{"text_format":"1","workbook":"xlsx","n_sheets":9,"sheets":["Orçamento","Resumo ","Somatório","Cronog_90_Dias","Composição BDI","Relatório CENTRAL","Parc Maior Relev","Composições","Cotações"],"not_rendered":{"charts":0,"images":4,"macros":1,"external_links":0,"defined_names":81,"comments":3,"pivot_tables":0},"unopened":[],"bounds":{"document_bytes":16777216,"sheet_cells":100000,"rows_first":2000,"rows_last":500,"rows_between":2000,"halvings":0,"cell_chars":16384,"cell_head_chars":4096},"cells_cut":0,"cells_raw":0,"read":"whole","date_system":"1900"}

{"sheet":"Orçamento","index":0,"n_rows":577,"n_cols":27,"rows_kept":577,"cut":false,"hidden":false,"merged":[[546,23,546,25],[547,23,547,25],[548,23,548,25],[544,23,544,25],[519,23,519,25],[520,23,520,25],[521,23,521,25],[522,23,522,25],[523,23,523,25],[524,23,524,25],[525,23,525,25],[526,23,526,25],[527,23,527,25],[528,23,528,25],[529,23,529,25],[530,23,530,25],[531,23,531,25],[532,23,532,25],[533,23,533,25],[534,23,534,25],[535,23,535,25],[536,23,536,25],[537,23,537,25],[538,23,538,25],[561,23,561,25],[562,23,562,25],[563,23,563,25],[564,23,564,25],[565,23,565,25],[566,23,566,25],[567,23,567,25],[568,23,568,25],[569,23,569,25],[552,23,552,25],[553,23,553,25],[554,23,554,25],[555,23,555,25],[556,23,556,25],[557,23,557,25],[558,23,558,25],[559,23,559,25],[560,23,560,25],[547,18,547,22],[0,14,0,24],[8,14,8,16],[9,14,9,16],[11,14,11,16],[12,14,12,16],[14,14,14,24],[1,14,1,24],[4,14,4,24],[7,14,7,24],[531,18,531,22],[528,15,528,17],[529,15,529,17],[530,15,530,17],[540,18,540,22],[538,18,538,22],[501,23,501,24],[546,18,546,22],[533,18,533,22],[526,18,526,22],[540,15,540,17],[541,15,541,17],[542,15,542,17],[548,18,548,22],[524,18,524,22],[525,18,525,22],[523,18,523,22],[532,18,532,22],[514,18,514,24],[520,18,520,22],[521,18,521,22],[522,18,522,22],[545,18,545,22],[543,18,543,22],[544,18,544,22],[534,18,534,22],[541,18,541,22],[537,18,537,22],[539,18,539,22],[535,18,535,22],[536,18,536,22],[545,23,545,25],[539,23,539,25],[540,23,540,25],[541,23,541,25],[542,23,542,25],[543,23,543,25],[502,23,502,24],[503,23,503,24],[518,23,518,25],[543,15,543,17],[544,15,544,17],[517,14,517,26],[501,17,506,17],[518,18,518,22],[519,18,519,22],[527,18,527,22],[528,18,528,22],[529,18,529,22],[530,18,530,22],[542,18,542,22],[539,15,539,17],[519,15,519,17],[520,15,520,17],[521,15,521,17],[522,15,522,17],[523,15,523,17],[524,15,524,17],[525,15,525,17],[526,15,526,17],[527,15,527,17],[531,15,531,17],[532,15,532,17],[533,15,533,17],[534,15,534,17],[535,15,535,17],[536,15,536,17],[537,15,537,17],[538,15,538,17],[512,16,512,24],[554,15,554,17],[554,18,554,22],[509,16,509,24],[510,16,510,24],[511,16,511,24],[10,14,10,26],[13,14,13,26],[9,17,9,22],[2,14,2,22],[3,14,3,22],[5,18,5,22],[6,18,6,22],[11,18,11,22],[12,18,12,22],[6,14,6,17],[5,14,5,17],[3,23,3,25],[2,23,2,25],[5,23,5,25],[6,23,6,25],[513,16,513,24],[8,23,8,25],[9,24,9,25],[576,18,576,22],[573,14,573,17],[570,15,570,17],[570,18,570,22],[571,15,571,17],[571,18,571,22],[572,15,572,17],[572,18,572,22],[575,18,575,22],[574,18,574,22],[570,23,570,25],[571,23,571,25],[572,23,572,25],[573,23,573,25],[574,23,574,25],[575,23,575,25],[576,23,576,25],[545,14,545,17],[552,15,552,17],[518,15,518,17],[573,18,573,22],[561,15,561,17],[561,18,561,22],[562,15,562,17],[562,18,562,22],[563,15,563,17],[563,18,563,22],[567,15,567,17],[567,18,567,22],[568,15,568,17],[568,18,568,22],[569,15,569,17],[558,15,558,17],[569,18,569,22],[564,15,564,17],[564,18,564,22],[565,15,565,17],[565,18,565,22],[566,15,566,17],[566,18,566,22],[12,24,12,25],[11,23,11,25],[558,18,558,22],[559,15,559,17],[559,18,559,22],[560,15,560,17],[560,18,560,22],[555,15,555,17],[555,18,555,22],[556,15,556,17],[556,18,556,22],[557,15,557,17],[557,18,557,22],[551,14,551,26],[552,18,552,22],[553,15,553,17],[553,18,553,22]]}
[]
[]
[null,null,null,null,null,null,null,null,null,null,null,null,null,null,"UNIDADE ESCOLAR",null,null,null,null,null,null,null,null,"CÓDIGO INEP"]
[null,null,null,null,null,null,null,null,null,null,null,null,"",null,"COLÉGIO ESTADUAL PROFESSORA MARIA PEREIRA VASCONCELOS",null,null,null,null,null,null,null,null,52047318]
[]
["Nmax",null,null,null,null,null,null,null,null,null,null,null,null,null,"OBRA",null,null,null,"DATA",null,null,null,null,"CIDADE"]
[{"$f":"MAX($C$18:$C$501)","v":3},null,null,null,null,null,null,null,null,null,null,null,null,null,"AMPLIAÇÃO E REFORMA",null,null,null,"2020-08-27",null,null,null,null,"LUZIÂNIA"]
[]
[null,null,null,null,null,null,null,null,null,null,null,null,null,null,"CRE",null,null,"ENDEREÇO",null,null,null,null,null,"REFERÊNCIA AGETOP"]
[null,null,null,null,null,null,null,null,null,null,null,null,null,null,"LUZIÂNIA",null,null,"RUA 92 QD 256 LOTE A SN JARDIM INGA, PQ. ESTRELA DALVA IX, CEP:72853-256",null,null,null,null,null,"DEZ/18","ONERADA"]
[]
[null,null,null,null,null,null,null,null,null,null,null,null,null,null,"ÁREA EXISTENTE (M²)",null,null,"ÁREA A CONSTRUIR (M²)","ÁREA TOTAL CONSTRUÍDA (M²)",null,null,null,null,"REFERÊNCIA SINAPI"]
[null,null,null,null,null,null,null,null,null,null,null,null,null,null,null,null,null,380.52,null,null,null,null,null,"MAR/19","ONERADA"]
[]
[null,null,null,null,null,null,null,null,null,null,null,"FILTRO",null,null,"PLANILHA ORÇAMENTÁRIA"]
["Nível E","Save Nivel","Nível C","Altura","n1","n2","n3","n4","n5","Czero","Cnível","↓","Nível","Nível Corrigido","ITEM","TABELA","CODIGO","DESCRIÇÃO DOS SERVIÇOS","UNID","QUANT","REPET","QUANT TOTAL","MAT","MO","VALOR UNIT","VALOR TOTAL","OBSERVAÇÕES¹"]
[{"$f":"CHOOSE(1+LOG(1+2*(ORÇAMENTO.Nivel=\"Nível 1\")+4*(ORÇAMENTO.Nivel=\"Nível 2\")+8*(ORÇAMENTO.Nivel=\"Nível 3\")+16*(ORÇAMENTO.Nivel=\"Nível 4\")+32*(ORÇAMENTO.Nivel=\"Serviço\"),2),0,1,2,3,4,\"S\")","v":"S"},{"$f":"IF(OR(C17=\"s\",C17=0),OFFSET(B17,-1,0),C17)","v":"Save Nivel"},{"$f":"IF(OFFSET(C17,-1,0)=\"L\",1,IF(OFFSET(C17,-1,0)=1,2,IF(OR(A17=\"s\",A17=0),\"S\",IF(AND(OFFSET(C17,-1,0)=2,A17=4),3,IF(AND(OR(OFFSET(C17,-1,0)=\"s\",OFFSET(C17,-1,0)=0),A17<>\"s\",A17>OFFSET(B17,-1,0)),OFFSET(B17,-1,0),A17)))))","v":"S"},{"$f":"IF(OR(C17=\"S\",C17=0),0,IF(ISERROR(K17),J17,SMALL(J17:K17,1)))","v":0},{"$f":"IF($C17=1,OFFSET(E17,-1,0)+1,OFFSET(E17,-1,0))","v":"n1"},{"$f":"IF($C17=1,0,IF($C17=2,OFFSET(F17,-1,0)+1,OFFSET(F17,-1,0)))","v":"n2"},{"$f":"IF(AND($C17<=2,$C17<>0),0,IF($C17=3,OFFSET(G17,-1,0)+1,OFFSET(G17,-1,0)))","v":"n3"},{"$f":"IF(AND($C17<=3,$C17<>0),0,IF($C17=4,OFFSET(H17,-1,0)+1,OFFSET(H17,-1,0)))","v":"n4"},{"$f":"IF(AND($C17<=4,$C17<>0),0,IF(AND($C17=\"S\",$Y17>0),OFFSET(I17,-1,0)+1,OFFSET(I17,-1,0)))","v":"n5"},{"$f":"IF(OR($C17=\"S\",$C17=0),0,MATCH(0,OFFSET($D17,1,$C17,ROW($C$501)-ROW($C17)),0))","v":0},{"$f":"IF(OR($C17=\"S\",$C17=0),0,MATCH(OFFSET($D17,0,$C17)+1,OFFSET($D17,1,$C17,ROW($C$501)-ROW($C17)),0))","v":0},"","Serviço","Serviço","-","SINAPI",null,"(sem código)","-",null,"REPET","-",0,0,0,"-",""]
[0,null,"L",{"$f":"COUNTA(OFFSET(D18,1,0):D$501)","v":482},{"$f":"LEFT(O19,1)-1","v":0},null,null,null,null,null,null,"F","LOTE","LOTE","AMPLIAÇÃO E REFORMA - COLÉGIO ESTADUAL PROFESSORA MARIA PEREIRA VASCONCELOS",null,null,null,null,null,null,null,null,null,null,805842.1600000005]
[1,{"$f":"IF(OR(C19=\"s\",C19=0),OFFSET(B19,-1,0),C19)","v":1},{"$f":"IF(OFFSET(C19,-1,0)=\"L\",1,IF(OFFSET(C19,-1,0)=1,2,IF(OR(A19=\"s\",A19=0),\"S\",IF(AND(OFFSET(C19,-1,0)=2,A19=4),3,IF(AND(OR(OFFSET(C19,-1,0)=\"s\",OFFSET(C19,-1,0)=0),A19<>\"s\",A19>OFFSET(B19,-1,0)),OFFSET(B19,-1,0),A19)))))","v":1},{"$f":"IF(OR(C19=\"S\",C19=0),0,IF(ISERROR(K19),J19,SMALL(J19:K19,1)))","v":362},{"$f":"IF($C19=1,OFFSET(E19,-1,0)+1,OFFSET(E19,-1,0))","v":1},{"$f":"IF($C19=1,0,IF($C19=2,OFFSET(F19,-1,0)+1,OFFSET(F19,-1,0)))","v":0},{"$f":"IF(AND($C19<=2,$C19<>0),0,IF($C19=3,OFFSET(G19,-1,0)+1,OFFSET(G19,-1,0)))","v":0},{"$f":"IF(AND($C19<=3,$C19<>0),0,IF($C19=4,OFFSET(H19,-1,0)+1,OFFSET(H19,-1,0)))","v":0},0,{"$f":"IF(OR($C19=\"S\",$C19=0),0,MATCH(0,OFFSET($D19,1,$C19,ROW($C$501)-ROW($C19)),0))","v":482},{"$f":"IF(OR($C19=\"S\",$C19=0),0,MATCH(OFFSET($D19,0,$C19)+1,OFFSET($D19,1,$C19,ROW($C$501)-ROW($C19)),0))","v":362},"F","Nível 1","Nível 1","1.","AGETOP",null,"REFORMA","UN",1,1,1]
[2,{"$f":"IF(OR(C20=\"s\",C20=0),OFFSET(B20,-1,0),C20)","v":2},{"$f":"IF(OFFSET(C20,-1,0)=\"L\",1,IF(OFFSET(C20,-1,0)=1,2,IF(OR(A20=\"s\",A20=0),\"S\",IF(AND(OFFSET(C20,-1,0)=2,A20=4),3,IF(AND(OR(OFFSET(C20,-1,0)=\"s\",OFFSET(C20,-1,0)=0),A20<>\"s\",A20>OFFSET(B20,-1,0)),OFFSET(B20,-1,0),A20)))))","v":2},{"$f":"IF(OR(C20=\"S\",C20=0),0,IF(ISERROR(K20),J20,SMALL(J20:K20,1)))","v":21},{"$f":"IF($C20=1,OFFSET(E20,-1,0)+1,OFFSET(E20,-1,0))","v":1},{"$f":"IF($C20=1,0,IF($C20=2,OFFSET(F20,-1,0)+1,OFFSET(F20,-1,0)))","v":1},{"$f":"IF(AND($C20<=2,$C20<>0),0,IF($C20=3,OFFSET(G20,-1,0)+1,OFFSET(G20,-1,0)))","v":0},{"$f":"IF(AND($C20<=3,$C20<>0),0,IF($C20=4,OFFSET(H20,-1,0)+1,OFFSET(H20,-1,0)))","v":0},0,361,21,"F","Nível 2","Nível 2","1.1.","AGETOP",null,"SERVIÇOS PRELIMINARES","-",null,1,"-"]
["S",2,"S",0,1,1,0,0,0,0,0,"F","Serviço","Serviço","1.1.0.1.","SINAPI",97661,"REMOÇÃO DE CABOS ELÉTRICOS, DE FORMA MANUAL, SEM REAPROVEITAMENTO. AF_12/2017","M",2500,1,2500,null,null,null,null,""]
["S",2,"S",0,1,1,0,0,0,0,0,"F","Serviço","Serviço","1.1.0.2.","SINAPI",97640,"REMOÇÃO DE FORROS DE DRYWALL, PVC E FIBROMINERAL, DE FORMA MANUAL, SEM REAPROVEITAMENTO. AF_12/2017","M2",204.09,1,204.09,null,null,null,null,""]
["S",2,"S",0,1,1,0,0,0,0,0,"F","Serviço","Serviço","1.1.0.3.","SINAPI",97642,"REMOÇÃO DE TRAMA METÁLICA OU DE MADEIRA PARA FORRO, DE FORMA MANUAL, SEM REAPROVEITAMENTO. AF_12/2017","M2",204.09,1,204.09,null,null,null,null,"Serviço incluso na referência acima"]
["S",{"$f":"IF(OR(C24=\"s\",C24=0),OFFSET(B24,-1,0),C24)","v":2},{"$f":"IF(OFFSET(C24,-1,0)=\"L\",1,IF(OFFSET(C24,-1,0)=1,2,IF(OR(A24=\"s\",A24=0),\"S\",IF(AND(OFFSET(C24,-1,0)=2,A24=4),3,IF(AND(OR(OFFSET(C24,-1,0)=\"s\",OFFSET(C24,-1,0)=0),A24<>\"s\",A24>OFFSET(B24,-1,0)),OFFSET(B24,-1,0),A24)))))","v":"S"},{"$f":"IF(OR(C24=\"S\",C24=0),0,IF(ISERROR(K24),J24,SMALL(J24:K24,1)))","v":0},1,1,0,0,0,0,0,"F","Serviço","Serviço","1.1.0.4.","SINAPI",97626,"DEMOLIÇÃO DE PILARES E VIGAS EM CONCRETO ARMADO, DE FORMA MANUAL, SEM REAPROVEITAMENTO. AF_12/2017","M3",1.92,1,1.92,null,null,null,null,""]
["S",2,"S",0,1,1,0,0,0,0,0,"F","Serviço","Serviço","1.1.0.5.","AGETOP",20101,"DEMOLICAO COBERTURA TELHA CERAMICA C/ TRANSP. ATÉ CB. E CARGA","m2    ",222.19,1,222.19,null,null,null,null,""]
["S",2,"S",0,1,1,0,0,0,0,0,"F","Serviço","Serviço","1.1.0.6.","AGETOP",20103,"DEMOLIÇÃO ESTRUTURA EM MADEIRA TELHADO C/ TRANSP. ATÉ CB. E CARGA","m2    ",222.19,1,222.19,null,null,null,null,""]
["S",2,"S",0,1,1,0,0,0,0,0,"F","Serviço","Serviço","1.1.0.7.","SINAPI",97645,"REMOÇÃO DE JANELAS, DE FORMA MANUAL, SEM REAPROVEITAMENTO. AF_12/2017","M2",20.22,1,20.22,null,null,null,null,"Referência: AGETOP - 20106"]
["S",2,"S",0,1,1,0,0,0,0,0,"F","Serviço","Serviço","1.1.0.8.","SINAPI",97644,"REMOÇÃO DE PORTAS, DE FORMA MANUAL, SEM REAPROVEITAMENTO. AF_12/2017","M2",6.21,1,6.21,null,null,null,null,"Referência: AGETOP - 20106"]
["S",2,"S",0,1,1,0,0,0,0,0,"F","Serviço","Serviço","1.1.0.9.","AGETOP",20112,"DEM.PISO CERAM. INCLUS. RETIRADA DE CONTRAPISO SOBRE LASTRO CONC.C/TR.CB.E CARGA","m2    ",75.28,1,75.28,null,null,null,null,""]
["S",2,"S",0,1,1,0,0,0,0,0,"F","Serviço","Serviço","1.1.0.10.","SINAPI",97633,"DEMOLIÇÃO DE REVESTIMENTO CERÂMICO, DE FORMA MANUAL, SEM REAPROVEITAMENTO. AF_12/2017","M2",154.6,1,154.6,null,null,null,null,"Referência: AGETOP - 20115"]
["S",2,"S",0,1,1,0,0,0,0,0,"F","Serviço","Serviço","1.1.0.11.","SINAPI",97622,"DEMOLIÇÃO DE ALVENARIA DE BLOCO FURADO, DE FORMA MANUAL, SEM REAPROVEITAMENTO. AF_12/2017","M3",2.17,1,2.17,null,null,null,null,"Referência: AGETOP - 20118"]
["S",2,"S",0,1,1,0,0,0,0,0,"F","Serviço","Serviço","1.1.0.12.","AGETOP",20121,"DEM. MANUAL EM CONCR.SIMPLES C/TR.ATE CB.E CARGA (O.C.)","m3    ",89.4,1,89.4,null,null,null,null,""]
["S",2,"S",0,1,1,0,0,0,0,0,"F","Serviço","Serviço","1.1.0.13.","AGETOP",20137,"DEMOLIÇAO BACIA SANITARIA C/ TRANSP. ATÉ CB. E CARGA","Un    ",6,1,6,null,null,null,null,""]
["S",2,"S",0,1,1,0,0,0,0,0,"F","Serviço","Serviço","1.1.0.14.","AGETOP",20138,"DEMOLIÇAO DE LAVATÓRIO C/ TRANSP. ATÉ CB. E CARGA","Un    ",1,1,1,null,null,null,null,""]
["S",2,"S",0,1,1,0,0,0,0,0,"F","Serviço","Serviço","1.1.0.15.","AGETOP",20139,"DEMOLIÇAO DE BANCADAS C/ TRANSP. ATÉ CB. E CARGA","m2    ",2.6,1,2.6,null,null,null,null,""]
["S",2,"S",0,1,1,0,0,0,0,0,"F","Serviço","Serviço","1.1.0.16.","AGETOP",20140,"DEMOLIÇAO DE VÁLVULA DE DESCARGA C/ TRANSP. ATÉ CB. E CARGA","Un    ",6,1,6,null,null,null,null,""]
["S",2,"S",0,1,1,0,0,0,0,0,"F","Serviço","Serviço","1.1.0.17.","AGETOP",20146,"DEMOLIÇÃO DE MICTÓRIO C/ TRANSP. ATÉ CB. E CARGA","Un    ",2,1,2,null,null,null,null,""]
["S",2,"S",0,1,1,0,0,0,0,0,"F","Serviço","Serviço","1.1.0.18.","AGETOP",20163,"DEMOLIÇÃO DAS INSTALAÇÕES HIDROSANITÁRIAS E AFINS C/ TRANSP. ATÉ CB. E CARGA","H     ",6,1,6,null,null,null,null,""]
["S",2,"S",0,1,1,0,0,0,0,0,"F","Serviço","Serviço","1.1.0.19.","SINAPI","73948/16","LIMPEZA MANUAL DO TERRENO (C/ RASPAGEM SUPERFICIAL)","M2",1106.98,1,1106.98,null,null,null,null,"Referência: AGETOP - 20202"]
["S",2,"S",0,1,1,0,0,0,0,0,"F","Serviço","Serviço","1.1.0.20.","SINAPI","74209/1","PLACA DE OBRA EM CHAPA DE ACO GALVANIZADO","M2",4.5,1,4.5,null,null,null,null,"Referência: AGETOP - 21301"]
[2,2,2,5,1,2,0,0,0,340,5,"F","Nível 2","Nível 2","1.2.","AGETOP",null,"TRANSPORTES","-",null,1,"-",null,null,null,null,""]
["S",2,"S",0,1,2,0,0,0,0,0,"F","Serviço","Serviço","1.2.0.1.","SINAPI",72900,"TRANSPORTE DE ENTULHO COM CAMINHAO BASCULANTE 6 M3, RODOVIA PAVIMENTADA, DMT 0,5 A 1,0 KM","M3",26.64,1,26.64,null,null,null,null,""]
["S",2,"S",0,1,2,0,0,0,0,0,"F","Serviço","Serviço","1.2.0.2.","SINAPI",72897,"CARGA MANUAL DE ENTULHO EM CAMINHAO BASCULANTE 6 M3","M3",26.64,1,26.64,null,null,null,null,""]
["S",2,"S",0,1,2,0,0,0,0,0,"F","Serviço","Serviço","1.2.0.3.","SINAPI",93358,"ESCAVAÇÃO MANUAL DE VALA COM PROFUNDIDADE MENOR OU IGUAL A 1,30 M. AF_03/2016","M3",20,1,20,null,null,null,null,"Referência: AGETOP - 40101"]
["S",2,"S",0,1,2,0,0,0,0,0,"F","Serviço","Serviço","1.2.0.4.","SINAPI",96995,"REATERRO MANUAL APILOADO COM SOQUETE. AF_10/2017","M3",20,1,20,null,null,null,null,"Referência: AGETOP - 40902"]
[2,2,2,9,1,3,0,0,0,335,9,"F","Nível 2","Nível 2","1.3.","AGETOP",null,"SERVIÇO EM TERRA","-",null,1,"-",null,null,null,null,""]
["S",2,"S",0,1,3,0,0,0,0,0,"F","Serviço","Serviço","1.3.0.1.","SINAPI",79480,"ESCAVACAO MECANICA CAMPO ABERTO EM SOLO EXCETO ROCHA ATE 2,00M PROFUNDIDADE","M3",475.65,1,475.65,null,null,null,null,"Referência: AGETOP - 41004"]
["S",2,"S",0,1,3,0,0,0,0,0,"F","Serviço","Serviço","1.3.0.2.","SINAPI",72898,"CARGA E DESCARGA MECANIZADAS DE ENTULHO EM CAMINHAO BASCULANTE 6 M3","M3",475.65,1,475.65,null,null,null,null,"Referência: AGETOP - 41005"]
["S",2,"S",0,1,3,0,0,0,0,0,"F","Serviço","Serviço","1.3.0.3.","AGETOP",41012,"INDENIZAÇÃO DE JAZIDA","m3    ",475.65,1,475.65,null,null,null,null,""]
["S",2,"S",0,1,3,0,0,0,0,0,"F","Serviço","Serviço","1.3.0.4.","AGETOP",41006,"TRANSPORTE DE MATERIAL ESCAVADO M3.KM","m3km  ",4756.5,1,4756.5,null,null,null,null,""]
["S",2,"S",0,1,3,0,0,0,0,0,"F","Serviço","Serviço","1.3.0.5.","SINAPI","74005/2","COMPACTACAO MECANICA C/ CONTROLE DO GC>=95% DO PN (AREAS) (C/MONIVELADORA 140 HP E ROLO COMPRESSOR VIBRATORIO 80 HP)","M3",380.52,1,380.52,null,null,null,null,"Referência: AGETOP - 41008"]
[{"$f":"CHOOSE(1+LOG(1+2*(ORÇAMENTO.Nivel=\"Nível 1\")+4*(ORÇAMENTO.Nivel=\"Nível 2\")+8*(ORÇAMENTO.Nivel=\"Nível 3\")+16*(ORÇAMENTO.Nivel=\"Nível 4\")+32*(ORÇAMENTO.Nivel=\"Serviço\"),2),0,1,2,3,4,\"S\")","v":"S"},2,"S",0,1,3,0,0,{"$f":"IF(AND($C52<=4,$C52<>0),0,IF(AND($C52=\"S\",$Y52>0),OFFSET(I52,-1,0)+1,OFFSET(I52,-1,0)))","v":0},0,0,"F","Serviço","Serviço","1.3.0.6.","SINAPI",96527,"ESCAVAÇÃO MANUAL DE VALA PARA VIGA BALDRAME, COM PREVISÃO DE FÔRMA. AF_06/2017","M3",3.57,1,3.57,null,null,null,null,"Referência: AGETOP - 40101"]
["S",2,"S",0,1,3,0,0,0,0,0,"F","Serviço","Serviço","1.3.0.7.","SINAPI",96995,"REATERRO MANUAL APILOADO COM SOQUETE. AF_10/2017","M3",1.65,1,1.65,null,null,null,null,"Referência: AGETOP - 40902"]
["S",2,"S",0,{"$f":"IF($C54=1,OFFSET(E54,-1,0)+1,OFFSET(E54,-1,0))","v":1},{"$f":"IF($C54=1,0,IF($C54=2,OFFSET(F54,-1,0)+1,OFFSET(F54,-1,0)))","v":3},{"$f":"IF(AND($C54<=2,$C54<>0),0,IF($C54=3,OFFSET(G54,-1,0)+1,OFFSET(G54,-1,0)))","v":0},{"$f":"IF(AND($C54<=3,$C54<>0),0,IF($C54=4,OFFSET(H54,-1,0)+1,OFFSET(H54,-1,0)))","v":0},0,0,0,"F","Serviço","Serviço","1.3.0.8.","AGETOP",41002,"APILOAMENTO","m2    ",893.41,1,893.41,null,null,null,null,""]
[2,{"$f":"IF(OR(C55=\"s\",C55=0),OFFSET(B55,-1,0),C55)","v":2},{"$f":"IF(OFFSET(C55,-1,0)=\"L\",1,IF(OFFSET(C55,-1,0)=1,2,IF(OR(A55=\"s\",A55=0),\"S\",IF(AND(OFFSET(C55,-1,0)=2,A55=4),3,IF(AND(OR(OFFSET(C55,-1,0)=\"s\",OFFSET(C55,-1,0)=0),A55<>\"s\",A55>OFFSET(B55,-1,0)),OFFSET(B55,-1,0),A55)))))","v":2},{"$f":"IF(OR(C55=\"S\",C55=0),0,IF(ISERROR(K55),J55,SMALL(J55:K55,1)))","v":12},1,4,0,0,0,326,12,"F","Nível 2","Nível 2","1.4.","AGETOP",null,"FUNDAÇÕES E SONDAGENS","-",null,1,"-",null,null,null,null,""]
[3,3,3,11,1,4,1,0,0,11,84,"F","Nível 3","Nível 3","1.4.1.","SINAPI",null,"ESTACAS E BLOCOS","-",null,1,"-",null,null,null,null,""]
["S",3,"S",0,1,4,1,0,0,0,0,"F","Serviço","Serviço","1.4.1.1.","SINAPI",98230,"ESTACA BROCA DE CONCRETO, DIÂMETRO DE 30 CM, PROFUNDIDADE DE ATÉ 3 M, ESCAVAÇÃO MANUAL COM TRADO CONCHA, NÃO ARMADA. AF_03/2018","M",45.5,1,45.5,null,null,null,null,"Referência: AGETOP - 50302"]
["S",3,"S",0,1,4,1,0,0,0,0,"F","Serviço","Serviço","1.4.1.2.","SINAPI",96522,"ESCAVAÇÃO MANUAL PARA BLOCO DE COROAMENTO OU SAPATA, SEM PREVISÃO DE FÔRMA. AF_06/2017","M3",1.82,1,1.82,null,null,null,null,"Referência: AGETOP - 50901"]
["S",3,"S",0,1,4,1,0,0,0,0,"F","Serviço","Serviço","1.4.1.3.","AGETOP",50902,"APILOAMENTO (BLOCOS/SAPATAS)","m2    ",2.8,1,2.8,null,null,null,null,""]
["S",3,"S",0,1,4,1,0,0,0,0,"F","Serviço","Serviço","1.4.1.4.","SINAPI",94963,"CONCRETO FCK = 15MPA, TRAÇO 1:3,4:3,5 (CIMENTO/ AREIA MÉDIA/ BRITA 1)  - PREPARO MECÂNICO COM BETONEIRA 400 L. AF_07/2016","M3",1.68,1,1.68,null,null,null,null,""]
["S",3,"S",0,1,4,1,0,0,0,0,"F","Serviço","Serviço","1.4.1.5.","SINAPI","74157/4","LANCAMENTO/APLICACAO MANUAL DE CONCRETO EM FUNDACOES","M3",1.82,1,1.82,null,null,null,null,"Referência: AGETOP - 51055"]
["S",3,"S",0,1,4,1,0,0,0,0,"F","Serviço","Serviço","1.4.1.6.","SINAPI",94962,"CONCRETO MAGRO PARA LASTRO, TRAÇO 1:4,5:4,5 (CIMENTO/ AREIA MÉDIA/ BRITA 1)  - PREPARO MECÂNICO COM BETONEIRA 400 L. AF_07/2016","M3",0.14000000000000001,1,0.14000000000000001,null,null,null,null,""]
["S",3,"S",0,1,4,1,0,0,0,0,"F","Serviço","Serviço","1.4.1.7.","SINAPI",96544,"ARMAÇÃO DE BLOCO, VIGA BALDRAME OU SAPATA UTILIZANDO AÇO CA-50 DE 6,3 MM - MONTAGEM. AF_06/2017","KG",23,1,23,null,null,null,null,"Referência: AGETOP - 52003"]
["S",3,"S",0,1,4,1,0,0,0,0,"F","Serviço","Serviço","1.4.1.8.","SINAPI",96545,"ARMAÇÃO DE BLOCO, VIGA BALDRAME OU SAPATA UTILIZANDO AÇO CA-50 DE 8 MM - MONTAGEM. AF_06/2017","KG",96,1,96,null,null,null,null,"Referência: AGETOP - 52004"]
["S",3,"S",0,1,4,1,0,0,0,0,"F","Serviço","Serviço","1.4.1.9.","SINAPI",96546,"ARMAÇÃO DE BLOCO, VIGA BALDRAME OU SAPATA UTILIZANDO AÇO CA-50 DE 10 MM - MONTAGEM. AF_06/2017","KG",7,1,7,null,null,null,null,"Referência: AGETOP - 52005"]
["S",3,"S",0,1,4,1,0,0,0,0,"F","Serviço","Serviço","1.4.1.10.","SINAPI",96543,"ARMAÇÃO DE BLOCO, VIGA BALDRAME E SAPATA UTILIZANDO AÇO CA-60 DE 5 MM - MONTAGEM. AF_06/2017","KG",20,1,20,null,null,null,null,"Referência: AGETOP - 52014"]
[2,2,2,9,1,5,0,0,0,314,9,"F","Nível 2","Nível 2","1.5.","AGETOP",null,"ESTRUTURA","-",null,1,"-",null,null,null,null,""]
[3,3,3,8,1,5,1,0,0,8,72,"F","Nível 3","Nível 3","1.5.1.","AGETOP",null,"PILAR/VIGAS BALDRAMES E VIGAS DE COBERTURA","-",null,1,"-",null,null,null,null,""]
["S",3,"S",0,1,5,1,0,0,0,0,"F","Serviço","Serviço","1.5.1.1.","SINAPI",92426,"MONTAGEM E DESMONTAGEM DE FÔRMA DE PILARES RETANGULARES E ESTRUTURAS SIMILARES COM ÁREA MÉDIA DAS SEÇÕES MENOR OU IGUAL A 0,25 M², PÉ-DIREITO SIMPLES, EM CHAPA DE MADEIRA COMPENSADA RESINADA, 8 UTILIZAÇÕES. AF_12/2015","M2",123.28,1,123.28,null,null,null,null,""]
["S",3,"S",0,1,5,1,0,0,0,0,"F","Serviço","Serviço","1.5.1.2.","SINAPI",94964,"CONCRETO FCK = 20MPA, TRAÇO 1:2,7:3 (CIMENTO/ AREIA MÉDIA/ BRITA 1)  - PREPARO MECÂNICO COM BETONEIRA 400 L. AF_07/2016","M3",7.0699999999999994,1,7.0699999999999994,null,null,null,null,""]
["S",3,"S",0,1,5,1,0,0,0,0,"F","Serviço","Serviço","1.5.1.3.","SINAPI",92873,"LANÇAMENTO COM USO DE BALDES, ADENSAMENTO E ACABAMENTO DE CONCRETO EM ESTRUTURAS. AF_12/2015","M3",7.0699999999999994,1,7.0699999999999994,null,null,null,null,"Referência: AGETOP - 60801"]
["S",3,"S",0,1,5,1,0,0,0,0,"F","Serviço","Serviço","1.5.1.4.","SINAPI",92777,"ARMAÇÃO DE PILAR OU VIGA DE UMA ESTRUTURA CONVENCIONAL DE CONCRETO ARMADO EM UMA EDIFICAÇÃO TÉRREA OU SOBRADO UTILIZANDO AÇO CA-50 DE 8,0 MM - MONTAGEM. AF_12/2015","KG",208,1,208,null,null,null,null,"Referência: AGETOP - 60304"]
["S",3,"S",0,1,5,1,0,0,0,0,"F","Serviço","Serviço","1.5.1.5.","SINAPI",92778,"ARMAÇÃO DE PILAR OU VIGA DE UMA ESTRUTURA CONVENCIONAL DE CONCRETO ARMADO EM UMA EDIFICAÇÃO TÉRREA OU SOBRADO UTILIZANDO AÇO CA-50 DE 10,0 MM - MONTAGEM. AF_12/2015","KG",237,1,237,null,null,null,null,"Referência: AGETOP - 60305"]
["S",3,"S",0,1,5,1,0,0,0,0,"F","Serviço","Serviço","1.5.1.6.","SINAPI",92775,"ARMAÇÃO DE PILAR OU VIGA DE UMA ESTRUTURA CONVENCIONAL DE CONCRETO ARMADO EM UMA EDIFICAÇÃO TÉRREA OU SOBRADO UTILIZANDO AÇO CA-60 DE 5,0 MM - MONTAGEM. AF_12/2015","KG",265,1,265,null,null,null,null,"Referência: AGETOP - 60314"]
["S",3,"S",0,1,5,1,0,0,0,0,"F","Serviço","Serviço","1.5.1.7.","AGETOP",61130,"MURO ARRIMO PADRÃO AGETOP EM CANALETA SEM REVESTIMENTO-(COM ALTURA ATÉ 2,50M)-INCLUSO FUNDAÇÃO","m2    ",8.65,1,8.65,null,null,null,null,""]
[{"$f":"CHOOSE(1+LOG(1+2*(ORÇAMENTO.Nivel=\"Nível 1\")+4*(ORÇAMENTO.Nivel=\"Nível 2\")+8*(ORÇAMENTO.Nivel=\"Nível 3\")+16*(ORÇAMENTO.Nivel=\"Nível 4\")+32*(ORÇAMENTO.Nivel=\"Serviço\"),2),0,1,2,3,4,\"S\")","v":2},{"$f":"IF(OR(C76=\"s\",C76=0),OFFSET(B76,-1,0),C76)","v":2},{"$f":"IF(OFFSET(C76,-1,0)=\"L\",1,IF(OFFSET(C76,-1,0)=1,2,IF(OR(A76=\"s\",A76=0),\"S\",IF(AND(OFFSET(C76,-1,0)=2,A76=4),3,IF(AND(OR(OFFSET(C76,-1,0)=\"s\",OFFSET(C76,-1,0)=0),A76<>\"s\",A76>OFFSET(B76,-1,0)),OFFSET(B76,-1,0),A76)))))","v":2},{"$f":"IF(OR(C76=\"S\",C76=0),0,IF(ISERROR(K76),J76,SMALL(J76:K76,1)))","v":131},{"$f":"IF($C76=1,OFFSET(E76,-1,0)+1,OFFSET(E76,-1,0))","v":1},{"$f":"IF($C76=1,0,IF($C76=2,OFFSET(F76,-1,0)+1,OFFSET(F76,-1,0)))","v":6},{"$f":"IF(AND($C76<=2,$C76<>0),0,IF($C76=3,OFFSET(G76,-1,0)+1,OFFSET(G76,-1,0)))","v":0},{"$f":"IF(AND($C76<=3,$C76<>0),0,IF($C76=4,OFFSET(H76,-1,0)+1,OFFSET(H76,-1,0)))","v":0},{"$f":"IF(AND($C76<=4,$C76<>0),0,IF(AND($C76=\"S\",$Y76>0),OFFSET(I76,-1,0)+1,OFFSET(I76,-1,0)))","v":0},305,131,"F","Nível 2","Nível 2","1.6.",null,null,"INSTALAÇÕES ELÉTRICAS","-",null,1,"-",null,null,null,null,""]
[3,3,3,63,1,6,1,0,0,130,63,"F","Nível 3","Nível 3","1.6.1.","SINAPI",null,"SUBESTAÇÃO","-",null,1,"-",null,null,null,null,""]
["S",3,"S",0,1,6,1,0,0,0,0,"F","Serviço","Serviço","1.6.1.1.","SINAPI","73767/2","ALCA PRE-FORMADA DISTRIBUIÇÃO EM  ACO RECOBERTO COM ALUMINIO PARA CABO 25MM2, ENCAPADO. FORNECIMENTO E INSTALAÇÃO.","UN",1,1,1,null,null,null,null,"Referência: AGETOP - 70204"]
["S",3,"S",0,1,6,1,0,0,0,0,"F","Serviço","Serviço","1.6.1.2.","AGETOP",70252,"ARRUELA LISA D=5/16\"","Un    ",8,1,8,null,null,null,null,""]
["S",3,"S",0,1,6,1,0,0,0,0,"F","Serviço","Serviço","1.6.1.3.","AGETOP",70268,"BARRA DE COBRE 2\" X 3/16\"  (2,0865 KG/M)","m     ",1.5,1,1.5,null,null,null,null,""]
["S",3,"S",0,1,6,1,0,0,0,0,"F","Serviço","Serviço","1.6.1.4.","SINAPI",91175,"FIXAÇÃO DE TUBOS VERTICAIS DE PPR DIÂMETROS MAIORES QUE 75 MM COM ABRAÇADEIRA METÁLICA RÍGIDA TIPO D 3\", FIXADA EM PERFILADO EM ALVENARIA. AF_05/2015","M",6,1,6,null,null,null,null,""]
["S",3,"S",0,1,6,1,0,0,0,0,"F","Serviço","Serviço","1.6.1.5.","AGETOP",70386,"BRAÇO C AÇO GALVANIZADO , CONFORME NTD-17","un    ",1,1,1,null,null,null,null,""]
["S",3,"S",0,1,6,1,0,0,{"$f":"IF(OR($C83=\"S\",$C83=0),0,MATCH(0,OFFSET($D83,1,$C83,ROW($C$501)-ROW($C83)),0))","v":0},{"$f":"IF(OR($C83=\"S\",$C83=0),0,MATCH(OFFSET($D83,0,$C83)+1,OFFSET($D83,1,$C83,ROW($C$501)-ROW($C83)),0))","v":0},"F","Serviço","Serviço","1.6.1.6.","AGETOP",70425,"BUCHA E ARRUELA METALICA DIAM. 2\"","PR    ",2,1,2,null,null,null,null,""]
["S",3,"S",0,1,6,1,0,0,0,0,"F","Serviço","Serviço","1.6.1.7.","AGETOP",70428,"BUCHA E ARRUELA METALICA DIAM. 4\"","PR    ",1,1,1,null,null,null,null,""]
["S",3,"S",0,1,6,1,0,0,0,0,"F","Serviço","Serviço","1.6.1.8.","SINAPI",92980,"CABO DE COBRE FLEXÍVEL ISOLADO, 10 MM², ANTI-CHAMA 0,6/1,0 KV, PARA DISTRIBUIÇÃO - FORNECIMENTO E INSTALAÇÃO. AF_12/2015","M",5,1,5,null,null,null,null,""]
["S",3,"S",0,1,6,1,0,0,0,0,"F","Serviço","Serviço","1.6.1.9.","SINAPI",92992,"CABO DE COBRE FLEXÍVEL ISOLADO, 95 MM², ANTI-CHAMA 0,6/1,0 KV, PARA DISTRIBUIÇÃO - FORNECIMENTO E INSTALAÇÃO. AF_12/2015","M",40,1,40,null,null,null,null,"Referência: AGETOP - 70515"]
["S",3,"S",0,1,6,1,0,0,0,0,"F","Serviço","Serviço","1.6.1.10.","SINAPI",92996,"CABO DE COBRE FLEXÍVEL ISOLADO, 150 MM², ANTI-CHAMA 0,6/1,0 KV, PARA DISTRIBUIÇÃO - FORNECIMENTO E INSTALAÇÃO. AF_12/2015","M",160,1,160,null,null,null,null,"Referência: AGETOP - 70517"]
["S",3,"S",0,1,6,1,0,0,0,0,"F","Serviço","Serviço","1.6.1.11.","AGETOP",70543,"CABO DE COBRE NÚ No. 35 MM2","M     ",3,1,3,null,null,null,null,""]
["S",3,"S",0,1,6,1,0,0,0,0,"F","Serviço","Serviço","1.6.1.12.","SINAPI",96977,"CORDOALHA DE COBRE NU 50 MM², ENTERRADA, SEM ISOLADOR - FORNECIMENTO E INSTALAÇÃO. AF_12/2017","M",45,1,45,null,null,null,null,"Referência: AGETOP - 70544"]
["S",3,"S",0,1,6,1,0,0,0,0,"F","Serviço","Serviço","1.6.1.13.","AGETOP",70698,"CAIXA METÁLICA PARA PROTEÇÃO GERAL 1200X1000X310MM DE 500A A 800A","Un    ",1,1,1,null,null,null,null,""]
["S",3,"S",0,1,6,1,0,0,0,0,"F","Serviço","Serviço","1.6.1.14.","AGETOP",70699,"CAIXA METÁLICA PARA T.C. 1200X1000X310MM - 500 a 800A","Un    ",1,1,1,null,null,null,null,""]
[{"$f":"CHOOSE(1+LOG(1+2*(ORÇAMENTO.Nivel=\"Nível 1\")+4*(ORÇAMENTO.Nivel=\"Nível 2\")+8*(ORÇAMENTO.Nivel=\"Nível 3\")+16*(ORÇAMENTO.Nivel=\"Nível 4\")+32*(ORÇAMENTO.Nivel=\"Serviço\"),2),0,1,2,3,4,\"S\")","v":"S"},3,"S",0,1,6,1,0,{"$f":"IF(AND($C92<=4,$C92<>0),0,IF(AND($C92=\"S\",$Y92>0),OFFSET(I92,-1,0)+1,OFFSET(I92,-1,0)))","v":0},0,0,"F","Serviço","Serviço","1.6.1.15.","SINAPI",97893,"CAIXA ENTERRADA ELÉTRICA RETANGULAR, EM ALVENARIA COM BLOCOS DE CONCRETO, FUNDO COM BRITA, DIMENSÕES INTERNAS: 0,8X0,8X0,6 M. AF_05/2018","UN",1,1,1,null,null,null,null,""]
["S",3,"S",0,1,6,1,0,0,0,0,"F","Serviço","Serviço","1.6.1.16.","AGETOP",70771,"CANTONEIRA AUXILIAR PARA BRAÇO TIPO C","un    ",1,1,1,null,null,null,null,""]
["S",3,"S",0,1,6,1,0,0,0,0,"F","Serviço","Serviço","1.6.1.17.","AGETOP",70920,"CINTA DE ACO GALVANIZADO DIAM.190 MM","Un    ",1,1,1,null,null,null,null,""]
["S",3,"S",0,{"$f":"IF($C95=1,OFFSET(E95,-1,0)+1,OFFSET(E95,-1,0))","v":1},{"$f":"IF($C95=1,0,IF($C95=2,OFFSET(F95,-1,0)+1,OFFSET(F95,-1,0)))","v":6},{"$f":"IF(AND($C95<=2,$C95<>0),0,IF($C95=3,OFFSET(G95,-1,0)+1,OFFSET(G95,-1,0)))","v":1},{"$f":"IF(AND($C95<=3,$C95<>0),0,IF($C95=4,OFFSET(H95,-1,0)+1,OFFSET(H95,-1,0)))","v":0},0,0,0,"F","Serviço","Serviço","1.6.1.18.","AGETOP",70921,"CINTA DE ACO GALVANIZADO DIAM.220 MM","Un    ",2,1,2,null,null,null,null,""]
["S",3,"S",0,1,6,1,0,0,0,0,"F","Serviço","Serviço","1.6.1.19.","AGETOP",70922,"CINTA DE ACO GALVANIZADO DIAM.230MM","Un    ",2,1,2,null,null,null,null,""]
["S",3,"S",0,1,6,1,0,0,0,0,"F","Serviço","Serviço","1.6.1.20.","AGETOP",71016,"CONECTOR DE COMPRESSÃO FORMATO H PARA CABO 25 A 70 MM2","un    ",4,1,4,null,null,null,null,""]
["S",3,"S",0,1,6,1,0,0,0,0,"F","Serviço","Serviço","1.6.1.21.","AGETOP",71020,"CONECTOR PARAL. ALUM.EXTRUD.CA-CU-10,0D.10-2-1 PARAF.","Un    ",6,1,6,null,null,null,null,""]
["S",3,"S",0,1,6,1,0,0,0,0,"F","Serviço","Serviço","1.6.1.22.","SINAPI",72272,"CONECTOR PARAFUSO FENDIDO \u0094SPLIT-BOLT\u0094 - PARA CABO DE 35MM2 - FORNECIMENTO E INSTALACAO","UN",1,1,1,null,null,null,null,"Referência: AGETOP - 71035"]
["S",3,"S",0,1,6,1,0,0,0,0,"F","Serviço","Serviço","1.6.1.23.","AGETOP",71040,"CONECTOR TIPO PARAFUSO FENDIDO 150 MM2","Un    ",4,1,4,null,null,null,null,""]
["S",{"$f":"IF(OR(C101=\"s\",C101=0),OFFSET(B101,-1,0),C101)","v":3},{"$f":"IF(OFFSET(C101,-1,0)=\"L\",1,IF(OFFSET(C101,-1,0)=1,2,IF(OR(A101=\"s\",A101=0),\"S\",IF(AND(OFFSET(C101,-1,0)=2,A101=4),3,IF(AND(OR(OFFSET(C101,-1,0)=\"s\",OFFSET(C101,-1,0)=0),A101<>\"s\",A101>OFFSET(B101,-1,0)),OFFSET(B101,-1,0),A101)))))","v":"S"},{"$f":"IF(OR(C101=\"S\",C101=0),0,IF(ISERROR(K101),J101,SMALL(J101:K101,1)))","v":0},1,6,1,0,0,0,0,"F","Serviço","Serviço","1.6.1.24.","AGETOP",71155,"CURVA DE 90 GRAUS AÇO GALVANIZADO DIAM. 2\"","Un    ",1,1,1,null,null,null,null,""]
["S",3,"S",0,1,6,1,0,0,0,0,"F","Serviço","Serviço","1.6.1.25.","AGETOP",71158,"CURVA DE 90 GRAUS AÇO GALVANIZADO DIÂMETRO 4\"","Un    ",1,1,1,null,null,null,null,""]
["S",3,"S",0,1,6,1,0,0,0,0,"F","Serviço","Serviço","1.6.1.26.","AGETOP",71184,"DISPOSITIVO DE PROTEÇÃO CONTRA SURTOS (D.P.S.) 275V DE 8 A 40KA","Un    ",3,1,3,null,null,null,null,""]
["S",3,"S",0,1,6,1,0,0,0,0,"F","Serviço","Serviço","1.6.1.27.","SINAPI","74130/7","DISJUNTOR TERMOMAGNETICO TRIPOLAR EM CAIXA MOLDADA 250A 600V, FORNECIMENTO E INSTALACAO","UN",1,1,1,null,null,null,null,"Referência: AGETOP - 71180"]
["S",3,"S",0,1,6,1,0,0,0,0,"F","Serviço","Serviço","1.6.1.28.","AGETOP",71205,"ELETRODUTO DE PVC RIGIDO DIAMETRO 2\"","M     ",5,1,5,null,null,null,null,""]
["S",3,"S",0,1,6,1,0,0,0,0,"F","Serviço","Serviço","1.6.1.29.","AGETOP",71208,"ELETRODUTO DE PVC RIGIDO DIAMETRO 4\"","M     ",30,1,30,null,null,null,null,""]
["S",3,"S",0,1,6,1,0,0,0,0,"F","Serviço","Serviço","1.6.1.30.","AGETOP",71218,"ELETRODUTO EM AÇO GALVANIZADO A FOGO DIÂMETRO 4\" - PESADO ","M     ",10,1,10,null,null,null,null,""]
["S",3,"S",0,1,6,1,0,0,0,0,"F","Serviço","Serviço","1.6.1.31.","AGETOP",71270,"ELO FUSIVEL 8 K - 15 KV","Un    ",1,1,1,null,null,null,null,""]
["S",3,"S",0,1,6,1,0,0,0,0,"F","Serviço","Serviço","1.6.1.32.","AGETOP",71321,"FITA DE AUTO FUSAO, ROLO E 10,00 MM","Un    ",5,1,5,null,null,null,null,""]
["S",3,"S",0,1,6,1,0,0,0,0,"F","Serviço","Serviço","1.6.1.33.","AGETOP",71365,"GRAMPO DE ANCORAGEM POLIMÉRICO","un    ",3,1,3,null,null,null,null,""]
["S",3,"S",0,1,6,1,0,0,0,0,"F","Serviço","Serviço","1.6.1.34.","AGETOP",71381,"HASTE REV.COBRE(COPPERWELD)  5/8\" X 3,00 M C/CONECTOR","Un    ",4,1,4,null,null,null,null,""]
["S",3,"S",0,1,6,1,0,0,0,0,"F","Serviço","Serviço","1.6.1.35.","AGETOP",71463,"ISOLADOR EPOXI 50X40 (BUJAO)","Un    ",2,1,2,null,null,null,null,""]
["S",3,"S",0,1,6,1,0,0,0,0,"F","Serviço","Serviço","1.6.1.36.","AGETOP",71476,"ISOLADOR DE ANCORAGEM POLIMÉRICO 15KV","un    ",1,1,1,null,null,null,null,""]
["S",3,"S",0,1,6,1,0,0,0,0,"F","Serviço","Serviço","1.6.1.37.","AGETOP",71510,"LACO PREFORMADO DE DISTRIBUICAO","Un    ",1,1,1,null,null,null,null,""]
["S",3,"S",0,1,6,1,0,0,0,0,"F","Serviço","Serviço","1.6.1.38.","AGETOP",71745,"LUVA PVC ROSQUEAVEL DIAMETRO 2\"","Un    ",1,1,1,null,null,null,null,""]
["S",3,"S",0,1,6,1,0,0,0,0,"F","Serviço","Serviço","1.6.1.39.","SINAPI",93017,"LUVA PARA ELETRODUTO, PVC, ROSCÁVEL, DN 110 MM (4\") - FORNECIMENTO E INSTALAÇÃO. AF_12/2015","UN",10,1,10,null,null,null,null,"Referência: AGETOP - 71748"]
["S",3,"S",0,1,6,1,0,0,0,0,"F","Serviço","Serviço","1.6.1.40.","AGETOP",71708,"LUVA EM AÇO GALVANIZADO DIÂMETRO 4\"","Un    ",2,1,2,null,null,null,null,""]
["S",3,"S",0,1,6,1,0,0,0,0,"F","Serviço","Serviço","1.6.1.41.","AGETOP",71750,"MANILHA-SAPATILHA EM AÇO GALVANIZADO","un    ",1,1,1,null,null,null,null,""]
["S",3,"S",0,1,6,1,0,0,0,0,"F","Serviço","Serviço","1.6.1.42.","AGETOP",71761,"MURETA MEDIÇÃO ALVEN. 1 1/2 V.(35CM) REBOC.C/PINTURA ACRÍL. E LAJE CONC. 20MPA MALHA 8.0MM CADA 10CM REVEST.C/ARGAMASSA 1:3 C/ IMPERMEABILIZANTE","m2    ",3,1,3,null,null,null,null,""]
["S",3,"S",0,1,6,1,0,0,0,0,"F","Serviço","Serviço","1.6.1.43.","AGETOP",71776,"NIPLE METALICO Fo.Zo. DIAMETRO 2.1/2\"","Un    ",2,1,2,null,null,null,null,""]
["S",3,"S",0,1,6,1,0,0,0,0,"F","Serviço","Serviço","1.6.1.44.","AGETOP",85047,"NIPLE DUPLO FERRO GALVANIZADO 2.1/2\"","Un    ",1,1,1,null,null,null,null,""]
["S",3,"S",0,1,6,1,0,0,0,0,"F","Serviço","Serviço","1.6.1.45.","AGETOP",71795,"OLHAL PARA PARAFUSO","un    ",3,1,3,null,null,null,null,""]
["S",3,"S",0,1,6,1,0,0,0,0,"F","Serviço","Serviço","1.6.1.46.","AGETOP",71835,"PARAFUSO CABEÇA ABAULADA (FRANCES) M16 X 45 MM","Un    ",3,1,3,null,null,null,null,""]
["S",3,"S",0,1,6,1,0,0,0,0,"F","Serviço","Serviço","1.6.1.47.","AGETOP",71841,"PARAFUSO CABEÇA ABAULADA (FRANCES) M16 X 150 MM","Un    ",3,1,3,null,null,null,null,""]
["S",3,"S",0,1,6,1,0,0,0,0,"F","Serviço","Serviço","1.6.1.48.","AGETOP",71833,"PARA RAIOS DISTRIBUIDOR POLIMÉRICO ÓXIDO DE ZINCO S/CENTELHADOR C/ DESLIGAMENTO AUTOMÁTICO 15KV,10KA","Un    ",3,1,3,null,null,null,null,""]
["S",3,"S",0,1,6,1,0,0,0,0,"F","Serviço","Serviço","1.6.1.49.","AGETOP",71997,"POSTE - FUNDAÇÃO EM CONCRETO SIMPLES DA BASE DOS POSTES 11/600 PARA TRAFO ( DIAM. 1000MM)","m     ",0.3,1,0.3,null,null,null,null,""]
["S",3,"S",0,1,6,1,0,0,0,0,"F","Serviço","Serviço","1.6.1.50.","AGETOP",72061,"POSTE DE CONCRETO SC 11/600 - SEM FUNDAÇÃO/CONCRETO","Un    ",1,1,1,null,null,null,null,""]
["S",3,"S",0,1,6,1,0,0,0,0,"F","Serviço","Serviço","1.6.1.51.","AGETOP",72080,"POSTE/TRAFO - CAMINHÃO MUNCK 12 TON. (MÍNIMO 4H/DIA)","H     ",4,1,4,null,null,null,null,""]
["S",3,"S",0,1,6,1,0,0,0,0,"F","Serviço","Serviço","1.6.1.52.","AGETOP",72329,"SAPATILHA DE AÇO GALVANIZADO PARA POSTE COM TRANSFORMADOR","un    ",3,1,3,null,null,null,null,""]
["S",3,"S",0,1,6,1,0,0,0,0,"F","Serviço","Serviço","1.6.1.53.","SINAPI",73624,"SUPORTE PARA TRANSFORMADOR EM POSTE DE CONCRETO CIRCULAR","UN",2,1,2,null,null,null,null,""]
["S",3,"S",0,1,6,1,0,0,0,0,"F","Serviço","Serviço","1.6.1.54.","AGETOP",72518,"TERMINAL DE PRESSAO 10 MM2","Un    ",1,1,1,null,null,null,null,""]
["S",3,"S",0,1,6,1,0,0,0,0,"F","Serviço","Serviço","1.6.1.55.","AGETOP",72538,"TERMINAL DE PRESSAO 95 MM2","Un    ",5,1,5,null,null,null,null,""]
["S",3,"S",0,1,6,1,0,0,0,0,"F","Serviço","Serviço","1.6.1.56.","AGETOP",72550,"TERMINAL DE PRESSAO 150 MM2","Un    ",2,1,2,null,null,null,null,""]
["S",3,"S",0,1,6,1,0,0,0,0,"F","Serviço","Serviço","1.6.1.57.","SINAPI","73857/3","TRANSFORMADOR DISTRIBUICAO  150KVA TRIFASICO 60HZ CLASSE 15KV IMERSO EM ÓLEO MINERAL FORNECIMENTO E INSTALACAO","UN",1,1,1,null,null,null,null,""]
["S",3,"S",0,1,6,1,0,0,0,0,"F","Serviço","Serviço","1.6.1.58.","SINAPI",88543,"ARMACAO SECUNDARIA OU REX COMPLETA PARA TRESLINHAS-FORNECIMENTO E INSTALACAO.","UN",1,1,1,null,null,null,null,"Referência: AGETOP - 70242"]
["S",3,"S",0,1,6,1,0,0,0,0,"F","Serviço","Serviço","1.6.1.59.","COMPOSIÇÃO","COMP 046_SEE","CAPUZ PARA PROTEÇÃO DOS PARA RAIOS","UN ",3,1,3,null,null,null,null,""]
["S",3,"S",0,1,6,1,0,0,0,0,"F","Serviço","Serviço","1.6.1.60.","COMPOSIÇÃO","COMP 047_SEE","CAPUZ DE PROTEÇÃO PARA BUCHA DE TRANSFORMADOR","UN ",3,1,3,null,null,null,null,""]
["S",3,"S",0,1,6,1,0,0,0,0,"F","Serviço","Serviço","1.6.1.61.","COMPOSIÇÃO","COMP 048_SEE","HASTE ROSQUEADA \"TIRANTE\" 3/8\"","M",0.5,1,0.5,null,null,null,null,""]
["S",3,"S",0,1,6,1,0,0,0,0,"F","Serviço","Serviço","1.6.1.62.","COMPOSIÇÃO","COMP 049_SEE","PORCA SEXTAVADA 3/8\"","UN ",8,1,8,null,null,null,null,""]
[3,3,3,49,1,6,2,0,0,67,49,"F","Nível 3","Nível 3","1.6.2.",null,null,"INST. ELÉTRICAS","-",null,1,"-",null,null,null,null,""]
["S",3,"S",0,1,6,2,0,0,0,0,"F","Serviço","Serviço","1.6.2.1.","AGETOP",70351,"BRACADEIRA METALICA TIPO \"U\" DIAM. 3/4\"","Un    ",100,1,100,null,null,null,null,""]
["S",3,"S",0,1,6,2,0,0,0,0,"F","Serviço","Serviço","1.6.2.2.","AGETOP",70352,"BRACADEIRA METALICA TIPO \"U\" DIAM. 1\"","Un    ",10,1,10,null,null,null,null,""]
["S",3,"S",0,1,6,2,0,0,0,0,"F","Serviço","Serviço","1.6.2.3.","AGETOP",70354,"BRACADEIRA METALICA TIPO \"U\" DIAM. 1.1/2\"","Un    ",10,1,10,null,null,null,null,""]
["S",3,"S",0,1,6,2,0,0,0,0,"F","Serviço","Serviço","1.6.2.4.","AGETOP",70355,"BRACADEIRA METALICA TIPO \"U\" DIAM. 2\"","Un    ",35,1,35,null,null,null,null,""]
["S",3,"S",0,1,6,2,0,0,0,0,"F","Serviço","Serviço","1.6.2.5.","AGETOP",70421,"BUCHA E ARRUELA METALICA DIAM. 3/4\"","PR    ",100,1,100,null,null,null,null,""]
["S",3,"S",0,1,6,2,0,0,0,0,"F","Serviço","Serviço","1.6.2.6.","AGETOP",70422,"BUCHA E ARRUELA METALICA DIAM. 1\"","PR    ",10,1,10,null,null,null,null,""]
["S",3,"S",0,1,6,2,0,0,{"$f":"IF(OR($C147=\"S\",$C147=0),0,MATCH(0,OFFSET($D147,1,$C147,ROW($C$501)-ROW($C147)),0))","v":0},{"$f":"IF(OR($C147=\"S\",$C147=0),0,MATCH(OFFSET($D147,0,$C147)+1,OFFSET($D147,1,$C147,ROW($C$501)-ROW($C147)),0))","v":0},"F","Serviço","Serviço","1.6.2.7.","AGETOP",70424,"BUCHA E ARRUELA METALICA DIAM. 1.1/2\"","PR    ",10,1,10,null,null,null,null,""]
["S",3,"S",0,1,6,2,0,0,0,0,"F","Serviço","Serviço","1.6.2.8.","AGETOP",70425,"BUCHA E ARRUELA METALICA DIAM. 2\"","PR    ",35,1,35,null,null,null,null,""]
["S",3,"S",0,1,6,2,0,0,0,0,"F","Serviço","Serviço","1.6.2.9.","SINAPI",91927,"CABO DE COBRE FLEXÍVEL ISOLADO, 2,5 MM², ANTI-CHAMA 0,6/1,0 KV, PARA CIRCUITOS TERMINAIS - FORNECIMENTO E INSTALAÇÃO. AF_12/2015","M",3734,1,3734,null,null,null,null,"Referência: AGETOP - 70581"]
["S",3,"S",0,1,6,2,0,0,0,0,"F","Serviço","Serviço","1.6.2.10.","SINAPI",91929,"CABO DE COBRE FLEXÍVEL ISOLADO, 4 MM², ANTI-CHAMA 0,6/1,0 KV, PARA CIRCUITOS TERMINAIS - FORNECIMENTO E INSTALAÇÃO. AF_12/2015","M",1716,1,1716,null,null,null,null,"Referência: AGETOP - 70582"]
["S",3,"S",0,1,6,2,0,0,0,0,"F","Serviço","Serviço","1.6.2.11.","SINAPI",91930,"CABO DE COBRE FLEXÍVEL ISOLADO, 6 MM², ANTI-CHAMA 450/750 V, PARA CIRCUITOS TERMINAIS - FORNECIMENTO E INSTALAÇÃO. AF_12/2015","M",50,1,50,null,null,null,null,"Referência: AGETOP - 70583"]
["S",3,"S",0,1,6,2,0,0,0,0,"F","Serviço","Serviço","1.6.2.12.","SINAPI",92982,"CABO DE COBRE FLEXÍVEL ISOLADO, 16 MM², ANTI-CHAMA 0,6/1,0 KV, PARA DISTRIBUIÇÃO - FORNECIMENTO E INSTALAÇÃO. AF_12/2015","M",93,1,93,null,null,null,null,""]
["S",3,"S",0,1,6,2,0,0,0,0,"F","Serviço","Serviço","1.6.2.13.","SINAPI",92983,"CABO DE COBRE FLEXÍVEL ISOLADO, 25 MM², ANTI-CHAMA 450/750 V, PARA DISTRIBUIÇÃO - FORNECIMENTO E INSTALAÇÃO. AF_12/2015","M",372,1,372,null,null,null,null,"Referência: AGETOP - 70511"]
["S",3,"S",0,1,6,2,0,0,0,0,"F","Serviço","Serviço","1.6.2.14.","SINAPI",83366,"CAIXA DE PASSAGEM PARA TELEFONE 15X15X10CM (SOBREPOR), FORNECIMENTO E INSTALACAO.","UN",1,1,1,null,null,null,null,"Referência: AGETOP - 70645"]
["S",3,"S",0,1,6,2,0,0,0,0,"F","Serviço","Serviço","1.6.2.15.","SINAPI",92869,"CAIXA RETANGULAR 4\" X 2\" BAIXA (0,30 M DO PISO), METÁLICA, INSTALADA EM PAREDE - FORNECIMENTO E INSTALAÇÃO. AF_12/2015","UN",49,1,49,null,null,null,null,"Referência: AGETOP - 70691"]
["S",3,"S",0,1,6,2,0,0,0,0,"F","Serviço","Serviço","1.6.2.16.","SINAPI",92868,"CAIXA RETANGULAR 4\" X 2\" MÉDIA (1,30 M DO PISO), METÁLICA, INSTALADA EM PAREDE - FORNECIMENTO E INSTALAÇÃO. AF_12/2015","UN",6,1,6,null,null,null,null,"Referência: AGETOP - 70691"]
["S",3,"S",0,1,6,2,0,0,0,0,"F","Serviço","Serviço","1.6.2.17.","SINAPI",92867,"CAIXA RETANGULAR 4\" X 2\" ALTA (2,00 M DO PISO), METÁLICA, INSTALADA EM PAREDE - FORNECIMENTO E INSTALAÇÃO. AF_12/2015","UN",24,1,24,null,null,null,null,"Referência: AGETOP - 70691"]
["S",3,"S",0,1,6,2,0,0,0,0,"F","Serviço","Serviço","1.6.2.18.","SINAPI",97891,"CAIXA ENTERRADA ELÉTRICA RETANGULAR, EM ALVENARIA COM BLOCOS DE CONCRETO, FUNDO COM BRITA, DIMENSÕES INTERNAS: 0,4X0,4X0,4 M. AF_05/2018","UN",6,1,6,null,null,null,null,""]
["S",3,"S",0,1,6,2,0,0,0,0,"F","Serviço","Serviço","1.6.2.19.","SINAPI",91902,"CURVA 90 GRAUS PARA ELETRODUTO, PVC, ROSCÁVEL, DN 25 MM (3/4\"), PARA CIRCUITOS TERMINAIS, INSTALADA EM LAJE - FORNECIMENTO E INSTALAÇÃO. AF_12/2015","UN",20,1,20,null,null,null,null,"Referência: AGETOP - 71141"]
["S",3,"S",0,1,6,2,0,0,0,0,"F","Serviço","Serviço","1.6.2.20.","SINAPI",91905,"CURVA 90 GRAUS PARA ELETRODUTO, PVC, ROSCÁVEL, DN 32 MM (1\"), PARA CIRCUITOS TERMINAIS, INSTALADA EM LAJE - FORNECIMENTO E INSTALAÇÃO. AF_12/2015","UN",5,1,5,null,null,null,null,"Referência: AGETOP - 71142"]
["S",3,"S",0,1,6,2,0,0,0,0,"F","Serviço","Serviço","1.6.2.21.","SINAPI",93653,"DISJUNTOR MONOPOLAR TIPO DIN, CORRENTE NOMINAL DE 10A - FORNECIMENTO E INSTALAÇÃO. AF_04/2016","UN",5,1,5,null,null,null,null,""]
["S",3,"S",0,1,6,2,0,0,0,0,"F","Serviço","Serviço","1.6.2.22.","SINAPI",93654,"DISJUNTOR MONOPOLAR TIPO DIN, CORRENTE NOMINAL DE 16A - FORNECIMENTO E INSTALAÇÃO. AF_04/2016","UN",25,1,25,null,null,null,null,""]
["S",3,"S",0,1,6,2,0,0,0,0,"F","Serviço","Serviço","1.6.2.23.","SINAPI",93671,"DISJUNTOR TRIPOLAR TIPO DIN, CORRENTE NOMINAL DE 32A - FORNECIMENTO E INSTALAÇÃO. AF_04/2016","UN",2,1,2,null,null,null,null,"Referência: AGETOP - 71173"]
["S",3,"S",0,1,6,2,0,0,0,0,"F","Serviço","Serviço","1.6.2.24.","SINAPI","74130/5","DISJUNTOR TERMOMAGNETICO TRIPOLAR PADRAO NEMA (AMERICANO) 60 A 100A 240V, FORNECIMENTO E INSTALACAO","UN",2,1,2,null,null,null,null,""]
["S",3,"S",0,1,6,2,0,0,0,0,"F","Serviço","Serviço","1.6.2.25.","AGETOP",71184,"DISPOSITIVO DE PROTEÇÃO CONTRA SURTOS (D.P.S.) 275V DE 8 A 40KA","Un    ",3,1,3,null,null,null,null,""]
["S",3,"S",0,1,6,2,0,0,0,0,"F","Serviço","Serviço","1.6.2.26.","SINAPI","74130/10","DISJUNTOR TERMOMAGNETICO TRIPOLAR EM CAIXA MOLDADA 175 A 225A 240V, FORNECIMENTO E INSTALACAO","UN",1,1,1,null,null,null,null,"Referência: AGETOP - 71177"]
["S",3,"S",0,1,6,2,0,0,0,0,"F","Serviço","Serviço","1.6.2.27.","AGETOP",71450,"INTERRUPTOR DIFERENCIAL RESIDUAL (D.R.) BIPOLAR DE 25A-30mA","Un    ",2,1,2,null,null,null,null,""]
["S",3,"S",0,1,6,2,0,0,0,0,"F","Serviço","Serviço","1.6.2.28.","SINAPI",91953,"INTERRUPTOR SIMPLES (1 MÓDULO), 10A/250V, INCLUINDO SUPORTE E PLACA - FORNECIMENTO E INSTALAÇÃO. AF_12/2015","UN",14,1,14,null,null,null,null,""]
["S",3,"S",0,1,6,2,0,0,0,0,"F","Serviço","Serviço","1.6.2.29.","SINAPI",91871,"ELETRODUTO RÍGIDO ROSCÁVEL, PVC, DN 25 MM (3/4\"), PARA CIRCUITOS TERMINAIS, INSTALADO EM PAREDE - FORNECIMENTO E INSTALAÇÃO. AF_12/2015","M",300,1,300,null,null,null,null,"Referência: AGETOP - 71201"]
["S",3,"S",0,1,6,2,0,0,0,0,"F","Serviço","Serviço","1.6.2.30.","SINAPI",91872,"ELETRODUTO RÍGIDO ROSCÁVEL, PVC, DN 32 MM (1\"), PARA CIRCUITOS TERMINAIS, INSTALADO EM PAREDE - FORNECIMENTO E INSTALAÇÃO. AF_12/2015","M",30,1,30,null,null,null,null,"Referência: AGETOP - 71202"]
["S",3,"S",0,1,6,2,0,0,0,0,"F","Serviço","Serviço","1.6.2.31.","SINAPI",93008,"ELETRODUTO RÍGIDO ROSCÁVEL, PVC, DN 50 MM (1 1/2\") - FORNECIMENTO E INSTALAÇÃO. AF_12/2015","M",30,1,30,null,null,null,null,""]
["S",3,"S",0,1,6,2,0,0,0,0,"F","Serviço","Serviço","1.6.2.32.","SINAPI",93009,"ELETRODUTO RÍGIDO ROSCÁVEL, PVC, DN 60 MM (2\") - FORNECIMENTO E INSTALAÇÃO. AF_12/2015","M",105,1,105,null,null,null,null,""]
["S",3,"S",0,1,6,2,0,0,0,0,"F","Serviço","Serviço","1.6.2.33.","AGETOP",71321,"FITA DE AUTO FUSAO, ROLO E 10,00 MM","Un    ",5,1,5,null,null,null,null,""]
["S",3,"S",0,1,6,2,0,0,0,0,"F","Serviço","Serviço","1.6.2.34.","AGETOP",71331,"FITA ISOLANTE, ROLO DE 20,00 M","Un    ",30,1,30,null,null,null,null,""]
["S",3,"S",0,1,6,2,0,0,0,0,"F","Serviço","Serviço","1.6.2.35.","SINAPI",97586,"LUMINÁRIA TIPO CALHA, DE SOBREPOR, COM 2 LÂMPADAS TUBULARES DE 36 W - FORNECIMENTO E INSTALAÇÃO. AF_11/2017","UN",90,1,90,null,null,null,null,"Referência: SINAPI - 97586"]
["S",3,"S",0,1,6,2,0,0,0,0,"F","Serviço","Serviço","1.6.2.36.","SINAPI",97593,"LUMINÁRIA TIPO SPOT, DE SOBREPOR, COM 1 LÂMPADA DE 15 W - FORNECIMENTO E INSTALAÇÃO. AF_11/2017","UN",43,1,43,null,null,null,null,"Referência: SINAPI - 97593"]
["S",3,"S",0,1,6,2,0,0,0,0,"F","Serviço","Serviço","1.6.2.37.","COMPOSIÇÃO","COMP 387_SEE","LÂMPADA LED TUBULAR 18W ","UN ",180,1,180,null,null,null,null,""]
["S",3,"S",0,1,6,2,0,0,0,0,"F","Serviço","Serviço","1.6.2.38.","SINAPI",91884,"LUVA PARA ELETRODUTO, PVC, ROSCÁVEL, DN 25 MM (3/4\"), PARA CIRCUITOS TERMINAIS, INSTALADA EM PAREDE - FORNECIMENTO E INSTALAÇÃO. AF_12/2015","UN",100,1,100,null,null,null,null,"Referência: AGETOP - 71741"]
["S",3,"S",0,1,6,2,0,0,0,0,"F","Serviço","Serviço","1.6.2.39.","SINAPI",91885,"LUVA PARA ELETRODUTO, PVC, ROSCÁVEL, DN 32 MM (1\"), PARA CIRCUITOS TERMINAIS, INSTALADA EM PAREDE - FORNECIMENTO E INSTALAÇÃO. AF_12/2015","UN",10,1,10,null,null,null,null,"Referência: AGETOP - 71742"]
["S",3,"S",0,1,6,2,0,0,0,0,"F","Serviço","Serviço","1.6.2.40.","SINAPI",93013,"LUVA PARA ELETRODUTO, PVC, ROSCÁVEL, DN 50 MM (1 1/2\") - FORNECIMENTO E INSTALAÇÃO. AF_12/2015","UN",10,1,10,null,null,null,null,"Referência: AGETOP - 71744"]
["S",3,"S",0,1,6,2,0,0,0,0,"F","Serviço","Serviço","1.6.2.41.","SINAPI",93014,"LUVA PARA ELETRODUTO, PVC, ROSCÁVEL, DN 60 MM (2\") - FORNECIMENTO E INSTALAÇÃO. AF_12/2015","UN",35,1,35,null,null,null,null,"Referência: AGETOP - 71745"]
["S",3,"S",0,1,6,2,0,0,0,0,"F","Serviço","Serviço","1.6.2.42.","SINAPI","74131/8","QUADRO DE DISTRIBUICAO DE ENERGIA DE EMBUTIR, EM CHAPA METALICA, PARA 50 DISJUNTORES TERMOMAGNETICOS MONOPOLARES, COM BARRAMENTO TRIFASICO E NEUTRO, FORNECIMENTO E INSTALACAO","UN",1,1,1,null,null,null,null,"Referência: AGETOP - 72205"]
["S",3,"S",0,1,6,2,0,0,0,0,"F","Serviço","Serviço","1.6.2.43.","SINAPI","74131/5","QUADRO DE DISTRIBUICAO DE ENERGIA DE EMBUTIR, EM CHAPA METALICA, PARA 24 DISJUNTORES TERMOMAGNETICOS MONOPOLARES, COM BARRAMENTO TRIFASICO E NEUTRO, FORNECIMENTO E INSTALACAO","UN",1,1,1,null,null,null,null,""]
["S",3,"S",0,1,6,2,0,0,0,0,"F","Serviço","Serviço","1.6.2.44.","AGETOP",72425,"TAMPA CEGA PLASTICA RETANGULAR 4\"X2\"","Un    ",20,1,20,null,null,null,null,""]
["S",3,"S",0,1,6,2,0,0,0,0,"F","Serviço","Serviço","1.6.2.45.","SINAPI",91996,"TOMADA MÉDIA DE EMBUTIR (1 MÓDULO), 2P+T 10 A, INCLUINDO SUPORTE E PLACA - FORNECIMENTO E INSTALAÇÃO. AF_12/2015","UN",6,1,6,null,null,null,null,"Referência: AGETOP - 72578"]
["S",3,"S",0,1,6,2,0,0,0,0,"F","Serviço","Serviço","1.6.2.46.","SINAPI",92000,"TOMADA BAIXA DE EMBUTIR (1 MÓDULO), 2P+T 10 A, INCLUINDO SUPORTE E PLACA - FORNECIMENTO E INSTALAÇÃO. AF_12/2015","UN",49,1,49,null,null,null,null,"Referência: AGETOP - 72578"]
["S",3,"S",0,1,6,2,0,0,0,0,"F","Serviço","Serviço","1.6.2.47.","SINAPI",91992,"TOMADA ALTA DE EMBUTIR (1 MÓDULO), 2P+T 10 A, INCLUINDO SUPORTE E PLACA - FORNECIMENTO E INSTALAÇÃO. AF_12/2015","UN",8,1,8,null,null,null,null,"Referência: AGETOP - 72585"]
["S",3,"S",0,1,6,2,0,0,0,0,"F","Serviço","Serviço","1.6.2.48.","SINAPI",91993,"TOMADA ALTA DE EMBUTIR (1 MÓDULO), 2P+T 20 A, INCLUINDO SUPORTE E PLACA - FORNECIMENTO E INSTALAÇÃO. AF_12/2015","UN",16,1,16,null,null,null,null,"Referência: AGETOP - 72585"]
[3,3,3,9,1,6,3,0,0,18,9,"F","Nível 3","Nível 3","1.6.3.",null,null,"IMPLANTAÇÃO BLOCOS DE SALAS","-",null,1,"-",null,null,null,null,""]
["S",3,"S",0,1,6,3,0,0,0,0,"F","Serviço","Serviço","1.6.3.1.","AGETOP",70354,"BRACADEIRA METALICA TIPO \"U\" DIAM. 1.1/2\"","Un    ",30,1,30,null,null,null,null,""]
["S",3,"S",0,1,6,3,0,0,0,0,"F","Serviço","Serviço","1.6.3.2.","AGETOP",70424,"BUCHA E ARRUELA METALICA DIAM. 1.1/2\"","PR    ",30,1,30,null,null,null,null,""]
["S",3,"S",0,1,6,3,0,0,0,0,"F","Serviço","Serviço","1.6.3.3.","SINAPI",91931,"CABO DE COBRE FLEXÍVEL ISOLADO, 6 MM², ANTI-CHAMA 0,6/1,0 KV, PARA CIRCUITOS TERMINAIS - FORNECIMENTO E INSTALAÇÃO. AF_12/2015","M",500,1,500,null,null,null,null,"Referência: AGETOP - 70583"]
["S",3,"S",0,1,6,3,0,0,0,0,"F","Serviço","Serviço","1.6.3.4.","SINAPI",97891,"CAIXA ENTERRADA ELÉTRICA RETANGULAR, EM ALVENARIA COM BLOCOS DE CONCRETO, FUNDO COM BRITA, DIMENSÕES INTERNAS: 0,4X0,4X0,4 M. AF_05/2018","UN",1,1,1,null,null,null,null,"Referência: AGETOP - 70713"]
["S",3,"S",0,1,6,3,0,0,0,0,"F","Serviço","Serviço","1.6.3.5.","SINAPI",93671,"DISJUNTOR TRIPOLAR TIPO DIN, CORRENTE NOMINAL DE 32A - FORNECIMENTO E INSTALAÇÃO. AF_04/2016","UN",1,1,1,null,null,null,null,"Referência: AGETOP - 71173"]
["S",3,"S",0,1,6,3,0,0,0,0,"F","Serviço","Serviço","1.6.3.6.","SINAPI",93008,"ELETRODUTO RÍGIDO ROSCÁVEL, PVC, DN 50 MM (1 1/2\") - FORNECIMENTO E INSTALAÇÃO. AF_12/2015","M",90,1,90,null,null,null,null,""]
[{"$f":"CHOOSE(1+LOG(1+2*(ORÇAMENTO.Nivel=\"Nível 1\")+4*(ORÇAMENTO.Nivel=\"Nível 2\")+8*(ORÇAMENTO.Nivel=\"Nível 3\")+16*(ORÇAMENTO.Nivel=\"Nível 4\")+32*(ORÇAMENTO.Nivel=\"Serviço\"),2),0,1,2,3,4,\"S\")","v":"S"},3,"S",0,1,6,3,0,{"$f":"IF(AND($C196<=4,$C196<>0),0,IF(AND($C196=\"S\",$Y196>0),OFFSET(I196,-1,0)+1,OFFSET(I196,-1,0)))","v":0},0,0,"F","Serviço","Serviço","1.6.3.7.","AGETOP",71321,"FITA DE AUTO FUSAO, ROLO E 10,00 MM","Un    ",1,1,1,null,null,null,null,""]
["S",3,"S",0,1,6,3,0,0,0,0,"F","Serviço","Serviço","1.6.3.8.","SINAPI",93013,"LUVA PARA ELETRODUTO, PVC, ROSCÁVEL, DN 50 MM (1 1/2\") - FORNECIMENTO E INSTALAÇÃO. AF_12/2015","UN",30,1,30,null,null,null,null,"Referência: AGETOP - 71744"]
[3,3,3,9,1,6,4,0,0,9,100,"F","Nível 3","Nível 3","1.6.4.",null,null,"IMPLANTAÇÃO BLOCOS DE SALAS","-",null,1,"-",null,null,null,null,""]
["S",3,"S",0,{"$f":"IF($C199=1,OFFSET(E199,-1,0)+1,OFFSET(E199,-1,0))","v":1},{"$f":"IF($C199=1,0,IF($C199=2,OFFSET(F199,-1,0)+1,OFFSET(F199,-1,0)))","v":6},{"$f":"IF(AND($C199<=2,$C199<>0),0,IF($C199=3,OFFSET(G199,-1,0)+1,OFFSET(G199,-1,0)))","v":4},{"$f":"IF(AND($C199<=3,$C199<>0),0,IF($C199=4,OFFSET(H199,-1,0)+1,OFFSET(H199,-1,0)))","v":0},0,0,0,"F","Serviço","Serviço","1.6.4.1.","AGETOP",70354,"BRACADEIRA METALICA TIPO \"U\" DIAM. 1.1/2\"","Un    ",16,1,16,null,null,null,null,""]
["S",3,"S",0,1,6,4,0,0,0,0,"F","Serviço","Serviço","1.6.4.2.","AGETOP",70424,"BUCHA E ARRUELA METALICA DIAM. 1.1/2\"","PR    ",16,1,16,null,null,null,null,""]
["S",3,"S",0,1,6,4,0,0,0,0,"F","Serviço","Serviço","1.6.4.3.","SINAPI",91931,"CABO DE COBRE FLEXÍVEL ISOLADO, 6 MM², ANTI-CHAMA 0,6/1,0 KV, PARA CIRCUITOS TERMINAIS - FORNECIMENTO E INSTALAÇÃO. AF_12/2015","M",250,1,250,null,null,null,null,"Referência: AGETOP - 70583"]
["S",3,"S",0,1,6,4,0,0,0,0,"F","Serviço","Serviço","1.6.4.4.","SINAPI",97891,"CAIXA ENTERRADA ELÉTRICA RETANGULAR, EM ALVENARIA COM BLOCOS DE CONCRETO, FUNDO COM BRITA, DIMENSÕES INTERNAS: 0,4X0,4X0,4 M. AF_05/2018","UN",1,1,1,null,null,null,null,"Referência: AGETOP - 70713"]
["S",3,"S",0,1,6,4,0,0,0,0,"F","Serviço","Serviço","1.6.4.5.","SINAPI",93671,"DISJUNTOR TRIPOLAR TIPO DIN, CORRENTE NOMINAL DE 32A - FORNECIMENTO E INSTALAÇÃO. AF_04/2016","UN",1,1,1,null,null,null,null,"Referência: AGETOP - 71173"]
["S",3,"S",0,1,6,4,0,0,0,0,"F","Serviço","Serviço","1.6.4.6.","SINAPI",93008,"ELETRODUTO RÍGIDO ROSCÁVEL, PVC, DN 50 MM (1 1/2\") - FORNECIMENTO E INSTALAÇÃO. AF_12/2015","M",50,1,50,null,null,null,null,""]
["S",{"$f":"IF(OR(C205=\"s\",C205=0),OFFSET(B205,-1,0),C205)","v":3},{"$f":"IF(OFFSET(C205,-1,0)=\"L\",1,IF(OFFSET(C205,-1,0)=1,2,IF(OR(A205=\"s\",A205=0),\"S\",IF(AND(OFFSET(C205,-1,0)=2,A205=4),3,IF(AND(OR(OFFSET(C205,-1,0)=\"s\",OFFSET(C205,-1,0)=0),A205<>\"s\",A205>OFFSET(B205,-1,0)),OFFSET(B205,-1,0),A205)))))","v":"S"},{"$f":"IF(OR(C205=\"S\",C205=0),0,IF(ISERROR(K205),J205,SMALL(J205:K205,1)))","v":0},1,6,4,0,0,0,0,"F","Serviço","Serviço","1.6.4.7.","AGETOP",71321,"FITA DE AUTO FUSAO, ROLO E 10,00 MM","Un    ",1,1,1,null,null,null,null,""]
["S",3,"S",0,1,6,4,0,0,0,0,"F","Serviço","Serviço","1.6.4.8.","SINAPI",93013,"LUVA PARA ELETRODUTO, PVC, ROSCÁVEL, DN 50 MM (1 1/2\") - FORNECIMENTO E INSTALAÇÃO. AF_12/2015","UN",16,1,16,null,null,null,null,"Referência: AGETOP - 71744"]
[2,2,2,98,1,7,0,0,0,174,98,"F","Nível 2","Nível 2","1.7.","AGETOP",null,"INSTALAÇÕES HIDROSSANITÁRIAS","-",null,1,"-",null,null,null,null,""]
[3,3,3,23,1,7,1,0,0,97,23,"F","Nível 3","Nível 3","1.7.1.","SINAPI",null,"PEÇAS E ACESSÓRIOS","-",null,1,"-",null,null,null,null,""]
["S",3,"S",0,1,7,1,0,0,0,0,"F","Serviço","Serviço","1.7.1.1.","SINAPI",95470,"VASO SANITARIO SIFONADO CONVENCIONAL COM LOUÇA BRANCA, INCLUSO CONJUNTO DE LIGAÇÃO PARA BACIA SANITÁRIA AJUSTÁVEL - FORNECIMENTO E INSTALAÇÃO. AF_10/2016","UN",6,1,6,null,null,null,null,"Referência: AGETOP - 80502"]
["S",3,"S",0,1,7,1,0,0,0,0,"F","Serviço","Serviço","1.7.1.2.","SINAPI",99635,"VÁLVULA DE DESCARGA METÁLICA, BASE 1 1/2 \", ACABAMENTO METALICO CROMADO - FORNECIMENTO E INSTALAÇÃO. AF_01/2019","UN",6,1,6,null,null,null,null,"Referência: AGETOP - 80515"]
["S",3,"S",0,1,7,1,0,0,{"$f":"IF(OR($C211=\"S\",$C211=0),0,MATCH(0,OFFSET($D211,1,$C211,ROW($C$501)-ROW($C211)),0))","v":0},{"$f":"IF(OR($C211=\"S\",$C211=0),0,MATCH(OFFSET($D211,0,$C211)+1,OFFSET($D211,1,$C211,ROW($C$501)-ROW($C211)),0))","v":0},"F","Serviço","Serviço","1.7.1.3.","AGETOP",80520,"CONJUNTO DE FIXACAO P/VASO SANITARIO (PAR)","CJ    ",6,1,6,null,null,null,null,""]
["S",3,"S",0,1,7,1,0,0,0,0,"F","Serviço","Serviço","1.7.1.4.","AGETOP",80513,"TUBO PARA VÁLVULA DE DESCARGA ( CURTO 1.1/4\" )","Un    ",6,1,6,null,null,null,null,""]
["S",3,"S",0,1,7,1,0,0,0,0,"F","Serviço","Serviço","1.7.1.5.","AGETOP",80526,"ASSENTO EM POLIPROPILENO COM SISTEMA DE FECHAMENTO SUAVE PARA VASO SANITÁRIO","Un    ",6,1,6,null,null,null,null,""]
["S",3,"S",0,1,7,1,0,0,0,0,"F","Serviço","Serviço","1.7.1.6.","AGETOP",80514,"TUBO DE LIGACAO PVC CROMADO 1.1/2\" / ESPUDE  - (ENTRADA)","Un    ",6,1,6,null,null,null,null,""]
["S",3,"S",0,1,7,1,0,0,0,0,"F","Serviço","Serviço","1.7.1.7.","SINAPI",86903,"LAVATÓRIO LOUÇA BRANCA COM COLUNA, 45 X 55CM OU EQUIVALENTE, PADRÃO MÉDIO - FORNECIMENTO E INSTALAÇÃO. AF_12/2013","UN",1,1,1,null,null,null,null,"Referência: AGETOP - 80541"]
["S",3,"S",0,1,7,1,0,0,0,0,"F","Serviço","Serviço","1.7.1.8.","AGETOP",80550,"FIXACAO P/LAVATORIO (PAR)","PAR   ",1,1,1,null,null,null,null,""]
["S",3,"S",0,1,7,1,0,0,0,0,"F","Serviço","Serviço","1.7.1.9.","AGETOP",80556,"LIGAÇÃO FLEXÍVEL PVC DIAM.1/2\" (ENGATE)","Un    ",5,1,5,null,null,null,null,""]
["S",3,"S",0,1,7,1,0,0,0,0,"F","Serviço","Serviço","1.7.1.10.","SINAPI",86883,"SIFÃO DO TIPO FLEXÍVEL EM PVC 1\u0094 X 1.1/2\u0094 - FORNECIMENTO E INSTALAÇÃO. AF_12/2013","UN",5,1,5,null,null,null,null,""]
["S",3,"S",0,1,7,1,0,0,0,0,"F","Serviço","Serviço","1.7.1.11.","SINAPI",86915,"TORNEIRA CROMADA DE MESA, 1/2\" OU 3/4\", PARA LAVATÓRIO, PADRÃO MÉDIO - FORNECIMENTO E INSTALAÇÃO. AF_12/2013","UN",5,1,5,null,null,null,null,"Referência: AGETOP - 80570"]
["S",3,"S",0,1,7,1,0,0,0,0,"F","Serviço","Serviço","1.7.1.12.","SINAPI",86877,"VÁLVULA EM METAL CROMADO 1.1/2\" X 1.1/2\" PARA TANQUE OU LAVATÓRIO, COM OU SEM LADRÃO - FORNECIMENTO E INSTALAÇÃO. AF_12/2013","UN",5,1,5,null,null,null,null,"Referência: AGETOP - 80580"]
["S",3,"S",0,1,7,1,0,0,0,0,"F","Serviço","Serviço","1.7.1.13.","SINAPI",86901,"CUBA DE EMBUTIR OVAL EM LOUÇA BRANCA, 35 X 50CM OU EQUIVALENTE - FORNECIMENTO E INSTALAÇÃO. AF_12/2013","UN",4,1,4,null,null,null,null,"Referência: AGETOP - 80590"]
["S",3,"S",0,1,7,1,0,0,0,0,"F","Serviço","Serviço","1.7.1.14.","SINAPI",86912,"TORNEIRA CROMADA LONGA, DE PAREDE, 1/2\" OU 3/4\", PARA PIA DE COZINHA, PADRÃO MÉDIO - FORNECIMENTO E INSTALAÇÃO. AF_12/2013","UN",3,1,3,null,null,null,null,""]
["S",3,"S",0,1,7,1,0,0,0,0,"F","Serviço","Serviço","1.7.1.15.","SINAPI",86900,"CUBA DE EMBUTIR DE AÇO INOXIDÁVEL MÉDIA - FORNECIMENTO E INSTALAÇÃO. AF_12/2013","UN",2,1,2,null,null,null,null,""]
["S",3,"S",0,1,7,1,0,0,0,0,"F","Serviço","Serviço","1.7.1.16.","AGETOP",80693,"TANQUE (PANELAO) INOX 60 X 70 X 40 CM CH.18","Un    ",1,1,1,null,null,null,null,""]
["S",3,"S",0,1,7,1,0,0,0,0,"F","Serviço","Serviço","1.7.1.17.","SINAPI",86881,"SIFÃO DO TIPO GARRAFA EM METAL CROMADO 1 X 1.1/2\" - FORNECIMENTO E INSTALAÇÃO. AF_12/2013","UN",3,1,3,null,null,null,null,"Referência: AGETOP - 80670"]
["S",3,"S",0,1,7,1,0,0,0,0,"F","Serviço","Serviço","1.7.1.18.","SINAPI",86878,"VÁLVULA EM METAL CROMADO TIPO AMERICANA 3.1/2\" X 1.1/2\" PARA PIA - FORNECIMENTO E INSTALAÇÃO. AF_12/2013","UN",3,1,3,null,null,null,null,""]
["S",3,"S",0,1,7,1,0,0,0,0,"F","Serviço","Serviço","1.7.1.19.","AGETOP",80601,"MICTORIO DE LOUCA C/SIFAO INTEGRADO","Un    ",2,1,2,null,null,null,null,""]
["S",3,"S",0,1,7,1,0,0,0,0,"F","Serviço","Serviço","1.7.1.20.","AGETOP",80621,"VÁLVULA DE DESCARGA PARA MICTÓRIO DIÂMETRO 1/2\" FECHAMENTO AUTOMÁTICO TEMPORIZADO","Un    ",2,1,2,null,null,null,null,""]
["S",3,"S",0,1,7,1,0,0,0,0,"F","Serviço","Serviço","1.7.1.21.","AGETOP",80610,"KIT FERR.P/MICT.LOUCA (ESPUDE,CONEXÃO ENTR.PARAFUSOS)","Un    ",2,1,2,null,null,null,null,""]
[{"$f":"CHOOSE(1+LOG(1+2*(ORÇAMENTO.Nivel=\"Nível 1\")+4*(ORÇAMENTO.Nivel=\"Nível 2\")+8*(ORÇAMENTO.Nivel=\"Nível 3\")+16*(ORÇAMENTO.Nivel=\"Nível 4\")+32*(ORÇAMENTO.Nivel=\"Serviço\"),2),0,1,2,3,4,\"S\")","v":"S"},3,"S",0,{"$f":"IF($C230=1,OFFSET(E230,-1,0)+1,OFFSET(E230,-1,0))","v":1},{"$f":"IF($C230=1,0,IF($C230=2,OFFSET(F230,-1,0)+1,OFFSET(F230,-1,0)))","v":7},{"$f":"IF(AND($C230<=2,$C230<>0),0,IF($C230=3,OFFSET(G230,-1,0)+1,OFFSET(G230,-1,0)))","v":1},{"$f":"IF(AND($C230<=3,$C230<>0),0,IF($C230=4,OFFSET(H230,-1,0)+1,OFFSET(H230,-1,0)))","v":0},{"$f":"IF(AND($C230<=4,$C230<>0),0,IF(AND($C230=\"S\",$Y230>0),OFFSET(I230,-1,0)+1,OFFSET(I230,-1,0)))","v":0},0,0,"F","Serviço","Serviço","1.7.1.22.","SINAPI",94792,"REGISTRO DE GAVETA BRUTO, LATÃO, ROSCÁVEL, 1\u0094, COM ACABAMENTO E CANOPLA CROMADOS, INSTALADO EM RESERVAÇÃO DE ÁGUA DE EDIFICAÇÃO QUE POSSUA RESERVATÓRIO DE FIBRA/FIBROCIMENTO \u0096 FORNECIMENTO E INSTALAÇÃO. AF_06/2016","UN",1,1,1,null,null,null,null,"Referência: AGETOP - 80927"]
[3,{"$f":"IF(OR(C231=\"s\",C231=0),OFFSET(B231,-1,0),C231)","v":3},{"$f":"IF(OFFSET(C231,-1,0)=\"L\",1,IF(OFFSET(C231,-1,0)=1,2,IF(OR(A231=\"s\",A231=0),\"S\",IF(AND(OFFSET(C231,-1,0)=2,A231=4),3,IF(AND(OR(OFFSET(C231,-1,0)=\"s\",OFFSET(C231,-1,0)=0),A231<>\"s\",A231>OFFSET(B231,-1,0)),OFFSET(B231,-1,0),A231)))))","v":3},{"$f":"IF(OR(C231=\"S\",C231=0),0,IF(ISERROR(K231),J231,SMALL(J231:K231,1)))","v":14},1,7,2,0,0,74,14,"F","Nível 3","Nível 3","1.7.2.","SINAPI",null,"ÁGUA FRIA","-",null,1,"-",null,null,null,null,""]
["S",3,"S",0,1,7,2,0,0,0,0,"F","Serviço","Serviço","1.7.2.1.","SINAPI",89402,"TUBO, PVC, SOLDÁVEL, DN 25MM, INSTALADO EM RAMAL DE DISTRIBUIÇÃO DE ÁGUA - FORNECIMENTO E INSTALAÇÃO. AF_12/2014","M",12,1,12,null,null,null,null,"Referência: AGETOP - 81003"]
["S",3,"S",0,1,7,2,0,0,0,0,"F","Serviço","Serviço","1.7.2.2.","SINAPI",89447,"TUBO, PVC, SOLDÁVEL, DN 32MM, INSTALADO EM PRUMADA DE ÁGUA - FORNECIMENTO E INSTALAÇÃO. AF_12/2014","M",12,1,12,null,null,null,null,""]
["S",3,"S",0,1,7,2,0,0,0,0,"F","Serviço","Serviço","1.7.2.3.","SINAPI",89553,"ADAPTADOR CURTO COM BOLSA E ROSCA PARA REGISTRO, PVC, SOLDÁVEL, DN 32MM X 1\u0094, INSTALADO EM PRUMADA DE ÁGUA - FORNECIMENTO E INSTALAÇÃO. AF_12/2014","UN",2,1,2,null,null,null,null,"Referência: AGETOP - 81067"]
["S",3,"S",0,1,7,2,0,0,0,0,"F","Serviço","Serviço","1.7.2.4.","SINAPI",89528,"LUVA, PVC, SOLDÁVEL, DN 25MM, INSTALADO EM PRUMADA DE ÁGUA - FORNECIMENTO E INSTALAÇÃO. AF_12/2014","UN",2,1,2,null,null,null,null,""]
["S",3,"S",0,1,7,2,0,0,0,0,"F","Serviço","Serviço","1.7.2.5.","SINAPI",89541,"LUVA, PVC, SOLDÁVEL, DN 32MM, INSTALADO EM PRUMADA DE ÁGUA - FORNECIMENTO E INSTALAÇÃO. AF_12/2014","UN",2,1,2,null,null,null,null,""]
["S",3,"S",0,1,7,2,0,0,0,0,"F","Serviço","Serviço","1.7.2.6.","AGETOP",81180,"BUCHA DE REDUCAO SOLDAVEL LONGA 50 X 32 mm","Un    ",1,1,1,null,null,null,null,""]
["S",3,"S",0,1,7,2,0,0,0,0,"F","Serviço","Serviço","1.7.2.7.","SINAPI",89481,"JOELHO 90 GRAUS, PVC, SOLDÁVEL, DN 25MM, INSTALADO EM PRUMADA DE ÁGUA - FORNECIMENTO E INSTALAÇÃO. AF_12/2014","UN",2,1,2,null,null,null,null,""]
["S",3,"S",0,1,7,2,0,0,0,0,"F","Serviço","Serviço","1.7.2.8.","SINAPI",89413,"JOELHO 90 GRAUS, PVC, SOLDÁVEL, DN 32MM, INSTALADO EM RAMAL DE DISTRIBUIÇÃO DE ÁGUA - FORNECIMENTO E INSTALAÇÃO. AF_12/2014","UN",5,1,5,null,null,null,null,"Referência: AGETOP - 81322"]
["S",3,"S",0,1,7,2,0,0,0,0,"F","Serviço","Serviço","1.7.2.9.","AGETOP",81340,"JOELHO REDUÇÃO 90º SOLDÁVEL  32 mm X 25 mm","Un    ",1,1,1,null,null,null,null,""]
["S",3,"S",0,1,7,2,0,0,0,0,"F","Serviço","Serviço","1.7.2.10.","SINAPI",94672,"JOELHO 90 GRAUS COM BUCHA DE LATÃO, PVC, SOLDÁVEL, DN  25 MM, X 3/4\u0094 INSTALADO EM RESERVAÇÃO DE ÁGUA DE EDIFICAÇÃO QUE POSSUA RESERVATÓRIO DE FIBRA/FIBROCIMENTO   FORNECIMENTO E INSTALAÇÃO. AF_06/2016","UN",1,1,1,null,null,null,null,""]
[{"$f":"CHOOSE(1+LOG(1+2*(ORÇAMENTO.Nivel=\"Nível 1\")+4*(ORÇAMENTO.Nivel=\"Nível 2\")+8*(ORÇAMENTO.Nivel=\"Nível 3\")+16*(ORÇAMENTO.Nivel=\"Nível 4\")+32*(ORÇAMENTO.Nivel=\"Serviço\"),2),0,1,2,3,4,\"S\")","v":"S"},{"$f":"IF(OR(C242=\"s\",C242=0),OFFSET(B242,-1,0),C242)","v":3},{"$f":"IF(OFFSET(C242,-1,0)=\"L\",1,IF(OFFSET(C242,-1,0)=1,2,IF(OR(A242=\"s\",A242=0),\"S\",IF(AND(OFFSET(C242,-1,0)=2,A242=4),3,IF(AND(OR(OFFSET(C242,-1,0)=\"s\",OFFSET(C242,-1,0)=0),A242<>\"s\",A242>OFFSET(B242,-1,0)),OFFSET(B242,-1,0),A242)))))","v":"S"},{"$f":"IF(OR(C242=\"S\",C242=0),0,IF(ISERROR(K242),J242,SMALL(J242:K242,1)))","v":0},{"$f":"IF($C242=1,OFFSET(E242,-1,0)+1,OFFSET(E242,-1,0))","v":1},{"$f":"IF($C242=1,0,IF($C242=2,OFFSET(F242,-1,0)+1,OFFSET(F242,-1,0)))","v":7},{"$f":"IF(AND($C242<=2,$C242<>0),0,IF($C242=3,OFFSET(G242,-1,0)+1,OFFSET(G242,-1,0)))","v":2},{"$f":"IF(AND($C242<=3,$C242<>0),0,IF($C242=4,OFFSET(H242,-1,0)+1,OFFSET(H242,-1,0)))","v":0},{"$f":"IF(AND($C242<=4,$C242<>0),0,IF(AND($C242=\"S\",$Y242>0),OFFSET(I242,-1,0)+1,OFFSET(I242,-1,0)))","v":0},0,0,"F","Serviço","Serviço","1.7.2.11.","AGETOP",81444,"TE 90 GR.SOLD.C/BUC.LATAO NA BOLSA CENT.25X25X3/4\"","Un    ",2,1,2,null,null,null,null,""]
["S",3,"S",0,1,7,2,0,0,0,0,"F","Serviço","Serviço","1.7.2.12.","AGETOP",81501,"ADESIVO PLASTICO - FRASCO 850 G","Un    ",2,1,2,null,null,null,null,""]
["S",3,"S",0,1,7,2,0,0,0,0,"F","Serviço","Serviço","1.7.2.13.","AGETOP",81504,"SOLUCAO LIMPADORA 1000 CM3","Un    ",2,1,2,null,null,null,null,""]
[3,3,3,14,1,7,3,0,0,60,14,"F","Nível 3","Nível 3","1.7.3.","SINAPI",null,"ESGOTO SANITÁRIO","-",null,1,"-",null,null,null,null,""]
["S",3,"S",0,1,7,3,0,0,0,0,"F","Serviço","Serviço","1.7.3.1.","SINAPI",89802,"JOELHO 45 GRAUS, PVC, SERIE NORMAL, ESGOTO PREDIAL, DN 50 MM, JUNTA ELÁSTICA, FORNECIDO E INSTALADO EM PRUMADA DE ESGOTO SANITÁRIO OU VENTILAÇÃO. AF_12/2014","UN",2,1,2,null,null,null,null,""]
["S",3,"S",0,1,7,3,0,0,0,0,"F","Serviço","Serviço","1.7.3.2.","SINAPI",89731,"JOELHO 90 GRAUS, PVC, SERIE NORMAL, ESGOTO PREDIAL, DN 50 MM, JUNTA ELÁSTICA, FORNECIDO E INSTALADO EM RAMAL DE DESCARGA OU RAMAL DE ESGOTO SANITÁRIO. AF_12/2014","UN",6,1,6,null,null,null,null,""]
["S",3,"S",0,1,7,3,0,0,0,0,"F","Serviço","Serviço","1.7.3.3.","SINAPI",89809,"JOELHO 90 GRAUS, PVC, SERIE NORMAL, ESGOTO PREDIAL, DN 100 MM, JUNTA ELÁSTICA, FORNECIDO E INSTALADO EM PRUMADA DE ESGOTO SANITÁRIO OU VENTILAÇÃO. AF_12/2014","UN",1,1,1,null,null,null,null,""]
["S",3,"S",0,1,7,3,0,0,0,0,"F","Serviço","Serviço","1.7.3.4.","AGETOP",81971,"JUNCAO SIMPLES DIAM. 75 X 50 MM","Un    ",2,1,2,null,null,null,null,""]
[{"$f":"CHOOSE(1+LOG(1+2*(ORÇAMENTO.Nivel=\"Nível 1\")+4*(ORÇAMENTO.Nivel=\"Nível 2\")+8*(ORÇAMENTO.Nivel=\"Nível 3\")+16*(ORÇAMENTO.Nivel=\"Nível 4\")+32*(ORÇAMENTO.Nivel=\"Serviço\"),2),0,1,2,3,4,\"S\")","v":"S"},3,"S",0,1,7,3,0,{"$f":"IF(AND($C250<=4,$C250<>0),0,IF(AND($C250=\"S\",$Y250>0),OFFSET(I250,-1,0)+1,OFFSET(I250,-1,0)))","v":0},0,0,"F","Serviço","Serviço","1.7.3.5.","SINAPI",89753,"LUVA SIMPLES, PVC, SERIE NORMAL, ESGOTO PREDIAL, DN 50 MM, JUNTA ELÁSTICA, FORNECIDO E INSTALADO EM RAMAL DE DESCARGA OU RAMAL DE ESGOTO SANITÁRIO. AF_12/2014","UN",2,1,2,null,null,null,null,"Referência: AGETOP - 82002"]
["S",3,"S",0,{"$f":"IF($C251=1,OFFSET(E251,-1,0)+1,OFFSET(E251,-1,0))","v":1},{"$f":"IF($C251=1,0,IF($C251=2,OFFSET(F251,-1,0)+1,OFFSET(F251,-1,0)))","v":7},{"$f":"IF(AND($C251<=2,$C251<>0),0,IF($C251=3,OFFSET(G251,-1,0)+1,OFFSET(G251,-1,0)))","v":3},{"$f":"IF(AND($C251<=3,$C251<>0),0,IF($C251=4,OFFSET(H251,-1,0)+1,OFFSET(H251,-1,0)))","v":0},0,0,0,"F","Serviço","Serviço","1.7.3.6.","SINAPI",89774,"LUVA SIMPLES, PVC, SERIE NORMAL, ESGOTO PREDIAL, DN 75 MM, JUNTA ELÁSTICA, FORNECIDO E INSTALADO EM RAMAL DE DESCARGA OU RAMAL DE ESGOTO SANITÁRIO. AF_12/2014","UN",2,1,2,null,null,null,null,"Referência: AGETOP - 82003"]
["S",3,"S",0,1,7,3,0,0,0,0,"F","Serviço","Serviço","1.7.3.7.","SINAPI",89778,"LUVA SIMPLES, PVC, SERIE NORMAL, ESGOTO PREDIAL, DN 100 MM, JUNTA ELÁSTICA, FORNECIDO E INSTALADO EM RAMAL DE DESCARGA OU RAMAL DE ESGOTO SANITÁRIO. AF_12/2014","UN",2,1,2,null,null,null,null,"Referência: AGETOP - 82004"]
["S",3,"S",0,1,7,3,0,0,0,0,"F","Serviço","Serviço","1.7.3.8.","SINAPI",89549,"REDUÇÃO EXCÊNTRICA, PVC, SERIE R, ÁGUA PLUVIAL, DN 75 X 50 MM, JUNTA ELÁSTICA, FORNECIDO E INSTALADO EM RAMAL DE ENCAMINHAMENTO. AF_12/2014","UN",1,1,1,null,null,null,null,""]
["S",{"$f":"IF(OR(C254=\"s\",C254=0),OFFSET(B254,-1,0),C254)","v":3},{"$f":"IF(OFFSET(C254,-1,0)=\"L\",1,IF(OFFSET(C254,-1,0)=1,2,IF(OR(A254=\"s\",A254=0),\"S\",IF(AND(OFFSET(C254,-1,0)=2,A254=4),3,IF(AND(OR(OFFSET(C254,-1,0)=\"s\",OFFSET(C254,-1,0)=0),A254<>\"s\",A254>OFFSET(B254,-1,0)),OFFSET(B254,-1,0),A254)))))","v":"S"},{"$f":"IF(OR(C254=\"S\",C254=0),0,IF(ISERROR(K254),J254,SMALL(J254:K254,1)))","v":0},1,7,3,0,0,0,0,"F","Serviço","Serviço","1.7.3.9.","SINAPI",89798,"TUBO PVC, SERIE NORMAL, ESGOTO PREDIAL, DN 50 MM, FORNECIDO E INSTALADO EM PRUMADA DE ESGOTO SANITÁRIO OU VENTILAÇÃO. AF_12/2014","M",12,1,12,null,null,null,null,""]
["S",3,"S",0,1,7,3,0,0,0,0,"F","Serviço","Serviço","1.7.3.10.","SINAPI",89799,"TUBO PVC, SERIE NORMAL, ESGOTO PREDIAL, DN 75 MM, FORNECIDO E INSTALADO EM PRUMADA DE ESGOTO SANITÁRIO OU VENTILAÇÃO. AF_12/2014","M",12,1,12,null,null,null,null,""]
["S",3,"S",0,1,7,3,0,0,0,0,"F","Serviço","Serviço","1.7.3.11.","SINAPI",89800,"TUBO PVC, SERIE NORMAL, ESGOTO PREDIAL, DN 100 MM, FORNECIDO E INSTALADO EM PRUMADA DE ESGOTO SANITÁRIO OU VENTILAÇÃO. AF_12/2014","M",12,1,12,null,null,null,null,""]
["S",3,"S",0,1,7,3,0,0,0,0,"F","Serviço","Serviço","1.7.3.12.","SINAPI",98108,"CAIXA DE GORDURA DUPLA (CAPACIDADE: 126 L), RETANGULAR, EM ALVENARIA COM BLOCOS DE CONCRETO, DIMENSÕES INTERNAS = 0,4X0,7 M, ALTURA INTERNA = 0,8 M. AF_05/2018","UN",1,1,1,null,null,null,null,""]
["S",3,"S",0,1,7,3,0,0,0,0,"F","Serviço","Serviço","1.7.3.13.","AGETOP",81828,"CAIXA DE AREIA 60X60CM FUNDO DE BRITA COM GRELHA METÁLICA FERRO CHATO PADRÃO AGETOP ","Un    ",2,1,2,null,null,null,null,""]
[3,3,3,39,1,7,4,0,0,46,39,"F","Nível 3","Nível 3","1.7.4.","SINAPI",null,"INCÊNDIO","-",null,1,"-",null,null,null,null,""]
["S",3,"S",0,1,7,4,0,0,0,0,"F","Serviço","Serviço","1.7.4.1.","AGETOP",72338,"SIRENE METALICA ALCANCE 500 M","Un    ",1,1,1,null,null,null,null,""]
["S",3,"S",0,1,7,4,0,0,0,0,"F","Serviço","Serviço","1.7.4.2.","AGETOP",81882,"RES.METALICO TAÇA AÇO PATINÁVEL-V=15M3-COL.SEC.H=6M+FUNDAÇÃO+LOGOTIPO","Un    ",1,1,1,null,null,null,null,""]
["S",3,"S",0,1,7,4,0,0,0,0,"F","Serviço","Serviço","1.7.4.3.","AGETOP",80910,"REGISTRO DE GAVETA BRUTO DIAMETRO 2.1/2\"","Un    ",2,1,2,null,null,null,null,""]
["S",3,"S",0,1,7,4,0,0,0,0,"F","Serviço","Serviço","1.7.4.4.","AGETOP",82379,"TUBO FERRO GALVANIZADO DIAM.2.1/2\"","m     ",200,1,200,null,null,null,null,""]
["S",3,"S",0,1,7,4,0,0,0,0,"F","Serviço","Serviço","1.7.4.5.","AGETOP",85003,"EXTINTOR PO QUIMICO SECO (6 KG) - CAPACIDADE EXTINTORA 20 BC","Un    ",2,1,2,null,null,null,null,""]
["S",3,"S",0,1,7,4,0,0,0,0,"F","Serviço","Serviço","1.7.4.6.","AGETOP",85006,"EXTINTOR MULTI USO EM PO A B C (6 KG) - CAPACIDADE EXTINTORA 3A 20BC","un    ",6,1,6,null,null,null,null,""]
["S",3,"S",0,1,7,4,0,0,0,0,"F","Serviço","Serviço","1.7.4.7.","AGETOP",85011,"CAIXA DE INCÊNDIO METÁLICA COM SUPORTE PARA MANGUEIRA, TAMPA E MURETA 17X60X90 CM C/PINTURA","Un    ",4,1,4,null,null,null,null,""]
["S",3,"S",0,1,7,4,0,0,0,0,"F","Serviço","Serviço","1.7.4.8.","AGETOP",85017,"MANGUEIRA DE INCÊNDIO D.I. = 38 MM TIPO 2 COMP. = 15 M","CJ    ",8,1,8,null,null,null,null,""]
["S",3,"S",0,1,7,4,0,0,0,0,"F","Serviço","Serviço","1.7.4.9.","AGETOP",85025,"ESGUICHO REGULÁVEL 1.1/2\"","Un    ",4,1,4,null,null,null,null,""]
["S",3,"S",0,1,7,4,0,0,0,0,"F","Serviço","Serviço","1.7.4.10.","AGETOP",85027,"ADAPTADOR P/ENGATE STORZ 2.1/2\" X 1.1/2\"","Un    ",5,1,5,null,null,null,null,""]
["S",3,"S",0,1,7,4,0,0,0,0,"F","Serviço","Serviço","1.7.4.11.","AGETOP",85031,"REGISTRO GLOBO ANGULAR 2.1/2\"","Un    ",4,1,4,null,null,null,null,""]
["S",3,"S",0,1,7,4,0,0,0,0,"F","Serviço","Serviço","1.7.4.12.","AGETOP",85035,"TAMPÃO CEGO COM CORRENTE 2.1/2\"","Un    ",5,1,5,null,null,null,null,""]
["S",3,"S",0,1,7,4,0,0,0,0,"F","Serviço","Serviço","1.7.4.13.","AGETOP",85037,"TANQUE DE PRESSÃO DE 10 L","Un    ",1,1,1,null,null,null,null,""]
["S",3,"S",0,1,7,4,0,0,0,0,"F","Serviço","Serviço","1.7.4.14.","AGETOP",85039,"PRESSOSTATO 50 A 80 PSI","Un    ",1,1,1,null,null,null,null,""]
["S",3,"S",0,1,7,4,0,0,0,0,"F","Serviço","Serviço","1.7.4.15.","AGETOP",85041,"MANOMETRO - 0 A 10 KG/CM2","Un    ",1,1,1,null,null,null,null,""]
["S",3,"S",0,1,7,4,0,0,{"$f":"IF(OR($C275=\"S\",$C275=0),0,MATCH(0,OFFSET($D275,1,$C275,ROW($C$501)-ROW($C275)),0))","v":0},{"$f":"IF(OR($C275=\"S\",$C275=0),0,MATCH(OFFSET($D275,0,$C275)+1,OFFSET($D275,1,$C275,ROW($C$501)-ROW($C275)),0))","v":0},"F","Serviço","Serviço","1.7.4.16.","AGETOP",85077,"VÁLVULA DE RETENÇÃO HORIZONTAL 2.1/2\"","Un    ",2,1,2,null,null,null,null,""]
["S",3,"S",0,1,7,4,0,0,0,0,"F","Serviço","Serviço","1.7.4.17.","COMPOSIÇÃO","COMP 017_SEE","REDUCAO GIRATÓRIA TIPO STORZ LATAO P/ INST. PREDIAL COMBATE A INCENDIO ENGATE RAPIDO 2.1/2\" X 1.1/2\"","UN ",4,1,4,null,null,null,null,""]
["S",3,"S",0,1,7,4,0,0,0,0,"F","Serviço","Serviço","1.7.4.18.","COMPOSIÇÃO","COMP 018_SEE","CHAVE DUPLA P/ CONEXÕES TIPO STORZ EM LATÃO ENGATE RÁPIDO 1 1/2\" X 2 1/2\"","UN ",4,1,4,null,null,null,null,""]
["S",3,"S",0,1,7,4,0,0,0,0,"F","Serviço","Serviço","1.7.4.19.","COMPOSIÇÃO","COMP 087_SEE","REGISTRO DE GAVETA COM HASTE ASCENDENTE DE BRONZE 2 1/2\"","UN ",1,1,1,null,null,null,null,""]
["S",3,"S",0,1,7,4,0,0,0,0,"F","Serviço","Serviço","1.7.4.20.","COMPOSIÇÃO","COMP 019_SEE","TAMPÃO LATAO C/ CORRENTE P/ INSTALAÇÃO PREDIAL COMBATE A INCÊNDIO ENGATE RÁPIDO 1 1/2\"","UN ",5,1,5,null,null,null,null,""]
["S",3,"S",0,1,7,4,0,0,0,0,"F","Serviço","Serviço","1.7.4.21.","AGETOP",85056,"TÊ DE FERRO GALVANIZADO 90º X 2 1/2\"","un    ",11,1,11,null,null,null,null,""]
["S",3,"S",0,1,7,4,0,0,0,0,"F","Serviço","Serviço","1.7.4.22.","COMPOSIÇÃO","COMP 030_SEE","COTOVELO DE FERRO GALV. 90° X 2 1/2\"","UN ",19,1,19,null,null,null,null,""]
["S",3,"S",0,1,7,4,0,0,0,0,"F","Serviço","Serviço","1.7.4.23.","COMPOSIÇÃO","COMP 077_SEE","UNIAO FERRO GALV C/ASSENTO CONICO BRONZE 2 1/2\"","UN ",6,1,6,null,null,null,null,""]
["S",3,"S",0,1,7,4,0,0,0,0,"F","Serviço","Serviço","1.7.4.24.","AGETOP",85047,"NIPLE DUPLO FERRO GALVANIZADO 2.1/2\"","Un    ",9,1,9,null,null,null,null,""]
["S",3,"S",0,1,7,4,0,0,0,0,"F","Serviço","Serviço","1.7.4.25.","COMPOSIÇÃO","COMP 076_SEE","CURVA FERRO GALVANIZADO 45G ROSCA MACHO/FEMEA REF. 2 1/2\"","UN ",1,1,1,null,null,null,null,""]
["S",3,"S",0,1,7,4,0,0,0,0,"F","Serviço","Serviço","1.7.4.26.","COMPOSIÇÃO","COMP 022_SEE","TAMPÃO FOFO 40X50CM C/INSCRIÇÃO ","UN ",1,1,1,null,null,null,null,""]
["S",3,"S",0,1,7,4,0,0,0,0,"F","Serviço","Serviço","1.7.4.27.","COMPOSIÇÃO","COMP 024_SEE","SINALIZADOR FOTOLUMINESCENTE PARA EXTINTOR","UN ",8,1,8,null,null,null,null,""]
["S",3,"S",0,1,7,4,0,0,0,0,"F","Serviço","Serviço","1.7.4.28.","COMPOSIÇÃO","COMP 186_SEE","BOTOEIRA BOMBA DE INCÊNDIO C/ MARTELO CONVENCIONAL/ ANALÓGICA","UN ",1,1,1,null,null,null,null,""]
["S",3,"S",0,1,7,4,0,0,0,0,"F","Serviço","Serviço","1.7.4.29.","COMPOSIÇÃO","COMP 188_SEE","ACIONADOR MANUAL DE ALARME","UN ",5,1,5,null,null,null,null,""]
["S",3,"S",0,1,7,4,0,0,0,0,"F","Serviço","Serviço","1.7.4.30.","COMPOSIÇÃO","COMP 190_SEE","CENTRAL DE DETECÇÃO E ALARME DE 40 SETORES COM BATERIA","UN ",1,1,1,null,null,null,null,""]
["S",3,"S",0,1,7,4,0,0,0,0,"F","Serviço","Serviço","1.7.4.31.","COMPOSIÇÃO","COMP 025_SEE","SINALIZADOR FOTOLUMINESCENTE DE EMERGÊNCIA","UN ",30,1,30,null,null,null,null,""]
["S",3,"S",0,1,7,4,0,0,0,0,"F","Serviço","Serviço","1.7.4.32.","COMPOSIÇÃO","COMP 277_SEE","MARCAÇÃO NO PISO - 1X1 M PARA EXTINTOR","M2",8,1,8,null,null,null,null,""]
["S",3,"S",0,1,7,4,0,0,0,0,"F","Serviço","Serviço","1.7.4.33.","AGETOP",71598,"LUMINÁRIA DE EMERGÊNCIA 30 LEDS","un    ",12,1,12,null,null,null,null,""]
["S",3,"S",0,1,7,4,0,0,0,0,"F","Serviço","Serviço","1.7.4.34.","COMPOSIÇÃO","COMP 040_SEE","CONJUNTO MOTOR-BOMBA ELÉTRICA TRIFÁSICO 380/220 V PARA VZ= 24,33 M³/H, HM= 46,24 M POTÊNCIA= 7,5 CV","UN ",1,1,1,null,null,null,null,""]
["S",3,"S",0,1,7,4,0,0,0,0,"F","Serviço","Serviço","1.7.4.35.","COMPOSIÇÃO","COMP 546_SEE","BUJÃO DE REBORDO 2.1/2\"","UN ",1,1,1,null,null,null,null,""]
["S",3,"S",0,1,7,4,0,0,0,0,"F","Serviço","Serviço","1.7.4.36.","COMPOSIÇÃO","COMP 548_SEE","VÁLVULA DE ESFERA BRUTA, METAL, ROSCÁVEL, 2.1/2\" - FORNECIMENTO E INSTALAÇÃO","UN ",1,1,1,null,null,null,null,""]
["S",3,"S",0,1,7,4,0,0,0,0,"F","Serviço","Serviço","1.7.4.37.","COMPOSIÇÃO","COMP 549_SEE","FLANGE GALVANIZADA 2.1/2\" - FORNECIMENTO E INSTALAÇÃO","UN ",1,1,1,null,null,null,null,""]
["S",3,"S",0,1,7,4,0,0,0,0,"F","Serviço","Serviço","1.7.4.38.","AGETOP",70356,"BRACADEIRA METALICA TIPO \"U\" DIAM. 2.1/2\"","Un    ",7,1,7,null,null,null,null,""]
[3,3,3,7,1,7,5,0,0,7,{"$error":"#N/A"},"F","Nível 3","Nível 3","1.7.5.",null,null,"RESERVATÓRIO","-",null,1,"-",null,null,null,null,""]
["S",3,"S",0,1,7,5,0,0,0,0,"F","Serviço","Serviço","1.7.5.1.","SINAPI",89447,"TUBO, PVC, SOLDÁVEL, DN 32MM, INSTALADO EM PRUMADA DE ÁGUA - FORNECIMENTO E INSTALAÇÃO. AF_12/2014","M",30,1,30,null,null,null,null,""]
["S",3,"S",0,1,7,5,0,0,0,0,"F","Serviço","Serviço","1.7.5.2.","SINAPI",94495,"REGISTRO DE GAVETA BRUTO, LATÃO, ROSCÁVEL, 1\u0094, INSTALADO EM RESERVAÇÃO DE ÁGUA DE EDIFICAÇÃO QUE POSSUA RESERVATÓRIO DE FIBRA/FIBROCIMENTO \u0096 FORNECIMENTO E INSTALAÇÃO. AF_06/2016","UN",1,1,1,null,null,null,null,"Referência: AGETOP - 80903"]
["S",3,"S",0,1,7,5,0,0,0,0,"F","Serviço","Serviço","1.7.5.3.","SINAPI",94709,"ADAPTADOR COM FLANGES LIVRES, PVC, SOLDÁVEL, DN 32 MM X 1 , INSTALADO EM RESERVAÇÃO DE ÁGUA DE EDIFICAÇÃO QUE POSSUA RESERVATÓRIO DE FIBRA/FIBROCIMENTO   FORNECIMENTO E INSTALAÇÃO. AF_06/2016","UN",1,1,1,null,null,null,null,"Referência: AGETOP - 81056"]
["S",3,"S",0,1,7,5,0,0,0,0,"F","Serviço","Serviço","1.7.5.4.","SINAPI",89553,"ADAPTADOR CURTO COM BOLSA E ROSCA PARA REGISTRO, PVC, SOLDÁVEL, DN 32MM X 1\u0094, INSTALADO EM PRUMADA DE ÁGUA - FORNECIMENTO E INSTALAÇÃO. AF_12/2014","UN",2,1,2,null,null,null,null,"Referência: AGETOP - 81067"]
["S",3,"S",0,1,7,5,0,0,0,0,"F","Serviço","Serviço","1.7.5.5.","SINAPI",89492,"JOELHO 90 GRAUS, PVC, SOLDÁVEL, DN 32MM, INSTALADO EM PRUMADA DE ÁGUA - FORNECIMENTO E INSTALAÇÃO. AF_12/2014","UN",6,1,6,null,null,null,null,""]
["S",3,"S",0,1,7,5,0,0,0,0,"F","Serviço","Serviço","1.7.5.6.","SINAPI",89541,"LUVA, PVC, SOLDÁVEL, DN 32MM, INSTALADO EM PRUMADA DE ÁGUA - FORNECIMENTO E INSTALAÇÃO. AF_12/2014","UN",5,1,5,null,null,null,null,""]
[2,2,2,26,1,8,0,0,0,76,26,"F","Nível 2","Nível 2","1.8.",null,null,"INSTALAÇÕES ESPECIAIS","-",null,1,"-",null,null,null,null,""]
["S",2,"S",0,1,8,0,0,0,0,0,"F","Serviço","Serviço","1.8.0.1.","AGETOP",91007,"CENTRAL DE GÁS PADRÃO AGETOP SEM INSTALAÇÕES (1+1 CILINDRO 45 KG)","Un    ",1,1,1,null,null,null,null,""]
["S",2,"S",0,1,8,0,0,0,0,0,"F","Serviço","Serviço","1.8.0.2.","AGETOP",91023,"UNIÃO S/BRONZE PRETA 3/4\" NPT 300 LBS","Un    ",3,1,3,null,null,null,null,""]
["S",2,"S",0,1,8,0,0,0,0,0,"F","Serviço","Serviço","1.8.0.3.","COMPOSIÇÃO","COMP 382_SEE","TE DE REDUCAO DE FERRO GALVANIZADO, COM ROSCA BSP, DE 3/4\" X 1/2\"","UN ",1,1,1,null,null,null,null,""]
["S",2,"S",0,1,8,0,0,0,0,0,"F","Serviço","Serviço","1.8.0.4.","COMPOSIÇÃO","COMP 383_SEE","BUCHA DE REDUCAO DE FERRO GALVANIZADO, COM ROSCA BSP, DE 1/2\" X 1/4\"","UN ",3,1,3,null,null,null,null,""]
["S",2,"S",0,1,8,0,0,0,0,0,"F","Serviço","Serviço","1.8.0.5.","AGETOP",91021,"LUVA GALVANIZADO DE REDUÇÃO 3/4\" X 1/2\" (GÁS)","Un    ",2,1,2,null,null,null,null,""]
["S",2,"S",0,1,8,0,0,0,0,0,"F","Serviço","Serviço","1.8.0.6.","SINAPI",92692,"NIPLE, EM FERRO GALVANIZADO, CONEXÃO ROSQUEADA, DN 15 (1/2\"), INSTALADO EM RAMAIS E SUB-RAMAIS DE GÁS - FORNECIMENTO E INSTALAÇÃO. AF_12/2015","UN",6,1,6,null,null,null,null,""]
["S",2,"S",0,1,8,0,0,0,0,0,"F","Serviço","Serviço","1.8.0.7.","AGETOP",91031,"NIPLE DUPLO 300 PSI 3/4\"","Un    ",6,1,6,null,null,null,null,""]
["S",2,"S",0,1,8,0,0,0,0,0,"F","Serviço","Serviço","1.8.0.8.","COMPOSIÇÃO","COMP 212_SEE","NIPLE DE REDUÇÃO 1/2\" X 1/4\" BSP","UN ",4,1,4,null,null,null,null,""]
["S",2,"S",0,1,8,0,0,0,0,0,"F","Serviço","Serviço","1.8.0.9.","COMPOSIÇÃO","COMP 213_SEE","NIPLE DE REDUÇÃO 3/4\" X 1/2\" BSP","UN ",4,1,4,null,null,null,null,""]
["S",2,"S",0,1,8,0,0,0,0,0,"F","Serviço","Serviço","1.8.0.10.","SINAPI",92688,"TUBO DE AÇO GALVANIZADO COM COSTURA, CLASSE MÉDIA, CONEXÃO ROSQUEADA, DN 20 (3/4\"), INSTALADO EM RAMAIS E SUB-RAMAIS DE GÁS - FORNECIMENTO E INSTALAÇÃO. AF_12/2015","M",12,1,12,null,null,null,null,""]
["S",2,"S",0,1,8,0,0,0,0,0,"F","Serviço","Serviço","1.8.0.11.","SINAPI",92701,"JOELHO 90 GRAUS, EM FERRO GALVANIZADO, CONEXÃO ROSQUEADA, DN 20 (3/4\"), INSTALADO EM RAMAIS E SUB-RAMAIS DE GÁS - FORNECIMENTO E INSTALAÇÃO. AF_12/2015","UN",4,1,4,null,null,null,null,""]
["S",2,"S",0,1,8,0,0,0,0,0,"F","Serviço","Serviço","1.8.0.12.","COMPOSIÇÃO","COMP 237_SEE","FITA ANTICORROSIVA","M",6,1,6,null,null,null,null,""]
["S",2,"S",0,1,8,0,0,0,0,0,"F","Serviço","Serviço","1.8.0.13.","AGETOP",91025,"VÁLVULA ESFERICA LATÃO 3/4\"","Un    ",3,1,3,null,null,null,null,""]
["S",2,"S",0,1,8,0,0,0,0,0,"F","Serviço","Serviço","1.8.0.14.","COMPOSIÇÃO","COMP 542_SEE","VÁLVULA UGV 3/4\" (S) LATÃO","UN ",1,1,1,null,null,null,null,""]
["S",2,"S",0,1,8,0,0,0,0,0,"F","Serviço","Serviço","1.8.0.15.","COMPOSIÇÃO","COMP 543_SEE","VÁLVULA UGV 1/2\" (S) LATÃO","UN ",1,1,1,null,null,null,null,""]
["S",2,"S",0,1,8,0,0,0,0,0,"F","Serviço","Serviço","1.8.0.16.","AGETOP",91029,"VALVULA DE RETENÇÃO LATÃO 1/2\" X 7/16\" NPT","Un    ",1,1,1,null,null,null,null,""]
["S",2,"S",0,1,8,0,0,0,0,0,"F","Serviço","Serviço","1.8.0.17.","COMPOSIÇÃO","COMP 211_SEE","REGULADOR DE 2º ESTÁGIO 5KG/H","UN ",1,1,1,null,null,null,null,""]
["S",2,"S",0,1,8,0,0,0,0,0,"F","Serviço","Serviço","1.8.0.18.","COMPOSIÇÃO","COMP 210_SEE","REGULADOR DE 1º ESTÁGIO 60KG/H MODELO AP-40  COM MANÔMETRO","UN ",1,1,1,null,null,null,null,""]
["S",2,"S",0,1,8,0,0,0,0,0,"F","Serviço","Serviço","1.8.0.19.","AGETOP",85003,"EXTINTOR PO QUIMICO SECO (6 KG) - CAPACIDADE EXTINTORA 20 BC","Un    ",1,1,1,null,null,null,null,""]
["S",2,"S",0,1,8,0,0,0,0,0,"F","Serviço","Serviço","1.8.0.20.","COMPOSIÇÃO","COMP 235_SEE","PLACA DE SINALIZAÇÃO EM PVC COD 01 - (300X300) PROIBIDO FUMAR","UN ",2,1,2,null,null,null,null,""]
["S",2,"S",0,1,8,0,0,0,0,0,"F","Serviço","Serviço","1.8.0.21.","COMPOSIÇÃO","COMP 236_SEE","PLACA DE SINALIZAÇÃO EM PVC COD 06 - (300X300) PERIGO INFLAMÁVEL","UN ",2,1,2,null,null,null,null,""]
["S",2,"S",0,1,8,0,0,0,0,0,"F","Serviço","Serviço","1.8.0.22.","AGETOP",91043,"BRAÇADEIRA METALICA TIPO \"D\" DIAM. 3/4\"","Un    ",4,1,4,null,null,null,null,""]
["S",2,"S",0,1,8,0,0,0,0,0,"F","Serviço","Serviço","1.8.0.23.","AGETOP",71863,"PARAFUSO P/BUCHA S-10","Un    ",8,1,8,null,null,null,null,""]
[{"$f":"CHOOSE(1+LOG(1+2*(ORÇAMENTO.Nivel=\"Nível 1\")+4*(ORÇAMENTO.Nivel=\"Nível 2\")+8*(ORÇAMENTO.Nivel=\"Nível 3\")+16*(ORÇAMENTO.Nivel=\"Nível 4\")+32*(ORÇAMENTO.Nivel=\"Serviço\"),2),0,1,2,3,4,\"S\")","v":"S"},2,"S",0,1,8,0,0,{"$f":"IF(AND($C329<=4,$C329<>0),0,IF(AND($C329=\"S\",$Y329>0),OFFSET(I329,-1,0)+1,OFFSET(I329,-1,0)))","v":0},0,0,"F","Serviço","Serviço","1.8.0.24.","AGETOP",70393,"BUCHA DE NYLON S-10","Un    ",8,1,8,null,null,null,null,""]
["S",2,"S",0,1,8,0,0,0,0,0,"F","Serviço","Serviço","1.8.0.25.","AGETOP",91045,"SUPORTE PARA COLETOR","Un    ",2,1,2,null,null,null,null,""]
[{"$f":"CHOOSE(1+LOG(1+2*(ORÇAMENTO.Nivel=\"Nível 1\")+4*(ORÇAMENTO.Nivel=\"Nível 2\")+8*(ORÇAMENTO.Nivel=\"Nível 3\")+16*(ORÇAMENTO.Nivel=\"Nível 4\")+32*(ORÇAMENTO.Nivel=\"Serviço\"),2),0,1,2,3,4,\"S\")","v":2},2,2,3,1,9,0,0,{"$f":"IF(AND($C331<=4,$C331<>0),0,IF(AND($C331=\"S\",$Y331>0),OFFSET(I331,-1,0)+1,OFFSET(I331,-1,0)))","v":0},50,3,"F","Nível 2","Nível 2","1.9.",null,null,"ALVENARIAS E DIVISÓRIAS","-",null,1,"-",null,null,null,null,""]
["S",2,"S",0,1,9,0,0,0,0,0,"F","Serviço","Serviço","1.9.0.1.","SINAPI",72132,"ALVENARIA EM TIJOLO CERAMICO MACICO 5X10X20CM 1/2 VEZ (ESPESSURA 10CM), ASSENTADO COM ARGAMASSA TRACO 1:2:8 (CIMENTO, CAL E AREIA)","M2",2.2200000000000002,1,2.2200000000000002,null,null,null,null,""]
["S",2,"S",0,{"$f":"IF($C333=1,OFFSET(E333,-1,0)+1,OFFSET(E333,-1,0))","v":1},{"$f":"IF($C333=1,0,IF($C333=2,OFFSET(F333,-1,0)+1,OFFSET(F333,-1,0)))","v":9},{"$f":"IF(AND($C333<=2,$C333<>0),0,IF($C333=3,OFFSET(G333,-1,0)+1,OFFSET(G333,-1,0)))","v":0},{"$f":"IF(AND($C333<=3,$C333<>0),0,IF($C333=4,OFFSET(H333,-1,0)+1,OFFSET(H333,-1,0)))","v":0},0,0,0,"F","Serviço","Serviço","1.9.0.2.","SINAPI",87489,"ALVENARIA DE VEDAÇÃO DE BLOCOS CERÂMICOS FURADOS NA VERTICAL DE 9X19X39CM (ESPESSURA 9CM) DE PAREDES COM ÁREA LÍQUIDA MAIOR OU IGUAL A 6M² COM VÃOS E ARGAMASSA DE ASSENTAMENTO COM PREPARO EM BETONEIRA. AF_06/2014","M2",13.719999999999999,1,13.719999999999999,null,null,null,null,"Referência: AGETOP - 100201"]
[2,{"$f":"IF(OR(C334=\"s\",C334=0),OFFSET(B334,-1,0),C334)","v":2},{"$f":"IF(OFFSET(C334,-1,0)=\"L\",1,IF(OFFSET(C334,-1,0)=1,2,IF(OR(A334=\"s\",A334=0),\"S\",IF(AND(OFFSET(C334,-1,0)=2,A334=4),3,IF(AND(OR(OFFSET(C334,-1,0)=\"s\",OFFSET(C334,-1,0)=0),A334<>\"s\",A334>OFFSET(B334,-1,0)),OFFSET(B334,-1,0),A334)))))","v":2},{"$f":"IF(OR(C334=\"S\",C334=0),0,IF(ISERROR(K334),J334,SMALL(J334:K334,1)))","v":3},1,10,0,0,0,47,3,"F","Nível 2","Nível 2","1.10.",null,null,"IMPERMEABILIZAÇÃO","-",null,1,"-",null,null,null,null,""]
["S",2,"S",0,1,10,0,0,0,0,0,"F","Serviço","Serviço","1.10.0.1.","AGETOP",121101,"IMPERMEABILIZAÇÃO  MURO DE ARRIMO COM 4 DEMÃOS DE EMULSÃO ASFÁLTICA ","m2    ",8.65,1,8.65,null,null,null,null,""]
["S",2,"S",0,1,10,0,0,0,0,0,"F","Serviço","Serviço","1.10.0.2.","SINAPI",98562,"IMPERMEABILIZAÇÃO DE FLOREIRA OU VIGA BALDRAME COM ARGAMASSA DE CIMENTO E AREIA, COM ADITIVO IMPERMEABILIZANTE, E = 2 CM. AF_06/2018","M2",32.44,1,32.44,null,null,null,null,"Referência: AGETOP - 120902"]
[2,2,2,2,1,11,0,0,0,44,2,"F","Nível 2","Nível 2","1.11.",null,null,"ESTRUTURA DE MADEIRA","-",null,1,"-",null,null,null,null,""]
["S",2,"S",0,1,11,0,0,0,0,0,"F","Serviço","Serviço","1.11.0.1.","AGETOP",140101,"ESTRUTURA-TELHA CERÂMICA V=3 A 7 M. C/FERRAGENS","m2    ",304.84000000000003,1,304.84000000000003,null,null,null,null,"Referência: AGETOP - 140101"]
[2,2,2,4,1,12,0,0,0,{"$f":"IF(OR($C339=\"S\",$C339=0),0,MATCH(0,OFFSET($D339,1,$C339,ROW($C$501)-ROW($C339)),0))","v":42},{"$f":"IF(OR($C339=\"S\",$C339=0),0,MATCH(OFFSET($D339,0,$C339)+1,OFFSET($D339,1,$C339,ROW($C$501)-ROW($C339)),0))","v":4},"F","Nível 2","Nível 2","1.12.",null,null,"COBERTURAS","-",null,1,"-",null,null,null,null,""]
["S",2,"S",0,1,12,0,0,0,0,0,"F","Serviço","Serviço","1.12.0.1.","SINAPI",94445,"TELHAMENTO COM TELHA CERÂMICA CAPA-CANAL, TIPO PLAN, COM ATÉ 2 ÁGUAS, INCLUSO TRANSPORTE VERTICAL. AF_06/2016","M2",304.84000000000003,1,304.84000000000003,null,null,null,null,"Referência: AGETOP - 160401"]
["S",2,"S",0,1,12,0,0,0,0,0,"F","Serviço","Serviço","1.12.0.2.","SINAPI",94221,"CUMEEIRA PARA TELHA CERÂMICA EMBOÇADA COM ARGAMASSA TRAÇO 1:2:9 (CIMENTO, CAL E AREIA) PARA TELHADOS COM ATÉ 2 ÁGUAS, INCLUSO TRANSPORTE VERTICAL. AF_06/2016","M",8.6999999999999993,1,8.6999999999999993,null,null,null,null,""]
["S",2,"S",0,1,12,0,0,0,0,0,"F","Serviço","Serviço","1.12.0.3.","SINAPI",94224,"EMBOÇAMENTO COM ARGAMASSA TRAÇO 1:2:9 (CIMENTO, CAL E AREIA). AF_06/2016","M",9.5,1,9.5,null,null,null,null,"Referência: AGETOP - 160403"]
[2,2,2,7,1,13,0,0,0,38,7,"F","Nível 2","Nível 2","1.13.",null,null,"ESQUADRIAS METÁLICAS","-",null,1,"-",null,null,null,null,""]
["S",2,"S",0,1,13,0,0,0,0,0,"F","Serviço","Serviço","1.13.0.1.","COMPOSIÇÃO","COMP 007_SEE","GUICHÊ CANTONEIRA/GRADE PARA VIDRO","M²",3.15,1,3.15,null,null,null,null,""]
["S",2,"S",0,1,13,0,0,0,0,0,"F","Serviço","Serviço","1.13.0.2.","AGETOP",180316,"CORRIMÃO/TUBO INDUSTRIAL C-1","m     ",34.700000000000003,1,34.700000000000003,null,null,null,null,""]
["S",2,"S",0,1,13,0,0,0,0,0,"F","Serviço","Serviço","1.13.0.3.","SINAPI",94559,"JANELA DE AÇO BASCULANTE, FIXAÇÃO COM ARGAMASSA, SEM VIDROS, PADRONIZADA. AF_07/2016","M2",15,1,15,null,null,null,null,"Referência: AGETOP - 180404"]
["S",2,"S",0,1,13,0,0,0,0,0,"F","Serviço","Serviço","1.13.0.4.","SINAPI","73933/4","PORTA DE FERRO DE ABRIR TIPO BARRA CHATA, COM REQUADRO E GUARNICAO COMPLETA","M2",1.68,1,1.68,null,null,null,null,"Referência: AGETOP - 180501"]
["S",2,"S",0,1,13,0,0,0,0,0,"F","Serviço","Serviço","1.13.0.5.","SINAPI","73933/4","PORTA DE FERRO DE ABRIR TIPO BARRA CHATA, COM REQUADRO E GUARNICAO COMPLETA","M2",4.32,1,4.32,null,null,null,null,"Referência: AGETOP - 180509"]
["S",2,"S",0,1,13,0,0,0,0,0,"F","Serviço","Serviço","1.13.0.6.","AGETOP",180323,"GRELHA PADRÃO AGETOP DE FERRO CHATO COM BERÇO (ESPAÇAMENTO ENTRE FACES = 1,5CM - NBR 9050 ACESSIBILIDADE)","m2    ",21.860000000000003,1,21.860000000000003,null,null,null,null,""]
[2,2,2,4,1,14,0,0,0,31,4,"F","Nível 2","Nível 2","1.14.",null,null,"REVESTIMENTO DE PAREDE","-",null,1,"-",null,null,null,null,""]
["S",2,"S",0,1,14,0,0,0,0,0,"F","Serviço","Serviço","1.14.0.1.","SINAPI",87904,"CHAPISCO APLICADO EM ALVENARIA (COM PRESENÇA DE VÃOS) E ESTRUTURAS DE CONCRETO DE FACHADA, COM COLHER DE PEDREIRO.  ARGAMASSA TRAÇO 1:3 COM PREPARO MANUAL. AF_06/2014","M2",8.65,1,8.65,null,null,null,null,"Referência: AGETOP - 200101"]
[{"$f":"CHOOSE(1+LOG(1+2*(ORÇAMENTO.Nivel=\"Nível 1\")+4*(ORÇAMENTO.Nivel=\"Nível 2\")+8*(ORÇAMENTO.Nivel=\"Nível 3\")+16*(ORÇAMENTO.Nivel=\"Nível 4\")+32*(ORÇAMENTO.Nivel=\"Serviço\"),2),0,1,2,3,4,\"S\")","v":"S"},2,"S",0,{"$f":"IF($C352=1,OFFSET(E352,-1,0)+1,OFFSET(E352,-1,0))","v":1},{"$f":"IF($C352=1,0,IF($C352=2,OFFSET(F352,-1,0)+1,OFFSET(F352,-1,0)))","v":14},{"$f":"IF(AND($C352<=2,$C352<>0),0,IF($C352=3,OFFSET(G352,-1,0)+1,OFFSET(G352,-1,0)))","v":0},{"$f":"IF(AND($C352<=3,$C352<>0),0,IF($C352=4,OFFSET(H352,-1,0)+1,OFFSET(H352,-1,0)))","v":0},{"$f":"IF(AND($C352<=4,$C352<>0),0,IF(AND($C352=\"S\",$Y352>0),OFFSET(I352,-1,0)+1,OFFSET(I352,-1,0)))","v":0},0,0,"F","Serviço","Serviço","1.14.0.2.","SINAPI",87547,"MASSA ÚNICA, PARA RECEBIMENTO DE PINTURA, EM ARGAMASSA TRAÇO 1:2:8, PREPARO MECÂNICO COM BETONEIRA 400L, APLICADA MANUALMENTE EM FACES INTERNAS DE PAREDES, ESPESSURA DE 10MM, COM EXECUÇÃO DE TALISCAS. AF_06/2014","M2",8.65,1,8.65,null,null,null,null,"Referência: AGETOP - 200403"]
["S",2,"S",0,1,14,0,0,0,0,0,"F","Serviço","Serviço","1.14.0.3.","SINAPI",87273,"REVESTIMENTO CERÂMICO PARA PAREDES INTERNAS COM PLACAS TIPO ESMALTADA EXTRA DE DIMENSÕES 33X45 CM APLICADAS EM AMBIENTES DE ÁREA MAIOR QUE 5 M² NA ALTURA INTEIRA DAS PAREDES. AF_06/2014","M2",254.25,1,254.25,null,null,null,null,""]
[2,2,2,2,1,15,0,0,0,27,2,"F","Nível 2","Nível 2","1.15.",null,null,"FORROS","-",null,1,"-",null,null,null,null,""]
["S",{"$f":"IF(OR(C355=\"s\",C355=0),OFFSET(B355,-1,0),C355)","v":2},{"$f":"IF(OFFSET(C355,-1,0)=\"L\",1,IF(OFFSET(C355,-1,0)=1,2,IF(OR(A355=\"s\",A355=0),\"S\",IF(AND(OFFSET(C355,-1,0)=2,A355=4),3,IF(AND(OR(OFFSET(C355,-1,0)=\"s\",OFFSET(C355,-1,0)=0),A355<>\"s\",A355>OFFSET(B355,-1,0)),OFFSET(B355,-1,0),A355)))))","v":"S"},{"$f":"IF(OR(C355=\"S\",C355=0),0,IF(ISERROR(K355),J355,SMALL(J355:K355,1)))","v":0},1,15,0,0,0,0,0,"F","Serviço","Serviço","1.15.0.1.","SINAPI",96116,"FORRO EM RÉGUAS DE PVC, FRISADO, PARA AMBIENTES COMERCIAIS, INCLUSIVE ESTRUTURA DE FIXAÇÃO. AF_05/2017_P","M2",204.09,1,204.09,null,null,null,null,"Referência: AGETOP - 210460"]
[2,2,2,7,1,16,0,0,0,25,7,"F","Nível 2","Nível 2","1.16.",null,null,"REVESTIMENTO DE PISO","-",null,1,"-",null,null,null,null,""]
["S",2,"S",0,1,16,0,0,0,0,0,"F","Serviço","Serviço","1.16.0.1.","SINAPI",84191,"PISO EM GRANILITE, MARMORITE OU GRANITINA ESPESSURA 8 MM, INCLUSO JUNTAS DE DILATACAO PLASTICAS","M2",1588.0428999999999,1,1588.0428999999999,null,null,null,null,"Referência: AGETOP - 221101"]
["S",2,"S",0,1,16,0,0,0,0,0,"F","Serviço","Serviço","1.16.0.2.","AGETOP",221104,"RASPAGEM E APLICAÇÃO RESINA ACRÍLICA DUAS DEMÃOS","m2    ",1588.0428999999999,1,1588.0428999999999,null,null,null,null,""]
["S",2,"S",0,1,16,0,0,0,0,0,"F","Serviço","Serviço","1.16.0.3.","SINAPI",87251,"REVESTIMENTO CERÂMICO PARA PISO COM PLACAS TIPO ESMALTADA EXTRA DE DIMENSÕES 45X45 CM APLICADA EM AMBIENTES DE ÁREA MAIOR QUE 10 M2. AF_06/2014","M2",75.28,1,75.28,null,null,null,null,""]
["S",2,"S",0,1,16,0,0,0,0,0,"F","Serviço","Serviço","1.16.0.4.","AGETOP",220102,"PISO CONCRETO DESEMPENADO ESPESSURA = 5 CM  1:2,5:3,5","m2    ",583.25,1,583.25,null,null,null,null,""]
["S",2,"S",0,1,16,0,0,0,0,0,"F","Serviço","Serviço","1.16.0.5.","AGETOP",220100,"PASSEIO PROTECAO EM CONC.DESEMPEN.5 CM 1:2,5:3,5 ( INCLUSO ESPELHO DE 30CM/ESCAVAÇÃO/REATERRO/APILOAMENTO/ATERRO INTERNO)","m2    ",29.13,1,29.13,null,null,null,null,""]
["S",2,"S",0,1,16,0,0,0,0,0,"F","Serviço","Serviço","1.16.0.6.","AGETOP",221126,"PISO DE LADRILHO HIDRÁULICO COLORIDO MODELO TÁTIL ( ALERTA OU DIRECIONAL) SEM LASTRO","m2    ",52.73,1,52.73,null,null,null,null,""]
[2,2,2,6,1,17,0,0,0,18,6,"F","Nível 2","Nível 2","1.17.",null,null,"ADMINISTRAÇÃO","-",null,1,"-",null,null,null,null,""]
[3,3,3,3,1,17,1,0,0,5,3,"F","Nível 3","Nível 3","1.17.1.",null,null,"MENSALISTAS","-",null,1,"-",null,null,null,null,""]
["S",3,"S",0,1,17,1,0,0,0,0,"F","Serviço","Serviço","1.17.1.1.","SINAPI",90778,"ENGENHEIRO CIVIL DE OBRA PLENO COM ENCARGOS COMPLEMENTARES","H",660,1,660,null,null,null,null,"Referência: AGETOP - 250101"]
["S",3,"S",0,1,17,1,0,0,0,0,"F","Serviço","Serviço","1.17.1.2.","SINAPI",90776,"ENCARREGADO GERAL COM ENCARGOS COMPLEMENTARES","H",132,1,132,null,null,null,null,"Referência: AGETOP - 250103"]
[3,3,3,2,1,17,2,0,0,2,54,"F","Nível 3","Nível 3","1.17.2.",null,null,"LAUDO DE ESTANQUEIDADE","-",null,1,"-",null,null,null,null,""]
["S",3,"S",0,1,17,2,0,0,0,0,"F","Serviço","Serviço","1.17.2.1.","SINAPI",90778,"ENGENHEIRO CIVIL DE OBRA PLENO COM ENCARGOS COMPLEMENTARES","H",16,1,16,null,null,null,null,"Referência: AGETOP - 250101"]
[2,2,2,9,1,18,0,0,0,12,9,"F","Nível 2","Nível 2","1.18.",null,null,"PINTURA","-",null,1,"-",null,null,null,null,""]
["S",2,"S",0,1,18,0,0,0,0,0,"F","Serviço","Serviço","1.18.0.1.","AGETOP",260105,"REMOCAO DE PINTURA ANTIGA A OLEO OU ESMALTE","m2    ",350,1,350,null,null,null,null,""]
["S",2,"S",0,1,18,0,0,0,0,0,"F","Serviço","Serviço","1.18.0.2.","SINAPI",88497,"APLICAÇÃO E LIXAMENTO DE MASSA LÁTEX EM PAREDES, DUAS DEMÃOS. AF_06/2014","M2",350,1,350,null,null,null,null,"Referência: AGETOP - 261300"]
[{"$f":"CHOOSE(1+LOG(1+2*(ORÇAMENTO.Nivel=\"Nível 1\")+4*(ORÇAMENTO.Nivel=\"Nível 2\")+8*(ORÇAMENTO.Nivel=\"Nível 3\")+16*(ORÇAMENTO.Nivel=\"Nível 4\")+32*(ORÇAMENTO.Nivel=\"Serviço\"),2),0,1,2,3,4,\"S\")","v":"S"},2,"S",0,1,18,0,0,{"$f":"IF(AND($C372<=4,$C372<>0),0,IF(AND($C372=\"S\",$Y372>0),OFFSET(I372,-1,0)+1,OFFSET(I372,-1,0)))","v":0},0,0,"F","Serviço","Serviço","1.18.0.3.","AGETOP",261550,"PINT.ESMALTE SINT.PAREDES - 2 DEM.C/SELADOR","m2    ",730,1,730,null,null,null,null,""]
["S",{"$f":"IF(OR(C373=\"s\",C373=0),OFFSET(B373,-1,0),C373)","v":2},{"$f":"IF(OFFSET(C373,-1,0)=\"L\",1,IF(OFFSET(C373,-1,0)=1,2,IF(OR(A373=\"s\",A373=0),\"S\",IF(AND(OFFSET(C373,-1,0)=2,A373=4),3,IF(AND(OR(OFFSET(C373,-1,0)=\"s\",OFFSET(C373,-1,0)=0),A373<>\"s\",A373>OFFSET(B373,-1,0)),OFFSET(B373,-1,0),A373)))))","v":"S"},{"$f":"IF(OR(C373=\"S\",C373=0),0,IF(ISERROR(K373),J373,SMALL(J373:K373,1)))","v":0},{"$f":"IF($C373=1,OFFSET(E373,-1,0)+1,OFFSET(E373,-1,0))","v":1},{"$f":"IF($C373=1,0,IF($C373=2,OFFSET(F373,-1,0)+1,OFFSET(F373,-1,0)))","v":18},{"$f":"IF(AND($C373<=2,$C373<>0),0,IF($C373=3,OFFSET(G373,-1,0)+1,OFFSET(G373,-1,0)))","v":0},{"$f":"IF(AND($C373<=3,$C373<>0),0,IF($C373=4,OFFSET(H373,-1,0)+1,OFFSET(H373,-1,0)))","v":0},0,0,0,"F","Serviço","Serviço","1.18.0.4.","SINAPI",88423,"APLICAÇÃO MANUAL DE PINTURA COM TINTA TEXTURIZADA ACRÍLICA EM PAREDES EXTERNAS DE CASAS, UMA COR. AF_06/2014","M2",467.61,1,467.61,null,null,null,null,"Referência: AGETOP - 260601"]
["S",2,"S",0,1,18,0,0,0,0,0,"F","Serviço","Serviço","1.18.0.5.","SINAPI",88489,"APLICAÇÃO MANUAL DE PINTURA COM TINTA LÁTEX ACRÍLICA EM PAREDES, DUAS DEMÃOS. AF_06/2014","M2",1878.05,1,1878.05,null,null,null,null,"Referência: AGETOP - 261001"]
["S",2,"S",0,1,18,0,0,0,0,0,"F","Serviço","Serviço","1.18.0.6.","SINAPI","74145/1","PINTURA ESMALTE FOSCO, DUAS DEMAOS, SOBRE SUPERFICIE METALICA, INCLUSO UMA DEMAO DE FUNDO ANTICORROSIVO. UTILIZACAO DE REVOLVER ( AR-COMPRIMIDO).","M2",70.16,1,70.16,null,null,null,null,"Referência: AGETOP - 261602"]
["S",2,"S",0,1,18,0,0,0,0,0,"F","Serviço","Serviço","1.18.0.7.","SINAPI","73924/3","PINTURA ESMALTE FOSCO, DUAS DEMAOS, SOBRE SUPERFICIE METALICA","M2",294,1,294,null,null,null,null,"Referência: AGETOP - 261503"]
["S",2,"S",0,1,18,0,0,0,0,0,"F","Serviço","Serviço","1.18.0.8.","AGETOP",261620,"LETREIRO MÉDIO A GRANDE PORTE EM PAREDE FEITO A PINCEL","m2    ",7.2,1,7.2,null,null,null,null,""]
[2,2,2,3,1,19,0,0,0,{"$f":"IF(OR($C378=\"S\",$C378=0),0,MATCH(0,OFFSET($D378,1,$C378,ROW($C$501)-ROW($C378)),0))","v":3},{"$f":"IF(OR($C378=\"S\",$C378=0),0,MATCH(OFFSET($D378,0,$C378)+1,OFFSET($D378,1,$C378,ROW($C$501)-ROW($C378)),0))","v":{"$error":"#N/A"}},"F","Nível 2","Nível 2","1.19.",null,null,"DIVERSOS","-",null,1,"-",null,null,null,null,""]
["S",2,"S",0,1,19,0,0,0,0,0,"F","Serviço","Serviço","1.19.0.1.","AGETOP",271417,"CANALETA CONCRETO DESEMPENADO 5 CM PD.AGETOP","m     ",55.89,1,55.89,null,null,null,null,""]
["S",2,"S",0,1,19,0,0,0,0,0,"F","Serviço","Serviço","1.19.0.2.","AGETOP",271608,"BANCADA DE GRANITO C/ESPELHO","m2    ",5.2,1,5.2,null,null,null,null,""]
[1,1,1,120,2,0,0,0,0,120,{"$error":"#N/A"},"F","Nível 1","Nível 1","2.","SINAPI",null,"BLOCO 3 SALAS PADRÃO SEDUC 2017 - LAJE","UN",2,2,2,null,null,null,null,""]
[2,2,2,2,2,1,0,0,0,119,2,"F","Nível 2","Nível 2","2.1.","SINAPI",null,"SERVIÇOS PRELIMINARES","-",null,2,"-",null,null,null,null,""]
["S",2,"S",0,2,1,0,0,0,0,0,"F","Serviço","Serviço","2.1.0.1.","AGETOP",20701,"LOCAÇÃO DA OBRA, EXECUÇÃO DE GABARITO SEM REAPROVEITAMENTO, INCLUSO PINTURA (FACE INTERNA DO RIPÃO 15CM) E PIQUETE COM TESTEMUNHA","m2    ",190.26,2,380.52,null,null,null,null,""]
[2,2,2,3,2,2,0,0,0,117,3,"F","Nível 2","Nível 2","2.2.",null,null,"TRANSPORTES","-",null,2,"-",null,null,null,null,""]
["S",2,"S",0,2,2,0,0,0,0,0,"F","Serviço","Serviço","2.2.0.1.","SINAPI",72897,"CARGA MANUAL DE ENTULHO EM CAMINHAO BASCULANTE 6 M3","M3",12,2,24,null,null,null,null,""]
["S",2,"S",0,2,2,0,0,0,0,0,"F","Serviço","Serviço","2.2.0.2.","SINAPI",72900,"TRANSPORTE DE ENTULHO COM CAMINHAO BASCULANTE 6 M3, RODOVIA PAVIMENTADA, DMT 0,5 A 1,0 KM","M3",12,2,24,null,null,null,null,""]
[2,2,2,8,2,3,0,0,0,114,8,"F","Nível 2","Nível 2","2.3.",null,null,"SERVIÇO EM TERRA","-",null,2,"-",null,null,null,null,""]
["S",2,"S",0,2,3,0,0,0,0,0,"F","Serviço","Serviço","2.3.0.1.","SINAPI",93358,"ESCAVAÇÃO MANUAL DE VALA COM PROFUNDIDADE MENOR OU IGUAL A 1,30 M. AF_03/2016","M3",9.35,2,18.7,null,null,null,null,"Referência: AGETOP - 40101"]
["S",2,"S",0,2,3,0,0,0,0,0,"F","Serviço","Serviço","2.3.0.2.","SINAPI",96995,"REATERRO MANUAL APILOADO COM SOQUETE. AF_10/2017","M3",5.42,2,10.84,null,null,null,null,"Referência: AGETOP - 40902"]
["S",2,"S",0,2,3,0,0,0,0,0,"F","Serviço","Serviço","2.3.0.3.","SINAPI",79480,"ESCAVACAO MECANICA CAMPO ABERTO EM SOLO EXCETO ROCHA ATE 2,00M PROFUNDIDADE","M3",40,2,80,null,null,null,null,"Referência: AGETOP - 41004"]
["S",2,"S",0,2,3,0,0,0,0,0,"F","Serviço","Serviço","2.3.0.4.","SINAPI",72898,"CARGA E DESCARGA MECANIZADAS DE ENTULHO EM CAMINHAO BASCULANTE 6 M3","M3",40,2,80,null,null,null,null,"Referência: AGETOP - 41005"]
["S",2,"S",0,2,3,0,0,0,0,0,"F","Serviço","Serviço","2.3.0.5.","AGETOP",41012,"INDENIZAÇÃO DE JAZIDA","m3    ",40,2,80,null,null,null,null,""]
["S",2,"S",0,2,3,0,0,0,0,0,"F","Serviço","Serviço","2.3.0.6.","AGETOP",41006,"TRANSPORTE DE MATERIAL ESCAVADO M3.KM","m3km  ",400,2,800,null,null,null,null,""]
["S",2,"S",0,2,3,0,0,0,0,0,"F","Serviço","Serviço","2.3.0.7.","SINAPI","74005/2","COMPACTACAO MECANICA C/ CONTROLE DO GC>=95% DO PN (AREAS) (C/MONIVELADORA 140 HP E ROLO COMPRESSOR VIBRATORIO 80 HP)","M3",32,2,64,null,null,null,null,"Referência: AGETOP - 41008"]
[2,2,2,11,2,4,0,0,0,106,11,"F","Nível 2","Nível 2","2.4.",null,null,"FUNDAÇÕES E SONDAGENS","-",null,2,"-",null,null,null,null,""]
[3,3,3,10,2,4,1,0,0,10,19,"F","Nível 3","Nível 3","2.4.1.",null,null,"ESTACAS E BLOCOS","-",null,2,"-",null,null,null,null,""]
["S",3,"S",0,2,4,1,0,0,0,0,"F","Serviço","Serviço","2.4.1.1.","SINAPI",98230,"ESTACA BROCA DE CONCRETO, DIÂMETRO DE 30 CM, PROFUNDIDADE DE ATÉ 3 M, ESCAVAÇÃO MANUAL COM TRADO CONCHA, NÃO ARMADA. AF_03/2018","M",103.5,2,207,null,null,null,null,"Referência: AGETOP - 50302"]
["S",3,"S",0,2,4,1,0,0,0,0,"F","Serviço","Serviço","2.4.1.2.","SINAPI",96522,"ESCAVAÇÃO MANUAL PARA BLOCO DE COROAMENTO OU SAPATA, SEM PREVISÃO DE FÔRMA. AF_06/2017","M3",7.19,2,14.38,null,null,null,null,"Referência: AGETOP - 50901"]
["S",3,"S",0,2,4,1,0,0,0,0,"F","Serviço","Serviço","2.4.1.3.","SINAPI",96995,"REATERRO MANUAL APILOADO COM SOQUETE. AF_10/2017","M3",3.29,2,6.58,null,null,null,null,"Referência: AGETOP - 40902"]
["S",3,"S",0,2,4,1,0,0,0,0,"F","Serviço","Serviço","2.4.1.4.","SINAPI",94963,"CONCRETO FCK = 15MPA, TRAÇO 1:3,4:3,5 (CIMENTO/ AREIA MÉDIA/ BRITA 1)  - PREPARO MECÂNICO COM BETONEIRA 400 L. AF_07/2016","M3",3.9000000000000004,2,7.8000000000000007,null,null,null,null,""]
["S",3,"S",0,2,4,1,0,0,0,0,"F","Serviço","Serviço","2.4.1.5.","SINAPI","74157/4","LANCAMENTO/APLICACAO MANUAL DE CONCRETO EM FUNDACOES","M3",3.9000000000000004,2,7.8000000000000007,null,null,null,null,"Referência: AGETOP - 51026"]
["S",3,"S",0,2,4,1,0,0,0,0,"F","Serviço","Serviço","2.4.1.6.","SINAPI",96544,"ARMAÇÃO DE BLOCO, VIGA BALDRAME OU SAPATA UTILIZANDO AÇO CA-50 DE 6,3 MM - MONTAGEM. AF_06/2017","KG",67.27,2,134.54,null,null,null,null,"Referência: AGETOP - 52003"]
["S",3,"S",0,2,4,1,0,0,0,0,"F","Serviço","Serviço","2.4.1.7.","SINAPI",96545,"ARMAÇÃO DE BLOCO, VIGA BALDRAME OU SAPATA UTILIZANDO AÇO CA-50 DE 8 MM - MONTAGEM. AF_06/2017","KG",136.36000000000001,2,272.72000000000003,null,null,null,null,"Referência: AGETOP - 60304"]
["S",3,"S",0,2,4,1,0,0,0,0,"F","Serviço","Serviço","2.4.1.8.","SINAPI",96546,"ARMAÇÃO DE BLOCO, VIGA BALDRAME OU SAPATA UTILIZANDO AÇO CA-50 DE 10 MM - MONTAGEM. AF_06/2017","KG",55.45,2,110.9,null,null,null,null,"Referência: AGETOP - 52005"]
["S",3,"S",0,2,4,1,0,0,0,0,"F","Serviço","Serviço","2.4.1.9.","SINAPI",96543,"ARMAÇÃO DE BLOCO, VIGA BALDRAME E SAPATA UTILIZANDO AÇO CA-60 DE 5 MM - MONTAGEM. AF_06/2017","KG",38.18,2,76.36,null,null,null,null,"Referência: AGETOP - 52014"]
[2,2,2,27,2,5,0,0,0,95,27,"F","Nível 2","Nível 2","2.5.",null,null,"ESTRUTURA","-",null,2,"-",null,null,null,null,""]
[3,3,3,8,2,5,1,0,0,26,8,"F","Nível 3","Nível 3","2.5.1.",null,null,"VIGAS BALDRAMES","-",null,2,"-",null,null,null,null,""]
["S",3,"S",0,2,5,1,0,0,0,0,"F","Serviço","Serviço","2.5.1.1.","SINAPI",96527,"ESCAVAÇÃO MANUAL DE VALA PARA VIGA BALDRAME, COM PREVISÃO DE FÔRMA. AF_06/2017","M3",9.94,2,19.88,null,null,null,null,"Referência: AGETOP - 40101"]
["S",3,"S",0,2,5,1,0,0,0,0,"F","Serviço","Serviço","2.5.1.2.","SINAPI",96995,"REATERRO MANUAL APILOADO COM SOQUETE. AF_10/2017","M3",5.69,2,11.38,null,null,null,null,"Referência: AGETOP - 50903"]
["S",3,"S",0,2,5,1,0,0,0,0,"F","Serviço","Serviço","2.5.1.3.","AGETOP",60191,"FORMA DE TABUA CINTA BALDRAME U=8 VEZES","m2    ",75.67,2,151.34,null,null,null,null,""]
["S",3,"S",0,2,5,1,0,0,0,0,"F","Serviço","Serviço","2.5.1.4.","SINAPI",94963,"CONCRETO FCK = 15MPA, TRAÇO 1:3,4:3,5 (CIMENTO/ AREIA MÉDIA/ BRITA 1)  - PREPARO MECÂNICO COM BETONEIRA 400 L. AF_07/2016","M3",4.25,2,8.5,null,null,null,null,""]
["S",3,"S",0,2,5,1,0,0,0,0,"F","Serviço","Serviço","2.5.1.5.","SINAPI","74157/4","LANCAMENTO/APLICACAO MANUAL DE CONCRETO EM FUNDACOES","M3",4.25,2,8.5,null,null,null,null,"Referência: AGETOP - 51055"]
["S",3,"S",0,2,5,1,0,0,0,0,"F","Serviço","Serviço","2.5.1.6.","SINAPI",96545,"ARMAÇÃO DE BLOCO, VIGA BALDRAME OU SAPATA UTILIZANDO AÇO CA-50 DE 8 MM - MONTAGEM. AF_06/2017","KG",173.64,2,347.28,null,null,null,null,"Referência: AGETOP - 52004"]
["S",3,"S",0,2,5,1,0,0,0,0,"F","Serviço","Serviço","2.5.1.7.","SINAPI",96543,"ARMAÇÃO DE BLOCO, VIGA BALDRAME E SAPATA UTILIZANDO AÇO CA-60 DE 5 MM - MONTAGEM. AF_06/2017","KG",97.27,2,194.54,null,null,null,null,"Referência: AGETOP - 52014"]
[3,3,3,6,2,5,2,0,0,18,6,"F","Nível 3","Nível 3","2.5.2.",null,null,"PILARES","-",null,2,"-",null,null,null,null,""]
["S",3,"S",0,2,5,2,0,0,0,0,"F","Serviço","Serviço","2.5.2.1.","SINAPI",92426,"MONTAGEM E DESMONTAGEM DE FÔRMA DE PILARES RETANGULARES E ESTRUTURAS SIMILARES COM ÁREA MÉDIA DAS SEÇÕES MENOR OU IGUAL A 0,25 M², PÉ-DIREITO SIMPLES, EM CHAPA DE MADEIRA COMPENSADA RESINADA, 8 UTILIZAÇÕES. AF_12/2015","M2",38.19,2,76.38,null,null,null,null,""]
["S",3,"S",0,2,5,2,0,0,0,0,"F","Serviço","Serviço","2.5.2.2.","SINAPI",94964,"CONCRETO FCK = 20MPA, TRAÇO 1:2,7:3 (CIMENTO/ AREIA MÉDIA/ BRITA 1)  - PREPARO MECÂNICO COM BETONEIRA 400 L. AF_07/2016","M3",1.82,2,3.64,null,null,null,null,""]
["S",3,"S",0,2,5,2,0,0,0,0,"F","Serviço","Serviço","2.5.2.3.","SINAPI",92873,"LANÇAMENTO COM USO DE BALDES, ADENSAMENTO E ACABAMENTO DE CONCRETO EM ESTRUTURAS. AF_12/2015","M3",1.82,2,3.64,null,null,null,null,"Referência: AGETOP - 51055"]
["S",3,"S",0,2,5,2,0,0,0,0,"F","Serviço","Serviço","2.5.2.4.","SINAPI",92778,"ARMAÇÃO DE PILAR OU VIGA DE UMA ESTRUTURA CONVENCIONAL DE CONCRETO ARMADO EM UMA EDIFICAÇÃO TÉRREA OU SOBRADO UTILIZANDO AÇO CA-50 DE 10,0 MM - MONTAGEM. AF_12/2015","KG",161.82,2,323.64,null,null,null,null,"Referência: AGETOP - 60305"]
["S",3,"S",0,2,5,2,0,0,0,0,"F","Serviço","Serviço","2.5.2.5.","SINAPI",92775,"ARMAÇÃO DE PILAR OU VIGA DE UMA ESTRUTURA CONVENCIONAL DE CONCRETO ARMADO EM UMA EDIFICAÇÃO TÉRREA OU SOBRADO UTILIZANDO AÇO CA-60 DE 5,0 MM - MONTAGEM. AF_12/2015","KG",55.45,2,110.9,null,null,null,null,"Referência: AGETOP - 60314"]
[3,3,3,8,2,5,3,0,0,12,8,"F","Nível 3","Nível 3","2.5.3.",null,null,"VIGAS DE COBERTURA","-",null,2,"-",null,null,null,null,""]
["S",3,"S",0,2,5,3,0,0,0,0,"F","Serviço","Serviço","2.5.3.1.","SINAPI",92464,"MONTAGEM E DESMONTAGEM DE FÔRMA DE VIGA, ESCORAMENTO METÁLICO, PÉ-DIREITO SIMPLES, EM CHAPA DE MADEIRA RESINADA, 8 UTILIZAÇÕES. AF_12/2015","M2",68.47,2,136.94,null,null,null,null,"Referência: AGETOP - 60204"]
["S",3,"S",0,2,5,3,0,0,0,0,"F","Serviço","Serviço","2.5.3.2.","SINAPI",94964,"CONCRETO FCK = 20MPA, TRAÇO 1:2,7:3 (CIMENTO/ AREIA MÉDIA/ BRITA 1)  - PREPARO MECÂNICO COM BETONEIRA 400 L. AF_07/2016","M3",4.08,2,8.16,null,null,null,null,""]
["S",3,"S",0,2,5,3,0,0,0,0,"F","Serviço","Serviço","2.5.3.3.","SINAPI",92873,"LANÇAMENTO COM USO DE BALDES, ADENSAMENTO E ACABAMENTO DE CONCRETO EM ESTRUTURAS. AF_12/2015","M3",4.08,2,8.16,null,null,null,null,"Referência: AGETOP - 51055"]
["S",3,"S",0,2,5,3,0,0,0,0,"F","Serviço","Serviço","2.5.3.4.","SINAPI",92777,"ARMAÇÃO DE PILAR OU VIGA DE UMA ESTRUTURA CONVENCIONAL DE CONCRETO ARMADO EM UMA EDIFICAÇÃO TÉRREA OU SOBRADO UTILIZANDO AÇO CA-50 DE 8,0 MM - MONTAGEM. AF_12/2015","KG",52.73,2,105.46,null,null,null,null,"Referência: AGETOP - 60304"]
["S",3,"S",0,2,5,3,0,0,0,0,"F","Serviço","Serviço","2.5.3.5.","SINAPI",92778,"ARMAÇÃO DE PILAR OU VIGA DE UMA ESTRUTURA CONVENCIONAL DE CONCRETO ARMADO EM UMA EDIFICAÇÃO TÉRREA OU SOBRADO UTILIZANDO AÇO CA-50 DE 10,0 MM - MONTAGEM. AF_12/2015","KG",159.1,2,318.2,null,null,null,null,"Referência: AGETOP - 60305"]
["S",3,"S",0,2,5,3,0,0,0,0,"F","Serviço","Serviço","2.5.3.6.","SINAPI",92779,"ARMAÇÃO DE PILAR OU VIGA DE UMA ESTRUTURA CONVENCIONAL DE CONCRETO ARMADO EM UMA EDIFICAÇÃO TÉRREA OU SOBRADO UTILIZANDO AÇO CA-50 DE 12,5 MM - MONTAGEM. AF_12/2015","KG",51.82,2,103.64,null,null,null,null,"Referência: AGETOP - 60306"]
["S",3,"S",0,2,5,3,0,0,0,0,"F","Serviço","Serviço","2.5.3.7.","SINAPI",92775,"ARMAÇÃO DE PILAR OU VIGA DE UMA ESTRUTURA CONVENCIONAL DE CONCRETO ARMADO EM UMA EDIFICAÇÃO TÉRREA OU SOBRADO UTILIZANDO AÇO CA-60 DE 5,0 MM - MONTAGEM. AF_12/2015","KG",67.27,2,134.54,null,null,null,null,"Referência: AGETOP - 60314"]
[3,3,3,2,2,5,4,0,0,4,2,"F","Nível 3","Nível 3","2.5.4.","SINAPI",null,"LAJE","-",null,2,"-",null,null,null,null,""]
["S",3,"S",0,2,5,4,0,0,0,0,"F","Serviço","Serviço","2.5.4.1.","SINAPI","74202/1","LAJE PRE-MOLDADA P/FORRO, SOBRECARGA 100KG/M2, VAOS ATE 3,50M/E=8CM, C/LAJOTAS E CAP.C/CONC FCK=20MPA, 3CM, INTER-EIXO 38CM, C/ESCORAMENTO (REAPR.3X) E FERRAGEM NEGATIVA","M2",156.28,2,312.56,null,null,null,null,""]
[3,3,3,2,2,5,5,0,0,2,{"$error":"#N/A"},"F","Nível 3","Nível 3","2.5.5.",null,null,"OUTROS","-",null,2,"-",null,null,null,null,""]
["S",3,"S",0,2,5,5,0,0,0,0,"F","Serviço","Serviço","2.5.5.1.","SINAPI","74022/30","ENSAIO DE RESISTENCIA A COMPRESSAO SIMPLES - CONCRETO","UN",6,2,12,null,null,null,null,"Referência: AGETOP - 50251"]
[2,2,2,25,2,6,0,0,0,68,25,"F","Nível 2","Nível 2","2.6.",null,null,"INSTALAÇÕES ELÉTRICAS","-",null,2,"-",null,null,null,null,""]
["S",2,"S",0,2,6,0,0,0,0,0,"F","Serviço","Serviço","2.6.0.1.","SINAPI",91927,"CABO DE COBRE FLEXÍVEL ISOLADO, 2,5 MM², ANTI-CHAMA 0,6/1,0 KV, PARA CIRCUITOS TERMINAIS - FORNECIMENTO E INSTALAÇÃO. AF_12/2015","M",900,2,1800,null,null,null,null,"Referência: AGETOP - 70563"]
["S",2,"S",0,2,6,0,0,0,0,0,"F","Serviço","Serviço","2.6.0.2.","SINAPI",91928,"CABO DE COBRE FLEXÍVEL ISOLADO, 4 MM², ANTI-CHAMA 450/750 V, PARA CIRCUITOS TERMINAIS - FORNECIMENTO E INSTALAÇÃO. AF_12/2015","M",500,2,1000,null,null,null,null,"Referência: AGETOP - 70564"]
["S",2,"S",0,2,6,0,0,0,0,0,"F","Serviço","Serviço","2.6.0.3.","SINAPI",83446,"CAIXA DE PASSAGEM 30X30X40 COM TAMPA E DRENO BRITA","UN",1,2,2,null,null,null,null,""]
["S",2,"S",0,2,6,0,0,0,0,0,"F","Serviço","Serviço","2.6.0.4.","SINAPI",91936,"CAIXA OCTOGONAL 4\" X 4\", PVC, INSTALADA EM LAJE - FORNECIMENTO E INSTALAÇÃO. AF_12/2015","UN",15,2,30,null,null,null,null,""]
["S",2,"S",0,2,6,0,0,0,0,0,"F","Serviço","Serviço","2.6.0.5.","SINAPI",92867,"CAIXA RETANGULAR 4\" X 2\" ALTA (2,00 M DO PISO), METÁLICA, INSTALADA EM PAREDE - FORNECIMENTO E INSTALAÇÃO. AF_12/2015","UN",6,2,12,null,null,null,null,""]
["S",2,"S",0,2,6,0,0,0,0,0,"F","Serviço","Serviço","2.6.0.6.","SINAPI",92867,"CAIXA RETANGULAR 4\" X 2\" ALTA (2,00 M DO PISO), METÁLICA, INSTALADA EM PAREDE - FORNECIMENTO E INSTALAÇÃO. AF_12/2015","UN",4,2,8,null,null,null,null,""]
["S",2,"S",0,2,6,0,0,0,0,0,"F","Serviço","Serviço","2.6.0.7.","SINAPI",92869,"CAIXA RETANGULAR 4\" X 2\" BAIXA (0,30 M DO PISO), METÁLICA, INSTALADA EM PAREDE - FORNECIMENTO E INSTALAÇÃO. AF_12/2015","UN",9,2,18,null,null,null,null,""]
["S",2,"S",0,2,6,0,0,0,0,0,"F","Serviço","Serviço","2.6.0.8.","SINAPI",91914,"CURVA 90 GRAUS PARA ELETRODUTO, PVC, ROSCÁVEL, DN 25 MM (3/4\"), PARA CIRCUITOS TERMINAIS, INSTALADA EM PAREDE - FORNECIMENTO E INSTALAÇÃO. AF_12/2015","UN",6,2,12,null,null,null,null,""]
["S",2,"S",0,2,6,0,0,0,{"$f":"IF(OR($C442=\"S\",$C442=0),0,MATCH(0,OFFSET($D442,1,$C442,ROW($C$501)-ROW($C442)),0))","v":0},{"$f":"IF(OR($C442=\"S\",$C442=0),0,MATCH(OFFSET($D442,0,$C442)+1,OFFSET($D442,1,$C442,ROW($C$501)-ROW($C442)),0))","v":0},"F","Serviço","Serviço","2.6.0.9.","SINAPI",93655,"DISJUNTOR MONOPOLAR TIPO DIN, CORRENTE NOMINAL DE 20A - FORNECIMENTO E INSTALAÇÃO. AF_04/2016","UN",2,2,4,null,null,null,null,""]
["S",2,"S",0,2,6,0,0,0,0,0,"F","Serviço","Serviço","2.6.0.10.","SINAPI",93656,"DISJUNTOR MONOPOLAR TIPO DIN, CORRENTE NOMINAL DE 25A - FORNECIMENTO E INSTALAÇÃO. AF_04/2016","UN",6,2,12,null,null,null,null,""]
["S",2,"S",0,2,6,0,0,0,0,0,"F","Serviço","Serviço","2.6.0.11.","SINAPI",93671,"DISJUNTOR TRIPOLAR TIPO DIN, CORRENTE NOMINAL DE 32A - FORNECIMENTO E INSTALAÇÃO. AF_04/2016","UN",1,2,2,null,null,null,null,""]
["S",2,"S",0,2,6,0,0,0,0,0,"F","Serviço","Serviço","2.6.0.12.","SINAPI",91871,"ELETRODUTO RÍGIDO ROSCÁVEL, PVC, DN 25 MM (3/4\"), PARA CIRCUITOS TERMINAIS, INSTALADO EM PAREDE - FORNECIMENTO E INSTALAÇÃO. AF_12/2015","M",135,2,270,null,null,null,null,"Referência: AGETOP - 71201"]
["S",2,"S",0,2,6,0,0,0,0,0,"F","Serviço","Serviço","2.6.0.13.","SINAPI",91872,"ELETRODUTO RÍGIDO ROSCÁVEL, PVC, DN 32 MM (1\"), PARA CIRCUITOS TERMINAIS, INSTALADO EM PAREDE - FORNECIMENTO E INSTALAÇÃO. AF_12/2015","M",45,2,90,null,null,null,null,"Referência: AGETOP - 71202"]
["S",2,"S",0,2,6,0,0,0,0,0,"F","Serviço","Serviço","2.6.0.14.","SINAPI",91873,"ELETRODUTO RÍGIDO ROSCÁVEL, PVC, DN 40 MM (1 1/4\"), PARA CIRCUITOS TERMINAIS, INSTALADO EM PAREDE - FORNECIMENTO E INSTALAÇÃO. AF_12/2015","M",9,2,18,null,null,null,null,""]
["S",2,"S",0,2,6,0,0,0,0,0,"F","Serviço","Serviço","2.6.0.15.","SINAPI",91953,"INTERRUPTOR SIMPLES (1 MÓDULO), 10A/250V, INCLUINDO SUPORTE E PLACA - FORNECIMENTO E INSTALAÇÃO. AF_12/2015","UN",4,2,8,null,null,null,null,""]
["S",2,"S",0,2,6,0,0,0,0,0,"F","Serviço","Serviço","2.6.0.16.","SINAPI",97610,"LÂMPADA COMPACTA DE LED 10 W, BASE E27 - FORNECIMENTO E INSTALAÇÃO. AF_11/2017","UN",45,2,90,null,null,null,null,""]
["S",2,"S",0,2,6,0,0,0,0,0,"F","Serviço","Serviço","2.6.0.17.","SINAPI",97591,"LUMINÁRIA TIPO PLAFON REDONDO COM VIDRO FOSCO, DE SOBREPOR, COM 2 LÂMPADAS DE 15 W - FORNECIMENTO E INSTALAÇÃO. AF_11/2017","UN",18,2,36,null,null,null,null,""]
["S",2,"S",0,2,6,0,0,0,0,0,"F","Serviço","Serviço","2.6.0.18.","SINAPI",97593,"LUMINÁRIA TIPO SPOT, DE SOBREPOR, COM 1 LÂMPADA DE 15 W - FORNECIMENTO E INSTALAÇÃO. AF_11/2017","UN",9,2,18,null,null,null,null,""]
["S",2,"S",0,2,6,0,0,0,0,0,"F","Serviço","Serviço","2.6.0.19.","SINAPI",91884,"LUVA PARA ELETRODUTO, PVC, ROSCÁVEL, DN 25 MM (3/4\"), PARA CIRCUITOS TERMINAIS, INSTALADA EM PAREDE - FORNECIMENTO E INSTALAÇÃO. AF_12/2015","UN",45,2,90,null,null,null,null,""]
["S",2,"S",0,2,6,0,0,0,0,0,"F","Serviço","Serviço","2.6.0.20.","SINAPI",91885,"LUVA PARA ELETRODUTO, PVC, ROSCÁVEL, DN 32 MM (1\"), PARA CIRCUITOS TERMINAIS, INSTALADA EM PAREDE - FORNECIMENTO E INSTALAÇÃO. AF_12/2015","UN",15,2,30,null,null,null,null,""]
["S",2,"S",0,2,6,0,0,0,0,0,"F","Serviço","Serviço","2.6.0.21.","SINAPI",91886,"LUVA PARA ELETRODUTO, PVC, ROSCÁVEL, DN 40 MM (1 1/4\"), PARA CIRCUITOS TERMINAIS, INSTALADA EM PAREDE - FORNECIMENTO E INSTALAÇÃO. AF_12/2015","UN",3,2,6,null,null,null,null,""]
["S",2,"S",0,2,6,0,0,0,0,0,"F","Serviço","Serviço","2.6.0.22.","SINAPI",83463,"QUADRO DE DISTRIBUICAO DE ENERGIA EM CHAPA DE ACO GALVANIZADO, PARA 12 DISJUNTORES TERMOMAGNETICOS MONOPOLARES, COM BARRAMENTO TRIFASICO E NEUTRO - FORNECIMENTO E INSTALACAO","UN",1,2,2,null,null,null,null,""]
["S",2,"S",0,2,6,0,0,0,0,0,"F","Serviço","Serviço","2.6.0.23.","SINAPI",91998,"TOMADA BAIXA DE EMBUTIR (1 MÓDULO), 2P+T 10 A, SEM SUPORTE E SEM PLACA - FORNECIMENTO E INSTALAÇÃO. AF_12/2015","UN",9,2,18,null,null,null,null,""]
["S",2,"S",0,2,6,0,0,0,0,0,"F","Serviço","Serviço","2.6.0.24.","SINAPI",91991,"TOMADA ALTA DE EMBUTIR (1 MÓDULO), 2P+T 20 A, SEM SUPORTE E SEM PLACA - FORNECIMENTO E INSTALAÇÃO. AF_12/2015","UN",6,2,12,null,null,null,null,""]
[2,2,2,3,2,7,0,0,0,43,3,"F","Nível 2","Nível 2","2.7.",null,null,"ALVENARIAS E DIVISÓRIAS","-",null,2,"-",null,null,null,null,""]
["S",2,"S",0,2,7,0,0,0,0,0,"F","Serviço","Serviço","2.7.0.1.","SINAPI",87503,"ALVENARIA DE VEDAÇÃO DE BLOCOS CERÂMICOS FURADOS NA HORIZONTAL DE 9X19X19CM (ESPESSURA 9CM) DE PAREDES COM ÁREA LÍQUIDA MAIOR OU IGUAL A 6M² SEM VÃOS E ARGAMASSA DE ASSENTAMENTO COM PREPARO EM BETONEIRA. AF_06/2014","M2",184.73,2,369.46,null,null,null,null,"Referência: AGETOP - 100201"]
["S",2,"S",0,2,7,0,0,0,0,0,"F","Serviço","Serviço","2.7.0.2.","SINAPI",93201,"FIXAÇÃO (ENCUNHAMENTO) DE ALVENARIA DE VEDAÇÃO COM ARGAMASSA APLICADA COM COLHER. AF_03/2016","M",72.900000000000006,2,145.80000000000001,null,null,null,null,""]
[2,2,2,2,2,8,0,0,0,40,2,"F","Nível 2","Nível 2","2.8.",null,null,"IMPERMEABILIZAÇÃO","-",null,2,"-",null,null,null,null,""]
["S",2,"S",0,2,8,0,0,0,0,0,"F","Serviço","Serviço","2.8.0.1.","SINAPI","74106/1","IMPERMEABILIZACAO DE ESTRUTURAS ENTERRADAS, COM TINTA ASFALTICA, DUAS DEMAOS.","M2",72.900000000000006,2,145.80000000000001,null,null,null,null,""]
[2,2,2,2,2,9,0,0,0,38,2,"F","Nível 2","Nível 2","2.9.",null,null,"ESTRUTURAS METÁLICAS","-",null,2,"-",null,null,null,null,""]
["S",2,"S",0,2,9,0,0,0,0,0,"F","Serviço","Serviço","2.9.0.1.","AGETOP",150103,"ESTRUTURA METÁLICA CONVENCIONAL EM AÇO DO TIPO USI SAC-300 COM FUNDO ANTICORROSIVO","Kg    ",3844.01,2,7688.02,null,null,null,null,""]
[2,2,2,4,2,10,0,0,0,36,4,"F","Nível 2","Nível 2","2.10.",null,null,"COBERTURAS","-",null,2,"-",null,null,null,null,""]
["S",2,"S",0,2,10,0,0,0,0,0,"F","Serviço","Serviço","2.10.0.1.","SINAPI",94445,"TELHAMENTO COM TELHA CERÂMICA CAPA-CANAL, TIPO PLAN, COM ATÉ 2 ÁGUAS, INCLUSO TRANSPORTE VERTICAL. AF_06/2016","M2",235.69,2,471.38,null,null,null,null,"Referência: AGETOP - 160401"]
["S",2,"S",0,2,10,0,0,0,0,0,"F","Serviço","Serviço","2.10.0.2.","SINAPI",94221,"CUMEEIRA PARA TELHA CERÂMICA EMBOÇADA COM ARGAMASSA TRAÇO 1:2:9 (CIMENTO, CAL E AREIA) PARA TELHADOS COM ATÉ 2 ÁGUAS, INCLUSO TRANSPORTE VERTICAL. AF_06/2016","M",24.05,2,48.1,null,null,null,null,""]
["S",2,"S",0,2,10,0,0,0,0,0,"F","Serviço","Serviço","2.10.0.3.","SINAPI",94224,"EMBOÇAMENTO COM ARGAMASSA TRAÇO 1:2:9 (CIMENTO, CAL E AREIA). AF_06/2016","M",62.1,2,124.2,null,null,null,null,"Referência: AGETOP - 160403"]
[2,2,2,4,2,11,0,0,0,32,4,"F","Nível 2","Nível 2","2.11.",null,null,"ESQUADRIAS METÁLICAS","-",null,2,"-",null,null,null,null,""]
["S",2,"S",0,2,11,0,0,0,0,0,"F","Serviço","Serviço","2.11.0.1.","SINAPI",94562,"JANELA DE AÇO DE CORRER, 4 FOLHAS, FIXAÇÃO COM ARGAMASSA, SEM VIDROS, PADRONIZADA. AF_07/2016","M2",14.4,2,28.8,null,null,null,null,"Referência: AGETOP - 180401"]
["S",2,"S",0,2,11,0,0,0,0,0,"F","Serviço","Serviço","2.11.0.2.","SINAPI",94559,"JANELA DE AÇO BASCULANTE, FIXAÇÃO COM ARGAMASSA, SEM VIDROS, PADRONIZADA. AF_07/2016","M2",7.2,2,14.4,null,null,null,null,"Referência: AGETOP - 180381"]
["S",2,"S",0,2,11,0,0,0,0,0,"F","Serviço","Serviço","2.11.0.3.","SINAPI","73933/4","PORTA DE FERRO DE ABRIR TIPO BARRA CHATA, COM REQUADRO E GUARNICAO COMPLETA","M2",5.04,2,10.08,null,null,null,null,"Referência: AGETOP - 180490"]
[2,2,2,2,2,12,0,0,0,28,2,"F","Nível 2","Nível 2","2.12.",null,null,"VIDROS","-",null,2,"-",null,null,null,null,""]
["S",2,"S",0,2,12,0,0,0,0,0,"F","Serviço","Serviço","2.12.0.1.","SINAPI",72117,"VIDRO LISO COMUM TRANSPARENTE, ESPESSURA 4MM","M2",21.6,2,43.2,null,null,null,null,"Referência: AGETOP - 190102"]
[2,2,2,4,2,13,0,0,0,26,4,"F","Nível 2","Nível 2","2.13.",null,null,"REVESTIMENTO DE PAREDE","-",null,2,"-",null,null,null,null,""]
["S",2,"S",0,2,13,0,0,0,0,0,"F","Serviço","Serviço","2.13.0.1.","SINAPI",87879,"CHAPISCO APLICADO EM ALVENARIAS E ESTRUTURAS DE CONCRETO INTERNAS, COM COLHER DE PEDREIRO.  ARGAMASSA TRAÇO 1:3 COM PREPARO EM BETONEIRA 400L. AF_06/2014","M2",369.45,2,738.9,null,null,null,null,""]
["S",2,"S",0,2,13,0,0,0,0,0,"F","Serviço","Serviço","2.13.0.2.","SINAPI",87548,"MASSA ÚNICA, PARA RECEBIMENTO DE PINTURA, EM ARGAMASSA TRAÇO 1:2:8, PREPARO MANUAL, APLICADA MANUALMENTE EM FACES INTERNAS DE PAREDES, ESPESSURA DE 10MM, COM EXECUÇÃO DE TALISCAS. AF_06/2014","M2",369.45,2,738.9,null,null,null,null,"Referência: AGETOP - 200500"]
["S",2,"S",0,2,13,0,0,0,0,0,"F","Serviço","Serviço","2.13.0.3.","SINAPI",84088,"PEITORIL EM MARMORE BRANCO, LARGURA DE 15CM, ASSENTADO COM ARGAMASSA TRACO 1:4 (CIMENTO E AREIA MEDIA), PREPARO MANUAL DA ARGAMASSA","M",24,2,48,null,null,null,null,""]
[2,2,2,2,2,14,0,0,0,22,2,"F","Nível 2","Nível 2","2.14.",null,null,"FORROS","-",null,2,"-",null,null,null,null,""]
["S",2,"S",0,2,14,0,0,0,0,0,"F","Serviço","Serviço","2.14.0.1.","SINAPI",87414,"APLICAÇÃO MANUAL DE GESSO DESEMPENADO (SEM TALISCAS) EM TETO DE AMBIENTES DE ÁREA MAIOR QUE 10M², ESPESSURA DE 1,0CM. AF_06/2014","M2",156.28,2,312.56,null,null,null,null,"Referência: AGETOP - 210515"]
[2,2,2,5,2,15,0,0,0,20,5,"F","Nível 2","Nível 2","2.15.",null,null,"REVESTIMENTO DE PISO","-",null,2,"-",null,null,null,null,""]
["S",2,"S",0,2,15,0,0,0,0,0,"F","Serviço","Serviço","2.15.0.1.","SINAPI",95240,"LASTRO DE CONCRETO MAGRO, APLICADO EM PISOS OU RADIERS, ESPESSURA DE 3 CM. AF_07/2016","M2",228.96,2,457.92,null,null,null,null,""]
["S",2,"S",0,2,15,0,0,0,0,0,"F","Serviço","Serviço","2.15.0.2.","SINAPI",94992,"EXECUÇÃO DE PASSEIO (CALÇADA) OU PISO DE CONCRETO COM CONCRETO MOLDADO IN LOCO, FEITO EM OBRA, ACABAMENTO CONVENCIONAL, ESPESSURA 6 CM, ARMADO. AF_07/2016","M2",38.700000000000003,2,77.400000000000006,null,null,null,null,"Referência: AGETOP - 220104"]
["S",2,"S",0,2,15,0,0,0,0,0,"F","Serviço","Serviço","2.15.0.3.","SINAPI",84191,"PISO EM GRANILITE, MARMORITE OU GRANITINA ESPESSURA 8 MM, INCLUSO JUNTAS DE DILATACAO PLASTICAS","M2",187.3,2,374.6,null,null,null,null,"Referência: AGETOP - 221101"]
["S",2,"S",0,2,15,0,0,0,0,0,"F","Serviço","Serviço","2.15.0.4.","AGETOP",221104,"RASPAGEM E APLICAÇÃO RESINA ACRÍLICA DUAS DEMÃOS","m2    ",187.3,2,374.6,null,null,null,null,""]
[2,2,2,2,2,16,0,0,0,15,2,"F","Nível 2","Nível 2","2.16.",null,null,"MARCENARIA","-",null,2,"-",null,null,null,null,""]
["S",2,"S",0,2,16,0,0,0,0,0,"F","Serviço","Serviço","2.16.0.1.","AGETOP",240106,"BATE CARTEIRA ENVERNIZADO E ASSENT. 2,5 X 12 CM","M     ",63.9,2,127.8,null,null,null,null,""]
[2,2,2,10,2,17,0,0,0,13,10,"F","Nível 2","Nível 2","2.17.",null,null,"PINTURA","-",null,2,"-",null,null,null,null,""]
["S",2,"S",0,2,17,0,0,0,0,0,"F","Serviço","Serviço","2.17.0.1.","SINAPI","74145/1","PINTURA ESMALTE FOSCO, DUAS DEMAOS, SOBRE SUPERFICIE METALICA, INCLUSO UMA DEMAO DE FUNDO ANTICORROSIVO. UTILIZACAO DE REVOLVER ( AR-COMPRIMIDO).","M2",235.69,2,471.38,null,null,null,null,"Referência: AGETOP - 261609"]
["S",2,"S",0,2,17,0,0,0,0,0,"F","Serviço","Serviço","2.17.0.2.","SINAPI",88423,"APLICAÇÃO MANUAL DE PINTURA COM TINTA TEXTURIZADA ACRÍLICA EM PAREDES EXTERNAS DE CASAS, UMA COR. AF_06/2014","M2",120.23,2,240.46,null,null,null,null,"Referência: AGETOP - 260601"]
["S",2,"S",0,2,17,0,0,0,0,0,"F","Serviço","Serviço","2.17.0.3.","SINAPI",88489,"APLICAÇÃO MANUAL DE PINTURA COM TINTA LÁTEX ACRÍLICA EM PAREDES, DUAS DEMÃOS. AF_06/2014","M2",124.94999999999996,2,249.89999999999992,null,null,null,null,"Referência: AGETOP - 261001"]
["S",2,"S",0,2,17,0,0,0,0,0,"F","Serviço","Serviço","2.17.0.4.","SINAPI",88497,"APLICAÇÃO E LIXAMENTO DE MASSA LÁTEX EM PAREDES, DUAS DEMÃOS. AF_06/2014","M2",258.88,2,517.76,null,null,null,null,"Referência: AGETOP - 261300"]
["S",2,"S",0,2,17,0,0,0,0,0,"F","Serviço","Serviço","2.17.0.5.","AGETOP",261550,"PINT.ESMALTE SINT.PAREDES - 2 DEM.C/SELADOR","m2    ",133.93,2,267.86,null,null,null,null,""]
["S",2,"S",0,2,17,0,0,0,0,0,"F","Serviço","Serviço","2.17.0.6.","SINAPI",88496,"APLICAÇÃO E LIXAMENTO DE MASSA LÁTEX EM TETO, DUAS DEMÃOS. AF_06/2014","M2",145.53,2,291.06,null,null,null,null,"Referência: AGETOP - 261300"]
["S",2,"S",0,2,17,0,0,0,0,0,"F","Serviço","Serviço","2.17.0.7.","SINAPI",88488,"APLICAÇÃO MANUAL DE PINTURA COM TINTA LÁTEX ACRÍLICA EM TETO, DUAS DEMÃOS. AF_06/2014","M2",145.53,2,291.06,null,null,null,null,"Referência: AGETOP - 261001"]
["S",2,"S",0,2,17,0,0,0,0,0,"F","Serviço","Serviço","2.17.0.8.","SINAPI","74145/1","PINTURA ESMALTE FOSCO, DUAS DEMAOS, SOBRE SUPERFICIE METALICA, INCLUSO UMA DEMAO DE FUNDO ANTICORROSIVO. UTILIZACAO DE REVOLVER ( AR-COMPRIMIDO).","M2",53.28,2,106.56,null,null,null,null,"Referência: AGETOP - 261602"]
["S",2,"S",0,2,17,0,0,0,0,0,"F","Serviço","Serviço","2.17.0.9.","AGETOP",261623,"LETREIRO PEQ.PORTE A PINCEL EM PAREDE E PORTAS","m2    ",0.95,2,1.9,null,null,null,null,""]
[2,2,2,3,2,18,0,0,0,3,{"$error":"#N/A"},"F","Nível 2","Nível 2","2.18.",null,null,"DIVERSOS","-",null,2,"-",null,null,null,null,""]
["S",2,"S",0,2,18,0,0,0,0,0,"F","Serviço","Serviço","2.18.0.1.","AGETOP",271210,"QUADRO DE GIZ EMBOÇO/PINTURA COMPLETO","m2    ",15.12,2,30.24,null,null,null,null,""]
["S",2,"S",0,2,18,0,0,0,0,0,"F","Serviço","Serviço","2.18.0.2.","AGETOP",270501,"LIMPEZA FINAL DE OBRA - (OBRAS CIVIS)","m2    ",190.26,2,380.52,null,null,null,null,""]
[-1,null,-1,null,0,0,0,0,0,null,null,"F"]
[null,null,null,null,null,null,null,null,null,null,null,"F",null,null,null,null,null,"OBS: OS QUANTITATIVOS DE MATERIAIS  DAS INSTALAÇÕES HIDROSSANITÁRIAS, ELÉTRICAS E ESPECIAIS SÃO FORNECIDOS PELOS PROFISSIONAIS RESPONSÁVEIS PELOS RESPECTIVOS PROJETOS.",null,null,null,null,null,"VALOR TOTAL"]
[null,null,null,null,null,null,null,null,null,null,null,"F",null,null,null,null,null,null,null,null,null,null,null,"VALOR BDI (21,36%)"]
[null,null,null,null,null,null,null,null,null,null,null,"F",null,null,null,null,null,null,null,null,null,null,null,"TOTAL ORÇAMENTO"]
[null,null,null,null,null,null,null,null,null,null,null,"F"]
[null,null,null,null,null,null,null,null,null,null,null,"F",null,null,null,null,null,null,null,null,null,null,null,"CUSTO POR M2 ³"]
[null,null,null,null,null,null,null,null,null,null,null,"F",null,null,null,null,null,null,null,null,null,null,null,"MATERIAL S/ BDI"]
[null,null,null,null,null,null,null,null,null,null,null,"F",null,null,null,null,null,null,null,null,null,null,null,"MÃO DE OBRA S/ BDI"]
[null,null,null,null,null,null,null,null,null,null,null,"F"]
[null,null,null,null,null,null,null,null,null,null,null,"F",null,null,null,null,"(1) Conforme previsto pelo DECRETO Nº 7.983, DE 8 DE ABRIL DE 2013, os preços adotados são aqueles constantes dos sistemas de referência indicados. Justifica-se o uso dos preços destas composições de custos unitários devido ao seu valor ser menor à mediana de seus correspondentes na tabela SINAPI;"]
[null,null,null,null,null,null,null,null,null,null,null,"F",null,null,null,null,"(2) Optou-se pelo uso das composições de custos da AGETOP para itens não presentes na SINAPI;"]
[null,null,null,null,null,null,null,null,null,null,null,"F",null,null,null,null,"(3) Para itens da AGETOP, os vidros não estão inclusos nas esquadrias e já foram considerados os custos de contramarco para as esquadrias de alumínio;"]
[null,null,null,null,null,null,null,null,null,null,null,"F",null,null,null,null,"(4) Nos casos em que houver execução de granitina e omissão do item AGETOP 221102, considerou-se que o quantitativo para o rodapé, de altura igual a 7cm, foi incorporado na área de piso;"]
[null,null,null,null,null,null,null,null,null,null,null,"F",null,null,null,null,"(5) O custo unitário aproximado por metro quadrado é calculado dividindo-se o valor total do orçamento pela área total de construção."]
[null,null,null,null,null,null,null,null,null,null,null,"F"]
[null,null,null,null,null,null,null,null,null,null,null,"F"]
[]
[null,null,null,null,null,null,null,null,null,null,null,null,null,null,"SOMATÓRIO DE SERVIÇOS"]
[null,null,null,null,null,null,null,null,null,null,null,null,null,null,"ITEM","DESCRIÇÃO DOS SERVIÇOS",null,null,"PREÇO SEM BDI",null,null,null,null,"PREÇO COM BDI",null,null,"PARTICIPAÇÃO ( % )"]
[null,null,null,null,null,null,null,null,null,null,null,null,null,null,"a.","SERVIÇOS PRELIMINARES",null,null,{"$f":"SUMIF($R$19:$R$501,$P520,$Z$19:$Z$501)","v":0},null,null,null,null,{"$f":"ROUND(S520*(1+BDI.Taxa),2)","v":0},null,null,{"$f":"IFERROR(ROUND($X520*100/$Z$504,2),0)","v":0}]
[null,null,null,null,null,null,null,null,null,null,null,null,null,null,"b.","TRANSPORTES",null,null,0,null,null,null,null,0,null,null,0]
[null,null,null,null,null,null,null,null,null,null,null,null,null,null,"c.","SERVIÇO EM TERRA",null,null,0,null,null,null,null,0,null,null,0]
[null,null,null,null,null,null,null,null,null,null,null,null,null,null,"d.","FUNDAÇÕES E SONDAGENS",null,null,0,null,null,null,null,0,null,null,0]
[null,null,null,null,null,null,null,null,null,null,null,null,null,null,"e.","ESTRUTURA",null,null,0,null,null,null,null,0,null,null,0]
[null,null,null,null,null,null,null,null,null,null,null,null,null,null,"f.","INSTALAÇÕES ELÉTRICAS",null,null,0,null,null,null,null,0,null,null,0]
[null,null,null,null,null,null,null,null,null,null,null,null,null,null,"g.","INSTALAÇÕES HIDROSSANITÁRIAS",null,null,0,null,null,null,null,0,null,null,0]
[null,null,null,null,null,null,null,null,null,null,null,null,null,null,"h","INSTALAÇÕES ESPECIAIS",null,null,0,null,null,null,null,0,null,null,0]
[null,null,null,null,null,null,null,null,null,null,null,null,null,null,"i.","ALVENARIAS E DIVISÓRIAS",null,null,0,null,null,null,null,0,null,null,0]
[null,null,null,null,null,null,null,null,null,null,null,null,null,null,"j.","ALVENARIA AUTO-PORTANTE",null,null,0,null,null,null,null,0,null,null,0]
[null,null,null,null,null,null,null,null,null,null,null,null,null,null,"k.","IMPERMEABILIZAÇÃO",null,null,0,null,null,null,null,0,null,null,0]
[null,null,null,null,null,null,null,null,null,null,null,null,null,null,"l.","ISOLAMENTO TÉRMICO E ACÚSTICO",null,null,0,null,null,null,null,0,null,null,0]
[null,null,null,null,null,null,null,null,null,null,null,null,null,null,"m.","ESTRUTURA DE MADEIRA",null,null,0,null,null,null,null,0,null,null,0]
[null,null,null,null,null,null,null,null,null,null,null,null,null,null,"n.","ESTRUTURAS METÁLICAS",null,null,0,null,null,null,null,0,null,null,0]
[null,null,null,null,null,null,null,null,null,null,null,null,null,null,"o.","COBERTURAS",null,null,0,null,null,null,null,0,null,null,0]
[null,null,null,null,null,null,null,null,null,null,null,null,null,null,"p.","ESQUADRIAS DE MADEIRA",null,null,0,null,null,null,null,0,null,null,0]
[null,null,null,null,null,null,null,null,null,null,null,null,null,null,"q.","ESQUADRIAS METÁLICAS",null,null,0,null,null,null,null,{"$f":"ROUND(S536*(1+BDI.Taxa),2)","v":0},null,null,0]
[null,null,null,null,null,null,null,null,null,null,null,null,null,null,"r.","VIDROS",null,null,0,null,null,null,null,0,null,null,0]
[null,null,null,null,null,null,null,null,null,null,null,null,null,null,"s.","REVESTIMENTO DE PAREDE",null,null,0,null,null,null,null,0,null,null,0]
[null,null,null,null,null,null,null,null,null,null,null,null,null,null,"t.","FORROS",null,null,0,null,null,null,null,0,null,null,0]
[null,null,null,null,null,null,null,null,null,null,null,null,null,null,"u.","REVESTIMENTO DE PISO",null,null,0,null,null,null,null,0,null,null,0]
[null,null,null,null,null,null,null,null,null,null,null,null,null,null,"v.","FERRAGENS",null,null,0,null,null,null,null,0,null,null,0]
[null,null,null,null,null,null,null,null,null,null,null,null,null,null,"w.","MARCENARIA",null,null,0,null,null,null,null,0,null,null,0]
[null,null,null,null,null,null,null,null,null,null,null,null,null,null,"x.","ADMINISTRAÇÃO",null,null,0,null,null,null,null,0,null,null,0]
[null,null,null,null,null,null,null,null,null,null,null,null,null,null,"y.","PINTURA",null,null,0,null,null,null,null,{"$f":"ROUND(S544*(1+BDI.Taxa),2)","v":0},null,null,0]
[null,null,null,null,null,null,null,null,null,null,null,null,null,null,"z.","DIVERSOS",null,null,0,null,null,null,null,{"$f":"IF(S545>0,IF((SUM(X520:Y544)+ROUND(S545*(1+BDI.Taxa),2))<>X547,X547-SUM(X520:Y544),ROUND(S545*(1+BDI.Taxa),2)),0)","v":0},null,null,{"$f":"IF(S545>0,IF((SUM(AA520:AA544)+IFERROR(ROUND($X545*100/$Z$504,2),0))<>AA547,AA547-SUM(AA520:AA544),IFERROR(ROUND($X545*100/$Z$504,2),0)),0)","v":0}]
[null,null,null,null,null,null,null,null,null,null,null,null,null,null,"TOTAL GERAL DO ORÇAMENTO (R$)",null,null,null,{"$f":"SUM(S520:W545)","v":0},null,null,null,null,{"$f":"SUM(X520:Y545)","v":0},null,null,{"$f":"SUM(AA520:AA545)","v":0}]
[null,null,null,null,null,null,null,null,null,null,null,null,null,null,null,null,null,null,{"$f":"$Z$502","v":0},null,null,null,null,{"$f":"$Z$504","v":0},null,null,100]
[null,null,null,null,null,null,null,null,null,null,null,null,null,null,null,null,null,null,"(TOTAL SEM BDI)",null,null,null,null,"(TOTAL COM BDI)",null,null,"(ARRED porcentagem)"]
[null,null,null,null,null,null,null,null,null,null,null,null,null,null,null,null,null,null,{"$f":"IF(AND(S546=S547,S546>0),\"OK\",\"ERRO\")","v":"ERRO"},null,null,null,null,{"$f":"IF(AND(X546=X547,X546>0),\"OK\",\"ERRO\")","v":"ERRO"},null,null,{"$f":"IF(AA546=100,\"OK\",\"ERRO\")","v":"ERRO"}]
[]
[]
[null,null,null,null,null,null,null,null,null,null,null,null,null,null,"RESUMO GERAL DO ORÇAMENTO"]
[null,null,null,null,null,null,null,null,null,null,null,null,null,null,"ITEM","DESCRIÇÃO DOS SERVIÇOS",null,null,"PREÇO SEM BDI",null,null,null,null,"PREÇO COM BDI",null,null,"PARTICIPAÇÃO ( % )"]
[null,null,null,null,null,null,null,null,null,null,null,null,null,null,"1.",{"$f":"IFERROR(VLOOKUP(O554,$O$19:$Y$501,4,FALSE),\"\")","v":"REFORMA"},null,null,{"$f":"IF(P555=\"\",$S$575-SUM(OFFSET($S$553:S553,0,0,COUNTA($S$553:S553),1)),SUMIF($R$19:$R$501,$P554,$Z$19:$Z$501))","v":0},null,null,null,null,{"$f":"IF(P555=\"\",$X$575-SUM(OFFSET($X$553:X553,0,0,COUNTA($X$553:X553),1)),ROUND(S554*(1+BDI.Taxa),2))","v":0},null,null,{"$f":"IF(P555=\"\",$AA$575-SUM(OFFSET($AA$553:AA553,0,0,COUNTA($AA$553:AA553),1)),ROUND(X554*100/ORÇAMENTO.TotalOrçamento,2))","v":{"$error":"#DIV/0!"}}]
[null,null,null,null,null,null,null,null,null,null,null,null,null,null,"2.","BLOCO 3 SALAS PADRÃO SEDUC 2017 - LAJE",null,null,{"$f":"IF(P556=\"\",$S$575-SUM(OFFSET($S$553:S554,0,0,COUNTA($S$553:S554),1)),SUMIF($R$19:$R$501,$P555,$Z$19:$Z$501))","v":0},null,null,null,null,{"$f":"IF(P556=\"\",$X$575-SUM(OFFSET($X$553:X554,0,0,COUNTA($X$553:X554),1)),ROUND(S555*(1+BDI.Taxa),2))","v":0},null,null,{"$f":"IF(P556=\"\",$AA$575-SUM(OFFSET($AA$553:AA554,0,0,COUNTA($AA$553:AA554),1)),ROUND(X555*100/ORÇAMENTO.TotalOrçamento,2))","v":{"$error":"#DIV/0!"}}]
[null,null,null,null,null,null,null,null,null,null,null,null,null,null,"3.","",null,null,{"$f":"IF(P557=\"\",$S$575-SUM(OFFSET($S$553:S555,0,0,COUNTA($S$553:S555),1)),SUMIF($R$19:$R$501,$P556,$Z$19:$Z$501))","v":0},null,null,null,null,{"$f":"IF(P557=\"\",$X$575-SUM(OFFSET($X$553:X555,0,0,COUNTA($X$553:X555),1)),ROUND(S556*(1+BDI.Taxa),2))","v":0},null,null,{"$f":"IF(P557=\"\",$AA$575-SUM(OFFSET($AA$553:AA555,0,0,COUNTA($AA$553:AA555),1)),ROUND(X556*100/ORÇAMENTO.TotalOrçamento,2))","v":{"$error":"#DIV/0!"}}]
[null,null,null,null,null,null,null,null,null,null,null,null,null,null,"4.","",null,null,{"$f":"IF(P558=\"\",$S$575-SUM(OFFSET($S$553:S556,0,0,COUNTA($S$553:S556),1)),SUMIF($R$19:$R$501,$P557,$Z$19:$Z$501))","v":0},null,null,null,null,{"$f":"IF(P558=\"\",$X$575-SUM(OFFSET($X$553:X556,0,0,COUNTA($X$553:X556),1)),ROUND(S557*(1+BDI.Taxa),2))","v":0},null,null,{"$f":"IF(P558=\"\",$AA$575-SUM(OFFSET($AA$553:AA556,0,0,COUNTA($AA$553:AA556),1)),ROUND(X557*100/ORÇAMENTO.TotalOrçamento,2))","v":{"$error":"#DIV/0!"}}]
[null,null,null,null,null,null,null,null,null,null,null,null,null,null,"5.","",null,null,{"$f":"IF(P559=\"\",$S$575-SUM(OFFSET($S$553:S557,0,0,COUNTA($S$553:S557),1)),SUMIF($R$19:$R$501,$P558,$Z$19:$Z$501))","v":0},null,null,null,null,{"$f":"IF(P559=\"\",$X$575-SUM(OFFSET($X$553:X557,0,0,COUNTA($X$553:X557),1)),ROUND(S558*(1+BDI.Taxa),2))","v":0},null,null,{"$f":"IF(P559=\"\",$AA$575-SUM(OFFSET($AA$553:AA557,0,0,COUNTA($AA$553:AA557),1)),ROUND(X558*100/ORÇAMENTO.TotalOrçamento,2))","v":{"$error":"#DIV/0!"}}]
[null,null,null,null,null,null,null,null,null,null,null,null,null,null,"6.","",null,null,{"$f":"IF(P560=\"\",$S$575-SUM(OFFSET($S$553:S558,0,0,COUNTA($S$553:S558),1)),SUMIF($R$19:$R$501,$P559,$Z$19:$Z$501))","v":0},null,null,null,null,{"$f":"IF(P560=\"\",$X$575-SUM(OFFSET($X$553:X558,0,0,COUNTA($X$553:X558),1)),ROUND(S559*(1+BDI.Taxa),2))","v":0},null,null,{"$f":"IF(P560=\"\",$AA$575-SUM(OFFSET($AA$553:AA558,0,0,COUNTA($AA$553:AA558),1)),ROUND(X559*100/ORÇAMENTO.TotalOrçamento,2))","v":{"$error":"#DIV/0!"}}]
[null,null,null,null,null,null,null,null,null,null,null,null,null,null,"7.","",null,null,{"$f":"IF(P561=\"\",$S$575-SUM(OFFSET($S$553:S559,0,0,COUNTA($S$553:S559),1)),SUMIF($R$19:$R$501,$P560,$Z$19:$Z$501))","v":0},null,null,null,null,{"$f":"IF(P561=\"\",$X$575-SUM(OFFSET($X$553:X559,0,0,COUNTA($X$553:X559),1)),ROUND(S560*(1+BDI.Taxa),2))","v":0},null,null,{"$f":"IF(P561=\"\",$AA$575-SUM(OFFSET($AA$553:AA559,0,0,COUNTA($AA$553:AA559),1)),ROUND(X560*100/ORÇAMENTO.TotalOrçamento,2))","v":{"$error":"#DIV/0!"}}]
[null,null,null,null,null,null,null,null,null,null,null,null,null,null,"8.","",null,null,{"$f":"IF(P562=\"\",$S$575-SUM(OFFSET($S$553:S560,0,0,COUNTA($S$553:S560),1)),SUMIF($R$19:$R$501,$P561,$Z$19:$Z$501))","v":0},null,null,null,null,{"$f":"IF(P562=\"\",$X$575-SUM(OFFSET($X$553:X560,0,0,COUNTA($X$553:X560),1)),ROUND(S561*(1+BDI.Taxa),2))","v":0},null,null,{"$f":"IF(P562=\"\",$AA$575-SUM(OFFSET($AA$553:AA560,0,0,COUNTA($AA$553:AA560),1)),ROUND(X561*100/ORÇAMENTO.TotalOrçamento,2))","v":{"$error":"#DIV/0!"}}]
[null,null,null,null,null,null,null,null,null,null,null,null,null,null,"9.","",null,null,{"$f":"IF(P563=\"\",$S$575-SUM(OFFSET($S$553:S561,0,0,COUNTA($S$553:S561),1)),SUMIF($R$19:$R$501,$P562,$Z$19:$Z$501))","v":0},null,null,null,null,{"$f":"IF(P563=\"\",$X$575-SUM(OFFSET($X$553:X561,0,0,COUNTA($X$553:X561),1)),ROUND(S562*(1+BDI.Taxa),2))","v":0},null,null,{"$f":"IF(P563=\"\",$AA$575-SUM(OFFSET($AA$553:AA561,0,0,COUNTA($AA$553:AA561),1)),ROUND(X562*100/ORÇAMENTO.TotalOrçamento,2))","v":{"$error":"#DIV/0!"}}]
[null,null,null,null,null,null,null,null,null,null,null,null,null,null,"10.","",null,null,{"$f":"IF(P564=\"\",$S$575-SUM(OFFSET($S$553:S562,0,0,COUNTA($S$553:S562),1)),SUMIF($R$19:$R$501,$P563,$Z$19:$Z$501))","v":0},null,null,null,null,{"$f":"IF(P564=\"\",$X$575-SUM(OFFSET($X$553:X562,0,0,COUNTA($X$553:X562),1)),ROUND(S563*(1+BDI.Taxa),2))","v":0},null,null,{"$f":"IF(P564=\"\",$AA$575-SUM(OFFSET($AA$553:AA562,0,0,COUNTA($AA$553:AA562),1)),ROUND(X563*100/ORÇAMENTO.TotalOrçamento,2))","v":{"$error":"#DIV/0!"}}]
[null,null,null,null,null,null,null,null,null,null,null,null,null,null,"11.","",null,null,{"$f":"IF(P565=\"\",$S$575-SUM(OFFSET($S$553:S563,0,0,COUNTA($S$553:S563),1)),SUMIF($R$19:$R$501,$P564,$Z$19:$Z$501))","v":0},null,null,null,null,{"$f":"IF(P565=\"\",$X$575-SUM(OFFSET($X$553:X563,0,0,COUNTA($X$553:X563),1)),ROUND(S564*(1+BDI.Taxa),2))","v":0},null,null,{"$f":"IF(P565=\"\",$AA$575-SUM(OFFSET($AA$553:AA563,0,0,COUNTA($AA$553:AA563),1)),ROUND(X564*100/ORÇAMENTO.TotalOrçamento,2))","v":{"$error":"#DIV/0!"}}]
[null,null,null,null,null,null,null,null,null,null,null,null,null,null,"12.","",null,null,{"$f":"IF(P566=\"\",$S$575-SUM(OFFSET($S$553:S564,0,0,COUNTA($S$553:S564),1)),SUMIF($R$19:$R$501,$P565,$Z$19:$Z$501))","v":0},null,null,null,null,{"$f":"IF(P566=\"\",$X$575-SUM(OFFSET($X$553:X564,0,0,COUNTA($X$553:X564),1)),ROUND(S565*(1+BDI.Taxa),2))","v":0},null,null,{"$f":"IF(P566=\"\",$AA$575-SUM(OFFSET($AA$553:AA564,0,0,COUNTA($AA$553:AA564),1)),ROUND(X565*100/ORÇAMENTO.TotalOrçamento,2))","v":{"$error":"#DIV/0!"}}]
[null,null,null,null,null,null,null,null,null,null,null,null,null,null,"13.","",null,null,{"$f":"IF(P567=\"\",$S$575-SUM(OFFSET($S$553:S565,0,0,COUNTA($S$553:S565),1)),SUMIF($R$19:$R$501,$P566,$Z$19:$Z$501))","v":0},null,null,null,null,{"$f":"IF(P567=\"\",$X$575-SUM(OFFSET($X$553:X565,0,0,COUNTA($X$553:X565),1)),ROUND(S566*(1+BDI.Taxa),2))","v":0},null,null,{"$f":"IF(P567=\"\",$AA$575-SUM(OFFSET($AA$553:AA565,0,0,COUNTA($AA$553:AA565),1)),ROUND(X566*100/ORÇAMENTO.TotalOrçamento,2))","v":{"$error":"#DIV/0!"}}]
[null,null,null,null,null,null,null,null,null,null,null,null,null,null,"14.","",null,null,{"$f":"IF(P568=\"\",$S$575-SUM(OFFSET($S$553:S566,0,0,COUNTA($S$553:S566),1)),SUMIF($R$19:$R$501,$P567,$Z$19:$Z$501))","v":0},null,null,null,null,{"$f":"IF(P568=\"\",$X$575-SUM(OFFSET($X$553:X566,0,0,COUNTA($X$553:X566),1)),ROUND(S567*(1+BDI.Taxa),2))","v":0},null,null,{"$f":"IF(P568=\"\",$AA$575-SUM(OFFSET($AA$553:AA566,0,0,COUNTA($AA$553:AA566),1)),ROUND(X567*100/ORÇAMENTO.TotalOrçamento,2))","v":{"$error":"#DIV/0!"}}]
[null,null,null,null,null,null,null,null,null,null,null,null,null,null,"15.","",null,null,{"$f":"IF(P569=\"\",$S$575-SUM(OFFSET($S$553:S567,0,0,COUNTA($S$553:S567),1)),SUMIF($R$19:$R$501,$P568,$Z$19:$Z$501))","v":0},null,null,null,null,{"$f":"IF(P569=\"\",$X$575-SUM(OFFSET($X$553:X567,0,0,COUNTA($X$553:X567),1)),ROUND(S568*(1+BDI.Taxa),2))","v":0},null,null,{"$f":"IF(P569=\"\",$AA$575-SUM(OFFSET($AA$553:AA567,0,0,COUNTA($AA$553:AA567),1)),ROUND(X568*100/ORÇAMENTO.TotalOrçamento,2))","v":{"$error":"#DIV/0!"}}]
[null,null,null,null,null,null,null,null,null,null,null,null,null,null,"16.","",null,null,{"$f":"IF(P570=\"\",$S$575-SUM(OFFSET($S$553:S568,0,0,COUNTA($S$553:S568),1)),SUMIF($R$19:$R$501,$P569,$Z$19:$Z$501))","v":0},null,null,null,null,{"$f":"IF(P570=\"\",$X$575-SUM(OFFSET($X$553:X568,0,0,COUNTA($X$553:X568),1)),ROUND(S569*(1+BDI.Taxa),2))","v":0},null,null,{"$f":"IF(P570=\"\",$AA$575-SUM(OFFSET($AA$553:AA568,0,0,COUNTA($AA$553:AA568),1)),ROUND(X569*100/ORÇAMENTO.TotalOrçamento,2))","v":{"$error":"#DIV/0!"}}]
[null,null,null,null,null,null,null,null,null,null,null,null,null,null,"17.","",null,null,{"$f":"IF(P571=\"\",$S$575-SUM(OFFSET($S$553:S569,0,0,COUNTA($S$553:S569),1)),SUMIF($R$19:$R$501,$P570,$Z$19:$Z$501))","v":0},null,null,null,null,{"$f":"IF(P571=\"\",$X$575-SUM(OFFSET($X$553:X569,0,0,COUNTA($X$553:X569),1)),ROUND(S570*(1+BDI.Taxa),2))","v":0},null,null,{"$f":"IF(P571=\"\",$AA$575-SUM(OFFSET($AA$553:AA569,0,0,COUNTA($AA$553:AA569),1)),ROUND(X570*100/ORÇAMENTO.TotalOrçamento,2))","v":{"$error":"#DIV/0!"}}]
[null,null,null,null,null,null,null,null,null,null,null,null,null,null,"18.","",null,null,{"$f":"IF(P572=\"\",$S$575-SUM(OFFSET($S$553:S570,0,0,COUNTA($S$553:S570),1)),SUMIF($R$19:$R$501,$P571,$Z$19:$Z$501))","v":0},null,null,null,null,{"$f":"IF(P572=\"\",$X$575-SUM(OFFSET($X$553:X570,0,0,COUNTA($X$553:X570),1)),ROUND(S571*(1+BDI.Taxa),2))","v":0},null,null,{"$f":"IF(P572=\"\",$AA$575-SUM(OFFSET($AA$553:AA570,0,0,COUNTA($AA$553:AA570),1)),ROUND(X571*100/ORÇAMENTO.TotalOrçamento,2))","v":{"$error":"#DIV/0!"}}]
[null,null,null,null,null,null,null,null,null,null,null,null,null,null,"19.","",null,null,{"$f":"IF(P573=\"\",$S$575-SUM(OFFSET($S$553:S571,0,0,COUNTA($S$553:S571),1)),SUMIF($R$19:$R$501,$P572,$Z$19:$Z$501))","v":0},null,null,null,null,{"$f":"IF(P573=\"\",$X$575-SUM(OFFSET($X$553:X571,0,0,COUNTA($X$553:X571),1)),ROUND(S572*(1+BDI.Taxa),2))","v":0},null,null,{"$f":"IF(P573=\"\",$AA$575-SUM(OFFSET($AA$553:AA571,0,0,COUNTA($AA$553:AA571),1)),ROUND(X572*100/ORÇAMENTO.TotalOrçamento,2))","v":{"$error":"#DIV/0!"}}]
[null,null,null,null,null,null,null,null,null,null,null,null,null,null,"20.","",null,null,{"$f":"IF(P574=\"\",$S$575-SUM(OFFSET($S$553:S572,0,0,COUNTA($S$553:S572),1)),SUMIF($R$19:$R$501,$P573,$Z$19:$Z$501))","v":0},null,null,null,null,{"$f":"IF(P574=\"\",$X$575-SUM(OFFSET($X$553:X572,0,0,COUNTA($X$553:X572),1)),ROUND(S573*(1+BDI.Taxa),2))","v":0},null,null,{"$f":"IF(P574=\"\",$AA$575-SUM(OFFSET($AA$553:AA572,0,0,COUNTA($AA$553:AA572),1)),ROUND(X573*100/ORÇAMENTO.TotalOrçamento,2))","v":{"$error":"#DIV/0!"}}]
[null,null,null,null,null,null,null,null,null,null,null,null,null,null,"TOTAL GERAL DO ORÇAMENTO (R$)",null,null,null,{"$f":"SUM(S554:W573)","v":0},null,null,null,null,{"$f":"SUM(X554:Y573)","v":0},null,null,{"$f":"SUM(AA554:AA573)","v":{"$error":"#DIV/0!"}}]
[null,null,null,null,null,null,null,null,null,null,null,null,null,null,null,null,null,null,{"$f":"$Z$502","v":0},null,null,null,null,{"$f":"$Z$504","v":0},null,null,100]
[null,null,null,null,null,null,null,null,null,null,null,null,null,null,null,null,null,null,"(TOTAL SEM BDI)",null,null,null,null,"(TOTAL COM BDI)",null,null,"(ARRED porcentagem)"]
[null,null,null,null,null,null,null,null,null,null,null,null,null,null,null,null,null,null,{"$f":"IF(AND(S574=S575,S574>0),\"OK\",\"ERRO\")","v":"ERRO"},null,null,null,null,{"$f":"IF(AND(X574=X575,X574>0),\"OK\",\"ERRO\")","v":"ERRO"},null,null,{"$f":"IF(AND(AA574=100,S554<>0),\"OK\",\"ERRO\")","v":{"$error":"#DIV/0!"}}]

{"sheet":"Resumo ","index":1,"n_rows":39,"n_cols":9,"rows_kept":39,"cut":false,"hidden":false,"merged":[[42,3,42,7],[41,3,41,7],[38,1,38,8],[22,2,22,5],[23,2,23,5],[24,2,24,5],[25,2,25,5],[26,2,26,5],[32,2,32,5],[33,2,33,5],[34,2,34,5],[35,2,35,5],[27,2,27,5],[28,2,28,5],[29,2,29,5],[30,2,30,5],[31,2,31,5],[1,1,1,8],[2,6,2,8],[3,6,3,8],[4,1,4,8],[5,6,5,8],[6,6,6,8],[7,1,7,8],[8,6,8,8],[9,6,9,8],[13,1,13,8],[11,1,11,2],[12,1,12,2],[0,1,0,8],[36,1,36,5],[2,1,2,5],[3,1,3,5],[5,1,5,5],[6,1,6,5],[8,1,8,5],[9,1,9,5],[11,3,11,5],[12,3,12,5],[10,1,10,8],[11,6,11,8],[12,6,12,8],[19,2,19,5],[20,2,20,5],[21,2,21,5],[13,0,14,0],[15,2,15,5],[16,2,16,5],[17,2,17,5],[18,2,18,5],[14,1,14,8]]}
[]
[]
[null,"UNIDADE ESCOLAR",null,null,null,null,"CÓDIGO INEP"]
[null,{"$f":"Orçamento!$O$4","v":"COLÉGIO ESTADUAL PROFESSORA MARIA PEREIRA VASCONCELOS"},null,null,null,null,{"$f":"Orçamento!X4","v":52047318}]
[]
[null,"OBRA",null,null,null,null,"CIDADE"]
[null,{"$f":"Orçamento!$O$7","v":"AMPLIAÇÃO E REFORMA"},null,null,null,null,{"$f":"Orçamento!$X$7","v":"LUZIÂNIA"}]
[]
[null,"ENDEREÇO",null,null,null,null,"CRE"]
[null,{"$f":"Orçamento!$R$10","v":"RUA 92 QD 256 LOTE A SN JARDIM INGA, PQ. ESTRELA DALVA IX, CEP:72853-256"},null,null,null,null,{"$f":"Orçamento!$O$10","v":"LUZIÂNIA"}]
[]
[null,"REFERÊNCIA",null,"DATA",null,null,"ÁREA TOTAL CONSTRUÍDA (M²)"]
[null,{"$f":"CONCATENATE(\"AGETOP E SINAPI - \",Orçamento!$Y$10)","v":"AGETOP E SINAPI - ONERADA"},null,{"$f":"Orçamento!$S$7","v":"2020-08-27"},null,null,{"$f":"Orçamento!$S$13","v":0}]
["FILTRO"]
[null,"RESUMO GERAL DO ORÇAMENTO"]
["↓","ITEM","DESCRIÇÃO DOS SERVIÇOS",null,null,null,"PREÇO SEM BDI","PREÇO COM BDI","PARTICIP. (%)"]
[{"$f":"IF(G17>0,\"F\",\"\")","v":""},"1.",{"$f":"Orçamento!$P554","v":"REFORMA"},null,null,null,{"$f":"IFERROR(Orçamento!S554,\"-\")","v":0},{"$f":"IFERROR(Orçamento!X554,\"\")","v":0},{"$f":"Orçamento!AA554","v":{"$error":"#DIV/0!"}}]
[{"$f":"IF(G18>0,\"F\",\"\")","v":""},"2.",{"$f":"Orçamento!$P555","v":"BLOCO 3 SALAS PADRÃO SEDUC 2017 - LAJE"},null,null,null,{"$f":"IFERROR(Orçamento!S555,\"-\")","v":0},{"$f":"IFERROR(Orçamento!X555,\"\")","v":0},{"$f":"Orçamento!AA555","v":{"$error":"#DIV/0!"}}]
["","3.",{"$f":"Orçamento!$P556","v":""},null,null,null,{"$f":"IFERROR(Orçamento!S556,\"-\")","v":0},{"$f":"IFERROR(Orçamento!X556,\"\")","v":0},{"$f":"Orçamento!AA556","v":{"$error":"#DIV/0!"}}]
["","4.",{"$f":"Orçamento!$P557","v":""},null,null,null,{"$f":"IFERROR(Orçamento!S557,\"-\")","v":0},{"$f":"IFERROR(Orçamento!X557,\"\")","v":0},{"$f":"Orçamento!AA557","v":{"$error":"#DIV/0!"}}]
["","5.",{"$f":"Orçamento!$P558","v":""},null,null,null,{"$f":"IFERROR(Orçamento!S558,\"-\")","v":0},{"$f":"IFERROR(Orçamento!X558,\"\")","v":0},{"$f":"Orçamento!AA558","v":{"$error":"#DIV/0!"}}]
["","6.",{"$f":"Orçamento!$P559","v":""},null,null,null,{"$f":"IFERROR(Orçamento!S559,\"-\")","v":0},{"$f":"IFERROR(Orçamento!X559,\"\")","v":0},{"$f":"Orçamento!AA559","v":{"$error":"#DIV/0!"}}]
["","7.",{"$f":"Orçamento!$P560","v":""},null,null,null,{"$f":"IFERROR(Orçamento!S560,\"-\")","v":0},{"$f":"IFERROR(Orçamento!X560,\"\")","v":0},{"$f":"Orçamento!AA560","v":{"$error":"#DIV/0!"}}]
["","8.",{"$f":"Orçamento!$P561","v":""},null,null,null,{"$f":"IFERROR(Orçamento!S561,\"-\")","v":0},{"$f":"IFERROR(Orçamento!X561,\"\")","v":0},{"$f":"Orçamento!AA561","v":{"$error":"#DIV/0!"}}]
["","9.",{"$f":"Orçamento!$P562","v":""},null,null,null,{"$f":"IFERROR(Orçamento!S562,\"-\")","v":0},{"$f":"IFERROR(Orçamento!X562,\"\")","v":0},{"$f":"Orçamento!AA562","v":{"$error":"#DIV/0!"}}]
["","10.",{"$f":"Orçamento!$P563","v":""},null,null,null,{"$f":"IFERROR(Orçamento!S563,\"-\")","v":0},{"$f":"IFERROR(Orçamento!X563,\"\")","v":0},{"$f":"Orçamento!AA563","v":{"$error":"#DIV/0!"}}]
["","11.",{"$f":"Orçamento!$P564","v":""},null,null,null,{"$f":"IFERROR(Orçamento!S564,\"-\")","v":0},{"$f":"IFERROR(Orçamento!X564,\"\")","v":0},{"$f":"Orçamento!AA564","v":{"$error":"#DIV/0!"}}]
["","12.",{"$f":"Orçamento!$P565","v":""},null,null,null,{"$f":"IFERROR(Orçamento!S565,\"-\")","v":0},{"$f":"IFERROR(Orçamento!X565,\"\")","v":0},{"$f":"Orçamento!AA565","v":{"$error":"#DIV/0!"}}]
["","13.",{"$f":"Orçamento!$P566","v":""},null,null,null,{"$f":"IFERROR(Orçamento!S566,\"-\")","v":0},{"$f":"IFERROR(Orçamento!X566,\"\")","v":0},{"$f":"Orçamento!AA566","v":{"$error":"#DIV/0!"}}]
["","14.",{"$f":"Orçamento!$P567","v":""},null,null,null,{"$f":"IFERROR(Orçamento!S567,\"-\")","v":0},{"$f":"IFERROR(Orçamento!X567,\"\")","v":0},{"$f":"Orçamento!AA567","v":{"$error":"#DIV/0!"}}]
["","15.",{"$f":"Orçamento!$P568","v":""},null,null,null,{"$f":"IFERROR(Orçamento!S568,\"-\")","v":0},{"$f":"IFERROR(Orçamento!X568,\"\")","v":0},{"$f":"Orçamento!AA568","v":{"$error":"#DIV/0!"}}]
["","16.",{"$f":"Orçamento!$P569","v":""},null,null,null,{"$f":"IFERROR(Orçamento!S569,\"-\")","v":0},{"$f":"IFERROR(Orçamento!X569,\"\")","v":0},{"$f":"Orçamento!AA569","v":{"$error":"#DIV/0!"}}]
["","17.",{"$f":"Orçamento!$P570","v":""},null,null,null,{"$f":"IFERROR(Orçamento!S570,\"-\")","v":0},{"$f":"IFERROR(Orçamento!X570,\"\")","v":0},{"$f":"Orçamento!AA570","v":{"$error":"#DIV/0!"}}]
["","18.",{"$f":"Orçamento!$P571","v":""},null,null,null,{"$f":"IFERROR(Orçamento!S571,\"-\")","v":0},{"$f":"IFERROR(Orçamento!X571,\"\")","v":0},{"$f":"Orçamento!AA571","v":{"$error":"#DIV/0!"}}]
["","19.",{"$f":"Orçamento!$P572","v":""},null,null,null,{"$f":"IFERROR(Orçamento!S572,\"-\")","v":0},{"$f":"IFERROR(Orçamento!X572,\"\")","v":0},{"$f":"Orçamento!AA572","v":{"$error":"#DIV/0!"}}]
["","20.",{"$f":"Orçamento!$P573","v":""},null,null,null,{"$f":"IFERROR(Orçamento!S573,\"-\")","v":0},{"$f":"IFERROR(Orçamento!X573,\"\")","v":0},{"$f":"Orçamento!AA573","v":{"$error":"#DIV/0!"}}]
["F","TOTAL GERAL DO ORÇAMENTO (R$)",null,null,null,null,{"$f":"SUM(G17:G36)","v":0},0,{"$f":"SUM(I17:I36)","v":{"$error":"#DIV/0!"}}]
["F"]
["F"]

{"sheet":"Somatório","index":2,"n_rows":45,"n_cols":6,"rows_kept":45,"cut":false,"hidden":false,"merged":[[0,1,0,5],[14,1,14,5],[2,1,2,3],[2,4,2,5],[3,1,3,3],[3,4,3,5],[5,1,5,3],[5,4,5,5],[6,1,6,3],[6,4,6,5],[8,1,8,3],[8,4,8,5],[1,1,1,5],[4,1,4,5],[7,1,7,5],[10,1,10,5],[9,1,9,3],[9,4,9,5],[11,1,11,2],[11,4,11,5],[12,1,12,2],[12,4,12,5],[13,0,14,0],[42,1,42,2],[44,1,44,5],[47,3,47,5],[48,3,48,5],[13,1,13,5]]}
[]
[]
[null,"UNIDADE ESCOLAR",null,null,"CÓDIGO INEP"]
[null,{"$f":"Orçamento!$O$4","v":"COLÉGIO ESTADUAL PROFESSORA MARIA PEREIRA VASCONCELOS"},null,null,{"$f":"Orçamento!X4","v":52047318}]
[]
[null,"OBRA",null,null,"CIDADE"]
[null,{"$f":"Orçamento!$O$7","v":"AMPLIAÇÃO E REFORMA"},null,null,{"$f":"Orçamento!$X$7","v":"LUZIÂNIA"}]
[]
[null,"ENDEREÇO",null,null,"CRE"]
[null,{"$f":"Orçamento!$R$10","v":"RUA 92 QD 256 LOTE A SN JARDIM INGA, PQ. ESTRELA DALVA IX, CEP:72853-256"},null,null,{"$f":"Orçamento!$O$10","v":"LUZIÂNIA"}]
[]
[null,"REFERÊNCIA",null,"DATA","ÁREA TOTAL CONSTRUÍDA (M²)"]
[null,{"$f":"CONCATENATE(\"AGETOP E SINAPI - \",Orçamento!$Y$10)","v":"AGETOP E SINAPI - ONERADA"},null,{"$f":"Orçamento!$S$7","v":"2020-08-27"},{"$f":"Orçamento!$S$13","v":0}]
["FILTRO"]
[null,"SOMATÓRIO DE SERVIÇOS"]
["↓","ITEM","DESCRIÇÃO DOS SERVIÇOS","PREÇO SEM BDI (R$)","PREÇO COM BDI (R$)","PARTIC.  ( % )"]
[{"$f":"IF(D17>0,\"F\",\"\")","v":""},"a.",{"$f":"Orçamento!P520","v":"SERVIÇOS PRELIMINARES"},{"$f":"Orçamento!S520","v":0},{"$f":"Orçamento!X520","v":0},{"$f":"Orçamento!AA520","v":0}]
[{"$f":"IF(D18>0,\"F\",\"\")","v":""},"b.",{"$f":"Orçamento!P521","v":"TRANSPORTES"},{"$f":"Orçamento!S521","v":0},{"$f":"Orçamento!X521","v":0},{"$f":"Orçamento!AA521","v":0}]
["","c.",{"$f":"Orçamento!P522","v":"SERVIÇO EM TERRA"},{"$f":"Orçamento!S522","v":0},{"$f":"Orçamento!X522","v":0},{"$f":"Orçamento!AA522","v":0}]
["","d.",{"$f":"Orçamento!P523","v":"FUNDAÇÕES E SONDAGENS"},{"$f":"Orçamento!S523","v":0},{"$f":"Orçamento!X523","v":0},{"$f":"Orçamento!AA523","v":0}]
["","e.",{"$f":"Orçamento!P524","v":"ESTRUTURA"},{"$f":"Orçamento!S524","v":0},{"$f":"Orçamento!X524","v":0},{"$f":"Orçamento!AA524","v":0}]
["","f.",{"$f":"Orçamento!P525","v":"INSTALAÇÕES ELÉTRICAS"},{"$f":"Orçamento!S525","v":0},{"$f":"Orçamento!X525","v":0},{"$f":"Orçamento!AA525","v":0}]
["","g.",{"$f":"Orçamento!P526","v":"INSTALAÇÕES HIDROSSANITÁRIAS"},{"$f":"Orçamento!S526","v":0},{"$f":"Orçamento!X526","v":0},{"$f":"Orçamento!AA526","v":0}]
["","h",{"$f":"Orçamento!P527","v":"INSTALAÇÕES ESPECIAIS"},{"$f":"Orçamento!S527","v":0},{"$f":"Orçamento!X527","v":0},{"$f":"Orçamento!AA527","v":0}]
["","i.",{"$f":"Orçamento!P528","v":"ALVENARIAS E DIVISÓRIAS"},{"$f":"Orçamento!S528","v":0},{"$f":"Orçamento!X528","v":0},{"$f":"Orçamento!AA528","v":0}]
["","j.",{"$f":"Orçamento!P529","v":"ALVENARIA AUTO-PORTANTE"},{"$f":"Orçamento!S529","v":0},{"$f":"Orçamento!X529","v":0},{"$f":"Orçamento!AA529","v":0}]
["","k.",{"$f":"Orçamento!P530","v":"IMPERMEABILIZAÇÃO"},{"$f":"Orçamento!S530","v":0},{"$f":"Orçamento!X530","v":0},{"$f":"Orçamento!AA530","v":0}]
["","l.",{"$f":"Orçamento!P531","v":"ISOLAMENTO TÉRMICO E ACÚSTICO"},{"$f":"Orçamento!S531","v":0},{"$f":"Orçamento!X531","v":0},{"$f":"Orçamento!AA531","v":0}]
["","m.",{"$f":"Orçamento!P532","v":"ESTRUTURA DE MADEIRA"},{"$f":"Orçamento!S532","v":0},{"$f":"Orçamento!X532","v":0},{"$f":"Orçamento!AA532","v":0}]
["","n.",{"$f":"Orçamento!P533","v":"ESTRUTURAS METÁLICAS"},{"$f":"Orçamento!S533","v":0},{"$f":"Orçamento!X533","v":0},{"$f":"Orçamento!AA533","v":0}]
["","o.",{"$f":"Orçamento!P534","v":"COBERTURAS"},{"$f":"Orçamento!S534","v":0},{"$f":"Orçamento!X534","v":0},{"$f":"Orçamento!AA534","v":0}]
["","p.",{"$f":"Orçamento!P535","v":"ESQUADRIAS DE MADEIRA"},{"$f":"Orçamento!S535","v":0},{"$f":"Orçamento!X535","v":0},{"$f":"Orçamento!AA535","v":0}]
["","q.",{"$f":"Orçamento!P536","v":"ESQUADRIAS METÁLICAS"},{"$f":"Orçamento!S536","v":0},{"$f":"Orçamento!X536","v":0},{"$f":"Orçamento!AA536","v":0}]
["","r.",{"$f":"Orçamento!P537","v":"VIDROS"},{"$f":"Orçamento!S537","v":0},{"$f":"Orçamento!X537","v":0},{"$f":"Orçamento!AA537","v":0}]
["","s.",{"$f":"Orçamento!P538","v":"REVESTIMENTO DE PAREDE"},{"$f":"Orçamento!S538","v":0},{"$f":"Orçamento!X538","v":0},{"$f":"Orçamento!AA538","v":0}]
["","t.",{"$f":"Orçamento!P539","v":"FORROS"},{"$f":"Orçamento!S539","v":0},{"$f":"Orçamento!X539","v":0},{"$f":"Orçamento!AA539","v":0}]
["","u.",{"$f":"Orçamento!P540","v":"REVESTIMENTO DE PISO"},{"$f":"Orçamento!S540","v":0},{"$f":"Orçamento!X540","v":0},{"$f":"Orçamento!AA540","v":0}]
["","v.",{"$f":"Orçamento!P541","v":"FERRAGENS"},{"$f":"Orçamento!S541","v":0},{"$f":"Orçamento!X541","v":0},{"$f":"Orçamento!AA541","v":0}]
["","w.",{"$f":"Orçamento!P542","v":"MARCENARIA"},{"$f":"Orçamento!S542","v":0},{"$f":"Orçamento!X542","v":0},{"$f":"Orçamento!AA542","v":0}]
["","x.",{"$f":"Orçamento!P543","v":"ADMINISTRAÇÃO"},{"$f":"Orçamento!S543","v":0},{"$f":"Orçamento!X543","v":0},{"$f":"Orçamento!AA543","v":0}]
["","y.",{"$f":"Orçamento!P544","v":"PINTURA"},{"$f":"Orçamento!S544","v":0},{"$f":"Orçamento!X544","v":0},{"$f":"Orçamento!AA544","v":0}]
["","z.",{"$f":"Orçamento!P545","v":"DIVERSOS"},{"$f":"Orçamento!S545","v":0},{"$f":"Orçamento!X545","v":0},{"$f":"Orçamento!AA545","v":0}]
["F","TOTAL GERAL DO ORÇAMENTO",null,{"$f":"SUM(D17:D42)","v":0},{"$f":"SUM(E17:E42)","v":0},{"$f":"SUM(F17:F42)","v":0}]
[]
[null,"(*) Para itens da AGETOP, os vidros não estão inclusos nas esquadrias e já foram considerados os custos de contramarco para as esquadrias de alumínio;"]

{"sheet":"Cronog_90_Dias","index":3,"n_rows":99,"n_cols":18,"rows_kept":99,"cut":false,"hidden":false,"merged":[[0,1,0,17],[2,1,2,7],[3,1,3,7],[5,1,5,7],[6,1,6,7],[8,1,8,7],[9,1,9,7],[1,1,1,17],[7,1,7,17],[4,1,4,17],[10,1,10,17],[9,8,9,17],[8,8,8,17],[3,8,3,17],[6,8,6,17],[5,8,5,17],[2,8,2,17],[50,1,52,2],[71,3,73,3],[12,17,13,17],[13,1,13,2],[13,5,13,8],[13,13,13,16],[12,3,13,3],[12,13,12,16],[14,1,16,2],[12,5,12,8],[17,1,19,2],[17,4,19,4],[17,5,17,8],[17,13,17,16],[19,5,19,8],[19,13,19,16],[20,1,22,2],[65,1,67,2],[68,3,70,3],[62,3,64,3],[68,1,70,2],[56,3,58,3],[65,4,67,4],[74,3,76,3],[50,4,52,4],[74,4,76,4],[56,1,58,2],[56,4,58,4],[50,3,52,3],[53,3,55,3],[68,4,70,4],[62,1,64,2],[62,4,64,4],[59,3,61,3],[53,1,55,2],[53,4,55,4],[59,1,61,2],[59,4,61,4],[74,1,76,2],[20,4,22,4],[20,5,20,8],[20,13,20,16],[22,5,22,8],[22,13,22,16],[20,3,22,3],[14,3,16,3],[17,3,19,3],[14,4,16,4],[14,5,14,8],[14,13,14,16],[16,5,16,8],[16,13,16,16],[23,13,23,16],[25,5,25,8],[25,13,25,16],[26,1,28,2],[26,4,28,4],[26,5,26,8],[26,13,26,16],[28,5,28,8],[28,13,28,16],[23,3,25,3],[23,1,25,2],[23,4,25,4],[23,5,23,8],[26,3,28,3],[25,9,25,12],[26,9,26,12],[28,9,28,12],[29,13,29,16],[31,5,31,8],[31,13,31,16],[32,1,34,2],[32,4,34,4],[32,5,32,8],[32,13,32,16],[34,5,34,8],[34,13,34,16],[32,3,34,3],[29,5,29,8],[29,1,31,2],[29,4,31,4],[29,3,31,3],[29,9,29,12],[31,9,31,12],[32,9,32,12],[34,9,34,12],[35,13,35,16],[37,5,37,8],[37,13,37,16],[35,3,37,3],[40,13,40,16],[38,3,40,3],[38,13,38,16],[41,1,43,2],[41,4,43,4],[41,5,41,8],[41,13,41,16],[43,5,43,8],[43,13,43,16],[41,3,43,3],[35,5,35,8],[38,5,38,8],[40,5,40,8],[35,1,37,2],[35,4,37,4],[38,1,40,2],[38,4,40,4],[35,9,35,12],[37,9,37,12],[38,9,38,12],[44,13,44,16],[46,5,46,8],[46,13,46,16],[47,1,49,2],[47,4,49,4],[47,5,47,8],[47,13,47,16],[49,5,49,8],[49,13,49,16],[44,5,44,8],[47,3,49,3],[44,3,46,3],[44,1,46,2],[44,4,46,4],[53,13,53,16],[55,5,55,8],[55,13,55,16],[50,5,50,8],[50,13,50,16],[52,5,52,8],[52,13,52,16],[56,13,56,16],[58,5,58,8],[58,13,58,16],[53,5,53,8],[56,5,56,8],[53,9,53,12],[55,9,55,12],[56,9,56,12],[58,9,58,12],[68,5,68,8],[65,5,65,8],[65,13,65,16],[67,5,67,8],[67,13,67,16],[65,3,67,3],[62,13,62,16],[64,5,64,8],[64,13,64,16],[62,5,62,8],[95,1,95,2],[95,5,95,8],[95,13,95,16],[97,1,97,4],[98,1,98,17],[86,13,86,16],[88,5,88,8],[88,13,88,16],[85,5,85,8],[85,13,85,16],[89,1,91,2],[89,4,91,4],[89,5,89,8],[89,13,89,16],[91,5,91,8],[91,13,91,16],[89,3,91,3],[86,4,88,4],[86,5,86,8],[86,3,88,3],[83,1,85,2],[83,4,85,4],[83,5,83,8],[83,13,83,16],[94,1,94,2],[94,5,94,8],[94,13,94,16],[76,5,76,8],[76,13,76,16],[77,5,77,8],[77,13,77,16],[79,5,79,8],[79,13,79,16],[80,5,80,8],[80,13,80,16],[82,5,82,8],[82,13,82,16],[77,3,79,3],[80,3,82,3],[86,1,88,2],[80,4,82,4],[83,3,85,3],[77,1,79,2],[77,4,79,4],[80,1,82,2],[86,9,86,12],[88,9,88,12],[89,9,89,12],[12,0,13,0],[9,0,11,0],[11,1,11,17],[92,1,92,2],[92,5,92,8],[92,13,92,16],[93,1,93,2],[93,5,93,8],[93,13,93,16],[74,13,74,16],[74,5,74,8],[68,13,68,16],[70,5,70,8],[70,13,70,16],[59,5,59,8],[71,1,73,2],[71,4,73,4],[71,5,71,8],[71,13,71,16],[73,5,73,8],[73,13,73,16],[59,13,59,16],[61,5,61,8],[61,13,61,16],[12,9,12,12],[13,9,13,12],[14,9,14,12],[16,9,16,12],[17,9,17,12],[19,9,19,12],[20,9,20,12],[22,9,22,12],[23,9,23,12],[40,9,40,12],[41,9,41,12],[43,9,43,12],[44,9,44,12],[46,9,46,12],[47,9,47,12],[49,9,49,12],[50,9,50,12],[52,9,52,12],[59,9,59,12],[61,9,61,12],[62,9,62,12],[64,9,64,12],[65,9,65,12],[67,9,67,12],[68,9,68,12],[70,9,70,12],[71,9,71,12],[91,9,91,12],[92,9,92,12],[93,9,93,12],[94,9,94,12],[95,9,95,12],[73,9,73,12],[74,9,74,12],[76,9,76,12],[77,9,77,12],[79,9,79,12],[80,9,80,12],[82,9,82,12],[83,9,83,12],[85,9,85,12]]}
[]
[]
[null,"UNIDADE ESCOLAR",null,null,null,null,null,null,"PRAZO"]
[null,{"$f":"Orçamento!$O$4","v":"COLÉGIO ESTADUAL PROFESSORA MARIA PEREIRA VASCONCELOS"},null,null,null,null,null,null,"90 DIAS CORRIDOS"]
[]
[null,"OBRA",null,null,null,null,null,null,"DATA"]
[null,{"$f":"Orçamento!$O$7","v":"AMPLIAÇÃO E REFORMA"},null,null,null,null,null,null,{"$f":"Orçamento!$S$7","v":"2020-08-27"}]
[]
[null,"LOCAL",null,null,null,null,null,null,"ÁREA TOTAL CONSTRUÍDA (M²)"]
["FILTRO",{"$f":"Orçamento!$X$7","v":"LUZIÂNIA"},null,null,null,null,null,null,{"$f":"Orçamento!$S$13","v":0}]
[]
[null,"CRONOGRAMA - FÍSICO FINANCEIRO"]
["↓","CUSTO TOTAL:",{"$f":"D93","v":0},"VALOR","Dias:",30,null,null,null,60,null,null,null,90,null,null,null,"TOTAL"]
[null,"DESCRIÇÃO DOS SERVIÇOS",null,null,"%","1ª PARCELA",null,null,null,"2ª PARCELA",null,null,null,"3ª PARCELA"]
[{"$f":"IF(D15>0,\"F\",\"\")","v":""},"SERVIÇOS PRELIMINARES",null,{"$f":"Orçamento!X520","v":0},{"$f":"Orçamento!AA520","v":0},{"$f":"ROUND(F17*$D$15,2)","v":0},null,null,null,{"$f":"ROUND(J17*$D$15,2)","v":0},null,null,null,{"$f":"ROUND(N17*$D$15,2)","v":0},null,null,null,{"$f":"SUM(F15:Q15)","v":0}]
[{"$f":"IF(A15=\"F\",A15,\"\")","v":""}]
[{"$f":"IF(A16=\"F\",A16,\"\")","v":""},null,null,null,null,0.6,null,null,null,0.4,null,null,null,{"$f":"1-F17-J17","v":0},null,null,null,{"$f":"IFERROR(E15/100,\"\")","v":0}]
[{"$f":"IF(D18>0,\"F\",\"\")","v":""},"TRANSPORTES",null,{"$f":"Orçamento!X521","v":0},{"$f":"Orçamento!AA521","v":0},{"$f":"ROUND(F20*$D$18,2)","v":0},null,null,null,{"$f":"ROUND(J20*$D$18,2)","v":0},null,null,null,{"$f":"ROUND(N20*$D$18,2)","v":0},null,null,null,{"$f":"SUM(F18:Q18)","v":0}]
[{"$f":"IF(A18=\"F\",A18,\"\")","v":""}]
[{"$f":"IF(A19=\"F\",A19,\"\")","v":""},null,null,null,null,0.42,null,null,null,0.57999999999999996,null,null,null,{"$f":"1-F20-J20","v":0},null,null,null,{"$f":"IFERROR(E18/100,\"\")","v":0}]
[{"$f":"IF(D21>0,\"F\",\"\")","v":""},"SERVIÇO EM TERRA",null,{"$f":"Orçamento!X522","v":0},{"$f":"Orçamento!AA522","v":0},{"$f":"ROUND(F23*$D$21,2)","v":0},null,null,null,{"$f":"ROUND(J23*$D$21,2)","v":0},null,null,null,{"$f":"ROUND(N23*$D$21,2)","v":0},null,null,null,{"$f":"SUM(F21:Q21)","v":0}]
[{"$f":"IF(A21=\"F\",A21,\"\")","v":""}]
[{"$f":"IF(A22=\"F\",A22,\"\")","v":""},null,null,null,null,0.6,null,null,null,0.4,null,null,null,{"$f":"1-F23-J23","v":0},null,null,null,{"$f":"IFERROR(E21/100,\"\")","v":0}]
[{"$f":"IF(D24>0,\"F\",\"\")","v":""},"FUNDAÇÕES E SONDAGENS",null,{"$f":"Orçamento!X523","v":0},{"$f":"Orçamento!AA523","v":0},{"$f":"ROUND(F26*$D$24,2)","v":0},null,null,null,{"$f":"ROUND(J26*$D$24,2)","v":0},null,null,null,{"$f":"ROUND(N26*$D$24,2)","v":0},null,null,null,{"$f":"SUM(F24:Q24)","v":0}]
[{"$f":"IF(A24=\"F\",A24,\"\")","v":""}]
[{"$f":"IF(A25=\"F\",A25,\"\")","v":""},null,null,null,null,0.6,null,null,null,0.4,null,null,null,{"$f":"1-F26-J26","v":0},null,null,null,{"$f":"IFERROR(E24/100,\"\")","v":0}]
[{"$f":"IF(D27>0,\"F\",\"\")","v":""},"ESTRUTURA",null,{"$f":"Orçamento!X524","v":0},{"$f":"Orçamento!AA524","v":0},{"$f":"ROUND(F29*$D$27,2)","v":0},null,null,null,{"$f":"ROUND(J29*$D$27,2)","v":0},null,null,null,{"$f":"ROUND(N29*$D$27,2)","v":0},null,null,null,{"$f":"SUM(F27:Q27)","v":0}]
[{"$f":"IF(A27=\"F\",A27,\"\")","v":""}]
[{"$f":"IF(A28=\"F\",A28,\"\")","v":""},null,null,null,null,0.2,null,null,null,0.7,null,null,null,{"$f":"1-F29-J29","v":0.10000000000000009},null,null,null,{"$f":"IFERROR(E27/100,\"\")","v":0}]
[{"$f":"IF(D30>0,\"F\",\"\")","v":""},"INST.ELET/TELEFÔNICA/CABEAMENTO ESTRUTURADO",null,{"$f":"Orçamento!X525","v":0},{"$f":"Orçamento!AA525","v":0},{"$f":"ROUND(F32*$D$30,2)","v":0},null,null,null,{"$f":"ROUND(J32*$D$30,2)","v":0},null,null,null,{"$f":"ROUND(N32*$D$30,2)","v":0},null,null,null,{"$f":"SUM(F30:Q30)","v":0}]
[{"$f":"IF(A30=\"F\",A30,\"\")","v":""}]
[{"$f":"IF(A31=\"F\",A31,\"\")","v":""},null,null,null,null,0.15,null,null,null,0.75,null,null,null,{"$f":"1-F32-J32","v":9.9999999999999978E-2},null,null,null,{"$f":"IFERROR(E30/100,\"\")","v":0}]
[{"$f":"IF(D33>0,\"F\",\"\")","v":""},"INSTALAÇÕES HIDROSSANITÁRIAS",null,{"$f":"Orçamento!X526","v":0},{"$f":"Orçamento!AA526","v":0},{"$f":"ROUND(F35*$D$33,2)","v":0},null,null,null,{"$f":"ROUND(J35*$D$33,2)","v":0},null,null,null,{"$f":"ROUND(N35*$D$33,2)","v":0},null,null,null,{"$f":"SUM(F33:Q33)","v":0}]
[{"$f":"IF(A33=\"F\",A33,\"\")","v":""}]
[{"$f":"IF(A34=\"F\",A34,\"\")","v":""},null,null,null,null,0.25,null,null,null,0.6,null,null,null,{"$f":"1-F35-J35","v":0.15000000000000002},null,null,null,{"$f":"IFERROR(E33/100,\"\")","v":0}]
[{"$f":"IF(D36>0,\"F\",\"\")","v":""},"INSTALAÇÕES ESPECIAIS",null,{"$f":"Orçamento!X527","v":0},{"$f":"Orçamento!AA527","v":0},{"$f":"ROUND(F38*$D$36,2)","v":0},null,null,null,{"$f":"ROUND(J38*$D$36,2)","v":0},null,null,null,{"$f":"ROUND(N38*$D$36,2)","v":0},null,null,null,{"$f":"SUM(F36:Q36)","v":0}]
[{"$f":"IF(A36=\"F\",A36,\"\")","v":""}]
[{"$f":"IF(A37=\"F\",A37,\"\")","v":""},null,null,null,null,0.3,null,null,null,0.7,null,null,null,{"$f":"1-F38-J38","v":0},null,null,null,{"$f":"IFERROR(E36/100,\"\")","v":0}]
[{"$f":"IF(D39>0,\"F\",\"\")","v":""},"ALVENARIA E DIVISÓRIAS",null,{"$f":"Orçamento!X528","v":0},{"$f":"Orçamento!AA528","v":0},{"$f":"ROUND(F41*$D$39,2)","v":0},null,null,null,{"$f":"ROUND(J41*$D$39,2)","v":0},null,null,null,{"$f":"ROUND(N41*$D$39,2)","v":0},null,null,null,{"$f":"SUM(F39:Q39)","v":0}]
[{"$f":"IF(A39=\"F\",A39,\"\")","v":""}]
[{"$f":"IF(A40=\"F\",A40,\"\")","v":""},null,null,null,null,0.35,null,null,null,0.65,null,null,null,{"$f":"1-F41-J41","v":0},null,null,null,{"$f":"IFERROR(E39/100,\"\")","v":0}]
[{"$f":"IF(D42>0,\"F\",\"\")","v":""},"ALVENARIA AUTO-PORTANTE",null,{"$f":"Orçamento!X529","v":0},{"$f":"Orçamento!AA529","v":0},{"$f":"ROUND(F44*$D$42,2)","v":0},null,null,null,{"$f":"ROUND(J44*$D$42,2)","v":0},null,null,null,{"$f":"ROUND(N44*$D$42,2)","v":0},null,null,null,{"$f":"SUM(F42:Q42)","v":0}]
[{"$f":"IF(A42=\"F\",A42,\"\")","v":""}]
[{"$f":"IF(A43=\"F\",A43,\"\")","v":""},null,null,null,null,0.34,null,null,null,0.66,null,null,null,{"$f":"1-F44-J44","v":0},null,null,null,{"$f":"IFERROR(E42/100,\"\")","v":0}]
[{"$f":"IF(D45>0,\"F\",\"\")","v":""},"IMPERMEABILIZAÇÃO",null,{"$f":"Orçamento!X530","v":0},{"$f":"Orçamento!AA530","v":0},{"$f":"ROUND(F47*$D$45,2)","v":0},null,null,null,{"$f":"ROUND(J47*$D$45,2)","v":0},null,null,null,{"$f":"ROUND(N47*$D$45,2)","v":0},null,null,null,{"$f":"SUM(F45:Q45)","v":0}]
[{"$f":"IF(A45=\"F\",A45,\"\")","v":""}]
[{"$f":"IF(A46=\"F\",A46,\"\")","v":""},null,null,null,null,0.45,null,null,null,0.55000000000000004,null,null,null,{"$f":"1-F47-J47","v":0},null,null,null,{"$f":"IFERROR(E45/100,\"\")","v":0}]
[{"$f":"IF(D48>0,\"F\",\"\")","v":""},"ISOLAMENTO TÉRMICO E ACÚSTICO",null,{"$f":"Orçamento!X531","v":0},{"$f":"Orçamento!AA531","v":0},{"$f":"ROUND(F50*$D$48,2)","v":0},null,null,null,{"$f":"ROUND(J50*$D$48,2)","v":0},null,null,null,{"$f":"ROUND(N50*$D$48,2)","v":0},null,null,null,{"$f":"SUM(F48:Q48)","v":0}]
[{"$f":"IF(A48=\"F\",A48,\"\")","v":""}]
[{"$f":"IF(A49=\"F\",A49,\"\")","v":""},null,null,null,null,0.45,null,null,null,0.55000000000000004,null,null,null,{"$f":"1-F50-J50","v":0},null,null,null,{"$f":"IFERROR(E48/100,\"\")","v":0}]
[{"$f":"IF(D51>0,\"F\",\"\")","v":""},"ESTRUTURA DE MADEIRA",null,{"$f":"Orçamento!X532","v":0},{"$f":"Orçamento!AA532","v":0},{"$f":"ROUND(F53*$D$51,2)","v":0},null,null,null,{"$f":"ROUND(J53*$D$51,2)","v":0},null,null,null,{"$f":"ROUND(N53*$D$51,2)","v":0},null,null,null,{"$f":"SUM(F51:Q51)","v":0}]
[{"$f":"IF(A51=\"F\",A51,\"\")","v":""}]
[{"$f":"IF(A52=\"F\",A52,\"\")","v":""},null,null,null,null,0.15,null,null,null,0.7,null,null,null,{"$f":"1-F53-J53","v":0.15000000000000002},null,null,null,{"$f":"IFERROR(E51/100,\"\")","v":0}]
[{"$f":"IF(D54>0,\"F\",\"\")","v":""},"ESTRUTURA METÁLICA",null,{"$f":"Orçamento!X533","v":0},{"$f":"Orçamento!AA533","v":0},{"$f":"ROUND(F56*$D$54,2)","v":0},null,null,null,{"$f":"ROUND(J56*$D$54,2)","v":0},null,null,null,{"$f":"ROUND(N56*$D$54,2)","v":0},null,null,null,{"$f":"SUM(F54:Q54)","v":0}]
[{"$f":"IF(A54=\"F\",A54,\"\")","v":""}]
[{"$f":"IF(A55=\"F\",A55,\"\")","v":""},null,null,null,null,0.35,null,null,null,0.65,null,null,null,{"$f":"1-F56-J56","v":0},null,null,null,{"$f":"IFERROR(E54/100,\"\")","v":0}]
[{"$f":"IF(D57>0,\"F\",\"\")","v":""},"COBERTURAS",null,{"$f":"Orçamento!X534","v":0},{"$f":"Orçamento!AA534","v":0},{"$f":"ROUND(F59*$D$57,2)","v":0},null,null,null,{"$f":"ROUND(J59*$D$57,2)","v":0},null,null,null,{"$f":"ROUND(N59*$D$57,2)","v":0},null,null,null,{"$f":"SUM(F57:Q57)","v":0}]
[{"$f":"IF(A57=\"F\",A57,\"\")","v":""}]
[{"$f":"IF(A58=\"F\",A58,\"\")","v":""},null,null,null,null,0,null,null,null,0.26,null,null,null,{"$f":"1-F59-J59","v":0.74},null,null,null,{"$f":"IFERROR(E57/100,\"\")","v":0}]
[{"$f":"IF(D60>0,\"F\",\"\")","v":""},"ESQUADRIAS DE MADEIRA",null,{"$f":"Orçamento!X535","v":0},{"$f":"Orçamento!AA535","v":0},{"$f":"ROUND(F62*$D$60,2)","v":0},null,null,null,{"$f":"ROUND(J62*$D$60,2)","v":0},null,null,null,{"$f":"ROUND(N62*$D$60,2)","v":0},null,null,null,{"$f":"SUM(F60:Q60)","v":0}]
[{"$f":"IF(A60=\"F\",A60,\"\")","v":""}]
[{"$f":"IF(A61=\"F\",A61,\"\")","v":""},null,null,null,null,0.3,null,null,null,0.55000000000000004,null,null,null,{"$f":"1-F62-J62","v":0.14999999999999991},null,null,null,{"$f":"IFERROR(E60/100,\"\")","v":0}]
[{"$f":"IF(D63>0,\"F\",\"\")","v":""},"ESQUADRIAS METÁLICAS",null,{"$f":"Orçamento!X536","v":0},{"$f":"Orçamento!AA536","v":0},{"$f":"ROUND(F65*$D$63,2)","v":0},null,null,null,{"$f":"ROUND(J65*$D$63,2)","v":0},null,null,null,{"$f":"ROUND(N65*$D$63,2)","v":0},null,null,null,{"$f":"SUM(F63:Q63)","v":0}]
[{"$f":"IF(A63=\"F\",A63,\"\")","v":""}]
[{"$f":"IF(A64=\"F\",A64,\"\")","v":""},null,null,null,null,0.3,null,null,null,0.55000000000000004,null,null,null,{"$f":"1-F65-J65","v":0.14999999999999991},null,null,null,{"$f":"IFERROR(E63/100,\"\")","v":0}]
[{"$f":"IF(D66>0,\"F\",\"\")","v":""},"VIDROS",null,{"$f":"Orçamento!X537","v":0},{"$f":"Orçamento!AA537","v":0},{"$f":"ROUND(F68*$D$66,2)","v":0},null,null,null,{"$f":"ROUND(J68*$D$66,2)","v":0},null,null,null,{"$f":"ROUND(N68*$D$66,2)","v":0},null,null,null,{"$f":"SUM(F66:Q66)","v":0}]
[{"$f":"IF(A66=\"F\",A66,\"\")","v":""}]
[{"$f":"IF(A67=\"F\",A67,\"\")","v":""},null,null,null,null,0,null,null,null,0,null,null,null,{"$f":"1-F68-J68","v":1},null,null,null,{"$f":"IFERROR(E66/100,\"\")","v":0}]
[{"$f":"IF(D69>0,\"F\",\"\")","v":""},"REVESTIMENTO DE PAREDE",null,{"$f":"Orçamento!X538","v":0},{"$f":"Orçamento!AA538","v":0},{"$f":"ROUND(F71*$D$69,2)","v":0},null,null,null,{"$f":"ROUND(J71*$D$69,2)","v":0},null,null,null,{"$f":"ROUND(N71*$D$69,2)","v":0},null,null,null,{"$f":"SUM(F69:Q69)","v":0}]
[{"$f":"IF(A69=\"F\",A69,\"\")","v":""}]
[{"$f":"IF(A70=\"F\",A70,\"\")","v":""},null,null,null,null,0.25,null,null,null,0.6,null,null,null,{"$f":"1-F71-J71","v":0.15000000000000002},null,null,null,{"$f":"IFERROR(E69/100,\"\")","v":0}]
[{"$f":"IF(D72>0,\"F\",\"\")","v":""},"FORROS",null,{"$f":"Orçamento!X539","v":0},{"$f":"Orçamento!AA539","v":0},{"$f":"ROUND(F74*$D$72,2)","v":0},null,null,null,{"$f":"ROUND(J74*$D$72,2)","v":0},null,null,null,{"$f":"ROUND(N74*$D$72,2)","v":0},null,null,null,{"$f":"SUM(F72:Q72)","v":0}]
[{"$f":"IF(A72=\"F\",A72,\"\")","v":""}]
[{"$f":"IF(A73=\"F\",A73,\"\")","v":""},null,null,null,null,0.24,null,null,null,0.55000000000000004,null,null,null,{"$f":"1-F74-J74","v":0.20999999999999996},null,null,null,{"$f":"IFERROR(E72/100,\"\")","v":0}]
[{"$f":"IF(D75>0,\"F\",\"\")","v":""},"REVESTIMENTO DE PISO",null,{"$f":"Orçamento!X540","v":0},{"$f":"Orçamento!AA540","v":0},{"$f":"ROUND(F77*$D$75,2)","v":0},null,null,null,{"$f":"ROUND(J77*$D$75,2)","v":0},null,null,null,{"$f":"ROUND(N77*$D$75,2)","v":0},null,null,null,{"$f":"SUM(F75:Q75)","v":0}]
[{"$f":"IF(A75=\"F\",A75,\"\")","v":""}]
[{"$f":"IF(A76=\"F\",A76,\"\")","v":""},null,null,null,null,0.3,null,null,null,0.5,null,null,null,{"$f":"1-F77-J77","v":0.19999999999999996},null,null,null,{"$f":"IFERROR(E75/100,\"\")","v":0}]
[{"$f":"IF(D78>0,\"F\",\"\")","v":""},"FERRAGENS",null,{"$f":"Orçamento!X541","v":0},{"$f":"Orçamento!AA541","v":0},{"$f":"ROUND(F80*$D$78,2)","v":0},null,null,null,{"$f":"ROUND(J80*$D$78,2)","v":0},null,null,null,{"$f":"ROUND(N80*$D$78,2)","v":0},null,null,null,{"$f":"SUM(F78:Q78)","v":0}]
[{"$f":"IF(A78=\"F\",A78,\"\")","v":""}]
[{"$f":"IF(A79=\"F\",A79,\"\")","v":""},null,null,null,null,0,null,null,null,0,null,null,null,{"$f":"1-F80-J80","v":1},null,null,null,{"$f":"IFERROR(E78/100,\"\")","v":0}]
[{"$f":"IF(D81>0,\"F\",\"\")","v":""},"MARCENARIA",null,{"$f":"Orçamento!X542","v":0},{"$f":"Orçamento!AA542","v":0},{"$f":"ROUND(F83*$D$81,2)","v":0},null,null,null,{"$f":"ROUND(J83*$D$81,2)","v":0},null,null,null,{"$f":"ROUND(N83*$D$81,2)","v":0},null,null,null,{"$f":"SUM(F81:Q81)","v":0}]
[{"$f":"IF(A81=\"F\",A81,\"\")","v":""}]
[{"$f":"IF(A82=\"F\",A82,\"\")","v":""},null,null,null,null,0,null,null,null,0.74,null,null,null,{"$f":"1-F83-J83","v":0.26},null,null,null,{"$f":"IFERROR(E81/100,\"\")","v":0}]
[{"$f":"IF(D84>0,\"F\",\"\")","v":""},"ADMINISTRAÇÃO - MENSALISTAS",null,{"$f":"Orçamento!X543","v":0},{"$f":"Orçamento!AA543","v":0},{"$f":"ROUND(F86*$D$84,2)","v":0},null,null,null,{"$f":"ROUND(J86*$D$84,2)","v":0},null,null,null,{"$f":"ROUND(N86*$D$84,2)","v":0},null,null,null,{"$f":"SUM(F84:Q84)","v":0}]
[{"$f":"IF(A84=\"F\",A84,\"\")","v":""}]
[{"$f":"IF(A85=\"F\",A85,\"\")","v":""},null,null,null,null,0.33,null,null,null,0.33,null,null,null,{"$f":"1-F86-J86","v":0.33999999999999991},null,null,null,{"$f":"IFERROR(E84/100,\"\")","v":0}]
[{"$f":"IF(D87>0,\"F\",\"\")","v":""},"PINTURA",null,{"$f":"Orçamento!X544","v":0},{"$f":"Orçamento!AA544","v":0},{"$f":"ROUND(F89*$D$87,2)","v":0},null,null,null,{"$f":"ROUND(J89*$D$87,2)","v":0},null,null,null,{"$f":"ROUND(N89*$D$87,2)","v":0},null,null,null,{"$f":"SUM(F87:Q87)","v":0}]
[{"$f":"IF(A87=\"F\",A87,\"\")","v":""}]
[{"$f":"IF(A88=\"F\",A88,\"\")","v":""},null,null,null,null,0,null,null,null,0.44,null,null,null,{"$f":"1-F89-J89","v":0.56000000000000005},null,null,null,{"$f":"IFERROR(E87/100,\"\")","v":0}]
[{"$f":"IF(D90>0,\"F\",\"\")","v":""},"DIVERSOS",null,{"$f":"Orçamento!X545","v":0},{"$f":"Orçamento!AA545","v":0},{"$f":"ROUND(F92*$D$90,2)","v":0},null,null,null,{"$f":"ROUND(J92*$D$90,2)","v":0},null,null,null,{"$f":"ROUND(N92*$D$90,2)","v":0},null,null,null,{"$f":"SUM(F90:Q90)","v":0}]
[{"$f":"IF(A90=\"F\",A90,\"\")","v":""}]
[{"$f":"IF(A91=\"F\",A91,\"\")","v":""},null,null,null,null,0.26,null,null,null,0.55000000000000004,null,null,null,{"$f":"1-F92-J92","v":0.18999999999999995},null,null,null,{"$f":"IFERROR(E90/100,\"\")","v":0}]
["F","CUSTO DO ORÇAMENTO",null,{"$f":"SUM(D15:D92)","v":0},{"$f":"SUM(E15:E92)","v":0},{"$f":"F15+F18+F21+F24+F27+F30+F33+F36+F39+F42+F45+F48+F51+F54+F57+F60+F63+F66+F69+F72+F75+F78+F81+F84+F87+F90","v":0},null,null,null,{"$f":"J15+J18+J21+J24+J27+J30+J33+J36+J39+J42+J45+J48+J51+J54+J57+J60+J63+J66+J69+J72+J75+J78+J81+J84+J87+J90","v":0},null,null,null,{"$f":"N15+N18+N21+N24+N27+N30+N33+N36+N39+N42+N45+N48+N51+N54+N57+N60+N63+N66+N69+N72+N75+N78+N81+N84+N87+N90","v":0},null,null,null,{"$f":"R15+R18+R21+R24+R27+R30+R33+R36+R39+R42+R45+R48+R51+R54+R57+R60+R63+R66+R69+R72+R75+R78+R81+R84+R87+R90","v":0}]
["F","PERCENTUAIS:",null,null,null,{"$f":"IFERROR(F93/D93,\"\")","v":""},null,null,null,{"$f":"IFERROR(J93/D93,\"\")","v":""},null,null,null,{"$f":"IFERROR(N93/D93,\"\")","v":""},null,null,null,{"$f":"SUM(F94:Q94)","v":0}]
["F","TOTAIS ACUMULADOS:",null,null,null,{"$f":"F93","v":0},null,null,null,{"$f":"F95+J93","v":0},null,null,null,{"$f":"J95+N93","v":0}]
["F","PERCENTUAIS  ACUMULADOS:",null,null,null,{"$f":"F94","v":""},null,null,null,{"$f":"IFERROR(F96+J94,\"\")","v":""},null,null,null,{"$f":"IFERROR(J96+N94,\"\")","v":""}]
["F"]
["F","OBSERVAÇÕES:"]
["F","Os pagamentos somente poderão ser efetuados mediante medição e atesto pelos técnicos da Secretaria da Educação. "]

{"sheet":"Composição BDI","index":4,"n_rows":45,"n_cols":9,"rows_kept":45,"cut":false,"hidden":false,"merged":[[12,0,12,3],[13,0,13,3],[14,0,14,3],[15,0,15,3],[6,0,6,3],[8,0,8,3],[7,0,7,3],[9,0,9,3],[11,0,11,3],[10,0,10,3],[0,0,0,3],[2,0,2,3],[3,0,3,3],[1,0,1,3],[5,0,5,3],[4,0,4,3],[18,5,18,8],[17,0,17,3],[16,0,16,3],[44,0,44,3],[42,0,42,3],[43,0,43,3],[18,0,18,3],[36,0,36,3],[39,0,39,3],[38,0,38,3],[40,0,40,3],[29,0,29,2],[32,0,32,3],[33,0,33,3],[34,0,34,3],[35,0,35,3]]}
[]
[]
["UNIDADE ESCOLAR"]
[{"$f":"Orçamento!$O$4","v":"COLÉGIO ESTADUAL PROFESSORA MARIA PEREIRA VASCONCELOS"}]
[]
["OBRA"]
[{"$f":"Orçamento!$O$7","v":"AMPLIAÇÃO E REFORMA"}]
[]
["ENDEREÇO"]
[{"$f":"Orçamento!$R$10","v":"RUA 92 QD 256 LOTE A SN JARDIM INGA, PQ. ESTRELA DALVA IX, CEP:72853-256"}]
[]
["CIDADE"]
[{"$f":"Orçamento!$X$7","v":"LUZIÂNIA"}]
[]
["CRE"]
[{"$f":"Orçamento!$O$10","v":"LUZIÂNIA"}]
[]
["DETALHAMENTO DA COMPOSIÇÃO DE BDI"]
["COMPOSIÇÃO BDI PARA OBRAS CIVIS",null,null,null,null,"BDI CONSTRUÇÃO E REFORMA"]
["DESCRIÇÃO","COEF.","TAXA % (a.m)","% no preço de venda",null,"Situação","1º Quartil","Médio","3º Quartil"]
["1) COFINS",1,0.03,{"$f":"C21","v":0.03},null,{"$f":"IF(OR(C21<G21,C21>I21),\"FORA DO INTERVALO\",\"OK\")","v":"OK"},0.03,0.03,0.03]
["2) PIS",1,6.4999999999999997E-3,{"$f":"C22","v":6.4999999999999997E-3},null,{"$f":"IF(OR(C22<G22,C22>I22),\"FORA DO INTERVALO\",\"OK\")","v":"OK"},6.4999999999999997E-3,6.4999999999999997E-3,6.4999999999999997E-3]
["3) ISSQN",1,0.03,{"$f":"C23*B23","v":0.03},null,"OK",0.02,3.5000000000000003E-2,0.05]
["4) CPRB",1,0,{"$f":"C24","v":0},null,"FORA DO INTERVALO",4.4999999999999998E-2,4.4999999999999998E-2,4.4999999999999998E-2]
["5) Administração Central",1,0.04,0.04,null,"OK",0.03,0.04,5.5E-2]
["6) Despesas Financeiras",1,5.5999999999999999E-3,5.5999999999999999E-3,null,"FORA DO INTERVALO",5.8999999999999999E-3,1.23E-2,1.3899999999999999E-2]
["7) Seguros + Garantias",1,1.1999999999999999E-3,1.1999999999999999E-3,null,"FORA DO INTERVALO",8.0000000000000002E-3,8.0000000000000002E-3,0.01]
["8) Risco",1,9.7000000000000003E-3,9.7000000000000003E-3,null,"OK",9.7000000000000003E-3,1.2699999999999999E-2,1.2699999999999999E-2]
["9) Lucro",1,7.1999999999999995E-2,7.1999999999999995E-2,null,"OK",6.1600000000000002E-2,7.3999999999999996E-2,8.9599999999999999E-2]
["BDI - FINAL",null,null,{"$f":"(((1+D25+D27+D28)*(1+D26)*(1+D29))/(1-(D21+D22+D23+D24))-1)","v":0.21357639301553344},null,"FORA DO INTERVALO",0.2034,0.22120000000000001,0.25]
[]
["Notas:"]
["(1) e (2) Alíquota definida por lei."]
["(3) Alíquota e base de cálculo definidas pela legislação municipal."]
["(4) Alíquota definida pelas leis 12.546/11, 12844/13 e 13.161/15 (CPRB – contribuição previdenciária sobre a receita bruta)."]
["(5) Valores definidos a partir dos limites no Acórdão nº 2.622/2013 - TCU – Plenário. Valores entre o 1º e 3º quartis."]
["(6) Valor calculado pela expressão matemática do acórdão 2.369/2011 – TCU – Plenário e disponibilizado pela AGETOP em dezembro de 2018. (Foi utilizado para o cálculo a média da Taxa SELIC no período de 11/2017 a 10/2018)"]
[]
["(7) Valores definidos pela AGETOP a partir dos limites no Acórdão nº 2.622/2013 - TCU – Plenário. Valores médios. \n\nObservação da AGETOP: (Seguros contra erros de execução, incêndio e explosão, danos da natureza (vendaval, destelhamento, alagamento, inundação, desmoronamento, geadas etc.), emprego de material defeituoso ou inadequado, roubo e/ou furto qualificado, quebra de equipamentos, desmoronamento de estrutura, nas modalidades de Obras Civis em Construção (OCC); Instalação e Montagem (IM); e Obras Civis em Construção e Instalação e Montagem (OCC/IM). Bem como coberturas adicionais para ampliação dessas coberturas básicas, como: cobertura de responsabilidade civil geral, cobertura de responsabilidade civil cruzada, cobertura de despesas extraordinárias, cobertura de tumultos, cobertura de desentulho do local, cobertura de riscos do fabricante, dentre outras, incluindo o seguro de vida em grupo regido pela convenção coletiva dos trabalhadores na indústria da construção civil). A partir de 24/02/2015 por intermédio da Portaria 449/2015 a Presidência da AGETOP, na pessoa do Senhor Jayme Eduardo Rincon, determinou a exclusão dos valores referentes aos Seguros de Risco de Engenharia e Responsabilidade Civil do Profissional na composição do cálculo do B.D.I.."]
["(8) Valores definidos a partir dos limites no Acórdão nº 2.622/2013 - TCU – Plenário. Valores entre 1º e 3° quartis."]
["(9) Valores definidos a partir dos limites definidos no Acórdão nº 2.622/2013 - TCU – Plenário. Valores adotados e praticados no mercado ( “ ex ante ” ) ou aqueles entre os 1º e 3º quartis."]
[]
["(*) A fórmula para estipulação da taxa de BDI estimado adotado é a mesma que foi aplicada para a obtenção das tabelas contidas no Acórdão n. 2.622/2013 – TCUPlenário"]
[]
["Obs.: Para obras com valores superiores a R$ 20.000.000,00 sugere-se recalcular o BDI, dimensionando as taxas de administração central e lucro para patamares inferiores ao estipulado acima."]

{"sheet":"Relatório CENTRAL","index":5,"n_rows":40,"n_cols":5,"rows_kept":40,"cut":false,"hidden":false,"merged":[[9,0,11,0],[0,1,0,4],[6,3,6,4],[9,3,9,4],[1,1,1,4],[2,1,2,2],[2,3,2,4],[3,1,3,2],[3,3,3,4],[4,1,4,4],[5,1,5,2],[5,3,5,4],[6,1,6,2],[7,1,7,4],[8,1,8,2],[8,3,8,4],[9,1,9,2],[10,1,10,4],[11,1,11,4],[39,1,39,2]]}
[]
[]
[null,"UNIDADE ESCOLAR",null,"CIDADE"]
[null,{"$f":"Orçamento!$O$4","v":"COLÉGIO ESTADUAL PROFESSORA MARIA PEREIRA VASCONCELOS"},null,{"$f":"Orçamento!$X$7","v":"LUZIÂNIA"}]
[]
[null,"OBRA",null,"CRE"]
[null,{"$f":"Orçamento!$O$7","v":"AMPLIAÇÃO E REFORMA"},null,{"$f":"Orçamento!$O$10","v":"LUZIÂNIA"}]
[]
[null,"ENDEREÇO",null,"DATA"]
["FILTRO",{"$f":"Orçamento!$R$10","v":"RUA 92 QD 256 LOTE A SN JARDIM INGA, PQ. ESTRELA DALVA IX, CEP:72853-256"},null,{"$f":"Orçamento!$S$7","v":"2020-08-27"}]
[]
[null,"RELATÓRIO CENTRAL"]
["↓","CÓDIGO","ETAPA","PREÇO  (R$) C/ BDI","PARTIC  ( % )"]
[{"$f":"IF(D14>0,\"F\",\"\")","v":""},{"$f":"Orçamento!O520","v":"a."},{"$f":"Orçamento!P520","v":"SERVIÇOS PRELIMINARES"},{"$f":"Orçamento!X520","v":0},{"$f":"Orçamento!AA520","v":0}]
[{"$f":"IF(D15>0,\"F\",\"\")","v":""},{"$f":"Orçamento!O521","v":"b."},{"$f":"Orçamento!P521","v":"TRANSPORTES"},{"$f":"Orçamento!X521","v":0},{"$f":"Orçamento!AA521","v":0}]
["",{"$f":"Orçamento!O522","v":"c."},{"$f":"Orçamento!P522","v":"SERVIÇO EM TERRA"},{"$f":"Orçamento!X522","v":0},{"$f":"Orçamento!AA522","v":0}]
["",{"$f":"Orçamento!O523","v":"d."},{"$f":"Orçamento!P523","v":"FUNDAÇÕES E SONDAGENS"},{"$f":"Orçamento!X523","v":0},{"$f":"Orçamento!AA523","v":0}]
["",{"$f":"Orçamento!O524","v":"e."},{"$f":"Orçamento!P524","v":"ESTRUTURA"},{"$f":"Orçamento!X524","v":0},{"$f":"Orçamento!AA524","v":0}]
["",{"$f":"Orçamento!O525","v":"f."},{"$f":"Orçamento!P525","v":"INSTALAÇÕES ELÉTRICAS"},{"$f":"Orçamento!X525","v":0},{"$f":"Orçamento!AA525","v":0}]
["",{"$f":"Orçamento!O526","v":"g."},{"$f":"Orçamento!P526","v":"INSTALAÇÕES HIDROSSANITÁRIAS"},{"$f":"Orçamento!X526","v":0},{"$f":"Orçamento!AA526","v":0}]
["",{"$f":"Orçamento!O527","v":"h"},{"$f":"Orçamento!P527","v":"INSTALAÇÕES ESPECIAIS"},{"$f":"Orçamento!X527","v":0},{"$f":"Orçamento!AA527","v":0}]
["",{"$f":"Orçamento!O528","v":"i."},{"$f":"Orçamento!P528","v":"ALVENARIAS E DIVISÓRIAS"},{"$f":"Orçamento!X528","v":0},{"$f":"Orçamento!AA528","v":0}]
["",{"$f":"Orçamento!O529","v":"j."},{"$f":"Orçamento!P529","v":"ALVENARIA AUTO-PORTANTE"},{"$f":"Orçamento!X529","v":0},{"$f":"Orçamento!AA529","v":0}]
["",{"$f":"Orçamento!O530","v":"k."},{"$f":"Orçamento!P530","v":"IMPERMEABILIZAÇÃO"},{"$f":"Orçamento!X530","v":0},{"$f":"Orçamento!AA530","v":0}]
["",{"$f":"Orçamento!O531","v":"l."},{"$f":"Orçamento!P531","v":"ISOLAMENTO TÉRMICO E ACÚSTICO"},{"$f":"Orçamento!X531","v":0},{"$f":"Orçamento!AA531","v":0}]
["",{"$f":"Orçamento!O532","v":"m."},{"$f":"Orçamento!P532","v":"ESTRUTURA DE MADEIRA"},{"$f":"Orçamento!X532","v":0},{"$f":"Orçamento!AA532","v":0}]
["",{"$f":"Orçamento!O533","v":"n."},{"$f":"Orçamento!P533","v":"ESTRUTURAS METÁLICAS"},{"$f":"Orçamento!X533","v":0},{"$f":"Orçamento!AA533","v":0}]
["",{"$f":"Orçamento!O534","v":"o."},{"$f":"Orçamento!P534","v":"COBERTURAS"},{"$f":"Orçamento!X534","v":0},{"$f":"Orçamento!AA534","v":0}]
["",{"$f":"Orçamento!O535","v":"p."},{"$f":"Orçamento!P535","v":"ESQUADRIAS DE MADEIRA"},{"$f":"Orçamento!X535","v":0},{"$f":"Orçamento!AA535","v":0}]
["",{"$f":"Orçamento!O536","v":"q."},{"$f":"Orçamento!P536","v":"ESQUADRIAS METÁLICAS"},{"$f":"Orçamento!X536","v":0},{"$f":"Orçamento!AA536","v":0}]
["",{"$f":"Orçamento!O537","v":"r."},{"$f":"Orçamento!P537","v":"VIDROS"},{"$f":"Orçamento!X537","v":0},{"$f":"Orçamento!AA537","v":0}]
["",{"$f":"Orçamento!O538","v":"s."},{"$f":"Orçamento!P538","v":"REVESTIMENTO DE PAREDE"},{"$f":"Orçamento!X538","v":0},{"$f":"Orçamento!AA538","v":0}]
["",{"$f":"Orçamento!O539","v":"t."},{"$f":"Orçamento!P539","v":"FORROS"},{"$f":"Orçamento!X539","v":0},{"$f":"Orçamento!AA539","v":0}]
["",{"$f":"Orçamento!O540","v":"u."},{"$f":"Orçamento!P540","v":"REVESTIMENTO DE PISO"},{"$f":"Orçamento!X540","v":0},{"$f":"Orçamento!AA540","v":0}]
["",{"$f":"Orçamento!O541","v":"v."},{"$f":"Orçamento!P541","v":"FERRAGENS"},{"$f":"Orçamento!X541","v":0},{"$f":"Orçamento!AA541","v":0}]
["",{"$f":"Orçamento!O542","v":"w."},{"$f":"Orçamento!P542","v":"MARCENARIA"},{"$f":"Orçamento!X542","v":0},{"$f":"Orçamento!AA542","v":0}]
["",{"$f":"Orçamento!O543","v":"x."},{"$f":"Orçamento!P543","v":"ADMINISTRAÇÃO"},{"$f":"Orçamento!X543","v":0},{"$f":"Orçamento!AA543","v":0}]
["",{"$f":"Orçamento!O544","v":"y."},{"$f":"Orçamento!P544","v":"PINTURA"},{"$f":"Orçamento!X544","v":0},{"$f":"Orçamento!AA544","v":0}]
["",{"$f":"Orçamento!O545","v":"z."},{"$f":"Orçamento!P545","v":"DIVERSOS"},{"$f":"Orçamento!X545","v":0},{"$f":"Orçamento!AA545","v":0}]
["F","TOTAL GERAL DO ORÇAMENTO (R$) C/BDI",null,{"$f":"SUM(D14:D39)","v":0},{"$f":"SUM(E14:E39)","v":0}]

{"sheet":"Parc Maior Relev","index":6,"n_rows":22,"n_cols":7,"rows_kept":22,"cut":false,"hidden":false,"merged":[[10,0,12,0],[8,1,8,3],[8,4,8,6],[22,3,22,7],[20,1,20,6],[0,1,0,6],[11,1,11,6],[1,1,1,6],[2,1,2,3],[2,4,2,6],[3,1,3,3],[3,4,3,6],[4,1,4,6],[5,1,5,3],[5,4,5,6],[9,1,9,3],[9,4,9,6],[10,1,10,6],[6,1,6,3],[6,4,6,6],[7,1,7,6]]}
[]
[]
[null,"UNIDADE ESCOLAR",null,null,"CÓDIGO INEP"]
[null,{"$f":"Orçamento!$O$4","v":"COLÉGIO ESTADUAL PROFESSORA MARIA PEREIRA VASCONCELOS"},null,null,{"$f":"Orçamento!$X$4","v":52047318}]
[]
[null,"OBRA",null,null,"CIDADE"]
[null,{"$f":"Orçamento!$O$7","v":"AMPLIAÇÃO E REFORMA"},null,null,{"$f":"Orçamento!$X$7","v":"LUZIÂNIA"}]
[]
[null,"CRE",null,null,"ÁREA TOTAL CONSTRUÍDA (M²)"]
[null,{"$f":"Orçamento!$O$10","v":"LUZIÂNIA"},null,null,{"$f":"Orçamento!$S$13","v":0}]
["FILTRO"]
[null,"PARCELA DE MAIOR RELEVÂNCIA"]
[null,"CÓDIGO","SERVIÇO","DESCRIÇÃO","UNID","QUANT","PARC. MAIOR RELEV (100%)"]
[{"$f":"IF(F14>0,\"F\",\"\")","v":"F"},70000,"INSTALAÇÕES ELÉTRICAS","SUBESTAÇÃO","KVA",150,{"$f":"F14","v":150}]
[null,"CÓDIGO","SERVIÇO","DESCRIÇÃO","UNID","QUANT","PARC. MAIOR RELEV (50%)"]
[{"$f":"IF(F16>0,\"F\",\"\")","v":"F"},160000,"COBERTURAS","TELHA PLAN","M2",{"$f":"Orçamento!T340","v":304.84000000000003},{"$f":"F16*0.5","v":152.42000000000002}]
[{"$f":"IF(F17>0,\"F\",\"\")","v":"F"},220000,"REVESTIMENTO DE PISO","GRANITINA","M2",{"$f":"Orçamento!T357","v":1588.0428999999999},{"$f":"F17*0.5","v":794.02144999999996}]
["",null,{"$f":"IFERROR(VLOOKUP(B18,Orçamento!$O$520:$P$545,2,FALSE),\"(inserir código ao lado)\")","v":"(inserir código ao lado)"},null,{"$f":"IFERROR(VLOOKUP($D18,Orçamento!$R$20:$Y$501,2,FALSE),\"-\")","v":"-"},{"$f":"SUMIF(Orçamento!$R$20:$R$501,'Parc Maior Relev'!D18,Orçamento!$T$20:$T$501)","v":0},0]
["",null,{"$f":"IFERROR(VLOOKUP(B19,Orçamento!$O$520:$P$545,2,FALSE),\"(inserir código ao lado)\")","v":"(inserir código ao lado)"},null,{"$f":"IFERROR(VLOOKUP($D19,Orçamento!$R$20:$Y$501,2,FALSE),\"-\")","v":"-"},{"$f":"SUMIF(Orçamento!$R$20:$R$501,'Parc Maior Relev'!D19,Orçamento!$T$20:$T$501)","v":0},0]
["F"]
["F","(*) Para os fins do inciso I dp § 1º do Art. 30 da Lei Federal 8.666/93, são consideradas parcelas de maior relevância técnica as execuções apresentadas"]
["F"]

{"sheet":"Composições","index":7,"n_rows":435,"n_cols":10,"rows_kept":435,"cut":false,"hidden":false,"merged":[[0,0,0,8],[10,0,10,2],[10,3,10,6],[11,0,11,9],[12,0,12,2],[12,3,12,6],[12,7,12,8],[7,0,7,6],[9,0,9,2],[9,3,9,6],[9,7,9,8],[3,0,3,6],[4,0,4,6],[15,0,15,9],[13,0,13,2],[13,3,13,6],[1,0,1,9],[3,7,3,9],[4,7,4,9],[6,7,6,9],[7,7,7,9],[6,0,6,6],[10,8,10,9],[13,8,13,9],[14,0,14,9],[8,0,8,9],[5,0,5,9],[2,0,2,9],[16,5,17,5],[16,6,16,7],[16,8,16,9],[22,1,22,7],[26,1,26,7],[16,0,17,0],[16,1,17,1],[16,2,17,2],[16,3,17,3],[16,4,17,4],[28,5,29,5],[28,6,28,7],[28,8,28,9],[34,1,34,7],[38,1,38,7],[28,0,29,0],[28,1,29,1],[28,2,29,2],[28,3,29,3],[28,4,29,4],[40,5,41,5],[40,6,40,7],[40,8,40,9],[46,1,46,7],[50,1,50,7],[40,0,41,0],[40,1,41,1],[40,2,41,2],[40,3,41,3],[40,4,41,4],[52,5,53,5],[52,6,52,7],[52,8,52,9],[58,1,58,7],[62,1,62,7],[52,0,53,0],[52,1,53,1],[52,2,53,2],[52,3,53,3],[52,4,53,4],[64,5,65,5],[64,6,64,7],[64,8,64,9],[70,1,70,7],[74,1,74,7],[64,0,65,0],[64,1,65,1],[64,2,65,2],[64,3,65,3],[64,4,65,4],[76,5,77,5],[76,6,76,7],[76,8,76,9],[82,1,82,7],[86,1,86,7],[76,0,77,0],[76,1,77,1],[76,2,77,2],[76,3,77,3],[76,4,77,4],[88,5,89,5],[88,6,88,7],[88,8,88,9],[94,1,94,7],[98,1,98,7],[88,0,89,0],[88,1,89,1],[88,2,89,2],[88,3,89,3],[88,4,89,4],[100,5,101,5],[100,6,100,7],[100,8,100,9],[106,1,106,7],[110,1,110,7],[100,0,101,0],[100,1,101,1],[100,2,101,2],[100,3,101,3],[100,4,101,4],[112,5,113,5],[112,6,112,7],[112,8,112,9],[118,1,118,7],[122,1,122,7],[112,0,113,0],[112,1,113,1],[112,2,113,2],[112,3,113,3],[112,4,113,4],[124,5,125,5],[124,6,124,7],[124,8,124,9],[129,1,129,7],[132,1,132,7],[124,0,125,0],[124,1,125,1],[124,2,125,2],[124,3,125,3],[124,4,125,4],[134,5,135,5],[134,6,134,7],[134,8,134,9],[139,1,139,7],[142,1,142,7],[134,0,135,0],[134,1,135,1],[134,2,135,2],[134,3,135,3],[134,4,135,4],[144,5,145,5],[144,6,144,7],[144,8,144,9],[149,1,149,7],[152,1,152,7],[144,0,145,0],[144,1,145,1],[144,2,145,2],[144,3,145,3],[144,4,145,4],[154,5,155,5],[154,6,154,7],[154,8,154,9],[160,1,160,7],[164,1,164,7],[154,0,155,0],[154,1,155,1],[154,2,155,2],[154,3,155,3],[154,4,155,4],[166,5,167,5],[166,6,166,7],[166,8,166,9],[172,1,172,7],[176,1,176,7],[166,0,167,0],[166,1,167,1],[166,2,167,2],[166,3,167,3],[166,4,167,4],[178,5,179,5],[178,6,178,7],[178,8,178,9],[184,1,184,7],[188,1,188,7],[178,0,179,0],[178,1,179,1],[178,2,179,2],[178,3,179,3],[178,4,179,4],[190,5,191,5],[190,6,190,7],[190,8,190,9],[196,1,196,7],[200,1,200,7],[190,0,191,0],[190,1,191,1],[190,2,191,2],[190,3,191,3],[190,4,191,4],[202,5,203,5],[202,6,202,7],[202,8,202,9],[208,1,208,7],[212,1,212,7],[202,0,203,0],[202,1,203,1],[202,2,203,2],[202,3,203,3],[202,4,203,4],[214,5,215,5],[214,6,214,7],[214,8,214,9],[218,1,218,7],[222,1,222,7],[214,0,215,0],[214,1,215,1],[214,2,215,2],[214,3,215,3],[214,4,215,4],[224,5,225,5],[224,6,224,7],[224,8,224,9],[230,1,230,7],[237,1,237,7],[224,0,225,0],[224,1,225,1],[224,2,225,2],[224,3,225,3],[224,4,225,4],[239,5,240,5],[239,6,239,7],[239,8,239,9],[245,1,245,7],[249,1,249,7],[239,0,240,0],[239,1,240,1],[239,2,240,2],[239,3,240,3],[239,4,240,4],[251,5,252,5],[251,6,251,7],[251,8,251,9],[257,1,257,7],[261,1,261,7],[251,0,252,0],[251,1,252,1],[251,2,252,2],[251,3,252,3],[251,4,252,4],[263,5,264,5],[263,6,263,7],[263,8,263,9],[269,1,269,7],[273,1,273,7],[263,0,264,0],[263,1,264,1],[263,2,264,2],[263,3,264,3],[263,4,264,4],[275,5,276,5],[275,6,275,7],[275,8,275,9],[281,1,281,7],[285,1,285,7],[275,0,276,0],[275,1,276,1],[275,2,276,2],[275,3,276,3],[275,4,276,4],[287,5,288,5],[287,6,287,7],[287,8,287,9],[293,1,293,7],[297,1,297,7],[287,0,288,0],[287,1,288,1],[287,2,288,2],[287,3,288,3],[287,4,288,4],[299,5,300,5],[299,6,299,7],[299,8,299,9],[305,1,305,7],[309,1,309,7],[299,0,300,0],[299,1,300,1],[299,2,300,2],[299,3,300,3],[299,4,300,4],[311,5,312,5],[311,6,311,7],[311,8,311,9],[317,1,317,7],[321,1,321,7],[311,0,312,0],[311,1,312,1],[311,2,312,2],[311,3,312,3],[311,4,312,4],[323,5,324,5],[323,6,323,7],[323,8,323,9],[329,1,329,7],[333,1,333,7],[323,0,324,0],[323,1,324,1],[323,2,324,2],[323,3,324,3],[323,4,324,4],[335,5,336,5],[335,6,335,7],[335,8,335,9],[341,1,341,7],[345,1,345,7],[335,0,336,0],[335,1,336,1],[335,2,336,2],[335,3,336,3],[335,4,336,4],[347,5,348,5],[347,6,347,7],[347,8,347,9],[353,1,353,7],[357,1,357,7],[347,0,348,0],[347,1,348,1],[347,2,348,2],[347,3,348,3],[347,4,348,4],[359,5,360,5],[359,6,359,7],[359,8,359,9],[365,1,365,7],[369,1,369,7],[359,0,360,0],[359,1,360,1],[359,2,360,2],[359,3,360,3],[359,4,360,4],[371,5,372,5],[371,6,371,7],[371,8,371,9],[377,1,377,7],[381,1,381,7],[371,0,372,0],[371,1,372,1],[371,2,372,2],[371,3,372,3],[371,4,372,4],[383,5,384,5],[383,6,383,7],[383,8,383,9],[389,1,389,7],[393,1,393,7],[383,0,384,0],[383,1,384,1],[383,2,384,2],[383,3,384,3],[383,4,384,4],[395,5,396,5],[395,6,395,7],[395,8,395,9],[401,1,401,7],[405,1,405,7],[395,0,396,0],[395,1,396,1],[395,2,396,2],[395,3,396,3],[395,4,396,4],[407,5,408,5],[407,6,407,7],[407,8,407,9],[413,1,413,7],[417,1,417,7],[407,0,408,0],[407,1,408,1],[407,2,408,2],[407,3,408,3],[407,4,408,4],[419,5,420,5],[419,6,419,7],[419,8,419,9],[424,1,424,7],[434,1,434,7],[419,0,420,0],[419,1,420,1],[419,2,420,2],[419,3,420,3],[419,4,420,4]]}
[]
[]
[]
["UNIDADE ESCOLAR",null,null,null,null,null,null,"CÓDIGO INEP"]
[{"$f":"Orçamento!$O$4","v":"COLÉGIO ESTADUAL PROFESSORA MARIA PEREIRA VASCONCELOS"},null,null,null,null,null,null,{"$f":"Orçamento!$X$4","v":52047318}]
[]
["OBRA",null,null,null,null,null,null,"CIDADE"]
[{"$f":"Orçamento!$O$7","v":"AMPLIAÇÃO E REFORMA"},null,null,null,null,null,null,{"$f":"Orçamento!$X$7","v":"LUZIÂNIA"}]
[]
["CRE",null,null,"ENDEREÇO",null,null,null,"REFERÊNCIA AGETOP"]
[{"$f":"Orçamento!$O$10","v":"LUZIÂNIA"},null,null,{"$f":"Orçamento!$R$10","v":"RUA 92 QD 256 LOTE A SN JARDIM INGA, PQ. ESTRELA DALVA IX, CEP:72853-256"},null,null,null,{"$f":"Orçamento!$X$10","v":"DEZ/18"},{"$f":"Orçamento!$Y$10","v":"ONERADA"}]
[]
["DATA",null,null,"ÁREA TOTAL CONSTRUÍDA (M²)",null,null,null,"REFERÊNCIA SINAPI"]
[{"$f":"Orçamento!$S$7","v":"2020-08-27"},null,null,{"$f":"Orçamento!$S$13","v":0},null,null,null,{"$f":"Orçamento!$X$13","v":"MAR/19"},{"$f":"Orçamento!$Y$13","v":"ONERADA"}]
[]
["COMPOSIÇÕES DE CUSTOS UNITÁRIOS - SEE-GO"]
[46,"FONTE","CÓDIGO","DESCRIÇÃO","UNIDADE","COEFIC.","CUSTO UNITÁRIO",null,"CUSTO  TOTAL (A) + (B) + (C) + (D) + (E)"]
[null,null,null,null,null,null,"DESONERADO","NÃO DESONER.","DESONERADO","NÃO DESONER."]
[null,"COMPOSIÇÃO","COMP 046_SEE","CAPUZ PARA PROTEÇÃO DOS PARA RAIOS","UN ",null,null,null,16.53,16.650000000000002]
[null,"AGETOP_I",8,"AJUDANTE","h     ",3.3300000000000003E-2,8.1999999999999993,9.51,0.27,0.32]
[null,"AGETOP_I",12,"ELETRICISTA","h     ",3.3300000000000003E-2,13.4,15.53,0.45,0.52]
[null,null,null,"","",null,0,0,0,0]
[null,"MÃO DE OBRA (B) - TOTAL",null,null,null,null,null,null,0.72,0.84000000000000008]
[null,"COTAÇÃO","COT 010_SEE","CAPUZ PARA PROTEÇÃO DOS PARA RAIOS","UN ",1,15.81,15.81,15.81,15.81]
[null,null,null,"","",null,0,0,0,0]
[null,null,null,"","",null,0,0,0,0]
[null,"MATERIAL (C) - TOTAL",null,null,null,null,null,null,15.81,15.81]
[]
[47,"FONTE","CÓDIGO","DESCRIÇÃO","UNIDADE","COEFIC.","CUSTO UNITÁRIO",null,"CUSTO  TOTAL (A) + (B) + (C) + (D) + (E)"]
[null,null,null,null,null,null,"DESONERADO","NÃO DESONER.","DESONERADO","NÃO DESONER."]
[null,"COMPOSIÇÃO","COMP 047_SEE","CAPUZ DE PROTEÇÃO PARA BUCHA DE TRANSFORMADOR","UN ",null,null,null,16.53,16.650000000000002]
[null,"AGETOP_I",8,"AJUDANTE","h     ",3.3300000000000003E-2,8.1999999999999993,9.51,0.27,0.32]
[null,"AGETOP_I",12,"ELETRICISTA","h     ",3.3300000000000003E-2,13.4,15.53,0.45,0.52]
[null,null,null,"","",null,0,0,0,0]
[null,"MÃO DE OBRA (B) - TOTAL",null,null,null,null,null,null,0.72,0.84000000000000008]
[null,"COTAÇÃO","COT 011_SEE","CAPUZ DE PROTEÇÃO PARA BUCHA DE TRANSFORMADOR","UN ",1,15.81,15.81,15.81,15.81]
[null,null,null,"","",null,0,0,0,0]
[null,null,null,"","",null,0,0,0,0]
[null,"MATERIAL (C) - TOTAL",null,null,null,null,null,null,15.81,15.81]
[]
[48,"FONTE","CÓDIGO","DESCRIÇÃO","UNIDADE","COEFIC.","CUSTO UNITÁRIO",null,"CUSTO  TOTAL (A) + (B) + (C) + (D) + (E)"]
[null,null,null,null,null,null,"DESONERADO","NÃO DESONER.","DESONERADO","NÃO DESONER."]
[null,"COMPOSIÇÃO","COMP 048_SEE","HASTE ROSQUEADA \"TIRANTE\" 3/8\"","M",null,null,null,14.02,15.39]
[null,"AGETOP_I",8,"AJUDANTE","h     ",0.4,8.1999999999999993,9.51,3.28,3.8]
[null,"AGETOP_I",12,"ELETRICISTA","h     ",0.4,13.4,15.53,5.36,6.21]
[null,null,null,"","",null,0,0,0,0]
[null,"MÃO DE OBRA (B) - TOTAL",null,null,null,null,null,null,8.64,10.01]
[null,"COTAÇÃO","COT 012_SEE","HASTE ROSQUEADA \"TIRANTE\" 3/8\"","M",1,5.3833333333333329,5.3833333333333329,5.38,5.38]
[null,null,null,"","",null,0,0,0,0]
[null,null,null,"","",null,0,0,0,0]
[null,"MATERIAL (C) - TOTAL",null,null,null,null,null,null,5.38,5.38]
[]
[49,"FONTE","CÓDIGO","DESCRIÇÃO","UNIDADE","COEFIC.","CUSTO UNITÁRIO",null,"CUSTO  TOTAL (A) + (B) + (C) + (D) + (E)"]
[null,null,null,null,null,null,"DESONERADO","NÃO DESONER.","DESONERADO","NÃO DESONER."]
[null,"COMPOSIÇÃO","COMP 049_SEE","PORCA SEXTAVADA 3/8\"","UN ",null,null,null,0.2,0.22]
[null,"AGETOP_I",8,"AJUDANTE","h     ",8.9999999999999993E-3,8.1999999999999993,9.51,7.0000000000000007E-2,0.09]
[null,null,null,"","",null,0,0,0,0]
[null,null,null,"","",null,0,0,0,0]
[null,"MÃO DE OBRA (B) - TOTAL",null,null,null,null,null,null,7.0000000000000007E-2,0.09]
[null,"COTAÇÃO","COT 013_SEE","PORCA SEXTAVADA 3/8\"","UN ",1,0.13,0.13,0.13,0.13]
[null,null,null,"","",null,0,0,0,0]
[null,null,null,"","",null,0,0,0,0]
[null,"MATERIAL (C) - TOTAL",null,null,null,null,null,null,0.13,0.13]
[]
[387,"FONTE","CÓDIGO","DESCRIÇÃO","UNIDADE","COEFIC.","CUSTO UNITÁRIO",null,"CUSTO  TOTAL (A) + (B) + (C) + (D) + (E)"]
[null,null,null,null,null,null,"DESONERADO","NÃO DESONER.","DESONERADO","NÃO DESONER."]
[null,"COMPOSIÇÃO","COMP 387_SEE","LÂMPADA LED TUBULAR 18W ","UN ",null,null,null,22.28,22.330000000000002]
[null,"AGETOP_I",8,"AJUDANTE","h     ",1.4999999999999999E-2,8.1999999999999993,9.51,0.12,0.14000000000000001]
[null,"AGETOP_I",12,"ELETRICISTA","h     ",1.4999999999999999E-2,13.4,15.53,0.2,0.23]
[null,null,null,"","",null,0,0,0,0]
[null,"MÃO DE OBRA (B) - TOTAL",null,null,null,null,null,null,0.32,0.37]
[null,"COTAÇÃO","COT 195_SEE","LÂMPADA LED TUBULAR 18W ","UN",1,21.959999999999997,21.959999999999997,21.96,21.96]
[null,null,null,"","",null,0,0,0,0]
[null,null,null,"","",null,0,0,0,0]
[null,"MATERIAL (C) - TOTAL",null,null,null,null,null,null,21.96,21.96]
[]
[17,"FONTE","CÓDIGO","DESCRIÇÃO","UNIDADE","COEFIC.","CUSTO UNITÁRIO",null,"CUSTO  TOTAL (A) + (B) + (C) + (D) + (E)"]
[null,null,null,null,null,null,"DESONERADO","NÃO DESONER.","DESONERADO","NÃO DESONER."]
[null,"COMPOSIÇÃO","COMP 017_SEE","REDUCAO GIRATÓRIA TIPO STORZ LATAO P/ INST. PREDIAL COMBATE A INCENDIO ENGATE RAPIDO 2.1/2\" X 1.1/2\"","UN ",null,"-","-",94.15,94.7]
[null,"AGETOP_I",8,"AJUDANTE","h     ",0.16,8.1999999999999993,9.51,1.31,1.52]
[null,"AGETOP_I",11,"ENCANADOR","h     ",0.16,13.4,15.53,2.14,2.48]
[null,null,null,"","",null,0,0,0,0]
[null,"MÃO DE OBRA (B) - TOTAL",null,null,null,null,null,null,3.45,4]
[null,"SINAPI_I",20972,"REDUCAO FIXA TIPO STORZ, ENGATE RAPIDO 2.1/2\" X 1.1/2\", EM LATAO, PARA INSTALACAO PREDIAL COMBATE A INCENDIO PREDIAL","UN    ",1,90.7,90.7,90.7,90.7]
[null,null,null,"","",null,0,0,0,0]
[null,null,null,"","",null,0,0,0,0]
[null,"MATERIAL (C) - TOTAL",null,null,null,null,null,null,90.7,90.7]
[]
[18,"FONTE","CÓDIGO","DESCRIÇÃO","UNIDADE","COEFIC.","CUSTO UNITÁRIO",null,"CUSTO  TOTAL (A) + (B) + (C) + (D) + (E)"]
[null,null,null,null,null,null,"DESONERADO","NÃO DESONER.","DESONERADO","NÃO DESONER."]
[null,"COMPOSIÇÃO","COMP 018_SEE","CHAVE DUPLA P/ CONEXÕES TIPO STORZ EM LATÃO ENGATE RÁPIDO 1 1/2\" X 2 1/2\"","UN ",null,"-","-",14.1,14.42]
[null,"AGETOP_I",11,"ENCANADOR","h     ",0.15,13.4,15.53,2.0099999999999998,2.33]
[null,null,null,"","",null,0,0,0,0]
[null,null,null,"","",null,0,0,0,0]
[null,"MÃO DE OBRA (B) - TOTAL",null,null,null,null,null,null,2.0099999999999998,2.33]
[null,"SINAPI_I",20971,"CHAVE DUPLA PARA CONEXOES TIPO STORZ, ENGATE RAPIDO 1 1/2\" X 2 1/2\", EM LATAO, PARA INSTALACAO PREDIAL COMBATE A INCENDIO","UN    ",1,12.09,12.09,12.09,12.09]
[null,null,null,"","",null,0,0,0,0]
[null,null,null,"","",null,0,0,0,0]
[null,"MATERIAL (C) - TOTAL",null,null,null,null,null,null,12.09,12.09]
[]
[87,"FONTE","CÓDIGO","DESCRIÇÃO","UNIDADE","COEFIC.","CUSTO UNITÁRIO",null,"CUSTO  TOTAL (A) + (B) + (C) + (D) + (E)"]
[null,null,null,null,null,null,"DESONERADO","NÃO DESONER.","DESONERADO","NÃO DESONER."]
[null,"COMPOSIÇÃO","COMP 087_SEE","REGISTRO DE GAVETA COM HASTE ASCENDENTE DE BRONZE 2 1/2\"","UN ",null,null,null,257.29999999999995,261.26]
[null,"AGETOP_I",8,"AJUDANTE","h     ",1.1499999999999999,8.1999999999999993,9.51,9.43,10.94]
[null,"AGETOP_I",11,"ENCANADOR","h     ",1.1499999999999999,13.4,15.53,15.41,17.86]
[null,null,null,"","",null,0,0,0,0]
[null,"MÃO DE OBRA (B) - TOTAL",null,null,null,null,null,null,24.84,28.799999999999997]
[null,"AGETOP_I","H689","FITA VEDAROSCA 12 MM","m",2.82,0.28000000000000003,0.28000000000000003,0.79,0.79]
[null,"COTAÇÃO","COT 017_SEE","REGISTRO DE GAVETA COM HASTE ASCENDENTE DE BRONZE 2 1/2\"","UN ",1,231.66666666666666,231.66666666666666,231.67,231.67]
[null,null,null,"","",null,0,0,0,0]
[null,"MATERIAL (C) - TOTAL",null,null,null,null,null,null,232.45999999999998,232.45999999999998]
[]
[19,"FONTE","CÓDIGO","DESCRIÇÃO","UNIDADE","COEFIC.","CUSTO UNITÁRIO",null,"CUSTO  TOTAL (A) + (B) + (C) + (D) + (E)"]
[null,null,null,null,null,null,"DESONERADO","NÃO DESONER.","DESONERADO","NÃO DESONER."]
[null,"COMPOSIÇÃO","COMP 019_SEE","TAMPÃO LATAO C/ CORRENTE P/ INSTALAÇÃO PREDIAL COMBATE A INCÊNDIO ENGATE RÁPIDO 1 1/2\"","UN ",null,"-","-",52.82,53.339999999999996]
[null,"AGETOP_I",11,"ENCANADOR","h     ",0.15,13.4,15.53,2.0099999999999998,2.33]
[null,"AGETOP_I",8,"AJUDANTE","h     ",0.15,8.1999999999999993,9.51,1.23,1.43]
[null,null,null,"","",null,0,0,0,0]
[null,"MÃO DE OBRA (B) - TOTAL",null,null,null,null,null,null,3.2399999999999998,3.76]
[null,"SINAPI_I",20964,"TAMPAO COM CORRENTE, EM LATAO, ENGATE RAPIDO 1 1/2\", PARA INSTALACAO PREDIAL DE COMBATE A INCENDIO","UN    ",1,49.58,49.58,49.58,49.58]
[null,null,null,"","",null,0,0,0,0]
[null,null,null,"","",null,0,0,0,0]
[null,"MATERIAL (C) - TOTAL",null,null,null,null,null,null,49.58,49.58]
[]
[30,"FONTE","CÓDIGO","DESCRIÇÃO","UNIDADE","COEFIC.","CUSTO UNITÁRIO",null,"CUSTO  TOTAL (A) + (B) + (C) + (D) + (E)"]
[null,null,null,null,null,null,"DESONERADO","NÃO DESONER.","DESONERADO","NÃO DESONER."]
[null,"COMPOSIÇÃO","COMP 030_SEE","COTOVELO DE FERRO GALV. 90° X 2 1/2\"","UN ",null,null,null,68.89,72.06]
[null,"AGETOP_I",8,"AJUDANTE","h     ",0.92,8.1999999999999993,9.51,7.54,8.75]
[null,"AGETOP_I",11,"ENCANADOR","h     ",0.92,13.4,15.53,12.33,14.29]
[null,"MÃO DE OBRA (B) - TOTAL",null,null,null,null,null,null,19.87,23.04]
[null,"SINAPI_I",3470,"COTOVELO 90 GRAUS DE FERRO GALVANIZADO, COM ROSCA BSP, DE 2 1/2\"","UN    ",1,48.46,48.46,48.46,48.46]
[null,"AGETOP_I","H689","FITA VEDAROSCA 12 MM","m",2,0.28000000000000003,0.28000000000000003,0.56000000000000005,0.56000000000000005]
[null,"MATERIAL (C) - TOTAL",null,null,null,null,null,null,49.02,49.02]
[]
[77,"FONTE","CÓDIGO","DESCRIÇÃO","UNIDADE","COEFIC.","CUSTO UNITÁRIO",null,"CUSTO  TOTAL (A) + (B) + (C) + (D) + (E)"]
[null,null,null,null,null,null,"DESONERADO","NÃO DESONER.","DESONERADO","NÃO DESONER."]
[null,"COMPOSIÇÃO","COMP 077_SEE","UNIAO FERRO GALV C/ASSENTO CONICO BRONZE 2 1/2\"","UN ",null,null,null,147.51999999999998,148.88999999999999]
[null,"AGETOP_I",8,"AJUDANTE","h     ",0.4,8.1999999999999993,9.51,3.28,3.8]
[null,"AGETOP_I",11,"ENCANADOR","h     ",0.4,13.4,15.53,5.36,6.21]
[null,"MÃO DE OBRA (B) - TOTAL",null,null,null,null,null,null,8.64,10.01]
[null,"AGETOP_I","H689","FITA VEDAROSCA 12 MM","m",2.4,0.28000000000000003,0.28000000000000003,0.67,0.67]
[null,"SINAPI_I",12427,"UNIAO COM ASSENTO CONICO DE BRONZE, DIAMETRO 2 1/2\"","UN    ",1,138.21,138.21,138.21,138.21]
[null,"MATERIAL (C) - TOTAL",null,null,null,null,null,null,138.88,138.88]
[]
[76,"FONTE","CÓDIGO","DESCRIÇÃO","UNIDADE","COEFIC.","CUSTO UNITÁRIO",null,"CUSTO  TOTAL (A) + (B) + (C) + (D) + (E)"]
[null,null,null,null,null,null,"DESONERADO","NÃO DESONER.","DESONERADO","NÃO DESONER."]
[null,"COMPOSIÇÃO","COMP 076_SEE","CURVA FERRO GALVANIZADO 45G ROSCA MACHO/FEMEA REF. 2 1/2\"","UN ",null,null,null,116.11,119.28]
[null,"AGETOP_I",8,"AJUDANTE","h     ",0.92,8.1999999999999993,9.51,7.54,8.75]
[null,"AGETOP_I",11,"ENCANADOR","h     ",0.92,13.4,15.53,12.33,14.29]
[null,"MÃO DE OBRA (B) - TOTAL",null,null,null,null,null,null,19.87,23.04]
[null,"SINAPI_I",3148,"FITA VEDA ROSCA EM ROLOS DE 18 MM X 50 M (L X C)","UN    ",4.9099999999999998E-2,12.9,12.9,0.63,0.63]
[null,"SINAPI_I",1784,"CURVA 45 GRAUS DE FERRO GALVANIZADO, COM ROSCA BSP MACHO/FEMEA, DE 2 1/2\"","UN    ",1,95.61,95.61,95.61,95.61]
[null,"MATERIAL (C) - TOTAL",null,null,null,null,null,null,96.24,96.24]
[]
[22,"FONTE","CÓDIGO","DESCRIÇÃO","UNIDADE","COEFIC.","CUSTO UNITÁRIO",null,"CUSTO  TOTAL (A) + (B) + (C) + (D) + (E)"]
[null,null,null,null,null,null,"DESONERADO","NÃO DESONER.","DESONERADO","NÃO DESONER."]
[null,"COMPOSIÇÃO","COMP 022_SEE","TAMPÃO FOFO 40X50CM C/INSCRIÇÃO ","UN ",null,"-","-",216.53,216.85000000000002]
[null,"AGETOP_I",11,"ENCANADOR","h     ",0.15,13.4,15.53,2.0099999999999998,2.33]
[null,null,null,"","",null,0,0,0,0]
[null,null,null,"","",null,0,0,0,0]
[null,"MÃO DE OBRA (B) - TOTAL",null,null,null,null,null,null,2.0099999999999998,2.33]
[null,"SINAPI_I",11293,"TAMPAO FOFO SIMPLES COM BASE, CLASSE A15 CARGA MAX 1,5 T, 400 X 500 MM, COM INSCRICAO INCENDIO","UN    ",1,214.52,214.52,214.52,214.52]
[null,null,null,"","",null,0,0,0,0]
[null,null,null,"","",null,0,0,0,0]
[null,"MATERIAL (C) - TOTAL",null,null,null,null,null,null,214.52,214.52]
[]
[24,"FONTE","CÓDIGO","DESCRIÇÃO","UNIDADE","COEFIC.","CUSTO UNITÁRIO",null,"CUSTO  TOTAL (A) + (B) + (C) + (D) + (E)"]
[null,null,null,null,null,null,"DESONERADO","NÃO DESONER.","DESONERADO","NÃO DESONER."]
[null,"COMPOSIÇÃO","COMP 024_SEE","SINALIZADOR FOTOLUMINESCENTE PARA EXTINTOR","UN ",null,"-","-",25.269999999999996,25.389999999999997]
[null,"AGETOP_I",5,"SERVENTE","h     ",0.09,8.1999999999999993,9.51,0.74,0.86]
[null,null,null,"","",null,0,0,0,0]
[null,null,null,"","",null,0,0,0,0]
[null,"MÃO DE OBRA (B) - TOTAL",null,null,null,null,null,null,0.74,0.86]
[null,"AGETOP_I",3070,"BUCHA DE NYLON S-6","un",2,0.04,0.04,0.08,0.08]
[null,"AGETOP_I",3393,"PARAFUSO P/BUCHA S-6","un",2,0.08,0.08,0.16,0.16]
[null,"SINAPI_I",37556,"PLACA DE SINALIZACAO DE SEGURANCA CONTRA INCENDIO, FOTOLUMINESCENTE, QUADRADA, *20 X 20* CM, EM PVC *2* MM ANTI-CHAMAS (SIMBOLOS, CORES E PICTOGRAMAS CONFORME NBR 13434)","UN    ",1,24.29,24.29,24.29,24.29]
[null,"MATERIAL (C) - TOTAL",null,null,null,null,null,null,24.529999999999998,24.529999999999998]
[]
[186,"FONTE","CÓDIGO","DESCRIÇÃO","UNIDADE","COEFIC.","CUSTO UNITÁRIO",null,"CUSTO  TOTAL (A) + (B) + (C) + (D) + (E)"]
[null,null,null,null,null,null,"DESONERADO","NÃO DESONER.","DESONERADO","NÃO DESONER."]
[null,"COMPOSIÇÃO","COMP 186_SEE","BOTOEIRA BOMBA DE INCÊNDIO C/ MARTELO CONVENCIONAL/ ANALÓGICA","UN ",null,null,null,85.1,88.539999999999992]
[null,"AGETOP_I",8,"AJUDANTE","h     ",1,8.1999999999999993,9.51,8.1999999999999993,9.51]
[null,"AGETOP_I",12,"ELETRICISTA","h     ",1,13.4,15.53,13.4,15.53]
[null,null,null,"","",null,0,0,0,0]
[null,"MÃO DE OBRA (B) - TOTAL",null,null,null,null,null,null,21.6,25.04]
[null,"COTAÇÃO","COT 088_SEE","BOTOEIRA BOMBA DE INCÊNDIO C/ MARTELO CONVENCIONAL/ ANALÓGICA","UN",1,63.5,63.5,63.5,63.5]
[null,null,null,"","",null,0,0,0,0]
[null,null,null,"","",null,0,0,0,0]
[null,"MATERIAL (C) - TOTAL",null,null,null,null,null,null,63.5,63.5]
[]
[188,"FONTE","CÓDIGO","DESCRIÇÃO","UNIDADE","COEFIC.","CUSTO UNITÁRIO",null,"CUSTO  TOTAL (A) + (B) + (C) + (D) + (E)"]
[null,null,null,null,null,null,"DESONERADO","NÃO DESONER.","DESONERADO","NÃO DESONER."]
[null,"COMPOSIÇÃO","COMP 188_SEE","ACIONADOR MANUAL DE ALARME","UN ",null,null,null,100.61,103.36]
[null,"AGETOP_I",8,"AJUDANTE","h     ",0.8,8.1999999999999993,9.51,6.56,7.61]
[null,"AGETOP_I",12,"ELETRICISTA","h     ",0.8,13.4,15.53,10.72,12.42]
[null,null,null,"","",null,0,0,0,0]
[null,"MÃO DE OBRA (B) - TOTAL",null,null,null,null,null,null,17.28,20.03]
[null,"COTAÇÃO","COT 090_SEE","ACIONADOR MANUAL DE ALARME","UN",1,83.333333333333329,83.333333333333329,83.33,83.33]
[null,null,null,"","",null,0,0,0,0]
[null,null,null,"","",null,0,0,0,0]
[null,"MATERIAL (C) - TOTAL",null,null,null,null,null,null,83.33,83.33]
[]
[190,"FONTE","CÓDIGO","DESCRIÇÃO","UNIDADE","COEFIC.","CUSTO UNITÁRIO",null,"CUSTO  TOTAL (A) + (B) + (C) + (D) + (E)"]
[null,null,null,null,null,null,"DESONERADO","NÃO DESONER.","DESONERADO","NÃO DESONER."]
[null,"COMPOSIÇÃO","COMP 190_SEE","CENTRAL DE DETECÇÃO E ALARME DE 40 SETORES COM BATERIA","UN ",null,null,null,1136.1300000000001,1163.6500000000001]
[null,"AGETOP_I",8,"AJUDANTE","h     ",8,8.1999999999999993,9.51,65.599999999999994,76.08]
[null,"AGETOP_I",12,"ELETRICISTA","h     ",8,13.4,15.53,107.2,124.24]
[null,null,null,"","",null,0,0,0,0]
[null,"MÃO DE OBRA (B) - TOTAL",null,null,null,null,null,null,172.8,200.32]
[null,"COTAÇÃO","COT 092_SEE","CENTRAL DE DETECÇÃO E ALARME DE 40 SETORES COM BATERIA (PREÇO MÉDIO)","UN",1,963.33333333333337,963.33333333333337,963.33,963.33]
[null,null,null,"","",null,0,0,0,0]
[null,null,null,"","",null,0,0,0,0]
[null,"MATERIAL (C) - TOTAL",null,null,null,null,null,null,963.33,963.33]
[]
[25,"FONTE","CÓDIGO","DESCRIÇÃO","UNIDADE","COEFIC.","CUSTO UNITÁRIO",null,"CUSTO  TOTAL (A) + (B) + (C) + (D) + (E)"]
[null,null,null,null,null,null,"DESONERADO","NÃO DESONER.","DESONERADO","NÃO DESONER."]
[null,"COMPOSIÇÃO","COMP 025_SEE","SINALIZADOR FOTOLUMINESCENTE DE EMERGÊNCIA","UN ",null,"-","-",25.269999999999996,25.389999999999997]
[null,"AGETOP_I",5,"SERVENTE","h     ",0.09,8.1999999999999993,9.51,0.74,0.86]
[null,"MÃO DE OBRA (B) - TOTAL",null,null,null,null,null,null,0.74,0.86]
[null,"AGETOP_I",3070,"BUCHA DE NYLON S-6","un",2,0.04,0.04,0.08,0.08]
[null,"AGETOP_I",3393,"PARAFUSO P/BUCHA S-6","un",2,0.08,0.08,0.16,0.16]
[null,"SINAPI_I",37556,"PLACA DE SINALIZACAO DE SEGURANCA CONTRA INCENDIO, FOTOLUMINESCENTE, QUADRADA, *20 X 20* CM, EM PVC *2* MM ANTI-CHAMAS (SIMBOLOS, CORES E PICTOGRAMAS CONFORME NBR 13434)","UN    ",1,24.29,24.29,24.29,24.29]
[null,"MATERIAL (C) - TOTAL",null,null,null,null,null,null,24.529999999999998,24.529999999999998]
[]
[277,"FONTE","CÓDIGO","DESCRIÇÃO","UNIDADE","COEFIC.","CUSTO UNITÁRIO",null,"CUSTO  TOTAL (A) + (B) + (C) + (D) + (E)"]
[null,null,null,null,null,null,"DESONERADO","NÃO DESONER.","DESONERADO","NÃO DESONER."]
[null,"COMPOSIÇÃO","COMP 277_SEE","MARCAÇÃO NO PISO - 1X1 M PARA EXTINTOR","M2",null,null,null,27.719999999999995,27.799999999999997]
[null,"AGETOP_I",5,"SERVENTE","h     ",3.3300000000000003E-2,8.1999999999999993,9.51,0.27,0.32]
[null,null,null,"","",null,0,0,0,0]
[null,null,null,"","",null,0,0,0,0]
[null,"MÃO DE OBRA (B) - TOTAL",null,null,null,null,null,null,0.27,0.32]
[null,"SINAPI_I",5318,"SOLVENTE DILUENTE A BASE DE AGUARRAS","L     ",0.13,10.98,10.98,1.43,1.43]
[null,"SINAPI",5824,"CAMINHÃO TOCO, PBT 16.000 KG, CARGA ÚTIL MÁX. 10.685 KG, DIST. ENTRE EIXOS 4,8 M, POTÊNCIA 189 CV, INCLUSIVE CARROCERIA FIXA ABERTA DE MADEIRA P/ TRANSPORTE GERAL DE CARGA SECA, DIMEN. APROX. 2,5 X 7,00 X 0,50 M - CHP DIURNO. AF_06/2014","CHP",3.3E-3,135.91999999999999,139.13,0.45,0.46]
[null,"SINAPI_I",7343,"TINTA A BASE DE RESINA ACRILICA, PARA SINALIZACAO HORIZONTAL VIARIA (NBR 11862)","L     ",0.6,11.69,11.69,7.01,7.01]
[null,"SINAPI_I",7348,"TINTA ACRILICA PREMIUM PARA PISO","L     ",0.03,12.39,12.39,0.37,0.37]
[null,"SINAPI_I",25972,"MICROESFERAS DE VIDRO PARA SINALIZACAO HORIZONTAL VIARIA, TIPO I-B (PREMIX) - NBR 16184","KG    ",2.14,8.33,8.33,17.829999999999998,17.829999999999998]
[null,"SINAPI",95133,"MÁQUINA DEMARCADORA DE FAIXA DE TRÁFEGO À FRIO, AUTOPROPELIDA, POTÊNCIA 38 HP - CHP DIURNO. AF_07/2016","CHP",3.3E-3,110.07,113.65,0.36,0.38]
[null,"MATERIAL (C) - TOTAL",null,null,null,null,null,null,27.449999999999996,27.479999999999997]
[]
[40,"FONTE","CÓDIGO","DESCRIÇÃO","UNIDADE","COEFIC.","CUSTO UNITÁRIO",null,"CUSTO  TOTAL (A) + (B) + (C) + (D) + (E)"]
[null,null,null,null,null,null,"DESONERADO","NÃO DESONER.","DESONERADO","NÃO DESONER."]
[null,"COMPOSIÇÃO","COMP 040_SEE","CONJUNTO MOTOR-BOMBA ELÉTRICA TRIFÁSICO 380/220 V PARA VZ= 24,33 M³/H, HM= 46,24 M POTÊNCIA= 7,5 CV","UN ",null,null,null,3965.4700000000003,3992.9900000000002]
[null,"AGETOP_I",8,"AJUDANTE","h     ",8,8.1999999999999993,9.51,65.599999999999994,76.08]
[null,"AGETOP_I",11,"ENCANADOR","h     ",8,13.4,15.53,107.2,124.24]
[null,null,null,"","",null,0,0,0,0]
[null,"MÃO DE OBRA (B) - TOTAL",null,null,null,null,null,null,172.8,200.32]
[null,"COTAÇÃO","COT 008_SEE","CONJUNTO MOTOR-BOMBA ELÉTRICA TRIFÁSICO 380/220 V PARA VZ= 24,33 M³/H, HM= 46,24 M POTÊNCIA= 7,5 CV","UN ",1,3792.6666666666665,3792.6666666666665,3792.67,3792.67]
[null,null,null,"","",null,0,0,0,0]
[null,null,null,"","",null,0,0,0,0]
[null,"MATERIAL (C) - TOTAL",null,null,null,null,null,null,3792.67,3792.67]
[]
[546,"FONTE","CÓDIGO","DESCRIÇÃO","UNID ","COEFIC.","CUSTO UNITÁRIO",null,"CUSTO  TOTAL (A) + (B) + (C) + (D) + (E)"]
[null,null,null,null,null,null,"DESONERADO","NÃO DESONER.","DESONERADO","NÃO DESONER."]
[null,"COMPOSIÇÃO","COMP 546_SEE","BUJÃO DE REBORDO 2.1/2\"","UN ","-","-","-",16.509999999999998,16.760000000000002]
[null,"AGETOP_I",8,"AJUDANTE","h     ",7.0000000000000007E-2,8.1999999999999993,9.51,0.56999999999999995,0.67]
[null,"AGETOP_I",11,"ENCANADOR","h     ",7.0000000000000007E-2,13.4,15.53,0.94,1.0900000000000001]
[null,null,null,"","",null,0,0,0,0]
[null,"MÃO DE OBRA (B) - TOTAL",null,null,null,null,null,null,1.5099999999999998,1.7600000000000002]
[null,"COTAÇÃO","COT 286_SEE","BUJÃO DE REBORDO 2.1/2\"","UN ",1,15,15,15,15]
[null,null,null,"","",null,0,0,0,0]
[null,null,null,"","",null,0,0,0,0]
[null,"MATERIAL (C) - TOTAL",null,null,null,null,null,null,15,15]
[]
[548,"FONTE","CÓDIGO","DESCRIÇÃO","UNID ","COEFIC.","CUSTO UNITÁRIO",null,"CUSTO  TOTAL (A) + (B) + (C) + (D) + (E)"]
[null,null,null,null,null,null,"DESONERADO","NÃO DESONER.","DESONERADO","NÃO DESONER."]
[null,"COMPOSIÇÃO","COMP 548_SEE","VÁLVULA DE ESFERA BRUTA, METAL, ROSCÁVEL, 2.1/2\" - FORNECIMENTO E INSTALAÇÃO","UN ","-","-","-",309.96999999999997,312.76]
[null,"SINAPI",88248,"AUXILIAR DE ENCANADOR OU BOMBEIRO HIDRÁULICO COM ENCARGOS COMPLEMENTARES","H",0.77449999999999997,13.72,15.22,10.63,11.79]
[null,"SINAPI",88267,"ENCANADOR OU BOMBEIRO HIDRÁULICO COM ENCARGOS COMPLEMENTARES","H",0.77449999999999997,17.670000000000002,19.78,13.69,15.32]
[null,null,null,"","",null,0,0,0,0]
[null,"MÃO DE OBRA (B) - TOTAL",null,null,null,null,null,null,24.32,27.11]
[null,"SINAPI_I",3148,"FITA VEDA ROSCA EM ROLOS DE 18 MM X 50 M (L X C)","UN    ",9.4999999999999998E-3,12.9,12.9,0.12,0.12]
[null,"COTAÇÃO","COT 290_SEE","VÁLVULA DE ESFERA BRUTA EM METAL, BITOLA 2.1/2\"","UN ",1,285.52600000000001,285.52600000000001,285.52999999999997,285.52999999999997]
[null,null,null,"","",null,0,0,0,0]
[null,"MATERIAL (C) - TOTAL",null,null,null,null,null,null,285.64999999999998,285.64999999999998]
[]
[549,"FONTE","CÓDIGO","DESCRIÇÃO","UNID ","COEFIC.","CUSTO UNITÁRIO",null,"CUSTO  TOTAL (A) + (B) + (C) + (D) + (E)"]
[null,null,null,null,null,null,"DESONERADO","NÃO DESONER.","DESONERADO","NÃO DESONER."]
[null,"COMPOSIÇÃO","COMP 549_SEE","FLANGE GALVANIZADA 2.1/2\" - FORNECIMENTO E INSTALAÇÃO","UN ","-","-","-",213.19,214.14]
[null,"SINAPI",88248,"AUXILIAR DE ENCANADOR OU BOMBEIRO HIDRÁULICO COM ENCARGOS COMPLEMENTARES","H",0.26200000000000001,13.72,15.22,3.59,3.99]
[null,"SINAPI",88267,"ENCANADOR OU BOMBEIRO HIDRÁULICO COM ENCARGOS COMPLEMENTARES","H",0.26200000000000001,17.670000000000002,19.78,4.63,5.18]
[null,null,null,"","",null,0,0,0,0]
[null,"MÃO DE OBRA (B) - TOTAL",null,null,null,null,null,null,8.2199999999999989,9.17]
[null,"SINAPI_I",3148,"FITA VEDA ROSCA EM ROLOS DE 18 MM X 50 M (L X C)","UN    ",1.2999999999999999E-2,12.9,12.9,0.17,0.17]
[null,"SINAPI_I",7307,"FUNDO ANTICORROSIVO PARA METAIS FERROSOS (ZARCAO)","L     ",2E-3,21.9,21.9,0.04,0.04]
[null,"COTAÇÃO","COT 291_SEE","FLANGE GALVANIZADA 2.1/2\"","UN ",1,151.89666666666668,151.89666666666668,151.9,151.9]
[null,"MATERIAL (C) - TOTAL",null,null,null,null,null,null,152.11000000000001,152.11000000000001]
[]
[382,"FONTE","CÓDIGO","DESCRIÇÃO","UNIDADE","COEFIC.","CUSTO UNITÁRIO",null,"CUSTO  TOTAL (A) + (B) + (C) + (D) + (E)"]
[null,null,null,null,null,null,"DESONERADO","NÃO DESONER.","DESONERADO","NÃO DESONER."]
[null,"COMPOSIÇÃO","COMP 382_SEE","TE DE REDUCAO DE FERRO GALVANIZADO, COM ROSCA BSP, DE 3/4\" X 1/2\"","UN ",null,null,null,21.83,23.92]
[null,"AGETOP_I",8,"AJUDANTE","h     ",0.6,8.1999999999999993,9.51,4.92,5.71]
[null,"AGETOP_I",11,"ENCANADOR","h     ",0.61050000000000004,13.4,15.53,8.18,9.48]
[null,null,null,"","",null,0,0,0,0]
[null,"MÃO DE OBRA (B) - TOTAL",null,null,null,null,null,null,13.1,15.190000000000001]
[null,"SINAPI_I",3146,"FITA VEDA ROSCA EM ROLOS DE 18 MM X 10 M (L X C)","UN    ",0.12075471698113208,3.5,3.5,0.42,0.42]
[null,"SINAPI_I",6302,"TE DE REDUCAO DE FERRO GALVANIZADO, COM ROSCA BSP, DE 3/4\" X 1/2\"","UN    ",1,8.31,8.31,8.31,8.31]
[null,null,null,"","",null,0,0,0,0]
[null,"MATERIAL (C) - TOTAL",null,null,null,null,null,null,8.73,8.73]
[]
[383,"FONTE","CÓDIGO","DESCRIÇÃO","UNIDADE","COEFIC.","CUSTO UNITÁRIO",null,"CUSTO  TOTAL (A) + (B) + (C) + (D) + (E)"]
[null,null,null,null,null,null,"DESONERADO","NÃO DESONER.","DESONERADO","NÃO DESONER."]
[null,"COMPOSIÇÃO","COMP 383_SEE","BUCHA DE REDUCAO DE FERRO GALVANIZADO, COM ROSCA BSP, DE 1/2\" X 1/4\"","UN ",null,null,null,6.85,7.4]
[null,"AGETOP_I",8,"AJUDANTE","h     ",0.16,8.1999999999999993,9.51,1.31,1.52]
[null,"AGETOP_I",11,"ENCANADOR","h     ",0.16,13.4,15.53,2.14,2.48]
[null,null,null,"","",null,0,0,0,0]
[null,"MÃO DE OBRA (B) - TOTAL",null,null,null,null,null,null,3.45,4]
[null,"AGETOP_I","H689","FITA VEDAROSCA 12 MM","m",1.2,0.28000000000000003,0.28000000000000003,0.34,0.34]
[null,"SINAPI_I",770,"BUCHA DE REDUCAO DE FERRO GALVANIZADO, COM ROSCA BSP, DE 1/2\" X 1/4\"","UN    ",1,3.06,3.06,3.06,3.06]
[null,null,null,"","",null,0,0,0,0]
[null,"MATERIAL (C) - TOTAL",null,null,null,null,null,null,3.4,3.4]
[]
[212,"FONTE","CÓDIGO","DESCRIÇÃO","UNIDADE","COEFIC.","CUSTO UNITÁRIO",null,"CUSTO  TOTAL (A) + (B) + (C) + (D) + (E)"]
[null,null,null,null,null,null,"DESONERADO","NÃO DESONER.","DESONERADO","NÃO DESONER."]
[null,"COMPOSIÇÃO","COMP 212_SEE","NIPLE DE REDUÇÃO 1/2\" X 1/4\" BSP","UN ",null,null,null,9.5,10.050000000000001]
[null,"AGETOP_I",8,"AJUDANTE","h     ",0.16,8.1999999999999993,9.51,1.31,1.52]
[null,"AGETOP_I",11,"ENCANADOR","h     ",0.16,13.4,15.53,2.14,2.48]
[null,null,null,"","",null,0,0,0,0]
[null,"MÃO DE OBRA (B) - TOTAL",null,null,null,null,null,null,3.45,4]
[null,"COTAÇÃO","COT 103_SEE","NIPLE DE REDUÇÃO 1/2\" X 1/4\" BSP","UN",1,6.0533333333333337,6.0533333333333337,6.05,6.05]
[null,null,null,"","",null,0,0,0,0]
[null,null,null,"","",null,0,0,0,0]
[null,"MATERIAL (C) - TOTAL",null,null,null,null,null,null,6.05,6.05]
[]
[213,"FONTE","CÓDIGO","DESCRIÇÃO","UNIDADE","COEFIC.","CUSTO UNITÁRIO",null,"CUSTO  TOTAL (A) + (B) + (C) + (D) + (E)"]
[null,null,null,null,null,null,"DESONERADO","NÃO DESONER.","DESONERADO","NÃO DESONER."]
[null,"COMPOSIÇÃO","COMP 213_SEE","NIPLE DE REDUÇÃO 3/4\" X 1/2\" BSP","UN ",null,null,null,13.16,13.71]
[null,"AGETOP_I",8,"AJUDANTE","h     ",0.16,8.1999999999999993,9.51,1.31,1.52]
[null,"AGETOP_I",11,"ENCANADOR","h     ",0.16,13.4,15.53,2.14,2.48]
[null,null,null,"","",null,0,0,0,0]
[null,"MÃO DE OBRA (B) - TOTAL",null,null,null,null,null,null,3.45,4]
[null,"COTAÇÃO","COT 104_SEE","NIPLE DE REDUÇÃO 3/4\" X 1/2\" BSP","UN",1,9.7099999999999991,9.7099999999999991,9.7100000000000009,9.7100000000000009]
[null,null,null,"","",null,0,0,0,0]
[null,null,null,"","",null,0,0,0,0]
[null,"MATERIAL (C) - TOTAL",null,null,null,null,null,null,9.7100000000000009,9.7100000000000009]
[]
[237,"FONTE","CÓDIGO","DESCRIÇÃO","UNIDADE","COEFIC.","CUSTO UNITÁRIO",null,"CUSTO  TOTAL (A) + (B) + (C) + (D) + (E)"]
[null,null,null,null,null,null,"DESONERADO","NÃO DESONER.","DESONERADO","NÃO DESONER."]
[null,"COMPOSIÇÃO","COMP 237_SEE","FITA ANTICORROSIVA","M",null,null,null,11.14,11.83]
[null,"AGETOP_I",8,"AJUDANTE","h     ",0.2,8.1999999999999993,9.51,1.64,1.9]
[null,"AGETOP_I",12,"ELETRICISTA","h     ",0.2,13.4,15.53,2.68,3.11]
[null,null,null,"","",null,0,0,0,0]
[null,"MÃO DE OBRA (B) - TOTAL",null,null,null,null,null,null,4.32,5.01]
[null,"SINAPI_I",39634,"FITA ADESIVA ANTICORROSIVA DE PVC FLEXIVEL, COR PRETA, PARA PROTECAO TUBULACAO, 50 MM X 30 M (L X C), E= *0,25* MM","M     ",1,6.82,6.82,6.82,6.82]
[null,null,null,"","",null,0,0,0,0]
[null,null,null,"","",null,0,0,0,0]
[null,"MATERIAL (C) - TOTAL",null,null,null,null,null,null,6.82,6.82]
[]
[542,"FONTE","CÓDIGO","DESCRIÇÃO","UNIDADE","COEFIC.","CUSTO UNITÁRIO",null,"CUSTO  TOTAL (A) + (B) + (C) + (D) + (E)"]
[null,null,null,null,null,null,"DESONERADO","NÃO DESONER.","DESONERADO","NÃO DESONER."]
[null,"COMPOSIÇÃO","COMP 542_SEE","VÁLVULA UGV 3/4\" (S) LATÃO","UN ",null,null,null,25.17,26.66]
[null,"AGETOP_I",8,"AJUDANTE","h     ",0.432,8.1999999999999993,9.51,3.54,4.1100000000000003]
[null,"AGETOP_I",11,"ENCANADOR","h     ",0.432,13.4,15.53,5.79,6.71]
[null,null,null,"","",null,0,0,0,0]
[null,"MÃO DE OBRA (B) - TOTAL",null,null,null,null,null,null,9.33,10.82]
[null,"COTAÇÃO","COT 281_SEE","VÁLVULA UGV 3/4\" (S) LATÃO","UN ",1,15.836666666666666,15.836666666666666,15.84,15.84]
[null,null,null,"","",null,0,0,0,0]
[null,null,null,"","",null,0,0,0,0]
[null,"MATERIAL (C) - TOTAL",null,null,null,null,null,null,15.84,15.84]
[]
[543,"FONTE","CÓDIGO","DESCRIÇÃO","UNIDADE","COEFIC.","CUSTO UNITÁRIO",null,"CUSTO  TOTAL (A) + (B) + (C) + (D) + (E)"]
[null,null,null,null,null,null,"DESONERADO","NÃO DESONER.","DESONERADO","NÃO DESONER."]
[null,"COMPOSIÇÃO","COMP 543_SEE","VÁLVULA UGV 1/2\" (S) LATÃO","UN ",null,null,null,24.5,25.990000000000002]
[null,"AGETOP_I",8,"AJUDANTE","h     ",0.432,8.1999999999999993,9.51,3.54,4.1100000000000003]
[null,"AGETOP_I",11,"ENCANADOR","h     ",0.432,13.4,15.53,5.79,6.71]
[null,null,null,"","",null,0,0,0,0]
[null,"MÃO DE OBRA (B) - TOTAL",null,null,null,null,null,null,9.33,10.82]
[null,"COTAÇÃO","COT 282_SEE","VÁLVULA UGV 1/2\" (S) LATÃO","UN ",1,15.166666666666666,15.166666666666666,15.17,15.17]
[null,null,null,"","",null,0,0,0,0]
[null,null,null,"","",null,0,0,0,0]
[null,"MATERIAL (C) - TOTAL",null,null,null,null,null,null,15.17,15.17]
[]
[211,"FONTE","CÓDIGO","DESCRIÇÃO","UNIDADE","COEFIC.","CUSTO UNITÁRIO",null,"CUSTO  TOTAL (A) + (B) + (C) + (D) + (E)"]
[null,null,null,null,null,null,"DESONERADO","NÃO DESONER.","DESONERADO","NÃO DESONER."]
[null,"COMPOSIÇÃO","COMP 211_SEE","REGULADOR DE 2º ESTÁGIO 5KG/H","UN ",null,null,null,85.46,89.419999999999987]
[null,"AGETOP_I",8,"AJUDANTE","h     ",1.1499999999999999,8.1999999999999993,9.51,9.43,10.94]
[null,"AGETOP_I",11,"ENCANADOR","h     ",1.1499999999999999,13.4,15.53,15.41,17.86]
[null,null,null,"","",null,0,0,0,0]
[null,"MÃO DE OBRA (B) - TOTAL",null,null,null,null,null,null,24.84,28.799999999999997]
[null,"COTAÇÃO","COT 102_SEE","REGULADOR DE 2º ESTÁGIO 5KG/H","UN",1,59.833333333333336,59.833333333333336,59.83,59.83]
[null,"AGETOP_I","H689","FITA VEDAROSCA 12 MM","m",2.82,0.28000000000000003,0.28000000000000003,0.79,0.79]
[null,null,null,"","",null,0,0,0,0]
[null,"MATERIAL (C) - TOTAL",null,null,null,null,null,null,60.62,60.62]
[]
[210,"FONTE","CÓDIGO","DESCRIÇÃO","UNIDADE","COEFIC.","CUSTO UNITÁRIO",null,"CUSTO  TOTAL (A) + (B) + (C) + (D) + (E)"]
[null,null,null,null,null,null,"DESONERADO","NÃO DESONER.","DESONERADO","NÃO DESONER."]
[null,"COMPOSIÇÃO","COMP 210_SEE","REGULADOR DE 1º ESTÁGIO 60KG/H MODELO AP-40  COM MANÔMETRO","UN ",null,null,null,231.21,235.17000000000002]
[null,"AGETOP_I",8,"AJUDANTE","h     ",1.1499999999999999,8.1999999999999993,9.51,9.43,10.94]
[null,"AGETOP_I",11,"ENCANADOR","h     ",1.1499999999999999,13.4,15.53,15.41,17.86]
[null,null,null,"","",null,0,0,0,0]
[null,"MÃO DE OBRA (B) - TOTAL",null,null,null,null,null,null,24.84,28.799999999999997]
[null,"COTAÇÃO","COT 101_SEE","REGULADOR DE 1º ESTÁGIO 60KG/H MODELO AP-40  COM MANÔMETRO","UN",1,205.57666666666668,205.57666666666668,205.58,205.58]
[null,"AGETOP_I","H689","FITA VEDAROSCA 12 MM","m",2.82,0.28000000000000003,0.28000000000000003,0.79,0.79]
[null,null,null,"","",null,0,0,0,0]
[null,"MATERIAL (C) - TOTAL",null,null,null,null,null,null,206.37,206.37]
[]
[235,"FONTE","CÓDIGO","DESCRIÇÃO","UNIDADE","COEFIC.","CUSTO UNITÁRIO",null,"CUSTO  TOTAL (A) + (B) + (C) + (D) + (E)"]
[null,null,null,null,null,null,"DESONERADO","NÃO DESONER.","DESONERADO","NÃO DESONER."]
[null,"COMPOSIÇÃO","COMP 235_SEE","PLACA DE SINALIZAÇÃO EM PVC COD 01 - (300X300) PROIBIDO FUMAR","UN ",null,null,null,25.269999999999996,25.389999999999997]
[null,"AGETOP_I",5,"SERVENTE","h     ",0.09,8.1999999999999993,9.51,0.74,0.86]
[null,null,null,"","",null,0,0,0,0]
[null,null,null,"","",null,0,0,0,0]
[null,"MÃO DE OBRA (B) - TOTAL",null,null,null,null,null,null,0.74,0.86]
[null,"AGETOP_I",3070,"BUCHA DE NYLON S-6","un",2,0.04,0.04,0.08,0.08]
[null,"AGETOP_I",3393,"PARAFUSO P/BUCHA S-6","un",2,0.08,0.08,0.16,0.16]
[null,"SINAPI_I",37556,"PLACA DE SINALIZACAO DE SEGURANCA CONTRA INCENDIO, FOTOLUMINESCENTE, QUADRADA, *20 X 20* CM, EM PVC *2* MM ANTI-CHAMAS (SIMBOLOS, CORES E PICTOGRAMAS CONFORME NBR 13434)","UN    ",1,24.29,24.29,24.29,24.29]
[null,"MATERIAL (C) - TOTAL",null,null,null,null,null,null,24.529999999999998,24.529999999999998]
[]
[236,"FONTE","CÓDIGO","DESCRIÇÃO","UNIDADE","COEFIC.","CUSTO UNITÁRIO",null,"CUSTO  TOTAL (A) + (B) + (C) + (D) + (E)"]
[null,null,null,null,null,null,"DESONERADO","NÃO DESONER.","DESONERADO","NÃO DESONER."]
[null,"COMPOSIÇÃO","COMP 236_SEE","PLACA DE SINALIZAÇÃO EM PVC COD 06 - (300X300) PERIGO INFLAMÁVEL","UN ",null,null,null,25.269999999999996,25.389999999999997]
[null,"AGETOP_I",5,"SERVENTE","h     ",0.09,8.1999999999999993,9.51,0.74,0.86]
[null,null,null,"","",null,0,0,0,0]
[null,null,null,"","",null,0,0,0,0]
[null,"MÃO DE OBRA (B) - TOTAL",null,null,null,null,null,null,0.74,0.86]
[null,"AGETOP_I",3070,"BUCHA DE NYLON S-6","un",2,0.04,0.04,0.08,0.08]
[null,"AGETOP_I",3393,"PARAFUSO P/BUCHA S-6","un",2,0.08,0.08,0.16,0.16]
[null,"SINAPI_I",37556,"PLACA DE SINALIZACAO DE SEGURANCA CONTRA INCENDIO, FOTOLUMINESCENTE, QUADRADA, *20 X 20* CM, EM PVC *2* MM ANTI-CHAMAS (SIMBOLOS, CORES E PICTOGRAMAS CONFORME NBR 13434)","UN    ",1,24.29,24.29,24.29,24.29]
[null,"MATERIAL (C) - TOTAL",null,null,null,null,null,null,24.529999999999998,24.529999999999998]
[]
[7,"FONTE","CÓDIGO","DESCRIÇÃO","UNIDADE","COEFIC.","CUSTO UNITÁRIO",null,"CUSTO  TOTAL (A) + (B) + (C) + (D) + (E)"]
[null,null,null,null,null,null,"DESONERADO","NÃO DESONER.","DESONERADO","NÃO DESONER."]
[null,"COMPOSIÇÃO","COMP 007_SEE","GUICHÊ CANTONEIRA/GRADE PARA VIDRO","M²","-","-","-",227.51,234.15]
[null,"AGETOP_I",4,"PEDREIRO","h     ",2.5,13.4,15.53,33.5,38.83]
[null,"AGETOP_I",5,"SERVENTE","h     ",1,8.1999999999999993,9.51,8.1999999999999993,9.51]
[null,"MÃO DE OBRA (B) - TOTAL",null,null,null,null,null,null,41.7,48.339999999999996]
[null,"AGETOP_I",104,"AREIA MEDIA ","m3",9.7000000000000003E-3,82.85,82.85,0.8,0.8]
[null,"AGETOP_I",1221,"CAL HIDRATADA","Kg",0.73,0.54,0.54,0.39,0.39]
[null,"AGETOP_I",1215,"CIMENTO PORTLAND C.P. 32","Kg",2.67,0.39,0.39,1.04,1.04]
[null,"AGETOP_I",2470,"FERRO CANTONEIRA 1/8\" X 7/8\"","Kg",3.5478000000000001,4.3899999999999997,4.3899999999999997,15.57,15.57]
[null,"AGETOP_I",2423,"FERRO CANTONEIRA 1/8\" X 3/4\"","Kg",7.9390000000000001,4.87,4.87,38.659999999999997,38.659999999999997]
[null,"AGETOP_I",2372,"CHAPA PERFILADA No. 18","Kg",13.320600000000001,5.42,5.42,72.2,72.2]
[null,"SINAPI_I",11552,"PERFIL U / CANALETA DE ALUMINIO, DE ABAS IGUAIS, 1/2\" (1,27 X 1,27 CM), PARA PORTA OU JANELA DE CORRER","M     ",1.306,7.72,7.72,10.08,10.08]
[null,"AGETOP_I",2898,"FABRICAÇÃO / MONTAGEM","un",1,36.729999999999997,36.729999999999997,36.729999999999997,36.729999999999997]
[null,"AGETOP_I",2529,"FECHO FIO REDONDO 4\" ZINCADO C/PARAFUSO DA SOPRANO OU EQUIVALENTE","un",2,5.17,5.17,10.34,10.34]
[null,"MATERIAL (C) - TOTAL",null,null,null,null,null,null,185.81,185.81]

{"sheet":"Cotações","index":8,"n_rows":224,"n_cols":9,"rows_kept":224,"cut":false,"hidden":false,"merged":[[8,0,8,8],[0,0,0,8],[1,0,1,9],[2,0,2,8],[3,0,3,6],[3,7,3,9],[4,0,4,6],[4,7,4,9],[5,0,5,8],[6,0,6,6],[6,7,6,9],[7,0,7,6],[7,7,7,9],[9,0,9,2],[9,3,9,6],[9,7,9,8],[10,0,10,2],[10,3,10,6],[10,8,10,9],[14,0,14,8],[15,0,15,9],[11,0,11,9],[12,0,12,2],[12,3,12,6],[12,7,12,8],[13,0,13,2],[13,3,13,6],[13,8,13,9],[16,7,17,8],[18,7,18,8],[19,3,19,4],[19,5,19,6],[19,7,19,8],[16,1,17,1],[16,2,17,2],[16,3,17,3],[16,4,17,4],[16,5,16,6],[23,3,23,4],[23,7,23,8],[24,3,24,4],[24,7,24,8],[25,3,25,8],[20,3,20,4],[20,7,20,8],[21,3,21,4],[21,7,21,8],[22,3,22,4],[22,7,22,8],[27,7,28,8],[29,7,29,8],[30,3,30,4],[30,5,30,6],[30,7,30,8],[27,1,28,1],[27,2,28,2],[27,3,28,3],[27,4,28,4],[27,5,27,6],[34,3,34,4],[34,7,34,8],[35,3,35,4],[35,7,35,8],[36,3,36,8],[31,3,31,4],[31,7,31,8],[32,3,32,4],[32,7,32,8],[33,3,33,4],[33,7,33,8],[38,7,39,8],[40,7,40,8],[41,3,41,4],[41,5,41,6],[41,7,41,8],[38,1,39,1],[38,2,39,2],[38,3,39,3],[38,4,39,4],[38,5,38,6],[45,3,45,4],[45,7,45,8],[46,3,46,4],[46,7,46,8],[47,3,47,8],[42,3,42,4],[42,7,42,8],[43,3,43,4],[43,7,43,8],[44,3,44,4],[44,7,44,8],[49,7,50,8],[51,7,51,8],[52,3,52,4],[52,5,52,6],[52,7,52,8],[49,1,50,1],[49,2,50,2],[49,3,50,3],[49,4,50,4],[49,5,49,6],[56,3,56,4],[56,7,56,8],[57,3,57,4],[57,7,57,8],[58,3,58,8],[53,3,53,4],[53,7,53,8],[54,3,54,4],[54,7,54,8],[55,3,55,4],[55,7,55,8],[60,7,61,8],[62,7,62,8],[63,3,63,4],[63,5,63,6],[63,7,63,8],[60,1,61,1],[60,2,61,2],[60,3,61,3],[60,4,61,4],[60,5,60,6],[67,3,67,4],[67,7,67,8],[68,3,68,4],[68,7,68,8],[69,3,69,8],[64,3,64,4],[64,7,64,8],[65,3,65,4],[65,7,65,8],[66,3,66,4],[66,7,66,8],[71,7,72,8],[73,7,73,8],[74,3,74,4],[74,5,74,6],[74,7,74,8],[71,1,72,1],[71,2,72,2],[71,3,72,3],[71,4,72,4],[71,5,71,6],[78,3,78,4],[78,7,78,8],[79,3,79,4],[79,7,79,8],[80,3,80,8],[75,3,75,4],[75,7,75,8],[76,3,76,4],[76,7,76,8],[77,3,77,4],[77,7,77,8],[82,7,83,8],[84,7,84,8],[85,3,85,4],[85,5,85,6],[85,7,85,8],[82,1,83,1],[82,2,83,2],[82,3,83,3],[82,4,83,4],[82,5,82,6],[89,3,89,4],[89,7,89,8],[90,3,90,4],[90,7,90,8],[91,3,91,8],[86,3,86,4],[86,7,86,8],[87,3,87,4],[87,7,87,8],[88,3,88,4],[88,7,88,8],[93,7,94,8],[95,7,95,8],[96,3,96,4],[96,5,96,6],[96,7,96,8],[93,1,94,1],[93,2,94,2],[93,3,94,3],[93,4,94,4],[93,5,93,6],[100,3,100,4],[100,7,100,8],[101,3,101,4],[101,7,101,8],[102,3,102,8],[97,3,97,4],[97,7,97,8],[98,3,98,4],[98,7,98,8],[99,3,99,4],[99,7,99,8],[104,7,105,8],[106,7,106,8],[107,3,107,4],[107,5,107,6],[107,7,107,8],[104,1,105,1],[104,2,105,2],[104,3,105,3],[104,4,105,4],[104,5,104,6],[111,3,111,4],[111,7,111,8],[112,3,112,4],[112,7,112,8],[113,3,113,8],[108,3,108,4],[108,7,108,8],[109,3,109,4],[109,7,109,8],[110,3,110,4],[110,7,110,8],[115,7,116,8],[117,7,117,8],[118,3,118,4],[118,5,118,6],[118,7,118,8],[115,1,116,1],[115,2,116,2],[115,3,116,3],[115,4,116,4],[115,5,115,6],[122,3,122,4],[122,7,122,8],[123,3,123,4],[123,7,123,8],[124,3,124,8],[119,3,119,4],[119,7,119,8],[120,3,120,4],[120,7,120,8],[121,3,121,4],[121,7,121,8],[126,7,127,8],[128,7,128,8],[129,3,129,4],[129,5,129,6],[129,7,129,8],[126,1,127,1],[126,2,127,2],[126,3,127,3],[126,4,127,4],[126,5,126,6],[133,3,133,4],[133,7,133,8],[134,3,134,4],[134,7,134,8],[135,3,135,8],[130,3,130,4],[130,7,130,8],[131,3,131,4],[131,7,131,8],[132,3,132,4],[132,7,132,8],[137,7,138,8],[139,7,139,8],[140,3,140,4],[140,5,140,6],[140,7,140,8],[137,1,138,1],[137,2,138,2],[137,3,138,3],[137,4,138,4],[137,5,137,6],[144,3,144,4],[144,7,144,8],[145,3,145,4],[145,7,145,8],[146,3,146,8],[141,3,141,4],[141,7,141,8],[142,3,142,4],[142,7,142,8],[143,3,143,4],[143,7,143,8],[148,7,149,8],[150,7,150,8],[151,3,151,4],[151,5,151,6],[151,7,151,8],[148,1,149,1],[148,2,149,2],[148,3,149,3],[148,4,149,4],[148,5,148,6],[155,3,155,4],[155,7,155,8],[156,3,156,4],[156,7,156,8],[157,3,157,8],[152,3,152,4],[152,7,152,8],[153,3,153,4],[153,7,153,8],[154,3,154,4],[154,7,154,8],[159,7,160,8],[161,7,161,8],[162,3,162,4],[162,5,162,6],[162,7,162,8],[159,1,160,1],[159,2,160,2],[159,3,160,3],[159,4,160,4],[159,5,159,6],[166,3,166,4],[166,7,166,8],[167,3,167,4],[167,7,167,8],[168,3,168,8],[163,3,163,4],[163,7,163,8],[164,3,164,4],[164,7,164,8],[165,3,165,4],[165,7,165,8],[170,7,171,8],[172,7,172,8],[173,3,173,4],[173,5,173,6],[173,7,173,8],[170,1,171,1],[170,2,171,2],[170,3,171,3],[170,4,171,4],[170,5,170,6],[177,3,177,4],[177,7,177,8],[178,3,178,4],[178,7,178,8],[179,3,179,8],[174,3,174,4],[174,7,174,8],[175,3,175,4],[175,7,175,8],[176,3,176,4],[176,7,176,8],[181,7,182,8],[183,7,183,8],[184,3,184,4],[184,5,184,6],[184,7,184,8],[181,1,182,1],[181,2,182,2],[181,3,182,3],[181,4,182,4],[181,5,181,6],[188,3,188,4],[188,7,188,8],[189,3,189,4],[189,7,189,8],[190,3,190,8],[185,3,185,4],[185,7,185,8],[186,3,186,4],[186,7,186,8],[187,3,187,4],[187,7,187,8],[192,7,193,8],[194,7,194,8],[195,3,195,4],[195,5,195,6],[195,7,195,8],[192,1,193,1],[192,2,193,2],[192,3,193,3],[192,4,193,4],[192,5,192,6],[199,3,199,4],[199,7,199,8],[200,3,200,4],[200,7,200,8],[201,3,201,8],[196,3,196,4],[196,7,196,8],[197,3,197,4],[197,7,197,8],[198,3,198,4],[198,7,198,8],[203,7,204,8],[205,7,205,8],[206,3,206,4],[206,5,206,6],[206,7,206,8],[203,1,204,1],[203,2,204,2],[203,3,204,3],[203,4,204,4],[203,5,203,6],[210,3,210,4],[210,7,210,8],[211,3,211,4],[211,7,211,8],[212,3,212,8],[207,3,207,4],[207,7,207,8],[208,3,208,4],[208,7,208,8],[209,3,209,4],[209,7,209,8],[214,7,215,8],[216,7,216,8],[217,3,217,4],[217,5,217,6],[217,7,217,8],[214,1,215,1],[214,2,215,2],[214,3,215,3],[214,4,215,4],[214,5,214,6],[221,3,221,4],[221,7,221,8],[222,3,222,4],[222,7,222,8],[223,3,223,8],[218,3,218,4],[218,7,218,8],[219,3,219,4],[219,7,219,8],[220,3,220,4],[220,7,220,8]]}
[]
[]
[]
["UNIDADE ESCOLAR",null,null,null,null,null,null,"CÓDIGO INEP"]
[{"$f":"Orçamento!$O$4","v":"COLÉGIO ESTADUAL PROFESSORA MARIA PEREIRA VASCONCELOS"},null,null,null,null,null,null,{"$f":"Orçamento!$X$4","v":52047318}]
[]
["OBRA",null,null,null,null,null,null,"CIDADE"]
[{"$f":"Orçamento!$O$7","v":"AMPLIAÇÃO E REFORMA"},null,null,null,null,null,null,{"$f":"Orçamento!$X$7","v":"LUZIÂNIA"}]
[]
["CRE",null,null,"ENDEREÇO",null,null,null,"REFERÊNCIA AGETOP"]
[{"$f":"Orçamento!$O$10","v":"LUZIÂNIA"},null,null,{"$f":"Orçamento!$R$10","v":"RUA 92 QD 256 LOTE A SN JARDIM INGA, PQ. ESTRELA DALVA IX, CEP:72853-256"},null,null,null,{"$f":"Orçamento!$X$10","v":"DEZ/18"},{"$f":"Orçamento!$Y$10","v":"ONERADA"}]
[]
["DATA",null,null,"ÁREA TOTAL CONSTRUÍDA (M²)",null,null,null,"REFERÊNCIA SINAPI"]
[{"$f":"Orçamento!$S$7","v":"2020-08-27"},null,null,{"$f":"Orçamento!$S$13","v":0},null,null,null,{"$f":"Orçamento!$X$13","v":"MAR/19"},{"$f":"Orçamento!$Y$13","v":"ONERADA"}]
[]
["COTAÇÕES DE PREÇOS - SEE-GO"]
[null,"FONTE","CÓDIGO","DESCRIÇÃO","UNIDADE","MÉDIA",null,"ÍNDICE RETROAÇÃO"]
[null,null,null,null,null,"DESONERADA","ONERADA"]
[10,"COTAÇÃO","COT 010_SEE","CAPUZ PARA PROTEÇÃO DOS PARA RAIOS","UN ",15.81,15.81,""]
[null,null,"EMPRESA","NOME DA EMPRESA",null,"COTAÇÕES",null,"DATA COTAÇÃO"]
[null,null,"E013 - ELETRO...","ELETROTRANSOL",null,15.81,15.81,"06/02/2019"]
[null,null,null,"",null,null,null,""]
[null,null,null,"",null,null,null,""]
[null,null,"","",null,null,null,""]
[null,null,"","",null,null,null,""]
[null,null,"OBSERVAÇÕES:",""]
[]
[null,"FONTE","CÓDIGO","DESCRIÇÃO","UNIDADE","MÉDIA",null,"ÍNDICE RETROAÇÃO"]
[null,null,null,null,null,"DESONERADA","ONERADA"]
[11,"COTAÇÃO","COT 011_SEE","CAPUZ DE PROTEÇÃO PARA BUCHA DE TRANSFORMADOR","UN ",15.81,15.81,""]
[null,null,"EMPRESA","NOME DA EMPRESA",null,"COTAÇÕES",null,"DATA COTAÇÃO"]
[null,null,"E013 - ELETRO...","ELETROTRANSOL",null,15.81,15.81,"06/02/2019"]
[null,null,null,"",null,null,null,""]
[null,null,null,"",null,null,null,""]
[null,null,"","",null,null,null,""]
[null,null,"","",null,null,null,""]
[null,null,"OBSERVAÇÕES:",""]
[]
[null,"FONTE","CÓDIGO","DESCRIÇÃO","UNIDADE","MÉDIA",null,"ÍNDICE RETROAÇÃO"]
[null,null,null,null,null,"DESONERADA","ONERADA"]
[12,"COTAÇÃO","COT 012_SEE","HASTE ROSQUEADA \"TIRANTE\" 3/8\"","M",5.3833333333333329,5.3833333333333329,""]
[null,null,"EMPRESA","NOME DA EMPRESA",null,"COTAÇÕES",null,"DATA COTAÇÃO"]
[null,null,"E013 - ELETRO...","ELETROTRANSOL",null,5.3833333333333329,5.3833333333333329,"06/02/2019"]
[null,null,null,"",null,null,null,""]
[null,null,null,"",null,null,null,""]
[null,null,"","",null,null,null,""]
[null,null,"","",null,null,null,""]
[null,null,"OBSERVAÇÕES:",""]
[]
[null,"FONTE","CÓDIGO","DESCRIÇÃO","UNIDADE","MÉDIA",null,"ÍNDICE RETROAÇÃO"]
[null,null,null,null,null,"DESONERADA","ONERADA"]
[13,"COTAÇÃO","COT 013_SEE","PORCA SEXTAVADA 3/8\"","UN ",0.13,0.13,""]
[null,null,"EMPRESA","NOME DA EMPRESA",null,"COTAÇÕES",null,"DATA COTAÇÃO"]
[null,null,"E013 - ELETRO...","ELETROTRANSOL",null,0.12,0.12,"06/02/2019"]
[null,null,"E055 - SANETA...","SANETAM COMERCIO DE TUBOS E CONEXOES LTDA.",null,0.13,0.13,"06/02/2019"]
[null,null,"E056 - AC COM...","AC COMERCIO DE FERRAMENTAS E PRODUTOS PARA FIXACAO EIRE",null,0.14000000000000001,0.14000000000000001,"06/02/2019"]
[null,null,"","",null,null,null,""]
[null,null,"","",null,null,null,""]
[null,null,"OBSERVAÇÕES:",""]
[]
[null,"FONTE","CÓDIGO","DESCRIÇÃO","UNIDADE","MÉDIA",null,"ÍNDICE RETROAÇÃO"]
[null,null,null,null,null,"DESONERADA","ONERADA"]
[195,"COTAÇÃO","COT 195_SEE","LÂMPADA LED TUBULAR 18W ","UN",21.959999999999997,21.959999999999997,""]
[null,null,"EMPRESA","NOME DA EMPRESA",null,"COTAÇÕES",null,"DATA COTAÇÃO"]
[null,null,"E030 - AJEL M...","AJEL MATERIAIS ELÉTRICOS",null,19.89,19.89,""]
[null,null,"E013 - ELETRO...","ELETROTRANSOL",null,25.99,25.99,""]
[null,null,"E014 - MAKRO ...","MAKRO SERVICE",null,20,20,""]
[null,null,"","",null,null,null,""]
[null,null,"","",null,null,null,""]
[null,null,"OBSERVAÇÕES:",""]
[]
[null,"FONTE","CÓDIGO","DESCRIÇÃO","UNIDADE","MÉDIA",null,"ÍNDICE RETROAÇÃO"]
[null,null,null,null,null,"DESONERADA","ONERADA"]
[17,"COTAÇÃO","COT 017_SEE","REGISTRO DE GAVETA COM HASTE ASCENDENTE DE BRONZE 2 1/2\"","UN ",231.66666666666666,231.66666666666666,""]
[null,null,"EMPRESA","NOME DA EMPRESA",null,"COTAÇÕES",null,"DATA COTAÇÃO"]
[null,null,"E034 - VALK T...","VALK TUBOS",null,220,220,""]
[null,null,"E035 - ACIONA...","ACIONAR SERVIÇOS E EQUIPAMENTOS CONTRA INCÊNDIO",null,250,250,""]
[null,null,"E038 - CENTER...","CENTER FIRE",null,225,225,""]
[null,null,"","",null,null,null,""]
[null,null,"","",null,null,null,""]
[null,null,"OBSERVAÇÕES:",""]
[]
[null,"FONTE","CÓDIGO","DESCRIÇÃO","UNIDADE","MÉDIA",null,"ÍNDICE RETROAÇÃO"]
[null,null,null,null,null,"DESONERADA","ONERADA"]
[88,"COTAÇÃO","COT 088_SEE","BOTOEIRA BOMBA DE INCÊNDIO C/ MARTELO CONVENCIONAL/ ANALÓGICA","UN",63.5,63.5,""]
[null,null,"EMPRESA","NOME DA EMPRESA",null,"COTAÇÕES",null,"DATA COTAÇÃO"]
[null,null,"E034 - VALK T...","VALK TUBOS",null,58,58,""]
[null,null,"E035 - ACIONA...","ACIONAR SERVIÇOS E EQUIPAMENTOS CONTRA INCÊNDIO",null,67.5,67.5,""]
[null,null,"E038 - CENTER...","CENTER FIRE",null,65,65,""]
[null,null,"","",null,null,null,""]
[null,null,"","",null,null,null,""]
[null,null,"OBSERVAÇÕES:",""]
[]
[null,"FONTE","CÓDIGO","DESCRIÇÃO","UNIDADE","MÉDIA",null,"ÍNDICE RETROAÇÃO"]
[null,null,null,null,null,"DESONERADA","ONERADA"]
[90,"COTAÇÃO","COT 090_SEE","ACIONADOR MANUAL DE ALARME","UN",83.333333333333329,83.333333333333329,""]
[null,null,"EMPRESA","NOME DA EMPRESA",null,"COTAÇÕES",null,"DATA COTAÇÃO"]
[null,null,"E034 - VALK T...","VALK TUBOS",null,120,120,""]
[null,null,"E035 - ACIONA...","ACIONAR SERVIÇOS E EQUIPAMENTOS CONTRA INCÊNDIO",null,65,65,""]
[null,null,"E038 - CENTER...","CENTER FIRE",null,65,65,""]
[null,null,"","",null,null,null,""]
[null,null,"","",null,null,null,""]
[null,null,"OBSERVAÇÕES:",""]
[]
[null,"FONTE","CÓDIGO","DESCRIÇÃO","UNIDADE","MÉDIA",null,"ÍNDICE RETROAÇÃO"]
[null,null,null,null,null,"DESONERADA","ONERADA"]
[92,"COTAÇÃO","COT 092_SEE","CENTRAL DE DETECÇÃO E ALARME DE 40 SETORES COM BATERIA (PREÇO MÉDIO)","UN",963.33333333333337,963.33333333333337,""]
[null,null,"EMPRESA","NOME DA EMPRESA",null,"COTAÇÕES",null,"DATA COTAÇÃO"]
[null,null,"E034 - VALK T...","VALK TUBOS",null,840,840,""]
[null,null,"E035 - ACIONA...","ACIONAR SERVIÇOS E EQUIPAMENTOS CONTRA INCÊNDIO",null,980,980,""]
[null,null,"E038 - CENTER...","CENTER FIRE",null,1070,1070,""]
[null,null,"","",null,null,null,""]
[null,null,"","",null,null,null,""]
[null,null,"OBSERVAÇÕES:",""]
[]
[null,"FONTE","CÓDIGO","DESCRIÇÃO","UNIDADE","MÉDIA",null,"ÍNDICE RETROAÇÃO"]
[null,null,null,null,null,"DESONERADA","ONERADA"]
[8,"COTAÇÃO","COT 008_SEE","CONJUNTO MOTOR-BOMBA ELÉTRICA TRIFÁSICO 380/220 V PARA VZ= 24,33 M³/H, HM= 46,24 M POTÊNCIA= 7,5 CV","UN ",3792.6666666666665,3792.6666666666665,""]
[null,null,"EMPRESA","NOME DA EMPRESA",null,"COTAÇÕES",null,"DATA COTAÇÃO"]
[null,null,"E036 - TECNOB...","TECNOBOMBAS",null,4200,4200,"05.02.2019"]
[null,null,"E039 - ESPÍND...","ESPÍNDOLA E ANDRADE LTDA-ME",null,3178,3178,"05.02.2019"]
[null,null,"E054 - R M D ...","R M D DE SOUZA EIRELI - ME",null,4000,4000,"06.02.2019"]
[null,null,"","",null,null,null,""]
[null,null,"","",null,null,null,""]
[null,null,"OBSERVAÇÕES:",""]
[]
[null,"FONTE","CÓDIGO","DESCRIÇÃO","UNIDADE","MÉDIA",null,"ÍNDICE RETROAÇÃO"]
[null,null,null,null,null,"DESONERADA","ONERADA"]
[286,"COTAÇÃO","COT 286_SEE","BUJÃO DE REBORDO 2.1/2\"","UN ",15,15,""]
[null,null,"EMPRESA","NOME DA EMPRESA",null,"COTAÇÕES",null,"DATA COTAÇÃO"]
[null,null,"E076 - GOIÂNI...","GOIÂNIA TUBOS",null,15,15,"12/04/2019"]
[null,null,null,"",null,null,null,""]
[null,null,null,"",null,null,null,""]
[null,null,"","",null,null,null,""]
[null,null,"","",null,null,null,""]
[null,null,"OBSERVAÇÕES:",""]
[]
[null,"FONTE","CÓDIGO","DESCRIÇÃO","UNIDADE","MÉDIA",null,"ÍNDICE RETROAÇÃO"]
[null,null,null,null,null,"DESONERADA","ONERADA"]
[290,"COTAÇÃO","COT 290_SEE","VÁLVULA DE ESFERA BRUTA EM METAL, BITOLA 2.1/2\"","UN ",285.52600000000001,285.52600000000001,""]
[null,null,"EMPRESA","NOME DA EMPRESA",null,"COTAÇÕES",null,"DATA COTAÇÃO"]
[null,null,"E034 - VALK T...","VALK TUBOS",null,278.8,278.8,"26/04/2019"]
[null,null,"E076 - GOIÂNI...","GOIÂNIA TUBOS",null,209.4,209.4,"26/04/2019"]
[null,null,"E081 - CASA I...","CASA IRACEMA",null,287.10000000000002,287.10000000000002,"26/04/2019"]
[null,null,"E082 - HIDROR...","HIDROREPAROS COM. DE FERR. E HIDRAULICOS",null,272.54000000000002,272.54000000000002,"26/04/2019"]
[null,null,"E083 - REBRAC...","REBRACE COMERCIO E REPRESENTAÇÕES EIRELI",null,379.79,379.79,"26/04/2019"]
[null,null,"OBSERVAÇÕES:",""]
[]
[null,"FONTE","CÓDIGO","DESCRIÇÃO","UNIDADE","MÉDIA",null,"ÍNDICE RETROAÇÃO"]
[null,null,null,null,null,"DESONERADA","ONERADA"]
[291,"COTAÇÃO","COT 291_SEE","FLANGE GALVANIZADA 2.1/2\"","UN ",151.89666666666668,151.89666666666668,""]
[null,null,"EMPRESA","NOME DA EMPRESA",null,"COTAÇÕES",null,"DATA COTAÇÃO"]
[null,null,"E081 - CASA I...","CASA IRACEMA",null,339.39,339.39,"26/04/2019"]
[null,null,"E083 - REBRAC...","REBRACE COMERCIO E REPRESENTAÇÕES EIRELI",null,70.12,70.12,"26/04/2019"]
[null,null,"E084 - CRS...","CRS",null,46.18,46.18,"26/04/2019"]
[null,null,"","",null,null,null,""]
[null,null,"","",null,null,null,""]
[null,null,"OBSERVAÇÕES:",""]
[]
[null,"FONTE","CÓDIGO","DESCRIÇÃO","UNIDADE","MÉDIA",null,"ÍNDICE RETROAÇÃO"]
[null,null,null,null,null,"DESONERADA","ONERADA"]
[103,"COTAÇÃO","COT 103_SEE","NIPLE DE REDUÇÃO 1/2\" X 1/4\" BSP","UN",6.0533333333333337,6.0533333333333337,""]
[null,null,"EMPRESA","NOME DA EMPRESA",null,"COTAÇÕES",null,"DATA COTAÇÃO"]
[null,null,"E070 - FOCO R...","FOCO REPRESENTAÇÃO E CONSULTORIA LTDA-ME",null,4.46,4.46,"12/02/2019"]
[null,null,"E071 - CASA D...","CASA DAS PEÇAS COM E INDUSTRIA DE FOGOES LTDA",null,3.9,3.9,"11/02/2019"]
[null,null,"E072 - AMIG I...","AMIG INSTALAÇÃO DE REDE DE GÁS E INCÊNDIO",null,9.8000000000000007,9.8000000000000007,"08/02/2019"]
[null,null,"","",null,null,null,""]
[null,null,"","",null,null,null,""]
[null,null,"OBSERVAÇÕES:",""]
[]
[null,"FONTE","CÓDIGO","DESCRIÇÃO","UNIDADE","MÉDIA",null,"ÍNDICE RETROAÇÃO"]
[null,null,null,null,null,"DESONERADA","ONERADA"]
[104,"COTAÇÃO","COT 104_SEE","NIPLE DE REDUÇÃO 3/4\" X 1/2\" BSP","UN",9.7099999999999991,9.7099999999999991,""]
[null,null,"EMPRESA","NOME DA EMPRESA",null,"COTAÇÕES",null,"DATA COTAÇÃO"]
[null,null,"E070 - FOCO R...","FOCO REPRESENTAÇÃO E CONSULTORIA LTDA-ME",null,10.93,10.93,"12/02/2019"]
[null,null,"E071 - CASA D...","CASA DAS PEÇAS COM E INDUSTRIA DE FOGOES LTDA",null,5.5,5.5,"11/02/2019"]
[null,null,"E072 - AMIG I...","AMIG INSTALAÇÃO DE REDE DE GÁS E INCÊNDIO",null,12.7,12.7,"08/02/2019"]
[null,null,"","",null,null,null,""]
[null,null,"","",null,null,null,""]
[null,null,"OBSERVAÇÕES:",""]
[]
[null,"FONTE","CÓDIGO","DESCRIÇÃO","UNIDADE","MÉDIA",null,"ÍNDICE RETROAÇÃO"]
[null,null,null,null,null,"DESONERADA","ONERADA"]
[281,"COTAÇÃO","COT 281_SEE","VÁLVULA UGV 3/4\" (S) LATÃO","UN ",15.836666666666666,15.836666666666666,""]
[null,null,"EMPRESA","NOME DA EMPRESA",null,"COTAÇÕES",null,"DATA COTAÇÃO"]
[null,null,"E070 - FOCO R...","FOCO REPRESENTAÇÃO E CONSULTORIA LTDA-ME",null,12.51,12.51,"12/02/2019"]
[null,null,"E071 - CASA D...","CASA DAS PEÇAS COM E INDUSTRIA DE FOGOES LTDA",null,17.5,17.5,"11/02/2019"]
[null,null,"E072 - AMIG I...","AMIG INSTALAÇÃO DE REDE DE GÁS E INCÊNDIO",null,17.5,17.5,"08/02/2019"]
[null,null,"",""]
[null,null,"","",null,null,null,""]
[null,null,"OBSERVAÇÕES:",""]
[]
[null,"FONTE","CÓDIGO","DESCRIÇÃO","UNIDADE","MÉDIA",null,"ÍNDICE RETROAÇÃO"]
[null,null,null,null,null,"DESONERADA","ONERADA"]
[282,"COTAÇÃO","COT 282_SEE","VÁLVULA UGV 1/2\" (S) LATÃO","UN ",15.166666666666666,15.166666666666666,""]
[null,null,"EMPRESA","NOME DA EMPRESA",null,"COTAÇÕES",null,"DATA COTAÇÃO"]
[null,null,"E070 - FOCO R...","FOCO REPRESENTAÇÃO E CONSULTORIA LTDA-ME",null,11.2,11.2,"12/02/2019"]
[null,null,"E071 - CASA D...","CASA DAS PEÇAS COM E INDUSTRIA DE FOGOES LTDA",null,17.5,17.5,"11/02/2019"]
[null,null,"E072 - AMIG I...","AMIG INSTALAÇÃO DE REDE DE GÁS E INCÊNDIO",null,16.8,16.8,"08/02/2019"]
[null,null,"","",null,null,null,""]
[null,null,"","",null,null,null,""]
[null,null,"OBSERVAÇÕES:",""]
[]
[null,"FONTE","CÓDIGO","DESCRIÇÃO","UNIDADE","MÉDIA",null,"ÍNDICE RETROAÇÃO"]
[null,null,null,null,null,"DESONERADA","ONERADA"]
[102,"COTAÇÃO","COT 102_SEE","REGULADOR DE 2º ESTÁGIO 5KG/H","UN",59.833333333333336,59.833333333333336,""]
[null,null,"EMPRESA","NOME DA EMPRESA",null,"COTAÇÕES",null,"DATA COTAÇÃO"]
[null,null,"E070 - FOCO R...","FOCO REPRESENTAÇÃO E CONSULTORIA LTDA-ME",null,38.9,38.9,"12/02/2019"]
[null,null,"E071 - CASA D...","CASA DAS PEÇAS COM E INDUSTRIA DE FOGOES LTDA",null,55.599999999999994,55.599999999999994,"11/02/2019"]
[null,null,"E072 - AMIG I...","AMIG INSTALAÇÃO DE REDE DE GÁS E INCÊNDIO",null,85,85,"08/02/2019"]
[null,null,"","",null,null,null,""]
[null,null,"","",null,null,null,""]
[null,null,"OBSERVAÇÕES:","AMIG enviou cotação de regulador de 2º estágio de 12kg/h."]
[]
[null,"FONTE","CÓDIGO","DESCRIÇÃO","UNIDADE","MÉDIA",null,"ÍNDICE RETROAÇÃO"]
[null,null,null,null,null,"DESONERADA","ONERADA"]
[101,"COTAÇÃO","COT 101_SEE","REGULADOR DE 1º ESTÁGIO 60KG/H MODELO AP-40  COM MANÔMETRO","UN",205.57666666666668,205.57666666666668,""]
[null,null,"EMPRESA","NOME DA EMPRESA",null,"COTAÇÕES",null,"DATA COTAÇÃO"]
[null,null,"E070 - FOCO R...","FOCO REPRESENTAÇÃO E CONSULTORIA LTDA-ME",null,148.72999999999999,148.72999999999999,"12/02/2019"]
[null,null,"E071 - CASA D...","CASA DAS PEÇAS COM E INDUSTRIA DE FOGOES LTDA",null,198,198,"11/02/2019"]
[null,null,"E072 - AMIG I...","AMIG INSTALAÇÃO DE REDE DE GÁS E INCÊNDIO",null,270,270,"08/02/2019"]
[null,null,"","",null,null,null,""]
[null,null,"","",null,null,null,""]
[null,null,"OBSERVAÇÕES:",""]