{"text_format":"1","workbook":"xlsx","n_sheets":8,"sheets":["Orçamento","Resumo ","Somatório","Cronog_120_Dias","Composição BDI","Relatório CENTRAL","Parc Maior Relev","Composições"],"not_rendered":{"charts":0,"images":4,"macros":1,"external_links":1,"defined_names":123,"comments":3,"pivot_tables":0},"unopened":[],"bounds":{"document_bytes":16777216,"sheet_cells":100000,"rows_first":2000,"rows_last":500,"rows_between":2000,"halvings":0,"cell_chars":16384,"cell_head_chars":4096},"cells_cut":0,"cells_raw":0,"read":"whole","date_system":"1900"}

{"sheet":"Orçamento","index":0,"n_rows":660,"n_cols":24,"rows_kept":660,"cut":false,"hidden":false,"merged":[[640,15,640,17],[640,18,640,20],[640,21,640,22],[596,16,596,22],[652,18,652,20],[652,21,652,22],[647,15,647,17],[647,18,647,20],[647,21,647,22],[648,15,648,17],[648,18,648,20],[648,21,648,22],[649,15,649,17],[649,18,649,20],[649,21,649,22],[641,18,641,20],[641,21,641,22],[642,15,642,17],[642,18,642,20],[642,21,642,22],[643,15,643,17],[643,18,643,20],[643,21,643,22],[638,15,638,17],[638,18,638,20],[638,21,638,22],[639,15,639,17],[628,14,628,17],[635,15,635,17],[601,15,601,17],[656,18,656,20],[656,21,656,22],[644,15,644,17],[644,18,644,20],[644,21,644,22],[645,15,645,17],[645,18,645,20],[645,21,645,22],[646,15,646,17],[646,18,646,20],[646,21,646,22],[650,15,650,17],[650,18,650,20],[650,21,650,22],[651,15,651,17],[651,18,651,20],[651,21,651,22],[652,15,652,17],[641,15,641,17],[639,18,639,20],[639,21,639,22],[659,18,659,20],[659,21,659,22],[656,14,656,17],[653,15,653,17],[653,18,653,20],[653,21,653,22],[654,15,654,17],[654,18,654,20],[654,21,654,22],[655,15,655,17],[655,18,655,20],[655,21,655,22],[658,18,658,20],[658,21,658,22],[657,18,657,20],[657,21,657,22],[634,14,634,23],[635,18,635,20],[635,21,635,22],[636,15,636,17],[636,18,636,20],[636,21,636,22],[637,15,637,17],[637,18,637,20],[637,21,637,22],[592,16,592,22],[593,16,593,22],[594,16,594,22],[3,21,3,22],[2,21,2,22],[5,21,5,22],[10,14,10,23],[13,14,13,23],[6,21,6,22],[9,17,9,20],[2,14,2,20],[3,14,3,20],[5,18,5,20],[6,18,6,20],[11,18,11,20],[12,18,12,20],[6,14,6,17],[5,14,5,17],[614,15,614,17],[615,15,615,17],[616,15,616,17],[617,15,617,17],[618,15,618,17],[619,15,619,17],[620,15,620,17],[621,15,621,17],[622,15,622,17],[602,15,602,17],[603,15,603,17],[604,15,604,17],[605,15,605,17],[606,15,606,17],[607,15,607,17],[608,15,608,17],[609,15,609,17],[610,15,610,17],[623,15,623,17],[624,15,624,17],[625,15,625,17],[626,15,626,17],[627,15,627,17],[600,14,600,23],[589,20,589,21],[588,20,588,21],[584,17,589,17],[584,20,584,21],[601,18,601,20],[601,21,601,22],[602,18,602,20],[602,21,602,22],[590,20,590,21],[610,18,610,20],[610,21,610,22],[611,18,611,20],[611,21,611,22],[612,18,612,20],[612,21,612,22],[613,18,613,20],[613,21,613,22],[625,18,625,20],[628,21,628,22],[625,21,625,22],[626,18,626,20],[626,21,626,22],[627,18,627,20],[627,21,627,22],[617,18,617,20],[617,21,617,22],[624,18,624,20],[624,21,624,22],[619,21,619,22],[620,18,620,20],[620,21,620,22],[622,18,622,20],[618,18,618,20],[618,21,618,22],[619,18,619,20],[629,21,629,22],[616,18,616,20],[616,21,616,22],[609,18,609,20],[609,21,609,22],[631,18,631,20],[631,21,631,22],[585,20,585,21],[607,18,607,20],[607,21,607,22],[608,18,608,20],[608,21,608,22],[606,18,606,20],[606,21,606,22],[615,18,615,20],[586,20,586,21],[597,18,597,22],[603,18,603,20],[603,21,603,22],[604,18,604,20],[604,21,604,22],[605,18,605,20],[605,21,605,22],[628,18,628,20],[595,16,595,22],[630,18,630,20],[630,21,630,22],[0,14,0,22],[8,14,8,16],[9,14,9,16],[11,14,11,16],[12,14,12,16],[14,14,14,22],[1,14,1,22],[4,14,4,22],[7,14,7,22],[614,18,614,20],[614,21,614,22],[622,21,622,22],[611,15,611,17],[612,15,612,17],[613,15,613,17],[615,21,615,22],[623,18,623,20],[623,21,623,22],[621,18,621,20],[621,21,621,22],[629,18,629,20]]}
[]
[]
[null,null,null,null,null,null,null,null,null,null,null,null,null,null,"UNIDADE ESCOLAR",null,null,null,null,null,null,"CÓDIGO INEP"]
[null,null,null,null,null,null,null,null,null,null,null,null,null,null,"COLÉGIO ESTADUAL CARLOS DRUMOND DE ANDRADE",null,null,null,null,null,null,52092127]
[]
["Nmax",null,null,null,null,null,null,null,null,null,null,null,null,null,"OBRA",null,null,null,"DATA",null,null,"CIDADE"]
[{"$f":"MAX($C$18:$C$584)","v":4},null,null,null,null,null,null,null,null,null,null,null,null,null,"REFORMA",null,null,null,"2020-09-02",null,null,"NOVO GAMA"]
[]
[null,null,null,null,null,null,null,null,null,null,null,null,null,null,"CRE",null,null,"ENDEREÇO",null,null,null,"REFERÊNCIA AGETOP"]
[null,null,null,null,null,null,null,null,null,null,null,null,null,null,"NOVO GAMA",null,null,"AV. SEBASTIÃO VARGAS FILHO QD 08 S/N VALE DO PEDREGA, VALE DO PEDREGAL, CEP:72860-785",null,null,null,"ABR/19","ONERADA"]
[]
[null,null,null,null,null,null,null,null,null,null,null,null,null,null,"ÁREA EXISTENTE (M²)",null,null,"ÁREA A CONSTRUIR (M²)","ÁREA TOTAL CONSTRUÍDA (M²)",null,null,"REFERÊNCIA SINAPI"]
[null,null,null,null,null,null,null,null,null,null,null,null,null,null,2578.4499999999998,null,null,89.67,2668.12,null,null,"SET/19","ONERADA"]
[]
[null,null,null,null,null,null,null,null,null,null,null,"FILTRO",null,null,"PLANILHA ORÇAMENTÁRIA"]
["Nível E","Save Nivel","Nível C","Altura","n1","n2","n3","n4","n5","Czero","Cnível","↓","Nível","Nível Corrigido","ITEM","TABELA","CODIGO","DESCRIÇÃO DOS SERVIÇOS","UNID","QUANT","MAT","MO","T.SERVIÇO","OBSERVAÇÕES¹"]
[{"$f":"CHOOSE(1+LOG(1+2*(ORÇAMENTO.Nivel=\"Nível 1\")+4*(ORÇAMENTO.Nivel=\"Nível 2\")+8*(ORÇAMENTO.Nivel=\"Nível 3\")+16*(ORÇAMENTO.Nivel=\"Nível 4\")+32*(ORÇAMENTO.Nivel=\"Serviço\"),2),0,1,2,3,4,\"S\")","v":"S"},{"$f":"IF(OR(C17=\"s\",C17=0),OFFSET(B17,-1,0),C17)","v":"Save Nivel"},{"$f":"IF(OFFSET(C17,-1,0)=\"L\",1,IF(OFFSET(C17,-1,0)=1,2,IF(OR(A17=\"s\",A17=0),\"S\",IF(AND(OFFSET(C17,-1,0)=2,A17=4),3,IF(AND(OR(OFFSET(C17,-1,0)=\"s\",OFFSET(C17,-1,0)=0),A17<>\"s\",A17>OFFSET(B17,-1,0)),OFFSET(B17,-1,0),A17)))))","v":"S"},{"$f":"IF(OR(C17=\"S\",C17=0),0,IF(ISERROR(K17),J17,SMALL(J17:K17,1)))","v":0},{"$f":"IF($C17=1,OFFSET(E17,-1,0)+1,OFFSET(E17,-1,0))","v":"n1"},{"$f":"IF($C17=1,0,IF($C17=2,OFFSET(F17,-1,0)+1,OFFSET(F17,-1,0)))","v":"n2"},{"$f":"IF(AND($C17<=2,$C17<>0),0,IF($C17=3,OFFSET(G17,-1,0)+1,OFFSET(G17,-1,0)))","v":"n3"},{"$f":"IF(AND($C17<=3,$C17<>0),0,IF($C17=4,OFFSET(H17,-1,0)+1,OFFSET(H17,-1,0)))","v":"n4"},{"$f":"IF(AND($C17<=4,$C17<>0),0,IF(AND($C17=\"S\",$W17>0),OFFSET(I17,-1,0)+1,OFFSET(I17,-1,0)))","v":"n5"},{"$f":"IF(OR($C17=\"S\",$C17=0),0,MATCH(0,OFFSET($D17,1,$C17,ROW($C$584)-ROW($C17)),0))","v":0},{"$f":"IF(OR($C17=\"S\",$C17=0),0,MATCH(OFFSET($D17,0,$C17)+1,OFFSET($D17,1,$C17,ROW($C$584)-ROW($C17)),0))","v":0},"","Serviço","Serviço","-","AGETOP",null,"(sem código)","-",null,0,0,0,""]
[0,null,"L",{"$f":"COUNTA(OFFSET(D18,1,0):D$584)","v":565},{"$f":"LEFT(O19,1)-1","v":0},null,null,null,null,null,null,"F","LOTE","LOTE","REFORMA - COLÉGIO ESTADUAL CARLOS DRUMOND DE ANDRADE",null,null,null,null,null,null,null,538780.87000000034]
[1,{"$f":"IF(OR(C19=\"s\",C19=0),OFFSET(B19,-1,0),C19)","v":1},{"$f":"IF(OFFSET(C19,-1,0)=\"L\",1,IF(OFFSET(C19,-1,0)=1,2,IF(OR(A19=\"s\",A19=0),\"S\",IF(AND(OFFSET(C19,-1,0)=2,A19=4),3,IF(AND(OR(OFFSET(C19,-1,0)=\"s\",OFFSET(C19,-1,0)=0),A19<>\"s\",A19>OFFSET(B19,-1,0)),OFFSET(B19,-1,0),A19)))))","v":1},{"$f":"IF(OR(C19=\"S\",C19=0),0,IF(ISERROR(K19),J19,SMALL(J19:K19,1)))","v":374},{"$f":"IF($C19=1,OFFSET(E19,-1,0)+1,OFFSET(E19,-1,0))","v":1},{"$f":"IF($C19=1,0,IF($C19=2,OFFSET(F19,-1,0)+1,OFFSET(F19,-1,0)))","v":0},{"$f":"IF(AND($C19<=2,$C19<>0),0,IF($C19=3,OFFSET(G19,-1,0)+1,OFFSET(G19,-1,0)))","v":0},{"$f":"IF(AND($C19<=3,$C19<>0),0,IF($C19=4,OFFSET(H19,-1,0)+1,OFFSET(H19,-1,0)))","v":0},0,{"$f":"IF(OR($C19=\"S\",$C19=0),0,MATCH(0,OFFSET($D19,1,$C19,ROW($C$584)-ROW($C19)),0))","v":565},{"$f":"IF(OR($C19=\"S\",$C19=0),0,MATCH(OFFSET($D19,0,$C19)+1,OFFSET($D19,1,$C19,ROW($C$584)-ROW($C19)),0))","v":374},"F","Nível 1","Nível 1","1.","AGETOP",null,"REFORMA"]
[2,{"$f":"IF(OR(C20=\"s\",C20=0),OFFSET(B20,-1,0),C20)","v":2},{"$f":"IF(OFFSET(C20,-1,0)=\"L\",1,IF(OFFSET(C20,-1,0)=1,2,IF(OR(A20=\"s\",A20=0),\"S\",IF(AND(OFFSET(C20,-1,0)=2,A20=4),3,IF(AND(OR(OFFSET(C20,-1,0)=\"s\",OFFSET(C20,-1,0)=0),A20<>\"s\",A20>OFFSET(B20,-1,0)),OFFSET(B20,-1,0),A20)))))","v":2},{"$f":"IF(OR(C20=\"S\",C20=0),0,IF(ISERROR(K20),J20,SMALL(J20:K20,1)))","v":31},{"$f":"IF($C20=1,OFFSET(E20,-1,0)+1,OFFSET(E20,-1,0))","v":1},{"$f":"IF($C20=1,0,IF($C20=2,OFFSET(F20,-1,0)+1,OFFSET(F20,-1,0)))","v":1},{"$f":"IF(AND($C20<=2,$C20<>0),0,IF($C20=3,OFFSET(G20,-1,0)+1,OFFSET(G20,-1,0)))","v":0},{"$f":"IF(AND($C20<=3,$C20<>0),0,IF($C20=4,OFFSET(H20,-1,0)+1,OFFSET(H20,-1,0)))","v":0},0,373,31,"F","Nível 2","Nível 2","1.1.","AGETOP",null,"SERVIÇOS PRELIMINARES"]
[{"$f":"CHOOSE(1+LOG(1+2*(ORÇAMENTO.Nivel=\"Nível 1\")+4*(ORÇAMENTO.Nivel=\"Nível 2\")+8*(ORÇAMENTO.Nivel=\"Nível 3\")+16*(ORÇAMENTO.Nivel=\"Nível 4\")+32*(ORÇAMENTO.Nivel=\"Serviço\"),2),0,1,2,3,4,\"S\")","v":3},{"$f":"IF(OR(C21=\"s\",C21=0),OFFSET(B21,-1,0),C21)","v":3},{"$f":"IF(OFFSET(C21,-1,0)=\"L\",1,IF(OFFSET(C21,-1,0)=1,2,IF(OR(A21=\"s\",A21=0),\"S\",IF(AND(OFFSET(C21,-1,0)=2,A21=4),3,IF(AND(OR(OFFSET(C21,-1,0)=\"s\",OFFSET(C21,-1,0)=0),A21<>\"s\",A21>OFFSET(B21,-1,0)),OFFSET(B21,-1,0),A21)))))","v":3},{"$f":"IF(OR(C21=\"S\",C21=0),0,IF(ISERROR(K21),J21,SMALL(J21:K21,1)))","v":2},{"$f":"IF($C21=1,OFFSET(E21,-1,0)+1,OFFSET(E21,-1,0))","v":1},{"$f":"IF($C21=1,0,IF($C21=2,OFFSET(F21,-1,0)+1,OFFSET(F21,-1,0)))","v":1},{"$f":"IF(AND($C21<=2,$C21<>0),0,IF($C21=3,OFFSET(G21,-1,0)+1,OFFSET(G21,-1,0)))","v":1},{"$f":"IF(AND($C21<=3,$C21<>0),0,IF($C21=4,OFFSET(H21,-1,0)+1,OFFSET(H21,-1,0)))","v":0},{"$f":"IF(AND($C21<=4,$C21<>0),0,IF(AND($C21=\"S\",$W21>0),OFFSET(I21,-1,0)+1,OFFSET(I21,-1,0)))","v":0},30,2,"F","Nível 3","Nível 3","1.1.1.","SINAPI",null,"PERGOLADO","-",null,null,null,null,""]
["S",3,"S",0,1,1,1,0,0,0,0,"F","Serviço","Serviço","1.1.1.0.1.","AGETOP",20121,"DEM. MANUAL EM CONCR.SIMPLES C/TR.ATE CB.E CARGA (O.C.)","m3    ",0.12,null,null,null,""]
[3,3,3,7,1,1,2,0,0,28,7,"F","Nível 3","Nível 3","1.1.2.","SINAPI",null,"COPA","-",null,null,null,null,""]
["S",3,"S",0,1,1,2,0,0,0,0,"F","Serviço","Serviço","1.1.2.0.1.","AGETOP",20118,"DEM.ALVEN.TIJOLO S/REAP. C/TR.ATE CB. E CARGA","m3    ",3.7994999999999997,null,null,null,""]
["S",3,"S",0,1,1,2,0,0,0,0,"F","Serviço","Serviço","1.1.2.0.2.","AGETOP",20112,"DEM.PISO CERAM. INCLUS. RETIRADA DE CONTRAPISO SOBRE LASTRO CONC.C/TR.CB.E CARGA","m2    ",9.84,null,null,null,""]
["S",3,"S",0,1,1,2,0,0,0,0,"F","Serviço","Serviço","1.1.2.0.3.","AGETOP",20139,"DEMOLIÇAO DE BANCADAS C/ TRANSP. ATÉ CB. E CARGA","m2    ",1.63,null,null,null,""]
["S",3,"S",0,1,1,2,0,0,0,0,"F","Serviço","Serviço","1.1.2.0.4.","AGETOP",20163,"DEMOLIÇÃO DAS INSTALAÇÕES HIDROSANITÁRIAS E AFINS C/ TRANSP. ATÉ CB. E CARGA","H     ",1,null,null,null,""]
["S",3,"S",0,1,1,2,0,0,0,0,"F","Serviço","Serviço","1.1.2.0.5.","AGETOP",20102,"DEMOLICAO-COBERTURA TELHA FIBROCIMENTO/FIBRA DE VIDRO/SIMILARES C/ TRANSP. ATÉ CB. E CARGA","m2    ",11.6,null,null,null,""]
["S",3,"S",0,1,1,2,0,0,0,0,"F","Serviço","Serviço","1.1.2.0.6.","AGETOP",20103,"DEMOLIÇÃO ESTRUTURA EM MADEIRA TELHADO C/ TRANSP. ATÉ CB. E CARGA","m2    ",11.6,null,null,null,""]
[3,3,3,4,1,1,3,0,0,21,4,"F","Nível 3","Nível 3","1.1.3.","SINAPI",null,"SANITÁRIO FEMININO","-",null,null,null,null,""]
["S",3,"S",0,1,1,3,0,0,0,0,"F","Serviço","Serviço","1.1.3.0.1.","AGETOP",20106,"RETIRADA DE JANELAS OU PORTAIS C/ TRANSP. ATÉ CB. E CARGA","m2    ",3.6000000000000005,null,null,null,""]
["S",3,"S",0,1,1,3,0,0,0,0,"F","Serviço","Serviço","1.1.3.0.2.","AGETOP",20163,"DEMOLIÇÃO DAS INSTALAÇÕES HIDROSANITÁRIAS E AFINS C/ TRANSP. ATÉ CB. E CARGA","H     ",1,null,null,null,""]
["S",3,"S",0,1,1,3,0,0,0,0,"F","Serviço","Serviço","1.1.3.0.3.","AGETOP",20115,"DEMOLIÇÃO DE REVESTIMENTOS COM AZULEJOS C/TRANSP.ATE CB. E CARGA","m2    ",1,null,null,null,""]
[3,3,3,3,1,1,4,0,0,17,3,"F","Nível 3","Nível 3","1.1.4.","SINAPI",null,"SANITÁRIO MASCULINO","-",null,null,null,null,""]
["S",3,"S",0,1,1,4,0,0,0,0,"F","Serviço","Serviço","1.1.4.0.1.","AGETOP",20106,"RETIRADA DE JANELAS OU PORTAIS C/ TRANSP. ATÉ CB. E CARGA","m2    ",3.6000000000000005,null,null,null,""]
["S",3,"S",0,1,1,4,0,0,0,0,"F","Serviço","Serviço","1.1.4.0.2.","AGETOP",20163,"DEMOLIÇÃO DAS INSTALAÇÕES HIDROSANITÁRIAS E AFINS C/ TRANSP. ATÉ CB. E CARGA","H     ",1,null,null,null,""]
[3,3,3,4,1,1,5,0,0,14,4,"F","Nível 3","Nível 3","1.1.5.","SINAPI",null,"ACESSIBILIDADE","-",null,null,null,null,""]
["S",3,"S",0,1,1,5,0,0,0,0,"F","Serviço","Serviço","1.1.5.0.1.","AGETOP",20106,"RETIRADA DE JANELAS OU PORTAIS C/ TRANSP. ATÉ CB. E CARGA","m2    ",18.64,null,null,null,""]
["S",3,"S",0,1,1,5,0,0,0,0,"F","Serviço","Serviço","1.1.5.0.2.","AGETOP",20118,"DEM.ALVEN.TIJOLO S/REAP. C/TR.ATE CB. E CARGA","m3    ",0.183,null,null,null,""]
["S",3,"S",0,1,1,5,0,0,0,0,"F","Serviço","Serviço","1.1.5.0.3.","AGETOP",67010,"ESCARIFICAÇÃO MANUAL, CORTE DE CONCRETO ATÉ 3CM DE PROFUNDIDADE","m3    ",0.78410000000000002,null,null,null,""]
[3,3,3,3,1,1,6,0,0,10,3,"F","Nível 3","Nível 3","1.1.6.","SINAPI",null,"TODO COLÉGIO","-",null,null,null,null,""]
["S",3,"S",0,1,1,6,0,0,0,0,"F","Serviço","Serviço","1.1.6.0.1.","AGETOP",20118,"DEM.ALVEN.TIJOLO S/REAP. C/TR.ATE CB. E CARGA","m3    ",1.3515000000000001,null,null,null,""]
["S",3,"S",0,1,1,6,0,0,0,0,"F","Serviço","Serviço","1.1.6.0.2.","AGETOP",260104,"REMOCAO DE PINTURA ANTIGA A LATEX","m2    ",1495.81,null,null,null,""]
[3,3,3,5,1,1,7,0,0,7,5,"F","Nível 3","Nível 3","1.1.7.","AGETOP",null,"IMPLANTAÇÃO","-",null,null,null,null,""]
["S",3,"S",0,1,1,7,0,0,0,0,"F","Serviço","Serviço","1.1.7.0.1.","SINAPI",98534,"PODA EM ALTURA DE ÁRVORE COM DIÂMETRO DE TRONCO MAIOR OU IGUAL A 0,40 M E MENOR QUE 0,60 M.AF_05/2018","UN",1,null,null,null,""]
["S",3,"S",0,1,1,7,0,0,0,0,"F","Serviço","Serviço","1.1.7.0.2.","SINAPI",98530,"CORTE RASO E RECORTE DE ÁRVORE COM DIÂMETRO DE TRONCO MAIOR OU IGUAL A 0,40 M E MENOR QUE 0,60 M.AF_05/2018","UN",1,null,null,null,""]
["S",3,"S",0,1,1,7,0,0,0,0,"F","Serviço","Serviço","1.1.7.0.3.","SINAPI",98527,"REMOÇÃO DE RAÍZES REMANESCENTES DE TRONCO DE ÁRVORE COM DIÂMETRO MAIOR OU IGUAL A 0,40 M E MENOR QUE 0,60 M.AF_05/2018","UN",1,null,null,null,""]
["S",3,"S",0,1,1,7,0,0,0,0,"F","Serviço","Serviço","1.1.7.0.4.","AGETOP",20118,"DEM.ALVEN.TIJOLO S/REAP. C/TR.ATE CB. E CARGA","m3    ",1,null,null,null,""]
[3,3,3,2,1,1,8,0,0,2,{"$error":"#N/A"},"F","Nível 3","Nível 3","1.1.8.","SINAPI",null,"OUTROS","-",null,null,null,null,""]
["S",3,"S",0,1,1,8,0,0,0,0,"F","Serviço","Serviço","1.1.8.0.1.","AGETOP",21301,"PLACA DE OBRA PLOTADA EM CHAPA METÁLICA 26 , AFIXADA EM CAVALETES DE MADEIRA DE LEI (VIGOTAS 6X12CM) - PADRÃO GOINFRA","m2    ",7.5,null,null,null,""]
[2,2,2,3,1,2,0,0,0,342,3,"F","Nível 2","Nível 2","1.2.","AGETOP",null,"TRANSPORTES","-",null,null,null,null,""]
["S",2,"S",0,1,2,0,0,0,0,0,"F","Serviço","Serviço","1.2.0.0.1.","SINAPI",72900,"TRANSPORTE DE ENTULHO COM CAMINHAO BASCULANTE 6 M3, RODOVIA PAVIMENTADA, DMT 0,5 A 1,0 KM","M3",15.39425,null,null,null,""]
["S",2,"S",0,1,2,0,0,0,0,0,"F","Serviço","Serviço","1.2.0.0.2.","SINAPI",72897,"CARGA MANUAL DE ENTULHO EM CAMINHAO BASCULANTE 6 M3","M3",15.39425,null,null,null,""]
[2,2,2,12,1,3,0,0,0,339,12,"F","Nível 2","Nível 2","1.3.","AGETOP",null,"SERVIÇO EM TERRA","-",null,null,null,null,""]
[3,3,3,2,1,3,1,0,0,11,2,"F","Nível 3","Nível 3","1.3.1.",null,null,"PERGOLADO","-",null,null,null,null,""]
["S",3,"S",0,1,3,1,0,0,0,0,"F","Serviço","Serviço","1.3.1.0.1.","AGETOP",41001,"ESC.CAMPO ABERTO C/TRANP.MANUAL DE TERRA(OC)","m3    ",2.4,null,null,null,""]
[3,3,3,6,1,3,2,0,0,9,6,"F","Nível 3","Nível 3","1.3.2.","AGETOP",null,"ACESSIBILIDADE","-",null,null,null,null,""]
["S",3,"S",0,1,3,2,0,0,0,0,"F","Serviço","Serviço","1.3.2.0.1.","AGETOP",41004,"ESCAVACAO MECANICA","m3    ",2.5,null,null,null,""]
["S",3,"S",0,1,3,2,0,0,0,0,"F","Serviço","Serviço","1.3.2.0.2.","AGETOP",41005,"CARGA MECANIZADA","m3    ",2.5,null,null,null,""]
["S",3,"S",0,1,3,2,0,0,0,0,"F","Serviço","Serviço","1.3.2.0.3.","AGETOP",41012,"INDENIZAÇÃO DE JAZIDA","m3    ",2.5,null,null,null,""]
["S",3,"S",0,1,3,2,0,0,0,0,"F","Serviço","Serviço","1.3.2.0.4.","AGETOP",41006,"TRANSPORTE DE MATERIAL ESCAVADO M3.KM","m3km  ",25,null,null,null,""]
["S",3,"S",0,1,3,2,0,0,0,0,"F","Serviço","Serviço","1.3.2.0.5.","AGETOP",41008,"COMPACTAÇÃO MECÂNICA COM CONTROLE DA UMIDADE (95% PN)","m3    ",2,null,null,null,""]
[3,3,3,3,1,3,3,0,0,3,49,"F","Nível 3","Nível 3","1.3.3.","AGETOP",null,"IMPLANTAÇÃO","-",null,null,null,null,""]
["S",3,"S",0,1,3,3,0,0,0,0,"F","Serviço","Serviço","1.3.3.0.1.","AGETOP",41140,"REGULARIZAÇÃO DO TERRENO SEM APILOAMENTO COM TRANSPORTE MANUAL DA TERRA ESCAVADA ","m2    ",89.67,null,null,null,""]
["S",3,"S",0,1,3,3,0,0,0,0,"F","Serviço","Serviço","1.3.3.0.2.","AGETOP",41002,"APILOAMENTO","m2    ",89.67,null,null,null,""]
[{"$f":"CHOOSE(1+LOG(1+2*(ORÇAMENTO.Nivel=\"Nível 1\")+4*(ORÇAMENTO.Nivel=\"Nível 2\")+8*(ORÇAMENTO.Nivel=\"Nível 3\")+16*(ORÇAMENTO.Nivel=\"Nível 4\")+32*(ORÇAMENTO.Nivel=\"Serviço\"),2),0,1,2,3,4,\"S\")","v":2},{"$f":"IF(OR(C66=\"s\",C66=0),OFFSET(B66,-1,0),C66)","v":2},{"$f":"IF(OFFSET(C66,-1,0)=\"L\",1,IF(OFFSET(C66,-1,0)=1,2,IF(OR(A66=\"s\",A66=0),\"S\",IF(AND(OFFSET(C66,-1,0)=2,A66=4),3,IF(AND(OR(OFFSET(C66,-1,0)=\"s\",OFFSET(C66,-1,0)=0),A66<>\"s\",A66>OFFSET(B66,-1,0)),OFFSET(B66,-1,0),A66)))))","v":2},{"$f":"IF(OR(C66=\"S\",C66=0),0,IF(ISERROR(K66),J66,SMALL(J66:K66,1)))","v":27},{"$f":"IF($C66=1,OFFSET(E66,-1,0)+1,OFFSET(E66,-1,0))","v":1},{"$f":"IF($C66=1,0,IF($C66=2,OFFSET(F66,-1,0)+1,OFFSET(F66,-1,0)))","v":4},{"$f":"IF(AND($C66<=2,$C66<>0),0,IF($C66=3,OFFSET(G66,-1,0)+1,OFFSET(G66,-1,0)))","v":0},{"$f":"IF(AND($C66<=3,$C66<>0),0,IF($C66=4,OFFSET(H66,-1,0)+1,OFFSET(H66,-1,0)))","v":0},{"$f":"IF(AND($C66<=4,$C66<>0),0,IF(AND($C66=\"S\",$W66>0),OFFSET(I66,-1,0)+1,OFFSET(I66,-1,0)))","v":0},327,27,"F","Nível 2","Nível 2","1.4.","AGETOP",null,"FUNDAÇÕES E SONDAGENS","-",null,null,null,null,""]
[3,3,3,10,1,4,1,0,0,26,10,"F","Nível 3","Nível 3","1.4.1.","SINAPI",null,"ESTACAS E BLOCOS","-",null,null,null,null,""]
[4,4,4,4,1,4,1,1,0,9,4,"F","Nível 4","Nível 4","1.4.1.1.","AGETOP",null,"PERGOLADO","-",null,null,null,null,""]
["S",4,"S",0,1,4,1,1,0,0,0,"F","Serviço","Serviço","1.4.1.1.1.","AGETOP",50302,"ESTACA A TRADO DIAM.30 CM SEM FERRO","M     ",28,null,null,null,""]
["S",4,"S",0,1,4,1,1,0,0,0,"F","Serviço","Serviço","1.4.1.1.2.","AGETOP",52004,"ACO CA 50-A - 8,0 MM (5/16\") - (OBRAS CIVIS)","Kg    ",22.727272727272727,null,null,null,""]
["S",4,"S",0,1,4,1,1,0,0,0,"F","Serviço","Serviço","1.4.1.1.3.","AGETOP",52014,"ACO CA-60 - 5,0 MM - (OBRAS CIVIS)","Kg    ",19.09090909090909,null,null,null,""]
[4,4,4,5,1,4,1,2,0,5,{"$error":"#N/A"},"F","Nível 4","Nível 4","1.4.1.2.","AGETOP",null,"ELEVADOR","-",null,null,null,null,""]
["S",4,"S",0,1,4,1,2,0,0,0,"F","Serviço","Serviço","1.4.1.2.1.","AGETOP",50302,"ESTACA A TRADO DIAM.30 CM SEM FERRO","M     ",9,null,null,null,""]
["S",4,"S",0,1,4,1,2,0,0,0,"F","Serviço","Serviço","1.4.1.2.2.","AGETOP",52004,"ACO CA 50-A - 8,0 MM (5/16\") - (OBRAS CIVIS)","Kg    ",9.0909090909090899,null,null,null,""]
["S",4,"S",0,1,4,1,2,0,0,0,"F","Serviço","Serviço","1.4.1.2.3.","AGETOP",52005,"ACO CA-50A - 10,0 MM (3/8\") - (OBRAS CIVIS)","Kg    ",16.363636363636363,null,null,null,""]
["S",4,"S",0,1,4,1,2,0,0,0,"F","Serviço","Serviço","1.4.1.2.4.","AGETOP",52014,"ACO CA-60 - 5,0 MM - (OBRAS CIVIS)","Kg    ",3.6363636363636362,null,null,null,""]
[3,3,3,16,1,4,2,0,0,16,29,"F","Nível 3","Nível 3","1.4.2.","SINAPI",null,"VIGAS BALDRAMES","-",null,null,null,null,""]
[4,4,4,7,1,4,2,1,0,15,7,"F","Nível 4","Nível 4","1.4.2.1.","AGETOP",null,"PERGOLADO","-",null,null,null,null,""]
["S",4,"S",0,1,4,2,1,0,0,0,"F","Serviço","Serviço","1.4.2.1.1.","AGETOP",40101,"ESCAVACAO MANUAL DE VALAS < 1 MTS. (OBRAS CIVIS)","m3    ",0.64800000000000002,null,null,null,""]
["S",4,"S",0,1,4,2,1,0,0,0,"F","Serviço","Serviço","1.4.2.1.2.","AGETOP",40902,"REATERRO COM APILOAMENTO","m3    ",0.46800000000000003,null,null,null,""]
["S",4,"S",0,1,4,2,1,0,0,0,"F","Serviço","Serviço","1.4.2.1.3.","AGETOP",51017,"PREPARO COM BETONEIRA E TRANSPORTE MANUAL DE CONCRETO FCK-20  - (O.C.)","m3    ",0.18,null,null,null,""]
["S",4,"S",0,1,4,2,1,0,0,0,"F","Serviço","Serviço","1.4.2.1.4.","AGETOP",51026,"LANÇAMENTO/APLICAÇÃO/ADENSAMENTO DE CONCRETO EM FUNDAÇÃO- (O.C.)","m3    ",0.18,null,null,null,""]
["S",4,"S",0,1,4,2,1,0,{"$f":"IF(OR($C83=\"S\",$C83=0),0,MATCH(0,OFFSET($D83,1,$C83,ROW($C$584)-ROW($C83)),0))","v":0},{"$f":"IF(OR($C83=\"S\",$C83=0),0,MATCH(OFFSET($D83,0,$C83)+1,OFFSET($D83,1,$C83,ROW($C$584)-ROW($C83)),0))","v":0},"F","Serviço","Serviço","1.4.2.1.5.","AGETOP",52005,"ACO CA-50A - 10,0 MM (3/8\") - (OBRAS CIVIS)","Kg    ",11.818181818181817,null,null,null,""]
["S",4,"S",0,1,4,2,1,0,0,0,"F","Serviço","Serviço","1.4.2.1.6.","AGETOP",52014,"ACO CA-60 - 5,0 MM - (OBRAS CIVIS)","Kg    ",4.545454545454545,null,null,null,""]
[4,4,4,8,1,4,2,2,0,8,{"$error":"#N/A"},"F","Nível 4","Nível 4","1.4.2.2.","AGETOP",null,"ELEVADOR","-",null,null,null,null,""]
["S",4,"S",0,1,4,2,2,0,0,0,"F","Serviço","Serviço","1.4.2.2.1.","AGETOP",40101,"ESCAVACAO MANUAL DE VALAS < 1 MTS. (OBRAS CIVIS)","m3    ",0.79992000000000008,null,null,null,""]
["S",4,"S",0,1,4,2,2,0,0,0,"F","Serviço","Serviço","1.4.2.2.2.","AGETOP",40902,"REATERRO COM APILOAMENTO","m3    ",0.48992000000000008,null,null,null,""]
["S",4,"S",0,1,4,2,2,0,0,0,"F","Serviço","Serviço","1.4.2.2.3.","AGETOP",60191,"FORMA DE TABUA CINTA BALDRAME U=8 VEZES","m2    ",5.46,null,null,null,""]
[{"$f":"CHOOSE(1+LOG(1+2*(ORÇAMENTO.Nivel=\"Nível 1\")+4*(ORÇAMENTO.Nivel=\"Nível 2\")+8*(ORÇAMENTO.Nivel=\"Nível 3\")+16*(ORÇAMENTO.Nivel=\"Nível 4\")+32*(ORÇAMENTO.Nivel=\"Serviço\"),2),0,1,2,3,4,\"S\")","v":"S"},{"$f":"IF(OR(C89=\"s\",C89=0),OFFSET(B89,-1,0),C89)","v":4},{"$f":"IF(OFFSET(C89,-1,0)=\"L\",1,IF(OFFSET(C89,-1,0)=1,2,IF(OR(A89=\"s\",A89=0),\"S\",IF(AND(OFFSET(C89,-1,0)=2,A89=4),3,IF(AND(OR(OFFSET(C89,-1,0)=\"s\",OFFSET(C89,-1,0)=0),A89<>\"s\",A89>OFFSET(B89,-1,0)),OFFSET(B89,-1,0),A89)))))","v":"S"},{"$f":"IF(OR(C89=\"S\",C89=0),0,IF(ISERROR(K89),J89,SMALL(J89:K89,1)))","v":0},{"$f":"IF($C89=1,OFFSET(E89,-1,0)+1,OFFSET(E89,-1,0))","v":1},{"$f":"IF($C89=1,0,IF($C89=2,OFFSET(F89,-1,0)+1,OFFSET(F89,-1,0)))","v":4},{"$f":"IF(AND($C89<=2,$C89<>0),0,IF($C89=3,OFFSET(G89,-1,0)+1,OFFSET(G89,-1,0)))","v":2},{"$f":"IF(AND($C89<=3,$C89<>0),0,IF($C89=4,OFFSET(H89,-1,0)+1,OFFSET(H89,-1,0)))","v":2},{"$f":"IF(AND($C89<=4,$C89<>0),0,IF(AND($C89=\"S\",$W89>0),OFFSET(I89,-1,0)+1,OFFSET(I89,-1,0)))","v":0},0,0,"F","Serviço","Serviço","1.4.2.2.4.","AGETOP",51015,"PREPARO COM BETONEIRA E TRANSPORTE MANUAL  DE CONCRETO FCK-15 - (O.C.)","m3    ",0.31,null,null,null,""]
["S",4,"S",0,1,4,2,2,0,0,0,"F","Serviço","Serviço","1.4.2.2.5.","AGETOP",51026,"LANÇAMENTO/APLICAÇÃO/ADENSAMENTO DE CONCRETO EM FUNDAÇÃO- (O.C.)","m3    ",0.31,null,null,null,""]
["S",4,"S",0,1,4,2,2,0,0,0,"F","Serviço","Serviço","1.4.2.2.6.","AGETOP",52004,"ACO CA 50-A - 8,0 MM (5/16\") - (OBRAS CIVIS)","Kg    ",11.818181818181817,null,null,null,""]
["S",4,"S",0,1,4,2,2,0,0,0,"F","Serviço","Serviço","1.4.2.2.7.","AGETOP",52014,"ACO CA-60 - 5,0 MM - (OBRAS CIVIS)","Kg    ",6.3636363636363633,null,null,null,""]
[2,2,2,24,1,5,0,0,0,300,24,"F","Nível 2","Nível 2","1.5.","AGETOP",null,"ESTRUTURA","-",null,null,null,null,""]
[3,3,3,6,1,5,1,0,0,23,6,"F","Nível 3","Nível 3","1.5.1.","AGETOP",null,"PILARES","-",null,null,null,null,""]
["S",3,"S",0,1,5,1,0,0,0,0,"F","Serviço","Serviço","1.5.1.0.1.","SINAPI",92426,"MONTAGEM E DESMONTAGEM DE FÔRMA DE PILARES RETANGULARES E ESTRUTURAS SIMILARES COM ÁREA MÉDIA DAS SEÇÕES MENOR OU IGUAL A 0,25 M², PÉ-DIREITO SIMPLES, EM CHAPA DE MADEIRA COMPENSADA RESINADA, 8 UTILIZAÇÕES. AF_12/2015","M2",19.97,null,null,null,""]
["S",3,"S",0,1,5,1,0,0,0,0,"F","Serviço","Serviço","1.5.1.0.2.","SINAPI",94964,"CONCRETO FCK = 20MPA, TRAÇO 1:2,7:3 (CIMENTO/ AREIA MÉDIA/ BRITA 1)  - PREPARO MECÂNICO COM BETONEIRA 400 L. AF_07/2016","M3",0.91,null,null,null,""]
["S",3,"S",0,1,5,1,0,0,0,0,"F","Serviço","Serviço","1.5.1.0.3.","AGETOP",60801,"LANÇAMENTO/APLICAÇÃO/ADENSAMENTO MANUAL DE CONCRETO - (OBRAS CIVIS)","m3    ",0.91,null,null,null,""]
["S",3,"S",0,1,5,1,0,0,0,0,"F","Serviço","Serviço","1.5.1.0.4.","AGETOP",60305,"ACO CA-50A - 10,0 MM (3/8\") - (OBRAS CIVIS)","Kg    ",69.090909090909079,null,null,null,""]
["S",3,"S",0,1,5,1,0,0,0,0,"F","Serviço","Serviço","1.5.1.0.5.","AGETOP",60314,"ACO CA - 60 - 5,0 MM - (OBRAS CIVIS)","Kg    ",26.36363636363636,null,null,null,""]
[3,3,3,6,1,5,2,0,0,17,6,"F","Nível 3","Nível 3","1.5.2.",null,null,"VIGAS INTERMEDIÁRIAS","-",null,null,null,null,""]
["S",3,"S",0,1,5,2,0,0,0,0,"F","Serviço","Serviço","1.5.2.0.1.","AGETOP",60209,"FORMA CH.COMPENSADA 12MM-VIGA/PILAR U=4V - (OBRAS CIVIS","m2    ",5.46,null,null,null,""]
["S",3,"S",0,1,5,2,0,0,0,0,"F","Serviço","Serviço","1.5.2.0.2.","SINAPI",94964,"CONCRETO FCK = 20MPA, TRAÇO 1:2,7:3 (CIMENTO/ AREIA MÉDIA/ BRITA 1)  - PREPARO MECÂNICO COM BETONEIRA 400 L. AF_07/2016","M3",0.31,null,null,null,""]
["S",3,"S",0,1,5,2,0,0,0,0,"F","Serviço","Serviço","1.5.2.0.3.","AGETOP",60801,"LANÇAMENTO/APLICAÇÃO/ADENSAMENTO MANUAL DE CONCRETO - (OBRAS CIVIS)","m3    ",0.31,null,null,null,""]
["S",3,"S",0,1,5,2,0,0,0,0,"F","Serviço","Serviço","1.5.2.0.4.","AGETOP",60304,"ACO CA-50 A - 8,0 MM (5/16\") - (OBRAS CIVIS)","Kg    ",11.818181818181817,null,null,null,""]
["S",3,"S",0,1,5,2,0,0,0,0,"F","Serviço","Serviço","1.5.2.0.5.","AGETOP",60314,"ACO CA - 60 - 5,0 MM - (OBRAS CIVIS)","Kg    ",6.3636363636363633,null,null,null,""]
[3,3,3,6,1,5,3,0,0,11,6,"F","Nível 3","Nível 3","1.5.3.","AGETOP",null,"VIGAS DE COBERTURA","-",null,null,null,null,""]
[{"$f":"CHOOSE(1+LOG(1+2*(ORÇAMENTO.Nivel=\"Nível 1\")+4*(ORÇAMENTO.Nivel=\"Nível 2\")+8*(ORÇAMENTO.Nivel=\"Nível 3\")+16*(ORÇAMENTO.Nivel=\"Nível 4\")+32*(ORÇAMENTO.Nivel=\"Serviço\"),2),0,1,2,3,4,\"S\")","v":"S"},3,"S",0,1,5,3,0,{"$f":"IF(AND($C107<=4,$C107<>0),0,IF(AND($C107=\"S\",$W107>0),OFFSET(I107,-1,0)+1,OFFSET(I107,-1,0)))","v":0},0,0,"F","Serviço","Serviço","1.5.3.0.1.","AGETOP",60209,"FORMA CH.COMPENSADA 12MM-VIGA/PILAR U=4V - (OBRAS CIVIS","m2    ",5.46,null,null,null,""]
["S",3,"S",0,1,5,3,0,0,0,0,"F","Serviço","Serviço","1.5.3.0.2.","SINAPI",94964,"CONCRETO FCK = 20MPA, TRAÇO 1:2,7:3 (CIMENTO/ AREIA MÉDIA/ BRITA 1)  - PREPARO MECÂNICO COM BETONEIRA 400 L. AF_07/2016","M3",0.31,null,null,null,""]
["S",3,"S",0,1,5,3,0,0,0,0,"F","Serviço","Serviço","1.5.3.0.3.","AGETOP",60801,"LANÇAMENTO/APLICAÇÃO/ADENSAMENTO MANUAL DE CONCRETO - (OBRAS CIVIS)","m3    ",0.31,null,null,null,""]
["S",3,"S",0,1,5,3,0,0,0,0,"F","Serviço","Serviço","1.5.3.0.4.","AGETOP",60304,"ACO CA-50 A - 8,0 MM (5/16\") - (OBRAS CIVIS)","Kg    ",11.818181818181817,null,null,null,""]
["S",3,"S",0,1,5,3,0,0,0,0,"F","Serviço","Serviço","1.5.3.0.5.","AGETOP",60314,"ACO CA - 60 - 5,0 MM - (OBRAS CIVIS)","Kg    ",6.3636363636363633,null,null,null,""]
[3,3,3,5,1,5,4,0,0,5,227,"F","Nível 3","Nível 3","1.5.4.",null,null,"LAJE","-",null,null,null,null,""]
["S",3,"S",0,1,5,4,0,0,0,0,"F","Serviço","Serviço","1.5.4.0.1.","SINAPI",92525,"MONTAGEM E DESMONTAGEM DE FÔRMA DE LAJE MACIÇA COM ÁREA MÉDIA MENOR OU IGUAL A 20 M², PÉ-DIREITO SIMPLES, EM CHAPA DE MADEIRA COMPENSADA PLASTIFICADA, 10 UTILIZAÇÕES. AF_12/2015","M2",4.4000000000000004,null,null,null,""]
["S",3,"S",0,1,5,4,0,0,0,0,"F","Serviço","Serviço","1.5.4.0.2.","SINAPI",94964,"CONCRETO FCK = 20MPA, TRAÇO 1:2,7:3 (CIMENTO/ AREIA MÉDIA/ BRITA 1)  - PREPARO MECÂNICO COM BETONEIRA 400 L. AF_07/2016","M3",0.43,null,null,null,""]
["S",3,"S",0,1,5,4,0,0,0,0,"F","Serviço","Serviço","1.5.4.0.3.","AGETOP",60801,"LANÇAMENTO/APLICAÇÃO/ADENSAMENTO MANUAL DE CONCRETO - (OBRAS CIVIS)","m3    ",0.43,null,null,null,""]
["S",3,"S",0,1,5,4,0,0,0,0,"F","Serviço","Serviço","1.5.4.0.4.","AGETOP",60303,"ACO CA-50-A - 6,3 MM (1/4\") - (OBRAS CIVIS)","Kg    ",17.27272727272727,null,null,null,""]
[2,2,2,110,1,6,0,0,0,276,110,"F","Nível 2","Nível 2","1.6.",null,null,"INSTALAÇÕES ELÉTRICAS","-",null,null,null,null,""]
[3,3,3,60,1,6,1,0,0,109,60,"F","Nível 3","Nível 3","1.6.1.","SINAPI",null,"REFORMA ELÉTRICA","-",null,null,null,null,""]
["S",3,"S",0,1,6,1,0,0,0,0,"F","Serviço","Serviço","1.6.1.0.1.","SINAPI","74131/4","QUADRO DE DISTRIBUICAO DE ENERGIA DE EMBUTIR, EM CHAPA METALICA, PARA 18 DISJUNTORES TERMOMAGNETICOS MONOPOLARES, COM BARRAMENTO TRIFASICO E NEUTRO, FORNECIMENTO E INSTALACAO","UN",7,null,null,null,""]
["S",3,"S",0,1,6,1,0,0,0,0,"F","Serviço","Serviço","1.6.1.0.2.","SINAPI","74131/6","QUADRO DE DISTRIBUICAO DE ENERGIA DE EMBUTIR, EM CHAPA METALICA, PARA 32 DISJUNTORES TERMOMAGNETICOS MONOPOLARES, COM BARRAMENTO TRIFASICO E NEUTRO, FORNECIMENTO E INSTALACAO","UN",1,null,null,null,"Referência: AGETOP - 72198"]
["S",3,"S",0,1,6,1,0,0,0,0,"F","Serviço","Serviço","1.6.1.0.3.","SINAPI",93670,"DISJUNTOR TRIPOLAR TIPO DIN, CORRENTE NOMINAL DE 25A - FORNECIMENTO E INSTALAÇÃO. AF_04/2016","UN",2,null,null,null,"Referência: AGETOP - 71173"]
["S",3,"S",0,1,6,1,0,0,0,0,"F","Serviço","Serviço","1.6.1.0.4.","SINAPI",93671,"DISJUNTOR TRIPOLAR TIPO DIN, CORRENTE NOMINAL DE 32A - FORNECIMENTO E INSTALAÇÃO. AF_04/2016","UN",6,null,null,null,"Referência: AGETOP - 71173"]
["S",3,"S",0,1,6,1,0,0,0,0,"F","Serviço","Serviço","1.6.1.0.5.","SINAPI",93673,"DISJUNTOR TRIPOLAR TIPO DIN, CORRENTE NOMINAL DE 50A - FORNECIMENTO E INSTALAÇÃO. AF_04/2016","UN",2,null,null,null,"Referência: AGETOP - 71174"]
["S",3,"S",0,1,6,1,0,0,0,0,"F","Serviço","Serviço","1.6.1.0.6.","SINAPI","74130/10","DISJUNTOR TERMOMAGNETICO TRIPOLAR EM CAIXA MOLDADA 175 A 225A 240V, FORNECIMENTO E INSTALACAO","UN",2,null,null,null,""]
["S",3,"S",0,1,6,1,0,0,0,0,"F","Serviço","Serviço","1.6.1.0.7.","SINAPI",93657,"DISJUNTOR MONOPOLAR TIPO DIN, CORRENTE NOMINAL DE 32A - FORNECIMENTO E INSTALAÇÃO. AF_04/2016","UN",1,null,null,null,""]
["S",3,"S",0,1,6,1,0,0,0,0,"F","Serviço","Serviço","1.6.1.0.8.","SINAPI",93656,"DISJUNTOR MONOPOLAR TIPO DIN, CORRENTE NOMINAL DE 25A - FORNECIMENTO E INSTALAÇÃO. AF_04/2016","UN",23,null,null,null,""]
["S",3,"S",0,1,6,1,0,0,0,0,"F","Serviço","Serviço","1.6.1.0.9.","SINAPI",93654,"DISJUNTOR MONOPOLAR TIPO DIN, CORRENTE NOMINAL DE 16A - FORNECIMENTO E INSTALAÇÃO. AF_04/2016","UN",22,null,null,null,""]
["S",3,"S",0,1,6,1,0,0,0,0,"F","Serviço","Serviço","1.6.1.0.10.","SINAPI",93653,"DISJUNTOR MONOPOLAR TIPO DIN, CORRENTE NOMINAL DE 10A - FORNECIMENTO E INSTALAÇÃO. AF_04/2016","UN",33,null,null,null,""]
["S",3,"S",0,1,6,1,0,0,0,0,"F","Serviço","Serviço","1.6.1.0.11.","AGETOP",71184,"DISPOSITIVO DE PROTEÇÃO CONTRA SURTOS (D.P.S.) 275V DE 8 A 40KA","Un    ",3,null,null,null,""]
["S",3,"S",0,1,6,1,0,0,0,0,"F","Serviço","Serviço","1.6.1.0.12.","AGETOP",71451,"INTERRUPTOR DIFERENCIAL RESIDUAL (D.R.) BIPOLAR DE 40A-30mA","Un    ",5,null,null,null,""]
["S",3,"S",0,1,6,1,0,0,0,0,"F","Serviço","Serviço","1.6.1.0.13.","SINAPI",91926,"CABO DE COBRE FLEXÍVEL ISOLADO, 2,5 MM², ANTI-CHAMA 450/750 V, PARA CIRCUITOS TERMINAIS - FORNECIMENTO E INSTALAÇÃO. AF_12/2015","M",4876,null,null,null,"Referência: AGETOP - 70563"]
["S",3,"S",0,1,6,1,0,0,0,0,"F","Serviço","Serviço","1.6.1.0.14.","SINAPI",91928,"CABO DE COBRE FLEXÍVEL ISOLADO, 4 MM², ANTI-CHAMA 450/750 V, PARA CIRCUITOS TERMINAIS - FORNECIMENTO E INSTALAÇÃO. AF_12/2015","M",1752.1,null,null,null,"Referência: AGETOP - 70564"]
["S",3,"S",0,1,6,1,0,0,0,0,"F","Serviço","Serviço","1.6.1.0.15.","SINAPI",91930,"CABO DE COBRE FLEXÍVEL ISOLADO, 6 MM², ANTI-CHAMA 450/750 V, PARA CIRCUITOS TERMINAIS - FORNECIMENTO E INSTALAÇÃO. AF_12/2015","M",467.8,null,null,null,"Referência: AGETOP - 70565"]
["S",3,"S",0,1,6,1,0,0,0,0,"F","Serviço","Serviço","1.6.1.0.16.","SINAPI",92979,"CABO DE COBRE FLEXÍVEL ISOLADO, 10 MM², ANTI-CHAMA 450/750 V, PARA DISTRIBUIÇÃO - FORNECIMENTO E INSTALAÇÃO. AF_12/2015","M",358.75,null,null,null,""]
["S",3,"S",0,1,6,1,0,0,0,0,"F","Serviço","Serviço","1.6.1.0.17.","SINAPI",92981,"CABO DE COBRE FLEXÍVEL ISOLADO, 16 MM², ANTI-CHAMA 450/750 V, PARA DISTRIBUIÇÃO - FORNECIMENTO E INSTALAÇÃO. AF_12/2015","M",365.5,null,null,null,""]
["S",3,"S",0,1,6,1,0,0,0,0,"F","Serviço","Serviço","1.6.1.0.18.","SINAPI",92990,"CABO DE COBRE FLEXÍVEL ISOLADO, 70 MM², ANTI-CHAMA 0,6/1,0 KV, PARA DISTRIBUIÇÃO - FORNECIMENTO E INSTALAÇÃO. AF_12/2015","M",468.12,null,null,null,"Referência: AGETOP - 70514"]
["S",3,"S",0,1,6,1,0,0,0,0,"F","Serviço","Serviço","1.6.1.0.19.","SINAPI",92986,"CABO DE COBRE FLEXÍVEL ISOLADO, 35 MM², ANTI-CHAMA 0,6/1,0 KV, PARA DISTRIBUIÇÃO - FORNECIMENTO E INSTALAÇÃO. AF_12/2015","M",117.03,null,null,null,"Referência: AGETOP - 70512"]
["S",3,"S",0,1,6,1,0,0,0,0,"F","Serviço","Serviço","1.6.1.0.20.","AGETOP",70541,"CABO DE COBRE NU No. 16 MM2 (6,94 M/KG)","M     ",15,null,null,null,""]
["S",3,"S",0,1,6,1,0,0,0,0,"F","Serviço","Serviço","1.6.1.0.21.","AGETOP",70544,"CABO DE COBRE NÚ No. 50 MM2","M     ",15,null,null,null,""]
["S",3,"S",0,1,6,1,0,0,0,0,"F","Serviço","Serviço","1.6.1.0.22.","SINAPI",91867,"ELETRODUTO RÍGIDO ROSCÁVEL, PVC, DN 25 MM (3/4\"), PARA CIRCUITOS TERMINAIS, INSTALADO EM LAJE - FORNECIMENTO E INSTALAÇÃO. AF_12/2015","M",1915,null,null,null,"Referência: AGETOP - 71201"]
["S",3,"S",0,1,6,1,0,0,0,0,"F","Serviço","Serviço","1.6.1.0.23.","SINAPI",91868,"ELETRODUTO RÍGIDO ROSCÁVEL, PVC, DN 32 MM (1\"), PARA CIRCUITOS TERMINAIS, INSTALADO EM LAJE - FORNECIMENTO E INSTALAÇÃO. AF_12/2015","M",587,null,null,null,"Referência: AGETOP - 71202"]
["S",3,"S",0,1,6,1,0,0,0,0,"F","Serviço","Serviço","1.6.1.0.24.","SINAPI",93008,"ELETRODUTO RÍGIDO ROSCÁVEL, PVC, DN 50 MM (1 1/2\") - FORNECIMENTO E INSTALAÇÃO. AF_12/2015","M",65,null,null,null,""]
["S",3,"S",0,1,6,1,0,0,0,0,"F","Serviço","Serviço","1.6.1.0.25.","SINAPI",93009,"ELETRODUTO RÍGIDO ROSCÁVEL, PVC, DN 60 MM (2\") - FORNECIMENTO E INSTALAÇÃO. AF_12/2015","M",53,null,null,null,""]
["S",3,"S",0,1,6,1,0,0,0,0,"F","Serviço","Serviço","1.6.1.0.26.","SINAPI",93010,"ELETRODUTO RÍGIDO ROSCÁVEL, PVC, DN 75 MM (2 1/2\") - FORNECIMENTO E INSTALAÇÃO. AF_12/2015","M",217,null,null,null,""]
["S",3,"S",0,1,6,1,0,0,0,0,"F","Serviço","Serviço","1.6.1.0.27.","AGETOP",70351,"BRACADEIRA METALICA TIPO \"U\" DIAM. 3/4\"","Un    ",330,null,null,null,""]
["S",3,"S",0,1,6,1,0,0,0,0,"F","Serviço","Serviço","1.6.1.0.28.","AGETOP",70352,"BRACADEIRA METALICA TIPO \"U\" DIAM. 1\"","Un    ",196,null,null,null,""]
["S",3,"S",0,1,6,1,0,0,{"$f":"IF(OR($C147=\"S\",$C147=0),0,MATCH(0,OFFSET($D147,1,$C147,ROW($C$584)-ROW($C147)),0))","v":0},{"$f":"IF(OR($C147=\"S\",$C147=0),0,MATCH(OFFSET($D147,0,$C147)+1,OFFSET($D147,1,$C147,ROW($C$584)-ROW($C147)),0))","v":0},"F","Serviço","Serviço","1.6.1.0.29.","AGETOP",70354,"BRACADEIRA METALICA TIPO \"U\" DIAM. 1.1/2\"","Un    ",22,null,null,null,""]
["S",3,"S",0,1,6,1,0,0,0,0,"F","Serviço","Serviço","1.6.1.0.30.","AGETOP",70355,"BRACADEIRA METALICA TIPO \"U\" DIAM. 2\"","Un    ",18,null,null,null,""]
["S",3,"S",0,1,6,1,0,0,0,0,"F","Serviço","Serviço","1.6.1.0.31.","AGETOP",70356,"BRACADEIRA METALICA TIPO \"U\" DIAM. 2.1/2\"","Un    ",73,null,null,null,""]
["S",3,"S",0,1,6,1,0,0,0,0,"F","Serviço","Serviço","1.6.1.0.32.","SINAPI",91879,"LUVA PARA ELETRODUTO, PVC, ROSCÁVEL, DN 25 MM (3/4\"), PARA CIRCUITOS TERMINAIS, INSTALADA EM LAJE - FORNECIMENTO E INSTALAÇÃO. AF_12/2015","UN",330,null,null,null,"Referência: AGETOP - 71741"]
["S",3,"S",0,1,6,1,0,0,0,0,"F","Serviço","Serviço","1.6.1.0.33.","SINAPI",91880,"LUVA PARA ELETRODUTO, PVC, ROSCÁVEL, DN 32 MM (1\"), PARA CIRCUITOS TERMINAIS, INSTALADA EM LAJE - FORNECIMENTO E INSTALAÇÃO. AF_12/2015","UN",196,null,null,null,"Referência: AGETOP - 71742"]
["S",3,"S",0,1,6,1,0,0,0,0,"F","Serviço","Serviço","1.6.1.0.34.","SINAPI",93013,"LUVA PARA ELETRODUTO, PVC, ROSCÁVEL, DN 50 MM (1 1/2\") - FORNECIMENTO E INSTALAÇÃO. AF_12/2015","UN",22,null,null,null,"Referência: AGETOP - 71744"]
["S",3,"S",0,1,6,1,0,0,0,0,"F","Serviço","Serviço","1.6.1.0.35.","SINAPI",93014,"LUVA PARA ELETRODUTO, PVC, ROSCÁVEL, DN 60 MM (2\") - FORNECIMENTO E INSTALAÇÃO. AF_12/2015","UN",18,null,null,null,"Referência: AGETOP - 71745"]
["S",3,"S",0,1,6,1,0,0,0,0,"F","Serviço","Serviço","1.6.1.0.36.","SINAPI",93015,"LUVA PARA ELETRODUTO, PVC, ROSCÁVEL, DN 75 MM (2 1/2\") - FORNECIMENTO E INSTALAÇÃO. AF_12/2015","UN",73,null,null,null,""]
["S",3,"S",0,1,6,1,0,0,0,0,"F","Serviço","Serviço","1.6.1.0.37.","SINAPI",95801,"CONDULETE DE ALUMÍNIO, TIPO X, PARA ELETRODUTO DE AÇO GALVANIZADO DN 20 MM (3/4''), APARENTE - FORNECIMENTO E INSTALAÇÃO. AF_11/2016_P","UN",163,null,null,null,"Referência: AGETOP - 70929"]
["S",3,"S",0,1,6,1,0,0,0,0,"F","Serviço","Serviço","1.6.1.0.38.","AGETOP",72395,"TAMPA CEGA PARA CONDULETE METÁLICO","Un    ",163,null,null,null,""]
["S",3,"S",0,1,6,1,0,0,0,0,"F","Serviço","Serviço","1.6.1.0.39.","SINAPI",91993,"TOMADA ALTA DE EMBUTIR (1 MÓDULO), 2P+T 20 A, INCLUINDO SUPORTE E PLACA - FORNECIMENTO E INSTALAÇÃO. AF_12/2015","UN",20,null,null,null,"Referência: AGETOP - 72585"]
["S",3,"S",0,1,6,1,0,0,0,0,"F","Serviço","Serviço","1.6.1.0.40.","SINAPI",91992,"TOMADA ALTA DE EMBUTIR (1 MÓDULO), 2P+T 10 A, INCLUINDO SUPORTE E PLACA - FORNECIMENTO E INSTALAÇÃO. AF_12/2015","UN",10,null,null,null,""]
["S",3,"S",0,1,6,1,0,0,0,0,"F","Serviço","Serviço","1.6.1.0.41.","SINAPI",92004,"TOMADA MÉDIA DE EMBUTIR (2 MÓDULOS), 2P+T 10 A, INCLUINDO SUPORTE E PLACA - FORNECIMENTO E INSTALAÇÃO. AF_12/2015","UN",9,null,null,null,"Referência: AGETOP - 72578"]
["S",3,"S",0,1,6,1,0,0,0,0,"F","Serviço","Serviço","1.6.1.0.42.","SINAPI",91996,"TOMADA MÉDIA DE EMBUTIR (1 MÓDULO), 2P+T 10 A, INCLUINDO SUPORTE E PLACA - FORNECIMENTO E INSTALAÇÃO. AF_12/2015","UN",2,null,null,null,"Referência: AGETOP - 72578"]
["S",3,"S",0,1,6,1,0,0,0,0,"F","Serviço","Serviço","1.6.1.0.43.","SINAPI",92008,"TOMADA BAIXA DE EMBUTIR (2 MÓDULOS), 2P+T 10 A, INCLUINDO SUPORTE E PLACA - FORNECIMENTO E INSTALAÇÃO. AF_12/2015","UN",16,null,null,null,""]
["S",3,"S",0,1,6,1,0,0,0,0,"F","Serviço","Serviço","1.6.1.0.44.","SINAPI",92000,"TOMADA BAIXA DE EMBUTIR (1 MÓDULO), 2P+T 10 A, INCLUINDO SUPORTE E PLACA - FORNECIMENTO E INSTALAÇÃO. AF_12/2015","UN",53,null,null,null,"Referência: AGETOP - 72578"]
["S",3,"S",0,1,6,1,0,0,0,0,"F","Serviço","Serviço","1.6.1.0.45.","SINAPI",97585,"LUMINÁRIA TIPO CALHA, DE SOBREPOR, COM 2 LÂMPADAS TUBULARES DE 18 W - FORNECIMENTO E INSTALAÇÃO. AF_11/2017","UN",236,null,null,null,""]
["S",3,"S",0,1,6,1,0,0,0,0,"F","Serviço","Serviço","1.6.1.0.46.","SINAPI",97601,"REFLETOR EM ALUMÍNIO COM SUPORTE E ALÇA, LÂMPADA 250 W - FORNECIMENTO E INSTALAÇÃO. AF_11/2017","UN",14,null,null,null,""]
["S",3,"S",0,1,6,1,0,0,0,0,"F","Serviço","Serviço","1.6.1.0.47.","SINAPI","73831/5","LAMPADA MISTA DE 250W - FORNECIMENTO E INSTALACAO","UN",14,null,null,null,""]
["S",3,"S",0,1,6,1,0,0,0,0,"F","Serviço","Serviço","1.6.1.0.48.","SINAPI",97606,"LUMINÁRIA ARANDELA TIPO MEIA-LUA, PARA 1 LÂMPADA DE 15 W - FORNECIMENTO E INSTALAÇÃO. AF_11/2017","UN",2,null,null,null,""]
["S",3,"S",0,1,6,1,0,0,0,0,"F","Serviço","Serviço","1.6.1.0.49.","SINAPI",97610,"LÂMPADA COMPACTA DE LED 10 W, BASE E27 - FORNECIMENTO E INSTALAÇÃO. AF_11/2017","UN",2,null,null,null,""]
["S",3,"S",0,1,6,1,0,0,0,0,"F","Serviço","Serviço","1.6.1.0.50.","SINAPI",91953,"INTERRUPTOR SIMPLES (1 MÓDULO), 10A/250V, INCLUINDO SUPORTE E PLACA - FORNECIMENTO E INSTALAÇÃO. AF_12/2015","UN",24,null,null,null,"Referência: AGETOP - 71440"]
["S",3,"S",0,1,6,1,0,0,0,0,"F","Serviço","Serviço","1.6.1.0.51.","SINAPI",91959,"INTERRUPTOR SIMPLES (2 MÓDULOS), 10A/250V, INCLUINDO SUPORTE E PLACA - FORNECIMENTO E INSTALAÇÃO. AF_12/2015","UN",17,null,null,null,"Referência: AGETOP - 71441"]
["S",3,"S",0,1,6,1,0,0,0,0,"F","Serviço","Serviço","1.6.1.0.52.","SINAPI",91961,"INTERRUPTOR PARALELO (2 MÓDULOS), 10A/250V, INCLUINDO SUPORTE E PLACA - FORNECIMENTO E INSTALAÇÃO. AF_12/2015","UN",6,null,null,null,""]
["S",3,"S",0,1,6,1,0,0,0,0,"F","Serviço","Serviço","1.6.1.0.53.","SINAPI",91967,"INTERRUPTOR SIMPLES (3 MÓDULOS), 10A/250V, INCLUINDO SUPORTE E PLACA - FORNECIMENTO E INSTALAÇÃO. AF_12/2015","UN",4,null,null,null,"Referência: AGETOP - 71442"]
["S",3,"S",0,1,6,1,0,0,0,0,"F","Serviço","Serviço","1.6.1.0.54.","SINAPI",97891,"CAIXA ENTERRADA ELÉTRICA RETANGULAR, EM ALVENARIA COM BLOCOS DE CONCRETO, FUNDO COM BRITA, DIMENSÕES INTERNAS: 0,4X0,4X0,4 M. AF_05/2018","UN",3,null,null,null,""]
["S",3,"S",0,1,6,1,0,0,0,0,"F","Serviço","Serviço","1.6.1.0.55.","SINAPI",6171,"TAMPA DE CONCRETO ARMADO 60X60X5CM PARA CAIXA","UN",3,null,null,null,""]
["S",3,"S",0,1,6,1,0,0,0,0,"F","Serviço","Serviço","1.6.1.0.56.","AGETOP",71861,"PARAFUSO P/BUCHA S-6","Un    ",556,null,null,null,""]
["S",3,"S",0,1,6,1,0,0,0,0,"F","Serviço","Serviço","1.6.1.0.57.","AGETOP",70647,"CAIXA DE PASSAGEM METÁLICA DE EMBUTIR 30X30X12 CM","Un    ",3,null,null,null,""]
["S",3,"S",0,1,6,1,0,0,0,0,"F","Serviço","Serviço","1.6.1.0.58.","AGETOP",70391,"BUCHA DE NYLON S-6","Un    ",556,null,null,null,""]
["S",3,"S",0,1,6,1,0,0,0,0,"F","Serviço","Serviço","1.6.1.0.59.","AGETOP",20162,"DEMOLIÇÃO DAS INSTALAÇÕES ELÉTRICAS E AFINS C/ TRANSP. ATÉ CB. E CARGA","H     ",40,null,null,null,""]
[3,3,3,10,1,6,2,0,0,49,10,"F","Nível 3","Nível 3","1.6.2.",null,"IMPLANTAÇÃO","IMPLANTAÇÃO","-",null,null,null,null,""]
["S",3,"S",0,1,6,2,0,0,0,0,"F","Serviço","Serviço","1.6.2.0.1.","SINAPI",93669,"DISJUNTOR TRIPOLAR TIPO DIN, CORRENTE NOMINAL DE 20A - FORNECIMENTO E INSTALAÇÃO. AF_04/2016","UN",1,null,null,null,""]
["S",3,"S",0,1,6,2,0,0,0,0,"F","Serviço","Serviço","1.6.2.0.2.","SINAPI",91930,"CABO DE COBRE FLEXÍVEL ISOLADO, 6 MM², ANTI-CHAMA 450/750 V, PARA CIRCUITOS TERMINAIS - FORNECIMENTO E INSTALAÇÃO. AF_12/2015","M",423,null,null,null,"Referência: AGETOP - 70565"]
["S",3,"S",0,1,6,2,0,0,0,0,"F","Serviço","Serviço","1.6.2.0.3.","SINAPI",91872,"ELETRODUTO RÍGIDO ROSCÁVEL, PVC, DN 32 MM (1\"), PARA CIRCUITOS TERMINAIS, INSTALADO EM PAREDE - FORNECIMENTO E INSTALAÇÃO. AF_12/2015","M",85,null,null,null,"Referência: AGETOP - 71202"]
["S",3,"S",0,1,6,2,0,0,0,0,"F","Serviço","Serviço","1.6.2.0.4.","AGETOP",70352,"BRACADEIRA METALICA TIPO \"U\" DIAM. 1\"","Un    ",29,null,null,null,""]
["S",3,"S",0,1,6,2,0,0,0,0,"F","Serviço","Serviço","1.6.2.0.5.","SINAPI",91880,"LUVA PARA ELETRODUTO, PVC, ROSCÁVEL, DN 32 MM (1\"), PARA CIRCUITOS TERMINAIS, INSTALADA EM LAJE - FORNECIMENTO E INSTALAÇÃO. AF_12/2015","UN",29,null,null,null,"Referência: AGETOP - 71742"]
["S",3,"S",0,1,6,2,0,0,0,0,"F","Serviço","Serviço","1.6.2.0.6.","SINAPI",97891,"CAIXA ENTERRADA ELÉTRICA RETANGULAR, EM ALVENARIA COM BLOCOS DE CONCRETO, FUNDO COM BRITA, DIMENSÕES INTERNAS: 0,4X0,4X0,4 M. AF_05/2018","UN",1,null,null,null,""]
["S",3,"S",0,1,6,2,0,0,0,0,"F","Serviço","Serviço","1.6.2.0.7.","SINAPI",6171,"TAMPA DE CONCRETO ARMADO 60X60X5CM PARA CAIXA","UN",1,null,null,null,""]
["S",3,"S",0,1,6,2,0,0,0,0,"F","Serviço","Serviço","1.6.2.0.8.","AGETOP",71861,"PARAFUSO P/BUCHA S-6","Un    ",66,null,null,null,""]
["S",3,"S",0,1,6,2,0,0,0,0,"F","Serviço","Serviço","1.6.2.0.9.","AGETOP",70391,"BUCHA DE NYLON S-6","Un    ",66,null,null,null,""]
[3,3,3,39,1,6,3,0,0,39,124,"F","Nível 3","Nível 3","1.6.3.","SINAPI",null,"SUBESTAÇÃO","-",null,null,null,null,""]
["S",3,"S",0,1,6,3,0,0,0,0,"F","Serviço","Serviço","1.6.3.0.1.","AGETOP",70386,"BRAÇO C AÇO GALVANIZADO , CONFORME NTD-17","un    ",1,null,null,null,""]
["S",3,"S",0,1,6,3,0,0,0,0,"F","Serviço","Serviço","1.6.3.0.2.","SINAPI","73767/2","ALCA PRE-FORMADA DISTRIBUIÇÃO EM  ACO RECOBERTO COM ALUMINIO PARA CABO 25MM2, ENCAPADO. FORNECIMENTO E INSTALAÇÃO.","UN",1,null,null,null,""]
["S",3,"S",0,1,6,3,0,0,0,0,"F","Serviço","Serviço","1.6.3.0.3.","SINAPI","73767/1","GRAMPO PARALELO EM ALUMINIO FUNDIDO OU ESTRUDADO DE 2 PARAFUSOS, PARA CABO DE 6 A 50 MM2, PASTA ANTIOXIDANTE. FORNEC E INSTALAÇÃO.","UN",3,null,null,null,""]
["S",3,"S",0,1,6,3,0,0,0,0,"F","Serviço","Serviço","1.6.3.0.4.","SINAPI",83377,"CONECTOR DE PARAFUSO FENDIDO EM LIGA DE COBRE COM SEPARADOR DE CABOS PARA CABO 50 MM2 - FORNECIMENTO E INSTALACAO","UN",6,null,null,null,""]
["S",3,"S",0,1,6,3,0,0,0,0,"F","Serviço","Serviço","1.6.3.0.5.","SINAPI",72263,"TERMINAL OU CONECTOR DE PRESSAO - PARA CABO 50MM2 - FORNECIMENTO E INSTALACAO","UN",1,null,null,null,""]
["S",3,"S",0,1,6,3,0,0,0,0,"F","Serviço","Serviço","1.6.3.0.6.","AGETOP",71833,"PARA RAIOS DISTRIBUIDOR POLIMÉRICO ÓXIDO DE ZINCO S/CENTELHADOR C/ DESLIGAMENTO AUTOMÁTICO 15KV,10KA","Un    ",3,null,null,null,""]
["S",3,"S",0,1,6,3,0,0,0,0,"F","Serviço","Serviço","1.6.3.0.7.","SINAPI",88544,"ARMACAO SECUNDARIA OU REX COMPLETA PARA DUAS LINHAS-FORNECIMENTO E INSTALACAO.","UN",1,null,null,null,""]
["S",3,"S",0,1,6,3,0,0,0,0,"F","Serviço","Serviço","1.6.3.0.8.","COMPOSIÇÃO","COMP 046_SEE","CAPUZ PARA PROTEÇÃO DOS PARA RAIOS","UN ",3,null,null,null,""]
["S",3,"S",0,1,6,3,0,0,0,0,"F","Serviço","Serviço","1.6.3.0.9.","COMPOSIÇÃO","COMP 047_SEE","CAPUZ DE PROTEÇÃO PARA BUCHA DE TRANSFORMADOR","UN ",3,null,null,null,""]
["S",3,"S",0,1,6,3,0,0,0,0,"F","Serviço","Serviço","1.6.3.0.10.","COMPOSIÇÃO","COMP 048_SEE","HASTE ROSQUEADA \"TIRANTE\" 3/8\"","M",0.5,null,null,null,""]
["S",3,"S",0,1,6,3,0,0,0,0,"F","Serviço","Serviço","1.6.3.0.11.","COMPOSIÇÃO","COMP 049_SEE","PORCA SEXTAVADA 3/8\"","UN ",8,null,null,null,""]
["S",3,"S",0,1,6,3,0,0,0,0,"F","Serviço","Serviço","1.6.3.0.12.","SINAPI","73781/2","ISOLADOR DE PINO TP HI-POT CILINDRICO CLASSE 15KV. FORNECIMENTO E INSTALACAO.","UN",3,null,null,null,""]
["S",3,"S",0,1,6,3,0,0,0,0,"F","Serviço","Serviço","1.6.3.0.13.","SINAPI","73781/3","ISOLADOR DE SUSPENSAO (DISCO) TP CAVILHA CLASSE 15KV - 6''. FORNECIMENTO E INSTALACAO.","UN",1,null,null,null,""]
["S",3,"S",0,1,6,3,0,0,0,0,"F","Serviço","Serviço","1.6.3.0.14.","AGETOP",70252,"ARRUELA LISA D=5/16\"","Un    ",8,null,null,null,""]
["S",3,"S",0,1,6,3,0,0,0,0,"F","Serviço","Serviço","1.6.3.0.15.","AGETOP",70720,"CAIXA METÁLICA PARA MEDIDOR POLIFÁSICO PADRÃO ENEL 500X380X166MM","Un    ",1,null,null,null,""]
["S",3,"S",0,1,6,3,0,0,0,0,"F","Serviço","Serviço","1.6.3.0.16.","AGETOP",70695,"CAIXA METÁLICA PARA PROTEÇÃO GERAL 580X500X216MM ATÉ 175A","Un    ",1,null,null,null,""]
["S",3,"S",0,1,6,3,0,0,0,0,"F","Serviço","Serviço","1.6.3.0.17.","AGETOP",70725,"CAIXA METÁLICA PARA T.C. 580X500X216MM - ATÉ 175A","Un    ",1,null,null,null,""]
["S",3,"S",0,1,6,3,0,0,0,0,"F","Serviço","Serviço","1.6.3.0.18.","SINAPI",93205,"CINTA DE AMARRAÇÃO DE ALVENARIA MOLDADA IN LOCO COM UTILIZAÇÃO DE BLOCOS CANALETA. AF_03/2016","M",6,null,null,null,""]
["S",3,"S",0,1,6,3,0,0,0,0,"F","Serviço","Serviço","1.6.3.0.19.","AGETOP",71268,"ELO FUSÍVEL 6 K","Un    ",3,null,null,null,""]
["S",3,"S",0,1,6,3,0,0,0,0,"F","Serviço","Serviço","1.6.3.0.20.","AGETOP",71186,"DISPOSITIVO DE PROTEÇÃO CONTRA SURTOS (D.P.S.) 275V DE 90KA","Un    ",3,null,null,null,""]
["S",3,"S",0,1,6,3,0,0,0,0,"F","Serviço","Serviço","1.6.3.0.21.","AGETOP",71320,"FITA DE AUTO FUSAO, ROLO DE 2,00 M","Un    ",5,null,null,null,""]
["S",3,"S",0,1,6,3,0,0,0,0,"F","Serviço","Serviço","1.6.3.0.22.","AGETOP",70771,"CANTONEIRA AUXILIAR PARA BRAÇO TIPO C","un    ",3,null,null,null,""]
["S",3,"S",0,1,6,3,0,0,{"$f":"IF(OR($C211=\"S\",$C211=0),0,MATCH(0,OFFSET($D211,1,$C211,ROW($C$584)-ROW($C211)),0))","v":0},{"$f":"IF(OR($C211=\"S\",$C211=0),0,MATCH(OFFSET($D211,0,$C211)+1,OFFSET($D211,1,$C211,ROW($C$584)-ROW($C211)),0))","v":0},"F","Serviço","Serviço","1.6.3.0.23.","SINAPI",93022,"CURVA 90 GRAUS PARA ELETRODUTO, PVC, ROSCÁVEL, DN 75 MM (2 1/2\") - FORNECIMENTO E INSTALAÇÃO. AF_12/2015","UN",2,null,null,null,""]
["S",3,"S",0,1,6,3,0,0,0,0,"F","Serviço","Serviço","1.6.3.0.24.","AGETOP",72329,"SAPATILHA DE AÇO GALVANIZADO PARA POSTE COM TRANSFORMADOR","un    ",3,null,null,null,""]
["S",3,"S",0,1,6,3,0,0,0,0,"F","Serviço","Serviço","1.6.3.0.25.","AGETOP",71795,"OLHAL PARA PARAFUSO","un    ",3,null,null,null,""]
["S",3,"S",0,1,6,3,0,0,0,0,"F","Serviço","Serviço","1.6.3.0.26.","AGETOP",71761,"MURETA MEDIÇÃO ALVEN. 1 1/2 V.(35CM) REBOC.C/PINTURA ACRÍL. E LAJE CONC. 20MPA MALHA 8.0MM CADA 10CM REVEST.C/ARGAMASSA 1:3 C/ IMPERMEABILIZANTE","m2    ",1,null,null,null,""]
["S",3,"S",0,1,6,3,0,0,0,0,"F","Serviço","Serviço","1.6.3.0.27.","AGETOP",71776,"NIPLE METALICO Fo.Zo. DIAMETRO 2.1/2\"","Un    ",1,null,null,null,""]
["S",3,"S",0,1,6,3,0,0,0,0,"F","Serviço","Serviço","1.6.3.0.28.","AGETOP",71791,"NIPLE DUPLO FERRO GALVANIZADO 2\"","Un    ",1,null,null,null,""]
["S",3,"S",0,1,6,3,0,0,0,0,"F","Serviço","Serviço","1.6.3.0.29.","SINAPI",73624,"SUPORTE PARA TRANSFORMADOR EM POSTE DE CONCRETO CIRCULAR","UN",2,null,null,null,""]
["S",3,"S",0,1,6,3,0,0,0,0,"F","Serviço","Serviço","1.6.3.0.30.","AGETOP",72060,"POSTE DE CONCRETO SC 11/400 - SEM FUNDAÇÃO/CONCRETO","Un    ",1,null,null,null,""]
["S",3,"S",0,1,6,3,0,0,0,0,"F","Serviço","Serviço","1.6.3.0.31.","AGETOP",72000,"POSTE - ENGASTAMENTO SIMPLES PARA POSTE DE CONCRETO SEÇÃO CIRCULAR","m3    ",0.5,null,null,null,""]
["S",3,"S",0,1,6,3,0,0,0,0,"F","Serviço","Serviço","1.6.3.0.32.","SINAPI",72263,"TERMINAL OU CONECTOR DE PRESSAO - PARA CABO 50MM2 - FORNECIMENTO E INSTALACAO","UN",1,null,null,null,""]
["S",3,"S",0,1,6,3,0,0,0,0,"F","Serviço","Serviço","1.6.3.0.33.","AGETOP",72535,"TERMINAL DE PRESSAO 70 MMM2","Un    ",8,null,null,null,""]
["S",3,"S",0,1,6,3,0,0,0,0,"F","Serviço","Serviço","1.6.3.0.34.","AGETOP",72528,"TERMINAL DE PRESSAO 35 MM2","Un    ",10,null,null,null,""]
[{"$f":"CHOOSE(1+LOG(1+2*(ORÇAMENTO.Nivel=\"Nível 1\")+4*(ORÇAMENTO.Nivel=\"Nível 2\")+8*(ORÇAMENTO.Nivel=\"Nível 3\")+16*(ORÇAMENTO.Nivel=\"Nível 4\")+32*(ORÇAMENTO.Nivel=\"Serviço\"),2),0,1,2,3,4,\"S\")","v":"S"},{"$f":"IF(OR(C223=\"s\",C223=0),OFFSET(B223,-1,0),C223)","v":3},{"$f":"IF(OFFSET(C223,-1,0)=\"L\",1,IF(OFFSET(C223,-1,0)=1,2,IF(OR(A223=\"s\",A223=0),\"S\",IF(AND(OFFSET(C223,-1,0)=2,A223=4),3,IF(AND(OR(OFFSET(C223,-1,0)=\"s\",OFFSET(C223,-1,0)=0),A223<>\"s\",A223>OFFSET(B223,-1,0)),OFFSET(B223,-1,0),A223)))))","v":"S"},{"$f":"IF(OR(C223=\"S\",C223=0),0,IF(ISERROR(K223),J223,SMALL(J223:K223,1)))","v":0},{"$f":"IF($C223=1,OFFSET(E223,-1,0)+1,OFFSET(E223,-1,0))","v":1},{"$f":"IF($C223=1,0,IF($C223=2,OFFSET(F223,-1,0)+1,OFFSET(F223,-1,0)))","v":6},{"$f":"IF(AND($C223<=2,$C223<>0),0,IF($C223=3,OFFSET(G223,-1,0)+1,OFFSET(G223,-1,0)))","v":3},{"$f":"IF(AND($C223<=3,$C223<>0),0,IF($C223=4,OFFSET(H223,-1,0)+1,OFFSET(H223,-1,0)))","v":0},{"$f":"IF(AND($C223<=4,$C223<>0),0,IF(AND($C223=\"S\",$W223>0),OFFSET(I223,-1,0)+1,OFFSET(I223,-1,0)))","v":0},0,0,"F","Serviço","Serviço","1.6.3.0.35.","AGETOP",72518,"TERMINAL DE PRESSAO 10 MM2","Un    ",10,null,null,null,""]
["S",3,"S",0,1,6,3,0,0,0,0,"F","Serviço","Serviço","1.6.3.0.36.","SINAPI","73857/2","TRANSFORMADOR DISTRIBUICAO  112,5KVA TRIFASICO 60HZ CLASSE 15KV IMERSO EM ÓLEO MINERAL FORNECIMENTO E INSTALACAO","UN",1,null,null,null,""]
["S",3,"S",0,1,6,3,0,0,0,0,"F","Serviço","Serviço","1.6.3.0.37.","AGETOP",72630,"TRILHO OU SUPORTE P/BORNE TERMINAL","M     ",0.2,null,null,null,""]
["S",3,"S",0,1,6,3,0,0,0,0,"F","Serviço","Serviço","1.6.3.0.38.","AGETOP",72080,"POSTE/TRAFO - CAMINHÃO MUNCK 12 TON. (MÍNIMO 4H/DIA)","H     ",8,null,null,null,""]
[2,2,2,51,1,7,0,0,0,166,51,"F","Nível 2","Nível 2","1.7.","AGETOP",null,"INSTALAÇÕES HIDROSSANITÁRIAS","-",null,null,null,null,""]
[3,3,3,2,1,7,1,0,0,50,2,"F","Nível 3","Nível 3","1.7.1.","SINAPI",null,"SANITÁRIO FEMININO","-",null,null,null,null,""]
["S",3,"S",0,1,7,1,0,0,0,0,"F","Serviço","Serviço","1.7.1.0.1.","AGETOP",80515,"VÁLVULA DE DESCARGA DUPLO ACIONAMENTO COM ACABAMENTO CROMADO ","Un    ",1,null,null,null,""]
[3,3,3,3,1,7,2,0,0,48,3,"F","Nível 3","Nível 3","1.7.2.","AGETOP",null,"SANITÁRIO MASCULINO","-",null,null,null,null,""]
["S",3,"S",0,1,7,2,0,0,0,0,"F","Serviço","Serviço","1.7.2.0.1.","AGETOP",80590,"CUBA DE LOUCA DE EMBUTIR OVAL MÉDIA ","Un    ",1,null,null,null,""]
["S",3,"S",0,1,7,2,0,0,0,0,"F","Serviço","Serviço","1.7.2.0.2.","AGETOP",80564,"SIFAO FLEXIVEL UNIVERSAL ( SANFONADO) EM PVC CROMADO PARA LAVATORIO","un    ",1,null,null,null,""]
[3,3,3,45,1,7,3,0,0,45,79,"F","Nível 3","Nível 3","1.7.3.","AGETOP",null,"COMBATE A INCÊNDIO","-",null,null,null,null,""]
["S",3,"S",0,1,7,3,0,0,0,0,"F","Serviço","Serviço","1.7.3.0.1.","COMPOSIÇÃO","COMP 040_SEE","CONJUNTO MOTOR-BOMBA ELÉTRICA TRIFÁSICO 380/220 V PARA VZ= 24,33 M³/H, HM= 46,24 M POTÊNCIA= 7,5 CV","UN ",1,null,null,null,""]
["S",3,"S",0,1,7,3,0,0,0,0,"F","Serviço","Serviço","1.7.3.0.2.","AGETOP",81882,"RES.METALICO TAÇA AÇO PATINÁVEL-V=15M3-COL.SEC.H=6M+FUNDAÇÃO+LOGOTIPO","Un    ",1,null,null,null,""]
["S",3,"S",0,1,7,3,0,0,0,0,"F","Serviço","Serviço","1.7.3.0.3.","AGETOP",81889,"TORNEIRA BOIA DIAMETRO 1\" (25 MM )","Un    ",1,null,null,null,""]
["S",3,"S",0,1,7,3,0,0,0,0,"F","Serviço","Serviço","1.7.3.0.4.","AGETOP",72338,"SIRENE METALICA ALCANCE 500 M","Un    ",1,null,null,null,""]
["S",3,"S",0,1,7,3,0,0,0,0,"F","Serviço","Serviço","1.7.3.0.5.","AGETOP",71156,"CURVA DE 90 GRAUS AÇO GALVANIZADO DIAM. 2.1/2\"","Un    ",1,null,null,null,""]
["S",3,"S",0,1,7,3,0,0,0,0,"F","Serviço","Serviço","1.7.3.0.6.","AGETOP",80910,"REGISTRO DE GAVETA BRUTO DIAMETRO 2.1/2\"","Un    ",2,null,null,null,""]
["S",3,"S",0,1,7,3,0,0,0,0,"F","Serviço","Serviço","1.7.3.0.7.","AGETOP",82379,"TUBO FERRO GALVANIZADO DIAM.2.1/2\"","m     ",205,null,null,null,""]
["S",3,"S",0,1,7,3,0,0,0,0,"F","Serviço","Serviço","1.7.3.0.8.","AGETOP",81003,"TUBO SOLDAVEL PVC MARROM DIAMETRO 25 mm","M     ",40,null,null,null,""]
["S",3,"S",0,1,7,3,0,0,0,0,"F","Serviço","Serviço","1.7.3.0.9.","AGETOP",81321,"JOELHO 90 GRAUS SOLDAVEL DIAMETRO 25 MM","Un    ",4,null,null,null,""]
["S",3,"S",0,1,7,3,0,0,0,0,"F","Serviço","Serviço","1.7.3.0.10.","AGETOP",85003,"EXTINTOR PO QUIMICO SECO (6 KG) - CAPACIDADE EXTINTORA 20 BC","Un    ",2,null,null,null,""]
["S",3,"S",0,1,7,3,0,0,0,0,"F","Serviço","Serviço","1.7.3.0.11.","AGETOP",85006,"EXTINTOR MULTI USO EM PO A B C (6 KG) - CAPACIDADE EXTINTORA 3A 20BC","un    ",4,null,null,null,""]
["S",3,"S",0,1,7,3,0,0,0,0,"F","Serviço","Serviço","1.7.3.0.12.","AGETOP",85011,"CAIXA DE INCÊNDIO METÁLICA COM SUPORTE PARA MANGUEIRA, TAMPA E MURETA 17X60X90 CM C/PINTURA","Un    ",4,null,null,null,""]
["S",3,"S",0,1,7,3,0,0,0,0,"F","Serviço","Serviço","1.7.3.0.13.","AGETOP",85017,"MANGUEIRA DE INCÊNDIO D.I. = 38 MM TIPO 2 COMP. = 15 M","CJ    ",8,null,null,null,""]
["S",3,"S",0,1,7,3,0,0,0,0,"F","Serviço","Serviço","1.7.3.0.14.","AGETOP",85025,"ESGUICHO REGULÁVEL 1.1/2\"","Un    ",4,null,null,null,""]
["S",3,"S",0,1,7,3,0,0,0,0,"F","Serviço","Serviço","1.7.3.0.15.","AGETOP",85027,"ADAPTADOR P/ENGATE STORZ 2.1/2\" X 1.1/2\"","Un    ",5,null,null,null,""]
["S",3,"S",0,1,7,3,0,0,0,0,"F","Serviço","Serviço","1.7.3.0.16.","AGETOP",85031,"REGISTRO GLOBO ANGULAR 2.1/2\"","Un    ",4,null,null,null,""]
["S",3,"S",0,1,7,3,0,0,0,0,"F","Serviço","Serviço","1.7.3.0.17.","AGETOP",85035,"TAMPÃO CEGO COM CORRENTE 2.1/2\"","Un    ",5,null,null,null,""]
["S",3,"S",0,1,7,3,0,0,0,0,"F","Serviço","Serviço","1.7.3.0.18.","AGETOP",85037,"TANQUE DE PRESSÃO DE 10 L","Un    ",1,null,null,null,""]
["S",3,"S",0,1,7,3,0,0,0,0,"F","Serviço","Serviço","1.7.3.0.19.","AGETOP",85039,"PRESSOSTATO 50 A 80 PSI","Un    ",1,null,null,null,""]
["S",3,"S",0,1,7,3,0,0,0,0,"F","Serviço","Serviço","1.7.3.0.20.","AGETOP",85041,"MANOMETRO - 0 A 10 KG/CM2","Un    ",1,null,null,null,""]
["S",3,"S",0,1,7,3,0,0,0,0,"F","Serviço","Serviço","1.7.3.0.21.","AGETOP",85047,"NIPLE DUPLO FERRO GALVANIZADO 2.1/2\"","Un    ",5,null,null,null,""]
["S",3,"S",0,1,7,3,0,0,0,0,"F","Serviço","Serviço","1.7.3.0.22.","SINAPI",92377,"NIPLE, EM FERRO GALVANIZADO, DN 65 (2 1/2\"), CONEXÃO ROSQUEADA, INSTALADO EM REDE DE ALIMENTAÇÃO PARA HIDRANTE - FORNECIMENTO E INSTALAÇÃO. AF_12/2015","UN",4,null,null,null,""]
["S",3,"S",0,1,7,3,0,0,0,0,"F","Serviço","Serviço","1.7.3.0.23.","AGETOP",85077,"VÁLVULA DE RETENÇÃO HORIZONTAL 2.1/2\"","Un    ",2,null,null,null,""]
["S",3,"S",0,1,7,3,0,0,0,0,"F","Serviço","Serviço","1.7.3.0.24.","COMPOSIÇÃO","COMP 017_SEE","REDUCAO GIRATÓRIA TIPO STORZ LATAO P/ INST. PREDIAL COMBATE A INCENDIO ENGATE RAPIDO 2.1/2\" X 1.1/2\"","UN ",1,null,null,null,""]
["S",3,"S",0,1,7,3,0,0,0,0,"F","Serviço","Serviço","1.7.3.0.25.","COMPOSIÇÃO","COMP 018_SEE","CHAVE DUPLA P/ CONEXÕES TIPO STORZ EM LATÃO ENGATE RÁPIDO 1 1/2\" X 2 1/2\"","UN ",4,null,null,null,""]
["S",3,"S",0,1,7,3,0,0,0,0,"F","Serviço","Serviço","1.7.3.0.26.","AGETOP",80981,"REGISTRO DE ESFERA DIAMETRO 2.1/2\"","Un    ",1,null,null,null,""]
["S",3,"S",0,1,7,3,0,0,0,0,"F","Serviço","Serviço","1.7.3.0.27.","COMPOSIÇÃO","COMP 087_SEE","REGISTRO DE GAVETA COM HASTE ASCENDENTE DE BRONZE 2 1/2\"","UN ",1,null,null,null,""]
["S",3,"S",0,1,7,3,0,0,0,0,"F","Serviço","Serviço","1.7.3.0.28.","AGETOP",85056,"TÊ DE FERRO GALVANIZADO 90º X 2 1/2\"","un    ",7,null,null,null,""]
["S",3,"S",0,1,7,3,0,0,0,0,"F","Serviço","Serviço","1.7.3.0.29.","COMPOSIÇÃO","COMP 030_SEE","COTOVELO DE FERRO GALV. 90° X 2 1/2\"","UN ",23,null,null,null,""]
["S",3,"S",0,1,7,3,0,0,0,0,"F","Serviço","Serviço","1.7.3.0.30.","COMPOSIÇÃO","COMP 077_SEE","UNIAO FERRO GALV C/ASSENTO CONICO BRONZE 2 1/2\"","UN ",6,null,null,null,""]
["S",3,"S",0,1,7,3,0,0,0,0,"F","Serviço","Serviço","1.7.3.0.31.","COMPOSIÇÃO","COMP 347_SEE","ADAPTADOR PVC SOLDAVEL, COM FLANGES LIVRES, 75 MM X 2 1/2\", PARA CAIXA D' AGUA","UN ",1,null,null,null,""]
["S",3,"S",0,1,7,3,0,0,0,0,"F","Serviço","Serviço","1.7.3.0.32.","COMPOSIÇÃO","COMP 022_SEE","TAMPÃO FOFO 40X50CM C/INSCRIÇÃO ","UN ",1,null,null,null,""]
["S",3,"S",0,1,7,3,0,0,0,0,"F","Serviço","Serviço","1.7.3.0.33.","COMPOSIÇÃO","COMP 546_SEE","BUJÃO DE REBORDO 2.1/2\"","UN ",1,null,null,null,""]
["S",3,"S",0,1,7,3,0,0,0,0,"F","Serviço","Serviço","1.7.3.0.34.","COMPOSIÇÃO","COMP 186_SEE","BOTOEIRA BOMBA DE INCÊNDIO C/ MARTELO CONVENCIONAL/ ANALÓGICA","UN ",1,null,null,null,""]
["S",3,"S",0,1,7,3,0,0,0,0,"F","Serviço","Serviço","1.7.3.0.35.","COMPOSIÇÃO","COMP 188_SEE","ACIONADOR MANUAL DE ALARME","UN ",4,null,null,null,""]
["S",3,"S",0,1,7,3,0,0,0,0,"F","Serviço","Serviço","1.7.3.0.36.","COMPOSIÇÃO","COMP 190_SEE","CENTRAL DE DETECÇÃO E ALARME DE 40 SETORES COM BATERIA","UN ",1,null,null,null,""]
["S",3,"S",0,1,7,3,0,0,0,0,"F","Serviço","Serviço","1.7.3.0.37.","SINAPI",97599,"LUMINÁRIA DE EMERGÊNCIA - FORNECIMENTO E INSTALAÇÃO. AF_11/2017","UN",19,null,null,null,""]
["S",3,"S",0,1,7,3,0,0,0,0,"F","Serviço","Serviço","1.7.3.0.38.","COMPOSIÇÃO","COMP 024_SEE","SINALIZADOR FOTOLUMINESCENTE PARA EXTINTOR","UN ",6,null,null,null,""]
["S",3,"S",0,1,7,3,0,0,0,0,"F","Serviço","Serviço","1.7.3.0.39.","COMPOSIÇÃO","COMP 025_SEE","SINALIZADOR FOTOLUMINESCENTE DE EMERGÊNCIA","UN ",23,null,null,null,""]
["S",3,"S",0,1,7,3,0,0,0,0,"F","Serviço","Serviço","1.7.3.0.40.","COMPOSIÇÃO","COMP 277_SEE","MARCAÇÃO NO PISO - 1X1 M PARA EXTINTOR","M2",6,null,null,null,""]
["S",3,"S",0,1,7,3,0,0,0,0,"F","Serviço","Serviço","1.7.3.0.41.","COMPOSIÇÃO","COMP 235_SEE","PLACA DE SINALIZAÇÃO EM PVC COD 01 - (300X300) PROIBIDO FUMAR","UN ",1,null,null,null,""]
["S",3,"S",0,1,7,3,0,0,{"$f":"IF(OR($C275=\"S\",$C275=0),0,MATCH(0,OFFSET($D275,1,$C275,ROW($C$584)-ROW($C275)),0))","v":0},{"$f":"IF(OR($C275=\"S\",$C275=0),0,MATCH(OFFSET($D275,0,$C275)+1,OFFSET($D275,1,$C275,ROW($C$584)-ROW($C275)),0))","v":0},"F","Serviço","Serviço","1.7.3.0.42.","COMPOSIÇÃO","COMP 236_SEE","PLACA DE SINALIZAÇÃO EM PVC COD 06 - (300X300) PERIGO INFLAMÁVEL","UN ",1,null,null,null,""]
["S",3,"S",0,1,7,3,0,0,0,0,"F","Serviço","Serviço","1.7.3.0.43.","COMPOSIÇÃO","COMP 411_SEE","PLACA DE SINALIZAÇÃO EM PVC COD 13 - (316X158) SAÍDA DE EMERGÊNCIA","UN ",1,null,null,null,""]
["S",3,"S",0,1,7,3,0,0,0,0,"F","Serviço","Serviço","1.7.3.0.44.","COMPOSIÇÃO","COMP 412_SEE","PLACA DE SINALIZAÇÃO EM PVC COD 17 - (316X158) MENSAGEM \"SAÍDA\"","UN ",2,null,null,null,""]
[{"$f":"CHOOSE(1+LOG(1+2*(ORÇAMENTO.Nivel=\"Nível 1\")+4*(ORÇAMENTO.Nivel=\"Nível 2\")+8*(ORÇAMENTO.Nivel=\"Nível 3\")+16*(ORÇAMENTO.Nivel=\"Nível 4\")+32*(ORÇAMENTO.Nivel=\"Serviço\"),2),0,1,2,3,4,\"S\")","v":2},2,2,27,1,8,0,0,0,115,27,"F","Nível 2","Nível 2","1.8.",null,null,"INSTALAÇÕES ESPECIAIS","-",null,null,null,null,""]
["S",2,"S",0,1,8,0,0,0,0,0,"F","Serviço","Serviço","1.8.0.0.1.","AGETOP",91007,"CENTRAL DE GÁS PADRÃO GOINFRA SEM INSTALAÇÕES (1+1 CILINDRO 45 KG)","Un    ",1,null,null,null,""]
["S",2,"S",0,1,8,0,0,0,0,0,"F","Serviço","Serviço","1.8.0.0.2.","AGETOP",91023,"UNIÃO S/BRONZE PRETA 3/4\" NPT 300 LBS","Un    ",3,null,null,null,""]
["S",2,"S",0,1,8,0,0,0,0,0,"F","Serviço","Serviço","1.8.0.0.3.","COMPOSIÇÃO","COMP 382_SEE","TE DE REDUCAO DE FERRO GALVANIZADO, COM ROSCA BSP, DE 3/4\" X 1/2\"","UN ",1,null,null,null,""]
["S",2,"S",0,1,8,0,0,0,0,0,"F","Serviço","Serviço","1.8.0.0.4.","COMPOSIÇÃO","COMP 383_SEE","BUCHA DE REDUCAO DE FERRO GALVANIZADO, COM ROSCA BSP, DE 1/2\" X 1/4\"","UN ",3,null,null,null,""]
["S",2,"S",0,1,8,0,0,0,0,0,"F","Serviço","Serviço","1.8.0.0.5.","AGETOP",91021,"LUVA GALVANIZADO DE REDUÇÃO 3/4\" X 1/2\" (GÁS)","Un    ",2,null,null,null,""]
["S",2,"S",0,1,8,0,0,0,0,0,"F","Serviço","Serviço","1.8.0.0.6.","SINAPI",92692,"NIPLE, EM FERRO GALVANIZADO, CONEXÃO ROSQUEADA, DN 15 (1/2\"), INSTALADO EM RAMAIS E SUB-RAMAIS DE GÁS - FORNECIMENTO E INSTALAÇÃO. AF_12/2015","UN",6,null,null,null,""]
["S",2,"S",0,1,8,0,0,0,0,0,"F","Serviço","Serviço","1.8.0.0.7.","AGETOP",91031,"NIPLE DUPLO 300 PSI 3/4\"","Un    ",6,null,null,null,""]
["S",2,"S",0,1,8,0,0,0,0,0,"F","Serviço","Serviço","1.8.0.0.8.","COMPOSIÇÃO","COMP 212_SEE","NIPLE DE REDUÇÃO 1/2\" X 1/4\" BSP","UN ",4,null,null,null,""]
["S",2,"S",0,1,8,0,0,0,0,0,"F","Serviço","Serviço","1.8.0.0.9.","COMPOSIÇÃO","COMP 213_SEE","NIPLE DE REDUÇÃO 3/4\" X 1/2\" BSP","UN ",4,null,null,null,""]
["S",2,"S",0,1,8,0,0,0,0,0,"F","Serviço","Serviço","1.8.0.0.10.","SINAPI",92688,"TUBO DE AÇO GALVANIZADO COM COSTURA, CLASSE MÉDIA, CONEXÃO ROSQUEADA, DN 20 (3/4\"), INSTALADO EM RAMAIS E SUB-RAMAIS DE GÁS - FORNECIMENTO E INSTALAÇÃO. AF_12/2015","M",12,null,null,null,""]
["S",2,"S",0,1,8,0,0,0,0,0,"F","Serviço","Serviço","1.8.0.0.11.","SINAPI",92701,"JOELHO 90 GRAUS, EM FERRO GALVANIZADO, CONEXÃO ROSQUEADA, DN 20 (3/4\"), INSTALADO EM RAMAIS E SUB-RAMAIS DE GÁS - FORNECIMENTO E INSTALAÇÃO. AF_12/2015","UN",7,null,null,null,""]
["S",2,"S",0,1,8,0,0,0,0,0,"F","Serviço","Serviço","1.8.0.0.12.","COMPOSIÇÃO","COMP 237_SEE","FITA ANTICORROSIVA","M",7,null,null,null,""]
["S",2,"S",0,1,8,0,0,0,0,0,"F","Serviço","Serviço","1.8.0.0.13.","AGETOP",91025,"VÁLVULA ESFERICA LATÃO 3/4\"","Un    ",3,null,null,null,""]
["S",{"$f":"IF(OR(C292=\"s\",C292=0),OFFSET(B292,-1,0),C292)","v":2},{"$f":"IF(OFFSET(C292,-1,0)=\"L\",1,IF(OFFSET(C292,-1,0)=1,2,IF(OR(A292=\"s\",A292=0),\"S\",IF(AND(OFFSET(C292,-1,0)=2,A292=4),3,IF(AND(OR(OFFSET(C292,-1,0)=\"s\",OFFSET(C292,-1,0)=0),A292<>\"s\",A292>OFFSET(B292,-1,0)),OFFSET(B292,-1,0),A292)))))","v":"S"},{"$f":"IF(OR(C292=\"S\",C292=0),0,IF(ISERROR(K292),J292,SMALL(J292:K292,1)))","v":0},{"$f":"IF($C292=1,OFFSET(E292,-1,0)+1,OFFSET(E292,-1,0))","v":1},{"$f":"IF($C292=1,0,IF($C292=2,OFFSET(F292,-1,0)+1,OFFSET(F292,-1,0)))","v":8},{"$f":"IF(AND($C292<=2,$C292<>0),0,IF($C292=3,OFFSET(G292,-1,0)+1,OFFSET(G292,-1,0)))","v":0},{"$f":"IF(AND($C292<=3,$C292<>0),0,IF($C292=4,OFFSET(H292,-1,0)+1,OFFSET(H292,-1,0)))","v":0},0,0,0,"F","Serviço","Serviço","1.8.0.0.14.","AGETOP",91019,"TE PRETO 90º 3/4\" NPT 300 LBS","Un    ",6,null,null,null,""]
["S",2,"S",0,1,8,0,0,{"$f":"IF(AND($C293<=4,$C293<>0),0,IF(AND($C293=\"S\",$W293>0),OFFSET(I293,-1,0)+1,OFFSET(I293,-1,0)))","v":0},0,0,"F","Serviço","Serviço","1.8.0.0.15.","COMPOSIÇÃO","COMP 542_SEE","VÁLVULA UGV 3/4\" (S) LATÃO","UN ",6,null,null,null,""]
["S",2,"S",0,1,8,0,0,0,0,0,"F","Serviço","Serviço","1.8.0.0.16.","COMPOSIÇÃO","COMP 543_SEE","VÁLVULA UGV 1/2\" (S) LATÃO","UN ",6,null,null,null,""]
["S",2,"S",0,1,8,0,0,0,0,0,"F","Serviço","Serviço","1.8.0.0.17.","AGETOP",91029,"VALVULA DE RETENÇÃO LATÃO 1/2\" X 7/16\" NPT","Un    ",6,null,null,null,""]
["S",2,"S",0,1,8,0,0,0,0,0,"F","Serviço","Serviço","1.8.0.0.18.","COMPOSIÇÃO","COMP 211_SEE","REGULADOR DE 2º ESTÁGIO 5KG/H","UN ",6,null,null,null,""]
["S",2,"S",0,1,8,0,0,0,0,0,"F","Serviço","Serviço","1.8.0.0.19.","COMPOSIÇÃO","COMP 210_SEE","REGULADOR DE 1º ESTÁGIO 60KG/H MODELO AP-40  COM MANÔMETRO","UN ",1,null,null,null,""]
["S",2,"S",0,1,8,0,0,0,0,0,"F","Serviço","Serviço","1.8.0.0.20.","AGETOP",85003,"EXTINTOR PO QUIMICO SECO (6 KG) - CAPACIDADE EXTINTORA 20 BC","Un    ",1,null,null,null,""]
["S",2,"S",0,1,8,0,0,0,0,0,"F","Serviço","Serviço","1.8.0.0.21.","COMPOSIÇÃO","COMP 235_SEE","PLACA DE SINALIZAÇÃO EM PVC COD 01 - (300X300) PROIBIDO FUMAR","UN ",2,null,null,null,""]
["S",2,"S",0,1,8,0,0,0,0,0,"F","Serviço","Serviço","1.8.0.0.22.","COMPOSIÇÃO","COMP 236_SEE","PLACA DE SINALIZAÇÃO EM PVC COD 06 - (300X300) PERIGO INFLAMÁVEL","UN ",2,null,null,null,""]
["S",2,"S",0,1,8,0,0,0,0,0,"F","Serviço","Serviço","1.8.0.0.23.","AGETOP",91043,"BRAÇADEIRA METALICA TIPO \"D\" DIAM. 3/4\"","Un    ",6,null,null,null,""]
["S",2,"S",0,1,8,0,0,0,0,0,"F","Serviço","Serviço","1.8.0.0.24.","AGETOP",71863,"PARAFUSO P/BUCHA S-10","Un    ",12,null,null,null,""]
["S",2,"S",0,1,8,0,0,0,0,0,"F","Serviço","Serviço","1.8.0.0.25.","AGETOP",70393,"BUCHA DE NYLON S-10","Un    ",12,null,null,null,""]
["S",2,"S",0,1,8,0,0,0,0,0,"F","Serviço","Serviço","1.8.0.0.26.","AGETOP",91045,"SUPORTE PARA COLETOR","Un    ",2,null,null,null,""]
[2,2,2,9,1,9,0,0,0,88,9,"F","Nível 2","Nível 2","1.9.",null,null,"ALVENARIAS E DIVISÓRIAS","-",null,null,null,null,""]
[3,3,3,2,1,9,1,0,0,8,2,"F","Nível 3","Nível 3","1.9.1.",null,null,"DML","-",null,null,null,null,""]
["S",3,"S",0,1,9,1,0,0,0,0,"F","Serviço","Serviço","1.9.1.0.1.","AGETOP",100201,"ALVENARIA DE TIJOLO FURADO 1/2 VEZ - 9 x 19 x 19 - ARG. (1CALH:4ARML+100KG DE CI/M3)","m2    ",19.55,null,null,null,""]
[3,3,3,2,1,9,2,0,0,6,2,"F","Nível 3","Nível 3","1.9.2.",null,null,"COPA","-",null,null,null,null,""]
["S",3,"S",0,1,9,2,0,0,0,0,"F","Serviço","Serviço","1.9.2.0.1.","AGETOP",100201,"ALVENARIA DE TIJOLO FURADO 1/2 VEZ - 9 x 19 x 19 - ARG. (1CALH:4ARML+100KG DE CI/M3)","m2    ",5.88,null,null,null,""]
[3,3,3,2,1,9,3,0,0,4,2,"F","Nível 3","Nível 3","1.9.3.",null,null,"ACESSIBILIDADE","-",null,null,null,null,""]
["S",3,"S",0,1,9,3,0,0,0,0,"F","Serviço","Serviço","1.9.3.0.1.","AGETOP",100201,"ALVENARIA DE TIJOLO FURADO 1/2 VEZ - 9 x 19 x 19 - ARG. (1CALH:4ARML+100KG DE CI/M3)","m2    ",60,null,null,null,""]
[3,3,3,2,1,9,4,0,0,2,27,"F","Nível 3","Nível 3","1.9.4.",null,null,"TODO COLÉGIO","-",null,null,null,null,""]
["S",3,"S",0,1,9,4,0,0,0,0,"F","Serviço","Serviço","1.9.4.0.1.","AGETOP",100201,"ALVENARIA DE TIJOLO FURADO 1/2 VEZ - 9 x 19 x 19 - ARG. (1CALH:4ARML+100KG DE CI/M3)","m2    ",9.91,null,null,null,""]
[2,2,2,2,1,10,0,0,0,79,2,"F","Nível 2","Nível 2","1.10.",null,null,"ESTRUTURAS METÁLICAS","-",null,null,null,null,""]
["S",2,"S",0,1,10,0,0,0,0,0,"F","Serviço","Serviço","1.10.0.0.1.","AGETOP",150204,"ESTRUTURA METÁLICA CONVENCIONAL EM AÇO DO TIPO MR-250 / ASTM A36 COM FUNDO ANTICORROSIVO","Kg    ",3427.96,null,null,null,""]
[2,2,2,8,1,11,0,0,0,77,8,"F","Nível 2","Nível 2","1.11.",null,null,"ESQUADRIAS METÁLICAS","-",null,null,null,null,""]
[3,3,3,3,1,11,1,0,0,7,3,"F","Nível 3","Nível 3","1.11.1.","AGETOP",null,"DML","-",null,null,null,null,""]
["S",3,"S",0,1,11,1,0,0,0,0,"F","Serviço","Serviço","1.11.1.0.1.","AGETOP",180501,"PORTA DE ABRIR EM CHAPA PF-1 C/FERRAGENS","m2    ",1.6800000000000002,null,null,null,""]
["S",3,"S",0,1,11,1,0,0,0,0,"F","Serviço","Serviço","1.11.1.0.2.","AGETOP",180401,"ESQ.DE CORRER CHAPA/VIDRO J9/J10/J12/J13 C/FERRAGENS","m2    ",0.3,null,null,null,""]
[3,3,3,2,1,11,2,0,0,4,2,"F","Nível 3","Nível 3","1.11.2.",null,null,"SANITÁRIO FEMININO","-",null,null,null,null,""]
["S",3,"S",0,1,11,2,0,0,0,0,"F","Serviço","Serviço","1.11.2.0.1.","AGETOP",180509,"PORTA ABRIR CH.P/WC PF-10 C/FERRAGENS","m2    ",3.6000000000000005,null,null,null,""]
[3,3,3,2,1,11,3,0,0,2,14,"F","Nível 3","Nível 3","1.11.3.",null,null,"SANITÁRIO MASCULINO","-",null,null,null,null,""]
["S",3,"S",0,1,11,3,0,0,0,0,"F","Serviço","Serviço","1.11.3.0.1.","AGETOP",180509,"PORTA ABRIR CH.P/WC PF-10 C/FERRAGENS","m2    ",3.6000000000000005,null,null,null,""]
[2,2,2,3,1,12,0,0,0,69,3,"F","Nível 2","Nível 2","1.12.",null,null,"VIDROS","-",null,null,null,null,""]
[3,3,3,2,1,12,1,0,0,2,6,"F","Nível 3","Nível 3","1.12.1.","AGETOP",null,"DML","-",null,null,null,null,""]
["S",3,"S",0,1,12,1,0,0,0,0,"F","Serviço","Serviço","1.12.1.0.1.","AGETOP",190102,"VIDRO LISO 4 MM - COLOCADO","m2    ",0.3,null,null,null,""]
[2,2,2,15,1,13,0,0,0,66,15,"F","Nível 2","Nível 2","1.13.",null,null,"REVESTIMENTO DE PAREDE","-",null,null,null,null,""]
[3,3,3,3,1,13,1,0,0,14,3,"F","Nível 3","Nível 3","1.13.1.","AGETOP",null,"DML","-",null,null,null,null,""]
["S",3,"S",0,1,13,1,0,0,0,0,"F","Serviço","Serviço","1.13.1.0.1.","AGETOP",200101,"CHAPISCO COMUM","m2    ",39.1,null,null,null,""]
["S",3,"S",0,1,13,1,0,0,0,0,"F","Serviço","Serviço","1.13.1.0.2.","AGETOP",200500,"REBOCO PAULISTA A-7 (1 CALH,4 ARMLC)","m2    ",39.1,null,null,null,""]
[{"$f":"CHOOSE(1+LOG(1+2*(ORÇAMENTO.Nivel=\"Nível 1\")+4*(ORÇAMENTO.Nivel=\"Nível 2\")+8*(ORÇAMENTO.Nivel=\"Nível 3\")+16*(ORÇAMENTO.Nivel=\"Nível 4\")+32*(ORÇAMENTO.Nivel=\"Serviço\"),2),0,1,2,3,4,\"S\")","v":3},{"$f":"IF(OR(C331=\"s\",C331=0),OFFSET(B331,-1,0),C331)","v":3},{"$f":"IF(OFFSET(C331,-1,0)=\"L\",1,IF(OFFSET(C331,-1,0)=1,2,IF(OR(A331=\"s\",A331=0),\"S\",IF(AND(OFFSET(C331,-1,0)=2,A331=4),3,IF(AND(OR(OFFSET(C331,-1,0)=\"s\",OFFSET(C331,-1,0)=0),A331<>\"s\",A331>OFFSET(B331,-1,0)),OFFSET(B331,-1,0),A331)))))","v":3},{"$f":"IF(OR(C331=\"S\",C331=0),0,IF(ISERROR(K331),J331,SMALL(J331:K331,1)))","v":3},{"$f":"IF($C331=1,OFFSET(E331,-1,0)+1,OFFSET(E331,-1,0))","v":1},{"$f":"IF($C331=1,0,IF($C331=2,OFFSET(F331,-1,0)+1,OFFSET(F331,-1,0)))","v":13},{"$f":"IF(AND($C331<=2,$C331<>0),0,IF($C331=3,OFFSET(G331,-1,0)+1,OFFSET(G331,-1,0)))","v":2},{"$f":"IF(AND($C331<=3,$C331<>0),0,IF($C331=4,OFFSET(H331,-1,0)+1,OFFSET(H331,-1,0)))","v":0},{"$f":"IF(AND($C331<=4,$C331<>0),0,IF(AND($C331=\"S\",$W331>0),OFFSET(I331,-1,0)+1,OFFSET(I331,-1,0)))","v":0},11,3,"F","Nível 3","Nível 3","1.13.2.","AGETOP",null,"COPA","-",null,null,null,null,""]
["S",3,"S",0,1,13,2,0,0,0,0,"F","Serviço","Serviço","1.13.2.0.1.","AGETOP",200101,"CHAPISCO COMUM","m2    ",11.76,null,null,null,""]
["S",3,"S",0,1,13,2,0,0,0,0,"F","Serviço","Serviço","1.13.2.0.2.","AGETOP",200500,"REBOCO PAULISTA A-7 (1 CALH,4 ARMLC)","m2    ",11.76,null,null,null,""]
[3,3,3,2,1,13,3,0,0,8,2,"F","Nível 3","Nível 3","1.13.3.","AGETOP",null,"SANITÁRIO FEMININO","-",null,null,null,null,""]
["S",3,"S",0,1,13,3,0,0,0,0,"F","Serviço","Serviço","1.13.3.0.1.","AGETOP",201302,"REVESTIMENTO COM CERÂMICA ","m2    ",1,null,null,null,""]
[3,3,3,3,1,13,4,0,0,6,3,"F","Nível 3","Nível 3","1.13.4.","AGETOP",null,"ACESSIBILIDADE","-",null,null,null,null,""]
["S",3,"S",0,1,13,4,0,0,0,0,"F","Serviço","Serviço","1.13.4.0.1.","AGETOP",200101,"CHAPISCO COMUM","m2    ",60,null,null,null,""]
["S",3,"S",0,1,13,4,0,0,0,0,"F","Serviço","Serviço","1.13.4.0.2.","AGETOP",200500,"REBOCO PAULISTA A-7 (1 CALH,4 ARMLC)","m2    ",60,null,null,null,""]
[3,3,3,3,1,13,5,0,0,{"$f":"IF(OR($C339=\"S\",$C339=0),0,MATCH(0,OFFSET($D339,1,$C339,ROW($C$584)-ROW($C339)),0))","v":3},{"$f":"IF(OR($C339=\"S\",$C339=0),0,MATCH(OFFSET($D339,0,$C339)+1,OFFSET($D339,1,$C339,ROW($C$584)-ROW($C339)),0))","v":39},"F","Nível 3","Nível 3","1.13.5.","AGETOP",null,"TODO COLÉGIO","-",null,null,null,null,""]
["S",3,"S",0,1,13,5,0,0,0,0,"F","Serviço","Serviço","1.13.5.0.1.","AGETOP",200101,"CHAPISCO COMUM","m2    ",19.82,null,null,null,""]
["S",3,"S",0,1,13,5,0,0,0,0,"F","Serviço","Serviço","1.13.5.0.2.","AGETOP",200500,"REBOCO PAULISTA A-7 (1 CALH,4 ARMLC)","m2    ",19.82,null,null,null,""]
[2,2,2,7,1,14,0,0,0,51,7,"F","Nível 2","Nível 2","1.14.",null,null,"REVESTIMENTO DE PISO","-",null,null,null,null,""]
[3,3,3,6,1,14,1,0,0,6,10,"F","Nível 3","Nível 3","1.14.1.",null,null,"ACESSIBILIDADE","-",null,null,null,null,""]
[4,4,4,2,1,14,1,1,0,5,2,"F","Nível 4","Nível 4","1.14.1.1.","AGETOP",null,"RAMPA","-",null,null,null,null,""]
["S",4,"S",0,1,14,1,1,0,0,0,"F","Serviço","Serviço","1.14.1.1.1.","AGETOP",220102,"PISO CONCRETO DESEMPENADO ESPESSURA = 5 CM  1:2,5:3,5","m2    ",11.88,null,null,null,""]
[4,4,4,3,1,14,1,2,0,3,{"$error":"#N/A"},"F","Nível 4","Nível 4","1.14.1.2.","SINAPI",null,"PODOTÁTIL","-",null,null,null,null,""]
["S",4,"S",0,1,14,1,2,0,0,0,"F","Serviço","Serviço","1.14.1.2.1.","AGETOP",221120,"PISO DE BORRACHA COLORIDO MODELO TÁTIL ( ALERTA OU DIRECIONAL) INCLUSO CONTRAPISO (1CI:3ARML) C/ E=2CM E NATA DE CIMENTO","m2    ",4.0200000000000005,null,null,null,""]
["S",4,"S",0,1,14,1,2,0,0,0,"F","Serviço","Serviço","1.14.1.2.2.","AGETOP",221126,"PISO DE LADRILHO HIDRÁULICO COLORIDO MODELO TÁTIL ( ALERTA OU DIRECIONAL) SEM LASTRO","m2    ",78.41,null,null,null,""]
[2,2,2,7,1,15,0,0,0,44,7,"F","Nível 2","Nível 2","1.15.",null,null,"FERRAGENS","-",null,null,null,null,""]
[3,3,3,3,1,15,1,0,0,6,3,"F","Nível 3","Nível 3","1.15.1.","AGETOP",null,"SANITÁRIO FEMININO","-",null,null,null,null,""]
["S",3,"S",0,1,15,1,0,0,0,0,"F","Serviço","Serviço","1.15.1.0.1.","AGETOP",230174,"BARRA DE APOIO EM AÇO INOX - 40 CM","un    ",1,null,null,null,""]
["S",3,"S",0,1,15,1,0,0,0,0,"F","Serviço","Serviço","1.15.1.0.2.","AGETOP",230176,"BARRA DE APOIO EM AÇO INOX - 80 CM ","un    ",3,null,null,null,""]
[3,3,3,3,1,15,2,0,0,3,17,"F","Nível 3","Nível 3","1.15.2.","AGETOP",null,"SANITÁRIO MASCULINO","-",null,null,null,null,""]
["S",3,"S",0,1,15,2,0,0,0,0,"F","Serviço","Serviço","1.15.2.0.1.","AGETOP",230174,"BARRA DE APOIO EM AÇO INOX - 40 CM","un    ",1,null,null,null,""]
["S",3,"S",0,1,15,2,0,0,0,0,"F","Serviço","Serviço","1.15.2.0.2.","AGETOP",230176,"BARRA DE APOIO EM AÇO INOX - 80 CM ","un    ",3,null,null,null,""]
[2,2,2,6,1,16,0,0,0,37,6,"F","Nível 2","Nível 2","1.16.",null,null,"ADMINISTRAÇÃO","-",null,null,null,null,""]
[3,3,3,3,1,16,1,0,0,5,3,"F","Nível 3","Nível 3","1.16.1.",null,null,"MENSALISTAS","-",null,null,null,null,""]
["S",3,"S",0,1,16,1,0,0,0,0,"F","Serviço","Serviço","1.16.1.0.1.","AGETOP",250101,"ENGENHEIRO - (OBRAS CIVIS)","H     ",120,null,null,null,""]
["S",3,"S",0,1,16,1,0,0,0,0,"F","Serviço","Serviço","1.16.1.0.2.","AGETOP",250103,"ENCARREGADO - (OBRAS CIVIS)","H     ",880,null,null,null,""]
[3,3,3,2,1,16,2,0,0,2,10,"F","Nível 3","Nível 3","1.16.2.",null,null,"LAUDO DE ESTANQUEIDADE","-",null,null,null,null,""]
["S",3,"S",0,1,16,2,0,0,0,0,"F","Serviço","Serviço","1.16.2.0.1.","AGETOP",250101,"ENGENHEIRO - (OBRAS CIVIS)","H     ",16,null,null,null,""]
[2,2,2,22,1,17,0,0,0,31,22,"F","Nível 2","Nível 2","1.17.",null,null,"PINTURA","-",null,null,null,null,""]
[{"$f":"CHOOSE(1+LOG(1+2*(ORÇAMENTO.Nivel=\"Nível 1\")+4*(ORÇAMENTO.Nivel=\"Nível 2\")+8*(ORÇAMENTO.Nivel=\"Nível 3\")+16*(ORÇAMENTO.Nivel=\"Nível 4\")+32*(ORÇAMENTO.Nivel=\"Serviço\"),2),0,1,2,3,4,\"S\")","v":3},3,3,2,1,17,1,0,{"$f":"IF(AND($C363<=4,$C363<>0),0,IF(AND($C363=\"S\",$W363>0),OFFSET(I363,-1,0)+1,OFFSET(I363,-1,0)))","v":0},21,2,"F","Nível 3","Nível 3","1.17.1.","AGETOP",null,"VIGAS E PILARES","-",null,null,null,null,""]
["S",{"$f":"IF(OR(C364=\"s\",C364=0),OFFSET(B364,-1,0),C364)","v":3},{"$f":"IF(OFFSET(C364,-1,0)=\"L\",1,IF(OFFSET(C364,-1,0)=1,2,IF(OR(A364=\"s\",A364=0),\"S\",IF(AND(OFFSET(C364,-1,0)=2,A364=4),3,IF(AND(OR(OFFSET(C364,-1,0)=\"s\",OFFSET(C364,-1,0)=0),A364<>\"s\",A364>OFFSET(B364,-1,0)),OFFSET(B364,-1,0),A364)))))","v":"S"},{"$f":"IF(OR(C364=\"S\",C364=0),0,IF(ISERROR(K364),J364,SMALL(J364:K364,1)))","v":0},{"$f":"IF($C364=1,OFFSET(E364,-1,0)+1,OFFSET(E364,-1,0))","v":1},{"$f":"IF($C364=1,0,IF($C364=2,OFFSET(F364,-1,0)+1,OFFSET(F364,-1,0)))","v":17},{"$f":"IF(AND($C364<=2,$C364<>0),0,IF($C364=3,OFFSET(G364,-1,0)+1,OFFSET(G364,-1,0)))","v":1},{"$f":"IF(AND($C364<=3,$C364<>0),0,IF($C364=4,OFFSET(H364,-1,0)+1,OFFSET(H364,-1,0)))","v":0},0,0,0,"F","Serviço","Serviço","1.17.1.0.1.","AGETOP",261609,"PINTURA ESMALTE ALQUIDICO ESTR.METALICA 2 DEMAOS","m2    ",177.62,null,null,null,""]
[3,3,3,5,1,17,2,0,0,19,5,"F","Nível 3","Nível 3","1.17.2.","AGETOP",null,"DML","-",null,null,null,null,""]
["S",3,"S",0,1,17,2,0,0,0,0,"F","Serviço","Serviço","1.17.2.0.1.","AGETOP",261550,"PINT.ESMALTE SINT.PAREDES - 2 DEM.C/SELADOR","m2    ",12.22,null,null,null,""]
["S",3,"S",0,1,17,2,0,0,0,0,"F","Serviço","Serviço","1.17.2.0.2.","AGETOP",261000,"PINTURA LATEX ACRILICA 2 DEMAOS C/SELADOR","m2    ",12.22,null,null,null,""]
["S",3,"S",0,1,17,2,0,0,0,0,"F","Serviço","Serviço","1.17.2.0.3.","AGETOP",260601,"PINTURA TEXTURIZADA C/SELADOR ACRILICO","m2    ",22.98,null,null,null,""]
["S",3,"S",0,1,17,2,0,0,0,0,"F","Serviço","Serviço","1.17.2.0.4.","AGETOP",261602,"PINT.ESMALTE/ESQUAD.FERRO C/FUNDO ANTICOR.","m2    ",3.96,null,null,null,""]
[3,3,3,4,1,17,3,0,0,14,4,"F","Nível 3","Nível 3","1.17.3.",null,null,"COPA","-",null,null,null,null,""]
["S",3,"S",0,1,17,3,0,0,0,0,"F","Serviço","Serviço","1.17.3.0.1.","AGETOP",261550,"PINT.ESMALTE SINT.PAREDES - 2 DEM.C/SELADOR","m2    ",2.94,null,null,null,""]
["S",3,"S",0,1,17,3,0,0,0,0,"F","Serviço","Serviço","1.17.3.0.2.","AGETOP",261000,"PINTURA LATEX ACRILICA 2 DEMAOS C/SELADOR","m2    ",2.94,null,null,null,""]
["S",3,"S",0,1,17,3,0,0,0,0,"F","Serviço","Serviço","1.17.3.0.3.","AGETOP",260601,"PINTURA TEXTURIZADA C/SELADOR ACRILICO","m2    ",5.88,null,null,null,""]
[3,3,3,2,1,17,4,0,0,10,2,"F","Nível 3","Nível 3","1.17.4.","AGETOP",null,"SANITÁRIO FEMININO","-",null,null,null,null,""]
["S",3,"S",0,1,17,4,0,0,0,0,"F","Serviço","Serviço","1.17.4.0.1.","AGETOP",261602,"PINT.ESMALTE/ESQUAD.FERRO C/FUNDO ANTICOR.","m2    ",10.08,null,null,null,""]
[3,3,3,2,1,17,5,0,0,8,2,"F","Nível 3","Nível 3","1.17.5.",null,null,"SANITÁRIO MASCULINO","-",null,null,null,null,""]
["S",3,"S",0,1,17,5,0,0,0,0,"F","Serviço","Serviço","1.17.5.0.1.","AGETOP",261602,"PINT.ESMALTE/ESQUAD.FERRO C/FUNDO ANTICOR.","m2    ",10.08,null,null,null,""]
[3,3,3,2,1,17,6,0,0,6,2,"F","Nível 3","Nível 3","1.17.6.","AGETOP",null,"ACESSIBILIDADE","-",null,null,null,null,""]
["S",3,"S",0,1,17,6,0,0,0,0,"F","Serviço","Serviço","1.17.6.0.1.","AGETOP",261000,"PINTURA LATEX ACRILICA 2 DEMAOS C/SELADOR","m2    ",60,null,null,null,""]
[3,3,3,4,1,17,7,0,0,4,{"$error":"#N/A"},"F","Nível 3","Nível 3","1.17.7.",null,null,"TODO COLÉGIO","-",null,null,null,null,""]
["S",3,"S",0,1,17,7,0,0,0,0,"F","Serviço","Serviço","1.17.7.0.1.","AGETOP",261300,"EMASSAMENTO COM MASSA PVA DUAS DEMAOS","m2    ",1255.54,null,null,null,""]
["S",3,"S",0,1,17,7,0,0,0,0,"F","Serviço","Serviço","1.17.7.0.2.","AGETOP",261550,"PINT.ESMALTE SINT.PAREDES - 2 DEM.C/SELADOR","m2    ",1255.54,null,null,null,""]
["S",3,"S",0,1,17,7,0,0,0,0,"F","Serviço","Serviço","1.17.7.0.3.","AGETOP",261000,"PINTURA LATEX ACRILICA 2 DEMAOS C/SELADOR","m2    ",2056.4499999999998,null,null,null,""]
[2,{"$f":"IF(OR(C384=\"s\",C384=0),OFFSET(B384,-1,0),C384)","v":2},{"$f":"IF(OFFSET(C384,-1,0)=\"L\",1,IF(OFFSET(C384,-1,0)=1,2,IF(OR(A384=\"s\",A384=0),\"S\",IF(AND(OFFSET(C384,-1,0)=2,A384=4),3,IF(AND(OR(OFFSET(C384,-1,0)=\"s\",OFFSET(C384,-1,0)=0),A384<>\"s\",A384>OFFSET(B384,-1,0)),OFFSET(B384,-1,0),A384)))))","v":2},{"$f":"IF(OR(C384=\"S\",C384=0),0,IF(ISERROR(K384),J384,SMALL(J384:K384,1)))","v":9},{"$f":"IF($C384=1,OFFSET(E384,-1,0)+1,OFFSET(E384,-1,0))","v":1},{"$f":"IF($C384=1,0,IF($C384=2,OFFSET(F384,-1,0)+1,OFFSET(F384,-1,0)))","v":18},{"$f":"IF(AND($C384<=2,$C384<>0),0,IF($C384=3,OFFSET(G384,-1,0)+1,OFFSET(G384,-1,0)))","v":0},{"$f":"IF(AND($C384<=3,$C384<>0),0,IF($C384=4,OFFSET(H384,-1,0)+1,OFFSET(H384,-1,0)))","v":0},{"$f":"IF(AND($C384<=4,$C384<>0),0,IF(AND($C384=\"S\",$W384>0),OFFSET(I384,-1,0)+1,OFFSET(I384,-1,0)))","v":0},9,{"$error":"#N/A"},"F","Nível 2","Nível 2","1.18.",null,null,"DIVERSOS","-",null,null,null,null,""]
[3,3,3,2,1,18,1,0,0,8,2,"F","Nível 3","Nível 3","1.18.1.","AGETOP",null,"LABORATÓRIO DE FÍSICA","-",null,null,null,null,""]
["S",3,"S",0,1,18,1,0,0,0,0,"F","Serviço","Serviço","1.18.1.0.1.","AGETOP",271608,"BANCADA DE GRANITO C/ESPELHO","m2    ",12.36,null,null,null,""]
[3,3,3,4,1,18,2,0,0,6,4,"F","Nível 3","Nível 3","1.18.2.",null,null,"ACESSIBILIDADE","-",null,null,null,null,""]
["S",3,"S",0,1,18,2,0,0,0,0,"F","Serviço","Serviço","1.18.2.0.1.","COMPOSIÇÃO","COMP 084_SEE","GUARDA-CORPO COM CORRIMÃO - SEDUC","M",12.9,null,null,null,""]
["S",3,"S",0,1,18,2,0,0,0,0,"F","Serviço","Serviço","1.18.2.0.2.","COMPOSIÇÃO","COMP 083_SEE","CORRIMÃO PISO - SEDUC","M",21.74,null,null,null,""]
["S",3,"S",0,1,18,2,0,0,0,0,"F","Serviço","Serviço","1.18.2.0.3.","COMPOSIÇÃO","COMP 086_SEE","ELEVADOR (PLATAFORMA VERTICAL) MODELO HERA OU EQUIVALENTE 02 PARADAS - CAPACIDADE 280KG (INSTALADO)","UN ",1,null,null,null,""]
[3,3,3,2,1,18,3,0,0,2,{"$error":"#N/A"},"F","Nível 3","Nível 3","1.18.3.",null,null,"OUTROS","-",null,null,null,null,""]
["S",3,"S",0,1,18,3,0,0,0,0,"F","Serviço","Serviço","1.18.3.0.1.","AGETOP",270501,"LIMPEZA FINAL DE OBRA - (OBRAS CIVIS)","m2    ",300,null,null,null,""]
[1,1,1,109,2,0,0,0,0,191,109,"F","Nível 1","Nível 1","2.","AGETOP",null,"PÁTIO MULTIUSO - PADRÃO SEDUC - OPÇÃO 2 ","-",null,null,null,null,""]
[{"$f":"CHOOSE(1+LOG(1+2*(ORÇAMENTO.Nivel=\"Nível 1\")+4*(ORÇAMENTO.Nivel=\"Nível 2\")+8*(ORÇAMENTO.Nivel=\"Nível 3\")+16*(ORÇAMENTO.Nivel=\"Nível 4\")+32*(ORÇAMENTO.Nivel=\"Serviço\"),2),0,1,2,3,4,\"S\")","v":2},2,2,2,2,1,0,0,0,108,2,"F","Nível 2","Nível 2","2.1.","AGETOP",null,"SERVIÇOS PRELIMINARES","-",null,null,null,null,""]
["S",2,"S",0,2,1,0,0,0,0,0,"F","Serviço","Serviço","2.1.0.0.1.","AGETOP",20701,"LOCAÇÃO DA OBRA, EXECUÇÃO DE GABARITO SEM REAPROVEITAMENTO, INCLUSO PINTURA (FACE INTERNA DO RIPÃO 15CM) E PIQUETE COM TESTEMUNHA","m2    ",89.67,null,null,null,""]
[2,2,2,3,2,2,0,0,0,106,3,"F","Nível 2","Nível 2","2.2.","SINAPI",null,"TRANSPORTES","-",null,null,null,null,""]
["S",2,"S",0,2,2,0,0,0,0,0,"F","Serviço","Serviço","2.2.0.0.1.","SINAPI",72897,"CARGA MANUAL DE ENTULHO EM CAMINHAO BASCULANTE 6 M3","M3",6,null,null,null,""]
["S",2,"S",0,2,2,0,0,0,0,0,"F","Serviço","Serviço","2.2.0.0.2.","SINAPI",72900,"TRANSPORTE DE ENTULHO COM CAMINHAO BASCULANTE 6 M3, RODOVIA PAVIMENTADA, DMT 0,5 A 1,0 KM","M3",6,null,null,null,""]
[2,2,2,3,2,3,0,0,0,103,3,"F","Nível 2","Nível 2","2.3.","SINAPI",null,"SERVIÇO EM TERRA","-",null,null,null,null,""]
["S",2,"S",0,2,3,0,0,0,0,0,"F","Serviço","Serviço","2.3.0.0.1.","AGETOP",40101,"ESCAVACAO MANUAL DE VALAS < 1 MTS. (OBRAS CIVIS)","m3    ",2.8,null,null,null,""]
["S",2,"S",0,2,3,0,0,0,{"$f":"IF(OR($C401=\"S\",$C401=0),0,MATCH(0,OFFSET($D401,1,$C401,ROW($C$584)-ROW($C401)),0))","v":0},{"$f":"IF(OR($C401=\"S\",$C401=0),0,MATCH(OFFSET($D401,0,$C401)+1,OFFSET($D401,1,$C401,ROW($C$584)-ROW($C401)),0))","v":0},"F","Serviço","Serviço","2.3.0.0.2.","AGETOP",40902,"REATERRO COM APILOAMENTO","m3    ",1.4,null,null,null,""]
[2,2,2,10,2,4,0,0,0,100,10,"F","Nível 2","Nível 2","2.4.","SINAPI",null,"FUNDAÇÕES E SONDAGENS","-",null,null,null,null,""]
["S",2,"S",0,2,4,0,0,0,0,0,"F","Serviço","Serviço","2.4.0.0.1.","AGETOP",50302,"ESTACA A TRADO DIAM.30 CM SEM FERRO","M     ",36,null,null,null,""]
["S",2,"S",0,2,4,0,0,0,0,0,"F","Serviço","Serviço","2.4.0.0.2.","SINAPI",96521,"ESCAVAÇÃO MECANIZADA PARA BLOCO DE COROAMENTO OU SAPATA, COM PREVISÃO DE FÔRMA, COM RETROESCAVADEIRA. AF_06/2017","M3",3.78,null,null,null,""]
["S",2,"S",0,2,4,0,0,0,0,0,"F","Serviço","Serviço","2.4.0.0.3.","AGETOP",40904,"REATERRO COM APILOAMENTO MECÂNICO","m3    ",0.28000000000000003,null,null,null,""]
["S",2,"S",0,2,4,0,0,0,0,0,"F","Serviço","Serviço","2.4.0.0.4.","AGETOP",51009,"FORMA TABUA PINHO P/FUNDACOES U=3V - (OBRAS CIVIS)","m2    ",3.5,null,null,null,""]
["S",2,"S",0,2,4,0,0,0,0,0,"F","Serviço","Serviço","2.4.0.0.5.","SINAPI",94964,"CONCRETO FCK = 20MPA, TRAÇO 1:2,7:3 (CIMENTO/ AREIA MÉDIA/ BRITA 1)  - PREPARO MECÂNICO COM BETONEIRA 400 L. AF_07/2016","M3",0.18,null,null,null,""]
["S",2,"S",0,2,4,0,0,0,0,0,"F","Serviço","Serviço","2.4.0.0.6.","SINAPI",92874,"LANÇAMENTO COM USO DE BOMBA, ADENSAMENTO E ACABAMENTO DE CONCRETO EM ESTRUTURAS. AF_12/2015","M3",0.18,null,null,null,""]
["S",2,"S",0,2,4,0,0,0,0,0,"F","Serviço","Serviço","2.4.0.0.7.","AGETOP",52003,"ACO CA-50A - 6,3 MM (1/4\") - (OBRAS CIVIS)","Kg    ",26,null,null,null,""]
["S",2,"S",0,2,4,0,0,0,0,0,"F","Serviço","Serviço","2.4.0.0.8.","AGETOP",52004,"ACO CA 50-A - 8,0 MM (5/16\") - (OBRAS CIVIS)","Kg    ",115,null,null,null,""]
["S",2,"S",0,2,4,0,0,0,0,0,"F","Serviço","Serviço","2.4.0.0.9.","AGETOP",52014,"ACO CA-60 - 5,0 MM - (OBRAS CIVIS)","Kg    ",20,null,null,null,""]
[2,2,2,8,2,5,0,0,0,90,8,"F","Nível 2","Nível 2","2.5.","SINAPI",null,"ESTRUTURA","-",null,null,null,null,""]
["S",2,"S",0,2,5,0,0,0,0,0,"F","Serviço","Serviço","2.5.0.0.1.","SINAPI",92415,"MONTAGEM E DESMONTAGEM DE FÔRMA DE PILARES RETANGULARES E ESTRUTURAS SIMILARES COM ÁREA MÉDIA DAS SEÇÕES MAIOR QUE 0,25 M², PÉ-DIREITO SIMPLES, EM CHAPA DE MADEIRA COMPENSADA RESINADA, 2 UTILIZAÇÕES. AF_12/2015","M2",30.22,null,null,null,""]
["S",2,"S",0,2,5,0,0,0,0,0,"F","Serviço","Serviço","2.5.0.0.2.","AGETOP",60192,"FORMA DE TABUA CINTA/PILAR SOBRE/ENTRE ALVENARIA U=8 VEZES","m2    ",72.239999999999995,null,null,null,""]
["S",2,"S",0,2,5,0,0,0,0,0,"F","Serviço","Serviço","2.5.0.0.3.","AGETOP",60304,"ACO CA-50 A - 8,0 MM (5/16\") - (OBRAS CIVIS)","Kg    ",155,null,null,null,""]
["S",2,"S",0,2,5,0,0,0,0,0,"F","Serviço","Serviço","2.5.0.0.4.","AGETOP",60305,"ACO CA-50A - 10,0 MM (3/8\") - (OBRAS CIVIS)","Kg    ",233,null,null,null,""]
["S",2,"S",0,2,5,0,0,0,0,0,"F","Serviço","Serviço","2.5.0.0.5.","AGETOP",60314,"ACO CA - 60 - 5,0 MM - (OBRAS CIVIS)","Kg    ",111,null,null,null,""]
["S",2,"S",0,2,5,0,0,0,0,0,"F","Serviço","Serviço","2.5.0.0.6.","SINAPI",94964,"CONCRETO FCK = 20MPA, TRAÇO 1:2,7:3 (CIMENTO/ AREIA MÉDIA/ BRITA 1)  - PREPARO MECÂNICO COM BETONEIRA 400 L. AF_07/2016","M3",3.91,null,null,null,""]
["S",2,"S",0,2,5,0,0,0,0,0,"F","Serviço","Serviço","2.5.0.0.7.","SINAPI",92874,"LANÇAMENTO COM USO DE BOMBA, ADENSAMENTO E ACABAMENTO DE CONCRETO EM ESTRUTURAS. AF_12/2015","M3",3.91,null,null,null,""]
[2,2,2,19,2,6,0,0,0,82,19,"F","Nível 2","Nível 2","2.6.","SINAPI",null,"INSTALAÇÕES ELÉTRICAS","-",null,null,null,null,""]
["S",2,"S",0,2,6,0,0,0,0,0,"F","Serviço","Serviço","2.6.0.0.1.","SINAPI",91927,"CABO DE COBRE FLEXÍVEL ISOLADO, 2,5 MM², ANTI-CHAMA 0,6/1,0 KV, PARA CIRCUITOS TERMINAIS - FORNECIMENTO E INSTALAÇÃO. AF_12/2015","M",197,null,null,null,"Referência: AGETOP - 70581"]
["S",2,"S",0,2,6,0,0,0,0,0,"F","Serviço","Serviço","2.6.0.0.2.","SINAPI",91940,"CAIXA RETANGULAR 4\" X 2\" MÉDIA (1,30 M DO PISO), PVC, INSTALADA EM PAREDE - FORNECIMENTO E INSTALAÇÃO. AF_12/2015","UN",5,null,null,null,""]
["S",2,"S",0,2,6,0,0,0,0,0,"F","Serviço","Serviço","2.6.0.0.3.","SINAPI",91914,"CURVA 90 GRAUS PARA ELETRODUTO, PVC, ROSCÁVEL, DN 25 MM (3/4\"), PARA CIRCUITOS TERMINAIS, INSTALADA EM PAREDE - FORNECIMENTO E INSTALAÇÃO. AF_12/2015","UN",15,null,null,null,""]
["S",2,"S",0,2,6,0,0,0,0,0,"F","Serviço","Serviço","2.6.0.0.4.","SINAPI",91917,"CURVA 90 GRAUS PARA ELETRODUTO, PVC, ROSCÁVEL, DN 32 MM (1\"), PARA CIRCUITOS TERMINAIS, INSTALADA EM PAREDE - FORNECIMENTO E INSTALAÇÃO. AF_12/2015","UN",7,null,null,null,""]
["S",2,"S",0,2,6,0,0,0,0,0,"F","Serviço","Serviço","2.6.0.0.5.","SINAPI",93654,"DISJUNTOR MONOPOLAR TIPO DIN, CORRENTE NOMINAL DE 16A - FORNECIMENTO E INSTALAÇÃO. AF_04/2016","UN",3,null,null,null,""]
["S",2,"S",0,2,6,0,0,0,0,0,"F","Serviço","Serviço","2.6.0.0.6.","SINAPI",93671,"DISJUNTOR TRIPOLAR TIPO DIN, CORRENTE NOMINAL DE 32A - FORNECIMENTO E INSTALAÇÃO. AF_04/2016","UN",1,null,null,null,"Referência: AGETOP - 71173"]
["S",2,"S",0,2,6,0,0,0,0,0,"F","Serviço","Serviço","2.6.0.0.7.","SINAPI",91871,"ELETRODUTO RÍGIDO ROSCÁVEL, PVC, DN 25 MM (3/4\"), PARA CIRCUITOS TERMINAIS, INSTALADO EM PAREDE - FORNECIMENTO E INSTALAÇÃO. AF_12/2015","M",24,null,null,null,"Referência: AGETOP - 71201"]
["S",2,"S",0,2,6,0,0,0,0,0,"F","Serviço","Serviço","2.6.0.0.8.","SINAPI",91856,"ELETRODUTO FLEXÍVEL CORRUGADO, PVC, DN 32 MM (1\"), PARA CIRCUITOS TERMINAIS, INSTALADO EM PAREDE - FORNECIMENTO E INSTALAÇÃO. AF_12/2015","M",13,null,null,null,""]
["S",2,"S",0,2,6,0,0,0,0,0,"F","Serviço","Serviço","2.6.0.0.9.","SINAPI",91953,"INTERRUPTOR SIMPLES (1 MÓDULO), 10A/250V, INCLUINDO SUPORTE E PLACA - FORNECIMENTO E INSTALAÇÃO. AF_12/2015","UN",1,null,null,null,"Referência: AGETOP - 71440"]
["S",2,"S",0,2,6,0,0,0,0,0,"F","Serviço","Serviço","2.6.0.0.10.","COMPOSIÇÃO","COMP 387_SEE","LÂMPADA LED TUBULAR 18W ","UN ",16,null,null,null,""]
["S",2,"S",0,2,6,0,0,0,0,0,"F","Serviço","Serviço","2.6.0.0.11.","SINAPI",97585,"LUMINÁRIA TIPO CALHA, DE SOBREPOR, COM 2 LÂMPADAS TUBULARES DE 18 W - FORNECIMENTO E INSTALAÇÃO. AF_11/2017","UN",8,null,null,null,""]
["S",2,"S",0,2,6,0,0,0,0,0,"F","Serviço","Serviço","2.6.0.0.12.","SINAPI",91884,"LUVA PARA ELETRODUTO, PVC, ROSCÁVEL, DN 25 MM (3/4\"), PARA CIRCUITOS TERMINAIS, INSTALADA EM PAREDE - FORNECIMENTO E INSTALAÇÃO. AF_12/2015","UN",15,null,null,null,"Referência: AGETOP - 71741"]
["S",2,"S",0,2,6,0,0,0,0,0,"F","Serviço","Serviço","2.6.0.0.13.","SINAPI",91885,"LUVA PARA ELETRODUTO, PVC, ROSCÁVEL, DN 32 MM (1\"), PARA CIRCUITOS TERMINAIS, INSTALADA EM PAREDE - FORNECIMENTO E INSTALAÇÃO. AF_12/2015","UN",7,null,null,null,"Referência: AGETOP - 71742"]
["S",2,"S",0,2,6,0,0,0,0,0,"F","Serviço","Serviço","2.6.0.0.14.","SINAPI",91996,"TOMADA MÉDIA DE EMBUTIR (1 MÓDULO), 2P+T 10 A, INCLUINDO SUPORTE E PLACA - FORNECIMENTO E INSTALAÇÃO. AF_12/2015","UN",4,null,null,null,"Referência: AGETOP - 72578"]
["S",2,"S",0,2,6,0,0,0,0,0,"F","Serviço","Serviço","2.6.0.0.15.","SINAPI",91997,"TOMADA MÉDIA DE EMBUTIR (1 MÓDULO), 2P+T 20 A, INCLUINDO SUPORTE E PLACA - FORNECIMENTO E INSTALAÇÃO. AF_12/2015","UN",1,null,null,null,""]
["S",2,"S",0,2,6,0,0,0,0,0,"F","Serviço","Serviço","2.6.0.0.16.","AGETOP",71450,"INTERRUPTOR DIFERENCIAL RESIDUAL (D.R.) BIPOLAR DE 25A-30mA","Un    ",3,null,null,null,""]
["S",2,"S",0,2,6,0,0,0,0,0,"F","Serviço","Serviço","2.6.0.0.17.","AGETOP",71331,"FITA ISOLANTE, ROLO DE 20,00 M","Un    ",2,null,null,null,""]
["S",2,"S",0,2,6,0,0,0,0,0,"F","Serviço","Serviço","2.6.0.0.18.","AGETOP",71321,"FITA DE AUTO FUSAO, ROLO E 10,00 MM","Un    ",1,null,null,null,""]
[2,2,2,30,2,7,0,0,0,63,30,"F","Nível 2","Nível 2","2.7.","SINAPI",null,"INSTALAÇÕES HIDROSSANITÁRIAS","-",null,null,null,null,""]
[3,3,3,10,2,7,1,0,0,29,10,"F","Nível 3","Nível 3","2.7.1.","SINAPI",null,"PEÇAS E ACESSÓRIOS","-",null,null,null,null,""]
["S",3,"S",0,2,7,1,0,0,0,0,"F","Serviço","Serviço","2.7.1.0.1.","AGETOP",81501,"ADESIVO PLASTICO - FRASCO 850 G","Un    ",2,null,null,null,""]
["S",3,"S",0,2,7,1,0,0,0,0,"F","Serviço","Serviço","2.7.1.0.2.","AGETOP",81504,"SOLUCAO LIMPADORA 1000 CM3","Un    ",2,null,null,null,""]
["S",3,"S",0,2,7,1,0,0,0,0,"F","Serviço","Serviço","2.7.1.0.3.","AGETOP",81825,"CAIXA DE PASSAGEM 60 X 60 CM SEM TAMPA","Un    ",1,null,null,null,""]
["S",3,"S",0,2,7,1,0,0,0,0,"F","Serviço","Serviço","2.7.1.0.4.","SINAPI",6171,"TAMPA DE CONCRETO ARMADO 60X60X5CM PARA CAIXA","UN",1,null,null,null,""]
["S",3,"S",0,2,7,1,0,0,0,0,"F","Serviço","Serviço","2.7.1.0.5.","AGETOP",80587,"CUBA DE LOUÇA DE EMBUTIR REDONDA ","un    ",2,null,null,null,""]
["S",3,"S",0,2,7,1,0,0,0,0,"F","Serviço","Serviço","2.7.1.0.6.","AGETOP",80556,"LIGAÇÃO FLEXÍVEL PVC DIAM.1/2\" (ENGATE)","Un    ",2,null,null,null,""]
["S",3,"S",0,2,7,1,0,0,0,0,"F","Serviço","Serviço","2.7.1.0.7.","AGETOP",80562,"SIFAO FLEXIVEL UNIVERSAL ( SANFONADO) EM PVC PARA LAVATORIO","Un    ",2,null,null,null,""]
["S",{"$f":"IF(OR(C448=\"s\",C448=0),OFFSET(B448,-1,0),C448)","v":3},{"$f":"IF(OFFSET(C448,-1,0)=\"L\",1,IF(OFFSET(C448,-1,0)=1,2,IF(OR(A448=\"s\",A448=0),\"S\",IF(AND(OFFSET(C448,-1,0)=2,A448=4),3,IF(AND(OR(OFFSET(C448,-1,0)=\"s\",OFFSET(C448,-1,0)=0),A448<>\"s\",A448>OFFSET(B448,-1,0)),OFFSET(B448,-1,0),A448)))))","v":"S"},{"$f":"IF(OR(C448=\"S\",C448=0),0,IF(ISERROR(K448),J448,SMALL(J448:K448,1)))","v":0},{"$f":"IF($C448=1,OFFSET(E448,-1,0)+1,OFFSET(E448,-1,0))","v":2},{"$f":"IF($C448=1,0,IF($C448=2,OFFSET(F448,-1,0)+1,OFFSET(F448,-1,0)))","v":7},{"$f":"IF(AND($C448<=2,$C448<>0),0,IF($C448=3,OFFSET(G448,-1,0)+1,OFFSET(G448,-1,0)))","v":1},{"$f":"IF(AND($C448<=3,$C448<>0),0,IF($C448=4,OFFSET(H448,-1,0)+1,OFFSET(H448,-1,0)))","v":0},{"$f":"IF(AND($C448<=4,$C448<>0),0,IF(AND($C448=\"S\",$W448>0),OFFSET(I448,-1,0)+1,OFFSET(I448,-1,0)))","v":0},0,0,"F","Serviço","Serviço","2.7.1.0.8.","AGETOP",80580,"VALVULA P/LAVATORIO OU BEBEDOURO METALICO DIAMETRO 1\"","Un    ",2,null,null,null,""]
["S",3,"S",0,2,7,1,0,0,0,0,"F","Serviço","Serviço","2.7.1.0.9.","AGETOP",80570,"TORNEIRA DE MESA PARA LAVATÓRIO DIÂMETRO DE 1/2\"","Un    ",2,null,null,null,""]
[3,3,3,12,2,7,2,0,0,19,12,"F","Nível 3","Nível 3","2.7.2.",null,null,"ÁGUA FRIA","-",null,null,null,null,""]
["S",3,"S",0,2,7,2,0,0,0,0,"F","Serviço","Serviço","2.7.2.0.1.","AGETOP",80927,"REGISTRO DE GAVETA C/CANOPLA DIAMETRO 1\"","Un    ",1,null,null,null,""]
["S",3,"S",0,2,7,2,0,0,0,0,"F","Serviço","Serviço","2.7.2.0.2.","AGETOP",81003,"TUBO SOLDAVEL PVC MARROM DIAMETRO 25 mm","M     ",3,null,null,null,""]
["S",3,"S",0,2,7,2,0,0,0,0,"F","Serviço","Serviço","2.7.2.0.3.","SINAPI",89447,"TUBO, PVC, SOLDÁVEL, DN 32MM, INSTALADO EM PRUMADA DE ÁGUA - FORNECIMENTO E INSTALAÇÃO. AF_12/2014","M",6,null,null,null,""]
["S",3,"S",0,2,7,2,0,0,0,0,"F","Serviço","Serviço","2.7.2.0.4.","AGETOP",81042,"ADAPTAD.PVC SOLD.LONGO C/FLANGES LIVRES P/CX.DAGUA 32X1\"","Un    ",2,null,null,null,""]
["S",3,"S",0,2,7,2,0,0,0,0,"F","Serviço","Serviço","2.7.2.0.5.","SINAPI",96662,"BUCHA DE REDUÇÃO, PPR, 32 X 25, CLASSE PN 25, INSTALADO EM RAMAL DE DISTRIBUIÇÃO DE ÁGUA \u0096 FORNECIMENTO E INSTALAÇÃO . AF_06/2015","UN",1,null,null,null,""]
["S",3,"S",0,2,7,2,0,0,0,0,"F","Serviço","Serviço","2.7.2.0.6.","SINAPI",89481,"JOELHO 90 GRAUS, PVC, SOLDÁVEL, DN 25MM, INSTALADO EM PRUMADA DE ÁGUA - FORNECIMENTO E INSTALAÇÃO. AF_12/2014","UN",1,null,null,null,""]
["S",3,"S",0,2,7,2,0,0,0,0,"F","Serviço","Serviço","2.7.2.0.7.","AGETOP",81341,"JOELHO 90 GRAUS ROSCAVEL 1/2\" (MARROM)","Un    ",3,null,null,null,""]
[{"$f":"CHOOSE(1+LOG(1+2*(ORÇAMENTO.Nivel=\"Nível 1\")+4*(ORÇAMENTO.Nivel=\"Nível 2\")+8*(ORÇAMENTO.Nivel=\"Nível 3\")+16*(ORÇAMENTO.Nivel=\"Nível 4\")+32*(ORÇAMENTO.Nivel=\"Serviço\"),2),0,1,2,3,4,\"S\")","v":"S"},3,"S",0,2,7,2,0,0,0,0,"F","Serviço","Serviço","2.7.2.0.8.","AGETOP",81342,"JOELHO 90 GRAUS ROSCAVEL DIAMETRO 3/4\"","Un    ",1,null,null,null,""]
["S",3,"S",0,2,7,2,0,0,0,0,"F","Serviço","Serviço","2.7.2.0.9.","AGETOP",81322,"JOELHO 90 GRAUS SOLDAVEL DIAMETRO 32 MM (1\")","Un    ",20,null,null,null,""]
["S",3,"S",0,2,7,2,0,0,0,0,"F","Serviço","Serviço","2.7.2.0.10.","AGETOP",81421,"TE REDUCAO 90 GRAUS SOLDAVEL 32 X 25 mm","Un    ",2,null,null,null,""]
["S",3,"S",0,2,7,2,0,0,0,0,"F","Serviço","Serviço","2.7.2.0.11.","SINAPI",89617,"TE, PVC, SOLDÁVEL, DN 25MM, INSTALADO EM PRUMADA DE ÁGUA - FORNECIMENTO E INSTALAÇÃO. AF_12/2014","UN",1,null,null,null,""]
[3,3,3,7,2,7,3,0,0,7,{"$error":"#N/A"},"F","Nível 3","Nível 3","2.7.3.",null,null,"ESGOTO SANITÁRIO","-",null,null,null,null,""]
["S",3,"S",0,2,7,3,0,0,0,0,"F","Serviço","Serviço","2.7.3.0.1.","AGETOP",81663,"CORPO CX. SIFONADA DIAM. 150 X 150 X 50","Un    ",1,null,null,null,""]
["S",3,"S",0,2,7,3,0,0,0,0,"F","Serviço","Serviço","2.7.3.0.2.","SINAPI",89726,"JOELHO 45 GRAUS, PVC, SERIE NORMAL, ESGOTO PREDIAL, DN 40 MM, JUNTA SOLDÁVEL, FORNECIDO E INSTALADO EM RAMAL DE DESCARGA OU RAMAL DE ESGOTO SANITÁRIO. AF_12/2014","UN",2,null,null,null,""]
["S",3,"S",0,2,7,3,0,0,{"$f":"IF(OR($C465=\"S\",$C465=0),0,MATCH(0,OFFSET($D465,1,$C465,ROW($C$584)-ROW($C465)),0))","v":0},{"$f":"IF(OR($C465=\"S\",$C465=0),0,MATCH(OFFSET($D465,0,$C465)+1,OFFSET($D465,1,$C465,ROW($C$584)-ROW($C465)),0))","v":0},"F","Serviço","Serviço","2.7.3.0.3.","SINAPI",89724,"JOELHO 90 GRAUS, PVC, SERIE NORMAL, ESGOTO PREDIAL, DN 40 MM, JUNTA SOLDÁVEL, FORNECIDO E INSTALADO EM RAMAL DE DESCARGA OU RAMAL DE ESGOTO SANITÁRIO. AF_12/2014","UN",3,null,null,null,""]
["S",3,"S",0,2,7,3,0,0,0,0,"F","Serviço","Serviço","2.7.3.0.4.","AGETOP",81927,"JOELHO 90 GRAUS C/ANEL 40 mm ","Un    ",3,null,null,null,""]
["S",3,"S",0,2,7,3,0,0,0,0,"F","Serviço","Serviço","2.7.3.0.5.","AGETOP",82301,"TUBO SOLD.P/ESGOTO DIAM. 40 MM","m     ",6,null,null,null,""]
["S",3,"S",0,2,7,3,0,0,0,0,"F","Serviço","Serviço","2.7.3.0.6.","SINAPI",89798,"TUBO PVC, SERIE NORMAL, ESGOTO PREDIAL, DN 50 MM, FORNECIDO E INSTALADO EM PRUMADA DE ESGOTO SANITÁRIO OU VENTILAÇÃO. AF_12/2014","M",3,null,null,null,""]
[2,2,2,4,2,8,0,0,0,33,4,"F","Nível 2","Nível 2","2.8.","SINAPI",null,"ALVENARIAS E DIVISÓRIAS","-",null,null,null,null,""]
["S",2,"S",0,2,8,0,0,0,0,0,"F","Serviço","Serviço","2.8.0.0.1.","SINAPI",87471,"ALVENARIA DE VEDAÇÃO DE BLOCOS CERÂMICOS FURADOS NA VERTICAL DE 9X19X39CM (ESPESSURA 9CM) DE PAREDES COM ÁREA LÍQUIDA MENOR QUE 6M² SEM VÃOS E ARGAMASSA DE ASSENTAMENTO COM PREPARO EM BETONEIRA. AF_06/2014","M2",44.92,null,null,null,""]
["S",2,"S",0,2,8,0,0,0,0,0,"F","Serviço","Serviço","2.8.0.0.2.","AGETOP",100204,"CUNHAMENTO/ALVENARIAS COM TIJOLO COMUM","m     ",5.6,null,null,null,""]
["S",2,"S",0,2,8,0,0,0,0,0,"F","Serviço","Serviço","2.8.0.0.3.","SINAPI",95465,"COBOGO CERAMICO (ELEMENTO VAZADO), 9X20X20CM, ASSENTADO COM ARGAMASSA TRACO 1:4 DE CIMENTO E AREIA","M2",23.94,null,null,null,""]
[2,2,2,2,2,9,0,0,0,29,2,"F","Nível 2","Nível 2","2.9.","SINAPI",null,"IMPERMEABILIZAÇÃO","-",null,null,null,null,""]
["S",2,"S",0,2,9,0,0,0,0,0,"F","Serviço","Serviço","2.9.0.0.1.","AGETOP",120902,"IMPERMEABILIZACAO VIGAS BALDRAMES E=2,0 CM","m2    ",30.3,null,null,null,""]
[2,2,2,2,2,10,0,0,0,27,2,"F","Nível 2","Nível 2","2.10.",null,null,"ESTRUTURAS METÁLICAS","-",null,null,null,null,""]
["S",2,"S",0,2,10,0,0,0,0,0,"F","Serviço","Serviço","2.10.0.0.1.","AGETOP",150103,"ESTRUTURA METÁLICA CONVENCIONAL EM AÇO DO TIPO USI SAC-300 COM FUNDO ANTICORROSIVO","Kg    ",1495.68,null,null,null,""]
[2,2,2,5,2,11,0,0,0,25,5,"F","Nível 2","Nível 2","2.11.",null,null,"COBERTURAS","-",null,null,null,null,""]
["S",2,"S",0,2,11,0,0,0,0,0,"F","Serviço","Serviço","2.11.0.0.1.","AGETOP",160401,"COBERTURA COM TELHA PLAN RESINADA COR VERMELHA","m2    ",124.64,null,null,null,""]
["S",2,"S",0,2,11,0,0,0,0,0,"F","Serviço","Serviço","2.11.0.0.2.","SINAPI",94221,"CUMEEIRA PARA TELHA CERÂMICA EMBOÇADA COM ARGAMASSA TRAÇO 1:2:9 (CIMENTO, CAL E AREIA) PARA TELHADOS COM ATÉ 2 ÁGUAS, INCLUSO TRANSPORTE VERTICAL. AF_07/2019","M",15.2,null,null,null,""]
["S",2,"S",0,2,11,0,0,0,0,0,"F","Serviço","Serviço","2.11.0.0.3.","AGETOP",160403,"EMBOCAMENTO LATERAL  (OITOES)","m     ",16.399999999999999,null,null,null,""]
["S",2,"S",0,2,11,0,0,0,0,0,"F","Serviço","Serviço","2.11.0.0.4.","AGETOP",160404,"EMBOCAMENTO DE BEIRAL","M     ",30.4,null,null,null,""]
[2,2,2,5,2,12,0,0,0,20,5,"F","Nível 2","Nível 2","2.12.",null,null,"REVESTIMENTO DE PAREDE","-",null,null,null,null,""]
["S",2,"S",0,2,12,0,0,0,0,0,"F","Serviço","Serviço","2.12.0.0.1.","AGETOP",200101,"CHAPISCO COMUM","m2    ",89.84,null,null,null,""]
["S",2,"S",0,2,12,0,0,0,0,0,"F","Serviço","Serviço","2.12.0.0.2.","AGETOP",200201,"EMBOÇO (1CI:4 ARML)","m2    ",3.15,null,null,null,""]
["S",2,"S",0,2,12,0,0,0,0,0,"F","Serviço","Serviço","2.12.0.0.3.","AGETOP",200500,"REBOCO PAULISTA A-7 (1 CALH,4 ARMLC)","m2    ",86.69,null,null,null,""]
["S",2,"S",0,2,12,0,0,0,0,0,"F","Serviço","Serviço","2.12.0.0.4.","AGETOP",201302,"REVESTIMENTO COM CERÂMICA ","m2    ",3.15,null,null,null,""]
[2,2,2,6,2,13,0,0,0,15,6,"F","Nível 2","Nível 2","2.13.","SINAPI",null,"REVESTIMENTO DE PISO","-",null,null,null,null,""]
["S",2,"S",0,2,13,0,0,0,0,0,"F","Serviço","Serviço","2.13.0.0.1.","SINAPI",95241,"LASTRO DE CONCRETO MAGRO, APLICADO EM PISOS OU RADIERS, ESPESSURA DE 5 CM. AF_07/2016","M2",89.67,null,null,null,""]
["S",2,"S",0,2,13,0,0,0,0,0,"F","Serviço","Serviço","2.13.0.0.2.","AGETOP",221101,"GRANITINA 8MM FUNDIDA COM CONTRAPISO (1CI:3ARML) E=2CM E JUNTA PLASTICA 27MM","m2    ",89.67,null,null,null,""]
["S",2,"S",0,2,13,0,0,0,0,0,"F","Serviço","Serviço","2.13.0.0.3.","AGETOP",221102,"RODAPÉ FUNDIDO DE GRANITINA 7CM","m     ",15.05,null,null,null,""]
["S",2,"S",0,2,13,0,0,0,0,0,"F","Serviço","Serviço","2.13.0.0.4.","AGETOP",221104,"RASPAGEM E APLICAÇÃO RESINA ACRÍLICA DUAS DEMÃOS","m2    ",90.723500000000001,null,null,null,""]
["S",2,"S",0,2,13,0,0,0,0,0,"F","Serviço","Serviço","2.13.0.0.5.","AGETOP",220100,"PASSEIO PROTECAO EM CONC.DESEMPEN.5 CM 1:2,5:3,5 ( INCLUSO ESPELHO DE 30CM/ESCAVAÇÃO/REATERRO/APILOAMENTO/ATERRO INTERNO)","m2    ",25.68,null,null,null,""]
[2,2,2,5,2,14,0,0,0,9,5,"F","Nível 2","Nível 2","2.14.",null,null,"PINTURA","-",null,null,null,null,""]
["S",2,"S",0,2,14,0,0,0,0,0,"F","Serviço","Serviço","2.14.0.0.1.","AGETOP",261304,"EMASSAMENTO ACRILICO 2 DEMAOS","m2    ",15.05,null,null,null,""]
["S",2,"S",0,2,14,0,0,0,0,0,"F","Serviço","Serviço","2.14.0.0.2.","AGETOP",261550,"PINT.ESMALTE SINT.PAREDES - 2 DEM.C/SELADOR","m2    ",15.05,null,null,null,""]
["S",2,"S",0,2,14,0,0,0,0,0,"F","Serviço","Serviço","2.14.0.0.3.","AGETOP",261001,"PINTURA LATEX ACRILICO 2 DEMAOS","m2    ",65.36,null,null,null,""]
["S",2,"S",0,2,14,0,0,0,0,0,"F","Serviço","Serviço","2.14.0.0.4.","AGETOP",261609,"PINTURA ESMALTE ALQUIDICO ESTR.METALICA 2 DEMAOS","m2    ",124.64,null,null,null,""]
[2,2,2,4,2,15,0,0,0,4,{"$error":"#N/A"},"F","Nível 2","Nível 2","2.15.",null,null,"DIVERSOS","-",null,null,null,null,""]
["S",2,"S",0,2,15,0,0,0,0,0,"F","Serviço","Serviço","2.15.0.0.1.","AGETOP",270501,"LIMPEZA FINAL DE OBRA - (OBRAS CIVIS)","m2    ",89.67,null,null,null,""]
["S",2,"S",0,2,15,0,0,0,0,0,"F","Serviço","Serviço","2.15.0.0.2.","AGETOP",271608,"BANCADA DE GRANITO C/ESPELHO","m2    ",1.0900000000000001,null,null,null,""]
["S",2,"S",0,2,15,0,0,0,0,0,"F","Serviço","Serviço","2.15.0.0.3.","AGETOP",271303,"BANCO DE CONCRETO POLIDO BASE EM ALVENARIA REBOCADA E PINTADA - PADRÃO GOINFRA ","m     ",9.6000000000000014,null,null,null,""]
[1,1,1,82,3,0,0,0,0,82,{"$error":"#N/A"},"F","Nível 1","Nível 1","3.","AGETOP",null,"QUADRA COBERTA PADRÃO NOSSA ESCOLA - MOD 02","-",null,null,null,null,""]
[2,2,2,2,3,1,0,0,0,81,2,"F","Nível 2","Nível 2","3.1.","SINAPI",null,"SERVIÇOS PRELIMINARES","-",null,null,null,null,""]
["S",2,"S",0,3,1,0,0,0,0,0,"F","Serviço","Serviço","3.1.0.0.1.","AGETOP",20701,"LOCAÇÃO DA OBRA, EXECUÇÃO DE GABARITO SEM REAPROVEITAMENTO, INCLUSO PINTURA (FACE INTERNA DO RIPÃO 15CM) E PIQUETE COM TESTEMUNHA","m2    ",229.16,null,null,null,""]
[2,2,2,3,3,2,0,0,0,79,3,"F","Nível 2","Nível 2","3.2.","AGETOP",null,"TRANSPORTES","-",null,null,null,null,""]
["S",2,"S",0,3,2,0,0,0,0,0,"F","Serviço","Serviço","3.2.0.0.1.","SINAPI",72900,"TRANSPORTE DE ENTULHO COM CAMINHAO BASCULANTE 6 M3, RODOVIA PAVIMENTADA, DMT 0,5 A 1,0 KM","M3",16.0412,null,null,null,""]
["S",2,"S",0,3,2,0,0,0,0,0,"F","Serviço","Serviço","3.2.0.0.2.","SINAPI",72897,"CARGA MANUAL DE ENTULHO EM CAMINHAO BASCULANTE 6 M3","M3",16.0412,null,null,null,""]
[2,2,2,3,3,3,0,0,0,76,3,"F","Nível 2","Nível 2","3.3.","SINAPI",null,"SERVIÇO EM TERRA","-",null,null,null,null,""]
["S",2,"S",0,3,3,0,0,0,0,0,"F","Serviço","Serviço","3.3.0.0.1.","AGETOP",41002,"APILOAMENTO","m2    ",297.90800000000002,null,null,null,""]
["S",2,"S",0,3,3,0,0,0,0,0,"F","Serviço","Serviço","3.3.0.0.2.","AGETOP",41140,"REGULARIZAÇÃO DO TERRENO SEM APILOAMENTO COM TRANSPORTE MANUAL DA TERRA ESCAVADA ","m2    ",297.90800000000002,null,null,null,""]
[2,2,2,13,3,4,0,0,0,73,13,"F","Nível 2","Nível 2","3.4.","AGETOP",null,"FUNDAÇÕES E SONDAGENS","-",null,null,null,null,""]
["S",2,"S",0,3,4,0,0,0,0,0,"F","Serviço","Serviço","3.4.0.0.1.","AGETOP",50302,"ESTACA A TRADO DIAM.30 CM SEM FERRO","M     ",76,null,null,null,""]
["S",{"$f":"IF(OR(C513=\"s\",C513=0),OFFSET(B513,-1,0),C513)","v":2},{"$f":"IF(OFFSET(C513,-1,0)=\"L\",1,IF(OFFSET(C513,-1,0)=1,2,IF(OR(A513=\"s\",A513=0),\"S\",IF(AND(OFFSET(C513,-1,0)=2,A513=4),3,IF(AND(OR(OFFSET(C513,-1,0)=\"s\",OFFSET(C513,-1,0)=0),A513<>\"s\",A513>OFFSET(B513,-1,0)),OFFSET(B513,-1,0),A513)))))","v":"S"},{"$f":"IF(OR(C513=\"S\",C513=0),0,IF(ISERROR(K513),J513,SMALL(J513:K513,1)))","v":0},{"$f":"IF($C513=1,OFFSET(E513,-1,0)+1,OFFSET(E513,-1,0))","v":3},{"$f":"IF($C513=1,0,IF($C513=2,OFFSET(F513,-1,0)+1,OFFSET(F513,-1,0)))","v":4},{"$f":"IF(AND($C513<=2,$C513<>0),0,IF($C513=3,OFFSET(G513,-1,0)+1,OFFSET(G513,-1,0)))","v":0},{"$f":"IF(AND($C513<=3,$C513<>0),0,IF($C513=4,OFFSET(H513,-1,0)+1,OFFSET(H513,-1,0)))","v":0},{"$f":"IF(AND($C513<=4,$C513<>0),0,IF(AND($C513=\"S\",$W513>0),OFFSET(I513,-1,0)+1,OFFSET(I513,-1,0)))","v":0},0,0,"F","Serviço","Serviço","3.4.0.0.2.","AGETOP",50901,"ESCAVACAO MANUAL DE VALAS (SAPATAS/BLOCOS)","m3    ",16.13,null,null,null,""]
["S",2,"S",0,3,4,0,0,0,0,0,"F","Serviço","Serviço","3.4.0.0.3.","AGETOP",50902,"APILOAMENTO (BLOCOS/SAPATAS)","m2    ",2.0699999999999998,null,null,null,""]
["S",2,"S",0,3,4,0,0,0,0,0,"F","Serviço","Serviço","3.4.0.0.4.","AGETOP",40902,"REATERRO COM APILOAMENTO","m3    ",10.69,null,null,null,""]
["S",2,"S",0,3,4,0,0,0,0,0,"F","Serviço","Serviço","3.4.0.0.5.","AGETOP",51025,"PREPARO SEM BETONEIRA E TRANSPORTE MANUAL DE CONCRETO PARA LASTRO  - (O.C.)","m3    ",1.7,null,null,null,""]
["S",2,"S",0,3,4,0,0,0,0,0,"F","Serviço","Serviço","3.4.0.0.6.","AGETOP",51009,"FORMA TABUA PINHO P/FUNDACOES U=3V - (OBRAS CIVIS)","m2    ",53.22,null,null,null,""]
["S",2,"S",0,3,4,0,0,0,0,0,"F","Serviço","Serviço","3.4.0.0.7.","AGETOP",52014,"ACO CA-60 - 5,0 MM - (OBRAS CIVIS)","Kg    ",91.440000000000012,null,null,null,""]
["S",2,"S",0,3,4,0,0,0,0,0,"F","Serviço","Serviço","3.4.0.0.8.","AGETOP",52004,"ACO CA 50-A - 8,0 MM (5/16\") - (OBRAS CIVIS)","Kg    ",194.4,null,null,null,""]
["S",2,"S",0,3,4,0,0,0,0,0,"F","Serviço","Serviço","3.4.0.0.9.","AGETOP",52005,"ACO CA-50A - 10,0 MM (3/8\") - (OBRAS CIVIS)","Kg    ",83.160000000000011,null,null,null,""]
["S",2,"S",0,3,4,0,0,0,0,0,"F","Serviço","Serviço","3.4.0.0.10.","AGETOP",52003,"ACO CA-50A - 6,3 MM (1/4\") - (OBRAS CIVIS)","Kg    ",118.44,null,null,null,""]
["S",2,"S",0,3,4,0,0,0,0,0,"F","Serviço","Serviço","3.4.0.0.11.","SINAPI",94964,"CONCRETO FCK = 20MPA, TRAÇO 1:2,7:3 (CIMENTO/ AREIA MÉDIA/ BRITA 1)  - PREPARO MECÂNICO COM BETONEIRA 400 L. AF_07/2016","M3",14.060000000000002,null,null,null,""]
[{"$f":"CHOOSE(1+LOG(1+2*(ORÇAMENTO.Nivel=\"Nível 1\")+4*(ORÇAMENTO.Nivel=\"Nível 2\")+8*(ORÇAMENTO.Nivel=\"Nível 3\")+16*(ORÇAMENTO.Nivel=\"Nível 4\")+32*(ORÇAMENTO.Nivel=\"Serviço\"),2),0,1,2,3,4,\"S\")","v":"S"},2,"S",0,3,4,0,0,0,0,0,"F","Serviço","Serviço","3.4.0.0.12.","AGETOP",51026,"LANÇAMENTO/APLICAÇÃO/ADENSAMENTO DE CONCRETO EM FUNDAÇÃO- (O.C.)","m3    ",14.06,null,null,null,""]
[2,2,2,8,3,5,0,0,0,60,8,"F","Nível 2","Nível 2","3.5.","AGETOP",null,"ESTRUTURA","-",null,null,null,null,""]
["S",2,"S",0,3,5,0,0,0,0,0,"F","Serviço","Serviço","3.5.0.0.1.","AGETOP",60213,"FORMA CH.COMPENSADA PLASTIF.12MM-VIGA/PILAR U=2V-(O.C.)","m2    ",96.259999999999991,null,null,null,""]
["S",2,"S",0,3,5,0,0,0,0,0,"F","Serviço","Serviço","3.5.0.0.2.","AGETOP",60314,"ACO CA - 60 - 5,0 MM - (OBRAS CIVIS)","Kg    ",132.66,null,null,null,""]
["S",2,"S",0,3,5,0,0,0,0,0,"F","Serviço","Serviço","3.5.0.0.3.","AGETOP",60304,"ACO CA-50 A - 8,0 MM (5/16\") - (OBRAS CIVIS)","Kg    ",68.849999999999994,null,null,null,""]
["S",2,"S",0,3,5,0,0,0,0,0,"F","Serviço","Serviço","3.5.0.0.4.","AGETOP",60305,"ACO CA-50A - 10,0 MM (3/8\") - (OBRAS CIVIS)","Kg    ",36.269999999999996,null,null,null,""]
["S",2,"S",0,3,5,0,0,0,{"$f":"IF(OR($C529=\"S\",$C529=0),0,MATCH(0,OFFSET($D529,1,$C529,ROW($C$584)-ROW($C529)),0))","v":0},{"$f":"IF(OR($C529=\"S\",$C529=0),0,MATCH(OFFSET($D529,0,$C529)+1,OFFSET($D529,1,$C529,ROW($C$584)-ROW($C529)),0))","v":0},"F","Serviço","Serviço","3.5.0.0.5.","SINAPI",92779,"ARMAÇÃO DE PILAR OU VIGA DE UMA ESTRUTURA CONVENCIONAL DE CONCRETO ARMADO EM UMA EDIFICAÇÃO TÉRREA OU SOBRADO UTILIZANDO AÇO CA-50 DE 12,5 MM - MONTAGEM. AF_12/2015","KG",543.6,null,null,null,""]
["S",2,"S",0,3,5,0,0,0,0,0,"F","Serviço","Serviço","3.5.0.0.6.","SINAPI",94964,"CONCRETO FCK = 20MPA, TRAÇO 1:2,7:3 (CIMENTO/ AREIA MÉDIA/ BRITA 1)  - PREPARO MECÂNICO COM BETONEIRA 400 L. AF_07/2016","M3",6.2799999999999994,null,null,null,""]
["S",2,"S",0,3,5,0,0,0,0,0,"F","Serviço","Serviço","3.5.0.0.7.","AGETOP",60801,"LANÇAMENTO/APLICAÇÃO/ADENSAMENTO MANUAL DE CONCRETO - (OBRAS CIVIS)","m3    ",6.2799999999999994,null,null,null,""]
[2,2,2,32,3,6,0,0,0,52,32,"F","Nível 2","Nível 2","3.6.","AGETOP",null,"INSTALAÇÕES ELÉTRICAS","-",null,null,null,null,""]
["S",2,"S",0,3,6,0,0,0,0,0,"F","Serviço","Serviço","3.6.0.0.1.","AGETOP",70351,"BRACADEIRA METALICA TIPO \"U\" DIAM. 3/4\"","Un    ",45,null,null,null,""]
["S",2,"S",0,3,6,0,0,0,0,0,"F","Serviço","Serviço","3.6.0.0.2.","AGETOP",70352,"BRACADEIRA METALICA TIPO \"U\" DIAM. 1\"","Un    ",27,null,null,null,""]
["S",2,"S",0,3,6,0,0,0,0,0,"F","Serviço","Serviço","3.6.0.0.3.","AGETOP",70391,"BUCHA DE NYLON S-6","Un    ",160,null,null,null,""]
["S",2,"S",0,3,6,0,0,0,0,0,"F","Serviço","Serviço","3.6.0.0.4.","SINAPI",96973,"CORDOALHA DE COBRE NU 35 MM², NÃO ENTERRADA, COM ISOLADOR - FORNECIMENTO E INSTALAÇÃO. AF_12/2017","M",9,null,null,null,""]
["S",2,"S",0,3,6,0,0,0,0,0,"F","Serviço","Serviço","3.6.0.0.5.","AGETOP",70714,"CAIXA DE PASSAGEM 50X50X80CM FUNDO DE BRITA SEM TAMPA","Un    ",1,null,null,null,""]
["S",2,"S",0,3,6,0,0,0,0,0,"F","Serviço","Serviço","3.6.0.0.6.","AGETOP",70924,"CONDULETE DE PVC - CAIXA COM 5 ENTRADAS ","un    ",19,null,null,null,""]
["S",2,"S",0,3,6,0,0,0,0,0,"F","Serviço","Serviço","3.6.0.0.7.","AGETOP",70925,"CONDULETE DE PVC - ADAPTADOR DE SAÍDA 3/4\"  ","un    ",42,null,null,null,""]
["S",2,"S",0,3,6,0,0,0,0,0,"F","Serviço","Serviço","3.6.0.0.8.","SINAPI",95811,"CONDULETE DE PVC, TIPO LB, PARA ELETRODUTO DE PVC SOLDÁVEL DN 25 MM (3/4''), APARENTE - FORNECIMENTO E INSTALAÇÃO. AF_11/2016","UN",5,null,null,null,""]
["S",2,"S",0,3,6,0,0,0,0,0,"F","Serviço","Serviço","3.6.0.0.9.","SINAPI",95817,"CONDULETE DE PVC, TIPO X, PARA ELETRODUTO DE PVC SOLDÁVEL DN 25 MM (3/4''), APARENTE - FORNECIMENTO E INSTALAÇÃO. AF_11/2016","UN",1,null,null,null,""]
["S",2,"S",0,3,6,0,0,0,0,0,"F","Serviço","Serviço","3.6.0.0.10.","SINAPI",93655,"DISJUNTOR MONOPOLAR TIPO DIN, CORRENTE NOMINAL DE 20A - FORNECIMENTO E INSTALAÇÃO. AF_04/2016","UN",3,null,null,null,""]
["S",2,"S",0,3,6,0,0,0,0,0,"F","Serviço","Serviço","3.6.0.0.11.","AGETOP",71173,"DISJUNTOR TRIPOLAR DE 10 A 35-A","Un    ",1,null,null,null,""]
["S",2,"S",0,3,6,0,0,0,0,0,"F","Serviço","Serviço","3.6.0.0.12.","AGETOP",71184,"DISPOSITIVO DE PROTEÇÃO CONTRA SURTOS (D.P.S.) 275V DE 8 A 40KA","Un    ",3,null,null,null,""]
["S",2,"S",0,3,6,0,0,0,0,0,"F","Serviço","Serviço","3.6.0.0.13.","AGETOP",71768,"MASSA EPOXI CAIXA DE 250 G","Un    ",2,null,null,null,""]
["S",2,"S",0,3,6,0,0,0,0,0,"F","Serviço","Serviço","3.6.0.0.14.","AGETOP",71201,"ELETRODUTO DE PVC RIGIDO DIAMETRO 3/4\"","M     ",42,null,null,null,""]
["S",2,"S",0,3,6,0,0,0,0,0,"F","Serviço","Serviço","3.6.0.0.15.","AGETOP",71202,"ELETRODUTO DE PVC RIGIDO DIAMETRO 1\"","M     ",21,null,null,null,""]
["S",2,"S",0,3,6,0,0,0,0,0,"F","Serviço","Serviço","3.6.0.0.16.","AGETOP",70563,"CABO ISOLADO PVC 750 V. No. 2,5 MM2","m     ",450,null,null,null,""]
["S",2,"S",0,3,6,0,0,0,0,0,"F","Serviço","Serviço","3.6.0.0.17.","AGETOP",71380,"HASTE REV.COBRE(COPPERWELD)  3/4\" X 2,40 M C/CONECTOR","Un    ",3,null,null,null,""]
["S",2,"S",0,3,6,0,0,0,0,0,"F","Serviço","Serviço","3.6.0.0.18.","SINAPI",95787,"CONDULETE DE ALUMÍNIO, TIPO LR, PARA ELETRODUTO DE AÇO GALVANIZADO DN 20 MM (3/4''), APARENTE - FORNECIMENTO E INSTALAÇÃO. AF_11/2016_P","UN",2,null,null,null,""]
["S",2,"S",0,3,6,0,0,0,0,0,"F","Serviço","Serviço","3.6.0.0.19.","SINAPI",95796,"CONDULETE DE ALUMÍNIO, TIPO T, PARA ELETRODUTO DE AÇO GALVANIZADO DN 25 MM (1''), APARENTE - FORNECIMENTO E INSTALAÇÃO. AF_11/2016_P","UN",3,null,null,null,""]
["S",2,"S",0,3,6,0,0,0,0,0,"F","Serviço","Serviço","3.6.0.0.20.","AGETOP",71861,"PARAFUSO P/BUCHA S-6","Un    ",160,null,null,null,""]
["S",2,"S",0,3,6,0,0,0,0,0,"F","Serviço","Serviço","3.6.0.0.21.","SINAPI",95781,"CONDULETE DE ALUMÍNIO, TIPO C, PARA ELETRODUTO DE AÇO GALVANIZADO DN 25 MM (1''), APARENTE - FORNECIMENTO E INSTALAÇÃO. AF_11/2016_P","UN",2,null,null,null,""]
["S",2,"S",0,3,6,0,0,0,0,0,"F","Serviço","Serviço","3.6.0.0.22.","AGETOP",72170,"QUADRO DE DISTRIBUIÇÃO DE EMBUTIR EM PVC CB 12E - 80A","Un    ",1,null,null,null,""]
["S",2,"S",0,3,6,0,0,0,0,0,"F","Serviço","Serviço","3.6.0.0.23.","SINAPI",72281,"REATOR PARA LAMPADA VAPOR DE MERCURIO USO EXTERNO 220V/400W","UN",8,null,null,null,""]
["S",2,"S",0,3,6,0,0,0,0,0,"F","Serviço","Serviço","3.6.0.0.24.","AGETOP",71684,"LUMINÁRIA TIPO PROJETOR RETANGULAR ATÉ 400 W - BASE E-40","un    ",8,null,null,null,""]
["S",2,"S",0,3,6,0,0,0,0,0,"F","Serviço","Serviço","3.6.0.0.25.","AGETOP",72578,"TOMADA HEXAGONAL 2P + T - 10A - 250V","Un    ",4,null,null,null,""]
["S",2,"S",0,3,6,0,0,0,0,0,"F","Serviço","Serviço","3.6.0.0.26.","AGETOP",71741,"LUVA PVC ROSQUEAVEL DIAMETRO 3/4\"","Un    ",25,null,null,null,""]
["S",2,"S",0,3,6,0,0,0,0,0,"F","Serviço","Serviço","3.6.0.0.27.","AGETOP",71742,"LUVA PVC ROSQUEAVEL DIAMETRO 1\"","Un    ",15,null,null,null,""]
["S",2,"S",0,3,6,0,0,0,0,0,"F","Serviço","Serviço","3.6.0.0.28.","AGETOP",71331,"FITA ISOLANTE, ROLO DE 20,00 M","Un    ",4,null,null,null,""]
["S",2,"S",0,3,6,0,0,0,0,0,"F","Serviço","Serviço","3.6.0.0.29.","AGETOP",71321,"FITA DE AUTO FUSAO, ROLO E 10,00 MM","Un    ",1,null,null,null,""]
["S",2,"S",0,3,6,0,0,0,0,0,"F","Serviço","Serviço","3.6.0.0.30.","AGETOP",70691,"CAIXA METALICA RET. 4\" X 2\" X 2\"","Un    ",4,null,null,null,""]
["S",2,"S",0,3,6,0,0,0,0,0,"F","Serviço","Serviço","3.6.0.0.31.","AGETOP",72501,"TERMINAL DE PRESSAO 2,5 MM2","Un    ",9,null,null,null,""]
[2,2,2,2,3,7,0,0,0,20,2,"F","Nível 2","Nível 2","3.7.","SINAPI",null,"IMPERMEABILIZAÇÃO","-",null,null,null,null,""]
["S",2,"S",0,3,7,0,0,0,0,0,"F","Serviço","Serviço","3.7.0.0.1.","AGETOP",120902,"IMPERMEABILIZACAO VIGAS BALDRAMES E=2,0 CM","m2    ",28.34,null,null,null,""]
[2,2,2,2,3,8,0,0,0,18,2,"F","Nível 2","Nível 2","3.8.","AGETOP",null,"ESTRUTURAS METÁLICAS","-",null,null,null,null,""]
["S",2,"S",0,3,8,0,0,0,0,0,"F","Serviço","Serviço","3.8.0.0.1.","AGETOP",150103,"ESTRUTURA METÁLICA CONVENCIONAL EM AÇO DO TIPO USI SAC-300 COM FUNDO ANTICORROSIVO","Kg    ",4406.6899999999996,null,null,null,""]
[2,2,2,3,3,9,0,0,0,16,3,"F","Nível 2","Nível 2","3.9.","AGETOP",null,"COBERTURAS","-",null,null,null,null,""]
["S",2,"S",0,3,9,0,0,0,0,0,"F","Serviço","Serviço","3.9.0.0.1.","AGETOP",160969,"COBERTURA COM TELHA CHAPA GALVANIZADA TRAPEZOIDAL 0,43 MM COM ACESSÓRIOS","m2    ",327.62,null,null,null,""]
["S",2,"S",0,3,9,0,0,0,0,0,"F","Serviço","Serviço","3.9.0.0.2.","AGETOP",160963,"CUMEEIRA PARA TELHA GALVANIZADA TRAPEZOIDAL 0,43MM","M     ",21.33,null,null,null,""]
[2,2,2,2,3,10,0,0,0,13,2,"F","Nível 2","Nível 2","3.10.","SINAPI",null,"REVESTIMENTO DE PAREDE","-",null,null,null,null,""]
["S",2,"S",0,3,10,0,0,0,0,0,"F","Serviço","Serviço","3.10.0.0.1.","SINAPI",87547,"MASSA ÚNICA, PARA RECEBIMENTO DE PINTURA, EM ARGAMASSA TRAÇO 1:2:8, PREPARO MECÂNICO COM BETONEIRA 400L, APLICADA MANUALMENTE EM FACES INTERNAS DE PAREDES, ESPESSURA DE 10MM, COM EXECUÇÃO DE TALISCAS. AF_06/2014","M2",102.13,null,null,null,""]
[2,2,2,3,3,11,0,0,0,11,3,"F","Nível 2","Nível 2","3.11.","SINAPI",null,"REVESTIMENTO DE PISO","-",null,null,null,null,""]
["S",2,"S",0,3,11,0,0,0,0,0,"F","Serviço","Serviço","3.11.0.0.1.","AGETOP",220061,"PISO LAMINADO COM CONCRETO USINADO 20MPA E=7 CM  ","m2    ",219.78,null,null,null,""]
["S",2,"S",0,3,11,0,0,0,0,0,"F","Serviço","Serviço","3.11.0.0.2.","AGETOP",220100,"PASSEIO PROTECAO EM CONC.DESEMPEN.5 CM 1:2,5:3,5 ( INCLUSO ESPELHO DE 30CM/ESCAVAÇÃO/REATERRO/APILOAMENTO/ATERRO INTERNO)","m2    ",32.58,null,null,null,""]
[2,2,2,4,3,12,0,0,0,8,4,"F","Nível 2","Nível 2","3.12.","AGETOP",null,"PINTURA","-",null,null,null,null,""]
["S",{"$f":"IF(OR(C577=\"s\",C577=0),OFFSET(B577,-1,0),C577)","v":2},{"$f":"IF(OFFSET(C577,-1,0)=\"L\",1,IF(OFFSET(C577,-1,0)=1,2,IF(OR(A577=\"s\",A577=0),\"S\",IF(AND(OFFSET(C577,-1,0)=2,A577=4),3,IF(AND(OR(OFFSET(C577,-1,0)=\"s\",OFFSET(C577,-1,0)=0),A577<>\"s\",A577>OFFSET(B577,-1,0)),OFFSET(B577,-1,0),A577)))))","v":"S"},{"$f":"IF(OR(C577=\"S\",C577=0),0,IF(ISERROR(K577),J577,SMALL(J577:K577,1)))","v":0},{"$f":"IF($C577=1,OFFSET(E577,-1,0)+1,OFFSET(E577,-1,0))","v":3},{"$f":"IF($C577=1,0,IF($C577=2,OFFSET(F577,-1,0)+1,OFFSET(F577,-1,0)))","v":12},{"$f":"IF(AND($C577<=2,$C577<>0),0,IF($C577=3,OFFSET(G577,-1,0)+1,OFFSET(G577,-1,0)))","v":0},{"$f":"IF(AND($C577<=3,$C577<>0),0,IF($C577=4,OFFSET(H577,-1,0)+1,OFFSET(H577,-1,0)))","v":0},{"$f":"IF(AND($C577<=4,$C577<>0),0,IF(AND($C577=\"S\",$W577>0),OFFSET(I577,-1,0)+1,OFFSET(I577,-1,0)))","v":0},0,0,"F","Serviço","Serviço","3.12.0.0.1.","AGETOP",261001,"PINTURA LATEX ACRILICO 2 DEMAOS","m2    ",102.13,null,null,null,""]
["S",2,"S",0,3,12,0,0,0,0,0,"F","Serviço","Serviço","3.12.0.0.2.","AGETOP",261602,"PINT.ESMALTE/ESQUAD.FERRO C/FUNDO ANTICOR.","m2    ",327.62,null,null,null,""]
["S",2,"S",0,3,12,0,0,0,0,0,"F","Serviço","Serviço","3.12.0.0.3.","AGETOP",261700,"DEMARC.QUADRA/VAGAS TINTA POLIESPORTIVA","m     ",72,null,null,null,""]
[2,2,2,4,3,13,0,0,0,4,{"$error":"#N/A"},"F","Nível 2","Nível 2","3.13.","AGETOP",null,"DIVERSOS","-",null,null,null,null,""]
["S",2,"S",0,3,13,0,0,0,0,0,"F","Serviço","Serviço","3.13.0.0.1.","COMPOSIÇÃO","COMP 031_SEE","MURETA P/ QUAD. POLIESP. ALV. DE TIJ. FURADO - 1/2 VEZ - C/ CHP. E PEDRISCO - H=0,80 M","M",58.36,null,null,null,""]
["S",2,"S",0,3,13,0,0,0,0,0,"F","Serviço","Serviço","3.13.0.0.2.","AGETOP",270501,"LIMPEZA FINAL DE OBRA - (OBRAS CIVIS)","m2    ",229.16,null,null,null,""]
["S",2,"S",0,3,13,0,0,0,0,0,"F","Serviço","Serviço","3.13.0.0.3.","AGETOP",271103,"CONJUNTO PARA VOLEIBOL EM FERRO GALVANIZADO COM PINTURA (2 SUPORTES)","CJ    ",1,null,null,null,""]
[-1,null,-1,null,0,0,0,0,0,null,null,"F"]
[null,null,null,null,null,null,null,null,null,null,null,"F",null,null,null,null,null,"OBS: OS QUANTITATIVOS DE MATERIAIS  DAS INSTALAÇÕES HIDROSSANITÁRIAS, ELÉTRICAS E ESPECIAIS SÃO FORNECIDOS PELOS PROFISSIONAIS RESPONSÁVEIS PELOS RESPECTIVOS PROJETOS.",null,null,"VALOR TOTAL"]
[null,null,null,null,null,null,null,null,null,null,null,"F",null,null,null,null,null,null,null,null,"VALOR BDI (21,36%)"]
[null,null,null,null,null,null,null,null,null,null,null,"F",null,null,null,null,null,null,null,null,"TOTAL ORÇAMENTO"]
[null,null,null,null,null,null,null,null,null,null,null,"F"]
[null,null,null,null,null,null,null,null,null,null,null,"F",null,null,null,null,null,null,null,null,"CUSTO POR M2 ³"]
[null,null,null,null,null,null,null,null,null,null,null,"F",null,null,null,null,null,null,null,null,"MATERIAL S/ BDI"]
[null,null,null,null,null,null,null,null,null,null,null,"F",null,null,null,null,null,null,null,null,"MÃO DE OBRA S/ BDI"]
[null,null,null,null,null,null,null,null,null,null,null,"F"]
[null,null,null,null,null,null,null,null,null,null,null,"F",null,null,null,null,"(1) Conforme previsto pelo DECRETO Nº 7.983, DE 8 DE ABRIL DE 2013, os preços adotados são aqueles constantes dos sistemas de referência indicados. Justifica-se o uso dos preços destas composições de custos unitários devido ao seu valor ser menor à mediana de seus correspondentes na tabela SINAPI;"]
[null,null,null,null,null,null,null,null,null,null,null,"F",null,null,null,null,"(2) Optou-se pelo uso das composições de custos da AGETOP para itens não presentes na SINAPI;"]
[null,null,null,null,null,null,null,null,null,null,null,"F",null,null,null,null,"(3) Para itens da AGETOP, os vidros não estão inclusos nas esquadrias e já foram considerados os custos de contramarco para as esquadrias de alumínio;"]
[null,null,null,null,null,null,null,null,null,null,null,"F",null,null,null,null,"(4) Nos casos em que houver execução de granitina e omissão do item AGETOP 221102, considerou-se que o quantitativo para o rodapé, de altura igual a 7cm, foi incorporado na área de piso;"]
[null,null,null,null,null,null,null,null,null,null,null,"F",null,null,null,null,"(5) O custo unitário aproximado por metro quadrado é calculado dividindo-se o valor total do orçamento pela área total de construção."]
[null,null,null,null,null,null,null,null,null,null,null,"F"]
[null,null,null,null,null,null,null,null,null,null,null,"F"]
[]
[null,null,null,null,null,null,null,null,null,null,null,null,null,null,"SOMATÓRIO DE SERVIÇOS"]
[null,null,null,null,null,null,null,null,null,null,null,null,null,null,"ITEM","DESCRIÇÃO DOS SERVIÇOS",null,null,"PREÇO SEM BDI",null,null,"PREÇO COM BDI",null,"PARTICIPAÇÃO ( % )"]
[null,null,null,null,null,null,null,null,null,null,null,null,null,null,"a.","SERVIÇOS PRELIMINARES",null,null,{"$f":"SUMIF($R$19:$R$584,$P603,$W$19:$W$584)","v":0},null,null,{"$f":"ROUND(S603*(1+BDI.Taxa),2)","v":0},null,{"$f":"IFERROR(ROUND($V603*100/$W$587,2),0)","v":0}]
[null,null,null,null,null,null,null,null,null,null,null,null,null,null,"b.","TRANSPORTES",null,null,0,null,null,0,null,{"$f":"IFERROR(ROUND($V604*100/$W$587,2),0)","v":0}]
[null,null,null,null,null,null,null,null,null,null,null,null,null,null,"c.","SERVIÇO EM TERRA",null,null,0,null,null,0,null,0]
[null,null,null,null,null,null,null,null,null,null,null,null,null,null,"d.","FUNDAÇÕES E SONDAGENS",null,null,0,null,null,0,null,0]
[null,null,null,null,null,null,null,null,null,null,null,null,null,null,"e.","ESTRUTURA",null,null,0,null,null,0,null,0]
[null,null,null,null,null,null,null,null,null,null,null,null,null,null,"f.","INSTALAÇÕES ELÉTRICAS",null,null,0,null,null,0,null,0]
[null,null,null,null,null,null,null,null,null,null,null,null,null,null,"g.","INSTALAÇÕES HIDROSSANITÁRIAS",null,null,0,null,null,0,null,0]
[null,null,null,null,null,null,null,null,null,null,null,null,null,null,"h","INSTALAÇÕES ESPECIAIS",null,null,0,null,null,0,null,0]
[null,null,null,null,null,null,null,null,null,null,null,null,null,null,"i.","ALVENARIAS E DIVISÓRIAS",null,null,0,null,null,0,null,0]
[null,null,null,null,null,null,null,null,null,null,null,null,null,null,"j.","ALVENARIA AUTO-PORTANTE",null,null,0,null,null,0,null,0]
[null,null,null,null,null,null,null,null,null,null,null,null,null,null,"k.","IMPERMEABILIZAÇÃO",null,null,0,null,null,0,null,0]
[null,null,null,null,null,null,null,null,null,null,null,null,null,null,"l.","ISOLAMENTO TÉRMICO E ACÚSTICO",null,null,0,null,null,0,null,0]
[null,null,null,null,null,null,null,null,null,null,null,null,null,null,"m.","ESTRUTURA DE MADEIRA",null,null,0,null,null,0,null,0]
[null,null,null,null,null,null,null,null,null,null,null,null,null,null,"n.","ESTRUTURAS METÁLICAS",null,null,0,null,null,0,null,0]
[null,null,null,null,null,null,null,null,null,null,null,null,null,null,"o.","COBERTURAS",null,null,0,null,null,0,null,0]
[null,null,null,null,null,null,null,null,null,null,null,null,null,null,"p.","ESQUADRIAS DE MADEIRA",null,null,0,null,null,0,null,0]
[null,null,null,null,null,null,null,null,null,null,null,null,null,null,"q.","ESQUADRIAS METÁLICAS",null,null,0,null,null,{"$f":"ROUND(S619*(1+BDI.Taxa),2)","v":0},null,0]
[null,null,null,null,null,null,null,null,null,null,null,null,null,null,"r.","VIDROS",null,null,0,null,null,0,null,0]
[null,null,null,null,null,null,null,null,null,null,null,null,null,null,"s.","REVESTIMENTO DE PAREDE",null,null,0,null,null,0,null,0]
[null,null,null,null,null,null,null,null,null,null,null,null,null,null,"t.","FORROS",null,null,0,null,null,0,null,0]
[null,null,null,null,null,null,null,null,null,null,null,null,null,null,"u.","REVESTIMENTO DE PISO",null,null,0,null,null,0,null,0]
[null,null,null,null,null,null,null,null,null,null,null,null,null,null,"v.","FERRAGENS",null,null,0,null,null,0,null,0]
[null,null,null,null,null,null,null,null,null,null,null,null,null,null,"w.","MARCENARIA",null,null,0,null,null,0,null,0]
[null,null,null,null,null,null,null,null,null,null,null,null,null,null,"x.","ADMINISTRAÇÃO",null,null,0,null,null,0,null,0]
[null,null,null,null,null,null,null,null,null,null,null,null,null,null,"y.","PINTURA",null,null,0,null,null,{"$f":"ROUND(S627*(1+BDI.Taxa),2)","v":0},null,0]
[null,null,null,null,null,null,null,null,null,null,null,null,null,null,"z.","DIVERSOS",null,null,0,null,null,{"$f":"IF(S628>0,IF((SUM(V603:W627)+ROUND(S628*(1+BDI.Taxa),2))<>V630,V630-SUM(V603:W627),ROUND(S628*(1+BDI.Taxa),2)),0)","v":0},null,{"$f":"IF(S628>0,IF((SUM(X603:X627)+IFERROR(ROUND($V628*100/$W$587,2),0))<>X630,X630-SUM(X603:X627),IFERROR(ROUND($V628*100/$W$587,2),0)),0)","v":0}]
[null,null,null,null,null,null,null,null,null,null,null,null,null,null,"TOTAL GERAL DO ORÇAMENTO (R$)",null,null,null,{"$f":"SUM(S603:U628)","v":0},null,null,{"$f":"SUM(V603:W628)","v":0},null,{"$f":"SUM(X603:X628)","v":0}]
[null,null,null,null,null,null,null,null,null,null,null,null,null,null,null,null,null,null,{"$f":"$W$585","v":0},null,null,{"$f":"$W$587","v":0},null,100]
[null,null,null,null,null,null,null,null,null,null,null,null,null,null,null,null,null,null,"(TOTAL SEM BDI)",null,null,"(TOTAL COM BDI)",null,"(ARRED porcentagem)"]
[null,null,null,null,null,null,null,null,null,null,null,null,null,null,null,null,null,null,{"$f":"IF(AND(S629=S630,S629>0),\"OK\",\"ERRO\")","v":"ERRO"},null,null,{"$f":"IF(AND(V629=V630,V629>0),\"OK\",\"ERRO\")","v":"ERRO"},null,{"$f":"IF(X629=100,\"OK\",\"ERRO\")","v":"ERRO"}]
[]
[]
[null,null,null,null,null,null,null,null,null,null,null,null,null,null,"RESUMO GERAL DO ORÇAMENTO"]
[null,null,null,null,null,null,null,null,null,null,null,null,null,null,"ITEM","DESCRIÇÃO DOS SERVIÇOS",null,null,"PREÇO SEM BDI",null,null,"PREÇO COM BDI",null,"PARTICIPAÇÃO ( % )"]
[null,null,null,null,null,null,null,null,null,null,null,null,null,null,"1.",{"$f":"IFERROR(VLOOKUP(O637,$O$19:$W$584,4,FALSE),\"\")","v":"REFORMA"},null,null,{"$f":"IF(P638=\"\",$S$658-SUM(OFFSET($S$636:S636,0,0,COUNTA($S$636:S636),1)),SUMIF($R$19:$R$584,$P637,$W$19:$W$584))","v":0},null,null,{"$f":"IF(P638=\"\",$V$658-SUM(OFFSET($V$636:V636,0,0,COUNTA($V$636:V636),1)),ROUND(S637*(1+BDI.Taxa),2))","v":0},null,{"$f":"IF(P638=\"\",$X$658-SUM(OFFSET($X$636:X636,0,0,COUNTA($X$636:X636),1)),ROUND(V637*100/ORÇAMENTO.TotalOrçamento,2))","v":{"$error":"#DIV/0!"}}]
[null,null,null,null,null,null,null,null,null,null,null,null,null,null,"2.","PÁTIO MULTIUSO - PADRÃO SEDUC - OPÇÃO 2 ",null,null,{"$f":"IF(P639=\"\",$S$658-SUM(OFFSET($S$636:S637,0,0,COUNTA($S$636:S637),1)),SUMIF($R$19:$R$584,$P638,$W$19:$W$584))","v":0},null,null,{"$f":"IF(P639=\"\",$V$658-SUM(OFFSET($V$636:V637,0,0,COUNTA($V$636:V637),1)),ROUND(S638*(1+BDI.Taxa),2))","v":0},null,{"$f":"IF(P639=\"\",$X$658-SUM(OFFSET($X$636:X637,0,0,COUNTA($X$636:X637),1)),ROUND(V638*100/ORÇAMENTO.TotalOrçamento,2))","v":{"$error":"#DIV/0!"}}]
[null,null,null,null,null,null,null,null,null,null,null,null,null,null,"3.","QUADRA COBERTA PADRÃO NOSSA ESCOLA - MOD 02",null,null,{"$f":"IF(P640=\"\",$S$658-SUM(OFFSET($S$636:S638,0,0,COUNTA($S$636:S638),1)),SUMIF($R$19:$R$584,$P639,$W$19:$W$584))","v":0},null,null,{"$f":"IF(P640=\"\",$V$658-SUM(OFFSET($V$636:V638,0,0,COUNTA($V$636:V638),1)),ROUND(S639*(1+BDI.Taxa),2))","v":0},null,{"$f":"IF(P640=\"\",$X$658-SUM(OFFSET($X$636:X638,0,0,COUNTA($X$636:X638),1)),ROUND(V639*100/ORÇAMENTO.TotalOrçamento,2))","v":{"$error":"#DIV/0!"}}]
[null,null,null,null,null,null,null,null,null,null,null,null,null,null,"4.","",null,null,{"$f":"IF(P641=\"\",$S$658-SUM(OFFSET($S$636:S639,0,0,COUNTA($S$636:S639),1)),SUMIF($R$19:$R$584,$P640,$W$19:$W$584))","v":0},null,null,{"$f":"IF(P641=\"\",$V$658-SUM(OFFSET($V$636:V639,0,0,COUNTA($V$636:V639),1)),ROUND(S640*(1+BDI.Taxa),2))","v":0},null,{"$f":"IF(P641=\"\",$X$658-SUM(OFFSET($X$636:X639,0,0,COUNTA($X$636:X639),1)),ROUND(V640*100/ORÇAMENTO.TotalOrçamento,2))","v":{"$error":"#DIV/0!"}}]
[null,null,null,null,null,null,null,null,null,null,null,null,null,null,"5.","",null,null,{"$f":"IF(P642=\"\",$S$658-SUM(OFFSET($S$636:S640,0,0,COUNTA($S$636:S640),1)),SUMIF($R$19:$R$584,$P641,$W$19:$W$584))","v":0},null,null,{"$f":"IF(P642=\"\",$V$658-SUM(OFFSET($V$636:V640,0,0,COUNTA($V$636:V640),1)),ROUND(S641*(1+BDI.Taxa),2))","v":0},null,{"$f":"IF(P642=\"\",$X$658-SUM(OFFSET($X$636:X640,0,0,COUNTA($X$636:X640),1)),ROUND(V641*100/ORÇAMENTO.TotalOrçamento,2))","v":{"$error":"#DIV/0!"}}]
[null,null,null,null,null,null,null,null,null,null,null,null,null,null,"6.","",null,null,{"$f":"IF(P643=\"\",$S$658-SUM(OFFSET($S$636:S641,0,0,COUNTA($S$636:S641),1)),SUMIF($R$19:$R$584,$P642,$W$19:$W$584))","v":0},null,null,{"$f":"IF(P643=\"\",$V$658-SUM(OFFSET($V$636:V641,0,0,COUNTA($V$636:V641),1)),ROUND(S642*(1+BDI.Taxa),2))","v":0},null,{"$f":"IF(P643=\"\",$X$658-SUM(OFFSET($X$636:X641,0,0,COUNTA($X$636:X641),1)),ROUND(V642*100/ORÇAMENTO.TotalOrçamento,2))","v":{"$error":"#DIV/0!"}}]
[null,null,null,null,null,null,null,null,null,null,null,null,null,null,"7.","",null,null,{"$f":"IF(P644=\"\",$S$658-SUM(OFFSET($S$636:S642,0,0,COUNTA($S$636:S642),1)),SUMIF($R$19:$R$584,$P643,$W$19:$W$584))","v":0},null,null,{"$f":"IF(P644=\"\",$V$658-SUM(OFFSET($V$636:V642,0,0,COUNTA($V$636:V642),1)),ROUND(S643*(1+BDI.Taxa),2))","v":0},null,{"$f":"IF(P644=\"\",$X$658-SUM(OFFSET($X$636:X642,0,0,COUNTA($X$636:X642),1)),ROUND(V643*100/ORÇAMENTO.TotalOrçamento,2))","v":{"$error":"#DIV/0!"}}]
[null,null,null,null,null,null,null,null,null,null,null,null,null,null,"8.","",null,null,{"$f":"IF(P645=\"\",$S$658-SUM(OFFSET($S$636:S643,0,0,COUNTA($S$636:S643),1)),SUMIF($R$19:$R$584,$P644,$W$19:$W$584))","v":0},null,null,{"$f":"IF(P645=\"\",$V$658-SUM(OFFSET($V$636:V643,0,0,COUNTA($V$636:V643),1)),ROUND(S644*(1+BDI.Taxa),2))","v":0},null,{"$f":"IF(P645=\"\",$X$658-SUM(OFFSET($X$636:X643,0,0,COUNTA($X$636:X643),1)),ROUND(V644*100/ORÇAMENTO.TotalOrçamento,2))","v":{"$error":"#DIV/0!"}}]
[null,null,null,null,null,null,null,null,null,null,null,null,null,null,"9.","",null,null,{"$f":"IF(P646=\"\",$S$658-SUM(OFFSET($S$636:S644,0,0,COUNTA($S$636:S644),1)),SUMIF($R$19:$R$584,$P645,$W$19:$W$584))","v":0},null,null,{"$f":"IF(P646=\"\",$V$658-SUM(OFFSET($V$636:V644,0,0,COUNTA($V$636:V644),1)),ROUND(S645*(1+BDI.Taxa),2))","v":0},null,{"$f":"IF(P646=\"\",$X$658-SUM(OFFSET($X$636:X644,0,0,COUNTA($X$636:X644),1)),ROUND(V645*100/ORÇAMENTO.TotalOrçamento,2))","v":{"$error":"#DIV/0!"}}]
[null,null,null,null,null,null,null,null,null,null,null,null,null,null,"10.","",null,null,{"$f":"IF(P647=\"\",$S$658-SUM(OFFSET($S$636:S645,0,0,COUNTA($S$636:S645),1)),SUMIF($R$19:$R$584,$P646,$W$19:$W$584))","v":0},null,null,{"$f":"IF(P647=\"\",$V$658-SUM(OFFSET($V$636:V645,0,0,COUNTA($V$636:V645),1)),ROUND(S646*(1+BDI.Taxa),2))","v":0},null,{"$f":"IF(P647=\"\",$X$658-SUM(OFFSET($X$636:X645,0,0,COUNTA($X$636:X645),1)),ROUND(V646*100/ORÇAMENTO.TotalOrçamento,2))","v":{"$error":"#DIV/0!"}}]
[null,null,null,null,null,null,null,null,null,null,null,null,null,null,"11.","",null,null,{"$f":"IF(P648=\"\",$S$658-SUM(OFFSET($S$636:S646,0,0,COUNTA($S$636:S646),1)),SUMIF($R$19:$R$584,$P647,$W$19:$W$584))","v":0},null,null,{"$f":"IF(P648=\"\",$V$658-SUM(OFFSET($V$636:V646,0,0,COUNTA($V$636:V646),1)),ROUND(S647*(1+BDI.Taxa),2))","v":0},null,{"$f":"IF(P648=\"\",$X$658-SUM(OFFSET($X$636:X646,0,0,COUNTA($X$636:X646),1)),ROUND(V647*100/ORÇAMENTO.TotalOrçamento,2))","v":{"$error":"#DIV/0!"}}]
[null,null,null,null,null,null,null,null,null,null,null,null,null,null,"12.","",null,null,{"$f":"IF(P649=\"\",$S$658-SUM(OFFSET($S$636:S647,0,0,COUNTA($S$636:S647),1)),SUMIF($R$19:$R$584,$P648,$W$19:$W$584))","v":0},null,null,{"$f":"IF(P649=\"\",$V$658-SUM(OFFSET($V$636:V647,0,0,COUNTA($V$636:V647),1)),ROUND(S648*(1+BDI.Taxa),2))","v":0},null,{"$f":"IF(P649=\"\",$X$658-SUM(OFFSET($X$636:X647,0,0,COUNTA($X$636:X647),1)),ROUND(V648*100/ORÇAMENTO.TotalOrçamento,2))","v":{"$error":"#DIV/0!"}}]
[null,null,null,null,null,null,null,null,null,null,null,null,null,null,"13.","",null,null,{"$f":"IF(P650=\"\",$S$658-SUM(OFFSET($S$636:S648,0,0,COUNTA($S$636:S648),1)),SUMIF($R$19:$R$584,$P649,$W$19:$W$584))","v":0},null,null,{"$f":"IF(P650=\"\",$V$658-SUM(OFFSET($V$636:V648,0,0,COUNTA($V$636:V648),1)),ROUND(S649*(1+BDI.Taxa),2))","v":0},null,{"$f":"IF(P650=\"\",$X$658-SUM(OFFSET($X$636:X648,0,0,COUNTA($X$636:X648),1)),ROUND(V649*100/ORÇAMENTO.TotalOrçamento,2))","v":{"$error":"#DIV/0!"}}]
[null,null,null,null,null,null,null,null,null,null,null,null,null,null,"14.","",null,null,{"$f":"IF(P651=\"\",$S$658-SUM(OFFSET($S$636:S649,0,0,COUNTA($S$636:S649),1)),SUMIF($R$19:$R$584,$P650,$W$19:$W$584))","v":0},null,null,{"$f":"IF(P651=\"\",$V$658-SUM(OFFSET($V$636:V649,0,0,COUNTA($V$636:V649),1)),ROUND(S650*(1+BDI.Taxa),2))","v":0},null,{"$f":"IF(P651=\"\",$X$658-SUM(OFFSET($X$636:X649,0,0,COUNTA($X$636:X649),1)),ROUND(V650*100/ORÇAMENTO.TotalOrçamento,2))","v":{"$error":"#DIV/0!"}}]
[null,null,null,null,null,null,null,null,null,null,null,null,null,null,"15.","",null,null,{"$f":"IF(P652=\"\",$S$658-SUM(OFFSET($S$636:S650,0,0,COUNTA($S$636:S650),1)),SUMIF($R$19:$R$584,$P651,$W$19:$W$584))","v":0},null,null,{"$f":"IF(P652=\"\",$V$658-SUM(OFFSET($V$636:V650,0,0,COUNTA($V$636:V650),1)),ROUND(S651*(1+BDI.Taxa),2))","v":0},null,{"$f":"IF(P652=\"\",$X$658-SUM(OFFSET($X$636:X650,0,0,COUNTA($X$636:X650),1)),ROUND(V651*100/ORÇAMENTO.TotalOrçamento,2))","v":{"$error":"#DIV/0!"}}]
[null,null,null,null,null,null,null,null,null,null,null,null,null,null,"16.","",null,null,{"$f":"IF(P653=\"\",$S$658-SUM(OFFSET($S$636:S651,0,0,COUNTA($S$636:S651),1)),SUMIF($R$19:$R$584,$P652,$W$19:$W$584))","v":0},null,null,{"$f":"IF(P653=\"\",$V$658-SUM(OFFSET($V$636:V651,0,0,COUNTA($V$636:V651),1)),ROUND(S652*(1+BDI.Taxa),2))","v":0},null,{"$f":"IF(P653=\"\",$X$658-SUM(OFFSET($X$636:X651,0,0,COUNTA($X$636:X651),1)),ROUND(V652*100/ORÇAMENTO.TotalOrçamento,2))","v":{"$error":"#DIV/0!"}}]
[null,null,null,null,null,null,null,null,null,null,null,null,null,null,"17.","",null,null,{"$f":"IF(P654=\"\",$S$658-SUM(OFFSET($S$636:S652,0,0,COUNTA($S$636:S652),1)),SUMIF($R$19:$R$584,$P653,$W$19:$W$584))","v":0},null,null,{"$f":"IF(P654=\"\",$V$658-SUM(OFFSET($V$636:V652,0,0,COUNTA($V$636:V652),1)),ROUND(S653*(1+BDI.Taxa),2))","v":0},null,{"$f":"IF(P654=\"\",$X$658-SUM(OFFSET($X$636:X652,0,0,COUNTA($X$636:X652),1)),ROUND(V653*100/ORÇAMENTO.TotalOrçamento,2))","v":{"$error":"#DIV/0!"}}]
[null,null,null,null,null,null,null,null,null,null,null,null,null,null,"18.","",null,null,{"$f":"IF(P655=\"\",$S$658-SUM(OFFSET($S$636:S653,0,0,COUNTA($S$636:S653),1)),SUMIF($R$19:$R$584,$P654,$W$19:$W$584))","v":0},null,null,{"$f":"IF(P655=\"\",$V$658-SUM(OFFSET($V$636:V653,0,0,COUNTA($V$636:V653),1)),ROUND(S654*(1+BDI.Taxa),2))","v":0},null,{"$f":"IF(P655=\"\",$X$658-SUM(OFFSET($X$636:X653,0,0,COUNTA($X$636:X653),1)),ROUND(V654*100/ORÇAMENTO.TotalOrçamento,2))","v":{"$error":"#DIV/0!"}}]
[null,null,null,null,null,null,null,null,null,null,null,null,null,null,"19.","",null,null,{"$f":"IF(P656=\"\",$S$658-SUM(OFFSET($S$636:S654,0,0,COUNTA($S$636:S654),1)),SUMIF($R$19:$R$584,$P655,$W$19:$W$584))","v":0},null,null,{"$f":"IF(P656=\"\",$V$658-SUM(OFFSET($V$636:V654,0,0,COUNTA($V$636:V654),1)),ROUND(S655*(1+BDI.Taxa),2))","v":0},null,{"$f":"IF(P656=\"\",$X$658-SUM(OFFSET($X$636:X654,0,0,COUNTA($X$636:X654),1)),ROUND(V655*100/ORÇAMENTO.TotalOrçamento,2))","v":{"$error":"#DIV/0!"}}]
[null,null,null,null,null,null,null,null,null,null,null,null,null,null,"20.","",null,null,{"$f":"IF(P657=\"\",$S$658-SUM(OFFSET($S$636:S655,0,0,COUNTA($S$636:S655),1)),SUMIF($R$19:$R$584,$P656,$W$19:$W$584))","v":0},null,null,{"$f":"IF(P657=\"\",$V$658-SUM(OFFSET($V$636:V655,0,0,COUNTA($V$636:V655),1)),ROUND(S656*(1+BDI.Taxa),2))","v":0},null,{"$f":"IF(P657=\"\",$X$658-SUM(OFFSET($X$636:X655,0,0,COUNTA($X$636:X655),1)),ROUND(V656*100/ORÇAMENTO.TotalOrçamento,2))","v":{"$error":"#DIV/0!"}}]
[null,null,null,null,null,null,null,null,null,null,null,null,null,null,"TOTAL GERAL DO ORÇAMENTO (R$)",null,null,null,{"$f":"SUM(S637:U656)","v":0},null,null,{"$f":"SUM(V637:W656)","v":0},null,{"$f":"SUM(X637:X656)","v":{"$error":"#DIV/0!"}}]
[null,null,null,null,null,null,null,null,null,null,null,null,null,null,null,null,null,null,{"$f":"$W$585","v":0},null,null,{"$f":"$W$587","v":0},null,100]
[null,null,null,null,null,null,null,null,null,null,null,null,null,null,null,null,null,null,"(TOTAL SEM BDI)",null,null,"(TOTAL COM BDI)",null,"(ARRED porcentagem)"]
[null,null,null,null,null,null,null,null,null,null,null,null,null,null,null,null,null,null,{"$f":"IF(AND(S657=S658,S657>0),\"OK\",\"ERRO\")","v":"ERRO"},null,null,{"$f":"IF(AND(V657=V658,V657>0),\"OK\",\"ERRO\")","v":"ERRO"},null,{"$f":"IF(AND(X657=100,S637<>0),\"OK\",\"ERRO\")","v":{"$error":"#DIV/0!"}}]

{"sheet":"Resumo ","index":1,"n_rows":39,"n_cols":9,"rows_kept":39,"cut":false,"hidden":false,"merged":[[13,0,14,0],[34,2,34,3],[35,2,35,3],[31,2,31,3],[32,2,32,3],[33,2,33,3],[28,2,28,3],[29,2,29,3],[30,2,30,3],[0,1,0,8],[36,1,36,5],[2,1,2,5],[3,1,3,5],[5,1,5,5],[6,1,6,5],[8,1,8,5],[9,1,9,5],[11,3,11,5],[12,3,12,5],[10,1,10,8],[11,6,11,8],[12,6,12,8],[25,2,25,3],[21,2,21,3],[22,2,22,3],[6,6,6,8],[7,1,7,8],[8,6,8,8],[9,6,9,8],[13,1,13,8],[1,1,1,8],[2,6,2,8],[3,6,3,8],[4,1,4,8],[5,6,5,8],[42,3,42,7],[11,1,11,2],[12,1,12,2],[15,2,15,3],[16,2,16,3],[14,1,14,8],[17,2,17,3],[23,2,23,3],[18,2,18,3],[19,2,19,3],[20,2,20,3],[41,3,41,7],[24,2,24,3],[26,2,26,3],[27,2,27,3],[38,1,38,8]]}
[]
[]
[null,"UNIDADE ESCOLAR",null,null,null,null,"CÓDIGO INEP"]
[null,{"$f":"Orçamento!$O$4","v":"COLÉGIO ESTADUAL CARLOS DRUMOND DE ANDRADE"},null,null,null,null,{"$f":"Orçamento!V4","v":52092127}]
[]
[null,"OBRA",null,null,null,null,"CIDADE"]
[null,{"$f":"Orçamento!$O$7","v":"REFORMA"},null,null,null,null,{"$f":"Orçamento!$V$7","v":"NOVO GAMA"}]
[]
[null,"ENDEREÇO",null,null,null,null,"CRE"]
[null,{"$f":"Orçamento!$R$10","v":"AV. SEBASTIÃO VARGAS FILHO QD 08 S/N VALE DO PEDREGA, VALE DO PEDREGAL, CEP:72860-785"},null,null,null,null,{"$f":"Orçamento!$O$10","v":"NOVO GAMA"}]
[]
[null,"REFERÊNCIA",null,"DATA",null,null,"ÁREA TOTAL CONSTRUÍDA (M²)"]
[null,{"$f":"CONCATENATE(\"AGETOP E SINAPI - \",Orçamento!$W$10)","v":"AGETOP E SINAPI - ONERADA"},null,{"$f":"Orçamento!$S$7","v":"2020-09-02"},null,null,{"$f":"Orçamento!$S$13","v":2668.12}]
["FILTRO"]
[null,"RESUMO GERAL DO ORÇAMENTO"]
["↓","ITEM","DESCRIÇÃO DOS SERVIÇOS",null,"UNID","QUANT","PREÇO SEM BDI","PREÇO COM BDI","PARTICIP. (%)"]
[{"$f":"IF(E17>0,\"F\",\"\")","v":"F"},"1.",{"$f":"Orçamento!$P637","v":"REFORMA"},null,"UN ",1,{"$f":"IFERROR(Orçamento!S637,\"-\")","v":0},{"$f":"IFERROR(Orçamento!V637,\"\")","v":0},{"$f":"Orçamento!X637","v":{"$error":"#DIV/0!"}}]
[{"$f":"IF(E18>0,\"F\",\"\")","v":"F"},"2.",{"$f":"Orçamento!$P638","v":"PÁTIO MULTIUSO - PADRÃO SEDUC - OPÇÃO 2 "},null,"UN ",1,{"$f":"IFERROR(Orçamento!S638,\"-\")","v":0},{"$f":"IFERROR(Orçamento!V638,\"\")","v":0},{"$f":"Orçamento!X638","v":{"$error":"#DIV/0!"}}]
["F","3.",{"$f":"Orçamento!$P639","v":"QUADRA COBERTA PADRÃO NOSSA ESCOLA - MOD 02"},null,"UN ",1,{"$f":"IFERROR(Orçamento!S639,\"-\")","v":0},{"$f":"IFERROR(Orçamento!V639,\"\")","v":0},{"$f":"Orçamento!X639","v":{"$error":"#DIV/0!"}}]
["","4.",{"$f":"Orçamento!$P640","v":""},null,null,null,{"$f":"IFERROR(Orçamento!S640,\"-\")","v":0},{"$f":"IFERROR(Orçamento!V640,\"\")","v":0},{"$f":"Orçamento!X640","v":{"$error":"#DIV/0!"}}]
["","5.",{"$f":"Orçamento!$P641","v":""},null,null,null,{"$f":"IFERROR(Orçamento!S641,\"-\")","v":0},{"$f":"IFERROR(Orçamento!V641,\"\")","v":0},{"$f":"Orçamento!X641","v":{"$error":"#DIV/0!"}}]
["","6.",{"$f":"Orçamento!$P642","v":""},null,null,null,{"$f":"IFERROR(Orçamento!S642,\"-\")","v":0},{"$f":"IFERROR(Orçamento!V642,\"\")","v":0},{"$f":"Orçamento!X642","v":{"$error":"#DIV/0!"}}]
["","7.",{"$f":"Orçamento!$P643","v":""},null,null,null,{"$f":"IFERROR(Orçamento!S643,\"-\")","v":0},{"$f":"IFERROR(Orçamento!V643,\"\")","v":0},{"$f":"Orçamento!X643","v":{"$error":"#DIV/0!"}}]
["","8.",{"$f":"Orçamento!$P644","v":""},null,null,null,{"$f":"IFERROR(Orçamento!S644,\"-\")","v":0},{"$f":"IFERROR(Orçamento!V644,\"\")","v":0},{"$f":"Orçamento!X644","v":{"$error":"#DIV/0!"}}]
["","9.",{"$f":"Orçamento!$P645","v":""},null,null,null,{"$f":"IFERROR(Orçamento!S645,\"-\")","v":0},{"$f":"IFERROR(Orçamento!V645,\"\")","v":0},{"$f":"Orçamento!X645","v":{"$error":"#DIV/0!"}}]
["","10.",{"$f":"Orçamento!$P646","v":""},null,null,null,{"$f":"IFERROR(Orçamento!S646,\"-\")","v":0},{"$f":"IFERROR(Orçamento!V646,\"\")","v":0},{"$f":"Orçamento!X646","v":{"$error":"#DIV/0!"}}]
["","11.",{"$f":"Orçamento!$P647","v":""},null,null,null,{"$f":"IFERROR(Orçamento!S647,\"-\")","v":0},{"$f":"IFERROR(Orçamento!V647,\"\")","v":0},{"$f":"Orçamento!X647","v":{"$error":"#DIV/0!"}}]
["","12.",{"$f":"Orçamento!$P648","v":""},null,null,null,{"$f":"IFERROR(Orçamento!S648,\"-\")","v":0},{"$f":"IFERROR(Orçamento!V648,\"\")","v":0},{"$f":"Orçamento!X648","v":{"$error":"#DIV/0!"}}]
["","13.",{"$f":"Orçamento!$P649","v":""},null,null,null,{"$f":"IFERROR(Orçamento!S649,\"-\")","v":0},{"$f":"IFERROR(Orçamento!V649,\"\")","v":0},{"$f":"Orçamento!X649","v":{"$error":"#DIV/0!"}}]
["","14.",{"$f":"Orçamento!$P650","v":""},null,null,null,{"$f":"IFERROR(Orçamento!S650,\"-\")","v":0},{"$f":"IFERROR(Orçamento!V650,\"\")","v":0},{"$f":"Orçamento!X650","v":{"$error":"#DIV/0!"}}]
["","15.",{"$f":"Orçamento!$P651","v":""},null,null,null,{"$f":"IFERROR(Orçamento!S651,\"-\")","v":0},{"$f":"IFERROR(Orçamento!V651,\"\")","v":0},{"$f":"Orçamento!X651","v":{"$error":"#DIV/0!"}}]
["","16.",{"$f":"Orçamento!$P652","v":""},null,null,null,{"$f":"IFERROR(Orçamento!S652,\"-\")","v":0},{"$f":"IFERROR(Orçamento!V652,\"\")","v":0},{"$f":"Orçamento!X652","v":{"$error":"#DIV/0!"}}]
["","17.",{"$f":"Orçamento!$P653","v":""},null,null,null,{"$f":"IFERROR(Orçamento!S653,\"-\")","v":0},{"$f":"IFERROR(Orçamento!V653,\"\")","v":0},{"$f":"Orçamento!X653","v":{"$error":"#DIV/0!"}}]
["","18.",{"$f":"Orçamento!$P654","v":""},null,null,null,{"$f":"IFERROR(Orçamento!S654,\"-\")","v":0},{"$f":"IFERROR(Orçamento!V654,\"\")","v":0},{"$f":"Orçamento!X654","v":{"$error":"#DIV/0!"}}]
["","19.",{"$f":"Orçamento!$P655","v":""},null,null,null,{"$f":"IFERROR(Orçamento!S655,\"-\")","v":0},{"$f":"IFERROR(Orçamento!V655,\"\")","v":0},{"$f":"Orçamento!X655","v":{"$error":"#DIV/0!"}}]
["","20.",{"$f":"Orçamento!$P656","v":""},null,null,null,{"$f":"IFERROR(Orçamento!S656,\"-\")","v":0},{"$f":"IFERROR(Orçamento!V656,\"\")","v":0},{"$f":"Orçamento!X656","v":{"$error":"#DIV/0!"}}]
["F","TOTAL GERAL DO ORÇAMENTO (R$)",null,null,null,null,{"$f":"SUM(G17:G36)","v":0},0,{"$f":"SUM(I17:I36)","v":{"$error":"#DIV/0!"}}]
["F"]
["F"]

{"sheet":"Somatório","index":2,"n_rows":45,"n_cols":6,"rows_kept":45,"cut":false,"hidden":false,"merged":[[13,0,14,0],[42,1,42,2],[44,1,44,5],[47,3,47,5],[48,3,48,5],[13,1,13,5],[9,1,9,3],[9,4,9,5],[11,1,11,2],[11,4,11,5],[12,1,12,2],[12,4,12,5],[0,1,0,5],[14,1,14,5],[2,1,2,3],[2,4,2,5],[3,1,3,3],[3,4,3,5],[5,1,5,3],[5,4,5,5],[6,1,6,3],[6,4,6,5],[8,1,8,3],[8,4,8,5],[1,1,1,5],[4,1,4,5],[7,1,7,5],[10,1,10,5]]}
[]
[]
[null,"UNIDADE ESCOLAR",null,null,"CÓDIGO INEP"]
[null,{"$f":"Orçamento!$O$4","v":"COLÉGIO ESTADUAL CARLOS DRUMOND DE ANDRADE"},null,null,{"$f":"Orçamento!V4","v":52092127}]
[]
[null,"OBRA",null,null,"CIDADE"]
[null,{"$f":"Orçamento!$O$7","v":"REFORMA"},null,null,{"$f":"Orçamento!$V$7","v":"NOVO GAMA"}]
[]
[null,"ENDEREÇO",null,null,"CRE"]
[null,{"$f":"Orçamento!$R$10","v":"AV. SEBASTIÃO VARGAS FILHO QD 08 S/N VALE DO PEDREGA, VALE DO PEDREGAL, CEP:72860-785"},null,null,{"$f":"Orçamento!$O$10","v":"NOVO GAMA"}]
[]
[null,"REFERÊNCIA",null,"DATA","ÁREA TOTAL CONSTRUÍDA (M²)"]
[null,{"$f":"CONCATENATE(\"AGETOP E SINAPI - \",Orçamento!$W$10)","v":"AGETOP E SINAPI - ONERADA"},null,{"$f":"Orçamento!$S$7","v":"2020-09-02"},{"$f":"Orçamento!$S$13","v":2668.12}]
["FILTRO"]
[null,"SOMATÓRIO DE SERVIÇOS"]
["↓","ITEM","DESCRIÇÃO DOS SERVIÇOS","PREÇO SEM BDI (R$)","PREÇO COM BDI (R$)","PARTIC.  ( % )"]
[{"$f":"IF(D17>0,\"F\",\"\")","v":""},"a.",{"$f":"Orçamento!P603","v":"SERVIÇOS PRELIMINARES"},{"$f":"Orçamento!S603","v":0},{"$f":"Orçamento!V603","v":0},{"$f":"Orçamento!X603","v":0}]
[{"$f":"IF(D18>0,\"F\",\"\")","v":""},"b.",{"$f":"Orçamento!P604","v":"TRANSPORTES"},{"$f":"Orçamento!S604","v":0},{"$f":"Orçamento!V604","v":0},{"$f":"Orçamento!X604","v":0}]
["","c.",{"$f":"Orçamento!P605","v":"SERVIÇO EM TERRA"},{"$f":"Orçamento!S605","v":0},{"$f":"Orçamento!V605","v":0},{"$f":"Orçamento!X605","v":0}]
["","d.",{"$f":"Orçamento!P606","v":"FUNDAÇÕES E SONDAGENS"},{"$f":"Orçamento!S606","v":0},{"$f":"Orçamento!V606","v":0},{"$f":"Orçamento!X606","v":0}]
["","e.",{"$f":"Orçamento!P607","v":"ESTRUTURA"},{"$f":"Orçamento!S607","v":0},{"$f":"Orçamento!V607","v":0},{"$f":"Orçamento!X607","v":0}]
["","f.",{"$f":"Orçamento!P608","v":"INSTALAÇÕES ELÉTRICAS"},{"$f":"Orçamento!S608","v":0},{"$f":"Orçamento!V608","v":0},{"$f":"Orçamento!X608","v":0}]
["","g.",{"$f":"Orçamento!P609","v":"INSTALAÇÕES HIDROSSANITÁRIAS"},{"$f":"Orçamento!S609","v":0},{"$f":"Orçamento!V609","v":0},{"$f":"Orçamento!X609","v":0}]
["","h.",{"$f":"Orçamento!P610","v":"INSTALAÇÕES ESPECIAIS"},{"$f":"Orçamento!S610","v":0},{"$f":"Orçamento!V610","v":0},{"$f":"Orçamento!X610","v":0}]
["","i.",{"$f":"Orçamento!P611","v":"ALVENARIAS E DIVISÓRIAS"},{"$f":"Orçamento!S611","v":0},{"$f":"Orçamento!V611","v":0},{"$f":"Orçamento!X611","v":0}]
["","j.",{"$f":"Orçamento!P612","v":"ALVENARIA AUTO-PORTANTE"},{"$f":"Orçamento!S612","v":0},{"$f":"Orçamento!V612","v":0},{"$f":"Orçamento!X612","v":0}]
["","k.",{"$f":"Orçamento!P613","v":"IMPERMEABILIZAÇÃO"},{"$f":"Orçamento!S613","v":0},{"$f":"Orçamento!V613","v":0},{"$f":"Orçamento!X613","v":0}]
["","l.",{"$f":"Orçamento!P614","v":"ISOLAMENTO TÉRMICO E ACÚSTICO"},{"$f":"Orçamento!S614","v":0},{"$f":"Orçamento!V614","v":0},{"$f":"Orçamento!X614","v":0}]
["","m.",{"$f":"Orçamento!P615","v":"ESTRUTURA DE MADEIRA"},{"$f":"Orçamento!S615","v":0},{"$f":"Orçamento!V615","v":0},{"$f":"Orçamento!X615","v":0}]
["","n.",{"$f":"Orçamento!P616","v":"ESTRUTURAS METÁLICAS"},{"$f":"Orçamento!S616","v":0},{"$f":"Orçamento!V616","v":0},{"$f":"Orçamento!X616","v":0}]
["","o.",{"$f":"Orçamento!P617","v":"COBERTURAS"},{"$f":"Orçamento!S617","v":0},{"$f":"Orçamento!V617","v":0},{"$f":"Orçamento!X617","v":0}]
["","p.",{"$f":"Orçamento!P618","v":"ESQUADRIAS DE MADEIRA"},{"$f":"Orçamento!S618","v":0},{"$f":"Orçamento!V618","v":0},{"$f":"Orçamento!X618","v":0}]
["","q.",{"$f":"Orçamento!P619","v":"ESQUADRIAS METÁLICAS"},{"$f":"Orçamento!S619","v":0},{"$f":"Orçamento!V619","v":0},{"$f":"Orçamento!X619","v":0}]
["","r.",{"$f":"Orçamento!P620","v":"VIDROS"},{"$f":"Orçamento!S620","v":0},{"$f":"Orçamento!V620","v":0},{"$f":"Orçamento!X620","v":0}]
["","s.",{"$f":"Orçamento!P621","v":"REVESTIMENTO DE PAREDE"},{"$f":"Orçamento!S621","v":0},{"$f":"Orçamento!V621","v":0},{"$f":"Orçamento!X621","v":0}]
["","t.",{"$f":"Orçamento!P622","v":"FORROS"},{"$f":"Orçamento!S622","v":0},{"$f":"Orçamento!V622","v":0},{"$f":"Orçamento!X622","v":0}]
["","u.",{"$f":"Orçamento!P623","v":"REVESTIMENTO DE PISO"},{"$f":"Orçamento!S623","v":0},{"$f":"Orçamento!V623","v":0},{"$f":"Orçamento!X623","v":0}]
["","v.",{"$f":"Orçamento!P624","v":"FERRAGENS"},{"$f":"Orçamento!S624","v":0},{"$f":"Orçamento!V624","v":0},{"$f":"Orçamento!X624","v":0}]
["","w.",{"$f":"Orçamento!P625","v":"MARCENARIA"},{"$f":"Orçamento!S625","v":0},{"$f":"Orçamento!V625","v":0},{"$f":"Orçamento!X625","v":0}]
["","x.",{"$f":"Orçamento!P626","v":"ADMINISTRAÇÃO"},{"$f":"Orçamento!S626","v":0},{"$f":"Orçamento!V626","v":0},{"$f":"Orçamento!X626","v":0}]
["","y.",{"$f":"Orçamento!P627","v":"PINTURA"},{"$f":"Orçamento!S627","v":0},{"$f":"Orçamento!V627","v":0},{"$f":"Orçamento!X627","v":0}]
["","z.",{"$f":"Orçamento!P628","v":"DIVERSOS"},{"$f":"Orçamento!S628","v":0},{"$f":"Orçamento!V628","v":0},{"$f":"Orçamento!X628","v":0}]
["F","TOTAL GERAL DO ORÇAMENTO",null,{"$f":"SUM(D17:D42)","v":0},{"$f":"SUM(E17:E42)","v":0},{"$f":"SUM(F17:F42)","v":0}]
[]
[null,"(*) Para itens da AGETOP, os vidros não estão inclusos nas esquadrias e já foram considerados os custos de contramarco para as esquadrias de alumínio;"]

{"sheet":"Cronog_120_Dias","index":3,"n_rows":99,"n_cols":23,"rows_kept":99,"cut":false,"hidden":false,"merged":[[2,1,2,7],[5,1,5,7],[6,1,6,7],[8,1,8,7],[9,1,9,7],[4,1,4,21],[7,1,7,21],[0,1,0,21],[1,1,1,21],[2,8,2,21],[12,0,13,0],[9,0,11,0],[11,1,11,21],[92,1,92,2],[92,5,92,8],[92,9,92,12],[93,1,93,2],[93,5,93,8],[93,9,93,12],[74,9,74,12],[74,5,74,8],[68,9,68,12],[70,5,70,8],[70,9,70,12],[59,5,59,8],[71,1,73,2],[71,4,73,4],[71,5,71,8],[71,9,71,12],[73,5,73,8],[73,9,73,12],[59,9,59,12],[61,5,61,8],[61,9,61,12],[94,1,94,2],[94,5,94,8],[94,9,94,12],[76,5,76,8],[76,9,76,12],[77,5,77,8],[77,9,77,12],[79,5,79,8],[79,9,79,12],[80,5,80,8],[80,9,80,12],[82,5,82,8],[82,9,82,12],[77,3,79,3],[80,3,82,3],[86,1,88,2],[80,4,82,4],[95,1,95,2],[95,5,95,8],[95,9,95,12],[97,1,97,4],[98,1,98,21],[86,9,86,12],[88,5,88,8],[88,9,88,12],[85,5,85,8],[85,9,85,12],[89,1,91,2],[89,4,91,4],[89,5,89,8],[89,9,89,12],[91,5,91,8],[91,9,91,12],[89,3,91,3],[86,4,88,4],[86,5,86,8],[86,3,88,3],[83,1,85,2],[83,4,85,4],[83,5,83,8],[83,9,83,12],[68,5,68,8],[65,5,65,8],[65,9,65,12],[67,5,67,8],[67,9,67,12],[65,3,67,3],[62,9,62,12],[64,5,64,8],[64,9,64,12],[62,5,62,8],[53,9,53,12],[55,5,55,8],[55,9,55,12],[50,5,50,8],[50,9,50,12],[52,5,52,8],[52,9,52,12],[56,9,56,12],[58,5,58,8],[58,9,58,12],[53,5,53,8],[56,5,56,8],[44,9,44,12],[46,5,46,8],[46,9,46,12],[47,1,49,2],[47,4,49,4],[47,5,47,8],[47,9,47,12],[49,5,49,8],[49,9,49,12],[44,5,44,8],[47,3,49,3],[35,9,35,12],[37,5,37,8],[37,9,37,12],[35,3,37,3],[40,9,40,12],[38,3,40,3],[38,9,38,12],[41,1,43,2],[41,4,43,4],[41,5,41,8],[41,9,41,12],[43,5,43,8],[43,9,43,12],[41,3,43,3],[35,5,35,8],[38,5,38,8],[40,5,40,8],[29,9,29,12],[31,5,31,8],[31,9,31,12],[32,1,34,2],[32,4,34,4],[32,5,32,8],[32,9,32,12],[34,5,34,8],[34,9,34,12],[32,3,34,3],[29,5,29,8],[29,1,31,2],[29,4,31,4],[26,1,28,2],[26,4,28,4],[26,5,26,8],[26,9,26,12],[28,5,28,8],[28,9,28,12],[23,3,25,3],[23,1,25,2],[23,4,25,4],[23,5,23,8],[26,3,28,3],[14,3,16,3],[17,3,19,3],[14,4,16,4],[14,5,14,8],[14,9,14,12],[16,5,16,8],[16,9,16,12],[23,9,23,12],[25,5,25,8],[25,9,25,12],[17,9,17,12],[19,5,19,8],[19,9,19,12],[20,1,22,2],[20,4,22,4],[20,5,20,8],[20,9,20,12],[22,5,22,8],[22,9,22,12],[20,3,22,3],[83,3,85,3],[53,4,55,4],[59,1,61,2],[59,4,61,4],[74,1,76,2],[77,1,79,2],[77,4,79,4],[80,1,82,2],[65,1,67,2],[68,3,70,3],[62,3,64,3],[68,1,70,2],[56,3,58,3],[65,4,67,4],[71,3,73,3],[74,3,76,3],[74,4,76,4],[56,1,58,2],[68,4,70,4],[44,3,46,3],[62,1,64,2],[62,4,64,4],[38,1,40,2],[38,4,40,4],[59,3,61,3],[44,1,46,2],[44,4,46,4],[53,1,55,2],[50,1,52,2],[50,4,52,4],[10,1,10,21],[9,8,9,21],[8,8,8,21],[3,8,3,21],[6,8,6,21],[5,8,5,21],[3,1,3,7],[56,4,58,4],[29,3,31,3],[35,1,37,2],[35,4,37,4],[50,3,52,3],[53,3,55,3],[12,21,13,21],[13,1,13,2],[13,5,13,8],[13,9,13,12],[12,3,13,3],[12,9,12,12],[14,1,16,2],[12,5,12,8],[17,1,19,2],[17,4,19,4],[17,5,17,8],[12,13,12,16],[12,17,12,20],[13,13,13,16],[13,17,13,20],[14,13,14,16],[14,17,14,20],[16,13,16,16],[16,17,16,20],[17,13,17,16],[17,17,17,20],[19,13,19,16],[19,17,19,20],[20,13,20,16],[20,17,20,20],[22,13,22,16],[22,17,22,20],[23,13,23,16],[23,17,23,20],[25,13,25,16],[25,17,25,20],[26,13,26,16],[26,17,26,20],[28,13,28,16],[28,17,28,20],[29,13,29,16],[29,17,29,20],[31,13,31,16],[31,17,31,20],[32,13,32,16],[32,17,32,20],[34,13,34,16],[34,17,34,20],[35,13,35,16],[35,17,35,20],[37,13,37,16],[37,17,37,20],[38,13,38,16],[38,17,38,20],[40,13,40,16],[40,17,40,20],[41,13,41,16],[41,17,41,20],[43,13,43,16],[43,17,43,20],[44,13,44,16],[44,17,44,20],[46,13,46,16],[46,17,46,20],[47,13,47,16],[47,17,47,20],[49,13,49,16],[49,17,49,20],[50,13,50,16],[50,17,50,20],[52,13,52,16],[52,17,52,20],[53,13,53,16],[53,17,53,20],[55,13,55,16],[55,17,55,20],[56,13,56,16],[56,17,56,20],[58,13,58,16],[58,17,58,20],[59,13,59,16],[59,17,59,20],[61,13,61,16],[61,17,61,20],[62,13,62,16],[62,17,62,20],[64,13,64,16],[64,17,64,20],[65,13,65,16],[65,17,65,20],[67,13,67,16],[67,17,67,20],[68,13,68,16],[68,17,68,20],[70,13,70,16],[70,17,70,20],[71,13,71,16],[71,17,71,20],[73,13,73,16],[73,17,73,20],[74,13,74,16],[74,17,74,20],[76,13,76,16],[76,17,76,20],[77,13,77,16],[77,17,77,20],[79,13,79,16],[79,17,79,20],[80,13,80,16],[80,17,80,20],[82,13,82,16],[82,17,82,20],[83,13,83,16],[83,17,83,20],[86,13,86,16],[86,17,86,20],[94,13,94,16],[94,17,94,20],[95,13,95,16],[95,17,95,20],[88,13,88,16],[88,17,88,20],[89,13,89,16],[89,17,89,20],[91,13,91,16],[91,17,91,20],[92,13,92,16],[92,17,92,20],[93,13,93,16],[93,17,93,20]]}
[]
[]
[null,"UNIDADE ESCOLAR",null,null,null,null,null,null,"PRAZO"]
[null,{"$f":"Orçamento!$O$4","v":"COLÉGIO ESTADUAL CARLOS DRUMOND DE ANDRADE"},null,null,null,null,null,null,"120 DIAS CORRIDOS"]
[]
[null,"OBRA",null,null,null,null,null,null,"DATA"]
[null,{"$f":"Orçamento!$O$7","v":"REFORMA"},null,null,null,null,null,null,{"$f":"Orçamento!$S$7","v":"2020-09-02"}]
[]
[null,"LOCAL",null,null,null,null,null,null,"ÁREA TOTAL CONSTRUÍDA (M²)"]
["FILTRO",{"$f":"Orçamento!$V$7","v":"NOVO GAMA"},null,null,null,null,null,null,{"$f":"Orçamento!$S$13","v":2668.12}]
[]
[null,"CRONOGRAMA - FÍSICO FINANCEIRO"]
["↓","CUSTO TOTAL:",{"$f":"D93","v":0},"VALOR","Dias:",30,null,null,null,60,null,null,null,90,null,null,null,120,null,null,null,"TOTAL"]
[null,"DESCRIÇÃO DOS SERVIÇOS",null,null,"%","1ª PARCELA",null,null,null,"2ª PARCELA",null,null,null,"3ª PARCELA",null,null,null,"4ª PARCELA"]
[{"$f":"IF(D15>0,\"F\",\"\")","v":""},"SERVIÇOS PRELIMINARES",null,{"$f":"Orçamento!V603","v":0},{"$f":"Orçamento!X603","v":0},{"$f":"ROUND(F17*$D$15,2)","v":0},null,null,null,{"$f":"ROUND(J17*$D$15,2)","v":0},null,null,null,{"$f":"ROUND(N17*$D$15,2)","v":0},null,null,null,{"$f":"ROUND(R17*$D$15,2)","v":0},null,null,null,{"$f":"SUM(F15:U15)","v":0},{"$f":"IF(V15=D15,\"OK\",\"ERRO\")","v":"OK"}]
[{"$f":"IF(A15=\"F\",A15,\"\")","v":""}]
[{"$f":"IF(A16=\"F\",A16,\"\")","v":""},null,null,null,null,0.245,null,null,null,{"$f":"F17","v":0.245},null,null,null,0.23,null,null,null,{"$f":"1-SUM(F17:Q17)","v":0.28000000000000003},null,null,null,{"$f":"IFERROR(E15/100,\"\")","v":0},{"$f":"IF(SUM(F17:U17)=100%,\"OK\",\"ERRO\")","v":"OK"}]
[{"$f":"IF(D18>0,\"F\",\"\")","v":""},"TRANSPORTES",null,{"$f":"Orçamento!V604","v":0},{"$f":"Orçamento!X604","v":0},{"$f":"ROUND(F20*$D$18,2)","v":0},null,null,null,{"$f":"ROUND(J20*$D$18,2)","v":0},null,null,null,{"$f":"ROUND(N20*$D$18,2)","v":0},null,null,null,{"$f":"ROUND(R20*$D$18,2)","v":0},null,null,null,{"$f":"SUM(F18:U18)","v":0},{"$f":"IF(V18=D18,\"OK\",\"ERRO\")","v":"OK"}]
[{"$f":"IF(A18=\"F\",A18,\"\")","v":""}]
[{"$f":"IF(A19=\"F\",A19,\"\")","v":""},null,null,null,null,0.25,null,null,null,{"$f":"F20","v":0.25},null,null,null,{"$f":"J20","v":0.25},null,null,null,{"$f":"1-SUM(F20:Q20)","v":0.25},null,null,null,{"$f":"IFERROR(E18/100,\"\")","v":0},{"$f":"IF(SUM(F20:U20)=100%,\"OK\",\"ERRO\")","v":"OK"}]
[{"$f":"IF(D21>0,\"F\",\"\")","v":""},"SERVIÇO EM TERRA",null,{"$f":"Orçamento!V605","v":0},{"$f":"Orçamento!X605","v":0},{"$f":"ROUND(F23*$D$21,2)","v":0},null,null,null,{"$f":"ROUND(J23*$D$21,2)","v":0},null,null,null,{"$f":"ROUND(N23*$D$21,2)","v":0},null,null,null,{"$f":"ROUND(R23*$D$21,2)","v":0},null,null,null,{"$f":"SUM(F21:U21)","v":0},{"$f":"IF(V21=D21,\"OK\",\"ERRO\")","v":"OK"}]
[{"$f":"IF(A21=\"F\",A21,\"\")","v":""}]
[{"$f":"IF(A22=\"F\",A22,\"\")","v":""},null,null,null,null,0.31,null,null,null,0.3,null,null,null,{"$f":"1-SUM(F23:M23)","v":0.39},null,null,null,0,null,null,null,{"$f":"IFERROR(E21/100,\"\")","v":0},{"$f":"IF(SUM(F23:U23)=100%,\"OK\",\"ERRO\")","v":"OK"}]
[{"$f":"IF(D24>0,\"F\",\"\")","v":""},"FUNDAÇÕES E SONDAGENS",null,{"$f":"Orçamento!V606","v":0},{"$f":"Orçamento!X606","v":0},{"$f":"ROUND(F26*$D$24,2)","v":0},null,null,null,{"$f":"ROUND(J26*$D$24,2)","v":0},null,null,null,{"$f":"ROUND(N26*$D$24,2)","v":0},null,null,null,{"$f":"ROUND(R26*$D$24,2)","v":0},null,null,null,{"$f":"SUM(F24:U24)","v":0},{"$f":"IF(V24=D24,\"OK\",\"ERRO\")","v":"OK"}]
[{"$f":"IF(A24=\"F\",A24,\"\")","v":""}]
[{"$f":"IF(A25=\"F\",A25,\"\")","v":""},null,null,null,null,0.35,null,null,null,{"$f":"F26","v":0.35},null,null,null,{"$f":"1-SUM(F26:M26)","v":0.30000000000000004},null,null,null,null,null,null,null,{"$f":"IFERROR(E24/100,\"\")","v":0},{"$f":"IF(SUM(F26:U26)=100%,\"OK\",\"ERRO\")","v":"OK"}]
[{"$f":"IF(D27>0,\"F\",\"\")","v":""},"ESTRUTURA",null,{"$f":"Orçamento!V607","v":0},{"$f":"Orçamento!X607","v":0},{"$f":"ROUND(F29*$D$27,2)","v":0},null,null,null,{"$f":"ROUND(J29*$D$27,2)","v":0},null,null,null,{"$f":"ROUND(N29*$D$27,2)","v":0},null,null,null,{"$f":"ROUND(R29*$D$27,2)","v":0},null,null,null,{"$f":"SUM(F27:U27)","v":0},{"$f":"IF(V27=D27,\"OK\",\"ERRO\")","v":"OK"}]
[{"$f":"IF(A27=\"F\",A27,\"\")","v":""}]
[{"$f":"IF(A28=\"F\",A28,\"\")","v":""},null,null,null,null,0.36,null,null,null,0.35,null,null,null,0.1,null,null,null,{"$f":"1-SUM(F29:Q29)","v":0.19000000000000006},null,null,null,{"$f":"IFERROR(E27/100,\"\")","v":0},{"$f":"IF(SUM(F29:U29)=100%,\"OK\",\"ERRO\")","v":"OK"}]
[{"$f":"IF(D30>0,\"F\",\"\")","v":""},"INST.ELET/TELEFÔNICA/CABEAMENTO ESTRUTURADO",null,{"$f":"Orçamento!V608","v":0},{"$f":"Orçamento!X608","v":0},{"$f":"ROUND(F32*$D$30,2)","v":0},null,null,null,{"$f":"ROUND(J32*$D$30,2)","v":0},null,null,null,{"$f":"ROUND(N32*$D$30,2)","v":0},null,null,null,{"$f":"ROUND(R32*$D$30,2)","v":0},null,null,null,{"$f":"SUM(F30:U30)","v":0},{"$f":"IF(V30=D30,\"OK\",\"ERRO\")","v":"OK"}]
[{"$f":"IF(A30=\"F\",A30,\"\")","v":""}]
[{"$f":"IF(A31=\"F\",A31,\"\")","v":""},null,null,null,null,0.2,null,null,null,0.35,null,null,null,0.3,null,null,null,{"$f":"1-SUM(F32:Q32)","v":0.14999999999999991},null,null,null,{"$f":"IFERROR(E30/100,\"\")","v":0},{"$f":"IF(SUM(F32:U32)=100%,\"OK\",\"ERRO\")","v":"OK"}]
[{"$f":"IF(D33>0,\"F\",\"\")","v":""},"INSTALAÇÕES HIDROSSANITÁRIAS",null,{"$f":"Orçamento!V609","v":0},{"$f":"Orçamento!X609","v":0},{"$f":"ROUND(F35*$D$33,2)","v":0},null,null,null,{"$f":"ROUND(J35*$D$33,2)","v":0},null,null,null,{"$f":"ROUND(N35*$D$33,2)","v":0},null,null,null,{"$f":"ROUND(R35*$D$33,2)","v":0},null,null,null,{"$f":"SUM(F33:U33)","v":0},{"$f":"IF(V33=D33,\"OK\",\"ERRO\")","v":"OK"}]
[{"$f":"IF(A33=\"F\",A33,\"\")","v":""}]
[{"$f":"IF(A34=\"F\",A34,\"\")","v":""},null,null,null,null,0.23,null,null,null,{"$f":"F35","v":0.23},null,null,null,{"$f":"J35","v":0.23},null,null,null,{"$f":"1-SUM(F35:Q35)","v":0.30999999999999994},null,null,null,{"$f":"IFERROR(E33/100,\"\")","v":0},{"$f":"IF(SUM(F35:U35)=100%,\"OK\",\"ERRO\")","v":"OK"}]
[{"$f":"IF(D36>0,\"F\",\"\")","v":""},"INSTALAÇÕES ESPECIAIS",null,{"$f":"Orçamento!V610","v":0},{"$f":"Orçamento!X610","v":0},{"$f":"ROUND(F38*$D$36,2)","v":0},null,null,null,{"$f":"ROUND(J38*$D$36,2)","v":0},null,null,null,{"$f":"ROUND(N38*$D$36,2)","v":0},null,null,null,{"$f":"ROUND(R38*$D$36,2)","v":0},null,null,null,{"$f":"SUM(F36:U36)","v":0},{"$f":"IF(V36=D36,\"OK\",\"ERRO\")","v":"OK"}]
[{"$f":"IF(A36=\"F\",A36,\"\")","v":""}]
[{"$f":"IF(A37=\"F\",A37,\"\")","v":""},null,null,null,null,0,null,null,null,1,null,null,null,0,null,null,null,0,null,null,null,{"$f":"IFERROR(E36/100,\"\")","v":0},{"$f":"IF(SUM(F38:U38)=100%,\"OK\",\"ERRO\")","v":"OK"}]
[{"$f":"IF(D39>0,\"F\",\"\")","v":""},"ALVENARIA E DIVISÓRIAS",null,{"$f":"Orçamento!V611","v":0},{"$f":"Orçamento!X611","v":0},{"$f":"ROUND(F41*$D$39,2)","v":0},null,null,null,{"$f":"ROUND(J41*$D$39,2)","v":0},null,null,null,{"$f":"ROUND(N41*$D$39,2)","v":0},null,null,null,{"$f":"ROUND(R41*$D$39,2)","v":0},null,null,null,{"$f":"SUM(F39:U39)","v":0},{"$f":"IF(V39=D39,\"OK\",\"ERRO\")","v":"OK"}]
[{"$f":"IF(A39=\"F\",A39,\"\")","v":""}]
[{"$f":"IF(A40=\"F\",A40,\"\")","v":""},null,null,null,null,0.21,null,null,null,{"$f":"F41","v":0.21},null,null,null,0.24,null,null,null,{"$f":"1-SUM(F41:Q41)","v":0.34000000000000008},null,null,null,{"$f":"IFERROR(E39/100,\"\")","v":0},{"$f":"IF(SUM(F41:U41)=100%,\"OK\",\"ERRO\")","v":"OK"}]
[{"$f":"IF(D42>0,\"F\",\"\")","v":""},"ALVENARIA AUTO-PORTANTE",null,{"$f":"Orçamento!V612","v":0},{"$f":"Orçamento!X612","v":0},0,null,null,null,0,null,null,null,0,null,null,null,0,null,null,null,{"$f":"SUM(F42:M42)","v":0}]
[{"$f":"IF(A42=\"F\",A42,\"\")","v":""}]
[{"$f":"IF(A43=\"F\",A43,\"\")","v":""},null,null,null,null,1,null,null,null,{"$f":"1-F44","v":0},null,null,null,1,null,null,null,1,null,null,null,{"$f":"IFERROR(E42/100,\"\")","v":0}]
[{"$f":"IF(D45>0,\"F\",\"\")","v":""},"IMPERMEABILIZAÇÃO",null,{"$f":"Orçamento!V613","v":0},{"$f":"Orçamento!X613","v":0},{"$f":"ROUND(F47*$D$45,2)","v":0},null,null,null,{"$f":"ROUND(J47*$D$45,2)","v":0},null,null,null,{"$f":"ROUND(N47*$D$45,2)","v":0},null,null,null,{"$f":"ROUND(R47*$D$45,2)","v":0},null,null,null,{"$f":"SUM(F45:U45)","v":0},{"$f":"IF(V45=D45,\"OK\",\"ERRO\")","v":"OK"}]
[{"$f":"IF(A45=\"F\",A45,\"\")","v":""}]
[{"$f":"IF(A46=\"F\",A46,\"\")","v":""},null,null,null,null,0.25,null,null,null,{"$f":"F47","v":0.25},null,null,null,{"$f":"1-SUM(F47:M47)","v":0.5},null,null,null,0,null,null,null,{"$f":"IFERROR(E45/100,\"\")","v":0},{"$f":"IF(SUM(F47:U47)=100%,\"OK\",\"ERRO\")","v":"OK"}]
[{"$f":"IF(D48>0,\"F\",\"\")","v":""},"ISOLAMENTO TÉRMICO E ACÚSTICO",null,{"$f":"Orçamento!V614","v":0},{"$f":"Orçamento!X614","v":0},{"$f":"ROUND(F50*$D$48,2)","v":0},null,null,null,{"$f":"ROUND(J50*$D$48,2)","v":0},null,null,null,{"$f":"ROUND(N50*$D$48,2)","v":0},null,null,null,{"$f":"ROUND(R50*$D$48,2)","v":0},null,null,null,{"$f":"SUM(F48:M48)","v":0}]
[{"$f":"IF(A48=\"F\",A48,\"\")","v":""}]
[{"$f":"IF(A49=\"F\",A49,\"\")","v":""},null,null,null,null,0.5,null,null,null,{"$f":"1-F50","v":0.5},null,null,null,0.35,null,null,null,0.35,null,null,null,{"$f":"IFERROR(E48/100,\"\")","v":0}]
[{"$f":"IF(D51>0,\"F\",\"\")","v":""},"ESTRUTURA DE MADEIRA",null,{"$f":"Orçamento!V615","v":0},{"$f":"Orçamento!X615","v":0},{"$f":"ROUND(F53*$D$51,2)","v":0},null,null,null,{"$f":"ROUND(J53*$D$51,2)","v":0},null,null,null,{"$f":"ROUND(N53*$D$51,2)","v":0},null,null,null,{"$f":"ROUND(R53*$D$51,2)","v":0},null,null,null,{"$f":"SUM(F51:U51)","v":0}]
[{"$f":"IF(A51=\"F\",A51,\"\")","v":""}]
[{"$f":"IF(A52=\"F\",A52,\"\")","v":""},null,null,null,null,0.24,null,null,null,{"$f":"F53","v":0.24},null,null,null,{"$f":"1-SUM(F53:M53)","v":0.52},null,null,null,0,null,null,null,{"$f":"IFERROR(E51/100,\"\")","v":0}]
[{"$f":"IF(D54>0,\"F\",\"\")","v":""},"ESTRUTURA METÁLICA",null,{"$f":"Orçamento!V616","v":0},{"$f":"Orçamento!X616","v":0},{"$f":"ROUND(F56*$D$54,2)","v":0},null,null,null,{"$f":"ROUND(J56*$D$54,2)","v":0},null,null,null,{"$f":"ROUND(N56*$D$54,2)","v":0},null,null,null,{"$f":"ROUND(R56*$D$54,2)","v":0},null,null,null,{"$f":"SUM(F54:U54)","v":0},{"$f":"IF(V54=D54,\"OK\",\"ERRO\")","v":"OK"}]
[{"$f":"IF(A54=\"F\",A54,\"\")","v":""}]
[{"$f":"IF(A55=\"F\",A55,\"\")","v":""},null,null,null,null,0.36,null,null,null,{"$f":"F56","v":0.36},null,null,null,{"$f":"1-SUM(F56:M56)","v":0.28000000000000003},null,null,null,0,null,null,null,{"$f":"IFERROR(E54/100,\"\")","v":0},{"$f":"IF(SUM(F56:U56)=100%,\"OK\",\"ERRO\")","v":"OK"}]
[{"$f":"IF(D57>0,\"F\",\"\")","v":""},"COBERTURAS",null,{"$f":"Orçamento!V617","v":0},{"$f":"Orçamento!X617","v":0},{"$f":"ROUND(F59*$D$57,2)","v":0},null,null,null,{"$f":"ROUND(J59*$D$57,2)","v":0},null,null,null,{"$f":"ROUND(N59*$D$57,2)","v":0},null,null,null,{"$f":"ROUND(R59*$D$57,2)","v":0},null,null,null,{"$f":"SUM(F57:U57)","v":0},{"$f":"IF(V57=D57,\"OK\",\"ERRO\")","v":"OK"}]
[{"$f":"IF(A57=\"F\",A57,\"\")","v":""}]
[{"$f":"IF(A58=\"F\",A58,\"\")","v":""},null,null,null,null,0,null,null,null,0.49,null,null,null,{"$f":"1-J59","v":0.51},null,null,null,0,null,null,null,{"$f":"IFERROR(E57/100,\"\")","v":0},{"$f":"IF(SUM(F59:U59)=100%,\"OK\",\"ERRO\")","v":"OK"}]
[{"$f":"IF(D60>0,\"F\",\"\")","v":""},"ESQUADRIAS DE MADEIRA",null,{"$f":"Orçamento!V618","v":0},{"$f":"Orçamento!X618","v":0},{"$f":"ROUND(F62*$D$60,2)","v":0},null,null,null,{"$f":"ROUND(J62*$D$60,2)","v":0},null,null,null,{"$f":"ROUND(N62*$D$60,2)","v":0},null,null,null,{"$f":"ROUND(R62*$D$60,2)","v":0},null,null,null,{"$f":"SUM(F60:M60)","v":0}]
[{"$f":"IF(A60=\"F\",A60,\"\")","v":""}]
[{"$f":"IF(A61=\"F\",A61,\"\")","v":""},null,null,null,null,0.54,null,null,null,{"$f":"1-F62","v":0.45999999999999996},null,null,null,0.32,null,null,null,0.32,null,null,null,{"$f":"IFERROR(E60/100,\"\")","v":0}]
[{"$f":"IF(D63>0,\"F\",\"\")","v":""},"ESQUADRIAS METÁLICAS",null,{"$f":"Orçamento!V619","v":0},{"$f":"Orçamento!X619","v":0},{"$f":"ROUND(F65*$D$63,2)","v":0},null,null,null,{"$f":"ROUND(J65*$D$63,2)","v":0},null,null,null,{"$f":"ROUND(N65*$D$63,2)","v":0},null,null,null,{"$f":"ROUND(R65*$D$63,2)","v":0},null,null,null,{"$f":"SUM(F63:U63)","v":0},{"$f":"IF(V63=D63,\"OK\",\"ERRO\")","v":"OK"}]
[{"$f":"IF(A63=\"F\",A63,\"\")","v":""}]
[{"$f":"IF(A64=\"F\",A64,\"\")","v":""},null,null,null,null,0,null,null,null,0.33809999999999996,null,null,null,0.24,null,null,null,{"$f":"1-SUM(F65:Q65)","v":0.42190000000000005},null,null,null,{"$f":"IFERROR(E63/100,\"\")","v":0},{"$f":"IF(SUM(F65:U65)=100%,\"OK\",\"ERRO\")","v":"OK"}]
[{"$f":"IF(D66>0,\"F\",\"\")","v":""},"VIDROS",null,{"$f":"Orçamento!V620","v":0},{"$f":"Orçamento!X620","v":0},{"$f":"ROUND(F68*$D$66,2)","v":0},null,null,null,{"$f":"ROUND(J68*$D$66,2)","v":0},null,null,null,{"$f":"ROUND(N68*$D$66,2)","v":0},null,null,null,{"$f":"ROUND(R68*$D$66,2)","v":0},null,null,null,{"$f":"SUM(F66:U66)","v":0},{"$f":"IF(V66=D66,\"OK\",\"ERRO\")","v":"OK"}]
[{"$f":"IF(A66=\"F\",A66,\"\")","v":""}]
[{"$f":"IF(A67=\"F\",A67,\"\")","v":""},null,null,null,null,0,null,null,null,0,null,null,null,0,null,null,null,1,null,null,null,{"$f":"IFERROR(E66/100,\"\")","v":0},{"$f":"IF(SUM(F68:U68)=100%,\"OK\",\"ERRO\")","v":"OK"}]
[{"$f":"IF(D69>0,\"F\",\"\")","v":""},"REVESTIMENTO DE PAREDE",null,{"$f":"Orçamento!V621","v":0},{"$f":"Orçamento!X621","v":0},{"$f":"ROUND(F71*$D$69,2)","v":0},null,null,null,{"$f":"ROUND(J71*$D$69,2)","v":0},null,null,null,{"$f":"ROUND(N71*$D$69,2)","v":0},null,null,null,{"$f":"ROUND(R71*$D$69,2)","v":0},null,null,null,{"$f":"SUM(F69:U69)","v":0},{"$f":"IF(V69=D69,\"OK\",\"ERRO\")","v":"OK"}]
[{"$f":"IF(A69=\"F\",A69,\"\")","v":""}]
[{"$f":"IF(A70=\"F\",A70,\"\")","v":""},null,null,null,null,0.15,null,null,null,0.2,null,null,null,0.3,null,null,null,{"$f":"1-SUM(F71:Q71)","v":0.35000000000000009},null,null,null,{"$f":"IFERROR(E69/100,\"\")","v":0},{"$f":"IF(SUM(F71:U71)=100%,\"OK\",\"ERRO\")","v":"OK"}]
[{"$f":"IF(D72>0,\"F\",\"\")","v":""},"FORROS",null,{"$f":"Orçamento!V622","v":0},{"$f":"Orçamento!X622","v":0},{"$f":"ROUND(F74*$D$72,2)","v":0},null,null,null,{"$f":"ROUND(J74*$D$72,2)","v":0},null,null,null,{"$f":"ROUND(N74*$D$72,2)","v":0},null,null,null,{"$f":"ROUND(R74*$D$72,2)","v":0},null,null,null,{"$f":"SUM(F72:U72)","v":0}]
[{"$f":"IF(A72=\"F\",A72,\"\")","v":""}]
[{"$f":"IF(A73=\"F\",A73,\"\")","v":""},null,null,null,null,0.15,null,null,null,0.3,null,null,null,0.25,null,null,null,{"$f":"1-SUM(F74:Q74)","v":0.30000000000000004},null,null,null,{"$f":"IFERROR(E72/100,\"\")","v":0}]
[{"$f":"IF(D75>0,\"F\",\"\")","v":""},"REVESTIMENTO DE PISO",null,{"$f":"Orçamento!V623","v":0},{"$f":"Orçamento!X623","v":0},{"$f":"ROUND(F77*$D$75,2)","v":0},null,null,null,{"$f":"ROUND(J77*$D$75,2)","v":0},null,null,null,{"$f":"ROUND(N77*$D$75,2)","v":0},null,null,null,{"$f":"ROUND(R77*$D$75,2)","v":0},null,null,null,{"$f":"SUM(F75:U75)","v":0},{"$f":"IF(V75=D75,\"OK\",\"ERRO\")","v":"OK"}]
[{"$f":"IF(A75=\"F\",A75,\"\")","v":""}]
[{"$f":"IF(A76=\"F\",A76,\"\")","v":""},null,null,null,null,0.23230000000000001,null,null,null,0.25,null,null,null,0.15,null,null,null,{"$f":"1-SUM(F77:Q77)","v":0.36770000000000003},null,null,null,{"$f":"IFERROR(E75/100,\"\")","v":0},{"$f":"IF(SUM(F77:U77)=100%,\"OK\",\"ERRO\")","v":"OK"}]
[{"$f":"IF(D78>0,\"F\",\"\")","v":""},"FERRAGENS",null,{"$f":"Orçamento!V624","v":0},{"$f":"Orçamento!X624","v":0},{"$f":"ROUND(F80*$D$78,2)","v":0},null,null,null,{"$f":"ROUND(J80*$D$78,2)","v":0},null,null,null,{"$f":"ROUND(N80*$D$78,2)","v":0},null,null,null,{"$f":"ROUND(R80*$D$78,2)","v":0},null,null,null,{"$f":"SUM(F78:U78)","v":0},{"$f":"IF(V78=D78,\"OK\",\"ERRO\")","v":"OK"}]
[{"$f":"IF(A78=\"F\",A78,\"\")","v":""}]
[{"$f":"IF(A79=\"F\",A79,\"\")","v":""},null,null,null,null,0,null,null,null,0,null,null,null,0,null,null,null,1,null,null,null,{"$f":"IFERROR(E78/100,\"\")","v":0},{"$f":"IF(SUM(F80:U80)=100%,\"OK\",\"ERRO\")","v":"OK"}]
[{"$f":"IF(D81>0,\"F\",\"\")","v":""},"MARCENARIA",null,{"$f":"Orçamento!V625","v":0},{"$f":"Orçamento!X625","v":0},{"$f":"ROUND(F83*$D$81,2)","v":0},null,null,null,{"$f":"ROUND(J83*$D$81,2)","v":0},null,null,null,{"$f":"ROUND(N83*$D$81,2)","v":0},null,null,null,{"$f":"ROUND(R83*$D$81,2)","v":0},null,null,null,{"$f":"SUM(F81:M81)","v":0}]
[{"$f":"IF(A81=\"F\",A81,\"\")","v":""}]
[{"$f":"IF(A82=\"F\",A82,\"\")","v":""},null,null,null,null,0.4,null,null,null,{"$f":"1-F83","v":0.6},null,null,null,{"$f":"1-J83","v":0.4},null,null,null,{"$f":"1-N83","v":0.6},null,null,null,{"$f":"IFERROR(E81/100,\"\")","v":0}]
[{"$f":"IF(D84>0,\"F\",\"\")","v":""},"ADMINISTRAÇÃO - MENSALISTAS",null,{"$f":"Orçamento!V626","v":0},{"$f":"Orçamento!X626","v":0},{"$f":"ROUND(F86*$D$84,2)","v":0},null,null,null,{"$f":"ROUND(J86*$D$84,2)","v":0},null,null,null,{"$f":"ROUND(N86*$D$84,2)","v":0},null,null,null,{"$f":"ROUND(R86*$D$84,2)","v":0},null,null,null,{"$f":"SUM(F84:U84)","v":0},{"$f":"IF(V84=D84,\"OK\",\"ERRO\")","v":"OK"}]
[{"$f":"IF(A84=\"F\",A84,\"\")","v":""}]
[{"$f":"IF(A85=\"F\",A85,\"\")","v":""},null,null,null,null,0.49,null,null,null,{"$f":"1-F86","v":0.51},null,null,null,null,null,null,null,null,null,null,null,{"$f":"IFERROR(E84/100,\"\")","v":0},{"$f":"IF(SUM(F86:U86)=100%,\"OK\",\"ERRO\")","v":"OK"}]
[{"$f":"IF(D87>0,\"F\",\"\")","v":""},"PINTURA",null,{"$f":"Orçamento!V627","v":0},{"$f":"Orçamento!X627","v":0},{"$f":"ROUND(F89*$D$87,2)","v":0},null,null,null,{"$f":"ROUND(J89*$D$87,2)","v":0},null,null,null,{"$f":"ROUND(N89*$D$87,2)","v":0},null,null,null,{"$f":"ROUND(R89*$D$87,2)","v":0},null,null,null,{"$f":"SUM(F87:U87)","v":0},{"$f":"IF(V87=D87,\"OK\",\"ERRO\")","v":"OK"}]
[{"$f":"IF(A87=\"F\",A87,\"\")","v":""}]
[{"$f":"IF(A88=\"F\",A88,\"\")","v":""},null,null,null,null,0,null,null,null,0,null,null,null,0.4,null,null,null,0.6,null,null,null,{"$f":"IFERROR(E87/100,\"\")","v":0},{"$f":"IF(SUM(F89:U89)=100%,\"OK\",\"ERRO\")","v":"OK"}]
[{"$f":"IF(D90>0,\"F\",\"\")","v":""},"DIVERSOS",null,{"$f":"Orçamento!V628","v":0},{"$f":"Orçamento!X628","v":0},{"$f":"ROUND(F92*$D$90,2)","v":0},null,null,null,{"$f":"ROUND(J92*$D$90,2)","v":0},null,null,null,{"$f":"ROUND(N92*$D$90,2)","v":0},null,null,null,{"$f":"ROUND(R92*$D$90,2)","v":0},null,null,null,{"$f":"SUM(F90:U90)","v":0},{"$f":"IF(V90=D90,\"OK\",\"ERRO\")","v":"OK"}]
[{"$f":"IF(A90=\"F\",A90,\"\")","v":""}]
[{"$f":"IF(A91=\"F\",A91,\"\")","v":""},null,null,null,null,0.24180000000000007,null,null,null,{"$f":"F92","v":0.24180000000000007},null,null,null,{"$f":"J92","v":0.24180000000000007},null,null,null,{"$f":"1-SUM(F91:Q92)","v":0.27459999999999973},null,null,null,{"$f":"IFERROR(E90/100,\"\")","v":0},{"$f":"IF(SUM(F92:U92)=100%,\"OK\",\"ERRO\")","v":"OK"}]
["F","CUSTO DO ORÇAMENTO",null,{"$f":"SUM(D15:D92)","v":0},{"$f":"SUM(E15:E92)","v":0},{"$f":"F15+F18+F21+F24+F27+F30+F33+F36+F39+F42+F45+F48+F51+F54+F57+F60+F63+F66+F69+F72+F75+F78+F81+F84+F87+F90","v":0},null,null,null,{"$f":"J15+J18+J21+J24+J27+J30+J33+J36+J39+J42+J45+J48+J51+J54+J57+J60+J63+J66+J69+J72+J75+J78+J81+J84+J87+J90","v":0},null,null,null,{"$f":"N15+N18+N21+N24+N27+N30+N33+N36+N39+N42+N45+N48+N51+N54+N57+N60+N63+N66+N69+N72+N75+N78+N81+N84+N87+N90","v":0},null,null,null,{"$f":"R15+R18+R21+R24+R27+R30+R33+R36+R39+R42+R45+R48+R51+R54+R57+R60+R63+R66+R69+R72+R75+R78+R81+R84+R87+R90","v":0},null,null,null,{"$f":"V15+V18+V21+V24+V27+V30+V33+V36+V39+V42+V45+V48+V51+V54+V57+V60+V63+V66+V69+V72+V75+V78+V81+V84+V87+V90","v":0}]
["F","PERCENTUAIS:",null,null,null,{"$f":"IFERROR(F93/$D$93,\"\")","v":""},null,null,null,{"$f":"IFERROR(J93/$D$93,\"\")","v":""},null,null,null,{"$f":"IFERROR(N93/$D$93,\"\")","v":""},null,null,null,{"$f":"IFERROR(R93/$D$93,\"\")","v":""},null,null,null,{"$f":"SUM(F94:U94)","v":0}]
["F","TOTAIS ACUMULADOS:",null,null,null,{"$f":"F93","v":0},null,null,null,{"$f":"J93+F95","v":0},null,null,null,{"$f":"N93+J95","v":0},null,null,null,{"$f":"R93+N95","v":0}]
["F","PERCENTUAIS  ACUMULADOS:",null,null,null,{"$f":"F94","v":""},null,null,null,{"$f":"F96+J94","v":{"$error":"#VALUE!"}},null,null,null,{"$f":"J96+N94","v":{"$error":"#VALUE!"}},null,null,null,{"$f":"N96+R94","v":{"$error":"#VALUE!"}}]
["F"]
["F","OBSERVAÇÕES:"]
["F","Os pagamentos somente poderão ser efetuados mediante medição e atesto pelos técnicos da Secretaria da Educação. "]

{"sheet":"Composição BDI","index":4,"n_rows":45,"n_cols":9,"rows_kept":45,"cut":false,"hidden":false,"merged":[[11,0,11,3],[12,0,12,3],[14,0,14,3],[15,0,15,3],[13,0,13,3],[0,0,0,3],[1,0,1,3],[4,0,4,3],[7,0,7,3],[10,0,10,3],[2,0,2,3],[3,0,3,3],[5,0,5,3],[6,0,6,3],[8,0,8,3],[9,0,9,3],[18,5,18,8],[17,0,17,3],[16,0,16,3],[44,0,44,3],[42,0,42,3],[43,0,43,3],[18,0,18,3],[36,0,36,3],[39,0,39,3],[38,0,38,3],[40,0,40,3],[29,0,29,2],[32,0,32,3],[33,0,33,3],[34,0,34,3],[35,0,35,3]]}
[]
[]
["UNIDADE ESCOLAR"]
[{"$f":"Orçamento!$O$4","v":"COLÉGIO ESTADUAL CARLOS DRUMOND DE ANDRADE"}]
[]
["OBRA"]
[{"$f":"Orçamento!$O$7","v":"REFORMA"}]
[]
["ENDEREÇO"]
[{"$f":"Orçamento!$R$10","v":"AV. SEBASTIÃO VARGAS FILHO QD 08 S/N VALE DO PEDREGA, VALE DO PEDREGAL, CEP:72860-785"}]
[]
["CIDADE"]
[{"$f":"Orçamento!$V$7","v":"NOVO GAMA"}]
[]
["CRE"]
[{"$f":"Orçamento!$O$10","v":"NOVO GAMA"}]
[]
["DETALHAMENTO DA COMPOSIÇÃO DE BDI"]
["COMPOSIÇÃO BDI PARA OBRAS CIVIS",null,null,null,null,"BDI CONSTRUÇÃO E REFORMA"]
["DESCRIÇÃO","COEF.","TAXA % (a.m)","% no preço de venda",null,"Situação","1º Quartil","Médio","3º Quartil"]
["1) COFINS",1,0.03,{"$f":"C21","v":0.03},null,{"$f":"IF(OR(C21<G21,C21>I21),\"FORA DO INTERVALO\",\"OK\")","v":"OK"},0.03,0.03,0.03]
["2) PIS",1,6.4999999999999997E-3,{"$f":"C22","v":6.4999999999999997E-3},null,{"$f":"IF(OR(C22<G22,C22>I22),\"FORA DO INTERVALO\",\"OK\")","v":"OK"},6.4999999999999997E-3,6.4999999999999997E-3,6.4999999999999997E-3]
["3) ISSQN",1,0.03,{"$f":"C23*B23","v":0.03},null,"OK",0.02,3.5000000000000003E-2,0.05]
["4) CPRB",1,0,{"$f":"C24","v":0},null,"FORA DO INTERVALO",4.4999999999999998E-2,4.4999999999999998E-2,4.4999999999999998E-2]
["5) Administração Central",1,0.04,0.04,null,"OK",0.03,0.04,5.5E-2]
["6) Despesas Financeiras",1,5.5999999999999999E-3,5.5999999999999999E-3,null,"FORA DO INTERVALO",5.8999999999999999E-3,1.23E-2,1.3899999999999999E-2]
["7) Seguros + Garantias",1,1.1999999999999999E-3,1.1999999999999999E-3,null,"FORA DO INTERVALO",8.0000000000000002E-3,8.0000000000000002E-3,0.01]
["8) Risco",1,9.7000000000000003E-3,9.7000000000000003E-3,null,"OK",9.7000000000000003E-3,1.2699999999999999E-2,1.2699999999999999E-2]
["9) Lucro",1,7.1999999999999995E-2,7.1999999999999995E-2,null,"OK",6.1600000000000002E-2,7.3999999999999996E-2,8.9599999999999999E-2]
["BDI - FINAL",null,null,{"$f":"(((1+D25+D27+D28)*(1+D26)*(1+D29))/(1-(D21+D22+D23+D24))-1)","v":0.21357639301553344},null,{"$f":"IF(OR(D30<G30,D30>I30),\"FORA DO INTERVALO\",\"OK\")","v":"OK"},0.2034,0.22120000000000001,0.25]
[]
["Notas:"]
["(1) e (2) Alíquota definida por lei."]
["(3) Alíquota e base de cálculo definidas pela legislação municipal."]
["(4) Alíquota definida pelas leis 12.546/11, 12844/13 e 13.161/15 (CPRB – contribuição previdenciária sobre a receita bruta)."]
["(5) Valores definidos a partir dos limites no Acórdão nº 2.622/2013 - TCU – Plenário. Valores entre o 1º e 3º quartis."]
["(6) Valor calculado pela expressão matemática do acórdão 2.369/2011 – TCU – Plenário e disponibilizado pela AGETOP em dezembro de 2018. (Foi utilizado para o cálculo a média da Taxa SELIC no período de 11/2017 a 10/2018)"]
[]
["(7) Valores definidos pela AGETOP a partir dos limites no Acórdão nº 2.622/2013 - TCU – Plenário. Valores médios. \n\nObservação da AGETOP: (Seguros contra erros de execução, incêndio e explosão, danos da natureza (vendaval, destelhamento, alagamento, inundação, desmoronamento, geadas etc.), emprego de material defeituoso ou inadequado, roubo e/ou furto qualificado, quebra de equipamentos, desmoronamento de estrutura, nas modalidades de Obras Civis em Construção (OCC); Instalação e Montagem (IM); e Obras Civis em Construção e Instalação e Montagem (OCC/IM). Bem como coberturas adicionais para ampliação dessas coberturas básicas, como: cobertura de responsabilidade civil geral, cobertura de responsabilidade civil cruzada, cobertura de despesas extraordinárias, cobertura de tumultos, cobertura de desentulho do local, cobertura de riscos do fabricante, dentre outras, incluindo o seguro de vida em grupo regido pela convenção coletiva dos trabalhadores na indústria da construção civil). A partir de 24/02/2015 por intermédio da Portaria 449/2015 a Presidência da AGETOP, na pessoa do Senhor Jayme Eduardo Rincon, determinou a exclusão dos valores referentes aos Seguros de Risco de Engenharia e Responsabilidade Civil do Profissional na composição do cálculo do B.D.I.."]
["(8) Valores definidos a partir dos limites no Acórdão nº 2.622/2013 - TCU – Plenário. Valores entre 1º e 3° quartis."]
["(9) Valores definidos a partir dos limites definidos no Acórdão nº 2.622/2013 - TCU – Plenário. Valores adotados e praticados no mercado ( “ ex ante ” ) ou aqueles entre os 1º e 3º quartis."]
[]
["(*) A fórmula para estipulação da taxa de BDI estimado adotado é a mesma que foi aplicada para a obtenção das tabelas contidas no Acórdão n. 2.622/2013 – TCUPlenário"]
[]
["Obs.: Para obras com valores superiores a R$ 20.000.000,00 sugere-se recalcular o BDI, dimensionando as taxas de administração central e lucro para patamares inferiores ao estipulado acima."]

{"sheet":"Relatório CENTRAL","index":5,"n_rows":40,"n_cols":5,"rows_kept":40,"cut":false,"hidden":false,"merged":[[10,1,10,4],[11,1,11,4],[39,1,39,2],[9,0,11,0],[0,1,0,4],[6,3,6,4],[9,3,9,4],[1,1,1,4],[2,1,2,2],[2,3,2,4],[3,1,3,2],[3,3,3,4],[4,1,4,4],[5,1,5,2],[5,3,5,4],[6,1,6,2],[7,1,7,4],[8,1,8,2],[8,3,8,4],[9,1,9,2]]}
[]
[]
[null,"UNIDADE ESCOLAR",null,"CIDADE"]
[null,{"$f":"Orçamento!$O$4","v":"COLÉGIO ESTADUAL CARLOS DRUMOND DE ANDRADE"},null,{"$f":"Orçamento!$V$7","v":"NOVO GAMA"}]
[]
[null,"OBRA",null,"CRE"]
[null,{"$f":"Orçamento!$O$7","v":"REFORMA"},null,{"$f":"Orçamento!$O$10","v":"NOVO GAMA"}]
[]
[null,"ENDEREÇO",null,"DATA"]
["FILTRO",{"$f":"Orçamento!$R$10","v":"AV. SEBASTIÃO VARGAS FILHO QD 08 S/N VALE DO PEDREGA, VALE DO PEDREGAL, CEP:72860-785"},null,{"$f":"Orçamento!$S$7","v":"2020-09-02"}]
[]
[null,"RELATÓRIO CENTRAL"]
["↓","CÓDIGO","ETAPA","PREÇO  (R$) C/ BDI","PARTIC  ( % )"]
[{"$f":"IF(D14>0,\"F\",\"\")","v":""},{"$f":"Orçamento!O603","v":"a."},{"$f":"Orçamento!P603","v":"SERVIÇOS PRELIMINARES"},{"$f":"Orçamento!V603","v":0},{"$f":"Orçamento!X603","v":0}]
[{"$f":"IF(D15>0,\"F\",\"\")","v":""},{"$f":"Orçamento!O604","v":"b."},{"$f":"Orçamento!P604","v":"TRANSPORTES"},{"$f":"Orçamento!V604","v":0},{"$f":"Orçamento!X604","v":0}]
["",{"$f":"Orçamento!O605","v":"c."},{"$f":"Orçamento!P605","v":"SERVIÇO EM TERRA"},{"$f":"Orçamento!V605","v":0},{"$f":"Orçamento!X605","v":0}]
["",{"$f":"Orçamento!O606","v":"d."},{"$f":"Orçamento!P606","v":"FUNDAÇÕES E SONDAGENS"},{"$f":"Orçamento!V606","v":0},{"$f":"Orçamento!X606","v":0}]
["",{"$f":"Orçamento!O607","v":"e."},{"$f":"Orçamento!P607","v":"ESTRUTURA"},{"$f":"Orçamento!V607","v":0},{"$f":"Orçamento!X607","v":0}]
["",{"$f":"Orçamento!O608","v":"f."},{"$f":"Orçamento!P608","v":"INSTALAÇÕES ELÉTRICAS"},{"$f":"Orçamento!V608","v":0},{"$f":"Orçamento!X608","v":0}]
["",{"$f":"Orçamento!O609","v":"g."},{"$f":"Orçamento!P609","v":"INSTALAÇÕES HIDROSSANITÁRIAS"},{"$f":"Orçamento!V609","v":0},{"$f":"Orçamento!X609","v":0}]
["",{"$f":"Orçamento!O610","v":"h"},{"$f":"Orçamento!P610","v":"INSTALAÇÕES ESPECIAIS"},{"$f":"Orçamento!V610","v":0},{"$f":"Orçamento!X610","v":0}]
["",{"$f":"Orçamento!O611","v":"i."},{"$f":"Orçamento!P611","v":"ALVENARIAS E DIVISÓRIAS"},{"$f":"Orçamento!V611","v":0},{"$f":"Orçamento!X611","v":0}]
["",{"$f":"Orçamento!O612","v":"j."},{"$f":"Orçamento!P612","v":"ALVENARIA AUTO-PORTANTE"},{"$f":"Orçamento!V612","v":0},{"$f":"Orçamento!X612","v":0}]
["",{"$f":"Orçamento!O613","v":"k."},{"$f":"Orçamento!P613","v":"IMPERMEABILIZAÇÃO"},{"$f":"Orçamento!V613","v":0},{"$f":"Orçamento!X613","v":0}]
["",{"$f":"Orçamento!O614","v":"l."},{"$f":"Orçamento!P614","v":"ISOLAMENTO TÉRMICO E ACÚSTICO"},{"$f":"Orçamento!V614","v":0},{"$f":"Orçamento!X614","v":0}]
["",{"$f":"Orçamento!O615","v":"m."},{"$f":"Orçamento!P615","v":"ESTRUTURA DE MADEIRA"},{"$f":"Orçamento!V615","v":0},{"$f":"Orçamento!X615","v":0}]
["",{"$f":"Orçamento!O616","v":"n."},{"$f":"Orçamento!P616","v":"ESTRUTURAS METÁLICAS"},{"$f":"Orçamento!V616","v":0},{"$f":"Orçamento!X616","v":0}]
["",{"$f":"Orçamento!O617","v":"o."},{"$f":"Orçamento!P617","v":"COBERTURAS"},{"$f":"Orçamento!V617","v":0},{"$f":"Orçamento!X617","v":0}]
["",{"$f":"Orçamento!O618","v":"p."},{"$f":"Orçamento!P618","v":"ESQUADRIAS DE MADEIRA"},{"$f":"Orçamento!V618","v":0},{"$f":"Orçamento!X618","v":0}]
["",{"$f":"Orçamento!O619","v":"q."},{"$f":"Orçamento!P619","v":"ESQUADRIAS METÁLICAS"},{"$f":"Orçamento!V619","v":0},{"$f":"Orçamento!X619","v":0}]
["",{"$f":"Orçamento!O620","v":"r."},{"$f":"Orçamento!P620","v":"VIDROS"},{"$f":"Orçamento!V620","v":0},{"$f":"Orçamento!X620","v":0}]
["",{"$f":"Orçamento!O621","v":"s."},{"$f":"Orçamento!P621","v":"REVESTIMENTO DE PAREDE"},{"$f":"Orçamento!V621","v":0},{"$f":"Orçamento!X621","v":0}]
["",{"$f":"Orçamento!O622","v":"t."},{"$f":"Orçamento!P622","v":"FORROS"},{"$f":"Orçamento!V622","v":0},{"$f":"Orçamento!X622","v":0}]
["",{"$f":"Orçamento!O623","v":"u."},{"$f":"Orçamento!P623","v":"REVESTIMENTO DE PISO"},{"$f":"Orçamento!V623","v":0},{"$f":"Orçamento!X623","v":0}]
["",{"$f":"Orçamento!O624","v":"v."},{"$f":"Orçamento!P624","v":"FERRAGENS"},{"$f":"Orçamento!V624","v":0},{"$f":"Orçamento!X624","v":0}]
["",{"$f":"Orçamento!O625","v":"w."},{"$f":"Orçamento!P625","v":"MARCENARIA"},{"$f":"Orçamento!V625","v":0},{"$f":"Orçamento!X625","v":0}]
["",{"$f":"Orçamento!O626","v":"x."},{"$f":"Orçamento!P626","v":"ADMINISTRAÇÃO"},{"$f":"Orçamento!V626","v":0},{"$f":"Orçamento!X626","v":0}]
["",{"$f":"Orçamento!O627","v":"y."},{"$f":"Orçamento!P627","v":"PINTURA"},{"$f":"Orçamento!V627","v":0},{"$f":"Orçamento!X627","v":0}]
["",{"$f":"Orçamento!O628","v":"z."},{"$f":"Orçamento!P628","v":"DIVERSOS"},{"$f":"Orçamento!V628","v":0},{"$f":"Orçamento!X628","v":0}]
["F","TOTAL GERAL DO ORÇAMENTO (R$) C/BDI",null,{"$f":"SUM(D14:D39)","v":0},{"$f":"SUM(E14:E39)","v":0}]

{"sheet":"Parc Maior Relev","index":6,"n_rows":18,"n_cols":7,"rows_kept":18,"cut":false,"hidden":false,"merged":[[0,1,0,6],[11,1,11,6],[1,1,1,6],[2,1,2,3],[2,4,2,6],[3,1,3,3],[3,4,3,6],[4,1,4,6],[5,1,5,3],[5,4,5,6],[9,1,9,3],[9,4,9,6],[10,1,10,6],[6,1,6,3],[6,4,6,6],[7,1,7,6],[10,0,12,0],[8,1,8,3],[8,4,8,6],[18,3,18,7],[16,1,16,6]]}
[]
[]
[null,"UNIDADE ESCOLAR",null,null,"CÓDIGO INEP"]
[null,{"$f":"Orçamento!$O$4","v":"COLÉGIO ESTADUAL CARLOS DRUMOND DE ANDRADE"},null,null,{"$f":"Orçamento!$V$4","v":52092127}]
[]
[null,"OBRA",null,null,"CIDADE"]
[null,{"$f":"Orçamento!$O$7","v":"REFORMA"},null,null,{"$f":"Orçamento!$V$7","v":"NOVO GAMA"}]
[]
[null,"CRE",null,null,"ÁREA TOTAL CONSTRUÍDA (M²)"]
[null,{"$f":"Orçamento!$O$10","v":"NOVO GAMA"},null,null,{"$f":"Orçamento!$S$13","v":2668.12}]
["FILTRO"]
[null,"PARCELA DE MAIOR RELEVÂNCIA"]
[null,"CÓDIGO","SERVIÇO","DESCRIÇÃO","UNID","QUANT","PARC. MAIOR RELEV (50%)"]
[null,{"$f":"Somatório!B21","v":"e."},"ESTRUTURA","CONCRETO","M3",{"$f":"0.18+0.31+0.91+0.31+0.31+0.43+0.18+3.91+14.06+6.28","v":26.880000000000003},{"$f":"F14*0.5","v":13.440000000000001}]
[null,{"$f":"Somatório!B25","v":"i."},"ALVENARIAS E DIVISÓRIAS","ALVENARIA DE TIJOLO","M2",{"$f":"19.55+5.88+24.97+9.91+44.92","v":105.23},{"$f":"F15*0.5","v":52.615000000000002}]
["F"]
["F","(*) Para os fins do inciso I dp § 1º do Art. 30 da Lei Federal 8.666/93, são consideradas parcelas de maior relevância técnica as execuções apresentadas"]
["F"]

{"sheet":"Composições","index":7,"n_rows":513,"n_cols":10,"rows_kept":513,"cut":false,"hidden":false,"merged":[[15,0,15,9],[13,0,13,2],[13,3,13,6],[1,0,1,9],[3,7,3,9],[4,7,4,9],[6,7,6,9],[7,7,7,9],[6,0,6,6],[10,8,10,9],[13,8,13,9],[14,0,14,9],[8,0,8,9],[5,0,5,9],[2,0,2,9],[0,0,0,8],[10,0,10,2],[10,3,10,6],[11,0,11,9],[12,0,12,2],[12,3,12,6],[12,7,12,8],[7,0,7,6],[9,0,9,2],[9,3,9,6],[9,7,9,8],[3,0,3,6],[4,0,4,6],[16,5,17,5],[16,6,16,7],[16,8,16,9],[22,1,22,7],[26,1,26,7],[16,0,17,0],[16,1,17,1],[16,2,17,2],[16,3,17,3],[16,4,17,4],[28,5,29,5],[28,6,28,7],[28,8,28,9],[34,1,34,7],[38,1,38,7],[28,0,29,0],[28,1,29,1],[28,2,29,2],[28,3,29,3],[28,4,29,4],[40,5,41,5],[40,6,40,7],[40,8,40,9],[46,1,46,7],[50,1,50,7],[40,0,41,0],[40,1,41,1],[40,2,41,2],[40,3,41,3],[40,4,41,4],[52,5,53,5],[52,6,52,7],[52,8,52,9],[58,1,58,7],[62,1,62,7],[52,0,53,0],[52,1,53,1],[52,2,53,2],[52,3,53,3],[52,4,53,4],[64,5,65,5],[64,6,64,7],[64,8,64,9],[70,1,70,7],[74,1,74,7],[64,0,65,0],[64,1,65,1],[64,2,65,2],[64,3,65,3],[64,4,65,4],[76,5,77,5],[76,6,76,7],[76,8,76,9],[82,1,82,7],[86,1,86,7],[76,0,77,0],[76,1,77,1],[76,2,77,2],[76,3,77,3],[76,4,77,4],[88,5,89,5],[88,6,88,7],[88,8,88,9],[94,1,94,7],[98,1,98,7],[88,0,89,0],[88,1,89,1],[88,2,89,2],[88,3,89,3],[88,4,89,4],[100,5,101,5],[100,6,100,7],[100,8,100,9],[106,1,106,7],[110,1,110,7],[100,0,101,0],[100,1,101,1],[100,2,101,2],[100,3,101,3],[100,4,101,4],[112,5,113,5],[112,6,112,7],[112,8,112,9],[117,1,117,7],[120,1,120,7],[112,0,113,0],[112,1,113,1],[112,2,113,2],[112,3,113,3],[112,4,113,4],[122,5,123,5],[122,6,122,7],[122,8,122,9],[127,1,127,7],[130,1,130,7],[122,0,123,0],[122,1,123,1],[122,2,123,2],[122,3,123,3],[122,4,123,4],[132,5,133,5],[132,6,132,7],[132,8,132,9],[138,1,138,7],[142,1,142,7],[132,0,133,0],[132,1,133,1],[132,2,133,2],[132,3,133,3],[132,4,133,4],[144,5,145,5],[144,6,144,7],[144,8,144,9],[150,1,150,7],[154,1,154,7],[144,0,145,0],[144,1,145,1],[144,2,145,2],[144,3,145,3],[144,4,145,4],[156,5,157,5],[156,6,156,7],[156,8,156,9],[162,1,162,7],[166,1,166,7],[156,0,157,0],[156,1,157,1],[156,2,157,2],[156,3,157,3],[156,4,157,4],[168,5,169,5],[168,6,168,7],[168,8,168,9],[174,1,174,7],[178,1,178,7],[168,0,169,0],[168,1,169,1],[168,2,169,2],[168,3,169,3],[168,4,169,4],[180,5,181,5],[180,6,180,7],[180,8,180,9],[186,1,186,7],[190,1,190,7],[180,0,181,0],[180,1,181,1],[180,2,181,2],[180,3,181,3],[180,4,181,4],[192,5,193,5],[192,6,192,7],[192,8,192,9],[198,1,198,7],[202,1,202,7],[192,0,193,0],[192,1,193,1],[192,2,193,2],[192,3,193,3],[192,4,193,4],[204,5,205,5],[204,6,204,7],[204,8,204,9],[210,1,210,7],[214,1,214,7],[204,0,205,0],[204,1,205,1],[204,2,205,2],[204,3,205,3],[204,4,205,4],[216,5,217,5],[216,6,216,7],[216,8,216,9],[220,1,220,7],[224,1,224,7],[216,0,217,0],[216,1,217,1],[216,2,217,2],[216,3,217,3],[216,4,217,4],[226,5,227,5],[226,6,226,7],[226,8,226,9],[232,1,232,7],[239,1,239,7],[226,0,227,0],[226,1,227,1],[226,2,227,2],[226,3,227,3],[226,4,227,4],[241,5,242,5],[241,6,241,7],[241,8,241,9],[247,1,247,7],[251,1,251,7],[241,0,242,0],[241,1,242,1],[241,2,242,2],[241,3,242,3],[241,4,242,4],[253,5,254,5],[253,6,253,7],[253,8,253,9],[259,1,259,7],[263,1,263,7],[253,0,254,0],[253,1,254,1],[253,2,254,2],[253,3,254,3],[253,4,254,4],[265,5,266,5],[265,6,265,7],[265,8,265,9],[271,1,271,7],[275,1,275,7],[265,0,266,0],[265,1,266,1],[265,2,266,2],[265,3,266,3],[265,4,266,4],[277,5,278,5],[277,6,277,7],[277,8,277,9],[283,1,283,7],[287,1,287,7],[277,0,278,0],[277,1,278,1],[277,2,278,2],[277,3,278,3],[277,4,278,4],[289,5,290,5],[289,6,289,7],[289,8,289,9],[295,1,295,7],[299,1,299,7],[289,0,290,0],[289,1,290,1],[289,2,290,2],[289,3,290,3],[289,4,290,4],[301,5,302,5],[301,6,301,7],[301,8,301,9],[307,1,307,7],[311,1,311,7],[301,0,302,0],[301,1,302,1],[301,2,302,2],[301,3,302,3],[301,4,302,4],[313,5,314,5],[313,6,313,7],[313,8,313,9],[319,1,319,7],[323,1,323,7],[313,0,314,0],[313,1,314,1],[313,2,314,2],[313,3,314,3],[313,4,314,4],[325,5,326,5],[325,6,325,7],[325,8,325,9],[331,1,331,7],[335,1,335,7],[325,0,326,0],[325,1,326,1],[325,2,326,2],[325,3,326,3],[325,4,326,4],[337,5,338,5],[337,6,337,7],[337,8,337,9],[343,1,343,7],[347,1,347,7],[337,0,338,0],[337,1,338,1],[337,2,338,2],[337,3,338,3],[337,4,338,4],[349,5,350,5],[349,6,349,7],[349,8,349,9],[355,1,355,7],[359,1,359,7],[349,0,350,0],[349,1,350,1],[349,2,350,2],[349,3,350,3],[349,4,350,4],[361,5,362,5],[361,6,361,7],[361,8,361,9],[367,1,367,7],[371,1,371,7],[361,0,362,0],[361,1,362,1],[361,2,362,2],[361,3,362,3],[361,4,362,4],[373,5,374,5],[373,6,373,7],[373,8,373,9],[379,1,379,7],[383,1,383,7],[373,0,374,0],[373,1,374,1],[373,2,374,2],[373,3,374,3],[373,4,374,4],[385,5,386,5],[385,6,385,7],[385,8,385,9],[391,1,391,7],[395,1,395,7],[385,0,386,0],[385,1,386,1],[385,2,386,2],[385,3,386,3],[385,4,386,4],[397,5,398,5],[397,6,397,7],[397,8,397,9],[403,1,403,7],[407,1,407,7],[397,0,398,0],[397,1,398,1],[397,2,398,2],[397,3,398,3],[397,4,398,4],[409,5,410,5],[409,6,409,7],[409,8,409,9],[415,1,415,7],[419,1,419,7],[409,0,410,0],[409,1,410,1],[409,2,410,2],[409,3,410,3],[409,4,410,4],[421,5,422,5],[421,6,421,7],[421,8,421,9],[427,1,427,7],[442,1,442,7],[421,0,422,0],[421,1,422,1],[421,2,422,2],[421,3,422,3],[421,4,422,4],[444,5,445,5],[444,6,444,7],[444,8,444,9],[449,1,449,7],[462,1,462,7],[444,0,445,0],[444,1,445,1],[444,2,445,2],[444,3,445,3],[444,4,445,4],[464,5,465,5],[464,6,464,7],[464,8,464,9],[470,1,470,7],[474,1,474,7],[464,0,465,0],[464,1,465,1],[464,2,465,2],[464,3,465,3],[464,4,465,4],[476,5,477,5],[476,6,476,7],[476,8,476,9],[482,1,482,7],[486,1,486,7],[476,0,477,0],[476,1,477,1],[476,2,477,2],[476,3,477,3],[476,4,477,4],[488,5,489,5],[488,6,488,7],[488,8,488,9],[497,1,497,7],[512,1,512,7],[488,0,489,0],[488,1,489,1],[488,2,489,2],[488,3,489,3],[488,4,489,4]]}
[]
[]
[]
["UNIDADE ESCOLAR",null,null,null,null,null,null,"CÓDIGO INEP"]
[{"$f":"Orçamento!$O$4","v":"COLÉGIO ESTADUAL CARLOS DRUMOND DE ANDRADE"},null,null,null,null,null,null,{"$f":"Orçamento!$V$4","v":52092127}]
[]
["OBRA",null,null,null,null,null,null,"CIDADE"]
[{"$f":"Orçamento!$O$7","v":"REFORMA"},null,null,null,null,null,null,{"$f":"Orçamento!$V$7","v":"NOVO GAMA"}]
[]
["CRE",null,null,"ENDEREÇO",null,null,null,"REFERÊNCIA AGETOP"]
[{"$f":"Orçamento!$O$10","v":"NOVO GAMA"},null,null,{"$f":"Orçamento!$R$10","v":"AV. SEBASTIÃO VARGAS FILHO QD 08 S/N VALE DO PEDREGA, VALE DO PEDREGAL, CEP:72860-785"},null,null,null,{"$f":"Orçamento!$V$10","v":"ABR/19"},{"$f":"Orçamento!$W$10","v":"ONERADA"}]
[]
["DATA",null,null,"ÁREA TOTAL CONSTRUÍDA (M²)",null,null,null,"REFERÊNCIA SINAPI"]
[{"$f":"Orçamento!$S$7","v":"2020-09-02"},null,null,{"$f":"Orçamento!$S$13","v":2668.12},null,null,null,{"$f":"Orçamento!$V$13","v":"SET/19"},{"$f":"Orçamento!$W$13","v":"ONERADA"}]
[]
["COMPOSIÇÕES DE CUSTOS UNITÁRIOS - SEE-GO"]
[46,"FONTE","CÓDIGO","DESCRIÇÃO","UNIDADE","COEFIC.","CUSTO UNITÁRIO",null,"CUSTO  TOTAL (A) + (B) + (C) + (D) + (E)"]
[null,null,null,null,null,null,"DESONERADO","NÃO DESONER.","DESONERADO","NÃO DESONER."]
[null,"COMPOSIÇÃO","COMP 046_SEE","CAPUZ PARA PROTEÇÃO DOS PARA RAIOS","UN ",null,null,null,16.53,16.650000000000002]
[null,"AGETOP_I",8,"AJUDANTE","h     ",3.3300000000000003E-2,8.1999999999999993,9.51,0.27,0.32]
[null,"AGETOP_I",12,"ELETRICISTA","h     ",3.3300000000000003E-2,13.4,15.53,0.45,0.52]
[null,null,null,"","",null,0,0,0,0]
[null,"MÃO DE OBRA (B) - TOTAL",null,null,null,null,null,null,0.72,0.84000000000000008]
[null,"COTAÇÃO","COT 010_SEE","CAPUZ PARA PROTEÇÃO DOS PARA RAIOS","UN ",1,15.81,15.81,15.81,15.81]
[null,null,null,"","",null,0,0,0,0]
[null,null,null,"","",null,0,0,0,0]
[null,"MATERIAL (C) - TOTAL",null,null,null,null,null,null,15.81,15.81]
[]
[47,"FONTE","CÓDIGO","DESCRIÇÃO","UNIDADE","COEFIC.","CUSTO UNITÁRIO",null,"CUSTO  TOTAL (A) + (B) + (C) + (D) + (E)"]
[null,null,null,null,null,null,"DESONERADO","NÃO DESONER.","DESONERADO","NÃO DESONER."]
[null,"COMPOSIÇÃO","COMP 047_SEE","CAPUZ DE PROTEÇÃO PARA BUCHA DE TRANSFORMADOR","UN ",null,null,null,16.53,16.650000000000002]
[null,"AGETOP_I",8,"AJUDANTE","h     ",3.3300000000000003E-2,8.1999999999999993,9.51,0.27,0.32]
[null,"AGETOP_I",12,"ELETRICISTA","h     ",3.3300000000000003E-2,13.4,15.53,0.45,0.52]
[null,null,null,"","",null,0,0,0,0]
[null,"MÃO DE OBRA (B) - TOTAL",null,null,null,null,null,null,0.72,0.84000000000000008]
[null,"COTAÇÃO","COT 011_SEE","CAPUZ DE PROTEÇÃO PARA BUCHA DE TRANSFORMADOR","UN ",1,15.81,15.81,15.81,15.81]
[null,null,null,"","",null,0,0,0,0]
[null,null,null,"","",null,0,0,0,0]
[null,"MATERIAL (C) - TOTAL",null,null,null,null,null,null,15.81,15.81]
[]
[48,"FONTE","CÓDIGO","DESCRIÇÃO","UNIDADE","COEFIC.","CUSTO UNITÁRIO",null,"CUSTO  TOTAL (A) + (B) + (C) + (D) + (E)"]
[null,null,null,null,null,null,"DESONERADO","NÃO DESONER.","DESONERADO","NÃO DESONER."]
[null,"COMPOSIÇÃO","COMP 048_SEE","HASTE ROSQUEADA \"TIRANTE\" 3/8\"","M",null,null,null,14.02,15.39]
[null,"AGETOP_I",8,"AJUDANTE","h     ",0.4,8.1999999999999993,9.51,3.28,3.8]
[null,"AGETOP_I",12,"ELETRICISTA","h     ",0.4,13.4,15.53,5.36,6.21]
[null,null,null,"","",null,0,0,0,0]
[null,"MÃO DE OBRA (B) - TOTAL",null,null,null,null,null,null,8.64,10.01]
[null,"COTAÇÃO","COT 012_SEE","HASTE ROSQUEADA \"TIRANTE\" 3/8\"","M",1,5.3833333333333329,5.3833333333333329,5.38,5.38]
[null,null,null,"","",null,0,0,0,0]
[null,null,null,"","",null,0,0,0,0]
[null,"MATERIAL (C) - TOTAL",null,null,null,null,null,null,5.38,5.38]
[]
[49,"FONTE","CÓDIGO","DESCRIÇÃO","UNIDADE","COEFIC.","CUSTO UNITÁRIO",null,"CUSTO  TOTAL (A) + (B) + (C) + (D) + (E)"]
[null,null,null,null,null,null,"DESONERADO","NÃO DESONER.","DESONERADO","NÃO DESONER."]
[null,"COMPOSIÇÃO","COMP 049_SEE","PORCA SEXTAVADA 3/8\"","UN ",null,null,null,0.2,0.22]
[null,"AGETOP_I",8,"AJUDANTE","h     ",8.9999999999999993E-3,8.1999999999999993,9.51,7.0000000000000007E-2,0.09]
[null,null,null,"","",null,0,0,0,0]
[null,null,null,"","",null,0,0,0,0]
[null,"MÃO DE OBRA (B) - TOTAL",null,null,null,null,null,null,7.0000000000000007E-2,0.09]
[null,"COTAÇÃO","COT 013_SEE","PORCA SEXTAVADA 3/8\"","UN ",1,0.13,0.13,0.13,0.13]
[null,null,null,"","",null,0,0,0,0]
[null,null,null,"","",null,0,0,0,0]
[null,"MATERIAL (C) - TOTAL",null,null,null,null,null,null,0.13,0.13]
[]
[40,"FONTE","CÓDIGO","DESCRIÇÃO","UNIDADE","COEFIC.","CUSTO UNITÁRIO",null,"CUSTO  TOTAL (A) + (B) + (C) + (D) + (E)"]
[null,null,null,null,null,null,"DESONERADO","NÃO DESONER.","DESONERADO","NÃO DESONER."]
[null,"COMPOSIÇÃO","COMP 040_SEE","CONJUNTO MOTOR-BOMBA ELÉTRICA TRIFÁSICO 380/220 V PARA VZ= 24,33 M³/H, HM= 46,24 M POTÊNCIA= 7,5 CV","UN ",null,null,null,3965.4700000000003,3992.9900000000002]
[null,"AGETOP_I",8,"AJUDANTE","h     ",8,8.1999999999999993,9.51,65.599999999999994,76.08]
[null,"AGETOP_I",11,"ENCANADOR","h     ",8,13.4,15.53,107.2,124.24]
[null,null,null,"","",null,0,0,0,0]
[null,"MÃO DE OBRA (B) - TOTAL",null,null,null,null,null,null,172.8,200.32]
[null,"COTAÇÃO","COT 008_SEE","CONJUNTO MOTOR-BOMBA ELÉTRICA TRIFÁSICO 380/220 V PARA VZ= 24,33 M³/H, HM= 46,24 M POTÊNCIA= 7,5 CV","UN ",1,3792.6666666666665,3792.6666666666665,3792.67,3792.67]
[null,null,null,"","",null,0,0,0,0]
[null,null,null,"","",null,0,0,0,0]
[null,"MATERIAL (C) - TOTAL",null,null,null,null,null,null,3792.67,3792.67]
[]
[17,"FONTE","CÓDIGO","DESCRIÇÃO","UNIDADE","COEFIC.","CUSTO UNITÁRIO",null,"CUSTO  TOTAL (A) + (B) + (C) + (D) + (E)"]
[null,null,null,null,null,null,"DESONERADO","NÃO DESONER.","DESONERADO","NÃO DESONER."]
[null,"COMPOSIÇÃO","COMP 017_SEE","REDUCAO GIRATÓRIA TIPO STORZ LATAO P/ INST. PREDIAL COMBATE A INCENDIO ENGATE RAPIDO 2.1/2\" X 1.1/2\"","UN ",null,"-","-",99.14,99.69]
[null,"AGETOP_I",8,"AJUDANTE","h     ",0.16,8.1999999999999993,9.51,1.31,1.52]
[null,"AGETOP_I",11,"ENCANADOR","h     ",0.16,13.4,15.53,2.14,2.48]
[null,null,null,"","",null,0,0,0,0]
[null,"MÃO DE OBRA (B) - TOTAL",null,null,null,null,null,null,3.45,4]
[null,"SINAPI_I",20972,"REDUCAO FIXA TIPO STORZ, ENGATE RAPIDO 2.1/2\" X 1.1/2\", EM LATAO, PARA INSTALACAO PREDIAL COMBATE A INCENDIO PREDIAL","UN    ",1,95.69,95.69,95.69,95.69]
[null,null,null,"","",null,0,0,0,0]
[null,null,null,"","",null,0,0,0,0]
[null,"MATERIAL (C) - TOTAL",null,null,null,null,null,null,95.69,95.69]
[]
[18,"FONTE","CÓDIGO","DESCRIÇÃO","UNIDADE","COEFIC.","CUSTO UNITÁRIO",null,"CUSTO  TOTAL (A) + (B) + (C) + (D) + (E)"]
[null,null,null,null,null,null,"DESONERADO","NÃO DESONER.","DESONERADO","NÃO DESONER."]
[null,"COMPOSIÇÃO","COMP 018_SEE","CHAVE DUPLA P/ CONEXÕES TIPO STORZ EM LATÃO ENGATE RÁPIDO 1 1/2\" X 2 1/2\"","UN ",null,"-","-",14.76,15.08]
[null,"AGETOP_I",11,"ENCANADOR","h     ",0.15,13.4,15.53,2.0099999999999998,2.33]
[null,null,null,"","",null,0,0,0,0]
[null,null,null,"","",null,0,0,0,0]
[null,"MÃO DE OBRA (B) - TOTAL",null,null,null,null,null,null,2.0099999999999998,2.33]
[null,"SINAPI_I",20971,"CHAVE DUPLA PARA CONEXOES TIPO STORZ, ENGATE RAPIDO 1 1/2\" X 2 1/2\", EM LATAO, PARA INSTALACAO PREDIAL COMBATE A INCENDIO","UN    ",1,12.75,12.75,12.75,12.75]
[null,null,null,"","",null,0,0,0,0]
[null,null,null,"","",null,0,0,0,0]
[null,"MATERIAL (C) - TOTAL",null,null,null,null,null,null,12.75,12.75]
[]
[87,"FONTE","CÓDIGO","DESCRIÇÃO","UNIDADE","COEFIC.","CUSTO UNITÁRIO",null,"CUSTO  TOTAL (A) + (B) + (C) + (D) + (E)"]
[null,null,null,null,null,null,"DESONERADO","NÃO DESONER.","DESONERADO","NÃO DESONER."]
[null,"COMPOSIÇÃO","COMP 087_SEE","REGISTRO DE GAVETA COM HASTE ASCENDENTE DE BRONZE 2 1/2\"","UN ",null,null,null,257.29999999999995,261.26]
[null,"AGETOP_I",8,"AJUDANTE","h     ",1.1499999999999999,8.1999999999999993,9.51,9.43,10.94]
[null,"AGETOP_I",11,"ENCANADOR","h     ",1.1499999999999999,13.4,15.53,15.41,17.86]
[null,null,null,"","",null,0,0,0,0]
[null,"MÃO DE OBRA (B) - TOTAL",null,null,null,null,null,null,24.84,28.799999999999997]
[null,"AGETOP_I","H689","FITA VEDAROSCA 12 MM","m",2.82,0.28000000000000003,0.28000000000000003,0.79,0.79]
[null,"COTAÇÃO","COT 017_SEE","REGISTRO DE GAVETA COM HASTE ASCENDENTE DE BRONZE 2 1/2\"","UN ",1,231.66666666666666,231.66666666666666,231.67,231.67]
[null,null,null,"","",null,0,0,0,0]
[null,"MATERIAL (C) - TOTAL",null,null,null,null,null,null,232.45999999999998,232.45999999999998]
[]
[30,"FONTE","CÓDIGO","DESCRIÇÃO","UNIDADE","COEFIC.","CUSTO UNITÁRIO",null,"CUSTO  TOTAL (A) + (B) + (C) + (D) + (E)"]
[null,null,null,null,null,null,"DESONERADO","NÃO DESONER.","DESONERADO","NÃO DESONER."]
[null,"COMPOSIÇÃO","COMP 030_SEE","COTOVELO DE FERRO GALV. 90° X 2 1/2\"","UN ",null,null,null,69.16,72.33]
[null,"AGETOP_I",8,"AJUDANTE","h     ",0.92,8.1999999999999993,9.51,7.54,8.75]
[null,"AGETOP_I",11,"ENCANADOR","h     ",0.92,13.4,15.53,12.33,14.29]
[null,"MÃO DE OBRA (B) - TOTAL",null,null,null,null,null,null,19.87,23.04]
[null,"SINAPI_I",3470,"COTOVELO 90 GRAUS DE FERRO GALVANIZADO, COM ROSCA BSP, DE 2 1/2\"","UN    ",1,48.73,48.73,48.73,48.73]
[null,"AGETOP_I","H689","FITA VEDAROSCA 12 MM","m",2,0.28000000000000003,0.28000000000000003,0.56000000000000005,0.56000000000000005]
[null,"MATERIAL (C) - TOTAL",null,null,null,null,null,null,49.29,49.29]
[]
[77,"FONTE","CÓDIGO","DESCRIÇÃO","UNIDADE","COEFIC.","CUSTO UNITÁRIO",null,"CUSTO  TOTAL (A) + (B) + (C) + (D) + (E)"]
[null,null,null,null,null,null,"DESONERADO","NÃO DESONER.","DESONERADO","NÃO DESONER."]
[null,"COMPOSIÇÃO","COMP 077_SEE","UNIAO FERRO GALV C/ASSENTO CONICO BRONZE 2 1/2\"","UN ",null,null,null,148.30000000000001,149.66999999999999]
[null,"AGETOP_I",8,"AJUDANTE","h     ",0.4,8.1999999999999993,9.51,3.28,3.8]
[null,"AGETOP_I",11,"ENCANADOR","h     ",0.4,13.4,15.53,5.36,6.21]
[null,"MÃO DE OBRA (B) - TOTAL",null,null,null,null,null,null,8.64,10.01]
[null,"AGETOP_I","H689","FITA VEDAROSCA 12 MM","m",2.4,0.28000000000000003,0.28000000000000003,0.67,0.67]
[null,"SINAPI_I",12427,"UNIAO COM ASSENTO CONICO DE BRONZE, DIAMETRO 2 1/2\"","UN    ",1,138.99,138.99,138.99,138.99]
[null,"MATERIAL (C) - TOTAL",null,null,null,null,null,null,139.66,139.66]
[]
[347,"FONTE","CÓDIGO","DESCRIÇÃO","UNIDADE","COEFIC.","CUSTO UNITÁRIO",null,"CUSTO  TOTAL (A) + (B) + (C) + (D) + (E)"]
[null,null,null,null,null,null,"DESONERADO","NÃO DESONER.","DESONERADO","NÃO DESONER."]
[null,"COMPOSIÇÃO","COMP 347_SEE","ADAPTADOR PVC SOLDAVEL, COM FLANGES LIVRES, 75 MM X 2 1/2\", PARA CAIXA D' AGUA","UN ",null,null,null,118.75,119.22]
[null,"AGETOP_I",11,"ENCANADOR","h     ",0.14000000000000001,13.4,15.53,1.88,2.17]
[null,"AGETOP_I",8,"AJUDANTE","h     ",0.14000000000000001,8.1999999999999993,9.51,1.1499999999999999,1.33]
[null,null,null,"","",null,0,0,0,0]
[null,"MÃO DE OBRA (B) - TOTAL",null,null,null,null,null,null,3.03,3.5]
[null,"SINAPI_I",83,"ADAPTADOR PVC SOLDAVEL, COM FLANGES LIVRES, 75 MM X 2  1/2\", PARA CAIXA D' AGUA","UN    ",1,115.19,115.19,115.19,115.19]
[null,"AGETOP_I","H689","FITA VEDAROSCA 12 MM","m",1.88,0.28000000000000003,0.28000000000000003,0.53,0.53]
[null,null,null,"","",null,0,0,0,0]
[null,"MATERIAL (C) - TOTAL",null,null,null,null,null,null,115.72,115.72]
[]
[22,"FONTE","CÓDIGO","DESCRIÇÃO","UNIDADE","COEFIC.","CUSTO UNITÁRIO",null,"CUSTO  TOTAL (A) + (B) + (C) + (D) + (E)"]
[null,null,null,null,null,null,"DESONERADO","NÃO DESONER.","DESONERADO","NÃO DESONER."]
[null,"COMPOSIÇÃO","COMP 022_SEE","TAMPÃO FOFO 40X50CM C/INSCRIÇÃO ","UN ",null,"-","-",199.82999999999998,200.15]
[null,"AGETOP_I",11,"ENCANADOR","h     ",0.15,13.4,15.53,2.0099999999999998,2.33]
[null,null,null,"","",null,0,0,0,0]
[null,null,null,"","",null,0,0,0,0]
[null,"MÃO DE OBRA (B) - TOTAL",null,null,null,null,null,null,2.0099999999999998,2.33]
[null,"SINAPI_I",11293,"TAMPAO FOFO SIMPLES COM BASE, CLASSE A15 CARGA MAX 1,5 T, 400 X 500 MM, COM INSCRICAO INCENDIO","UN    ",1,197.82,197.82,197.82,197.82]
[null,null,null,"","",null,0,0,0,0]
[null,null,null,"","",null,0,0,0,0]
[null,"MATERIAL (C) - TOTAL",null,null,null,null,null,null,197.82,197.82]
[]
[546,"FONTE","CÓDIGO","DESCRIÇÃO","UNID ","COEFIC.","CUSTO UNITÁRIO",null,"CUSTO  TOTAL (A) + (B) + (C) + (D) + (E)"]
[null,null,null,null,null,null,"DESONERADO","NÃO DESONER.","DESONERADO","NÃO DESONER."]
[null,"COMPOSIÇÃO","COMP 546_SEE","BUJÃO DE REBORDO 2.1/2\"","UN ","-","-","-",16.509999999999998,16.760000000000002]
[null,"AGETOP_I",8,"AJUDANTE","h     ",7.0000000000000007E-2,8.1999999999999993,9.51,0.56999999999999995,0.67]
[null,"AGETOP_I",11,"ENCANADOR","h     ",7.0000000000000007E-2,13.4,15.53,0.94,1.0900000000000001]
[null,null,null,"","",null,0,0,0,0]
[null,"MÃO DE OBRA (B) - TOTAL",null,null,null,null,null,null,1.5099999999999998,1.7600000000000002]
[null,"COTAÇÃO","COT 286_SEE","BUJÃO DE REBORDO 2.1/2\"","UN ",1,15,15,15,15]
[null,null,null,"","",null,0,0,0,0]
[null,null,null,"","",null,0,0,0,0]
[null,"MATERIAL (C) - TOTAL",null,null,null,null,null,null,15,15]
[]
[186,"FONTE","CÓDIGO","DESCRIÇÃO","UNIDADE","COEFIC.","CUSTO UNITÁRIO",null,"CUSTO  TOTAL (A) + (B) + (C) + (D) + (E)"]
[null,null,null,null,null,null,"DESONERADO","NÃO DESONER.","DESONERADO","NÃO DESONER."]
[null,"COMPOSIÇÃO","COMP 186_SEE","BOTOEIRA BOMBA DE INCÊNDIO C/ MARTELO CONVENCIONAL/ ANALÓGICA","UN ",null,null,null,85.1,88.539999999999992]
[null,"AGETOP_I",8,"AJUDANTE","h     ",1,8.1999999999999993,9.51,8.1999999999999993,9.51]
[null,"AGETOP_I",12,"ELETRICISTA","h     ",1,13.4,15.53,13.4,15.53]
[null,null,null,"","",null,0,0,0,0]
[null,"MÃO DE OBRA (B) - TOTAL",null,null,null,null,null,null,21.6,25.04]
[null,"COTAÇÃO","COT 088_SEE","BOTOEIRA BOMBA DE INCÊNDIO C/ MARTELO CONVENCIONAL/ ANALÓGICA","UN",1,63.5,63.5,63.5,63.5]
[null,null,null,"","",null,0,0,0,0]
[null,null,null,"","",null,0,0,0,0]
[null,"MATERIAL (C) - TOTAL",null,null,null,null,null,null,63.5,63.5]
[]
[188,"FONTE","CÓDIGO","DESCRIÇÃO","UNIDADE","COEFIC.","CUSTO UNITÁRIO",null,"CUSTO  TOTAL (A) + (B) + (C) + (D) + (E)"]
[null,null,null,null,null,null,"DESONERADO","NÃO DESONER.","DESONERADO","NÃO DESONER."]
[null,"COMPOSIÇÃO","COMP 188_SEE","ACIONADOR MANUAL DE ALARME","UN ",null,null,null,100.61,103.36]
[null,"AGETOP_I",8,"AJUDANTE","h     ",0.8,8.1999999999999993,9.51,6.56,7.61]
[null,"AGETOP_I",12,"ELETRICISTA","h     ",0.8,13.4,15.53,10.72,12.42]
[null,null,null,"","",null,0,0,0,0]
[null,"MÃO DE OBRA (B) - TOTAL",null,null,null,null,null,null,17.28,20.03]
[null,"COTAÇÃO","COT 090_SEE","ACIONADOR MANUAL DE ALARME","UN",1,83.333333333333329,83.333333333333329,83.33,83.33]
[null,null,null,"","",null,0,0,0,0]
[null,null,null,"","",null,0,0,0,0]
[null,"MATERIAL (C) - TOTAL",null,null,null,null,null,null,83.33,83.33]
[]
[190,"FONTE","CÓDIGO","DESCRIÇÃO","UNIDADE","COEFIC.","CUSTO UNITÁRIO",null,"CUSTO  TOTAL (A) + (B) + (C) + (D) + (E)"]
[null,null,null,null,null,null,"DESONERADO","NÃO DESONER.","DESONERADO","NÃO DESONER."]
[null,"COMPOSIÇÃO","COMP 190_SEE","CENTRAL DE DETECÇÃO E ALARME DE 40 SETORES COM BATERIA","UN ",null,null,null,1136.1300000000001,1163.6500000000001]
[null,"AGETOP_I",8,"AJUDANTE","h     ",8,8.1999999999999993,9.51,65.599999999999994,76.08]
[null,"AGETOP_I",12,"ELETRICISTA","h     ",8,13.4,15.53,107.2,124.24]
[null,null,null,"","",null,0,0,0,0]
[null,"MÃO DE OBRA (B) - TOTAL",null,null,null,null,null,null,172.8,200.32]
[null,"COTAÇÃO","COT 092_SEE","CENTRAL DE DETECÇÃO E ALARME DE 40 SETORES COM BATERIA (PREÇO MÉDIO)","UN",1,963.33333333333337,963.33333333333337,963.33,963.33]
[null,null,null,"","",null,0,0,0,0]
[null,null,null,"","",null,0,0,0,0]
[null,"MATERIAL (C) - TOTAL",null,null,null,null,null,null,963.33,963.33]
[]
[24,"FONTE","CÓDIGO","DESCRIÇÃO","UNIDADE","COEFIC.","CUSTO UNITÁRIO",null,"CUSTO  TOTAL (A) + (B) + (C) + (D) + (E)"]
[null,null,null,null,null,null,"DESONERADO","NÃO DESONER.","DESONERADO","NÃO DESONER."]
[null,"COMPOSIÇÃO","COMP 024_SEE","SINALIZADOR FOTOLUMINESCENTE PARA EXTINTOR","UN ",null,"-","-",25.269999999999996,25.389999999999997]
[null,"AGETOP_I",5,"SERVENTE","h     ",0.09,8.1999999999999993,9.51,0.74,0.86]
[null,null,null,"","",null,0,0,0,0]
[null,null,null,"","",null,0,0,0,0]
[null,"MÃO DE OBRA (B) - TOTAL",null,null,null,null,null,null,0.74,0.86]
[null,"AGETOP_I",3070,"BUCHA DE NYLON S-6","un",2,0.04,0.04,0.08,0.08]
[null,"AGETOP_I",3393,"PARAFUSO P/BUCHA S-6","un",2,0.08,0.08,0.16,0.16]
[null,"SINAPI_I",37556,"PLACA DE SINALIZACAO DE SEGURANCA CONTRA INCENDIO, FOTOLUMINESCENTE, QUADRADA, *20 X 20* CM, EM PVC *2* MM ANTI-CHAMAS (SIMBOLOS, CORES E PICTOGRAMAS CONFORME NBR 13434)","UN    ",1,24.29,24.29,24.29,24.29]
[null,"MATERIAL (C) - TOTAL",null,null,null,null,null,null,24.529999999999998,24.529999999999998]
[]
[25,"FONTE","CÓDIGO","DESCRIÇÃO","UNIDADE","COEFIC.","CUSTO UNITÁRIO",null,"CUSTO  TOTAL (A) + (B) + (C) + (D) + (E)"]
[null,null,null,null,null,null,"DESONERADO","NÃO DESONER.","DESONERADO","NÃO DESONER."]
[null,"COMPOSIÇÃO","COMP 025_SEE","SINALIZADOR FOTOLUMINESCENTE DE EMERGÊNCIA","UN ",null,"-","-",25.269999999999996,25.389999999999997]
[null,"AGETOP_I",5,"SERVENTE","h     ",0.09,8.1999999999999993,9.51,0.74,0.86]
[null,"MÃO DE OBRA (B) - TOTAL",null,null,null,null,null,null,0.74,0.86]
[null,"AGETOP_I",3070,"BUCHA DE NYLON S-6","un",2,0.04,0.04,0.08,0.08]
[null,"AGETOP_I",3393,"PARAFUSO P/BUCHA S-6","un",2,0.08,0.08,0.16,0.16]
[null,"SINAPI_I",37556,"PLACA DE SINALIZACAO DE SEGURANCA CONTRA INCENDIO, FOTOLUMINESCENTE, QUADRADA, *20 X 20* CM, EM PVC *2* MM ANTI-CHAMAS (SIMBOLOS, CORES E PICTOGRAMAS CONFORME NBR 13434)","UN    ",1,24.29,24.29,24.29,24.29]
[null,"MATERIAL (C) - TOTAL",null,null,null,null,null,null,24.529999999999998,24.529999999999998]
[]
[277,"FONTE","CÓDIGO","DESCRIÇÃO","UNIDADE","COEFIC.","CUSTO UNITÁRIO",null,"CUSTO  TOTAL (A) + (B) + (C) + (D) + (E)"]
[null,null,null,null,null,null,"DESONERADO","NÃO DESONER.","DESONERADO","NÃO DESONER."]
[null,"COMPOSIÇÃO","COMP 277_SEE","MARCAÇÃO NO PISO - 1X1 M PARA EXTINTOR","M2",null,null,null,29.31,29.389999999999997]
[null,"AGETOP_I",5,"SERVENTE","h     ",3.3300000000000003E-2,8.1999999999999993,9.51,0.27,0.32]
[null,null,null,"","",null,0,0,0,0]
[null,null,null,"","",null,0,0,0,0]
[null,"MÃO DE OBRA (B) - TOTAL",null,null,null,null,null,null,0.27,0.32]
[null,"SINAPI_I",5318,"SOLVENTE DILUENTE A BASE DE AGUARRAS","L     ",0.13,11.16,11.16,1.45,1.45]
[null,"SINAPI",5824,"CAMINHÃO TOCO, PBT 16.000 KG, CARGA ÚTIL MÁX. 10.685 KG, DIST. ENTRE EIXOS 4,8 M, POTÊNCIA 189 CV, INCLUSIVE CARROCERIA FIXA ABERTA DE MADEIRA P/ TRANSPORTE GERAL DE CARGA SECA, DIMEN. APROX. 2,5 X 7,00 X 0,50 M - CHP DIURNO. AF_06/2014","CHP",3.3E-3,139.12,142.33000000000001,0.46,0.47]
[null,"SINAPI_I",7343,"TINTA A BASE DE RESINA ACRILICA, PARA SINALIZACAO HORIZONTAL VIARIA (NBR 11862)","L     ",0.6,12.11,12.11,7.27,7.27]
[null,"SINAPI_I",7348,"TINTA ACRILICA PREMIUM PARA PISO","L     ",0.03,12.41,12.41,0.37,0.37]
[null,"SINAPI_I",25972,"MICROESFERAS DE VIDRO PARA SINALIZACAO HORIZONTAL VIARIA, TIPO I-B (PREMIX) - NBR 16184","KG    ",2.14,8.94,8.94,19.13,19.13]
[null,"SINAPI",95133,"MÁQUINA DEMARCADORA DE FAIXA DE TRÁFEGO À FRIO, AUTOPROPELIDA, POTÊNCIA 38 HP - CHP DIURNO. AF_07/2016","CHP",3.3E-3,110.32,113.9,0.36,0.38]
[null,"MATERIAL (C) - TOTAL",null,null,null,null,null,null,29.04,29.069999999999997]
[]
[235,"FONTE","CÓDIGO","DESCRIÇÃO","UNIDADE","COEFIC.","CUSTO UNITÁRIO",null,"CUSTO  TOTAL (A) + (B) + (C) + (D) + (E)"]
[null,null,null,null,null,null,"DESONERADO","NÃO DESONER.","DESONERADO","NÃO DESONER."]
[null,"COMPOSIÇÃO","COMP 235_SEE","PLACA DE SINALIZAÇÃO EM PVC COD 01 - (300X300) PROIBIDO FUMAR","UN ",null,null,null,25.269999999999996,25.389999999999997]
[null,"AGETOP_I",5,"SERVENTE","h     ",0.09,8.1999999999999993,9.51,0.74,0.86]
[null,null,null,"","",null,0,0,0,0]
[null,null,null,"","",null,0,0,0,0]
[null,"MÃO DE OBRA (B) - TOTAL",null,null,null,null,null,null,0.74,0.86]
[null,"AGETOP_I",3070,"BUCHA DE NYLON S-6","un",2,0.04,0.04,0.08,0.08]
[null,"AGETOP_I",3393,"PARAFUSO P/BUCHA S-6","un",2,0.08,0.08,0.16,0.16]
[null,"SINAPI_I",37556,"PLACA DE SINALIZACAO DE SEGURANCA CONTRA INCENDIO, FOTOLUMINESCENTE, QUADRADA, *20 X 20* CM, EM PVC *2* MM ANTI-CHAMAS (SIMBOLOS, CORES E PICTOGRAMAS CONFORME NBR 13434)","UN    ",1,24.29,24.29,24.29,24.29]
[null,"MATERIAL (C) - TOTAL",null,null,null,null,null,null,24.529999999999998,24.529999999999998]
[]
[236,"FONTE","CÓDIGO","DESCRIÇÃO","UNIDADE","COEFIC.","CUSTO UNITÁRIO",null,"CUSTO  TOTAL (A) + (B) + (C) + (D) + (E)"]
[null,null,null,null,null,null,"DESONERADO","NÃO DESONER.","DESONERADO","NÃO DESONER."]
[null,"COMPOSIÇÃO","COMP 236_SEE","PLACA DE SINALIZAÇÃO EM PVC COD 06 - (300X300) PERIGO INFLAMÁVEL","UN ",null,null,null,25.269999999999996,25.389999999999997]
[null,"AGETOP_I",5,"SERVENTE","h     ",0.09,8.1999999999999993,9.51,0.74,0.86]
[null,null,null,"","",null,0,0,0,0]
[null,null,null,"","",null,0,0,0,0]
[null,"MÃO DE OBRA (B) - TOTAL",null,null,null,null,null,null,0.74,0.86]
[null,"AGETOP_I",3070,"BUCHA DE NYLON S-6","un",2,0.04,0.04,0.08,0.08]
[null,"AGETOP_I",3393,"PARAFUSO P/BUCHA S-6","un",2,0.08,0.08,0.16,0.16]
[null,"SINAPI_I",37556,"PLACA DE SINALIZACAO DE SEGURANCA CONTRA INCENDIO, FOTOLUMINESCENTE, QUADRADA, *20 X 20* CM, EM PVC *2* MM ANTI-CHAMAS (SIMBOLOS, CORES E PICTOGRAMAS CONFORME NBR 13434)","UN    ",1,24.29,24.29,24.29,24.29]
[null,"MATERIAL (C) - TOTAL",null,null,null,null,null,null,24.529999999999998,24.529999999999998]
[]
[411,"FONTE","CÓDIGO","DESCRIÇÃO","UNIDADE","COEFIC.","CUSTO UNITÁRIO",null,"CUSTO  TOTAL (A) + (B) + (C) + (D) + (E)"]
[null,null,null,null,null,null,"DESONERADO","NÃO DESONER.","DESONERADO","NÃO DESONER."]
[null,"COMPOSIÇÃO","COMP 411_SEE","PLACA DE SINALIZAÇÃO EM PVC COD 13 - (316X158) SAÍDA DE EMERGÊNCIA","UN ",null,null,null,30.769999999999996,30.889999999999997]
[null,"AGETOP_I",5,"SERVENTE","h     ",0.09,8.1999999999999993,9.51,0.74,0.86]
[null,null,null,"","",null,0,0,0,0]
[null,null,null,"","",null,0,0,0,0]
[null,"MÃO DE OBRA (B) - TOTAL",null,null,null,null,null,null,0.74,0.86]
[null,"AGETOP_I",3070,"BUCHA DE NYLON S-6","un",2,0.04,0.04,0.08,0.08]
[null,"AGETOP_I",3393,"PARAFUSO P/BUCHA S-6","un",2,0.08,0.08,0.16,0.16]
[null,"SINAPI_I",37559,"PLACA DE SINALIZACAO DE SEGURANCA CONTRA INCENDIO, FOTOLUMINESCENTE, RETANGULAR, *12 X 40* CM, EM PVC *2* MM ANTI-CHAMAS (SIMBOLOS, CORES E PICTOGRAMAS CONFORME NBR 13434)","UN    ",1,29.79,29.79,29.79,29.79]
[null,"MATERIAL (C) - TOTAL",null,null,null,null,null,null,30.029999999999998,30.029999999999998]
[]
[412,"FONTE","CÓDIGO","DESCRIÇÃO","UNIDADE","COEFIC.","CUSTO UNITÁRIO",null,"CUSTO  TOTAL (A) + (B) + (C) + (D) + (E)"]
[null,null,null,null,null,null,"DESONERADO","NÃO DESONER.","DESONERADO","NÃO DESONER."]
[null,"COMPOSIÇÃO","COMP 412_SEE","PLACA DE SINALIZAÇÃO EM PVC COD 17 - (316X158) MENSAGEM \"SAÍDA\"","UN ",null,null,null,30.769999999999996,30.889999999999997]
[null,"AGETOP_I",5,"SERVENTE","h     ",0.09,8.1999999999999993,9.51,0.74,0.86]
[null,null,null,"","",null,0,0,0,0]
[null,null,null,"","",null,0,0,0,0]
[null,"MÃO DE OBRA (B) - TOTAL",null,null,null,null,null,null,0.74,0.86]
[null,"AGETOP_I",3070,"BUCHA DE NYLON S-6","un",2,0.04,0.04,0.08,0.08]
[null,"AGETOP_I",3393,"PARAFUSO P/BUCHA S-6","un",2,0.08,0.08,0.16,0.16]
[null,"SINAPI_I",37559,"PLACA DE SINALIZACAO DE SEGURANCA CONTRA INCENDIO, FOTOLUMINESCENTE, RETANGULAR, *12 X 40* CM, EM PVC *2* MM ANTI-CHAMAS (SIMBOLOS, CORES E PICTOGRAMAS CONFORME NBR 13434)","UN    ",1,29.79,29.79,29.79,29.79]
[null,"MATERIAL (C) - TOTAL",null,null,null,null,null,null,30.029999999999998,30.029999999999998]
[]
[382,"FONTE","CÓDIGO","DESCRIÇÃO","UNIDADE","COEFIC.","CUSTO UNITÁRIO",null,"CUSTO  TOTAL (A) + (B) + (C) + (D) + (E)"]
[null,null,null,null,null,null,"DESONERADO","NÃO DESONER.","DESONERADO","NÃO DESONER."]
[null,"COMPOSIÇÃO","COMP 382_SEE","TE DE REDUCAO DE FERRO GALVANIZADO, COM ROSCA BSP, DE 3/4\" X 1/2\"","UN ",null,null,null,21.96,24.05]
[null,"AGETOP_I",8,"AJUDANTE","h     ",0.6,8.1999999999999993,9.51,4.92,5.71]
[null,"AGETOP_I",11,"ENCANADOR","h     ",0.61050000000000004,13.4,15.53,8.18,9.48]
[null,null,null,"","",null,0,0,0,0]
[null,"MÃO DE OBRA (B) - TOTAL",null,null,null,null,null,null,13.1,15.190000000000001]
[null,"SINAPI_I",3146,"FITA VEDA ROSCA EM ROLOS DE 18 MM X 10 M (L X C)","UN    ",0.12075471698113208,4.17,4.17,0.5,0.5]
[null,"SINAPI_I",6302,"TE DE REDUCAO DE FERRO GALVANIZADO, COM ROSCA BSP, DE 3/4\" X 1/2\"","UN    ",1,8.36,8.36,8.36,8.36]
[null,null,null,"","",null,0,0,0,0]
[null,"MATERIAL (C) - TOTAL",null,null,null,null,null,null,8.86,8.86]
[]
[383,"FONTE","CÓDIGO","DESCRIÇÃO","UNIDADE","COEFIC.","CUSTO UNITÁRIO",null,"CUSTO  TOTAL (A) + (B) + (C) + (D) + (E)"]
[null,null,null,null,null,null,"DESONERADO","NÃO DESONER.","DESONERADO","NÃO DESONER."]
[null,"COMPOSIÇÃO","COMP 383_SEE","BUCHA DE REDUCAO DE FERRO GALVANIZADO, COM ROSCA BSP, DE 1/2\" X 1/4\"","UN ",null,null,null,6.87,7.42]
[null,"AGETOP_I",8,"AJUDANTE","h     ",0.16,8.1999999999999993,9.51,1.31,1.52]
[null,"AGETOP_I",11,"ENCANADOR","h     ",0.16,13.4,15.53,2.14,2.48]
[null,null,null,"","",null,0,0,0,0]
[null,"MÃO DE OBRA (B) - TOTAL",null,null,null,null,null,null,3.45,4]
[null,"AGETOP_I","H689","FITA VEDAROSCA 12 MM","m",1.2,0.28000000000000003,0.28000000000000003,0.34,0.34]
[null,"SINAPI_I",770,"BUCHA DE REDUCAO DE FERRO GALVANIZADO, COM ROSCA BSP, DE 1/2\" X 1/4\"","UN    ",1,3.08,3.08,3.08,3.08]
[null,null,null,"","",null,0,0,0,0]
[null,"MATERIAL (C) - TOTAL",null,null,null,null,null,null,3.42,3.42]
[]
[212,"FONTE","CÓDIGO","DESCRIÇÃO","UNIDADE","COEFIC.","CUSTO UNITÁRIO",null,"CUSTO  TOTAL (A) + (B) + (C) + (D) + (E)"]
[null,null,null,null,null,null,"DESONERADO","NÃO DESONER.","DESONERADO","NÃO DESONER."]
[null,"COMPOSIÇÃO","COMP 212_SEE","NIPLE DE REDUÇÃO 1/2\" X 1/4\" BSP","UN ",null,null,null,9.5,10.050000000000001]
[null,"AGETOP_I",8,"AJUDANTE","h     ",0.16,8.1999999999999993,9.51,1.31,1.52]
[null,"AGETOP_I",11,"ENCANADOR","h     ",0.16,13.4,15.53,2.14,2.48]
[null,null,null,"","",null,0,0,0,0]
[null,"MÃO DE OBRA (B) - TOTAL",null,null,null,null,null,null,3.45,4]
[null,"COTAÇÃO","COT 103_SEE","NIPLE DE REDUÇÃO 1/2\" X 1/4\" BSP","UN",1,6.0533333333333337,6.0533333333333337,6.05,6.05]
[null,null,null,"","",null,0,0,0,0]
[null,null,null,"","",null,0,0,0,0]
[null,"MATERIAL (C) - TOTAL",null,null,null,null,null,null,6.05,6.05]
[]
[213,"FONTE","CÓDIGO","DESCRIÇÃO","UNIDADE","COEFIC.","CUSTO UNITÁRIO",null,"CUSTO  TOTAL (A) + (B) + (C) + (D) + (E)"]
[null,null,null,null,null,null,"DESONERADO","NÃO DESONER.","DESONERADO","NÃO DESONER."]
[null,"COMPOSIÇÃO","COMP 213_SEE","NIPLE DE REDUÇÃO 3/4\" X 1/2\" BSP","UN ",null,null,null,13.16,13.71]
[null,"AGETOP_I",8,"AJUDANTE","h     ",0.16,8.1999999999999993,9.51,1.31,1.52]
[null,"AGETOP_I",11,"ENCANADOR","h     ",0.16,13.4,15.53,2.14,2.48]
[null,null,null,"","",null,0,0,0,0]
[null,"MÃO DE OBRA (B) - TOTAL",null,null,null,null,null,null,3.45,4]
[null,"COTAÇÃO","COT 104_SEE","NIPLE DE REDUÇÃO 3/4\" X 1/2\" BSP","UN",1,9.7099999999999991,9.7099999999999991,9.7100000000000009,9.7100000000000009]
[null,null,null,"","",null,0,0,0,0]
[null,null,null,"","",null,0,0,0,0]
[null,"MATERIAL (C) - TOTAL",null,null,null,null,null,null,9.7100000000000009,9.7100000000000009]
[]
[237,"FONTE","CÓDIGO","DESCRIÇÃO","UNIDADE","COEFIC.","CUSTO UNITÁRIO",null,"CUSTO  TOTAL (A) + (B) + (C) + (D) + (E)"]
[null,null,null,null,null,null,"DESONERADO","NÃO DESONER.","DESONERADO","NÃO DESONER."]
[null,"COMPOSIÇÃO","COMP 237_SEE","FITA ANTICORROSIVA","M",null,null,null,12.44,13.129999999999999]
[null,"AGETOP_I",8,"AJUDANTE","h     ",0.2,8.1999999999999993,9.51,1.64,1.9]
[null,"AGETOP_I",12,"ELETRICISTA","h     ",0.2,13.4,15.53,2.68,3.11]
[null,null,null,"","",null,0,0,0,0]
[null,"MÃO DE OBRA (B) - TOTAL",null,null,null,null,null,null,4.32,5.01]
[null,"SINAPI_I",39634,"FITA ADESIVA ANTICORROSIVA DE PVC FLEXIVEL, COR PRETA, PARA PROTECAO TUBULACAO, 50 MM X 30 M (L X C), E= *0,25* MM","M     ",1,8.1199999999999992,8.1199999999999992,8.1199999999999992,8.1199999999999992]
[null,null,null,"","",null,0,0,0,0]
[null,null,null,"","",null,0,0,0,0]
[null,"MATERIAL (C) - TOTAL",null,null,null,null,null,null,8.1199999999999992,8.1199999999999992]
[]
[542,"FONTE","CÓDIGO","DESCRIÇÃO","UNIDADE","COEFIC.","CUSTO UNITÁRIO",null,"CUSTO  TOTAL (A) + (B) + (C) + (D) + (E)"]
[null,null,null,null,null,null,"DESONERADO","NÃO DESONER.","DESONERADO","NÃO DESONER."]
[null,"COMPOSIÇÃO","COMP 542_SEE","VÁLVULA UGV 3/4\" (S) LATÃO","UN ",null,null,null,25.17,26.66]
[null,"AGETOP_I",8,"AJUDANTE","h     ",0.432,8.1999999999999993,9.51,3.54,4.1100000000000003]
[null,"AGETOP_I",11,"ENCANADOR","h     ",0.432,13.4,15.53,5.79,6.71]
[null,null,null,"","",null,0,0,0,0]
[null,"MÃO DE OBRA (B) - TOTAL",null,null,null,null,null,null,9.33,10.82]
[null,"COTAÇÃO","COT 281_SEE","VÁLVULA UGV 3/4\" (S) LATÃO","UN ",1,15.836666666666666,15.836666666666666,15.84,15.84]
[null,null,null,"","",null,0,0,0,0]
[null,null,null,"","",null,0,0,0,0]
[null,"MATERIAL (C) - TOTAL",null,null,null,null,null,null,15.84,15.84]
[]
[543,"FONTE","CÓDIGO","DESCRIÇÃO","UNIDADE","COEFIC.","CUSTO UNITÁRIO",null,"CUSTO  TOTAL (A) + (B) + (C) + (D) + (E)"]
[null,null,null,null,null,null,"DESONERADO","NÃO DESONER.","DESONERADO","NÃO DESONER."]
[null,"COMPOSIÇÃO","COMP 543_SEE","VÁLVULA UGV 1/2\" (S) LATÃO","UN ",null,null,null,24.5,25.990000000000002]
[null,"AGETOP_I",8,"AJUDANTE","h     ",0.432,8.1999999999999993,9.51,3.54,4.1100000000000003]
[null,"AGETOP_I",11,"ENCANADOR","h     ",0.432,13.4,15.53,5.79,6.71]
[null,null,null,"","",null,0,0,0,0]
[null,"MÃO DE OBRA (B) - TOTAL",null,null,null,null,null,null,9.33,10.82]
[null,"COTAÇÃO","COT 282_SEE","VÁLVULA UGV 1/2\" (S) LATÃO","UN ",1,15.166666666666666,15.166666666666666,15.17,15.17]
[null,null,null,"","",null,0,0,0,0]
[null,null,null,"","",null,0,0,0,0]
[null,"MATERIAL (C) - TOTAL",null,null,null,null,null,null,15.17,15.17]
[]
[211,"FONTE","CÓDIGO","DESCRIÇÃO","UNIDADE","COEFIC.","CUSTO UNITÁRIO",null,"CUSTO  TOTAL (A) + (B) + (C) + (D) + (E)"]
[null,null,null,null,null,null,"DESONERADO","NÃO DESONER.","DESONERADO","NÃO DESONER."]
[null,"COMPOSIÇÃO","COMP 211_SEE","REGULADOR DE 2º ESTÁGIO 5KG/H","UN ",null,null,null,85.46,89.419999999999987]
[null,"AGETOP_I",8,"AJUDANTE","h     ",1.1499999999999999,8.1999999999999993,9.51,9.43,10.94]
[null,"AGETOP_I",11,"ENCANADOR","h     ",1.1499999999999999,13.4,15.53,15.41,17.86]
[null,null,null,"","",null,0,0,0,0]
[null,"MÃO DE OBRA (B) - TOTAL",null,null,null,null,null,null,24.84,28.799999999999997]
[null,"COTAÇÃO","COT 102_SEE","REGULADOR DE 2º ESTÁGIO 5KG/H","UN",1,59.833333333333336,59.833333333333336,59.83,59.83]
[null,"AGETOP_I","H689","FITA VEDAROSCA 12 MM","m",2.82,0.28000000000000003,0.28000000000000003,0.79,0.79]
[null,null,null,"","",null,0,0,0,0]
[null,"MATERIAL (C) - TOTAL",null,null,null,null,null,null,60.62,60.62]
[]
[210,"FONTE","CÓDIGO","DESCRIÇÃO","UNIDADE","COEFIC.","CUSTO UNITÁRIO",null,"CUSTO  TOTAL (A) + (B) + (C) + (D) + (E)"]
[null,null,null,null,null,null,"DESONERADO","NÃO DESONER.","DESONERADO","NÃO DESONER."]
[null,"COMPOSIÇÃO","COMP 210_SEE","REGULADOR DE 1º ESTÁGIO 60KG/H MODELO AP-40  COM MANÔMETRO","UN ",null,null,null,231.21,235.17000000000002]
[null,"AGETOP_I",8,"AJUDANTE","h     ",1.1499999999999999,8.1999999999999993,9.51,9.43,10.94]
[null,"AGETOP_I",11,"ENCANADOR","h     ",1.1499999999999999,13.4,15.53,15.41,17.86]
[null,null,null,"","",null,0,0,0,0]
[null,"MÃO DE OBRA (B) - TOTAL",null,null,null,null,null,null,24.84,28.799999999999997]
[null,"COTAÇÃO","COT 101_SEE","REGULADOR DE 1º ESTÁGIO 60KG/H MODELO AP-40  COM MANÔMETRO","UN",1,205.57666666666668,205.57666666666668,205.58,205.58]
[null,"AGETOP_I","H689","FITA VEDAROSCA 12 MM","m",2.82,0.28000000000000003,0.28000000000000003,0.79,0.79]
[null,null,null,"","",null,0,0,0,0]
[null,"MATERIAL (C) - TOTAL",null,null,null,null,null,null,206.37,206.37]
[]
[235,"FONTE","CÓDIGO","DESCRIÇÃO","UNIDADE","COEFIC.","CUSTO UNITÁRIO",null,"CUSTO  TOTAL (A) + (B) + (C) + (D) + (E)"]
[null,null,null,null,null,null,"DESONERADO","NÃO DESONER.","DESONERADO","NÃO DESONER."]
[null,"COMPOSIÇÃO","COMP 235_SEE","PLACA DE SINALIZAÇÃO EM PVC COD 01 - (300X300) PROIBIDO FUMAR","UN ",null,null,null,25.269999999999996,25.389999999999997]
[null,"AGETOP_I",5,"SERVENTE","h     ",0.09,8.1999999999999993,9.51,0.74,0.86]
[null,null,null,"","",null,0,0,0,0]
[null,null,null,"","",null,0,0,0,0]
[null,"MÃO DE OBRA (B) - TOTAL",null,null,null,null,null,null,0.74,0.86]
[null,"AGETOP_I",3070,"BUCHA DE NYLON S-6","un",2,0.04,0.04,0.08,0.08]
[null,"AGETOP_I",3393,"PARAFUSO P/BUCHA S-6","un",2,0.08,0.08,0.16,0.16]
[null,"SINAPI_I",37556,"PLACA DE SINALIZACAO DE SEGURANCA CONTRA INCENDIO, FOTOLUMINESCENTE, QUADRADA, *20 X 20* CM, EM PVC *2* MM ANTI-CHAMAS (SIMBOLOS, CORES E PICTOGRAMAS CONFORME NBR 13434)","UN    ",1,24.29,24.29,24.29,24.29]
[null,"MATERIAL (C) - TOTAL",null,null,null,null,null,null,24.529999999999998,24.529999999999998]
[]
[236,"FONTE","CÓDIGO","DESCRIÇÃO","UNIDADE","COEFIC.","CUSTO UNITÁRIO",null,"CUSTO  TOTAL (A) + (B) + (C) + (D) + (E)"]
[null,null,null,null,null,null,"DESONERADO","NÃO DESONER.","DESONERADO","NÃO DESONER."]
[null,"COMPOSIÇÃO","COMP 236_SEE","PLACA DE SINALIZAÇÃO EM PVC COD 06 - (300X300) PERIGO INFLAMÁVEL","UN ",null,null,null,25.269999999999996,25.389999999999997]
[null,"AGETOP_I",5,"SERVENTE","h     ",0.09,8.1999999999999993,9.51,0.74,0.86]
[null,null,null,"","",null,0,0,0,0]
[null,null,null,"","",null,0,0,0,0]
[null,"MÃO DE OBRA (B) - TOTAL",null,null,null,null,null,null,0.74,0.86]
[null,"AGETOP_I",3070,"BUCHA DE NYLON S-6","un",2,0.04,0.04,0.08,0.08]
[null,"AGETOP_I",3393,"PARAFUSO P/BUCHA S-6","un",2,0.08,0.08,0.16,0.16]
[null,"SINAPI_I",37556,"PLACA DE SINALIZACAO DE SEGURANCA CONTRA INCENDIO, FOTOLUMINESCENTE, QUADRADA, *20 X 20* CM, EM PVC *2* MM ANTI-CHAMAS (SIMBOLOS, CORES E PICTOGRAMAS CONFORME NBR 13434)","UN    ",1,24.29,24.29,24.29,24.29]
[null,"MATERIAL (C) - TOTAL",null,null,null,null,null,null,24.529999999999998,24.529999999999998]
[]
[84,"FONTE","CÓDIGO","DESCRIÇÃO","UNIDADE","COEFIC.","CUSTO UNITÁRIO",null,"CUSTO  TOTAL (A) + (B) + (C) + (D) + (E)"]
[null,null,null,null,null,null,"DESONERADO","NÃO DESONER.","DESONERADO","NÃO DESONER."]
[null,"COMPOSIÇÃO","COMP 084_SEE","GUARDA-CORPO COM CORRIMÃO - SEDUC","M",null,null,null,204.60000000000002,209.46]
[null,"AGETOP_I",25,"OFICIAL \"B\"","h     ",1.1000000000000001,13.4,15.53,14.74,17.079999999999998]
[null,"AGETOP_I",8,"AJUDANTE","h     ",1.1000000000000001,8.1999999999999993,9.51,9.02,10.46]
[null,null,null,"","",null,0,0,0,0]
[null,"MÃO DE OBRA (B) - TOTAL",null,null,null,null,null,null,23.759999999999998,27.54]
[null,"AGETOP_I",2376,"TUBO INDUSTRIAL 2\" CHAPA 13 ","Kg",7.7778,5.23,5.23,40.68,40.68]
[null,"AGETOP_I",2504,"TUBO INDUSTRIAL D=25 MM CHAPA 13 ","Kg",4.6319999999999997,5.07,5.07,23.48,23.48]
[null,"AGETOP_I",2377,"TUBO INDUSTRIAL 40X40 CH.13","Kg",6.3419999999999996,5.07,5.07,32.15,32.15]
[null,"AGETOP_I",2421,"TUBO INDUSTRIAL 1.1/2\" CHAPA 13 ","Kg",1.4862,5.07,5.07,7.54,7.54]
[null,"AGETOP_I",2417,"MASSA PLASTICA","Kg",0.2041,10.58,10.58,2.16,2.16]
[null,"AGETOP_I",2246,"ELETRODO 2.5 OK","Kg",0.11459999999999999,8.6999999999999993,8.6999999999999993,1,1]
[null,"AGETOP_I",1672,"LIXA PARA FERRO ( NÚMERO 100 )","un",0.25509999999999999,2.12,2.12,0.54,0.54]
[null,"AGETOP_I",1264,"DISCO DE DESBASTE 7/8\" P/ CONC./FERRO (1/4\" X 7\")","un",5.0999999999999997E-2,7,7,0.36,0.36]
[null,"AGETOP_I",1334,"DISCO DE CORTE DIAM. 5/8\"- 10\"","un",0.373,5.5,5.5,2.0499999999999998,2.0499999999999998]
[null,"AGETOP_I",2902,"FABRICAÇÃO / MONTAGEM","un",1,50.44,50.44,50.44,50.44]
[null,"AGETOP_I",2150,"CHAPA DE FERRO DOBRADA No.13","Kg",0.43519999999999998,5.28,5.28,2.2999999999999998,2.2999999999999998]
[null,"AGETOP_I",2719,"CHAPA PERFILADA 3/16\"","Kg",1.0979999999999999,5.04,5.04,5.53,5.53]
[null,"AGETOP_I",2436,"ACO CA-25 - 6,3 MM (1/4\") - BARRA LISA A-36","Kg",0.38124999999999998,5.13,5.13,1.96,1.96]
[null,"AGETOP",261602,"PINT.ESMALTE/ESQUAD.FERRO C/FUNDO ANTICOR.","m2    ",0.78,13.65,15.04,10.65,11.73]
[null,"MATERIAL (C) - TOTAL",null,null,null,null,null,null,180.84000000000003,181.92000000000002]
[]
[83,"FONTE","CÓDIGO","DESCRIÇÃO","UNIDADE","COEFIC.","CUSTO UNITÁRIO",null,"CUSTO  TOTAL (A) + (B) + (C) + (D) + (E)"]
[null,null,null,null,null,null,"DESONERADO","NÃO DESONER.","DESONERADO","NÃO DESONER."]
[null,"COMPOSIÇÃO","COMP 083_SEE","CORRIMÃO PISO - SEDUC","M",null,null,null,141.9,145.95000000000002]
[null,"AGETOP_I",25,"OFICIAL \"B\"","h     ",1,13.4,15.53,13.4,15.53]
[null,"AGETOP_I",8,"AJUDANTE","h     ",1,8.1999999999999993,9.51,8.1999999999999993,9.51]
[null,"MÃO DE OBRA (B) - TOTAL",null,null,null,null,null,null,21.6,25.04]
[null,"AGETOP_I",2376,"TUBO INDUSTRIAL 2\" CHAPA 13 ","Kg",8.2197499999999994,5.23,5.23,42.99,42.99]
[null,"AGETOP_I",2504,"TUBO INDUSTRIAL D=25 MM CHAPA 13 ","Kg",1.1000000000000001,5.07,5.07,5.58,5.58]
[null,"AGETOP_I",2417,"MASSA PLASTICA","Kg",0.2041,10.58,10.58,2.16,2.16]
[null,"AGETOP_I",2246,"ELETRODO 2.5 OK","Kg",0.11459999999999999,8.6999999999999993,8.6999999999999993,1,1]
[null,"AGETOP_I",1672,"LIXA PARA FERRO ( NÚMERO 100 )","un",0.125,2.12,2.12,0.27,0.27]
[null,"AGETOP_I",1264,"DISCO DE DESBASTE 7/8\" P/ CONC./FERRO (1/4\" X 7\")","un",2.5000000000000001E-2,7,7,0.18,0.18]
[null,"AGETOP_I",1334,"DISCO DE CORTE DIAM. 5/8\"- 10\"","un",0.1865,5.5,5.5,1.03,1.03]
[null,"AGETOP_I",2902,"FABRICAÇÃO / MONTAGEM","un",1,50.44,50.44,50.44,50.44]
[null,"AGETOP_I",2150,"CHAPA DE FERRO DOBRADA No.13","Kg",0.43519999999999998,5.28,5.28,2.2999999999999998,2.2999999999999998]
[null,"AGETOP_I",2719,"CHAPA PERFILADA 3/16\"","Kg",1.1644000000000001,5.04,5.04,5.87,5.87]
[null,"AGETOP_I",2436,"ACO CA-25 - 6,3 MM (1/4\") - BARRA LISA A-36","Kg",0.48150000000000004,5.13,5.13,2.4700000000000002,2.4700000000000002]
[null,"AGETOP",261602,"PINT.ESMALTE/ESQUAD.FERRO C/FUNDO ANTICOR.","m2    ",0.44,13.65,15.04,6.01,6.62]
[null,"MATERIAL (C) - TOTAL",null,null,null,null,null,null,120.30000000000001,120.91000000000001]
[]
[86,"FONTE","CÓDIGO","DESCRIÇÃO","UNIDADE","COEFIC.","CUSTO UNITÁRIO",null,"CUSTO  TOTAL (A) + (B) + (C) + (D) + (E)"]
[null,null,null,null,null,null,"DESONERADO","NÃO DESONER.","DESONERADO","NÃO DESONER."]
[null,"COMPOSIÇÃO","COMP 086_SEE","ELEVADOR (PLATAFORMA VERTICAL) MODELO HERA OU EQUIVALENTE 02 PARADAS - CAPACIDADE 280KG (INSTALADO)","UN ",null,null,null,37873.33,37873.33]
[null,null,null,"","",null,0,0,0,0]
[null,null,null,"","",null,0,0,0,0]
[null,null,null,"","",null,0,0,0,0]
[null,"MÃO DE OBRA (B) - TOTAL",null,null,null,null,null,null,0,0]
[null,"COTAÇÃO","COT 016_SEE","ELEVADOR (PLATAFORMA VERTICAL) MODELO HERA OU EQUIVALENTE 02 PARADAS - CAPACIDADE 280KG (INSTALADO)","UN ",1,37873.333333333336,37873.333333333336,37873.33,37873.33]
[null,null,null,"","",null,0,0,0,0]
[null,null,null,"","",null,0,0,0,0]
[null,"MATERIAL (C) - TOTAL",null,null,null,null,null,null,37873.33,37873.33]
[]
[387,"FONTE","CÓDIGO","DESCRIÇÃO","UNIDADE","COEFIC.","CUSTO UNITÁRIO",null,"CUSTO  TOTAL (A) + (B) + (C) + (D) + (E)"]
[null,null,null,null,null,null,"DESONERADO","NÃO DESONER.","DESONERADO","NÃO DESONER."]
[null,"COMPOSIÇÃO","COMP 387_SEE","LÂMPADA LED TUBULAR 18W ","UN ",null,null,null,22.28,22.330000000000002]
[null,"AGETOP_I",8,"AJUDANTE","h     ",1.4999999999999999E-2,8.1999999999999993,9.51,0.12,0.14000000000000001]
[null,"AGETOP_I",12,"ELETRICISTA","h     ",1.4999999999999999E-2,13.4,15.53,0.2,0.23]
[null,null,null,"","",null,0,0,0,0]
[null,"MÃO DE OBRA (B) - TOTAL",null,null,null,null,null,null,0.32,0.37]
[null,"COTAÇÃO","COT 195_SEE","LÂMPADA LED TUBULAR 18W ","UN",1,21.959999999999997,21.959999999999997,21.96,21.96]
[null,null,null,"","",null,0,0,0,0]
[null,null,null,"","",null,0,0,0,0]
[null,"MATERIAL (C) - TOTAL",null,null,null,null,null,null,21.96,21.96]
[]
[31,"FONTE","CÓDIGO","DESCRIÇÃO","UNIDADE","COEFIC.","CUSTO UNITÁRIO",null,"CUSTO  TOTAL (A) + (B) + (C) + (D) + (E)"]
[null,null,null,null,null,null,"DESONERADO","NÃO DESONER.","DESONERADO","NÃO DESONER."]
[null,"COMPOSIÇÃO","COMP 031_SEE","MURETA P/ QUAD. POLIESP. ALV. DE TIJ. FURADO - 1/2 VEZ - C/ CHP. E PEDRISCO - H=0,80 M","M",null,null,null,31.649999999999995,33.459999999999994]
[null,"AGETOP_I",5,"SERVENTE","h     ",0.50848000000000004,8.1999999999999993,9.51,4.17,4.84]
[null,"AGETOP_I",4,"PEDREIRO","h     ",0.2278,13.4,15.53,3.05,3.54]
[null,"AGETOP_I",32,"OPERADOR DE BETONEIRA ","h     ",3.6499999999999998E-2,9.85,11.41,0.36,0.42]
[null,"AGETOP_I",8,"AJUDANTE","h     ",0.17269999999999999,8.1999999999999993,9.51,1.42,1.64]
[null,"AGETOP_I",6,"ARMADOR","h     ",0.1145,13.4,15.53,1.53,1.78]
[null,"AGETOP_I",10,"CARPINTEIRO","h     ",5.5500000000000001E-2,13.4,15.53,0.74,0.86]
[null,"MÃO DE OBRA (B) - TOTAL",null,null,null,null,null,null,11.27,13.079999999999998]
[null,"AGETOP_I",104,"AREIA MEDIA ","m3",2.2440000000000002E-2,82.85,82.85,1.86,1.86]
[null,"AGETOP_I",102,"ARAME RECOZIDO 18","Kg",2.9839999999999998E-2,6.75,6.75,0.2,0.2]
[null,"AGETOP_I",2426,"ARAME GALVANIZADO No. 12 BWG","Kg",2.5600000000000002E-3,6.5,6.5,0.02,0.02]
[null,"AGETOP_I",2448,"ACO CA-60 B - 5,0 MM","Kg",0.50471999999999995,4.45,4.45,2.25,2.25]
[null,"AGETOP_I",2437,"ACO CA-50 - 6,3 MM (1/4\")","Kg",0.33,4.28,4.28,1.41,1.41]
[null,"AGETOP_I",2438,"ACO CA-50 - 8,0 MM (5/16\")","Kg",0.80456000000000005,4.0999999999999996,4.0999999999999996,3.3,3.3]
[null,"AGETOP_I",2386,"BRITA No. 01","m3",1.6719999999999999E-2,85.36,85.36,1.43,1.43]
[null,"AGETOP_I",2497,"BRITA No.02","m3",1.6719999999999999E-2,74.900000000000006,74.900000000000006,1.25,1.25]
[null,"AGETOP_I",1221,"CAL HIDRATADA","Kg",0.67584,0.54,0.54,0.36,0.36]
[null,"AGETOP_I",1215,"CIMENTO PORTLAND C.P. 32","Kg",6.6745599999999996,0.39,0.39,2.6,2.6]
[null,"AGETOP_I",2034,"TIJOLO FURADO 19x19x9","un",8.3699200000000005,0.48,0.48,4.0199999999999996,4.0199999999999996]
[null,"AGETOP_I",2023,"TABUA PARA FORMA(30CM)","m",0.17743999999999999,5.63,5.63,1,1]
[null,"AGETOP_I",1861,"PREGO 18x24","Kg",1.2840000000000001E-2,5.99,5.99,0.08,0.08]
[null,"AGETOP_I",1858,"PONTALETE 3x3\"","m",0.11384,5.24,5.24,0.6,0.6]
[null,"MATERIAL (C) - TOTAL",null,null,null,null,null,null,20.379999999999995,20.379999999999995]