{"text_format":"1","workbook":"xlsx","n_sheets":8,"sheets":["Orçamento","Resumo ","Somatório","Cronog_90_Dias","Composição BDI","Relatório CENTRAL","Parc Maior Relev","Composições"],"not_rendered":{"charts":0,"images":4,"macros":1,"external_links":2,"defined_names":151,"comments":3,"pivot_tables":0},"unopened":[],"bounds":{"document_bytes":16777216,"sheet_cells":100000,"rows_first":2000,"rows_last":500,"rows_between":2000,"halvings":0,"cell_chars":16384,"cell_head_chars":4096},"cells_cut":0,"cells_raw":0,"read":"whole","date_system":"1900"}

{"sheet":"Orçamento","index":0,"n_rows":411,"n_cols":24,"rows_kept":411,"cut":false,"hidden":false,"merged":[[346,16,346,22],[381,18,381,20],[381,21,381,22],[0,14,0,22],[8,14,8,16],[9,14,9,16],[11,14,11,16],[12,14,12,16],[14,14,14,22],[1,14,1,22],[4,14,4,22],[7,14,7,22],[365,18,365,20],[365,21,365,22],[373,21,373,22],[362,15,362,17],[363,15,363,17],[364,15,364,17],[366,21,366,22],[374,18,374,20],[374,21,374,22],[372,18,372,20],[372,21,372,22],[380,18,380,20],[380,21,380,22],[367,18,367,20],[367,21,367,22],[360,18,360,20],[360,21,360,22],[382,18,382,20],[382,21,382,22],[336,20,336,21],[358,18,358,20],[358,21,358,22],[359,18,359,20],[359,21,359,22],[357,18,357,20],[357,21,357,22],[366,18,366,20],[337,20,337,21],[348,18,348,22],[354,18,354,20],[354,21,354,22],[355,18,355,20],[355,21,355,22],[356,18,356,20],[356,21,356,22],[379,18,379,20],[379,21,379,22],[376,21,376,22],[377,18,377,20],[377,21,377,22],[378,18,378,20],[378,21,378,22],[368,18,368,20],[368,21,368,22],[375,18,375,20],[375,21,375,22],[370,21,370,22],[371,18,371,20],[371,21,371,22],[373,18,373,20],[369,18,369,20],[369,21,369,22],[370,18,370,20],[374,15,374,17],[375,15,375,17],[376,15,376,17],[377,15,377,17],[378,15,378,17],[351,14,351,23],[340,20,340,21],[339,20,339,21],[335,17,340,17],[335,20,335,21],[352,18,352,20],[352,21,352,22],[353,18,353,20],[353,21,353,22],[341,20,341,21],[361,18,361,20],[361,21,361,22],[362,18,362,20],[362,21,362,22],[363,18,363,20],[363,21,363,22],[364,18,364,20],[364,21,364,22],[376,18,376,20],[353,15,353,17],[354,15,354,17],[355,15,355,17],[356,15,356,17],[357,15,357,17],[358,15,358,17],[359,15,359,17],[360,15,360,17],[361,15,361,17],[365,15,365,17],[366,15,366,17],[367,15,367,17],[368,15,368,17],[369,15,369,17],[370,15,370,17],[371,15,371,17],[372,15,372,17],[373,15,373,17],[343,16,343,22],[344,16,344,22],[345,16,345,22],[3,21,3,22],[2,21,2,22],[5,21,5,22],[10,14,10,23],[13,14,13,23],[6,21,6,22],[2,14,2,20],[3,14,3,20],[5,18,5,20],[6,18,6,20],[6,14,6,17],[5,14,5,17],[12,21,12,22],[12,18,12,20],[8,18,8,20],[8,21,8,22],[9,19,9,20],[385,14,385,23],[386,18,386,20],[386,21,386,22],[387,15,387,17],[387,18,387,20],[387,21,387,22],[388,15,388,17],[388,18,388,20],[388,21,388,22],[392,15,392,17],[390,18,390,20],[390,21,390,22],[410,18,410,20],[410,21,410,22],[407,14,407,17],[404,15,404,17],[404,18,404,20],[404,21,404,22],[405,15,405,17],[405,18,405,20],[405,21,405,22],[406,15,406,17],[406,18,406,20],[406,21,406,22],[409,18,409,20],[409,21,409,22],[408,18,408,20],[408,21,408,22],[389,18,389,20],[389,21,389,22],[390,15,390,17],[379,14,379,17],[386,15,386,17],[352,15,352,17],[407,18,407,20],[407,21,407,22],[395,15,395,17],[395,18,395,20],[395,21,395,22],[396,15,396,17],[396,18,396,20],[396,21,396,22],[397,15,397,17],[397,18,397,20],[397,21,397,22],[401,15,401,17],[401,18,401,20],[401,21,401,22],[402,15,402,17],[402,18,402,20],[402,21,402,22],[403,15,403,17],[391,15,391,17],[391,18,391,20],[391,21,391,22],[347,16,347,22],[403,18,403,20],[403,21,403,22],[398,15,398,17],[398,18,398,20],[398,21,398,22],[399,15,399,17],[399,18,399,20],[399,21,399,22],[400,15,400,17],[400,18,400,20],[400,21,400,22],[392,18,392,20],[392,21,392,22],[393,15,393,17],[393,18,393,20],[393,21,393,22],[394,15,394,17],[394,18,394,20],[394,21,394,22],[389,15,389,17]]}
[]
[]
[null,null,null,null,null,null,null,null,null,null,null,null,null,null,"UNIDADE ESCOLAR",null,null,null,null,null,null,"CÓDIGO INEP"]
[null,null,null,null,null,null,null,null,null,null,null,null,"",null,"COLÉGIO ESTADUAL VALPARAIZO",null,null,null,null,null,null,52047229]
[]
["Nmax",null,null,null,null,null,null,null,null,null,null,null,null,null,"OBRA",null,null,null,"DATA",null,null,"CIDADE"]
[{"$f":"MAX($C$18:$C$335)","v":4},null,null,null,null,null,null,null,null,null,null,null,null,null,"REFORMA",null,null,null,"2020-09-02",null,null,"VALPARAÍSO DE GOIÁS"]
[]
[null,null,null,null,null,null,null,null,null,null,null,null,null,null,"CRE",null,null,"ENDEREÇO","REFERÊNCIA AGETOP",null,null,"REFERÊNCIA SINAPI"]
[null,null,null,null,null,null,null,null,null,null,null,null,null,null,"NOVO GAMA",null,null,"PRACA CENTRAL ETAPA A, VALPARAISO I, CEP:72876-030","ABR/19","DESONERADA",null,"NOV/19","DESONERADA"]
[]
[null,null,null,null,null,null,null,null,null,null,null,null,null,null,"ÁREA EXISTENTE (M²)",null,null,"ÁREA A CONSTRUIR (M²)","ÁREA A DEMOLIR (M²)",null,null,"ÁREA TOTAL CONSTRUÍDA (M²)"]
[null,null,null,null,null,null,null,null,null,null,null,null,null,null,1620.6,null,null,null,0,null,null,1620.6]
[]
[null,null,null,null,null,null,null,null,null,null,null,"FILTRO",null,null,"PLANILHA ORÇAMENTÁRIA"]
["Nível E","Save Nivel","Nível C","Altura","n1","n2","n3","n4","n5","Czero","Cnível","↓","Nível","Nível Corrigido","ITEM","TABELA","CODIGO","DESCRIÇÃO DOS SERVIÇOS","UNID","QUANT","MAT","MO","T.SERVIÇO","OBSERVAÇÕES¹"]
[{"$f":"CHOOSE(1+LOG(1+2*(ORÇAMENTO.Nivel=\"Nível 1\")+4*(ORÇAMENTO.Nivel=\"Nível 2\")+8*(ORÇAMENTO.Nivel=\"Nível 3\")+16*(ORÇAMENTO.Nivel=\"Nível 4\")+32*(ORÇAMENTO.Nivel=\"Serviço\"),2),0,1,2,3,4,\"S\")","v":"S"},{"$f":"IF(OR(C17=\"s\",C17=0),OFFSET(B17,-1,0),C17)","v":"Save Nivel"},{"$f":"IF(OFFSET(C17,-1,0)=\"L\",1,IF(OFFSET(C17,-1,0)=1,2,IF(OR(A17=\"s\",A17=0),\"S\",IF(AND(OFFSET(C17,-1,0)=2,A17=4),3,IF(AND(OR(OFFSET(C17,-1,0)=\"s\",OFFSET(C17,-1,0)=0),A17<>\"s\",A17>OFFSET(B17,-1,0)),OFFSET(B17,-1,0),A17)))))","v":"S"},{"$f":"IF(OR(C17=\"S\",C17=0),0,IF(ISERROR(K17),J17,SMALL(J17:K17,1)))","v":0},{"$f":"IF($C17=1,OFFSET(E17,-1,0)+1,OFFSET(E17,-1,0))","v":"n1"},{"$f":"IF($C17=1,0,IF($C17=2,OFFSET(F17,-1,0)+1,OFFSET(F17,-1,0)))","v":"n2"},{"$f":"IF(AND($C17<=2,$C17<>0),0,IF($C17=3,OFFSET(G17,-1,0)+1,OFFSET(G17,-1,0)))","v":"n3"},{"$f":"IF(AND($C17<=3,$C17<>0),0,IF($C17=4,OFFSET(H17,-1,0)+1,OFFSET(H17,-1,0)))","v":"n4"},{"$f":"IF(AND($C17<=4,$C17<>0),0,IF(AND($C17=\"S\",$W17>0),OFFSET(I17,-1,0)+1,OFFSET(I17,-1,0)))","v":"n5"},{"$f":"IF(OR($C17=\"S\",$C17=0),0,MATCH(0,OFFSET($D17,1,$C17,ROW($C$335)-ROW($C17)),0))","v":0},{"$f":"IF(OR($C17=\"S\",$C17=0),0,MATCH(OFFSET($D17,0,$C17)+1,OFFSET($D17,1,$C17,ROW($C$335)-ROW($C17)),0))","v":0},"","Serviço","Serviço","-","SINAPI",null,"(sem código)","-",null,0,0,0,""]
[0,null,"L",{"$f":"COUNTA(OFFSET(D18,1,0):D$335)","v":316},{"$f":"LEFT(O19,1)-1","v":0},null,null,null,null,null,null,"F","LOTE","LOTE","REFORMA - COLÉGIO ESTADUAL VALPARAIZO",null,null,null,null,null,null,null,462265.15999999992]
[{"$f":"CHOOSE(1+LOG(1+2*(ORÇAMENTO.Nivel=\"Nível 1\")+4*(ORÇAMENTO.Nivel=\"Nível 2\")+8*(ORÇAMENTO.Nivel=\"Nível 3\")+16*(ORÇAMENTO.Nivel=\"Nível 4\")+32*(ORÇAMENTO.Nivel=\"Serviço\"),2),0,1,2,3,4,\"S\")","v":1},{"$f":"IF(OR(C19=\"s\",C19=0),OFFSET(B19,-1,0),C19)","v":1},{"$f":"IF(OFFSET(C19,-1,0)=\"L\",1,IF(OFFSET(C19,-1,0)=1,2,IF(OR(A19=\"s\",A19=0),\"S\",IF(AND(OFFSET(C19,-1,0)=2,A19=4),3,IF(AND(OR(OFFSET(C19,-1,0)=\"s\",OFFSET(C19,-1,0)=0),A19<>\"s\",A19>OFFSET(B19,-1,0)),OFFSET(B19,-1,0),A19)))))","v":1},{"$f":"IF(OR(C19=\"S\",C19=0),0,IF(ISERROR(K19),J19,SMALL(J19:K19,1)))","v":316},{"$f":"IF($C19=1,OFFSET(E19,-1,0)+1,OFFSET(E19,-1,0))","v":1},{"$f":"IF($C19=1,0,IF($C19=2,OFFSET(F19,-1,0)+1,OFFSET(F19,-1,0)))","v":0},{"$f":"IF(AND($C19<=2,$C19<>0),0,IF($C19=3,OFFSET(G19,-1,0)+1,OFFSET(G19,-1,0)))","v":0},{"$f":"IF(AND($C19<=3,$C19<>0),0,IF($C19=4,OFFSET(H19,-1,0)+1,OFFSET(H19,-1,0)))","v":0},{"$f":"IF(AND($C19<=4,$C19<>0),0,IF(AND($C19=\"S\",$W19>0),OFFSET(I19,-1,0)+1,OFFSET(I19,-1,0)))","v":0},{"$f":"IF(OR($C19=\"S\",$C19=0),0,MATCH(0,OFFSET($D19,1,$C19,ROW($C$335)-ROW($C19)),0))","v":316},{"$f":"IF(OR($C19=\"S\",$C19=0),0,MATCH(OFFSET($D19,0,$C19)+1,OFFSET($D19,1,$C19,ROW($C$335)-ROW($C19)),0))","v":{"$error":"#N/A"}},"F","Nível 1","Nível 1","1.","AGETOP",null,"REFORMA"]
[2,{"$f":"IF(OR(C20=\"s\",C20=0),OFFSET(B20,-1,0),C20)","v":2},{"$f":"IF(OFFSET(C20,-1,0)=\"L\",1,IF(OFFSET(C20,-1,0)=1,2,IF(OR(A20=\"s\",A20=0),\"S\",IF(AND(OFFSET(C20,-1,0)=2,A20=4),3,IF(AND(OR(OFFSET(C20,-1,0)=\"s\",OFFSET(C20,-1,0)=0),A20<>\"s\",A20>OFFSET(B20,-1,0)),OFFSET(B20,-1,0),A20)))))","v":2},{"$f":"IF(OR(C20=\"S\",C20=0),0,IF(ISERROR(K20),J20,SMALL(J20:K20,1)))","v":31},{"$f":"IF($C20=1,OFFSET(E20,-1,0)+1,OFFSET(E20,-1,0))","v":1},{"$f":"IF($C20=1,0,IF($C20=2,OFFSET(F20,-1,0)+1,OFFSET(F20,-1,0)))","v":1},{"$f":"IF(AND($C20<=2,$C20<>0),0,IF($C20=3,OFFSET(G20,-1,0)+1,OFFSET(G20,-1,0)))","v":0},{"$f":"IF(AND($C20<=3,$C20<>0),0,IF($C20=4,OFFSET(H20,-1,0)+1,OFFSET(H20,-1,0)))","v":0},{"$f":"IF(AND($C20<=4,$C20<>0),0,IF(AND($C20=\"S\",$W20>0),OFFSET(I20,-1,0)+1,OFFSET(I20,-1,0)))","v":0},315,31,"F","Nível 2","Nível 2","1.1.","AGETOP",null,"SERVIÇOS PRELIMINARES"]
[3,{"$f":"IF(OR(C21=\"s\",C21=0),OFFSET(B21,-1,0),C21)","v":3},{"$f":"IF(OFFSET(C21,-1,0)=\"L\",1,IF(OFFSET(C21,-1,0)=1,2,IF(OR(A21=\"s\",A21=0),\"S\",IF(AND(OFFSET(C21,-1,0)=2,A21=4),3,IF(AND(OR(OFFSET(C21,-1,0)=\"s\",OFFSET(C21,-1,0)=0),A21<>\"s\",A21>OFFSET(B21,-1,0)),OFFSET(B21,-1,0),A21)))))","v":3},{"$f":"IF(OR(C21=\"S\",C21=0),0,IF(ISERROR(K21),J21,SMALL(J21:K21,1)))","v":13},{"$f":"IF($C21=1,OFFSET(E21,-1,0)+1,OFFSET(E21,-1,0))","v":1},{"$f":"IF($C21=1,0,IF($C21=2,OFFSET(F21,-1,0)+1,OFFSET(F21,-1,0)))","v":1},{"$f":"IF(AND($C21<=2,$C21<>0),0,IF($C21=3,OFFSET(G21,-1,0)+1,OFFSET(G21,-1,0)))","v":1},{"$f":"IF(AND($C21<=3,$C21<>0),0,IF($C21=4,OFFSET(H21,-1,0)+1,OFFSET(H21,-1,0)))","v":0},{"$f":"IF(AND($C21<=4,$C21<>0),0,IF(AND($C21=\"S\",$W21>0),OFFSET(I21,-1,0)+1,OFFSET(I21,-1,0)))","v":0},30,13,"F","Nível 3","Nível 3","1.1.1.","SINAPI",null,"ACESSIBILIDADE","-",null,null,null,null,""]
["S",3,"S",0,1,1,1,0,0,0,0,"F","Serviço","Serviço","1.1.1.0.1.","AGETOP",20109,"DEM.PISO CIMENT.SOBRE LASTRO CONC.C/TR.ATE CB. E CARGA","m2    ",11,null,null,null,""]
[{"$f":"CHOOSE(1+LOG(1+2*(ORÇAMENTO.Nivel=\"Nível 1\")+4*(ORÇAMENTO.Nivel=\"Nível 2\")+8*(ORÇAMENTO.Nivel=\"Nível 3\")+16*(ORÇAMENTO.Nivel=\"Nível 4\")+32*(ORÇAMENTO.Nivel=\"Serviço\"),2),0,1,2,3,4,\"S\")","v":"S"},{"$f":"IF(OR(C23=\"s\",C23=0),OFFSET(B23,-1,0),C23)","v":3},{"$f":"IF(OFFSET(C23,-1,0)=\"L\",1,IF(OFFSET(C23,-1,0)=1,2,IF(OR(A23=\"s\",A23=0),\"S\",IF(AND(OFFSET(C23,-1,0)=2,A23=4),3,IF(AND(OR(OFFSET(C23,-1,0)=\"s\",OFFSET(C23,-1,0)=0),A23<>\"s\",A23>OFFSET(B23,-1,0)),OFFSET(B23,-1,0),A23)))))","v":"S"},{"$f":"IF(OR(C23=\"S\",C23=0),0,IF(ISERROR(K23),J23,SMALL(J23:K23,1)))","v":0},{"$f":"IF($C23=1,OFFSET(E23,-1,0)+1,OFFSET(E23,-1,0))","v":1},{"$f":"IF($C23=1,0,IF($C23=2,OFFSET(F23,-1,0)+1,OFFSET(F23,-1,0)))","v":1},{"$f":"IF(AND($C23<=2,$C23<>0),0,IF($C23=3,OFFSET(G23,-1,0)+1,OFFSET(G23,-1,0)))","v":1},{"$f":"IF(AND($C23<=3,$C23<>0),0,IF($C23=4,OFFSET(H23,-1,0)+1,OFFSET(H23,-1,0)))","v":0},{"$f":"IF(AND($C23<=4,$C23<>0),0,IF(AND($C23=\"S\",$W23>0),OFFSET(I23,-1,0)+1,OFFSET(I23,-1,0)))","v":0},0,0,"F","Serviço","Serviço","1.1.1.0.2.","COMPOSIÇÃO","COMP 010_SEE","DEMOLIÇÃO DE GRADE/GRELHA/CORRIMÃO/GUARDA CORPO - METÁLICO","M2",5,null,null,null,""]
["S",3,"S",0,1,1,1,0,0,0,0,"F","Serviço","Serviço","1.1.1.0.3.","AGETOP",20163,"DEMOLIÇÃO DAS INSTALAÇÕES HIDROSANITÁRIAS E AFINS C/ TRANSP. ATÉ CB. E CARGA","H     ",3,null,null,null,""]
["S",3,"S",0,1,1,1,0,0,0,0,"F","Serviço","Serviço","1.1.1.0.4.","AGETOP",20146,"DEMOLIÇÃO DE MICTÓRIO C/ TRANSP. ATÉ CB. E CARGA","Un    ",2,null,null,null,""]
["S",3,"S",0,1,1,1,0,0,0,0,"F","Serviço","Serviço","1.1.1.0.5.","AGETOP",20141,"DEMOLIÇAO DE CAIXA DESCARGA EXTERNA C/ TRANSP. ATÉ CB. E CARGA","Un    ",3,null,null,null,""]
["S",3,"S",0,1,1,1,0,0,0,0,"F","Serviço","Serviço","1.1.1.0.6.","SINAPI",97644,"REMOÇÃO DE PORTAS, DE FORMA MANUAL, SEM REAPROVEITAMENTO. AF_12/2017","M2",6.24,null,null,null,"Referência: AGETOP - 20106"]
["S",3,"S",0,1,1,1,0,0,0,0,"F","Serviço","Serviço","1.1.1.0.7.","AGETOP",20137,"DEMOLIÇAO BACIA SANITARIA C/ TRANSP. ATÉ CB. E CARGA","Un    ",2,null,null,null,""]
["S",3,"S",0,1,1,1,0,0,0,0,"F","Serviço","Serviço","1.1.1.0.8.","SINAPI",97622,"DEMOLIÇÃO DE ALVENARIA DE BLOCO FURADO, DE FORMA MANUAL, SEM REAPROVEITAMENTO. AF_12/2017","M3",1.32,null,null,null,"Referência: AGETOP - 20118"]
["S",3,"S",0,1,1,1,0,0,0,0,"F","Serviço","Serviço","1.1.1.0.9.","AGETOP",20111,"DEM.PISO CERAM.SOBRE LASTRO CONC.C/TR.CB.E CARGA","m2    ",6.6,null,null,null,""]
["S",3,"S",0,1,1,1,0,0,0,0,"F","Serviço","Serviço","1.1.1.0.10.","AGETOP",20121,"DEM. MANUAL EM CONCR.SIMPLES C/TR.ATE CB.E CARGA (O.C.)","m3    ",1.4900000000000002,null,null,null,""]
["S",3,"S",0,1,1,1,0,0,0,0,"F","Serviço","Serviço","1.1.1.0.11.","SINAPI",97633,"DEMOLIÇÃO DE REVESTIMENTO CERÂMICO, DE FORMA MANUAL, SEM REAPROVEITAMENTO. AF_12/2017","M2",8.32,null,null,null,"Referência: AGETOP - 20115"]
["S",3,"S",0,1,1,1,0,0,0,0,"F","Serviço","Serviço","1.1.1.0.12.","SINAPI",97631,"DEMOLIÇÃO DE ARGAMASSAS, DE FORMA MANUAL, SEM REAPROVEITAMENTO. AF_12/2017","M2",2.5,null,null,null,""]
[3,3,3,5,1,1,2,0,0,17,5,"F","Nível 3","Nível 3","1.1.2.","SINAPI",null,"COBERTURA E FORROS","-",null,null,null,null,""]
["S",3,"S",0,1,1,2,0,0,0,0,"F","Serviço","Serviço","1.1.2.0.1.","AGETOP",20102,"DEMOLICAO-COBERTURA TELHA FIBROCIMENTO/FIBRA DE VIDRO/SIMILARES C/ TRANSP. ATÉ CB. E CARGA","m2    ",996.5,null,null,null,""]
["S",3,"S",0,1,1,2,0,0,0,0,"F","Serviço","Serviço","1.1.2.0.2.","AGETOP",20103,"DEMOLIÇÃO ESTRUTURA EM MADEIRA TELHADO C/ TRANSP. ATÉ CB. E CARGA","m2    ",996.5,null,null,null,""]
["S",3,"S",0,1,1,2,0,0,0,0,"F","Serviço","Serviço","1.1.2.0.3.","SINAPI",97640,"REMOÇÃO DE FORROS DE DRYWALL, PVC E FIBROMINERAL, DE FORMA MANUAL, SEM REAPROVEITAMENTO. AF_12/2017","M2",794,null,null,null,""]
[{"$f":"CHOOSE(1+LOG(1+2*(ORÇAMENTO.Nivel=\"Nível 1\")+4*(ORÇAMENTO.Nivel=\"Nível 2\")+8*(ORÇAMENTO.Nivel=\"Nível 3\")+16*(ORÇAMENTO.Nivel=\"Nível 4\")+32*(ORÇAMENTO.Nivel=\"Serviço\"),2),0,1,2,3,4,\"S\")","v":"S"},{"$f":"IF(OR(C38=\"s\",C38=0),OFFSET(B38,-1,0),C38)","v":3},{"$f":"IF(OFFSET(C38,-1,0)=\"L\",1,IF(OFFSET(C38,-1,0)=1,2,IF(OR(A38=\"s\",A38=0),\"S\",IF(AND(OFFSET(C38,-1,0)=2,A38=4),3,IF(AND(OR(OFFSET(C38,-1,0)=\"s\",OFFSET(C38,-1,0)=0),A38<>\"s\",A38>OFFSET(B38,-1,0)),OFFSET(B38,-1,0),A38)))))","v":"S"},{"$f":"IF(OR(C38=\"S\",C38=0),0,IF(ISERROR(K38),J38,SMALL(J38:K38,1)))","v":0},{"$f":"IF($C38=1,OFFSET(E38,-1,0)+1,OFFSET(E38,-1,0))","v":1},{"$f":"IF($C38=1,0,IF($C38=2,OFFSET(F38,-1,0)+1,OFFSET(F38,-1,0)))","v":1},{"$f":"IF(AND($C38<=2,$C38<>0),0,IF($C38=3,OFFSET(G38,-1,0)+1,OFFSET(G38,-1,0)))","v":2},{"$f":"IF(AND($C38<=3,$C38<>0),0,IF($C38=4,OFFSET(H38,-1,0)+1,OFFSET(H38,-1,0)))","v":0},{"$f":"IF(AND($C38<=4,$C38<>0),0,IF(AND($C38=\"S\",$W38>0),OFFSET(I38,-1,0)+1,OFFSET(I38,-1,0)))","v":0},0,0,"F","Serviço","Serviço","1.1.2.0.4.","SINAPI",97642,"REMOÇÃO DE TRAMA METÁLICA OU DE MADEIRA PARA FORRO, DE FORMA MANUAL, SEM REAPROVEITAMENTO. AF_12/2017","M2",496,null,null,null,""]
[3,{"$f":"IF(OR(C39=\"s\",C39=0),OFFSET(B39,-1,0),C39)","v":3},{"$f":"IF(OFFSET(C39,-1,0)=\"L\",1,IF(OFFSET(C39,-1,0)=1,2,IF(OR(A39=\"s\",A39=0),\"S\",IF(AND(OFFSET(C39,-1,0)=2,A39=4),3,IF(AND(OR(OFFSET(C39,-1,0)=\"s\",OFFSET(C39,-1,0)=0),A39<>\"s\",A39>OFFSET(B39,-1,0)),OFFSET(B39,-1,0),A39)))))","v":3},{"$f":"IF(OR(C39=\"S\",C39=0),0,IF(ISERROR(K39),J39,SMALL(J39:K39,1)))","v":3},{"$f":"IF($C39=1,OFFSET(E39,-1,0)+1,OFFSET(E39,-1,0))","v":1},{"$f":"IF($C39=1,0,IF($C39=2,OFFSET(F39,-1,0)+1,OFFSET(F39,-1,0)))","v":1},{"$f":"IF(AND($C39<=2,$C39<>0),0,IF($C39=3,OFFSET(G39,-1,0)+1,OFFSET(G39,-1,0)))","v":3},{"$f":"IF(AND($C39<=3,$C39<>0),0,IF($C39=4,OFFSET(H39,-1,0)+1,OFFSET(H39,-1,0)))","v":0},{"$f":"IF(AND($C39<=4,$C39<>0),0,IF(AND($C39=\"S\",$W39>0),OFFSET(I39,-1,0)+1,OFFSET(I39,-1,0)))","v":0},12,3,"F","Nível 3","Nível 3","1.1.3.","SINAPI",null,"REFORMA GERAL","-",null,null,null,null,""]
["S",3,"S",0,1,1,3,0,0,0,0,"F","Serviço","Serviço","1.1.3.0.1.","SINAPI","73859/2","CAPINA E LIMPEZA MANUAL DE TERRENO","M2",145,null,null,null,""]
[{"$f":"CHOOSE(1+LOG(1+2*(ORÇAMENTO.Nivel=\"Nível 1\")+4*(ORÇAMENTO.Nivel=\"Nível 2\")+8*(ORÇAMENTO.Nivel=\"Nível 3\")+16*(ORÇAMENTO.Nivel=\"Nível 4\")+32*(ORÇAMENTO.Nivel=\"Serviço\"),2),0,1,2,3,4,\"S\")","v":"S"},{"$f":"IF(OR(C41=\"s\",C41=0),OFFSET(B41,-1,0),C41)","v":3},{"$f":"IF(OFFSET(C41,-1,0)=\"L\",1,IF(OFFSET(C41,-1,0)=1,2,IF(OR(A41=\"s\",A41=0),\"S\",IF(AND(OFFSET(C41,-1,0)=2,A41=4),3,IF(AND(OR(OFFSET(C41,-1,0)=\"s\",OFFSET(C41,-1,0)=0),A41<>\"s\",A41>OFFSET(B41,-1,0)),OFFSET(B41,-1,0),A41)))))","v":"S"},{"$f":"IF(OR(C41=\"S\",C41=0),0,IF(ISERROR(K41),J41,SMALL(J41:K41,1)))","v":0},{"$f":"IF($C41=1,OFFSET(E41,-1,0)+1,OFFSET(E41,-1,0))","v":1},{"$f":"IF($C41=1,0,IF($C41=2,OFFSET(F41,-1,0)+1,OFFSET(F41,-1,0)))","v":1},{"$f":"IF(AND($C41<=2,$C41<>0),0,IF($C41=3,OFFSET(G41,-1,0)+1,OFFSET(G41,-1,0)))","v":3},{"$f":"IF(AND($C41<=3,$C41<>0),0,IF($C41=4,OFFSET(H41,-1,0)+1,OFFSET(H41,-1,0)))","v":0},{"$f":"IF(AND($C41<=4,$C41<>0),0,IF(AND($C41=\"S\",$W41>0),OFFSET(I41,-1,0)+1,OFFSET(I41,-1,0)))","v":0},0,0,"F","Serviço","Serviço","1.1.3.0.2.","SINAPI",85421,"REMOCAO DE VIDRO COMUM","M2",8.5,null,null,null,""]
[3,3,3,3,1,1,4,0,0,9,3,"F","Nível 3","Nível 3","1.1.4.","SINAPI",null,"CANALETA COM GRELHA","-",null,null,null,null,""]
["S",3,"S",0,1,1,4,0,0,0,0,"F","Serviço","Serviço","1.1.4.0.1.","SINAPI",97622,"DEMOLIÇÃO DE ALVENARIA DE BLOCO FURADO, DE FORMA MANUAL, SEM REAPROVEITAMENTO. AF_12/2017","M3",0.23,null,null,null,"Referência: AGETOP - 20118"]
["S",3,"S",0,1,1,4,0,0,0,0,"F","Serviço","Serviço","1.1.4.0.2.","AGETOP",20109,"DEM.PISO CIMENT.SOBRE LASTRO CONC.C/TR.ATE CB. E CARGA","m2    ",6,null,null,null,""]
[3,3,3,4,1,1,5,0,0,6,4,"F","Nível 3","Nível 3","1.1.5.","SINAPI",null,"INST. ELÉTRICAS","-",null,null,null,null,""]
["S",3,"S",0,1,1,5,0,0,0,0,"F","Serviço","Serviço","1.1.5.0.1.","SINAPI",97661,"REMOÇÃO DE CABOS ELÉTRICOS, DE FORMA MANUAL, SEM REAPROVEITAMENTO. AF_12/2017","M",6500,null,null,null,""]
["S",3,"S",0,1,1,5,0,0,0,0,"F","Serviço","Serviço","1.1.5.0.2.","SINAPI",97660,"REMOÇÃO DE INTERRUPTORES/TOMADAS ELÉTRICAS, DE FORMA MANUAL, SEM REAPROVEITAMENTO. AF_12/2017","UN",80,null,null,null,""]
["S",3,"S",0,1,1,5,0,0,0,0,"F","Serviço","Serviço","1.1.5.0.3.","SINAPI",97665,"REMOÇÃO DE LUMINÁRIAS, DE FORMA MANUAL, SEM REAPROVEITAMENTO. AF_12/2017","UN",162,null,null,null,""]
[3,{"$f":"IF(OR(C49=\"s\",C49=0),OFFSET(B49,-1,0),C49)","v":3},{"$f":"IF(OFFSET(C49,-1,0)=\"L\",1,IF(OFFSET(C49,-1,0)=1,2,IF(OR(A49=\"s\",A49=0),\"S\",IF(AND(OFFSET(C49,-1,0)=2,A49=4),3,IF(AND(OR(OFFSET(C49,-1,0)=\"s\",OFFSET(C49,-1,0)=0),A49<>\"s\",A49>OFFSET(B49,-1,0)),OFFSET(B49,-1,0),A49)))))","v":3},{"$f":"IF(OR(C49=\"S\",C49=0),0,IF(ISERROR(K49),J49,SMALL(J49:K49,1)))","v":2},{"$f":"IF($C49=1,OFFSET(E49,-1,0)+1,OFFSET(E49,-1,0))","v":1},{"$f":"IF($C49=1,0,IF($C49=2,OFFSET(F49,-1,0)+1,OFFSET(F49,-1,0)))","v":1},{"$f":"IF(AND($C49<=2,$C49<>0),0,IF($C49=3,OFFSET(G49,-1,0)+1,OFFSET(G49,-1,0)))","v":6},{"$f":"IF(AND($C49<=3,$C49<>0),0,IF($C49=4,OFFSET(H49,-1,0)+1,OFFSET(H49,-1,0)))","v":0},{"$f":"IF(AND($C49<=4,$C49<>0),0,IF(AND($C49=\"S\",$W49>0),OFFSET(I49,-1,0)+1,OFFSET(I49,-1,0)))","v":0},2,{"$error":"#N/A"},"F","Nível 3","Nível 3","1.1.6.","SINAPI",null,"OUTROS","-",null,null,null,null,""]
["S",{"$f":"IF(OR(C50=\"s\",C50=0),OFFSET(B50,-1,0),C50)","v":3},{"$f":"IF(OFFSET(C50,-1,0)=\"L\",1,IF(OFFSET(C50,-1,0)=1,2,IF(OR(A50=\"s\",A50=0),\"S\",IF(AND(OFFSET(C50,-1,0)=2,A50=4),3,IF(AND(OR(OFFSET(C50,-1,0)=\"s\",OFFSET(C50,-1,0)=0),A50<>\"s\",A50>OFFSET(B50,-1,0)),OFFSET(B50,-1,0),A50)))))","v":"S"},{"$f":"IF(OR(C50=\"S\",C50=0),0,IF(ISERROR(K50),J50,SMALL(J50:K50,1)))","v":0},{"$f":"IF($C50=1,OFFSET(E50,-1,0)+1,OFFSET(E50,-1,0))","v":1},{"$f":"IF($C50=1,0,IF($C50=2,OFFSET(F50,-1,0)+1,OFFSET(F50,-1,0)))","v":1},{"$f":"IF(AND($C50<=2,$C50<>0),0,IF($C50=3,OFFSET(G50,-1,0)+1,OFFSET(G50,-1,0)))","v":6},{"$f":"IF(AND($C50<=3,$C50<>0),0,IF($C50=4,OFFSET(H50,-1,0)+1,OFFSET(H50,-1,0)))","v":0},{"$f":"IF(AND($C50<=4,$C50<>0),0,IF(AND($C50=\"S\",$W50>0),OFFSET(I50,-1,0)+1,OFFSET(I50,-1,0)))","v":0},0,0,"F","Serviço","Serviço","1.1.6.0.1.","SINAPI","74209/1","PLACA DE OBRA EM CHAPA DE ACO GALVANIZADO","M2",7.5,null,null,null,"Referência: AGETOP - 21301"]
[2,2,2,3,1,2,0,0,0,284,3,"F","Nível 2","Nível 2","1.2.","AGETOP",null,"TRANSPORTES","-",null,null,null,null,""]
["S",2,"S",0,1,2,0,0,0,0,0,"F","Serviço","Serviço","1.2.0.0.1.","SINAPI",72900,"TRANSPORTE DE ENTULHO COM CAMINHAO BASCULANTE 6 M3, RODOVIA PAVIMENTADA, DMT 0,5 A 1,0 KM","M3",59.595999999999997,null,null,null,""]
["S",2,"S",0,1,2,0,0,0,0,0,"F","Serviço","Serviço","1.2.0.0.2.","SINAPI",72897,"CARGA MANUAL DE ENTULHO EM CAMINHAO BASCULANTE 6 M3","M3",59.595999999999997,null,null,null,""]
[2,2,2,11,1,3,0,0,0,281,11,"F","Nível 2","Nível 2","1.3.","AGETOP",null,"SERVIÇO EM TERRA","-",null,null,null,null,""]
[3,3,3,7,1,3,1,0,0,10,7,"F","Nível 3","Nível 3","1.3.1.","SINAPI",null,"ACESSIBILIDADE","-",null,null,null,null,""]
["S",3,"S",0,1,3,1,0,0,0,0,"F","Serviço","Serviço","1.3.1.0.1.","SINAPI",79480,"ESCAVACAO MECANICA CAMPO ABERTO EM SOLO EXCETO ROCHA ATE 2,00M PROFUNDIDADE","M3",19.225000000000001,null,null,null,"Referência: AGETOP - 41004"]
["S",3,"S",0,1,3,1,0,0,0,0,"F","Serviço","Serviço","1.3.1.0.2.","SINAPI",72898,"CARGA E DESCARGA MECANIZADAS DE ENTULHO EM CAMINHAO BASCULANTE 6 M3","M3",19.225000000000001,null,null,null,"Referência: AGETOP - 41005"]
["S",3,"S",0,1,3,1,0,0,0,0,"F","Serviço","Serviço","1.3.1.0.3.","AGETOP",41012,"INDENIZAÇÃO DE JAZIDA","m3    ",19.225000000000001,null,null,null,""]
["S",3,"S",0,1,3,1,0,0,0,0,"F","Serviço","Serviço","1.3.1.0.4.","AGETOP",41006,"TRANSPORTE DE MATERIAL ESCAVADO M3.KM","m3km  ",192.25,null,null,null,""]
["S",3,"S",0,1,3,1,0,0,0,0,"F","Serviço","Serviço","1.3.1.0.5.","SINAPI","74005/1","COMPACTACAO MECANICA, SEM CONTROLE DO GC (C/COMPACTADOR PLACA 400 KG)","M3",15.38,null,null,null,"Referência: AGETOP - 41009"]
["S",3,"S",0,1,3,1,0,0,0,0,"F","Serviço","Serviço","1.3.1.0.6.","AGETOP",41140,"REGULARIZAÇÃO DO TERRENO SEM APILOAMENTO COM TRANSPORTE MANUAL DA TERRA ESCAVADA ","m2    ",236.6,null,null,null,""]
[3,3,3,3,1,3,2,0,0,3,172,"F","Nível 3","Nível 3","1.3.2.","SINAPI",null,"INST. ELÉTRICAS","-",null,null,null,null,""]
["S",3,"S",0,1,3,2,0,0,0,0,"F","Serviço","Serviço","1.3.2.0.1.","SINAPI",93358,"ESCAVAÇÃO MANUAL DE VALA COM PROFUNDIDADE MENOR OU IGUAL A 1,30 M. AF_03/2016","M3",6.4,null,null,null,"Referência: AGETOP - 40101"]
["S",3,"S",0,1,3,2,0,0,0,0,"F","Serviço","Serviço","1.3.2.0.2.","SINAPI",96995,"REATERRO MANUAL APILOADO COM SOQUETE. AF_10/2017","M3",6.4,null,null,null,"Referência: AGETOP - 40902"]
[{"$f":"CHOOSE(1+LOG(1+2*(ORÇAMENTO.Nivel=\"Nível 1\")+4*(ORÇAMENTO.Nivel=\"Nível 2\")+8*(ORÇAMENTO.Nivel=\"Nível 3\")+16*(ORÇAMENTO.Nivel=\"Nível 4\")+32*(ORÇAMENTO.Nivel=\"Serviço\"),2),0,1,2,3,4,\"S\")","v":2},{"$f":"IF(OR(C65=\"s\",C65=0),OFFSET(B65,-1,0),C65)","v":2},{"$f":"IF(OFFSET(C65,-1,0)=\"L\",1,IF(OFFSET(C65,-1,0)=1,2,IF(OR(A65=\"s\",A65=0),\"S\",IF(AND(OFFSET(C65,-1,0)=2,A65=4),3,IF(AND(OR(OFFSET(C65,-1,0)=\"s\",OFFSET(C65,-1,0)=0),A65<>\"s\",A65>OFFSET(B65,-1,0)),OFFSET(B65,-1,0),A65)))))","v":2},{"$f":"IF(OR(C65=\"S\",C65=0),0,IF(ISERROR(K65),J65,SMALL(J65:K65,1)))","v":137},{"$f":"IF($C65=1,OFFSET(E65,-1,0)+1,OFFSET(E65,-1,0))","v":1},{"$f":"IF($C65=1,0,IF($C65=2,OFFSET(F65,-1,0)+1,OFFSET(F65,-1,0)))","v":4},{"$f":"IF(AND($C65<=2,$C65<>0),0,IF($C65=3,OFFSET(G65,-1,0)+1,OFFSET(G65,-1,0)))","v":0},{"$f":"IF(AND($C65<=3,$C65<>0),0,IF($C65=4,OFFSET(H65,-1,0)+1,OFFSET(H65,-1,0)))","v":0},{"$f":"IF(AND($C65<=4,$C65<>0),0,IF(AND($C65=\"S\",$W65>0),OFFSET(I65,-1,0)+1,OFFSET(I65,-1,0)))","v":0},270,137,"F","Nível 2","Nível 2","1.4.",null,null,"INSTALAÇÕES ELÉTRICAS","-",null,null,null,null,""]
[3,3,3,64,1,4,1,0,0,136,64,"F","Nível 3","Nível 3","1.4.1.","SINAPI",null,"SUBESTAÇÃO","-",null,null,null,null,""]
["S",3,"S",0,1,4,1,0,0,0,0,"F","Serviço","Serviço","1.4.1.0.1.","SINAPI","73767/2","ALCA PRE-FORMADA DISTRIBUIÇÃO EM  ACO RECOBERTO COM ALUMINIO PARA CABO 25MM2, ENCAPADO. FORNECIMENTO E INSTALAÇÃO.","UN",1,null,null,null,""]
["S",3,"S",0,1,4,1,0,0,0,0,"F","Serviço","Serviço","1.4.1.0.2.","AGETOP",70252,"ARRUELA LISA D=5/16\"","Un    ",8,null,null,null,""]
["S",3,"S",0,1,4,1,0,0,0,0,"F","Serviço","Serviço","1.4.1.0.3.","AGETOP",70268,"BARRA DE COBRE 2\" X 3/16\"  (2,0865 KG/M)","m     ",1.5,null,null,null,""]
["S",3,"S",0,1,4,1,0,0,0,0,"F","Serviço","Serviço","1.4.1.0.4.","SINAPI",91175,"FIXAÇÃO DE TUBOS VERTICAIS DE PPR DIÂMETROS MAIORES QUE 75 MM COM ABRAÇADEIRA METÁLICA RÍGIDA TIPO D 3\", FIXADA EM PERFILADO EM ALVENARIA. AF_05/2015","M",6,null,null,null,""]
["S",3,"S",0,1,4,1,0,0,0,0,"F","Serviço","Serviço","1.4.1.0.5.","AGETOP",70386,"BRAÇO C AÇO GALVANIZADO , CONFORME NTD-17","un    ",1,null,null,null,""]
["S",3,"S",0,1,4,1,0,0,0,0,"F","Serviço","Serviço","1.4.1.0.6.","AGETOP",70422,"BUCHA E ARRUELA METALICA DIAM. 1\"","PR    ",2,null,null,null,""]
["S",3,"S",0,1,4,1,0,0,0,0,"F","Serviço","Serviço","1.4.1.0.7.","AGETOP",70426,"BUCHA E ARRUELA METALICA DIAM. 2.1/2\"","PR    ",1,null,null,null,""]
["S",3,"S",0,1,4,1,0,0,0,0,"F","Serviço","Serviço","1.4.1.0.8.","SINAPI",92980,"CABO DE COBRE FLEXÍVEL ISOLADO, 10 MM², ANTI-CHAMA 0,6/1,0 KV, PARA DISTRIBUIÇÃO - FORNECIMENTO E INSTALAÇÃO. AF_12/2015","M",5,null,null,null,""]
["S",3,"S",0,1,4,1,0,0,0,0,"F","Serviço","Serviço","1.4.1.0.9.","SINAPI",92986,"CABO DE COBRE FLEXÍVEL ISOLADO, 35 MM², ANTI-CHAMA 0,6/1,0 KV, PARA DISTRIBUIÇÃO - FORNECIMENTO E INSTALAÇÃO. AF_12/2015","M",15,null,null,null,"Referência: AGETOP - 70512"]
["S",3,"S",0,1,4,1,0,0,0,0,"F","Serviço","Serviço","1.4.1.0.10.","SINAPI",92990,"CABO DE COBRE FLEXÍVEL ISOLADO, 70 MM², ANTI-CHAMA 0,6/1,0 KV, PARA DISTRIBUIÇÃO - FORNECIMENTO E INSTALAÇÃO. AF_12/2015","M",60,null,null,null,"Referência: AGETOP - 70514"]
["S",3,"S",0,1,4,1,0,0,0,0,"F","Serviço","Serviço","1.4.1.0.11.","AGETOP",70543,"CABO DE COBRE NÚ No. 35 MM2","M     ",3,null,null,null,""]
["S",3,"S",0,1,4,1,0,0,0,0,"F","Serviço","Serviço","1.4.1.0.12.","SINAPI",96977,"CORDOALHA DE COBRE NU 50 MM², ENTERRADA, SEM ISOLADOR - FORNECIMENTO E INSTALAÇÃO. AF_12/2017","M",45,null,null,null,""]
["S",3,"S",0,1,4,1,0,0,0,0,"F","Serviço","Serviço","1.4.1.0.13.","AGETOP",70696,"CAIXA METÁLICA PARA PROTEÇÃO GERAL 820X750X266MM DE 250A A 350A","Un    ",1,null,null,null,""]
["S",3,"S",0,1,4,1,0,0,0,0,"F","Serviço","Serviço","1.4.1.0.14.","AGETOP",70697,"CAIXA METÁLICA PARA T.C. 820X750X266MM - 250 A 350A","Un    ",1,null,null,null,""]
["S",3,"S",0,1,4,1,0,0,0,0,"F","Serviço","Serviço","1.4.1.0.15.","SINAPI",97893,"CAIXA ENTERRADA ELÉTRICA RETANGULAR, EM ALVENARIA COM BLOCOS DE CONCRETO, FUNDO COM BRITA, DIMENSÕES INTERNAS: 0,8X0,8X0,6 M. AF_05/2018","UN",1,null,null,null,""]
["S",3,"S",0,1,4,1,0,0,0,0,"F","Serviço","Serviço","1.4.1.0.16.","AGETOP",70771,"CANTONEIRA AUXILIAR PARA BRAÇO TIPO C","un    ",1,null,null,null,""]
["S",3,"S",0,1,4,1,0,0,{"$f":"IF(OR($C83=\"S\",$C83=0),0,MATCH(0,OFFSET($D83,1,$C83,ROW($C$335)-ROW($C83)),0))","v":0},{"$f":"IF(OR($C83=\"S\",$C83=0),0,MATCH(OFFSET($D83,0,$C83)+1,OFFSET($D83,1,$C83,ROW($C$335)-ROW($C83)),0))","v":0},"F","Serviço","Serviço","1.4.1.0.17.","AGETOP",70920,"CINTA DE ACO GALVANIZADO DIAM.190 MM","Un    ",1,null,null,null,""]
["S",3,"S",0,1,4,1,0,0,0,0,"F","Serviço","Serviço","1.4.1.0.18.","AGETOP",70921,"CINTA DE ACO GALVANIZADO DIAM.220 MM","Un    ",2,null,null,null,""]
["S",3,"S",0,1,4,1,0,0,0,0,"F","Serviço","Serviço","1.4.1.0.19.","AGETOP",70922,"CINTA DE ACO GALVANIZADO DIAM.230MM","Un    ",2,null,null,null,""]
["S",3,"S",0,1,4,1,0,0,0,0,"F","Serviço","Serviço","1.4.1.0.20.","AGETOP",71016,"CONECTOR DE COMPRESSÃO FORMATO H PARA CABO 25 A 70 MM2","un    ",4,null,null,null,""]
["S",3,"S",0,1,4,1,0,0,0,0,"F","Serviço","Serviço","1.4.1.0.21.","AGETOP",71020,"CONECTOR PARAL. ALUM.EXTRUD.CA-CU-10,0D.10-2-1 PARAF.","Un    ",6,null,null,null,""]
["S",3,"S",0,1,4,1,0,0,0,0,"F","Serviço","Serviço","1.4.1.0.22.","SINAPI",72272,"CONECTOR PARAFUSO FENDIDO \u0094SPLIT-BOLT\u0094 - PARA CABO DE 35MM2 - FORNECIMENTO E INSTALACAO","UN",1,null,null,null,""]
["S",3,"S",0,1,4,1,0,0,0,0,"F","Serviço","Serviço","1.4.1.0.23.","AGETOP",71037,"CONECTOR TIPO PARAFUSO FENDIDO 70 MM2","Un    ",4,null,null,null,""]
["S",3,"S",0,1,4,1,0,0,0,0,"F","Serviço","Serviço","1.4.1.0.24.","AGETOP",71142,"CURVA DE 90 GRAUS DE PVC RIGIDO DIAM. 1\"","Un    ",1,null,null,null,""]
["S",3,"S",0,1,4,1,0,0,0,0,"F","Serviço","Serviço","1.4.1.0.25.","SINAPI",93022,"CURVA 90 GRAUS PARA ELETRODUTO, PVC, ROSCÁVEL, DN 75 MM (2 1/2\") - FORNECIMENTO E INSTALAÇÃO. AF_12/2015","UN",1,null,null,null,""]
["S",3,"S",0,1,4,1,0,0,0,0,"F","Serviço","Serviço","1.4.1.0.26.","AGETOP",71184,"DISPOSITIVO DE PROTEÇÃO CONTRA SURTOS (D.P.S.) 275V DE 8 A 40KA","Un    ",3,null,null,null,""]
["S",3,"S",0,1,4,1,0,0,0,0,"F","Serviço","Serviço","1.4.1.0.27.","SINAPI","74130/10","DISJUNTOR TERMOMAGNETICO TRIPOLAR EM CAIXA MOLDADA 175 A 225A 240V, FORNECIMENTO E INSTALACAO","UN",1,null,null,null,""]
["S",3,"S",0,1,4,1,0,0,0,0,"F","Serviço","Serviço","1.4.1.0.28.","AGETOP",71202,"ELETRODUTO DE PVC RIGIDO DIAMETRO 1\"","M     ",3,null,null,null,""]
["S",3,"S",0,1,4,1,0,0,0,0,"F","Serviço","Serviço","1.4.1.0.29.","SINAPI",93010,"ELETRODUTO RÍGIDO ROSCÁVEL, PVC, DN 75 MM (2 1/2\") - FORNECIMENTO E INSTALAÇÃO. AF_12/2015","M",3,null,null,null,""]
["S",3,"S",0,1,4,1,0,0,0,0,"F","Serviço","Serviço","1.4.1.0.30.","AGETOP",71216,"ELETRODUTO EM AÇO GALVANIZADO A FOGO DIÂMETRO 2 1/2\" - PESADO ","M     ",7,null,null,null,""]
["S",3,"S",0,1,4,1,0,0,0,0,"F","Serviço","Serviço","1.4.1.0.31.","AGETOP",71268,"ELO FUSÍVEL 6 K","Un    ",1,null,null,null,""]
["S",3,"S",0,1,4,1,0,0,0,0,"F","Serviço","Serviço","1.4.1.0.32.","AGETOP",71321,"FITA DE AUTO FUSAO, ROLO E 10,00 MM","Un    ",5,null,null,null,""]
["S",3,"S",0,1,4,1,0,0,0,0,"F","Serviço","Serviço","1.4.1.0.33.","AGETOP",71365,"GRAMPO DE ANCORAGEM POLIMÉRICO","un    ",3,null,null,null,""]
["S",3,"S",0,1,4,1,0,0,0,0,"F","Serviço","Serviço","1.4.1.0.34.","AGETOP",71381,"HASTE REV.COBRE(COPPERWELD)  5/8\" X 3,00 M C/CONECTOR","Un    ",4,null,null,null,""]
["S",3,"S",0,1,4,1,0,0,0,0,"F","Serviço","Serviço","1.4.1.0.35.","AGETOP",71463,"ISOLADOR EPOXI 50X40 (BUJAO)","Un    ",2,null,null,null,""]
["S",3,"S",0,1,4,1,0,0,0,0,"F","Serviço","Serviço","1.4.1.0.36.","AGETOP",71476,"ISOLADOR DE ANCORAGEM POLIMÉRICO 15KV","un    ",1,null,null,null,""]
["S",3,"S",0,1,4,1,0,0,0,0,"F","Serviço","Serviço","1.4.1.0.37.","AGETOP",71510,"LACO PREFORMADO DE DISTRIBUICAO","Un    ",1,null,null,null,""]
["S",3,"S",0,1,4,1,0,0,0,0,"F","Serviço","Serviço","1.4.1.0.38.","AGETOP",71742,"LUVA PVC ROSQUEAVEL DIAMETRO 1\"","Un    ",1,null,null,null,""]
["S",3,"S",0,1,4,1,0,0,0,0,"F","Serviço","Serviço","1.4.1.0.39.","SINAPI",93015,"LUVA PARA ELETRODUTO, PVC, ROSCÁVEL, DN 75 MM (2 1/2\") - FORNECIMENTO E INSTALAÇÃO. AF_12/2015","UN",1,null,null,null,""]
["S",3,"S",0,1,4,1,0,0,0,0,"F","Serviço","Serviço","1.4.1.0.40.","AGETOP",71706,"LUVA  EM AÇO GALVANIZADO DIÂMETRO 2.1/2\"","Un    ",2,null,null,null,""]
["S",3,"S",0,1,4,1,0,0,0,0,"F","Serviço","Serviço","1.4.1.0.41.","AGETOP",71750,"MANILHA-SAPATILHA EM AÇO GALVANIZADO","un    ",1,null,null,null,""]
["S",3,"S",0,1,4,1,0,0,0,0,"F","Serviço","Serviço","1.4.1.0.42.","AGETOP",71761,"MURETA MEDIÇÃO ALVEN. 1 1/2 V.(35CM) REBOC.C/PINTURA ACRÍL. E LAJE CONC. 20MPA MALHA 8.0MM CADA 10CM REVEST.C/ARGAMASSA 1:3 C/ IMPERMEABILIZANTE","m2    ",4,null,null,null,""]
["S",3,"S",0,1,4,1,0,0,0,0,"F","Serviço","Serviço","1.4.1.0.43.","AGETOP",71773,"NIPLE METALICO Fo.Zo. DIAMETRO 1\"","Un    ",1,null,null,null,""]
["S",3,"S",0,1,4,1,0,0,0,0,"F","Serviço","Serviço","1.4.1.0.44.","AGETOP",71776,"NIPLE METALICO Fo.Zo. DIAMETRO 2.1/2\"","Un    ",2,null,null,null,""]
["S",3,"S",0,1,4,1,0,0,0,0,"F","Serviço","Serviço","1.4.1.0.45.","AGETOP",85047,"NIPLE DUPLO FERRO GALVANIZADO 2.1/2\"","Un    ",1,null,null,null,""]
["S",3,"S",0,1,4,1,0,0,0,0,"F","Serviço","Serviço","1.4.1.0.46.","AGETOP",71795,"OLHAL PARA PARAFUSO","un    ",3,null,null,null,""]
["S",3,"S",0,1,4,1,0,0,0,0,"F","Serviço","Serviço","1.4.1.0.47.","AGETOP",71835,"PARAFUSO CABEÇA ABAULADA (FRANCES) M16 X 45 MM","Un    ",3,null,null,null,""]
["S",3,"S",0,1,4,1,0,0,0,0,"F","Serviço","Serviço","1.4.1.0.48.","AGETOP",71841,"PARAFUSO CABEÇA ABAULADA (FRANCES) M16 X 150 MM","Un    ",3,null,null,null,""]
["S",3,"S",0,1,4,1,0,0,0,0,"F","Serviço","Serviço","1.4.1.0.49.","AGETOP",71833,"PARA RAIOS DISTRIBUIDOR POLIMÉRICO ÓXIDO DE ZINCO S/CENTELHADOR C/ DESLIGAMENTO AUTOMÁTICO 15KV,10KA","Un    ",3,null,null,null,""]
["S",3,"S",0,1,4,1,0,0,0,0,"F","Serviço","Serviço","1.4.1.0.50.","AGETOP",71997,"POSTE - FUNDAÇÃO EM CONCRETO SIMPLES DA BASE DOS POSTES 11/600 PARA TRAFO ( DIAM. 1000MM)","m     ",0.3,null,null,null,""]
["S",3,"S",0,1,4,1,0,0,0,0,"F","Serviço","Serviço","1.4.1.0.51.","AGETOP",72061,"POSTE DE CONCRETO SC 11/600 - SEM FUNDAÇÃO/CONCRETO","Un    ",1,null,null,null,""]
["S",3,"S",0,1,4,1,0,0,0,0,"F","Serviço","Serviço","1.4.1.0.52.","AGETOP",72080,"POSTE/TRAFO - CAMINHÃO MUNCK 12 TON. (MÍNIMO 4H/DIA)","H     ",4,null,null,null,""]
["S",3,"S",0,1,4,1,0,0,0,0,"F","Serviço","Serviço","1.4.1.0.53.","AGETOP",72329,"SAPATILHA DE AÇO GALVANIZADO PARA POSTE COM TRANSFORMADOR","un    ",3,null,null,null,""]
["S",3,"S",0,1,4,1,0,0,0,0,"F","Serviço","Serviço","1.4.1.0.54.","SINAPI",73624,"SUPORTE PARA TRANSFORMADOR EM POSTE DE CONCRETO CIRCULAR","UN",2,null,null,null,""]
["S",3,"S",0,1,4,1,0,0,0,0,"F","Serviço","Serviço","1.4.1.0.55.","AGETOP",72518,"TERMINAL DE PRESSAO 10 MM2","Un    ",1,null,null,null,""]
["S",3,"S",0,1,4,1,0,0,0,0,"F","Serviço","Serviço","1.4.1.0.56.","AGETOP",72528,"TERMINAL DE PRESSAO 35 MM2","Un    ",5,null,null,null,""]
["S",3,"S",0,1,4,1,0,0,0,0,"F","Serviço","Serviço","1.4.1.0.57.","AGETOP",72535,"TERMINAL DE PRESSAO 70 MMM2","Un    ",2,null,null,null,""]
["S",3,"S",0,1,4,1,0,0,0,0,"F","Serviço","Serviço","1.4.1.0.58.","SINAPI","73857/2","TRANSFORMADOR DISTRIBUICAO  112,5KVA TRIFASICO 60HZ CLASSE 15KV IMERSO EM ÓLEO MINERAL FORNECIMENTO E INSTALACAO","UN",1,null,null,null,""]
["S",3,"S",0,1,4,1,0,0,0,0,"F","Serviço","Serviço","1.4.1.0.59.","SINAPI",88543,"ARMACAO SECUNDARIA OU REX COMPLETA PARA TRESLINHAS-FORNECIMENTO E INSTALACAO.","UN",1,null,null,null,""]
["S",3,"S",0,1,4,1,0,0,0,0,"F","Serviço","Serviço","1.4.1.0.60.","COMPOSIÇÃO","COMP 046_SEE","CAPUZ PARA PROTEÇÃO DOS PARA RAIOS","UN ",3,null,null,null,""]
["S",3,"S",0,1,4,1,0,0,0,0,"F","Serviço","Serviço","1.4.1.0.61.","COMPOSIÇÃO","COMP 047_SEE","CAPUZ DE PROTEÇÃO PARA BUCHA DE TRANSFORMADOR","UN ",3,null,null,null,""]
["S",3,"S",0,1,4,1,0,0,0,0,"F","Serviço","Serviço","1.4.1.0.62.","COMPOSIÇÃO","COMP 048_SEE","HASTE ROSQUEADA \"TIRANTE\" 3/8\"","M",0.5,null,null,null,""]
["S",3,"S",0,1,4,1,0,0,0,0,"F","Serviço","Serviço","1.4.1.0.63.","COMPOSIÇÃO","COMP 049_SEE","PORCA SEXTAVADA 3/8\"","UN ",8,null,null,null,""]
[3,3,3,72,1,4,2,0,0,72,104,"F","Nível 3","Nível 3","1.4.2.",null,null,"REFORMA","-",null,null,null,null,""]
["S",3,"S",0,1,4,2,0,0,0,0,"F","Serviço","Serviço","1.4.2.0.1.","AGETOP",70351,"BRACADEIRA METALICA TIPO \"U\" DIAM. 3/4\"","Un    ",1573,null,null,null,""]
["S",3,"S",0,1,4,2,0,0,0,0,"F","Serviço","Serviço","1.4.2.0.2.","AGETOP",70352,"BRACADEIRA METALICA TIPO \"U\" DIAM. 1\"","Un    ",114,null,null,null,""]
["S",3,"S",0,1,4,2,0,0,0,0,"F","Serviço","Serviço","1.4.2.0.3.","AGETOP",70354,"BRACADEIRA METALICA TIPO \"U\" DIAM. 1.1/2\"","Un    ",69,null,null,null,""]
["S",3,"S",0,1,4,2,0,0,0,0,"F","Serviço","Serviço","1.4.2.0.4.","AGETOP",70421,"BUCHA E ARRUELA METALICA DIAM. 3/4\"","PR    ",1781,null,null,null,""]
["S",3,"S",0,1,4,2,0,0,0,0,"F","Serviço","Serviço","1.4.2.0.5.","AGETOP",70422,"BUCHA E ARRUELA METALICA DIAM. 1\"","PR    ",183,null,null,null,""]
["S",3,"S",0,1,4,2,0,0,0,0,"F","Serviço","Serviço","1.4.2.0.6.","AGETOP",70424,"BUCHA E ARRUELA METALICA DIAM. 1.1/2\"","PR    ",32,null,null,null,""]
["S",3,"S",0,1,4,2,0,0,0,0,"F","Serviço","Serviço","1.4.2.0.7.","AGETOP",71861,"PARAFUSO P/BUCHA S-6","Un    ",2000,null,null,null,""]
["S",3,"S",0,1,4,2,0,0,0,0,"F","Serviço","Serviço","1.4.2.0.8.","SINAPI",91926,"CABO DE COBRE FLEXÍVEL ISOLADO, 2,5 MM², ANTI-CHAMA 450/750 V, PARA CIRCUITOS TERMINAIS - FORNECIMENTO E INSTALAÇÃO. AF_12/2015","M",6680,null,null,null,"Referência: AGETOP - 70563"]
["S",3,"S",0,1,4,2,0,0,0,0,"F","Serviço","Serviço","1.4.2.0.9.","SINAPI",91928,"CABO DE COBRE FLEXÍVEL ISOLADO, 4 MM², ANTI-CHAMA 450/750 V, PARA CIRCUITOS TERMINAIS - FORNECIMENTO E INSTALAÇÃO. AF_12/2015","M",860,null,null,null,"Referência: AGETOP - 70564"]
["S",3,"S",0,1,4,2,0,0,0,0,"F","Serviço","Serviço","1.4.2.0.10.","SINAPI",91930,"CABO DE COBRE FLEXÍVEL ISOLADO, 6 MM², ANTI-CHAMA 450/750 V, PARA CIRCUITOS TERMINAIS - FORNECIMENTO E INSTALAÇÃO. AF_12/2015","M",675,null,null,null,"Referência: AGETOP - 70565"]
["S",3,"S",0,1,4,2,0,0,0,0,"F","Serviço","Serviço","1.4.2.0.11.","SINAPI",91929,"CABO DE COBRE FLEXÍVEL ISOLADO, 4 MM², ANTI-CHAMA 0,6/1,0 KV, PARA CIRCUITOS TERMINAIS - FORNECIMENTO E INSTALAÇÃO. AF_12/2015","M",500,null,null,null,"Referência: AGETOP - 70582"]
["S",3,"S",0,1,4,2,0,0,0,0,"F","Serviço","Serviço","1.4.2.0.12.","AGETOP",70514,"CABO EPR/XLPE (90°C) 1 KV - 70 MM2","M     ",150,null,null,null,""]
["S",3,"S",0,1,4,2,0,0,0,0,"F","Serviço","Serviço","1.4.2.0.13.","SINAPI",91931,"CABO DE COBRE FLEXÍVEL ISOLADO, 6 MM², ANTI-CHAMA 0,6/1,0 KV, PARA CIRCUITOS TERMINAIS - FORNECIMENTO E INSTALAÇÃO. AF_12/2015","M",90,null,null,null,"Referência: AGETOP - 70583"]
["S",3,"S",0,1,4,2,0,0,0,0,"F","Serviço","Serviço","1.4.2.0.14.","SINAPI",92980,"CABO DE COBRE FLEXÍVEL ISOLADO, 10 MM², ANTI-CHAMA 0,6/1,0 KV, PARA DISTRIBUIÇÃO - FORNECIMENTO E INSTALAÇÃO. AF_12/2015","M",320,null,null,null,""]
["S",3,"S",0,1,4,2,0,0,0,0,"F","Serviço","Serviço","1.4.2.0.15.","SINAPI",92982,"CABO DE COBRE FLEXÍVEL ISOLADO, 16 MM², ANTI-CHAMA 0,6/1,0 KV, PARA DISTRIBUIÇÃO - FORNECIMENTO E INSTALAÇÃO. AF_12/2015","M",180,null,null,null,""]
["S",3,"S",0,1,4,2,0,0,0,0,"F","Serviço","Serviço","1.4.2.0.16.","SINAPI",92984,"CABO DE COBRE FLEXÍVEL ISOLADO, 25 MM², ANTI-CHAMA 0,6/1,0 KV, PARA DISTRIBUIÇÃO - FORNECIMENTO E INSTALAÇÃO. AF_12/2015","M",320,null,null,null,"Referência: AGETOP - 70511"]
["S",3,"S",0,1,4,2,0,0,{"$f":"IF(OR($C147=\"S\",$C147=0),0,MATCH(0,OFFSET($D147,1,$C147,ROW($C$335)-ROW($C147)),0))","v":0},{"$f":"IF(OR($C147=\"S\",$C147=0),0,MATCH(OFFSET($D147,0,$C147)+1,OFFSET($D147,1,$C147,ROW($C$335)-ROW($C147)),0))","v":0},"F","Serviço","Serviço","1.4.2.0.17.","AGETOP",70646,"CAIXA DE PASSAGEM METÁLICA DE EMBUTIR 20X20X10 CM","Un    ",11,null,null,null,""]
["S",3,"S",0,1,4,2,0,0,0,0,"F","Serviço","Serviço","1.4.2.0.18.","SINAPI",91937,"CAIXA OCTOGONAL 3\" X 3\", PVC, INSTALADA EM LAJE - FORNECIMENTO E INSTALAÇÃO. AF_12/2015","UN",173,null,null,null,""]
["S",3,"S",0,1,4,2,0,0,0,0,"F","Serviço","Serviço","1.4.2.0.19.","SINAPI",92869,"CAIXA RETANGULAR 4\" X 2\" BAIXA (0,30 M DO PISO), METÁLICA, INSTALADA EM PAREDE - FORNECIMENTO E INSTALAÇÃO. AF_12/2015","UN",36,null,null,null,""]
["S",3,"S",0,1,4,2,0,0,0,0,"F","Serviço","Serviço","1.4.2.0.20.","SINAPI",92868,"CAIXA RETANGULAR 4\" X 2\" MÉDIA (1,30 M DO PISO), METÁLICA, INSTALADA EM PAREDE - FORNECIMENTO E INSTALAÇÃO. AF_12/2015","UN",22,null,null,null,"Referência: AGETOP - 70691"]
["S",3,"S",0,1,4,2,0,0,0,0,"F","Serviço","Serviço","1.4.2.0.21.","SINAPI",92867,"CAIXA RETANGULAR 4\" X 2\" ALTA (2,00 M DO PISO), METÁLICA, INSTALADA EM PAREDE - FORNECIMENTO E INSTALAÇÃO. AF_12/2015","UN",33,null,null,null,""]
["S",3,"S",0,1,4,2,0,0,0,0,"F","Serviço","Serviço","1.4.2.0.22.","SINAPI",92872,"CAIXA RETANGULAR 4\" X 4\" BAIXA (0,30 M DO PISO), METÁLICA, INSTALADA EM PAREDE - FORNECIMENTO E INSTALAÇÃO. AF_12/2015","UN",1,null,null,null,""]
["S",3,"S",0,1,4,2,0,0,0,0,"F","Serviço","Serviço","1.4.2.0.23.","SINAPI",92870,"CAIXA RETANGULAR 4\" X 4\" ALTA (2,00 M DO PISO), METÁLICA, INSTALADA EM PAREDE - FORNECIMENTO E INSTALAÇÃO. AF_12/2015","UN",9,null,null,null,""]
["S",3,"S",0,1,4,2,0,0,0,0,"F","Serviço","Serviço","1.4.2.0.24.","SINAPI",97886,"CAIXA ENTERRADA ELÉTRICA RETANGULAR, EM ALVENARIA COM TIJOLOS CERÂMICOS MACIÇOS, FUNDO COM BRITA, DIMENSÕES INTERNAS: 0,3X0,3X0,3 M. AF_05/2018","UN",3,null,null,null,""]
["S",3,"S",0,1,4,2,0,0,0,0,"F","Serviço","Serviço","1.4.2.0.25.","SINAPI",97893,"CAIXA ENTERRADA ELÉTRICA RETANGULAR, EM ALVENARIA COM BLOCOS DE CONCRETO, FUNDO COM BRITA, DIMENSÕES INTERNAS: 0,8X0,8X0,6 M. AF_05/2018","UN",3,null,null,null,""]
["S",3,"S",0,1,4,2,0,0,0,0,"F","Serviço","Serviço","1.4.2.0.26.","AGETOP",70924,"CONDULETE DE PVC - CAIXA COM 5 ENTRADAS ","un    ",114,null,null,null,""]
["S",3,"S",0,1,4,2,0,0,0,0,"F","Serviço","Serviço","1.4.2.0.27.","AGETOP",70926,"CONDULETE DE PVC - ADAPTADOR DE SAÍDA 1\" ","un    ",4,null,null,null,""]
["S",3,"S",0,1,4,2,0,0,0,0,"F","Serviço","Serviço","1.4.2.0.28.","AGETOP",72430,"TAMPA PARA CONDULETE DE PVC PARA 1 INTERRUPTOR ","Un    ",32,null,null,null,""]
["S",3,"S",0,1,4,2,0,0,0,0,"F","Serviço","Serviço","1.4.2.0.29.","AGETOP",72441,"TAMPA PARA CONDULETE DE PVC PARA 1 TOMADA","un    ",82,null,null,null,""]
["S",3,"S",0,1,4,2,0,0,0,0,"F","Serviço","Serviço","1.4.2.0.30.","AGETOP",72385,"TAMPA CEGA PARA CONDULETE DE PVC","Un    ",6,null,null,null,""]
["S",3,"S",0,1,4,2,0,0,0,0,"F","Serviço","Serviço","1.4.2.0.31.","SINAPI",93654,"DISJUNTOR MONOPOLAR TIPO DIN, CORRENTE NOMINAL DE 16A - FORNECIMENTO E INSTALAÇÃO. AF_04/2016","UN",74,null,null,null,""]
["S",3,"S",0,1,4,2,0,0,0,0,"F","Serviço","Serviço","1.4.2.0.32.","SINAPI",93655,"DISJUNTOR MONOPOLAR TIPO DIN, CORRENTE NOMINAL DE 20A - FORNECIMENTO E INSTALAÇÃO. AF_04/2016","UN",25,null,null,null,""]
["S",3,"S",0,1,4,2,0,0,0,0,"F","Serviço","Serviço","1.4.2.0.33.","SINAPI",93656,"DISJUNTOR MONOPOLAR TIPO DIN, CORRENTE NOMINAL DE 25A - FORNECIMENTO E INSTALAÇÃO. AF_04/2016","UN",1,null,null,null,""]
["S",3,"S",0,1,4,2,0,0,0,0,"F","Serviço","Serviço","1.4.2.0.34.","SINAPI",93668,"DISJUNTOR TRIPOLAR TIPO DIN, CORRENTE NOMINAL DE 16A - FORNECIMENTO E INSTALAÇÃO. AF_04/2016","UN",4,null,null,null,""]
["S",3,"S",0,1,4,2,0,0,0,0,"F","Serviço","Serviço","1.4.2.0.35.","SINAPI",93669,"DISJUNTOR TRIPOLAR TIPO DIN, CORRENTE NOMINAL DE 20A - FORNECIMENTO E INSTALAÇÃO. AF_04/2016","UN",2,null,null,null,""]
["S",3,"S",0,1,4,2,0,0,0,0,"F","Serviço","Serviço","1.4.2.0.36.","SINAPI",93670,"DISJUNTOR TRIPOLAR TIPO DIN, CORRENTE NOMINAL DE 25A - FORNECIMENTO E INSTALAÇÃO. AF_04/2016","UN",2,null,null,null,"Referência: AGETOP - 71173"]
["S",3,"S",0,1,4,2,0,0,0,0,"F","Serviço","Serviço","1.4.2.0.37.","SINAPI","74130/5","DISJUNTOR TERMOMAGNETICO TRIPOLAR PADRAO NEMA (AMERICANO) 60 A 100A 240V, FORNECIMENTO E INSTALACAO","UN",6,null,null,null,""]
["S",3,"S",0,1,4,2,0,0,0,0,"F","Serviço","Serviço","1.4.2.0.38.","AGETOP",71184,"DISPOSITIVO DE PROTEÇÃO CONTRA SURTOS (D.P.S.) 275V DE 8 A 40KA","Un    ",4,null,null,null,""]
["S",3,"S",0,1,4,2,0,0,0,0,"F","Serviço","Serviço","1.4.2.0.39.","SINAPI","74130/10","DISJUNTOR TERMOMAGNETICO TRIPOLAR EM CAIXA MOLDADA 175 A 225A 240V, FORNECIMENTO E INSTALACAO","UN",1,null,null,null,""]
["S",3,"S",0,1,4,2,0,0,0,0,"F","Serviço","Serviço","1.4.2.0.40.","AGETOP",71450,"INTERRUPTOR DIFERENCIAL RESIDUAL (D.R.) BIPOLAR DE 25A-30mA","Un    ",6,null,null,null,""]
["S",3,"S",0,1,4,2,0,0,0,0,"F","Serviço","Serviço","1.4.2.0.41.","SINAPI",91952,"INTERRUPTOR SIMPLES (1 MÓDULO), 10A/250V, SEM SUPORTE E SEM PLACA - FORNECIMENTO E INSTALAÇÃO. AF_12/2015","UN",32,null,null,null,""]
["S",3,"S",0,1,4,2,0,0,0,0,"F","Serviço","Serviço","1.4.2.0.42.","SINAPI",91953,"INTERRUPTOR SIMPLES (1 MÓDULO), 10A/250V, INCLUINDO SUPORTE E PLACA - FORNECIMENTO E INSTALAÇÃO. AF_12/2015","UN",5,null,null,null,"Referência: AGETOP - 71440"]
["S",3,"S",0,1,4,2,0,0,0,0,"F","Serviço","Serviço","1.4.2.0.43.","SINAPI",91959,"INTERRUPTOR SIMPLES (2 MÓDULOS), 10A/250V, INCLUINDO SUPORTE E PLACA - FORNECIMENTO E INSTALAÇÃO. AF_12/2015","UN",2,null,null,null,"Referência: AGETOP - 71441"]
["S",3,"S",0,1,4,2,0,0,0,0,"F","Serviço","Serviço","1.4.2.0.44.","SINAPI",91967,"INTERRUPTOR SIMPLES (3 MÓDULOS), 10A/250V, INCLUINDO SUPORTE E PLACA - FORNECIMENTO E INSTALAÇÃO. AF_12/2015","UN",1,null,null,null,"Referência: AGETOP - 71442"]
["S",3,"S",0,1,4,2,0,0,0,0,"F","Serviço","Serviço","1.4.2.0.45.","SINAPI",92023,"INTERRUPTOR SIMPLES (1 MÓDULO) COM 1 TOMADA DE EMBUTIR 2P+T 10 A,  INCLUINDO SUPORTE E PLACA - FORNECIMENTO E INSTALAÇÃO. AF_12/2015","UN",9,null,null,null,""]
["S",3,"S",0,1,4,2,0,0,0,0,"F","Serviço","Serviço","1.4.2.0.46.","SINAPI",92027,"INTERRUPTOR SIMPLES (2 MÓDULOS) COM 1 TOMADA DE EMBUTIR 2P+T 10 A,  INCLUINDO SUPORTE E PLACA - FORNECIMENTO E INSTALAÇÃO. AF_12/2015","UN",1,null,null,null,""]
["S",3,"S",0,1,4,2,0,0,0,0,"F","Serviço","Serviço","1.4.2.0.47.","SINAPI",91871,"ELETRODUTO RÍGIDO ROSCÁVEL, PVC, DN 25 MM (3/4\"), PARA CIRCUITOS TERMINAIS, INSTALADO EM PAREDE - FORNECIMENTO E INSTALAÇÃO. AF_12/2015","M",1415,null,null,null,"Referência: AGETOP - 71201"]
["S",3,"S",0,1,4,2,0,0,0,0,"F","Serviço","Serviço","1.4.2.0.48.","SINAPI",91872,"ELETRODUTO RÍGIDO ROSCÁVEL, PVC, DN 32 MM (1\"), PARA CIRCUITOS TERMINAIS, INSTALADO EM PAREDE - FORNECIMENTO E INSTALAÇÃO. AF_12/2015","M",170,null,null,null,"Referência: AGETOP - 71202"]
["S",3,"S",0,1,4,2,0,0,0,0,"F","Serviço","Serviço","1.4.2.0.49.","SINAPI",93008,"ELETRODUTO RÍGIDO ROSCÁVEL, PVC, DN 50 MM (1 1/2\") - FORNECIMENTO E INSTALAÇÃO. AF_12/2015","M",230,null,null,null,""]
["S",3,"S",0,1,4,2,0,0,0,0,"F","Serviço","Serviço","1.4.2.0.50.","AGETOP",71208,"ELETRODUTO DE PVC RIGIDO DIAMETRO 4\"","M     ",30,null,null,null,""]
["S",3,"S",0,1,4,2,0,0,0,0,"F","Serviço","Serviço","1.4.2.0.51.","AGETOP",71193,"ELETRODUTO PVC FLEXÍVEL - MANGUEIRA CORRUGADA LEVE - DIAM. 20MM","M     ",80,null,null,null,""]
["S",3,"S",0,1,4,2,0,0,0,0,"F","Serviço","Serviço","1.4.2.0.52.","AGETOP",71194,"ELETRODUTO PVC FLEXÍVEL - MANGUEIRA CORRUGADA LEVE - DIAM. 25MM","M     ",25,null,null,null,""]
["S",3,"S",0,1,4,2,0,0,0,0,"F","Serviço","Serviço","1.4.2.0.53.","AGETOP",71194,"ELETRODUTO PVC FLEXÍVEL - MANGUEIRA CORRUGADA LEVE - DIAM. 25MM","M     ",80,null,null,null,""]
["S",3,"S",0,1,4,2,0,0,0,0,"F","Serviço","Serviço","1.4.2.0.54.","AGETOP",71321,"FITA DE AUTO FUSAO, ROLO E 10,00 MM","Un    ",10,null,null,null,""]
["S",3,"S",0,1,4,2,0,0,0,0,"F","Serviço","Serviço","1.4.2.0.55.","AGETOP",71331,"FITA ISOLANTE, ROLO DE 20,00 M","Un    ",5,null,null,null,""]
["S",3,"S",0,1,4,2,0,0,0,0,"F","Serviço","Serviço","1.4.2.0.56.","SINAPI",97600,"REFLETOR EM ALUMÍNIO COM SUPORTE E ALÇA, LÂMPADA 125 W - FORNECIMENTO E INSTALAÇÃO. AF_11/2017","UN",9,null,null,null,""]
["S",3,"S",0,1,4,2,0,0,0,0,"F","Serviço","Serviço","1.4.2.0.57.","SINAPI",97585,"LUMINÁRIA TIPO CALHA, DE SOBREPOR, COM 2 LÂMPADAS TUBULARES DE 18 W - FORNECIMENTO E INSTALAÇÃO. AF_11/2017","UN",162,null,null,null,""]
["S",3,"S",0,1,4,2,0,0,0,0,"F","Serviço","Serviço","1.4.2.0.58.","SINAPI",97605,"LUMINÁRIA ARANDELA TIPO MEIA-LUA, PARA 1 LÂMPADA LED - FORNECIMENTO E INSTALAÇÃO. AF_11/2017","UN",4,null,null,null,""]
["S",3,"S",0,1,4,2,0,0,0,0,"F","Serviço","Serviço","1.4.2.0.59.","COMPOSIÇÃO","COMP 387_SEE","LÂMPADA LED TUBULAR 18W ","UN ",324,null,null,null,""]
["S",3,"S",0,1,4,2,0,0,0,0,"F","Serviço","Serviço","1.4.2.0.60.","SINAPI",91884,"LUVA PARA ELETRODUTO, PVC, ROSCÁVEL, DN 25 MM (3/4\"), PARA CIRCUITOS TERMINAIS, INSTALADA EM PAREDE - FORNECIMENTO E INSTALAÇÃO. AF_12/2015","UN",175,null,null,null,"Referência: AGETOP - 71741"]
["S",3,"S",0,1,4,2,0,0,0,0,"F","Serviço","Serviço","1.4.2.0.61.","COMPOSIÇÃO","COMP 330_SEE","LUVA SIMPLES 1\"","UN ",20,null,null,null,""]
["S",3,"S",0,1,4,2,0,0,0,0,"F","Serviço","Serviço","1.4.2.0.62.","SINAPI",93013,"LUVA PARA ELETRODUTO, PVC, ROSCÁVEL, DN 50 MM (1 1/2\") - FORNECIMENTO E INSTALAÇÃO. AF_12/2015","UN",7,null,null,null,"Referência: AGETOP - 71744"]
["S",3,"S",0,1,4,2,0,0,0,0,"F","Serviço","Serviço","1.4.2.0.63.","SINAPI","74131/8","QUADRO DE DISTRIBUICAO DE ENERGIA DE EMBUTIR, EM CHAPA METALICA, PARA 50 DISJUNTORES TERMOMAGNETICOS MONOPOLARES, COM BARRAMENTO TRIFASICO E NEUTRO, FORNECIMENTO E INSTALACAO","UN",1,null,null,null,"Referência: AGETOP - 72201"]
["S",3,"S",0,1,4,2,0,0,0,0,"F","Serviço","Serviço","1.4.2.0.64.","SINAPI","74131/4","QUADRO DE DISTRIBUICAO DE ENERGIA DE EMBUTIR, EM CHAPA METALICA, PARA 18 DISJUNTORES TERMOMAGNETICOS MONOPOLARES, COM BARRAMENTO TRIFASICO E NEUTRO, FORNECIMENTO E INSTALACAO","UN",6,null,null,null,""]
["S",3,"S",0,1,4,2,0,0,0,0,"F","Serviço","Serviço","1.4.2.0.65.","AGETOP",72425,"TAMPA CEGA PLASTICA RETANGULAR 4\"X2\"","Un    ",1,null,null,null,""]
["S",3,"S",0,1,4,2,0,0,0,0,"F","Serviço","Serviço","1.4.2.0.66.","AGETOP",72400,"TAMPA CEGA PLASTICA QUADRADA 4\"X4\"","Un    ",1,null,null,null,""]
["S",3,"S",0,1,4,2,0,0,0,0,"F","Serviço","Serviço","1.4.2.0.67.","AGETOP",72578,"TOMADA HEXAGONAL 2P + T - 10A - 250V","Un    ",82,null,null,null,""]
["S",3,"S",0,1,4,2,0,0,0,0,"F","Serviço","Serviço","1.4.2.0.68.","SINAPI",92000,"TOMADA BAIXA DE EMBUTIR (1 MÓDULO), 2P+T 10 A, INCLUINDO SUPORTE E PLACA - FORNECIMENTO E INSTALAÇÃO. AF_12/2015","UN",15,null,null,null,"Referência: AGETOP - 72578"]
["S",3,"S",0,1,4,2,0,0,0,0,"F","Serviço","Serviço","1.4.2.0.69.","SINAPI",91992,"TOMADA ALTA DE EMBUTIR (1 MÓDULO), 2P+T 10 A, INCLUINDO SUPORTE E PLACA - FORNECIMENTO E INSTALAÇÃO. AF_12/2015","UN",5,null,null,null,""]
["S",3,"S",0,1,4,2,0,0,0,0,"F","Serviço","Serviço","1.4.2.0.70.","SINAPI",91993,"TOMADA ALTA DE EMBUTIR (1 MÓDULO), 2P+T 20 A, INCLUINDO SUPORTE E PLACA - FORNECIMENTO E INSTALAÇÃO. AF_12/2015","UN",29,null,null,null,"Referência: AGETOP - 72585"]
["S",3,"S",0,1,4,2,0,0,0,0,"F","Serviço","Serviço","1.4.2.0.71.","SINAPI",92004,"TOMADA MÉDIA DE EMBUTIR (2 MÓDULOS), 2P+T 10 A, INCLUINDO SUPORTE E PLACA - FORNECIMENTO E INSTALAÇÃO. AF_12/2015","UN",22,null,null,null,"Referência: AGETOP - 72578"]
[{"$f":"CHOOSE(1+LOG(1+2*(ORÇAMENTO.Nivel=\"Nível 1\")+4*(ORÇAMENTO.Nivel=\"Nível 2\")+8*(ORÇAMENTO.Nivel=\"Nível 3\")+16*(ORÇAMENTO.Nivel=\"Nível 4\")+32*(ORÇAMENTO.Nivel=\"Serviço\"),2),0,1,2,3,4,\"S\")","v":2},2,2,52,1,5,0,0,0,133,52,"F","Nível 2","Nível 2","1.5.","AGETOP",null,"INSTALAÇÕES HIDROSSANITÁRIAS","-",null,null,null,null,""]
[3,3,3,18,1,5,1,0,0,51,18,"F","Nível 3","Nível 3","1.5.1.","SINAPI",null,"PEÇAS E ACESSÓRIOS","-",null,null,null,null,""]
[4,4,4,8,1,5,1,1,0,17,8,"F","Nível 4","Nível 4","1.5.1.1.","SINAPI",null,"VASO SANITÁRIO E ACESSÓRIOS","-",null,null,null,null,""]
["S",4,"S",0,1,5,1,1,0,0,0,"F","Serviço","Serviço","1.5.1.1.1.","SINAPI",95470,"VASO SANITARIO SIFONADO CONVENCIONAL COM LOUÇA BRANCA, INCLUSO CONJUNTO DE LIGAÇÃO PARA BACIA SANITÁRIA AJUSTÁVEL - FORNECIMENTO E INSTALAÇÃO. AF_10/2016","UN",2,null,null,null,""]
["S",4,"S",0,1,5,1,1,0,0,0,"F","Serviço","Serviço","1.5.1.1.2.","AGETOP",80520,"CONJUNTO DE FIXACAO P/VASO SANITARIO (PAR)","CJ    ",2,null,null,null,""]
["S",4,"S",0,1,5,1,1,0,0,0,"F","Serviço","Serviço","1.5.1.1.3.","AGETOP",80511,"CAIXA DE DESCARGA EXTERNA","Un    ",3,null,null,null,""]
["S",4,"S",0,1,5,1,1,0,0,0,"F","Serviço","Serviço","1.5.1.1.4.","AGETOP",80556,"LIGAÇÃO FLEXÍVEL PVC DIAM.1/2\" (ENGATE)","Un    ",3,null,null,null,""]
["S",4,"S",0,1,5,1,1,0,0,0,"F","Serviço","Serviço","1.5.1.1.5.","AGETOP",80512,"TUBO DE DESCIDA PARA CAIXA DE DESCARGA ( LONGO 1 1/4\" )","Un    ",3,null,null,null,""]
["S",4,"S",0,1,5,1,1,0,0,0,"F","Serviço","Serviço","1.5.1.1.6.","AGETOP",80526,"ASSENTO EM POLIPROPILENO COM SISTEMA DE FECHAMENTO SUAVE PARA VASO SANITÁRIO","Un    ",2,null,null,null,""]
["S",4,"S",0,1,5,1,1,0,{"$f":"IF(OR($C211=\"S\",$C211=0),0,MATCH(0,OFFSET($D211,1,$C211,ROW($C$335)-ROW($C211)),0))","v":0},{"$f":"IF(OR($C211=\"S\",$C211=0),0,MATCH(OFFSET($D211,0,$C211)+1,OFFSET($D211,1,$C211,ROW($C$335)-ROW($C211)),0))","v":0},"F","Serviço","Serviço","1.5.1.1.7.","AGETOP",80510,"ANEL DE VEDAÇÃO PARA VASO SANITÁRIO","Un    ",2,null,null,null,""]
[4,4,4,7,1,5,1,2,0,9,7,"F","Nível 4","Nível 4","1.5.1.2.","SINAPI",null,"LAVATÓRIO E ACESSÓRIOS","-",null,null,null,null,""]
["S",4,"S",0,1,5,1,2,0,0,0,"F","Serviço","Serviço","1.5.1.2.1.","AGETOP",80542,"LAVATÓRIO MÉDIO SEM COLUNA","Un    ",2,null,null,null,""]
["S",4,"S",0,1,5,1,2,0,0,0,"F","Serviço","Serviço","1.5.1.2.2.","AGETOP",80550,"FIXACAO P/LAVATORIO (PAR)","PAR   ",2,null,null,null,""]
["S",4,"S",0,1,5,1,2,0,0,0,"F","Serviço","Serviço","1.5.1.2.3.","AGETOP",80556,"LIGAÇÃO FLEXÍVEL PVC DIAM.1/2\" (ENGATE)","Un    ",2,null,null,null,""]
["S",4,"S",0,1,5,1,2,0,0,0,"F","Serviço","Serviço","1.5.1.2.4.","SINAPI",86883,"SIFÃO DO TIPO FLEXÍVEL EM PVC 1\u0094 X 1.1/2\u0094 - FORNECIMENTO E INSTALAÇÃO. AF_12/2013","UN",2,null,null,null,""]
["S",4,"S",0,1,5,1,2,0,0,0,"F","Serviço","Serviço","1.5.1.2.5.","SINAPI",86906,"TORNEIRA CROMADA DE MESA, 1/2\" OU 3/4\", PARA LAVATÓRIO, PADRÃO POPULAR - FORNECIMENTO E INSTALAÇÃO. AF_12/2013","UN",8,null,null,null,""]
["S",4,"S",0,1,5,1,2,0,0,0,"F","Serviço","Serviço","1.5.1.2.6.","SINAPI",86877,"VÁLVULA EM METAL CROMADO 1.1/2\" X 1.1/2\" PARA TANQUE OU LAVATÓRIO, COM OU SEM LADRÃO - FORNECIMENTO E INSTALAÇÃO. AF_12/2013","UN",2,null,null,null,""]
[4,4,4,2,1,5,1,3,0,2,10,"F","Nível 4","Nível 4","1.5.1.3.","SINAPI",null,"MICTÓRIO","-",null,null,null,null,""]
["S",4,"S",0,1,5,1,3,0,0,0,"F","Serviço","Serviço","1.5.1.3.1.","SINAPI","74234/1","MICTORIO SIFONADO DE LOUCA BRANCA COM PERTENCES, COM REGISTRO DE PRESSAO 1/2\" COM CANOPLA CROMADA ACABAMENTO SIMPLES E CONJUNTO PARA FIXACAO  - FORNECIMENTO E INSTALACAO","UN",2,null,null,null,"Referência: AGETOP - 80601"]
[3,3,3,13,1,5,2,0,0,33,13,"F","Nível 3","Nível 3","1.5.2.","SINAPI",null,"ÁGUA FRIA","-",null,null,null,null,""]
[4,4,4,2,1,5,2,1,0,12,2,"F","Nível 4","Nível 4","1.5.2.1.","SINAPI",null,"TUBOS DE PVC SOLDÁVEL","-",null,null,null,null,""]
["S",4,"S",0,1,5,2,1,0,0,0,"F","Serviço","Serviço","1.5.2.1.1.","SINAPI",89402,"TUBO, PVC, SOLDÁVEL, DN 25MM, INSTALADO EM RAMAL DE DISTRIBUIÇÃO DE ÁGUA - FORNECIMENTO E INSTALAÇÃO. AF_12/2014","M",18,null,null,null,"Referência: AGETOP - 81003"]
[4,4,4,2,1,5,2,2,0,10,2,"F","Nível 4","Nível 4","1.5.2.2.","SINAPI",null,"LUVAS DE PVC","-",null,null,null,null,""]
["S",4,"S",0,1,5,2,2,0,0,0,"F","Serviço","Serviço","1.5.2.2.1.","SINAPI",89528,"LUVA, PVC, SOLDÁVEL, DN 25MM, INSTALADO EM PRUMADA DE ÁGUA - FORNECIMENTO E INSTALAÇÃO. AF_12/2014","UN",2,null,null,null,""]
[4,4,4,3,1,5,2,3,0,8,3,"F","Nível 4","Nível 4","1.5.2.3.","SINAPI",null,"JOELHO","-",null,null,null,null,""]
["S",4,"S",0,1,5,2,3,0,0,0,"F","Serviço","Serviço","1.5.2.3.1.","SINAPI",90373,"JOELHO 90 GRAUS COM BUCHA DE LATÃO, PVC, SOLDÁVEL, DN 25MM, X 1/2\u0094 INSTALADO EM RAMAL OU SUB-RAMAL DE ÁGUA - FORNECIMENTO E INSTALAÇÃO. AF_12/2014","UN",2,null,null,null,"Referência: AGETOP - 81360"]
["S",4,"S",0,1,5,2,3,0,0,0,"F","Serviço","Serviço","1.5.2.3.2.","SINAPI",89481,"JOELHO 90 GRAUS, PVC, SOLDÁVEL, DN 25MM, INSTALADO EM PRUMADA DE ÁGUA - FORNECIMENTO E INSTALAÇÃO. AF_12/2014","UN",6,null,null,null,""]
[4,4,4,2,1,5,2,4,0,5,2,"F","Nível 4","Nível 4","1.5.2.4.","SINAPI",null,"TÊ","-",null,null,null,null,""]
["S",4,"S",0,1,5,2,4,0,0,0,"F","Serviço","Serviço","1.5.2.4.1.","SINAPI",89617,"TE, PVC, SOLDÁVEL, DN 25MM, INSTALADO EM PRUMADA DE ÁGUA - FORNECIMENTO E INSTALAÇÃO. AF_12/2014","UN",2,null,null,null,""]
[4,4,4,3,1,5,2,5,0,3,{"$error":"#N/A"},"F","Nível 4","Nível 4","1.5.2.5.","SINAPI",null,"ADESIVOS","-",null,null,null,null,""]
["S",4,"S",0,1,5,2,5,0,0,0,"F","Serviço","Serviço","1.5.2.5.1.","AGETOP",81501,"ADESIVO PLASTICO - FRASCO 850 G","Un    ",1,null,null,null,""]
["S",4,"S",0,1,5,2,5,0,0,0,"F","Serviço","Serviço","1.5.2.5.2.","AGETOP",81504,"SOLUCAO LIMPADORA 1000 CM3","Un    ",1,null,null,null,""]
[3,3,3,13,1,5,3,0,0,20,13,"F","Nível 3","Nível 3","1.5.3.","SINAPI",null,"ESGOTO SANITÁRIO","-",null,null,null,null,""]
[4,4,4,2,1,5,3,1,0,12,2,"F","Nível 4","Nível 4","1.5.3.1.","SINAPI",null,"CURVAS","-",null,null,null,null,""]
["S",4,"S",0,1,5,3,1,0,0,0,"F","Serviço","Serviço","1.5.3.1.1.","SINAPI",89728,"CURVA CURTA 90 GRAUS, PVC, SERIE NORMAL, ESGOTO PREDIAL, DN 40 MM, JUNTA SOLDÁVEL, FORNECIDO E INSTALADO EM RAMAL DE DESCARGA OU RAMAL DE ESGOTO SANITÁRIO. AF_12/2014","UN",2,null,null,null,""]
[4,4,4,3,1,5,3,2,0,10,3,"F","Nível 4","Nível 4","1.5.3.2.","SINAPI",null,"JOELHOS","-",null,null,null,null,""]
["S",4,"S",0,1,5,3,2,0,0,0,"F","Serviço","Serviço","1.5.3.2.1.","SINAPI",89726,"JOELHO 45 GRAUS, PVC, SERIE NORMAL, ESGOTO PREDIAL, DN 40 MM, JUNTA SOLDÁVEL, FORNECIDO E INSTALADO EM RAMAL DE DESCARGA OU RAMAL DE ESGOTO SANITÁRIO. AF_12/2014","UN",4,null,null,null,""]
["S",4,"S",0,1,5,3,2,0,0,0,"F","Serviço","Serviço","1.5.3.2.2.","AGETOP",81927,"JOELHO 90 GRAUS C/ANEL 40 mm ","Un    ",2,null,null,null,""]
[4,4,4,3,1,5,3,3,0,7,3,"F","Nível 4","Nível 4","1.5.3.3.","SINAPI",null,"LUVAS","-",null,null,null,null,""]
["S",4,"S",0,1,5,3,3,0,0,0,"F","Serviço","Serviço","1.5.3.3.1.","SINAPI",89752,"LUVA SIMPLES, PVC, SERIE NORMAL, ESGOTO PREDIAL, DN 40 MM, JUNTA SOLDÁVEL, FORNECIDO E INSTALADO EM RAMAL DE DESCARGA OU RAMAL DE ESGOTO SANITÁRIO. AF_12/2014","UN",4,null,null,null,"Referência: AGETOP - 82001"]
["S",4,"S",0,1,5,3,3,0,0,0,"F","Serviço","Serviço","1.5.3.3.2.","SINAPI",89753,"LUVA SIMPLES, PVC, SERIE NORMAL, ESGOTO PREDIAL, DN 50 MM, JUNTA ELÁSTICA, FORNECIDO E INSTALADO EM RAMAL DE DESCARGA OU RAMAL DE ESGOTO SANITÁRIO. AF_12/2014","UN",2,null,null,null,"Referência: AGETOP - 82002"]
[4,4,4,4,1,5,3,4,0,4,{"$error":"#N/A"},"F","Nível 4","Nível 4","1.5.3.4.","SINAPI",null,"TUBOS","-",null,null,null,null,""]
["S",4,"S",0,1,5,3,4,0,0,0,"F","Serviço","Serviço","1.5.3.4.1.","SINAPI",89711,"TUBO PVC, SERIE NORMAL, ESGOTO PREDIAL, DN 40 MM, FORNECIDO E INSTALADO EM RAMAL DE DESCARGA OU RAMAL DE ESGOTO SANITÁRIO. AF_12/2014","M",18,null,null,null,"Referência: AGETOP - 82301"]
["S",4,"S",0,1,5,3,4,0,0,0,"F","Serviço","Serviço","1.5.3.4.2.","SINAPI",89798,"TUBO PVC, SERIE NORMAL, ESGOTO PREDIAL, DN 50 MM, FORNECIDO E INSTALADO EM PRUMADA DE ESGOTO SANITÁRIO OU VENTILAÇÃO. AF_12/2014","M",18,null,null,null,""]
["S",4,"S",0,1,5,3,4,0,0,0,"F","Serviço","Serviço","1.5.3.4.3.","SINAPI",89800,"TUBO PVC, SERIE NORMAL, ESGOTO PREDIAL, DN 100 MM, FORNECIDO E INSTALADO EM PRUMADA DE ESGOTO SANITÁRIO OU VENTILAÇÃO. AF_12/2014","M",12,null,null,null,""]
[3,3,3,7,1,5,4,0,0,7,{"$error":"#N/A"},"F","Nível 3","Nível 3","1.5.4.","SINAPI",null,"OUTROS","-",null,null,null,null,""]
["S",3,"S",0,1,5,4,0,0,0,0,"F","Serviço","Serviço","1.5.4.0.1.","AGETOP",230174,"BARRA DE APOIO EM AÇO INOX - 40 CM","un    ",8,null,null,null,""]
["S",3,"S",0,1,5,4,0,0,0,0,"F","Serviço","Serviço","1.5.4.0.2.","AGETOP",230176,"BARRA DE APOIO EM AÇO INOX - 80 CM ","un    ",6,null,null,null,""]
["S",3,"S",0,1,5,4,0,0,0,0,"F","Serviço","Serviço","1.5.4.0.3.","AGETOP",81663,"CORPO CX. SIFONADA DIAM. 150 X 150 X 50","Un    ",2,null,null,null,""]
["S",3,"S",0,1,5,4,0,0,0,0,"F","Serviço","Serviço","1.5.4.0.4.","AGETOP",81761,"GRELHA QUADRADA ACO INOX SIMPLES DIAM.150 MM","Un    ",2,null,null,null,""]
["S",3,"S",0,1,5,4,0,0,0,0,"F","Serviço","Serviço","1.5.4.0.5.","AGETOP",180323,"GRELHA PADRÃO GOINFRA DE FERRO CHATO COM BERÇO (ESPAÇAMENTO ENTRE FACES = 1,5CM - NBR 9050 ACESSIBILIDADE)","m2    ",4.8,null,null,null,""]
["S",3,"S",0,1,5,4,0,0,0,0,"F","Serviço","Serviço","1.5.4.0.6.","AGETOP",271417,"CANALETA CONCRETO DESEMPENADO 5 CM PD.GOINFRA","m     ",12,null,null,null,""]
[{"$f":"CHOOSE(1+LOG(1+2*(ORÇAMENTO.Nivel=\"Nível 1\")+4*(ORÇAMENTO.Nivel=\"Nível 2\")+8*(ORÇAMENTO.Nivel=\"Nível 3\")+16*(ORÇAMENTO.Nivel=\"Nível 4\")+32*(ORÇAMENTO.Nivel=\"Serviço\"),2),0,1,2,3,4,\"S\")","v":2},{"$f":"IF(OR(C254=\"s\",C254=0),OFFSET(B254,-1,0),C254)","v":2},{"$f":"IF(OFFSET(C254,-1,0)=\"L\",1,IF(OFFSET(C254,-1,0)=1,2,IF(OR(A254=\"s\",A254=0),\"S\",IF(AND(OFFSET(C254,-1,0)=2,A254=4),3,IF(AND(OR(OFFSET(C254,-1,0)=\"s\",OFFSET(C254,-1,0)=0),A254<>\"s\",A254>OFFSET(B254,-1,0)),OFFSET(B254,-1,0),A254)))))","v":2},{"$f":"IF(OR(C254=\"S\",C254=0),0,IF(ISERROR(K254),J254,SMALL(J254:K254,1)))","v":7},{"$f":"IF($C254=1,OFFSET(E254,-1,0)+1,OFFSET(E254,-1,0))","v":1},{"$f":"IF($C254=1,0,IF($C254=2,OFFSET(F254,-1,0)+1,OFFSET(F254,-1,0)))","v":6},{"$f":"IF(AND($C254<=2,$C254<>0),0,IF($C254=3,OFFSET(G254,-1,0)+1,OFFSET(G254,-1,0)))","v":0},{"$f":"IF(AND($C254<=3,$C254<>0),0,IF($C254=4,OFFSET(H254,-1,0)+1,OFFSET(H254,-1,0)))","v":0},{"$f":"IF(AND($C254<=4,$C254<>0),0,IF(AND($C254=\"S\",$W254>0),OFFSET(I254,-1,0)+1,OFFSET(I254,-1,0)))","v":0},81,7,"F","Nível 2","Nível 2","1.6.",null,null,"INSTALAÇÕES ESPECIAIS","-",null,null,null,null,""]
[3,3,3,6,1,6,1,0,0,6,36,"F","Nível 3","Nível 3","1.6.1.","SINAPI",null,"INST. DE INCÊNDIO","-",null,null,null,null,""]
["S",3,"S",0,1,6,1,0,0,0,0,"F","Serviço","Serviço","1.6.1.0.1.","AGETOP",85003,"EXTINTOR PO QUIMICO SECO (6 KG) - CAPACIDADE EXTINTORA 20 BC","Un    ",1,null,null,null,""]
["S",3,"S",0,1,6,1,0,0,0,0,"F","Serviço","Serviço","1.6.1.0.2.","AGETOP",85006,"EXTINTOR MULTI USO EM PO A B C (6 KG) - CAPACIDADE EXTINTORA 3A 20BC","un    ",6,null,null,null,""]
["S",3,"S",0,1,6,1,0,0,0,0,"F","Serviço","Serviço","1.6.1.0.3.","COMPOSIÇÃO","COMP 025_SEE","SINALIZADOR FOTOLUMINESCENTE DE EMERGÊNCIA","UN ",14,null,null,null,""]
["S",3,"S",0,1,6,1,0,0,0,0,"F","Serviço","Serviço","1.6.1.0.4.","COMPOSIÇÃO","COMP 277_SEE","MARCAÇÃO NO PISO - 1X1 M PARA EXTINTOR","M2",7,null,null,null,""]
["S",3,"S",0,1,6,1,0,0,0,0,"F","Serviço","Serviço","1.6.1.0.5.","AGETOP",71598,"LUMINÁRIA DE EMERGÊNCIA 30 LEDS","un    ",10,null,null,null,""]
[2,2,2,3,1,7,0,0,0,74,3,"F","Nível 2","Nível 2","1.7.","AGETOP",91045,"ALVENARIAS E DIVISÓRIAS","Un    ",null,null,null,null,""]
[{"$f":"CHOOSE(1+LOG(1+2*(ORÇAMENTO.Nivel=\"Nível 1\")+4*(ORÇAMENTO.Nivel=\"Nível 2\")+8*(ORÇAMENTO.Nivel=\"Nível 3\")+16*(ORÇAMENTO.Nivel=\"Nível 4\")+32*(ORÇAMENTO.Nivel=\"Serviço\"),2),0,1,2,3,4,\"S\")","v":3},3,3,2,1,7,1,0,0,2,29,"F","Nível 3","Nível 3","1.7.1.","SINAPI",null,"ACESSIBILIDADE","-",null,null,null,null,""]
[{"$f":"CHOOSE(1+LOG(1+2*(ORÇAMENTO.Nivel=\"Nível 1\")+4*(ORÇAMENTO.Nivel=\"Nível 2\")+8*(ORÇAMENTO.Nivel=\"Nível 3\")+16*(ORÇAMENTO.Nivel=\"Nível 4\")+32*(ORÇAMENTO.Nivel=\"Serviço\"),2),0,1,2,3,4,\"S\")","v":"S"},3,"S",0,1,7,1,0,0,0,0,"F","Serviço","Serviço","1.7.1.0.1.","SINAPI",87520,"ALVENARIA DE VEDAÇÃO DE BLOCOS CERÂMICOS FURADOS NA HORIZONTAL DE 9X19X19CM (ESPESSURA 9CM) DE PAREDES COM ÁREA LÍQUIDA MAIOR OU IGUAL A 6M² COM VÃOS E ARGAMASSA DE ASSENTAMENTO COM PREPARO MANUAL. AF_06/2014","M2",50.133333333333333,null,null,null,"Referência: AGETOP - 100201"]
[{"$f":"CHOOSE(1+LOG(1+2*(ORÇAMENTO.Nivel=\"Nível 1\")+4*(ORÇAMENTO.Nivel=\"Nível 2\")+8*(ORÇAMENTO.Nivel=\"Nível 3\")+16*(ORÇAMENTO.Nivel=\"Nível 4\")+32*(ORÇAMENTO.Nivel=\"Serviço\"),2),0,1,2,3,4,\"S\")","v":2},2,2,3,1,8,0,0,0,71,3,"F","Nível 2","Nível 2","1.8.",null,null,"IMPERMEABILIZAÇÃO","-",null,null,null,null,""]
[3,3,3,2,1,8,1,0,0,2,26,"F","Nível 3","Nível 3","1.8.1.","SINAPI",null,"COBERTURA E FORROS","-",null,null,null,null,""]
["S",3,"S",0,1,8,1,0,0,0,0,"F","Serviço","Serviço","1.8.1.0.1.","SINAPI",98546,"IMPERMEABILIZAÇÃO DE SUPERFÍCIE COM MANTA ASFÁLTICA, UMA CAMADA, INCLUSIVE APLICAÇÃO DE PRIMER ASFÁLTICO, E=3MM. AF_06/2018","M2",475,null,null,null,"Referência: AGETOP - 120107"]
[2,2,2,2,1,9,0,0,0,68,2,"F","Nível 2","Nível 2","1.9.",null,null,"ESTRUTURAS METÁLICAS","-",null,null,null,null,""]
["S",2,"S",0,1,9,0,0,0,0,0,"F","Serviço","Serviço","1.9.0.0.1.","AGETOP",150204,"ESTRUTURA METÁLICA CONVENCIONAL EM AÇO DO TIPO MR-250 / ASTM A36 COM FUNDO ANTICORROSIVO","Kg    ",7635,null,null,null,""]
[2,2,2,6,1,10,0,0,0,66,6,"F","Nível 2","Nível 2","1.10.",null,null,"COBERTURAS","-",null,null,null,null,""]
[3,3,3,5,1,10,1,0,0,5,21,"F","Nível 3","Nível 3","1.10.1.","SINAPI",null,"COBERTURA E FORROS","-",null,null,null,null,""]
["S",3,"S",0,1,10,1,0,0,0,0,"F","Serviço","Serviço","1.10.1.0.1.","SINAPI",94210,"TELHAMENTO COM TELHA ONDULADA DE FIBROCIMENTO E = 6 MM, COM RECOBRIMENTO LATERAL DE 1 1/4 DE ONDA PARA TELHADO COM INCLINAÇÃO MÁXIMA DE 10°, COM ATÉ 2 ÁGUAS, INCLUSO IÇAMENTO. AF_07/2019","M2",996.5,null,null,null,"Referência: AGETOP - 160501"]
["S",3,"S",0,1,10,1,0,0,0,0,"F","Serviço","Serviço","1.10.1.0.2.","SINAPI",94231,"RUFO EM CHAPA DE AÇO GALVANIZADO NÚMERO 24, CORTE DE 25 CM, INCLUSO TRANSPORTE VERTICAL. AF_07/2019","M",475,null,null,null,"Referência: AGETOP - 160602"]
["S",3,"S",0,1,10,1,0,0,0,0,"F","Serviço","Serviço","1.10.1.0.3.","SINAPI",94228,"CALHA EM CHAPA DE AÇO GALVANIZADO NÚMERO 24, DESENVOLVIMENTO DE 50 CM, INCLUSO TRANSPORTE VERTICAL. AF_07/2019","M",180,null,null,null,"Referência: AGETOP - 160601"]
["S",3,"S",0,1,10,1,0,0,0,0,"F","Serviço","Serviço","1.10.1.0.4.","AGETOP",160404,"EMBOCAMENTO DE BEIRAL","M     ",63.85,null,null,null,""]
[2,2,2,8,1,11,0,0,0,{"$f":"IF(OR($C275=\"S\",$C275=0),0,MATCH(0,OFFSET($D275,1,$C275,ROW($C$335)-ROW($C275)),0))","v":60},{"$f":"IF(OR($C275=\"S\",$C275=0),0,MATCH(OFFSET($D275,0,$C275)+1,OFFSET($D275,1,$C275,ROW($C$335)-ROW($C275)),0))","v":8},"F","Nível 2","Nível 2","1.11.",null,null,"ESQUADRIAS METÁLICAS","-",null,null,null,null,""]
[3,3,3,7,1,11,1,0,0,7,15,"F","Nível 3","Nível 3","1.11.1.","SINAPI",null,"ACESSIBILIDADE","-",null,null,null,null,""]
["S",3,"S",0,1,11,1,0,0,0,0,"F","Serviço","Serviço","1.11.1.0.1.","COMPOSIÇÃO","COMP 083_SEE","CORRIMÃO PISO - SEDUC","M",4.9000000000000004,null,null,null,""]
["S",3,"S",0,1,11,1,0,0,0,0,"F","Serviço","Serviço","1.11.1.0.2.","COMPOSIÇÃO","COMP 085_SEE","GUARDA-CORPO - SEDUC","M",4.3,null,null,null,""]
["S",3,"S",0,1,11,1,0,0,0,0,"F","Serviço","Serviço","1.11.1.0.3.","COMPOSIÇÃO","COMP 084_SEE","GUARDA-CORPO COM CORRIMÃO - SEDUC","M",10,null,null,null,""]
["S",{"$f":"IF(OR(C280=\"s\",C280=0),OFFSET(B280,-1,0),C280)","v":3},{"$f":"IF(OFFSET(C280,-1,0)=\"L\",1,IF(OFFSET(C280,-1,0)=1,2,IF(OR(A280=\"s\",A280=0),\"S\",IF(AND(OFFSET(C280,-1,0)=2,A280=4),3,IF(AND(OR(OFFSET(C280,-1,0)=\"s\",OFFSET(C280,-1,0)=0),A280<>\"s\",A280>OFFSET(B280,-1,0)),OFFSET(B280,-1,0),A280)))))","v":"S"},{"$f":"IF(OR(C280=\"S\",C280=0),0,IF(ISERROR(K280),J280,SMALL(J280:K280,1)))","v":0},{"$f":"IF($C280=1,OFFSET(E280,-1,0)+1,OFFSET(E280,-1,0))","v":1},{"$f":"IF($C280=1,0,IF($C280=2,OFFSET(F280,-1,0)+1,OFFSET(F280,-1,0)))","v":11},{"$f":"IF(AND($C280<=2,$C280<>0),0,IF($C280=3,OFFSET(G280,-1,0)+1,OFFSET(G280,-1,0)))","v":1},{"$f":"IF(AND($C280<=3,$C280<>0),0,IF($C280=4,OFFSET(H280,-1,0)+1,OFFSET(H280,-1,0)))","v":0},{"$f":"IF(AND($C280<=4,$C280<>0),0,IF(AND($C280=\"S\",$W280>0),OFFSET(I280,-1,0)+1,OFFSET(I280,-1,0)))","v":0},0,0,"F","Serviço","Serviço","1.11.1.0.4.","COMPOSIÇÃO","COMP 082_SEE","CORRIMÃO PAREDE - SEDUC","M",10.9,null,null,null,""]
["S",3,"S",0,1,11,1,0,0,0,0,"F","Serviço","Serviço","1.11.1.0.5.","AGETOP",180509,"PORTA ABRIR CH.P/WC PF-10 C/FERRAGENS","m2    ",3.24,null,null,null,""]
["S",3,"S",0,1,11,1,0,0,0,0,"F","Serviço","Serviço","1.11.1.0.6.","SINAPI","73933/4","PORTA DE FERRO DE ABRIR TIPO BARRA CHATA, COM REQUADRO E GUARNICAO COMPLETA","M2",3.7800000000000002,null,null,null,"Referência: AGETOP - 180501"]
[2,2,2,3,1,12,0,0,0,{"$f":"IF(OR($C283=\"S\",$C283=0),0,MATCH(0,OFFSET($D283,1,$C283,ROW($C$335)-ROW($C283)),0))","v":52},{"$f":"IF(OR($C283=\"S\",$C283=0),0,MATCH(OFFSET($D283,0,$C283)+1,OFFSET($D283,1,$C283,ROW($C$335)-ROW($C283)),0))","v":3},"F","Nível 2","Nível 2","1.12.","SINAPI",null,"VIDROS","-",null,null,null,null,""]
[3,3,3,2,1,12,1,0,0,2,7,"F","Nível 3","Nível 3","1.12.1.","SINAPI",null,"REFORMA GERAL","-",null,null,null,null,""]
["S",3,"S",0,1,12,1,0,0,0,0,"F","Serviço","Serviço","1.12.1.0.1.","SINAPI",72117,"VIDRO LISO COMUM TRANSPARENTE, ESPESSURA 4MM","M2",8.5,null,null,null,"Referência: AGETOP - 190102"]
[{"$f":"CHOOSE(1+LOG(1+2*(ORÇAMENTO.Nivel=\"Nível 1\")+4*(ORÇAMENTO.Nivel=\"Nível 2\")+8*(ORÇAMENTO.Nivel=\"Nível 3\")+16*(ORÇAMENTO.Nivel=\"Nível 4\")+32*(ORÇAMENTO.Nivel=\"Serviço\"),2),0,1,2,3,4,\"S\")","v":2},{"$f":"IF(OR(C286=\"s\",C286=0),OFFSET(B286,-1,0),C286)","v":2},{"$f":"IF(OFFSET(C286,-1,0)=\"L\",1,IF(OFFSET(C286,-1,0)=1,2,IF(OR(A286=\"s\",A286=0),\"S\",IF(AND(OFFSET(C286,-1,0)=2,A286=4),3,IF(AND(OR(OFFSET(C286,-1,0)=\"s\",OFFSET(C286,-1,0)=0),A286<>\"s\",A286>OFFSET(B286,-1,0)),OFFSET(B286,-1,0),A286)))))","v":2},{"$f":"IF(OR(C286=\"S\",C286=0),0,IF(ISERROR(K286),J286,SMALL(J286:K286,1)))","v":8},{"$f":"IF($C286=1,OFFSET(E286,-1,0)+1,OFFSET(E286,-1,0))","v":1},{"$f":"IF($C286=1,0,IF($C286=2,OFFSET(F286,-1,0)+1,OFFSET(F286,-1,0)))","v":13},{"$f":"IF(AND($C286<=2,$C286<>0),0,IF($C286=3,OFFSET(G286,-1,0)+1,OFFSET(G286,-1,0)))","v":0},{"$f":"IF(AND($C286<=3,$C286<>0),0,IF($C286=4,OFFSET(H286,-1,0)+1,OFFSET(H286,-1,0)))","v":0},{"$f":"IF(AND($C286<=4,$C286<>0),0,IF(AND($C286=\"S\",$W286>0),OFFSET(I286,-1,0)+1,OFFSET(I286,-1,0)))","v":0},{"$f":"IF(OR($C286=\"S\",$C286=0),0,MATCH(0,OFFSET($D286,1,$C286,ROW($C$335)-ROW($C286)),0))","v":49},{"$f":"IF(OR($C286=\"S\",$C286=0),0,MATCH(OFFSET($D286,0,$C286)+1,OFFSET($D286,1,$C286,ROW($C$335)-ROW($C286)),0))","v":8},"F","Nível 2","Nível 2","1.13.",null,null,"REVESTIMENTO DE PAREDE","-",null,null,null,null,""]
[3,3,3,4,1,13,1,0,0,7,4,"F","Nível 3","Nível 3","1.13.1.","SINAPI",null,"ACESSIBILIDADE","-",null,null,null,null,""]
["S",3,"S",0,1,13,1,0,0,0,0,"F","Serviço","Serviço","1.13.1.0.1.","SINAPI",87273,"REVESTIMENTO CERÂMICO PARA PAREDES INTERNAS COM PLACAS TIPO ESMALTADA EXTRA DE DIMENSÕES 33X45 CM APLICADAS EM AMBIENTES DE ÁREA MAIOR QUE 5 M² NA ALTURA INTEIRA DAS PAREDES. AF_06/2014","M2",23.5,null,null,null,""]
[{"$f":"CHOOSE(1+LOG(1+2*(ORÇAMENTO.Nivel=\"Nível 1\")+4*(ORÇAMENTO.Nivel=\"Nível 2\")+8*(ORÇAMENTO.Nivel=\"Nível 3\")+16*(ORÇAMENTO.Nivel=\"Nível 4\")+32*(ORÇAMENTO.Nivel=\"Serviço\"),2),0,1,2,3,4,\"S\")","v":"S"},{"$f":"IF(OR(C289=\"s\",C289=0),OFFSET(B289,-1,0),C289)","v":3},{"$f":"IF(OFFSET(C289,-1,0)=\"L\",1,IF(OFFSET(C289,-1,0)=1,2,IF(OR(A289=\"s\",A289=0),\"S\",IF(AND(OFFSET(C289,-1,0)=2,A289=4),3,IF(AND(OR(OFFSET(C289,-1,0)=\"s\",OFFSET(C289,-1,0)=0),A289<>\"s\",A289>OFFSET(B289,-1,0)),OFFSET(B289,-1,0),A289)))))","v":"S"},{"$f":"IF(OR(C289=\"S\",C289=0),0,IF(ISERROR(K289),J289,SMALL(J289:K289,1)))","v":0},{"$f":"IF($C289=1,OFFSET(E289,-1,0)+1,OFFSET(E289,-1,0))","v":1},{"$f":"IF($C289=1,0,IF($C289=2,OFFSET(F289,-1,0)+1,OFFSET(F289,-1,0)))","v":13},{"$f":"IF(AND($C289<=2,$C289<>0),0,IF($C289=3,OFFSET(G289,-1,0)+1,OFFSET(G289,-1,0)))","v":1},{"$f":"IF(AND($C289<=3,$C289<>0),0,IF($C289=4,OFFSET(H289,-1,0)+1,OFFSET(H289,-1,0)))","v":0},{"$f":"IF(AND($C289<=4,$C289<>0),0,IF(AND($C289=\"S\",$W289>0),OFFSET(I289,-1,0)+1,OFFSET(I289,-1,0)))","v":0},0,0,"F","Serviço","Serviço","1.13.1.0.2.","SINAPI",87904,"CHAPISCO APLICADO EM ALVENARIA (COM PRESENÇA DE VÃOS) E ESTRUTURAS DE CONCRETO DE FACHADA, COM COLHER DE PEDREIRO.  ARGAMASSA TRAÇO 1:3 COM PREPARO MANUAL. AF_06/2014","M2",17.54,null,null,null,"Referência: AGETOP - 200101"]
["S",3,"S",0,1,13,1,0,0,0,0,"F","Serviço","Serviço","1.13.1.0.3.","SINAPI",87553,"EMBOÇO, PARA RECEBIMENTO DE CERÂMICA, EM ARGAMASSA TRAÇO 1:2:8, PREPARO MECÂNICO COM BETONEIRA 400L, APLICADO MANUALMENTE EM FACES INTERNAS DE PAREDES, PARA AMBIENTE COM ÁREA MAIOR QUE 10M2, ESPESSURA DE 10MM, COM EXECUÇÃO DE TALISCAS. AF_06/2014","M2",17.54,null,null,null,""]
[3,3,3,3,1,13,2,0,0,3,19,"F","Nível 3","Nível 3","1.13.2.","SINAPI",null,"REFORMA GERAL","-",null,null,null,null,""]
["S",3,"S",0,1,13,2,0,0,0,0,"F","Serviço","Serviço","1.13.2.0.1.","SINAPI",87904,"CHAPISCO APLICADO EM ALVENARIA (COM PRESENÇA DE VÃOS) E ESTRUTURAS DE CONCRETO DE FACHADA, COM COLHER DE PEDREIRO.  ARGAMASSA TRAÇO 1:3 COM PREPARO MANUAL. AF_06/2014","M2",160,null,null,null,"Referência: AGETOP - 200101"]
["S",3,"S",0,1,13,2,0,0,0,0,"F","Serviço","Serviço","1.13.2.0.2.","SINAPI",87547,"MASSA ÚNICA, PARA RECEBIMENTO DE PINTURA, EM ARGAMASSA TRAÇO 1:2:8, PREPARO MECÂNICO COM BETONEIRA 400L, APLICADA MANUALMENTE EM FACES INTERNAS DE PAREDES, ESPESSURA DE 10MM, COM EXECUÇÃO DE TALISCAS. AF_06/2014","M2",1565,null,null,null,""]
[2,2,2,4,1,14,0,0,0,41,4,"F","Nível 2","Nível 2","1.14.",null,null,"FORROS","-",null,null,null,null,""]
[3,3,3,3,1,14,1,0,0,3,12,"F","Nível 3","Nível 3","1.14.1.","SINAPI",null,"COBERTURA E FORROS","-",null,null,null,null,""]
["S",3,"S",0,1,14,1,0,0,0,0,"F","Serviço","Serviço","1.14.1.0.1.","AGETOP",210461,"FORRO DE PVC SEM ESTRUTURA DE METALON (COM REPINTURA DA ESTRUTURA COM TINTA ALQUÍDICA D.F.)","m2    ",298,null,null,null,""]
["S",3,"S",0,1,14,1,0,0,0,0,"F","Serviço","Serviço","1.14.1.0.2.","SINAPI",96116,"FORRO EM RÉGUAS DE PVC, FRISADO, PARA AMBIENTES COMERCIAIS, INCLUSIVE ESTRUTURA DE FIXAÇÃO. AF_05/2017_P","M2",496,null,null,null,"Referência: AGETOP - 210460"]
[2,2,2,14,1,15,0,0,0,37,14,"F","Nível 2","Nível 2","1.15.",null,null,"REVESTIMENTO DE PISO","-",null,null,null,null,""]
[3,3,3,8,1,15,1,0,0,13,8,"F","Nível 3","Nível 3","1.15.1.","SINAPI",null,"ACESSIBILIDADE","-",null,null,null,null,""]
["S",3,"S",0,1,15,1,0,0,0,0,"F","Serviço","Serviço","1.15.1.0.1.","AGETOP",220102,"PISO CONCRETO DESEMPENADO ESPESSURA = 5 CM  1:2,5:3,5","m2    ",43.55,null,null,null,""]
["S",3,"S",0,1,15,1,0,0,0,0,"F","Serviço","Serviço","1.15.1.0.2.","AGETOP",221126,"PISO DE LADRILHO HIDRÁULICO COLORIDO MODELO TÁTIL ( ALERTA OU DIRECIONAL) SEM LASTRO","m2    ",27.77,null,null,null,""]
["S",3,"S",0,1,15,1,0,0,0,0,"F","Serviço","Serviço","1.15.1.0.3.","AGETOP",220101,"LASTRO DE CONCRETO REGULARIZADO IMPERMEABILIZADO 1:3:6 ESP=5CM (BASE)","m2    ",15,null,null,null,""]
["S",3,"S",0,1,15,1,0,0,0,0,"F","Serviço","Serviço","1.15.1.0.4.","SINAPI",84191,"PISO EM GRANILITE, MARMORITE OU GRANITINA ESPESSURA 8 MM, INCLUSO JUNTAS DE DILATACAO PLASTICAS","M2",246.1,null,null,null,"Referência: AGETOP - 221101"]
["S",3,"S",0,1,15,1,0,0,0,0,"F","Serviço","Serviço","1.15.1.0.5.","AGETOP",221104,"RASPAGEM E APLICAÇÃO RESINA ACRÍLICA DUAS DEMÃOS","m2    ",246.1,null,null,null,""]
["S",3,"S",0,1,15,1,0,0,0,0,"F","Serviço","Serviço","1.15.1.0.6.","SINAPI",87251,"REVESTIMENTO CERÂMICO PARA PISO COM PLACAS TIPO ESMALTADA EXTRA DE DIMENSÕES 45X45 CM APLICADA EM AMBIENTES DE ÁREA MAIOR QUE 10 M2. AF_06/2014","M2",6.6,null,null,null,""]
["S",3,"S",0,1,15,1,0,0,0,0,"F","Serviço","Serviço","1.15.1.0.7.","SINAPI",87622,"CONTRAPISO EM ARGAMASSA TRAÇO 1:4 (CIMENTO E AREIA), PREPARO MANUAL, APLICADO EM ÁREAS SECAS SOBRE LAJE, ADERIDO, ESPESSURA 2CM. AF_06/2014","M2",2,null,null,null,""]
[{"$f":"CHOOSE(1+LOG(1+2*(ORÇAMENTO.Nivel=\"Nível 1\")+4*(ORÇAMENTO.Nivel=\"Nível 2\")+8*(ORÇAMENTO.Nivel=\"Nível 3\")+16*(ORÇAMENTO.Nivel=\"Nível 4\")+32*(ORÇAMENTO.Nivel=\"Serviço\"),2),0,1,2,3,4,\"S\")","v":3},{"$f":"IF(OR(C307=\"s\",C307=0),OFFSET(B307,-1,0),C307)","v":3},{"$f":"IF(OFFSET(C307,-1,0)=\"L\",1,IF(OFFSET(C307,-1,0)=1,2,IF(OR(A307=\"s\",A307=0),\"S\",IF(AND(OFFSET(C307,-1,0)=2,A307=4),3,IF(AND(OR(OFFSET(C307,-1,0)=\"s\",OFFSET(C307,-1,0)=0),A307<>\"s\",A307>OFFSET(B307,-1,0)),OFFSET(B307,-1,0),A307)))))","v":3},{"$f":"IF(OR(C307=\"S\",C307=0),0,IF(ISERROR(K307),J307,SMALL(J307:K307,1)))","v":3},{"$f":"IF($C307=1,OFFSET(E307,-1,0)+1,OFFSET(E307,-1,0))","v":1},{"$f":"IF($C307=1,0,IF($C307=2,OFFSET(F307,-1,0)+1,OFFSET(F307,-1,0)))","v":15},{"$f":"IF(AND($C307<=2,$C307<>0),0,IF($C307=3,OFFSET(G307,-1,0)+1,OFFSET(G307,-1,0)))","v":2},{"$f":"IF(AND($C307<=3,$C307<>0),0,IF($C307=4,OFFSET(H307,-1,0)+1,OFFSET(H307,-1,0)))","v":0},{"$f":"IF(AND($C307<=4,$C307<>0),0,IF(AND($C307=\"S\",$W307>0),OFFSET(I307,-1,0)+1,OFFSET(I307,-1,0)))","v":0},5,3,"F","Nível 3","Nível 3","1.15.2.","SINAPI",null,"REFORMA GERAL","-",null,null,null,null,""]
[{"$f":"CHOOSE(1+LOG(1+2*(ORÇAMENTO.Nivel=\"Nível 1\")+4*(ORÇAMENTO.Nivel=\"Nível 2\")+8*(ORÇAMENTO.Nivel=\"Nível 3\")+16*(ORÇAMENTO.Nivel=\"Nível 4\")+32*(ORÇAMENTO.Nivel=\"Serviço\"),2),0,1,2,3,4,\"S\")","v":"S"},{"$f":"IF(OR(C308=\"s\",C308=0),OFFSET(B308,-1,0),C308)","v":3},{"$f":"IF(OFFSET(C308,-1,0)=\"L\",1,IF(OFFSET(C308,-1,0)=1,2,IF(OR(A308=\"s\",A308=0),\"S\",IF(AND(OFFSET(C308,-1,0)=2,A308=4),3,IF(AND(OR(OFFSET(C308,-1,0)=\"s\",OFFSET(C308,-1,0)=0),A308<>\"s\",A308>OFFSET(B308,-1,0)),OFFSET(B308,-1,0),A308)))))","v":"S"},{"$f":"IF(OR(C308=\"S\",C308=0),0,IF(ISERROR(K308),J308,SMALL(J308:K308,1)))","v":0},{"$f":"IF($C308=1,OFFSET(E308,-1,0)+1,OFFSET(E308,-1,0))","v":1},{"$f":"IF($C308=1,0,IF($C308=2,OFFSET(F308,-1,0)+1,OFFSET(F308,-1,0)))","v":15},{"$f":"IF(AND($C308<=2,$C308<>0),0,IF($C308=3,OFFSET(G308,-1,0)+1,OFFSET(G308,-1,0)))","v":2},{"$f":"IF(AND($C308<=3,$C308<>0),0,IF($C308=4,OFFSET(H308,-1,0)+1,OFFSET(H308,-1,0)))","v":0},{"$f":"IF(AND($C308<=4,$C308<>0),0,IF(AND($C308=\"S\",$W308>0),OFFSET(I308,-1,0)+1,OFFSET(I308,-1,0)))","v":0},0,0,"F","Serviço","Serviço","1.15.2.0.1.","SINAPI",84191,"PISO EM GRANILITE, MARMORITE OU GRANITINA ESPESSURA 8 MM, INCLUSO JUNTAS DE DILATACAO PLASTICAS","M2",38.549999999999997,null,null,null,"Referência: AGETOP - 221101"]
[{"$f":"CHOOSE(1+LOG(1+2*(ORÇAMENTO.Nivel=\"Nível 1\")+4*(ORÇAMENTO.Nivel=\"Nível 2\")+8*(ORÇAMENTO.Nivel=\"Nível 3\")+16*(ORÇAMENTO.Nivel=\"Nível 4\")+32*(ORÇAMENTO.Nivel=\"Serviço\"),2),0,1,2,3,4,\"S\")","v":"S"},3,"S",0,1,15,2,0,0,0,0,"F","Serviço","Serviço","1.15.2.0.2.","AGETOP",221104,"RASPAGEM E APLICAÇÃO RESINA ACRÍLICA DUAS DEMÃOS","m2    ",38.549999999999997,null,null,null,""]
[{"$f":"CHOOSE(1+LOG(1+2*(ORÇAMENTO.Nivel=\"Nível 1\")+4*(ORÇAMENTO.Nivel=\"Nível 2\")+8*(ORÇAMENTO.Nivel=\"Nível 3\")+16*(ORÇAMENTO.Nivel=\"Nível 4\")+32*(ORÇAMENTO.Nivel=\"Serviço\"),2),0,1,2,3,4,\"S\")","v":3},3,3,2,1,15,3,0,0,2,21,"F","Nível 3","Nível 3","1.15.3.","SINAPI",null,"INST. ELÉTRICAS","-",null,null,null,null,""]
[{"$f":"CHOOSE(1+LOG(1+2*(ORÇAMENTO.Nivel=\"Nível 1\")+4*(ORÇAMENTO.Nivel=\"Nível 2\")+8*(ORÇAMENTO.Nivel=\"Nível 3\")+16*(ORÇAMENTO.Nivel=\"Nível 4\")+32*(ORÇAMENTO.Nivel=\"Serviço\"),2),0,1,2,3,4,\"S\")","v":"S"},3,"S",0,1,15,3,0,0,0,0,"F","Serviço","Serviço","1.15.3.0.1.","SINAPI",94992,"EXECUÇÃO DE PASSEIO (CALÇADA) OU PISO DE CONCRETO COM CONCRETO MOLDADO IN LOCO, FEITO EM OBRA, ACABAMENTO CONVENCIONAL, ESPESSURA 6 CM, ARMADO. AF_07/2016","M2",6.4,null,null,null,""]
[2,{"$f":"IF(OR(C312=\"s\",C312=0),OFFSET(B312,-1,0),C312)","v":2},{"$f":"IF(OFFSET(C312,-1,0)=\"L\",1,IF(OFFSET(C312,-1,0)=1,2,IF(OR(A312=\"s\",A312=0),\"S\",IF(AND(OFFSET(C312,-1,0)=2,A312=4),3,IF(AND(OR(OFFSET(C312,-1,0)=\"s\",OFFSET(C312,-1,0)=0),A312<>\"s\",A312>OFFSET(B312,-1,0)),OFFSET(B312,-1,0),A312)))))","v":2},{"$f":"IF(OR(C312=\"S\",C312=0),0,IF(ISERROR(K312),J312,SMALL(J312:K312,1)))","v":4},{"$f":"IF($C312=1,OFFSET(E312,-1,0)+1,OFFSET(E312,-1,0))","v":1},{"$f":"IF($C312=1,0,IF($C312=2,OFFSET(F312,-1,0)+1,OFFSET(F312,-1,0)))","v":16},{"$f":"IF(AND($C312<=2,$C312<>0),0,IF($C312=3,OFFSET(G312,-1,0)+1,OFFSET(G312,-1,0)))","v":0},{"$f":"IF(AND($C312<=3,$C312<>0),0,IF($C312=4,OFFSET(H312,-1,0)+1,OFFSET(H312,-1,0)))","v":0},{"$f":"IF(AND($C312<=4,$C312<>0),0,IF(AND($C312=\"S\",$W312>0),OFFSET(I312,-1,0)+1,OFFSET(I312,-1,0)))","v":0},23,4,"F","Nível 2","Nível 2","1.16.",null,null,"ADMINISTRAÇÃO","-",null,null,null,null,""]
[3,3,3,3,1,16,1,0,0,3,6,"F","Nível 3","Nível 3","1.16.1.",null,null,"MENSALISTAS","-",null,null,null,null,""]
["S",3,"S",0,1,16,1,0,0,0,0,"F","Serviço","Serviço","1.16.1.0.1.","SINAPI",90778,"ENGENHEIRO CIVIL DE OBRA PLENO COM ENCARGOS COMPLEMENTARES","H",132,null,null,null,"Referência: AGETOP - 250101"]
["S",3,"S",0,1,16,1,0,0,0,0,"F","Serviço","Serviço","1.16.1.0.2.","SINAPI",90776,"ENCARREGADO GERAL COM ENCARGOS COMPLEMENTARES","H",660,null,null,null,"Referência: AGETOP - 250103"]
[{"$f":"CHOOSE(1+LOG(1+2*(ORÇAMENTO.Nivel=\"Nível 1\")+4*(ORÇAMENTO.Nivel=\"Nível 2\")+8*(ORÇAMENTO.Nivel=\"Nível 3\")+16*(ORÇAMENTO.Nivel=\"Nível 4\")+32*(ORÇAMENTO.Nivel=\"Serviço\"),2),0,1,2,3,4,\"S\")","v":2},2,2,17,1,17,0,0,0,19,17,"F","Nível 2","Nível 2","1.17.",null,null,"PINTURA","-",null,null,null,null,""]
[{"$f":"CHOOSE(1+LOG(1+2*(ORÇAMENTO.Nivel=\"Nível 1\")+4*(ORÇAMENTO.Nivel=\"Nível 2\")+8*(ORÇAMENTO.Nivel=\"Nível 3\")+16*(ORÇAMENTO.Nivel=\"Nível 4\")+32*(ORÇAMENTO.Nivel=\"Serviço\"),2),0,1,2,3,4,\"S\")","v":3},{"$f":"IF(OR(C317=\"s\",C317=0),OFFSET(B317,-1,0),C317)","v":3},{"$f":"IF(OFFSET(C317,-1,0)=\"L\",1,IF(OFFSET(C317,-1,0)=1,2,IF(OR(A317=\"s\",A317=0),\"S\",IF(AND(OFFSET(C317,-1,0)=2,A317=4),3,IF(AND(OR(OFFSET(C317,-1,0)=\"s\",OFFSET(C317,-1,0)=0),A317<>\"s\",A317>OFFSET(B317,-1,0)),OFFSET(B317,-1,0),A317)))))","v":3},{"$f":"IF(OR(C317=\"S\",C317=0),0,IF(ISERROR(K317),J317,SMALL(J317:K317,1)))","v":2},{"$f":"IF($C317=1,OFFSET(E317,-1,0)+1,OFFSET(E317,-1,0))","v":1},{"$f":"IF($C317=1,0,IF($C317=2,OFFSET(F317,-1,0)+1,OFFSET(F317,-1,0)))","v":17},{"$f":"IF(AND($C317<=2,$C317<>0),0,IF($C317=3,OFFSET(G317,-1,0)+1,OFFSET(G317,-1,0)))","v":1},{"$f":"IF(AND($C317<=3,$C317<>0),0,IF($C317=4,OFFSET(H317,-1,0)+1,OFFSET(H317,-1,0)))","v":0},{"$f":"IF(AND($C317<=4,$C317<>0),0,IF(AND($C317=\"S\",$W317>0),OFFSET(I317,-1,0)+1,OFFSET(I317,-1,0)))","v":0},16,2,"F","Nível 3","Nível 3","1.17.1.","SINAPI",null,"ACESSIBILIDADE","-",null,null,null,null,""]
["S",3,"S",0,1,17,1,0,0,{"$f":"IF(OR($C318=\"S\",$C318=0),0,MATCH(0,OFFSET($D318,1,$C318,ROW($C$335)-ROW($C318)),0))","v":0},{"$f":"IF(OR($C318=\"S\",$C318=0),0,MATCH(OFFSET($D318,0,$C318)+1,OFFSET($D318,1,$C318,ROW($C$335)-ROW($C318)),0))","v":0},"F","Serviço","Serviço","1.17.1.0.1.","SINAPI","74145/1","PINTURA ESMALTE FOSCO, DUAS DEMAOS, SOBRE SUPERFICIE METALICA, INCLUSO UMA DEMAO DE FUNDO ANTICORROSIVO. UTILIZACAO DE REVOLVER ( AR-COMPRIMIDO).","M2",21.06,null,null,null,"Referência: AGETOP - 261602"]
[3,3,3,2,1,17,2,0,0,14,2,"F","Nível 3","Nível 3","1.17.2.","SINAPI",null,"COBERTURA E FORROS","-",null,null,null,null,""]
["S",3,"S",0,1,17,2,0,0,0,0,"F","Serviço","Serviço","1.17.2.0.1.","AGETOP",261609,"PINTURA ESMALTE ALQUIDICO ESTR.METALICA 2 DEMAOS","m2    ",996.5,null,null,null,""]
[3,3,3,10,1,17,3,0,0,12,10,"F","Nível 3","Nível 3","1.17.3.","SINAPI",null,"REFORMA GERAL","-",null,null,null,null,""]
["S",3,"S",0,1,17,3,0,0,0,0,"F","Serviço","Serviço","1.17.3.0.1.","AGETOP",260104,"REMOCAO DE PINTURA ANTIGA A LATEX","m2    ",1000,null,null,null,""]
[{"$f":"CHOOSE(1+LOG(1+2*(ORÇAMENTO.Nivel=\"Nível 1\")+4*(ORÇAMENTO.Nivel=\"Nível 2\")+8*(ORÇAMENTO.Nivel=\"Nível 3\")+16*(ORÇAMENTO.Nivel=\"Nível 4\")+32*(ORÇAMENTO.Nivel=\"Serviço\"),2),0,1,2,3,4,\"S\")","v":"S"},{"$f":"IF(OR(C323=\"s\",C323=0),OFFSET(B323,-1,0),C323)","v":3},{"$f":"IF(OFFSET(C323,-1,0)=\"L\",1,IF(OFFSET(C323,-1,0)=1,2,IF(OR(A323=\"s\",A323=0),\"S\",IF(AND(OFFSET(C323,-1,0)=2,A323=4),3,IF(AND(OR(OFFSET(C323,-1,0)=\"s\",OFFSET(C323,-1,0)=0),A323<>\"s\",A323>OFFSET(B323,-1,0)),OFFSET(B323,-1,0),A323)))))","v":"S"},{"$f":"IF(OR(C323=\"S\",C323=0),0,IF(ISERROR(K323),J323,SMALL(J323:K323,1)))","v":0},{"$f":"IF($C323=1,OFFSET(E323,-1,0)+1,OFFSET(E323,-1,0))","v":1},{"$f":"IF($C323=1,0,IF($C323=2,OFFSET(F323,-1,0)+1,OFFSET(F323,-1,0)))","v":17},{"$f":"IF(AND($C323<=2,$C323<>0),0,IF($C323=3,OFFSET(G323,-1,0)+1,OFFSET(G323,-1,0)))","v":3},{"$f":"IF(AND($C323<=3,$C323<>0),0,IF($C323=4,OFFSET(H323,-1,0)+1,OFFSET(H323,-1,0)))","v":0},{"$f":"IF(AND($C323<=4,$C323<>0),0,IF(AND($C323=\"S\",$W323>0),OFFSET(I323,-1,0)+1,OFFSET(I323,-1,0)))","v":0},0,0,"F","Serviço","Serviço","1.17.3.0.2.","AGETOP",260105,"REMOCAO DE PINTURA ANTIGA A OLEO OU ESMALTE","m2    ",600,null,null,null,""]
["S",3,"S",0,1,17,3,0,0,0,0,"F","Serviço","Serviço","1.17.3.0.3.","SINAPI",88497,"APLICAÇÃO E LIXAMENTO DE MASSA LÁTEX EM PAREDES, DUAS DEMÃOS. AF_06/2014","M2",1000,null,null,null,"Referência: AGETOP - 261300"]
["S",3,"S",0,1,17,3,0,0,0,0,"F","Serviço","Serviço","1.17.3.0.4.","SINAPI",88489,"APLICAÇÃO MANUAL DE PINTURA COM TINTA LÁTEX ACRÍLICA EM PAREDES, DUAS DEMÃOS. AF_06/2014","M2",4250,null,null,null,"Referência: AGETOP - 261001"]
["S",3,"S",0,1,17,3,0,0,0,0,"F","Serviço","Serviço","1.17.3.0.5.","AGETOP",261550,"PINT.ESMALTE SINT.PAREDES - 2 DEM.C/SELADOR","m2    ",1585,null,null,null,""]
[{"$f":"CHOOSE(1+LOG(1+2*(ORÇAMENTO.Nivel=\"Nível 1\")+4*(ORÇAMENTO.Nivel=\"Nível 2\")+8*(ORÇAMENTO.Nivel=\"Nível 3\")+16*(ORÇAMENTO.Nivel=\"Nível 4\")+32*(ORÇAMENTO.Nivel=\"Serviço\"),2),0,1,2,3,4,\"S\")","v":"S"},{"$f":"IF(OR(C327=\"s\",C327=0),OFFSET(B327,-1,0),C327)","v":3},{"$f":"IF(OFFSET(C327,-1,0)=\"L\",1,IF(OFFSET(C327,-1,0)=1,2,IF(OR(A327=\"s\",A327=0),\"S\",IF(AND(OFFSET(C327,-1,0)=2,A327=4),3,IF(AND(OR(OFFSET(C327,-1,0)=\"s\",OFFSET(C327,-1,0)=0),A327<>\"s\",A327>OFFSET(B327,-1,0)),OFFSET(B327,-1,0),A327)))))","v":"S"},{"$f":"IF(OR(C327=\"S\",C327=0),0,IF(ISERROR(K327),J327,SMALL(J327:K327,1)))","v":0},{"$f":"IF($C327=1,OFFSET(E327,-1,0)+1,OFFSET(E327,-1,0))","v":1},{"$f":"IF($C327=1,0,IF($C327=2,OFFSET(F327,-1,0)+1,OFFSET(F327,-1,0)))","v":17},{"$f":"IF(AND($C327<=2,$C327<>0),0,IF($C327=3,OFFSET(G327,-1,0)+1,OFFSET(G327,-1,0)))","v":3},{"$f":"IF(AND($C327<=3,$C327<>0),0,IF($C327=4,OFFSET(H327,-1,0)+1,OFFSET(H327,-1,0)))","v":0},{"$f":"IF(AND($C327<=4,$C327<>0),0,IF(AND($C327=\"S\",$W327>0),OFFSET(I327,-1,0)+1,OFFSET(I327,-1,0)))","v":0},0,0,"F","Serviço","Serviço","1.17.3.0.6.","AGETOP",261609,"PINTURA ESMALTE ALQUIDICO ESTR.METALICA 2 DEMAOS","m2    ",280,null,null,null,""]
["S",3,"S",0,1,17,3,0,0,0,0,"F","Serviço","Serviço","1.17.3.0.7.","SINAPI","74145/1","PINTURA ESMALTE FOSCO, DUAS DEMAOS, SOBRE SUPERFICIE METALICA, INCLUSO UMA DEMAO DE FUNDO ANTICORROSIVO. UTILIZACAO DE REVOLVER ( AR-COMPRIMIDO).","M2",600,null,null,null,"Referência: AGETOP - 261602"]
["S",3,"S",0,1,17,3,0,0,0,0,"F","Serviço","Serviço","1.17.3.0.8.","SINAPI",88486,"APLICAÇÃO MANUAL DE PINTURA COM TINTA LÁTEX PVA EM TETO, DUAS DEMÃOS. AF_06/2014","M2",62,null,null,null,"Referência: AGETOP - 261307"]
[{"$f":"CHOOSE(1+LOG(1+2*(ORÇAMENTO.Nivel=\"Nível 1\")+4*(ORÇAMENTO.Nivel=\"Nível 2\")+8*(ORÇAMENTO.Nivel=\"Nível 3\")+16*(ORÇAMENTO.Nivel=\"Nível 4\")+32*(ORÇAMENTO.Nivel=\"Serviço\"),2),0,1,2,3,4,\"S\")","v":"S"},{"$f":"IF(OR(C330=\"s\",C330=0),OFFSET(B330,-1,0),C330)","v":3},{"$f":"IF(OFFSET(C330,-1,0)=\"L\",1,IF(OFFSET(C330,-1,0)=1,2,IF(OR(A330=\"s\",A330=0),\"S\",IF(AND(OFFSET(C330,-1,0)=2,A330=4),3,IF(AND(OR(OFFSET(C330,-1,0)=\"s\",OFFSET(C330,-1,0)=0),A330<>\"s\",A330>OFFSET(B330,-1,0)),OFFSET(B330,-1,0),A330)))))","v":"S"},{"$f":"IF(OR(C330=\"S\",C330=0),0,IF(ISERROR(K330),J330,SMALL(J330:K330,1)))","v":0},{"$f":"IF($C330=1,OFFSET(E330,-1,0)+1,OFFSET(E330,-1,0))","v":1},{"$f":"IF($C330=1,0,IF($C330=2,OFFSET(F330,-1,0)+1,OFFSET(F330,-1,0)))","v":17},{"$f":"IF(AND($C330<=2,$C330<>0),0,IF($C330=3,OFFSET(G330,-1,0)+1,OFFSET(G330,-1,0)))","v":3},{"$f":"IF(AND($C330<=3,$C330<>0),0,IF($C330=4,OFFSET(H330,-1,0)+1,OFFSET(H330,-1,0)))","v":0},{"$f":"IF(AND($C330<=4,$C330<>0),0,IF(AND($C330=\"S\",$W330>0),OFFSET(I330,-1,0)+1,OFFSET(I330,-1,0)))","v":0},0,0,"F","Serviço","Serviço","1.17.3.0.9.","AGETOP",261620,"LETREIRO MÉDIO A GRANDE PORTE EM PAREDE FEITO A PINCEL","m2    ",7.2,null,null,null,""]
[{"$f":"CHOOSE(1+LOG(1+2*(ORÇAMENTO.Nivel=\"Nível 1\")+4*(ORÇAMENTO.Nivel=\"Nível 2\")+8*(ORÇAMENTO.Nivel=\"Nível 3\")+16*(ORÇAMENTO.Nivel=\"Nível 4\")+32*(ORÇAMENTO.Nivel=\"Serviço\"),2),0,1,2,3,4,\"S\")","v":3},{"$f":"IF(OR(C331=\"s\",C331=0),OFFSET(B331,-1,0),C331)","v":3},{"$f":"IF(OFFSET(C331,-1,0)=\"L\",1,IF(OFFSET(C331,-1,0)=1,2,IF(OR(A331=\"s\",A331=0),\"S\",IF(AND(OFFSET(C331,-1,0)=2,A331=4),3,IF(AND(OR(OFFSET(C331,-1,0)=\"s\",OFFSET(C331,-1,0)=0),A331<>\"s\",A331>OFFSET(B331,-1,0)),OFFSET(B331,-1,0),A331)))))","v":3},{"$f":"IF(OR(C331=\"S\",C331=0),0,IF(ISERROR(K331),J331,SMALL(J331:K331,1)))","v":2},{"$f":"IF($C331=1,OFFSET(E331,-1,0)+1,OFFSET(E331,-1,0))","v":1},{"$f":"IF($C331=1,0,IF($C331=2,OFFSET(F331,-1,0)+1,OFFSET(F331,-1,0)))","v":17},{"$f":"IF(AND($C331<=2,$C331<>0),0,IF($C331=3,OFFSET(G331,-1,0)+1,OFFSET(G331,-1,0)))","v":4},{"$f":"IF(AND($C331<=3,$C331<>0),0,IF($C331=4,OFFSET(H331,-1,0)+1,OFFSET(H331,-1,0)))","v":0},{"$f":"IF(AND($C331<=4,$C331<>0),0,IF(AND($C331=\"S\",$W331>0),OFFSET(I331,-1,0)+1,OFFSET(I331,-1,0)))","v":0},2,{"$error":"#N/A"},"F","Nível 3","Nível 3","1.17.4.","SINAPI",null,"CANALETA COM GRELHA","-",null,null,null,null,""]
[{"$f":"CHOOSE(1+LOG(1+2*(ORÇAMENTO.Nivel=\"Nível 1\")+4*(ORÇAMENTO.Nivel=\"Nível 2\")+8*(ORÇAMENTO.Nivel=\"Nível 3\")+16*(ORÇAMENTO.Nivel=\"Nível 4\")+32*(ORÇAMENTO.Nivel=\"Serviço\"),2),0,1,2,3,4,\"S\")","v":"S"},3,"S",0,1,17,4,0,0,0,0,"F","Serviço","Serviço","1.17.4.0.1.","SINAPI","74145/1","PINTURA ESMALTE FOSCO, DUAS DEMAOS, SOBRE SUPERFICIE METALICA, INCLUSO UMA DEMAO DE FUNDO ANTICORROSIVO. UTILIZACAO DE REVOLVER ( AR-COMPRIMIDO).","M2",7.2,null,null,null,"Referência: AGETOP - 261602"]
[2,2,2,2,1,18,0,0,0,2,{"$error":"#N/A"},"F","Nível 2","Nível 2","1.18.",null,null,"DIVERSOS","-",null,null,null,null,""]
["S",2,"S",0,1,18,0,0,0,0,0,"F","Serviço","Serviço","1.18.0.0.1.","AGETOP",270501,"LIMPEZA FINAL DE OBRA - (OBRAS CIVIS)","m2    ",220,null,null,null,""]
[-1,null,-1,null,0,0,0,0,0,null,null,"F"]
[null,null,null,null,null,null,null,null,null,null,null,"F",null,null,null,null,null,"OBS: OS QUANTITATIVOS DE MATERIAIS  DAS INSTALAÇÕES HIDROSSANITÁRIAS, ELÉTRICAS E ESPECIAIS SÃO FORNECIDOS PELOS PROFISSIONAIS RESPONSÁVEIS PELOS RESPECTIVOS PROJETOS.",null,null,"VALOR TOTAL"]
[null,null,null,null,null,null,null,null,null,null,null,"F",null,null,null,null,null,null,null,null,"VALOR BDI (26,34%)"]
[null,null,null,null,null,null,null,null,null,null,null,"F",null,null,null,null,null,null,null,null,"TOTAL ORÇAMENTO"]
[null,null,null,null,null,null,null,null,null,null,null,"F"]
[null,null,null,null,null,null,null,null,null,null,null,"F",null,null,null,null,null,null,null,null,"CUSTO POR M2 ³"]
[null,null,null,null,null,null,null,null,null,null,null,"F",null,null,null,null,null,null,null,null,"MATERIAL S/ BDI"]
[null,null,null,null,null,null,null,null,null,null,null,"F",null,null,null,null,null,null,null,null,"MÃO DE OBRA S/ BDI"]
[null,null,null,null,null,null,null,null,null,null,null,"F"]
[null,null,null,null,null,null,null,null,null,null,null,"F",null,null,null,null,"(1) Conforme previsto pelo DECRETO Nº 7.983, DE 8 DE ABRIL DE 2013, os preços adotados são aqueles constantes dos sistemas de referência indicados. Justifica-se o uso dos preços destas composições de custos unitários devido ao seu valor ser menor à mediana de seus correspondentes na tabela SINAPI;"]
[null,null,null,null,null,null,null,null,null,null,null,"F",null,null,null,null,"(2) Optou-se pelo uso das composições de custos da AGETOP para itens não presentes na SINAPI;"]
[null,null,null,null,null,null,null,null,null,null,null,"F",null,null,null,null,"(3) Para itens da AGETOP, os vidros não estão inclusos nas esquadrias e já foram considerados os custos de contramarco para as esquadrias de alumínio;"]
[null,null,null,null,null,null,null,null,null,null,null,"F",null,null,null,null,"(4) Nos casos em que houver execução de granitina e omissão do item AGETOP 221102, considerou-se que o quantitativo para o rodapé, de altura igual a 7cm, foi incorporado na área de piso;"]
[null,null,null,null,null,null,null,null,null,null,null,"F",null,null,null,null,"(5) O custo unitário aproximado por metro quadrado é calculado dividindo-se o valor total do orçamento pela área total de construção."]
[null,null,null,null,null,null,null,null,null,null,null,"F"]
[null,null,null,null,null,null,null,null,null,null,null,"F"]
[]
[null,null,null,null,null,null,null,null,null,null,null,null,null,null,"SOMATÓRIO DE SERVIÇOS"]
[null,null,null,null,null,null,null,null,null,null,null,null,null,null,"ITEM","DESCRIÇÃO DOS SERVIÇOS",null,null,"PREÇO SEM BDI",null,null,"PREÇO COM BDI",null,"PARTICIPAÇÃO ( % )"]
[null,null,null,null,null,null,null,null,null,null,null,null,null,null,"a.","SERVIÇOS PRELIMINARES",null,null,{"$f":"SUMIF($R$19:$R$335,$P354,$W$19:$W$335)","v":0},null,null,{"$f":"ROUND(S354*(1+BDI.Taxa),2)","v":0},null,{"$f":"IFERROR(ROUND($V354*100/$W$338,2),0)","v":0}]
[null,null,null,null,null,null,null,null,null,null,null,null,null,null,"b.","TRANSPORTES",null,null,0,null,null,0,null,{"$f":"IFERROR(ROUND($V355*100/$W$338,2),0)","v":0}]
[null,null,null,null,null,null,null,null,null,null,null,null,null,null,"c.","SERVIÇO EM TERRA",null,null,0,null,null,0,null,0]
[null,null,null,null,null,null,null,null,null,null,null,null,null,null,"d.","FUNDAÇÕES E SONDAGENS",null,null,0,null,null,0,null,0]
[null,null,null,null,null,null,null,null,null,null,null,null,null,null,"e.","ESTRUTURA",null,null,0,null,null,0,null,0]
[null,null,null,null,null,null,null,null,null,null,null,null,null,null,"f.","INSTALAÇÕES ELÉTRICAS",null,null,0,null,null,0,null,0]
[null,null,null,null,null,null,null,null,null,null,null,null,null,null,"g.","INSTALAÇÕES HIDROSSANITÁRIAS",null,null,0,null,null,0,null,0]
[null,null,null,null,null,null,null,null,null,null,null,null,null,null,"h","INSTALAÇÕES ESPECIAIS",null,null,0,null,null,0,null,0]
[null,null,null,null,null,null,null,null,null,null,null,null,null,null,"i.","ALVENARIAS E DIVISÓRIAS",null,null,0,null,null,0,null,0]
[null,null,null,null,null,null,null,null,null,null,null,null,null,null,"j.","ALVENARIA AUTO-PORTANTE",null,null,0,null,null,0,null,0]
[null,null,null,null,null,null,null,null,null,null,null,null,null,null,"k.","IMPERMEABILIZAÇÃO",null,null,0,null,null,0,null,0]
[null,null,null,null,null,null,null,null,null,null,null,null,null,null,"l.","ISOLAMENTO TÉRMICO E ACÚSTICO",null,null,0,null,null,0,null,0]
[null,null,null,null,null,null,null,null,null,null,null,null,null,null,"m.","ESTRUTURA DE MADEIRA",null,null,0,null,null,0,null,0]
[null,null,null,null,null,null,null,null,null,null,null,null,null,null,"n.","ESTRUTURAS METÁLICAS",null,null,0,null,null,0,null,0]
[null,null,null,null,null,null,null,null,null,null,null,null,null,null,"o.","COBERTURAS",null,null,0,null,null,0,null,0]
[null,null,null,null,null,null,null,null,null,null,null,null,null,null,"p.","ESQUADRIAS DE MADEIRA",null,null,0,null,null,0,null,0]
[null,null,null,null,null,null,null,null,null,null,null,null,null,null,"q.","ESQUADRIAS METÁLICAS",null,null,0,null,null,{"$f":"ROUND(S370*(1+BDI.Taxa),2)","v":0},null,0]
[null,null,null,null,null,null,null,null,null,null,null,null,null,null,"r.","VIDROS",null,null,0,null,null,0,null,0]
[null,null,null,null,null,null,null,null,null,null,null,null,null,null,"s.","REVESTIMENTO DE PAREDE",null,null,0,null,null,0,null,0]
[null,null,null,null,null,null,null,null,null,null,null,null,null,null,"t.","FORROS",null,null,0,null,null,0,null,0]
[null,null,null,null,null,null,null,null,null,null,null,null,null,null,"u.","REVESTIMENTO DE PISO",null,null,0,null,null,0,null,0]
[null,null,null,null,null,null,null,null,null,null,null,null,null,null,"v.","FERRAGENS",null,null,0,null,null,0,null,0]
[null,null,null,null,null,null,null,null,null,null,null,null,null,null,"w.","MARCENARIA",null,null,0,null,null,0,null,0]
[null,null,null,null,null,null,null,null,null,null,null,null,null,null,"x.","ADMINISTRAÇÃO",null,null,0,null,null,0,null,0]
[null,null,null,null,null,null,null,null,null,null,null,null,null,null,"y.","PINTURA",null,null,0,null,null,{"$f":"ROUND(S378*(1+BDI.Taxa),2)","v":0},null,0]
[null,null,null,null,null,null,null,null,null,null,null,null,null,null,"z.","DIVERSOS",null,null,0,null,null,{"$f":"IF(S379>0,IF((SUM(V354:W378)+ROUND(S379*(1+BDI.Taxa),2))<>V381,V381-SUM(V354:W378),ROUND(S379*(1+BDI.Taxa),2)),0)","v":0},null,{"$f":"IF(S379>0,IF((SUM(X354:X378)+IFERROR(ROUND($V379*100/$W$338,2),0))<>X381,X381-SUM(X354:X378),IFERROR(ROUND($V379*100/$W$338,2),0)),0)","v":0}]
[null,null,null,null,null,null,null,null,null,null,null,null,null,null,"TOTAL GERAL DO ORÇAMENTO (R$)",null,null,null,{"$f":"SUM(S354:U379)","v":0},null,null,{"$f":"SUM(V354:W379)","v":0},null,{"$f":"SUM(X354:X379)","v":0}]
[null,null,null,null,null,null,null,null,null,null,null,null,null,null,null,null,null,null,{"$f":"$W$336","v":0},null,null,{"$f":"$W$338","v":0},null,100]
[null,null,null,null,null,null,null,null,null,null,null,null,null,null,null,null,null,null,"(TOTAL SEM BDI)",null,null,"(TOTAL COM BDI)",null,"(ARRED porcentagem)"]
[null,null,null,null,null,null,null,null,null,null,null,null,null,null,null,null,null,null,{"$f":"IF(AND(S380=S381,S380>0),\"OK\",\"ERRO\")","v":"ERRO"},null,null,{"$f":"IF(AND(V380=V381,V380>0),\"OK\",\"ERRO\")","v":"ERRO"},null,{"$f":"IF(X380=100,\"OK\",\"ERRO\")","v":"ERRO"}]
[]
[]
[null,null,null,null,null,null,null,null,null,null,null,null,null,null,"RESUMO GERAL DO ORÇAMENTO"]
[null,null,null,null,null,null,null,null,null,null,null,null,null,null,"ITEM","DESCRIÇÃO DOS SERVIÇOS",null,null,"PREÇO SEM BDI",null,null,"PREÇO COM BDI",null,"PARTICIPAÇÃO ( % )"]
[null,null,null,null,null,null,null,null,null,null,null,null,null,null,"1.",{"$f":"IFERROR(VLOOKUP(O388,$O$19:$W$335,4,FALSE),\"\")","v":"REFORMA"},null,null,{"$f":"IF(P389=\"\",$S$409-SUM(OFFSET($S$387:S387,0,0,COUNTA($S$387:S387),1)),SUMIF($R$19:$R$335,$P388,$W$19:$W$335))","v":0},null,null,{"$f":"IF(P389=\"\",$V$409-SUM(OFFSET($V$387:V387,0,0,COUNTA($V$387:V387),1)),ROUND(S388*(1+BDI.Taxa),2))","v":0},null,{"$f":"IF(P389=\"\",$X$409-SUM(OFFSET($X$387:X387,0,0,COUNTA($X$387:X387),1)),ROUND(V388*100/ORÇAMENTO.Totalorçamento,2))","v":100}]
[null,null,null,null,null,null,null,null,null,null,null,null,null,null,"2.","",null,null,{"$f":"IF(P390=\"\",$S$409-SUM(OFFSET($S$387:S388,0,0,COUNTA($S$387:S388),1)),SUMIF($R$19:$R$335,$P389,$W$19:$W$335))","v":0},null,null,{"$f":"IF(P390=\"\",$V$409-SUM(OFFSET($V$387:V388,0,0,COUNTA($V$387:V388),1)),ROUND(S389*(1+BDI.Taxa),2))","v":0},null,{"$f":"IF(P390=\"\",$X$409-SUM(OFFSET($X$387:X388,0,0,COUNTA($X$387:X388),1)),ROUND(V389*100/ORÇAMENTO.Totalorçamento,2))","v":0}]
[null,null,null,null,null,null,null,null,null,null,null,null,null,null,"3.","",null,null,{"$f":"IF(P391=\"\",$S$409-SUM(OFFSET($S$387:S389,0,0,COUNTA($S$387:S389),1)),SUMIF($R$19:$R$335,$P390,$W$19:$W$335))","v":0},null,null,{"$f":"IF(P391=\"\",$V$409-SUM(OFFSET($V$387:V389,0,0,COUNTA($V$387:V389),1)),ROUND(S390*(1+BDI.Taxa),2))","v":0},null,{"$f":"IF(P391=\"\",$X$409-SUM(OFFSET($X$387:X389,0,0,COUNTA($X$387:X389),1)),ROUND(V390*100/ORÇAMENTO.Totalorçamento,2))","v":0}]
[null,null,null,null,null,null,null,null,null,null,null,null,null,null,"4.","",null,null,{"$f":"IF(P392=\"\",$S$409-SUM(OFFSET($S$387:S390,0,0,COUNTA($S$387:S390),1)),SUMIF($R$19:$R$335,$P391,$W$19:$W$335))","v":0},null,null,{"$f":"IF(P392=\"\",$V$409-SUM(OFFSET($V$387:V390,0,0,COUNTA($V$387:V390),1)),ROUND(S391*(1+BDI.Taxa),2))","v":0},null,{"$f":"IF(P392=\"\",$X$409-SUM(OFFSET($X$387:X390,0,0,COUNTA($X$387:X390),1)),ROUND(V391*100/ORÇAMENTO.Totalorçamento,2))","v":0}]
[null,null,null,null,null,null,null,null,null,null,null,null,null,null,"5.","",null,null,{"$f":"IF(P393=\"\",$S$409-SUM(OFFSET($S$387:S391,0,0,COUNTA($S$387:S391),1)),SUMIF($R$19:$R$335,$P392,$W$19:$W$335))","v":0},null,null,{"$f":"IF(P393=\"\",$V$409-SUM(OFFSET($V$387:V391,0,0,COUNTA($V$387:V391),1)),ROUND(S392*(1+BDI.Taxa),2))","v":0},null,{"$f":"IF(P393=\"\",$X$409-SUM(OFFSET($X$387:X391,0,0,COUNTA($X$387:X391),1)),ROUND(V392*100/ORÇAMENTO.Totalorçamento,2))","v":0}]
[null,null,null,null,null,null,null,null,null,null,null,null,null,null,"6.","",null,null,{"$f":"IF(P394=\"\",$S$409-SUM(OFFSET($S$387:S392,0,0,COUNTA($S$387:S392),1)),SUMIF($R$19:$R$335,$P393,$W$19:$W$335))","v":0},null,null,{"$f":"IF(P394=\"\",$V$409-SUM(OFFSET($V$387:V392,0,0,COUNTA($V$387:V392),1)),ROUND(S393*(1+BDI.Taxa),2))","v":0},null,{"$f":"IF(P394=\"\",$X$409-SUM(OFFSET($X$387:X392,0,0,COUNTA($X$387:X392),1)),ROUND(V393*100/ORÇAMENTO.Totalorçamento,2))","v":0}]
[null,null,null,null,null,null,null,null,null,null,null,null,null,null,"7.","",null,null,{"$f":"IF(P395=\"\",$S$409-SUM(OFFSET($S$387:S393,0,0,COUNTA($S$387:S393),1)),SUMIF($R$19:$R$335,$P394,$W$19:$W$335))","v":0},null,null,{"$f":"IF(P395=\"\",$V$409-SUM(OFFSET($V$387:V393,0,0,COUNTA($V$387:V393),1)),ROUND(S394*(1+BDI.Taxa),2))","v":0},null,{"$f":"IF(P395=\"\",$X$409-SUM(OFFSET($X$387:X393,0,0,COUNTA($X$387:X393),1)),ROUND(V394*100/ORÇAMENTO.Totalorçamento,2))","v":0}]
[null,null,null,null,null,null,null,null,null,null,null,null,null,null,"8.","",null,null,{"$f":"IF(P396=\"\",$S$409-SUM(OFFSET($S$387:S394,0,0,COUNTA($S$387:S394),1)),SUMIF($R$19:$R$335,$P395,$W$19:$W$335))","v":0},null,null,{"$f":"IF(P396=\"\",$V$409-SUM(OFFSET($V$387:V394,0,0,COUNTA($V$387:V394),1)),ROUND(S395*(1+BDI.Taxa),2))","v":0},null,{"$f":"IF(P396=\"\",$X$409-SUM(OFFSET($X$387:X394,0,0,COUNTA($X$387:X394),1)),ROUND(V395*100/ORÇAMENTO.Totalorçamento,2))","v":0}]
[null,null,null,null,null,null,null,null,null,null,null,null,null,null,"9.","",null,null,{"$f":"IF(P397=\"\",$S$409-SUM(OFFSET($S$387:S395,0,0,COUNTA($S$387:S395),1)),SUMIF($R$19:$R$335,$P396,$W$19:$W$335))","v":0},null,null,{"$f":"IF(P397=\"\",$V$409-SUM(OFFSET($V$387:V395,0,0,COUNTA($V$387:V395),1)),ROUND(S396*(1+BDI.Taxa),2))","v":0},null,{"$f":"IF(P397=\"\",$X$409-SUM(OFFSET($X$387:X395,0,0,COUNTA($X$387:X395),1)),ROUND(V396*100/ORÇAMENTO.Totalorçamento,2))","v":0}]
[null,null,null,null,null,null,null,null,null,null,null,null,null,null,"10.","",null,null,{"$f":"IF(P398=\"\",$S$409-SUM(OFFSET($S$387:S396,0,0,COUNTA($S$387:S396),1)),SUMIF($R$19:$R$335,$P397,$W$19:$W$335))","v":0},null,null,{"$f":"IF(P398=\"\",$V$409-SUM(OFFSET($V$387:V396,0,0,COUNTA($V$387:V396),1)),ROUND(S397*(1+BDI.Taxa),2))","v":0},null,{"$f":"IF(P398=\"\",$X$409-SUM(OFFSET($X$387:X396,0,0,COUNTA($X$387:X396),1)),ROUND(V397*100/ORÇAMENTO.Totalorçamento,2))","v":0}]
[null,null,null,null,null,null,null,null,null,null,null,null,null,null,"11.","",null,null,{"$f":"IF(P399=\"\",$S$409-SUM(OFFSET($S$387:S397,0,0,COUNTA($S$387:S397),1)),SUMIF($R$19:$R$335,$P398,$W$19:$W$335))","v":0},null,null,{"$f":"IF(P399=\"\",$V$409-SUM(OFFSET($V$387:V397,0,0,COUNTA($V$387:V397),1)),ROUND(S398*(1+BDI.Taxa),2))","v":0},null,{"$f":"IF(P399=\"\",$X$409-SUM(OFFSET($X$387:X397,0,0,COUNTA($X$387:X397),1)),ROUND(V398*100/ORÇAMENTO.Totalorçamento,2))","v":0}]
[null,null,null,null,null,null,null,null,null,null,null,null,null,null,"12.","",null,null,{"$f":"IF(P400=\"\",$S$409-SUM(OFFSET($S$387:S398,0,0,COUNTA($S$387:S398),1)),SUMIF($R$19:$R$335,$P399,$W$19:$W$335))","v":0},null,null,{"$f":"IF(P400=\"\",$V$409-SUM(OFFSET($V$387:V398,0,0,COUNTA($V$387:V398),1)),ROUND(S399*(1+BDI.Taxa),2))","v":0},null,{"$f":"IF(P400=\"\",$X$409-SUM(OFFSET($X$387:X398,0,0,COUNTA($X$387:X398),1)),ROUND(V399*100/ORÇAMENTO.Totalorçamento,2))","v":0}]
[null,null,null,null,null,null,null,null,null,null,null,null,null,null,"13.","",null,null,{"$f":"IF(P401=\"\",$S$409-SUM(OFFSET($S$387:S399,0,0,COUNTA($S$387:S399),1)),SUMIF($R$19:$R$335,$P400,$W$19:$W$335))","v":0},null,null,{"$f":"IF(P401=\"\",$V$409-SUM(OFFSET($V$387:V399,0,0,COUNTA($V$387:V399),1)),ROUND(S400*(1+BDI.Taxa),2))","v":0},null,{"$f":"IF(P401=\"\",$X$409-SUM(OFFSET($X$387:X399,0,0,COUNTA($X$387:X399),1)),ROUND(V400*100/ORÇAMENTO.Totalorçamento,2))","v":0}]
[null,null,null,null,null,null,null,null,null,null,null,null,null,null,"14.","",null,null,{"$f":"IF(P402=\"\",$S$409-SUM(OFFSET($S$387:S400,0,0,COUNTA($S$387:S400),1)),SUMIF($R$19:$R$335,$P401,$W$19:$W$335))","v":0},null,null,{"$f":"IF(P402=\"\",$V$409-SUM(OFFSET($V$387:V400,0,0,COUNTA($V$387:V400),1)),ROUND(S401*(1+BDI.Taxa),2))","v":0},null,{"$f":"IF(P402=\"\",$X$409-SUM(OFFSET($X$387:X400,0,0,COUNTA($X$387:X400),1)),ROUND(V401*100/ORÇAMENTO.Totalorçamento,2))","v":0}]
[null,null,null,null,null,null,null,null,null,null,null,null,null,null,"15.","",null,null,{"$f":"IF(P403=\"\",$S$409-SUM(OFFSET($S$387:S401,0,0,COUNTA($S$387:S401),1)),SUMIF($R$19:$R$335,$P402,$W$19:$W$335))","v":0},null,null,{"$f":"IF(P403=\"\",$V$409-SUM(OFFSET($V$387:V401,0,0,COUNTA($V$387:V401),1)),ROUND(S402*(1+BDI.Taxa),2))","v":0},null,{"$f":"IF(P403=\"\",$X$409-SUM(OFFSET($X$387:X401,0,0,COUNTA($X$387:X401),1)),ROUND(V402*100/ORÇAMENTO.Totalorçamento,2))","v":0}]
[null,null,null,null,null,null,null,null,null,null,null,null,null,null,"16.","",null,null,{"$f":"IF(P404=\"\",$S$409-SUM(OFFSET($S$387:S402,0,0,COUNTA($S$387:S402),1)),SUMIF($R$19:$R$335,$P403,$W$19:$W$335))","v":0},null,null,{"$f":"IF(P404=\"\",$V$409-SUM(OFFSET($V$387:V402,0,0,COUNTA($V$387:V402),1)),ROUND(S403*(1+BDI.Taxa),2))","v":0},null,{"$f":"IF(P404=\"\",$X$409-SUM(OFFSET($X$387:X402,0,0,COUNTA($X$387:X402),1)),ROUND(V403*100/ORÇAMENTO.Totalorçamento,2))","v":0}]
[null,null,null,null,null,null,null,null,null,null,null,null,null,null,"17.","",null,null,{"$f":"IF(P405=\"\",$S$409-SUM(OFFSET($S$387:S403,0,0,COUNTA($S$387:S403),1)),SUMIF($R$19:$R$335,$P404,$W$19:$W$335))","v":0},null,null,{"$f":"IF(P405=\"\",$V$409-SUM(OFFSET($V$387:V403,0,0,COUNTA($V$387:V403),1)),ROUND(S404*(1+BDI.Taxa),2))","v":0},null,{"$f":"IF(P405=\"\",$X$409-SUM(OFFSET($X$387:X403,0,0,COUNTA($X$387:X403),1)),ROUND(V404*100/ORÇAMENTO.Totalorçamento,2))","v":0}]
[null,null,null,null,null,null,null,null,null,null,null,null,null,null,"18.","",null,null,{"$f":"IF(P406=\"\",$S$409-SUM(OFFSET($S$387:S404,0,0,COUNTA($S$387:S404),1)),SUMIF($R$19:$R$335,$P405,$W$19:$W$335))","v":0},null,null,{"$f":"IF(P406=\"\",$V$409-SUM(OFFSET($V$387:V404,0,0,COUNTA($V$387:V404),1)),ROUND(S405*(1+BDI.Taxa),2))","v":0},null,{"$f":"IF(P406=\"\",$X$409-SUM(OFFSET($X$387:X404,0,0,COUNTA($X$387:X404),1)),ROUND(V405*100/ORÇAMENTO.Totalorçamento,2))","v":0}]
[null,null,null,null,null,null,null,null,null,null,null,null,null,null,"19.","",null,null,{"$f":"IF(P407=\"\",$S$409-SUM(OFFSET($S$387:S405,0,0,COUNTA($S$387:S405),1)),SUMIF($R$19:$R$335,$P406,$W$19:$W$335))","v":0},null,null,{"$f":"IF(P407=\"\",$V$409-SUM(OFFSET($V$387:V405,0,0,COUNTA($V$387:V405),1)),ROUND(S406*(1+BDI.Taxa),2))","v":0},null,{"$f":"IF(P407=\"\",$X$409-SUM(OFFSET($X$387:X405,0,0,COUNTA($X$387:X405),1)),ROUND(V406*100/ORÇAMENTO.Totalorçamento,2))","v":0}]
[null,null,null,null,null,null,null,null,null,null,null,null,null,null,"20.","",null,null,{"$f":"IF(P408=\"\",$S$409-SUM(OFFSET($S$387:S406,0,0,COUNTA($S$387:S406),1)),SUMIF($R$19:$R$335,$P407,$W$19:$W$335))","v":0},null,null,{"$f":"IF(P408=\"\",$V$409-SUM(OFFSET($V$387:V406,0,0,COUNTA($V$387:V406),1)),ROUND(S407*(1+BDI.Taxa),2))","v":0},null,{"$f":"IF(P408=\"\",$X$409-SUM(OFFSET($X$387:X406,0,0,COUNTA($X$387:X406),1)),ROUND(V407*100/ORÇAMENTO.Totalorçamento,2))","v":0}]
[null,null,null,null,null,null,null,null,null,null,null,null,null,null,"TOTAL GERAL DO ORÇAMENTO (R$)",null,null,null,{"$f":"SUM(S388:U407)","v":0},null,null,{"$f":"SUM(V388:W407)","v":0},null,{"$f":"SUM(X388:X407)","v":100}]
[null,null,null,null,null,null,null,null,null,null,null,null,null,null,null,null,null,null,{"$f":"$W$336","v":0},null,null,{"$f":"$W$338","v":0},null,100]
[null,null,null,null,null,null,null,null,null,null,null,null,null,null,null,null,null,null,"(TOTAL SEM BDI)",null,null,"(TOTAL COM BDI)",null,"(ARRED porcentagem)"]
[null,null,null,null,null,null,null,null,null,null,null,null,null,null,null,null,null,null,{"$f":"IF(AND(S408=S409,S408>0),\"OK\",\"ERRO\")","v":"ERRO"},null,null,{"$f":"IF(AND(V408=V409,V408>0),\"OK\",\"ERRO\")","v":"ERRO"},null,{"$f":"IF(AND(X408=100,S388<>0),\"OK\",\"ERRO\")","v":"ERRO"}]

{"sheet":"Resumo ","index":1,"n_rows":39,"n_cols":9,"rows_kept":39,"cut":false,"hidden":false,"merged":[[42,3,42,7],[11,1,11,2],[12,1,12,2],[15,2,15,3],[16,2,16,3],[14,1,14,8],[17,2,17,3],[23,2,23,3],[18,2,18,3],[19,2,19,3],[20,2,20,3],[41,3,41,7],[24,2,24,3],[26,2,26,3],[27,2,27,3],[38,1,38,8],[1,1,1,8],[2,6,2,8],[3,6,3,8],[4,1,4,8],[5,6,5,8],[6,6,6,8],[7,1,7,8],[8,6,8,8],[9,6,9,8],[13,1,13,8],[0,1,0,8],[36,1,36,5],[2,1,2,5],[3,1,3,5],[5,1,5,5],[6,1,6,5],[8,1,8,5],[9,1,9,5],[11,3,11,5],[12,3,12,5],[10,1,10,8],[11,6,11,8],[12,6,12,8],[25,2,25,3],[21,2,21,3],[22,2,22,3],[13,0,14,0],[34,2,34,3],[35,2,35,3],[31,2,31,3],[32,2,32,3],[33,2,33,3],[28,2,28,3],[29,2,29,3],[30,2,30,3]]}
[]
[]
[null,"UNIDADE ESCOLAR",null,null,null,null,"CÓDIGO INEP"]
[null,{"$f":"Orçamento!$O$4","v":"COLÉGIO ESTADUAL VALPARAIZO"},null,null,null,null,{"$f":"Orçamento!V4","v":52047229}]
[]
[null,"OBRA",null,null,null,null,"CIDADE"]
[null,{"$f":"Orçamento!$O$7","v":"REFORMA"},null,null,null,null,{"$f":"Orçamento!$V$7","v":"VALPARAÍSO DE GOIÁS"}]
[]
[null,"ENDEREÇO",null,null,null,null,"CRE"]
[null,{"$f":"Orçamento!$R$10","v":"PRACA CENTRAL ETAPA A, VALPARAISO I, CEP:72876-030"},null,null,null,null,{"$f":"Orçamento!$O$10","v":"NOVO GAMA"}]
[]
[null,"REFERÊNCIA",null,"DATA",null,null,"ÁREA TOTAL CONSTRUÍDA (M²)"]
[null,{"$f":"CONCATENATE(\"AGETOP E SINAPI - \",Orçamento!$T$10)","v":"AGETOP E SINAPI - DESONERADA"},null,{"$f":"Orçamento!$S$7","v":"2020-09-02"},null,null,{"$f":"Orçamento!$V$13","v":1620.6}]
["FILTRO"]
[null,"RESUMO GERAL DO ORÇAMENTO"]
["↓","ITEM","DESCRIÇÃO DOS SERVIÇOS",null,"UNID","QUANT","PREÇO SEM BDI","PREÇO COM BDI","PARTICIP. (%)"]
[{"$f":"IF(H17>0,\"F\",\"\")","v":""},"1.",{"$f":"Orçamento!$P388","v":"REFORMA"},null,{"$f":"IF(C17<>\"\",\"UN\",\"\")","v":"UN"},{"$f":"IF(C17<>\"\",1,\"\")","v":1},{"$f":"IFERROR(Orçamento!S388,\"-\")","v":0},{"$f":"IFERROR(Orçamento!V388,\"\")","v":0},{"$f":"Orçamento!X388","v":100}]
[{"$f":"IF(H18>0,\"F\",\"\")","v":""},"2.",{"$f":"Orçamento!$P389","v":""},null,{"$f":"IF(C18<>\"\",\"UN\",\"\")","v":""},{"$f":"IF(C18<>\"\",1,\"\")","v":""},{"$f":"IFERROR(Orçamento!S389,\"-\")","v":0},{"$f":"IFERROR(Orçamento!V389,\"\")","v":0},{"$f":"Orçamento!X389","v":0}]
[{"$f":"IF(H19>0,\"F\",\"\")","v":""},"3.",{"$f":"Orçamento!$P390","v":""},null,"","",{"$f":"IFERROR(Orçamento!S390,\"-\")","v":0},{"$f":"IFERROR(Orçamento!V390,\"\")","v":0},{"$f":"Orçamento!X390","v":0}]
["","4.",{"$f":"Orçamento!$P391","v":""},null,"","",{"$f":"IFERROR(Orçamento!S391,\"-\")","v":0},{"$f":"IFERROR(Orçamento!V391,\"\")","v":0},{"$f":"Orçamento!X391","v":0}]
["","5.",{"$f":"Orçamento!$P392","v":""},null,"","",{"$f":"IFERROR(Orçamento!S392,\"-\")","v":0},{"$f":"IFERROR(Orçamento!V392,\"\")","v":0},{"$f":"Orçamento!X392","v":0}]
["","6.",{"$f":"Orçamento!$P393","v":""},null,"","",{"$f":"IFERROR(Orçamento!S393,\"-\")","v":0},{"$f":"IFERROR(Orçamento!V393,\"\")","v":0},{"$f":"Orçamento!X393","v":0}]
["","7.",{"$f":"Orçamento!$P394","v":""},null,"","",{"$f":"IFERROR(Orçamento!S394,\"-\")","v":0},{"$f":"IFERROR(Orçamento!V394,\"\")","v":0},{"$f":"Orçamento!X394","v":0}]
["","8.",{"$f":"Orçamento!$P395","v":""},null,"","",{"$f":"IFERROR(Orçamento!S395,\"-\")","v":0},{"$f":"IFERROR(Orçamento!V395,\"\")","v":0},{"$f":"Orçamento!X395","v":0}]
["","9.",{"$f":"Orçamento!$P396","v":""},null,"","",{"$f":"IFERROR(Orçamento!S396,\"-\")","v":0},{"$f":"IFERROR(Orçamento!V396,\"\")","v":0},{"$f":"Orçamento!X396","v":0}]
["","10.",{"$f":"Orçamento!$P397","v":""},null,"","",{"$f":"IFERROR(Orçamento!S397,\"-\")","v":0},{"$f":"IFERROR(Orçamento!V397,\"\")","v":0},{"$f":"Orçamento!X397","v":0}]
["","11.",{"$f":"Orçamento!$P398","v":""},null,"","",{"$f":"IFERROR(Orçamento!S398,\"-\")","v":0},{"$f":"IFERROR(Orçamento!V398,\"\")","v":0},{"$f":"Orçamento!X398","v":0}]
["","12.",{"$f":"Orçamento!$P399","v":""},null,"","",{"$f":"IFERROR(Orçamento!S399,\"-\")","v":0},{"$f":"IFERROR(Orçamento!V399,\"\")","v":0},{"$f":"Orçamento!X399","v":0}]
["","13.",{"$f":"Orçamento!$P400","v":""},null,"","",{"$f":"IFERROR(Orçamento!S400,\"-\")","v":0},{"$f":"IFERROR(Orçamento!V400,\"\")","v":0},{"$f":"Orçamento!X400","v":0}]
["","14.",{"$f":"Orçamento!$P401","v":""},null,"","",{"$f":"IFERROR(Orçamento!S401,\"-\")","v":0},{"$f":"IFERROR(Orçamento!V401,\"\")","v":0},{"$f":"Orçamento!X401","v":0}]
["","15.",{"$f":"Orçamento!$P402","v":""},null,"","",{"$f":"IFERROR(Orçamento!S402,\"-\")","v":0},{"$f":"IFERROR(Orçamento!V402,\"\")","v":0},{"$f":"Orçamento!X402","v":0}]
["","16.",{"$f":"Orçamento!$P403","v":""},null,"","",{"$f":"IFERROR(Orçamento!S403,\"-\")","v":0},{"$f":"IFERROR(Orçamento!V403,\"\")","v":0},{"$f":"Orçamento!X403","v":0}]
["","17.",{"$f":"Orçamento!$P404","v":""},null,"","",{"$f":"IFERROR(Orçamento!S404,\"-\")","v":0},{"$f":"IFERROR(Orçamento!V404,\"\")","v":0},{"$f":"Orçamento!X404","v":0}]
["","18.",{"$f":"Orçamento!$P405","v":""},null,"","",{"$f":"IFERROR(Orçamento!S405,\"-\")","v":0},{"$f":"IFERROR(Orçamento!V405,\"\")","v":0},{"$f":"Orçamento!X405","v":0}]
["","19.",{"$f":"Orçamento!$P406","v":""},null,"","",{"$f":"IFERROR(Orçamento!S406,\"-\")","v":0},{"$f":"IFERROR(Orçamento!V406,\"\")","v":0},{"$f":"Orçamento!X406","v":0}]
["","20.",{"$f":"Orçamento!$P407","v":""},null,"","",{"$f":"IFERROR(Orçamento!S407,\"-\")","v":0},{"$f":"IFERROR(Orçamento!V407,\"\")","v":0},{"$f":"Orçamento!X407","v":0}]
["F","TOTAL GERAL DO ORÇAMENTO (R$)",null,null,null,null,{"$f":"SUM(G17:G36)","v":0},{"$f":"SUM(H17:H36)","v":0},{"$f":"SUM(I17:I36)","v":100}]
["F"]
["F"]

{"sheet":"Somatório","index":2,"n_rows":45,"n_cols":6,"rows_kept":45,"cut":false,"hidden":false,"merged":[[0,1,0,5],[14,1,14,5],[2,1,2,3],[2,4,2,5],[3,1,3,3],[3,4,3,5],[5,1,5,3],[5,4,5,5],[6,1,6,3],[6,4,6,5],[8,1,8,3],[8,4,8,5],[1,1,1,5],[4,1,4,5],[7,1,7,5],[10,1,10,5],[9,1,9,3],[9,4,9,5],[11,1,11,2],[11,4,11,5],[12,1,12,2],[12,4,12,5],[13,0,14,0],[42,1,42,2],[44,1,44,5],[47,3,47,5],[48,3,48,5],[13,1,13,5]]}
[]
[]
[null,"UNIDADE ESCOLAR",null,null,"CÓDIGO INEP"]
[null,{"$f":"Orçamento!$O$4","v":"COLÉGIO ESTADUAL VALPARAIZO"},null,null,{"$f":"Orçamento!V4","v":52047229}]
[]
[null,"OBRA",null,null,"CIDADE"]
[null,{"$f":"Orçamento!$O$7","v":"REFORMA"},null,null,{"$f":"Orçamento!$V$7","v":"VALPARAÍSO DE GOIÁS"}]
[]
[null,"ENDEREÇO",null,null,"CRE"]
[null,{"$f":"Orçamento!$R$10","v":"PRACA CENTRAL ETAPA A, VALPARAISO I, CEP:72876-030"},null,null,{"$f":"Orçamento!$O$10","v":"NOVO GAMA"}]
[]
[null,"REFERÊNCIA",null,"DATA","ÁREA TOTAL CONSTRUÍDA (M²)"]
[null,{"$f":"CONCATENATE(\"AGETOP E SINAPI - \",Orçamento!$T$10)","v":"AGETOP E SINAPI - DESONERADA"},null,{"$f":"Orçamento!$S$7","v":"2020-09-02"},{"$f":"Orçamento!$V$13","v":1620.6}]
["FILTRO"]
[null,"SOMATÓRIO DE SERVIÇOS"]
["↓","ITEM","DESCRIÇÃO DOS SERVIÇOS","PREÇO SEM BDI (R$)","PREÇO COM BDI (R$)","PARTIC.  ( % )"]
[{"$f":"IF(D17>0,\"F\",\"\")","v":""},"a.",{"$f":"Orçamento!P354","v":"SERVIÇOS PRELIMINARES"},{"$f":"Orçamento!S354","v":0},{"$f":"Orçamento!V354","v":0},{"$f":"Orçamento!X354","v":0}]
[{"$f":"IF(D18>0,\"F\",\"\")","v":""},"b.",{"$f":"Orçamento!P355","v":"TRANSPORTES"},{"$f":"Orçamento!S355","v":0},{"$f":"Orçamento!V355","v":0},{"$f":"Orçamento!X355","v":0}]
["","c.",{"$f":"Orçamento!P356","v":"SERVIÇO EM TERRA"},{"$f":"Orçamento!S356","v":0},{"$f":"Orçamento!V356","v":0},{"$f":"Orçamento!X356","v":0}]
["","d.",{"$f":"Orçamento!P357","v":"FUNDAÇÕES E SONDAGENS"},{"$f":"Orçamento!S357","v":0},{"$f":"Orçamento!V357","v":0},{"$f":"Orçamento!X357","v":0}]
["","e.",{"$f":"Orçamento!P358","v":"ESTRUTURA"},{"$f":"Orçamento!S358","v":0},{"$f":"Orçamento!V358","v":0},{"$f":"Orçamento!X358","v":0}]
["","f.",{"$f":"Orçamento!P359","v":"INSTALAÇÕES ELÉTRICAS"},{"$f":"Orçamento!S359","v":0},{"$f":"Orçamento!V359","v":0},{"$f":"Orçamento!X359","v":0}]
["","g.",{"$f":"Orçamento!P360","v":"INSTALAÇÕES HIDROSSANITÁRIAS"},{"$f":"Orçamento!S360","v":0},{"$f":"Orçamento!V360","v":0},{"$f":"Orçamento!X360","v":0}]
["","h.",{"$f":"Orçamento!P361","v":"INSTALAÇÕES ESPECIAIS"},{"$f":"Orçamento!S361","v":0},{"$f":"Orçamento!V361","v":0},{"$f":"Orçamento!X361","v":0}]
["","i.",{"$f":"Orçamento!P362","v":"ALVENARIAS E DIVISÓRIAS"},{"$f":"Orçamento!S362","v":0},{"$f":"Orçamento!V362","v":0},{"$f":"Orçamento!X362","v":0}]
["","j.",{"$f":"Orçamento!P363","v":"ALVENARIA AUTO-PORTANTE"},{"$f":"Orçamento!S363","v":0},{"$f":"Orçamento!V363","v":0},{"$f":"Orçamento!X363","v":0}]
["","k.",{"$f":"Orçamento!P364","v":"IMPERMEABILIZAÇÃO"},{"$f":"Orçamento!S364","v":0},{"$f":"Orçamento!V364","v":0},{"$f":"Orçamento!X364","v":0}]
["","l.",{"$f":"Orçamento!P365","v":"ISOLAMENTO TÉRMICO E ACÚSTICO"},{"$f":"Orçamento!S365","v":0},{"$f":"Orçamento!V365","v":0},{"$f":"Orçamento!X365","v":0}]
["","m.",{"$f":"Orçamento!P366","v":"ESTRUTURA DE MADEIRA"},{"$f":"Orçamento!S366","v":0},{"$f":"Orçamento!V366","v":0},{"$f":"Orçamento!X366","v":0}]
["","n.",{"$f":"Orçamento!P367","v":"ESTRUTURAS METÁLICAS"},{"$f":"Orçamento!S367","v":0},{"$f":"Orçamento!V367","v":0},{"$f":"Orçamento!X367","v":0}]
["","o.",{"$f":"Orçamento!P368","v":"COBERTURAS"},{"$f":"Orçamento!S368","v":0},{"$f":"Orçamento!V368","v":0},{"$f":"Orçamento!X368","v":0}]
["","p.",{"$f":"Orçamento!P369","v":"ESQUADRIAS DE MADEIRA"},{"$f":"Orçamento!S369","v":0},{"$f":"Orçamento!V369","v":0},{"$f":"Orçamento!X369","v":0}]
["","q.",{"$f":"Orçamento!P370","v":"ESQUADRIAS METÁLICAS"},{"$f":"Orçamento!S370","v":0},{"$f":"Orçamento!V370","v":0},{"$f":"Orçamento!X370","v":0}]
["","r.",{"$f":"Orçamento!P371","v":"VIDROS"},{"$f":"Orçamento!S371","v":0},{"$f":"Orçamento!V371","v":0},{"$f":"Orçamento!X371","v":0}]
["","s.",{"$f":"Orçamento!P372","v":"REVESTIMENTO DE PAREDE"},{"$f":"Orçamento!S372","v":0},{"$f":"Orçamento!V372","v":0},{"$f":"Orçamento!X372","v":0}]
["","t.",{"$f":"Orçamento!P373","v":"FORROS"},{"$f":"Orçamento!S373","v":0},{"$f":"Orçamento!V373","v":0},{"$f":"Orçamento!X373","v":0}]
["","u.",{"$f":"Orçamento!P374","v":"REVESTIMENTO DE PISO"},{"$f":"Orçamento!S374","v":0},{"$f":"Orçamento!V374","v":0},{"$f":"Orçamento!X374","v":0}]
["","v.",{"$f":"Orçamento!P375","v":"FERRAGENS"},{"$f":"Orçamento!S375","v":0},{"$f":"Orçamento!V375","v":0},{"$f":"Orçamento!X375","v":0}]
["","w.",{"$f":"Orçamento!P376","v":"MARCENARIA"},{"$f":"Orçamento!S376","v":0},{"$f":"Orçamento!V376","v":0},{"$f":"Orçamento!X376","v":0}]
["","x.",{"$f":"Orçamento!P377","v":"ADMINISTRAÇÃO"},{"$f":"Orçamento!S377","v":0},{"$f":"Orçamento!V377","v":0},{"$f":"Orçamento!X377","v":0}]
["","y.",{"$f":"Orçamento!P378","v":"PINTURA"},{"$f":"Orçamento!S378","v":0},{"$f":"Orçamento!V378","v":0},{"$f":"Orçamento!X378","v":0}]
["","z.",{"$f":"Orçamento!P379","v":"DIVERSOS"},{"$f":"Orçamento!S379","v":0},{"$f":"Orçamento!V379","v":0},{"$f":"Orçamento!X379","v":0}]
["F","TOTAL GERAL DO ORÇAMENTO",null,{"$f":"SUM(D17:D42)","v":0},{"$f":"SUM(E17:E42)","v":0},{"$f":"SUM(F17:F42)","v":0}]
[]
[null,"(*) Para itens da AGETOP, os vidros não estão inclusos nas esquadrias e já foram considerados os custos de contramarco para as esquadrias de alumínio;"]

{"sheet":"Cronog_90_Dias","index":3,"n_rows":99,"n_cols":20,"rows_kept":99,"cut":false,"hidden":false,"merged":[[97,1,97,4],[98,1,98,17],[94,1,94,2],[94,5,94,8],[94,9,94,12],[94,13,94,16],[95,1,95,2],[95,5,95,8],[95,9,95,12],[95,13,95,16],[92,1,92,2],[92,5,92,8],[92,9,92,12],[92,13,92,16],[93,1,93,2],[93,5,93,8],[93,9,93,12],[93,13,93,16],[89,1,91,2],[89,3,91,3],[89,4,91,4],[89,5,89,8],[89,9,89,12],[89,13,89,16],[91,5,91,8],[91,9,91,12],[91,13,91,16],[86,1,88,2],[86,3,88,3],[86,4,88,4],[86,5,86,8],[86,9,86,12],[86,13,86,16],[88,5,88,8],[88,9,88,12],[88,13,88,16],[83,1,85,2],[83,3,85,3],[83,4,85,4],[83,5,83,8],[83,9,83,12],[83,13,83,16],[85,5,85,8],[85,9,85,12],[85,13,85,16],[80,1,82,2],[80,3,82,3],[80,4,82,4],[80,5,80,8],[80,9,80,12],[80,13,80,16],[82,5,82,8],[82,9,82,12],[82,13,82,16],[77,1,79,2],[77,3,79,3],[77,4,79,4],[77,5,77,8],[77,9,77,12],[77,13,77,16],[79,5,79,8],[79,9,79,12],[79,13,79,16],[74,1,76,2],[74,3,76,3],[74,4,76,4],[74,5,74,8],[74,9,74,12],[74,13,74,16],[76,5,76,8],[76,9,76,12],[76,13,76,16],[71,1,73,2],[71,3,73,3],[71,4,73,4],[71,5,71,8],[71,9,71,12],[71,13,71,16],[73,5,73,8],[73,9,73,12],[73,13,73,16],[68,1,70,2],[68,3,70,3],[68,4,70,4],[68,5,68,8],[68,9,68,12],[68,13,68,16],[70,5,70,8],[70,9,70,12],[70,13,70,16],[65,1,67,2],[65,3,67,3],[65,4,67,4],[65,5,65,8],[65,9,65,12],[65,13,65,16],[67,5,67,8],[67,9,67,12],[67,13,67,16],[62,1,64,2],[62,3,64,3],[62,4,64,4],[62,5,62,8],[62,9,62,12],[62,13,62,16],[64,5,64,8],[64,9,64,12],[64,13,64,16],[59,1,61,2],[59,3,61,3],[59,4,61,4],[59,5,59,8],[59,9,59,12],[59,13,59,16],[61,5,61,8],[61,9,61,12],[61,13,61,16],[56,1,58,2],[56,3,58,3],[56,4,58,4],[56,5,56,8],[56,9,56,12],[56,13,56,16],[58,5,58,8],[58,9,58,12],[58,13,58,16],[53,1,55,2],[53,3,55,3],[53,4,55,4],[53,5,53,8],[53,9,53,12],[53,13,53,16],[55,5,55,8],[55,9,55,12],[55,13,55,16],[50,1,52,2],[50,3,52,3],[50,4,52,4],[50,5,50,8],[50,9,50,12],[50,13,50,16],[52,5,52,8],[52,9,52,12],[52,13,52,16],[47,1,49,2],[47,3,49,3],[47,4,49,4],[47,5,47,8],[47,9,47,12],[47,13,47,16],[49,5,49,8],[49,9,49,12],[49,13,49,16],[44,1,46,2],[44,3,46,3],[44,4,46,4],[44,5,44,8],[44,9,44,12],[44,13,44,16],[46,5,46,8],[46,9,46,12],[46,13,46,16],[41,1,43,2],[41,3,43,3],[41,4,43,4],[41,5,41,8],[41,9,41,12],[41,13,41,16],[43,5,43,8],[43,9,43,12],[43,13,43,16],[38,1,40,2],[38,3,40,3],[38,4,40,4],[38,5,38,8],[38,9,38,12],[38,13,38,16],[40,5,40,8],[40,9,40,12],[40,13,40,16],[35,1,37,2],[35,3,37,3],[35,4,37,4],[35,5,35,8],[35,9,35,12],[35,13,35,16],[37,5,37,8],[37,9,37,12],[37,13,37,16],[32,1,34,2],[32,3,34,3],[32,4,34,4],[32,5,32,8],[32,9,32,12],[32,13,32,16],[34,5,34,8],[34,9,34,12],[34,13,34,16],[29,1,31,2],[29,3,31,3],[29,4,31,4],[29,5,29,8],[29,9,29,12],[29,13,29,16],[31,5,31,8],[31,9,31,12],[31,13,31,16],[26,1,28,2],[26,3,28,3],[26,4,28,4],[26,5,26,8],[26,9,26,12],[26,13,26,16],[28,5,28,8],[28,9,28,12],[28,13,28,16],[23,1,25,2],[23,3,25,3],[23,4,25,4],[23,5,23,8],[23,9,23,12],[23,13,23,16],[25,5,25,8],[25,9,25,12],[25,13,25,16],[20,1,22,2],[20,3,22,3],[20,4,22,4],[20,5,20,8],[20,9,20,12],[20,13,20,16],[22,5,22,8],[22,9,22,12],[22,13,22,16],[17,1,19,2],[17,3,19,3],[17,4,19,4],[17,5,17,8],[17,9,17,12],[17,13,17,16],[19,5,19,8],[19,9,19,12],[19,13,19,16],[14,1,16,2],[14,3,16,3],[14,4,16,4],[14,5,14,8],[14,9,14,12],[14,13,14,16],[16,5,16,8],[16,9,16,12],[16,13,16,16],[12,0,13,0],[12,3,13,3],[12,5,12,8],[12,9,12,12],[12,13,12,16],[12,17,13,17],[13,1,13,2],[13,5,13,8],[13,9,13,12],[13,13,13,16],[0,1,0,17],[1,1,1,17],[2,1,2,7],[2,8,2,17],[3,1,3,7],[3,8,3,17],[8,1,8,7],[8,8,8,17],[9,0,11,0],[9,1,9,7],[9,8,9,17],[10,1,10,17],[11,1,11,17],[4,1,4,17],[5,1,5,7],[5,8,5,17],[6,1,6,7],[6,8,6,17],[7,1,7,17]]}
[]
[]
[null,"UNIDADE ESCOLAR",null,null,null,null,null,null,"PRAZO"]
[null,{"$f":"Orçamento!O4","v":"COLÉGIO ESTADUAL VALPARAIZO"},null,null,null,null,null,null,"90 DIAS CORRIDOS"]
[]
[null,"OBRA",null,null,null,null,null,null,"DATA"]
[null,{"$f":"Orçamento!O7","v":"REFORMA"},null,null,null,null,null,null,{"$f":"Orçamento!S7","v":"2020-09-02"}]
[]
[null,"LOCAL",null,null,null,null,null,null,"ÁREA TOTAL CONSTRUÍDA (M²)"]
["FILTRO",{"$f":"Orçamento!V7","v":"VALPARAÍSO DE GOIÁS"},null,null,null,null,null,null,{"$f":"Orçamento!V13","v":1620.6}]
[]
[null,"CRONOGRAMA - FÍSICO FINANCEIRO"]
["↓","CUSTO TOTAL:",{"$f":"D93","v":0},"VALOR","Dias:",30,null,null,null,60,null,null,null,90,null,null,null,"TOTAL"]
[null,"DESCRIÇÃO DOS SERVIÇOS",null,null,"%","1ª PARCELA",null,null,null,"2ª PARCELA",null,null,null,"3ª PARCELA"]
[{"$f":"IF(D15>0,\"F\",\"\")","v":""},"SERVIÇOS PRELIMINARES",null,{"$f":"Orçamento!V354","v":0},{"$f":"Orçamento!X354","v":0},{"$f":"ROUND(F17*$D$15,2)","v":0},null,null,null,{"$f":"ROUND(J17*$D$15,2)","v":0},null,null,null,{"$f":"ROUND(N17*$D$15,2)","v":0},null,null,null,{"$f":"SUM(F15:Q15)","v":0},null,{"$f":"IF(D15=R15,\"OK\",\"ERRO\")","v":"OK"}]
[{"$f":"IF(A15=\"F\",A15,\"\")","v":""}]
[{"$f":"IF(A16=\"F\",A16,\"\")","v":""},null,null,null,null,1,null,null,null,0,null,null,null,{"$f":"1-F17-J17","v":0},null,null,null,{"$f":"IFERROR(E15/100,\"\")","v":0},null,{"$f":"IF(E15=R17*100,\"OK\",\"ERRO\")","v":"OK"}]
[{"$f":"IF(D18>0,\"F\",\"\")","v":""},"TRANSPORTES",null,{"$f":"Orçamento!V355","v":0},{"$f":"Orçamento!X355","v":0},{"$f":"ROUND(F20*$D$18,2)","v":0},null,null,null,{"$f":"ROUND(J20*$D$18,2)-0.01","v":-0.01},null,null,null,{"$f":"ROUND(N20*$D$18,2)","v":0},null,null,null,{"$f":"SUM(F18:Q18)","v":-0.01},null,{"$f":"IF(D18=R18,\"OK\",\"ERRO\")","v":"ERRO"}]
[{"$f":"IF(A18=\"F\",A18,\"\")","v":""}]
[{"$f":"IF(A19=\"F\",A19,\"\")","v":""},null,null,null,null,0.37,null,null,null,0.3,null,null,null,{"$f":"1-F20-J20","v":0.33},null,null,null,{"$f":"IFERROR(E18/100,\"\")","v":0},null,{"$f":"IF(E18=R20*100,\"OK\",\"ERRO\")","v":"OK"}]
[{"$f":"IF(D21>0,\"F\",\"\")","v":""},"SERVIÇO EM TERRA",null,{"$f":"Orçamento!V356","v":0},{"$f":"Orçamento!X356","v":0},{"$f":"ROUND(F23*$D$21,2)","v":0},null,null,null,{"$f":"ROUND(J23*$D$21,2)","v":0},null,null,null,{"$f":"ROUND(N23*$D$21,2)","v":0},null,null,null,{"$f":"SUM(F21:Q21)","v":0},null,{"$f":"IF(D21=R21,\"OK\",\"ERRO\")","v":"OK"}]
[{"$f":"IF(A21=\"F\",A21,\"\")","v":""}]
[{"$f":"IF(A22=\"F\",A22,\"\")","v":""},null,null,null,null,1,null,null,null,0,null,null,null,{"$f":"1-F23-J23","v":0},null,null,null,{"$f":"IFERROR(E21/100,\"\")","v":0},null,{"$f":"IF(E21=R23*100,\"OK\",\"ERRO\")","v":"OK"}]
[{"$f":"IF(D24>0,\"F\",\"\")","v":""},"FUNDAÇÕES E SONDAGENS",null,{"$f":"Orçamento!V357","v":0},{"$f":"Orçamento!X357","v":0},{"$f":"ROUND(F26*$D$24,2)","v":0},null,null,null,{"$f":"ROUND(J26*$D$24,2)","v":0},null,null,null,{"$f":"ROUND(N26*$D$24,2)","v":0},null,null,null,{"$f":"SUM(F24:Q24)","v":0},null,{"$f":"IF(D24=R24,\"OK\",\"ERRO\")","v":"OK"}]
[{"$f":"IF(A24=\"F\",A24,\"\")","v":""}]
[{"$f":"IF(A25=\"F\",A25,\"\")","v":""},null,null,null,null,1,null,null,null,0,null,null,null,{"$f":"1-F26-J26","v":0},null,null,null,{"$f":"IFERROR(E24/100,\"\")","v":0},null,{"$f":"IF(E24=R26*100,\"OK\",\"ERRO\")","v":"OK"}]
[{"$f":"IF(D27>0,\"F\",\"\")","v":""},"ESTRUTURA",null,{"$f":"Orçamento!V358","v":0},{"$f":"Orçamento!X358","v":0},{"$f":"ROUND(F29*$D$27,2)","v":0},null,null,null,{"$f":"ROUND(J29*$D$27,2)","v":0},null,null,null,{"$f":"ROUND(N29*$D$27,2)","v":0},null,null,null,{"$f":"SUM(F27:Q27)","v":0},null,{"$f":"IF(D27=R27,\"OK\",\"ERRO\")","v":"OK"}]
[{"$f":"IF(A27=\"F\",A27,\"\")","v":""}]
[{"$f":"IF(A28=\"F\",A28,\"\")","v":""},null,null,null,null,0.54,null,null,null,0.46,null,null,null,{"$f":"1-F29-J29","v":0},null,null,null,{"$f":"IFERROR(E27/100,\"\")","v":0},null,{"$f":"IF(E27=R29*100,\"OK\",\"ERRO\")","v":"OK"}]
[{"$f":"IF(D30>0,\"F\",\"\")","v":""},"INST.ELET/TELEFÔNICA/CABEAMENTO ESTRUTURADO",null,{"$f":"Orçamento!V359","v":0},{"$f":"Orçamento!X359","v":0},{"$f":"ROUND(F32*$D$30,2)","v":0},null,null,null,{"$f":"ROUND(J32*$D$30,2)","v":0},null,null,null,{"$f":"ROUND(N32*$D$30,2)","v":0},null,null,null,{"$f":"SUM(F30:Q30)","v":0},null,{"$f":"IF(D30=R30,\"OK\",\"ERRO\")","v":"OK"}]
[{"$f":"IF(A30=\"F\",A30,\"\")","v":""}]
[{"$f":"IF(A31=\"F\",A31,\"\")","v":""},null,null,null,null,0,null,null,null,{"$f":"1-B32","v":1},null,null,null,{"$f":"1-F32-J32","v":0},null,null,null,{"$f":"IFERROR(E30/100,\"\")","v":0},null,{"$f":"IF(E30=R32*100,\"OK\",\"ERRO\")","v":"OK"}]
[{"$f":"IF(D33>0,\"F\",\"\")","v":""},"INSTALAÇÕES HIDROSSANITÁRIAS",null,{"$f":"Orçamento!V360","v":0},{"$f":"Orçamento!X360","v":0},{"$f":"ROUND(F35*$D$33,2)","v":0},null,null,null,{"$f":"ROUND(J35*$D$33,2)","v":0},null,null,null,{"$f":"ROUND(N35*$D$33,2)","v":0},null,null,null,{"$f":"SUM(F33:Q33)","v":0},null,{"$f":"IF(D33=R33,\"OK\",\"ERRO\")","v":"OK"}]
[{"$f":"IF(A33=\"F\",A33,\"\")","v":""}]
[{"$f":"IF(A34=\"F\",A34,\"\")","v":""},null,null,null,null,0,null,null,null,{"$f":"1-B35","v":1},null,null,null,{"$f":"1-F35-J35","v":0},null,null,null,{"$f":"IFERROR(E33/100,\"\")","v":0},null,{"$f":"IF(E33=R35*100,\"OK\",\"ERRO\")","v":"OK"}]
[{"$f":"IF(D36>0,\"F\",\"\")","v":""},"INSTALAÇÕES ESPECIAIS",null,{"$f":"Orçamento!V361","v":0},{"$f":"Orçamento!X361","v":0},{"$f":"ROUND(F38*$D$36,2)","v":0},null,null,null,{"$f":"ROUND(J38*$D$36,2)","v":0},null,null,null,{"$f":"ROUND(N38*$D$36,2)","v":0},null,null,null,{"$f":"SUM(F36:Q36)","v":0},null,{"$f":"IF(D36=R36,\"OK\",\"ERRO\")","v":"OK"}]
[{"$f":"IF(A36=\"F\",A36,\"\")","v":""}]
[{"$f":"IF(A37=\"F\",A37,\"\")","v":""},null,null,null,null,0,null,null,null,{"$f":"1-B38","v":1},null,null,null,{"$f":"1-F38-J38","v":0},null,null,null,{"$f":"IFERROR(E36/100,\"\")","v":0},null,{"$f":"IF(E36=R38*100,\"OK\",\"ERRO\")","v":"OK"}]
[{"$f":"IF(D39>0,\"F\",\"\")","v":""},"ALVENARIA E DIVISÓRIAS",null,{"$f":"Orçamento!V362","v":0},{"$f":"Orçamento!X362","v":0},{"$f":"ROUND(F41*$D$39,2)","v":0},null,null,null,{"$f":"ROUND(J41*$D$39,2)","v":0},null,null,null,{"$f":"ROUND(N41*$D$39,2)","v":0},null,null,null,{"$f":"SUM(F39:Q39)","v":0},null,{"$f":"IF(D39=R39,\"OK\",\"ERRO\")","v":"OK"}]
[{"$f":"IF(A39=\"F\",A39,\"\")","v":""}]
[{"$f":"IF(A40=\"F\",A40,\"\")","v":""},null,null,null,null,0,null,null,null,{"$f":"1-B41","v":1},null,null,null,{"$f":"1-F41-J41","v":0},null,null,null,{"$f":"IFERROR(E39/100,\"\")","v":0},null,{"$f":"IF(E39=R41*100,\"OK\",\"ERRO\")","v":"OK"}]
[{"$f":"IF(D42>0,\"F\",\"\")","v":""},"ALVENARIA AUTO-PORTANTE",null,{"$f":"Orçamento!V363","v":0},{"$f":"Orçamento!X363","v":0},{"$f":"ROUND(F44*$D$42,2)","v":0},null,null,null,{"$f":"ROUND(J44*$D$42,2)","v":0},null,null,null,{"$f":"ROUND(N44*$D$42,2)","v":0},null,null,null,{"$f":"SUM(F42:Q42)","v":0},null,{"$f":"IF(D42=R42,\"OK\",\"ERRO\")","v":"OK"}]
[{"$f":"IF(A42=\"F\",A42,\"\")","v":""}]
[{"$f":"IF(A43=\"F\",A43,\"\")","v":""},null,null,null,null,0,null,null,null,{"$f":"1-B44","v":1},null,null,null,{"$f":"1-F44-J44","v":0},null,null,null,{"$f":"IFERROR(E42/100,\"\")","v":0},null,{"$f":"IF(E42=R44*100,\"OK\",\"ERRO\")","v":"OK"}]
[{"$f":"IF(D45>0,\"F\",\"\")","v":""},"IMPERMEABILIZAÇÃO",null,{"$f":"Orçamento!V364","v":0},{"$f":"Orçamento!X364","v":0},{"$f":"ROUND(F47*$D$45,2)","v":0},null,null,null,{"$f":"ROUND(J47*$D$45,2)","v":0},null,null,null,{"$f":"ROUND(N47*$D$45,2)","v":0},null,null,null,{"$f":"SUM(F45:Q45)","v":0},null,{"$f":"IF(D45=R45,\"OK\",\"ERRO\")","v":"OK"}]
[{"$f":"IF(A45=\"F\",A45,\"\")","v":""}]
[{"$f":"IF(A46=\"F\",A46,\"\")","v":""},null,null,null,null,0.85,null,null,null,0.15,null,null,null,{"$f":"1-F47-J47","v":0},null,null,null,{"$f":"IFERROR(E45/100,\"\")","v":0},null,{"$f":"IF(E45=R47*100,\"OK\",\"ERRO\")","v":"OK"}]
[{"$f":"IF(D48>0,\"F\",\"\")","v":""},"ISOLAMENTO TÉRMICO E ACÚSTICO",null,{"$f":"Orçamento!V365","v":0},{"$f":"Orçamento!X365","v":0},{"$f":"ROUND(F50*$D$48,2)","v":0},null,null,null,{"$f":"ROUND(J50*$D$48,2)","v":0},null,null,null,{"$f":"ROUND(N50*$D$48,2)","v":0},null,null,null,{"$f":"SUM(F48:Q48)","v":0},null,{"$f":"IF(D48=R48,\"OK\",\"ERRO\")","v":"OK"}]
[{"$f":"IF(A48=\"F\",A48,\"\")","v":""}]
[{"$f":"IF(A49=\"F\",A49,\"\")","v":""},null,null,null,null,0,null,null,null,{"$f":"1-B50","v":1},null,null,null,{"$f":"1-F50-J50","v":0},null,null,null,{"$f":"IFERROR(E48/100,\"\")","v":0},null,{"$f":"IF(E48=R50*100,\"OK\",\"ERRO\")","v":"OK"}]
[{"$f":"IF(D51>0,\"F\",\"\")","v":""},"ESTRUTURA DE MADEIRA",null,{"$f":"Orçamento!V366","v":0},{"$f":"Orçamento!X366","v":0},{"$f":"ROUND(F53*$D$51,2)","v":0},null,null,null,{"$f":"ROUND(J53*$D$51,2)","v":0},null,null,null,{"$f":"ROUND(N53*$D$51,2)","v":0},null,null,null,{"$f":"SUM(F51:Q51)","v":0},null,{"$f":"IF(D51=R51,\"OK\",\"ERRO\")","v":"OK"}]
[{"$f":"IF(A51=\"F\",A51,\"\")","v":""}]
[{"$f":"IF(A52=\"F\",A52,\"\")","v":""},null,null,null,null,0,null,null,null,0.57999999999999996,null,null,null,{"$f":"1-F53-J53","v":0.42000000000000004},null,null,null,{"$f":"IFERROR(E51/100,\"\")","v":0},null,{"$f":"IF(E51=R53*100,\"OK\",\"ERRO\")","v":"OK"}]
[{"$f":"IF(D54>0,\"F\",\"\")","v":""},"ESTRUTURA METÁLICA",null,{"$f":"Orçamento!V367","v":0},{"$f":"Orçamento!X367","v":0},{"$f":"ROUND(F56*$D$54,2)","v":0},null,null,null,{"$f":"ROUND(J56*$D$54,2)","v":0},null,null,null,{"$f":"ROUND(N56*$D$54,2)","v":0},null,null,null,{"$f":"SUM(F54:Q54)","v":0},null,{"$f":"IF(D54=R54,\"OK\",\"ERRO\")","v":"OK"}]
[{"$f":"IF(A54=\"F\",A54,\"\")","v":""}]
[{"$f":"IF(A55=\"F\",A55,\"\")","v":""},null,null,null,null,0,null,null,null,0.57999999999999996,null,null,null,{"$f":"1-F56-J56","v":0.42000000000000004},null,null,null,{"$f":"IFERROR(E54/100,\"\")","v":0},null,{"$f":"IF(E54=R56*100,\"OK\",\"ERRO\")","v":"OK"}]
[{"$f":"IF(D57>0,\"F\",\"\")","v":""},"COBERTURAS",null,{"$f":"Orçamento!V368","v":0},{"$f":"Orçamento!X368","v":0},{"$f":"ROUND(F59*$D$57,2)","v":0},null,null,null,{"$f":"ROUND(J59*$D$57,2)","v":0},null,null,null,{"$f":"ROUND(N59*$D$57,2)","v":0},null,null,null,{"$f":"SUM(F57:Q57)","v":0},null,{"$f":"IF(D57=R57,\"OK\",\"ERRO\")","v":"OK"}]
[{"$f":"IF(A57=\"F\",A57,\"\")","v":""}]
[{"$f":"IF(A58=\"F\",A58,\"\")","v":""},null,null,null,null,0,null,null,null,0,null,null,null,{"$f":"1-F59-J59","v":1},null,null,null,{"$f":"IFERROR(E57/100,\"\")","v":0},null,{"$f":"IF(E57=R59*100,\"OK\",\"ERRO\")","v":"OK"}]
[{"$f":"IF(D60>0,\"F\",\"\")","v":""},"ESQUADRIAS DE MADEIRA",null,{"$f":"Orçamento!V369","v":0},{"$f":"Orçamento!X369","v":0},{"$f":"ROUND(F62*$D$60,2)","v":0},null,null,null,{"$f":"ROUND(J62*$D$60,2)","v":0},null,null,null,{"$f":"ROUND(N62*$D$60,2)","v":0},null,null,null,{"$f":"SUM(F60:Q60)","v":0},null,{"$f":"IF(D60=R60,\"OK\",\"ERRO\")","v":"OK"}]
[{"$f":"IF(A60=\"F\",A60,\"\")","v":""}]
[{"$f":"IF(A61=\"F\",A61,\"\")","v":""},null,null,null,null,0,null,null,null,0.4,null,null,null,{"$f":"1-F62-J62","v":0.6},null,null,null,{"$f":"IFERROR(E60/100,\"\")","v":0},null,{"$f":"IF(E60=R62*100,\"OK\",\"ERRO\")","v":"OK"}]
[{"$f":"IF(D63>0,\"F\",\"\")","v":""},"ESQUADRIAS METÁLICAS",null,{"$f":"Orçamento!V370","v":0},{"$f":"Orçamento!X370","v":0},{"$f":"ROUND(F65*$D$63,2)","v":0},null,null,null,{"$f":"ROUND(J65*$D$63,2)","v":0},null,null,null,{"$f":"ROUND(N65*$D$63,2)","v":0},null,null,null,{"$f":"SUM(F63:Q63)","v":0},null,{"$f":"IF(D63=R63,\"OK\",\"ERRO\")","v":"OK"}]
[{"$f":"IF(A63=\"F\",A63,\"\")","v":""}]
[{"$f":"IF(A64=\"F\",A64,\"\")","v":""},null,null,null,null,0,null,null,null,0.45,null,null,null,{"$f":"1-F65-J65","v":0.55000000000000004},null,null,null,{"$f":"IFERROR(E63/100,\"\")","v":0},null,{"$f":"IF(E63=R65*100,\"OK\",\"ERRO\")","v":"OK"}]
[{"$f":"IF(D66>0,\"F\",\"\")","v":""},"VIDROS",null,{"$f":"Orçamento!V371","v":0},{"$f":"Orçamento!X371","v":0},{"$f":"ROUND(F68*$D$66,2)","v":0},null,null,null,{"$f":"ROUND(J68*$D$66,2)","v":0},null,null,null,{"$f":"ROUND(N68*$D$66,2)","v":0},null,null,null,{"$f":"SUM(F66:Q66)","v":0},null,{"$f":"IF(D66=R66,\"OK\",\"ERRO\")","v":"OK"}]
[{"$f":"IF(A66=\"F\",A66,\"\")","v":""}]
[{"$f":"IF(A67=\"F\",A67,\"\")","v":""},null,null,null,null,0,null,null,null,0,null,null,null,{"$f":"1-F68-J68","v":1},null,null,null,{"$f":"IFERROR(E66/100,\"\")","v":0},null,{"$f":"IF(E66=R68*100,\"OK\",\"ERRO\")","v":"OK"}]
[{"$f":"IF(D69>0,\"F\",\"\")","v":""},"REVESTIMENTO DE PAREDE",null,{"$f":"Orçamento!V372","v":0},{"$f":"Orçamento!X372","v":0},{"$f":"ROUND(F71*$D$69,2)","v":0},null,null,null,{"$f":"ROUND(J71*$D$69,2)","v":0},null,null,null,{"$f":"ROUND(N71*$D$69,2)","v":0},null,null,null,{"$f":"SUM(F69:Q69)","v":0},null,{"$f":"IF(D69=R69,\"OK\",\"ERRO\")","v":"OK"}]
[{"$f":"IF(A69=\"F\",A69,\"\")","v":""}]
[{"$f":"IF(A70=\"F\",A70,\"\")","v":""},null,null,null,null,0,null,null,null,0.4,null,null,null,{"$f":"1-F71-J71","v":0.6},null,null,null,{"$f":"IFERROR(E69/100,\"\")","v":0},null,{"$f":"IF(E69=R71*100,\"OK\",\"ERRO\")","v":"OK"}]
[{"$f":"IF(D72>0,\"F\",\"\")","v":""},"FORROS",null,{"$f":"Orçamento!V373","v":0},{"$f":"Orçamento!X373","v":0},{"$f":"ROUND(F74*$D$72,2)","v":0},null,null,null,{"$f":"ROUND(J74*$D$72,2)","v":0},null,null,null,{"$f":"ROUND(N74*$D$72,2)","v":0},null,null,null,{"$f":"SUM(F72:Q72)","v":0},null,{"$f":"IF(D72=R72,\"OK\",\"ERRO\")","v":"OK"}]
[{"$f":"IF(A72=\"F\",A72,\"\")","v":""}]
[{"$f":"IF(A73=\"F\",A73,\"\")","v":""},null,null,null,null,0,null,null,null,0.4,null,null,null,{"$f":"1-F74-J74","v":0.6},null,null,null,{"$f":"IFERROR(E72/100,\"\")","v":0},null,{"$f":"IF(E72=R74*100,\"OK\",\"ERRO\")","v":"OK"}]
[{"$f":"IF(D75>0,\"F\",\"\")","v":""},"REVESTIMENTO DE PISO",null,{"$f":"Orçamento!V374","v":0},{"$f":"Orçamento!X374","v":0},{"$f":"ROUND(F77*$D$75,2)","v":0},null,null,null,{"$f":"ROUND(J77*$D$75,2)","v":0},null,null,null,{"$f":"ROUND(N77*$D$75,2)","v":0},null,null,null,{"$f":"SUM(F75:Q75)","v":0},null,{"$f":"IF(D75=R75,\"OK\",\"ERRO\")","v":"OK"}]
[{"$f":"IF(A75=\"F\",A75,\"\")","v":""}]
[{"$f":"IF(A76=\"F\",A76,\"\")","v":""},null,null,null,null,0,null,null,null,0.4,null,null,null,{"$f":"1-F77-J77","v":0.6},null,null,null,{"$f":"IFERROR(E75/100,\"\")","v":0},null,{"$f":"IF(E75=R77*100,\"OK\",\"ERRO\")","v":"OK"}]
[{"$f":"IF(D78>0,\"F\",\"\")","v":""},"FERRAGENS",null,{"$f":"Orçamento!V375","v":0},{"$f":"Orçamento!X375","v":0},{"$f":"ROUND(F80*$D$78,2)","v":0},null,null,null,{"$f":"ROUND(J80*$D$78,2)","v":0},null,null,null,{"$f":"ROUND(N80*$D$78,2)","v":0},null,null,null,{"$f":"SUM(F78:Q78)","v":0},null,{"$f":"IF(D78=R78,\"OK\",\"ERRO\")","v":"OK"}]
[{"$f":"IF(A78=\"F\",A78,\"\")","v":""}]
[{"$f":"IF(A79=\"F\",A79,\"\")","v":""},null,null,null,null,0,null,null,null,0,null,null,null,{"$f":"1-F80-J80","v":1},null,null,null,{"$f":"IFERROR(E78/100,\"\")","v":0},null,{"$f":"IF(E78=R80*100,\"OK\",\"ERRO\")","v":"OK"}]
[{"$f":"IF(D81>0,\"F\",\"\")","v":""},"MARCENARIA",null,{"$f":"Orçamento!V376","v":0},{"$f":"Orçamento!X376","v":0},{"$f":"ROUND(F83*$D$81,2)","v":0},null,null,null,{"$f":"ROUND(J83*$D$81,2)","v":0},null,null,null,{"$f":"ROUND(N83*$D$81,2)","v":0},null,null,null,{"$f":"SUM(F81:Q81)","v":0},null,{"$f":"IF(D81=R81,\"OK\",\"ERRO\")","v":"OK"}]
[{"$f":"IF(A81=\"F\",A81,\"\")","v":""}]
[{"$f":"IF(A82=\"F\",A82,\"\")","v":""},null,null,null,null,0,null,null,null,0,null,null,null,{"$f":"1-F83-J83","v":1},null,null,null,{"$f":"IFERROR(E81/100,\"\")","v":0},null,{"$f":"IF(E81=R83*100,\"OK\",\"ERRO\")","v":"OK"}]
[{"$f":"IF(D84>0,\"F\",\"\")","v":""},"ADMINISTRAÇÃO - MENSALISTAS",null,{"$f":"Orçamento!V377","v":0},{"$f":"Orçamento!X377","v":0},{"$f":"ROUND(F86*$D$84,2)","v":0},null,null,null,{"$f":"ROUND(J86*$D$84,2)","v":0},null,null,null,{"$f":"ROUND(N86*$D$84,2)","v":0},null,null,null,{"$f":"SUM(F84:Q84)","v":0},null,{"$f":"IF(D84=R84,\"OK\",\"ERRO\")","v":"OK"}]
[{"$f":"IF(A84=\"F\",A84,\"\")","v":""}]
[{"$f":"IF(A85=\"F\",A85,\"\")","v":""},null,null,null,null,0.34,null,null,null,0.33,null,null,null,0.33,null,null,null,{"$f":"IFERROR(E84/100,\"\")","v":0},null,{"$f":"IF(E84=R86*100,\"OK\",\"ERRO\")","v":"OK"}]
[{"$f":"IF(D87>0,\"F\",\"\")","v":""},"PINTURA",null,{"$f":"Orçamento!V378","v":0},{"$f":"Orçamento!X378","v":0},{"$f":"ROUND(F89*$D$87,2)","v":0},null,null,null,{"$f":"ROUND(J89*$D$87,2)","v":0},null,null,null,{"$f":"ROUND(N89*$D$87,2)","v":0},null,null,null,{"$f":"SUM(F87:Q87)","v":0},null,{"$f":"IF(D87=R87,\"OK\",\"ERRO\")","v":"OK"}]
[{"$f":"IF(A87=\"F\",A87,\"\")","v":""}]
[{"$f":"IF(A88=\"F\",A88,\"\")","v":""},null,null,null,null,0,null,null,null,0,null,null,null,{"$f":"1-F89-J89","v":1},null,null,null,{"$f":"IFERROR(E87/100,\"\")","v":0},null,{"$f":"IF(E87=R89*100,\"OK\",\"ERRO\")","v":"OK"}]
[{"$f":"IF(D90>0,\"F\",\"\")","v":""},"DIVERSOS",null,{"$f":"Orçamento!V379","v":0},{"$f":"Orçamento!X379","v":0},{"$f":"ROUND(F92*$D$90,2)","v":0},null,null,null,{"$f":"ROUND(J92*$D$90,2)","v":0},null,null,null,{"$f":"ROUND(N92*$D$90,2)","v":0},null,null,null,{"$f":"SUM(F90:Q90)","v":0},null,{"$f":"IF(D90=R90,\"OK\",\"ERRO\")","v":"OK"}]
[{"$f":"IF(A90=\"F\",A90,\"\")","v":""}]
[{"$f":"IF(A91=\"F\",A91,\"\")","v":""},null,null,null,null,0,null,null,null,0,null,null,null,{"$f":"1-F92-J92","v":1},null,null,null,{"$f":"IFERROR(E90/100,\"\")","v":0},null,{"$f":"IF(E90=R92*100,\"OK\",\"ERRO\")","v":"OK"}]
["F","CUSTO DO ORÇAMENTO",null,{"$f":"SUM(D15:D92)","v":0},{"$f":"SUM(E15:E92)","v":0},{"$f":"F15+F18+F21+F24+F27+F30+F33+F36+F39+F42+F45+F48+F51+F54+F57+F60+F63+F66+F69+F72+F75+F78+F81+F84+F87+F90","v":0},null,null,null,{"$f":"J15+J18+J21+J24+J27+J30+J33+J36+J39+J42+J45+J48+J51+J54+J57+J60+J63+J66+J69+J72+J75+J78+J81+J84+J87+J90","v":-0.01},null,null,null,{"$f":"N15+N18+N21+N24+N27+N30+N33+N36+N39+N42+N45+N48+N51+N54+N57+N60+N63+N66+N69+N72+N75+N78+N81+N84+N87+N90","v":0},null,null,null,{"$f":"R15+R18+R21+R24+R27+R30+R33+R36+R39+R42+R45+R48+R51+R54+R57+R60+R63+R66+R69+R72+R75+R78+R81+R84+R87+R90","v":-0.01}]
["F","PERCENTUAIS:",null,null,null,{"$f":"IFERROR(F93/D93,\"\")","v":""},null,null,null,{"$f":"IFERROR(J93/D93,\"\")","v":""},null,null,null,{"$f":"IFERROR(N93/D93,\"\")","v":""},null,null,null,{"$f":"SUM(F94:Q94)","v":0}]
["F","TOTAIS ACUMULADOS:",null,null,null,{"$f":"F93","v":0},null,null,null,{"$f":"F95+J93","v":-0.01},null,null,null,{"$f":"J95+N93","v":-0.01}]
["F","PERCENTUAIS  ACUMULADOS:",null,null,null,{"$f":"F94","v":""},null,null,null,{"$f":"J94+F96","v":{"$error":"#VALUE!"}},null,null,null,{"$f":"IFERROR(J96+N94,\"\")","v":""}]
["F"]
["F","OBSERVAÇÕES:"]
["F","Os pagamentos somente poderão ser efetuados mediante medição e atesto pelos técnicos da Secretaria da Educação. "]

{"sheet":"Composição BDI","index":4,"n_rows":45,"n_cols":9,"rows_kept":45,"cut":false,"hidden":false,"merged":[[18,5,18,8],[17,0,17,3],[16,0,16,3],[44,0,44,3],[42,0,42,3],[43,0,43,3],[18,0,18,3],[36,0,36,3],[39,0,39,3],[38,0,38,3],[40,0,40,3],[29,0,29,2],[32,0,32,3],[33,0,33,3],[34,0,34,3],[35,0,35,3],[0,0,0,3],[1,0,1,3],[4,0,4,3],[7,0,7,3],[10,0,10,3],[2,0,2,3],[3,0,3,3],[5,0,5,3],[6,0,6,3],[8,0,8,3],[9,0,9,3],[11,0,11,3],[12,0,12,3],[14,0,14,3],[15,0,15,3],[13,0,13,3]]}
[]
[]
["UNIDADE ESCOLAR"]
[{"$f":"Orçamento!$O$4","v":"COLÉGIO ESTADUAL VALPARAIZO"}]
[]
["OBRA"]
[{"$f":"Orçamento!$O$7","v":"REFORMA"}]
[]
["ENDEREÇO"]
[{"$f":"Orçamento!$R$10","v":"PRACA CENTRAL ETAPA A, VALPARAISO I, CEP:72876-030"}]
[]
["CIDADE"]
[{"$f":"Orçamento!$V$7","v":"VALPARAÍSO DE GOIÁS"}]
[]
["CRE"]
[{"$f":"Orçamento!$O$10","v":"NOVO GAMA"}]
[]
["DETALHAMENTO DA COMPOSIÇÃO DE BDI"]
["COMPOSIÇÃO BDI PARA OBRAS CIVIS",null,null,null,null,"BDI CONSTRUÇÃO E REFORMA"]
["DESCRIÇÃO","COEF.","TAXA % (a.m)","% no preço de venda",null,"Situação","1º Quartil","Médio","3º Quartil"]
["1) COFINS",1,0.03,{"$f":"C21","v":0.03},null,{"$f":"IF(OR(C21<G21,C21>I21),\"FORA DO INTERVALO\",\"OK\")","v":"OK"},0.03,0.03,0.03]
["2) PIS",1,6.4999999999999997E-3,{"$f":"C22","v":6.4999999999999997E-3},null,{"$f":"IF(OR(C22<G22,C22>I22),\"FORA DO INTERVALO\",\"OK\")","v":"OK"},6.4999999999999997E-3,6.4999999999999997E-3,6.4999999999999997E-3]
["3) ISSQN",1,1.4999999999999999E-2,{"$f":"C23*B23","v":1.4999999999999999E-2},null,"FORA DO INTERVALO",0.02,3.5000000000000003E-2,0.05]
["4) CPRB",1,4.4999999999999998E-2,{"$f":"C24","v":4.4999999999999998E-2},null,"OK",4.4999999999999998E-2,4.4999999999999998E-2,4.4999999999999998E-2]
["5) Administração Central",1,4.7E-2,4.7E-2,null,"OK",0.03,0.04,5.5E-2]
["6) Despesas Financeiras",1,5.5999999999999999E-3,5.5999999999999999E-3,null,"FORA DO INTERVALO",5.8999999999999999E-3,1.23E-2,1.3899999999999999E-2]
["7) Seguros + Garantias",1,1.1999999999999999E-3,1.1999999999999999E-3,null,"FORA DO INTERVALO",8.0000000000000002E-3,8.0000000000000002E-3,0.01]
["8) Risco",1,9.7000000000000003E-3,9.7000000000000003E-3,null,"OK",9.7000000000000003E-3,1.2699999999999999E-2,1.2699999999999999E-2]
["9) Lucro",1,7.2999999999999995E-2,7.2999999999999995E-2,null,"OK",6.1600000000000002E-2,7.3999999999999996E-2,8.9599999999999999E-2]
["BDI - FINAL",null,null,{"$f":"(((1+D25+D27+D28)*(1+D26)*(1+D29))/(1-(D21+D22+D23+D24))-1)","v":0.26340167074709475},null,{"$f":"IF(OR(D30<G30,D30>I30),\"FORA DO INTERVALO\",\"OK\")","v":"FORA DO INTERVALO"},0.2034,0.22120000000000001,0.25]
[]
["Notas:"]
["(1) e (2) Alíquota definida por lei."]
["(3) Alíquota e base de cálculo definidas pela legislação municipal."]
["(4) Alíquota definida pelas leis 12.546/11, 12844/13 e 13.161/15 (CPRB – contribuição previdenciária sobre a receita bruta)."]
["(5) Valores definidos a partir dos limites no Acórdão nº 2.622/2013 - TCU – Plenário. Valores entre o 1º e 3º quartis."]
["(6) Valor calculado pela expressão matemática do acórdão 2.369/2011 – TCU – Plenário e disponibilizado pela AGETOP em dezembro de 2018. (Foi utilizado para o cálculo a média da Taxa SELIC no período de 11/2017 a 10/2018)"]
[]
["(7) Valores definidos pela AGETOP a partir dos limites no Acórdão nº 2.622/2013 - TCU – Plenário. Valores médios. \n\nObservação da AGETOP: (Seguros contra erros de execução, incêndio e explosão, danos da natureza (vendaval, destelhamento, alagamento, inundação, desmoronamento, geadas etc.), emprego de material defeituoso ou inadequado, roubo e/ou furto qualificado, quebra de equipamentos, desmoronamento de estrutura, nas modalidades de Obras Civis em Construção (OCC); Instalação e Montagem (IM); e Obras Civis em Construção e Instalação e Montagem (OCC/IM). Bem como coberturas adicionais para ampliação dessas coberturas básicas, como: cobertura de responsabilidade civil geral, cobertura de responsabilidade civil cruzada, cobertura de despesas extraordinárias, cobertura de tumultos, cobertura de desentulho do local, cobertura de riscos do fabricante, dentre outras, incluindo o seguro de vida em grupo regido pela convenção coletiva dos trabalhadores na indústria da construção civil). A partir de 24/02/2015 por intermédio da Portaria 449/2015 a Presidência da AGETOP, na pessoa do Senhor Jayme Eduardo Rincon, determinou a exclusão dos valores referentes aos Seguros de Risco de Engenharia e Responsabilidade Civil do Profissional na composição do cálculo do B.D.I.."]
["(8) Valores definidos a partir dos limites no Acórdão nº 2.622/2013 - TCU – Plenário. Valores entre 1º e 3° quartis."]
["(9) Valores definidos a partir dos limites definidos no Acórdão nº 2.622/2013 - TCU – Plenário. Valores adotados e praticados no mercado ( “ ex ante ” ) ou aqueles entre os 1º e 3º quartis."]
[]
["(*) A fórmula para estipulação da taxa de BDI estimado adotado é a mesma que foi aplicada para a obtenção das tabelas contidas no Acórdão n. 2.622/2013 – TCUPlenário"]
[]
["Obs.: Para obras com valores superiores a R$ 20.000.000,00 sugere-se recalcular o BDI, dimensionando as taxas de administração central e lucro para patamares inferiores ao estipulado acima."]

{"sheet":"Relatório CENTRAL","index":5,"n_rows":40,"n_cols":5,"rows_kept":40,"cut":false,"hidden":false,"merged":[[39,1,39,2],[9,0,11,0],[0,1,0,4],[6,3,6,4],[9,3,9,4],[1,1,1,4],[2,1,2,2],[2,3,2,4],[3,1,3,2],[3,3,3,4],[4,1,4,4],[5,1,5,2],[5,3,5,4],[6,1,6,2],[7,1,7,4],[8,1,8,2],[8,3,8,4],[9,1,9,2],[10,1,10,4],[11,1,11,4]]}
[]
[]
[null,"UNIDADE ESCOLAR",null,"CIDADE"]
[null,{"$f":"Orçamento!$O$4","v":"COLÉGIO ESTADUAL VALPARAIZO"},null,{"$f":"Orçamento!$V$7","v":"VALPARAÍSO DE GOIÁS"}]
[]
[null,"OBRA",null,"CRE"]
[null,{"$f":"Orçamento!$O$7","v":"REFORMA"},null,{"$f":"Orçamento!$O$10","v":"NOVO GAMA"}]
[]
[null,"ENDEREÇO",null,"DATA"]
["FILTRO",{"$f":"Orçamento!$R$10","v":"PRACA CENTRAL ETAPA A, VALPARAISO I, CEP:72876-030"},null,{"$f":"Orçamento!$S$7","v":"2020-09-02"}]
[]
[null,"RELATÓRIO CENTRAL"]
["↓","CÓDIGO","ETAPA","PREÇO  (R$) C/ BDI","PARTIC  ( % )"]
[{"$f":"IF(D14>0,\"F\",\"\")","v":""},{"$f":"Orçamento!O354","v":"a."},{"$f":"Orçamento!P354","v":"SERVIÇOS PRELIMINARES"},{"$f":"Orçamento!V354","v":0},{"$f":"Orçamento!X354","v":0}]
[{"$f":"IF(D15>0,\"F\",\"\")","v":""},{"$f":"Orçamento!O355","v":"b."},{"$f":"Orçamento!P355","v":"TRANSPORTES"},{"$f":"Orçamento!V355","v":0},{"$f":"Orçamento!X355","v":0}]
["",{"$f":"Orçamento!O356","v":"c."},{"$f":"Orçamento!P356","v":"SERVIÇO EM TERRA"},{"$f":"Orçamento!V356","v":0},{"$f":"Orçamento!X356","v":0}]
["",{"$f":"Orçamento!O357","v":"d."},{"$f":"Orçamento!P357","v":"FUNDAÇÕES E SONDAGENS"},{"$f":"Orçamento!V357","v":0},{"$f":"Orçamento!X357","v":0}]
["",{"$f":"Orçamento!O358","v":"e."},{"$f":"Orçamento!P358","v":"ESTRUTURA"},{"$f":"Orçamento!V358","v":0},{"$f":"Orçamento!X358","v":0}]
["",{"$f":"Orçamento!O359","v":"f."},{"$f":"Orçamento!P359","v":"INSTALAÇÕES ELÉTRICAS"},{"$f":"Orçamento!V359","v":0},{"$f":"Orçamento!X359","v":0}]
["",{"$f":"Orçamento!O360","v":"g."},{"$f":"Orçamento!P360","v":"INSTALAÇÕES HIDROSSANITÁRIAS"},{"$f":"Orçamento!V360","v":0},{"$f":"Orçamento!X360","v":0}]
["",{"$f":"Orçamento!O361","v":"h"},{"$f":"Orçamento!P361","v":"INSTALAÇÕES ESPECIAIS"},{"$f":"Orçamento!V361","v":0},{"$f":"Orçamento!X361","v":0}]
["",{"$f":"Orçamento!O362","v":"i."},{"$f":"Orçamento!P362","v":"ALVENARIAS E DIVISÓRIAS"},{"$f":"Orçamento!V362","v":0},{"$f":"Orçamento!X362","v":0}]
["",{"$f":"Orçamento!O363","v":"j."},{"$f":"Orçamento!P363","v":"ALVENARIA AUTO-PORTANTE"},{"$f":"Orçamento!V363","v":0},{"$f":"Orçamento!X363","v":0}]
["",{"$f":"Orçamento!O364","v":"k."},{"$f":"Orçamento!P364","v":"IMPERMEABILIZAÇÃO"},{"$f":"Orçamento!V364","v":0},{"$f":"Orçamento!X364","v":0}]
["",{"$f":"Orçamento!O365","v":"l."},{"$f":"Orçamento!P365","v":"ISOLAMENTO TÉRMICO E ACÚSTICO"},{"$f":"Orçamento!V365","v":0},{"$f":"Orçamento!X365","v":0}]
["",{"$f":"Orçamento!O366","v":"m."},{"$f":"Orçamento!P366","v":"ESTRUTURA DE MADEIRA"},{"$f":"Orçamento!V366","v":0},{"$f":"Orçamento!X366","v":0}]
["",{"$f":"Orçamento!O367","v":"n."},{"$f":"Orçamento!P367","v":"ESTRUTURAS METÁLICAS"},{"$f":"Orçamento!V367","v":0},{"$f":"Orçamento!X367","v":0}]
["",{"$f":"Orçamento!O368","v":"o."},{"$f":"Orçamento!P368","v":"COBERTURAS"},{"$f":"Orçamento!V368","v":0},{"$f":"Orçamento!X368","v":0}]
["",{"$f":"Orçamento!O369","v":"p."},{"$f":"Orçamento!P369","v":"ESQUADRIAS DE MADEIRA"},{"$f":"Orçamento!V369","v":0},{"$f":"Orçamento!X369","v":0}]
["",{"$f":"Orçamento!O370","v":"q."},{"$f":"Orçamento!P370","v":"ESQUADRIAS METÁLICAS"},{"$f":"Orçamento!V370","v":0},{"$f":"Orçamento!X370","v":0}]
["",{"$f":"Orçamento!O371","v":"r."},{"$f":"Orçamento!P371","v":"VIDROS"},{"$f":"Orçamento!V371","v":0},{"$f":"Orçamento!X371","v":0}]
["",{"$f":"Orçamento!O372","v":"s."},{"$f":"Orçamento!P372","v":"REVESTIMENTO DE PAREDE"},{"$f":"Orçamento!V372","v":0},{"$f":"Orçamento!X372","v":0}]
["",{"$f":"Orçamento!O373","v":"t."},{"$f":"Orçamento!P373","v":"FORROS"},{"$f":"Orçamento!V373","v":0},{"$f":"Orçamento!X373","v":0}]
["",{"$f":"Orçamento!O374","v":"u."},{"$f":"Orçamento!P374","v":"REVESTIMENTO DE PISO"},{"$f":"Orçamento!V374","v":0},{"$f":"Orçamento!X374","v":0}]
["",{"$f":"Orçamento!O375","v":"v."},{"$f":"Orçamento!P375","v":"FERRAGENS"},{"$f":"Orçamento!V375","v":0},{"$f":"Orçamento!X375","v":0}]
["",{"$f":"Orçamento!O376","v":"w."},{"$f":"Orçamento!P376","v":"MARCENARIA"},{"$f":"Orçamento!V376","v":0},{"$f":"Orçamento!X376","v":0}]
["",{"$f":"Orçamento!O377","v":"x."},{"$f":"Orçamento!P377","v":"ADMINISTRAÇÃO"},{"$f":"Orçamento!V377","v":0},{"$f":"Orçamento!X377","v":0}]
["",{"$f":"Orçamento!O378","v":"y."},{"$f":"Orçamento!P378","v":"PINTURA"},{"$f":"Orçamento!V378","v":0},{"$f":"Orçamento!X378","v":0}]
["",{"$f":"Orçamento!O379","v":"z."},{"$f":"Orçamento!P379","v":"DIVERSOS"},{"$f":"Orçamento!V379","v":0},{"$f":"Orçamento!X379","v":0}]
["F","TOTAL GERAL DO ORÇAMENTO (R$) C/BDI",null,{"$f":"SUM(D14:D39)","v":0},{"$f":"SUM(E14:E39)","v":0}]

{"sheet":"Parc Maior Relev","index":6,"n_rows":35,"n_cols":7,"rows_kept":35,"cut":false,"hidden":false,"merged":[[0,1,0,6],[11,1,11,6],[1,1,1,6],[2,1,2,3],[2,4,2,6],[3,1,3,3],[3,4,3,6],[4,1,4,6],[5,1,5,3],[5,4,5,6],[9,1,9,3],[9,4,9,6],[10,1,10,6],[6,1,6,3],[6,4,6,6],[7,1,7,6],[8,1,8,3],[8,4,8,6],[35,3,35,7],[33,1,33,6]]}
[]
[]
[null,"UNIDADE ESCOLAR",null,null,"CÓDIGO INEP"]
[null,{"$f":"Orçamento!$O$4","v":"COLÉGIO ESTADUAL VALPARAIZO"},null,null,{"$f":"Orçamento!$V$4","v":52047229}]
[]
[null,"OBRA",null,null,"CIDADE"]
[null,{"$f":"Orçamento!$O$7","v":"REFORMA"},null,null,{"$f":"Orçamento!$V$7","v":"VALPARAÍSO DE GOIÁS"}]
[]
[null,"CRE",null,null,"ÁREA TOTAL CONSTRUÍDA (M²)"]
[null,{"$f":"Orçamento!$O$10","v":"NOVO GAMA"},null,null,{"$f":"Orçamento!$V$13","v":1620.6}]
[]
["FILTRO","PARCELA DE MAIOR RELEVÂNCIA"]
[{"$f":"IF(G14>0,\"F\",\"\")","v":"F"},"CÓDIGO","SERVIÇO","DESCRIÇÃO","UNID","QUANT","PARC. MAIOR RELEV (100%)"]
[{"$f":"IF(G14>0,\"F\",\"\")","v":"F"},{"$f":"Somatório!B22","v":"f."},"INSTALAÇÕES ELÉTRICAS","SUBESTAÇÃO","KVA",112.5,{"$f":"F14","v":112.5}]
[{"$f":"IF(SUM(G16:G32)>0,\"F\",\"\")","v":"F"},"CÓDIGO","SERVIÇO","DESCRIÇÃO","UNID","QUANT","PARC. MAIOR RELEV (50%)"]
[{"$f":"IF(G16>0,\"F\",\"\")","v":""},{"$f":"Somatório!B21","v":"e."},"ESTRUTURA","CONCRETO","M3",{"$f":"SUMIF(Orçamento!$R$20:$R$335,'Parc Maior Relev'!D16,Orçamento!$T$20:$T$335)","v":0},{"$f":"F16*0.5","v":0}]
[{"$f":"IF(G17>0,\"F\",\"\")","v":""},"f.","INSTALAÇÕES ELÉTRICAS","INSTALAÇÕES ELÉTRICAS","KVA",{"$f":"SUMIF(Orçamento!$R$20:$R$335,'Parc Maior Relev'!D17,Orçamento!$T$20:$T$335)","v":0},{"$f":"F17","v":0}]
[{"$f":"IF(G18>0,\"F\",\"\")","v":""},{"$f":"Somatório!B25","v":"i."},"ALVENARIA E DIVISÓRIAS","ALVENARIA DE TIJOLOS","M2",{"$f":"SUMIF(Orçamento!$R$20:$R$335,'Parc Maior Relev'!D18,Orçamento!$T$20:$T$335)","v":0},{"$f":"F18*0.5","v":0}]
["",{"$f":"Somatório!B29","v":"m."},"ESTRUTURA DE MADEIRA","ESTRUTURA DE MADEIRA","M2",{"$f":"SUMIF(Orçamento!$R$20:$R$335,'Parc Maior Relev'!D19,Orçamento!$T$20:$T$335)","v":0},0]
["",{"$f":"Somatório!B31","v":"o."},"COBERTURAS","COBERTURA CERÂMICA","M2",{"$f":"SUMIF(Orçamento!$R$20:$R$335,'Parc Maior Relev'!D20,Orçamento!$T$20:$T$335)","v":0},0]
["","o.","COBERTURAS","COBERTURA COM TELHA METÁLICA","M2",{"$f":"SUMIF(Orçamento!$R$20:$R$335,'Parc Maior Relev'!D21,Orçamento!$T$20:$T$335)","v":0},0]
["",{"$f":"Somatório!B35","v":"s."},"REVESTIMENTO DE PAREDE","CHAPISCO","M2",{"$f":"SUMIF(Orçamento!$R$20:$R$335,'Parc Maior Relev'!D22,Orçamento!$T$20:$T$335)","v":0},0]
["F","s.","REVESTIMENTO DE PAREDE","REBOCO","M2",{"$f":"Orçamento!T293","v":1565},{"$f":"F23*0.5","v":782.5}]
["","s.","REVESTIMENTO DE PAREDE","REVESTIMENTO CERÂMICO","M2",{"$f":"SUMIF(Orçamento!$R$20:$R$335,'Parc Maior Relev'!D24,Orçamento!$T$20:$T$335)","v":0},{"$f":"F24*0.5","v":0}]
["",{"$f":"Somatório!B36","v":"t."},"FORROS","FORRO DE GESSO","M2",{"$f":"SUMIF(Orçamento!$R$20:$R$335,'Parc Maior Relev'!D25,Orçamento!$T$20:$T$335)","v":0},{"$f":"F25*0.5","v":0}]
["","t.","FORROS","FORRO DE PVC","M2",{"$f":"SUMIF(Orçamento!$R$20:$R$335,'Parc Maior Relev'!D26,Orçamento!$T$20:$T$335)","v":0},{"$f":"F26*0.5","v":0}]
["","t.","FORROS","FORRO DE GESSO ACARTONADO","M2",{"$f":"SUMIF(Orçamento!$R$20:$R$335,'Parc Maior Relev'!D27,Orçamento!$T$20:$T$335)","v":0},{"$f":"F27*0.5","v":0}]
["","u.","REVESTIMENTO DE PISO","PISO DE GRANITINA","M2",{"$f":"SUMIF(Orçamento!$R$20:$R$335,'Parc Maior Relev'!D28,Orçamento!$T$20:$T$335)","v":0},0]
["","u.","REVESTIMENTO DE PISO","PISO LAMINADO","M2",{"$f":"SUMIF(Orçamento!$R$20:$R$335,'Parc Maior Relev'!D29,Orçamento!$T$20:$T$335)","v":0},0]
["","u.","REVESTIMENTO DE PISO","PISO DE CONCRETO DESEMPENADO","M2",{"$f":"SUMIF(Orçamento!$R$20:$R$335,'Parc Maior Relev'!D30,Orçamento!$T$20:$T$335)","v":0},0]
["","u.","REVESTIMENTO DE PISO","PISO CERÂMICO","M2",{"$f":"SUMIF(Orçamento!$R$20:$R$335,'Parc Maior Relev'!D31,Orçamento!$T$20:$T$335)","v":0},{"$f":"F31*0.5","v":0}]
["F","y.","PINTURA","PINTURA","M2",{"$f":"Orçamento!T325","v":4250},2125]
["F"]
["F","(*) Para os fins do inciso I dp § 1º do Art. 30 da Lei Federal 8.666/93, são consideradas parcelas de maior relevância técnica as execuções apresentadas"]
["F"]

{"sheet":"Composições","index":7,"n_rows":185,"n_cols":10,"rows_kept":185,"cut":false,"hidden":false,"merged":[[0,0,0,8],[10,0,10,2],[10,3,10,6],[11,0,11,9],[12,0,12,2],[12,3,12,6],[12,7,12,8],[7,0,7,6],[9,0,9,2],[9,3,9,6],[9,7,9,8],[3,0,3,6],[4,0,4,6],[15,0,15,9],[13,0,13,2],[13,3,13,6],[1,0,1,9],[3,7,3,9],[4,7,4,9],[6,7,6,9],[7,7,7,9],[6,0,6,6],[10,8,10,9],[13,8,13,9],[14,0,14,9],[8,0,8,9],[5,0,5,9],[2,0,2,9],[16,5,17,5],[16,6,16,7],[16,8,16,9],[22,1,22,7],[26,1,26,7],[16,0,17,0],[16,1,17,1],[16,2,17,2],[16,3,17,3],[16,4,17,4],[28,5,29,5],[28,6,28,7],[28,8,28,9],[33,1,33,7],[35,1,35,7],[28,0,29,0],[28,1,29,1],[28,2,29,2],[28,3,29,3],[28,4,29,4],[37,5,38,5],[37,6,37,7],[37,8,37,9],[42,1,42,7],[44,1,44,7],[37,0,38,0],[37,1,38,1],[37,2,38,2],[37,3,38,3],[37,4,38,4],[46,5,47,5],[46,6,46,7],[46,8,46,9],[51,1,51,7],[53,1,53,7],[46,0,47,0],[46,1,47,1],[46,2,47,2],[46,3,47,3],[46,4,47,4],[55,5,56,5],[55,6,55,7],[55,8,55,9],[59,1,59,7],[61,1,61,7],[55,0,56,0],[55,1,56,1],[55,2,56,2],[55,3,56,3],[55,4,56,4],[63,5,64,5],[63,6,63,7],[63,8,63,9],[68,1,68,7],[70,1,70,7],[63,0,64,0],[63,1,64,1],[63,2,64,2],[63,3,64,3],[63,4,64,4],[72,5,73,5],[72,6,72,7],[72,8,72,9],[77,1,77,7],[79,1,79,7],[72,0,73,0],[72,1,73,1],[72,2,73,2],[72,3,73,3],[72,4,73,4],[81,5,82,5],[81,6,81,7],[81,8,81,9],[85,1,85,7],[89,1,89,7],[81,0,82,0],[81,1,82,1],[81,2,82,2],[81,3,82,3],[81,4,82,4],[91,5,92,5],[91,6,91,7],[91,8,91,9],[95,1,95,7],[102,1,102,7],[91,0,92,0],[91,1,92,1],[91,2,92,2],[91,3,92,3],[91,4,92,4],[104,5,105,5],[104,6,104,7],[104,8,104,9],[109,1,109,7],[122,1,122,7],[104,0,105,0],[104,1,105,1],[104,2,105,2],[104,3,105,3],[104,4,105,4],[124,5,125,5],[124,6,124,7],[124,8,124,9],[129,1,129,7],[143,1,143,7],[124,0,125,0],[124,1,125,1],[124,2,125,2],[124,3,125,3],[124,4,125,4],[145,5,146,5],[145,6,145,7],[145,8,145,9],[150,1,150,7],[165,1,165,7],[145,0,146,0],[145,1,146,1],[145,2,146,2],[145,3,146,3],[145,4,146,4],[167,5,168,5],[167,6,167,7],[167,8,167,9],[172,1,172,7],[184,1,184,7],[167,0,168,0],[167,1,168,1],[167,2,168,2],[167,3,168,3],[167,4,168,4]]}
[]
[]
[]
["UNIDADE ESCOLAR",null,null,null,null,null,null,"CÓDIGO INEP"]
[{"$f":"Orçamento!$O$4","v":"COLÉGIO ESTADUAL VALPARAIZO"},null,null,null,null,null,null,{"$f":"Orçamento!$V$4","v":52047229}]
[]
["OBRA",null,null,null,null,null,null,"CIDADE"]
[{"$f":"Orçamento!$O$7","v":"REFORMA"},null,null,null,null,null,null,{"$f":"Orçamento!$V$7","v":"VALPARAÍSO DE GOIÁS"}]
[]
["CRE",null,null,"ENDEREÇO",null,null,null,"REFERÊNCIA AGETOP"]
[{"$f":"Orçamento!$O$10","v":"NOVO GAMA"},null,null,{"$f":"Orçamento!$R$10","v":"PRACA CENTRAL ETAPA A, VALPARAISO I, CEP:72876-030"},null,null,null,{"$f":"Orçamento!$S$10","v":"ABR/19"},{"$f":"Orçamento!$T$10","v":"DESONERADA"}]
[]
["DATA",null,null,"ÁREA TOTAL CONSTRUÍDA (M²)",null,null,null,"REFERÊNCIA SINAPI"]
[{"$f":"Orçamento!$S$7","v":"2020-09-02"},null,null,{"$f":"Orçamento!$V$13","v":1620.6},null,null,null,{"$f":"Orçamento!$V$10","v":"NOV/19"},{"$f":"Orçamento!$W$10","v":"DESONERADA"}]
[]
["COMPOSIÇÕES DE CUSTOS UNITÁRIOS - SEE-GO"]
[10,"FONTE","CÓDIGO","DESCRIÇÃO","UNIDADE","COEFIC.","CUSTO UNITÁRIO",null,"CUSTO  TOTAL (A) + (B) + (C) + (D) + (E)"]
[null,null,null,null,null,null,"DESONERADO","NÃO DESONER.","DESONERADO","NÃO DESONER."]
[null,"COMPOSIÇÃO","COMP 010_SEE","DEMOLIÇÃO DE GRADE/GRELHA/CORRIMÃO/GUARDA CORPO - METÁLICO","M2",null,"-","-",4.0599999999999996,4.71]
[null,null,null,"","",null,0,0,0,0]
[null,null,null,"","",null,0,0,0,0]
[null,null,null,"","",null,0,0,0,0]
[null,"MÃO DE OBRA (B) - TOTAL",null,null,null,null,null,null,0,0]
[null,"AGETOP",20106,"RETIRADA DE JANELAS OU PORTAIS C/ TRANSP. ATÉ CB. E CARGA","m2    ",1,4.0599999999999996,4.71,4.0599999999999996,4.71]
[null,null,null,"","",null,0,0,0,0]
[null,null,null,"","",null,0,0,0,0]
[null,"MATERIAL (C) - TOTAL",null,null,null,null,null,null,4.0599999999999996,4.71]
[]
[46,"FONTE","CÓDIGO","DESCRIÇÃO","UNIDADE","COEFIC.","CUSTO UNITÁRIO",null,"CUSTO  TOTAL (A) + (B) + (C) + (D) + (E)"]
[null,null,null,null,null,null,"DESONERADO","NÃO DESONER.","DESONERADO","NÃO DESONER."]
[null,"COMPOSIÇÃO","COMP 046_SEE","CAPUZ PARA PROTEÇÃO DOS PARA RAIOS","UN ",null,null,null,16.100000000000001,16.150000000000002]
[null,"AGETOP_I",8,"AJUDANTE","h     ",3.3300000000000003E-2,8.75,10.14,0.28999999999999998,0.34]
[null,"AGETOP_I",12,"MATERIAL HIDRO-SANITÁRIO",0,3.3300000000000003E-2,0,0,0,0]
[null,"MÃO DE OBRA (B) - TOTAL",null,null,null,null,null,null,0.28999999999999998,0.34]
[null,"COTAÇÃO","COT 010_SEE","CAPUZ PARA PROTEÇÃO DOS PARA RAIOS","UN ",1,15.81,15.81,15.81,15.81]
[null,"MATERIAL (C) - TOTAL",null,null,null,null,null,null,15.81,15.81]
[]
[47,"FONTE","CÓDIGO","DESCRIÇÃO","UNIDADE","COEFIC.","CUSTO UNITÁRIO",null,"CUSTO  TOTAL (A) + (B) + (C) + (D) + (E)"]
[null,null,null,null,null,null,"DESONERADO","NÃO DESONER.","DESONERADO","NÃO DESONER."]
[null,"COMPOSIÇÃO","COMP 047_SEE","CAPUZ DE PROTEÇÃO PARA BUCHA DE TRANSFORMADOR","UN ",null,null,null,16.100000000000001,16.150000000000002]
[null,"AGETOP_I",8,"AJUDANTE","h     ",3.3300000000000003E-2,8.75,10.14,0.28999999999999998,0.34]
[null,"AGETOP_I",12,"MATERIAL HIDRO-SANITÁRIO",0,3.3300000000000003E-2,0,0,0,0]
[null,"MÃO DE OBRA (B) - TOTAL",null,null,null,null,null,null,0.28999999999999998,0.34]
[null,"COTAÇÃO","COT 011_SEE","CAPUZ DE PROTEÇÃO PARA BUCHA DE TRANSFORMADOR","UN ",1,15.81,15.81,15.81,15.81]
[null,"MATERIAL (C) - TOTAL",null,null,null,null,null,null,15.81,15.81]
[]
[48,"FONTE","CÓDIGO","DESCRIÇÃO","UNIDADE","COEFIC.","CUSTO UNITÁRIO",null,"CUSTO  TOTAL (A) + (B) + (C) + (D) + (E)"]
[null,null,null,null,null,null,"DESONERADO","NÃO DESONER.","DESONERADO","NÃO DESONER."]
[null,"COMPOSIÇÃO","COMP 048_SEE","HASTE ROSQUEADA \"TIRANTE\" 3/8\"","M",null,null,null,8.879999999999999,9.44]
[null,"AGETOP_I",8,"AJUDANTE","h     ",0.4,8.75,10.14,3.5,4.0599999999999996]
[null,"AGETOP_I",12,"MATERIAL HIDRO-SANITÁRIO",0,0.4,0,0,0,0]
[null,"MÃO DE OBRA (B) - TOTAL",null,null,null,null,null,null,3.5,4.0599999999999996]
[null,"COTAÇÃO","COT 012_SEE","HASTE ROSQUEADA \"TIRANTE\" 3/8\"","M",1,5.3833333333333329,5.3833333333333329,5.38,5.38]
[null,"MATERIAL (C) - TOTAL",null,null,null,null,null,null,5.38,5.38]
[]
[49,"FONTE","CÓDIGO","DESCRIÇÃO","UNIDADE","COEFIC.","CUSTO UNITÁRIO",null,"CUSTO  TOTAL (A) + (B) + (C) + (D) + (E)"]
[null,null,null,null,null,null,"DESONERADO","NÃO DESONER.","DESONERADO","NÃO DESONER."]
[null,"COMPOSIÇÃO","COMP 049_SEE","PORCA SEXTAVADA 3/8\"","UN ",null,null,null,0.21000000000000002,0.22]
[null,"AGETOP_I",8,"AJUDANTE","h     ",8.9999999999999993E-3,8.75,10.14,0.08,0.09]
[null,"MÃO DE OBRA (B) - TOTAL",null,null,null,null,null,null,0.08,0.09]
[null,"COTAÇÃO","COT 013_SEE","PORCA SEXTAVADA 3/8\"","UN ",1,0.13,0.13,0.13,0.13]
[null,"MATERIAL (C) - TOTAL",null,null,null,null,null,null,0.13,0.13]
[]
[387,"FONTE","CÓDIGO","DESCRIÇÃO","UNIDADE","COEFIC.","CUSTO UNITÁRIO",null,"CUSTO  TOTAL (A) + (B) + (C) + (D) + (E)"]
[null,null,null,null,null,null,"DESONERADO","NÃO DESONER.","DESONERADO","NÃO DESONER."]
[null,"COMPOSIÇÃO","COMP 387_SEE","LÂMPADA LED TUBULAR 18W ","UN ",null,null,null,22.09,22.11]
[null,"AGETOP_I",8,"AJUDANTE","h     ",1.4999999999999999E-2,8.75,10.14,0.13,0.15]
[null,"AGETOP_I",12,"MATERIAL HIDRO-SANITÁRIO",0,1.4999999999999999E-2,0,0,0,0]
[null,"MÃO DE OBRA (B) - TOTAL",null,null,null,null,null,null,0.13,0.15]
[null,"COTAÇÃO","COT 195_SEE","LÂMPADA LED TUBULAR 18W ","UN",1,21.959999999999997,21.959999999999997,21.96,21.96]
[null,"MATERIAL (C) - TOTAL",null,null,null,null,null,null,21.96,21.96]
[]
[330,"FONTE","CÓDIGO","DESCRIÇÃO","UNIDADE","COEFIC.","CUSTO UNITÁRIO",null,"CUSTO  TOTAL (A) + (B) + (C) + (D) + (E)"]
[null,null,null,null,null,null,"DESONERADO","NÃO DESONER.","DESONERADO","NÃO DESONER."]
[null,"COMPOSIÇÃO","COMP 330_SEE","LUVA SIMPLES 1\"","UN ",null,null,null,10.25,10.74]
[null,"AGETOP_I",5,"SERVENTE","h     ",0.35,8.75,10.14,3.06,3.55]
[null,"AGETOP_I",11,"MATERIAL ELÉTRICO",0,0.35,0,0,0,0]
[null,"MÃO DE OBRA (B) - TOTAL",null,null,null,null,null,null,3.06,3.55]
[null,"SINAPI_I",3910,"LUVA DE FERRO GALVANIZADO, COM ROSCA BSP, DE 1\"","UN    ",1,7.19,7.19,7.19,7.19]
[null,"MATERIAL (C) - TOTAL",null,null,null,null,null,null,7.19,7.19]
[]
[25,"FONTE","CÓDIGO","DESCRIÇÃO","UNIDADE","COEFIC.","CUSTO UNITÁRIO",null,"CUSTO  TOTAL (A) + (B) + (C) + (D) + (E)"]
[null,null,null,null,null,null,"DESONERADO","NÃO DESONER.","DESONERADO","NÃO DESONER."]
[null,"COMPOSIÇÃO","COMP 025_SEE","SINALIZADOR FOTOLUMINESCENTE DE EMERGÊNCIA","UN ",null,"-","-",24.159999999999997,24.279999999999998]
[null,"AGETOP_I",5,"SERVENTE","h     ",0.09,8.75,10.14,0.79,0.91]
[null,"MÃO DE OBRA (B) - TOTAL",null,null,null,null,null,null,0.79,0.91]
[null,"AGETOP_I",3070,"BUCHA DE NYLON S-6","un",2,0.04,0.04,0.08,0.08]
[null,"AGETOP_I",3393,"PARAFUSO P/BUCHA S-6","un",2,0.08,0.08,0.16,0.16]
[null,"SINAPI_I",37556,"PLACA DE SINALIZACAO DE SEGURANCA CONTRA INCENDIO, FOTOLUMINESCENTE, QUADRADA, *20 X 20* CM, EM PVC *2* MM ANTI-CHAMAS (SIMBOLOS, CORES E PICTOGRAMAS CONFORME NBR 13434)","UN    ",1,23.13,23.13,23.13,23.13]
[null,"MATERIAL (C) - TOTAL",null,null,null,null,null,null,23.369999999999997,23.369999999999997]
[]
[277,"FONTE","CÓDIGO","DESCRIÇÃO","UNIDADE","COEFIC.","CUSTO UNITÁRIO",null,"CUSTO  TOTAL (A) + (B) + (C) + (D) + (E)"]
[null,null,null,null,null,null,"DESONERADO","NÃO DESONER.","DESONERADO","NÃO DESONER."]
[null,"COMPOSIÇÃO","COMP 277_SEE","MARCAÇÃO NO PISO - 1X1 M PARA EXTINTOR","M2",null,null,null,29.07,29.14]
[null,"AGETOP_I",5,"SERVENTE","h     ",3.3300000000000003E-2,8.75,10.14,0.28999999999999998,0.34]
[null,"MÃO DE OBRA (B) - TOTAL",null,null,null,null,null,null,0.28999999999999998,0.34]
[null,"SINAPI_I",5318,"SOLVENTE DILUENTE A BASE DE AGUARRAS","L     ",0.13,10.86,10.86,1.41,1.41]
[null,"SINAPI",5824,"CAMINHÃO TOCO, PBT 16.000 KG, CARGA ÚTIL MÁX. 10.685 KG, DIST. ENTRE EIXOS 4,8 M, POTÊNCIA 189 CV, INCLUSIVE CARROCERIA FIXA ABERTA DE MADEIRA P/ TRANSPORTE GERAL DE CARGA SECA, DIMEN. APROX. 2,5 X 7,00 X 0,50 M - CHP DIURNO. AF_06/2014","CHP",3.3E-3,122.23,125.42,0.4,0.41]
[null,"SINAPI_I",7343,"TINTA A BASE DE RESINA ACRILICA, PARA SINALIZACAO HORIZONTAL VIARIA (NBR 11862)","L     ",0.6,12,12,7.2,7.2]
[null,"SINAPI_I",7348,"TINTA ACRILICA PREMIUM PARA PISO","L     ",0.03,13.81,13.81,0.41,0.41]
[null,"SINAPI_I",25972,"MICROESFERAS DE VIDRO PARA SINALIZACAO HORIZONTAL VIARIA, TIPO I-B (PREMIX) - NBR 16184","KG    ",2.14,8.8800000000000008,8.8800000000000008,19,19]
[null,"SINAPI",95133,"MÁQUINA DEMARCADORA DE FAIXA DE TRÁFEGO À FRIO, AUTOPROPELIDA, POTÊNCIA 38 HP - CHP DIURNO. AF_07/2016","CHP",3.3E-3,108.52,112.07,0.36,0.37]
[null,"MATERIAL (C) - TOTAL",null,null,null,null,null,null,28.78,28.8]
[]
[83,"FONTE","CÓDIGO","DESCRIÇÃO","UNIDADE","COEFIC.","CUSTO UNITÁRIO",null,"CUSTO  TOTAL (A) + (B) + (C) + (D) + (E)"]
[null,null,null,null,null,null,"DESONERADO","NÃO DESONER.","DESONERADO","NÃO DESONER."]
[null,"COMPOSIÇÃO","COMP 083_SEE","CORRIMÃO PISO - SEDUC","M",null,null,null,143.18,147.41000000000003]
[null,"AGETOP_I",25,"OFICIAL \"B\"","h     ",1,13.95,16.16,13.95,16.16]
[null,"AGETOP_I",8,"AJUDANTE","h     ",1,8.75,10.14,8.75,10.14]
[null,"MÃO DE OBRA (B) - TOTAL",null,null,null,null,null,null,22.7,26.3]
[null,"AGETOP_I",2376,"TUBO INDUSTRIAL 2\" CHAPA 13 ","Kg",8.2197499999999994,5.23,5.23,42.99,42.99]
[null,"AGETOP_I",2504,"TUBO INDUSTRIAL D=25 MM CHAPA 13 ","Kg",1.1000000000000001,5.07,5.07,5.58,5.58]
[null,"AGETOP_I",2417,"MASSA PLASTICA","Kg",0.2041,10.58,10.58,2.16,2.16]
[null,"AGETOP_I",2246,"ELETRODO 2.5 OK","Kg",0.11459999999999999,8.6999999999999993,8.6999999999999993,1,1]
[null,"AGETOP_I",1672,"LIXA PARA FERRO ( NÚMERO 100 )","un",0.125,2.12,2.12,0.27,0.27]
[null,"AGETOP_I",1264,"DISCO DE DESBASTE 7/8\" P/ CONC./FERRO (1/4\" X 7\")","un",2.5000000000000001E-2,7,7,0.18,0.18]
[null,"AGETOP_I",1334,"DISCO DE CORTE DIAM. 5/8\"- 10\"","un",0.1865,5.5,5.5,1.03,1.03]
[null,"AGETOP_I",2902,"FABRICAÇÃO / MONTAGEM","un",1,50.44,50.44,50.44,50.44]
[null,"AGETOP_I",2150,"CHAPA DE FERRO DOBRADA No.13","Kg",0.43519999999999998,5.28,5.28,2.2999999999999998,2.2999999999999998]
[null,"AGETOP_I",2719,"CHAPA PERFILADA 3/16\"","Kg",1.1644000000000001,5.04,5.04,5.87,5.87]
[null,"AGETOP_I",2436,"ACO CA-25 - 6,3 MM (1/4\") - BARRA LISA A-36","Kg",0.48150000000000004,5.13,5.13,2.4700000000000002,2.4700000000000002]
[null,"AGETOP",261602,"PINT.ESMALTE/ESQUAD.FERRO C/FUNDO ANTICOR.","m2    ",0.44,14.07,15.51,6.19,6.82]
[null,"MATERIAL (C) - TOTAL",null,null,null,null,null,null,120.48,121.11000000000001]
[]
[85,"FONTE","CÓDIGO","DESCRIÇÃO","UNIDADE","COEFIC.","CUSTO UNITÁRIO",null,"CUSTO  TOTAL (A) + (B) + (C) + (D) + (E)"]
[null,null,null,null,null,null,"DESONERADO","NÃO DESONER.","DESONERADO","NÃO DESONER."]
[null,"COMPOSIÇÃO","COMP 085_SEE","GUARDA-CORPO - SEDUC","M",null,null,null,190.52999999999997,195.41]
[null,"AGETOP_I",25,"OFICIAL \"B\"","h     ",1.1000000000000001,13.95,16.16,15.35,17.78]
[null,"AGETOP_I",8,"AJUDANTE","h     ",1.1000000000000001,8.75,10.14,9.6300000000000008,11.15]
[null,"MÃO DE OBRA (B) - TOTAL",null,null,null,null,null,null,24.98,28.93]
[null,"AGETOP_I",2376,"TUBO INDUSTRIAL 2\" CHAPA 13 ","Kg",7.7778,5.23,5.23,40.68,40.68]
[null,"AGETOP_I",2504,"TUBO INDUSTRIAL D=25 MM CHAPA 13 ","Kg",4.6319999999999997,5.07,5.07,23.48,23.48]
[null,"AGETOP_I",2377,"TUBO INDUSTRIAL 40X40 CH.13","Kg",6.3419999999999996,5.07,5.07,32.15,32.15]
[null,"AGETOP_I",2417,"MASSA PLASTICA","Kg",0.2041,10.58,10.58,2.16,2.16]
[null,"AGETOP_I",2246,"ELETRODO 2.5 OK","Kg",0.11459999999999999,8.6999999999999993,8.6999999999999993,1,1]
[null,"AGETOP_I",1672,"LIXA PARA FERRO ( NÚMERO 100 )","un",0.25509999999999999,2.12,2.12,0.54,0.54]
[null,"AGETOP_I",1264,"DISCO DE DESBASTE 7/8\" P/ CONC./FERRO (1/4\" X 7\")","un",5.0999999999999997E-2,7,7,0.36,0.36]
[null,"AGETOP_I",1334,"DISCO DE CORTE DIAM. 5/8\"- 10\"","un",0.2334,5.5,5.5,1.28,1.28]
[null,"AGETOP_I",2902,"FABRICAÇÃO / MONTAGEM","un",1,50.44,50.44,50.44,50.44]
[null,"AGETOP_I",2150,"CHAPA DE FERRO DOBRADA No.13","Kg",0.33909,5.28,5.28,1.79,1.79]
[null,"AGETOP_I",2719,"CHAPA PERFILADA 3/16\"","Kg",0.3463,5.04,5.04,1.75,1.75]
[null,"AGETOP_I",2436,"ACO CA-25 - 6,3 MM (1/4\") - BARRA LISA A-36","Kg",0.18029999999999999,5.13,5.13,0.92,0.92]
[null,"AGETOP",261602,"PINT.ESMALTE/ESQUAD.FERRO C/FUNDO ANTICOR.","m2    ",0.64,14.07,15.51,9,9.93]
[null,"MATERIAL (C) - TOTAL",null,null,null,null,null,null,165.54999999999998,166.48]
[]
[84,"FONTE","CÓDIGO","DESCRIÇÃO","UNIDADE","COEFIC.","CUSTO UNITÁRIO",null,"CUSTO  TOTAL (A) + (B) + (C) + (D) + (E)"]
[null,null,null,null,null,null,"DESONERADO","NÃO DESONER.","DESONERADO","NÃO DESONER."]
[null,"COMPOSIÇÃO","COMP 084_SEE","GUARDA-CORPO COM CORRIMÃO - SEDUC","M",null,null,null,206.14000000000001,211.22000000000003]
[null,"AGETOP_I",25,"OFICIAL \"B\"","h     ",1.1000000000000001,13.95,16.16,15.35,17.78]
[null,"AGETOP_I",8,"AJUDANTE","h     ",1.1000000000000001,8.75,10.14,9.6300000000000008,11.15]
[null,"MÃO DE OBRA (B) - TOTAL",null,null,null,null,null,null,24.98,28.93]
[null,"AGETOP_I",2376,"TUBO INDUSTRIAL 2\" CHAPA 13 ","Kg",7.7778,5.23,5.23,40.68,40.68]
[null,"AGETOP_I",2504,"TUBO INDUSTRIAL D=25 MM CHAPA 13 ","Kg",4.6319999999999997,5.07,5.07,23.48,23.48]
[null,"AGETOP_I",2377,"TUBO INDUSTRIAL 40X40 CH.13","Kg",6.3419999999999996,5.07,5.07,32.15,32.15]
[null,"AGETOP_I",2421,"TUBO INDUSTRIAL 1.1/2\" CHAPA 13 ","Kg",1.4862,5.07,5.07,7.54,7.54]
[null,"AGETOP_I",2417,"MASSA PLASTICA","Kg",0.2041,10.58,10.58,2.16,2.16]
[null,"AGETOP_I",2246,"ELETRODO 2.5 OK","Kg",0.11459999999999999,8.6999999999999993,8.6999999999999993,1,1]
[null,"AGETOP_I",1672,"LIXA PARA FERRO ( NÚMERO 100 )","un",0.25509999999999999,2.12,2.12,0.54,0.54]
[null,"AGETOP_I",1264,"DISCO DE DESBASTE 7/8\" P/ CONC./FERRO (1/4\" X 7\")","un",5.0999999999999997E-2,7,7,0.36,0.36]
[null,"AGETOP_I",1334,"DISCO DE CORTE DIAM. 5/8\"- 10\"","un",0.373,5.5,5.5,2.0499999999999998,2.0499999999999998]
[null,"AGETOP_I",2902,"FABRICAÇÃO / MONTAGEM","un",1,50.44,50.44,50.44,50.44]
[null,"AGETOP_I",2150,"CHAPA DE FERRO DOBRADA No.13","Kg",0.43519999999999998,5.28,5.28,2.2999999999999998,2.2999999999999998]
[null,"AGETOP_I",2719,"CHAPA PERFILADA 3/16\"","Kg",1.0979999999999999,5.04,5.04,5.53,5.53]
[null,"AGETOP_I",2436,"ACO CA-25 - 6,3 MM (1/4\") - BARRA LISA A-36","Kg",0.38124999999999998,5.13,5.13,1.96,1.96]
[null,"AGETOP",261602,"PINT.ESMALTE/ESQUAD.FERRO C/FUNDO ANTICOR.","m2    ",0.78,14.07,15.51,10.97,12.1]
[null,"MATERIAL (C) - TOTAL",null,null,null,null,null,null,181.16000000000003,182.29000000000002]
[]
[82,"FONTE","CÓDIGO","DESCRIÇÃO","UNIDADE","COEFIC.","CUSTO UNITÁRIO",null,"CUSTO  TOTAL (A) + (B) + (C) + (D) + (E)"]
[null,null,null,null,null,null,"DESONERADO","NÃO DESONER.","DESONERADO","NÃO DESONER."]
[null,"COMPOSIÇÃO","COMP 082_SEE","CORRIMÃO PAREDE - SEDUC","M",null,null,null,121.38,125.41]
[null,"AGETOP_I",25,"OFICIAL \"B\"","h     ",1,13.95,16.16,13.95,16.16]
[null,"AGETOP_I",8,"AJUDANTE","h     ",1,8.75,10.14,8.75,10.14]
[null,"MÃO DE OBRA (B) - TOTAL",null,null,null,null,null,null,22.7,26.3]
[null,"AGETOP_I",2376,"TUBO INDUSTRIAL 2\" CHAPA 13 ","Kg",5.5247999999999999,5.23,5.23,28.89,28.89]
[null,"AGETOP_I",2504,"TUBO INDUSTRIAL D=25 MM CHAPA 13 ","Kg",1.1000000000000001,5.07,5.07,5.58,5.58]
[null,"AGETOP_I",2417,"MASSA PLASTICA","Kg",0.2041,10.58,10.58,2.16,2.16]
[null,"AGETOP_I",2246,"ELETRODO 2.5 OK","Kg",0.11459999999999999,8.6999999999999993,8.6999999999999993,1,1]
[null,"AGETOP_I",1672,"LIXA PARA FERRO ( NÚMERO 100 )","un",0.125,2.12,2.12,0.27,0.27]
[null,"AGETOP_I",1264,"DISCO DE DESBASTE 7/8\" P/ CONC./FERRO (1/4\" X 7\")","un",2.5000000000000001E-2,7,7,0.18,0.18]
[null,"AGETOP_I",1334,"DISCO DE CORTE DIAM. 5/8\"- 10\"","un",0.1865,5.5,5.5,1.03,1.03]
[null,"AGETOP_I",2902,"FABRICAÇÃO / MONTAGEM","un",1,50.44,50.44,50.44,50.44]
[null,"AGETOP_I",2719,"CHAPA PERFILADA 3/16\"","Kg",0.72,5.04,5.04,3.63,3.63]
[null,"AGETOP_I",2436,"ACO CA-25 - 6,3 MM (1/4\") - BARRA LISA A-36","Kg",0.25,5.13,5.13,1.28,1.28]
[null,"AGETOP",261602,"PINT.ESMALTE/ESQUAD.FERRO C/FUNDO ANTICOR.","m2    ",0.3,14.07,15.51,4.22,4.6500000000000004]
[null,"MATERIAL (C) - TOTAL",null,null,null,null,null,null,98.679999999999993,99.11]