{"text_format":"1","workbook":"xlsx","n_sheets":9,"sheets":["Orçamento","Resumo ","Somatório","Cronog_180_Dias","Composição BDI","Relatório CENTRAL","Parc Maior Relev","Composições","Cotações"],"not_rendered":{"charts":0,"images":5,"macros":1,"external_links":2,"defined_names":157,"comments":2,"pivot_tables":0},"unopened":[],"bounds":{"document_bytes":16777216,"sheet_cells":100000,"rows_first":2000,"rows_last":500,"rows_between":2000,"halvings":0,"cell_chars":16384,"cell_head_chars":4096},"cells_cut":0,"cells_raw":0,"read":"whole","date_system":"1900"}

{"sheet":"Orçamento","index":0,"n_rows":694,"n_cols":27,"rows_kept":694,"cut":false,"hidden":false,"merged":[[663,23,663,25],[664,23,664,25],[665,23,665,25],[661,23,661,25],[636,23,636,25],[637,23,637,25],[638,23,638,25],[639,23,639,25],[640,23,640,25],[641,23,641,25],[642,23,642,25],[643,23,643,25],[644,23,644,25],[645,23,645,25],[646,23,646,25],[647,23,647,25],[648,23,648,25],[649,23,649,25],[650,23,650,25],[651,23,651,25],[652,23,652,25],[653,23,653,25],[654,23,654,25],[655,23,655,25],[678,23,678,25],[679,23,679,25],[680,23,680,25],[681,23,681,25],[682,23,682,25],[683,23,683,25],[684,23,684,25],[685,23,685,25],[686,23,686,25],[669,23,669,25],[670,23,670,25],[671,23,671,25],[672,23,672,25],[673,23,673,25],[674,23,674,25],[675,23,675,25],[676,23,676,25],[677,23,677,25],[8,12,9,12],[664,18,664,22],[0,14,0,24],[8,14,8,16],[9,14,9,16],[11,14,11,16],[12,14,12,16],[14,14,14,24],[1,14,1,24],[4,14,4,24],[7,14,7,24],[648,18,648,22],[645,15,645,17],[646,15,646,17],[647,15,647,17],[657,18,657,22],[655,18,655,22],[618,23,618,24],[663,18,663,22],[650,18,650,22],[643,18,643,22],[657,15,657,17],[658,15,658,17],[659,15,659,17],[665,18,665,22],[641,18,641,22],[642,18,642,22],[640,18,640,22],[649,18,649,22],[631,18,631,24],[637,18,637,22],[638,18,638,22],[639,18,639,22],[662,18,662,22],[660,18,660,22],[661,18,661,22],[651,18,651,22],[658,18,658,22],[654,18,654,22],[656,18,656,22],[652,18,652,22],[653,18,653,22],[662,23,662,25],[656,23,656,25],[657,23,657,25],[658,23,658,25],[659,23,659,25],[660,23,660,25],[619,23,619,24],[620,23,620,24],[635,23,635,25],[660,15,660,17],[661,15,661,17],[634,14,634,26],[618,17,623,17],[635,18,635,22],[636,18,636,22],[644,18,644,22],[645,18,645,22],[646,18,646,22],[647,18,647,22],[659,18,659,22],[656,15,656,17],[636,15,636,17],[637,15,637,17],[638,15,638,17],[639,15,639,17],[640,15,640,17],[641,15,641,17],[642,15,642,17],[643,15,643,17],[644,15,644,17],[648,15,648,17],[649,15,649,17],[650,15,650,17],[651,15,651,17],[652,15,652,17],[653,15,653,17],[654,15,654,17],[655,15,655,17],[629,16,629,24],[671,15,671,17],[671,18,671,22],[626,16,626,24],[627,16,627,24],[628,16,628,24],[10,14,10,26],[13,14,13,26],[9,17,9,22],[2,14,2,22],[3,14,3,22],[5,18,5,22],[6,18,6,22],[11,18,11,22],[12,18,12,22],[6,14,6,17],[5,14,5,17],[3,23,3,25],[2,23,2,25],[5,23,5,25],[6,23,6,25],[630,16,630,24],[8,23,8,25],[9,24,9,25],[693,18,693,22],[690,14,690,17],[687,15,687,17],[687,18,687,22],[688,15,688,17],[688,18,688,22],[689,15,689,17],[689,18,689,22],[692,18,692,22],[691,18,691,22],[687,23,687,25],[688,23,688,25],[689,23,689,25],[690,23,690,25],[691,23,691,25],[692,23,692,25],[693,23,693,25],[662,14,662,17],[669,15,669,17],[635,15,635,17],[690,18,690,22],[678,15,678,17],[678,18,678,22],[679,15,679,17],[679,18,679,22],[680,15,680,17],[680,18,680,22],[684,15,684,17],[684,18,684,22],[685,15,685,17],[685,18,685,22],[686,15,686,17],[675,15,675,17],[686,18,686,22],[681,15,681,17],[681,18,681,22],[682,15,682,17],[682,18,682,22],[683,15,683,17],[683,18,683,22],[12,24,12,25],[11,23,11,25],[675,18,675,22],[676,15,676,17],[676,18,676,22],[677,15,677,17],[677,18,677,22],[672,15,672,17],[672,18,672,22],[673,15,673,17],[673,18,673,22],[674,15,674,17],[674,18,674,22],[668,14,668,26],[669,18,669,22],[670,15,670,17],[670,18,670,22]]}
[]
[]
[null,null,null,null,null,null,null,null,null,null,null,null,null,null,"UNIDADE ESCOLAR",null,null,null,null,null,null,null,null,"CÓDIGO INEP"]
[null,null,null,null,null,null,null,null,null,null,null,null,null,null,"COLÉGIO ESTADUAL JUSCELINO KUBITSCHEK DE OLIVEIRA",null,null,null,null,null,null,null,null,52075583]
[]
["Nmax",null,null,null,null,null,null,null,null,null,null,null,null,null,"OBRA",null,null,null,"DATA",null,null,null,null,"CIDADE"]
[{"$f":"MAX($C$18:$C$618)","v":3},null,null,null,null,null,null,null,null,null,null,null,null,null,"REFORMA E IMPLANTAÇÃO",null,null,null,"2020-07-07",null,null,null,null,"ÁGUAS LINDAS DE GOIÁS"]
[]
[null,null,null,null,null,null,null,null,null,null,null,null,"",null,"CRE",null,null,"ENDEREÇO",null,null,null,null,null,"REFERÊNCIA AGETOP"]
[null,null,null,null,null,null,null,null,null,null,null,null,null,null,"ÁGUAS LINDAS",null,null,"AREA ESPECIAL S/N, JARDIM SANTA LUCIA, CEP:72910-001",null,null,null,null,null,"ABR/19","DESONERADA"]
[]
[null,null,null,null,null,null,null,null,null,null,null,null,null,null,"ÁREA EXISTENTE (M²)",null,null,"ÁREA A CONSTRUIR (M²)","ÁREA TOTAL CONSTRUÍDA (M²)",null,null,null,null,"REFERÊNCIA SINAPI"]
[null,null,null,null,null,null,null,null,null,null,null,null,null,null,2454.88,null,null,619.21,3074.09,null,null,null,null,"SET/19","DESONERADA"]
[]
[null,null,null,null,null,null,null,null,null,null,null,"FILTRO",null,null,"PLANILHA ORÇAMENTÁRIA"]
["Nível E","Save Nivel","Nível C","Altura","n1","n2","n3","n4","n5","Czero","Cnível","↓","Nível","Nível Corrigido","ITEM","TABELA","CODIGO","DESCRIÇÃO DOS SERVIÇOS","UNID","QUANT","REPET","QUANT TOTAL","MAT","MO","T.SERVIÇO UNIT","VALOR TOTAL","OBSERVAÇÕES¹"]
[{"$f":"CHOOSE(1+LOG(1+2*(ORÇAMENTO.Nivel=\"Nível 1\")+4*(ORÇAMENTO.Nivel=\"Nível 2\")+8*(ORÇAMENTO.Nivel=\"Nível 3\")+16*(ORÇAMENTO.Nivel=\"Nível 4\")+32*(ORÇAMENTO.Nivel=\"Serviço\"),2),0,1,2,3,4,\"S\")","v":"S"},{"$f":"IF(OR(C17=\"s\",C17=0),OFFSET(B17,-1,0),C17)","v":"Save Nivel"},{"$f":"IF(OFFSET(C17,-1,0)=\"L\",1,IF(OFFSET(C17,-1,0)=1,2,IF(OR(A17=\"s\",A17=0),\"S\",IF(AND(OFFSET(C17,-1,0)=2,A17=4),3,IF(AND(OR(OFFSET(C17,-1,0)=\"s\",OFFSET(C17,-1,0)=0),A17<>\"s\",A17>OFFSET(B17,-1,0)),OFFSET(B17,-1,0),A17)))))","v":"S"},{"$f":"IF(OR(C17=\"S\",C17=0),0,IF(ISERROR(K17),J17,SMALL(J17:K17,1)))","v":0},{"$f":"IF($C17=1,OFFSET(E17,-1,0)+1,OFFSET(E17,-1,0))","v":"n1"},{"$f":"IF($C17=1,0,IF($C17=2,OFFSET(F17,-1,0)+1,OFFSET(F17,-1,0)))","v":"n2"},{"$f":"IF(AND($C17<=2,$C17<>0),0,IF($C17=3,OFFSET(G17,-1,0)+1,OFFSET(G17,-1,0)))","v":"n3"},{"$f":"IF(AND($C17<=3,$C17<>0),0,IF($C17=4,OFFSET(H17,-1,0)+1,OFFSET(H17,-1,0)))","v":"n4"},{"$f":"IF(AND($C17<=4,$C17<>0),0,IF(AND($C17=\"S\",$Y17>0),OFFSET(I17,-1,0)+1,OFFSET(I17,-1,0)))","v":"n5"},{"$f":"IF(OR($C17=\"S\",$C17=0),0,MATCH(0,OFFSET($D17,1,$C17,ROW($C$618)-ROW($C17)),0))","v":0},{"$f":"IF(OR($C17=\"S\",$C17=0),0,MATCH(OFFSET($D17,0,$C17)+1,OFFSET($D17,1,$C17,ROW($C$618)-ROW($C17)),0))","v":0},"","Serviço","Serviço","-","SINAPI",null,"(sem código)","-",null,"REPET","-",0,0,0,"-",""]
[0,null,"L",{"$f":"COUNTA(OFFSET(D18,1,0):D$618)","v":599},{"$f":"LEFT(O19,1)-1","v":0},null,null,null,null,null,null,"F","LOTE","LOTE","REFORMA E IMPLANTAÇÃO - COLÉGIO ESTADUAL JUSCELINO KUBITSCHEK DE OLIVEIRA",null,null,null,null,null,null,null,null,null,null,808382.72000000079]
[1,{"$f":"IF(OR(C19=\"s\",C19=0),OFFSET(B19,-1,0),C19)","v":1},{"$f":"IF(OFFSET(C19,-1,0)=\"L\",1,IF(OFFSET(C19,-1,0)=1,2,IF(OR(A19=\"s\",A19=0),\"S\",IF(AND(OFFSET(C19,-1,0)=2,A19=4),3,IF(AND(OR(OFFSET(C19,-1,0)=\"s\",OFFSET(C19,-1,0)=0),A19<>\"s\",A19>OFFSET(B19,-1,0)),OFFSET(B19,-1,0),A19)))))","v":1},{"$f":"IF(OR(C19=\"S\",C19=0),0,IF(ISERROR(K19),J19,SMALL(J19:K19,1)))","v":312},{"$f":"IF($C19=1,OFFSET(E19,-1,0)+1,OFFSET(E19,-1,0))","v":1},{"$f":"IF($C19=1,0,IF($C19=2,OFFSET(F19,-1,0)+1,OFFSET(F19,-1,0)))","v":0},{"$f":"IF(AND($C19<=2,$C19<>0),0,IF($C19=3,OFFSET(G19,-1,0)+1,OFFSET(G19,-1,0)))","v":0},{"$f":"IF(AND($C19<=3,$C19<>0),0,IF($C19=4,OFFSET(H19,-1,0)+1,OFFSET(H19,-1,0)))","v":0},0,{"$f":"IF(OR($C19=\"S\",$C19=0),0,MATCH(0,OFFSET($D19,1,$C19,ROW($C$618)-ROW($C19)),0))","v":599},{"$f":"IF(OR($C19=\"S\",$C19=0),0,MATCH(OFFSET($D19,0,$C19)+1,OFFSET($D19,1,$C19,ROW($C$618)-ROW($C19)),0))","v":312},"F","Nível 1","Nível 1","1.","AGETOP",null,"REFORMA E IMPLANTAÇÃO","UN",1,1]
[2,{"$f":"IF(OR(C20=\"s\",C20=0),OFFSET(B20,-1,0),C20)","v":2},{"$f":"IF(OFFSET(C20,-1,0)=\"L\",1,IF(OFFSET(C20,-1,0)=1,2,IF(OR(A20=\"s\",A20=0),\"S\",IF(AND(OFFSET(C20,-1,0)=2,A20=4),3,IF(AND(OR(OFFSET(C20,-1,0)=\"s\",OFFSET(C20,-1,0)=0),A20<>\"s\",A20>OFFSET(B20,-1,0)),OFFSET(B20,-1,0),A20)))))","v":2},{"$f":"IF(OR(C20=\"S\",C20=0),0,IF(ISERROR(K20),J20,SMALL(J20:K20,1)))","v":21},{"$f":"IF($C20=1,OFFSET(E20,-1,0)+1,OFFSET(E20,-1,0))","v":1},{"$f":"IF($C20=1,0,IF($C20=2,OFFSET(F20,-1,0)+1,OFFSET(F20,-1,0)))","v":1},{"$f":"IF(AND($C20<=2,$C20<>0),0,IF($C20=3,OFFSET(G20,-1,0)+1,OFFSET(G20,-1,0)))","v":0},{"$f":"IF(AND($C20<=3,$C20<>0),0,IF($C20=4,OFFSET(H20,-1,0)+1,OFFSET(H20,-1,0)))","v":0},0,311,21,"F","Nível 2","Nível 2","1.1.","AGETOP",null,"SERVIÇOS PRELIMINARES","-",null,1]
[3,3,3,3,1,1,1,0,0,20,3,"F","Nível 3","Nível 3","1.1.1.","SINAPI",null,"FORRO PVC COM ESTRUTURA","-",null,1,null,null,null,null,null,""]
["S",3,"S",0,1,1,1,0,0,0,0,"F","Serviço","Serviço","1.1.1.1.","SINAPI",97640,"REMOÇÃO DE FORROS DE DRYWALL, PVC E FIBROMINERAL, DE FORMA MANUAL, SEM REAPROVEITAMENTO. AF_12/2017","M2",131.87,1,null,null,null,null,null,""]
["S",3,"S",0,1,1,1,0,0,0,0,"F","Serviço","Serviço","1.1.1.2.","SINAPI",97642,"REMOÇÃO DE TRAMA METÁLICA OU DE MADEIRA PARA FORRO, DE FORMA MANUAL, SEM REAPROVEITAMENTO. AF_12/2017","M2",131.87,1,null,null,null,null,null,""]
[3,3,3,17,1,1,2,0,0,17,26,"F","Nível 3","Nível 3","1.1.2.","SINAPI",null,"OUTROS","-",null,1,null,null,null,null,null,""]
["S",3,"S",0,1,1,2,0,0,0,0,"F","Serviço","Serviço","1.1.2.1.","SINAPI",97622,"DEMOLIÇÃO DE ALVENARIA DE BLOCO FURADO, DE FORMA MANUAL, SEM REAPROVEITAMENTO. AF_12/2017","M3",1.8674999999999997,1,null,null,null,null,null,"Referência: AGETOP - 20118"]
["S",3,"S",0,1,1,2,0,0,0,0,"F","Serviço","Serviço","1.1.2.2.","AGETOP",20101,"DEMOLICAO COBERTURA TELHA CERAMICA C/ TRANSP. ATÉ CB. E CARGA","m2    ",268.85000000000002,1,null,null,null,null,null,""]
["S",3,"S",0,1,1,2,0,0,0,0,"F","Serviço","Serviço","1.1.2.3.","AGETOP",20111,"DEM.PISO CERAM.SOBRE LASTRO CONC.C/TR.CB.E CARGA","m2    ",46.86,1,null,null,null,null,null,""]
["S",3,"S",0,1,1,2,0,0,0,0,"F","Serviço","Serviço","1.1.2.4.","SINAPI",97633,"DEMOLIÇÃO DE REVESTIMENTO CERÂMICO, DE FORMA MANUAL, SEM REAPROVEITAMENTO. AF_12/2017","M2",158.98000000000002,1,null,null,null,null,null,"Referência: AGETOP - 20115"]
["S",3,"S",0,1,1,2,0,0,0,0,"F","Serviço","Serviço","1.1.2.5.","AGETOP",20137,"DEMOLIÇAO BACIA SANITARIA C/ TRANSP. ATÉ CB. E CARGA","Un    ",6,1,null,null,null,null,null,""]
["S",3,"S",0,1,1,2,0,0,0,0,"F","Serviço","Serviço","1.1.2.6.","AGETOP",20139,"DEMOLIÇAO DE BANCADAS C/ TRANSP. ATÉ CB. E CARGA","m2    ",3.71,1,null,null,null,null,null,""]
["S",3,"S",0,1,1,2,0,0,0,0,"F","Serviço","Serviço","1.1.2.7.","AGETOP",20141,"DEMOLIÇAO DE CAIXA DESCARGA EXTERNA C/ TRANSP. ATÉ CB. E CARGA","Un    ",6,1,null,null,null,null,null,""]
["S",3,"S",0,1,1,2,0,0,0,0,"F","Serviço","Serviço","1.1.2.8.","AGETOP",20163,"DEMOLIÇÃO DAS INSTALAÇÕES HIDROSANITÁRIAS E AFINS C/ TRANSP. ATÉ CB. E CARGA","H     ",4,1,null,null,null,null,null,""]
["S",3,"S",0,1,1,2,0,0,0,0,"F","Serviço","Serviço","1.1.2.9.","SINAPI",97661,"REMOÇÃO DE CABOS ELÉTRICOS, DE FORMA MANUAL, SEM REAPROVEITAMENTO. AF_12/2017","M",500,1,null,null,null,null,null,""]
["S",3,"S",0,1,1,2,0,0,0,0,"F","Serviço","Serviço","1.1.2.10.","SINAPI",97660,"REMOÇÃO DE INTERRUPTORES/TOMADAS ELÉTRICAS, DE FORMA MANUAL, SEM REAPROVEITAMENTO. AF_12/2017","UN",20,1,null,null,null,null,null,""]
["S",3,"S",0,1,1,2,0,0,0,0,"F","Serviço","Serviço","1.1.2.11.","SINAPI",97665,"REMOÇÃO DE LUMINÁRIAS, DE FORMA MANUAL, SEM REAPROVEITAMENTO. AF_12/2017","UN",28,1,null,null,null,null,null,""]
["S",3,"S",0,1,1,2,0,0,0,0,"F","Serviço","Serviço","1.1.2.12.","AGETOP",20121,"DEM. MANUAL EM CONCR.SIMPLES C/TR.ATE CB.E CARGA (O.C.)","m3    ",1.34,1,null,null,null,null,null,""]
["S",3,"S",0,1,1,2,0,0,0,0,"F","Serviço","Serviço","1.1.2.13.","COMPOSIÇÃO","COMP 010_SEE","DEMOLIÇÃO DE GRADE/GRELHA/GUARDA CORPO - METÁLICO","M2",8.08,1,null,null,null,null,null,""]
["S",3,"S",0,1,1,2,0,0,0,0,"F","Serviço","Serviço","1.1.2.14.","COMPOSIÇÃO","COMP 385_SEE","DEMOLIÇÃO POSTE DE CONCRETO/METALICA ENTRE 10 E 15 METROS C/ REAPROVEITAMENTO C/ TRANSPORTE ATE CAÇAMBA E CARGA","UN ",2,1,null,null,null,null,null,""]
["S",3,"S",0,1,1,2,0,0,0,0,"F","Serviço","Serviço","1.1.2.15.","AGETOP",20190,"LIMPEZA MECANICA DE TERRENO","m2    ",1302.3499999999999,1,null,null,null,null,null,""]
["S",3,"S",0,1,1,2,0,0,0,0,"F","Serviço","Serviço","1.1.2.16.","SINAPI","74209/1","PLACA DE OBRA EM CHAPA DE ACO GALVANIZADO","M2",7.5,1,null,null,null,null,null,"Referência: AGETOP - 21301"]
[2,2,2,3,1,2,0,0,0,290,3,"F","Nível 2","Nível 2","1.2.","AGETOP",null,"TRANSPORTES","-",null,1,null,null,null,null,null,""]
["S",2,"S",0,1,2,0,0,0,0,0,"F","Serviço","Serviço","1.2.0.1.","SINAPI",72900,"TRANSPORTE DE ENTULHO COM CAMINHAO BASCULANTE 6 M3, RODOVIA PAVIMENTADA, DMT 0,5 A 1,0 KM","M3",34.130000000000003,1,null,null,null,null,null,""]
["S",2,"S",0,1,2,0,0,0,0,0,"F","Serviço","Serviço","1.2.0.2.","SINAPI",72897,"CARGA MANUAL DE ENTULHO EM CAMINHAO BASCULANTE 6 M3","M3",34.130000000000003,1,null,null,null,null,null,""]
[2,2,2,20,1,3,0,0,0,287,20,"F","Nível 2","Nível 2","1.3.","AGETOP",null,"SERVIÇO EM TERRA","-",null,1,null,null,null,null,null,""]
[3,3,3,3,1,3,1,0,0,19,3,"F","Nível 3","Nível 3","1.3.1.","SINAPI",null,"INST. ELÉTRICAS","-",null,1,null,null,null,null,null,""]
["S",3,"S",0,1,3,1,0,0,0,0,"F","Serviço","Serviço","1.3.1.1.","SINAPI",93358,"ESCAVAÇÃO MANUAL DE VALA COM PROFUNDIDADE MENOR OU IGUAL A 1,30 M. AF_03/2016","M3",18,1,null,null,null,null,null,"Referência: AGETOP - 40101"]
["S",3,"S",0,1,3,1,0,0,0,0,"F","Serviço","Serviço","1.3.1.2.","SINAPI",96995,"REATERRO MANUAL APILOADO COM SOQUETE. AF_10/2017","M3",18,1,null,null,null,null,null,"Referência: AGETOP - 40902"]
[3,3,3,2,1,3,2,0,0,16,2,"F","Nível 3","Nível 3","1.3.2.","SINAPI",null,"CALÇADA ACESSÍVEL ","-",null,1,null,null,null,null,null,""]
["S",3,"S",0,1,3,2,0,0,0,0,"F","Serviço","Serviço","1.3.2.1.","AGETOP",41002,"APILOAMENTO","m2    ",462.4,1,null,null,null,null,null,""]
[3,3,3,7,1,3,3,0,0,14,7,"F","Nível 3","Nível 3","1.3.3.",null,null,"FOSSA SEPTICA E SUMIDOURO","-",null,1,null,null,null,null,null,""]
["S",3,"S",0,1,3,3,0,0,0,0,"F","Serviço","Serviço","1.3.3.1.","SINAPI",79480,"ESCAVACAO MECANICA CAMPO ABERTO EM SOLO EXCETO ROCHA ATE 2,00M PROFUNDIDADE","M3",22.18,1,null,null,null,null,null,"Referência: AGETOP - 41004"]
["S",3,"S",0,1,3,3,0,0,0,0,"F","Serviço","Serviço","1.3.3.2.","SINAPI",72898,"CARGA E DESCARGA MECANIZADAS DE ENTULHO EM CAMINHAO BASCULANTE 6 M3","M3",22.18,1,null,null,null,null,null,"Referência: AGETOP - 41005"]
["S",3,"S",0,1,3,3,0,0,0,0,"F","Serviço","Serviço","1.3.3.3.","AGETOP",41012,"INDENIZAÇÃO DE JAZIDA","m3    ",22.18,1,null,null,null,null,null,""]
["S",3,"S",0,1,3,3,0,0,0,0,"F","Serviço","Serviço","1.3.3.4.","AGETOP",41006,"TRANSPORTE DE MATERIAL ESCAVADO M3.KM","m3km  ",221.8,1,null,null,null,null,null,""]
["S",3,"S",0,1,3,3,0,0,0,0,"F","Serviço","Serviço","1.3.3.5.","AGETOP",40902,"REATERRO COM APILOAMENTO","m3    ",17.75,1,null,null,null,null,null,""]
["S",3,"S",0,1,3,3,0,0,0,0,"F","Serviço","Serviço","1.3.3.6.","AGETOP",50620,"PEDRA MARROADA COM LANCAMENTO","m3    ",2,1,null,null,null,null,null,""]
[3,3,3,7,1,3,4,0,0,7,262,"F","Nível 3","Nível 3","1.3.4.",null,null,"IMPLANTAÇÃO PADRÃO","-",null,1,null,null,null,null,null,""]
["S",3,"S",0,1,3,4,0,0,0,0,"F","Serviço","Serviço","1.3.4.1.","SINAPI",79480,"ESCAVACAO MECANICA CAMPO ABERTO EM SOLO EXCETO ROCHA ATE 2,00M PROFUNDIDADE","M3",295.97000000000003,1,null,null,null,null,null,"Referência: AGETOP - 41004"]
["S",3,"S",0,1,3,4,0,0,0,0,"F","Serviço","Serviço","1.3.4.2.","SINAPI",72898,"CARGA E DESCARGA MECANIZADAS DE ENTULHO EM CAMINHAO BASCULANTE 6 M3","M3",295.97000000000003,1,null,null,null,null,null,"Referência: AGETOP - 41005"]
["S",3,"S",0,1,3,4,0,0,0,0,"F","Serviço","Serviço","1.3.4.3.","AGETOP",41012,"INDENIZAÇÃO DE JAZIDA","m3    ",295.97000000000003,1,null,null,null,null,null,""]
["S",3,"S",0,1,3,4,0,0,0,0,"F","Serviço","Serviço","1.3.4.4.","AGETOP",41006,"TRANSPORTE DE MATERIAL ESCAVADO M3.KM","m3km  ",2959.7,1,null,null,null,null,null,""]
["S",3,"S",0,1,3,4,0,0,0,0,"F","Serviço","Serviço","1.3.4.5.","SINAPI","74005/1","COMPACTACAO MECANICA, SEM CONTROLE DO GC (C/COMPACTADOR PLACA 400 KG)","M3",236.78,1,null,null,null,null,null,"Referência: AGETOP - 41009"]
["S",3,"S",0,1,3,4,0,0,0,0,"F","Serviço","Serviço","1.3.4.6.","AGETOP",40905,"APILOAMENTO MECÂNICO","m2    ",839.49,1,null,null,null,null,null,""]
[2,2,2,11,1,4,0,0,0,267,11,"F","Nível 2","Nível 2","1.4.","SINAPI",null,"FUNDAÇÕES E SONDAGENS","-",null,1,null,null,null,null,null,""]
[3,3,3,10,1,4,1,0,0,10,20,"F","Nível 3","Nível 3","1.4.1.","SINAPI",null,"ESTACAS E BLOCOS","-",null,1,null,null,null,null,null,""]
["S",3,"S",0,1,4,1,0,0,0,0,"F","Serviço","Serviço","1.4.1.1.","SINAPI",98230,"ESTACA BROCA DE CONCRETO, DIÂMETRO DE 30 CM, PROFUNDIDADE DE ATÉ 3 M, ESCAVAÇÃO MANUAL COM TRADO CONCHA, NÃO ARMADA. AF_03/2018","M",376,1,null,null,null,null,null,"Referência: AGETOP - 50302"]
["S",3,"S",0,1,4,1,0,0,0,0,"F","Serviço","Serviço","1.4.1.2.","SINAPI",96522,"ESCAVAÇÃO MANUAL PARA BLOCO DE COROAMENTO OU SAPATA, SEM PREVISÃO DE FÔRMA. AF_06/2017","M3",14.66,1,null,null,null,null,null,"Referência: AGETOP - 50901"]
["S",3,"S",0,1,4,1,0,0,0,0,"F","Serviço","Serviço","1.4.1.3.","SINAPI",96619,"LASTRO DE CONCRETO MAGRO, APLICADO EM BLOCOS DE COROAMENTO OU SAPATAS, ESPESSURA DE 5 CM. AF_08/2017","M2",1.1299999999999999,1,null,null,null,null,null,""]
["S",3,"S",0,1,4,1,0,0,0,0,"F","Serviço","Serviço","1.4.1.4.","SINAPI",94963,"CONCRETO FCK = 15MPA, TRAÇO 1:3,4:3,5 (CIMENTO/ AREIA MÉDIA/ BRITA 1)  - PREPARO MECÂNICO COM BETONEIRA 400 L. AF_07/2016","M3",13.53,1,null,null,null,null,null,""]
["S",3,"S",0,1,4,1,0,0,0,0,"F","Serviço","Serviço","1.4.1.5.","SINAPI","74157/4","LANCAMENTO/APLICACAO MANUAL DE CONCRETO EM FUNDACOES","M3",14.66,1,null,null,null,null,null,"Referência: AGETOP - 51026"]
["S",3,"S",0,1,4,1,0,0,0,0,"F","Serviço","Serviço","1.4.1.6.","SINAPI",96544,"ARMAÇÃO DE BLOCO, VIGA BALDRAME OU SAPATA UTILIZANDO AÇO CA-50 DE 6,3 MM - MONTAGEM. AF_06/2017","KG",232.2,1,null,null,null,null,null,"Referência: AGETOP - 52003"]
["S",3,"S",0,1,4,1,0,0,0,0,"F","Serviço","Serviço","1.4.1.7.","SINAPI",96545,"ARMAÇÃO DE BLOCO, VIGA BALDRAME OU SAPATA UTILIZANDO AÇO CA-50 DE 8 MM - MONTAGEM. AF_06/2017","KG",447.3,1,null,null,null,null,null,"Referência: AGETOP - 52004"]
["S",3,"S",0,1,4,1,0,0,0,0,"F","Serviço","Serviço","1.4.1.8.","SINAPI",96546,"ARMAÇÃO DE BLOCO, VIGA BALDRAME OU SAPATA UTILIZANDO AÇO CA-50 DE 10 MM - MONTAGEM. AF_06/2017","KG",400.5,1,null,null,null,null,null,"Referência: AGETOP - 52005"]
["S",3,"S",0,1,4,1,0,0,0,0,"F","Serviço","Serviço","1.4.1.9.","SINAPI",96543,"ARMAÇÃO DE BLOCO, VIGA BALDRAME E SAPATA UTILIZANDO AÇO CA-60 DE 5 MM - MONTAGEM. AF_06/2017","KG",145.80000000000001,1,null,null,null,null,null,"Referência: AGETOP - 52014"]
[2,2,2,26,1,5,0,0,0,256,26,"F","Nível 2","Nível 2","1.5.","SINAPI",null,"ESTRUTURA","-",null,1,null,null,null,null,null,""]
[3,3,3,9,1,5,1,0,0,25,9,"F","Nível 3","Nível 3","1.5.1.","SINAPI",null,"VIGAS BALDRAMES","-",null,1,null,null,null,null,null,""]
["S",3,"S",0,1,5,1,0,0,0,0,"F","Serviço","Serviço","1.5.1.1.","SINAPI",96527,"ESCAVAÇÃO MANUAL DE VALA PARA VIGA BALDRAME, COM PREVISÃO DE FÔRMA. AF_06/2017","M3",36.08,1,null,null,null,null,null,"Referência: AGETOP - 40101"]
["S",3,"S",0,1,5,1,0,0,0,0,"F","Serviço","Serviço","1.5.1.2.","SINAPI",96995,"REATERRO MANUAL APILOADO COM SOQUETE. AF_10/2017","M3",21.38,1,null,null,null,null,null,"Referência: AGETOP - 40902"]
["S",3,"S",0,1,5,1,0,0,0,0,"F","Serviço","Serviço","1.5.1.3.","AGETOP",60191,"FORMA DE TABUA CINTA BALDRAME U=8 VEZES","m2    ",217.61,1,null,null,null,null,null,""]
["S",3,"S",0,1,5,1,0,0,0,0,"F","Serviço","Serviço","1.5.1.4.","SINAPI",94964,"CONCRETO FCK = 20MPA, TRAÇO 1:2,7:3 (CIMENTO/ AREIA MÉDIA/ BRITA 1)  - PREPARO MECÂNICO COM BETONEIRA 400 L. AF_07/2016","M3",14.7,1,null,null,null,null,null,""]
["S",3,"S",0,1,5,1,0,0,0,0,"F","Serviço","Serviço","1.5.1.5.","SINAPI",92873,"LANÇAMENTO COM USO DE BALDES, ADENSAMENTO E ACABAMENTO DE CONCRETO EM ESTRUTURAS. AF_12/2015","M3",14.7,1,null,null,null,null,null,"Referência: AGETOP - 60801"]
["S",3,"S",0,1,5,1,0,0,0,0,"F","Serviço","Serviço","1.5.1.6.","SINAPI",96543,"ARMAÇÃO DE BLOCO, VIGA BALDRAME E SAPATA UTILIZANDO AÇO CA-60 DE 5 MM - MONTAGEM. AF_06/2017","KG",328.5,1,null,null,null,null,null,"Referência: AGETOP - 52014"]
["S",3,"S",0,1,5,1,0,0,{"$f":"IF(OR($C83=\"S\",$C83=0),0,MATCH(0,OFFSET($D83,1,$C83,ROW($C$618)-ROW($C83)),0))","v":0},{"$f":"IF(OR($C83=\"S\",$C83=0),0,MATCH(OFFSET($D83,0,$C83)+1,OFFSET($D83,1,$C83,ROW($C$618)-ROW($C83)),0))","v":0},"F","Serviço","Serviço","1.5.1.7.","SINAPI",96545,"ARMAÇÃO DE BLOCO, VIGA BALDRAME OU SAPATA UTILIZANDO AÇO CA-50 DE 8 MM - MONTAGEM. AF_06/2017","KG",591.30000000000007,1,null,null,null,null,null,"Referência: AGETOP - 52004"]
["S",3,"S",0,1,5,1,0,0,0,0,"F","Serviço","Serviço","1.5.1.8.","SINAPI",96546,"ARMAÇÃO DE BLOCO, VIGA BALDRAME OU SAPATA UTILIZANDO AÇO CA-50 DE 10 MM - MONTAGEM. AF_06/2017","KG",21.6,1,null,null,null,null,null,"Referência: AGETOP - 52005"]
[3,3,3,6,1,5,2,0,0,16,6,"F","Nível 3","Nível 3","1.5.2.","SINAPI",null,"PILARES","-",null,1,null,null,null,null,null,""]
["S",3,"S",0,1,5,2,0,0,0,0,"F","Serviço","Serviço","1.5.2.1.","SINAPI",92426,"MONTAGEM E DESMONTAGEM DE FÔRMA DE PILARES RETANGULARES E ESTRUTURAS SIMILARES COM ÁREA MÉDIA DAS SEÇÕES MENOR OU IGUAL A 0,25 M², PÉ-DIREITO SIMPLES, EM CHAPA DE MADEIRA COMPENSADA RESINADA, 8 UTILIZAÇÕES. AF_12/2015","M2",141.86000000000001,1,null,null,null,null,null,""]
["S",3,"S",0,1,5,2,0,0,0,0,"F","Serviço","Serviço","1.5.2.2.","SINAPI",94964,"CONCRETO FCK = 20MPA, TRAÇO 1:2,7:3 (CIMENTO/ AREIA MÉDIA/ BRITA 1)  - PREPARO MECÂNICO COM BETONEIRA 400 L. AF_07/2016","M3",6.77,1,null,null,null,null,null,""]
["S",3,"S",0,1,5,2,0,0,0,0,"F","Serviço","Serviço","1.5.2.3.","SINAPI",92873,"LANÇAMENTO COM USO DE BALDES, ADENSAMENTO E ACABAMENTO DE CONCRETO EM ESTRUTURAS. AF_12/2015","M3",6.77,1,null,null,null,null,null,"Referência: AGETOP - 60801"]
["S",3,"S",0,1,5,2,0,0,0,0,"F","Serviço","Serviço","1.5.2.4.","SINAPI",92778,"ARMAÇÃO DE PILAR OU VIGA DE UMA ESTRUTURA CONVENCIONAL DE CONCRETO ARMADO EM UMA EDIFICAÇÃO TÉRREA OU SOBRADO UTILIZANDO AÇO CA-50 DE 10,0 MM - MONTAGEM. AF_12/2015","KG",415.8,1,null,null,null,null,null,"Referência: AGETOP - 60305"]
["S",3,"S",0,1,5,2,0,0,0,0,"F","Serviço","Serviço","1.5.2.5.","SINAPI",92775,"ARMAÇÃO DE PILAR OU VIGA DE UMA ESTRUTURA CONVENCIONAL DE CONCRETO ARMADO EM UMA EDIFICAÇÃO TÉRREA OU SOBRADO UTILIZANDO AÇO CA-60 DE 5,0 MM - MONTAGEM. AF_12/2015","KG",182.7,1,null,null,null,null,null,"Referência: AGETOP - 60314"]
[3,3,3,8,1,5,3,0,0,10,8,"F","Nível 3","Nível 3","1.5.3.","SINAPI",null,"VIGAS DE COBERTURA","-",null,1,null,null,null,null,null,""]
["S",3,"S",0,1,5,3,0,0,0,0,"F","Serviço","Serviço","1.5.3.1.","SINAPI",92464,"MONTAGEM E DESMONTAGEM DE FÔRMA DE VIGA, ESCORAMENTO METÁLICO, PÉ-DIREITO SIMPLES, EM CHAPA DE MADEIRA RESINADA, 8 UTILIZAÇÕES. AF_12/2015","M2",239.99,1,null,null,null,null,null,"Referência: AGETOP - 60209"]
["S",3,"S",0,1,5,3,0,0,0,0,"F","Serviço","Serviço","1.5.3.2.","SINAPI",94964,"CONCRETO FCK = 20MPA, TRAÇO 1:2,7:3 (CIMENTO/ AREIA MÉDIA/ BRITA 1)  - PREPARO MECÂNICO COM BETONEIRA 400 L. AF_07/2016","M3",14.24,1,null,null,null,null,null,""]
["S",3,"S",0,1,5,3,0,0,0,0,"F","Serviço","Serviço","1.5.3.3.","SINAPI",92873,"LANÇAMENTO COM USO DE BALDES, ADENSAMENTO E ACABAMENTO DE CONCRETO EM ESTRUTURAS. AF_12/2015","M3",14.24,1,null,null,null,null,null,"Referência: AGETOP - 60801"]
["S",3,"S",0,1,5,3,0,0,0,0,"F","Serviço","Serviço","1.5.3.4.","SINAPI",92777,"ARMAÇÃO DE PILAR OU VIGA DE UMA ESTRUTURA CONVENCIONAL DE CONCRETO ARMADO EM UMA EDIFICAÇÃO TÉRREA OU SOBRADO UTILIZANDO AÇO CA-50 DE 8,0 MM - MONTAGEM. AF_12/2015","KG",219.6,1,null,null,null,null,null,"Referência: AGETOP - 60304"]
["S",3,"S",0,1,5,3,0,0,0,0,"F","Serviço","Serviço","1.5.3.5.","SINAPI",92778,"ARMAÇÃO DE PILAR OU VIGA DE UMA ESTRUTURA CONVENCIONAL DE CONCRETO ARMADO EM UMA EDIFICAÇÃO TÉRREA OU SOBRADO UTILIZANDO AÇO CA-50 DE 10,0 MM - MONTAGEM. AF_12/2015","KG",484.2,1,null,null,null,null,null,"Referência: AGETOP - 60305"]
["S",3,"S",0,1,5,3,0,0,0,0,"F","Serviço","Serviço","1.5.3.6.","SINAPI",92779,"ARMAÇÃO DE PILAR OU VIGA DE UMA ESTRUTURA CONVENCIONAL DE CONCRETO ARMADO EM UMA EDIFICAÇÃO TÉRREA OU SOBRADO UTILIZANDO AÇO CA-50 DE 12,5 MM - MONTAGEM. AF_12/2015","KG",176.4,1,null,null,null,null,null,""]
["S",3,"S",0,1,5,3,0,0,0,0,"F","Serviço","Serviço","1.5.3.7.","SINAPI",92775,"ARMAÇÃO DE PILAR OU VIGA DE UMA ESTRUTURA CONVENCIONAL DE CONCRETO ARMADO EM UMA EDIFICAÇÃO TÉRREA OU SOBRADO UTILIZANDO AÇO CA-60 DE 5,0 MM - MONTAGEM. AF_12/2015","KG",225.9,1,null,null,null,null,null,"Referência: AGETOP - 60314"]
[3,3,3,2,1,5,4,0,0,2,220,"F","Nível 3","Nível 3","1.5.4.","SINAPI",null,"LAJE","-",null,1,null,null,null,null,null,""]
["S",3,"S",0,1,5,4,0,0,0,0,"F","Serviço","Serviço","1.5.4.1.","SINAPI","74202/1","LAJE PRE-MOLDADA P/FORRO, SOBRECARGA 100KG/M2, VAOS ATE 3,50M/E=8CM, C/LAJOTAS E CAP.C/CONC FCK=20MPA, 3CM, INTER-EIXO 38CM, C/ESCORAMENTO (REAPR.3X) E FERRAGEM NEGATIVA","M2",433.26,1,null,null,null,null,null,""]
[2,2,2,57,1,6,0,0,0,230,57,"F","Nível 2","Nível 2","1.6.",null,null,"INSTALAÇÕES ELÉTRICAS","-",null,1,null,null,null,null,null,""]
["S",2,"S",0,1,6,0,0,0,0,0,"F","Serviço","Serviço","1.6.0.1.","AGETOP",70351,"BRACADEIRA METALICA TIPO \"U\" DIAM. 3/4\"","Un    ",425,1,null,null,null,null,null,""]
["S",2,"S",0,1,6,0,0,0,0,0,"F","Serviço","Serviço","1.6.0.2.","AGETOP",70352,"BRACADEIRA METALICA TIPO \"U\" DIAM. 1\"","Un    ",150,1,null,null,null,null,null,""]
["S",2,"S",0,1,6,0,0,0,0,0,"F","Serviço","Serviço","1.6.0.3.","AGETOP",70355,"BRACADEIRA METALICA TIPO \"U\" DIAM. 2\"","Un    ",15,1,null,null,null,null,null,""]
["S",2,"S",0,1,6,0,0,0,0,0,"F","Serviço","Serviço","1.6.0.4.","AGETOP",70421,"BUCHA E ARRUELA METALICA DIAM. 3/4\"","PR    ",30,1,null,null,null,null,null,""]
["S",2,"S",0,1,6,0,0,0,0,0,"F","Serviço","Serviço","1.6.0.5.","AGETOP",70422,"BUCHA E ARRUELA METALICA DIAM. 1\"","PR    ",20,1,null,null,null,null,null,""]
["S",2,"S",0,1,6,0,0,0,0,0,"F","Serviço","Serviço","1.6.0.6.","AGETOP",70425,"BUCHA E ARRUELA METALICA DIAM. 2\"","PR    ",4,1,null,null,null,null,null,""]
["S",2,"S",0,1,6,0,0,0,0,0,"F","Serviço","Serviço","1.6.0.7.","SINAPI",92980,"CABO DE COBRE FLEXÍVEL ISOLADO, 10 MM², ANTI-CHAMA 0,6/1,0 KV, PARA DISTRIBUIÇÃO - FORNECIMENTO E INSTALAÇÃO. AF_12/2015","M",6,1,null,null,null,null,null,""]
["S",2,"S",0,1,6,0,0,0,0,0,"F","Serviço","Serviço","1.6.0.8.","SINAPI",92982,"CABO DE COBRE FLEXÍVEL ISOLADO, 16 MM², ANTI-CHAMA 0,6/1,0 KV, PARA DISTRIBUIÇÃO - FORNECIMENTO E INSTALAÇÃO. AF_12/2015","M",10,1,null,null,null,null,null,"Referência: AGETOP - 70510"]
["S",2,"S",0,1,6,0,0,0,0,0,"F","Serviço","Serviço","1.6.0.9.","SINAPI",92984,"CABO DE COBRE FLEXÍVEL ISOLADO, 25 MM², ANTI-CHAMA 0,6/1,0 KV, PARA DISTRIBUIÇÃO - FORNECIMENTO E INSTALAÇÃO. AF_12/2015","M",50,1,null,null,null,null,null,"Referência: AGETOP - 70511"]
["S",2,"S",0,1,6,0,0,0,0,0,"F","Serviço","Serviço","1.6.0.10.","SINAPI",92986,"CABO DE COBRE FLEXÍVEL ISOLADO, 35 MM², ANTI-CHAMA 0,6/1,0 KV, PARA DISTRIBUIÇÃO - FORNECIMENTO E INSTALAÇÃO. AF_12/2015","M",120,1,null,null,null,null,null,"Referência: AGETOP - 70512"]
["S",2,"S",0,1,6,0,0,0,0,0,"F","Serviço","Serviço","1.6.0.11.","SINAPI",96971,"CORDOALHA DE COBRE NU 16 MM², NÃO ENTERRADA, COM ISOLADOR - FORNECIMENTO E INSTALAÇÃO. AF_12/2017","M",12,1,null,null,null,null,null,"Referência: AGETOP - 70541"]
["S",2,"S",0,1,6,0,0,0,0,0,"F","Serviço","Serviço","1.6.0.12.","SINAPI",91927,"CABO DE COBRE FLEXÍVEL ISOLADO, 2,5 MM², ANTI-CHAMA 0,6/1,0 KV, PARA CIRCUITOS TERMINAIS - FORNECIMENTO E INSTALAÇÃO. AF_12/2015","M",2935,1,null,null,null,null,null,"Referência: AGETOP - 70581"]
["S",2,"S",0,1,6,0,0,0,0,0,"F","Serviço","Serviço","1.6.0.13.","SINAPI",91929,"CABO DE COBRE FLEXÍVEL ISOLADO, 4 MM², ANTI-CHAMA 0,6/1,0 KV, PARA CIRCUITOS TERMINAIS - FORNECIMENTO E INSTALAÇÃO. AF_12/2015","M",150,1,null,null,null,null,null,"Referência: AGETOP - 70582"]
["S",2,"S",0,1,6,0,0,0,0,0,"F","Serviço","Serviço","1.6.0.14.","SINAPI",91931,"CABO DE COBRE FLEXÍVEL ISOLADO, 6 MM², ANTI-CHAMA 0,6/1,0 KV, PARA CIRCUITOS TERMINAIS - FORNECIMENTO E INSTALAÇÃO. AF_12/2015","M",790,1,null,null,null,null,null,"Referência: AGETOP - 70583"]
["S",2,"S",0,1,6,0,0,0,0,0,"F","Serviço","Serviço","1.6.0.15.","SINAPI",91933,"CABO DE COBRE FLEXÍVEL ISOLADO, 10 MM², ANTI-CHAMA 0,6/1,0 KV, PARA CIRCUITOS TERMINAIS - FORNECIMENTO E INSTALAÇÃO. AF_12/2015","M",250,1,null,null,null,null,null,"Referência: AGETOP - 70584"]
["S",2,"S",0,1,6,0,0,0,0,0,"F","Serviço","Serviço","1.6.0.16.","SINAPI",92865,"CAIXA OCTOGONAL 4\" X 4\", METÁLICA, INSTALADA EM LAJE - FORNECIMENTO E INSTALAÇÃO. AF_12/2015","UN",80,1,null,null,null,null,null,"Referência: AGETOP - 70682"]
["S",2,"S",0,1,6,0,0,0,0,0,"F","Serviço","Serviço","1.6.0.17.","SINAPI",92868,"CAIXA RETANGULAR 4\" X 2\" MÉDIA (1,30 M DO PISO), METÁLICA, INSTALADA EM PAREDE - FORNECIMENTO E INSTALAÇÃO. AF_12/2015","UN",33,1,null,null,null,null,null,"Referência: AGETOP - 70691"]
["S",2,"S",0,1,6,0,0,0,0,0,"F","Serviço","Serviço","1.6.0.18.","SINAPI",91939,"CAIXA RETANGULAR 4\" X 2\" ALTA (2,00 M DO PISO), PVC, INSTALADA EM PAREDE - FORNECIMENTO E INSTALAÇÃO. AF_12/2015","UN",70,1,null,null,null,null,null,""]
["S",2,"S",0,1,6,0,0,0,0,0,"F","Serviço","Serviço","1.6.0.19.","SINAPI",97892,"CAIXA ENTERRADA ELÉTRICA RETANGULAR, EM ALVENARIA COM BLOCOS DE CONCRETO, FUNDO COM BRITA, DIMENSÕES INTERNAS: 0,6X0,6X0,6 M. AF_05/2018","UN",5,1,null,null,null,null,null,""]
["S",2,"S",0,1,6,0,0,0,0,0,"F","Serviço","Serviço","1.6.0.20.","AGETOP",70720,"CAIXA METÁLICA PARA MEDIDOR POLIFÁSICO PADRÃO ENEL 500X380X166MM","Un    ",1,1,null,null,null,null,null,""]
["S",2,"S",0,1,6,0,0,0,0,0,"F","Serviço","Serviço","1.6.0.21.","AGETOP",70924,"CONDULETE DE PVC - CAIXA COM 5 ENTRADAS ","un    ",43,1,null,null,null,null,null,""]
["S",2,"S",0,1,6,0,0,0,0,0,"F","Serviço","Serviço","1.6.0.22.","AGETOP",70930,"CONDULETE METÁLICO - ADAPTADOR DE SAÍDA 3/4\" ","un    ",166,1,null,null,null,null,null,""]
["S",2,"S",0,1,6,0,0,0,0,0,"F","Serviço","Serviço","1.6.0.23.","SINAPI",91902,"CURVA 90 GRAUS PARA ELETRODUTO, PVC, ROSCÁVEL, DN 25 MM (3/4\"), PARA CIRCUITOS TERMINAIS, INSTALADA EM LAJE - FORNECIMENTO E INSTALAÇÃO. AF_12/2015","UN",40,1,null,null,null,null,null,"Referência: AGETOP - 71141"]
["S",2,"S",0,1,6,0,0,0,0,0,"F","Serviço","Serviço","1.6.0.24.","SINAPI",91905,"CURVA 90 GRAUS PARA ELETRODUTO, PVC, ROSCÁVEL, DN 32 MM (1\"), PARA CIRCUITOS TERMINAIS, INSTALADA EM LAJE - FORNECIMENTO E INSTALAÇÃO. AF_12/2015","UN",15,1,null,null,null,null,null,"Referência: AGETOP - 71142"]
["S",2,"S",0,1,6,0,0,0,0,0,"F","Serviço","Serviço","1.6.0.25.","SINAPI",93653,"DISJUNTOR MONOPOLAR TIPO DIN, CORRENTE NOMINAL DE 10A - FORNECIMENTO E INSTALAÇÃO. AF_04/2016","UN",10,1,null,null,null,null,null,""]
["S",2,"S",0,1,6,0,0,0,0,0,"F","Serviço","Serviço","1.6.0.26.","SINAPI",93020,"CURVA 90 GRAUS PARA ELETRODUTO, PVC, ROSCÁVEL, DN 60 MM (2\") - FORNECIMENTO E INSTALAÇÃO. AF_12/2015","UN",2,1,null,null,null,null,null,""]
["S",2,"S",0,1,6,0,0,0,0,0,"F","Serviço","Serviço","1.6.0.27.","SINAPI",93654,"DISJUNTOR MONOPOLAR TIPO DIN, CORRENTE NOMINAL DE 16A - FORNECIMENTO E INSTALAÇÃO. AF_04/2016","UN",8,1,null,null,null,null,null,""]
["S",2,"S",0,1,6,0,0,0,0,0,"F","Serviço","Serviço","1.6.0.28.","SINAPI",93656,"DISJUNTOR MONOPOLAR TIPO DIN, CORRENTE NOMINAL DE 25A - FORNECIMENTO E INSTALAÇÃO. AF_04/2016","UN",13,1,null,null,null,null,null,""]
["S",2,"S",0,1,6,0,0,0,0,0,"F","Serviço","Serviço","1.6.0.29.","SINAPI",93657,"DISJUNTOR MONOPOLAR TIPO DIN, CORRENTE NOMINAL DE 32A - FORNECIMENTO E INSTALAÇÃO. AF_04/2016","UN",1,1,null,null,null,null,null,""]
["S",2,"S",0,1,6,0,0,0,0,0,"F","Serviço","Serviço","1.6.0.30.","SINAPI",93673,"DISJUNTOR TRIPOLAR TIPO DIN, CORRENTE NOMINAL DE 50A - FORNECIMENTO E INSTALAÇÃO. AF_04/2016","UN",4,1,null,null,null,null,null,"Referência: AGETOP - 71174"]
["S",2,"S",0,1,6,0,0,0,0,0,"F","Serviço","Serviço","1.6.0.31.","SINAPI","74130/5","DISJUNTOR TERMOMAGNETICO TRIPOLAR PADRAO NEMA (AMERICANO) 60 A 100A 240V, FORNECIMENTO E INSTALACAO","UN",2,1,null,null,null,null,null,""]
["S",2,"S",0,1,6,0,0,0,0,0,"F","Serviço","Serviço","1.6.0.32.","AGETOP",71184,"DISPOSITIVO DE PROTEÇÃO CONTRA SURTOS (D.P.S.) 275V DE 8 A 40KA","Un    ",3,1,null,null,null,null,null,""]
["S",2,"S",0,1,6,0,0,0,0,0,"F","Serviço","Serviço","1.6.0.33.","SINAPI",91844,"ELETRODUTO FLEXÍVEL CORRUGADO, PVC, DN 25 MM (3/4\"), PARA CIRCUITOS TERMINAIS, INSTALADO EM LAJE - FORNECIMENTO E INSTALAÇÃO. AF_12/2015","M",865,1,null,null,null,null,null,""]
["S",2,"S",0,1,6,0,0,0,0,0,"F","Serviço","Serviço","1.6.0.34.","SINAPI",91846,"ELETRODUTO FLEXÍVEL CORRUGADO, PVC, DN 32 MM (1\"), PARA CIRCUITOS TERMINAIS, INSTALADO EM LAJE - FORNECIMENTO E INSTALAÇÃO. AF_12/2015","M",300,1,null,null,null,null,null,""]
["S",2,"S",0,1,6,0,0,0,0,0,"F","Serviço","Serviço","1.6.0.35.","SINAPI",93009,"ELETRODUTO RÍGIDO ROSCÁVEL, PVC, DN 60 MM (2\") - FORNECIMENTO E INSTALAÇÃO. AF_12/2015","M",30,1,null,null,null,null,null,""]
["S",2,"S",0,1,6,0,0,0,0,0,"F","Serviço","Serviço","1.6.0.36.","AGETOP",71215,"ELETRODUTO EM AÇO GALVANIZADO A FOGO DIÂMETRO 2\" - PESADO ","M     ",6,1,null,null,null,null,null,""]
["S",2,"S",0,1,6,0,0,0,0,0,"F","Serviço","Serviço","1.6.0.37.","AGETOP",71321,"FITA DE AUTO FUSAO, ROLO E 10,00 MM","Un    ",2,1,null,null,null,null,null,""]
["S",2,"S",0,1,6,0,0,0,0,0,"F","Serviço","Serviço","1.6.0.38.","AGETOP",71331,"FITA ISOLANTE, ROLO DE 20,00 M","Un    ",10,1,null,null,null,null,null,""]
["S",2,"S",0,1,6,0,0,0,0,0,"F","Serviço","Serviço","1.6.0.39.","AGETOP",71381,"HASTE REV.COBRE(COPPERWELD)  5/8\" X 3,00 M C/CONECTOR","Un    ",3,1,null,null,null,null,null,""]
["S",2,"S",0,1,6,0,0,0,0,0,"F","Serviço","Serviço","1.6.0.40.","SINAPI",91955,"INTERRUPTOR PARALELO (1 MÓDULO), 10A/250V, INCLUINDO SUPORTE E PLACA - FORNECIMENTO E INSTALAÇÃO. AF_12/2015","UN",2,1,null,null,null,null,null,"Referência: AGETOP - 71431"]
["S",2,"S",0,1,6,0,0,0,0,0,"F","Serviço","Serviço","1.6.0.41.","SINAPI",91953,"INTERRUPTOR SIMPLES (1 MÓDULO), 10A/250V, INCLUINDO SUPORTE E PLACA - FORNECIMENTO E INSTALAÇÃO. AF_12/2015","UN",15,1,null,null,null,null,null,"Referência: AGETOP - 71440"]
["S",2,"S",0,1,6,0,0,0,0,0,"F","Serviço","Serviço","1.6.0.42.","SINAPI",97610,"LÂMPADA COMPACTA DE LED 10 W, BASE E27 - FORNECIMENTO E INSTALAÇÃO. AF_11/2017","UN",4,1,null,null,null,null,null,""]
["S",2,"S",0,1,6,0,0,0,0,0,"F","Serviço","Serviço","1.6.0.43.","COMPOSIÇÃO","COMP 387_SEE","LÂMPADA LED TUBULAR 18W ","UN ",218,1,null,null,null,null,null,""]
["S",2,"S",0,1,6,0,0,0,0,0,"F","Serviço","Serviço","1.6.0.44.","SINAPI",97585,"LUMINÁRIA TIPO CALHA, DE SOBREPOR, COM 2 LÂMPADAS TUBULARES DE 18 W - FORNECIMENTO E INSTALAÇÃO. AF_11/2017","UN",109,1,null,null,null,null,null,""]
["S",2,"S",0,1,6,0,0,0,0,0,"F","Serviço","Serviço","1.6.0.45.","SINAPI",97593,"LUMINÁRIA TIPO SPOT, DE SOBREPOR, COM 1 LÂMPADA DE 15 W - FORNECIMENTO E INSTALAÇÃO. AF_11/2017","UN",4,1,null,null,null,null,null,"Referência: AGETOP - 71688"]
["S",2,"S",0,1,6,0,0,0,{"$f":"IF(OR($C147=\"S\",$C147=0),0,MATCH(0,OFFSET($D147,1,$C147,ROW($C$618)-ROW($C147)),0))","v":0},{"$f":"IF(OR($C147=\"S\",$C147=0),0,MATCH(OFFSET($D147,0,$C147)+1,OFFSET($D147,1,$C147,ROW($C$618)-ROW($C147)),0))","v":0},"F","Serviço","Serviço","1.6.0.46.","SINAPI",93014,"LUVA PARA ELETRODUTO, PVC, ROSCÁVEL, DN 60 MM (2\") - FORNECIMENTO E INSTALAÇÃO. AF_12/2015","UN",14,1,null,null,null,null,null,"Referência: AGETOP - 71745"]
["S",2,"S",0,1,6,0,0,0,0,0,"F","Serviço","Serviço","1.6.0.47.","AGETOP",71824,"PADRÃO TRIFASICO 35 MM H=7 METROS","Un    ",1,1,null,null,null,null,null,""]
["S",2,"S",0,1,6,0,0,0,0,0,"F","Serviço","Serviço","1.6.0.48.","SINAPI","74131/5","QUADRO DE DISTRIBUICAO DE ENERGIA DE EMBUTIR, EM CHAPA METALICA, PARA 24 DISJUNTORES TERMOMAGNETICOS MONOPOLARES, COM BARRAMENTO TRIFASICO E NEUTRO, FORNECIMENTO E INSTALACAO","UN",1,1,null,null,null,null,null,""]
["S",2,"S",0,1,6,0,0,0,0,0,"F","Serviço","Serviço","1.6.0.49.","SINAPI","74131/6","QUADRO DE DISTRIBUICAO DE ENERGIA DE EMBUTIR, EM CHAPA METALICA, PARA 32 DISJUNTORES TERMOMAGNETICOS MONOPOLARES, COM BARRAMENTO TRIFASICO E NEUTRO, FORNECIMENTO E INSTALACAO","UN",1,1,null,null,null,null,null,"Referência: AGETOP - 72198"]
["S",2,"S",0,1,6,0,0,0,0,0,"F","Serviço","Serviço","1.6.0.50.","AGETOP",72425,"TAMPA CEGA PLASTICA RETANGULAR 4\"X2\"","Un    ",36,1,null,null,null,null,null,""]
["S",2,"S",0,1,6,0,0,0,0,0,"F","Serviço","Serviço","1.6.0.51.","SINAPI",91996,"TOMADA MÉDIA DE EMBUTIR (1 MÓDULO), 2P+T 10 A, INCLUINDO SUPORTE E PLACA - FORNECIMENTO E INSTALAÇÃO. AF_12/2015","UN",10,1,null,null,null,null,null,"Referência: AGETOP - 72578"]
["S",2,"S",0,1,6,0,0,0,0,0,"F","Serviço","Serviço","1.6.0.52.","SINAPI",92000,"TOMADA BAIXA DE EMBUTIR (1 MÓDULO), 2P+T 10 A, INCLUINDO SUPORTE E PLACA - FORNECIMENTO E INSTALAÇÃO. AF_12/2015","UN",9,1,null,null,null,null,null,"Referência: AGETOP - 72578"]
["S",2,"S",0,1,6,0,0,0,0,0,"F","Serviço","Serviço","1.6.0.53.","SINAPI",91992,"TOMADA ALTA DE EMBUTIR (1 MÓDULO), 2P+T 10 A, INCLUINDO SUPORTE E PLACA - FORNECIMENTO E INSTALAÇÃO. AF_12/2015","UN",9,1,null,null,null,null,null,""]
["S",2,"S",0,1,6,0,0,0,0,0,"F","Serviço","Serviço","1.6.0.54.","SINAPI",98111,"CAIXA DE INSPEÇÃO PARA ATERRAMENTO, CIRCULAR, EM POLIETILENO, DIÂMETRO INTERNO = 0,3 M. AF_05/2018","UN",1,1,null,null,null,null,null,""]
["S",2,"S",0,1,6,0,0,0,0,0,"F","Serviço","Serviço","1.6.0.55.","AGETOP",70255,"ATERRAMENTO - SOLDA EXOTÉRMICA - CARTUCHO 90 G","un    ",3,1,null,null,null,null,null,""]
["S",2,"S",0,1,6,0,0,0,0,0,"F","Serviço","Serviço","1.6.0.56.","AGETOP",72080,"POSTE/TRAFO - CAMINHÃO MUNCK 12 TON. (MÍNIMO 4H/DIA)","H     ",4,1,null,null,null,null,null,""]
[2,2,2,90,1,7,0,0,0,173,90,"F","Nível 2","Nível 2","1.7.","AGETOP",null,"INSTALAÇÕES HIDROSSANITÁRIAS","-",null,1,null,null,null,null,null,""]
[3,3,3,50,1,7,1,0,0,89,50,"F","Nível 3","Nível 3","1.7.1.","SINAPI",null,"PEÇAS E ACESSÓRIOS","-",null,1,null,null,null,null,null,""]
["S",3,"S",0,1,7,1,0,0,0,0,"F","Serviço","Serviço","1.7.1.1.","SINAPI",95470,"VASO SANITARIO SIFONADO CONVENCIONAL COM LOUÇA BRANCA, INCLUSO CONJUNTO DE LIGAÇÃO PARA BACIA SANITÁRIA AJUSTÁVEL - FORNECIMENTO E INSTALAÇÃO. AF_10/2016","UN",6,1,null,null,null,null,null,""]
["S",3,"S",0,1,7,1,0,0,0,0,"F","Serviço","Serviço","1.7.1.2.","AGETOP",80511,"CAIXA DE DESCARGA EXTERNA","Un    ",6,1,null,null,null,null,null,""]
["S",3,"S",0,1,7,1,0,0,0,0,"F","Serviço","Serviço","1.7.1.3.","AGETOP",80510,"ANEL DE VEDAÇÃO PARA VASO SANITÁRIO","Un    ",6,1,null,null,null,null,null,""]
["S",3,"S",0,1,7,1,0,0,0,0,"F","Serviço","Serviço","1.7.1.4.","AGETOP",80512,"TUBO DE DESCIDA PARA CAIXA DE DESCARGA ( LONGO 1 1/4\" )","Un    ",6,1,null,null,null,null,null,""]
["S",3,"S",0,1,7,1,0,0,0,0,"F","Serviço","Serviço","1.7.1.5.","AGETOP",80520,"CONJUNTO DE FIXACAO P/VASO SANITARIO (PAR)","CJ    ",6,1,null,null,null,null,null,""]
["S",3,"S",0,1,7,1,0,0,0,0,"F","Serviço","Serviço","1.7.1.6.","AGETOP",80526,"ASSENTO EM POLIPROPILENO COM SISTEMA DE FECHAMENTO SUAVE PARA VASO SANITÁRIO","Un    ",6,1,null,null,null,null,null,""]
["S",3,"S",0,1,7,1,0,0,0,0,"F","Serviço","Serviço","1.7.1.7.","SINAPI",95544,"PAPELEIRA DE PAREDE EM METAL CROMADO SEM TAMPA, INCLUSO FIXAÇÃO. AF_10/2016","UN",6,1,null,null,null,null,null,""]
["S",3,"S",0,1,7,1,0,0,0,0,"F","Serviço","Serviço","1.7.1.8.","AGETOP",80686,"CUBA INOX 56X34X17CM E=0,6MM-AÇO 304 (CUBA Nº2)","Un    ",2,1,null,null,null,null,null,""]
["S",3,"S",0,1,7,1,0,0,0,0,"F","Serviço","Serviço","1.7.1.9.","SINAPI",86912,"TORNEIRA CROMADA LONGA, DE PAREDE, 1/2\" OU 3/4\", PARA PIA DE COZINHA, PADRÃO MÉDIO - FORNECIMENTO E INSTALAÇÃO. AF_12/2013","UN",3,1,null,null,null,null,null,""]
["S",3,"S",0,1,7,1,0,0,0,0,"F","Serviço","Serviço","1.7.1.10.","AGETOP",80693,"TANQUE (PANELAO) INOX 60 X 70 X 40 CM CH.18","Un    ",1,1,null,null,null,null,null,""]
["S",3,"S",0,1,7,1,0,0,0,0,"F","Serviço","Serviço","1.7.1.11.","SINAPI",86881,"SIFÃO DO TIPO GARRAFA EM METAL CROMADO 1 X 1.1/2\" - FORNECIMENTO E INSTALAÇÃO. AF_12/2013","UN",3,1,null,null,null,null,null,"Referência: AGETOP - 80670"]
["S",3,"S",0,1,7,1,0,0,0,0,"F","Serviço","Serviço","1.7.1.12.","SINAPI",86878,"VÁLVULA EM METAL CROMADO TIPO AMERICANA 3.1/2\" X 1.1/2\" PARA PIA - FORNECIMENTO E INSTALAÇÃO. AF_12/2013","UN",3,1,null,null,null,null,null,""]
["S",3,"S",0,1,7,1,0,0,0,0,"F","Serviço","Serviço","1.7.1.13.","SINAPI",95543,"PORTA TOALHA BANHO EM METAL CROMADO, TIPO BARRA, INCLUSO FIXAÇÃO. AF_10/2016","UN",4,1,null,null,null,null,null,""]
["S",3,"S",0,1,7,1,0,0,0,0,"F","Serviço","Serviço","1.7.1.14.","SINAPI",88571,"SABONETEIRA DE SOBREPOR (FIXADA NA PAREDE), TIPO CONCHA, EM ACO INOXIDAVEL - FORNECIMENTO E INSTALACAO","UN",4,1,null,null,null,null,null,"Referência: AGETOP - 80741"]
["S",3,"S",0,1,7,1,0,0,0,0,"F","Serviço","Serviço","1.7.1.15.","AGETOP",80903,"REGISTRO DE GAVETA BRUTO DIAMETRO 1\"","Un    ",1,1,null,null,null,null,null,""]
["S",3,"S",0,1,7,1,0,0,0,0,"F","Serviço","Serviço","1.7.1.16.","AGETOP",80981,"REGISTRO DE ESFERA DIAMETRO 2.1/2\"","Un    ",1,1,null,null,null,null,null,""]
["S",3,"S",0,1,7,1,0,0,0,0,"F","Serviço","Serviço","1.7.1.17.","SINAPI",89447,"TUBO, PVC, SOLDÁVEL, DN 32MM, INSTALADO EM PRUMADA DE ÁGUA - FORNECIMENTO E INSTALAÇÃO. AF_12/2014","M",72,1,null,null,null,null,null,""]
["S",3,"S",0,1,7,1,0,0,0,0,"F","Serviço","Serviço","1.7.1.18.","SINAPI",89451,"TUBO, PVC, SOLDÁVEL, DN 75MM, INSTALADO EM PRUMADA DE ÁGUA - FORNECIMENTO E INSTALAÇÃO. AF_12/2014","M",78,1,null,null,null,null,null,""]
["S",3,"S",0,1,7,1,0,0,0,0,"F","Serviço","Serviço","1.7.1.19.","SINAPI",89553,"ADAPTADOR CURTO COM BOLSA E ROSCA PARA REGISTRO, PVC, SOLDÁVEL, DN 32MM X 1\u0094, INSTALADO EM PRUMADA DE ÁGUA - FORNECIMENTO E INSTALAÇÃO. AF_12/2014","UN",4,1,null,null,null,null,null,"Referência: AGETOP - 81067"]
["S",3,"S",0,1,7,1,0,0,0,0,"F","Serviço","Serviço","1.7.1.20.","SINAPI",89613,"ADAPTADOR CURTO COM BOLSA E ROSCA PARA REGISTRO, PVC, SOLDÁVEL, DN 75MM X 2.1/2\u0094, INSTALADO EM PRUMADA DE ÁGUA - FORNECIMENTO E INSTALAÇÃO. AF_12/2014","UN",4,1,null,null,null,null,null,"Referência: AGETOP - 81071"]
["S",3,"S",0,1,7,1,0,0,0,0,"F","Serviço","Serviço","1.7.1.21.","SINAPI",89579,"LUVA DE REDUÇÃO, PVC, SOLDÁVEL, DN 50MM X 25MM, INSTALADO EM PRUMADA DE ÁGUA   FORNECIMENTO E INSTALAÇÃO. AF_12/2014","UN",4,1,null,null,null,null,null,""]
["S",3,"S",0,1,7,1,0,0,0,0,"F","Serviço","Serviço","1.7.1.22.","AGETOP",81180,"BUCHA DE REDUCAO SOLDAVEL LONGA 50 X 32 mm","Un    ",4,1,null,null,null,null,null,""]
["S",3,"S",0,1,7,1,0,0,0,0,"F","Serviço","Serviço","1.7.1.23.","AGETOP",81185,"BUCHA DE REDUÇÃO SOLDÁVEL LONGA 75 X 50 MM","un    ",4,1,null,null,null,null,null,""]
["S",3,"S",0,1,7,1,0,0,0,0,"F","Serviço","Serviço","1.7.1.24.","AGETOP",81501,"ADESIVO PLASTICO - FRASCO 850 G","Un    ",7,1,null,null,null,null,null,""]
["S",3,"S",0,1,7,1,0,0,0,0,"F","Serviço","Serviço","1.7.1.25.","AGETOP",81504,"SOLUCAO LIMPADORA 1000 CM3","Un    ",7,1,null,null,null,null,null,""]
["S",3,"S",0,1,7,1,0,0,0,0,"F","Serviço","Serviço","1.7.1.26.","AGETOP",81663,"CORPO CX. SIFONADA DIAM. 150 X 150 X 50","Un    ",3,1,null,null,null,null,null,""]
["S",3,"S",0,1,7,1,0,0,0,0,"F","Serviço","Serviço","1.7.1.27.","AGETOP",81679,"CORPO RALO SIFONADO CONICO DIAM. 100 X 40","Un    ",1,1,null,null,null,null,null,""]
["S",3,"S",0,1,7,1,0,0,0,0,"F","Serviço","Serviço","1.7.1.28.","AGETOP",81702,"CURVA 45 GRAUS DIAMETRO 100 MM","Un    ",2,1,null,null,null,null,null,""]
["S",3,"S",0,1,7,1,0,0,0,0,"F","Serviço","Serviço","1.7.1.29.","AGETOP",81730,"CURVA 90 GRAUS CURTA DIAM. 40 MM","Un    ",5,1,null,null,null,null,null,""]
["S",3,"S",0,1,7,1,0,0,0,0,"F","Serviço","Serviço","1.7.1.30.","SINAPI",89802,"JOELHO 45 GRAUS, PVC, SERIE NORMAL, ESGOTO PREDIAL, DN 50 MM, JUNTA ELÁSTICA, FORNECIDO E INSTALADO EM PRUMADA DE ESGOTO SANITÁRIO OU VENTILAÇÃO. AF_12/2014","UN",2,1,null,null,null,null,null,""]
["S",3,"S",0,1,7,1,0,0,0,0,"F","Serviço","Serviço","1.7.1.31.","SINAPI",89810,"JOELHO 45 GRAUS, PVC, SERIE NORMAL, ESGOTO PREDIAL, DN 100 MM, JUNTA ELÁSTICA, FORNECIDO E INSTALADO EM PRUMADA DE ESGOTO SANITÁRIO OU VENTILAÇÃO. AF_12/2014","UN",2,1,null,null,null,null,null,""]
["S",3,"S",0,1,7,1,0,0,0,0,"F","Serviço","Serviço","1.7.1.32.","SINAPI",89731,"JOELHO 90 GRAUS, PVC, SERIE NORMAL, ESGOTO PREDIAL, DN 50 MM, JUNTA ELÁSTICA, FORNECIDO E INSTALADO EM RAMAL DE DESCARGA OU RAMAL DE ESGOTO SANITÁRIO. AF_12/2014","UN",5,1,null,null,null,null,null,""]
["S",3,"S",0,1,7,1,0,0,0,0,"F","Serviço","Serviço","1.7.1.33.","AGETOP",81973,"JUNCAO SIMPLES DIAM. 100 X 50 MM","Un    ",3,1,null,null,null,null,null,""]
["S",3,"S",0,1,7,1,0,0,0,0,"F","Serviço","Serviço","1.7.1.34.","SINAPI",89797,"JUNÇÃO SIMPLES, PVC, SERIE NORMAL, ESGOTO PREDIAL, DN 100 X 100 MM, JUNTA ELÁSTICA, FORNECIDO E INSTALADO EM RAMAL DE DESCARGA OU RAMAL DE ESGOTO SANITÁRIO. AF_12/2014","UN",7,1,null,null,null,null,null,"Referência: AGETOP - 81975"]
["S",3,"S",0,1,7,1,0,0,0,0,"F","Serviço","Serviço","1.7.1.35.","AGETOP",82103,"REDUCAO EXCENTRICA 100 X 50 MM","Un    ",3,1,null,null,null,null,null,""]
["S",3,"S",0,1,7,1,0,0,0,0,"F","Serviço","Serviço","1.7.1.36.","SINAPI",89825,"TE, PVC, SERIE NORMAL, ESGOTO PREDIAL, DN 50 X 50 MM, JUNTA ELÁSTICA, FORNECIDO E INSTALADO EM PRUMADA DE ESGOTO SANITÁRIO OU VENTILAÇÃO. AF_12/2014","UN",4,1,null,null,null,null,null,""]
["S",3,"S",0,1,7,1,0,0,0,0,"F","Serviço","Serviço","1.7.1.37.","SINAPI",89711,"TUBO PVC, SERIE NORMAL, ESGOTO PREDIAL, DN 40 MM, FORNECIDO E INSTALADO EM RAMAL DE DESCARGA OU RAMAL DE ESGOTO SANITÁRIO. AF_12/2014","M",12,1,null,null,null,null,null,"Referência: AGETOP - 82301"]
["S",3,"S",0,1,7,1,0,0,0,0,"F","Serviço","Serviço","1.7.1.38.","SINAPI",89798,"TUBO PVC, SERIE NORMAL, ESGOTO PREDIAL, DN 50 MM, FORNECIDO E INSTALADO EM PRUMADA DE ESGOTO SANITÁRIO OU VENTILAÇÃO. AF_12/2014","M",24,1,null,null,null,null,null,""]
["S",3,"S",0,{"$f":"IF($C198=1,OFFSET(E198,-1,0)+1,OFFSET(E198,-1,0))","v":1},{"$f":"IF($C198=1,0,IF($C198=2,OFFSET(F198,-1,0)+1,OFFSET(F198,-1,0)))","v":7},{"$f":"IF(AND($C198<=2,$C198<>0),0,IF($C198=3,OFFSET(G198,-1,0)+1,OFFSET(G198,-1,0)))","v":1},{"$f":"IF(AND($C198<=3,$C198<>0),0,IF($C198=4,OFFSET(H198,-1,0)+1,OFFSET(H198,-1,0)))","v":0},0,0,0,"F","Serviço","Serviço","1.7.1.39.","SINAPI",89800,"TUBO PVC, SERIE NORMAL, ESGOTO PREDIAL, DN 100 MM, FORNECIDO E INSTALADO EM PRUMADA DE ESGOTO SANITÁRIO OU VENTILAÇÃO. AF_12/2014","M",156,1,null,null,null,null,null,""]
[{"$f":"CHOOSE(1+LOG(1+2*(ORÇAMENTO.Nivel=\"Nível 1\")+4*(ORÇAMENTO.Nivel=\"Nível 2\")+8*(ORÇAMENTO.Nivel=\"Nível 3\")+16*(ORÇAMENTO.Nivel=\"Nível 4\")+32*(ORÇAMENTO.Nivel=\"Serviço\"),2),0,1,2,3,4,\"S\")","v":"S"},3,"S",0,1,7,1,0,{"$f":"IF(AND($C199<=4,$C199<>0),0,IF(AND($C199=\"S\",$Y199>0),OFFSET(I199,-1,0)+1,OFFSET(I199,-1,0)))","v":0},0,0,"F","Serviço","Serviço","1.7.1.40.","SINAPI",95674,"HIDRÔMETRO DN 20 (½\u0094), 3,0 M³/H \u0096 FORNECIMENTO E INSTALAÇÃO. AF_11/2016","UN",1,1,null,null,null,null,null,"Referência: AGETOP - 81811"]
["S",3,"S",0,1,7,1,0,0,0,0,"F","Serviço","Serviço","1.7.1.41.","AGETOP",81815,"KIT CAVALETE D=25MM P/HIDRÔMETRO 1,5-3,0-5,0 M3/MURETA/CAIXA","Un    ",1,1,null,null,null,null,null,""]
["S",3,"S",0,1,7,1,0,0,0,0,"F","Serviço","Serviço","1.7.1.42.","AGETOP",81825,"CAIXA DE PASSAGEM 60 X 60 CM SEM TAMPA","Un    ",9,1,null,null,null,null,null,""]
["S",3,"S",0,1,7,1,0,0,0,0,"F","Serviço","Serviço","1.7.1.43.","AGETOP",81826,"TAMPA EM CONCRETO ARMADO 25 MPA E=5CM PARA A CAIXA DE PASSAGEM 60X60CM","Un    ",9,1,null,null,null,null,null,""]
["S",3,"S",0,1,7,1,0,0,0,0,"F","Serviço","Serviço","1.7.1.44.","AGETOP",81827,"CAIXA DE AREIA 60X60CM FUNDO DE BRITA SEM TAMPA","Un    ",2,1,null,null,null,null,null,""]
["S",3,"S",0,1,7,1,0,0,0,0,"F","Serviço","Serviço","1.7.1.45.","AGETOP",70716,"CAIXA DE PASSAGEM 80X80X110 CM FUNDO DE BRITA SEM TAMPA","Un    ",1,1,null,null,null,null,null,""]
["S",3,"S",0,1,7,1,0,0,0,0,"F","Serviço","Serviço","1.7.1.46.","AGETOP",81835,"CAIXA DE AREIA - TAMPA EM GRELHA DE CONCRETO ARMADO 25MPA E=5CM","m2    ",3,1,null,null,null,null,null,""]
["S",3,"S",0,1,7,1,0,0,0,0,"F","Serviço","Serviço","1.7.1.47.","SINAPI",94798,"TORNEIRA DE BOIA, ROSCÁVEL, 1 1/4\u0094 , FORNECIDA E INSTALADA EM RESERVAÇÃO DE ÁGUA. AF_06/2016","UN",1,1,null,null,null,null,null,""]
["S",3,"S",0,1,7,1,0,0,0,0,"F","Serviço","Serviço","1.7.1.48.","AGETOP",81869,"FOSSA SEPTICA 8700 LITROS COM IMPERMEABILIZAÇÃO","Un    ",1,1,null,null,null,null,null,""]
["S",3,"S",0,1,7,1,0,0,0,0,"F","Serviço","Serviço","1.7.1.49.","AGETOP",81874,"SUMIDOURO COM DIÂMETRO=1,60M E  PROFUNDIDADE=4,50 M","Un    ",1,1,null,null,null,null,null,""]
[3,3,3,39,1,7,2,0,0,39,86,"F","Nível 3","Nível 3","1.7.2.","SINAPI",94798,"INSTALAÇÕES DE INCÊNDIO","UN",1,1,null,null,null,null,null,""]
["S",3,"S",0,1,7,2,0,0,0,0,"F","Serviço","Serviço","1.7.2.1.","COMPOSIÇÃO","COMP 040_SEE","CONJUNTO MOTOR-BOMBA ELÉTRICA TRIFÁSICO 380/220 V PARA VZ= 24,33 M³/H, HM= 46,24 M POTÊNCIA= 7,5 CV","UN ",1,1,null,null,null,null,null,""]
["S",3,"S",0,1,7,2,0,0,{"$f":"IF(OR($C211=\"S\",$C211=0),0,MATCH(0,OFFSET($D211,1,$C211,ROW($C$618)-ROW($C211)),0))","v":0},{"$f":"IF(OR($C211=\"S\",$C211=0),0,MATCH(OFFSET($D211,0,$C211)+1,OFFSET($D211,1,$C211,ROW($C$618)-ROW($C211)),0))","v":0},"F","Serviço","Serviço","1.7.2.2.","AGETOP",72338,"SIRENE METALICA ALCANCE 500 M","Un    ",2,1,null,null,null,null,null,""]
["S",3,"S",0,1,7,2,0,0,0,0,"F","Serviço","Serviço","1.7.2.3.","AGETOP",81883,"RES.METALICO TAÇA AÇO PATINÁVEL-V=20M3-COL.SEC.H=6M+FUNDAÇÃO+LOGOTIPO","un    ",1,1,null,null,null,null,null,""]
["S",3,"S",0,1,7,2,0,0,0,0,"F","Serviço","Serviço","1.7.2.4.","AGETOP",80903,"REGISTRO DE GAVETA BRUTO DIAMETRO 1\"","Un    ",1,1,null,null,null,null,null,""]
["S",3,"S",0,1,7,2,0,0,0,0,"F","Serviço","Serviço","1.7.2.5.","AGETOP",80910,"REGISTRO DE GAVETA BRUTO DIAMETRO 2.1/2\"","Un    ",3,1,null,null,null,null,null,""]
["S",3,"S",0,1,7,2,0,0,0,0,"F","Serviço","Serviço","1.7.2.6.","AGETOP",82379,"TUBO FERRO GALVANIZADO DIAM.2.1/2\"","m     ",204,1,null,null,null,null,null,""]
["S",3,"S",0,1,7,2,0,0,0,0,"F","Serviço","Serviço","1.7.2.7.","AGETOP",85003,"EXTINTOR PO QUIMICO SECO (6 KG) - CAPACIDADE EXTINTORA 20 BC","Un    ",2,1,null,null,null,null,null,""]
["S",3,"S",0,1,7,2,0,0,0,0,"F","Serviço","Serviço","1.7.2.8.","AGETOP",85006,"EXTINTOR MULTI USO EM PO A B C (6 KG) - CAPACIDADE EXTINTORA 3A 20BC","un    ",8,1,null,null,null,null,null,""]
["S",3,"S",0,1,7,2,0,0,0,0,"F","Serviço","Serviço","1.7.2.9.","AGETOP",85001,"EXTINTOR CO2 (6 KG) - CAPACIDADE EXTINTORA 5 BC","Un    ",1,1,null,null,null,null,null,""]
["S",3,"S",0,1,7,2,0,0,0,0,"F","Serviço","Serviço","1.7.2.10.","AGETOP",85011,"CAIXA DE INCÊNDIO METÁLICA COM SUPORTE PARA MANGUEIRA, TAMPA E MURETA 17X60X90 CM C/PINTURA","Un    ",4,1,null,null,null,null,null,""]
["S",3,"S",0,1,7,2,0,0,0,0,"F","Serviço","Serviço","1.7.2.11.","AGETOP",85017,"MANGUEIRA DE INCÊNDIO D.I. = 38 MM TIPO 2 COMP. = 15 M","CJ    ",8,1,null,null,null,null,null,""]
["S",3,"S",0,1,7,2,0,0,0,0,"F","Serviço","Serviço","1.7.2.12.","AGETOP",85025,"ESGUICHO REGULÁVEL 1.1/2\"","Un    ",4,1,null,null,null,null,null,""]
["S",3,"S",0,1,7,2,0,0,0,0,"F","Serviço","Serviço","1.7.2.13.","AGETOP",85027,"ADAPTADOR P/ENGATE STORZ 2.1/2\" X 1.1/2\"","Un    ",5,1,null,null,null,null,null,""]
["S",3,"S",0,1,7,2,0,0,0,0,"F","Serviço","Serviço","1.7.2.14.","AGETOP",85031,"REGISTRO GLOBO ANGULAR 2.1/2\"","Un    ",4,1,null,null,null,null,null,""]
["S",3,"S",0,1,7,2,0,0,0,0,"F","Serviço","Serviço","1.7.2.15.","AGETOP",85035,"TAMPÃO CEGO COM CORRENTE 2.1/2\"","Un    ",5,1,null,null,null,null,null,""]
["S",3,"S",0,1,7,2,0,0,0,0,"F","Serviço","Serviço","1.7.2.16.","AGETOP",85037,"TANQUE DE PRESSÃO DE 10 L","Un    ",1,1,null,null,null,null,null,""]
["S",3,"S",0,1,7,2,0,0,0,0,"F","Serviço","Serviço","1.7.2.17.","AGETOP",85039,"PRESSOSTATO 50 A 80 PSI","Un    ",1,1,null,null,null,null,null,""]
["S",3,"S",0,1,7,2,0,0,0,0,"F","Serviço","Serviço","1.7.2.18.","AGETOP",85041,"MANOMETRO - 0 A 10 KG/CM2","Un    ",1,1,null,null,null,null,null,""]
["S",3,"S",0,1,7,2,0,0,0,0,"F","Serviço","Serviço","1.7.2.19.","AGETOP",85047,"NIPLE DUPLO FERRO GALVANIZADO 2.1/2\"","Un    ",15,1,null,null,null,null,null,""]
["S",3,"S",0,1,7,2,0,0,0,0,"F","Serviço","Serviço","1.7.2.20.","AGETOP",85077,"VÁLVULA DE RETENÇÃO HORIZONTAL 2.1/2\"","Un    ",2,1,null,null,null,null,null,""]
["S",3,"S",0,1,7,2,0,0,0,0,"F","Serviço","Serviço","1.7.2.21.","COMPOSIÇÃO","COMP 017_SEE","REDUCAO GIRATÓRIA TIPO STORZ LATAO P/ INST. PREDIAL COMBATE A INCENDIO ENGATE RAPIDO 2.1/2\" X 1.1/2\"","UN ",4,1,null,null,null,null,null,""]
["S",3,"S",0,1,7,2,0,0,0,0,"F","Serviço","Serviço","1.7.2.22.","COMPOSIÇÃO","COMP 018_SEE","CHAVE DUPLA P/ CONEXÕES TIPO STORZ EM LATÃO ENGATE RÁPIDO 1 1/2\" X 2 1/2\"","UN ",4,1,null,null,null,null,null,""]
["S",3,"S",0,1,7,2,0,0,0,0,"F","Serviço","Serviço","1.7.2.23.","COMPOSIÇÃO","COMP 087_SEE","REGISTRO DE GAVETA COM HASTE ASCENDENTE DE BRONZE 2 1/2\"","UN ",1,1,null,null,null,null,null,""]
["S",3,"S",0,1,7,2,0,0,0,0,"F","Serviço","Serviço","1.7.2.24.","COMPOSIÇÃO","COMP 019_SEE","TAMPÃO LATAO C/ CORRENTE P/ INSTALAÇÃO PREDIAL COMBATE A INCÊNDIO ENGATE RÁPIDO 1 1/2\"","UN ",1,1,null,null,null,null,null,""]
["S",3,"S",0,1,7,2,0,0,0,0,"F","Serviço","Serviço","1.7.2.25.","COMPOSIÇÃO","COMP 088_SEE","TE DE FERRO GALVANIZADO 90º X 2.1/2\" X 1\"","UN ",5,1,null,null,null,null,null,""]
["S",3,"S",0,1,7,2,0,0,0,0,"F","Serviço","Serviço","1.7.2.26.","AGETOP",85056,"TÊ DE FERRO GALVANIZADO 90º X 2 1/2\"","un    ",7,1,null,null,null,null,null,""]
["S",3,"S",0,1,7,2,0,0,0,0,"F","Serviço","Serviço","1.7.2.27.","COMPOSIÇÃO","COMP 030_SEE","COTOVELO DE FERRO GALV. 90° X 2 1/2\"","UN ",25,1,null,null,null,null,null,""]
["S",3,"S",0,1,7,2,0,0,0,0,"F","Serviço","Serviço","1.7.2.28.","COMPOSIÇÃO","COMP 077_SEE","UNIAO FERRO GALV C/ASSENTO CONICO BRONZE 2 1/2\"","UN ",4,1,null,null,null,null,null,""]
["S",3,"S",0,1,7,2,0,0,0,0,"F","Serviço","Serviço","1.7.2.29.","COMPOSIÇÃO","COMP 076_SEE","CURVA FERRO GALVANIZADO 45G ROSCA MACHO/FEMEA REF. 2 1/2\"","UN ",3,1,null,null,null,null,null,""]
["S",{"$f":"IF(OR(C239=\"s\",C239=0),OFFSET(B239,-1,0),C239)","v":3},{"$f":"IF(OFFSET(C239,-1,0)=\"L\",1,IF(OFFSET(C239,-1,0)=1,2,IF(OR(A239=\"s\",A239=0),\"S\",IF(AND(OFFSET(C239,-1,0)=2,A239=4),3,IF(AND(OR(OFFSET(C239,-1,0)=\"s\",OFFSET(C239,-1,0)=0),A239<>\"s\",A239>OFFSET(B239,-1,0)),OFFSET(B239,-1,0),A239)))))","v":"S"},{"$f":"IF(OR(C239=\"S\",C239=0),0,IF(ISERROR(K239),J239,SMALL(J239:K239,1)))","v":0},1,7,2,0,0,0,0,"F","Serviço","Serviço","1.7.2.30.","COMPOSIÇÃO","COMP 022_SEE","TAMPÃO FOFO 40X50CM C/INSCRIÇÃO ","UN ",1,1,null,null,null,null,null,""]
["S",3,"S",0,1,7,2,0,0,0,0,"F","Serviço","Serviço","1.7.2.31.","COMPOSIÇÃO","COMP 024_SEE","SINALIZADOR FOTOLUMINESCENTE PARA EXTINTOR","UN ",11,1,null,null,null,null,null,""]
["S",3,"S",0,1,7,2,0,0,0,0,"F","Serviço","Serviço","1.7.2.32.","COMPOSIÇÃO","COMP 186_SEE","BOTOEIRA BOMBA DE INCÊNDIO C/ MARTELO CONVENCIONAL/ ANALÓGICA","UN ",4,1,null,null,null,null,null,""]
["S",3,"S",0,1,7,2,0,0,0,0,"F","Serviço","Serviço","1.7.2.33.","COMPOSIÇÃO","COMP 188_SEE","ACIONADOR MANUAL DE ALARME","UN ",4,1,null,null,null,null,null,""]
["S",3,"S",0,1,7,2,0,0,0,0,"F","Serviço","Serviço","1.7.2.34.","COMPOSIÇÃO","COMP 190_SEE","CENTRAL DE DETECÇÃO E ALARME DE 40 SETORES COM BATERIA","UN ",1,1,null,null,null,null,null,""]
["S",3,"S",0,1,7,2,0,0,0,0,"F","Serviço","Serviço","1.7.2.35.","COMPOSIÇÃO","COMP 025_SEE","SINALIZADOR FOTOLUMINESCENTE DE EMERGÊNCIA","UN ",40,1,null,null,null,null,null,""]
["S",3,"S",0,1,7,2,0,0,0,0,"F","Serviço","Serviço","1.7.2.36.","COMPOSIÇÃO","COMP 277_SEE","MARCAÇÃO NO PISO - 1X1 M PARA EXTINTOR","M2",11,1,null,null,null,null,null,""]
["S",3,"S",0,1,7,2,0,0,0,0,"F","Serviço","Serviço","1.7.2.37.","COMPOSIÇÃO","COMP 080_SEE","BUCHA REDUCAO FERRO GALV ROSCA REF. 2 1/2\"X1\"","UN ",3,1,null,null,null,null,null,""]
["S",3,"S",0,1,7,2,0,0,0,0,"F","Serviço","Serviço","1.7.2.38.","COMPOSIÇÃO","COMP 089_SEE","TE DE REDUCAO 90 GRAUS SOLDAVEL 60 X 50 MM","UN ",8,1,null,null,null,null,null,""]
[2,2,2,27,1,8,0,0,0,83,27,"F","Nível 2","Nível 2","1.8.",null,null,"INSTALAÇÕES ESPECIAIS","-",null,1,null,null,null,null,null,""]
["S",2,"S",0,1,8,0,0,0,0,0,"F","Serviço","Serviço","1.8.0.1.","AGETOP",91007,"CENTRAL DE GÁS PADRÃO GOINFRA SEM INSTALAÇÕES (1+1 CILINDRO 45 KG)","Un    ",1,1,null,null,null,null,null,""]
["S",2,"S",0,1,8,0,0,0,0,0,"F","Serviço","Serviço","1.8.0.2.","AGETOP",91023,"UNIÃO S/BRONZE PRETA 3/4\" NPT 300 LBS","Un    ",3,1,null,null,null,null,null,""]
["S",2,"S",0,1,8,0,0,0,0,0,"F","Serviço","Serviço","1.8.0.3.","COMPOSIÇÃO","COMP 382_SEE","TE DE REDUCAO DE FERRO GALVANIZADO, COM ROSCA BSP, DE 3/4\" X 1/2\"","UN ",1,1,null,null,null,null,null,""]
["S",2,"S",0,1,8,0,0,0,0,0,"F","Serviço","Serviço","1.8.0.4.","COMPOSIÇÃO","COMP 383_SEE","BUCHA DE REDUCAO DE FERRO GALVANIZADO, COM ROSCA BSP, DE 1/2\" X 1/4\"","UN ",3,1,null,null,null,null,null,""]
["S",2,"S",0,1,8,0,0,0,0,0,"F","Serviço","Serviço","1.8.0.5.","AGETOP",91021,"LUVA GALVANIZADO DE REDUÇÃO 3/4\" X 1/2\" (GÁS)","Un    ",2,1,null,null,null,null,null,""]
["S",2,"S",0,1,8,0,0,0,0,0,"F","Serviço","Serviço","1.8.0.6.","SINAPI",92692,"NIPLE, EM FERRO GALVANIZADO, CONEXÃO ROSQUEADA, DN 15 (1/2\"), INSTALADO EM RAMAIS E SUB-RAMAIS DE GÁS - FORNECIMENTO E INSTALAÇÃO. AF_12/2015","UN",6,1,null,null,null,null,null,""]
["S",2,"S",0,1,8,0,0,0,0,0,"F","Serviço","Serviço","1.8.0.7.","AGETOP",91031,"NIPLE DUPLO 300 PSI 3/4\"","Un    ",6,1,null,null,null,null,null,""]
["S",2,"S",0,1,8,0,0,0,0,0,"F","Serviço","Serviço","1.8.0.8.","COMPOSIÇÃO","COMP 212_SEE","NIPLE DE REDUÇÃO 1/2\" X 1/4\" BSP","UN ",4,1,null,null,null,null,null,""]
["S",2,"S",0,1,8,0,0,0,0,0,"F","Serviço","Serviço","1.8.0.9.","COMPOSIÇÃO","COMP 213_SEE","NIPLE DE REDUÇÃO 3/4\" X 1/2\" BSP","UN ",4,1,null,null,null,null,null,""]
["S",2,"S",0,1,8,0,0,0,0,0,"F","Serviço","Serviço","1.8.0.10.","SINAPI",92688,"TUBO DE AÇO GALVANIZADO COM COSTURA, CLASSE MÉDIA, CONEXÃO ROSQUEADA, DN 20 (3/4\"), INSTALADO EM RAMAIS E SUB-RAMAIS DE GÁS - FORNECIMENTO E INSTALAÇÃO. AF_12/2015","M",18,1,null,null,null,null,null,""]
["S",2,"S",0,1,8,0,0,0,0,0,"F","Serviço","Serviço","1.8.0.11.","SINAPI",92701,"JOELHO 90 GRAUS, EM FERRO GALVANIZADO, CONEXÃO ROSQUEADA, DN 20 (3/4\"), INSTALADO EM RAMAIS E SUB-RAMAIS DE GÁS - FORNECIMENTO E INSTALAÇÃO. AF_12/2015","UN",7,1,null,null,null,null,null,""]
["S",2,"S",0,1,8,0,0,0,0,0,"F","Serviço","Serviço","1.8.0.12.","COMPOSIÇÃO","COMP 237_SEE","FITA ANTICORROSIVA","M",16,1,null,null,null,null,null,""]
["S",2,"S",0,1,8,0,0,0,0,0,"F","Serviço","Serviço","1.8.0.13.","AGETOP",91025,"VÁLVULA ESFERICA LATÃO 3/4\"","Un    ",3,1,null,null,null,null,null,""]
["S",2,"S",0,1,8,0,0,0,0,0,"F","Serviço","Serviço","1.8.0.14.","AGETOP",91019,"TE PRETO 90º 3/4\" NPT 300 LBS","Un    ",1,1,null,null,null,null,null,""]
["S",2,"S",0,1,8,0,0,0,0,0,"F","Serviço","Serviço","1.8.0.15.","COMPOSIÇÃO","COMP 542_SEE","VÁLVULA UGV 3/4\" (S) LATÃO","UN ",2,1,null,null,null,null,null,""]
["S",2,"S",0,{"$f":"IF($C264=1,OFFSET(E264,-1,0)+1,OFFSET(E264,-1,0))","v":1},{"$f":"IF($C264=1,0,IF($C264=2,OFFSET(F264,-1,0)+1,OFFSET(F264,-1,0)))","v":8},{"$f":"IF(AND($C264<=2,$C264<>0),0,IF($C264=3,OFFSET(G264,-1,0)+1,OFFSET(G264,-1,0)))","v":0},{"$f":"IF(AND($C264<=3,$C264<>0),0,IF($C264=4,OFFSET(H264,-1,0)+1,OFFSET(H264,-1,0)))","v":0},0,0,0,"F","Serviço","Serviço","1.8.0.16.","COMPOSIÇÃO","COMP 543_SEE","VÁLVULA UGV 1/2\" (S) LATÃO","UN ",2,1,null,null,null,null,null,""]
[{"$f":"CHOOSE(1+LOG(1+2*(ORÇAMENTO.Nivel=\"Nível 1\")+4*(ORÇAMENTO.Nivel=\"Nível 2\")+8*(ORÇAMENTO.Nivel=\"Nível 3\")+16*(ORÇAMENTO.Nivel=\"Nível 4\")+32*(ORÇAMENTO.Nivel=\"Serviço\"),2),0,1,2,3,4,\"S\")","v":"S"},2,"S",0,1,8,0,0,{"$f":"IF(AND($C265<=4,$C265<>0),0,IF(AND($C265=\"S\",$Y265>0),OFFSET(I265,-1,0)+1,OFFSET(I265,-1,0)))","v":0},0,0,"F","Serviço","Serviço","1.8.0.17.","AGETOP",91029,"VALVULA DE RETENÇÃO LATÃO 1/2\" X 7/16\" NPT","Un    ",2,1,null,null,null,null,null,""]
["S",2,"S",0,1,8,0,0,0,0,0,"F","Serviço","Serviço","1.8.0.18.","COMPOSIÇÃO","COMP 211_SEE","REGULADOR DE 2º ESTÁGIO 5KG/H","UN ",2,1,null,null,null,null,null,""]
["S",2,"S",0,1,8,0,0,0,0,0,"F","Serviço","Serviço","1.8.0.19.","COMPOSIÇÃO","COMP 210_SEE","REGULADOR DE 1º ESTÁGIO 60KG/H MODELO AP-40  COM MANÔMETRO","UN ",1,1,null,null,null,null,null,""]
["S",2,"S",0,1,8,0,0,0,0,0,"F","Serviço","Serviço","1.8.0.20.","AGETOP",85003,"EXTINTOR PO QUIMICO SECO (6 KG) - CAPACIDADE EXTINTORA 20 BC","Un    ",1,1,null,null,null,null,null,""]
["S",2,"S",0,1,8,0,0,0,0,0,"F","Serviço","Serviço","1.8.0.21.","COMPOSIÇÃO","COMP 235_SEE","PLACA DE SINALIZAÇÃO EM PVC COD 01 - (300X300) PROIBIDO FUMAR","UN ",2,1,null,null,null,null,null,""]
["S",2,"S",0,1,8,0,0,0,0,0,"F","Serviço","Serviço","1.8.0.22.","COMPOSIÇÃO","COMP 236_SEE","PLACA DE SINALIZAÇÃO EM PVC COD 06 - (300X300) PERIGO INFLAMÁVEL","UN ",2,1,null,null,null,null,null,""]
["S",2,"S",0,1,8,0,0,0,0,0,"F","Serviço","Serviço","1.8.0.23.","AGETOP",91043,"BRAÇADEIRA METALICA TIPO \"D\" DIAM. 3/4\"","Un    ",5,1,null,null,null,null,null,""]
["S",2,"S",0,1,8,0,0,0,0,0,"F","Serviço","Serviço","1.8.0.24.","AGETOP",71863,"PARAFUSO P/BUCHA S-10","Un    ",10,1,null,null,null,null,null,""]
["S",2,"S",0,1,8,0,0,0,0,0,"F","Serviço","Serviço","1.8.0.25.","AGETOP",70393,"BUCHA DE NYLON S-10","Un    ",10,1,null,null,null,null,null,""]
["S",2,"S",0,1,8,0,0,0,0,0,"F","Serviço","Serviço","1.8.0.26.","AGETOP",91045,"SUPORTE PARA COLETOR","Un    ",2,1,null,null,null,null,null,""]
[2,2,2,2,1,9,0,0,0,{"$f":"IF(OR($C275=\"S\",$C275=0),0,MATCH(0,OFFSET($D275,1,$C275,ROW($C$618)-ROW($C275)),0))","v":56},{"$f":"IF(OR($C275=\"S\",$C275=0),0,MATCH(OFFSET($D275,0,$C275)+1,OFFSET($D275,1,$C275,ROW($C$618)-ROW($C275)),0))","v":2},"F","Nível 2","Nível 2","1.9.","SINAPI",null,"ESTRUTURAS METÁLICAS","-",null,1,null,null,null,null,null,""]
["S",2,"S",0,1,9,0,0,0,0,0,"F","Serviço","Serviço","1.9.0.1.","AGETOP",150204,"ESTRUTURA METÁLICA CONVENCIONAL EM AÇO DO TIPO MR-250 / ASTM A36 COM FUNDO ANTICORROSIVO","Kg    ",12734,1,null,null,null,null,null,""]
[2,2,2,7,1,10,0,0,0,54,7,"F","Nível 2","Nível 2","1.10.",null,null,"COBERTURAS","-",null,1,null,null,null,null,null,""]
[3,3,3,2,1,10,1,0,0,6,2,"F","Nível 3","Nível 3","1.10.1.",null,null,"REFORMA","-",null,1,null,null,null,null,null,""]
["S",3,"S",0,1,10,1,0,0,0,0,"F","Serviço","Serviço","1.10.1.1.","AGETOP",160100,"COBERTURA COM TELHA AMERICANA  RESINADA COR VERMELHA","m2    ",268.85000000000002,1,null,null,null,null,null,""]
[3,3,3,4,1,10,2,0,0,4,15,"F","Nível 3","Nível 3","1.10.2.","SINAPI",null,"AMPLIAÇÃO","-",null,1,null,null,null,null,null,""]
["S",3,"S",0,1,10,2,0,0,0,0,"F","Serviço","Serviço","1.10.2.1.","AGETOP",160100,"COBERTURA COM TELHA AMERICANA  RESINADA COR VERMELHA","m2    ",745.49,1,null,null,null,null,null,""]
["S",3,"S",0,1,10,2,0,0,0,0,"F","Serviço","Serviço","1.10.2.2.","SINAPI",94221,"CUMEEIRA PARA TELHA CERÂMICA EMBOÇADA COM ARGAMASSA TRAÇO 1:2:9 (CIMENTO, CAL E AREIA) PARA TELHADOS COM ATÉ 2 ÁGUAS, INCLUSO TRANSPORTE VERTICAL. AF_07/2019","M",75.63,1,null,null,null,null,null,""]
["S",3,"S",0,1,10,2,0,0,0,0,"F","Serviço","Serviço","1.10.2.3.","SINAPI",94224,"EMBOÇAMENTO COM ARGAMASSA TRAÇO 1:2:9 (CIMENTO, CAL E AREIA). AF_07/2019","M",170.98,1,null,null,null,null,null,"Referência: AGETOP - 160403"]
[2,2,2,2,1,11,0,0,0,47,2,"F","Nível 2","Nível 2","1.11.",null,null,"ESQUADRIAS METÁLICAS","-",null,1,null,null,null,null,null,""]
["S",2,"S",0,1,11,0,0,0,0,0,"F","Serviço","Serviço","1.11.0.1.","AGETOP",180323,"GRELHA PADRÃO GOINFRA DE FERRO CHATO COM BERÇO (ESPAÇAMENTO ENTRE FACES = 1,5CM - NBR 9050 ACESSIBILIDADE)","m2    ",36.93,1,null,null,null,null,null,""]
[2,2,2,2,1,12,0,0,0,45,2,"F","Nível 2","Nível 2","1.12.",null,null,"REVESTIMENTO DE PAREDE","-",null,1,null,null,null,null,null,""]
["S",2,"S",0,1,12,0,0,0,0,0,"F","Serviço","Serviço","1.12.0.1.","SINAPI",87273,"REVESTIMENTO CERÂMICO PARA PAREDES INTERNAS COM PLACAS TIPO ESMALTADA EXTRA DE DIMENSÕES 33X45 CM APLICADAS EM AMBIENTES DE ÁREA MAIOR QUE 5 M² NA ALTURA INTEIRA DAS PAREDES. AF_06/2014","M2",158.98000000000002,1,null,null,null,null,null,""]
[2,2,2,2,1,13,0,0,0,43,2,"F","Nível 2","Nível 2","1.13.",null,null,"FORROS","-",null,1,null,null,null,null,null,""]
["S",2,"S",0,1,13,0,0,0,0,0,"F","Serviço","Serviço","1.13.0.1.","SINAPI",96116,"FORRO EM RÉGUAS DE PVC, FRISADO, PARA AMBIENTES COMERCIAIS, INCLUSIVE ESTRUTURA DE FIXAÇÃO. AF_05/2017_P","M2",131.87,1,null,null,null,null,null,"Referência: AGETOP - 210460"]
[2,2,2,9,1,14,0,0,0,41,9,"F","Nível 2","Nível 2","1.14.",null,null,"REVESTIMENTO DE PISO","-",null,1,null,null,null,null,null,""]
[3,3,3,2,1,14,1,0,0,8,2,"F","Nível 3","Nível 3","1.14.1.",null,null,"CERÂMICO","-",null,1,null,null,null,null,null,""]
["S",3,"S",0,1,14,1,0,0,0,0,"F","Serviço","Serviço","1.14.1.1.","SINAPI",87251,"REVESTIMENTO CERÂMICO PARA PISO COM PLACAS TIPO ESMALTADA EXTRA DE DIMENSÕES 45X45 CM APLICADA EM AMBIENTES DE ÁREA MAIOR QUE 10 M2. AF_06/2014","M2",46.86,1,null,null,null,null,null,""]
[3,3,3,2,1,14,2,0,0,6,2,"F","Nível 3","Nível 3","1.14.2.",null,null,"CALÇADA ACESSÍVEL ","-",null,1,null,null,null,null,null,""]
["S",3,"S",0,1,14,2,0,0,0,0,"F","Serviço","Serviço","1.14.2.1.","AGETOP",220102,"PISO CONCRETO DESEMPENADO ESPESSURA = 5 CM  1:2,5:3,5","m2    ",462.4,1,null,null,null,null,null,""]
[3,3,3,2,1,14,3,0,0,4,2,"F","Nível 3","Nível 3","1.14.3.","SINAPI",null,"IMPLANTAÇÃO DAS SALAS","-",null,1,null,null,null,null,null,""]
["S",3,"S",0,1,14,3,0,0,0,0,"F","Serviço","Serviço","1.14.3.1.","AGETOP",220102,"PISO CONCRETO DESEMPENADO ESPESSURA = 5 CM  1:2,5:3,5","m2    ",89.35,1,null,null,null,null,null,""]
[3,3,3,2,1,14,4,0,0,2,22,"F","Nível 3","Nível 3","1.14.4.",null,null,"PODOTÁTIL","-",null,1,null,null,null,null,null,""]
["S",3,"S",0,1,14,4,0,0,0,0,"F","Serviço","Serviço","1.14.4.1.","AGETOP",221126,"PISO DE LADRILHO HIDRÁULICO COLORIDO MODELO TÁTIL ( ALERTA OU DIRECIONAL) SEM LASTRO","m2    ",40.369999999999997,1,null,null,null,null,null,""]
[{"$f":"CHOOSE(1+LOG(1+2*(ORÇAMENTO.Nivel=\"Nível 1\")+4*(ORÇAMENTO.Nivel=\"Nível 2\")+8*(ORÇAMENTO.Nivel=\"Nível 3\")+16*(ORÇAMENTO.Nivel=\"Nível 4\")+32*(ORÇAMENTO.Nivel=\"Serviço\"),2),0,1,2,3,4,\"S\")","v":2},{"$f":"IF(OR(C299=\"s\",C299=0),OFFSET(B299,-1,0),C299)","v":2},{"$f":"IF(OFFSET(C299,-1,0)=\"L\",1,IF(OFFSET(C299,-1,0)=1,2,IF(OR(A299=\"s\",A299=0),\"S\",IF(AND(OFFSET(C299,-1,0)=2,A299=4),3,IF(AND(OR(OFFSET(C299,-1,0)=\"s\",OFFSET(C299,-1,0)=0),A299<>\"s\",A299>OFFSET(B299,-1,0)),OFFSET(B299,-1,0),A299)))))","v":2},{"$f":"IF(OR(C299=\"S\",C299=0),0,IF(ISERROR(K299),J299,SMALL(J299:K299,1)))","v":6},{"$f":"IF($C299=1,OFFSET(E299,-1,0)+1,OFFSET(E299,-1,0))","v":1},{"$f":"IF($C299=1,0,IF($C299=2,OFFSET(F299,-1,0)+1,OFFSET(F299,-1,0)))","v":15},{"$f":"IF(AND($C299<=2,$C299<>0),0,IF($C299=3,OFFSET(G299,-1,0)+1,OFFSET(G299,-1,0)))","v":0},{"$f":"IF(AND($C299<=3,$C299<>0),0,IF($C299=4,OFFSET(H299,-1,0)+1,OFFSET(H299,-1,0)))","v":0},{"$f":"IF(AND($C299<=4,$C299<>0),0,IF(AND($C299=\"S\",$Y299>0),OFFSET(I299,-1,0)+1,OFFSET(I299,-1,0)))","v":0},32,6,"F","Nível 2","Nível 2","1.15.",null,null,"ADMINISTRAÇÃO","-",null,1,null,null,null,null,null,""]
[3,3,3,3,1,15,1,0,0,5,3,"F","Nível 3","Nível 3","1.15.1.",null,null,"MENSALISTAS","-",null,1,null,null,null,null,null,""]
["S",3,"S",0,1,15,1,0,0,0,0,"F","Serviço","Serviço","1.15.1.1.","SINAPI",90778,"ENGENHEIRO CIVIL DE OBRA PLENO COM ENCARGOS COMPLEMENTARES","H",264,1,null,null,null,null,null,"Referência: AGETOP - 250101"]
["S",3,"S",0,1,15,1,0,0,0,0,"F","Serviço","Serviço","1.15.1.2.","SINAPI",90776,"ENCARREGADO GERAL COM ENCARGOS COMPLEMENTARES","H",1320,1,null,null,null,null,null,"Referência: AGETOP - 250103"]
[3,3,3,2,1,15,2,0,0,2,9,"F","Nível 3","Nível 3","1.15.2.",null,null,"LAUDO DE ESTANQUEIDADE","-",null,1,null,null,null,null,null,""]
[{"$f":"CHOOSE(1+LOG(1+2*(ORÇAMENTO.Nivel=\"Nível 1\")+4*(ORÇAMENTO.Nivel=\"Nível 2\")+8*(ORÇAMENTO.Nivel=\"Nível 3\")+16*(ORÇAMENTO.Nivel=\"Nível 4\")+32*(ORÇAMENTO.Nivel=\"Serviço\"),2),0,1,2,3,4,\"S\")","v":"S"},3,"S",0,1,15,2,0,{"$f":"IF(AND($C304<=4,$C304<>0),0,IF(AND($C304=\"S\",$Y304>0),OFFSET(I304,-1,0)+1,OFFSET(I304,-1,0)))","v":0},0,0,"F","Serviço","Serviço","1.15.2.1.","SINAPI",90778,"ENGENHEIRO CIVIL DE OBRA PLENO COM ENCARGOS COMPLEMENTARES","H",16,1,null,null,null,null,null,"Referência: AGETOP - 250101"]
[2,2,2,22,1,16,0,0,0,26,22,"F","Nível 2","Nível 2","1.16.",null,null,"PINTURA","-",null,1,null,null,null,null,null,""]
[3,3,3,2,1,16,1,0,0,21,2,"F","Nível 3","Nível 3","1.16.1.","SINAPI",null,"GRELHA","-",null,1,null,null,null,null,null,""]
["S",3,"S",0,1,16,1,0,0,0,0,"F","Serviço","Serviço","1.16.1.1.","SINAPI","74145/1","PINTURA ESMALTE FOSCO, DUAS DEMAOS, SOBRE SUPERFICIE METALICA, INCLUSO UMA DEMAO DE FUNDO ANTICORROSIVO. UTILIZACAO DE REVOLVER ( AR-COMPRIMIDO).","M2",55.39,1,null,null,null,null,null,"Referência: AGETOP - 261602"]
[3,3,3,4,1,16,2,0,0,19,4,"F","Nível 3","Nível 3","1.16.2.",null,null,"ESMALTE SINTÉTICO","-",null,1,null,null,null,null,null,""]
["S",3,"S",0,{"$f":"IF($C309=1,OFFSET(E309,-1,0)+1,OFFSET(E309,-1,0))","v":1},{"$f":"IF($C309=1,0,IF($C309=2,OFFSET(F309,-1,0)+1,OFFSET(F309,-1,0)))","v":16},{"$f":"IF(AND($C309<=2,$C309<>0),0,IF($C309=3,OFFSET(G309,-1,0)+1,OFFSET(G309,-1,0)))","v":2},{"$f":"IF(AND($C309<=3,$C309<>0),0,IF($C309=4,OFFSET(H309,-1,0)+1,OFFSET(H309,-1,0)))","v":0},0,0,0,"F","Serviço","Serviço","1.16.2.1.","AGETOP",260105,"REMOCAO DE PINTURA ANTIGA A OLEO OU ESMALTE","m2    ",298.34500000000003,1,null,null,null,null,null,""]
["S",3,"S",0,1,16,2,0,0,0,0,"F","Serviço","Serviço","1.16.2.2.","SINAPI",88497,"APLICAÇÃO E LIXAMENTO DE MASSA LÁTEX EM PAREDES, DUAS DEMÃOS. AF_06/2014","M2",298.35000000000002,1,null,null,null,null,null,"Referência: AGETOP - 261300"]
["S",3,"S",0,1,16,2,0,0,0,0,"F","Serviço","Serviço","1.16.2.3.","AGETOP",261550,"PINT.ESMALTE SINT.PAREDES - 2 DEM.C/SELADOR","m2    ",1217.46,1,null,null,null,null,null,""]
[3,3,3,4,1,16,3,0,0,15,4,"F","Nível 3","Nível 3","1.16.3.","AGETOP",null,"LÁTEX ACRÍLICA","-",null,1,null,null,null,null,null,""]
["S",3,"S",0,1,16,3,0,0,0,0,"F","Serviço","Serviço","1.16.3.1.","AGETOP",260104,"REMOCAO DE PINTURA ANTIGA A LATEX","m2    ",298.34500000000003,1,null,null,null,null,null,""]
["S",3,"S",0,1,16,3,0,0,0,0,"F","Serviço","Serviço","1.16.3.2.","SINAPI",88497,"APLICAÇÃO E LIXAMENTO DE MASSA LÁTEX EM PAREDES, DUAS DEMÃOS. AF_06/2014","M2",298.34500000000003,1,null,null,null,null,null,"Referência: AGETOP - 261300"]
["S",{"$f":"IF(OR(C315=\"s\",C315=0),OFFSET(B315,-1,0),C315)","v":3},{"$f":"IF(OFFSET(C315,-1,0)=\"L\",1,IF(OFFSET(C315,-1,0)=1,2,IF(OR(A315=\"s\",A315=0),\"S\",IF(AND(OFFSET(C315,-1,0)=2,A315=4),3,IF(AND(OR(OFFSET(C315,-1,0)=\"s\",OFFSET(C315,-1,0)=0),A315<>\"s\",A315>OFFSET(B315,-1,0)),OFFSET(B315,-1,0),A315)))))","v":"S"},{"$f":"IF(OR(C315=\"S\",C315=0),0,IF(ISERROR(K315),J315,SMALL(J315:K315,1)))","v":0},1,16,3,0,0,0,0,"F","Serviço","Serviço","1.16.3.3.","SINAPI",88489,"APLICAÇÃO MANUAL DE PINTURA COM TINTA LÁTEX ACRÍLICA EM PAREDES, DUAS DEMÃOS. AF_06/2014","M2",1136.3,1,null,null,null,null,null,"Referência: AGETOP - 261001"]
[3,3,3,3,1,16,4,0,0,11,3,"F","Nível 3","Nível 3","1.16.4.","AGETOP",null,"EXTERNA","-",null,1,null,null,null,null,null,""]
["S",3,"S",0,1,16,4,0,0,0,0,"F","Serviço","Serviço","1.16.4.1.","SINAPI",88489,"APLICAÇÃO MANUAL DE PINTURA COM TINTA LÁTEX ACRÍLICA EM PAREDES, DUAS DEMÃOS. AF_06/2014","M2",1421.75,1,null,null,null,null,null,"Referência: AGETOP - 261001"]
["S",3,"S",0,1,16,4,0,0,0,0,"F","Serviço","Serviço","1.16.4.2.","SINAPI",88423,"APLICAÇÃO MANUAL DE PINTURA COM TINTA TEXTURIZADA ACRÍLICA EM PAREDES EXTERNAS DE CASAS, UMA COR. AF_06/2014","M2",100.29,1,null,null,null,null,null,"Referência: AGETOP - 260601"]
[3,3,3,3,1,16,5,0,0,8,3,"F","Nível 3","Nível 3","1.16.5.","SINAPI",null,"ESQUADRIAS EXISTENTES","-",null,1,null,null,null,null,null,""]
["S",3,"S",0,1,16,5,0,0,0,0,"F","Serviço","Serviço","1.16.5.1.","AGETOP",260105,"REMOCAO DE PINTURA ANTIGA A OLEO OU ESMALTE","m2    ",488.31,1,null,null,null,null,null,""]
["S",3,"S",0,1,16,5,0,0,0,0,"F","Serviço","Serviço","1.16.5.2.","SINAPI","73924/3","PINTURA ESMALTE FOSCO, DUAS DEMAOS, SOBRE SUPERFICIE METALICA","M2",488.31,1,null,null,null,null,null,"Referência: AGETOP - 261503"]
[3,3,3,3,1,16,6,0,0,5,3,"F","Nível 3","Nível 3","1.16.6.","AGETOP",null,"OUTROS","-",null,1,null,null,null,null,null,""]
["S",3,"S",0,1,16,6,0,0,0,0,"F","Serviço","Serviço","1.16.6.1.","SINAPI",88497,"APLICAÇÃO E LIXAMENTO DE MASSA LÁTEX EM PAREDES, DUAS DEMÃOS. AF_06/2014","M2",9.1999999999999993,1,null,null,null,null,null,"Referência: AGETOP - 261300"]
["S",3,"S",0,1,16,6,0,0,0,0,"F","Serviço","Serviço","1.16.6.2.","AGETOP",261620,"LETREIRO MÉDIO A GRANDE PORTE EM PAREDE FEITO A PINCEL","m2    ",7.2,1,null,null,null,null,null,""]
[3,3,3,2,1,16,7,0,0,2,{"$error":"#N/A"},"F","Nível 3","Nível 3","1.16.7.","SINAPI",null,"ESTRUTURA METÁLICA","-",null,1,null,null,null,null,null,""]
["S",3,"S",0,1,16,7,0,0,0,0,"F","Serviço","Serviço","1.16.7.1.","SINAPI","74145/1","PINTURA ESMALTE FOSCO, DUAS DEMAOS, SOBRE SUPERFICIE METALICA, INCLUSO UMA DEMAO DE FUNDO ANTICORROSIVO. UTILIZACAO DE REVOLVER ( AR-COMPRIMIDO).","M2",745.49,1,null,null,null,null,null,"Referência: AGETOP - 261602"]
[{"$f":"CHOOSE(1+LOG(1+2*(ORÇAMENTO.Nivel=\"Nível 1\")+4*(ORÇAMENTO.Nivel=\"Nível 2\")+8*(ORÇAMENTO.Nivel=\"Nível 3\")+16*(ORÇAMENTO.Nivel=\"Nível 4\")+32*(ORÇAMENTO.Nivel=\"Serviço\"),2),0,1,2,3,4,\"S\")","v":2},{"$f":"IF(OR(C327=\"s\",C327=0),OFFSET(B327,-1,0),C327)","v":2},{"$f":"IF(OFFSET(C327,-1,0)=\"L\",1,IF(OFFSET(C327,-1,0)=1,2,IF(OR(A327=\"s\",A327=0),\"S\",IF(AND(OFFSET(C327,-1,0)=2,A327=4),3,IF(AND(OR(OFFSET(C327,-1,0)=\"s\",OFFSET(C327,-1,0)=0),A327<>\"s\",A327>OFFSET(B327,-1,0)),OFFSET(B327,-1,0),A327)))))","v":2},{"$f":"IF(OR(C327=\"S\",C327=0),0,IF(ISERROR(K327),J327,SMALL(J327:K327,1)))","v":4},{"$f":"IF($C327=1,OFFSET(E327,-1,0)+1,OFFSET(E327,-1,0))","v":1},{"$f":"IF($C327=1,0,IF($C327=2,OFFSET(F327,-1,0)+1,OFFSET(F327,-1,0)))","v":17},{"$f":"IF(AND($C327<=2,$C327<>0),0,IF($C327=3,OFFSET(G327,-1,0)+1,OFFSET(G327,-1,0)))","v":0},{"$f":"IF(AND($C327<=3,$C327<>0),0,IF($C327=4,OFFSET(H327,-1,0)+1,OFFSET(H327,-1,0)))","v":0},{"$f":"IF(AND($C327<=4,$C327<>0),0,IF(AND($C327=\"S\",$Y327>0),OFFSET(I327,-1,0)+1,OFFSET(I327,-1,0)))","v":0},4,{"$error":"#N/A"},"F","Nível 2","Nível 2","1.17.",null,null,"DIVERSOS","-",null,1,null,null,null,null,null,""]
["S",2,"S",0,1,17,0,0,0,0,0,"F","Serviço","Serviço","1.17.0.1.","AGETOP",271417,"CANALETA CONCRETO DESEMPENADO 5 CM PD.GOINFRA","m     ",227.5,1,null,null,null,null,null,""]
["S",2,"S",0,1,17,0,0,0,0,0,"F","Serviço","Serviço","1.17.0.2.","AGETOP",270501,"LIMPEZA FINAL DE OBRA - (OBRAS CIVIS)","m2    ",200,1,null,null,null,null,null,""]
["S",2,"S",0,1,17,0,0,0,0,0,"F","Serviço","Serviço","1.17.0.3.","AGETOP",271608,"BANCADA DE GRANITO C/ESPELHO","m2    ",3.71,1,null,null,null,null,null,""]
[1,1,1,98,{"$f":"IF($C331=1,OFFSET(E331,-1,0)+1,OFFSET(E331,-1,0))","v":2},{"$f":"IF($C331=1,0,IF($C331=2,OFFSET(F331,-1,0)+1,OFFSET(F331,-1,0)))","v":0},{"$f":"IF(AND($C331<=2,$C331<>0),0,IF($C331=3,OFFSET(G331,-1,0)+1,OFFSET(G331,-1,0)))","v":0},{"$f":"IF(AND($C331<=3,$C331<>0),0,IF($C331=4,OFFSET(H331,-1,0)+1,OFFSET(H331,-1,0)))","v":0},0,287,98,"F","Nível 1","Nível 1","2.","SINAPI",null,"BLOCO 03 SALAS PADRÃO SEDUC 2019 - LAJE","UN",3,3,null,null,null,null,null,""]
[2,2,2,2,2,1,0,0,0,97,2,"F","Nível 2","Nível 2","2.1.","AGETOP",null,"SERVIÇOS PRELIMINARES","-",null,3,null,null,null,null,null,""]
["S",2,"S",0,2,1,0,0,0,0,0,"F","Serviço","Serviço","2.1.0.1.","AGETOP",20701,"LOCAÇÃO DA OBRA, EXECUÇÃO DE GABARITO SEM REAPROVEITAMENTO, INCLUSO PINTURA (FACE INTERNA DO RIPÃO 15CM) E PIQUETE COM TESTEMUNHA","m2    ",190.26,3,null,null,null,null,null,""]
[2,2,2,3,2,2,0,0,0,95,3,"F","Nível 2","Nível 2","2.2.","SINAPI",null,"TRANSPORTES","-",null,3,null,null,null,null,null,""]
["S",2,"S",0,2,2,0,0,0,0,0,"F","Serviço","Serviço","2.2.0.1.","SINAPI",72897,"CARGA MANUAL DE ENTULHO EM CAMINHAO BASCULANTE 6 M3","M3",13.31,3,null,null,null,null,null,""]
["S",{"$f":"IF(OR(C336=\"s\",C336=0),OFFSET(B336,-1,0),C336)","v":2},{"$f":"IF(OFFSET(C336,-1,0)=\"L\",1,IF(OFFSET(C336,-1,0)=1,2,IF(OR(A336=\"s\",A336=0),\"S\",IF(AND(OFFSET(C336,-1,0)=2,A336=4),3,IF(AND(OR(OFFSET(C336,-1,0)=\"s\",OFFSET(C336,-1,0)=0),A336<>\"s\",A336>OFFSET(B336,-1,0)),OFFSET(B336,-1,0),A336)))))","v":"S"},{"$f":"IF(OR(C336=\"S\",C336=0),0,IF(ISERROR(K336),J336,SMALL(J336:K336,1)))","v":0},2,2,0,0,0,0,0,"F","Serviço","Serviço","2.2.0.2.","SINAPI",72900,"TRANSPORTE DE ENTULHO COM CAMINHAO BASCULANTE 6 M3, RODOVIA PAVIMENTADA, DMT 0,5 A 1,0 KM","M3",13.31,3,null,null,null,null,null,""]
[2,2,2,7,2,3,0,0,0,92,7,"F","Nível 2","Nível 2","2.3.","SINAPI",null,"SERVIÇO EM TERRA","-",null,3,null,null,null,null,null,""]
[3,3,3,3,2,3,1,0,0,6,3,"F","Nível 3","Nível 3","2.3.1.","SINAPI",null,"BLOCO PADRÃO","-",null,3,null,null,null,null,null,""]
["S",3,"S",0,2,3,1,0,0,{"$f":"IF(OR($C339=\"S\",$C339=0),0,MATCH(0,OFFSET($D339,1,$C339,ROW($C$618)-ROW($C339)),0))","v":0},{"$f":"IF(OR($C339=\"S\",$C339=0),0,MATCH(OFFSET($D339,0,$C339)+1,OFFSET($D339,1,$C339,ROW($C$618)-ROW($C339)),0))","v":0},"F","Serviço","Serviço","2.3.1.1.","AGETOP",41140,"REGULARIZAÇÃO DO TERRENO SEM APILOAMENTO COM TRANSPORTE MANUAL DA TERRA ESCAVADA ","m2    ",190.26,3,null,null,null,null,null,""]
["S",3,"S",0,2,3,1,0,0,0,0,"F","Serviço","Serviço","2.3.1.2.","AGETOP",40905,"APILOAMENTO MECÂNICO","m2    ",190.26,3,null,null,null,null,null,""]
[3,3,3,3,2,3,2,0,0,3,163,"F","Nível 3","Nível 3","2.3.2.","SINAPI",null,"SPDA","-",null,3,null,null,null,null,null,""]
["S",3,"S",0,2,3,2,0,0,0,0,"F","Serviço","Serviço","2.3.2.1.","SINAPI",93358,"ESCAVAÇÃO MANUAL DE VALA COM PROFUNDIDADE MENOR OU IGUAL A 1,30 M. AF_03/2016","M3",7.92,3,null,null,null,null,null,"Referência: AGETOP - 40101"]
["S",3,"S",0,2,3,2,0,0,0,0,"F","Serviço","Serviço","2.3.2.2.","AGETOP",40902,"REATERRO COM APILOAMENTO","m3    ",7.92,3,null,null,null,null,null,""]
[2,2,2,42,2,4,0,0,0,85,42,"F","Nível 2","Nível 2","2.4.","SINAPI",null,"INSTALAÇÕES ELÉTRICAS","-",null,3,null,null,null,null,null,""]
[3,3,3,26,2,4,1,0,0,41,26,"F","Nível 3","Nível 3","2.4.1.","SINAPI",null,"INST. ELÉTRICAS","-",null,3,null,null,null,null,null,""]
["S",3,"S",0,2,4,1,0,0,0,0,"F","Serviço","Serviço","2.4.1.1.","AGETOP",70351,"BRACADEIRA METALICA TIPO \"U\" DIAM. 3/4\"","Un    ",60,3,null,null,null,null,null,""]
["S",3,"S",0,2,4,1,0,0,0,0,"F","Serviço","Serviço","2.4.1.2.","AGETOP",70352,"BRACADEIRA METALICA TIPO \"U\" DIAM. 1\"","Un    ",25,3,null,null,null,null,null,""]
[{"$f":"CHOOSE(1+LOG(1+2*(ORÇAMENTO.Nivel=\"Nível 1\")+4*(ORÇAMENTO.Nivel=\"Nível 2\")+8*(ORÇAMENTO.Nivel=\"Nível 3\")+16*(ORÇAMENTO.Nivel=\"Nível 4\")+32*(ORÇAMENTO.Nivel=\"Serviço\"),2),0,1,2,3,4,\"S\")","v":"S"},3,"S",0,2,4,1,0,{"$f":"IF(AND($C348<=4,$C348<>0),0,IF(AND($C348=\"S\",$Y348>0),OFFSET(I348,-1,0)+1,OFFSET(I348,-1,0)))","v":0},0,0,"F","Serviço","Serviço","2.4.1.3.","AGETOP",70421,"BUCHA E ARRUELA METALICA DIAM. 3/4\"","PR    ",2,3,null,null,null,null,null,""]
["S",3,"S",0,2,4,1,0,0,0,0,"F","Serviço","Serviço","2.4.1.4.","AGETOP",70422,"BUCHA E ARRUELA METALICA DIAM. 1\"","PR    ",2,3,null,null,null,null,null,""]
["S",3,"S",0,2,4,1,0,0,0,0,"F","Serviço","Serviço","2.4.1.5.","SINAPI",92980,"CABO DE COBRE FLEXÍVEL ISOLADO, 10 MM², ANTI-CHAMA 0,6/1,0 KV, PARA DISTRIBUIÇÃO - FORNECIMENTO E INSTALAÇÃO. AF_12/2015","M",1,3,null,null,null,null,null,""]
["S",3,"S",0,{"$f":"IF($C351=1,OFFSET(E351,-1,0)+1,OFFSET(E351,-1,0))","v":2},{"$f":"IF($C351=1,0,IF($C351=2,OFFSET(F351,-1,0)+1,OFFSET(F351,-1,0)))","v":4},{"$f":"IF(AND($C351<=2,$C351<>0),0,IF($C351=3,OFFSET(G351,-1,0)+1,OFFSET(G351,-1,0)))","v":1},{"$f":"IF(AND($C351<=3,$C351<>0),0,IF($C351=4,OFFSET(H351,-1,0)+1,OFFSET(H351,-1,0)))","v":0},0,0,0,"F","Serviço","Serviço","2.4.1.6.","AGETOP",70561,"CABO ISOLADO PP 3 X 2,5 MM2","M     ",100,3,null,null,null,null,null,""]
["S",3,"S",0,2,4,1,0,0,0,0,"F","Serviço","Serviço","2.4.1.7.","SINAPI",91926,"CABO DE COBRE FLEXÍVEL ISOLADO, 2,5 MM², ANTI-CHAMA 450/750 V, PARA CIRCUITOS TERMINAIS - FORNECIMENTO E INSTALAÇÃO. AF_12/2015","M",318,3,null,null,null,null,null,"Referência: AGETOP - 70563"]
["S",3,"S",0,2,4,1,0,0,0,0,"F","Serviço","Serviço","2.4.1.8.","SINAPI",91928,"CABO DE COBRE FLEXÍVEL ISOLADO, 4 MM², ANTI-CHAMA 450/750 V, PARA CIRCUITOS TERMINAIS - FORNECIMENTO E INSTALAÇÃO. AF_12/2015","M",306,3,null,null,null,null,null,"Referência: AGETOP - 70564"]
["S",3,"S",0,2,4,1,0,0,0,0,"F","Serviço","Serviço","2.4.1.9.","SINAPI",91937,"CAIXA OCTOGONAL 3\" X 3\", PVC, INSTALADA EM LAJE - FORNECIMENTO E INSTALAÇÃO. AF_12/2015","UN",22,3,null,null,null,null,null,""]
["S",3,"S",0,2,4,1,0,0,0,0,"F","Serviço","Serviço","2.4.1.10.","SINAPI",92868,"CAIXA RETANGULAR 4\" X 2\" MÉDIA (1,30 M DO PISO), METÁLICA, INSTALADA EM PAREDE - FORNECIMENTO E INSTALAÇÃO. AF_12/2015","UN",17,3,null,null,null,null,null,"Referência: AGETOP - 70691"]
["S",3,"S",0,2,4,1,0,0,0,0,"F","Serviço","Serviço","2.4.1.11.","AGETOP",70924,"CONDULETE DE PVC - CAIXA COM 5 ENTRADAS ","un    ",20,3,null,null,null,null,null,""]
["S",{"$f":"IF(OR(C357=\"s\",C357=0),OFFSET(B357,-1,0),C357)","v":3},{"$f":"IF(OFFSET(C357,-1,0)=\"L\",1,IF(OFFSET(C357,-1,0)=1,2,IF(OR(A357=\"s\",A357=0),\"S\",IF(AND(OFFSET(C357,-1,0)=2,A357=4),3,IF(AND(OR(OFFSET(C357,-1,0)=\"s\",OFFSET(C357,-1,0)=0),A357<>\"s\",A357>OFFSET(B357,-1,0)),OFFSET(B357,-1,0),A357)))))","v":"S"},{"$f":"IF(OR(C357=\"S\",C357=0),0,IF(ISERROR(K357),J357,SMALL(J357:K357,1)))","v":0},2,4,1,0,0,0,0,"F","Serviço","Serviço","2.4.1.12.","SINAPI",91902,"CURVA 90 GRAUS PARA ELETRODUTO, PVC, ROSCÁVEL, DN 25 MM (3/4\"), PARA CIRCUITOS TERMINAIS, INSTALADA EM LAJE - FORNECIMENTO E INSTALAÇÃO. AF_12/2015","UN",4,3,null,null,null,null,null,"Referência: AGETOP - 71141"]
["S",3,"S",0,2,4,1,0,0,0,0,"F","Serviço","Serviço","2.4.1.13.","SINAPI",91905,"CURVA 90 GRAUS PARA ELETRODUTO, PVC, ROSCÁVEL, DN 32 MM (1\"), PARA CIRCUITOS TERMINAIS, INSTALADA EM LAJE - FORNECIMENTO E INSTALAÇÃO. AF_12/2015","UN",4,3,null,null,null,null,null,"Referência: AGETOP - 71142"]
["S",3,"S",0,2,4,1,0,0,0,0,"F","Serviço","Serviço","2.4.1.14.","SINAPI",91844,"ELETRODUTO FLEXÍVEL CORRUGADO, PVC, DN 25 MM (3/4\"), PARA CIRCUITOS TERMINAIS, INSTALADO EM LAJE - FORNECIMENTO E INSTALAÇÃO. AF_12/2015","M",120,3,null,null,null,null,null,""]
["S",3,"S",0,2,4,1,0,0,0,0,"F","Serviço","Serviço","2.4.1.15.","SINAPI",91846,"ELETRODUTO FLEXÍVEL CORRUGADO, PVC, DN 32 MM (1\"), PARA CIRCUITOS TERMINAIS, INSTALADO EM LAJE - FORNECIMENTO E INSTALAÇÃO. AF_12/2015","M",20,3,null,null,null,null,null,""]
["S",3,"S",0,2,4,1,0,0,0,0,"F","Serviço","Serviço","2.4.1.16.","SINAPI",91871,"ELETRODUTO RÍGIDO ROSCÁVEL, PVC, DN 25 MM (3/4\"), PARA CIRCUITOS TERMINAIS, INSTALADO EM PAREDE - FORNECIMENTO E INSTALAÇÃO. AF_12/2015","M",50,3,null,null,null,null,null,"Referência: AGETOP - 71201"]
["S",3,"S",0,2,4,1,0,0,0,0,"F","Serviço","Serviço","2.4.1.17.","SINAPI",91872,"ELETRODUTO RÍGIDO ROSCÁVEL, PVC, DN 32 MM (1\"), PARA CIRCUITOS TERMINAIS, INSTALADO EM PAREDE - FORNECIMENTO E INSTALAÇÃO. AF_12/2015","M",50,3,null,null,null,null,null,"Referência: AGETOP - 71202"]
["S",3,"S",0,2,4,1,0,0,0,0,"F","Serviço","Serviço","2.4.1.18.","SINAPI",91953,"INTERRUPTOR SIMPLES (1 MÓDULO), 10A/250V, INCLUINDO SUPORTE E PLACA - FORNECIMENTO E INSTALAÇÃO. AF_12/2015","UN",4,3,null,null,null,null,null,"Referência: AGETOP - 71440"]
["S",3,"S",0,2,4,1,0,0,0,0,"F","Serviço","Serviço","2.4.1.19.","COMPOSIÇÃO","COMP 387_SEE","LÂMPADA LED TUBULAR 18W ","UN ",44,3,null,null,null,null,null,""]
["S",3,"S",0,2,4,1,0,0,0,0,"F","Serviço","Serviço","2.4.1.20.","SINAPI",97585,"LUMINÁRIA TIPO CALHA, DE SOBREPOR, COM 2 LÂMPADAS TUBULARES DE 18 W - FORNECIMENTO E INSTALAÇÃO. AF_11/2017","UN",22,3,null,null,null,null,null,""]
["S",3,"S",0,2,4,1,0,0,0,0,"F","Serviço","Serviço","2.4.1.21.","SINAPI",91884,"LUVA PARA ELETRODUTO, PVC, ROSCÁVEL, DN 25 MM (3/4\"), PARA CIRCUITOS TERMINAIS, INSTALADA EM PAREDE - FORNECIMENTO E INSTALAÇÃO. AF_12/2015","UN",60,3,null,null,null,null,null,"Referência: AGETOP - 71741"]
["S",3,"S",0,2,4,1,0,0,0,0,"F","Serviço","Serviço","2.4.1.22.","SINAPI",91885,"LUVA PARA ELETRODUTO, PVC, ROSCÁVEL, DN 32 MM (1\"), PARA CIRCUITOS TERMINAIS, INSTALADA EM PAREDE - FORNECIMENTO E INSTALAÇÃO. AF_12/2015","UN",25,3,null,null,null,null,null,"Referência: AGETOP - 71742"]
["S",3,"S",0,2,4,1,0,0,0,0,"F","Serviço","Serviço","2.4.1.23.","AGETOP",72385,"TAMPA CEGA PARA CONDULETE DE PVC","Un    ",20,3,null,null,null,null,null,""]
["S",3,"S",0,2,4,1,0,0,0,0,"F","Serviço","Serviço","2.4.1.24.","SINAPI",92000,"TOMADA BAIXA DE EMBUTIR (1 MÓDULO), 2P+T 10 A, INCLUINDO SUPORTE E PLACA - FORNECIMENTO E INSTALAÇÃO. AF_12/2015","UN",7,3,null,null,null,null,null,"Referência: AGETOP - 72578"]
["S",3,"S",0,2,4,1,0,0,0,0,"F","Serviço","Serviço","2.4.1.25.","SINAPI",91993,"TOMADA ALTA DE EMBUTIR (1 MÓDULO), 2P+T 20 A, INCLUINDO SUPORTE E PLACA - FORNECIMENTO E INSTALAÇÃO. AF_12/2015","UN",6,3,null,null,null,null,null,"Referência: AGETOP - 72585"]
[3,3,3,15,2,4,2,0,0,15,133,"F","Nível 3","Nível 3","2.4.2.","SINAPI",null,"SPDA","-",null,3,null,null,null,null,null,""]
["S",3,"S",0,2,4,2,0,0,0,0,"F","Serviço","Serviço","2.4.2.1.","SINAPI",72315,"TERMINAL AEREO EM ACO GALVANIZADO COM BASE DE FIXACAO H = 30CM","UN",13,3,null,null,null,null,null,""]
["S",3,"S",0,2,4,2,0,0,0,0,"F","Serviço","Serviço","2.4.2.2.","COMPOSIÇÃO","COMP 036_SEE","PRESILHA LATÃO 16/35MM 5MM+PARAF FENDA ","UN ",140,3,null,null,null,null,null,""]
["S",3,"S",0,2,4,2,0,0,0,0,"F","Serviço","Serviço","2.4.2.3.","SINAPI",93203,"FIXAÇÃO (ENCUNHAMENTO) DE ALVENARIA DE VEDAÇÃO COM ESPUMA DE POLIURETANO EXPANSIVA. AF_03/2016","M",1,3,null,null,null,null,null,""]
["S",3,"S",0,2,4,2,0,0,0,0,"F","Serviço","Serviço","2.4.2.4.","AGETOP",71035,"CONECTOR TIPO PARAFUSO FENDIDO 35 MM2","Un    ",15,3,null,null,null,null,null,""]
["S",3,"S",0,2,4,2,0,0,0,0,"F","Serviço","Serviço","2.4.2.5.","AGETOP",70543,"CABO DE COBRE NÚ No. 35 MM2","M     ",118,3,null,null,null,null,null,""]
["S",3,"S",0,2,4,2,0,0,0,0,"F","Serviço","Serviço","2.4.2.6.","AGETOP",70544,"CABO DE COBRE NÚ No. 50 MM2","M     ",68,3,null,null,null,null,null,""]
["S",3,"S",0,2,4,2,0,0,0,0,"F","Serviço","Serviço","2.4.2.7.","SINAPI",91872,"ELETRODUTO RÍGIDO ROSCÁVEL, PVC, DN 32 MM (1\"), PARA CIRCUITOS TERMINAIS, INSTALADO EM PAREDE - FORNECIMENTO E INSTALAÇÃO. AF_12/2015","M",15,3,null,null,null,null,null,"Referência: AGETOP - 71202"]
["S",3,"S",0,2,4,2,0,0,0,0,"F","Serviço","Serviço","2.4.2.8.","AGETOP",70372,"BRACADEIRA METALICA TIPO \"D\" DIAM. 1\"","Un    ",7,3,null,null,null,null,null,""]
["S",3,"S",0,2,4,2,0,0,0,0,"F","Serviço","Serviço","2.4.2.9.","SINAPI",96985,"HASTE DE ATERRAMENTO 5/8  PARA SPDA - FORNECIMENTO E INSTALAÇÃO. AF_12/2017","UN",8,3,null,null,null,null,null,""]
["S",3,"S",0,2,4,2,0,0,0,0,"F","Serviço","Serviço","2.4.2.10.","SINAPI",98111,"CAIXA DE INSPEÇÃO PARA ATERRAMENTO, CIRCULAR, EM POLIETILENO, DIÂMETRO INTERNO = 0,3 M. AF_05/2018","UN",1,3,null,null,null,null,null,""]
["S",3,"S",0,2,4,2,0,0,0,0,"F","Serviço","Serviço","2.4.2.11.","AGETOP",70255,"ATERRAMENTO - SOLDA EXOTÉRMICA - CARTUCHO 90 G","un    ",8,3,null,null,null,null,null,""]
["S",3,"S",0,2,4,2,0,0,0,0,"F","Serviço","Serviço","2.4.2.12.","COMPOSIÇÃO","COMP 039_SEE","MOLDE GRAF CGT 5/8 50MM C","UN ",3,3,null,null,null,null,null,""]
["S",3,"S",0,2,4,2,0,0,0,0,"F","Serviço","Serviço","2.4.2.13.","COMPOSIÇÃO","COMP 550_SEE","ALIC P/MOLDE C-84","UN ",1,3,null,null,null,null,null,""]
["S",3,"S",0,2,4,2,0,0,0,0,"F","Serviço","Serviço","2.4.2.14.","COMPOSIÇÃO","COMP 048_SEE","HASTE ROSQUEADA \"TIRANTE\" 3/8\"","M",8,3,null,null,null,null,null,""]
[2,2,2,8,2,5,0,0,0,43,8,"F","Nível 2","Nível 2","2.5.","SINAPI",null,"INSTALAÇÕES ESPECIAIS","-",null,3,null,null,null,null,null,""]
[3,3,3,7,2,5,1,0,0,7,96,"F","Nível 3","Nível 3","2.5.1.","SINAPI",null,"INSTALAÇÕES DE INCÊNDIO","-",null,3,null,null,null,null,null,""]
["S",3,"S",0,2,5,1,0,0,0,0,"F","Serviço","Serviço","2.5.1.1.","AGETOP",85006,"EXTINTOR MULTI USO EM PO A B C (6 KG) - CAPACIDADE EXTINTORA 3A 20BC","un    ",1,3,null,null,null,null,null,""]
["S",3,"S",0,2,5,1,0,0,0,0,"F","Serviço","Serviço","2.5.1.2.","SINAPI",97599,"LUMINÁRIA DE EMERGÊNCIA - FORNECIMENTO E INSTALAÇÃO. AF_11/2017","UN",3,3,null,null,null,null,null,""]
["S",3,"S",0,2,5,1,0,0,0,0,"F","Serviço","Serviço","2.5.1.3.","COMPOSIÇÃO","COMP 024_SEE","SINALIZADOR FOTOLUMINESCENTE PARA EXTINTOR","UN ",1,3,null,null,null,null,null,""]
["S",3,"S",0,2,5,1,0,0,0,0,"F","Serviço","Serviço","2.5.1.4.","COMPOSIÇÃO","COMP 025_SEE","SINALIZADOR FOTOLUMINESCENTE DE EMERGÊNCIA","UN ",4,3,null,null,null,null,null,""]
["S",3,"S",0,2,5,1,0,0,0,0,"F","Serviço","Serviço","2.5.1.5.","COMPOSIÇÃO","COMP 277_SEE","MARCAÇÃO NO PISO - 1X1 M PARA EXTINTOR","M2",1,3,null,null,null,null,null,""]
["S",3,"S",0,2,5,1,0,0,0,0,"F","Serviço","Serviço","2.5.1.6.","COMPOSIÇÃO","COMP 412_SEE","PLACA DE SINALIZAÇÃO EM PVC COD 17 - (316X158) MENSAGEM \"SAÍDA\"","UN ",3,3,null,null,null,null,null,""]
[2,2,2,5,2,6,0,0,0,35,5,"F","Nível 2","Nível 2","2.6.","AGETOP",null,"ALVENARIAS E DIVISÓRIAS","-",null,3,null,null,null,null,null,""]
["S",2,"S",0,2,6,0,0,0,0,0,"F","Serviço","Serviço","2.6.0.1.","SINAPI",87503,"ALVENARIA DE VEDAÇÃO DE BLOCOS CERÂMICOS FURADOS NA HORIZONTAL DE 9X19X19CM (ESPESSURA 9CM) DE PAREDES COM ÁREA LÍQUIDA MAIOR OU IGUAL A 6M² SEM VÃOS E ARGAMASSA DE ASSENTAMENTO COM PREPARO EM BETONEIRA. AF_06/2014","M2",81.16,3,null,null,null,null,null,"Referência: AGETOP - 100201"]
["S",2,"S",0,2,6,0,0,0,0,0,"F","Serviço","Serviço","2.6.0.2.","SINAPI",87519,"ALVENARIA DE VEDAÇÃO DE BLOCOS CERÂMICOS FURADOS NA HORIZONTAL DE 9X19X19CM (ESPESSURA 9CM) DE PAREDES COM ÁREA LÍQUIDA MAIOR OU IGUAL A 6M² COM VÃOS E ARGAMASSA DE ASSENTAMENTO COM PREPARO EM BETONEIRA. AF_06/2014","M2",100.2,3,null,null,null,null,null,"Referência: AGETOP - 100201"]
["S",2,"S",0,2,6,0,0,0,0,0,"F","Serviço","Serviço","2.6.0.3.","SINAPI",93201,"FIXAÇÃO (ENCUNHAMENTO) DE ALVENARIA DE VEDAÇÃO COM ARGAMASSA APLICADA COM COLHER. AF_03/2016","M",71.7,3,null,null,null,null,null,""]
["S",2,"S",0,2,6,0,0,0,0,0,"F","Serviço","Serviço","2.6.0.4.","SINAPI","74106/1","IMPERMEABILIZACAO DE ESTRUTURAS ENTERRADAS, COM TINTA ASFALTICA, DUAS DEMAOS.","M2",74.88,3,null,null,null,null,null,""]
[2,2,2,4,2,7,0,0,0,30,4,"F","Nível 2","Nível 2","2.7.",null,null,"ESQUADRIAS METÁLICAS","-",null,3,null,null,null,null,null,""]
["S",2,"S",0,2,7,0,0,0,0,0,"F","Serviço","Serviço","2.7.0.1.","SINAPI",94562,"JANELA DE AÇO DE CORRER, 4 FOLHAS, FIXAÇÃO COM ARGAMASSA, SEM VIDROS, PADRONIZADA. AF_07/2016","M2",14.4,3,null,null,null,null,null,"Referência: AGETOP - 180401"]
["S",2,"S",0,2,7,0,0,0,0,0,"F","Serviço","Serviço","2.7.0.2.","SINAPI",94559,"JANELA DE AÇO BASCULANTE, FIXAÇÃO COM ARGAMASSA, SEM VIDROS, PADRONIZADA. AF_07/2016","M2",7.2,3,null,null,null,null,null,"Referência: AGETOP - 180404"]
["S",2,"S",0,2,7,0,0,0,0,0,"F","Serviço","Serviço","2.7.0.3.","SINAPI","73933/4","PORTA DE FERRO DE ABRIR TIPO BARRA CHATA, COM REQUADRO E GUARNICAO COMPLETA","M2",5.04,3,null,null,null,null,null,"Referência: AGETOP - 180501"]
[2,2,2,2,2,8,0,0,0,{"$f":"IF(OR($C403=\"S\",$C403=0),0,MATCH(0,OFFSET($D403,1,$C403,ROW($C$618)-ROW($C403)),0))","v":26},{"$f":"IF(OR($C403=\"S\",$C403=0),0,MATCH(OFFSET($D403,0,$C403)+1,OFFSET($D403,1,$C403,ROW($C$618)-ROW($C403)),0))","v":2},"F","Nível 2","Nível 2","2.8.",null,null,"VIDROS","-",null,3,null,null,null,null,null,""]
["S",2,"S",0,2,8,0,0,0,0,0,"F","Serviço","Serviço","2.8.0.1.","SINAPI",72117,"VIDRO LISO COMUM TRANSPARENTE, ESPESSURA 4MM","M2",21.6,3,null,null,null,null,null,"Referência: AGETOP - 190102"]
[2,2,2,5,2,9,0,0,0,24,5,"F","Nível 2","Nível 2","2.9.",null,null,"REVESTIMENTO DE PAREDE","-",null,3,null,null,null,null,null,""]
["S",2,"S",0,2,9,0,0,0,0,0,"F","Serviço","Serviço","2.9.0.1.","SINAPI",87879,"CHAPISCO APLICADO EM ALVENARIAS E ESTRUTURAS DE CONCRETO INTERNAS, COM COLHER DE PEDREIRO.  ARGAMASSA TRAÇO 1:3 COM PREPARO EM BETONEIRA 400L. AF_06/2014","M2",338.27,3,null,null,null,null,null,""]
["S",2,"S",0,2,9,0,0,0,0,0,"F","Serviço","Serviço","2.9.0.2.","SINAPI",87775,"EMBOÇO OU MASSA ÚNICA EM ARGAMASSA TRAÇO 1:2:8, PREPARO MECÂNICO COM BETONEIRA 400 L, APLICADA MANUALMENTE EM PANOS DE FACHADA COM PRESENÇA DE VÃOS, ESPESSURA DE 25 MM. AF_06/2014","M2",63.79,3,null,null,null,null,null,""]
["S",2,"S",0,2,9,0,0,0,0,0,"F","Serviço","Serviço","2.9.0.3.","SINAPI",87792,"EMBOÇO OU MASSA ÚNICA EM ARGAMASSA TRAÇO 1:2:8, PREPARO MECÂNICO COM BETONEIRA 400 L, APLICADA MANUALMENTE EM PANOS CEGOS DE FACHADA (SEM PRESENÇA DE VÃOS), ESPESSURA DE 25 MM. AF_06/2014","M2",50.02,3,null,null,null,null,null,""]
["S",2,"S",0,2,9,0,0,0,0,0,"F","Serviço","Serviço","2.9.0.4.","SINAPI",87548,"MASSA ÚNICA, PARA RECEBIMENTO DE PINTURA, EM ARGAMASSA TRAÇO 1:2:8, PREPARO MANUAL, APLICADA MANUALMENTE EM FACES INTERNAS DE PAREDES, ESPESSURA DE 10MM, COM EXECUÇÃO DE TALISCAS. AF_06/2014","M2",224.46,3,null,null,null,null,null,"Referência: AGETOP - 200500"]
[2,2,2,2,2,10,0,0,0,19,2,"F","Nível 2","Nível 2","2.10.",null,null,"FORROS","-",null,3,null,null,null,null,null,""]
[{"$f":"CHOOSE(1+LOG(1+2*(ORÇAMENTO.Nivel=\"Nível 1\")+4*(ORÇAMENTO.Nivel=\"Nível 2\")+8*(ORÇAMENTO.Nivel=\"Nível 3\")+16*(ORÇAMENTO.Nivel=\"Nível 4\")+32*(ORÇAMENTO.Nivel=\"Serviço\"),2),0,1,2,3,4,\"S\")","v":"S"},2,"S",0,2,10,0,0,{"$f":"IF(AND($C411<=4,$C411<>0),0,IF(AND($C411=\"S\",$Y411>0),OFFSET(I411,-1,0)+1,OFFSET(I411,-1,0)))","v":0},0,0,"F","Serviço","Serviço","2.10.0.1.","SINAPI",87414,"APLICAÇÃO MANUAL DE GESSO DESEMPENADO (SEM TALISCAS) EM TETO DE AMBIENTES DE ÁREA MAIOR QUE 10M², ESPESSURA DE 1,0CM. AF_06/2014","M2",145.53,3,null,null,null,null,null,"Referência: AGETOP - 210515"]
[2,2,2,5,2,11,0,0,0,17,5,"F","Nível 2","Nível 2","2.11.","SINAPI",null,"REVESTIMENTO DE PISO","-",null,3,null,null,null,null,null,""]
["S",2,"S",0,2,11,0,0,0,0,0,"F","Serviço","Serviço","2.11.0.1.","SINAPI",95240,"LASTRO DE CONCRETO MAGRO, APLICADO EM PISOS OU RADIERS, ESPESSURA DE 3 CM. AF_07/2016","M2",179.5,3,null,null,null,null,null,""]
["S",2,"S",0,{"$f":"IF($C414=1,OFFSET(E414,-1,0)+1,OFFSET(E414,-1,0))","v":2},{"$f":"IF($C414=1,0,IF($C414=2,OFFSET(F414,-1,0)+1,OFFSET(F414,-1,0)))","v":11},{"$f":"IF(AND($C414<=2,$C414<>0),0,IF($C414=3,OFFSET(G414,-1,0)+1,OFFSET(G414,-1,0)))","v":0},{"$f":"IF(AND($C414<=3,$C414<>0),0,IF($C414=4,OFFSET(H414,-1,0)+1,OFFSET(H414,-1,0)))","v":0},0,0,0,"F","Serviço","Serviço","2.11.0.2.","SINAPI",94992,"EXECUÇÃO DE PASSEIO (CALÇADA) OU PISO DE CONCRETO COM CONCRETO MOLDADO IN LOCO, FEITO EM OBRA, ACABAMENTO CONVENCIONAL, ESPESSURA 6 CM, ARMADO. AF_07/2016","M2",45.43,3,null,null,null,null,null,""]
["S",2,"S",0,2,11,0,0,0,0,0,"F","Serviço","Serviço","2.11.0.3.","SINAPI",84191,"PISO EM GRANILITE, MARMORITE OU GRANITINA ESPESSURA 8 MM, INCLUSO JUNTAS DE DILATACAO PLASTICAS","M2",186.6,3,null,null,null,null,null,"Referência: AGETOP - 221101"]
["S",2,"S",0,2,11,0,0,0,0,0,"F","Serviço","Serviço","2.11.0.4.","AGETOP",221104,"RASPAGEM E APLICAÇÃO RESINA ACRÍLICA DUAS DEMÃOS","m2    ",186.6,3,null,null,null,null,null,""]
[2,2,2,2,2,12,0,0,0,12,2,"F","Nível 2","Nível 2","2.12.","SINAPI",null,"MARCENARIA","-",null,3,null,null,null,null,null,""]
["S",2,"S",0,2,12,0,0,0,0,0,"F","Serviço","Serviço","2.12.0.1.","AGETOP",240106,"BATE CARTEIRA ENVERNIZADO E ASSENT. 2,5 X 12 CM","M     ",61.02,3,null,null,null,null,null,""]
[2,2,2,8,2,13,0,0,0,10,8,"F","Nível 2","Nível 2","2.13.","SINAPI",null,"PINTURA","-",null,3,null,null,null,null,null,""]
["S",{"$f":"IF(OR(C420=\"s\",C420=0),OFFSET(B420,-1,0),C420)","v":2},{"$f":"IF(OFFSET(C420,-1,0)=\"L\",1,IF(OFFSET(C420,-1,0)=1,2,IF(OR(A420=\"s\",A420=0),\"S\",IF(AND(OFFSET(C420,-1,0)=2,A420=4),3,IF(AND(OR(OFFSET(C420,-1,0)=\"s\",OFFSET(C420,-1,0)=0),A420<>\"s\",A420>OFFSET(B420,-1,0)),OFFSET(B420,-1,0),A420)))))","v":"S"},{"$f":"IF(OR(C420=\"S\",C420=0),0,IF(ISERROR(K420),J420,SMALL(J420:K420,1)))","v":0},2,13,0,0,0,0,0,"F","Serviço","Serviço","2.13.0.1.","SINAPI",88423,"APLICAÇÃO MANUAL DE PINTURA COM TINTA TEXTURIZADA ACRÍLICA EM PAREDES EXTERNAS DE CASAS, UMA COR. AF_06/2014","M2",25.020000000000003,3,null,null,null,null,null,"Referência: AGETOP - 260601"]
["S",2,"S",0,2,13,0,0,0,0,0,"F","Serviço","Serviço","2.13.0.2.","SINAPI",88489,"APLICAÇÃO MANUAL DE PINTURA COM TINTA LÁTEX ACRÍLICA EM PAREDES, DUAS DEMÃOS. AF_06/2014","M2",156.38999999999999,3,null,null,null,null,null,"Referência: AGETOP - 261001"]
["S",2,"S",0,2,13,0,0,0,0,0,"F","Serviço","Serviço","2.13.0.3.","SINAPI",88497,"APLICAÇÃO E LIXAMENTO DE MASSA LÁTEX EM PAREDES, DUAS DEMÃOS. AF_06/2014","M2",323.13,3,null,null,null,null,null,"Referência: AGETOP - 261300"]
["S",2,"S",0,2,13,0,0,0,0,0,"F","Serviço","Serviço","2.13.0.4.","AGETOP",261550,"PINT.ESMALTE SINT.PAREDES - 2 DEM.C/SELADOR","m2    ",166.74,3,null,null,null,null,null,""]
["S",2,"S",0,2,13,0,0,0,0,0,"F","Serviço","Serviço","2.13.0.5.","SINAPI",88496,"APLICAÇÃO E LIXAMENTO DE MASSA LÁTEX EM TETO, DUAS DEMÃOS. AF_06/2014","M2",145.53,3,null,null,null,null,null,"Referência: AGETOP - 261300"]
["S",2,"S",0,2,13,0,0,0,0,0,"F","Serviço","Serviço","2.13.0.6.","SINAPI",88488,"APLICAÇÃO MANUAL DE PINTURA COM TINTA LÁTEX ACRÍLICA EM TETO, DUAS DEMÃOS. AF_06/2014","M2",145.53,3,null,null,null,null,null,""]
["S",2,"S",0,2,13,0,0,0,0,0,"F","Serviço","Serviço","2.13.0.7.","SINAPI","74145/1","PINTURA ESMALTE FOSCO, DUAS DEMAOS, SOBRE SUPERFICIE METALICA, INCLUSO UMA DEMAO DE FUNDO ANTICORROSIVO. UTILIZACAO DE REVOLVER ( AR-COMPRIMIDO).","M2",58.32,3,null,null,null,null,null,"Referência: AGETOP - 261602"]
[2,2,2,2,2,14,0,0,0,2,{"$error":"#N/A"},"F","Nível 2","Nível 2","2.14.","SINAPI",null,"DIVERSOS","-",null,3,null,null,null,null,null,""]
["S",2,"S",0,2,14,0,0,0,0,0,"F","Serviço","Serviço","2.14.0.1.","AGETOP",271210,"QUADRO DE GIZ EMBOÇO/PINTURA COMPLETO","m2    ",15.12,3,null,null,null,null,null,""]
[1,1,1,121,3,0,0,0,0,189,121,"F","Nível 1","Nível 1","3.",null,null,"BLOCO SANITÁRIO PADRÃO SEDUC 2013","UN",1,1,null,null,null,null,null,""]
[2,2,2,2,3,1,0,0,0,120,2,"F","Nível 2","Nível 2","3.1.",null,null,"SERVIÇOS PRELIMINARES","-",null,1,null,null,null,null,null,""]
["S",2,"S",0,3,1,0,0,0,0,0,"F","Serviço","Serviço","3.1.0.1.","AGETOP",20701,"LOCAÇÃO DA OBRA, EXECUÇÃO DE GABARITO SEM REAPROVEITAMENTO, INCLUSO PINTURA (FACE INTERNA DO RIPÃO 15CM) E PIQUETE COM TESTEMUNHA","m2    ",48.43,1,null,null,null,null,null,""]
[2,2,2,3,3,2,0,0,0,118,3,"F","Nível 2","Nível 2","3.2.",null,null,"TRANSPORTES","-",null,1,null,null,null,null,null,""]
["S",2,"S",0,3,2,0,0,0,0,0,"F","Serviço","Serviço","3.2.0.1.","SINAPI",72900,"TRANSPORTE DE ENTULHO COM CAMINHAO BASCULANTE 6 M3, RODOVIA PAVIMENTADA, DMT 0,5 A 1,0 KM","M3",18,1,null,null,null,null,null,""]
["S",2,"S",0,3,2,0,0,0,0,0,"F","Serviço","Serviço","3.2.0.2.","SINAPI",72897,"CARGA MANUAL DE ENTULHO EM CAMINHAO BASCULANTE 6 M3","M3",18,1,null,null,null,null,null,""]
[2,2,2,3,3,3,0,0,0,115,3,"F","Nível 2","Nível 2","3.3.",null,null,"SERVIÇO EM TERRA","-",null,1,null,null,null,null,null,""]
["S",2,"S",0,3,3,0,0,0,0,0,"F","Serviço","Serviço","3.3.0.1.","SINAPI",79472,"REGULARIZACAO DE SUPERFICIES EM TERRA COM MOTONIVELADORA","M2",48.43,1,null,null,null,null,null,""]
["S",2,"S",0,3,3,0,0,0,0,0,"F","Serviço","Serviço","3.3.0.2.","SINAPI","74005/1","COMPACTACAO MECANICA, SEM CONTROLE DO GC (C/COMPACTADOR PLACA 400 KG)","M3",9.6859999999999999,1,null,null,null,null,null,"Referência: AGETOP - 41009"]
[2,2,2,20,3,4,0,0,0,112,20,"F","Nível 2","Nível 2","3.4.",null,null,"INSTALAÇÕES ELÉTRICAS","-",null,1,null,null,null,null,null,""]
["S",2,"S",0,3,4,0,0,0,0,0,"F","Serviço","Serviço","3.4.0.1.","SINAPI",91182,"FIXAÇÃO DE TUBOS HORIZONTAIS DE PPR DIÂMETROS MENORES OU IGUAIS A 40 MM COM ABRAÇADEIRA METÁLICA FLEXÍVEL 18 MM, FIXADA DIRETAMENTE NA LAJE. AF_05/2015","M",10,1,null,null,null,null,null,""]
[{"$f":"CHOOSE(1+LOG(1+2*(ORÇAMENTO.Nivel=\"Nível 1\")+4*(ORÇAMENTO.Nivel=\"Nível 2\")+8*(ORÇAMENTO.Nivel=\"Nível 3\")+16*(ORÇAMENTO.Nivel=\"Nível 4\")+32*(ORÇAMENTO.Nivel=\"Serviço\"),2),0,1,2,3,4,\"S\")","v":"S"},2,"S",0,3,4,0,0,{"$f":"IF(AND($C440<=4,$C440<>0),0,IF(AND($C440=\"S\",$Y440>0),OFFSET(I440,-1,0)+1,OFFSET(I440,-1,0)))","v":0},0,0,"F","Serviço","Serviço","3.4.0.2.","SINAPI",95541,"FIXAÇÃO UTILIZANDO PARAFUSO E BUCHA DE NYLON, SOMENTE MÃO DE OBRA. AF_10/2016","UN",24,1,null,null,null,null,null,""]
["S",2,"S",0,3,4,0,0,0,0,0,"F","Serviço","Serviço","3.4.0.3.","SINAPI",91927,"CABO DE COBRE FLEXÍVEL ISOLADO, 2,5 MM², ANTI-CHAMA 0,6/1,0 KV, PARA CIRCUITOS TERMINAIS - FORNECIMENTO E INSTALAÇÃO. AF_12/2015","M",100,1,null,null,null,null,null,"Referência: AGETOP - 70581"]
["S",2,"S",0,3,4,0,0,0,0,0,"F","Serviço","Serviço","3.4.0.4.","SINAPI",91931,"CABO DE COBRE FLEXÍVEL ISOLADO, 6 MM², ANTI-CHAMA 0,6/1,0 KV, PARA CIRCUITOS TERMINAIS - FORNECIMENTO E INSTALAÇÃO. AF_12/2015","M",20,1,null,null,null,null,null,"Referência: AGETOP - 70583"]
["S",2,"S",0,{"$f":"IF($C443=1,OFFSET(E443,-1,0)+1,OFFSET(E443,-1,0))","v":3},{"$f":"IF($C443=1,0,IF($C443=2,OFFSET(F443,-1,0)+1,OFFSET(F443,-1,0)))","v":4},{"$f":"IF(AND($C443<=2,$C443<>0),0,IF($C443=3,OFFSET(G443,-1,0)+1,OFFSET(G443,-1,0)))","v":0},{"$f":"IF(AND($C443<=3,$C443<>0),0,IF($C443=4,OFFSET(H443,-1,0)+1,OFFSET(H443,-1,0)))","v":0},0,0,0,"F","Serviço","Serviço","3.4.0.5.","SINAPI",92868,"CAIXA RETANGULAR 4\" X 2\" MÉDIA (1,30 M DO PISO), METÁLICA, INSTALADA EM PAREDE - FORNECIMENTO E INSTALAÇÃO. AF_12/2015","UN",5,1,null,null,null,null,null,"Referência: AGETOP - 70691"]
["S",2,"S",0,3,4,0,0,0,0,0,"F","Serviço","Serviço","3.4.0.6.","SINAPI",92865,"CAIXA OCTOGONAL 4\" X 4\", METÁLICA, INSTALADA EM LAJE - FORNECIMENTO E INSTALAÇÃO. AF_12/2015","UN",7,1,null,null,null,null,null,"Referência: AGETOP - 70682"]
["S",2,"S",0,3,4,0,0,0,0,0,"F","Serviço","Serviço","3.4.0.7.","SINAPI",83446,"CAIXA DE PASSAGEM 30X30X40 COM TAMPA E DRENO BRITA","UN",1,1,null,null,null,null,null,""]
["S",2,"S",0,3,4,0,0,0,0,0,"F","Serviço","Serviço","3.4.0.8.","SINAPI",91914,"CURVA 90 GRAUS PARA ELETRODUTO, PVC, ROSCÁVEL, DN 25 MM (3/4\"), PARA CIRCUITOS TERMINAIS, INSTALADA EM PAREDE - FORNECIMENTO E INSTALAÇÃO. AF_12/2015","UN",7,1,null,null,null,null,null,""]
["S",2,"S",0,3,4,0,0,0,0,0,"F","Serviço","Serviço","3.4.0.9.","SINAPI",91917,"CURVA 90 GRAUS PARA ELETRODUTO, PVC, ROSCÁVEL, DN 32 MM (1\"), PARA CIRCUITOS TERMINAIS, INSTALADA EM PAREDE - FORNECIMENTO E INSTALAÇÃO. AF_12/2015","UN",3,1,null,null,null,null,null,""]
["S",2,"S",0,3,4,0,0,0,0,0,"F","Serviço","Serviço","3.4.0.10.","SINAPI",93358,"ESCAVAÇÃO MANUAL DE VALA COM PROFUNDIDADE MENOR OU IGUAL A 1,30 M. AF_03/2016","M3",0.51200000000000001,1,null,null,null,null,null,"Referência: AGETOP - 40101"]
["S",{"$f":"IF(OR(C449=\"s\",C449=0),OFFSET(B449,-1,0),C449)","v":2},{"$f":"IF(OFFSET(C449,-1,0)=\"L\",1,IF(OFFSET(C449,-1,0)=1,2,IF(OR(A449=\"s\",A449=0),\"S\",IF(AND(OFFSET(C449,-1,0)=2,A449=4),3,IF(AND(OR(OFFSET(C449,-1,0)=\"s\",OFFSET(C449,-1,0)=0),A449<>\"s\",A449>OFFSET(B449,-1,0)),OFFSET(B449,-1,0),A449)))))","v":"S"},{"$f":"IF(OR(C449=\"S\",C449=0),0,IF(ISERROR(K449),J449,SMALL(J449:K449,1)))","v":0},3,4,0,0,0,0,0,"F","Serviço","Serviço","3.4.0.11.","SINAPI",91871,"ELETRODUTO RÍGIDO ROSCÁVEL, PVC, DN 25 MM (3/4\"), PARA CIRCUITOS TERMINAIS, INSTALADO EM PAREDE - FORNECIMENTO E INSTALAÇÃO. AF_12/2015","M",30,1,null,null,null,null,null,"Referência: AGETOP - 71201"]
["S",2,"S",0,3,4,0,0,0,0,0,"F","Serviço","Serviço","3.4.0.12.","SINAPI",91872,"ELETRODUTO RÍGIDO ROSCÁVEL, PVC, DN 32 MM (1\"), PARA CIRCUITOS TERMINAIS, INSTALADO EM PAREDE - FORNECIMENTO E INSTALAÇÃO. AF_12/2015","M",6,1,null,null,null,null,null,"Referência: AGETOP - 71202"]
["S",2,"S",0,3,4,0,0,0,0,0,"F","Serviço","Serviço","3.4.0.13.","SINAPI",91953,"INTERRUPTOR SIMPLES (1 MÓDULO), 10A/250V, INCLUINDO SUPORTE E PLACA - FORNECIMENTO E INSTALAÇÃO. AF_12/2015","UN",4,1,null,null,null,null,null,"Referência: AGETOP - 71440"]
["S",2,"S",0,3,4,0,0,0,0,0,"F","Serviço","Serviço","3.4.0.14.","AGETOP",71450,"INTERRUPTOR DIFERENCIAL RESIDUAL (D.R.) BIPOLAR DE 25A-30mA","Un    ",1,1,null,null,null,null,null,""]
["S",2,"S",0,3,4,0,0,0,0,0,"F","Serviço","Serviço","3.4.0.15.","SINAPI",97585,"LUMINÁRIA TIPO CALHA, DE SOBREPOR, COM 2 LÂMPADAS TUBULARES DE 18 W - FORNECIMENTO E INSTALAÇÃO. AF_11/2017","UN",5,1,null,null,null,null,null,""]
["S",2,"S",0,3,4,0,0,0,0,0,"F","Serviço","Serviço","3.4.0.16.","SINAPI",97586,"LUMINÁRIA TIPO CALHA, DE SOBREPOR, COM 2 LÂMPADAS TUBULARES DE 36 W - FORNECIMENTO E INSTALAÇÃO. AF_11/2017","UN",2,1,null,null,null,null,null,""]
["S",2,"S",0,3,4,0,0,0,0,0,"F","Serviço","Serviço","3.4.0.17.","SINAPI",91884,"LUVA PARA ELETRODUTO, PVC, ROSCÁVEL, DN 25 MM (3/4\"), PARA CIRCUITOS TERMINAIS, INSTALADA EM PAREDE - FORNECIMENTO E INSTALAÇÃO. AF_12/2015","UN",10,1,null,null,null,null,null,"Referência: AGETOP - 71741"]
["S",2,"S",0,3,4,0,0,0,0,0,"F","Serviço","Serviço","3.4.0.18.","SINAPI",91885,"LUVA PARA ELETRODUTO, PVC, ROSCÁVEL, DN 32 MM (1\"), PARA CIRCUITOS TERMINAIS, INSTALADA EM PAREDE - FORNECIMENTO E INSTALAÇÃO. AF_12/2015","UN",2,1,null,null,null,null,null,"Referência: AGETOP - 71742"]
["S",2,"S",0,3,4,0,0,0,0,0,"F","Serviço","Serviço","3.4.0.19.","SINAPI",91993,"TOMADA ALTA DE EMBUTIR (1 MÓDULO), 2P+T 20 A, INCLUINDO SUPORTE E PLACA - FORNECIMENTO E INSTALAÇÃO. AF_12/2015","UN",1,1,null,null,null,null,null,"Referência: AGETOP - 72585"]
[2,2,2,56,3,5,0,0,0,92,56,"F","Nível 2","Nível 2","3.5.",null,null,"INSTALAÇÕES HIDROSSANITÁRIAS","-",null,1,null,null,null,null,null,""]
[3,3,3,24,3,5,1,0,0,55,24,"F","Nível 3","Nível 3","3.5.1.","SINAPI",null,"PEÇAS E ACESSÓRIOS","-",null,1,null,null,null,null,null,""]
["S",3,"S",0,3,5,1,0,0,0,0,"F","Serviço","Serviço","3.5.1.1.","SINAPI",95470,"VASO SANITARIO SIFONADO CONVENCIONAL COM LOUÇA BRANCA, INCLUSO CONJUNTO DE LIGAÇÃO PARA BACIA SANITÁRIA AJUSTÁVEL - FORNECIMENTO E INSTALAÇÃO. AF_10/2016","UN",7,1,null,null,null,null,null,""]
["S",3,"S",0,3,5,1,0,0,0,0,"F","Serviço","Serviço","3.5.1.2.","AGETOP",80518,"VÁLVULA DE DESCARGA COM SISTEMA PASSANTE EM POLÍMERO - OPÇÃO ECONÔMICA ( ALTA SEGURANÇA)","Un    ",7,1,null,null,null,null,null,""]
["S",3,"S",0,3,5,1,0,0,0,0,"F","Serviço","Serviço","3.5.1.3.","AGETOP",80526,"ASSENTO EM POLIPROPILENO COM SISTEMA DE FECHAMENTO SUAVE PARA VASO SANITÁRIO","Un    ",7,1,null,null,null,null,null,""]
["S",3,"S",0,3,5,1,0,0,0,0,"F","Serviço","Serviço","3.5.1.4.","COMPOSIÇÃO","COMP 209_SEE","TOALHEIRO PLÁSTICO TIPO DISPENSER PARA PAPEL TOALHA INTERFOLHADO","UN ",3,1,null,null,null,null,null,""]
["S",3,"S",0,3,5,1,0,0,0,0,"F","Serviço","Serviço","3.5.1.5.","SINAPI",95544,"PAPELEIRA DE PAREDE EM METAL CROMADO SEM TAMPA, INCLUSO FIXAÇÃO. AF_10/2016","UN",7,1,null,null,null,null,null,""]
["S",3,"S",0,3,5,1,0,0,0,0,"F","Serviço","Serviço","3.5.1.6.","SINAPI",86904,"LAVATÓRIO LOUÇA BRANCA SUSPENSO, 29,5 X 39CM OU EQUIVALENTE, PADRÃO POPULAR - FORNECIMENTO E INSTALAÇÃO. AF_12/2013","UN",1,1,null,null,null,null,null,""]
["S",3,"S",0,3,5,1,0,0,0,0,"F","Serviço","Serviço","3.5.1.7.","SINAPI",86884,"ENGATE FLEXÍVEL EM PLÁSTICO BRANCO, 1/2\" X 30CM - FORNECIMENTO E INSTALAÇÃO. AF_12/2013","UN",5,1,null,null,null,null,null,""]
["S",3,"S",0,3,5,1,0,0,{"$f":"IF(OR($C467=\"S\",$C467=0),0,MATCH(0,OFFSET($D467,1,$C467,ROW($C$618)-ROW($C467)),0))","v":0},{"$f":"IF(OR($C467=\"S\",$C467=0),0,MATCH(OFFSET($D467,0,$C467)+1,OFFSET($D467,1,$C467,ROW($C$618)-ROW($C467)),0))","v":0},"F","Serviço","Serviço","3.5.1.8.","SINAPI",86883,"SIFÃO DO TIPO FLEXÍVEL EM PVC 1\u0094 X 1.1/2\u0094 - FORNECIMENTO E INSTALAÇÃO. AF_12/2013","UN",5,1,null,null,null,null,null,""]
["S",3,"S",0,3,5,1,0,0,0,0,"F","Serviço","Serviço","3.5.1.9.","SINAPI",86906,"TORNEIRA CROMADA DE MESA, 1/2\" OU 3/4\", PARA LAVATÓRIO, PADRÃO POPULAR - FORNECIMENTO E INSTALAÇÃO. AF_12/2013","UN",5,1,null,null,null,null,null,""]
["S",3,"S",0,3,5,1,0,0,0,0,"F","Serviço","Serviço","3.5.1.10.","SINAPI",86877,"VÁLVULA EM METAL CROMADO 1.1/2\" X 1.1/2\" PARA TANQUE OU LAVATÓRIO, COM OU SEM LADRÃO - FORNECIMENTO E INSTALAÇÃO. AF_12/2013","UN",5,1,null,null,null,null,null,"Referência: AGETOP - 80580"]
["S",3,"S",0,3,5,1,0,0,0,0,"F","Serviço","Serviço","3.5.1.11.","SINAPI",86901,"CUBA DE EMBUTIR OVAL EM LOUÇA BRANCA, 35 X 50CM OU EQUIVALENTE - FORNECIMENTO E INSTALAÇÃO. AF_12/2013","UN",4,1,null,null,null,null,null,"Referência: AGETOP - 80587"]
["S",3,"S",0,3,5,1,0,0,0,0,"F","Serviço","Serviço","3.5.1.12.","SINAPI",9535,"CHUVEIRO ELETRICO COMUM CORPO PLASTICO TIPO DUCHA, FORNECIMENTO E INSTALACAO","UN",1,1,null,null,null,null,null,""]
["S",3,"S",0,3,5,1,0,0,0,0,"F","Serviço","Serviço","3.5.1.13.","SINAPI",95543,"PORTA TOALHA BANHO EM METAL CROMADO, TIPO BARRA, INCLUSO FIXAÇÃO. AF_10/2016","UN",1,1,null,null,null,null,null,""]
["S",3,"S",0,3,5,1,0,0,0,0,"F","Serviço","Serviço","3.5.1.14.","SINAPI",95545,"SABONETEIRA DE PAREDE EM METAL CROMADO, INCLUSO FIXAÇÃO. AF_10/2016","UN",1,1,null,null,null,null,null,""]
["S",3,"S",0,3,5,1,0,0,0,0,"F","Serviço","Serviço","3.5.1.15.","SINAPI",86913,"TORNEIRA CROMADA 1/2\" OU 3/4\" PARA TANQUE, PADRÃO POPULAR - FORNECIMENTO E INSTALAÇÃO. AF_12/2013","UN",2,1,null,null,null,null,null,""]
["S",3,"S",0,3,5,1,0,0,0,0,"F","Serviço","Serviço","3.5.1.16.","SINAPI",89708,"CAIXA SIFONADA, PVC, DN 150 X 185 X 75 MM, JUNTA ELÁSTICA, FORNECIDA E INSTALADA EM RAMAL DE DESCARGA OU EM RAMAL DE ESGOTO SANITÁRIO. AF_12/2014","UN",3,1,null,null,null,null,null,""]
["S",3,"S",0,3,5,1,0,0,0,0,"F","Serviço","Serviço","3.5.1.17.","SINAPI",89709,"RALO SIFONADO, PVC, DN 100 X 40 MM, JUNTA SOLDÁVEL, FORNECIDO E INSTALADO EM RAMAL DE DESCARGA OU EM RAMAL DE ESGOTO SANITÁRIO. AF_12/2014","UN",1,1,null,null,null,null,null,""]
["S",3,"S",0,3,5,1,0,0,0,0,"F","Serviço","Serviço","3.5.1.18.","AGETOP",82101,"REDUCAO EXCENTRICA 75 X 50 MM","Un    ",3,1,null,null,null,null,null,""]
["S",3,"S",0,3,5,1,0,0,0,0,"F","Serviço","Serviço","3.5.1.19.","AGETOP",81695,"PROLONGAMENTO PARA CAIXA SIFONADA 100 MM","M     ",1,1,null,null,null,null,null,""]
["S",3,"S",0,3,5,1,0,0,0,0,"F","Serviço","Serviço","3.5.1.20.","AGETOP",81696,"PROLONGAMENTO PARA CAIXA SIFONADA 150 MM","M     ",3,1,null,null,null,null,null,""]
["S",3,"S",0,3,5,1,0,0,0,0,"F","Serviço","Serviço","3.5.1.21.","SINAPI",97906,"CAIXA ENTERRADA HIDRÁULICA RETANGULAR, EM ALVENARIA COM BLOCOS DE CONCRETO, DIMENSÕES INTERNAS: 0,6X0,6X0,6 M PARA REDE DE ESGOTO. AF_05/2018","UN",2,1,null,null,null,null,null,""]
["S",3,"S",0,3,5,1,0,0,0,0,"F","Serviço","Serviço","3.5.1.22.","SINAPI",6171,"TAMPA DE CONCRETO ARMADO 60X60X5CM PARA CAIXA","UN",2,1,null,null,null,null,null,""]
["S",3,"S",0,3,5,1,0,0,0,0,"F","Serviço","Serviço","3.5.1.23.","AGETOP",81885,"TERMINAL DE VENTILACAO DIAMETRO 50 MM","Un    ",2,1,null,null,null,null,null,""]
[3,3,3,21,3,5,2,0,0,31,21,"F","Nível 3","Nível 3","3.5.2.",null,null,"ÁGUA FRIA","-",null,1,null,null,null,null,null,""]
["S",3,"S",0,3,5,2,0,0,0,0,"F","Serviço","Serviço","3.5.2.1.","SINAPI",89985,"REGISTRO DE PRESSÃO BRUTO, LATÃO, ROSCÁVEL, 3/4\", COM ACABAMENTO E CANOPLA CROMADOS. FORNECIDO E INSTALADO EM RAMAL DE ÁGUA. AF_12/2014","UN",1,1,null,null,null,null,null,"Referência: AGETOP - 80926"]
["S",3,"S",0,3,5,2,0,0,0,0,"F","Serviço","Serviço","3.5.2.2.","SINAPI",94794,"REGISTRO DE GAVETA BRUTO, LATÃO, ROSCÁVEL, 1 1/2\u0094, COM ACABAMENTO E CANOPLA CROMADOS, INSTALADO EM RESERVAÇÃO DE ÁGUA DE EDIFICAÇÃO QUE POSSUA RESERVATÓRIO DE FIBRA/FIBROCIMENTO \u0096 FORNECIMENTO E INSTALAÇÃO. AF_06/2016","UN",3,1,null,null,null,null,null,"Referência: AGETOP - 80929"]
["S",3,"S",0,3,5,2,0,0,0,0,"F","Serviço","Serviço","3.5.2.3.","SINAPI",89987,"REGISTRO DE GAVETA BRUTO, LATÃO, ROSCÁVEL, 3/4\", COM ACABAMENTO E CANOPLA CROMADOS. FORNECIDO E INSTALADO EM RAMAL DE ÁGUA. AF_12/2014","UN",2,1,null,null,null,null,null,"Referência: AGETOP - 80926"]
["S",3,"S",0,3,5,2,0,0,0,0,"F","Serviço","Serviço","3.5.2.4.","SINAPI",89402,"TUBO, PVC, SOLDÁVEL, DN 25MM, INSTALADO EM RAMAL DE DISTRIBUIÇÃO DE ÁGUA - FORNECIMENTO E INSTALAÇÃO. AF_12/2014","M",24,1,null,null,null,null,null,"Referência: AGETOP - 81003"]
["S",3,"S",0,3,5,2,0,0,0,0,"F","Serviço","Serviço","3.5.2.5.","SINAPI",94651,"TUBO, PVC, SOLDÁVEL, DN 50 MM, INSTALADO EM RESERVAÇÃO DE ÁGUA DE EDIFICAÇÃO QUE POSSUA RESERVATÓRIO DE FIBRA/FIBROCIMENTO   FORNECIMENTO E INSTALAÇÃO. AF_06/2016","M",54,1,null,null,null,null,null,"Referência: AGETOP - 81006"]
["S",3,"S",0,3,5,2,0,0,0,0,"F","Serviço","Serviço","3.5.2.6.","SINAPI",94652,"TUBO, PVC, SOLDÁVEL, DN 60 MM, INSTALADO EM RESERVAÇÃO DE ÁGUA DE EDIFICAÇÃO QUE POSSUA RESERVATÓRIO DE FIBRA/FIBROCIMENTO   FORNECIMENTO E INSTALAÇÃO. AF_06/2016","M",6,1,null,null,null,null,null,""]
["S",3,"S",0,3,5,2,0,0,0,0,"F","Serviço","Serviço","3.5.2.7.","SINAPI",89429,"ADAPTADOR CURTO COM BOLSA E ROSCA PARA REGISTRO, PVC, SOLDÁVEL, DN 25MM X 3/4\u0094, INSTALADO EM RAMAL DE DISTRIBUIÇÃO DE ÁGUA - FORNECIMENTO E INSTALAÇÃO. AF_12/2014","UN",6,1,null,null,null,null,null,"Referência: AGETOP - 81066"]
["S",3,"S",0,3,5,2,0,0,0,0,"F","Serviço","Serviço","3.5.2.8.","SINAPI",89596,"ADAPTADOR CURTO COM BOLSA E ROSCA PARA REGISTRO, PVC, SOLDÁVEL, DN 50MM X 1.1/2\u0094, INSTALADO EM PRUMADA DE ÁGUA - FORNECIMENTO E INSTALAÇÃO. AF_12/2014","UN",13,1,null,null,null,null,null,"Referência: AGETOP - 81069"]
["S",3,"S",0,3,5,2,0,0,0,0,"F","Serviço","Serviço","3.5.2.9.","SINAPI",89605,"LUVA DE REDUÇÃO, PVC, SOLDÁVEL, DN 60MM X 50MM, INSTALADO EM PRUMADA DE ÁGUA - FORNECIMENTO E INSTALAÇÃO. AF_12/2014","UN",2,1,null,null,null,null,null,""]
["S",3,"S",0,3,5,2,0,0,0,0,"F","Serviço","Serviço","3.5.2.10.","SINAPI",89579,"LUVA DE REDUÇÃO, PVC, SOLDÁVEL, DN 50MM X 25MM, INSTALADO EM PRUMADA DE ÁGUA   FORNECIMENTO E INSTALAÇÃO. AF_12/2014","UN",1,1,null,null,null,null,null,""]
["S",3,"S",0,3,5,2,0,0,0,0,"F","Serviço","Serviço","3.5.2.11.","SINAPI",89605,"LUVA DE REDUÇÃO, PVC, SOLDÁVEL, DN 60MM X 50MM, INSTALADO EM PRUMADA DE ÁGUA - FORNECIMENTO E INSTALAÇÃO. AF_12/2014","UN",1,1,null,null,null,null,null,""]
["S",3,"S",0,3,5,2,0,0,0,0,"F","Serviço","Serviço","3.5.2.12.","SINAPI",89408,"JOELHO 90 GRAUS, PVC, SOLDÁVEL, DN 25MM, INSTALADO EM RAMAL DE DISTRIBUIÇÃO DE ÁGUA - FORNECIMENTO E INSTALAÇÃO. AF_12/2014","UN",9,1,null,null,null,null,null,""]
["S",3,"S",0,3,5,2,0,0,0,0,"F","Serviço","Serviço","3.5.2.13.","SINAPI",94678,"JOELHO 90 GRAUS, PVC, SOLDÁVEL, DN 50 MM INSTALADO EM RESERVAÇÃO DE ÁGUA DE EDIFICAÇÃO QUE POSSUA RESERVATÓRIO DE FIBRA/FIBROCIMENTO   FORNECIMENTO E INSTALAÇÃO. AF_06/2016","UN",12,1,null,null,null,null,null,"Referência: AGETOP - 81324"]
["S",3,"S",0,3,5,2,0,0,0,0,"F","Serviço","Serviço","3.5.2.14.","SINAPI",90373,"JOELHO 90 GRAUS COM BUCHA DE LATÃO, PVC, SOLDÁVEL, DN 25MM, X 1/2\u0094 INSTALADO EM RAMAL OU SUB-RAMAL DE ÁGUA - FORNECIMENTO E INSTALAÇÃO. AF_12/2014","UN",4,1,null,null,null,null,null,"Referência: AGETOP - 81360"]
["S",3,"S",0,3,5,2,0,0,0,0,"F","Serviço","Serviço","3.5.2.15.","SINAPI",94672,"JOELHO 90 GRAUS COM BUCHA DE LATÃO, PVC, SOLDÁVEL, DN  25 MM, X 3/4\u0094 INSTALADO EM RESERVAÇÃO DE ÁGUA DE EDIFICAÇÃO QUE POSSUA RESERVATÓRIO DE FIBRA/FIBROCIMENTO   FORNECIMENTO E INSTALAÇÃO. AF_06/2016","UN",2,1,null,null,null,null,null,""]
["S",3,"S",0,3,5,2,0,0,0,0,"F","Serviço","Serviço","3.5.2.16.","SINAPI",89440,"TE, PVC, SOLDÁVEL, DN 25MM, INSTALADO EM RAMAL DE DISTRIBUIÇÃO DE ÁGUA - FORNECIMENTO E INSTALAÇÃO. AF_12/2014","UN",2,1,null,null,null,null,null,"Referência: AGETOP - 81402"]
["S",3,"S",0,3,5,2,0,0,0,0,"F","Serviço","Serviço","3.5.2.17.","SINAPI",94694,"TÊ, PVC, SOLDÁVEL, DN 50 MM INSTALADO EM RESERVAÇÃO DE ÁGUA DE EDIFICAÇÃO QUE POSSUA RESERVATÓRIO DE FIBRA/FIBROCIMENTO   FORNECIMENTO E INSTALAÇÃO. AF_06/2016","UN",5,1,null,null,null,null,null,"Referência: AGETOP - 81405"]
["S",3,"S",0,3,5,2,0,0,0,0,"F","Serviço","Serviço","3.5.2.18.","SINAPI",89627,"TÊ DE REDUÇÃO, PVC, SOLDÁVEL, DN 50MM X 25MM, INSTALADO EM PRUMADA DE ÁGUA - FORNECIMENTO E INSTALAÇÃO. AF_12/2014","UN",3,1,null,null,null,null,null,""]
["S",3,"S",0,3,5,2,0,0,0,0,"F","Serviço","Serviço","3.5.2.19.","SINAPI",94698,"TÊ DE REDUÇÃO, PVC, SOLDÁVEL, DN 75 MM X 50 MM, INSTALADO EM RESERVAÇÃO DE ÁGUA DE EDIFICAÇÃO QUE POSSUA RESERVATÓRIO DE FIBRA/FIBROCIMENTO   FORNECIMENTO E INSTALAÇÃO. AF_06/2016","UN",1,1,null,null,null,null,null,"Referência: AGETOP - 81427"]
["S",3,"S",0,3,5,2,0,0,0,0,"F","Serviço","Serviço","3.5.2.20.","SINAPI",89441,"TÊ COM BUCHA DE LATÃO NA BOLSA CENTRAL, PVC, SOLDÁVEL, DN 25MM X 1/2\u0094, INSTALADO EM RAMAL DE DISTRIBUIÇÃO DE ÁGUA - FORNECIMENTO E INSTALAÇÃO. AF_12/2014","UN",2,1,null,null,null,null,null,""]
[{"$f":"CHOOSE(1+LOG(1+2*(ORÇAMENTO.Nivel=\"Nível 1\")+4*(ORÇAMENTO.Nivel=\"Nível 2\")+8*(ORÇAMENTO.Nivel=\"Nível 3\")+16*(ORÇAMENTO.Nivel=\"Nível 4\")+32*(ORÇAMENTO.Nivel=\"Serviço\"),2),0,1,2,3,4,\"S\")","v":3},3,3,10,3,5,3,0,{"$f":"IF(AND($C504<=4,$C504<>0),0,IF(AND($C504=\"S\",$Y504>0),OFFSET(I504,-1,0)+1,OFFSET(I504,-1,0)))","v":0},10,{"$error":"#N/A"},"F","Nível 3","Nível 3","3.5.3.","SINAPI",null,"ESGOTO","-",null,1,null,null,null,null,null,""]
["S",3,"S",0,3,5,3,0,0,0,0,"F","Serviço","Serviço","3.5.3.1.","SINAPI",89732,"JOELHO 45 GRAUS, PVC, SERIE NORMAL, ESGOTO PREDIAL, DN 50 MM, JUNTA ELÁSTICA, FORNECIDO E INSTALADO EM RAMAL DE DESCARGA OU RAMAL DE ESGOTO SANITÁRIO. AF_12/2014","UN",2,1,null,null,null,null,null,""]
["S",3,"S",0,3,5,3,0,0,0,0,"F","Serviço","Serviço","3.5.3.2.","AGETOP",81927,"JOELHO 90 GRAUS C/ANEL 40 mm ","Un    ",5,1,null,null,null,null,null,""]
["S",3,"S",0,{"$f":"IF($C507=1,OFFSET(E507,-1,0)+1,OFFSET(E507,-1,0))","v":3},{"$f":"IF($C507=1,0,IF($C507=2,OFFSET(F507,-1,0)+1,OFFSET(F507,-1,0)))","v":5},{"$f":"IF(AND($C507<=2,$C507<>0),0,IF($C507=3,OFFSET(G507,-1,0)+1,OFFSET(G507,-1,0)))","v":3},{"$f":"IF(AND($C507<=3,$C507<>0),0,IF($C507=4,OFFSET(H507,-1,0)+1,OFFSET(H507,-1,0)))","v":0},0,0,0,"F","Serviço","Serviço","3.5.3.3.","SINAPI",89724,"JOELHO 90 GRAUS, PVC, SERIE NORMAL, ESGOTO PREDIAL, DN 40 MM, JUNTA SOLDÁVEL, FORNECIDO E INSTALADO EM RAMAL DE DESCARGA OU RAMAL DE ESGOTO SANITÁRIO. AF_12/2014","UN",5,1,null,null,null,null,null,""]
["S",3,"S",0,3,5,3,0,0,0,0,"F","Serviço","Serviço","3.5.3.4.","SINAPI",89731,"JOELHO 90 GRAUS, PVC, SERIE NORMAL, ESGOTO PREDIAL, DN 50 MM, JUNTA ELÁSTICA, FORNECIDO E INSTALADO EM RAMAL DE DESCARGA OU RAMAL DE ESGOTO SANITÁRIO. AF_12/2014","UN",6,1,null,null,null,null,null,""]
["S",3,"S",0,3,5,3,0,0,0,0,"F","Serviço","Serviço","3.5.3.5.","SINAPI",89744,"JOELHO 90 GRAUS, PVC, SERIE NORMAL, ESGOTO PREDIAL, DN 100 MM, JUNTA ELÁSTICA, FORNECIDO E INSTALADO EM RAMAL DE DESCARGA OU RAMAL DE ESGOTO SANITÁRIO. AF_12/2014","UN",7,1,null,null,null,null,null,"Referência: AGETOP - 81938"]
["S",3,"S",0,3,5,3,0,0,0,0,"F","Serviço","Serviço","3.5.3.6.","SINAPI",89784,"TE, PVC, SERIE NORMAL, ESGOTO PREDIAL, DN 50 X 50 MM, JUNTA ELÁSTICA, FORNECIDO E INSTALADO EM RAMAL DE DESCARGA OU RAMAL DE ESGOTO SANITÁRIO. AF_12/2014","UN",4,1,null,null,null,null,null,"Referência: AGETOP - 82230"]
["S",3,"S",0,3,5,3,0,0,0,0,"F","Serviço","Serviço","3.5.3.7.","SINAPI",89711,"TUBO PVC, SERIE NORMAL, ESGOTO PREDIAL, DN 40 MM, FORNECIDO E INSTALADO EM RAMAL DE DESCARGA OU RAMAL DE ESGOTO SANITÁRIO. AF_12/2014","M",18,1,null,null,null,null,null,"Referência: AGETOP - 82301"]
["S",3,"S",0,3,5,3,0,0,0,0,"F","Serviço","Serviço","3.5.3.8.","SINAPI",89712,"TUBO PVC, SERIE NORMAL, ESGOTO PREDIAL, DN 50 MM, FORNECIDO E INSTALADO EM RAMAL DE DESCARGA OU RAMAL DE ESGOTO SANITÁRIO. AF_12/2014","M",36,1,null,null,null,null,null,"Referência: AGETOP - 82302"]
["S",{"$f":"IF(OR(C513=\"s\",C513=0),OFFSET(B513,-1,0),C513)","v":3},{"$f":"IF(OFFSET(C513,-1,0)=\"L\",1,IF(OFFSET(C513,-1,0)=1,2,IF(OR(A513=\"s\",A513=0),\"S\",IF(AND(OFFSET(C513,-1,0)=2,A513=4),3,IF(AND(OR(OFFSET(C513,-1,0)=\"s\",OFFSET(C513,-1,0)=0),A513<>\"s\",A513>OFFSET(B513,-1,0)),OFFSET(B513,-1,0),A513)))))","v":"S"},{"$f":"IF(OR(C513=\"S\",C513=0),0,IF(ISERROR(K513),J513,SMALL(J513:K513,1)))","v":0},3,5,3,0,0,0,0,"F","Serviço","Serviço","3.5.3.9.","SINAPI",89714,"TUBO PVC, SERIE NORMAL, ESGOTO PREDIAL, DN 100 MM, FORNECIDO E INSTALADO EM RAMAL DE DESCARGA OU RAMAL DE ESGOTO SANITÁRIO. AF_12/2014","M",12,1,null,null,null,null,null,"Referência: AGETOP - 82304"]
[2,2,2,4,3,6,0,0,0,36,4,"F","Nível 2","Nível 2","3.6.","SINAPI",null,"ALVENARIAS E DIVISÓRIAS","-",null,1,null,null,null,null,null,""]
["S",2,"S",0,3,6,0,0,0,0,0,"F","Serviço","Serviço","3.6.0.1.","SINAPI",87511,"ALVENARIA DE VEDAÇÃO DE BLOCOS CERÂMICOS FURADOS NA HORIZONTAL DE 9X19X19CM (ESPESSURA 9CM) DE PAREDES COM ÁREA LÍQUIDA MENOR QUE 6M² COM VÃOS E ARGAMASSA DE ASSENTAMENTO COM PREPARO EM BETONEIRA. AF_06/2014","M2",121.72,1,null,null,null,null,null,"Referência: AGETOP - 100201"]
["S",2,"S",0,3,6,0,0,0,0,0,"F","Serviço","Serviço","3.6.0.2.","SINAPI",79627,"DIVISORIA EM GRANITO BRANCO POLIDO, ESP = 3CM, ASSENTADO COM ARGAMASSA TRACO 1:4, ARREMATE EM CIMENTO BRANCO, EXCLUSIVE FERRAGENS","M2",19.564999999999998,1,null,null,null,null,null,"Referência: AGETOP - 100320"]
["S",2,"S",0,3,6,0,0,0,0,0,"F","Serviço","Serviço","3.6.0.3.","SINAPI","74106/1","IMPERMEABILIZACAO DE ESTRUTURAS ENTERRADAS, COM TINTA ASFALTICA, DUAS DEMAOS.","M2",48,1,null,null,null,null,null,""]
[2,2,2,4,3,7,0,0,0,32,4,"F","Nível 2","Nível 2","3.7.","AGETOP",null,"ESQUADRIAS METÁLICAS","-",null,1,null,null,null,null,null,""]
["S",2,"S",0,3,7,0,0,0,0,0,"F","Serviço","Serviço","3.7.0.1.","SINAPI","73933/4","PORTA DE FERRO DE ABRIR TIPO BARRA CHATA, COM REQUADRO E GUARNICAO COMPLETA","M2",5.67,1,null,null,null,null,null,"Referência: AGETOP - 180501"]
["S",2,"S",0,3,7,0,0,0,0,0,"F","Serviço","Serviço","3.7.0.2.","SINAPI","73933/4","PORTA DE FERRO DE ABRIR TIPO BARRA CHATA, COM REQUADRO E GUARNICAO COMPLETA","M2",6.48,1,null,null,null,null,null,"Referência: AGETOP - 180501"]
["S",2,"S",0,3,7,0,0,0,0,0,"F","Serviço","Serviço","3.7.0.3.","SINAPI",94559,"JANELA DE AÇO BASCULANTE, FIXAÇÃO COM ARGAMASSA, SEM VIDROS, PADRONIZADA. AF_07/2016","M2",3,1,null,null,null,null,null,"Referência: AGETOP - 180404"]
[2,2,2,2,3,8,0,0,0,28,2,"F","Nível 2","Nível 2","3.8.","AGETOP",null,"VIDROS","-",null,1,null,null,null,null,null,""]
["S",2,"S",0,3,8,0,0,0,0,0,"F","Serviço","Serviço","3.8.0.1.","SINAPI",72117,"VIDRO LISO COMUM TRANSPARENTE, ESPESSURA 4MM","M2",3,1,null,null,null,null,null,"Referência: AGETOP - 190102"]
[2,2,2,7,3,9,0,0,0,26,7,"F","Nível 2","Nível 2","3.9.","AGETOP",null,"REVESTIMENTO DE PAREDE","-",null,1,null,null,null,null,null,""]
["S",2,"S",0,3,9,0,0,0,0,0,"F","Serviço","Serviço","3.9.0.1.","SINAPI",87548,"MASSA ÚNICA, PARA RECEBIMENTO DE PINTURA, EM ARGAMASSA TRAÇO 1:2:8, PREPARO MANUAL, APLICADA MANUALMENTE EM FACES INTERNAS DE PAREDES, ESPESSURA DE 10MM, COM EXECUÇÃO DE TALISCAS. AF_06/2014","M2",165.09,1,null,null,null,null,null,"Referência: AGETOP - 200500"]
["S",2,"S",0,3,9,0,0,0,0,0,"F","Serviço","Serviço","3.9.0.2.","SINAPI",87272,"REVESTIMENTO CERÂMICO PARA PAREDES INTERNAS COM PLACAS TIPO ESMALTADA EXTRA  DE DIMENSÕES 33X45 CM APLICADAS EM AMBIENTES DE ÁREA MENOR QUE 5 M² NA ALTURA INTEIRA DAS PAREDES. AF_06/2014","M2",22.95,1,null,null,null,null,null,"Referência: AGETOP - 201302"]
["S",2,"S",0,3,9,0,0,0,0,0,"F","Serviço","Serviço","3.9.0.3.","SINAPI",87273,"REVESTIMENTO CERÂMICO PARA PAREDES INTERNAS COM PLACAS TIPO ESMALTADA EXTRA DE DIMENSÕES 33X45 CM APLICADAS EM AMBIENTES DE ÁREA MAIOR QUE 5 M² NA ALTURA INTEIRA DAS PAREDES. AF_06/2014","M2",55.4,1,null,null,null,null,null,""]
["S",2,"S",0,3,9,0,0,0,0,0,"F","Serviço","Serviço","3.9.0.4.","SINAPI",87549,"EMBOÇO, PARA RECEBIMENTO DE CERÂMICA, EM ARGAMASSA TRAÇO 1:2:8, PREPARO MECÂNICO COM BETONEIRA 400L, APLICADO MANUALMENTE EM FACES INTERNAS DE PAREDES, PARA AMBIENTE COM ÁREA ENTRE 5M2 E 10M2, ESPESSURA DE 10MM, COM EXECUÇÃO DE TALISCAS. AF_06/2014","M2",55.4,1,null,null,null,null,null,"Referência: AGETOP - 200201"]
["S",2,"S",0,3,9,0,0,0,0,0,"F","Serviço","Serviço","3.9.0.5.","SINAPI",87545,"EMBOÇO, PARA RECEBIMENTO DE CERÂMICA, EM ARGAMASSA TRAÇO 1:2:8, PREPARO MECÂNICO COM BETONEIRA 400L, APLICADO MANUALMENTE EM FACES INTERNAS DE PAREDES, PARA AMBIENTE COM ÁREA MENOR QUE 5M2, ESPESSURA DE 10MM, COM EXECUÇÃO DE TALISCAS. AF_06/2014","M2",22.950000000000003,1,null,null,null,null,null,"Referência: AGETOP - 200201"]
["S",2,"S",0,3,9,0,0,0,0,0,"F","Serviço","Serviço","3.9.0.6.","SINAPI",87904,"CHAPISCO APLICADO EM ALVENARIA (COM PRESENÇA DE VÃOS) E ESTRUTURAS DE CONCRETO DE FACHADA, COM COLHER DE PEDREIRO.  ARGAMASSA TRAÇO 1:3 COM PREPARO MANUAL. AF_06/2014","M2",243.44,1,null,null,null,null,null,"Referência: AGETOP - 200101"]
[2,2,2,2,3,10,0,0,0,{"$f":"IF(OR($C531=\"S\",$C531=0),0,MATCH(0,OFFSET($D531,1,$C531,ROW($C$618)-ROW($C531)),0))","v":19},{"$f":"IF(OR($C531=\"S\",$C531=0),0,MATCH(OFFSET($D531,0,$C531)+1,OFFSET($D531,1,$C531,ROW($C$618)-ROW($C531)),0))","v":2},"F","Nível 2","Nível 2","3.10.","AGETOP",null,"FORROS","-",null,1,null,null,null,null,null,""]
["S",2,"S",0,3,10,0,0,0,0,0,"F","Serviço","Serviço","3.10.0.1.","SINAPI",96111,"FORRO EM RÉGUAS DE PVC, FRISADO, PARA AMBIENTES RESIDENCIAIS, INCLUSIVE ESTRUTURA DE FIXAÇÃO. AF_05/2017_P","M2",25.16,1,null,null,null,null,null,"Referência: AGETOP - 210460"]
[2,2,2,6,3,11,0,0,0,17,6,"F","Nível 2","Nível 2","3.11.","SINAPI",null,"REVESTIMENTO DE PISO","-",null,1,null,null,null,null,null,""]
["S",2,"S",0,3,11,0,0,0,0,0,"F","Serviço","Serviço","3.11.0.1.","SINAPI",95241,"LASTRO DE CONCRETO MAGRO, APLICADO EM PISOS OU RADIERS, ESPESSURA DE 5 CM. AF_07/2016","M2",48.43,1,null,null,null,null,null,""]
["S",2,"S",0,3,11,0,0,0,0,0,"F","Serviço","Serviço","3.11.0.2.","AGETOP",221104,"RASPAGEM E APLICAÇÃO RESINA ACRÍLICA DUAS DEMÃOS","m2    ",18.850000000000001,1,null,null,null,null,null,""]
["S",2,"S",0,3,11,0,0,0,0,0,"F","Serviço","Serviço","3.11.0.3.","SINAPI",84191,"PISO EM GRANILITE, MARMORITE OU GRANITINA ESPESSURA 8 MM, INCLUSO JUNTAS DE DILATACAO PLASTICAS","M2",18.850000000000001,1,null,null,null,null,null,"Referência: AGETOP - 221101"]
["S",2,"S",0,3,11,0,0,0,0,0,"F","Serviço","Serviço","3.11.0.4.","SINAPI",87247,"REVESTIMENTO CERÂMICO PARA PISO COM PLACAS TIPO ESMALTADA EXTRA DE DIMENSÕES 35X35 CM APLICADA EM AMBIENTES DE ÁREA ENTRE 5 M2 E 10 M2. AF_06/2014","M2",25.16,1,null,null,null,null,null,""]
["S",2,"S",0,3,11,0,0,0,0,0,"F","Serviço","Serviço","3.11.0.5.","SINAPI",94992,"EXECUÇÃO DE PASSEIO (CALÇADA) OU PISO DE CONCRETO COM CONCRETO MOLDADO IN LOCO, FEITO EM OBRA, ACABAMENTO CONVENCIONAL, ESPESSURA 6 CM, ARMADO. AF_07/2016","M2",15,1,null,null,null,null,null,""]
[2,2,2,3,3,12,0,0,0,11,3,"F","Nível 2","Nível 2","3.12.","AGETOP",null,"FERRAGENS","-",null,1,null,null,null,null,null,""]
["S",2,"S",0,3,12,0,0,0,0,0,"F","Serviço","Serviço","3.12.0.1.","AGETOP",230176,"BARRA DE APOIO EM AÇO INOX - 80 CM ","un    ",4,1,null,null,null,null,null,""]
["S",2,"S",0,3,12,0,0,0,0,0,"F","Serviço","Serviço","3.12.0.2.","AGETOP",230174,"BARRA DE APOIO EM AÇO INOX - 40 CM","un    ",2,1,null,null,null,null,null,""]
[2,2,2,5,3,13,0,0,0,8,5,"F","Nível 2","Nível 2","3.13.","AGETOP",null,"PINTURA","-",null,1,null,null,null,null,null,""]
["S",2,"S",0,3,13,0,0,0,0,0,"F","Serviço","Serviço","3.13.0.1.","SINAPI","74145/1","PINTURA ESMALTE FOSCO, DUAS DEMAOS, SOBRE SUPERFICIE METALICA, INCLUSO UMA DEMAO DE FUNDO ANTICORROSIVO. UTILIZACAO DE REVOLVER ( AR-COMPRIMIDO).","M2",30.3,1,null,null,null,null,null,"Referência: AGETOP - 261602"]
["S",2,"S",0,3,13,0,0,0,0,0,"F","Serviço","Serviço","3.13.0.2.","SINAPI",88489,"APLICAÇÃO MANUAL DE PINTURA COM TINTA LÁTEX ACRÍLICA EM PAREDES, DUAS DEMÃOS. AF_06/2014","M2",95.92,1,null,null,null,null,null,"Referência: AGETOP - 261001"]
["S",2,"S",0,3,13,0,0,0,0,0,"F","Serviço","Serviço","3.13.0.3.","SINAPI",88487,"APLICAÇÃO MANUAL DE PINTURA COM TINTA LÁTEX PVA EM PAREDES, DUAS DEMÃOS. AF_06/2014","M2",31,1,null,null,null,null,null,""]
["S",2,"S",0,3,13,0,0,0,0,0,"F","Serviço","Serviço","3.13.0.4.","SINAPI",88497,"APLICAÇÃO E LIXAMENTO DE MASSA LÁTEX EM PAREDES, DUAS DEMÃOS. AF_06/2014","M2",31,1,null,null,null,null,null,"Referência: AGETOP - 261300"]
[2,2,2,3,3,14,0,0,0,3,{"$error":"#N/A"},"F","Nível 2","Nível 2","3.14.","AGETOP",null,"DIVERSOS","-",null,1,null,null,null,null,null,""]
["S",2,"S",0,3,14,0,0,0,0,0,"F","Serviço","Serviço","3.14.0.1.","COMPOSIÇÃO","COMP 541_SEE","BANCADA DE GRANITO CINZA POLIDO - FORNECIMENTO E INSTALAÇÃO. ","M2    ",2.42,1,null,null,null,null,null,""]
["S",2,"S",0,3,14,0,0,0,0,0,"F","Serviço","Serviço","3.14.0.2.","COMPOSIÇÃO","COMP 206_SEE","BANCO ARTICULADO PARA BANHO, EM ACO INOX POLIDO, 70* CM X 45* CM","UN ",1,1,null,null,null,null,null,""]
[1,1,1,35,4,0,0,0,0,68,35,"F","Nível 1","Nível 1","4.","AGETOP",null,"PASSARELA MODELO 01 - PADRÃO SÉC. XXI 2015","UN",1,1,null,null,null,null,null,""]
[2,2,2,2,4,1,0,0,0,34,2,"F","Nível 2","Nível 2","4.1.","SINAPI",null,"SERVIÇOS PRELIMINARES","-",null,1,null,null,null,null,null,""]
["S",2,"S",0,4,1,0,0,0,0,0,"F","Serviço","Serviço","4.1.0.1.","AGETOP",20701,"LOCAÇÃO DA OBRA, EXECUÇÃO DE GABARITO SEM REAPROVEITAMENTO, INCLUSO PINTURA (FACE INTERNA DO RIPÃO 15CM) E PIQUETE COM TESTEMUNHA","m2    ",10.08,1,null,null,null,null,null,""]
[2,2,2,3,4,2,0,0,0,32,3,"F","Nível 2","Nível 2","4.2.","AGETOP",null,"TRANSPORTES","-",null,1,null,null,null,null,null,""]
["S",2,"S",0,4,2,0,0,0,0,0,"F","Serviço","Serviço","4.2.0.1.","SINAPI",72900,"TRANSPORTE DE ENTULHO COM CAMINHAO BASCULANTE 6 M3, RODOVIA PAVIMENTADA, DMT 0,5 A 1,0 KM","M3",3,1,null,null,null,null,null,""]
["S",2,"S",0,4,2,0,0,0,0,0,"F","Serviço","Serviço","4.2.0.2.","SINAPI",72897,"CARGA MANUAL DE ENTULHO EM CAMINHAO BASCULANTE 6 M3","M3",3,1,null,null,null,null,null,""]
[2,2,2,9,4,3,0,0,0,29,9,"F","Nível 2","Nível 2","4.3.","AGETOP",null,"FUNDAÇÕES E SONDAGENS","-",null,1,null,null,null,null,null,""]
["S",2,"S",0,4,3,0,0,0,0,0,"F","Serviço","Serviço","4.3.0.1.","SINAPI",96534,"FABRICAÇÃO, MONTAGEM E DESMONTAGEM DE FÔRMA PARA BLOCO DE COROAMENTO, EM MADEIRA SERRADA, E=25 MM, 4 UTILIZAÇÕES. AF_06/2017","M2",5.28,1,null,null,null,null,null,"Referência: AGETOP - 51009"]
["S",2,"S",0,4,3,0,0,0,0,0,"F","Serviço","Serviço","4.3.0.2.","SINAPI",96523,"ESCAVAÇÃO MANUAL PARA BLOCO DE COROAMENTO OU SAPATA, COM PREVISÃO DE FÔRMA. AF_06/2017","M3",1.0289999999999999,1,null,null,null,null,null,"Referência: AGETOP - 50901"]
["S",2,"S",0,4,3,0,0,0,0,0,"F","Serviço","Serviço","4.3.0.3.","AGETOP",50902,"APILOAMENTO (BLOCOS/SAPATAS)","m2    ",1,1,null,null,null,null,null,""]
["S",2,"S",0,4,3,0,0,0,0,0,"F","Serviço","Serviço","4.3.0.4.","SINAPI",96995,"REATERRO MANUAL APILOADO COM SOQUETE. AF_10/2017","M3",0.44899999999999995,1,null,null,null,null,null,"Referência: AGETOP - 40902"]
["S",2,"S",0,4,3,0,0,0,0,0,"F","Serviço","Serviço","4.3.0.5.","SINAPI",94964,"CONCRETO FCK = 20MPA, TRAÇO 1:2,7:3 (CIMENTO/ AREIA MÉDIA/ BRITA 1)  - PREPARO MECÂNICO COM BETONEIRA 400 L. AF_07/2016","M3",0.57999999999999996,1,null,null,null,null,null,""]
["S",2,"S",0,4,3,0,0,0,0,0,"F","Serviço","Serviço","4.3.0.6.","SINAPI","74157/4","LANCAMENTO/APLICACAO MANUAL DE CONCRETO EM FUNDACOES","M3",0.57999999999999996,1,null,null,null,null,null,"Referência: AGETOP - 51026"]
["S",2,"S",0,4,3,0,0,0,0,0,"F","Serviço","Serviço","4.3.0.7.","SINAPI",96547,"ARMAÇÃO DE BLOCO, VIGA BALDRAME OU SAPATA UTILIZANDO AÇO CA-50 DE 12,5 MM - MONTAGEM. AF_06/2017","KG",13.18181818181818,1,null,null,null,null,null,""]
["S",2,"S",0,4,3,0,0,0,0,0,"F","Serviço","Serviço","4.3.0.8.","SINAPI",96543,"ARMAÇÃO DE BLOCO, VIGA BALDRAME E SAPATA UTILIZANDO AÇO CA-60 DE 5 MM - MONTAGEM. AF_06/2017","KG",8.7272727272727266,1,null,null,null,null,null,"Referência: AGETOP - 52014"]
[2,2,2,7,4,4,0,0,0,20,7,"F","Nível 2","Nível 2","4.4.","AGETOP",null,"ESTRUTURA","-",null,1,null,null,null,null,null,""]
["S",2,"S",0,4,4,0,0,0,0,0,"F","Serviço","Serviço","4.4.0.1.","SINAPI",92426,"MONTAGEM E DESMONTAGEM DE FÔRMA DE PILARES RETANGULARES E ESTRUTURAS SIMILARES COM ÁREA MÉDIA DAS SEÇÕES MENOR OU IGUAL A 0,25 M², PÉ-DIREITO SIMPLES, EM CHAPA DE MADEIRA COMPENSADA RESINADA, 8 UTILIZAÇÕES. AF_12/2015","M2",1.29,1,null,null,null,null,null,""]
[{"$f":"CHOOSE(1+LOG(1+2*(ORÇAMENTO.Nivel=\"Nível 1\")+4*(ORÇAMENTO.Nivel=\"Nível 2\")+8*(ORÇAMENTO.Nivel=\"Nível 3\")+16*(ORÇAMENTO.Nivel=\"Nível 4\")+32*(ORÇAMENTO.Nivel=\"Serviço\"),2),0,1,2,3,4,\"S\")","v":"S"},2,"S",0,4,4,0,0,{"$f":"IF(AND($C567<=4,$C567<>0),0,IF(AND($C567=\"S\",$Y567>0),OFFSET(I567,-1,0)+1,OFFSET(I567,-1,0)))","v":0},0,0,"F","Serviço","Serviço","4.4.0.2.","SINAPI",94964,"CONCRETO FCK = 20MPA, TRAÇO 1:2,7:3 (CIMENTO/ AREIA MÉDIA/ BRITA 1)  - PREPARO MECÂNICO COM BETONEIRA 400 L. AF_07/2016","M3",0.11,1,null,null,null,null,null,""]
["S",2,"S",0,4,4,0,0,0,0,0,"F","Serviço","Serviço","4.4.0.3.","SINAPI",92873,"LANÇAMENTO COM USO DE BALDES, ADENSAMENTO E ACABAMENTO DE CONCRETO EM ESTRUTURAS. AF_12/2015","M3",0.11,1,null,null,null,null,null,"Referência: AGETOP - 60801"]
["S",2,"S",0,4,4,0,0,0,0,0,"F","Serviço","Serviço","4.4.0.4.","SINAPI",92779,"ARMAÇÃO DE PILAR OU VIGA DE UMA ESTRUTURA CONVENCIONAL DE CONCRETO ARMADO EM UMA EDIFICAÇÃO TÉRREA OU SOBRADO UTILIZANDO AÇO CA-50 DE 12,5 MM - MONTAGEM. AF_12/2015","KG",2.8181818181818179,1,null,null,null,null,null,""]
["S",2,"S",0,{"$f":"IF($C570=1,OFFSET(E570,-1,0)+1,OFFSET(E570,-1,0))","v":4},{"$f":"IF($C570=1,0,IF($C570=2,OFFSET(F570,-1,0)+1,OFFSET(F570,-1,0)))","v":4},{"$f":"IF(AND($C570<=2,$C570<>0),0,IF($C570=3,OFFSET(G570,-1,0)+1,OFFSET(G570,-1,0)))","v":0},{"$f":"IF(AND($C570<=3,$C570<>0),0,IF($C570=4,OFFSET(H570,-1,0)+1,OFFSET(H570,-1,0)))","v":0},0,0,0,"F","Serviço","Serviço","4.4.0.5.","SINAPI",92775,"ARMAÇÃO DE PILAR OU VIGA DE UMA ESTRUTURA CONVENCIONAL DE CONCRETO ARMADO EM UMA EDIFICAÇÃO TÉRREA OU SOBRADO UTILIZANDO AÇO CA-60 DE 5,0 MM - MONTAGEM. AF_12/2015","KG",1.4545454545454546,1,null,null,null,null,null,"Referência: AGETOP - 60314"]
["S",2,"S",0,4,4,0,0,0,0,0,"F","Serviço","Serviço","4.4.0.6.","SINAPI",98562,"IMPERMEABILIZAÇÃO DE FLOREIRA OU VIGA BALDRAME COM ARGAMASSA DE CIMENTO E AREIA, COM ADITIVO IMPERMEABILIZANTE, E = 2 CM. AF_06/2018","M2",3.6,1,null,null,null,null,null,"Referência: AGETOP - 120902"]
[2,2,2,2,4,5,0,0,0,13,2,"F","Nível 2","Nível 2","4.5.",null,null,"ESTRUTURAS METÁLICAS","-",null,1,null,null,null,null,null,""]
["S",2,"S",0,4,5,0,0,0,0,0,"F","Serviço","Serviço","4.5.0.1.","AGETOP",150103,"ESTRUTURA METÁLICA CONVENCIONAL EM AÇO DO TIPO USI SAC-300 COM FUNDO ANTICORROSIVO","Kg    ",161.91200000000003,1,null,null,null,null,null,""]
[2,2,2,3,4,6,0,0,0,11,3,"F","Nível 2","Nível 2","4.6.",null,null,"COBERTURAS","-",null,1,null,null,null,null,null,""]
["S",{"$f":"IF(OR(C575=\"s\",C575=0),OFFSET(B575,-1,0),C575)","v":2},{"$f":"IF(OFFSET(C575,-1,0)=\"L\",1,IF(OFFSET(C575,-1,0)=1,2,IF(OR(A575=\"s\",A575=0),\"S\",IF(AND(OFFSET(C575,-1,0)=2,A575=4),3,IF(AND(OR(OFFSET(C575,-1,0)=\"s\",OFFSET(C575,-1,0)=0),A575<>\"s\",A575>OFFSET(B575,-1,0)),OFFSET(B575,-1,0),A575)))))","v":"S"},{"$f":"IF(OR(C575=\"S\",C575=0),0,IF(ISERROR(K575),J575,SMALL(J575:K575,1)))","v":0},4,6,0,0,0,0,0,"F","Serviço","Serviço","4.6.0.1.","SINAPI",94213,"TELHAMENTO COM TELHA DE AÇO/ALUMÍNIO E = 0,5 MM, COM ATÉ 2 ÁGUAS, INCLUSO IÇAMENTO. AF_07/2019","M2",12.96,1,null,null,null,null,null,"Referência: AGETOP - 160905"]
["S",2,"S",0,4,6,0,0,0,0,0,"F","Serviço","Serviço","4.6.0.2.","SINAPI",94228,"CALHA EM CHAPA DE AÇO GALVANIZADO NÚMERO 24, DESENVOLVIMENTO DE 50 CM, INCLUSO TRANSPORTE VERTICAL. AF_07/2019","M",3.6,1,null,null,null,null,null,"Referência: AGETOP - 160601"]
[2,2,2,4,4,7,0,0,0,8,4,"F","Nível 2","Nível 2","4.7.",null,null,"REVESTIMENTO DE PISO","-",null,1,null,null,null,null,null,""]
["S",2,"S",0,4,7,0,0,0,0,0,"F","Serviço","Serviço","4.7.0.1.","SINAPI",95241,"LASTRO DE CONCRETO MAGRO, APLICADO EM PISOS OU RADIERS, ESPESSURA DE 5 CM. AF_07/2016","M2",10.08,1,null,null,null,null,null,""]
["S",2,"S",0,4,7,0,0,0,0,0,"F","Serviço","Serviço","4.7.0.2.","SINAPI",84191,"PISO EM GRANILITE, MARMORITE OU GRANITINA ESPESSURA 8 MM, INCLUSO JUNTAS DE DILATACAO PLASTICAS","M2",10.64,1,null,null,null,null,null,"Referência: AGETOP - 221101"]
["S",2,"S",0,4,7,0,0,0,0,0,"F","Serviço","Serviço","4.7.0.3.","AGETOP",221104,"RASPAGEM E APLICAÇÃO RESINA ACRÍLICA DUAS DEMÃOS","m2    ",10.64,1,null,null,null,null,null,""]
[2,2,2,2,4,8,0,0,0,4,2,"F","Nível 2","Nível 2","4.8.",null,null,"PINTURA","-",null,1,null,null,null,null,null,""]
["S",2,"S",0,4,8,0,0,0,0,0,"F","Serviço","Serviço","4.8.0.1.","SINAPI","74145/1","PINTURA ESMALTE FOSCO, DUAS DEMAOS, SOBRE SUPERFICIE METALICA, INCLUSO UMA DEMAO DE FUNDO ANTICORROSIVO. UTILIZACAO DE REVOLVER ( AR-COMPRIMIDO).","M2",25.92,1,null,null,null,null,null,"Referência: AGETOP - 261602"]
[2,2,2,2,4,9,0,0,0,2,{"$error":"#N/A"},"F","Nível 2","Nível 2","4.9.","SINAPI",null,"DIVERSOS","-",null,1,null,null,null,null,null,""]
["S",2,"S",0,4,9,0,0,0,0,0,"F","Serviço","Serviço","4.9.0.1.","AGETOP",270501,"LIMPEZA FINAL DE OBRA - (OBRAS CIVIS)","m2    ",10.08,1,null,null,null,null,null,""]
[1,1,1,33,5,0,0,0,0,33,{"$error":"#N/A"},"F","Nível 1","Nível 1","5.","AGETOP",null,"PASSARELA MODELO 02 - PADRÃO SÉC. XXI 2015","UN",1,1,null,null,null,null,null,""]
[2,2,2,2,5,1,0,0,0,32,2,"F","Nível 2","Nível 2","5.1.","AGETOP",null,"SERVIÇOS PRELIMINARES","-",null,1,null,null,null,null,null,""]
["S",2,"S",0,5,1,0,0,0,0,0,"F","Serviço","Serviço","5.1.0.1.","AGETOP",20701,"LOCAÇÃO DA OBRA, EXECUÇÃO DE GABARITO SEM REAPROVEITAMENTO, INCLUSO PINTURA (FACE INTERNA DO RIPÃO 15CM) E PIQUETE COM TESTEMUNHA","m2    ",20.16,1,null,null,null,null,null,""]
[2,2,2,3,5,2,0,0,0,30,3,"F","Nível 2","Nível 2","5.2.","AGETOP",null,"TRANSPORTES","-",null,1,null,null,null,null,null,""]
["S",2,"S",0,5,2,0,0,0,0,0,"F","Serviço","Serviço","5.2.0.1.","SINAPI",72900,"TRANSPORTE DE ENTULHO COM CAMINHAO BASCULANTE 6 M3, RODOVIA PAVIMENTADA, DMT 0,5 A 1,0 KM","M3",6,1,null,null,null,null,null,""]
["S",2,"S",0,5,2,0,0,0,0,0,"F","Serviço","Serviço","5.2.0.2.","SINAPI",72897,"CARGA MANUAL DE ENTULHO EM CAMINHAO BASCULANTE 6 M3","M3",6,1,null,null,null,null,null,""]
[2,2,2,9,5,3,0,0,0,27,9,"F","Nível 2","Nível 2","5.3.","AGETOP",null,"FUNDAÇÕES E SONDAGENS","-",null,1,null,null,null,null,null,""]
["S",2,"S",0,5,3,0,0,0,0,0,"F","Serviço","Serviço","5.3.0.1.","SINAPI",96534,"FABRICAÇÃO, MONTAGEM E DESMONTAGEM DE FÔRMA PARA BLOCO DE COROAMENTO, EM MADEIRA SERRADA, E=25 MM, 4 UTILIZAÇÕES. AF_06/2017","M2",5.28,1,null,null,null,null,null,"Referência: AGETOP - 51009"]
["S",2,"S",0,5,3,0,0,0,0,0,"F","Serviço","Serviço","5.3.0.2.","SINAPI",96523,"ESCAVAÇÃO MANUAL PARA BLOCO DE COROAMENTO OU SAPATA, COM PREVISÃO DE FÔRMA. AF_06/2017","M3",1.0289999999999999,1,null,null,null,null,null,"Referência: AGETOP - 50901"]
["S",2,"S",0,5,3,0,0,0,0,0,"F","Serviço","Serviço","5.3.0.3.","AGETOP",50902,"APILOAMENTO (BLOCOS/SAPATAS)","m2    ",1,1,null,null,null,null,null,""]
["S",2,"S",0,5,3,0,0,0,{"$f":"IF(OR($C595=\"S\",$C595=0),0,MATCH(0,OFFSET($D595,1,$C595,ROW($C$618)-ROW($C595)),0))","v":0},{"$f":"IF(OR($C595=\"S\",$C595=0),0,MATCH(OFFSET($D595,0,$C595)+1,OFFSET($D595,1,$C595,ROW($C$618)-ROW($C595)),0))","v":0},"F","Serviço","Serviço","5.3.0.4.","SINAPI",96995,"REATERRO MANUAL APILOADO COM SOQUETE. AF_10/2017","M3",0.44899999999999995,1,null,null,null,null,null,"Referência: AGETOP - 40902"]
["S",2,"S",0,5,3,0,0,0,0,0,"F","Serviço","Serviço","5.3.0.5.","SINAPI",94964,"CONCRETO FCK = 20MPA, TRAÇO 1:2,7:3 (CIMENTO/ AREIA MÉDIA/ BRITA 1)  - PREPARO MECÂNICO COM BETONEIRA 400 L. AF_07/2016","M3",0.57999999999999996,1,null,null,null,null,null,""]
["S",2,"S",0,5,3,0,0,0,0,0,"F","Serviço","Serviço","5.3.0.6.","SINAPI","74157/4","LANCAMENTO/APLICACAO MANUAL DE CONCRETO EM FUNDACOES","M3",0.57999999999999996,1,null,null,null,null,null,"Referência: AGETOP - 51026"]
["S",2,"S",0,5,3,0,0,0,0,0,"F","Serviço","Serviço","5.3.0.7.","SINAPI",96547,"ARMAÇÃO DE BLOCO, VIGA BALDRAME OU SAPATA UTILIZANDO AÇO CA-50 DE 12,5 MM - MONTAGEM. AF_06/2017","KG",13.18181818181818,1,null,null,null,null,null,""]
["S",2,"S",0,5,3,0,0,0,0,0,"F","Serviço","Serviço","5.3.0.8.","SINAPI",96543,"ARMAÇÃO DE BLOCO, VIGA BALDRAME E SAPATA UTILIZANDO AÇO CA-60 DE 5 MM - MONTAGEM. AF_06/2017","KG",8.7272727272727266,1,null,null,null,null,null,"Referência: AGETOP - 52014"]
[2,2,2,7,5,4,0,0,0,18,7,"F","Nível 2","Nível 2","5.4.","AGETOP",null,"ESTRUTURA","-",null,1,null,null,null,null,null,""]
["S",2,"S",0,5,4,0,0,0,0,0,"F","Serviço","Serviço","5.4.0.1.","SINAPI",92426,"MONTAGEM E DESMONTAGEM DE FÔRMA DE PILARES RETANGULARES E ESTRUTURAS SIMILARES COM ÁREA MÉDIA DAS SEÇÕES MENOR OU IGUAL A 0,25 M², PÉ-DIREITO SIMPLES, EM CHAPA DE MADEIRA COMPENSADA RESINADA, 8 UTILIZAÇÕES. AF_12/2015","M2",1.29,1,null,null,null,null,null,""]
["S",2,"S",0,5,4,0,0,0,0,0,"F","Serviço","Serviço","5.4.0.2.","SINAPI",94964,"CONCRETO FCK = 20MPA, TRAÇO 1:2,7:3 (CIMENTO/ AREIA MÉDIA/ BRITA 1)  - PREPARO MECÂNICO COM BETONEIRA 400 L. AF_07/2016","M3",0.11,1,null,null,null,null,null,""]
["S",2,"S",0,5,4,0,0,0,0,0,"F","Serviço","Serviço","5.4.0.3.","SINAPI",92873,"LANÇAMENTO COM USO DE BALDES, ADENSAMENTO E ACABAMENTO DE CONCRETO EM ESTRUTURAS. AF_12/2015","M3",0.11,1,null,null,null,null,null,"Referência: AGETOP - 60801"]
["S",2,"S",0,5,4,0,0,0,0,0,"F","Serviço","Serviço","5.4.0.4.","SINAPI",92779,"ARMAÇÃO DE PILAR OU VIGA DE UMA ESTRUTURA CONVENCIONAL DE CONCRETO ARMADO EM UMA EDIFICAÇÃO TÉRREA OU SOBRADO UTILIZANDO AÇO CA-50 DE 12,5 MM - MONTAGEM. AF_12/2015","KG",2.8181818181818179,1,null,null,null,null,null,""]
["S",2,"S",0,5,4,0,0,0,0,0,"F","Serviço","Serviço","5.4.0.5.","SINAPI",92775,"ARMAÇÃO DE PILAR OU VIGA DE UMA ESTRUTURA CONVENCIONAL DE CONCRETO ARMADO EM UMA EDIFICAÇÃO TÉRREA OU SOBRADO UTILIZANDO AÇO CA-60 DE 5,0 MM - MONTAGEM. AF_12/2015","KG",1.4545454545454546,1,null,null,null,null,null,"Referência: AGETOP - 60314"]
["S",2,"S",0,5,4,0,0,0,0,0,"F","Serviço","Serviço","5.4.0.6.","SINAPI",98562,"IMPERMEABILIZAÇÃO DE FLOREIRA OU VIGA BALDRAME COM ARGAMASSA DE CIMENTO E AREIA, COM ADITIVO IMPERMEABILIZANTE, E = 2 CM. AF_06/2018","M2",3.6,1,null,null,null,null,null,"Referência: AGETOP - 120902"]
[2,2,2,2,5,5,0,0,0,11,2,"F","Nível 2","Nível 2","5.5.",null,null,"ESTRUTURAS METÁLICAS","-",null,1,null,null,null,null,null,""]
["S",2,"S",0,5,5,0,0,0,0,0,"F","Serviço","Serviço","5.5.0.1.","AGETOP",150103,"ESTRUTURA METÁLICA CONVENCIONAL EM AÇO DO TIPO USI SAC-300 COM FUNDO ANTICORROSIVO","Kg    ",270.56000000000006,1,null,null,null,null,null,""]
[2,2,2,3,5,6,0,0,0,9,3,"F","Nível 2","Nível 2","5.6.",null,null,"COBERTURAS","-",null,1,null,null,null,null,null,""]
["S",2,"S",0,5,6,0,0,0,0,0,"F","Serviço","Serviço","5.6.0.1.","SINAPI",94213,"TELHAMENTO COM TELHA DE AÇO/ALUMÍNIO E = 0,5 MM, COM ATÉ 2 ÁGUAS, INCLUSO IÇAMENTO. AF_07/2019","M2",25.92,1,null,null,null,null,null,"Referência: AGETOP - 160905"]
["S",2,"S",0,5,6,0,0,0,0,0,"F","Serviço","Serviço","5.6.0.2.","SINAPI",94228,"CALHA EM CHAPA DE AÇO GALVANIZADO NÚMERO 24, DESENVOLVIMENTO DE 50 CM, INCLUSO TRANSPORTE VERTICAL. AF_07/2019","M",7.2,1,null,null,null,null,null,"Referência: AGETOP - 160601"]
[2,2,2,4,5,7,0,0,0,{"$f":"IF(OR($C612=\"S\",$C612=0),0,MATCH(0,OFFSET($D612,1,$C612,ROW($C$618)-ROW($C612)),0))","v":6},{"$f":"IF(OR($C612=\"S\",$C612=0),0,MATCH(OFFSET($D612,0,$C612)+1,OFFSET($D612,1,$C612,ROW($C$618)-ROW($C612)),0))","v":4},"F","Nível 2","Nível 2","5.7.",null,null,"REVESTIMENTO DE PISO","-",null,1,null,null,null,null,null,""]
["S",2,"S",0,5,7,0,0,0,0,0,"F","Serviço","Serviço","5.7.0.1.","SINAPI",95241,"LASTRO DE CONCRETO MAGRO, APLICADO EM PISOS OU RADIERS, ESPESSURA DE 5 CM. AF_07/2016","M2",20.16,1,null,null,null,null,null,""]
["S",2,"S",0,5,7,0,0,0,0,0,"F","Serviço","Serviço","5.7.0.2.","SINAPI",84191,"PISO EM GRANILITE, MARMORITE OU GRANITINA ESPESSURA 8 MM, INCLUSO JUNTAS DE DILATACAO PLASTICAS","M2",20.16,1,null,null,null,null,null,"Referência: AGETOP - 221101"]
["S",2,"S",0,5,7,0,0,0,0,0,"F","Serviço","Serviço","5.7.0.3.","AGETOP",221104,"RASPAGEM E APLICAÇÃO RESINA ACRÍLICA DUAS DEMÃOS","m2    ",20.72,1,null,null,null,null,null,""]
[2,2,2,2,5,8,0,0,0,2,{"$error":"#N/A"},"F","Nível 2","Nível 2","5.8.",null,null,"PINTURA","-",null,1,null,null,null,null,null,""]
["S",2,"S",0,5,8,0,0,0,0,0,"F","Serviço","Serviço","5.8.0.1.","SINAPI","74145/1","PINTURA ESMALTE FOSCO, DUAS DEMAOS, SOBRE SUPERFICIE METALICA, INCLUSO UMA DEMAO DE FUNDO ANTICORROSIVO. UTILIZACAO DE REVOLVER ( AR-COMPRIMIDO).","M2",51.84,1,null,null,null,null,null,"Referência: AGETOP - 261602"]
[-1,null,-1,null,0,0,0,0,0,null,null,"F"]
[null,null,null,null,null,null,null,null,null,null,null,"F",null,null,null,null,null,"OBS: OS QUANTITATIVOS DE MATERIAIS  DAS INSTALAÇÕES HIDROSSANITÁRIAS, ELÉTRICAS E ESPECIAIS SÃO FORNECIDOS PELOS PROFISSIONAIS RESPONSÁVEIS PELOS RESPECTIVOS PROJETOS.",null,null,null,null,null,"VALOR TOTAL"]
[null,null,null,null,null,null,null,null,null,null,null,"F",null,null,null,null,null,null,null,null,null,null,null,"VALOR BDI (26,44%)"]
[null,null,null,null,null,null,null,null,null,null,null,"F",null,null,null,null,null,null,null,null,null,null,null,"TOTAL ORÇAMENTO"]
[null,null,null,null,null,null,null,null,null,null,null,"F"]
[null,null,null,null,null,null,null,null,null,null,null,"F",null,null,null,null,null,null,null,null,null,null,null,"CUSTO POR M2 ³"]
[null,null,null,null,null,null,null,null,null,null,null,"F",null,null,null,null,null,null,null,null,null,null,null,"MATERIAL S/ BDI"]
[null,null,null,null,null,null,null,null,null,null,null,"F",null,null,null,null,null,null,null,null,null,null,null,"MÃO DE OBRA S/ BDI"]
[null,null,null,null,null,null,null,null,null,null,null,"F"]
[null,null,null,null,null,null,null,null,null,null,null,"F",null,null,null,null,"(1) Conforme previsto pelo DECRETO Nº 7.983, DE 8 DE ABRIL DE 2013, os preços adotados são aqueles constantes dos sistemas de referência indicados. Justifica-se o uso dos preços destas composições de custos unitários devido ao seu valor ser menor à mediana de seus correspondentes na tabela SINAPI;"]
[null,null,null,null,null,null,null,null,null,null,null,"F",null,null,null,null,"(2) Optou-se pelo uso das composições de custos da AGETOP para itens não presentes na SINAPI;"]
[null,null,null,null,null,null,null,null,null,null,null,"F",null,null,null,null,"(3) Para itens da AGETOP, os vidros não estão inclusos nas esquadrias e já foram considerados os custos de contramarco para as esquadrias de alumínio;"]
[null,null,null,null,null,null,null,null,null,null,null,"F",null,null,null,null,"(4) Nos casos em que houver execução de granitina e omissão do item AGETOP 221102, considerou-se que o quantitativo para o rodapé, de altura igual a 7cm, foi incorporado na área de piso;"]
[null,null,null,null,null,null,null,null,null,null,null,"F",null,null,null,null,"(5) O custo unitário aproximado por metro quadrado é calculado dividindo-se o valor total do orçamento pela área total de construção."]
[null,null,null,null,null,null,null,null,null,null,null,"F"]
[null,null,null,null,null,null,null,null,null,null,null,"F"]
[]
[null,null,null,null,null,null,null,null,null,null,null,null,null,null,"SOMATÓRIO DE SERVIÇOS"]
[null,null,null,null,null,null,null,null,null,null,null,null,null,null,"ITEM","DESCRIÇÃO DOS SERVIÇOS",null,null,"PREÇO SEM BDI",null,null,null,null,"PREÇO COM BDI",null,null,"PARTICIPAÇÃO ( % )"]
[null,null,null,null,null,null,null,null,null,null,null,null,null,null,"a.","SERVIÇOS PRELIMINARES",null,null,{"$f":"SUMIF($R$19:$R$618,$P637,$Z$19:$Z$618)","v":0},null,null,null,null,{"$f":"ROUND(S637*(1+BDI.Taxa),2)","v":0},null,null,{"$f":"IFERROR(ROUND($X637*100/$Z$621,2),0)","v":0}]
[null,null,null,null,null,null,null,null,null,null,null,null,null,null,"b.","TRANSPORTES",null,null,0,null,null,null,null,0,null,null,0]
[null,null,null,null,null,null,null,null,null,null,null,null,null,null,"c.","SERVIÇO EM TERRA",null,null,0,null,null,null,null,0,null,null,0]
[null,null,null,null,null,null,null,null,null,null,null,null,null,null,"d.","FUNDAÇÕES E SONDAGENS",null,null,0,null,null,null,null,0,null,null,0]
[null,null,null,null,null,null,null,null,null,null,null,null,null,null,"e.","ESTRUTURA",null,null,0,null,null,null,null,0,null,null,0]
[null,null,null,null,null,null,null,null,null,null,null,null,null,null,"f.","INSTALAÇÕES ELÉTRICAS",null,null,0,null,null,null,null,0,null,null,0]
[null,null,null,null,null,null,null,null,null,null,null,null,null,null,"g.","INSTALAÇÕES HIDROSSANITÁRIAS",null,null,0,null,null,null,null,0,null,null,0]
[null,null,null,null,null,null,null,null,null,null,null,null,null,null,"h","INSTALAÇÕES ESPECIAIS",null,null,0,null,null,null,null,0,null,null,0]
[null,null,null,null,null,null,null,null,null,null,null,null,null,null,"i.","ALVENARIAS E DIVISÓRIAS",null,null,0,null,null,null,null,0,null,null,0]
[null,null,null,null,null,null,null,null,null,null,null,null,null,null,"j.","ALVENARIA AUTO-PORTANTE",null,null,0,null,null,null,null,0,null,null,0]
[null,null,null,null,null,null,null,null,null,null,null,null,null,null,"k.","IMPERMEABILIZAÇÃO",null,null,0,null,null,null,null,0,null,null,0]
[null,null,null,null,null,null,null,null,null,null,null,null,null,null,"l.","ISOLAMENTO TÉRMICO E ACÚSTICO",null,null,0,null,null,null,null,0,null,null,0]
[null,null,null,null,null,null,null,null,null,null,null,null,null,null,"m.","ESTRUTURA DE MADEIRA",null,null,0,null,null,null,null,0,null,null,0]
[null,null,null,null,null,null,null,null,null,null,null,null,null,null,"n.","ESTRUTURAS METÁLICAS",null,null,0,null,null,null,null,0,null,null,0]
[null,null,null,null,null,null,null,null,null,null,null,null,null,null,"o.","COBERTURAS",null,null,0,null,null,null,null,0,null,null,0]
[null,null,null,null,null,null,null,null,null,null,null,null,null,null,"p.","ESQUADRIAS DE MADEIRA",null,null,0,null,null,null,null,0,null,null,0]
[null,null,null,null,null,null,null,null,null,null,null,null,null,null,"q.","ESQUADRIAS METÁLICAS",null,null,0,null,null,null,null,{"$f":"ROUND(S653*(1+BDI.Taxa),2)","v":0},null,null,0]
[null,null,null,null,null,null,null,null,null,null,null,null,null,null,"r.","VIDROS",null,null,0,null,null,null,null,0,null,null,0]
[null,null,null,null,null,null,null,null,null,null,null,null,null,null,"s.","REVESTIMENTO DE PAREDE",null,null,0,null,null,null,null,0,null,null,0]
[null,null,null,null,null,null,null,null,null,null,null,null,null,null,"t.","FORROS",null,null,0,null,null,null,null,0,null,null,0]
[null,null,null,null,null,null,null,null,null,null,null,null,null,null,"u.","REVESTIMENTO DE PISO",null,null,0,null,null,null,null,0,null,null,0]
[null,null,null,null,null,null,null,null,null,null,null,null,null,null,"v.","FERRAGENS",null,null,0,null,null,null,null,0,null,null,0]
[null,null,null,null,null,null,null,null,null,null,null,null,null,null,"w.","MARCENARIA",null,null,0,null,null,null,null,0,null,null,0]
[null,null,null,null,null,null,null,null,null,null,null,null,null,null,"x.","ADMINISTRAÇÃO",null,null,0,null,null,null,null,0,null,null,0]
[null,null,null,null,null,null,null,null,null,null,null,null,null,null,"y.","PINTURA",null,null,0,null,null,null,null,{"$f":"ROUND(S661*(1+BDI.Taxa),2)","v":0},null,null,0]
[null,null,null,null,null,null,null,null,null,null,null,null,null,null,"z.","DIVERSOS",null,null,0,null,null,null,null,{"$f":"IF(S662>0,IF((SUM(X637:Y661)+ROUND(S662*(1+BDI.Taxa),2))<>X664,X664-SUM(X637:Y661),ROUND(S662*(1+BDI.Taxa),2)),0)","v":0},null,null,{"$f":"IF(S662>0,IF((SUM(AA637:AA661)+IFERROR(ROUND($X662*100/$Z$621,2),0))<>AA664,AA664-SUM(AA637:AA661),IFERROR(ROUND($X662*100/$Z$621,2),0)),0)","v":0}]
[null,null,null,null,null,null,null,null,null,null,null,null,null,null,"TOTAL GERAL DO ORÇAMENTO (R$)",null,null,null,{"$f":"SUM(S637:W662)","v":0},null,null,null,null,{"$f":"SUM(X637:Y662)","v":0},null,null,{"$f":"SUM(AA637:AA662)","v":0}]
[null,null,null,null,null,null,null,null,null,null,null,null,null,null,null,null,null,null,{"$f":"$Z$619","v":0},null,null,null,null,{"$f":"$Z$621","v":0},null,null,100]
[null,null,null,null,null,null,null,null,null,null,null,null,null,null,null,null,null,null,"(TOTAL SEM BDI)",null,null,null,null,"(TOTAL COM BDI)",null,null,"(ARRED porcentagem)"]
[null,null,null,null,null,null,null,null,null,null,null,null,null,null,null,null,null,null,{"$f":"IF(AND(S663=S664,S663>0),\"OK\",\"ERRO\")","v":"ERRO"},null,null,null,null,{"$f":"IF(AND(X663=X664,X663>0),\"OK\",\"ERRO\")","v":"ERRO"},null,null,{"$f":"IF(AA663=100,\"OK\",\"ERRO\")","v":"ERRO"}]
[]
[]
[null,null,null,null,null,null,null,null,null,null,null,null,null,null,"RESUMO GERAL DO ORÇAMENTO"]
[null,null,null,null,null,null,null,null,null,null,null,null,null,null,"ITEM","DESCRIÇÃO DOS SERVIÇOS",null,null,"PREÇO SEM BDI",null,null,null,null,"PREÇO COM BDI",null,null,"PARTICIPAÇÃO ( % )"]
[null,null,null,null,null,null,null,null,null,null,null,null,null,null,"1.",{"$f":"IFERROR(VLOOKUP(O671,$O$19:$Y$618,4,FALSE),\"\")","v":"REFORMA E IMPLANTAÇÃO"},null,null,{"$f":"IF(P672=\"\",$S$692-SUM(OFFSET($S$670:S670,0,0,COUNTA($S$670:S670),1)),SUMIF($R$19:$R$618,$P671,$Z$19:$Z$618))","v":0},null,null,null,null,{"$f":"IF(P672=\"\",$X$692-SUM(OFFSET($X$670:X670,0,0,COUNTA($X$670:X670),1)),ROUND(S671*(1+BDI.Taxa),2))","v":0},null,null,{"$f":"IF(P672=\"\",$AA$692-SUM(OFFSET($AA$670:AA670,0,0,COUNTA($AA$670:AA670),1)),ROUND(X671*100/ORÇAMENTO.TotalOrçamento,2))","v":{"$error":"#DIV/0!"}}]
[null,null,null,null,null,null,null,null,null,null,null,null,null,null,"2.","BLOCO 03 SALAS PADRÃO SEDUC 2019 - LAJE",null,null,{"$f":"IF(P673=\"\",$S$692-SUM(OFFSET($S$670:S671,0,0,COUNTA($S$670:S671),1)),SUMIF($R$19:$R$618,$P672,$Z$19:$Z$618))","v":0},null,null,null,null,{"$f":"IF(P673=\"\",$X$692-SUM(OFFSET($X$670:X671,0,0,COUNTA($X$670:X671),1)),ROUND(S672*(1+BDI.Taxa),2))","v":0},null,null,{"$f":"IF(P673=\"\",$AA$692-SUM(OFFSET($AA$670:AA671,0,0,COUNTA($AA$670:AA671),1)),ROUND(X672*100/ORÇAMENTO.TotalOrçamento,2))","v":{"$error":"#DIV/0!"}}]
[null,null,null,null,null,null,null,null,null,null,null,null,null,null,"3.","BLOCO SANITÁRIO PADRÃO SEDUC 2013",null,null,{"$f":"IF(P674=\"\",$S$692-SUM(OFFSET($S$670:S672,0,0,COUNTA($S$670:S672),1)),SUMIF($R$19:$R$618,$P673,$Z$19:$Z$618))","v":0},null,null,null,null,{"$f":"IF(P674=\"\",$X$692-SUM(OFFSET($X$670:X672,0,0,COUNTA($X$670:X672),1)),ROUND(S673*(1+BDI.Taxa),2))","v":0},null,null,{"$f":"IF(P674=\"\",$AA$692-SUM(OFFSET($AA$670:AA672,0,0,COUNTA($AA$670:AA672),1)),ROUND(X673*100/ORÇAMENTO.TotalOrçamento,2))","v":{"$error":"#DIV/0!"}}]
[null,null,null,null,null,null,null,null,null,null,null,null,null,null,"4.","PASSARELA MODELO 01 - PADRÃO SÉC. XXI 2015",null,null,{"$f":"IF(P675=\"\",$S$692-SUM(OFFSET($S$670:S673,0,0,COUNTA($S$670:S673),1)),SUMIF($R$19:$R$618,$P674,$Z$19:$Z$618))","v":0},null,null,null,null,{"$f":"IF(P675=\"\",$X$692-SUM(OFFSET($X$670:X673,0,0,COUNTA($X$670:X673),1)),ROUND(S674*(1+BDI.Taxa),2))","v":0},null,null,{"$f":"IF(P675=\"\",$AA$692-SUM(OFFSET($AA$670:AA673,0,0,COUNTA($AA$670:AA673),1)),ROUND(X674*100/ORÇAMENTO.TotalOrçamento,2))","v":{"$error":"#DIV/0!"}}]
[null,null,null,null,null,null,null,null,null,null,null,null,null,null,"5.","PASSARELA MODELO 02 - PADRÃO SÉC. XXI 2015",null,null,{"$f":"IF(P676=\"\",$S$692-SUM(OFFSET($S$670:S674,0,0,COUNTA($S$670:S674),1)),SUMIF($R$19:$R$618,$P675,$Z$19:$Z$618))","v":0},null,null,null,null,{"$f":"IF(P676=\"\",$X$692-SUM(OFFSET($X$670:X674,0,0,COUNTA($X$670:X674),1)),ROUND(S675*(1+BDI.Taxa),2))","v":0},null,null,{"$f":"IF(P676=\"\",$AA$692-SUM(OFFSET($AA$670:AA674,0,0,COUNTA($AA$670:AA674),1)),ROUND(X675*100/ORÇAMENTO.TotalOrçamento,2))","v":{"$error":"#DIV/0!"}}]
[null,null,null,null,null,null,null,null,null,null,null,null,null,null,"6.","",null,null,{"$f":"IF(P677=\"\",$S$692-SUM(OFFSET($S$670:S675,0,0,COUNTA($S$670:S675),1)),SUMIF($R$19:$R$618,$P676,$Z$19:$Z$618))","v":0},null,null,null,null,{"$f":"IF(P677=\"\",$X$692-SUM(OFFSET($X$670:X675,0,0,COUNTA($X$670:X675),1)),ROUND(S676*(1+BDI.Taxa),2))","v":0},null,null,{"$f":"IF(P677=\"\",$AA$692-SUM(OFFSET($AA$670:AA675,0,0,COUNTA($AA$670:AA675),1)),ROUND(X676*100/ORÇAMENTO.TotalOrçamento,2))","v":{"$error":"#DIV/0!"}}]
[null,null,null,null,null,null,null,null,null,null,null,null,null,null,"7.","",null,null,{"$f":"IF(P678=\"\",$S$692-SUM(OFFSET($S$670:S676,0,0,COUNTA($S$670:S676),1)),SUMIF($R$19:$R$618,$P677,$Z$19:$Z$618))","v":0},null,null,null,null,{"$f":"IF(P678=\"\",$X$692-SUM(OFFSET($X$670:X676,0,0,COUNTA($X$670:X676),1)),ROUND(S677*(1+BDI.Taxa),2))","v":0},null,null,{"$f":"IF(P678=\"\",$AA$692-SUM(OFFSET($AA$670:AA676,0,0,COUNTA($AA$670:AA676),1)),ROUND(X677*100/ORÇAMENTO.TotalOrçamento,2))","v":{"$error":"#DIV/0!"}}]
[null,null,null,null,null,null,null,null,null,null,null,null,null,null,"8.","",null,null,{"$f":"IF(P679=\"\",$S$692-SUM(OFFSET($S$670:S677,0,0,COUNTA($S$670:S677),1)),SUMIF($R$19:$R$618,$P678,$Z$19:$Z$618))","v":0},null,null,null,null,{"$f":"IF(P679=\"\",$X$692-SUM(OFFSET($X$670:X677,0,0,COUNTA($X$670:X677),1)),ROUND(S678*(1+BDI.Taxa),2))","v":0},null,null,{"$f":"IF(P679=\"\",$AA$692-SUM(OFFSET($AA$670:AA677,0,0,COUNTA($AA$670:AA677),1)),ROUND(X678*100/ORÇAMENTO.TotalOrçamento,2))","v":{"$error":"#DIV/0!"}}]
[null,null,null,null,null,null,null,null,null,null,null,null,null,null,"9.","",null,null,{"$f":"IF(P680=\"\",$S$692-SUM(OFFSET($S$670:S678,0,0,COUNTA($S$670:S678),1)),SUMIF($R$19:$R$618,$P679,$Z$19:$Z$618))","v":0},null,null,null,null,{"$f":"IF(P680=\"\",$X$692-SUM(OFFSET($X$670:X678,0,0,COUNTA($X$670:X678),1)),ROUND(S679*(1+BDI.Taxa),2))","v":0},null,null,{"$f":"IF(P680=\"\",$AA$692-SUM(OFFSET($AA$670:AA678,0,0,COUNTA($AA$670:AA678),1)),ROUND(X679*100/ORÇAMENTO.TotalOrçamento,2))","v":{"$error":"#DIV/0!"}}]
[null,null,null,null,null,null,null,null,null,null,null,null,null,null,"10.","",null,null,{"$f":"IF(P681=\"\",$S$692-SUM(OFFSET($S$670:S679,0,0,COUNTA($S$670:S679),1)),SUMIF($R$19:$R$618,$P680,$Z$19:$Z$618))","v":0},null,null,null,null,{"$f":"IF(P681=\"\",$X$692-SUM(OFFSET($X$670:X679,0,0,COUNTA($X$670:X679),1)),ROUND(S680*(1+BDI.Taxa),2))","v":0},null,null,{"$f":"IF(P681=\"\",$AA$692-SUM(OFFSET($AA$670:AA679,0,0,COUNTA($AA$670:AA679),1)),ROUND(X680*100/ORÇAMENTO.TotalOrçamento,2))","v":{"$error":"#DIV/0!"}}]
[null,null,null,null,null,null,null,null,null,null,null,null,null,null,"11.","",null,null,{"$f":"IF(P682=\"\",$S$692-SUM(OFFSET($S$670:S680,0,0,COUNTA($S$670:S680),1)),SUMIF($R$19:$R$618,$P681,$Z$19:$Z$618))","v":0},null,null,null,null,{"$f":"IF(P682=\"\",$X$692-SUM(OFFSET($X$670:X680,0,0,COUNTA($X$670:X680),1)),ROUND(S681*(1+BDI.Taxa),2))","v":0},null,null,{"$f":"IF(P682=\"\",$AA$692-SUM(OFFSET($AA$670:AA680,0,0,COUNTA($AA$670:AA680),1)),ROUND(X681*100/ORÇAMENTO.TotalOrçamento,2))","v":{"$error":"#DIV/0!"}}]
[null,null,null,null,null,null,null,null,null,null,null,null,null,null,"12.","",null,null,{"$f":"IF(P683=\"\",$S$692-SUM(OFFSET($S$670:S681,0,0,COUNTA($S$670:S681),1)),SUMIF($R$19:$R$618,$P682,$Z$19:$Z$618))","v":0},null,null,null,null,{"$f":"IF(P683=\"\",$X$692-SUM(OFFSET($X$670:X681,0,0,COUNTA($X$670:X681),1)),ROUND(S682*(1+BDI.Taxa),2))","v":0},null,null,{"$f":"IF(P683=\"\",$AA$692-SUM(OFFSET($AA$670:AA681,0,0,COUNTA($AA$670:AA681),1)),ROUND(X682*100/ORÇAMENTO.TotalOrçamento,2))","v":{"$error":"#DIV/0!"}}]
[null,null,null,null,null,null,null,null,null,null,null,null,null,null,"13.","",null,null,{"$f":"IF(P684=\"\",$S$692-SUM(OFFSET($S$670:S682,0,0,COUNTA($S$670:S682),1)),SUMIF($R$19:$R$618,$P683,$Z$19:$Z$618))","v":0},null,null,null,null,{"$f":"IF(P684=\"\",$X$692-SUM(OFFSET($X$670:X682,0,0,COUNTA($X$670:X682),1)),ROUND(S683*(1+BDI.Taxa),2))","v":0},null,null,{"$f":"IF(P684=\"\",$AA$692-SUM(OFFSET($AA$670:AA682,0,0,COUNTA($AA$670:AA682),1)),ROUND(X683*100/ORÇAMENTO.TotalOrçamento,2))","v":{"$error":"#DIV/0!"}}]
[null,null,null,null,null,null,null,null,null,null,null,null,null,null,"14.","",null,null,{"$f":"IF(P685=\"\",$S$692-SUM(OFFSET($S$670:S683,0,0,COUNTA($S$670:S683),1)),SUMIF($R$19:$R$618,$P684,$Z$19:$Z$618))","v":0},null,null,null,null,{"$f":"IF(P685=\"\",$X$692-SUM(OFFSET($X$670:X683,0,0,COUNTA($X$670:X683),1)),ROUND(S684*(1+BDI.Taxa),2))","v":0},null,null,{"$f":"IF(P685=\"\",$AA$692-SUM(OFFSET($AA$670:AA683,0,0,COUNTA($AA$670:AA683),1)),ROUND(X684*100/ORÇAMENTO.TotalOrçamento,2))","v":{"$error":"#DIV/0!"}}]
[null,null,null,null,null,null,null,null,null,null,null,null,null,null,"15.","",null,null,{"$f":"IF(P686=\"\",$S$692-SUM(OFFSET($S$670:S684,0,0,COUNTA($S$670:S684),1)),SUMIF($R$19:$R$618,$P685,$Z$19:$Z$618))","v":0},null,null,null,null,{"$f":"IF(P686=\"\",$X$692-SUM(OFFSET($X$670:X684,0,0,COUNTA($X$670:X684),1)),ROUND(S685*(1+BDI.Taxa),2))","v":0},null,null,{"$f":"IF(P686=\"\",$AA$692-SUM(OFFSET($AA$670:AA684,0,0,COUNTA($AA$670:AA684),1)),ROUND(X685*100/ORÇAMENTO.TotalOrçamento,2))","v":{"$error":"#DIV/0!"}}]
[null,null,null,null,null,null,null,null,null,null,null,null,null,null,"16.","",null,null,{"$f":"IF(P687=\"\",$S$692-SUM(OFFSET($S$670:S685,0,0,COUNTA($S$670:S685),1)),SUMIF($R$19:$R$618,$P686,$Z$19:$Z$618))","v":0},null,null,null,null,{"$f":"IF(P687=\"\",$X$692-SUM(OFFSET($X$670:X685,0,0,COUNTA($X$670:X685),1)),ROUND(S686*(1+BDI.Taxa),2))","v":0},null,null,{"$f":"IF(P687=\"\",$AA$692-SUM(OFFSET($AA$670:AA685,0,0,COUNTA($AA$670:AA685),1)),ROUND(X686*100/ORÇAMENTO.TotalOrçamento,2))","v":{"$error":"#DIV/0!"}}]
[null,null,null,null,null,null,null,null,null,null,null,null,null,null,"17.","",null,null,{"$f":"IF(P688=\"\",$S$692-SUM(OFFSET($S$670:S686,0,0,COUNTA($S$670:S686),1)),SUMIF($R$19:$R$618,$P687,$Z$19:$Z$618))","v":0},null,null,null,null,{"$f":"IF(P688=\"\",$X$692-SUM(OFFSET($X$670:X686,0,0,COUNTA($X$670:X686),1)),ROUND(S687*(1+BDI.Taxa),2))","v":0},null,null,{"$f":"IF(P688=\"\",$AA$692-SUM(OFFSET($AA$670:AA686,0,0,COUNTA($AA$670:AA686),1)),ROUND(X687*100/ORÇAMENTO.TotalOrçamento,2))","v":{"$error":"#DIV/0!"}}]
[null,null,null,null,null,null,null,null,null,null,null,null,null,null,"18.","",null,null,{"$f":"IF(P689=\"\",$S$692-SUM(OFFSET($S$670:S687,0,0,COUNTA($S$670:S687),1)),SUMIF($R$19:$R$618,$P688,$Z$19:$Z$618))","v":0},null,null,null,null,{"$f":"IF(P689=\"\",$X$692-SUM(OFFSET($X$670:X687,0,0,COUNTA($X$670:X687),1)),ROUND(S688*(1+BDI.Taxa),2))","v":0},null,null,{"$f":"IF(P689=\"\",$AA$692-SUM(OFFSET($AA$670:AA687,0,0,COUNTA($AA$670:AA687),1)),ROUND(X688*100/ORÇAMENTO.TotalOrçamento,2))","v":{"$error":"#DIV/0!"}}]
[null,null,null,null,null,null,null,null,null,null,null,null,null,null,"19.","",null,null,{"$f":"IF(P690=\"\",$S$692-SUM(OFFSET($S$670:S688,0,0,COUNTA($S$670:S688),1)),SUMIF($R$19:$R$618,$P689,$Z$19:$Z$618))","v":0},null,null,null,null,{"$f":"IF(P690=\"\",$X$692-SUM(OFFSET($X$670:X688,0,0,COUNTA($X$670:X688),1)),ROUND(S689*(1+BDI.Taxa),2))","v":0},null,null,{"$f":"IF(P690=\"\",$AA$692-SUM(OFFSET($AA$670:AA688,0,0,COUNTA($AA$670:AA688),1)),ROUND(X689*100/ORÇAMENTO.TotalOrçamento,2))","v":{"$error":"#DIV/0!"}}]
[null,null,null,null,null,null,null,null,null,null,null,null,null,null,"20.","",null,null,{"$f":"IF(P691=\"\",$S$692-SUM(OFFSET($S$670:S689,0,0,COUNTA($S$670:S689),1)),SUMIF($R$19:$R$618,$P690,$Z$19:$Z$618))","v":0},null,null,null,null,{"$f":"IF(P691=\"\",$X$692-SUM(OFFSET($X$670:X689,0,0,COUNTA($X$670:X689),1)),ROUND(S690*(1+BDI.Taxa),2))","v":0},null,null,{"$f":"IF(P691=\"\",$AA$692-SUM(OFFSET($AA$670:AA689,0,0,COUNTA($AA$670:AA689),1)),ROUND(X690*100/ORÇAMENTO.TotalOrçamento,2))","v":{"$error":"#DIV/0!"}}]
[null,null,null,null,null,null,null,null,null,null,null,null,null,null,"TOTAL GERAL DO ORÇAMENTO (R$)",null,null,null,{"$f":"SUM(S671:W690)","v":0},null,null,null,null,{"$f":"SUM(X671:Y690)","v":0},null,null,{"$f":"SUM(AA671:AA690)","v":{"$error":"#DIV/0!"}}]
[null,null,null,null,null,null,null,null,null,null,null,null,null,null,null,null,null,null,{"$f":"$Z$619","v":0},null,null,null,null,{"$f":"$Z$621","v":0},null,null,100]
[null,null,null,null,null,null,null,null,null,null,null,null,null,null,null,null,null,null,"(TOTAL SEM BDI)",null,null,null,null,"(TOTAL COM BDI)",null,null,"(ARRED porcentagem)"]
[null,null,null,null,null,null,null,null,null,null,null,null,null,null,null,null,null,null,{"$f":"IF(AND(S691=S692,S691>0),\"OK\",\"ERRO\")","v":"ERRO"},null,null,null,null,{"$f":"IF(AND(X691=X692,X691>0),\"OK\",\"ERRO\")","v":"ERRO"},null,null,{"$f":"IF(AND(AA691=100,S671<>0),\"OK\",\"ERRO\")","v":{"$error":"#DIV/0!"}}]

{"sheet":"Resumo ","index":1,"n_rows":39,"n_cols":9,"rows_kept":39,"cut":false,"hidden":false,"merged":[[42,3,42,7],[41,3,41,7],[38,1,38,8],[22,2,22,5],[23,2,23,5],[24,2,24,5],[25,2,25,5],[26,2,26,5],[32,2,32,5],[33,2,33,5],[34,2,34,5],[35,2,35,5],[27,2,27,5],[28,2,28,5],[29,2,29,5],[30,2,30,5],[31,2,31,5],[1,1,1,8],[2,6,2,8],[3,6,3,8],[4,1,4,8],[5,6,5,8],[6,6,6,8],[7,1,7,8],[8,6,8,8],[9,6,9,8],[13,1,13,8],[11,1,11,2],[12,1,12,2],[0,1,0,8],[36,1,36,5],[2,1,2,5],[3,1,3,5],[5,1,5,5],[6,1,6,5],[8,1,8,5],[9,1,9,5],[11,3,11,5],[12,3,12,5],[10,1,10,8],[11,6,11,8],[12,6,12,8],[19,2,19,5],[20,2,20,5],[21,2,21,5],[13,0,14,0],[15,2,15,5],[16,2,16,5],[17,2,17,5],[18,2,18,5],[14,1,14,8]]}
[]
[]
[null,"UNIDADE ESCOLAR",null,null,null,null,"CÓDIGO INEP"]
[null,{"$f":"Orçamento!$O$4","v":"COLÉGIO ESTADUAL JUSCELINO KUBITSCHEK DE OLIVEIRA"},null,null,null,null,{"$f":"Orçamento!X4","v":52075583}]
[]
[null,"OBRA",null,null,null,null,"CIDADE"]
[null,{"$f":"Orçamento!$O$7","v":"REFORMA E IMPLANTAÇÃO"},null,null,null,null,{"$f":"Orçamento!$X$7","v":"ÁGUAS LINDAS DE GOIÁS"}]
[]
[null,"ENDEREÇO",null,null,null,null,"CRE"]
[null,{"$f":"Orçamento!$R$10","v":"AREA ESPECIAL S/N, JARDIM SANTA LUCIA, CEP:72910-001"},null,null,null,null,{"$f":"Orçamento!$O$10","v":"ÁGUAS LINDAS"}]
[]
[null,"REFERÊNCIA",null,"DATA",null,null,"ÁREA TOTAL CONSTRUÍDA (M²)"]
[null,{"$f":"CONCATENATE(\"AGETOP E SINAPI - \",Orçamento!$Y$10)","v":"AGETOP E SINAPI - DESONERADA"},null,{"$f":"Orçamento!$S$7","v":"2020-07-07"},null,null,{"$f":"Orçamento!$S$13","v":3074.09}]
["FILTRO"]
[null,"RESUMO GERAL DO ORÇAMENTO"]
["↓","ITEM","DESCRIÇÃO DOS SERVIÇOS",null,null,null,"PREÇO SEM BDI","PREÇO COM BDI","PARTICIP. (%)"]
[{"$f":"IF(G17>0,\"F\",\"\")","v":""},"1.",{"$f":"Orçamento!$P671","v":"REFORMA E IMPLANTAÇÃO"},null,null,null,{"$f":"IFERROR(Orçamento!S671,\"-\")","v":0},{"$f":"IFERROR(Orçamento!X671,\"\")","v":0},{"$f":"Orçamento!AA671","v":{"$error":"#DIV/0!"}}]
[{"$f":"IF(G18>0,\"F\",\"\")","v":""},"2.",{"$f":"Orçamento!$P672","v":"BLOCO 03 SALAS PADRÃO SEDUC 2019 - LAJE"},null,null,null,{"$f":"IFERROR(Orçamento!S672,\"-\")","v":0},{"$f":"IFERROR(Orçamento!X672,\"\")","v":0},{"$f":"Orçamento!AA672","v":{"$error":"#DIV/0!"}}]
["","3.",{"$f":"Orçamento!$P673","v":"BLOCO SANITÁRIO PADRÃO SEDUC 2013"},null,null,null,{"$f":"IFERROR(Orçamento!S673,\"-\")","v":0},{"$f":"IFERROR(Orçamento!X673,\"\")","v":0},{"$f":"Orçamento!AA673","v":{"$error":"#DIV/0!"}}]
["","4.",{"$f":"Orçamento!$P674","v":"PASSARELA MODELO 01 - PADRÃO SÉC. XXI 2015"},null,null,null,{"$f":"IFERROR(Orçamento!S674,\"-\")","v":0},{"$f":"IFERROR(Orçamento!X674,\"\")","v":0},{"$f":"Orçamento!AA674","v":{"$error":"#DIV/0!"}}]
["","5.",{"$f":"Orçamento!$P675","v":"PASSARELA MODELO 02 - PADRÃO SÉC. XXI 2015"},null,null,null,{"$f":"IFERROR(Orçamento!S675,\"-\")","v":0},{"$f":"IFERROR(Orçamento!X675,\"\")","v":0},{"$f":"Orçamento!AA675","v":{"$error":"#DIV/0!"}}]
["","6.",{"$f":"Orçamento!$P676","v":""},null,null,null,{"$f":"IFERROR(Orçamento!S676,\"-\")","v":0},{"$f":"IFERROR(Orçamento!X676,\"\")","v":0},{"$f":"Orçamento!AA676","v":{"$error":"#DIV/0!"}}]
["","7.",{"$f":"Orçamento!$P677","v":""},null,null,null,{"$f":"IFERROR(Orçamento!S677,\"-\")","v":0},{"$f":"IFERROR(Orçamento!X677,\"\")","v":0},{"$f":"Orçamento!AA677","v":{"$error":"#DIV/0!"}}]
["","8.",{"$f":"Orçamento!$P678","v":""},null,null,null,{"$f":"IFERROR(Orçamento!S678,\"-\")","v":0},{"$f":"IFERROR(Orçamento!X678,\"\")","v":0},{"$f":"Orçamento!AA678","v":{"$error":"#DIV/0!"}}]
["","9.",{"$f":"Orçamento!$P679","v":""},null,null,null,{"$f":"IFERROR(Orçamento!S679,\"-\")","v":0},{"$f":"IFERROR(Orçamento!X679,\"\")","v":0},{"$f":"Orçamento!AA679","v":{"$error":"#DIV/0!"}}]
["","10.",{"$f":"Orçamento!$P680","v":""},null,null,null,{"$f":"IFERROR(Orçamento!S680,\"-\")","v":0},{"$f":"IFERROR(Orçamento!X680,\"\")","v":0},{"$f":"Orçamento!AA680","v":{"$error":"#DIV/0!"}}]
["","11.",{"$f":"Orçamento!$P681","v":""},null,null,null,{"$f":"IFERROR(Orçamento!S681,\"-\")","v":0},{"$f":"IFERROR(Orçamento!X681,\"\")","v":0},{"$f":"Orçamento!AA681","v":{"$error":"#DIV/0!"}}]
["","12.",{"$f":"Orçamento!$P682","v":""},null,null,null,{"$f":"IFERROR(Orçamento!S682,\"-\")","v":0},{"$f":"IFERROR(Orçamento!X682,\"\")","v":0},{"$f":"Orçamento!AA682","v":{"$error":"#DIV/0!"}}]
["","13.",{"$f":"Orçamento!$P683","v":""},null,null,null,{"$f":"IFERROR(Orçamento!S683,\"-\")","v":0},{"$f":"IFERROR(Orçamento!X683,\"\")","v":0},{"$f":"Orçamento!AA683","v":{"$error":"#DIV/0!"}}]
["","14.",{"$f":"Orçamento!$P684","v":""},null,null,null,{"$f":"IFERROR(Orçamento!S684,\"-\")","v":0},{"$f":"IFERROR(Orçamento!X684,\"\")","v":0},{"$f":"Orçamento!AA684","v":{"$error":"#DIV/0!"}}]
["","15.",{"$f":"Orçamento!$P685","v":""},null,null,null,{"$f":"IFERROR(Orçamento!S685,\"-\")","v":0},{"$f":"IFERROR(Orçamento!X685,\"\")","v":0},{"$f":"Orçamento!AA685","v":{"$error":"#DIV/0!"}}]
["","16.",{"$f":"Orçamento!$P686","v":""},null,null,null,{"$f":"IFERROR(Orçamento!S686,\"-\")","v":0},{"$f":"IFERROR(Orçamento!X686,\"\")","v":0},{"$f":"Orçamento!AA686","v":{"$error":"#DIV/0!"}}]
["","17.",{"$f":"Orçamento!$P687","v":""},null,null,null,{"$f":"IFERROR(Orçamento!S687,\"-\")","v":0},{"$f":"IFERROR(Orçamento!X687,\"\")","v":0},{"$f":"Orçamento!AA687","v":{"$error":"#DIV/0!"}}]
["","18.",{"$f":"Orçamento!$P688","v":""},null,null,null,{"$f":"IFERROR(Orçamento!S688,\"-\")","v":0},{"$f":"IFERROR(Orçamento!X688,\"\")","v":0},{"$f":"Orçamento!AA688","v":{"$error":"#DIV/0!"}}]
["","19.",{"$f":"Orçamento!$P689","v":""},null,null,null,{"$f":"IFERROR(Orçamento!S689,\"-\")","v":0},{"$f":"IFERROR(Orçamento!X689,\"\")","v":0},{"$f":"Orçamento!AA689","v":{"$error":"#DIV/0!"}}]
["","20.",{"$f":"Orçamento!$P690","v":""},null,null,null,{"$f":"IFERROR(Orçamento!S690,\"-\")","v":0},{"$f":"IFERROR(Orçamento!X690,\"\")","v":0},{"$f":"Orçamento!AA690","v":{"$error":"#DIV/0!"}}]
["F","TOTAL GERAL DO ORÇAMENTO (R$)",null,null,null,null,{"$f":"SUM(G17:G36)","v":0},0,{"$f":"SUM(I17:I36)","v":{"$error":"#DIV/0!"}}]
["F"]
["F"]

{"sheet":"Somatório","index":2,"n_rows":45,"n_cols":9,"rows_kept":45,"cut":false,"hidden":false,"merged":[[0,1,0,5],[14,1,14,5],[2,1,2,3],[2,4,2,5],[3,1,3,3],[3,4,3,5],[5,1,5,3],[5,4,5,5],[6,1,6,3],[6,4,6,5],[8,1,8,3],[8,4,8,5],[1,1,1,5],[4,1,4,5],[7,1,7,5],[10,1,10,5],[9,1,9,3],[9,4,9,5],[11,1,11,2],[11,4,11,5],[12,1,12,2],[12,4,12,5],[13,0,14,0],[42,1,42,2],[44,1,44,5],[47,3,47,5],[48,3,48,5],[13,1,13,5]]}
[]
[]
[null,"UNIDADE ESCOLAR",null,null,"CÓDIGO INEP"]
[null,{"$f":"Orçamento!$O$4","v":"COLÉGIO ESTADUAL JUSCELINO KUBITSCHEK DE OLIVEIRA"},null,null,{"$f":"Orçamento!X4","v":52075583}]
[]
[null,"OBRA",null,null,"CIDADE"]
[null,{"$f":"Orçamento!$O$7","v":"REFORMA E IMPLANTAÇÃO"},null,null,{"$f":"Orçamento!$X$7","v":"ÁGUAS LINDAS DE GOIÁS"}]
[]
[null,"ENDEREÇO",null,null,"CRE"]
[null,{"$f":"Orçamento!$R$10","v":"AREA ESPECIAL S/N, JARDIM SANTA LUCIA, CEP:72910-001"},null,null,{"$f":"Orçamento!$O$10","v":"ÁGUAS LINDAS"}]
[]
[null,"REFERÊNCIA",null,"DATA","ÁREA TOTAL CONSTRUÍDA (M²)"]
[null,{"$f":"CONCATENATE(\"AGETOP E SINAPI - \",Orçamento!$Y$10)","v":"AGETOP E SINAPI - DESONERADA"},null,{"$f":"Orçamento!$S$7","v":"2020-07-07"},{"$f":"Orçamento!$S$13","v":3074.09}]
["FILTRO"]
[null,"SOMATÓRIO DE SERVIÇOS"]
["↓","ITEM","DESCRIÇÃO DOS SERVIÇOS","PREÇO SEM BDI (R$)","PREÇO COM BDI (R$)","PARTIC.  ( % )"]
[{"$f":"IF(D17>0,\"F\",\"\")","v":""},"a.",{"$f":"Orçamento!P637","v":"SERVIÇOS PRELIMINARES"},{"$f":"Orçamento!S637","v":0},{"$f":"Orçamento!X637","v":0},{"$f":"Orçamento!AA637","v":0},5,6,7]
[{"$f":"IF(D18>0,\"F\",\"\")","v":""},"b.",{"$f":"Orçamento!P638","v":"TRANSPORTES"},{"$f":"Orçamento!S638","v":0},{"$f":"Orçamento!X638","v":0},{"$f":"Orçamento!AA638","v":0},0,0,1]
["","c.",{"$f":"Orçamento!P639","v":"SERVIÇO EM TERRA"},{"$f":"Orçamento!S639","v":0},{"$f":"Orçamento!X639","v":0},{"$f":"Orçamento!AA639","v":0},6,6,7]
["","d.",{"$f":"Orçamento!P640","v":"FUNDAÇÕES E SONDAGENS"},{"$f":"Orçamento!S640","v":0},{"$f":"Orçamento!X640","v":0},{"$f":"Orçamento!AA640","v":0},0,2,9]
["","e.",{"$f":"Orçamento!P641","v":"ESTRUTURA"},{"$f":"Orçamento!S641","v":0},{"$f":"Orçamento!X641","v":0},{"$f":"Orçamento!AA641","v":0},6,0,7]
["","f.",{"$f":"Orçamento!P642","v":"INSTALAÇÕES ELÉTRICAS"},{"$f":"Orçamento!S642","v":0},{"$f":"Orçamento!X642","v":0},{"$f":"Orçamento!AA642","v":0},9,0,7]
["","g.",{"$f":"Orçamento!P643","v":"INSTALAÇÕES HIDROSSANITÁRIAS"},{"$f":"Orçamento!S643","v":0},{"$f":"Orçamento!X643","v":0},{"$f":"Orçamento!AA643","v":0},0,6,4]
["","h",{"$f":"Orçamento!P644","v":"INSTALAÇÕES ESPECIAIS"},{"$f":"Orçamento!S644","v":0},{"$f":"Orçamento!X644","v":0},{"$f":"Orçamento!AA644","v":0},3,8,0]
["","i.",{"$f":"Orçamento!P645","v":"ALVENARIAS E DIVISÓRIAS"},{"$f":"Orçamento!S645","v":0},{"$f":"Orçamento!X645","v":0},{"$f":"Orçamento!AA645","v":0},9,2,1]
["","j.",{"$f":"Orçamento!P646","v":"ALVENARIA AUTO-PORTANTE"},{"$f":"Orçamento!S646","v":0},{"$f":"Orçamento!X646","v":0},{"$f":"Orçamento!AA646","v":0}]
["","k.",{"$f":"Orçamento!P647","v":"IMPERMEABILIZAÇÃO"},{"$f":"Orçamento!S647","v":0},{"$f":"Orçamento!X647","v":0},{"$f":"Orçamento!AA647","v":0},4,7,8]
["","l.",{"$f":"Orçamento!P648","v":"ISOLAMENTO TÉRMICO E ACÚSTICO"},{"$f":"Orçamento!S648","v":0},{"$f":"Orçamento!X648","v":0},{"$f":"Orçamento!AA648","v":0}]
["","m.",{"$f":"Orçamento!P649","v":"ESTRUTURA DE MADEIRA"},{"$f":"Orçamento!S649","v":0},{"$f":"Orçamento!X649","v":0},{"$f":"Orçamento!AA649","v":0}]
["","n.",{"$f":"Orçamento!P650","v":"ESTRUTURAS METÁLICAS"},{"$f":"Orçamento!S650","v":0},{"$f":"Orçamento!X650","v":0},{"$f":"Orçamento!AA650","v":0},2,2,0]
["","o.",{"$f":"Orçamento!P651","v":"COBERTURAS"},{"$f":"Orçamento!S651","v":0},{"$f":"Orçamento!X651","v":0},{"$f":"Orçamento!AA651","v":0},5,6,3]
["","p.",{"$f":"Orçamento!P652","v":"ESQUADRIAS DE MADEIRA"},{"$f":"Orçamento!S652","v":0},{"$f":"Orçamento!X652","v":0},{"$f":"Orçamento!AA652","v":0}]
["","q.",{"$f":"Orçamento!P653","v":"ESQUADRIAS METÁLICAS"},{"$f":"Orçamento!S653","v":0},{"$f":"Orçamento!X653","v":0},{"$f":"Orçamento!AA653","v":0},3,4,0]
["","r.",{"$f":"Orçamento!P654","v":"VIDROS"},{"$f":"Orçamento!S654","v":0},{"$f":"Orçamento!X654","v":0},{"$f":"Orçamento!AA654","v":0},2,5,5]
["","s.",{"$f":"Orçamento!P655","v":"REVESTIMENTO DE PAREDE"},{"$f":"Orçamento!S655","v":0},{"$f":"Orçamento!X655","v":0},{"$f":"Orçamento!AA655","v":0},1,2,1]
["","t.",{"$f":"Orçamento!P656","v":"FORROS"},{"$f":"Orçamento!S656","v":0},{"$f":"Orçamento!X656","v":0},{"$f":"Orçamento!AA656","v":0},2,3,6]
["","u.",{"$f":"Orçamento!P657","v":"REVESTIMENTO DE PISO"},{"$f":"Orçamento!S657","v":0},{"$f":"Orçamento!X657","v":0},{"$f":"Orçamento!AA657","v":0},5,8,0]
["","v.",{"$f":"Orçamento!P658","v":"FERRAGENS"},{"$f":"Orçamento!S658","v":0},{"$f":"Orçamento!X658","v":0},{"$f":"Orçamento!AA658","v":0},2,3,5]
["","w.",{"$f":"Orçamento!P659","v":"MARCENARIA"},{"$f":"Orçamento!S659","v":0},{"$f":"Orçamento!X659","v":0},{"$f":"Orçamento!AA659","v":0},3,6,2]
["","x.",{"$f":"Orçamento!P660","v":"ADMINISTRAÇÃO"},{"$f":"Orçamento!S660","v":0},{"$f":"Orçamento!X660","v":0},{"$f":"Orçamento!AA660","v":0},0,5,9]
["","y.",{"$f":"Orçamento!P661","v":"PINTURA"},{"$f":"Orçamento!S661","v":0},{"$f":"Orçamento!X661","v":0},{"$f":"Orçamento!AA661","v":0},2,1,1]
["","z.",{"$f":"Orçamento!P662","v":"DIVERSOS"},{"$f":"Orçamento!S662","v":0},{"$f":"Orçamento!X662","v":0},{"$f":"Orçamento!AA662","v":0},9,9,7]
["F","TOTAL GERAL DO ORÇAMENTO",null,{"$f":"SUM(D17:D42)","v":0},0,0,78,91,90]
[]
[null,"(*) Para itens da AGETOP, os vidros não estão inclusos nas esquadrias e já foram considerados os custos de contramarco para as esquadrias de alumínio;"]

{"sheet":"Cronog_180_Dias","index":3,"n_rows":99,"n_cols":31,"rows_kept":99,"cut":false,"hidden":false,"merged":[[97,1,97,4],[98,1,98,29],[94,25,94,28],[95,1,95,2],[95,5,95,8],[95,9,95,12],[95,13,95,16],[95,17,95,20],[95,21,95,24],[95,25,95,28],[94,1,94,2],[94,5,94,8],[94,9,94,12],[94,13,94,16],[94,17,94,20],[94,21,94,24],[91,5,91,8],[91,9,91,12],[91,13,91,16],[91,17,91,20],[91,21,91,24],[91,25,91,28],[92,25,92,28],[93,1,93,2],[93,5,93,8],[93,9,93,12],[93,13,93,16],[93,17,93,20],[93,21,93,24],[93,25,93,28],[92,1,92,2],[92,5,92,8],[92,9,92,12],[92,13,92,16],[92,17,92,20],[92,21,92,24],[89,1,91,2],[89,3,91,3],[89,4,91,4],[89,5,89,8],[86,1,88,2],[86,3,88,3],[86,4,88,4],[86,5,86,8],[86,9,86,12],[86,13,86,16],[89,17,89,20],[89,21,89,24],[89,25,89,28],[89,9,89,12],[89,13,89,16],[86,17,86,20],[86,21,86,24],[86,25,86,28],[88,5,88,8],[88,9,88,12],[88,13,88,16],[88,17,88,20],[88,21,88,24],[88,25,88,28],[80,5,80,8],[80,9,80,12],[80,13,80,16],[83,17,83,20],[83,21,83,24],[83,25,83,28],[85,5,85,8],[85,9,85,12],[85,13,85,16],[85,17,85,20],[85,21,85,24],[85,25,85,28],[79,5,79,8],[79,9,79,12],[79,13,79,16],[79,17,79,20],[79,21,79,24],[79,25,79,28],[83,1,85,2],[83,3,85,3],[83,4,85,4],[83,5,83,8],[83,9,83,12],[83,13,83,16],[80,17,80,20],[80,21,80,24],[80,25,80,28],[82,5,82,8],[82,9,82,12],[82,13,82,16],[82,17,82,20],[82,21,82,24],[82,25,82,28],[80,1,82,2],[80,3,82,3],[80,4,82,4],[77,1,79,2],[77,3,79,3],[77,4,79,4],[77,5,77,8],[77,9,77,12],[77,13,77,16],[74,17,74,20],[74,21,74,24],[74,25,74,28],[76,5,76,8],[76,9,76,12],[76,13,76,16],[76,17,76,20],[76,21,76,24],[76,25,76,28],[74,1,76,2],[74,3,76,3],[74,4,76,4],[74,5,74,8],[74,9,74,12],[74,13,74,16],[77,17,77,20],[77,21,77,24],[77,25,77,28],[68,5,68,8],[68,9,68,12],[68,13,68,16],[71,17,71,20],[71,21,71,24],[71,25,71,28],[73,5,73,8],[73,9,73,12],[73,13,73,16],[73,17,73,20],[73,21,73,24],[73,25,73,28],[67,5,67,8],[67,9,67,12],[67,13,67,16],[67,17,67,20],[67,21,67,24],[67,25,67,28],[71,1,73,2],[71,3,73,3],[71,4,73,4],[71,5,71,8],[71,9,71,12],[71,13,71,16],[68,17,68,20],[68,21,68,24],[68,25,68,28],[70,5,70,8],[70,9,70,12],[70,13,70,16],[70,17,70,20],[70,21,70,24],[70,25,70,28],[68,1,70,2],[68,3,70,3],[68,4,70,4],[65,1,67,2],[65,3,67,3],[65,4,67,4],[65,5,65,8],[65,9,65,12],[65,13,65,16],[62,17,62,20],[62,21,62,24],[62,25,62,28],[64,5,64,8],[64,9,64,12],[64,13,64,16],[64,17,64,20],[64,21,64,24],[64,25,64,28],[62,1,64,2],[62,3,64,3],[62,4,64,4],[62,5,62,8],[62,9,62,12],[62,13,62,16],[65,17,65,20],[65,21,65,24],[65,25,65,28],[56,5,56,8],[56,9,56,12],[56,13,56,16],[59,17,59,20],[59,21,59,24],[59,25,59,28],[61,5,61,8],[61,9,61,12],[61,13,61,16],[61,17,61,20],[61,21,61,24],[61,25,61,28],[55,5,55,8],[55,9,55,12],[55,13,55,16],[55,17,55,20],[55,21,55,24],[55,25,55,28],[59,1,61,2],[59,3,61,3],[59,4,61,4],[59,5,59,8],[59,9,59,12],[59,13,59,16],[56,17,56,20],[56,21,56,24],[56,25,56,28],[58,5,58,8],[58,9,58,12],[58,13,58,16],[58,17,58,20],[58,21,58,24],[58,25,58,28],[56,1,58,2],[56,3,58,3],[56,4,58,4],[53,1,55,2],[53,3,55,3],[53,4,55,4],[53,5,53,8],[53,9,53,12],[53,13,53,16],[50,17,50,20],[50,21,50,24],[50,25,50,28],[52,5,52,8],[52,9,52,12],[52,13,52,16],[52,17,52,20],[52,21,52,24],[52,25,52,28],[50,1,52,2],[50,3,52,3],[50,4,52,4],[50,5,50,8],[50,9,50,12],[50,13,50,16],[53,17,53,20],[53,21,53,24],[53,25,53,28],[44,5,44,8],[44,9,44,12],[44,13,44,16],[47,17,47,20],[47,21,47,24],[47,25,47,28],[49,5,49,8],[49,9,49,12],[49,13,49,16],[49,17,49,20],[49,21,49,24],[49,25,49,28],[43,5,43,8],[43,9,43,12],[43,13,43,16],[43,17,43,20],[43,21,43,24],[43,25,43,28],[47,1,49,2],[47,3,49,3],[47,4,49,4],[47,5,47,8],[47,9,47,12],[47,13,47,16],[44,17,44,20],[44,21,44,24],[44,25,44,28],[46,5,46,8],[46,9,46,12],[46,13,46,16],[46,17,46,20],[46,21,46,24],[46,25,46,28],[44,1,46,2],[44,3,46,3],[44,4,46,4],[41,1,43,2],[41,3,43,3],[41,4,43,4],[41,5,41,8],[41,9,41,12],[41,13,41,16],[38,17,38,20],[38,21,38,24],[38,25,38,28],[40,5,40,8],[40,9,40,12],[40,13,40,16],[40,17,40,20],[40,21,40,24],[40,25,40,28],[38,1,40,2],[38,3,40,3],[38,4,40,4],[38,5,38,8],[38,9,38,12],[38,13,38,16],[41,17,41,20],[41,21,41,24],[41,25,41,28],[32,5,32,8],[32,9,32,12],[32,13,32,16],[35,17,35,20],[35,21,35,24],[35,25,35,28],[37,5,37,8],[37,9,37,12],[37,13,37,16],[37,17,37,20],[37,21,37,24],[37,25,37,28],[31,5,31,8],[31,9,31,12],[31,13,31,16],[31,17,31,20],[31,21,31,24],[31,25,31,28],[35,1,37,2],[35,3,37,3],[35,4,37,4],[35,5,35,8],[35,9,35,12],[35,13,35,16],[32,17,32,20],[32,21,32,24],[32,25,32,28],[34,5,34,8],[34,9,34,12],[34,13,34,16],[34,17,34,20],[34,21,34,24],[34,25,34,28],[32,1,34,2],[32,3,34,3],[32,4,34,4],[29,1,31,2],[29,3,31,3],[29,4,31,4],[29,5,29,8],[29,9,29,12],[29,13,29,16],[26,17,26,20],[26,21,26,24],[26,25,26,28],[28,5,28,8],[28,9,28,12],[28,13,28,16],[28,17,28,20],[28,21,28,24],[28,25,28,28],[26,1,28,2],[26,3,28,3],[26,4,28,4],[26,5,26,8],[26,9,26,12],[26,13,26,16],[29,17,29,20],[29,21,29,24],[29,25,29,28],[20,5,20,8],[20,9,20,12],[20,13,20,16],[23,17,23,20],[23,21,23,24],[23,25,23,28],[25,5,25,8],[25,9,25,12],[25,13,25,16],[25,17,25,20],[25,21,25,24],[25,25,25,28],[19,5,19,8],[19,9,19,12],[19,13,19,16],[19,17,19,20],[19,21,19,24],[19,25,19,28],[23,1,25,2],[23,3,25,3],[23,4,25,4],[23,5,23,8],[23,9,23,12],[23,13,23,16],[20,17,20,20],[20,21,20,24],[20,25,20,28],[22,5,22,8],[22,9,22,12],[22,13,22,16],[22,17,22,20],[22,21,22,24],[22,25,22,28],[20,1,22,2],[20,3,22,3],[20,4,22,4],[17,1,19,2],[17,3,19,3],[17,4,19,4],[17,5,17,8],[17,9,17,12],[17,13,17,16],[14,17,14,20],[14,21,14,24],[14,25,14,28],[16,5,16,8],[16,9,16,12],[16,13,16,16],[16,17,16,20],[16,21,16,24],[16,25,16,28],[14,1,16,2],[14,3,16,3],[14,4,16,4],[14,5,14,8],[14,9,14,12],[14,13,14,16],[17,17,17,20],[17,21,17,24],[17,25,17,28],[12,0,13,0],[12,3,13,3],[12,5,12,8],[12,9,12,12],[12,13,12,16],[12,17,12,20],[8,1,8,7],[8,8,8,29],[9,0,11,0],[9,1,9,7],[9,8,9,29],[10,1,10,29],[11,1,11,29],[12,21,12,24],[12,25,12,28],[12,29,13,29],[13,1,13,2],[13,5,13,8],[13,9,13,12],[13,13,13,16],[13,17,13,20],[13,21,13,24],[13,25,13,28],[4,1,4,29],[5,1,5,7],[5,8,5,29],[6,1,6,7],[6,8,6,29],[7,1,7,29],[0,1,0,29],[1,1,1,29],[2,1,2,7],[2,8,2,29],[3,1,3,7],[3,8,3,29]]}
[]
[]
[null,"UNIDADE ESCOLAR",null,null,null,null,null,null,"PRAZO"]
[null,{"$f":"Orçamento!O4","v":"COLÉGIO ESTADUAL JUSCELINO KUBITSCHEK DE OLIVEIRA"},null,null,null,null,null,null,"180 DIAS CORRIDOS"]
[]
[null,"OBRA",null,null,null,null,null,null,"DATA"]
[null,{"$f":"Orçamento!O7","v":"REFORMA E IMPLANTAÇÃO"},null,null,null,null,null,null,{"$f":"Orçamento!S7","v":"2020-07-07"}]
[]
[null,"LOCAL",null,null,null,null,null,null,"ÁREA TOTAL CONSTRUÍDA (M²)"]
["FILTRO",{"$f":"Orçamento!X7","v":"ÁGUAS LINDAS DE GOIÁS"},null,null,null,null,null,null,{"$f":"Orçamento!S13","v":3074.09}]
[]
[null,"CRONOGRAMA - FÍSICO FINANCEIRO"]
["↓","CUSTO TOTAL:",{"$f":"D93","v":0},"VALOR","Dias:",30,null,null,null,60,null,null,null,90,null,null,null,120,null,null,null,150,null,null,null,180,null,null,null,"TOTAL"]
[null,"DESCRIÇÃO DOS SERVIÇOS",null,null,"%","1ª PARCELA",null,null,null,"2ª PARCELA",null,null,null,"3ª PARCELA",null,null,null,"4ª PARCELA",null,null,null,"5ª PARCELA",null,null,null,"6ª PARCELA"]
[{"$f":"IF(D15>0,\"F\",\"\")","v":""},"SERVIÇOS PRELIMINARES",null,{"$f":"Orçamento!X637","v":0},{"$f":"Orçamento!AA637","v":0},{"$f":"ROUND(F17*$D$15,2)","v":0},null,null,null,{"$f":"ROUND(J17*$D$15,2)","v":0},null,null,null,{"$f":"ROUND(N17*$D$15,2)","v":0},null,null,null,{"$f":"ROUND(R17*$D$15,2)","v":0},null,null,null,{"$f":"ROUND(V17*$D$15,2)","v":0},null,null,null,{"$f":"ROUND(Z17*$D$15,2)","v":0},null,null,null,{"$f":"SUM(F15:AC15)","v":0},{"$f":"IF(D15=AD15,\"OK\",\"ERRO\")","v":"OK"}]
[{"$f":"IF(A15=\"F\",A15,\"\")","v":""}]
[{"$f":"IF(A16=\"F\",A16,\"\")","v":""},null,null,null,null,1,null,null,null,null,null,null,null,null,null,null,null,null,null,null,null,null,null,null,null,{"$f":"100%-(SUM(F17:Y17))","v":0},null,null,null,{"$f":"IFERROR(E15/100,\"\")","v":0},{"$f":"IF(E15=AD17*100,\"OK\",\"ERRO\")","v":"OK"}]
[{"$f":"IF(D18>0,\"F\",\"\")","v":""},"TRANSPORTES",null,{"$f":"Orçamento!X638","v":0},{"$f":"Orçamento!AA638","v":0},{"$f":"ROUND(F20*$D$18,2)","v":0},null,null,null,{"$f":"ROUND(J20*$D$18,2)","v":0},null,null,null,{"$f":"ROUND(N20*$D$18,2)","v":0},null,null,null,{"$f":"ROUND(R20*$D$18,2)","v":0},null,null,null,{"$f":"ROUND(V20*$D$18,2)","v":0},null,null,null,{"$f":"ROUND(Z20*$D$18,2)","v":0},null,null,null,{"$f":"SUM(F18:AC18)","v":0},{"$f":"IF(D18=AD18,\"OK\",\"ERRO\")","v":"OK"}]
[{"$f":"IF(A18=\"F\",A18,\"\")","v":""}]
[{"$f":"IF(A19=\"F\",A19,\"\")","v":""},null,null,null,null,0.17100000000000001,null,null,null,0.16,null,null,null,0.17100000000000001,null,null,null,0.17199999999999999,null,null,null,0.16,null,null,null,{"$f":"100%-(SUM(F20:Y20))","v":0.16600000000000004},null,null,null,{"$f":"IFERROR(E18/100,\"\")","v":0},{"$f":"IF(E18=AD20*100,\"OK\",\"ERRO\")","v":"OK"}]
[{"$f":"IF(D21>0,\"F\",\"\")","v":""},"SERVIÇO EM TERRA",null,{"$f":"Orçamento!X639","v":0},{"$f":"Orçamento!AA639","v":0},{"$f":"ROUND(F23*$D$21,2)","v":0},null,null,null,{"$f":"ROUND(J23*$D$21,2)","v":0},null,null,null,{"$f":"ROUND(N23*$D$21,2)","v":0},null,null,null,{"$f":"ROUND(R23*$D$21,2)","v":0},null,null,null,{"$f":"ROUND(V23*$D$21,2)","v":0},null,null,null,{"$f":"ROUND(Z23*$D$21,2)","v":0},null,null,null,{"$f":"SUM(F21:AC21)","v":0},{"$f":"IF(D21=AD21,\"OK\",\"ERRO\")","v":"OK"}]
[{"$f":"IF(A21=\"F\",A21,\"\")","v":""}]
[{"$f":"IF(A22=\"F\",A22,\"\")","v":""},null,null,null,null,0.38,null,null,null,0.62,null,null,null,null,null,null,null,0,null,null,null,0,null,null,null,{"$f":"100%-(SUM(F23:Y23))","v":0},null,null,null,{"$f":"IFERROR(E21/100,\"\")","v":0},{"$f":"IF(E21=AD23*100,\"OK\",\"ERRO\")","v":"OK"}]
[{"$f":"IF(D24>0,\"F\",\"\")","v":""},"FUNDAÇÕES E SONDAGENS",null,{"$f":"Orçamento!X640","v":0},{"$f":"Orçamento!AA640","v":0},{"$f":"ROUND(F26*$D$24,2)","v":0},null,null,null,{"$f":"ROUND(J26*$D$24,2)","v":0},null,null,null,{"$f":"ROUND(N26*$D$24,2)","v":0},null,null,null,{"$f":"ROUND(R26*$D$24,2)","v":0},null,null,null,{"$f":"ROUND(V26*$D$24,2)","v":0},null,null,null,{"$f":"ROUND(Z26*$D$24,2)","v":0},null,null,null,{"$f":"SUM(F24:AC24)","v":0},{"$f":"IF(D24=AD24,\"OK\",\"ERRO\")","v":"OK"}]
[{"$f":"IF(A24=\"F\",A24,\"\")","v":""}]
[{"$f":"IF(A25=\"F\",A25,\"\")","v":""},null,null,null,null,0.2499999,null,null,null,0.75,null,null,null,null,null,null,null,null,null,null,null,null,null,null,null,null,null,null,null,{"$f":"IFERROR(E24/100,\"\")","v":0},{"$f":"IF(E24=AD26*100,\"OK\",\"ERRO\")","v":"OK"}]
[{"$f":"IF(D27>0,\"F\",\"\")","v":""},"ESTRUTURA",null,{"$f":"Orçamento!X641","v":0},{"$f":"Orçamento!AA641","v":0},{"$f":"ROUND(F29*$D$27,2)","v":0},null,null,null,{"$f":"ROUND(J29*$D$27,2)","v":0},null,null,null,{"$f":"ROUND(N29*$D$27,2)","v":0},null,null,null,{"$f":"ROUND(R29*$D$27,2)","v":0},null,null,null,{"$f":"ROUND(V29*$D$27,2)","v":0},null,null,null,{"$f":"ROUND(Z29*$D$27,2)","v":0},null,null,null,{"$f":"SUM(F27:AC27)","v":0},{"$f":"IF(D27=AD27,\"OK\",\"ERRO\")","v":"OK"}]
[{"$f":"IF(A27=\"F\",A27,\"\")","v":""}]
[{"$f":"IF(A28=\"F\",A28,\"\")","v":""},null,null,null,null,null,null,null,null,0.55000000000000004,null,null,null,0.45,null,null,null,null,null,null,null,null,null,null,null,{"$f":"100%-(SUM(F29:Y29))","v":0},null,null,null,{"$f":"IFERROR(E27/100,\"\")","v":0},{"$f":"IF(E27=AD29*100,\"OK\",\"ERRO\")","v":"OK"}]
[{"$f":"IF(D30>0,\"F\",\"\")","v":""},"INST.ELET/TELEFÔNICA/CABEAMENTO ESTRUTURADO",null,{"$f":"Orçamento!X642","v":0},{"$f":"Orçamento!AA642","v":0},{"$f":"ROUND(F32*$D$30,2)","v":0},null,null,null,{"$f":"ROUND(J32*$D$30,2)","v":0},null,null,null,{"$f":"ROUND(N32*$D$30,2)","v":0},null,null,null,{"$f":"ROUND(R32*$D$30,2)","v":0},null,null,null,{"$f":"ROUND(V32*$D$30,2)","v":0},null,null,null,{"$f":"ROUND(Z32*$D$30,2)","v":0},null,null,null,{"$f":"SUM(F30:AC30)","v":0},{"$f":"IF(D30=AD30,\"OK\",\"ERRO\")","v":"OK"}]
[{"$f":"IF(A30=\"F\",A30,\"\")","v":""}]
[{"$f":"IF(A31=\"F\",A31,\"\")","v":""},null,null,null,null,null,null,null,null,0.17,null,null,null,0.11799999999999999,null,null,null,0.24,null,null,null,0.25,null,null,null,{"$f":"100%-(SUM(F32:Y32))","v":0.22199999999999998},null,null,null,{"$f":"IFERROR(E30/100,\"\")","v":0},{"$f":"IF(E30=AD32*100,\"OK\",\"ERRO\")","v":"OK"}]
[{"$f":"IF(D33>0,\"F\",\"\")","v":""},"INSTALAÇÕES HIDROSSANITÁRIAS",null,{"$f":"Orçamento!X643","v":0},{"$f":"Orçamento!AA643","v":0},{"$f":"ROUND(F35*$D$33,2)","v":0},null,null,null,{"$f":"ROUND(J35*$D$33,2)","v":0},null,null,null,{"$f":"ROUND(N35*$D$33,2)","v":0},null,null,null,{"$f":"ROUND(R35*$D$33,2)","v":0},null,null,null,{"$f":"ROUND(V35*$D$33,2)","v":0},null,null,null,{"$f":"ROUND(Z35*$D$33,2)","v":0},null,null,null,{"$f":"SUM(F33:AC33)","v":0},{"$f":"IF(D33=AD33,\"OK\",\"ERRO\")","v":"OK"}]
[{"$f":"IF(A33=\"F\",A33,\"\")","v":""}]
[{"$f":"IF(A34=\"F\",A34,\"\")","v":""},null,null,null,null,null,null,null,null,0.125,null,null,null,0.14499999999999999,null,null,null,0.23400000000000001,null,null,null,0.25,null,null,null,{"$f":"100%-(SUM(F35:Y35))","v":0.246},null,null,null,{"$f":"IFERROR(E33/100,\"\")","v":0},{"$f":"IF(E33=AD35*100,\"OK\",\"ERRO\")","v":"OK"}]
[{"$f":"IF(D36>0,\"F\",\"\")","v":""},"INSTALAÇÕES ESPECIAIS",null,{"$f":"Orçamento!X644","v":0},{"$f":"Orçamento!AA644","v":0},{"$f":"ROUND(F38*$D$36,2)","v":0},null,null,null,{"$f":"ROUND(J38*$D$36,2)","v":0},null,null,null,{"$f":"ROUND(N38*$D$36,2)","v":0},null,null,null,{"$f":"ROUND(R38*$D$36,2)","v":0},null,null,null,{"$f":"ROUND(V38*$D$36,2)","v":0},null,null,null,{"$f":"ROUND(Z38*$D$36,2)","v":0},null,null,null,{"$f":"SUM(F36:AC36)","v":0},{"$f":"IF(D36=AD36,\"OK\",\"ERRO\")","v":"OK"}]
[{"$f":"IF(A36=\"F\",A36,\"\")","v":""}]
[{"$f":"IF(A37=\"F\",A37,\"\")","v":""},null,null,null,null,null,null,null,null,null,null,null,null,null,null,null,null,null,null,null,null,1,null,null,null,{"$f":"100%-(SUM(F38:Y38))","v":0},null,null,null,{"$f":"IFERROR(E36/100,\"\")","v":0},{"$f":"IF(E36=AD38*100,\"OK\",\"ERRO\")","v":"OK"}]
[{"$f":"IF(D39>0,\"F\",\"\")","v":""},"ALVENARIA E DIVISÓRIAS",null,{"$f":"Orçamento!X645","v":0},{"$f":"Orçamento!AA645","v":0},{"$f":"ROUND(F41*$D$39,2)","v":0},null,null,null,{"$f":"ROUND(J41*$D$39,2)","v":0},null,null,null,{"$f":"ROUND(N41*$D$39,2)","v":0},null,null,null,{"$f":"ROUND(R41*$D$39,2)","v":0},null,null,null,{"$f":"ROUND(V41*$D$39,2)","v":0},null,null,null,{"$f":"ROUND(Z41*$D$39,2)","v":0},null,null,null,{"$f":"SUM(F39:AC39)","v":0},{"$f":"IF(D39=AD39,\"OK\",\"ERRO\")","v":"OK"}]
[{"$f":"IF(A39=\"F\",A39,\"\")","v":""}]
[{"$f":"IF(A40=\"F\",A40,\"\")","v":""},null,null,null,null,null,null,null,null,null,null,null,null,0.5,null,null,null,0.3,null,null,null,0.2,null,null,null,{"$f":"100%-(SUM(F41:Y41))","v":0},null,null,null,{"$f":"IFERROR(E39/100,\"\")","v":0},{"$f":"IF(E39=AD41*100,\"OK\",\"ERRO\")","v":"OK"}]
[{"$f":"IF(D42>0,\"F\",\"\")","v":""},"ALVENARIA AUTO-PORTANTE",null,{"$f":"Orçamento!X646","v":0},{"$f":"Orçamento!AA646","v":0},{"$f":"ROUND(F44*$D$42,2)","v":0},null,null,null,{"$f":"ROUND(J44*$D$42,2)","v":0},null,null,null,{"$f":"ROUND(N44*$D$42,2)","v":0},null,null,null,{"$f":"ROUND(R44*$D$42,2)","v":0},null,null,null,{"$f":"ROUND(V44*$D$42,2)","v":0},null,null,null,{"$f":"ROUND(Z44*$D$42,2)","v":0},null,null,null,{"$f":"SUM(F42:AC42)","v":0},{"$f":"IF(D42=AD42,\"OK\",\"ERRO\")","v":"OK"}]
[{"$f":"IF(A42=\"F\",A42,\"\")","v":""}]
[{"$f":"IF(A43=\"F\",A43,\"\")","v":""},null,null,null,null,null,null,null,null,null,null,null,null,null,null,null,null,1,null,null,null,0,null,null,null,{"$f":"100%-(SUM(F44:Y44))","v":0},null,null,null,{"$f":"IFERROR(E42/100,\"\")","v":0},{"$f":"IF(E42=AD44*100,\"OK\",\"ERRO\")","v":"OK"}]
[{"$f":"IF(D45>0,\"F\",\"\")","v":""},"IMPERMEABILIZAÇÃO",null,{"$f":"Orçamento!X647","v":0},{"$f":"Orçamento!AA647","v":0},{"$f":"ROUND(F47*$D$45,2)","v":0},null,null,null,{"$f":"ROUND(J47*$D$45,2)","v":0},null,null,null,{"$f":"ROUND(N47*$D$45,2)","v":0},null,null,null,{"$f":"ROUND(R47*$D$45,2)","v":0},null,null,null,{"$f":"ROUND(V47*$D$45,2)","v":0},null,null,null,{"$f":"ROUND(Z47*$D$45,2)","v":0},null,null,null,{"$f":"SUM(F45:AC45)","v":0},{"$f":"IF(D45=AD45,\"OK\",\"ERRO\")","v":"OK"}]
[{"$f":"IF(A45=\"F\",A45,\"\")","v":""}]
[{"$f":"IF(A46=\"F\",A46,\"\")","v":""},null,null,null,null,null,null,null,null,0.65,null,null,null,null,null,null,null,0.35,null,null,null,0,null,null,null,{"$f":"100%-(SUM(F47:Y47))","v":0},null,null,null,{"$f":"IFERROR(E45/100,\"\")","v":0},{"$f":"IF(E45=AD47*100,\"OK\",\"ERRO\")","v":"OK"}]
[{"$f":"IF(D48>0,\"F\",\"\")","v":""},"ISOLAMENTO TÉRMICO E ACÚSTICO",null,{"$f":"Orçamento!X648","v":0},{"$f":"Orçamento!AA648","v":0},{"$f":"ROUND(F50*$D$48,2)","v":0},null,null,null,{"$f":"ROUND(J50*$D$48,2)","v":0},null,null,null,{"$f":"ROUND(N50*$D$48,2)","v":0},null,null,null,{"$f":"ROUND(R50*$D$48,2)","v":0},null,null,null,{"$f":"ROUND(V50*$D$48,2)","v":0},null,null,null,{"$f":"ROUND(Z50*$D$48,2)","v":0},null,null,null,{"$f":"SUM(F48:AC48)","v":0},{"$f":"IF(D48=AD48,\"OK\",\"ERRO\")","v":"OK"}]
[{"$f":"IF(A48=\"F\",A48,\"\")","v":""}]
[{"$f":"IF(A49=\"F\",A49,\"\")","v":""},null,null,null,null,null,null,null,null,null,null,null,null,null,null,null,null,1,null,null,null,null,null,null,null,{"$f":"100%-(SUM(F50:Y50))","v":0},null,null,null,{"$f":"IFERROR(E48/100,\"\")","v":0},{"$f":"IF(E48=AD50*100,\"OK\",\"ERRO\")","v":"OK"}]
[{"$f":"IF(D51>0,\"F\",\"\")","v":""},"ESTRUTURA DE MADEIRA",null,{"$f":"Orçamento!X649","v":0},{"$f":"Orçamento!AA649","v":0},{"$f":"ROUND(F53*$D$51,2)","v":0},null,null,null,{"$f":"ROUND(J53*$D$51,2)","v":0},null,null,null,{"$f":"ROUND(N53*$D$51,2)","v":0},null,null,null,{"$f":"ROUND(R53*$D$51,2)","v":0},null,null,null,{"$f":"ROUND(V53*$D$51,2)","v":0},null,null,null,{"$f":"ROUND(Z53*$D$51,2)","v":0},null,null,null,{"$f":"SUM(F51:AC51)","v":0},{"$f":"IF(D51=AD51,\"OK\",\"ERRO\")","v":"OK"}]
[{"$f":"IF(A51=\"F\",A51,\"\")","v":""}]
[{"$f":"IF(A52=\"F\",A52,\"\")","v":""},null,null,null,null,null,null,null,null,null,null,null,null,0.3,null,null,null,0.7,null,null,null,null,null,null,null,{"$f":"100%-(SUM(F53:Y53))","v":0},null,null,null,{"$f":"IFERROR(E51/100,\"\")","v":0},{"$f":"IF(E51=AD53*100,\"OK\",\"ERRO\")","v":"OK"}]
[{"$f":"IF(D54>0,\"F\",\"\")","v":""},"ESTRUTURA METÁLICA",null,{"$f":"Orçamento!X650","v":0},{"$f":"Orçamento!AA650","v":0},{"$f":"ROUND(F56*$D$54,2)","v":0},null,null,null,{"$f":"ROUND(J56*$D$54,2)","v":0},null,null,null,{"$f":"ROUND(N56*$D$54,2)","v":0},null,null,null,{"$f":"ROUND(R56*$D$54,2)","v":0},null,null,null,{"$f":"ROUND(V56*$D$54,2)","v":0},null,null,null,{"$f":"ROUND(Z56*$D$54,2)","v":0},null,null,null,{"$f":"SUM(F54:AC54)","v":0},{"$f":"IF(D54=AD54,\"OK\",\"ERRO\")","v":"OK"}]
[{"$f":"IF(A54=\"F\",A54,\"\")","v":""}]
[{"$f":"IF(A55=\"F\",A55,\"\")","v":""},null,null,null,null,null,null,null,null,null,null,null,null,0.3,null,null,null,0.7,null,null,null,null,null,null,null,{"$f":"100%-(SUM(F56:Y56))","v":0},null,null,null,{"$f":"IFERROR(E54/100,\"\")","v":0},{"$f":"IF(E54=AD56*100,\"OK\",\"ERRO\")","v":"OK"}]
[{"$f":"IF(D57>0,\"F\",\"\")","v":""},"COBERTURAS",null,{"$f":"Orçamento!X651","v":0},{"$f":"Orçamento!AA651","v":0},{"$f":"ROUND(F59*$D$57,2)","v":0},null,null,null,{"$f":"ROUND(J59*$D$57,2)","v":0},null,null,null,{"$f":"ROUND(N59*$D$57,2)","v":0},null,null,null,{"$f":"ROUND(R59*$D$57,2)","v":0},null,null,null,{"$f":"ROUND(V59*$D$57,2)","v":0},null,null,null,{"$f":"ROUND(Z59*$D$57,2)","v":0},null,null,null,{"$f":"SUM(F57:AC57)","v":0},{"$f":"IF(D57=AD57,\"OK\",\"ERRO\")","v":"OK"}]
[{"$f":"IF(A57=\"F\",A57,\"\")","v":""}]
[{"$f":"IF(A58=\"F\",A58,\"\")","v":""},null,null,null,null,null,null,null,null,null,null,null,null,null,null,null,null,0.36,null,null,null,0.64,null,null,null,{"$f":"100%-(SUM(F59:Y59))","v":0},null,null,null,{"$f":"IFERROR(E57/100,\"\")","v":0},{"$f":"IF(E57=AD59*100,\"OK\",\"ERRO\")","v":"OK"}]
[{"$f":"IF(D60>0,\"F\",\"\")","v":""},"ESQUADRIAS DE MADEIRA",null,{"$f":"Orçamento!X652","v":0},{"$f":"Orçamento!AA652","v":0},{"$f":"ROUND(F62*$D$60,2)","v":0},null,null,null,{"$f":"ROUND(J62*$D$60,2)","v":0},null,null,null,{"$f":"ROUND(N62*$D$60,2)","v":0},null,null,null,{"$f":"ROUND(R62*$D$60,2)","v":0},null,null,null,{"$f":"ROUND(V62*$D$60,2)","v":0},null,null,null,{"$f":"ROUND(Z62*$D$60,2)","v":0},null,null,null,{"$f":"SUM(F60:AC60)","v":0},{"$f":"IF(D60=AD60,\"OK\",\"ERRO\")","v":"OK"}]
[{"$f":"IF(A60=\"F\",A60,\"\")","v":""}]
[{"$f":"IF(A61=\"F\",A61,\"\")","v":""},null,null,null,null,null,null,null,null,null,null,null,null,null,null,null,null,null,null,null,null,0.4,null,null,null,{"$f":"100%-(SUM(F62:Y62))","v":0.6},null,null,null,{"$f":"IFERROR(E60/100,\"\")","v":0},{"$f":"IF(E60=AD62*100,\"OK\",\"ERRO\")","v":"OK"}]
[{"$f":"IF(D63>0,\"F\",\"\")","v":""},"ESQUADRIAS METÁLICAS",null,{"$f":"Orçamento!X653","v":0},{"$f":"Orçamento!AA653","v":0},{"$f":"ROUND(F65*$D$63,2)","v":0},null,null,null,{"$f":"ROUND(J65*$D$63,2)","v":0},null,null,null,{"$f":"ROUND(N65*$D$63,2)","v":0},null,null,null,{"$f":"ROUND(R65*$D$63,2)","v":0},null,null,null,{"$f":"ROUND(V65*$D$63,2)","v":0},null,null,null,{"$f":"ROUND(Z65*$D$63,2)","v":0},null,null,null,{"$f":"SUM(F63:AC63)","v":0},{"$f":"IF(D63=AD63,\"OK\",\"ERRO\")","v":"OK"}]
[{"$f":"IF(A63=\"F\",A63,\"\")","v":""}]
[{"$f":"IF(A64=\"F\",A64,\"\")","v":""},null,null,null,null,null,null,null,null,null,null,null,null,null,null,null,null,null,null,null,null,0.4,null,null,null,{"$f":"100%-(SUM(F65:Y65))","v":0.6},null,null,null,{"$f":"IFERROR(E63/100,\"\")","v":0},{"$f":"IF(E63=AD65*100,\"OK\",\"ERRO\")","v":"OK"}]
[{"$f":"IF(D66>0,\"F\",\"\")","v":""},"VIDROS",null,{"$f":"Orçamento!X654","v":0},{"$f":"Orçamento!AA654","v":0},{"$f":"ROUND(F68*$D$66,2)","v":0},null,null,null,{"$f":"ROUND(J68*$D$66,2)","v":0},null,null,null,{"$f":"ROUND(N68*$D$66,2)","v":0},null,null,null,{"$f":"ROUND(R68*$D$66,2)","v":0},null,null,null,{"$f":"ROUND(V68*$D$66,2)","v":0},null,null,null,{"$f":"ROUND(Z68*$D$66,2)","v":0},null,null,null,{"$f":"SUM(F66:AC66)","v":0},{"$f":"IF(D66=AD66,\"OK\",\"ERRO\")","v":"OK"}]
[{"$f":"IF(A66=\"F\",A66,\"\")","v":""}]
[{"$f":"IF(A67=\"F\",A67,\"\")","v":""},null,null,null,null,null,null,null,null,null,null,null,null,null,null,null,null,null,null,null,null,null,null,null,null,{"$f":"100%-(SUM(F68:Y68))","v":1},null,null,null,{"$f":"IFERROR(E66/100,\"\")","v":0},{"$f":"IF(E66=AD68*100,\"OK\",\"ERRO\")","v":"OK"}]
[{"$f":"IF(D69>0,\"F\",\"\")","v":""},"REVESTIMENTO DE PAREDE",null,{"$f":"Orçamento!X655","v":0},{"$f":"Orçamento!AA655","v":0},{"$f":"ROUND(F71*$D$69,2)","v":0},null,null,null,{"$f":"ROUND(J71*$D$69,2)","v":0},null,null,null,{"$f":"ROUND(N71*$D$69,2)","v":0},null,null,null,{"$f":"ROUND(R71*$D$69,2)","v":0},null,null,null,{"$f":"ROUND(V71*$D$69,2)","v":0},null,null,null,{"$f":"ROUND(Z71*$D$69,2)","v":0},null,null,null,{"$f":"SUM(F69:AC69)","v":0},{"$f":"IF(D69=AD69,\"OK\",\"ERRO\")","v":"OK"}]
[{"$f":"IF(A69=\"F\",A69,\"\")","v":""}]
[{"$f":"IF(A70=\"F\",A70,\"\")","v":""},null,null,null,null,null,null,null,null,null,null,null,null,null,null,null,null,1,null,null,null,null,null,null,null,{"$f":"100%-(SUM(F71:Y71))","v":0},null,null,null,{"$f":"IFERROR(E69/100,\"\")","v":0},{"$f":"IF(E69=AD71*100,\"OK\",\"ERRO\")","v":"OK"}]
[{"$f":"IF(D72>0,\"F\",\"\")","v":""},"FORROS",null,{"$f":"Orçamento!X656","v":0},{"$f":"Orçamento!AA656","v":0},{"$f":"ROUND(F74*$D$72,2)","v":0},null,null,null,{"$f":"ROUND(J74*$D$72,2)","v":0},null,null,null,{"$f":"ROUND(N74*$D$72,2)","v":0},null,null,null,{"$f":"ROUND(R74*$D$72,2)","v":0},null,null,null,{"$f":"ROUND(V74*$D$72,2)","v":0},null,null,null,{"$f":"ROUND(Z74*$D$72,2)","v":0},null,null,null,{"$f":"SUM(F72:AC72)","v":0},{"$f":"IF(D72=AD72,\"OK\",\"ERRO\")","v":"OK"}]
[{"$f":"IF(A72=\"F\",A72,\"\")","v":""}]
[{"$f":"IF(A73=\"F\",A73,\"\")","v":""},null,null,null,null,null,null,null,null,null,null,null,null,null,null,null,null,1,null,null,null,null,null,null,null,{"$f":"100%-(SUM(F74:Y74))","v":0},null,null,null,{"$f":"IFERROR(E72/100,\"\")","v":0},{"$f":"IF(E72=AD74*100,\"OK\",\"ERRO\")","v":"OK"}]
[{"$f":"IF(D75>0,\"F\",\"\")","v":""},"REVESTIMENTO DE PISO",null,{"$f":"Orçamento!X657","v":0},{"$f":"Orçamento!AA657","v":0},{"$f":"ROUND(F77*$D$75,2)","v":0},null,null,null,{"$f":"ROUND(J77*$D$75,2)","v":0},null,null,null,{"$f":"ROUND(N77*$D$75,2)","v":0},null,null,null,{"$f":"ROUND(R77*$D$75,2)","v":0},null,null,null,{"$f":"ROUND(V77*$D$75,2)","v":0},null,null,null,{"$f":"ROUND(Z77*$D$75,2)","v":0},null,null,null,{"$f":"SUM(F75:AC75)","v":0},{"$f":"IF(D75=AD75,\"OK\",\"ERRO\")","v":"OK"}]
[{"$f":"IF(A75=\"F\",A75,\"\")","v":""}]
[{"$f":"IF(A76=\"F\",A76,\"\")","v":""},null,null,null,null,null,null,null,null,null,null,null,null,0.15,null,null,null,null,null,null,null,0.35,null,null,null,{"$f":"100%-(SUM(F77:Y77))","v":0.5},null,null,null,{"$f":"IFERROR(E75/100,\"\")","v":0},{"$f":"IF(E75=AD77*100,\"OK\",\"ERRO\")","v":"OK"}]
[{"$f":"IF(D78>0,\"F\",\"\")","v":""},"FERRAGENS",null,{"$f":"Orçamento!X658","v":0},{"$f":"Orçamento!AA658","v":0},{"$f":"ROUND(F80*$D$78,2)","v":0},null,null,null,{"$f":"ROUND(J80*$D$78,2)","v":0},null,null,null,{"$f":"ROUND(N80*$D$78,2)","v":0},null,null,null,{"$f":"ROUND(R80*$D$78,2)","v":0},null,null,null,{"$f":"ROUND(V80*$D$78,2)","v":0},null,null,null,{"$f":"ROUND(Z80*$D$78,2)","v":0},null,null,null,{"$f":"SUM(F78:AC78)","v":0},{"$f":"IF(D78=AD78,\"OK\",\"ERRO\")","v":"OK"}]
[{"$f":"IF(A78=\"F\",A78,\"\")","v":""}]
[{"$f":"IF(A79=\"F\",A79,\"\")","v":""},null,null,null,null,null,null,null,null,null,null,null,null,null,null,null,null,null,null,null,null,null,null,null,null,{"$f":"100%-(SUM(F80:Y80))","v":1},null,null,null,{"$f":"IFERROR(E78/100,\"\")","v":0},{"$f":"IF(E78=AD80*100,\"OK\",\"ERRO\")","v":"OK"}]
[{"$f":"IF(D81>0,\"F\",\"\")","v":""},"MARCENARIA",null,{"$f":"Orçamento!X659","v":0},{"$f":"Orçamento!AA659","v":0},{"$f":"ROUND(F83*$D$81,2)","v":0},null,null,null,{"$f":"ROUND(J83*$D$81,2)","v":0},null,null,null,{"$f":"ROUND(N83*$D$81,2)","v":0},null,null,null,{"$f":"ROUND(R83*$D$81,2)","v":0},null,null,null,{"$f":"ROUND(V83*$D$81,2)","v":0},null,null,null,{"$f":"ROUND(Z83*$D$81,2)","v":0},null,null,null,{"$f":"SUM(F81:AC81)","v":0},{"$f":"IF(D81=AD81,\"OK\",\"ERRO\")","v":"OK"}]
[{"$f":"IF(A81=\"F\",A81,\"\")","v":""}]
[{"$f":"IF(A82=\"F\",A82,\"\")","v":""},null,null,null,null,null,null,null,null,null,null,null,null,null,null,null,null,null,null,null,null,null,null,null,null,{"$f":"100%-(SUM(F83:Y83))","v":1},null,null,null,{"$f":"IFERROR(E81/100,\"\")","v":0},{"$f":"IF(E81=AD83*100,\"OK\",\"ERRO\")","v":"OK"}]
[{"$f":"IF(D84>0,\"F\",\"\")","v":""},"ADMINISTRAÇÃO - MENSALISTAS",null,{"$f":"Orçamento!X660","v":0},{"$f":"Orçamento!AA660","v":0},{"$f":"ROUND(F86*$D$84,2)","v":0},null,null,null,{"$f":"ROUND(J86*$D$84,2)","v":0},null,null,null,{"$f":"ROUND(N86*$D$84,2)","v":0},null,null,null,{"$f":"ROUND(R86*$D$84,2)","v":0},null,null,null,{"$f":"ROUND(V86*$D$84,2)","v":0},null,null,null,{"$f":"ROUND(Z86*$D$84,2)","v":0},null,null,null,{"$f":"SUM(F84:AC84)","v":0},{"$f":"IF(D84=AD84,\"OK\",\"ERRO\")","v":"OK"}]
[{"$f":"IF(A84=\"F\",A84,\"\")","v":""}]
[{"$f":"IF(A85=\"F\",A85,\"\")","v":""},null,null,null,null,0.17,null,null,null,0.17,null,null,null,0.17,null,null,null,0.17,null,null,null,0.17,null,null,null,{"$f":"100%-(SUM(F86:Y86))","v":0.14999999999999991},null,null,null,{"$f":"IFERROR(E84/100,\"\")","v":0},{"$f":"IF(E84=AD86*100,\"OK\",\"ERRO\")","v":"OK"}]
[{"$f":"IF(D87>0,\"F\",\"\")","v":""},"PINTURA",null,{"$f":"Orçamento!X661","v":0},{"$f":"Orçamento!AA661","v":0},{"$f":"ROUND(F89*$D$87,2)","v":0},null,null,null,{"$f":"ROUND(J89*$D$87,2)","v":0},null,null,null,{"$f":"ROUND(N89*$D$87,2)","v":0},null,null,null,{"$f":"ROUND(R89*$D$87,2)","v":0},null,null,null,{"$f":"ROUND(V89*$D$87,2)","v":0},null,null,null,{"$f":"ROUND(Z89*$D$87,2)","v":0},null,null,null,{"$f":"SUM(F87:AC87)","v":0},{"$f":"IF(D87=AD87,\"OK\",\"ERRO\")","v":"OK"}]
[{"$f":"IF(A87=\"F\",A87,\"\")","v":""}]
[{"$f":"IF(A88=\"F\",A88,\"\")","v":""},null,null,null,null,null,null,null,null,null,null,null,null,null,null,null,null,null,null,null,null,0.31,null,null,null,{"$f":"100%-(SUM(F89:Y89))","v":0.69},null,null,null,{"$f":"IFERROR(E87/100,\"\")","v":0},{"$f":"IF(E87=AD89*100,\"OK\",\"ERRO\")","v":"OK"}]
[{"$f":"IF(D90>0,\"F\",\"\")","v":""},"DIVERSOS",null,{"$f":"Orçamento!X662","v":0},{"$f":"Orçamento!AA662","v":0},{"$f":"ROUND(F92*$D$90,2)","v":0},null,null,null,{"$f":"ROUND(J92*$D$90,2)","v":0},null,null,null,{"$f":"ROUND(N92*$D$90,2)","v":0},null,null,null,{"$f":"ROUND(R92*$D$90,2)","v":0},null,null,null,{"$f":"ROUND(V92*$D$90,2)","v":0},null,null,null,{"$f":"ROUND(Z92*$D$90,2)","v":0},null,null,null,{"$f":"SUM(F90:AC90)","v":0},{"$f":"IF(D90=AD90,\"OK\",\"ERRO\")","v":"OK"}]
[{"$f":"IF(A90=\"F\",A90,\"\")","v":""}]
[{"$f":"IF(A91=\"F\",A91,\"\")","v":""},null,null,null,null,0.16600000000000001,null,null,null,0.16,null,null,null,0.17,null,null,null,0.16600000000000001,null,null,null,0.16700000000000001,null,null,null,{"$f":"100%-(SUM(F92:Y92))","v":0.17099999999999993},null,null,null,{"$f":"IFERROR(E90/100,\"\")","v":0},{"$f":"IF(E90=AD92*100,\"OK\",\"ERRO\")","v":"OK"}]
["F","CUSTO DO ORÇAMENTO",null,{"$f":"SUM(D15:D92)","v":0},{"$f":"SUM(E15:E92)","v":0},{"$f":"F15+F18+F21+F24+F27+F30+F33+F36+F39+F42+F45+F48+F51+F54+F57+F60+F63+F66+F69+F72+F75+F78+F81+F84+F87+F90","v":0},null,null,null,{"$f":"J15+J18+J21+J24+J27+J30+J33+J36+J39+J42+J45+J48+J51+J54+J57+J60+J63+J66+J69+J72+J75+J78+J81+J84+J87+J90","v":0},null,null,null,{"$f":"N15+N18+N21+N24+N27+N30+N33+N36+N39+N42+N45+N48+N51+N54+N57+N60+N63+N66+N69+N72+N75+N78+N81+N84+N87+N90","v":0},null,null,null,{"$f":"R15+R18+R21+R24+R27+R30+R33+R36+R39+R42+R45+R48+R51+R54+R57+R60+R63+R66+R69+R72+R75+R78+R81+R84+R87+R90","v":0},null,null,null,{"$f":"V15+V18+V21+V24+V27+V30+V33+V36+V39+V42+V45+V48+V51+V54+V57+V60+V63+V66+V69+V72+V75+V78+V81+V84+V87+V90","v":0},null,null,null,{"$f":"Z15+Z18+Z21+Z24+Z27+Z30+Z33+Z36+Z39+Z42+Z45+Z48+Z51+Z54+Z57+Z60+Z63+Z66+Z69+Z72+Z75+Z78+Z81+Z84+Z87+Z90","v":0},null,null,null,{"$f":"AD15+AD18+AD21+AD24+AD27+AD30+AD33+AD36+AD39+AD42+AD45+AD48+AD51+AD54+AD57+AD60+AD63+AD66+AD69+AD72+AD75+AD78+AD81+AD84+AD87+AD90","v":0}]
["F","PERCENTUAIS:",null,null,null,{"$f":"IFERROR(F93/$D$93,\"\")","v":""},null,null,null,{"$f":"IFERROR(J93/$D$93,\"\")","v":""},null,null,null,{"$f":"IFERROR(N93/$D$93,\"\")","v":""},null,null,null,{"$f":"IFERROR(R93/$D$93,\"\")","v":""},null,null,null,{"$f":"IFERROR(V93/$D$93,\"\")","v":""},null,null,null,{"$f":"IFERROR(Z93/$D$93,\"\")","v":""},null,null,null,{"$f":"SUM(F94:AC94)","v":0}]
["F","TOTAIS ACUMULADOS:",null,null,null,{"$f":"F93","v":0},null,null,null,{"$f":"J93+F95","v":0},null,null,null,{"$f":"N93+J95","v":0},null,null,null,{"$f":"R93+N95","v":0},null,null,null,{"$f":"V93+R95","v":0},null,null,null,{"$f":"Z93+V95","v":0}]
["F","PERCENTUAIS  ACUMULADOS:",null,null,null,{"$f":"F94","v":""},null,null,null,{"$f":"J94+F96","v":{"$error":"#VALUE!"}},null,null,null,{"$f":"N94+J96","v":{"$error":"#VALUE!"}},null,null,null,{"$f":"R94+N96","v":{"$error":"#VALUE!"}},null,null,null,{"$f":"V94+R96","v":{"$error":"#VALUE!"}},null,null,null,{"$f":"Z94+V96","v":{"$error":"#VALUE!"}}]
["F"]
["F","OBSERVAÇÕES:"]
["F","Os pagamentos somente poderão ser efetuados mediante medição e atesto pelos técnicos da Secretaria da Educação. "]

{"sheet":"Composição BDI","index":4,"n_rows":45,"n_cols":9,"rows_kept":45,"cut":false,"hidden":false,"merged":[[12,0,12,3],[13,0,13,3],[14,0,14,3],[15,0,15,3],[6,0,6,3],[8,0,8,3],[7,0,7,3],[9,0,9,3],[11,0,11,3],[10,0,10,3],[0,0,0,3],[2,0,2,3],[3,0,3,3],[1,0,1,3],[5,0,5,3],[4,0,4,3],[18,5,18,8],[17,0,17,3],[16,0,16,3],[44,0,44,3],[42,0,42,3],[43,0,43,3],[18,0,18,3],[36,0,36,3],[39,0,39,3],[38,0,38,3],[40,0,40,3],[29,0,29,2],[32,0,32,3],[33,0,33,3],[34,0,34,3],[35,0,35,3]]}
[]
[]
["UNIDADE ESCOLAR"]
[{"$f":"Orçamento!$O$4","v":"COLÉGIO ESTADUAL JUSCELINO KUBITSCHEK DE OLIVEIRA"}]
[]
["OBRA"]
[{"$f":"Orçamento!$O$7","v":"REFORMA E IMPLANTAÇÃO"}]
[]
["ENDEREÇO"]
[{"$f":"Orçamento!$R$10","v":"AREA ESPECIAL S/N, JARDIM SANTA LUCIA, CEP:72910-001"}]
[]
["CIDADE"]
[{"$f":"Orçamento!$X$7","v":"ÁGUAS LINDAS DE GOIÁS"}]
[]
["CRE"]
[{"$f":"Orçamento!$O$10","v":"ÁGUAS LINDAS"}]
[]
["DETALHAMENTO DA COMPOSIÇÃO DE BDI"]
["COMPOSIÇÃO BDI PARA OBRAS CIVIS",null,null,null,null,"BDI CONSTRUÇÃO E REFORMA"]
["DESCRIÇÃO","COEF.","TAXA % (a.m)","% no preço de venda",null,"Situação","1º Quartil","Médio","3º Quartil"]
["1) COFINS",1,0.03,{"$f":"C21","v":0.03},null,{"$f":"IF(OR(C21<G21,C21>I21),\"FORA DO INTERVALO\",\"OK\")","v":"OK"},0.03,0.03,0.03]
["2) PIS",1,6.4999999999999997E-3,{"$f":"C22","v":6.4999999999999997E-3},null,{"$f":"IF(OR(C22<G22,C22>I22),\"FORA DO INTERVALO\",\"OK\")","v":"OK"},6.4999999999999997E-3,6.4999999999999997E-3,6.4999999999999997E-3]
["3) ISSQN",1,0.03,{"$f":"C23*B23","v":0.03},null,"OK",0.02,3.5000000000000003E-2,0.05]
["4) CPRB",1,4.4999999999999998E-2,{"$f":"C24","v":4.4999999999999998E-2},null,"OK",4.4999999999999998E-2,4.4999999999999998E-2,4.4999999999999998E-2]
["5) Administração Central",1,3.5000000000000003E-2,3.5000000000000003E-2,null,"OK",0.03,0.04,5.5E-2]
["6) Despesas Financeiras",1,5.5999999999999999E-3,5.5999999999999999E-3,null,"FORA DO INTERVALO",5.8999999999999999E-3,1.23E-2,1.3899999999999999E-2]
["7) Seguros + Garantias",1,1.1999999999999999E-3,1.1999999999999999E-3,null,"FORA DO INTERVALO",8.0000000000000002E-3,8.0000000000000002E-3,0.01]
["8) Risco",1,9.7000000000000003E-3,9.7000000000000003E-3,null,"OK",9.7000000000000003E-3,1.2699999999999999E-2,1.2699999999999999E-2]
["9) Lucro",1,6.8099999999999994E-2,6.8099999999999994E-2,null,"OK",6.1600000000000002E-2,7.3999999999999996E-2,8.9599999999999999E-2]
["BDI - FINAL",null,null,{"$f":"(((1+D25+D27+D28)*(1+D26)*(1+D29))/(1-(D21+D22+D23+D24))-1)","v":0.26435756266066424},null,{"$f":"IF(OR(D30<G30,D30>I30),\"FORA DO INTERVALO\",\"OK\")","v":"FORA DO INTERVALO"},0.2034,0.22120000000000001,0.25]
[]
["Notas:"]
["(1) e (2) Alíquota definida por lei."]
["(3) Alíquota e base de cálculo definidas pela legislação municipal."]
["(4) Alíquota definida pelas leis 12.546/11, 12844/13 e 13.161/15 (CPRB – contribuição previdenciária sobre a receita bruta)."]
["(5) Valores definidos a partir dos limites no Acórdão nº 2.622/2013 - TCU – Plenário. Valores entre o 1º e 3º quartis."]
["(6) Valor calculado pela expressão matemática do acórdão 2.369/2011 – TCU – Plenário e disponibilizado pela AGETOP em dezembro de 2018. (Foi utilizado para o cálculo a média da Taxa SELIC no período de 11/2017 a 10/2018)"]
[]
["(7) Valores definidos pela AGETOP a partir dos limites no Acórdão nº 2.622/2013 - TCU – Plenário. Valores médios. \n\nObservação da AGETOP: (Seguros contra erros de execução, incêndio e explosão, danos da natureza (vendaval, destelhamento, alagamento, inundação, desmoronamento, geadas etc.), emprego de material defeituoso ou inadequado, roubo e/ou furto qualificado, quebra de equipamentos, desmoronamento de estrutura, nas modalidades de Obras Civis em Construção (OCC); Instalação e Montagem (IM); e Obras Civis em Construção e Instalação e Montagem (OCC/IM). Bem como coberturas adicionais para ampliação dessas coberturas básicas, como: cobertura de responsabilidade civil geral, cobertura de responsabilidade civil cruzada, cobertura de despesas extraordinárias, cobertura de tumultos, cobertura de desentulho do local, cobertura de riscos do fabricante, dentre outras, incluindo o seguro de vida em grupo regido pela convenção coletiva dos trabalhadores na indústria da construção civil). A partir de 24/02/2015 por intermédio da Portaria 449/2015 a Presidência da AGETOP, na pessoa do Senhor Jayme Eduardo Rincon, determinou a exclusão dos valores referentes aos Seguros de Risco de Engenharia e Responsabilidade Civil do Profissional na composição do cálculo do B.D.I.."]
["(8) Valores definidos a partir dos limites no Acórdão nº 2.622/2013 - TCU – Plenário. Valores entre 1º e 3° quartis."]
["(9) Valores definidos a partir dos limites definidos no Acórdão nº 2.622/2013 - TCU – Plenário. Valores adotados e praticados no mercado ( “ ex ante ” ) ou aqueles entre os 1º e 3º quartis."]
[]
["(*) A fórmula para estipulação da taxa de BDI estimado adotado é a mesma que foi aplicada para a obtenção das tabelas contidas no Acórdão n. 2.622/2013 – TCUPlenário"]
[]
["Obs.: Para obras com valores superiores a R$ 20.000.000,00 sugere-se recalcular o BDI, dimensionando as taxas de administração central e lucro para patamares inferiores ao estipulado acima."]

{"sheet":"Relatório CENTRAL","index":5,"n_rows":40,"n_cols":7,"rows_kept":40,"cut":false,"hidden":false,"merged":[[8,3,8,4],[9,1,9,2],[10,1,10,4],[11,1,11,4],[39,1,39,2],[9,0,11,0],[0,1,0,4],[6,3,6,4],[9,3,9,4],[1,1,1,4],[2,1,2,2],[2,3,2,4],[3,1,3,2],[3,3,3,4],[4,1,4,4],[5,1,5,2],[5,3,5,4],[6,1,6,2],[7,1,7,4],[8,1,8,2]]}
[]
[]
[null,"UNIDADE ESCOLAR",null,"CIDADE"]
[null,{"$f":"Orçamento!$O$4","v":"COLÉGIO ESTADUAL JUSCELINO KUBITSCHEK DE OLIVEIRA"},null,{"$f":"Orçamento!$X$7","v":"ÁGUAS LINDAS DE GOIÁS"}]
[]
[null,"OBRA",null,"CRE"]
[null,{"$f":"Orçamento!$O$7","v":"REFORMA E IMPLANTAÇÃO"},null,{"$f":"Orçamento!$O$10","v":"ÁGUAS LINDAS"}]
[]
[null,"ENDEREÇO",null,"DATA"]
["FILTRO",{"$f":"Orçamento!$R$10","v":"AREA ESPECIAL S/N, JARDIM SANTA LUCIA, CEP:72910-001"},null,{"$f":"Orçamento!$S$7","v":"2020-07-07"}]
[]
[null,"RELATÓRIO CENTRAL"]
["↓","CÓDIGO","ETAPA","PREÇO  (R$) C/ BDI","PARTIC  ( % )"]
[{"$f":"IF(D14>0,\"F\",\"\")","v":""},{"$f":"Orçamento!O637","v":"a."},{"$f":"Orçamento!P637","v":"SERVIÇOS PRELIMINARES"},{"$f":"Orçamento!X637","v":0},{"$f":"Orçamento!AA637","v":0},6,7]
[{"$f":"IF(D15>0,\"F\",\"\")","v":""},{"$f":"Orçamento!O638","v":"b."},{"$f":"Orçamento!P638","v":"TRANSPORTES"},{"$f":"Orçamento!X638","v":0},{"$f":"Orçamento!AA638","v":0},0,1]
["",{"$f":"Orçamento!O639","v":"c."},{"$f":"Orçamento!P639","v":"SERVIÇO EM TERRA"},{"$f":"Orçamento!X639","v":0},{"$f":"Orçamento!AA639","v":0},6,7]
["",{"$f":"Orçamento!O640","v":"d."},{"$f":"Orçamento!P640","v":"FUNDAÇÕES E SONDAGENS"},{"$f":"Orçamento!X640","v":0},{"$f":"Orçamento!AA640","v":0},2,9]
["",{"$f":"Orçamento!O641","v":"e."},{"$f":"Orçamento!P641","v":"ESTRUTURA"},{"$f":"Orçamento!X641","v":0},{"$f":"Orçamento!AA641","v":0},0,7]
["",{"$f":"Orçamento!O642","v":"f."},{"$f":"Orçamento!P642","v":"INSTALAÇÕES ELÉTRICAS"},{"$f":"Orçamento!X642","v":0},{"$f":"Orçamento!AA642","v":0},0,7]
["",{"$f":"Orçamento!O643","v":"g."},{"$f":"Orçamento!P643","v":"INSTALAÇÕES HIDROSSANITÁRIAS"},{"$f":"Orçamento!X643","v":0},{"$f":"Orçamento!AA643","v":0},6,4]
["",{"$f":"Orçamento!O644","v":"h"},{"$f":"Orçamento!P644","v":"INSTALAÇÕES ESPECIAIS"},{"$f":"Orçamento!X644","v":0},{"$f":"Orçamento!AA644","v":0},8,0]
["",{"$f":"Orçamento!O645","v":"i."},{"$f":"Orçamento!P645","v":"ALVENARIAS E DIVISÓRIAS"},{"$f":"Orçamento!X645","v":0},{"$f":"Orçamento!AA645","v":0},2,1]
["",{"$f":"Orçamento!O646","v":"j."},{"$f":"Orçamento!P646","v":"ALVENARIA AUTO-PORTANTE"},{"$f":"Orçamento!X646","v":0},{"$f":"Orçamento!AA646","v":0}]
["",{"$f":"Orçamento!O647","v":"k."},{"$f":"Orçamento!P647","v":"IMPERMEABILIZAÇÃO"},{"$f":"Orçamento!X647","v":0},{"$f":"Orçamento!AA647","v":0},7,8]
["",{"$f":"Orçamento!O648","v":"l."},{"$f":"Orçamento!P648","v":"ISOLAMENTO TÉRMICO E ACÚSTICO"},{"$f":"Orçamento!X648","v":0},{"$f":"Orçamento!AA648","v":0}]
["",{"$f":"Orçamento!O649","v":"m."},{"$f":"Orçamento!P649","v":"ESTRUTURA DE MADEIRA"},{"$f":"Orçamento!X649","v":0},{"$f":"Orçamento!AA649","v":0}]
["",{"$f":"Orçamento!O650","v":"n."},{"$f":"Orçamento!P650","v":"ESTRUTURAS METÁLICAS"},{"$f":"Orçamento!X650","v":0},{"$f":"Orçamento!AA650","v":0},2,0]
["",{"$f":"Orçamento!O651","v":"o."},{"$f":"Orçamento!P651","v":"COBERTURAS"},{"$f":"Orçamento!X651","v":0},{"$f":"Orçamento!AA651","v":0},6,3]
["",{"$f":"Orçamento!O652","v":"p."},{"$f":"Orçamento!P652","v":"ESQUADRIAS DE MADEIRA"},{"$f":"Orçamento!X652","v":0},{"$f":"Orçamento!AA652","v":0}]
["",{"$f":"Orçamento!O653","v":"q."},{"$f":"Orçamento!P653","v":"ESQUADRIAS METÁLICAS"},{"$f":"Orçamento!X653","v":0},{"$f":"Orçamento!AA653","v":0},4,0]
["",{"$f":"Orçamento!O654","v":"r."},{"$f":"Orçamento!P654","v":"VIDROS"},{"$f":"Orçamento!X654","v":0},{"$f":"Orçamento!AA654","v":0},5,5]
["",{"$f":"Orçamento!O655","v":"s."},{"$f":"Orçamento!P655","v":"REVESTIMENTO DE PAREDE"},{"$f":"Orçamento!X655","v":0},{"$f":"Orçamento!AA655","v":0},2,1]
["",{"$f":"Orçamento!O656","v":"t."},{"$f":"Orçamento!P656","v":"FORROS"},{"$f":"Orçamento!X656","v":0},{"$f":"Orçamento!AA656","v":0},3,6]
["",{"$f":"Orçamento!O657","v":"u."},{"$f":"Orçamento!P657","v":"REVESTIMENTO DE PISO"},{"$f":"Orçamento!X657","v":0},{"$f":"Orçamento!AA657","v":0},8,0]
["",{"$f":"Orçamento!O658","v":"v."},{"$f":"Orçamento!P658","v":"FERRAGENS"},{"$f":"Orçamento!X658","v":0},{"$f":"Orçamento!AA658","v":0},3,5]
["",{"$f":"Orçamento!O659","v":"w."},{"$f":"Orçamento!P659","v":"MARCENARIA"},{"$f":"Orçamento!X659","v":0},{"$f":"Orçamento!AA659","v":0},6,2]
["",{"$f":"Orçamento!O660","v":"x."},{"$f":"Orçamento!P660","v":"ADMINISTRAÇÃO"},{"$f":"Orçamento!X660","v":0},{"$f":"Orçamento!AA660","v":0},5,9]
["",{"$f":"Orçamento!O661","v":"y."},{"$f":"Orçamento!P661","v":"PINTURA"},{"$f":"Orçamento!X661","v":0},{"$f":"Orçamento!AA661","v":0},1,1]
["",{"$f":"Orçamento!O662","v":"z."},{"$f":"Orçamento!P662","v":"DIVERSOS"},{"$f":"Orçamento!X662","v":0},{"$f":"Orçamento!AA662","v":0},9,7]
["F","TOTAL GERAL DO ORÇAMENTO (R$) C/BDI",null,{"$f":"SUM(D14:D39)","v":0},{"$f":"SUM(E14:E39)","v":0},{"$f":"SUM(F14:F39)","v":91},{"$f":"SUM(G14:G39)","v":90}]

{"sheet":"Parc Maior Relev","index":6,"n_rows":32,"n_cols":7,"rows_kept":32,"cut":false,"hidden":false,"merged":[[10,0,12,0],[8,1,8,3],[8,4,8,6],[32,3,32,7],[30,1,30,6],[0,1,0,6],[11,1,11,6],[1,1,1,6],[2,1,2,3],[2,4,2,6],[3,1,3,3],[3,4,3,6],[4,1,4,6],[5,1,5,3],[5,4,5,6],[9,1,9,3],[9,4,9,6],[10,1,10,6],[6,1,6,3],[6,4,6,6],[7,1,7,6]]}
[]
[]
[null,"UNIDADE ESCOLAR",null,null,"CÓDIGO INEP"]
[null,{"$f":"Orçamento!$O$4","v":"COLÉGIO ESTADUAL JUSCELINO KUBITSCHEK DE OLIVEIRA"},null,null,{"$f":"Orçamento!$X$4","v":52075583}]
[]
[null,"OBRA",null,null,"CIDADE"]
[null,{"$f":"Orçamento!$O$7","v":"REFORMA E IMPLANTAÇÃO"},null,null,{"$f":"Orçamento!$X$7","v":"ÁGUAS LINDAS DE GOIÁS"}]
[]
[null,"CRE",null,null,"ÁREA TOTAL CONSTRUÍDA (M²)"]
[null,{"$f":"Orçamento!$O$10","v":"ÁGUAS LINDAS"},null,null,{"$f":"Orçamento!$S$13","v":3074.09}]
["FILTRO"]
[null,"PARCELA DE MAIOR RELEVÂNCIA"]
[null,"CÓDIGO","SERVIÇO","DESCRIÇÃO","UNID","QUANT","PARC. MAIOR RELEV (100%)"]
[{"$f":"IF(F14>0,\"F\",\"\")","v":""},70000,"INSTALAÇÕES ELÉTRICAS","SUBESTAÇÃO","KVA",{"$f":"SUMIF(Orçamento!$R$20:$R$618,'Parc Maior Relev'!D14,Orçamento!$T$20:$T$618)","v":0},{"$f":"F14","v":0}]
[null,"CÓDIGO","SERVIÇO","DESCRIÇÃO","UNID","QUANT","PARC. MAIOR RELEV (50%)"]
[null,{"$f":"Somatório!B22","v":"f."},"INSTALAÇÕES ELÉTRICAS","INSTALAÇÕES ELÉTRICAS","KVA",62.96,{"$f":"F16*0.5","v":31.48}]
[null,{"$f":"Somatório!B31","v":"o."},"COBERTURAS","TELHA CERÂMICA","M2",{"$f":"Orçamento!V279+Orçamento!V281","v":0},0]
[null,160000,"COBERTURAS","TELHA FIBROCIMENTO","M2",{"$f":"SUMIF(Orçamento!$R$20:$R$618,'Parc Maior Relev'!D18,Orçamento!$T$20:$T$618)","v":0},0]
[null,160000,"COBERTURAS","TELHA METÁLICA","M2",{"$f":"SUMIF(Orçamento!$R$20:$R$618,'Parc Maior Relev'!D19,Orçamento!$T$20:$T$618)","v":0},0]
[null,200000,"REVESTIMENTO DE PAREDE","REBOCO","M2",{"$f":"SUMIF(Orçamento!$R$20:$R$618,'Parc Maior Relev'!D20,Orçamento!$T$20:$T$618)","v":0},0]
[null,200000,"REVESTIMENTO DE PAREDE","REVESTIMENTO CERÂMICO","M2",{"$f":"SUMIF(Orçamento!$R$20:$R$618,'Parc Maior Relev'!D21,Orçamento!$T$20:$T$618)","v":0},0]
[null,210000,"FORROS","FORRO DE GESSO","M2",{"$f":"SUMIF(Orçamento!$R$20:$R$618,'Parc Maior Relev'!D22,Orçamento!$T$20:$T$618)","v":0},0]
[null,210000,"FORROS","FORRO PVC","M2",{"$f":"SUMIF(Orçamento!$R$20:$R$618,'Parc Maior Relev'!D23,Orçamento!$T$20:$T$618)","v":0},0]
[null,210000,"FORROS","FORRO ACARTONADO","M2",{"$f":"SUMIF(Orçamento!$R$20:$R$618,'Parc Maior Relev'!D24,Orçamento!$T$20:$T$618)","v":0},0]
[null,{"$f":"Somatório!B37","v":"u."},"REVESTIMENTO DE PISO","PISO GRANITINA","M2",{"$f":"Orçamento!V415+Orçamento!V536","v":0},0]
[null,220000,"REVESTIMENTO DE PISO","PISO LAMINADO","M2",{"$f":"SUMIF(Orçamento!$R$20:$R$618,'Parc Maior Relev'!D26,Orçamento!$T$20:$T$618)","v":0},0]
[null,220000,"REVESTIMENTO DE PISO","PISO CONCRETO DESEMPENADO","M2",{"$f":"SUMIF(Orçamento!$R$20:$R$618,'Parc Maior Relev'!D27,Orçamento!$T$20:$T$618)","v":0},0]
[null,220000,"REVESTIMENTO DE PISO","PISO CERÂMICO","M2",{"$f":"SUMIF(Orçamento!$R$20:$R$618,'Parc Maior Relev'!D28,Orçamento!$T$20:$T$618)","v":0},0]
[null,260000,"PINTURA","PINTURA","M2",{"$f":"SUMIF(Orçamento!$R$20:$R$618,'Parc Maior Relev'!D29,Orçamento!$T$20:$T$618)","v":0},0]
["F"]
["F","(*) Para os fins do inciso I dp § 1º do Art. 30 da Lei Federal 8.666/93, são consideradas parcelas de maior relevância técnica as execuções apresentadas"]
["F"]

{"sheet":"Composições","index":7,"n_rows":442,"n_cols":10,"rows_kept":442,"cut":false,"hidden":false,"merged":[[425,1,425,7],[410,8,410,9],[415,1,415,7],[418,1,418,7],[420,0,421,0],[420,1,421,1],[420,2,421,2],[420,3,421,3],[420,4,421,4],[420,5,421,5],[420,6,420,7],[420,8,420,9],[404,1,404,7],[408,1,408,7],[410,0,411,0],[410,1,411,1],[410,2,411,2],[410,3,411,3],[410,4,411,4],[410,5,411,5],[410,6,410,7],[387,2,388,2],[387,3,388,3],[387,4,388,4],[387,5,388,5],[387,6,387,7],[387,8,387,9],[391,1,391,7],[398,1,398,7],[400,0,401,0],[400,1,401,1],[400,2,401,2],[400,3,401,3],[400,4,401,4],[400,5,401,5],[400,6,400,7],[400,8,400,9],[322,8,322,9],[331,8,331,9],[340,8,340,9],[349,8,349,9],[363,1,363,7],[358,8,358,9],[365,1,365,7],[367,0,368,0],[367,1,368,1],[367,2,368,2],[367,3,368,3],[367,4,368,4],[367,5,368,5],[367,6,367,7],[367,8,367,9],[327,1,327,7],[329,1,329,7],[331,0,332,0],[331,1,332,1],[331,2,332,2],[331,3,332,3],[331,4,332,4],[331,5,332,5],[331,6,331,7],[316,1,316,7],[320,1,320,7],[322,0,323,0],[322,1,323,1],[322,2,323,2],[322,3,323,3],[322,4,323,4],[322,5,323,5],[322,6,322,7],[310,1,310,7],[312,0,313,0],[312,1,313,1],[312,2,313,2],[312,3,313,3],[312,4,313,4],[312,5,313,5],[312,6,312,7],[312,8,312,9],[302,5,303,5],[302,6,302,7],[302,8,302,9],[306,1,306,7],[302,0,303,0],[302,1,303,1],[302,2,303,2],[302,3,303,3],[302,4,303,4],[292,5,293,5],[292,6,292,7],[292,8,292,9],[300,1,300,7],[292,0,293,0],[292,1,293,1],[292,2,293,2],[292,3,293,3],[292,4,293,4],[297,1,297,7],[269,1,269,7],[280,1,280,7],[278,1,278,7],[282,5,283,5],[282,6,282,7],[282,8,282,9],[290,1,290,7],[282,0,283,0],[282,1,283,1],[282,2,283,2],[282,3,283,3],[282,4,283,4],[287,1,287,7],[271,1,271,7],[273,0,274,0],[273,1,274,1],[273,2,274,2],[273,3,274,3],[273,4,274,4],[273,5,274,5],[273,6,273,7],[273,8,273,9],[264,0,265,0],[264,1,265,1],[264,2,265,2],[264,3,265,3],[264,4,265,4],[264,5,265,5],[264,6,264,7],[264,8,264,9],[253,1,253,7],[255,0,256,0],[255,1,256,1],[255,2,256,2],[255,3,256,3],[255,4,256,4],[255,5,256,5],[255,6,255,7],[255,8,255,9],[260,1,260,7],[262,1,262,7],[237,8,237,9],[251,1,251,7],[244,1,244,7],[246,0,247,0],[246,1,247,1],[246,2,247,2],[246,3,247,3],[246,4,247,4],[246,5,247,5],[246,6,246,7],[246,8,246,9],[232,1,232,7],[242,1,242,7],[235,1,235,7],[237,0,238,0],[237,1,238,1],[237,2,238,2],[237,3,238,3],[237,4,238,4],[237,5,238,5],[237,6,237,7],[189,1,189,7],[203,1,203,7],[215,1,215,7],[213,1,213,7],[217,5,218,5],[217,6,217,7],[217,8,217,9],[222,1,222,7],[217,0,218,0],[217,1,218,1],[217,2,218,2],[217,3,218,3],[217,4,218,4],[196,1,196,7],[198,0,199,0],[198,1,199,1],[198,2,199,2],[198,3,199,3],[198,4,199,4],[198,5,199,5],[198,6,198,7],[198,8,198,9],[206,1,206,7],[208,0,209,0],[175,8,175,9],[183,1,183,7],[179,1,179,7],[185,0,186,0],[185,1,186,1],[185,2,186,2],[185,3,186,3],[185,4,186,4],[185,5,186,5],[185,6,185,7],[185,8,185,9],[171,1,171,7],[173,1,173,7],[175,0,176,0],[175,1,176,1],[175,2,176,2],[175,3,176,3],[175,4,176,4],[175,5,176,5],[175,6,175,7],[134,1,134,7],[142,1,142,7],[153,1,153,7],[146,1,146,7],[148,0,149,0],[148,1,149,1],[148,2,149,2],[148,3,149,3],[148,4,149,4],[148,5,149,5],[148,6,148,7],[138,0,139,0],[138,1,139,1],[138,2,139,2],[138,3,139,3],[138,4,139,4],[138,5,139,5],[138,6,138,7],[120,8,120,9],[125,1,125,7],[128,1,128,7],[130,0,131,0],[130,1,131,1],[130,2,131,2],[130,3,131,3],[130,4,131,4],[130,5,131,5],[130,6,130,7],[130,8,130,9],[110,1,111,1],[110,2,111,2],[110,3,111,3],[110,4,111,4],[115,1,115,7],[118,1,118,7],[120,0,121,0],[120,1,121,1],[120,2,121,2],[120,3,121,3],[120,4,121,4],[120,5,121,5],[120,6,120,7],[67,1,67,7],[76,1,76,7],[88,1,88,7],[86,1,86,7],[90,5,91,5],[90,6,90,7],[90,8,90,9],[95,1,95,7],[98,1,98,7],[69,1,69,7],[90,1,91,1],[90,2,91,2],[90,3,91,3],[90,4,91,4],[79,1,79,7],[59,1,59,7],[54,8,54,9],[61,1,61,7],[63,0,64,0],[63,1,64,1],[63,2,64,2],[63,3,64,3],[63,4,64,4],[63,5,64,5],[63,6,63,7],[63,8,63,9],[43,1,43,7],[45,0,46,0],[45,1,46,1],[45,2,46,2],[45,3,46,3],[45,4,46,4],[45,5,46,5],[45,6,45,7],[45,8,45,9],[22,1,22,7],[28,8,28,9],[41,1,41,7],[34,1,34,7],[36,0,37,0],[36,1,37,1],[36,2,37,2],[36,3,37,3],[36,4,37,4],[36,5,37,5],[36,6,36,7],[36,8,36,9],[32,1,32,7],[0,0,0,8],[10,0,10,2],[10,3,10,6],[11,0,11,9],[12,0,12,2],[12,3,12,6],[12,7,12,8],[7,0,7,6],[9,0,9,2],[9,3,9,6],[9,7,9,8],[3,0,3,6],[4,0,4,6],[15,0,15,9],[13,0,13,2],[13,3,13,6],[1,0,1,9],[2,0,2,9],[50,1,50,7],[52,1,52,7],[54,0,55,0],[54,1,55,1],[54,2,55,2],[54,3,55,3],[54,4,55,4],[54,5,55,5],[54,6,54,7],[3,7,3,9],[4,7,4,9],[6,7,6,9],[7,7,7,9],[6,0,6,6],[10,8,10,9],[13,8,13,9],[14,0,14,9],[8,0,8,9],[5,0,5,9],[16,8,16,9],[16,0,17,0],[16,1,17,1],[16,2,17,2],[71,0,72,0],[71,1,72,1],[71,2,72,2],[71,3,72,3],[71,4,72,4],[71,5,72,5],[71,6,71,7],[71,8,71,9],[26,1,26,7],[28,0,29,0],[28,1,29,1],[28,2,29,2],[28,3,29,3],[28,4,29,4],[28,5,29,5],[28,6,28,7],[16,5,17,5],[16,6,16,7],[16,3,17,3],[16,4,17,4],[81,0,82,0],[81,1,82,1],[81,2,82,2],[81,3,82,3],[81,4,82,4],[81,5,82,5],[81,6,81,7],[81,8,81,9],[136,1,136,7],[90,0,91,0],[100,5,101,5],[100,6,100,7],[100,8,100,9],[105,1,105,7],[108,1,108,7],[100,0,101,0],[100,1,101,1],[100,2,101,2],[100,3,101,3],[100,4,101,4],[110,5,111,5],[110,6,110,7],[110,8,110,9],[110,0,111,0],[138,8,138,9],[164,1,164,7],[166,0,167,0],[166,1,167,1],[166,2,167,2],[166,3,167,3],[166,4,167,4],[166,5,167,5],[166,6,166,7],[166,8,166,9],[148,8,148,9],[155,1,155,7],[157,0,158,0],[157,1,158,1],[157,2,158,2],[157,3,158,3],[157,4,158,4],[157,5,158,5],[157,6,157,7],[157,8,157,9],[162,1,162,7],[208,1,209,1],[208,2,209,2],[208,3,209,3],[208,4,209,4],[208,5,209,5],[208,6,208,7],[208,8,208,9],[225,1,225,7],[227,0,228,0],[227,1,228,1],[227,2,228,2],[227,3,228,3],[227,4,228,4],[227,5,228,5],[227,6,227,7],[227,8,227,9],[336,1,336,7],[338,1,338,7],[340,0,341,0],[340,1,341,1],[340,2,341,2],[340,3,341,3],[340,4,341,4],[340,5,341,5],[340,6,340,7],[345,1,345,7],[347,1,347,7],[349,0,350,0],[349,1,350,1],[349,2,350,2],[349,3,350,3],[349,4,350,4],[349,5,350,5],[349,6,349,7],[433,8,433,9],[354,1,354,7],[356,1,356,7],[358,0,359,0],[358,1,359,1],[358,2,359,2],[358,3,359,3],[358,4,359,4],[358,5,359,5],[358,6,358,7],[371,1,371,7],[375,1,375,7],[377,0,378,0],[377,1,378,1],[377,2,378,2],[377,3,378,3],[377,4,378,4],[377,5,378,5],[377,6,377,7],[377,8,377,9],[381,1,381,7],[385,1,385,7],[387,0,388,0],[387,1,388,1],[438,1,438,7],[441,1,441,7],[431,1,431,7],[433,0,434,0],[433,1,434,1],[433,2,434,2],[433,3,434,3],[433,4,434,4],[433,5,434,5],[433,6,433,7]]}
[]
[]
[]
["UNIDADE ESCOLAR",null,null,null,null,null,null,"CÓDIGO INEP"]
[{"$f":"Orçamento!$O$4","v":"COLÉGIO ESTADUAL JUSCELINO KUBITSCHEK DE OLIVEIRA"},null,null,null,null,null,null,{"$f":"Orçamento!$X$4","v":52075583}]
[]
["OBRA",null,null,null,null,null,null,"CIDADE"]
[{"$f":"Orçamento!$O$7","v":"REFORMA E IMPLANTAÇÃO"},null,null,null,null,null,null,{"$f":"Orçamento!$X$7","v":"ÁGUAS LINDAS DE GOIÁS"}]
[]
["CRE",null,null,"ENDEREÇO",null,null,null,"REFERÊNCIA AGETOP"]
[{"$f":"Orçamento!$O$10","v":"ÁGUAS LINDAS"},null,null,{"$f":"Orçamento!$R$10","v":"AREA ESPECIAL S/N, JARDIM SANTA LUCIA, CEP:72910-001"},null,null,null,{"$f":"Orçamento!$X$10","v":"ABR/19"},{"$f":"Orçamento!$Y$10","v":"DESONERADA"}]
[]
["DATA",null,null,"ÁREA TOTAL CONSTRUÍDA (M²)",null,null,null,"REFERÊNCIA SINAPI"]
[{"$f":"Orçamento!$S$7","v":"2020-07-07"},null,null,{"$f":"Orçamento!$S$13","v":3074.09},null,null,null,{"$f":"Orçamento!$X$13","v":"SET/19"},{"$f":"Orçamento!$Y$13","v":"DESONERADA"}]
[]
["COMPOSIÇÕES DE CUSTOS UNITÁRIOS - SEE-GO"]
[10,"FONTE","CÓDIGO","DESCRIÇÃO","UNIDADE","COEFIC.","CUSTO UNITÁRIO",null,"CUSTO  TOTAL (A) + (B) + (C) + (D) + (E)"]
[null,null,null,null,null,null,"DESONERADO","NÃO DESONER.","DESONERADO","NÃO DESONER."]
[null,"COMPOSIÇÃO","COMP 010_SEE","DEMOLIÇÃO DE GRADE/GRELHA/GUARDA CORPO - METÁLICO","M2",null,"-","-",3.82,4.42]
[null,null,null,"","",null,0,0,0,0]
[null,null,null,"","",null,0,0,0,0]
[null,null,null,"","",null,0,0,0,0]
[null,"MÃO DE OBRA (B) - TOTAL",null,null,null,null,null,null,0,0]
[null,"AGETOP",20106,"RETIRADA DE JANELAS OU PORTAIS C/ TRANSP. ATÉ CB. E CARGA","m2    ",1,3.82,4.42,3.82,4.42]
[null,null,null,"","",null,0,0,0,0]
[null,null,null,"","",null,0,0,0,0]
[null,"MATERIAL (C) - TOTAL",null,null,null,null,null,null,3.82,4.42]
[]
[385,"FONTE","CÓDIGO","DESCRIÇÃO","UNIDADE","COEFIC.","CUSTO UNITÁRIO",null,"CUSTO  TOTAL (A) + (B) + (C) + (D) + (E)"]
[null,null,null,null,null,null,"DESONERADO","NÃO DESONER.","DESONERADO","NÃO DESONER."]
[null,"COMPOSIÇÃO","COMP 385_SEE","DEMOLIÇÃO POSTE DE CONCRETO/METALICA ENTRE 10 E 15 METROS C/ REAPROVEITAMENTO C/ TRANSPORTE ATE CAÇAMBA E CARGA","UN ",null,null,null,138.19999999999999,139.51]
[null,"AGETOP_I",8,"AJUDANTE","h     ",1,8.1999999999999993,9.51,8.1999999999999993,9.51]
[null,"MÃO DE OBRA (B) - TOTAL",null,null,null,null,null,null,8.1999999999999993,9.51]
[null,"AGETOP",72080,"POSTE/TRAFO - CAMINHÃO MUNCK 12 TON. (MÍNIMO 4H/DIA)","H     ",1,130,130,130,130]
[null,"MATERIAL (C) - TOTAL",null,null,null,null,null,null,130,130]
[]
[387,"FONTE","CÓDIGO","DESCRIÇÃO","UNIDADE","COEFIC.","CUSTO UNITÁRIO",null,"CUSTO  TOTAL (A) + (B) + (C) + (D) + (E)"]
[null,null,null,null,null,null,"DESONERADO","NÃO DESONER.","DESONERADO","NÃO DESONER."]
[null,"COMPOSIÇÃO","COMP 387_SEE","LÂMPADA LED TUBULAR 18W ","UN ",null,null,null,22.28,22.330000000000002]
[null,"AGETOP_I",8,"AJUDANTE","h     ",1.4999999999999999E-2,8.1999999999999993,9.51,0.12,0.14000000000000001]
[null,"AGETOP_I",12,"ELETRICISTA","h     ",1.4999999999999999E-2,13.4,15.53,0.2,0.23]
[null,"MÃO DE OBRA (B) - TOTAL",null,null,null,null,null,null,0.32,0.37]
[null,"COTAÇÃO","COT 195_SEE","LÂMPADA LED TUBULAR 18W ","UN",1,21.959999999999997,21.959999999999997,21.96,21.96]
[null,"MATERIAL (C) - TOTAL",null,null,null,null,null,null,21.96,21.96]
[]
[40,"FONTE","CÓDIGO","DESCRIÇÃO","UNIDADE","COEFIC.","CUSTO UNITÁRIO",null,"CUSTO  TOTAL (A) + (B) + (C) + (D) + (E)"]
[null,null,null,null,null,null,"DESONERADO","NÃO DESONER.","DESONERADO","NÃO DESONER."]
[null,"COMPOSIÇÃO","COMP 040_SEE","CONJUNTO MOTOR-BOMBA ELÉTRICA TRIFÁSICO 380/220 V PARA VZ= 24,33 M³/H, HM= 46,24 M POTÊNCIA= 7,5 CV","UN ",null,null,null,3965.4700000000003,3992.9900000000002]
[null,"AGETOP_I",8,"AJUDANTE","h     ",8,8.1999999999999993,9.51,65.599999999999994,76.08]
[null,"AGETOP_I",11,"ENCANADOR","h     ",8,13.4,15.53,107.2,124.24]
[null,"MÃO DE OBRA (B) - TOTAL",null,null,null,null,null,null,172.8,200.32]
[null,"COTAÇÃO","COT 008_SEE","CONJUNTO MOTOR-BOMBA ELÉTRICA TRIFÁSICO 380/220 V PARA VZ= 24,33 M³/H, HM= 46,24 M POTÊNCIA= 7,5 CV","UN ",1,3792.6666666666665,3792.6666666666665,3792.67,3792.67]
[null,"MATERIAL (C) - TOTAL",null,null,null,null,null,null,3792.67,3792.67]
[]
[17,"FONTE","CÓDIGO","DESCRIÇÃO","UNIDADE","COEFIC.","CUSTO UNITÁRIO",null,"CUSTO  TOTAL (A) + (B) + (C) + (D) + (E)"]
[null,null,null,null,null,null,"DESONERADO","NÃO DESONER.","DESONERADO","NÃO DESONER."]
[null,"COMPOSIÇÃO","COMP 017_SEE","REDUCAO GIRATÓRIA TIPO STORZ LATAO P/ INST. PREDIAL COMBATE A INCENDIO ENGATE RAPIDO 2.1/2\" X 1.1/2\"","UN ",null,"-","-",99.14,99.69]
[null,"AGETOP_I",8,"AJUDANTE","h     ",0.16,8.1999999999999993,9.51,1.31,1.52]
[null,"AGETOP_I",11,"ENCANADOR","h     ",0.16,13.4,15.53,2.14,2.48]
[null,"MÃO DE OBRA (B) - TOTAL",null,null,null,null,null,null,3.45,4]
[null,"SINAPI_I",20972,"REDUCAO FIXA TIPO STORZ, ENGATE RAPIDO 2.1/2\" X 1.1/2\", EM LATAO, PARA INSTALACAO PREDIAL COMBATE A INCENDIO PREDIAL","UN    ",1,95.69,95.69,95.69,95.69]
[null,"MATERIAL (C) - TOTAL",null,null,null,null,null,null,95.69,95.69]
[]
[18,"FONTE","CÓDIGO","DESCRIÇÃO","UNIDADE","COEFIC.","CUSTO UNITÁRIO",null,"CUSTO  TOTAL (A) + (B) + (C) + (D) + (E)"]
[null,null,null,null,null,null,"DESONERADO","NÃO DESONER.","DESONERADO","NÃO DESONER."]
[null,"COMPOSIÇÃO","COMP 018_SEE","CHAVE DUPLA P/ CONEXÕES TIPO STORZ EM LATÃO ENGATE RÁPIDO 1 1/2\" X 2 1/2\"","UN ",null,"-","-",14.76,15.08]
[null,"AGETOP_I",11,"ENCANADOR","h     ",0.15,13.4,15.53,2.0099999999999998,2.33]
[null,"MÃO DE OBRA (B) - TOTAL",null,null,null,null,null,null,2.0099999999999998,2.33]
[null,"SINAPI_I",20971,"CHAVE DUPLA PARA CONEXOES TIPO STORZ, ENGATE RAPIDO 1 1/2\" X 2 1/2\", EM LATAO, PARA INSTALACAO PREDIAL COMBATE A INCENDIO","UN    ",1,12.75,12.75,12.75,12.75]
[null,"MATERIAL (C) - TOTAL",null,null,null,null,null,null,12.75,12.75]
[]
[87,"FONTE","CÓDIGO","DESCRIÇÃO","UNIDADE","COEFIC.","CUSTO UNITÁRIO",null,"CUSTO  TOTAL (A) + (B) + (C) + (D) + (E)"]
[null,null,null,null,null,null,"DESONERADO","NÃO DESONER.","DESONERADO","NÃO DESONER."]
[null,"COMPOSIÇÃO","COMP 087_SEE","REGISTRO DE GAVETA COM HASTE ASCENDENTE DE BRONZE 2 1/2\"","UN ",null,null,null,257.29999999999995,261.26]
[null,"AGETOP_I",8,"AJUDANTE","h     ",1.1499999999999999,8.1999999999999993,9.51,9.43,10.94]
[null,"AGETOP_I",11,"ENCANADOR","h     ",1.1499999999999999,13.4,15.53,15.41,17.86]
[null,"MÃO DE OBRA (B) - TOTAL",null,null,null,null,null,null,24.84,28.799999999999997]
[null,"AGETOP_I","H689","FITA VEDAROSCA 12 MM","m",2.82,0.28000000000000003,0.28000000000000003,0.79,0.79]
[null,"COTAÇÃO","COT 017_SEE","REGISTRO DE GAVETA COM HASTE ASCENDENTE DE BRONZE 2 1/2\"","UN ",1,231.66666666666666,231.66666666666666,231.67,231.67]
[null,"MATERIAL (C) - TOTAL",null,null,null,null,null,null,232.45999999999998,232.45999999999998]
[]
[19,"FONTE","CÓDIGO","DESCRIÇÃO","UNIDADE","COEFIC.","CUSTO UNITÁRIO",null,"CUSTO  TOTAL (A) + (B) + (C) + (D) + (E)"]
[null,null,null,null,null,null,"DESONERADO","NÃO DESONER.","DESONERADO","NÃO DESONER."]
[null,"COMPOSIÇÃO","COMP 019_SEE","TAMPÃO LATAO C/ CORRENTE P/ INSTALAÇÃO PREDIAL COMBATE A INCÊNDIO ENGATE RÁPIDO 1 1/2\"","UN ",null,"-","-",55.550000000000004,56.07]
[null,"AGETOP_I",11,"ENCANADOR","h     ",0.15,13.4,15.53,2.0099999999999998,2.33]
[null,"AGETOP_I",8,"AJUDANTE","h     ",0.15,8.1999999999999993,9.51,1.23,1.43]
[null,"MÃO DE OBRA (B) - TOTAL",null,null,null,null,null,null,3.2399999999999998,3.76]
[null,"SINAPI_I",20964,"TAMPAO COM CORRENTE, EM LATAO, ENGATE RAPIDO 1 1/2\", PARA INSTALACAO PREDIAL DE COMBATE A INCENDIO","UN    ",1,52.31,52.31,52.31,52.31]
[null,"MATERIAL (C) - TOTAL",null,null,null,null,null,null,52.31,52.31]
[]
[88,"FONTE","CÓDIGO","DESCRIÇÃO","UNIDADE","COEFIC.","CUSTO UNITÁRIO",null,"CUSTO  TOTAL (A) + (B) + (C) + (D) + (E)"]
[null,null,null,null,null,null,"DESONERADO","NÃO DESONER.","DESONERADO","NÃO DESONER."]
[null,"COMPOSIÇÃO","COMP 088_SEE","TE DE FERRO GALVANIZADO 90º X 2.1/2\" X 1\"","UN ",null,null,null,86.89,89.03]
[null,"AGETOP_I",8,"AJUDANTE","h     ",0.624,8.1999999999999993,9.51,5.12,5.93]
[null,"AGETOP_I",11,"ENCANADOR","h     ",0.624,13.4,15.53,8.36,9.69]
[null,"MÃO DE OBRA (B) - TOTAL",null,null,null,null,null,null,13.48,15.62]
[null,"AGETOP_I","H689","FITA VEDAROSCA 12 MM","m",1.2,0.28000000000000003,0.28000000000000003,0.34,0.34]
[null,"SINAPI_I",6307,"TE DE REDUCAO DE FERRO GALVANIZADO, COM ROSCA BSP, DE 2 1/2\" X 1\"","UN    ",1,73.069999999999993,73.069999999999993,73.069999999999993,73.069999999999993]
[null,"MATERIAL (C) - TOTAL",null,null,null,null,null,null,73.41,73.41]
[]
[30,"FONTE","CÓDIGO","DESCRIÇÃO","UNIDADE","COEFIC.","CUSTO UNITÁRIO",null,"CUSTO  TOTAL (A) + (B) + (C) + (D) + (E)"]
[null,null,null,null,null,null,"DESONERADO","NÃO DESONER.","DESONERADO","NÃO DESONER."]
[null,"COMPOSIÇÃO","COMP 030_SEE","COTOVELO DE FERRO GALV. 90° X 2 1/2\"","UN ",null,null,null,69.16,72.33]
[null,"AGETOP_I",8,"AJUDANTE","h     ",0.92,8.1999999999999993,9.51,7.54,8.75]
[null,"AGETOP_I",11,"ENCANADOR","h     ",0.92,13.4,15.53,12.33,14.29]
[null,"MÃO DE OBRA (B) - TOTAL",null,null,null,null,null,null,19.87,23.04]
[null,"SINAPI_I",3470,"COTOVELO 90 GRAUS DE FERRO GALVANIZADO, COM ROSCA BSP, DE 2 1/2\"","UN    ",1,48.73,48.73,48.73,48.73]
[null,"AGETOP_I","H689","FITA VEDAROSCA 12 MM","m",2,0.28000000000000003,0.28000000000000003,0.56000000000000005,0.56000000000000005]
[null,"MATERIAL (C) - TOTAL",null,null,null,null,null,null,49.29,49.29]
[]
[77,"FONTE","CÓDIGO","DESCRIÇÃO","UNIDADE","COEFIC.","CUSTO UNITÁRIO",null,"CUSTO  TOTAL (A) + (B) + (C) + (D) + (E)"]
[null,null,null,null,null,null,"DESONERADO","NÃO DESONER.","DESONERADO","NÃO DESONER."]
[null,"COMPOSIÇÃO","COMP 077_SEE","UNIAO FERRO GALV C/ASSENTO CONICO BRONZE 2 1/2\"","UN ",null,null,null,148.30000000000001,149.66999999999999]
[null,"AGETOP_I",8,"AJUDANTE","h     ",0.4,8.1999999999999993,9.51,3.28,3.8]
[null,"AGETOP_I",11,"ENCANADOR","h     ",0.4,13.4,15.53,5.36,6.21]
[null,"MÃO DE OBRA (B) - TOTAL",null,null,null,null,null,null,8.64,10.01]
[null,"AGETOP_I","H689","FITA VEDAROSCA 12 MM","m",2.4,0.28000000000000003,0.28000000000000003,0.67,0.67]
[null,"SINAPI_I",12427,"UNIAO COM ASSENTO CONICO DE BRONZE, DIAMETRO 2 1/2\"","UN    ",1,138.99,138.99,138.99,138.99]
[null,"MATERIAL (C) - TOTAL",null,null,null,null,null,null,139.66,139.66]
[]
[76,"FONTE","CÓDIGO","DESCRIÇÃO","UNIDADE","COEFIC.","CUSTO UNITÁRIO",null,"CUSTO  TOTAL (A) + (B) + (C) + (D) + (E)"]
[null,null,null,null,null,null,"DESONERADO","NÃO DESONER.","DESONERADO","NÃO DESONER."]
[null,"COMPOSIÇÃO","COMP 076_SEE","CURVA FERRO GALVANIZADO 45G ROSCA MACHO/FEMEA REF. 2 1/2\"","UN ",null,null,null,116.73,119.9]
[null,"AGETOP_I",8,"AJUDANTE","h     ",0.92,8.1999999999999993,9.51,7.54,8.75]
[null,"AGETOP_I",11,"ENCANADOR","h     ",0.92,13.4,15.53,12.33,14.29]
[null,"MÃO DE OBRA (B) - TOTAL",null,null,null,null,null,null,19.87,23.04]
[null,"SINAPI_I",3148,"FITA VEDA ROSCA EM ROLOS DE 18 MM X 50 M (L X C)","UN    ",4.9099999999999998E-2,14.49,14.49,0.71,0.71]
[null,"SINAPI_I",1784,"CURVA 45 GRAUS DE FERRO GALVANIZADO, COM ROSCA BSP MACHO/FEMEA, DE 2 1/2\"","UN    ",1,96.15,96.15,96.15,96.15]
[null,"MATERIAL (C) - TOTAL",null,null,null,null,null,null,96.86,96.86]
[]
[22,"FONTE","CÓDIGO","DESCRIÇÃO","UNIDADE","COEFIC.","CUSTO UNITÁRIO",null,"CUSTO  TOTAL (A) + (B) + (C) + (D) + (E)"]
[null,null,null,null,null,null,"DESONERADO","NÃO DESONER.","DESONERADO","NÃO DESONER."]
[null,"COMPOSIÇÃO","COMP 022_SEE","TAMPÃO FOFO 40X50CM C/INSCRIÇÃO ","UN ",null,"-","-",199.82999999999998,200.15]
[null,"AGETOP_I",11,"ENCANADOR","h     ",0.15,13.4,15.53,2.0099999999999998,2.33]
[null,"MÃO DE OBRA (B) - TOTAL",null,null,null,null,null,null,2.0099999999999998,2.33]
[null,"SINAPI_I",11293,"TAMPAO FOFO SIMPLES COM BASE, CLASSE A15 CARGA MAX 1,5 T, 400 X 500 MM, COM INSCRICAO INCENDIO","UN    ",1,197.82,197.82,197.82,197.82]
[null,"MATERIAL (C) - TOTAL",null,null,null,null,null,null,197.82,197.82]
[]
[24,"FONTE","CÓDIGO","DESCRIÇÃO","UNIDADE","COEFIC.","CUSTO UNITÁRIO",null,"CUSTO  TOTAL (A) + (B) + (C) + (D) + (E)"]
[null,null,null,null,null,null,"DESONERADO","NÃO DESONER.","DESONERADO","NÃO DESONER."]
[null,"COMPOSIÇÃO","COMP 024_SEE","SINALIZADOR FOTOLUMINESCENTE PARA EXTINTOR","UN ",null,"-","-",25.269999999999996,25.389999999999997]
[null,"AGETOP_I",5,"SERVENTE","h     ",0.09,8.1999999999999993,9.51,0.74,0.86]
[null,"MÃO DE OBRA (B) - TOTAL",null,null,null,null,null,null,0.74,0.86]
[null,"AGETOP_I",3070,"BUCHA DE NYLON S-6","un",2,0.04,0.04,0.08,0.08]
[null,"AGETOP_I",3393,"PARAFUSO P/BUCHA S-6","un",2,0.08,0.08,0.16,0.16]
[null,"SINAPI_I",37556,"PLACA DE SINALIZACAO DE SEGURANCA CONTRA INCENDIO, FOTOLUMINESCENTE, QUADRADA, *20 X 20* CM, EM PVC *2* MM ANTI-CHAMAS (SIMBOLOS, CORES E PICTOGRAMAS CONFORME NBR 13434)","UN    ",1,24.29,24.29,24.29,24.29]
[null,"MATERIAL (C) - TOTAL",null,null,null,null,null,null,24.529999999999998,24.529999999999998]
[]
[186,"FONTE","CÓDIGO","DESCRIÇÃO","UNIDADE","COEFIC.","CUSTO UNITÁRIO",null,"CUSTO  TOTAL (A) + (B) + (C) + (D) + (E)"]
[null,null,null,null,null,null,"DESONERADO","NÃO DESONER.","DESONERADO","NÃO DESONER."]
[null,"COMPOSIÇÃO","COMP 186_SEE","BOTOEIRA BOMBA DE INCÊNDIO C/ MARTELO CONVENCIONAL/ ANALÓGICA","UN ",null,null,null,85.1,88.539999999999992]
[null,"AGETOP_I",8,"AJUDANTE","h     ",1,8.1999999999999993,9.51,8.1999999999999993,9.51]
[null,"AGETOP_I",12,"ELETRICISTA","h     ",1,13.4,15.53,13.4,15.53]
[null,"MÃO DE OBRA (B) - TOTAL",null,null,null,null,null,null,21.6,25.04]
[null,"COTAÇÃO","COT 088_SEE","BOTOEIRA BOMBA DE INCÊNDIO C/ MARTELO CONVENCIONAL/ ANALÓGICA","UN",1,63.5,63.5,63.5,63.5]
[null,"MATERIAL (C) - TOTAL",null,null,null,null,null,null,63.5,63.5]
[]
[188,"FONTE","CÓDIGO","DESCRIÇÃO","UNIDADE","COEFIC.","CUSTO UNITÁRIO",null,"CUSTO  TOTAL (A) + (B) + (C) + (D) + (E)"]
[null,null,null,null,null,null,"DESONERADO","NÃO DESONER.","DESONERADO","NÃO DESONER."]
[null,"COMPOSIÇÃO","COMP 188_SEE","ACIONADOR MANUAL DE ALARME","UN ",null,null,null,100.61,103.36]
[null,"AGETOP_I",8,"AJUDANTE","h     ",0.8,8.1999999999999993,9.51,6.56,7.61]
[null,"AGETOP_I",12,"ELETRICISTA","h     ",0.8,13.4,15.53,10.72,12.42]
[null,"MÃO DE OBRA (B) - TOTAL",null,null,null,null,null,null,17.28,20.03]
[null,"COTAÇÃO","COT 090_SEE","ACIONADOR MANUAL DE ALARME","UN",1,83.333333333333329,83.333333333333329,83.33,83.33]
[null,"MATERIAL (C) - TOTAL",null,null,null,null,null,null,83.33,83.33]
[]
[190,"FONTE","CÓDIGO","DESCRIÇÃO","UNIDADE","COEFIC.","CUSTO UNITÁRIO",null,"CUSTO  TOTAL (A) + (B) + (C) + (D) + (E)"]
[null,null,null,null,null,null,"DESONERADO","NÃO DESONER.","DESONERADO","NÃO DESONER."]
[null,"COMPOSIÇÃO","COMP 190_SEE","CENTRAL DE DETECÇÃO E ALARME DE 40 SETORES COM BATERIA","UN ",null,null,null,1136.1300000000001,1163.6500000000001]
[null,"AGETOP_I",8,"AJUDANTE","h     ",8,8.1999999999999993,9.51,65.599999999999994,76.08]
[null,"AGETOP_I",12,"ELETRICISTA","h     ",8,13.4,15.53,107.2,124.24]
[null,"MÃO DE OBRA (B) - TOTAL",null,null,null,null,null,null,172.8,200.32]
[null,"COTAÇÃO","COT 092_SEE","CENTRAL DE DETECÇÃO E ALARME DE 40 SETORES COM BATERIA (PREÇO MÉDIO)","UN",1,963.33333333333337,963.33333333333337,963.33,963.33]
[null,"MATERIAL (C) - TOTAL",null,null,null,null,null,null,963.33,963.33]
[]
[25,"FONTE","CÓDIGO","DESCRIÇÃO","UNIDADE","COEFIC.","CUSTO UNITÁRIO",null,"CUSTO  TOTAL (A) + (B) + (C) + (D) + (E)"]
[null,null,null,null,null,null,"DESONERADO","NÃO DESONER.","DESONERADO","NÃO DESONER."]
[null,"COMPOSIÇÃO","COMP 025_SEE","SINALIZADOR FOTOLUMINESCENTE DE EMERGÊNCIA","UN ",null,"-","-",25.269999999999996,25.389999999999997]
[null,"AGETOP_I",5,"SERVENTE","h     ",0.09,8.1999999999999993,9.51,0.74,0.86]
[null,"MÃO DE OBRA (B) - TOTAL",null,null,null,null,null,null,0.74,0.86]
[null,"AGETOP_I",3070,"BUCHA DE NYLON S-6","un",2,0.04,0.04,0.08,0.08]
[null,"AGETOP_I",3393,"PARAFUSO P/BUCHA S-6","un",2,0.08,0.08,0.16,0.16]
[null,"SINAPI_I",37556,"PLACA DE SINALIZACAO DE SEGURANCA CONTRA INCENDIO, FOTOLUMINESCENTE, QUADRADA, *20 X 20* CM, EM PVC *2* MM ANTI-CHAMAS (SIMBOLOS, CORES E PICTOGRAMAS CONFORME NBR 13434)","UN    ",1,24.29,24.29,24.29,24.29]
[null,"MATERIAL (C) - TOTAL",null,null,null,null,null,null,24.529999999999998,24.529999999999998]
[]
[277,"FONTE","CÓDIGO","DESCRIÇÃO","UNIDADE","COEFIC.","CUSTO UNITÁRIO",null,"CUSTO  TOTAL (A) + (B) + (C) + (D) + (E)"]
[null,null,null,null,null,null,"DESONERADO","NÃO DESONER.","DESONERADO","NÃO DESONER."]
[null,"COMPOSIÇÃO","COMP 277_SEE","MARCAÇÃO NO PISO - 1X1 M PARA EXTINTOR","M2",null,null,null,29.52,29.599999999999998]
[null,"AGETOP_I",5,"SERVENTE","h     ",3.3300000000000003E-2,8.1999999999999993,9.51,0.27,0.32]
[null,"MÃO DE OBRA (B) - TOTAL",null,null,null,null,null,null,0.27,0.32]
[null,"SINAPI_I",5318,"SOLVENTE DILUENTE A BASE DE AGUARRAS","L     ",0.13,11,11,1.43,1.43]
[null,"SINAPI",5824,"CAMINHÃO TOCO, PBT 16.000 KG, CARGA ÚTIL MÁX. 10.685 KG, DIST. ENTRE EIXOS 4,8 M, POTÊNCIA 189 CV, INCLUSIVE CARROCERIA FIXA ABERTA DE MADEIRA P/ TRANSPORTE GERAL DE CARGA SECA, DIMEN. APROX. 2,5 X 7,00 X 0,50 M - CHP DIURNO. AF_06/2014","CHP",3.3E-3,122.72,125.93,0.4,0.42]
[null,"SINAPI_I",7343,"TINTA A BASE DE RESINA ACRILICA, PARA SINALIZACAO HORIZONTAL VIARIA (NBR 11862)","L     ",0.6,12.55,12.55,7.53,7.53]
[null,"SINAPI_I",7348,"TINTA ACRILICA PREMIUM PARA PISO","L     ",0.03,13,13,0.39,0.39]
[null,"SINAPI_I",25972,"MICROESFERAS DE VIDRO PARA SINALIZACAO HORIZONTAL VIARIA, TIPO I-B (PREMIX) - NBR 16184","KG    ",2.14,8.94,8.94,19.13,19.13]
[null,"SINAPI",95133,"MÁQUINA DEMARCADORA DE FAIXA DE TRÁFEGO À FRIO, AUTOPROPELIDA, POTÊNCIA 38 HP - CHP DIURNO. AF_07/2016","CHP",3.3E-3,111.93,115.51,0.37,0.38]
[null,"MATERIAL (C) - TOTAL",null,null,null,null,null,null,29.25,29.279999999999998]
[]
[80,"FONTE","CÓDIGO","DESCRIÇÃO","UNIDADE","COEFIC.","CUSTO UNITÁRIO",null,"CUSTO  TOTAL (A) + (B) + (C) + (D) + (E)"]
[null,null,null,null,null,null,"DESONERADO","NÃO DESONER.","DESONERADO","NÃO DESONER."]
[null,"COMPOSIÇÃO","COMP 080_SEE","BUCHA REDUCAO FERRO GALV ROSCA REF. 2 1/2\"X1\"","UN ",null,null,null,30.39,31.35]
[null,"AGETOP_I",8,"AJUDANTE","h     ",0.28000000000000003,8.1999999999999993,9.51,2.2999999999999998,2.66]
[null,"AGETOP_I",11,"ENCANADOR","h     ",0.28000000000000003,13.4,15.53,3.75,4.3499999999999996]
[null,"MÃO DE OBRA (B) - TOTAL",null,null,null,null,null,null,6.05,7.01]
[null,"SINAPI_I",3148,"FITA VEDA ROSCA EM ROLOS DE 18 MM X 50 M (L X C)","UN    ",2.4500000000000001E-2,14.49,14.49,0.36,0.36]
[null,"SINAPI_I",773,"BUCHA DE REDUCAO DE FERRO GALVANIZADO, COM ROSCA BSP, DE 2 1/2\" X 1\"","UN    ",1,23.98,23.98,23.98,23.98]
[null,"MATERIAL (C) - TOTAL",null,null,null,null,null,null,24.34,24.34]
[]
[89,"FONTE","CÓDIGO","DESCRIÇÃO","UNIDADE","COEFIC.","CUSTO UNITÁRIO",null,"CUSTO  TOTAL (A) + (B) + (C) + (D) + (E)"]
[null,null,null,null,null,null,"DESONERADO","NÃO DESONER.","DESONERADO","NÃO DESONER."]
[null,"COMPOSIÇÃO","COMP 089_SEE","TE DE REDUCAO 90 GRAUS SOLDAVEL 60 X 50 MM","UN ",null,null,null,69.539999999999992,70.75]
[null,"AGETOP_I",8,"AJUDANTE","h     ",0.35,8.1999999999999993,9.51,2.87,3.33]
[null,"AGETOP_I",11,"ENCANADOR","h     ",0.35,13.4,15.53,4.6900000000000004,5.44]
[null,"MÃO DE OBRA (B) - TOTAL",null,null,null,null,null,null,7.5600000000000005,8.77]
[null,"COTAÇÃO","COT 018_SEE","TE DE REDUCAO 90 GRAUS SOLDAVEL 60 X 50 MM","UN ",1,61.980000000000004,61.980000000000004,61.98,61.98]
[null,"MATERIAL (C) - TOTAL",null,null,null,null,null,null,61.98,61.98]
[]
[382,"FONTE","CÓDIGO","DESCRIÇÃO","UNIDADE","COEFIC.","CUSTO UNITÁRIO",null,"CUSTO  TOTAL (A) + (B) + (C) + (D) + (E)"]
[null,null,null,null,null,null,"DESONERADO","NÃO DESONER.","DESONERADO","NÃO DESONER."]
[null,"COMPOSIÇÃO","COMP 382_SEE","TE DE REDUCAO DE FERRO GALVANIZADO, COM ROSCA BSP, DE 3/4\" X 1/2\"","UN ",null,null,null,21.93,24.020000000000003]
[null,"AGETOP_I",8,"AJUDANTE","h     ",0.6,8.1999999999999993,9.51,4.92,5.71]
[null,"AGETOP_I",11,"ENCANADOR","h     ",0.61050000000000004,13.4,15.53,8.18,9.48]
[null,"MÃO DE OBRA (B) - TOTAL",null,null,null,null,null,null,13.1,15.190000000000001]
[null,"SINAPI_I",3146,"FITA VEDA ROSCA EM ROLOS DE 18 MM X 10 M (L X C)","UN    ",0.12075471698113208,3.93,3.93,0.47,0.47]
[null,"SINAPI_I",6302,"TE DE REDUCAO DE FERRO GALVANIZADO, COM ROSCA BSP, DE 3/4\" X 1/2\"","UN    ",1,8.36,8.36,8.36,8.36]
[null,"MATERIAL (C) - TOTAL",null,null,null,null,null,null,8.83,8.83]
[]
[383,"FONTE","CÓDIGO","DESCRIÇÃO","UNIDADE","COEFIC.","CUSTO UNITÁRIO",null,"CUSTO  TOTAL (A) + (B) + (C) + (D) + (E)"]
[null,null,null,null,null,null,"DESONERADO","NÃO DESONER.","DESONERADO","NÃO DESONER."]
[null,"COMPOSIÇÃO","COMP 383_SEE","BUCHA DE REDUCAO DE FERRO GALVANIZADO, COM ROSCA BSP, DE 1/2\" X 1/4\"","UN ",null,null,null,6.87,7.42]
[null,"AGETOP_I",8,"AJUDANTE","h     ",0.16,8.1999999999999993,9.51,1.31,1.52]
[null,"AGETOP_I",11,"ENCANADOR","h     ",0.16,13.4,15.53,2.14,2.48]
[null,"MÃO DE OBRA (B) - TOTAL",null,null,null,null,null,null,3.45,4]
[null,"AGETOP_I","H689","FITA VEDAROSCA 12 MM","m",1.2,0.28000000000000003,0.28000000000000003,0.34,0.34]
[null,"SINAPI_I",770,"BUCHA DE REDUCAO DE FERRO GALVANIZADO, COM ROSCA BSP, DE 1/2\" X 1/4\"","UN    ",1,3.08,3.08,3.08,3.08]
[null,"MATERIAL (C) - TOTAL",null,null,null,null,null,null,3.42,3.42]
[]
[212,"FONTE","CÓDIGO","DESCRIÇÃO","UNIDADE","COEFIC.","CUSTO UNITÁRIO",null,"CUSTO  TOTAL (A) + (B) + (C) + (D) + (E)"]
[null,null,null,null,null,null,"DESONERADO","NÃO DESONER.","DESONERADO","NÃO DESONER."]
[null,"COMPOSIÇÃO","COMP 212_SEE","NIPLE DE REDUÇÃO 1/2\" X 1/4\" BSP","UN ",null,null,null,9.5,10.050000000000001]
[null,"AGETOP_I",8,"AJUDANTE","h     ",0.16,8.1999999999999993,9.51,1.31,1.52]
[null,"AGETOP_I",11,"ENCANADOR","h     ",0.16,13.4,15.53,2.14,2.48]
[null,"MÃO DE OBRA (B) - TOTAL",null,null,null,null,null,null,3.45,4]
[null,"COTAÇÃO","COT 103_SEE","NIPLE DE REDUÇÃO 1/2\" X 1/4\" BSP","UN",1,6.0533333333333337,6.0533333333333337,6.05,6.05]
[null,"MATERIAL (C) - TOTAL",null,null,null,null,null,null,6.05,6.05]
[]
[213,"FONTE","CÓDIGO","DESCRIÇÃO","UNIDADE","COEFIC.","CUSTO UNITÁRIO",null,"CUSTO  TOTAL (A) + (B) + (C) + (D) + (E)"]
[null,null,null,null,null,null,"DESONERADO","NÃO DESONER.","DESONERADO","NÃO DESONER."]
[null,"COMPOSIÇÃO","COMP 213_SEE","NIPLE DE REDUÇÃO 3/4\" X 1/2\" BSP","UN ",null,null,null,13.16,13.71]
[null,"AGETOP_I",8,"AJUDANTE","h     ",0.16,8.1999999999999993,9.51,1.31,1.52]
[null,"AGETOP_I",11,"ENCANADOR","h     ",0.16,13.4,15.53,2.14,2.48]
[null,"MÃO DE OBRA (B) - TOTAL",null,null,null,null,null,null,3.45,4]
[null,"COTAÇÃO","COT 104_SEE","NIPLE DE REDUÇÃO 3/4\" X 1/2\" BSP","UN",1,9.7099999999999991,9.7099999999999991,9.7100000000000009,9.7100000000000009]
[null,"MATERIAL (C) - TOTAL",null,null,null,null,null,null,9.7100000000000009,9.7100000000000009]
[]
[237,"FONTE","CÓDIGO","DESCRIÇÃO","UNIDADE","COEFIC.","CUSTO UNITÁRIO",null,"CUSTO  TOTAL (A) + (B) + (C) + (D) + (E)"]
[null,null,null,null,null,null,"DESONERADO","NÃO DESONER.","DESONERADO","NÃO DESONER."]
[null,"COMPOSIÇÃO","COMP 237_SEE","FITA ANTICORROSIVA","M",null,null,null,11.97,12.66]
[null,"AGETOP_I",8,"AJUDANTE","h     ",0.2,8.1999999999999993,9.51,1.64,1.9]
[null,"AGETOP_I",12,"ELETRICISTA","h     ",0.2,13.4,15.53,2.68,3.11]
[null,"MÃO DE OBRA (B) - TOTAL",null,null,null,null,null,null,4.32,5.01]
[null,"SINAPI_I",39634,"FITA ADESIVA ANTICORROSIVA DE PVC FLEXIVEL, COR PRETA, PARA PROTECAO TUBULACAO, 50 MM X 30 M (L X C), E= *0,25* MM","M     ",1,7.65,7.65,7.65,7.65]
[null,"MATERIAL (C) - TOTAL",null,null,null,null,null,null,7.65,7.65]
[]
[542,"FONTE","CÓDIGO","DESCRIÇÃO","UNIDADE","COEFIC.","CUSTO UNITÁRIO",null,"CUSTO  TOTAL (A) + (B) + (C) + (D) + (E)"]
[null,null,null,null,null,null,"DESONERADO","NÃO DESONER.","DESONERADO","NÃO DESONER."]
[null,"COMPOSIÇÃO","COMP 542_SEE","VÁLVULA UGV 3/4\" (S) LATÃO","UN ",null,null,null,25.17,26.66]
[null,"AGETOP_I",8,"AJUDANTE","h     ",0.432,8.1999999999999993,9.51,3.54,4.1100000000000003]
[null,"AGETOP_I",11,"ENCANADOR","h     ",0.432,13.4,15.53,5.79,6.71]
[null,"MÃO DE OBRA (B) - TOTAL",null,null,null,null,null,null,9.33,10.82]
[null,"COTAÇÃO","COT 281_SEE","VÁLVULA UGV 3/4\" (S) LATÃO","UN ",1,15.836666666666666,15.836666666666666,15.84,15.84]
[null,"MATERIAL (C) - TOTAL",null,null,null,null,null,null,15.84,15.84]
[]
[543,"FONTE","CÓDIGO","DESCRIÇÃO","UNIDADE","COEFIC.","CUSTO UNITÁRIO",null,"CUSTO  TOTAL (A) + (B) + (C) + (D) + (E)"]
[null,null,null,null,null,null,"DESONERADO","NÃO DESONER.","DESONERADO","NÃO DESONER."]
[null,"COMPOSIÇÃO","COMP 543_SEE","VÁLVULA UGV 1/2\" (S) LATÃO","UN ",null,null,null,24.5,25.990000000000002]
[null,"AGETOP_I",8,"AJUDANTE","h     ",0.432,8.1999999999999993,9.51,3.54,4.1100000000000003]
[null,"AGETOP_I",11,"ENCANADOR","h     ",0.432,13.4,15.53,5.79,6.71]
[null,"MÃO DE OBRA (B) - TOTAL",null,null,null,null,null,null,9.33,10.82]
[null,"COTAÇÃO","COT 282_SEE","VÁLVULA UGV 1/2\" (S) LATÃO","UN ",1,15.166666666666666,15.166666666666666,15.17,15.17]
[null,"MATERIAL (C) - TOTAL",null,null,null,null,null,null,15.17,15.17]
[]
[211,"FONTE","CÓDIGO","DESCRIÇÃO","UNIDADE","COEFIC.","CUSTO UNITÁRIO",null,"CUSTO  TOTAL (A) + (B) + (C) + (D) + (E)"]
[null,null,null,null,null,null,"DESONERADO","NÃO DESONER.","DESONERADO","NÃO DESONER."]
[null,"COMPOSIÇÃO","COMP 211_SEE","REGULADOR DE 2º ESTÁGIO 5KG/H","UN ",null,null,null,85.46,89.419999999999987]
[null,"AGETOP_I",8,"AJUDANTE","h     ",1.1499999999999999,8.1999999999999993,9.51,9.43,10.94]
[null,"AGETOP_I",11,"ENCANADOR","h     ",1.1499999999999999,13.4,15.53,15.41,17.86]
[null,"MÃO DE OBRA (B) - TOTAL",null,null,null,null,null,null,24.84,28.799999999999997]
[null,"COTAÇÃO","COT 102_SEE","REGULADOR DE 2º ESTÁGIO 5KG/H","UN",1,59.833333333333336,59.833333333333336,59.83,59.83]
[null,"AGETOP_I","H689","FITA VEDAROSCA 12 MM","m",2.82,0.28000000000000003,0.28000000000000003,0.79,0.79]
[null,"MATERIAL (C) - TOTAL",null,null,null,null,null,null,60.62,60.62]
[]
[210,"FONTE","CÓDIGO","DESCRIÇÃO","UNIDADE","COEFIC.","CUSTO UNITÁRIO",null,"CUSTO  TOTAL (A) + (B) + (C) + (D) + (E)"]
[null,null,null,null,null,null,"DESONERADO","NÃO DESONER.","DESONERADO","NÃO DESONER."]
[null,"COMPOSIÇÃO","COMP 210_SEE","REGULADOR DE 1º ESTÁGIO 60KG/H MODELO AP-40  COM MANÔMETRO","UN ",null,null,null,231.21,235.17000000000002]
[null,"AGETOP_I",8,"AJUDANTE","h     ",1.1499999999999999,8.1999999999999993,9.51,9.43,10.94]
[null,"AGETOP_I",11,"ENCANADOR","h     ",1.1499999999999999,13.4,15.53,15.41,17.86]
[null,"MÃO DE OBRA (B) - TOTAL",null,null,null,null,null,null,24.84,28.799999999999997]
[null,"COTAÇÃO","COT 101_SEE","REGULADOR DE 1º ESTÁGIO 60KG/H MODELO AP-40  COM MANÔMETRO","UN",1,205.57666666666668,205.57666666666668,205.58,205.58]
[null,"AGETOP_I","H689","FITA VEDAROSCA 12 MM","m",2.82,0.28000000000000003,0.28000000000000003,0.79,0.79]
[null,"MATERIAL (C) - TOTAL",null,null,null,null,null,null,206.37,206.37]
[]
[235,"FONTE","CÓDIGO","DESCRIÇÃO","UNIDADE","COEFIC.","CUSTO UNITÁRIO",null,"CUSTO  TOTAL (A) + (B) + (C) + (D) + (E)"]
[null,null,null,null,null,null,"DESONERADO","NÃO DESONER.","DESONERADO","NÃO DESONER."]
[null,"COMPOSIÇÃO","COMP 235_SEE","PLACA DE SINALIZAÇÃO EM PVC COD 01 - (300X300) PROIBIDO FUMAR","UN ",null,null,null,25.269999999999996,25.389999999999997]
[null,"AGETOP_I",5,"SERVENTE","h     ",0.09,8.1999999999999993,9.51,0.74,0.86]
[null,"MÃO DE OBRA (B) - TOTAL",null,null,null,null,null,null,0.74,0.86]
[null,"AGETOP_I",3070,"BUCHA DE NYLON S-6","un",2,0.04,0.04,0.08,0.08]
[null,"AGETOP_I",3393,"PARAFUSO P/BUCHA S-6","un",2,0.08,0.08,0.16,0.16]
[null,"SINAPI_I",37556,"PLACA DE SINALIZACAO DE SEGURANCA CONTRA INCENDIO, FOTOLUMINESCENTE, QUADRADA, *20 X 20* CM, EM PVC *2* MM ANTI-CHAMAS (SIMBOLOS, CORES E PICTOGRAMAS CONFORME NBR 13434)","UN    ",1,24.29,24.29,24.29,24.29]
[null,"MATERIAL (C) - TOTAL",null,null,null,null,null,null,24.529999999999998,24.529999999999998]
[]
[236,"FONTE","CÓDIGO","DESCRIÇÃO","UNIDADE","COEFIC.","CUSTO UNITÁRIO",null,"CUSTO  TOTAL (A) + (B) + (C) + (D) + (E)"]
[null,null,null,null,null,null,"DESONERADO","NÃO DESONER.","DESONERADO","NÃO DESONER."]
[null,"COMPOSIÇÃO","COMP 236_SEE","PLACA DE SINALIZAÇÃO EM PVC COD 06 - (300X300) PERIGO INFLAMÁVEL","UN ",null,null,null,25.269999999999996,25.389999999999997]
[null,"AGETOP_I",5,"SERVENTE","h     ",0.09,8.1999999999999993,9.51,0.74,0.86]
[null,"MÃO DE OBRA (B) - TOTAL",null,null,null,null,null,null,0.74,0.86]
[null,"AGETOP_I",3070,"BUCHA DE NYLON S-6","un",2,0.04,0.04,0.08,0.08]
[null,"AGETOP_I",3393,"PARAFUSO P/BUCHA S-6","un",2,0.08,0.08,0.16,0.16]
[null,"SINAPI_I",37556,"PLACA DE SINALIZACAO DE SEGURANCA CONTRA INCENDIO, FOTOLUMINESCENTE, QUADRADA, *20 X 20* CM, EM PVC *2* MM ANTI-CHAMAS (SIMBOLOS, CORES E PICTOGRAMAS CONFORME NBR 13434)","UN    ",1,24.29,24.29,24.29,24.29]
[null,"MATERIAL (C) - TOTAL",null,null,null,null,null,null,24.529999999999998,24.529999999999998]
[]
[387,"FONTE","CÓDIGO","DESCRIÇÃO","UNIDADE","COEFIC.","CUSTO UNITÁRIO",null,"CUSTO  TOTAL (A) + (B) + (C) + (D) + (E)"]
[null,null,null,null,null,null,"DESONERADO","NÃO DESONER.","DESONERADO","NÃO DESONER."]
[null,"COMPOSIÇÃO","COMP 387_SEE","LÂMPADA LED TUBULAR 18W ","UN ",null,null,null,22.28,22.330000000000002]
[null,"AGETOP_I",8,"AJUDANTE","h     ",1.4999999999999999E-2,8.1999999999999993,9.51,0.12,0.14000000000000001]
[null,"AGETOP_I",12,"ELETRICISTA","h     ",1.4999999999999999E-2,13.4,15.53,0.2,0.23]
[null,"MÃO DE OBRA (B) - TOTAL",null,null,null,null,null,null,0.32,0.37]
[null,"COTAÇÃO","COT 195_SEE","LÂMPADA LED TUBULAR 18W ","UN",1,21.959999999999997,21.959999999999997,21.96,21.96]
[null,"MATERIAL (C) - TOTAL",null,null,null,null,null,null,21.96,21.96]
[]
[36,"FONTE","CÓDIGO","DESCRIÇÃO","UNIDADE","COEFIC.","CUSTO UNITÁRIO",null,"CUSTO  TOTAL (A) + (B) + (C) + (D) + (E)"]
[null,null,null,null,null,null,"DESONERADO","NÃO DESONER.","DESONERADO","NÃO DESONER."]
[null,"COMPOSIÇÃO","COMP 036_SEE","PRESILHA LATÃO 16/35MM 5MM+PARAF FENDA ","UN ",null,null,null,3.3900000000000006,3.67]
[null,"AGETOP_I",8,"AJUDANTE","h     ",8.3299999999999999E-2,8.1999999999999993,9.51,0.68,0.79]
[null,"AGETOP_I",12,"ELETRICISTA","h     ",8.3299999999999999E-2,13.4,15.53,1.1200000000000001,1.29]
[null,"MÃO DE OBRA (B) - TOTAL",null,null,null,null,null,null,1.8000000000000003,2.08]
[null,"COTAÇÃO","COT 004_SEE","PRESILHA LATÃO 16/35MM 5MM+PARAF FENDA 1/4''X1.1/4''","UN ",1,1.5933333333333335,1.5933333333333335,1.59,1.59]
[null,"MATERIAL (C) - TOTAL",null,null,null,null,null,null,1.59,1.59]
[]
[39,"FONTE","CÓDIGO","DESCRIÇÃO","UNIDADE","COEFIC.","CUSTO UNITÁRIO",null,"CUSTO  TOTAL (A) + (B) + (C) + (D) + (E)"]
[null,null,null,null,null,null,"DESONERADO","NÃO DESONER.","DESONERADO","NÃO DESONER."]
[null,"COMPOSIÇÃO","COMP 039_SEE","MOLDE GRAF CGT 5/8 50MM C","UN ",null,null,null,139.44,139.56]
[null,"AGETOP_I",8,"AJUDANTE","h     ",3.3300000000000003E-2,8.1999999999999993,9.51,0.27,0.32]
[null,"AGETOP_I",12,"ELETRICISTA","h     ",3.3300000000000003E-2,13.4,15.53,0.45,0.52]
[null,"MÃO DE OBRA (B) - TOTAL",null,null,null,null,null,null,0.72,0.84000000000000008]
[null,"COTAÇÃO","COT 007_SEE","MOLDE GRAF CGT 5/8 50MM C","UN",1,138.7175,138.7175,138.72,138.72]
[null,"MATERIAL (C) - TOTAL",null,null,null,null,null,null,138.72,138.72]
[]
[550,"FONTE","CÓDIGO","DESCRIÇÃO","UNID ","COEFIC.","CUSTO UNITÁRIO",null,"CUSTO  TOTAL (A) + (B) + (C) + (D) + (E)"]
[null,null,null,null,null,null,"DESONERADO","NÃO DESONER.","DESONERADO","NÃO DESONER."]
[null,"COMPOSIÇÃO","COMP 550_SEE","ALIC P/MOLDE C-84","UN ","-","-","-",88.19,88.31]
[null,"AGETOP_I",8,"AJUDANTE","h     ",3.3300000000000003E-2,8.1999999999999993,9.51,0.27,0.32]
[null,"AGETOP_I",12,"ELETRICISTA","h     ",3.3300000000000003E-2,13.4,15.53,0.45,0.52]
[null,"MÃO DE OBRA (B) - TOTAL",null,null,null,null,null,null,0.72,0.84000000000000008]
[null,"COTAÇÃO","COT 292_SEE","ALIC P/MOLDE C-84","UN ",1,87.465000000000003,87.465000000000003,87.47,87.47]
[null,"MATERIAL (C) - TOTAL",null,null,null,null,null,null,87.47,87.47]
[]
[48,"FONTE","CÓDIGO","DESCRIÇÃO","UNIDADE","COEFIC.","CUSTO UNITÁRIO",null,"CUSTO  TOTAL (A) + (B) + (C) + (D) + (E)"]
[null,null,null,null,null,null,"DESONERADO","NÃO DESONER.","DESONERADO","NÃO DESONER."]
[null,"COMPOSIÇÃO","COMP 048_SEE","HASTE ROSQUEADA \"TIRANTE\" 3/8\"","M",null,null,null,14.02,15.39]
[null,"AGETOP_I",8,"AJUDANTE","h     ",0.4,8.1999999999999993,9.51,3.28,3.8]
[null,"AGETOP_I",12,"ELETRICISTA","h     ",0.4,13.4,15.53,5.36,6.21]
[null,"MÃO DE OBRA (B) - TOTAL",null,null,null,null,null,null,8.64,10.01]
[null,"COTAÇÃO","COT 012_SEE","HASTE ROSQUEADA \"TIRANTE\" 3/8\"","M",1,5.3833333333333329,5.3833333333333329,5.38,5.38]
[null,"MATERIAL (C) - TOTAL",null,null,null,null,null,null,5.38,5.38]
[]
[24,"FONTE","CÓDIGO","DESCRIÇÃO","UNIDADE","COEFIC.","CUSTO UNITÁRIO",null,"CUSTO  TOTAL (A) + (B) + (C) + (D) + (E)"]
[null,null,null,null,null,null,"DESONERADO","NÃO DESONER.","DESONERADO","NÃO DESONER."]
[null,"COMPOSIÇÃO","COMP 024_SEE","SINALIZADOR FOTOLUMINESCENTE PARA EXTINTOR","UN ",null,"-","-",25.269999999999996,25.389999999999997]
[null,"AGETOP_I",5,"SERVENTE","h     ",0.09,8.1999999999999993,9.51,0.74,0.86]
[null,"MÃO DE OBRA (B) - TOTAL",null,null,null,null,null,null,0.74,0.86]
[null,"AGETOP_I",3070,"BUCHA DE NYLON S-6","un",2,0.04,0.04,0.08,0.08]
[null,"AGETOP_I",3393,"PARAFUSO P/BUCHA S-6","un",2,0.08,0.08,0.16,0.16]
[null,"SINAPI_I",37556,"PLACA DE SINALIZACAO DE SEGURANCA CONTRA INCENDIO, FOTOLUMINESCENTE, QUADRADA, *20 X 20* CM, EM PVC *2* MM ANTI-CHAMAS (SIMBOLOS, CORES E PICTOGRAMAS CONFORME NBR 13434)","UN    ",1,24.29,24.29,24.29,24.29]
[null,"MATERIAL (C) - TOTAL",null,null,null,null,null,null,24.529999999999998,24.529999999999998]
[]
[25,"FONTE","CÓDIGO","DESCRIÇÃO","UNIDADE","COEFIC.","CUSTO UNITÁRIO",null,"CUSTO  TOTAL (A) + (B) + (C) + (D) + (E)"]
[null,null,null,null,null,null,"DESONERADO","NÃO DESONER.","DESONERADO","NÃO DESONER."]
[null,"COMPOSIÇÃO","COMP 025_SEE","SINALIZADOR FOTOLUMINESCENTE DE EMERGÊNCIA","UN ",null,"-","-",25.269999999999996,25.389999999999997]
[null,"AGETOP_I",5,"SERVENTE","h     ",0.09,8.1999999999999993,9.51,0.74,0.86]
[null,"MÃO DE OBRA (B) - TOTAL",null,null,null,null,null,null,0.74,0.86]
[null,"AGETOP_I",3070,"BUCHA DE NYLON S-6","un",2,0.04,0.04,0.08,0.08]
[null,"AGETOP_I",3393,"PARAFUSO P/BUCHA S-6","un",2,0.08,0.08,0.16,0.16]
[null,"SINAPI_I",37556,"PLACA DE SINALIZACAO DE SEGURANCA CONTRA INCENDIO, FOTOLUMINESCENTE, QUADRADA, *20 X 20* CM, EM PVC *2* MM ANTI-CHAMAS (SIMBOLOS, CORES E PICTOGRAMAS CONFORME NBR 13434)","UN    ",1,24.29,24.29,24.29,24.29]
[null,"MATERIAL (C) - TOTAL",null,null,null,null,null,null,24.529999999999998,24.529999999999998]
[]
[277,"FONTE","CÓDIGO","DESCRIÇÃO","UNIDADE","COEFIC.","CUSTO UNITÁRIO",null,"CUSTO  TOTAL (A) + (B) + (C) + (D) + (E)"]
[null,null,null,null,null,null,"DESONERADO","NÃO DESONER.","DESONERADO","NÃO DESONER."]
[null,"COMPOSIÇÃO","COMP 277_SEE","MARCAÇÃO NO PISO - 1X1 M PARA EXTINTOR","M2",null,null,null,29.52,29.599999999999998]
[null,"AGETOP_I",5,"SERVENTE","h     ",3.3300000000000003E-2,8.1999999999999993,9.51,0.27,0.32]
[null,"MÃO DE OBRA (B) - TOTAL",null,null,null,null,null,null,0.27,0.32]
[null,"SINAPI_I",5318,"SOLVENTE DILUENTE A BASE DE AGUARRAS","L     ",0.13,11,11,1.43,1.43]
[null,"SINAPI",5824,"CAMINHÃO TOCO, PBT 16.000 KG, CARGA ÚTIL MÁX. 10.685 KG, DIST. ENTRE EIXOS 4,8 M, POTÊNCIA 189 CV, INCLUSIVE CARROCERIA FIXA ABERTA DE MADEIRA P/ TRANSPORTE GERAL DE CARGA SECA, DIMEN. APROX. 2,5 X 7,00 X 0,50 M - CHP DIURNO. AF_06/2014","CHP",3.3E-3,122.72,125.93,0.4,0.42]
[null,"SINAPI_I",7343,"TINTA A BASE DE RESINA ACRILICA, PARA SINALIZACAO HORIZONTAL VIARIA (NBR 11862)","L     ",0.6,12.55,12.55,7.53,7.53]
[null,"SINAPI_I",7348,"TINTA ACRILICA PREMIUM PARA PISO","L     ",0.03,13,13,0.39,0.39]
[null,"SINAPI_I",25972,"MICROESFERAS DE VIDRO PARA SINALIZACAO HORIZONTAL VIARIA, TIPO I-B (PREMIX) - NBR 16184","KG    ",2.14,8.94,8.94,19.13,19.13]
[null,"SINAPI",95133,"MÁQUINA DEMARCADORA DE FAIXA DE TRÁFEGO À FRIO, AUTOPROPELIDA, POTÊNCIA 38 HP - CHP DIURNO. AF_07/2016","CHP",3.3E-3,111.93,115.51,0.37,0.38]
[null,"MATERIAL (C) - TOTAL",null,null,null,null,null,null,29.25,29.279999999999998]
[]
[412,"FONTE","CÓDIGO","DESCRIÇÃO","UNIDADE","COEFIC.","CUSTO UNITÁRIO",null,"CUSTO  TOTAL (A) + (B) + (C) + (D) + (E)"]
[null,null,null,null,null,null,"DESONERADO","NÃO DESONER.","DESONERADO","NÃO DESONER."]
[null,"COMPOSIÇÃO","COMP 412_SEE","PLACA DE SINALIZAÇÃO EM PVC COD 17 - (316X158) MENSAGEM \"SAÍDA\"","UN ",null,null,null,30.769999999999996,30.889999999999997]
[null,"AGETOP_I",5,"SERVENTE","h     ",0.09,8.1999999999999993,9.51,0.74,0.86]
[null,"MÃO DE OBRA (B) - TOTAL",null,null,null,null,null,null,0.74,0.86]
[null,"AGETOP_I",3070,"BUCHA DE NYLON S-6","un",2,0.04,0.04,0.08,0.08]
[null,"AGETOP_I",3393,"PARAFUSO P/BUCHA S-6","un",2,0.08,0.08,0.16,0.16]
[null,"SINAPI_I",37559,"PLACA DE SINALIZACAO DE SEGURANCA CONTRA INCENDIO, FOTOLUMINESCENTE, RETANGULAR, *12 X 40* CM, EM PVC *2* MM ANTI-CHAMAS (SIMBOLOS, CORES E PICTOGRAMAS CONFORME NBR 13434)","UN    ",1,29.79,29.79,29.79,29.79]
[null,"MATERIAL (C) - TOTAL",null,null,null,null,null,null,30.029999999999998,30.029999999999998]
[]
[209,"FONTE","CÓDIGO","DESCRIÇÃO","UNIDADE","COEFIC.","CUSTO UNITÁRIO",null,"CUSTO  TOTAL (A) + (B) + (C) + (D) + (E)"]
[null,null,null,null,null,null,"DESONERADO","NÃO DESONER.","DESONERADO","NÃO DESONER."]
[null,"COMPOSIÇÃO","COMP 209_SEE","TOALHEIRO PLÁSTICO TIPO DISPENSER PARA PAPEL TOALHA INTERFOLHADO","UN ",null,null,null,49.3,50.16]
[null,"AGETOP_I",8,"AJUDANTE","h     ",0.25,8.1999999999999993,9.51,2.0499999999999998,2.38]
[null,"AGETOP_I",4,"PEDREIRO","h     ",0.25,13.4,15.53,3.35,3.88]
[null,"MÃO DE OBRA (B) - TOTAL",null,null,null,null,null,null,5.4,6.26]
[null,"SINAPI_I",37401,"TOALHEIRO PLASTICO TIPO DISPENSER PARA PAPEL TOALHA INTERFOLHADO","UN    ",1,43.1,43.1,43.1,43.1]
[null,"AGETOP_I",2221,"PARAFUSO COM BUCHA S-8","un",4,0.2,0.2,0.8,0.8]
[null,"MATERIAL (C) - TOTAL",null,null,null,null,null,null,43.9,43.9]
[]
[541,"FONTE","CÓDIGO","DESCRIÇÃO","UNIDADE","COEFIC.","CUSTO UNITÁRIO",null,"CUSTO  TOTAL (A) + (B) + (C) + (D) + (E)"]
[null,null,null,null,null,null,"DESONERADO","NÃO DESONER.","DESONERADO","NÃO DESONER."]
[null,"COMPOSIÇÃO","COMP 541_SEE","BANCADA DE GRANITO CINZA POLIDO - FORNECIMENTO E INSTALAÇÃO. ","M2    ",null,null,null,521.62,526.67000000000007]
[null,"SINAPI",88274,"MARMORISTA/GRANITEIRO COM ENCARGOS COMPLEMENTARES","H",1.6555555555555557,17.96,20.100000000000001,29.73,33.28]
[null,"SINAPI",88316,"SERVENTE COM ENCARGOS COMPLEMENTARES","H",1.088888888888889,13.03,14.41,14.19,15.69]
[null,"MÃO DE OBRA (B) - TOTAL",null,null,null,null,null,null,43.92,48.97]
[null,"SINAPI_I",4823,"MASSA PLASTICA PARA MARMORE/GRANITO","KG    ",0.58088888888888901,29.37,29.37,17.059999999999999,17.059999999999999]
[null,"SINAPI_I",7568,"BUCHA DE NYLON SEM ABA S10, COM PARAFUSO DE 6,10 X 65 MM EM ACO ZINCADO COM ROSCA SOBERBA, CABECA CHATA E FENDA PHILLIPS","UN    ",6.666666666666667,0.3,0.3,2,2]
[null,"SINAPI_I",11795,"GRANITO PARA BANCADA, POLIDO, TIPO ANDORINHA/ QUARTZ/ CASTELO/ CORUMBA OU OUTROS EQUIVALENTES DA REGIAO, E=  *2,5* CM","M2    ",1.1166666666666667,347.16,347.16,387.66,387.66]
[null,"SINAPI_I",37329,"REJUNTE EPOXI BRANCO","KG    ",3.9E-2,41.64,41.64,1.62,1.62]
[null,"SINAPI_I",37591,"SUPORTE MAO-FRANCESA EM ACO, ABAS IGUAIS 40 CM, CAPACIDADE MINIMA 70 KG, BRANCO","UN    ",2.2222222222222223,31.21,31.21,69.36,69.36]
[null,"MATERIAL (C) - TOTAL",null,null,null,null,null,null,477.70000000000005,477.70000000000005]
[]
[206,"FONTE","CÓDIGO","DESCRIÇÃO","UNIDADE","COEFIC.","CUSTO UNITÁRIO",null,"CUSTO  TOTAL (A) + (B) + (C) + (D) + (E)"]
[null,null,null,null,null,null,"DESONERADO","NÃO DESONER.","DESONERADO","NÃO DESONER."]
[null,"COMPOSIÇÃO","COMP 206_SEE","BANCO ARTICULADO PARA BANHO, EM ACO INOX POLIDO, 70* CM X 45* CM","UN ",null,null,null,705.46,708.9]
[null,"AGETOP_I",8,"AJUDANTE","h     ",1,8.1999999999999993,9.51,8.1999999999999993,9.51]
[null,"AGETOP_I",11,"ENCANADOR","h     ",1,13.4,15.53,13.4,15.53]
[null,"MÃO DE OBRA (B) - TOTAL",null,null,null,null,null,null,21.6,25.04]
[null,"SINAPI_I",36215,"BANCO ARTICULADO PARA BANHO, EM ACO INOX POLIDO, 70* CM X 45* CM","UN    ",1,682.26,682.26,682.26,682.26]
[null,"AGETOP_I",2221,"PARAFUSO COM BUCHA S-8","un",8,0.2,0.2,1.6,1.6]
[null,"MATERIAL (C) - TOTAL",null,null,null,null,null,null,683.86,683.86]

{"sheet":"Cotações","index":8,"n_rows":213,"n_cols":9,"rows_kept":213,"cut":false,"hidden":false,"merged":[[210,3,210,4],[210,7,210,8],[211,3,211,4],[211,7,211,8],[212,3,212,8],[207,3,207,4],[207,7,207,8],[208,3,208,4],[208,7,208,8],[209,3,209,4],[209,7,209,8],[203,7,204,8],[205,7,205,8],[206,3,206,4],[206,5,206,6],[206,7,206,8],[203,1,204,1],[203,2,204,2],[203,3,204,3],[203,4,204,4],[203,5,203,6],[199,3,199,4],[199,7,199,8],[200,3,200,4],[200,7,200,8],[201,3,201,8],[196,3,196,4],[196,7,196,8],[197,3,197,4],[197,7,197,8],[198,3,198,4],[198,7,198,8],[192,7,193,8],[194,7,194,8],[195,3,195,4],[195,5,195,6],[195,7,195,8],[192,1,193,1],[192,2,193,2],[192,3,193,3],[192,4,193,4],[192,5,192,6],[188,3,188,4],[188,7,188,8],[189,3,189,4],[189,7,189,8],[190,3,190,8],[185,3,185,4],[185,7,185,8],[186,3,186,4],[186,7,186,8],[187,3,187,4],[187,7,187,8],[181,7,182,8],[183,7,183,8],[184,3,184,4],[184,5,184,6],[184,7,184,8],[181,1,182,1],[181,2,182,2],[181,3,182,3],[181,4,182,4],[181,5,181,6],[177,3,177,4],[177,7,177,8],[178,3,178,4],[178,7,178,8],[179,3,179,8],[174,3,174,4],[174,7,174,8],[175,3,175,4],[175,7,175,8],[176,3,176,4],[176,7,176,8],[170,7,171,8],[172,7,172,8],[173,3,173,4],[173,5,173,6],[173,7,173,8],[170,1,171,1],[170,2,171,2],[170,3,171,3],[170,4,171,4],[170,5,170,6],[166,3,166,4],[166,7,166,8],[167,3,167,4],[167,7,167,8],[168,3,168,8],[163,3,163,4],[163,7,163,8],[164,3,164,4],[164,7,164,8],[165,3,165,4],[165,7,165,8],[159,7,160,8],[161,7,161,8],[162,3,162,4],[162,5,162,6],[162,7,162,8],[159,1,160,1],[159,2,160,2],[159,3,160,3],[159,4,160,4],[159,5,159,6],[155,3,155,4],[155,7,155,8],[156,3,156,4],[156,7,156,8],[157,3,157,8],[152,3,152,4],[152,7,152,8],[153,3,153,4],[153,7,153,8],[154,3,154,4],[154,7,154,8],[148,7,149,8],[150,7,150,8],[151,3,151,4],[151,5,151,6],[151,7,151,8],[148,1,149,1],[148,2,149,2],[148,3,149,3],[148,4,149,4],[148,5,148,6],[144,3,144,4],[144,7,144,8],[145,3,145,4],[145,7,145,8],[146,3,146,8],[141,3,141,4],[141,7,141,8],[142,3,142,4],[142,7,142,8],[143,3,143,4],[143,7,143,8],[137,7,138,8],[139,7,139,8],[140,3,140,4],[140,5,140,6],[140,7,140,8],[137,1,138,1],[137,2,138,2],[137,3,138,3],[137,4,138,4],[137,5,137,6],[133,3,133,4],[133,7,133,8],[134,3,134,4],[134,7,134,8],[135,3,135,8],[130,3,130,4],[130,7,130,8],[131,3,131,4],[131,7,131,8],[132,3,132,4],[132,7,132,8],[126,7,127,8],[128,7,128,8],[129,3,129,4],[129,5,129,6],[129,7,129,8],[126,1,127,1],[126,2,127,2],[126,3,127,3],[126,4,127,4],[126,5,126,6],[122,3,122,4],[122,7,122,8],[123,3,123,4],[123,7,123,8],[124,3,124,8],[119,3,119,4],[119,7,119,8],[120,3,120,4],[120,7,120,8],[121,3,121,4],[121,7,121,8],[115,7,116,8],[117,7,117,8],[118,3,118,4],[118,5,118,6],[118,7,118,8],[115,1,116,1],[115,2,116,2],[115,3,116,3],[115,4,116,4],[115,5,115,6],[111,3,111,4],[111,7,111,8],[112,3,112,4],[112,7,112,8],[113,3,113,8],[108,3,108,4],[108,7,108,8],[109,3,109,4],[109,7,109,8],[110,3,110,4],[110,7,110,8],[104,7,105,8],[106,7,106,8],[107,3,107,4],[107,5,107,6],[107,7,107,8],[104,1,105,1],[104,2,105,2],[104,3,105,3],[104,4,105,4],[104,5,104,6],[100,3,100,4],[100,7,100,8],[101,3,101,4],[101,7,101,8],[102,3,102,8],[97,3,97,4],[97,7,97,8],[98,3,98,4],[98,7,98,8],[99,3,99,4],[99,7,99,8],[93,7,94,8],[95,7,95,8],[96,3,96,4],[96,5,96,6],[96,7,96,8],[93,1,94,1],[93,2,94,2],[93,3,94,3],[93,4,94,4],[93,5,93,6],[89,3,89,4],[89,7,89,8],[90,3,90,4],[90,7,90,8],[91,3,91,8],[86,3,86,4],[86,7,86,8],[87,3,87,4],[87,7,87,8],[88,3,88,4],[88,7,88,8],[82,7,83,8],[84,7,84,8],[85,3,85,4],[85,5,85,6],[85,7,85,8],[82,1,83,1],[82,2,83,2],[82,3,83,3],[82,4,83,4],[82,5,82,6],[78,3,78,4],[78,7,78,8],[79,3,79,4],[79,7,79,8],[80,3,80,8],[75,3,75,4],[75,7,75,8],[76,3,76,4],[76,7,76,8],[77,3,77,4],[77,7,77,8],[71,7,72,8],[73,7,73,8],[74,3,74,4],[74,5,74,6],[74,7,74,8],[71,1,72,1],[71,2,72,2],[71,3,72,3],[71,4,72,4],[71,5,71,6],[67,3,67,4],[67,7,67,8],[68,3,68,4],[68,7,68,8],[69,3,69,8],[64,3,64,4],[64,7,64,8],[65,3,65,4],[65,7,65,8],[66,3,66,4],[66,7,66,8],[60,7,61,8],[62,7,62,8],[63,3,63,4],[63,5,63,6],[63,7,63,8],[60,1,61,1],[60,2,61,2],[60,3,61,3],[60,4,61,4],[60,5,60,6],[56,3,56,4],[56,7,56,8],[57,3,57,4],[57,7,57,8],[58,3,58,8],[53,3,53,4],[53,7,53,8],[54,3,54,4],[54,7,54,8],[55,3,55,4],[55,7,55,8],[49,7,50,8],[51,7,51,8],[52,3,52,4],[52,5,52,6],[52,7,52,8],[49,1,50,1],[49,2,50,2],[49,3,50,3],[49,4,50,4],[49,5,49,6],[45,3,45,4],[45,7,45,8],[46,3,46,4],[46,7,46,8],[47,3,47,8],[42,3,42,4],[42,7,42,8],[43,3,43,4],[43,7,43,8],[44,3,44,4],[44,7,44,8],[38,7,39,8],[40,7,40,8],[41,3,41,4],[41,5,41,6],[41,7,41,8],[38,1,39,1],[38,2,39,2],[38,3,39,3],[38,4,39,4],[38,5,38,6],[34,3,34,4],[34,7,34,8],[35,3,35,4],[35,7,35,8],[36,3,36,8],[31,3,31,4],[31,7,31,8],[32,3,32,4],[32,7,32,8],[33,3,33,4],[33,7,33,8],[27,7,28,8],[29,7,29,8],[30,3,30,4],[30,5,30,6],[30,7,30,8],[27,1,28,1],[27,2,28,2],[27,3,28,3],[27,4,28,4],[27,5,27,6],[23,3,23,4],[23,7,23,8],[24,3,24,4],[24,7,24,8],[25,3,25,8],[20,3,20,4],[20,7,20,8],[21,3,21,4],[21,7,21,8],[22,3,22,4],[22,7,22,8],[16,7,17,8],[18,7,18,8],[19,3,19,4],[19,5,19,6],[19,7,19,8],[16,1,17,1],[16,2,17,2],[16,3,17,3],[16,4,17,4],[16,5,16,6],[8,0,8,8],[0,0,0,8],[1,0,1,9],[2,0,2,8],[3,0,3,6],[3,7,3,9],[4,0,4,6],[4,7,4,9],[5,0,5,8],[6,0,6,6],[6,7,6,9],[7,0,7,6],[7,7,7,9],[9,0,9,2],[9,3,9,6],[9,7,9,8],[10,0,10,2],[10,3,10,6],[10,8,10,9],[14,0,14,8],[15,0,15,9],[11,0,11,9],[12,0,12,2],[12,3,12,6],[12,7,12,8],[13,0,13,2],[13,3,13,6],[13,8,13,9]]}
[]
[]
[]
["UNIDADE ESCOLAR",null,null,null,null,null,null,"CÓDIGO INEP"]
[{"$f":"Orçamento!$O$4","v":"COLÉGIO ESTADUAL JUSCELINO KUBITSCHEK DE OLIVEIRA"},null,null,null,null,null,null,{"$f":"Orçamento!$X$4","v":52075583}]
[]
["OBRA",null,null,null,null,null,null,"CIDADE"]
[{"$f":"Orçamento!$O$7","v":"REFORMA E IMPLANTAÇÃO"},null,null,null,null,null,null,{"$f":"Orçamento!$X$7","v":"ÁGUAS LINDAS DE GOIÁS"}]
[]
["CRE",null,null,"ENDEREÇO",null,null,null,"REFERÊNCIA AGETOP"]
[{"$f":"Orçamento!$O$10","v":"ÁGUAS LINDAS"},null,null,{"$f":"Orçamento!$R$10","v":"AREA ESPECIAL S/N, JARDIM SANTA LUCIA, CEP:72910-001"},null,null,null,{"$f":"Orçamento!$X$10","v":"ABR/19"},{"$f":"Orçamento!$Y$10","v":"DESONERADA"}]
[]
["DATA",null,null,"ÁREA TOTAL CONSTRUÍDA (M²)",null,null,null,"REFERÊNCIA SINAPI"]
[{"$f":"Orçamento!$S$7","v":"2020-07-07"},null,null,{"$f":"Orçamento!$S$13","v":3074.09},null,null,null,{"$f":"Orçamento!$X$13","v":"SET/19"},{"$f":"Orçamento!$Y$13","v":"DESONERADA"}]
[]
["COTAÇÕES DE PREÇOS - SEE-GO"]
[null,"FONTE","CÓDIGO","DESCRIÇÃO","UNIDADE","MÉDIA",null,"ÍNDICE RETROAÇÃO"]
[null,null,null,null,null,"DESONERADA","ONERADA"]
[195,"COTAÇÃO","COT 195_SEE","LÂMPADA LED TUBULAR 18W ","UN",21.959999999999997,21.959999999999997,""]
[null,null,"EMPRESA","NOME DA EMPRESA",null,"COTAÇÕES",null,"DATA COTAÇÃO"]
[null,null,"E030 - AJEL M...","AJEL MATERIAIS ELÉTRICOS",null,19.89,19.89,""]
[null,null,"E013 - ELETRO...","ELETROTRANSOL",null,25.99,25.99,""]
[null,null,"E014 - MAKRO ...","MAKRO SERVICE",null,20,20,""]
[null,null,"","",null,null,null,""]
[null,null,"","",null,null,null,""]
[null,null,"OBSERVAÇÕES:",""]
[]
[null,"FONTE","CÓDIGO","DESCRIÇÃO","UNIDADE","MÉDIA",null,"ÍNDICE RETROAÇÃO"]
[null,null,null,null,null,"DESONERADA","ONERADA"]
[8,"COTAÇÃO","COT 008_SEE","CONJUNTO MOTOR-BOMBA ELÉTRICA TRIFÁSICO 380/220 V PARA VZ= 24,33 M³/H, HM= 46,24 M POTÊNCIA= 7,5 CV","UN ",3792.6666666666665,3792.6666666666665,""]
[null,null,"EMPRESA","NOME DA EMPRESA",null,"COTAÇÕES",null,"DATA COTAÇÃO"]
[null,null,"E036 - TECNOB...","TECNOBOMBAS",null,4200,4200,"05.02.2019"]
[null,null,"E039 - ESPÍND...","ESPÍNDOLA E ANDRADE LTDA-ME",null,3178,3178,"05.02.2019"]
[null,null,"E054 - R M D ...","R M D DE SOUZA EIRELI - ME",null,4000,4000,"06.02.2019"]
[null,null,"","",null,null,null,""]
[null,null,"","",null,null,null,""]
[null,null,"OBSERVAÇÕES:",""]
[]
[null,"FONTE","CÓDIGO","DESCRIÇÃO","UNIDADE","MÉDIA",null,"ÍNDICE RETROAÇÃO"]
[null,null,null,null,null,"DESONERADA","ONERADA"]
[17,"COTAÇÃO","COT 017_SEE","REGISTRO DE GAVETA COM HASTE ASCENDENTE DE BRONZE 2 1/2\"","UN ",231.66666666666666,231.66666666666666,""]
[null,null,"EMPRESA","NOME DA EMPRESA",null,"COTAÇÕES",null,"DATA COTAÇÃO"]
[null,null,"E034 - VALK T...","VALK TUBOS",null,220,220,""]
[null,null,"E035 - ACIONA...","ACIONAR SERVIÇOS E EQUIPAMENTOS CONTRA INCÊNDIO",null,250,250,""]
[null,null,"E038 - CENTER...","CENTER FIRE",null,225,225,""]
[null,null,"","",null,null,null,""]
[null,null,"","",null,null,null,""]
[null,null,"OBSERVAÇÕES:",""]
[]
[null,"FONTE","CÓDIGO","DESCRIÇÃO","UNIDADE","MÉDIA",null,"ÍNDICE RETROAÇÃO"]
[null,null,null,null,null,"DESONERADA","ONERADA"]
[88,"COTAÇÃO","COT 088_SEE","BOTOEIRA BOMBA DE INCÊNDIO C/ MARTELO CONVENCIONAL/ ANALÓGICA","UN",63.5,63.5,""]
[null,null,"EMPRESA","NOME DA EMPRESA",null,"COTAÇÕES",null,"DATA COTAÇÃO"]
[null,null,"E034 - VALK T...","VALK TUBOS",null,58,58,""]
[null,null,"E035 - ACIONA...","ACIONAR SERVIÇOS E EQUIPAMENTOS CONTRA INCÊNDIO",null,67.5,67.5,""]
[null,null,"E038 - CENTER...","CENTER FIRE",null,65,65,""]
[null,null,"","",null,null,null,""]
[null,null,"","",null,null,null,""]
[null,null,"OBSERVAÇÕES:",""]
[]
[null,"FONTE","CÓDIGO","DESCRIÇÃO","UNIDADE","MÉDIA",null,"ÍNDICE RETROAÇÃO"]
[null,null,null,null,null,"DESONERADA","ONERADA"]
[90,"COTAÇÃO","COT 090_SEE","ACIONADOR MANUAL DE ALARME","UN",83.333333333333329,83.333333333333329,""]
[null,null,"EMPRESA","NOME DA EMPRESA",null,"COTAÇÕES",null,"DATA COTAÇÃO"]
[null,null,"E034 - VALK T...","VALK TUBOS",null,120,120,""]
[null,null,"E035 - ACIONA...","ACIONAR SERVIÇOS E EQUIPAMENTOS CONTRA INCÊNDIO",null,65,65,""]
[null,null,"E038 - CENTER...","CENTER FIRE",null,65,65,""]
[null,null,"","",null,null,null,""]
[null,null,"","",null,null,null,""]
[null,null,"OBSERVAÇÕES:",""]
[]
[null,"FONTE","CÓDIGO","DESCRIÇÃO","UNIDADE","MÉDIA",null,"ÍNDICE RETROAÇÃO"]
[null,null,null,null,null,"DESONERADA","ONERADA"]
[92,"COTAÇÃO","COT 092_SEE","CENTRAL DE DETECÇÃO E ALARME DE 40 SETORES COM BATERIA (PREÇO MÉDIO)","UN",963.33333333333337,963.33333333333337,""]
[null,null,"EMPRESA","NOME DA EMPRESA",null,"COTAÇÕES",null,"DATA COTAÇÃO"]
[null,null,"E034 - VALK T...","VALK TUBOS",null,840,840,""]
[null,null,"E035 - ACIONA...","ACIONAR SERVIÇOS E EQUIPAMENTOS CONTRA INCÊNDIO",null,980,980,""]
[null,null,"E038 - CENTER...","CENTER FIRE",null,1070,1070,""]
[null,null,"","",null,null,null,""]
[null,null,"","",null,null,null,""]
[null,null,"OBSERVAÇÕES:",""]
[]
[null,"FONTE","CÓDIGO","DESCRIÇÃO","UNIDADE","MÉDIA",null,"ÍNDICE RETROAÇÃO"]
[null,null,null,null,null,"DESONERADA","ONERADA"]
[18,"COTAÇÃO","COT 018_SEE","TE DE REDUCAO 90 GRAUS SOLDAVEL 60 X 50 MM","UN ",61.980000000000004,61.980000000000004,""]
[null,null,"EMPRESA","NOME DA EMPRESA",null,"COTAÇÕES",null,"DATA COTAÇÃO"]
[null,null,"E085 - CIA DA...","CIA DAS BOMBAS ",null,60,60,"08/05/2019"]
[null,null,"E087 - SAFRA ...","SAFRA IRRIGAÇÃO",null,63.96,63.96,"09/05/2019"]
[null,null,null,"",null,null,null,""]
[null,null,"","",null,null,null,""]
[null,null,"","",null,null,null,""]
[null,null,"OBSERVAÇÕES:",""]
[]
[null,"FONTE","CÓDIGO","DESCRIÇÃO","UNIDADE","MÉDIA",null,"ÍNDICE RETROAÇÃO"]
[null,null,null,null,null,"DESONERADA","ONERADA"]
[103,"COTAÇÃO","COT 103_SEE","NIPLE DE REDUÇÃO 1/2\" X 1/4\" BSP","UN",6.0533333333333337,6.0533333333333337,""]
[null,null,"EMPRESA","NOME DA EMPRESA",null,"COTAÇÕES",null,"DATA COTAÇÃO"]
[null,null,"E070 - FOCO R...","FOCO REPRESENTAÇÃO E CONSULTORIA LTDA-ME",null,4.46,4.46,"12/02/2019"]
[null,null,"E071 - CASA D...","CASA DAS PEÇAS COM E INDUSTRIA DE FOGOES LTDA",null,3.9,3.9,"11/02/2019"]
[null,null,"E072 - AMIG I...","AMIG INSTALAÇÃO DE REDE DE GÁS E INCÊNDIO",null,9.8000000000000007,9.8000000000000007,"08/02/2019"]
[null,null,"","",null,null,null,""]
[null,null,"","",null,null,null,""]
[null,null,"OBSERVAÇÕES:",""]
[]
[null,"FONTE","CÓDIGO","DESCRIÇÃO","UNIDADE","MÉDIA",null,"ÍNDICE RETROAÇÃO"]
[null,null,null,null,null,"DESONERADA","ONERADA"]
[104,"COTAÇÃO","COT 104_SEE","NIPLE DE REDUÇÃO 3/4\" X 1/2\" BSP","UN",9.7099999999999991,9.7099999999999991,""]
[null,null,"EMPRESA","NOME DA EMPRESA",null,"COTAÇÕES",null,"DATA COTAÇÃO"]
[null,null,"E070 - FOCO R...","FOCO REPRESENTAÇÃO E CONSULTORIA LTDA-ME",null,10.93,10.93,"12/02/2019"]
[null,null,"E071 - CASA D...","CASA DAS PEÇAS COM E INDUSTRIA DE FOGOES LTDA",null,5.5,5.5,"11/02/2019"]
[null,null,"E072 - AMIG I...","AMIG INSTALAÇÃO DE REDE DE GÁS E INCÊNDIO",null,12.7,12.7,"08/02/2019"]
[null,null,"","",null,null,null,""]
[null,null,"","",null,null,null,""]
[null,null,"OBSERVAÇÕES:",""]
[]
[null,"FONTE","CÓDIGO","DESCRIÇÃO","UNIDADE","MÉDIA",null,"ÍNDICE RETROAÇÃO"]
[null,null,null,null,null,"DESONERADA","ONERADA"]
[281,"COTAÇÃO","COT 281_SEE","VÁLVULA UGV 3/4\" (S) LATÃO","UN ",15.836666666666666,15.836666666666666,""]
[null,null,"EMPRESA","NOME DA EMPRESA",null,"COTAÇÕES",null,"DATA COTAÇÃO"]
[null,null,"E070 - FOCO R...","FOCO REPRESENTAÇÃO E CONSULTORIA LTDA-ME",null,12.51,12.51,"12/02/2019"]
[null,null,"E071 - CASA D...","CASA DAS PEÇAS COM E INDUSTRIA DE FOGOES LTDA",null,17.5,17.5,"11/02/2019"]
[null,null,"E072 - AMIG I...","AMIG INSTALAÇÃO DE REDE DE GÁS E INCÊNDIO",null,17.5,17.5,"08/02/2019"]
[null,null,"",""]
[null,null,"","",null,null,null,""]
[null,null,"OBSERVAÇÕES:",""]
[]
[null,"FONTE","CÓDIGO","DESCRIÇÃO","UNIDADE","MÉDIA",null,"ÍNDICE RETROAÇÃO"]
[null,null,null,null,null,"DESONERADA","ONERADA"]
[282,"COTAÇÃO","COT 282_SEE","VÁLVULA UGV 1/2\" (S) LATÃO","UN ",15.166666666666666,15.166666666666666,""]
[null,null,"EMPRESA","NOME DA EMPRESA",null,"COTAÇÕES",null,"DATA COTAÇÃO"]
[null,null,"E070 - FOCO R...","FOCO REPRESENTAÇÃO E CONSULTORIA LTDA-ME",null,11.2,11.2,"12/02/2019"]
[null,null,"E071 - CASA D...","CASA DAS PEÇAS COM E INDUSTRIA DE FOGOES LTDA",null,17.5,17.5,"11/02/2019"]
[null,null,"E072 - AMIG I...","AMIG INSTALAÇÃO DE REDE DE GÁS E INCÊNDIO",null,16.8,16.8,"08/02/2019"]
[null,null,"","",null,null,null,""]
[null,null,"","",null,null,null,""]
[null,null,"OBSERVAÇÕES:",""]
[]
[null,"FONTE","CÓDIGO","DESCRIÇÃO","UNIDADE","MÉDIA",null,"ÍNDICE RETROAÇÃO"]
[null,null,null,null,null,"DESONERADA","ONERADA"]
[102,"COTAÇÃO","COT 102_SEE","REGULADOR DE 2º ESTÁGIO 5KG/H","UN",59.833333333333336,59.833333333333336,""]
[null,null,"EMPRESA","NOME DA EMPRESA",null,"COTAÇÕES",null,"DATA COTAÇÃO"]
[null,null,"E070 - FOCO R...","FOCO REPRESENTAÇÃO E CONSULTORIA LTDA-ME",null,38.9,38.9,"12/02/2019"]
[null,null,"E071 - CASA D...","CASA DAS PEÇAS COM E INDUSTRIA DE FOGOES LTDA",null,55.599999999999994,55.599999999999994,"11/02/2019"]
[null,null,"E072 - AMIG I...","AMIG INSTALAÇÃO DE REDE DE GÁS E INCÊNDIO",null,85,85,"08/02/2019"]
[null,null,"","",null,null,null,""]
[null,null,"","",null,null,null,""]
[null,null,"OBSERVAÇÕES:","AMIG enviou cotação de regulador de 2º estágio de 12kg/h."]
[]
[null,"FONTE","CÓDIGO","DESCRIÇÃO","UNIDADE","MÉDIA",null,"ÍNDICE RETROAÇÃO"]
[null,null,null,null,null,"DESONERADA","ONERADA"]
[101,"COTAÇÃO","COT 101_SEE","REGULADOR DE 1º ESTÁGIO 60KG/H MODELO AP-40  COM MANÔMETRO","UN",205.57666666666668,205.57666666666668,""]
[null,null,"EMPRESA","NOME DA EMPRESA",null,"COTAÇÕES",null,"DATA COTAÇÃO"]
[null,null,"E070 - FOCO R...","FOCO REPRESENTAÇÃO E CONSULTORIA LTDA-ME",null,148.72999999999999,148.72999999999999,"12/02/2019"]
[null,null,"E071 - CASA D...","CASA DAS PEÇAS COM E INDUSTRIA DE FOGOES LTDA",null,198,198,"11/02/2019"]
[null,null,"E072 - AMIG I...","AMIG INSTALAÇÃO DE REDE DE GÁS E INCÊNDIO",null,270,270,"08/02/2019"]
[null,null,"","",null,null,null,""]
[null,null,"","",null,null,null,""]
[null,null,"OBSERVAÇÕES:",""]
[]
[null,"FONTE","CÓDIGO","DESCRIÇÃO","UNIDADE","MÉDIA",null,"ÍNDICE RETROAÇÃO"]
[null,null,null,null,null,"DESONERADA","ONERADA"]
[195,"COTAÇÃO","COT 195_SEE","LÂMPADA LED TUBULAR 18W ","UN",21.959999999999997,21.959999999999997,""]
[null,null,"EMPRESA","NOME DA EMPRESA",null,"COTAÇÕES",null,"DATA COTAÇÃO"]
[null,null,"E030 - AJEL M...","AJEL MATERIAIS ELÉTRICOS",null,19.89,19.89,""]
[null,null,"E013 - ELETRO...","ELETROTRANSOL",null,25.99,25.99,""]
[null,null,"E014 - MAKRO ...","MAKRO SERVICE",null,20,20,""]
[null,null,"","",null,null,null,""]
[null,null,"","",null,null,null,""]
[null,null,"OBSERVAÇÕES:",""]
[]
[null,"FONTE","CÓDIGO","DESCRIÇÃO","UNIDADE","MÉDIA",null,"ÍNDICE RETROAÇÃO"]
[null,null,null,null,null,"DESONERADA","ONERADA"]
[4,"COTAÇÃO","COT 004_SEE","PRESILHA LATÃO 16/35MM 5MM+PARAF FENDA 1/4''X1.1/4''","UN ",1.5933333333333335,1.5933333333333335,""]
[null,null,"EMPRESA","NOME DA EMPRESA",null,"COTAÇÕES",null,"DATA COTAÇÃO"]
[null,null,"E013 - ELETRO...","ELETROTRANSOL",null,0.83,0.83,"29/04/2019"]
[null,null,"E018 - ELETRO...","ELETRO ENERGIA",null,2.4500000000000002,2.4500000000000002,"29/04/2019"]
[null,null,"E016 - ADEEL...","ADEEL",null,1.5,1.5,"02/05/2019"]
[null,null,"","",null,null,null,""]
[null,null,"","",null,null,null,""]
[null,null,"OBSERVAÇÕES:",""]
[]
[null,"FONTE","CÓDIGO","DESCRIÇÃO","UNIDADE","MÉDIA",null,"ÍNDICE RETROAÇÃO"]
[null,null,null,null,null,"DESONERADA","ONERADA"]
[7,"COTAÇÃO","COT 007_SEE","MOLDE GRAF CGT 5/8 50MM C","UN",138.7175,138.7175,""]
[null,null,"EMPRESA","NOME DA EMPRESA",null,"COTAÇÕES",null,"DATA COTAÇÃO"]
[null,null,"E013 - ELETRO...","ELETROTRANSOL",null,175.68,175.68,"29/04/2019"]
[null,null,"E030 - AJEL M...","AJEL MATERIAIS ELÉTRICOS",null,111.19,111.19,"29/04/2019"]
[null,null,"E018 - ELETRO...","ELETRO ENERGIA",null,110,110,"29/04/2019"]
[null,null,"E016 - ADEEL...","ADEEL",null,158,158,"02/05/2019"]
[null,null,"","",null,null,null,""]
[null,null,"OBSERVAÇÕES:",""]
[]
[null,"FONTE","CÓDIGO","DESCRIÇÃO","UNIDADE","MÉDIA",null,"ÍNDICE RETROAÇÃO"]
[null,null,null,null,null,"DESONERADA","ONERADA"]
[292,"COTAÇÃO","COT 292_SEE","ALIC P/MOLDE C-84","UN ",87.465000000000003,87.465000000000003,""]
[null,null,"EMPRESA","NOME DA EMPRESA",null,"COTAÇÕES",null,"DATA COTAÇÃO"]
[null,null,"E013 - ELETRO...","ELETROTRANSOL",null,85.19,85.19,"29/04/2019"]
[null,null,"E030 - AJEL M...","AJEL MATERIAIS ELÉTRICOS",null,89.67,89.67,"29/04/2019"]
[null,null,"E018 - ELETRO...","ELETRO ENERGIA",null,85,85,"29/04/2019"]
[null,null,"E016 - ADEEL...","ADEEL",null,90,90,"02/05/2019"]
[null,null,"","",null,null,null,""]
[null,null,"OBSERVAÇÕES:",""]
[]
[null,"FONTE","CÓDIGO","DESCRIÇÃO","UNIDADE","MÉDIA",null,"ÍNDICE RETROAÇÃO"]
[null,null,null,null,null,"DESONERADA","ONERADA"]
[12,"COTAÇÃO","COT 012_SEE","HASTE ROSQUEADA \"TIRANTE\" 3/8\"","M",5.3833333333333329,5.3833333333333329,""]
[null,null,"EMPRESA","NOME DA EMPRESA",null,"COTAÇÕES",null,"DATA COTAÇÃO"]
[null,null,"E013 - ELETRO...","ELETROTRANSOL",null,5.3833333333333329,5.3833333333333329,"06/02/2019"]
[null,null,null,"",null,null,null,""]
[null,null,null,"",null,null,null,""]
[null,null,"","",null,null,null,""]
[null,null,"","",null,null,null,""]
[null,null,"OBSERVAÇÕES:",""]