{"text_format":"1","workbook":"xlsx","n_sheets":8,"sheets":["Orçamento","Resumo ","Somatório","Cronog_120_Dias","Composição BDI","Relatório CENTRAL","Parc Maior Relev","Composições"],"not_rendered":{"charts":0,"images":6,"macros":1,"external_links":1,"defined_names":151,"comments":1,"pivot_tables":0},"unopened":[],"bounds":{"document_bytes":16777216,"sheet_cells":100000,"rows_first":2000,"rows_last":500,"rows_between":2000,"halvings":0,"cell_chars":16384,"cell_head_chars":4096},"cells_cut":0,"cells_raw":0,"read":"whole","date_system":"1900"}

{"sheet":"Orçamento","index":0,"n_rows":915,"n_cols":24,"rows_kept":915,"cut":false,"hidden":false,"merged":[[896,18,896,20],[896,21,896,22],[897,15,897,17],[897,18,897,20],[897,21,897,22],[898,15,898,17],[898,18,898,20],[898,21,898,22],[893,15,893,17],[893,18,893,20],[893,21,893,22],[894,15,894,17],[894,18,894,20],[894,21,894,22],[895,15,895,17],[895,18,895,20],[895,21,895,22],[907,18,907,20],[907,21,907,22],[902,15,902,17],[902,18,902,20],[902,21,902,22],[903,15,903,17],[903,18,903,20],[903,21,903,22],[904,15,904,17],[904,18,904,20],[904,21,904,22],[883,14,883,17],[890,15,890,17],[856,15,856,17],[911,18,911,20],[911,21,911,22],[899,15,899,17],[899,18,899,20],[899,21,899,22],[900,15,900,17],[900,18,900,20],[900,21,900,22],[901,15,901,17],[901,18,901,20],[901,21,901,22],[905,15,905,17],[905,18,905,20],[905,21,905,22],[906,15,906,17],[906,18,906,20],[906,21,906,22],[907,15,907,17],[896,15,896,17],[851,16,851,22],[914,18,914,20],[914,21,914,22],[911,14,911,17],[908,15,908,17],[908,18,908,20],[908,21,908,22],[909,15,909,17],[909,18,909,20],[909,21,909,22],[910,15,910,17],[910,18,910,20],[910,21,910,22],[913,18,913,20],[913,21,913,22],[912,18,912,20],[912,21,912,22],[889,14,889,23],[890,18,890,20],[890,21,890,22],[891,15,891,17],[891,18,891,20],[891,21,891,22],[892,15,892,17],[892,18,892,20],[892,21,892,22],[847,16,847,22],[848,16,848,22],[849,16,849,22],[3,21,3,22],[2,21,2,22],[5,21,5,22],[10,14,10,23],[13,14,13,23],[6,21,6,22],[2,14,2,20],[3,14,3,20],[5,18,5,20],[6,18,6,20],[6,14,6,17],[5,14,5,17],[12,21,12,22],[12,18,12,20],[8,18,8,20],[8,21,8,22],[9,19,9,20],[869,15,869,17],[870,15,870,17],[871,15,871,17],[872,15,872,17],[873,15,873,17],[874,15,874,17],[875,15,875,17],[876,15,876,17],[877,15,877,17],[857,15,857,17],[858,15,858,17],[859,15,859,17],[860,15,860,17],[861,15,861,17],[862,15,862,17],[863,15,863,17],[864,15,864,17],[865,15,865,17],[878,15,878,17],[879,15,879,17],[880,15,880,17],[881,15,881,17],[882,15,882,17],[855,14,855,23],[844,20,844,21],[843,20,843,21],[839,17,844,17],[839,20,839,21],[856,18,856,20],[856,21,856,22],[857,18,857,20],[857,21,857,22],[845,20,845,21],[865,18,865,20],[865,21,865,22],[866,18,866,20],[866,21,866,22],[867,18,867,20],[867,21,867,22],[868,18,868,20],[868,21,868,22],[880,18,880,20],[883,18,883,20],[883,21,883,22],[880,21,880,22],[881,18,881,20],[881,21,881,22],[882,18,882,20],[882,21,882,22],[872,18,872,20],[872,21,872,22],[879,18,879,20],[879,21,879,22],[874,21,874,22],[875,18,875,20],[875,21,875,22],[877,18,877,20],[873,18,873,20],[873,21,873,22],[874,18,874,20],[884,18,884,20],[884,21,884,22],[871,18,871,20],[871,21,871,22],[864,18,864,20],[864,21,864,22],[886,18,886,20],[886,21,886,22],[840,20,840,21],[862,18,862,20],[862,21,862,22],[863,18,863,20],[863,21,863,22],[861,18,861,20],[861,21,861,22],[870,18,870,20],[841,20,841,21],[852,18,852,22],[858,18,858,20],[858,21,858,22],[859,18,859,20],[859,21,859,22],[860,18,860,20],[860,21,860,22],[850,16,850,22],[885,18,885,20],[885,21,885,22],[0,14,0,22],[8,14,8,16],[9,14,9,16],[11,14,11,16],[12,14,12,16],[14,14,14,22],[1,14,1,22],[4,14,4,22],[7,14,7,22],[869,18,869,20],[869,21,869,22],[877,21,877,22],[866,15,866,17],[867,15,867,17],[868,15,868,17],[870,21,870,22],[878,18,878,20],[878,21,878,22],[876,18,876,20],[876,21,876,22]]}
[]
[]
[null,null,null,null,null,null,null,null,null,null,null,null,null,null,"UNIDADE ESCOLAR",null,null,null,null,null,null,"CÓDIGO INEP"]
[null,null,null,null,null,null,null,null,null,null,null,null,null,null,"CENTRO DE ENSINO EM PERÍODO INTEGRAL PROFESSOR SÉRGIO FAYAD GENEROSO",null,null,null,null,null,null,52046176]
[]
["Nmax",null,null,null,null,null,null,null,null,null,null,null,null,null,"OBRA",null,null,null,"DATA",null,null,"CIDADE"]
[{"$f":"MAX($C$18:$C$839)","v":4},null,null,null,null,null,null,null,null,null,null,null,null,null,"REFORMA E AMPLIAÇÃO",null,null,null,"2020-07-07",null,null,"FORMOSA"]
[]
[null,null,null,null,null,null,null,null,null,null,null,null,null,null,"CRE",null,null,"ENDEREÇO","REFERÊNCIA AGETOP",null,null,"REFERÊNCIA SINAPI"]
[null,null,null,null,null,null,null,null,null,null,null,null,null,null,"FORMOSA",null,null,"AV.MAESTRO JOAO L. DO ESPIRITO SANTO S/N, FORMOSINHA, CEP:73813-120","ABR/19","DESONERADA",null,"DEZ/19","DESONERADA"]
[]
[null,null,null,null,null,null,null,null,null,null,null,null,null,null,"ÁREA EXISTENTE (M²)",null,null,"ÁREA A CONSTRUIR (M²)","ÁREA A DEMOLIR (M²)",null,null,"ÁREA TOTAL CONSTRUÍDA (M²)"]
[null,null,null,null,null,null,null,null,null,null,null,null,null,null,3222.5,null,null,91.08,0,null,null,3313.58]
[]
[null,null,null,null,null,null,null,null,null,null,null,"FILTRO",null,null,"PLANILHA ORÇAMENTÁRIA"]
["Nível E","Save Nivel","Nível C","Altura","n1","n2","n3","n4","n5","Czero","Cnível","↓","Nível","Nível Corrigido","ITEM","TABELA","CODIGO","DESCRIÇÃO DOS SERVIÇOS","UNID","QUANT","MAT","MO","T.SERVIÇO","OBSERVAÇÕES¹"]
[{"$f":"CHOOSE(1+LOG(1+2*(ORÇAMENTO.Nivel=\"Nível 1\")+4*(ORÇAMENTO.Nivel=\"Nível 2\")+8*(ORÇAMENTO.Nivel=\"Nível 3\")+16*(ORÇAMENTO.Nivel=\"Nível 4\")+32*(ORÇAMENTO.Nivel=\"Serviço\"),2),0,1,2,3,4,\"S\")","v":"S"},{"$f":"IF(OR(C17=\"s\",C17=0),OFFSET(B17,-1,0),C17)","v":"Save Nivel"},{"$f":"IF(OFFSET(C17,-1,0)=\"L\",1,IF(OFFSET(C17,-1,0)=1,2,IF(OR(A17=\"s\",A17=0),\"S\",IF(AND(OFFSET(C17,-1,0)=2,A17=4),3,IF(AND(OR(OFFSET(C17,-1,0)=\"s\",OFFSET(C17,-1,0)=0),A17<>\"s\",A17>OFFSET(B17,-1,0)),OFFSET(B17,-1,0),A17)))))","v":"S"},{"$f":"IF(OR(C17=\"S\",C17=0),0,IF(ISERROR(K17),J17,SMALL(J17:K17,1)))","v":0},{"$f":"IF($C17=1,OFFSET(E17,-1,0)+1,OFFSET(E17,-1,0))","v":"n1"},{"$f":"IF($C17=1,0,IF($C17=2,OFFSET(F17,-1,0)+1,OFFSET(F17,-1,0)))","v":"n2"},{"$f":"IF(AND($C17<=2,$C17<>0),0,IF($C17=3,OFFSET(G17,-1,0)+1,OFFSET(G17,-1,0)))","v":"n3"},{"$f":"IF(AND($C17<=3,$C17<>0),0,IF($C17=4,OFFSET(H17,-1,0)+1,OFFSET(H17,-1,0)))","v":"n4"},{"$f":"IF(AND($C17<=4,$C17<>0),0,IF(AND($C17=\"S\",$W17>0),OFFSET(I17,-1,0)+1,OFFSET(I17,-1,0)))","v":"n5"},{"$f":"IF(OR($C17=\"S\",$C17=0),0,MATCH(0,OFFSET($D17,1,$C17,ROW($C$839)-ROW($C17)),0))","v":0},{"$f":"IF(OR($C17=\"S\",$C17=0),0,MATCH(OFFSET($D17,0,$C17)+1,OFFSET($D17,1,$C17,ROW($C$839)-ROW($C17)),0))","v":0},"","Serviço","Serviço","-","SINAPI",null,"(sem código)","-",null,0,0,0,""]
[0,null,"L",{"$f":"COUNTA(OFFSET(D18,1,0):D$839)","v":820},{"$f":"LEFT(O19,1)-1","v":0},null,null,null,null,null,null,"F","LOTE","LOTE","REFORMA E AMPLIAÇÃO - CENTRO DE ENSINO EM PERÍODO INTEGRAL PROFESSOR SÉRGIO FAYAD GENEROSO",null,null,null,null,null,null,null,797673.45000000007]
[{"$f":"CHOOSE(1+LOG(1+2*(ORÇAMENTO.Nivel=\"Nível 1\")+4*(ORÇAMENTO.Nivel=\"Nível 2\")+8*(ORÇAMENTO.Nivel=\"Nível 3\")+16*(ORÇAMENTO.Nivel=\"Nível 4\")+32*(ORÇAMENTO.Nivel=\"Serviço\"),2),0,1,2,3,4,\"S\")","v":1},{"$f":"IF(OR(C19=\"s\",C19=0),OFFSET(B19,-1,0),C19)","v":1},{"$f":"IF(OFFSET(C19,-1,0)=\"L\",1,IF(OFFSET(C19,-1,0)=1,2,IF(OR(A19=\"s\",A19=0),\"S\",IF(AND(OFFSET(C19,-1,0)=2,A19=4),3,IF(AND(OR(OFFSET(C19,-1,0)=\"s\",OFFSET(C19,-1,0)=0),A19<>\"s\",A19>OFFSET(B19,-1,0)),OFFSET(B19,-1,0),A19)))))","v":1},{"$f":"IF(OR(C19=\"S\",C19=0),0,IF(ISERROR(K19),J19,SMALL(J19:K19,1)))","v":820},{"$f":"IF($C19=1,OFFSET(E19,-1,0)+1,OFFSET(E19,-1,0))","v":1},{"$f":"IF($C19=1,0,IF($C19=2,OFFSET(F19,-1,0)+1,OFFSET(F19,-1,0)))","v":0},{"$f":"IF(AND($C19<=2,$C19<>0),0,IF($C19=3,OFFSET(G19,-1,0)+1,OFFSET(G19,-1,0)))","v":0},{"$f":"IF(AND($C19<=3,$C19<>0),0,IF($C19=4,OFFSET(H19,-1,0)+1,OFFSET(H19,-1,0)))","v":0},{"$f":"IF(AND($C19<=4,$C19<>0),0,IF(AND($C19=\"S\",$W19>0),OFFSET(I19,-1,0)+1,OFFSET(I19,-1,0)))","v":0},{"$f":"IF(OR($C19=\"S\",$C19=0),0,MATCH(0,OFFSET($D19,1,$C19,ROW($C$839)-ROW($C19)),0))","v":820},{"$f":"IF(OR($C19=\"S\",$C19=0),0,MATCH(OFFSET($D19,0,$C19)+1,OFFSET($D19,1,$C19,ROW($C$839)-ROW($C19)),0))","v":{"$error":"#N/A"}},"F","Nível 1","Nível 1","1.","AGETOP",null,"REFORMA"]
[2,{"$f":"IF(OR(C20=\"s\",C20=0),OFFSET(B20,-1,0),C20)","v":2},{"$f":"IF(OFFSET(C20,-1,0)=\"L\",1,IF(OFFSET(C20,-1,0)=1,2,IF(OR(A20=\"s\",A20=0),\"S\",IF(AND(OFFSET(C20,-1,0)=2,A20=4),3,IF(AND(OR(OFFSET(C20,-1,0)=\"s\",OFFSET(C20,-1,0)=0),A20<>\"s\",A20>OFFSET(B20,-1,0)),OFFSET(B20,-1,0),A20)))))","v":2},{"$f":"IF(OR(C20=\"S\",C20=0),0,IF(ISERROR(K20),J20,SMALL(J20:K20,1)))","v":79},{"$f":"IF($C20=1,OFFSET(E20,-1,0)+1,OFFSET(E20,-1,0))","v":1},{"$f":"IF($C20=1,0,IF($C20=2,OFFSET(F20,-1,0)+1,OFFSET(F20,-1,0)))","v":1},{"$f":"IF(AND($C20<=2,$C20<>0),0,IF($C20=3,OFFSET(G20,-1,0)+1,OFFSET(G20,-1,0)))","v":0},{"$f":"IF(AND($C20<=3,$C20<>0),0,IF($C20=4,OFFSET(H20,-1,0)+1,OFFSET(H20,-1,0)))","v":0},{"$f":"IF(AND($C20<=4,$C20<>0),0,IF(AND($C20=\"S\",$W20>0),OFFSET(I20,-1,0)+1,OFFSET(I20,-1,0)))","v":0},819,79,"F","Nível 2","Nível 2","1.1.","AGETOP",null,"SERVIÇOS PRELIMINARES"]
[3,{"$f":"IF(OR(C21=\"s\",C21=0),OFFSET(B21,-1,0),C21)","v":3},{"$f":"IF(OFFSET(C21,-1,0)=\"L\",1,IF(OFFSET(C21,-1,0)=1,2,IF(OR(A21=\"s\",A21=0),\"S\",IF(AND(OFFSET(C21,-1,0)=2,A21=4),3,IF(AND(OR(OFFSET(C21,-1,0)=\"s\",OFFSET(C21,-1,0)=0),A21<>\"s\",A21>OFFSET(B21,-1,0)),OFFSET(B21,-1,0),A21)))))","v":3},{"$f":"IF(OR(C21=\"S\",C21=0),0,IF(ISERROR(K21),J21,SMALL(J21:K21,1)))","v":2},{"$f":"IF($C21=1,OFFSET(E21,-1,0)+1,OFFSET(E21,-1,0))","v":1},{"$f":"IF($C21=1,0,IF($C21=2,OFFSET(F21,-1,0)+1,OFFSET(F21,-1,0)))","v":1},{"$f":"IF(AND($C21<=2,$C21<>0),0,IF($C21=3,OFFSET(G21,-1,0)+1,OFFSET(G21,-1,0)))","v":1},{"$f":"IF(AND($C21<=3,$C21<>0),0,IF($C21=4,OFFSET(H21,-1,0)+1,OFFSET(H21,-1,0)))","v":0},{"$f":"IF(AND($C21<=4,$C21<>0),0,IF(AND($C21=\"S\",$W21>0),OFFSET(I21,-1,0)+1,OFFSET(I21,-1,0)))","v":0},78,2,"F","Nível 3","Nível 3","1.1.1.","SINAPI",null,"REFORMA CAIXA D'ÁGUA","-",null,null,null,null,""]
["S",{"$f":"IF(OR(C22=\"s\",C22=0),OFFSET(B22,-1,0),C22)","v":3},{"$f":"IF(OFFSET(C22,-1,0)=\"L\",1,IF(OFFSET(C22,-1,0)=1,2,IF(OR(A22=\"s\",A22=0),\"S\",IF(AND(OFFSET(C22,-1,0)=2,A22=4),3,IF(AND(OR(OFFSET(C22,-1,0)=\"s\",OFFSET(C22,-1,0)=0),A22<>\"s\",A22>OFFSET(B22,-1,0)),OFFSET(B22,-1,0),A22)))))","v":"S"},{"$f":"IF(OR(C22=\"S\",C22=0),0,IF(ISERROR(K22),J22,SMALL(J22:K22,1)))","v":0},{"$f":"IF($C22=1,OFFSET(E22,-1,0)+1,OFFSET(E22,-1,0))","v":1},{"$f":"IF($C22=1,0,IF($C22=2,OFFSET(F22,-1,0)+1,OFFSET(F22,-1,0)))","v":1},{"$f":"IF(AND($C22<=2,$C22<>0),0,IF($C22=3,OFFSET(G22,-1,0)+1,OFFSET(G22,-1,0)))","v":1},{"$f":"IF(AND($C22<=3,$C22<>0),0,IF($C22=4,OFFSET(H22,-1,0)+1,OFFSET(H22,-1,0)))","v":0},{"$f":"IF(AND($C22<=4,$C22<>0),0,IF(AND($C22=\"S\",$W22>0),OFFSET(I22,-1,0)+1,OFFSET(I22,-1,0)))","v":0},0,0,"F","Serviço","Serviço","1.1.1.0.1.","SINAPI",88316,"SERVENTE COM ENCARGOS COMPLEMENTARES","H",8,null,null,null,""]
[3,{"$f":"IF(OR(C23=\"s\",C23=0),OFFSET(B23,-1,0),C23)","v":3},{"$f":"IF(OFFSET(C23,-1,0)=\"L\",1,IF(OFFSET(C23,-1,0)=1,2,IF(OR(A23=\"s\",A23=0),\"S\",IF(AND(OFFSET(C23,-1,0)=2,A23=4),3,IF(AND(OR(OFFSET(C23,-1,0)=\"s\",OFFSET(C23,-1,0)=0),A23<>\"s\",A23>OFFSET(B23,-1,0)),OFFSET(B23,-1,0),A23)))))","v":3},{"$f":"IF(OR(C23=\"S\",C23=0),0,IF(ISERROR(K23),J23,SMALL(J23:K23,1)))","v":4},{"$f":"IF($C23=1,OFFSET(E23,-1,0)+1,OFFSET(E23,-1,0))","v":1},{"$f":"IF($C23=1,0,IF($C23=2,OFFSET(F23,-1,0)+1,OFFSET(F23,-1,0)))","v":1},{"$f":"IF(AND($C23<=2,$C23<>0),0,IF($C23=3,OFFSET(G23,-1,0)+1,OFFSET(G23,-1,0)))","v":2},{"$f":"IF(AND($C23<=3,$C23<>0),0,IF($C23=4,OFFSET(H23,-1,0)+1,OFFSET(H23,-1,0)))","v":0},{"$f":"IF(AND($C23<=4,$C23<>0),0,IF(AND($C23=\"S\",$W23>0),OFFSET(I23,-1,0)+1,OFFSET(I23,-1,0)))","v":0},76,4,"F","Nível 3","Nível 3","1.1.2.","SINAPI",null,"REFORMA DA COBERTURA","-",null,null,null,null,""]
["S",3,"S",0,1,1,2,0,0,0,0,"F","Serviço","Serviço","1.1.2.0.1.","AGETOP",20103,"DEMOLIÇÃO ESTRUTURA EM MADEIRA TELHADO C/ TRANSP. ATÉ CB. E CARGA","m2    ",20,null,null,null,""]
["S",3,"S",0,1,1,2,0,0,0,0,"F","Serviço","Serviço","1.1.2.0.2.","AGETOP",20102,"DEMOLICAO-COBERTURA TELHA FIBROCIMENTO/FIBRA DE VIDRO/SIMILARES C/ TRANSP. ATÉ CB. E CARGA","m2    ",78,null,null,null,""]
["S",3,"S",0,1,1,2,0,0,0,0,"F","Serviço","Serviço","1.1.2.0.3.","AGETOP",20157,"DEMOLIÇÃO CALHAS/ RUFOS EM CHAPA C/TR.AT.C.B.E CARGA","m2    ",41,null,null,null,""]
[3,3,3,12,1,1,3,0,0,72,12,"F","Nível 3","Nível 3","1.1.3.","SINAPI",null,"REFORMA GERAL WC FEM","-",null,null,null,null,""]
[{"$f":"CHOOSE(1+LOG(1+2*(ORÇAMENTO.Nivel=\"Nível 1\")+4*(ORÇAMENTO.Nivel=\"Nível 2\")+8*(ORÇAMENTO.Nivel=\"Nível 3\")+16*(ORÇAMENTO.Nivel=\"Nível 4\")+32*(ORÇAMENTO.Nivel=\"Serviço\"),2),0,1,2,3,4,\"S\")","v":"S"},{"$f":"IF(OR(C28=\"s\",C28=0),OFFSET(B28,-1,0),C28)","v":3},{"$f":"IF(OFFSET(C28,-1,0)=\"L\",1,IF(OFFSET(C28,-1,0)=1,2,IF(OR(A28=\"s\",A28=0),\"S\",IF(AND(OFFSET(C28,-1,0)=2,A28=4),3,IF(AND(OR(OFFSET(C28,-1,0)=\"s\",OFFSET(C28,-1,0)=0),A28<>\"s\",A28>OFFSET(B28,-1,0)),OFFSET(B28,-1,0),A28)))))","v":"S"},{"$f":"IF(OR(C28=\"S\",C28=0),0,IF(ISERROR(K28),J28,SMALL(J28:K28,1)))","v":0},{"$f":"IF($C28=1,OFFSET(E28,-1,0)+1,OFFSET(E28,-1,0))","v":1},{"$f":"IF($C28=1,0,IF($C28=2,OFFSET(F28,-1,0)+1,OFFSET(F28,-1,0)))","v":1},{"$f":"IF(AND($C28<=2,$C28<>0),0,IF($C28=3,OFFSET(G28,-1,0)+1,OFFSET(G28,-1,0)))","v":3},{"$f":"IF(AND($C28<=3,$C28<>0),0,IF($C28=4,OFFSET(H28,-1,0)+1,OFFSET(H28,-1,0)))","v":0},{"$f":"IF(AND($C28<=4,$C28<>0),0,IF(AND($C28=\"S\",$W28>0),OFFSET(I28,-1,0)+1,OFFSET(I28,-1,0)))","v":0},0,0,"F","Serviço","Serviço","1.1.3.0.1.","SINAPI",97644,"REMOÇÃO DE PORTAS, DE FORMA MANUAL, SEM REAPROVEITAMENTO. AF_12/2017","M2",14,null,null,null,"Referência: AGETOP - 20106"]
["S",3,"S",0,1,1,3,0,0,0,0,"F","Serviço","Serviço","1.1.3.0.2.","SINAPI",97645,"REMOÇÃO DE JANELAS, DE FORMA MANUAL, SEM REAPROVEITAMENTO. AF_12/2017","M2",1.5,null,null,null,"Referência: AGETOP - 20106"]
["S",3,"S",0,1,1,3,0,0,0,0,"F","Serviço","Serviço","1.1.3.0.3.","SINAPI",97622,"DEMOLIÇÃO DE ALVENARIA DE BLOCO FURADO, DE FORMA MANUAL, SEM REAPROVEITAMENTO. AF_12/2017","M3",0.22,null,null,null,"Referência: AGETOP - 20118"]
["S",3,"S",0,1,1,3,0,0,0,0,"F","Serviço","Serviço","1.1.3.0.4.","AGETOP",20134,"DEM.DE FORRO GESSO C/TRANSP.ATE CB.E CARGA","m2    ",15.04,null,null,null,""]
[{"$f":"CHOOSE(1+LOG(1+2*(ORÇAMENTO.Nivel=\"Nível 1\")+4*(ORÇAMENTO.Nivel=\"Nível 2\")+8*(ORÇAMENTO.Nivel=\"Nível 3\")+16*(ORÇAMENTO.Nivel=\"Nível 4\")+32*(ORÇAMENTO.Nivel=\"Serviço\"),2),0,1,2,3,4,\"S\")","v":"S"},{"$f":"IF(OR(C32=\"s\",C32=0),OFFSET(B32,-1,0),C32)","v":3},{"$f":"IF(OFFSET(C32,-1,0)=\"L\",1,IF(OFFSET(C32,-1,0)=1,2,IF(OR(A32=\"s\",A32=0),\"S\",IF(AND(OFFSET(C32,-1,0)=2,A32=4),3,IF(AND(OR(OFFSET(C32,-1,0)=\"s\",OFFSET(C32,-1,0)=0),A32<>\"s\",A32>OFFSET(B32,-1,0)),OFFSET(B32,-1,0),A32)))))","v":"S"},{"$f":"IF(OR(C32=\"S\",C32=0),0,IF(ISERROR(K32),J32,SMALL(J32:K32,1)))","v":0},{"$f":"IF($C32=1,OFFSET(E32,-1,0)+1,OFFSET(E32,-1,0))","v":1},{"$f":"IF($C32=1,0,IF($C32=2,OFFSET(F32,-1,0)+1,OFFSET(F32,-1,0)))","v":1},{"$f":"IF(AND($C32<=2,$C32<>0),0,IF($C32=3,OFFSET(G32,-1,0)+1,OFFSET(G32,-1,0)))","v":3},{"$f":"IF(AND($C32<=3,$C32<>0),0,IF($C32=4,OFFSET(H32,-1,0)+1,OFFSET(H32,-1,0)))","v":0},{"$f":"IF(AND($C32<=4,$C32<>0),0,IF(AND($C32=\"S\",$W32>0),OFFSET(I32,-1,0)+1,OFFSET(I32,-1,0)))","v":0},0,0,"F","Serviço","Serviço","1.1.3.0.5.","SINAPI",97633,"DEMOLIÇÃO DE REVESTIMENTO CERÂMICO, DE FORMA MANUAL, SEM REAPROVEITAMENTO. AF_12/2017","M2",69,null,null,null,"Referência: AGETOP - 20115"]
["S",{"$f":"IF(OR(C33=\"s\",C33=0),OFFSET(B33,-1,0),C33)","v":3},{"$f":"IF(OFFSET(C33,-1,0)=\"L\",1,IF(OFFSET(C33,-1,0)=1,2,IF(OR(A33=\"s\",A33=0),\"S\",IF(AND(OFFSET(C33,-1,0)=2,A33=4),3,IF(AND(OR(OFFSET(C33,-1,0)=\"s\",OFFSET(C33,-1,0)=0),A33<>\"s\",A33>OFFSET(B33,-1,0)),OFFSET(B33,-1,0),A33)))))","v":"S"},{"$f":"IF(OR(C33=\"S\",C33=0),0,IF(ISERROR(K33),J33,SMALL(J33:K33,1)))","v":0},{"$f":"IF($C33=1,OFFSET(E33,-1,0)+1,OFFSET(E33,-1,0))","v":1},{"$f":"IF($C33=1,0,IF($C33=2,OFFSET(F33,-1,0)+1,OFFSET(F33,-1,0)))","v":1},{"$f":"IF(AND($C33<=2,$C33<>0),0,IF($C33=3,OFFSET(G33,-1,0)+1,OFFSET(G33,-1,0)))","v":3},{"$f":"IF(AND($C33<=3,$C33<>0),0,IF($C33=4,OFFSET(H33,-1,0)+1,OFFSET(H33,-1,0)))","v":0},{"$f":"IF(AND($C33<=4,$C33<>0),0,IF(AND($C33=\"S\",$W33>0),OFFSET(I33,-1,0)+1,OFFSET(I33,-1,0)))","v":0},0,0,"F","Serviço","Serviço","1.1.3.0.6.","AGETOP",20139,"DEMOLIÇAO DE BANCADAS C/ TRANSP. ATÉ CB. E CARGA","m2    ",1.46,null,null,null,""]
["S",3,"S",0,1,1,3,0,0,0,0,"F","Serviço","Serviço","1.1.3.0.7.","AGETOP",20151,"DEMOL.DIVISÓRIA EM PEDRA/CONC.C/TRANSP.ATE C.B.CARGA","m2    ",14.25,null,null,null,""]
["S",3,"S",0,1,1,3,0,0,0,0,"F","Serviço","Serviço","1.1.3.0.8.","AGETOP",20109,"DEM.PISO CIMENT.SOBRE LASTRO CONC.C/TR.ATE CB. E CARGA","m2    ",14.65,null,null,null,""]
["S",3,"S",0,1,1,3,0,0,0,0,"F","Serviço","Serviço","1.1.3.0.9.","AGETOP",20163,"DEMOLIÇÃO DAS INSTALAÇÕES HIDROSANITÁRIAS E AFINS C/ TRANSP. ATÉ CB. E CARGA","H     ",4,null,null,null,""]
["S",3,"S",0,1,1,3,0,0,0,0,"F","Serviço","Serviço","1.1.3.0.10.","AGETOP",20137,"DEMOLIÇAO BACIA SANITARIA C/ TRANSP. ATÉ CB. E CARGA","Un    ",8,null,null,null,""]
["S",3,"S",0,1,1,3,0,0,0,0,"F","Serviço","Serviço","1.1.3.0.11.","AGETOP",20140,"DEMOLIÇAO DE VÁLVULA DE DESCARGA C/ TRANSP. ATÉ CB. E CARGA","Un    ",8,null,null,null,""]
[3,3,3,13,1,1,4,0,0,60,13,"F","Nível 3","Nível 3","1.1.4.","SINAPI",null,"REFORMA GERAL WC MASC","-",null,null,null,null,""]
[{"$f":"CHOOSE(1+LOG(1+2*(ORÇAMENTO.Nivel=\"Nível 1\")+4*(ORÇAMENTO.Nivel=\"Nível 2\")+8*(ORÇAMENTO.Nivel=\"Nível 3\")+16*(ORÇAMENTO.Nivel=\"Nível 4\")+32*(ORÇAMENTO.Nivel=\"Serviço\"),2),0,1,2,3,4,\"S\")","v":"S"},{"$f":"IF(OR(C40=\"s\",C40=0),OFFSET(B40,-1,0),C40)","v":3},{"$f":"IF(OFFSET(C40,-1,0)=\"L\",1,IF(OFFSET(C40,-1,0)=1,2,IF(OR(A40=\"s\",A40=0),\"S\",IF(AND(OFFSET(C40,-1,0)=2,A40=4),3,IF(AND(OR(OFFSET(C40,-1,0)=\"s\",OFFSET(C40,-1,0)=0),A40<>\"s\",A40>OFFSET(B40,-1,0)),OFFSET(B40,-1,0),A40)))))","v":"S"},{"$f":"IF(OR(C40=\"S\",C40=0),0,IF(ISERROR(K40),J40,SMALL(J40:K40,1)))","v":0},{"$f":"IF($C40=1,OFFSET(E40,-1,0)+1,OFFSET(E40,-1,0))","v":1},{"$f":"IF($C40=1,0,IF($C40=2,OFFSET(F40,-1,0)+1,OFFSET(F40,-1,0)))","v":1},{"$f":"IF(AND($C40<=2,$C40<>0),0,IF($C40=3,OFFSET(G40,-1,0)+1,OFFSET(G40,-1,0)))","v":4},{"$f":"IF(AND($C40<=3,$C40<>0),0,IF($C40=4,OFFSET(H40,-1,0)+1,OFFSET(H40,-1,0)))","v":0},{"$f":"IF(AND($C40<=4,$C40<>0),0,IF(AND($C40=\"S\",$W40>0),OFFSET(I40,-1,0)+1,OFFSET(I40,-1,0)))","v":0},0,0,"F","Serviço","Serviço","1.1.4.0.1.","SINAPI",97644,"REMOÇÃO DE PORTAS, DE FORMA MANUAL, SEM REAPROVEITAMENTO. AF_12/2017","M2",14,null,null,null,"Referência: AGETOP - 20106"]
["S",3,"S",0,1,1,4,0,0,0,0,"F","Serviço","Serviço","1.1.4.0.2.","SINAPI",97645,"REMOÇÃO DE JANELAS, DE FORMA MANUAL, SEM REAPROVEITAMENTO. AF_12/2017","M2",1.5,null,null,null,"Referência: AGETOP - 20106"]
["S",3,"S",0,1,1,4,0,0,0,0,"F","Serviço","Serviço","1.1.4.0.3.","SINAPI",97622,"DEMOLIÇÃO DE ALVENARIA DE BLOCO FURADO, DE FORMA MANUAL, SEM REAPROVEITAMENTO. AF_12/2017","M3",0.22,null,null,null,"Referência: AGETOP - 20118"]
["S",3,"S",0,1,1,4,0,0,0,0,"F","Serviço","Serviço","1.1.4.0.4.","AGETOP",20134,"DEM.DE FORRO GESSO C/TRANSP.ATE CB.E CARGA","m2    ",15.04,null,null,null,""]
["S",3,"S",0,1,1,4,0,0,0,0,"F","Serviço","Serviço","1.1.4.0.5.","SINAPI",97633,"DEMOLIÇÃO DE REVESTIMENTO CERÂMICO, DE FORMA MANUAL, SEM REAPROVEITAMENTO. AF_12/2017","M2",69,null,null,null,"Referência: AGETOP - 20115"]
["S",3,"S",0,1,1,4,0,0,0,0,"F","Serviço","Serviço","1.1.4.0.6.","AGETOP",20139,"DEMOLIÇAO DE BANCADAS C/ TRANSP. ATÉ CB. E CARGA","m2    ",1.46,null,null,null,""]
["S",3,"S",0,1,1,4,0,0,0,0,"F","Serviço","Serviço","1.1.4.0.7.","AGETOP",20151,"DEMOL.DIVISÓRIA EM PEDRA/CONC.C/TRANSP.ATE C.B.CARGA","m2    ",14.25,null,null,null,""]
["S",3,"S",0,1,1,4,0,0,0,0,"F","Serviço","Serviço","1.1.4.0.8.","AGETOP",20109,"DEM.PISO CIMENT.SOBRE LASTRO CONC.C/TR.ATE CB. E CARGA","m2    ",14.65,null,null,null,""]
["S",3,"S",0,1,1,4,0,0,0,0,"F","Serviço","Serviço","1.1.4.0.9.","AGETOP",20163,"DEMOLIÇÃO DAS INSTALAÇÕES HIDROSANITÁRIAS E AFINS C/ TRANSP. ATÉ CB. E CARGA","H     ",4,null,null,null,""]
["S",{"$f":"IF(OR(C49=\"s\",C49=0),OFFSET(B49,-1,0),C49)","v":3},{"$f":"IF(OFFSET(C49,-1,0)=\"L\",1,IF(OFFSET(C49,-1,0)=1,2,IF(OR(A49=\"s\",A49=0),\"S\",IF(AND(OFFSET(C49,-1,0)=2,A49=4),3,IF(AND(OR(OFFSET(C49,-1,0)=\"s\",OFFSET(C49,-1,0)=0),A49<>\"s\",A49>OFFSET(B49,-1,0)),OFFSET(B49,-1,0),A49)))))","v":"S"},{"$f":"IF(OR(C49=\"S\",C49=0),0,IF(ISERROR(K49),J49,SMALL(J49:K49,1)))","v":0},{"$f":"IF($C49=1,OFFSET(E49,-1,0)+1,OFFSET(E49,-1,0))","v":1},{"$f":"IF($C49=1,0,IF($C49=2,OFFSET(F49,-1,0)+1,OFFSET(F49,-1,0)))","v":1},{"$f":"IF(AND($C49<=2,$C49<>0),0,IF($C49=3,OFFSET(G49,-1,0)+1,OFFSET(G49,-1,0)))","v":4},{"$f":"IF(AND($C49<=3,$C49<>0),0,IF($C49=4,OFFSET(H49,-1,0)+1,OFFSET(H49,-1,0)))","v":0},{"$f":"IF(AND($C49<=4,$C49<>0),0,IF(AND($C49=\"S\",$W49>0),OFFSET(I49,-1,0)+1,OFFSET(I49,-1,0)))","v":0},0,0,"F","Serviço","Serviço","1.1.4.0.10.","AGETOP",20137,"DEMOLIÇAO BACIA SANITARIA C/ TRANSP. ATÉ CB. E CARGA","Un    ",8,null,null,null,""]
["S",{"$f":"IF(OR(C50=\"s\",C50=0),OFFSET(B50,-1,0),C50)","v":3},{"$f":"IF(OFFSET(C50,-1,0)=\"L\",1,IF(OFFSET(C50,-1,0)=1,2,IF(OR(A50=\"s\",A50=0),\"S\",IF(AND(OFFSET(C50,-1,0)=2,A50=4),3,IF(AND(OR(OFFSET(C50,-1,0)=\"s\",OFFSET(C50,-1,0)=0),A50<>\"s\",A50>OFFSET(B50,-1,0)),OFFSET(B50,-1,0),A50)))))","v":"S"},{"$f":"IF(OR(C50=\"S\",C50=0),0,IF(ISERROR(K50),J50,SMALL(J50:K50,1)))","v":0},{"$f":"IF($C50=1,OFFSET(E50,-1,0)+1,OFFSET(E50,-1,0))","v":1},{"$f":"IF($C50=1,0,IF($C50=2,OFFSET(F50,-1,0)+1,OFFSET(F50,-1,0)))","v":1},{"$f":"IF(AND($C50<=2,$C50<>0),0,IF($C50=3,OFFSET(G50,-1,0)+1,OFFSET(G50,-1,0)))","v":4},{"$f":"IF(AND($C50<=3,$C50<>0),0,IF($C50=4,OFFSET(H50,-1,0)+1,OFFSET(H50,-1,0)))","v":0},{"$f":"IF(AND($C50<=4,$C50<>0),0,IF(AND($C50=\"S\",$W50>0),OFFSET(I50,-1,0)+1,OFFSET(I50,-1,0)))","v":0},0,0,"F","Serviço","Serviço","1.1.4.0.11.","AGETOP",20140,"DEMOLIÇAO DE VÁLVULA DE DESCARGA C/ TRANSP. ATÉ CB. E CARGA","Un    ",8,null,null,null,""]
["S",{"$f":"IF(OR(C51=\"s\",C51=0),OFFSET(B51,-1,0),C51)","v":3},{"$f":"IF(OFFSET(C51,-1,0)=\"L\",1,IF(OFFSET(C51,-1,0)=1,2,IF(OR(A51=\"s\",A51=0),\"S\",IF(AND(OFFSET(C51,-1,0)=2,A51=4),3,IF(AND(OR(OFFSET(C51,-1,0)=\"s\",OFFSET(C51,-1,0)=0),A51<>\"s\",A51>OFFSET(B51,-1,0)),OFFSET(B51,-1,0),A51)))))","v":"S"},{"$f":"IF(OR(C51=\"S\",C51=0),0,IF(ISERROR(K51),J51,SMALL(J51:K51,1)))","v":0},{"$f":"IF($C51=1,OFFSET(E51,-1,0)+1,OFFSET(E51,-1,0))","v":1},{"$f":"IF($C51=1,0,IF($C51=2,OFFSET(F51,-1,0)+1,OFFSET(F51,-1,0)))","v":1},{"$f":"IF(AND($C51<=2,$C51<>0),0,IF($C51=3,OFFSET(G51,-1,0)+1,OFFSET(G51,-1,0)))","v":4},{"$f":"IF(AND($C51<=3,$C51<>0),0,IF($C51=4,OFFSET(H51,-1,0)+1,OFFSET(H51,-1,0)))","v":0},{"$f":"IF(AND($C51<=4,$C51<>0),0,IF(AND($C51=\"S\",$W51>0),OFFSET(I51,-1,0)+1,OFFSET(I51,-1,0)))","v":0},0,0,"F","Serviço","Serviço","1.1.4.0.12.","AGETOP",20146,"DEMOLIÇÃO DE MICTÓRIO C/ TRANSP. ATÉ CB. E CARGA","Un    ",3,null,null,null,""]
[3,{"$f":"IF(OR(C52=\"s\",C52=0),OFFSET(B52,-1,0),C52)","v":3},{"$f":"IF(OFFSET(C52,-1,0)=\"L\",1,IF(OFFSET(C52,-1,0)=1,2,IF(OR(A52=\"s\",A52=0),\"S\",IF(AND(OFFSET(C52,-1,0)=2,A52=4),3,IF(AND(OR(OFFSET(C52,-1,0)=\"s\",OFFSET(C52,-1,0)=0),A52<>\"s\",A52>OFFSET(B52,-1,0)),OFFSET(B52,-1,0),A52)))))","v":3},{"$f":"IF(OR(C52=\"S\",C52=0),0,IF(ISERROR(K52),J52,SMALL(J52:K52,1)))","v":7},{"$f":"IF($C52=1,OFFSET(E52,-1,0)+1,OFFSET(E52,-1,0))","v":1},{"$f":"IF($C52=1,0,IF($C52=2,OFFSET(F52,-1,0)+1,OFFSET(F52,-1,0)))","v":1},{"$f":"IF(AND($C52<=2,$C52<>0),0,IF($C52=3,OFFSET(G52,-1,0)+1,OFFSET(G52,-1,0)))","v":5},{"$f":"IF(AND($C52<=3,$C52<>0),0,IF($C52=4,OFFSET(H52,-1,0)+1,OFFSET(H52,-1,0)))","v":0},{"$f":"IF(AND($C52<=4,$C52<>0),0,IF(AND($C52=\"S\",$W52>0),OFFSET(I52,-1,0)+1,OFFSET(I52,-1,0)))","v":0},47,7,"F","Nível 3","Nível 3","1.1.5.","SINAPI",null,"REFORMA WC FUNCIONÁRIOS","-",null,null,null,null,""]
["S",3,"S",0,1,1,5,0,0,0,0,"F","Serviço","Serviço","1.1.5.0.1.","AGETOP",20109,"DEM.PISO CIMENT.SOBRE LASTRO CONC.C/TR.ATE CB. E CARGA","m2    ",4.12,null,null,null,""]
["S",3,"S",0,1,1,5,0,0,0,0,"F","Serviço","Serviço","1.1.5.0.2.","SINAPI",97633,"DEMOLIÇÃO DE REVESTIMENTO CERÂMICO, DE FORMA MANUAL, SEM REAPROVEITAMENTO. AF_12/2017","M2",21.42,null,null,null,"Referência: AGETOP - 20115"]
["S",3,"S",0,1,1,5,0,0,0,0,"F","Serviço","Serviço","1.1.5.0.3.","SINAPI",97644,"REMOÇÃO DE PORTAS, DE FORMA MANUAL, SEM REAPROVEITAMENTO. AF_12/2017","M2",2.94,null,null,null,"Referência: AGETOP - 20106"]
["S",3,"S",0,1,1,5,0,0,0,0,"F","Serviço","Serviço","1.1.5.0.4.","AGETOP",20137,"DEMOLIÇAO BACIA SANITARIA C/ TRANSP. ATÉ CB. E CARGA","Un    ",2,null,null,null,""]
["S",3,"S",0,1,1,5,0,0,0,0,"F","Serviço","Serviço","1.1.5.0.5.","AGETOP",20141,"DEMOLIÇAO DE CAIXA DESCARGA EXTERNA C/ TRANSP. ATÉ CB. E CARGA","Un    ",2,null,null,null,""]
["S",3,"S",0,1,1,5,0,0,0,0,"F","Serviço","Serviço","1.1.5.0.6.","AGETOP",20138,"DEMOLIÇAO DE LAVATÓRIO C/ TRANSP. ATÉ CB. E CARGA","Un    ",2,null,null,null,""]
[3,3,3,2,1,1,6,0,0,40,2,"F","Nível 3","Nível 3","1.1.6.","SINAPI",null,"LOCAL DE SAÍDA DOS ALUNOS","-",null,null,null,null,""]
["S",3,"S",0,1,1,6,0,0,0,0,"F","Serviço","Serviço","1.1.6.0.1.","AGETOP",20109,"DEM.PISO CIMENT.SOBRE LASTRO CONC.C/TR.ATE CB. E CARGA","m2    ",80.209999999999994,null,null,null,""]
[{"$f":"CHOOSE(1+LOG(1+2*(ORÇAMENTO.Nivel=\"Nível 1\")+4*(ORÇAMENTO.Nivel=\"Nível 2\")+8*(ORÇAMENTO.Nivel=\"Nível 3\")+16*(ORÇAMENTO.Nivel=\"Nível 4\")+32*(ORÇAMENTO.Nivel=\"Serviço\"),2),0,1,2,3,4,\"S\")","v":3},3,3,2,1,1,7,0,0,38,2,"F","Nível 3","Nível 3","1.1.7.","SINAPI",null,"SALAS DE AULA / LAB. / BIBLIO. / AUDIT.","-",null,null,null,null,""]
["S",3,"S",0,1,1,7,0,0,0,0,"F","Serviço","Serviço","1.1.7.0.1.","SINAPI",97645,"REMOÇÃO DE JANELAS, DE FORMA MANUAL, SEM REAPROVEITAMENTO. AF_12/2017","M2",168.13,null,null,null,"Referência: AGETOP - 20106"]
[3,3,3,2,1,1,8,0,0,36,2,"F","Nível 3","Nível 3","1.1.8.","SINAPI",null,"REFORMA QUADRA COBERTA","-",null,null,null,null,""]
["S",3,"S",0,1,1,8,0,0,0,0,"F","Serviço","Serviço","1.1.8.0.1.","AGETOP",20100,"DEMOLIÇÃO - COBERTURA TELHA METÁLICA C/ TRANSP. ATÉ CB. E CARGA","m2    ",406.97,null,null,null,""]
[3,3,3,2,1,1,9,0,0,34,2,"F","Nível 3","Nível 3","1.1.9.","SINAPI",null,"SALA DO CAF","-",null,null,null,null,""]
["S",3,"S",0,1,1,9,0,0,0,0,"F","Serviço","Serviço","1.1.9.0.1.","SINAPI",97622,"DEMOLIÇÃO DE ALVENARIA DE BLOCO FURADO, DE FORMA MANUAL, SEM REAPROVEITAMENTO. AF_12/2017","M3",1.62,null,null,null,"Referência: AGETOP - 20118"]
[3,3,3,2,1,1,10,0,0,32,2,"F","Nível 3","Nível 3","1.1.10.","SINAPI",null,"PINTURA GERAL","-",null,null,null,null,""]
["S",3,"S",0,1,1,10,0,0,0,0,"F","Serviço","Serviço","1.1.10.0.1.","AGETOP",20117,"DEMOL.REVEST.C/ARGAMASSA C/TR.ATE CB.E CARGA","m2    ",100.8,null,null,null,""]
[3,3,3,2,1,1,11,0,0,30,2,"F","Nível 3","Nível 3","1.1.11.","SINAPI",null,"CONSTRUÇÃO WC ACESSÍVEL","-",null,null,null,null,""]
["S",3,"S",0,1,1,11,0,0,0,0,"F","Serviço","Serviço","1.1.11.0.1.","AGETOP",20109,"DEM.PISO CIMENT.SOBRE LASTRO CONC.C/TR.ATE CB. E CARGA","m2    ",11.6,null,null,null,""]
[3,{"$f":"IF(OR(C71=\"s\",C71=0),OFFSET(B71,-1,0),C71)","v":3},{"$f":"IF(OFFSET(C71,-1,0)=\"L\",1,IF(OFFSET(C71,-1,0)=1,2,IF(OR(A71=\"s\",A71=0),\"S\",IF(AND(OFFSET(C71,-1,0)=2,A71=4),3,IF(AND(OR(OFFSET(C71,-1,0)=\"s\",OFFSET(C71,-1,0)=0),A71<>\"s\",A71>OFFSET(B71,-1,0)),OFFSET(B71,-1,0),A71)))))","v":3},{"$f":"IF(OR(C71=\"S\",C71=0),0,IF(ISERROR(K71),J71,SMALL(J71:K71,1)))","v":10},{"$f":"IF($C71=1,OFFSET(E71,-1,0)+1,OFFSET(E71,-1,0))","v":1},{"$f":"IF($C71=1,0,IF($C71=2,OFFSET(F71,-1,0)+1,OFFSET(F71,-1,0)))","v":1},{"$f":"IF(AND($C71<=2,$C71<>0),0,IF($C71=3,OFFSET(G71,-1,0)+1,OFFSET(G71,-1,0)))","v":12},{"$f":"IF(AND($C71<=3,$C71<>0),0,IF($C71=4,OFFSET(H71,-1,0)+1,OFFSET(H71,-1,0)))","v":0},{"$f":"IF(AND($C71<=4,$C71<>0),0,IF(AND($C71=\"S\",$W71>0),OFFSET(I71,-1,0)+1,OFFSET(I71,-1,0)))","v":0},28,10,"F","Nível 3","Nível 3","1.1.12.","SINAPI",null,"REFORMA E AMPLIAÇÃO DA COZINHA","-",null,null,null,null,""]
["S",{"$f":"IF(OR(C72=\"s\",C72=0),OFFSET(B72,-1,0),C72)","v":3},{"$f":"IF(OFFSET(C72,-1,0)=\"L\",1,IF(OFFSET(C72,-1,0)=1,2,IF(OR(A72=\"s\",A72=0),\"S\",IF(AND(OFFSET(C72,-1,0)=2,A72=4),3,IF(AND(OR(OFFSET(C72,-1,0)=\"s\",OFFSET(C72,-1,0)=0),A72<>\"s\",A72>OFFSET(B72,-1,0)),OFFSET(B72,-1,0),A72)))))","v":"S"},{"$f":"IF(OR(C72=\"S\",C72=0),0,IF(ISERROR(K72),J72,SMALL(J72:K72,1)))","v":0},{"$f":"IF($C72=1,OFFSET(E72,-1,0)+1,OFFSET(E72,-1,0))","v":1},{"$f":"IF($C72=1,0,IF($C72=2,OFFSET(F72,-1,0)+1,OFFSET(F72,-1,0)))","v":1},{"$f":"IF(AND($C72<=2,$C72<>0),0,IF($C72=3,OFFSET(G72,-1,0)+1,OFFSET(G72,-1,0)))","v":12},{"$f":"IF(AND($C72<=3,$C72<>0),0,IF($C72=4,OFFSET(H72,-1,0)+1,OFFSET(H72,-1,0)))","v":0},{"$f":"IF(AND($C72<=4,$C72<>0),0,IF(AND($C72=\"S\",$W72>0),OFFSET(I72,-1,0)+1,OFFSET(I72,-1,0)))","v":0},0,0,"F","Serviço","Serviço","1.1.12.0.1.","SINAPI",97622,"DEMOLIÇÃO DE ALVENARIA DE BLOCO FURADO, DE FORMA MANUAL, SEM REAPROVEITAMENTO. AF_12/2017","M3",3.12,null,null,null,"Referência: AGETOP - 20118"]
["S",3,"S",0,1,1,12,0,0,0,0,"F","Serviço","Serviço","1.1.12.0.2.","AGETOP",20121,"DEM. MANUAL EM CONCR.SIMPLES C/TR.ATE CB.E CARGA (O.C.)","m3    ",0.09,null,null,null,""]
["S",3,"S",0,1,1,12,0,0,0,0,"F","Serviço","Serviço","1.1.12.0.3.","SINAPI",97644,"REMOÇÃO DE PORTAS, DE FORMA MANUAL, SEM REAPROVEITAMENTO. AF_12/2017","M2",7.6,null,null,null,"Referência: AGETOP - 20106"]
["S",3,"S",0,1,1,12,0,0,0,0,"F","Serviço","Serviço","1.1.12.0.4.","SINAPI",97633,"DEMOLIÇÃO DE REVESTIMENTO CERÂMICO, DE FORMA MANUAL, SEM REAPROVEITAMENTO. AF_12/2017","M2",41.93,null,null,null,"Referência: AGETOP - 20115"]
["S",3,"S",0,1,1,12,0,0,0,0,"F","Serviço","Serviço","1.1.12.0.5.","AGETOP",20111,"DEM.PISO CERAM.SOBRE LASTRO CONC.C/TR.CB.E CARGA","m2    ",4.32,null,null,null,""]
["S",3,"S",0,1,1,12,0,0,0,0,"F","Serviço","Serviço","1.1.12.0.6.","SINAPI",97645,"REMOÇÃO DE JANELAS, DE FORMA MANUAL, SEM REAPROVEITAMENTO. AF_12/2017","M2",7.8,null,null,null,"Referência: AGETOP - 20106"]
["S",3,"S",0,1,1,12,0,0,0,0,"F","Serviço","Serviço","1.1.12.0.7.","AGETOP",20163,"DEMOLIÇÃO DAS INSTALAÇÕES HIDROSANITÁRIAS E AFINS C/ TRANSP. ATÉ CB. E CARGA","H     ",6,null,null,null,""]
["S",3,"S",0,1,1,12,0,0,0,0,"F","Serviço","Serviço","1.1.12.0.8.","AGETOP",72080,"POSTE/TRAFO - CAMINHÃO MUNCK 12 TON. (MÍNIMO 4H/DIA)","H     ",4,null,null,null,""]
["S",3,"S",0,1,1,12,0,0,0,0,"F","Serviço","Serviço","1.1.12.0.9.","AGETOP",20139,"DEMOLIÇAO DE BANCADAS C/ TRANSP. ATÉ CB. E CARGA","m2    ",1.7,null,null,null,""]
[3,{"$f":"IF(OR(C81=\"s\",C81=0),OFFSET(B81,-1,0),C81)","v":3},{"$f":"IF(OFFSET(C81,-1,0)=\"L\",1,IF(OFFSET(C81,-1,0)=1,2,IF(OR(A81=\"s\",A81=0),\"S\",IF(AND(OFFSET(C81,-1,0)=2,A81=4),3,IF(AND(OR(OFFSET(C81,-1,0)=\"s\",OFFSET(C81,-1,0)=0),A81<>\"s\",A81>OFFSET(B81,-1,0)),OFFSET(B81,-1,0),A81)))))","v":3},{"$f":"IF(OR(C81=\"S\",C81=0),0,IF(ISERROR(K81),J81,SMALL(J81:K81,1)))","v":3},{"$f":"IF($C81=1,OFFSET(E81,-1,0)+1,OFFSET(E81,-1,0))","v":1},{"$f":"IF($C81=1,0,IF($C81=2,OFFSET(F81,-1,0)+1,OFFSET(F81,-1,0)))","v":1},{"$f":"IF(AND($C81<=2,$C81<>0),0,IF($C81=3,OFFSET(G81,-1,0)+1,OFFSET(G81,-1,0)))","v":13},{"$f":"IF(AND($C81<=3,$C81<>0),0,IF($C81=4,OFFSET(H81,-1,0)+1,OFFSET(H81,-1,0)))","v":0},{"$f":"IF(AND($C81<=4,$C81<>0),0,IF(AND($C81=\"S\",$W81>0),OFFSET(I81,-1,0)+1,OFFSET(I81,-1,0)))","v":0},18,3,"F","Nível 3","Nível 3","1.1.13.","SINAPI",null,"INSTALAÇÃO PLATAFORMA ELEVATÓRIA","-",null,null,null,null,""]
["S",3,"S",0,1,1,13,0,0,0,0,"F","Serviço","Serviço","1.1.13.0.1.","AGETOP",20109,"DEM.PISO CIMENT.SOBRE LASTRO CONC.C/TR.ATE CB. E CARGA","m2    ",3.5,null,null,null,""]
["S",3,"S",0,1,1,13,0,0,{"$f":"IF(OR($C83=\"S\",$C83=0),0,MATCH(0,OFFSET($D83,1,$C83,ROW($C$839)-ROW($C83)),0))","v":0},{"$f":"IF(OR($C83=\"S\",$C83=0),0,MATCH(OFFSET($D83,0,$C83)+1,OFFSET($D83,1,$C83,ROW($C$839)-ROW($C83)),0))","v":0},"F","Serviço","Serviço","1.1.13.0.2.","COMPOSIÇÃO","COMP 010_SEE","DEMOLIÇÃO DE GRADE/GRELHA/CORRIMÃO/GUARDA CORPO - METÁLICO","M2",1.92,null,null,null,""]
[3,3,3,5,1,1,14,0,0,15,5,"F","Nível 3","Nível 3","1.1.14.","SINAPI",null,"ACESSIBILIDADE","-",null,null,null,null,""]
["S",3,"S",0,1,1,14,0,0,0,0,"F","Serviço","Serviço","1.1.14.0.1.","COMPOSIÇÃO","COMP 010_SEE","DEMOLIÇÃO DE GRADE/GRELHA/CORRIMÃO/GUARDA CORPO - METÁLICO","M2",0.39,null,null,null,""]
["S",3,"S",0,1,1,14,0,0,0,0,"F","Serviço","Serviço","1.1.14.0.2.","AGETOP",20109,"DEM.PISO CIMENT.SOBRE LASTRO CONC.C/TR.ATE CB. E CARGA","m2    ",97.6,null,null,null,""]
["S",3,"S",0,1,1,14,0,0,0,0,"F","Serviço","Serviço","1.1.14.0.3.","AGETOP",20143,"DEM. MEIO FIO SEM REAPROV.C/TR.ATE C B E CARGA","m     ",19.5,null,null,null,""]
["S",{"$f":"IF(OR(C88=\"s\",C88=0),OFFSET(B88,-1,0),C88)","v":3},{"$f":"IF(OFFSET(C88,-1,0)=\"L\",1,IF(OFFSET(C88,-1,0)=1,2,IF(OR(A88=\"s\",A88=0),\"S\",IF(AND(OFFSET(C88,-1,0)=2,A88=4),3,IF(AND(OR(OFFSET(C88,-1,0)=\"s\",OFFSET(C88,-1,0)=0),A88<>\"s\",A88>OFFSET(B88,-1,0)),OFFSET(B88,-1,0),A88)))))","v":"S"},{"$f":"IF(OR(C88=\"S\",C88=0),0,IF(ISERROR(K88),J88,SMALL(J88:K88,1)))","v":0},{"$f":"IF($C88=1,OFFSET(E88,-1,0)+1,OFFSET(E88,-1,0))","v":1},{"$f":"IF($C88=1,0,IF($C88=2,OFFSET(F88,-1,0)+1,OFFSET(F88,-1,0)))","v":1},{"$f":"IF(AND($C88<=2,$C88<>0),0,IF($C88=3,OFFSET(G88,-1,0)+1,OFFSET(G88,-1,0)))","v":14},{"$f":"IF(AND($C88<=3,$C88<>0),0,IF($C88=4,OFFSET(H88,-1,0)+1,OFFSET(H88,-1,0)))","v":0},{"$f":"IF(AND($C88<=4,$C88<>0),0,IF(AND($C88=\"S\",$W88>0),OFFSET(I88,-1,0)+1,OFFSET(I88,-1,0)))","v":0},0,0,"F","Serviço","Serviço","1.1.14.0.4.","SINAPI","73859/2","CAPINA E LIMPEZA MANUAL DE TERRENO","M2",1084.78,null,null,null,""]
[{"$f":"CHOOSE(1+LOG(1+2*(ORÇAMENTO.Nivel=\"Nível 1\")+4*(ORÇAMENTO.Nivel=\"Nível 2\")+8*(ORÇAMENTO.Nivel=\"Nível 3\")+16*(ORÇAMENTO.Nivel=\"Nível 4\")+32*(ORÇAMENTO.Nivel=\"Serviço\"),2),0,1,2,3,4,\"S\")","v":3},3,3,2,1,1,15,0,0,10,2,"F","Nível 3","Nível 3","1.1.15.","SINAPI",null,"CENTRAL DE GÁS","-",null,null,null,null,""]
["S",3,"S",0,1,1,15,0,0,0,0,"F","Serviço","Serviço","1.1.15.0.1.","AGETOP",20121,"DEM. MANUAL EM CONCR.SIMPLES C/TR.ATE CB.E CARGA (O.C.)","m3    ",0.19,null,null,null,""]
[3,3,3,2,1,1,16,0,0,8,2,"F","Nível 3","Nível 3","1.1.16.","SINAPI",null,"INST. HIDROSSANITÁRIAS","-",null,null,null,null,""]
["S",3,"S",0,1,1,16,0,0,0,0,"F","Serviço","Serviço","1.1.16.0.1.","AGETOP",20121,"DEM. MANUAL EM CONCR.SIMPLES C/TR.ATE CB.E CARGA (O.C.)","m3    ",3,null,null,null,""]
[3,3,3,2,1,1,17,0,0,6,2,"F","Nível 3","Nível 3","1.1.17.","SINAPI",null,"INST. DE INCÊNDIO","-",null,null,null,null,""]
["S",3,"S",0,1,1,17,0,0,0,0,"F","Serviço","Serviço","1.1.17.0.1.","AGETOP",20121,"DEM. MANUAL EM CONCR.SIMPLES C/TR.ATE CB.E CARGA (O.C.)","m3    ",0.87,null,null,null,""]
[3,3,3,2,1,1,18,0,0,4,2,"F","Nível 3","Nível 3","1.1.18.","SINAPI",null,"INST. ELÉTRICAS","-",null,null,null,null,""]
["S",3,"S",0,1,1,18,0,0,0,0,"F","Serviço","Serviço","1.1.18.0.1.","AGETOP",20162,"DEMOLIÇÃO DAS INSTALAÇÕES ELÉTRICAS E AFINS C/ TRANSP. ATÉ CB. E CARGA","H     ",40,null,null,null,""]
[3,3,3,2,1,1,19,0,0,2,{"$error":"#N/A"},"F","Nível 3","Nível 3","1.1.19.","SINAPI",null,"OUTROS","-",null,null,null,null,""]
[{"$f":"CHOOSE(1+LOG(1+2*(ORÇAMENTO.Nivel=\"Nível 1\")+4*(ORÇAMENTO.Nivel=\"Nível 2\")+8*(ORÇAMENTO.Nivel=\"Nível 3\")+16*(ORÇAMENTO.Nivel=\"Nível 4\")+32*(ORÇAMENTO.Nivel=\"Serviço\"),2),0,1,2,3,4,\"S\")","v":"S"},3,"S",0,1,1,19,0,0,0,0,"F","Serviço","Serviço","1.1.19.0.1.","SINAPI","74209/1","PLACA DE OBRA EM CHAPA DE ACO GALVANIZADO","M2",7.5,null,null,null,"Referência: AGETOP - 21301"]
[2,{"$f":"IF(OR(C99=\"s\",C99=0),OFFSET(B99,-1,0),C99)","v":2},{"$f":"IF(OFFSET(C99,-1,0)=\"L\",1,IF(OFFSET(C99,-1,0)=1,2,IF(OR(A99=\"s\",A99=0),\"S\",IF(AND(OFFSET(C99,-1,0)=2,A99=4),3,IF(AND(OR(OFFSET(C99,-1,0)=\"s\",OFFSET(C99,-1,0)=0),A99<>\"s\",A99>OFFSET(B99,-1,0)),OFFSET(B99,-1,0),A99)))))","v":2},{"$f":"IF(OR(C99=\"S\",C99=0),0,IF(ISERROR(K99),J99,SMALL(J99:K99,1)))","v":3},{"$f":"IF($C99=1,OFFSET(E99,-1,0)+1,OFFSET(E99,-1,0))","v":1},{"$f":"IF($C99=1,0,IF($C99=2,OFFSET(F99,-1,0)+1,OFFSET(F99,-1,0)))","v":2},{"$f":"IF(AND($C99<=2,$C99<>0),0,IF($C99=3,OFFSET(G99,-1,0)+1,OFFSET(G99,-1,0)))","v":0},{"$f":"IF(AND($C99<=3,$C99<>0),0,IF($C99=4,OFFSET(H99,-1,0)+1,OFFSET(H99,-1,0)))","v":0},{"$f":"IF(AND($C99<=4,$C99<>0),0,IF(AND($C99=\"S\",$W99>0),OFFSET(I99,-1,0)+1,OFFSET(I99,-1,0)))","v":0},740,3,"F","Nível 2","Nível 2","1.2.","AGETOP",null,"TRANSPORTES","-",null,null,null,null,""]
["S",2,"S",0,1,2,0,0,0,0,0,"F","Serviço","Serviço","1.2.0.0.1.","SINAPI",72900,"TRANSPORTE DE ENTULHO COM CAMINHAO BASCULANTE 6 M3, RODOVIA PAVIMENTADA, DMT 0,5 A 1,0 KM","M3",41.959600000000009,null,null,null,""]
["S",2,"S",0,1,2,0,0,0,0,0,"F","Serviço","Serviço","1.2.0.0.2.","SINAPI",72897,"CARGA MANUAL DE ENTULHO EM CAMINHAO BASCULANTE 6 M3","M3",41.959600000000009,null,null,null,""]
[2,2,2,29,1,3,0,0,0,737,29,"F","Nível 2","Nível 2","1.3.","AGETOP",null,"SERVIÇO EM TERRA","-",null,null,null,null,""]
[3,3,3,7,1,3,1,0,0,28,7,"F","Nível 3","Nível 3","1.3.1.","SINAPI",null,"AMPLIAÇÃO DO REFEITÓRIO","-",null,null,null,null,""]
["S",3,"S",0,1,3,1,0,0,0,0,"F","Serviço","Serviço","1.3.1.0.1.","SINAPI",79480,"ESCAVACAO MECANICA CAMPO ABERTO EM SOLO EXCETO ROCHA ATE 2,00M PROFUNDIDADE","M3",6.375,null,null,null,"Referência: AGETOP - 41004"]
["S",3,"S",0,1,3,1,0,0,0,0,"F","Serviço","Serviço","1.3.1.0.2.","AGETOP",41005,"CARGA MECANIZADA","m3    ",6.375,null,null,null,""]
["S",3,"S",0,1,3,1,0,0,0,0,"F","Serviço","Serviço","1.3.1.0.3.","AGETOP",41012,"INDENIZAÇÃO DE JAZIDA","m3    ",6.375,null,null,null,""]
["S",3,"S",0,1,3,1,0,0,0,0,"F","Serviço","Serviço","1.3.1.0.4.","AGETOP",41006,"TRANSPORTE DE MATERIAL ESCAVADO M3.KM","m3km  ",63.75,null,null,null,""]
["S",3,"S",0,1,3,1,0,0,0,0,"F","Serviço","Serviço","1.3.1.0.5.","SINAPI","74005/1","COMPACTACAO MECANICA, SEM CONTROLE DO GC (C/COMPACTADOR PLACA 400 KG)","M3",5.0999999999999996,null,null,null,"Referência: AGETOP - 41009"]
["S",3,"S",0,1,3,1,0,0,0,0,"F","Serviço","Serviço","1.3.1.0.6.","AGETOP",41002,"APILOAMENTO","m2    ",51,null,null,null,""]
[3,3,3,2,1,3,2,0,0,21,2,"F","Nível 3","Nível 3","1.3.2.","SINAPI",null,"INSTALAÇÃO PLATAFORMA ELEVATÓRIA","-",null,null,null,null,""]
["S",3,"S",0,1,3,2,0,0,0,0,"F","Serviço","Serviço","1.3.2.0.1.","AGETOP",40101,"ESCAVACAO MANUAL DE VALAS < 1 MTS. (OBRAS CIVIS)","m3    ",1,null,null,null,""]
[3,3,3,3,1,3,3,0,0,19,3,"F","Nível 3","Nível 3","1.3.3.","SINAPI",null,"ACESSIBILIDADE","-",null,null,null,null,""]
["S",3,"S",0,1,3,3,0,0,0,0,"F","Serviço","Serviço","1.3.3.0.1.","AGETOP",41140,"REGULARIZAÇÃO DO TERRENO SEM APILOAMENTO COM TRANSPORTE MANUAL DA TERRA ESCAVADA ","m2    ",1084.78,null,null,null,""]
["S",3,"S",0,1,3,3,0,0,0,0,"F","Serviço","Serviço","1.3.3.0.2.","AGETOP",41002,"APILOAMENTO","m2    ",1084.78,null,null,null,""]
[3,3,3,3,1,3,4,0,0,16,3,"F","Nível 3","Nível 3","1.3.4.","SINAPI",null,"CENTRAL DE GÁS","-",null,null,null,null,""]
["S",3,"S",0,1,3,4,0,0,0,0,"F","Serviço","Serviço","1.3.4.0.1.","SINAPI",93358,"ESCAVAÇÃO MANUAL DE VALA COM PROFUNDIDADE MENOR OU IGUAL A 1,30 M. AF_03/2016","M3",0.94,null,null,null,"Referência: AGETOP - 40101"]
["S",3,"S",0,1,3,4,0,0,0,0,"F","Serviço","Serviço","1.3.4.0.2.","SINAPI",96995,"REATERRO MANUAL APILOADO COM SOQUETE. AF_10/2017","M3",0.94,null,null,null,"Referência: AGETOP - 40902"]
[3,3,3,3,1,3,5,0,0,13,3,"F","Nível 3","Nível 3","1.3.5.","SINAPI",null,"INST. HIDROSSANITÁRIAS","-",null,null,null,null,""]
["S",3,"S",0,1,3,5,0,0,0,0,"F","Serviço","Serviço","1.3.5.0.1.","AGETOP",40101,"ESCAVACAO MANUAL DE VALAS < 1 MTS. (OBRAS CIVIS)","m3    ",48,null,null,null,""]
["S",3,"S",0,1,3,5,0,0,0,0,"F","Serviço","Serviço","1.3.5.0.2.","AGETOP",40902,"REATERRO COM APILOAMENTO","m3    ",48,null,null,null,""]
[3,3,3,3,1,3,6,0,0,10,3,"F","Nível 3","Nível 3","1.3.6.","SINAPI",null,"INST. DE INCÊNDIO","-",null,null,null,null,""]
["S",3,"S",0,1,3,6,0,0,0,0,"F","Serviço","Serviço","1.3.6.0.1.","AGETOP",40101,"ESCAVACAO MANUAL DE VALAS < 1 MTS. (OBRAS CIVIS)","m3    ",8.75,null,null,null,""]
["S",3,"S",0,1,3,6,0,0,0,0,"F","Serviço","Serviço","1.3.6.0.2.","AGETOP",40902,"REATERRO COM APILOAMENTO","m3    ",8.75,null,null,null,""]
[{"$f":"CHOOSE(1+LOG(1+2*(ORÇAMENTO.Nivel=\"Nível 1\")+4*(ORÇAMENTO.Nivel=\"Nível 2\")+8*(ORÇAMENTO.Nivel=\"Nível 3\")+16*(ORÇAMENTO.Nivel=\"Nível 4\")+32*(ORÇAMENTO.Nivel=\"Serviço\"),2),0,1,2,3,4,\"S\")","v":3},3,3,3,1,3,7,0,0,7,3,"F","Nível 3","Nível 3","1.3.7.","SINAPI",null,"INST. ELÉTRICAS","-",null,null,null,null,""]
["S",3,"S",0,1,3,7,0,0,0,0,"F","Serviço","Serviço","1.3.7.0.1.","SINAPI",93358,"ESCAVAÇÃO MANUAL DE VALA COM PROFUNDIDADE MENOR OU IGUAL A 1,30 M. AF_03/2016","M3",32.61,null,null,null,"Referência: AGETOP - 40101"]
["S",3,"S",0,1,3,7,0,0,0,0,"F","Serviço","Serviço","1.3.7.0.2.","SINAPI",96995,"REATERRO MANUAL APILOADO COM SOQUETE. AF_10/2017","M3",32.61,null,null,null,"Referência: AGETOP - 40902"]
[3,3,3,4,1,3,8,0,0,4,616,"F","Nível 3","Nível 3","1.3.8.","SINAPI",null,"FUNDAÇÃO","-",null,null,null,null,""]
["S",3,"S",0,1,3,8,0,0,0,0,"F","Serviço","Serviço","1.3.8.0.1.","SINAPI",96522,"ESCAVAÇÃO MANUAL PARA BLOCO DE COROAMENTO OU SAPATA, SEM PREVISÃO DE FÔRMA. AF_06/2017","M3",4.12,null,null,null,"Referência: AGETOP - 50901"]
["S",3,"S",0,1,3,8,0,0,0,0,"F","Serviço","Serviço","1.3.8.0.2.","AGETOP",50902,"APILOAMENTO (BLOCOS/SAPATAS)","m2    ",7.92,null,null,null,""]
["S",3,"S",0,1,3,8,0,0,0,0,"F","Serviço","Serviço","1.3.8.0.3.","SINAPI",96526,"ESCAVAÇÃO MANUAL DE VALA PARA VIGA BALDRAME, SEM PREVISÃO DE FÔRMA. AF_06/2017","M3",1.93,null,null,null,"Referência: AGETOP - 40101"]
[{"$f":"CHOOSE(1+LOG(1+2*(ORÇAMENTO.Nivel=\"Nível 1\")+4*(ORÇAMENTO.Nivel=\"Nível 2\")+8*(ORÇAMENTO.Nivel=\"Nível 3\")+16*(ORÇAMENTO.Nivel=\"Nível 4\")+32*(ORÇAMENTO.Nivel=\"Serviço\"),2),0,1,2,3,4,\"S\")","v":2},2,2,14,1,4,0,0,0,708,14,"F","Nível 2","Nível 2","1.4.","AGETOP",null,"FUNDAÇÕES E SONDAGENS","-",null,null,null,null,""]
[3,3,3,4,1,4,1,0,0,13,4,"F","Nível 3","Nível 3","1.4.1.","SINAPI",null,"ESTACAS","-",null,null,null,null,""]
["S",3,"S",0,1,4,1,0,0,0,0,"F","Serviço","Serviço","1.4.1.0.1.","SINAPI",98230,"ESTACA BROCA DE CONCRETO, DIÂMETRO DE 30 CM, PROFUNDIDADE DE ATÉ 3 M, ESCAVAÇÃO MANUAL COM TRADO CONCHA, NÃO ARMADA. AF_03/2018","M",8.5,null,null,null,"Referência: AGETOP - 50302"]
["S",3,"S",0,1,4,1,0,0,0,0,"F","Serviço","Serviço","1.4.1.0.2.","SINAPI",95577,"MONTAGEM DE ARMADURA LONGITUDINAL DE ESTACAS DE SEÇÃO CIRCULAR, DIÂMETRO = 10,0 MM. AF_11/2016","KG",178.2,null,null,null,"Referência: AGETOP - 52005"]
["S",3,"S",0,1,4,1,0,0,0,0,"F","Serviço","Serviço","1.4.1.0.3.","SINAPI",95583,"MONTAGEM DE ARMADURA TRANSVERSAL DE ESTACAS DE SEÇÃO CIRCULAR, DIÂMETRO = 5,0 MM. AF_11/2016","KG",57.33,null,null,null,"Referência: AGETOP - 52014"]
[3,3,3,4,1,4,2,0,0,9,4,"F","Nível 3","Nível 3","1.4.2.","SINAPI",null,"BLOCO","-",null,null,null,null,""]
["S",3,"S",0,1,4,2,0,0,0,0,"F","Serviço","Serviço","1.4.2.0.1.","SINAPI",94965,"CONCRETO FCK = 25MPA, TRAÇO 1:2,3:2,7 (CIMENTO/ AREIA MÉDIA/ BRITA 1)  - PREPARO MECÂNICO COM BETONEIRA 400 L. AF_07/2016","M3",4.12,null,null,null,"Referência: AGETOP - 51030"]
["S",3,"S",0,1,4,2,0,0,0,0,"F","Serviço","Serviço","1.4.2.0.2.","SINAPI","74157/4","LANCAMENTO/APLICACAO MANUAL DE CONCRETO EM FUNDACOES","M3",4.12,null,null,null,"Referência: AGETOP - 51026"]
["S",3,"S",0,1,4,2,0,0,0,0,"F","Serviço","Serviço","1.4.2.0.3.","SINAPI",96543,"ARMAÇÃO DE BLOCO, VIGA BALDRAME E SAPATA UTILIZANDO AÇO CA-60 DE 5 MM - MONTAGEM. AF_06/2017","KG",50.49,null,null,null,"Referência: AGETOP - 52014"]
[3,3,3,5,1,4,3,0,0,5,341,"F","Nível 3","Nível 3","1.4.3.","SINAPI",null,"VIGAS BALDRAMES","-",null,null,null,null,""]
["S",3,"S",0,1,4,3,0,0,0,0,"F","Serviço","Serviço","1.4.3.0.1.","SINAPI",94965,"CONCRETO FCK = 25MPA, TRAÇO 1:2,3:2,7 (CIMENTO/ AREIA MÉDIA/ BRITA 1)  - PREPARO MECÂNICO COM BETONEIRA 400 L. AF_07/2016","M3",1.93,null,null,null,"Referência: AGETOP - 51030"]
["S",3,"S",0,1,4,3,0,0,0,0,"F","Serviço","Serviço","1.4.3.0.2.","SINAPI","74157/4","LANCAMENTO/APLICACAO MANUAL DE CONCRETO EM FUNDACOES","M3",1.93,null,null,null,"Referência: AGETOP - 51026"]
["S",3,"S",0,1,4,3,0,0,0,0,"F","Serviço","Serviço","1.4.3.0.3.","SINAPI",96545,"ARMAÇÃO DE BLOCO, VIGA BALDRAME OU SAPATA UTILIZANDO AÇO CA-50 DE 8 MM - MONTAGEM. AF_06/2017","KG",84.33,null,null,null,"Referência: AGETOP - 52004"]
["S",3,"S",0,1,4,3,0,0,0,0,"F","Serviço","Serviço","1.4.3.0.4.","SINAPI",96543,"ARMAÇÃO DE BLOCO, VIGA BALDRAME E SAPATA UTILIZANDO AÇO CA-60 DE 5 MM - MONTAGEM. AF_06/2017","KG",32.04,null,null,null,"Referência: AGETOP - 52014"]
[2,{"$f":"IF(OR(C145=\"s\",C145=0),OFFSET(B145,-1,0),C145)","v":2},{"$f":"IF(OFFSET(C145,-1,0)=\"L\",1,IF(OFFSET(C145,-1,0)=1,2,IF(OR(A145=\"s\",A145=0),\"S\",IF(AND(OFFSET(C145,-1,0)=2,A145=4),3,IF(AND(OR(OFFSET(C145,-1,0)=\"s\",OFFSET(C145,-1,0)=0),A145<>\"s\",A145>OFFSET(B145,-1,0)),OFFSET(B145,-1,0),A145)))))","v":2},{"$f":"IF(OR(C145=\"S\",C145=0),0,IF(ISERROR(K145),J145,SMALL(J145:K145,1)))","v":18},{"$f":"IF($C145=1,OFFSET(E145,-1,0)+1,OFFSET(E145,-1,0))","v":1},{"$f":"IF($C145=1,0,IF($C145=2,OFFSET(F145,-1,0)+1,OFFSET(F145,-1,0)))","v":5},{"$f":"IF(AND($C145<=2,$C145<>0),0,IF($C145=3,OFFSET(G145,-1,0)+1,OFFSET(G145,-1,0)))","v":0},{"$f":"IF(AND($C145<=3,$C145<>0),0,IF($C145=4,OFFSET(H145,-1,0)+1,OFFSET(H145,-1,0)))","v":0},{"$f":"IF(AND($C145<=4,$C145<>0),0,IF(AND($C145=\"S\",$W145>0),OFFSET(I145,-1,0)+1,OFFSET(I145,-1,0)))","v":0},694,18,"F","Nível 2","Nível 2","1.5.","AGETOP",null,"ESTRUTURA","-",null,null,null,null,""]
[3,3,3,7,1,5,1,0,0,17,7,"F","Nível 3","Nível 3","1.5.1.","SINAPI",null,"PILARES","-",null,null,null,null,""]
["S",3,"S",0,1,5,1,0,0,{"$f":"IF(OR($C147=\"S\",$C147=0),0,MATCH(0,OFFSET($D147,1,$C147,ROW($C$839)-ROW($C147)),0))","v":0},{"$f":"IF(OR($C147=\"S\",$C147=0),0,MATCH(OFFSET($D147,0,$C147)+1,OFFSET($D147,1,$C147,ROW($C$839)-ROW($C147)),0))","v":0},"F","Serviço","Serviço","1.5.1.0.1.","SINAPI",92426,"MONTAGEM E DESMONTAGEM DE FÔRMA DE PILARES RETANGULARES E ESTRUTURAS SIMILARES COM ÁREA MÉDIA DAS SEÇÕES MENOR OU IGUAL A 0,25 M², PÉ-DIREITO SIMPLES, EM CHAPA DE MADEIRA COMPENSADA RESINADA, 8 UTILIZAÇÕES. AF_12/2015","M2",106.27,null,null,null,""]
["S",3,"S",0,1,5,1,0,0,0,0,"F","Serviço","Serviço","1.5.1.0.2.","SINAPI",94965,"CONCRETO FCK = 25MPA, TRAÇO 1:2,3:2,7 (CIMENTO/ AREIA MÉDIA/ BRITA 1)  - PREPARO MECÂNICO COM BETONEIRA 400 L. AF_07/2016","M3",4.97,null,null,null,"Referência: AGETOP - 51030"]
["S",3,"S",0,1,5,1,0,0,0,0,"F","Serviço","Serviço","1.5.1.0.3.","SINAPI",92873,"LANÇAMENTO COM USO DE BALDES, ADENSAMENTO E ACABAMENTO DE CONCRETO EM ESTRUTURAS. AF_12/2015","M3",4.97,null,null,null,"Referência: AGETOP - 60801"]
["S",3,"S",0,1,5,1,0,0,0,0,"F","Serviço","Serviço","1.5.1.0.4.","SINAPI",92778,"ARMAÇÃO DE PILAR OU VIGA DE UMA ESTRUTURA CONVENCIONAL DE CONCRETO ARMADO EM UMA EDIFICAÇÃO TÉRREA OU SOBRADO UTILIZANDO AÇO CA-50 DE 10,0 MM - MONTAGEM. AF_12/2015","KG",289.52999999999997,null,null,null,"Referência: AGETOP - 60305"]
["S",3,"S",0,1,5,1,0,0,0,0,"F","Serviço","Serviço","1.5.1.0.5.","SINAPI",92761,"ARMAÇÃO DE PILAR OU VIGA DE UMA ESTRUTURA CONVENCIONAL DE CONCRETO ARMADO EM UM EDIFÍCIO DE MÚLTIPLOS PAVIMENTOS UTILIZANDO AÇO CA-50 DE 8,0 MM - MONTAGEM. AF_12/2015","KG",23.13,null,null,null,"Referência: AGETOP - 60304"]
["S",3,"S",0,1,5,1,0,0,0,0,"F","Serviço","Serviço","1.5.1.0.6.","SINAPI",92775,"ARMAÇÃO DE PILAR OU VIGA DE UMA ESTRUTURA CONVENCIONAL DE CONCRETO ARMADO EM UMA EDIFICAÇÃO TÉRREA OU SOBRADO UTILIZANDO AÇO CA-60 DE 5,0 MM - MONTAGEM. AF_12/2015","KG",129.5,null,null,null,"Referência: AGETOP - 60314"]
[3,3,3,6,1,5,2,0,0,10,6,"F","Nível 3","Nível 3","1.5.2.",null,null,"VIGAS DE COBERTURA","-",null,null,null,null,""]
["S",3,"S",0,1,5,2,0,0,0,0,"F","Serviço","Serviço","1.5.2.0.1.","SINAPI",92464,"MONTAGEM E DESMONTAGEM DE FÔRMA DE VIGA, ESCORAMENTO METÁLICO, PÉ-DIREITO SIMPLES, EM CHAPA DE MADEIRA RESINADA, 8 UTILIZAÇÕES. AF_12/2015","M2",48.49,null,null,null,"Referência: AGETOP - 60209"]
["S",3,"S",0,1,5,2,0,0,0,0,"F","Serviço","Serviço","1.5.2.0.2.","SINAPI",94965,"CONCRETO FCK = 25MPA, TRAÇO 1:2,3:2,7 (CIMENTO/ AREIA MÉDIA/ BRITA 1)  - PREPARO MECÂNICO COM BETONEIRA 400 L. AF_07/2016","M3",2.79,null,null,null,"Referência: AGETOP - 51030"]
["S",3,"S",0,1,5,2,0,0,0,0,"F","Serviço","Serviço","1.5.2.0.3.","SINAPI",92873,"LANÇAMENTO COM USO DE BALDES, ADENSAMENTO E ACABAMENTO DE CONCRETO EM ESTRUTURAS. AF_12/2015","M3",2.79,null,null,null,"Referência: AGETOP - 60801"]
["S",3,"S",0,1,5,2,0,0,0,0,"F","Serviço","Serviço","1.5.2.0.4.","SINAPI",92777,"ARMAÇÃO DE PILAR OU VIGA DE UMA ESTRUTURA CONVENCIONAL DE CONCRETO ARMADO EM UMA EDIFICAÇÃO TÉRREA OU SOBRADO UTILIZANDO AÇO CA-50 DE 8,0 MM - MONTAGEM. AF_12/2015","KG",119.16,null,null,null,"Referência: AGETOP - 60304"]
["S",3,"S",0,1,5,2,0,0,0,0,"F","Serviço","Serviço","1.5.2.0.5.","SINAPI",92775,"ARMAÇÃO DE PILAR OU VIGA DE UMA ESTRUTURA CONVENCIONAL DE CONCRETO ARMADO EM UMA EDIFICAÇÃO TÉRREA OU SOBRADO UTILIZANDO AÇO CA-60 DE 5,0 MM - MONTAGEM. AF_12/2015","KG",53.55,null,null,null,"Referência: AGETOP - 60314"]
[3,3,3,4,1,5,3,0,0,4,322,"F","Nível 3","Nível 3","1.5.3.",null,null,"LAJE","-",null,null,null,null,""]
["S",3,"S",0,1,5,3,0,0,0,0,"F","Serviço","Serviço","1.5.3.0.1.","SINAPI",92267,"FABRICAÇÃO DE FÔRMA PARA LAJES, EM CHAPA DE MADEIRA COMPENSADA RESINADA, E = 17 MM. AF_12/2015","M2",17.690000000000001,null,null,null,""]
["S",3,"S",0,1,5,3,0,0,0,0,"F","Serviço","Serviço","1.5.3.0.2.","SINAPI",92785,"ARMAÇÃO DE LAJE DE UMA ESTRUTURA CONVENCIONAL DE CONCRETO ARMADO EM UMA EDIFICAÇÃO TÉRREA OU SOBRADO UTILIZANDO AÇO CA-50 DE 6,3 MM - MONTAGEM. AF_12/2015","KG",56.07,null,null,null,"Referência: AGETOP - 60303"]
[{"$f":"CHOOSE(1+LOG(1+2*(ORÇAMENTO.Nivel=\"Nível 1\")+4*(ORÇAMENTO.Nivel=\"Nível 2\")+8*(ORÇAMENTO.Nivel=\"Nível 3\")+16*(ORÇAMENTO.Nivel=\"Nível 4\")+32*(ORÇAMENTO.Nivel=\"Serviço\"),2),0,1,2,3,4,\"S\")","v":"S"},{"$f":"IF(OR(C162=\"s\",C162=0),OFFSET(B162,-1,0),C162)","v":3},{"$f":"IF(OFFSET(C162,-1,0)=\"L\",1,IF(OFFSET(C162,-1,0)=1,2,IF(OR(A162=\"s\",A162=0),\"S\",IF(AND(OFFSET(C162,-1,0)=2,A162=4),3,IF(AND(OR(OFFSET(C162,-1,0)=\"s\",OFFSET(C162,-1,0)=0),A162<>\"s\",A162>OFFSET(B162,-1,0)),OFFSET(B162,-1,0),A162)))))","v":"S"},{"$f":"IF(OR(C162=\"S\",C162=0),0,IF(ISERROR(K162),J162,SMALL(J162:K162,1)))","v":0},{"$f":"IF($C162=1,OFFSET(E162,-1,0)+1,OFFSET(E162,-1,0))","v":1},{"$f":"IF($C162=1,0,IF($C162=2,OFFSET(F162,-1,0)+1,OFFSET(F162,-1,0)))","v":5},{"$f":"IF(AND($C162<=2,$C162<>0),0,IF($C162=3,OFFSET(G162,-1,0)+1,OFFSET(G162,-1,0)))","v":3},{"$f":"IF(AND($C162<=3,$C162<>0),0,IF($C162=4,OFFSET(H162,-1,0)+1,OFFSET(H162,-1,0)))","v":0},{"$f":"IF(AND($C162<=4,$C162<>0),0,IF(AND($C162=\"S\",$W162>0),OFFSET(I162,-1,0)+1,OFFSET(I162,-1,0)))","v":0},0,0,"F","Serviço","Serviço","1.5.3.0.3.","SINAPI",94965,"CONCRETO FCK = 25MPA, TRAÇO 1:2,3:2,7 (CIMENTO/ AREIA MÉDIA/ BRITA 1)  - PREPARO MECÂNICO COM BETONEIRA 400 L. AF_07/2016","M3",1.92,null,null,null,"Referência: AGETOP - 51030"]
[{"$f":"CHOOSE(1+LOG(1+2*(ORÇAMENTO.Nivel=\"Nível 1\")+4*(ORÇAMENTO.Nivel=\"Nível 2\")+8*(ORÇAMENTO.Nivel=\"Nível 3\")+16*(ORÇAMENTO.Nivel=\"Nível 4\")+32*(ORÇAMENTO.Nivel=\"Serviço\"),2),0,1,2,3,4,\"S\")","v":2},{"$f":"IF(OR(C163=\"s\",C163=0),OFFSET(B163,-1,0),C163)","v":2},{"$f":"IF(OFFSET(C163,-1,0)=\"L\",1,IF(OFFSET(C163,-1,0)=1,2,IF(OR(A163=\"s\",A163=0),\"S\",IF(AND(OFFSET(C163,-1,0)=2,A163=4),3,IF(AND(OR(OFFSET(C163,-1,0)=\"s\",OFFSET(C163,-1,0)=0),A163<>\"s\",A163>OFFSET(B163,-1,0)),OFFSET(B163,-1,0),A163)))))","v":2},{"$f":"IF(OR(C163=\"S\",C163=0),0,IF(ISERROR(K163),J163,SMALL(J163:K163,1)))","v":193},{"$f":"IF($C163=1,OFFSET(E163,-1,0)+1,OFFSET(E163,-1,0))","v":1},{"$f":"IF($C163=1,0,IF($C163=2,OFFSET(F163,-1,0)+1,OFFSET(F163,-1,0)))","v":6},{"$f":"IF(AND($C163<=2,$C163<>0),0,IF($C163=3,OFFSET(G163,-1,0)+1,OFFSET(G163,-1,0)))","v":0},{"$f":"IF(AND($C163<=3,$C163<>0),0,IF($C163=4,OFFSET(H163,-1,0)+1,OFFSET(H163,-1,0)))","v":0},{"$f":"IF(AND($C163<=4,$C163<>0),0,IF(AND($C163=\"S\",$W163>0),OFFSET(I163,-1,0)+1,OFFSET(I163,-1,0)))","v":0},676,193,"F","Nível 2","Nível 2","1.6.",null,null,"INSTALAÇÕES ELÉTRICAS","-",null,null,null,null,""]
[3,3,3,64,1,6,1,0,0,192,64,"F","Nível 3","Nível 3","1.6.1.","SINAPI",null,"REFORMA","-",null,null,null,null,""]
["S",3,"S",0,1,6,1,0,0,0,0,"F","Serviço","Serviço","1.6.1.0.1.","SINAPI","74131/4","QUADRO DE DISTRIBUICAO DE ENERGIA DE EMBUTIR, EM CHAPA METALICA, PARA 18 DISJUNTORES TERMOMAGNETICOS MONOPOLARES, COM BARRAMENTO TRIFASICO E NEUTRO, FORNECIMENTO E INSTALACAO","UN",7,null,null,null,""]
["S",3,"S",0,1,6,1,0,0,0,0,"F","Serviço","Serviço","1.6.1.0.2.","SINAPI","74131/5","QUADRO DE DISTRIBUICAO DE ENERGIA DE EMBUTIR, EM CHAPA METALICA, PARA 24 DISJUNTORES TERMOMAGNETICOS MONOPOLARES, COM BARRAMENTO TRIFASICO E NEUTRO, FORNECIMENTO E INSTALACAO","UN",3,null,null,null,""]
["S",3,"S",0,1,6,1,0,0,0,0,"F","Serviço","Serviço","1.6.1.0.3.","SINAPI",93670,"DISJUNTOR TRIPOLAR TIPO DIN, CORRENTE NOMINAL DE 25A - FORNECIMENTO E INSTALAÇÃO. AF_04/2016","UN",2,null,null,null,"Referência: AGETOP - 71173"]
["S",3,"S",0,1,6,1,0,0,0,0,"F","Serviço","Serviço","1.6.1.0.4.","SINAPI",93671,"DISJUNTOR TRIPOLAR TIPO DIN, CORRENTE NOMINAL DE 32A - FORNECIMENTO E INSTALAÇÃO. AF_04/2016","UN",6,null,null,null,"Referência: AGETOP - 71173"]
["S",3,"S",0,1,6,1,0,0,0,0,"F","Serviço","Serviço","1.6.1.0.5.","SINAPI",93673,"DISJUNTOR TRIPOLAR TIPO DIN, CORRENTE NOMINAL DE 50A - FORNECIMENTO E INSTALAÇÃO. AF_04/2016","UN",4,null,null,null,"Referência: AGETOP - 71174"]
["S",3,"S",0,1,6,1,0,0,0,0,"F","Serviço","Serviço","1.6.1.0.6.","AGETOP",71175,"DISJUNTOR TRIPOLAR DE 60 A 100-A","Un    ",6,null,null,null,""]
["S",3,"S",0,1,6,1,0,0,0,0,"F","Serviço","Serviço","1.6.1.0.7.","SINAPI","74130/10","DISJUNTOR TERMOMAGNETICO TRIPOLAR EM CAIXA MOLDADA 175 A 225A 240V, FORNECIMENTO E INSTALACAO","UN",2,null,null,null,""]
["S",3,"S",0,1,6,1,0,0,0,0,"F","Serviço","Serviço","1.6.1.0.8.","SINAPI",93656,"DISJUNTOR MONOPOLAR TIPO DIN, CORRENTE NOMINAL DE 25A - FORNECIMENTO E INSTALAÇÃO. AF_04/2016","UN",42,null,null,null,""]
["S",3,"S",0,1,6,1,0,0,0,0,"F","Serviço","Serviço","1.6.1.0.9.","SINAPI",93654,"DISJUNTOR MONOPOLAR TIPO DIN, CORRENTE NOMINAL DE 16A - FORNECIMENTO E INSTALAÇÃO. AF_04/2016","UN",27,null,null,null,""]
["S",3,"S",0,1,6,1,0,0,0,0,"F","Serviço","Serviço","1.6.1.0.10.","SINAPI",93653,"DISJUNTOR MONOPOLAR TIPO DIN, CORRENTE NOMINAL DE 10A - FORNECIMENTO E INSTALAÇÃO. AF_04/2016","UN",60,null,null,null,""]
["S",3,"S",0,1,6,1,0,0,0,0,"F","Serviço","Serviço","1.6.1.0.11.","AGETOP",71184,"DISPOSITIVO DE PROTEÇÃO CONTRA SURTOS (D.P.S.) 275V DE 8 A 40KA","Un    ",3,null,null,null,""]
["S",3,"S",0,1,6,1,0,0,0,0,"F","Serviço","Serviço","1.6.1.0.12.","AGETOP",71456,"INTERRUPTOR DIFERENCIAL RESIDUAL (D.R.) TETRAPOLAR DE 40A-30mA","Un    ",7,null,null,null,""]
["S",3,"S",0,1,6,1,0,0,0,0,"F","Serviço","Serviço","1.6.1.0.13.","SINAPI",91926,"CABO DE COBRE FLEXÍVEL ISOLADO, 2,5 MM², ANTI-CHAMA 450/750 V, PARA CIRCUITOS TERMINAIS - FORNECIMENTO E INSTALAÇÃO. AF_12/2015","M",6124,null,null,null,"Referência: AGETOP - 70563"]
["S",3,"S",0,1,6,1,0,0,0,0,"F","Serviço","Serviço","1.6.1.0.14.","SINAPI",91928,"CABO DE COBRE FLEXÍVEL ISOLADO, 4 MM², ANTI-CHAMA 450/750 V, PARA CIRCUITOS TERMINAIS - FORNECIMENTO E INSTALAÇÃO. AF_12/2015","M",2656,null,null,null,"Referência: AGETOP - 70564"]
["S",3,"S",0,1,6,1,0,0,0,0,"F","Serviço","Serviço","1.6.1.0.15.","SINAPI",91930,"CABO DE COBRE FLEXÍVEL ISOLADO, 6 MM², ANTI-CHAMA 450/750 V, PARA CIRCUITOS TERMINAIS - FORNECIMENTO E INSTALAÇÃO. AF_12/2015","M",1450,null,null,null,"Referência: AGETOP - 70565"]
["S",3,"S",0,1,6,1,0,0,0,0,"F","Serviço","Serviço","1.6.1.0.16.","SINAPI",92979,"CABO DE COBRE FLEXÍVEL ISOLADO, 10 MM², ANTI-CHAMA 450/750 V, PARA DISTRIBUIÇÃO - FORNECIMENTO E INSTALAÇÃO. AF_12/2015","M",607,null,null,null,""]
["S",3,"S",0,1,6,1,0,0,0,0,"F","Serviço","Serviço","1.6.1.0.17.","SINAPI",92981,"CABO DE COBRE FLEXÍVEL ISOLADO, 16 MM², ANTI-CHAMA 450/750 V, PARA DISTRIBUIÇÃO - FORNECIMENTO E INSTALAÇÃO. AF_12/2015","M",1926,null,null,null,""]
["S",3,"S",0,1,6,1,0,0,0,0,"F","Serviço","Serviço","1.6.1.0.18.","SINAPI",92983,"CABO DE COBRE FLEXÍVEL ISOLADO, 25 MM², ANTI-CHAMA 450/750 V, PARA DISTRIBUIÇÃO - FORNECIMENTO E INSTALAÇÃO. AF_12/2015","M",1607,null,null,null,""]
["S",3,"S",0,1,6,1,0,0,0,0,"F","Serviço","Serviço","1.6.1.0.19.","SINAPI",92985,"CABO DE COBRE FLEXÍVEL ISOLADO, 35 MM², ANTI-CHAMA 450/750 V, PARA DISTRIBUIÇÃO - FORNECIMENTO E INSTALAÇÃO. AF_12/2015","M",1001,null,null,null,""]
["S",3,"S",0,1,6,1,0,0,0,0,"F","Serviço","Serviço","1.6.1.0.20.","AGETOP",70541,"CABO DE COBRE NU No. 16 MM2 (6,94 M/KG)","M     ",15,null,null,null,""]
["S",3,"S",0,1,6,1,0,0,0,0,"F","Serviço","Serviço","1.6.1.0.21.","SINAPI",91867,"ELETRODUTO RÍGIDO ROSCÁVEL, PVC, DN 25 MM (3/4\"), PARA CIRCUITOS TERMINAIS, INSTALADO EM LAJE - FORNECIMENTO E INSTALAÇÃO. AF_12/2015","M",1905,null,null,null,"Referência: AGETOP - 71201"]
["S",3,"S",0,1,6,1,0,0,0,0,"F","Serviço","Serviço","1.6.1.0.22.","SINAPI",91868,"ELETRODUTO RÍGIDO ROSCÁVEL, PVC, DN 32 MM (1\"), PARA CIRCUITOS TERMINAIS, INSTALADO EM LAJE - FORNECIMENTO E INSTALAÇÃO. AF_12/2015","M",985,null,null,null,"Referência: AGETOP - 71202"]
["S",3,"S",0,1,6,1,0,0,0,0,"F","Serviço","Serviço","1.6.1.0.23.","SINAPI",93008,"ELETRODUTO RÍGIDO ROSCÁVEL, PVC, DN 50 MM (1 1/2\") - FORNECIMENTO E INSTALAÇÃO. AF_12/2015","M",555,null,null,null,""]
["S",3,"S",0,1,6,1,0,0,0,0,"F","Serviço","Serviço","1.6.1.0.24.","SINAPI",93010,"ELETRODUTO RÍGIDO ROSCÁVEL, PVC, DN 75 MM (2 1/2\") - FORNECIMENTO E INSTALAÇÃO. AF_12/2015","M",430,null,null,null,""]
["S",3,"S",0,1,6,1,0,0,0,0,"F","Serviço","Serviço","1.6.1.0.25.","SINAPI",93009,"ELETRODUTO RÍGIDO ROSCÁVEL, PVC, DN 60 MM (2\") - FORNECIMENTO E INSTALAÇÃO. AF_12/2015","M",443,null,null,null,""]
["S",3,"S",0,1,6,1,0,0,0,0,"F","Serviço","Serviço","1.6.1.0.26.","AGETOP",70351,"BRACADEIRA METALICA TIPO \"U\" DIAM. 3/4\"","Un    ",600,null,null,null,""]
["S",3,"S",0,1,6,1,0,0,0,0,"F","Serviço","Serviço","1.6.1.0.27.","AGETOP",70352,"BRACADEIRA METALICA TIPO \"U\" DIAM. 1\"","Un    ",300,null,null,null,""]
["S",3,"S",0,1,6,1,0,0,0,0,"F","Serviço","Serviço","1.6.1.0.28.","AGETOP",70354,"BRACADEIRA METALICA TIPO \"U\" DIAM. 1.1/2\"","Un    ",185,null,null,null,""]
["S",3,"S",0,1,6,1,0,0,0,0,"F","Serviço","Serviço","1.6.1.0.29.","AGETOP",70355,"BRACADEIRA METALICA TIPO \"U\" DIAM. 2\"","Un    ",140,null,null,null,""]
["S",3,"S",0,1,6,1,0,0,0,0,"F","Serviço","Serviço","1.6.1.0.30.","AGETOP",70356,"BRACADEIRA METALICA TIPO \"U\" DIAM. 2.1/2\"","Un    ",140,null,null,null,""]
["S",3,"S",0,1,6,1,0,0,0,0,"F","Serviço","Serviço","1.6.1.0.31.","SINAPI",91879,"LUVA PARA ELETRODUTO, PVC, ROSCÁVEL, DN 25 MM (3/4\"), PARA CIRCUITOS TERMINAIS, INSTALADA EM LAJE - FORNECIMENTO E INSTALAÇÃO. AF_12/2015","UN",600,null,null,null,"Referência: AGETOP - 71741"]
["S",3,"S",0,1,6,1,0,0,0,0,"F","Serviço","Serviço","1.6.1.0.32.","SINAPI",91880,"LUVA PARA ELETRODUTO, PVC, ROSCÁVEL, DN 32 MM (1\"), PARA CIRCUITOS TERMINAIS, INSTALADA EM LAJE - FORNECIMENTO E INSTALAÇÃO. AF_12/2015","UN",300,null,null,null,"Referência: AGETOP - 71742"]
["S",3,"S",0,1,6,1,0,0,0,0,"F","Serviço","Serviço","1.6.1.0.33.","SINAPI",93013,"LUVA PARA ELETRODUTO, PVC, ROSCÁVEL, DN 50 MM (1 1/2\") - FORNECIMENTO E INSTALAÇÃO. AF_12/2015","UN",185,null,null,null,"Referência: AGETOP - 71744"]
["S",3,"S",0,1,6,1,0,0,0,0,"F","Serviço","Serviço","1.6.1.0.34.","SINAPI",93014,"LUVA PARA ELETRODUTO, PVC, ROSCÁVEL, DN 60 MM (2\") - FORNECIMENTO E INSTALAÇÃO. AF_12/2015","UN",140,null,null,null,"Referência: AGETOP - 71745"]
["S",3,"S",0,1,6,1,0,0,0,0,"F","Serviço","Serviço","1.6.1.0.35.","SINAPI",93015,"LUVA PARA ELETRODUTO, PVC, ROSCÁVEL, DN 75 MM (2 1/2\") - FORNECIMENTO E INSTALAÇÃO. AF_12/2015","UN",140,null,null,null,""]
["S",3,"S",0,1,6,1,0,0,0,0,"F","Serviço","Serviço","1.6.1.0.36.","SINAPI",95801,"CONDULETE DE ALUMÍNIO, TIPO X, PARA ELETRODUTO DE AÇO GALVANIZADO DN 20 MM (3/4''), APARENTE - FORNECIMENTO E INSTALAÇÃO. AF_11/2016_P","UN",200,null,null,null,"Referência: AGETOP - 70929"]
["S",3,"S",0,1,6,1,0,0,0,0,"F","Serviço","Serviço","1.6.1.0.37.","AGETOP",72385,"TAMPA CEGA PARA CONDULETE DE PVC","Un    ",200,null,null,null,""]
["S",3,"S",0,1,6,1,0,0,0,0,"F","Serviço","Serviço","1.6.1.0.38.","SINAPI",91902,"CURVA 90 GRAUS PARA ELETRODUTO, PVC, ROSCÁVEL, DN 25 MM (3/4\"), PARA CIRCUITOS TERMINAIS, INSTALADA EM LAJE - FORNECIMENTO E INSTALAÇÃO. AF_12/2015","UN",100,null,null,null,"Referência: AGETOP - 71141"]
["S",3,"S",0,1,6,1,0,0,0,0,"F","Serviço","Serviço","1.6.1.0.39.","SINAPI",91905,"CURVA 90 GRAUS PARA ELETRODUTO, PVC, ROSCÁVEL, DN 32 MM (1\"), PARA CIRCUITOS TERMINAIS, INSTALADA EM LAJE - FORNECIMENTO E INSTALAÇÃO. AF_12/2015","UN",50,null,null,null,"Referência: AGETOP - 71142"]
["S",3,"S",0,1,6,1,0,0,0,0,"F","Serviço","Serviço","1.6.1.0.40.","AGETOP",71124,"CURVA 90 GRAUS AÇO ZINCADO DIÂMETRO 1.1/2\"","Un    ",30,null,null,null,""]
["S",3,"S",0,1,6,1,0,0,0,0,"F","Serviço","Serviço","1.6.1.0.41.","AGETOP",71125,"CURVA 90 GRAUS AÇO ZINCADO DIÂMETRO 2\"","Un    ",20,null,null,null,""]
["S",3,"S",0,1,6,1,0,0,0,0,"F","Serviço","Serviço","1.6.1.0.42.","AGETOP",71126,"CURVA 90 GRAUS AÇO ZINCADO DIÂMETRO 2.1/2\"","Un    ",10,null,null,null,""]
["S",3,"S",0,1,6,1,0,0,0,0,"F","Serviço","Serviço","1.6.1.0.43.","SINAPI",92867,"CAIXA RETANGULAR 4\" X 2\" ALTA (2,00 M DO PISO), METÁLICA, INSTALADA EM PAREDE - FORNECIMENTO E INSTALAÇÃO. AF_12/2015","UN",213,null,null,null,""]
["S",3,"S",0,1,6,1,0,0,0,0,"F","Serviço","Serviço","1.6.1.0.44.","SINAPI",92866,"CAIXA SEXTAVADA 3\" X 3\", METÁLICA, INSTALADA EM LAJE - FORNECIMENTO E INSTALAÇÃO. AF_12/2015","UN",285,null,null,null,"Referência: AGETOP - 70680"]
["S",3,"S",0,1,6,1,0,0,0,0,"F","Serviço","Serviço","1.6.1.0.45.","SINAPI",91953,"INTERRUPTOR SIMPLES (1 MÓDULO), 10A/250V, INCLUINDO SUPORTE E PLACA - FORNECIMENTO E INSTALAÇÃO. AF_12/2015","UN",28,null,null,null,"Referência: AGETOP - 71440"]
["S",3,"S",0,1,6,1,0,0,0,0,"F","Serviço","Serviço","1.6.1.0.46.","SINAPI",91959,"INTERRUPTOR SIMPLES (2 MÓDULOS), 10A/250V, INCLUINDO SUPORTE E PLACA - FORNECIMENTO E INSTALAÇÃO. AF_12/2015","UN",54,null,null,null,"Referência: AGETOP - 71441"]
["S",3,"S",0,1,6,1,0,0,{"$f":"IF(OR($C211=\"S\",$C211=0),0,MATCH(0,OFFSET($D211,1,$C211,ROW($C$839)-ROW($C211)),0))","v":0},{"$f":"IF(OR($C211=\"S\",$C211=0),0,MATCH(OFFSET($D211,0,$C211)+1,OFFSET($D211,1,$C211,ROW($C$839)-ROW($C211)),0))","v":0},"F","Serviço","Serviço","1.6.1.0.47.","SINAPI",92000,"TOMADA BAIXA DE EMBUTIR (1 MÓDULO), 2P+T 10 A, INCLUINDO SUPORTE E PLACA - FORNECIMENTO E INSTALAÇÃO. AF_12/2015","UN",54,null,null,null,"Referência: AGETOP - 72578"]
["S",3,"S",0,1,6,1,0,0,0,0,"F","Serviço","Serviço","1.6.1.0.48.","SINAPI",91996,"TOMADA MÉDIA DE EMBUTIR (1 MÓDULO), 2P+T 10 A, INCLUINDO SUPORTE E PLACA - FORNECIMENTO E INSTALAÇÃO. AF_12/2015","UN",21,null,null,null,"Referência: AGETOP - 72578"]
["S",3,"S",0,1,6,1,0,0,0,0,"F","Serviço","Serviço","1.6.1.0.49.","SINAPI",92004,"TOMADA MÉDIA DE EMBUTIR (2 MÓDULOS), 2P+T 10 A, INCLUINDO SUPORTE E PLACA - FORNECIMENTO E INSTALAÇÃO. AF_12/2015","UN",2,null,null,null,"Referência: AGETOP - 72578"]
["S",3,"S",0,1,6,1,0,0,0,0,"F","Serviço","Serviço","1.6.1.0.50.","SINAPI",91993,"TOMADA ALTA DE EMBUTIR (1 MÓDULO), 2P+T 20 A, INCLUINDO SUPORTE E PLACA - FORNECIMENTO E INSTALAÇÃO. AF_12/2015","UN",42,null,null,null,"Referência: AGETOP - 72585"]
["S",3,"S",0,1,6,1,0,0,0,0,"F","Serviço","Serviço","1.6.1.0.51.","SINAPI",91992,"TOMADA ALTA DE EMBUTIR (1 MÓDULO), 2P+T 10 A, INCLUINDO SUPORTE E PLACA - FORNECIMENTO E INSTALAÇÃO. AF_12/2015","UN",10,null,null,null,""]
["S",3,"S",0,1,6,1,0,0,0,0,"F","Serviço","Serviço","1.6.1.0.52.","SINAPI",97585,"LUMINÁRIA TIPO CALHA, DE SOBREPOR, COM 2 LÂMPADAS TUBULARES DE 18 W - FORNECIMENTO E INSTALAÇÃO. AF_11/2017","UN",187,null,null,null,""]
["S",3,"S",0,1,6,1,0,0,0,0,"F","Serviço","Serviço","1.6.1.0.53.","SINAPI",97610,"LÂMPADA COMPACTA DE LED 10 W, BASE E27 - FORNECIMENTO E INSTALAÇÃO. AF_11/2017","UN",187,null,null,null,""]
["S",3,"S",0,1,6,1,0,0,0,0,"F","Serviço","Serviço","1.6.1.0.54.","SINAPI",97601,"REFLETOR EM ALUMÍNIO COM SUPORTE E ALÇA, LÂMPADA 250 W - FORNECIMENTO E INSTALAÇÃO. AF_11/2017","UN",6,null,null,null,""]
["S",3,"S",0,1,6,1,0,0,0,0,"F","Serviço","Serviço","1.6.1.0.55.","SINAPI","73831/8","LAMPADA DE VAPOR DE SODIO DE 250WX220V - FORNECIMENTO E INSTALACAO","UN",6,null,null,null,""]
["S",3,"S",0,1,6,1,0,0,0,0,"F","Serviço","Serviço","1.6.1.0.56.","AGETOP",72341,"SOQUETE ANTIVIBRATORIO P/LAMP.FLUORESCENTE","Un    ",12,null,null,null,""]
["S",3,"S",0,1,6,1,0,0,0,0,"F","Serviço","Serviço","1.6.1.0.57.","AGETOP",71655,"LUMINÁRIA CIRCULAR SEM VIDRO PARA QUADRA ATE 400 W - BASE E-40","Un    ",10,null,null,null,""]
["S",3,"S",0,1,6,1,0,0,0,0,"F","Serviço","Serviço","1.6.1.0.58.","SINAPI","73831/9","LAMPADA DE VAPOR DE SODIO DE 400WX220V - FORNECIMENTO E INSTALACAO","UN",10,null,null,null,""]
["S",3,"S",0,1,6,1,0,0,0,0,"F","Serviço","Serviço","1.6.1.0.59.","AGETOP",70710,"CAIXA DE PASSAGEM 30X30X40CM COM TAMPA E DRENO BRITA","Un    ",9,null,null,null,""]
["S",3,"S",0,1,6,1,0,0,0,0,"F","Serviço","Serviço","1.6.1.0.60.","AGETOP",70648,"CAIXA DE PASSAGEM METÁLICA DE EMBUTIR  40X40X15 CM","Un    ",5,null,null,null,""]
["S",3,"S",0,1,6,1,0,0,0,0,"F","Serviço","Serviço","1.6.1.0.61.","AGETOP",71861,"PARAFUSO P/BUCHA S-6","Un    ",1068,null,null,null,""]
["S",3,"S",0,1,6,1,0,0,0,0,"F","Serviço","Serviço","1.6.1.0.62.","AGETOP",70391,"BUCHA DE NYLON S-6","Un    ",1068,null,null,null,""]
[{"$f":"CHOOSE(1+LOG(1+2*(ORÇAMENTO.Nivel=\"Nível 1\")+4*(ORÇAMENTO.Nivel=\"Nível 2\")+8*(ORÇAMENTO.Nivel=\"Nível 3\")+16*(ORÇAMENTO.Nivel=\"Nível 4\")+32*(ORÇAMENTO.Nivel=\"Serviço\"),2),0,1,2,3,4,\"S\")","v":"S"},{"$f":"IF(OR(C227=\"s\",C227=0),OFFSET(B227,-1,0),C227)","v":3},{"$f":"IF(OFFSET(C227,-1,0)=\"L\",1,IF(OFFSET(C227,-1,0)=1,2,IF(OR(A227=\"s\",A227=0),\"S\",IF(AND(OFFSET(C227,-1,0)=2,A227=4),3,IF(AND(OR(OFFSET(C227,-1,0)=\"s\",OFFSET(C227,-1,0)=0),A227<>\"s\",A227>OFFSET(B227,-1,0)),OFFSET(B227,-1,0),A227)))))","v":"S"},{"$f":"IF(OR(C227=\"S\",C227=0),0,IF(ISERROR(K227),J227,SMALL(J227:K227,1)))","v":0},{"$f":"IF($C227=1,OFFSET(E227,-1,0)+1,OFFSET(E227,-1,0))","v":1},{"$f":"IF($C227=1,0,IF($C227=2,OFFSET(F227,-1,0)+1,OFFSET(F227,-1,0)))","v":6},{"$f":"IF(AND($C227<=2,$C227<>0),0,IF($C227=3,OFFSET(G227,-1,0)+1,OFFSET(G227,-1,0)))","v":1},{"$f":"IF(AND($C227<=3,$C227<>0),0,IF($C227=4,OFFSET(H227,-1,0)+1,OFFSET(H227,-1,0)))","v":0},{"$f":"IF(AND($C227<=4,$C227<>0),0,IF(AND($C227=\"S\",$W227>0),OFFSET(I227,-1,0)+1,OFFSET(I227,-1,0)))","v":0},0,0,"F","Serviço","Serviço","1.6.1.0.63.","AGETOP",70633,"CAIXA DE PASSAGEM - ESCAVAÇÃO MANUAL / REATERRO/ APILOAMENTO DO FUNDO ","m3    ",1.08,null,null,null,""]
[3,3,3,61,1,6,2,0,0,128,61,"F","Nível 3","Nível 3","1.6.2.","SINAPI",null,"SUBESTAÇÃO","-",null,null,null,null,""]
["S",3,"S",0,1,6,2,0,0,0,0,"F","Serviço","Serviço","1.6.2.0.1.","SINAPI","73767/2","ALCA PRE-FORMADA DISTRIBUIÇÃO EM  ACO RECOBERTO COM ALUMINIO PARA CABO 25MM2, ENCAPADO. FORNECIMENTO E INSTALAÇÃO.","UN",1,null,null,null,""]
["S",3,"S",0,1,6,2,0,0,0,0,"F","Serviço","Serviço","1.6.2.0.2.","AGETOP",70252,"ARRUELA LISA D=5/16\"","Un    ",8,null,null,null,""]
["S",3,"S",0,1,6,2,0,0,0,0,"F","Serviço","Serviço","1.6.2.0.3.","AGETOP",70268,"BARRA DE COBRE 2\" X 3/16\"  (2,0865 KG/M)","m     ",1.5,null,null,null,""]
["S",3,"S",0,1,6,2,0,0,0,0,"F","Serviço","Serviço","1.6.2.0.4.","SINAPI",91175,"FIXAÇÃO DE TUBOS VERTICAIS DE PPR DIÂMETROS MAIORES QUE 75 MM COM ABRAÇADEIRA METÁLICA RÍGIDA TIPO D 3\", FIXADA EM PERFILADO EM ALVENARIA. AF_05/2015","M",6,null,null,null,""]
["S",3,"S",0,1,6,2,0,0,0,0,"F","Serviço","Serviço","1.6.2.0.5.","AGETOP",70386,"BRAÇO C AÇO GALVANIZADO , CONFORME NTD-17","un    ",1,null,null,null,""]
["S",3,"S",0,1,6,2,0,0,0,0,"F","Serviço","Serviço","1.6.2.0.6.","AGETOP",70422,"BUCHA E ARRUELA METALICA DIAM. 1\"","PR    ",2,null,null,null,""]
["S",3,"S",0,1,6,2,0,0,0,0,"F","Serviço","Serviço","1.6.2.0.7.","AGETOP",70426,"BUCHA E ARRUELA METALICA DIAM. 2.1/2\"","PR    ",1,null,null,null,""]
["S",3,"S",0,1,6,2,0,0,0,0,"F","Serviço","Serviço","1.6.2.0.8.","SINAPI",92986,"CABO DE COBRE FLEXÍVEL ISOLADO, 35 MM², ANTI-CHAMA 0,6/1,0 KV, PARA DISTRIBUIÇÃO - FORNECIMENTO E INSTALAÇÃO. AF_12/2015","M",58.8,null,null,null,"Referência: AGETOP - 70512"]
["S",3,"S",0,1,6,2,0,0,0,0,"F","Serviço","Serviço","1.6.2.0.9.","SINAPI",92990,"CABO DE COBRE FLEXÍVEL ISOLADO, 70 MM², ANTI-CHAMA 0,6/1,0 KV, PARA DISTRIBUIÇÃO - FORNECIMENTO E INSTALAÇÃO. AF_12/2015","M",285.2,null,null,null,"Referência: AGETOP - 70514"]
["S",3,"S",0,1,6,2,0,0,0,0,"F","Serviço","Serviço","1.6.2.0.10.","AGETOP",70543,"CABO DE COBRE NÚ No. 35 MM2","M     ",20,null,null,null,""]
["S",3,"S",0,1,6,2,0,0,0,0,"F","Serviço","Serviço","1.6.2.0.11.","SINAPI",96977,"CORDOALHA DE COBRE NU 50 MM², ENTERRADA, SEM ISOLADOR - FORNECIMENTO E INSTALAÇÃO. AF_12/2017","M",45,null,null,null,""]
["S",3,"S",0,1,6,2,0,0,0,0,"F","Serviço","Serviço","1.6.2.0.12.","AGETOP",70695,"CAIXA METÁLICA PARA PROTEÇÃO GERAL 580X500X216MM ATÉ 175A","Un    ",1,null,null,null,""]
["S",3,"S",0,1,6,2,0,0,0,0,"F","Serviço","Serviço","1.6.2.0.13.","AGETOP",70725,"CAIXA METÁLICA PARA T.C. 580X500X216MM - ATÉ 175A","Un    ",1,null,null,null,""]
["S",3,"S",0,1,6,2,0,0,0,0,"F","Serviço","Serviço","1.6.2.0.14.","SINAPI",97893,"CAIXA ENTERRADA ELÉTRICA RETANGULAR, EM ALVENARIA COM BLOCOS DE CONCRETO, FUNDO COM BRITA, DIMENSÕES INTERNAS: 0,8X0,8X0,6 M. AF_05/2018","UN",1,null,null,null,""]
["S",3,"S",0,1,6,2,0,0,0,0,"F","Serviço","Serviço","1.6.2.0.15.","AGETOP",70771,"CANTONEIRA AUXILIAR PARA BRAÇO TIPO C","un    ",1,null,null,null,""]
["S",3,"S",0,1,6,2,0,0,0,0,"F","Serviço","Serviço","1.6.2.0.16.","AGETOP",70920,"CINTA DE ACO GALVANIZADO DIAM.190 MM","Un    ",1,null,null,null,""]
["S",3,"S",0,1,6,2,0,0,0,0,"F","Serviço","Serviço","1.6.2.0.17.","AGETOP",70921,"CINTA DE ACO GALVANIZADO DIAM.220 MM","Un    ",2,null,null,null,""]
["S",3,"S",0,1,6,2,0,0,0,0,"F","Serviço","Serviço","1.6.2.0.18.","AGETOP",70922,"CINTA DE ACO GALVANIZADO DIAM.230MM","Un    ",2,null,null,null,""]
["S",3,"S",0,1,6,2,0,0,0,0,"F","Serviço","Serviço","1.6.2.0.19.","AGETOP",71016,"CONECTOR DE COMPRESSÃO FORMATO H PARA CABO 25 A 70 MM2","un    ",4,null,null,null,""]
["S",3,"S",0,1,6,2,0,0,0,0,"F","Serviço","Serviço","1.6.2.0.20.","AGETOP",71036,"CONECTOR TIPO PARAFUSO FENDIDO 50 MM2","Un    ",6,null,null,null,""]
["S",3,"S",0,1,6,2,0,0,0,0,"F","Serviço","Serviço","1.6.2.0.21.","SINAPI",72272,"CONECTOR PARAFUSO FENDIDO \u0094SPLIT-BOLT\u0094 - PARA CABO DE 35MM2 - FORNECIMENTO E INSTALACAO","UN",1,null,null,null,""]
["S",3,"S",0,1,6,2,0,0,0,0,"F","Serviço","Serviço","1.6.2.0.22.","AGETOP",71037,"CONECTOR TIPO PARAFUSO FENDIDO 70 MM2","Un    ",4,null,null,null,""]
["S",3,"S",0,1,6,2,0,0,0,0,"F","Serviço","Serviço","1.6.2.0.23.","AGETOP",71142,"CURVA DE 90 GRAUS DE PVC RIGIDO DIAM. 1\"","Un    ",1,null,null,null,""]
["S",3,"S",0,1,6,2,0,0,0,0,"F","Serviço","Serviço","1.6.2.0.24.","SINAPI",93022,"CURVA 90 GRAUS PARA ELETRODUTO, PVC, ROSCÁVEL, DN 75 MM (2 1/2\") - FORNECIMENTO E INSTALAÇÃO. AF_12/2015","UN",1,null,null,null,""]
["S",3,"S",0,1,6,2,0,0,0,0,"F","Serviço","Serviço","1.6.2.0.25.","SINAPI","74130/10","DISJUNTOR TERMOMAGNETICO TRIPOLAR EM CAIXA MOLDADA 175 A 225A 240V, FORNECIMENTO E INSTALACAO","UN",2,null,null,null,""]
["S",3,"S",0,1,6,2,0,0,0,0,"F","Serviço","Serviço","1.6.2.0.26.","AGETOP",71202,"ELETRODUTO DE PVC RIGIDO DIAMETRO 1\"","M     ",3,null,null,null,""]
["S",3,"S",0,1,6,2,0,0,0,0,"F","Serviço","Serviço","1.6.2.0.27.","SINAPI",93010,"ELETRODUTO RÍGIDO ROSCÁVEL, PVC, DN 75 MM (2 1/2\") - FORNECIMENTO E INSTALAÇÃO. AF_12/2015","M",3,null,null,null,""]
["S",3,"S",0,1,6,2,0,0,0,0,"F","Serviço","Serviço","1.6.2.0.28.","AGETOP",71216,"ELETRODUTO EM AÇO GALVANIZADO A FOGO DIÂMETRO 2 1/2\" - PESADO ","M     ",7,null,null,null,""]
["S",3,"S",0,1,6,2,0,0,0,0,"F","Serviço","Serviço","1.6.2.0.29.","AGETOP",71268,"ELO FUSÍVEL 6 K","Un    ",1,null,null,null,""]
["S",3,"S",0,1,6,2,0,0,0,0,"F","Serviço","Serviço","1.6.2.0.30.","AGETOP",71321,"FITA DE AUTO FUSAO, ROLO E 10,00 MM","Un    ",5,null,null,null,""]
[{"$f":"CHOOSE(1+LOG(1+2*(ORÇAMENTO.Nivel=\"Nível 1\")+4*(ORÇAMENTO.Nivel=\"Nível 2\")+8*(ORÇAMENTO.Nivel=\"Nível 3\")+16*(ORÇAMENTO.Nivel=\"Nível 4\")+32*(ORÇAMENTO.Nivel=\"Serviço\"),2),0,1,2,3,4,\"S\")","v":"S"},3,"S",0,1,6,2,0,0,0,0,"F","Serviço","Serviço","1.6.2.0.31.","AGETOP",71365,"GRAMPO DE ANCORAGEM POLIMÉRICO","un    ",3,null,null,null,""]
["S",3,"S",0,1,6,2,0,0,0,0,"F","Serviço","Serviço","1.6.2.0.32.","AGETOP",71381,"HASTE REV.COBRE(COPPERWELD)  5/8\" X 3,00 M C/CONECTOR","Un    ",4,null,null,null,""]
["S",3,"S",0,1,6,2,0,0,0,0,"F","Serviço","Serviço","1.6.2.0.33.","AGETOP",71463,"ISOLADOR EPOXI 50X40 (BUJAO)","Un    ",2,null,null,null,""]
["S",3,"S",0,1,6,2,0,0,0,0,"F","Serviço","Serviço","1.6.2.0.34.","AGETOP",71476,"ISOLADOR DE ANCORAGEM POLIMÉRICO 15KV","un    ",1,null,null,null,""]
["S",3,"S",0,1,6,2,0,0,0,0,"F","Serviço","Serviço","1.6.2.0.35.","AGETOP",71510,"LACO PREFORMADO DE DISTRIBUICAO","Un    ",1,null,null,null,""]
["S",3,"S",0,1,6,2,0,0,0,0,"F","Serviço","Serviço","1.6.2.0.36.","AGETOP",71742,"LUVA PVC ROSQUEAVEL DIAMETRO 1\"","Un    ",1,null,null,null,""]
["S",3,"S",0,1,6,2,0,0,0,0,"F","Serviço","Serviço","1.6.2.0.37.","SINAPI",93015,"LUVA PARA ELETRODUTO, PVC, ROSCÁVEL, DN 75 MM (2 1/2\") - FORNECIMENTO E INSTALAÇÃO. AF_12/2015","UN",1,null,null,null,""]
["S",3,"S",0,1,6,2,0,0,0,0,"F","Serviço","Serviço","1.6.2.0.38.","AGETOP",71706,"LUVA  EM AÇO GALVANIZADO DIÂMETRO 2.1/2\"","Un    ",2,null,null,null,""]
["S",3,"S",0,1,6,2,0,0,0,0,"F","Serviço","Serviço","1.6.2.0.39.","AGETOP",71750,"MANILHA-SAPATILHA EM AÇO GALVANIZADO","un    ",1,null,null,null,""]
["S",3,"S",0,1,6,2,0,0,0,0,"F","Serviço","Serviço","1.6.2.0.40.","AGETOP",71761,"MURETA MEDIÇÃO ALVEN. 1 1/2 V.(35CM) REBOC.C/PINTURA ACRÍL. E LAJE CONC. 20MPA MALHA 8.0MM CADA 10CM REVEST.C/ARGAMASSA 1:3 C/ IMPERMEABILIZANTE","m2    ",4,null,null,null,""]
["S",3,"S",0,1,6,2,0,0,0,0,"F","Serviço","Serviço","1.6.2.0.41.","AGETOP",71791,"NIPLE DUPLO FERRO GALVANIZADO 2\"","Un    ",1,null,null,null,""]
["S",3,"S",0,1,6,2,0,0,0,0,"F","Serviço","Serviço","1.6.2.0.42.","AGETOP",71776,"NIPLE METALICO Fo.Zo. DIAMETRO 2.1/2\"","Un    ",1,null,null,null,""]
["S",3,"S",0,1,6,2,0,0,0,0,"F","Serviço","Serviço","1.6.2.0.43.","AGETOP",71795,"OLHAL PARA PARAFUSO","un    ",3,null,null,null,""]
["S",3,"S",0,1,6,2,0,0,0,0,"F","Serviço","Serviço","1.6.2.0.44.","AGETOP",71835,"PARAFUSO CABEÇA ABAULADA (FRANCES) M16 X 45 MM","Un    ",3,null,null,null,""]
["S",3,"S",0,1,6,2,0,0,0,0,"F","Serviço","Serviço","1.6.2.0.45.","AGETOP",71841,"PARAFUSO CABEÇA ABAULADA (FRANCES) M16 X 150 MM","Un    ",3,null,null,null,""]
["S",3,"S",0,1,6,2,0,0,0,0,"F","Serviço","Serviço","1.6.2.0.46.","AGETOP",71833,"PARA RAIOS DISTRIBUIDOR POLIMÉRICO ÓXIDO DE ZINCO S/CENTELHADOR C/ DESLIGAMENTO AUTOMÁTICO 15KV,10KA","Un    ",3,null,null,null,""]
["S",3,"S",0,1,6,2,0,0,{"$f":"IF(OR($C275=\"S\",$C275=0),0,MATCH(0,OFFSET($D275,1,$C275,ROW($C$839)-ROW($C275)),0))","v":0},{"$f":"IF(OR($C275=\"S\",$C275=0),0,MATCH(OFFSET($D275,0,$C275)+1,OFFSET($D275,1,$C275,ROW($C$839)-ROW($C275)),0))","v":0},"F","Serviço","Serviço","1.6.2.0.47.","AGETOP",71997,"POSTE - FUNDAÇÃO EM CONCRETO SIMPLES DA BASE DOS POSTES 11/600 PARA TRAFO ( DIAM. 1000MM)","m     ",0.3,null,null,null,""]
["S",3,"S",0,1,6,2,0,0,0,0,"F","Serviço","Serviço","1.6.2.0.48.","AGETOP",72061,"POSTE DE CONCRETO SC 11/600 - SEM FUNDAÇÃO/CONCRETO","Un    ",1,null,null,null,""]
["S",3,"S",0,1,6,2,0,0,0,0,"F","Serviço","Serviço","1.6.2.0.49.","AGETOP",72080,"POSTE/TRAFO - CAMINHÃO MUNCK 12 TON. (MÍNIMO 4H/DIA)","H     ",4,null,null,null,""]
["S",3,"S",0,1,6,2,0,0,0,0,"F","Serviço","Serviço","1.6.2.0.50.","AGETOP",72329,"SAPATILHA DE AÇO GALVANIZADO PARA POSTE COM TRANSFORMADOR","un    ",3,null,null,null,""]
["S",3,"S",0,1,6,2,0,0,0,0,"F","Serviço","Serviço","1.6.2.0.51.","SINAPI",73624,"SUPORTE PARA TRANSFORMADOR EM POSTE DE CONCRETO CIRCULAR","UN",2,null,null,null,""]
["S",3,"S",0,1,6,2,0,0,0,0,"F","Serviço","Serviço","1.6.2.0.52.","AGETOP",72518,"TERMINAL DE PRESSAO 10 MM2","Un    ",10,null,null,null,""]
["S",3,"S",0,1,6,2,0,0,0,0,"F","Serviço","Serviço","1.6.2.0.53.","AGETOP",72528,"TERMINAL DE PRESSAO 35 MM2","Un    ",10,null,null,null,""]
["S",3,"S",0,1,6,2,0,0,0,0,"F","Serviço","Serviço","1.6.2.0.54.","AGETOP",72535,"TERMINAL DE PRESSAO 70 MMM2","Un    ",8,null,null,null,""]
["S",3,"S",0,1,6,2,0,0,0,0,"F","Serviço","Serviço","1.6.2.0.55.","SINAPI","73857/2","TRANSFORMADOR DISTRIBUICAO  112,5KVA TRIFASICO 60HZ CLASSE 15KV IMERSO EM ÓLEO MINERAL FORNECIMENTO E INSTALACAO","UN",1,null,null,null,""]
["S",3,"S",0,1,6,2,0,0,0,0,"F","Serviço","Serviço","1.6.2.0.56.","SINAPI",88543,"ARMACAO SECUNDARIA OU REX COMPLETA PARA TRESLINHAS-FORNECIMENTO E INSTALACAO.","UN",1,null,null,null,""]
["S",3,"S",0,1,6,2,0,0,0,0,"F","Serviço","Serviço","1.6.2.0.57.","COMPOSIÇÃO","COMP 046_SEE","CAPUZ PARA PROTEÇÃO DOS PARA RAIOS","UN ",3,null,null,null,""]
["S",3,"S",0,1,6,2,0,0,0,0,"F","Serviço","Serviço","1.6.2.0.58.","COMPOSIÇÃO","COMP 047_SEE","CAPUZ DE PROTEÇÃO PARA BUCHA DE TRANSFORMADOR","UN ",3,null,null,null,""]
["S",{"$f":"IF(OR(C287=\"s\",C287=0),OFFSET(B287,-1,0),C287)","v":3},{"$f":"IF(OFFSET(C287,-1,0)=\"L\",1,IF(OFFSET(C287,-1,0)=1,2,IF(OR(A287=\"s\",A287=0),\"S\",IF(AND(OFFSET(C287,-1,0)=2,A287=4),3,IF(AND(OR(OFFSET(C287,-1,0)=\"s\",OFFSET(C287,-1,0)=0),A287<>\"s\",A287>OFFSET(B287,-1,0)),OFFSET(B287,-1,0),A287)))))","v":"S"},{"$f":"IF(OR(C287=\"S\",C287=0),0,IF(ISERROR(K287),J287,SMALL(J287:K287,1)))","v":0},{"$f":"IF($C287=1,OFFSET(E287,-1,0)+1,OFFSET(E287,-1,0))","v":1},{"$f":"IF($C287=1,0,IF($C287=2,OFFSET(F287,-1,0)+1,OFFSET(F287,-1,0)))","v":6},{"$f":"IF(AND($C287<=2,$C287<>0),0,IF($C287=3,OFFSET(G287,-1,0)+1,OFFSET(G287,-1,0)))","v":2},{"$f":"IF(AND($C287<=3,$C287<>0),0,IF($C287=4,OFFSET(H287,-1,0)+1,OFFSET(H287,-1,0)))","v":0},{"$f":"IF(AND($C287<=4,$C287<>0),0,IF(AND($C287=\"S\",$W287>0),OFFSET(I287,-1,0)+1,OFFSET(I287,-1,0)))","v":0},0,0,"F","Serviço","Serviço","1.6.2.0.59.","COMPOSIÇÃO","COMP 048_SEE","HASTE ROSQUEADA \"TIRANTE\" 3/8\"","M",0.5,null,null,null,""]
["S",3,"S",0,1,6,2,0,0,0,0,"F","Serviço","Serviço","1.6.2.0.60.","COMPOSIÇÃO","COMP 049_SEE","PORCA SEXTAVADA 3/8\"","UN ",8,null,null,null,""]
[3,3,3,67,1,6,3,0,0,67,192,"F","Nível 3","Nível 3","1.6.3.","SINAPI",null,"INST. DE INCÊNDIO","-",null,null,null,null,""]
[4,4,4,17,1,6,3,1,0,66,17,"F","Nível 4","Nível 4","1.6.3.1.","SINAPI",null,"QUADRO DE COMANDO DE MOTORES, RESERV. ENTERRADO","-",null,null,null,null,""]
["S",4,"S",0,1,6,3,1,0,0,0,"F","Serviço","Serviço","1.6.3.1.1.","AGETOP",70700,"CAIXA PARA QUADRO DE COMANDO METÁLICA DE SOBREPOR 40X30X20 CM","Un    ",1,null,null,null,""]
["S",4,"S",0,1,6,3,1,0,0,0,"F","Serviço","Serviço","1.6.3.1.2.","COMPOSIÇÃO","COMP 544_SEE","RELE DE NÍVEL","UN ",1,null,null,null,""]
["S",4,"S",0,1,6,3,1,0,0,0,"F","Serviço","Serviço","1.6.3.1.3.","AGETOP",70305,"BOTOEIRA \"LIGA-DESLIGA\" P/INST.EM PORTA  DE QUADRO","Un    ",3,null,null,null,""]
["S",4,"S",0,1,6,3,1,0,0,0,"F","Serviço","Serviço","1.6.3.1.4.","AGETOP",70776,"CH.PARTIDA DE MOTOR TRIF.C/RELE FALTA DE FASE 5CV","Un    ",2,null,null,null,""]
["S",4,"S",0,1,6,3,1,0,0,0,"F","Serviço","Serviço","1.6.3.1.5.","AGETOP",70837,"CH.PARTIDA DE MOTOR TRIF.C/RELE FALTA DE FASE 1 CV","Un    ",1,null,null,null,""]
["S",4,"S",0,1,6,3,1,0,0,0,"F","Serviço","Serviço","1.6.3.1.6.","SINAPI",93672,"DISJUNTOR TRIPOLAR TIPO DIN, CORRENTE NOMINAL DE 40A - FORNECIMENTO E INSTALAÇÃO. AF_04/2016","UN",1,null,null,null,"Referência: AGETOP - 71174"]
["S",4,"S",0,1,6,3,1,0,0,0,"F","Serviço","Serviço","1.6.3.1.7.","SINAPI",93671,"DISJUNTOR TRIPOLAR TIPO DIN, CORRENTE NOMINAL DE 32A - FORNECIMENTO E INSTALAÇÃO. AF_04/2016","UN",2,null,null,null,"Referência: AGETOP - 71173"]
["S",4,"S",0,1,6,3,1,0,0,0,"F","Serviço","Serviço","1.6.3.1.8.","SINAPI",93670,"DISJUNTOR TRIPOLAR TIPO DIN, CORRENTE NOMINAL DE 25A - FORNECIMENTO E INSTALAÇÃO. AF_04/2016","UN",1,null,null,null,"Referência: AGETOP - 71173"]
["S",4,"S",0,1,6,3,1,0,0,0,"F","Serviço","Serviço","1.6.3.1.9.","AGETOP",70286,"BORNE TERMINAL SAK 4 MM2","Un    ",4,null,null,null,""]
["S",4,"S",0,1,6,3,1,0,0,0,"F","Serviço","Serviço","1.6.3.1.10.","AGETOP",70288,"BORNE TERMINAL SAK 10 MM2","Un    ",8,null,null,null,""]
["S",4,"S",0,1,6,3,1,0,0,0,"F","Serviço","Serviço","1.6.3.1.11.","AGETOP",71184,"DISPOSITIVO DE PROTEÇÃO CONTRA SURTOS (D.P.S.) 275V DE 8 A 40KA","Un    ",4,null,null,null,""]
["S",4,"S",0,1,6,3,1,0,0,0,"F","Serviço","Serviço","1.6.3.1.12.","SINAPI",88547,"CHAVE DE BOIA AUTOMÁTICA SUPERIOR 10A/250V - FORNECIMENTO E INSTALACAO","UN",1,null,null,null,""]
["S",4,"S",0,1,6,3,1,0,0,0,"F","Serviço","Serviço","1.6.3.1.13.","AGETOP",70893,"CHAVE TRIPOLAR TIPO PACCO 40A","Un    ",2,null,null,null,""]
["S",4,"S",0,1,6,3,1,0,0,0,"F","Serviço","Serviço","1.6.3.1.14.","AGETOP",81894,"CHAVE DE BOIA AUTOMÁTICA - 15A/250V ","un    ",1,null,null,null,""]
["S",4,"S",0,1,6,3,1,0,0,0,"F","Serviço","Serviço","1.6.3.1.15.","AGETOP",70561,"CABO ISOLADO PP 3 X 2,5 MM2","M     ",20,null,null,null,""]
["S",4,"S",0,1,6,3,1,0,0,0,"F","Serviço","Serviço","1.6.3.1.16.","AGETOP",71064,"CONTATOR 3 TF 44 - 32A","Un    ",2,null,null,null,""]
[4,4,4,22,1,6,3,2,0,49,22,"F","Nível 4","Nível 4","1.6.3.2.","AGETOP",null,"QUADRO DE COMANDO DE MOTORES, INCÊNDIO 7,5CV","-",null,null,null,null,""]
["S",4,"S",0,1,6,3,2,0,0,0,"F","Serviço","Serviço","1.6.3.2.1.","AGETOP",70700,"CAIXA PARA QUADRO DE COMANDO METÁLICA DE SOBREPOR 40X30X20 CM","Un    ",1,null,null,null,""]
["S",4,"S",0,1,6,3,2,0,0,0,"F","Serviço","Serviço","1.6.3.2.2.","AGETOP",70424,"BUCHA E ARRUELA METALICA DIAM. 1.1/2\"","PR    ",4,null,null,null,""]
["S",4,"S",0,1,6,3,2,0,0,0,"F","Serviço","Serviço","1.6.3.2.3.","COMPOSIÇÃO","COMP 544_SEE","RELE DE NÍVEL","UN ",1,null,null,null,""]
["S",4,"S",0,1,6,3,2,0,0,0,"F","Serviço","Serviço","1.6.3.2.4.","AGETOP",70305,"BOTOEIRA \"LIGA-DESLIGA\" P/INST.EM PORTA  DE QUADRO","Un    ",1,null,null,null,""]
["S",4,"S",0,1,6,3,2,0,0,0,"F","Serviço","Serviço","1.6.3.2.5.","AGETOP",70779,"CH.PARTIDA MOTOR TRIF.C/RELE FALTA DE FASE 7 1/2CV","Un    ",1,null,null,null,""]
["S",4,"S",0,1,6,3,2,0,0,0,"F","Serviço","Serviço","1.6.3.2.6.","SINAPI",93672,"DISJUNTOR TRIPOLAR TIPO DIN, CORRENTE NOMINAL DE 40A - FORNECIMENTO E INSTALAÇÃO. AF_04/2016","UN",1,null,null,null,"Referência: AGETOP - 71174"]
["S",4,"S",0,1,6,3,2,0,0,0,"F","Serviço","Serviço","1.6.3.2.7.","SINAPI",93667,"DISJUNTOR TRIPOLAR TIPO DIN, CORRENTE NOMINAL DE 10A - FORNECIMENTO E INSTALAÇÃO. AF_04/2016","UN",3,null,null,null,""]
["S",4,"S",0,1,6,3,2,0,0,0,"F","Serviço","Serviço","1.6.3.2.8.","AGETOP",71184,"DISPOSITIVO DE PROTEÇÃO CONTRA SURTOS (D.P.S.) 275V DE 8 A 40KA","Un    ",4,null,null,null,""]
["S",4,"S",0,1,6,3,2,0,0,0,"F","Serviço","Serviço","1.6.3.2.9.","AGETOP",71063,"CONTATOR 3 TF 43 - 25A","Un    ",2,null,null,null,""]
["S",4,"S",0,1,6,3,2,0,0,0,"F","Serviço","Serviço","1.6.3.2.10.","AGETOP",70893,"CHAVE TRIPOLAR TIPO PACCO 40A","Un    ",1,null,null,null,""]
["S",4,"S",0,1,6,3,2,0,0,0,"F","Serviço","Serviço","1.6.3.2.11.","AGETOP",70779,"CH.PARTIDA MOTOR TRIF.C/RELE FALTA DE FASE 7 1/2CV","Un    ",1,null,null,null,""]
["S",4,"S",0,1,6,3,2,0,0,0,"F","Serviço","Serviço","1.6.3.2.12.","AGETOP",81894,"CHAVE DE BOIA AUTOMÁTICA - 15A/250V ","un    ",2,null,null,null,""]
["S",4,"S",0,1,6,3,2,0,0,0,"F","Serviço","Serviço","1.6.3.2.13.","AGETOP",70561,"CABO ISOLADO PP 3 X 2,5 MM2","M     ",20,null,null,null,""]
["S",4,"S",0,1,6,3,2,0,0,0,"F","Serviço","Serviço","1.6.3.2.14.","AGETOP",71184,"DISPOSITIVO DE PROTEÇÃO CONTRA SURTOS (D.P.S.) 275V DE 8 A 40KA","Un    ",4,null,null,null,""]
["S",4,"S",0,1,6,3,2,0,0,0,"F","Serviço","Serviço","1.6.3.2.15.","AGETOP",70288,"BORNE TERMINAL SAK 10 MM2","Un    ",4,null,null,null,""]
[{"$f":"CHOOSE(1+LOG(1+2*(ORÇAMENTO.Nivel=\"Nível 1\")+4*(ORÇAMENTO.Nivel=\"Nível 2\")+8*(ORÇAMENTO.Nivel=\"Nível 3\")+16*(ORÇAMENTO.Nivel=\"Nível 4\")+32*(ORÇAMENTO.Nivel=\"Serviço\"),2),0,1,2,3,4,\"S\")","v":"S"},4,"S",0,1,6,3,2,0,0,0,"F","Serviço","Serviço","1.6.3.2.16.","SINAPI",92980,"CABO DE COBRE FLEXÍVEL ISOLADO, 10 MM², ANTI-CHAMA 0,6/1,0 KV, PARA DISTRIBUIÇÃO - FORNECIMENTO E INSTALAÇÃO. AF_12/2015","M",241,null,null,null,""]
["S",4,"S",0,1,6,3,2,0,0,0,"F","Serviço","Serviço","1.6.3.2.17.","AGETOP",71203,"ELETRODUTO DE PVC RIGIDO DIAMETRO 1.1/2\"","M     ",60,null,null,null,""]
["S",4,"S",0,1,6,3,2,0,0,0,"F","Serviço","Serviço","1.6.3.2.18.","AGETOP",71744,"LUVA PVC ROSQUEAVEL DIAMETRO 1.1/2\"","Un    ",15,null,null,null,""]
["S",4,"S",0,1,6,3,2,0,0,0,"F","Serviço","Serviço","1.6.3.2.19.","AGETOP",71144,"CURVA DE 90 GRAUS DE PVC RIGIDO DIAM. 1.1/2\"","Un    ",3,null,null,null,""]
["S",4,"S",0,1,6,3,2,0,0,0,"F","Serviço","Serviço","1.6.3.2.20.","SINAPI",83446,"CAIXA DE PASSAGEM 30X30X40 COM TAMPA E DRENO BRITA","UN",1,null,null,null,""]
["S",4,"S",0,1,6,3,2,0,0,0,"F","Serviço","Serviço","1.6.3.2.21.","AGETOP",70633,"CAIXA DE PASSAGEM - ESCAVAÇÃO MANUAL / REATERRO/ APILOAMENTO DO FUNDO ","m3    ",0.12,null,null,null,""]
[4,4,4,14,1,6,3,3,0,27,14,"F","Nível 4","Nível 4","1.6.3.3.",null,null,"CIRC. DE COMANDO E ACIONAMENTO SISTEMA DE COMB. A INCÊNDIO","-",null,null,null,null,""]
["S",4,"S",0,1,6,3,3,0,0,0,"F","Serviço","Serviço","1.6.3.3.1.","AGETOP",91043,"BRAÇADEIRA METALICA TIPO \"D\" DIAM. 3/4\"","Un    ",40,null,null,null,""]
["S",4,"S",0,1,6,3,3,0,0,0,"F","Serviço","Serviço","1.6.3.3.2.","AGETOP",70421,"BUCHA E ARRUELA METALICA DIAM. 3/4\"","PR    ",10,null,null,null,""]
["S",4,"S",0,1,6,3,3,0,0,0,"F","Serviço","Serviço","1.6.3.3.3.","AGETOP",70356,"BRACADEIRA METALICA TIPO \"U\" DIAM. 2.1/2\"","Un    ",40,null,null,null,""]
["S",4,"S",0,1,6,3,3,0,0,0,"F","Serviço","Serviço","1.6.3.3.4.","AGETOP",70426,"BUCHA E ARRUELA METALICA DIAM. 2.1/2\"","PR    ",10,null,null,null,""]
["S",4,"S",0,1,6,3,3,0,0,0,"F","Serviço","Serviço","1.6.3.3.5.","AGETOP",70556,"CABO FLEXIVEL PARALELO 2 X 2,5 MM2","M     ",538,null,null,null,""]
["S",4,"S",0,1,6,3,3,0,0,0,"F","Serviço","Serviço","1.6.3.3.6.","AGETOP",71201,"ELETRODUTO DE PVC RIGIDO DIAMETRO 3/4\"","M     ",175,null,null,null,""]
["S",4,"S",0,1,6,3,3,0,0,0,"F","Serviço","Serviço","1.6.3.3.7.","SINAPI",95787,"CONDULETE DE ALUMÍNIO, TIPO LR, PARA ELETRODUTO DE AÇO GALVANIZADO DN 20 MM (3/4''), APARENTE - FORNECIMENTO E INSTALAÇÃO. AF_11/2016_P","UN",8,null,null,null,""]
["S",4,"S",0,1,6,3,3,0,0,0,"F","Serviço","Serviço","1.6.3.3.8.","SINAPI",95795,"CONDULETE DE ALUMÍNIO, TIPO T, PARA ELETRODUTO DE AÇO GALVANIZADO DN 20 MM (3/4''), APARENTE - FORNECIMENTO E INSTALAÇÃO. AF_11/2016_P","UN",3,null,null,null,""]
["S",4,"S",0,1,6,3,3,0,0,0,"F","Serviço","Serviço","1.6.3.3.9.","AGETOP",72395,"TAMPA CEGA PARA CONDULETE METÁLICO","Un    ",11,null,null,null,""]
["S",4,"S",0,1,6,3,3,0,{"$f":"IF(OR($C339=\"S\",$C339=0),0,MATCH(0,OFFSET($D339,1,$C339,ROW($C$839)-ROW($C339)),0))","v":0},{"$f":"IF(OR($C339=\"S\",$C339=0),0,MATCH(OFFSET($D339,0,$C339)+1,OFFSET($D339,1,$C339,ROW($C$839)-ROW($C339)),0))","v":0},"F","Serviço","Serviço","1.6.3.3.10.","SINAPI",91884,"LUVA PARA ELETRODUTO, PVC, ROSCÁVEL, DN 25 MM (3/4\"), PARA CIRCUITOS TERMINAIS, INSTALADA EM PAREDE - FORNECIMENTO E INSTALAÇÃO. AF_12/2015","UN",20,null,null,null,"Referência: AGETOP - 71741"]
["S",4,"S",0,1,6,3,3,0,0,0,"F","Serviço","Serviço","1.6.3.3.11.","AGETOP",70351,"BRACADEIRA METALICA TIPO \"U\" DIAM. 3/4\"","Un    ",20,null,null,null,""]
["S",4,"S",0,1,6,3,3,0,0,0,"F","Serviço","Serviço","1.6.3.3.12.","AGETOP",71862,"PARAFUSO P/BUCHA S-8","Un    ",80,null,null,null,""]
["S",4,"S",0,1,6,3,3,0,0,0,"F","Serviço","Serviço","1.6.3.3.13.","AGETOP",70392,"BUCHA DE NYLON S-8","Un    ",80,null,null,null,""]
[4,4,4,13,1,6,3,4,0,13,43,"F","Nível 4","Nível 4","1.6.3.4.","SINAPI",null,"CIRC. ILUMINAÇÃO DE EMERGÊNCIA","-",null,null,null,null,""]
["S",4,"S",0,1,6,3,4,0,0,0,"F","Serviço","Serviço","1.6.3.4.1.","SINAPI",91992,"TOMADA ALTA DE EMBUTIR (1 MÓDULO), 2P+T 10 A, INCLUINDO SUPORTE E PLACA - FORNECIMENTO E INSTALAÇÃO. AF_12/2015","UN",25,null,null,null,""]
["S",4,"S",0,1,6,3,4,0,0,0,"F","Serviço","Serviço","1.6.3.4.2.","SINAPI",91926,"CABO DE COBRE FLEXÍVEL ISOLADO, 2,5 MM², ANTI-CHAMA 450/750 V, PARA CIRCUITOS TERMINAIS - FORNECIMENTO E INSTALAÇÃO. AF_12/2015","M",1019,null,null,null,"Referência: AGETOP - 70563"]
["S",4,"S",0,1,6,3,4,0,0,0,"F","Serviço","Serviço","1.6.3.4.3.","SINAPI",91867,"ELETRODUTO RÍGIDO ROSCÁVEL, PVC, DN 25 MM (3/4\"), PARA CIRCUITOS TERMINAIS, INSTALADO EM LAJE - FORNECIMENTO E INSTALAÇÃO. AF_12/2015","M",289,null,null,null,"Referência: AGETOP - 71201"]
["S",4,"S",0,1,6,3,4,0,0,0,"F","Serviço","Serviço","1.6.3.4.4.","SINAPI",91879,"LUVA PARA ELETRODUTO, PVC, ROSCÁVEL, DN 25 MM (3/4\"), PARA CIRCUITOS TERMINAIS, INSTALADA EM LAJE - FORNECIMENTO E INSTALAÇÃO. AF_12/2015","UN",80,null,null,null,"Referência: AGETOP - 71741"]
["S",4,"S",0,1,6,3,4,0,0,0,"F","Serviço","Serviço","1.6.3.4.5.","AGETOP",70351,"BRACADEIRA METALICA TIPO \"U\" DIAM. 3/4\"","Un    ",80,null,null,null,""]
["S",4,"S",0,1,6,3,4,0,0,0,"F","Serviço","Serviço","1.6.3.4.6.","AGETOP",71862,"PARAFUSO P/BUCHA S-8","Un    ",320,null,null,null,""]
["S",4,"S",0,1,6,3,4,0,0,0,"F","Serviço","Serviço","1.6.3.4.7.","AGETOP",70392,"BUCHA DE NYLON S-8","Un    ",320,null,null,null,""]
["S",{"$f":"IF(OR(C351=\"s\",C351=0),OFFSET(B351,-1,0),C351)","v":4},{"$f":"IF(OFFSET(C351,-1,0)=\"L\",1,IF(OFFSET(C351,-1,0)=1,2,IF(OR(A351=\"s\",A351=0),\"S\",IF(AND(OFFSET(C351,-1,0)=2,A351=4),3,IF(AND(OR(OFFSET(C351,-1,0)=\"s\",OFFSET(C351,-1,0)=0),A351<>\"s\",A351>OFFSET(B351,-1,0)),OFFSET(B351,-1,0),A351)))))","v":"S"},{"$f":"IF(OR(C351=\"S\",C351=0),0,IF(ISERROR(K351),J351,SMALL(J351:K351,1)))","v":0},{"$f":"IF($C351=1,OFFSET(E351,-1,0)+1,OFFSET(E351,-1,0))","v":1},{"$f":"IF($C351=1,0,IF($C351=2,OFFSET(F351,-1,0)+1,OFFSET(F351,-1,0)))","v":6},{"$f":"IF(AND($C351<=2,$C351<>0),0,IF($C351=3,OFFSET(G351,-1,0)+1,OFFSET(G351,-1,0)))","v":3},{"$f":"IF(AND($C351<=3,$C351<>0),0,IF($C351=4,OFFSET(H351,-1,0)+1,OFFSET(H351,-1,0)))","v":4},{"$f":"IF(AND($C351<=4,$C351<>0),0,IF(AND($C351=\"S\",$W351>0),OFFSET(I351,-1,0)+1,OFFSET(I351,-1,0)))","v":0},0,0,"F","Serviço","Serviço","1.6.3.4.8.","SINAPI",95787,"CONDULETE DE ALUMÍNIO, TIPO LR, PARA ELETRODUTO DE AÇO GALVANIZADO DN 20 MM (3/4''), APARENTE - FORNECIMENTO E INSTALAÇÃO. AF_11/2016_P","UN",9,null,null,null,""]
["S",4,"S",0,1,6,3,4,0,0,0,"F","Serviço","Serviço","1.6.3.4.9.","SINAPI",95795,"CONDULETE DE ALUMÍNIO, TIPO T, PARA ELETRODUTO DE AÇO GALVANIZADO DN 20 MM (3/4''), APARENTE - FORNECIMENTO E INSTALAÇÃO. AF_11/2016_P","UN",4,null,null,null,""]
["S",4,"S",0,1,6,3,4,0,0,0,"F","Serviço","Serviço","1.6.3.4.10.","SINAPI",95801,"CONDULETE DE ALUMÍNIO, TIPO X, PARA ELETRODUTO DE AÇO GALVANIZADO DN 20 MM (3/4''), APARENTE - FORNECIMENTO E INSTALAÇÃO. AF_11/2016_P","UN",2,null,null,null,"Referência: AGETOP - 70929"]
["S",4,"S",0,1,6,3,4,0,0,0,"F","Serviço","Serviço","1.6.3.4.11.","SINAPI",95778,"CONDULETE DE ALUMÍNIO, TIPO C, PARA ELETRODUTO DE AÇO GALVANIZADO DN 20 MM (3/4''), APARENTE - FORNECIMENTO E INSTALAÇÃO. AF_11/2016_P","UN",2,null,null,null,""]
["S",4,"S",0,1,6,3,4,0,0,0,"F","Serviço","Serviço","1.6.3.4.12.","AGETOP",72395,"TAMPA CEGA PARA CONDULETE METÁLICO","Un    ",17,null,null,null,""]
[{"$f":"CHOOSE(1+LOG(1+2*(ORÇAMENTO.Nivel=\"Nível 1\")+4*(ORÇAMENTO.Nivel=\"Nível 2\")+8*(ORÇAMENTO.Nivel=\"Nível 3\")+16*(ORÇAMENTO.Nivel=\"Nível 4\")+32*(ORÇAMENTO.Nivel=\"Serviço\"),2),0,1,2,3,4,\"S\")","v":2},{"$f":"IF(OR(C356=\"s\",C356=0),OFFSET(B356,-1,0),C356)","v":2},{"$f":"IF(OFFSET(C356,-1,0)=\"L\",1,IF(OFFSET(C356,-1,0)=1,2,IF(OR(A356=\"s\",A356=0),\"S\",IF(AND(OFFSET(C356,-1,0)=2,A356=4),3,IF(AND(OR(OFFSET(C356,-1,0)=\"s\",OFFSET(C356,-1,0)=0),A356<>\"s\",A356>OFFSET(B356,-1,0)),OFFSET(B356,-1,0),A356)))))","v":2},{"$f":"IF(OR(C356=\"S\",C356=0),0,IF(ISERROR(K356),J356,SMALL(J356:K356,1)))","v":171},{"$f":"IF($C356=1,OFFSET(E356,-1,0)+1,OFFSET(E356,-1,0))","v":1},{"$f":"IF($C356=1,0,IF($C356=2,OFFSET(F356,-1,0)+1,OFFSET(F356,-1,0)))","v":7},{"$f":"IF(AND($C356<=2,$C356<>0),0,IF($C356=3,OFFSET(G356,-1,0)+1,OFFSET(G356,-1,0)))","v":0},{"$f":"IF(AND($C356<=3,$C356<>0),0,IF($C356=4,OFFSET(H356,-1,0)+1,OFFSET(H356,-1,0)))","v":0},{"$f":"IF(AND($C356<=4,$C356<>0),0,IF(AND($C356=\"S\",$W356>0),OFFSET(I356,-1,0)+1,OFFSET(I356,-1,0)))","v":0},483,171,"F","Nível 2","Nível 2","1.7.","AGETOP",null,"INSTALAÇÕES HIDROSSANITÁRIAS","-",null,null,null,null,""]
[3,{"$f":"IF(OR(C357=\"s\",C357=0),OFFSET(B357,-1,0),C357)","v":3},{"$f":"IF(OFFSET(C357,-1,0)=\"L\",1,IF(OFFSET(C357,-1,0)=1,2,IF(OR(A357=\"s\",A357=0),\"S\",IF(AND(OFFSET(C357,-1,0)=2,A357=4),3,IF(AND(OR(OFFSET(C357,-1,0)=\"s\",OFFSET(C357,-1,0)=0),A357<>\"s\",A357>OFFSET(B357,-1,0)),OFFSET(B357,-1,0),A357)))))","v":3},{"$f":"IF(OR(C357=\"S\",C357=0),0,IF(ISERROR(K357),J357,SMALL(J357:K357,1)))","v":34},{"$f":"IF($C357=1,OFFSET(E357,-1,0)+1,OFFSET(E357,-1,0))","v":1},{"$f":"IF($C357=1,0,IF($C357=2,OFFSET(F357,-1,0)+1,OFFSET(F357,-1,0)))","v":7},{"$f":"IF(AND($C357<=2,$C357<>0),0,IF($C357=3,OFFSET(G357,-1,0)+1,OFFSET(G357,-1,0)))","v":1},{"$f":"IF(AND($C357<=3,$C357<>0),0,IF($C357=4,OFFSET(H357,-1,0)+1,OFFSET(H357,-1,0)))","v":0},{"$f":"IF(AND($C357<=4,$C357<>0),0,IF(AND($C357=\"S\",$W357>0),OFFSET(I357,-1,0)+1,OFFSET(I357,-1,0)))","v":0},170,34,"F","Nível 3","Nível 3","1.7.1.","SINAPI",null,"PEÇAS E ACESSÓRIOS","-",null,null,null,null,""]
[4,4,4,8,1,7,1,1,0,33,8,"F","Nível 4","Nível 4","1.7.1.1.","SINAPI",null,"VASO SANITÁRIO E ACESSÓRIOS","-",null,null,null,null,""]
["S",4,"S",0,1,7,1,1,0,0,0,"F","Serviço","Serviço","1.7.1.1.1.","SINAPI",95470,"VASO SANITARIO SIFONADO CONVENCIONAL COM LOUÇA BRANCA, INCLUSO CONJUNTO DE LIGAÇÃO PARA BACIA SANITÁRIA AJUSTÁVEL - FORNECIMENTO E INSTALAÇÃO. AF_10/2016","UN",22,null,null,null,""]
["S",4,"S",0,1,7,1,1,0,0,0,"F","Serviço","Serviço","1.7.1.1.2.","SINAPI",99635,"VÁLVULA DE DESCARGA METÁLICA, BASE 1 1/2 \", ACABAMENTO METALICO CROMADO - FORNECIMENTO E INSTALAÇÃO. AF_01/2019","UN",22,null,null,null,"Referência: AGETOP - 80515"]
["S",4,"S",0,1,7,1,1,0,0,0,"F","Serviço","Serviço","1.7.1.1.3.","AGETOP",80520,"CONJUNTO DE FIXACAO P/VASO SANITARIO (PAR)","CJ    ",22,null,null,null,""]
["S",4,"S",0,1,7,1,1,0,0,0,"F","Serviço","Serviço","1.7.1.1.4.","AGETOP",80510,"ANEL DE VEDAÇÃO PARA VASO SANITÁRIO","Un    ",22,null,null,null,""]
["S",{"$f":"IF(OR(C363=\"s\",C363=0),OFFSET(B363,-1,0),C363)","v":4},{"$f":"IF(OFFSET(C363,-1,0)=\"L\",1,IF(OFFSET(C363,-1,0)=1,2,IF(OR(A363=\"s\",A363=0),\"S\",IF(AND(OFFSET(C363,-1,0)=2,A363=4),3,IF(AND(OR(OFFSET(C363,-1,0)=\"s\",OFFSET(C363,-1,0)=0),A363<>\"s\",A363>OFFSET(B363,-1,0)),OFFSET(B363,-1,0),A363)))))","v":"S"},{"$f":"IF(OR(C363=\"S\",C363=0),0,IF(ISERROR(K363),J363,SMALL(J363:K363,1)))","v":0},{"$f":"IF($C363=1,OFFSET(E363,-1,0)+1,OFFSET(E363,-1,0))","v":1},{"$f":"IF($C363=1,0,IF($C363=2,OFFSET(F363,-1,0)+1,OFFSET(F363,-1,0)))","v":7},{"$f":"IF(AND($C363<=2,$C363<>0),0,IF($C363=3,OFFSET(G363,-1,0)+1,OFFSET(G363,-1,0)))","v":1},{"$f":"IF(AND($C363<=3,$C363<>0),0,IF($C363=4,OFFSET(H363,-1,0)+1,OFFSET(H363,-1,0)))","v":1},{"$f":"IF(AND($C363<=4,$C363<>0),0,IF(AND($C363=\"S\",$W363>0),OFFSET(I363,-1,0)+1,OFFSET(I363,-1,0)))","v":0},0,0,"F","Serviço","Serviço","1.7.1.1.5.","AGETOP",80513,"TUBO PARA VÁLVULA DE DESCARGA ( CURTO 1.1/4\" )","Un    ",22,null,null,null,""]
["S",4,"S",0,1,7,1,1,0,0,0,"F","Serviço","Serviço","1.7.1.1.6.","AGETOP",80514,"TUBO DE LIGACAO PVC CROMADO 1.1/2\" / ESPUDE  - (ENTRADA)","Un    ",22,null,null,null,""]
["S",4,"S",0,1,7,1,1,0,0,0,"F","Serviço","Serviço","1.7.1.1.7.","COMPOSIÇÃO","COMP 427_SEE","DUCHA HIGIENICA PLASTICA COM REGISTRO METALICO 1/2 \"","UN ",20,null,null,null,""]
[4,4,4,11,1,7,1,2,0,25,11,"F","Nível 4","Nível 4","1.7.1.2.","SINAPI",null,"LAVATÓRIO E ACESSÓRIOS","-",null,null,null,null,""]
["S",4,"S",0,1,7,1,2,0,0,0,"F","Serviço","Serviço","1.7.1.2.1.","AGETOP",80542,"LAVATÓRIO MÉDIO SEM COLUNA","Un    ",6,null,null,null,""]
["S",4,"S",0,1,7,1,2,0,0,0,"F","Serviço","Serviço","1.7.1.2.2.","AGETOP",80550,"FIXACAO P/LAVATORIO (PAR)","PAR   ",6,null,null,null,""]
["S",4,"S",0,1,7,1,2,0,0,0,"F","Serviço","Serviço","1.7.1.2.3.","AGETOP",80556,"LIGAÇÃO FLEXÍVEL PVC DIAM.1/2\" (ENGATE)","Un    ",18,null,null,null,""]
["S",4,"S",0,1,7,1,2,0,0,0,"F","Serviço","Serviço","1.7.1.2.4.","SINAPI",86883,"SIFÃO DO TIPO FLEXÍVEL EM PVC 1\u0094 X 1.1/2\u0094 - FORNECIMENTO E INSTALAÇÃO. AF_12/2013","UN",18,null,null,null,""]
["S",4,"S",0,1,7,1,2,0,0,0,"F","Serviço","Serviço","1.7.1.2.5.","SINAPI",86915,"TORNEIRA CROMADA DE MESA, 1/2\" OU 3/4\", PARA LAVATÓRIO, PADRÃO MÉDIO - FORNECIMENTO E INSTALAÇÃO. AF_12/2013","UN",18,null,null,null,"Referência: AGETOP - 80570"]
["S",4,"S",0,1,7,1,2,0,0,0,"F","Serviço","Serviço","1.7.1.2.6.","SINAPI",86877,"VÁLVULA EM METAL CROMADO 1.1/2\" X 1.1/2\" PARA TANQUE OU LAVATÓRIO, COM OU SEM LADRÃO - FORNECIMENTO E INSTALAÇÃO. AF_12/2013","UN",18,null,null,null,""]
["S",4,"S",0,1,7,1,2,0,0,0,"F","Serviço","Serviço","1.7.1.2.7.","SINAPI",86901,"CUBA DE EMBUTIR OVAL EM LOUÇA BRANCA, 35 X 50CM OU EQUIVALENTE - FORNECIMENTO E INSTALAÇÃO. AF_12/2013","UN",12,null,null,null,"Referência: AGETOP - 80587"]
["S",4,"S",0,1,7,1,2,0,0,0,"F","Serviço","Serviço","1.7.1.2.8.","SINAPI","74234/1","MICTORIO SIFONADO DE LOUCA BRANCA COM PERTENCES, COM REGISTRO DE PRESSAO 1/2\" COM CANOPLA CROMADA ACABAMENTO SIMPLES E CONJUNTO PARA FIXACAO  - FORNECIMENTO E INSTALACAO","UN",6,null,null,null,"Referência: AGETOP - 80601"]
["S",4,"S",0,1,7,1,2,0,0,0,"F","Serviço","Serviço","1.7.1.2.9.","AGETOP",80610,"KIT FERR.P/MICT.LOUCA (ESPUDE,CONEXÃO ENTR.PARAFUSOS)","Un    ",6,null,null,null,""]
["S",4,"S",0,1,7,1,2,0,0,0,"F","Serviço","Serviço","1.7.1.2.10.","AGETOP",80613,"SIFÃO METÁLICO 1 1/2\" X 2\" P/MICTÓRIO","Un    ",6,null,null,null,""]
[4,4,4,5,1,7,1,3,0,14,5,"F","Nível 4","Nível 4","1.7.1.3.","SINAPI",null,"PIA E ACESSÓRIOS","-",null,null,null,null,""]
[{"$f":"CHOOSE(1+LOG(1+2*(ORÇAMENTO.Nivel=\"Nível 1\")+4*(ORÇAMENTO.Nivel=\"Nível 2\")+8*(ORÇAMENTO.Nivel=\"Nível 3\")+16*(ORÇAMENTO.Nivel=\"Nível 4\")+32*(ORÇAMENTO.Nivel=\"Serviço\"),2),0,1,2,3,4,\"S\")","v":"S"},{"$f":"IF(OR(C378=\"s\",C378=0),OFFSET(B378,-1,0),C378)","v":4},{"$f":"IF(OFFSET(C378,-1,0)=\"L\",1,IF(OFFSET(C378,-1,0)=1,2,IF(OR(A378=\"s\",A378=0),\"S\",IF(AND(OFFSET(C378,-1,0)=2,A378=4),3,IF(AND(OR(OFFSET(C378,-1,0)=\"s\",OFFSET(C378,-1,0)=0),A378<>\"s\",A378>OFFSET(B378,-1,0)),OFFSET(B378,-1,0),A378)))))","v":"S"},{"$f":"IF(OR(C378=\"S\",C378=0),0,IF(ISERROR(K378),J378,SMALL(J378:K378,1)))","v":0},{"$f":"IF($C378=1,OFFSET(E378,-1,0)+1,OFFSET(E378,-1,0))","v":1},{"$f":"IF($C378=1,0,IF($C378=2,OFFSET(F378,-1,0)+1,OFFSET(F378,-1,0)))","v":7},{"$f":"IF(AND($C378<=2,$C378<>0),0,IF($C378=3,OFFSET(G378,-1,0)+1,OFFSET(G378,-1,0)))","v":1},{"$f":"IF(AND($C378<=3,$C378<>0),0,IF($C378=4,OFFSET(H378,-1,0)+1,OFFSET(H378,-1,0)))","v":3},{"$f":"IF(AND($C378<=4,$C378<>0),0,IF(AND($C378=\"S\",$W378>0),OFFSET(I378,-1,0)+1,OFFSET(I378,-1,0)))","v":0},0,0,"F","Serviço","Serviço","1.7.1.3.1.","AGETOP",80688,"CUBA INOX 46X30X15CM E=0,6MM-AÇO 304 (CUBA Nº 1)","Un    ",2,null,null,null,""]
["S",4,"S",0,1,7,1,3,0,0,0,"F","Serviço","Serviço","1.7.1.3.2.","SINAPI",86912,"TORNEIRA CROMADA LONGA, DE PAREDE, 1/2\" OU 3/4\", PARA PIA DE COZINHA, PADRÃO MÉDIO - FORNECIMENTO E INSTALAÇÃO. AF_12/2013","UN",3,null,null,null,""]
["S",4,"S",0,1,7,1,3,0,0,0,"F","Serviço","Serviço","1.7.1.3.3.","SINAPI",86881,"SIFÃO DO TIPO GARRAFA EM METAL CROMADO 1 X 1.1/2\" - FORNECIMENTO E INSTALAÇÃO. AF_12/2013","UN",2,null,null,null,"Referência: AGETOP - 80670"]
["S",4,"S",0,1,7,1,3,0,0,0,"F","Serviço","Serviço","1.7.1.3.4.","SINAPI",86878,"VÁLVULA EM METAL CROMADO TIPO AMERICANA 3.1/2\" X 1.1/2\" PARA PIA - FORNECIMENTO E INSTALAÇÃO. AF_12/2013","UN",2,null,null,null,""]
[4,4,4,4,1,7,1,4,0,9,4,"F","Nível 4","Nível 4","1.7.1.4.","SINAPI",null,"TANQUES / TORNEIRAS","-",null,null,null,null,""]
["S",4,"S",0,1,7,1,4,0,0,0,"F","Serviço","Serviço","1.7.1.4.1.","SINAPI",88316,"SERVENTE COM ENCARGOS COMPLEMENTARES","H",2,null,null,null,""]
["S",4,"S",0,1,7,1,4,0,0,0,"F","Serviço","Serviço","1.7.1.4.2.","AGETOP",80820,"SIFAO P/TANQUE 1\" X 1.1/2\" - PVC","Un    ",1,null,null,null,""]
["S",4,"S",0,1,7,1,4,0,0,0,"F","Serviço","Serviço","1.7.1.4.3.","SINAPI",86877,"VÁLVULA EM METAL CROMADO 1.1/2\" X 1.1/2\" PARA TANQUE OU LAVATÓRIO, COM OU SEM LADRÃO - FORNECIMENTO E INSTALAÇÃO. AF_12/2013","UN",1,null,null,null,""]
[4,4,4,5,1,7,1,5,0,5,46,"F","Nível 4","Nível 4","1.7.1.5.","SINAPI",null,"REGISTROS","-",null,null,null,null,""]
["S",4,"S",0,1,7,1,5,0,0,0,"F","Serviço","Serviço","1.7.1.5.1.","AGETOP",80906,"REGISTRO DE GAVETA BRUTO DIAMETRO 2\"","Un    ",2,null,null,null,""]
["S",4,"S",0,1,7,1,5,0,0,0,"F","Serviço","Serviço","1.7.1.5.2.","AGETOP",80905,"REGISTRO DE GAVETA BRUTO DIAMETRO 1.1/2\"","Un    ",8,null,null,null,""]
["S",4,"S",0,1,7,1,5,0,0,0,"F","Serviço","Serviço","1.7.1.5.3.","AGETOP",80902,"REGISTRO DE GAVETA BRUTO DIAMETRO 3/4\"","Un    ",7,null,null,null,""]
["S",4,"S",0,1,7,1,5,0,0,0,"F","Serviço","Serviço","1.7.1.5.4.","AGETOP",80911,"REGISTRO DE GAVETA BRUTO 3\"","Un    ",4,null,null,null,""]
[3,3,3,59,1,7,2,0,0,136,59,"F","Nível 3","Nível 3","1.7.2.","SINAPI",null,"ÁGUA FRIA","-",null,null,null,null,""]
[4,4,4,6,1,7,2,1,0,58,6,"F","Nível 4","Nível 4","1.7.2.1.","SINAPI",null,"TUBOS DE PVC SOLDÁVEL","-",null,null,null,null,""]
["S",4,"S",0,1,7,2,1,0,0,0,"F","Serviço","Serviço","1.7.2.1.1.","SINAPI",89402,"TUBO, PVC, SOLDÁVEL, DN 25MM, INSTALADO EM RAMAL DE DISTRIBUIÇÃO DE ÁGUA - FORNECIMENTO E INSTALAÇÃO. AF_12/2014","M",44,null,null,null,"Referência: AGETOP - 81003"]
["S",4,"S",0,1,7,2,1,0,0,0,"F","Serviço","Serviço","1.7.2.1.2.","SINAPI",89447,"TUBO, PVC, SOLDÁVEL, DN 32MM, INSTALADO EM PRUMADA DE ÁGUA - FORNECIMENTO E INSTALAÇÃO. AF_12/2014","M",32,null,null,null,""]
["S",4,"S",0,1,7,2,1,0,0,0,"F","Serviço","Serviço","1.7.2.1.3.","SINAPI",89449,"TUBO, PVC, SOLDÁVEL, DN 50MM, INSTALADO EM PRUMADA DE ÁGUA - FORNECIMENTO E INSTALAÇÃO. AF_12/2014","M",66,null,null,null,""]
["S",4,"S",0,1,7,2,1,0,0,0,"F","Serviço","Serviço","1.7.2.1.4.","SINAPI",89450,"TUBO, PVC, SOLDÁVEL, DN 60MM, INSTALADO EM PRUMADA DE ÁGUA - FORNECIMENTO E INSTALAÇÃO. AF_12/2014","M",42,null,null,null,""]
["S",4,"S",0,1,7,2,1,0,0,0,"F","Serviço","Serviço","1.7.2.1.5.","SINAPI",89451,"TUBO, PVC, SOLDÁVEL, DN 75MM, INSTALADO EM PRUMADA DE ÁGUA - FORNECIMENTO E INSTALAÇÃO. AF_12/2014","M",38,null,null,null,""]
[4,4,4,8,1,7,2,2,0,52,8,"F","Nível 4","Nível 4","1.7.2.2.","SINAPI",null,"ADAPTADORES DE PVC SOLDÁVEL","-",null,null,null,null,""]
["S",4,"S",0,1,7,2,2,0,0,0,"F","Serviço","Serviço","1.7.2.2.1.","SINAPI",94713,"ADAPTADOR COM FLANGES LIVRES, PVC, SOLDÁVEL, DN 75 MM X 2 1/2 , INSTALADO EM RESERVAÇÃO DE ÁGUA DE EDIFICAÇÃO QUE POSSUA RESERVATÓRIO DE FIBRA/FIBROCIMENTO   FORNECIMENTO E INSTALAÇÃO. AF_06/2016","UN",1,null,null,null,""]
["S",4,"S",0,1,7,2,2,0,0,0,"F","Serviço","Serviço","1.7.2.2.2.","SINAPI",94714,"ADAPTADOR COM FLANGES LIVRES, PVC, SOLDÁVEL, DN 85 MM X 3 , INSTALADO EM RESERVAÇÃO DE ÁGUA DE EDIFICAÇÃO QUE POSSUA RESERVATÓRIO DE FIBRA/FIBROCIMENTO   FORNECIMENTO E INSTALAÇÃO. AF_06/2016","UN",4,null,null,null,""]
["S",4,"S",0,1,7,2,2,0,0,0,"F","Serviço","Serviço","1.7.2.2.3.","SINAPI",89538,"ADAPTADOR CURTO COM BOLSA E ROSCA PARA REGISTRO, PVC, SOLDÁVEL, DN 25MM X 3/4\u0094, INSTALADO EM PRUMADA DE ÁGUA - FORNECIMENTO E INSTALAÇÃO. AF_12/2014","UN",14,null,null,null,""]
["S",4,"S",0,1,7,2,2,0,0,0,"F","Serviço","Serviço","1.7.2.2.4.","SINAPI",89596,"ADAPTADOR CURTO COM BOLSA E ROSCA PARA REGISTRO, PVC, SOLDÁVEL, DN 50MM X 1.1/2\u0094, INSTALADO EM PRUMADA DE ÁGUA - FORNECIMENTO E INSTALAÇÃO. AF_12/2014","UN",38,null,null,null,"Referência: AGETOP - 81069"]
["S",4,"S",0,1,7,2,2,0,{"$f":"IF(OR($C403=\"S\",$C403=0),0,MATCH(0,OFFSET($D403,1,$C403,ROW($C$839)-ROW($C403)),0))","v":0},{"$f":"IF(OR($C403=\"S\",$C403=0),0,MATCH(OFFSET($D403,0,$C403)+1,OFFSET($D403,1,$C403,ROW($C$839)-ROW($C403)),0))","v":0},"F","Serviço","Serviço","1.7.2.2.5.","SINAPI",89610,"ADAPTADOR CURTO COM BOLSA E ROSCA PARA REGISTRO, PVC, SOLDÁVEL, DN 60MM X 2\u0094, INSTALADO EM PRUMADA DE ÁGUA - FORNECIMENTO E INSTALAÇÃO. AF_12/2014","UN",4,null,null,null,""]
["S",4,"S",0,1,7,2,2,0,0,0,"F","Serviço","Serviço","1.7.2.2.6.","SINAPI",89613,"ADAPTADOR CURTO COM BOLSA E ROSCA PARA REGISTRO, PVC, SOLDÁVEL, DN 75MM X 2.1/2\u0094, INSTALADO EM PRUMADA DE ÁGUA - FORNECIMENTO E INSTALAÇÃO. AF_12/2014","UN",2,null,null,null,"Referência: AGETOP - 81071"]
["S",4,"S",0,1,7,2,2,0,0,0,"F","Serviço","Serviço","1.7.2.2.7.","SINAPI",89616,"ADAPTADOR CURTO COM BOLSA E ROSCA PARA REGISTRO, PVC, SOLDÁVEL, DN 85MM X 3\u0094, INSTALADO EM PRUMADA DE ÁGUA - FORNECIMENTO E INSTALAÇÃO. AF_12/2014","UN",8,null,null,null,"Referência: AGETOP - 81072"]
[4,4,4,4,1,7,2,3,0,44,4,"F","Nível 4","Nível 4","1.7.2.3.","SINAPI",null,"LUVAS DE PVC","-",null,null,null,null,""]
["S",4,"S",0,1,7,2,3,0,0,0,"F","Serviço","Serviço","1.7.2.3.1.","SINAPI",89434,"LUVA SOLDÁVEL E COM ROSCA, PVC, SOLDÁVEL, DN 32MM X 1\u0094, INSTALADO EM RAMAL DE DISTRIBUIÇÃO DE ÁGUA - FORNECIMENTO E INSTALAÇÃO. AF_12/2014","UN",3,null,null,null,""]
["S",4,"S",0,1,7,2,3,0,0,0,"F","Serviço","Serviço","1.7.2.3.2.","SINAPI",89575,"LUVA, PVC, SOLDÁVEL, DN 50MM, INSTALADO EM PRUMADA DE ÁGUA - FORNECIMENTO E INSTALAÇÃO. AF_12/2014","UN",2,null,null,null,"Referência: AGETOP - 81105"]
["S",4,"S",0,1,7,2,3,0,0,0,"F","Serviço","Serviço","1.7.2.3.3.","SINAPI",89597,"LUVA, PVC, SOLDÁVEL, DN 60MM, INSTALADO EM PRUMADA DE ÁGUA - FORNECIMENTO E INSTALAÇÃO. AF_12/2014","UN",6,null,null,null,""]
[4,4,4,10,1,7,2,4,0,40,10,"F","Nível 4","Nível 4","1.7.2.4.","SINAPI",null,"BUCHAS","-",null,null,null,null,""]
["S",4,"S",0,1,7,2,4,0,0,0,"F","Serviço","Serviço","1.7.2.4.1.","AGETOP",81165,"BUCHA DE REDUCAO SOLD. CURTA 60 X 50 mm","Un    ",10,null,null,null,""]
["S",4,"S",0,1,7,2,4,0,0,0,"F","Serviço","Serviço","1.7.2.4.2.","AGETOP",81166,"BUCHA DE REDUCAO SOLDAVEL CURTA 75 X 60 mm","Un    ",2,null,null,null,""]
["S",4,"S",0,1,7,2,4,0,0,0,"F","Serviço","Serviço","1.7.2.4.3.","AGETOP",81179,"BUCHA DE REDUCAO SOLDAVEL LONGA 50 X 25 mm","Un    ",15,null,null,null,""]
["S",4,"S",0,1,7,2,4,0,0,0,"F","Serviço","Serviço","1.7.2.4.4.","AGETOP",81162,"BUCHA DE REDUCAO SOLD.CURTA 32 X 25 MM","Un    ",1,null,null,null,""]
["S",4,"S",0,1,7,2,4,0,0,0,"F","Serviço","Serviço","1.7.2.4.5.","AGETOP",81181,"BUCHA DE REDUCAO SOLDAVEL LONGA 60 X 25 mm","Un    ",4,null,null,null,""]
["S",4,"S",0,1,7,2,4,0,0,0,"F","Serviço","Serviço","1.7.2.4.6.","AGETOP",81185,"BUCHA DE REDUÇÃO SOLDÁVEL LONGA 75 X 50 MM","un    ",1,null,null,null,""]
["S",4,"S",0,1,7,2,4,0,0,0,"F","Serviço","Serviço","1.7.2.4.7.","AGETOP",81180,"BUCHA DE REDUCAO SOLDAVEL LONGA 50 X 32 mm","Un    ",1,null,null,null,""]
["S",4,"S",0,1,7,2,4,0,0,0,"F","Serviço","Serviço","1.7.2.4.8.","AGETOP",81182,"BUCHA DE REDUCAO SOLDAVEL LONGA 60 X 32 mm","Un    ",3,null,null,null,""]
["S",4,"S",0,1,7,2,4,0,0,0,"F","Serviço","Serviço","1.7.2.4.9.","COMPOSIÇÃO","COMP 057_SEE","BUCHA DE REDUCAO SOLDAVEL LONGA 85 X 60 mm","UN ",4,null,null,null,""]
[4,4,4,12,1,7,2,5,0,30,12,"F","Nível 4","Nível 4","1.7.2.5.","SINAPI",null,"JOELHO","-",null,null,null,null,""]
["S",4,"S",0,1,7,2,5,0,0,0,"F","Serviço","Serviço","1.7.2.5.1.","SINAPI",89409,"JOELHO 45 GRAUS, PVC, SOLDÁVEL, DN 25MM, INSTALADO EM RAMAL DE DISTRIBUIÇÃO DE ÁGUA - FORNECIMENTO E INSTALAÇÃO. AF_12/2014","UN",1,null,null,null,""]
["S",4,"S",0,1,7,2,5,0,0,0,"F","Serviço","Serviço","1.7.2.5.2.","SINAPI",89506,"JOELHO 45 GRAUS, PVC, SOLDÁVEL, DN 60MM, INSTALADO EM PRUMADA DE ÁGUA - FORNECIMENTO E INSTALAÇÃO. AF_12/2014","UN",2,null,null,null,""]
["S",4,"S",0,1,7,2,5,0,0,0,"F","Serviço","Serviço","1.7.2.5.3.","SINAPI",89481,"JOELHO 90 GRAUS, PVC, SOLDÁVEL, DN 25MM, INSTALADO EM PRUMADA DE ÁGUA - FORNECIMENTO E INSTALAÇÃO. AF_12/2014","UN",7,null,null,null,""]
["S",4,"S",0,1,7,2,5,0,0,0,"F","Serviço","Serviço","1.7.2.5.4.","SINAPI",89413,"JOELHO 90 GRAUS, PVC, SOLDÁVEL, DN 32MM, INSTALADO EM RAMAL DE DISTRIBUIÇÃO DE ÁGUA - FORNECIMENTO E INSTALAÇÃO. AF_12/2014","UN",2,null,null,null,"Referência: AGETOP - 81322"]
["S",4,"S",0,1,7,2,5,0,0,0,"F","Serviço","Serviço","1.7.2.5.5.","AGETOP",81340,"JOELHO REDUÇÃO 90º SOLDÁVEL  32 mm X 25 mm","Un    ",4,null,null,null,""]
["S",4,"S",0,1,7,2,5,0,0,0,"F","Serviço","Serviço","1.7.2.5.6.","SINAPI",89501,"JOELHO 90 GRAUS, PVC, SOLDÁVEL, DN 50MM, INSTALADO EM PRUMADA DE ÁGUA - FORNECIMENTO E INSTALAÇÃO. AF_12/2014","UN",19,null,null,null,""]
["S",4,"S",0,1,7,2,5,0,0,0,"F","Serviço","Serviço","1.7.2.5.7.","SINAPI",89505,"JOELHO 90 GRAUS, PVC, SOLDÁVEL, DN 60MM, INSTALADO EM PRUMADA DE ÁGUA - FORNECIMENTO E INSTALAÇÃO. AF_12/2014","UN",3,null,null,null,"Referência: AGETOP - 81325"]
["S",{"$f":"IF(OR(C428=\"s\",C428=0),OFFSET(B428,-1,0),C428)","v":4},{"$f":"IF(OFFSET(C428,-1,0)=\"L\",1,IF(OFFSET(C428,-1,0)=1,2,IF(OR(A428=\"s\",A428=0),\"S\",IF(AND(OFFSET(C428,-1,0)=2,A428=4),3,IF(AND(OR(OFFSET(C428,-1,0)=\"s\",OFFSET(C428,-1,0)=0),A428<>\"s\",A428>OFFSET(B428,-1,0)),OFFSET(B428,-1,0),A428)))))","v":"S"},{"$f":"IF(OR(C428=\"S\",C428=0),0,IF(ISERROR(K428),J428,SMALL(J428:K428,1)))","v":0},{"$f":"IF($C428=1,OFFSET(E428,-1,0)+1,OFFSET(E428,-1,0))","v":1},{"$f":"IF($C428=1,0,IF($C428=2,OFFSET(F428,-1,0)+1,OFFSET(F428,-1,0)))","v":7},{"$f":"IF(AND($C428<=2,$C428<>0),0,IF($C428=3,OFFSET(G428,-1,0)+1,OFFSET(G428,-1,0)))","v":2},{"$f":"IF(AND($C428<=3,$C428<>0),0,IF($C428=4,OFFSET(H428,-1,0)+1,OFFSET(H428,-1,0)))","v":5},{"$f":"IF(AND($C428<=4,$C428<>0),0,IF(AND($C428=\"S\",$W428>0),OFFSET(I428,-1,0)+1,OFFSET(I428,-1,0)))","v":0},0,0,"F","Serviço","Serviço","1.7.2.5.8.","SINAPI",89513,"JOELHO 90 GRAUS, PVC, SOLDÁVEL, DN 75MM, INSTALADO EM PRUMADA DE ÁGUA - FORNECIMENTO E INSTALAÇÃO. AF_12/2014","UN",1,null,null,null,"Referência: AGETOP - 81326"]
["S",4,"S",0,1,7,2,5,0,0,0,"F","Serviço","Serviço","1.7.2.5.9.","SINAPI",89521,"JOELHO 90 GRAUS, PVC, SOLDÁVEL, DN 85MM, INSTALADO EM PRUMADA DE ÁGUA - FORNECIMENTO E INSTALAÇÃO. AF_12/2014","UN",5,null,null,null,"Referência: AGETOP - 81327"]
["S",4,"S",0,1,7,2,5,0,0,0,"F","Serviço","Serviço","1.7.2.5.10.","AGETOP",81360,"JOELHO RED.90 GRAUS SOLD.C/BUCHA LATAO 25X1/2\"","Un    ",30,null,null,null,""]
["S",4,"S",0,1,7,2,5,0,0,0,"F","Serviço","Serviço","1.7.2.5.11.","AGETOP",81381,"JOELHO 90 GRAUS C/ROSCA E BUCHA LATAO DIAM. 3/4","Un    ",3,null,null,null,""]
[4,4,4,13,1,7,2,6,0,18,13,"F","Nível 4","Nível 4","1.7.2.6.","SINAPI",null,"TÊ","-",null,null,null,null,""]
["S",4,"S",0,1,7,2,6,0,0,0,"F","Serviço","Serviço","1.7.2.6.1.","SINAPI",89617,"TE, PVC, SOLDÁVEL, DN 25MM, INSTALADO EM PRUMADA DE ÁGUA - FORNECIMENTO E INSTALAÇÃO. AF_12/2014","UN",1,null,null,null,""]
["S",4,"S",0,1,7,2,6,0,0,0,"F","Serviço","Serviço","1.7.2.6.2.","SINAPI",89443,"TE, PVC, SOLDÁVEL, DN 32MM, INSTALADO EM RAMAL DE DISTRIBUIÇÃO DE ÁGUA - FORNECIMENTO E INSTALAÇÃO. AF_12/2014","UN",1,null,null,null,"Referência: AGETOP - 81403"]
["S",4,"S",0,1,7,2,6,0,0,0,"F","Serviço","Serviço","1.7.2.6.3.","SINAPI",89625,"TE, PVC, SOLDÁVEL, DN 50MM, INSTALADO EM PRUMADA DE ÁGUA - FORNECIMENTO E INSTALAÇÃO. AF_12/2014","UN",23,null,null,null,"Referência: AGETOP - 81405"]
["S",4,"S",0,1,7,2,6,0,0,0,"F","Serviço","Serviço","1.7.2.6.4.","SINAPI",89628,"TE, PVC, SOLDÁVEL, DN 60MM, INSTALADO EM PRUMADA DE ÁGUA - FORNECIMENTO E INSTALAÇÃO. AF_12/2014","UN",10,null,null,null,"Referência: AGETOP - 81406"]
["S",4,"S",0,1,7,2,6,0,0,0,"F","Serviço","Serviço","1.7.2.6.5.","SINAPI",89629,"TE, PVC, SOLDÁVEL, DN 75MM, INSTALADO EM PRUMADA DE ÁGUA - FORNECIMENTO E INSTALAÇÃO. AF_12/2014","UN",2,null,null,null,"Referência: AGETOP - 81407"]
["S",4,"S",0,1,7,2,6,0,0,0,"F","Serviço","Serviço","1.7.2.6.6.","SINAPI",89631,"TE, PVC, SOLDÁVEL, DN 85MM, INSTALADO EM PRUMADA DE ÁGUA - FORNECIMENTO E INSTALAÇÃO. AF_12/2014","UN",2,null,null,null,"Referência: AGETOP - 81408"]
["S",4,"S",0,1,7,2,6,0,0,0,"F","Serviço","Serviço","1.7.2.6.7.","SINAPI",89627,"TÊ DE REDUÇÃO, PVC, SOLDÁVEL, DN 50MM X 25MM, INSTALADO EM PRUMADA DE ÁGUA - FORNECIMENTO E INSTALAÇÃO. AF_12/2014","UN",6,null,null,null,""]
["S",4,"S",0,1,7,2,6,0,0,0,"F","Serviço","Serviço","1.7.2.6.8.","AGETOP",81424,"TE REDUCAO 90 GRAUS SOLDAVEL 50 X 25 mm","Un    ",10,null,null,null,""]
["S",4,"S",0,1,7,2,6,0,0,0,"F","Serviço","Serviço","1.7.2.6.9.","AGETOP",81421,"TE REDUCAO 90 GRAUS SOLDAVEL 32 X 25 mm","Un    ",1,null,null,null,""]
["S",4,"S",0,1,7,2,6,0,0,0,"F","Serviço","Serviço","1.7.2.6.10.","AGETOP",81427,"TE DE REDUCAO 90 GRAUS SOLDAVEL 75 X 50 MM","Un    ",1,null,null,null,""]
["S",4,"S",0,1,7,2,6,0,0,0,"F","Serviço","Serviço","1.7.2.6.11.","AGETOP",81444,"TE 90 GR.SOLD.C/BUC.LATAO NA BOLSA CENT.25X25X3/4\"","Un    ",1,null,null,null,""]
["S",4,"S",0,1,7,2,6,0,0,0,"F","Serviço","Serviço","1.7.2.6.12.","AGETOP",81445,"TE RED.SOLD.90GR.BUC.LATAO BOLSA CENT.25X25X1/2\"","Un    ",11,null,null,null,""]
[4,4,4,3,1,7,2,7,0,5,3,"F","Nível 4","Nível 4","1.7.2.7.","SINAPI",null,"ADESIVOS","-",null,null,null,null,""]
["S",4,"S",0,1,7,2,7,0,0,0,"F","Serviço","Serviço","1.7.2.7.1.","AGETOP",81501,"ADESIVO PLASTICO - FRASCO 850 G","Un    ",1,null,null,null,""]
["S",4,"S",0,1,7,2,7,0,0,0,"F","Serviço","Serviço","1.7.2.7.2.","AGETOP",81504,"SOLUCAO LIMPADORA 1000 CM3","Un    ",1,null,null,null,""]
[4,4,4,2,1,7,2,8,0,2,68,"F","Nível 4","Nível 4","1.7.2.8.","SINAPI",null,"CURVAS","-",null,null,null,null,""]
["S",4,"S",0,1,7,2,8,0,0,0,"F","Serviço","Serviço","1.7.2.8.1.","SINAPI",89411,"CURVA 45 GRAUS, PVC, SOLDÁVEL, DN 25MM, INSTALADO EM RAMAL DE DISTRIBUIÇÃO DE ÁGUA - FORNECIMENTO E INSTALAÇÃO. AF_12/2014","UN",1,null,null,null,""]
[3,3,3,31,1,7,3,0,0,77,31,"F","Nível 3","Nível 3","1.7.3.","SINAPI",null,"ESGOTO SANITÁRIO","-",null,null,null,null,""]
[4,4,4,4,1,7,3,1,0,30,4,"F","Nível 4","Nível 4","1.7.3.1.","SINAPI",null,"CORPO DE CAIXA SIFONADA / RALO","-",null,null,null,null,""]
["S",4,"S",0,1,7,3,1,0,0,0,"F","Serviço","Serviço","1.7.3.1.1.","AGETOP",81663,"CORPO CX. SIFONADA DIAM. 150 X 150 X 50","Un    ",10,null,null,null,""]
["S",4,"S",0,1,7,3,1,0,0,0,"F","Serviço","Serviço","1.7.3.1.2.","AGETOP",81696,"PROLONGAMENTO PARA CAIXA SIFONADA 150 MM","M     ",10,null,null,null,""]
["S",4,"S",0,1,7,3,1,0,0,0,"F","Serviço","Serviço","1.7.3.1.3.","AGETOP",81791,"GRELHA REDONDA BRANCA DIAM. 150 MM","Un    ",10,null,null,null,""]
[4,4,4,7,1,7,3,2,0,26,7,"F","Nível 4","Nível 4","1.7.3.2.","SINAPI",null,"CURVAS","-",null,null,null,null,""]
["S",4,"S",0,1,7,3,2,0,0,0,"F","Serviço","Serviço","1.7.3.2.1.","AGETOP",81702,"CURVA 45 GRAUS DIAMETRO 100 MM","Un    ",6,null,null,null,""]
["S",4,"S",0,1,7,3,2,0,0,0,"F","Serviço","Serviço","1.7.3.2.2.","AGETOP",81550,"CURVA 45º DIAMETRO 50 MM","Un    ",8,null,null,null,""]
["S",4,"S",0,1,7,3,2,0,0,0,"F","Serviço","Serviço","1.7.3.2.3.","AGETOP",81701,"CURVA 45 GRAUS DIAMETRO 40 MM","Un    ",8,null,null,null,""]
["S",4,"S",0,1,7,3,2,0,0,0,"F","Serviço","Serviço","1.7.3.2.4.","SINAPI",89728,"CURVA CURTA 90 GRAUS, PVC, SERIE NORMAL, ESGOTO PREDIAL, DN 40 MM, JUNTA SOLDÁVEL, FORNECIDO E INSTALADO EM RAMAL DE DESCARGA OU RAMAL DE ESGOTO SANITÁRIO. AF_12/2014","UN",19,null,null,null,""]
["S",4,"S",0,1,7,3,2,0,0,0,"F","Serviço","Serviço","1.7.3.2.5.","SINAPI",89733,"CURVA CURTA 90 GRAUS, PVC, SERIE NORMAL, ESGOTO PREDIAL, DN 50 MM, JUNTA ELÁSTICA, FORNECIDO E INSTALADO EM RAMAL DE DESCARGA OU RAMAL DE ESGOTO SANITÁRIO. AF_12/2014","UN",24,null,null,null,""]
["S",4,"S",0,1,7,3,2,0,0,0,"F","Serviço","Serviço","1.7.3.2.6.","SINAPI",89748,"CURVA CURTA 90 GRAUS, PVC, SERIE NORMAL, ESGOTO PREDIAL, DN 100 MM, JUNTA ELÁSTICA, FORNECIDO E INSTALADO EM RAMAL DE DESCARGA OU RAMAL DE ESGOTO SANITÁRIO. AF_12/2014","UN",10,null,null,null,""]
[4,4,4,6,1,7,3,3,0,19,6,"F","Nível 4","Nível 4","1.7.3.3.","SINAPI",null,"JOELHOS","-",null,null,null,null,""]
["S",4,"S",0,1,7,3,3,0,0,0,"F","Serviço","Serviço","1.7.3.3.1.","SINAPI",89810,"JOELHO 45 GRAUS, PVC, SERIE NORMAL, ESGOTO PREDIAL, DN 100 MM, JUNTA ELÁSTICA, FORNECIDO E INSTALADO EM PRUMADA DE ESGOTO SANITÁRIO OU VENTILAÇÃO. AF_12/2014","UN",12,null,null,null,""]
["S",4,"S",0,1,7,3,3,0,0,0,"F","Serviço","Serviço","1.7.3.3.2.","SINAPI",89731,"JOELHO 90 GRAUS, PVC, SERIE NORMAL, ESGOTO PREDIAL, DN 50 MM, JUNTA ELÁSTICA, FORNECIDO E INSTALADO EM RAMAL DE DESCARGA OU RAMAL DE ESGOTO SANITÁRIO. AF_12/2014","UN",26,null,null,null,""]
["S",4,"S",0,1,7,3,3,0,0,0,"F","Serviço","Serviço","1.7.3.3.3.","AGETOP",81927,"JOELHO 90 GRAUS C/ANEL 40 mm ","Un    ",19,null,null,null,""]
["S",4,"S",0,1,7,3,3,0,0,0,"F","Serviço","Serviço","1.7.3.3.4.","SINAPI",89744,"JOELHO 90 GRAUS, PVC, SERIE NORMAL, ESGOTO PREDIAL, DN 100 MM, JUNTA ELÁSTICA, FORNECIDO E INSTALADO EM RAMAL DE DESCARGA OU RAMAL DE ESGOTO SANITÁRIO. AF_12/2014","UN",1,null,null,null,"Referência: AGETOP - 81938"]
["S",4,"S",0,1,7,3,3,0,{"$f":"IF(OR($C467=\"S\",$C467=0),0,MATCH(0,OFFSET($D467,1,$C467,ROW($C$839)-ROW($C467)),0))","v":0},{"$f":"IF(OR($C467=\"S\",$C467=0),0,MATCH(OFFSET($D467,0,$C467)+1,OFFSET($D467,1,$C467,ROW($C$839)-ROW($C467)),0))","v":0},"F","Serviço","Serviço","1.7.3.3.5.","AGETOP",81946,"JOELHO 90 GRAUS C/VISITA DIAM.100 X 50 MM","Un    ",3,null,null,null,""]
[4,4,4,4,1,7,3,4,0,13,4,"F","Nível 4","Nível 4","1.7.3.4.","SINAPI",null,"JUNÇÕES","-",null,null,null,null,""]
["S",4,"S",0,1,7,3,4,0,0,0,"F","Serviço","Serviço","1.7.3.4.1.","SINAPI",89785,"JUNÇÃO SIMPLES, PVC, SERIE NORMAL, ESGOTO PREDIAL, DN 50 X 50 MM, JUNTA ELÁSTICA, FORNECIDO E INSTALADO EM RAMAL DE DESCARGA OU RAMAL DE ESGOTO SANITÁRIO. AF_12/2014","UN",4,null,null,null,"Referência: AGETOP - 81970"]
["S",4,"S",0,1,7,3,4,0,0,0,"F","Serviço","Serviço","1.7.3.4.2.","AGETOP",81973,"JUNCAO SIMPLES DIAM. 100 X 50 MM","Un    ",2,null,null,null,""]
["S",4,"S",0,1,7,3,4,0,0,0,"F","Serviço","Serviço","1.7.3.4.3.","SINAPI",89797,"JUNÇÃO SIMPLES, PVC, SERIE NORMAL, ESGOTO PREDIAL, DN 100 X 100 MM, JUNTA ELÁSTICA, FORNECIDO E INSTALADO EM RAMAL DE DESCARGA OU RAMAL DE ESGOTO SANITÁRIO. AF_12/2014","UN",18,null,null,null,"Referência: AGETOP - 81975"]
[4,4,4,2,1,7,3,5,0,9,2,"F","Nível 4","Nível 4","1.7.3.5.","SINAPI",null,"REDUÇÕES","-",null,null,null,null,""]
["S",4,"S",0,1,7,3,5,0,0,0,"F","Serviço","Serviço","1.7.3.5.1.","AGETOP",82103,"REDUCAO EXCENTRICA 100 X 50 MM","Un    ",6,null,null,null,""]
[4,4,4,3,1,7,3,6,0,7,3,"F","Nível 4","Nível 4","1.7.3.6.","SINAPI",null,"TÊ","-",null,null,null,null,""]
["S",4,"S",0,1,7,3,6,0,0,0,"F","Serviço","Serviço","1.7.3.6.1.","SINAPI",89825,"TE, PVC, SERIE NORMAL, ESGOTO PREDIAL, DN 50 X 50 MM, JUNTA ELÁSTICA, FORNECIDO E INSTALADO EM PRUMADA DE ESGOTO SANITÁRIO OU VENTILAÇÃO. AF_12/2014","UN",11,null,null,null,""]
["S",4,"S",0,1,7,3,6,0,0,0,"F","Serviço","Serviço","1.7.3.6.2.","AGETOP",82233,"TE SANITARIO DIAMETRO 100 X 50 MM","Un    ",2,null,null,null,""]
[4,4,4,4,1,7,3,7,0,4,33,"F","Nível 4","Nível 4","1.7.3.7.","SINAPI",null,"TUBOS","-",null,null,null,null,""]
["S",4,"S",0,1,7,3,7,0,0,0,"F","Serviço","Serviço","1.7.3.7.1.","SINAPI",89711,"TUBO PVC, SERIE NORMAL, ESGOTO PREDIAL, DN 40 MM, FORNECIDO E INSTALADO EM RAMAL DE DESCARGA OU RAMAL DE ESGOTO SANITÁRIO. AF_12/2014","M",22,null,null,null,"Referência: AGETOP - 82301"]
["S",4,"S",0,1,7,3,7,0,0,0,"F","Serviço","Serviço","1.7.3.7.2.","SINAPI",89798,"TUBO PVC, SERIE NORMAL, ESGOTO PREDIAL, DN 50 MM, FORNECIDO E INSTALADO EM PRUMADA DE ESGOTO SANITÁRIO OU VENTILAÇÃO. AF_12/2014","M",48,null,null,null,""]
["S",4,"S",0,1,7,3,7,0,0,0,"F","Serviço","Serviço","1.7.3.7.3.","SINAPI",89800,"TUBO PVC, SERIE NORMAL, ESGOTO PREDIAL, DN 100 MM, FORNECIDO E INSTALADO EM PRUMADA DE ESGOTO SANITÁRIO OU VENTILAÇÃO. AF_12/2014","M",115,null,null,null,""]
[3,3,3,9,1,7,4,0,0,46,9,"F","Nível 3","Nível 3","1.7.4.","SINAPI",null,"OUTROS","-",null,null,null,null,""]
["S",3,"S",0,1,7,4,0,0,0,0,"F","Serviço","Serviço","1.7.4.0.1.","AGETOP",81851,"CAIXA DE GORDURA 100 L CONCRETO PADRÃO GOINFRA IMPERMEABILIZADA","Un    ",1,null,null,null,""]
["S",3,"S",0,1,7,4,0,0,0,0,"F","Serviço","Serviço","1.7.4.0.2.","AGETOP",81825,"CAIXA DE PASSAGEM 60 X 60 CM SEM TAMPA","Un    ",10,null,null,null,""]
["S",3,"S",0,1,7,4,0,0,0,0,"F","Serviço","Serviço","1.7.4.0.3.","AGETOP",81826,"TAMPA EM CONCRETO ARMADO 25 MPA E=5CM PARA A CAIXA DE PASSAGEM 60X60CM","Un    ",10,null,null,null,""]
["S",3,"S",0,1,7,4,0,0,0,0,"F","Serviço","Serviço","1.7.4.0.4.","SINAPI",94797,"TORNEIRA DE BOIA, ROSCÁVEL, 1\u0094, FORNECIDA E INSTALADA EM RESERVAÇÃO DE ÁGUA. AF_06/2016","UN",1,null,null,null,""]
["S",3,"S",0,1,7,4,0,0,0,0,"F","Serviço","Serviço","1.7.4.0.5.","AGETOP",81885,"TERMINAL DE VENTILACAO DIAMETRO 50 MM","Un    ",12,null,null,null,""]
[{"$f":"CHOOSE(1+LOG(1+2*(ORÇAMENTO.Nivel=\"Nível 1\")+4*(ORÇAMENTO.Nivel=\"Nível 2\")+8*(ORÇAMENTO.Nivel=\"Nível 3\")+16*(ORÇAMENTO.Nivel=\"Nível 4\")+32*(ORÇAMENTO.Nivel=\"Serviço\"),2),0,1,2,3,4,\"S\")","v":"S"},{"$f":"IF(OR(C487=\"s\",C487=0),OFFSET(B487,-1,0),C487)","v":3},{"$f":"IF(OFFSET(C487,-1,0)=\"L\",1,IF(OFFSET(C487,-1,0)=1,2,IF(OR(A487=\"s\",A487=0),\"S\",IF(AND(OFFSET(C487,-1,0)=2,A487=4),3,IF(AND(OR(OFFSET(C487,-1,0)=\"s\",OFFSET(C487,-1,0)=0),A487<>\"s\",A487>OFFSET(B487,-1,0)),OFFSET(B487,-1,0),A487)))))","v":"S"},{"$f":"IF(OR(C487=\"S\",C487=0),0,IF(ISERROR(K487),J487,SMALL(J487:K487,1)))","v":0},{"$f":"IF($C487=1,OFFSET(E487,-1,0)+1,OFFSET(E487,-1,0))","v":1},{"$f":"IF($C487=1,0,IF($C487=2,OFFSET(F487,-1,0)+1,OFFSET(F487,-1,0)))","v":7},{"$f":"IF(AND($C487<=2,$C487<>0),0,IF($C487=3,OFFSET(G487,-1,0)+1,OFFSET(G487,-1,0)))","v":4},{"$f":"IF(AND($C487<=3,$C487<>0),0,IF($C487=4,OFFSET(H487,-1,0)+1,OFFSET(H487,-1,0)))","v":0},{"$f":"IF(AND($C487<=4,$C487<>0),0,IF(AND($C487=\"S\",$W487>0),OFFSET(I487,-1,0)+1,OFFSET(I487,-1,0)))","v":0},0,0,"F","Serviço","Serviço","1.7.4.0.6.","AGETOP",271509,"BEBEDOURO REVESTIDO COM CERÂMICA ADULTO/CRIANÇA PAREDE(SEM INST.H.SANIT.)","M     ",6,null,null,null,""]
["S",{"$f":"IF(OR(C488=\"s\",C488=0),OFFSET(B488,-1,0),C488)","v":3},{"$f":"IF(OFFSET(C488,-1,0)=\"L\",1,IF(OFFSET(C488,-1,0)=1,2,IF(OR(A488=\"s\",A488=0),\"S\",IF(AND(OFFSET(C488,-1,0)=2,A488=4),3,IF(AND(OR(OFFSET(C488,-1,0)=\"s\",OFFSET(C488,-1,0)=0),A488<>\"s\",A488>OFFSET(B488,-1,0)),OFFSET(B488,-1,0),A488)))))","v":"S"},{"$f":"IF(OR(C488=\"S\",C488=0),0,IF(ISERROR(K488),J488,SMALL(J488:K488,1)))","v":0},{"$f":"IF($C488=1,OFFSET(E488,-1,0)+1,OFFSET(E488,-1,0))","v":1},{"$f":"IF($C488=1,0,IF($C488=2,OFFSET(F488,-1,0)+1,OFFSET(F488,-1,0)))","v":7},{"$f":"IF(AND($C488<=2,$C488<>0),0,IF($C488=3,OFFSET(G488,-1,0)+1,OFFSET(G488,-1,0)))","v":4},{"$f":"IF(AND($C488<=3,$C488<>0),0,IF($C488=4,OFFSET(H488,-1,0)+1,OFFSET(H488,-1,0)))","v":0},{"$f":"IF(AND($C488<=4,$C488<>0),0,IF(AND($C488=\"S\",$W488>0),OFFSET(I488,-1,0)+1,OFFSET(I488,-1,0)))","v":0},0,0,"F","Serviço","Serviço","1.7.4.0.7.","AGETOP",80532,"PORTA PAPEL HIGIÊNICO EM METAL/ACABAMENTO CROMADO","Un    ",20,null,null,null,""]
["S",3,"S",0,1,7,4,0,0,0,0,"F","Serviço","Serviço","1.7.4.0.8.","AGETOP",80741,"SABONETEIRA EM METAL / ACABAMENTO CROMADO","Un    ",4,null,null,null,""]
[3,3,3,37,1,7,5,0,0,37,119,"F","Nível 3","Nível 3","1.7.5.","SINAPI",null,"ESCOVÓDROMO","-",null,null,null,null,""]
[4,{"$f":"IF(OR(C491=\"s\",C491=0),OFFSET(B491,-1,0),C491)","v":4},{"$f":"IF(OFFSET(C491,-1,0)=\"L\",1,IF(OFFSET(C491,-1,0)=1,2,IF(OR(A491=\"s\",A491=0),\"S\",IF(AND(OFFSET(C491,-1,0)=2,A491=4),3,IF(AND(OR(OFFSET(C491,-1,0)=\"s\",OFFSET(C491,-1,0)=0),A491<>\"s\",A491>OFFSET(B491,-1,0)),OFFSET(B491,-1,0),A491)))))","v":4},{"$f":"IF(OR(C491=\"S\",C491=0),0,IF(ISERROR(K491),J491,SMALL(J491:K491,1)))","v":4},{"$f":"IF($C491=1,OFFSET(E491,-1,0)+1,OFFSET(E491,-1,0))","v":1},{"$f":"IF($C491=1,0,IF($C491=2,OFFSET(F491,-1,0)+1,OFFSET(F491,-1,0)))","v":7},{"$f":"IF(AND($C491<=2,$C491<>0),0,IF($C491=3,OFFSET(G491,-1,0)+1,OFFSET(G491,-1,0)))","v":5},{"$f":"IF(AND($C491<=3,$C491<>0),0,IF($C491=4,OFFSET(H491,-1,0)+1,OFFSET(H491,-1,0)))","v":1},{"$f":"IF(AND($C491<=4,$C491<>0),0,IF(AND($C491=\"S\",$W491>0),OFFSET(I491,-1,0)+1,OFFSET(I491,-1,0)))","v":0},36,4,"F","Nível 4","Nível 4","1.7.5.1.","SINAPI",null,"LAVATÓRIO E ACESSÓRIOS","-",null,null,null,null,""]
["S",4,"S",0,1,7,5,1,0,0,0,"F","Serviço","Serviço","1.7.5.1.1.","SINAPI",86914,"TORNEIRA CROMADA 1/2\" OU 3/4\" PARA TANQUE, PADRÃO MÉDIO - FORNECIMENTO E INSTALAÇÃO. AF_12/2013","UN",8,null,null,null,""]
["S",4,"S",0,1,7,5,1,0,0,0,"F","Serviço","Serviço","1.7.5.1.2.","AGETOP",80820,"SIFAO P/TANQUE 1\" X 1.1/2\" - PVC","Un    ",4,null,null,null,""]
["S",4,"S",0,1,7,5,1,0,0,0,"F","Serviço","Serviço","1.7.5.1.3.","AGETOP",81084,"ADAPTADOR PVC P/SIFAO PVC 40 MM X 1.1/4\"","Un    ",4,null,null,null,""]
[4,4,4,2,1,7,5,2,0,32,2,"F","Nível 4","Nível 4","1.7.5.2.","SINAPI",null,"REGISTROS","-",null,null,null,null,""]
["S",4,"S",0,1,7,5,2,0,0,0,"F","Serviço","Serviço","1.7.5.2.1.","AGETOP",80927,"REGISTRO DE GAVETA C/CANOPLA DIAMETRO 1\"","Un    ",2,null,null,null,""]
[4,4,4,3,1,7,5,3,0,30,3,"F","Nível 4","Nível 4","1.7.5.3.","SINAPI",null,"TUBOS DE PVC SOLDÁVEL","-",null,null,null,null,""]
["S",4,"S",0,1,7,5,3,0,0,0,"F","Serviço","Serviço","1.7.5.3.1.","SINAPI",89402,"TUBO, PVC, SOLDÁVEL, DN 25MM, INSTALADO EM RAMAL DE DISTRIBUIÇÃO DE ÁGUA - FORNECIMENTO E INSTALAÇÃO. AF_12/2014","M",3,null,null,null,"Referência: AGETOP - 81003"]
["S",4,"S",0,1,7,5,3,0,0,0,"F","Serviço","Serviço","1.7.5.3.2.","SINAPI",89357,"TUBO, PVC, SOLDÁVEL, DN 32MM, INSTALADO EM RAMAL OU SUB-RAMAL DE ÁGUA - FORNECIMENTO E INSTALAÇÃO. AF_12/2014","M",6,null,null,null,"Referência: AGETOP - 81004"]
[4,4,4,2,1,7,5,4,0,27,2,"F","Nível 4","Nível 4","1.7.5.4.","SINAPI",null,"ADAPTADORES DE PVC SOLDÁVEL","-",null,null,null,null,""]
["S",4,"S",0,1,7,5,4,0,0,0,"F","Serviço","Serviço","1.7.5.4.1.","SINAPI",89391,"ADAPTADOR CURTO COM BOLSA E ROSCA PARA REGISTRO, PVC, SOLDÁVEL, DN 32MM X 1\u0094, INSTALADO EM RAMAL OU SUB-RAMAL DE ÁGUA - FORNECIMENTO E INSTALAÇÃO. AF_12/2014","UN",4,null,null,null,"Referência: AGETOP - 81067"]
[4,4,4,4,1,7,5,5,0,25,4,"F","Nível 4","Nível 4","1.7.5.5.","SINAPI",null,"JOELHO","-",null,null,null,null,""]
["S",4,"S",0,1,7,5,5,0,0,0,"F","Serviço","Serviço","1.7.5.5.1.","AGETOP",81369,"JOELHO 90 GRAUS SOLD. C/BUCHA LATAO 25 X 3/4\"","Un    ",8,null,null,null,""]
["S",4,"S",0,1,7,5,5,0,0,0,"F","Serviço","Serviço","1.7.5.5.2.","SINAPI",89408,"JOELHO 90 GRAUS, PVC, SOLDÁVEL, DN 25MM, INSTALADO EM RAMAL DE DISTRIBUIÇÃO DE ÁGUA - FORNECIMENTO E INSTALAÇÃO. AF_12/2014","UN",2,null,null,null,""]
["S",4,"S",0,1,7,5,5,0,0,0,"F","Serviço","Serviço","1.7.5.5.3.","SINAPI",89413,"JOELHO 90 GRAUS, PVC, SOLDÁVEL, DN 32MM, INSTALADO EM RAMAL DE DISTRIBUIÇÃO DE ÁGUA - FORNECIMENTO E INSTALAÇÃO. AF_12/2014","UN",4,null,null,null,"Referência: AGETOP - 81322"]
[4,4,4,2,1,7,5,6,0,21,2,"F","Nível 4","Nível 4","1.7.5.6.","SINAPI",null,"TÊ","-",null,null,null,null,""]
["S",4,"S",0,1,7,5,6,0,0,0,"F","Serviço","Serviço","1.7.5.6.1.","SINAPI",89445,"TÊ DE REDUÇÃO, PVC, SOLDÁVEL, DN 32MM X 25MM, INSTALADO EM RAMAL DE DISTRIBUIÇÃO DE ÁGUA - FORNECIMENTO E INSTALAÇÃO. AF_12/2014","UN",6,null,null,null,"Referência: AGETOP - 81421"]
[4,4,4,2,1,7,5,7,0,19,2,"F","Nível 4","Nível 4","1.7.5.7.","SINAPI",null,"LUVAS","-",null,null,null,null,""]
["S",4,"S",0,1,7,5,7,0,0,0,"F","Serviço","Serviço","1.7.5.7.1.","AGETOP",81162,"BUCHA DE REDUCAO SOLD.CURTA 32 X 25 MM","Un    ",2,null,null,null,""]
[4,4,4,6,1,7,5,8,0,17,6,"F","Nível 4","Nível 4","1.7.5.8.","SINAPI",null,"CORPO DE CAIXA SIFONADA / RALO","-",null,null,null,null,""]
["S",4,"S",0,1,7,5,8,0,0,0,"F","Serviço","Serviço","1.7.5.8.1.","AGETOP",81663,"CORPO CX. SIFONADA DIAM. 150 X 150 X 50","Un    ",2,null,null,null,""]
["S",4,"S",0,1,7,5,8,0,0,0,"F","Serviço","Serviço","1.7.5.8.2.","AGETOP",81696,"PROLONGAMENTO PARA CAIXA SIFONADA 150 MM","M     ",2,null,null,null,""]
["S",4,"S",0,1,7,5,8,0,0,0,"F","Serviço","Serviço","1.7.5.8.3.","AGETOP",81793,"GRELHA REDONDA CROMADA DIAM.150 MM","Un    ",2,null,null,null,""]
["S",4,"S",0,1,7,5,8,0,0,0,"F","Serviço","Serviço","1.7.5.8.4.","SINAPI",89710,"RALO SECO, PVC, DN 100 X 40 MM, JUNTA SOLDÁVEL, FORNECIDO E INSTALADO EM RAMAL DE DESCARGA OU EM RAMAL DE ESGOTO SANITÁRIO. AF_12/2014","UN",2,null,null,null,""]
["S",4,"S",0,1,7,5,8,0,0,0,"F","Serviço","Serviço","1.7.5.8.5.","AGETOP",81792,"GRELHA REDONDA CROMADA DIAM.100 MM","Un    ",2,null,null,null,""]
[4,4,4,4,1,7,5,9,0,11,4,"F","Nível 4","Nível 4","1.7.5.9.","SINAPI",null,"JOELHOS","-",null,null,null,null,""]
["S",4,"S",0,1,7,5,9,0,0,0,"F","Serviço","Serviço","1.7.5.9.1.","SINAPI",89726,"JOELHO 45 GRAUS, PVC, SERIE NORMAL, ESGOTO PREDIAL, DN 40 MM, JUNTA SOLDÁVEL, FORNECIDO E INSTALADO EM RAMAL DE DESCARGA OU RAMAL DE ESGOTO SANITÁRIO. AF_12/2014","UN",6,null,null,null,""]
["S",4,"S",0,1,7,5,9,0,0,0,"F","Serviço","Serviço","1.7.5.9.2.","AGETOP",81927,"JOELHO 90 GRAUS C/ANEL 40 mm ","Un    ",4,null,null,null,""]
["S",4,"S",0,1,7,5,9,0,0,0,"F","Serviço","Serviço","1.7.5.9.3.","SINAPI",89724,"JOELHO 90 GRAUS, PVC, SERIE NORMAL, ESGOTO PREDIAL, DN 40 MM, JUNTA SOLDÁVEL, FORNECIDO E INSTALADO EM RAMAL DE DESCARGA OU RAMAL DE ESGOTO SANITÁRIO. AF_12/2014","UN",4,null,null,null,""]
[4,4,4,3,1,7,5,10,0,7,3,"F","Nível 4","Nível 4","1.7.5.10.","SINAPI",null,"TUBOS","-",null,null,null,null,""]
["S",4,"S",0,1,7,5,10,0,0,0,"F","Serviço","Serviço","1.7.5.10.1.","SINAPI",89711,"TUBO PVC, SERIE NORMAL, ESGOTO PREDIAL, DN 40 MM, FORNECIDO E INSTALADO EM RAMAL DE DESCARGA OU RAMAL DE ESGOTO SANITÁRIO. AF_12/2014","M",6,null,null,null,"Referência: AGETOP - 82301"]
["S",4,"S",0,1,7,5,10,0,0,0,"F","Serviço","Serviço","1.7.5.10.2.","SINAPI",89798,"TUBO PVC, SERIE NORMAL, ESGOTO PREDIAL, DN 50 MM, FORNECIDO E INSTALADO EM PRUMADA DE ESGOTO SANITÁRIO OU VENTILAÇÃO. AF_12/2014","M",3,null,null,null,""]
[4,4,4,4,1,7,5,11,0,4,{"$error":"#N/A"},"F","Nível 4","Nível 4","1.7.5.11.","SINAPI",null,"EXTRAS","-",null,null,null,null,""]
["S",4,"S",0,1,7,5,11,0,0,0,"F","Serviço","Serviço","1.7.5.11.1.","AGETOP",81829,"CAIXA DE INSPEÇÃO - TAMPA EM CONCRETO ARMADO 25 MPA E=5CM ","m2    ",0.72,null,null,null,""]
["S",4,"S",0,1,7,5,11,0,0,0,"F","Serviço","Serviço","1.7.5.11.2.","AGETOP",81825,"CAIXA DE PASSAGEM 60 X 60 CM SEM TAMPA","Un    ",2,null,null,null,""]
["S",4,"S",0,1,7,5,11,0,0,0,"F","Serviço","Serviço","1.7.5.11.3.","SINAPI",83626,"GRELHA DE FERRO FUNDIDO PARA CANALETA LARG = 15CM, FORNECIMENTO E ASSENTAMENTO","M",7,null,null,null,""]
[{"$f":"CHOOSE(1+LOG(1+2*(ORÇAMENTO.Nivel=\"Nível 1\")+4*(ORÇAMENTO.Nivel=\"Nível 2\")+8*(ORÇAMENTO.Nivel=\"Nível 3\")+16*(ORÇAMENTO.Nivel=\"Nível 4\")+32*(ORÇAMENTO.Nivel=\"Serviço\"),2),0,1,2,3,4,\"S\")","v":2},{"$f":"IF(OR(C527=\"s\",C527=0),OFFSET(B527,-1,0),C527)","v":2},{"$f":"IF(OFFSET(C527,-1,0)=\"L\",1,IF(OFFSET(C527,-1,0)=1,2,IF(OR(A527=\"s\",A527=0),\"S\",IF(AND(OFFSET(C527,-1,0)=2,A527=4),3,IF(AND(OR(OFFSET(C527,-1,0)=\"s\",OFFSET(C527,-1,0)=0),A527<>\"s\",A527>OFFSET(B527,-1,0)),OFFSET(B527,-1,0),A527)))))","v":2},{"$f":"IF(OR(C527=\"S\",C527=0),0,IF(ISERROR(K527),J527,SMALL(J527:K527,1)))","v":70},{"$f":"IF($C527=1,OFFSET(E527,-1,0)+1,OFFSET(E527,-1,0))","v":1},{"$f":"IF($C527=1,0,IF($C527=2,OFFSET(F527,-1,0)+1,OFFSET(F527,-1,0)))","v":8},{"$f":"IF(AND($C527<=2,$C527<>0),0,IF($C527=3,OFFSET(G527,-1,0)+1,OFFSET(G527,-1,0)))","v":0},{"$f":"IF(AND($C527<=3,$C527<>0),0,IF($C527=4,OFFSET(H527,-1,0)+1,OFFSET(H527,-1,0)))","v":0},{"$f":"IF(AND($C527<=4,$C527<>0),0,IF(AND($C527=\"S\",$W527>0),OFFSET(I527,-1,0)+1,OFFSET(I527,-1,0)))","v":0},312,70,"F","Nível 2","Nível 2","1.8.",null,null,"INSTALAÇÕES ESPECIAIS","-",null,null,null,null,""]
[3,3,3,28,1,8,1,0,0,{"$f":"IF(OR($C528=\"S\",$C528=0),0,MATCH(0,OFFSET($D528,1,$C528,ROW($C$839)-ROW($C528)),0))","v":69},{"$f":"IF(OR($C528=\"S\",$C528=0),0,MATCH(OFFSET($D528,0,$C528)+1,OFFSET($D528,1,$C528,ROW($C$839)-ROW($C528)),0))","v":28},"F","Nível 3","Nível 3","1.8.1.","SINAPI",null,"CENTRAL DE GÁS","-",null,null,null,null,""]
["S",3,"S",0,1,8,1,0,0,0,0,"F","Serviço","Serviço","1.8.1.0.1.","AGETOP",91009,"CENTRAL DE GÁS PADRÃO GOINFRA SEM INSTALAÇÕES (2+2 CILINDROS 45 KG)","Un    ",1,null,null,null,""]
["S",3,"S",0,1,8,1,0,0,0,0,"F","Serviço","Serviço","1.8.1.0.2.","AGETOP",91023,"UNIÃO S/BRONZE PRETA 3/4\" NPT 300 LBS","Un    ",3,null,null,null,""]
["S",3,"S",0,1,8,1,0,0,0,0,"F","Serviço","Serviço","1.8.1.0.3.","COMPOSIÇÃO","COMP 382_SEE","TE DE REDUCAO DE FERRO GALVANIZADO, COM ROSCA BSP, DE 3/4\" X 1/2\"","UN ",1,null,null,null,""]
["S",3,"S",0,1,8,1,0,0,0,0,"F","Serviço","Serviço","1.8.1.0.4.","COMPOSIÇÃO","COMP 383_SEE","BUCHA DE REDUCAO DE FERRO GALVANIZADO, COM ROSCA BSP, DE 1/2\" X 1/4\"","UN ",3,null,null,null,""]
["S",3,"S",0,1,8,1,0,0,0,0,"F","Serviço","Serviço","1.8.1.0.5.","AGETOP",91021,"LUVA GALVANIZADO DE REDUÇÃO 3/4\" X 1/2\" (GÁS)","Un    ",2,null,null,null,""]
["S",3,"S",0,1,8,1,0,0,0,0,"F","Serviço","Serviço","1.8.1.0.6.","SINAPI",92692,"NIPLE, EM FERRO GALVANIZADO, CONEXÃO ROSQUEADA, DN 15 (1/2\"), INSTALADO EM RAMAIS E SUB-RAMAIS DE GÁS - FORNECIMENTO E INSTALAÇÃO. AF_12/2015","UN",6,null,null,null,""]
["S",3,"S",0,1,8,1,0,0,0,0,"F","Serviço","Serviço","1.8.1.0.7.","AGETOP",91031,"NIPLE DUPLO 300 PSI 3/4\"","Un    ",6,null,null,null,""]
["S",3,"S",0,1,8,1,0,0,0,0,"F","Serviço","Serviço","1.8.1.0.8.","COMPOSIÇÃO","COMP 212_SEE","NIPLE DE REDUÇÃO 1/2\" X 1/4\" BSP","UN ",4,null,null,null,""]
["S",3,"S",0,1,8,1,0,0,0,0,"F","Serviço","Serviço","1.8.1.0.9.","COMPOSIÇÃO","COMP 213_SEE","NIPLE DE REDUÇÃO 3/4\" X 1/2\" BSP","UN ",4,null,null,null,""]
["S",3,"S",0,1,8,1,0,0,0,0,"F","Serviço","Serviço","1.8.1.0.10.","SINAPI",92688,"TUBO DE AÇO GALVANIZADO COM COSTURA, CLASSE MÉDIA, CONEXÃO ROSQUEADA, DN 20 (3/4\"), INSTALADO EM RAMAIS E SUB-RAMAIS DE GÁS - FORNECIMENTO E INSTALAÇÃO. AF_12/2015","M",30,null,null,null,""]
["S",3,"S",0,1,8,1,0,0,0,0,"F","Serviço","Serviço","1.8.1.0.11.","SINAPI",92701,"JOELHO 90 GRAUS, EM FERRO GALVANIZADO, CONEXÃO ROSQUEADA, DN 20 (3/4\"), INSTALADO EM RAMAIS E SUB-RAMAIS DE GÁS - FORNECIMENTO E INSTALAÇÃO. AF_12/2015","UN",7,null,null,null,""]
["S",3,"S",0,1,8,1,0,0,0,0,"F","Serviço","Serviço","1.8.1.0.12.","COMPOSIÇÃO","COMP 237_SEE","FITA ANTICORROSIVA","M",26,null,null,null,""]
["S",3,"S",0,1,8,1,0,0,0,0,"F","Serviço","Serviço","1.8.1.0.13.","AGETOP",91025,"VÁLVULA ESFERICA LATÃO 3/4\"","Un    ",5,null,null,null,""]
["S",3,"S",0,1,8,1,0,0,0,0,"F","Serviço","Serviço","1.8.1.0.14.","AGETOP",91019,"TE PRETO 90º 3/4\" NPT 300 LBS","Un    ",3,null,null,null,""]
["S",3,"S",0,1,8,1,0,0,0,0,"F","Serviço","Serviço","1.8.1.0.15.","COMPOSIÇÃO","COMP 542_SEE","VÁLVULA UGV 3/4\" (S) LATÃO","UN ",4,null,null,null,""]
["S",3,"S",0,1,8,1,0,0,0,0,"F","Serviço","Serviço","1.8.1.0.16.","COMPOSIÇÃO","COMP 543_SEE","VÁLVULA UGV 1/2\" (S) LATÃO","UN ",4,null,null,null,""]
["S",3,"S",0,1,8,1,0,0,0,0,"F","Serviço","Serviço","1.8.1.0.17.","AGETOP",91029,"VALVULA DE RETENÇÃO LATÃO 1/2\" X 7/16\" NPT","Un    ",4,null,null,null,""]
["S",3,"S",0,1,8,1,0,0,0,0,"F","Serviço","Serviço","1.8.1.0.18.","COMPOSIÇÃO","COMP 211_SEE","REGULADOR DE 2º ESTÁGIO 5KG/H","UN ",4,null,null,null,""]
["S",3,"S",0,1,8,1,0,0,0,0,"F","Serviço","Serviço","1.8.1.0.19.","COMPOSIÇÃO","COMP 210_SEE","REGULADOR DE 1º ESTÁGIO 60KG/H MODELO AP-40  COM MANÔMETRO","UN ",1,null,null,null,""]
["S",3,"S",0,1,8,1,0,0,0,0,"F","Serviço","Serviço","1.8.1.0.20.","AGETOP",85003,"EXTINTOR PO QUIMICO SECO (6 KG) - CAPACIDADE EXTINTORA 20 BC","Un    ",1,null,null,null,""]
["S",3,"S",0,1,8,1,0,0,0,0,"F","Serviço","Serviço","1.8.1.0.21.","COMPOSIÇÃO","COMP 235_SEE","PLACA DE SINALIZAÇÃO EM PVC COD 01 - (300X300) PROIBIDO FUMAR","UN ",2,null,null,null,""]
["S",3,"S",0,1,8,1,0,0,0,0,"F","Serviço","Serviço","1.8.1.0.22.","COMPOSIÇÃO","COMP 236_SEE","PLACA DE SINALIZAÇÃO EM PVC COD 06 - (300X300) PERIGO INFLAMÁVEL","UN ",2,null,null,null,""]
["S",3,"S",0,1,8,1,0,0,0,0,"F","Serviço","Serviço","1.8.1.0.23.","AGETOP",91043,"BRAÇADEIRA METALICA TIPO \"D\" DIAM. 3/4\"","Un    ",4,null,null,null,""]
["S",3,"S",0,1,8,1,0,0,0,0,"F","Serviço","Serviço","1.8.1.0.24.","AGETOP",71863,"PARAFUSO P/BUCHA S-10","Un    ",8,null,null,null,""]
["S",3,"S",0,1,8,1,0,0,0,0,"F","Serviço","Serviço","1.8.1.0.25.","AGETOP",70393,"BUCHA DE NYLON S-10","Un    ",8,null,null,null,""]
["S",3,"S",0,1,8,1,0,0,0,0,"F","Serviço","Serviço","1.8.1.0.26.","AGETOP",91045,"SUPORTE PARA COLETOR","Un    ",2,null,null,null,""]
[{"$f":"CHOOSE(1+LOG(1+2*(ORÇAMENTO.Nivel=\"Nível 1\")+4*(ORÇAMENTO.Nivel=\"Nível 2\")+8*(ORÇAMENTO.Nivel=\"Nível 3\")+16*(ORÇAMENTO.Nivel=\"Nível 4\")+32*(ORÇAMENTO.Nivel=\"Serviço\"),2),0,1,2,3,4,\"S\")","v":"S"},{"$f":"IF(OR(C555=\"s\",C555=0),OFFSET(B555,-1,0),C555)","v":3},{"$f":"IF(OFFSET(C555,-1,0)=\"L\",1,IF(OFFSET(C555,-1,0)=1,2,IF(OR(A555=\"s\",A555=0),\"S\",IF(AND(OFFSET(C555,-1,0)=2,A555=4),3,IF(AND(OR(OFFSET(C555,-1,0)=\"s\",OFFSET(C555,-1,0)=0),A555<>\"s\",A555>OFFSET(B555,-1,0)),OFFSET(B555,-1,0),A555)))))","v":"S"},{"$f":"IF(OR(C555=\"S\",C555=0),0,IF(ISERROR(K555),J555,SMALL(J555:K555,1)))","v":0},{"$f":"IF($C555=1,OFFSET(E555,-1,0)+1,OFFSET(E555,-1,0))","v":1},{"$f":"IF($C555=1,0,IF($C555=2,OFFSET(F555,-1,0)+1,OFFSET(F555,-1,0)))","v":8},{"$f":"IF(AND($C555<=2,$C555<>0),0,IF($C555=3,OFFSET(G555,-1,0)+1,OFFSET(G555,-1,0)))","v":1},{"$f":"IF(AND($C555<=3,$C555<>0),0,IF($C555=4,OFFSET(H555,-1,0)+1,OFFSET(H555,-1,0)))","v":0},{"$f":"IF(AND($C555<=4,$C555<>0),0,IF(AND($C555=\"S\",$W555>0),OFFSET(I555,-1,0)+1,OFFSET(I555,-1,0)))","v":0},0,0,"F","Serviço","Serviço","1.8.1.0.27.","COMPOSIÇÃO","COMP 045_SEE","LAUDO DE ESTANQUEIDADE","UN ",1,null,null,null,""]
[3,{"$f":"IF(OR(C556=\"s\",C556=0),OFFSET(B556,-1,0),C556)","v":3},{"$f":"IF(OFFSET(C556,-1,0)=\"L\",1,IF(OFFSET(C556,-1,0)=1,2,IF(OR(A556=\"s\",A556=0),\"S\",IF(AND(OFFSET(C556,-1,0)=2,A556=4),3,IF(AND(OR(OFFSET(C556,-1,0)=\"s\",OFFSET(C556,-1,0)=0),A556<>\"s\",A556>OFFSET(B556,-1,0)),OFFSET(B556,-1,0),A556)))))","v":3},{"$f":"IF(OR(C556=\"S\",C556=0),0,IF(ISERROR(K556),J556,SMALL(J556:K556,1)))","v":41},{"$f":"IF($C556=1,OFFSET(E556,-1,0)+1,OFFSET(E556,-1,0))","v":1},{"$f":"IF($C556=1,0,IF($C556=2,OFFSET(F556,-1,0)+1,OFFSET(F556,-1,0)))","v":8},{"$f":"IF(AND($C556<=2,$C556<>0),0,IF($C556=3,OFFSET(G556,-1,0)+1,OFFSET(G556,-1,0)))","v":2},{"$f":"IF(AND($C556<=3,$C556<>0),0,IF($C556=4,OFFSET(H556,-1,0)+1,OFFSET(H556,-1,0)))","v":0},{"$f":"IF(AND($C556<=4,$C556<>0),0,IF(AND($C556=\"S\",$W556>0),OFFSET(I556,-1,0)+1,OFFSET(I556,-1,0)))","v":0},41,47,"F","Nível 3","Nível 3","1.8.2.","SINAPI",null,"INST. DE INCÊNDIO","-",null,null,null,null,""]
["S",3,"S",0,1,8,2,0,0,0,0,"F","Serviço","Serviço","1.8.2.0.1.","COMPOSIÇÃO","COMP 547_SEE","BOMBA THSI-18 6CV","UN ",1,null,null,null,""]
["S",3,"S",0,1,8,2,0,0,0,0,"F","Serviço","Serviço","1.8.2.0.2.","AGETOP",71156,"CURVA DE 90 GRAUS AÇO GALVANIZADO DIAM. 2.1/2\"","Un    ",1,null,null,null,""]
["S",3,"S",0,1,8,2,0,0,0,0,"F","Serviço","Serviço","1.8.2.0.3.","AGETOP",80910,"REGISTRO DE GAVETA BRUTO DIAMETRO 2.1/2\"","Un    ",4,null,null,null,""]
["S",3,"S",0,1,8,2,0,0,0,0,"F","Serviço","Serviço","1.8.2.0.4.","AGETOP",82379,"TUBO FERRO GALVANIZADO DIAM.2.1/2\"","m     ",170,null,null,null,""]
["S",3,"S",0,1,8,2,0,0,0,0,"F","Serviço","Serviço","1.8.2.0.5.","AGETOP",85003,"EXTINTOR PO QUIMICO SECO (6 KG) - CAPACIDADE EXTINTORA 20 BC","Un    ",1,null,null,null,""]
["S",3,"S",0,1,8,2,0,0,0,0,"F","Serviço","Serviço","1.8.2.0.6.","AGETOP",85006,"EXTINTOR MULTI USO EM PO A B C (6 KG) - CAPACIDADE EXTINTORA 3A 20BC","un    ",7,null,null,null,""]
["S",3,"S",0,1,8,2,0,0,0,0,"F","Serviço","Serviço","1.8.2.0.7.","AGETOP",71706,"LUVA  EM AÇO GALVANIZADO DIÂMETRO 2.1/2\"","Un    ",4,null,null,null,""]
["S",3,"S",0,1,8,2,0,0,0,0,"F","Serviço","Serviço","1.8.2.0.8.","AGETOP",85011,"CAIXA DE INCÊNDIO METÁLICA COM SUPORTE PARA MANGUEIRA, TAMPA E MURETA 17X60X90 CM C/PINTURA","Un    ",5,null,null,null,""]
["S",3,"S",0,1,8,2,0,0,0,0,"F","Serviço","Serviço","1.8.2.0.9.","AGETOP",85017,"MANGUEIRA DE INCÊNDIO D.I. = 38 MM TIPO 2 COMP. = 15 M","CJ    ",10,null,null,null,""]
["S",3,"S",0,1,8,2,0,0,0,0,"F","Serviço","Serviço","1.8.2.0.10.","AGETOP",85025,"ESGUICHO REGULÁVEL 1.1/2\"","Un    ",5,null,null,null,""]
["S",3,"S",0,1,8,2,0,0,0,0,"F","Serviço","Serviço","1.8.2.0.11.","AGETOP",85027,"ADAPTADOR P/ENGATE STORZ 2.1/2\" X 1.1/2\"","Un    ",6,null,null,null,""]
["S",3,"S",0,1,8,2,0,0,{"$f":"IF(OR($C568=\"S\",$C568=0),0,MATCH(0,OFFSET($D568,1,$C568,ROW($C$839)-ROW($C568)),0))","v":0},{"$f":"IF(OR($C568=\"S\",$C568=0),0,MATCH(OFFSET($D568,0,$C568)+1,OFFSET($D568,1,$C568,ROW($C$839)-ROW($C568)),0))","v":0},"F","Serviço","Serviço","1.8.2.0.12.","AGETOP",85031,"REGISTRO GLOBO ANGULAR 2.1/2\"","Un    ",5,null,null,null,""]
["S",3,"S",0,1,8,2,0,0,0,0,"F","Serviço","Serviço","1.8.2.0.13.","AGETOP",85035,"TAMPÃO CEGO COM CORRENTE 2.1/2\"","Un    ",6,null,null,null,""]
["S",3,"S",0,1,8,2,0,0,0,0,"F","Serviço","Serviço","1.8.2.0.14.","AGETOP",85037,"TANQUE DE PRESSÃO DE 10 L","Un    ",1,null,null,null,""]
["S",3,"S",0,1,8,2,0,0,0,0,"F","Serviço","Serviço","1.8.2.0.15.","AGETOP",85039,"PRESSOSTATO 50 A 80 PSI","Un    ",1,null,null,null,""]
["S",3,"S",0,1,8,2,0,0,0,0,"F","Serviço","Serviço","1.8.2.0.16.","AGETOP",85041,"MANOMETRO - 0 A 10 KG/CM2","Un    ",1,null,null,null,""]
["S",3,"S",0,1,8,2,0,0,0,0,"F","Serviço","Serviço","1.8.2.0.17.","AGETOP",85047,"NIPLE DUPLO FERRO GALVANIZADO 2.1/2\"","Un    ",9,null,null,null,""]
["S",3,"S",0,1,8,2,0,0,0,0,"F","Serviço","Serviço","1.8.2.0.18.","SINAPI",92377,"NIPLE, EM FERRO GALVANIZADO, DN 65 (2 1/2\"), CONEXÃO ROSQUEADA, INSTALADO EM REDE DE ALIMENTAÇÃO PARA HIDRANTE - FORNECIMENTO E INSTALAÇÃO. AF_12/2015","UN",5,null,null,null,""]
["S",3,"S",0,1,8,2,0,0,0,0,"F","Serviço","Serviço","1.8.2.0.19.","AGETOP",85077,"VÁLVULA DE RETENÇÃO HORIZONTAL 2.1/2\"","Un    ",2,null,null,null,""]
["S",3,"S",0,1,8,2,0,0,0,0,"F","Serviço","Serviço","1.8.2.0.20.","COMPOSIÇÃO","COMP 017_SEE","REDUCAO GIRATÓRIA TIPO STORZ LATAO P/ INST. PREDIAL COMBATE A INCENDIO ENGATE RAPIDO 2.1/2\" X 1.1/2\"","UN ",1,null,null,null,""]
["S",3,"S",0,1,8,2,0,0,0,0,"F","Serviço","Serviço","1.8.2.0.21.","COMPOSIÇÃO","COMP 018_SEE","CHAVE DUPLA P/ CONEXÕES TIPO STORZ EM LATÃO ENGATE RÁPIDO 1 1/2\" X 2 1/2\"","UN ",5,null,null,null,""]
["S",3,"S",0,1,8,2,0,0,0,0,"F","Serviço","Serviço","1.8.2.0.22.","AGETOP",80981,"REGISTRO DE ESFERA DIAMETRO 2.1/2\"","Un    ",1,null,null,null,""]
["S",3,"S",0,1,8,2,0,0,0,0,"F","Serviço","Serviço","1.8.2.0.23.","COMPOSIÇÃO","COMP 087_SEE","REGISTRO DE GAVETA COM HASTE ASCENDENTE DE BRONZE 2 1/2\"","UN ",1,null,null,null,""]
["S",3,"S",0,1,8,2,0,0,0,0,"F","Serviço","Serviço","1.8.2.0.24.","AGETOP",85056,"TÊ DE FERRO GALVANIZADO 90º X 2 1/2\"","un    ",8,null,null,null,""]
["S",3,"S",0,1,8,2,0,0,0,0,"F","Serviço","Serviço","1.8.2.0.25.","COMPOSIÇÃO","COMP 030_SEE","COTOVELO DE FERRO GALV. 90° X 2 1/2\"","UN ",16,null,null,null,""]
["S",3,"S",0,1,8,2,0,0,0,0,"F","Serviço","Serviço","1.8.2.0.26.","COMPOSIÇÃO","COMP 077_SEE","UNIAO FERRO GALV C/ASSENTO CONICO BRONZE 2 1/2\"","UN ",6,null,null,null,""]
["S",3,"S",0,1,8,2,0,0,0,0,"F","Serviço","Serviço","1.8.2.0.27.","COMPOSIÇÃO","COMP 347_SEE","ADAPTADOR PVC SOLDAVEL, COM FLANGES LIVRES, 75 MM X 2 1/2\", PARA CAIXA D' AGUA","UN ",2,null,null,null,""]
["S",3,"S",0,1,8,2,0,0,0,0,"F","Serviço","Serviço","1.8.2.0.28.","COMPOSIÇÃO","COMP 022_SEE","TAMPÃO FOFO 40X50CM C/INSCRIÇÃO ","UN ",1,null,null,null,""]
["S",3,"S",0,1,8,2,0,0,0,0,"F","Serviço","Serviço","1.8.2.0.29.","COMPOSIÇÃO","COMP 546_SEE","BUJÃO DE REBORDO 2.1/2\"","UN ",1,null,null,null,""]
["S",3,"S",0,1,8,2,0,0,0,0,"F","Serviço","Serviço","1.8.2.0.30.","COMPOSIÇÃO","COMP 186_SEE","BOTOEIRA BOMBA DE INCÊNDIO C/ MARTELO CONVENCIONAL/ ANALÓGICA","UN ",5,null,null,null,""]
["S",3,"S",0,1,8,2,0,0,0,0,"F","Serviço","Serviço","1.8.2.0.31.","COMPOSIÇÃO","COMP 188_SEE","ACIONADOR MANUAL DE ALARME","UN ",5,null,null,null,""]
["S",3,"S",0,1,8,2,0,0,0,0,"F","Serviço","Serviço","1.8.2.0.32.","COMPOSIÇÃO","COMP 190_SEE","CENTRAL DE DETECÇÃO E ALARME DE 40 SETORES COM BATERIA","UN ",1,null,null,null,""]
["S",3,"S",0,1,8,2,0,0,0,0,"F","Serviço","Serviço","1.8.2.0.33.","SINAPI",97599,"LUMINÁRIA DE EMERGÊNCIA - FORNECIMENTO E INSTALAÇÃO. AF_11/2017","UN",25,null,null,null,""]
["S",3,"S",0,1,8,2,0,0,0,0,"F","Serviço","Serviço","1.8.2.0.34.","COMPOSIÇÃO","COMP 024_SEE","SINALIZADOR FOTOLUMINESCENTE PARA EXTINTOR","UN ",8,null,null,null,""]
["S",3,"S",0,1,8,2,0,0,0,0,"F","Serviço","Serviço","1.8.2.0.35.","COMPOSIÇÃO","COMP 025_SEE","SINALIZADOR FOTOLUMINESCENTE DE EMERGÊNCIA","UN ",30,null,null,null,""]
["S",3,"S",0,1,8,2,0,0,0,0,"F","Serviço","Serviço","1.8.2.0.36.","COMPOSIÇÃO","COMP 277_SEE","MARCAÇÃO NO PISO - 1X1 M PARA EXTINTOR","M2",8,null,null,null,""]
["S",3,"S",0,1,8,2,0,0,0,0,"F","Serviço","Serviço","1.8.2.0.37.","COMPOSIÇÃO","COMP 235_SEE","PLACA DE SINALIZAÇÃO EM PVC COD 01 - (300X300) PROIBIDO FUMAR","UN ",1,null,null,null,""]
["S",3,"S",0,1,8,2,0,0,0,0,"F","Serviço","Serviço","1.8.2.0.38.","COMPOSIÇÃO","COMP 236_SEE","PLACA DE SINALIZAÇÃO EM PVC COD 06 - (300X300) PERIGO INFLAMÁVEL","UN ",1,null,null,null,""]
["S",3,"S",0,1,8,2,0,0,0,0,"F","Serviço","Serviço","1.8.2.0.39.","COMPOSIÇÃO","COMP 411_SEE","PLACA DE SINALIZAÇÃO EM PVC COD 13 - (316X158) SAÍDA DE EMERGÊNCIA","UN ",2,null,null,null,""]
["S",3,"S",0,1,8,2,0,0,0,0,"F","Serviço","Serviço","1.8.2.0.40.","COMPOSIÇÃO","COMP 412_SEE","PLACA DE SINALIZAÇÃO EM PVC COD 17 - (316X158) MENSAGEM \"SAÍDA\"","UN ",2,null,null,null,""]
[{"$f":"CHOOSE(1+LOG(1+2*(ORÇAMENTO.Nivel=\"Nível 1\")+4*(ORÇAMENTO.Nivel=\"Nível 2\")+8*(ORÇAMENTO.Nivel=\"Nível 3\")+16*(ORÇAMENTO.Nivel=\"Nível 4\")+32*(ORÇAMENTO.Nivel=\"Serviço\"),2),0,1,2,3,4,\"S\")","v":2},{"$f":"IF(OR(C597=\"s\",C597=0),OFFSET(B597,-1,0),C597)","v":2},{"$f":"IF(OFFSET(C597,-1,0)=\"L\",1,IF(OFFSET(C597,-1,0)=1,2,IF(OR(A597=\"s\",A597=0),\"S\",IF(AND(OFFSET(C597,-1,0)=2,A597=4),3,IF(AND(OR(OFFSET(C597,-1,0)=\"s\",OFFSET(C597,-1,0)=0),A597<>\"s\",A597>OFFSET(B597,-1,0)),OFFSET(B597,-1,0),A597)))))","v":2},{"$f":"IF(OR(C597=\"S\",C597=0),0,IF(ISERROR(K597),J597,SMALL(J597:K597,1)))","v":20},{"$f":"IF($C597=1,OFFSET(E597,-1,0)+1,OFFSET(E597,-1,0))","v":1},{"$f":"IF($C597=1,0,IF($C597=2,OFFSET(F597,-1,0)+1,OFFSET(F597,-1,0)))","v":9},{"$f":"IF(AND($C597<=2,$C597<>0),0,IF($C597=3,OFFSET(G597,-1,0)+1,OFFSET(G597,-1,0)))","v":0},{"$f":"IF(AND($C597<=3,$C597<>0),0,IF($C597=4,OFFSET(H597,-1,0)+1,OFFSET(H597,-1,0)))","v":0},{"$f":"IF(AND($C597<=4,$C597<>0),0,IF(AND($C597=\"S\",$W597>0),OFFSET(I597,-1,0)+1,OFFSET(I597,-1,0)))","v":0},242,20,"F","Nível 2","Nível 2","1.9.","AGETOP",91045,"ALVENARIAS E DIVISÓRIAS","Un    ",null,null,null,null,""]
[3,3,3,2,1,9,1,0,0,19,2,"F","Nível 3","Nível 3","1.9.1.","SINAPI",null,"REFORMA GERAL WC FEM","-",null,null,null,null,""]
["S",3,"S",0,1,9,1,0,0,0,0,"F","Serviço","Serviço","1.9.1.0.1.","AGETOP",100160,"ALVENARIA DE TIJOLO FURADO 1/2 VEZ 14X29X9 - 6 FUROS -  ARG. (1CALH:4ARML+100KG DE CI/M3)","m2    ",15.25,null,null,null,""]
[3,3,3,3,1,9,2,0,0,17,3,"F","Nível 3","Nível 3","1.9.2.","SINAPI",null,"REFORMA GERAL WC MASC","-",null,null,null,null,""]
["S",3,"S",0,1,9,2,0,0,0,0,"F","Serviço","Serviço","1.9.2.0.1.","AGETOP",100160,"ALVENARIA DE TIJOLO FURADO 1/2 VEZ 14X29X9 - 6 FUROS -  ARG. (1CALH:4ARML+100KG DE CI/M3)","m2    ",15.25,null,null,null,""]
["S",3,"S",0,1,9,2,0,0,0,0,"F","Serviço","Serviço","1.9.2.0.2.","AGETOP",100320,"DIVISORIA DE GRANITO POLIDO","m2    ",1.46,null,null,null,""]
[3,3,3,2,1,9,3,0,0,14,2,"F","Nível 3","Nível 3","1.9.3.","SINAPI",null,"LABORATÓRIO SECO","-",null,null,null,null,""]
["S",3,"S",0,1,9,3,0,0,0,0,"F","Serviço","Serviço","1.9.3.0.1.","AGETOP",100160,"ALVENARIA DE TIJOLO FURADO 1/2 VEZ 14X29X9 - 6 FUROS -  ARG. (1CALH:4ARML+100KG DE CI/M3)","m2    ",4.6399999999999997,null,null,null,""]
[3,3,3,2,1,9,4,0,0,12,2,"F","Nível 3","Nível 3","1.9.4.","SINAPI",null,"LOCAL DE SAÍDA DOS ALUNOS","-",null,null,null,null,""]
["S",3,"S",0,1,9,4,0,0,0,0,"F","Serviço","Serviço","1.9.4.0.1.","SINAPI",72132,"ALVENARIA EM TIJOLO CERAMICO MACICO 5X10X20CM 1/2 VEZ (ESPESSURA 10CM), ASSENTADO COM ARGAMASSA TRACO 1:2:8 (CIMENTO, CAL E AREIA)","M2",9.48,null,null,null,"Referência: AGETOP - 100102"]
[3,3,3,2,1,9,5,0,0,10,2,"F","Nível 3","Nível 3","1.9.5.","SINAPI",null,"SALAS DE AULA / LAB. / BIBLIO. / AUDIT.","-",null,null,null,null,""]
["S",3,"S",0,1,9,5,0,0,0,0,"F","Serviço","Serviço","1.9.5.0.1.","AGETOP",100602,"ALVENARIA DE TIJOLO LAMINADO 1/2 VEZ  - ARG. (1CI : 1CH : 5ARML)","m2    ",46.2,null,null,null,""]
[3,3,3,3,1,9,6,0,0,8,3,"F","Nível 3","Nível 3","1.9.6.","SINAPI",null,"CONSTRUÇÃO WC ACESSÍVEL","-",null,null,null,null,""]
["S",3,"S",0,1,9,6,0,0,0,0,"F","Serviço","Serviço","1.9.6.0.1.","AGETOP",100160,"ALVENARIA DE TIJOLO FURADO 1/2 VEZ 14X29X9 - 6 FUROS -  ARG. (1CALH:4ARML+100KG DE CI/M3)","m2    ",111.83,null,null,null,""]
[{"$f":"CHOOSE(1+LOG(1+2*(ORÇAMENTO.Nivel=\"Nível 1\")+4*(ORÇAMENTO.Nivel=\"Nível 2\")+8*(ORÇAMENTO.Nivel=\"Nível 3\")+16*(ORÇAMENTO.Nivel=\"Nível 4\")+32*(ORÇAMENTO.Nivel=\"Serviço\"),2),0,1,2,3,4,\"S\")","v":"S"},{"$f":"IF(OR(C611=\"s\",C611=0),OFFSET(B611,-1,0),C611)","v":3},{"$f":"IF(OFFSET(C611,-1,0)=\"L\",1,IF(OFFSET(C611,-1,0)=1,2,IF(OR(A611=\"s\",A611=0),\"S\",IF(AND(OFFSET(C611,-1,0)=2,A611=4),3,IF(AND(OR(OFFSET(C611,-1,0)=\"s\",OFFSET(C611,-1,0)=0),A611<>\"s\",A611>OFFSET(B611,-1,0)),OFFSET(B611,-1,0),A611)))))","v":"S"},{"$f":"IF(OR(C611=\"S\",C611=0),0,IF(ISERROR(K611),J611,SMALL(J611:K611,1)))","v":0},{"$f":"IF($C611=1,OFFSET(E611,-1,0)+1,OFFSET(E611,-1,0))","v":1},{"$f":"IF($C611=1,0,IF($C611=2,OFFSET(F611,-1,0)+1,OFFSET(F611,-1,0)))","v":9},{"$f":"IF(AND($C611<=2,$C611<>0),0,IF($C611=3,OFFSET(G611,-1,0)+1,OFFSET(G611,-1,0)))","v":6},{"$f":"IF(AND($C611<=3,$C611<>0),0,IF($C611=4,OFFSET(H611,-1,0)+1,OFFSET(H611,-1,0)))","v":0},{"$f":"IF(AND($C611<=4,$C611<>0),0,IF(AND($C611=\"S\",$W611>0),OFFSET(I611,-1,0)+1,OFFSET(I611,-1,0)))","v":0},0,0,"F","Serviço","Serviço","1.9.6.0.2.","AGETOP",60010,"VERGA/CONTRAVERGA EM CONCRETO ARMADO FCK = 20 MPA","m3    ",0.18,null,null,null,""]
[3,3,3,3,1,9,7,0,0,5,3,"F","Nível 3","Nível 3","1.9.7.","SINAPI",null,"REFORMA E AMPLIAÇÃO DA COZINHA","-",null,null,null,null,""]
["S",3,"S",0,1,9,7,0,0,0,0,"F","Serviço","Serviço","1.9.7.0.1.","AGETOP",100160,"ALVENARIA DE TIJOLO FURADO 1/2 VEZ 14X29X9 - 6 FUROS -  ARG. (1CALH:4ARML+100KG DE CI/M3)","m2    ",38.4,null,null,null,""]
[{"$f":"CHOOSE(1+LOG(1+2*(ORÇAMENTO.Nivel=\"Nível 1\")+4*(ORÇAMENTO.Nivel=\"Nível 2\")+8*(ORÇAMENTO.Nivel=\"Nível 3\")+16*(ORÇAMENTO.Nivel=\"Nível 4\")+32*(ORÇAMENTO.Nivel=\"Serviço\"),2),0,1,2,3,4,\"S\")","v":"S"},{"$f":"IF(OR(C614=\"s\",C614=0),OFFSET(B614,-1,0),C614)","v":3},{"$f":"IF(OFFSET(C614,-1,0)=\"L\",1,IF(OFFSET(C614,-1,0)=1,2,IF(OR(A614=\"s\",A614=0),\"S\",IF(AND(OFFSET(C614,-1,0)=2,A614=4),3,IF(AND(OR(OFFSET(C614,-1,0)=\"s\",OFFSET(C614,-1,0)=0),A614<>\"s\",A614>OFFSET(B614,-1,0)),OFFSET(B614,-1,0),A614)))))","v":"S"},{"$f":"IF(OR(C614=\"S\",C614=0),0,IF(ISERROR(K614),J614,SMALL(J614:K614,1)))","v":0},{"$f":"IF($C614=1,OFFSET(E614,-1,0)+1,OFFSET(E614,-1,0))","v":1},{"$f":"IF($C614=1,0,IF($C614=2,OFFSET(F614,-1,0)+1,OFFSET(F614,-1,0)))","v":9},{"$f":"IF(AND($C614<=2,$C614<>0),0,IF($C614=3,OFFSET(G614,-1,0)+1,OFFSET(G614,-1,0)))","v":7},{"$f":"IF(AND($C614<=3,$C614<>0),0,IF($C614=4,OFFSET(H614,-1,0)+1,OFFSET(H614,-1,0)))","v":0},{"$f":"IF(AND($C614<=4,$C614<>0),0,IF(AND($C614=\"S\",$W614>0),OFFSET(I614,-1,0)+1,OFFSET(I614,-1,0)))","v":0},0,0,"F","Serviço","Serviço","1.9.7.0.2.","AGETOP",60010,"VERGA/CONTRAVERGA EM CONCRETO ARMADO FCK = 20 MPA","m3    ",0.16,null,null,null,""]
[3,3,3,2,1,9,8,0,0,2,128,"F","Nível 3","Nível 3","1.9.8.","SINAPI",null,"INSTALAÇÃO PLATAFORMA ELEVATÓRIA","-",null,null,null,null,""]
["S",3,"S",0,1,9,8,0,0,0,0,"F","Serviço","Serviço","1.9.8.0.1.","AGETOP",100602,"ALVENARIA DE TIJOLO LAMINADO 1/2 VEZ  - ARG. (1CI : 1CH : 5ARML)","m2    ",54,null,null,null,""]
[{"$f":"CHOOSE(1+LOG(1+2*(ORÇAMENTO.Nivel=\"Nível 1\")+4*(ORÇAMENTO.Nivel=\"Nível 2\")+8*(ORÇAMENTO.Nivel=\"Nível 3\")+16*(ORÇAMENTO.Nivel=\"Nível 4\")+32*(ORÇAMENTO.Nivel=\"Serviço\"),2),0,1,2,3,4,\"S\")","v":2},{"$f":"IF(OR(C617=\"s\",C617=0),OFFSET(B617,-1,0),C617)","v":2},{"$f":"IF(OFFSET(C617,-1,0)=\"L\",1,IF(OFFSET(C617,-1,0)=1,2,IF(OR(A617=\"s\",A617=0),\"S\",IF(AND(OFFSET(C617,-1,0)=2,A617=4),3,IF(AND(OR(OFFSET(C617,-1,0)=\"s\",OFFSET(C617,-1,0)=0),A617<>\"s\",A617>OFFSET(B617,-1,0)),OFFSET(B617,-1,0),A617)))))","v":2},{"$f":"IF(OR(C617=\"S\",C617=0),0,IF(ISERROR(K617),J617,SMALL(J617:K617,1)))","v":8},{"$f":"IF($C617=1,OFFSET(E617,-1,0)+1,OFFSET(E617,-1,0))","v":1},{"$f":"IF($C617=1,0,IF($C617=2,OFFSET(F617,-1,0)+1,OFFSET(F617,-1,0)))","v":10},{"$f":"IF(AND($C617<=2,$C617<>0),0,IF($C617=3,OFFSET(G617,-1,0)+1,OFFSET(G617,-1,0)))","v":0},{"$f":"IF(AND($C617<=3,$C617<>0),0,IF($C617=4,OFFSET(H617,-1,0)+1,OFFSET(H617,-1,0)))","v":0},{"$f":"IF(AND($C617<=4,$C617<>0),0,IF(AND($C617=\"S\",$W617>0),OFFSET(I617,-1,0)+1,OFFSET(I617,-1,0)))","v":0},222,8,"F","Nível 2","Nível 2","1.10.",null,null,"IMPERMEABILIZAÇÃO","-",null,null,null,null,""]
[3,3,3,4,1,10,1,0,0,7,4,"F","Nível 3","Nível 3","1.10.1.","SINAPI",null,"REFORMA CAIXA D'ÁGUA","-",null,null,null,null,""]
["S",3,"S",0,1,10,1,0,0,0,0,"F","Serviço","Serviço","1.10.1.0.1.","SINAPI",96401,"EXECUÇÃO DE IMPRIMAÇÃO COM ASFALTO DILUÍDO CM-30. AF_11/2019","M2",45,null,null,null,""]
["S",3,"S",0,1,10,1,0,0,0,0,"F","Serviço","Serviço","1.10.1.0.2.","SINAPI",98546,"IMPERMEABILIZAÇÃO DE SUPERFÍCIE COM MANTA ASFÁLTICA, UMA CAMADA, INCLUSIVE APLICAÇÃO DE PRIMER ASFÁLTICO, E=3MM. AF_06/2018","M2",45,null,null,null,"Referência: AGETOP - 120107"]
["S",3,"S",0,1,10,1,0,0,0,0,"F","Serviço","Serviço","1.10.1.0.3.","AGETOP",130107,"PROTEÇÃO MECÂNICA, TÉRMICA E ACÚSTICA DE IMPERMEABILIZAÇÃO PARA LAJE COM VERMICULITA (1CI:2ARM:3VERM) ESP.=3CM","m2    ",45,null,null,null,""]
[3,3,3,3,1,10,2,0,0,3,15,"F","Nível 3","Nível 3","1.10.2.","SINAPI",null,"CONSTRUÇÃO WC ACESSÍVEL","-",null,null,null,null,""]
[{"$f":"CHOOSE(1+LOG(1+2*(ORÇAMENTO.Nivel=\"Nível 1\")+4*(ORÇAMENTO.Nivel=\"Nível 2\")+8*(ORÇAMENTO.Nivel=\"Nível 3\")+16*(ORÇAMENTO.Nivel=\"Nível 4\")+32*(ORÇAMENTO.Nivel=\"Serviço\"),2),0,1,2,3,4,\"S\")","v":"S"},{"$f":"IF(OR(C623=\"s\",C623=0),OFFSET(B623,-1,0),C623)","v":3},{"$f":"IF(OFFSET(C623,-1,0)=\"L\",1,IF(OFFSET(C623,-1,0)=1,2,IF(OR(A623=\"s\",A623=0),\"S\",IF(AND(OFFSET(C623,-1,0)=2,A623=4),3,IF(AND(OR(OFFSET(C623,-1,0)=\"s\",OFFSET(C623,-1,0)=0),A623<>\"s\",A623>OFFSET(B623,-1,0)),OFFSET(B623,-1,0),A623)))))","v":"S"},{"$f":"IF(OR(C623=\"S\",C623=0),0,IF(ISERROR(K623),J623,SMALL(J623:K623,1)))","v":0},{"$f":"IF($C623=1,OFFSET(E623,-1,0)+1,OFFSET(E623,-1,0))","v":1},{"$f":"IF($C623=1,0,IF($C623=2,OFFSET(F623,-1,0)+1,OFFSET(F623,-1,0)))","v":10},{"$f":"IF(AND($C623<=2,$C623<>0),0,IF($C623=3,OFFSET(G623,-1,0)+1,OFFSET(G623,-1,0)))","v":2},{"$f":"IF(AND($C623<=3,$C623<>0),0,IF($C623=4,OFFSET(H623,-1,0)+1,OFFSET(H623,-1,0)))","v":0},{"$f":"IF(AND($C623<=4,$C623<>0),0,IF(AND($C623=\"S\",$W623>0),OFFSET(I623,-1,0)+1,OFFSET(I623,-1,0)))","v":0},0,0,"F","Serviço","Serviço","1.10.2.0.1.","AGETOP",130107,"PROTEÇÃO MECÂNICA, TÉRMICA E ACÚSTICA DE IMPERMEABILIZAÇÃO PARA LAJE COM VERMICULITA (1CI:2ARM:3VERM) ESP.=3CM","m2    ",23.28,null,null,null,""]
["S",3,"S",0,1,10,2,0,0,0,0,"F","Serviço","Serviço","1.10.2.0.2.","AGETOP",120902,"IMPERMEABILIZACAO VIGAS BALDRAMES E=2,0 CM","m2    ",14.8,null,null,null,""]
[2,2,2,3,1,11,0,0,0,214,3,"F","Nível 2","Nível 2","1.11.",null,null,"ESTRUTURA DE MADEIRA","-",null,null,null,null,""]
[3,3,3,2,1,11,1,0,0,2,9,"F","Nível 3","Nível 3","1.11.1.","SINAPI",null,"REFORMA DA COBERTURA","-",null,null,null,null,""]
["S",3,"S",0,1,11,1,0,0,0,0,"F","Serviço","Serviço","1.11.1.0.1.","SINAPI",92541,"TRAMA DE MADEIRA COMPOSTA POR RIPAS, CAIBROS E TERÇAS PARA TELHADOS DE ATÉ 2 ÁGUAS PARA TELHA CERÂMICA CAPA-CANAL, INCLUSO TRANSPORTE VERTICAL. AF_07/2019","M2",24,null,null,null,"Referência: AGETOP - 140202"]
[2,2,2,2,1,12,0,0,0,211,2,"F","Nível 2","Nível 2","1.12.",null,null,"ESTRUTURAS METÁLICAS","-",null,null,null,null,""]
["S",2,"S",0,1,12,0,0,0,0,0,"F","Serviço","Serviço","1.12.0.0.1.","AGETOP",150204,"ESTRUTURA METÁLICA CONVENCIONAL EM AÇO DO TIPO MR-250 / ASTM A36 COM FUNDO ANTICORROSIVO","Kg    ",976,null,null,null,""]
[2,2,2,11,1,13,0,0,0,209,11,"F","Nível 2","Nível 2","1.13.",null,null,"COBERTURAS","-",null,null,null,null,""]
[3,3,3,4,1,13,1,0,0,10,4,"F","Nível 3","Nível 3","1.13.1.","SINAPI",null,"REFORMA DA COBERTURA","-",null,null,null,null,""]
["S",3,"S",0,1,13,1,0,0,{"$f":"IF(OR($C632=\"S\",$C632=0),0,MATCH(0,OFFSET($D632,1,$C632,ROW($C$839)-ROW($C632)),0))","v":0},{"$f":"IF(OR($C632=\"S\",$C632=0),0,MATCH(OFFSET($D632,0,$C632)+1,OFFSET($D632,1,$C632,ROW($C$839)-ROW($C632)),0))","v":0},"F","Serviço","Serviço","1.13.1.0.1.","SINAPI",94210,"TELHAMENTO COM TELHA ONDULADA DE FIBROCIMENTO E = 6 MM, COM RECOBRIMENTO LATERAL DE 1 1/4 DE ONDA PARA TELHADO COM INCLINAÇÃO MÁXIMA DE 10°, COM ATÉ 2 ÁGUAS, INCLUSO IÇAMENTO. AF_07/2019","M2",82,null,null,null,"Referência: AGETOP - 160501"]
["S",3,"S",0,1,13,1,0,0,0,0,"F","Serviço","Serviço","1.13.1.0.2.","AGETOP",160600,"CALHA DE CHAPA GALVANIZADA","m2    ",32,null,null,null,""]
["S",3,"S",0,1,13,1,0,0,0,0,"F","Serviço","Serviço","1.13.1.0.3.","AGETOP",160603,"RUFO DE CHAPA GALVANIZADA","m2    ",9,null,null,null,""]
[3,3,3,2,1,13,2,0,0,6,2,"F","Nível 3","Nível 3","1.13.2.","SINAPI",null,"REFORMA QUADRA COBERTA","-",null,null,null,null,""]
["S",{"$f":"IF(OR(C636=\"s\",C636=0),OFFSET(B636,-1,0),C636)","v":3},{"$f":"IF(OFFSET(C636,-1,0)=\"L\",1,IF(OFFSET(C636,-1,0)=1,2,IF(OR(A636=\"s\",A636=0),\"S\",IF(AND(OFFSET(C636,-1,0)=2,A636=4),3,IF(AND(OR(OFFSET(C636,-1,0)=\"s\",OFFSET(C636,-1,0)=0),A636<>\"s\",A636>OFFSET(B636,-1,0)),OFFSET(B636,-1,0),A636)))))","v":"S"},{"$f":"IF(OR(C636=\"S\",C636=0),0,IF(ISERROR(K636),J636,SMALL(J636:K636,1)))","v":0},{"$f":"IF($C636=1,OFFSET(E636,-1,0)+1,OFFSET(E636,-1,0))","v":1},{"$f":"IF($C636=1,0,IF($C636=2,OFFSET(F636,-1,0)+1,OFFSET(F636,-1,0)))","v":13},{"$f":"IF(AND($C636<=2,$C636<>0),0,IF($C636=3,OFFSET(G636,-1,0)+1,OFFSET(G636,-1,0)))","v":2},{"$f":"IF(AND($C636<=3,$C636<>0),0,IF($C636=4,OFFSET(H636,-1,0)+1,OFFSET(H636,-1,0)))","v":0},{"$f":"IF(AND($C636<=4,$C636<>0),0,IF(AND($C636=\"S\",$W636>0),OFFSET(I636,-1,0)+1,OFFSET(I636,-1,0)))","v":0},0,0,"F","Serviço","Serviço","1.13.2.0.1.","AGETOP",160967,"COBERTURA COM TELHA CHAPA GALVANIZADA  TRAPEZOIDAL 0,5 MM COM ACESSÓRIOS","m2    ",406.97,null,null,null,""]
[3,3,3,2,1,13,3,0,0,4,2,"F","Nível 3","Nível 3","1.13.3.","SINAPI",null,"AMPLIAÇÃO DO REFEITÓRIO","-",null,null,null,null,""]
["S",3,"S",0,1,13,3,0,0,0,0,"F","Serviço","Serviço","1.13.3.0.1.","SINAPI",94216,"TELHAMENTO COM TELHA METÁLICA TERMOACÚSTICA E = 30 MM, COM ATÉ 2 ÁGUAS, INCLUSO IÇAMENTO. AF_07/2019","M2",44.57,null,null,null,"Referência: COMPOSIÇÃO - COMP 338_SEE"]
[3,3,3,2,1,13,4,0,0,2,17,"F","Nível 3","Nível 3","1.13.4.","SINAPI",null,"REFORMA E AMPLIAÇÃO DA COZINHA","-",null,null,null,null,""]
["S",3,"S",0,1,13,4,0,0,0,0,"F","Serviço","Serviço","1.13.4.0.1.","AGETOP",160967,"COBERTURA COM TELHA CHAPA GALVANIZADA  TRAPEZOIDAL 0,5 MM COM ACESSÓRIOS","m2    ",20,null,null,null,""]
[2,{"$f":"IF(OR(C641=\"s\",C641=0),OFFSET(B641,-1,0),C641)","v":2},{"$f":"IF(OFFSET(C641,-1,0)=\"L\",1,IF(OFFSET(C641,-1,0)=1,2,IF(OR(A641=\"s\",A641=0),\"S\",IF(AND(OFFSET(C641,-1,0)=2,A641=4),3,IF(AND(OR(OFFSET(C641,-1,0)=\"s\",OFFSET(C641,-1,0)=0),A641<>\"s\",A641>OFFSET(B641,-1,0)),OFFSET(B641,-1,0),A641)))))","v":2},{"$f":"IF(OR(C641=\"S\",C641=0),0,IF(ISERROR(K641),J641,SMALL(J641:K641,1)))","v":26},{"$f":"IF($C641=1,OFFSET(E641,-1,0)+1,OFFSET(E641,-1,0))","v":1},{"$f":"IF($C641=1,0,IF($C641=2,OFFSET(F641,-1,0)+1,OFFSET(F641,-1,0)))","v":14},{"$f":"IF(AND($C641<=2,$C641<>0),0,IF($C641=3,OFFSET(G641,-1,0)+1,OFFSET(G641,-1,0)))","v":0},{"$f":"IF(AND($C641<=3,$C641<>0),0,IF($C641=4,OFFSET(H641,-1,0)+1,OFFSET(H641,-1,0)))","v":0},{"$f":"IF(AND($C641<=4,$C641<>0),0,IF(AND($C641=\"S\",$W641>0),OFFSET(I641,-1,0)+1,OFFSET(I641,-1,0)))","v":0},198,26,"F","Nível 2","Nível 2","1.14.",null,null,"ESQUADRIAS METÁLICAS","-",null,null,null,null,""]
[3,3,3,4,1,14,1,0,0,25,4,"F","Nível 3","Nível 3","1.14.1.","SINAPI",null,"REFORMA GERAL WC FEM","-",null,null,null,null,""]
["S",3,"S",0,1,14,1,0,0,0,0,"F","Serviço","Serviço","1.14.1.0.1.","AGETOP",180501,"PORTA DE ABRIR EM CHAPA PF-1 C/FERRAGENS","m2    ",3.3600000000000003,null,null,null,""]
["S",3,"S",0,1,14,1,0,0,0,0,"F","Serviço","Serviço","1.14.1.0.2.","AGETOP",180509,"PORTA ABRIR CH.P/WC PF-10 C/FERRAGENS","m2    ",10.639999999999999,null,null,null,""]
["S",3,"S",0,1,14,1,0,0,0,0,"F","Serviço","Serviço","1.14.1.0.3.","AGETOP",180381,"ESQ. MAXIMO AR CHAPA/VIDRO J3/J5/J6/J8 C/FERRAGENS","m2    ",1.5,null,null,null,""]
[3,3,3,4,1,14,2,0,0,21,4,"F","Nível 3","Nível 3","1.14.2.","SINAPI",null,"REFORMA GERAL WC MASC","-",null,null,null,null,""]
["S",3,"S",0,1,14,2,0,0,0,0,"F","Serviço","Serviço","1.14.2.0.1.","AGETOP",180501,"PORTA DE ABRIR EM CHAPA PF-1 C/FERRAGENS","m2    ",3.3600000000000003,null,null,null,""]
["S",3,"S",0,1,14,2,0,0,0,0,"F","Serviço","Serviço","1.14.2.0.2.","AGETOP",180509,"PORTA ABRIR CH.P/WC PF-10 C/FERRAGENS","m2    ",10.639999999999999,null,null,null,""]
["S",3,"S",0,1,14,2,0,0,0,0,"F","Serviço","Serviço","1.14.2.0.3.","AGETOP",180381,"ESQ. MAXIMO AR CHAPA/VIDRO J3/J5/J6/J8 C/FERRAGENS","m2    ",1.5,null,null,null,""]
[3,3,3,2,1,14,3,0,0,17,2,"F","Nível 3","Nível 3","1.14.3.","SINAPI",null,"REFORMA WC FUNCIONÁRIOS","-",null,null,null,null,""]
["S",3,"S",0,1,14,3,0,0,0,0,"F","Serviço","Serviço","1.14.3.0.1.","AGETOP",180501,"PORTA DE ABRIR EM CHAPA PF-1 C/FERRAGENS","m2    ",2.94,null,null,null,""]
[3,3,3,4,1,14,4,0,0,15,4,"F","Nível 3","Nível 3","1.14.4.","SINAPI",null,"SALAS DE AULA / LAB. / BIBLIO. / AUDIT.","-",null,null,null,null,""]
["S",3,"S",0,1,14,4,0,0,0,0,"F","Serviço","Serviço","1.14.4.0.1.","AGETOP",180381,"ESQ. MAXIMO AR CHAPA/VIDRO J3/J5/J6/J8 C/FERRAGENS","m2    ",57.499999999999993,null,null,null,""]
["S",3,"S",0,1,14,4,0,0,0,0,"F","Serviço","Serviço","1.14.4.0.2.","SINAPI",94562,"JANELA DE AÇO DE CORRER COM 4 FOLHAS PARA VIDRO, COM BATENTE, FERRAGENS E PINTURA ANTICORROSIVA. EXCLUSIVE VIDROS, ALIZAR E CONTRAMARCO. FORNECIMENTO E INSTALAÇÃO. AF_12/2019","M2",110.63,null,null,null,"Referência: AGETOP - 180401"]
["S",3,"S",0,1,14,4,0,0,0,0,"F","Serviço","Serviço","1.14.4.0.3.","AGETOP",180208,"GRADE PROTECAO TIPO TIJOLINHO GP-1/GP-2","m2    ",119.14,null,null,null,""]
[{"$f":"CHOOSE(1+LOG(1+2*(ORÇAMENTO.Nivel=\"Nível 1\")+4*(ORÇAMENTO.Nivel=\"Nível 2\")+8*(ORÇAMENTO.Nivel=\"Nível 3\")+16*(ORÇAMENTO.Nivel=\"Nível 4\")+32*(ORÇAMENTO.Nivel=\"Serviço\"),2),0,1,2,3,4,\"S\")","v":3},3,3,3,1,14,5,0,0,11,3,"F","Nível 3","Nível 3","1.14.5.","SINAPI",null,"CONSTRUÇÃO WC ACESSÍVEL","-",null,null,null,null,""]
["S",{"$f":"IF(OR(C657=\"s\",C657=0),OFFSET(B657,-1,0),C657)","v":3},{"$f":"IF(OFFSET(C657,-1,0)=\"L\",1,IF(OFFSET(C657,-1,0)=1,2,IF(OR(A657=\"s\",A657=0),\"S\",IF(AND(OFFSET(C657,-1,0)=2,A657=4),3,IF(AND(OR(OFFSET(C657,-1,0)=\"s\",OFFSET(C657,-1,0)=0),A657<>\"s\",A657>OFFSET(B657,-1,0)),OFFSET(B657,-1,0),A657)))))","v":"S"},{"$f":"IF(OR(C657=\"S\",C657=0),0,IF(ISERROR(K657),J657,SMALL(J657:K657,1)))","v":0},{"$f":"IF($C657=1,OFFSET(E657,-1,0)+1,OFFSET(E657,-1,0))","v":1},{"$f":"IF($C657=1,0,IF($C657=2,OFFSET(F657,-1,0)+1,OFFSET(F657,-1,0)))","v":14},{"$f":"IF(AND($C657<=2,$C657<>0),0,IF($C657=3,OFFSET(G657,-1,0)+1,OFFSET(G657,-1,0)))","v":5},{"$f":"IF(AND($C657<=3,$C657<>0),0,IF($C657=4,OFFSET(H657,-1,0)+1,OFFSET(H657,-1,0)))","v":0},{"$f":"IF(AND($C657<=4,$C657<>0),0,IF(AND($C657=\"S\",$W657>0),OFFSET(I657,-1,0)+1,OFFSET(I657,-1,0)))","v":0},0,0,"F","Serviço","Serviço","1.14.5.0.1.","AGETOP",180501,"PORTA DE ABRIR EM CHAPA PF-1 C/FERRAGENS","m2    ",7.5600000000000005,null,null,null,""]
["S",3,"S",0,1,14,5,0,0,0,0,"F","Serviço","Serviço","1.14.5.0.2.","AGETOP",180381,"ESQ. MAXIMO AR CHAPA/VIDRO J3/J5/J6/J8 C/FERRAGENS","m2    ",3,null,null,null,""]
[3,3,3,6,1,14,6,0,0,8,6,"F","Nível 3","Nível 3","1.14.6.","SINAPI",null,"REFORMA E AMPLIAÇÃO DA COZINHA","-",null,null,null,null,""]
["S",3,"S",0,1,14,6,0,0,0,0,"F","Serviço","Serviço","1.14.6.0.1.","AGETOP",180208,"GRADE PROTECAO TIPO TIJOLINHO GP-1/GP-2","m2    ",11.13,null,null,null,""]
["S",3,"S",0,1,14,6,0,0,0,0,"F","Serviço","Serviço","1.14.6.0.2.","AGETOP",180501,"PORTA DE ABRIR EM CHAPA PF-1 C/FERRAGENS","m2    ",3.15,null,null,null,""]
["S",3,"S",0,1,14,6,0,0,0,0,"F","Serviço","Serviço","1.14.6.0.3.","AGETOP",180381,"ESQ. MAXIMO AR CHAPA/VIDRO J3/J5/J6/J8 C/FERRAGENS","m2    ",2.8499999999999996,null,null,null,""]
["S",3,"S",0,1,14,6,0,0,0,0,"F","Serviço","Serviço","1.14.6.0.4.","AGETOP",180380,"ESQ. MAXIMO AR CHAPA/VIDRO J4 C/FERRAGENS","m2    ",0.48,null,null,null,""]
["S",3,"S",0,1,14,6,0,0,0,0,"F","Serviço","Serviço","1.14.6.0.5.","SINAPI",94562,"JANELA DE AÇO DE CORRER COM 4 FOLHAS PARA VIDRO, COM BATENTE, FERRAGENS E PINTURA ANTICORROSIVA. EXCLUSIVE VIDROS, ALIZAR E CONTRAMARCO. FORNECIMENTO E INSTALAÇÃO. AF_12/2019","M2",7.8,null,null,null,"Referência: AGETOP - 180401"]
[3,3,3,2,1,14,7,0,0,2,40,"F","Nível 3","Nível 3","1.14.7.","SINAPI",null,"ACESSIBILIDADE","-",null,null,null,null,""]
["S",3,"S",0,1,14,7,0,0,0,0,"F","Serviço","Serviço","1.14.7.0.1.","COMPOSIÇÃO","COMP 082_SEE","CORRIMÃO PAREDE - SEDUC","M",12.56,null,null,null,""]
[2,{"$f":"IF(OR(C667=\"s\",C667=0),OFFSET(B667,-1,0),C667)","v":2},{"$f":"IF(OFFSET(C667,-1,0)=\"L\",1,IF(OFFSET(C667,-1,0)=1,2,IF(OR(A667=\"s\",A667=0),\"S\",IF(AND(OFFSET(C667,-1,0)=2,A667=4),3,IF(AND(OR(OFFSET(C667,-1,0)=\"s\",OFFSET(C667,-1,0)=0),A667<>\"s\",A667>OFFSET(B667,-1,0)),OFFSET(B667,-1,0),A667)))))","v":2},{"$f":"IF(OR(C667=\"S\",C667=0),0,IF(ISERROR(K667),J667,SMALL(J667:K667,1)))","v":11},{"$f":"IF($C667=1,OFFSET(E667,-1,0)+1,OFFSET(E667,-1,0))","v":1},{"$f":"IF($C667=1,0,IF($C667=2,OFFSET(F667,-1,0)+1,OFFSET(F667,-1,0)))","v":15},{"$f":"IF(AND($C667<=2,$C667<>0),0,IF($C667=3,OFFSET(G667,-1,0)+1,OFFSET(G667,-1,0)))","v":0},{"$f":"IF(AND($C667<=3,$C667<>0),0,IF($C667=4,OFFSET(H667,-1,0)+1,OFFSET(H667,-1,0)))","v":0},{"$f":"IF(AND($C667<=4,$C667<>0),0,IF(AND($C667=\"S\",$W667>0),OFFSET(I667,-1,0)+1,OFFSET(I667,-1,0)))","v":0},172,11,"F","Nível 2","Nível 2","1.15.",null,null,"VIDROS","-",null,null,null,null,""]
[{"$f":"CHOOSE(1+LOG(1+2*(ORÇAMENTO.Nivel=\"Nível 1\")+4*(ORÇAMENTO.Nivel=\"Nível 2\")+8*(ORÇAMENTO.Nivel=\"Nível 3\")+16*(ORÇAMENTO.Nivel=\"Nível 4\")+32*(ORÇAMENTO.Nivel=\"Serviço\"),2),0,1,2,3,4,\"S\")","v":3},3,3,2,1,15,1,0,0,10,2,"F","Nível 3","Nível 3","1.15.1.","SINAPI",null,"REFORMA GERAL WC FEM","-",null,null,null,null,""]
["S",3,"S",0,1,15,1,0,0,0,0,"F","Serviço","Serviço","1.15.1.0.1.","SINAPI",72122,"VIDRO FANTASIA TIPO CANELADO, ESPESSURA 4MM","M2",1.5,null,null,null,""]
[3,3,3,2,1,15,2,0,0,8,2,"F","Nível 3","Nível 3","1.15.2.","SINAPI",null,"REFORMA GERAL WC MASC","-",null,null,null,null,""]
["S",3,"S",0,1,15,2,0,0,0,0,"F","Serviço","Serviço","1.15.2.0.1.","SINAPI",72122,"VIDRO FANTASIA TIPO CANELADO, ESPESSURA 4MM","M2",1.5,null,null,null,""]
[3,3,3,2,1,15,3,0,0,6,2,"F","Nível 3","Nível 3","1.15.3.","SINAPI",null,"SALAS DE AULA / LAB. / BIBLIO. / AUDIT.","-",null,null,null,null,""]
["S",3,"S",0,1,15,3,0,0,0,0,"F","Serviço","Serviço","1.15.3.0.1.","SINAPI",72117,"VIDRO LISO COMUM TRANSPARENTE, ESPESSURA 4MM","M2",168.13,null,null,null,"Referência: AGETOP - 190102"]
[3,3,3,2,1,15,4,0,0,4,2,"F","Nível 3","Nível 3","1.15.4.","SINAPI",null,"CONSTRUÇÃO WC ACESSÍVEL","-",null,null,null,null,""]
["S",3,"S",0,1,15,4,0,0,0,0,"F","Serviço","Serviço","1.15.4.0.1.","SINAPI",72122,"VIDRO FANTASIA TIPO CANELADO, ESPESSURA 4MM","M2",3,null,null,null,""]
[3,3,3,2,1,15,5,0,0,2,22,"F","Nível 3","Nível 3","1.15.5.","SINAPI",null,"REFORMA E AMPLIAÇÃO DA COZINHA","-",null,null,null,null,""]
["S",3,"S",0,1,15,5,0,0,0,0,"F","Serviço","Serviço","1.15.5.0.1.","SINAPI",72117,"VIDRO LISO COMUM TRANSPARENTE, ESPESSURA 4MM","M2",11.129999999999999,null,null,null,"Referência: AGETOP - 190102"]
[{"$f":"CHOOSE(1+LOG(1+2*(ORÇAMENTO.Nivel=\"Nível 1\")+4*(ORÇAMENTO.Nivel=\"Nível 2\")+8*(ORÇAMENTO.Nivel=\"Nível 3\")+16*(ORÇAMENTO.Nivel=\"Nível 4\")+32*(ORÇAMENTO.Nivel=\"Serviço\"),2),0,1,2,3,4,\"S\")","v":2},2,2,32,1,16,0,0,0,161,32,"F","Nível 2","Nível 2","1.16.",null,null,"REVESTIMENTO DE PAREDE","-",null,null,null,null,""]
[3,3,3,5,1,16,1,0,0,31,5,"F","Nível 3","Nível 3","1.16.1.","SINAPI",null,"REFORMA GERAL WC FEM","-",null,null,null,null,""]
["S",3,"S",0,1,16,1,0,0,0,0,"F","Serviço","Serviço","1.16.1.0.1.","SINAPI",87904,"CHAPISCO APLICADO EM ALVENARIA (COM PRESENÇA DE VÃOS) E ESTRUTURAS DE CONCRETO DE FACHADA, COM COLHER DE PEDREIRO.  ARGAMASSA TRAÇO 1:3 COM PREPARO MANUAL. AF_06/2014","M2",35.5,null,null,null,"Referência: AGETOP - 200101"]
["S",3,"S",0,1,16,1,0,0,0,0,"F","Serviço","Serviço","1.16.1.0.2.","SINAPI",87553,"EMBOÇO, PARA RECEBIMENTO DE CERÂMICA, EM ARGAMASSA TRAÇO 1:2:8, PREPARO MECÂNICO COM BETONEIRA 400L, APLICADO MANUALMENTE EM FACES INTERNAS DE PAREDES, PARA AMBIENTE COM ÁREA MAIOR QUE 10M2, ESPESSURA DE 10MM, COM EXECUÇÃO DE TALISCAS. AF_06/2014","M2",52.5,null,null,null,""]
["S",3,"S",0,1,16,1,0,0,0,0,"F","Serviço","Serviço","1.16.1.0.3.","SINAPI",87547,"MASSA ÚNICA, PARA RECEBIMENTO DE PINTURA, EM ARGAMASSA TRAÇO 1:2:8, PREPARO MECÂNICO COM BETONEIRA 400L, APLICADA MANUALMENTE EM FACES INTERNAS DE PAREDES, ESPESSURA DE 10MM, COM EXECUÇÃO DE TALISCAS. AF_06/2014","M2",2,null,null,null,""]
["S",3,"S",0,1,16,1,0,0,0,0,"F","Serviço","Serviço","1.16.1.0.4.","SINAPI",87273,"REVESTIMENTO CERÂMICO PARA PAREDES INTERNAS COM PLACAS TIPO ESMALTADA EXTRA DE DIMENSÕES 33X45 CM APLICADAS EM AMBIENTES DE ÁREA MAIOR QUE 5 M² NA ALTURA INTEIRA DAS PAREDES. AF_06/2014","M2",121.5,null,null,null,""]
[3,3,3,5,1,16,2,0,0,26,5,"F","Nível 3","Nível 3","1.16.2.","SINAPI",null,"REFORMA GERAL WC MASC","-",null,null,null,null,""]
["S",3,"S",0,1,16,2,0,0,0,0,"F","Serviço","Serviço","1.16.2.0.1.","SINAPI",87904,"CHAPISCO APLICADO EM ALVENARIA (COM PRESENÇA DE VÃOS) E ESTRUTURAS DE CONCRETO DE FACHADA, COM COLHER DE PEDREIRO.  ARGAMASSA TRAÇO 1:3 COM PREPARO MANUAL. AF_06/2014","M2",35.5,null,null,null,"Referência: AGETOP - 200101"]
["S",3,"S",0,1,16,2,0,0,0,0,"F","Serviço","Serviço","1.16.2.0.2.","SINAPI",87553,"EMBOÇO, PARA RECEBIMENTO DE CERÂMICA, EM ARGAMASSA TRAÇO 1:2:8, PREPARO MECÂNICO COM BETONEIRA 400L, APLICADO MANUALMENTE EM FACES INTERNAS DE PAREDES, PARA AMBIENTE COM ÁREA MAIOR QUE 10M2, ESPESSURA DE 10MM, COM EXECUÇÃO DE TALISCAS. AF_06/2014","M2",52.5,null,null,null,""]
["S",3,"S",0,1,16,2,0,0,0,0,"F","Serviço","Serviço","1.16.2.0.3.","SINAPI",87547,"MASSA ÚNICA, PARA RECEBIMENTO DE PINTURA, EM ARGAMASSA TRAÇO 1:2:8, PREPARO MECÂNICO COM BETONEIRA 400L, APLICADA MANUALMENTE EM FACES INTERNAS DE PAREDES, ESPESSURA DE 10MM, COM EXECUÇÃO DE TALISCAS. AF_06/2014","M2",2,null,null,null,""]
[{"$f":"CHOOSE(1+LOG(1+2*(ORÇAMENTO.Nivel=\"Nível 1\")+4*(ORÇAMENTO.Nivel=\"Nível 2\")+8*(ORÇAMENTO.Nivel=\"Nível 3\")+16*(ORÇAMENTO.Nivel=\"Nível 4\")+32*(ORÇAMENTO.Nivel=\"Serviço\"),2),0,1,2,3,4,\"S\")","v":"S"},{"$f":"IF(OR(C688=\"s\",C688=0),OFFSET(B688,-1,0),C688)","v":3},{"$f":"IF(OFFSET(C688,-1,0)=\"L\",1,IF(OFFSET(C688,-1,0)=1,2,IF(OR(A688=\"s\",A688=0),\"S\",IF(AND(OFFSET(C688,-1,0)=2,A688=4),3,IF(AND(OR(OFFSET(C688,-1,0)=\"s\",OFFSET(C688,-1,0)=0),A688<>\"s\",A688>OFFSET(B688,-1,0)),OFFSET(B688,-1,0),A688)))))","v":"S"},{"$f":"IF(OR(C688=\"S\",C688=0),0,IF(ISERROR(K688),J688,SMALL(J688:K688,1)))","v":0},{"$f":"IF($C688=1,OFFSET(E688,-1,0)+1,OFFSET(E688,-1,0))","v":1},{"$f":"IF($C688=1,0,IF($C688=2,OFFSET(F688,-1,0)+1,OFFSET(F688,-1,0)))","v":16},{"$f":"IF(AND($C688<=2,$C688<>0),0,IF($C688=3,OFFSET(G688,-1,0)+1,OFFSET(G688,-1,0)))","v":2},{"$f":"IF(AND($C688<=3,$C688<>0),0,IF($C688=4,OFFSET(H688,-1,0)+1,OFFSET(H688,-1,0)))","v":0},{"$f":"IF(AND($C688<=4,$C688<>0),0,IF(AND($C688=\"S\",$W688>0),OFFSET(I688,-1,0)+1,OFFSET(I688,-1,0)))","v":0},0,0,"F","Serviço","Serviço","1.16.2.0.4.","SINAPI",87273,"REVESTIMENTO CERÂMICO PARA PAREDES INTERNAS COM PLACAS TIPO ESMALTADA EXTRA DE DIMENSÕES 33X45 CM APLICADAS EM AMBIENTES DE ÁREA MAIOR QUE 5 M² NA ALTURA INTEIRA DAS PAREDES. AF_06/2014","M2",121.5,null,null,null,""]
[3,{"$f":"IF(OR(C689=\"s\",C689=0),OFFSET(B689,-1,0),C689)","v":3},{"$f":"IF(OFFSET(C689,-1,0)=\"L\",1,IF(OFFSET(C689,-1,0)=1,2,IF(OR(A689=\"s\",A689=0),\"S\",IF(AND(OFFSET(C689,-1,0)=2,A689=4),3,IF(AND(OR(OFFSET(C689,-1,0)=\"s\",OFFSET(C689,-1,0)=0),A689<>\"s\",A689>OFFSET(B689,-1,0)),OFFSET(B689,-1,0),A689)))))","v":3},{"$f":"IF(OR(C689=\"S\",C689=0),0,IF(ISERROR(K689),J689,SMALL(J689:K689,1)))","v":2},{"$f":"IF($C689=1,OFFSET(E689,-1,0)+1,OFFSET(E689,-1,0))","v":1},{"$f":"IF($C689=1,0,IF($C689=2,OFFSET(F689,-1,0)+1,OFFSET(F689,-1,0)))","v":16},{"$f":"IF(AND($C689<=2,$C689<>0),0,IF($C689=3,OFFSET(G689,-1,0)+1,OFFSET(G689,-1,0)))","v":3},{"$f":"IF(AND($C689<=3,$C689<>0),0,IF($C689=4,OFFSET(H689,-1,0)+1,OFFSET(H689,-1,0)))","v":0},{"$f":"IF(AND($C689<=4,$C689<>0),0,IF(AND($C689=\"S\",$W689>0),OFFSET(I689,-1,0)+1,OFFSET(I689,-1,0)))","v":0},21,2,"F","Nível 3","Nível 3","1.16.3.","SINAPI",null,"REFORMA WC FUNCIONÁRIOS","-",null,null,null,null,""]
["S",3,"S",0,1,16,3,0,0,0,0,"F","Serviço","Serviço","1.16.3.0.1.","SINAPI",87273,"REVESTIMENTO CERÂMICO PARA PAREDES INTERNAS COM PLACAS TIPO ESMALTADA EXTRA DE DIMENSÕES 33X45 CM APLICADAS EM AMBIENTES DE ÁREA MAIOR QUE 5 M² NA ALTURA INTEIRA DAS PAREDES. AF_06/2014","M2",21.42,null,null,null,""]
[3,3,3,4,1,16,4,0,0,19,4,"F","Nível 3","Nível 3","1.16.4.","SINAPI",null,"LABORATÓRIO SECO","-",null,null,null,null,""]
["S",3,"S",0,1,16,4,0,0,0,0,"F","Serviço","Serviço","1.16.4.0.1.","SINAPI",87904,"CHAPISCO APLICADO EM ALVENARIA (COM PRESENÇA DE VÃOS) E ESTRUTURAS DE CONCRETO DE FACHADA, COM COLHER DE PEDREIRO.  ARGAMASSA TRAÇO 1:3 COM PREPARO MANUAL. AF_06/2014","M2",10.14,null,null,null,"Referência: AGETOP - 200101"]
["S",3,"S",0,1,16,4,0,0,0,0,"F","Serviço","Serviço","1.16.4.0.2.","SINAPI",87553,"EMBOÇO, PARA RECEBIMENTO DE CERÂMICA, EM ARGAMASSA TRAÇO 1:2:8, PREPARO MECÂNICO COM BETONEIRA 400L, APLICADO MANUALMENTE EM FACES INTERNAS DE PAREDES, PARA AMBIENTE COM ÁREA MAIOR QUE 10M2, ESPESSURA DE 10MM, COM EXECUÇÃO DE TALISCAS. AF_06/2014","M2",10.14,null,null,null,""]
["S",3,"S",0,1,16,4,0,0,{"$f":"IF(OR($C694=\"S\",$C694=0),0,MATCH(0,OFFSET($D694,1,$C694,ROW($C$839)-ROW($C694)),0))","v":0},{"$f":"IF(OR($C694=\"S\",$C694=0),0,MATCH(OFFSET($D694,0,$C694)+1,OFFSET($D694,1,$C694,ROW($C$839)-ROW($C694)),0))","v":0},"F","Serviço","Serviço","1.16.4.0.3.","SINAPI",87273,"REVESTIMENTO CERÂMICO PARA PAREDES INTERNAS COM PLACAS TIPO ESMALTADA EXTRA DE DIMENSÕES 33X45 CM APLICADAS EM AMBIENTES DE ÁREA MAIOR QUE 5 M² NA ALTURA INTEIRA DAS PAREDES. AF_06/2014","M2",10.14,null,null,null,""]
[3,3,3,3,1,16,5,0,0,15,3,"F","Nível 3","Nível 3","1.16.5.","SINAPI",null,"LOCAL DE SAÍDA DOS ALUNOS","-",null,null,null,null,""]
["S",3,"S",0,1,16,5,0,0,0,0,"F","Serviço","Serviço","1.16.5.0.1.","SINAPI",87904,"CHAPISCO APLICADO EM ALVENARIA (COM PRESENÇA DE VÃOS) E ESTRUTURAS DE CONCRETO DE FACHADA, COM COLHER DE PEDREIRO.  ARGAMASSA TRAÇO 1:3 COM PREPARO MANUAL. AF_06/2014","M2",20.85,null,null,null,"Referência: AGETOP - 200101"]
["S",3,"S",0,1,16,5,0,0,0,0,"F","Serviço","Serviço","1.16.5.0.2.","SINAPI",87547,"MASSA ÚNICA, PARA RECEBIMENTO DE PINTURA, EM ARGAMASSA TRAÇO 1:2:8, PREPARO MECÂNICO COM BETONEIRA 400L, APLICADA MANUALMENTE EM FACES INTERNAS DE PAREDES, ESPESSURA DE 10MM, COM EXECUÇÃO DE TALISCAS. AF_06/2014","M2",20.85,null,null,null,""]
[3,3,3,2,1,16,6,0,0,12,2,"F","Nível 3","Nível 3","1.16.6.","SINAPI",null,"PINTURA GERAL","-",null,null,null,null,""]
["S",3,"S",0,1,16,6,0,0,0,0,"F","Serviço","Serviço","1.16.6.0.1.","SINAPI",87547,"MASSA ÚNICA, PARA RECEBIMENTO DE PINTURA, EM ARGAMASSA TRAÇO 1:2:8, PREPARO MECÂNICO COM BETONEIRA 400L, APLICADA MANUALMENTE EM FACES INTERNAS DE PAREDES, ESPESSURA DE 10MM, COM EXECUÇÃO DE TALISCAS. AF_06/2014","M2",2491.38,null,null,null,""]
[3,{"$f":"IF(OR(C700=\"s\",C700=0),OFFSET(B700,-1,0),C700)","v":3},{"$f":"IF(OFFSET(C700,-1,0)=\"L\",1,IF(OFFSET(C700,-1,0)=1,2,IF(OR(A700=\"s\",A700=0),\"S\",IF(AND(OFFSET(C700,-1,0)=2,A700=4),3,IF(AND(OR(OFFSET(C700,-1,0)=\"s\",OFFSET(C700,-1,0)=0),A700<>\"s\",A700>OFFSET(B700,-1,0)),OFFSET(B700,-1,0),A700)))))","v":3},{"$f":"IF(OR(C700=\"S\",C700=0),0,IF(ISERROR(K700),J700,SMALL(J700:K700,1)))","v":5},{"$f":"IF($C700=1,OFFSET(E700,-1,0)+1,OFFSET(E700,-1,0))","v":1},{"$f":"IF($C700=1,0,IF($C700=2,OFFSET(F700,-1,0)+1,OFFSET(F700,-1,0)))","v":16},{"$f":"IF(AND($C700<=2,$C700<>0),0,IF($C700=3,OFFSET(G700,-1,0)+1,OFFSET(G700,-1,0)))","v":7},{"$f":"IF(AND($C700<=3,$C700<>0),0,IF($C700=4,OFFSET(H700,-1,0)+1,OFFSET(H700,-1,0)))","v":0},{"$f":"IF(AND($C700<=4,$C700<>0),0,IF(AND($C700=\"S\",$W700>0),OFFSET(I700,-1,0)+1,OFFSET(I700,-1,0)))","v":0},10,5,"F","Nível 3","Nível 3","1.16.7.","SINAPI",null,"CONSTRUÇÃO WC ACESSÍVEL","-",null,null,null,null,""]
["S",{"$f":"IF(OR(C701=\"s\",C701=0),OFFSET(B701,-1,0),C701)","v":3},{"$f":"IF(OFFSET(C701,-1,0)=\"L\",1,IF(OFFSET(C701,-1,0)=1,2,IF(OR(A701=\"s\",A701=0),\"S\",IF(AND(OFFSET(C701,-1,0)=2,A701=4),3,IF(AND(OR(OFFSET(C701,-1,0)=\"s\",OFFSET(C701,-1,0)=0),A701<>\"s\",A701>OFFSET(B701,-1,0)),OFFSET(B701,-1,0),A701)))))","v":"S"},{"$f":"IF(OR(C701=\"S\",C701=0),0,IF(ISERROR(K701),J701,SMALL(J701:K701,1)))","v":0},{"$f":"IF($C701=1,OFFSET(E701,-1,0)+1,OFFSET(E701,-1,0))","v":1},{"$f":"IF($C701=1,0,IF($C701=2,OFFSET(F701,-1,0)+1,OFFSET(F701,-1,0)))","v":16},{"$f":"IF(AND($C701<=2,$C701<>0),0,IF($C701=3,OFFSET(G701,-1,0)+1,OFFSET(G701,-1,0)))","v":7},{"$f":"IF(AND($C701<=3,$C701<>0),0,IF($C701=4,OFFSET(H701,-1,0)+1,OFFSET(H701,-1,0)))","v":0},{"$f":"IF(AND($C701<=4,$C701<>0),0,IF(AND($C701=\"S\",$W701>0),OFFSET(I701,-1,0)+1,OFFSET(I701,-1,0)))","v":0},0,0,"F","Serviço","Serviço","1.16.7.0.1.","SINAPI",87904,"CHAPISCO APLICADO EM ALVENARIA (COM PRESENÇA DE VÃOS) E ESTRUTURAS DE CONCRETO DE FACHADA, COM COLHER DE PEDREIRO.  ARGAMASSA TRAÇO 1:3 COM PREPARO MANUAL. AF_06/2014","M2",223.66,null,null,null,"Referência: AGETOP - 200101"]
["S",3,"S",0,1,16,7,0,0,0,0,"F","Serviço","Serviço","1.16.7.0.2.","SINAPI",87547,"MASSA ÚNICA, PARA RECEBIMENTO DE PINTURA, EM ARGAMASSA TRAÇO 1:2:8, PREPARO MECÂNICO COM BETONEIRA 400L, APLICADA MANUALMENTE EM FACES INTERNAS DE PAREDES, ESPESSURA DE 10MM, COM EXECUÇÃO DE TALISCAS. AF_06/2014","M2",144.06,null,null,null,""]
["S",3,"S",0,1,16,7,0,0,0,0,"F","Serviço","Serviço","1.16.7.0.3.","SINAPI",87553,"EMBOÇO, PARA RECEBIMENTO DE CERÂMICA, EM ARGAMASSA TRAÇO 1:2:8, PREPARO MECÂNICO COM BETONEIRA 400L, APLICADO MANUALMENTE EM FACES INTERNAS DE PAREDES, PARA AMBIENTE COM ÁREA MAIOR QUE 10M2, ESPESSURA DE 10MM, COM EXECUÇÃO DE TALISCAS. AF_06/2014","M2",79.599999999999994,null,null,null,""]
["S",3,"S",0,1,16,7,0,0,0,0,"F","Serviço","Serviço","1.16.7.0.4.","SINAPI",87273,"REVESTIMENTO CERÂMICO PARA PAREDES INTERNAS COM PLACAS TIPO ESMALTADA EXTRA DE DIMENSÕES 33X45 CM APLICADAS EM AMBIENTES DE ÁREA MAIOR QUE 5 M² NA ALTURA INTEIRA DAS PAREDES. AF_06/2014","M2",79.599999999999994,null,null,null,""]
[3,3,3,5,1,16,8,0,0,5,38,"F","Nível 3","Nível 3","1.16.8.","SINAPI",null,"REFORMA E AMPLIAÇÃO DA COZINHA","-",null,null,null,null,""]
["S",3,"S",0,1,16,8,0,0,0,0,"F","Serviço","Serviço","1.16.8.0.1.","SINAPI",87904,"CHAPISCO APLICADO EM ALVENARIA (COM PRESENÇA DE VÃOS) E ESTRUTURAS DE CONCRETO DE FACHADA, COM COLHER DE PEDREIRO.  ARGAMASSA TRAÇO 1:3 COM PREPARO MANUAL. AF_06/2014","M2",76.8,null,null,null,"Referência: AGETOP - 200101"]
["S",3,"S",0,1,16,8,0,0,0,0,"F","Serviço","Serviço","1.16.8.0.2.","SINAPI",87547,"MASSA ÚNICA, PARA RECEBIMENTO DE PINTURA, EM ARGAMASSA TRAÇO 1:2:8, PREPARO MECÂNICO COM BETONEIRA 400L, APLICADA MANUALMENTE EM FACES INTERNAS DE PAREDES, ESPESSURA DE 10MM, COM EXECUÇÃO DE TALISCAS. AF_06/2014","M2",38.4,null,null,null,""]
["S",3,"S",0,1,16,8,0,0,0,0,"F","Serviço","Serviço","1.16.8.0.3.","SINAPI",87553,"EMBOÇO, PARA RECEBIMENTO DE CERÂMICA, EM ARGAMASSA TRAÇO 1:2:8, PREPARO MECÂNICO COM BETONEIRA 400L, APLICADO MANUALMENTE EM FACES INTERNAS DE PAREDES, PARA AMBIENTE COM ÁREA MAIOR QUE 10M2, ESPESSURA DE 10MM, COM EXECUÇÃO DE TALISCAS. AF_06/2014","M2",38.4,null,null,null,""]
["S",3,"S",0,1,16,8,0,0,0,0,"F","Serviço","Serviço","1.16.8.0.4.","SINAPI",87273,"REVESTIMENTO CERÂMICO PARA PAREDES INTERNAS COM PLACAS TIPO ESMALTADA EXTRA DE DIMENSÕES 33X45 CM APLICADAS EM AMBIENTES DE ÁREA MAIOR QUE 5 M² NA ALTURA INTEIRA DAS PAREDES. AF_06/2014","M2",66.48,null,null,null,""]
[2,2,2,10,1,17,0,0,0,129,10,"F","Nível 2","Nível 2","1.17.",null,null,"FORROS","-",null,null,null,null,""]
[3,3,3,2,1,17,1,0,0,9,2,"F","Nível 3","Nível 3","1.17.1.","SINAPI",null,"REFORMA GERAL WC FEM","-",null,null,null,null,""]
["S",3,"S",0,1,17,1,0,0,0,0,"F","Serviço","Serviço","1.17.1.0.1.","AGETOP",210501,"FORRO DE GESSO COMUM","m2    ",15.04,null,null,null,""]
[3,3,3,2,1,17,2,0,0,7,2,"F","Nível 3","Nível 3","1.17.2.","SINAPI",null,"REFORMA GERAL WC MASC","-",null,null,null,null,""]
["S",3,"S",0,1,17,2,0,0,0,0,"F","Serviço","Serviço","1.17.2.0.1.","AGETOP",210501,"FORRO DE GESSO COMUM","m2    ",15.04,null,null,null,""]
[3,3,3,3,1,17,3,0,0,5,3,"F","Nível 3","Nível 3","1.17.3.","SINAPI",null,"CONSTRUÇÃO WC ACESSÍVEL","-",null,null,null,null,""]
["S",3,"S",0,1,17,3,0,0,0,0,"F","Serviço","Serviço","1.17.3.0.1.","AGETOP",210501,"FORRO DE GESSO COMUM","m2    ",17.72,null,null,null,""]
[{"$f":"CHOOSE(1+LOG(1+2*(ORÇAMENTO.Nivel=\"Nível 1\")+4*(ORÇAMENTO.Nivel=\"Nível 2\")+8*(ORÇAMENTO.Nivel=\"Nível 3\")+16*(ORÇAMENTO.Nivel=\"Nível 4\")+32*(ORÇAMENTO.Nivel=\"Serviço\"),2),0,1,2,3,4,\"S\")","v":"S"},{"$f":"IF(OR(C717=\"s\",C717=0),OFFSET(B717,-1,0),C717)","v":3},{"$f":"IF(OFFSET(C717,-1,0)=\"L\",1,IF(OFFSET(C717,-1,0)=1,2,IF(OR(A717=\"s\",A717=0),\"S\",IF(AND(OFFSET(C717,-1,0)=2,A717=4),3,IF(AND(OR(OFFSET(C717,-1,0)=\"s\",OFFSET(C717,-1,0)=0),A717<>\"s\",A717>OFFSET(B717,-1,0)),OFFSET(B717,-1,0),A717)))))","v":"S"},{"$f":"IF(OR(C717=\"S\",C717=0),0,IF(ISERROR(K717),J717,SMALL(J717:K717,1)))","v":0},{"$f":"IF($C717=1,OFFSET(E717,-1,0)+1,OFFSET(E717,-1,0))","v":1},{"$f":"IF($C717=1,0,IF($C717=2,OFFSET(F717,-1,0)+1,OFFSET(F717,-1,0)))","v":17},{"$f":"IF(AND($C717<=2,$C717<>0),0,IF($C717=3,OFFSET(G717,-1,0)+1,OFFSET(G717,-1,0)))","v":3},{"$f":"IF(AND($C717<=3,$C717<>0),0,IF($C717=4,OFFSET(H717,-1,0)+1,OFFSET(H717,-1,0)))","v":0},{"$f":"IF(AND($C717<=4,$C717<>0),0,IF(AND($C717=\"S\",$W717>0),OFFSET(I717,-1,0)+1,OFFSET(I717,-1,0)))","v":0},{"$f":"IF(OR($C717=\"S\",$C717=0),0,MATCH(0,OFFSET($D717,1,$C717,ROW($C$839)-ROW($C717)),0))","v":0},{"$f":"IF(OR($C717=\"S\",$C717=0),0,MATCH(OFFSET($D717,0,$C717)+1,OFFSET($D717,1,$C717,ROW($C$839)-ROW($C717)),0))","v":0},"F","Serviço","Serviço","1.17.3.0.2.","AGETOP",210506,"TABICA PARA FORRO DE GESSO COMUM","m     ",38.880000000000003,null,null,null,""]
[3,3,3,2,1,17,4,0,0,2,13,"F","Nível 3","Nível 3","1.17.4.","SINAPI",null,"REFORMA E AMPLIAÇÃO DA COZINHA","-",null,null,null,null,""]
["S",3,"S",0,1,17,4,0,0,0,0,"F","Serviço","Serviço","1.17.4.0.1.","AGETOP",210461,"FORRO DE PVC SEM ESTRUTURA DE METALON (COM REPINTURA DA ESTRUTURA COM TINTA ALQUÍDICA D.F.)","m2    ",12.6,null,null,null,""]
[2,2,2,35,1,18,0,0,0,119,35,"F","Nível 2","Nível 2","1.18.",null,null,"REVESTIMENTO DE PISO","-",null,null,null,null,""]
[3,3,3,3,1,18,1,0,0,34,3,"F","Nível 3","Nível 3","1.18.1.","SINAPI",null,"REFORMA GERAL WC FEM","-",null,null,null,null,""]
["S",3,"S",0,1,18,1,0,0,0,0,"F","Serviço","Serviço","1.18.1.0.1.","SINAPI",84191,"PISO EM GRANILITE, MARMORITE OU GRANITINA ESPESSURA 8 MM, INCLUSO JUNTAS DE DILATACAO PLASTICAS","M2",14.65,null,null,null,"Referência: AGETOP - 221101"]
["S",3,"S",0,1,18,1,0,0,0,0,"F","Serviço","Serviço","1.18.1.0.2.","AGETOP",221104,"RASPAGEM E APLICAÇÃO RESINA ACRÍLICA DUAS DEMÃOS","m2    ",29.3,null,null,null,""]
[3,3,3,3,1,18,2,0,0,31,3,"F","Nível 3","Nível 3","1.18.2.","SINAPI",null,"REFORMA GERAL WC MASC","-",null,null,null,null,""]
["S",3,"S",0,1,18,2,0,0,0,0,"F","Serviço","Serviço","1.18.2.0.1.","SINAPI",84191,"PISO EM GRANILITE, MARMORITE OU GRANITINA ESPESSURA 8 MM, INCLUSO JUNTAS DE DILATACAO PLASTICAS","M2",14.65,null,null,null,"Referência: AGETOP - 221101"]
["S",3,"S",0,1,18,2,0,0,0,0,"F","Serviço","Serviço","1.18.2.0.2.","AGETOP",221104,"RASPAGEM E APLICAÇÃO RESINA ACRÍLICA DUAS DEMÃOS","m2    ",29.3,null,null,null,""]
[3,3,3,2,1,18,3,0,0,28,2,"F","Nível 3","Nível 3","1.18.3.","SINAPI",null,"REFORMA WC FUNCIONÁRIOS","-",null,null,null,null,""]
["S",3,"S",0,1,18,3,0,0,0,0,"F","Serviço","Serviço","1.18.3.0.1.","SINAPI",87251,"REVESTIMENTO CERÂMICO PARA PISO COM PLACAS TIPO ESMALTADA EXTRA DE DIMENSÕES 45X45 CM APLICADA EM AMBIENTES DE ÁREA MAIOR QUE 10 M2. AF_06/2014","M2",4.12,null,null,null,""]
[3,3,3,2,1,18,4,0,0,26,2,"F","Nível 3","Nível 3","1.18.4.","SINAPI",null,"LOCAL DE SAÍDA DOS ALUNOS","-",null,null,null,null,""]
["S",3,"S",0,1,18,4,0,0,0,0,"F","Serviço","Serviço","1.18.4.0.1.","AGETOP",220102,"PISO CONCRETO DESEMPENADO ESPESSURA = 5 CM  1:2,5:3,5","m2    ",108.21,null,null,null,""]
[3,3,3,3,1,18,5,0,0,24,3,"F","Nível 3","Nível 3","1.18.5.","SINAPI",null,"CONSTRUÇÃO WC ACESSÍVEL","-",null,null,null,null,""]
["S",3,"S",0,1,18,5,0,0,0,0,"F","Serviço","Serviço","1.18.5.0.1.","AGETOP",220101,"LASTRO DE CONCRETO REGULARIZADO IMPERMEABILIZADO 1:3:6 ESP=5CM (BASE)","m2    ",18.32,null,null,null,""]
["S",3,"S",0,1,18,5,0,0,0,0,"F","Serviço","Serviço","1.18.5.0.2.","SINAPI",87251,"REVESTIMENTO CERÂMICO PARA PISO COM PLACAS TIPO ESMALTADA EXTRA DE DIMENSÕES 45X45 CM APLICADA EM AMBIENTES DE ÁREA MAIOR QUE 10 M2. AF_06/2014","M2",18.32,null,null,null,""]
[3,3,3,4,1,18,6,0,0,21,4,"F","Nível 3","Nível 3","1.18.6.","SINAPI",null,"AMPLIAÇÃO DO REFEITÓRIO","-",null,null,null,null,""]
["S",3,"S",0,1,18,6,0,0,0,0,"F","Serviço","Serviço","1.18.6.0.1.","AGETOP",220101,"LASTRO DE CONCRETO REGULARIZADO IMPERMEABILIZADO 1:3:6 ESP=5CM (BASE)","m2    ",51,null,null,null,""]
["S",3,"S",0,1,18,6,0,0,0,0,"F","Serviço","Serviço","1.18.6.0.2.","SINAPI",84191,"PISO EM GRANILITE, MARMORITE OU GRANITINA ESPESSURA 8 MM, INCLUSO JUNTAS DE DILATACAO PLASTICAS","M2",51,null,null,null,"Referência: AGETOP - 221101"]
["S",3,"S",0,1,18,6,0,0,0,0,"F","Serviço","Serviço","1.18.6.0.3.","AGETOP",221104,"RASPAGEM E APLICAÇÃO RESINA ACRÍLICA DUAS DEMÃOS","m2    ",140.86000000000001,null,null,null,""]
[3,3,3,3,1,18,7,0,0,17,3,"F","Nível 3","Nível 3","1.18.7.","SINAPI",null,"REFORMA E AMPLIAÇÃO DA COZINHA","-",null,null,null,null,""]
["S",3,"S",0,1,18,7,0,0,0,0,"F","Serviço","Serviço","1.18.7.0.1.","AGETOP",220101,"LASTRO DE CONCRETO REGULARIZADO IMPERMEABILIZADO 1:3:6 ESP=5CM (BASE)","m2    ",3.66,null,null,null,""]
["S",3,"S",0,1,18,7,0,0,0,0,"F","Serviço","Serviço","1.18.7.0.2.","SINAPI",87251,"REVESTIMENTO CERÂMICO PARA PISO COM PLACAS TIPO ESMALTADA EXTRA DE DIMENSÕES 45X45 CM APLICADA EM AMBIENTES DE ÁREA MAIOR QUE 10 M2. AF_06/2014","M2",16.920000000000002,null,null,null,""]
[3,3,3,2,1,18,8,0,0,14,2,"F","Nível 3","Nível 3","1.18.8.","SINAPI",null,"INSTALAÇÃO PLATAFORMA ELEVATÓRIA","-",null,null,null,null,""]
["S",3,"S",0,1,18,8,0,0,0,0,"F","Serviço","Serviço","1.18.8.0.1.","AGETOP",220102,"PISO CONCRETO DESEMPENADO ESPESSURA = 5 CM  1:2,5:3,5","m2    ",3.5,null,null,null,""]
[{"$f":"CHOOSE(1+LOG(1+2*(ORÇAMENTO.Nivel=\"Nível 1\")+4*(ORÇAMENTO.Nivel=\"Nível 2\")+8*(ORÇAMENTO.Nivel=\"Nível 3\")+16*(ORÇAMENTO.Nivel=\"Nível 4\")+32*(ORÇAMENTO.Nivel=\"Serviço\"),2),0,1,2,3,4,\"S\")","v":3},{"$f":"IF(OR(C743=\"s\",C743=0),OFFSET(B743,-1,0),C743)","v":3},{"$f":"IF(OFFSET(C743,-1,0)=\"L\",1,IF(OFFSET(C743,-1,0)=1,2,IF(OR(A743=\"s\",A743=0),\"S\",IF(AND(OFFSET(C743,-1,0)=2,A743=4),3,IF(AND(OR(OFFSET(C743,-1,0)=\"s\",OFFSET(C743,-1,0)=0),A743<>\"s\",A743>OFFSET(B743,-1,0)),OFFSET(B743,-1,0),A743)))))","v":3},{"$f":"IF(OR(C743=\"S\",C743=0),0,IF(ISERROR(K743),J743,SMALL(J743:K743,1)))","v":4},{"$f":"IF($C743=1,OFFSET(E743,-1,0)+1,OFFSET(E743,-1,0))","v":1},{"$f":"IF($C743=1,0,IF($C743=2,OFFSET(F743,-1,0)+1,OFFSET(F743,-1,0)))","v":18},{"$f":"IF(AND($C743<=2,$C743<>0),0,IF($C743=3,OFFSET(G743,-1,0)+1,OFFSET(G743,-1,0)))","v":9},{"$f":"IF(AND($C743<=3,$C743<>0),0,IF($C743=4,OFFSET(H743,-1,0)+1,OFFSET(H743,-1,0)))","v":0},{"$f":"IF(AND($C743<=4,$C743<>0),0,IF(AND($C743=\"S\",$W743>0),OFFSET(I743,-1,0)+1,OFFSET(I743,-1,0)))","v":0},12,4,"F","Nível 3","Nível 3","1.18.9.","SINAPI",null,"ACESSIBILIDADE","-",null,null,null,null,""]
[{"$f":"CHOOSE(1+LOG(1+2*(ORÇAMENTO.Nivel=\"Nível 1\")+4*(ORÇAMENTO.Nivel=\"Nível 2\")+8*(ORÇAMENTO.Nivel=\"Nível 3\")+16*(ORÇAMENTO.Nivel=\"Nível 4\")+32*(ORÇAMENTO.Nivel=\"Serviço\"),2),0,1,2,3,4,\"S\")","v":"S"},{"$f":"IF(OR(C744=\"s\",C744=0),OFFSET(B744,-1,0),C744)","v":3},{"$f":"IF(OFFSET(C744,-1,0)=\"L\",1,IF(OFFSET(C744,-1,0)=1,2,IF(OR(A744=\"s\",A744=0),\"S\",IF(AND(OFFSET(C744,-1,0)=2,A744=4),3,IF(AND(OR(OFFSET(C744,-1,0)=\"s\",OFFSET(C744,-1,0)=0),A744<>\"s\",A744>OFFSET(B744,-1,0)),OFFSET(B744,-1,0),A744)))))","v":"S"},{"$f":"IF(OR(C744=\"S\",C744=0),0,IF(ISERROR(K744),J744,SMALL(J744:K744,1)))","v":0},{"$f":"IF($C744=1,OFFSET(E744,-1,0)+1,OFFSET(E744,-1,0))","v":1},{"$f":"IF($C744=1,0,IF($C744=2,OFFSET(F744,-1,0)+1,OFFSET(F744,-1,0)))","v":18},{"$f":"IF(AND($C744<=2,$C744<>0),0,IF($C744=3,OFFSET(G744,-1,0)+1,OFFSET(G744,-1,0)))","v":9},{"$f":"IF(AND($C744<=3,$C744<>0),0,IF($C744=4,OFFSET(H744,-1,0)+1,OFFSET(H744,-1,0)))","v":0},{"$f":"IF(AND($C744<=4,$C744<>0),0,IF(AND($C744=\"S\",$W744>0),OFFSET(I744,-1,0)+1,OFFSET(I744,-1,0)))","v":0},0,0,"F","Serviço","Serviço","1.18.9.0.1.","AGETOP",220102,"PISO CONCRETO DESEMPENADO ESPESSURA = 5 CM  1:2,5:3,5","m2    ",757.65,null,null,null,""]
[{"$f":"CHOOSE(1+LOG(1+2*(ORÇAMENTO.Nivel=\"Nível 1\")+4*(ORÇAMENTO.Nivel=\"Nível 2\")+8*(ORÇAMENTO.Nivel=\"Nível 3\")+16*(ORÇAMENTO.Nivel=\"Nível 4\")+32*(ORÇAMENTO.Nivel=\"Serviço\"),2),0,1,2,3,4,\"S\")","v":"S"},{"$f":"IF(OR(C745=\"s\",C745=0),OFFSET(B745,-1,0),C745)","v":3},{"$f":"IF(OFFSET(C745,-1,0)=\"L\",1,IF(OFFSET(C745,-1,0)=1,2,IF(OR(A745=\"s\",A745=0),\"S\",IF(AND(OFFSET(C745,-1,0)=2,A745=4),3,IF(AND(OR(OFFSET(C745,-1,0)=\"s\",OFFSET(C745,-1,0)=0),A745<>\"s\",A745>OFFSET(B745,-1,0)),OFFSET(B745,-1,0),A745)))))","v":"S"},{"$f":"IF(OR(C745=\"S\",C745=0),0,IF(ISERROR(K745),J745,SMALL(J745:K745,1)))","v":0},{"$f":"IF($C745=1,OFFSET(E745,-1,0)+1,OFFSET(E745,-1,0))","v":1},{"$f":"IF($C745=1,0,IF($C745=2,OFFSET(F745,-1,0)+1,OFFSET(F745,-1,0)))","v":18},{"$f":"IF(AND($C745<=2,$C745<>0),0,IF($C745=3,OFFSET(G745,-1,0)+1,OFFSET(G745,-1,0)))","v":9},{"$f":"IF(AND($C745<=3,$C745<>0),0,IF($C745=4,OFFSET(H745,-1,0)+1,OFFSET(H745,-1,0)))","v":0},{"$f":"IF(AND($C745<=4,$C745<>0),0,IF(AND($C745=\"S\",$W745>0),OFFSET(I745,-1,0)+1,OFFSET(I745,-1,0)))","v":0},0,0,"F","Serviço","Serviço","1.18.9.0.2.","AGETOP",221120,"PISO DE BORRACHA COLORIDO MODELO TÁTIL ( ALERTA OU DIRECIONAL) INCLUSO CONTRAPISO (1CI:3ARML) C/ E=2CM E NATA DE CIMENTO","m2    ",103.47,null,null,null,""]
[{"$f":"CHOOSE(1+LOG(1+2*(ORÇAMENTO.Nivel=\"Nível 1\")+4*(ORÇAMENTO.Nivel=\"Nível 2\")+8*(ORÇAMENTO.Nivel=\"Nível 3\")+16*(ORÇAMENTO.Nivel=\"Nível 4\")+32*(ORÇAMENTO.Nivel=\"Serviço\"),2),0,1,2,3,4,\"S\")","v":"S"},{"$f":"IF(OR(C746=\"s\",C746=0),OFFSET(B746,-1,0),C746)","v":3},{"$f":"IF(OFFSET(C746,-1,0)=\"L\",1,IF(OFFSET(C746,-1,0)=1,2,IF(OR(A746=\"s\",A746=0),\"S\",IF(AND(OFFSET(C746,-1,0)=2,A746=4),3,IF(AND(OR(OFFSET(C746,-1,0)=\"s\",OFFSET(C746,-1,0)=0),A746<>\"s\",A746>OFFSET(B746,-1,0)),OFFSET(B746,-1,0),A746)))))","v":"S"},{"$f":"IF(OR(C746=\"S\",C746=0),0,IF(ISERROR(K746),J746,SMALL(J746:K746,1)))","v":0},{"$f":"IF($C746=1,OFFSET(E746,-1,0)+1,OFFSET(E746,-1,0))","v":1},{"$f":"IF($C746=1,0,IF($C746=2,OFFSET(F746,-1,0)+1,OFFSET(F746,-1,0)))","v":18},{"$f":"IF(AND($C746<=2,$C746<>0),0,IF($C746=3,OFFSET(G746,-1,0)+1,OFFSET(G746,-1,0)))","v":9},{"$f":"IF(AND($C746<=3,$C746<>0),0,IF($C746=4,OFFSET(H746,-1,0)+1,OFFSET(H746,-1,0)))","v":0},{"$f":"IF(AND($C746<=4,$C746<>0),0,IF(AND($C746=\"S\",$W746>0),OFFSET(I746,-1,0)+1,OFFSET(I746,-1,0)))","v":0},0,0,"F","Serviço","Serviço","1.18.9.0.3.","AGETOP",221126,"PISO DE LADRILHO HIDRÁULICO COLORIDO MODELO TÁTIL ( ALERTA OU DIRECIONAL) SEM LASTRO","m2    ",176.29000000000002,null,null,null,""]
[3,3,3,2,1,18,10,0,0,8,2,"F","Nível 3","Nível 3","1.18.10.","SINAPI",null,"CENTRAL DE GÁS","-",null,null,null,null,""]
["S",3,"S",0,1,18,10,0,0,0,0,"F","Serviço","Serviço","1.18.10.0.1.","AGETOP",220102,"PISO CONCRETO DESEMPENADO ESPESSURA = 5 CM  1:2,5:3,5","m2    ",3.77,null,null,null,""]
[3,3,3,2,1,18,11,0,0,6,2,"F","Nível 3","Nível 3","1.18.11.","SINAPI",null,"INST. HIDROSSANITÁRIAS","-",null,null,null,null,""]
["S",3,"S",0,1,18,11,0,0,0,0,"F","Serviço","Serviço","1.18.11.0.1.","AGETOP",220102,"PISO CONCRETO DESEMPENADO ESPESSURA = 5 CM  1:2,5:3,5","m2    ",57.5,null,null,null,""]
[3,3,3,2,1,18,12,0,0,4,2,"F","Nível 3","Nível 3","1.18.12.","SINAPI",null,"INST. DE INCÊNDIO","-",null,null,null,null,""]
["S",3,"S",0,1,18,12,0,0,{"$f":"IF(OR($C752=\"S\",$C752=0),0,MATCH(0,OFFSET($D752,1,$C752,ROW($C$839)-ROW($C752)),0))","v":0},{"$f":"IF(OR($C752=\"S\",$C752=0),0,MATCH(OFFSET($D752,0,$C752)+1,OFFSET($D752,1,$C752,ROW($C$839)-ROW($C752)),0))","v":0},"F","Serviço","Serviço","1.18.12.0.1.","AGETOP",220102,"PISO CONCRETO DESEMPENADO ESPESSURA = 5 CM  1:2,5:3,5","m2    ",1.75,null,null,null,""]
[3,3,3,2,1,18,13,0,0,2,{"$error":"#N/A"},"F","Nível 3","Nível 3","1.18.13.","SINAPI",null,"INST. ELÉTRICAS","-",null,null,null,null,""]
["S",3,"S",0,1,18,13,0,0,0,0,"F","Serviço","Serviço","1.18.13.0.1.","AGETOP",220102,"PISO CONCRETO DESEMPENADO ESPESSURA = 5 CM  1:2,5:3,5","m2    ",108.65,null,null,null,""]
[2,2,2,4,1,19,0,0,0,84,4,"F","Nível 2","Nível 2","1.19.",null,null,"FERRAGENS","-",null,null,null,null,""]
[3,3,3,3,1,19,1,0,0,3,13,"F","Nível 3","Nível 3","1.19.1.","SINAPI",null,"CONSTRUÇÃO WC ACESSÍVEL","-",null,null,null,null,""]
["S",3,"S",0,1,19,1,0,0,0,0,"F","Serviço","Serviço","1.19.1.0.1.","AGETOP",230174,"BARRA DE APOIO EM AÇO INOX - 40 CM","un    ",12,null,null,null,""]
["S",3,"S",0,1,19,1,0,0,0,0,"F","Serviço","Serviço","1.19.1.0.2.","AGETOP",230176,"BARRA DE APOIO EM AÇO INOX - 80 CM ","un    ",12,null,null,null,""]
[2,{"$f":"IF(OR(C759=\"s\",C759=0),OFFSET(B759,-1,0),C759)","v":2},{"$f":"IF(OFFSET(C759,-1,0)=\"L\",1,IF(OFFSET(C759,-1,0)=1,2,IF(OR(A759=\"s\",A759=0),\"S\",IF(AND(OFFSET(C759,-1,0)=2,A759=4),3,IF(AND(OR(OFFSET(C759,-1,0)=\"s\",OFFSET(C759,-1,0)=0),A759<>\"s\",A759>OFFSET(B759,-1,0)),OFFSET(B759,-1,0),A759)))))","v":2},{"$f":"IF(OR(C759=\"S\",C759=0),0,IF(ISERROR(K759),J759,SMALL(J759:K759,1)))","v":4},{"$f":"IF($C759=1,OFFSET(E759,-1,0)+1,OFFSET(E759,-1,0))","v":1},{"$f":"IF($C759=1,0,IF($C759=2,OFFSET(F759,-1,0)+1,OFFSET(F759,-1,0)))","v":20},{"$f":"IF(AND($C759<=2,$C759<>0),0,IF($C759=3,OFFSET(G759,-1,0)+1,OFFSET(G759,-1,0)))","v":0},{"$f":"IF(AND($C759<=3,$C759<>0),0,IF($C759=4,OFFSET(H759,-1,0)+1,OFFSET(H759,-1,0)))","v":0},{"$f":"IF(AND($C759<=4,$C759<>0),0,IF(AND($C759=\"S\",$W759>0),OFFSET(I759,-1,0)+1,OFFSET(I759,-1,0)))","v":0},80,4,"F","Nível 2","Nível 2","1.20.",null,null,"ADMINISTRAÇÃO","-",null,null,null,null,""]
[3,3,3,3,1,20,1,0,0,3,9,"F","Nível 3","Nível 3","1.20.1.",null,null,"MENSALISTAS","-",null,null,null,null,""]
["S",3,"S",0,1,20,1,0,0,0,0,"F","Serviço","Serviço","1.20.1.0.1.","SINAPI",90778,"ENGENHEIRO CIVIL DE OBRA PLENO COM ENCARGOS COMPLEMENTARES","H",176,null,null,null,"Referência: AGETOP - 250101"]
["S",3,"S",0,1,20,1,0,0,0,0,"F","Serviço","Serviço","1.20.1.0.2.","SINAPI",90776,"ENCARREGADO GERAL COM ENCARGOS COMPLEMENTARES","H",880,null,null,null,"Referência: AGETOP - 250103"]
[{"$f":"CHOOSE(1+LOG(1+2*(ORÇAMENTO.Nivel=\"Nível 1\")+4*(ORÇAMENTO.Nivel=\"Nível 2\")+8*(ORÇAMENTO.Nivel=\"Nível 3\")+16*(ORÇAMENTO.Nivel=\"Nível 4\")+32*(ORÇAMENTO.Nivel=\"Serviço\"),2),0,1,2,3,4,\"S\")","v":2},2,2,56,1,21,0,0,0,76,56,"F","Nível 2","Nível 2","1.21.",null,null,"PINTURA","-",null,null,null,null,""]
[3,3,3,5,1,21,1,0,0,55,5,"F","Nível 3","Nível 3","1.21.1.","SINAPI",null,"REFORMA GERAL WC FEM","-",null,null,null,null,""]
["S",3,"S",0,1,21,1,0,0,0,0,"F","Serviço","Serviço","1.21.1.0.1.","AGETOP",260104,"REMOCAO DE PINTURA ANTIGA A LATEX","m2    ",24.409999999999997,null,null,null,""]
["S",3,"S",0,1,21,1,0,0,0,0,"F","Serviço","Serviço","1.21.1.0.2.","SINAPI","74145/1","PINTURA ESMALTE FOSCO, DUAS DEMAOS, SOBRE SUPERFICIE METALICA, INCLUSO UMA DEMAO DE FUNDO ANTICORROSIVO. UTILIZACAO DE REVOLVER ( AR-COMPRIMIDO).","M2",45,null,null,null,"Referência: AGETOP - 261602"]
["S",3,"S",0,1,21,1,0,0,0,0,"F","Serviço","Serviço","1.21.1.0.3.","SINAPI",88496,"APLICAÇÃO E LIXAMENTO DE MASSA LÁTEX EM TETO, DUAS DEMÃOS. AF_06/2014","M2",32.08,null,null,null,"Referência: AGETOP - 261300"]
["S",3,"S",0,1,21,1,0,0,0,0,"F","Serviço","Serviço","1.21.1.0.4.","SINAPI",88486,"APLICAÇÃO MANUAL DE PINTURA COM TINTA LÁTEX PVA EM TETO, DUAS DEMÃOS. AF_06/2014","M2",30.08,null,null,null,"Referência: AGETOP - 261307"]
[3,3,3,5,1,21,2,0,0,50,5,"F","Nível 3","Nível 3","1.21.2.","SINAPI",null,"REFORMA GERAL WC MASC","-",null,null,null,null,""]
["S",3,"S",0,1,21,2,0,0,0,0,"F","Serviço","Serviço","1.21.2.0.1.","AGETOP",260104,"REMOCAO DE PINTURA ANTIGA A LATEX","m2    ",24.409999999999997,null,null,null,""]
["S",3,"S",0,1,21,2,0,0,0,0,"F","Serviço","Serviço","1.21.2.0.2.","SINAPI","74145/1","PINTURA ESMALTE FOSCO, DUAS DEMAOS, SOBRE SUPERFICIE METALICA, INCLUSO UMA DEMAO DE FUNDO ANTICORROSIVO. UTILIZACAO DE REVOLVER ( AR-COMPRIMIDO).","M2",45,null,null,null,"Referência: AGETOP - 261602"]
["S",3,"S",0,1,21,2,0,0,0,0,"F","Serviço","Serviço","1.21.2.0.3.","SINAPI",88496,"APLICAÇÃO E LIXAMENTO DE MASSA LÁTEX EM TETO, DUAS DEMÃOS. AF_06/2014","M2",32.08,null,null,null,"Referência: AGETOP - 261300"]
[{"$f":"CHOOSE(1+LOG(1+2*(ORÇAMENTO.Nivel=\"Nível 1\")+4*(ORÇAMENTO.Nivel=\"Nível 2\")+8*(ORÇAMENTO.Nivel=\"Nível 3\")+16*(ORÇAMENTO.Nivel=\"Nível 4\")+32*(ORÇAMENTO.Nivel=\"Serviço\"),2),0,1,2,3,4,\"S\")","v":"S"},{"$f":"IF(OR(C773=\"s\",C773=0),OFFSET(B773,-1,0),C773)","v":3},{"$f":"IF(OFFSET(C773,-1,0)=\"L\",1,IF(OFFSET(C773,-1,0)=1,2,IF(OR(A773=\"s\",A773=0),\"S\",IF(AND(OFFSET(C773,-1,0)=2,A773=4),3,IF(AND(OR(OFFSET(C773,-1,0)=\"s\",OFFSET(C773,-1,0)=0),A773<>\"s\",A773>OFFSET(B773,-1,0)),OFFSET(B773,-1,0),A773)))))","v":"S"},{"$f":"IF(OR(C773=\"S\",C773=0),0,IF(ISERROR(K773),J773,SMALL(J773:K773,1)))","v":0},{"$f":"IF($C773=1,OFFSET(E773,-1,0)+1,OFFSET(E773,-1,0))","v":1},{"$f":"IF($C773=1,0,IF($C773=2,OFFSET(F773,-1,0)+1,OFFSET(F773,-1,0)))","v":21},{"$f":"IF(AND($C773<=2,$C773<>0),0,IF($C773=3,OFFSET(G773,-1,0)+1,OFFSET(G773,-1,0)))","v":2},{"$f":"IF(AND($C773<=3,$C773<>0),0,IF($C773=4,OFFSET(H773,-1,0)+1,OFFSET(H773,-1,0)))","v":0},{"$f":"IF(AND($C773<=4,$C773<>0),0,IF(AND($C773=\"S\",$W773>0),OFFSET(I773,-1,0)+1,OFFSET(I773,-1,0)))","v":0},0,0,"F","Serviço","Serviço","1.21.2.0.4.","SINAPI",88486,"APLICAÇÃO MANUAL DE PINTURA COM TINTA LÁTEX PVA EM TETO, DUAS DEMÃOS. AF_06/2014","M2",30.08,null,null,null,"Referência: AGETOP - 261307"]
[3,{"$f":"IF(OR(C774=\"s\",C774=0),OFFSET(B774,-1,0),C774)","v":3},{"$f":"IF(OFFSET(C774,-1,0)=\"L\",1,IF(OFFSET(C774,-1,0)=1,2,IF(OR(A774=\"s\",A774=0),\"S\",IF(AND(OFFSET(C774,-1,0)=2,A774=4),3,IF(AND(OR(OFFSET(C774,-1,0)=\"s\",OFFSET(C774,-1,0)=0),A774<>\"s\",A774>OFFSET(B774,-1,0)),OFFSET(B774,-1,0),A774)))))","v":3},{"$f":"IF(OR(C774=\"S\",C774=0),0,IF(ISERROR(K774),J774,SMALL(J774:K774,1)))","v":6},{"$f":"IF($C774=1,OFFSET(E774,-1,0)+1,OFFSET(E774,-1,0))","v":1},{"$f":"IF($C774=1,0,IF($C774=2,OFFSET(F774,-1,0)+1,OFFSET(F774,-1,0)))","v":21},{"$f":"IF(AND($C774<=2,$C774<>0),0,IF($C774=3,OFFSET(G774,-1,0)+1,OFFSET(G774,-1,0)))","v":3},{"$f":"IF(AND($C774<=3,$C774<>0),0,IF($C774=4,OFFSET(H774,-1,0)+1,OFFSET(H774,-1,0)))","v":0},{"$f":"IF(AND($C774<=4,$C774<>0),0,IF(AND($C774=\"S\",$W774>0),OFFSET(I774,-1,0)+1,OFFSET(I774,-1,0)))","v":0},45,6,"F","Nível 3","Nível 3","1.21.3.","SINAPI",null,"REFORMA WC FUNCIONÁRIOS","-",null,null,null,null,""]
["S",3,"S",0,1,21,3,0,0,0,0,"F","Serviço","Serviço","1.21.3.0.1.","SINAPI","74145/1","PINTURA ESMALTE FOSCO, DUAS DEMAOS, SOBRE SUPERFICIE METALICA, INCLUSO UMA DEMAO DE FUNDO ANTICORROSIVO. UTILIZACAO DE REVOLVER ( AR-COMPRIMIDO).","M2",8.82,null,null,null,"Referência: AGETOP - 261602"]
["S",3,"S",0,1,21,3,0,0,0,0,"F","Serviço","Serviço","1.21.3.0.2.","AGETOP",260105,"REMOCAO DE PINTURA ANTIGA A OLEO OU ESMALTE","m2    ",4.8,null,null,null,""]
["S",3,"S",0,1,21,3,0,0,0,0,"F","Serviço","Serviço","1.21.3.0.3.","SINAPI","73924/3","PINTURA ESMALTE FOSCO, DUAS DEMAOS, SOBRE SUPERFICIE METALICA","M2",4.8,null,null,null,"Referência: AGETOP - 261503"]
["S",3,"S",0,1,21,3,0,0,0,0,"F","Serviço","Serviço","1.21.3.0.4.","SINAPI",88489,"APLICAÇÃO MANUAL DE PINTURA COM TINTA LÁTEX ACRÍLICA EM PAREDES, DUAS DEMÃOS. AF_06/2014","M2",5.8,null,null,null,"Referência: AGETOP - 261001"]
["S",3,"S",0,1,21,3,0,0,0,0,"F","Serviço","Serviço","1.21.3.0.5.","SINAPI",88486,"APLICAÇÃO MANUAL DE PINTURA COM TINTA LÁTEX PVA EM TETO, DUAS DEMÃOS. AF_06/2014","M2",4.12,null,null,null,"Referência: AGETOP - 261307"]
[3,3,3,2,1,21,4,0,0,39,2,"F","Nível 3","Nível 3","1.21.4.","SINAPI",null,"LOCAL DE SAÍDA DOS ALUNOS","-",null,null,null,null,""]
["S",3,"S",0,1,21,4,0,0,0,0,"F","Serviço","Serviço","1.21.4.0.1.","AGETOP",261000,"PINTURA LATEX ACRILICA 2 DEMAOS C/SELADOR","m2    ",20.85,null,null,null,""]
[3,3,3,4,1,21,5,0,0,37,4,"F","Nível 3","Nível 3","1.21.5.","SINAPI",null,"SALAS DE AULA / LAB. / BIBLIO. / AUDIT.","-",null,null,null,null,""]
["S",3,"S",0,1,21,5,0,0,0,0,"F","Serviço","Serviço","1.21.5.0.1.","SINAPI","74145/1","PINTURA ESMALTE FOSCO, DUAS DEMAOS, SOBRE SUPERFICIE METALICA, INCLUSO UMA DEMAO DE FUNDO ANTICORROSIVO. UTILIZACAO DE REVOLVER ( AR-COMPRIMIDO).","M2",514.97,null,null,null,"Referência: AGETOP - 261602"]
["S",3,"S",0,1,21,5,0,0,0,0,"F","Serviço","Serviço","1.21.5.0.2.","AGETOP",260105,"REMOCAO DE PINTURA ANTIGA A OLEO OU ESMALTE","m2    ",318.32,null,null,null,""]
["S",3,"S",0,1,21,5,0,0,0,0,"F","Serviço","Serviço","1.21.5.0.3.","SINAPI","73924/3","PINTURA ESMALTE FOSCO, DUAS DEMAOS, SOBRE SUPERFICIE METALICA","M2",318.32,null,null,null,"Referência: AGETOP - 261503"]
[3,3,3,7,1,21,6,0,0,33,7,"F","Nível 3","Nível 3","1.21.6.","SINAPI",null,"REFORMA QUADRA COBERTA","-",null,null,null,null,""]
["S",3,"S",0,1,21,6,0,0,0,0,"F","Serviço","Serviço","1.21.6.0.1.","AGETOP",260104,"REMOCAO DE PINTURA ANTIGA A LATEX","m2    ",238.32,null,null,null,""]
["S",3,"S",0,1,21,6,0,0,0,0,"F","Serviço","Serviço","1.21.6.0.2.","SINAPI",88497,"APLICAÇÃO E LIXAMENTO DE MASSA LÁTEX EM PAREDES, DUAS DEMÃOS. AF_06/2014","M2",54.5,null,null,null,"Referência: AGETOP - 261300"]
["S",3,"S",0,1,21,6,0,0,0,0,"F","Serviço","Serviço","1.21.6.0.3.","SINAPI",88489,"APLICAÇÃO MANUAL DE PINTURA COM TINTA LÁTEX ACRÍLICA EM PAREDES, DUAS DEMÃOS. AF_06/2014","M2",181.68,null,null,null,"Referência: AGETOP - 261001"]
[{"$f":"CHOOSE(1+LOG(1+2*(ORÇAMENTO.Nivel=\"Nível 1\")+4*(ORÇAMENTO.Nivel=\"Nível 2\")+8*(ORÇAMENTO.Nivel=\"Nível 3\")+16*(ORÇAMENTO.Nivel=\"Nível 4\")+32*(ORÇAMENTO.Nivel=\"Serviço\"),2),0,1,2,3,4,\"S\")","v":"S"},{"$f":"IF(OR(C790=\"s\",C790=0),OFFSET(B790,-1,0),C790)","v":3},{"$f":"IF(OFFSET(C790,-1,0)=\"L\",1,IF(OFFSET(C790,-1,0)=1,2,IF(OR(A790=\"s\",A790=0),\"S\",IF(AND(OFFSET(C790,-1,0)=2,A790=4),3,IF(AND(OR(OFFSET(C790,-1,0)=\"s\",OFFSET(C790,-1,0)=0),A790<>\"s\",A790>OFFSET(B790,-1,0)),OFFSET(B790,-1,0),A790)))))","v":"S"},{"$f":"IF(OR(C790=\"S\",C790=0),0,IF(ISERROR(K790),J790,SMALL(J790:K790,1)))","v":0},{"$f":"IF($C790=1,OFFSET(E790,-1,0)+1,OFFSET(E790,-1,0))","v":1},{"$f":"IF($C790=1,0,IF($C790=2,OFFSET(F790,-1,0)+1,OFFSET(F790,-1,0)))","v":21},{"$f":"IF(AND($C790<=2,$C790<>0),0,IF($C790=3,OFFSET(G790,-1,0)+1,OFFSET(G790,-1,0)))","v":6},{"$f":"IF(AND($C790<=3,$C790<>0),0,IF($C790=4,OFFSET(H790,-1,0)+1,OFFSET(H790,-1,0)))","v":0},{"$f":"IF(AND($C790<=4,$C790<>0),0,IF(AND($C790=\"S\",$W790>0),OFFSET(I790,-1,0)+1,OFFSET(I790,-1,0)))","v":0},0,0,"F","Serviço","Serviço","1.21.6.0.4.","AGETOP",261703,"PINT.POLIESPORTIVA - 2 DEM.(PISOS E CIMENTADOS)","m2    ",612.72,null,null,null,""]
["S",3,"S",0,1,21,6,0,0,0,0,"F","Serviço","Serviço","1.21.6.0.5.","SINAPI",41595,"PINTURA ACRILICA DE FAIXAS DE DEMARCACAO EM QUADRA POLIESPORTIVA, 5 CM DE LARGURA","M",323,null,null,null,"Referência: AGETOP - 261700"]
["S",3,"S",0,1,21,6,0,0,0,0,"F","Serviço","Serviço","1.21.6.0.6.","SINAPI","74145/1","PINTURA ESMALTE FOSCO, DUAS DEMAOS, SOBRE SUPERFICIE METALICA, INCLUSO UMA DEMAO DE FUNDO ANTICORROSIVO. UTILIZACAO DE REVOLVER ( AR-COMPRIMIDO).","M2",25.28,null,null,null,"Referência: AGETOP - 261602"]
[3,3,3,4,1,21,7,0,0,26,4,"F","Nível 3","Nível 3","1.21.7.","SINAPI",null,"SALA DO CAF","-",null,null,null,null,""]
[{"$f":"CHOOSE(1+LOG(1+2*(ORÇAMENTO.Nivel=\"Nível 1\")+4*(ORÇAMENTO.Nivel=\"Nível 2\")+8*(ORÇAMENTO.Nivel=\"Nível 3\")+16*(ORÇAMENTO.Nivel=\"Nível 4\")+32*(ORÇAMENTO.Nivel=\"Serviço\"),2),0,1,2,3,4,\"S\")","v":"S"},{"$f":"IF(OR(C794=\"s\",C794=0),OFFSET(B794,-1,0),C794)","v":3},{"$f":"IF(OFFSET(C794,-1,0)=\"L\",1,IF(OFFSET(C794,-1,0)=1,2,IF(OR(A794=\"s\",A794=0),\"S\",IF(AND(OFFSET(C794,-1,0)=2,A794=4),3,IF(AND(OR(OFFSET(C794,-1,0)=\"s\",OFFSET(C794,-1,0)=0),A794<>\"s\",A794>OFFSET(B794,-1,0)),OFFSET(B794,-1,0),A794)))))","v":"S"},{"$f":"IF(OR(C794=\"S\",C794=0),0,IF(ISERROR(K794),J794,SMALL(J794:K794,1)))","v":0},{"$f":"IF($C794=1,OFFSET(E794,-1,0)+1,OFFSET(E794,-1,0))","v":1},{"$f":"IF($C794=1,0,IF($C794=2,OFFSET(F794,-1,0)+1,OFFSET(F794,-1,0)))","v":21},{"$f":"IF(AND($C794<=2,$C794<>0),0,IF($C794=3,OFFSET(G794,-1,0)+1,OFFSET(G794,-1,0)))","v":7},{"$f":"IF(AND($C794<=3,$C794<>0),0,IF($C794=4,OFFSET(H794,-1,0)+1,OFFSET(H794,-1,0)))","v":0},{"$f":"IF(AND($C794<=4,$C794<>0),0,IF(AND($C794=\"S\",$W794>0),OFFSET(I794,-1,0)+1,OFFSET(I794,-1,0)))","v":0},{"$f":"IF(OR($C794=\"S\",$C794=0),0,MATCH(0,OFFSET($D794,1,$C794,ROW($C$839)-ROW($C794)),0))","v":0},{"$f":"IF(OR($C794=\"S\",$C794=0),0,MATCH(OFFSET($D794,0,$C794)+1,OFFSET($D794,1,$C794,ROW($C$839)-ROW($C794)),0))","v":0},"F","Serviço","Serviço","1.21.7.0.1.","SINAPI",88497,"APLICAÇÃO E LIXAMENTO DE MASSA LÁTEX EM PAREDES, DUAS DEMÃOS. AF_06/2014","M2",9.07,null,null,null,"Referência: AGETOP - 261300"]
["S",3,"S",0,1,21,7,0,0,0,0,"F","Serviço","Serviço","1.21.7.0.2.","AGETOP",261550,"PINT.ESMALTE SINT.PAREDES - 2 DEM.C/SELADOR","m2    ",16.5,null,null,null,""]
["S",3,"S",0,1,21,7,0,0,0,0,"F","Serviço","Serviço","1.21.7.0.3.","SINAPI",88489,"APLICAÇÃO MANUAL DE PINTURA COM TINTA LÁTEX ACRÍLICA EM PAREDES, DUAS DEMÃOS. AF_06/2014","M2",13.72,null,null,null,"Referência: AGETOP - 261001"]
[3,3,3,8,1,21,8,0,0,22,8,"F","Nível 3","Nível 3","1.21.8.","SINAPI",null,"PINTURA GERAL","-",null,null,null,null,""]
["S",3,"S",0,1,21,8,0,0,0,0,"F","Serviço","Serviço","1.21.8.0.1.","AGETOP",260104,"REMOCAO DE PINTURA ANTIGA A LATEX","m2    ",1677.03,null,null,null,""]
["S",3,"S",0,1,21,8,0,0,0,0,"F","Serviço","Serviço","1.21.8.0.2.","SINAPI",88497,"APLICAÇÃO E LIXAMENTO DE MASSA LÁTEX EM PAREDES, DUAS DEMÃOS. AF_06/2014","M2",197.74,null,null,null,"Referência: AGETOP - 261300"]
["S",3,"S",0,1,21,8,0,0,0,0,"F","Serviço","Serviço","1.21.8.0.3.","SINAPI",88489,"APLICAÇÃO MANUAL DE PINTURA COM TINTA LÁTEX ACRÍLICA EM PAREDES, DUAS DEMÃOS. AF_06/2014","M2",5986.41,null,null,null,"Referência: AGETOP - 261001"]
["S",3,"S",0,1,21,8,0,0,0,0,"F","Serviço","Serviço","1.21.8.0.4.","SINAPI",88486,"APLICAÇÃO MANUAL DE PINTURA COM TINTA LÁTEX PVA EM TETO, DUAS DEMÃOS. AF_06/2014","M2",1928.33,null,null,null,"Referência: AGETOP - 261307"]
["S",3,"S",0,1,21,8,0,0,0,0,"F","Serviço","Serviço","1.21.8.0.5.","AGETOP",260105,"REMOCAO DE PINTURA ANTIGA A OLEO OU ESMALTE","m2    ",624.91999999999996,null,null,null,""]
["S",3,"S",0,1,21,8,0,0,0,0,"F","Serviço","Serviço","1.21.8.0.6.","SINAPI","73924/3","PINTURA ESMALTE FOSCO, DUAS DEMAOS, SOBRE SUPERFICIE METALICA","M2",791.66,null,null,null,"Referência: AGETOP - 261503"]
["S",3,"S",0,1,21,8,0,0,0,0,"F","Serviço","Serviço","1.21.8.0.7.","AGETOP",261620,"LETREIRO MÉDIO A GRANDE PORTE EM PAREDE FEITO A PINCEL","m2    ",7.2,null,null,null,""]
[{"$f":"CHOOSE(1+LOG(1+2*(ORÇAMENTO.Nivel=\"Nível 1\")+4*(ORÇAMENTO.Nivel=\"Nível 2\")+8*(ORÇAMENTO.Nivel=\"Nível 3\")+16*(ORÇAMENTO.Nivel=\"Nível 4\")+32*(ORÇAMENTO.Nivel=\"Serviço\"),2),0,1,2,3,4,\"S\")","v":3},{"$f":"IF(OR(C805=\"s\",C805=0),OFFSET(B805,-1,0),C805)","v":3},{"$f":"IF(OFFSET(C805,-1,0)=\"L\",1,IF(OFFSET(C805,-1,0)=1,2,IF(OR(A805=\"s\",A805=0),\"S\",IF(AND(OFFSET(C805,-1,0)=2,A805=4),3,IF(AND(OR(OFFSET(C805,-1,0)=\"s\",OFFSET(C805,-1,0)=0),A805<>\"s\",A805>OFFSET(B805,-1,0)),OFFSET(B805,-1,0),A805)))))","v":3},{"$f":"IF(OR(C805=\"S\",C805=0),0,IF(ISERROR(K805),J805,SMALL(J805:K805,1)))","v":5},{"$f":"IF($C805=1,OFFSET(E805,-1,0)+1,OFFSET(E805,-1,0))","v":1},{"$f":"IF($C805=1,0,IF($C805=2,OFFSET(F805,-1,0)+1,OFFSET(F805,-1,0)))","v":21},{"$f":"IF(AND($C805<=2,$C805<>0),0,IF($C805=3,OFFSET(G805,-1,0)+1,OFFSET(G805,-1,0)))","v":9},{"$f":"IF(AND($C805<=3,$C805<>0),0,IF($C805=4,OFFSET(H805,-1,0)+1,OFFSET(H805,-1,0)))","v":0},{"$f":"IF(AND($C805<=4,$C805<>0),0,IF(AND($C805=\"S\",$W805>0),OFFSET(I805,-1,0)+1,OFFSET(I805,-1,0)))","v":0},14,5,"F","Nível 3","Nível 3","1.21.9.","SINAPI",null,"CONSTRUÇÃO WC ACESSÍVEL","-",null,null,null,null,""]
["S",3,"S",0,1,21,9,0,0,0,0,"F","Serviço","Serviço","1.21.9.0.1.","SINAPI",88496,"APLICAÇÃO E LIXAMENTO DE MASSA LÁTEX EM TETO, DUAS DEMÃOS. AF_06/2014","M2",17.72,null,null,null,"Referência: AGETOP - 261300"]
["S",3,"S",0,1,21,9,0,0,0,0,"F","Serviço","Serviço","1.21.9.0.2.","SINAPI",88486,"APLICAÇÃO MANUAL DE PINTURA COM TINTA LÁTEX PVA EM TETO, DUAS DEMÃOS. AF_06/2014","M2",17.72,null,null,null,"Referência: AGETOP - 261307"]
["S",3,"S",0,1,21,9,0,0,0,0,"F","Serviço","Serviço","1.21.9.0.3.","AGETOP",261000,"PINTURA LATEX ACRILICA 2 DEMAOS C/SELADOR","m2    ",144.06,null,null,null,""]
["S",3,"S",0,1,21,9,0,0,0,0,"F","Serviço","Serviço","1.21.9.0.4.","SINAPI","74145/1","PINTURA ESMALTE FOSCO, DUAS DEMAOS, SOBRE SUPERFICIE METALICA, INCLUSO UMA DEMAO DE FUNDO ANTICORROSIVO. UTILIZACAO DE REVOLVER ( AR-COMPRIMIDO).","M2",28.68,null,null,null,"Referência: AGETOP - 261602"]
[3,3,3,2,1,21,10,0,0,9,2,"F","Nível 3","Nível 3","1.21.10.","SINAPI",null,"AMPLIAÇÃO DO REFEITÓRIO","-",null,null,null,null,""]
["S",3,"S",0,1,21,10,0,0,0,0,"F","Serviço","Serviço","1.21.10.0.1.","AGETOP",261611,"PINTURA  ALQUÍDICA BRILHANTE DUPLA FUNÇÃO 2 DEMÃOS = 50 MÍCRONS","m2    ",44.57,null,null,null,""]
[3,3,3,5,1,21,11,0,0,7,5,"F","Nível 3","Nível 3","1.21.11.","SINAPI",null,"REFORMA E AMPLIAÇÃO DA COZINHA","-",null,null,null,null,""]
["S",3,"S",0,1,21,11,0,0,0,0,"F","Serviço","Serviço","1.21.11.0.1.","SINAPI","74145/1","PINTURA ESMALTE FOSCO, DUAS DEMAOS, SOBRE SUPERFICIE METALICA, INCLUSO UMA DEMAO DE FUNDO ANTICORROSIVO. UTILIZACAO DE REVOLVER ( AR-COMPRIMIDO).","M2",48.4,null,null,null,"Referência: AGETOP - 261602"]
[{"$f":"CHOOSE(1+LOG(1+2*(ORÇAMENTO.Nivel=\"Nível 1\")+4*(ORÇAMENTO.Nivel=\"Nível 2\")+8*(ORÇAMENTO.Nivel=\"Nível 3\")+16*(ORÇAMENTO.Nivel=\"Nível 4\")+32*(ORÇAMENTO.Nivel=\"Serviço\"),2),0,1,2,3,4,\"S\")","v":"S"},{"$f":"IF(OR(C814=\"s\",C814=0),OFFSET(B814,-1,0),C814)","v":3},{"$f":"IF(OFFSET(C814,-1,0)=\"L\",1,IF(OFFSET(C814,-1,0)=1,2,IF(OR(A814=\"s\",A814=0),\"S\",IF(AND(OFFSET(C814,-1,0)=2,A814=4),3,IF(AND(OR(OFFSET(C814,-1,0)=\"s\",OFFSET(C814,-1,0)=0),A814<>\"s\",A814>OFFSET(B814,-1,0)),OFFSET(B814,-1,0),A814)))))","v":"S"},{"$f":"IF(OR(C814=\"S\",C814=0),0,IF(ISERROR(K814),J814,SMALL(J814:K814,1)))","v":0},{"$f":"IF($C814=1,OFFSET(E814,-1,0)+1,OFFSET(E814,-1,0))","v":1},{"$f":"IF($C814=1,0,IF($C814=2,OFFSET(F814,-1,0)+1,OFFSET(F814,-1,0)))","v":21},{"$f":"IF(AND($C814<=2,$C814<>0),0,IF($C814=3,OFFSET(G814,-1,0)+1,OFFSET(G814,-1,0)))","v":11},{"$f":"IF(AND($C814<=3,$C814<>0),0,IF($C814=4,OFFSET(H814,-1,0)+1,OFFSET(H814,-1,0)))","v":0},{"$f":"IF(AND($C814<=4,$C814<>0),0,IF(AND($C814=\"S\",$W814>0),OFFSET(I814,-1,0)+1,OFFSET(I814,-1,0)))","v":0},{"$f":"IF(OR($C814=\"S\",$C814=0),0,MATCH(0,OFFSET($D814,1,$C814,ROW($C$839)-ROW($C814)),0))","v":0},{"$f":"IF(OR($C814=\"S\",$C814=0),0,MATCH(OFFSET($D814,0,$C814)+1,OFFSET($D814,1,$C814,ROW($C$839)-ROW($C814)),0))","v":0},"F","Serviço","Serviço","1.21.11.0.2.","AGETOP",261611,"PINTURA  ALQUÍDICA BRILHANTE DUPLA FUNÇÃO 2 DEMÃOS = 50 MÍCRONS","m2    ",20,null,null,null,""]
["S",3,"S",0,1,21,11,0,0,0,0,"F","Serviço","Serviço","1.21.11.0.3.","SINAPI",88486,"APLICAÇÃO MANUAL DE PINTURA COM TINTA LÁTEX PVA EM TETO, DUAS DEMÃOS. AF_06/2014","M2",28.76,null,null,null,"Referência: AGETOP - 261307"]
["S",3,"S",0,1,21,11,0,0,0,0,"F","Serviço","Serviço","1.21.11.0.4.","AGETOP",261000,"PINTURA LATEX ACRILICA 2 DEMAOS C/SELADOR","m2    ",38.4,null,null,null,""]
[3,3,3,2,1,21,12,0,0,2,{"$error":"#N/A"},"F","Nível 3","Nível 3","1.21.12.","SINAPI",null,"INSTALAÇÃO PLATAFORMA ELEVATÓRIA","-",null,null,null,null,""]
["S",3,"S",0,1,21,12,0,0,0,0,"F","Serviço","Serviço","1.21.12.0.1.","AGETOP",260801,"PINTURA A BASE DE SILICONE 1 DEMAO","m2    ",108,null,null,null,""]
[2,2,2,20,1,22,0,0,0,20,{"$error":"#N/A"},"F","Nível 2","Nível 2","1.22.",null,null,"DIVERSOS","-",null,null,null,null,""]
[3,3,3,2,1,22,1,0,0,19,2,"F","Nível 3","Nível 3","1.22.1.","SINAPI",null,"REFORMA GERAL WC FEM","-",null,null,null,null,""]
["S",3,"S",0,1,22,1,0,0,0,0,"F","Serviço","Serviço","1.22.1.0.1.","AGETOP",271608,"BANCADA DE GRANITO C/ESPELHO","m2    ",1.46,null,null,null,""]
[3,3,3,2,1,22,2,0,0,{"$f":"IF(OR($C822=\"S\",$C822=0),0,MATCH(0,OFFSET($D822,1,$C822,ROW($C$839)-ROW($C822)),0))","v":17},{"$f":"IF(OR($C822=\"S\",$C822=0),0,MATCH(OFFSET($D822,0,$C822)+1,OFFSET($D822,1,$C822,ROW($C$839)-ROW($C822)),0))","v":2},"F","Nível 3","Nível 3","1.22.2.","SINAPI",null,"REFORMA GERAL WC MASC","-",null,null,null,null,""]
["S",3,"S",0,1,22,2,0,0,0,0,"F","Serviço","Serviço","1.22.2.0.1.","AGETOP",271608,"BANCADA DE GRANITO C/ESPELHO","m2    ",1.46,null,null,null,""]
[3,3,3,2,1,22,3,0,0,15,2,"F","Nível 3","Nível 3","1.22.3.","SINAPI",null,"LABORATÓRIO SECO","-",null,null,null,null,""]
["S",3,"S",0,1,22,3,0,0,0,0,"F","Serviço","Serviço","1.22.3.0.1.","AGETOP",271608,"BANCADA DE GRANITO C/ESPELHO","m2    ",13.3,null,null,null,""]
[3,3,3,3,1,22,4,0,0,13,3,"F","Nível 3","Nível 3","1.22.4.","SINAPI",null,"LOCAL DE SAÍDA DOS ALUNOS","-",null,null,null,null,""]
["S",3,"S",0,1,22,4,0,0,0,0,"F","Serviço","Serviço","1.22.4.0.1.","AGETOP",271417,"CANALETA CONCRETO DESEMPENADO 5 CM PD.GOINFRA","m     ",16.7,null,null,null,""]
["S",3,"S",0,1,22,4,0,0,0,0,"F","Serviço","Serviço","1.22.4.0.2.","AGETOP",270210,"PLANTIO GRAMA ESMERALDA PLACA C/ M.O. IRRIG., ADUBO,TERRA VEGETAL (O.C.) A<11.000,00M2","m2    ",139.16999999999999,null,null,null,""]
[{"$f":"CHOOSE(1+LOG(1+2*(ORÇAMENTO.Nivel=\"Nível 1\")+4*(ORÇAMENTO.Nivel=\"Nível 2\")+8*(ORÇAMENTO.Nivel=\"Nível 3\")+16*(ORÇAMENTO.Nivel=\"Nível 4\")+32*(ORÇAMENTO.Nivel=\"Serviço\"),2),0,1,2,3,4,\"S\")","v":3},{"$f":"IF(OR(C829=\"s\",C829=0),OFFSET(B829,-1,0),C829)","v":3},{"$f":"IF(OFFSET(C829,-1,0)=\"L\",1,IF(OFFSET(C829,-1,0)=1,2,IF(OR(A829=\"s\",A829=0),\"S\",IF(AND(OFFSET(C829,-1,0)=2,A829=4),3,IF(AND(OR(OFFSET(C829,-1,0)=\"s\",OFFSET(C829,-1,0)=0),A829<>\"s\",A829>OFFSET(B829,-1,0)),OFFSET(B829,-1,0),A829)))))","v":3},{"$f":"IF(OR(C829=\"S\",C829=0),0,IF(ISERROR(K829),J829,SMALL(J829:K829,1)))","v":4},{"$f":"IF($C829=1,OFFSET(E829,-1,0)+1,OFFSET(E829,-1,0))","v":1},{"$f":"IF($C829=1,0,IF($C829=2,OFFSET(F829,-1,0)+1,OFFSET(F829,-1,0)))","v":22},{"$f":"IF(AND($C829<=2,$C829<>0),0,IF($C829=3,OFFSET(G829,-1,0)+1,OFFSET(G829,-1,0)))","v":5},{"$f":"IF(AND($C829<=3,$C829<>0),0,IF($C829=4,OFFSET(H829,-1,0)+1,OFFSET(H829,-1,0)))","v":0},{"$f":"IF(AND($C829<=4,$C829<>0),0,IF(AND($C829=\"S\",$W829>0),OFFSET(I829,-1,0)+1,OFFSET(I829,-1,0)))","v":0},10,4,"F","Nível 3","Nível 3","1.22.5.","SINAPI",null,"REFORMA E AMPLIAÇÃO DA COZINHA","-",null,null,null,null,""]
["S",{"$f":"IF(OR(C830=\"s\",C830=0),OFFSET(B830,-1,0),C830)","v":3},{"$f":"IF(OFFSET(C830,-1,0)=\"L\",1,IF(OFFSET(C830,-1,0)=1,2,IF(OR(A830=\"s\",A830=0),\"S\",IF(AND(OFFSET(C830,-1,0)=2,A830=4),3,IF(AND(OR(OFFSET(C830,-1,0)=\"s\",OFFSET(C830,-1,0)=0),A830<>\"s\",A830>OFFSET(B830,-1,0)),OFFSET(B830,-1,0),A830)))))","v":"S"},{"$f":"IF(OR(C830=\"S\",C830=0),0,IF(ISERROR(K830),J830,SMALL(J830:K830,1)))","v":0},{"$f":"IF($C830=1,OFFSET(E830,-1,0)+1,OFFSET(E830,-1,0))","v":1},{"$f":"IF($C830=1,0,IF($C830=2,OFFSET(F830,-1,0)+1,OFFSET(F830,-1,0)))","v":22},{"$f":"IF(AND($C830<=2,$C830<>0),0,IF($C830=3,OFFSET(G830,-1,0)+1,OFFSET(G830,-1,0)))","v":5},{"$f":"IF(AND($C830<=3,$C830<>0),0,IF($C830=4,OFFSET(H830,-1,0)+1,OFFSET(H830,-1,0)))","v":0},{"$f":"IF(AND($C830<=4,$C830<>0),0,IF(AND($C830=\"S\",$W830>0),OFFSET(I830,-1,0)+1,OFFSET(I830,-1,0)))","v":0},0,0,"F","Serviço","Serviço","1.22.5.0.1.","AGETOP",271608,"BANCADA DE GRANITO C/ESPELHO","m2    ",4.21,null,null,null,""]
["S",3,"S",0,1,22,5,0,0,0,0,"F","Serviço","Serviço","1.22.5.0.2.","COMPOSIÇÃO","COMP 027_SEE","TELA MOSQUITEIRA EM NYLON COM ESTRUTURA DE ALUMÍNIO, COM FORNECIMENTO DE MÃO DE OBRA E INSTALAÇÃO","M2",14.28,null,null,null,""]
["S",3,"S",0,1,22,5,0,0,0,0,"F","Serviço","Serviço","1.22.5.0.3.","AGETOP",230210,"DOBRADICA C/MOLA P/PORTA/DIVISORIAS","Un    ",2,null,null,null,""]
[3,3,3,2,1,22,6,0,0,6,2,"F","Nível 3","Nível 3","1.22.6.","SINAPI",null,"INSTALAÇÃO PLATAFORMA ELEVATÓRIA","-",null,null,null,null,""]
["S",3,"S",0,1,22,6,0,0,0,0,"F","Serviço","Serviço","1.22.6.0.1.","COMPOSIÇÃO","COMP 086_SEE","ELEVADOR (PLATAFORMA VERTICAL) MODELO HERA OU EQUIVALENTE 02 PARADAS - CAPACIDADE 280KG (INSTALADO)","UN ",1,null,null,null,""]
[3,3,3,2,1,22,7,0,0,4,2,"F","Nível 3","Nível 3","1.22.7.","SINAPI",null,"ACESSIBILIDADE","-",null,null,null,null,""]
["S",3,"S",0,1,22,7,0,0,0,0,"F","Serviço","Serviço","1.22.7.0.1.","AGETOP",270210,"PLANTIO GRAMA ESMERALDA PLACA C/ M.O. IRRIG., ADUBO,TERRA VEGETAL (O.C.) A<11.000,00M2","m2    ",199.54,null,null,null,""]
[3,3,3,2,1,22,8,0,0,2,{"$error":"#N/A"},"F","Nível 3","Nível 3","1.22.8.","SINAPI",null,"OUTROS","-",null,null,null,null,""]
["S",3,"S",0,1,22,8,0,0,0,0,"F","Serviço","Serviço","1.22.8.0.1.","AGETOP",270501,"LIMPEZA FINAL DE OBRA - (OBRAS CIVIS)","m2    ",244,null,null,null,""]
[-1,null,-1,null,0,0,0,0,0,null,null,"F"]
[null,null,null,null,null,null,null,null,null,null,null,"F",null,null,null,null,null,"OBS: OS QUANTITATIVOS DE MATERIAIS  DAS INSTALAÇÕES HIDROSSANITÁRIAS, ELÉTRICAS E ESPECIAIS SÃO FORNECIDOS PELOS PROFISSIONAIS RESPONSÁVEIS PELOS RESPECTIVOS PROJETOS.",null,null,"VALOR TOTAL"]
[null,null,null,null,null,null,null,null,null,null,null,"F",null,null,null,null,null,null,null,null,"VALOR BDI (26,34%)"]
[null,null,null,null,null,null,null,null,null,null,null,"F",null,null,null,null,null,null,null,null,"TOTAL ORÇAMENTO"]
[null,null,null,null,null,null,null,null,null,null,null,"F"]
[null,null,null,null,null,null,null,null,null,null,null,"F",null,null,null,null,null,null,null,null,"CUSTO POR M2 ³"]
[null,null,null,null,null,null,null,null,null,null,null,"F",null,null,null,null,null,null,null,null,"MATERIAL S/ BDI"]
[null,null,null,null,null,null,null,null,null,null,null,"F",null,null,null,null,null,null,null,null,"MÃO DE OBRA S/ BDI"]
[null,null,null,null,null,null,null,null,null,null,null,"F"]
[null,null,null,null,null,null,null,null,null,null,null,"F",null,null,null,null,"(1) Conforme previsto pelo DECRETO Nº 7.983, DE 8 DE ABRIL DE 2013, os preços adotados são aqueles constantes dos sistemas de referência indicados. Justifica-se o uso dos preços destas composições de custos unitários devido ao seu valor ser menor à mediana de seus correspondentes na tabela SINAPI;"]
[null,null,null,null,null,null,null,null,null,null,null,"F",null,null,null,null,"(2) Optou-se pelo uso das composições de custos da AGETOP para itens não presentes na SINAPI;"]
[null,null,null,null,null,null,null,null,null,null,null,"F",null,null,null,null,"(3) Para itens da AGETOP, os vidros não estão inclusos nas esquadrias e já foram considerados os custos de contramarco para as esquadrias de alumínio;"]
[null,null,null,null,null,null,null,null,null,null,null,"F",null,null,null,null,"(4) Nos casos em que houver execução de granitina e omissão do item AGETOP 221102, considerou-se que o quantitativo para o rodapé, de altura igual a 7cm, foi incorporado na área de piso;"]
[null,null,null,null,null,null,null,null,null,null,null,"F",null,null,null,null,"(5) O custo unitário aproximado por metro quadrado é calculado dividindo-se o valor total do orçamento pela área total de construção."]
[null,null,null,null,null,null,null,null,null,null,null,"F"]
[null,null,null,null,null,null,null,null,null,null,null,"F"]
[]
[null,null,null,null,null,null,null,null,null,null,null,null,null,null,"SOMATÓRIO DE SERVIÇOS"]
[null,null,null,null,null,null,null,null,null,null,null,null,null,null,"ITEM","DESCRIÇÃO DOS SERVIÇOS",null,null,"PREÇO SEM BDI",null,null,"PREÇO COM BDI",null,"PARTICIPAÇÃO ( % )"]
[null,null,null,null,null,null,null,null,null,null,null,null,null,null,"a.","SERVIÇOS PRELIMINARES",null,null,{"$f":"SUMIF($R$19:$R$839,$P858,$W$19:$W$839)","v":0},null,null,{"$f":"ROUND(S858*(1+BDI.Taxa),2)","v":0},null,{"$f":"IFERROR(ROUND($V858*100/$W$842,2),0)","v":0}]
[null,null,null,null,null,null,null,null,null,null,null,null,null,null,"b.","TRANSPORTES",null,null,0,null,null,0,null,{"$f":"IFERROR(ROUND($V859*100/$W$842,2),0)","v":0}]
[null,null,null,null,null,null,null,null,null,null,null,null,null,null,"c.","SERVIÇO EM TERRA",null,null,0,null,null,0,null,0]
[null,null,null,null,null,null,null,null,null,null,null,null,null,null,"d.","FUNDAÇÕES E SONDAGENS",null,null,0,null,null,0,null,0]
[null,null,null,null,null,null,null,null,null,null,null,null,null,null,"e.","ESTRUTURA",null,null,0,null,null,0,null,0]
[null,null,null,null,null,null,null,null,null,null,null,null,null,null,"f.","INSTALAÇÕES ELÉTRICAS",null,null,0,null,null,0,null,0]
[null,null,null,null,null,null,null,null,null,null,null,null,null,null,"g.","INSTALAÇÕES HIDROSSANITÁRIAS",null,null,0,null,null,0,null,0]
[null,null,null,null,null,null,null,null,null,null,null,null,null,null,"h","INSTALAÇÕES ESPECIAIS",null,null,0,null,null,0,null,0]
[null,null,null,null,null,null,null,null,null,null,null,null,null,null,"i.","ALVENARIAS E DIVISÓRIAS",null,null,0,null,null,0,null,0]
[null,null,null,null,null,null,null,null,null,null,null,null,null,null,"j.","ALVENARIA AUTO-PORTANTE",null,null,0,null,null,0,null,0]
[null,null,null,null,null,null,null,null,null,null,null,null,null,null,"k.","IMPERMEABILIZAÇÃO",null,null,0,null,null,0,null,0]
[null,null,null,null,null,null,null,null,null,null,null,null,null,null,"l.","ISOLAMENTO TÉRMICO E ACÚSTICO",null,null,0,null,null,0,null,0]
[null,null,null,null,null,null,null,null,null,null,null,null,null,null,"m.","ESTRUTURA DE MADEIRA",null,null,0,null,null,0,null,0]
[null,null,null,null,null,null,null,null,null,null,null,null,null,null,"n.","ESTRUTURAS METÁLICAS",null,null,0,null,null,0,null,0]
[null,null,null,null,null,null,null,null,null,null,null,null,null,null,"o.","COBERTURAS",null,null,0,null,null,0,null,0]
[null,null,null,null,null,null,null,null,null,null,null,null,null,null,"p.","ESQUADRIAS DE MADEIRA",null,null,0,null,null,0,null,0]
[null,null,null,null,null,null,null,null,null,null,null,null,null,null,"q.","ESQUADRIAS METÁLICAS",null,null,0,null,null,{"$f":"ROUND(S874*(1+BDI.Taxa),2)","v":0},null,0]
[null,null,null,null,null,null,null,null,null,null,null,null,null,null,"r.","VIDROS",null,null,0,null,null,0,null,0]
[null,null,null,null,null,null,null,null,null,null,null,null,null,null,"s.","REVESTIMENTO DE PAREDE",null,null,0,null,null,0,null,0]
[null,null,null,null,null,null,null,null,null,null,null,null,null,null,"t.","FORROS",null,null,0,null,null,0,null,0]
[null,null,null,null,null,null,null,null,null,null,null,null,null,null,"u.","REVESTIMENTO DE PISO",null,null,0,null,null,0,null,0]
[null,null,null,null,null,null,null,null,null,null,null,null,null,null,"v.","FERRAGENS",null,null,0,null,null,0,null,0]
[null,null,null,null,null,null,null,null,null,null,null,null,null,null,"w.","MARCENARIA",null,null,0,null,null,0,null,0]
[null,null,null,null,null,null,null,null,null,null,null,null,null,null,"x.","ADMINISTRAÇÃO",null,null,0,null,null,0,null,0]
[null,null,null,null,null,null,null,null,null,null,null,null,null,null,"y.","PINTURA",null,null,0,null,null,{"$f":"ROUND(S882*(1+BDI.Taxa),2)","v":0},null,0]
[null,null,null,null,null,null,null,null,null,null,null,null,null,null,"z.","DIVERSOS",null,null,0,null,null,{"$f":"IF(S883>0,IF((SUM(V858:W882)+ROUND(S883*(1+BDI.Taxa),2))<>V885,V885-SUM(V858:W882),ROUND(S883*(1+BDI.Taxa),2)),0)","v":0},null,{"$f":"IF(S883>0,IF((SUM(X858:X882)+IFERROR(ROUND($V883*100/$W$842,2),0))<>X885,X885-SUM(X858:X882),IFERROR(ROUND($V883*100/$W$842,2),0)),0)","v":0}]
[null,null,null,null,null,null,null,null,null,null,null,null,null,null,"TOTAL GERAL DO ORÇAMENTO (R$)",null,null,null,{"$f":"SUM(S858:U883)","v":0},null,null,{"$f":"SUM(V858:W883)","v":0},null,{"$f":"SUM(X858:X883)","v":0}]
[null,null,null,null,null,null,null,null,null,null,null,null,null,null,null,null,null,null,{"$f":"$W$840","v":0},null,null,{"$f":"$W$842","v":0},null,100]
[null,null,null,null,null,null,null,null,null,null,null,null,null,null,null,null,null,null,"(TOTAL SEM BDI)",null,null,"(TOTAL COM BDI)",null,"(ARRED porcentagem)"]
[null,null,null,null,null,null,null,null,null,null,null,null,null,null,null,null,null,null,{"$f":"IF(AND(S884=S885,S884>0),\"OK\",\"ERRO\")","v":"ERRO"},null,null,{"$f":"IF(AND(V884=V885,V884>0),\"OK\",\"ERRO\")","v":"ERRO"},null,{"$f":"IF(X884=100,\"OK\",\"ERRO\")","v":"ERRO"}]
[]
[]
[null,null,null,null,null,null,null,null,null,null,null,null,null,null,"RESUMO GERAL DO ORÇAMENTO"]
[null,null,null,null,null,null,null,null,null,null,null,null,null,null,"ITEM","DESCRIÇÃO DOS SERVIÇOS",null,null,"PREÇO SEM BDI",null,null,"PREÇO COM BDI",null,"PARTICIPAÇÃO ( % )"]
[null,null,null,null,null,null,null,null,null,null,null,null,null,null,"1.",{"$f":"IFERROR(VLOOKUP(O892,$O$19:$W$839,4,FALSE),\"\")","v":"REFORMA"},null,null,{"$f":"IF(P893=\"\",$S$913-SUM(OFFSET($S$891:S891,0,0,COUNTA($S$891:S891),1)),SUMIF($R$19:$R$839,$P892,$W$19:$W$839))","v":0},null,null,{"$f":"IF(P893=\"\",$V$913-SUM(OFFSET($V$891:V891,0,0,COUNTA($V$891:V891),1)),ROUND(S892*(1+BDI.Taxa),2))","v":0},null,{"$f":"IF(P893=\"\",$X$913-SUM(OFFSET($X$891:X891,0,0,COUNTA($X$891:X891),1)),ROUND(V892*100/ORÇAMENTO.Totalorçamento,2))","v":100}]
[null,null,null,null,null,null,null,null,null,null,null,null,null,null,"2.","",null,null,{"$f":"IF(P894=\"\",$S$913-SUM(OFFSET($S$891:S892,0,0,COUNTA($S$891:S892),1)),SUMIF($R$19:$R$839,$P893,$W$19:$W$839))","v":0},null,null,{"$f":"IF(P894=\"\",$V$913-SUM(OFFSET($V$891:V892,0,0,COUNTA($V$891:V892),1)),ROUND(S893*(1+BDI.Taxa),2))","v":0},null,{"$f":"IF(P894=\"\",$X$913-SUM(OFFSET($X$891:X892,0,0,COUNTA($X$891:X892),1)),ROUND(V893*100/ORÇAMENTO.Totalorçamento,2))","v":0}]
[null,null,null,null,null,null,null,null,null,null,null,null,null,null,"3.","",null,null,{"$f":"IF(P895=\"\",$S$913-SUM(OFFSET($S$891:S893,0,0,COUNTA($S$891:S893),1)),SUMIF($R$19:$R$839,$P894,$W$19:$W$839))","v":0},null,null,{"$f":"IF(P895=\"\",$V$913-SUM(OFFSET($V$891:V893,0,0,COUNTA($V$891:V893),1)),ROUND(S894*(1+BDI.Taxa),2))","v":0},null,{"$f":"IF(P895=\"\",$X$913-SUM(OFFSET($X$891:X893,0,0,COUNTA($X$891:X893),1)),ROUND(V894*100/ORÇAMENTO.Totalorçamento,2))","v":0}]
[null,null,null,null,null,null,null,null,null,null,null,null,null,null,"4.","",null,null,{"$f":"IF(P896=\"\",$S$913-SUM(OFFSET($S$891:S894,0,0,COUNTA($S$891:S894),1)),SUMIF($R$19:$R$839,$P895,$W$19:$W$839))","v":0},null,null,{"$f":"IF(P896=\"\",$V$913-SUM(OFFSET($V$891:V894,0,0,COUNTA($V$891:V894),1)),ROUND(S895*(1+BDI.Taxa),2))","v":0},null,{"$f":"IF(P896=\"\",$X$913-SUM(OFFSET($X$891:X894,0,0,COUNTA($X$891:X894),1)),ROUND(V895*100/ORÇAMENTO.Totalorçamento,2))","v":0}]
[null,null,null,null,null,null,null,null,null,null,null,null,null,null,"5.","",null,null,{"$f":"IF(P897=\"\",$S$913-SUM(OFFSET($S$891:S895,0,0,COUNTA($S$891:S895),1)),SUMIF($R$19:$R$839,$P896,$W$19:$W$839))","v":0},null,null,{"$f":"IF(P897=\"\",$V$913-SUM(OFFSET($V$891:V895,0,0,COUNTA($V$891:V895),1)),ROUND(S896*(1+BDI.Taxa),2))","v":0},null,{"$f":"IF(P897=\"\",$X$913-SUM(OFFSET($X$891:X895,0,0,COUNTA($X$891:X895),1)),ROUND(V896*100/ORÇAMENTO.Totalorçamento,2))","v":0}]
[null,null,null,null,null,null,null,null,null,null,null,null,null,null,"6.","",null,null,{"$f":"IF(P898=\"\",$S$913-SUM(OFFSET($S$891:S896,0,0,COUNTA($S$891:S896),1)),SUMIF($R$19:$R$839,$P897,$W$19:$W$839))","v":0},null,null,{"$f":"IF(P898=\"\",$V$913-SUM(OFFSET($V$891:V896,0,0,COUNTA($V$891:V896),1)),ROUND(S897*(1+BDI.Taxa),2))","v":0},null,{"$f":"IF(P898=\"\",$X$913-SUM(OFFSET($X$891:X896,0,0,COUNTA($X$891:X896),1)),ROUND(V897*100/ORÇAMENTO.Totalorçamento,2))","v":0}]
[null,null,null,null,null,null,null,null,null,null,null,null,null,null,"7.","",null,null,{"$f":"IF(P899=\"\",$S$913-SUM(OFFSET($S$891:S897,0,0,COUNTA($S$891:S897),1)),SUMIF($R$19:$R$839,$P898,$W$19:$W$839))","v":0},null,null,{"$f":"IF(P899=\"\",$V$913-SUM(OFFSET($V$891:V897,0,0,COUNTA($V$891:V897),1)),ROUND(S898*(1+BDI.Taxa),2))","v":0},null,{"$f":"IF(P899=\"\",$X$913-SUM(OFFSET($X$891:X897,0,0,COUNTA($X$891:X897),1)),ROUND(V898*100/ORÇAMENTO.Totalorçamento,2))","v":0}]
[null,null,null,null,null,null,null,null,null,null,null,null,null,null,"8.","",null,null,{"$f":"IF(P900=\"\",$S$913-SUM(OFFSET($S$891:S898,0,0,COUNTA($S$891:S898),1)),SUMIF($R$19:$R$839,$P899,$W$19:$W$839))","v":0},null,null,{"$f":"IF(P900=\"\",$V$913-SUM(OFFSET($V$891:V898,0,0,COUNTA($V$891:V898),1)),ROUND(S899*(1+BDI.Taxa),2))","v":0},null,{"$f":"IF(P900=\"\",$X$913-SUM(OFFSET($X$891:X898,0,0,COUNTA($X$891:X898),1)),ROUND(V899*100/ORÇAMENTO.Totalorçamento,2))","v":0}]
[null,null,null,null,null,null,null,null,null,null,null,null,null,null,"9.","",null,null,{"$f":"IF(P901=\"\",$S$913-SUM(OFFSET($S$891:S899,0,0,COUNTA($S$891:S899),1)),SUMIF($R$19:$R$839,$P900,$W$19:$W$839))","v":0},null,null,{"$f":"IF(P901=\"\",$V$913-SUM(OFFSET($V$891:V899,0,0,COUNTA($V$891:V899),1)),ROUND(S900*(1+BDI.Taxa),2))","v":0},null,{"$f":"IF(P901=\"\",$X$913-SUM(OFFSET($X$891:X899,0,0,COUNTA($X$891:X899),1)),ROUND(V900*100/ORÇAMENTO.Totalorçamento,2))","v":0}]
[null,null,null,null,null,null,null,null,null,null,null,null,null,null,"10.","",null,null,{"$f":"IF(P902=\"\",$S$913-SUM(OFFSET($S$891:S900,0,0,COUNTA($S$891:S900),1)),SUMIF($R$19:$R$839,$P901,$W$19:$W$839))","v":0},null,null,{"$f":"IF(P902=\"\",$V$913-SUM(OFFSET($V$891:V900,0,0,COUNTA($V$891:V900),1)),ROUND(S901*(1+BDI.Taxa),2))","v":0},null,{"$f":"IF(P902=\"\",$X$913-SUM(OFFSET($X$891:X900,0,0,COUNTA($X$891:X900),1)),ROUND(V901*100/ORÇAMENTO.Totalorçamento,2))","v":0}]
[null,null,null,null,null,null,null,null,null,null,null,null,null,null,"11.","",null,null,{"$f":"IF(P903=\"\",$S$913-SUM(OFFSET($S$891:S901,0,0,COUNTA($S$891:S901),1)),SUMIF($R$19:$R$839,$P902,$W$19:$W$839))","v":0},null,null,{"$f":"IF(P903=\"\",$V$913-SUM(OFFSET($V$891:V901,0,0,COUNTA($V$891:V901),1)),ROUND(S902*(1+BDI.Taxa),2))","v":0},null,{"$f":"IF(P903=\"\",$X$913-SUM(OFFSET($X$891:X901,0,0,COUNTA($X$891:X901),1)),ROUND(V902*100/ORÇAMENTO.Totalorçamento,2))","v":0}]
[null,null,null,null,null,null,null,null,null,null,null,null,null,null,"12.","",null,null,{"$f":"IF(P904=\"\",$S$913-SUM(OFFSET($S$891:S902,0,0,COUNTA($S$891:S902),1)),SUMIF($R$19:$R$839,$P903,$W$19:$W$839))","v":0},null,null,{"$f":"IF(P904=\"\",$V$913-SUM(OFFSET($V$891:V902,0,0,COUNTA($V$891:V902),1)),ROUND(S903*(1+BDI.Taxa),2))","v":0},null,{"$f":"IF(P904=\"\",$X$913-SUM(OFFSET($X$891:X902,0,0,COUNTA($X$891:X902),1)),ROUND(V903*100/ORÇAMENTO.Totalorçamento,2))","v":0}]
[null,null,null,null,null,null,null,null,null,null,null,null,null,null,"13.","",null,null,{"$f":"IF(P905=\"\",$S$913-SUM(OFFSET($S$891:S903,0,0,COUNTA($S$891:S903),1)),SUMIF($R$19:$R$839,$P904,$W$19:$W$839))","v":0},null,null,{"$f":"IF(P905=\"\",$V$913-SUM(OFFSET($V$891:V903,0,0,COUNTA($V$891:V903),1)),ROUND(S904*(1+BDI.Taxa),2))","v":0},null,{"$f":"IF(P905=\"\",$X$913-SUM(OFFSET($X$891:X903,0,0,COUNTA($X$891:X903),1)),ROUND(V904*100/ORÇAMENTO.Totalorçamento,2))","v":0}]
[null,null,null,null,null,null,null,null,null,null,null,null,null,null,"14.","",null,null,{"$f":"IF(P906=\"\",$S$913-SUM(OFFSET($S$891:S904,0,0,COUNTA($S$891:S904),1)),SUMIF($R$19:$R$839,$P905,$W$19:$W$839))","v":0},null,null,{"$f":"IF(P906=\"\",$V$913-SUM(OFFSET($V$891:V904,0,0,COUNTA($V$891:V904),1)),ROUND(S905*(1+BDI.Taxa),2))","v":0},null,{"$f":"IF(P906=\"\",$X$913-SUM(OFFSET($X$891:X904,0,0,COUNTA($X$891:X904),1)),ROUND(V905*100/ORÇAMENTO.Totalorçamento,2))","v":0}]
[null,null,null,null,null,null,null,null,null,null,null,null,null,null,"15.","",null,null,{"$f":"IF(P907=\"\",$S$913-SUM(OFFSET($S$891:S905,0,0,COUNTA($S$891:S905),1)),SUMIF($R$19:$R$839,$P906,$W$19:$W$839))","v":0},null,null,{"$f":"IF(P907=\"\",$V$913-SUM(OFFSET($V$891:V905,0,0,COUNTA($V$891:V905),1)),ROUND(S906*(1+BDI.Taxa),2))","v":0},null,{"$f":"IF(P907=\"\",$X$913-SUM(OFFSET($X$891:X905,0,0,COUNTA($X$891:X905),1)),ROUND(V906*100/ORÇAMENTO.Totalorçamento,2))","v":0}]
[null,null,null,null,null,null,null,null,null,null,null,null,null,null,"16.","",null,null,{"$f":"IF(P908=\"\",$S$913-SUM(OFFSET($S$891:S906,0,0,COUNTA($S$891:S906),1)),SUMIF($R$19:$R$839,$P907,$W$19:$W$839))","v":0},null,null,{"$f":"IF(P908=\"\",$V$913-SUM(OFFSET($V$891:V906,0,0,COUNTA($V$891:V906),1)),ROUND(S907*(1+BDI.Taxa),2))","v":0},null,{"$f":"IF(P908=\"\",$X$913-SUM(OFFSET($X$891:X906,0,0,COUNTA($X$891:X906),1)),ROUND(V907*100/ORÇAMENTO.Totalorçamento,2))","v":0}]
[null,null,null,null,null,null,null,null,null,null,null,null,null,null,"17.","",null,null,{"$f":"IF(P909=\"\",$S$913-SUM(OFFSET($S$891:S907,0,0,COUNTA($S$891:S907),1)),SUMIF($R$19:$R$839,$P908,$W$19:$W$839))","v":0},null,null,{"$f":"IF(P909=\"\",$V$913-SUM(OFFSET($V$891:V907,0,0,COUNTA($V$891:V907),1)),ROUND(S908*(1+BDI.Taxa),2))","v":0},null,{"$f":"IF(P909=\"\",$X$913-SUM(OFFSET($X$891:X907,0,0,COUNTA($X$891:X907),1)),ROUND(V908*100/ORÇAMENTO.Totalorçamento,2))","v":0}]
[null,null,null,null,null,null,null,null,null,null,null,null,null,null,"18.","",null,null,{"$f":"IF(P910=\"\",$S$913-SUM(OFFSET($S$891:S908,0,0,COUNTA($S$891:S908),1)),SUMIF($R$19:$R$839,$P909,$W$19:$W$839))","v":0},null,null,{"$f":"IF(P910=\"\",$V$913-SUM(OFFSET($V$891:V908,0,0,COUNTA($V$891:V908),1)),ROUND(S909*(1+BDI.Taxa),2))","v":0},null,{"$f":"IF(P910=\"\",$X$913-SUM(OFFSET($X$891:X908,0,0,COUNTA($X$891:X908),1)),ROUND(V909*100/ORÇAMENTO.Totalorçamento,2))","v":0}]
[null,null,null,null,null,null,null,null,null,null,null,null,null,null,"19.","",null,null,{"$f":"IF(P911=\"\",$S$913-SUM(OFFSET($S$891:S909,0,0,COUNTA($S$891:S909),1)),SUMIF($R$19:$R$839,$P910,$W$19:$W$839))","v":0},null,null,{"$f":"IF(P911=\"\",$V$913-SUM(OFFSET($V$891:V909,0,0,COUNTA($V$891:V909),1)),ROUND(S910*(1+BDI.Taxa),2))","v":0},null,{"$f":"IF(P911=\"\",$X$913-SUM(OFFSET($X$891:X909,0,0,COUNTA($X$891:X909),1)),ROUND(V910*100/ORÇAMENTO.Totalorçamento,2))","v":0}]
[null,null,null,null,null,null,null,null,null,null,null,null,null,null,"20.","",null,null,{"$f":"IF(P912=\"\",$S$913-SUM(OFFSET($S$891:S910,0,0,COUNTA($S$891:S910),1)),SUMIF($R$19:$R$839,$P911,$W$19:$W$839))","v":0},null,null,{"$f":"IF(P912=\"\",$V$913-SUM(OFFSET($V$891:V910,0,0,COUNTA($V$891:V910),1)),ROUND(S911*(1+BDI.Taxa),2))","v":0},null,{"$f":"IF(P912=\"\",$X$913-SUM(OFFSET($X$891:X910,0,0,COUNTA($X$891:X910),1)),ROUND(V911*100/ORÇAMENTO.Totalorçamento,2))","v":0}]
[null,null,null,null,null,null,null,null,null,null,null,null,null,null,"TOTAL GERAL DO ORÇAMENTO (R$)",null,null,null,{"$f":"SUM(S892:U911)","v":0},null,null,{"$f":"SUM(V892:W911)","v":0},null,{"$f":"SUM(X892:X911)","v":100}]
[null,null,null,null,null,null,null,null,null,null,null,null,null,null,null,null,null,null,{"$f":"$W$840","v":0},null,null,{"$f":"$W$842","v":0},null,100]
[null,null,null,null,null,null,null,null,null,null,null,null,null,null,null,null,null,null,"(TOTAL SEM BDI)",null,null,"(TOTAL COM BDI)",null,"(ARRED porcentagem)"]
[null,null,null,null,null,null,null,null,null,null,null,null,null,null,null,null,null,null,{"$f":"IF(AND(S912=S913,S912>0),\"OK\",\"ERRO\")","v":"ERRO"},null,null,{"$f":"IF(AND(V912=V913,V912>0),\"OK\",\"ERRO\")","v":"ERRO"},null,{"$f":"IF(AND(X912=100,S892<>0),\"OK\",\"ERRO\")","v":"ERRO"}]

{"sheet":"Resumo ","index":1,"n_rows":39,"n_cols":9,"rows_kept":39,"cut":false,"hidden":false,"merged":[[13,0,14,0],[34,2,34,3],[35,2,35,3],[31,2,31,3],[32,2,32,3],[33,2,33,3],[28,2,28,3],[29,2,29,3],[30,2,30,3],[0,1,0,8],[36,1,36,5],[2,1,2,5],[3,1,3,5],[5,1,5,5],[6,1,6,5],[8,1,8,5],[9,1,9,5],[11,3,11,5],[12,3,12,5],[10,1,10,8],[11,6,11,8],[12,6,12,8],[25,2,25,3],[21,2,21,3],[22,2,22,3],[6,6,6,8],[7,1,7,8],[8,6,8,8],[9,6,9,8],[13,1,13,8],[1,1,1,8],[2,6,2,8],[3,6,3,8],[4,1,4,8],[5,6,5,8],[42,3,42,7],[11,1,11,2],[12,1,12,2],[15,2,15,3],[16,2,16,3],[14,1,14,8],[17,2,17,3],[23,2,23,3],[18,2,18,3],[19,2,19,3],[20,2,20,3],[41,3,41,7],[24,2,24,3],[26,2,26,3],[27,2,27,3],[38,1,38,8]]}
[]
[]
[null,"UNIDADE ESCOLAR",null,null,null,null,"CÓDIGO INEP"]
[null,{"$f":"Orçamento!$O$4","v":"CENTRO DE ENSINO EM PERÍODO INTEGRAL PROFESSOR SÉRGIO FAYAD GENEROSO"},null,null,null,null,{"$f":"Orçamento!V4","v":52046176}]
[]
[null,"OBRA",null,null,null,null,"CIDADE"]
[null,{"$f":"Orçamento!$O$7","v":"REFORMA E AMPLIAÇÃO"},null,null,null,null,{"$f":"Orçamento!$V$7","v":"FORMOSA"}]
[]
[null,"ENDEREÇO",null,null,null,null,"CRE"]
[null,{"$f":"Orçamento!$R$10","v":"AV.MAESTRO JOAO L. DO ESPIRITO SANTO S/N, FORMOSINHA, CEP:73813-120"},null,null,null,null,{"$f":"Orçamento!$O$10","v":"FORMOSA"}]
[]
[null,"REFERÊNCIA",null,"DATA",null,null,"ÁREA TOTAL CONSTRUÍDA (M²)"]
[null,{"$f":"CONCATENATE(\"AGETOP E SINAPI - \",Orçamento!$T$10)","v":"AGETOP E SINAPI - DESONERADA"},null,{"$f":"Orçamento!$S$7","v":"2020-07-07"},null,null,{"$f":"Orçamento!$V$13","v":3313.58}]
["FILTRO"]
[null,"RESUMO GERAL DO ORÇAMENTO"]
["↓","ITEM","DESCRIÇÃO DOS SERVIÇOS",null,"UNID","QUANT","PREÇO SEM BDI","PREÇO COM BDI","PARTICIP. (%)"]
[{"$f":"IF(H17>0,\"F\",\"\")","v":""},"1.",{"$f":"Orçamento!$P892","v":"REFORMA"},null,{"$f":"IF(C17<>\"\",\"UN\",\"\")","v":"UN"},{"$f":"IF(C17<>\"\",1,\"\")","v":1},{"$f":"IFERROR(Orçamento!S892,\"-\")","v":0},{"$f":"IFERROR(Orçamento!V892,\"\")","v":0},{"$f":"Orçamento!X892","v":100}]
[{"$f":"IF(H18>0,\"F\",\"\")","v":""},"2.",{"$f":"Orçamento!$P893","v":""},null,{"$f":"IF(C18<>\"\",\"UN\",\"\")","v":""},{"$f":"IF(C18<>\"\",1,\"\")","v":""},{"$f":"IFERROR(Orçamento!S893,\"-\")","v":0},{"$f":"IFERROR(Orçamento!V893,\"\")","v":0},{"$f":"Orçamento!X893","v":0}]
[{"$f":"IF(H19>0,\"F\",\"\")","v":""},"3.",{"$f":"Orçamento!$P894","v":""},null,"","",{"$f":"IFERROR(Orçamento!S894,\"-\")","v":0},{"$f":"IFERROR(Orçamento!V894,\"\")","v":0},{"$f":"Orçamento!X894","v":0}]
["","4.",{"$f":"Orçamento!$P895","v":""},null,"","",{"$f":"IFERROR(Orçamento!S895,\"-\")","v":0},{"$f":"IFERROR(Orçamento!V895,\"\")","v":0},{"$f":"Orçamento!X895","v":0}]
["","5.",{"$f":"Orçamento!$P896","v":""},null,"","",{"$f":"IFERROR(Orçamento!S896,\"-\")","v":0},{"$f":"IFERROR(Orçamento!V896,\"\")","v":0},{"$f":"Orçamento!X896","v":0}]
["","6.",{"$f":"Orçamento!$P897","v":""},null,"","",{"$f":"IFERROR(Orçamento!S897,\"-\")","v":0},{"$f":"IFERROR(Orçamento!V897,\"\")","v":0},{"$f":"Orçamento!X897","v":0}]
["","7.",{"$f":"Orçamento!$P898","v":""},null,"","",{"$f":"IFERROR(Orçamento!S898,\"-\")","v":0},{"$f":"IFERROR(Orçamento!V898,\"\")","v":0},{"$f":"Orçamento!X898","v":0}]
["","8.",{"$f":"Orçamento!$P899","v":""},null,"","",{"$f":"IFERROR(Orçamento!S899,\"-\")","v":0},{"$f":"IFERROR(Orçamento!V899,\"\")","v":0},{"$f":"Orçamento!X899","v":0}]
["","9.",{"$f":"Orçamento!$P900","v":""},null,"","",{"$f":"IFERROR(Orçamento!S900,\"-\")","v":0},{"$f":"IFERROR(Orçamento!V900,\"\")","v":0},{"$f":"Orçamento!X900","v":0}]
["","10.",{"$f":"Orçamento!$P901","v":""},null,"","",{"$f":"IFERROR(Orçamento!S901,\"-\")","v":0},{"$f":"IFERROR(Orçamento!V901,\"\")","v":0},{"$f":"Orçamento!X901","v":0}]
["","11.",{"$f":"Orçamento!$P902","v":""},null,"","",{"$f":"IFERROR(Orçamento!S902,\"-\")","v":0},{"$f":"IFERROR(Orçamento!V902,\"\")","v":0},{"$f":"Orçamento!X902","v":0}]
["","12.",{"$f":"Orçamento!$P903","v":""},null,"","",{"$f":"IFERROR(Orçamento!S903,\"-\")","v":0},{"$f":"IFERROR(Orçamento!V903,\"\")","v":0},{"$f":"Orçamento!X903","v":0}]
["","13.",{"$f":"Orçamento!$P904","v":""},null,"","",{"$f":"IFERROR(Orçamento!S904,\"-\")","v":0},{"$f":"IFERROR(Orçamento!V904,\"\")","v":0},{"$f":"Orçamento!X904","v":0}]
["","14.",{"$f":"Orçamento!$P905","v":""},null,"","",{"$f":"IFERROR(Orçamento!S905,\"-\")","v":0},{"$f":"IFERROR(Orçamento!V905,\"\")","v":0},{"$f":"Orçamento!X905","v":0}]
["","15.",{"$f":"Orçamento!$P906","v":""},null,"","",{"$f":"IFERROR(Orçamento!S906,\"-\")","v":0},{"$f":"IFERROR(Orçamento!V906,\"\")","v":0},{"$f":"Orçamento!X906","v":0}]
["","16.",{"$f":"Orçamento!$P907","v":""},null,"","",{"$f":"IFERROR(Orçamento!S907,\"-\")","v":0},{"$f":"IFERROR(Orçamento!V907,\"\")","v":0},{"$f":"Orçamento!X907","v":0}]
["","17.",{"$f":"Orçamento!$P908","v":""},null,"","",{"$f":"IFERROR(Orçamento!S908,\"-\")","v":0},{"$f":"IFERROR(Orçamento!V908,\"\")","v":0},{"$f":"Orçamento!X908","v":0}]
["","18.",{"$f":"Orçamento!$P909","v":""},null,"","",{"$f":"IFERROR(Orçamento!S909,\"-\")","v":0},{"$f":"IFERROR(Orçamento!V909,\"\")","v":0},{"$f":"Orçamento!X909","v":0}]
["","19.",{"$f":"Orçamento!$P910","v":""},null,"","",{"$f":"IFERROR(Orçamento!S910,\"-\")","v":0},{"$f":"IFERROR(Orçamento!V910,\"\")","v":0},{"$f":"Orçamento!X910","v":0}]
["","20.",{"$f":"Orçamento!$P911","v":""},null,"","",{"$f":"IFERROR(Orçamento!S911,\"-\")","v":0},{"$f":"IFERROR(Orçamento!V911,\"\")","v":0},{"$f":"Orçamento!X911","v":0}]
["F","TOTAL GERAL DO ORÇAMENTO (R$)",null,null,null,null,{"$f":"SUM(G17:G36)","v":0},{"$f":"SUM(H17:H36)","v":0},{"$f":"SUM(I17:I36)","v":100}]
["F"]
["F"]

{"sheet":"Somatório","index":2,"n_rows":45,"n_cols":6,"rows_kept":45,"cut":false,"hidden":false,"merged":[[13,0,14,0],[42,1,42,2],[44,1,44,5],[47,3,47,5],[48,3,48,5],[13,1,13,5],[9,1,9,3],[9,4,9,5],[11,1,11,2],[11,4,11,5],[12,1,12,2],[12,4,12,5],[0,1,0,5],[14,1,14,5],[2,1,2,3],[2,4,2,5],[3,1,3,3],[3,4,3,5],[5,1,5,3],[5,4,5,5],[6,1,6,3],[6,4,6,5],[8,1,8,3],[8,4,8,5],[1,1,1,5],[4,1,4,5],[7,1,7,5],[10,1,10,5]]}
[]
[]
[null,"UNIDADE ESCOLAR",null,null,"CÓDIGO INEP"]
[null,{"$f":"Orçamento!$O$4","v":"CENTRO DE ENSINO EM PERÍODO INTEGRAL PROFESSOR SÉRGIO FAYAD GENEROSO"},null,null,{"$f":"Orçamento!V4","v":52046176}]
[]
[null,"OBRA",null,null,"CIDADE"]
[null,{"$f":"Orçamento!$O$7","v":"REFORMA E AMPLIAÇÃO"},null,null,{"$f":"Orçamento!$V$7","v":"FORMOSA"}]
[]
[null,"ENDEREÇO",null,null,"CRE"]
[null,{"$f":"Orçamento!$R$10","v":"AV.MAESTRO JOAO L. DO ESPIRITO SANTO S/N, FORMOSINHA, CEP:73813-120"},null,null,{"$f":"Orçamento!$O$10","v":"FORMOSA"}]
[]
[null,"REFERÊNCIA",null,"DATA","ÁREA TOTAL CONSTRUÍDA (M²)"]
[null,{"$f":"CONCATENATE(\"AGETOP E SINAPI - \",Orçamento!$T$10)","v":"AGETOP E SINAPI - DESONERADA"},null,{"$f":"Orçamento!$S$7","v":"2020-07-07"},{"$f":"Orçamento!$V$13","v":3313.58}]
["FILTRO"]
[null,"SOMATÓRIO DE SERVIÇOS"]
["↓","ITEM","DESCRIÇÃO DOS SERVIÇOS","PREÇO SEM BDI (R$)","PREÇO COM BDI (R$)","PARTIC.  ( % )"]
[{"$f":"IF(D17>0,\"F\",\"\")","v":""},"a.",{"$f":"Orçamento!P858","v":"SERVIÇOS PRELIMINARES"},{"$f":"Orçamento!S858","v":0},{"$f":"Orçamento!V858","v":0},{"$f":"Orçamento!X858","v":0}]
[{"$f":"IF(D18>0,\"F\",\"\")","v":""},"b.",{"$f":"Orçamento!P859","v":"TRANSPORTES"},{"$f":"Orçamento!S859","v":0},{"$f":"Orçamento!V859","v":0},{"$f":"Orçamento!X859","v":0}]
["","c.",{"$f":"Orçamento!P860","v":"SERVIÇO EM TERRA"},{"$f":"Orçamento!S860","v":0},{"$f":"Orçamento!V860","v":0},{"$f":"Orçamento!X860","v":0}]
["","d.",{"$f":"Orçamento!P861","v":"FUNDAÇÕES E SONDAGENS"},{"$f":"Orçamento!S861","v":0},{"$f":"Orçamento!V861","v":0},{"$f":"Orçamento!X861","v":0}]
["","e.",{"$f":"Orçamento!P862","v":"ESTRUTURA"},{"$f":"Orçamento!S862","v":0},{"$f":"Orçamento!V862","v":0},{"$f":"Orçamento!X862","v":0}]
["","f.",{"$f":"Orçamento!P863","v":"INSTALAÇÕES ELÉTRICAS"},{"$f":"Orçamento!S863","v":0},{"$f":"Orçamento!V863","v":0},{"$f":"Orçamento!X863","v":0}]
["","g.",{"$f":"Orçamento!P864","v":"INSTALAÇÕES HIDROSSANITÁRIAS"},{"$f":"Orçamento!S864","v":0},{"$f":"Orçamento!V864","v":0},{"$f":"Orçamento!X864","v":0}]
["","h.",{"$f":"Orçamento!P865","v":"INSTALAÇÕES ESPECIAIS"},{"$f":"Orçamento!S865","v":0},{"$f":"Orçamento!V865","v":0},{"$f":"Orçamento!X865","v":0}]
["","i.",{"$f":"Orçamento!P866","v":"ALVENARIAS E DIVISÓRIAS"},{"$f":"Orçamento!S866","v":0},{"$f":"Orçamento!V866","v":0},{"$f":"Orçamento!X866","v":0}]
["","j.",{"$f":"Orçamento!P867","v":"ALVENARIA AUTO-PORTANTE"},{"$f":"Orçamento!S867","v":0},{"$f":"Orçamento!V867","v":0},{"$f":"Orçamento!X867","v":0}]
["","k.",{"$f":"Orçamento!P868","v":"IMPERMEABILIZAÇÃO"},{"$f":"Orçamento!S868","v":0},{"$f":"Orçamento!V868","v":0},{"$f":"Orçamento!X868","v":0}]
["","l.",{"$f":"Orçamento!P869","v":"ISOLAMENTO TÉRMICO E ACÚSTICO"},{"$f":"Orçamento!S869","v":0},{"$f":"Orçamento!V869","v":0},{"$f":"Orçamento!X869","v":0}]
["","m.",{"$f":"Orçamento!P870","v":"ESTRUTURA DE MADEIRA"},{"$f":"Orçamento!S870","v":0},{"$f":"Orçamento!V870","v":0},{"$f":"Orçamento!X870","v":0}]
["","n.",{"$f":"Orçamento!P871","v":"ESTRUTURAS METÁLICAS"},{"$f":"Orçamento!S871","v":0},{"$f":"Orçamento!V871","v":0},{"$f":"Orçamento!X871","v":0}]
["","o.",{"$f":"Orçamento!P872","v":"COBERTURAS"},{"$f":"Orçamento!S872","v":0},{"$f":"Orçamento!V872","v":0},{"$f":"Orçamento!X872","v":0}]
["","p.",{"$f":"Orçamento!P873","v":"ESQUADRIAS DE MADEIRA"},{"$f":"Orçamento!S873","v":0},{"$f":"Orçamento!V873","v":0},{"$f":"Orçamento!X873","v":0}]
["","q.",{"$f":"Orçamento!P874","v":"ESQUADRIAS METÁLICAS"},{"$f":"Orçamento!S874","v":0},{"$f":"Orçamento!V874","v":0},{"$f":"Orçamento!X874","v":0}]
["","r.",{"$f":"Orçamento!P875","v":"VIDROS"},{"$f":"Orçamento!S875","v":0},{"$f":"Orçamento!V875","v":0},{"$f":"Orçamento!X875","v":0}]
["","s.",{"$f":"Orçamento!P876","v":"REVESTIMENTO DE PAREDE"},{"$f":"Orçamento!S876","v":0},{"$f":"Orçamento!V876","v":0},{"$f":"Orçamento!X876","v":0}]
["","t.",{"$f":"Orçamento!P877","v":"FORROS"},{"$f":"Orçamento!S877","v":0},{"$f":"Orçamento!V877","v":0},{"$f":"Orçamento!X877","v":0}]
["","u.",{"$f":"Orçamento!P878","v":"REVESTIMENTO DE PISO"},{"$f":"Orçamento!S878","v":0},{"$f":"Orçamento!V878","v":0},{"$f":"Orçamento!X878","v":0}]
["","v.",{"$f":"Orçamento!P879","v":"FERRAGENS"},{"$f":"Orçamento!S879","v":0},{"$f":"Orçamento!V879","v":0},{"$f":"Orçamento!X879","v":0}]
["","w.",{"$f":"Orçamento!P880","v":"MARCENARIA"},{"$f":"Orçamento!S880","v":0},{"$f":"Orçamento!V880","v":0},{"$f":"Orçamento!X880","v":0}]
["","x.",{"$f":"Orçamento!P881","v":"ADMINISTRAÇÃO"},{"$f":"Orçamento!S881","v":0},{"$f":"Orçamento!V881","v":0},{"$f":"Orçamento!X881","v":0}]
["","y.",{"$f":"Orçamento!P882","v":"PINTURA"},{"$f":"Orçamento!S882","v":0},{"$f":"Orçamento!V882","v":0},{"$f":"Orçamento!X882","v":0}]
["","z.",{"$f":"Orçamento!P883","v":"DIVERSOS"},{"$f":"Orçamento!S883","v":0},{"$f":"Orçamento!V883","v":0},{"$f":"Orçamento!X883","v":0}]
["F","TOTAL GERAL DO ORÇAMENTO",null,{"$f":"SUM(D17:D42)","v":0},{"$f":"SUM(E17:E42)","v":0},{"$f":"SUM(F17:F42)","v":0}]
[]
[null,"(*) Para itens da AGETOP, os vidros não estão inclusos nas esquadrias e já foram considerados os custos de contramarco para as esquadrias de alumínio;"]

{"sheet":"Cronog_120_Dias","index":3,"n_rows":99,"n_cols":24,"rows_kept":99,"cut":false,"hidden":false,"merged":[[0,1,0,21],[1,1,1,21],[2,1,2,7],[2,8,2,21],[3,1,3,7],[3,8,3,21],[8,1,8,7],[8,8,8,21],[9,0,11,0],[9,1,9,7],[9,8,9,21],[10,1,10,21],[11,1,11,21],[4,1,4,21],[5,1,5,7],[5,8,5,21],[6,1,6,7],[6,8,6,21],[7,1,7,21],[12,21,13,21],[13,1,13,2],[13,5,13,8],[13,9,13,12],[13,13,13,16],[13,17,13,20],[12,0,13,0],[12,3,13,3],[12,5,12,8],[12,9,12,12],[12,13,12,16],[12,17,12,20],[17,1,19,2],[17,3,19,3],[17,4,19,4],[17,5,17,8],[17,9,17,12],[14,1,16,2],[14,3,16,3],[14,4,16,4],[14,5,14,8],[14,9,14,12],[17,13,17,16],[17,17,17,20],[19,5,19,8],[19,9,19,12],[19,13,19,16],[19,17,19,20],[14,17,14,20],[16,5,16,8],[16,9,16,12],[16,13,16,16],[16,17,16,20],[14,13,14,16],[23,1,25,2],[23,3,25,3],[23,4,25,4],[23,5,23,8],[23,9,23,12],[20,1,22,2],[20,3,22,3],[20,4,22,4],[20,5,20,8],[20,9,20,12],[23,13,23,16],[23,17,23,20],[25,5,25,8],[25,9,25,12],[25,13,25,16],[25,17,25,20],[20,17,20,20],[22,5,22,8],[22,9,22,12],[22,13,22,16],[22,17,22,20],[20,13,20,16],[29,1,31,2],[29,3,31,3],[29,4,31,4],[29,5,29,8],[29,9,29,12],[26,1,28,2],[26,3,28,3],[26,4,28,4],[26,5,26,8],[26,9,26,12],[29,13,29,16],[29,17,29,20],[31,5,31,8],[31,9,31,12],[31,13,31,16],[31,17,31,20],[26,17,26,20],[28,5,28,8],[28,9,28,12],[28,13,28,16],[28,17,28,20],[26,13,26,16],[35,1,37,2],[35,3,37,3],[35,4,37,4],[35,5,35,8],[35,9,35,12],[32,1,34,2],[32,3,34,3],[32,4,34,4],[32,5,32,8],[32,9,32,12],[35,13,35,16],[35,17,35,20],[37,5,37,8],[37,9,37,12],[37,13,37,16],[37,17,37,20],[32,17,32,20],[34,5,34,8],[34,9,34,12],[34,13,34,16],[34,17,34,20],[32,13,32,16],[41,1,43,2],[41,3,43,3],[41,4,43,4],[41,5,41,8],[41,9,41,12],[38,1,40,2],[38,3,40,3],[38,4,40,4],[38,5,38,8],[38,9,38,12],[41,13,41,16],[41,17,41,20],[43,5,43,8],[43,9,43,12],[43,13,43,16],[43,17,43,20],[38,17,38,20],[40,5,40,8],[40,9,40,12],[40,13,40,16],[40,17,40,20],[38,13,38,16],[47,1,49,2],[47,3,49,3],[47,4,49,4],[47,5,47,8],[47,9,47,12],[44,1,46,2],[44,3,46,3],[44,4,46,4],[44,5,44,8],[44,9,44,12],[47,13,47,16],[47,17,47,20],[49,5,49,8],[49,9,49,12],[49,13,49,16],[49,17,49,20],[44,17,44,20],[46,5,46,8],[46,9,46,12],[46,13,46,16],[46,17,46,20],[44,13,44,16],[53,1,55,2],[53,3,55,3],[53,4,55,4],[53,5,53,8],[53,9,53,12],[50,1,52,2],[50,3,52,3],[50,4,52,4],[50,5,50,8],[50,9,50,12],[53,13,53,16],[53,17,53,20],[55,5,55,8],[55,9,55,12],[55,13,55,16],[55,17,55,20],[50,17,50,20],[52,5,52,8],[52,9,52,12],[52,13,52,16],[52,17,52,20],[50,13,50,16],[59,1,61,2],[59,3,61,3],[59,4,61,4],[59,5,59,8],[59,9,59,12],[56,1,58,2],[56,3,58,3],[56,4,58,4],[56,5,56,8],[56,9,56,12],[59,13,59,16],[59,17,59,20],[61,5,61,8],[61,9,61,12],[61,13,61,16],[61,17,61,20],[56,17,56,20],[58,5,58,8],[58,9,58,12],[58,13,58,16],[58,17,58,20],[56,13,56,16],[65,1,67,2],[65,3,67,3],[65,4,67,4],[65,5,65,8],[65,9,65,12],[62,1,64,2],[62,3,64,3],[62,4,64,4],[62,5,62,8],[62,9,62,12],[65,13,65,16],[65,17,65,20],[67,5,67,8],[67,9,67,12],[67,13,67,16],[67,17,67,20],[62,17,62,20],[64,5,64,8],[64,9,64,12],[64,13,64,16],[64,17,64,20],[62,13,62,16],[71,1,73,2],[71,3,73,3],[71,4,73,4],[71,5,71,8],[71,9,71,12],[68,1,70,2],[68,3,70,3],[68,4,70,4],[68,5,68,8],[68,9,68,12],[71,13,71,16],[71,17,71,20],[73,5,73,8],[73,9,73,12],[73,13,73,16],[73,17,73,20],[68,17,68,20],[70,5,70,8],[70,9,70,12],[70,13,70,16],[70,17,70,20],[68,13,68,16],[77,1,79,2],[77,3,79,3],[77,4,79,4],[77,5,77,8],[77,9,77,12],[74,1,76,2],[74,3,76,3],[74,4,76,4],[74,5,74,8],[74,9,74,12],[77,13,77,16],[77,17,77,20],[79,5,79,8],[79,9,79,12],[79,13,79,16],[79,17,79,20],[74,17,74,20],[76,5,76,8],[76,9,76,12],[76,13,76,16],[76,17,76,20],[74,13,74,16],[83,1,85,2],[83,3,85,3],[83,4,85,4],[83,5,83,8],[83,9,83,12],[80,1,82,2],[80,3,82,3],[80,4,82,4],[80,5,80,8],[80,9,80,12],[83,13,83,16],[83,17,83,20],[85,5,85,8],[85,9,85,12],[85,13,85,16],[85,17,85,20],[80,17,80,20],[82,5,82,8],[82,9,82,12],[82,13,82,16],[82,17,82,20],[80,13,80,16],[89,1,91,2],[89,3,91,3],[89,4,91,4],[89,5,89,8],[89,9,89,12],[86,1,88,2],[86,3,88,3],[86,4,88,4],[86,5,86,8],[86,9,86,12],[89,13,89,16],[89,17,89,20],[91,5,91,8],[91,9,91,12],[91,13,91,16],[91,17,91,20],[86,17,86,20],[88,5,88,8],[88,9,88,12],[88,13,88,16],[88,17,88,20],[86,13,86,16],[92,1,92,2],[92,5,92,8],[92,9,92,12],[92,13,92,16],[92,17,92,20],[93,1,93,2],[93,5,93,8],[93,9,93,12],[93,13,93,16],[93,17,93,20],[97,1,97,4],[98,1,98,21],[94,1,94,2],[94,5,94,8],[94,9,94,12],[94,13,94,16],[94,17,94,20],[95,1,95,2],[95,5,95,8],[95,9,95,12],[95,13,95,16],[95,17,95,20]]}
[]
[]
[null,"UNIDADE ESCOLAR",null,null,null,null,null,null,"PRAZO"]
[null,{"$f":"Orçamento!O4","v":"CENTRO DE ENSINO EM PERÍODO INTEGRAL PROFESSOR SÉRGIO FAYAD GENEROSO"},null,null,null,null,null,null,"120 DIAS CORRIDOS"]
[]
[null,"OBRA",null,null,null,null,null,null,"DATA"]
[null,{"$f":"Orçamento!O7","v":"REFORMA E AMPLIAÇÃO"},null,null,null,null,null,null,{"$f":"Orçamento!S7","v":"2020-07-07"}]
[]
[null,"LOCAL",null,null,null,null,null,null,"ÁREA TOTAL CONSTRUÍDA (M²)"]
["FILTRO",{"$f":"Orçamento!V7","v":"FORMOSA"},null,null,null,null,null,null,{"$f":"Orçamento!V13","v":3313.58}]
[]
[null,"CRONOGRAMA - FÍSICO FINANCEIRO"]
["↓","CUSTO TOTAL:",{"$f":"D93","v":0},"VALOR","Dias:",30,null,null,null,60,null,null,null,90,null,null,null,120,null,null,null,"TOTAL"]
[null,"DESCRIÇÃO DOS SERVIÇOS",null,null,"%","1ª PARCELA",null,null,null,"2ª PARCELA",null,null,null,"3ª PARCELA",null,null,null,"4ª PARCELA"]
[{"$f":"IF(D15>0,\"F\",\"\")","v":""},"SERVIÇOS PRELIMINARES",null,{"$f":"Orçamento!V858","v":0},{"$f":"Orçamento!X858","v":0},{"$f":"ROUND(F17*$D$15,2)","v":0},null,null,null,{"$f":"ROUND(J17*$D$15,2)","v":0},null,null,null,{"$f":"ROUND(N17*$D$15,2)","v":0},null,null,null,{"$f":"ROUND(R17*$D$15,2)","v":0},null,null,null,{"$f":"SUM(F15:U15)","v":0},null,{"$f":"IF(D15=V15,\"OK\",\"ERRO\")","v":"OK"}]
[{"$f":"IF(A15=\"F\",A15,\"\")","v":""}]
[{"$f":"IF(A16=\"F\",A16,\"\")","v":""},null,null,null,null,1,null,null,null,0,null,null,null,0,null,null,null,{"$f":"100%-(SUM(F17:Q17))","v":0},null,null,null,{"$f":"IFERROR(E15/100,\"\")","v":0},null,{"$f":"IF(E15=V17*100,\"OK\",\"ERRO\")","v":"OK"}]
[{"$f":"IF(D18>0,\"F\",\"\")","v":""},"TRANSPORTES",null,{"$f":"Orçamento!V859","v":0},{"$f":"Orçamento!X859","v":0},{"$f":"ROUND(F20*$D$18,2)","v":0},null,null,null,{"$f":"ROUND(J20*$D$18,2)","v":0},null,null,null,{"$f":"ROUND(N20*$D$18,2)","v":0},null,null,null,{"$f":"ROUND(R20*$D$18,2)","v":0},null,null,null,{"$f":"SUM(F18:U18)","v":0},null,{"$f":"IF(D18=V18,\"OK\",\"ERRO\")","v":"OK"}]
[{"$f":"IF(A18=\"F\",A18,\"\")","v":""}]
[{"$f":"IF(A19=\"F\",A19,\"\")","v":""},null,null,null,null,0.26,null,null,null,0.26,null,null,null,0.26,null,null,null,{"$f":"100%-(SUM(F20:Q20))","v":0.21999999999999997},null,null,null,{"$f":"IFERROR(E18/100,\"\")","v":0},null,{"$f":"IF(E18=V20*100,\"OK\",\"ERRO\")","v":"OK"}]
[{"$f":"IF(D21>0,\"F\",\"\")","v":""},"SERVIÇO EM TERRA",null,{"$f":"Orçamento!V860","v":0},{"$f":"Orçamento!X860","v":0},{"$f":"ROUND(F23*$D$21,2)","v":0},null,null,null,{"$f":"ROUND(J23*$D$21,2)","v":0},null,null,null,{"$f":"ROUND(N23*$D$21,2)","v":0},null,null,null,{"$f":"ROUND(R23*$D$21,2)","v":0},null,null,null,{"$f":"SUM(F21:U21)","v":0},null,{"$f":"IF(D21=V21,\"OK\",\"ERRO\")","v":"OK"}]
[{"$f":"IF(A21=\"F\",A21,\"\")","v":""}]
[{"$f":"IF(A22=\"F\",A22,\"\")","v":""},null,null,null,null,1,null,null,null,0,null,null,null,0,null,null,null,{"$f":"100%-(SUM(F23:Q23))","v":0},null,null,null,{"$f":"IFERROR(E21/100,\"\")","v":0},null,{"$f":"IF(E21=V23*100,\"OK\",\"ERRO\")","v":"OK"}]
[{"$f":"IF(D24>0,\"F\",\"\")","v":""},"FUNDAÇÕES E SONDAGENS",null,{"$f":"Orçamento!V861","v":0},{"$f":"Orçamento!X861","v":0},{"$f":"ROUND(F26*$D$24,2)","v":0},null,null,null,{"$f":"ROUND(J26*$D$24,2)","v":0},null,null,null,{"$f":"ROUND(N26*$D$24,2)","v":0},null,null,null,{"$f":"ROUND(R26*$D$24,2)","v":0},null,null,null,{"$f":"SUM(F24:U24)","v":0},null,{"$f":"IF(D24=V24,\"OK\",\"ERRO\")","v":"OK"}]
[{"$f":"IF(A24=\"F\",A24,\"\")","v":""}]
[{"$f":"IF(A25=\"F\",A25,\"\")","v":""},null,null,null,null,1,null,null,null,0,null,null,null,null,null,null,null,{"$f":"100%-(SUM(F26:Q26))","v":0},null,null,null,{"$f":"IFERROR(E24/100,\"\")","v":0},null,{"$f":"IF(E24=V26*100,\"OK\",\"ERRO\")","v":"OK"}]
[{"$f":"IF(D27>0,\"F\",\"\")","v":""},"ESTRUTURA",null,{"$f":"Orçamento!V862","v":0},{"$f":"Orçamento!X862","v":0},{"$f":"ROUND(F29*$D$27,2)","v":0},null,null,null,{"$f":"ROUND(J29*$D$27,2)","v":0},null,null,null,{"$f":"ROUND(N29*$D$27,2)","v":0},null,null,null,{"$f":"ROUND(R29*$D$27,2)","v":0},null,null,null,{"$f":"SUM(F27:U27)","v":0},null,{"$f":"IF(D27=V27,\"OK\",\"ERRO\")","v":"OK"}]
[{"$f":"IF(A27=\"F\",A27,\"\")","v":""}]
[{"$f":"IF(A28=\"F\",A28,\"\")","v":""},null,null,null,null,0.4,null,null,null,0.6,null,null,null,0,null,null,null,{"$f":"100%-(SUM(F29:Q29))","v":0},null,null,null,{"$f":"IFERROR(E27/100,\"\")","v":0},null,{"$f":"IF(E27=V29*100,\"OK\",\"ERRO\")","v":"OK"}]
[{"$f":"IF(D30>0,\"F\",\"\")","v":""},"INST.ELET/TELEFÔNICA/CABEAMENTO ESTRUTURADO",null,{"$f":"Orçamento!V863","v":0},{"$f":"Orçamento!X863","v":0},{"$f":"ROUND(F32*$D$30,2)","v":0},null,null,null,{"$f":"ROUND(J32*$D$30,2)","v":0},null,null,null,{"$f":"ROUND(N32*$D$30,2)","v":0},null,null,null,{"$f":"ROUND(R32*$D$30,2)","v":0},null,null,null,{"$f":"SUM(F30:U30)","v":0},null,{"$f":"IF(D30=V30,\"OK\",\"ERRO\")","v":"OK"}]
[{"$f":"IF(A30=\"F\",A30,\"\")","v":""}]
[{"$f":"IF(A31=\"F\",A31,\"\")","v":""},null,null,null,null,null,null,null,null,0.75,null,null,null,0.25,null,null,null,{"$f":"100%-(SUM(F32:Q32))","v":0},null,null,null,{"$f":"IFERROR(E30/100,\"\")","v":0},null,{"$f":"IF(E30=V32*100,\"OK\",\"ERRO\")","v":"OK"}]
[{"$f":"IF(D33>0,\"F\",\"\")","v":""},"INSTALAÇÕES HIDROSSANITÁRIAS",null,{"$f":"Orçamento!V864","v":0},{"$f":"Orçamento!X864","v":0},{"$f":"ROUND(F35*$D$33,2)","v":0},null,null,null,{"$f":"ROUND(J35*$D$33,2)","v":0},null,null,null,{"$f":"ROUND(N35*$D$33,2)","v":0},null,null,null,{"$f":"ROUND(R35*$D$33,2)","v":0},null,null,null,{"$f":"SUM(F33:U33)","v":0},null,{"$f":"IF(D33=V33,\"OK\",\"ERRO\")","v":"OK"}]
[{"$f":"IF(A33=\"F\",A33,\"\")","v":""}]
[{"$f":"IF(A34=\"F\",A34,\"\")","v":""},null,null,null,null,null,null,null,null,0.75,null,null,null,0.25,null,null,null,{"$f":"100%-(SUM(F35:Q35))","v":0},null,null,null,{"$f":"IFERROR(E33/100,\"\")","v":0},null,{"$f":"IF(E33=V35*100,\"OK\",\"ERRO\")","v":"OK"}]
[{"$f":"IF(D36>0,\"F\",\"\")","v":""},"INSTALAÇÕES ESPECIAIS",null,{"$f":"Orçamento!V865","v":0},{"$f":"Orçamento!X865","v":0},{"$f":"ROUND(F38*$D$36,2)","v":0},null,null,null,{"$f":"ROUND(J38*$D$36,2)","v":0},null,null,null,{"$f":"ROUND(N38*$D$36,2)","v":0},null,null,null,{"$f":"ROUND(R38*$D$36,2)","v":0},null,null,null,{"$f":"SUM(F36:U36)","v":0},null,{"$f":"IF(D36=V36,\"OK\",\"ERRO\")","v":"OK"}]
[{"$f":"IF(A36=\"F\",A36,\"\")","v":""}]
[{"$f":"IF(A37=\"F\",A37,\"\")","v":""},null,null,null,null,null,null,null,null,0.63,null,null,null,0.37,null,null,null,{"$f":"100%-(SUM(F38:Q38))","v":0},null,null,null,{"$f":"IFERROR(E36/100,\"\")","v":0},null,{"$f":"IF(E36=V38*100,\"OK\",\"ERRO\")","v":"OK"}]
[{"$f":"IF(D39>0,\"F\",\"\")","v":""},"ALVENARIA E DIVISÓRIAS",null,{"$f":"Orçamento!V866","v":0},{"$f":"Orçamento!X866","v":0},{"$f":"ROUND(F41*$D$39,2)","v":0},null,null,null,{"$f":"ROUND(J41*$D$39,2)","v":0},null,null,null,{"$f":"ROUND(N41*$D$39,2)","v":0},null,null,null,{"$f":"ROUND(R41*$D$39,2)","v":0},null,null,null,{"$f":"SUM(F39:U39)","v":0},null,{"$f":"IF(D39=V39,\"OK\",\"ERRO\")","v":"OK"}]
[{"$f":"IF(A39=\"F\",A39,\"\")","v":""}]
[{"$f":"IF(A40=\"F\",A40,\"\")","v":""},null,null,null,null,null,null,null,null,0.63,null,null,null,0.37,null,null,null,{"$f":"100%-(SUM(F41:Q41))","v":0},null,null,null,{"$f":"IFERROR(E39/100,\"\")","v":0},null,{"$f":"IF(E39=V41*100,\"OK\",\"ERRO\")","v":"OK"}]
[{"$f":"IF(D42>0,\"F\",\"\")","v":""},"ALVENARIA AUTO-PORTANTE",null,{"$f":"Orçamento!V867","v":0},{"$f":"Orçamento!X867","v":0},{"$f":"ROUND(F44*$D$42,2)","v":0},null,null,null,{"$f":"ROUND(J44*$D$42,2)","v":0},null,null,null,{"$f":"ROUND(N44*$D$42,2)","v":0},null,null,null,{"$f":"ROUND(R44*$D$42,2)","v":0},null,null,null,{"$f":"SUM(F42:U42)","v":0},null,{"$f":"IF(D42=V42,\"OK\",\"ERRO\")","v":"OK"}]
[{"$f":"IF(A42=\"F\",A42,\"\")","v":""}]
[{"$f":"IF(A43=\"F\",A43,\"\")","v":""},null,null,null,null,null,null,null,null,0.63,null,null,null,0.37,null,null,null,{"$f":"100%-(SUM(F44:Q44))","v":0},null,null,null,{"$f":"IFERROR(E42/100,\"\")","v":0},null,{"$f":"IF(E42=V44*100,\"OK\",\"ERRO\")","v":"OK"}]
[{"$f":"IF(D45>0,\"F\",\"\")","v":""},"IMPERMEABILIZAÇÃO",null,{"$f":"Orçamento!V868","v":0},{"$f":"Orçamento!X868","v":0},{"$f":"ROUND(F47*$D$45,2)","v":0},null,null,null,{"$f":"ROUND(J47*$D$45,2)","v":0},null,null,null,{"$f":"ROUND(N47*$D$45,2)-0.01","v":-0.01},null,null,null,{"$f":"ROUND(R47*$D$45,2)","v":0},null,null,null,{"$f":"SUM(F45:U45)","v":-0.01},null,{"$f":"IF(D45=V45,\"OK\",\"ERRO\")","v":"ERRO"}]
[{"$f":"IF(A45=\"F\",A45,\"\")","v":""}]
[{"$f":"IF(A46=\"F\",A46,\"\")","v":""},null,null,null,null,0.35,null,null,null,0.35,null,null,null,0.3,null,null,null,{"$f":"100%-(SUM(F47:Q47))","v":0},null,null,null,{"$f":"IFERROR(E45/100,\"\")","v":0},null,{"$f":"IF(E45=V47*100,\"OK\",\"ERRO\")","v":"OK"}]
[{"$f":"IF(D48>0,\"F\",\"\")","v":""},"ISOLAMENTO TÉRMICO E ACÚSTICO",null,{"$f":"Orçamento!V869","v":0},{"$f":"Orçamento!X869","v":0},{"$f":"ROUND(F50*$D$48,2)","v":0},null,null,null,{"$f":"ROUND(J50*$D$48,2)","v":0},null,null,null,{"$f":"ROUND(N50*$D$48,2)","v":0},null,null,null,{"$f":"ROUND(R50*$D$48,2)","v":0},null,null,null,{"$f":"SUM(F48:U48)","v":0},null,{"$f":"IF(D48=V48,\"OK\",\"ERRO\")","v":"OK"}]
[{"$f":"IF(A48=\"F\",A48,\"\")","v":""}]
[{"$f":"IF(A49=\"F\",A49,\"\")","v":""},null,null,null,null,null,null,null,null,0.55000000000000004,null,null,null,0.4,null,null,null,{"$f":"100%-(SUM(F50:Q50))","v":4.9999999999999933E-2},null,null,null,{"$f":"IFERROR(E48/100,\"\")","v":0},null,{"$f":"IF(E48=V50*100,\"OK\",\"ERRO\")","v":"OK"}]
[{"$f":"IF(D51>0,\"F\",\"\")","v":""},"ESTRUTURA DE MADEIRA",null,{"$f":"Orçamento!V870","v":0},{"$f":"Orçamento!X870","v":0},{"$f":"ROUND(F53*$D$51,2)","v":0},null,null,null,{"$f":"ROUND(J53*$D$51,2)","v":0},null,null,null,{"$f":"ROUND(N53*$D$51,2)","v":0},null,null,null,{"$f":"ROUND(R53*$D$51,2)","v":0},null,null,null,{"$f":"SUM(F51:U51)","v":0},null,{"$f":"IF(D51=V51,\"OK\",\"ERRO\")","v":"OK"}]
[{"$f":"IF(A51=\"F\",A51,\"\")","v":""}]
[{"$f":"IF(A52=\"F\",A52,\"\")","v":""},null,null,null,null,null,null,null,null,0.35,null,null,null,0.65,null,null,null,{"$f":"100%-(SUM(F53:Q53))","v":0},null,null,null,{"$f":"IFERROR(E51/100,\"\")","v":0},null,{"$f":"IF(E51=V53*100,\"OK\",\"ERRO\")","v":"OK"}]
[{"$f":"IF(D54>0,\"F\",\"\")","v":""},"ESTRUTURA METÁLICA",null,{"$f":"Orçamento!V871","v":0},{"$f":"Orçamento!X871","v":0},{"$f":"ROUND(F56*$D$54,2)","v":0},null,null,null,{"$f":"ROUND(J56*$D$54,2)","v":0},null,null,null,{"$f":"ROUND(N56*$D$54,2)","v":0},null,null,null,{"$f":"ROUND(R56*$D$54,2)","v":0},null,null,null,{"$f":"SUM(F54:U54)","v":0},null,{"$f":"IF(D54=V54,\"OK\",\"ERRO\")","v":"OK"}]
[{"$f":"IF(A54=\"F\",A54,\"\")","v":""}]
[{"$f":"IF(A55=\"F\",A55,\"\")","v":""},null,null,null,null,null,null,null,null,0.35,null,null,null,0.65,null,null,null,{"$f":"100%-(SUM(F56:Q56))","v":0},null,null,null,{"$f":"IFERROR(E54/100,\"\")","v":0},null,{"$f":"IF(E54=V56*100,\"OK\",\"ERRO\")","v":"OK"}]
[{"$f":"IF(D57>0,\"F\",\"\")","v":""},"COBERTURAS",null,{"$f":"Orçamento!V872","v":0},{"$f":"Orçamento!X872","v":0},{"$f":"ROUND(F59*$D$57,2)","v":0},null,null,null,{"$f":"ROUND(J59*$D$57,2)","v":0},null,null,null,{"$f":"ROUND(N59*$D$57,2)","v":0},null,null,null,{"$f":"ROUND(R59*$D$57,2)","v":0},null,null,null,{"$f":"SUM(F57:U57)","v":0},null,{"$f":"IF(D57=V57,\"OK\",\"ERRO\")","v":"OK"}]
[{"$f":"IF(A57=\"F\",A57,\"\")","v":""}]
[{"$f":"IF(A58=\"F\",A58,\"\")","v":""},null,null,null,null,null,null,null,null,null,null,null,null,0.55000000000000004,null,null,null,{"$f":"100%-(SUM(F59:Q59))","v":0.44999999999999996},null,null,null,{"$f":"IFERROR(E57/100,\"\")","v":0},null,{"$f":"IF(E57=V59*100,\"OK\",\"ERRO\")","v":"OK"}]
[{"$f":"IF(D60>0,\"F\",\"\")","v":""},"ESQUADRIAS DE MADEIRA",null,{"$f":"Orçamento!V873","v":0},{"$f":"Orçamento!X873","v":0},{"$f":"ROUND(F62*$D$60,2)","v":0},null,null,null,{"$f":"ROUND(J62*$D$60,2)","v":0},null,null,null,{"$f":"ROUND(N62*$D$60,2)","v":0},null,null,null,{"$f":"ROUND(R62*$D$60,2)","v":0},null,null,null,{"$f":"SUM(F60:U60)","v":0},null,{"$f":"IF(D60=V60,\"OK\",\"ERRO\")","v":"OK"}]
[{"$f":"IF(A60=\"F\",A60,\"\")","v":""}]
[{"$f":"IF(A61=\"F\",A61,\"\")","v":""},null,null,null,null,null,null,null,null,null,null,null,null,0.55000000000000004,null,null,null,{"$f":"100%-(SUM(F62:Q62))","v":0.44999999999999996},null,null,null,{"$f":"IFERROR(E60/100,\"\")","v":0},null,{"$f":"IF(E60=V62*100,\"OK\",\"ERRO\")","v":"OK"}]
[{"$f":"IF(D63>0,\"F\",\"\")","v":""},"ESQUADRIAS METÁLICAS",null,{"$f":"Orçamento!V874","v":0},{"$f":"Orçamento!X874","v":0},{"$f":"ROUND(F65*$D$63,2)","v":0},null,null,null,{"$f":"ROUND(J65*$D$63,2)","v":0},null,null,null,{"$f":"ROUND(N65*$D$63,2)","v":0},null,null,null,{"$f":"ROUND(R65*$D$63,2)","v":0},null,null,null,{"$f":"SUM(F63:U63)","v":0},null,{"$f":"IF(D63=V63,\"OK\",\"ERRO\")","v":"OK"}]
[{"$f":"IF(A63=\"F\",A63,\"\")","v":""}]
[{"$f":"IF(A64=\"F\",A64,\"\")","v":""},null,null,null,null,null,null,null,null,null,null,null,null,0.55000000000000004,null,null,null,{"$f":"100%-(SUM(F65:Q65))","v":0.44999999999999996},null,null,null,{"$f":"IFERROR(E63/100,\"\")","v":0},null,{"$f":"IF(E63=V65*100,\"OK\",\"ERRO\")","v":"OK"}]
[{"$f":"IF(D66>0,\"F\",\"\")","v":""},"VIDROS",null,{"$f":"Orçamento!V875","v":0},{"$f":"Orçamento!X875","v":0},{"$f":"ROUND(F68*$D$66,2)","v":0},null,null,null,{"$f":"ROUND(J68*$D$66,2)","v":0},null,null,null,{"$f":"ROUND(N68*$D$66,2)","v":0},null,null,null,{"$f":"ROUND(R68*$D$66,2)","v":0},null,null,null,{"$f":"SUM(F66:U66)","v":0},null,{"$f":"IF(D66=V66,\"OK\",\"ERRO\")","v":"OK"}]
[{"$f":"IF(A66=\"F\",A66,\"\")","v":""}]
[{"$f":"IF(A67=\"F\",A67,\"\")","v":""},null,null,null,null,null,null,null,null,null,null,null,null,0,null,null,null,1,null,null,null,{"$f":"IFERROR(E66/100,\"\")","v":0},null,{"$f":"IF(E66=V68*100,\"OK\",\"ERRO\")","v":"OK"}]
[{"$f":"IF(D69>0,\"F\",\"\")","v":""},"REVESTIMENTO DE PAREDE",null,{"$f":"Orçamento!V876","v":0},{"$f":"Orçamento!X876","v":0},{"$f":"ROUND(F71*$D$69,2)","v":0},null,null,null,{"$f":"ROUND(J71*$D$69,2)","v":0},null,null,null,{"$f":"ROUND(N71*$D$69,2)","v":0},null,null,null,{"$f":"ROUND(R71*$D$69,2)","v":0},null,null,null,{"$f":"SUM(F69:U69)","v":0},null,{"$f":"IF(D69=V69,\"OK\",\"ERRO\")","v":"OK"}]
[{"$f":"IF(A69=\"F\",A69,\"\")","v":""}]
[{"$f":"IF(A70=\"F\",A70,\"\")","v":""},null,null,null,null,null,null,null,null,null,null,null,null,1,null,null,null,{"$f":"100%-(SUM(F71:Q71))","v":0},null,null,null,{"$f":"IFERROR(E69/100,\"\")","v":0},null,{"$f":"IF(E69=V71*100,\"OK\",\"ERRO\")","v":"OK"}]
[{"$f":"IF(D72>0,\"F\",\"\")","v":""},"FORROS",null,{"$f":"Orçamento!V877","v":0},{"$f":"Orçamento!X877","v":0},{"$f":"ROUND(F74*$D$72,2)","v":0},null,null,null,{"$f":"ROUND(J74*$D$72,2)","v":0},null,null,null,{"$f":"ROUND(N74*$D$72,2)","v":0},null,null,null,{"$f":"ROUND(R74*$D$72,2)","v":0},null,null,null,{"$f":"SUM(F72:U72)","v":0},null,{"$f":"IF(D72=V72,\"OK\",\"ERRO\")","v":"OK"}]
[{"$f":"IF(A72=\"F\",A72,\"\")","v":""}]
[{"$f":"IF(A73=\"F\",A73,\"\")","v":""},null,null,null,null,null,null,null,null,null,null,null,null,0.4,null,null,null,{"$f":"100%-(SUM(F74:Q74))","v":0.6},null,null,null,{"$f":"IFERROR(E72/100,\"\")","v":0},null,{"$f":"IF(E72=V74*100,\"OK\",\"ERRO\")","v":"OK"}]
[{"$f":"IF(D75>0,\"F\",\"\")","v":""},"REVESTIMENTO DE PISO",null,{"$f":"Orçamento!V878","v":0},{"$f":"Orçamento!X878","v":0},{"$f":"ROUND(F77*$D$75,2)","v":0},null,null,null,{"$f":"ROUND(J77*$D$75,2)","v":0},null,null,null,{"$f":"ROUND(N77*$D$75,2)","v":0},null,null,null,{"$f":"ROUND(R77*$D$75,2)","v":0},null,null,null,{"$f":"SUM(F75:U75)","v":0},null,{"$f":"IF(D75=V75,\"OK\",\"ERRO\")","v":"OK"}]
[{"$f":"IF(A75=\"F\",A75,\"\")","v":""}]
[{"$f":"IF(A76=\"F\",A76,\"\")","v":""},null,null,null,null,null,null,null,null,null,null,null,null,0.4,null,null,null,{"$f":"100%-(SUM(F77:Q77))","v":0.6},null,null,null,{"$f":"IFERROR(E75/100,\"\")","v":0},null,{"$f":"IF(E75=V77*100,\"OK\",\"ERRO\")","v":"OK"}]
[{"$f":"IF(D78>0,\"F\",\"\")","v":""},"FERRAGENS",null,{"$f":"Orçamento!V879","v":0},{"$f":"Orçamento!X879","v":0},{"$f":"ROUND(F80*$D$78,2)","v":0},null,null,null,{"$f":"ROUND(J80*$D$78,2)","v":0},null,null,null,{"$f":"ROUND(N80*$D$78,2)","v":0},null,null,null,{"$f":"ROUND(R80*$D$78,2)","v":0},null,null,null,{"$f":"SUM(F78:U78)","v":0},null,{"$f":"IF(D78=V78,\"OK\",\"ERRO\")","v":"OK"}]
[{"$f":"IF(A78=\"F\",A78,\"\")","v":""}]
[{"$f":"IF(A79=\"F\",A79,\"\")","v":""},null,null,null,null,null,null,null,null,null,null,null,null,null,null,null,null,{"$f":"100%-(SUM(F80:Q80))","v":1},null,null,null,{"$f":"IFERROR(E78/100,\"\")","v":0},null,{"$f":"IF(E78=V80*100,\"OK\",\"ERRO\")","v":"OK"}]
[{"$f":"IF(D81>0,\"F\",\"\")","v":""},"MARCENARIA",null,{"$f":"Orçamento!V880","v":0},{"$f":"Orçamento!X880","v":0},{"$f":"ROUND(F83*$D$81,2)","v":0},null,null,null,{"$f":"ROUND(J83*$D$81,2)","v":0},null,null,null,{"$f":"ROUND(N83*$D$81,2)","v":0},null,null,null,{"$f":"ROUND(R83*$D$81,2)","v":0},null,null,null,{"$f":"SUM(F81:U81)","v":0},null,{"$f":"IF(D81=V81,\"OK\",\"ERRO\")","v":"OK"}]
[{"$f":"IF(A81=\"F\",A81,\"\")","v":""}]
[{"$f":"IF(A82=\"F\",A82,\"\")","v":""},null,null,null,null,null,null,null,null,null,null,null,null,null,null,null,null,{"$f":"100%-(SUM(F83:Q83))","v":1},null,null,null,{"$f":"IFERROR(E81/100,\"\")","v":0},null,{"$f":"IF(E81=V83*100,\"OK\",\"ERRO\")","v":"OK"}]
[{"$f":"IF(D84>0,\"F\",\"\")","v":""},"ADMINISTRAÇÃO - MENSALISTAS",null,{"$f":"Orçamento!V881","v":0},{"$f":"Orçamento!X881","v":0},{"$f":"ROUND(F86*$D$84,2)","v":0},null,null,null,{"$f":"ROUND(J86*$D$84,2)","v":0},null,null,null,{"$f":"ROUND(N86*$D$84,2)","v":0},null,null,null,{"$f":"ROUND(R86*$D$84,2)+0.01","v":0.01},null,null,null,{"$f":"SUM(F84:U84)","v":0.01},null,{"$f":"IF(D84=V84,\"OK\",\"ERRO\")","v":"ERRO"}]
[{"$f":"IF(A84=\"F\",A84,\"\")","v":""}]
[{"$f":"IF(A85=\"F\",A85,\"\")","v":""},null,null,null,null,0.26,null,null,null,0.26,null,null,null,0.25,null,null,null,{"$f":"100%-(SUM(F86:Q86))","v":0.22999999999999998},null,null,null,{"$f":"IFERROR(E84/100,\"\")","v":0},null,{"$f":"IF(E84=V86*100,\"OK\",\"ERRO\")","v":"OK"}]
[{"$f":"IF(D87>0,\"F\",\"\")","v":""},"PINTURA",null,{"$f":"Orçamento!V882","v":0},{"$f":"Orçamento!X882","v":0},{"$f":"ROUND(F89*$D$87,2)","v":0},null,null,null,{"$f":"ROUND(J89*$D$87,2)","v":0},null,null,null,{"$f":"ROUND(N89*$D$87,2)","v":0},null,null,null,{"$f":"ROUND(R89*$D$87,2)","v":0},null,null,null,{"$f":"SUM(F87:U87)","v":0},null,{"$f":"IF(D87=V87,\"OK\",\"ERRO\")","v":"OK"}]
[{"$f":"IF(A87=\"F\",A87,\"\")","v":""}]
[{"$f":"IF(A88=\"F\",A88,\"\")","v":""},null,null,null,null,null,null,null,null,null,null,null,null,0.36,null,null,null,{"$f":"100%-(SUM(F89:Q89))","v":0.64},null,null,null,{"$f":"IFERROR(E87/100,\"\")","v":0},null,{"$f":"IF(E87=V89*100,\"OK\",\"ERRO\")","v":"OK"}]
[{"$f":"IF(D90>0,\"F\",\"\")","v":""},"DIVERSOS",null,{"$f":"Orçamento!V883","v":0},{"$f":"Orçamento!X883","v":0},{"$f":"ROUND(F92*$D$90,2)","v":0},null,null,null,{"$f":"ROUND(J92*$D$90,2)","v":0},null,null,null,{"$f":"ROUND(N92*$D$90,2)","v":0},null,null,null,{"$f":"ROUND(R92*$D$90,2)+0.01","v":0.01},null,null,null,{"$f":"SUM(F90:U90)","v":0.01},null,{"$f":"IF(D90=V90,\"OK\",\"ERRO\")","v":"ERRO"}]
[{"$f":"IF(A90=\"F\",A90,\"\")","v":""}]
[{"$f":"IF(A91=\"F\",A91,\"\")","v":""},null,null,null,null,0.255,null,null,null,0.255,null,null,null,0.255,null,null,null,{"$f":"100%-(SUM(F92:Q92))","v":0.23499999999999999},null,null,null,{"$f":"IFERROR(E90/100,\"\")","v":0},null,{"$f":"IF(E90=V92*100,\"OK\",\"ERRO\")","v":"OK"}]
["F","CUSTO DO ORÇAMENTO",null,{"$f":"SUM(D15:D92)","v":0},{"$f":"SUM(E15:E92)","v":0},{"$f":"F15+F18+F21+F24+F27+F30+F33+F36+F39+F42+F45+F48+F51+F54+F57+F60+F63+F66+F69+F72+F75+F78+F81+F84+F87+F90","v":0},null,null,null,{"$f":"J15+J18+J21+J24+J27+J30+J33+J36+J39+J42+J45+J48+J51+J54+J57+J60+J63+J66+J69+J72+J75+J78+J81+J84+J87+J90","v":0},null,null,null,{"$f":"N15+N18+N21+N24+N27+N30+N33+N36+N39+N42+N45+N48+N51+N54+N57+N60+N63+N66+N69+N72+N75+N78+N81+N84+N87+N90","v":-0.01},null,null,null,{"$f":"R15+R18+R21+R24+R27+R30+R33+R36+R39+R42+R45+R48+R51+R54+R57+R60+R63+R66+R69+R72+R75+R78+R81+R84+R87+R90","v":0.02},null,null,null,{"$f":"V15+V18+V21+V24+V27+V30+V33+V36+V39+V42+V45+V48+V51+V54+V57+V60+V63+V66+V69+V72+V75+V78+V81+V84+V87+V90","v":0.01}]
["F","PERCENTUAIS:",null,null,null,{"$f":"IFERROR(F93/$D$93,\"\")","v":""},null,null,null,{"$f":"IFERROR(J93/$D$93,\"\")","v":""},null,null,null,{"$f":"IFERROR(N93/$D$93,\"\")","v":""},null,null,null,{"$f":"IFERROR(R93/$D$93,\"\")","v":""},null,null,null,{"$f":"SUM(F94:U94)","v":0}]
["F","TOTAIS ACUMULADOS:",null,null,null,{"$f":"F93","v":0},null,null,null,{"$f":"J93+F95","v":0},null,null,null,{"$f":"N93+J95","v":-0.01},null,null,null,{"$f":"R93+N95","v":0.01}]
["F","PERCENTUAIS  ACUMULADOS:",null,null,null,{"$f":"F94","v":""},null,null,null,{"$f":"J94+F96","v":{"$error":"#VALUE!"}},null,null,null,{"$f":"N94+J96","v":{"$error":"#VALUE!"}},null,null,null,{"$f":"R94+N96","v":{"$error":"#VALUE!"}}]
["F"]
["F","OBSERVAÇÕES:"]
["F","Os pagamentos somente poderão ser efetuados mediante medição e atesto pelos técnicos da Secretaria da Educação. "]

{"sheet":"Composição BDI","index":4,"n_rows":45,"n_cols":9,"rows_kept":45,"cut":false,"hidden":false,"merged":[[11,0,11,3],[12,0,12,3],[14,0,14,3],[15,0,15,3],[13,0,13,3],[0,0,0,3],[1,0,1,3],[4,0,4,3],[7,0,7,3],[10,0,10,3],[2,0,2,3],[3,0,3,3],[5,0,5,3],[6,0,6,3],[8,0,8,3],[9,0,9,3],[18,5,18,8],[17,0,17,3],[16,0,16,3],[44,0,44,3],[42,0,42,3],[43,0,43,3],[18,0,18,3],[36,0,36,3],[39,0,39,3],[38,0,38,3],[40,0,40,3],[29,0,29,2],[32,0,32,3],[33,0,33,3],[34,0,34,3],[35,0,35,3]]}
[]
[]
["UNIDADE ESCOLAR"]
[{"$f":"Orçamento!$O$4","v":"CENTRO DE ENSINO EM PERÍODO INTEGRAL PROFESSOR SÉRGIO FAYAD GENEROSO"}]
[]
["OBRA"]
[{"$f":"Orçamento!$O$7","v":"REFORMA E AMPLIAÇÃO"}]
[]
["ENDEREÇO"]
[{"$f":"Orçamento!$R$10","v":"AV.MAESTRO JOAO L. DO ESPIRITO SANTO S/N, FORMOSINHA, CEP:73813-120"}]
[]
["CIDADE"]
[{"$f":"Orçamento!$V$7","v":"FORMOSA"}]
[]
["CRE"]
[{"$f":"Orçamento!$O$10","v":"FORMOSA"}]
[]
["DETALHAMENTO DA COMPOSIÇÃO DE BDI"]
["COMPOSIÇÃO BDI PARA OBRAS CIVIS",null,null,null,null,"BDI CONSTRUÇÃO E REFORMA"]
["DESCRIÇÃO","COEF.","TAXA % (a.m)","% no preço de venda",null,"Situação","1º Quartil","Médio","3º Quartil"]
["1) COFINS",1,0.03,{"$f":"C21","v":0.03},null,{"$f":"IF(OR(C21<G21,C21>I21),\"FORA DO INTERVALO\",\"OK\")","v":"OK"},0.03,0.03,0.03]
["2) PIS",1,6.4999999999999997E-3,{"$f":"C22","v":6.4999999999999997E-3},null,{"$f":"IF(OR(C22<G22,C22>I22),\"FORA DO INTERVALO\",\"OK\")","v":"OK"},6.4999999999999997E-3,6.4999999999999997E-3,6.4999999999999997E-3]
["3) ISSQN",1,{"$f":"IFERROR(VLOOKUP($A$13,#REF!,10,FALSE())/100,0)","v":0},{"$f":"C23*B23","v":0},null,"FORA DO INTERVALO",0.02,3.5000000000000003E-2,0.05]
["4) CPRB",1,{"$f":"IF(Orçamento!$T$10=\"DESONERADA\",4.5%,0)","v":4.4999999999999998E-2},{"$f":"C24","v":4.4999999999999998E-2},null,"OK",4.4999999999999998E-2,4.4999999999999998E-2,4.4999999999999998E-2]
["5) Administração Central",1,4.5999999999999999E-2,4.5999999999999999E-2,null,"OK",0.03,0.04,5.5E-2]
["6) Despesas Financeiras",1,5.5999999999999999E-3,5.5999999999999999E-3,null,"FORA DO INTERVALO",5.8999999999999999E-3,1.23E-2,1.3899999999999999E-2]
["7) Seguros + Garantias",1,1.1999999999999999E-3,1.1999999999999999E-3,null,"FORA DO INTERVALO",8.0000000000000002E-3,8.0000000000000002E-3,0.01]
["8) Risco",1,9.7000000000000003E-3,9.7000000000000003E-3,null,"OK",9.7000000000000003E-3,1.2699999999999999E-2,1.2699999999999999E-2]
["9) Lucro",1,7.3999999999999996E-2,7.3999999999999996E-2,null,"OK",6.1600000000000002E-2,7.3999999999999996E-2,8.9599999999999999E-2]
["BDI - FINAL",null,null,{"$f":"(((1+D25+D27+D28)*(1+D26)*(1+D29))/(1-(D21+D22+D23+D24))-1)","v":0.2427514636472512},null,{"$f":"IF(OR(D30<G30,D30>I30),\"FORA DO INTERVALO\",\"OK\")","v":"OK"},0.2034,0.22120000000000001,0.25]
[]
["Notas:"]
["(1) e (2) Alíquota definida por lei."]
["(3) Alíquota e base de cálculo definidas pela legislação municipal."]
["(4) Alíquota definida pelas leis 12.546/11, 12844/13 e 13.161/15 (CPRB – contribuição previdenciária sobre a receita bruta)."]
["(5) Valores definidos a partir dos limites no Acórdão nº 2.622/2013 - TCU – Plenário. Valores entre o 1º e 3º quartis."]
["(6) Valor calculado pela expressão matemática do acórdão 2.369/2011 – TCU – Plenário e disponibilizado pela AGETOP em dezembro de 2018. (Foi utilizado para o cálculo a média da Taxa SELIC no período de 11/2017 a 10/2018)"]
[]
["(7) Valores definidos pela AGETOP a partir dos limites no Acórdão nº 2.622/2013 - TCU – Plenário. Valores médios. \n\nObservação da AGETOP: (Seguros contra erros de execução, incêndio e explosão, danos da natureza (vendaval, destelhamento, alagamento, inundação, desmoronamento, geadas etc.), emprego de material defeituoso ou inadequado, roubo e/ou furto qualificado, quebra de equipamentos, desmoronamento de estrutura, nas modalidades de Obras Civis em Construção (OCC); Instalação e Montagem (IM); e Obras Civis em Construção e Instalação e Montagem (OCC/IM). Bem como coberturas adicionais para ampliação dessas coberturas básicas, como: cobertura de responsabilidade civil geral, cobertura de responsabilidade civil cruzada, cobertura de despesas extraordinárias, cobertura de tumultos, cobertura de desentulho do local, cobertura de riscos do fabricante, dentre outras, incluindo o seguro de vida em grupo regido pela convenção coletiva dos trabalhadores na indústria da construção civil). A partir de 24/02/2015 por intermédio da Portaria 449/2015 a Presidência da AGETOP, na pessoa do Senhor Jayme Eduardo Rincon, determinou a exclusão dos valores referentes aos Seguros de Risco de Engenharia e Responsabilidade Civil do Profissional na composição do cálculo do B.D.I.."]
["(8) Valores definidos a partir dos limites no Acórdão nº 2.622/2013 - TCU – Plenário. Valores entre 1º e 3° quartis."]
["(9) Valores definidos a partir dos limites definidos no Acórdão nº 2.622/2013 - TCU – Plenário. Valores adotados e praticados no mercado ( “ ex ante ” ) ou aqueles entre os 1º e 3º quartis."]
[]
["(*) A fórmula para estipulação da taxa de BDI estimado adotado é a mesma que foi aplicada para a obtenção das tabelas contidas no Acórdão n. 2.622/2013 – TCUPlenário"]
[]
["Obs.: Para obras com valores superiores a R$ 20.000.000,00 sugere-se recalcular o BDI, dimensionando as taxas de administração central e lucro para patamares inferiores ao estipulado acima."]

{"sheet":"Relatório CENTRAL","index":5,"n_rows":40,"n_cols":5,"rows_kept":40,"cut":false,"hidden":false,"merged":[[39,1,39,2],[9,0,11,0],[0,1,0,4],[6,3,6,4],[9,3,9,4],[1,1,1,4],[2,1,2,2],[2,3,2,4],[3,1,3,2],[3,3,3,4],[4,1,4,4],[5,1,5,2],[5,3,5,4],[6,1,6,2],[7,1,7,4],[8,1,8,2],[8,3,8,4],[9,1,9,2],[10,1,10,4],[11,1,11,4]]}
[]
[]
[null,"UNIDADE ESCOLAR",null,"CIDADE"]
[null,{"$f":"Orçamento!$O$4","v":"CENTRO DE ENSINO EM PERÍODO INTEGRAL PROFESSOR SÉRGIO FAYAD GENEROSO"},null,{"$f":"Orçamento!$V$7","v":"FORMOSA"}]
[]
[null,"OBRA",null,"CRE"]
[null,{"$f":"Orçamento!$O$7","v":"REFORMA E AMPLIAÇÃO"},null,{"$f":"Orçamento!$O$10","v":"FORMOSA"}]
[]
[null,"ENDEREÇO",null,"DATA"]
["FILTRO",{"$f":"Orçamento!$R$10","v":"AV.MAESTRO JOAO L. DO ESPIRITO SANTO S/N, FORMOSINHA, CEP:73813-120"},null,{"$f":"Orçamento!$S$7","v":"2020-07-07"}]
[]
[null,"RELATÓRIO CENTRAL"]
["↓","CÓDIGO","ETAPA","PREÇO  (R$) C/ BDI","PARTIC  ( % )"]
[{"$f":"IF(D14>0,\"F\",\"\")","v":""},{"$f":"Orçamento!O858","v":"a."},{"$f":"Orçamento!P858","v":"SERVIÇOS PRELIMINARES"},{"$f":"Orçamento!V858","v":0},{"$f":"Orçamento!X858","v":0}]
[{"$f":"IF(D15>0,\"F\",\"\")","v":""},{"$f":"Orçamento!O859","v":"b."},{"$f":"Orçamento!P859","v":"TRANSPORTES"},{"$f":"Orçamento!V859","v":0},{"$f":"Orçamento!X859","v":0}]
["",{"$f":"Orçamento!O860","v":"c."},{"$f":"Orçamento!P860","v":"SERVIÇO EM TERRA"},{"$f":"Orçamento!V860","v":0},{"$f":"Orçamento!X860","v":0}]
["",{"$f":"Orçamento!O861","v":"d."},{"$f":"Orçamento!P861","v":"FUNDAÇÕES E SONDAGENS"},{"$f":"Orçamento!V861","v":0},{"$f":"Orçamento!X861","v":0}]
["",{"$f":"Orçamento!O862","v":"e."},{"$f":"Orçamento!P862","v":"ESTRUTURA"},{"$f":"Orçamento!V862","v":0},{"$f":"Orçamento!X862","v":0}]
["",{"$f":"Orçamento!O863","v":"f."},{"$f":"Orçamento!P863","v":"INSTALAÇÕES ELÉTRICAS"},{"$f":"Orçamento!V863","v":0},{"$f":"Orçamento!X863","v":0}]
["",{"$f":"Orçamento!O864","v":"g."},{"$f":"Orçamento!P864","v":"INSTALAÇÕES HIDROSSANITÁRIAS"},{"$f":"Orçamento!V864","v":0},{"$f":"Orçamento!X864","v":0}]
["",{"$f":"Orçamento!O865","v":"h"},{"$f":"Orçamento!P865","v":"INSTALAÇÕES ESPECIAIS"},{"$f":"Orçamento!V865","v":0},{"$f":"Orçamento!X865","v":0}]
["",{"$f":"Orçamento!O866","v":"i."},{"$f":"Orçamento!P866","v":"ALVENARIAS E DIVISÓRIAS"},{"$f":"Orçamento!V866","v":0},{"$f":"Orçamento!X866","v":0}]
["",{"$f":"Orçamento!O867","v":"j."},{"$f":"Orçamento!P867","v":"ALVENARIA AUTO-PORTANTE"},{"$f":"Orçamento!V867","v":0},{"$f":"Orçamento!X867","v":0}]
["",{"$f":"Orçamento!O868","v":"k."},{"$f":"Orçamento!P868","v":"IMPERMEABILIZAÇÃO"},{"$f":"Orçamento!V868","v":0},{"$f":"Orçamento!X868","v":0}]
["",{"$f":"Orçamento!O869","v":"l."},{"$f":"Orçamento!P869","v":"ISOLAMENTO TÉRMICO E ACÚSTICO"},{"$f":"Orçamento!V869","v":0},{"$f":"Orçamento!X869","v":0}]
["",{"$f":"Orçamento!O870","v":"m."},{"$f":"Orçamento!P870","v":"ESTRUTURA DE MADEIRA"},{"$f":"Orçamento!V870","v":0},{"$f":"Orçamento!X870","v":0}]
["",{"$f":"Orçamento!O871","v":"n."},{"$f":"Orçamento!P871","v":"ESTRUTURAS METÁLICAS"},{"$f":"Orçamento!V871","v":0},{"$f":"Orçamento!X871","v":0}]
["",{"$f":"Orçamento!O872","v":"o."},{"$f":"Orçamento!P872","v":"COBERTURAS"},{"$f":"Orçamento!V872","v":0},{"$f":"Orçamento!X872","v":0}]
["",{"$f":"Orçamento!O873","v":"p."},{"$f":"Orçamento!P873","v":"ESQUADRIAS DE MADEIRA"},{"$f":"Orçamento!V873","v":0},{"$f":"Orçamento!X873","v":0}]
["",{"$f":"Orçamento!O874","v":"q."},{"$f":"Orçamento!P874","v":"ESQUADRIAS METÁLICAS"},{"$f":"Orçamento!V874","v":0},{"$f":"Orçamento!X874","v":0}]
["",{"$f":"Orçamento!O875","v":"r."},{"$f":"Orçamento!P875","v":"VIDROS"},{"$f":"Orçamento!V875","v":0},{"$f":"Orçamento!X875","v":0}]
["",{"$f":"Orçamento!O876","v":"s."},{"$f":"Orçamento!P876","v":"REVESTIMENTO DE PAREDE"},{"$f":"Orçamento!V876","v":0},{"$f":"Orçamento!X876","v":0}]
["",{"$f":"Orçamento!O877","v":"t."},{"$f":"Orçamento!P877","v":"FORROS"},{"$f":"Orçamento!V877","v":0},{"$f":"Orçamento!X877","v":0}]
["",{"$f":"Orçamento!O878","v":"u."},{"$f":"Orçamento!P878","v":"REVESTIMENTO DE PISO"},{"$f":"Orçamento!V878","v":0},{"$f":"Orçamento!X878","v":0}]
["",{"$f":"Orçamento!O879","v":"v."},{"$f":"Orçamento!P879","v":"FERRAGENS"},{"$f":"Orçamento!V879","v":0},{"$f":"Orçamento!X879","v":0}]
["",{"$f":"Orçamento!O880","v":"w."},{"$f":"Orçamento!P880","v":"MARCENARIA"},{"$f":"Orçamento!V880","v":0},{"$f":"Orçamento!X880","v":0}]
["",{"$f":"Orçamento!O881","v":"x."},{"$f":"Orçamento!P881","v":"ADMINISTRAÇÃO"},{"$f":"Orçamento!V881","v":0},{"$f":"Orçamento!X881","v":0}]
["",{"$f":"Orçamento!O882","v":"y."},{"$f":"Orçamento!P882","v":"PINTURA"},{"$f":"Orçamento!V882","v":0},{"$f":"Orçamento!X882","v":0}]
["",{"$f":"Orçamento!O883","v":"z."},{"$f":"Orçamento!P883","v":"DIVERSOS"},{"$f":"Orçamento!V883","v":0},{"$f":"Orçamento!X883","v":0}]
["F","TOTAL GERAL DO ORÇAMENTO (R$) C/BDI",null,{"$f":"SUM(D14:D39)","v":0},{"$f":"SUM(E14:E39)","v":0}]

{"sheet":"Parc Maior Relev","index":6,"n_rows":35,"n_cols":7,"rows_kept":35,"cut":false,"hidden":false,"merged":[[10,1,10,6],[6,1,6,3],[6,4,6,6],[7,1,7,6],[8,1,8,3],[8,4,8,6],[35,3,35,7],[33,1,33,6],[0,1,0,6],[11,1,11,6],[1,1,1,6],[2,1,2,3],[2,4,2,6],[3,1,3,3],[3,4,3,6],[4,1,4,6],[5,1,5,3],[5,4,5,6],[9,1,9,3],[9,4,9,6]]}
[]
[]
[null,"UNIDADE ESCOLAR",null,null,"CÓDIGO INEP"]
[null,{"$f":"Orçamento!$O$4","v":"CENTRO DE ENSINO EM PERÍODO INTEGRAL PROFESSOR SÉRGIO FAYAD GENEROSO"},null,null,{"$f":"Orçamento!$V$4","v":52046176}]
[]
[null,"OBRA",null,null,"CIDADE"]
[null,{"$f":"Orçamento!$O$7","v":"REFORMA E AMPLIAÇÃO"},null,null,{"$f":"Orçamento!$V$7","v":"FORMOSA"}]
[]
[null,"CRE",null,null,"ÁREA TOTAL CONSTRUÍDA (M²)"]
[null,{"$f":"Orçamento!$O$10","v":"FORMOSA"},null,null,{"$f":"Orçamento!$V$13","v":3313.58}]
[]
["FILTRO","PARCELA DE MAIOR RELEVÂNCIA"]
[{"$f":"IF(G14>0,\"F\",\"\")","v":"F"},"CÓDIGO","SERVIÇO","DESCRIÇÃO","UNID","QUANT","PARC. MAIOR RELEV (100%)"]
[{"$f":"IF(G14>0,\"F\",\"\")","v":"F"},{"$f":"Somatório!B22","v":"f."},"INSTALAÇÕES ELÉTRICAS","SUBESTAÇÃO","KVA",112.5,{"$f":"F14","v":112.5}]
[{"$f":"IF(SUM(G16:G32)>0,\"F\",\"\")","v":"F"},"CÓDIGO","SERVIÇO","DESCRIÇÃO","UNID","QUANT","PARC. MAIOR RELEV (50%)"]
[{"$f":"IF(G16>0,\"F\",\"\")","v":""},{"$f":"Somatório!B21","v":"e."},"ESTRUTURA","CONCRETO","M3",{"$f":"SUMIF(Orçamento!$R$20:$R$839,'Parc Maior Relev'!D16,Orçamento!$T$20:$T$839)","v":0},{"$f":"F16*0.5","v":0}]
[{"$f":"IF(G17>0,\"F\",\"\")","v":""},"f.","INSTALAÇÕES ELÉTRICAS","INSTALAÇÕES ELÉTRICAS","KVA",{"$f":"SUMIF(Orçamento!$R$20:$R$839,'Parc Maior Relev'!D17,Orçamento!$T$20:$T$839)","v":0},{"$f":"F17","v":0}]
[{"$f":"IF(G18>0,\"F\",\"\")","v":""},{"$f":"Somatório!B25","v":"i."},"ALVENARIA E DIVISÓRIAS","ALVENARIA DE TIJOLOS","M2",{"$f":"SUMIF(Orçamento!$R$20:$R$839,'Parc Maior Relev'!D18,Orçamento!$T$20:$T$839)","v":0},{"$f":"F18*0.5","v":0}]
["",{"$f":"Somatório!B29","v":"m."},"ESTRUTURA DE MADEIRA","ESTRUTURA DE MADEIRA","M2",{"$f":"SUMIF(Orçamento!$R$20:$R$839,'Parc Maior Relev'!D19,Orçamento!$T$20:$T$839)","v":0},0]
["",{"$f":"Somatório!B31","v":"o."},"COBERTURAS","COBERTURA CERÂMICA","M2",{"$f":"SUMIF(Orçamento!$R$20:$R$839,'Parc Maior Relev'!D20,Orçamento!$T$20:$T$839)","v":0},0]
["","o.","COBERTURAS","COBERTURA COM TELHA METÁLICA","M2",{"$f":"SUMIF(Orçamento!$R$20:$R$839,'Parc Maior Relev'!D21,Orçamento!$T$20:$T$839)","v":0},0]
["",{"$f":"Somatório!B35","v":"s."},"REVESTIMENTO DE PAREDE","CHAPISCO","M2",{"$f":"SUMIF(Orçamento!$R$20:$R$839,'Parc Maior Relev'!D22,Orçamento!$T$20:$T$839)","v":0},0]
["F","s.","REVESTIMENTO DE PAREDE","REBOCO","M2",{"$f":"Orçamento!T682+Orçamento!T687+Orçamento!T697+Orçamento!T699+Orçamento!T702+Orçamento!T707","v":2698.69},{"$f":"F23*0.5","v":1349.345}]
["","s.","REVESTIMENTO DE PAREDE","REVESTIMENTO CERÂMICO","M2",{"$f":"SUMIF(Orçamento!$R$20:$R$839,'Parc Maior Relev'!D24,Orçamento!$T$20:$T$839)","v":0},{"$f":"F24*0.5","v":0}]
["",{"$f":"Somatório!B36","v":"t."},"FORROS","FORRO DE GESSO","M2",{"$f":"SUMIF(Orçamento!$R$20:$R$839,'Parc Maior Relev'!D25,Orçamento!$T$20:$T$839)","v":0},{"$f":"F25*0.5","v":0}]
["","t.","FORROS","FORRO DE PVC","M2",{"$f":"SUMIF(Orçamento!$R$20:$R$839,'Parc Maior Relev'!D26,Orçamento!$T$20:$T$839)","v":0},{"$f":"F26*0.5","v":0}]
["","t.","FORROS","FORRO DE GESSO ACARTONADO","M2",{"$f":"SUMIF(Orçamento!$R$20:$R$839,'Parc Maior Relev'!D27,Orçamento!$T$20:$T$839)","v":0},{"$f":"F27*0.5","v":0}]
["","u.","REVESTIMENTO DE PISO","PISO DE GRANITINA","M2",{"$f":"SUMIF(Orçamento!$R$20:$R$839,'Parc Maior Relev'!D28,Orçamento!$T$20:$T$839)","v":0},0]
["","u.","REVESTIMENTO DE PISO","PISO LAMINADO","M2",{"$f":"SUMIF(Orçamento!$R$20:$R$839,'Parc Maior Relev'!D29,Orçamento!$T$20:$T$839)","v":0},0]
["","u.","REVESTIMENTO DE PISO","PISO DE CONCRETO DESEMPENADO","M2",{"$f":"SUMIF(Orçamento!$R$20:$R$839,'Parc Maior Relev'!D30,Orçamento!$T$20:$T$839)","v":0},0]
["","u.","REVESTIMENTO DE PISO","PISO CERÂMICO","M2",{"$f":"SUMIF(Orçamento!$R$20:$R$839,'Parc Maior Relev'!D31,Orçamento!$T$20:$T$839)","v":0},{"$f":"F31*0.5","v":0}]
["F","y.","PINTURA","PINTURA","M2",{"$f":"Orçamento!T778+Orçamento!T781+Orçamento!T789+Orçamento!T796+Orçamento!T800+Orçamento!T816","v":6246.86},3123.43]
["F"]
["F","(*) Para os fins do inciso I dp § 1º do Art. 30 da Lei Federal 8.666/93, são consideradas parcelas de maior relevância técnica as execuções apresentadas"]
["F"]

{"sheet":"Composições","index":7,"n_rows":420,"n_cols":10,"rows_kept":420,"cut":false,"hidden":false,"merged":[[15,0,15,9],[13,0,13,2],[13,3,13,6],[1,0,1,9],[3,7,3,9],[4,7,4,9],[6,7,6,9],[7,7,7,9],[6,0,6,6],[10,8,10,9],[13,8,13,9],[14,0,14,9],[8,0,8,9],[5,0,5,9],[2,0,2,9],[0,0,0,8],[10,0,10,2],[10,3,10,6],[11,0,11,9],[12,0,12,2],[12,3,12,6],[12,7,12,8],[7,0,7,6],[9,0,9,2],[9,3,9,6],[9,7,9,8],[3,0,3,6],[4,0,4,6],[16,5,17,5],[16,6,16,7],[16,8,16,9],[22,1,22,7],[26,1,26,7],[16,0,17,0],[16,1,17,1],[16,2,17,2],[16,3,17,3],[16,4,17,4],[28,5,29,5],[28,6,28,7],[28,8,28,9],[34,1,34,7],[38,1,38,7],[28,0,29,0],[28,1,29,1],[28,2,29,2],[28,3,29,3],[28,4,29,4],[40,5,41,5],[40,6,40,7],[40,8,40,9],[45,1,45,7],[47,1,47,7],[40,0,41,0],[40,1,41,1],[40,2,41,2],[40,3,41,3],[40,4,41,4],[49,5,50,5],[49,6,49,7],[49,8,49,9],[54,1,54,7],[56,1,56,7],[49,0,50,0],[49,1,50,1],[49,2,50,2],[49,3,50,3],[49,4,50,4],[58,5,59,5],[58,6,58,7],[58,8,58,9],[63,1,63,7],[65,1,65,7],[58,0,59,0],[58,1,59,1],[58,2,59,2],[58,3,59,3],[58,4,59,4],[67,5,68,5],[67,6,67,7],[67,8,67,9],[71,1,71,7],[73,1,73,7],[67,0,68,0],[67,1,68,1],[67,2,68,2],[67,3,68,3],[67,4,68,4],[75,5,76,5],[75,6,75,7],[75,8,75,9],[80,1,80,7],[82,1,82,7],[75,0,76,0],[75,1,76,1],[75,2,76,2],[75,3,76,3],[75,4,76,4],[84,5,85,5],[84,6,84,7],[84,8,84,9],[89,1,89,7],[91,1,91,7],[84,0,85,0],[84,1,85,1],[84,2,85,2],[84,3,85,3],[84,4,85,4],[93,5,94,5],[93,6,93,7],[93,8,93,9],[98,1,98,7],[101,1,101,7],[93,0,94,0],[93,1,94,1],[93,2,94,2],[93,3,94,3],[93,4,94,4],[103,5,104,5],[103,6,103,7],[103,8,103,9],[108,1,108,7],[111,1,111,7],[103,0,104,0],[103,1,104,1],[103,2,104,2],[103,3,104,3],[103,4,104,4],[113,5,114,5],[113,6,113,7],[113,8,113,9],[118,1,118,7],[120,1,120,7],[113,0,114,0],[113,1,114,1],[113,2,114,2],[113,3,114,3],[113,4,114,4],[122,5,123,5],[122,6,122,7],[122,8,122,9],[127,1,127,7],[129,1,129,7],[122,0,123,0],[122,1,123,1],[122,2,123,2],[122,3,123,3],[122,4,123,4],[131,5,132,5],[131,6,131,7],[131,8,131,9],[136,1,136,7],[138,1,138,7],[131,0,132,0],[131,1,132,1],[131,2,132,2],[131,3,132,3],[131,4,132,4],[140,5,141,5],[140,6,140,7],[140,8,140,9],[145,1,145,7],[147,1,147,7],[140,0,141,0],[140,1,141,1],[140,2,141,2],[140,3,141,3],[140,4,141,4],[149,5,150,5],[149,6,149,7],[149,8,149,9],[154,1,154,7],[156,1,156,7],[149,0,150,0],[149,1,150,1],[149,2,150,2],[149,3,150,3],[149,4,150,4],[158,5,159,5],[158,6,158,7],[158,8,158,9],[163,1,163,7],[166,1,166,7],[158,0,159,0],[158,1,159,1],[158,2,159,2],[158,3,159,3],[158,4,159,4],[168,5,169,5],[168,6,168,7],[168,8,168,9],[173,1,173,7],[176,1,176,7],[168,0,169,0],[168,1,169,1],[168,2,169,2],[168,3,169,3],[168,4,169,4],[178,5,179,5],[178,6,178,7],[178,8,178,9],[182,1,182,7],[186,1,186,7],[178,0,179,0],[178,1,179,1],[178,2,179,2],[178,3,179,3],[178,4,179,4],[188,5,189,5],[188,6,188,7],[188,8,188,9],[192,1,192,7],[196,1,196,7],[188,0,189,0],[188,1,189,1],[188,2,189,2],[188,3,189,3],[188,4,189,4],[198,5,199,5],[198,6,198,7],[198,8,198,9],[202,1,202,7],[203,1,203,7],[198,0,199,0],[198,1,199,1],[198,2,199,2],[198,3,199,3],[198,4,199,4],[205,5,206,5],[205,6,205,7],[205,8,205,9],[210,1,210,7],[212,1,212,7],[205,0,206,0],[205,1,206,1],[205,2,206,2],[205,3,206,3],[205,4,206,4],[214,5,215,5],[214,6,214,7],[214,8,214,9],[219,1,219,7],[221,1,221,7],[214,0,215,0],[214,1,215,1],[214,2,215,2],[214,3,215,3],[214,4,215,4],[223,5,224,5],[223,6,223,7],[223,8,223,9],[227,1,227,7],[229,1,229,7],[223,0,224,0],[223,1,224,1],[223,2,224,2],[223,3,224,3],[223,4,224,4],[231,5,232,5],[231,6,231,7],[231,8,231,9],[236,1,236,7],[239,1,239,7],[231,0,232,0],[231,1,232,1],[231,2,232,2],[231,3,232,3],[231,4,232,4],[241,5,242,5],[241,6,241,7],[241,8,241,9],[246,1,246,7],[249,1,249,7],[241,0,242,0],[241,1,242,1],[241,2,242,2],[241,3,242,3],[241,4,242,4],[251,5,252,5],[251,6,251,7],[251,8,251,9],[256,1,256,7],[259,1,259,7],[251,0,252,0],[251,1,252,1],[251,2,252,2],[251,3,252,3],[251,4,252,4],[261,5,262,5],[261,6,261,7],[261,8,261,9],[266,1,266,7],[269,1,269,7],[261,0,262,0],[261,1,262,1],[261,2,262,2],[261,3,262,3],[261,4,262,4],[271,5,272,5],[271,6,271,7],[271,8,271,9],[275,1,275,7],[277,1,277,7],[271,0,272,0],[271,1,272,1],[271,2,272,2],[271,3,272,3],[271,4,272,4],[279,5,280,5],[279,6,279,7],[279,8,279,9],[284,1,284,7],[286,1,286,7],[279,0,280,0],[279,1,280,1],[279,2,280,2],[279,3,280,3],[279,4,280,4],[288,5,289,5],[288,6,288,7],[288,8,288,9],[293,1,293,7],[295,1,295,7],[288,0,289,0],[288,1,289,1],[288,2,289,2],[288,3,289,3],[288,4,289,4],[297,5,298,5],[297,6,297,7],[297,8,297,9],[302,1,302,7],[304,1,304,7],[297,0,298,0],[297,1,298,1],[297,2,298,2],[297,3,298,3],[297,4,298,4],[306,5,307,5],[306,6,306,7],[306,8,306,9],[311,1,311,7],[313,1,313,7],[306,0,307,0],[306,1,307,1],[306,2,307,2],[306,3,307,3],[306,4,307,4],[315,5,316,5],[315,6,315,7],[315,8,315,9],[319,1,319,7],[323,1,323,7],[315,0,316,0],[315,1,316,1],[315,2,316,2],[315,3,316,3],[315,4,316,4],[325,5,326,5],[325,6,325,7],[325,8,325,9],[329,1,329,7],[333,1,333,7],[325,0,326,0],[325,1,326,1],[325,2,326,2],[325,3,326,3],[325,4,326,4],[335,5,336,5],[335,6,335,7],[335,8,335,9],[339,1,339,7],[346,1,346,7],[335,0,336,0],[335,1,336,1],[335,2,336,2],[335,3,336,3],[335,4,336,4],[348,5,349,5],[348,6,348,7],[348,8,348,9],[352,1,352,7],[356,1,356,7],[348,0,349,0],[348,1,349,1],[348,2,349,2],[348,3,349,3],[348,4,349,4],[358,5,359,5],[358,6,358,7],[358,8,358,9],[362,1,362,7],[366,1,366,7],[358,0,359,0],[358,1,359,1],[358,2,359,2],[358,3,359,3],[358,4,359,4],[368,5,369,5],[368,6,368,7],[368,8,368,9],[372,1,372,7],[376,1,376,7],[368,0,369,0],[368,1,369,1],[368,2,369,2],[368,3,369,3],[368,4,369,4],[378,5,379,5],[378,6,378,7],[378,8,378,9],[382,1,382,7],[386,1,386,7],[378,0,379,0],[378,1,379,1],[378,2,379,2],[378,3,379,3],[378,4,379,4],[388,5,389,5],[388,6,388,7],[388,8,388,9],[393,1,393,7],[405,1,405,7],[388,0,389,0],[388,1,389,1],[388,2,389,2],[388,3,389,3],[388,4,389,4],[407,5,408,5],[407,6,407,7],[407,8,407,9],[410,1,410,7],[412,1,412,7],[407,0,408,0],[407,1,408,1],[407,2,408,2],[407,3,408,3],[407,4,408,4],[414,5,415,5],[414,6,414,7],[414,8,414,9],[417,1,417,7],[419,1,419,7],[414,0,415,0],[414,1,415,1],[414,2,415,2],[414,3,415,3],[414,4,415,4]]}
[]
[]
[]
["UNIDADE ESCOLAR",null,null,null,null,null,null,"CÓDIGO INEP"]
[{"$f":"Orçamento!$O$4","v":"CENTRO DE ENSINO EM PERÍODO INTEGRAL PROFESSOR SÉRGIO FAYAD GENEROSO"},null,null,null,null,null,null,{"$f":"Orçamento!$V$4","v":52046176}]
[]
["OBRA",null,null,null,null,null,null,"CIDADE"]
[{"$f":"Orçamento!$O$7","v":"REFORMA E AMPLIAÇÃO"},null,null,null,null,null,null,{"$f":"Orçamento!$V$7","v":"FORMOSA"}]
[]
["CRE",null,null,"ENDEREÇO",null,null,null,"REFERÊNCIA AGETOP"]
[{"$f":"Orçamento!$O$10","v":"FORMOSA"},null,null,{"$f":"Orçamento!$R$10","v":"AV.MAESTRO JOAO L. DO ESPIRITO SANTO S/N, FORMOSINHA, CEP:73813-120"},null,null,null,{"$f":"Orçamento!$S$10","v":"ABR/19"},{"$f":"Orçamento!$T$10","v":"DESONERADA"}]
[]
["DATA",null,null,"ÁREA TOTAL CONSTRUÍDA (M²)",null,null,null,"REFERÊNCIA SINAPI"]
[{"$f":"Orçamento!$S$7","v":"2020-07-07"},null,null,{"$f":"Orçamento!$V$13","v":3313.58},null,null,null,{"$f":"Orçamento!$V$10","v":"DEZ/19"},{"$f":"Orçamento!$W$10","v":"DESONERADA"}]
[]
["COMPOSIÇÕES DE CUSTOS UNITÁRIOS - SEE-GO"]
[10,"FONTE","CÓDIGO","DESCRIÇÃO","UNIDADE","COEFIC.","CUSTO UNITÁRIO",null,"CUSTO  TOTAL (A) + (B) + (C) + (D) + (E)"]
[null,null,null,null,null,null,"DESONERADO","NÃO DESONER.","DESONERADO","NÃO DESONER."]
[null,"COMPOSIÇÃO","COMP 010_SEE","DEMOLIÇÃO DE GRADE/GRELHA/CORRIMÃO/GUARDA CORPO - METÁLICO","M2",null,"-","-",4.0599999999999996,4.71]
[null,null,null,"","",null,0,0,0,0]
[null,null,null,"","",null,0,0,0,0]
[null,null,null,"","",null,0,0,0,0]
[null,"MÃO DE OBRA (B) - TOTAL",null,null,null,null,null,null,0,0]
[null,"AGETOP",20106,"RETIRADA DE JANELAS OU PORTAIS C/ TRANSP. ATÉ CB. E CARGA","m2    ",1,4.0599999999999996,4.71,4.0599999999999996,4.71]
[null,null,null,"","",null,0,0,0,0]
[null,null,null,"","",null,0,0,0,0]
[null,"MATERIAL (C) - TOTAL",null,null,null,null,null,null,4.0599999999999996,4.71]
[]
[10,"FONTE","CÓDIGO","DESCRIÇÃO","UNIDADE","COEFIC.","CUSTO UNITÁRIO",null,"CUSTO  TOTAL (A) + (B) + (C) + (D) + (E)"]
[null,null,null,null,null,null,"DESONERADO","NÃO DESONER.","DESONERADO","NÃO DESONER."]
[null,"COMPOSIÇÃO","COMP 010_SEE","DEMOLIÇÃO DE GRADE/GRELHA/CORRIMÃO/GUARDA CORPO - METÁLICO","M2",null,"-","-",4.0599999999999996,4.71]
[null,null,null,"","",null,0,0,0,0]
[null,null,null,"","",null,0,0,0,0]
[null,null,null,"","",null,0,0,0,0]
[null,"MÃO DE OBRA (B) - TOTAL",null,null,null,null,null,null,0,0]
[null,"AGETOP",20106,"RETIRADA DE JANELAS OU PORTAIS C/ TRANSP. ATÉ CB. E CARGA","m2    ",1,4.0599999999999996,4.71,4.0599999999999996,4.71]
[null,null,null,"","",null,0,0,0,0]
[null,null,null,"","",null,0,0,0,0]
[null,"MATERIAL (C) - TOTAL",null,null,null,null,null,null,4.0599999999999996,4.71]
[]
[46,"FONTE","CÓDIGO","DESCRIÇÃO","UNIDADE","COEFIC.","CUSTO UNITÁRIO",null,"CUSTO  TOTAL (A) + (B) + (C) + (D) + (E)"]
[null,null,null,null,null,null,"DESONERADO","NÃO DESONER.","DESONERADO","NÃO DESONER."]
[null,"COMPOSIÇÃO","COMP 046_SEE","CAPUZ PARA PROTEÇÃO DOS PARA RAIOS","UN ",null,null,null,16.560000000000002,16.690000000000001]
[null,"AGETOP_I",8,"AJUDANTE","h     ",3.3300000000000003E-2,8.75,10.14,0.28999999999999998,0.34]
[null,"AGETOP_I",12,"ELETRICISTA","h     ",3.3300000000000003E-2,13.95,16.16,0.46,0.54]
[null,"MÃO DE OBRA (B) - TOTAL",null,null,null,null,null,null,0.75,0.88000000000000012]
[null,"COTAÇÃO","COT 010_SEE","CAPUZ PARA PROTEÇÃO DOS PARA RAIOS","UN ",1,15.81,15.81,15.81,15.81]
[null,"MATERIAL (C) - TOTAL",null,null,null,null,null,null,15.81,15.81]
[]
[47,"FONTE","CÓDIGO","DESCRIÇÃO","UNIDADE","COEFIC.","CUSTO UNITÁRIO",null,"CUSTO  TOTAL (A) + (B) + (C) + (D) + (E)"]
[null,null,null,null,null,null,"DESONERADO","NÃO DESONER.","DESONERADO","NÃO DESONER."]
[null,"COMPOSIÇÃO","COMP 047_SEE","CAPUZ DE PROTEÇÃO PARA BUCHA DE TRANSFORMADOR","UN ",null,null,null,16.560000000000002,16.690000000000001]
[null,"AGETOP_I",8,"AJUDANTE","h     ",3.3300000000000003E-2,8.75,10.14,0.28999999999999998,0.34]
[null,"AGETOP_I",12,"ELETRICISTA","h     ",3.3300000000000003E-2,13.95,16.16,0.46,0.54]
[null,"MÃO DE OBRA (B) - TOTAL",null,null,null,null,null,null,0.75,0.88000000000000012]
[null,"COTAÇÃO","COT 011_SEE","CAPUZ DE PROTEÇÃO PARA BUCHA DE TRANSFORMADOR","UN ",1,15.81,15.81,15.81,15.81]
[null,"MATERIAL (C) - TOTAL",null,null,null,null,null,null,15.81,15.81]
[]
[48,"FONTE","CÓDIGO","DESCRIÇÃO","UNIDADE","COEFIC.","CUSTO UNITÁRIO",null,"CUSTO  TOTAL (A) + (B) + (C) + (D) + (E)"]
[null,null,null,null,null,null,"DESONERADO","NÃO DESONER.","DESONERADO","NÃO DESONER."]
[null,"COMPOSIÇÃO","COMP 048_SEE","HASTE ROSQUEADA \"TIRANTE\" 3/8\"","M",null,null,null,14.46,15.899999999999999]
[null,"AGETOP_I",8,"AJUDANTE","h     ",0.4,8.75,10.14,3.5,4.0599999999999996]
[null,"AGETOP_I",12,"ELETRICISTA","h     ",0.4,13.95,16.16,5.58,6.46]
[null,"MÃO DE OBRA (B) - TOTAL",null,null,null,null,null,null,9.08,10.52]
[null,"COTAÇÃO","COT 012_SEE","HASTE ROSQUEADA \"TIRANTE\" 3/8\"","M",1,5.3833333333333329,5.3833333333333329,5.38,5.38]
[null,"MATERIAL (C) - TOTAL",null,null,null,null,null,null,5.38,5.38]
[]
[49,"FONTE","CÓDIGO","DESCRIÇÃO","UNIDADE","COEFIC.","CUSTO UNITÁRIO",null,"CUSTO  TOTAL (A) + (B) + (C) + (D) + (E)"]
[null,null,null,null,null,null,"DESONERADO","NÃO DESONER.","DESONERADO","NÃO DESONER."]
[null,"COMPOSIÇÃO","COMP 049_SEE","PORCA SEXTAVADA 3/8\"","UN ",null,null,null,0.21000000000000002,0.22]
[null,"AGETOP_I",8,"AJUDANTE","h     ",8.9999999999999993E-3,8.75,10.14,0.08,0.09]
[null,"MÃO DE OBRA (B) - TOTAL",null,null,null,null,null,null,0.08,0.09]
[null,"COTAÇÃO","COT 013_SEE","PORCA SEXTAVADA 3/8\"","UN ",1,0.13,0.13,0.13,0.13]
[null,"MATERIAL (C) - TOTAL",null,null,null,null,null,null,0.13,0.13]
[]
[427,"FONTE","CÓDIGO","DESCRIÇÃO","UNIDADE","COEFIC.","CUSTO UNITÁRIO",null,"CUSTO  TOTAL (A) + (B) + (C) + (D) + (E)"]
[null,null,null,null,null,null,"DESONERADO","NÃO DESONER.","DESONERADO","NÃO DESONER."]
[null,"COMPOSIÇÃO","COMP 427_SEE","DUCHA HIGIENICA PLASTICA COM REGISTRO METALICO 1/2 \"","UN ",null,null,null,72.490000000000009,73.210000000000008]
[null,"AGETOP_I",11,"ENCANADOR","h     ",0.2,13.95,16.16,2.79,3.23]
[null,"AGETOP_I",8,"AJUDANTE","h     ",0.2,8.75,10.14,1.75,2.0299999999999998]
[null,"MÃO DE OBRA (B) - TOTAL",null,null,null,null,null,null,4.54,5.26]
[null,"SINAPI_I",1370,"DUCHA HIGIENICA PLASTICA COM REGISTRO METALICO 1/2 \"","UN    ",1,67.95,67.95,67.95,67.95]
[null,"MATERIAL (C) - TOTAL",null,null,null,null,null,null,67.95,67.95]
[]
[57,"FONTE","CÓDIGO","DESCRIÇÃO","UNIDADE","COEFIC.","CUSTO UNITÁRIO",null,"CUSTO  TOTAL (A) + (B) + (C) + (D) + (E)"]
[null,null,null,null,null,null,"DESONERADO","NÃO DESONER.","DESONERADO","NÃO DESONER."]
[null,"COMPOSIÇÃO","COMP 057_SEE","BUCHA DE REDUCAO SOLDAVEL LONGA 85 X 60 mm","UN ",null,null,null,17.55,18.22]
[null,"AGETOP_I",8,"AJUDANTE","h     ",0.185,8.75,10.14,1.62,1.88]
[null,"AGETOP_I",11,"ENCANADOR","h     ",0.185,13.95,16.16,2.58,2.99]
[null,"MÃO DE OBRA (B) - TOTAL",null,null,null,null,null,null,4.2,4.87]
[null,"SINAPI_I",817,"BUCHA DE REDUCAO DE PVC, SOLDAVEL, LONGA, COM 85 X 60 MM, PARA AGUA FRIA PREDIAL","UN    ",1,13.35,13.35,13.35,13.35]
[null,"MATERIAL (C) - TOTAL",null,null,null,null,null,null,13.35,13.35]
[]
[382,"FONTE","CÓDIGO","DESCRIÇÃO","UNIDADE","COEFIC.","CUSTO UNITÁRIO",null,"CUSTO  TOTAL (A) + (B) + (C) + (D) + (E)"]
[null,null,null,null,null,null,"DESONERADO","NÃO DESONER.","DESONERADO","NÃO DESONER."]
[null,"COMPOSIÇÃO","COMP 382_SEE","TE DE REDUCAO DE FERRO GALVANIZADO, COM ROSCA BSP, DE 3/4\" X 1/2\"","UN ",null,null,null,22.58,24.759999999999998]
[null,"AGETOP_I",8,"AJUDANTE","h     ",0.6,8.75,10.14,5.25,6.08]
[null,"AGETOP_I",11,"ENCANADOR","h     ",0.61050000000000004,13.95,16.16,8.52,9.8699999999999992]
[null,"MÃO DE OBRA (B) - TOTAL",null,null,null,null,null,null,13.77,15.95]
[null,"SINAPI_I",3146,"FITA VEDA ROSCA EM ROLOS DE 18 MM X 10 M (L X C)","UN    ",0.12075471698113208,3.69,3.69,0.45,0.45]
[null,"SINAPI_I",6302,"TE DE REDUCAO DE FERRO GALVANIZADO, COM ROSCA BSP, DE 3/4\" X 1/2\"","UN    ",1,8.36,8.36,8.36,8.36]
[null,"MATERIAL (C) - TOTAL",null,null,null,null,null,null,8.8099999999999987,8.8099999999999987]
[]
[383,"FONTE","CÓDIGO","DESCRIÇÃO","UNIDADE","COEFIC.","CUSTO UNITÁRIO",null,"CUSTO  TOTAL (A) + (B) + (C) + (D) + (E)"]
[null,null,null,null,null,null,"DESONERADO","NÃO DESONER.","DESONERADO","NÃO DESONER."]
[null,"COMPOSIÇÃO","COMP 383_SEE","BUCHA DE REDUCAO DE FERRO GALVANIZADO, COM ROSCA BSP, DE 1/2\" X 1/4\"","UN ",null,null,null,6.71,7.29]
[null,"AGETOP_I",8,"AJUDANTE","h     ",0.16,8.75,10.14,1.4,1.62]
[null,"AGETOP_I",11,"ENCANADOR","h     ",0.16,13.95,16.16,2.23,2.59]
[null,"MÃO DE OBRA (B) - TOTAL",null,null,null,null,null,null,3.63,4.21]
[null,"AGETOP_I","H689","","",1.2,0,0,0,0]
[null,"SINAPI_I",770,"BUCHA DE REDUCAO DE FERRO GALVANIZADO, COM ROSCA BSP, DE 1/2\" X 1/4\"","UN    ",1,3.08,3.08,3.08,3.08]
[null,"MATERIAL (C) - TOTAL",null,null,null,null,null,null,3.08,3.08]
[]
[212,"FONTE","CÓDIGO","DESCRIÇÃO","UNIDADE","COEFIC.","CUSTO UNITÁRIO",null,"CUSTO  TOTAL (A) + (B) + (C) + (D) + (E)"]
[null,null,null,null,null,null,"DESONERADO","NÃO DESONER.","DESONERADO","NÃO DESONER."]
[null,"COMPOSIÇÃO","COMP 212_SEE","NIPLE DE REDUÇÃO 1/2\" X 1/4\" BSP","UN ",null,null,null,9.68,10.26]
[null,"AGETOP_I",8,"AJUDANTE","h     ",0.16,8.75,10.14,1.4,1.62]
[null,"AGETOP_I",11,"ENCANADOR","h     ",0.16,13.95,16.16,2.23,2.59]
[null,"MÃO DE OBRA (B) - TOTAL",null,null,null,null,null,null,3.63,4.21]
[null,"COTAÇÃO","COT 103_SEE","NIPLE DE REDUÇÃO 1/2\" X 1/4\" BSP","UN",1,6.0533333333333337,6.0533333333333337,6.05,6.05]
[null,"MATERIAL (C) - TOTAL",null,null,null,null,null,null,6.05,6.05]
[]
[213,"FONTE","CÓDIGO","DESCRIÇÃO","UNIDADE","COEFIC.","CUSTO UNITÁRIO",null,"CUSTO  TOTAL (A) + (B) + (C) + (D) + (E)"]
[null,null,null,null,null,null,"DESONERADO","NÃO DESONER.","DESONERADO","NÃO DESONER."]
[null,"COMPOSIÇÃO","COMP 213_SEE","NIPLE DE REDUÇÃO 3/4\" X 1/2\" BSP","UN ",null,null,null,13.34,13.920000000000002]
[null,"AGETOP_I",8,"AJUDANTE","h     ",0.16,8.75,10.14,1.4,1.62]
[null,"AGETOP_I",11,"ENCANADOR","h     ",0.16,13.95,16.16,2.23,2.59]
[null,"MÃO DE OBRA (B) - TOTAL",null,null,null,null,null,null,3.63,4.21]
[null,"COTAÇÃO","COT 104_SEE","NIPLE DE REDUÇÃO 3/4\" X 1/2\" BSP","UN",1,9.7099999999999991,9.7099999999999991,9.7100000000000009,9.7100000000000009]
[null,"MATERIAL (C) - TOTAL",null,null,null,null,null,null,9.7100000000000009,9.7100000000000009]
[]
[237,"FONTE","CÓDIGO","DESCRIÇÃO","UNIDADE","COEFIC.","CUSTO UNITÁRIO",null,"CUSTO  TOTAL (A) + (B) + (C) + (D) + (E)"]
[null,null,null,null,null,null,"DESONERADO","NÃO DESONER.","DESONERADO","NÃO DESONER."]
[null,"COMPOSIÇÃO","COMP 237_SEE","FITA ANTICORROSIVA","M",null,null,null,11.73,12.45]
[null,"AGETOP_I",8,"AJUDANTE","h     ",0.2,8.75,10.14,1.75,2.0299999999999998]
[null,"AGETOP_I",12,"ELETRICISTA","h     ",0.2,13.95,16.16,2.79,3.23]
[null,"MÃO DE OBRA (B) - TOTAL",null,null,null,null,null,null,4.54,5.26]
[null,"SINAPI_I",39634,"FITA ADESIVA ANTICORROSIVA DE PVC FLEXIVEL, COR PRETA, PARA PROTECAO TUBULACAO, 50 MM X 30 M (L X C), E= *0,25* MM","M     ",1,7.19,7.19,7.19,7.19]
[null,"MATERIAL (C) - TOTAL",null,null,null,null,null,null,7.19,7.19]
[]
[542,"FONTE","CÓDIGO","DESCRIÇÃO","UNIDADE","COEFIC.","CUSTO UNITÁRIO",null,"CUSTO  TOTAL (A) + (B) + (C) + (D) + (E)"]
[null,null,null,null,null,null,"DESONERADO","NÃO DESONER.","DESONERADO","NÃO DESONER."]
[null,"COMPOSIÇÃO","COMP 542_SEE","VÁLVULA UGV 3/4\" (S) LATÃO","UN ",null,null,null,25.65,27.2]
[null,"AGETOP_I",8,"AJUDANTE","h     ",0.432,8.75,10.14,3.78,4.38]
[null,"AGETOP_I",11,"ENCANADOR","h     ",0.432,13.95,16.16,6.03,6.98]
[null,"MÃO DE OBRA (B) - TOTAL",null,null,null,null,null,null,9.81,11.36]
[null,"COTAÇÃO","COT 281_SEE","VÁLVULA UGV 3/4\" (S) LATÃO","UN ",1,15.836666666666666,15.836666666666666,15.84,15.84]
[null,"MATERIAL (C) - TOTAL",null,null,null,null,null,null,15.84,15.84]
[]
[543,"FONTE","CÓDIGO","DESCRIÇÃO","UNIDADE","COEFIC.","CUSTO UNITÁRIO",null,"CUSTO  TOTAL (A) + (B) + (C) + (D) + (E)"]
[null,null,null,null,null,null,"DESONERADO","NÃO DESONER.","DESONERADO","NÃO DESONER."]
[null,"COMPOSIÇÃO","COMP 543_SEE","VÁLVULA UGV 1/2\" (S) LATÃO","UN ",null,null,null,24.98,26.53]
[null,"AGETOP_I",8,"AJUDANTE","h     ",0.432,8.75,10.14,3.78,4.38]
[null,"AGETOP_I",11,"ENCANADOR","h     ",0.432,13.95,16.16,6.03,6.98]
[null,"MÃO DE OBRA (B) - TOTAL",null,null,null,null,null,null,9.81,11.36]
[null,"COTAÇÃO","COT 282_SEE","VÁLVULA UGV 1/2\" (S) LATÃO","UN ",1,15.166666666666666,15.166666666666666,15.17,15.17]
[null,"MATERIAL (C) - TOTAL",null,null,null,null,null,null,15.17,15.17]
[]
[211,"FONTE","CÓDIGO","DESCRIÇÃO","UNIDADE","COEFIC.","CUSTO UNITÁRIO",null,"CUSTO  TOTAL (A) + (B) + (C) + (D) + (E)"]
[null,null,null,null,null,null,"DESONERADO","NÃO DESONER.","DESONERADO","NÃO DESONER."]
[null,"COMPOSIÇÃO","COMP 211_SEE","REGULADOR DE 2º ESTÁGIO 5KG/H","UN ",null,null,null,85.93,90.07]
[null,"AGETOP_I",8,"AJUDANTE","h     ",1.1499999999999999,8.75,10.14,10.06,11.66]
[null,"AGETOP_I",11,"ENCANADOR","h     ",1.1499999999999999,13.95,16.16,16.04,18.579999999999998]
[null,"MÃO DE OBRA (B) - TOTAL",null,null,null,null,null,null,26.1,30.24]
[null,"COTAÇÃO","COT 102_SEE","REGULADOR DE 2º ESTÁGIO 5KG/H","UN",1,59.833333333333336,59.833333333333336,59.83,59.83]
[null,"AGETOP_I","H689","","",2.82,0,0,0,0]
[null,"MATERIAL (C) - TOTAL",null,null,null,null,null,null,59.83,59.83]
[]
[210,"FONTE","CÓDIGO","DESCRIÇÃO","UNIDADE","COEFIC.","CUSTO UNITÁRIO",null,"CUSTO  TOTAL (A) + (B) + (C) + (D) + (E)"]
[null,null,null,null,null,null,"DESONERADO","NÃO DESONER.","DESONERADO","NÃO DESONER."]
[null,"COMPOSIÇÃO","COMP 210_SEE","REGULADOR DE 1º ESTÁGIO 60KG/H MODELO AP-40  COM MANÔMETRO","UN ",null,null,null,231.68,235.82000000000002]
[null,"AGETOP_I",8,"AJUDANTE","h     ",1.1499999999999999,8.75,10.14,10.06,11.66]
[null,"AGETOP_I",11,"ENCANADOR","h     ",1.1499999999999999,13.95,16.16,16.04,18.579999999999998]
[null,"MÃO DE OBRA (B) - TOTAL",null,null,null,null,null,null,26.1,30.24]
[null,"COTAÇÃO","COT 101_SEE","REGULADOR DE 1º ESTÁGIO 60KG/H MODELO AP-40  COM MANÔMETRO","UN",1,205.57666666666668,205.57666666666668,205.58,205.58]
[null,"AGETOP_I","H689","","",2.82,0,0,0,0]
[null,"MATERIAL (C) - TOTAL",null,null,null,null,null,null,205.58,205.58]
[]
[235,"FONTE","CÓDIGO","DESCRIÇÃO","UNIDADE","COEFIC.","CUSTO UNITÁRIO",null,"CUSTO  TOTAL (A) + (B) + (C) + (D) + (E)"]
[null,null,null,null,null,null,"DESONERADO","NÃO DESONER.","DESONERADO","NÃO DESONER."]
[null,"COMPOSIÇÃO","COMP 235_SEE","PLACA DE SINALIZAÇÃO EM PVC COD 01 - (300X300) PROIBIDO FUMAR","UN ",null,null,null,24.159999999999997,24.279999999999998]
[null,"AGETOP_I",5,"SERVENTE","h     ",0.09,8.75,10.14,0.79,0.91]
[null,"MÃO DE OBRA (B) - TOTAL",null,null,null,null,null,null,0.79,0.91]
[null,"AGETOP_I",3070,"BUCHA DE NYLON S-6","un",2,0.04,0.04,0.08,0.08]
[null,"AGETOP_I",3393,"PARAFUSO P/BUCHA S-6","un",2,0.08,0.08,0.16,0.16]
[null,"SINAPI_I",37556,"PLACA DE SINALIZACAO DE SEGURANCA CONTRA INCENDIO, FOTOLUMINESCENTE, QUADRADA, *20 X 20* CM, EM PVC *2* MM ANTI-CHAMAS (SIMBOLOS, CORES E PICTOGRAMAS CONFORME NBR 13434)","UN    ",1,23.13,23.13,23.13,23.13]
[null,"MATERIAL (C) - TOTAL",null,null,null,null,null,null,23.369999999999997,23.369999999999997]
[]
[236,"FONTE","CÓDIGO","DESCRIÇÃO","UNIDADE","COEFIC.","CUSTO UNITÁRIO",null,"CUSTO  TOTAL (A) + (B) + (C) + (D) + (E)"]
[null,null,null,null,null,null,"DESONERADO","NÃO DESONER.","DESONERADO","NÃO DESONER."]
[null,"COMPOSIÇÃO","COMP 236_SEE","PLACA DE SINALIZAÇÃO EM PVC COD 06 - (300X300) PERIGO INFLAMÁVEL","UN ",null,null,null,24.159999999999997,24.279999999999998]
[null,"AGETOP_I",5,"SERVENTE","h     ",0.09,8.75,10.14,0.79,0.91]
[null,"MÃO DE OBRA (B) - TOTAL",null,null,null,null,null,null,0.79,0.91]
[null,"AGETOP_I",3070,"BUCHA DE NYLON S-6","un",2,0.04,0.04,0.08,0.08]
[null,"AGETOP_I",3393,"PARAFUSO P/BUCHA S-6","un",2,0.08,0.08,0.16,0.16]
[null,"SINAPI_I",37556,"PLACA DE SINALIZACAO DE SEGURANCA CONTRA INCENDIO, FOTOLUMINESCENTE, QUADRADA, *20 X 20* CM, EM PVC *2* MM ANTI-CHAMAS (SIMBOLOS, CORES E PICTOGRAMAS CONFORME NBR 13434)","UN    ",1,23.13,23.13,23.13,23.13]
[null,"MATERIAL (C) - TOTAL",null,null,null,null,null,null,23.369999999999997,23.369999999999997]
[]
[45,"FONTE","CÓDIGO","DESCRIÇÃO","UNIDADE","COEFIC.","CUSTO UNITÁRIO",null,"CUSTO  TOTAL (A) + (B) + (C) + (D) + (E)"]
[null,null,null,null,null,null,"DESONERADO","NÃO DESONER.","DESONERADO","NÃO DESONER."]
[null,"COMPOSIÇÃO","COMP 045_SEE","LAUDO DE ESTANQUEIDADE","UN ",null,null,null,936,1085.1199999999999]
[null,"AGETOP",250101,"ENGENHEIRO - (OBRAS CIVIS)","H     ",16,58.5,67.819999999999993,936,1085.1199999999999]
[null,"MÃO DE OBRA (B) - TOTAL",null,null,null,null,null,null,936,1085.1199999999999]
[null,"MATERIAL (C) - TOTAL",null,null,null,null,null,null,0,0]
[]
[547,"FONTE","CÓDIGO","DESCRIÇÃO","UNID ","COEFIC.","CUSTO UNITÁRIO",null,"CUSTO  TOTAL (A) + (B) + (C) + (D) + (E)"]
[null,null,null,null,null,null,"DESONERADO","NÃO DESONER.","DESONERADO","NÃO DESONER."]
[null,"COMPOSIÇÃO","COMP 547_SEE","BOMBA THSI-18 6CV","UN ","-","-","-",3632.54,3661.34]
[null,"AGETOP_I",8,"AJUDANTE","h     ",8,8.75,10.14,70,81.12]
[null,"AGETOP_I",12,"ELETRICISTA","h     ",8,13.95,16.16,111.6,129.28]
[null,"MÃO DE OBRA (B) - TOTAL",null,null,null,null,null,null,181.6,210.4]
[null,"COTAÇÃO","COT 289_SEE","BOMBA THSI-18 6CV","UN ",1,3450.94,3450.94,3450.94,3450.94]
[null,"MATERIAL (C) - TOTAL",null,null,null,null,null,null,3450.94,3450.94]
[]
[17,"FONTE","CÓDIGO","DESCRIÇÃO","UNIDADE","COEFIC.","CUSTO UNITÁRIO",null,"CUSTO  TOTAL (A) + (B) + (C) + (D) + (E)"]
[null,null,null,null,null,null,"DESONERADO","NÃO DESONER.","DESONERADO","NÃO DESONER."]
[null,"COMPOSIÇÃO","COMP 017_SEE","REDUCAO GIRATÓRIA TIPO STORZ LATAO P/ INST. PREDIAL COMBATE A INCENDIO ENGATE RAPIDO 2.1/2\" X 1.1/2\"","UN ",null,"-","-",108.61999999999999,109.19999999999999]
[null,"AGETOP_I",8,"AJUDANTE","h     ",0.16,8.75,10.14,1.4,1.62]
[null,"AGETOP_I",11,"ENCANADOR","h     ",0.16,13.95,16.16,2.23,2.59]
[null,"MÃO DE OBRA (B) - TOTAL",null,null,null,null,null,null,3.63,4.21]
[null,"SINAPI_I",20972,"REDUCAO FIXA TIPO STORZ, ENGATE RAPIDO 2.1/2\" X 1.1/2\", EM LATAO, PARA INSTALACAO PREDIAL COMBATE A INCENDIO PREDIAL","UN    ",1,104.99,104.99,104.99,104.99]
[null,"MATERIAL (C) - TOTAL",null,null,null,null,null,null,104.99,104.99]
[]
[18,"FONTE","CÓDIGO","DESCRIÇÃO","UNIDADE","COEFIC.","CUSTO UNITÁRIO",null,"CUSTO  TOTAL (A) + (B) + (C) + (D) + (E)"]
[null,null,null,null,null,null,"DESONERADO","NÃO DESONER.","DESONERADO","NÃO DESONER."]
[null,"COMPOSIÇÃO","COMP 018_SEE","CHAVE DUPLA P/ CONEXÕES TIPO STORZ EM LATÃO ENGATE RÁPIDO 1 1/2\" X 2 1/2\"","UN ",null,"-","-",16.079999999999998,16.41]
[null,"AGETOP_I",11,"ENCANADOR","h     ",0.15,13.95,16.16,2.09,2.42]
[null,"MÃO DE OBRA (B) - TOTAL",null,null,null,null,null,null,2.09,2.42]
[null,"SINAPI_I",20971,"CHAVE DUPLA PARA CONEXOES TIPO STORZ, ENGATE RAPIDO 1 1/2\" X 2 1/2\", EM LATAO, PARA INSTALACAO PREDIAL COMBATE A INCENDIO","UN    ",1,13.99,13.99,13.99,13.99]
[null,"MATERIAL (C) - TOTAL",null,null,null,null,null,null,13.99,13.99]
[]
[87,"FONTE","CÓDIGO","DESCRIÇÃO","UNIDADE","COEFIC.","CUSTO UNITÁRIO",null,"CUSTO  TOTAL (A) + (B) + (C) + (D) + (E)"]
[null,null,null,null,null,null,"DESONERADO","NÃO DESONER.","DESONERADO","NÃO DESONER."]
[null,"COMPOSIÇÃO","COMP 087_SEE","REGISTRO DE GAVETA COM HASTE ASCENDENTE DE BRONZE 2 1/2\"","UN ",null,null,null,257.77,261.90999999999997]
[null,"AGETOP_I",8,"AJUDANTE","h     ",1.1499999999999999,8.75,10.14,10.06,11.66]
[null,"AGETOP_I",11,"ENCANADOR","h     ",1.1499999999999999,13.95,16.16,16.04,18.579999999999998]
[null,"MÃO DE OBRA (B) - TOTAL",null,null,null,null,null,null,26.1,30.24]
[null,"AGETOP_I","H689","","",2.82,0,0,0,0]
[null,"COTAÇÃO","COT 017_SEE","REGISTRO DE GAVETA COM HASTE ASCENDENTE DE BRONZE 2 1/2\"","UN ",1,231.66666666666666,231.66666666666666,231.67,231.67]
[null,"MATERIAL (C) - TOTAL",null,null,null,null,null,null,231.67,231.67]
[]
[30,"FONTE","CÓDIGO","DESCRIÇÃO","UNIDADE","COEFIC.","CUSTO UNITÁRIO",null,"CUSTO  TOTAL (A) + (B) + (C) + (D) + (E)"]
[null,null,null,null,null,null,"DESONERADO","NÃO DESONER.","DESONERADO","NÃO DESONER."]
[null,"COMPOSIÇÃO","COMP 030_SEE","COTOVELO DE FERRO GALV. 90° X 2 1/2\"","UN ",null,null,null,69.61,72.929999999999993]
[null,"AGETOP_I",8,"AJUDANTE","h     ",0.92,8.75,10.14,8.0500000000000007,9.33]
[null,"AGETOP_I",11,"ENCANADOR","h     ",0.92,13.95,16.16,12.83,14.87]
[null,"MÃO DE OBRA (B) - TOTAL",null,null,null,null,null,null,20.880000000000003,24.2]
[null,"SINAPI_I",3470,"COTOVELO 90 GRAUS DE FERRO GALVANIZADO, COM ROSCA BSP, DE 2 1/2\"","UN    ",1,48.73,48.73,48.73,48.73]
[null,"AGETOP_I","H689","","",2,0,0,0,0]
[null,"MATERIAL (C) - TOTAL",null,null,null,null,null,null,48.73,48.73]
[]
[77,"FONTE","CÓDIGO","DESCRIÇÃO","UNIDADE","COEFIC.","CUSTO UNITÁRIO",null,"CUSTO  TOTAL (A) + (B) + (C) + (D) + (E)"]
[null,null,null,null,null,null,"DESONERADO","NÃO DESONER.","DESONERADO","NÃO DESONER."]
[null,"COMPOSIÇÃO","COMP 077_SEE","UNIAO FERRO GALV C/ASSENTO CONICO BRONZE 2 1/2\"","UN ",null,null,null,148.07000000000002,149.51000000000002]
[null,"AGETOP_I",8,"AJUDANTE","h     ",0.4,8.75,10.14,3.5,4.0599999999999996]
[null,"AGETOP_I",11,"ENCANADOR","h     ",0.4,13.95,16.16,5.58,6.46]
[null,"MÃO DE OBRA (B) - TOTAL",null,null,null,null,null,null,9.08,10.52]
[null,"AGETOP_I","H689","","",2.4,0,0,0,0]
[null,"SINAPI_I",12427,"UNIAO COM ASSENTO CONICO DE BRONZE, DIAMETRO 2 1/2\"","UN    ",1,138.99,138.99,138.99,138.99]
[null,"MATERIAL (C) - TOTAL",null,null,null,null,null,null,138.99,138.99]
[]
[347,"FONTE","CÓDIGO","DESCRIÇÃO","UNIDADE","COEFIC.","CUSTO UNITÁRIO",null,"CUSTO  TOTAL (A) + (B) + (C) + (D) + (E)"]
[null,null,null,null,null,null,"DESONERADO","NÃO DESONER.","DESONERADO","NÃO DESONER."]
[null,"COMPOSIÇÃO","COMP 347_SEE","ADAPTADOR PVC SOLDAVEL, COM FLANGES LIVRES, 75 MM X 2 1/2\", PARA CAIXA D' AGUA","UN ",null,null,null,120.25,120.75]
[null,"AGETOP_I",11,"ENCANADOR","h     ",0.14000000000000001,13.95,16.16,1.95,2.2599999999999998]
[null,"AGETOP_I",8,"AJUDANTE","h     ",0.14000000000000001,8.75,10.14,1.23,1.42]
[null,"MÃO DE OBRA (B) - TOTAL",null,null,null,null,null,null,3.1799999999999997,3.6799999999999997]
[null,"SINAPI_I",83,"ADAPTADOR PVC SOLDAVEL, COM FLANGES LIVRES, 75 MM X 2  1/2\", PARA CAIXA D' AGUA","UN    ",1,117.07,117.07,117.07,117.07]
[null,"AGETOP_I","H689","","",1.88,0,0,0,0]
[null,"MATERIAL (C) - TOTAL",null,null,null,null,null,null,117.07,117.07]
[]
[22,"FONTE","CÓDIGO","DESCRIÇÃO","UNIDADE","COEFIC.","CUSTO UNITÁRIO",null,"CUSTO  TOTAL (A) + (B) + (C) + (D) + (E)"]
[null,null,null,null,null,null,"DESONERADO","NÃO DESONER.","DESONERADO","NÃO DESONER."]
[null,"COMPOSIÇÃO","COMP 022_SEE","TAMPÃO FOFO 40X50CM C/INSCRIÇÃO ","UN ",null,"-","-",198.75,199.07999999999998]
[null,"AGETOP_I",11,"ENCANADOR","h     ",0.15,13.95,16.16,2.09,2.42]
[null,"MÃO DE OBRA (B) - TOTAL",null,null,null,null,null,null,2.09,2.42]
[null,"SINAPI_I",11293,"TAMPAO FOFO SIMPLES COM BASE, CLASSE A15 CARGA MAX 1,5 T, 400 X 500 MM, COM INSCRICAO INCENDIO","UN    ",1,196.66,196.66,196.66,196.66]
[null,"MATERIAL (C) - TOTAL",null,null,null,null,null,null,196.66,196.66]
[]
[546,"FONTE","CÓDIGO","DESCRIÇÃO","UNID ","COEFIC.","CUSTO UNITÁRIO",null,"CUSTO  TOTAL (A) + (B) + (C) + (D) + (E)"]
[null,null,null,null,null,null,"DESONERADO","NÃO DESONER.","DESONERADO","NÃO DESONER."]
[null,"COMPOSIÇÃO","COMP 546_SEE","BUJÃO DE REBORDO 2.1/2\"","UN ","-","-","-",16.59,16.84]
[null,"AGETOP_I",8,"AJUDANTE","h     ",7.0000000000000007E-2,8.75,10.14,0.61,0.71]
[null,"AGETOP_I",11,"ENCANADOR","h     ",7.0000000000000007E-2,13.95,16.16,0.98,1.1299999999999999]
[null,"MÃO DE OBRA (B) - TOTAL",null,null,null,null,null,null,1.5899999999999999,1.8399999999999999]
[null,"COTAÇÃO","COT 286_SEE","BUJÃO DE REBORDO 2.1/2\"","UN ",1,15,15,15,15]
[null,"MATERIAL (C) - TOTAL",null,null,null,null,null,null,15,15]
[]
[186,"FONTE","CÓDIGO","DESCRIÇÃO","UNIDADE","COEFIC.","CUSTO UNITÁRIO",null,"CUSTO  TOTAL (A) + (B) + (C) + (D) + (E)"]
[null,null,null,null,null,null,"DESONERADO","NÃO DESONER.","DESONERADO","NÃO DESONER."]
[null,"COMPOSIÇÃO","COMP 186_SEE","BOTOEIRA BOMBA DE INCÊNDIO C/ MARTELO CONVENCIONAL/ ANALÓGICA","UN ",null,null,null,86.2,89.8]
[null,"AGETOP_I",8,"AJUDANTE","h     ",1,8.75,10.14,8.75,10.14]
[null,"AGETOP_I",12,"ELETRICISTA","h     ",1,13.95,16.16,13.95,16.16]
[null,"MÃO DE OBRA (B) - TOTAL",null,null,null,null,null,null,22.7,26.3]
[null,"COTAÇÃO","COT 088_SEE","BOTOEIRA BOMBA DE INCÊNDIO C/ MARTELO CONVENCIONAL/ ANALÓGICA","UN",1,63.5,63.5,63.5,63.5]
[null,"MATERIAL (C) - TOTAL",null,null,null,null,null,null,63.5,63.5]
[]
[188,"FONTE","CÓDIGO","DESCRIÇÃO","UNIDADE","COEFIC.","CUSTO UNITÁRIO",null,"CUSTO  TOTAL (A) + (B) + (C) + (D) + (E)"]
[null,null,null,null,null,null,"DESONERADO","NÃO DESONER.","DESONERADO","NÃO DESONER."]
[null,"COMPOSIÇÃO","COMP 188_SEE","ACIONADOR MANUAL DE ALARME","UN ",null,null,null,101.49,104.37]
[null,"AGETOP_I",8,"AJUDANTE","h     ",0.8,8.75,10.14,7,8.11]
[null,"AGETOP_I",12,"ELETRICISTA","h     ",0.8,13.95,16.16,11.16,12.93]
[null,"MÃO DE OBRA (B) - TOTAL",null,null,null,null,null,null,18.16,21.04]
[null,"COTAÇÃO","COT 090_SEE","ACIONADOR MANUAL DE ALARME","UN",1,83.333333333333329,83.333333333333329,83.33,83.33]
[null,"MATERIAL (C) - TOTAL",null,null,null,null,null,null,83.33,83.33]
[]
[190,"FONTE","CÓDIGO","DESCRIÇÃO","UNIDADE","COEFIC.","CUSTO UNITÁRIO",null,"CUSTO  TOTAL (A) + (B) + (C) + (D) + (E)"]
[null,null,null,null,null,null,"DESONERADO","NÃO DESONER.","DESONERADO","NÃO DESONER."]
[null,"COMPOSIÇÃO","COMP 190_SEE","CENTRAL DE DETECÇÃO E ALARME DE 40 SETORES COM BATERIA","UN ",null,null,null,1144.93,1173.73]
[null,"AGETOP_I",8,"AJUDANTE","h     ",8,8.75,10.14,70,81.12]
[null,"AGETOP_I",12,"ELETRICISTA","h     ",8,13.95,16.16,111.6,129.28]
[null,"MÃO DE OBRA (B) - TOTAL",null,null,null,null,null,null,181.6,210.4]
[null,"COTAÇÃO","COT 092_SEE","CENTRAL DE DETECÇÃO E ALARME DE 40 SETORES COM BATERIA (PREÇO MÉDIO)","UN",1,963.33333333333337,963.33333333333337,963.33,963.33]
[null,"MATERIAL (C) - TOTAL",null,null,null,null,null,null,963.33,963.33]
[]
[24,"FONTE","CÓDIGO","DESCRIÇÃO","UNIDADE","COEFIC.","CUSTO UNITÁRIO",null,"CUSTO  TOTAL (A) + (B) + (C) + (D) + (E)"]
[null,null,null,null,null,null,"DESONERADO","NÃO DESONER.","DESONERADO","NÃO DESONER."]
[null,"COMPOSIÇÃO","COMP 024_SEE","SINALIZADOR FOTOLUMINESCENTE PARA EXTINTOR","UN ",null,"-","-",24.159999999999997,24.279999999999998]
[null,"AGETOP_I",5,"SERVENTE","h     ",0.09,8.75,10.14,0.79,0.91]
[null,"MÃO DE OBRA (B) - TOTAL",null,null,null,null,null,null,0.79,0.91]
[null,"AGETOP_I",3070,"BUCHA DE NYLON S-6","un",2,0.04,0.04,0.08,0.08]
[null,"AGETOP_I",3393,"PARAFUSO P/BUCHA S-6","un",2,0.08,0.08,0.16,0.16]
[null,"SINAPI_I",37556,"PLACA DE SINALIZACAO DE SEGURANCA CONTRA INCENDIO, FOTOLUMINESCENTE, QUADRADA, *20 X 20* CM, EM PVC *2* MM ANTI-CHAMAS (SIMBOLOS, CORES E PICTOGRAMAS CONFORME NBR 13434)","UN    ",1,23.13,23.13,23.13,23.13]
[null,"MATERIAL (C) - TOTAL",null,null,null,null,null,null,23.369999999999997,23.369999999999997]
[]
[25,"FONTE","CÓDIGO","DESCRIÇÃO","UNIDADE","COEFIC.","CUSTO UNITÁRIO",null,"CUSTO  TOTAL (A) + (B) + (C) + (D) + (E)"]
[null,null,null,null,null,null,"DESONERADO","NÃO DESONER.","DESONERADO","NÃO DESONER."]
[null,"COMPOSIÇÃO","COMP 025_SEE","SINALIZADOR FOTOLUMINESCENTE DE EMERGÊNCIA","UN ",null,"-","-",24.159999999999997,24.279999999999998]
[null,"AGETOP_I",5,"SERVENTE","h     ",0.09,8.75,10.14,0.79,0.91]
[null,"MÃO DE OBRA (B) - TOTAL",null,null,null,null,null,null,0.79,0.91]
[null,"AGETOP_I",3070,"BUCHA DE NYLON S-6","un",2,0.04,0.04,0.08,0.08]
[null,"AGETOP_I",3393,"PARAFUSO P/BUCHA S-6","un",2,0.08,0.08,0.16,0.16]
[null,"SINAPI_I",37556,"PLACA DE SINALIZACAO DE SEGURANCA CONTRA INCENDIO, FOTOLUMINESCENTE, QUADRADA, *20 X 20* CM, EM PVC *2* MM ANTI-CHAMAS (SIMBOLOS, CORES E PICTOGRAMAS CONFORME NBR 13434)","UN    ",1,23.13,23.13,23.13,23.13]
[null,"MATERIAL (C) - TOTAL",null,null,null,null,null,null,23.369999999999997,23.369999999999997]
[]
[277,"FONTE","CÓDIGO","DESCRIÇÃO","UNIDADE","COEFIC.","CUSTO UNITÁRIO",null,"CUSTO  TOTAL (A) + (B) + (C) + (D) + (E)"]
[null,null,null,null,null,null,"DESONERADO","NÃO DESONER.","DESONERADO","NÃO DESONER."]
[null,"COMPOSIÇÃO","COMP 277_SEE","MARCAÇÃO NO PISO - 1X1 M PARA EXTINTOR","M2",null,null,null,29.07,29.14]
[null,"AGETOP_I",5,"SERVENTE","h     ",3.3300000000000003E-2,8.75,10.14,0.28999999999999998,0.34]
[null,"MÃO DE OBRA (B) - TOTAL",null,null,null,null,null,null,0.28999999999999998,0.34]
[null,"SINAPI_I",5318,"SOLVENTE DILUENTE A BASE DE AGUARRAS","L     ",0.13,10.86,10.86,1.41,1.41]
[null,"SINAPI",5824,"CAMINHÃO TOCO, PBT 16.000 KG, CARGA ÚTIL MÁX. 10.685 KG, DIST. ENTRE EIXOS 4,8 M, POTÊNCIA 189 CV, INCLUSIVE CARROCERIA FIXA ABERTA DE MADEIRA P/ TRANSPORTE GERAL DE CARGA SECA, DIMEN. APROX. 2,5 X 7,00 X 0,50 M - CHP DIURNO. AF_06/2014","CHP",3.3E-3,122.23,125.42,0.4,0.41]
[null,"SINAPI_I",7343,"TINTA A BASE DE RESINA ACRILICA, PARA SINALIZACAO HORIZONTAL VIARIA (NBR 11862)","L     ",0.6,12,12,7.2,7.2]
[null,"SINAPI_I",7348,"TINTA ACRILICA PREMIUM PARA PISO","L     ",0.03,13.81,13.81,0.41,0.41]
[null,"SINAPI_I",25972,"MICROESFERAS DE VIDRO PARA SINALIZACAO HORIZONTAL VIARIA, TIPO I-B (PREMIX) - NBR 16184","KG    ",2.14,8.8800000000000008,8.8800000000000008,19,19]
[null,"SINAPI",95133,"MÁQUINA DEMARCADORA DE FAIXA DE TRÁFEGO À FRIO, AUTOPROPELIDA, POTÊNCIA 38 HP - CHP DIURNO. AF_07/2016","CHP",3.3E-3,108.52,112.07,0.36,0.37]
[null,"MATERIAL (C) - TOTAL",null,null,null,null,null,null,28.78,28.8]
[]
[235,"FONTE","CÓDIGO","DESCRIÇÃO","UNIDADE","COEFIC.","CUSTO UNITÁRIO",null,"CUSTO  TOTAL (A) + (B) + (C) + (D) + (E)"]
[null,null,null,null,null,null,"DESONERADO","NÃO DESONER.","DESONERADO","NÃO DESONER."]
[null,"COMPOSIÇÃO","COMP 235_SEE","PLACA DE SINALIZAÇÃO EM PVC COD 01 - (300X300) PROIBIDO FUMAR","UN ",null,null,null,24.159999999999997,24.279999999999998]
[null,"AGETOP_I",5,"SERVENTE","h     ",0.09,8.75,10.14,0.79,0.91]
[null,"MÃO DE OBRA (B) - TOTAL",null,null,null,null,null,null,0.79,0.91]
[null,"AGETOP_I",3070,"BUCHA DE NYLON S-6","un",2,0.04,0.04,0.08,0.08]
[null,"AGETOP_I",3393,"PARAFUSO P/BUCHA S-6","un",2,0.08,0.08,0.16,0.16]
[null,"SINAPI_I",37556,"PLACA DE SINALIZACAO DE SEGURANCA CONTRA INCENDIO, FOTOLUMINESCENTE, QUADRADA, *20 X 20* CM, EM PVC *2* MM ANTI-CHAMAS (SIMBOLOS, CORES E PICTOGRAMAS CONFORME NBR 13434)","UN    ",1,23.13,23.13,23.13,23.13]
[null,"MATERIAL (C) - TOTAL",null,null,null,null,null,null,23.369999999999997,23.369999999999997]
[]
[236,"FONTE","CÓDIGO","DESCRIÇÃO","UNIDADE","COEFIC.","CUSTO UNITÁRIO",null,"CUSTO  TOTAL (A) + (B) + (C) + (D) + (E)"]
[null,null,null,null,null,null,"DESONERADO","NÃO DESONER.","DESONERADO","NÃO DESONER."]
[null,"COMPOSIÇÃO","COMP 236_SEE","PLACA DE SINALIZAÇÃO EM PVC COD 06 - (300X300) PERIGO INFLAMÁVEL","UN ",null,null,null,24.159999999999997,24.279999999999998]
[null,"AGETOP_I",5,"SERVENTE","h     ",0.09,8.75,10.14,0.79,0.91]
[null,"MÃO DE OBRA (B) - TOTAL",null,null,null,null,null,null,0.79,0.91]
[null,"AGETOP_I",3070,"BUCHA DE NYLON S-6","un",2,0.04,0.04,0.08,0.08]
[null,"AGETOP_I",3393,"PARAFUSO P/BUCHA S-6","un",2,0.08,0.08,0.16,0.16]
[null,"SINAPI_I",37556,"PLACA DE SINALIZACAO DE SEGURANCA CONTRA INCENDIO, FOTOLUMINESCENTE, QUADRADA, *20 X 20* CM, EM PVC *2* MM ANTI-CHAMAS (SIMBOLOS, CORES E PICTOGRAMAS CONFORME NBR 13434)","UN    ",1,23.13,23.13,23.13,23.13]
[null,"MATERIAL (C) - TOTAL",null,null,null,null,null,null,23.369999999999997,23.369999999999997]
[]
[411,"FONTE","CÓDIGO","DESCRIÇÃO","UNIDADE","COEFIC.","CUSTO UNITÁRIO",null,"CUSTO  TOTAL (A) + (B) + (C) + (D) + (E)"]
[null,null,null,null,null,null,"DESONERADO","NÃO DESONER.","DESONERADO","NÃO DESONER."]
[null,"COMPOSIÇÃO","COMP 411_SEE","PLACA DE SINALIZAÇÃO EM PVC COD 13 - (316X158) SAÍDA DE EMERGÊNCIA","UN ",null,null,null,29.4,29.52]
[null,"AGETOP_I",5,"SERVENTE","h     ",0.09,8.75,10.14,0.79,0.91]
[null,"MÃO DE OBRA (B) - TOTAL",null,null,null,null,null,null,0.79,0.91]
[null,"AGETOP_I",3070,"BUCHA DE NYLON S-6","un",2,0.04,0.04,0.08,0.08]
[null,"AGETOP_I",3393,"PARAFUSO P/BUCHA S-6","un",2,0.08,0.08,0.16,0.16]
[null,"SINAPI_I",37559,"PLACA DE SINALIZACAO DE SEGURANCA CONTRA INCENDIO, FOTOLUMINESCENTE, RETANGULAR, *12 X 40* CM, EM PVC *2* MM ANTI-CHAMAS (SIMBOLOS, CORES E PICTOGRAMAS CONFORME NBR 13434)","UN    ",1,28.37,28.37,28.37,28.37]
[null,"MATERIAL (C) - TOTAL",null,null,null,null,null,null,28.61,28.61]
[]
[412,"FONTE","CÓDIGO","DESCRIÇÃO","UNIDADE","COEFIC.","CUSTO UNITÁRIO",null,"CUSTO  TOTAL (A) + (B) + (C) + (D) + (E)"]
[null,null,null,null,null,null,"DESONERADO","NÃO DESONER.","DESONERADO","NÃO DESONER."]
[null,"COMPOSIÇÃO","COMP 412_SEE","PLACA DE SINALIZAÇÃO EM PVC COD 17 - (316X158) MENSAGEM \"SAÍDA\"","UN ",null,null,null,29.4,29.52]
[null,"AGETOP_I",5,"SERVENTE","h     ",0.09,8.75,10.14,0.79,0.91]
[null,"MÃO DE OBRA (B) - TOTAL",null,null,null,null,null,null,0.79,0.91]
[null,"AGETOP_I",3070,"BUCHA DE NYLON S-6","un",2,0.04,0.04,0.08,0.08]
[null,"AGETOP_I",3393,"PARAFUSO P/BUCHA S-6","un",2,0.08,0.08,0.16,0.16]
[null,"SINAPI_I",37559,"PLACA DE SINALIZACAO DE SEGURANCA CONTRA INCENDIO, FOTOLUMINESCENTE, RETANGULAR, *12 X 40* CM, EM PVC *2* MM ANTI-CHAMAS (SIMBOLOS, CORES E PICTOGRAMAS CONFORME NBR 13434)","UN    ",1,28.37,28.37,28.37,28.37]
[null,"MATERIAL (C) - TOTAL",null,null,null,null,null,null,28.61,28.61]
[]
[82,"FONTE","CÓDIGO","DESCRIÇÃO","UNIDADE","COEFIC.","CUSTO UNITÁRIO",null,"CUSTO  TOTAL (A) + (B) + (C) + (D) + (E)"]
[null,null,null,null,null,null,"DESONERADO","NÃO DESONER.","DESONERADO","NÃO DESONER."]
[null,"COMPOSIÇÃO","COMP 082_SEE","CORRIMÃO PAREDE - SEDUC","M",null,null,null,121.38,125.41]
[null,"AGETOP_I",25,"OFICIAL \"B\"","h     ",1,13.95,16.16,13.95,16.16]
[null,"AGETOP_I",8,"AJUDANTE","h     ",1,8.75,10.14,8.75,10.14]
[null,"MÃO DE OBRA (B) - TOTAL",null,null,null,null,null,null,22.7,26.3]
[null,"AGETOP_I",2376,"TUBO INDUSTRIAL 2\" CHAPA 13 ","Kg",5.5247999999999999,5.23,5.23,28.89,28.89]
[null,"AGETOP_I",2504,"TUBO INDUSTRIAL D=25 MM CHAPA 13 ","Kg",1.1000000000000001,5.07,5.07,5.58,5.58]
[null,"AGETOP_I",2417,"MASSA PLASTICA","Kg",0.2041,10.58,10.58,2.16,2.16]
[null,"AGETOP_I",2246,"ELETRODO 2.5 OK","Kg",0.11459999999999999,8.6999999999999993,8.6999999999999993,1,1]
[null,"AGETOP_I",1672,"LIXA PARA FERRO ( NÚMERO 100 )","un",0.125,2.12,2.12,0.27,0.27]
[null,"AGETOP_I",1264,"DISCO DE DESBASTE 7/8\" P/ CONC./FERRO (1/4\" X 7\")","un",2.5000000000000001E-2,7,7,0.18,0.18]
[null,"AGETOP_I",1334,"DISCO DE CORTE DIAM. 5/8\"- 10\"","un",0.1865,5.5,5.5,1.03,1.03]
[null,"AGETOP_I",2902,"FABRICAÇÃO / MONTAGEM","un",1,50.44,50.44,50.44,50.44]
[null,"AGETOP_I",2719,"CHAPA PERFILADA 3/16\"","Kg",0.72,5.04,5.04,3.63,3.63]
[null,"AGETOP_I",2436,"ACO CA-25 - 6,3 MM (1/4\") - BARRA LISA A-36","Kg",0.25,5.13,5.13,1.28,1.28]
[null,"AGETOP",261602,"PINT.ESMALTE/ESQUAD.FERRO C/FUNDO ANTICOR.","m2    ",0.3,14.07,15.51,4.22,4.6500000000000004]
[null,"MATERIAL (C) - TOTAL",null,null,null,null,null,null,98.679999999999993,99.11]
[]
[27,"FONTE","CÓDIGO","DESCRIÇÃO","UNIDADE","COEFIC.","CUSTO UNITÁRIO",null,"CUSTO  TOTAL (A) + (B) + (C) + (D) + (E)"]
[null,null,null,null,null,null,"DESONERADO","NÃO DESONER.","DESONERADO","NÃO DESONER."]
[null,"COMPOSIÇÃO","COMP 027_SEE","TELA MOSQUITEIRA EM NYLON COM ESTRUTURA DE ALUMÍNIO, COM FORNECIMENTO DE MÃO DE OBRA E INSTALAÇÃO","M2",null,null,null,123.21,123.21]
[null,"MÃO DE OBRA (B) - TOTAL",null,null,null,null,null,null,0,0]
[null,"COTAÇÃO","COT 002_SEE","TELA MOSQUITEIRA EM NYLON COM ESTRUTURA DE ALUMÍNIO [M²], COM FORNECIMENTO DE MÃO DE OBRA E INSTALAÇÃO","M2",1,123.21333333333332,123.21333333333332,123.21,123.21]
[null,"MATERIAL (C) - TOTAL",null,null,null,null,null,null,123.21,123.21]
[]
[86,"FONTE","CÓDIGO","DESCRIÇÃO","UNIDADE","COEFIC.","CUSTO UNITÁRIO",null,"CUSTO  TOTAL (A) + (B) + (C) + (D) + (E)"]
[null,null,null,null,null,null,"DESONERADO","NÃO DESONER.","DESONERADO","NÃO DESONER."]
[null,"COMPOSIÇÃO","COMP 086_SEE","ELEVADOR (PLATAFORMA VERTICAL) MODELO HERA OU EQUIVALENTE 02 PARADAS - CAPACIDADE 280KG (INSTALADO)","UN ",null,null,null,37873.33,37873.33]
[null,"MÃO DE OBRA (B) - TOTAL",null,null,null,null,null,null,0,0]
[null,"COTAÇÃO","COT 016_SEE","ELEVADOR (PLATAFORMA VERTICAL) MODELO HERA OU EQUIVALENTE 02 PARADAS - CAPACIDADE 280KG (INSTALADO)","UN ",1,37873.333333333336,37873.333333333336,37873.33,37873.33]
[null,"MATERIAL (C) - TOTAL",null,null,null,null,null,null,37873.33,37873.33]