{"text_format":"1","workbook":"xlsx","n_sheets":8,"sheets":["Orçamento","Resumo ","Somatório","Cronog_120_Dias","Composição BDI","Relatório CENTRAL","Parc Maior Relev","Composições"],"not_rendered":{"charts":0,"images":4,"macros":1,"external_links":0,"defined_names":80,"comments":0,"pivot_tables":0},"unopened":[],"bounds":{"document_bytes":16777216,"sheet_cells":100000,"rows_first":2000,"rows_last":500,"rows_between":2000,"halvings":0,"cell_chars":16384,"cell_head_chars":4096},"cells_cut":0,"cells_raw":0,"read":"whole","date_system":"1900"}

{"sheet":"Orçamento","index":0,"n_rows":808,"n_cols":24,"rows_kept":808,"cut":false,"hidden":false,"merged":[[743,16,743,22],[8,12,9,12],[778,18,778,20],[778,21,778,22],[0,14,0,22],[8,14,8,16],[9,14,9,16],[11,14,11,16],[12,14,12,16],[14,14,14,22],[1,14,1,22],[4,14,4,22],[7,14,7,22],[762,18,762,20],[762,21,762,22],[770,21,770,22],[759,15,759,17],[760,15,760,17],[761,15,761,17],[763,21,763,22],[771,18,771,20],[771,21,771,22],[769,18,769,20],[769,21,769,22],[777,18,777,20],[777,21,777,22],[764,18,764,20],[764,21,764,22],[757,18,757,20],[757,21,757,22],[779,18,779,20],[779,21,779,22],[733,20,733,21],[755,18,755,20],[755,21,755,22],[756,18,756,20],[756,21,756,22],[754,18,754,20],[754,21,754,22],[763,18,763,20],[734,20,734,21],[745,18,745,22],[751,18,751,20],[751,21,751,22],[752,18,752,20],[752,21,752,22],[753,18,753,20],[753,21,753,22],[776,18,776,20],[776,21,776,22],[773,21,773,22],[774,18,774,20],[774,21,774,22],[775,18,775,20],[775,21,775,22],[765,18,765,20],[765,21,765,22],[772,18,772,20],[772,21,772,22],[767,21,767,22],[768,18,768,20],[768,21,768,22],[770,18,770,20],[766,18,766,20],[766,21,766,22],[767,18,767,20],[771,15,771,17],[772,15,772,17],[773,15,773,17],[774,15,774,17],[775,15,775,17],[748,14,748,23],[737,20,737,21],[736,20,736,21],[732,17,737,17],[732,20,732,21],[749,18,749,20],[749,21,749,22],[750,18,750,20],[750,21,750,22],[738,20,738,21],[758,18,758,20],[758,21,758,22],[759,18,759,20],[759,21,759,22],[760,18,760,20],[760,21,760,22],[761,18,761,20],[761,21,761,22],[773,18,773,20],[750,15,750,17],[751,15,751,17],[752,15,752,17],[753,15,753,17],[754,15,754,17],[755,15,755,17],[756,15,756,17],[757,15,757,17],[758,15,758,17],[762,15,762,17],[763,15,763,17],[764,15,764,17],[765,15,765,17],[766,15,766,17],[767,15,767,17],[768,15,768,17],[769,15,769,17],[770,15,770,17],[740,16,740,22],[741,16,741,22],[742,16,742,22],[3,21,3,22],[2,21,2,22],[5,21,5,22],[10,14,10,23],[13,14,13,23],[6,21,6,22],[9,17,9,20],[2,14,2,20],[3,14,3,20],[5,18,5,20],[6,18,6,20],[11,18,11,20],[12,18,12,20],[6,14,6,17],[5,14,5,17],[744,16,744,22],[807,18,807,20],[807,21,807,22],[804,14,804,17],[801,15,801,17],[801,18,801,20],[801,21,801,22],[802,15,802,17],[802,18,802,20],[802,21,802,22],[803,15,803,17],[803,18,803,20],[803,21,803,22],[806,18,806,20],[806,21,806,22],[805,18,805,20],[805,21,805,22],[782,14,782,23],[783,18,783,20],[783,21,783,22],[784,15,784,17],[784,18,784,20],[784,21,784,22],[785,15,785,17],[776,14,776,17],[783,15,783,17],[749,15,749,17],[804,18,804,20],[804,21,804,22],[792,15,792,17],[792,18,792,20],[792,21,792,22],[793,15,793,17],[793,18,793,20],[793,21,793,22],[794,15,794,17],[794,18,794,20],[794,21,794,22],[798,15,798,17],[798,18,798,20],[798,21,798,22],[799,15,799,17],[799,18,799,20],[799,21,799,22],[800,15,800,17],[789,15,789,17],[785,18,785,20],[785,21,785,22],[800,18,800,20],[800,21,800,22],[795,15,795,17],[795,18,795,20],[795,21,795,22],[796,15,796,17],[796,18,796,20],[796,21,796,22],[797,15,797,17],[797,18,797,20],[797,21,797,22],[789,18,789,20],[789,21,789,22],[790,15,790,17],[790,18,790,20],[790,21,790,22],[791,15,791,17],[791,18,791,20],[791,21,791,22],[786,15,786,17],[786,18,786,20],[786,21,786,22],[787,15,787,17],[787,18,787,20],[787,21,787,22],[788,15,788,17],[788,18,788,20],[788,21,788,22]]}
[]
[]
[null,null,null,null,null,null,null,null,null,null,null,null,null,null,"UNIDADE ESCOLAR",null,null,null,null,null,null,"CÓDIGO INEP"]
[null,null,null,null,null,null,null,null,null,null,null,null,null,null,"COLÉGIO ESTADUAL GOMES DE SOUZA RAMOS",null,null,null,null,null,null,52020428]
[]
["Nmax",null,null,null,null,null,null,null,null,null,null,null,null,null,"OBRA",null,null,null,"DATA",null,null,"CIDADE"]
[{"$f":"MAX($C$18:$C$732)","v":4},null,null,null,null,null,null,null,null,null,null,null,null,null,"REFORMA E AMPLIAÇÃO",null,null,null,"2020-07-07",null,null,"ANÁPOLIS"]
[]
[null,null,null,null,null,null,null,null,null,null,null,null,"",null,"CRE",null,null,"ENDEREÇO",null,null,null,"REFERÊNCIA AGETOP"]
[null,null,null,null,null,null,null,null,null,null,null,null,null,null,"ANÁPOLIS",null,null,"AV PLANALTO S/N, JAIARA, CEP:75064-720",null,null,null,"DEZ/18","ONERADA"]
[]
[null,null,null,null,null,null,null,null,null,null,null,null,null,null,"ÁREA EXISTENTE (M²)",null,null,"ÁREA A CONSTRUIR (M²)","ÁREA TOTAL CONSTRUÍDA (M²)",null,null,"REFERÊNCIA SINAPI"]
[null,null,null,null,null,null,null,null,null,null,null,null,null,null,2552.3200000000002,null,null,189.98,2742.3,null,null,"MAR/19","ONERADA"]
[]
[null,null,null,null,null,null,null,null,null,null,null,"FILTRO",null,null,"PLANILHA ORÇAMENTÁRIA"]
{"$rows_left_out":794}
{"sheet":"Resumo ","index":1,"n_rows":39,"n_cols":9,"rows_kept":39,"cut":false,"hidden":false,"merged":[[42,3,42,7],[11,1,11,2],[12,1,12,2],[15,2,15,3],[16,2,16,3],[14,1,14,8],[17,2,17,3],[23,2,23,3],[18,2,18,3],[19,2,19,3],[20,2,20,3],[41,3,41,7],[24,2,24,3],[26,2,26,3],[27,2,27,3],[38,1,38,8],[1,1,1,8],[2,6,2,8],[3,6,3,8],[4,1,4,8],[5,6,5,8],[6,6,6,8],[7,1,7,8],[8,6,8,8],[9,6,9,8],[13,1,13,8],[0,1,0,8],[36,1,36,5],[2,1,2,5],[3,1,3,5],[5,1,5,5],[6,1,6,5],[8,1,8,5],[9,1,9,5],[11,3,11,5],[12,3,12,5],[10,1,10,8],[11,6,11,8],[12,6,12,8],[25,2,25,3],[21,2,21,3],[22,2,22,3],[13,0,14,0],[34,2,34,3],[35,2,35,3],[31,2,31,3],[32,2,32,3],[33,2,33,3],[28,2,28,3],[29,2,29,3],[30,2,30,3]]}
[]
[]
[null,"UNIDADE ESCOLAR",null,null,null,null,"CÓDIGO INEP"]
[null,{"$f":"Orçamento!$O$4","v":"COLÉGIO ESTADUAL GOMES DE SOUZA RAMOS"},null,null,null,null,{"$f":"Orçamento!V4","v":52020428}]
[]
[null,"OBRA",null,null,null,null,"CIDADE"]
[null,{"$f":"Orçamento!$O$7","v":"REFORMA E AMPLIAÇÃO"},null,null,null,null,{"$f":"Orçamento!$V$7","v":"ANÁPOLIS"}]
[]
[null,"ENDEREÇO",null,null,null,null,"CRE"]
[null,{"$f":"Orçamento!$R$10","v":"AV PLANALTO S/N, JAIARA, CEP:75064-720"},null,null,null,null,{"$f":"Orçamento!$O$10","v":"ANÁPOLIS"}]
[]
[null,"REFERÊNCIA",null,"DATA",null,null,"ÁREA TOTAL CONSTRUÍDA (M²)"]
[null,{"$f":"CONCATENATE(\"AGETOP E SINAPI - \",Orçamento!$W$10)","v":"AGETOP E SINAPI - ONERADA"},null,{"$f":"Orçamento!$S$7","v":"2020-07-07"},null,null,{"$f":"Orçamento!$S$13","v":2742.3}]
["FILTRO"]
[null,"RESUMO GERAL DO ORÇAMENTO"]
{"$rows_left_out":25}
{"sheet":"Somatório","index":2,"n_rows":45,"n_cols":6,"rows_kept":45,"cut":false,"hidden":false,"merged":[[0,1,0,5],[14,1,14,5],[2,1,2,3],[2,4,2,5],[3,1,3,3],[3,4,3,5],[5,1,5,3],[5,4,5,5],[6,1,6,3],[6,4,6,5],[8,1,8,3],[8,4,8,5],[1,1,1,5],[4,1,4,5],[7,1,7,5],[10,1,10,5],[9,1,9,3],[9,4,9,5],[11,1,11,2],[11,4,11,5],[12,1,12,2],[12,4,12,5],[13,0,14,0],[42,1,42,2],[44,1,44,5],[47,3,47,5],[48,3,48,5],[13,1,13,5]]}
[]
[]
[null,"UNIDADE ESCOLAR",null,null,"CÓDIGO INEP"]
[null,{"$f":"Orçamento!$O$4","v":"COLÉGIO ESTADUAL GOMES DE SOUZA RAMOS"},null,null,{"$f":"Orçamento!V4","v":52020428}]
[]
[null,"OBRA",null,null,"CIDADE"]
[null,{"$f":"Orçamento!$O$7","v":"REFORMA E AMPLIAÇÃO"},null,null,{"$f":"Orçamento!$V$7","v":"ANÁPOLIS"}]
[]
[null,"ENDEREÇO",null,null,"CRE"]
[null,{"$f":"Orçamento!$R$10","v":"AV PLANALTO S/N, JAIARA, CEP:75064-720"},null,null,{"$f":"Orçamento!$O$10","v":"ANÁPOLIS"}]
[]
[null,"REFERÊNCIA",null,"DATA","ÁREA TOTAL CONSTRUÍDA (M²)"]
[null,{"$f":"CONCATENATE(\"AGETOP E SINAPI - \",Orçamento!$W$10)","v":"AGETOP E SINAPI - ONERADA"},null,{"$f":"Orçamento!$S$7","v":"2020-07-07"},{"$f":"Orçamento!$S$13","v":2742.3}]
["FILTRO"]
[null,"SOMATÓRIO DE SERVIÇOS"]
{"$rows_left_out":31}
{"sheet":"Cronog_120_Dias","index":3,"n_rows":99,"n_cols":22,"rows_kept":99,"cut":false,"hidden":false,"merged":[[86,13,86,16],[88,13,88,16],[89,13,89,16],[91,13,91,16],[92,13,92,16],[93,13,93,16],[94,13,94,16],[95,13,95,16],[73,13,73,16],[74,13,74,16],[76,13,76,16],[77,13,77,16],[79,13,79,16],[80,13,80,16],[82,13,82,16],[83,13,83,16],[85,13,85,16],[59,13,59,16],[61,13,61,16],[62,13,62,16],[64,13,64,16],[65,13,65,16],[67,13,67,16],[68,13,68,16],[70,13,70,16],[71,13,71,16],[95,9,95,12],[12,13,12,16],[13,13,13,16],[14,13,14,16],[16,13,16,16],[17,13,17,16],[19,13,19,16],[20,13,20,16],[22,13,22,16],[23,13,23,16],[25,13,25,16],[26,13,26,16],[28,13,28,16],[29,13,29,16],[31,13,31,16],[32,13,32,16],[34,13,34,16],[35,13,35,16],[37,13,37,16],[38,13,38,16],[40,13,40,16],[41,13,41,16],[43,13,43,16],[44,13,44,16],[73,9,73,12],[74,9,74,12],[76,9,76,12],[77,9,77,12],[79,9,79,12],[80,9,80,12],[82,9,82,12],[83,9,83,12],[85,9,85,12],[59,9,59,12],[61,9,61,12],[62,9,62,12],[64,9,64,12],[65,9,65,12],[67,9,67,12],[68,9,68,12],[70,9,70,12],[71,9,71,12],[12,9,12,12],[13,9,13,12],[14,9,14,12],[16,9,16,12],[17,9,17,12],[19,9,19,12],[20,9,20,12],[22,9,22,12],[23,9,23,12],[10,1,10,21],[9,8,9,21],[8,8,8,21],[3,8,3,21],[6,8,6,21],[5,8,5,21],[3,1,3,7],[56,4,58,4],[29,3,31,3],[35,1,37,2],[35,4,37,4],[50,3,52,3],[53,3,55,3],[12,21,13,21],[13,1,13,2],[13,5,13,8],[13,17,13,20],[12,3,13,3],[12,17,12,20],[14,1,16,2],[12,5,12,8],[17,1,19,2],[17,4,19,4],[17,5,17,8],[56,1,58,2],[68,4,70,4],[44,3,46,3],[62,1,64,2],[62,4,64,4],[38,1,40,2],[38,4,40,4],[59,3,61,3],[44,1,46,2],[44,4,46,4],[53,1,55,2],[50,1,52,2],[50,4,52,4],[20,1,22,2],[20,4,22,4],[20,5,20,8],[20,17,20,20],[22,5,22,8],[22,17,22,20],[20,3,22,3],[83,3,85,3],[53,4,55,4],[59,1,61,2],[59,4,61,4],[74,1,76,2],[77,1,79,2],[77,4,79,4],[80,1,82,2],[65,1,67,2],[68,3,70,3],[62,3,64,3],[68,1,70,2],[56,3,58,3],[65,4,67,4],[71,3,73,3],[74,3,76,3],[74,4,76,4],[14,3,16,3],[17,3,19,3],[14,4,16,4],[14,5,14,8],[14,17,14,20],[16,5,16,8],[16,17,16,20],[23,17,23,20],[25,5,25,8],[25,17,25,20],[17,17,17,20],[19,5,19,8],[19,17,19,20],[25,9,25,12],[26,1,28,2],[26,4,28,4],[26,5,26,8],[26,17,26,20],[28,5,28,8],[28,17,28,20],[23,3,25,3],[23,1,25,2],[23,4,25,4],[23,5,23,8],[26,3,28,3],[26,9,26,12],[28,9,28,12],[29,17,29,20],[31,5,31,8],[31,17,31,20],[32,1,34,2],[32,4,34,4],[32,5,32,8],[32,17,32,20],[34,5,34,8],[34,17,34,20],[32,3,34,3],[29,5,29,8],[29,1,31,2],[29,4,31,4],[29,9,29,12],[31,9,31,12],[32,9,32,12],[34,9,34,12],[35,17,35,20],[37,5,37,8],[37,17,37,20],[35,3,37,3],[40,17,40,20],[38,3,40,3],[38,17,38,20],[41,1,43,2],[41,4,43,4],[41,5,41,8],[41,17,41,20],[43,5,43,8],[43,17,43,20],[41,3,43,3],[35,5,35,8],[38,5,38,8],[40,5,40,8],[35,9,35,12],[37,9,37,12],[38,9,38,12],[40,9,40,12],[41,9,41,12],[43,9,43,12],[44,17,44,20],[46,5,46,8],[46,17,46,20],[47,1,49,2],[47,4,49,4],[47,5,47,8],[47,17,47,20],[49,5,49,8],[49,17,49,20],[44,5,44,8],[47,3,49,3],[44,9,44,12],[46,9,46,12],[47,9,47,12],[49,9,49,12],[46,13,46,16],[47,13,47,16],[49,13,49,16],[53,17,53,20],[55,5,55,8],[55,17,55,20],[50,5,50,8],[50,17,50,20],[52,5,52,8],[52,17,52,20],[56,17,56,20],[58,5,58,8],[58,17,58,20],[53,5,53,8],[56,5,56,8],[50,9,50,12],[52,9,52,12],[53,9,53,12],[55,9,55,12],[56,9,56,12],[58,9,58,12],[50,13,50,16],[52,13,52,16],[53,13,53,16],[55,13,55,16],[56,13,56,16],[58,13,58,16],[68,5,68,8],[65,5,65,8],[65,17,65,20],[67,5,67,8],[67,17,67,20],[65,3,67,3],[62,17,62,20],[64,5,64,8],[64,17,64,20],[62,5,62,8],[95,1,95,2],[95,5,95,8],[95,17,95,20],[97,1,97,4],[98,1,98,21],[86,17,86,20],[88,5,88,8],[88,17,88,20],[85,5,85,8],[85,17,85,20],[89,1,91,2],[89,4,91,4],[89,5,89,8],[89,17,89,20],[91,5,91,8],[91,17,91,20],[89,3,91,3],[86,4,88,4],[86,5,86,8],[86,3,88,3],[83,1,85,2],[83,4,85,4],[83,5,83,8],[83,17,83,20],[94,1,94,2],[94,5,94,8],[94,17,94,20],[76,5,76,8],[76,17,76,20],[77,5,77,8],[77,17,77,20],[79,5,79,8],[79,17,79,20],[80,5,80,8],[80,17,80,20],[82,5,82,8],[82,17,82,20],[77,3,79,3],[80,3,82,3],[86,1,88,2],[80,4,82,4],[86,9,86,12],[88,9,88,12],[89,9,89,12],[91,9,91,12],[92,9,92,12],[93,9,93,12],[94,9,94,12],[12,0,13,0],[9,0,11,0],[11,1,11,21],[92,1,92,2],[92,5,92,8],[92,17,92,20],[93,1,93,2],[93,5,93,8],[93,17,93,20],[74,17,74,20],[74,5,74,8],[68,17,68,20],[70,5,70,8],[70,17,70,20],[59,5,59,8],[71,1,73,2],[71,4,73,4],[71,5,71,8],[71,17,71,20],[73,5,73,8],[73,17,73,20],[59,17,59,20],[61,5,61,8],[61,17,61,20],[2,1,2,7],[5,1,5,7],[6,1,6,7],[8,1,8,7],[9,1,9,7],[4,1,4,21],[7,1,7,21],[0,1,0,21],[1,1,1,21],[2,8,2,21]]}
[]
[]
[null,"UNIDADE ESCOLAR",null,null,null,null,null,null,"PRAZO"]
[null,{"$f":"Orçamento!$O$4","v":"COLÉGIO ESTADUAL GOMES DE SOUZA RAMOS"},null,null,null,null,null,null,"120 DIAS CORRIDOS"]
[]
[null,"OBRA",null,null,null,null,null,null,"DATA"]
[null,{"$f":"Orçamento!$O$7","v":"REFORMA E AMPLIAÇÃO"},null,null,null,null,null,null,{"$f":"Orçamento!$S$7","v":"2020-07-07"}]
[]
[null,"LOCAL",null,null,null,null,null,null,"ÁREA TOTAL CONSTRUÍDA (M²)"]
["FILTRO",{"$f":"Orçamento!$V$7","v":"ANÁPOLIS"},null,null,null,null,null,null,{"$f":"Orçamento!$S$13","v":2742.3}]
[]
[null,"CRONOGRAMA - FÍSICO FINANCEIRO"]
["↓","CUSTO TOTAL:",{"$f":"D93","v":0},"VALOR","Dias:",30,null,null,null,60,null,null,null,90,null,null,null,120,null,null,null,"TOTAL"]
[null,"DESCRIÇÃO DOS SERVIÇOS",null,null,"%","1ª PARCELA",null,null,null,"2ª PARCELA",null,null,null,"3ª PARCELA",null,null,null,"4ª PARCELA"]
[{"$f":"IF(D15>0,\"F\",\"\")","v":""},"SERVIÇOS PRELIMINARES",null,{"$f":"Orçamento!V751","v":0},{"$f":"Orçamento!X751","v":0},{"$f":"ROUND(F17*$D$15,2)","v":0},null,null,null,{"$f":"ROUND(J17*$D$15,2)","v":0},null,null,null,{"$f":"ROUND(N17*$D$15,2)","v":0},null,null,null,{"$f":"ROUND(R17*$D$15,2)","v":0},null,null,null,{"$f":"SUM(F15:U15)","v":0}]
{"$rows_left_out":85}
{"sheet":"Composição BDI","index":4,"n_rows":45,"n_cols":9,"rows_kept":45,"cut":false,"hidden":false,"merged":[[18,5,18,8],[17,0,17,3],[16,0,16,3],[44,0,44,3],[42,0,42,3],[43,0,43,3],[18,0,18,3],[36,0,36,3],[39,0,39,3],[38,0,38,3],[40,0,40,3],[29,0,29,2],[32,0,32,3],[33,0,33,3],[34,0,34,3],[35,0,35,3],[0,0,0,3],[1,0,1,3],[4,0,4,3],[7,0,7,3],[10,0,10,3],[2,0,2,3],[3,0,3,3],[5,0,5,3],[6,0,6,3],[8,0,8,3],[9,0,9,3],[11,0,11,3],[12,0,12,3],[14,0,14,3],[15,0,15,3],[13,0,13,3]]}
[]
[]
["UNIDADE ESCOLAR"]
[{"$f":"Orçamento!$O$4","v":"COLÉGIO ESTADUAL GOMES DE SOUZA RAMOS"}]
[]
["OBRA"]
[{"$f":"Orçamento!$O$7","v":"REFORMA E AMPLIAÇÃO"}]
[]
["ENDEREÇO"]
[{"$f":"Orçamento!$R$10","v":"AV PLANALTO S/N, JAIARA, CEP:75064-720"}]
[]
["CIDADE"]
[{"$f":"Orçamento!$V$7","v":"ANÁPOLIS"}]
[]
["CRE"]
{"$rows_left_out":31}
{"sheet":"Relatório CENTRAL","index":5,"n_rows":40,"n_cols":5,"rows_kept":40,"cut":false,"hidden":false,"merged":[[11,1,11,4],[39,1,39,2],[9,0,11,0],[0,1,0,4],[6,3,6,4],[9,3,9,4],[1,1,1,4],[2,1,2,2],[2,3,2,4],[3,1,3,2],[3,3,3,4],[4,1,4,4],[5,1,5,2],[5,3,5,4],[6,1,6,2],[7,1,7,4],[8,1,8,2],[8,3,8,4],[9,1,9,2],[10,1,10,4]]}
[]
[]
[null,"UNIDADE ESCOLAR",null,"CIDADE"]
[null,{"$f":"Orçamento!$O$4","v":"COLÉGIO ESTADUAL GOMES DE SOUZA RAMOS"},null,{"$f":"Orçamento!$V$7","v":"ANÁPOLIS"}]
[]
[null,"OBRA",null,"CRE"]
[null,{"$f":"Orçamento!$O$7","v":"REFORMA E AMPLIAÇÃO"},null,{"$f":"Orçamento!$O$10","v":"ANÁPOLIS"}]
[]
[null,"ENDEREÇO",null,"DATA"]
["FILTRO",{"$f":"Orçamento!$R$10","v":"AV PLANALTO S/N, JAIARA, CEP:75064-720"},null,{"$f":"Orçamento!$S$7","v":"2020-07-07"}]
[]
[null,"RELATÓRIO CENTRAL"]
["↓","CÓDIGO","ETAPA","PREÇO  (R$) C/ BDI","PARTIC  ( % )"]
[{"$f":"IF(D14>0,\"F\",\"\")","v":""},{"$f":"Orçamento!O751","v":"a."},{"$f":"Orçamento!P751","v":"SERVIÇOS PRELIMINARES"},{"$f":"Orçamento!V751","v":0},{"$f":"Orçamento!X751","v":0}]
[{"$f":"IF(D15>0,\"F\",\"\")","v":""},{"$f":"Orçamento!O752","v":"b."},{"$f":"Orçamento!P752","v":"TRANSPORTES"},{"$f":"Orçamento!V752","v":0},{"$f":"Orçamento!X752","v":0}]
{"$rows_left_out":26}
{"sheet":"Parc Maior Relev","index":6,"n_rows":21,"n_cols":7,"rows_kept":21,"cut":false,"hidden":false,"merged":[[10,0,12,0],[8,1,8,3],[8,4,8,6],[21,3,21,7],[19,1,19,6],[0,1,0,6],[11,1,11,6],[1,1,1,6],[2,1,2,3],[2,4,2,6],[3,1,3,3],[3,4,3,6],[4,1,4,6],[5,1,5,3],[5,4,5,6],[9,1,9,3],[9,4,9,6],[10,1,10,6],[6,1,6,3],[6,4,6,6],[7,1,7,6]]}
[]
[]
[null,"UNIDADE ESCOLAR",null,null,"CÓDIGO INEP"]
[null,{"$f":"Orçamento!$O$4","v":"COLÉGIO ESTADUAL GOMES DE SOUZA RAMOS"},null,null,{"$f":"Orçamento!$V$4","v":52020428}]
[]
[null,"OBRA",null,null,"CIDADE"]
[null,{"$f":"Orçamento!$O$7","v":"REFORMA E AMPLIAÇÃO"},null,null,{"$f":"Orçamento!$V$7","v":"ANÁPOLIS"}]
[]
[null,"CRE",null,null,"ÁREA TOTAL CONSTRUÍDA (M²)"]
[null,{"$f":"Orçamento!$O$10","v":"ANÁPOLIS"},null,null,{"$f":"Orçamento!$S$13","v":2742.3}]
["FILTRO"]
[null,"PARCELA DE MAIOR RELEVÂNCIA"]
[null,"CÓDIGO","SERVIÇO","DESCRIÇÃO","UNID","QUANT","PARC. MAIOR RELEV (50%)"]
[{"$f":"IF(F14>0,\"F\",\"\")","v":"F"},"U.",{"$f":"IFERROR(VLOOKUP(B14,Orçamento!$O$751:$P$776,2,FALSE),\"(inserir código ao lado)\")","v":"REVESTIMENTO DE PISO"},"PISO EM GRANITINA","M²",148.47999999999999,{"$f":"F14*0.5","v":74.239999999999995}]
[{"$f":"IF(F15>0,\"F\",\"\")","v":"F"},"Y.",{"$f":"IFERROR(VLOOKUP(B15,Orçamento!$O$751:$P$776,2,FALSE),\"(inserir código ao lado)\")","v":"PINTURA"},"PINTURA","M²",1689.58,844.79]
{"$rows_left_out":7}
{"sheet":"Composições","index":7,"n_rows":530,"n_cols":10,"rows_kept":530,"cut":false,"hidden":false,"merged":[[511,5,512,5],[511,6,511,7],[511,8,511,9],[516,1,516,7],[529,1,529,7],[511,0,512,0],[511,1,512,1],[511,2,512,2],[511,3,512,3],[511,4,512,4],[494,5,495,5],[494,6,494,7],[494,8,494,9],[499,1,499,7],[509,1,509,7],[494,0,495,0],[494,1,495,1],[494,2,495,2],[494,3,495,3],[494,4,495,4],[482,5,483,5],[482,6,482,7],[482,8,482,9],[488,1,488,7],[492,1,492,7],[482,0,483,0],[482,1,483,1],[482,2,483,2],[482,3,483,3],[482,4,483,4],[462,5,463,5],[462,6,462,7],[462,8,462,9],[467,1,467,7],[480,1,480,7],[462,0,463,0],[462,1,463,1],[462,2,463,2],[462,3,463,3],[462,4,463,4],[439,5,440,5],[439,6,439,7],[439,8,439,9],[445,1,445,7],[460,1,460,7],[439,0,440,0],[439,1,440,1],[439,2,440,2],[439,3,440,3],[439,4,440,4],[427,5,428,5],[427,6,427,7],[427,8,427,9],[433,1,433,7],[437,1,437,7],[427,0,428,0],[427,1,428,1],[427,2,428,2],[427,3,428,3],[427,4,428,4],[415,5,416,5],[415,6,415,7],[415,8,415,9],[421,1,421,7],[425,1,425,7],[415,0,416,0],[415,1,416,1],[415,2,416,2],[415,3,416,3],[415,4,416,4],[403,5,404,5],[403,6,403,7],[403,8,403,9],[409,1,409,7],[413,1,413,7],[403,0,404,0],[403,1,404,1],[403,2,404,2],[403,3,404,3],[403,4,404,4],[391,5,392,5],[391,6,391,7],[391,8,391,9],[397,1,397,7],[401,1,401,7],[391,0,392,0],[391,1,392,1],[391,2,392,2],[391,3,392,3],[391,4,392,4],[379,5,380,5],[379,6,379,7],[379,8,379,9],[385,1,385,7],[389,1,389,7],[379,0,380,0],[379,1,380,1],[379,2,380,2],[379,3,380,3],[379,4,380,4],[367,5,368,5],[367,6,367,7],[367,8,367,9],[373,1,373,7],[377,1,377,7],[367,0,368,0],[367,1,368,1],[367,2,368,2],[367,3,368,3],[367,4,368,4],[355,5,356,5],[355,6,355,7],[355,8,355,9],[361,1,361,7],[365,1,365,7],[355,0,356,0],[355,1,356,1],[355,2,356,2],[355,3,356,3],[355,4,356,4],[343,5,344,5],[343,6,343,7],[343,8,343,9],[349,1,349,7],[353,1,353,7],[343,0,344,0],[343,1,344,1],[343,2,344,2],[343,3,344,3],[343,4,344,4],[331,5,332,5],[331,6,331,7],[331,8,331,9],[337,1,337,7],[341,1,341,7],[331,0,332,0],[331,1,332,1],[331,2,332,2],[331,3,332,3],[331,4,332,4],[319,5,320,5],[319,6,319,7],[319,8,319,9],[325,1,325,7],[329,1,329,7],[319,0,320,0],[319,1,320,1],[319,2,320,2],[319,3,320,3],[319,4,320,4],[307,5,308,5],[307,6,307,7],[307,8,307,9],[313,1,313,7],[317,1,317,7],[307,0,308,0],[307,1,308,1],[307,2,308,2],[307,3,308,3],[307,4,308,4],[295,5,296,5],[295,6,295,7],[295,8,295,9],[301,1,301,7],[305,1,305,7],[295,0,296,0],[295,1,296,1],[295,2,296,2],[295,3,296,3],[295,4,296,4],[283,5,284,5],[283,6,283,7],[283,8,283,9],[289,1,289,7],[293,1,293,7],[283,0,284,0],[283,1,284,1],[283,2,284,2],[283,3,284,3],[283,4,284,4],[271,5,272,5],[271,6,271,7],[271,8,271,9],[277,1,277,7],[281,1,281,7],[271,0,272,0],[271,1,272,1],[271,2,272,2],[271,3,272,3],[271,4,272,4],[259,5,260,5],[259,6,259,7],[259,8,259,9],[265,1,265,7],[269,1,269,7],[259,0,260,0],[259,1,260,1],[259,2,260,2],[259,3,260,3],[259,4,260,4],[244,5,245,5],[244,6,244,7],[244,8,244,9],[250,1,250,7],[257,1,257,7],[244,0,245,0],[244,1,245,1],[244,2,245,2],[244,3,245,3],[244,4,245,4],[234,5,235,5],[234,6,234,7],[234,8,234,9],[238,1,238,7],[242,1,242,7],[234,0,235,0],[234,1,235,1],[234,2,235,2],[234,3,235,3],[234,4,235,4],[222,5,223,5],[222,6,222,7],[222,8,222,9],[228,1,228,7],[232,1,232,7],[222,0,223,0],[222,1,223,1],[222,2,223,2],[222,3,223,3],[222,4,223,4],[210,5,211,5],[210,6,210,7],[210,8,210,9],[216,1,216,7],[220,1,220,7],[210,0,211,0],[210,1,211,1],[210,2,211,2],[210,3,211,3],[210,4,211,4],[198,5,199,5],[198,6,198,7],[198,8,198,9],[204,1,204,7],[208,1,208,7],[198,0,199,0],[198,1,199,1],[198,2,199,2],[198,3,199,3],[198,4,199,4],[186,5,187,5],[186,6,186,7],[186,8,186,9],[192,1,192,7],[196,1,196,7],[186,0,187,0],[186,1,187,1],[186,2,187,2],[186,3,187,3],[186,4,187,4],[174,5,175,5],[174,6,174,7],[174,8,174,9],[180,1,180,7],[184,1,184,7],[174,0,175,0],[174,1,175,1],[174,2,175,2],[174,3,175,3],[174,4,175,4],[164,5,165,5],[164,6,164,7],[164,8,164,9],[169,1,169,7],[172,1,172,7],[164,0,165,0],[164,1,165,1],[164,2,165,2],[164,3,165,3],[164,4,165,4],[154,5,155,5],[154,6,154,7],[154,8,154,9],[159,1,159,7],[162,1,162,7],[154,0,155,0],[154,1,155,1],[154,2,155,2],[154,3,155,3],[154,4,155,4],[144,5,145,5],[144,6,144,7],[144,8,144,9],[149,1,149,7],[152,1,152,7],[144,0,145,0],[144,1,145,1],[144,2,145,2],[144,3,145,3],[144,4,145,4],[132,5,133,5],[132,6,132,7],[132,8,132,9],[138,1,138,7],[142,1,142,7],[132,0,133,0],[132,1,133,1],[132,2,133,2],[132,3,133,3],[132,4,133,4],[120,5,121,5],[120,6,120,7],[120,8,120,9],[126,1,126,7],[130,1,130,7],[120,0,121,0],[120,1,121,1],[120,2,121,2],[120,3,121,3],[120,4,121,4],[108,5,109,5],[108,6,108,7],[108,8,108,9],[114,1,114,7],[118,1,118,7],[108,0,109,0],[108,1,109,1],[108,2,109,2],[108,3,109,3],[108,4,109,4],[96,5,97,5],[96,6,96,7],[96,8,96,9],[102,1,102,7],[106,1,106,7],[96,0,97,0],[96,1,97,1],[96,2,97,2],[96,3,97,3],[96,4,97,4],[84,5,85,5],[84,6,84,7],[84,8,84,9],[90,1,90,7],[94,1,94,7],[84,0,85,0],[84,1,85,1],[84,2,85,2],[84,3,85,3],[84,4,85,4],[75,5,76,5],[75,6,75,7],[75,8,75,9],[80,1,80,7],[82,1,82,7],[75,0,76,0],[75,1,76,1],[75,2,76,2],[75,3,76,3],[75,4,76,4],[63,5,64,5],[63,6,63,7],[63,8,63,9],[69,1,69,7],[73,1,73,7],[63,0,64,0],[63,1,64,1],[63,2,64,2],[63,3,64,3],[63,4,64,4],[51,5,52,5],[51,6,51,7],[51,8,51,9],[57,1,57,7],[61,1,61,7],[51,0,52,0],[51,1,52,1],[51,2,52,2],[51,3,52,3],[51,4,52,4],[39,5,40,5],[39,6,39,7],[39,8,39,9],[45,1,45,7],[49,1,49,7],[39,0,40,0],[39,1,40,1],[39,2,40,2],[39,3,40,3],[39,4,40,4],[27,5,28,5],[27,6,27,7],[27,8,27,9],[33,1,33,7],[37,1,37,7],[27,0,28,0],[27,1,28,1],[27,2,28,2],[27,3,28,3],[27,4,28,4],[16,5,17,5],[16,6,16,7],[16,8,16,9],[21,1,21,7],[25,1,25,7],[16,0,17,0],[16,1,17,1],[16,2,17,2],[16,3,17,3],[16,4,17,4],[0,0,0,8],[10,0,10,2],[10,3,10,6],[11,0,11,9],[12,0,12,2],[12,3,12,6],[12,7,12,8],[7,0,7,6],[9,0,9,2],[9,3,9,6],[9,7,9,8],[3,0,3,6],[4,0,4,6],[15,0,15,9],[13,0,13,2],[13,3,13,6],[1,0,1,9],[3,7,3,9],[4,7,4,9],[6,7,6,9],[7,7,7,9],[6,0,6,6],[10,8,10,9],[13,8,13,9],[14,0,14,9],[8,0,8,9],[5,0,5,9],[2,0,2,9]]}
[]
[]
[]
["UNIDADE ESCOLAR",null,null,null,null,null,null,"CÓDIGO INEP"]
[{"$f":"Orçamento!$O$4","v":"COLÉGIO ESTADUAL GOMES DE SOUZA RAMOS"},null,null,null,null,null,null,{"$f":"Orçamento!$V$4","v":52020428}]
[]
["OBRA",null,null,null,null,null,null,"CIDADE"]
[{"$f":"Orçamento!$O$7","v":"REFORMA E AMPLIAÇÃO"},null,null,null,null,null,null,{"$f":"Orçamento!$V$7","v":"ANÁPOLIS"}]
[]
["CRE",null,null,"ENDEREÇO",null,null,null,"REFERÊNCIA AGETOP"]
[{"$f":"Orçamento!$O$10","v":"ANÁPOLIS"},null,null,{"$f":"Orçamento!$R$10","v":"AV PLANALTO S/N, JAIARA, CEP:75064-720"},null,null,null,{"$f":"Orçamento!$V$10","v":"DEZ/18"},{"$f":"Orçamento!$W$10","v":"ONERADA"}]
[]
["DATA",null,null,"ÁREA TOTAL CONSTRUÍDA (M²)",null,null,null,"REFERÊNCIA SINAPI"]
[{"$f":"Orçamento!$S$7","v":"2020-07-07"},null,null,{"$f":"Orçamento!$S$13","v":2742.3},null,null,null,{"$f":"Orçamento!$V$13","v":"MAR/19"},{"$f":"Orçamento!$W$13","v":"ONERADA"}]
[]
{"$rows_left_out":515}