{"text_format":"1","workbook":"xlsx","n_sheets":8,"sheets":["Orçamento","Resumo ","Somatório","Cronog_240_Dias","Composição BDI","Relatório CENTRAL","Parc Maior Relev","Composições"],"not_rendered":{"charts":0,"images":4,"macros":1,"external_links":0,"defined_names":123,"comments":2,"pivot_tables":0},"unopened":[],"bounds":{"document_bytes":16777216,"sheet_cells":100000,"rows_first":2000,"rows_last":500,"rows_between":2000,"halvings":0,"cell_chars":16384,"cell_head_chars":4096},"cells_cut":0,"cells_raw":0,"read":"whole","date_system":"1900"}

{"sheet":"Orçamento","index":0,"n_rows":1404,"n_cols":27,"rows_kept":1404,"cut":false,"hidden":false,"merged":[[1396,18,1396,22],[1391,15,1391,17],[1391,18,1391,22],[1392,15,1392,17],[1392,18,1392,22],[1393,15,1393,17],[1393,18,1393,22],[12,24,12,25],[11,23,11,25],[1385,18,1385,22],[1386,15,1386,17],[1386,18,1386,22],[1387,15,1387,17],[1387,18,1387,22],[1382,15,1382,17],[1382,18,1382,22],[1383,15,1383,17],[1383,18,1383,22],[1384,15,1384,17],[1384,18,1384,22],[1378,14,1378,26],[1379,18,1379,22],[1380,15,1380,17],[1380,18,1380,22],[1397,23,1397,25],[1398,23,1398,25],[1399,23,1399,25],[1400,23,1400,25],[1401,23,1401,25],[1402,23,1402,25],[1403,23,1403,25],[1372,14,1372,17],[1379,15,1379,17],[1345,15,1345,17],[1400,18,1400,22],[1388,15,1388,17],[1388,18,1388,22],[1389,15,1389,17],[1389,18,1389,22],[1390,15,1390,17],[1390,18,1390,22],[1394,15,1394,17],[1394,18,1394,22],[1395,15,1395,17],[1395,18,1395,22],[1396,15,1396,17],[1385,15,1385,17],[1403,18,1403,22],[1400,14,1400,17],[1397,15,1397,17],[1397,18,1397,22],[1398,15,1398,17],[1398,18,1398,22],[1399,15,1399,17],[1399,18,1399,22],[1402,18,1402,22],[1401,18,1401,22],[1381,15,1381,17],[1381,18,1381,22],[1336,16,1336,24],[1337,16,1337,24],[1338,16,1338,24],[10,14,10,26],[13,14,13,26],[9,17,9,22],[2,14,2,22],[3,14,3,22],[5,18,5,22],[6,18,6,22],[11,18,11,22],[12,18,12,22],[6,14,6,17],[5,14,5,17],[3,23,3,25],[2,23,2,25],[5,23,5,25],[6,23,6,25],[1340,16,1340,24],[8,23,8,25],[9,24,9,25],[1358,15,1358,17],[1359,15,1359,17],[1360,15,1360,17],[1361,15,1361,17],[1362,15,1362,17],[1363,15,1363,17],[1364,15,1364,17],[1365,15,1365,17],[1339,16,1339,24],[1329,23,1329,24],[1330,23,1330,24],[1345,23,1345,25],[1370,15,1370,17],[1371,15,1371,17],[1344,14,1344,26],[1328,17,1333,17],[1345,18,1345,22],[1346,18,1346,22],[1354,18,1354,22],[1355,18,1355,22],[1356,18,1356,22],[1357,18,1357,22],[1369,18,1369,22],[1366,15,1366,17],[1346,15,1346,17],[1347,15,1347,17],[1348,15,1348,17],[1349,15,1349,17],[1350,15,1350,17],[1351,15,1351,17],[1352,15,1352,17],[1353,15,1353,17],[1354,15,1354,17],[1375,18,1375,22],[1351,18,1351,22],[1352,18,1352,22],[1350,18,1350,22],[1359,18,1359,22],[1341,18,1341,24],[1347,18,1347,22],[1348,18,1348,22],[1349,18,1349,22],[1372,18,1372,22],[1370,18,1370,22],[1371,18,1371,22],[1361,18,1361,22],[1368,18,1368,22],[1364,18,1364,22],[1366,18,1366,22],[1362,18,1362,22],[1363,18,1363,22],[1372,23,1372,25],[1366,23,1366,25],[1367,23,1367,25],[1368,23,1368,25],[1369,23,1369,25],[1370,23,1370,25],[1374,18,1374,22],[0,14,0,24],[8,14,8,16],[9,14,9,16],[11,14,11,16],[12,14,12,16],[14,14,14,24],[1,14,1,24],[4,14,4,24],[7,14,7,24],[1358,18,1358,22],[1355,15,1355,17],[1356,15,1356,17],[1357,15,1357,17],[1367,18,1367,22],[1365,18,1365,22],[1328,23,1328,24],[1373,18,1373,22],[1360,18,1360,22],[1353,18,1353,22],[1367,15,1367,17],[1368,15,1368,17],[1369,15,1369,17],[1379,23,1379,25],[1380,23,1380,25],[1381,23,1381,25],[1382,23,1382,25],[1383,23,1383,25],[1384,23,1384,25],[1385,23,1385,25],[1386,23,1386,25],[1387,23,1387,25],[1388,23,1388,25],[1389,23,1389,25],[1390,23,1390,25],[1391,23,1391,25],[1392,23,1392,25],[1393,23,1393,25],[1394,23,1394,25],[1395,23,1395,25],[1396,23,1396,25],[1373,23,1373,25],[1374,23,1374,25],[1375,23,1375,25],[1371,23,1371,25],[1346,23,1346,25],[1347,23,1347,25],[1348,23,1348,25],[1349,23,1349,25],[1350,23,1350,25],[1351,23,1351,25],[1352,23,1352,25],[1353,23,1353,25],[1354,23,1354,25],[1355,23,1355,25],[1356,23,1356,25],[1357,23,1357,25],[1358,23,1358,25],[1359,23,1359,25],[1360,23,1360,25],[1361,23,1361,25],[1362,23,1362,25],[1363,23,1363,25],[1364,23,1364,25],[1365,23,1365,25]]}
[]
[]
[null,null,null,null,null,null,null,null,null,null,null,null,null,null,"UNIDADE ESCOLAR",null,null,null,null,null,null,null,null,"CÓDIGO INEP"]
[null,null,null,null,null,null,null,null,null,null,null,null,null,null,"COLÉGIO ESTADUAL EXALTINA SOARES DOS SANTOS",null,null,null,null,null,null,null,null,52042944]
[]
["Nmax",null,null,null,null,null,null,null,null,null,null,null,null,null,"OBRA",null,null,null,"DATA",null,null,null,null,"CIDADE"]
[{"$f":"MAX($C$18:$C$1328)","v":3},null,null,null,null,null,null,null,null,null,null,null,null,null,"IMPLANTAÇÃO E CONSTRUÇÃO",null,null,null,"2020-07-07",null,null,null,null,"SIMOLÂNDIA"]
[]
[null,null,null,null,null,null,null,null,null,null,null,null,null,null,"CRE",null,null,"ENDEREÇO",null,null,null,null,null,"REFERÊNCIA AGETOP"]
[null,null,null,null,null,null,null,null,null,null,null,null,null,null,"POSSE",null,null,"AV PEDRO NUNES, CENTRO, CEP:73930-000",null,null,null,null,null,"DEZ/18","DESONERADA"]
[]
[null,null,null,null,null,null,null,null,null,null,null,null,null,null,"ÁREA EXISTENTE (M²)",null,null,"ÁREA A CONSTRUIR (M²)","ÁREA TOTAL CONSTRUÍDA (M²)",null,null,null,null,"REFERÊNCIA SINAPI"]
[null,null,null,null,null,null,null,null,null,null,null,null,null,null,null,null,null,1496.75,1496.75,null,null,null,null,"ABR/19","DESONERADA"]
[]
[null,null,null,null,null,null,null,null,null,null,null,"FILTRO",null,null,"PLANILHA ORÇAMENTÁRIA"]
["Nível E","Save Nivel","Nível C","Altura","n1","n2","n3","n4","n5","Czero","Cnível","↓","Nível","Nível Corrigido","ITEM","TABELA","CODIGO","DESCRIÇÃO DOS SERVIÇOS","UNID","QUANT","REPET","QUANT TOTAL","MAT","MO","VALOR UNIT","VALOR TOTAL","OBSERVAÇÕES¹"]
[{"$f":"CHOOSE(1+LOG(1+2*(ORÇAMENTO.Nivel=\"Nível 1\")+4*(ORÇAMENTO.Nivel=\"Nível 2\")+8*(ORÇAMENTO.Nivel=\"Nível 3\")+16*(ORÇAMENTO.Nivel=\"Nível 4\")+32*(ORÇAMENTO.Nivel=\"Serviço\"),2),0,1,2,3,4,\"S\")","v":"S"},{"$f":"IF(OR(C17=\"s\",C17=0),OFFSET(B17,-1,0),C17)","v":"Save Nivel"},{"$f":"IF(OFFSET(C17,-1,0)=\"L\",1,IF(OFFSET(C17,-1,0)=1,2,IF(OR(A17=\"s\",A17=0),\"S\",IF(AND(OFFSET(C17,-1,0)=2,A17=4),3,IF(AND(OR(OFFSET(C17,-1,0)=\"s\",OFFSET(C17,-1,0)=0),A17<>\"s\",A17>OFFSET(B17,-1,0)),OFFSET(B17,-1,0),A17)))))","v":"S"},{"$f":"IF(OR(C17=\"S\",C17=0),0,IF(ISERROR(K17),J17,SMALL(J17:K17,1)))","v":0},{"$f":"IF($C17=1,OFFSET(E17,-1,0)+1,OFFSET(E17,-1,0))","v":"n1"},{"$f":"IF($C17=1,0,IF($C17=2,OFFSET(F17,-1,0)+1,OFFSET(F17,-1,0)))","v":"n2"},{"$f":"IF(AND($C17<=2,$C17<>0),0,IF($C17=3,OFFSET(G17,-1,0)+1,OFFSET(G17,-1,0)))","v":"n3"},{"$f":"IF(AND($C17<=3,$C17<>0),0,IF($C17=4,OFFSET(H17,-1,0)+1,OFFSET(H17,-1,0)))","v":"n4"},{"$f":"IF(AND($C17<=4,$C17<>0),0,IF(AND($C17=\"S\",$Y17>0),OFFSET(I17,-1,0)+1,OFFSET(I17,-1,0)))","v":"n5"},{"$f":"IF(OR($C17=\"S\",$C17=0),0,MATCH(0,OFFSET($D17,1,$C17,ROW($C$1328)-ROW($C17)),0))","v":0},{"$f":"IF(OR($C17=\"S\",$C17=0),0,MATCH(OFFSET($D17,0,$C17)+1,OFFSET($D17,1,$C17,ROW($C$1328)-ROW($C17)),0))","v":0},"","Serviço","Serviço","-","AGETOP",null,"(sem código)","-",null,"REPET","-",0,0,0,"-",""]
[0,null,"L",{"$f":"COUNTA(OFFSET(D18,1,0):D$1328)","v":1309},{"$f":"LEFT(O19,1)-1","v":0},null,null,null,null,null,null,"F","LOTE","LOTE","IMPLANTAÇÃO E CONSTRUÇÃO - COLÉGIO ESTADUAL EXALTINA SOARES DOS SANTOS",null,null,null,null,null,null,null,null,null,null,1645945.6900000013]
[1,{"$f":"IF(OR(C19=\"s\",C19=0),OFFSET(B19,-1,0),C19)","v":1},{"$f":"IF(OFFSET(C19,-1,0)=\"L\",1,IF(OFFSET(C19,-1,0)=1,2,IF(OR(A19=\"s\",A19=0),\"S\",IF(AND(OFFSET(C19,-1,0)=2,A19=4),3,IF(AND(OR(OFFSET(C19,-1,0)=\"s\",OFFSET(C19,-1,0)=0),A19<>\"s\",A19>OFFSET(B19,-1,0)),OFFSET(B19,-1,0),A19)))))","v":1},{"$f":"IF(OR(C19=\"S\",C19=0),0,IF(ISERROR(K19),J19,SMALL(J19:K19,1)))","v":349},{"$f":"IF($C19=1,OFFSET(E19,-1,0)+1,OFFSET(E19,-1,0))","v":1},{"$f":"IF($C19=1,0,IF($C19=2,OFFSET(F19,-1,0)+1,OFFSET(F19,-1,0)))","v":0},{"$f":"IF(AND($C19<=2,$C19<>0),0,IF($C19=3,OFFSET(G19,-1,0)+1,OFFSET(G19,-1,0)))","v":0},{"$f":"IF(AND($C19<=3,$C19<>0),0,IF($C19=4,OFFSET(H19,-1,0)+1,OFFSET(H19,-1,0)))","v":0},{"$f":"IF(AND($C19<=4,$C19<>0),0,IF(AND($C19=\"S\",$Y19>0),OFFSET(I19,-1,0)+1,OFFSET(I19,-1,0)))","v":0},{"$f":"IF(OR($C19=\"S\",$C19=0),0,MATCH(0,OFFSET($D19,1,$C19,ROW($C$1328)-ROW($C19)),0))","v":1309},{"$f":"IF(OR($C19=\"S\",$C19=0),0,MATCH(OFFSET($D19,0,$C19)+1,OFFSET($D19,1,$C19,ROW($C$1328)-ROW($C19)),0))","v":349},"F","Nível 1","Nível 1","1.",null,null,"IMPLANTAÇÃO CE EXALTINA SOARES DOS SANTOS","UN",1,1]
[2,{"$f":"IF(OR(C20=\"s\",C20=0),OFFSET(B20,-1,0),C20)","v":2},{"$f":"IF(OFFSET(C20,-1,0)=\"L\",1,IF(OFFSET(C20,-1,0)=1,2,IF(OR(A20=\"s\",A20=0),\"S\",IF(AND(OFFSET(C20,-1,0)=2,A20=4),3,IF(AND(OR(OFFSET(C20,-1,0)=\"s\",OFFSET(C20,-1,0)=0),A20<>\"s\",A20>OFFSET(B20,-1,0)),OFFSET(B20,-1,0),A20)))))","v":2},{"$f":"IF(OR(C20=\"S\",C20=0),0,IF(ISERROR(K20),J20,SMALL(J20:K20,1)))","v":33},{"$f":"IF($C20=1,OFFSET(E20,-1,0)+1,OFFSET(E20,-1,0))","v":1},{"$f":"IF($C20=1,0,IF($C20=2,OFFSET(F20,-1,0)+1,OFFSET(F20,-1,0)))","v":1},{"$f":"IF(AND($C20<=2,$C20<>0),0,IF($C20=3,OFFSET(G20,-1,0)+1,OFFSET(G20,-1,0)))","v":0},{"$f":"IF(AND($C20<=3,$C20<>0),0,IF($C20=4,OFFSET(H20,-1,0)+1,OFFSET(H20,-1,0)))","v":0},{"$f":"IF(AND($C20<=4,$C20<>0),0,IF(AND($C20=\"S\",$Y20>0),OFFSET(I20,-1,0)+1,OFFSET(I20,-1,0)))","v":0},348,33,"F","Nível 2","Nível 2","1.1.","SINAPI",null,"SERVIÇOS PRELIMINARES","-",null,1]
[{"$f":"CHOOSE(1+LOG(1+2*(ORÇAMENTO.Nivel=\"Nível 1\")+4*(ORÇAMENTO.Nivel=\"Nível 2\")+8*(ORÇAMENTO.Nivel=\"Nível 3\")+16*(ORÇAMENTO.Nivel=\"Nível 4\")+32*(ORÇAMENTO.Nivel=\"Serviço\"),2),0,1,2,3,4,\"S\")","v":3},3,3,2,{"$f":"IF($C21=1,OFFSET(E21,-1,0)+1,OFFSET(E21,-1,0))","v":1},{"$f":"IF($C21=1,0,IF($C21=2,OFFSET(F21,-1,0)+1,OFFSET(F21,-1,0)))","v":1},{"$f":"IF(AND($C21<=2,$C21<>0),0,IF($C21=3,OFFSET(G21,-1,0)+1,OFFSET(G21,-1,0)))","v":1},{"$f":"IF(AND($C21<=3,$C21<>0),0,IF($C21=4,OFFSET(H21,-1,0)+1,OFFSET(H21,-1,0)))","v":0},{"$f":"IF(AND($C21<=4,$C21<>0),0,IF(AND($C21=\"S\",$Y21>0),OFFSET(I21,-1,0)+1,OFFSET(I21,-1,0)))","v":0},32,2,"F","Nível 3","Nível 3","1.1.1.","AGETOP",null,"PALCO EXISTENTE","-",null,1,null,null,null,null,null,""]
["S",3,"S",0,1,1,1,0,{"$f":"IF(AND($C22<=4,$C22<>0),0,IF(AND($C22=\"S\",$Y22>0),OFFSET(I22,-1,0)+1,OFFSET(I22,-1,0)))","v":0},0,0,"F","Serviço","Serviço","1.1.1.1.","AGETOP",20121,"DEM. MANUAL EM CONCR.SIMPLES C/TR.ATE CB.E CARGA (O.C.)","m3    ",4.7190000000000003,1,null,null,null,null,null,""]
[3,3,3,15,1,1,2,0,{"$f":"IF(AND($C23<=4,$C23<>0),0,IF(AND($C23=\"S\",$Y23>0),OFFSET(I23,-1,0)+1,OFFSET(I23,-1,0)))","v":0},30,15,"F","Nível 3","Nível 3","1.1.2.","SINAPI",null,"DEMOLIÇÃO EDIFICAÇÃO EXISTENTE","-",null,1,null,null,null,null,null,""]
["S",3,"S",0,1,1,2,0,{"$f":"IF(AND($C24<=4,$C24<>0),0,IF(AND($C24=\"S\",$Y24>0),OFFSET(I24,-1,0)+1,OFFSET(I24,-1,0)))","v":0},0,0,"F","Serviço","Serviço","1.1.2.1.","AGETOP",20101,"DEMOLICAO COBERTURA TELHA CERAMICA C/ TRANSP. ATÉ CB. E CARGA","m2    ",820.73160000000007,1,null,null,null,null,null,""]
["S",3,"S",0,1,1,2,0,{"$f":"IF(AND($C25<=4,$C25<>0),0,IF(AND($C25=\"S\",$Y25>0),OFFSET(I25,-1,0)+1,OFFSET(I25,-1,0)))","v":0},0,0,"F","Serviço","Serviço","1.1.2.2.","AGETOP",20102,"DEMOLICAO-COBERTURA TELHA FIBROCIMENTO/FIBRA DE VIDRO/SIMILARES C/ TRANSP. ATÉ CB. E CARGA","m2    ",186.02,1,null,null,null,null,null,""]
["S",3,"S",0,1,1,2,0,{"$f":"IF(AND($C26<=4,$C26<>0),0,IF(AND($C26=\"S\",$Y26>0),OFFSET(I26,-1,0)+1,OFFSET(I26,-1,0)))","v":0},0,0,"F","Serviço","Serviço","1.1.2.3.","AGETOP",20103,"DEMOLIÇÃO ESTRUTURA EM MADEIRA TELHADO C/ TRANSP. ATÉ CB. E CARGA","m2    ",1006.75,1,null,null,null,null,null,""]
["S",3,"S",0,1,1,2,0,{"$f":"IF(AND($C27<=4,$C27<>0),0,IF(AND($C27=\"S\",$Y27>0),OFFSET(I27,-1,0)+1,OFFSET(I27,-1,0)))","v":0},0,0,"F","Serviço","Serviço","1.1.2.4.","AGETOP",20106,"RETIRADA DE JANELAS OU PORTAIS C/ TRANSP. ATÉ CB. E CARGA","m2    ",238.56,1,null,null,null,null,null,""]
["S",{"$f":"IF(OR(C28=\"s\",C28=0),OFFSET(B28,-1,0),C28)","v":3},{"$f":"IF(OFFSET(C28,-1,0)=\"L\",1,IF(OFFSET(C28,-1,0)=1,2,IF(OR(A28=\"s\",A28=0),\"S\",IF(AND(OFFSET(C28,-1,0)=2,A28=4),3,IF(AND(OR(OFFSET(C28,-1,0)=\"s\",OFFSET(C28,-1,0)=0),A28<>\"s\",A28>OFFSET(B28,-1,0)),OFFSET(B28,-1,0),A28)))))","v":"S"},{"$f":"IF(OR(C28=\"S\",C28=0),0,IF(ISERROR(K28),J28,SMALL(J28:K28,1)))","v":0},1,1,2,0,{"$f":"IF(AND($C28<=4,$C28<>0),0,IF(AND($C28=\"S\",$Y28>0),OFFSET(I28,-1,0)+1,OFFSET(I28,-1,0)))","v":0},0,0,"F","Serviço","Serviço","1.1.2.5.","AGETOP",20121,"DEM. MANUAL EM CONCR.SIMPLES C/TR.ATE CB.E CARGA (O.C.)","m3    ",75.072500000000005,1,null,null,null,null,null,""]
["S",3,"S",0,1,1,2,0,{"$f":"IF(AND($C29<=4,$C29<>0),0,IF(AND($C29=\"S\",$Y29>0),OFFSET(I29,-1,0)+1,OFFSET(I29,-1,0)))","v":0},0,0,"F","Serviço","Serviço","1.1.2.6.","AGETOP",20137,"DEMOLIÇAO BACIA SANITARIA C/ TRANSP. ATÉ CB. E CARGA","Un    ",7,1,null,null,null,null,null,""]
["S",3,"S",0,1,1,2,0,{"$f":"IF(AND($C30<=4,$C30<>0),0,IF(AND($C30=\"S\",$Y30>0),OFFSET(I30,-1,0)+1,OFFSET(I30,-1,0)))","v":0},0,0,"F","Serviço","Serviço","1.1.2.7.","AGETOP",20138,"DEMOLIÇAO DE LAVATÓRIO C/ TRANSP. ATÉ CB. E CARGA","Un    ",1,1,null,null,null,null,null,""]
["S",3,"S",0,1,1,2,0,{"$f":"IF(AND($C31<=4,$C31<>0),0,IF(AND($C31=\"S\",$Y31>0),OFFSET(I31,-1,0)+1,OFFSET(I31,-1,0)))","v":0},0,0,"F","Serviço","Serviço","1.1.2.8.","AGETOP",20139,"DEMOLIÇAO DE BANCADAS C/ TRANSP. ATÉ CB. E CARGA","m2    ",1.9708000000000001,1,null,null,null,null,null,""]
["S",3,"S",0,1,1,2,0,{"$f":"IF(AND($C32<=4,$C32<>0),0,IF(AND($C32=\"S\",$Y32>0),OFFSET(I32,-1,0)+1,OFFSET(I32,-1,0)))","v":0},0,0,"F","Serviço","Serviço","1.1.2.9.","AGETOP",20140,"DEMOLIÇAO DE VÁLVULA DE DESCARGA C/ TRANSP. ATÉ CB. E CARGA","Un    ",7,1,null,null,null,null,null,""]
["S",3,"S",0,1,1,2,0,{"$f":"IF(AND($C33<=4,$C33<>0),0,IF(AND($C33=\"S\",$Y33>0),OFFSET(I33,-1,0)+1,OFFSET(I33,-1,0)))","v":0},0,0,"F","Serviço","Serviço","1.1.2.10.","AGETOP",20147,"DEMOLIÇÃO DE FORRO PVC  INCLUSIVE ESTRUTURA DE SUSTENTAÇÃO C/ TRANSP. ATÉ CB. E CARGA","m2    ",639.53,1,null,null,null,null,null,""]
["S",3,"S",0,1,1,2,0,{"$f":"IF(AND($C34<=4,$C34<>0),0,IF(AND($C34=\"S\",$Y34>0),OFFSET(I34,-1,0)+1,OFFSET(I34,-1,0)))","v":0},0,0,"F","Serviço","Serviço","1.1.2.11.","AGETOP",20155,"DEMOL.MURO/PAREDE PLACA PRÉ-MOLDADA C/TRANSP.C.B.E CARGA","m2    ",2040.5250000000001,1,null,null,null,null,null,""]
["S",3,"S",0,1,1,2,0,{"$f":"IF(AND($C35<=4,$C35<>0),0,IF(AND($C35=\"S\",$Y35>0),OFFSET(I35,-1,0)+1,OFFSET(I35,-1,0)))","v":0},0,0,"F","Serviço","Serviço","1.1.2.12.","AGETOP",20162,"DEMOLIÇÃO DAS INSTALAÇÕES ELÉTRICAS E AFINS C/ TRANSP. ATÉ CB. E CARGA","H     ",24,1,null,null,null,null,null,""]
["S",3,"S",0,1,1,2,0,{"$f":"IF(AND($C36<=4,$C36<>0),0,IF(AND($C36=\"S\",$Y36>0),OFFSET(I36,-1,0)+1,OFFSET(I36,-1,0)))","v":0},0,0,"F","Serviço","Serviço","1.1.2.13.","AGETOP",20163,"DEMOLIÇÃO DAS INSTALAÇÕES HIDROSANITÁRIAS E AFINS C/ TRANSP. ATÉ CB. E CARGA","H     ",24,1,null,null,null,null,null,""]
["S",3,"S",0,1,1,2,0,{"$f":"IF(AND($C37<=4,$C37<>0),0,IF(AND($C37=\"S\",$Y37>0),OFFSET(I37,-1,0)+1,OFFSET(I37,-1,0)))","v":0},0,0,"F","Serviço","Serviço","1.1.2.14.","AGETOP",20190,"LIMPEZA MECANICA DE TERRENO","m2    ",1074,1,null,null,null,null,null,""]
[{"$f":"CHOOSE(1+LOG(1+2*(ORÇAMENTO.Nivel=\"Nível 1\")+4*(ORÇAMENTO.Nivel=\"Nível 2\")+8*(ORÇAMENTO.Nivel=\"Nível 3\")+16*(ORÇAMENTO.Nivel=\"Nível 4\")+32*(ORÇAMENTO.Nivel=\"Serviço\"),2),0,1,2,3,4,\"S\")","v":3},{"$f":"IF(OR(C38=\"s\",C38=0),OFFSET(B38,-1,0),C38)","v":3},{"$f":"IF(OFFSET(C38,-1,0)=\"L\",1,IF(OFFSET(C38,-1,0)=1,2,IF(OR(A38=\"s\",A38=0),\"S\",IF(AND(OFFSET(C38,-1,0)=2,A38=4),3,IF(AND(OR(OFFSET(C38,-1,0)=\"s\",OFFSET(C38,-1,0)=0),A38<>\"s\",A38>OFFSET(B38,-1,0)),OFFSET(B38,-1,0),A38)))))","v":3},{"$f":"IF(OR(C38=\"S\",C38=0),0,IF(ISERROR(K38),J38,SMALL(J38:K38,1)))","v":2},{"$f":"IF($C38=1,OFFSET(E38,-1,0)+1,OFFSET(E38,-1,0))","v":1},{"$f":"IF($C38=1,0,IF($C38=2,OFFSET(F38,-1,0)+1,OFFSET(F38,-1,0)))","v":1},{"$f":"IF(AND($C38<=2,$C38<>0),0,IF($C38=3,OFFSET(G38,-1,0)+1,OFFSET(G38,-1,0)))","v":3},{"$f":"IF(AND($C38<=3,$C38<>0),0,IF($C38=4,OFFSET(H38,-1,0)+1,OFFSET(H38,-1,0)))","v":0},{"$f":"IF(AND($C38<=4,$C38<>0),0,IF(AND($C38=\"S\",$Y38>0),OFFSET(I38,-1,0)+1,OFFSET(I38,-1,0)))","v":0},15,2,"F","Nível 3","Nível 3","1.1.3.","AGETOP",null,"MURETA QUADRA","-",null,1,null,null,null,null,null,""]
["S",3,"S",0,1,1,3,0,{"$f":"IF(AND($C39<=4,$C39<>0),0,IF(AND($C39=\"S\",$Y39>0),OFFSET(I39,-1,0)+1,OFFSET(I39,-1,0)))","v":0},0,0,"F","Serviço","Serviço","1.1.3.1.","AGETOP",20118,"DEM.ALVEN.TIJOLO S/REAP. C/TR.ATE CB. E CARGA","m3    ",8.4074999999999989,1,null,null,null,null,null,""]
[3,3,3,3,1,1,4,0,{"$f":"IF(AND($C40<=4,$C40<>0),0,IF(AND($C40=\"S\",$Y40>0),OFFSET(I40,-1,0)+1,OFFSET(I40,-1,0)))","v":0},13,3,"F","Nível 3","Nível 3","1.1.4.","AGETOP",null,"REMOÇÃO ÁRVORES","-",null,1,null,null,null,null,null,""]
["S",3,"S",0,1,1,4,0,{"$f":"IF(AND($C41<=4,$C41<>0),0,IF(AND($C41=\"S\",$Y41>0),OFFSET(I41,-1,0)+1,OFFSET(I41,-1,0)))","v":0},0,0,"F","Serviço","Serviço","1.1.4.1.","SINAPI",98529,"CORTE RASO E RECORTE DE ÁRVORE COM DIÂMETRO DE TRONCO MAIOR OU IGUAL A 0,20 M E MENOR QUE 0,40 M.AF_05/2018","UN",11,1,null,null,null,null,null,""]
["S",3,"S",0,1,1,4,0,{"$f":"IF(AND($C42<=4,$C42<>0),0,IF(AND($C42=\"S\",$Y42>0),OFFSET(I42,-1,0)+1,OFFSET(I42,-1,0)))","v":0},0,0,"F","Serviço","Serviço","1.1.4.2.","SINAPI",98526,"REMOÇÃO DE RAÍZES REMANESCENTES DE TRONCO DE ÁRVORE COM DIÂMETRO MAIOR OU IGUAL A 0,20 M E MENOR QUE 0,40 M.AF_05/2018","UN",11,1,null,null,null,null,null,""]
[3,3,3,10,1,1,5,0,{"$f":"IF(AND($C43<=4,$C43<>0),0,IF(AND($C43=\"S\",$Y43>0),OFFSET(I43,-1,0)+1,OFFSET(I43,-1,0)))","v":0},10,309,"F","Nível 3","Nível 3","1.1.5.","AGETOP",null,"OUTROS","-",null,1,null,null,null,null,null,""]
["S",3,"S",0,1,1,5,0,{"$f":"IF(AND($C44<=4,$C44<>0),0,IF(AND($C44=\"S\",$Y44>0),OFFSET(I44,-1,0)+1,OFFSET(I44,-1,0)))","v":0},0,0,"F","Serviço","Serviço","1.1.5.1.","AGETOP",21301,"PLACA DE OBRA PLOTADA EM CHAPA METÁLICA 26 , AFIXADA EM CAVALETES DE MADEIRA DE LEI (VIGOTAS 6X12CM) - PADRÃO AGETOP","m2    ",4.5,1,null,null,null,null,null,""]
["S",3,"S",0,1,1,5,0,{"$f":"IF(AND($C45<=4,$C45<>0),0,IF(AND($C45=\"S\",$Y45>0),OFFSET(I45,-1,0)+1,OFFSET(I45,-1,0)))","v":0},0,0,"F","Serviço","Serviço","1.1.5.2.","AGETOP",20210,"BARRACÃO DE OBRAS PADRÃO AGETOP/2014 ( BLOCOS,COBERTURAS, PASSARELAS E MÓVEIS), COM ALOJAMENTO E LAVANDERIA , COM PINTURA, EM CONSONÂNCIA COM AS NR's, EM ESPECIAL A NR-18, INCLUSO INSTALAÇÕES ELÉTRICAS E HIDROSSANITÁRIAS - ( COM REAPROVEITAMENTO 1 VEZ ).","m2    ",70,1,null,null,null,null,null,""]
["S",3,"S",0,1,1,5,0,{"$f":"IF(AND($C46<=4,$C46<>0),0,IF(AND($C46=\"S\",$Y46>0),OFFSET(I46,-1,0)+1,OFFSET(I46,-1,0)))","v":0},0,0,"F","Serviço","Serviço","1.1.5.3.","AGETOP",20302,"DEPÓSITO PARA CIMENTO TIPO I  COM PINTURA PADRÃO AGETOP/2014 (2,20 X 2,262M) A=4,98 M2 ( C/ REAPROV. 1 VEZ ) - INCLUSO PALETES ","Un    ",1,1,null,null,null,null,null,""]
["S",3,"S",0,1,1,5,0,{"$f":"IF(AND($C47<=4,$C47<>0),0,IF(AND($C47=\"S\",$Y47>0),OFFSET(I47,-1,0)+1,OFFSET(I47,-1,0)))","v":0},0,0,"F","Serviço","Serviço","1.1.5.4.","AGETOP",20400,"LIGAÇÃO PROVISÓRIA DE ÁGUA ( INCLUSO RETIRADA DO ESGOTO SANITÁRIO) - PD. AGETOP","Un    ",1,1,null,null,null,null,null,""]
["S",3,"S",0,1,1,5,0,{"$f":"IF(AND($C48<=4,$C48<>0),0,IF(AND($C48=\"S\",$Y48>0),OFFSET(I48,-1,0)+1,OFFSET(I48,-1,0)))","v":0},0,0,"F","Serviço","Serviço","1.1.5.5.","AGETOP",20501,"LIGAÇÃO PROVISÓRIA LUZ E FORÇA - PD. AGETOP","Un    ",1,1,null,null,null,null,null,""]
["S",3,"S",0,1,1,5,0,{"$f":"IF(AND($C49<=4,$C49<>0),0,IF(AND($C49=\"S\",$Y49>0),OFFSET(I49,-1,0)+1,OFFSET(I49,-1,0)))","v":0},0,0,"F","Serviço","Serviço","1.1.5.6.","AGETOP",20200,"FERRAMENTAS (MANUAIS/ELÉTRICAS) E MATERIAL DE LIMPEZA PERMANENTE DA OBRA - ÁREAS EDIFICADAS/COBERTAS/FECHADAS","m2    ",1496.75,1,null,null,null,null,null,""]
["S",3,"S",0,1,1,5,0,{"$f":"IF(AND($C50<=4,$C50<>0),0,IF(AND($C50=\"S\",$Y50>0),OFFSET(I50,-1,0)+1,OFFSET(I50,-1,0)))","v":0},0,0,"F","Serviço","Serviço","1.1.5.7.","AGETOP",21400,"CONSUMO DE ÁGUA","m3    ",692.69589999999994,1,null,null,null,null,null,""]
["S",3,"S",0,1,1,5,0,{"$f":"IF(AND($C51<=4,$C51<>0),0,IF(AND($C51=\"S\",$Y51>0),OFFSET(I51,-1,0)+1,OFFSET(I51,-1,0)))","v":0},0,0,"F","Serviço","Serviço","1.1.5.8.","AGETOP",21401,"CONSUMO DE ENERGIA ELÉTRICA","KWH   ",4932.0456975000006,1,null,null,null,null,null,""]
["S",3,"S",0,1,1,5,0,{"$f":"IF(AND($C52<=4,$C52<>0),0,IF(AND($C52=\"S\",$Y52>0),OFFSET(I52,-1,0)+1,OFFSET(I52,-1,0)))","v":0},0,0,"F","Serviço","Serviço","1.1.5.9.","AGETOP",21602,"EPI/PPRA/PCMSO/EXAMES/TREINAMENTOS/VISITAS (< 20 EMPREGADOS) - ÁREAS EDIFICADAS/COBERTAS/FECHADAS","m2    ",1496.75,1,null,null,null,null,null,""]
[2,2,2,3,1,2,0,0,{"$f":"IF(AND($C53<=4,$C53<>0),0,IF(AND($C53=\"S\",$Y53>0),OFFSET(I53,-1,0)+1,OFFSET(I53,-1,0)))","v":0},315,3,"F","Nível 2","Nível 2","1.2.","AGETOP",null,"TRANSPORTES","-",null,1,null,null,null,null,null,""]
["S",2,"S",0,1,2,0,0,{"$f":"IF(AND($C54<=4,$C54<>0),0,IF(AND($C54=\"S\",$Y54>0),OFFSET(I54,-1,0)+1,OFFSET(I54,-1,0)))","v":0},0,0,"F","Serviço","Serviço","1.2.0.1.","SINAPI",72900,"TRANSPORTE DE ENTULHO COM CAMINHAO BASCULANTE 6 M3, RODOVIA PAVIMENTADA, DMT 0,5 A 1,0 KM","M3",330,1,null,null,null,null,null,""]
["S",2,"S",0,1,2,0,0,{"$f":"IF(AND($C55<=4,$C55<>0),0,IF(AND($C55=\"S\",$Y55>0),OFFSET(I55,-1,0)+1,OFFSET(I55,-1,0)))","v":0},0,0,"F","Serviço","Serviço","1.2.0.2.","SINAPI",72897,"CARGA MANUAL DE ENTULHO EM CAMINHAO BASCULANTE 6 M3","M3",330,1,null,null,null,null,null,""]
[2,2,2,8,1,3,0,0,{"$f":"IF(AND($C56<=4,$C56<>0),0,IF(AND($C56=\"S\",$Y56>0),OFFSET(I56,-1,0)+1,OFFSET(I56,-1,0)))","v":0},312,8,"F","Nível 2","Nível 2","1.3.","SINAPI",null,"SERVIÇO EM TERRA","-",null,1,null,null,null,null,null,""]
[3,3,3,7,1,3,1,0,{"$f":"IF(AND($C57<=4,$C57<>0),0,IF(AND($C57=\"S\",$Y57>0),OFFSET(I57,-1,0)+1,OFFSET(I57,-1,0)))","v":0},7,77,"F","Nível 3","Nível 3","1.3.1.","AGETOP",null,"AQUISIÇÃO DE TERRA","-",null,1,null,null,null,null,null,""]
["S",3,"S",0,1,3,1,0,{"$f":"IF(AND($C58<=4,$C58<>0),0,IF(AND($C58=\"S\",$Y58>0),OFFSET(I58,-1,0)+1,OFFSET(I58,-1,0)))","v":0},0,0,"F","Serviço","Serviço","1.3.1.1.","AGETOP",41004,"ESCAVACAO MECANICA","m3    ",383.11250000000001,1,null,null,null,null,null,""]
["S",3,"S",0,1,3,1,0,{"$f":"IF(AND($C59<=4,$C59<>0),0,IF(AND($C59=\"S\",$Y59>0),OFFSET(I59,-1,0)+1,OFFSET(I59,-1,0)))","v":0},0,0,"F","Serviço","Serviço","1.3.1.2.","AGETOP",41005,"CARGA MECANIZADA","m3    ",144.65,1,null,null,null,null,null,""]
["S",3,"S",0,1,3,1,0,{"$f":"IF(AND($C60<=4,$C60<>0),0,IF(AND($C60=\"S\",$Y60>0),OFFSET(I60,-1,0)+1,OFFSET(I60,-1,0)))","v":0},0,0,"F","Serviço","Serviço","1.3.1.3.","AGETOP",41012,"INDENIZAÇÃO DE JAZIDA","m3    ",144.65,1,null,null,null,null,null,""]
["S",3,"S",0,1,3,1,0,{"$f":"IF(AND($C61<=4,$C61<>0),0,IF(AND($C61=\"S\",$Y61>0),OFFSET(I61,-1,0)+1,OFFSET(I61,-1,0)))","v":0},0,0,"F","Serviço","Serviço","1.3.1.4.","AGETOP",41006,"TRANSPORTE DE MATERIAL ESCAVADO M3.KM","m3km  ",1446.5,1,null,null,null,null,null,""]
["S",3,"S",0,1,3,1,0,{"$f":"IF(AND($C62<=4,$C62<>0),0,IF(AND($C62=\"S\",$Y62>0),OFFSET(I62,-1,0)+1,OFFSET(I62,-1,0)))","v":0},0,0,"F","Serviço","Serviço","1.3.1.5.","AGETOP",41010,"TRANSPORTE COM LÂMINA ATE 100 M - (OBRAS CIVIS)","m3    ",238.46250000000001,1,null,null,null,null,null,""]
["S",3,"S",0,1,3,1,0,{"$f":"IF(AND($C63<=4,$C63<>0),0,IF(AND($C63=\"S\",$Y63>0),OFFSET(I63,-1,0)+1,OFFSET(I63,-1,0)))","v":0},0,0,"F","Serviço","Serviço","1.3.1.6.","AGETOP",41008,"COMPACTAÇÃO MECÂNICA COM CONTROLE DA UMIDADE (95% PN)","m3    ",306.49,1,null,null,null,null,null,""]
[{"$f":"CHOOSE(1+LOG(1+2*(ORÇAMENTO.Nivel=\"Nível 1\")+4*(ORÇAMENTO.Nivel=\"Nível 2\")+8*(ORÇAMENTO.Nivel=\"Nível 3\")+16*(ORÇAMENTO.Nivel=\"Nível 4\")+32*(ORÇAMENTO.Nivel=\"Serviço\"),2),0,1,2,3,4,\"S\")","v":2},2,2,7,1,4,0,0,{"$f":"IF(AND($C64<=4,$C64<>0),0,IF(AND($C64=\"S\",$Y64>0),OFFSET(I64,-1,0)+1,OFFSET(I64,-1,0)))","v":0},304,7,"F","Nível 2","Nível 2","1.4.","AGETOP",null,"FUNDAÇÕES E SONDAGENS","-",null,1,null,null,null,null,null,""]
["S",2,"S",0,1,4,0,0,{"$f":"IF(AND($C65<=4,$C65<>0),0,IF(AND($C65=\"S\",$Y65>0),OFFSET(I65,-1,0)+1,OFFSET(I65,-1,0)))","v":0},0,0,"F","Serviço","Serviço","1.4.0.1.","AGETOP",40103,"ESCAVAÇAO MANUAL DE VALAS PROF.1 A 2 M","m3    ",0.19,1,null,null,null,null,null,""]
["S",2,"S",0,1,4,0,0,{"$f":"IF(AND($C66<=4,$C66<>0),0,IF(AND($C66=\"S\",$Y66>0),OFFSET(I66,-1,0)+1,OFFSET(I66,-1,0)))","v":0},0,0,"F","Serviço","Serviço","1.4.0.2.","AGETOP",50302,"ESTACA A TRADO DIAM.30 CM SEM FERRO","M     ",125.5,1,null,null,null,null,null,""]
["S",2,"S",0,1,4,0,0,{"$f":"IF(AND($C67<=4,$C67<>0),0,IF(AND($C67=\"S\",$Y67>0),OFFSET(I67,-1,0)+1,OFFSET(I67,-1,0)))","v":0},0,0,"F","Serviço","Serviço","1.4.0.3.","COMPOSIÇÃO","COMP 199_SEE","ESTACA A TRADO DIAM.40 CM S/FERRO","M",1.5,1,null,null,null,null,null,""]
["S",{"$f":"IF(OR(C68=\"s\",C68=0),OFFSET(B68,-1,0),C68)","v":2},{"$f":"IF(OFFSET(C68,-1,0)=\"L\",1,IF(OFFSET(C68,-1,0)=1,2,IF(OR(A68=\"s\",A68=0),\"S\",IF(AND(OFFSET(C68,-1,0)=2,A68=4),3,IF(AND(OR(OFFSET(C68,-1,0)=\"s\",OFFSET(C68,-1,0)=0),A68<>\"s\",A68>OFFSET(B68,-1,0)),OFFSET(B68,-1,0),A68)))))","v":"S"},{"$f":"IF(OR(C68=\"S\",C68=0),0,IF(ISERROR(K68),J68,SMALL(J68:K68,1)))","v":0},{"$f":"IF($C68=1,OFFSET(E68,-1,0)+1,OFFSET(E68,-1,0))","v":1},{"$f":"IF($C68=1,0,IF($C68=2,OFFSET(F68,-1,0)+1,OFFSET(F68,-1,0)))","v":4},{"$f":"IF(AND($C68<=2,$C68<>0),0,IF($C68=3,OFFSET(G68,-1,0)+1,OFFSET(G68,-1,0)))","v":0},{"$f":"IF(AND($C68<=3,$C68<>0),0,IF($C68=4,OFFSET(H68,-1,0)+1,OFFSET(H68,-1,0)))","v":0},{"$f":"IF(AND($C68<=4,$C68<>0),0,IF(AND($C68=\"S\",$Y68>0),OFFSET(I68,-1,0)+1,OFFSET(I68,-1,0)))","v":0},0,0,"F","Serviço","Serviço","1.4.0.4.","AGETOP",52002,"ACO CA-25 - 6,3 MM (1/4\") - (OBRAS CIVIS)","Kg    ",6,1,null,null,null,null,null,""]
["S",2,"S",0,1,4,0,0,{"$f":"IF(AND($C69<=4,$C69<>0),0,IF(AND($C69=\"S\",$Y69>0),OFFSET(I69,-1,0)+1,OFFSET(I69,-1,0)))","v":0},0,0,"F","Serviço","Serviço","1.4.0.5.","AGETOP",52004,"ACO CA 50-A - 8,0 MM (5/16\") - (OBRAS CIVIS)","Kg    ",100,1,null,null,null,null,null,""]
["S",2,"S",0,1,4,0,0,{"$f":"IF(AND($C70<=4,$C70<>0),0,IF(AND($C70=\"S\",$Y70>0),OFFSET(I70,-1,0)+1,OFFSET(I70,-1,0)))","v":0},0,0,"F","Serviço","Serviço","1.4.0.6.","AGETOP",52014,"ACO CA-60 - 5,0 MM - (OBRAS CIVIS)","Kg    ",51,1,null,null,null,null,null,""]
[2,2,2,17,1,5,0,0,{"$f":"IF(AND($C71<=4,$C71<>0),0,IF(AND($C71=\"S\",$Y71>0),OFFSET(I71,-1,0)+1,OFFSET(I71,-1,0)))","v":0},297,17,"F","Nível 2","Nível 2","1.5.","AGETOP",null,"ESTRUTURA","-",null,1,null,null,null,null,null,""]
["S",2,"S",0,1,5,0,0,{"$f":"IF(AND($C72<=4,$C72<>0),0,IF(AND($C72=\"S\",$Y72>0),OFFSET(I72,-1,0)+1,OFFSET(I72,-1,0)))","v":0},0,0,"F","Serviço","Serviço","1.5.0.1.","SINAPI","73816/1","EXECUCAO DE DRENO COM TUBOS DE PVC CORRUGADO FLEXIVEL PERFURADO - DN 100","M",132,1,null,null,null,null,null,""]
["S",2,"S",0,1,5,0,0,{"$f":"IF(AND($C73<=4,$C73<>0),0,IF(AND($C73=\"S\",$Y73>0),OFFSET(I73,-1,0)+1,OFFSET(I73,-1,0)))","v":0},0,0,"F","Serviço","Serviço","1.5.0.2.","SINAPI",89669,"LUVA SIMPLES, PVC, SERIE R, ÁGUA PLUVIAL, DN 100 MM, JUNTA ELÁSTICA, FORNECIDO E INSTALADO EM CONDUTORES VERTICAIS DE ÁGUAS PLUVIAIS. AF_12/2014","UN",22,1,null,null,null,null,null,""]
["S",2,"S",0,1,5,0,0,{"$f":"IF(AND($C74<=4,$C74<>0),0,IF(AND($C74=\"S\",$Y74>0),OFFSET(I74,-1,0)+1,OFFSET(I74,-1,0)))","v":0},0,0,"F","Serviço","Serviço","1.5.0.3.","SINAPI",89573,"TÊ, PVC, SERIE R, ÁGUA PLUVIAL, DN 100 X 75 MM, JUNTA ELÁSTICA, FORNECIDO E INSTALADO EM RAMAL DE ENCAMINHAMENTO. AF_12/2014","UN",66,1,null,null,null,null,null,""]
["S",2,"S",0,1,5,0,0,{"$f":"IF(AND($C75<=4,$C75<>0),0,IF(AND($C75=\"S\",$Y75>0),OFFSET(I75,-1,0)+1,OFFSET(I75,-1,0)))","v":0},0,0,"F","Serviço","Serviço","1.5.0.4.","AGETOP",82101,"REDUCAO EXCENTRICA 75 X 50 MM","Un    ",66,1,null,null,null,null,null,""]
["S",2,"S",0,1,5,0,0,{"$f":"IF(AND($C76<=4,$C76<>0),0,IF(AND($C76=\"S\",$Y76>0),OFFSET(I76,-1,0)+1,OFFSET(I76,-1,0)))","v":0},0,0,"F","Serviço","Serviço","1.5.0.5.","SINAPI",89509,"TUBO PVC, SÉRIE R, ÁGUA PLUVIAL, DN 50 MM, FORNECIDO E INSTALADO EM RAMAL DE ENCAMINHAMENTO. AF_12/2014","M",26,1,null,null,null,null,null,""]
["S",2,"S",0,1,5,0,0,{"$f":"IF(AND($C77<=4,$C77<>0),0,IF(AND($C77=\"S\",$Y77>0),OFFSET(I77,-1,0)+1,OFFSET(I77,-1,0)))","v":0},0,0,"F","Serviço","Serviço","1.5.0.6.","AGETOP",81702,"CURVA 45 GRAUS DIAMETRO 100 MM","Un    ",2,1,null,null,null,null,null,""]
["S",2,"S",0,1,5,0,0,{"$f":"IF(AND($C78<=4,$C78<>0),0,IF(AND($C78=\"S\",$Y78>0),OFFSET(I78,-1,0)+1,OFFSET(I78,-1,0)))","v":0},0,0,"F","Serviço","Serviço","1.5.0.7.","AGETOP",81643,"CAP DIAMETRO 100 MM ESGOTO PRIMARIO","Un    ",2,1,null,null,null,null,null,""]
["S",2,"S",0,1,5,0,0,{"$f":"IF(AND($C79<=4,$C79<>0),0,IF(AND($C79=\"S\",$Y79>0),OFFSET(I79,-1,0)+1,OFFSET(I79,-1,0)))","v":0},0,0,"F","Serviço","Serviço","1.5.0.8.","SINAPI","73881/1","EXECUCAO DE DRENO COM MANTA GEOTEXTIL 200 G/M2","M2",52.8,1,null,null,null,null,null,""]
["S",2,"S",0,1,5,0,0,{"$f":"IF(AND($C80<=4,$C80<>0),0,IF(AND($C80=\"S\",$Y80>0),OFFSET(I80,-1,0)+1,OFFSET(I80,-1,0)))","v":0},0,0,"F","Serviço","Serviço","1.5.0.9.","AGETOP",110106,"CORTINA CANALETA CONCRETO 14X19X19 PARA SER CHEIA CONCRETO ARMADO (0,0568M3/M2) - EXCLUSO O CONCRETO","m2    ",109.6,1,null,null,null,null,null,""]
["S",2,"S",0,1,5,0,0,{"$f":"IF(AND($C81<=4,$C81<>0),0,IF(AND($C81=\"S\",$Y81>0),OFFSET(I81,-1,0)+1,OFFSET(I81,-1,0)))","v":0},0,0,"F","Serviço","Serviço","1.5.0.10.","COMPOSIÇÃO","COMP 334_SEE","ALVENARIA DE BLOCO DE CONCRETO ESTRUTURAL 14X19X39, FBK 4,5MPA","M2",236.72,1,null,null,null,null,null,""]
["S",2,"S",0,1,5,0,0,{"$f":"IF(AND($C82<=4,$C82<>0),0,IF(AND($C82=\"S\",$Y82>0),OFFSET(I82,-1,0)+1,OFFSET(I82,-1,0)))","v":0},0,0,"F","Serviço","Serviço","1.5.0.11.","AGETOP",60304,"ACO CA-50 A - 8,0 MM (5/16\") - (OBRAS CIVIS)","Kg    ",1038,1,null,null,null,null,null,""]
["S",2,"S",0,1,5,0,0,{"$f":"IF(AND($C83<=4,$C83<>0),0,IF(AND($C83=\"S\",$Y83>0),OFFSET(I83,-1,0)+1,OFFSET(I83,-1,0)))","v":0},{"$f":"IF(OR($C83=\"S\",$C83=0),0,MATCH(0,OFFSET($D83,1,$C83,ROW($C$1328)-ROW($C83)),0))","v":0},{"$f":"IF(OR($C83=\"S\",$C83=0),0,MATCH(OFFSET($D83,0,$C83)+1,OFFSET($D83,1,$C83,ROW($C$1328)-ROW($C83)),0))","v":0},"F","Serviço","Serviço","1.5.0.12.","AGETOP",60305,"ACO CA-50A - 10,0 MM (3/8\") - (OBRAS CIVIS)","Kg    ",71,1,null,null,null,null,null,""]
["S",2,"S",0,1,5,0,0,{"$f":"IF(AND($C84<=4,$C84<>0),0,IF(AND($C84=\"S\",$Y84>0),OFFSET(I84,-1,0)+1,OFFSET(I84,-1,0)))","v":0},0,0,"F","Serviço","Serviço","1.5.0.13.","AGETOP",60314,"ACO CA - 60 - 5,0 MM - (OBRAS CIVIS)","Kg    ",277,1,null,null,null,null,null,""]
["S",2,"S",0,1,5,0,0,{"$f":"IF(AND($C85<=4,$C85<>0),0,IF(AND($C85=\"S\",$Y85>0),OFFSET(I85,-1,0)+1,OFFSET(I85,-1,0)))","v":0},0,0,"F","Serviço","Serviço","1.5.0.14.","AGETOP",60192,"FORMA DE TABUA CINTA/PILAR SOBRE/ENTRE ALVENARIA U=8 VEZES","m2    ",350.34,1,null,null,null,null,null,""]
["S",2,"S",0,1,5,0,0,{"$f":"IF(AND($C86<=4,$C86<>0),0,IF(AND($C86=\"S\",$Y86>0),OFFSET(I86,-1,0)+1,OFFSET(I86,-1,0)))","v":0},0,0,"F","Serviço","Serviço","1.5.0.15.","AGETOP",60507,"PREPARO COM BETONEIRA E TRANSPORTE MANUAL DE CONCRETO FCK-20 - (O.C.)","m3    ",28.17,1,null,null,null,null,null,""]
["S",2,"S",0,1,5,0,0,{"$f":"IF(AND($C87<=4,$C87<>0),0,IF(AND($C87=\"S\",$Y87>0),OFFSET(I87,-1,0)+1,OFFSET(I87,-1,0)))","v":0},0,0,"F","Serviço","Serviço","1.5.0.16.","AGETOP",60801,"LANÇAMENTO/APLICAÇÃO/ADENSAMENTO MANUAL DE CONCRETO - (OBRAS CIVIS)","m3    ",28.17,1,null,null,null,null,null,""]
[2,2,2,126,1,6,0,0,{"$f":"IF(AND($C88<=4,$C88<>0),0,IF(AND($C88=\"S\",$Y88>0),OFFSET(I88,-1,0)+1,OFFSET(I88,-1,0)))","v":0},280,126,"F","Nível 2","Nível 2","1.6.","SINAPI",null,"INSTALAÇÕES ELÉTRICAS","-",null,1,null,null,null,null,null,""]
[3,3,3,45,1,6,1,0,{"$f":"IF(AND($C89<=4,$C89<>0),0,IF(AND($C89=\"S\",$Y89>0),OFFSET(I89,-1,0)+1,OFFSET(I89,-1,0)))","v":0},125,45,"F","Nível 3","Nível 3","1.6.1.","AGETOP",null,"IMPLANTAÇÃO","-",null,1,null,null,null,null,null,""]
["S",3,"S",0,1,6,1,0,{"$f":"IF(AND($C90<=4,$C90<>0),0,IF(AND($C90=\"S\",$Y90>0),OFFSET(I90,-1,0)+1,OFFSET(I90,-1,0)))","v":0},0,0,"F","Serviço","Serviço","1.6.1.1.","AGETOP",40101,"ESCAVACAO MANUAL DE VALAS < 1 MTS. (OBRAS CIVIS)","m3    ",50,1,null,null,null,null,null,""]
["S",3,"S",0,1,6,1,0,{"$f":"IF(AND($C91<=4,$C91<>0),0,IF(AND($C91=\"S\",$Y91>0),OFFSET(I91,-1,0)+1,OFFSET(I91,-1,0)))","v":0},0,0,"F","Serviço","Serviço","1.6.1.2.","AGETOP",41002,"APILOAMENTO","m2    ",64.61,1,null,null,null,null,null,""]
["S",3,"S",0,1,6,1,0,{"$f":"IF(AND($C92<=4,$C92<>0),0,IF(AND($C92=\"S\",$Y92>0),OFFSET(I92,-1,0)+1,OFFSET(I92,-1,0)))","v":0},0,0,"F","Serviço","Serviço","1.6.1.3.","AGETOP",71202,"ELETRODUTO DE PVC RIGIDO DIAMETRO 1\"","M     ",285,1,null,null,null,null,null,""]
["S",3,"S",0,1,6,1,0,{"$f":"IF(AND($C93<=4,$C93<>0),0,IF(AND($C93=\"S\",$Y93>0),OFFSET(I93,-1,0)+1,OFFSET(I93,-1,0)))","v":0},0,0,"F","Serviço","Serviço","1.6.1.4.","AGETOP",71203,"ELETRODUTO DE PVC RIGIDO DIAMETRO 1.1/2\"","M     ",68.709999999999994,1,null,null,null,null,null,""]
["S",3,"S",0,1,6,1,0,{"$f":"IF(AND($C94<=4,$C94<>0),0,IF(AND($C94=\"S\",$Y94>0),OFFSET(I94,-1,0)+1,OFFSET(I94,-1,0)))","v":0},0,0,"F","Serviço","Serviço","1.6.1.5.","AGETOP",71206,"ELETRODUTO DE PVC RIGIDO DIAMETRO 2.1/2\"","M     ",40,1,null,null,null,null,null,""]
["S",3,"S",0,1,6,1,0,{"$f":"IF(AND($C95<=4,$C95<>0),0,IF(AND($C95=\"S\",$Y95>0),OFFSET(I95,-1,0)+1,OFFSET(I95,-1,0)))","v":0},0,0,"F","Serviço","Serviço","1.6.1.6.","AGETOP",71207,"ELETRODUTO DE PVC RIGIDO DIAMETRO 3\"","M     ",30,1,null,null,null,null,null,""]
["S",3,"S",0,1,6,1,0,{"$f":"IF(AND($C96<=4,$C96<>0),0,IF(AND($C96=\"S\",$Y96>0),OFFSET(I96,-1,0)+1,OFFSET(I96,-1,0)))","v":0},0,0,"F","Serviço","Serviço","1.6.1.7.","AGETOP",70422,"BUCHA E ARRUELA METALICA DIAM. 1\"","PR    ",95,1,null,null,null,null,null,""]
["S",3,"S",0,1,6,1,0,{"$f":"IF(AND($C97<=4,$C97<>0),0,IF(AND($C97=\"S\",$Y97>0),OFFSET(I97,-1,0)+1,OFFSET(I97,-1,0)))","v":0},0,0,"F","Serviço","Serviço","1.6.1.8.","AGETOP",70424,"BUCHA E ARRUELA METALICA DIAM. 1.1/2\"","PR    ",22,1,null,null,null,null,null,""]
["S",3,"S",0,1,6,1,0,{"$f":"IF(AND($C98<=4,$C98<>0),0,IF(AND($C98=\"S\",$Y98>0),OFFSET(I98,-1,0)+1,OFFSET(I98,-1,0)))","v":0},0,0,"F","Serviço","Serviço","1.6.1.9.","AGETOP",70426,"BUCHA E ARRUELA METALICA DIAM. 2.1/2\"","PR    ",13,1,null,null,null,null,null,""]
["S",3,"S",0,1,6,1,0,{"$f":"IF(AND($C99<=4,$C99<>0),0,IF(AND($C99=\"S\",$Y99>0),OFFSET(I99,-1,0)+1,OFFSET(I99,-1,0)))","v":0},0,0,"F","Serviço","Serviço","1.6.1.10.","AGETOP",70427,"BUCHA E ARRUELA METALICA DIAM. 3\"","PR    ",10,1,null,null,null,null,null,""]
["S",3,"S",0,1,6,1,0,{"$f":"IF(AND($C100<=4,$C100<>0),0,IF(AND($C100=\"S\",$Y100>0),OFFSET(I100,-1,0)+1,OFFSET(I100,-1,0)))","v":0},0,0,"F","Serviço","Serviço","1.6.1.11.","AGETOP",70352,"BRACADEIRA METALICA TIPO \"U\" DIAM. 1\"","Un    ",90,1,null,null,null,null,null,""]
["S",3,"S",0,1,6,1,0,{"$f":"IF(AND($C101<=4,$C101<>0),0,IF(AND($C101=\"S\",$Y101>0),OFFSET(I101,-1,0)+1,OFFSET(I101,-1,0)))","v":0},0,0,"F","Serviço","Serviço","1.6.1.12.","AGETOP",70354,"BRACADEIRA METALICA TIPO \"U\" DIAM. 1.1/2\"","Un    ",10,1,null,null,null,null,null,""]
["S",3,"S",0,1,6,1,0,{"$f":"IF(AND($C102<=4,$C102<>0),0,IF(AND($C102=\"S\",$Y102>0),OFFSET(I102,-1,0)+1,OFFSET(I102,-1,0)))","v":0},0,0,"F","Serviço","Serviço","1.6.1.13.","AGETOP",70356,"BRACADEIRA METALICA TIPO \"U\" DIAM. 2.1/2\"","Un    ",5,1,null,null,null,null,null,""]
["S",3,"S",0,1,6,1,0,{"$f":"IF(AND($C103<=4,$C103<>0),0,IF(AND($C103=\"S\",$Y103>0),OFFSET(I103,-1,0)+1,OFFSET(I103,-1,0)))","v":0},0,0,"F","Serviço","Serviço","1.6.1.14.","AGETOP",70357,"BRACADEIRA METALICA TIPO \"U\" DIAM. 3\"","Un    ",5,1,null,null,null,null,null,""]
["S",3,"S",0,1,6,1,0,{"$f":"IF(AND($C104<=4,$C104<>0),0,IF(AND($C104=\"S\",$Y104>0),OFFSET(I104,-1,0)+1,OFFSET(I104,-1,0)))","v":0},0,0,"F","Serviço","Serviço","1.6.1.15.","AGETOP",70582,"CABO PVC (70ºC) 1 KV No. 4 MM2","M     ",1400.6,1,null,null,null,null,null,""]
["S",3,"S",0,1,6,1,0,{"$f":"IF(AND($C105<=4,$C105<>0),0,IF(AND($C105=\"S\",$Y105>0),OFFSET(I105,-1,0)+1,OFFSET(I105,-1,0)))","v":0},0,0,"F","Serviço","Serviço","1.6.1.16.","AGETOP",70583,"CABO PVC (70ºC) 1 KV No. 6 MM2","M     ",176,1,null,null,null,null,null,""]
["S",3,"S",0,1,6,1,0,{"$f":"IF(AND($C106<=4,$C106<>0),0,IF(AND($C106=\"S\",$Y106>0),OFFSET(I106,-1,0)+1,OFFSET(I106,-1,0)))","v":0},0,0,"F","Serviço","Serviço","1.6.1.17.","AGETOP",70584,"CABO PVC (70ºC) 1 KV No. 10 MM2","M     ",339,1,null,null,null,null,null,""]
["S",3,"S",0,1,6,1,0,{"$f":"IF(AND($C107<=4,$C107<>0),0,IF(AND($C107=\"S\",$Y107>0),OFFSET(I107,-1,0)+1,OFFSET(I107,-1,0)))","v":0},0,0,"F","Serviço","Serviço","1.6.1.18.","AGETOP",70585,"CABO PVC (70ºC) 1 KV No. 16 MM2","M     ",15,1,null,null,null,null,null,""]
["S",3,"S",0,1,6,1,0,{"$f":"IF(AND($C108<=4,$C108<>0),0,IF(AND($C108=\"S\",$Y108>0),OFFSET(I108,-1,0)+1,OFFSET(I108,-1,0)))","v":0},0,0,"F","Serviço","Serviço","1.6.1.19.","AGETOP",70511,"CABO EPR/XLPE (90°C) 1 KV - 25 MM2","M     ",40,1,null,null,null,null,null,""]
["S",3,"S",0,1,6,1,0,{"$f":"IF(AND($C109<=4,$C109<>0),0,IF(AND($C109=\"S\",$Y109>0),OFFSET(I109,-1,0)+1,OFFSET(I109,-1,0)))","v":0},0,0,"F","Serviço","Serviço","1.6.1.20.","AGETOP",70513,"CABO EPR/XLPE (90°C) 1 KV - 50 MM2","M     ",160,1,null,null,null,null,null,""]
["S",3,"S",0,1,6,1,0,{"$f":"IF(AND($C110<=4,$C110<>0),0,IF(AND($C110=\"S\",$Y110>0),OFFSET(I110,-1,0)+1,OFFSET(I110,-1,0)))","v":0},0,0,"F","Serviço","Serviço","1.6.1.21.","AGETOP",71171,"DISJUNTOR MONOPOLAR DE 10 A 32-A","Un    ",6,1,null,null,null,null,null,""]
["S",3,"S",0,1,6,1,0,{"$f":"IF(AND($C111<=4,$C111<>0),0,IF(AND($C111=\"S\",$Y111>0),OFFSET(I111,-1,0)+1,OFFSET(I111,-1,0)))","v":0},0,0,"F","Serviço","Serviço","1.6.1.22.","AGETOP",71173,"DISJUNTOR TRIPOLAR DE 10 A 35-A","Un    ",3,1,null,null,null,null,null,""]
["S",3,"S",0,1,6,1,0,{"$f":"IF(AND($C112<=4,$C112<>0),0,IF(AND($C112=\"S\",$Y112>0),OFFSET(I112,-1,0)+1,OFFSET(I112,-1,0)))","v":0},0,0,"F","Serviço","Serviço","1.6.1.23.","AGETOP",71174,"DISJUNTOR TRIPOLAR 40 A 50A","Un    ",2,1,null,null,null,null,null,""]
["S",3,"S",0,1,6,1,0,{"$f":"IF(AND($C113<=4,$C113<>0),0,IF(AND($C113=\"S\",$Y113>0),OFFSET(I113,-1,0)+1,OFFSET(I113,-1,0)))","v":0},0,0,"F","Serviço","Serviço","1.6.1.24.","AGETOP",71175,"DISJUNTOR TRIPOLAR DE 60 A 100-A","Un    ",1,1,null,null,null,null,null,""]
[{"$f":"CHOOSE(1+LOG(1+2*(ORÇAMENTO.Nivel=\"Nível 1\")+4*(ORÇAMENTO.Nivel=\"Nível 2\")+8*(ORÇAMENTO.Nivel=\"Nível 3\")+16*(ORÇAMENTO.Nivel=\"Nível 4\")+32*(ORÇAMENTO.Nivel=\"Serviço\"),2),0,1,2,3,4,\"S\")","v":"S"},{"$f":"IF(OR(C114=\"s\",C114=0),OFFSET(B114,-1,0),C114)","v":3},{"$f":"IF(OFFSET(C114,-1,0)=\"L\",1,IF(OFFSET(C114,-1,0)=1,2,IF(OR(A114=\"s\",A114=0),\"S\",IF(AND(OFFSET(C114,-1,0)=2,A114=4),3,IF(AND(OR(OFFSET(C114,-1,0)=\"s\",OFFSET(C114,-1,0)=0),A114<>\"s\",A114>OFFSET(B114,-1,0)),OFFSET(B114,-1,0),A114)))))","v":"S"},{"$f":"IF(OR(C114=\"S\",C114=0),0,IF(ISERROR(K114),J114,SMALL(J114:K114,1)))","v":0},{"$f":"IF($C114=1,OFFSET(E114,-1,0)+1,OFFSET(E114,-1,0))","v":1},{"$f":"IF($C114=1,0,IF($C114=2,OFFSET(F114,-1,0)+1,OFFSET(F114,-1,0)))","v":6},{"$f":"IF(AND($C114<=2,$C114<>0),0,IF($C114=3,OFFSET(G114,-1,0)+1,OFFSET(G114,-1,0)))","v":1},{"$f":"IF(AND($C114<=3,$C114<>0),0,IF($C114=4,OFFSET(H114,-1,0)+1,OFFSET(H114,-1,0)))","v":0},{"$f":"IF(AND($C114<=4,$C114<>0),0,IF(AND($C114=\"S\",$Y114>0),OFFSET(I114,-1,0)+1,OFFSET(I114,-1,0)))","v":0},0,0,"F","Serviço","Serviço","1.6.1.25.","AGETOP",71176,"DISJUNTOR TRIPOLAR DE 125-A","Un    ",1,1,null,null,null,null,null,""]
["S",3,"S",0,1,6,1,0,{"$f":"IF(AND($C115<=4,$C115<>0),0,IF(AND($C115=\"S\",$Y115>0),OFFSET(I115,-1,0)+1,OFFSET(I115,-1,0)))","v":0},0,0,"F","Serviço","Serviço","1.6.1.26.","AGETOP",71560,"LAMPADA MISTA DE 160 W","Un    ",32,1,null,null,null,null,null,""]
["S",3,"S",0,1,6,1,0,{"$f":"IF(AND($C116<=4,$C116<>0),0,IF(AND($C116=\"S\",$Y116>0),OFFSET(I116,-1,0)+1,OFFSET(I116,-1,0)))","v":0},0,0,"F","Serviço","Serviço","1.6.1.27.","AGETOP",71561,"LAMPADA MISTA 250 W","Un    ",2,1,null,null,null,null,null,""]
["S",3,"S",0,1,6,1,0,{"$f":"IF(AND($C117<=4,$C117<>0),0,IF(AND($C117=\"S\",$Y117>0),OFFSET(I117,-1,0)+1,OFFSET(I117,-1,0)))","v":0},0,0,"F","Serviço","Serviço","1.6.1.28.","AGETOP",71625,"LUMINÁRIA PARA JARDIM COM POSTE 3,00 M COM 02 LUMINÁRIAS PLANAS - INCLUSO BASE DE CONCRETO PADRÃO AGETOP E FIXAÇÃO","un    ",16,1,null,null,null,null,null,""]
["S",3,"S",0,1,6,1,0,{"$f":"IF(AND($C118<=4,$C118<>0),0,IF(AND($C118=\"S\",$Y118>0),OFFSET(I118,-1,0)+1,OFFSET(I118,-1,0)))","v":0},0,0,"F","Serviço","Serviço","1.6.1.29.","AGETOP",70633,"CAIXA DE PASSAGEM - ESCAVAÇÃO MANUAL / REATERRO/ APILOAMENTO DO FUNDO ","m3    ",4.05,1,null,null,null,null,null,""]
["S",3,"S",0,1,6,1,0,{"$f":"IF(AND($C119<=4,$C119<>0),0,IF(AND($C119=\"S\",$Y119>0),OFFSET(I119,-1,0)+1,OFFSET(I119,-1,0)))","v":0},0,0,"F","Serviço","Serviço","1.6.1.30.","AGETOP",70634,"CAIXA DE PASSAGEM -  TAMPA EM CONCRETO ARMADO 25 MPA E=5CM","m2    ",6.75,1,null,null,null,null,null,""]
["S",3,"S",0,1,6,1,0,{"$f":"IF(AND($C120<=4,$C120<>0),0,IF(AND($C120=\"S\",$Y120>0),OFFSET(I120,-1,0)+1,OFFSET(I120,-1,0)))","v":0},0,0,"F","Serviço","Serviço","1.6.1.31.","AGETOP",70635,"CAIXA DE PASSAGEM -  ALVENARIA DE 1/2 VEZ COM REVESTIMENTO INTERNO EM REBOCO PAULISTA A-14 ","m2    ",6.75,1,null,null,null,null,null,""]
["S",3,"S",0,1,6,1,0,{"$f":"IF(AND($C121<=4,$C121<>0),0,IF(AND($C121=\"S\",$Y121>0),OFFSET(I121,-1,0)+1,OFFSET(I121,-1,0)))","v":0},0,0,"F","Serviço","Serviço","1.6.1.32.","AGETOP",70637,"CAIXA DE PASSAGEM - LASTRO DE BRITA PARA O FUNDO","m3    ",1.35,1,null,null,null,null,null,""]
["S",3,"S",0,1,6,1,0,{"$f":"IF(AND($C122<=4,$C122<>0),0,IF(AND($C122=\"S\",$Y122>0),OFFSET(I122,-1,0)+1,OFFSET(I122,-1,0)))","v":0},0,0,"F","Serviço","Serviço","1.6.1.33.","AGETOP",71742,"LUVA PVC ROSQUEAVEL DIAMETRO 1\"","Un    ",95,1,null,null,null,null,null,""]
["S",3,"S",0,1,6,1,0,{"$f":"IF(AND($C123<=4,$C123<>0),0,IF(AND($C123=\"S\",$Y123>0),OFFSET(I123,-1,0)+1,OFFSET(I123,-1,0)))","v":0},0,0,"F","Serviço","Serviço","1.6.1.34.","AGETOP",71744,"LUVA PVC ROSQUEAVEL DIAMETRO 1.1/2\"","Un    ",22,1,null,null,null,null,null,""]
["S",3,"S",0,1,6,1,0,{"$f":"IF(AND($C124<=4,$C124<>0),0,IF(AND($C124=\"S\",$Y124>0),OFFSET(I124,-1,0)+1,OFFSET(I124,-1,0)))","v":0},0,0,"F","Serviço","Serviço","1.6.1.35.","AGETOP",71746,"LUVA PVC ROSQUEAVEL DIAMETRO 2.1/2\"","Un    ",13,1,null,null,null,null,null,""]
["S",3,"S",0,1,6,1,0,{"$f":"IF(AND($C125<=4,$C125<>0),0,IF(AND($C125=\"S\",$Y125>0),OFFSET(I125,-1,0)+1,OFFSET(I125,-1,0)))","v":0},0,0,"F","Serviço","Serviço","1.6.1.36.","AGETOP",71747,"LUVA PVC ROSQUEAVEL DIAMETRO 3\"","Un    ",10,1,null,null,null,null,null,""]
["S",3,"S",0,1,6,1,0,{"$f":"IF(AND($C126<=4,$C126<>0),0,IF(AND($C126=\"S\",$Y126>0),OFFSET(I126,-1,0)+1,OFFSET(I126,-1,0)))","v":0},0,0,"F","Serviço","Serviço","1.6.1.37.","AGETOP",71380,"HASTE REV.COBRE(COPPERWELD)  3/4\" X 2,40 M C/CONECTOR","Un    ",4,1,null,null,null,null,null,""]
["S",3,"S",0,1,6,1,0,{"$f":"IF(AND($C127<=4,$C127<>0),0,IF(AND($C127=\"S\",$Y127>0),OFFSET(I127,-1,0)+1,OFFSET(I127,-1,0)))","v":0},0,0,"F","Serviço","Serviço","1.6.1.38.","AGETOP",70255,"ATERRAMENTO - SOLDA EXOTÉRMICA - CARTUCHO 90 G","un    ",2,1,null,null,null,null,null,""]
["S",3,"S",0,1,6,1,0,{"$f":"IF(AND($C128<=4,$C128<>0),0,IF(AND($C128=\"S\",$Y128>0),OFFSET(I128,-1,0)+1,OFFSET(I128,-1,0)))","v":0},0,0,"F","Serviço","Serviço","1.6.1.39.","AGETOP",70391,"BUCHA DE NYLON S-6","Un    ",220,1,null,null,null,null,null,""]
["S",3,"S",0,1,6,1,0,{"$f":"IF(AND($C129<=4,$C129<>0),0,IF(AND($C129=\"S\",$Y129>0),OFFSET(I129,-1,0)+1,OFFSET(I129,-1,0)))","v":0},0,0,"F","Serviço","Serviço","1.6.1.40.","AGETOP",71861,"PARAFUSO P/BUCHA S-6","Un    ",220,1,null,null,null,null,null,""]
["S",3,"S",0,1,6,1,0,{"$f":"IF(AND($C130<=4,$C130<>0),0,IF(AND($C130=\"S\",$Y130>0),OFFSET(I130,-1,0)+1,OFFSET(I130,-1,0)))","v":0},0,0,"F","Serviço","Serviço","1.6.1.41.","AGETOP",71991,"POSTE SIMPLES CÔNICO CONTÍNUO, CIRCULAR, RETO, COM DIÂMETRO NOMINAL DE 60MM NA EXTREMIDADE, GALVANIZADO A FOGO, Hútil= 7 M - ENGASTADO EM CONCRETO COM FCK = 13,5 MPA","Un    ",2,1,null,null,null,null,null,""]
["S",3,"S",0,1,6,1,0,{"$f":"IF(AND($C131<=4,$C131<>0),0,IF(AND($C131=\"S\",$Y131>0),OFFSET(I131,-1,0)+1,OFFSET(I131,-1,0)))","v":0},0,0,"F","Serviço","Serviço","1.6.1.42.","AGETOP",20162,"DEMOLIÇÃO DAS INSTALAÇÕES ELÉTRICAS E AFINS C/ TRANSP. ATÉ CB. E CARGA","H     ",4,1,null,null,null,null,null,""]
["S",3,"S",0,1,6,1,0,{"$f":"IF(AND($C132<=4,$C132<>0),0,IF(AND($C132=\"S\",$Y132>0),OFFSET(I132,-1,0)+1,OFFSET(I132,-1,0)))","v":0},0,0,"F","Serviço","Serviço","1.6.1.43.","AGETOP",71321,"FITA DE AUTO FUSAO, ROLO E 10,00 MM","Un    ",10,1,null,null,null,null,null,""]
["S",3,"S",0,1,6,1,0,{"$f":"IF(AND($C133<=4,$C133<>0),0,IF(AND($C133=\"S\",$Y133>0),OFFSET(I133,-1,0)+1,OFFSET(I133,-1,0)))","v":0},0,0,"F","Serviço","Serviço","1.6.1.44.","AGETOP",220102,"PISO CONCRETO DESEMPENADO ESPESSURA = 5 CM  1:2,5:3,5","m2    ",64.61,1,null,null,null,null,null,""]
[3,3,3,4,1,6,2,0,{"$f":"IF(AND($C134<=4,$C134<>0),0,IF(AND($C134=\"S\",$Y134>0),OFFSET(I134,-1,0)+1,OFFSET(I134,-1,0)))","v":0},80,4,"F","Nível 3","Nível 3","1.6.2.","AGETOP",null,"CABEAMENTO","-",null,1,null,null,null,null,null,""]
["S",3,"S",0,1,6,2,0,{"$f":"IF(AND($C135<=4,$C135<>0),0,IF(AND($C135=\"S\",$Y135>0),OFFSET(I135,-1,0)+1,OFFSET(I135,-1,0)))","v":0},0,0,"F","Serviço","Serviço","1.6.2.1.","AGETOP",70607,"CABO TELEFONICO CCE-50 2 PARES","M     ",35,1,null,null,null,null,null,""]
["S",3,"S",0,1,6,2,0,{"$f":"IF(AND($C136<=4,$C136<>0),0,IF(AND($C136=\"S\",$Y136>0),OFFSET(I136,-1,0)+1,OFFSET(I136,-1,0)))","v":0},0,0,"F","Serviço","Serviço","1.6.2.2.","AGETOP",70626,"CABO UTP-4P, CAT. 6 , 24 AWG","M     ",35,1,null,null,null,null,null,""]
["S",3,"S",0,1,6,2,0,{"$f":"IF(AND($C137<=4,$C137<>0),0,IF(AND($C137=\"S\",$Y137>0),OFFSET(I137,-1,0)+1,OFFSET(I137,-1,0)))","v":0},0,0,"F","Serviço","Serviço","1.6.2.3.","AGETOP",70711,"CAIXA DE PASSAGEM 35X60X50CM FUNDO DE CONCRETO (PARA TAMPA R1)","Un    ",2,1,null,null,null,null,null,""]
[3,3,3,10,1,6,3,0,{"$f":"IF(AND($C138<=4,$C138<>0),0,IF(AND($C138=\"S\",$Y138>0),OFFSET(I138,-1,0)+1,OFFSET(I138,-1,0)))","v":0},76,10,"F","Nível 3","Nível 3","1.6.3.","AGETOP",null,"SPDA","-",null,1,null,null,null,null,null,""]
["S",3,"S",0,1,6,3,0,{"$f":"IF(AND($C139<=4,$C139<>0),0,IF(AND($C139=\"S\",$Y139>0),OFFSET(I139,-1,0)+1,OFFSET(I139,-1,0)))","v":0},0,0,"F","Serviço","Serviço","1.6.3.1.","AGETOP",71380,"HASTE REV.COBRE(COPPERWELD)  3/4\" X 2,40 M C/CONECTOR","Un    ",43,1,null,null,null,null,null,""]
["S",3,"S",0,1,6,3,0,{"$f":"IF(AND($C140<=4,$C140<>0),0,IF(AND($C140=\"S\",$Y140>0),OFFSET(I140,-1,0)+1,OFFSET(I140,-1,0)))","v":0},0,0,"F","Serviço","Serviço","1.6.3.2.","AGETOP",70543,"CABO DE COBRE NÚ No. 35 MM2","M     ",663,1,null,null,null,null,null,""]
["S",3,"S",0,1,6,3,0,{"$f":"IF(AND($C141<=4,$C141<>0),0,IF(AND($C141=\"S\",$Y141>0),OFFSET(I141,-1,0)+1,OFFSET(I141,-1,0)))","v":0},0,0,"F","Serviço","Serviço","1.6.3.3.","AGETOP",70544,"CABO DE COBRE NÚ No. 50 MM2","M     ",458,1,null,null,null,null,null,""]
["S",3,"S",0,1,6,3,0,{"$f":"IF(AND($C142<=4,$C142<>0),0,IF(AND($C142=\"S\",$Y142>0),OFFSET(I142,-1,0)+1,OFFSET(I142,-1,0)))","v":0},0,0,"F","Serviço","Serviço","1.6.3.4.","COMPOSIÇÃO","COMP 034_SEE","TERMINAL AÉREO SPDA 30CM Fo Go DIAM. 5/16\" COM SUPORTE","UN ",60,1,null,null,null,null,null,""]
["S",3,"S",0,1,6,3,0,{"$f":"IF(AND($C143<=4,$C143<>0),0,IF(AND($C143=\"S\",$Y143>0),OFFSET(I143,-1,0)+1,OFFSET(I143,-1,0)))","v":0},0,0,"F","Serviço","Serviço","1.6.3.5.","COMPOSIÇÃO","COMP 035_SEE","CLIPS 3/8 P/ CABO DE AÇO BELGO","UN ",60,1,null,null,null,null,null,""]
["S",3,"S",0,1,6,3,0,{"$f":"IF(AND($C144<=4,$C144<>0),0,IF(AND($C144=\"S\",$Y144>0),OFFSET(I144,-1,0)+1,OFFSET(I144,-1,0)))","v":0},0,0,"F","Serviço","Serviço","1.6.3.6.","COMPOSIÇÃO","COMP 037_SEE","CAIXA DE INSPEÇÃO PVC 300X250MM+TP P/CX INSP GALV FOGO 300MM","UN ",43,1,null,null,null,null,null,""]
["S",3,"S",0,1,6,3,0,{"$f":"IF(AND($C145<=4,$C145<>0),0,IF(AND($C145=\"S\",$Y145>0),OFFSET(I145,-1,0)+1,OFFSET(I145,-1,0)))","v":0},0,0,"F","Serviço","Serviço","1.6.3.7.","COMPOSIÇÃO","COMP 042_SEE","MASTRO P/PARA RAIO 1.1/2 6MT+ABRAC C/3 ESTAI P/MASTRO 1.1/2+SINALEIRO TOPO C/FOTOCELULA+ABRAC PARA SINALEIRO","UN ",1,1,null,null,null,null,null,""]
["S",3,"S",0,1,6,3,0,{"$f":"IF(AND($C146<=4,$C146<>0),0,IF(AND($C146=\"S\",$Y146>0),OFFSET(I146,-1,0)+1,OFFSET(I146,-1,0)))","v":0},0,0,"F","Serviço","Serviço","1.6.3.8.","COMPOSIÇÃO","COMP 043_SEE","APOIO PARA MASTRO 2\"","UN ",3,1,null,null,null,null,null,""]
["S",3,"S",0,1,6,3,0,{"$f":"IF(AND($C147<=4,$C147<>0),0,IF(AND($C147=\"S\",$Y147>0),OFFSET(I147,-1,0)+1,OFFSET(I147,-1,0)))","v":0},{"$f":"IF(OR($C147=\"S\",$C147=0),0,MATCH(0,OFFSET($D147,1,$C147,ROW($C$1328)-ROW($C147)),0))","v":0},{"$f":"IF(OR($C147=\"S\",$C147=0),0,MATCH(OFFSET($D147,0,$C147)+1,OFFSET($D147,1,$C147,ROW($C$1328)-ROW($C147)),0))","v":0},"F","Serviço","Serviço","1.6.3.9.","AGETOP",71831,"PARA RAIOS FRANKLIM 4 PONTAS","Un    ",1,1,null,null,null,null,null,""]
[3,3,3,66,1,6,4,0,{"$f":"IF(AND($C148<=4,$C148<>0),0,IF(AND($C148=\"S\",$Y148>0),OFFSET(I148,-1,0)+1,OFFSET(I148,-1,0)))","v":0},66,122,"F","Nível 3","Nível 3","1.6.4.","SINAPI",null,"SUBESTAÇÃO","-",null,1,null,null,null,null,null,""]
["S",3,"S",0,1,6,4,0,{"$f":"IF(AND($C149<=4,$C149<>0),0,IF(AND($C149=\"S\",$Y149>0),OFFSET(I149,-1,0)+1,OFFSET(I149,-1,0)))","v":0},0,0,"F","Serviço","Serviço","1.6.4.1.","AGETOP",72061,"POSTE DE CONCRETO SC 11/600 - SEM FUNDAÇÃO/CONCRETO","Un    ",1,1,null,null,null,null,null,""]
["S",3,"S",0,1,6,4,0,{"$f":"IF(AND($C150<=4,$C150<>0),0,IF(AND($C150=\"S\",$Y150>0),OFFSET(I150,-1,0)+1,OFFSET(I150,-1,0)))","v":0},0,0,"F","Serviço","Serviço","1.6.4.2.","AGETOP",72600,"TRANSFORMADOR TRIFASICO 75 KVA 13,8KV - A ÓLEO ","Un    ",1,1,null,null,null,null,null,""]
["S",3,"S",0,1,6,4,0,{"$f":"IF(AND($C151<=4,$C151<>0),0,IF(AND($C151=\"S\",$Y151>0),OFFSET(I151,-1,0)+1,OFFSET(I151,-1,0)))","v":0},0,0,"F","Serviço","Serviço","1.6.4.3.","AGETOP",72370,"SUPORTE P/TRANSFORM.EM POSTE CONCR.CIRCULAR","Un    ",3,1,null,null,null,null,null,""]
["S",3,"S",0,1,6,4,0,{"$f":"IF(AND($C152<=4,$C152<>0),0,IF(AND($C152=\"S\",$Y152>0),OFFSET(I152,-1,0)+1,OFFSET(I152,-1,0)))","v":0},0,0,"F","Serviço","Serviço","1.6.4.4.","AGETOP",70920,"CINTA DE ACO GALVANIZADO DIAM.190 MM","Un    ",1,1,null,null,null,null,null,""]
["S",3,"S",0,1,6,4,0,{"$f":"IF(AND($C153<=4,$C153<>0),0,IF(AND($C153=\"S\",$Y153>0),OFFSET(I153,-1,0)+1,OFFSET(I153,-1,0)))","v":0},0,0,"F","Serviço","Serviço","1.6.4.5.","AGETOP",70921,"CINTA DE ACO GALVANIZADO DIAM.220 MM","Un    ",4,1,null,null,null,null,null,""]
["S",3,"S",0,1,6,4,0,{"$f":"IF(AND($C154<=4,$C154<>0),0,IF(AND($C154=\"S\",$Y154>0),OFFSET(I154,-1,0)+1,OFFSET(I154,-1,0)))","v":0},0,0,"F","Serviço","Serviço","1.6.4.6.","AGETOP",70922,"CINTA DE ACO GALVANIZADO DIAM.230MM","Un    ",1,1,null,null,null,null,null,""]
["S",3,"S",0,1,6,4,0,{"$f":"IF(AND($C155<=4,$C155<>0),0,IF(AND($C155=\"S\",$Y155>0),OFFSET(I155,-1,0)+1,OFFSET(I155,-1,0)))","v":0},0,0,"F","Serviço","Serviço","1.6.4.7.","AGETOP",70386,"BRAÇO C AÇO GALVANIZADO , CONFORME NTD-17","un    ",1,1,null,null,null,null,null,""]
["S",3,"S",0,1,6,4,0,{"$f":"IF(AND($C156<=4,$C156<>0),0,IF(AND($C156=\"S\",$Y156>0),OFFSET(I156,-1,0)+1,OFFSET(I156,-1,0)))","v":0},0,0,"F","Serviço","Serviço","1.6.4.8.","AGETOP",71795,"OLHAL PARA PARAFUSO","un    ",3,1,null,null,null,null,null,""]
["S",3,"S",0,1,6,4,0,{"$f":"IF(AND($C157<=4,$C157<>0),0,IF(AND($C157=\"S\",$Y157>0),OFFSET(I157,-1,0)+1,OFFSET(I157,-1,0)))","v":0},0,0,"F","Serviço","Serviço","1.6.4.9.","AGETOP",70771,"CANTONEIRA AUXILIAR PARA BRAÇO TIPO C","un    ",1,1,null,null,null,null,null,""]
["S",3,"S",0,1,6,4,0,{"$f":"IF(AND($C158<=4,$C158<>0),0,IF(AND($C158=\"S\",$Y158>0),OFFSET(I158,-1,0)+1,OFFSET(I158,-1,0)))","v":0},0,0,"F","Serviço","Serviço","1.6.4.10.","AGETOP",72329,"SAPATILHA DE AÇO GALVANIZADO PARA POSTE COM TRANSFORMADOR","un    ",1,1,null,null,null,null,null,""]
["S",3,"S",0,1,6,4,0,{"$f":"IF(AND($C159<=4,$C159<>0),0,IF(AND($C159=\"S\",$Y159>0),OFFSET(I159,-1,0)+1,OFFSET(I159,-1,0)))","v":0},0,0,"F","Serviço","Serviço","1.6.4.11.","AGETOP",71835,"PARAFUSO CABEÇA ABAULADA (FRANCES) M16 X 45 MM","Un    ",3,1,null,null,null,null,null,""]
["S",3,"S",0,1,6,4,0,{"$f":"IF(AND($C160<=4,$C160<>0),0,IF(AND($C160=\"S\",$Y160>0),OFFSET(I160,-1,0)+1,OFFSET(I160,-1,0)))","v":0},0,0,"F","Serviço","Serviço","1.6.4.12.","AGETOP",71841,"PARAFUSO CABEÇA ABAULADA (FRANCES) M16 X 150 MM","Un    ",3,1,null,null,null,null,null,""]
["S",3,"S",0,1,6,4,0,{"$f":"IF(AND($C161<=4,$C161<>0),0,IF(AND($C161=\"S\",$Y161>0),OFFSET(I161,-1,0)+1,OFFSET(I161,-1,0)))","v":0},0,0,"F","Serviço","Serviço","1.6.4.13.","AGETOP",71750,"MANILHA-SAPATILHA EM AÇO GALVANIZADO","un    ",3,1,null,null,null,null,null,""]
["S",3,"S",0,1,6,4,0,{"$f":"IF(AND($C162<=4,$C162<>0),0,IF(AND($C162=\"S\",$Y162>0),OFFSET(I162,-1,0)+1,OFFSET(I162,-1,0)))","v":0},0,0,"F","Serviço","Serviço","1.6.4.14.","AGETOP",70218,"ARAME DE AÇO GALVANIZADO No. 12 BWG","M     ",3,1,null,null,null,null,null,""]
["S",3,"S",0,1,6,4,0,{"$f":"IF(AND($C163<=4,$C163<>0),0,IF(AND($C163=\"S\",$Y163>0),OFFSET(I163,-1,0)+1,OFFSET(I163,-1,0)))","v":0},0,0,"F","Serviço","Serviço","1.6.4.15.","AGETOP",71476,"ISOLADOR DE ANCORAGEM POLIMÉRICO 15KV","un    ",3,1,null,null,null,null,null,""]
["S",3,"S",0,1,6,4,0,{"$f":"IF(AND($C164<=4,$C164<>0),0,IF(AND($C164=\"S\",$Y164>0),OFFSET(I164,-1,0)+1,OFFSET(I164,-1,0)))","v":0},0,0,"F","Serviço","Serviço","1.6.4.16.","AGETOP",71365,"GRAMPO DE ANCORAGEM POLIMÉRICO","un    ",3,1,null,null,null,null,null,""]
["S",3,"S",0,1,6,4,0,{"$f":"IF(AND($C165<=4,$C165<>0),0,IF(AND($C165=\"S\",$Y165>0),OFFSET(I165,-1,0)+1,OFFSET(I165,-1,0)))","v":0},0,0,"F","Serviço","Serviço","1.6.4.17.","AGETOP",71020,"CONECTOR PARAL. ALUM.EXTRUD.CA-CU-10,0D.10-2-1 PARAF.","Un    ",3,1,null,null,null,null,null,""]
["S",3,"S",0,1,6,4,0,{"$f":"IF(AND($C166<=4,$C166<>0),0,IF(AND($C166=\"S\",$Y166>0),OFFSET(I166,-1,0)+1,OFFSET(I166,-1,0)))","v":0},0,0,"F","Serviço","Serviço","1.6.4.18.","AGETOP",71016,"CONECTOR DE COMPRESSÃO FORMATO H PARA CABO 25 A 70 MM2","un    ",1,1,null,null,null,null,null,""]
["S",3,"S",0,1,6,4,0,{"$f":"IF(AND($C167<=4,$C167<>0),0,IF(AND($C167=\"S\",$Y167>0),OFFSET(I167,-1,0)+1,OFFSET(I167,-1,0)))","v":0},0,0,"F","Serviço","Serviço","1.6.4.19.","AGETOP",70240,"ARMACAO SECUNDARIA PESADA 1 ELEMENTO","Un    ",1,1,null,null,null,null,null,""]
["S",3,"S",0,1,6,4,0,{"$f":"IF(AND($C168<=4,$C168<>0),0,IF(AND($C168=\"S\",$Y168>0),OFFSET(I168,-1,0)+1,OFFSET(I168,-1,0)))","v":0},0,0,"F","Serviço","Serviço","1.6.4.20.","AGETOP",71480,"ISOLADOR ROLDANA PORCELANA 72 X 72","Un    ",3,1,null,null,null,null,null,""]
["S",3,"S",0,1,6,4,0,{"$f":"IF(AND($C169<=4,$C169<>0),0,IF(AND($C169=\"S\",$Y169>0),OFFSET(I169,-1,0)+1,OFFSET(I169,-1,0)))","v":0},0,0,"F","Serviço","Serviço","1.6.4.21.","AGETOP",70204,"ALCA PREFORMADA DE DISTRIBUICAO","Un    ",3,1,null,null,null,null,null,""]
["S",3,"S",0,1,6,4,0,{"$f":"IF(AND($C170<=4,$C170<>0),0,IF(AND($C170=\"S\",$Y170>0),OFFSET(I170,-1,0)+1,OFFSET(I170,-1,0)))","v":0},0,0,"F","Serviço","Serviço","1.6.4.22.","AGETOP",71216,"ELETRODUTO EM AÇO GALVANIZADO A FOGO DIÂMETRO 2 1/2\" - PESADO ","M     ",12,1,null,null,null,null,null,""]
["S",3,"S",0,1,6,4,0,{"$f":"IF(AND($C171<=4,$C171<>0),0,IF(AND($C171=\"S\",$Y171>0),OFFSET(I171,-1,0)+1,OFFSET(I171,-1,0)))","v":0},0,0,"F","Serviço","Serviço","1.6.4.23.","AGETOP",71833,"PARA RAIOS DISTRIBUIDOR POLIMÉRICO ÓXIDO DE ZINCO S/CENTELHADOR C/ DESLIGAMENTO AUTOMÁTICO 15KV,10KA","Un    ",3,1,null,null,null,null,null,""]
["S",3,"S",0,1,6,4,0,{"$f":"IF(AND($C172<=4,$C172<>0),0,IF(AND($C172=\"S\",$Y172>0),OFFSET(I172,-1,0)+1,OFFSET(I172,-1,0)))","v":0},0,0,"F","Serviço","Serviço","1.6.4.24.","AGETOP",72145,"PROTETOR PARA PARA-RAIO POLIMÉRICO","un    ",6,1,null,null,null,null,null,""]
["S",3,"S",0,1,6,4,0,{"$f":"IF(AND($C173<=4,$C173<>0),0,IF(AND($C173=\"S\",$Y173>0),OFFSET(I173,-1,0)+1,OFFSET(I173,-1,0)))","v":0},0,0,"F","Serviço","Serviço","1.6.4.25.","AGETOP",70505,"CABECOTE DE LIGA DE ALUMINIO DIAM. 2.1/2\"","Un    ",1,1,null,null,null,null,null,""]
["S",3,"S",0,1,6,4,0,{"$f":"IF(AND($C174<=4,$C174<>0),0,IF(AND($C174=\"S\",$Y174>0),OFFSET(I174,-1,0)+1,OFFSET(I174,-1,0)))","v":0},0,0,"F","Serviço","Serviço","1.6.4.26.","AGETOP",72661,"VERGALHAO ROSCA TOTAL D=5/16\"","M     ",0.5,1,null,null,null,null,null,""]
["S",3,"S",0,1,6,4,0,{"$f":"IF(AND($C175<=4,$C175<>0),0,IF(AND($C175=\"S\",$Y175>0),OFFSET(I175,-1,0)+1,OFFSET(I175,-1,0)))","v":0},0,0,"F","Serviço","Serviço","1.6.4.27.","AGETOP",71982,"PORCA SEXTAVADA DIAMETRO 5/16\"","Un    ",8,1,null,null,null,null,null,""]
["S",3,"S",0,1,6,4,0,{"$f":"IF(AND($C176<=4,$C176<>0),0,IF(AND($C176=\"S\",$Y176>0),OFFSET(I176,-1,0)+1,OFFSET(I176,-1,0)))","v":0},0,0,"F","Serviço","Serviço","1.6.4.28.","AGETOP",70252,"ARRUELA LISA D=5/16\"","Un    ",8,1,null,null,null,null,null,""]
["S",3,"S",0,1,6,4,0,{"$f":"IF(AND($C177<=4,$C177<>0),0,IF(AND($C177=\"S\",$Y177>0),OFFSET(I177,-1,0)+1,OFFSET(I177,-1,0)))","v":0},0,0,"F","Serviço","Serviço","1.6.4.29.","AGETOP",70376,"BRACADEIRA METALICA TIPO \"D\" DIAM. 2.1/2\"","Un    ",2,1,null,null,null,null,null,""]
["S",3,"S",0,1,6,4,0,{"$f":"IF(AND($C178<=4,$C178<>0),0,IF(AND($C178=\"S\",$Y178>0),OFFSET(I178,-1,0)+1,OFFSET(I178,-1,0)))","v":0},0,0,"F","Serviço","Serviço","1.6.4.30.","AGETOP",71776,"NIPLE METALICO Fo.Zo. DIAMETRO 2.1/2\"","Un    ",3,1,null,null,null,null,null,""]
["S",3,"S",0,1,6,4,0,{"$f":"IF(AND($C179<=4,$C179<>0),0,IF(AND($C179=\"S\",$Y179>0),OFFSET(I179,-1,0)+1,OFFSET(I179,-1,0)))","v":0},0,0,"F","Serviço","Serviço","1.6.4.31.","AGETOP",70426,"BUCHA E ARRUELA METALICA DIAM. 2.1/2\"","PR    ",3,1,null,null,null,null,null,""]
["S",3,"S",0,1,6,4,0,{"$f":"IF(AND($C180<=4,$C180<>0),0,IF(AND($C180=\"S\",$Y180>0),OFFSET(I180,-1,0)+1,OFFSET(I180,-1,0)))","v":0},0,0,"F","Serviço","Serviço","1.6.4.32.","AGETOP",71791,"NIPLE DUPLO FERRO GALVANIZADO 2\"","Un    ",1,1,null,null,null,null,null,""]
["S",3,"S",0,1,6,4,0,{"$f":"IF(AND($C181<=4,$C181<>0),0,IF(AND($C181=\"S\",$Y181>0),OFFSET(I181,-1,0)+1,OFFSET(I181,-1,0)))","v":0},0,0,"F","Serviço","Serviço","1.6.4.33.","AGETOP",70425,"BUCHA E ARRUELA METALICA DIAM. 2\"","PR    ",2,1,null,null,null,null,null,""]
["S",3,"S",0,1,6,4,0,{"$f":"IF(AND($C182<=4,$C182<>0),0,IF(AND($C182=\"S\",$Y182>0),OFFSET(I182,-1,0)+1,OFFSET(I182,-1,0)))","v":0},0,0,"F","Serviço","Serviço","1.6.4.34.","AGETOP",70422,"BUCHA E ARRUELA METALICA DIAM. 1\"","PR    ",1,1,null,null,null,null,null,""]
["S",3,"S",0,1,6,4,0,{"$f":"IF(AND($C183<=4,$C183<>0),0,IF(AND($C183=\"S\",$Y183>0),OFFSET(I183,-1,0)+1,OFFSET(I183,-1,0)))","v":0},0,0,"F","Serviço","Serviço","1.6.4.35.","AGETOP",70720,"CAIXA METÁLICA PARA MEDIDOR POLIFÁSICO PADRÃO ENEL 500X380X166MM","Un    ",1,1,null,null,null,null,null,""]
["S",3,"S",0,1,6,4,0,{"$f":"IF(AND($C184<=4,$C184<>0),0,IF(AND($C184=\"S\",$Y184>0),OFFSET(I184,-1,0)+1,OFFSET(I184,-1,0)))","v":0},0,0,"F","Serviço","Serviço","1.6.4.36.","AGETOP",70725,"CAIXA METÁLICA PARA T.C. 580X500X216MM - ATÉ 175A","Un    ",1,1,null,null,null,null,null,""]
["S",3,"S",0,1,6,4,0,{"$f":"IF(AND($C185<=4,$C185<>0),0,IF(AND($C185=\"S\",$Y185>0),OFFSET(I185,-1,0)+1,OFFSET(I185,-1,0)))","v":0},0,0,"F","Serviço","Serviço","1.6.4.37.","AGETOP",70695,"CAIXA METÁLICA PARA PROTEÇÃO GERAL 580X500X216MM ATÉ 175A","Un    ",1,1,null,null,null,null,null,""]
["S",3,"S",0,1,6,4,0,{"$f":"IF(AND($C186<=4,$C186<>0),0,IF(AND($C186=\"S\",$Y186>0),OFFSET(I186,-1,0)+1,OFFSET(I186,-1,0)))","v":0},0,0,"F","Serviço","Serviço","1.6.4.38.","AGETOP",71206,"ELETRODUTO DE PVC RIGIDO DIAMETRO 2.1/2\"","M     ",3,1,null,null,null,null,null,""]
["S",3,"S",0,1,6,4,0,{"$f":"IF(AND($C187<=4,$C187<>0),0,IF(AND($C187=\"S\",$Y187>0),OFFSET(I187,-1,0)+1,OFFSET(I187,-1,0)))","v":0},0,0,"F","Serviço","Serviço","1.6.4.39.","AGETOP",71146,"CURVA DE 90 GRAUS DE PVC RIGIDO DIAM. 2.1/2\"","Un    ",1,1,null,null,null,null,null,""]
["S",3,"S",0,1,6,4,0,{"$f":"IF(AND($C188<=4,$C188<>0),0,IF(AND($C188=\"S\",$Y188>0),OFFSET(I188,-1,0)+1,OFFSET(I188,-1,0)))","v":0},0,0,"F","Serviço","Serviço","1.6.4.40.","AGETOP",71746,"LUVA PVC ROSQUEAVEL DIAMETRO 2.1/2\"","Un    ",2,1,null,null,null,null,null,""]
["S",3,"S",0,1,6,4,0,{"$f":"IF(AND($C189<=4,$C189<>0),0,IF(AND($C189=\"S\",$Y189>0),OFFSET(I189,-1,0)+1,OFFSET(I189,-1,0)))","v":0},0,0,"F","Serviço","Serviço","1.6.4.41.","AGETOP",71202,"ELETRODUTO DE PVC RIGIDO DIAMETRO 1\"","M     ",3,1,null,null,null,null,null,""]
["S",3,"S",0,1,6,4,0,{"$f":"IF(AND($C190<=4,$C190<>0),0,IF(AND($C190=\"S\",$Y190>0),OFFSET(I190,-1,0)+1,OFFSET(I190,-1,0)))","v":0},0,0,"F","Serviço","Serviço","1.6.4.42.","AGETOP",71142,"CURVA DE 90 GRAUS DE PVC RIGIDO DIAM. 1\"","Un    ",1,1,null,null,null,null,null,""]
["S",3,"S",0,1,6,4,0,{"$f":"IF(AND($C191<=4,$C191<>0),0,IF(AND($C191=\"S\",$Y191>0),OFFSET(I191,-1,0)+1,OFFSET(I191,-1,0)))","v":0},0,0,"F","Serviço","Serviço","1.6.4.43.","AGETOP",71742,"LUVA PVC ROSQUEAVEL DIAMETRO 1\"","Un    ",2,1,null,null,null,null,null,""]
["S",3,"S",0,1,6,4,0,{"$f":"IF(AND($C192<=4,$C192<>0),0,IF(AND($C192=\"S\",$Y192>0),OFFSET(I192,-1,0)+1,OFFSET(I192,-1,0)))","v":0},0,0,"F","Serviço","Serviço","1.6.4.44.","AGETOP",70268,"BARRA DE COBRE 2\" X 3/16\"  (2,0865 KG/M)","m     ",1.5,1,null,null,null,null,null,""]
["S",3,"S",0,1,6,4,0,{"$f":"IF(AND($C193<=4,$C193<>0),0,IF(AND($C193=\"S\",$Y193>0),OFFSET(I193,-1,0)+1,OFFSET(I193,-1,0)))","v":0},0,0,"F","Serviço","Serviço","1.6.4.45.","AGETOP",71463,"ISOLADOR EPOXI 50X40 (BUJAO)","Un    ",2,1,null,null,null,null,null,""]
["S",3,"S",0,1,6,4,0,{"$f":"IF(AND($C194<=4,$C194<>0),0,IF(AND($C194=\"S\",$Y194>0),OFFSET(I194,-1,0)+1,OFFSET(I194,-1,0)))","v":0},0,0,"F","Serviço","Serviço","1.6.4.46.","AGETOP",72532,"TERMINAL DE PRESSAO 50 MM2","Un    ",9,1,null,null,null,null,null,""]
["S",3,"S",0,1,6,4,0,{"$f":"IF(AND($C195<=4,$C195<>0),0,IF(AND($C195=\"S\",$Y195>0),OFFSET(I195,-1,0)+1,OFFSET(I195,-1,0)))","v":0},0,0,"F","Serviço","Serviço","1.6.4.47.","AGETOP",72523,"TERMINAL DE PRESSAO 25 MM2","Un    ",2,1,null,null,null,null,null,""]
["S",3,"S",0,1,6,4,0,{"$f":"IF(AND($C196<=4,$C196<>0),0,IF(AND($C196=\"S\",$Y196>0),OFFSET(I196,-1,0)+1,OFFSET(I196,-1,0)))","v":0},0,0,"F","Serviço","Serviço","1.6.4.48.","AGETOP",72518,"TERMINAL DE PRESSAO 10 MM2","Un    ",3,1,null,null,null,null,null,""]
["S",3,"S",0,1,6,4,0,{"$f":"IF(AND($C197<=4,$C197<>0),0,IF(AND($C197=\"S\",$Y197>0),OFFSET(I197,-1,0)+1,OFFSET(I197,-1,0)))","v":0},0,0,"F","Serviço","Serviço","1.6.4.49.","AGETOP",72630,"TRILHO OU SUPORTE P/BORNE TERMINAL","M     ",0.2,1,null,null,null,null,null,""]
["S",3,"S",0,1,6,4,0,{"$f":"IF(AND($C198<=4,$C198<>0),0,IF(AND($C198=\"S\",$Y198>0),OFFSET(I198,-1,0)+1,OFFSET(I198,-1,0)))","v":0},0,0,"F","Serviço","Serviço","1.6.4.50.","AGETOP",71184,"DISPOSITIVO DE PROTEÇÃO CONTRA SURTOS (D.P.S.) 275V DE 8 A 40KA","Un    ",3,1,null,null,null,null,null,""]
["S",3,"S",0,1,6,4,0,{"$f":"IF(AND($C199<=4,$C199<>0),0,IF(AND($C199=\"S\",$Y199>0),OFFSET(I199,-1,0)+1,OFFSET(I199,-1,0)))","v":0},0,0,"F","Serviço","Serviço","1.6.4.51.","AGETOP",71176,"DISJUNTOR TRIPOLAR DE 125-A","Un    ",1,1,null,null,null,null,null,""]
["S",3,"S",0,1,6,4,0,{"$f":"IF(AND($C200<=4,$C200<>0),0,IF(AND($C200=\"S\",$Y200>0),OFFSET(I200,-1,0)+1,OFFSET(I200,-1,0)))","v":0},0,0,"F","Serviço","Serviço","1.6.4.52.","AGETOP",70513,"CABO EPR/XLPE (90°C) 1 KV - 50 MM2","M     ",48,1,null,null,null,null,null,""]
["S",3,"S",0,1,6,4,0,{"$f":"IF(AND($C201<=4,$C201<>0),0,IF(AND($C201=\"S\",$Y201>0),OFFSET(I201,-1,0)+1,OFFSET(I201,-1,0)))","v":0},0,0,"F","Serviço","Serviço","1.6.4.53.","AGETOP",70584,"CABO PVC (70ºC) 1 KV No. 10 MM2","M     ",10,1,null,null,null,null,null,""]
["S",3,"S",0,1,6,4,0,{"$f":"IF(AND($C202<=4,$C202<>0),0,IF(AND($C202=\"S\",$Y202>0),OFFSET(I202,-1,0)+1,OFFSET(I202,-1,0)))","v":0},0,0,"F","Serviço","Serviço","1.6.4.54.","AGETOP",70544,"CABO DE COBRE NÚ No. 50 MM2","M     ",12,1,null,null,null,null,null,""]
["S",3,"S",0,1,6,4,0,{"$f":"IF(AND($C203<=4,$C203<>0),0,IF(AND($C203=\"S\",$Y203>0),OFFSET(I203,-1,0)+1,OFFSET(I203,-1,0)))","v":0},0,0,"F","Serviço","Serviço","1.6.4.55.","AGETOP",70541,"CABO DE COBRE NU No. 16 MM2 (6,94 M/KG)","M     ",12,1,null,null,null,null,null,""]
["S",3,"S",0,1,6,4,0,{"$f":"IF(AND($C204<=4,$C204<>0),0,IF(AND($C204=\"S\",$Y204>0),OFFSET(I204,-1,0)+1,OFFSET(I204,-1,0)))","v":0},0,0,"F","Serviço","Serviço","1.6.4.56.","AGETOP",71380,"HASTE REV.COBRE(COPPERWELD)  3/4\" X 2,40 M C/CONECTOR","Un    ",6,1,null,null,null,null,null,""]
["S",3,"S",0,1,6,4,0,{"$f":"IF(AND($C205<=4,$C205<>0),0,IF(AND($C205=\"S\",$Y205>0),OFFSET(I205,-1,0)+1,OFFSET(I205,-1,0)))","v":0},0,0,"F","Serviço","Serviço","1.6.4.57.","AGETOP",71330,"FITA ISOLANTE, ROLO DE 10,00 M","Un    ",5,1,null,null,null,null,null,""]
["S",3,"S",0,1,6,4,0,{"$f":"IF(AND($C206<=4,$C206<>0),0,IF(AND($C206=\"S\",$Y206>0),OFFSET(I206,-1,0)+1,OFFSET(I206,-1,0)))","v":0},0,0,"F","Serviço","Serviço","1.6.4.58.","AGETOP",71320,"FITA DE AUTO FUSAO, ROLO DE 2,00 M","Un    ",2,1,null,null,null,null,null,""]
[{"$f":"CHOOSE(1+LOG(1+2*(ORÇAMENTO.Nivel=\"Nível 1\")+4*(ORÇAMENTO.Nivel=\"Nível 2\")+8*(ORÇAMENTO.Nivel=\"Nível 3\")+16*(ORÇAMENTO.Nivel=\"Nível 4\")+32*(ORÇAMENTO.Nivel=\"Serviço\"),2),0,1,2,3,4,\"S\")","v":"S"},{"$f":"IF(OR(C207=\"s\",C207=0),OFFSET(B207,-1,0),C207)","v":3},{"$f":"IF(OFFSET(C207,-1,0)=\"L\",1,IF(OFFSET(C207,-1,0)=1,2,IF(OR(A207=\"s\",A207=0),\"S\",IF(AND(OFFSET(C207,-1,0)=2,A207=4),3,IF(AND(OR(OFFSET(C207,-1,0)=\"s\",OFFSET(C207,-1,0)=0),A207<>\"s\",A207>OFFSET(B207,-1,0)),OFFSET(B207,-1,0),A207)))))","v":"S"},{"$f":"IF(OR(C207=\"S\",C207=0),0,IF(ISERROR(K207),J207,SMALL(J207:K207,1)))","v":0},{"$f":"IF($C207=1,OFFSET(E207,-1,0)+1,OFFSET(E207,-1,0))","v":1},{"$f":"IF($C207=1,0,IF($C207=2,OFFSET(F207,-1,0)+1,OFFSET(F207,-1,0)))","v":6},{"$f":"IF(AND($C207<=2,$C207<>0),0,IF($C207=3,OFFSET(G207,-1,0)+1,OFFSET(G207,-1,0)))","v":4},{"$f":"IF(AND($C207<=3,$C207<>0),0,IF($C207=4,OFFSET(H207,-1,0)+1,OFFSET(H207,-1,0)))","v":0},{"$f":"IF(AND($C207<=4,$C207<>0),0,IF(AND($C207=\"S\",$Y207>0),OFFSET(I207,-1,0)+1,OFFSET(I207,-1,0)))","v":0},0,0,"F","Serviço","Serviço","1.6.4.59.","AGETOP",70716,"CAIXA DE PASSAGEM 80X80X110 CM FUNDO DE BRITA SEM TAMPA","Un    ",1,1,null,null,null,null,null,""]
["S",3,"S",0,1,6,4,0,{"$f":"IF(AND($C208<=4,$C208<>0),0,IF(AND($C208=\"S\",$Y208>0),OFFSET(I208,-1,0)+1,OFFSET(I208,-1,0)))","v":0},0,0,"F","Serviço","Serviço","1.6.4.60.","AGETOP",71036,"CONECTOR TIPO PARAFUSO FENDIDO 50 MM2","Un    ",2,1,null,null,null,null,null,""]
["S",3,"S",0,1,6,4,0,{"$f":"IF(AND($C209<=4,$C209<>0),0,IF(AND($C209=\"S\",$Y209>0),OFFSET(I209,-1,0)+1,OFFSET(I209,-1,0)))","v":0},0,0,"F","Serviço","Serviço","1.6.4.61.","AGETOP",71034,"CONECTOR TIPO PARAFUSO FENDIDO 25 MM2","Un    ",1,1,null,null,null,null,null,""]
["S",3,"S",0,1,6,4,0,{"$f":"IF(AND($C210<=4,$C210<>0),0,IF(AND($C210=\"S\",$Y210>0),OFFSET(I210,-1,0)+1,OFFSET(I210,-1,0)))","v":0},0,0,"F","Serviço","Serviço","1.6.4.62.","AGETOP",71997,"POSTE - FUNDAÇÃO EM CONCRETO SIMPLES DA BASE DOS POSTES 11/600 PARA TRAFO ( DIAM. 1000MM)","m     ",1,1,null,null,null,null,null,""]
["S",3,"S",0,1,6,4,0,{"$f":"IF(AND($C211<=4,$C211<>0),0,IF(AND($C211=\"S\",$Y211>0),OFFSET(I211,-1,0)+1,OFFSET(I211,-1,0)))","v":0},{"$f":"IF(OR($C211=\"S\",$C211=0),0,MATCH(0,OFFSET($D211,1,$C211,ROW($C$1328)-ROW($C211)),0))","v":0},{"$f":"IF(OR($C211=\"S\",$C211=0),0,MATCH(OFFSET($D211,0,$C211)+1,OFFSET($D211,1,$C211,ROW($C$1328)-ROW($C211)),0))","v":0},"F","Serviço","Serviço","1.6.4.63.","AGETOP",72080,"POSTE/TRAFO - CAMINHÃO MUNCK 12 TON. (MÍNIMO 4H/DIA)","H     ",4,1,null,null,null,null,null,""]
["S",3,"S",0,1,6,4,0,{"$f":"IF(AND($C212<=4,$C212<>0),0,IF(AND($C212=\"S\",$Y212>0),OFFSET(I212,-1,0)+1,OFFSET(I212,-1,0)))","v":0},0,0,"F","Serviço","Serviço","1.6.4.64.","AGETOP",70791,"CHAVE FUSIVEL,15 KV,100A, (CHAVE MATHEUS)","Un    ",3,1,null,null,null,null,null,""]
["S",3,"S",0,1,6,4,0,{"$f":"IF(AND($C213<=4,$C213<>0),0,IF(AND($C213=\"S\",$Y213>0),OFFSET(I213,-1,0)+1,OFFSET(I213,-1,0)))","v":0},0,0,"F","Serviço","Serviço","1.6.4.65.","AGETOP",71267,"ELO FUSÍVEL 5 H","Un    ",3,1,null,null,null,null,null,""]
[2,2,2,64,1,7,0,0,{"$f":"IF(AND($C214<=4,$C214<>0),0,IF(AND($C214=\"S\",$Y214>0),OFFSET(I214,-1,0)+1,OFFSET(I214,-1,0)))","v":0},154,64,"F","Nível 2","Nível 2","1.7.","SINAPI",null,"INSTALAÇÕES HIDROSSANITÁRIAS","-",null,1,null,null,null,null,null,""]
[3,3,3,15,1,7,1,0,{"$f":"IF(AND($C215<=4,$C215<>0),0,IF(AND($C215=\"S\",$Y215>0),OFFSET(I215,-1,0)+1,OFFSET(I215,-1,0)))","v":0},63,15,"F","Nível 3","Nível 3","1.7.1.","SINAPI",null,"PEÇAS E ACESSÓRIOS","-",null,1,null,null,null,null,null,""]
["S",3,"S",0,1,7,1,0,{"$f":"IF(AND($C216<=4,$C216<>0),0,IF(AND($C216=\"S\",$Y216>0),OFFSET(I216,-1,0)+1,OFFSET(I216,-1,0)))","v":0},0,0,"F","Serviço","Serviço","1.7.1.1.","AGETOP",70709,"CAIXA DE PASSAGEM 20X20X25CM FUNDO BRITA SEM TAMPA","Un    ",3,1,null,null,null,null,null,""]
["S",3,"S",0,1,7,1,0,{"$f":"IF(AND($C217<=4,$C217<>0),0,IF(AND($C217=\"S\",$Y217>0),OFFSET(I217,-1,0)+1,OFFSET(I217,-1,0)))","v":0},0,0,"F","Serviço","Serviço","1.7.1.2.","AGETOP",81501,"ADESIVO PLASTICO - FRASCO 850 G","Un    ",2,1,null,null,null,null,null,""]
["S",3,"S",0,1,7,1,0,{"$f":"IF(AND($C218<=4,$C218<>0),0,IF(AND($C218=\"S\",$Y218>0),OFFSET(I218,-1,0)+1,OFFSET(I218,-1,0)))","v":0},0,0,"F","Serviço","Serviço","1.7.1.3.","AGETOP",81504,"SOLUCAO LIMPADORA 1000 CM3","Un    ",2,1,null,null,null,null,null,""]
["S",3,"S",0,1,7,1,0,{"$f":"IF(AND($C219<=4,$C219<>0),0,IF(AND($C219=\"S\",$Y219>0),OFFSET(I219,-1,0)+1,OFFSET(I219,-1,0)))","v":0},0,0,"F","Serviço","Serviço","1.7.1.4.","AGETOP",81825,"CAIXA DE PASSAGEM 60 X 60 CM SEM TAMPA","Un    ",5,1,null,null,null,null,null,""]
["S",3,"S",0,1,7,1,0,{"$f":"IF(AND($C220<=4,$C220<>0),0,IF(AND($C220=\"S\",$Y220>0),OFFSET(I220,-1,0)+1,OFFSET(I220,-1,0)))","v":0},0,0,"F","Serviço","Serviço","1.7.1.5.","AGETOP",81826,"TAMPA EM CONCRETO ARMADO 25 MPA E=5CM PARA A CAIXA DE PASSAGEM 60X60CM","Un    ",5,1,null,null,null,null,null,""]
["S",3,"S",0,1,7,1,0,{"$f":"IF(AND($C221<=4,$C221<>0),0,IF(AND($C221=\"S\",$Y221>0),OFFSET(I221,-1,0)+1,OFFSET(I221,-1,0)))","v":0},0,0,"F","Serviço","Serviço","1.7.1.6.","AGETOP",81828,"CAIXA DE AREIA 60X60CM FUNDO DE BRITA COM GRELHA METÁLICA FERRO CHATO PADRÃO AGETOP ","Un    ",9,1,null,null,null,null,null,""]
["S",3,"S",0,1,7,1,0,{"$f":"IF(AND($C222<=4,$C222<>0),0,IF(AND($C222=\"S\",$Y222>0),OFFSET(I222,-1,0)+1,OFFSET(I222,-1,0)))","v":0},0,0,"F","Serviço","Serviço","1.7.1.7.","AGETOP",81869,"FOSSA SEPTICA 8700 LITROS COM IMPERMEABILIZAÇÃO","Un    ",1,1,null,null,null,null,null,""]
["S",3,"S",0,1,7,1,0,{"$f":"IF(AND($C223<=4,$C223<>0),0,IF(AND($C223=\"S\",$Y223>0),OFFSET(I223,-1,0)+1,OFFSET(I223,-1,0)))","v":0},0,0,"F","Serviço","Serviço","1.7.1.8.","AGETOP",81874,"SUMIDOURO COM DIÂMETRO=1,60M E  PROFUNDIDADE=4,50 M","Un    ",3,1,null,null,null,null,null,""]
["S",3,"S",0,1,7,1,0,{"$f":"IF(AND($C224<=4,$C224<>0),0,IF(AND($C224=\"S\",$Y224>0),OFFSET(I224,-1,0)+1,OFFSET(I224,-1,0)))","v":0},0,0,"F","Serviço","Serviço","1.7.1.9.","AGETOP",80811,"TORNEIRA DE JARDIM COM BICO PARA MANGUEIRA DIÂMETRO DE 1/2\" E 3/4\"","Un    ",3,1,null,null,null,null,null,""]
["S",3,"S",0,1,7,1,0,{"$f":"IF(AND($C225<=4,$C225<>0),0,IF(AND($C225=\"S\",$Y225>0),OFFSET(I225,-1,0)+1,OFFSET(I225,-1,0)))","v":0},0,0,"F","Serviço","Serviço","1.7.1.10.","AGETOP",81889,"TORNEIRA BOIA DIAMETRO 1\" (25 MM )","Un    ",1,1,null,null,null,null,null,""]
["S",3,"S",0,1,7,1,0,{"$f":"IF(AND($C226<=4,$C226<>0),0,IF(AND($C226=\"S\",$Y226>0),OFFSET(I226,-1,0)+1,OFFSET(I226,-1,0)))","v":0},0,0,"F","Serviço","Serviço","1.7.1.11.","COMPOSIÇÃO","COMP 229_SEE","CAIXA PARA HIDROMETRO CONCRETO PRE-MOLDADO","UN ",1,1,null,null,null,null,null,""]
["S",3,"S",0,1,7,1,0,{"$f":"IF(AND($C227<=4,$C227<>0),0,IF(AND($C227=\"S\",$Y227>0),OFFSET(I227,-1,0)+1,OFFSET(I227,-1,0)))","v":0},0,0,"F","Serviço","Serviço","1.7.1.12.","COMPOSIÇÃO","COMP 230_SEE","HIDROMETRO 20,0 M3/H DN 1 1/2\"","UN ",1,1,null,null,null,null,null,""]
["S",3,"S",0,1,7,1,0,{"$f":"IF(AND($C228<=4,$C228<>0),0,IF(AND($C228=\"S\",$Y228>0),OFFSET(I228,-1,0)+1,OFFSET(I228,-1,0)))","v":0},0,0,"F","Serviço","Serviço","1.7.1.13.","SINAPI",95644,"KIT CAVALETE PARA MEDIÇÃO DE ÁGUA - ENTRADA INDIVIDUALIZADA, EM PVC DN 32 (1\u0094), PARA 1 MEDIDOR \u0096 FORNECIMENTO E INSTALAÇÃO (EXCLUSIVE HIDRÔMETRO). AF_11/2016","UN",1,1,null,null,null,null,null,""]
["S",3,"S",0,1,7,1,0,{"$f":"IF(AND($C229<=4,$C229<>0),0,IF(AND($C229=\"S\",$Y229>0),OFFSET(I229,-1,0)+1,OFFSET(I229,-1,0)))","v":0},0,0,"F","Serviço","Serviço","1.7.1.14.","COMPOSIÇÃO","COMP 403_SEE","HIDROMETRO MULTIJATO, VAZAO MAXIMA DE 7,0 M3/H, DE 1\" FORNECIMENTO E INSTALAÇÃO.","UN ",1,1,null,null,null,null,null,""]
[3,3,3,14,1,7,2,0,{"$f":"IF(AND($C230<=4,$C230<>0),0,IF(AND($C230=\"S\",$Y230>0),OFFSET(I230,-1,0)+1,OFFSET(I230,-1,0)))","v":0},48,14,"F","Nível 3","Nível 3","1.7.2.","AGETOP",null,"ÁGUA FRIA","-",null,1,null,null,null,null,null,""]
["S",3,"S",0,1,7,2,0,{"$f":"IF(AND($C231<=4,$C231<>0),0,IF(AND($C231=\"S\",$Y231>0),OFFSET(I231,-1,0)+1,OFFSET(I231,-1,0)))","v":0},0,0,"F","Serviço","Serviço","1.7.2.1.","AGETOP",81003,"TUBO SOLDAVEL PVC MARROM DIAMETRO 25 mm","M     ",110,1,null,null,null,null,null,""]
["S",3,"S",0,1,7,2,0,{"$f":"IF(AND($C232<=4,$C232<>0),0,IF(AND($C232=\"S\",$Y232>0),OFFSET(I232,-1,0)+1,OFFSET(I232,-1,0)))","v":0},0,0,"F","Serviço","Serviço","1.7.2.2.","AGETOP",81004,"TUBO SOLDAVEL PVC MARROM DIAMETRO 32 mm","m     ",145,1,null,null,null,null,null,""]
["S",3,"S",0,1,7,2,0,{"$f":"IF(AND($C233<=4,$C233<>0),0,IF(AND($C233=\"S\",$Y233>0),OFFSET(I233,-1,0)+1,OFFSET(I233,-1,0)))","v":0},0,0,"F","Serviço","Serviço","1.7.2.3.","AGETOP",81006,"TUBO SOLDAVEL PVC MARROM DIAM. 50 mm","m     ",12,1,null,null,null,null,null,""]
["S",3,"S",0,1,7,2,0,{"$f":"IF(AND($C234<=4,$C234<>0),0,IF(AND($C234=\"S\",$Y234>0),OFFSET(I234,-1,0)+1,OFFSET(I234,-1,0)))","v":0},0,0,"F","Serviço","Serviço","1.7.2.4.","AGETOP",81007,"TUBO SOLDAVEL PVC MARROM DIAMETRO 60 mm (2\")","m     ",112,1,null,null,null,null,null,""]
["S",3,"S",0,1,7,2,0,{"$f":"IF(AND($C235<=4,$C235<>0),0,IF(AND($C235=\"S\",$Y235>0),OFFSET(I235,-1,0)+1,OFFSET(I235,-1,0)))","v":0},0,0,"F","Serviço","Serviço","1.7.2.5.","AGETOP",81165,"BUCHA DE REDUCAO SOLD. CURTA 60 X 50 mm","Un    ",1,1,null,null,null,null,null,""]
["S",3,"S",0,1,7,2,0,{"$f":"IF(AND($C236<=4,$C236<>0),0,IF(AND($C236=\"S\",$Y236>0),OFFSET(I236,-1,0)+1,OFFSET(I236,-1,0)))","v":0},0,0,"F","Serviço","Serviço","1.7.2.6.","AGETOP",81180,"BUCHA DE REDUCAO SOLDAVEL LONGA 50 X 32 mm","Un    ",1,1,null,null,null,null,null,""]
["S",3,"S",0,1,7,2,0,{"$f":"IF(AND($C237<=4,$C237<>0),0,IF(AND($C237=\"S\",$Y237>0),OFFSET(I237,-1,0)+1,OFFSET(I237,-1,0)))","v":0},0,0,"F","Serviço","Serviço","1.7.2.7.","AGETOP",81303,"JOELHO 45 GRAUS SOLDAVEL 32 mm","Un    ",2,1,null,null,null,null,null,""]
["S",3,"S",0,1,7,2,0,{"$f":"IF(AND($C238<=4,$C238<>0),0,IF(AND($C238=\"S\",$Y238>0),OFFSET(I238,-1,0)+1,OFFSET(I238,-1,0)))","v":0},0,0,"F","Serviço","Serviço","1.7.2.8.","AGETOP",81321,"JOELHO 90 GRAUS SOLDAVEL DIAMETRO 25 MM","Un    ",1,1,null,null,null,null,null,""]
["S",3,"S",0,1,7,2,0,{"$f":"IF(AND($C239<=4,$C239<>0),0,IF(AND($C239=\"S\",$Y239>0),OFFSET(I239,-1,0)+1,OFFSET(I239,-1,0)))","v":0},0,0,"F","Serviço","Serviço","1.7.2.9.","AGETOP",81322,"JOELHO 90 GRAUS SOLDAVEL DIAMETRO 32 MM (1\")","Un    ",2,1,null,null,null,null,null,""]
["S",3,"S",0,1,7,2,0,{"$f":"IF(AND($C240<=4,$C240<>0),0,IF(AND($C240=\"S\",$Y240>0),OFFSET(I240,-1,0)+1,OFFSET(I240,-1,0)))","v":0},0,0,"F","Serviço","Serviço","1.7.2.10.","AGETOP",81324,"JOELHO 90 GRAUS SOLDAVEL 50 mm (MARROM)","Un    ",1,1,null,null,null,null,null,""]
["S",3,"S",0,1,7,2,0,{"$f":"IF(AND($C241<=4,$C241<>0),0,IF(AND($C241=\"S\",$Y241>0),OFFSET(I241,-1,0)+1,OFFSET(I241,-1,0)))","v":0},0,0,"F","Serviço","Serviço","1.7.2.11.","AGETOP",81325,"JOELHO 90 GRAUS SOLDAVEL DIAMETRO 60 mm","Un    ",3,1,null,null,null,null,null,""]
["S",3,"S",0,1,7,2,0,{"$f":"IF(AND($C242<=4,$C242<>0),0,IF(AND($C242=\"S\",$Y242>0),OFFSET(I242,-1,0)+1,OFFSET(I242,-1,0)))","v":0},0,0,"F","Serviço","Serviço","1.7.2.12.","AGETOP",81406,"TE 90 GRAUS SOLDAVEL DIMETRO 60 mm","Un    ",3,1,null,null,null,null,null,""]
["S",3,"S",0,1,7,2,0,{"$f":"IF(AND($C243<=4,$C243<>0),0,IF(AND($C243=\"S\",$Y243>0),OFFSET(I243,-1,0)+1,OFFSET(I243,-1,0)))","v":0},0,0,"F","Serviço","Serviço","1.7.2.13.","AGETOP",81421,"TE REDUCAO 90 GRAUS SOLDAVEL 32 X 25 mm","Un    ",2,1,null,null,null,null,null,""]
[3,3,3,4,1,7,3,0,{"$f":"IF(AND($C244<=4,$C244<>0),0,IF(AND($C244=\"S\",$Y244>0),OFFSET(I244,-1,0)+1,OFFSET(I244,-1,0)))","v":0},34,4,"F","Nível 3","Nível 3","1.7.3.","AGETOP",null,"ESGOTO","-",null,1,null,null,null,null,null,""]
["S",3,"S",0,1,7,3,0,{"$f":"IF(AND($C245<=4,$C245<>0),0,IF(AND($C245=\"S\",$Y245>0),OFFSET(I245,-1,0)+1,OFFSET(I245,-1,0)))","v":0},0,0,"F","Serviço","Serviço","1.7.3.1.","AGETOP",81702,"CURVA 45 GRAUS DIAMETRO 100 MM","Un    ",1,1,null,null,null,null,null,""]
["S",3,"S",0,1,7,3,0,{"$f":"IF(AND($C246<=4,$C246<>0),0,IF(AND($C246=\"S\",$Y246>0),OFFSET(I246,-1,0)+1,OFFSET(I246,-1,0)))","v":0},0,0,"F","Serviço","Serviço","1.7.3.2.","AGETOP",82303,"TUBO SOLDAVEL P/ESGOTO DIAM.75 MM","m     ",99,1,null,null,null,null,null,""]
["S",3,"S",0,1,7,3,0,{"$f":"IF(AND($C247<=4,$C247<>0),0,IF(AND($C247=\"S\",$Y247>0),OFFSET(I247,-1,0)+1,OFFSET(I247,-1,0)))","v":0},0,0,"F","Serviço","Serviço","1.7.3.3.","AGETOP",82304,"TUBO SOLDAVEL P/ESGOTO DIAM. 100 MM","m     ",187,1,null,null,null,null,null,""]
[3,3,3,22,1,7,4,0,{"$f":"IF(AND($C248<=4,$C248<>0),0,IF(AND($C248=\"S\",$Y248>0),OFFSET(I248,-1,0)+1,OFFSET(I248,-1,0)))","v":0},30,22,"F","Nível 3","Nível 3","1.7.4.",null,null,"RESERVATÓRIO","-",null,1,null,null,null,null,null,""]
["S",3,"S",0,1,7,4,0,{"$f":"IF(AND($C249<=4,$C249<>0),0,IF(AND($C249=\"S\",$Y249>0),OFFSET(I249,-1,0)+1,OFFSET(I249,-1,0)))","v":0},0,0,"F","Serviço","Serviço","1.7.4.1.","AGETOP",80906,"REGISTRO DE GAVETA BRUTO DIAMETRO 2\"","Un    ",1,1,null,null,null,null,null,""]
["S",3,"S",0,1,7,4,0,{"$f":"IF(AND($C250<=4,$C250<>0),0,IF(AND($C250=\"S\",$Y250>0),OFFSET(I250,-1,0)+1,OFFSET(I250,-1,0)))","v":0},0,0,"F","Serviço","Serviço","1.7.4.2.","AGETOP",80911,"REGISTRO DE GAVETA BRUTO 3\"","Un    ",1,1,null,null,null,null,null,""]
["S",3,"S",0,1,7,4,0,{"$f":"IF(AND($C251<=4,$C251<>0),0,IF(AND($C251=\"S\",$Y251>0),OFFSET(I251,-1,0)+1,OFFSET(I251,-1,0)))","v":0},0,0,"F","Serviço","Serviço","1.7.4.3.","AGETOP",81003,"TUBO SOLDAVEL PVC MARROM DIAMETRO 25 mm","M     ",16,1,null,null,null,null,null,""]
["S",3,"S",0,1,7,4,0,{"$f":"IF(AND($C252<=4,$C252<>0),0,IF(AND($C252=\"S\",$Y252>0),OFFSET(I252,-1,0)+1,OFFSET(I252,-1,0)))","v":0},0,0,"F","Serviço","Serviço","1.7.4.4.","AGETOP",81004,"TUBO SOLDAVEL PVC MARROM DIAMETRO 32 mm","m     ",2,1,null,null,null,null,null,""]
["S",3,"S",0,1,7,4,0,{"$f":"IF(AND($C253<=4,$C253<>0),0,IF(AND($C253=\"S\",$Y253>0),OFFSET(I253,-1,0)+1,OFFSET(I253,-1,0)))","v":0},0,0,"F","Serviço","Serviço","1.7.4.5.","AGETOP",81006,"TUBO SOLDAVEL PVC MARROM DIAM. 50 mm","m     ",13,1,null,null,null,null,null,""]
["S",3,"S",0,1,7,4,0,{"$f":"IF(AND($C254<=4,$C254<>0),0,IF(AND($C254=\"S\",$Y254>0),OFFSET(I254,-1,0)+1,OFFSET(I254,-1,0)))","v":0},0,0,"F","Serviço","Serviço","1.7.4.6.","AGETOP",81009,"TUBO SOLDAVEL PVC MARROM DIAMETRO 85 mm","m     ",13,1,null,null,null,null,null,""]
["S",3,"S",0,1,7,4,0,{"$f":"IF(AND($C255<=4,$C255<>0),0,IF(AND($C255=\"S\",$Y255>0),OFFSET(I255,-1,0)+1,OFFSET(I255,-1,0)))","v":0},0,0,"F","Serviço","Serviço","1.7.4.7.","AGETOP",81041,"ADAPTAD.PVC SOLD.LONGO C/FLANGES LIVRES P/CX.DAGUA 25X3/4\"","Un    ",2,1,null,null,null,null,null,""]
["S",3,"S",0,1,7,4,0,{"$f":"IF(AND($C256<=4,$C256<>0),0,IF(AND($C256=\"S\",$Y256>0),OFFSET(I256,-1,0)+1,OFFSET(I256,-1,0)))","v":0},0,0,"F","Serviço","Serviço","1.7.4.8.","AGETOP",81043,"ADAPTAD.PVC SOLD.LONGO C/FLANGES LIVRES P/ CX.DAGUA 50X1.1/2","Un    ",2,1,null,null,null,null,null,""]
["S",3,"S",0,1,7,4,0,{"$f":"IF(AND($C257<=4,$C257<>0),0,IF(AND($C257=\"S\",$Y257>0),OFFSET(I257,-1,0)+1,OFFSET(I257,-1,0)))","v":0},0,0,"F","Serviço","Serviço","1.7.4.9.","COMPOSIÇÃO","COMP 028_SEE","ADAPTADOR PVC SOLDAVEL FLANGES LIVRES P/ CAIXA D' AGUA 85 MM X 3\"","UN ",2,1,null,null,null,null,null,""]
["S",3,"S",0,1,7,4,0,{"$f":"IF(AND($C258<=4,$C258<>0),0,IF(AND($C258=\"S\",$Y258>0),OFFSET(I258,-1,0)+1,OFFSET(I258,-1,0)))","v":0},0,0,"F","Serviço","Serviço","1.7.4.10.","AGETOP",81069,"ADAPTAD.SOLD.CURTO C/BOLSA/ROSCA P/REG.50X11/2\"","Un    ",2,1,null,null,null,null,null,""]
["S",3,"S",0,1,7,4,0,{"$f":"IF(AND($C259<=4,$C259<>0),0,IF(AND($C259=\"S\",$Y259>0),OFFSET(I259,-1,0)+1,OFFSET(I259,-1,0)))","v":0},0,0,"F","Serviço","Serviço","1.7.4.11.","AGETOP",81072,"ADAPTADOR SOLDAVEL CURTO C/BR P/REG. 85 X 3\"","Un    ",2,1,null,null,null,null,null,""]
["S",3,"S",0,1,7,4,0,{"$f":"IF(AND($C260<=4,$C260<>0),0,IF(AND($C260=\"S\",$Y260>0),OFFSET(I260,-1,0)+1,OFFSET(I260,-1,0)))","v":0},0,0,"F","Serviço","Serviço","1.7.4.12.","COMPOSIÇÃO","COMP 331_SEE","VALVULA PÉ DE CRIVO 1.1/4\"","UN ",1,1,null,null,null,null,null,""]
["S",3,"S",0,1,7,4,0,{"$f":"IF(AND($C261<=4,$C261<>0),0,IF(AND($C261=\"S\",$Y261>0),OFFSET(I261,-1,0)+1,OFFSET(I261,-1,0)))","v":0},0,0,"F","Serviço","Serviço","1.7.4.13.","COMPOSIÇÃO","COMP 555_SEE","TORNEIRA BÓIA AUTOMÁTICA 1\"","UN ",1,1,null,null,null,null,null,""]
["S",3,"S",0,1,7,4,0,{"$f":"IF(AND($C262<=4,$C262<>0),0,IF(AND($C262=\"S\",$Y262>0),OFFSET(I262,-1,0)+1,OFFSET(I262,-1,0)))","v":0},0,0,"F","Serviço","Serviço","1.7.4.14.","AGETOP",81102,"LUVA SOLDAVEL DIAMETRO 25 mm","Un    ",1,1,null,null,null,null,null,""]
["S",3,"S",0,1,7,4,0,{"$f":"IF(AND($C263<=4,$C263<>0),0,IF(AND($C263=\"S\",$Y263>0),OFFSET(I263,-1,0)+1,OFFSET(I263,-1,0)))","v":0},0,0,"F","Serviço","Serviço","1.7.4.15.","AGETOP",81105,"LUVA SOLDAVEL DIAMETRO 50 mm","Un    ",1,1,null,null,null,null,null,""]
["S",3,"S",0,1,7,4,0,{"$f":"IF(AND($C264<=4,$C264<>0),0,IF(AND($C264=\"S\",$Y264>0),OFFSET(I264,-1,0)+1,OFFSET(I264,-1,0)))","v":0},0,0,"F","Serviço","Serviço","1.7.4.16.","AGETOP",81108,"LUVA SOLDAVEL DIAMETRO 85 mm","Un    ",1,1,null,null,null,null,null,""]
["S",3,"S",0,1,7,4,0,{"$f":"IF(AND($C265<=4,$C265<>0),0,IF(AND($C265=\"S\",$Y265>0),OFFSET(I265,-1,0)+1,OFFSET(I265,-1,0)))","v":0},0,0,"F","Serviço","Serviço","1.7.4.17.","AGETOP",81321,"JOELHO 90 GRAUS SOLDAVEL DIAMETRO 25 MM","Un    ",2,1,null,null,null,null,null,""]
["S",3,"S",0,1,7,4,0,{"$f":"IF(AND($C266<=4,$C266<>0),0,IF(AND($C266=\"S\",$Y266>0),OFFSET(I266,-1,0)+1,OFFSET(I266,-1,0)))","v":0},0,0,"F","Serviço","Serviço","1.7.4.18.","AGETOP",81324,"JOELHO 90 GRAUS SOLDAVEL 50 mm (MARROM)","Un    ",1,1,null,null,null,null,null,""]
["S",3,"S",0,1,7,4,0,{"$f":"IF(AND($C267<=4,$C267<>0),0,IF(AND($C267=\"S\",$Y267>0),OFFSET(I267,-1,0)+1,OFFSET(I267,-1,0)))","v":0},0,0,"F","Serviço","Serviço","1.7.4.19.","AGETOP",81327,"JOELHO 90 GRAUS SOLDAVEL DIAMETRO 85 mm","Un    ",1,1,null,null,null,null,null,""]
["S",3,"S",0,1,7,4,0,{"$f":"IF(AND($C268<=4,$C268<>0),0,IF(AND($C268=\"S\",$Y268>0),OFFSET(I268,-1,0)+1,OFFSET(I268,-1,0)))","v":0},0,0,"F","Serviço","Serviço","1.7.4.20.","SINAPI",83647,"BOMBA RECALQUE D'AGUA TRIFASICA 1,5HP","UN",1,1,null,null,null,null,null,""]
["S",3,"S",0,1,7,4,0,{"$f":"IF(AND($C269<=4,$C269<>0),0,IF(AND($C269=\"S\",$Y269>0),OFFSET(I269,-1,0)+1,OFFSET(I269,-1,0)))","v":0},0,0,"F","Serviço","Serviço","1.7.4.21.","AGETOP",91041,"MANGOTE FLEXIVEL PRETO 7/8 \" X 7/16\" - 500 MM","Un    ",1,1,null,null,null,null,null,""]
[{"$f":"CHOOSE(1+LOG(1+2*(ORÇAMENTO.Nivel=\"Nível 1\")+4*(ORÇAMENTO.Nivel=\"Nível 2\")+8*(ORÇAMENTO.Nivel=\"Nível 3\")+16*(ORÇAMENTO.Nivel=\"Nível 4\")+32*(ORÇAMENTO.Nivel=\"Serviço\"),2),0,1,2,3,4,\"S\")","v":3},{"$f":"IF(OR(C270=\"s\",C270=0),OFFSET(B270,-1,0),C270)","v":3},{"$f":"IF(OFFSET(C270,-1,0)=\"L\",1,IF(OFFSET(C270,-1,0)=1,2,IF(OR(A270=\"s\",A270=0),\"S\",IF(AND(OFFSET(C270,-1,0)=2,A270=4),3,IF(AND(OR(OFFSET(C270,-1,0)=\"s\",OFFSET(C270,-1,0)=0),A270<>\"s\",A270>OFFSET(B270,-1,0)),OFFSET(B270,-1,0),A270)))))","v":3},{"$f":"IF(OR(C270=\"S\",C270=0),0,IF(ISERROR(K270),J270,SMALL(J270:K270,1)))","v":8},{"$f":"IF($C270=1,OFFSET(E270,-1,0)+1,OFFSET(E270,-1,0))","v":1},{"$f":"IF($C270=1,0,IF($C270=2,OFFSET(F270,-1,0)+1,OFFSET(F270,-1,0)))","v":7},{"$f":"IF(AND($C270<=2,$C270<>0),0,IF($C270=3,OFFSET(G270,-1,0)+1,OFFSET(G270,-1,0)))","v":5},{"$f":"IF(AND($C270<=3,$C270<>0),0,IF($C270=4,OFFSET(H270,-1,0)+1,OFFSET(H270,-1,0)))","v":0},{"$f":"IF(AND($C270<=4,$C270<>0),0,IF(AND($C270=\"S\",$Y270>0),OFFSET(I270,-1,0)+1,OFFSET(I270,-1,0)))","v":0},8,82,"F","Nível 3","Nível 3","1.7.5.","AGETOP",null,"COMBATE A INCÊNDIO","-",null,1,null,null,null,null,null,""]
["S",3,"S",0,1,7,5,0,{"$f":"IF(AND($C271<=4,$C271<>0),0,IF(AND($C271=\"S\",$Y271>0),OFFSET(I271,-1,0)+1,OFFSET(I271,-1,0)))","v":0},0,0,"F","Serviço","Serviço","1.7.5.1.","SINAPI","73775/2","EXTINTOR INCENDIO AGUA-PRESSURIZADA 10L INCL SUPORTE PAREDE CARGA     COMPLETA FORNECIMENTO E COLOCACAO","UN",3,1,null,null,null,null,null,""]
["S",3,"S",0,1,7,5,0,{"$f":"IF(AND($C272<=4,$C272<>0),0,IF(AND($C272=\"S\",$Y272>0),OFFSET(I272,-1,0)+1,OFFSET(I272,-1,0)))","v":0},0,0,"F","Serviço","Serviço","1.7.5.2.","SINAPI",83635,"EXTINTOR INCENDIO TP PO QUIMICO 6KG - FORNECIMENTO E INSTALACAO","UN",4,1,null,null,null,null,null,""]
["S",3,"S",0,1,7,5,0,{"$f":"IF(AND($C273<=4,$C273<>0),0,IF(AND($C273=\"S\",$Y273>0),OFFSET(I273,-1,0)+1,OFFSET(I273,-1,0)))","v":0},0,0,"F","Serviço","Serviço","1.7.5.3.","AGETOP",71598,"LUMINÁRIA DE EMERGÊNCIA 30 LEDS","un    ",10,1,null,null,null,null,null,""]
["S",3,"S",0,1,7,5,0,{"$f":"IF(AND($C274<=4,$C274<>0),0,IF(AND($C274=\"S\",$Y274>0),OFFSET(I274,-1,0)+1,OFFSET(I274,-1,0)))","v":0},0,0,"F","Serviço","Serviço","1.7.5.4.","COMPOSIÇÃO","COMP 235_SEE","PLACA DE SINALIZAÇÃO EM PVC COD 01 - (300X300) PROIBIDO FUMAR","UN ",1,1,null,null,null,null,null,""]
["S",3,"S",0,1,7,5,0,{"$f":"IF(AND($C275<=4,$C275<>0),0,IF(AND($C275=\"S\",$Y275>0),OFFSET(I275,-1,0)+1,OFFSET(I275,-1,0)))","v":0},{"$f":"IF(OR($C275=\"S\",$C275=0),0,MATCH(0,OFFSET($D275,1,$C275,ROW($C$1328)-ROW($C275)),0))","v":0},{"$f":"IF(OR($C275=\"S\",$C275=0),0,MATCH(OFFSET($D275,0,$C275)+1,OFFSET($D275,1,$C275,ROW($C$1328)-ROW($C275)),0))","v":0},"F","Serviço","Serviço","1.7.5.5.","COMPOSIÇÃO","COMP 236_SEE","PLACA DE SINALIZAÇÃO EM PVC COD 06 - (300X300) PERIGO INFLAMÁVEL","UN ",1,1,null,null,null,null,null,""]
["S",3,"S",0,1,7,5,0,{"$f":"IF(AND($C276<=4,$C276<>0),0,IF(AND($C276=\"S\",$Y276>0),OFFSET(I276,-1,0)+1,OFFSET(I276,-1,0)))","v":0},0,0,"F","Serviço","Serviço","1.7.5.6.","COMPOSIÇÃO","COMP 411_SEE","PLACA DE SINALIZAÇÃO EM PVC COD 13 - (316X158) SAÍDA DE EMERGÊNCIA","UN ",12,1,null,null,null,null,null,""]
["S",3,"S",0,1,7,5,0,{"$f":"IF(AND($C277<=4,$C277<>0),0,IF(AND($C277=\"S\",$Y277>0),OFFSET(I277,-1,0)+1,OFFSET(I277,-1,0)))","v":0},0,0,"F","Serviço","Serviço","1.7.5.7.","COMPOSIÇÃO","COMP 412_SEE","PLACA DE SINALIZAÇÃO EM PVC COD 17 - (316X158) MENSAGEM \"SAÍDA\"","UN ",1,1,null,null,null,null,null,""]
[2,2,2,26,1,8,0,0,{"$f":"IF(AND($C278<=4,$C278<>0),0,IF(AND($C278=\"S\",$Y278>0),OFFSET(I278,-1,0)+1,OFFSET(I278,-1,0)))","v":0},90,26,"F","Nível 2","Nível 2","1.8.","SINAPI",null,"INSTALAÇÕES ESPECIAIS","-",null,1,null,null,null,null,null,""]
["S",2,"S",0,1,8,0,0,{"$f":"IF(AND($C279<=4,$C279<>0),0,IF(AND($C279=\"S\",$Y279>0),OFFSET(I279,-1,0)+1,OFFSET(I279,-1,0)))","v":0},0,0,"F","Serviço","Serviço","1.8.0.1.","AGETOP",91007,"CENTRAL DE GÁS PADRÃO AGETOP SEM INSTALAÇÕES (1+1 CILINDRO 45 KG)","Un    ",1,1,null,null,null,null,null,""]
["S",2,"S",0,1,8,0,0,{"$f":"IF(AND($C280<=4,$C280<>0),0,IF(AND($C280=\"S\",$Y280>0),OFFSET(I280,-1,0)+1,OFFSET(I280,-1,0)))","v":0},0,0,"F","Serviço","Serviço","1.8.0.2.","AGETOP",91023,"UNIÃO S/BRONZE PRETA 3/4\" NPT 300 LBS","Un    ",3,1,null,null,null,null,null,""]
["S",2,"S",0,1,8,0,0,{"$f":"IF(AND($C281<=4,$C281<>0),0,IF(AND($C281=\"S\",$Y281>0),OFFSET(I281,-1,0)+1,OFFSET(I281,-1,0)))","v":0},0,0,"F","Serviço","Serviço","1.8.0.3.","COMPOSIÇÃO","COMP 382_SEE","TE DE REDUCAO DE FERRO GALVANIZADO, COM ROSCA BSP, DE 3/4\" X 1/2\"","UN ",1,1,null,null,null,null,null,""]
["S",2,"S",0,1,8,0,0,{"$f":"IF(AND($C282<=4,$C282<>0),0,IF(AND($C282=\"S\",$Y282>0),OFFSET(I282,-1,0)+1,OFFSET(I282,-1,0)))","v":0},0,0,"F","Serviço","Serviço","1.8.0.4.","COMPOSIÇÃO","COMP 383_SEE","BUCHA DE REDUCAO DE FERRO GALVANIZADO, COM ROSCA BSP, DE 1/2\" X 1/4\"","UN ",3,1,null,null,null,null,null,""]
["S",2,"S",0,1,8,0,0,{"$f":"IF(AND($C283<=4,$C283<>0),0,IF(AND($C283=\"S\",$Y283>0),OFFSET(I283,-1,0)+1,OFFSET(I283,-1,0)))","v":0},0,0,"F","Serviço","Serviço","1.8.0.5.","AGETOP",91021,"LUVA GALVANIZADO DE REDUÇÃO 3/4\" X 1/2\" (GÁS)","Un    ",2,1,null,null,null,null,null,""]
["S",2,"S",0,1,8,0,0,{"$f":"IF(AND($C284<=4,$C284<>0),0,IF(AND($C284=\"S\",$Y284>0),OFFSET(I284,-1,0)+1,OFFSET(I284,-1,0)))","v":0},0,0,"F","Serviço","Serviço","1.8.0.6.","SINAPI",92692,"NIPLE, EM FERRO GALVANIZADO, CONEXÃO ROSQUEADA, DN 15 (1/2\"), INSTALADO EM RAMAIS E SUB-RAMAIS DE GÁS - FORNECIMENTO E INSTALAÇÃO. AF_12/2015","UN",6,1,null,null,null,null,null,""]
["S",2,"S",0,1,8,0,0,{"$f":"IF(AND($C285<=4,$C285<>0),0,IF(AND($C285=\"S\",$Y285>0),OFFSET(I285,-1,0)+1,OFFSET(I285,-1,0)))","v":0},0,0,"F","Serviço","Serviço","1.8.0.7.","AGETOP",91031,"NIPLE DUPLO 300 PSI 3/4\"","Un    ",6,1,null,null,null,null,null,""]
["S",2,"S",0,1,8,0,0,{"$f":"IF(AND($C286<=4,$C286<>0),0,IF(AND($C286=\"S\",$Y286>0),OFFSET(I286,-1,0)+1,OFFSET(I286,-1,0)))","v":0},0,0,"F","Serviço","Serviço","1.8.0.8.","COMPOSIÇÃO","COMP 212_SEE","NIPLE DE REDUÇÃO 1/2\" X 1/4\" BSP","UN ",4,1,null,null,null,null,null,""]
["S",2,"S",0,1,8,0,0,{"$f":"IF(AND($C287<=4,$C287<>0),0,IF(AND($C287=\"S\",$Y287>0),OFFSET(I287,-1,0)+1,OFFSET(I287,-1,0)))","v":0},0,0,"F","Serviço","Serviço","1.8.0.9.","COMPOSIÇÃO","COMP 213_SEE","NIPLE DE REDUÇÃO 3/4\" X 1/2\" BSP","UN ",4,1,null,null,null,null,null,""]
["S",2,"S",0,1,8,0,0,{"$f":"IF(AND($C288<=4,$C288<>0),0,IF(AND($C288=\"S\",$Y288>0),OFFSET(I288,-1,0)+1,OFFSET(I288,-1,0)))","v":0},0,0,"F","Serviço","Serviço","1.8.0.10.","SINAPI",92688,"TUBO DE AÇO GALVANIZADO COM COSTURA, CLASSE MÉDIA, CONEXÃO ROSQUEADA, DN 20 (3/4\"), INSTALADO EM RAMAIS E SUB-RAMAIS DE GÁS - FORNECIMENTO E INSTALAÇÃO. AF_12/2015","M",18,1,null,null,null,null,null,""]
["S",2,"S",0,1,8,0,0,{"$f":"IF(AND($C289<=4,$C289<>0),0,IF(AND($C289=\"S\",$Y289>0),OFFSET(I289,-1,0)+1,OFFSET(I289,-1,0)))","v":0},0,0,"F","Serviço","Serviço","1.8.0.11.","SINAPI",92701,"JOELHO 90 GRAUS, EM FERRO GALVANIZADO, CONEXÃO ROSQUEADA, DN 20 (3/4\"), INSTALADO EM RAMAIS E SUB-RAMAIS DE GÁS - FORNECIMENTO E INSTALAÇÃO. AF_12/2015","UN",4,1,null,null,null,null,null,""]
["S",2,"S",0,1,8,0,0,{"$f":"IF(AND($C290<=4,$C290<>0),0,IF(AND($C290=\"S\",$Y290>0),OFFSET(I290,-1,0)+1,OFFSET(I290,-1,0)))","v":0},0,0,"F","Serviço","Serviço","1.8.0.12.","COMPOSIÇÃO","COMP 237_SEE","FITA ANTICORROSIVA","M",14,1,null,null,null,null,null,""]
["S",2,"S",0,1,8,0,0,{"$f":"IF(AND($C291<=4,$C291<>0),0,IF(AND($C291=\"S\",$Y291>0),OFFSET(I291,-1,0)+1,OFFSET(I291,-1,0)))","v":0},0,0,"F","Serviço","Serviço","1.8.0.13.","AGETOP",91025,"VÁLVULA ESFERICA LATÃO 3/4\"","Un    ",3,1,null,null,null,null,null,""]
["S",2,"S",0,1,8,0,0,{"$f":"IF(AND($C292<=4,$C292<>0),0,IF(AND($C292=\"S\",$Y292>0),OFFSET(I292,-1,0)+1,OFFSET(I292,-1,0)))","v":0},0,0,"F","Serviço","Serviço","1.8.0.14.","COMPOSIÇÃO","COMP 542_SEE","VÁLVULA UGV 3/4\" (S) LATÃO","UN ",1,1,null,null,null,null,null,""]
["S",2,"S",0,1,8,0,0,{"$f":"IF(AND($C293<=4,$C293<>0),0,IF(AND($C293=\"S\",$Y293>0),OFFSET(I293,-1,0)+1,OFFSET(I293,-1,0)))","v":0},0,0,"F","Serviço","Serviço","1.8.0.15.","COMPOSIÇÃO","COMP 543_SEE","VÁLVULA UGV 1/2\" (S) LATÃO","UN ",1,1,null,null,null,null,null,""]
["S",2,"S",0,1,8,0,0,{"$f":"IF(AND($C294<=4,$C294<>0),0,IF(AND($C294=\"S\",$Y294>0),OFFSET(I294,-1,0)+1,OFFSET(I294,-1,0)))","v":0},0,0,"F","Serviço","Serviço","1.8.0.16.","AGETOP",91029,"VALVULA DE RETENÇÃO LATÃO 1/2\" X 7/16\" NPT","Un    ",1,1,null,null,null,null,null,""]
["S",2,"S",0,1,8,0,0,{"$f":"IF(AND($C295<=4,$C295<>0),0,IF(AND($C295=\"S\",$Y295>0),OFFSET(I295,-1,0)+1,OFFSET(I295,-1,0)))","v":0},0,0,"F","Serviço","Serviço","1.8.0.17.","COMPOSIÇÃO","COMP 211_SEE","REGULADOR DE 2º ESTÁGIO 5KG/H","UN ",1,1,null,null,null,null,null,""]
["S",2,"S",0,1,8,0,0,{"$f":"IF(AND($C296<=4,$C296<>0),0,IF(AND($C296=\"S\",$Y296>0),OFFSET(I296,-1,0)+1,OFFSET(I296,-1,0)))","v":0},0,0,"F","Serviço","Serviço","1.8.0.18.","COMPOSIÇÃO","COMP 210_SEE","REGULADOR DE 1º ESTÁGIO 60KG/H MODELO AP-40  COM MANÔMETRO","UN ",1,1,null,null,null,null,null,""]
["S",2,"S",0,1,8,0,0,{"$f":"IF(AND($C297<=4,$C297<>0),0,IF(AND($C297=\"S\",$Y297>0),OFFSET(I297,-1,0)+1,OFFSET(I297,-1,0)))","v":0},0,0,"F","Serviço","Serviço","1.8.0.19.","AGETOP",85003,"EXTINTOR PO QUIMICO SECO (6 KG) - CAPACIDADE EXTINTORA 20 BC","Un    ",1,1,null,null,null,null,null,""]
["S",2,"S",0,1,8,0,0,{"$f":"IF(AND($C298<=4,$C298<>0),0,IF(AND($C298=\"S\",$Y298>0),OFFSET(I298,-1,0)+1,OFFSET(I298,-1,0)))","v":0},0,0,"F","Serviço","Serviço","1.8.0.20.","COMPOSIÇÃO","COMP 235_SEE","PLACA DE SINALIZAÇÃO EM PVC COD 01 - (300X300) PROIBIDO FUMAR","UN ",2,1,null,null,null,null,null,""]
["S",2,"S",0,1,8,0,0,{"$f":"IF(AND($C299<=4,$C299<>0),0,IF(AND($C299=\"S\",$Y299>0),OFFSET(I299,-1,0)+1,OFFSET(I299,-1,0)))","v":0},0,0,"F","Serviço","Serviço","1.8.0.21.","COMPOSIÇÃO","COMP 236_SEE","PLACA DE SINALIZAÇÃO EM PVC COD 06 - (300X300) PERIGO INFLAMÁVEL","UN ",2,1,null,null,null,null,null,""]
["S",2,"S",0,1,8,0,0,{"$f":"IF(AND($C300<=4,$C300<>0),0,IF(AND($C300=\"S\",$Y300>0),OFFSET(I300,-1,0)+1,OFFSET(I300,-1,0)))","v":0},0,0,"F","Serviço","Serviço","1.8.0.22.","AGETOP",91043,"BRAÇADEIRA METALICA TIPO \"D\" DIAM. 3/4\"","Un    ",5,1,null,null,null,null,null,""]
["S",2,"S",0,1,8,0,0,{"$f":"IF(AND($C301<=4,$C301<>0),0,IF(AND($C301=\"S\",$Y301>0),OFFSET(I301,-1,0)+1,OFFSET(I301,-1,0)))","v":0},0,0,"F","Serviço","Serviço","1.8.0.23.","AGETOP",71863,"PARAFUSO P/BUCHA S-10","Un    ",10,1,null,null,null,null,null,""]
["S",2,"S",0,1,8,0,0,{"$f":"IF(AND($C302<=4,$C302<>0),0,IF(AND($C302=\"S\",$Y302>0),OFFSET(I302,-1,0)+1,OFFSET(I302,-1,0)))","v":0},0,0,"F","Serviço","Serviço","1.8.0.24.","AGETOP",70393,"BUCHA DE NYLON S-10","Un    ",10,1,null,null,null,null,null,""]
["S",2,"S",0,1,8,0,0,{"$f":"IF(AND($C303<=4,$C303<>0),0,IF(AND($C303=\"S\",$Y303>0),OFFSET(I303,-1,0)+1,OFFSET(I303,-1,0)))","v":0},0,0,"F","Serviço","Serviço","1.8.0.25.","AGETOP",91045,"SUPORTE PARA COLETOR","Un    ",2,1,null,null,null,null,null,""]
[2,2,2,2,1,9,0,0,{"$f":"IF(AND($C304<=4,$C304<>0),0,IF(AND($C304=\"S\",$Y304>0),OFFSET(I304,-1,0)+1,OFFSET(I304,-1,0)))","v":0},64,2,"F","Nível 2","Nível 2","1.9.","SINAPI",null,"ALVENARIAS E DIVISÓRIAS","-",null,1,null,null,null,null,null,""]
["S",2,"S",0,1,9,0,0,{"$f":"IF(AND($C305<=4,$C305<>0),0,IF(AND($C305=\"S\",$Y305>0),OFFSET(I305,-1,0)+1,OFFSET(I305,-1,0)))","v":0},0,0,"F","Serviço","Serviço","1.9.0.1.","AGETOP",100201,"ALVENARIA DE TIJOLO FURADO 1/2 VEZ - 9 x 19 x 19 - ARG. (1CALH:4ARML+100KG DE CI/M3)","m2    ",46.83,1,null,null,null,null,null,""]
[2,2,2,5,1,10,0,0,{"$f":"IF(AND($C306<=4,$C306<>0),0,IF(AND($C306=\"S\",$Y306>0),OFFSET(I306,-1,0)+1,OFFSET(I306,-1,0)))","v":0},62,5,"F","Nível 2","Nível 2","1.10.","SINAPI",null,"ESQUADRIAS METÁLICAS","-",null,1,null,null,null,null,null,""]
["S",2,"S",0,1,10,0,0,{"$f":"IF(AND($C307<=4,$C307<>0),0,IF(AND($C307=\"S\",$Y307>0),OFFSET(I307,-1,0)+1,OFFSET(I307,-1,0)))","v":0},0,0,"F","Serviço","Serviço","1.10.0.1.","AGETOP",180280,"PORTAO TELA/TUBO FoGo PT1/PT2 C/FERRAGENS","m2    ",8,1,null,null,null,null,null,""]
["S",2,"S",0,1,10,0,0,{"$f":"IF(AND($C308<=4,$C308<>0),0,IF(AND($C308=\"S\",$Y308>0),OFFSET(I308,-1,0)+1,OFFSET(I308,-1,0)))","v":0},0,0,"F","Serviço","Serviço","1.10.0.2.","AGETOP",180304,"PORTAO DE ABRIR CHAPA 14  PT-4 C/FERRAGENS","m2    ",3,1,null,null,null,null,null,""]
["S",2,"S",0,1,10,0,0,{"$f":"IF(AND($C309<=4,$C309<>0),0,IF(AND($C309=\"S\",$Y309>0),OFFSET(I309,-1,0)+1,OFFSET(I309,-1,0)))","v":0},0,0,"F","Serviço","Serviço","1.10.0.3.","AGETOP",180323,"GRELHA PADRÃO AGETOP DE FERRO CHATO COM BERÇO (ESPAÇAMENTO ENTRE FACES = 1,5CM - NBR 9050 ACESSIBILIDADE)","m2    ",153.67000000000002,1,null,null,null,null,null,""]
["S",2,"S",0,1,10,0,0,{"$f":"IF(AND($C310<=4,$C310<>0),0,IF(AND($C310=\"S\",$Y310>0),OFFSET(I310,-1,0)+1,OFFSET(I310,-1,0)))","v":0},0,0,"F","Serviço","Serviço","1.10.0.4.","AGETOP",180501,"PORTA DE ABRIR EM CHAPA PF-1 C/FERRAGENS","m2    ",1.6800000000000002,1,null,null,null,null,null,""]
[2,2,2,7,1,11,0,0,{"$f":"IF(AND($C311<=4,$C311<>0),0,IF(AND($C311=\"S\",$Y311>0),OFFSET(I311,-1,0)+1,OFFSET(I311,-1,0)))","v":0},57,7,"F","Nível 2","Nível 2","1.11.","SINAPI",null,"REVESTIMENTO DE PAREDE","-",null,1,null,null,null,null,null,""]
[3,3,3,3,1,11,1,0,{"$f":"IF(AND($C312<=4,$C312<>0),0,IF(AND($C312=\"S\",$Y312>0),OFFSET(I312,-1,0)+1,OFFSET(I312,-1,0)))","v":0},6,3,"F","Nível 3","Nível 3","1.11.1.","SINAPI",null,"MURO","-",null,1,null,null,null,null,null,""]
["S",3,"S",0,1,11,1,0,{"$f":"IF(AND($C313<=4,$C313<>0),0,IF(AND($C313=\"S\",$Y313>0),OFFSET(I313,-1,0)+1,OFFSET(I313,-1,0)))","v":0},0,0,"F","Serviço","Serviço","1.11.1.1.","AGETOP",200101,"CHAPISCO COMUM","m2    ",1297.21,1,null,null,null,null,null,""]
["S",3,"S",0,1,11,1,0,{"$f":"IF(AND($C314<=4,$C314<>0),0,IF(AND($C314=\"S\",$Y314>0),OFFSET(I314,-1,0)+1,OFFSET(I314,-1,0)))","v":0},0,0,"F","Serviço","Serviço","1.11.1.2.","AGETOP",200499,"REBOCO PAULISTA A-14 (1CALH:4ARMLC+100kgCI/M3)","m2    ",1297.21,1,null,null,null,null,null,""]
[3,3,3,3,1,11,2,0,{"$f":"IF(AND($C315<=4,$C315<>0),0,IF(AND($C315=\"S\",$Y315>0),OFFSET(I315,-1,0)+1,OFFSET(I315,-1,0)))","v":0},3,8,"F","Nível 3","Nível 3","1.11.2.","SINAPI",null,"MURETA","-",null,1,null,null,null,null,null,""]
["S",3,"S",0,1,11,2,0,{"$f":"IF(AND($C316<=4,$C316<>0),0,IF(AND($C316=\"S\",$Y316>0),OFFSET(I316,-1,0)+1,OFFSET(I316,-1,0)))","v":0},0,0,"F","Serviço","Serviço","1.11.2.1.","AGETOP",200101,"CHAPISCO COMUM","m2    ",109.12,1,null,null,null,null,null,""]
["S",3,"S",0,1,11,2,0,{"$f":"IF(AND($C317<=4,$C317<>0),0,IF(AND($C317=\"S\",$Y317>0),OFFSET(I317,-1,0)+1,OFFSET(I317,-1,0)))","v":0},0,0,"F","Serviço","Serviço","1.11.2.2.","AGETOP",200499,"REBOCO PAULISTA A-14 (1CALH:4ARMLC+100kgCI/M3)","m2    ",109.12,1,null,null,null,null,null,""]
[2,2,2,13,1,12,0,0,{"$f":"IF(AND($C318<=4,$C318<>0),0,IF(AND($C318=\"S\",$Y318>0),OFFSET(I318,-1,0)+1,OFFSET(I318,-1,0)))","v":0},50,13,"F","Nível 2","Nível 2","1.12.","SINAPI",null,"REVESTIMENTO DE PISO","-",null,1,null,null,null,null,null,""]
[3,3,3,2,1,12,1,0,{"$f":"IF(AND($C319<=4,$C319<>0),0,IF(AND($C319=\"S\",$Y319>0),OFFSET(I319,-1,0)+1,OFFSET(I319,-1,0)))","v":0},12,2,"F","Nível 3","Nível 3","1.12.1.","SINAPI",null,"CALÇADA","-",null,1,null,null,null,null,null,""]
["S",3,"S",0,1,12,1,0,{"$f":"IF(AND($C320<=4,$C320<>0),0,IF(AND($C320=\"S\",$Y320>0),OFFSET(I320,-1,0)+1,OFFSET(I320,-1,0)))","v":0},0,0,"F","Serviço","Serviço","1.12.1.1.","AGETOP",220102,"PISO CONCRETO DESEMPENADO ESPESSURA = 5 CM  1:2,5:3,5","m2    ",429.04,1,null,null,null,null,null,""]
[3,3,3,2,1,12,2,0,{"$f":"IF(AND($C321<=4,$C321<>0),0,IF(AND($C321=\"S\",$Y321>0),OFFSET(I321,-1,0)+1,OFFSET(I321,-1,0)))","v":0},10,2,"F","Nível 3","Nível 3","1.12.2.","AGETOP",null,"VEÍCULOS","-",null,1,null,null,null,null,null,""]
["S",3,"S",0,1,12,2,0,{"$f":"IF(AND($C322<=4,$C322<>0),0,IF(AND($C322=\"S\",$Y322>0),OFFSET(I322,-1,0)+1,OFFSET(I322,-1,0)))","v":0},0,0,"F","Serviço","Serviço","1.12.2.1.","AGETOP",220104,"PISO EM CONCRETO DESEMPENADO ESPESSURA = 7 CM  1:2,5:3,5","m2    ",244.13,1,null,null,null,null,null,""]
[3,3,3,2,1,12,3,0,{"$f":"IF(AND($C323<=4,$C323<>0),0,IF(AND($C323=\"S\",$Y323>0),OFFSET(I323,-1,0)+1,OFFSET(I323,-1,0)))","v":0},8,2,"F","Nível 3","Nível 3","1.12.3.","AGETOP",null,"ÁREAS LIVRES","-",null,1,null,null,null,null,null,""]
["S",{"$f":"IF(OR(C324=\"s\",C324=0),OFFSET(B324,-1,0),C324)","v":3},{"$f":"IF(OFFSET(C324,-1,0)=\"L\",1,IF(OFFSET(C324,-1,0)=1,2,IF(OR(A324=\"s\",A324=0),\"S\",IF(AND(OFFSET(C324,-1,0)=2,A324=4),3,IF(AND(OR(OFFSET(C324,-1,0)=\"s\",OFFSET(C324,-1,0)=0),A324<>\"s\",A324>OFFSET(B324,-1,0)),OFFSET(B324,-1,0),A324)))))","v":"S"},{"$f":"IF(OR(C324=\"S\",C324=0),0,IF(ISERROR(K324),J324,SMALL(J324:K324,1)))","v":0},{"$f":"IF($C324=1,OFFSET(E324,-1,0)+1,OFFSET(E324,-1,0))","v":1},{"$f":"IF($C324=1,0,IF($C324=2,OFFSET(F324,-1,0)+1,OFFSET(F324,-1,0)))","v":12},{"$f":"IF(AND($C324<=2,$C324<>0),0,IF($C324=3,OFFSET(G324,-1,0)+1,OFFSET(G324,-1,0)))","v":3},{"$f":"IF(AND($C324<=3,$C324<>0),0,IF($C324=4,OFFSET(H324,-1,0)+1,OFFSET(H324,-1,0)))","v":0},{"$f":"IF(AND($C324<=4,$C324<>0),0,IF(AND($C324=\"S\",$Y324>0),OFFSET(I324,-1,0)+1,OFFSET(I324,-1,0)))","v":0},0,0,"F","Serviço","Serviço","1.12.3.1.","AGETOP",220102,"PISO CONCRETO DESEMPENADO ESPESSURA = 5 CM  1:2,5:3,5","m2    ",221.76,1,null,null,null,null,null,""]
[3,3,3,2,1,12,4,0,{"$f":"IF(AND($C325<=4,$C325<>0),0,IF(AND($C325=\"S\",$Y325>0),OFFSET(I325,-1,0)+1,OFFSET(I325,-1,0)))","v":0},6,2,"F","Nível 3","Nível 3","1.12.4.","SINAPI",null,"MEIO-FIO","-",null,1,null,null,null,null,null,""]
["S",3,"S",0,1,12,4,0,{"$f":"IF(AND($C326<=4,$C326<>0),0,IF(AND($C326=\"S\",$Y326>0),OFFSET(I326,-1,0)+1,OFFSET(I326,-1,0)))","v":0},0,0,"F","Serviço","Serviço","1.12.4.1.","AGETOP",271712,"MEIO FIO PD. AGETOP EM CONC. PRÉ MOLD. RETO/CURVO (9v12X25X100CM), C/ SARJETA ( 13X10v12CM)FC28=30MPA COM ARGAM.(1CI:3ARMLC) P/ARREMATE DO REJUNT. - INCLUSO ESCAV./APILOAM./REATERRO E CONC.FC28= 10MPA P/ ASSENTAM. E CHUMBAMENTO ","m     ",192.89,1,null,null,null,null,null,""]
[3,3,3,4,1,12,5,0,{"$f":"IF(AND($C327<=4,$C327<>0),0,IF(AND($C327=\"S\",$Y327>0),OFFSET(I327,-1,0)+1,OFFSET(I327,-1,0)))","v":0},4,25,"F","Nível 3","Nível 3","1.12.5.","SINAPI",null,"ACESSIBILIDADE","-",null,1,null,null,null,null,null,""]
["S",3,"S",0,1,12,5,0,{"$f":"IF(AND($C328<=4,$C328<>0),0,IF(AND($C328=\"S\",$Y328>0),OFFSET(I328,-1,0)+1,OFFSET(I328,-1,0)))","v":0},0,0,"F","Serviço","Serviço","1.12.5.1.","AGETOP",221120,"PISO DE BORRACHA COLORIDO MODELO TÁTIL ( ALERTA OU DIRECIONAL) INCLUSO CONTRAPISO (1CI:3ARML) C/ E=2CM E NATA DE CIMENTO","m2    ",64.900000000000006,1,null,null,null,null,null,""]
["S",3,"S",0,1,12,5,0,{"$f":"IF(AND($C329<=4,$C329<>0),0,IF(AND($C329=\"S\",$Y329>0),OFFSET(I329,-1,0)+1,OFFSET(I329,-1,0)))","v":0},0,0,"F","Serviço","Serviço","1.12.5.2.","AGETOP",221126,"PISO DE LADRILHO HIDRÁULICO COLORIDO MODELO TÁTIL ( ALERTA OU DIRECIONAL) SEM LASTRO","m2    ",7.86,1,null,null,null,null,null,""]
["S",3,"S",0,1,12,5,0,{"$f":"IF(AND($C330<=4,$C330<>0),0,IF(AND($C330=\"S\",$Y330>0),OFFSET(I330,-1,0)+1,OFFSET(I330,-1,0)))","v":0},0,0,"F","Serviço","Serviço","1.12.5.3.","AGETOP",220102,"PISO CONCRETO DESEMPENADO ESPESSURA = 5 CM  1:2,5:3,5","m2    ",114.68,1,null,null,null,null,null,""]
[2,2,2,2,1,13,0,0,{"$f":"IF(AND($C331<=4,$C331<>0),0,IF(AND($C331=\"S\",$Y331>0),OFFSET(I331,-1,0)+1,OFFSET(I331,-1,0)))","v":0},37,2,"F","Nível 2","Nível 2","1.13.","SINAPI",null,"FERRAGENS","-",null,1,null,null,null,null,null,""]
["S",2,"S",0,1,13,0,0,{"$f":"IF(AND($C332<=4,$C332<>0),0,IF(AND($C332=\"S\",$Y332>0),OFFSET(I332,-1,0)+1,OFFSET(I332,-1,0)))","v":0},0,0,"F","Serviço","Serviço","1.13.0.1.","AGETOP",180318,"GUARDA BICICLETAS","M     ",5,1,null,null,null,null,null,""]
[2,2,2,7,1,14,0,0,{"$f":"IF(AND($C333<=4,$C333<>0),0,IF(AND($C333=\"S\",$Y333>0),OFFSET(I333,-1,0)+1,OFFSET(I333,-1,0)))","v":0},35,7,"F","Nível 2","Nível 2","1.14.","SINAPI",null,"ADMINISTRAÇÃO","-",null,1,null,null,null,null,null,""]
[3,3,3,4,1,14,1,0,{"$f":"IF(AND($C334<=4,$C334<>0),0,IF(AND($C334=\"S\",$Y334>0),OFFSET(I334,-1,0)+1,OFFSET(I334,-1,0)))","v":0},6,4,"F","Nível 3","Nível 3","1.14.1.","AGETOP",null,"MENSALISTAS","-",null,1,null,null,null,null,null,""]
["S",3,"S",0,1,14,1,0,{"$f":"IF(AND($C335<=4,$C335<>0),0,IF(AND($C335=\"S\",$Y335>0),OFFSET(I335,-1,0)+1,OFFSET(I335,-1,0)))","v":0},0,0,"F","Serviço","Serviço","1.14.1.1.","AGETOP",250101,"ENGENHEIRO - (OBRAS CIVIS)","H     ",240,1,null,null,null,null,null,""]
["S",3,"S",0,1,14,1,0,{"$f":"IF(AND($C336<=4,$C336<>0),0,IF(AND($C336=\"S\",$Y336>0),OFFSET(I336,-1,0)+1,OFFSET(I336,-1,0)))","v":0},0,0,"F","Serviço","Serviço","1.14.1.2.","AGETOP",250103,"ENCARREGADO - (OBRAS CIVIS)","H     ",1760,1,null,null,null,null,null,""]
[{"$f":"CHOOSE(1+LOG(1+2*(ORÇAMENTO.Nivel=\"Nível 1\")+4*(ORÇAMENTO.Nivel=\"Nível 2\")+8*(ORÇAMENTO.Nivel=\"Nível 3\")+16*(ORÇAMENTO.Nivel=\"Nível 4\")+32*(ORÇAMENTO.Nivel=\"Serviço\"),2),0,1,2,3,4,\"S\")","v":"S"},{"$f":"IF(OR(C337=\"s\",C337=0),OFFSET(B337,-1,0),C337)","v":3},{"$f":"IF(OFFSET(C337,-1,0)=\"L\",1,IF(OFFSET(C337,-1,0)=1,2,IF(OR(A337=\"s\",A337=0),\"S\",IF(AND(OFFSET(C337,-1,0)=2,A337=4),3,IF(AND(OR(OFFSET(C337,-1,0)=\"s\",OFFSET(C337,-1,0)=0),A337<>\"s\",A337>OFFSET(B337,-1,0)),OFFSET(B337,-1,0),A337)))))","v":"S"},{"$f":"IF(OR(C337=\"S\",C337=0),0,IF(ISERROR(K337),J337,SMALL(J337:K337,1)))","v":0},{"$f":"IF($C337=1,OFFSET(E337,-1,0)+1,OFFSET(E337,-1,0))","v":1},{"$f":"IF($C337=1,0,IF($C337=2,OFFSET(F337,-1,0)+1,OFFSET(F337,-1,0)))","v":14},{"$f":"IF(AND($C337<=2,$C337<>0),0,IF($C337=3,OFFSET(G337,-1,0)+1,OFFSET(G337,-1,0)))","v":1},{"$f":"IF(AND($C337<=3,$C337<>0),0,IF($C337=4,OFFSET(H337,-1,0)+1,OFFSET(H337,-1,0)))","v":0},{"$f":"IF(AND($C337<=4,$C337<>0),0,IF(AND($C337=\"S\",$Y337>0),OFFSET(I337,-1,0)+1,OFFSET(I337,-1,0)))","v":0},0,0,"F","Serviço","Serviço","1.14.1.3.","AGETOP",250110,"VIGIA DE OBRAS - (NOTURNO  E NO SÁBADO/DOMINGO DIURNO) - O.C.","H     ",3520,1,null,null,null,null,null,""]
[3,3,3,2,1,14,2,0,{"$f":"IF(AND($C338<=4,$C338<>0),0,IF(AND($C338=\"S\",$Y338>0),OFFSET(I338,-1,0)+1,OFFSET(I338,-1,0)))","v":0},{"$f":"IF(OR($C338=\"S\",$C338=0),0,MATCH(0,OFFSET($D338,1,$C338,ROW($C$1328)-ROW($C338)),0))","v":2},{"$f":"IF(OR($C338=\"S\",$C338=0),0,MATCH(OFFSET($D338,0,$C338)+1,OFFSET($D338,1,$C338,ROW($C$1328)-ROW($C338)),0))","v":8},"F","Nível 3","Nível 3","1.14.2.","AGETOP",null,"LAUDO DE ESTANQUEIDADE","-",null,1,null,null,null,null,null,""]
["S",3,"S",0,1,14,2,0,{"$f":"IF(AND($C339<=4,$C339<>0),0,IF(AND($C339=\"S\",$Y339>0),OFFSET(I339,-1,0)+1,OFFSET(I339,-1,0)))","v":0},0,0,"F","Serviço","Serviço","1.14.2.1.","AGETOP",250101,"ENGENHEIRO - (OBRAS CIVIS)","H     ",16,1,null,null,null,null,null,""]
[2,2,2,16,1,15,0,0,{"$f":"IF(AND($C340<=4,$C340<>0),0,IF(AND($C340=\"S\",$Y340>0),OFFSET(I340,-1,0)+1,OFFSET(I340,-1,0)))","v":0},28,16,"F","Nível 2","Nível 2","1.15.","SINAPI",null,"PINTURA","-",null,1,null,null,null,null,null,""]
[3,3,3,3,1,15,1,0,{"$f":"IF(AND($C341<=4,$C341<>0),0,IF(AND($C341=\"S\",$Y341>0),OFFSET(I341,-1,0)+1,OFFSET(I341,-1,0)))","v":0},15,3,"F","Nível 3","Nível 3","1.15.1.","SINAPI",null,"MURO","-",null,1,null,null,null,null,null,""]
["S",3,"S",0,1,15,1,0,{"$f":"IF(AND($C342<=4,$C342<>0),0,IF(AND($C342=\"S\",$Y342>0),OFFSET(I342,-1,0)+1,OFFSET(I342,-1,0)))","v":0},0,0,"F","Serviço","Serviço","1.15.1.1.","AGETOP",261000,"PINTURA LATEX ACRILICA 2 DEMAOS C/SELADOR","m2    ",1297.21,1,null,null,null,null,null,""]
["S",3,"S",0,1,15,1,0,{"$f":"IF(AND($C343<=4,$C343<>0),0,IF(AND($C343=\"S\",$Y343>0),OFFSET(I343,-1,0)+1,OFFSET(I343,-1,0)))","v":0},0,0,"F","Serviço","Serviço","1.15.1.2.","AGETOP",261620,"LETREIRO MÉDIO A GRANDE PORTE EM PAREDE FEITO A PINCEL","m2    ",7.2,1,null,null,null,null,null,""]
[3,3,3,2,1,15,2,0,{"$f":"IF(AND($C344<=4,$C344<>0),0,IF(AND($C344=\"S\",$Y344>0),OFFSET(I344,-1,0)+1,OFFSET(I344,-1,0)))","v":0},12,2,"F","Nível 3","Nível 3","1.15.2.","SINAPI",null,"MURETA","-",null,1,null,null,null,null,null,""]
["S",3,"S",0,1,15,2,0,{"$f":"IF(AND($C345<=4,$C345<>0),0,IF(AND($C345=\"S\",$Y345>0),OFFSET(I345,-1,0)+1,OFFSET(I345,-1,0)))","v":0},0,0,"F","Serviço","Serviço","1.15.2.1.","AGETOP",261000,"PINTURA LATEX ACRILICA 2 DEMAOS C/SELADOR","m2    ",109.12,1,null,null,null,null,null,""]
[3,3,3,2,1,15,3,0,{"$f":"IF(AND($C346<=4,$C346<>0),0,IF(AND($C346=\"S\",$Y346>0),OFFSET(I346,-1,0)+1,OFFSET(I346,-1,0)))","v":0},10,2,"F","Nível 3","Nível 3","1.15.3.","SINAPI",null,"PORTÕES","-",null,1,null,null,null,null,null,""]
["S",3,"S",0,1,15,3,0,{"$f":"IF(AND($C347<=4,$C347<>0),0,IF(AND($C347=\"S\",$Y347>0),OFFSET(I347,-1,0)+1,OFFSET(I347,-1,0)))","v":0},0,0,"F","Serviço","Serviço","1.15.3.1.","AGETOP",261602,"PINT.ESMALTE/ESQUAD.FERRO C/FUNDO ANTICOR.","m2    ",22,1,null,null,null,null,null,""]
[3,{"$f":"IF(OR(C348=\"s\",C348=0),OFFSET(B348,-1,0),C348)","v":3},{"$f":"IF(OFFSET(C348,-1,0)=\"L\",1,IF(OFFSET(C348,-1,0)=1,2,IF(OR(A348=\"s\",A348=0),\"S\",IF(AND(OFFSET(C348,-1,0)=2,A348=4),3,IF(AND(OR(OFFSET(C348,-1,0)=\"s\",OFFSET(C348,-1,0)=0),A348<>\"s\",A348>OFFSET(B348,-1,0)),OFFSET(B348,-1,0),A348)))))","v":3},{"$f":"IF(OR(C348=\"S\",C348=0),0,IF(ISERROR(K348),J348,SMALL(J348:K348,1)))","v":2},{"$f":"IF($C348=1,OFFSET(E348,-1,0)+1,OFFSET(E348,-1,0))","v":1},{"$f":"IF($C348=1,0,IF($C348=2,OFFSET(F348,-1,0)+1,OFFSET(F348,-1,0)))","v":15},{"$f":"IF(AND($C348<=2,$C348<>0),0,IF($C348=3,OFFSET(G348,-1,0)+1,OFFSET(G348,-1,0)))","v":4},{"$f":"IF(AND($C348<=3,$C348<>0),0,IF($C348=4,OFFSET(H348,-1,0)+1,OFFSET(H348,-1,0)))","v":0},{"$f":"IF(AND($C348<=4,$C348<>0),0,IF(AND($C348=\"S\",$Y348>0),OFFSET(I348,-1,0)+1,OFFSET(I348,-1,0)))","v":0},8,2,"F","Nível 3","Nível 3","1.15.4.","AGETOP",null,"PORTAS","-",null,1,null,null,null,null,null,""]
["S",3,"S",0,1,15,4,0,{"$f":"IF(AND($C349<=4,$C349<>0),0,IF(AND($C349=\"S\",$Y349>0),OFFSET(I349,-1,0)+1,OFFSET(I349,-1,0)))","v":0},0,0,"F","Serviço","Serviço","1.15.4.1.","AGETOP",261602,"PINT.ESMALTE/ESQUAD.FERRO C/FUNDO ANTICOR.","m2    ",3.36,1,null,null,null,null,null,""]
[3,3,3,2,1,15,5,0,{"$f":"IF(AND($C350<=4,$C350<>0),0,IF(AND($C350=\"S\",$Y350>0),OFFSET(I350,-1,0)+1,OFFSET(I350,-1,0)))","v":0},6,2,"F","Nível 3","Nível 3","1.15.5.","AGETOP",null,"GRELHA","-",null,1,null,null,null,null,null,""]
[{"$f":"CHOOSE(1+LOG(1+2*(ORÇAMENTO.Nivel=\"Nível 1\")+4*(ORÇAMENTO.Nivel=\"Nível 2\")+8*(ORÇAMENTO.Nivel=\"Nível 3\")+16*(ORÇAMENTO.Nivel=\"Nível 4\")+32*(ORÇAMENTO.Nivel=\"Serviço\"),2),0,1,2,3,4,\"S\")","v":"S"},3,"S",0,1,15,5,0,{"$f":"IF(AND($C351<=4,$C351<>0),0,IF(AND($C351=\"S\",$Y351>0),OFFSET(I351,-1,0)+1,OFFSET(I351,-1,0)))","v":0},0,0,"F","Serviço","Serviço","1.15.5.1.","AGETOP",261602,"PINT.ESMALTE/ESQUAD.FERRO C/FUNDO ANTICOR.","m2    ",307.33999999999997,1,null,null,null,null,null,""]
[3,3,3,2,1,15,6,0,{"$f":"IF(AND($C352<=4,$C352<>0),0,IF(AND($C352=\"S\",$Y352>0),OFFSET(I352,-1,0)+1,OFFSET(I352,-1,0)))","v":0},4,2,"F","Nível 3","Nível 3","1.15.6.","AGETOP",null,"MEIO-FIO","-",null,1,null,null,null,null,null,""]
["S",3,"S",0,1,15,6,0,{"$f":"IF(AND($C353<=4,$C353<>0),0,IF(AND($C353=\"S\",$Y353>0),OFFSET(I353,-1,0)+1,OFFSET(I353,-1,0)))","v":0},0,0,"F","Serviço","Serviço","1.15.6.1.","SINAPI",83693,"CAIACAO EM MEIO FIO","M2",19.3,1,null,null,null,null,null,""]
[3,3,3,2,1,15,7,0,{"$f":"IF(AND($C354<=4,$C354<>0),0,IF(AND($C354=\"S\",$Y354>0),OFFSET(I354,-1,0)+1,OFFSET(I354,-1,0)))","v":0},2,{"$error":"#N/A"},"F","Nível 3","Nível 3","1.15.7.","AGETOP",null,"SÍMBOLO PNE","-",null,1,null,null,null,null,null,""]
["S",3,"S",0,1,15,7,0,{"$f":"IF(AND($C355<=4,$C355<>0),0,IF(AND($C355=\"S\",$Y355>0),OFFSET(I355,-1,0)+1,OFFSET(I355,-1,0)))","v":0},0,0,"F","Serviço","Serviço","1.15.7.1.","AGETOP",261000,"PINTURA LATEX ACRILICA 2 DEMAOS C/SELADOR","m2    ",2.89,1,null,null,null,null,null,""]
[2,2,2,12,1,16,0,0,{"$f":"IF(AND($C356<=4,$C356<>0),0,IF(AND($C356=\"S\",$Y356>0),OFFSET(I356,-1,0)+1,OFFSET(I356,-1,0)))","v":0},12,236,"F","Nível 2","Nível 2","1.16.","SINAPI",null,"DIVERSOS","-",null,1,null,null,null,null,null,""]
["S",2,"S",0,1,16,0,0,{"$f":"IF(AND($C357<=4,$C357<>0),0,IF(AND($C357=\"S\",$Y357>0),OFFSET(I357,-1,0)+1,OFFSET(I357,-1,0)))","v":0},0,0,"F","Serviço","Serviço","1.16.0.1.","AGETOP",270312,"MURO DE ALVENARIA TIJOLO FURADO 1/2 VEZ ( H=2,50M) COM FUNDAÇÃO - SEM REVESTIMENTOS (PADRÃO AGETOP)","m2    ",682.13,1,null,null,null,null,null,""]
["S",2,"S",0,1,16,0,0,{"$f":"IF(AND($C358<=4,$C358<>0),0,IF(AND($C358=\"S\",$Y358>0),OFFSET(I358,-1,0)+1,OFFSET(I358,-1,0)))","v":0},0,0,"F","Serviço","Serviço","1.16.0.2.","AGETOP",270802,"MASTROS PARA BANDEIRAS EM  FERRO GALVANIZADO (ASSENTADOS/PINTADOS) -  3 UNIDADES","CJ    ",1,1,null,null,null,null,null,""]
["S",2,"S",0,1,16,0,0,{"$f":"IF(AND($C359<=4,$C359<>0),0,IF(AND($C359=\"S\",$Y359>0),OFFSET(I359,-1,0)+1,OFFSET(I359,-1,0)))","v":0},0,0,"F","Serviço","Serviço","1.16.0.3.","AGETOP",270210,"PLANTIO GRAMA ESMERALDA PLACA C/ M.O. IRRIG., ADUBO,TERRA VEGETAL (O.C.) A<11.000,00M2","m2    ",1212.79,1,null,null,null,null,null,""]
["S",2,"S",0,1,16,0,0,{"$f":"IF(AND($C360<=4,$C360<>0),0,IF(AND($C360=\"S\",$Y360>0),OFFSET(I360,-1,0)+1,OFFSET(I360,-1,0)))","v":0},0,0,"F","Serviço","Serviço","1.16.0.4.","AGETOP",271303,"BANCO DE CONCRETO POLIDO BASE EM ALVENARIA REBOCADA E PINTADA - PADRÃO AGETOP 2015","m     ",30,1,null,null,null,null,null,""]
["S",2,"S",0,1,16,0,0,{"$f":"IF(AND($C361<=4,$C361<>0),0,IF(AND($C361=\"S\",$Y361>0),OFFSET(I361,-1,0)+1,OFFSET(I361,-1,0)))","v":0},0,0,"F","Serviço","Serviço","1.16.0.5.","AGETOP",271417,"CANALETA CONCRETO DESEMPENADO 5 CM PD.AGETOP","m     ",242.96,1,null,null,null,null,null,""]
["S",2,"S",0,1,16,0,0,{"$f":"IF(AND($C362<=4,$C362<>0),0,IF(AND($C362=\"S\",$Y362>0),OFFSET(I362,-1,0)+1,OFFSET(I362,-1,0)))","v":0},0,0,"F","Serviço","Serviço","1.16.0.6.","SINAPI",98510,"PLANTIO DE ÁRVORE ORNAMENTAL COM ALTURA DE MUDA MENOR OU IGUAL A 2,00 M. AF_05/2018","UN",8,1,null,null,null,null,null,""]
["S",2,"S",0,1,16,0,0,{"$f":"IF(AND($C363<=4,$C363<>0),0,IF(AND($C363=\"S\",$Y363>0),OFFSET(I363,-1,0)+1,OFFSET(I363,-1,0)))","v":0},0,0,"F","Serviço","Serviço","1.16.0.7.","SINAPI",98511,"PLANTIO DE ÁRVORE ORNAMENTAL COM ALTURA DE MUDA MAIOR QUE 2,00 M E MENOR OU IGUAL A 4,00 M. AF_05/2018","UN",11,1,null,null,null,null,null,""]
["S",2,"S",0,1,16,0,0,{"$f":"IF(AND($C364<=4,$C364<>0),0,IF(AND($C364=\"S\",$Y364>0),OFFSET(I364,-1,0)+1,OFFSET(I364,-1,0)))","v":0},0,0,"F","Serviço","Serviço","1.16.0.8.","COMPOSIÇÃO","COMP 084_SEE","GUARDA-CORPO COM CORRIMÃO - SEDUC","M",128.44999999999999,1,null,null,null,null,null,""]
[{"$f":"CHOOSE(1+LOG(1+2*(ORÇAMENTO.Nivel=\"Nível 1\")+4*(ORÇAMENTO.Nivel=\"Nível 2\")+8*(ORÇAMENTO.Nivel=\"Nível 3\")+16*(ORÇAMENTO.Nivel=\"Nível 4\")+32*(ORÇAMENTO.Nivel=\"Serviço\"),2),0,1,2,3,4,\"S\")","v":"S"},{"$f":"IF(OR(C365=\"s\",C365=0),OFFSET(B365,-1,0),C365)","v":2},{"$f":"IF(OFFSET(C365,-1,0)=\"L\",1,IF(OFFSET(C365,-1,0)=1,2,IF(OR(A365=\"s\",A365=0),\"S\",IF(AND(OFFSET(C365,-1,0)=2,A365=4),3,IF(AND(OR(OFFSET(C365,-1,0)=\"s\",OFFSET(C365,-1,0)=0),A365<>\"s\",A365>OFFSET(B365,-1,0)),OFFSET(B365,-1,0),A365)))))","v":"S"},{"$f":"IF(OR(C365=\"S\",C365=0),0,IF(ISERROR(K365),J365,SMALL(J365:K365,1)))","v":0},{"$f":"IF($C365=1,OFFSET(E365,-1,0)+1,OFFSET(E365,-1,0))","v":1},{"$f":"IF($C365=1,0,IF($C365=2,OFFSET(F365,-1,0)+1,OFFSET(F365,-1,0)))","v":16},{"$f":"IF(AND($C365<=2,$C365<>0),0,IF($C365=3,OFFSET(G365,-1,0)+1,OFFSET(G365,-1,0)))","v":0},{"$f":"IF(AND($C365<=3,$C365<>0),0,IF($C365=4,OFFSET(H365,-1,0)+1,OFFSET(H365,-1,0)))","v":0},{"$f":"IF(AND($C365<=4,$C365<>0),0,IF(AND($C365=\"S\",$Y365>0),OFFSET(I365,-1,0)+1,OFFSET(I365,-1,0)))","v":0},{"$f":"IF(OR($C365=\"S\",$C365=0),0,MATCH(0,OFFSET($D365,1,$C365,ROW($C$1328)-ROW($C365)),0))","v":0},{"$f":"IF(OR($C365=\"S\",$C365=0),0,MATCH(OFFSET($D365,0,$C365)+1,OFFSET($D365,1,$C365,ROW($C$1328)-ROW($C365)),0))","v":0},"F","Serviço","Serviço","1.16.0.9.","AGETOP",270501,"LIMPEZA FINAL DE OBRA - (OBRAS CIVIS)","m2    ",1496.75,1,null,null,null,null,null,""]
["S",2,"S",0,1,16,0,0,{"$f":"IF(AND($C366<=4,$C366<>0),0,IF(AND($C366=\"S\",$Y366>0),OFFSET(I366,-1,0)+1,OFFSET(I366,-1,0)))","v":0},0,0,"F","Serviço","Serviço","1.16.0.10.","AGETOP",271500,"CAFE DA MANHA","RE    ",2640,1,null,null,null,null,null,""]
["S",2,"S",0,1,16,0,0,{"$f":"IF(AND($C367<=4,$C367<>0),0,IF(AND($C367=\"S\",$Y367>0),OFFSET(I367,-1,0)+1,OFFSET(I367,-1,0)))","v":0},0,0,"F","Serviço","Serviço","1.16.0.11.","AGETOP",271502,"CANTINA - (OBRAS CIVIS)","RE    ",2640,1,null,null,null,null,null,""]
[1,1,1,237,2,0,0,0,{"$f":"IF(AND($C368<=4,$C368<>0),0,IF(AND($C368=\"S\",$Y368>0),OFFSET(I368,-1,0)+1,OFFSET(I368,-1,0)))","v":0},{"$f":"IF(OR($C368=\"S\",$C368=0),0,MATCH(0,OFFSET($D368,1,$C368,ROW($C$1328)-ROW($C368)),0))","v":960},{"$f":"IF(OR($C368=\"S\",$C368=0),0,MATCH(OFFSET($D368,0,$C368)+1,OFFSET($D368,1,$C368,ROW($C$1328)-ROW($C368)),0))","v":237},"F","Nível 1","Nível 1","2.","SINAPI",null,"BLOCO ADMINISTRAÇÃO COM CANTINA - PADRÃO LAJE PLANA","UN",1,1,null,null,null,null,null,""]
[2,2,2,2,2,1,0,0,{"$f":"IF(AND($C369<=4,$C369<>0),0,IF(AND($C369=\"S\",$Y369>0),OFFSET(I369,-1,0)+1,OFFSET(I369,-1,0)))","v":0},236,2,"F","Nível 2","Nível 2","2.1.","SINAPI",null,"SERVIÇOS PRELIMINARES","-",null,1,null,null,null,null,null,""]
["S",2,"S",0,2,1,0,0,{"$f":"IF(AND($C370<=4,$C370<>0),0,IF(AND($C370=\"S\",$Y370>0),OFFSET(I370,-1,0)+1,OFFSET(I370,-1,0)))","v":0},0,0,"F","Serviço","Serviço","2.1.0.1.","AGETOP",20701,"LOCAÇÃO DA OBRA, EXECUÇÃO DE GABARITO SEM REAPROVEITAMENTO, INCLUSO PINTURA (FACE INTERNA DO RIPÃO 15CM) E PIQUETE COM TESTEMUNHA","m2    ",167.45,1,null,null,null,null,null,""]
[2,2,2,3,2,2,0,0,{"$f":"IF(AND($C371<=4,$C371<>0),0,IF(AND($C371=\"S\",$Y371>0),OFFSET(I371,-1,0)+1,OFFSET(I371,-1,0)))","v":0},234,3,"F","Nível 2","Nível 2","2.2.","SINAPI",null,"TRANSPORTES","-",null,1,null,null,null,null,null,""]
["S",2,"S",0,2,2,0,0,{"$f":"IF(AND($C372<=4,$C372<>0),0,IF(AND($C372=\"S\",$Y372>0),OFFSET(I372,-1,0)+1,OFFSET(I372,-1,0)))","v":0},0,0,"F","Serviço","Serviço","2.2.0.1.","SINAPI",72897,"CARGA MANUAL DE ENTULHO EM CAMINHAO BASCULANTE 6 M3","M3",12,1,null,null,null,null,null,""]
["S",2,"S",0,2,2,0,0,{"$f":"IF(AND($C373<=4,$C373<>0),0,IF(AND($C373=\"S\",$Y373>0),OFFSET(I373,-1,0)+1,OFFSET(I373,-1,0)))","v":0},0,0,"F","Serviço","Serviço","2.2.0.2.","SINAPI",72900,"TRANSPORTE DE ENTULHO COM CAMINHAO BASCULANTE 6 M3, RODOVIA PAVIMENTADA, DMT 0,5 A 1,0 KM","M3",12,1,null,null,null,null,null,""]
[2,2,2,10,2,3,0,0,{"$f":"IF(AND($C374<=4,$C374<>0),0,IF(AND($C374=\"S\",$Y374>0),OFFSET(I374,-1,0)+1,OFFSET(I374,-1,0)))","v":0},231,10,"F","Nível 2","Nível 2","2.3.","SINAPI",null,"FUNDAÇÕES E SONDAGENS","-",null,1,null,null,null,null,null,""]
[3,3,3,9,2,3,1,0,{"$f":"IF(AND($C375<=4,$C375<>0),0,IF(AND($C375=\"S\",$Y375>0),OFFSET(I375,-1,0)+1,OFFSET(I375,-1,0)))","v":0},9,18,"F","Nível 3","Nível 3","2.3.1.","SINAPI",null,"ESTACAS E BLOCOS","-",null,1,null,null,null,null,null,""]
["S",3,"S",0,2,3,1,0,{"$f":"IF(AND($C376<=4,$C376<>0),0,IF(AND($C376=\"S\",$Y376>0),OFFSET(I376,-1,0)+1,OFFSET(I376,-1,0)))","v":0},{"$f":"IF(OR($C376=\"S\",$C376=0),0,MATCH(0,OFFSET($D376,1,$C376,ROW($C$1328)-ROW($C376)),0))","v":0},{"$f":"IF(OR($C376=\"S\",$C376=0),0,MATCH(OFFSET($D376,0,$C376)+1,OFFSET($D376,1,$C376,ROW($C$1328)-ROW($C376)),0))","v":0},"F","Serviço","Serviço","2.3.1.1.","AGETOP",50302,"ESTACA A TRADO DIAM.30 CM SEM FERRO","M     ",83,1,null,null,null,null,null,""]
["S",3,"S",0,2,3,1,0,{"$f":"IF(AND($C377<=4,$C377<>0),0,IF(AND($C377=\"S\",$Y377>0),OFFSET(I377,-1,0)+1,OFFSET(I377,-1,0)))","v":0},0,0,"F","Serviço","Serviço","2.3.1.2.","AGETOP",50901,"ESCAVACAO MANUAL DE VALAS (SAPATAS/BLOCOS)","m3    ",5.4,1,null,null,null,null,null,""]
["S",3,"S",0,2,3,1,0,{"$f":"IF(AND($C378<=4,$C378<>0),0,IF(AND($C378=\"S\",$Y378>0),OFFSET(I378,-1,0)+1,OFFSET(I378,-1,0)))","v":0},0,0,"F","Serviço","Serviço","2.3.1.3.","SINAPI",94963,"CONCRETO FCK = 15MPA, TRAÇO 1:3,4:3,5 (CIMENTO/ AREIA MÉDIA/ BRITA 1)  - PREPARO MECÂNICO COM BETONEIRA 400 L. AF_07/2016","M3",3.96,1,null,null,null,null,null,""]
["S",3,"S",0,2,3,1,0,{"$f":"IF(AND($C379<=4,$C379<>0),0,IF(AND($C379=\"S\",$Y379>0),OFFSET(I379,-1,0)+1,OFFSET(I379,-1,0)))","v":0},0,0,"F","Serviço","Serviço","2.3.1.4.","AGETOP",51026,"LANÇAMENTO/APLICAÇÃO/ADENSAMENTO DE CONCRETO EM FUNDAÇÃO- (O.C.)","m3    ",3.96,1,null,null,null,null,null,""]
["S",3,"S",0,2,3,1,0,{"$f":"IF(AND($C380<=4,$C380<>0),0,IF(AND($C380=\"S\",$Y380>0),OFFSET(I380,-1,0)+1,OFFSET(I380,-1,0)))","v":0},0,0,"F","Serviço","Serviço","2.3.1.5.","AGETOP",52014,"ACO CA-60 - 5,0 MM - (OBRAS CIVIS)","Kg    ",3.3636363636363633,1,null,null,null,null,null,""]
["S",3,"S",0,2,3,1,0,{"$f":"IF(AND($C381<=4,$C381<>0),0,IF(AND($C381=\"S\",$Y381>0),OFFSET(I381,-1,0)+1,OFFSET(I381,-1,0)))","v":0},0,0,"F","Serviço","Serviço","2.3.1.6.","AGETOP",52003,"ACO CA-50A - 6,3 MM (1/4\") - (OBRAS CIVIS)","Kg    ",68.818181818181813,1,null,null,null,null,null,""]
["S",3,"S",0,2,3,1,0,{"$f":"IF(AND($C382<=4,$C382<>0),0,IF(AND($C382=\"S\",$Y382>0),OFFSET(I382,-1,0)+1,OFFSET(I382,-1,0)))","v":0},0,0,"F","Serviço","Serviço","2.3.1.7.","AGETOP",52004,"ACO CA 50-A - 8,0 MM (5/16\") - (OBRAS CIVIS)","Kg    ",152.09090909090907,1,null,null,null,null,null,""]
["S",3,"S",0,2,3,1,0,{"$f":"IF(AND($C383<=4,$C383<>0),0,IF(AND($C383=\"S\",$Y383>0),OFFSET(I383,-1,0)+1,OFFSET(I383,-1,0)))","v":0},0,0,"F","Serviço","Serviço","2.3.1.8.","AGETOP",52006,"ACO CA 50-A - 12,5 MM (1/2\") - (OBRAS CIVIS)","Kg    ",315,1,null,null,null,null,null,""]
[2,2,2,29,2,4,0,0,{"$f":"IF(AND($C384<=4,$C384<>0),0,IF(AND($C384=\"S\",$Y384>0),OFFSET(I384,-1,0)+1,OFFSET(I384,-1,0)))","v":0},221,29,"F","Nível 2","Nível 2","2.4.","SINAPI",null,"ESTRUTURA","-",null,1,null,null,null,null,null,""]
[3,3,3,8,2,4,1,0,{"$f":"IF(AND($C385<=4,$C385<>0),0,IF(AND($C385=\"S\",$Y385>0),OFFSET(I385,-1,0)+1,OFFSET(I385,-1,0)))","v":0},28,8,"F","Nível 3","Nível 3","2.4.1.","SINAPI",null,"VIGAS BALDRAMES","-",null,1,null,null,null,null,null,""]
["S",3,"S",0,2,4,1,0,{"$f":"IF(AND($C386<=4,$C386<>0),0,IF(AND($C386=\"S\",$Y386>0),OFFSET(I386,-1,0)+1,OFFSET(I386,-1,0)))","v":0},0,0,"F","Serviço","Serviço","2.4.1.1.","AGETOP",40101,"ESCAVACAO MANUAL DE VALAS < 1 MTS. (OBRAS CIVIS)","m3    ",10.5,1,null,null,null,null,null,""]
["S",3,"S",0,2,4,1,0,{"$f":"IF(AND($C387<=4,$C387<>0),0,IF(AND($C387=\"S\",$Y387>0),OFFSET(I387,-1,0)+1,OFFSET(I387,-1,0)))","v":0},0,0,"F","Serviço","Serviço","2.4.1.2.","AGETOP",50903,"REATERRO C/APILOAMENTO (BLOCOS/SAPATAS)","m3    ",5.32,1,null,null,null,null,null,""]
["S",3,"S",0,2,4,1,0,{"$f":"IF(AND($C388<=4,$C388<>0),0,IF(AND($C388=\"S\",$Y388>0),OFFSET(I388,-1,0)+1,OFFSET(I388,-1,0)))","v":0},0,0,"F","Serviço","Serviço","2.4.1.3.","AGETOP",60191,"FORMA DE TABUA CINTA BALDRAME U=8 VEZES","m2    ",86.44,1,null,null,null,null,null,""]
["S",3,"S",0,2,4,1,0,{"$f":"IF(AND($C389<=4,$C389<>0),0,IF(AND($C389=\"S\",$Y389>0),OFFSET(I389,-1,0)+1,OFFSET(I389,-1,0)))","v":0},0,0,"F","Serviço","Serviço","2.4.1.4.","SINAPI",94965,"CONCRETO FCK = 25MPA, TRAÇO 1:2,3:2,7 (CIMENTO/ AREIA MÉDIA/ BRITA 1)  - PREPARO MECÂNICO COM BETONEIRA 400 L. AF_07/2016","M3",5.18,1,null,null,null,null,null,""]
["S",3,"S",0,2,4,1,0,{"$f":"IF(AND($C390<=4,$C390<>0),0,IF(AND($C390=\"S\",$Y390>0),OFFSET(I390,-1,0)+1,OFFSET(I390,-1,0)))","v":0},0,0,"F","Serviço","Serviço","2.4.1.5.","AGETOP",51055,"LANÇAMENTO/APLICAÇÃO/ADENSAMENTO MANUAL DE CONCRETO - (O.C.)","m3    ",5.18,1,null,null,null,null,null,""]
["S",3,"S",0,2,4,1,0,{"$f":"IF(AND($C391<=4,$C391<>0),0,IF(AND($C391=\"S\",$Y391>0),OFFSET(I391,-1,0)+1,OFFSET(I391,-1,0)))","v":0},0,0,"F","Serviço","Serviço","2.4.1.6.","AGETOP",52003,"ACO CA-50A - 6,3 MM (1/4\") - (OBRAS CIVIS)","Kg    ",139.54545454545453,1,null,null,null,null,null,""]
["S",3,"S",0,2,4,1,0,{"$f":"IF(AND($C392<=4,$C392<>0),0,IF(AND($C392=\"S\",$Y392>0),OFFSET(I392,-1,0)+1,OFFSET(I392,-1,0)))","v":0},{"$f":"IF(OR($C392=\"S\",$C392=0),0,MATCH(0,OFFSET($D392,1,$C392,ROW($C$1328)-ROW($C392)),0))","v":0},{"$f":"IF(OR($C392=\"S\",$C392=0),0,MATCH(OFFSET($D392,0,$C392)+1,OFFSET($D392,1,$C392,ROW($C$1328)-ROW($C392)),0))","v":0},"F","Serviço","Serviço","2.4.1.7.","AGETOP",52005,"ACO CA-50A - 10,0 MM (3/8\") - (OBRAS CIVIS)","Kg    ",288.81818181818176,1,null,null,null,null,null,""]
[3,3,3,6,2,4,2,0,{"$f":"IF(AND($C393<=4,$C393<>0),0,IF(AND($C393=\"S\",$Y393>0),OFFSET(I393,-1,0)+1,OFFSET(I393,-1,0)))","v":0},20,6,"F","Nível 3","Nível 3","2.4.2.","SINAPI",null,"PILARES","-",null,1,null,null,null,null,null,""]
[{"$f":"CHOOSE(1+LOG(1+2*(ORÇAMENTO.Nivel=\"Nível 1\")+4*(ORÇAMENTO.Nivel=\"Nível 2\")+8*(ORÇAMENTO.Nivel=\"Nível 3\")+16*(ORÇAMENTO.Nivel=\"Nível 4\")+32*(ORÇAMENTO.Nivel=\"Serviço\"),2),0,1,2,3,4,\"S\")","v":"S"},{"$f":"IF(OR(C394=\"s\",C394=0),OFFSET(B394,-1,0),C394)","v":3},{"$f":"IF(OFFSET(C394,-1,0)=\"L\",1,IF(OFFSET(C394,-1,0)=1,2,IF(OR(A394=\"s\",A394=0),\"S\",IF(AND(OFFSET(C394,-1,0)=2,A394=4),3,IF(AND(OR(OFFSET(C394,-1,0)=\"s\",OFFSET(C394,-1,0)=0),A394<>\"s\",A394>OFFSET(B394,-1,0)),OFFSET(B394,-1,0),A394)))))","v":"S"},{"$f":"IF(OR(C394=\"S\",C394=0),0,IF(ISERROR(K394),J394,SMALL(J394:K394,1)))","v":0},{"$f":"IF($C394=1,OFFSET(E394,-1,0)+1,OFFSET(E394,-1,0))","v":2},{"$f":"IF($C394=1,0,IF($C394=2,OFFSET(F394,-1,0)+1,OFFSET(F394,-1,0)))","v":4},{"$f":"IF(AND($C394<=2,$C394<>0),0,IF($C394=3,OFFSET(G394,-1,0)+1,OFFSET(G394,-1,0)))","v":2},{"$f":"IF(AND($C394<=3,$C394<>0),0,IF($C394=4,OFFSET(H394,-1,0)+1,OFFSET(H394,-1,0)))","v":0},{"$f":"IF(AND($C394<=4,$C394<>0),0,IF(AND($C394=\"S\",$Y394>0),OFFSET(I394,-1,0)+1,OFFSET(I394,-1,0)))","v":0},0,0,"F","Serviço","Serviço","2.4.2.1.","SINAPI",92426,"MONTAGEM E DESMONTAGEM DE FÔRMA DE PILARES RETANGULARES E ESTRUTURAS SIMILARES COM ÁREA MÉDIA DAS SEÇÕES MENOR OU IGUAL A 0,25 M², PÉ-DIREITO SIMPLES, EM CHAPA DE MADEIRA COMPENSADA RESINADA, 8 UTILIZAÇÕES. AF_12/2015","M2",80.02,1,null,null,null,null,null,""]
["S",3,"S",0,2,4,2,0,{"$f":"IF(AND($C395<=4,$C395<>0),0,IF(AND($C395=\"S\",$Y395>0),OFFSET(I395,-1,0)+1,OFFSET(I395,-1,0)))","v":0},0,0,"F","Serviço","Serviço","2.4.2.2.","SINAPI",94965,"CONCRETO FCK = 25MPA, TRAÇO 1:2,3:2,7 (CIMENTO/ AREIA MÉDIA/ BRITA 1)  - PREPARO MECÂNICO COM BETONEIRA 400 L. AF_07/2016","M3",3.99,1,null,null,null,null,null,""]
["S",3,"S",0,2,4,2,0,{"$f":"IF(AND($C396<=4,$C396<>0),0,IF(AND($C396=\"S\",$Y396>0),OFFSET(I396,-1,0)+1,OFFSET(I396,-1,0)))","v":0},0,0,"F","Serviço","Serviço","2.4.2.3.","AGETOP",51055,"LANÇAMENTO/APLICAÇÃO/ADENSAMENTO MANUAL DE CONCRETO - (O.C.)","m3    ",3.99,1,null,null,null,null,null,""]
["S",3,"S",0,2,4,2,0,{"$f":"IF(AND($C397<=4,$C397<>0),0,IF(AND($C397=\"S\",$Y397>0),OFFSET(I397,-1,0)+1,OFFSET(I397,-1,0)))","v":0},0,0,"F","Serviço","Serviço","2.4.2.4.","AGETOP",60303,"ACO CA-50-A - 6,3 MM (1/4\") - (OBRAS CIVIS)","Kg    ",124.99999999999999,1,null,null,null,null,null,""]
["S",3,"S",0,2,4,2,0,{"$f":"IF(AND($C398<=4,$C398<>0),0,IF(AND($C398=\"S\",$Y398>0),OFFSET(I398,-1,0)+1,OFFSET(I398,-1,0)))","v":0},0,0,"F","Serviço","Serviço","2.4.2.5.","AGETOP",60306,"ACO CA-50A - 12,5 MM (1/2\") - (OBRAS CIVIS)","Kg    ",444.36363636363632,1,null,null,null,null,null,""]
[3,3,3,6,2,4,3,0,{"$f":"IF(AND($C399<=4,$C399<>0),0,IF(AND($C399=\"S\",$Y399>0),OFFSET(I399,-1,0)+1,OFFSET(I399,-1,0)))","v":0},14,6,"F","Nível 3","Nível 3","2.4.3.","SINAPI",null,"VIGAS DE COBERTURA","-",null,1,null,null,null,null,null,""]
["S",3,"S",0,2,4,3,0,{"$f":"IF(AND($C400<=4,$C400<>0),0,IF(AND($C400=\"S\",$Y400>0),OFFSET(I400,-1,0)+1,OFFSET(I400,-1,0)))","v":0},0,0,"F","Serviço","Serviço","2.4.3.1.","AGETOP",60204,"FORMA - CH.COMPENSADA 17MM PLAST REAP 4 V.-(OBRAS CIVIS)","m2    ",94.14,1,null,null,null,null,null,""]
["S",3,"S",0,2,4,3,0,{"$f":"IF(AND($C401<=4,$C401<>0),0,IF(AND($C401=\"S\",$Y401>0),OFFSET(I401,-1,0)+1,OFFSET(I401,-1,0)))","v":0},0,0,"F","Serviço","Serviço","2.4.3.2.","SINAPI",94965,"CONCRETO FCK = 25MPA, TRAÇO 1:2,3:2,7 (CIMENTO/ AREIA MÉDIA/ BRITA 1)  - PREPARO MECÂNICO COM BETONEIRA 400 L. AF_07/2016","M3",5.7700000000000005,1,null,null,null,null,null,""]
["S",3,"S",0,2,4,3,0,{"$f":"IF(AND($C402<=4,$C402<>0),0,IF(AND($C402=\"S\",$Y402>0),OFFSET(I402,-1,0)+1,OFFSET(I402,-1,0)))","v":0},0,0,"F","Serviço","Serviço","2.4.3.3.","AGETOP",51055,"LANÇAMENTO/APLICAÇÃO/ADENSAMENTO MANUAL DE CONCRETO - (O.C.)","m3    ",5.7700000000000005,1,null,null,null,null,null,""]
["S",3,"S",0,2,4,3,0,{"$f":"IF(AND($C403<=4,$C403<>0),0,IF(AND($C403=\"S\",$Y403>0),OFFSET(I403,-1,0)+1,OFFSET(I403,-1,0)))","v":0},0,0,"F","Serviço","Serviço","2.4.3.4.","AGETOP",60303,"ACO CA-50-A - 6,3 MM (1/4\") - (OBRAS CIVIS)","Kg    ",145.18181818181816,1,null,null,null,null,null,""]
["S",3,"S",0,2,4,3,0,{"$f":"IF(AND($C404<=4,$C404<>0),0,IF(AND($C404=\"S\",$Y404>0),OFFSET(I404,-1,0)+1,OFFSET(I404,-1,0)))","v":0},0,0,"F","Serviço","Serviço","2.4.3.5.","AGETOP",60305,"ACO CA-50A - 10,0 MM (3/8\") - (OBRAS CIVIS)","Kg    ",278.90909090909088,1,null,null,null,null,null,""]
[3,3,3,6,2,4,4,0,{"$f":"IF(AND($C405<=4,$C405<>0),0,IF(AND($C405=\"S\",$Y405>0),OFFSET(I405,-1,0)+1,OFFSET(I405,-1,0)))","v":0},8,6,"F","Nível 3","Nível 3","2.4.4.","SINAPI",null,"LAJE","-",null,1,null,null,null,null,null,""]
["S",3,"S",0,2,4,4,0,{"$f":"IF(AND($C406<=4,$C406<>0),0,IF(AND($C406=\"S\",$Y406>0),OFFSET(I406,-1,0)+1,OFFSET(I406,-1,0)))","v":0},0,0,"F","Serviço","Serviço","2.4.4.1.","SINAPI",92525,"MONTAGEM E DESMONTAGEM DE FÔRMA DE LAJE MACIÇA COM ÁREA MÉDIA MENOR OU IGUAL A 20 M², PÉ-DIREITO SIMPLES, EM CHAPA DE MADEIRA COMPENSADA PLASTIFICADA, 10 UTILIZAÇÕES. AF_12/2015","M2",98.94,1,null,null,null,null,null,""]
["S",3,"S",0,2,4,4,0,{"$f":"IF(AND($C407<=4,$C407<>0),0,IF(AND($C407=\"S\",$Y407>0),OFFSET(I407,-1,0)+1,OFFSET(I407,-1,0)))","v":0},0,0,"F","Serviço","Serviço","2.4.4.2.","SINAPI",94965,"CONCRETO FCK = 25MPA, TRAÇO 1:2,3:2,7 (CIMENTO/ AREIA MÉDIA/ BRITA 1)  - PREPARO MECÂNICO COM BETONEIRA 400 L. AF_07/2016","M3",9.8940000000000001,1,null,null,null,null,null,""]
["S",3,"S",0,2,4,4,0,{"$f":"IF(AND($C408<=4,$C408<>0),0,IF(AND($C408=\"S\",$Y408>0),OFFSET(I408,-1,0)+1,OFFSET(I408,-1,0)))","v":0},0,0,"F","Serviço","Serviço","2.4.4.3.","AGETOP",60314,"ACO CA - 60 - 5,0 MM - (OBRAS CIVIS)","Kg    ",115.54545454545453,1,null,null,null,null,null,""]
["S",3,"S",0,2,4,4,0,{"$f":"IF(AND($C409<=4,$C409<>0),0,IF(AND($C409=\"S\",$Y409>0),OFFSET(I409,-1,0)+1,OFFSET(I409,-1,0)))","v":0},0,0,"F","Serviço","Serviço","2.4.4.4.","AGETOP",60304,"ACO CA-50 A - 8,0 MM (5/16\") - (OBRAS CIVIS)","Kg    ",74.636363636363626,1,null,null,null,null,null,""]
["S",3,"S",0,2,4,4,0,{"$f":"IF(AND($C410<=4,$C410<>0),0,IF(AND($C410=\"S\",$Y410>0),OFFSET(I410,-1,0)+1,OFFSET(I410,-1,0)))","v":0},0,0,"F","Serviço","Serviço","2.4.4.5.","AGETOP",60306,"ACO CA-50A - 12,5 MM (1/2\") - (OBRAS CIVIS)","Kg    ",424.27272727272725,1,null,null,null,null,null,""]
[3,3,3,2,2,4,5,0,{"$f":"IF(AND($C411<=4,$C411<>0),0,IF(AND($C411=\"S\",$Y411>0),OFFSET(I411,-1,0)+1,OFFSET(I411,-1,0)))","v":0},2,{"$error":"#N/A"},"F","Nível 3","Nível 3","2.4.5.","SINAPI",null,"OUTROS","-",null,1,null,null,null,null,null,""]
["S",3,"S",0,2,4,5,0,{"$f":"IF(AND($C412<=4,$C412<>0),0,IF(AND($C412=\"S\",$Y412>0),OFFSET(I412,-1,0)+1,OFFSET(I412,-1,0)))","v":0},0,0,"F","Serviço","Serviço","2.4.5.1.","AGETOP",50251,"CORPO DE PROVA","Un    ",6,1,null,null,null,null,null,""]
[2,2,2,60,2,5,0,0,{"$f":"IF(AND($C413<=4,$C413<>0),0,IF(AND($C413=\"S\",$Y413>0),OFFSET(I413,-1,0)+1,OFFSET(I413,-1,0)))","v":0},192,60,"F","Nível 2","Nível 2","2.5.","SINAPI",null,"INSTALAÇÕES ELÉTRICAS","-",null,1,null,null,null,null,null,""]
[3,3,3,7,2,5,1,0,{"$f":"IF(AND($C414<=4,$C414<>0),0,IF(AND($C414=\"S\",$Y414>0),OFFSET(I414,-1,0)+1,OFFSET(I414,-1,0)))","v":0},59,7,"F","Nível 3","Nível 3","2.5.1.","SINAPI",null,"QUADRO DE DISTRIBUIÇÃO","-",null,1,null,null,null,null,null,""]
["S",3,"S",0,2,5,1,0,{"$f":"IF(AND($C415<=4,$C415<>0),0,IF(AND($C415=\"S\",$Y415>0),OFFSET(I415,-1,0)+1,OFFSET(I415,-1,0)))","v":0},0,0,"F","Serviço","Serviço","2.5.1.1.","SINAPI","74131/5","QUADRO DE DISTRIBUICAO DE ENERGIA DE EMBUTIR, EM CHAPA METALICA, PARA 24 DISJUNTORES TERMOMAGNETICOS MONOPOLARES, COM BARRAMENTO TRIFASICO E NEUTRO, FORNECIMENTO E INSTALACAO","UN",1,1,null,null,null,null,null,""]
["S",3,"S",0,2,5,1,0,{"$f":"IF(AND($C416<=4,$C416<>0),0,IF(AND($C416=\"S\",$Y416>0),OFFSET(I416,-1,0)+1,OFFSET(I416,-1,0)))","v":0},0,0,"F","Serviço","Serviço","2.5.1.2.","SINAPI","74130/5","DISJUNTOR TERMOMAGNETICO TRIPOLAR PADRAO NEMA (AMERICANO) 60 A 100A 240V, FORNECIMENTO E INSTALACAO","UN",1,1,null,null,null,null,null,""]
["S",3,"S",0,2,5,1,0,{"$f":"IF(AND($C417<=4,$C417<>0),0,IF(AND($C417=\"S\",$Y417>0),OFFSET(I417,-1,0)+1,OFFSET(I417,-1,0)))","v":0},0,0,"F","Serviço","Serviço","2.5.1.3.","AGETOP",71171,"DISJUNTOR MONOPOLAR DE 10 A 32-A","Un    ",16,1,null,null,null,null,null,""]
["S",3,"S",0,2,5,1,0,{"$f":"IF(AND($C418<=4,$C418<>0),0,IF(AND($C418=\"S\",$Y418>0),OFFSET(I418,-1,0)+1,OFFSET(I418,-1,0)))","v":0},0,0,"F","Serviço","Serviço","2.5.1.4.","AGETOP",71172,"DISJUNTOR MONOPOLAR DE 35 A 50-A","Un    ",1,1,null,null,null,null,null,""]
["S",3,"S",0,2,5,1,0,{"$f":"IF(AND($C419<=4,$C419<>0),0,IF(AND($C419=\"S\",$Y419>0),OFFSET(I419,-1,0)+1,OFFSET(I419,-1,0)))","v":0},0,0,"F","Serviço","Serviço","2.5.1.5.","AGETOP",71450,"INTERRUPTOR DIFERENCIAL RESIDUAL (D.R.) BIPOLAR DE 25A-30mA","Un    ",3,1,null,null,null,null,null,""]
["S",3,"S",0,2,5,1,0,{"$f":"IF(AND($C420<=4,$C420<>0),0,IF(AND($C420=\"S\",$Y420>0),OFFSET(I420,-1,0)+1,OFFSET(I420,-1,0)))","v":0},0,0,"F","Serviço","Serviço","2.5.1.6.","AGETOP",71451,"INTERRUPTOR DIFERENCIAL RESIDUAL (D.R.) BIPOLAR DE 40A-30mA","Un    ",1,1,null,null,null,null,null,""]
[3,3,3,5,2,5,2,0,{"$f":"IF(AND($C421<=4,$C421<>0),0,IF(AND($C421=\"S\",$Y421>0),OFFSET(I421,-1,0)+1,OFFSET(I421,-1,0)))","v":0},52,5,"F","Nível 3","Nível 3","2.5.2.","AGETOP",null,"CABOS E FIOS (CONDUTORES)","-",null,1,null,null,null,null,null,""]
["S",3,"S",0,2,5,2,0,{"$f":"IF(AND($C422<=4,$C422<>0),0,IF(AND($C422=\"S\",$Y422>0),OFFSET(I422,-1,0)+1,OFFSET(I422,-1,0)))","v":0},0,0,"F","Serviço","Serviço","2.5.2.1.","AGETOP",70563,"CABO ISOLADO PVC 750 V. No. 2,5 MM2","m     ",1500.4,1,null,null,null,null,null,""]
["S",3,"S",0,2,5,2,0,{"$f":"IF(AND($C423<=4,$C423<>0),0,IF(AND($C423=\"S\",$Y423>0),OFFSET(I423,-1,0)+1,OFFSET(I423,-1,0)))","v":0},0,0,"F","Serviço","Serviço","2.5.2.2.","AGETOP",70564,"CABO ISOLADO PVC 750 V. No. 4 MM2","m     ",385.24999999999994,1,null,null,null,null,null,""]
["S",3,"S",0,2,5,2,0,{"$f":"IF(AND($C424<=4,$C424<>0),0,IF(AND($C424=\"S\",$Y424>0),OFFSET(I424,-1,0)+1,OFFSET(I424,-1,0)))","v":0},0,0,"F","Serviço","Serviço","2.5.2.3.","AGETOP",70565,"CABO ISOLADO PVC 750 V. No. 6 MM2","m     ",100,1,null,null,null,null,null,""]
["S",3,"S",0,2,5,2,0,{"$f":"IF(AND($C425<=4,$C425<>0),0,IF(AND($C425=\"S\",$Y425>0),OFFSET(I425,-1,0)+1,OFFSET(I425,-1,0)))","v":0},0,0,"F","Serviço","Serviço","2.5.2.4.","AGETOP",70541,"CABO DE COBRE NU No. 16 MM2 (6,94 M/KG)","M     ",10,1,null,null,null,null,null,""]
[3,3,3,33,2,5,3,0,{"$f":"IF(AND($C426<=4,$C426<>0),0,IF(AND($C426=\"S\",$Y426>0),OFFSET(I426,-1,0)+1,OFFSET(I426,-1,0)))","v":0},47,33,"F","Nível 3","Nível 3","2.5.3.","AGETOP",null,"ELETRODUTOS E ACESSÓRIOS","-",null,1,null,null,null,null,null,""]
["S",3,"S",0,2,5,3,0,{"$f":"IF(AND($C427<=4,$C427<>0),0,IF(AND($C427=\"S\",$Y427>0),OFFSET(I427,-1,0)+1,OFFSET(I427,-1,0)))","v":0},0,0,"F","Serviço","Serviço","2.5.3.1.","AGETOP",71194,"ELETRODUTO PVC FLEXÍVEL - MANGUEIRA CORRUGADA LEVE - DIAM. 25MM","M     ",150,1,null,null,null,null,null,""]
["S",3,"S",0,2,5,3,0,{"$f":"IF(AND($C428<=4,$C428<>0),0,IF(AND($C428=\"S\",$Y428>0),OFFSET(I428,-1,0)+1,OFFSET(I428,-1,0)))","v":0},0,0,"F","Serviço","Serviço","2.5.3.2.","AGETOP",71195,"ELETRODUTO PVC FLEXÍVEL - MANGUEIRA CORRUGADA LEVE - DIAM. 32MM","M     ",80,1,null,null,null,null,null,""]
["S",3,"S",0,2,5,3,0,{"$f":"IF(AND($C429<=4,$C429<>0),0,IF(AND($C429=\"S\",$Y429>0),OFFSET(I429,-1,0)+1,OFFSET(I429,-1,0)))","v":0},0,0,"F","Serviço","Serviço","2.5.3.3.","AGETOP",71201,"ELETRODUTO DE PVC RIGIDO DIAMETRO 3/4\"","M     ",40,1,null,null,null,null,null,""]
["S",3,"S",0,2,5,3,0,{"$f":"IF(AND($C430<=4,$C430<>0),0,IF(AND($C430=\"S\",$Y430>0),OFFSET(I430,-1,0)+1,OFFSET(I430,-1,0)))","v":0},0,0,"F","Serviço","Serviço","2.5.3.4.","AGETOP",71202,"ELETRODUTO DE PVC RIGIDO DIAMETRO 1\"","M     ",60,1,null,null,null,null,null,""]
["S",3,"S",0,2,5,3,0,{"$f":"IF(AND($C431<=4,$C431<>0),0,IF(AND($C431=\"S\",$Y431>0),OFFSET(I431,-1,0)+1,OFFSET(I431,-1,0)))","v":0},0,0,"F","Serviço","Serviço","2.5.3.5.","AGETOP",70681,"CAIXA METALICA OCTOGONAL FUNDO MOVEL, SIMPLES 2\"","Un    ",24,1,null,null,null,null,null,""]
["S",3,"S",0,2,5,3,0,{"$f":"IF(AND($C432<=4,$C432<>0),0,IF(AND($C432=\"S\",$Y432>0),OFFSET(I432,-1,0)+1,OFFSET(I432,-1,0)))","v":0},0,0,"F","Serviço","Serviço","2.5.3.6.","AGETOP",70680,"CAIXA MET.HEXAGONAL P/ARANDELA (SEXTAVADA 3\"X3\")","Un    ",6,1,null,null,null,null,null,""]
["S",3,"S",0,2,5,3,0,{"$f":"IF(AND($C433<=4,$C433<>0),0,IF(AND($C433=\"S\",$Y433>0),OFFSET(I433,-1,0)+1,OFFSET(I433,-1,0)))","v":0},0,0,"F","Serviço","Serviço","2.5.3.7.","AGETOP",70691,"CAIXA METALICA RET. 4\" X 2\" X 2\"","Un    ",77,1,null,null,null,null,null,""]
["S",3,"S",0,2,5,3,0,{"$f":"IF(AND($C434<=4,$C434<>0),0,IF(AND($C434=\"S\",$Y434>0),OFFSET(I434,-1,0)+1,OFFSET(I434,-1,0)))","v":0},0,0,"F","Serviço","Serviço","2.5.3.8.","AGETOP",70692,"CAIXA METALICA QUADRADA 4\"X4\"X2\"","Un    ",5,1,null,null,null,null,null,""]
["S",3,"S",0,2,5,3,0,{"$f":"IF(AND($C435<=4,$C435<>0),0,IF(AND($C435=\"S\",$Y435>0),OFFSET(I435,-1,0)+1,OFFSET(I435,-1,0)))","v":0},0,0,"F","Serviço","Serviço","2.5.3.9.","AGETOP",70646,"CAIXA DE PASSAGEM METÁLICA DE EMBUTIR 20X20X10 CM","Un    ",1,1,null,null,null,null,null,""]
["S",3,"S",0,2,5,3,0,{"$f":"IF(AND($C436<=4,$C436<>0),0,IF(AND($C436=\"S\",$Y436>0),OFFSET(I436,-1,0)+1,OFFSET(I436,-1,0)))","v":0},0,0,"F","Serviço","Serviço","2.5.3.10.","AGETOP",71141,"CURVA DE 90 GRAUS DE PVC RIGIDO DIAM. 3/4\"","Un    ",10,1,null,null,null,null,null,""]
["S",3,"S",0,2,5,3,0,{"$f":"IF(AND($C437<=4,$C437<>0),0,IF(AND($C437=\"S\",$Y437>0),OFFSET(I437,-1,0)+1,OFFSET(I437,-1,0)))","v":0},0,0,"F","Serviço","Serviço","2.5.3.11.","AGETOP",71142,"CURVA DE 90 GRAUS DE PVC RIGIDO DIAM. 1\"","Un    ",5,1,null,null,null,null,null,""]
["S",3,"S",0,2,5,3,0,{"$f":"IF(AND($C438<=4,$C438<>0),0,IF(AND($C438=\"S\",$Y438>0),OFFSET(I438,-1,0)+1,OFFSET(I438,-1,0)))","v":0},0,0,"F","Serviço","Serviço","2.5.3.12.","AGETOP",70351,"BRACADEIRA METALICA TIPO \"U\" DIAM. 3/4\"","Un    ",20,1,null,null,null,null,null,""]
["S",3,"S",0,2,5,3,0,{"$f":"IF(AND($C439<=4,$C439<>0),0,IF(AND($C439=\"S\",$Y439>0),OFFSET(I439,-1,0)+1,OFFSET(I439,-1,0)))","v":0},0,0,"F","Serviço","Serviço","2.5.3.13.","AGETOP",70352,"BRACADEIRA METALICA TIPO \"U\" DIAM. 1\"","Un    ",15,1,null,null,null,null,null,""]
["S",3,"S",0,2,5,3,0,{"$f":"IF(AND($C440<=4,$C440<>0),0,IF(AND($C440=\"S\",$Y440>0),OFFSET(I440,-1,0)+1,OFFSET(I440,-1,0)))","v":0},0,0,"F","Serviço","Serviço","2.5.3.14.","AGETOP",71741,"LUVA PVC ROSQUEAVEL DIAMETRO 3/4\"","Un    ",35,1,null,null,null,null,null,""]
["S",3,"S",0,2,5,3,0,{"$f":"IF(AND($C441<=4,$C441<>0),0,IF(AND($C441=\"S\",$Y441>0),OFFSET(I441,-1,0)+1,OFFSET(I441,-1,0)))","v":0},0,0,"F","Serviço","Serviço","2.5.3.15.","AGETOP",71742,"LUVA PVC ROSQUEAVEL DIAMETRO 1\"","Un    ",25,1,null,null,null,null,null,""]
["S",3,"S",0,2,5,3,0,{"$f":"IF(AND($C442<=4,$C442<>0),0,IF(AND($C442=\"S\",$Y442>0),OFFSET(I442,-1,0)+1,OFFSET(I442,-1,0)))","v":0},0,0,"F","Serviço","Serviço","2.5.3.16.","AGETOP",70421,"BUCHA E ARRUELA METALICA DIAM. 3/4\"","PR    ",8,1,null,null,null,null,null,""]
["S",3,"S",0,2,5,3,0,{"$f":"IF(AND($C443<=4,$C443<>0),0,IF(AND($C443=\"S\",$Y443>0),OFFSET(I443,-1,0)+1,OFFSET(I443,-1,0)))","v":0},0,0,"F","Serviço","Serviço","2.5.3.17.","AGETOP",70422,"BUCHA E ARRUELA METALICA DIAM. 1\"","PR    ",6,1,null,null,null,null,null,""]
["S",3,"S",0,2,5,3,0,{"$f":"IF(AND($C444<=4,$C444<>0),0,IF(AND($C444=\"S\",$Y444>0),OFFSET(I444,-1,0)+1,OFFSET(I444,-1,0)))","v":0},0,0,"F","Serviço","Serviço","2.5.3.18.","AGETOP",71331,"FITA ISOLANTE, ROLO DE 20,00 M","Un    ",5,1,null,null,null,null,null,""]
["S",3,"S",0,2,5,3,0,{"$f":"IF(AND($C445<=4,$C445<>0),0,IF(AND($C445=\"S\",$Y445>0),OFFSET(I445,-1,0)+1,OFFSET(I445,-1,0)))","v":0},0,0,"F","Serviço","Serviço","2.5.3.19.","AGETOP",70929,"CONDULETE METÁLICO - CAIXA COM 5 ENTRADAS ","un    ",10,1,null,null,null,null,null,""]
["S",3,"S",0,2,5,3,0,{"$f":"IF(AND($C446<=4,$C446<>0),0,IF(AND($C446=\"S\",$Y446>0),OFFSET(I446,-1,0)+1,OFFSET(I446,-1,0)))","v":0},0,0,"F","Serviço","Serviço","2.5.3.20.","AGETOP",70930,"CONDULETE METÁLICO - ADAPTADOR DE SAÍDA 3/4\" ","un    ",10,1,null,null,null,null,null,""]
["S",3,"S",0,2,5,3,0,{"$f":"IF(AND($C447<=4,$C447<>0),0,IF(AND($C447=\"S\",$Y447>0),OFFSET(I447,-1,0)+1,OFFSET(I447,-1,0)))","v":0},0,0,"F","Serviço","Serviço","2.5.3.21.","AGETOP",72395,"TAMPA CEGA PARA CONDULETE METÁLICO","Un    ",10,1,null,null,null,null,null,""]
["S",3,"S",0,2,5,3,0,{"$f":"IF(AND($C448<=4,$C448<>0),0,IF(AND($C448=\"S\",$Y448>0),OFFSET(I448,-1,0)+1,OFFSET(I448,-1,0)))","v":0},0,0,"F","Serviço","Serviço","2.5.3.22.","AGETOP",71610,"LUMINÁRIA TIPO ARANDELA DE USO EXTERNO BLINDADA COM GRADE ( PEQUENA ) - BASE E-27","un    ",6,1,null,null,null,null,null,""]
["S",3,"S",0,2,5,3,0,{"$f":"IF(AND($C449<=4,$C449<>0),0,IF(AND($C449=\"S\",$Y449>0),OFFSET(I449,-1,0)+1,OFFSET(I449,-1,0)))","v":0},0,0,"F","Serviço","Serviço","2.5.3.23.","AGETOP",71440,"INTERRUPTOR SIMPLES (1 SECAO)","Un    ",12,1,null,null,null,null,null,""]
["S",3,"S",0,2,5,3,0,{"$f":"IF(AND($C450<=4,$C450<>0),0,IF(AND($C450=\"S\",$Y450>0),OFFSET(I450,-1,0)+1,OFFSET(I450,-1,0)))","v":0},0,0,"F","Serviço","Serviço","2.5.3.24.","AGETOP",71688,"LUMINÁRIA TIPO SPOT DE SOBREPOR PARA 01 LÂMPADA","un    ",5,1,null,null,null,null,null,""]
["S",3,"S",0,2,5,3,0,{"$f":"IF(AND($C451<=4,$C451<>0),0,IF(AND($C451=\"S\",$Y451>0),OFFSET(I451,-1,0)+1,OFFSET(I451,-1,0)))","v":0},0,0,"F","Serviço","Serviço","2.5.3.25.","AGETOP",71644,"LUMINÁRIA TIPO PLAFON DE SOBREPOR QUADRADA PARA 02 LÂMPADAS","Un    ",20,1,null,null,null,null,null,""]
["S",3,"S",0,2,5,3,0,{"$f":"IF(AND($C452<=4,$C452<>0),0,IF(AND($C452=\"S\",$Y452>0),OFFSET(I452,-1,0)+1,OFFSET(I452,-1,0)))","v":0},0,0,"F","Serviço","Serviço","2.5.3.26.","AGETOP",71577,"LAMPADA COMPACTA ELETRÔNICA COM REATOR INTEGRADO  25/26 W","Un    ",45,1,null,null,null,null,null,""]
["S",3,"S",0,2,5,3,0,{"$f":"IF(AND($C453<=4,$C453<>0),0,IF(AND($C453=\"S\",$Y453>0),OFFSET(I453,-1,0)+1,OFFSET(I453,-1,0)))","v":0},0,0,"F","Serviço","Serviço","2.5.3.27.","AGETOP",71520,"LAMPADA A VAPOR DE MERCURIO 125 W","Un    ",6,1,null,null,null,null,null,""]
["S",3,"S",0,2,5,3,0,{"$f":"IF(AND($C454<=4,$C454<>0),0,IF(AND($C454=\"S\",$Y454>0),OFFSET(I454,-1,0)+1,OFFSET(I454,-1,0)))","v":0},0,0,"F","Serviço","Serviço","2.5.3.28.","AGETOP",72579,"TOMADA HEXAGONAL DUPLA 2P + T - 10A - 250V","un    ",2,1,null,null,null,null,null,""]
["S",3,"S",0,2,5,3,0,{"$f":"IF(AND($C455<=4,$C455<>0),0,IF(AND($C455=\"S\",$Y455>0),OFFSET(I455,-1,0)+1,OFFSET(I455,-1,0)))","v":0},0,0,"F","Serviço","Serviço","2.5.3.29.","AGETOP",72570,"TOMADA HEXAGONAL 2P + T - 10A - 250V (LINHA X OU EQUIVALENTE)","Un    ",24,1,null,null,null,null,null,""]
["S",3,"S",0,2,5,3,0,{"$f":"IF(AND($C456<=4,$C456<>0),0,IF(AND($C456=\"S\",$Y456>0),OFFSET(I456,-1,0)+1,OFFSET(I456,-1,0)))","v":0},{"$f":"IF(OR($C456=\"S\",$C456=0),0,MATCH(0,OFFSET($D456,1,$C456,ROW($C$1328)-ROW($C456)),0))","v":0},{"$f":"IF(OR($C456=\"S\",$C456=0),0,MATCH(OFFSET($D456,0,$C456)+1,OFFSET($D456,1,$C456,ROW($C$1328)-ROW($C456)),0))","v":0},"F","Serviço","Serviço","2.5.3.30.","AGETOP",72575,"TOMADA HEXAGONAL 2P + T - 20A - 250V (LINHA X OU EQUIVALENTE)","Un    ",12,1,null,null,null,null,null,""]
["S",3,"S",0,2,5,3,0,{"$f":"IF(AND($C457<=4,$C457<>0),0,IF(AND($C457=\"S\",$Y457>0),OFFSET(I457,-1,0)+1,OFFSET(I457,-1,0)))","v":0},0,0,"F","Serviço","Serviço","2.5.3.31.","AGETOP",70287,"BORNE TERMINAL SAK 6 MM2","Un    ",3,1,null,null,null,null,null,""]
["S",3,"S",0,2,5,3,0,{"$f":"IF(AND($C458<=4,$C458<>0),0,IF(AND($C458=\"S\",$Y458>0),OFFSET(I458,-1,0)+1,OFFSET(I458,-1,0)))","v":0},0,0,"F","Serviço","Serviço","2.5.3.32.","AGETOP",71598,"LUMINÁRIA DE EMERGÊNCIA 30 LEDS","un    ",4,1,null,null,null,null,null,""]
[3,3,3,14,2,5,4,0,{"$f":"IF(AND($C459<=4,$C459<>0),0,IF(AND($C459=\"S\",$Y459>0),OFFSET(I459,-1,0)+1,OFFSET(I459,-1,0)))","v":0},14,{"$error":"#N/A"},"F","Nível 3","Nível 3","2.5.4.","AGETOP",null,"CABEAMENTO ESTRUTURADO","-",null,1,null,null,null,null,null,""]
["S",3,"S",0,2,5,4,0,{"$f":"IF(AND($C460<=4,$C460<>0),0,IF(AND($C460=\"S\",$Y460>0),OFFSET(I460,-1,0)+1,OFFSET(I460,-1,0)))","v":0},0,0,"F","Serviço","Serviço","2.5.4.1.","AGETOP",70283,"BLOCO BER-10 (BLOCO DE ENGATE RAPIDO)","Un    ",2,1,null,null,null,null,null,""]
["S",3,"S",0,2,5,4,0,{"$f":"IF(AND($C461<=4,$C461<>0),0,IF(AND($C461=\"S\",$Y461>0),OFFSET(I461,-1,0)+1,OFFSET(I461,-1,0)))","v":0},0,0,"F","Serviço","Serviço","2.5.4.2.","AGETOP",70602,"CABO TELEFONICO CCI-50 2 PARES","M     ",25,1,null,null,null,null,null,""]
["S",3,"S",0,2,5,4,0,{"$f":"IF(AND($C462<=4,$C462<>0),0,IF(AND($C462=\"S\",$Y462>0),OFFSET(I462,-1,0)+1,OFFSET(I462,-1,0)))","v":0},0,0,"F","Serviço","Serviço","2.5.4.3.","AGETOP",70626,"CABO UTP-4P, CAT. 6 , 24 AWG","M     ",190,1,null,null,null,null,null,""]
["S",3,"S",0,2,5,4,0,{"$f":"IF(AND($C463<=4,$C463<>0),0,IF(AND($C463=\"S\",$Y463>0),OFFSET(I463,-1,0)+1,OFFSET(I463,-1,0)))","v":0},0,0,"F","Serviço","Serviço","2.5.4.4.","AGETOP",71026,"CONECTOR RJ-45 CAT. 6","Un    ",12,1,null,null,null,null,null,""]
["S",3,"S",0,2,5,4,0,{"$f":"IF(AND($C464<=4,$C464<>0),0,IF(AND($C464=\"S\",$Y464>0),OFFSET(I464,-1,0)+1,OFFSET(I464,-1,0)))","v":0},0,0,"F","Serviço","Serviço","2.5.4.5.","AGETOP",71887,"PATCH PANEL PADRÃO 19\" CAT. 6, COM 24 PORTAS","Un    ",2,1,null,null,null,null,null,""]
["S",3,"S",0,2,5,4,0,{"$f":"IF(AND($C465<=4,$C465<>0),0,IF(AND($C465=\"S\",$Y465>0),OFFSET(I465,-1,0)+1,OFFSET(I465,-1,0)))","v":0},0,0,"F","Serviço","Serviço","2.5.4.6.","AGETOP",72226,"RACK FECHADO DE PAREDE COM PORTA EM ACRÍLICO - 12 U´S ","un    ",1,1,null,null,null,null,null,""]
["S",3,"S",0,2,5,4,0,{"$f":"IF(AND($C466<=4,$C466<>0),0,IF(AND($C466=\"S\",$Y466>0),OFFSET(I466,-1,0)+1,OFFSET(I466,-1,0)))","v":0},0,0,"F","Serviço","Serviço","2.5.4.7.","AGETOP",72591,"TOMADA TELEFÔNICA RJ-11","Un    ",12,1,null,null,null,null,null,""]
["S",3,"S",0,2,5,4,0,{"$f":"IF(AND($C467<=4,$C467<>0),0,IF(AND($C467=\"S\",$Y467>0),OFFSET(I467,-1,0)+1,OFFSET(I467,-1,0)))","v":0},0,0,"F","Serviço","Serviço","2.5.4.8.","AGETOP",72556,"TOMADA LOGICA RJ-45 TIPO KEYSTONE JACK, CAT. 6","Un    ",12,1,null,null,null,null,null,""]
["S",3,"S",0,2,5,4,0,{"$f":"IF(AND($C468<=4,$C468<>0),0,IF(AND($C468=\"S\",$Y468>0),OFFSET(I468,-1,0)+1,OFFSET(I468,-1,0)))","v":0},0,0,"F","Serviço","Serviço","2.5.4.9.","AGETOP",70670,"CAIXA DISTRIBUIÇÃO TELEFÔNICA DE EMBUTIR 40X40X12 CM","Un    ",1,1,null,null,null,null,null,""]
["S",3,"S",0,2,5,4,0,{"$f":"IF(AND($C469<=4,$C469<>0),0,IF(AND($C469=\"S\",$Y469>0),OFFSET(I469,-1,0)+1,OFFSET(I469,-1,0)))","v":0},0,0,"F","Serviço","Serviço","2.5.4.10.","AGETOP",70646,"CAIXA DE PASSAGEM METÁLICA DE EMBUTIR 20X20X10 CM","Un    ",1,1,null,null,null,null,null,""]
["S",3,"S",0,2,5,4,0,{"$f":"IF(AND($C470<=4,$C470<>0),0,IF(AND($C470=\"S\",$Y470>0),OFFSET(I470,-1,0)+1,OFFSET(I470,-1,0)))","v":0},0,0,"F","Serviço","Serviço","2.5.4.11.","AGETOP",70691,"CAIXA METALICA RET. 4\" X 2\" X 2\"","Un    ",12,1,null,null,null,null,null,""]
["S",3,"S",0,2,5,4,0,{"$f":"IF(AND($C471<=4,$C471<>0),0,IF(AND($C471=\"S\",$Y471>0),OFFSET(I471,-1,0)+1,OFFSET(I471,-1,0)))","v":0},0,0,"F","Serviço","Serviço","2.5.4.12.","AGETOP",71886,"PATCH CORD COMPRIMENTO DE 2,50 M - CAT.6 ","Un    ",24,1,null,null,null,null,null,""]
["S",3,"S",0,2,5,4,0,{"$f":"IF(AND($C472<=4,$C472<>0),0,IF(AND($C472=\"S\",$Y472>0),OFFSET(I472,-1,0)+1,OFFSET(I472,-1,0)))","v":0},0,0,"F","Serviço","Serviço","2.5.4.13.","AGETOP",72291,"REGUA COM 8 TOMADAS","Un    ",1,1,null,null,null,null,null,""]
[2,2,2,81,2,6,0,0,{"$f":"IF(AND($C473<=4,$C473<>0),0,IF(AND($C473=\"S\",$Y473>0),OFFSET(I473,-1,0)+1,OFFSET(I473,-1,0)))","v":0},132,81,"F","Nível 2","Nível 2","2.6.","SINAPI",null,"INSTALAÇÕES HIDROSSANITÁRIAS","-",null,1,null,null,null,null,null,""]
[3,3,3,44,2,6,1,0,{"$f":"IF(AND($C474<=4,$C474<>0),0,IF(AND($C474=\"S\",$Y474>0),OFFSET(I474,-1,0)+1,OFFSET(I474,-1,0)))","v":0},80,44,"F","Nível 3","Nível 3","2.6.1.","SINAPI",null,"PEÇAS E ACESSÓRIOS","-",null,1,null,null,null,null,null,""]
["S",3,"S",0,2,6,1,0,{"$f":"IF(AND($C475<=4,$C475<>0),0,IF(AND($C475=\"S\",$Y475>0),OFFSET(I475,-1,0)+1,OFFSET(I475,-1,0)))","v":0},0,0,"F","Serviço","Serviço","2.6.1.1.","AGETOP",80927,"REGISTRO DE GAVETA C/CANOPLA DIAMETRO 1\"","Un    ",1,1,null,null,null,null,null,""]
["S",3,"S",0,2,6,1,0,{"$f":"IF(AND($C476<=4,$C476<>0),0,IF(AND($C476=\"S\",$Y476>0),OFFSET(I476,-1,0)+1,OFFSET(I476,-1,0)))","v":0},0,0,"F","Serviço","Serviço","2.6.1.2.","AGETOP",80929,"REGISTRO DE GAVETA C/CANOPLA DIAMETRO 1.1/2\"","Un    ",2,1,null,null,null,null,null,""]
["S",3,"S",0,2,6,1,0,{"$f":"IF(AND($C477<=4,$C477<>0),0,IF(AND($C477=\"S\",$Y477>0),OFFSET(I477,-1,0)+1,OFFSET(I477,-1,0)))","v":0},0,0,"F","Serviço","Serviço","2.6.1.3.","AGETOP",80926,"REGISTRO DE GAVETA C/CANOPLA DIAMETRO 3/4\"","Un    ",3,1,null,null,null,null,null,""]
["S",3,"S",0,2,6,1,0,{"$f":"IF(AND($C478<=4,$C478<>0),0,IF(AND($C478=\"S\",$Y478>0),OFFSET(I478,-1,0)+1,OFFSET(I478,-1,0)))","v":0},0,0,"F","Serviço","Serviço","2.6.1.4.","AGETOP",80946,"REGISTRO DE PRESSAO C/CANOPLA CROMADA DIAM.3/4\"","Un    ",1,1,null,null,null,null,null,""]
["S",3,"S",0,2,6,1,0,{"$f":"IF(AND($C479<=4,$C479<>0),0,IF(AND($C479=\"S\",$Y479>0),OFFSET(I479,-1,0)+1,OFFSET(I479,-1,0)))","v":0},0,0,"F","Serviço","Serviço","2.6.1.5.","AGETOP",81067,"ADAPTAD.SOLD.CURTO C/BOLSA E ROSCA P/REG.32X1\"","Un    ",2,1,null,null,null,null,null,""]
["S",3,"S",0,2,6,1,0,{"$f":"IF(AND($C480<=4,$C480<>0),0,IF(AND($C480=\"S\",$Y480>0),OFFSET(I480,-1,0)+1,OFFSET(I480,-1,0)))","v":0},0,0,"F","Serviço","Serviço","2.6.1.6.","AGETOP",81069,"ADAPTAD.SOLD.CURTO C/BOLSA/ROSCA P/REG.50X11/2\"","Un    ",4,1,null,null,null,null,null,""]
["S",3,"S",0,2,6,1,0,{"$f":"IF(AND($C481<=4,$C481<>0),0,IF(AND($C481=\"S\",$Y481>0),OFFSET(I481,-1,0)+1,OFFSET(I481,-1,0)))","v":0},0,0,"F","Serviço","Serviço","2.6.1.7.","AGETOP",81066,"ADAPTAD.SOLD.CURTO C/BOLSA E ROSCA P/REG.25X3/4\"","Un    ",7,1,null,null,null,null,null,""]
["S",3,"S",0,2,6,1,0,{"$f":"IF(AND($C482<=4,$C482<>0),0,IF(AND($C482=\"S\",$Y482>0),OFFSET(I482,-1,0)+1,OFFSET(I482,-1,0)))","v":0},0,0,"F","Serviço","Serviço","2.6.1.8.","AGETOP",80502,"VASO SANITARIO","Un    ",2,1,null,null,null,null,null,""]
["S",3,"S",0,2,6,1,0,{"$f":"IF(AND($C483<=4,$C483<>0),0,IF(AND($C483=\"S\",$Y483>0),OFFSET(I483,-1,0)+1,OFFSET(I483,-1,0)))","v":0},0,0,"F","Serviço","Serviço","2.6.1.9.","AGETOP",80510,"ANEL DE VEDAÇÃO PARA VASO SANITÁRIO","Un    ",2,1,null,null,null,null,null,""]
["S",3,"S",0,2,6,1,0,{"$f":"IF(AND($C484<=4,$C484<>0),0,IF(AND($C484=\"S\",$Y484>0),OFFSET(I484,-1,0)+1,OFFSET(I484,-1,0)))","v":0},0,0,"F","Serviço","Serviço","2.6.1.10.","AGETOP",80513,"TUBO PARA VÁLVULA DE DESCARGA ( CURTO 1.1/4\" )","Un    ",2,1,null,null,null,null,null,""]
["S",3,"S",0,2,6,1,0,{"$f":"IF(AND($C485<=4,$C485<>0),0,IF(AND($C485=\"S\",$Y485>0),OFFSET(I485,-1,0)+1,OFFSET(I485,-1,0)))","v":0},0,0,"F","Serviço","Serviço","2.6.1.11.","AGETOP",80514,"TUBO DE LIGACAO PVC CROMADO 1.1/2\" / ESPUDE  - (ENTRADA)","Un    ",2,1,null,null,null,null,null,""]
["S",3,"S",0,2,6,1,0,{"$f":"IF(AND($C486<=4,$C486<>0),0,IF(AND($C486=\"S\",$Y486>0),OFFSET(I486,-1,0)+1,OFFSET(I486,-1,0)))","v":0},0,0,"F","Serviço","Serviço","2.6.1.12.","AGETOP",80517,"VÁLVULA DE DESCARGA DUPLO ACIONAMENTO COM ACABAMENTO CROMADO ANTIVANDALISMO","Un    ",2,1,null,null,null,null,null,""]
["S",3,"S",0,2,6,1,0,{"$f":"IF(AND($C487<=4,$C487<>0),0,IF(AND($C487=\"S\",$Y487>0),OFFSET(I487,-1,0)+1,OFFSET(I487,-1,0)))","v":0},0,0,"F","Serviço","Serviço","2.6.1.13.","AGETOP",80520,"CONJUNTO DE FIXACAO P/VASO SANITARIO (PAR)","CJ    ",2,1,null,null,null,null,null,""]
["S",3,"S",0,2,6,1,0,{"$f":"IF(AND($C488<=4,$C488<>0),0,IF(AND($C488=\"S\",$Y488>0),OFFSET(I488,-1,0)+1,OFFSET(I488,-1,0)))","v":0},0,0,"F","Serviço","Serviço","2.6.1.14.","AGETOP",80526,"ASSENTO EM POLIPROPILENO COM SISTEMA DE FECHAMENTO SUAVE PARA VASO SANITÁRIO","Un    ",2,1,null,null,null,null,null,""]
["S",3,"S",0,2,6,1,0,{"$f":"IF(AND($C489<=4,$C489<>0),0,IF(AND($C489=\"S\",$Y489>0),OFFSET(I489,-1,0)+1,OFFSET(I489,-1,0)))","v":0},0,0,"F","Serviço","Serviço","2.6.1.15.","AGETOP",80530,"PORTA PAPEL HIGIÊNICO EM LOUÇA - EMBUTIR","Un    ",2,1,null,null,null,null,null,""]
["S",3,"S",0,2,6,1,0,{"$f":"IF(AND($C490<=4,$C490<>0),0,IF(AND($C490=\"S\",$Y490>0),OFFSET(I490,-1,0)+1,OFFSET(I490,-1,0)))","v":0},0,0,"F","Serviço","Serviço","2.6.1.16.","AGETOP",80721,"CHUVEIRO ELÉTRICO EM PVC COM BRAÇO METÁLICO","Un    ",1,1,null,null,null,null,null,""]
["S",3,"S",0,2,6,1,0,{"$f":"IF(AND($C491<=4,$C491<>0),0,IF(AND($C491=\"S\",$Y491>0),OFFSET(I491,-1,0)+1,OFFSET(I491,-1,0)))","v":0},0,0,"F","Serviço","Serviço","2.6.1.17.","AGETOP",80740,"MEIA SABONETEIRA EM LOUÇA DE EMBUTIR","Un    ",1,1,null,null,null,null,null,""]
["S",3,"S",0,2,6,1,0,{"$f":"IF(AND($C492<=4,$C492<>0),0,IF(AND($C492=\"S\",$Y492>0),OFFSET(I492,-1,0)+1,OFFSET(I492,-1,0)))","v":0},0,0,"F","Serviço","Serviço","2.6.1.18.","AGETOP",80732,"PORTA TOALHA HASTE LONGA EM METAL/ACABAMENTO CROMADO","Un    ",1,1,null,null,null,null,null,""]
["S",3,"S",0,2,6,1,0,{"$f":"IF(AND($C493<=4,$C493<>0),0,IF(AND($C493=\"S\",$Y493>0),OFFSET(I493,-1,0)+1,OFFSET(I493,-1,0)))","v":0},0,0,"F","Serviço","Serviço","2.6.1.19.","AGETOP",80541,"LAVATÓRIO MÉDIO COM COLUNA","Un    ",1,1,null,null,null,null,null,""]
["S",3,"S",0,2,6,1,0,{"$f":"IF(AND($C494<=4,$C494<>0),0,IF(AND($C494=\"S\",$Y494>0),OFFSET(I494,-1,0)+1,OFFSET(I494,-1,0)))","v":0},0,0,"F","Serviço","Serviço","2.6.1.20.","AGETOP",80590,"CUBA DE LOUCA DE EMBUTIR OVAL MÉDIA ","Un    ",1,1,null,null,null,null,null,""]
["S",3,"S",0,2,6,1,0,{"$f":"IF(AND($C495<=4,$C495<>0),0,IF(AND($C495=\"S\",$Y495>0),OFFSET(I495,-1,0)+1,OFFSET(I495,-1,0)))","v":0},0,0,"F","Serviço","Serviço","2.6.1.21.","AGETOP",80556,"LIGAÇÃO FLEXÍVEL PVC DIAM.1/2\" (ENGATE)","Un    ",2,1,null,null,null,null,null,""]
["S",3,"S",0,2,6,1,0,{"$f":"IF(AND($C496<=4,$C496<>0),0,IF(AND($C496=\"S\",$Y496>0),OFFSET(I496,-1,0)+1,OFFSET(I496,-1,0)))","v":0},0,0,"F","Serviço","Serviço","2.6.1.22.","AGETOP",80580,"VALVULA P/LAVATORIO OU BEBEDOURO METALICO DIAMETRO 1\"","Un    ",2,1,null,null,null,null,null,""]
["S",3,"S",0,2,6,1,0,{"$f":"IF(AND($C497<=4,$C497<>0),0,IF(AND($C497=\"S\",$Y497>0),OFFSET(I497,-1,0)+1,OFFSET(I497,-1,0)))","v":0},0,0,"F","Serviço","Serviço","2.6.1.23.","AGETOP",80561,"SIFAO P/LAVATORIO PVC DIAM.1\"X1.1/2\"","Un    ",2,1,null,null,null,null,null,""]
["S",3,"S",0,2,6,1,0,{"$f":"IF(AND($C498<=4,$C498<>0),0,IF(AND($C498=\"S\",$Y498>0),OFFSET(I498,-1,0)+1,OFFSET(I498,-1,0)))","v":0},0,0,"F","Serviço","Serviço","2.6.1.24.","AGETOP",80550,"FIXACAO P/LAVATORIO (PAR)","PAR   ",1,1,null,null,null,null,null,""]
["S",3,"S",0,2,6,1,0,{"$f":"IF(AND($C499<=4,$C499<>0),0,IF(AND($C499=\"S\",$Y499>0),OFFSET(I499,-1,0)+1,OFFSET(I499,-1,0)))","v":0},0,0,"F","Serviço","Serviço","2.6.1.25.","AGETOP",80570,"TORNEIRA DE MESA PARA LAVATÓRIO DIÂMETRO DE 1/2\"","Un    ",2,1,null,null,null,null,null,""]
["S",3,"S",0,2,6,1,0,{"$f":"IF(AND($C500<=4,$C500<>0),0,IF(AND($C500=\"S\",$Y500>0),OFFSET(I500,-1,0)+1,OFFSET(I500,-1,0)))","v":0},0,0,"F","Serviço","Serviço","2.6.1.26.","AGETOP",80804,"TANQUE DE LOUÇA COM COLUNA TAMANHO MÉDIO","Un    ",1,1,null,null,null,null,null,""]
["S",3,"S",0,2,6,1,0,{"$f":"IF(AND($C501<=4,$C501<>0),0,IF(AND($C501=\"S\",$Y501>0),OFFSET(I501,-1,0)+1,OFFSET(I501,-1,0)))","v":0},0,0,"F","Serviço","Serviço","2.6.1.27.","AGETOP",80820,"SIFAO P/TANQUE 1\" X 1.1/2\" - PVC","Un    ",1,1,null,null,null,null,null,""]
["S",3,"S",0,2,6,1,0,{"$f":"IF(AND($C502<=4,$C502<>0),0,IF(AND($C502=\"S\",$Y502>0),OFFSET(I502,-1,0)+1,OFFSET(I502,-1,0)))","v":0},0,0,"F","Serviço","Serviço","2.6.1.28.","AGETOP",80830,"VALVULA P/TANQUE METALICA DIAM.1\" S/LADRAO","Un    ",1,1,null,null,null,null,null,""]
["S",3,"S",0,2,6,1,0,{"$f":"IF(AND($C503<=4,$C503<>0),0,IF(AND($C503=\"S\",$Y503>0),OFFSET(I503,-1,0)+1,OFFSET(I503,-1,0)))","v":0},0,0,"F","Serviço","Serviço","2.6.1.29.","AGETOP",80810,"TORNEIRA DE PAREDE PARA TANQUE COM AREJADOR DIÂMETRO DE 1/2\" E 3/4\"","Un    ",1,1,null,null,null,null,null,""]
["S",3,"S",0,2,6,1,0,{"$f":"IF(AND($C504<=4,$C504<>0),0,IF(AND($C504=\"S\",$Y504>0),OFFSET(I504,-1,0)+1,OFFSET(I504,-1,0)))","v":0},0,0,"F","Serviço","Serviço","2.6.1.30.","AGETOP",80686,"CUBA INOX 56X34X17CM E=0,6MM-AÇO 304 (CUBA Nº2)","Un    ",3,1,null,null,null,null,null,""]
["S",3,"S",0,2,6,1,0,{"$f":"IF(AND($C505<=4,$C505<>0),0,IF(AND($C505=\"S\",$Y505>0),OFFSET(I505,-1,0)+1,OFFSET(I505,-1,0)))","v":0},0,0,"F","Serviço","Serviço","2.6.1.31.","AGETOP",80680,"VALVULA P/PIA TIPO AMERICANA DIAM.3.1/2\" (METAL)","Un    ",3,1,null,null,null,null,null,""]
["S",3,"S",0,2,6,1,0,{"$f":"IF(AND($C506<=4,$C506<>0),0,IF(AND($C506=\"S\",$Y506>0),OFFSET(I506,-1,0)+1,OFFSET(I506,-1,0)))","v":0},0,0,"F","Serviço","Serviço","2.6.1.32.","AGETOP",80670,"SIFAO P/PIA 1.1/2\" X 2\" METAL","Un    ",3,1,null,null,null,null,null,""]
["S",3,"S",0,2,6,1,0,{"$f":"IF(AND($C507<=4,$C507<>0),0,IF(AND($C507=\"S\",$Y507>0),OFFSET(I507,-1,0)+1,OFFSET(I507,-1,0)))","v":0},0,0,"F","Serviço","Serviço","2.6.1.33.","AGETOP",80660,"TORNEIRA DE PAREDE PARA PIA OU BEBEDOURO DIÂMETRO DE 1/2\" E 3/4\" ","Un    ",3,1,null,null,null,null,null,""]
["S",3,"S",0,2,6,1,0,{"$f":"IF(AND($C508<=4,$C508<>0),0,IF(AND($C508=\"S\",$Y508>0),OFFSET(I508,-1,0)+1,OFFSET(I508,-1,0)))","v":0},0,0,"F","Serviço","Serviço","2.6.1.34.","AGETOP",81825,"CAIXA DE PASSAGEM 60 X 60 CM SEM TAMPA","Un    ",4,1,null,null,null,null,null,""]
["S",3,"S",0,2,6,1,0,{"$f":"IF(AND($C509<=4,$C509<>0),0,IF(AND($C509=\"S\",$Y509>0),OFFSET(I509,-1,0)+1,OFFSET(I509,-1,0)))","v":0},0,0,"F","Serviço","Serviço","2.6.1.35.","AGETOP",81826,"TAMPA EM CONCRETO ARMADO 25 MPA E=5CM PARA A CAIXA DE PASSAGEM 60X60CM","Un    ",4,1,null,null,null,null,null,""]
["S",3,"S",0,2,6,1,0,{"$f":"IF(AND($C510<=4,$C510<>0),0,IF(AND($C510=\"S\",$Y510>0),OFFSET(I510,-1,0)+1,OFFSET(I510,-1,0)))","v":0},0,0,"F","Serviço","Serviço","2.6.1.36.","AGETOP",81681,"CORPO RALO SECO CILINDRICO 100 X 40","Un    ",1,1,null,null,null,null,null,""]
["S",3,"S",0,2,6,1,0,{"$f":"IF(AND($C511<=4,$C511<>0),0,IF(AND($C511=\"S\",$Y511>0),OFFSET(I511,-1,0)+1,OFFSET(I511,-1,0)))","v":0},0,0,"F","Serviço","Serviço","2.6.1.37.","AGETOP",81785,"GRELHA REDONDA ACO INOX SIMPLES DIAM. 100 MM","Un    ",1,1,null,null,null,null,null,""]
["S",3,"S",0,2,6,1,0,{"$f":"IF(AND($C512<=4,$C512<>0),0,IF(AND($C512=\"S\",$Y512>0),OFFSET(I512,-1,0)+1,OFFSET(I512,-1,0)))","v":0},0,0,"F","Serviço","Serviço","2.6.1.38.","AGETOP",81663,"CORPO CX. SIFONADA DIAM. 150 X 150 X 50","Un    ",3,1,null,null,null,null,null,""]
["S",3,"S",0,2,6,1,0,{"$f":"IF(AND($C513<=4,$C513<>0),0,IF(AND($C513=\"S\",$Y513>0),OFFSET(I513,-1,0)+1,OFFSET(I513,-1,0)))","v":0},0,0,"F","Serviço","Serviço","2.6.1.39.","AGETOP",81761,"GRELHA QUADRADA ACO INOX SIMPLES DIAM.150 MM","Un    ",3,1,null,null,null,null,null,""]
["S",3,"S",0,2,6,1,0,{"$f":"IF(AND($C514<=4,$C514<>0),0,IF(AND($C514=\"S\",$Y514>0),OFFSET(I514,-1,0)+1,OFFSET(I514,-1,0)))","v":0},0,0,"F","Serviço","Serviço","2.6.1.40.","AGETOP",81851,"CAIXA DE GORDURA 100 L CONCRETO PADRÃO AGETOP IMPERMEABILIZADA","Un    ",1,1,null,null,null,null,null,""]
["S",3,"S",0,2,6,1,0,{"$f":"IF(AND($C515<=4,$C515<>0),0,IF(AND($C515=\"S\",$Y515>0),OFFSET(I515,-1,0)+1,OFFSET(I515,-1,0)))","v":0},0,0,"F","Serviço","Serviço","2.6.1.41.","AGETOP",81885,"TERMINAL DE VENTILACAO DIAMETRO 50 MM","Un    ",2,1,null,null,null,null,null,""]
["S",3,"S",0,2,6,1,0,{"$f":"IF(AND($C516<=4,$C516<>0),0,IF(AND($C516=\"S\",$Y516>0),OFFSET(I516,-1,0)+1,OFFSET(I516,-1,0)))","v":0},0,0,"F","Serviço","Serviço","2.6.1.42.","AGETOP",81501,"ADESIVO PLASTICO - FRASCO 850 G","Un    ",2,1,null,null,null,null,null,""]
["S",3,"S",0,2,6,1,0,{"$f":"IF(AND($C517<=4,$C517<>0),0,IF(AND($C517=\"S\",$Y517>0),OFFSET(I517,-1,0)+1,OFFSET(I517,-1,0)))","v":0},0,0,"F","Serviço","Serviço","2.6.1.43.","AGETOP",81504,"SOLUCAO LIMPADORA 1000 CM3","Un    ",2,1,null,null,null,null,null,""]
[3,3,3,22,2,6,2,0,{"$f":"IF(AND($C518<=4,$C518<>0),0,IF(AND($C518=\"S\",$Y518>0),OFFSET(I518,-1,0)+1,OFFSET(I518,-1,0)))","v":0},36,22,"F","Nível 3","Nível 3","2.6.2.","SINAPI",null,"ÁGUA FRIA","-",null,1,null,null,null,null,null,""]
["S",3,"S",0,2,6,2,0,{"$f":"IF(AND($C519<=4,$C519<>0),0,IF(AND($C519=\"S\",$Y519>0),OFFSET(I519,-1,0)+1,OFFSET(I519,-1,0)))","v":0},0,0,"F","Serviço","Serviço","2.6.2.1.","AGETOP",81003,"TUBO SOLDAVEL PVC MARROM DIAMETRO 25 mm","M     ",30,1,null,null,null,null,null,""]
["S",3,"S",0,2,6,2,0,{"$f":"IF(AND($C520<=4,$C520<>0),0,IF(AND($C520=\"S\",$Y520>0),OFFSET(I520,-1,0)+1,OFFSET(I520,-1,0)))","v":0},{"$f":"IF(OR($C520=\"S\",$C520=0),0,MATCH(0,OFFSET($D520,1,$C520,ROW($C$1328)-ROW($C520)),0))","v":0},{"$f":"IF(OR($C520=\"S\",$C520=0),0,MATCH(OFFSET($D520,0,$C520)+1,OFFSET($D520,1,$C520,ROW($C$1328)-ROW($C520)),0))","v":0},"F","Serviço","Serviço","2.6.2.2.","AGETOP",81004,"TUBO SOLDAVEL PVC MARROM DIAMETRO 32 mm","m     ",6,1,null,null,null,null,null,""]
["S",3,"S",0,2,6,2,0,{"$f":"IF(AND($C521<=4,$C521<>0),0,IF(AND($C521=\"S\",$Y521>0),OFFSET(I521,-1,0)+1,OFFSET(I521,-1,0)))","v":0},0,0,"F","Serviço","Serviço","2.6.2.3.","AGETOP",81006,"TUBO SOLDAVEL PVC MARROM DIAM. 50 mm","m     ",30,1,null,null,null,null,null,""]
["S",3,"S",0,2,6,2,0,{"$f":"IF(AND($C522<=4,$C522<>0),0,IF(AND($C522=\"S\",$Y522>0),OFFSET(I522,-1,0)+1,OFFSET(I522,-1,0)))","v":0},0,0,"F","Serviço","Serviço","2.6.2.4.","AGETOP",81007,"TUBO SOLDAVEL PVC MARROM DIAMETRO 60 mm (2\")","m     ",36,1,null,null,null,null,null,""]
["S",3,"S",0,2,6,2,0,{"$f":"IF(AND($C523<=4,$C523<>0),0,IF(AND($C523=\"S\",$Y523>0),OFFSET(I523,-1,0)+1,OFFSET(I523,-1,0)))","v":0},0,0,"F","Serviço","Serviço","2.6.2.5.","AGETOP",81102,"LUVA SOLDAVEL DIAMETRO 25 mm","Un    ",4,1,null,null,null,null,null,""]
["S",3,"S",0,2,6,2,0,{"$f":"IF(AND($C524<=4,$C524<>0),0,IF(AND($C524=\"S\",$Y524>0),OFFSET(I524,-1,0)+1,OFFSET(I524,-1,0)))","v":0},0,0,"F","Serviço","Serviço","2.6.2.6.","AGETOP",81103,"LUVA SOLDAVEL DIAMETRO 32 mm","Un    ",1,1,null,null,null,null,null,""]
["S",3,"S",0,2,6,2,0,{"$f":"IF(AND($C525<=4,$C525<>0),0,IF(AND($C525=\"S\",$Y525>0),OFFSET(I525,-1,0)+1,OFFSET(I525,-1,0)))","v":0},0,0,"F","Serviço","Serviço","2.6.2.7.","AGETOP",81105,"LUVA SOLDAVEL DIAMETRO 50 mm","Un    ",3,1,null,null,null,null,null,""]
["S",3,"S",0,2,6,2,0,{"$f":"IF(AND($C526<=4,$C526<>0),0,IF(AND($C526=\"S\",$Y526>0),OFFSET(I526,-1,0)+1,OFFSET(I526,-1,0)))","v":0},0,0,"F","Serviço","Serviço","2.6.2.8.","AGETOP",81106,"LUVA SOLDAVEL DIAMETRO 60 mm","Un    ",4,1,null,null,null,null,null,""]
["S",3,"S",0,2,6,2,0,{"$f":"IF(AND($C527<=4,$C527<>0),0,IF(AND($C527=\"S\",$Y527>0),OFFSET(I527,-1,0)+1,OFFSET(I527,-1,0)))","v":0},0,0,"F","Serviço","Serviço","2.6.2.9.","AGETOP",81361,"JOELHO REDUCAO 90 GRAUS SOLD./ROSCA 25 X 1/2\"","Un    ",2,1,null,null,null,null,null,""]
["S",3,"S",0,2,6,2,0,{"$f":"IF(AND($C528<=4,$C528<>0),0,IF(AND($C528=\"S\",$Y528>0),OFFSET(I528,-1,0)+1,OFFSET(I528,-1,0)))","v":0},0,0,"F","Serviço","Serviço","2.6.2.10.","AGETOP",81369,"JOELHO 90 GRAUS SOLD. C/BUCHA LATAO 25 X 3/4\"","Un    ",5,1,null,null,null,null,null,""]
["S",3,"S",0,2,6,2,0,{"$f":"IF(AND($C529<=4,$C529<>0),0,IF(AND($C529=\"S\",$Y529>0),OFFSET(I529,-1,0)+1,OFFSET(I529,-1,0)))","v":0},0,0,"F","Serviço","Serviço","2.6.2.11.","AGETOP",81321,"JOELHO 90 GRAUS SOLDAVEL DIAMETRO 25 MM","Un    ",13,1,null,null,null,null,null,""]
["S",3,"S",0,2,6,2,0,{"$f":"IF(AND($C530<=4,$C530<>0),0,IF(AND($C530=\"S\",$Y530>0),OFFSET(I530,-1,0)+1,OFFSET(I530,-1,0)))","v":0},0,0,"F","Serviço","Serviço","2.6.2.12.","AGETOP",81322,"JOELHO 90 GRAUS SOLDAVEL DIAMETRO 32 MM (1\")","Un    ",1,1,null,null,null,null,null,""]
["S",3,"S",0,2,6,2,0,{"$f":"IF(AND($C531<=4,$C531<>0),0,IF(AND($C531=\"S\",$Y531>0),OFFSET(I531,-1,0)+1,OFFSET(I531,-1,0)))","v":0},0,0,"F","Serviço","Serviço","2.6.2.13.","AGETOP",81324,"JOELHO 90 GRAUS SOLDAVEL 50 mm (MARROM)","Un    ",5,1,null,null,null,null,null,""]
["S",3,"S",0,2,6,2,0,{"$f":"IF(AND($C532<=4,$C532<>0),0,IF(AND($C532=\"S\",$Y532>0),OFFSET(I532,-1,0)+1,OFFSET(I532,-1,0)))","v":0},0,0,"F","Serviço","Serviço","2.6.2.14.","AGETOP",81325,"JOELHO 90 GRAUS SOLDAVEL DIAMETRO 60 mm","Un    ",3,1,null,null,null,null,null,""]
["S",3,"S",0,2,6,2,0,{"$f":"IF(AND($C533<=4,$C533<>0),0,IF(AND($C533=\"S\",$Y533>0),OFFSET(I533,-1,0)+1,OFFSET(I533,-1,0)))","v":0},0,0,"F","Serviço","Serviço","2.6.2.15.","AGETOP",81402,"TE 90 GRAUS SOLDAVEL DIAMETRO 25 mm","Un    ",2,1,null,null,null,null,null,""]
["S",3,"S",0,2,6,2,0,{"$f":"IF(AND($C534<=4,$C534<>0),0,IF(AND($C534=\"S\",$Y534>0),OFFSET(I534,-1,0)+1,OFFSET(I534,-1,0)))","v":0},0,0,"F","Serviço","Serviço","2.6.2.16.","AGETOP",81162,"BUCHA DE REDUCAO SOLD.CURTA 32 X 25 MM","Un    ",1,1,null,null,null,null,null,""]
["S",3,"S",0,2,6,2,0,{"$f":"IF(AND($C535<=4,$C535<>0),0,IF(AND($C535=\"S\",$Y535>0),OFFSET(I535,-1,0)+1,OFFSET(I535,-1,0)))","v":0},0,0,"F","Serviço","Serviço","2.6.2.17.","AGETOP",81179,"BUCHA DE REDUCAO SOLDAVEL LONGA 50 X 25 mm","Un    ",4,1,null,null,null,null,null,""]
["S",3,"S",0,2,6,2,0,{"$f":"IF(AND($C536<=4,$C536<>0),0,IF(AND($C536=\"S\",$Y536>0),OFFSET(I536,-1,0)+1,OFFSET(I536,-1,0)))","v":0},0,0,"F","Serviço","Serviço","2.6.2.18.","AGETOP",81182,"BUCHA DE REDUCAO SOLDAVEL LONGA 60 X 32 mm","Un    ",1,1,null,null,null,null,null,""]
["S",3,"S",0,2,6,2,0,{"$f":"IF(AND($C537<=4,$C537<>0),0,IF(AND($C537=\"S\",$Y537>0),OFFSET(I537,-1,0)+1,OFFSET(I537,-1,0)))","v":0},0,0,"F","Serviço","Serviço","2.6.2.19.","AGETOP",81405,"TE 90 GRAUS SOLDAVEL DIAMETRO 50 mm","Un    ",3,1,null,null,null,null,null,""]
["S",3,"S",0,2,6,2,0,{"$f":"IF(AND($C538<=4,$C538<>0),0,IF(AND($C538=\"S\",$Y538>0),OFFSET(I538,-1,0)+1,OFFSET(I538,-1,0)))","v":0},0,0,"F","Serviço","Serviço","2.6.2.20.","AGETOP",81406,"TE 90 GRAUS SOLDAVEL DIMETRO 60 mm","Un    ",4,1,null,null,null,null,null,""]
["S",3,"S",0,2,6,2,0,{"$f":"IF(AND($C539<=4,$C539<>0),0,IF(AND($C539=\"S\",$Y539>0),OFFSET(I539,-1,0)+1,OFFSET(I539,-1,0)))","v":0},0,0,"F","Serviço","Serviço","2.6.2.21.","AGETOP",81184,"BUCHA DE REDUCAO SOLDAVEL LONGA 60 X 50 mm","Un    ",3,1,null,null,null,null,null,""]
[3,3,3,14,2,6,3,0,{"$f":"IF(AND($C540<=4,$C540<>0),0,IF(AND($C540=\"S\",$Y540>0),OFFSET(I540,-1,0)+1,OFFSET(I540,-1,0)))","v":0},14,{"$error":"#N/A"},"F","Nível 3","Nível 3","2.6.3.","SINAPI",null,"ESGOTO","-",null,1,null,null,null,null,null,""]
["S",3,"S",0,2,6,3,0,{"$f":"IF(AND($C541<=4,$C541<>0),0,IF(AND($C541=\"S\",$Y541>0),OFFSET(I541,-1,0)+1,OFFSET(I541,-1,0)))","v":0},0,0,"F","Serviço","Serviço","2.6.3.1.","AGETOP",81730,"CURVA 90 GRAUS CURTA DIAM. 40 MM","Un    ",3,1,null,null,null,null,null,""]
["S",3,"S",0,2,6,3,0,{"$f":"IF(AND($C542<=4,$C542<>0),0,IF(AND($C542=\"S\",$Y542>0),OFFSET(I542,-1,0)+1,OFFSET(I542,-1,0)))","v":0},0,0,"F","Serviço","Serviço","2.6.3.2.","AGETOP",81921,"JOELHO 45 GRAUS DIAMETRO 40 MM","Un    ",6,1,null,null,null,null,null,""]
["S",3,"S",0,2,6,3,0,{"$f":"IF(AND($C543<=4,$C543<>0),0,IF(AND($C543=\"S\",$Y543>0),OFFSET(I543,-1,0)+1,OFFSET(I543,-1,0)))","v":0},0,0,"F","Serviço","Serviço","2.6.3.3.","AGETOP",81922,"JOELHO 45 GRAUS DIAMETRO 50 MM","Un    ",2,1,null,null,null,null,null,""]
["S",3,"S",0,2,6,3,0,{"$f":"IF(AND($C544<=4,$C544<>0),0,IF(AND($C544=\"S\",$Y544>0),OFFSET(I544,-1,0)+1,OFFSET(I544,-1,0)))","v":0},0,0,"F","Serviço","Serviço","2.6.3.4.","AGETOP",81737,"CURVA 90 GRAUS LONGA DIAM. 100 MM","Un    ",2,1,null,null,null,null,null,""]
["S",3,"S",0,2,6,3,0,{"$f":"IF(AND($C545<=4,$C545<>0),0,IF(AND($C545=\"S\",$Y545>0),OFFSET(I545,-1,0)+1,OFFSET(I545,-1,0)))","v":0},0,0,"F","Serviço","Serviço","2.6.3.5.","AGETOP",81936,"JOELHO 90 GRAUS DIAMETRO 50 MM","Un    ",10,1,null,null,null,null,null,""]
["S",3,"S",0,2,6,3,0,{"$f":"IF(AND($C546<=4,$C546<>0),0,IF(AND($C546=\"S\",$Y546>0),OFFSET(I546,-1,0)+1,OFFSET(I546,-1,0)))","v":0},0,0,"F","Serviço","Serviço","2.6.3.6.","AGETOP",81927,"JOELHO 90 GRAUS C/ANEL 40 mm ","Un    ",3,1,null,null,null,null,null,""]
["S",3,"S",0,2,6,3,0,{"$f":"IF(AND($C547<=4,$C547<>0),0,IF(AND($C547=\"S\",$Y547>0),OFFSET(I547,-1,0)+1,OFFSET(I547,-1,0)))","v":0},0,0,"F","Serviço","Serviço","2.6.3.7.","AGETOP",82230,"TE SANITARIO DIAMETRO 50 X 50 MM","Un    ",2,1,null,null,null,null,null,""]
["S",3,"S",0,2,6,3,0,{"$f":"IF(AND($C548<=4,$C548<>0),0,IF(AND($C548=\"S\",$Y548>0),OFFSET(I548,-1,0)+1,OFFSET(I548,-1,0)))","v":0},0,0,"F","Serviço","Serviço","2.6.3.8.","AGETOP",82301,"TUBO SOLD.P/ESGOTO DIAM. 40 MM","m     ",12,1,null,null,null,null,null,""]
["S",3,"S",0,2,6,3,0,{"$f":"IF(AND($C549<=4,$C549<>0),0,IF(AND($C549=\"S\",$Y549>0),OFFSET(I549,-1,0)+1,OFFSET(I549,-1,0)))","v":0},0,0,"F","Serviço","Serviço","2.6.3.9.","AGETOP",82302,"TUBO SOLD. P/ESGOTO DIAM. 50 MM","m     ",36,1,null,null,null,null,null,""]
["S",3,"S",0,2,6,3,0,{"$f":"IF(AND($C550<=4,$C550<>0),0,IF(AND($C550=\"S\",$Y550>0),OFFSET(I550,-1,0)+1,OFFSET(I550,-1,0)))","v":0},0,0,"F","Serviço","Serviço","2.6.3.10.","AGETOP",82304,"TUBO SOLDAVEL P/ESGOTO DIAM. 100 MM","m     ",30,1,null,null,null,null,null,""]
["S",3,"S",0,2,6,3,0,{"$f":"IF(AND($C551<=4,$C551<>0),0,IF(AND($C551=\"S\",$Y551>0),OFFSET(I551,-1,0)+1,OFFSET(I551,-1,0)))","v":0},0,0,"F","Serviço","Serviço","2.6.3.11.","AGETOP",82001,"LUVA SIMPLES DIAMETRO 40 MM","Un    ",2,1,null,null,null,null,null,""]
["S",3,"S",0,2,6,3,0,{"$f":"IF(AND($C552<=4,$C552<>0),0,IF(AND($C552=\"S\",$Y552>0),OFFSET(I552,-1,0)+1,OFFSET(I552,-1,0)))","v":0},0,0,"F","Serviço","Serviço","2.6.3.12.","AGETOP",82002,"LUVA SIMPLES DIAMETRO 50 MM","Un    ",5,1,null,null,null,null,null,""]
["S",3,"S",0,2,6,3,0,{"$f":"IF(AND($C553<=4,$C553<>0),0,IF(AND($C553=\"S\",$Y553>0),OFFSET(I553,-1,0)+1,OFFSET(I553,-1,0)))","v":0},0,0,"F","Serviço","Serviço","2.6.3.13.","AGETOP",82004,"LUVA SIMPLES DIAM. 100 MM","Un    ",5,1,null,null,null,null,null,""]
[2,2,2,4,2,7,0,0,{"$f":"IF(AND($C554<=4,$C554<>0),0,IF(AND($C554=\"S\",$Y554>0),OFFSET(I554,-1,0)+1,OFFSET(I554,-1,0)))","v":0},51,4,"F","Nível 2","Nível 2","2.7.","AGETOP",null,"ALVENARIAS E DIVISÓRIAS","-",null,1,null,null,null,null,null,""]
["S",2,"S",0,2,7,0,0,{"$f":"IF(AND($C555<=4,$C555<>0),0,IF(AND($C555=\"S\",$Y555>0),OFFSET(I555,-1,0)+1,OFFSET(I555,-1,0)))","v":0},0,0,"F","Serviço","Serviço","2.7.0.1.","AGETOP",100201,"ALVENARIA DE TIJOLO FURADO 1/2 VEZ - 9 x 19 x 19 - ARG. (1CALH:4ARML+100KG DE CI/M3)","m2    ",235.274,1,null,null,null,null,null,""]
["S",2,"S",0,2,7,0,0,{"$f":"IF(AND($C556<=4,$C556<>0),0,IF(AND($C556=\"S\",$Y556>0),OFFSET(I556,-1,0)+1,OFFSET(I556,-1,0)))","v":0},0,0,"F","Serviço","Serviço","2.7.0.2.","AGETOP",100204,"CUNHAMENTO/ALVENARIAS COM TIJOLO COMUM","m     ",89.88,1,null,null,null,null,null,""]
["S",2,"S",0,2,7,0,0,{"$f":"IF(AND($C557<=4,$C557<>0),0,IF(AND($C557=\"S\",$Y557>0),OFFSET(I557,-1,0)+1,OFFSET(I557,-1,0)))","v":0},0,0,"F","Serviço","Serviço","2.7.0.3.","AGETOP",100501,"ELEMENTO VAZADO DE CONCRETO","m2    ",3.944,1,null,null,null,null,null,""]
[2,2,2,2,2,8,0,0,{"$f":"IF(AND($C558<=4,$C558<>0),0,IF(AND($C558=\"S\",$Y558>0),OFFSET(I558,-1,0)+1,OFFSET(I558,-1,0)))","v":0},47,2,"F","Nível 2","Nível 2","2.8.",null,null,"IMPERMEABILIZAÇÃO","-",null,1,null,null,null,null,null,""]
["S",2,"S",0,2,8,0,0,{"$f":"IF(AND($C559<=4,$C559<>0),0,IF(AND($C559=\"S\",$Y559>0),OFFSET(I559,-1,0)+1,OFFSET(I559,-1,0)))","v":0},0,0,"F","Serviço","Serviço","2.8.0.1.","SINAPI","74106/1","IMPERMEABILIZACAO DE ESTRUTURAS ENTERRADAS, COM TINTA ASFALTICA, DUAS DEMAOS.","M2",75,1,null,null,null,null,null,""]
[2,2,2,2,2,9,0,0,{"$f":"IF(AND($C560<=4,$C560<>0),0,IF(AND($C560=\"S\",$Y560>0),OFFSET(I560,-1,0)+1,OFFSET(I560,-1,0)))","v":0},45,2,"F","Nível 2","Nível 2","2.9.",null,null,"ESTRUTURAS METÁLICAS","-",null,1,null,null,null,null,null,""]
["S",2,"S",0,2,9,0,0,{"$f":"IF(AND($C561<=4,$C561<>0),0,IF(AND($C561=\"S\",$Y561>0),OFFSET(I561,-1,0)+1,OFFSET(I561,-1,0)))","v":0},0,0,"F","Serviço","Serviço","2.9.0.1.","AGETOP",150103,"ESTRUTURA METÁLICA CONVENCIONAL EM AÇO DO TIPO USI SAC-300 COM FUNDO ANTICORROSIVO","Kg    ",1864.95,1,null,null,null,null,null,""]
[2,2,2,4,2,10,0,0,{"$f":"IF(AND($C562<=4,$C562<>0),0,IF(AND($C562=\"S\",$Y562>0),OFFSET(I562,-1,0)+1,OFFSET(I562,-1,0)))","v":0},43,4,"F","Nível 2","Nível 2","2.10.",null,null,"COBERTURAS","-",null,1,null,null,null,null,null,""]
["S",2,"S",0,2,10,0,0,{"$f":"IF(AND($C563<=4,$C563<>0),0,IF(AND($C563=\"S\",$Y563>0),OFFSET(I563,-1,0)+1,OFFSET(I563,-1,0)))","v":0},0,0,"F","Serviço","Serviço","2.10.0.1.","AGETOP",160401,"COBERTURA COM TELHA PLAN RESINADA COR VERMELHA","m2    ",225,1,null,null,null,null,null,""]
["S",2,"S",0,2,10,0,0,{"$f":"IF(AND($C564<=4,$C564<>0),0,IF(AND($C564=\"S\",$Y564>0),OFFSET(I564,-1,0)+1,OFFSET(I564,-1,0)))","v":0},0,0,"F","Serviço","Serviço","2.10.0.2.","SINAPI",94221,"CUMEEIRA PARA TELHA CERÂMICA EMBOÇADA COM ARGAMASSA TRAÇO 1:2:9 (CIMENTO, CAL E AREIA) PARA TELHADOS COM ATÉ 2 ÁGUAS, INCLUSO TRANSPORTE VERTICAL. AF_06/2016","M",22.75,1,null,null,null,null,null,""]
["S",2,"S",0,2,10,0,0,{"$f":"IF(AND($C565<=4,$C565<>0),0,IF(AND($C565=\"S\",$Y565>0),OFFSET(I565,-1,0)+1,OFFSET(I565,-1,0)))","v":0},0,0,"F","Serviço","Serviço","2.10.0.3.","AGETOP",160403,"EMBOCAMENTO LATERAL  (OITOES)","m     ",65.28,1,null,null,null,null,null,""]
[2,2,2,6,2,11,0,0,{"$f":"IF(AND($C566<=4,$C566<>0),0,IF(AND($C566=\"S\",$Y566>0),OFFSET(I566,-1,0)+1,OFFSET(I566,-1,0)))","v":0},39,6,"F","Nível 2","Nível 2","2.11.",null,null,"ESQUADRIAS METÁLICAS","-",null,1,null,null,null,null,null,""]
["S",2,"S",0,2,11,0,0,{"$f":"IF(AND($C567<=4,$C567<>0),0,IF(AND($C567=\"S\",$Y567>0),OFFSET(I567,-1,0)+1,OFFSET(I567,-1,0)))","v":0},0,0,"F","Serviço","Serviço","2.11.0.1.","AGETOP",180303,"PORTA DE ENROLAR C/FERRAGENS","m2    ",2.64,1,null,null,null,null,null,""]
["S",2,"S",0,2,11,0,0,{"$f":"IF(AND($C568<=4,$C568<>0),0,IF(AND($C568=\"S\",$Y568>0),OFFSET(I568,-1,0)+1,OFFSET(I568,-1,0)))","v":0},0,0,"F","Serviço","Serviço","2.11.0.2.","AGETOP",180305,"PORTAO DE TELA E CANO GALVANIZ. PT 9 C/FERRAGENS","m2    ",4.5,1,null,null,null,null,null,""]
["S",2,"S",0,2,11,0,0,{"$f":"IF(AND($C569<=4,$C569<>0),0,IF(AND($C569=\"S\",$Y569>0),OFFSET(I569,-1,0)+1,OFFSET(I569,-1,0)))","v":0},0,0,"F","Serviço","Serviço","2.11.0.3.","AGETOP",180403,"ESQ.MAXIMO AR CHAPA/VIDRO J1/J2/J7/J15 C/FERRAGENS","m2    ",24.200000000000003,1,null,null,null,null,null,""]
["S",2,"S",0,2,11,0,0,{"$f":"IF(AND($C570<=4,$C570<>0),0,IF(AND($C570=\"S\",$Y570>0),OFFSET(I570,-1,0)+1,OFFSET(I570,-1,0)))","v":0},0,0,"F","Serviço","Serviço","2.11.0.4.","AGETOP",180501,"PORTA DE ABRIR EM CHAPA PF-1 C/FERRAGENS","m2    ",15.120000000000001,1,null,null,null,null,null,""]
["S",2,"S",0,2,11,0,0,{"$f":"IF(AND($C571<=4,$C571<>0),0,IF(AND($C571=\"S\",$Y571>0),OFFSET(I571,-1,0)+1,OFFSET(I571,-1,0)))","v":0},0,0,"F","Serviço","Serviço","2.11.0.5.","AGETOP",180504,"PORTA ABRIR/VENEZIANA PF-4 C/FERRAGENS","m2    ",4.62,1,null,null,null,null,null,""]
[2,{"$f":"IF(OR(C572=\"s\",C572=0),OFFSET(B572,-1,0),C572)","v":2},{"$f":"IF(OFFSET(C572,-1,0)=\"L\",1,IF(OFFSET(C572,-1,0)=1,2,IF(OR(A572=\"s\",A572=0),\"S\",IF(AND(OFFSET(C572,-1,0)=2,A572=4),3,IF(AND(OR(OFFSET(C572,-1,0)=\"s\",OFFSET(C572,-1,0)=0),A572<>\"s\",A572>OFFSET(B572,-1,0)),OFFSET(B572,-1,0),A572)))))","v":2},{"$f":"IF(OR(C572=\"S\",C572=0),0,IF(ISERROR(K572),J572,SMALL(J572:K572,1)))","v":3},{"$f":"IF($C572=1,OFFSET(E572,-1,0)+1,OFFSET(E572,-1,0))","v":2},{"$f":"IF($C572=1,0,IF($C572=2,OFFSET(F572,-1,0)+1,OFFSET(F572,-1,0)))","v":12},{"$f":"IF(AND($C572<=2,$C572<>0),0,IF($C572=3,OFFSET(G572,-1,0)+1,OFFSET(G572,-1,0)))","v":0},{"$f":"IF(AND($C572<=3,$C572<>0),0,IF($C572=4,OFFSET(H572,-1,0)+1,OFFSET(H572,-1,0)))","v":0},{"$f":"IF(AND($C572<=4,$C572<>0),0,IF(AND($C572=\"S\",$Y572>0),OFFSET(I572,-1,0)+1,OFFSET(I572,-1,0)))","v":0},33,3,"F","Nível 2","Nível 2","2.12.",null,null,"VIDROS","-",null,1,null,null,null,null,null,""]
[{"$f":"CHOOSE(1+LOG(1+2*(ORÇAMENTO.Nivel=\"Nível 1\")+4*(ORÇAMENTO.Nivel=\"Nível 2\")+8*(ORÇAMENTO.Nivel=\"Nível 3\")+16*(ORÇAMENTO.Nivel=\"Nível 4\")+32*(ORÇAMENTO.Nivel=\"Serviço\"),2),0,1,2,3,4,\"S\")","v":"S"},2,"S",0,2,12,0,0,{"$f":"IF(AND($C573<=4,$C573<>0),0,IF(AND($C573=\"S\",$Y573>0),OFFSET(I573,-1,0)+1,OFFSET(I573,-1,0)))","v":0},0,0,"F","Serviço","Serviço","2.12.0.1.","AGETOP",190101,"VIDRO LISO 3 MM - COLOCADO","m2    ",22.44,1,null,null,null,null,null,""]
["S",2,"S",0,2,12,0,0,{"$f":"IF(AND($C574<=4,$C574<>0),0,IF(AND($C574=\"S\",$Y574>0),OFFSET(I574,-1,0)+1,OFFSET(I574,-1,0)))","v":0},0,0,"F","Serviço","Serviço","2.12.0.2.","AGETOP",190107,"VIDRO FANTASIA - COLOCADO","m2    ",1.76,1,null,null,null,null,null,""]
[2,2,2,6,2,13,0,0,{"$f":"IF(AND($C575<=4,$C575<>0),0,IF(AND($C575=\"S\",$Y575>0),OFFSET(I575,-1,0)+1,OFFSET(I575,-1,0)))","v":0},30,6,"F","Nível 2","Nível 2","2.13.",null,null,"REVESTIMENTO DE PAREDE","-",null,1,null,null,null,null,null,""]
["S",2,"S",0,2,13,0,0,{"$f":"IF(AND($C576<=4,$C576<>0),0,IF(AND($C576=\"S\",$Y576>0),OFFSET(I576,-1,0)+1,OFFSET(I576,-1,0)))","v":0},0,0,"F","Serviço","Serviço","2.13.0.1.","AGETOP",200101,"CHAPISCO COMUM","m2    ",478.43599999999998,1,null,null,null,null,null,""]
["S",2,"S",0,2,13,0,0,{"$f":"IF(AND($C577<=4,$C577<>0),0,IF(AND($C577=\"S\",$Y577>0),OFFSET(I577,-1,0)+1,OFFSET(I577,-1,0)))","v":0},0,0,"F","Serviço","Serviço","2.13.0.2.","AGETOP",200201,"EMBOÇO (1CI:4 ARML)","m2    ",78.099999999999994,1,null,null,null,null,null,""]
["S",2,"S",0,2,13,0,0,{"$f":"IF(AND($C578<=4,$C578<>0),0,IF(AND($C578=\"S\",$Y578>0),OFFSET(I578,-1,0)+1,OFFSET(I578,-1,0)))","v":0},0,0,"F","Serviço","Serviço","2.13.0.3.","AGETOP",200500,"REBOCO PAULISTA A-7 (1 CALH,4 ARMLC)","m2    ",400.33600000000001,1,null,null,null,null,null,""]
["S",2,"S",0,2,13,0,0,{"$f":"IF(AND($C579<=4,$C579<>0),0,IF(AND($C579=\"S\",$Y579>0),OFFSET(I579,-1,0)+1,OFFSET(I579,-1,0)))","v":0},0,0,"F","Serviço","Serviço","2.13.0.4.","AGETOP",201302,"REVESTIMENTO COM CERÂMICA ","m2    ",78.099999999999994,1,null,null,null,null,null,""]
["S",2,"S",0,2,13,0,0,{"$f":"IF(AND($C580<=4,$C580<>0),0,IF(AND($C580=\"S\",$Y580>0),OFFSET(I580,-1,0)+1,OFFSET(I580,-1,0)))","v":0},0,0,"F","Serviço","Serviço","2.13.0.5.","COMPOSIÇÃO","COMP 415_SEE","PEITORIL EM GRANITO CINZA, LARGURA VARIÁVEL E PINGADEIRA","M2",3.145,1,null,null,null,null,null,""]
[2,2,2,2,2,14,0,0,{"$f":"IF(AND($C581<=4,$C581<>0),0,IF(AND($C581=\"S\",$Y581>0),OFFSET(I581,-1,0)+1,OFFSET(I581,-1,0)))","v":0},24,2,"F","Nível 2","Nível 2","2.14.",null,null,"FORROS","-",null,1,null,null,null,null,null,""]
["S",2,"S",0,2,14,0,0,{"$f":"IF(AND($C582<=4,$C582<>0),0,IF(AND($C582=\"S\",$Y582>0),OFFSET(I582,-1,0)+1,OFFSET(I582,-1,0)))","v":0},0,0,"F","Serviço","Serviço","2.14.0.1.","AGETOP",210515,"GESSO CORRIDO EM TETO","m2    ",98.94,1,null,null,null,null,null,""]
[2,2,2,6,2,15,0,0,{"$f":"IF(AND($C583<=4,$C583<>0),0,IF(AND($C583=\"S\",$Y583>0),OFFSET(I583,-1,0)+1,OFFSET(I583,-1,0)))","v":0},22,6,"F","Nível 2","Nível 2","2.15.","SINAPI",null,"REVESTIMENTO DE PISO","-",null,1,null,null,null,null,null,""]
["S",2,"S",0,2,15,0,0,{"$f":"IF(AND($C584<=4,$C584<>0),0,IF(AND($C584=\"S\",$Y584>0),OFFSET(I584,-1,0)+1,OFFSET(I584,-1,0)))","v":0},{"$f":"IF(OR($C584=\"S\",$C584=0),0,MATCH(0,OFFSET($D584,1,$C584,ROW($C$1328)-ROW($C584)),0))","v":0},{"$f":"IF(OR($C584=\"S\",$C584=0),0,MATCH(OFFSET($D584,0,$C584)+1,OFFSET($D584,1,$C584,ROW($C$1328)-ROW($C584)),0))","v":0},"F","Serviço","Serviço","2.15.0.1.","AGETOP",220100,"PASSEIO PROTECAO EM CONC.DESEMPEN.5 CM 1:2,5:3,5 ( INCLUSO ESPELHO DE 30CM/ESCAVAÇÃO/REATERRO/APILOAMENTO/ATERRO INTERNO)","m2    ",54.85,1,null,null,null,null,null,""]
["S",2,"S",0,2,15,0,0,{"$f":"IF(AND($C585<=4,$C585<>0),0,IF(AND($C585=\"S\",$Y585>0),OFFSET(I585,-1,0)+1,OFFSET(I585,-1,0)))","v":0},0,0,"F","Serviço","Serviço","2.15.0.2.","AGETOP",220101,"LASTRO DE CONCRETO REGULARIZADO IMPERMEABILIZADO 1:3:6 ESP=5CM (BASE)","m2    ",225,1,null,null,null,null,null,""]
["S",2,"S",0,2,15,0,0,{"$f":"IF(AND($C586<=4,$C586<>0),0,IF(AND($C586=\"S\",$Y586>0),OFFSET(I586,-1,0)+1,OFFSET(I586,-1,0)))","v":0},0,0,"F","Serviço","Serviço","2.15.0.3.","AGETOP",221101,"GRANITINA 8MM FUNDIDA COM CONTRAPISO (1CI:3ARML) E=2CM E JUNTA PLASTICA 27MM","m2    ",153.19999999999999,1,null,null,null,null,null,""]
["S",2,"S",0,2,15,0,0,{"$f":"IF(AND($C587<=4,$C587<>0),0,IF(AND($C587=\"S\",$Y587>0),OFFSET(I587,-1,0)+1,OFFSET(I587,-1,0)))","v":0},0,0,"F","Serviço","Serviço","2.15.0.4.","AGETOP",221102,"RODAPÉ FUNDIDO DE GRANITINA 7CM","m     ",126.49,1,null,null,null,null,null,""]
["S",2,"S",0,2,15,0,0,{"$f":"IF(AND($C588<=4,$C588<>0),0,IF(AND($C588=\"S\",$Y588>0),OFFSET(I588,-1,0)+1,OFFSET(I588,-1,0)))","v":0},0,0,"F","Serviço","Serviço","2.15.0.5.","AGETOP",221104,"RASPAGEM E APLICAÇÃO RESINA ACRÍLICA DUAS DEMÃOS","m2    ",162.05429999999998,1,null,null,null,null,null,""]
[2,2,2,3,2,16,0,0,{"$f":"IF(AND($C589<=4,$C589<>0),0,IF(AND($C589=\"S\",$Y589>0),OFFSET(I589,-1,0)+1,OFFSET(I589,-1,0)))","v":0},16,3,"F","Nível 2","Nível 2","2.16.","SINAPI",null,"MARCENARIA","-",null,1,null,null,null,null,null,""]
["S",2,"S",0,2,16,0,0,{"$f":"IF(AND($C590<=4,$C590<>0),0,IF(AND($C590=\"S\",$Y590>0),OFFSET(I590,-1,0)+1,OFFSET(I590,-1,0)))","v":0},0,0,"F","Serviço","Serviço","2.16.0.1.","AGETOP",240110,"QUADRO AVISO TP-1 (1,20 X 1,20 M)","Un    ",2,1,null,null,null,null,null,""]
["S",2,"S",0,2,16,0,0,{"$f":"IF(AND($C591<=4,$C591<>0),0,IF(AND($C591=\"S\",$Y591>0),OFFSET(I591,-1,0)+1,OFFSET(I591,-1,0)))","v":0},0,0,"F","Serviço","Serviço","2.16.0.2.","AGETOP",240203,"PRATELEIRA MONTANTES EM ALVEN. APARENTE C/PINTURA","m2    ",24.969000000000001,1,null,null,null,null,null,""]
[2,2,2,9,2,17,0,0,{"$f":"IF(AND($C592<=4,$C592<>0),0,IF(AND($C592=\"S\",$Y592>0),OFFSET(I592,-1,0)+1,OFFSET(I592,-1,0)))","v":0},13,9,"F","Nível 2","Nível 2","2.17.","SINAPI",null,"PINTURA","-",null,1,null,null,null,null,null,""]
["S",2,"S",0,2,17,0,0,{"$f":"IF(AND($C593<=4,$C593<>0),0,IF(AND($C593=\"S\",$Y593>0),OFFSET(I593,-1,0)+1,OFFSET(I593,-1,0)))","v":0},0,0,"F","Serviço","Serviço","2.17.0.1.","AGETOP",261609,"PINTURA ESMALTE ALQUIDICO ESTR.METALICA 2 DEMAOS","m2    ",225,1,null,null,null,null,null,""]
["S",2,"S",0,2,17,0,0,{"$f":"IF(AND($C594<=4,$C594<>0),0,IF(AND($C594=\"S\",$Y594>0),OFFSET(I594,-1,0)+1,OFFSET(I594,-1,0)))","v":0},0,0,"F","Serviço","Serviço","2.17.0.2.","AGETOP",260601,"PINTURA TEXTURIZADA C/SELADOR ACRILICO","m2    ",115.855,1,null,null,null,null,null,""]
["S",2,"S",0,2,17,0,0,{"$f":"IF(AND($C595<=4,$C595<>0),0,IF(AND($C595=\"S\",$Y595>0),OFFSET(I595,-1,0)+1,OFFSET(I595,-1,0)))","v":0},0,0,"F","Serviço","Serviço","2.17.0.3.","AGETOP",261000,"PINTURA LATEX ACRILICA 2 DEMAOS C/SELADOR","m2    ",142.16199999999998,1,null,null,null,null,null,""]
["S",2,"S",0,2,17,0,0,{"$f":"IF(AND($C596<=4,$C596<>0),0,IF(AND($C596=\"S\",$Y596>0),OFFSET(I596,-1,0)+1,OFFSET(I596,-1,0)))","v":0},0,0,"F","Serviço","Serviço","2.17.0.4.","AGETOP",261304,"EMASSAMENTO ACRILICO 2 DEMAOS","m2    ",55.784999999999997,1,null,null,null,null,null,""]
["S",2,"S",0,2,17,0,0,{"$f":"IF(AND($C597<=4,$C597<>0),0,IF(AND($C597=\"S\",$Y597>0),OFFSET(I597,-1,0)+1,OFFSET(I597,-1,0)))","v":0},0,0,"F","Serviço","Serviço","2.17.0.5.","AGETOP",261550,"PINT.ESMALTE SINT.PAREDES - 2 DEM.C/SELADOR","m2    ",144.70499999999998,1,null,null,null,null,null,""]
["S",2,"S",0,2,17,0,0,{"$f":"IF(AND($C598<=4,$C598<>0),0,IF(AND($C598=\"S\",$Y598>0),OFFSET(I598,-1,0)+1,OFFSET(I598,-1,0)))","v":0},0,0,"F","Serviço","Serviço","2.17.0.6.","AGETOP",261300,"EMASSAMENTO COM MASSA PVA DUAS DEMAOS","m2    ",146.75199999999998,1,null,null,null,null,null,""]
["S",2,"S",0,2,17,0,0,{"$f":"IF(AND($C599<=4,$C599<>0),0,IF(AND($C599=\"S\",$Y599>0),OFFSET(I599,-1,0)+1,OFFSET(I599,-1,0)))","v":0},0,0,"F","Serviço","Serviço","2.17.0.7.","AGETOP",261602,"PINT.ESMALTE/ESQUAD.FERRO C/FUNDO ANTICOR.","m2    ",102.16000000000001,1,null,null,null,null,null,""]
["S",2,"S",0,2,17,0,0,{"$f":"IF(AND($C600<=4,$C600<>0),0,IF(AND($C600=\"S\",$Y600>0),OFFSET(I600,-1,0)+1,OFFSET(I600,-1,0)))","v":0},0,0,"F","Serviço","Serviço","2.17.0.8.","AGETOP",261623,"LETREIRO PEQ.PORTE A PINCEL EM PAREDE E PORTAS","m2    ",1.36,1,null,null,null,null,null,""]
[2,2,2,4,2,18,0,0,{"$f":"IF(AND($C601<=4,$C601<>0),0,IF(AND($C601=\"S\",$Y601>0),OFFSET(I601,-1,0)+1,OFFSET(I601,-1,0)))","v":0},4,163,"F","Nível 2","Nível 2","2.18.","SINAPI",null,"DIVERSOS","-",null,1,null,null,null,null,null,""]
["S",2,"S",0,2,18,0,0,{"$f":"IF(AND($C602<=4,$C602<>0),0,IF(AND($C602=\"S\",$Y602>0),OFFSET(I602,-1,0)+1,OFFSET(I602,-1,0)))","v":0},0,0,"F","Serviço","Serviço","2.18.0.1.","AGETOP",270501,"LIMPEZA FINAL DE OBRA - (OBRAS CIVIS)","m2    ",167.45,1,null,null,null,null,null,""]
["S",2,"S",0,2,18,0,0,{"$f":"IF(AND($C603<=4,$C603<>0),0,IF(AND($C603=\"S\",$Y603>0),OFFSET(I603,-1,0)+1,OFFSET(I603,-1,0)))","v":0},0,0,"F","Serviço","Serviço","2.18.0.2.","AGETOP",271303,"BANCO DE CONCRETO POLIDO BASE EM ALVENARIA REBOCADA E PINTADA - PADRÃO AGETOP 2015","m     ",2.95,1,null,null,null,null,null,""]
["S",2,"S",0,2,18,0,0,{"$f":"IF(AND($C604<=4,$C604<>0),0,IF(AND($C604=\"S\",$Y604>0),OFFSET(I604,-1,0)+1,OFFSET(I604,-1,0)))","v":0},0,0,"F","Serviço","Serviço","2.18.0.3.","AGETOP",271608,"BANCADA DE GRANITO C/ESPELHO","m2    ",5.93,1,null,null,null,null,null,""]
[1,1,1,164,3,0,0,0,{"$f":"IF(AND($C605<=4,$C605<>0),0,IF(AND($C605=\"S\",$Y605>0),OFFSET(I605,-1,0)+1,OFFSET(I605,-1,0)))","v":0},723,164,"F","Nível 1","Nível 1","3.","AGETOP",null,"BLOCO BIBLIOTECA E LABORATÓRIO DE CIÊNCIAS","UN",1,1,null,null,null,null,null,""]
[2,2,2,2,3,1,0,0,{"$f":"IF(AND($C606<=4,$C606<>0),0,IF(AND($C606=\"S\",$Y606>0),OFFSET(I606,-1,0)+1,OFFSET(I606,-1,0)))","v":0},163,2,"F","Nível 2","Nível 2","3.1.","AGETOP",null,"SERVIÇOS PRELIMINARES","-",null,1,null,null,null,null,null,""]
["S",2,"S",0,3,1,0,0,{"$f":"IF(AND($C607<=4,$C607<>0),0,IF(AND($C607=\"S\",$Y607>0),OFFSET(I607,-1,0)+1,OFFSET(I607,-1,0)))","v":0},0,0,"F","Serviço","Serviço","3.1.0.1.","AGETOP",20701,"LOCAÇÃO DA OBRA, EXECUÇÃO DE GABARITO SEM REAPROVEITAMENTO, INCLUSO PINTURA (FACE INTERNA DO RIPÃO 15CM) E PIQUETE COM TESTEMUNHA","m2    ",134.83000000000001,1,null,null,null,null,null,""]
[2,2,2,2,3,2,0,0,{"$f":"IF(AND($C608<=4,$C608<>0),0,IF(AND($C608=\"S\",$Y608>0),OFFSET(I608,-1,0)+1,OFFSET(I608,-1,0)))","v":0},161,2,"F","Nível 2","Nível 2","3.2.","AGETOP",null,"TRANSPORTES","-",null,1,null,null,null,null,null,""]
["S",2,"S",0,3,2,0,0,{"$f":"IF(AND($C609<=4,$C609<>0),0,IF(AND($C609=\"S\",$Y609>0),OFFSET(I609,-1,0)+1,OFFSET(I609,-1,0)))","v":0},0,0,"F","Serviço","Serviço","3.2.0.1.","AGETOP",30101,"TRANSPORTE DE ENTULHO EM CAMINHÃO  INCLUSO A CARGA MANUAL","m3    ",15,1,null,null,null,null,null,""]
[2,2,2,9,3,3,0,0,{"$f":"IF(AND($C610<=4,$C610<>0),0,IF(AND($C610=\"S\",$Y610>0),OFFSET(I610,-1,0)+1,OFFSET(I610,-1,0)))","v":0},159,9,"F","Nível 2","Nível 2","3.3.","AGETOP",null,"SERVIÇO EM TERRA","-",null,1,null,null,null,null,null,""]
["S",2,"S",0,3,3,0,0,{"$f":"IF(AND($C611<=4,$C611<>0),0,IF(AND($C611=\"S\",$Y611>0),OFFSET(I611,-1,0)+1,OFFSET(I611,-1,0)))","v":0},0,0,"F","Serviço","Serviço","3.3.0.1.","AGETOP",40101,"ESCAVACAO MANUAL DE VALAS < 1 MTS. (OBRAS CIVIS)","m3    ",6.38,1,null,null,null,null,null,""]
["S",2,"S",0,3,3,0,0,{"$f":"IF(AND($C612<=4,$C612<>0),0,IF(AND($C612=\"S\",$Y612>0),OFFSET(I612,-1,0)+1,OFFSET(I612,-1,0)))","v":0},0,0,"F","Serviço","Serviço","3.3.0.2.","AGETOP",40902,"REATERRO COM APILOAMENTO","m3    ",4.9000000000000004,1,null,null,null,null,null,""]
["S",2,"S",0,3,3,0,0,{"$f":"IF(AND($C613<=4,$C613<>0),0,IF(AND($C613=\"S\",$Y613>0),OFFSET(I613,-1,0)+1,OFFSET(I613,-1,0)))","v":0},0,0,"F","Serviço","Serviço","3.3.0.3.","AGETOP",41003,"ATERRO INTERNO SEM APILOAM.C/TR.EM CARRINHO MÃO","m3    ",117.35,1,null,null,null,null,null,""]
["S",2,"S",0,3,3,0,0,{"$f":"IF(AND($C614<=4,$C614<>0),0,IF(AND($C614=\"S\",$Y614>0),OFFSET(I614,-1,0)+1,OFFSET(I614,-1,0)))","v":0},0,0,"F","Serviço","Serviço","3.3.0.4.","AGETOP",41004,"ESCAVACAO MECANICA","m3    ",117.35,1,null,null,null,null,null,""]
["S",2,"S",0,3,3,0,0,{"$f":"IF(AND($C615<=4,$C615<>0),0,IF(AND($C615=\"S\",$Y615>0),OFFSET(I615,-1,0)+1,OFFSET(I615,-1,0)))","v":0},0,0,"F","Serviço","Serviço","3.3.0.5.","AGETOP",41005,"CARGA MECANIZADA","m3    ",117.35,1,null,null,null,null,null,""]
["S",2,"S",0,3,3,0,0,{"$f":"IF(AND($C616<=4,$C616<>0),0,IF(AND($C616=\"S\",$Y616>0),OFFSET(I616,-1,0)+1,OFFSET(I616,-1,0)))","v":0},0,0,"F","Serviço","Serviço","3.3.0.6.","AGETOP",41012,"INDENIZAÇÃO DE JAZIDA","m3    ",117.35,1,null,null,null,null,null,""]
["S",2,"S",0,3,3,0,0,{"$f":"IF(AND($C617<=4,$C617<>0),0,IF(AND($C617=\"S\",$Y617>0),OFFSET(I617,-1,0)+1,OFFSET(I617,-1,0)))","v":0},0,0,"F","Serviço","Serviço","3.3.0.7.","AGETOP",41006,"TRANSPORTE DE MATERIAL ESCAVADO M3.KM","m3km  ",352.05,1,null,null,null,null,null,""]
["S",2,"S",0,3,3,0,0,{"$f":"IF(AND($C618<=4,$C618<>0),0,IF(AND($C618=\"S\",$Y618>0),OFFSET(I618,-1,0)+1,OFFSET(I618,-1,0)))","v":0},0,0,"F","Serviço","Serviço","3.3.0.8.","AGETOP",41008,"COMPACTAÇÃO MECÂNICA COM CONTROLE DA UMIDADE (95% PN)","m3    ",93.88,1,null,null,null,null,null,""]
[2,2,2,14,3,4,0,0,{"$f":"IF(AND($C619<=4,$C619<>0),0,IF(AND($C619=\"S\",$Y619>0),OFFSET(I619,-1,0)+1,OFFSET(I619,-1,0)))","v":0},150,14,"F","Nível 2","Nível 2","3.4.","AGETOP",null,"FUNDAÇÕES E SONDAGENS","-",null,1,null,null,null,null,null,""]
["S",2,"S",0,3,4,0,0,{"$f":"IF(AND($C620<=4,$C620<>0),0,IF(AND($C620=\"S\",$Y620>0),OFFSET(I620,-1,0)+1,OFFSET(I620,-1,0)))","v":0},0,0,"F","Serviço","Serviço","3.4.0.1.","AGETOP",50250,"TRAÇO DE CONCRETO","Un    ",1,1,null,null,null,null,null,""]
["S",2,"S",0,3,4,0,0,{"$f":"IF(AND($C621<=4,$C621<>0),0,IF(AND($C621=\"S\",$Y621>0),OFFSET(I621,-1,0)+1,OFFSET(I621,-1,0)))","v":0},0,0,"F","Serviço","Serviço","3.4.0.2.","AGETOP",50251,"CORPO DE PROVA","Un    ",6,1,null,null,null,null,null,""]
["S",2,"S",0,3,4,0,0,{"$f":"IF(AND($C622<=4,$C622<>0),0,IF(AND($C622=\"S\",$Y622>0),OFFSET(I622,-1,0)+1,OFFSET(I622,-1,0)))","v":0},0,0,"F","Serviço","Serviço","3.4.0.3.","AGETOP",50302,"ESTACA A TRADO DIAM.30 CM SEM FERRO","M     ",111.5,1,null,null,null,null,null,""]
["S",2,"S",0,3,4,0,0,{"$f":"IF(AND($C623<=4,$C623<>0),0,IF(AND($C623=\"S\",$Y623>0),OFFSET(I623,-1,0)+1,OFFSET(I623,-1,0)))","v":0},0,0,"F","Serviço","Serviço","3.4.0.4.","AGETOP",50901,"ESCAVACAO MANUAL DE VALAS (SAPATAS/BLOCOS)","m3    ",9.7200000000000006,1,null,null,null,null,null,""]
["S",2,"S",0,3,4,0,0,{"$f":"IF(AND($C624<=4,$C624<>0),0,IF(AND($C624=\"S\",$Y624>0),OFFSET(I624,-1,0)+1,OFFSET(I624,-1,0)))","v":0},0,0,"F","Serviço","Serviço","3.4.0.5.","AGETOP",50902,"APILOAMENTO (BLOCOS/SAPATAS)","m2    ",7,1,null,null,null,null,null,""]
["S",2,"S",0,3,4,0,0,{"$f":"IF(AND($C625<=4,$C625<>0),0,IF(AND($C625=\"S\",$Y625>0),OFFSET(I625,-1,0)+1,OFFSET(I625,-1,0)))","v":0},0,0,"F","Serviço","Serviço","3.4.0.6.","AGETOP",50903,"REATERRO C/APILOAMENTO (BLOCOS/SAPATAS)","m3    ",5.52,1,null,null,null,null,null,""]
["S",2,"S",0,3,4,0,0,{"$f":"IF(AND($C626<=4,$C626<>0),0,IF(AND($C626=\"S\",$Y626>0),OFFSET(I626,-1,0)+1,OFFSET(I626,-1,0)))","v":0},0,0,"F","Serviço","Serviço","3.4.0.7.","AGETOP",51009,"FORMA TABUA PINHO P/FUNDACOES U=3V - (OBRAS CIVIS)","m2    ",22.8,1,null,null,null,null,null,""]
["S",2,"S",0,3,4,0,0,{"$f":"IF(AND($C627<=4,$C627<>0),0,IF(AND($C627=\"S\",$Y627>0),OFFSET(I627,-1,0)+1,OFFSET(I627,-1,0)))","v":0},0,0,"F","Serviço","Serviço","3.4.0.8.","AGETOP",51017,"PREPARO COM BETONEIRA E TRANSPORTE MANUAL DE CONCRETO FCK-20  - (O.C.)","m3    ",4.2,1,null,null,null,null,null,""]
["S",2,"S",0,3,4,0,0,{"$f":"IF(AND($C628<=4,$C628<>0),0,IF(AND($C628=\"S\",$Y628>0),OFFSET(I628,-1,0)+1,OFFSET(I628,-1,0)))","v":0},0,0,"F","Serviço","Serviço","3.4.0.9.","AGETOP",51025,"PREPARO SEM BETONEIRA E TRANSPORTE MANUAL DE CONCRETO PARA LASTRO  - (O.C.)","m3    ",0.35,1,null,null,null,null,null,""]
["S",2,"S",0,3,4,0,0,{"$f":"IF(AND($C629<=4,$C629<>0),0,IF(AND($C629=\"S\",$Y629>0),OFFSET(I629,-1,0)+1,OFFSET(I629,-1,0)))","v":0},0,0,"F","Serviço","Serviço","3.4.0.10.","AGETOP",51026,"LANÇAMENTO/APLICAÇÃO/ADENSAMENTO DE CONCRETO EM FUNDAÇÃO- (O.C.)","m3    ",4.55,1,null,null,null,null,null,""]
["S",2,"S",0,3,4,0,0,{"$f":"IF(AND($C630<=4,$C630<>0),0,IF(AND($C630=\"S\",$Y630>0),OFFSET(I630,-1,0)+1,OFFSET(I630,-1,0)))","v":0},0,0,"F","Serviço","Serviço","3.4.0.11.","AGETOP",52004,"ACO CA 50-A - 8,0 MM (5/16\") - (OBRAS CIVIS)","Kg    ",69.400000000000006,1,null,null,null,null,null,""]
["S",2,"S",0,3,4,0,0,{"$f":"IF(AND($C631<=4,$C631<>0),0,IF(AND($C631=\"S\",$Y631>0),OFFSET(I631,-1,0)+1,OFFSET(I631,-1,0)))","v":0},0,0,"F","Serviço","Serviço","3.4.0.12.","AGETOP",52005,"ACO CA-50A - 10,0 MM (3/8\") - (OBRAS CIVIS)","Kg    ",51.03,1,null,null,null,null,null,""]
["S",2,"S",0,3,4,0,0,{"$f":"IF(AND($C632<=4,$C632<>0),0,IF(AND($C632=\"S\",$Y632>0),OFFSET(I632,-1,0)+1,OFFSET(I632,-1,0)))","v":0},0,0,"F","Serviço","Serviço","3.4.0.13.","AGETOP",52014,"ACO CA-60 - 5,0 MM - (OBRAS CIVIS)","Kg    ",68.239999999999995,1,null,null,null,null,null,""]
[2,2,2,14,3,5,0,0,{"$f":"IF(AND($C633<=4,$C633<>0),0,IF(AND($C633=\"S\",$Y633>0),OFFSET(I633,-1,0)+1,OFFSET(I633,-1,0)))","v":0},136,14,"F","Nível 2","Nível 2","3.5.","AGETOP",null,"ESTRUTURA","-",null,1,null,null,null,null,null,""]
[{"$f":"CHOOSE(1+LOG(1+2*(ORÇAMENTO.Nivel=\"Nível 1\")+4*(ORÇAMENTO.Nivel=\"Nível 2\")+8*(ORÇAMENTO.Nivel=\"Nível 3\")+16*(ORÇAMENTO.Nivel=\"Nível 4\")+32*(ORÇAMENTO.Nivel=\"Serviço\"),2),0,1,2,3,4,\"S\")","v":"S"},2,"S",0,3,5,0,0,{"$f":"IF(AND($C634<=4,$C634<>0),0,IF(AND($C634=\"S\",$Y634>0),OFFSET(I634,-1,0)+1,OFFSET(I634,-1,0)))","v":0},0,0,"F","Serviço","Serviço","3.5.0.1.","AGETOP",60208,"FORMA CH.COMPENSADA 12MM-VIGA/PILAR U=3V - (OBRAS CIVIS","m2    ",116.57,1,null,null,null,null,null,""]
["S",2,"S",0,3,5,0,0,{"$f":"IF(AND($C635<=4,$C635<>0),0,IF(AND($C635=\"S\",$Y635>0),OFFSET(I635,-1,0)+1,OFFSET(I635,-1,0)))","v":0},0,0,"F","Serviço","Serviço","3.5.0.2.","AGETOP",60303,"ACO CA-50-A - 6,3 MM (1/4\") - (OBRAS CIVIS)","Kg    ",54,1,null,null,null,null,null,""]
["S",2,"S",0,3,5,0,0,{"$f":"IF(AND($C636<=4,$C636<>0),0,IF(AND($C636=\"S\",$Y636>0),OFFSET(I636,-1,0)+1,OFFSET(I636,-1,0)))","v":0},0,0,"F","Serviço","Serviço","3.5.0.3.","AGETOP",60304,"ACO CA-50 A - 8,0 MM (5/16\") - (OBRAS CIVIS)","Kg    ",37.6,1,null,null,null,null,null,""]
["S",2,"S",0,{"$f":"IF($C637=1,OFFSET(E637,-1,0)+1,OFFSET(E637,-1,0))","v":3},{"$f":"IF($C637=1,0,IF($C637=2,OFFSET(F637,-1,0)+1,OFFSET(F637,-1,0)))","v":5},{"$f":"IF(AND($C637<=2,$C637<>0),0,IF($C637=3,OFFSET(G637,-1,0)+1,OFFSET(G637,-1,0)))","v":0},{"$f":"IF(AND($C637<=3,$C637<>0),0,IF($C637=4,OFFSET(H637,-1,0)+1,OFFSET(H637,-1,0)))","v":0},{"$f":"IF(AND($C637<=4,$C637<>0),0,IF(AND($C637=\"S\",$Y637>0),OFFSET(I637,-1,0)+1,OFFSET(I637,-1,0)))","v":0},0,0,"F","Serviço","Serviço","3.5.0.4.","AGETOP",60305,"ACO CA-50A - 10,0 MM (3/8\") - (OBRAS CIVIS)","Kg    ",113.97,1,null,null,null,null,null,""]
["S",2,"S",0,3,5,0,0,{"$f":"IF(AND($C638<=4,$C638<>0),0,IF(AND($C638=\"S\",$Y638>0),OFFSET(I638,-1,0)+1,OFFSET(I638,-1,0)))","v":0},0,0,"F","Serviço","Serviço","3.5.0.5.","AGETOP",60306,"ACO CA-50A - 12,5 MM (1/2\") - (OBRAS CIVIS)","Kg    ",176,1,null,null,null,null,null,""]
["S",2,"S",0,3,5,0,0,{"$f":"IF(AND($C639<=4,$C639<>0),0,IF(AND($C639=\"S\",$Y639>0),OFFSET(I639,-1,0)+1,OFFSET(I639,-1,0)))","v":0},0,0,"F","Serviço","Serviço","3.5.0.6.","AGETOP",60307,"ACO CA-50 - 16,0 MM (5/8\") - (OBRAS CIVIS)","Kg    ",103,1,null,null,null,null,null,""]
["S",2,"S",0,3,5,0,0,{"$f":"IF(AND($C640<=4,$C640<>0),0,IF(AND($C640=\"S\",$Y640>0),OFFSET(I640,-1,0)+1,OFFSET(I640,-1,0)))","v":0},0,0,"F","Serviço","Serviço","3.5.0.7.","AGETOP",60314,"ACO CA - 60 - 5,0 MM - (OBRAS CIVIS)","Kg    ",133.6,1,null,null,null,null,null,""]
["S",2,"S",0,3,5,0,0,{"$f":"IF(AND($C641<=4,$C641<>0),0,IF(AND($C641=\"S\",$Y641>0),OFFSET(I641,-1,0)+1,OFFSET(I641,-1,0)))","v":0},0,0,"F","Serviço","Serviço","3.5.0.8.","AGETOP",60470,"LASTRO DE BRITA - (OBRAS CIVIS)","m3    ",0.3,1,null,null,null,null,null,""]
["S",2,"S",0,3,5,0,0,{"$f":"IF(AND($C642<=4,$C642<>0),0,IF(AND($C642=\"S\",$Y642>0),OFFSET(I642,-1,0)+1,OFFSET(I642,-1,0)))","v":0},0,0,"F","Serviço","Serviço","3.5.0.9.","AGETOP",60486,"TRAÇO DE CONCRETO","Un    ",1,1,null,null,null,null,null,""]
["S",{"$f":"IF(OR(C643=\"s\",C643=0),OFFSET(B643,-1,0),C643)","v":2},{"$f":"IF(OFFSET(C643,-1,0)=\"L\",1,IF(OFFSET(C643,-1,0)=1,2,IF(OR(A643=\"s\",A643=0),\"S\",IF(AND(OFFSET(C643,-1,0)=2,A643=4),3,IF(AND(OR(OFFSET(C643,-1,0)=\"s\",OFFSET(C643,-1,0)=0),A643<>\"s\",A643>OFFSET(B643,-1,0)),OFFSET(B643,-1,0),A643)))))","v":"S"},{"$f":"IF(OR(C643=\"S\",C643=0),0,IF(ISERROR(K643),J643,SMALL(J643:K643,1)))","v":0},3,5,0,0,{"$f":"IF(AND($C643<=4,$C643<>0),0,IF(AND($C643=\"S\",$Y643>0),OFFSET(I643,-1,0)+1,OFFSET(I643,-1,0)))","v":0},0,0,"F","Serviço","Serviço","3.5.0.10.","AGETOP",60487,"CORPO DE PROVA","Un    ",18,1,null,null,null,null,null,""]
["S",2,"S",0,3,5,0,0,{"$f":"IF(AND($C644<=4,$C644<>0),0,IF(AND($C644=\"S\",$Y644>0),OFFSET(I644,-1,0)+1,OFFSET(I644,-1,0)))","v":0},0,0,"F","Serviço","Serviço","3.5.0.11.","AGETOP",60507,"PREPARO COM BETONEIRA E TRANSPORTE MANUAL DE CONCRETO FCK-20 - (O.C.)","m3    ",5.95,1,null,null,null,null,null,""]
["S",2,"S",0,3,5,0,0,{"$f":"IF(AND($C645<=4,$C645<>0),0,IF(AND($C645=\"S\",$Y645>0),OFFSET(I645,-1,0)+1,OFFSET(I645,-1,0)))","v":0},0,0,"F","Serviço","Serviço","3.5.0.12.","AGETOP",60801,"LANÇAMENTO/APLICAÇÃO/ADENSAMENTO MANUAL DE CONCRETO - (OBRAS CIVIS)","m3    ",5.95,1,null,null,null,null,null,""]
["S",2,"S",0,3,5,0,0,{"$f":"IF(AND($C646<=4,$C646<>0),0,IF(AND($C646=\"S\",$Y646>0),OFFSET(I646,-1,0)+1,OFFSET(I646,-1,0)))","v":0},0,0,"F","Serviço","Serviço","3.5.0.13.","AGETOP",61101,"FORRO EM LAJE PRE-MOLDADA INC.CAPEAMENTO/FERR.DISTRIB./ESCORAMENTO E FORMA/DESFORMA","m2    ",101.1,1,null,null,null,null,null,""]
[2,2,2,41,3,6,0,0,{"$f":"IF(AND($C647<=4,$C647<>0),0,IF(AND($C647=\"S\",$Y647>0),OFFSET(I647,-1,0)+1,OFFSET(I647,-1,0)))","v":0},122,41,"F","Nível 2","Nível 2","3.6.","AGETOP",null,"INSTALAÇÕES ELÉTRICAS","-",null,1,null,null,null,null,null,""]
[3,3,3,5,3,6,1,0,{"$f":"IF(AND($C648<=4,$C648<>0),0,IF(AND($C648=\"S\",$Y648>0),OFFSET(I648,-1,0)+1,OFFSET(I648,-1,0)))","v":0},{"$f":"IF(OR($C648=\"S\",$C648=0),0,MATCH(0,OFFSET($D648,1,$C648,ROW($C$1328)-ROW($C648)),0))","v":40},{"$f":"IF(OR($C648=\"S\",$C648=0),0,MATCH(OFFSET($D648,0,$C648)+1,OFFSET($D648,1,$C648,ROW($C$1328)-ROW($C648)),0))","v":5},"F","Nível 3","Nível 3","3.6.1.","AGETOP",null,"QUADRO DE DISTRIBUIÇÃO","-",null,1,null,null,null,null,null,""]
["S",3,"S",0,3,6,1,0,{"$f":"IF(AND($C649<=4,$C649<>0),0,IF(AND($C649=\"S\",$Y649>0),OFFSET(I649,-1,0)+1,OFFSET(I649,-1,0)))","v":0},0,0,"","Serviço","Serviço","-","AGETOP",72185,"(sem código)","-",1,1,null,null,null,null,null,""]
["S",3,"S",0,3,6,1,0,{"$f":"IF(AND($C650<=4,$C650<>0),0,IF(AND($C650=\"S\",$Y650>0),OFFSET(I650,-1,0)+1,OFFSET(I650,-1,0)))","v":0},0,0,"F","Serviço","Serviço","3.6.1.1.","AGETOP",71173,"DISJUNTOR TRIPOLAR DE 10 A 35-A","Un    ",1,1,null,null,null,null,null,""]
["S",3,"S",0,3,6,1,0,{"$f":"IF(AND($C651<=4,$C651<>0),0,IF(AND($C651=\"S\",$Y651>0),OFFSET(I651,-1,0)+1,OFFSET(I651,-1,0)))","v":0},0,0,"F","Serviço","Serviço","3.6.1.2.","AGETOP",71171,"DISJUNTOR MONOPOLAR DE 10 A 32-A","Un    ",10,1,null,null,null,null,null,""]
["S",3,"S",0,3,6,1,0,{"$f":"IF(AND($C652<=4,$C652<>0),0,IF(AND($C652=\"S\",$Y652>0),OFFSET(I652,-1,0)+1,OFFSET(I652,-1,0)))","v":0},0,0,"F","Serviço","Serviço","3.6.1.3.","AGETOP",71450,"INTERRUPTOR DIFERENCIAL RESIDUAL (D.R.) BIPOLAR DE 25A-30mA","Un    ",2,1,null,null,null,null,null,""]
[3,3,3,4,3,6,2,0,{"$f":"IF(AND($C653<=4,$C653<>0),0,IF(AND($C653=\"S\",$Y653>0),OFFSET(I653,-1,0)+1,OFFSET(I653,-1,0)))","v":0},35,4,"F","Nível 3","Nível 3","3.6.2.","AGETOP",null,"CABOS E FIOS (CONDUTORES)","-",null,1,null,null,null,null,null,""]
["S",3,"S",0,3,6,2,0,{"$f":"IF(AND($C654<=4,$C654<>0),0,IF(AND($C654=\"S\",$Y654>0),OFFSET(I654,-1,0)+1,OFFSET(I654,-1,0)))","v":0},0,0,"F","Serviço","Serviço","3.6.2.1.","AGETOP",70563,"CABO ISOLADO PVC 750 V. No. 2,5 MM2","m     ",500,1,null,null,null,null,null,""]
["S",3,"S",0,3,6,2,0,{"$f":"IF(AND($C655<=4,$C655<>0),0,IF(AND($C655=\"S\",$Y655>0),OFFSET(I655,-1,0)+1,OFFSET(I655,-1,0)))","v":0},0,0,"F","Serviço","Serviço","3.6.2.2.","AGETOP",70564,"CABO ISOLADO PVC 750 V. No. 4 MM2","m     ",300,1,null,null,null,null,null,""]
["S",3,"S",0,3,6,2,0,{"$f":"IF(AND($C656<=4,$C656<>0),0,IF(AND($C656=\"S\",$Y656>0),OFFSET(I656,-1,0)+1,OFFSET(I656,-1,0)))","v":0},0,0,"F","Serviço","Serviço","3.6.2.3.","AGETOP",70541,"CABO DE COBRE NU No. 16 MM2 (6,94 M/KG)","M     ",10,1,null,null,null,null,null,""]
[3,3,3,31,3,6,3,0,{"$f":"IF(AND($C657<=4,$C657<>0),0,IF(AND($C657=\"S\",$Y657>0),OFFSET(I657,-1,0)+1,OFFSET(I657,-1,0)))","v":0},31,{"$error":"#N/A"},"F","Nível 3","Nível 3","3.6.3.","AGETOP",null,"ELETRODUTOS E ACESSÓRIOS","-",null,1,null,null,null,null,null,""]
["S",3,"S",0,3,6,3,0,{"$f":"IF(AND($C658<=4,$C658<>0),0,IF(AND($C658=\"S\",$Y658>0),OFFSET(I658,-1,0)+1,OFFSET(I658,-1,0)))","v":0},0,0,"F","Serviço","Serviço","3.6.3.1.","AGETOP",71194,"ELETRODUTO PVC FLEXÍVEL - MANGUEIRA CORRUGADA LEVE - DIAM. 25MM","M     ",150,1,null,null,null,null,null,""]
["S",3,"S",0,3,6,3,0,{"$f":"IF(AND($C659<=4,$C659<>0),0,IF(AND($C659=\"S\",$Y659>0),OFFSET(I659,-1,0)+1,OFFSET(I659,-1,0)))","v":0},0,0,"F","Serviço","Serviço","3.6.3.2.","AGETOP",71195,"ELETRODUTO PVC FLEXÍVEL - MANGUEIRA CORRUGADA LEVE - DIAM. 32MM","M     ",12,1,null,null,null,null,null,""]
["S",3,"S",0,3,6,3,0,{"$f":"IF(AND($C660<=4,$C660<>0),0,IF(AND($C660=\"S\",$Y660>0),OFFSET(I660,-1,0)+1,OFFSET(I660,-1,0)))","v":0},0,0,"F","Serviço","Serviço","3.6.3.3.","AGETOP",71201,"ELETRODUTO DE PVC RIGIDO DIAMETRO 3/4\"","M     ",30,1,null,null,null,null,null,""]
["S",3,"S",0,3,6,3,0,{"$f":"IF(AND($C661<=4,$C661<>0),0,IF(AND($C661=\"S\",$Y661>0),OFFSET(I661,-1,0)+1,OFFSET(I661,-1,0)))","v":0},0,0,"F","Serviço","Serviço","3.6.3.4.","AGETOP",71202,"ELETRODUTO DE PVC RIGIDO DIAMETRO 1\"","M     ",5,1,null,null,null,null,null,""]
["S",3,"S",0,3,6,3,0,{"$f":"IF(AND($C662<=4,$C662<>0),0,IF(AND($C662=\"S\",$Y662>0),OFFSET(I662,-1,0)+1,OFFSET(I662,-1,0)))","v":0},0,0,"F","Serviço","Serviço","3.6.3.5.","AGETOP",70681,"CAIXA METALICA OCTOGONAL FUNDO MOVEL, SIMPLES 2\"","Un    ",16,1,null,null,null,null,null,""]
["S",3,"S",0,3,6,3,0,{"$f":"IF(AND($C663<=4,$C663<>0),0,IF(AND($C663=\"S\",$Y663>0),OFFSET(I663,-1,0)+1,OFFSET(I663,-1,0)))","v":0},0,0,"F","Serviço","Serviço","3.6.3.6.","AGETOP",70680,"CAIXA MET.HEXAGONAL P/ARANDELA (SEXTAVADA 3\"X3\")","Un    ",4,1,null,null,null,null,null,""]
["S",3,"S",0,3,6,3,0,{"$f":"IF(AND($C664<=4,$C664<>0),0,IF(AND($C664=\"S\",$Y664>0),OFFSET(I664,-1,0)+1,OFFSET(I664,-1,0)))","v":0},0,0,"F","Serviço","Serviço","3.6.3.7.","AGETOP",70691,"CAIXA METALICA RET. 4\" X 2\" X 2\"","Un    ",33,1,null,null,null,null,null,""]
["S",3,"S",0,3,6,3,0,{"$f":"IF(AND($C665<=4,$C665<>0),0,IF(AND($C665=\"S\",$Y665>0),OFFSET(I665,-1,0)+1,OFFSET(I665,-1,0)))","v":0},0,0,"F","Serviço","Serviço","3.6.3.8.","AGETOP",70692,"CAIXA METALICA QUADRADA 4\"X4\"X2\"","Un    ",4,1,null,null,null,null,null,""]
["S",3,"S",0,3,6,3,0,{"$f":"IF(AND($C666<=4,$C666<>0),0,IF(AND($C666=\"S\",$Y666>0),OFFSET(I666,-1,0)+1,OFFSET(I666,-1,0)))","v":0},0,0,"F","Serviço","Serviço","3.6.3.9.","AGETOP",70645,"CAIXA DE PASSAGEM METÁLICA DE EMBUTIR 15X15X8 CM","Un    ",3,1,null,null,null,null,null,""]
["S",3,"S",0,3,6,3,0,{"$f":"IF(AND($C667<=4,$C667<>0),0,IF(AND($C667=\"S\",$Y667>0),OFFSET(I667,-1,0)+1,OFFSET(I667,-1,0)))","v":0},0,0,"F","Serviço","Serviço","3.6.3.10.","AGETOP",70646,"CAIXA DE PASSAGEM METÁLICA DE EMBUTIR 20X20X10 CM","Un    ",1,1,null,null,null,null,null,""]
["S",3,"S",0,3,6,3,0,{"$f":"IF(AND($C668<=4,$C668<>0),0,IF(AND($C668=\"S\",$Y668>0),OFFSET(I668,-1,0)+1,OFFSET(I668,-1,0)))","v":0},0,0,"F","Serviço","Serviço","3.6.3.11.","AGETOP",71141,"CURVA DE 90 GRAUS DE PVC RIGIDO DIAM. 3/4\"","Un    ",5,1,null,null,null,null,null,""]
["S",3,"S",0,3,6,3,0,{"$f":"IF(AND($C669<=4,$C669<>0),0,IF(AND($C669=\"S\",$Y669>0),OFFSET(I669,-1,0)+1,OFFSET(I669,-1,0)))","v":0},0,0,"F","Serviço","Serviço","3.6.3.12.","AGETOP",71142,"CURVA DE 90 GRAUS DE PVC RIGIDO DIAM. 1\"","Un    ",2,1,null,null,null,null,null,""]
["S",3,"S",0,3,6,3,0,{"$f":"IF(AND($C670<=4,$C670<>0),0,IF(AND($C670=\"S\",$Y670>0),OFFSET(I670,-1,0)+1,OFFSET(I670,-1,0)))","v":0},0,0,"F","Serviço","Serviço","3.6.3.13.","AGETOP",70351,"BRACADEIRA METALICA TIPO \"U\" DIAM. 3/4\"","Un    ",15,1,null,null,null,null,null,""]
["S",3,"S",0,3,6,3,0,{"$f":"IF(AND($C671<=4,$C671<>0),0,IF(AND($C671=\"S\",$Y671>0),OFFSET(I671,-1,0)+1,OFFSET(I671,-1,0)))","v":0},0,0,"F","Serviço","Serviço","3.6.3.14.","AGETOP",70352,"BRACADEIRA METALICA TIPO \"U\" DIAM. 1\"","Un    ",3,1,null,null,null,null,null,""]
["S",3,"S",0,3,6,3,0,{"$f":"IF(AND($C672<=4,$C672<>0),0,IF(AND($C672=\"S\",$Y672>0),OFFSET(I672,-1,0)+1,OFFSET(I672,-1,0)))","v":0},0,0,"F","Serviço","Serviço","3.6.3.15.","AGETOP",71741,"LUVA PVC ROSQUEAVEL DIAMETRO 3/4\"","Un    ",26,1,null,null,null,null,null,""]
["S",3,"S",0,3,6,3,0,{"$f":"IF(AND($C673<=4,$C673<>0),0,IF(AND($C673=\"S\",$Y673>0),OFFSET(I673,-1,0)+1,OFFSET(I673,-1,0)))","v":0},0,0,"F","Serviço","Serviço","3.6.3.16.","AGETOP",71742,"LUVA PVC ROSQUEAVEL DIAMETRO 1\"","Un    ",5,1,null,null,null,null,null,""]
["S",3,"S",0,3,6,3,0,{"$f":"IF(AND($C674<=4,$C674<>0),0,IF(AND($C674=\"S\",$Y674>0),OFFSET(I674,-1,0)+1,OFFSET(I674,-1,0)))","v":0},0,0,"F","Serviço","Serviço","3.6.3.17.","AGETOP",70421,"BUCHA E ARRUELA METALICA DIAM. 3/4\"","PR    ",15,1,null,null,null,null,null,""]
["S",3,"S",0,3,6,3,0,{"$f":"IF(AND($C675<=4,$C675<>0),0,IF(AND($C675=\"S\",$Y675>0),OFFSET(I675,-1,0)+1,OFFSET(I675,-1,0)))","v":0},0,0,"F","Serviço","Serviço","3.6.3.18.","AGETOP",70422,"BUCHA E ARRUELA METALICA DIAM. 1\"","PR    ",5,1,null,null,null,null,null,""]
["S",3,"S",0,3,6,3,0,{"$f":"IF(AND($C676<=4,$C676<>0),0,IF(AND($C676=\"S\",$Y676>0),OFFSET(I676,-1,0)+1,OFFSET(I676,-1,0)))","v":0},0,0,"F","Serviço","Serviço","3.6.3.19.","AGETOP",71331,"FITA ISOLANTE, ROLO DE 20,00 M","Un    ",5,1,null,null,null,null,null,""]
["S",3,"S",0,3,6,3,0,{"$f":"IF(AND($C677<=4,$C677<>0),0,IF(AND($C677=\"S\",$Y677>0),OFFSET(I677,-1,0)+1,OFFSET(I677,-1,0)))","v":0},0,0,"F","Serviço","Serviço","3.6.3.20.","AGETOP",70929,"CONDULETE METÁLICO - CAIXA COM 5 ENTRADAS ","un    ",7,1,null,null,null,null,null,""]
["S",3,"S",0,3,6,3,0,{"$f":"IF(AND($C678<=4,$C678<>0),0,IF(AND($C678=\"S\",$Y678>0),OFFSET(I678,-1,0)+1,OFFSET(I678,-1,0)))","v":0},0,0,"F","Serviço","Serviço","3.6.3.21.","AGETOP",70930,"CONDULETE METÁLICO - ADAPTADOR DE SAÍDA 3/4\" ","un    ",7,1,null,null,null,null,null,""]
["S",3,"S",0,3,6,3,0,{"$f":"IF(AND($C679<=4,$C679<>0),0,IF(AND($C679=\"S\",$Y679>0),OFFSET(I679,-1,0)+1,OFFSET(I679,-1,0)))","v":0},0,0,"F","Serviço","Serviço","3.6.3.22.","AGETOP",72395,"TAMPA CEGA PARA CONDULETE METÁLICO","Un    ",7,1,null,null,null,null,null,""]
["S",3,"S",0,3,6,3,0,{"$f":"IF(AND($C680<=4,$C680<>0),0,IF(AND($C680=\"S\",$Y680>0),OFFSET(I680,-1,0)+1,OFFSET(I680,-1,0)))","v":0},0,0,"F","Serviço","Serviço","3.6.3.23.","AGETOP",71610,"LUMINÁRIA TIPO ARANDELA DE USO EXTERNO BLINDADA COM GRADE ( PEQUENA ) - BASE E-27","un    ",4,1,null,null,null,null,null,""]
["S",3,"S",0,3,6,3,0,{"$f":"IF(AND($C681<=4,$C681<>0),0,IF(AND($C681=\"S\",$Y681>0),OFFSET(I681,-1,0)+1,OFFSET(I681,-1,0)))","v":0},0,0,"F","Serviço","Serviço","3.6.3.24.","AGETOP",71440,"INTERRUPTOR SIMPLES (1 SECAO)","Un    ",3,1,null,null,null,null,null,""]
["S",3,"S",0,3,6,3,0,{"$f":"IF(AND($C682<=4,$C682<>0),0,IF(AND($C682=\"S\",$Y682>0),OFFSET(I682,-1,0)+1,OFFSET(I682,-1,0)))","v":0},0,0,"F","Serviço","Serviço","3.6.3.25.","AGETOP",71644,"LUMINÁRIA TIPO PLAFON DE SOBREPOR QUADRADA PARA 02 LÂMPADAS","Un    ",16,1,null,null,null,null,null,""]
["S",3,"S",0,3,6,3,0,{"$f":"IF(AND($C683<=4,$C683<>0),0,IF(AND($C683=\"S\",$Y683>0),OFFSET(I683,-1,0)+1,OFFSET(I683,-1,0)))","v":0},0,0,"F","Serviço","Serviço","3.6.3.26.","AGETOP",71577,"LAMPADA COMPACTA ELETRÔNICA COM REATOR INTEGRADO  25/26 W","Un    ",32,1,null,null,null,null,null,""]
["S",3,"S",0,3,6,3,0,{"$f":"IF(AND($C684<=4,$C684<>0),0,IF(AND($C684=\"S\",$Y684>0),OFFSET(I684,-1,0)+1,OFFSET(I684,-1,0)))","v":0},0,0,"F","Serviço","Serviço","3.6.3.27.","AGETOP",71520,"LAMPADA A VAPOR DE MERCURIO 125 W","Un    ",4,1,null,null,null,null,null,""]
["S",3,"S",0,3,6,3,0,{"$f":"IF(AND($C685<=4,$C685<>0),0,IF(AND($C685=\"S\",$Y685>0),OFFSET(I685,-1,0)+1,OFFSET(I685,-1,0)))","v":0},0,0,"F","Serviço","Serviço","3.6.3.28.","AGETOP",72570,"TOMADA HEXAGONAL 2P + T - 10A - 250V (LINHA X OU EQUIVALENTE)","Un    ",16,1,null,null,null,null,null,""]
["S",3,"S",0,3,6,3,0,{"$f":"IF(AND($C686<=4,$C686<>0),0,IF(AND($C686=\"S\",$Y686>0),OFFSET(I686,-1,0)+1,OFFSET(I686,-1,0)))","v":0},0,0,"F","Serviço","Serviço","3.6.3.29.","AGETOP",72575,"TOMADA HEXAGONAL 2P + T - 20A - 250V (LINHA X OU EQUIVALENTE)","Un    ",14,1,null,null,null,null,null,""]
["S",3,"S",0,3,6,3,0,{"$f":"IF(AND($C687<=4,$C687<>0),0,IF(AND($C687=\"S\",$Y687>0),OFFSET(I687,-1,0)+1,OFFSET(I687,-1,0)))","v":0},0,0,"F","Serviço","Serviço","3.6.3.30.","AGETOP",71598,"LUMINÁRIA DE EMERGÊNCIA 30 LEDS","un    ",1,1,null,null,null,null,null,""]
[2,2,2,29,3,7,0,0,{"$f":"IF(AND($C688<=4,$C688<>0),0,IF(AND($C688=\"S\",$Y688>0),OFFSET(I688,-1,0)+1,OFFSET(I688,-1,0)))","v":0},81,29,"F","Nível 2","Nível 2","3.7.","AGETOP",null,"INSTALAÇÕES HIDROSSANITÁRIAS","-",null,1,null,null,null,null,null,""]
["S",2,"S",0,3,7,0,0,{"$f":"IF(AND($C689<=4,$C689<>0),0,IF(AND($C689=\"S\",$Y689>0),OFFSET(I689,-1,0)+1,OFFSET(I689,-1,0)))","v":0},0,0,"F","Serviço","Serviço","3.7.0.1.","AGETOP",80555,"LIGAÇÃO FLEXÍVEL METÁLICA DIAM.1/2\"(ENGATE)","Un    ",3,1,null,null,null,null,null,""]
["S",2,"S",0,3,7,0,0,{"$f":"IF(AND($C690<=4,$C690<>0),0,IF(AND($C690=\"S\",$Y690>0),OFFSET(I690,-1,0)+1,OFFSET(I690,-1,0)))","v":0},0,0,"F","Serviço","Serviço","3.7.0.2.","AGETOP",80660,"TORNEIRA DE PAREDE PARA PIA OU BEBEDOURO DIÂMETRO DE 1/2\" E 3/4\" ","Un    ",3,1,null,null,null,null,null,""]
["S",2,"S",0,3,7,0,0,{"$f":"IF(AND($C691<=4,$C691<>0),0,IF(AND($C691=\"S\",$Y691>0),OFFSET(I691,-1,0)+1,OFFSET(I691,-1,0)))","v":0},0,0,"F","Serviço","Serviço","3.7.0.3.","AGETOP",80671,"SIFAO PVC P/PIA 1.1/2\" X 2\"","Un    ",3,1,null,null,null,null,null,""]
["S",2,"S",0,3,7,0,0,{"$f":"IF(AND($C692<=4,$C692<>0),0,IF(AND($C692=\"S\",$Y692>0),OFFSET(I692,-1,0)+1,OFFSET(I692,-1,0)))","v":0},0,0,"F","Serviço","Serviço","3.7.0.4.","AGETOP",80680,"VALVULA P/PIA TIPO AMERICANA DIAM.3.1/2\" (METAL)","Un    ",3,1,null,null,null,null,null,""]
["S",2,"S",0,3,7,0,0,{"$f":"IF(AND($C693<=4,$C693<>0),0,IF(AND($C693=\"S\",$Y693>0),OFFSET(I693,-1,0)+1,OFFSET(I693,-1,0)))","v":0},0,0,"F","Serviço","Serviço","3.7.0.5.","AGETOP",80687,"CUBA INOX 35X40X15CM E=0,6MM-AÇO 304 (CUBA Nº 3)","Un    ",3,1,null,null,null,null,null,""]
["S",2,"S",0,3,7,0,0,{"$f":"IF(AND($C694<=4,$C694<>0),0,IF(AND($C694=\"S\",$Y694>0),OFFSET(I694,-1,0)+1,OFFSET(I694,-1,0)))","v":0},0,0,"F","Serviço","Serviço","3.7.0.6.","AGETOP",81823,"TAMPA PARA CAIXA PASSAGEM FERRO FUNDIDO T-33 - TRÁFEGO PESADO","Un    ",1,1,null,null,null,null,null,""]
["S",2,"S",0,3,7,0,0,{"$f":"IF(AND($C695<=4,$C695<>0),0,IF(AND($C695=\"S\",$Y695>0),OFFSET(I695,-1,0)+1,OFFSET(I695,-1,0)))","v":0},0,0,"F","Serviço","Serviço","3.7.0.7.","AGETOP",81825,"CAIXA DE PASSAGEM 60 X 60 CM SEM TAMPA","Un    ",1,1,null,null,null,null,null,""]
["S",2,"S",0,3,7,0,0,{"$f":"IF(AND($C696<=4,$C696<>0),0,IF(AND($C696=\"S\",$Y696>0),OFFSET(I696,-1,0)+1,OFFSET(I696,-1,0)))","v":0},0,0,"F","Serviço","Serviço","3.7.0.8.","AGETOP",81846,"CAIXA DE GORDURA E INSPEÇÃO EM PVC/ABS 19 LITROS COM TAMPA E PORTA TAMPA E CESTO DE LIMPEZA REMOVÍVEL","un    ",1,1,null,null,null,null,null,""]
["S",2,"S",0,3,7,0,0,{"$f":"IF(AND($C697<=4,$C697<>0),0,IF(AND($C697=\"S\",$Y697>0),OFFSET(I697,-1,0)+1,OFFSET(I697,-1,0)))","v":0},0,0,"F","Serviço","Serviço","3.7.0.9.","AGETOP",80926,"REGISTRO DE GAVETA C/CANOPLA DIAMETRO 3/4\"","Un    ",3,1,null,null,null,null,null,""]
[{"$f":"CHOOSE(1+LOG(1+2*(ORÇAMENTO.Nivel=\"Nível 1\")+4*(ORÇAMENTO.Nivel=\"Nível 2\")+8*(ORÇAMENTO.Nivel=\"Nível 3\")+16*(ORÇAMENTO.Nivel=\"Nível 4\")+32*(ORÇAMENTO.Nivel=\"Serviço\"),2),0,1,2,3,4,\"S\")","v":"S"},2,"S",0,3,7,0,0,{"$f":"IF(AND($C698<=4,$C698<>0),0,IF(AND($C698=\"S\",$Y698>0),OFFSET(I698,-1,0)+1,OFFSET(I698,-1,0)))","v":0},0,0,"F","Serviço","Serviço","3.7.0.10.","AGETOP",81003,"TUBO SOLDAVEL PVC MARROM DIAMETRO 25 mm","M     ",15,1,null,null,null,null,null,""]
["S",2,"S",0,3,7,0,0,{"$f":"IF(AND($C699<=4,$C699<>0),0,IF(AND($C699=\"S\",$Y699>0),OFFSET(I699,-1,0)+1,OFFSET(I699,-1,0)))","v":0},0,0,"F","Serviço","Serviço","3.7.0.11.","AGETOP",81004,"TUBO SOLDAVEL PVC MARROM DIAMETRO 32 mm","m     ",24,1,null,null,null,null,null,""]
["S",2,"S",0,3,7,0,0,{"$f":"IF(AND($C700<=4,$C700<>0),0,IF(AND($C700=\"S\",$Y700>0),OFFSET(I700,-1,0)+1,OFFSET(I700,-1,0)))","v":0},0,0,"F","Serviço","Serviço","3.7.0.12.","AGETOP",81066,"ADAPTAD.SOLD.CURTO C/BOLSA E ROSCA P/REG.25X3/4\"","Un    ",6,1,null,null,null,null,null,""]
["S",2,"S",0,{"$f":"IF($C701=1,OFFSET(E701,-1,0)+1,OFFSET(E701,-1,0))","v":3},{"$f":"IF($C701=1,0,IF($C701=2,OFFSET(F701,-1,0)+1,OFFSET(F701,-1,0)))","v":7},{"$f":"IF(AND($C701<=2,$C701<>0),0,IF($C701=3,OFFSET(G701,-1,0)+1,OFFSET(G701,-1,0)))","v":0},{"$f":"IF(AND($C701<=3,$C701<>0),0,IF($C701=4,OFFSET(H701,-1,0)+1,OFFSET(H701,-1,0)))","v":0},{"$f":"IF(AND($C701<=4,$C701<>0),0,IF(AND($C701=\"S\",$Y701>0),OFFSET(I701,-1,0)+1,OFFSET(I701,-1,0)))","v":0},0,0,"F","Serviço","Serviço","3.7.0.13.","AGETOP",81162,"BUCHA DE REDUCAO SOLD.CURTA 32 X 25 MM","Un    ",1,1,null,null,null,null,null,""]
["S",2,"S",0,3,7,0,0,{"$f":"IF(AND($C702<=4,$C702<>0),0,IF(AND($C702=\"S\",$Y702>0),OFFSET(I702,-1,0)+1,OFFSET(I702,-1,0)))","v":0},0,0,"F","Serviço","Serviço","3.7.0.14.","AGETOP",81321,"JOELHO 90 GRAUS SOLDAVEL DIAMETRO 25 MM","Un    ",3,1,null,null,null,null,null,""]
["S",2,"S",0,3,7,0,0,{"$f":"IF(AND($C703<=4,$C703<>0),0,IF(AND($C703=\"S\",$Y703>0),OFFSET(I703,-1,0)+1,OFFSET(I703,-1,0)))","v":0},0,0,"F","Serviço","Serviço","3.7.0.15.","AGETOP",81322,"JOELHO 90 GRAUS SOLDAVEL DIAMETRO 32 MM (1\")","Un    ",1,1,null,null,null,null,null,""]
["S",2,"S",0,3,7,0,0,{"$f":"IF(AND($C704<=4,$C704<>0),0,IF(AND($C704=\"S\",$Y704>0),OFFSET(I704,-1,0)+1,OFFSET(I704,-1,0)))","v":0},0,0,"F","Serviço","Serviço","3.7.0.16.","AGETOP",81369,"JOELHO 90 GRAUS SOLD. C/BUCHA LATAO 25 X 3/4\"","Un    ",3,1,null,null,null,null,null,""]
["S",2,"S",0,3,7,0,0,{"$f":"IF(AND($C705<=4,$C705<>0),0,IF(AND($C705=\"S\",$Y705>0),OFFSET(I705,-1,0)+1,OFFSET(I705,-1,0)))","v":0},0,0,"F","Serviço","Serviço","3.7.0.17.","AGETOP",81421,"TE REDUCAO 90 GRAUS SOLDAVEL 32 X 25 mm","Un    ",2,1,null,null,null,null,null,""]
["S",2,"S",0,3,7,0,0,{"$f":"IF(AND($C706<=4,$C706<>0),0,IF(AND($C706=\"S\",$Y706>0),OFFSET(I706,-1,0)+1,OFFSET(I706,-1,0)))","v":0},0,0,"F","Serviço","Serviço","3.7.0.18.","AGETOP",81602,"BUCHA DE REDUCAO LONGA DIAM. 50 X 40 MM","Un    ",3,1,null,null,null,null,null,""]
["S",{"$f":"IF(OR(C707=\"s\",C707=0),OFFSET(B707,-1,0),C707)","v":2},{"$f":"IF(OFFSET(C707,-1,0)=\"L\",1,IF(OFFSET(C707,-1,0)=1,2,IF(OR(A707=\"s\",A707=0),\"S\",IF(AND(OFFSET(C707,-1,0)=2,A707=4),3,IF(AND(OR(OFFSET(C707,-1,0)=\"s\",OFFSET(C707,-1,0)=0),A707<>\"s\",A707>OFFSET(B707,-1,0)),OFFSET(B707,-1,0),A707)))))","v":"S"},{"$f":"IF(OR(C707=\"S\",C707=0),0,IF(ISERROR(K707),J707,SMALL(J707:K707,1)))","v":0},3,7,0,0,{"$f":"IF(AND($C707<=4,$C707<>0),0,IF(AND($C707=\"S\",$Y707>0),OFFSET(I707,-1,0)+1,OFFSET(I707,-1,0)))","v":0},0,0,"F","Serviço","Serviço","3.7.0.19.","AGETOP",81885,"TERMINAL DE VENTILACAO DIAMETRO 50 MM","Un    ",1,1,null,null,null,null,null,""]
["S",2,"S",0,3,7,0,0,{"$f":"IF(AND($C708<=4,$C708<>0),0,IF(AND($C708=\"S\",$Y708>0),OFFSET(I708,-1,0)+1,OFFSET(I708,-1,0)))","v":0},0,0,"F","Serviço","Serviço","3.7.0.20.","AGETOP",81922,"JOELHO 45 GRAUS DIAMETRO 50 MM","Un    ",4,1,null,null,null,null,null,""]
["S",2,"S",0,3,7,0,0,{"$f":"IF(AND($C709<=4,$C709<>0),0,IF(AND($C709=\"S\",$Y709>0),OFFSET(I709,-1,0)+1,OFFSET(I709,-1,0)))","v":0},0,0,"F","Serviço","Serviço","3.7.0.21.","AGETOP",81935,"JOELHO 90 GRAUS DIAMETRO 40 MM","Un    ",3,1,null,null,null,null,null,""]
["S",2,"S",0,3,7,0,0,{"$f":"IF(AND($C710<=4,$C710<>0),0,IF(AND($C710=\"S\",$Y710>0),OFFSET(I710,-1,0)+1,OFFSET(I710,-1,0)))","v":0},0,0,"F","Serviço","Serviço","3.7.0.22.","AGETOP",81936,"JOELHO 90 GRAUS DIAMETRO 50 MM","Un    ",2,1,null,null,null,null,null,""]
["S",2,"S",0,3,7,0,0,{"$f":"IF(AND($C711<=4,$C711<>0),0,IF(AND($C711=\"S\",$Y711>0),OFFSET(I711,-1,0)+1,OFFSET(I711,-1,0)))","v":0},0,0,"F","Serviço","Serviço","3.7.0.23.","AGETOP",81923,"JOELHO 45 GRAUS DIAMETRO 75 MM","Un    ",3,1,null,null,null,null,null,""]
["S",2,"S",0,3,7,0,0,{"$f":"IF(AND($C712<=4,$C712<>0),0,IF(AND($C712=\"S\",$Y712>0),OFFSET(I712,-1,0)+1,OFFSET(I712,-1,0)))","v":0},{"$f":"IF(OR($C712=\"S\",$C712=0),0,MATCH(0,OFFSET($D712,1,$C712,ROW($C$1328)-ROW($C712)),0))","v":0},{"$f":"IF(OR($C712=\"S\",$C712=0),0,MATCH(OFFSET($D712,0,$C712)+1,OFFSET($D712,1,$C712,ROW($C$1328)-ROW($C712)),0))","v":0},"F","Serviço","Serviço","3.7.0.24.","AGETOP",81973,"JUNCAO SIMPLES DIAM. 100 X 50 MM","Un    ",2,1,null,null,null,null,null,""]
["S",2,"S",0,3,7,0,0,{"$f":"IF(AND($C713<=4,$C713<>0),0,IF(AND($C713=\"S\",$Y713>0),OFFSET(I713,-1,0)+1,OFFSET(I713,-1,0)))","v":0},0,0,"F","Serviço","Serviço","3.7.0.25.","AGETOP",82103,"REDUCAO EXCENTRICA 100 X 50 MM","Un    ",1,1,null,null,null,null,null,""]
["S",2,"S",0,3,7,0,0,{"$f":"IF(AND($C714<=4,$C714<>0),0,IF(AND($C714=\"S\",$Y714>0),OFFSET(I714,-1,0)+1,OFFSET(I714,-1,0)))","v":0},0,0,"F","Serviço","Serviço","3.7.0.26.","AGETOP",82301,"TUBO SOLD.P/ESGOTO DIAM. 40 MM","m     ",3,1,null,null,null,null,null,""]
["S",2,"S",0,3,7,0,0,{"$f":"IF(AND($C715<=4,$C715<>0),0,IF(AND($C715=\"S\",$Y715>0),OFFSET(I715,-1,0)+1,OFFSET(I715,-1,0)))","v":0},0,0,"F","Serviço","Serviço","3.7.0.27.","AGETOP",82302,"TUBO SOLD. P/ESGOTO DIAM. 50 MM","m     ",24,1,null,null,null,null,null,""]
["S",2,"S",0,3,7,0,0,{"$f":"IF(AND($C716<=4,$C716<>0),0,IF(AND($C716=\"S\",$Y716>0),OFFSET(I716,-1,0)+1,OFFSET(I716,-1,0)))","v":0},0,0,"F","Serviço","Serviço","3.7.0.28.","AGETOP",82304,"TUBO SOLDAVEL P/ESGOTO DIAM. 100 MM","m     ",24,1,null,null,null,null,null,""]
[2,2,2,3,3,8,0,0,{"$f":"IF(AND($C717<=4,$C717<>0),0,IF(AND($C717=\"S\",$Y717>0),OFFSET(I717,-1,0)+1,OFFSET(I717,-1,0)))","v":0},52,3,"F","Nível 2","Nível 2","3.8.","AGETOP",null,"ALVENARIAS E DIVISÓRIAS","-",null,1,null,null,null,null,null,""]
["S",2,"S",0,3,8,0,0,{"$f":"IF(AND($C718<=4,$C718<>0),0,IF(AND($C718=\"S\",$Y718>0),OFFSET(I718,-1,0)+1,OFFSET(I718,-1,0)))","v":0},0,0,"F","Serviço","Serviço","3.8.0.1.","AGETOP",100102,"ALVENARIA DE TIJOLO COMUM 1/2 VEZ - ARG. (1CI : 2CH : 8ARML)","m2    ",10.52,1,null,null,null,null,null,""]
["S",2,"S",0,3,8,0,0,{"$f":"IF(AND($C719<=4,$C719<>0),0,IF(AND($C719=\"S\",$Y719>0),OFFSET(I719,-1,0)+1,OFFSET(I719,-1,0)))","v":0},0,0,"F","Serviço","Serviço","3.8.0.2.","AGETOP",100201,"ALVENARIA DE TIJOLO FURADO 1/2 VEZ - 9 x 19 x 19 - ARG. (1CALH:4ARML+100KG DE CI/M3)","m2    ",118.35,1,null,null,null,null,null,""]
[2,2,2,2,3,9,0,0,{"$f":"IF(AND($C720<=4,$C720<>0),0,IF(AND($C720=\"S\",$Y720>0),OFFSET(I720,-1,0)+1,OFFSET(I720,-1,0)))","v":0},49,2,"F","Nível 2","Nível 2","3.9.","AGETOP",null,"IMPERMEABILIZAÇÃO","-",null,1,null,null,null,null,null,""]
["S",2,"S",0,3,9,0,0,{"$f":"IF(AND($C721<=4,$C721<>0),0,IF(AND($C721=\"S\",$Y721>0),OFFSET(I721,-1,0)+1,OFFSET(I721,-1,0)))","v":0},0,0,"F","Serviço","Serviço","3.9.0.1.","AGETOP",120902,"IMPERMEABILIZACAO VIGAS BALDRAMES E=2,0 CM","m2    ",20.64,1,null,null,null,null,null,""]
[2,2,2,2,3,10,0,0,{"$f":"IF(AND($C722<=4,$C722<>0),0,IF(AND($C722=\"S\",$Y722>0),OFFSET(I722,-1,0)+1,OFFSET(I722,-1,0)))","v":0},47,2,"F","Nível 2","Nível 2","3.10.","AGETOP",null,"ESTRUTURAS METÁLICAS","-",null,1,null,null,null,null,null,""]
["S",2,"S",0,3,10,0,0,{"$f":"IF(AND($C723<=4,$C723<>0),0,IF(AND($C723=\"S\",$Y723>0),OFFSET(I723,-1,0)+1,OFFSET(I723,-1,0)))","v":0},0,0,"F","Serviço","Serviço","3.10.0.1.","AGETOP",150103,"ESTRUTURA METÁLICA CONVENCIONAL EM AÇO DO TIPO USI SAC-300 COM FUNDO ANTICORROSIVO","Kg    ",1321.78,1,null,null,null,null,null,""]
[2,2,2,5,3,11,0,0,{"$f":"IF(AND($C724<=4,$C724<>0),0,IF(AND($C724=\"S\",$Y724>0),OFFSET(I724,-1,0)+1,OFFSET(I724,-1,0)))","v":0},45,5,"F","Nível 2","Nível 2","3.11.","AGETOP",null,"COBERTURAS","-",null,1,null,null,null,null,null,""]
["S",2,"S",0,3,11,0,0,{"$f":"IF(AND($C725<=4,$C725<>0),0,IF(AND($C725=\"S\",$Y725>0),OFFSET(I725,-1,0)+1,OFFSET(I725,-1,0)))","v":0},0,0,"F","Serviço","Serviço","3.11.0.1.","AGETOP",160401,"COBERTURA COM TELHA PLAN RESINADA COR VERMELHA","m2    ",181.37,1,null,null,null,null,null,""]
["S",2,"S",0,3,11,0,0,{"$f":"IF(AND($C726<=4,$C726<>0),0,IF(AND($C726=\"S\",$Y726>0),OFFSET(I726,-1,0)+1,OFFSET(I726,-1,0)))","v":0},0,0,"F","Serviço","Serviço","3.11.0.2.","AGETOP",160402,"CUMEEIRA  P/ TELHA PLAN RESINADA COR VERMELHA","m     ",16.95,1,null,null,null,null,null,""]
["S",2,"S",0,3,11,0,0,{"$f":"IF(AND($C727<=4,$C727<>0),0,IF(AND($C727=\"S\",$Y727>0),OFFSET(I727,-1,0)+1,OFFSET(I727,-1,0)))","v":0},0,0,"F","Serviço","Serviço","3.11.0.3.","AGETOP",160403,"EMBOCAMENTO LATERAL  (OITOES)","m     ",21.4,1,null,null,null,null,null,""]
["S",2,"S",0,3,11,0,0,{"$f":"IF(AND($C728<=4,$C728<>0),0,IF(AND($C728=\"S\",$Y728>0),OFFSET(I728,-1,0)+1,OFFSET(I728,-1,0)))","v":0},0,0,"F","Serviço","Serviço","3.11.0.4.","AGETOP",160404,"EMBOCAMENTO DE BEIRAL","M     ",33.9,1,null,null,null,null,null,""]
[2,2,2,4,3,12,0,0,{"$f":"IF(AND($C729<=4,$C729<>0),0,IF(AND($C729=\"S\",$Y729>0),OFFSET(I729,-1,0)+1,OFFSET(I729,-1,0)))","v":0},40,4,"F","Nível 2","Nível 2","3.12.","AGETOP",null,"ESQUADRIAS METÁLICAS","-",null,1,null,null,null,null,null,""]
["S",2,"S",0,3,12,0,0,{"$f":"IF(AND($C730<=4,$C730<>0),0,IF(AND($C730=\"S\",$Y730>0),OFFSET(I730,-1,0)+1,OFFSET(I730,-1,0)))","v":0},0,0,"F","Serviço","Serviço","3.12.0.1.","AGETOP",180501,"PORTA DE ABRIR EM CHAPA PF-1 C/FERRAGENS","m2    ",3.36,1,null,null,null,null,null,""]
["S",2,"S",0,3,12,0,0,{"$f":"IF(AND($C731<=4,$C731<>0),0,IF(AND($C731=\"S\",$Y731>0),OFFSET(I731,-1,0)+1,OFFSET(I731,-1,0)))","v":0},0,0,"F","Serviço","Serviço","3.12.0.2.","AGETOP",180311,"GRADE DE PROTECAO/TUBO INDUSTRIAL/FERRO REDONDO-GP5","m2    ",31.2,1,null,null,null,null,null,""]
["S",2,"S",0,3,12,0,0,{"$f":"IF(AND($C732<=4,$C732<>0),0,IF(AND($C732=\"S\",$Y732>0),OFFSET(I732,-1,0)+1,OFFSET(I732,-1,0)))","v":0},0,0,"F","Serviço","Serviço","3.12.0.3.","AGETOP",180403,"ESQ.MAXIMO AR CHAPA/VIDRO J1/J2/J7/J15 C/FERRAGENS","m2    ",28.8,1,null,null,null,null,null,""]
[2,2,2,3,3,13,0,0,{"$f":"IF(AND($C733<=4,$C733<>0),0,IF(AND($C733=\"S\",$Y733>0),OFFSET(I733,-1,0)+1,OFFSET(I733,-1,0)))","v":0},36,3,"F","Nível 2","Nível 2","3.13.","AGETOP",null,"VIDROS","-",null,1,null,null,null,null,null,""]
["S",2,"S",0,3,13,0,0,{"$f":"IF(AND($C734<=4,$C734<>0),0,IF(AND($C734=\"S\",$Y734>0),OFFSET(I734,-1,0)+1,OFFSET(I734,-1,0)))","v":0},0,0,"F","Serviço","Serviço","3.13.0.1.","AGETOP",190102,"VIDRO LISO 4 MM - COLOCADO","m2    ",17.28,1,null,null,null,null,null,""]
["S",2,"S",0,3,13,0,0,{"$f":"IF(AND($C735<=4,$C735<>0),0,IF(AND($C735=\"S\",$Y735>0),OFFSET(I735,-1,0)+1,OFFSET(I735,-1,0)))","v":0},0,0,"F","Serviço","Serviço","3.13.0.2.","AGETOP",190107,"VIDRO FANTASIA - COLOCADO","m2    ",11.52,1,null,null,null,null,null,""]
[2,2,2,6,3,14,0,0,{"$f":"IF(AND($C736<=4,$C736<>0),0,IF(AND($C736=\"S\",$Y736>0),OFFSET(I736,-1,0)+1,OFFSET(I736,-1,0)))","v":0},33,6,"F","Nível 2","Nível 2","3.14.","AGETOP",null,"REVESTIMENTO DE PAREDE","-",null,1,null,null,null,null,null,""]
["S",2,"S",0,3,14,0,0,{"$f":"IF(AND($C737<=4,$C737<>0),0,IF(AND($C737=\"S\",$Y737>0),OFFSET(I737,-1,0)+1,OFFSET(I737,-1,0)))","v":0},0,0,"F","Serviço","Serviço","3.14.0.1.","AGETOP",200101,"CHAPISCO COMUM","m2    ",265.70999999999998,1,null,null,null,null,null,""]
["S",2,"S",0,3,14,0,0,{"$f":"IF(AND($C738<=4,$C738<>0),0,IF(AND($C738=\"S\",$Y738>0),OFFSET(I738,-1,0)+1,OFFSET(I738,-1,0)))","v":0},0,0,"F","Serviço","Serviço","3.14.0.2.","AGETOP",200201,"EMBOÇO (1CI:4 ARML)","m2    ",74.5,1,null,null,null,null,null,""]
["S",2,"S",0,3,14,0,0,{"$f":"IF(AND($C739<=4,$C739<>0),0,IF(AND($C739=\"S\",$Y739>0),OFFSET(I739,-1,0)+1,OFFSET(I739,-1,0)))","v":0},0,0,"F","Serviço","Serviço","3.14.0.3.","AGETOP",200499,"REBOCO PAULISTA A-14 (1CALH:4ARMLC+100kgCI/M3)","m2    ",191.21,1,null,null,null,null,null,""]
["S",2,"S",0,3,14,0,0,{"$f":"IF(AND($C740<=4,$C740<>0),0,IF(AND($C740=\"S\",$Y740>0),OFFSET(I740,-1,0)+1,OFFSET(I740,-1,0)))","v":0},0,0,"F","Serviço","Serviço","3.14.0.4.","AGETOP",201302,"REVESTIMENTO COM CERÂMICA ","m2    ",74.5,1,null,null,null,null,null,""]
["S",2,"S",0,3,14,0,0,{"$f":"IF(AND($C741<=4,$C741<>0),0,IF(AND($C741=\"S\",$Y741>0),OFFSET(I741,-1,0)+1,OFFSET(I741,-1,0)))","v":0},0,0,"F","Serviço","Serviço","3.14.0.5.","COMPOSIÇÃO","COMP 415_SEE","PEITORIL EM GRANITO CINZA, LARGURA VARIÁVEL E PINGADEIRA","M2",2.4480000000000004,1,null,null,null,null,null,""]
[2,2,2,3,3,15,0,0,{"$f":"IF(AND($C742<=4,$C742<>0),0,IF(AND($C742=\"S\",$Y742>0),OFFSET(I742,-1,0)+1,OFFSET(I742,-1,0)))","v":0},27,3,"F","Nível 2","Nível 2","3.15.","AGETOP",null,"FORROS","-",null,1,null,null,null,null,null,""]
["S",2,"S",0,3,15,0,0,{"$f":"IF(AND($C743<=4,$C743<>0),0,IF(AND($C743=\"S\",$Y743>0),OFFSET(I743,-1,0)+1,OFFSET(I743,-1,0)))","v":0},0,0,"F","Serviço","Serviço","3.15.0.1.","AGETOP",210101,"CHAPISCO EM FORRO (1CI: 3 ARG)","m2    ",97.02,1,null,null,null,null,null,""]
["S",2,"S",0,3,15,0,0,{"$f":"IF(AND($C744<=4,$C744<>0),0,IF(AND($C744=\"S\",$Y744>0),OFFSET(I744,-1,0)+1,OFFSET(I744,-1,0)))","v":0},0,0,"F","Serviço","Serviço","3.15.0.2.","AGETOP",210401,"REBOCO PAULISTA EM FORRO(1CALH:4ARML+150KG CI/M3)","m2    ",97.02,1,null,null,null,null,null,""]
[2,2,2,6,3,16,0,0,{"$f":"IF(AND($C745<=4,$C745<>0),0,IF(AND($C745=\"S\",$Y745>0),OFFSET(I745,-1,0)+1,OFFSET(I745,-1,0)))","v":0},24,6,"F","Nível 2","Nível 2","3.16.","AGETOP",null,"REVESTIMENTO DE PISO","-",null,1,null,null,null,null,null,""]
["S",2,"S",0,3,16,0,0,{"$f":"IF(AND($C746<=4,$C746<>0),0,IF(AND($C746=\"S\",$Y746>0),OFFSET(I746,-1,0)+1,OFFSET(I746,-1,0)))","v":0},0,0,"F","Serviço","Serviço","3.16.0.1.","AGETOP",220100,"PASSEIO PROTECAO EM CONC.DESEMPEN.5 CM 1:2,5:3,5 ( INCLUSO ESPELHO DE 30CM/ESCAVAÇÃO/REATERRO/APILOAMENTO/ATERRO INTERNO)","m2    ",54.4,1,null,null,null,null,null,""]
["S",2,"S",0,3,16,0,0,{"$f":"IF(AND($C747<=4,$C747<>0),0,IF(AND($C747=\"S\",$Y747>0),OFFSET(I747,-1,0)+1,OFFSET(I747,-1,0)))","v":0},0,0,"F","Serviço","Serviço","3.16.0.2.","AGETOP",220101,"LASTRO DE CONCRETO REGULARIZADO IMPERMEABILIZADO 1:3:6 ESP=5CM (BASE)","m2    ",127.02,1,null,null,null,null,null,""]
["S",2,"S",0,3,16,0,0,{"$f":"IF(AND($C748<=4,$C748<>0),0,IF(AND($C748=\"S\",$Y748>0),OFFSET(I748,-1,0)+1,OFFSET(I748,-1,0)))","v":0},0,0,"F","Serviço","Serviço","3.16.0.3.","AGETOP",221101,"GRANITINA 8MM FUNDIDA COM CONTRAPISO (1CI:3ARML) E=2CM E JUNTA PLASTICA 27MM","m2    ",127.02,1,null,null,null,null,null,""]
["S",2,"S",0,3,16,0,0,{"$f":"IF(AND($C749<=4,$C749<>0),0,IF(AND($C749=\"S\",$Y749>0),OFFSET(I749,-1,0)+1,OFFSET(I749,-1,0)))","v":0},0,0,"F","Serviço","Serviço","3.16.0.4.","AGETOP",221102,"RODAPÉ FUNDIDO DE GRANITINA 7CM","m     ",68.75,1,null,null,null,null,null,""]
["S",2,"S",0,3,16,0,0,{"$f":"IF(AND($C750<=4,$C750<>0),0,IF(AND($C750=\"S\",$Y750>0),OFFSET(I750,-1,0)+1,OFFSET(I750,-1,0)))","v":0},0,0,"F","Serviço","Serviço","3.16.0.5.","AGETOP",221104,"RASPAGEM E APLICAÇÃO RESINA ACRÍLICA DUAS DEMÃOS","m2    ",131.83250000000001,1,null,null,null,null,null,""]
[2,2,2,3,3,17,0,0,{"$f":"IF(AND($C751<=4,$C751<>0),0,IF(AND($C751=\"S\",$Y751>0),OFFSET(I751,-1,0)+1,OFFSET(I751,-1,0)))","v":0},18,3,"F","Nível 2","Nível 2","3.17.","AGETOP",null,"MARCENARIA","-",null,1,null,null,null,null,null,""]
["S",2,"S",0,3,17,0,0,{"$f":"IF(AND($C752<=4,$C752<>0),0,IF(AND($C752=\"S\",$Y752>0),OFFSET(I752,-1,0)+1,OFFSET(I752,-1,0)))","v":0},0,0,"F","Serviço","Serviço","3.17.0.1.","AGETOP",240106,"BATE CARTEIRA ENVERNIZADO E ASSENT. 2,5 X 12 CM","M     ",6.6,1,null,null,null,null,null,""]
["S",2,"S",0,3,17,0,0,{"$f":"IF(AND($C753<=4,$C753<>0),0,IF(AND($C753=\"S\",$Y753>0),OFFSET(I753,-1,0)+1,OFFSET(I753,-1,0)))","v":0},0,0,"F","Serviço","Serviço","3.17.0.2.","AGETOP",240110,"QUADRO AVISO TP-1 (1,20 X 1,20 M)","Un    ",2,1,null,null,null,null,null,""]
[2,2,2,10,3,18,0,0,{"$f":"IF(AND($C754<=4,$C754<>0),0,IF(AND($C754=\"S\",$Y754>0),OFFSET(I754,-1,0)+1,OFFSET(I754,-1,0)))","v":0},15,10,"F","Nível 2","Nível 2","3.18.","AGETOP",null,"PINTURA","-",null,1,null,null,null,null,null,""]
["S",2,"S",0,3,18,0,0,{"$f":"IF(AND($C755<=4,$C755<>0),0,IF(AND($C755=\"S\",$Y755>0),OFFSET(I755,-1,0)+1,OFFSET(I755,-1,0)))","v":0},0,0,"F","Serviço","Serviço","3.18.0.1.","AGETOP",261300,"EMASSAMENTO COM MASSA PVA DUAS DEMAOS","m2    ",154.34,1,null,null,null,null,null,""]
["S",2,"S",0,3,18,0,0,{"$f":"IF(AND($C756<=4,$C756<>0),0,IF(AND($C756=\"S\",$Y756>0),OFFSET(I756,-1,0)+1,OFFSET(I756,-1,0)))","v":0},0,0,"F","Serviço","Serviço","3.18.0.2.","AGETOP",261302,"PINTURA LATEX DUAS DEMAOS COM SELADOR","m2    ",154.34,1,null,null,null,null,null,""]
["S",2,"S",0,3,18,0,0,{"$f":"IF(AND($C757<=4,$C757<>0),0,IF(AND($C757=\"S\",$Y757>0),OFFSET(I757,-1,0)+1,OFFSET(I757,-1,0)))","v":0},0,0,"F","Serviço","Serviço","3.18.0.3.","AGETOP",261303,"PINTURA LATEX TRES DEMAOS COM SELADOR","m2    ",83.51,1,null,null,null,null,null,""]
["S",2,"S",0,3,18,0,0,{"$f":"IF(AND($C758<=4,$C758<>0),0,IF(AND($C758=\"S\",$Y758>0),OFFSET(I758,-1,0)+1,OFFSET(I758,-1,0)))","v":0},0,0,"F","Serviço","Serviço","3.18.0.4.","AGETOP",261304,"EMASSAMENTO ACRILICO 2 DEMAOS","m2    ",93.16,1,null,null,null,null,null,""]
["S",2,"S",0,3,18,0,0,{"$f":"IF(AND($C759<=4,$C759<>0),0,IF(AND($C759=\"S\",$Y759>0),OFFSET(I759,-1,0)+1,OFFSET(I759,-1,0)))","v":0},0,0,"F","Serviço","Serviço","3.18.0.5.","AGETOP",261550,"PINT.ESMALTE SINT.PAREDES - 2 DEM.C/SELADOR","m2    ",93.16,1,null,null,null,null,null,""]
["S",2,"S",0,3,18,0,0,{"$f":"IF(AND($C760<=4,$C760<>0),0,IF(AND($C760=\"S\",$Y760>0),OFFSET(I760,-1,0)+1,OFFSET(I760,-1,0)))","v":0},0,0,"F","Serviço","Serviço","3.18.0.6.","AGETOP",261602,"PINT.ESMALTE/ESQUAD.FERRO C/FUNDO ANTICOR.","m2    ",148.32,1,null,null,null,null,null,""]
["S",2,"S",0,3,18,0,0,{"$f":"IF(AND($C761<=4,$C761<>0),0,IF(AND($C761=\"S\",$Y761>0),OFFSET(I761,-1,0)+1,OFFSET(I761,-1,0)))","v":0},0,0,"F","Serviço","Serviço","3.18.0.7.","AGETOP",261607,"PINTURA CERAMICA P/BEIRAL","m2    ",14.57,1,null,null,null,null,null,""]
[{"$f":"CHOOSE(1+LOG(1+2*(ORÇAMENTO.Nivel=\"Nível 1\")+4*(ORÇAMENTO.Nivel=\"Nível 2\")+8*(ORÇAMENTO.Nivel=\"Nível 3\")+16*(ORÇAMENTO.Nivel=\"Nível 4\")+32*(ORÇAMENTO.Nivel=\"Serviço\"),2),0,1,2,3,4,\"S\")","v":"S"},2,"S",0,3,18,0,0,{"$f":"IF(AND($C762<=4,$C762<>0),0,IF(AND($C762=\"S\",$Y762>0),OFFSET(I762,-1,0)+1,OFFSET(I762,-1,0)))","v":0},0,0,"F","Serviço","Serviço","3.18.0.8.","AGETOP",261611,"PINTURA  ALQUÍDICA BRILHANTE DUPLA FUNÇÃO 2 DEMÃOS = 50 MÍCRONS","m2    ",117.63,1,null,null,null,null,null,""]
["S",2,"S",0,3,18,0,0,{"$f":"IF(AND($C763<=4,$C763<>0),0,IF(AND($C763=\"S\",$Y763>0),OFFSET(I763,-1,0)+1,OFFSET(I763,-1,0)))","v":0},0,0,"F","Serviço","Serviço","3.18.0.9.","AGETOP",261623,"LETREIRO PEQ.PORTE A PINCEL EM PAREDE E PORTAS","m2    ",0.36,1,null,null,null,null,null,""]
[2,2,2,5,3,19,0,0,{"$f":"IF(AND($C764<=4,$C764<>0),0,IF(AND($C764=\"S\",$Y764>0),OFFSET(I764,-1,0)+1,OFFSET(I764,-1,0)))","v":0},5,{"$error":"#N/A"},"F","Nível 2","Nível 2","3.19.","AGETOP",null,"DIVERSOS","-",null,1,null,null,null,null,null,""]
["S",2,"S",0,{"$f":"IF($C765=1,OFFSET(E765,-1,0)+1,OFFSET(E765,-1,0))","v":3},{"$f":"IF($C765=1,0,IF($C765=2,OFFSET(F765,-1,0)+1,OFFSET(F765,-1,0)))","v":19},{"$f":"IF(AND($C765<=2,$C765<>0),0,IF($C765=3,OFFSET(G765,-1,0)+1,OFFSET(G765,-1,0)))","v":0},{"$f":"IF(AND($C765<=3,$C765<>0),0,IF($C765=4,OFFSET(H765,-1,0)+1,OFFSET(H765,-1,0)))","v":0},{"$f":"IF(AND($C765<=4,$C765<>0),0,IF(AND($C765=\"S\",$Y765>0),OFFSET(I765,-1,0)+1,OFFSET(I765,-1,0)))","v":0},0,0,"F","Serviço","Serviço","3.19.0.1.","AGETOP",270501,"LIMPEZA FINAL DE OBRA - (OBRAS CIVIS)","m2    ",134.83000000000001,1,null,null,null,null,null,""]
["S",2,"S",0,3,19,0,0,{"$f":"IF(AND($C766<=4,$C766<>0),0,IF(AND($C766=\"S\",$Y766>0),OFFSET(I766,-1,0)+1,OFFSET(I766,-1,0)))","v":0},0,0,"F","Serviço","Serviço","3.19.0.2.","AGETOP",271210,"QUADRO DE GIZ EMBOÇO/PINTURA COMPLETO","m2    ",4.8,1,null,null,null,null,null,""]
["S",2,"S",0,3,19,0,0,{"$f":"IF(AND($C767<=4,$C767<>0),0,IF(AND($C767=\"S\",$Y767>0),OFFSET(I767,-1,0)+1,OFFSET(I767,-1,0)))","v":0},0,0,"F","Serviço","Serviço","3.19.0.3.","AGETOP",271608,"BANCADA DE GRANITO C/ESPELHO","m2    ",18.73,1,null,null,null,null,null,""]
["S",2,"S",0,3,19,0,0,{"$f":"IF(AND($C768<=4,$C768<>0),0,IF(AND($C768=\"S\",$Y768>0),OFFSET(I768,-1,0)+1,OFFSET(I768,-1,0)))","v":0},0,0,"F","Serviço","Serviço","3.19.0.4.","AGETOP",271305,"BASE DE BANCADA REBOCADA","m     ",7.9,1,null,null,null,null,null,""]
[1,1,1,117,4,0,0,0,{"$f":"IF(AND($C769<=4,$C769<>0),0,IF(AND($C769=\"S\",$Y769>0),OFFSET(I769,-1,0)+1,OFFSET(I769,-1,0)))","v":0},559,117,"F","Nível 1","Nível 1","4.","AGETOP",null,"BLOCO 04 SALAS DE AULA","UN",2,2,null,null,null,null,null,""]
[2,2,2,2,4,1,0,0,{"$f":"IF(AND($C770<=4,$C770<>0),0,IF(AND($C770=\"S\",$Y770>0),OFFSET(I770,-1,0)+1,OFFSET(I770,-1,0)))","v":0},116,2,"F","Nível 2","Nível 2","4.1.","AGETOP",null,"SERVIÇOS PRELIMINARES","-",null,2,null,null,null,null,null,""]
["S",{"$f":"IF(OR(C771=\"s\",C771=0),OFFSET(B771,-1,0),C771)","v":2},{"$f":"IF(OFFSET(C771,-1,0)=\"L\",1,IF(OFFSET(C771,-1,0)=1,2,IF(OR(A771=\"s\",A771=0),\"S\",IF(AND(OFFSET(C771,-1,0)=2,A771=4),3,IF(AND(OR(OFFSET(C771,-1,0)=\"s\",OFFSET(C771,-1,0)=0),A771<>\"s\",A771>OFFSET(B771,-1,0)),OFFSET(B771,-1,0),A771)))))","v":"S"},{"$f":"IF(OR(C771=\"S\",C771=0),0,IF(ISERROR(K771),J771,SMALL(J771:K771,1)))","v":0},4,1,0,0,{"$f":"IF(AND($C771<=4,$C771<>0),0,IF(AND($C771=\"S\",$Y771>0),OFFSET(I771,-1,0)+1,OFFSET(I771,-1,0)))","v":0},0,0,"F","Serviço","Serviço","4.1.0.1.","AGETOP",20701,"LOCAÇÃO DA OBRA, EXECUÇÃO DE GABARITO SEM REAPROVEITAMENTO, INCLUSO PINTURA (FACE INTERNA DO RIPÃO 15CM) E PIQUETE COM TESTEMUNHA","m2    ",268.33,2,null,null,null,null,null,""]
[2,2,2,2,4,2,0,0,{"$f":"IF(AND($C772<=4,$C772<>0),0,IF(AND($C772=\"S\",$Y772>0),OFFSET(I772,-1,0)+1,OFFSET(I772,-1,0)))","v":0},114,2,"F","Nível 2","Nível 2","4.2.","AGETOP",null,"TRANSPORTES","-",null,2,null,null,null,null,null,""]
["S",2,"S",0,4,2,0,0,{"$f":"IF(AND($C773<=4,$C773<>0),0,IF(AND($C773=\"S\",$Y773>0),OFFSET(I773,-1,0)+1,OFFSET(I773,-1,0)))","v":0},0,0,"F","Serviço","Serviço","4.2.0.1.","AGETOP",30101,"TRANSPORTE DE ENTULHO EM CAMINHÃO  INCLUSO A CARGA MANUAL","m3    ",18.78,2,null,null,null,null,null,""]
[2,2,2,5,4,3,0,0,{"$f":"IF(AND($C774<=4,$C774<>0),0,IF(AND($C774=\"S\",$Y774>0),OFFSET(I774,-1,0)+1,OFFSET(I774,-1,0)))","v":0},112,5,"F","Nível 2","Nível 2","4.3.","AGETOP",null,"SERVIÇO EM TERRA","-",null,2,null,null,null,null,null,""]
["S",2,"S",0,4,3,0,0,{"$f":"IF(AND($C775<=4,$C775<>0),0,IF(AND($C775=\"S\",$Y775>0),OFFSET(I775,-1,0)+1,OFFSET(I775,-1,0)))","v":0},0,0,"F","Serviço","Serviço","4.3.0.1.","AGETOP",40101,"ESCAVACAO MANUAL DE VALAS < 1 MTS. (OBRAS CIVIS)","m3    ",9.81,2,null,null,null,null,null,""]
["S",2,"S",0,4,3,0,0,{"$f":"IF(AND($C776<=4,$C776<>0),0,IF(AND($C776=\"S\",$Y776>0),OFFSET(I776,-1,0)+1,OFFSET(I776,-1,0)))","v":0},{"$f":"IF(OR($C776=\"S\",$C776=0),0,MATCH(0,OFFSET($D776,1,$C776,ROW($C$1328)-ROW($C776)),0))","v":0},{"$f":"IF(OR($C776=\"S\",$C776=0),0,MATCH(OFFSET($D776,0,$C776)+1,OFFSET($D776,1,$C776,ROW($C$1328)-ROW($C776)),0))","v":0},"F","Serviço","Serviço","4.3.0.2.","AGETOP",40902,"REATERRO COM APILOAMENTO","m3    ",7,2,null,null,null,null,null,""]
["S",2,"S",0,4,3,0,0,{"$f":"IF(AND($C777<=4,$C777<>0),0,IF(AND($C777=\"S\",$Y777>0),OFFSET(I777,-1,0)+1,OFFSET(I777,-1,0)))","v":0},0,0,"F","Serviço","Serviço","4.3.0.3.","AGETOP",41002,"APILOAMENTO","m2    ",254.3,2,null,null,null,null,null,""]
["S",2,"S",0,4,3,0,0,{"$f":"IF(AND($C778<=4,$C778<>0),0,IF(AND($C778=\"S\",$Y778>0),OFFSET(I778,-1,0)+1,OFFSET(I778,-1,0)))","v":0},0,0,"F","Serviço","Serviço","4.3.0.4.","AGETOP",41003,"ATERRO INTERNO SEM APILOAM.C/TR.EM CARRINHO MÃO","m3    ",26.83,2,null,null,null,null,null,""]
[2,2,2,13,4,4,0,0,{"$f":"IF(AND($C779<=4,$C779<>0),0,IF(AND($C779=\"S\",$Y779>0),OFFSET(I779,-1,0)+1,OFFSET(I779,-1,0)))","v":0},107,13,"F","Nível 2","Nível 2","4.4.","AGETOP",null,"FUNDAÇÕES E SONDAGENS","-",null,2,null,null,null,null,null,""]
["S",2,"S",0,4,4,0,0,{"$f":"IF(AND($C780<=4,$C780<>0),0,IF(AND($C780=\"S\",$Y780>0),OFFSET(I780,-1,0)+1,OFFSET(I780,-1,0)))","v":0},0,0,"F","Serviço","Serviço","4.4.0.1.","AGETOP",50201,"EMBASAMENTO COM TIJOLO COMUM","m3    ",4.42,2,null,null,null,null,null,""]
["S",2,"S",0,4,4,0,0,{"$f":"IF(AND($C781<=4,$C781<>0),0,IF(AND($C781=\"S\",$Y781>0),OFFSET(I781,-1,0)+1,OFFSET(I781,-1,0)))","v":0},0,0,"F","Serviço","Serviço","4.4.0.2.","AGETOP",50302,"ESTACA A TRADO DIAM.30 CM SEM FERRO","M     ",210.5,2,null,null,null,null,null,""]
["S",2,"S",0,4,4,0,0,{"$f":"IF(AND($C782<=4,$C782<>0),0,IF(AND($C782=\"S\",$Y782>0),OFFSET(I782,-1,0)+1,OFFSET(I782,-1,0)))","v":0},0,0,"F","Serviço","Serviço","4.4.0.3.","AGETOP",50901,"ESCAVACAO MANUAL DE VALAS (SAPATAS/BLOCOS)","m3    ",27.08,2,null,null,null,null,null,""]
["S",2,"S",0,4,4,0,0,{"$f":"IF(AND($C783<=4,$C783<>0),0,IF(AND($C783=\"S\",$Y783>0),OFFSET(I783,-1,0)+1,OFFSET(I783,-1,0)))","v":0},0,0,"F","Serviço","Serviço","4.4.0.4.","AGETOP",50902,"APILOAMENTO (BLOCOS/SAPATAS)","m2    ",18.32,2,null,null,null,null,null,""]
["S",2,"S",0,4,4,0,0,{"$f":"IF(AND($C784<=4,$C784<>0),0,IF(AND($C784=\"S\",$Y784>0),OFFSET(I784,-1,0)+1,OFFSET(I784,-1,0)))","v":0},0,0,"F","Serviço","Serviço","4.4.0.5.","AGETOP",50903,"REATERRO C/APILOAMENTO (BLOCOS/SAPATAS)","m3    ",20.149999999999999,2,null,null,null,null,null,""]
["S",2,"S",0,4,4,0,0,{"$f":"IF(AND($C785<=4,$C785<>0),0,IF(AND($C785=\"S\",$Y785>0),OFFSET(I785,-1,0)+1,OFFSET(I785,-1,0)))","v":0},0,0,"F","Serviço","Serviço","4.4.0.6.","AGETOP",51009,"FORMA TABUA PINHO P/FUNDACOES U=3V - (OBRAS CIVIS)","m2    ",37.619999999999997,2,null,null,null,null,null,""]
["S",2,"S",0,4,4,0,0,{"$f":"IF(AND($C786<=4,$C786<>0),0,IF(AND($C786=\"S\",$Y786>0),OFFSET(I786,-1,0)+1,OFFSET(I786,-1,0)))","v":0},0,0,"F","Serviço","Serviço","4.4.0.7.","AGETOP",51017,"PREPARO COM BETONEIRA E TRANSPORTE MANUAL DE CONCRETO FCK-20  - (O.C.)","m3    ",6.93,2,null,null,null,null,null,""]
["S",2,"S",0,4,4,0,0,{"$f":"IF(AND($C787<=4,$C787<>0),0,IF(AND($C787=\"S\",$Y787>0),OFFSET(I787,-1,0)+1,OFFSET(I787,-1,0)))","v":0},0,0,"F","Serviço","Serviço","4.4.0.8.","AGETOP",51026,"LANÇAMENTO/APLICAÇÃO/ADENSAMENTO DE CONCRETO EM FUNDAÇÃO- (O.C.)","m3    ",6.93,2,null,null,null,null,null,""]
["S",2,"S",0,4,4,0,0,{"$f":"IF(AND($C788<=4,$C788<>0),0,IF(AND($C788=\"S\",$Y788>0),OFFSET(I788,-1,0)+1,OFFSET(I788,-1,0)))","v":0},0,0,"F","Serviço","Serviço","4.4.0.9.","AGETOP",52003,"ACO CA-50A - 6,3 MM (1/4\") - (OBRAS CIVIS)","Kg    ",98,2,null,null,null,null,null,""]
["S",2,"S",0,4,4,0,0,{"$f":"IF(AND($C789<=4,$C789<>0),0,IF(AND($C789=\"S\",$Y789>0),OFFSET(I789,-1,0)+1,OFFSET(I789,-1,0)))","v":0},0,0,"F","Serviço","Serviço","4.4.0.10.","AGETOP",52004,"ACO CA 50-A - 8,0 MM (5/16\") - (OBRAS CIVIS)","Kg    ",93,2,null,null,null,null,null,""]
["S",2,"S",0,4,4,0,0,{"$f":"IF(AND($C790<=4,$C790<>0),0,IF(AND($C790=\"S\",$Y790>0),OFFSET(I790,-1,0)+1,OFFSET(I790,-1,0)))","v":0},0,0,"F","Serviço","Serviço","4.4.0.11.","AGETOP",52005,"ACO CA-50A - 10,0 MM (3/8\") - (OBRAS CIVIS)","Kg    ",122,2,null,null,null,null,null,""]
["S",2,"S",0,4,4,0,0,{"$f":"IF(AND($C791<=4,$C791<>0),0,IF(AND($C791=\"S\",$Y791>0),OFFSET(I791,-1,0)+1,OFFSET(I791,-1,0)))","v":0},0,0,"F","Serviço","Serviço","4.4.0.12.","AGETOP",52014,"ACO CA-60 - 5,0 MM - (OBRAS CIVIS)","Kg    ",5,2,null,null,null,null,null,""]
[2,2,2,10,4,5,0,0,{"$f":"IF(AND($C792<=4,$C792<>0),0,IF(AND($C792=\"S\",$Y792>0),OFFSET(I792,-1,0)+1,OFFSET(I792,-1,0)))","v":0},94,10,"F","Nível 2","Nível 2","4.5.","AGETOP",null,"ESTRUTURA","-",null,2,null,null,null,null,null,""]
["S",2,"S",0,4,5,0,0,{"$f":"IF(AND($C793<=4,$C793<>0),0,IF(AND($C793=\"S\",$Y793>0),OFFSET(I793,-1,0)+1,OFFSET(I793,-1,0)))","v":0},0,0,"F","Serviço","Serviço","4.5.0.1.","AGETOP",60208,"FORMA CH.COMPENSADA 12MM-VIGA/PILAR U=3V - (OBRAS CIVIS","m2    ",193.22,2,null,null,null,null,null,""]
["S",2,"S",0,4,5,0,0,{"$f":"IF(AND($C794<=4,$C794<>0),0,IF(AND($C794=\"S\",$Y794>0),OFFSET(I794,-1,0)+1,OFFSET(I794,-1,0)))","v":0},0,0,"F","Serviço","Serviço","4.5.0.2.","AGETOP",60304,"ACO CA-50 A - 8,0 MM (5/16\") - (OBRAS CIVIS)","Kg    ",253,2,null,null,null,null,null,""]
["S",2,"S",0,4,5,0,0,{"$f":"IF(AND($C795<=4,$C795<>0),0,IF(AND($C795=\"S\",$Y795>0),OFFSET(I795,-1,0)+1,OFFSET(I795,-1,0)))","v":0},0,0,"F","Serviço","Serviço","4.5.0.3.","AGETOP",60305,"ACO CA-50A - 10,0 MM (3/8\") - (OBRAS CIVIS)","Kg    ",143,2,null,null,null,null,null,""]
["S",2,"S",0,4,5,0,0,{"$f":"IF(AND($C796<=4,$C796<>0),0,IF(AND($C796=\"S\",$Y796>0),OFFSET(I796,-1,0)+1,OFFSET(I796,-1,0)))","v":0},0,0,"F","Serviço","Serviço","4.5.0.4.","AGETOP",60306,"ACO CA-50A - 12,5 MM (1/2\") - (OBRAS CIVIS)","Kg    ",366,2,null,null,null,null,null,""]
["S",2,"S",0,4,5,0,0,{"$f":"IF(AND($C797<=4,$C797<>0),0,IF(AND($C797=\"S\",$Y797>0),OFFSET(I797,-1,0)+1,OFFSET(I797,-1,0)))","v":0},0,0,"F","Serviço","Serviço","4.5.0.5.","AGETOP",60307,"ACO CA-50 - 16,0 MM (5/8\") - (OBRAS CIVIS)","Kg    ",239,2,null,null,null,null,null,""]
["S",2,"S",0,4,5,0,0,{"$f":"IF(AND($C798<=4,$C798<>0),0,IF(AND($C798=\"S\",$Y798>0),OFFSET(I798,-1,0)+1,OFFSET(I798,-1,0)))","v":0},0,0,"F","Serviço","Serviço","4.5.0.6.","AGETOP",60314,"ACO CA - 60 - 5,0 MM - (OBRAS CIVIS)","Kg    ",249,2,null,null,null,null,null,""]
["S",2,"S",0,4,5,0,0,{"$f":"IF(AND($C799<=4,$C799<>0),0,IF(AND($C799=\"S\",$Y799>0),OFFSET(I799,-1,0)+1,OFFSET(I799,-1,0)))","v":0},0,0,"F","Serviço","Serviço","4.5.0.7.","AGETOP",60507,"PREPARO COM BETONEIRA E TRANSPORTE MANUAL DE CONCRETO FCK-20 - (O.C.)","m3    ",10.3,2,null,null,null,null,null,""]
["S",2,"S",0,4,5,0,0,{"$f":"IF(AND($C800<=4,$C800<>0),0,IF(AND($C800=\"S\",$Y800>0),OFFSET(I800,-1,0)+1,OFFSET(I800,-1,0)))","v":0},0,0,"F","Serviço","Serviço","4.5.0.8.","AGETOP",60801,"LANÇAMENTO/APLICAÇÃO/ADENSAMENTO MANUAL DE CONCRETO - (OBRAS CIVIS)","m3    ",10.3,2,null,null,null,null,null,""]
["S",2,"S",0,4,5,0,0,{"$f":"IF(AND($C801<=4,$C801<>0),0,IF(AND($C801=\"S\",$Y801>0),OFFSET(I801,-1,0)+1,OFFSET(I801,-1,0)))","v":0},0,0,"F","Serviço","Serviço","4.5.0.9.","AGETOP",61101,"FORRO EM LAJE PRE-MOLDADA INC.CAPEAMENTO/FERR.DISTRIB./ESCORAMENTO E FORMA/DESFORMA","m2    ",205.72,2,null,null,null,null,null,""]
[2,2,2,39,4,6,0,0,{"$f":"IF(AND($C802<=4,$C802<>0),0,IF(AND($C802=\"S\",$Y802>0),OFFSET(I802,-1,0)+1,OFFSET(I802,-1,0)))","v":0},84,39,"F","Nível 2","Nível 2","4.6.","AGETOP",null,"INSTALAÇÕES ELÉTRICAS","-",null,2,null,null,null,null,null,""]
[3,3,3,4,4,6,1,0,{"$f":"IF(AND($C803<=4,$C803<>0),0,IF(AND($C803=\"S\",$Y803>0),OFFSET(I803,-1,0)+1,OFFSET(I803,-1,0)))","v":0},38,4,"F","Nível 3","Nível 3","4.6.1.","AGETOP",null,"QUADRO DE DISTRIBUIÇÃO","-",null,2,null,null,null,null,null,""]
["S",3,"S",0,4,6,1,0,{"$f":"IF(AND($C804<=4,$C804<>0),0,IF(AND($C804=\"S\",$Y804>0),OFFSET(I804,-1,0)+1,OFFSET(I804,-1,0)))","v":0},0,0,"F","Serviço","Serviço","4.6.1.1.","AGETOP",72190,"QUADRO DE DISTRIBUIÇÃO DE EMBUTIR METÁLICO CB-24E - 150A","Un    ",1,2,null,null,null,null,null,""]
["S",3,"S",0,4,6,1,0,{"$f":"IF(AND($C805<=4,$C805<>0),0,IF(AND($C805=\"S\",$Y805>0),OFFSET(I805,-1,0)+1,OFFSET(I805,-1,0)))","v":0},0,0,"F","Serviço","Serviço","4.6.1.2.","AGETOP",71173,"DISJUNTOR TRIPOLAR DE 10 A 35-A","Un    ",1,2,null,null,null,null,null,""]
["S",3,"S",0,4,6,1,0,{"$f":"IF(AND($C806<=4,$C806<>0),0,IF(AND($C806=\"S\",$Y806>0),OFFSET(I806,-1,0)+1,OFFSET(I806,-1,0)))","v":0},0,0,"F","Serviço","Serviço","4.6.1.3.","AGETOP",71171,"DISJUNTOR MONOPOLAR DE 10 A 32-A","Un    ",12,2,null,null,null,null,null,""]
[3,3,3,4,4,6,2,0,{"$f":"IF(AND($C807<=4,$C807<>0),0,IF(AND($C807=\"S\",$Y807>0),OFFSET(I807,-1,0)+1,OFFSET(I807,-1,0)))","v":0},34,4,"F","Nível 3","Nível 3","4.6.2.","AGETOP",null,"CABOS E FIOS (CONDUTORES)","-",null,2,null,null,null,null,null,""]
["S",3,"S",0,4,6,2,0,{"$f":"IF(AND($C808<=4,$C808<>0),0,IF(AND($C808=\"S\",$Y808>0),OFFSET(I808,-1,0)+1,OFFSET(I808,-1,0)))","v":0},0,0,"F","Serviço","Serviço","4.6.2.1.","AGETOP",70563,"CABO ISOLADO PVC 750 V. No. 2,5 MM2","m     ",850,2,null,null,null,null,null,""]
["S",3,"S",0,4,6,2,0,{"$f":"IF(AND($C809<=4,$C809<>0),0,IF(AND($C809=\"S\",$Y809>0),OFFSET(I809,-1,0)+1,OFFSET(I809,-1,0)))","v":0},0,0,"F","Serviço","Serviço","4.6.2.2.","AGETOP",70564,"CABO ISOLADO PVC 750 V. No. 4 MM2","m     ",280,2,null,null,null,null,null,""]
["S",3,"S",0,4,6,2,0,{"$f":"IF(AND($C810<=4,$C810<>0),0,IF(AND($C810=\"S\",$Y810>0),OFFSET(I810,-1,0)+1,OFFSET(I810,-1,0)))","v":0},0,0,"F","Serviço","Serviço","4.6.2.3.","AGETOP",70541,"CABO DE COBRE NU No. 16 MM2 (6,94 M/KG)","M     ",10,2,null,null,null,null,null,""]
[3,3,3,30,4,6,3,0,{"$f":"IF(AND($C811<=4,$C811<>0),0,IF(AND($C811=\"S\",$Y811>0),OFFSET(I811,-1,0)+1,OFFSET(I811,-1,0)))","v":0},30,{"$error":"#N/A"},"F","Nível 3","Nível 3","4.6.3.","AGETOP",null,"ELETRODUTOS E ACESSÓRIOS","-",null,2,null,null,null,null,null,""]
["S",3,"S",0,4,6,3,0,{"$f":"IF(AND($C812<=4,$C812<>0),0,IF(AND($C812=\"S\",$Y812>0),OFFSET(I812,-1,0)+1,OFFSET(I812,-1,0)))","v":0},0,0,"F","Serviço","Serviço","4.6.3.1.","AGETOP",71194,"ELETRODUTO PVC FLEXÍVEL - MANGUEIRA CORRUGADA LEVE - DIAM. 25MM","M     ",200,2,null,null,null,null,null,""]
["S",3,"S",0,4,6,3,0,{"$f":"IF(AND($C813<=4,$C813<>0),0,IF(AND($C813=\"S\",$Y813>0),OFFSET(I813,-1,0)+1,OFFSET(I813,-1,0)))","v":0},0,0,"F","Serviço","Serviço","4.6.3.2.","AGETOP",71201,"ELETRODUTO DE PVC RIGIDO DIAMETRO 3/4\"","M     ",30,2,null,null,null,null,null,""]
["S",3,"S",0,4,6,3,0,{"$f":"IF(AND($C814<=4,$C814<>0),0,IF(AND($C814=\"S\",$Y814>0),OFFSET(I814,-1,0)+1,OFFSET(I814,-1,0)))","v":0},0,0,"F","Serviço","Serviço","4.6.3.3.","AGETOP",71202,"ELETRODUTO DE PVC RIGIDO DIAMETRO 1\"","M     ",50,2,null,null,null,null,null,""]
["S",3,"S",0,4,6,3,0,{"$f":"IF(AND($C815<=4,$C815<>0),0,IF(AND($C815=\"S\",$Y815>0),OFFSET(I815,-1,0)+1,OFFSET(I815,-1,0)))","v":0},0,0,"F","Serviço","Serviço","4.6.3.4.","AGETOP",70681,"CAIXA METALICA OCTOGONAL FUNDO MOVEL, SIMPLES 2\"","Un    ",32,2,null,null,null,null,null,""]
["S",3,"S",0,4,6,3,0,{"$f":"IF(AND($C816<=4,$C816<>0),0,IF(AND($C816=\"S\",$Y816>0),OFFSET(I816,-1,0)+1,OFFSET(I816,-1,0)))","v":0},0,0,"F","Serviço","Serviço","4.6.3.5.","AGETOP",70680,"CAIXA MET.HEXAGONAL P/ARANDELA (SEXTAVADA 3\"X3\")","Un    ",4,2,null,null,null,null,null,""]
["S",3,"S",0,4,6,3,0,{"$f":"IF(AND($C817<=4,$C817<>0),0,IF(AND($C817=\"S\",$Y817>0),OFFSET(I817,-1,0)+1,OFFSET(I817,-1,0)))","v":0},0,0,"F","Serviço","Serviço","4.6.3.6.","AGETOP",70691,"CAIXA METALICA RET. 4\" X 2\" X 2\"","Un    ",20,2,null,null,null,null,null,""]
["S",3,"S",0,4,6,3,0,{"$f":"IF(AND($C818<=4,$C818<>0),0,IF(AND($C818=\"S\",$Y818>0),OFFSET(I818,-1,0)+1,OFFSET(I818,-1,0)))","v":0},0,0,"F","Serviço","Serviço","4.6.3.7.","AGETOP",70692,"CAIXA METALICA QUADRADA 4\"X4\"X2\"","Un    ",6,2,null,null,null,null,null,""]
["S",3,"S",0,4,6,3,0,{"$f":"IF(AND($C819<=4,$C819<>0),0,IF(AND($C819=\"S\",$Y819>0),OFFSET(I819,-1,0)+1,OFFSET(I819,-1,0)))","v":0},0,0,"F","Serviço","Serviço","4.6.3.8.","AGETOP",70645,"CAIXA DE PASSAGEM METÁLICA DE EMBUTIR 15X15X8 CM","Un    ",1,2,null,null,null,null,null,""]
["S",3,"S",0,4,6,3,0,{"$f":"IF(AND($C820<=4,$C820<>0),0,IF(AND($C820=\"S\",$Y820>0),OFFSET(I820,-1,0)+1,OFFSET(I820,-1,0)))","v":0},0,0,"F","Serviço","Serviço","4.6.3.9.","AGETOP",71141,"CURVA DE 90 GRAUS DE PVC RIGIDO DIAM. 3/4\"","Un    ",10,2,null,null,null,null,null,""]
["S",3,"S",0,4,6,3,0,{"$f":"IF(AND($C821<=4,$C821<>0),0,IF(AND($C821=\"S\",$Y821>0),OFFSET(I821,-1,0)+1,OFFSET(I821,-1,0)))","v":0},0,0,"F","Serviço","Serviço","4.6.3.10.","AGETOP",71142,"CURVA DE 90 GRAUS DE PVC RIGIDO DIAM. 1\"","Un    ",7,2,null,null,null,null,null,""]
["S",3,"S",0,4,6,3,0,{"$f":"IF(AND($C822<=4,$C822<>0),0,IF(AND($C822=\"S\",$Y822>0),OFFSET(I822,-1,0)+1,OFFSET(I822,-1,0)))","v":0},0,0,"F","Serviço","Serviço","4.6.3.11.","AGETOP",70351,"BRACADEIRA METALICA TIPO \"U\" DIAM. 3/4\"","Un    ",60,2,null,null,null,null,null,""]
["S",3,"S",0,4,6,3,0,{"$f":"IF(AND($C823<=4,$C823<>0),0,IF(AND($C823=\"S\",$Y823>0),OFFSET(I823,-1,0)+1,OFFSET(I823,-1,0)))","v":0},0,0,"F","Serviço","Serviço","4.6.3.12.","AGETOP",70352,"BRACADEIRA METALICA TIPO \"U\" DIAM. 1\"","Un    ",10,2,null,null,null,null,null,""]
["S",3,"S",0,4,6,3,0,{"$f":"IF(AND($C824<=4,$C824<>0),0,IF(AND($C824=\"S\",$Y824>0),OFFSET(I824,-1,0)+1,OFFSET(I824,-1,0)))","v":0},0,0,"F","Serviço","Serviço","4.6.3.13.","AGETOP",71741,"LUVA PVC ROSQUEAVEL DIAMETRO 3/4\"","Un    ",15,2,null,null,null,null,null,""]
["S",3,"S",0,4,6,3,0,{"$f":"IF(AND($C825<=4,$C825<>0),0,IF(AND($C825=\"S\",$Y825>0),OFFSET(I825,-1,0)+1,OFFSET(I825,-1,0)))","v":0},0,0,"F","Serviço","Serviço","4.6.3.14.","AGETOP",71742,"LUVA PVC ROSQUEAVEL DIAMETRO 1\"","Un    ",16.666666666666668,2,null,null,null,null,null,""]
[{"$f":"CHOOSE(1+LOG(1+2*(ORÇAMENTO.Nivel=\"Nível 1\")+4*(ORÇAMENTO.Nivel=\"Nível 2\")+8*(ORÇAMENTO.Nivel=\"Nível 3\")+16*(ORÇAMENTO.Nivel=\"Nível 4\")+32*(ORÇAMENTO.Nivel=\"Serviço\"),2),0,1,2,3,4,\"S\")","v":"S"},3,"S",0,4,6,3,0,{"$f":"IF(AND($C826<=4,$C826<>0),0,IF(AND($C826=\"S\",$Y826>0),OFFSET(I826,-1,0)+1,OFFSET(I826,-1,0)))","v":0},0,0,"F","Serviço","Serviço","4.6.3.15.","AGETOP",70421,"BUCHA E ARRUELA METALICA DIAM. 3/4\"","PR    ",6,2,null,null,null,null,null,""]
["S",3,"S",0,4,6,3,0,{"$f":"IF(AND($C827<=4,$C827<>0),0,IF(AND($C827=\"S\",$Y827>0),OFFSET(I827,-1,0)+1,OFFSET(I827,-1,0)))","v":0},0,0,"F","Serviço","Serviço","4.6.3.16.","AGETOP",70422,"BUCHA E ARRUELA METALICA DIAM. 1\"","PR    ",6,2,null,null,null,null,null,""]
["S",3,"S",0,4,6,3,0,{"$f":"IF(AND($C828<=4,$C828<>0),0,IF(AND($C828=\"S\",$Y828>0),OFFSET(I828,-1,0)+1,OFFSET(I828,-1,0)))","v":0},0,0,"F","Serviço","Serviço","4.6.3.17.","AGETOP",71331,"FITA ISOLANTE, ROLO DE 20,00 M","Un    ",8,2,null,null,null,null,null,""]
["S",3,"S",0,{"$f":"IF($C829=1,OFFSET(E829,-1,0)+1,OFFSET(E829,-1,0))","v":4},{"$f":"IF($C829=1,0,IF($C829=2,OFFSET(F829,-1,0)+1,OFFSET(F829,-1,0)))","v":6},{"$f":"IF(AND($C829<=2,$C829<>0),0,IF($C829=3,OFFSET(G829,-1,0)+1,OFFSET(G829,-1,0)))","v":3},{"$f":"IF(AND($C829<=3,$C829<>0),0,IF($C829=4,OFFSET(H829,-1,0)+1,OFFSET(H829,-1,0)))","v":0},{"$f":"IF(AND($C829<=4,$C829<>0),0,IF(AND($C829=\"S\",$Y829>0),OFFSET(I829,-1,0)+1,OFFSET(I829,-1,0)))","v":0},0,0,"F","Serviço","Serviço","4.6.3.18.","AGETOP",70929,"CONDULETE METÁLICO - CAIXA COM 5 ENTRADAS ","un    ",12,2,null,null,null,null,null,""]
["S",3,"S",0,4,6,3,0,{"$f":"IF(AND($C830<=4,$C830<>0),0,IF(AND($C830=\"S\",$Y830>0),OFFSET(I830,-1,0)+1,OFFSET(I830,-1,0)))","v":0},0,0,"F","Serviço","Serviço","4.6.3.19.","AGETOP",70930,"CONDULETE METÁLICO - ADAPTADOR DE SAÍDA 3/4\" ","un    ",12,2,null,null,null,null,null,""]
["S",3,"S",0,4,6,3,0,{"$f":"IF(AND($C831<=4,$C831<>0),0,IF(AND($C831=\"S\",$Y831>0),OFFSET(I831,-1,0)+1,OFFSET(I831,-1,0)))","v":0},0,0,"F","Serviço","Serviço","4.6.3.20.","AGETOP",72395,"TAMPA CEGA PARA CONDULETE METÁLICO","Un    ",12,2,null,null,null,null,null,""]
["S",3,"S",0,4,6,3,0,{"$f":"IF(AND($C832<=4,$C832<>0),0,IF(AND($C832=\"S\",$Y832>0),OFFSET(I832,-1,0)+1,OFFSET(I832,-1,0)))","v":0},0,0,"F","Serviço","Serviço","4.6.3.21.","AGETOP",71450,"INTERRUPTOR DIFERENCIAL RESIDUAL (D.R.) BIPOLAR DE 25A-30mA","Un    ",5,2,null,null,null,null,null,""]
["S",3,"S",0,4,6,3,0,{"$f":"IF(AND($C833<=4,$C833<>0),0,IF(AND($C833=\"S\",$Y833>0),OFFSET(I833,-1,0)+1,OFFSET(I833,-1,0)))","v":0},0,0,"F","Serviço","Serviço","4.6.3.22.","AGETOP",71610,"LUMINÁRIA TIPO ARANDELA DE USO EXTERNO BLINDADA COM GRADE ( PEQUENA ) - BASE E-27","un    ",4,2,null,null,null,null,null,""]
["S",3,"S",0,4,6,3,0,{"$f":"IF(AND($C834<=4,$C834<>0),0,IF(AND($C834=\"S\",$Y834>0),OFFSET(I834,-1,0)+1,OFFSET(I834,-1,0)))","v":0},0,0,"F","Serviço","Serviço","4.6.3.23.","AGETOP",71440,"INTERRUPTOR SIMPLES (1 SECAO)","Un    ",5,2,null,null,null,null,null,""]
["S",{"$f":"IF(OR(C835=\"s\",C835=0),OFFSET(B835,-1,0),C835)","v":3},{"$f":"IF(OFFSET(C835,-1,0)=\"L\",1,IF(OFFSET(C835,-1,0)=1,2,IF(OR(A835=\"s\",A835=0),\"S\",IF(AND(OFFSET(C835,-1,0)=2,A835=4),3,IF(AND(OR(OFFSET(C835,-1,0)=\"s\",OFFSET(C835,-1,0)=0),A835<>\"s\",A835>OFFSET(B835,-1,0)),OFFSET(B835,-1,0),A835)))))","v":"S"},{"$f":"IF(OR(C835=\"S\",C835=0),0,IF(ISERROR(K835),J835,SMALL(J835:K835,1)))","v":0},4,6,3,0,{"$f":"IF(AND($C835<=4,$C835<>0),0,IF(AND($C835=\"S\",$Y835>0),OFFSET(I835,-1,0)+1,OFFSET(I835,-1,0)))","v":0},0,0,"F","Serviço","Serviço","4.6.3.24.","AGETOP",71644,"LUMINÁRIA TIPO PLAFON DE SOBREPOR QUADRADA PARA 02 LÂMPADAS","Un    ",32,2,null,null,null,null,null,""]
["S",3,"S",0,4,6,3,0,{"$f":"IF(AND($C836<=4,$C836<>0),0,IF(AND($C836=\"S\",$Y836>0),OFFSET(I836,-1,0)+1,OFFSET(I836,-1,0)))","v":0},0,0,"F","Serviço","Serviço","4.6.3.25.","AGETOP",71577,"LAMPADA COMPACTA ELETRÔNICA COM REATOR INTEGRADO  25/26 W","Un    ",64,2,null,null,null,null,null,""]
["S",3,"S",0,4,6,3,0,{"$f":"IF(AND($C837<=4,$C837<>0),0,IF(AND($C837=\"S\",$Y837>0),OFFSET(I837,-1,0)+1,OFFSET(I837,-1,0)))","v":0},0,0,"F","Serviço","Serviço","4.6.3.26.","AGETOP",71520,"LAMPADA A VAPOR DE MERCURIO 125 W","Un    ",4,2,null,null,null,null,null,""]
["S",3,"S",0,4,6,3,0,{"$f":"IF(AND($C838<=4,$C838<>0),0,IF(AND($C838=\"S\",$Y838>0),OFFSET(I838,-1,0)+1,OFFSET(I838,-1,0)))","v":0},0,0,"F","Serviço","Serviço","4.6.3.27.","AGETOP",72570,"TOMADA HEXAGONAL 2P + T - 10A - 250V (LINHA X OU EQUIVALENTE)","Un    ",10,2,null,null,null,null,null,""]
["S",3,"S",0,4,6,3,0,{"$f":"IF(AND($C839<=4,$C839<>0),0,IF(AND($C839=\"S\",$Y839>0),OFFSET(I839,-1,0)+1,OFFSET(I839,-1,0)))","v":0},0,0,"F","Serviço","Serviço","4.6.3.28.","AGETOP",72575,"TOMADA HEXAGONAL 2P + T - 20A - 250V (LINHA X OU EQUIVALENTE)","Un    ",4,2,null,null,null,null,null,""]
["S",3,"S",0,4,6,3,0,{"$f":"IF(AND($C840<=4,$C840<>0),0,IF(AND($C840=\"S\",$Y840>0),OFFSET(I840,-1,0)+1,OFFSET(I840,-1,0)))","v":0},{"$f":"IF(OR($C840=\"S\",$C840=0),0,MATCH(0,OFFSET($D840,1,$C840,ROW($C$1328)-ROW($C840)),0))","v":0},{"$f":"IF(OR($C840=\"S\",$C840=0),0,MATCH(OFFSET($D840,0,$C840)+1,OFFSET($D840,1,$C840,ROW($C$1328)-ROW($C840)),0))","v":0},"F","Serviço","Serviço","4.6.3.29.","AGETOP",71598,"LUMINÁRIA DE EMERGÊNCIA 30 LEDS","un    ",2,2,null,null,null,null,null,""]
[2,2,2,2,4,7,0,0,{"$f":"IF(AND($C841<=4,$C841<>0),0,IF(AND($C841=\"S\",$Y841>0),OFFSET(I841,-1,0)+1,OFFSET(I841,-1,0)))","v":0},45,2,"F","Nível 2","Nível 2","4.7.","AGETOP",null,"ALVENARIAS E DIVISÓRIAS","-",null,2,null,null,null,null,null,""]
["S",2,"S",0,4,7,0,0,{"$f":"IF(AND($C842<=4,$C842<>0),0,IF(AND($C842=\"S\",$Y842>0),OFFSET(I842,-1,0)+1,OFFSET(I842,-1,0)))","v":0},0,0,"F","Serviço","Serviço","4.7.0.1.","AGETOP",100201,"ALVENARIA DE TIJOLO FURADO 1/2 VEZ - 9 x 19 x 19 - ARG. (1CALH:4ARML+100KG DE CI/M3)","m2    ",202.49,2,null,null,null,null,null,""]
[2,2,2,2,4,8,0,0,{"$f":"IF(AND($C843<=4,$C843<>0),0,IF(AND($C843=\"S\",$Y843>0),OFFSET(I843,-1,0)+1,OFFSET(I843,-1,0)))","v":0},43,2,"F","Nível 2","Nível 2","4.8.","AGETOP",null,"IMPERMEABILIZAÇÃO","-",null,2,null,null,null,null,null,""]
["S",2,"S",0,4,8,0,0,{"$f":"IF(AND($C844<=4,$C844<>0),0,IF(AND($C844=\"S\",$Y844>0),OFFSET(I844,-1,0)+1,OFFSET(I844,-1,0)))","v":0},0,0,"F","Serviço","Serviço","4.8.0.1.","AGETOP",120902,"IMPERMEABILIZACAO VIGAS BALDRAMES E=2,0 CM","m2    ",58.62,2,null,null,null,null,null,""]
[2,2,2,2,4,9,0,0,{"$f":"IF(AND($C845<=4,$C845<>0),0,IF(AND($C845=\"S\",$Y845>0),OFFSET(I845,-1,0)+1,OFFSET(I845,-1,0)))","v":0},41,2,"F","Nível 2","Nível 2","4.9.","AGETOP",null,"ESTRUTURAS METÁLICAS","-",null,2,null,null,null,null,null,""]
["S",2,"S",0,4,9,0,0,{"$f":"IF(AND($C846<=4,$C846<>0),0,IF(AND($C846=\"S\",$Y846>0),OFFSET(I846,-1,0)+1,OFFSET(I846,-1,0)))","v":0},0,0,"F","Serviço","Serviço","4.9.0.1.","AGETOP",150103,"ESTRUTURA METÁLICA CONVENCIONAL EM AÇO DO TIPO USI SAC-300 COM FUNDO ANTICORROSIVO","Kg    ",2326.92,2,null,null,null,null,null,""]
[2,2,2,5,4,10,0,0,{"$f":"IF(AND($C847<=4,$C847<>0),0,IF(AND($C847=\"S\",$Y847>0),OFFSET(I847,-1,0)+1,OFFSET(I847,-1,0)))","v":0},39,5,"F","Nível 2","Nível 2","4.10.","AGETOP",null,"COBERTURAS","-",null,2,null,null,null,null,null,""]
["S",2,"S",0,4,10,0,0,{"$f":"IF(AND($C848<=4,$C848<>0),0,IF(AND($C848=\"S\",$Y848>0),OFFSET(I848,-1,0)+1,OFFSET(I848,-1,0)))","v":0},0,0,"F","Serviço","Serviço","4.10.0.1.","AGETOP",160401,"COBERTURA COM TELHA PLAN RESINADA COR VERMELHA","m2    ",341.87,2,null,null,null,null,null,""]
["S",2,"S",0,4,10,0,0,{"$f":"IF(AND($C849<=4,$C849<>0),0,IF(AND($C849=\"S\",$Y849>0),OFFSET(I849,-1,0)+1,OFFSET(I849,-1,0)))","v":0},0,0,"F","Serviço","Serviço","4.10.0.2.","AGETOP",160402,"CUMEEIRA  P/ TELHA PLAN RESINADA COR VERMELHA","m     ",31.95,2,null,null,null,null,null,""]
["S",2,"S",0,4,10,0,0,{"$f":"IF(AND($C850<=4,$C850<>0),0,IF(AND($C850=\"S\",$Y850>0),OFFSET(I850,-1,0)+1,OFFSET(I850,-1,0)))","v":0},0,0,"F","Serviço","Serviço","4.10.0.3.","AGETOP",160403,"EMBOCAMENTO LATERAL  (OITOES)","m     ",22.04,2,null,null,null,null,null,""]
["S",2,"S",0,4,10,0,0,{"$f":"IF(AND($C851<=4,$C851<>0),0,IF(AND($C851=\"S\",$Y851>0),OFFSET(I851,-1,0)+1,OFFSET(I851,-1,0)))","v":0},0,0,"F","Serviço","Serviço","4.10.0.4.","AGETOP",160404,"EMBOCAMENTO DE BEIRAL","M     ",63.9,2,null,null,null,null,null,""]
[2,2,2,4,4,11,0,0,{"$f":"IF(AND($C852<=4,$C852<>0),0,IF(AND($C852=\"S\",$Y852>0),OFFSET(I852,-1,0)+1,OFFSET(I852,-1,0)))","v":0},34,4,"F","Nível 2","Nível 2","4.11.","AGETOP",null,"ESQUADRIAS METÁLICAS","-",null,2,null,null,null,null,null,""]
["S",2,"S",0,4,11,0,0,{"$f":"IF(AND($C853<=4,$C853<>0),0,IF(AND($C853=\"S\",$Y853>0),OFFSET(I853,-1,0)+1,OFFSET(I853,-1,0)))","v":0},0,0,"F","Serviço","Serviço","4.11.0.1.","AGETOP",180311,"GRADE DE PROTECAO/TUBO INDUSTRIAL/FERRO REDONDO-GP5","m2    ",62.4,2,null,null,null,null,null,""]
["S",2,"S",0,4,11,0,0,{"$f":"IF(AND($C854<=4,$C854<>0),0,IF(AND($C854=\"S\",$Y854>0),OFFSET(I854,-1,0)+1,OFFSET(I854,-1,0)))","v":0},0,0,"F","Serviço","Serviço","4.11.0.2.","AGETOP",180403,"ESQ.MAXIMO AR CHAPA/VIDRO J1/J2/J7/J15 C/FERRAGENS","m2    ",57.6,2,null,null,null,null,null,""]
["S",2,"S",0,4,11,0,0,{"$f":"IF(AND($C855<=4,$C855<>0),0,IF(AND($C855=\"S\",$Y855>0),OFFSET(I855,-1,0)+1,OFFSET(I855,-1,0)))","v":0},0,0,"F","Serviço","Serviço","4.11.0.3.","AGETOP",180501,"PORTA DE ABRIR EM CHAPA PF-1 C/FERRAGENS","m2    ",6.72,2,null,null,null,null,null,""]
[2,2,2,2,4,12,0,0,{"$f":"IF(AND($C856<=4,$C856<>0),0,IF(AND($C856=\"S\",$Y856>0),OFFSET(I856,-1,0)+1,OFFSET(I856,-1,0)))","v":0},30,2,"F","Nível 2","Nível 2","4.12.","AGETOP",null,"VIDROS","-",null,2,null,null,null,null,null,""]
["S",2,"S",0,4,12,0,0,{"$f":"IF(AND($C857<=4,$C857<>0),0,IF(AND($C857=\"S\",$Y857>0),OFFSET(I857,-1,0)+1,OFFSET(I857,-1,0)))","v":0},0,0,"F","Serviço","Serviço","4.12.0.1.","AGETOP",190102,"VIDRO LISO 4 MM - COLOCADO","m2    ",57.6,2,null,null,null,null,null,""]
[2,2,2,4,4,13,0,0,{"$f":"IF(AND($C858<=4,$C858<>0),0,IF(AND($C858=\"S\",$Y858>0),OFFSET(I858,-1,0)+1,OFFSET(I858,-1,0)))","v":0},28,4,"F","Nível 2","Nível 2","4.13.","AGETOP",null,"REVESTIMENTO DE PAREDE","-",null,2,null,null,null,null,null,""]
["S",2,"S",0,4,13,0,0,{"$f":"IF(AND($C859<=4,$C859<>0),0,IF(AND($C859=\"S\",$Y859>0),OFFSET(I859,-1,0)+1,OFFSET(I859,-1,0)))","v":0},0,0,"F","Serviço","Serviço","4.13.0.1.","AGETOP",200101,"CHAPISCO COMUM","m2    ",444.82,2,null,null,null,null,null,""]
["S",2,"S",0,4,13,0,0,{"$f":"IF(AND($C860<=4,$C860<>0),0,IF(AND($C860=\"S\",$Y860>0),OFFSET(I860,-1,0)+1,OFFSET(I860,-1,0)))","v":0},0,0,"F","Serviço","Serviço","4.13.0.2.","AGETOP",200499,"REBOCO PAULISTA A-14 (1CALH:4ARMLC+100kgCI/M3)","m2    ",444.82,2,null,null,null,null,null,""]
["S",2,"S",0,4,13,0,0,{"$f":"IF(AND($C861<=4,$C861<>0),0,IF(AND($C861=\"S\",$Y861>0),OFFSET(I861,-1,0)+1,OFFSET(I861,-1,0)))","v":0},0,0,"F","Serviço","Serviço","4.13.0.3.","COMPOSIÇÃO","COMP 415_SEE","PEITORIL EM GRANITO CINZA, LARGURA VARIÁVEL E PINGADEIRA","M2",5.7120000000000006,2,null,null,null,null,null,""]
[2,2,2,3,4,14,0,0,{"$f":"IF(AND($C862<=4,$C862<>0),0,IF(AND($C862=\"S\",$Y862>0),OFFSET(I862,-1,0)+1,OFFSET(I862,-1,0)))","v":0},24,3,"F","Nível 2","Nível 2","4.14.","AGETOP",null,"FORROS","-",null,2,null,null,null,null,null,""]
["S",2,"S",0,4,14,0,0,{"$f":"IF(AND($C863<=4,$C863<>0),0,IF(AND($C863=\"S\",$Y863>0),OFFSET(I863,-1,0)+1,OFFSET(I863,-1,0)))","v":0},0,0,"F","Serviço","Serviço","4.14.0.1.","AGETOP",210101,"CHAPISCO EM FORRO (1CI: 3 ARG)","m2    ",194.04,2,null,null,null,null,null,""]
["S",2,"S",0,4,14,0,0,{"$f":"IF(AND($C864<=4,$C864<>0),0,IF(AND($C864=\"S\",$Y864>0),OFFSET(I864,-1,0)+1,OFFSET(I864,-1,0)))","v":0},0,0,"F","Serviço","Serviço","4.14.0.2.","AGETOP",210401,"REBOCO PAULISTA EM FORRO(1CALH:4ARML+150KG CI/M3)","m2    ",194.04,2,null,null,null,null,null,""]
[2,2,2,6,4,15,0,0,{"$f":"IF(AND($C865<=4,$C865<>0),0,IF(AND($C865=\"S\",$Y865>0),OFFSET(I865,-1,0)+1,OFFSET(I865,-1,0)))","v":0},21,6,"F","Nível 2","Nível 2","4.15.","AGETOP",null,"REVESTIMENTO DE PISO","-",null,2,null,null,null,null,null,""]
["S",2,"S",0,4,15,0,0,{"$f":"IF(AND($C866<=4,$C866<>0),0,IF(AND($C866=\"S\",$Y866>0),OFFSET(I866,-1,0)+1,OFFSET(I866,-1,0)))","v":0},0,0,"F","Serviço","Serviço","4.15.0.1.","AGETOP",220100,"PASSEIO PROTECAO EM CONC.DESEMPEN.5 CM 1:2,5:3,5 ( INCLUSO ESPELHO DE 30CM/ESCAVAÇÃO/REATERRO/APILOAMENTO/ATERRO INTERNO)","m2    ",84.4,2,null,null,null,null,null,""]
["S",2,"S",0,4,15,0,0,{"$f":"IF(AND($C867<=4,$C867<>0),0,IF(AND($C867=\"S\",$Y867>0),OFFSET(I867,-1,0)+1,OFFSET(I867,-1,0)))","v":0},0,0,"F","Serviço","Serviço","4.15.0.2.","AGETOP",220101,"LASTRO DE CONCRETO REGULARIZADO IMPERMEABILIZADO 1:3:6 ESP=5CM (BASE)","m2    ",259.77999999999997,2,null,null,null,null,null,""]
["S",2,"S",0,4,15,0,0,{"$f":"IF(AND($C868<=4,$C868<>0),0,IF(AND($C868=\"S\",$Y868>0),OFFSET(I868,-1,0)+1,OFFSET(I868,-1,0)))","v":0},0,0,"F","Serviço","Serviço","4.15.0.3.","AGETOP",221101,"GRANITINA 8MM FUNDIDA COM CONTRAPISO (1CI:3ARML) E=2CM E JUNTA PLASTICA 27MM","m2    ",259.77999999999997,2,null,null,null,null,null,""]
["S",2,"S",0,4,15,0,0,{"$f":"IF(AND($C869<=4,$C869<>0),0,IF(AND($C869=\"S\",$Y869>0),OFFSET(I869,-1,0)+1,OFFSET(I869,-1,0)))","v":0},0,0,"F","Serviço","Serviço","4.15.0.4.","AGETOP",221102,"RODAPÉ FUNDIDO DE GRANITINA 7CM","m     ",137.75,2,null,null,null,null,null,""]
["S",2,"S",0,4,15,0,0,{"$f":"IF(AND($C870<=4,$C870<>0),0,IF(AND($C870=\"S\",$Y870>0),OFFSET(I870,-1,0)+1,OFFSET(I870,-1,0)))","v":0},0,0,"F","Serviço","Serviço","4.15.0.5.","AGETOP",221104,"RASPAGEM E APLICAÇÃO RESINA ACRÍLICA DUAS DEMÃOS","m2    ",269.42,2,null,null,null,null,null,""]
[2,2,2,3,4,16,0,0,{"$f":"IF(AND($C871<=4,$C871<>0),0,IF(AND($C871=\"S\",$Y871>0),OFFSET(I871,-1,0)+1,OFFSET(I871,-1,0)))","v":0},15,3,"F","Nível 2","Nível 2","4.16.","AGETOP",null,"MARCENARIA","-",null,2,null,null,null,null,null,""]
["S",2,"S",0,4,16,0,0,{"$f":"IF(AND($C872<=4,$C872<>0),0,IF(AND($C872=\"S\",$Y872>0),OFFSET(I872,-1,0)+1,OFFSET(I872,-1,0)))","v":0},0,0,"F","Serviço","Serviço","4.16.0.1.","AGETOP",240106,"BATE CARTEIRA ENVERNIZADO E ASSENT. 2,5 X 12 CM","M     ",69.7,2,null,null,null,null,null,""]
["S",2,"S",0,4,16,0,0,{"$f":"IF(AND($C873<=4,$C873<>0),0,IF(AND($C873=\"S\",$Y873>0),OFFSET(I873,-1,0)+1,OFFSET(I873,-1,0)))","v":0},0,0,"F","Serviço","Serviço","4.16.0.2.","AGETOP",240110,"QUADRO AVISO TP-1 (1,20 X 1,20 M)","Un    ",4,2,null,null,null,null,null,""]
[2,2,2,9,4,17,0,0,{"$f":"IF(AND($C874<=4,$C874<>0),0,IF(AND($C874=\"S\",$Y874>0),OFFSET(I874,-1,0)+1,OFFSET(I874,-1,0)))","v":0},12,9,"F","Nível 2","Nível 2","4.17.","AGETOP",null,"PINTURA","-",null,2,null,null,null,null,null,""]
["S",2,"S",0,4,17,0,0,{"$f":"IF(AND($C875<=4,$C875<>0),0,IF(AND($C875=\"S\",$Y875>0),OFFSET(I875,-1,0)+1,OFFSET(I875,-1,0)))","v":0},0,0,"F","Serviço","Serviço","4.17.0.1.","AGETOP",261000,"PINTURA LATEX ACRILICA 2 DEMAOS C/SELADOR","m2    ",63.83,2,null,null,null,null,null,""]
["S",2,"S",0,4,17,0,0,{"$f":"IF(AND($C876<=4,$C876<>0),0,IF(AND($C876=\"S\",$Y876>0),OFFSET(I876,-1,0)+1,OFFSET(I876,-1,0)))","v":0},0,0,"F","Serviço","Serviço","4.17.0.2.","AGETOP",261301,"EMASSAMENTO COM MASSA PVA UMA DEMAO","m2    ",101.76,2,null,null,null,null,null,""]
["S",2,"S",0,4,17,0,0,{"$f":"IF(AND($C877<=4,$C877<>0),0,IF(AND($C877=\"S\",$Y877>0),OFFSET(I877,-1,0)+1,OFFSET(I877,-1,0)))","v":0},0,0,"F","Serviço","Serviço","4.17.0.3.","AGETOP",261302,"PINTURA LATEX DUAS DEMAOS COM SELADOR","m2    ",295.8,2,null,null,null,null,null,""]
["S",2,"S",0,4,17,0,0,{"$f":"IF(AND($C878<=4,$C878<>0),0,IF(AND($C878=\"S\",$Y878>0),OFFSET(I878,-1,0)+1,OFFSET(I878,-1,0)))","v":0},0,0,"F","Serviço","Serviço","4.17.0.4.","AGETOP",261303,"PINTURA LATEX TRES DEMAOS COM SELADOR","m2    ",80.69,2,null,null,null,null,null,""]
["S",2,"S",0,4,17,0,0,{"$f":"IF(AND($C879<=4,$C879<>0),0,IF(AND($C879=\"S\",$Y879>0),OFFSET(I879,-1,0)+1,OFFSET(I879,-1,0)))","v":0},0,0,"F","Serviço","Serviço","4.17.0.5.","AGETOP",261304,"EMASSAMENTO ACRILICO 2 DEMAOS","m2    ",243.17,2,null,null,null,null,null,""]
["S",2,"S",0,4,17,0,0,{"$f":"IF(AND($C880<=4,$C880<>0),0,IF(AND($C880=\"S\",$Y880>0),OFFSET(I880,-1,0)+1,OFFSET(I880,-1,0)))","v":0},0,0,"F","Serviço","Serviço","4.17.0.6.","AGETOP",261550,"PINT.ESMALTE SINT.PAREDES - 2 DEM.C/SELADOR","m2    ",179.34,2,null,null,null,null,null,""]
["S",2,"S",0,4,17,0,0,{"$f":"IF(AND($C881<=4,$C881<>0),0,IF(AND($C881=\"S\",$Y881>0),OFFSET(I881,-1,0)+1,OFFSET(I881,-1,0)))","v":0},0,0,"F","Serviço","Serviço","4.17.0.7.","AGETOP",261602,"PINT.ESMALTE/ESQUAD.FERRO C/FUNDO ANTICOR.","m2    ",126.72,2,null,null,null,null,null,""]
["S",2,"S",0,4,17,0,0,{"$f":"IF(AND($C882<=4,$C882<>0),0,IF(AND($C882=\"S\",$Y882>0),OFFSET(I882,-1,0)+1,OFFSET(I882,-1,0)))","v":0},0,0,"F","Serviço","Serviço","4.17.0.8.","AGETOP",261623,"LETREIRO PEQ.PORTE A PINCEL EM PAREDE E PORTAS","m2    ",0.48,2,null,null,null,null,null,""]
[2,2,2,3,4,18,0,0,{"$f":"IF(AND($C883<=4,$C883<>0),0,IF(AND($C883=\"S\",$Y883>0),OFFSET(I883,-1,0)+1,OFFSET(I883,-1,0)))","v":0},3,188,"F","Nível 2","Nível 2","4.18.","AGETOP",null,"DIVERSOS","-",null,2,null,null,null,null,null,""]
["S",2,"S",0,4,18,0,0,{"$f":"IF(AND($C884<=4,$C884<>0),0,IF(AND($C884=\"S\",$Y884>0),OFFSET(I884,-1,0)+1,OFFSET(I884,-1,0)))","v":0},0,0,"F","Serviço","Serviço","4.18.0.1.","AGETOP",270501,"LIMPEZA FINAL DE OBRA - (OBRAS CIVIS)","m2    ",268.33,2,null,null,null,null,null,""]
["S",2,"S",0,4,18,0,0,{"$f":"IF(AND($C885<=4,$C885<>0),0,IF(AND($C885=\"S\",$Y885>0),OFFSET(I885,-1,0)+1,OFFSET(I885,-1,0)))","v":0},0,0,"F","Serviço","Serviço","4.18.0.2.","AGETOP",271210,"QUADRO DE GIZ EMBOÇO/PINTURA COMPLETO","m2    ",19.2,2,null,null,null,null,null,""]
[1,1,1,190,5,0,0,0,{"$f":"IF(AND($C886<=4,$C886<>0),0,IF(AND($C886=\"S\",$Y886>0),OFFSET(I886,-1,0)+1,OFFSET(I886,-1,0)))","v":0},442,190,"F","Nível 1","Nível 1","5.","AGETOP",null,"BLOCO RECREIO COM SANITÁRIOS","UN",1,1,null,null,null,null,null,""]
[2,2,2,2,5,1,0,0,{"$f":"IF(AND($C887<=4,$C887<>0),0,IF(AND($C887=\"S\",$Y887>0),OFFSET(I887,-1,0)+1,OFFSET(I887,-1,0)))","v":0},189,2,"F","Nível 2","Nível 2","5.1.","AGETOP",null,"SERVIÇOS PRELIMINARES","-",null,1,null,null,null,null,null,""]
["S",2,"S",0,5,1,0,0,{"$f":"IF(AND($C888<=4,$C888<>0),0,IF(AND($C888=\"S\",$Y888>0),OFFSET(I888,-1,0)+1,OFFSET(I888,-1,0)))","v":0},0,0,"F","Serviço","Serviço","5.1.0.1.","AGETOP",20701,"LOCAÇÃO DA OBRA, EXECUÇÃO DE GABARITO SEM REAPROVEITAMENTO, INCLUSO PINTURA (FACE INTERNA DO RIPÃO 15CM) E PIQUETE COM TESTEMUNHA","m2    ",102.96,1,null,null,null,null,null,""]
[2,2,2,2,5,2,0,0,{"$f":"IF(AND($C889<=4,$C889<>0),0,IF(AND($C889=\"S\",$Y889>0),OFFSET(I889,-1,0)+1,OFFSET(I889,-1,0)))","v":0},187,2,"F","Nível 2","Nível 2","5.2.","AGETOP",null,"TRANSPORTES","-",null,1,null,null,null,null,null,""]
[{"$f":"CHOOSE(1+LOG(1+2*(ORÇAMENTO.Nivel=\"Nível 1\")+4*(ORÇAMENTO.Nivel=\"Nível 2\")+8*(ORÇAMENTO.Nivel=\"Nível 3\")+16*(ORÇAMENTO.Nivel=\"Nível 4\")+32*(ORÇAMENTO.Nivel=\"Serviço\"),2),0,1,2,3,4,\"S\")","v":"S"},2,"S",0,5,2,0,0,{"$f":"IF(AND($C890<=4,$C890<>0),0,IF(AND($C890=\"S\",$Y890>0),OFFSET(I890,-1,0)+1,OFFSET(I890,-1,0)))","v":0},0,0,"F","Serviço","Serviço","5.2.0.1.","AGETOP",30101,"TRANSPORTE DE ENTULHO EM CAMINHÃO  INCLUSO A CARGA MANUAL","m3    ",7.2,1,null,null,null,null,null,""]
[2,2,2,5,5,3,0,0,{"$f":"IF(AND($C891<=4,$C891<>0),0,IF(AND($C891=\"S\",$Y891>0),OFFSET(I891,-1,0)+1,OFFSET(I891,-1,0)))","v":0},185,5,"F","Nível 2","Nível 2","5.3.","AGETOP",null,"SERVIÇO EM TERRA","-",null,1,null,null,null,null,null,""]
["S",2,"S",0,5,3,0,0,{"$f":"IF(AND($C892<=4,$C892<>0),0,IF(AND($C892=\"S\",$Y892>0),OFFSET(I892,-1,0)+1,OFFSET(I892,-1,0)))","v":0},0,0,"F","Serviço","Serviço","5.3.0.1.","AGETOP",40101,"ESCAVACAO MANUAL DE VALAS < 1 MTS. (OBRAS CIVIS)","m3    ",9.32,1,null,null,null,null,null,""]
["S",2,"S",0,{"$f":"IF($C893=1,OFFSET(E893,-1,0)+1,OFFSET(E893,-1,0))","v":5},{"$f":"IF($C893=1,0,IF($C893=2,OFFSET(F893,-1,0)+1,OFFSET(F893,-1,0)))","v":3},{"$f":"IF(AND($C893<=2,$C893<>0),0,IF($C893=3,OFFSET(G893,-1,0)+1,OFFSET(G893,-1,0)))","v":0},{"$f":"IF(AND($C893<=3,$C893<>0),0,IF($C893=4,OFFSET(H893,-1,0)+1,OFFSET(H893,-1,0)))","v":0},{"$f":"IF(AND($C893<=4,$C893<>0),0,IF(AND($C893=\"S\",$Y893>0),OFFSET(I893,-1,0)+1,OFFSET(I893,-1,0)))","v":0},0,0,"F","Serviço","Serviço","5.3.0.2.","AGETOP",40902,"REATERRO COM APILOAMENTO","m3    ",6.54,1,null,null,null,null,null,""]
["S",2,"S",0,5,3,0,0,{"$f":"IF(AND($C894<=4,$C894<>0),0,IF(AND($C894=\"S\",$Y894>0),OFFSET(I894,-1,0)+1,OFFSET(I894,-1,0)))","v":0},0,0,"F","Serviço","Serviço","5.3.0.3.","AGETOP",41002,"APILOAMENTO","m2    ",101.59,1,null,null,null,null,null,""]
["S",2,"S",0,5,3,0,0,{"$f":"IF(AND($C895<=4,$C895<>0),0,IF(AND($C895=\"S\",$Y895>0),OFFSET(I895,-1,0)+1,OFFSET(I895,-1,0)))","v":0},0,0,"F","Serviço","Serviço","5.3.0.4.","AGETOP",41003,"ATERRO INTERNO SEM APILOAM.C/TR.EM CARRINHO MÃO","m3    ",8.98,1,null,null,null,null,null,""]
[2,2,2,14,5,4,0,0,{"$f":"IF(AND($C896<=4,$C896<>0),0,IF(AND($C896=\"S\",$Y896>0),OFFSET(I896,-1,0)+1,OFFSET(I896,-1,0)))","v":0},180,14,"F","Nível 2","Nível 2","5.4.","AGETOP",null,"FUNDAÇÕES E SONDAGENS","-",null,1,null,null,null,null,null,""]
["S",2,"S",0,5,4,0,0,{"$f":"IF(AND($C897<=4,$C897<>0),0,IF(AND($C897=\"S\",$Y897>0),OFFSET(I897,-1,0)+1,OFFSET(I897,-1,0)))","v":0},0,0,"F","Serviço","Serviço","5.4.0.1.","AGETOP",50201,"EMBASAMENTO COM TIJOLO COMUM","m3    ",1.75,1,null,null,null,null,null,""]
["S",2,"S",0,5,4,0,0,{"$f":"IF(AND($C898<=4,$C898<>0),0,IF(AND($C898=\"S\",$Y898>0),OFFSET(I898,-1,0)+1,OFFSET(I898,-1,0)))","v":0},0,0,"F","Serviço","Serviço","5.4.0.2.","AGETOP",50302,"ESTACA A TRADO DIAM.30 CM SEM FERRO","M     ",82.75,1,null,null,null,null,null,""]
["S",{"$f":"IF(OR(C899=\"s\",C899=0),OFFSET(B899,-1,0),C899)","v":2},{"$f":"IF(OFFSET(C899,-1,0)=\"L\",1,IF(OFFSET(C899,-1,0)=1,2,IF(OR(A899=\"s\",A899=0),\"S\",IF(AND(OFFSET(C899,-1,0)=2,A899=4),3,IF(AND(OR(OFFSET(C899,-1,0)=\"s\",OFFSET(C899,-1,0)=0),A899<>\"s\",A899>OFFSET(B899,-1,0)),OFFSET(B899,-1,0),A899)))))","v":"S"},{"$f":"IF(OR(C899=\"S\",C899=0),0,IF(ISERROR(K899),J899,SMALL(J899:K899,1)))","v":0},5,4,0,0,{"$f":"IF(AND($C899<=4,$C899<>0),0,IF(AND($C899=\"S\",$Y899>0),OFFSET(I899,-1,0)+1,OFFSET(I899,-1,0)))","v":0},0,0,"F","Serviço","Serviço","5.4.0.3.","AGETOP",50901,"ESCAVACAO MANUAL DE VALAS (SAPATAS/BLOCOS)","m3    ",5.44,1,null,null,null,null,null,""]
["S",2,"S",0,5,4,0,0,{"$f":"IF(AND($C900<=4,$C900<>0),0,IF(AND($C900=\"S\",$Y900>0),OFFSET(I900,-1,0)+1,OFFSET(I900,-1,0)))","v":0},0,0,"F","Serviço","Serviço","5.4.0.4.","AGETOP",50902,"APILOAMENTO (BLOCOS/SAPATAS)","m2    ",4.1399999999999997,1,null,null,null,null,null,""]
["S",2,"S",0,5,4,0,0,{"$f":"IF(AND($C901<=4,$C901<>0),0,IF(AND($C901=\"S\",$Y901>0),OFFSET(I901,-1,0)+1,OFFSET(I901,-1,0)))","v":0},0,0,"F","Serviço","Serviço","5.4.0.5.","AGETOP",50903,"REATERRO C/APILOAMENTO (BLOCOS/SAPATAS)","m3    ",2.81,1,null,null,null,null,null,""]
["S",2,"S",0,5,4,0,0,{"$f":"IF(AND($C902<=4,$C902<>0),0,IF(AND($C902=\"S\",$Y902>0),OFFSET(I902,-1,0)+1,OFFSET(I902,-1,0)))","v":0},0,0,"F","Serviço","Serviço","5.4.0.6.","AGETOP",51009,"FORMA TABUA PINHO P/FUNDACOES U=3V - (OBRAS CIVIS)","m2    ",15.62,1,null,null,null,null,null,""]
["S",2,"S",0,5,4,0,0,{"$f":"IF(AND($C903<=4,$C903<>0),0,IF(AND($C903=\"S\",$Y903>0),OFFSET(I903,-1,0)+1,OFFSET(I903,-1,0)))","v":0},0,0,"F","Serviço","Serviço","5.4.0.7.","AGETOP",51017,"PREPARO COM BETONEIRA E TRANSPORTE MANUAL DE CONCRETO FCK-20  - (O.C.)","m3    ",2.63,1,null,null,null,null,null,""]
["S",2,"S",0,5,4,0,0,{"$f":"IF(AND($C904<=4,$C904<>0),0,IF(AND($C904=\"S\",$Y904>0),OFFSET(I904,-1,0)+1,OFFSET(I904,-1,0)))","v":0},{"$f":"IF(OR($C904=\"S\",$C904=0),0,MATCH(0,OFFSET($D904,1,$C904,ROW($C$1328)-ROW($C904)),0))","v":0},{"$f":"IF(OR($C904=\"S\",$C904=0),0,MATCH(OFFSET($D904,0,$C904)+1,OFFSET($D904,1,$C904,ROW($C$1328)-ROW($C904)),0))","v":0},"F","Serviço","Serviço","5.4.0.8.","AGETOP",51026,"LANÇAMENTO/APLICAÇÃO/ADENSAMENTO DE CONCRETO EM FUNDAÇÃO- (O.C.)","m3    ",2.63,1,null,null,null,null,null,""]
["S",2,"S",0,5,4,0,0,{"$f":"IF(AND($C905<=4,$C905<>0),0,IF(AND($C905=\"S\",$Y905>0),OFFSET(I905,-1,0)+1,OFFSET(I905,-1,0)))","v":0},0,0,"F","Serviço","Serviço","5.4.0.9.","AGETOP",51027,"LASTRO DE BRITA (OBRAS CIVIS)","m3    ",0.8,1,null,null,null,null,null,""]
["S",2,"S",0,5,4,0,0,{"$f":"IF(AND($C906<=4,$C906<>0),0,IF(AND($C906=\"S\",$Y906>0),OFFSET(I906,-1,0)+1,OFFSET(I906,-1,0)))","v":0},0,0,"F","Serviço","Serviço","5.4.0.10.","AGETOP",52003,"ACO CA-50A - 6,3 MM (1/4\") - (OBRAS CIVIS)","Kg    ",125,1,null,null,null,null,null,""]
["S",2,"S",0,5,4,0,0,{"$f":"IF(AND($C907<=4,$C907<>0),0,IF(AND($C907=\"S\",$Y907>0),OFFSET(I907,-1,0)+1,OFFSET(I907,-1,0)))","v":0},0,0,"F","Serviço","Serviço","5.4.0.11.","AGETOP",52004,"ACO CA 50-A - 8,0 MM (5/16\") - (OBRAS CIVIS)","Kg    ",79,1,null,null,null,null,null,""]
["S",2,"S",0,5,4,0,0,{"$f":"IF(AND($C908<=4,$C908<>0),0,IF(AND($C908=\"S\",$Y908>0),OFFSET(I908,-1,0)+1,OFFSET(I908,-1,0)))","v":0},0,0,"F","Serviço","Serviço","5.4.0.12.","AGETOP",52005,"ACO CA-50A - 10,0 MM (3/8\") - (OBRAS CIVIS)","Kg    ",27,1,null,null,null,null,null,""]
["S",2,"S",0,5,4,0,0,{"$f":"IF(AND($C909<=4,$C909<>0),0,IF(AND($C909=\"S\",$Y909>0),OFFSET(I909,-1,0)+1,OFFSET(I909,-1,0)))","v":0},0,0,"F","Serviço","Serviço","5.4.0.13.","AGETOP",52014,"ACO CA-60 - 5,0 MM - (OBRAS CIVIS)","Kg    ",25,1,null,null,null,null,null,""]
[2,2,2,9,5,5,0,0,{"$f":"IF(AND($C910<=4,$C910<>0),0,IF(AND($C910=\"S\",$Y910>0),OFFSET(I910,-1,0)+1,OFFSET(I910,-1,0)))","v":0},166,9,"F","Nível 2","Nível 2","5.5.","AGETOP",null,"ESTRUTURA","-",null,1,null,null,null,null,null,""]
["S",2,"S",0,5,5,0,0,{"$f":"IF(AND($C911<=4,$C911<>0),0,IF(AND($C911=\"S\",$Y911>0),OFFSET(I911,-1,0)+1,OFFSET(I911,-1,0)))","v":0},0,0,"F","Serviço","Serviço","5.5.0.1.","AGETOP",60203,"FORMA- CH.COMPENSADA 12 MM UTILIZAÇÃO 3 VEZES - (OBRAS CIVIS)","m2    ",116.95,1,null,null,null,null,null,""]
["S",2,"S",0,5,5,0,0,{"$f":"IF(AND($C912<=4,$C912<>0),0,IF(AND($C912=\"S\",$Y912>0),OFFSET(I912,-1,0)+1,OFFSET(I912,-1,0)))","v":0},0,0,"F","Serviço","Serviço","5.5.0.2.","AGETOP",60304,"ACO CA-50 A - 8,0 MM (5/16\") - (OBRAS CIVIS)","Kg    ",58,1,null,null,null,null,null,""]
["S",2,"S",0,5,5,0,0,{"$f":"IF(AND($C913<=4,$C913<>0),0,IF(AND($C913=\"S\",$Y913>0),OFFSET(I913,-1,0)+1,OFFSET(I913,-1,0)))","v":0},0,0,"F","Serviço","Serviço","5.5.0.3.","AGETOP",60305,"ACO CA-50A - 10,0 MM (3/8\") - (OBRAS CIVIS)","Kg    ",275,1,null,null,null,null,null,""]
["S",2,"S",0,5,5,0,0,{"$f":"IF(AND($C914<=4,$C914<>0),0,IF(AND($C914=\"S\",$Y914>0),OFFSET(I914,-1,0)+1,OFFSET(I914,-1,0)))","v":0},0,0,"F","Serviço","Serviço","5.5.0.4.","AGETOP",60306,"ACO CA-50A - 12,5 MM (1/2\") - (OBRAS CIVIS)","Kg    ",45,1,null,null,null,null,null,""]
["S",2,"S",0,5,5,0,0,{"$f":"IF(AND($C915<=4,$C915<>0),0,IF(AND($C915=\"S\",$Y915>0),OFFSET(I915,-1,0)+1,OFFSET(I915,-1,0)))","v":0},0,0,"F","Serviço","Serviço","5.5.0.5.","AGETOP",60314,"ACO CA - 60 - 5,0 MM - (OBRAS CIVIS)","Kg    ",201,1,null,null,null,null,null,""]
["S",2,"S",0,5,5,0,0,{"$f":"IF(AND($C916<=4,$C916<>0),0,IF(AND($C916=\"S\",$Y916>0),OFFSET(I916,-1,0)+1,OFFSET(I916,-1,0)))","v":0},0,0,"F","Serviço","Serviço","5.5.0.6.","AGETOP",60507,"PREPARO COM BETONEIRA E TRANSPORTE MANUAL DE CONCRETO FCK-20 - (O.C.)","m3    ",6.32,1,null,null,null,null,null,""]
["S",2,"S",0,5,5,0,0,{"$f":"IF(AND($C917<=4,$C917<>0),0,IF(AND($C917=\"S\",$Y917>0),OFFSET(I917,-1,0)+1,OFFSET(I917,-1,0)))","v":0},0,0,"F","Serviço","Serviço","5.5.0.7.","AGETOP",60802,"LANÇAMENTO/APLICAÇÃO/ADENSAMENTO DE CONCRETO EM ESTRUTURA - (O.C.)","m3    ",6.32,1,null,null,null,null,null,""]
["S",2,"S",0,5,5,0,0,{"$f":"IF(AND($C918<=4,$C918<>0),0,IF(AND($C918=\"S\",$Y918>0),OFFSET(I918,-1,0)+1,OFFSET(I918,-1,0)))","v":0},0,0,"F","Serviço","Serviço","5.5.0.8.","AGETOP",61101,"FORRO EM LAJE PRE-MOLDADA INC.CAPEAMENTO/FERR.DISTRIB./ESCORAMENTO E FORMA/DESFORMA","m2    ",55.15,1,null,null,null,null,null,""]
[2,2,2,33,5,6,0,0,{"$f":"IF(AND($C919<=4,$C919<>0),0,IF(AND($C919=\"S\",$Y919>0),OFFSET(I919,-1,0)+1,OFFSET(I919,-1,0)))","v":0},157,33,"F","Nível 2","Nível 2","5.6.","AGETOP",null,"INSTALAÇÕES ELÉTRICAS","-",null,1,null,null,null,null,null,""]
[3,3,3,5,5,6,1,0,{"$f":"IF(AND($C920<=4,$C920<>0),0,IF(AND($C920=\"S\",$Y920>0),OFFSET(I920,-1,0)+1,OFFSET(I920,-1,0)))","v":0},32,5,"F","Nível 3","Nível 3","5.6.1.","AGETOP",null,"QUADRO DE DISTRIBUIÇÃO","-",null,1,null,null,null,null,null,""]
["S",3,"S",0,5,6,1,0,{"$f":"IF(AND($C921<=4,$C921<>0),0,IF(AND($C921=\"S\",$Y921>0),OFFSET(I921,-1,0)+1,OFFSET(I921,-1,0)))","v":0},0,0,"F","Serviço","Serviço","5.6.1.1.","AGETOP",72170,"QUADRO DE DISTRIBUIÇÃO DE EMBUTIR EM PVC CB 12E - 80A","Un    ",1,1,null,null,null,null,null,""]
["S",3,"S",0,5,6,1,0,{"$f":"IF(AND($C922<=4,$C922<>0),0,IF(AND($C922=\"S\",$Y922>0),OFFSET(I922,-1,0)+1,OFFSET(I922,-1,0)))","v":0},0,0,"F","Serviço","Serviço","5.6.1.2.","AGETOP",71173,"DISJUNTOR TRIPOLAR DE 10 A 35-A","Un    ",1,1,null,null,null,null,null,""]
["S",3,"S",0,5,6,1,0,{"$f":"IF(AND($C923<=4,$C923<>0),0,IF(AND($C923=\"S\",$Y923>0),OFFSET(I923,-1,0)+1,OFFSET(I923,-1,0)))","v":0},0,0,"F","Serviço","Serviço","5.6.1.3.","AGETOP",71171,"DISJUNTOR MONOPOLAR DE 10 A 32-A","Un    ",5,1,null,null,null,null,null,""]
["S",3,"S",0,5,6,1,0,{"$f":"IF(AND($C924<=4,$C924<>0),0,IF(AND($C924=\"S\",$Y924>0),OFFSET(I924,-1,0)+1,OFFSET(I924,-1,0)))","v":0},0,0,"F","Serviço","Serviço","5.6.1.4.","AGETOP",71450,"INTERRUPTOR DIFERENCIAL RESIDUAL (D.R.) BIPOLAR DE 25A-30mA","Un    ",1,1,null,null,null,null,null,""]
[3,3,3,3,5,6,2,0,{"$f":"IF(AND($C925<=4,$C925<>0),0,IF(AND($C925=\"S\",$Y925>0),OFFSET(I925,-1,0)+1,OFFSET(I925,-1,0)))","v":0},27,3,"F","Nível 3","Nível 3","5.6.2.","AGETOP",null,"CABOS E FIOS (CONDUTORES)","-",null,1,null,null,null,null,null,""]
["S",3,"S",0,5,6,2,0,{"$f":"IF(AND($C926<=4,$C926<>0),0,IF(AND($C926=\"S\",$Y926>0),OFFSET(I926,-1,0)+1,OFFSET(I926,-1,0)))","v":0},0,0,"F","Serviço","Serviço","5.6.2.1.","AGETOP",70563,"CABO ISOLADO PVC 750 V. No. 2,5 MM2","m     ",300,1,null,null,null,null,null,""]
["S",3,"S",0,5,6,2,0,{"$f":"IF(AND($C927<=4,$C927<>0),0,IF(AND($C927=\"S\",$Y927>0),OFFSET(I927,-1,0)+1,OFFSET(I927,-1,0)))","v":0},0,0,"F","Serviço","Serviço","5.6.2.2.","AGETOP",70541,"CABO DE COBRE NU No. 16 MM2 (6,94 M/KG)","M     ",10,1,null,null,null,null,null,""]
[3,3,3,24,5,6,3,0,{"$f":"IF(AND($C928<=4,$C928<>0),0,IF(AND($C928=\"S\",$Y928>0),OFFSET(I928,-1,0)+1,OFFSET(I928,-1,0)))","v":0},24,{"$error":"#N/A"},"F","Nível 3","Nível 3","5.6.3.","AGETOP",null,"ELETRODUTOS E ACESSÓRIOS","-",null,1,null,null,null,null,null,""]
["S",3,"S",0,5,6,3,0,{"$f":"IF(AND($C929<=4,$C929<>0),0,IF(AND($C929=\"S\",$Y929>0),OFFSET(I929,-1,0)+1,OFFSET(I929,-1,0)))","v":0},0,0,"F","Serviço","Serviço","5.6.3.1.","AGETOP",71194,"ELETRODUTO PVC FLEXÍVEL - MANGUEIRA CORRUGADA LEVE - DIAM. 25MM","M     ",60,1,null,null,null,null,null,""]
["S",3,"S",0,5,6,3,0,{"$f":"IF(AND($C930<=4,$C930<>0),0,IF(AND($C930=\"S\",$Y930>0),OFFSET(I930,-1,0)+1,OFFSET(I930,-1,0)))","v":0},0,0,"F","Serviço","Serviço","5.6.3.2.","AGETOP",71201,"ELETRODUTO DE PVC RIGIDO DIAMETRO 3/4\"","M     ",20,1,null,null,null,null,null,""]
["S",3,"S",0,5,6,3,0,{"$f":"IF(AND($C931<=4,$C931<>0),0,IF(AND($C931=\"S\",$Y931>0),OFFSET(I931,-1,0)+1,OFFSET(I931,-1,0)))","v":0},0,0,"F","Serviço","Serviço","5.6.3.3.","AGETOP",70681,"CAIXA METALICA OCTOGONAL FUNDO MOVEL, SIMPLES 2\"","Un    ",6,1,null,null,null,null,null,""]
["S",3,"S",0,5,6,3,0,{"$f":"IF(AND($C932<=4,$C932<>0),0,IF(AND($C932=\"S\",$Y932>0),OFFSET(I932,-1,0)+1,OFFSET(I932,-1,0)))","v":0},0,0,"F","Serviço","Serviço","5.6.3.4.","AGETOP",70680,"CAIXA MET.HEXAGONAL P/ARANDELA (SEXTAVADA 3\"X3\")","Un    ",3,1,null,null,null,null,null,""]
["S",3,"S",0,5,6,3,0,{"$f":"IF(AND($C933<=4,$C933<>0),0,IF(AND($C933=\"S\",$Y933>0),OFFSET(I933,-1,0)+1,OFFSET(I933,-1,0)))","v":0},0,0,"F","Serviço","Serviço","5.6.3.5.","AGETOP",70691,"CAIXA METALICA RET. 4\" X 2\" X 2\"","Un    ",10,1,null,null,null,null,null,""]
["S",3,"S",0,5,6,3,0,{"$f":"IF(AND($C934<=4,$C934<>0),0,IF(AND($C934=\"S\",$Y934>0),OFFSET(I934,-1,0)+1,OFFSET(I934,-1,0)))","v":0},0,0,"F","Serviço","Serviço","5.6.3.6.","AGETOP",70692,"CAIXA METALICA QUADRADA 4\"X4\"X2\"","Un    ",2,1,null,null,null,null,null,""]
["S",3,"S",0,5,6,3,0,{"$f":"IF(AND($C935<=4,$C935<>0),0,IF(AND($C935=\"S\",$Y935>0),OFFSET(I935,-1,0)+1,OFFSET(I935,-1,0)))","v":0},0,0,"F","Serviço","Serviço","5.6.3.7.","AGETOP",70645,"CAIXA DE PASSAGEM METÁLICA DE EMBUTIR 15X15X8 CM","Un    ",3,1,null,null,null,null,null,""]
["S",3,"S",0,5,6,3,0,{"$f":"IF(AND($C936<=4,$C936<>0),0,IF(AND($C936=\"S\",$Y936>0),OFFSET(I936,-1,0)+1,OFFSET(I936,-1,0)))","v":0},0,0,"F","Serviço","Serviço","5.6.3.8.","AGETOP",71141,"CURVA DE 90 GRAUS DE PVC RIGIDO DIAM. 3/4\"","Un    ",10,1,null,null,null,null,null,""]
["S",3,"S",0,5,6,3,0,{"$f":"IF(AND($C937<=4,$C937<>0),0,IF(AND($C937=\"S\",$Y937>0),OFFSET(I937,-1,0)+1,OFFSET(I937,-1,0)))","v":0},0,0,"F","Serviço","Serviço","5.6.3.9.","AGETOP",70351,"BRACADEIRA METALICA TIPO \"U\" DIAM. 3/4\"","Un    ",10,1,null,null,null,null,null,""]
["S",3,"S",0,5,6,3,0,{"$f":"IF(AND($C938<=4,$C938<>0),0,IF(AND($C938=\"S\",$Y938>0),OFFSET(I938,-1,0)+1,OFFSET(I938,-1,0)))","v":0},0,0,"F","Serviço","Serviço","5.6.3.10.","AGETOP",71741,"LUVA PVC ROSQUEAVEL DIAMETRO 3/4\"","Un    ",25,1,null,null,null,null,null,""]
["S",3,"S",0,5,6,3,0,{"$f":"IF(AND($C939<=4,$C939<>0),0,IF(AND($C939=\"S\",$Y939>0),OFFSET(I939,-1,0)+1,OFFSET(I939,-1,0)))","v":0},0,0,"F","Serviço","Serviço","5.6.3.11.","AGETOP",70421,"BUCHA E ARRUELA METALICA DIAM. 3/4\"","PR    ",8,1,null,null,null,null,null,""]
["S",3,"S",0,5,6,3,0,{"$f":"IF(AND($C940<=4,$C940<>0),0,IF(AND($C940=\"S\",$Y940>0),OFFSET(I940,-1,0)+1,OFFSET(I940,-1,0)))","v":0},0,0,"F","Serviço","Serviço","5.6.3.12.","AGETOP",71331,"FITA ISOLANTE, ROLO DE 20,00 M","Un    ",1,1,null,null,null,null,null,""]
["S",3,"S",0,5,6,3,0,{"$f":"IF(AND($C941<=4,$C941<>0),0,IF(AND($C941=\"S\",$Y941>0),OFFSET(I941,-1,0)+1,OFFSET(I941,-1,0)))","v":0},0,0,"F","Serviço","Serviço","5.6.3.13.","AGETOP",70929,"CONDULETE METÁLICO - CAIXA COM 5 ENTRADAS ","un    ",8,1,null,null,null,null,null,""]
["S",3,"S",0,5,6,3,0,{"$f":"IF(AND($C942<=4,$C942<>0),0,IF(AND($C942=\"S\",$Y942>0),OFFSET(I942,-1,0)+1,OFFSET(I942,-1,0)))","v":0},0,0,"F","Serviço","Serviço","5.6.3.14.","AGETOP",70930,"CONDULETE METÁLICO - ADAPTADOR DE SAÍDA 3/4\" ","un    ",8,1,null,null,null,null,null,""]
["S",3,"S",0,5,6,3,0,{"$f":"IF(AND($C943<=4,$C943<>0),0,IF(AND($C943=\"S\",$Y943>0),OFFSET(I943,-1,0)+1,OFFSET(I943,-1,0)))","v":0},0,0,"F","Serviço","Serviço","5.6.3.15.","AGETOP",72395,"TAMPA CEGA PARA CONDULETE METÁLICO","Un    ",8,1,null,null,null,null,null,""]
["S",3,"S",0,5,6,3,0,{"$f":"IF(AND($C944<=4,$C944<>0),0,IF(AND($C944=\"S\",$Y944>0),OFFSET(I944,-1,0)+1,OFFSET(I944,-1,0)))","v":0},0,0,"F","Serviço","Serviço","5.6.3.16.","AGETOP",71610,"LUMINÁRIA TIPO ARANDELA DE USO EXTERNO BLINDADA COM GRADE ( PEQUENA ) - BASE E-27","un    ",3,1,null,null,null,null,null,""]
["S",3,"S",0,5,6,3,0,{"$f":"IF(AND($C945<=4,$C945<>0),0,IF(AND($C945=\"S\",$Y945>0),OFFSET(I945,-1,0)+1,OFFSET(I945,-1,0)))","v":0},0,0,"F","Serviço","Serviço","5.6.3.17.","AGETOP",71440,"INTERRUPTOR SIMPLES (1 SECAO)","Un    ",5,1,null,null,null,null,null,""]
["S",3,"S",0,5,6,3,0,{"$f":"IF(AND($C946<=4,$C946<>0),0,IF(AND($C946=\"S\",$Y946>0),OFFSET(I946,-1,0)+1,OFFSET(I946,-1,0)))","v":0},0,0,"F","Serviço","Serviço","5.6.3.18.","AGETOP",71688,"LUMINÁRIA TIPO SPOT DE SOBREPOR PARA 01 LÂMPADA","un    ",2,1,null,null,null,null,null,""]
["S",3,"S",0,5,6,3,0,{"$f":"IF(AND($C947<=4,$C947<>0),0,IF(AND($C947=\"S\",$Y947>0),OFFSET(I947,-1,0)+1,OFFSET(I947,-1,0)))","v":0},0,0,"F","Serviço","Serviço","5.6.3.19.","AGETOP",71644,"LUMINÁRIA TIPO PLAFON DE SOBREPOR QUADRADA PARA 02 LÂMPADAS","Un    ",10,1,null,null,null,null,null,""]
["S",3,"S",0,5,6,3,0,{"$f":"IF(AND($C948<=4,$C948<>0),0,IF(AND($C948=\"S\",$Y948>0),OFFSET(I948,-1,0)+1,OFFSET(I948,-1,0)))","v":0},0,0,"F","Serviço","Serviço","5.6.3.20.","AGETOP",71577,"LAMPADA COMPACTA ELETRÔNICA COM REATOR INTEGRADO  25/26 W","Un    ",22,1,null,null,null,null,null,""]
["S",3,"S",0,5,6,3,0,{"$f":"IF(AND($C949<=4,$C949<>0),0,IF(AND($C949=\"S\",$Y949>0),OFFSET(I949,-1,0)+1,OFFSET(I949,-1,0)))","v":0},0,0,"F","Serviço","Serviço","5.6.3.21.","AGETOP",71520,"LAMPADA A VAPOR DE MERCURIO 125 W","Un    ",3,1,null,null,null,null,null,""]
["S",3,"S",0,5,6,3,0,{"$f":"IF(AND($C950<=4,$C950<>0),0,IF(AND($C950=\"S\",$Y950>0),OFFSET(I950,-1,0)+1,OFFSET(I950,-1,0)))","v":0},0,0,"F","Serviço","Serviço","5.6.3.22.","AGETOP",72570,"TOMADA HEXAGONAL 2P + T - 10A - 250V (LINHA X OU EQUIVALENTE)","Un    ",4,1,null,null,null,null,null,""]
["S",3,"S",0,5,6,3,0,{"$f":"IF(AND($C951<=4,$C951<>0),0,IF(AND($C951=\"S\",$Y951>0),OFFSET(I951,-1,0)+1,OFFSET(I951,-1,0)))","v":0},0,0,"F","Serviço","Serviço","5.6.3.23.","AGETOP",71598,"LUMINÁRIA DE EMERGÊNCIA 30 LEDS","un    ",1,1,null,null,null,null,null,""]
[2,2,2,68,5,7,0,0,{"$f":"IF(AND($C952<=4,$C952<>0),0,IF(AND($C952=\"S\",$Y952>0),OFFSET(I952,-1,0)+1,OFFSET(I952,-1,0)))","v":0},124,68,"F","Nível 2","Nível 2","5.7.","AGETOP",null,"INSTALAÇÕES HIDROSSANITÁRIAS","-",null,1,null,null,null,null,null,""]
["S",2,"S",0,5,7,0,0,{"$f":"IF(AND($C953<=4,$C953<>0),0,IF(AND($C953=\"S\",$Y953>0),OFFSET(I953,-1,0)+1,OFFSET(I953,-1,0)))","v":0},0,0,"F","Serviço","Serviço","5.7.0.1.","AGETOP",80502,"VASO SANITARIO","Un    ",10,1,null,null,null,null,null,""]
[{"$f":"CHOOSE(1+LOG(1+2*(ORÇAMENTO.Nivel=\"Nível 1\")+4*(ORÇAMENTO.Nivel=\"Nível 2\")+8*(ORÇAMENTO.Nivel=\"Nível 3\")+16*(ORÇAMENTO.Nivel=\"Nível 4\")+32*(ORÇAMENTO.Nivel=\"Serviço\"),2),0,1,2,3,4,\"S\")","v":"S"},2,"S",0,5,7,0,0,{"$f":"IF(AND($C954<=4,$C954<>0),0,IF(AND($C954=\"S\",$Y954>0),OFFSET(I954,-1,0)+1,OFFSET(I954,-1,0)))","v":0},0,0,"F","Serviço","Serviço","5.7.0.2.","AGETOP",80510,"ANEL DE VEDAÇÃO PARA VASO SANITÁRIO","Un    ",10,1,null,null,null,null,null,""]
["S",2,"S",0,5,7,0,0,{"$f":"IF(AND($C955<=4,$C955<>0),0,IF(AND($C955=\"S\",$Y955>0),OFFSET(I955,-1,0)+1,OFFSET(I955,-1,0)))","v":0},0,0,"F","Serviço","Serviço","5.7.0.3.","AGETOP",80513,"TUBO PARA VÁLVULA DE DESCARGA ( CURTO 1.1/4\" )","Un    ",10,1,null,null,null,null,null,""]
["S",2,"S",0,5,7,0,0,{"$f":"IF(AND($C956<=4,$C956<>0),0,IF(AND($C956=\"S\",$Y956>0),OFFSET(I956,-1,0)+1,OFFSET(I956,-1,0)))","v":0},0,0,"F","Serviço","Serviço","5.7.0.4.","AGETOP",80515,"VÁLVULA DE DESCARGA DUPLO ACIONAMENTO COM ACABAMENTO CROMADO ","Un    ",10,1,null,null,null,null,null,""]
["S",2,"S",0,{"$f":"IF($C957=1,OFFSET(E957,-1,0)+1,OFFSET(E957,-1,0))","v":5},{"$f":"IF($C957=1,0,IF($C957=2,OFFSET(F957,-1,0)+1,OFFSET(F957,-1,0)))","v":7},{"$f":"IF(AND($C957<=2,$C957<>0),0,IF($C957=3,OFFSET(G957,-1,0)+1,OFFSET(G957,-1,0)))","v":0},{"$f":"IF(AND($C957<=3,$C957<>0),0,IF($C957=4,OFFSET(H957,-1,0)+1,OFFSET(H957,-1,0)))","v":0},{"$f":"IF(AND($C957<=4,$C957<>0),0,IF(AND($C957=\"S\",$Y957>0),OFFSET(I957,-1,0)+1,OFFSET(I957,-1,0)))","v":0},0,0,"F","Serviço","Serviço","5.7.0.5.","AGETOP",80520,"CONJUNTO DE FIXACAO P/VASO SANITARIO (PAR)","CJ    ",10,1,null,null,null,null,null,""]
["S",2,"S",0,5,7,0,0,{"$f":"IF(AND($C958<=4,$C958<>0),0,IF(AND($C958=\"S\",$Y958>0),OFFSET(I958,-1,0)+1,OFFSET(I958,-1,0)))","v":0},0,0,"F","Serviço","Serviço","5.7.0.6.","AGETOP",80526,"ASSENTO EM POLIPROPILENO COM SISTEMA DE FECHAMENTO SUAVE PARA VASO SANITÁRIO","Un    ",10,1,null,null,null,null,null,""]
["S",2,"S",0,5,7,0,0,{"$f":"IF(AND($C959<=4,$C959<>0),0,IF(AND($C959=\"S\",$Y959>0),OFFSET(I959,-1,0)+1,OFFSET(I959,-1,0)))","v":0},0,0,"F","Serviço","Serviço","5.7.0.7.","AGETOP",80530,"PORTA PAPEL HIGIÊNICO EM LOUÇA - EMBUTIR","Un    ",10,1,null,null,null,null,null,""]
["S",2,"S",0,5,7,0,0,{"$f":"IF(AND($C960<=4,$C960<>0),0,IF(AND($C960=\"S\",$Y960>0),OFFSET(I960,-1,0)+1,OFFSET(I960,-1,0)))","v":0},0,0,"F","Serviço","Serviço","5.7.0.8.","AGETOP",80541,"LAVATÓRIO MÉDIO COM COLUNA","Un    ",2,1,null,null,null,null,null,""]
["S",2,"S",0,5,7,0,0,{"$f":"IF(AND($C961<=4,$C961<>0),0,IF(AND($C961=\"S\",$Y961>0),OFFSET(I961,-1,0)+1,OFFSET(I961,-1,0)))","v":0},0,0,"F","Serviço","Serviço","5.7.0.9.","AGETOP",80560,"SIFAO P/LAVATORIO METALICO DIAM.1\"X1.1/2\"","Un    ",11,1,null,null,null,null,null,""]
["S",2,"S",0,5,7,0,0,{"$f":"IF(AND($C962<=4,$C962<>0),0,IF(AND($C962=\"S\",$Y962>0),OFFSET(I962,-1,0)+1,OFFSET(I962,-1,0)))","v":0},0,0,"F","Serviço","Serviço","5.7.0.10.","AGETOP",80570,"TORNEIRA DE MESA PARA LAVATÓRIO DIÂMETRO DE 1/2\"","Un    ",11,1,null,null,null,null,null,""]
["S",{"$f":"IF(OR(C963=\"s\",C963=0),OFFSET(B963,-1,0),C963)","v":2},{"$f":"IF(OFFSET(C963,-1,0)=\"L\",1,IF(OFFSET(C963,-1,0)=1,2,IF(OR(A963=\"s\",A963=0),\"S\",IF(AND(OFFSET(C963,-1,0)=2,A963=4),3,IF(AND(OR(OFFSET(C963,-1,0)=\"s\",OFFSET(C963,-1,0)=0),A963<>\"s\",A963>OFFSET(B963,-1,0)),OFFSET(B963,-1,0),A963)))))","v":"S"},{"$f":"IF(OR(C963=\"S\",C963=0),0,IF(ISERROR(K963),J963,SMALL(J963:K963,1)))","v":0},5,7,0,0,{"$f":"IF(AND($C963<=4,$C963<>0),0,IF(AND($C963=\"S\",$Y963>0),OFFSET(I963,-1,0)+1,OFFSET(I963,-1,0)))","v":0},0,0,"F","Serviço","Serviço","5.7.0.11.","AGETOP",80580,"VALVULA P/LAVATORIO OU BEBEDOURO METALICO DIAMETRO 1\"","Un    ",11,1,null,null,null,null,null,""]
["S",2,"S",0,5,7,0,0,{"$f":"IF(AND($C964<=4,$C964<>0),0,IF(AND($C964=\"S\",$Y964>0),OFFSET(I964,-1,0)+1,OFFSET(I964,-1,0)))","v":0},0,0,"F","Serviço","Serviço","5.7.0.12.","AGETOP",80590,"CUBA DE LOUCA DE EMBUTIR OVAL MÉDIA ","Un    ",9,1,null,null,null,null,null,""]
["S",2,"S",0,5,7,0,0,{"$f":"IF(AND($C965<=4,$C965<>0),0,IF(AND($C965=\"S\",$Y965>0),OFFSET(I965,-1,0)+1,OFFSET(I965,-1,0)))","v":0},0,0,"F","Serviço","Serviço","5.7.0.13.","AGETOP",80601,"MICTORIO DE LOUCA C/SIFAO INTEGRADO","Un    ",3,1,null,null,null,null,null,""]
["S",2,"S",0,5,7,0,0,{"$f":"IF(AND($C966<=4,$C966<>0),0,IF(AND($C966=\"S\",$Y966>0),OFFSET(I966,-1,0)+1,OFFSET(I966,-1,0)))","v":0},0,0,"F","Serviço","Serviço","5.7.0.14.","AGETOP",80610,"KIT FERR.P/MICT.LOUCA (ESPUDE,CONEXÃO ENTR.PARAFUSOS)","Un    ",3,1,null,null,null,null,null,""]
["S",2,"S",0,5,7,0,0,{"$f":"IF(AND($C967<=4,$C967<>0),0,IF(AND($C967=\"S\",$Y967>0),OFFSET(I967,-1,0)+1,OFFSET(I967,-1,0)))","v":0},0,0,"F","Serviço","Serviço","5.7.0.15.","AGETOP",80660,"TORNEIRA DE PAREDE PARA PIA OU BEBEDOURO DIÂMETRO DE 1/2\" E 3/4\" ","Un    ",2,1,null,null,null,null,null,""]
["S",2,"S",0,5,7,0,0,{"$f":"IF(AND($C968<=4,$C968<>0),0,IF(AND($C968=\"S\",$Y968>0),OFFSET(I968,-1,0)+1,OFFSET(I968,-1,0)))","v":0},{"$f":"IF(OR($C968=\"S\",$C968=0),0,MATCH(0,OFFSET($D968,1,$C968,ROW($C$1328)-ROW($C968)),0))","v":0},{"$f":"IF(OR($C968=\"S\",$C968=0),0,MATCH(OFFSET($D968,0,$C968)+1,OFFSET($D968,1,$C968,ROW($C$1328)-ROW($C968)),0))","v":0},"F","Serviço","Serviço","5.7.0.16.","AGETOP",80926,"REGISTRO DE GAVETA C/CANOPLA DIAMETRO 3/4\"","Un    ",2,1,null,null,null,null,null,""]
["S",2,"S",0,5,7,0,0,{"$f":"IF(AND($C969<=4,$C969<>0),0,IF(AND($C969=\"S\",$Y969>0),OFFSET(I969,-1,0)+1,OFFSET(I969,-1,0)))","v":0},0,0,"F","Serviço","Serviço","5.7.0.17.","AGETOP",80927,"REGISTRO DE GAVETA C/CANOPLA DIAMETRO 1\"","Un    ",2,1,null,null,null,null,null,""]
["S",2,"S",0,5,7,0,0,{"$f":"IF(AND($C970<=4,$C970<>0),0,IF(AND($C970=\"S\",$Y970>0),OFFSET(I970,-1,0)+1,OFFSET(I970,-1,0)))","v":0},0,0,"F","Serviço","Serviço","5.7.0.18.","AGETOP",80946,"REGISTRO DE PRESSAO C/CANOPLA CROMADA DIAM.3/4\"","Un    ",3,1,null,null,null,null,null,""]
["S",2,"S",0,5,7,0,0,{"$f":"IF(AND($C971<=4,$C971<>0),0,IF(AND($C971=\"S\",$Y971>0),OFFSET(I971,-1,0)+1,OFFSET(I971,-1,0)))","v":0},0,0,"F","Serviço","Serviço","5.7.0.19.","AGETOP",81003,"TUBO SOLDAVEL PVC MARROM DIAMETRO 25 mm","M     ",9,1,null,null,null,null,null,""]
["S",2,"S",0,5,7,0,0,{"$f":"IF(AND($C972<=4,$C972<>0),0,IF(AND($C972=\"S\",$Y972>0),OFFSET(I972,-1,0)+1,OFFSET(I972,-1,0)))","v":0},0,0,"F","Serviço","Serviço","5.7.0.20.","AGETOP",81004,"TUBO SOLDAVEL PVC MARROM DIAMETRO 32 mm","m     ",6,1,null,null,null,null,null,""]
["S",2,"S",0,5,7,0,0,{"$f":"IF(AND($C973<=4,$C973<>0),0,IF(AND($C973=\"S\",$Y973>0),OFFSET(I973,-1,0)+1,OFFSET(I973,-1,0)))","v":0},0,0,"F","Serviço","Serviço","5.7.0.21.","AGETOP",81006,"TUBO SOLDAVEL PVC MARROM DIAM. 50 mm","m     ",12,1,null,null,null,null,null,""]
["S",2,"S",0,5,7,0,0,{"$f":"IF(AND($C974<=4,$C974<>0),0,IF(AND($C974=\"S\",$Y974>0),OFFSET(I974,-1,0)+1,OFFSET(I974,-1,0)))","v":0},0,0,"F","Serviço","Serviço","5.7.0.22.","AGETOP",81007,"TUBO SOLDAVEL PVC MARROM DIAMETRO 60 mm (2\")","m     ",24,1,null,null,null,null,null,""]
["S",2,"S",0,5,7,0,0,{"$f":"IF(AND($C975<=4,$C975<>0),0,IF(AND($C975=\"S\",$Y975>0),OFFSET(I975,-1,0)+1,OFFSET(I975,-1,0)))","v":0},0,0,"F","Serviço","Serviço","5.7.0.23.","AGETOP",81066,"ADAPTAD.SOLD.CURTO C/BOLSA E ROSCA P/REG.25X3/4\"","Un    ",7,1,null,null,null,null,null,""]
["S",2,"S",0,5,7,0,0,{"$f":"IF(AND($C976<=4,$C976<>0),0,IF(AND($C976=\"S\",$Y976>0),OFFSET(I976,-1,0)+1,OFFSET(I976,-1,0)))","v":0},0,0,"F","Serviço","Serviço","5.7.0.24.","AGETOP",81067,"ADAPTAD.SOLD.CURTO C/BOLSA E ROSCA P/REG.32X1\"","Un    ",4,1,null,null,null,null,null,""]
["S",2,"S",0,5,7,0,0,{"$f":"IF(AND($C977<=4,$C977<>0),0,IF(AND($C977=\"S\",$Y977>0),OFFSET(I977,-1,0)+1,OFFSET(I977,-1,0)))","v":0},0,0,"F","Serviço","Serviço","5.7.0.25.","AGETOP",81069,"ADAPTAD.SOLD.CURTO C/BOLSA/ROSCA P/REG.50X11/2\"","Un    ",10,1,null,null,null,null,null,""]
["S",2,"S",0,5,7,0,0,{"$f":"IF(AND($C978<=4,$C978<>0),0,IF(AND($C978=\"S\",$Y978>0),OFFSET(I978,-1,0)+1,OFFSET(I978,-1,0)))","v":0},0,0,"F","Serviço","Serviço","5.7.0.26.","AGETOP",81146,"LUVA SOLD.C/BUCHA DE LATAO 25X3/4\" COR AZUL","Un    ",3,1,null,null,null,null,null,""]
["S",2,"S",0,5,7,0,0,{"$f":"IF(AND($C979<=4,$C979<>0),0,IF(AND($C979=\"S\",$Y979>0),OFFSET(I979,-1,0)+1,OFFSET(I979,-1,0)))","v":0},0,0,"F","Serviço","Serviço","5.7.0.27.","AGETOP",81175,"BUCHA DE REDUCAO SOLD.LONGA 32 X 20 mm","Un    ",2,1,null,null,null,null,null,""]
["S",2,"S",0,5,7,0,0,{"$f":"IF(AND($C980<=4,$C980<>0),0,IF(AND($C980=\"S\",$Y980>0),OFFSET(I980,-1,0)+1,OFFSET(I980,-1,0)))","v":0},0,0,"F","Serviço","Serviço","5.7.0.28.","AGETOP",81179,"BUCHA DE REDUCAO SOLDAVEL LONGA 50 X 25 mm","Un    ",2,1,null,null,null,null,null,""]
["S",2,"S",0,5,7,0,0,{"$f":"IF(AND($C981<=4,$C981<>0),0,IF(AND($C981=\"S\",$Y981>0),OFFSET(I981,-1,0)+1,OFFSET(I981,-1,0)))","v":0},0,0,"F","Serviço","Serviço","5.7.0.29.","AGETOP",81180,"BUCHA DE REDUCAO SOLDAVEL LONGA 50 X 32 mm","Un    ",2,1,null,null,null,null,null,""]
["S",2,"S",0,5,7,0,0,{"$f":"IF(AND($C982<=4,$C982<>0),0,IF(AND($C982=\"S\",$Y982>0),OFFSET(I982,-1,0)+1,OFFSET(I982,-1,0)))","v":0},0,0,"F","Serviço","Serviço","5.7.0.30.","AGETOP",81184,"BUCHA DE REDUCAO SOLDAVEL LONGA 60 X 50 mm","Un    ",8,1,null,null,null,null,null,""]
["S",2,"S",0,5,7,0,0,{"$f":"IF(AND($C983<=4,$C983<>0),0,IF(AND($C983=\"S\",$Y983>0),OFFSET(I983,-1,0)+1,OFFSET(I983,-1,0)))","v":0},0,0,"F","Serviço","Serviço","5.7.0.31.","AGETOP",81321,"JOELHO 90 GRAUS SOLDAVEL DIAMETRO 25 MM","Un    ",7,1,null,null,null,null,null,""]
["S",2,"S",0,5,7,0,0,{"$f":"IF(AND($C984<=4,$C984<>0),0,IF(AND($C984=\"S\",$Y984>0),OFFSET(I984,-1,0)+1,OFFSET(I984,-1,0)))","v":0},0,0,"F","Serviço","Serviço","5.7.0.32.","AGETOP",81322,"JOELHO 90 GRAUS SOLDAVEL DIAMETRO 32 MM (1\")","Un    ",2,1,null,null,null,null,null,""]
["S",2,"S",0,5,7,0,0,{"$f":"IF(AND($C985<=4,$C985<>0),0,IF(AND($C985=\"S\",$Y985>0),OFFSET(I985,-1,0)+1,OFFSET(I985,-1,0)))","v":0},0,0,"F","Serviço","Serviço","5.7.0.33.","AGETOP",81324,"JOELHO 90 GRAUS SOLDAVEL 50 mm (MARROM)","Un    ",12,1,null,null,null,null,null,""]
["S",2,"S",0,5,7,0,0,{"$f":"IF(AND($C986<=4,$C986<>0),0,IF(AND($C986=\"S\",$Y986>0),OFFSET(I986,-1,0)+1,OFFSET(I986,-1,0)))","v":0},0,0,"F","Serviço","Serviço","5.7.0.34.","AGETOP",81325,"JOELHO 90 GRAUS SOLDAVEL DIAMETRO 60 mm","Un    ",1,1,null,null,null,null,null,""]
["S",2,"S",0,5,7,0,0,{"$f":"IF(AND($C987<=4,$C987<>0),0,IF(AND($C987=\"S\",$Y987>0),OFFSET(I987,-1,0)+1,OFFSET(I987,-1,0)))","v":0},0,0,"F","Serviço","Serviço","5.7.0.35.","AGETOP",81360,"JOELHO RED.90 GRAUS SOLD.C/BUCHA LATAO 25X1/2\"","Un    ",8,1,null,null,null,null,null,""]
["S",2,"S",0,5,7,0,0,{"$f":"IF(AND($C988<=4,$C988<>0),0,IF(AND($C988=\"S\",$Y988>0),OFFSET(I988,-1,0)+1,OFFSET(I988,-1,0)))","v":0},0,0,"F","Serviço","Serviço","5.7.0.36.","AGETOP",81402,"TE 90 GRAUS SOLDAVEL DIAMETRO 25 mm","Un    ",2,1,null,null,null,null,null,""]
["S",2,"S",0,5,7,0,0,{"$f":"IF(AND($C989<=4,$C989<>0),0,IF(AND($C989=\"S\",$Y989>0),OFFSET(I989,-1,0)+1,OFFSET(I989,-1,0)))","v":0},0,0,"F","Serviço","Serviço","5.7.0.37.","AGETOP",81405,"TE 90 GRAUS SOLDAVEL DIAMETRO 50 mm","Un    ",2,1,null,null,null,null,null,""]
["S",2,"S",0,5,7,0,0,{"$f":"IF(AND($C990<=4,$C990<>0),0,IF(AND($C990=\"S\",$Y990>0),OFFSET(I990,-1,0)+1,OFFSET(I990,-1,0)))","v":0},0,0,"F","Serviço","Serviço","5.7.0.38.","AGETOP",81406,"TE 90 GRAUS SOLDAVEL DIMETRO 60 mm","Un    ",10,1,null,null,null,null,null,""]
["S",2,"S",0,5,7,0,0,{"$f":"IF(AND($C991<=4,$C991<>0),0,IF(AND($C991=\"S\",$Y991>0),OFFSET(I991,-1,0)+1,OFFSET(I991,-1,0)))","v":0},0,0,"F","Serviço","Serviço","5.7.0.39.","AGETOP",81425,"TE REDUCAO 90 GRAUS SOLDAVEL 50 X 32 mm","Un    ",1,1,null,null,null,null,null,""]
["S",2,"S",0,5,7,0,0,{"$f":"IF(AND($C992<=4,$C992<>0),0,IF(AND($C992=\"S\",$Y992>0),OFFSET(I992,-1,0)+1,OFFSET(I992,-1,0)))","v":0},0,0,"F","Serviço","Serviço","5.7.0.40.","AGETOP",81445,"TE RED.SOLD.90GR.BUC.LATAO BOLSA CENT.25X25X1/2\"","Un    ",8,1,null,null,null,null,null,""]
["S",2,"S",0,5,7,0,0,{"$f":"IF(AND($C993<=4,$C993<>0),0,IF(AND($C993=\"S\",$Y993>0),OFFSET(I993,-1,0)+1,OFFSET(I993,-1,0)))","v":0},0,0,"F","Serviço","Serviço","5.7.0.41.","AGETOP",81501,"ADESIVO PLASTICO - FRASCO 850 G","Un    ",1,1,null,null,null,null,null,""]
["S",2,"S",0,5,7,0,0,{"$f":"IF(AND($C994<=4,$C994<>0),0,IF(AND($C994=\"S\",$Y994>0),OFFSET(I994,-1,0)+1,OFFSET(I994,-1,0)))","v":0},0,0,"F","Serviço","Serviço","5.7.0.42.","AGETOP",81504,"SOLUCAO LIMPADORA 1000 CM3","Un    ",1,1,null,null,null,null,null,""]
["S",2,"S",0,5,7,0,0,{"$f":"IF(AND($C995<=4,$C995<>0),0,IF(AND($C995=\"S\",$Y995>0),OFFSET(I995,-1,0)+1,OFFSET(I995,-1,0)))","v":0},0,0,"F","Serviço","Serviço","5.7.0.43.","AGETOP",81550,"CURVA 45º DIAMETRO 50 MM","Un    ",3,1,null,null,null,null,null,""]
["S",2,"S",0,5,7,0,0,{"$f":"IF(AND($C996<=4,$C996<>0),0,IF(AND($C996=\"S\",$Y996>0),OFFSET(I996,-1,0)+1,OFFSET(I996,-1,0)))","v":0},0,0,"F","Serviço","Serviço","5.7.0.44.","AGETOP",81663,"CORPO CX. SIFONADA DIAM. 150 X 150 X 50","Un    ",4,1,null,null,null,null,null,""]
["S",2,"S",0,5,7,0,0,{"$f":"IF(AND($C997<=4,$C997<>0),0,IF(AND($C997=\"S\",$Y997>0),OFFSET(I997,-1,0)+1,OFFSET(I997,-1,0)))","v":0},0,0,"F","Serviço","Serviço","5.7.0.45.","AGETOP",81664,"CORPO CX. SIFONADA DIAM. 150 X 185 X 75","Un    ",1,1,null,null,null,null,null,""]
["S",2,"S",0,5,7,0,0,{"$f":"IF(AND($C998<=4,$C998<>0),0,IF(AND($C998=\"S\",$Y998>0),OFFSET(I998,-1,0)+1,OFFSET(I998,-1,0)))","v":0},0,0,"F","Serviço","Serviço","5.7.0.46.","AGETOP",81733,"CURVA 90 GRAUS CURTA DIAM. 100 MM","Un    ",20,1,null,null,null,null,null,""]
["S",2,"S",0,5,7,0,0,{"$f":"IF(AND($C999<=4,$C999<>0),0,IF(AND($C999=\"S\",$Y999>0),OFFSET(I999,-1,0)+1,OFFSET(I999,-1,0)))","v":0},0,0,"F","Serviço","Serviço","5.7.0.47.","AGETOP",81778,"GRELHA QUADRADA CROMADA DIAM. 150 MM","Un    ",5,1,null,null,null,null,null,""]
["S",2,"S",0,5,7,0,0,{"$f":"IF(AND($C1000<=4,$C1000<>0),0,IF(AND($C1000=\"S\",$Y1000>0),OFFSET(I1000,-1,0)+1,OFFSET(I1000,-1,0)))","v":0},0,0,"F","Serviço","Serviço","5.7.0.48.","AGETOP",81825,"CAIXA DE PASSAGEM 60 X 60 CM SEM TAMPA","Un    ",2,1,null,null,null,null,null,""]
["S",2,"S",0,5,7,0,0,{"$f":"IF(AND($C1001<=4,$C1001<>0),0,IF(AND($C1001=\"S\",$Y1001>0),OFFSET(I1001,-1,0)+1,OFFSET(I1001,-1,0)))","v":0},0,0,"F","Serviço","Serviço","5.7.0.49.","AGETOP",81840,"TAMPA  PARA CAIXA PASSAGEM FERRO FUNDIDO T-33 - TRÁFEGO LEVE","Un    ",2,1,null,null,null,null,null,""]
["S",2,"S",0,5,7,0,0,{"$f":"IF(AND($C1002<=4,$C1002<>0),0,IF(AND($C1002=\"S\",$Y1002>0),OFFSET(I1002,-1,0)+1,OFFSET(I1002,-1,0)))","v":0},0,0,"F","Serviço","Serviço","5.7.0.50.","AGETOP",81921,"JOELHO 45 GRAUS DIAMETRO 40 MM","Un    ",6,1,null,null,null,null,null,""]
["S",2,"S",0,5,7,0,0,{"$f":"IF(AND($C1003<=4,$C1003<>0),0,IF(AND($C1003=\"S\",$Y1003>0),OFFSET(I1003,-1,0)+1,OFFSET(I1003,-1,0)))","v":0},0,0,"F","Serviço","Serviço","5.7.0.51.","AGETOP",81922,"JOELHO 45 GRAUS DIAMETRO 50 MM","Un    ",1,1,null,null,null,null,null,""]
["S",2,"S",0,5,7,0,0,{"$f":"IF(AND($C1004<=4,$C1004<>0),0,IF(AND($C1004=\"S\",$Y1004>0),OFFSET(I1004,-1,0)+1,OFFSET(I1004,-1,0)))","v":0},0,0,"F","Serviço","Serviço","5.7.0.52.","AGETOP",81935,"JOELHO 90 GRAUS DIAMETRO 40 MM","Un    ",11,1,null,null,null,null,null,""]
["S",2,"S",0,5,7,0,0,{"$f":"IF(AND($C1005<=4,$C1005<>0),0,IF(AND($C1005=\"S\",$Y1005>0),OFFSET(I1005,-1,0)+1,OFFSET(I1005,-1,0)))","v":0},0,0,"F","Serviço","Serviço","5.7.0.53.","AGETOP",81936,"JOELHO 90 GRAUS DIAMETRO 50 MM","Un    ",16,1,null,null,null,null,null,""]
["S",2,"S",0,5,7,0,0,{"$f":"IF(AND($C1006<=4,$C1006<>0),0,IF(AND($C1006=\"S\",$Y1006>0),OFFSET(I1006,-1,0)+1,OFFSET(I1006,-1,0)))","v":0},0,0,"F","Serviço","Serviço","5.7.0.54.","AGETOP",81923,"JOELHO 45 GRAUS DIAMETRO 75 MM","Un    ",14,1,null,null,null,null,null,""]
["S",2,"S",0,5,7,0,0,{"$f":"IF(AND($C1007<=4,$C1007<>0),0,IF(AND($C1007=\"S\",$Y1007>0),OFFSET(I1007,-1,0)+1,OFFSET(I1007,-1,0)))","v":0},0,0,"F","Serviço","Serviço","5.7.0.55.","AGETOP",81973,"JUNCAO SIMPLES DIAM. 100 X 50 MM","Un    ",3,1,null,null,null,null,null,""]
["S",2,"S",0,5,7,0,0,{"$f":"IF(AND($C1008<=4,$C1008<>0),0,IF(AND($C1008=\"S\",$Y1008>0),OFFSET(I1008,-1,0)+1,OFFSET(I1008,-1,0)))","v":0},0,0,"F","Serviço","Serviço","5.7.0.56.","AGETOP",81974,"JUNCAO SIMPLES DIAMETRO 100 X 75 MM","Un    ",1,1,null,null,null,null,null,""]
["S",2,"S",0,5,7,0,0,{"$f":"IF(AND($C1009<=4,$C1009<>0),0,IF(AND($C1009=\"S\",$Y1009>0),OFFSET(I1009,-1,0)+1,OFFSET(I1009,-1,0)))","v":0},0,0,"F","Serviço","Serviço","5.7.0.57.","AGETOP",81975,"JUNCAO SIMPLES DIAM. 100 X 100 MM","Un    ",10,1,null,null,null,null,null,""]
["S",2,"S",0,5,7,0,0,{"$f":"IF(AND($C1010<=4,$C1010<>0),0,IF(AND($C1010=\"S\",$Y1010>0),OFFSET(I1010,-1,0)+1,OFFSET(I1010,-1,0)))","v":0},0,0,"F","Serviço","Serviço","5.7.0.58.","AGETOP",82002,"LUVA SIMPLES DIAMETRO 50 MM","Un    ",3,1,null,null,null,null,null,""]
["S",2,"S",0,5,7,0,0,{"$f":"IF(AND($C1011<=4,$C1011<>0),0,IF(AND($C1011=\"S\",$Y1011>0),OFFSET(I1011,-1,0)+1,OFFSET(I1011,-1,0)))","v":0},0,0,"F","Serviço","Serviço","5.7.0.59.","AGETOP",82004,"LUVA SIMPLES DIAM. 100 MM","Un    ",6,1,null,null,null,null,null,""]
["S",2,"S",0,5,7,0,0,{"$f":"IF(AND($C1012<=4,$C1012<>0),0,IF(AND($C1012=\"S\",$Y1012>0),OFFSET(I1012,-1,0)+1,OFFSET(I1012,-1,0)))","v":0},0,0,"F","Serviço","Serviço","5.7.0.60.","AGETOP",82052,"PORTA GRELHA QUADRADO CROMADO DIAM.150 MM","Un    ",5,1,null,null,null,null,null,""]
["S",2,"S",0,5,7,0,0,{"$f":"IF(AND($C1013<=4,$C1013<>0),0,IF(AND($C1013=\"S\",$Y1013>0),OFFSET(I1013,-1,0)+1,OFFSET(I1013,-1,0)))","v":0},0,0,"F","Serviço","Serviço","5.7.0.61.","AGETOP",82230,"TE SANITARIO DIAMETRO 50 X 50 MM","Un    ",6,1,null,null,null,null,null,""]
["S",2,"S",0,5,7,0,0,{"$f":"IF(AND($C1014<=4,$C1014<>0),0,IF(AND($C1014=\"S\",$Y1014>0),OFFSET(I1014,-1,0)+1,OFFSET(I1014,-1,0)))","v":0},0,0,"F","Serviço","Serviço","5.7.0.62.","AGETOP",82231,"TE SANITARIO DIAMETRO 75 X 50 MM","Un    ",1,1,null,null,null,null,null,""]
["S",2,"S",0,5,7,0,0,{"$f":"IF(AND($C1015<=4,$C1015<>0),0,IF(AND($C1015=\"S\",$Y1015>0),OFFSET(I1015,-1,0)+1,OFFSET(I1015,-1,0)))","v":0},0,0,"F","Serviço","Serviço","5.7.0.63.","AGETOP",82233,"TE SANITARIO DIAMETRO 100 X 50 MM","Un    ",8,1,null,null,null,null,null,""]
["S",2,"S",0,5,7,0,0,{"$f":"IF(AND($C1016<=4,$C1016<>0),0,IF(AND($C1016=\"S\",$Y1016>0),OFFSET(I1016,-1,0)+1,OFFSET(I1016,-1,0)))","v":0},0,0,"F","Serviço","Serviço","5.7.0.64.","AGETOP",82301,"TUBO SOLD.P/ESGOTO DIAM. 40 MM","m     ",12,1,null,null,null,null,null,""]
["S",2,"S",0,5,7,0,0,{"$f":"IF(AND($C1017<=4,$C1017<>0),0,IF(AND($C1017=\"S\",$Y1017>0),OFFSET(I1017,-1,0)+1,OFFSET(I1017,-1,0)))","v":0},0,0,"F","Serviço","Serviço","5.7.0.65.","AGETOP",82302,"TUBO SOLD. P/ESGOTO DIAM. 50 MM","m     ",11,1,null,null,null,null,null,""]
[{"$f":"CHOOSE(1+LOG(1+2*(ORÇAMENTO.Nivel=\"Nível 1\")+4*(ORÇAMENTO.Nivel=\"Nível 2\")+8*(ORÇAMENTO.Nivel=\"Nível 3\")+16*(ORÇAMENTO.Nivel=\"Nível 4\")+32*(ORÇAMENTO.Nivel=\"Serviço\"),2),0,1,2,3,4,\"S\")","v":"S"},2,"S",0,5,7,0,0,{"$f":"IF(AND($C1018<=4,$C1018<>0),0,IF(AND($C1018=\"S\",$Y1018>0),OFFSET(I1018,-1,0)+1,OFFSET(I1018,-1,0)))","v":0},0,0,"F","Serviço","Serviço","5.7.0.66.","AGETOP",82303,"TUBO SOLDAVEL P/ESGOTO DIAM.75 MM","m     ",60,1,null,null,null,null,null,""]
["S",2,"S",0,5,7,0,0,{"$f":"IF(AND($C1019<=4,$C1019<>0),0,IF(AND($C1019=\"S\",$Y1019>0),OFFSET(I1019,-1,0)+1,OFFSET(I1019,-1,0)))","v":0},0,0,"F","Serviço","Serviço","5.7.0.67.","AGETOP",82304,"TUBO SOLDAVEL P/ESGOTO DIAM. 100 MM","m     ",24,1,null,null,null,null,null,""]
[2,2,2,6,5,8,0,0,{"$f":"IF(AND($C1020<=4,$C1020<>0),0,IF(AND($C1020=\"S\",$Y1020>0),OFFSET(I1020,-1,0)+1,OFFSET(I1020,-1,0)))","v":0},56,6,"F","Nível 2","Nível 2","5.8.","AGETOP",null,"ALVENARIAS E DIVISÓRIAS","-",null,1,null,null,null,null,null,""]
["S",2,"S",0,{"$f":"IF($C1021=1,OFFSET(E1021,-1,0)+1,OFFSET(E1021,-1,0))","v":5},{"$f":"IF($C1021=1,0,IF($C1021=2,OFFSET(F1021,-1,0)+1,OFFSET(F1021,-1,0)))","v":8},{"$f":"IF(AND($C1021<=2,$C1021<>0),0,IF($C1021=3,OFFSET(G1021,-1,0)+1,OFFSET(G1021,-1,0)))","v":0},{"$f":"IF(AND($C1021<=3,$C1021<>0),0,IF($C1021=4,OFFSET(H1021,-1,0)+1,OFFSET(H1021,-1,0)))","v":0},{"$f":"IF(AND($C1021<=4,$C1021<>0),0,IF(AND($C1021=\"S\",$Y1021>0),OFFSET(I1021,-1,0)+1,OFFSET(I1021,-1,0)))","v":0},0,0,"F","Serviço","Serviço","5.8.0.1.","AGETOP",100101,"ALVENARIA DE TIJOLO COMUM 1/4 VEZ - ARG. (1CI : 2CH : 8ARML)","m2    ",38.4,1,null,null,null,null,null,""]
["S",2,"S",0,5,8,0,0,{"$f":"IF(AND($C1022<=4,$C1022<>0),0,IF(AND($C1022=\"S\",$Y1022>0),OFFSET(I1022,-1,0)+1,OFFSET(I1022,-1,0)))","v":0},0,0,"F","Serviço","Serviço","5.8.0.2.","AGETOP",100201,"ALVENARIA DE TIJOLO FURADO 1/2 VEZ - 9 x 19 x 19 - ARG. (1CALH:4ARML+100KG DE CI/M3)","m2    ",80.12,1,null,null,null,null,null,""]
["S",2,"S",0,5,8,0,0,{"$f":"IF(AND($C1023<=4,$C1023<>0),0,IF(AND($C1023=\"S\",$Y1023>0),OFFSET(I1023,-1,0)+1,OFFSET(I1023,-1,0)))","v":0},0,0,"F","Serviço","Serviço","5.8.0.3.","AGETOP",100202,"ALVENARIA DE TIJOLO FURADO 1 VEZ -  ARG. (1CALH:4ARML+100KG DE CI/M3)","m2    ",24.36,1,null,null,null,null,null,""]
["S",2,"S",0,5,8,0,0,{"$f":"IF(AND($C1024<=4,$C1024<>0),0,IF(AND($C1024=\"S\",$Y1024>0),OFFSET(I1024,-1,0)+1,OFFSET(I1024,-1,0)))","v":0},0,0,"F","Serviço","Serviço","5.8.0.4.","AGETOP",100320,"DIVISORIA DE GRANITO POLIDO","m2    ",2.2999999999999998,1,null,null,null,null,null,""]
["S",2,"S",0,5,8,0,0,{"$f":"IF(AND($C1025<=4,$C1025<>0),0,IF(AND($C1025=\"S\",$Y1025>0),OFFSET(I1025,-1,0)+1,OFFSET(I1025,-1,0)))","v":0},0,0,"F","Serviço","Serviço","5.8.0.5.","AGETOP",100501,"ELEMENTO VAZADO DE CONCRETO","m2    ",14.67,1,null,null,null,null,null,""]
[2,2,2,2,5,9,0,0,{"$f":"IF(AND($C1026<=4,$C1026<>0),0,IF(AND($C1026=\"S\",$Y1026>0),OFFSET(I1026,-1,0)+1,OFFSET(I1026,-1,0)))","v":0},50,2,"F","Nível 2","Nível 2","5.9.","AGETOP",null,"IMPERMEABILIZAÇÃO","-",null,1,null,null,null,null,null,""]
["S",{"$f":"IF(OR(C1027=\"s\",C1027=0),OFFSET(B1027,-1,0),C1027)","v":2},{"$f":"IF(OFFSET(C1027,-1,0)=\"L\",1,IF(OFFSET(C1027,-1,0)=1,2,IF(OR(A1027=\"s\",A1027=0),\"S\",IF(AND(OFFSET(C1027,-1,0)=2,A1027=4),3,IF(AND(OR(OFFSET(C1027,-1,0)=\"s\",OFFSET(C1027,-1,0)=0),A1027<>\"s\",A1027>OFFSET(B1027,-1,0)),OFFSET(B1027,-1,0),A1027)))))","v":"S"},{"$f":"IF(OR(C1027=\"S\",C1027=0),0,IF(ISERROR(K1027),J1027,SMALL(J1027:K1027,1)))","v":0},5,9,0,0,{"$f":"IF(AND($C1027<=4,$C1027<>0),0,IF(AND($C1027=\"S\",$Y1027>0),OFFSET(I1027,-1,0)+1,OFFSET(I1027,-1,0)))","v":0},0,0,"F","Serviço","Serviço","5.9.0.1.","AGETOP",120902,"IMPERMEABILIZACAO VIGAS BALDRAMES E=2,0 CM","m2    ",39.619999999999997,1,null,null,null,null,null,""]
[2,2,2,2,5,10,0,0,{"$f":"IF(AND($C1028<=4,$C1028<>0),0,IF(AND($C1028=\"S\",$Y1028>0),OFFSET(I1028,-1,0)+1,OFFSET(I1028,-1,0)))","v":0},48,2,"F","Nível 2","Nível 2","5.10.","AGETOP",null,"ESTRUTURAS METÁLICAS","-",null,1,null,null,null,null,null,""]
["S",2,"S",0,5,10,0,0,{"$f":"IF(AND($C1029<=4,$C1029<>0),0,IF(AND($C1029=\"S\",$Y1029>0),OFFSET(I1029,-1,0)+1,OFFSET(I1029,-1,0)))","v":0},0,0,"F","Serviço","Serviço","5.10.0.1.","AGETOP",150103,"ESTRUTURA METÁLICA CONVENCIONAL EM AÇO DO TIPO USI SAC-300 COM FUNDO ANTICORROSIVO","Kg    ",1284.44,1,null,null,null,null,null,""]
[2,2,2,5,5,11,0,0,{"$f":"IF(AND($C1030<=4,$C1030<>0),0,IF(AND($C1030=\"S\",$Y1030>0),OFFSET(I1030,-1,0)+1,OFFSET(I1030,-1,0)))","v":0},46,5,"F","Nível 2","Nível 2","5.11.","AGETOP",null,"COBERTURAS","-",null,1,null,null,null,null,null,""]
["S",2,"S",0,5,11,0,0,{"$f":"IF(AND($C1031<=4,$C1031<>0),0,IF(AND($C1031=\"S\",$Y1031>0),OFFSET(I1031,-1,0)+1,OFFSET(I1031,-1,0)))","v":0},0,0,"F","Serviço","Serviço","5.11.0.1.","AGETOP",160401,"COBERTURA COM TELHA PLAN RESINADA COR VERMELHA","m2    ",137.76,1,null,null,null,null,null,""]
["S",2,"S",0,5,11,0,0,{"$f":"IF(AND($C1032<=4,$C1032<>0),0,IF(AND($C1032=\"S\",$Y1032>0),OFFSET(I1032,-1,0)+1,OFFSET(I1032,-1,0)))","v":0},{"$f":"IF(OR($C1032=\"S\",$C1032=0),0,MATCH(0,OFFSET($D1032,1,$C1032,ROW($C$1328)-ROW($C1032)),0))","v":0},{"$f":"IF(OR($C1032=\"S\",$C1032=0),0,MATCH(OFFSET($D1032,0,$C1032)+1,OFFSET($D1032,1,$C1032,ROW($C$1328)-ROW($C1032)),0))","v":0},"F","Serviço","Serviço","5.11.0.2.","AGETOP",160402,"CUMEEIRA  P/ TELHA PLAN RESINADA COR VERMELHA","m     ",16.8,1,null,null,null,null,null,""]
["S",2,"S",0,5,11,0,0,{"$f":"IF(AND($C1033<=4,$C1033<>0),0,IF(AND($C1033=\"S\",$Y1033>0),OFFSET(I1033,-1,0)+1,OFFSET(I1033,-1,0)))","v":0},0,0,"F","Serviço","Serviço","5.11.0.3.","AGETOP",160403,"EMBOCAMENTO LATERAL  (OITOES)","m     ",16.8,1,null,null,null,null,null,""]
["S",2,"S",0,5,11,0,0,{"$f":"IF(AND($C1034<=4,$C1034<>0),0,IF(AND($C1034=\"S\",$Y1034>0),OFFSET(I1034,-1,0)+1,OFFSET(I1034,-1,0)))","v":0},0,0,"F","Serviço","Serviço","5.11.0.4.","AGETOP",160404,"EMBOCAMENTO DE BEIRAL","M     ",33.6,1,null,null,null,null,null,""]
[2,2,2,4,5,12,0,0,{"$f":"IF(AND($C1035<=4,$C1035<>0),0,IF(AND($C1035=\"S\",$Y1035>0),OFFSET(I1035,-1,0)+1,OFFSET(I1035,-1,0)))","v":0},41,4,"F","Nível 2","Nível 2","5.12.","AGETOP",null,"ESQUADRIAS METÁLICAS","-",null,1,null,null,null,null,null,""]
["S",2,"S",0,5,12,0,0,{"$f":"IF(AND($C1036<=4,$C1036<>0),0,IF(AND($C1036=\"S\",$Y1036>0),OFFSET(I1036,-1,0)+1,OFFSET(I1036,-1,0)))","v":0},0,0,"F","Serviço","Serviço","5.12.0.1.","AGETOP",180403,"ESQ.MAXIMO AR CHAPA/VIDRO J1/J2/J7/J15 C/FERRAGENS","m2    ",6.4,1,null,null,null,null,null,""]
["S",2,"S",0,5,12,0,0,{"$f":"IF(AND($C1037<=4,$C1037<>0),0,IF(AND($C1037=\"S\",$Y1037>0),OFFSET(I1037,-1,0)+1,OFFSET(I1037,-1,0)))","v":0},0,0,"F","Serviço","Serviço","5.12.0.2.","AGETOP",180501,"PORTA DE ABRIR EM CHAPA PF-1 C/FERRAGENS","m2    ",3.36,1,null,null,null,null,null,""]
["S",2,"S",0,5,12,0,0,{"$f":"IF(AND($C1038<=4,$C1038<>0),0,IF(AND($C1038=\"S\",$Y1038>0),OFFSET(I1038,-1,0)+1,OFFSET(I1038,-1,0)))","v":0},0,0,"F","Serviço","Serviço","5.12.0.3.","AGETOP",180504,"PORTA ABRIR/VENEZIANA PF-4 C/FERRAGENS","m2    ",11.52,1,null,null,null,null,null,""]
[2,2,2,2,5,13,0,0,{"$f":"IF(AND($C1039<=4,$C1039<>0),0,IF(AND($C1039=\"S\",$Y1039>0),OFFSET(I1039,-1,0)+1,OFFSET(I1039,-1,0)))","v":0},37,2,"F","Nível 2","Nível 2","5.13.","AGETOP",null,"VIDROS","-",null,1,null,null,null,null,null,""]
["S",2,"S",0,5,13,0,0,{"$f":"IF(AND($C1040<=4,$C1040<>0),0,IF(AND($C1040=\"S\",$Y1040>0),OFFSET(I1040,-1,0)+1,OFFSET(I1040,-1,0)))","v":0},0,0,"F","Serviço","Serviço","5.13.0.1.","AGETOP",190107,"VIDRO FANTASIA - COLOCADO","m2    ",6.4,1,null,null,null,null,null,""]
[2,2,2,7,5,14,0,0,{"$f":"IF(AND($C1041<=4,$C1041<>0),0,IF(AND($C1041=\"S\",$Y1041>0),OFFSET(I1041,-1,0)+1,OFFSET(I1041,-1,0)))","v":0},35,7,"F","Nível 2","Nível 2","5.14.","AGETOP",null,"REVESTIMENTO DE PAREDE","-",null,1,null,null,null,null,null,""]
["S",2,"S",0,5,14,0,0,{"$f":"IF(AND($C1042<=4,$C1042<>0),0,IF(AND($C1042=\"S\",$Y1042>0),OFFSET(I1042,-1,0)+1,OFFSET(I1042,-1,0)))","v":0},0,0,"F","Serviço","Serviço","5.14.0.1.","AGETOP",200101,"CHAPISCO COMUM","m2    ",236.16,1,null,null,null,null,null,""]
["S",2,"S",0,5,14,0,0,{"$f":"IF(AND($C1043<=4,$C1043<>0),0,IF(AND($C1043=\"S\",$Y1043>0),OFFSET(I1043,-1,0)+1,OFFSET(I1043,-1,0)))","v":0},0,0,"F","Serviço","Serviço","5.14.0.2.","AGETOP",200104,"CHAPISCO FINO USADO SOBRE EMBOCO C/PENEIRA","m2    ",34.479999999999997,1,null,null,null,null,null,""]
["S",2,"S",0,5,14,0,0,{"$f":"IF(AND($C1044<=4,$C1044<>0),0,IF(AND($C1044=\"S\",$Y1044>0),OFFSET(I1044,-1,0)+1,OFFSET(I1044,-1,0)))","v":0},0,0,"F","Serviço","Serviço","5.14.0.3.","AGETOP",200201,"EMBOÇO (1CI:4 ARML)","m2    ",201.44,1,null,null,null,null,null,""]
["S",2,"S",0,5,14,0,0,{"$f":"IF(AND($C1045<=4,$C1045<>0),0,IF(AND($C1045=\"S\",$Y1045>0),OFFSET(I1045,-1,0)+1,OFFSET(I1045,-1,0)))","v":0},0,0,"F","Serviço","Serviço","5.14.0.4.","AGETOP",200499,"REBOCO PAULISTA A-14 (1CALH:4ARMLC+100kgCI/M3)","m2    ",113.44,1,null,null,null,null,null,""]
["S",2,"S",0,5,14,0,0,{"$f":"IF(AND($C1046<=4,$C1046<>0),0,IF(AND($C1046=\"S\",$Y1046>0),OFFSET(I1046,-1,0)+1,OFFSET(I1046,-1,0)))","v":0},0,0,"F","Serviço","Serviço","5.14.0.5.","AGETOP",201302,"REVESTIMENTO COM CERÂMICA ","m2    ",166.96,1,null,null,null,null,null,""]
["S",2,"S",0,5,14,0,0,{"$f":"IF(AND($C1047<=4,$C1047<>0),0,IF(AND($C1047=\"S\",$Y1047>0),OFFSET(I1047,-1,0)+1,OFFSET(I1047,-1,0)))","v":0},0,0,"F","Serviço","Serviço","5.14.0.6.","COMPOSIÇÃO","COMP 415_SEE","PEITORIL EM GRANITO CINZA, LARGURA VARIÁVEL E PINGADEIRA","M2",1.8139000000000001,1,null,null,null,null,null,""]
[2,2,2,3,5,15,0,0,{"$f":"IF(AND($C1048<=4,$C1048<>0),0,IF(AND($C1048=\"S\",$Y1048>0),OFFSET(I1048,-1,0)+1,OFFSET(I1048,-1,0)))","v":0},28,3,"F","Nível 2","Nível 2","5.15.","AGETOP",null,"FORROS","-",null,1,null,null,null,null,null,""]
["S",2,"S",0,5,15,0,0,{"$f":"IF(AND($C1049<=4,$C1049<>0),0,IF(AND($C1049=\"S\",$Y1049>0),OFFSET(I1049,-1,0)+1,OFFSET(I1049,-1,0)))","v":0},0,0,"F","Serviço","Serviço","5.15.0.1.","AGETOP",210101,"CHAPISCO EM FORRO (1CI: 3 ARG)","m2    ",50.39,1,null,null,null,null,null,""]
["S",2,"S",0,5,15,0,0,{"$f":"IF(AND($C1050<=4,$C1050<>0),0,IF(AND($C1050=\"S\",$Y1050>0),OFFSET(I1050,-1,0)+1,OFFSET(I1050,-1,0)))","v":0},0,0,"F","Serviço","Serviço","5.15.0.2.","AGETOP",210401,"REBOCO PAULISTA EM FORRO(1CALH:4ARML+150KG CI/M3)","m2    ",50.39,1,null,null,null,null,null,""]
[2,2,2,6,5,16,0,0,{"$f":"IF(AND($C1051<=4,$C1051<>0),0,IF(AND($C1051=\"S\",$Y1051>0),OFFSET(I1051,-1,0)+1,OFFSET(I1051,-1,0)))","v":0},25,6,"F","Nível 2","Nível 2","5.16.","AGETOP",null,"REVESTIMENTO DE PISO","-",null,1,null,null,null,null,null,""]
["S",2,"S",0,5,16,0,0,{"$f":"IF(AND($C1052<=4,$C1052<>0),0,IF(AND($C1052=\"S\",$Y1052>0),OFFSET(I1052,-1,0)+1,OFFSET(I1052,-1,0)))","v":0},0,0,"F","Serviço","Serviço","5.16.0.1.","AGETOP",220100,"PASSEIO PROTECAO EM CONC.DESEMPEN.5 CM 1:2,5:3,5 ( INCLUSO ESPELHO DE 30CM/ESCAVAÇÃO/REATERRO/APILOAMENTO/ATERRO INTERNO)","m2    ",38.08,1,null,null,null,null,null,""]
["S",2,"S",0,5,16,0,0,{"$f":"IF(AND($C1053<=4,$C1053<>0),0,IF(AND($C1053=\"S\",$Y1053>0),OFFSET(I1053,-1,0)+1,OFFSET(I1053,-1,0)))","v":0},0,0,"F","Serviço","Serviço","5.16.0.2.","AGETOP",220101,"LASTRO DE CONCRETO REGULARIZADO IMPERMEABILIZADO 1:3:6 ESP=5CM (BASE)","m2    ",93.73,1,null,null,null,null,null,""]
["S",2,"S",0,5,16,0,0,{"$f":"IF(AND($C1054<=4,$C1054<>0),0,IF(AND($C1054=\"S\",$Y1054>0),OFFSET(I1054,-1,0)+1,OFFSET(I1054,-1,0)))","v":0},0,0,"F","Serviço","Serviço","5.16.0.3.","AGETOP",221101,"GRANITINA 8MM FUNDIDA COM CONTRAPISO (1CI:3ARML) E=2CM E JUNTA PLASTICA 27MM","m2    ",93.73,1,null,null,null,null,null,""]
["S",2,"S",0,5,16,0,0,{"$f":"IF(AND($C1055<=4,$C1055<>0),0,IF(AND($C1055=\"S\",$Y1055>0),OFFSET(I1055,-1,0)+1,OFFSET(I1055,-1,0)))","v":0},0,0,"F","Serviço","Serviço","5.16.0.4.","AGETOP",221102,"RODAPÉ FUNDIDO DE GRANITINA 7CM","m     ",11.38,1,null,null,null,null,null,""]
["S",2,"S",0,5,16,0,0,{"$f":"IF(AND($C1056<=4,$C1056<>0),0,IF(AND($C1056=\"S\",$Y1056>0),OFFSET(I1056,-1,0)+1,OFFSET(I1056,-1,0)))","v":0},0,0,"F","Serviço","Serviço","5.16.0.5.","AGETOP",221104,"RASPAGEM E APLICAÇÃO RESINA ACRÍLICA DUAS DEMÃOS","m2    ",93.73,1,null,null,null,null,null,""]
[2,2,2,3,5,17,0,0,{"$f":"IF(AND($C1057<=4,$C1057<>0),0,IF(AND($C1057=\"S\",$Y1057>0),OFFSET(I1057,-1,0)+1,OFFSET(I1057,-1,0)))","v":0},19,3,"F","Nível 2","Nível 2","5.17.","AGETOP",null,"FERRAGENS","-",null,1,null,null,null,null,null,""]
["S",2,"S",0,5,17,0,0,{"$f":"IF(AND($C1058<=4,$C1058<>0),0,IF(AND($C1058=\"S\",$Y1058>0),OFFSET(I1058,-1,0)+1,OFFSET(I1058,-1,0)))","v":0},0,0,"F","Serviço","Serviço","5.17.0.1.","AGETOP",230174,"BARRA DE APOIO EM AÇO INOX - 40 CM","un    ",3,1,null,null,null,null,null,""]
["S",2,"S",0,5,17,0,0,{"$f":"IF(AND($C1059<=4,$C1059<>0),0,IF(AND($C1059=\"S\",$Y1059>0),OFFSET(I1059,-1,0)+1,OFFSET(I1059,-1,0)))","v":0},0,0,"F","Serviço","Serviço","5.17.0.2.","AGETOP",230176,"BARRA DE APOIO EM AÇO INOX - 80 CM ","un    ",3,1,null,null,null,null,null,""]
[2,2,2,11,5,18,0,0,{"$f":"IF(AND($C1060<=4,$C1060<>0),0,IF(AND($C1060=\"S\",$Y1060>0),OFFSET(I1060,-1,0)+1,OFFSET(I1060,-1,0)))","v":0},16,11,"F","Nível 2","Nível 2","5.18.","AGETOP",null,"PINTURA","-",null,1,null,null,null,null,null,""]
["S",2,"S",0,5,18,0,0,{"$f":"IF(AND($C1061<=4,$C1061<>0),0,IF(AND($C1061=\"S\",$Y1061>0),OFFSET(I1061,-1,0)+1,OFFSET(I1061,-1,0)))","v":0},0,0,"F","Serviço","Serviço","5.18.0.1.","AGETOP",260801,"PINTURA A BASE DE SILICONE 1 DEMAO","m2    ",28.34,1,null,null,null,null,null,""]
["S",2,"S",0,5,18,0,0,{"$f":"IF(AND($C1062<=4,$C1062<>0),0,IF(AND($C1062=\"S\",$Y1062>0),OFFSET(I1062,-1,0)+1,OFFSET(I1062,-1,0)))","v":0},0,0,"F","Serviço","Serviço","5.18.0.2.","AGETOP",261300,"EMASSAMENTO COM MASSA PVA DUAS DEMAOS","m2    ",34.67,1,null,null,null,null,null,""]
["S",2,"S",0,5,18,0,0,{"$f":"IF(AND($C1063<=4,$C1063<>0),0,IF(AND($C1063=\"S\",$Y1063>0),OFFSET(I1063,-1,0)+1,OFFSET(I1063,-1,0)))","v":0},0,0,"F","Serviço","Serviço","5.18.0.3.","AGETOP",261302,"PINTURA LATEX DUAS DEMAOS COM SELADOR","m2    ",34.67,1,null,null,null,null,null,""]
["S",2,"S",0,5,18,0,0,{"$f":"IF(AND($C1064<=4,$C1064<>0),0,IF(AND($C1064=\"S\",$Y1064>0),OFFSET(I1064,-1,0)+1,OFFSET(I1064,-1,0)))","v":0},0,0,"F","Serviço","Serviço","5.18.0.4.","AGETOP",261303,"PINTURA LATEX TRES DEMAOS COM SELADOR","m2    ",150.22,1,null,null,null,null,null,""]
["S",2,"S",0,5,18,0,0,{"$f":"IF(AND($C1065<=4,$C1065<>0),0,IF(AND($C1065=\"S\",$Y1065>0),OFFSET(I1065,-1,0)+1,OFFSET(I1065,-1,0)))","v":0},0,0,"F","Serviço","Serviço","5.18.0.5.","AGETOP",261304,"EMASSAMENTO ACRILICO 2 DEMAOS","m2    ",13.42,1,null,null,null,null,null,""]
["S",2,"S",0,5,18,0,0,{"$f":"IF(AND($C1066<=4,$C1066<>0),0,IF(AND($C1066=\"S\",$Y1066>0),OFFSET(I1066,-1,0)+1,OFFSET(I1066,-1,0)))","v":0},0,0,"F","Serviço","Serviço","5.18.0.6.","AGETOP",261550,"PINT.ESMALTE SINT.PAREDES - 2 DEM.C/SELADOR","m2    ",13.42,1,null,null,null,null,null,""]
["S",2,"S",0,5,18,0,0,{"$f":"IF(AND($C1067<=4,$C1067<>0),0,IF(AND($C1067=\"S\",$Y1067>0),OFFSET(I1067,-1,0)+1,OFFSET(I1067,-1,0)))","v":0},0,0,"F","Serviço","Serviço","5.18.0.7.","AGETOP",261602,"PINT.ESMALTE/ESQUAD.FERRO C/FUNDO ANTICOR.","m2    ",57.44,1,null,null,null,null,null,""]
["S",2,"S",0,5,18,0,0,{"$f":"IF(AND($C1068<=4,$C1068<>0),0,IF(AND($C1068=\"S\",$Y1068>0),OFFSET(I1068,-1,0)+1,OFFSET(I1068,-1,0)))","v":0},0,0,"F","Serviço","Serviço","5.18.0.8.","AGETOP",261607,"PINTURA CERAMICA P/BEIRAL","m2    ",13.44,1,null,null,null,null,null,""]
["S",2,"S",0,5,18,0,0,{"$f":"IF(AND($C1069<=4,$C1069<>0),0,IF(AND($C1069=\"S\",$Y1069>0),OFFSET(I1069,-1,0)+1,OFFSET(I1069,-1,0)))","v":0},0,0,"F","Serviço","Serviço","5.18.0.9.","AGETOP",261611,"PINTURA  ALQUÍDICA BRILHANTE DUPLA FUNÇÃO 2 DEMÃOS = 50 MÍCRONS","m2    ",19.05,1,null,null,null,null,null,""]
["S",2,"S",0,5,18,0,0,{"$f":"IF(AND($C1070<=4,$C1070<>0),0,IF(AND($C1070=\"S\",$Y1070>0),OFFSET(I1070,-1,0)+1,OFFSET(I1070,-1,0)))","v":0},0,0,"F","Serviço","Serviço","5.18.0.10.","AGETOP",261623,"LETREIRO PEQ.PORTE A PINCEL EM PAREDE E PORTAS","m2    ",0.6,1,null,null,null,null,null,""]
[2,2,2,5,5,19,0,0,{"$f":"IF(AND($C1071<=4,$C1071<>0),0,IF(AND($C1071=\"S\",$Y1071>0),OFFSET(I1071,-1,0)+1,OFFSET(I1071,-1,0)))","v":0},5,{"$error":"#N/A"},"F","Nível 2","Nível 2","5.19.","AGETOP",null,"DIVERSOS","-",null,1,null,null,null,null,null,""]
["S",2,"S",0,5,19,0,0,{"$f":"IF(AND($C1072<=4,$C1072<>0),0,IF(AND($C1072=\"S\",$Y1072>0),OFFSET(I1072,-1,0)+1,OFFSET(I1072,-1,0)))","v":0},0,0,"F","Serviço","Serviço","5.19.0.1.","AGETOP",270501,"LIMPEZA FINAL DE OBRA - (OBRAS CIVIS)","m2    ",102.96,1,null,null,null,null,null,""]
["S",2,"S",0,5,19,0,0,{"$f":"IF(AND($C1073<=4,$C1073<>0),0,IF(AND($C1073=\"S\",$Y1073>0),OFFSET(I1073,-1,0)+1,OFFSET(I1073,-1,0)))","v":0},0,0,"F","Serviço","Serviço","5.19.0.2.","AGETOP",271608,"BANCADA DE GRANITO C/ESPELHO","m2    ",4.0699103409389394,1,null,null,null,null,null,""]
["S",2,"S",0,5,19,0,0,{"$f":"IF(AND($C1074<=4,$C1074<>0),0,IF(AND($C1074=\"S\",$Y1074>0),OFFSET(I1074,-1,0)+1,OFFSET(I1074,-1,0)))","v":0},0,0,"F","Serviço","Serviço","5.19.0.3.","AGETOP",271605,"SUPORTE PARA BANCADA EM FERRO \"T\" 1/8\" X 1 1/4\"","Un    ",14,1,null,null,null,null,null,""]
["S",2,"S",0,5,19,0,0,{"$f":"IF(AND($C1075<=4,$C1075<>0),0,IF(AND($C1075=\"S\",$Y1075>0),OFFSET(I1075,-1,0)+1,OFFSET(I1075,-1,0)))","v":0},0,0,"F","Serviço","Serviço","5.19.0.4.","AGETOP",271303,"BANCO DE CONCRETO POLIDO BASE EM ALVENARIA REBOCADA E PINTADA - PADRÃO AGETOP 2015","m     ",5.05,1,null,null,null,null,null,""]
[1,1,1,51,6,0,0,0,{"$f":"IF(AND($C1076<=4,$C1076<>0),0,IF(AND($C1076=\"S\",$Y1076>0),OFFSET(I1076,-1,0)+1,OFFSET(I1076,-1,0)))","v":0},252,51,"F","Nível 1","Nível 1","6.","AGETOP",null,"PASSARELA MODELO 02 - PADRÃO LAJE PLANA","UN",1,1,null,null,null,null,null,""]
[2,2,2,2,6,1,0,0,{"$f":"IF(AND($C1077<=4,$C1077<>0),0,IF(AND($C1077=\"S\",$Y1077>0),OFFSET(I1077,-1,0)+1,OFFSET(I1077,-1,0)))","v":0},50,2,"F","Nível 2","Nível 2","6.1.","AGETOP",null,"SERVIÇOS PRELIMINARES","-",null,1,null,null,null,null,null,""]
["S",2,"S",0,6,1,0,0,{"$f":"IF(AND($C1078<=4,$C1078<>0),0,IF(AND($C1078=\"S\",$Y1078>0),OFFSET(I1078,-1,0)+1,OFFSET(I1078,-1,0)))","v":0},0,0,"F","Serviço","Serviço","6.1.0.1.","AGETOP",20701,"LOCAÇÃO DA OBRA, EXECUÇÃO DE GABARITO SEM REAPROVEITAMENTO, INCLUSO PINTURA (FACE INTERNA DO RIPÃO 15CM) E PIQUETE COM TESTEMUNHA","m2    ",12.08,1,null,null,null,null,null,""]
[2,2,2,2,6,2,0,0,{"$f":"IF(AND($C1079<=4,$C1079<>0),0,IF(AND($C1079=\"S\",$Y1079>0),OFFSET(I1079,-1,0)+1,OFFSET(I1079,-1,0)))","v":0},48,2,"F","Nível 2","Nível 2","6.2.","AGETOP",null,"TRANSPORTES","-",null,1,null,null,null,null,null,""]
["S",2,"S",0,6,2,0,0,{"$f":"IF(AND($C1080<=4,$C1080<>0),0,IF(AND($C1080=\"S\",$Y1080>0),OFFSET(I1080,-1,0)+1,OFFSET(I1080,-1,0)))","v":0},0,0,"F","Serviço","Serviço","6.2.0.1.","AGETOP",30101,"TRANSPORTE DE ENTULHO EM CAMINHÃO  INCLUSO A CARGA MANUAL","m3    ",0.37,1,null,null,null,null,null,""]
[2,2,2,3,6,3,0,0,{"$f":"IF(AND($C1081<=4,$C1081<>0),0,IF(AND($C1081=\"S\",$Y1081>0),OFFSET(I1081,-1,0)+1,OFFSET(I1081,-1,0)))","v":0},46,3,"F","Nível 2","Nível 2","6.3.","AGETOP",null,"SERVIÇO EM TERRA","-",null,1,null,null,null,null,null,""]
[{"$f":"CHOOSE(1+LOG(1+2*(ORÇAMENTO.Nivel=\"Nível 1\")+4*(ORÇAMENTO.Nivel=\"Nível 2\")+8*(ORÇAMENTO.Nivel=\"Nível 3\")+16*(ORÇAMENTO.Nivel=\"Nível 4\")+32*(ORÇAMENTO.Nivel=\"Serviço\"),2),0,1,2,3,4,\"S\")","v":"S"},2,"S",0,6,3,0,0,{"$f":"IF(AND($C1082<=4,$C1082<>0),0,IF(AND($C1082=\"S\",$Y1082>0),OFFSET(I1082,-1,0)+1,OFFSET(I1082,-1,0)))","v":0},0,0,"F","Serviço","Serviço","6.3.0.1.","AGETOP",41002,"APILOAMENTO","m2    ",9.98,1,null,null,null,null,null,""]
["S",2,"S",0,6,3,0,0,{"$f":"IF(AND($C1083<=4,$C1083<>0),0,IF(AND($C1083=\"S\",$Y1083>0),OFFSET(I1083,-1,0)+1,OFFSET(I1083,-1,0)))","v":0},0,0,"F","Serviço","Serviço","6.3.0.2.","AGETOP",41003,"ATERRO INTERNO SEM APILOAM.C/TR.EM CARRINHO MÃO","m3    ",1.21,1,null,null,null,null,null,""]
[2,2,2,10,6,4,0,0,{"$f":"IF(AND($C1084<=4,$C1084<>0),0,IF(AND($C1084=\"S\",$Y1084>0),OFFSET(I1084,-1,0)+1,OFFSET(I1084,-1,0)))","v":0},43,10,"F","Nível 2","Nível 2","6.4.","AGETOP",null,"FUNDAÇÕES E SONDAGENS","-",null,1,null,null,null,null,null,""]
["S",2,"S",0,{"$f":"IF($C1085=1,OFFSET(E1085,-1,0)+1,OFFSET(E1085,-1,0))","v":6},{"$f":"IF($C1085=1,0,IF($C1085=2,OFFSET(F1085,-1,0)+1,OFFSET(F1085,-1,0)))","v":4},{"$f":"IF(AND($C1085<=2,$C1085<>0),0,IF($C1085=3,OFFSET(G1085,-1,0)+1,OFFSET(G1085,-1,0)))","v":0},{"$f":"IF(AND($C1085<=3,$C1085<>0),0,IF($C1085=4,OFFSET(H1085,-1,0)+1,OFFSET(H1085,-1,0)))","v":0},{"$f":"IF(AND($C1085<=4,$C1085<>0),0,IF(AND($C1085=\"S\",$Y1085>0),OFFSET(I1085,-1,0)+1,OFFSET(I1085,-1,0)))","v":0},0,0,"F","Serviço","Serviço","6.4.0.1.","AGETOP",50201,"EMBASAMENTO COM TIJOLO COMUM","m3    ",0.63,1,null,null,null,null,null,""]
["S",2,"S",0,6,4,0,0,{"$f":"IF(AND($C1086<=4,$C1086<>0),0,IF(AND($C1086=\"S\",$Y1086>0),OFFSET(I1086,-1,0)+1,OFFSET(I1086,-1,0)))","v":0},0,0,"F","Serviço","Serviço","6.4.0.2.","AGETOP",50302,"ESTACA A TRADO DIAM.30 CM SEM FERRO","M     ",6,1,null,null,null,null,null,""]
["S",2,"S",0,6,4,0,0,{"$f":"IF(AND($C1087<=4,$C1087<>0),0,IF(AND($C1087=\"S\",$Y1087>0),OFFSET(I1087,-1,0)+1,OFFSET(I1087,-1,0)))","v":0},0,0,"F","Serviço","Serviço","6.4.0.3.","AGETOP",50901,"ESCAVACAO MANUAL DE VALAS (SAPATAS/BLOCOS)","m3    ",1.67,1,null,null,null,null,null,""]
["S",2,"S",0,6,4,0,0,{"$f":"IF(AND($C1088<=4,$C1088<>0),0,IF(AND($C1088=\"S\",$Y1088>0),OFFSET(I1088,-1,0)+1,OFFSET(I1088,-1,0)))","v":0},0,0,"F","Serviço","Serviço","6.4.0.4.","AGETOP",50902,"APILOAMENTO (BLOCOS/SAPATAS)","m2    ",2.71,1,null,null,null,null,null,""]
["S",2,"S",0,6,4,0,0,{"$f":"IF(AND($C1089<=4,$C1089<>0),0,IF(AND($C1089=\"S\",$Y1089>0),OFFSET(I1089,-1,0)+1,OFFSET(I1089,-1,0)))","v":0},0,0,"F","Serviço","Serviço","6.4.0.5.","AGETOP",50903,"REATERRO C/APILOAMENTO (BLOCOS/SAPATAS)","m3    ",0.4,1,null,null,null,null,null,""]
["S",2,"S",0,6,4,0,0,{"$f":"IF(AND($C1090<=4,$C1090<>0),0,IF(AND($C1090=\"S\",$Y1090>0),OFFSET(I1090,-1,0)+1,OFFSET(I1090,-1,0)))","v":0},0,0,"F","Serviço","Serviço","6.4.0.6.","AGETOP",51017,"PREPARO COM BETONEIRA E TRANSPORTE MANUAL DE CONCRETO FCK-20  - (O.C.)","m3    ",0.56999999999999995,1,null,null,null,null,null,""]
["S",{"$f":"IF(OR(C1091=\"s\",C1091=0),OFFSET(B1091,-1,0),C1091)","v":2},{"$f":"IF(OFFSET(C1091,-1,0)=\"L\",1,IF(OFFSET(C1091,-1,0)=1,2,IF(OR(A1091=\"s\",A1091=0),\"S\",IF(AND(OFFSET(C1091,-1,0)=2,A1091=4),3,IF(AND(OR(OFFSET(C1091,-1,0)=\"s\",OFFSET(C1091,-1,0)=0),A1091<>\"s\",A1091>OFFSET(B1091,-1,0)),OFFSET(B1091,-1,0),A1091)))))","v":"S"},{"$f":"IF(OR(C1091=\"S\",C1091=0),0,IF(ISERROR(K1091),J1091,SMALL(J1091:K1091,1)))","v":0},6,4,0,0,{"$f":"IF(AND($C1091<=4,$C1091<>0),0,IF(AND($C1091=\"S\",$Y1091>0),OFFSET(I1091,-1,0)+1,OFFSET(I1091,-1,0)))","v":0},0,0,"F","Serviço","Serviço","6.4.0.7.","AGETOP",51026,"LANÇAMENTO/APLICAÇÃO/ADENSAMENTO DE CONCRETO EM FUNDAÇÃO- (O.C.)","m3    ",0.56999999999999995,1,null,null,null,null,null,""]
["S",2,"S",0,6,4,0,0,{"$f":"IF(AND($C1092<=4,$C1092<>0),0,IF(AND($C1092=\"S\",$Y1092>0),OFFSET(I1092,-1,0)+1,OFFSET(I1092,-1,0)))","v":0},0,0,"F","Serviço","Serviço","6.4.0.8.","AGETOP",52003,"ACO CA-50A - 6,3 MM (1/4\") - (OBRAS CIVIS)","Kg    ",10,1,null,null,null,null,null,""]
["S",2,"S",0,6,4,0,0,{"$f":"IF(AND($C1093<=4,$C1093<>0),0,IF(AND($C1093=\"S\",$Y1093>0),OFFSET(I1093,-1,0)+1,OFFSET(I1093,-1,0)))","v":0},0,0,"F","Serviço","Serviço","6.4.0.9.","AGETOP",52014,"ACO CA-60 - 5,0 MM - (OBRAS CIVIS)","Kg    ",7,1,null,null,null,null,null,""]
[2,2,2,6,6,5,0,0,{"$f":"IF(AND($C1094<=4,$C1094<>0),0,IF(AND($C1094=\"S\",$Y1094>0),OFFSET(I1094,-1,0)+1,OFFSET(I1094,-1,0)))","v":0},33,6,"F","Nível 2","Nível 2","6.5.","AGETOP",52014,"ESTRUTURA","Kg    ",7,1,null,null,null,null,null,""]
["S",2,"S",0,6,5,0,0,{"$f":"IF(AND($C1095<=4,$C1095<>0),0,IF(AND($C1095=\"S\",$Y1095>0),OFFSET(I1095,-1,0)+1,OFFSET(I1095,-1,0)))","v":0},0,0,"F","Serviço","Serviço","6.5.0.1.","AGETOP",60208,"FORMA CH.COMPENSADA 12MM-VIGA/PILAR U=3V - (OBRAS CIVIS","m2    ",11.65,1,null,null,null,null,null,""]
["S",2,"S",0,6,5,0,0,{"$f":"IF(AND($C1096<=4,$C1096<>0),0,IF(AND($C1096=\"S\",$Y1096>0),OFFSET(I1096,-1,0)+1,OFFSET(I1096,-1,0)))","v":0},{"$f":"IF(OR($C1096=\"S\",$C1096=0),0,MATCH(0,OFFSET($D1096,1,$C1096,ROW($C$1328)-ROW($C1096)),0))","v":0},{"$f":"IF(OR($C1096=\"S\",$C1096=0),0,MATCH(OFFSET($D1096,0,$C1096)+1,OFFSET($D1096,1,$C1096,ROW($C$1328)-ROW($C1096)),0))","v":0},"F","Serviço","Serviço","6.5.0.2.","AGETOP",60305,"ACO CA-50A - 10,0 MM (3/8\") - (OBRAS CIVIS)","Kg    ",50.98,1,null,null,null,null,null,""]
["S",2,"S",0,6,5,0,0,{"$f":"IF(AND($C1097<=4,$C1097<>0),0,IF(AND($C1097=\"S\",$Y1097>0),OFFSET(I1097,-1,0)+1,OFFSET(I1097,-1,0)))","v":0},0,0,"F","Serviço","Serviço","6.5.0.3.","AGETOP",60314,"ACO CA - 60 - 5,0 MM - (OBRAS CIVIS)","Kg    ",20.16,1,null,null,null,null,null,""]
["S",2,"S",0,6,5,0,0,{"$f":"IF(AND($C1098<=4,$C1098<>0),0,IF(AND($C1098=\"S\",$Y1098>0),OFFSET(I1098,-1,0)+1,OFFSET(I1098,-1,0)))","v":0},0,0,"F","Serviço","Serviço","6.5.0.4.","AGETOP",60507,"PREPARO COM BETONEIRA E TRANSPORTE MANUAL DE CONCRETO FCK-20 - (O.C.)","m3    ",0.52,1,null,null,null,null,null,""]
["S",2,"S",0,6,5,0,0,{"$f":"IF(AND($C1099<=4,$C1099<>0),0,IF(AND($C1099=\"S\",$Y1099>0),OFFSET(I1099,-1,0)+1,OFFSET(I1099,-1,0)))","v":0},0,0,"F","Serviço","Serviço","6.5.0.5.","AGETOP",60802,"LANÇAMENTO/APLICAÇÃO/ADENSAMENTO DE CONCRETO EM ESTRUTURA - (O.C.)","m3    ",0.52,1,null,null,null,null,null,""]
[2,2,2,8,6,6,0,0,{"$f":"IF(AND($C1100<=4,$C1100<>0),0,IF(AND($C1100=\"S\",$Y1100>0),OFFSET(I1100,-1,0)+1,OFFSET(I1100,-1,0)))","v":0},27,8,"F","Nível 2","Nível 2","6.6.","AGETOP",null,"INSTALAÇÕES ELÉTRICAS","-",null,1,null,null,null,null,null,""]
["S",2,"S",0,6,6,0,0,{"$f":"IF(AND($C1101<=4,$C1101<>0),0,IF(AND($C1101=\"S\",$Y1101>0),OFFSET(I1101,-1,0)+1,OFFSET(I1101,-1,0)))","v":0},0,0,"F","Serviço","Serviço","6.6.0.1.","AGETOP",70351,"BRACADEIRA METALICA TIPO \"U\" DIAM. 3/4\"","Un    ",4,1,null,null,null,null,null,""]
["S",2,"S",0,6,6,0,0,{"$f":"IF(AND($C1102<=4,$C1102<>0),0,IF(AND($C1102=\"S\",$Y1102>0),OFFSET(I1102,-1,0)+1,OFFSET(I1102,-1,0)))","v":0},0,0,"F","Serviço","Serviço","6.6.0.2.","AGETOP",71660,"LUMINÁRIA CIRCULAR COM VIDRO PARA QUADRA ATÉ 400 W - BASE E-40","Un    ",1,1,null,null,null,null,null,""]
["S",2,"S",0,6,6,0,0,{"$f":"IF(AND($C1103<=4,$C1103<>0),0,IF(AND($C1103=\"S\",$Y1103>0),OFFSET(I1103,-1,0)+1,OFFSET(I1103,-1,0)))","v":0},0,0,"F","Serviço","Serviço","6.6.0.3.","AGETOP",71201,"ELETRODUTO DE PVC RIGIDO DIAMETRO 3/4\"","M     ",5,1,null,null,null,null,null,""]
["S",2,"S",0,6,6,0,0,{"$f":"IF(AND($C1104<=4,$C1104<>0),0,IF(AND($C1104=\"S\",$Y1104>0),OFFSET(I1104,-1,0)+1,OFFSET(I1104,-1,0)))","v":0},0,0,"F","Serviço","Serviço","6.6.0.4.","AGETOP",71291,"FIO ISOLADO PVC 750 V, No. 2,5 MM2","M     ",15,1,null,null,null,null,null,""]
["S",2,"S",0,6,6,0,0,{"$f":"IF(AND($C1105<=4,$C1105<>0),0,IF(AND($C1105=\"S\",$Y1105>0),OFFSET(I1105,-1,0)+1,OFFSET(I1105,-1,0)))","v":0},0,0,"F","Serviço","Serviço","6.6.0.5.","AGETOP",71577,"LAMPADA COMPACTA ELETRÔNICA COM REATOR INTEGRADO  25/26 W","Un    ",2,1,null,null,null,null,null,""]
["S",2,"S",0,6,6,0,0,{"$f":"IF(AND($C1106<=4,$C1106<>0),0,IF(AND($C1106=\"S\",$Y1106>0),OFFSET(I1106,-1,0)+1,OFFSET(I1106,-1,0)))","v":0},0,0,"F","Serviço","Serviço","6.6.0.6.","AGETOP",72252,"REATOR ELETRÔNICO AFP 2 X 28W","un    ",1,1,null,null,null,null,null,""]
["S",2,"S",0,6,6,0,0,{"$f":"IF(AND($C1107<=4,$C1107<>0),0,IF(AND($C1107=\"S\",$Y1107>0),OFFSET(I1107,-1,0)+1,OFFSET(I1107,-1,0)))","v":0},0,0,"F","Serviço","Serviço","6.6.0.7.","AGETOP",72341,"SOQUETE ANTIVIBRATORIO P/LAMP.FLUORESCENTE","Un    ",4,1,null,null,null,null,null,""]
[2,2,2,2,6,7,0,0,{"$f":"IF(AND($C1108<=4,$C1108<>0),0,IF(AND($C1108=\"S\",$Y1108>0),OFFSET(I1108,-1,0)+1,OFFSET(I1108,-1,0)))","v":0},19,2,"F","Nível 2","Nível 2","6.7.","AGETOP",null,"ESTRUTURAS METÁLICAS","-",null,1,null,null,null,null,null,""]
["S",2,"S",0,6,7,0,0,{"$f":"IF(AND($C1109<=4,$C1109<>0),0,IF(AND($C1109=\"S\",$Y1109>0),OFFSET(I1109,-1,0)+1,OFFSET(I1109,-1,0)))","v":0},0,0,"F","Serviço","Serviço","6.7.0.1.","AGETOP",150103,"ESTRUTURA METÁLICA CONVENCIONAL EM AÇO DO TIPO USI SAC-300 COM FUNDO ANTICORROSIVO","Kg    ",57.86,1,null,null,null,null,null,""]
[2,2,2,2,6,8,0,0,{"$f":"IF(AND($C1110<=4,$C1110<>0),0,IF(AND($C1110=\"S\",$Y1110>0),OFFSET(I1110,-1,0)+1,OFFSET(I1110,-1,0)))","v":0},17,2,"F","Nível 2","Nível 2","6.8.","AGETOP",null,"COBERTURAS","-",null,1,null,null,null,null,null,""]
["S",2,"S",0,6,8,0,0,{"$f":"IF(AND($C1111<=4,$C1111<>0),0,IF(AND($C1111=\"S\",$Y1111>0),OFFSET(I1111,-1,0)+1,OFFSET(I1111,-1,0)))","v":0},0,0,"F","Serviço","Serviço","6.8.0.1.","AGETOP",160801,"COBERTURA COM TELHA CANALETE 49 OU EQUIV. COM ACESSÓRIOS","m2    ",23.1,1,null,null,null,null,null,""]
[2,2,2,3,6,9,0,0,{"$f":"IF(AND($C1112<=4,$C1112<>0),0,IF(AND($C1112=\"S\",$Y1112>0),OFFSET(I1112,-1,0)+1,OFFSET(I1112,-1,0)))","v":0},15,3,"F","Nível 2","Nível 2","6.9.","AGETOP",null,"REVESTIMENTO DE PAREDE","-",null,1,null,null,null,null,null,""]
["S",2,"S",0,6,9,0,0,{"$f":"IF(AND($C1113<=4,$C1113<>0),0,IF(AND($C1113=\"S\",$Y1113>0),OFFSET(I1113,-1,0)+1,OFFSET(I1113,-1,0)))","v":0},0,0,"F","Serviço","Serviço","6.9.0.1.","AGETOP",200101,"CHAPISCO COMUM","m2    ",10.56,1,null,null,null,null,null,""]
["S",2,"S",0,6,9,0,0,{"$f":"IF(AND($C1114<=4,$C1114<>0),0,IF(AND($C1114=\"S\",$Y1114>0),OFFSET(I1114,-1,0)+1,OFFSET(I1114,-1,0)))","v":0},0,0,"F","Serviço","Serviço","6.9.0.2.","AGETOP",200499,"REBOCO PAULISTA A-14 (1CALH:4ARMLC+100kgCI/M3)","m2    ",10.56,1,null,null,null,null,null,""]
[2,2,2,5,6,10,0,0,{"$f":"IF(AND($C1115<=4,$C1115<>0),0,IF(AND($C1115=\"S\",$Y1115>0),OFFSET(I1115,-1,0)+1,OFFSET(I1115,-1,0)))","v":0},12,5,"F","Nível 2","Nível 2","6.10.","AGETOP",null,"REVESTIMENTO DE PISO","-",null,1,null,null,null,null,null,""]
["S",2,"S",0,6,10,0,0,{"$f":"IF(AND($C1116<=4,$C1116<>0),0,IF(AND($C1116=\"S\",$Y1116>0),OFFSET(I1116,-1,0)+1,OFFSET(I1116,-1,0)))","v":0},0,0,"F","Serviço","Serviço","6.10.0.1.","AGETOP",220101,"LASTRO DE CONCRETO REGULARIZADO IMPERMEABILIZADO 1:3:6 ESP=5CM (BASE)","m2    ",9.98,1,null,null,null,null,null,""]
["S",2,"S",0,6,10,0,0,{"$f":"IF(AND($C1117<=4,$C1117<>0),0,IF(AND($C1117=\"S\",$Y1117>0),OFFSET(I1117,-1,0)+1,OFFSET(I1117,-1,0)))","v":0},0,0,"F","Serviço","Serviço","6.10.0.2.","AGETOP",221101,"GRANITINA 8MM FUNDIDA COM CONTRAPISO (1CI:3ARML) E=2CM E JUNTA PLASTICA 27MM","m2    ",13.65,1,null,null,null,null,null,""]
["S",2,"S",0,6,10,0,0,{"$f":"IF(AND($C1118<=4,$C1118<>0),0,IF(AND($C1118=\"S\",$Y1118>0),OFFSET(I1118,-1,0)+1,OFFSET(I1118,-1,0)))","v":0},0,0,"F","Serviço","Serviço","6.10.0.3.","AGETOP",221102,"RODAPÉ FUNDIDO DE GRANITINA 7CM","m     ",2.56,1,null,null,null,null,null,""]
["S",2,"S",0,6,10,0,0,{"$f":"IF(AND($C1119<=4,$C1119<>0),0,IF(AND($C1119=\"S\",$Y1119>0),OFFSET(I1119,-1,0)+1,OFFSET(I1119,-1,0)))","v":0},0,0,"F","Serviço","Serviço","6.10.0.4.","AGETOP",221104,"RASPAGEM E APLICAÇÃO RESINA ACRÍLICA DUAS DEMÃOS","m2    ",13.65,1,null,null,null,null,null,""]
[2,2,2,5,6,11,0,0,{"$f":"IF(AND($C1120<=4,$C1120<>0),0,IF(AND($C1120=\"S\",$Y1120>0),OFFSET(I1120,-1,0)+1,OFFSET(I1120,-1,0)))","v":0},7,5,"F","Nível 2","Nível 2","6.11.","AGETOP",null,"PINTURA","-",null,1,null,null,null,null,null,""]
["S",2,"S",0,6,11,0,0,{"$f":"IF(AND($C1121<=4,$C1121<>0),0,IF(AND($C1121=\"S\",$Y1121>0),OFFSET(I1121,-1,0)+1,OFFSET(I1121,-1,0)))","v":0},0,0,"F","Serviço","Serviço","6.11.0.1.","AGETOP",261000,"PINTURA LATEX ACRILICA 2 DEMAOS C/SELADOR","m2    ",6.34,1,null,null,null,null,null,""]
["S",2,"S",0,6,11,0,0,{"$f":"IF(AND($C1122<=4,$C1122<>0),0,IF(AND($C1122=\"S\",$Y1122>0),OFFSET(I1122,-1,0)+1,OFFSET(I1122,-1,0)))","v":0},0,0,"F","Serviço","Serviço","6.11.0.2.","AGETOP",261304,"EMASSAMENTO ACRILICO 2 DEMAOS","m2    ",6.72,1,null,null,null,null,null,""]
["S",2,"S",0,6,11,0,0,{"$f":"IF(AND($C1123<=4,$C1123<>0),0,IF(AND($C1123=\"S\",$Y1123>0),OFFSET(I1123,-1,0)+1,OFFSET(I1123,-1,0)))","v":0},0,0,"F","Serviço","Serviço","6.11.0.3.","AGETOP",261550,"PINT.ESMALTE SINT.PAREDES - 2 DEM.C/SELADOR","m2    ",4.22,1,null,null,null,null,null,""]
["S",2,"S",0,6,11,0,0,{"$f":"IF(AND($C1124<=4,$C1124<>0),0,IF(AND($C1124=\"S\",$Y1124>0),OFFSET(I1124,-1,0)+1,OFFSET(I1124,-1,0)))","v":0},0,0,"F","Serviço","Serviço","6.11.0.4.","AGETOP",261611,"PINTURA  ALQUÍDICA BRILHANTE DUPLA FUNÇÃO 2 DEMÃOS = 50 MÍCRONS","m2    ",6.65,1,null,null,null,null,null,""]
[2,2,2,2,6,12,0,0,{"$f":"IF(AND($C1125<=4,$C1125<>0),0,IF(AND($C1125=\"S\",$Y1125>0),OFFSET(I1125,-1,0)+1,OFFSET(I1125,-1,0)))","v":0},2,199,"F","Nível 2","Nível 2","6.12.","AGETOP",null,"DIVERSOS","-",null,1,null,null,null,null,null,""]
["S",2,"S",0,6,12,0,0,{"$f":"IF(AND($C1126<=4,$C1126<>0),0,IF(AND($C1126=\"S\",$Y1126>0),OFFSET(I1126,-1,0)+1,OFFSET(I1126,-1,0)))","v":0},0,0,"F","Serviço","Serviço","6.12.0.1.","AGETOP",270501,"LIMPEZA FINAL DE OBRA - (OBRAS CIVIS)","m2    ",12.08,1,null,null,null,null,null,""]
[1,1,1,46,7,0,0,0,{"$f":"IF(AND($C1127<=4,$C1127<>0),0,IF(AND($C1127=\"S\",$Y1127>0),OFFSET(I1127,-1,0)+1,OFFSET(I1127,-1,0)))","v":0},201,46,"F","Nível 1","Nível 1","7.","AGETOP",null,"PASSARELA MODELO 03 - PADRÃO LAJE PLANA","UN",1,1,null,null,null,null,null,""]
[2,2,2,2,7,1,0,0,{"$f":"IF(AND($C1128<=4,$C1128<>0),0,IF(AND($C1128=\"S\",$Y1128>0),OFFSET(I1128,-1,0)+1,OFFSET(I1128,-1,0)))","v":0},45,2,"F","Nível 2","Nível 2","7.1.","AGETOP",null,"SERVIÇOS PRELIMINARES","-",null,1,null,null,null,null,null,""]
["S",2,"S",0,7,1,0,0,{"$f":"IF(AND($C1129<=4,$C1129<>0),0,IF(AND($C1129=\"S\",$Y1129>0),OFFSET(I1129,-1,0)+1,OFFSET(I1129,-1,0)))","v":0},0,0,"F","Serviço","Serviço","7.1.0.1.","AGETOP",20701,"LOCAÇÃO DA OBRA, EXECUÇÃO DE GABARITO SEM REAPROVEITAMENTO, INCLUSO PINTURA (FACE INTERNA DO RIPÃO 15CM) E PIQUETE COM TESTEMUNHA","m2    ",11.5,1,null,null,null,null,null,""]
[2,2,2,2,7,2,0,0,{"$f":"IF(AND($C1130<=4,$C1130<>0),0,IF(AND($C1130=\"S\",$Y1130>0),OFFSET(I1130,-1,0)+1,OFFSET(I1130,-1,0)))","v":0},43,2,"F","Nível 2","Nível 2","7.2.","AGETOP",null,"TRANSPORTES","-",null,1,null,null,null,null,null,""]
["S",2,"S",0,7,2,0,0,{"$f":"IF(AND($C1131<=4,$C1131<>0),0,IF(AND($C1131=\"S\",$Y1131>0),OFFSET(I1131,-1,0)+1,OFFSET(I1131,-1,0)))","v":0},0,0,"F","Serviço","Serviço","7.2.0.1.","AGETOP",30101,"TRANSPORTE DE ENTULHO EM CAMINHÃO  INCLUSO A CARGA MANUAL","m3    ",0.35,1,null,null,null,null,null,""]
[2,2,2,3,7,3,0,0,{"$f":"IF(AND($C1132<=4,$C1132<>0),0,IF(AND($C1132=\"S\",$Y1132>0),OFFSET(I1132,-1,0)+1,OFFSET(I1132,-1,0)))","v":0},41,3,"F","Nível 2","Nível 2","7.3.","AGETOP",null,"SERVIÇO EM TERRA","-",null,1,null,null,null,null,null,""]
["S",2,"S",0,7,3,0,0,{"$f":"IF(AND($C1133<=4,$C1133<>0),0,IF(AND($C1133=\"S\",$Y1133>0),OFFSET(I1133,-1,0)+1,OFFSET(I1133,-1,0)))","v":0},0,0,"F","Serviço","Serviço","7.3.0.1.","AGETOP",41002,"APILOAMENTO","m2    ",9.5,1,null,null,null,null,null,""]
["S",2,"S",0,7,3,0,0,{"$f":"IF(AND($C1134<=4,$C1134<>0),0,IF(AND($C1134=\"S\",$Y1134>0),OFFSET(I1134,-1,0)+1,OFFSET(I1134,-1,0)))","v":0},0,0,"F","Serviço","Serviço","7.3.0.2.","AGETOP",41003,"ATERRO INTERNO SEM APILOAM.C/TR.EM CARRINHO MÃO","m3    ",1.1499999999999999,1,null,null,null,null,null,""]
[2,2,2,10,7,4,0,0,{"$f":"IF(AND($C1135<=4,$C1135<>0),0,IF(AND($C1135=\"S\",$Y1135>0),OFFSET(I1135,-1,0)+1,OFFSET(I1135,-1,0)))","v":0},38,10,"F","Nível 2","Nível 2","7.4.","AGETOP",null,"FUNDAÇÕES E SONDAGENS","-",null,1,null,null,null,null,null,""]
["S",2,"S",0,7,4,0,0,{"$f":"IF(AND($C1136<=4,$C1136<>0),0,IF(AND($C1136=\"S\",$Y1136>0),OFFSET(I1136,-1,0)+1,OFFSET(I1136,-1,0)))","v":0},0,0,"F","Serviço","Serviço","7.4.0.1.","AGETOP",50201,"EMBASAMENTO COM TIJOLO COMUM","m3    ",0.6,1,null,null,null,null,null,""]
["S",2,"S",0,7,4,0,0,{"$f":"IF(AND($C1137<=4,$C1137<>0),0,IF(AND($C1137=\"S\",$Y1137>0),OFFSET(I1137,-1,0)+1,OFFSET(I1137,-1,0)))","v":0},0,0,"F","Serviço","Serviço","7.4.0.2.","AGETOP",50302,"ESTACA A TRADO DIAM.30 CM SEM FERRO","M     ",6,1,null,null,null,null,null,""]
["S",2,"S",0,7,4,0,0,{"$f":"IF(AND($C1138<=4,$C1138<>0),0,IF(AND($C1138=\"S\",$Y1138>0),OFFSET(I1138,-1,0)+1,OFFSET(I1138,-1,0)))","v":0},0,0,"F","Serviço","Serviço","7.4.0.3.","AGETOP",50901,"ESCAVACAO MANUAL DE VALAS (SAPATAS/BLOCOS)","m3    ",1.59,1,null,null,null,null,null,""]
["S",2,"S",0,7,4,0,0,{"$f":"IF(AND($C1139<=4,$C1139<>0),0,IF(AND($C1139=\"S\",$Y1139>0),OFFSET(I1139,-1,0)+1,OFFSET(I1139,-1,0)))","v":0},0,0,"F","Serviço","Serviço","7.4.0.4.","AGETOP",50902,"APILOAMENTO (BLOCOS/SAPATAS)","m2    ",2.58,1,null,null,null,null,null,""]
["S",2,"S",0,7,4,0,0,{"$f":"IF(AND($C1140<=4,$C1140<>0),0,IF(AND($C1140=\"S\",$Y1140>0),OFFSET(I1140,-1,0)+1,OFFSET(I1140,-1,0)))","v":0},0,0,"F","Serviço","Serviço","7.4.0.5.","AGETOP",50903,"REATERRO C/APILOAMENTO (BLOCOS/SAPATAS)","m3    ",0.38,1,null,null,null,null,null,""]
["S",2,"S",0,7,4,0,0,{"$f":"IF(AND($C1141<=4,$C1141<>0),0,IF(AND($C1141=\"S\",$Y1141>0),OFFSET(I1141,-1,0)+1,OFFSET(I1141,-1,0)))","v":0},0,0,"F","Serviço","Serviço","7.4.0.6.","AGETOP",51017,"PREPARO COM BETONEIRA E TRANSPORTE MANUAL DE CONCRETO FCK-20  - (O.C.)","m3    ",0.56999999999999995,1,null,null,null,null,null,""]
["S",2,"S",0,7,4,0,0,{"$f":"IF(AND($C1142<=4,$C1142<>0),0,IF(AND($C1142=\"S\",$Y1142>0),OFFSET(I1142,-1,0)+1,OFFSET(I1142,-1,0)))","v":0},0,0,"F","Serviço","Serviço","7.4.0.7.","AGETOP",51026,"LANÇAMENTO/APLICAÇÃO/ADENSAMENTO DE CONCRETO EM FUNDAÇÃO- (O.C.)","m3    ",0.56999999999999995,1,null,null,null,null,null,""]
["S",2,"S",0,7,4,0,0,{"$f":"IF(AND($C1143<=4,$C1143<>0),0,IF(AND($C1143=\"S\",$Y1143>0),OFFSET(I1143,-1,0)+1,OFFSET(I1143,-1,0)))","v":0},0,0,"F","Serviço","Serviço","7.4.0.8.","AGETOP",52003,"ACO CA-50A - 6,3 MM (1/4\") - (OBRAS CIVIS)","Kg    ",10,1,null,null,null,null,null,""]
["S",2,"S",0,7,4,0,0,{"$f":"IF(AND($C1144<=4,$C1144<>0),0,IF(AND($C1144=\"S\",$Y1144>0),OFFSET(I1144,-1,0)+1,OFFSET(I1144,-1,0)))","v":0},0,0,"F","Serviço","Serviço","7.4.0.9.","AGETOP",52014,"ACO CA-60 - 5,0 MM - (OBRAS CIVIS)","Kg    ",7,1,null,null,null,null,null,""]
[2,2,2,6,7,5,0,0,{"$f":"IF(AND($C1145<=4,$C1145<>0),0,IF(AND($C1145=\"S\",$Y1145>0),OFFSET(I1145,-1,0)+1,OFFSET(I1145,-1,0)))","v":0},28,6,"F","Nível 2","Nível 2","7.5.","AGETOP",null,"ESTRUTURA","-",null,1,null,null,null,null,null,""]
[{"$f":"CHOOSE(1+LOG(1+2*(ORÇAMENTO.Nivel=\"Nível 1\")+4*(ORÇAMENTO.Nivel=\"Nível 2\")+8*(ORÇAMENTO.Nivel=\"Nível 3\")+16*(ORÇAMENTO.Nivel=\"Nível 4\")+32*(ORÇAMENTO.Nivel=\"Serviço\"),2),0,1,2,3,4,\"S\")","v":"S"},2,"S",0,7,5,0,0,{"$f":"IF(AND($C1146<=4,$C1146<>0),0,IF(AND($C1146=\"S\",$Y1146>0),OFFSET(I1146,-1,0)+1,OFFSET(I1146,-1,0)))","v":0},0,0,"F","Serviço","Serviço","7.5.0.1.","AGETOP",60208,"FORMA CH.COMPENSADA 12MM-VIGA/PILAR U=3V - (OBRAS CIVIS","m2    ",11.65,1,null,null,null,null,null,""]
["S",2,"S",0,7,5,0,0,{"$f":"IF(AND($C1147<=4,$C1147<>0),0,IF(AND($C1147=\"S\",$Y1147>0),OFFSET(I1147,-1,0)+1,OFFSET(I1147,-1,0)))","v":0},0,0,"F","Serviço","Serviço","7.5.0.2.","AGETOP",60305,"ACO CA-50A - 10,0 MM (3/8\") - (OBRAS CIVIS)","Kg    ",50.98,1,null,null,null,null,null,""]
["S",2,"S",0,7,5,0,0,{"$f":"IF(AND($C1148<=4,$C1148<>0),0,IF(AND($C1148=\"S\",$Y1148>0),OFFSET(I1148,-1,0)+1,OFFSET(I1148,-1,0)))","v":0},0,0,"F","Serviço","Serviço","7.5.0.3.","AGETOP",60314,"ACO CA - 60 - 5,0 MM - (OBRAS CIVIS)","Kg    ",20.16,1,null,null,null,null,null,""]
["S",2,"S",0,{"$f":"IF($C1149=1,OFFSET(E1149,-1,0)+1,OFFSET(E1149,-1,0))","v":7},{"$f":"IF($C1149=1,0,IF($C1149=2,OFFSET(F1149,-1,0)+1,OFFSET(F1149,-1,0)))","v":5},{"$f":"IF(AND($C1149<=2,$C1149<>0),0,IF($C1149=3,OFFSET(G1149,-1,0)+1,OFFSET(G1149,-1,0)))","v":0},{"$f":"IF(AND($C1149<=3,$C1149<>0),0,IF($C1149=4,OFFSET(H1149,-1,0)+1,OFFSET(H1149,-1,0)))","v":0},{"$f":"IF(AND($C1149<=4,$C1149<>0),0,IF(AND($C1149=\"S\",$Y1149>0),OFFSET(I1149,-1,0)+1,OFFSET(I1149,-1,0)))","v":0},0,0,"F","Serviço","Serviço","7.5.0.4.","AGETOP",60507,"PREPARO COM BETONEIRA E TRANSPORTE MANUAL DE CONCRETO FCK-20 - (O.C.)","m3    ",0.52,1,null,null,null,null,null,""]
["S",2,"S",0,7,5,0,0,{"$f":"IF(AND($C1150<=4,$C1150<>0),0,IF(AND($C1150=\"S\",$Y1150>0),OFFSET(I1150,-1,0)+1,OFFSET(I1150,-1,0)))","v":0},0,0,"F","Serviço","Serviço","7.5.0.5.","AGETOP",60802,"LANÇAMENTO/APLICAÇÃO/ADENSAMENTO DE CONCRETO EM ESTRUTURA - (O.C.)","m3    ",0.52,1,null,null,null,null,null,""]
[2,2,2,8,7,6,0,0,{"$f":"IF(AND($C1151<=4,$C1151<>0),0,IF(AND($C1151=\"S\",$Y1151>0),OFFSET(I1151,-1,0)+1,OFFSET(I1151,-1,0)))","v":0},22,8,"F","Nível 2","Nível 2","7.6.","AGETOP",null,"INSTALAÇÕES ELÉTRICAS","-",null,1,null,null,null,null,null,""]
["S",2,"S",0,7,6,0,0,{"$f":"IF(AND($C1152<=4,$C1152<>0),0,IF(AND($C1152=\"S\",$Y1152>0),OFFSET(I1152,-1,0)+1,OFFSET(I1152,-1,0)))","v":0},0,0,"F","Serviço","Serviço","7.6.0.1.","AGETOP",70351,"BRACADEIRA METALICA TIPO \"U\" DIAM. 3/4\"","Un    ",4,1,null,null,null,null,null,""]
["S",2,"S",0,7,6,0,0,{"$f":"IF(AND($C1153<=4,$C1153<>0),0,IF(AND($C1153=\"S\",$Y1153>0),OFFSET(I1153,-1,0)+1,OFFSET(I1153,-1,0)))","v":0},0,0,"F","Serviço","Serviço","7.6.0.2.","AGETOP",71660,"LUMINÁRIA CIRCULAR COM VIDRO PARA QUADRA ATÉ 400 W - BASE E-40","Un    ",1,1,null,null,null,null,null,""]
["S",2,"S",0,7,6,0,0,{"$f":"IF(AND($C1154<=4,$C1154<>0),0,IF(AND($C1154=\"S\",$Y1154>0),OFFSET(I1154,-1,0)+1,OFFSET(I1154,-1,0)))","v":0},0,0,"F","Serviço","Serviço","7.6.0.3.","AGETOP",71201,"ELETRODUTO DE PVC RIGIDO DIAMETRO 3/4\"","M     ",5,1,null,null,null,null,null,""]
["S",{"$f":"IF(OR(C1155=\"s\",C1155=0),OFFSET(B1155,-1,0),C1155)","v":2},{"$f":"IF(OFFSET(C1155,-1,0)=\"L\",1,IF(OFFSET(C1155,-1,0)=1,2,IF(OR(A1155=\"s\",A1155=0),\"S\",IF(AND(OFFSET(C1155,-1,0)=2,A1155=4),3,IF(AND(OR(OFFSET(C1155,-1,0)=\"s\",OFFSET(C1155,-1,0)=0),A1155<>\"s\",A1155>OFFSET(B1155,-1,0)),OFFSET(B1155,-1,0),A1155)))))","v":"S"},{"$f":"IF(OR(C1155=\"S\",C1155=0),0,IF(ISERROR(K1155),J1155,SMALL(J1155:K1155,1)))","v":0},7,6,0,0,{"$f":"IF(AND($C1155<=4,$C1155<>0),0,IF(AND($C1155=\"S\",$Y1155>0),OFFSET(I1155,-1,0)+1,OFFSET(I1155,-1,0)))","v":0},0,0,"F","Serviço","Serviço","7.6.0.4.","AGETOP",71291,"FIO ISOLADO PVC 750 V, No. 2,5 MM2","M     ",15,1,null,null,null,null,null,""]
["S",2,"S",0,7,6,0,0,{"$f":"IF(AND($C1156<=4,$C1156<>0),0,IF(AND($C1156=\"S\",$Y1156>0),OFFSET(I1156,-1,0)+1,OFFSET(I1156,-1,0)))","v":0},0,0,"F","Serviço","Serviço","7.6.0.5.","AGETOP",71577,"LAMPADA COMPACTA ELETRÔNICA COM REATOR INTEGRADO  25/26 W","Un    ",2,1,null,null,null,null,null,""]
["S",2,"S",0,7,6,0,0,{"$f":"IF(AND($C1157<=4,$C1157<>0),0,IF(AND($C1157=\"S\",$Y1157>0),OFFSET(I1157,-1,0)+1,OFFSET(I1157,-1,0)))","v":0},0,0,"F","Serviço","Serviço","7.6.0.6.","AGETOP",72252,"REATOR ELETRÔNICO AFP 2 X 28W","un    ",1,1,null,null,null,null,null,""]
["S",2,"S",0,7,6,0,0,{"$f":"IF(AND($C1158<=4,$C1158<>0),0,IF(AND($C1158=\"S\",$Y1158>0),OFFSET(I1158,-1,0)+1,OFFSET(I1158,-1,0)))","v":0},0,0,"F","Serviço","Serviço","7.6.0.7.","AGETOP",72341,"SOQUETE ANTIVIBRATORIO P/LAMP.FLUORESCENTE","Un    ",4,1,null,null,null,null,null,""]
[2,2,2,2,7,7,0,0,{"$f":"IF(AND($C1159<=4,$C1159<>0),0,IF(AND($C1159=\"S\",$Y1159>0),OFFSET(I1159,-1,0)+1,OFFSET(I1159,-1,0)))","v":0},14,2,"F","Nível 2","Nível 2","7.7.","AGETOP",null,"ESTRUTURAS METÁLICAS","-",null,1,null,null,null,null,null,""]
["S",2,"S",0,7,7,0,0,{"$f":"IF(AND($C1160<=4,$C1160<>0),0,IF(AND($C1160=\"S\",$Y1160>0),OFFSET(I1160,-1,0)+1,OFFSET(I1160,-1,0)))","v":0},{"$f":"IF(OR($C1160=\"S\",$C1160=0),0,MATCH(0,OFFSET($D1160,1,$C1160,ROW($C$1328)-ROW($C1160)),0))","v":0},{"$f":"IF(OR($C1160=\"S\",$C1160=0),0,MATCH(OFFSET($D1160,0,$C1160)+1,OFFSET($D1160,1,$C1160,ROW($C$1328)-ROW($C1160)),0))","v":0},"F","Serviço","Serviço","7.7.0.1.","AGETOP",150103,"ESTRUTURA METÁLICA CONVENCIONAL EM AÇO DO TIPO USI SAC-300 COM FUNDO ANTICORROSIVO","Kg    ",55.1,1,null,null,null,null,null,""]
[2,2,2,2,7,8,0,0,{"$f":"IF(AND($C1161<=4,$C1161<>0),0,IF(AND($C1161=\"S\",$Y1161>0),OFFSET(I1161,-1,0)+1,OFFSET(I1161,-1,0)))","v":0},12,2,"F","Nível 2","Nível 2","7.8.","AGETOP",null,"COBERTURAS","-",null,1,null,null,null,null,null,""]
["S",2,"S",0,7,8,0,0,{"$f":"IF(AND($C1162<=4,$C1162<>0),0,IF(AND($C1162=\"S\",$Y1162>0),OFFSET(I1162,-1,0)+1,OFFSET(I1162,-1,0)))","v":0},0,0,"F","Serviço","Serviço","7.8.0.1.","AGETOP",160801,"COBERTURA COM TELHA CANALETE 49 OU EQUIV. COM ACESSÓRIOS","m2    ",22,1,null,null,null,null,null,""]
[2,2,2,3,7,9,0,0,{"$f":"IF(AND($C1163<=4,$C1163<>0),0,IF(AND($C1163=\"S\",$Y1163>0),OFFSET(I1163,-1,0)+1,OFFSET(I1163,-1,0)))","v":0},10,3,"F","Nível 2","Nível 2","7.9.","AGETOP",null,"REVESTIMENTO DE PAREDE","-",null,1,null,null,null,null,null,""]
["S",2,"S",0,7,9,0,0,{"$f":"IF(AND($C1164<=4,$C1164<>0),0,IF(AND($C1164=\"S\",$Y1164>0),OFFSET(I1164,-1,0)+1,OFFSET(I1164,-1,0)))","v":0},0,0,"F","Serviço","Serviço","7.9.0.1.","AGETOP",200101,"CHAPISCO COMUM","m2    ",10.56,1,null,null,null,null,null,""]
["S",2,"S",0,7,9,0,0,{"$f":"IF(AND($C1165<=4,$C1165<>0),0,IF(AND($C1165=\"S\",$Y1165>0),OFFSET(I1165,-1,0)+1,OFFSET(I1165,-1,0)))","v":0},0,0,"F","Serviço","Serviço","7.9.0.2.","AGETOP",200499,"REBOCO PAULISTA A-14 (1CALH:4ARMLC+100kgCI/M3)","m2    ",10.56,1,null,null,null,null,null,""]
[2,2,2,5,7,10,0,0,{"$f":"IF(AND($C1166<=4,$C1166<>0),0,IF(AND($C1166=\"S\",$Y1166>0),OFFSET(I1166,-1,0)+1,OFFSET(I1166,-1,0)))","v":0},7,5,"F","Nível 2","Nível 2","7.10.","AGETOP",null,"REVESTIMENTO DE PISO","-",null,1,null,null,null,null,null,""]
["S",2,"S",0,7,10,0,0,{"$f":"IF(AND($C1167<=4,$C1167<>0),0,IF(AND($C1167=\"S\",$Y1167>0),OFFSET(I1167,-1,0)+1,OFFSET(I1167,-1,0)))","v":0},0,0,"F","Serviço","Serviço","7.10.0.1.","AGETOP",220101,"LASTRO DE CONCRETO REGULARIZADO IMPERMEABILIZADO 1:3:6 ESP=5CM (BASE)","m2    ",9.5,1,null,null,null,null,null,""]
["S",2,"S",0,7,10,0,0,{"$f":"IF(AND($C1168<=4,$C1168<>0),0,IF(AND($C1168=\"S\",$Y1168>0),OFFSET(I1168,-1,0)+1,OFFSET(I1168,-1,0)))","v":0},0,0,"F","Serviço","Serviço","7.10.0.2.","AGETOP",221101,"GRANITINA 8MM FUNDIDA COM CONTRAPISO (1CI:3ARML) E=2CM E JUNTA PLASTICA 27MM","m2    ",13,1,null,null,null,null,null,""]
["S",2,"S",0,7,10,0,0,{"$f":"IF(AND($C1169<=4,$C1169<>0),0,IF(AND($C1169=\"S\",$Y1169>0),OFFSET(I1169,-1,0)+1,OFFSET(I1169,-1,0)))","v":0},0,0,"F","Serviço","Serviço","7.10.0.3.","AGETOP",221102,"RODAPÉ FUNDIDO DE GRANITINA 7CM","m     ",2.56,1,null,null,null,null,null,""]
["S",2,"S",0,7,10,0,0,{"$f":"IF(AND($C1170<=4,$C1170<>0),0,IF(AND($C1170=\"S\",$Y1170>0),OFFSET(I1170,-1,0)+1,OFFSET(I1170,-1,0)))","v":0},0,0,"F","Serviço","Serviço","7.10.0.4.","AGETOP",221104,"RASPAGEM E APLICAÇÃO RESINA ACRÍLICA DUAS DEMÃOS","m2    ",13,1,null,null,null,null,null,""]
[2,2,2,2,7,11,0,0,{"$f":"IF(AND($C1171<=4,$C1171<>0),0,IF(AND($C1171=\"S\",$Y1171>0),OFFSET(I1171,-1,0)+1,OFFSET(I1171,-1,0)))","v":0},2,149,"F","Nível 2","Nível 2","7.11.","AGETOP",null,"DIVERSOS","-",null,1,null,null,null,null,null,""]
["S",2,"S",0,7,11,0,0,{"$f":"IF(AND($C1172<=4,$C1172<>0),0,IF(AND($C1172=\"S\",$Y1172>0),OFFSET(I1172,-1,0)+1,OFFSET(I1172,-1,0)))","v":0},0,0,"F","Serviço","Serviço","7.11.0.1.","AGETOP",270501,"LIMPEZA FINAL DE OBRA - (OBRAS CIVIS)","m2    ",11.5,1,null,null,null,null,null,""]
[1,1,1,50,8,0,0,0,{"$f":"IF(AND($C1173<=4,$C1173<>0),0,IF(AND($C1173=\"S\",$Y1173>0),OFFSET(I1173,-1,0)+1,OFFSET(I1173,-1,0)))","v":0},155,50,"F","Nível 1","Nível 1","8.","AGETOP",null,"RESERVATÓRIO ELEVADO - PADRÃO SÉC. XXI","UN",1,1,null,null,null,null,null,""]
[2,2,2,5,8,1,0,0,{"$f":"IF(AND($C1174<=4,$C1174<>0),0,IF(AND($C1174=\"S\",$Y1174>0),OFFSET(I1174,-1,0)+1,OFFSET(I1174,-1,0)))","v":0},49,5,"F","Nível 2","Nível 2","8.1.","AGETOP",null,"SERVIÇOS PRELIMINARES","-",null,1,null,null,null,null,null,""]
["S",2,"S",0,8,1,0,0,{"$f":"IF(AND($C1175<=4,$C1175<>0),0,IF(AND($C1175=\"S\",$Y1175>0),OFFSET(I1175,-1,0)+1,OFFSET(I1175,-1,0)))","v":0},0,0,"F","Serviço","Serviço","8.1.0.1.","AGETOP",40101,"ESCAVACAO MANUAL DE VALAS < 1 MTS. (OBRAS CIVIS)","m3    ",0.98,1,null,null,null,null,null,""]
["S",2,"S",0,8,1,0,0,{"$f":"IF(AND($C1176<=4,$C1176<>0),0,IF(AND($C1176=\"S\",$Y1176>0),OFFSET(I1176,-1,0)+1,OFFSET(I1176,-1,0)))","v":0},0,0,"F","Serviço","Serviço","8.1.0.2.","AGETOP",40902,"REATERRO COM APILOAMENTO","m3    ",0.49,1,null,null,null,null,null,""]
["S",2,"S",0,8,1,0,0,{"$f":"IF(AND($C1177<=4,$C1177<>0),0,IF(AND($C1177=\"S\",$Y1177>0),OFFSET(I1177,-1,0)+1,OFFSET(I1177,-1,0)))","v":0},0,0,"F","Serviço","Serviço","8.1.0.3.","AGETOP",41003,"ATERRO INTERNO SEM APILOAM.C/TR.EM CARRINHO MÃO","m3    ",0.45,1,null,null,null,null,null,""]
["S",2,"S",0,8,1,0,0,{"$f":"IF(AND($C1178<=4,$C1178<>0),0,IF(AND($C1178=\"S\",$Y1178>0),OFFSET(I1178,-1,0)+1,OFFSET(I1178,-1,0)))","v":0},0,0,"F","Serviço","Serviço","8.1.0.4.","AGETOP",41002,"APILOAMENTO","m2    ",0.45,1,null,null,null,null,null,""]
[2,2,2,7,8,2,0,0,{"$f":"IF(AND($C1179<=4,$C1179<>0),0,IF(AND($C1179=\"S\",$Y1179>0),OFFSET(I1179,-1,0)+1,OFFSET(I1179,-1,0)))","v":0},44,7,"F","Nível 2","Nível 2","8.2.","AGETOP",null,"FUNDAÇÕES E SONDAGENS","-",null,1,null,null,null,null,null,""]
["S",2,"S",0,8,2,0,0,{"$f":"IF(AND($C1180<=4,$C1180<>0),0,IF(AND($C1180=\"S\",$Y1180>0),OFFSET(I1180,-1,0)+1,OFFSET(I1180,-1,0)))","v":0},0,0,"F","Serviço","Serviço","8.2.0.1.","AGETOP",51001,"ESCAVACAO TUBULOES A CEU ABERTO - (OBRAS CIVIS)","m3    ",6.79,1,null,null,null,null,null,""]
["S",2,"S",0,8,2,0,0,{"$f":"IF(AND($C1181<=4,$C1181<>0),0,IF(AND($C1181=\"S\",$Y1181>0),OFFSET(I1181,-1,0)+1,OFFSET(I1181,-1,0)))","v":0},0,0,"F","Serviço","Serviço","8.2.0.2.","AGETOP",51002,"ALARGAMENTO DE BASE PARA TUBULOES - (OBRAS CIVIS)","m3    ",2.9,1,null,null,null,null,null,""]
["S",2,"S",0,8,2,0,0,{"$f":"IF(AND($C1182<=4,$C1182<>0),0,IF(AND($C1182=\"S\",$Y1182>0),OFFSET(I1182,-1,0)+1,OFFSET(I1182,-1,0)))","v":0},0,0,"F","Serviço","Serviço","8.2.0.3.","AGETOP",52006,"ACO CA 50-A - 12,5 MM (1/2\") - (OBRAS CIVIS)","Kg    ",162,1,null,null,null,null,null,""]
["S",2,"S",0,8,2,0,0,{"$f":"IF(AND($C1183<=4,$C1183<>0),0,IF(AND($C1183=\"S\",$Y1183>0),OFFSET(I1183,-1,0)+1,OFFSET(I1183,-1,0)))","v":0},0,0,"F","Serviço","Serviço","8.2.0.4.","AGETOP",52014,"ACO CA-60 - 5,0 MM - (OBRAS CIVIS)","Kg    ",17.760000000000002,1,null,null,null,null,null,""]
["S",2,"S",0,8,2,0,0,{"$f":"IF(AND($C1184<=4,$C1184<>0),0,IF(AND($C1184=\"S\",$Y1184>0),OFFSET(I1184,-1,0)+1,OFFSET(I1184,-1,0)))","v":0},0,0,"F","Serviço","Serviço","8.2.0.5.","AGETOP",51031,"CONCRETO USINADO CONVENCIONAL FCK=20  MPA COM TRANSPORTE MANUAL (O.C .)","m3    ",8.67,1,null,null,null,null,null,""]
["S",2,"S",0,8,2,0,0,{"$f":"IF(AND($C1185<=4,$C1185<>0),0,IF(AND($C1185=\"S\",$Y1185>0),OFFSET(I1185,-1,0)+1,OFFSET(I1185,-1,0)))","v":0},0,0,"F","Serviço","Serviço","8.2.0.6.","AGETOP",51026,"LANÇAMENTO/APLICAÇÃO/ADENSAMENTO DE CONCRETO EM FUNDAÇÃO- (O.C.)","m3    ",8.67,1,null,null,null,null,null,""]
[2,2,2,10,8,3,0,0,{"$f":"IF(AND($C1186<=4,$C1186<>0),0,IF(AND($C1186=\"S\",$Y1186>0),OFFSET(I1186,-1,0)+1,OFFSET(I1186,-1,0)))","v":0},37,10,"F","Nível 2","Nível 2","8.3.","AGETOP",null,"ESTRUTURA","-",null,1,null,null,null,null,null,""]
["S",2,"S",0,8,3,0,0,{"$f":"IF(AND($C1187<=4,$C1187<>0),0,IF(AND($C1187=\"S\",$Y1187>0),OFFSET(I1187,-1,0)+1,OFFSET(I1187,-1,0)))","v":0},0,0,"F","Serviço","Serviço","8.3.0.1.","AGETOP",60201,"FORMA CURVA C/TABUA E CH.COMPENSADO U=2 V - (O.C.)","m2    ",70.650000000000006,1,null,null,null,null,null,""]
["S",2,"S",0,8,3,0,0,{"$f":"IF(AND($C1188<=4,$C1188<>0),0,IF(AND($C1188=\"S\",$Y1188>0),OFFSET(I1188,-1,0)+1,OFFSET(I1188,-1,0)))","v":0},0,0,"F","Serviço","Serviço","8.3.0.2.","AGETOP",60210,"FORMA CH.COMPENSADA PLASTIF. 12MM-U=5V - (OBRAS CIVIS)","m2    ",60.23,1,null,null,null,null,null,""]
["S",2,"S",0,8,3,0,0,{"$f":"IF(AND($C1189<=4,$C1189<>0),0,IF(AND($C1189=\"S\",$Y1189>0),OFFSET(I1189,-1,0)+1,OFFSET(I1189,-1,0)))","v":0},0,0,"F","Serviço","Serviço","8.3.0.3.","AGETOP",60303,"ACO CA-50-A - 6,3 MM (1/4\") - (OBRAS CIVIS)","Kg    ",279,1,null,null,null,null,null,""]
["S",2,"S",0,8,3,0,0,{"$f":"IF(AND($C1190<=4,$C1190<>0),0,IF(AND($C1190=\"S\",$Y1190>0),OFFSET(I1190,-1,0)+1,OFFSET(I1190,-1,0)))","v":0},0,0,"F","Serviço","Serviço","8.3.0.4.","AGETOP",60304,"ACO CA-50 A - 8,0 MM (5/16\") - (OBRAS CIVIS)","Kg    ",150,1,null,null,null,null,null,""]
["S",2,"S",0,8,3,0,0,{"$f":"IF(AND($C1191<=4,$C1191<>0),0,IF(AND($C1191=\"S\",$Y1191>0),OFFSET(I1191,-1,0)+1,OFFSET(I1191,-1,0)))","v":0},0,0,"F","Serviço","Serviço","8.3.0.5.","AGETOP",60305,"ACO CA-50A - 10,0 MM (3/8\") - (OBRAS CIVIS)","Kg    ",57,1,null,null,null,null,null,""]
["S",2,"S",0,8,3,0,0,{"$f":"IF(AND($C1192<=4,$C1192<>0),0,IF(AND($C1192=\"S\",$Y1192>0),OFFSET(I1192,-1,0)+1,OFFSET(I1192,-1,0)))","v":0},0,0,"F","Serviço","Serviço","8.3.0.6.","AGETOP",60306,"ACO CA-50A - 12,5 MM (1/2\") - (OBRAS CIVIS)","Kg    ",466,1,null,null,null,null,null,""]
["S",2,"S",0,8,3,0,0,{"$f":"IF(AND($C1193<=4,$C1193<>0),0,IF(AND($C1193=\"S\",$Y1193>0),OFFSET(I1193,-1,0)+1,OFFSET(I1193,-1,0)))","v":0},0,0,"F","Serviço","Serviço","8.3.0.7.","AGETOP",60314,"ACO CA - 60 - 5,0 MM - (OBRAS CIVIS)","Kg    ",131.91,1,null,null,null,null,null,""]
["S",2,"S",0,8,3,0,0,{"$f":"IF(AND($C1194<=4,$C1194<>0),0,IF(AND($C1194=\"S\",$Y1194>0),OFFSET(I1194,-1,0)+1,OFFSET(I1194,-1,0)))","v":0},0,0,"F","Serviço","Serviço","8.3.0.8.","AGETOP",60520,"CONCRETO USINADO CONVENCIONAL FCK=25 MPA COM TRANSPORTE MANUAL - (O.C.)","m3    ",10.34,1,null,null,null,null,null,""]
["S",2,"S",0,8,3,0,0,{"$f":"IF(AND($C1195<=4,$C1195<>0),0,IF(AND($C1195=\"S\",$Y1195>0),OFFSET(I1195,-1,0)+1,OFFSET(I1195,-1,0)))","v":0},0,0,"F","Serviço","Serviço","8.3.0.9.","AGETOP",60800,"LANÇAMENTO/APLICAÇÃO/ADENSAMENTO DE CONCRETO USINADO BOMBEADO EM ESTRUTURA - (O.C.)","m3    ",10.34,1,null,null,null,null,null,""]
[2,2,2,2,8,4,0,0,{"$f":"IF(AND($C1196<=4,$C1196<>0),0,IF(AND($C1196=\"S\",$Y1196>0),OFFSET(I1196,-1,0)+1,OFFSET(I1196,-1,0)))","v":0},27,2,"F","Nível 2","Nível 2","8.4.","AGETOP",null,"ALVENARIAS E DIVISÓRIAS","-",null,1,null,null,null,null,null,""]
["S",2,"S",0,8,4,0,0,{"$f":"IF(AND($C1197<=4,$C1197<>0),0,IF(AND($C1197=\"S\",$Y1197>0),OFFSET(I1197,-1,0)+1,OFFSET(I1197,-1,0)))","v":0},0,0,"F","Serviço","Serviço","8.4.0.1.","AGETOP",100201,"ALVENARIA DE TIJOLO FURADO 1/2 VEZ - 9 x 19 x 19 - ARG. (1CALH:4ARML+100KG DE CI/M3)","m2    ",77.989999999999995,1,null,null,null,null,null,""]
[2,2,2,6,8,5,0,0,{"$f":"IF(AND($C1198<=4,$C1198<>0),0,IF(AND($C1198=\"S\",$Y1198>0),OFFSET(I1198,-1,0)+1,OFFSET(I1198,-1,0)))","v":0},25,6,"F","Nível 2","Nível 2","8.5.","AGETOP",null,"IMPERMEABILIZAÇÃO","-",null,1,null,null,null,null,null,""]
["S",2,"S",0,8,5,0,0,{"$f":"IF(AND($C1199<=4,$C1199<>0),0,IF(AND($C1199=\"S\",$Y1199>0),OFFSET(I1199,-1,0)+1,OFFSET(I1199,-1,0)))","v":0},0,0,"F","Serviço","Serviço","8.5.0.1.","AGETOP",120101,"REGULARIZAÇÃO (1:3) E=2 CM","m2    ",6.71,1,null,null,null,null,null,""]
["S",2,"S",0,8,5,0,0,{"$f":"IF(AND($C1200<=4,$C1200<>0),0,IF(AND($C1200=\"S\",$Y1200>0),OFFSET(I1200,-1,0)+1,OFFSET(I1200,-1,0)))","v":0},0,0,"F","Serviço","Serviço","8.5.0.2.","AGETOP",120107,"MANTA ASFÁLTICA TIPO III - B ( 3 MM)","m2    ",6.71,1,null,null,null,null,null,""]
["S",2,"S",0,8,5,0,0,{"$f":"IF(AND($C1201<=4,$C1201<>0),0,IF(AND($C1201=\"S\",$Y1201>0),OFFSET(I1201,-1,0)+1,OFFSET(I1201,-1,0)))","v":0},0,0,"F","Serviço","Serviço","8.5.0.3.","AGETOP",120207,"PROTECAO MECANICA (1:3) E=2 CM","m2    ",6.71,1,null,null,null,null,null,""]
["S",2,"S",0,8,5,0,0,{"$f":"IF(AND($C1202<=4,$C1202<>0),0,IF(AND($C1202=\"S\",$Y1202>0),OFFSET(I1202,-1,0)+1,OFFSET(I1202,-1,0)))","v":0},0,0,"F","Serviço","Serviço","8.5.0.4.","AGETOP",120212,"IMPERMEAB. FLEXÍVEL INCLUSIVE BASE (TRANSIÇÃO) SEMI FLEXIVEL","m2    ",32.74,1,null,null,null,null,null,""]
["S",2,"S",0,8,5,0,0,{"$f":"IF(AND($C1203<=4,$C1203<>0),0,IF(AND($C1203=\"S\",$Y1203>0),OFFSET(I1203,-1,0)+1,OFFSET(I1203,-1,0)))","v":0},0,0,"F","Serviço","Serviço","8.5.0.5.","AGETOP",120902,"IMPERMEABILIZACAO VIGAS BALDRAMES E=2,0 CM","m2    ",5.72,1,null,null,null,null,null,""]
[2,2,2,5,8,6,0,0,{"$f":"IF(AND($C1204<=4,$C1204<>0),0,IF(AND($C1204=\"S\",$Y1204>0),OFFSET(I1204,-1,0)+1,OFFSET(I1204,-1,0)))","v":0},19,5,"F","Nível 2","Nível 2","8.6.","AGETOP",null,"ESQUADRIAS METÁLICAS","-",null,1,null,null,null,null,null,""]
["S",2,"S",0,8,6,0,0,{"$f":"IF(AND($C1205<=4,$C1205<>0),0,IF(AND($C1205=\"S\",$Y1205>0),OFFSET(I1205,-1,0)+1,OFFSET(I1205,-1,0)))","v":0},0,0,"F","Serviço","Serviço","8.6.0.1.","AGETOP",180710,"ALÇAPÃO FORMATO COIFA EM CHAPA VINCADA Nº. 18 H=(10+2)CM, C/ALÇAS E PORTA CADEADOS (INCLUSIVE CADEADOS Nº. 30)","m2    ",0.42,1,null,null,null,null,null,""]
["S",2,"S",0,8,6,0,0,{"$f":"IF(AND($C1206<=4,$C1206<>0),0,IF(AND($C1206=\"S\",$Y1206>0),OFFSET(I1206,-1,0)+1,OFFSET(I1206,-1,0)))","v":0},0,0,"F","Serviço","Serviço","8.6.0.2.","AGETOP",180504,"PORTA ABRIR/VENEZIANA PF-4 C/FERRAGENS","m2    ",1.68,1,null,null,null,null,null,""]
["S",2,"S",0,8,6,0,0,{"$f":"IF(AND($C1207<=4,$C1207<>0),0,IF(AND($C1207=\"S\",$Y1207>0),OFFSET(I1207,-1,0)+1,OFFSET(I1207,-1,0)))","v":0},0,0,"F","Serviço","Serviço","8.6.0.3.","AGETOP",180701,"ESCADA TIPO MARINHEIRO COM GUARDA CORPO PADRÃO AGETOP ( H > 3M )","m     ",11.54,1,null,null,null,null,null,""]
["S",2,"S",0,8,6,0,0,{"$f":"IF(AND($C1208<=4,$C1208<>0),0,IF(AND($C1208=\"S\",$Y1208>0),OFFSET(I1208,-1,0)+1,OFFSET(I1208,-1,0)))","v":0},0,0,"F","Serviço","Serviço","8.6.0.4.","AGETOP",180703,"ESCADA TIPO MARINHEIRO SEM GUARDA CORPO PADRÃO AGETOP ( H <= 3M)","m     ",7.26,1,null,null,null,null,null,""]
[2,2,2,3,8,7,0,0,{"$f":"IF(AND($C1209<=4,$C1209<>0),0,IF(AND($C1209=\"S\",$Y1209>0),OFFSET(I1209,-1,0)+1,OFFSET(I1209,-1,0)))","v":0},14,3,"F","Nível 2","Nível 2","8.7.","AGETOP",null,"REVESTIMENTO DE PAREDE","-",null,1,null,null,null,null,null,""]
[{"$f":"CHOOSE(1+LOG(1+2*(ORÇAMENTO.Nivel=\"Nível 1\")+4*(ORÇAMENTO.Nivel=\"Nível 2\")+8*(ORÇAMENTO.Nivel=\"Nível 3\")+16*(ORÇAMENTO.Nivel=\"Nível 4\")+32*(ORÇAMENTO.Nivel=\"Serviço\"),2),0,1,2,3,4,\"S\")","v":"S"},2,"S",0,8,7,0,0,{"$f":"IF(AND($C1210<=4,$C1210<>0),0,IF(AND($C1210=\"S\",$Y1210>0),OFFSET(I1210,-1,0)+1,OFFSET(I1210,-1,0)))","v":0},0,0,"F","Serviço","Serviço","8.7.0.1.","AGETOP",200101,"CHAPISCO COMUM","m2    ",209.62,1,null,null,null,null,null,""]
["S",2,"S",0,8,7,0,0,{"$f":"IF(AND($C1211<=4,$C1211<>0),0,IF(AND($C1211=\"S\",$Y1211>0),OFFSET(I1211,-1,0)+1,OFFSET(I1211,-1,0)))","v":0},0,0,"F","Serviço","Serviço","8.7.0.2.","AGETOP",200499,"REBOCO PAULISTA A-14 (1CALH:4ARMLC+100kgCI/M3)","m2    ",209.62,1,null,null,null,null,null,""]
[2,2,2,3,8,8,0,0,{"$f":"IF(AND($C1212<=4,$C1212<>0),0,IF(AND($C1212=\"S\",$Y1212>0),OFFSET(I1212,-1,0)+1,OFFSET(I1212,-1,0)))","v":0},11,3,"F","Nível 2","Nível 2","8.8.","AGETOP",null,"FORROS","-",null,1,null,null,null,null,null,""]
["S",2,"S",0,{"$f":"IF($C1213=1,OFFSET(E1213,-1,0)+1,OFFSET(E1213,-1,0))","v":8},{"$f":"IF($C1213=1,0,IF($C1213=2,OFFSET(F1213,-1,0)+1,OFFSET(F1213,-1,0)))","v":8},{"$f":"IF(AND($C1213<=2,$C1213<>0),0,IF($C1213=3,OFFSET(G1213,-1,0)+1,OFFSET(G1213,-1,0)))","v":0},{"$f":"IF(AND($C1213<=3,$C1213<>0),0,IF($C1213=4,OFFSET(H1213,-1,0)+1,OFFSET(H1213,-1,0)))","v":0},{"$f":"IF(AND($C1213<=4,$C1213<>0),0,IF(AND($C1213=\"S\",$Y1213>0),OFFSET(I1213,-1,0)+1,OFFSET(I1213,-1,0)))","v":0},0,0,"F","Serviço","Serviço","8.8.0.1.","AGETOP",210102,"CHAPISCO ROLADO ( 1CIM:3 ARML)+(1 COLA:10 CIM)","m2    ",17.579999999999998,1,null,null,null,null,null,""]
["S",2,"S",0,8,8,0,0,{"$f":"IF(AND($C1214<=4,$C1214<>0),0,IF(AND($C1214=\"S\",$Y1214>0),OFFSET(I1214,-1,0)+1,OFFSET(I1214,-1,0)))","v":0},0,0,"F","Serviço","Serviço","8.8.0.2.","AGETOP",210401,"REBOCO PAULISTA EM FORRO(1CALH:4ARML+150KG CI/M3)","m2    ",17.579999999999998,1,null,null,null,null,null,""]
[2,2,2,4,8,9,0,0,{"$f":"IF(AND($C1215<=4,$C1215<>0),0,IF(AND($C1215=\"S\",$Y1215>0),OFFSET(I1215,-1,0)+1,OFFSET(I1215,-1,0)))","v":0},8,4,"F","Nível 2","Nível 2","8.9.","AGETOP",null,"REVESTIMENTO DE PISO","-",null,1,null,null,null,null,null,""]
["S",2,"S",0,8,9,0,0,{"$f":"IF(AND($C1216<=4,$C1216<>0),0,IF(AND($C1216=\"S\",$Y1216>0),OFFSET(I1216,-1,0)+1,OFFSET(I1216,-1,0)))","v":0},0,0,"F","Serviço","Serviço","8.9.0.1.","AGETOP",220100,"PASSEIO PROTECAO EM CONC.DESEMPEN.5 CM 1:2,5:3,5 ( INCLUSO ESPELHO DE 30CM/ESCAVAÇÃO/REATERRO/APILOAMENTO/ATERRO INTERNO)","m2    ",6.41,1,null,null,null,null,null,""]
["S",2,"S",0,8,9,0,0,{"$f":"IF(AND($C1217<=4,$C1217<>0),0,IF(AND($C1217=\"S\",$Y1217>0),OFFSET(I1217,-1,0)+1,OFFSET(I1217,-1,0)))","v":0},0,0,"F","Serviço","Serviço","8.9.0.2.","AGETOP",220102,"PISO CONCRETO DESEMPENADO ESPESSURA = 5 CM  1:2,5:3,5","m2    ",4.5199999999999996,1,null,null,null,null,null,""]
["S",2,"S",0,8,9,0,0,{"$f":"IF(AND($C1218<=4,$C1218<>0),0,IF(AND($C1218=\"S\",$Y1218>0),OFFSET(I1218,-1,0)+1,OFFSET(I1218,-1,0)))","v":0},0,0,"F","Serviço","Serviço","8.9.0.3.","AGETOP",220902,"RODAPE DE MASSA (ICI:3 ARMG)","m     ",15.7,1,null,null,null,null,null,""]
[2,{"$f":"IF(OR(C1219=\"s\",C1219=0),OFFSET(B1219,-1,0),C1219)","v":2},{"$f":"IF(OFFSET(C1219,-1,0)=\"L\",1,IF(OFFSET(C1219,-1,0)=1,2,IF(OR(A1219=\"s\",A1219=0),\"S\",IF(AND(OFFSET(C1219,-1,0)=2,A1219=4),3,IF(AND(OR(OFFSET(C1219,-1,0)=\"s\",OFFSET(C1219,-1,0)=0),A1219<>\"s\",A1219>OFFSET(B1219,-1,0)),OFFSET(B1219,-1,0),A1219)))))","v":2},{"$f":"IF(OR(C1219=\"S\",C1219=0),0,IF(ISERROR(K1219),J1219,SMALL(J1219:K1219,1)))","v":4},8,10,0,0,{"$f":"IF(AND($C1219<=4,$C1219<>0),0,IF(AND($C1219=\"S\",$Y1219>0),OFFSET(I1219,-1,0)+1,OFFSET(I1219,-1,0)))","v":0},4,97,"F","Nível 2","Nível 2","8.10.","AGETOP",null,"PINTURA","-",null,1,null,null,null,null,null,""]
["S",2,"S",0,8,10,0,0,{"$f":"IF(AND($C1220<=4,$C1220<>0),0,IF(AND($C1220=\"S\",$Y1220>0),OFFSET(I1220,-1,0)+1,OFFSET(I1220,-1,0)))","v":0},0,0,"F","Serviço","Serviço","8.10.0.1.","AGETOP",261300,"EMASSAMENTO COM MASSA PVA DUAS DEMAOS","m2    ",89.35,1,null,null,null,null,null,""]
["S",2,"S",0,8,10,0,0,{"$f":"IF(AND($C1221<=4,$C1221<>0),0,IF(AND($C1221=\"S\",$Y1221>0),OFFSET(I1221,-1,0)+1,OFFSET(I1221,-1,0)))","v":0},0,0,"F","Serviço","Serviço","8.10.0.2.","AGETOP",261000,"PINTURA LATEX ACRILICA 2 DEMAOS C/SELADOR","m2    ",209.62,1,null,null,null,null,null,""]
["S",2,"S",0,8,10,0,0,{"$f":"IF(AND($C1222<=4,$C1222<>0),0,IF(AND($C1222=\"S\",$Y1222>0),OFFSET(I1222,-1,0)+1,OFFSET(I1222,-1,0)))","v":0},0,0,"F","Serviço","Serviço","8.10.0.3.","AGETOP",261602,"PINT.ESMALTE/ESQUAD.FERRO C/FUNDO ANTICOR.","m2    ",14.68,1,null,null,null,null,null,""]
[1,1,1,26,9,0,0,0,{"$f":"IF(AND($C1223<=4,$C1223<>0),0,IF(AND($C1223=\"S\",$Y1223>0),OFFSET(I1223,-1,0)+1,OFFSET(I1223,-1,0)))","v":0},105,26,"F","Nível 1","Nível 1","9.","AGETOP",null,"RESERVATÓRIO ENTERRADO - PADRÃO SÉC. XXI","UN",1,1,null,null,null,null,null,""]
[2,2,2,2,9,1,0,0,{"$f":"IF(AND($C1224<=4,$C1224<>0),0,IF(AND($C1224=\"S\",$Y1224>0),OFFSET(I1224,-1,0)+1,OFFSET(I1224,-1,0)))","v":0},{"$f":"IF(OR($C1224=\"S\",$C1224=0),0,MATCH(0,OFFSET($D1224,1,$C1224,ROW($C$1328)-ROW($C1224)),0))","v":25},{"$f":"IF(OR($C1224=\"S\",$C1224=0),0,MATCH(OFFSET($D1224,0,$C1224)+1,OFFSET($D1224,1,$C1224,ROW($C$1328)-ROW($C1224)),0))","v":2},"F","Nível 2","Nível 2","9.1.","AGETOP",null,"SERVIÇOS PRELIMINARES","-",null,1,null,null,null,null,null,""]
["S",2,"S",0,9,1,0,0,{"$f":"IF(AND($C1225<=4,$C1225<>0),0,IF(AND($C1225=\"S\",$Y1225>0),OFFSET(I1225,-1,0)+1,OFFSET(I1225,-1,0)))","v":0},0,0,"F","Serviço","Serviço","9.1.0.1.","AGETOP",20702,"LOCAÇÃO DE OBRAS DE PEQUENO PORTE COM CAVALETE, INCLUSO PINTURA ( FACE INTERNA DO SARRAFO 10CM) E PIQUETE COM TESTEMUNHA","m2    ",12.24,1,null,null,null,null,null,""]
[2,2,2,3,9,2,0,0,{"$f":"IF(AND($C1226<=4,$C1226<>0),0,IF(AND($C1226=\"S\",$Y1226>0),OFFSET(I1226,-1,0)+1,OFFSET(I1226,-1,0)))","v":0},23,3,"F","Nível 2","Nível 2","9.2.","AGETOP",null,"SERVIÇO EM TERRA","-",null,1,null,null,null,null,null,""]
["S",2,"S",0,9,2,0,0,{"$f":"IF(AND($C1227<=4,$C1227<>0),0,IF(AND($C1227=\"S\",$Y1227>0),OFFSET(I1227,-1,0)+1,OFFSET(I1227,-1,0)))","v":0},0,0,"F","Serviço","Serviço","9.2.0.1.","AGETOP",40101,"ESCAVACAO MANUAL DE VALAS < 1 MTS. (OBRAS CIVIS)","m3    ",25.58,1,null,null,null,null,null,""]
["S",2,"S",0,9,2,0,0,{"$f":"IF(AND($C1228<=4,$C1228<>0),0,IF(AND($C1228=\"S\",$Y1228>0),OFFSET(I1228,-1,0)+1,OFFSET(I1228,-1,0)))","v":0},0,0,"F","Serviço","Serviço","9.2.0.2.","AGETOP",40904,"REATERRO COM APILOAMENTO MECÂNICO","m3    ",12.276000000000002,1,null,null,null,null,null,""]
[2,2,2,3,9,3,0,0,{"$f":"IF(AND($C1229<=4,$C1229<>0),0,IF(AND($C1229=\"S\",$Y1229>0),OFFSET(I1229,-1,0)+1,OFFSET(I1229,-1,0)))","v":0},20,3,"F","Nível 2","Nível 2","9.3.","AGETOP",null,"FUNDAÇÕES E SONDAGENS","-",null,1,null,null,null,null,null,""]
["S",2,"S",0,9,3,0,0,{"$f":"IF(AND($C1230<=4,$C1230<>0),0,IF(AND($C1230=\"S\",$Y1230>0),OFFSET(I1230,-1,0)+1,OFFSET(I1230,-1,0)))","v":0},0,0,"F","Serviço","Serviço","9.3.0.1.","AGETOP",51031,"CONCRETO USINADO CONVENCIONAL FCK=20  MPA COM TRANSPORTE MANUAL (O.C .)","m3    ",0.61380000000000012,1,null,null,null,null,null,""]
["S",2,"S",0,9,3,0,0,{"$f":"IF(AND($C1231<=4,$C1231<>0),0,IF(AND($C1231=\"S\",$Y1231>0),OFFSET(I1231,-1,0)+1,OFFSET(I1231,-1,0)))","v":0},0,0,"F","Serviço","Serviço","9.3.0.2.","AGETOP",51026,"LANÇAMENTO/APLICAÇÃO/ADENSAMENTO DE CONCRETO EM FUNDAÇÃO- (O.C.)","m3    ",0.61380000000000012,1,null,null,null,null,null,""]
[2,2,2,6,9,4,0,0,{"$f":"IF(AND($C1232<=4,$C1232<>0),0,IF(AND($C1232=\"S\",$Y1232>0),OFFSET(I1232,-1,0)+1,OFFSET(I1232,-1,0)))","v":0},17,6,"F","Nível 2","Nível 2","9.4.","AGETOP",null,"ESTRUTURA","-",null,1,null,null,null,null,null,""]
["S",2,"S",0,9,4,0,0,{"$f":"IF(AND($C1233<=4,$C1233<>0),0,IF(AND($C1233=\"S\",$Y1233>0),OFFSET(I1233,-1,0)+1,OFFSET(I1233,-1,0)))","v":0},0,0,"F","Serviço","Serviço","9.4.0.1.","AGETOP",60210,"FORMA CH.COMPENSADA PLASTIF. 12MM-U=5V - (OBRAS CIVIS)","m2    ",65.739999999999995,1,null,null,null,null,null,""]
["S",2,"S",0,9,4,0,0,{"$f":"IF(AND($C1234<=4,$C1234<>0),0,IF(AND($C1234=\"S\",$Y1234>0),OFFSET(I1234,-1,0)+1,OFFSET(I1234,-1,0)))","v":0},0,0,"F","Serviço","Serviço","9.4.0.2.","AGETOP",60520,"CONCRETO USINADO CONVENCIONAL FCK=25 MPA COM TRANSPORTE MANUAL - (O.C.)","m3    ",6.81,1,null,null,null,null,null,""]
["S",2,"S",0,9,4,0,0,{"$f":"IF(AND($C1235<=4,$C1235<>0),0,IF(AND($C1235=\"S\",$Y1235>0),OFFSET(I1235,-1,0)+1,OFFSET(I1235,-1,0)))","v":0},0,0,"F","Serviço","Serviço","9.4.0.3.","AGETOP",60800,"LANÇAMENTO/APLICAÇÃO/ADENSAMENTO DE CONCRETO USINADO BOMBEADO EM ESTRUTURA - (O.C.)","m3    ",6.81,1,null,null,null,null,null,""]
["S",2,"S",0,9,4,0,0,{"$f":"IF(AND($C1236<=4,$C1236<>0),0,IF(AND($C1236=\"S\",$Y1236>0),OFFSET(I1236,-1,0)+1,OFFSET(I1236,-1,0)))","v":0},0,0,"F","Serviço","Serviço","9.4.0.4.","AGETOP",60303,"ACO CA-50-A - 6,3 MM (1/4\") - (OBRAS CIVIS)","Kg    ",422,1,null,null,null,null,null,""]
["S",2,"S",0,9,4,0,0,{"$f":"IF(AND($C1237<=4,$C1237<>0),0,IF(AND($C1237=\"S\",$Y1237>0),OFFSET(I1237,-1,0)+1,OFFSET(I1237,-1,0)))","v":0},0,0,"F","Serviço","Serviço","9.4.0.5.","AGETOP",60314,"ACO CA - 60 - 5,0 MM - (OBRAS CIVIS)","Kg    ",11,1,null,null,null,null,null,""]
[2,2,2,6,9,5,0,0,{"$f":"IF(AND($C1238<=4,$C1238<>0),0,IF(AND($C1238=\"S\",$Y1238>0),OFFSET(I1238,-1,0)+1,OFFSET(I1238,-1,0)))","v":0},11,6,"F","Nível 2","Nível 2","9.5.","AGETOP",null,"IMPERMEABILIZAÇÃO","-",null,1,null,null,null,null,null,""]
["S",2,"S",0,9,5,0,0,{"$f":"IF(AND($C1239<=4,$C1239<>0),0,IF(AND($C1239=\"S\",$Y1239>0),OFFSET(I1239,-1,0)+1,OFFSET(I1239,-1,0)))","v":0},0,0,"F","Serviço","Serviço","9.5.0.1.","AGETOP",120101,"REGULARIZAÇÃO (1:3) E=2 CM","m2    ",12.24,1,null,null,null,null,null,""]
["S",2,"S",0,9,5,0,0,{"$f":"IF(AND($C1240<=4,$C1240<>0),0,IF(AND($C1240=\"S\",$Y1240>0),OFFSET(I1240,-1,0)+1,OFFSET(I1240,-1,0)))","v":0},0,0,"F","Serviço","Serviço","9.5.0.2.","AGETOP",120107,"MANTA ASFÁLTICA TIPO III - B ( 3 MM)","m2    ",12.24,1,null,null,null,null,null,""]
["S",2,"S",0,9,5,0,0,{"$f":"IF(AND($C1241<=4,$C1241<>0),0,IF(AND($C1241=\"S\",$Y1241>0),OFFSET(I1241,-1,0)+1,OFFSET(I1241,-1,0)))","v":0},0,0,"F","Serviço","Serviço","9.5.0.3.","AGETOP",120207,"PROTECAO MECANICA (1:3) E=2 CM","m2    ",19.115000000000002,1,null,null,null,null,null,""]
["S",2,"S",0,9,5,0,0,{"$f":"IF(AND($C1242<=4,$C1242<>0),0,IF(AND($C1242=\"S\",$Y1242>0),OFFSET(I1242,-1,0)+1,OFFSET(I1242,-1,0)))","v":0},0,0,"F","Serviço","Serviço","9.5.0.4.","AGETOP",120212,"IMPERMEAB. FLEXÍVEL INCLUSIVE BASE (TRANSIÇÃO) SEMI FLEXIVEL","m2    ",47.695000000000007,1,null,null,null,null,null,""]
["S",2,"S",0,9,5,0,0,{"$f":"IF(AND($C1243<=4,$C1243<>0),0,IF(AND($C1243=\"S\",$Y1243>0),OFFSET(I1243,-1,0)+1,OFFSET(I1243,-1,0)))","v":0},0,0,"F","Serviço","Serviço","9.5.0.5.","AGETOP",121101,"IMPERMEABILIZAÇÃO  MURO DE ARRIMO COM 4 DEMÃOS DE EMULSÃO ASFÁLTICA ","m2    ",35.500000000000007,1,null,null,null,null,null,""]
[2,2,2,3,9,6,0,0,{"$f":"IF(AND($C1244<=4,$C1244<>0),0,IF(AND($C1244=\"S\",$Y1244>0),OFFSET(I1244,-1,0)+1,OFFSET(I1244,-1,0)))","v":0},5,3,"F","Nível 2","Nível 2","9.6.","AGETOP",null,"ESQUADRIAS METÁLICAS","-",null,1,null,null,null,null,null,""]
["S",2,"S",0,9,6,0,0,{"$f":"IF(AND($C1245<=4,$C1245<>0),0,IF(AND($C1245=\"S\",$Y1245>0),OFFSET(I1245,-1,0)+1,OFFSET(I1245,-1,0)))","v":0},0,0,"F","Serviço","Serviço","9.6.0.1.","AGETOP",180703,"ESCADA TIPO MARINHEIRO SEM GUARDA CORPO PADRÃO AGETOP ( H <= 3M)","m     ",1.4,1,null,null,null,null,null,""]
["S",2,"S",0,9,6,0,0,{"$f":"IF(AND($C1246<=4,$C1246<>0),0,IF(AND($C1246=\"S\",$Y1246>0),OFFSET(I1246,-1,0)+1,OFFSET(I1246,-1,0)))","v":0},0,0,"F","Serviço","Serviço","9.6.0.2.","AGETOP",180710,"ALÇAPÃO FORMATO COIFA EM CHAPA VINCADA Nº. 18 H=(10+2)CM, C/ALÇAS E PORTA CADEADOS (INCLUSIVE CADEADOS Nº. 30)","m2    ",3.28,1,null,null,null,null,null,""]
[2,2,2,2,9,7,0,0,{"$f":"IF(AND($C1247<=4,$C1247<>0),0,IF(AND($C1247=\"S\",$Y1247>0),OFFSET(I1247,-1,0)+1,OFFSET(I1247,-1,0)))","v":0},2,62,"F","Nível 2","Nível 2","9.7.","AGETOP",null,"PINTURA","-",null,1,null,null,null,null,null,""]
["S",2,"S",0,9,7,0,0,{"$f":"IF(AND($C1248<=4,$C1248<>0),0,IF(AND($C1248=\"S\",$Y1248>0),OFFSET(I1248,-1,0)+1,OFFSET(I1248,-1,0)))","v":0},0,0,"F","Serviço","Serviço","9.7.0.1.","AGETOP",261602,"PINT.ESMALTE/ESQUAD.FERRO C/FUNDO ANTICOR.","m2    ",1.4,1,null,null,null,null,null,""]
[1,1,1,79,10,0,0,0,{"$f":"IF(AND($C1249<=4,$C1249<>0),0,IF(AND($C1249=\"S\",$Y1249>0),OFFSET(I1249,-1,0)+1,OFFSET(I1249,-1,0)))","v":0},79,{"$error":"#N/A"},"F","Nível 1","Nível 1","10.","AGETOP",null,"QUADRO ARCO MOD 02 - PADRÃO SEDUC","UN",1,1,null,null,null,null,null,""]
[2,2,2,2,10,1,0,0,{"$f":"IF(AND($C1250<=4,$C1250<>0),0,IF(AND($C1250=\"S\",$Y1250>0),OFFSET(I1250,-1,0)+1,OFFSET(I1250,-1,0)))","v":0},78,2,"F","Nível 2","Nível 2","10.1.","AGETOP",null,"SERVIÇOS PRELIMINARES","-",null,1,null,null,null,null,null,""]
["S",2,"S",0,10,1,0,0,{"$f":"IF(AND($C1251<=4,$C1251<>0),0,IF(AND($C1251=\"S\",$Y1251>0),OFFSET(I1251,-1,0)+1,OFFSET(I1251,-1,0)))","v":0},0,0,"F","Serviço","Serviço","10.1.0.1.","AGETOP",20702,"LOCAÇÃO DE OBRAS DE PEQUENO PORTE COM CAVALETE, INCLUSO PINTURA ( FACE INTERNA DO SARRAFO 10CM) E PIQUETE COM TESTEMUNHA","m2    ",432.77,1,null,null,null,null,null,""]
[2,2,2,3,10,2,0,0,{"$f":"IF(AND($C1252<=4,$C1252<>0),0,IF(AND($C1252=\"S\",$Y1252>0),OFFSET(I1252,-1,0)+1,OFFSET(I1252,-1,0)))","v":0},76,3,"F","Nível 2","Nível 2","10.2.","AGETOP",null,"SERVIÇO EM TERRA","-",null,1,null,null,null,null,null,""]
["S",2,"S",0,10,2,0,0,{"$f":"IF(AND($C1253<=4,$C1253<>0),0,IF(AND($C1253=\"S\",$Y1253>0),OFFSET(I1253,-1,0)+1,OFFSET(I1253,-1,0)))","v":0},0,0,"F","Serviço","Serviço","10.2.0.1.","AGETOP",41002,"APILOAMENTO","m2    ",583.85,1,null,null,null,null,null,""]
["S",2,"S",0,10,2,0,0,{"$f":"IF(AND($C1254<=4,$C1254<>0),0,IF(AND($C1254=\"S\",$Y1254>0),OFFSET(I1254,-1,0)+1,OFFSET(I1254,-1,0)))","v":0},0,0,"F","Serviço","Serviço","10.2.0.2.","AGETOP",41140,"REGULARIZAÇÃO DO TERRENO SEM APILOAMENTO COM TRANSPORTE MANUAL DA TERRA ESCAVADA ","m2    ",583.85,1,null,null,null,null,null,""]
[2,2,2,11,10,3,0,0,{"$f":"IF(AND($C1255<=4,$C1255<>0),0,IF(AND($C1255=\"S\",$Y1255>0),OFFSET(I1255,-1,0)+1,OFFSET(I1255,-1,0)))","v":0},73,11,"F","Nível 2","Nível 2","10.3.","AGETOP",null,"FUNDAÇÕES E SONDAGENS","-",null,1,null,null,null,null,null,""]
["S",2,"S",0,10,3,0,0,{"$f":"IF(AND($C1256<=4,$C1256<>0),0,IF(AND($C1256=\"S\",$Y1256>0),OFFSET(I1256,-1,0)+1,OFFSET(I1256,-1,0)))","v":0},0,0,"F","Serviço","Serviço","10.3.0.1.","AGETOP",50302,"ESTACA A TRADO DIAM.30 CM SEM FERRO","M     ",90,1,null,null,null,null,null,""]
["S",2,"S",0,10,3,0,0,{"$f":"IF(AND($C1257<=4,$C1257<>0),0,IF(AND($C1257=\"S\",$Y1257>0),OFFSET(I1257,-1,0)+1,OFFSET(I1257,-1,0)))","v":0},0,0,"F","Serviço","Serviço","10.3.0.2.","AGETOP",50901,"ESCAVACAO MANUAL DE VALAS (SAPATAS/BLOCOS)","m3    ",21.4,1,null,null,null,null,null,""]
["S",2,"S",0,10,3,0,0,{"$f":"IF(AND($C1258<=4,$C1258<>0),0,IF(AND($C1258=\"S\",$Y1258>0),OFFSET(I1258,-1,0)+1,OFFSET(I1258,-1,0)))","v":0},0,0,"F","Serviço","Serviço","10.3.0.3.","AGETOP",50902,"APILOAMENTO (BLOCOS/SAPATAS)","m2    ",9.9,1,null,null,null,null,null,""]
["S",2,"S",0,10,3,0,0,{"$f":"IF(AND($C1259<=4,$C1259<>0),0,IF(AND($C1259=\"S\",$Y1259>0),OFFSET(I1259,-1,0)+1,OFFSET(I1259,-1,0)))","v":0},0,0,"F","Serviço","Serviço","10.3.0.4.","AGETOP",50903,"REATERRO C/APILOAMENTO (BLOCOS/SAPATAS)","m3    ",9.5299999999999994,1,null,null,null,null,null,""]
["S",2,"S",0,10,3,0,0,{"$f":"IF(AND($C1260<=4,$C1260<>0),0,IF(AND($C1260=\"S\",$Y1260>0),OFFSET(I1260,-1,0)+1,OFFSET(I1260,-1,0)))","v":0},0,0,"F","Serviço","Serviço","10.3.0.5.","AGETOP",51009,"FORMA TABUA PINHO P/FUNDACOES U=3V - (OBRAS CIVIS)","m2    ",42,1,null,null,null,null,null,""]
["S",2,"S",0,10,3,0,0,{"$f":"IF(AND($C1261<=4,$C1261<>0),0,IF(AND($C1261=\"S\",$Y1261>0),OFFSET(I1261,-1,0)+1,OFFSET(I1261,-1,0)))","v":0},0,0,"F","Serviço","Serviço","10.3.0.6.","AGETOP",52003,"ACO CA-50A - 6,3 MM (1/4\") - (OBRAS CIVIS)","Kg    ",117.2,1,null,null,null,null,null,""]
["S",2,"S",0,10,3,0,0,{"$f":"IF(AND($C1262<=4,$C1262<>0),0,IF(AND($C1262=\"S\",$Y1262>0),OFFSET(I1262,-1,0)+1,OFFSET(I1262,-1,0)))","v":0},0,0,"F","Serviço","Serviço","10.3.0.7.","AGETOP",52004,"ACO CA 50-A - 8,0 MM (5/16\") - (OBRAS CIVIS)","Kg    ",218.3,1,null,null,null,null,null,""]
["S",2,"S",0,10,3,0,0,{"$f":"IF(AND($C1263<=4,$C1263<>0),0,IF(AND($C1263=\"S\",$Y1263>0),OFFSET(I1263,-1,0)+1,OFFSET(I1263,-1,0)))","v":0},0,0,"F","Serviço","Serviço","10.3.0.8.","AGETOP",52014,"ACO CA-60 - 5,0 MM - (OBRAS CIVIS)","Kg    ",83.3,1,null,null,null,null,null,""]
["S",2,"S",0,10,3,0,0,{"$f":"IF(AND($C1264<=4,$C1264<>0),0,IF(AND($C1264=\"S\",$Y1264>0),OFFSET(I1264,-1,0)+1,OFFSET(I1264,-1,0)))","v":0},0,0,"F","Serviço","Serviço","10.3.0.9.","AGETOP",51017,"PREPARO COM BETONEIRA E TRANSPORTE MANUAL DE CONCRETO FCK-20  - (O.C.)","m3    ",11.1,1,null,null,null,null,null,""]
["S",2,"S",0,10,3,0,0,{"$f":"IF(AND($C1265<=4,$C1265<>0),0,IF(AND($C1265=\"S\",$Y1265>0),OFFSET(I1265,-1,0)+1,OFFSET(I1265,-1,0)))","v":0},0,0,"F","Serviço","Serviço","10.3.0.10.","AGETOP",51026,"LANÇAMENTO/APLICAÇÃO/ADENSAMENTO DE CONCRETO EM FUNDAÇÃO- (O.C.)","m3    ",11.1,1,null,null,null,null,null,""]
[2,2,2,9,10,4,0,0,{"$f":"IF(AND($C1266<=4,$C1266<>0),0,IF(AND($C1266=\"S\",$Y1266>0),OFFSET(I1266,-1,0)+1,OFFSET(I1266,-1,0)))","v":0},62,9,"F","Nível 2","Nível 2","10.4.","AGETOP",null,"ESTRUTURA","-",null,1,null,null,null,null,null,""]
["S",2,"S",0,10,4,0,0,{"$f":"IF(AND($C1267<=4,$C1267<>0),0,IF(AND($C1267=\"S\",$Y1267>0),OFFSET(I1267,-1,0)+1,OFFSET(I1267,-1,0)))","v":0},0,0,"F","Serviço","Serviço","10.4.0.1.","AGETOP",60191,"FORMA DE TABUA CINTA BALDRAME U=8 VEZES","m2    ",114.96,1,null,null,null,null,null,""]
["S",2,"S",0,10,4,0,0,{"$f":"IF(AND($C1268<=4,$C1268<>0),0,IF(AND($C1268=\"S\",$Y1268>0),OFFSET(I1268,-1,0)+1,OFFSET(I1268,-1,0)))","v":0},0,0,"F","Serviço","Serviço","10.4.0.2.","AGETOP",60207,"FORMA CH.COMPENSADA 12MM-VIGA/PILAR U=2V - (OBRAS CIVIS","m2    ",202.37,1,null,null,null,null,null,""]
["S",2,"S",0,10,4,0,0,{"$f":"IF(AND($C1269<=4,$C1269<>0),0,IF(AND($C1269=\"S\",$Y1269>0),OFFSET(I1269,-1,0)+1,OFFSET(I1269,-1,0)))","v":0},0,0,"F","Serviço","Serviço","10.4.0.3.","AGETOP",60305,"ACO CA-50A - 10,0 MM (3/8\") - (OBRAS CIVIS)","Kg    ",896.3,1,null,null,null,null,null,""]
["S",2,"S",0,10,4,0,0,{"$f":"IF(AND($C1270<=4,$C1270<>0),0,IF(AND($C1270=\"S\",$Y1270>0),OFFSET(I1270,-1,0)+1,OFFSET(I1270,-1,0)))","v":0},0,0,"F","Serviço","Serviço","10.4.0.4.","AGETOP",60304,"ACO CA-50 A - 8,0 MM (5/16\") - (OBRAS CIVIS)","Kg    ",382.1,1,null,null,null,null,null,""]
["S",2,"S",0,10,4,0,0,{"$f":"IF(AND($C1271<=4,$C1271<>0),0,IF(AND($C1271=\"S\",$Y1271>0),OFFSET(I1271,-1,0)+1,OFFSET(I1271,-1,0)))","v":0},0,0,"F","Serviço","Serviço","10.4.0.5.","AGETOP",60303,"ACO CA-50-A - 6,3 MM (1/4\") - (OBRAS CIVIS)","Kg    ",112.8,1,null,null,null,null,null,""]
["S",2,"S",0,10,4,0,0,{"$f":"IF(AND($C1272<=4,$C1272<>0),0,IF(AND($C1272=\"S\",$Y1272>0),OFFSET(I1272,-1,0)+1,OFFSET(I1272,-1,0)))","v":0},0,0,"F","Serviço","Serviço","10.4.0.6.","AGETOP",60314,"ACO CA - 60 - 5,0 MM - (OBRAS CIVIS)","Kg    ",304.10000000000002,1,null,null,null,null,null,""]
["S",2,"S",0,10,4,0,0,{"$f":"IF(AND($C1273<=4,$C1273<>0),0,IF(AND($C1273=\"S\",$Y1273>0),OFFSET(I1273,-1,0)+1,OFFSET(I1273,-1,0)))","v":0},0,0,"F","Serviço","Serviço","10.4.0.7.","AGETOP",60507,"PREPARO COM BETONEIRA E TRANSPORTE MANUAL DE CONCRETO FCK-20 - (O.C.)","m3    ",18.98,1,null,null,null,null,null,""]
["S",2,"S",0,10,4,0,0,{"$f":"IF(AND($C1274<=4,$C1274<>0),0,IF(AND($C1274=\"S\",$Y1274>0),OFFSET(I1274,-1,0)+1,OFFSET(I1274,-1,0)))","v":0},0,0,"F","Serviço","Serviço","10.4.0.8.","AGETOP",60801,"LANÇAMENTO/APLICAÇÃO/ADENSAMENTO MANUAL DE CONCRETO - (OBRAS CIVIS)","m3    ",18.98,1,null,null,null,null,null,""]
[2,2,2,28,10,5,0,0,{"$f":"IF(AND($C1275<=4,$C1275<>0),0,IF(AND($C1275=\"S\",$Y1275>0),OFFSET(I1275,-1,0)+1,OFFSET(I1275,-1,0)))","v":0},53,28,"F","Nível 2","Nível 2","10.5.","AGETOP",null,"INSTALAÇÕES ELÉTRICAS","-",null,1,null,null,null,null,null,""]
["S",2,"S",0,10,5,0,0,{"$f":"IF(AND($C1276<=4,$C1276<>0),0,IF(AND($C1276=\"S\",$Y1276>0),OFFSET(I1276,-1,0)+1,OFFSET(I1276,-1,0)))","v":0},0,0,"F","Serviço","Serviço","10.5.0.1.","AGETOP",70351,"BRACADEIRA METALICA TIPO \"U\" DIAM. 3/4\"","Un    ",60,1,null,null,null,null,null,""]
["S",2,"S",0,10,5,0,0,{"$f":"IF(AND($C1277<=4,$C1277<>0),0,IF(AND($C1277=\"S\",$Y1277>0),OFFSET(I1277,-1,0)+1,OFFSET(I1277,-1,0)))","v":0},0,0,"F","Serviço","Serviço","10.5.0.2.","AGETOP",70421,"BUCHA E ARRUELA METALICA DIAM. 3/4\"","PR    ",12,1,null,null,null,null,null,""]
["S",2,"S",0,10,5,0,0,{"$f":"IF(AND($C1278<=4,$C1278<>0),0,IF(AND($C1278=\"S\",$Y1278>0),OFFSET(I1278,-1,0)+1,OFFSET(I1278,-1,0)))","v":0},0,0,"F","Serviço","Serviço","10.5.0.3.","AGETOP",70422,"BUCHA E ARRUELA METALICA DIAM. 1\"","PR    ",1,1,null,null,null,null,null,""]
["S",2,"S",0,10,5,0,0,{"$f":"IF(AND($C1279<=4,$C1279<>0),0,IF(AND($C1279=\"S\",$Y1279>0),OFFSET(I1279,-1,0)+1,OFFSET(I1279,-1,0)))","v":0},0,0,"F","Serviço","Serviço","10.5.0.4.","AGETOP",70582,"CABO PVC (70ºC) 1 KV No. 4 MM2","M     ",80,1,null,null,null,null,null,""]
["S",2,"S",0,10,5,0,0,{"$f":"IF(AND($C1280<=4,$C1280<>0),0,IF(AND($C1280=\"S\",$Y1280>0),OFFSET(I1280,-1,0)+1,OFFSET(I1280,-1,0)))","v":0},0,0,"F","Serviço","Serviço","10.5.0.5.","AGETOP",70634,"CAIXA DE PASSAGEM -  TAMPA EM CONCRETO ARMADO 25 MPA E=5CM","m2    ",0.25,1,null,null,null,null,null,""]
["S",2,"S",0,10,5,0,0,{"$f":"IF(AND($C1281<=4,$C1281<>0),0,IF(AND($C1281=\"S\",$Y1281>0),OFFSET(I1281,-1,0)+1,OFFSET(I1281,-1,0)))","v":0},0,0,"F","Serviço","Serviço","10.5.0.6.","AGETOP",70691,"CAIXA METALICA RET. 4\" X 2\" X 2\"","Un    ",4,1,null,null,null,null,null,""]
["S",2,"S",0,10,5,0,0,{"$f":"IF(AND($C1282<=4,$C1282<>0),0,IF(AND($C1282=\"S\",$Y1282>0),OFFSET(I1282,-1,0)+1,OFFSET(I1282,-1,0)))","v":0},0,0,"F","Serviço","Serviço","10.5.0.7.","AGETOP",70714,"CAIXA DE PASSAGEM 50X50X80CM FUNDO DE BRITA SEM TAMPA","Un    ",1,1,null,null,null,null,null,""]
["S",2,"S",0,10,5,0,0,{"$f":"IF(AND($C1283<=4,$C1283<>0),0,IF(AND($C1283=\"S\",$Y1283>0),OFFSET(I1283,-1,0)+1,OFFSET(I1283,-1,0)))","v":0},0,0,"F","Serviço","Serviço","10.5.0.8.","AGETOP",71141,"CURVA DE 90 GRAUS DE PVC RIGIDO DIAM. 3/4\"","Un    ",4,1,null,null,null,null,null,""]
["S",2,"S",0,10,5,0,0,{"$f":"IF(AND($C1284<=4,$C1284<>0),0,IF(AND($C1284=\"S\",$Y1284>0),OFFSET(I1284,-1,0)+1,OFFSET(I1284,-1,0)))","v":0},0,0,"F","Serviço","Serviço","10.5.0.9.","AGETOP",71142,"CURVA DE 90 GRAUS DE PVC RIGIDO DIAM. 1\"","Un    ",1,1,null,null,null,null,null,""]
["S",2,"S",0,10,5,0,0,{"$f":"IF(AND($C1285<=4,$C1285<>0),0,IF(AND($C1285=\"S\",$Y1285>0),OFFSET(I1285,-1,0)+1,OFFSET(I1285,-1,0)))","v":0},0,0,"F","Serviço","Serviço","10.5.0.10.","AGETOP",71171,"DISJUNTOR MONOPOLAR DE 10 A 32-A","Un    ",3,1,null,null,null,null,null,""]
["S",2,"S",0,10,5,0,0,{"$f":"IF(AND($C1286<=4,$C1286<>0),0,IF(AND($C1286=\"S\",$Y1286>0),OFFSET(I1286,-1,0)+1,OFFSET(I1286,-1,0)))","v":0},0,0,"F","Serviço","Serviço","10.5.0.11.","AGETOP",71173,"DISJUNTOR TRIPOLAR DE 10 A 35-A","Un    ",1,1,null,null,null,null,null,""]
["S",2,"S",0,10,5,0,0,{"$f":"IF(AND($C1287<=4,$C1287<>0),0,IF(AND($C1287=\"S\",$Y1287>0),OFFSET(I1287,-1,0)+1,OFFSET(I1287,-1,0)))","v":0},0,0,"F","Serviço","Serviço","10.5.0.12.","AGETOP",71190,"ELETROCALHA CH.Aº PRE ZN. FOGO \"C\" C/ABAS 50X50 MM S/TAMPA","M     ",28,1,null,null,null,null,null,""]
["S",2,"S",0,10,5,0,0,{"$f":"IF(AND($C1288<=4,$C1288<>0),0,IF(AND($C1288=\"S\",$Y1288>0),OFFSET(I1288,-1,0)+1,OFFSET(I1288,-1,0)))","v":0},{"$f":"IF(OR($C1288=\"S\",$C1288=0),0,MATCH(0,OFFSET($D1288,1,$C1288,ROW($C$1328)-ROW($C1288)),0))","v":0},{"$f":"IF(OR($C1288=\"S\",$C1288=0),0,MATCH(OFFSET($D1288,0,$C1288)+1,OFFSET($D1288,1,$C1288,ROW($C$1328)-ROW($C1288)),0))","v":0},"F","Serviço","Serviço","10.5.0.13.","AGETOP",71202,"ELETRODUTO DE PVC RIGIDO DIAMETRO 1\"","M     ",15,1,null,null,null,null,null,""]
["S",2,"S",0,10,5,0,0,{"$f":"IF(AND($C1289<=4,$C1289<>0),0,IF(AND($C1289=\"S\",$Y1289>0),OFFSET(I1289,-1,0)+1,OFFSET(I1289,-1,0)))","v":0},0,0,"F","Serviço","Serviço","10.5.0.14.","AGETOP",71194,"ELETRODUTO PVC FLEXÍVEL - MANGUEIRA CORRUGADA LEVE - DIAM. 25MM","M     ",120,1,null,null,null,null,null,""]
["S",2,"S",0,10,5,0,0,{"$f":"IF(AND($C1290<=4,$C1290<>0),0,IF(AND($C1290=\"S\",$Y1290>0),OFFSET(I1290,-1,0)+1,OFFSET(I1290,-1,0)))","v":0},0,0,"F","Serviço","Serviço","10.5.0.15.","AGETOP",71291,"FIO ISOLADO PVC 750 V, No. 2,5 MM2","M     ",360,1,null,null,null,null,null,""]
["S",2,"S",0,10,5,0,0,{"$f":"IF(AND($C1291<=4,$C1291<>0),0,IF(AND($C1291=\"S\",$Y1291>0),OFFSET(I1291,-1,0)+1,OFFSET(I1291,-1,0)))","v":0},0,0,"F","Serviço","Serviço","10.5.0.16.","AGETOP",71321,"FITA DE AUTO FUSAO, ROLO E 10,00 MM","Un    ",1,1,null,null,null,null,null,""]
["S",2,"S",0,10,5,0,0,{"$f":"IF(AND($C1292<=4,$C1292<>0),0,IF(AND($C1292=\"S\",$Y1292>0),OFFSET(I1292,-1,0)+1,OFFSET(I1292,-1,0)))","v":0},0,0,"F","Serviço","Serviço","10.5.0.17.","AGETOP",71450,"INTERRUPTOR DIFERENCIAL RESIDUAL (D.R.) BIPOLAR DE 25A-30mA","Un    ",1,1,null,null,null,null,null,""]
["S",2,"S",0,10,5,0,0,{"$f":"IF(AND($C1293<=4,$C1293<>0),0,IF(AND($C1293=\"S\",$Y1293>0),OFFSET(I1293,-1,0)+1,OFFSET(I1293,-1,0)))","v":0},0,0,"F","Serviço","Serviço","10.5.0.18.","AGETOP",71522,"LAMPADA A VAPOR MERCURIO 400 W","Un    ",10,1,null,null,null,null,null,""]
["S",2,"S",0,10,5,0,0,{"$f":"IF(AND($C1294<=4,$C1294<>0),0,IF(AND($C1294=\"S\",$Y1294>0),OFFSET(I1294,-1,0)+1,OFFSET(I1294,-1,0)))","v":0},0,0,"F","Serviço","Serviço","10.5.0.19.","AGETOP",71660,"LUMINÁRIA CIRCULAR COM VIDRO PARA QUADRA ATÉ 400 W - BASE E-40","Un    ",10,1,null,null,null,null,null,""]
["S",2,"S",0,10,5,0,0,{"$f":"IF(AND($C1295<=4,$C1295<>0),0,IF(AND($C1295=\"S\",$Y1295>0),OFFSET(I1295,-1,0)+1,OFFSET(I1295,-1,0)))","v":0},0,0,"F","Serviço","Serviço","10.5.0.20.","AGETOP",71742,"LUVA PVC ROSQUEAVEL DIAMETRO 1\"","Un    ",5,1,null,null,null,null,null,""]
["S",2,"S",0,10,5,0,0,{"$f":"IF(AND($C1296<=4,$C1296<>0),0,IF(AND($C1296=\"S\",$Y1296>0),OFFSET(I1296,-1,0)+1,OFFSET(I1296,-1,0)))","v":0},0,0,"F","Serviço","Serviço","10.5.0.21.","AGETOP",70929,"CONDULETE METÁLICO - CAIXA COM 5 ENTRADAS ","un    ",10,1,null,null,null,null,null,""]
["S",2,"S",0,10,5,0,0,{"$f":"IF(AND($C1297<=4,$C1297<>0),0,IF(AND($C1297=\"S\",$Y1297>0),OFFSET(I1297,-1,0)+1,OFFSET(I1297,-1,0)))","v":0},0,0,"F","Serviço","Serviço","10.5.0.22.","AGETOP",70930,"CONDULETE METÁLICO - ADAPTADOR DE SAÍDA 3/4\" ","un    ",10,1,null,null,null,null,null,""]
["S",2,"S",0,10,5,0,0,{"$f":"IF(AND($C1298<=4,$C1298<>0),0,IF(AND($C1298=\"S\",$Y1298>0),OFFSET(I1298,-1,0)+1,OFFSET(I1298,-1,0)))","v":0},0,0,"F","Serviço","Serviço","10.5.0.23.","AGETOP",72190,"QUADRO DE DISTRIBUIÇÃO DE EMBUTIR METÁLICO CB-24E - 150A","Un    ",1,1,null,null,null,null,null,""]
["S",2,"S",0,10,5,0,0,{"$f":"IF(AND($C1299<=4,$C1299<>0),0,IF(AND($C1299=\"S\",$Y1299>0),OFFSET(I1299,-1,0)+1,OFFSET(I1299,-1,0)))","v":0},0,0,"F","Serviço","Serviço","10.5.0.24.","AGETOP",72250,"REATOR EXTERNO V. MERCÚRIO  AFP 1 X 400 W","Un    ",10,1,null,null,null,null,null,""]
["S",2,"S",0,10,5,0,0,{"$f":"IF(AND($C1300<=4,$C1300<>0),0,IF(AND($C1300=\"S\",$Y1300>0),OFFSET(I1300,-1,0)+1,OFFSET(I1300,-1,0)))","v":0},0,0,"F","Serviço","Serviço","10.5.0.25.","AGETOP",72395,"TAMPA CEGA PARA CONDULETE METÁLICO","Un    ",10,1,null,null,null,null,null,""]
["S",2,"S",0,10,5,0,0,{"$f":"IF(AND($C1301<=4,$C1301<>0),0,IF(AND($C1301=\"S\",$Y1301>0),OFFSET(I1301,-1,0)+1,OFFSET(I1301,-1,0)))","v":0},0,0,"F","Serviço","Serviço","10.5.0.26.","AGETOP",72578,"TOMADA HEXAGONAL 2P + T - 10A - 250V","Un    ",4,1,null,null,null,null,null,""]
["S",2,"S",0,10,5,0,0,{"$f":"IF(AND($C1302<=4,$C1302<>0),0,IF(AND($C1302=\"S\",$Y1302>0),OFFSET(I1302,-1,0)+1,OFFSET(I1302,-1,0)))","v":0},0,0,"F","Serviço","Serviço","10.5.0.27.","AGETOP",71745,"LUVA PVC ROSQUEAVEL DIAMETRO 2\"","Un    ",4,1,null,null,null,null,null,""]
[2,2,2,4,10,6,0,0,{"$f":"IF(AND($C1303<=4,$C1303<>0),0,IF(AND($C1303=\"S\",$Y1303>0),OFFSET(I1303,-1,0)+1,OFFSET(I1303,-1,0)))","v":0},25,4,"F","Nível 2","Nível 2","10.6.","AGETOP",null,"ALVENARIAS E DIVISÓRIAS","-",null,1,null,null,null,null,null,""]
["S",2,"S",0,10,6,0,0,{"$f":"IF(AND($C1304<=4,$C1304<>0),0,IF(AND($C1304=\"S\",$Y1304>0),OFFSET(I1304,-1,0)+1,OFFSET(I1304,-1,0)))","v":0},0,0,"F","Serviço","Serviço","10.6.0.1.","AGETOP",100102,"ALVENARIA DE TIJOLO COMUM 1/2 VEZ - ARG. (1CI : 2CH : 8ARML)","m2    ",27.2,1,null,null,null,null,null,""]
["S",2,"S",0,10,6,0,0,{"$f":"IF(AND($C1305<=4,$C1305<>0),0,IF(AND($C1305=\"S\",$Y1305>0),OFFSET(I1305,-1,0)+1,OFFSET(I1305,-1,0)))","v":0},0,0,"F","Serviço","Serviço","10.6.0.2.","AGETOP",100201,"ALVENARIA DE TIJOLO FURADO 1/2 VEZ - 9 x 19 x 19 - ARG. (1CALH:4ARML+100KG DE CI/M3)","m2    ",71.5,1,null,null,null,null,null,""]
["S",2,"S",0,10,6,0,0,{"$f":"IF(AND($C1306<=4,$C1306<>0),0,IF(AND($C1306=\"S\",$Y1306>0),OFFSET(I1306,-1,0)+1,OFFSET(I1306,-1,0)))","v":0},0,0,"F","Serviço","Serviço","10.6.0.3.","AGETOP",100501,"ELEMENTO VAZADO DE CONCRETO","m2    ",93.9,1,null,null,null,null,null,""]
[2,2,2,2,10,7,0,0,{"$f":"IF(AND($C1307<=4,$C1307<>0),0,IF(AND($C1307=\"S\",$Y1307>0),OFFSET(I1307,-1,0)+1,OFFSET(I1307,-1,0)))","v":0},21,2,"F","Nível 2","Nível 2","10.7.","AGETOP",null,"IMPERMEABILIZAÇÃO","-",null,1,null,null,null,null,null,""]
["S",2,"S",0,10,7,0,0,{"$f":"IF(AND($C1308<=4,$C1308<>0),0,IF(AND($C1308=\"S\",$Y1308>0),OFFSET(I1308,-1,0)+1,OFFSET(I1308,-1,0)))","v":0},0,0,"F","Serviço","Serviço","10.7.0.1.","AGETOP",120902,"IMPERMEABILIZACAO VIGAS BALDRAMES E=2,0 CM","m2    ",54,1,null,null,null,null,null,""]
[2,2,2,2,10,8,0,0,{"$f":"IF(AND($C1309<=4,$C1309<>0),0,IF(AND($C1309=\"S\",$Y1309>0),OFFSET(I1309,-1,0)+1,OFFSET(I1309,-1,0)))","v":0},19,2,"F","Nível 2","Nível 2","10.8.","AGETOP",null,"ESTRUTURAS METÁLICAS","-",null,1,null,null,null,null,null,""]
["S",2,"S",0,10,8,0,0,{"$f":"IF(AND($C1310<=4,$C1310<>0),0,IF(AND($C1310=\"S\",$Y1310>0),OFFSET(I1310,-1,0)+1,OFFSET(I1310,-1,0)))","v":0},0,0,"F","Serviço","Serviço","10.8.0.1.","AGETOP",150103,"ESTRUTURA METÁLICA CONVENCIONAL EM AÇO DO TIPO USI SAC-300 COM FUNDO ANTICORROSIVO","Kg    ",4830.01,1,null,null,null,null,null,""]
[2,2,2,2,10,9,0,0,{"$f":"IF(AND($C1311<=4,$C1311<>0),0,IF(AND($C1311=\"S\",$Y1311>0),OFFSET(I1311,-1,0)+1,OFFSET(I1311,-1,0)))","v":0},17,2,"F","Nível 2","Nível 2","10.9.","AGETOP",null,"COBERTURAS","-",null,1,null,null,null,null,null,""]
["S",2,"S",0,10,9,0,0,{"$f":"IF(AND($C1312<=4,$C1312<>0),0,IF(AND($C1312=\"S\",$Y1312>0),OFFSET(I1312,-1,0)+1,OFFSET(I1312,-1,0)))","v":0},0,0,"F","Serviço","Serviço","10.9.0.1.","AGETOP",160969,"COBERTURA COM TELHA CHAPA GALVANIZADA TRAPEZOIDAL 0,43 MM COM ACESSÓRIOS","m2    ",570.24,1,null,null,null,null,null,""]
[2,2,2,3,10,10,0,0,{"$f":"IF(AND($C1313<=4,$C1313<>0),0,IF(AND($C1313=\"S\",$Y1313>0),OFFSET(I1313,-1,0)+1,OFFSET(I1313,-1,0)))","v":0},15,3,"F","Nível 2","Nível 2","10.10.","AGETOP",null,"REVESTIMENTO DE PAREDE","-",null,1,null,null,null,null,null,""]
["S",2,"S",0,10,10,0,0,{"$f":"IF(AND($C1314<=4,$C1314<>0),0,IF(AND($C1314=\"S\",$Y1314>0),OFFSET(I1314,-1,0)+1,OFFSET(I1314,-1,0)))","v":0},0,0,"F","Serviço","Serviço","10.10.0.1.","AGETOP",200101,"CHAPISCO COMUM","m2    ",98.7,1,null,null,null,null,null,""]
["S",2,"S",0,10,10,0,0,{"$f":"IF(AND($C1315<=4,$C1315<>0),0,IF(AND($C1315=\"S\",$Y1315>0),OFFSET(I1315,-1,0)+1,OFFSET(I1315,-1,0)))","v":0},0,0,"F","Serviço","Serviço","10.10.0.2.","AGETOP",200499,"REBOCO PAULISTA A-14 (1CALH:4ARMLC+100kgCI/M3)","m2    ",98.7,1,null,null,null,null,null,""]
[2,2,2,4,10,11,0,0,{"$f":"IF(AND($C1316<=4,$C1316<>0),0,IF(AND($C1316=\"S\",$Y1316>0),OFFSET(I1316,-1,0)+1,OFFSET(I1316,-1,0)))","v":0},12,4,"F","Nível 2","Nível 2","10.11.","AGETOP",null,"REVESTIMENTO DE PISO","-",null,1,null,null,null,null,null,""]
["S",2,"S",0,10,11,0,0,{"$f":"IF(AND($C1317<=4,$C1317<>0),0,IF(AND($C1317=\"S\",$Y1317>0),OFFSET(I1317,-1,0)+1,OFFSET(I1317,-1,0)))","v":0},0,0,"F","Serviço","Serviço","10.11.0.1.","AGETOP",220061,"PISO LAMINADO COM CONCRETO USINADO 20MPA E=7 CM  ","m2    ",403.5,1,null,null,null,null,null,""]
["S",2,"S",0,10,11,0,0,{"$f":"IF(AND($C1318<=4,$C1318<>0),0,IF(AND($C1318=\"S\",$Y1318>0),OFFSET(I1318,-1,0)+1,OFFSET(I1318,-1,0)))","v":0},0,0,"F","Serviço","Serviço","10.11.0.2.","AGETOP",220100,"PASSEIO PROTECAO EM CONC.DESEMPEN.5 CM 1:2,5:3,5 ( INCLUSO ESPELHO DE 30CM/ESCAVAÇÃO/REATERRO/APILOAMENTO/ATERRO INTERNO)","m2    ",74.44,1,null,null,null,null,null,""]
["S",2,"S",0,10,11,0,0,{"$f":"IF(AND($C1319<=4,$C1319<>0),0,IF(AND($C1319=\"S\",$Y1319>0),OFFSET(I1319,-1,0)+1,OFFSET(I1319,-1,0)))","v":0},0,0,"F","Serviço","Serviço","10.11.0.3.","AGETOP",220102,"PISO CONCRETO DESEMPENADO ESPESSURA = 5 CM  1:2,5:3,5","m2    ",27.74,1,null,null,null,null,null,""]
[2,2,2,4,10,12,0,0,{"$f":"IF(AND($C1320<=4,$C1320<>0),0,IF(AND($C1320=\"S\",$Y1320>0),OFFSET(I1320,-1,0)+1,OFFSET(I1320,-1,0)))","v":0},8,4,"F","Nível 2","Nível 2","10.12.","AGETOP",null,"PINTURA","-",null,1,null,null,null,null,null,""]
["S",2,"S",0,10,12,0,0,{"$f":"IF(AND($C1321<=4,$C1321<>0),0,IF(AND($C1321=\"S\",$Y1321>0),OFFSET(I1321,-1,0)+1,OFFSET(I1321,-1,0)))","v":0},0,0,"F","Serviço","Serviço","10.12.0.1.","AGETOP",261000,"PINTURA LATEX ACRILICA 2 DEMAOS C/SELADOR","m2    ",98.7,1,null,null,null,null,null,""]
["S",2,"S",0,10,12,0,0,{"$f":"IF(AND($C1322<=4,$C1322<>0),0,IF(AND($C1322=\"S\",$Y1322>0),OFFSET(I1322,-1,0)+1,OFFSET(I1322,-1,0)))","v":0},0,0,"F","Serviço","Serviço","10.12.0.2.","AGETOP",261609,"PINTURA ESMALTE ALQUIDICO ESTR.METALICA 2 DEMAOS","m2    ",251.2,1,null,null,null,null,null,""]
["S",2,"S",0,10,12,0,0,{"$f":"IF(AND($C1323<=4,$C1323<>0),0,IF(AND($C1323=\"S\",$Y1323>0),OFFSET(I1323,-1,0)+1,OFFSET(I1323,-1,0)))","v":0},0,0,"F","Serviço","Serviço","10.12.0.3.","AGETOP",261700,"DEMARC.QUADRA/VAGAS TINTA POLIESPORTIVA","m     ",72,1,null,null,null,null,null,""]
[2,2,2,4,10,13,0,0,{"$f":"IF(AND($C1324<=4,$C1324<>0),0,IF(AND($C1324=\"S\",$Y1324>0),OFFSET(I1324,-1,0)+1,OFFSET(I1324,-1,0)))","v":0},4,{"$error":"#N/A"},"F","Nível 2","Nível 2","10.13.","AGETOP",null,"DIVERSOS","-",null,1,null,null,null,null,null,""]
["S",2,"S",0,10,13,0,0,{"$f":"IF(AND($C1325<=4,$C1325<>0),0,IF(AND($C1325=\"S\",$Y1325>0),OFFSET(I1325,-1,0)+1,OFFSET(I1325,-1,0)))","v":0},0,0,"F","Serviço","Serviço","10.13.0.1.","AGETOP",270501,"LIMPEZA FINAL DE OBRA - (OBRAS CIVIS)","m2    ",432.77,1,null,null,null,null,null,""]
["S",2,"S",0,10,13,0,0,{"$f":"IF(AND($C1326<=4,$C1326<>0),0,IF(AND($C1326=\"S\",$Y1326>0),OFFSET(I1326,-1,0)+1,OFFSET(I1326,-1,0)))","v":0},0,0,"F","Serviço","Serviço","10.13.0.2.","AGETOP",270621,"ALAMBRADO EM TUBO INDUSTRIAL 2\"#2,28 E TELA MALHA 4\" FIO 12 (QUADRA ESPORTE EXISTENTE) SEM PINTURA","m2    ",125.6,1,null,null,null,null,null,""]
["S",2,"S",0,10,13,0,0,{"$f":"IF(AND($C1327<=4,$C1327<>0),0,IF(AND($C1327=\"S\",$Y1327>0),OFFSET(I1327,-1,0)+1,OFFSET(I1327,-1,0)))","v":0},0,0,"F","Serviço","Serviço","10.13.0.3.","AGETOP",271103,"CONJUNTO PARA VOLEIBOL EM FERRO GALVANIZADO COM PINTURA (2 SUPORTES)","CJ    ",1,1,null,null,null,null,null,""]
[-1,null,-1,null,0,0,0,0,0,null,null,"F"]
[null,null,null,null,null,null,null,null,null,null,null,"F",null,null,null,null,null,"OBS: OS QUANTITATIVOS DE MATERIAIS  DAS INSTALAÇÕES HIDROSSANITÁRIAS, ELÉTRICAS E ESPECIAIS SÃO FORNECIDOS PELOS PROFISSIONAIS RESPONSÁVEIS PELOS RESPECTIVOS PROJETOS.",null,null,null,null,null,"VALOR TOTAL"]
[null,null,null,null,null,null,null,null,null,null,null,"F",null,null,null,null,null,null,null,null,null,null,null,"VALOR BDI (25,39%)"]
[null,null,null,null,null,null,null,null,null,null,null,"F",null,null,null,null,null,null,null,null,null,null,null,"TOTAL ORÇAMENTO"]
[null,null,null,null,null,null,null,null,null,null,null,"F"]
[null,null,null,null,null,null,null,null,null,null,null,"F",null,null,null,null,null,null,null,null,null,null,null,"CUSTO POR M2 ³"]
[null,null,null,null,null,null,null,null,null,null,null,"F",null,null,null,null,null,null,null,null,null,null,null,"MATERIAL S/ BDI"]
[null,null,null,null,null,null,null,null,null,null,null,"F",null,null,null,null,null,null,null,null,null,null,null,"MÃO DE OBRA S/ BDI"]
[null,null,null,null,null,null,null,null,null,null,null,"F"]
[null,null,null,null,null,null,null,null,null,null,null,"F",null,null,null,null,"(1) Conforme previsto pelo DECRETO Nº 7.983, DE 8 DE ABRIL DE 2013, os preços adotados são aqueles constantes dos sistemas de referência indicados. Justifica-se o uso dos preços destas composições de custos unitários devido ao seu valor ser menor à mediana de seus correspondentes na tabela SINAPI;"]
[null,null,null,null,null,null,null,null,null,null,null,"F",null,null,null,null,"(2) Optou-se pelo uso das composições de custos da AGETOP para itens não presentes na SINAPI;"]
[null,null,null,null,null,null,null,null,null,null,null,"F",null,null,null,null,"(3) Para itens da AGETOP, os vidros não estão inclusos nas esquadrias e já foram considerados os custos de contramarco para as esquadrias de alumínio;"]
[null,null,null,null,null,null,null,null,null,null,null,"F",null,null,null,null,"(4) Nos casos em que houver execução de granitina e omissão do item AGETOP 221102, considerou-se que o quantitativo para o rodapé, de altura igual a 7cm, foi incorporado na área de piso;"]
[null,null,null,null,null,null,null,null,null,null,null,"F",null,null,null,null,"(5) O custo unitário aproximado por metro quadrado é calculado dividindo-se o valor total do orçamento pela área total de construção."]
[null,null,null,null,null,null,null,null,null,null,null,"F"]
[null,null,null,null,null,null,null,null,null,null,null,"F"]
[]
[null,null,null,null,null,null,null,null,null,null,null,null,null,null,"SOMATÓRIO DE SERVIÇOS"]
[null,null,null,null,null,null,null,null,null,null,null,null,null,null,"ITEM","DESCRIÇÃO DOS SERVIÇOS",null,null,"PREÇO SEM BDI",null,null,null,null,"PREÇO COM BDI",null,null,"PARTICIPAÇÃO ( % )"]
[null,null,null,null,null,null,null,null,null,null,null,null,null,null,"a.","SERVIÇOS PRELIMINARES",null,null,{"$f":"SUMIF($R$19:$R$1328,$P1347,$Z$19:$Z$1328)","v":0},null,null,null,null,{"$f":"ROUND(S1347*(1+BDI.Taxa),2)","v":0},null,null,{"$f":"IFERROR(ROUND($X1347*100/$Z$1331,2),0)","v":0}]
[null,null,null,null,null,null,null,null,null,null,null,null,null,null,"b.","TRANSPORTES",null,null,0,null,null,null,null,0,null,null,0]
[null,null,null,null,null,null,null,null,null,null,null,null,null,null,"c.","SERVIÇO EM TERRA",null,null,0,null,null,null,null,0,null,null,0]
[null,null,null,null,null,null,null,null,null,null,null,null,null,null,"d.","FUNDAÇÕES E SONDAGENS",null,null,0,null,null,null,null,0,null,null,0]
[null,null,null,null,null,null,null,null,null,null,null,null,null,null,"e.","ESTRUTURA",null,null,0,null,null,null,null,0,null,null,0]
[null,null,null,null,null,null,null,null,null,null,null,null,null,null,"f.","INSTALAÇÕES ELÉTRICAS",null,null,0,null,null,null,null,0,null,null,0]
[null,null,null,null,null,null,null,null,null,null,null,null,null,null,"g.","INSTALAÇÕES HIDROSSANITÁRIAS",null,null,0,null,null,null,null,0,null,null,0]
[null,null,null,null,null,null,null,null,null,null,null,null,null,null,"h","INSTALAÇÕES ESPECIAIS",null,null,0,null,null,null,null,0,null,null,0]
[null,null,null,null,null,null,null,null,null,null,null,null,null,null,"i.","ALVENARIAS E DIVISÓRIAS",null,null,0,null,null,null,null,0,null,null,0]
[null,null,null,null,null,null,null,null,null,null,null,null,null,null,"j.","ALVENARIA AUTO-PORTANTE",null,null,0,null,null,null,null,0,null,null,0]
[null,null,null,null,null,null,null,null,null,null,null,null,null,null,"k.","IMPERMEABILIZAÇÃO",null,null,0,null,null,null,null,0,null,null,0]
[null,null,null,null,null,null,null,null,null,null,null,null,null,null,"l.","ISOLAMENTO TÉRMICO E ACÚSTICO",null,null,0,null,null,null,null,0,null,null,0]
[null,null,null,null,null,null,null,null,null,null,null,null,null,null,"m.","ESTRUTURA DE MADEIRA",null,null,0,null,null,null,null,0,null,null,0]
[null,null,null,null,null,null,null,null,null,null,null,null,null,null,"n.","ESTRUTURAS METÁLICAS",null,null,0,null,null,null,null,0,null,null,0]
[null,null,null,null,null,null,null,null,null,null,null,null,null,null,"o.","COBERTURAS",null,null,0,null,null,null,null,0,null,null,0]
[null,null,null,null,null,null,null,null,null,null,null,null,null,null,"p.","ESQUADRIAS DE MADEIRA",null,null,0,null,null,null,null,0,null,null,0]
[null,null,null,null,null,null,null,null,null,null,null,null,null,null,"q.","ESQUADRIAS METÁLICAS",null,null,0,null,null,null,null,{"$f":"ROUND(S1363*(1+BDI.Taxa),2)","v":0},null,null,0]
[null,null,null,null,null,null,null,null,null,null,null,null,null,null,"r.","VIDROS",null,null,0,null,null,null,null,0,null,null,0]
[null,null,null,null,null,null,null,null,null,null,null,null,null,null,"s.","REVESTIMENTO DE PAREDE",null,null,0,null,null,null,null,0,null,null,0]
[null,null,null,null,null,null,null,null,null,null,null,null,null,null,"t.","FORROS",null,null,0,null,null,null,null,0,null,null,0]
[null,null,null,null,null,null,null,null,null,null,null,null,null,null,"u.","REVESTIMENTO DE PISO",null,null,0,null,null,null,null,0,null,null,0]
[null,null,null,null,null,null,null,null,null,null,null,null,null,null,"v.","FERRAGENS",null,null,0,null,null,null,null,0,null,null,0]
[null,null,null,null,null,null,null,null,null,null,null,null,null,null,"w.","MARCENARIA",null,null,0,null,null,null,null,0,null,null,0]
[null,null,null,null,null,null,null,null,null,null,null,null,null,null,"x.","ADMINISTRAÇÃO",null,null,0,null,null,null,null,0,null,null,0]
[null,null,null,null,null,null,null,null,null,null,null,null,null,null,"y.","PINTURA",null,null,0,null,null,null,null,{"$f":"ROUND(S1371*(1+BDI.Taxa),2)","v":0},null,null,0]
[null,null,null,null,null,null,null,null,null,null,null,null,null,null,"z.","DIVERSOS",null,null,0,null,null,null,null,{"$f":"IF(S1372>0,IF((SUM(X1347:Y1371)+ROUND(S1372*(1+BDI.Taxa),2))<>X1374,X1374-SUM(X1347:Y1371),ROUND(S1372*(1+BDI.Taxa),2)),0)","v":0},null,null,{"$f":"IF(S1372>0,IF((SUM(AA1347:AA1371)+IFERROR(ROUND($X1372*100/$Z$1331,2),0))<>AA1374,AA1374-SUM(AA1347:AA1371),IFERROR(ROUND($X1372*100/$Z$1331,2),0)),0)","v":0}]
[null,null,null,null,null,null,null,null,null,null,null,null,null,null,"TOTAL GERAL DO ORÇAMENTO (R$)",null,null,null,{"$f":"SUM(S1347:W1372)","v":0},null,null,null,null,{"$f":"SUM(X1347:Y1372)","v":0},null,null,{"$f":"SUM(AA1347:AA1372)","v":0}]
[null,null,null,null,null,null,null,null,null,null,null,null,null,null,null,null,null,null,{"$f":"$Z$1329","v":0},null,null,null,null,{"$f":"$Z$1331","v":0},null,null,100]
[null,null,null,null,null,null,null,null,null,null,null,null,null,null,null,null,null,null,"(TOTAL SEM BDI)",null,null,null,null,"(TOTAL COM BDI)",null,null,"(ARRED porcentagem)"]
[null,null,null,null,null,null,null,null,null,null,null,null,null,null,null,null,null,null,{"$f":"IF(AND(S1373=S1374,S1373>0),\"OK\",\"ERRO\")","v":"ERRO"},null,null,null,null,{"$f":"IF(AND(X1373=X1374,X1373>0),\"OK\",\"ERRO\")","v":"ERRO"},null,null,{"$f":"IF(AA1373=100,\"OK\",\"ERRO\")","v":"ERRO"}]
[]
[]
[null,null,null,null,null,null,null,null,null,null,null,null,null,null,"RESUMO GERAL DO ORÇAMENTO"]
[null,null,null,null,null,null,null,null,null,null,null,null,null,null,"ITEM","DESCRIÇÃO DOS SERVIÇOS",null,null,"PREÇO SEM BDI",null,null,null,null,"PREÇO COM BDI",null,null,"PARTICIPAÇÃO ( % )"]
[null,null,null,null,null,null,null,null,null,null,null,null,null,null,"1.",{"$f":"IFERROR(VLOOKUP(O1381,$O$19:$Y$1328,4,FALSE),\"\")","v":"IMPLANTAÇÃO CE EXALTINA SOARES DOS SANTOS"},null,null,{"$f":"IF(P1382=\"\",$S$1402-SUM(OFFSET($S$1380:S1380,0,0,COUNTA($S$1380:S1380),1)),SUMIF($R$19:$R$1328,$P1381,$Z$19:$Z$1328))","v":0},null,null,null,null,{"$f":"IF(P1382=\"\",$X$1402-SUM(OFFSET($X$1380:X1380,0,0,COUNTA($X$1380:X1380),1)),ROUND(S1381*(1+BDI.Taxa),2))","v":0},null,null,{"$f":"IF(P1382=\"\",$AA$1402-SUM(OFFSET($AA$1380:AA1380,0,0,COUNTA($AA$1380:AA1380),1)),ROUND(X1381*100/ORÇAMENTO.TotalOrçamento,2))","v":{"$error":"#DIV/0!"}}]
[null,null,null,null,null,null,null,null,null,null,null,null,null,null,"2.","BLOCO ADMINISTRAÇÃO COM CANTINA - PADRÃO LAJE PLANA",null,null,{"$f":"IF(P1383=\"\",$S$1402-SUM(OFFSET($S$1380:S1381,0,0,COUNTA($S$1380:S1381),1)),SUMIF($R$19:$R$1328,$P1382,$Z$19:$Z$1328))","v":0},null,null,null,null,{"$f":"IF(P1383=\"\",$X$1402-SUM(OFFSET($X$1380:X1381,0,0,COUNTA($X$1380:X1381),1)),ROUND(S1382*(1+BDI.Taxa),2))","v":0},null,null,{"$f":"IF(P1383=\"\",$AA$1402-SUM(OFFSET($AA$1380:AA1381,0,0,COUNTA($AA$1380:AA1381),1)),ROUND(X1382*100/ORÇAMENTO.TotalOrçamento,2))","v":{"$error":"#DIV/0!"}}]
[null,null,null,null,null,null,null,null,null,null,null,null,null,null,"3.","BLOCO BIBLIOTECA E LABORATÓRIO DE CIÊNCIAS",null,null,{"$f":"IF(P1384=\"\",$S$1402-SUM(OFFSET($S$1380:S1382,0,0,COUNTA($S$1380:S1382),1)),SUMIF($R$19:$R$1328,$P1383,$Z$19:$Z$1328))","v":0},null,null,null,null,{"$f":"IF(P1384=\"\",$X$1402-SUM(OFFSET($X$1380:X1382,0,0,COUNTA($X$1380:X1382),1)),ROUND(S1383*(1+BDI.Taxa),2))","v":0},null,null,{"$f":"IF(P1384=\"\",$AA$1402-SUM(OFFSET($AA$1380:AA1382,0,0,COUNTA($AA$1380:AA1382),1)),ROUND(X1383*100/ORÇAMENTO.TotalOrçamento,2))","v":{"$error":"#DIV/0!"}}]
[null,null,null,null,null,null,null,null,null,null,null,null,null,null,"4.","BLOCO 04 SALAS DE AULA",null,null,{"$f":"IF(P1385=\"\",$S$1402-SUM(OFFSET($S$1380:S1383,0,0,COUNTA($S$1380:S1383),1)),SUMIF($R$19:$R$1328,$P1384,$Z$19:$Z$1328))","v":0},null,null,null,null,{"$f":"IF(P1385=\"\",$X$1402-SUM(OFFSET($X$1380:X1383,0,0,COUNTA($X$1380:X1383),1)),ROUND(S1384*(1+BDI.Taxa),2))","v":0},null,null,{"$f":"IF(P1385=\"\",$AA$1402-SUM(OFFSET($AA$1380:AA1383,0,0,COUNTA($AA$1380:AA1383),1)),ROUND(X1384*100/ORÇAMENTO.TotalOrçamento,2))","v":{"$error":"#DIV/0!"}}]
[null,null,null,null,null,null,null,null,null,null,null,null,null,null,"5.","BLOCO RECREIO COM SANITÁRIOS",null,null,{"$f":"IF(P1386=\"\",$S$1402-SUM(OFFSET($S$1380:S1384,0,0,COUNTA($S$1380:S1384),1)),SUMIF($R$19:$R$1328,$P1385,$Z$19:$Z$1328))","v":0},null,null,null,null,{"$f":"IF(P1386=\"\",$X$1402-SUM(OFFSET($X$1380:X1384,0,0,COUNTA($X$1380:X1384),1)),ROUND(S1385*(1+BDI.Taxa),2))","v":0},null,null,{"$f":"IF(P1386=\"\",$AA$1402-SUM(OFFSET($AA$1380:AA1384,0,0,COUNTA($AA$1380:AA1384),1)),ROUND(X1385*100/ORÇAMENTO.TotalOrçamento,2))","v":{"$error":"#DIV/0!"}}]
[null,null,null,null,null,null,null,null,null,null,null,null,null,null,"6.","PASSARELA MODELO 02 - PADRÃO LAJE PLANA",null,null,{"$f":"IF(P1387=\"\",$S$1402-SUM(OFFSET($S$1380:S1385,0,0,COUNTA($S$1380:S1385),1)),SUMIF($R$19:$R$1328,$P1386,$Z$19:$Z$1328))","v":0},null,null,null,null,{"$f":"IF(P1387=\"\",$X$1402-SUM(OFFSET($X$1380:X1385,0,0,COUNTA($X$1380:X1385),1)),ROUND(S1386*(1+BDI.Taxa),2))","v":0},null,null,{"$f":"IF(P1387=\"\",$AA$1402-SUM(OFFSET($AA$1380:AA1385,0,0,COUNTA($AA$1380:AA1385),1)),ROUND(X1386*100/ORÇAMENTO.TotalOrçamento,2))","v":{"$error":"#DIV/0!"}}]
[null,null,null,null,null,null,null,null,null,null,null,null,null,null,"7.","PASSARELA MODELO 03 - PADRÃO LAJE PLANA",null,null,{"$f":"IF(P1388=\"\",$S$1402-SUM(OFFSET($S$1380:S1386,0,0,COUNTA($S$1380:S1386),1)),SUMIF($R$19:$R$1328,$P1387,$Z$19:$Z$1328))","v":0},null,null,null,null,{"$f":"IF(P1388=\"\",$X$1402-SUM(OFFSET($X$1380:X1386,0,0,COUNTA($X$1380:X1386),1)),ROUND(S1387*(1+BDI.Taxa),2))","v":0},null,null,{"$f":"IF(P1388=\"\",$AA$1402-SUM(OFFSET($AA$1380:AA1386,0,0,COUNTA($AA$1380:AA1386),1)),ROUND(X1387*100/ORÇAMENTO.TotalOrçamento,2))","v":{"$error":"#DIV/0!"}}]
[null,null,null,null,null,null,null,null,null,null,null,null,null,null,"8.","RESERVATÓRIO ELEVADO - PADRÃO SÉC. XXI",null,null,{"$f":"IF(P1389=\"\",$S$1402-SUM(OFFSET($S$1380:S1387,0,0,COUNTA($S$1380:S1387),1)),SUMIF($R$19:$R$1328,$P1388,$Z$19:$Z$1328))","v":0},null,null,null,null,{"$f":"IF(P1389=\"\",$X$1402-SUM(OFFSET($X$1380:X1387,0,0,COUNTA($X$1380:X1387),1)),ROUND(S1388*(1+BDI.Taxa),2))","v":0},null,null,{"$f":"IF(P1389=\"\",$AA$1402-SUM(OFFSET($AA$1380:AA1387,0,0,COUNTA($AA$1380:AA1387),1)),ROUND(X1388*100/ORÇAMENTO.TotalOrçamento,2))","v":{"$error":"#DIV/0!"}}]
[null,null,null,null,null,null,null,null,null,null,null,null,null,null,"9.","RESERVATÓRIO ENTERRADO - PADRÃO SÉC. XXI",null,null,{"$f":"IF(P1390=\"\",$S$1402-SUM(OFFSET($S$1380:S1388,0,0,COUNTA($S$1380:S1388),1)),SUMIF($R$19:$R$1328,$P1389,$Z$19:$Z$1328))","v":0},null,null,null,null,{"$f":"IF(P1390=\"\",$X$1402-SUM(OFFSET($X$1380:X1388,0,0,COUNTA($X$1380:X1388),1)),ROUND(S1389*(1+BDI.Taxa),2))","v":0},null,null,{"$f":"IF(P1390=\"\",$AA$1402-SUM(OFFSET($AA$1380:AA1388,0,0,COUNTA($AA$1380:AA1388),1)),ROUND(X1389*100/ORÇAMENTO.TotalOrçamento,2))","v":{"$error":"#DIV/0!"}}]
[null,null,null,null,null,null,null,null,null,null,null,null,null,null,"10.","QUADRO ARCO MOD 02 - PADRÃO SEDUC",null,null,{"$f":"IF(P1391=\"\",$S$1402-SUM(OFFSET($S$1380:S1389,0,0,COUNTA($S$1380:S1389),1)),SUMIF($R$19:$R$1328,$P1390,$Z$19:$Z$1328))","v":0},null,null,null,null,{"$f":"IF(P1391=\"\",$X$1402-SUM(OFFSET($X$1380:X1389,0,0,COUNTA($X$1380:X1389),1)),ROUND(S1390*(1+BDI.Taxa),2))","v":0},null,null,{"$f":"IF(P1391=\"\",$AA$1402-SUM(OFFSET($AA$1380:AA1389,0,0,COUNTA($AA$1380:AA1389),1)),ROUND(X1390*100/ORÇAMENTO.TotalOrçamento,2))","v":{"$error":"#DIV/0!"}}]
[null,null,null,null,null,null,null,null,null,null,null,null,null,null,"11.","",null,null,{"$f":"IF(P1392=\"\",$S$1402-SUM(OFFSET($S$1380:S1390,0,0,COUNTA($S$1380:S1390),1)),SUMIF($R$19:$R$1328,$P1391,$Z$19:$Z$1328))","v":0},null,null,null,null,{"$f":"IF(P1392=\"\",$X$1402-SUM(OFFSET($X$1380:X1390,0,0,COUNTA($X$1380:X1390),1)),ROUND(S1391*(1+BDI.Taxa),2))","v":0},null,null,{"$f":"IF(P1392=\"\",$AA$1402-SUM(OFFSET($AA$1380:AA1390,0,0,COUNTA($AA$1380:AA1390),1)),ROUND(X1391*100/ORÇAMENTO.TotalOrçamento,2))","v":{"$error":"#DIV/0!"}}]
[null,null,null,null,null,null,null,null,null,null,null,null,null,null,"12.","",null,null,{"$f":"IF(P1393=\"\",$S$1402-SUM(OFFSET($S$1380:S1391,0,0,COUNTA($S$1380:S1391),1)),SUMIF($R$19:$R$1328,$P1392,$Z$19:$Z$1328))","v":0},null,null,null,null,{"$f":"IF(P1393=\"\",$X$1402-SUM(OFFSET($X$1380:X1391,0,0,COUNTA($X$1380:X1391),1)),ROUND(S1392*(1+BDI.Taxa),2))","v":0},null,null,{"$f":"IF(P1393=\"\",$AA$1402-SUM(OFFSET($AA$1380:AA1391,0,0,COUNTA($AA$1380:AA1391),1)),ROUND(X1392*100/ORÇAMENTO.TotalOrçamento,2))","v":{"$error":"#DIV/0!"}}]
[null,null,null,null,null,null,null,null,null,null,null,null,null,null,"13.","",null,null,{"$f":"IF(P1394=\"\",$S$1402-SUM(OFFSET($S$1380:S1392,0,0,COUNTA($S$1380:S1392),1)),SUMIF($R$19:$R$1328,$P1393,$Z$19:$Z$1328))","v":0},null,null,null,null,{"$f":"IF(P1394=\"\",$X$1402-SUM(OFFSET($X$1380:X1392,0,0,COUNTA($X$1380:X1392),1)),ROUND(S1393*(1+BDI.Taxa),2))","v":0},null,null,{"$f":"IF(P1394=\"\",$AA$1402-SUM(OFFSET($AA$1380:AA1392,0,0,COUNTA($AA$1380:AA1392),1)),ROUND(X1393*100/ORÇAMENTO.TotalOrçamento,2))","v":{"$error":"#DIV/0!"}}]
[null,null,null,null,null,null,null,null,null,null,null,null,null,null,"14.","",null,null,{"$f":"IF(P1395=\"\",$S$1402-SUM(OFFSET($S$1380:S1393,0,0,COUNTA($S$1380:S1393),1)),SUMIF($R$19:$R$1328,$P1394,$Z$19:$Z$1328))","v":0},null,null,null,null,{"$f":"IF(P1395=\"\",$X$1402-SUM(OFFSET($X$1380:X1393,0,0,COUNTA($X$1380:X1393),1)),ROUND(S1394*(1+BDI.Taxa),2))","v":0},null,null,{"$f":"IF(P1395=\"\",$AA$1402-SUM(OFFSET($AA$1380:AA1393,0,0,COUNTA($AA$1380:AA1393),1)),ROUND(X1394*100/ORÇAMENTO.TotalOrçamento,2))","v":{"$error":"#DIV/0!"}}]
[null,null,null,null,null,null,null,null,null,null,null,null,null,null,"15.","",null,null,{"$f":"IF(P1396=\"\",$S$1402-SUM(OFFSET($S$1380:S1394,0,0,COUNTA($S$1380:S1394),1)),SUMIF($R$19:$R$1328,$P1395,$Z$19:$Z$1328))","v":0},null,null,null,null,{"$f":"IF(P1396=\"\",$X$1402-SUM(OFFSET($X$1380:X1394,0,0,COUNTA($X$1380:X1394),1)),ROUND(S1395*(1+BDI.Taxa),2))","v":0},null,null,{"$f":"IF(P1396=\"\",$AA$1402-SUM(OFFSET($AA$1380:AA1394,0,0,COUNTA($AA$1380:AA1394),1)),ROUND(X1395*100/ORÇAMENTO.TotalOrçamento,2))","v":{"$error":"#DIV/0!"}}]
[null,null,null,null,null,null,null,null,null,null,null,null,null,null,"16.","",null,null,{"$f":"IF(P1397=\"\",$S$1402-SUM(OFFSET($S$1380:S1395,0,0,COUNTA($S$1380:S1395),1)),SUMIF($R$19:$R$1328,$P1396,$Z$19:$Z$1328))","v":0},null,null,null,null,{"$f":"IF(P1397=\"\",$X$1402-SUM(OFFSET($X$1380:X1395,0,0,COUNTA($X$1380:X1395),1)),ROUND(S1396*(1+BDI.Taxa),2))","v":0},null,null,{"$f":"IF(P1397=\"\",$AA$1402-SUM(OFFSET($AA$1380:AA1395,0,0,COUNTA($AA$1380:AA1395),1)),ROUND(X1396*100/ORÇAMENTO.TotalOrçamento,2))","v":{"$error":"#DIV/0!"}}]
[null,null,null,null,null,null,null,null,null,null,null,null,null,null,"17.","",null,null,{"$f":"IF(P1398=\"\",$S$1402-SUM(OFFSET($S$1380:S1396,0,0,COUNTA($S$1380:S1396),1)),SUMIF($R$19:$R$1328,$P1397,$Z$19:$Z$1328))","v":0},null,null,null,null,{"$f":"IF(P1398=\"\",$X$1402-SUM(OFFSET($X$1380:X1396,0,0,COUNTA($X$1380:X1396),1)),ROUND(S1397*(1+BDI.Taxa),2))","v":0},null,null,{"$f":"IF(P1398=\"\",$AA$1402-SUM(OFFSET($AA$1380:AA1396,0,0,COUNTA($AA$1380:AA1396),1)),ROUND(X1397*100/ORÇAMENTO.TotalOrçamento,2))","v":{"$error":"#DIV/0!"}}]
[null,null,null,null,null,null,null,null,null,null,null,null,null,null,"18.","",null,null,{"$f":"IF(P1399=\"\",$S$1402-SUM(OFFSET($S$1380:S1397,0,0,COUNTA($S$1380:S1397),1)),SUMIF($R$19:$R$1328,$P1398,$Z$19:$Z$1328))","v":0},null,null,null,null,{"$f":"IF(P1399=\"\",$X$1402-SUM(OFFSET($X$1380:X1397,0,0,COUNTA($X$1380:X1397),1)),ROUND(S1398*(1+BDI.Taxa),2))","v":0},null,null,{"$f":"IF(P1399=\"\",$AA$1402-SUM(OFFSET($AA$1380:AA1397,0,0,COUNTA($AA$1380:AA1397),1)),ROUND(X1398*100/ORÇAMENTO.TotalOrçamento,2))","v":{"$error":"#DIV/0!"}}]
[null,null,null,null,null,null,null,null,null,null,null,null,null,null,"19.","",null,null,{"$f":"IF(P1400=\"\",$S$1402-SUM(OFFSET($S$1380:S1398,0,0,COUNTA($S$1380:S1398),1)),SUMIF($R$19:$R$1328,$P1399,$Z$19:$Z$1328))","v":0},null,null,null,null,{"$f":"IF(P1400=\"\",$X$1402-SUM(OFFSET($X$1380:X1398,0,0,COUNTA($X$1380:X1398),1)),ROUND(S1399*(1+BDI.Taxa),2))","v":0},null,null,{"$f":"IF(P1400=\"\",$AA$1402-SUM(OFFSET($AA$1380:AA1398,0,0,COUNTA($AA$1380:AA1398),1)),ROUND(X1399*100/ORÇAMENTO.TotalOrçamento,2))","v":{"$error":"#DIV/0!"}}]
[null,null,null,null,null,null,null,null,null,null,null,null,null,null,"20.","",null,null,{"$f":"IF(P1401=\"\",$S$1402-SUM(OFFSET($S$1380:S1399,0,0,COUNTA($S$1380:S1399),1)),SUMIF($R$19:$R$1328,$P1400,$Z$19:$Z$1328))","v":0},null,null,null,null,{"$f":"IF(P1401=\"\",$X$1402-SUM(OFFSET($X$1380:X1399,0,0,COUNTA($X$1380:X1399),1)),ROUND(S1400*(1+BDI.Taxa),2))","v":0},null,null,{"$f":"IF(P1401=\"\",$AA$1402-SUM(OFFSET($AA$1380:AA1399,0,0,COUNTA($AA$1380:AA1399),1)),ROUND(X1400*100/ORÇAMENTO.TotalOrçamento,2))","v":{"$error":"#DIV/0!"}}]
[null,null,null,null,null,null,null,null,null,null,null,null,null,null,"TOTAL GERAL DO ORÇAMENTO (R$)",null,null,null,{"$f":"SUM(S1381:W1400)","v":0},null,null,null,null,{"$f":"SUM(X1381:Y1400)","v":0},null,null,{"$f":"SUM(AA1381:AA1400)","v":{"$error":"#DIV/0!"}}]
[null,null,null,null,null,null,null,null,null,null,null,null,null,null,null,null,null,null,{"$f":"$Z$1329","v":0},null,null,null,null,{"$f":"$Z$1331","v":0},null,null,100]
[null,null,null,null,null,null,null,null,null,null,null,null,null,null,null,null,null,null,"(TOTAL SEM BDI)",null,null,null,null,"(TOTAL COM BDI)",null,null,"(ARRED porcentagem)"]
[null,null,null,null,null,null,null,null,null,null,null,null,null,null,null,null,null,null,{"$f":"IF(AND(S1401=S1402,S1401>0),\"OK\",\"ERRO\")","v":"ERRO"},null,null,null,null,{"$f":"IF(AND(X1401=X1402,X1401>0),\"OK\",\"ERRO\")","v":"ERRO"},null,null,{"$f":"IF(AA1401=100,\"OK\",\"ERRO\")","v":{"$error":"#DIV/0!"}}]

{"sheet":"Resumo ","index":1,"n_rows":39,"n_cols":9,"rows_kept":39,"cut":false,"hidden":false,"merged":[[13,0,14,0],[15,2,15,5],[16,2,16,5],[17,2,17,5],[18,2,18,5],[14,1,14,8],[0,1,0,8],[36,1,36,5],[2,1,2,5],[3,1,3,5],[5,1,5,5],[6,1,6,5],[8,1,8,5],[9,1,9,5],[11,3,11,5],[12,3,12,5],[10,1,10,8],[11,6,11,8],[12,6,12,8],[19,2,19,5],[20,2,20,5],[21,2,21,5],[31,2,31,5],[1,1,1,8],[2,6,2,8],[3,6,3,8],[4,1,4,8],[5,6,5,8],[6,6,6,8],[7,1,7,8],[8,6,8,8],[9,6,9,8],[13,1,13,8],[11,1,11,2],[12,1,12,2],[42,3,42,7],[41,3,41,7],[38,1,38,8],[22,2,22,5],[23,2,23,5],[24,2,24,5],[25,2,25,5],[26,2,26,5],[32,2,32,5],[33,2,33,5],[34,2,34,5],[35,2,35,5],[27,2,27,5],[28,2,28,5],[29,2,29,5],[30,2,30,5]]}
[]
[]
[null,"UNIDADE ESCOLAR",null,null,null,null,"CÓDIGO INEP"]
[null,{"$f":"Orçamento!$O$4","v":"COLÉGIO ESTADUAL EXALTINA SOARES DOS SANTOS"},null,null,null,null,{"$f":"Orçamento!X4","v":52042944}]
[]
[null,"OBRA",null,null,null,null,"CIDADE"]
[null,{"$f":"Orçamento!$O$7","v":"IMPLANTAÇÃO E CONSTRUÇÃO"},null,null,null,null,{"$f":"Orçamento!$X$7","v":"SIMOLÂNDIA"}]
[]
[null,"ENDEREÇO",null,null,null,null,"CRE"]
[null,{"$f":"Orçamento!$R$10","v":"AV PEDRO NUNES, CENTRO, CEP:73930-000"},null,null,null,null,{"$f":"Orçamento!$O$10","v":"POSSE"}]
[]
[null,"REFERÊNCIA",null,"DATA",null,null,"ÁREA TOTAL CONSTRUÍDA (M²)"]
[null,{"$f":"CONCATENATE(\"AGETOP E SINAPI - \",Orçamento!$Y$10)","v":"AGETOP E SINAPI - DESONERADA"},null,{"$f":"Orçamento!$S$7","v":"2020-07-07"},null,null,{"$f":"Orçamento!$S$13","v":1496.75}]
["FILTRO"]
[null,"RESUMO GERAL DO ORÇAMENTO"]
["↓","ITEM","DESCRIÇÃO DOS SERVIÇOS",null,null,null,"PREÇO SEM BDI","PREÇO COM BDI","PARTICIP. (%)"]
[{"$f":"IF(H17>0,\"F\",\"\")","v":""},"1.",{"$f":"Orçamento!$P1381","v":"IMPLANTAÇÃO CE EXALTINA SOARES DOS SANTOS"},null,null,null,{"$f":"IFERROR(Orçamento!S1381,\"-\")","v":0},{"$f":"IFERROR(Orçamento!X1381,\"\")","v":0},{"$f":"Orçamento!AA1381","v":{"$error":"#DIV/0!"}}]
[{"$f":"IF(H18>0,\"F\",\"\")","v":""},"2.",{"$f":"Orçamento!$P1382","v":"BLOCO ADMINISTRAÇÃO COM CANTINA - PADRÃO LAJE PLANA"},null,null,null,{"$f":"IFERROR(Orçamento!S1382,\"-\")","v":0},{"$f":"IFERROR(Orçamento!X1382,\"\")","v":0},{"$f":"Orçamento!AA1382","v":{"$error":"#DIV/0!"}}]
["","3.",{"$f":"Orçamento!$P1383","v":"BLOCO BIBLIOTECA E LABORATÓRIO DE CIÊNCIAS"},null,null,null,{"$f":"IFERROR(Orçamento!S1383,\"-\")","v":0},{"$f":"IFERROR(Orçamento!X1383,\"\")","v":0},{"$f":"Orçamento!AA1383","v":{"$error":"#DIV/0!"}}]
["","4.",{"$f":"Orçamento!$P1384","v":"BLOCO 04 SALAS DE AULA"},null,null,null,{"$f":"IFERROR(Orçamento!S1384,\"-\")","v":0},{"$f":"IFERROR(Orçamento!X1384,\"\")","v":0},{"$f":"Orçamento!AA1384","v":{"$error":"#DIV/0!"}}]
["","5.",{"$f":"Orçamento!$P1385","v":"BLOCO RECREIO COM SANITÁRIOS"},null,null,null,{"$f":"IFERROR(Orçamento!S1385,\"-\")","v":0},{"$f":"IFERROR(Orçamento!X1385,\"\")","v":0},{"$f":"Orçamento!AA1385","v":{"$error":"#DIV/0!"}}]
["","6.",{"$f":"Orçamento!$P1386","v":"PASSARELA MODELO 02 - PADRÃO LAJE PLANA"},null,null,null,{"$f":"IFERROR(Orçamento!S1386,\"-\")","v":0},{"$f":"IFERROR(Orçamento!X1386,\"\")","v":0},{"$f":"Orçamento!AA1386","v":{"$error":"#DIV/0!"}}]
["","7.",{"$f":"Orçamento!$P1387","v":"PASSARELA MODELO 03 - PADRÃO LAJE PLANA"},null,null,null,{"$f":"IFERROR(Orçamento!S1387,\"-\")","v":0},{"$f":"IFERROR(Orçamento!X1387,\"\")","v":0},{"$f":"Orçamento!AA1387","v":{"$error":"#DIV/0!"}}]
["","8.",{"$f":"Orçamento!$P1388","v":"RESERVATÓRIO ELEVADO - PADRÃO SÉC. XXI"},null,null,null,{"$f":"IFERROR(Orçamento!S1388,\"-\")","v":0},{"$f":"IFERROR(Orçamento!X1388,\"\")","v":0},{"$f":"Orçamento!AA1388","v":{"$error":"#DIV/0!"}}]
["","9.",{"$f":"Orçamento!$P1389","v":"RESERVATÓRIO ENTERRADO - PADRÃO SÉC. XXI"},null,null,null,{"$f":"IFERROR(Orçamento!S1389,\"-\")","v":0},{"$f":"IFERROR(Orçamento!X1389,\"\")","v":0},{"$f":"Orçamento!AA1389","v":{"$error":"#DIV/0!"}}]
["","10.",{"$f":"Orçamento!$P1390","v":"QUADRO ARCO MOD 02 - PADRÃO SEDUC"},null,null,null,{"$f":"IFERROR(Orçamento!S1390,\"-\")","v":0},{"$f":"IFERROR(Orçamento!X1390,\"\")","v":0},{"$f":"Orçamento!AA1390","v":{"$error":"#DIV/0!"}}]
["","11.",{"$f":"Orçamento!$P1391","v":""},null,null,null,{"$f":"IFERROR(Orçamento!S1391,\"-\")","v":0},{"$f":"IFERROR(Orçamento!X1391,\"\")","v":0},{"$f":"Orçamento!AA1391","v":{"$error":"#DIV/0!"}}]
["","12.",{"$f":"Orçamento!$P1392","v":""},null,null,null,{"$f":"IFERROR(Orçamento!S1392,\"-\")","v":0},{"$f":"IFERROR(Orçamento!X1392,\"\")","v":0},{"$f":"Orçamento!AA1392","v":{"$error":"#DIV/0!"}}]
["","13.",{"$f":"Orçamento!$P1393","v":""},null,null,null,{"$f":"IFERROR(Orçamento!S1393,\"-\")","v":0},{"$f":"IFERROR(Orçamento!X1393,\"\")","v":0},{"$f":"Orçamento!AA1393","v":{"$error":"#DIV/0!"}}]
["","14.",{"$f":"Orçamento!$P1394","v":""},null,null,null,{"$f":"IFERROR(Orçamento!S1394,\"-\")","v":0},{"$f":"IFERROR(Orçamento!X1394,\"\")","v":0},{"$f":"Orçamento!AA1394","v":{"$error":"#DIV/0!"}}]
["","15.",{"$f":"Orçamento!$P1395","v":""},null,null,null,{"$f":"IFERROR(Orçamento!S1395,\"-\")","v":0},{"$f":"IFERROR(Orçamento!X1395,\"\")","v":0},{"$f":"Orçamento!AA1395","v":{"$error":"#DIV/0!"}}]
["","16.",{"$f":"Orçamento!$P1396","v":""},null,null,null,{"$f":"IFERROR(Orçamento!S1396,\"-\")","v":0},{"$f":"IFERROR(Orçamento!X1396,\"\")","v":0},{"$f":"Orçamento!AA1396","v":{"$error":"#DIV/0!"}}]
["","17.",{"$f":"Orçamento!$P1397","v":""},null,null,null,{"$f":"IFERROR(Orçamento!S1397,\"-\")","v":0},{"$f":"IFERROR(Orçamento!X1397,\"\")","v":0},{"$f":"Orçamento!AA1397","v":{"$error":"#DIV/0!"}}]
["","18.",{"$f":"Orçamento!$P1398","v":""},null,null,null,{"$f":"IFERROR(Orçamento!S1398,\"-\")","v":0},{"$f":"IFERROR(Orçamento!X1398,\"\")","v":0},{"$f":"Orçamento!AA1398","v":{"$error":"#DIV/0!"}}]
["","19.",{"$f":"Orçamento!$P1399","v":""},null,null,null,{"$f":"IFERROR(Orçamento!S1399,\"-\")","v":0},{"$f":"IFERROR(Orçamento!X1399,\"\")","v":0},{"$f":"Orçamento!AA1399","v":{"$error":"#DIV/0!"}}]
["","20.",{"$f":"Orçamento!$P1400","v":""},null,null,null,{"$f":"IFERROR(Orçamento!S1400,\"-\")","v":0},{"$f":"IFERROR(Orçamento!X1400,\"\")","v":0},{"$f":"Orçamento!AA1400","v":{"$error":"#DIV/0!"}}]
["F","TOTAL GERAL DO ORÇAMENTO (R$)",null,null,null,null,{"$f":"SUM(G17:G36)","v":0},0,{"$f":"SUM(I17:I36)","v":{"$error":"#DIV/0!"}}]
["F"]
["F"]

{"sheet":"Somatório","index":2,"n_rows":45,"n_cols":6,"rows_kept":45,"cut":false,"hidden":false,"merged":[[13,0,14,0],[42,1,42,2],[44,1,44,5],[47,3,47,5],[48,3,48,5],[13,1,13,5],[9,1,9,3],[9,4,9,5],[11,1,11,2],[11,4,11,5],[12,1,12,2],[12,4,12,5],[0,1,0,5],[14,1,14,5],[2,1,2,3],[2,4,2,5],[3,1,3,3],[3,4,3,5],[5,1,5,3],[5,4,5,5],[6,1,6,3],[6,4,6,5],[8,1,8,3],[8,4,8,5],[1,1,1,5],[4,1,4,5],[7,1,7,5],[10,1,10,5]]}
[]
[]
[null,"UNIDADE ESCOLAR",null,null,"CÓDIGO INEP"]
[null,{"$f":"Orçamento!$O$4","v":"COLÉGIO ESTADUAL EXALTINA SOARES DOS SANTOS"},null,null,{"$f":"Orçamento!X4","v":52042944}]
[]
[null,"OBRA",null,null,"CIDADE"]
[null,{"$f":"Orçamento!$O$7","v":"IMPLANTAÇÃO E CONSTRUÇÃO"},null,null,{"$f":"Orçamento!$X$7","v":"SIMOLÂNDIA"}]
[]
[null,"ENDEREÇO",null,null,"CRE"]
[null,{"$f":"Orçamento!$R$10","v":"AV PEDRO NUNES, CENTRO, CEP:73930-000"},null,null,{"$f":"Orçamento!$O$10","v":"POSSE"}]
[]
[null,"REFERÊNCIA",null,"DATA","ÁREA TOTAL CONSTRUÍDA (M²)"]
[null,{"$f":"CONCATENATE(\"AGETOP E SINAPI - \",Orçamento!$Y$10)","v":"AGETOP E SINAPI - DESONERADA"},null,{"$f":"Orçamento!$S$7","v":"2020-07-07"},{"$f":"Orçamento!$S$13","v":1496.75}]
["FILTRO"]
[null,"SOMATÓRIO DE SERVIÇOS"]
["↓","ITEM","DESCRIÇÃO DOS SERVIÇOS","PREÇO SEM BDI (R$)","PREÇO COM BDI (R$)","PARTIC.  ( % )"]
[{"$f":"IF(D17>0,\"F\",\"\")","v":""},"a.",{"$f":"Orçamento!P1347","v":"SERVIÇOS PRELIMINARES"},{"$f":"Orçamento!S1347","v":0},{"$f":"Orçamento!X1347","v":0},{"$f":"Orçamento!AA1347","v":0}]
[{"$f":"IF(D18>0,\"F\",\"\")","v":""},"b.",{"$f":"Orçamento!P1348","v":"TRANSPORTES"},{"$f":"Orçamento!S1348","v":0},{"$f":"Orçamento!X1348","v":0},{"$f":"Orçamento!AA1348","v":0}]
["","c.",{"$f":"Orçamento!P1349","v":"SERVIÇO EM TERRA"},{"$f":"Orçamento!S1349","v":0},{"$f":"Orçamento!X1349","v":0},{"$f":"Orçamento!AA1349","v":0}]
["","d.",{"$f":"Orçamento!P1350","v":"FUNDAÇÕES E SONDAGENS"},{"$f":"Orçamento!S1350","v":0},{"$f":"Orçamento!X1350","v":0},{"$f":"Orçamento!AA1350","v":0}]
["","e.",{"$f":"Orçamento!P1351","v":"ESTRUTURA"},{"$f":"Orçamento!S1351","v":0},{"$f":"Orçamento!X1351","v":0},{"$f":"Orçamento!AA1351","v":0}]
["","f.",{"$f":"Orçamento!P1352","v":"INSTALAÇÕES ELÉTRICAS"},{"$f":"Orçamento!S1352","v":0},{"$f":"Orçamento!X1352","v":0},{"$f":"Orçamento!AA1352","v":0}]
["","g.",{"$f":"Orçamento!P1353","v":"INSTALAÇÕES HIDROSSANITÁRIAS"},{"$f":"Orçamento!S1353","v":0},{"$f":"Orçamento!X1353","v":0},{"$f":"Orçamento!AA1353","v":0}]
["","h",{"$f":"Orçamento!P1354","v":"INSTALAÇÕES ESPECIAIS"},{"$f":"Orçamento!S1354","v":0},{"$f":"Orçamento!X1354","v":0},{"$f":"Orçamento!AA1354","v":0}]
["","i.",{"$f":"Orçamento!P1355","v":"ALVENARIAS E DIVISÓRIAS"},{"$f":"Orçamento!S1355","v":0},{"$f":"Orçamento!X1355","v":0},{"$f":"Orçamento!AA1355","v":0}]
["","j.",{"$f":"Orçamento!P1356","v":"ALVENARIA AUTO-PORTANTE"},{"$f":"Orçamento!S1356","v":0},{"$f":"Orçamento!X1356","v":0},{"$f":"Orçamento!AA1356","v":0}]
["","k.",{"$f":"Orçamento!P1357","v":"IMPERMEABILIZAÇÃO"},{"$f":"Orçamento!S1357","v":0},{"$f":"Orçamento!X1357","v":0},{"$f":"Orçamento!AA1357","v":0}]
["","l.",{"$f":"Orçamento!P1358","v":"ISOLAMENTO TÉRMICO E ACÚSTICO"},{"$f":"Orçamento!S1358","v":0},{"$f":"Orçamento!X1358","v":0},{"$f":"Orçamento!AA1358","v":0}]
["","m.",{"$f":"Orçamento!P1359","v":"ESTRUTURA DE MADEIRA"},{"$f":"Orçamento!S1359","v":0},{"$f":"Orçamento!X1359","v":0},{"$f":"Orçamento!AA1359","v":0}]
["","n.",{"$f":"Orçamento!P1360","v":"ESTRUTURAS METÁLICAS"},{"$f":"Orçamento!S1360","v":0},{"$f":"Orçamento!X1360","v":0},{"$f":"Orçamento!AA1360","v":0}]
["","o.",{"$f":"Orçamento!P1361","v":"COBERTURAS"},{"$f":"Orçamento!S1361","v":0},{"$f":"Orçamento!X1361","v":0},{"$f":"Orçamento!AA1361","v":0}]
["","p.",{"$f":"Orçamento!P1362","v":"ESQUADRIAS DE MADEIRA"},{"$f":"Orçamento!S1362","v":0},{"$f":"Orçamento!X1362","v":0},{"$f":"Orçamento!AA1362","v":0}]
["","q.",{"$f":"Orçamento!P1363","v":"ESQUADRIAS METÁLICAS"},{"$f":"Orçamento!S1363","v":0},{"$f":"Orçamento!X1363","v":0},{"$f":"Orçamento!AA1363","v":0}]
["","r.",{"$f":"Orçamento!P1364","v":"VIDROS"},{"$f":"Orçamento!S1364","v":0},{"$f":"Orçamento!X1364","v":0},{"$f":"Orçamento!AA1364","v":0}]
["","s.",{"$f":"Orçamento!P1365","v":"REVESTIMENTO DE PAREDE"},{"$f":"Orçamento!S1365","v":0},{"$f":"Orçamento!X1365","v":0},{"$f":"Orçamento!AA1365","v":0}]
["","t.",{"$f":"Orçamento!P1366","v":"FORROS"},{"$f":"Orçamento!S1366","v":0},{"$f":"Orçamento!X1366","v":0},{"$f":"Orçamento!AA1366","v":0}]
["","u.",{"$f":"Orçamento!P1367","v":"REVESTIMENTO DE PISO"},{"$f":"Orçamento!S1367","v":0},{"$f":"Orçamento!X1367","v":0},{"$f":"Orçamento!AA1367","v":0}]
["","v.",{"$f":"Orçamento!P1368","v":"FERRAGENS"},{"$f":"Orçamento!S1368","v":0},{"$f":"Orçamento!X1368","v":0},{"$f":"Orçamento!AA1368","v":0}]
["","w.",{"$f":"Orçamento!P1369","v":"MARCENARIA"},{"$f":"Orçamento!S1369","v":0},{"$f":"Orçamento!X1369","v":0},{"$f":"Orçamento!AA1369","v":0}]
["","x.",{"$f":"Orçamento!P1370","v":"ADMINISTRAÇÃO"},{"$f":"Orçamento!S1370","v":0},{"$f":"Orçamento!X1370","v":0},{"$f":"Orçamento!AA1370","v":0}]
["","y.",{"$f":"Orçamento!P1371","v":"PINTURA"},{"$f":"Orçamento!S1371","v":0},{"$f":"Orçamento!X1371","v":0},{"$f":"Orçamento!AA1371","v":0}]
["","z.",{"$f":"Orçamento!P1372","v":"DIVERSOS"},{"$f":"Orçamento!S1372","v":0},{"$f":"Orçamento!X1372","v":0},{"$f":"Orçamento!AA1372","v":0}]
["F","TOTAL GERAL DO ORÇAMENTO",null,{"$f":"SUM(D17:D42)","v":0},{"$f":"SUM(E17:E42)","v":0},{"$f":"SUM(F17:F42)","v":0}]
[]
[null,"(*) Para itens da AGETOP, os vidros não estão inclusos nas esquadrias e já foram considerados os custos de contramarco para as esquadrias de alumínio;"]

{"sheet":"Cronog_240_Dias","index":3,"n_rows":99,"n_cols":39,"rows_kept":99,"cut":false,"hidden":false,"merged":[[92,13,92,16],[92,17,92,20],[92,21,92,24],[92,25,92,28],[92,29,92,32],[92,33,92,36],[93,13,93,16],[94,13,94,16],[95,13,95,16],[93,17,93,20],[94,17,94,20],[95,17,95,20],[93,21,93,24],[94,21,94,24],[95,21,95,24],[93,25,93,28],[94,25,94,28],[95,25,95,28],[93,29,93,32],[94,29,94,32],[95,29,95,32],[93,33,93,36],[94,33,94,36],[95,33,95,36],[79,33,79,36],[80,33,80,36],[82,33,82,36],[83,33,83,36],[85,33,85,36],[86,33,86,36],[88,33,88,36],[89,33,89,36],[91,33,91,36],[65,33,65,36],[67,33,67,36],[68,33,68,36],[70,33,70,36],[71,33,71,36],[73,33,73,36],[74,33,74,36],[76,33,76,36],[77,33,77,36],[52,33,52,36],[53,33,53,36],[55,33,55,36],[56,33,56,36],[58,33,58,36],[59,33,59,36],[61,33,61,36],[62,33,62,36],[64,33,64,36],[38,33,38,36],[40,33,40,36],[41,33,41,36],[43,33,43,36],[44,33,44,36],[46,33,46,36],[47,33,47,36],[49,33,49,36],[50,33,50,36],[25,33,25,36],[26,33,26,36],[28,33,28,36],[29,33,29,36],[31,33,31,36],[32,33,32,36],[34,33,34,36],[35,33,35,36],[37,33,37,36],[12,33,12,36],[13,33,13,36],[14,33,14,36],[16,33,16,36],[17,33,17,36],[19,33,19,36],[20,33,20,36],[22,33,22,36],[23,33,23,36],[79,29,79,32],[80,29,80,32],[82,29,82,32],[83,29,83,32],[85,29,85,32],[86,29,86,32],[88,29,88,32],[89,29,89,32],[91,29,91,32],[65,29,65,32],[67,29,67,32],[68,29,68,32],[70,29,70,32],[71,29,71,32],[73,29,73,32],[74,29,74,32],[76,29,76,32],[77,29,77,32],[52,29,52,32],[53,29,53,32],[55,29,55,32],[56,29,56,32],[58,29,58,32],[59,29,59,32],[61,29,61,32],[62,29,62,32],[64,29,64,32],[38,29,38,32],[40,29,40,32],[41,29,41,32],[43,29,43,32],[44,29,44,32],[46,29,46,32],[47,29,47,32],[49,29,49,32],[50,29,50,32],[25,29,25,32],[26,29,26,32],[28,29,28,32],[29,29,29,32],[31,29,31,32],[32,29,32,32],[34,29,34,32],[35,29,35,32],[37,29,37,32],[12,29,12,32],[13,29,13,32],[14,29,14,32],[16,29,16,32],[17,29,17,32],[19,29,19,32],[20,29,20,32],[22,29,22,32],[23,29,23,32],[79,25,79,28],[80,25,80,28],[82,25,82,28],[83,25,83,28],[85,25,85,28],[86,25,86,28],[88,25,88,28],[89,25,89,28],[91,25,91,28],[65,25,65,28],[67,25,67,28],[68,25,68,28],[70,25,70,28],[71,25,71,28],[73,25,73,28],[74,25,74,28],[76,25,76,28],[77,25,77,28],[52,25,52,28],[53,25,53,28],[55,25,55,28],[56,25,56,28],[58,25,58,28],[59,25,59,28],[61,25,61,28],[62,25,62,28],[64,25,64,28],[38,25,38,28],[40,25,40,28],[41,25,41,28],[43,25,43,28],[44,25,44,28],[46,25,46,28],[47,25,47,28],[49,25,49,28],[50,25,50,28],[25,25,25,28],[26,25,26,28],[28,25,28,28],[29,25,29,28],[31,25,31,28],[32,25,32,28],[34,25,34,28],[35,25,35,28],[37,25,37,28],[12,25,12,28],[13,25,13,28],[14,25,14,28],[16,25,16,28],[17,25,17,28],[19,25,19,28],[20,25,20,28],[22,25,22,28],[23,25,23,28],[79,21,79,24],[80,21,80,24],[82,21,82,24],[83,21,83,24],[85,21,85,24],[86,21,86,24],[88,21,88,24],[89,21,89,24],[91,21,91,24],[65,21,65,24],[67,21,67,24],[68,21,68,24],[70,21,70,24],[71,21,71,24],[73,21,73,24],[74,21,74,24],[76,21,76,24],[77,21,77,24],[52,21,52,24],[53,21,53,24],[55,21,55,24],[56,21,56,24],[58,21,58,24],[59,21,59,24],[61,21,61,24],[62,21,62,24],[64,21,64,24],[38,21,38,24],[40,21,40,24],[41,21,41,24],[43,21,43,24],[44,21,44,24],[46,21,46,24],[47,21,47,24],[49,21,49,24],[50,21,50,24],[25,21,25,24],[26,21,26,24],[28,21,28,24],[29,21,29,24],[31,21,31,24],[32,21,32,24],[34,21,34,24],[35,21,35,24],[37,21,37,24],[12,21,12,24],[13,21,13,24],[14,21,14,24],[16,21,16,24],[17,21,17,24],[19,21,19,24],[20,21,20,24],[22,21,22,24],[23,21,23,24],[79,17,79,20],[80,17,80,20],[82,17,82,20],[83,17,83,20],[85,17,85,20],[86,17,86,20],[88,17,88,20],[89,17,89,20],[91,17,91,20],[65,17,65,20],[67,17,67,20],[68,17,68,20],[70,17,70,20],[71,17,71,20],[73,17,73,20],[74,17,74,20],[76,17,76,20],[77,17,77,20],[52,17,52,20],[53,17,53,20],[55,17,55,20],[56,17,56,20],[58,17,58,20],[59,17,59,20],[61,17,61,20],[62,17,62,20],[64,17,64,20],[38,17,38,20],[40,17,40,20],[41,17,41,20],[43,17,43,20],[44,17,44,20],[46,17,46,20],[47,17,47,20],[49,17,49,20],[50,17,50,20],[25,17,25,20],[26,17,26,20],[28,17,28,20],[29,17,29,20],[31,17,31,20],[32,17,32,20],[34,17,34,20],[35,17,35,20],[37,17,37,20],[12,17,12,20],[13,17,13,20],[14,17,14,20],[16,17,16,20],[17,17,17,20],[19,17,19,20],[20,17,20,20],[22,17,22,20],[23,17,23,20],[79,13,79,16],[80,13,80,16],[82,13,82,16],[83,13,83,16],[85,13,85,16],[86,13,86,16],[88,13,88,16],[89,13,89,16],[91,13,91,16],[65,13,65,16],[67,13,67,16],[68,13,68,16],[70,13,70,16],[71,13,71,16],[73,13,73,16],[74,13,74,16],[76,13,76,16],[77,13,77,16],[52,13,52,16],[53,13,53,16],[55,13,55,16],[56,13,56,16],[58,13,58,16],[59,13,59,16],[61,13,61,16],[62,13,62,16],[64,13,64,16],[38,13,38,16],[40,13,40,16],[41,13,41,16],[43,13,43,16],[44,13,44,16],[46,13,46,16],[47,13,47,16],[49,13,49,16],[50,13,50,16],[25,13,25,16],[26,13,26,16],[28,13,28,16],[29,13,29,16],[31,13,31,16],[32,13,32,16],[34,13,34,16],[35,13,35,16],[37,13,37,16],[12,13,12,16],[13,13,13,16],[14,13,14,16],[16,13,16,16],[17,13,17,16],[19,13,19,16],[20,13,20,16],[22,13,22,16],[23,13,23,16],[12,0,13,0],[9,0,11,0],[11,1,11,37],[92,1,92,2],[92,5,92,8],[92,9,92,12],[93,1,93,2],[93,5,93,8],[93,9,93,12],[74,9,74,12],[74,5,74,8],[68,9,68,12],[70,5,70,8],[70,9,70,12],[59,5,59,8],[71,1,73,2],[71,4,73,4],[71,5,71,8],[71,9,71,12],[73,5,73,8],[73,9,73,12],[59,9,59,12],[61,5,61,8],[61,9,61,12],[94,1,94,2],[94,5,94,8],[94,9,94,12],[76,5,76,8],[76,9,76,12],[77,5,77,8],[77,9,77,12],[79,5,79,8],[79,9,79,12],[80,5,80,8],[80,9,80,12],[82,5,82,8],[82,9,82,12],[77,3,79,3],[80,3,82,3],[86,1,88,2],[80,4,82,4],[83,3,85,3],[77,1,79,2],[77,4,79,4],[80,1,82,2],[95,1,95,2],[95,5,95,8],[95,9,95,12],[97,1,97,4],[98,1,98,37],[86,9,86,12],[88,5,88,8],[88,9,88,12],[85,5,85,8],[85,9,85,12],[89,1,91,2],[89,4,91,4],[89,5,89,8],[89,9,89,12],[91,5,91,8],[91,9,91,12],[89,3,91,3],[86,4,88,4],[86,5,86,8],[86,3,88,3],[83,1,85,2],[83,4,85,4],[83,5,83,8],[83,9,83,12],[68,5,68,8],[65,5,65,8],[65,9,65,12],[67,5,67,8],[67,9,67,12],[65,3,67,3],[62,9,62,12],[64,5,64,8],[64,9,64,12],[62,5,62,8],[53,9,53,12],[55,5,55,8],[55,9,55,12],[50,5,50,8],[50,9,50,12],[52,5,52,8],[52,9,52,12],[56,9,56,12],[58,5,58,8],[58,9,58,12],[53,5,53,8],[56,5,56,8],[44,9,44,12],[46,5,46,8],[46,9,46,12],[47,1,49,2],[47,4,49,4],[47,5,47,8],[47,9,47,12],[49,5,49,8],[49,9,49,12],[44,5,44,8],[47,3,49,3],[44,3,46,3],[44,1,46,2],[44,4,46,4],[35,9,35,12],[37,5,37,8],[37,9,37,12],[35,3,37,3],[40,9,40,12],[38,3,40,3],[38,9,38,12],[41,1,43,2],[41,4,43,4],[41,5,41,8],[41,9,41,12],[43,5,43,8],[43,9,43,12],[41,3,43,3],[35,5,35,8],[38,5,38,8],[40,5,40,8],[35,1,37,2],[35,4,37,4],[38,1,40,2],[38,4,40,4],[29,9,29,12],[31,5,31,8],[31,9,31,12],[32,1,34,2],[32,4,34,4],[32,5,32,8],[32,9,32,12],[34,5,34,8],[34,9,34,12],[32,3,34,3],[29,5,29,8],[29,1,31,2],[29,4,31,4],[29,3,31,3],[23,9,23,12],[25,5,25,8],[25,9,25,12],[26,1,28,2],[26,4,28,4],[26,5,26,8],[26,9,26,12],[28,5,28,8],[28,9,28,12],[23,3,25,3],[23,1,25,2],[23,4,25,4],[23,5,23,8],[26,3,28,3],[20,4,22,4],[20,5,20,8],[20,9,20,12],[22,5,22,8],[22,9,22,12],[20,3,22,3],[14,3,16,3],[17,3,19,3],[14,4,16,4],[14,5,14,8],[14,9,14,12],[16,5,16,8],[16,9,16,12],[65,1,67,2],[68,3,70,3],[62,3,64,3],[68,1,70,2],[56,3,58,3],[65,4,67,4],[74,3,76,3],[50,4,52,4],[74,4,76,4],[56,1,58,2],[56,4,58,4],[50,3,52,3],[53,3,55,3],[68,4,70,4],[62,1,64,2],[62,4,64,4],[59,3,61,3],[53,1,55,2],[53,4,55,4],[59,1,61,2],[59,4,61,4],[74,1,76,2],[10,1,10,37],[9,8,9,37],[8,8,8,37],[3,8,3,37],[6,8,6,37],[5,8,5,37],[2,8,2,37],[50,1,52,2],[71,3,73,3],[12,37,13,37],[13,1,13,2],[13,5,13,8],[13,9,13,12],[12,3,13,3],[12,9,12,12],[14,1,16,2],[12,5,12,8],[17,1,19,2],[17,4,19,4],[17,5,17,8],[17,9,17,12],[19,5,19,8],[19,9,19,12],[20,1,22,2],[0,1,0,37],[2,1,2,7],[3,1,3,7],[5,1,5,7],[6,1,6,7],[8,1,8,7],[9,1,9,7],[1,1,1,37],[7,1,7,37],[4,1,4,37]]}
[]
[]
[null,"UNIDADE ESCOLAR",null,null,null,null,null,null,"PRAZO"]
[null,{"$f":"Orçamento!$O$4","v":"COLÉGIO ESTADUAL EXALTINA SOARES DOS SANTOS"},null,null,null,null,null,null,"240 DIAS CORRIDOS"]
[]
[null,"OBRA",null,null,null,null,null,null,"DATA"]
[null,{"$f":"Orçamento!$O$7","v":"IMPLANTAÇÃO E CONSTRUÇÃO"},null,null,null,null,null,null,{"$f":"Orçamento!$S$7","v":"2020-07-07"}]
[]
[null,"LOCAL",null,null,null,null,null,null,"ÁREA TOTAL CONSTRUÍDA (M²)"]
["FILTRO",{"$f":"Orçamento!$X$7","v":"SIMOLÂNDIA"},null,null,null,null,null,null,{"$f":"Orçamento!$S$13","v":1496.75}]
[]
[null,"CRONOGRAMA - FÍSICO FINANCEIRO"]
["↓","CUSTO TOTAL:",{"$f":"D93","v":0},"VALOR","Dias:",30,null,null,null,60,null,null,null,90,null,null,null,120,null,null,null,150,null,null,null,180,null,null,null,210,null,null,null,240,null,null,null,"TOTAL"]
[null,"DESCRIÇÃO DOS SERVIÇOS",null,null,"%","1ª PARCELA",null,null,null,"2ª PARCELA",null,null,null,"3ª PARCELA",null,null,null,"4ª PARCELA",null,null,null,"5ª PARCELA",null,null,null,"6ª PARCELA",null,null,null,"7ª PARCELA",null,null,null,"8ª PARCELA"]
[{"$f":"IF(D15>0,\"F\",\"\")","v":""},"SERVIÇOS PRELIMINARES",null,{"$f":"Orçamento!X1347","v":0},{"$f":"Orçamento!AA1347","v":0},{"$f":"ROUND(F17*$D$15,2)","v":0},null,null,null,{"$f":"ROUND(J17*$D$15,2)","v":0},null,null,null,{"$f":"ROUND(N17*$D$15,2)","v":0},null,null,null,{"$f":"ROUND(R17*$D$15,2)","v":0},null,null,null,{"$f":"ROUND(V17*$D$15,2)","v":0},null,null,null,{"$f":"ROUND(Z17*$D$15,2)","v":0},null,null,null,{"$f":"ROUND(AD17*$D$15,2)","v":0},null,null,null,{"$f":"ROUND(AH17*$D$15,2)","v":0},null,null,null,{"$f":"SUM(F15:AK16)","v":0},{"$f":"IF(AL15=D15,\"OK\",\"ERRO\")","v":"OK"}]
[{"$f":"IF(A15=\"F\",A15,\"\")","v":""}]
[{"$f":"IF(A16=\"F\",A16,\"\")","v":""},null,null,null,null,0.41,null,null,null,8.2000000000000003E-2,null,null,null,8.3000000000000004E-2,null,null,null,{"$f":"N17","v":8.3000000000000004E-2},null,null,null,{"$f":"R17","v":8.3000000000000004E-2},null,null,null,{"$f":"V17","v":8.3000000000000004E-2},null,null,null,8.4000000000000005E-2,null,null,null,{"$f":"1-SUM(F17:AG17)","v":9.2000000000000193E-2},null,null,null,{"$f":"IFERROR(E15/100,\"\")","v":0},{"$f":"IF((F17+J17+AH17+N17+R17+V17+Z17+AD17)=100%,\"OK\",\"ERRO\")","v":"OK"}]
[{"$f":"IF(D18>0,\"F\",\"\")","v":""},"TRANSPORTES",null,{"$f":"Orçamento!X1348","v":0},{"$f":"Orçamento!AA1348","v":0},{"$f":"ROUND(F20*$D$18,2)","v":0},null,null,null,{"$f":"ROUND(J20*$D$18,2)","v":0},null,null,null,{"$f":"ROUND(N20*$D$18,2)","v":0},null,null,null,{"$f":"ROUND(R20*$D$18,2)","v":0},null,null,null,{"$f":"ROUND(V20*$D$18,2)","v":0},null,null,null,{"$f":"ROUND(Z20*$D$18,2)","v":0},null,null,null,{"$f":"ROUND(AD20*$D$18,2)","v":0},null,null,null,{"$f":"ROUND(AH20*$D$18,2)","v":0},null,null,null,{"$f":"SUM(F18:AK18)","v":0},{"$f":"IF(AL18=D18,\"OK\",\"ERRO\")","v":"OK"}]
[{"$f":"IF(A18=\"F\",A18,\"\")","v":""}]
[{"$f":"IF(A19=\"F\",A19,\"\")","v":""},null,null,null,null,0.12,null,null,null,{"$f":"F20","v":0.12},null,null,null,{"$f":"J20","v":0.12},null,null,null,{"$f":"N20","v":0.12},null,null,null,{"$f":"R20","v":0.12},null,null,null,{"$f":"V20","v":0.12},null,null,null,0.15,null,null,null,{"$f":"1-SUM(F20:AG20)","v":0.13},null,null,null,{"$f":"IFERROR(E18/100,\"\")","v":0},{"$f":"IF((F20+J20+AH20+N20+R20+V20+Z20+AD20)=100%,\"OK\",\"ERRO\")","v":"OK"}]
[{"$f":"IF(D21>0,\"F\",\"\")","v":""},"SERVIÇO EM TERRA",null,{"$f":"Orçamento!X1349","v":0},{"$f":"Orçamento!AA1349","v":0},{"$f":"ROUND(F23*$D$21,2)","v":0},null,null,null,{"$f":"ROUND(J23*$D$21,2)","v":0},null,null,null,{"$f":"ROUND(N23*$D$21,2)","v":0},null,null,null,{"$f":"ROUND(R23*$D$21,2)","v":0},null,null,null,{"$f":"ROUND(V23*$D$21,2)","v":0},null,null,null,{"$f":"ROUND(Z23*$D$21,2)","v":0},null,null,null,{"$f":"ROUND(AD23*$D$21,2)","v":0},null,null,null,{"$f":"ROUND(AH23*$D$21,2)","v":0},null,null,null,{"$f":"SUM(F21:AK21)","v":0},{"$f":"IF(AL21=D21,\"OK\",\"ERRO\")","v":"OK"}]
[{"$f":"IF(A21=\"F\",A21,\"\")","v":""}]
[{"$f":"IF(A22=\"F\",A22,\"\")","v":""},null,null,null,null,0.28749999999999998,null,null,null,0.14349999999999999,null,null,null,0.1825,null,null,null,0.18149999999999999,null,null,null,0,null,null,null,0.20499999999999999,null,null,null,0,null,null,null,0,null,null,null,{"$f":"IFERROR(E21/100,\"\")","v":0},{"$f":"IF((F23+J23+AH23+N23+R23+V23+Z23+AD23)=100%,\"OK\",\"ERRO\")","v":"OK"}]
[{"$f":"IF(D24>0,\"F\",\"\")","v":""},"FUNDAÇÕES E SONDAGENS",null,{"$f":"Orçamento!X1350","v":0},{"$f":"Orçamento!AA1350","v":0},{"$f":"ROUND(F26*$D$24,2)","v":0},null,null,null,{"$f":"ROUND(J26*$D$24,2)","v":0},null,null,null,{"$f":"ROUND(N26*$D$24,2)","v":0},null,null,null,{"$f":"ROUND(R26*$D$24,2)","v":0},null,null,null,{"$f":"ROUND(V26*$D$24,2)","v":0},null,null,null,{"$f":"ROUND(Z26*$D$24,2)","v":0},null,null,null,{"$f":"ROUND(AD26*$D$24,2)","v":0},null,null,null,{"$f":"ROUND(AH26*$D$24,2)","v":0},null,null,null,{"$f":"SUM(F24:AK24)","v":0},{"$f":"IF(AL24=D24,\"OK\",\"ERRO\")","v":"OK"}]
[{"$f":"IF(A24=\"F\",A24,\"\")","v":""}]
[{"$f":"IF(A25=\"F\",A25,\"\")","v":""},null,null,null,null,0,null,null,null,0.23899999999999999,null,null,null,{"$f":"J26","v":0.23899999999999999},null,null,null,0,null,null,null,0.13,null,null,null,{"$f":"1-SUM(J26:Y26)","v":0.39200000000000002},null,null,null,0,null,null,null,0,null,null,null,{"$f":"IFERROR(E24/100,\"\")","v":0},{"$f":"IF((F26+J26+AH26+N26+R26+V26+Z26+AD26)=100%,\"OK\",\"ERRO\")","v":"OK"}]
[{"$f":"IF(D27>0,\"F\",\"\")","v":""},"ESTRUTURA",null,{"$f":"Orçamento!X1351","v":0},{"$f":"Orçamento!AA1351","v":0},{"$f":"ROUND(F29*$D$27,2)","v":0},null,null,null,{"$f":"ROUND(J29*$D$27,2)","v":0},null,null,null,{"$f":"ROUND(N29*$D$27,2)","v":0},null,null,null,{"$f":"ROUND(R29*$D$27,2)","v":0},null,null,null,{"$f":"ROUND(V29*$D$27,2)","v":0},null,null,null,{"$f":"ROUND(Z29*$D$27,2)","v":0},null,null,null,{"$f":"ROUND(AD29*$D$27,2)","v":0},null,null,null,{"$f":"ROUND(AH29*$D$27,2)","v":0},null,null,null,{"$f":"SUM(F27:AK27)","v":0},{"$f":"IF(AL27=D27,\"OK\",\"ERRO\")","v":"OK"}]
[{"$f":"IF(A27=\"F\",A27,\"\")","v":""}]
[{"$f":"IF(A28=\"F\",A28,\"\")","v":""},null,null,null,null,0,null,null,null,0.23,null,null,null,0.17449999999999999,null,null,null,0.183,null,null,null,0,null,null,null,0.21,null,null,null,0.20250000000000012,null,null,null,0,null,null,null,{"$f":"IFERROR(E27/100,\"\")","v":0},{"$f":"IF((F29+J29+AH29+N29+R29+V29+Z29+AD29)=100%,\"OK\",\"ERRO\")","v":"OK"}]
[{"$f":"IF(D30>0,\"F\",\"\")","v":""},"INST.ELET/TELEFÔNICA/CABEAMENTO ESTRUTURADO",null,{"$f":"Orçamento!X1352","v":0},{"$f":"Orçamento!AA1352","v":0},{"$f":"ROUND(F32*$D$30,2)","v":0},null,null,null,{"$f":"ROUND(J32*$D$30,2)","v":0},null,null,null,{"$f":"ROUND(N32*$D$30,2)","v":0},null,null,null,{"$f":"ROUND(R32*$D$30,2)","v":0},null,null,null,{"$f":"ROUND(V32*$D$30,2)","v":0},null,null,null,{"$f":"ROUND(Z32*$D$30,2)","v":0},null,null,null,{"$f":"ROUND(AD32*$D$30,2)","v":0},null,null,null,{"$f":"ROUND(AH32*$D$30,2)","v":0},null,null,null,{"$f":"SUM(F30:AK30)","v":0},{"$f":"IF(AL30=D30,\"OK\",\"ERRO\")","v":"OK"}]
[{"$f":"IF(A30=\"F\",A30,\"\")","v":""}]
[{"$f":"IF(A31=\"F\",A31,\"\")","v":""},null,null,null,null,0,null,null,null,0.13,null,null,null,{"$f":"J32","v":0.13},null,null,null,{"$f":"N32","v":0.13},null,null,null,{"$f":"R32","v":0.13},null,null,null,0.2,null,null,null,0.21,null,null,null,{"$f":"1-SUM(F32:AG32)","v":7.0000000000000062E-2},null,null,null,{"$f":"IFERROR(E30/100,\"\")","v":0},{"$f":"IF((F32+J32+AH32+N32+R32+V32+Z32+AD32)=100%,\"OK\",\"ERRO\")","v":"OK"}]
[{"$f":"IF(D33>0,\"F\",\"\")","v":""},"INSTALAÇÕES HIDROSSANITÁRIAS",null,{"$f":"Orçamento!X1353","v":0},{"$f":"Orçamento!AA1353","v":0},{"$f":"ROUND(F35*$D$33,2)","v":0},null,null,null,{"$f":"ROUND(J35*$D$33,2)","v":0},null,null,null,{"$f":"ROUND(N35*$D$33,2)","v":0},null,null,null,{"$f":"ROUND(R35*$D$33,2)","v":0},null,null,null,{"$f":"ROUND(V35*$D$33,2)","v":0},null,null,null,{"$f":"ROUND(Z35*$D$33,2)","v":0},null,null,null,{"$f":"ROUND(AD35*$D$33,2)","v":0},null,null,null,{"$f":"ROUND(AH35*$D$33,2)","v":0},null,null,null,{"$f":"SUM(F33:AK33)","v":0},{"$f":"IF(AL33=D33,\"OK\",\"ERRO\")","v":"OK"}]
[{"$f":"IF(A33=\"F\",A33,\"\")","v":""}]
[{"$f":"IF(A34=\"F\",A34,\"\")","v":""},null,null,null,null,0.1,null,null,null,{"$f":"F35","v":0.1},null,null,null,{"$f":"J35","v":0.1},null,null,null,{"$f":"N35","v":0.1},null,null,null,{"$f":"R35","v":0.1},null,null,null,{"$f":"V35","v":0.1},null,null,null,0.14000000000000001,null,null,null,{"$f":"1-SUM(F35:AG35)","v":0.26},null,null,null,{"$f":"IFERROR(E33/100,\"\")","v":0},{"$f":"IF((F35+J35+AH35+N35+R35+V35+Z35+AD35)=100%,\"OK\",\"ERRO\")","v":"OK"}]
[{"$f":"IF(D36>0,\"F\",\"\")","v":""},"INSTALAÇÕES ESPECIAIS",null,{"$f":"Orçamento!X1354","v":0},{"$f":"Orçamento!AA1354","v":0},{"$f":"ROUND(F38*$D$36,2)","v":0},null,null,null,{"$f":"ROUND(J38*$D$36,2)","v":0},null,null,null,{"$f":"ROUND(N38*$D$36,2)","v":0},null,null,null,{"$f":"ROUND(R38*$D$36,2)","v":0},null,null,null,{"$f":"ROUND(V38*$D$36,2)","v":0},null,null,null,{"$f":"ROUND(Z38*$D$36,2)","v":0},null,null,null,{"$f":"ROUND(AD38*$D$36,2)","v":0},null,null,null,{"$f":"ROUND(AH38*$D$36,2)","v":0},null,null,null,{"$f":"SUM(F36:AK36)","v":0},{"$f":"IF(AL36=D36,\"OK\",\"ERRO\")","v":"OK"}]
[{"$f":"IF(A36=\"F\",A36,\"\")","v":""}]
[{"$f":"IF(A37=\"F\",A37,\"\")","v":""},null,null,null,null,null,null,null,null,null,null,null,null,null,null,null,null,null,null,null,null,null,null,null,null,null,null,null,null,null,null,null,null,1,null,null,null,{"$f":"IFERROR(E36/100,\"\")","v":0},{"$f":"IF((F38+J38+AH38+N38+R38+V38+Z38+AD38)=100%,\"OK\",\"ERRO\")","v":"OK"}]
[{"$f":"IF(D39>0,\"F\",\"\")","v":""},"ALVENARIA E DIVISÓRIAS",null,{"$f":"Orçamento!X1355","v":0},{"$f":"Orçamento!AA1355","v":0},{"$f":"ROUND(F41*$D$39,2)","v":0},null,null,null,{"$f":"ROUND(J41*$D$39,2)","v":0},null,null,null,{"$f":"ROUND(N41*$D$39,2)","v":0},null,null,null,{"$f":"ROUND(R41*$D$39,2)","v":0},null,null,null,{"$f":"ROUND(V41*$D$39,2)","v":0},null,null,null,{"$f":"ROUND(Z41*$D$39,2)","v":0},null,null,null,{"$f":"ROUND(AD41*$D$39,2)","v":0},null,null,null,{"$f":"ROUND(AH41*$D$39,2)","v":0},null,null,null,{"$f":"SUM(F39:AK39)","v":0},{"$f":"IF(AL39=D39,\"OK\",\"ERRO\")","v":"OK"}]
[{"$f":"IF(A39=\"F\",A39,\"\")","v":""}]
[{"$f":"IF(A40=\"F\",A40,\"\")","v":""},null,null,null,null,0,null,null,null,0,null,null,null,0,null,null,null,0.22439999999999999,null,null,null,0.29599999999999999,null,null,null,0.24,null,null,null,{"$f":"1-SUM(R41:AC41)","v":0.23960000000000004},null,null,null,0,null,null,null,{"$f":"IFERROR(E39/100,\"\")","v":0},{"$f":"IF((F41+J41+AH41+N41+R41+V41+Z41+AD41)=100%,\"OK\",\"ERRO\")","v":"OK"}]
[{"$f":"IF(D42>0,\"F\",\"\")","v":""},"ALVENARIA AUTO-PORTANTE",null,{"$f":"Orçamento!X1356","v":0},{"$f":"Orçamento!AA1356","v":0},{"$f":"ROUND(F44*$D$42,2)","v":0},null,null,null,{"$f":"ROUND(J44*$D$42,2)","v":0},null,null,null,{"$f":"ROUND(N44*$D$42,2)","v":0},null,null,null,{"$f":"ROUND(R44*$D$42,2)","v":0},null,null,null,{"$f":"ROUND(V44*$D$42,2)","v":0},null,null,null,{"$f":"ROUND(Z44*$D$42,2)","v":0},null,null,null,{"$f":"ROUND(AD44*$D$42,2)","v":0},null,null,null,{"$f":"ROUND(AH44*$D$42,2)","v":0},null,null,null,{"$f":"SUM(F42:AK42)","v":0}]
[{"$f":"IF(A42=\"F\",A42,\"\")","v":""}]
[{"$f":"IF(A43=\"F\",A43,\"\")","v":""},null,null,null,null,1,null,null,null,{"$f":"1-F44","v":0},null,null,null,{"$f":"1-J44","v":1},null,null,null,{"$f":"1-N44","v":0},null,null,null,{"$f":"1-R44","v":1},null,null,null,{"$f":"1-V44","v":0},null,null,null,{"$f":"1-Z44","v":1},null,null,null,{"$f":"1-AD44","v":0},null,null,null,{"$f":"IFERROR(E42/100,\"\")","v":0}]
[{"$f":"IF(D45>0,\"F\",\"\")","v":""},"IMPERMEABILIZAÇÃO",null,{"$f":"Orçamento!X1357","v":0},{"$f":"Orçamento!AA1357","v":0},{"$f":"ROUND(F47*$D$45,2)","v":0},null,null,null,{"$f":"ROUND(J47*$D$45,2)","v":0},null,null,null,{"$f":"ROUND(N47*$D$45,2)","v":0},null,null,null,{"$f":"ROUND(R47*$D$45,2)","v":0},null,null,null,{"$f":"ROUND(V47*$D$45,2)","v":0},null,null,null,{"$f":"ROUND(Z47*$D$45,2)","v":0},null,null,null,{"$f":"ROUND(AD47*$D$45,2)","v":0},null,null,null,{"$f":"ROUND(AH47*$D$45,2)","v":0},null,null,null,{"$f":"SUM(F45:AK45)","v":0},{"$f":"IF(AL45=D45,\"OK\",\"ERRO\")","v":"OK"}]
[{"$f":"IF(A45=\"F\",A45,\"\")","v":""}]
[{"$f":"IF(A46=\"F\",A46,\"\")","v":""},null,null,null,null,0,null,null,null,0.24,null,null,null,0.20349999999999999,null,null,null,0,null,null,null,0.23200000000000001,null,null,null,0,null,null,null,{"$f":"1-SUM(F47:AC47)","v":0.32450000000000001},null,null,null,null,null,null,null,{"$f":"IFERROR(E45/100,\"\")","v":0},{"$f":"IF((F47+J47+AH47+N47+R47+V47+Z47+AD47)=100%,\"OK\",\"ERRO\")","v":"OK"}]
[{"$f":"IF(D48>0,\"F\",\"\")","v":""},"ISOLAMENTO TÉRMICO E ACÚSTICO",null,{"$f":"Orçamento!X1358","v":0},{"$f":"Orçamento!AA1358","v":0},{"$f":"ROUND(F50*$D$48,2)","v":0},null,null,null,{"$f":"ROUND(J50*$D$48,2)","v":0},null,null,null,{"$f":"ROUND(N50*$D$48,2)","v":0},null,null,null,{"$f":"ROUND(R50*$D$48,2)","v":0},null,null,null,{"$f":"ROUND(V50*$D$48,2)","v":0},null,null,null,{"$f":"ROUND(Z50*$D$48,2)","v":0},null,null,null,{"$f":"ROUND(AD50*$D$48,2)","v":0},null,null,null,{"$f":"ROUND(AH50*$D$48,2)","v":0},null,null,null,{"$f":"SUM(F48:AK48)","v":0}]
[{"$f":"IF(A48=\"F\",A48,\"\")","v":""}]
[{"$f":"IF(A49=\"F\",A49,\"\")","v":""},null,null,null,null,0.5,null,null,null,{"$f":"1-F50","v":0.5},null,null,null,{"$f":"1-J50","v":0.5},null,null,null,{"$f":"1-N50","v":0.5},null,null,null,{"$f":"1-R50","v":0.5},null,null,null,{"$f":"1-V50","v":0.5},null,null,null,{"$f":"1-Z50","v":0.5},null,null,null,{"$f":"1-AD50","v":0.5},null,null,null,{"$f":"IFERROR(E48/100,\"\")","v":0}]
[{"$f":"IF(D51>0,\"F\",\"\")","v":""},"ESTRUTURA DE MADEIRA",null,{"$f":"Orçamento!X1359","v":0},{"$f":"Orçamento!AA1359","v":0},{"$f":"ROUND(F53*$D$51,2)","v":0},null,null,null,{"$f":"ROUND(J53*$D$51,2)","v":0},null,null,null,{"$f":"ROUND(N53*$D$51,2)","v":0},null,null,null,{"$f":"ROUND(R53*$D$51,2)","v":0},null,null,null,{"$f":"ROUND(V53*$D$51,2)","v":0},null,null,null,{"$f":"ROUND(Z53*$D$51,2)","v":0},null,null,null,{"$f":"ROUND(AD53*$D$51,2)","v":0},null,null,null,{"$f":"ROUND(AH53*$D$51,2)","v":0},null,null,null,{"$f":"SUM(F51:AK51)","v":0}]
[{"$f":"IF(A51=\"F\",A51,\"\")","v":""}]
[{"$f":"IF(A52=\"F\",A52,\"\")","v":""},null,null,null,null,0.4,null,null,null,{"$f":"1-F53","v":0.6},null,null,null,{"$f":"1-J53","v":0.4},null,null,null,{"$f":"1-N53","v":0.6},null,null,null,{"$f":"1-R53","v":0.4},null,null,null,{"$f":"1-V53","v":0.6},null,null,null,{"$f":"1-Z53","v":0.4},null,null,null,{"$f":"1-AD53","v":0.6},null,null,null,{"$f":"IFERROR(E51/100,\"\")","v":0}]
[{"$f":"IF(D54>0,\"F\",\"\")","v":""},"ESTRUTURA METÁLICA",null,{"$f":"Orçamento!X1360","v":0},{"$f":"Orçamento!AA1360","v":0},{"$f":"ROUND(F56*$D$54,2)","v":0},null,null,null,{"$f":"ROUND(J56*$D$54,2)","v":0},null,null,null,{"$f":"ROUND(N56*$D$54,2)","v":0},null,null,null,{"$f":"ROUND(R56*$D$54,2)","v":0},null,null,null,{"$f":"ROUND(V56*$D$54,2)","v":0},null,null,null,{"$f":"ROUND(Z56*$D$54,2)","v":0},null,null,null,{"$f":"ROUND(AD56*$D$54,2)","v":0},null,null,null,{"$f":"ROUND(AH56*$D$54,2)","v":0},null,null,null,{"$f":"SUM(F54:AK54)","v":0},{"$f":"IF(AL54=D54,\"OK\",\"ERRO\")","v":"OK"}]
[{"$f":"IF(A54=\"F\",A54,\"\")","v":""}]
[{"$f":"IF(A55=\"F\",A55,\"\")","v":""},null,null,null,null,0,null,null,null,0,null,null,null,0,null,null,null,0,null,null,null,0.26100000000000001,null,null,null,0.25,null,null,null,{"$f":"1-SUM(V56:AC56)","v":0.48899999999999999},null,null,null,0,null,null,null,{"$f":"IFERROR(E54/100,\"\")","v":0},{"$f":"IF((F56+J56+AH56+N56+R56+V56+Z56+AD56)=100%,\"OK\",\"ERRO\")","v":"OK"}]
[{"$f":"IF(D57>0,\"F\",\"\")","v":""},"COBERTURAS",null,{"$f":"Orçamento!X1361","v":0},{"$f":"Orçamento!AA1361","v":0},{"$f":"ROUND(F59*$D$57,2)","v":0},null,null,null,{"$f":"ROUND(J59*$D$57,2)","v":0},null,null,null,{"$f":"ROUND(N59*$D$57,2)","v":0},null,null,null,{"$f":"ROUND(R59*$D$57,2)","v":0},null,null,null,{"$f":"ROUND(V59*$D$57,2)","v":0},null,null,null,{"$f":"ROUND(Z59*$D$57,2)","v":0},null,null,null,{"$f":"ROUND(AD59*$D$57,2)","v":0},null,null,null,{"$f":"ROUND(AH59*$D$57,2)","v":0},null,null,null,{"$f":"SUM(F57:AK57)","v":0},{"$f":"IF(AL57=D57,\"OK\",\"ERRO\")","v":"OK"}]
[{"$f":"IF(A57=\"F\",A57,\"\")","v":""}]
[{"$f":"IF(A58=\"F\",A58,\"\")","v":""},null,null,null,null,0,null,null,null,0,null,null,null,0,null,null,null,0,null,null,null,0,null,null,null,0.42,null,null,null,0.49,null,null,null,9.000000000000008E-2,null,null,null,{"$f":"IFERROR(E57/100,\"\")","v":0},{"$f":"IF((F59+J59+AH59+N59+R59+V59+Z59+AD59)=100%,\"OK\",\"ERRO\")","v":"OK"}]
[{"$f":"IF(D60>0,\"F\",\"\")","v":""},"ESQUADRIAS DE MADEIRA",null,{"$f":"Orçamento!X1362","v":0},{"$f":"Orçamento!AA1362","v":0},{"$f":"ROUND(F62*$D$60,2)","v":0},null,null,null,{"$f":"ROUND(J62*$D$60,2)","v":0},null,null,null,{"$f":"ROUND(N62*$D$60,2)","v":0},null,null,null,{"$f":"ROUND(R62*$D$60,2)","v":0},null,null,null,{"$f":"ROUND(V62*$D$60,2)","v":0},null,null,null,{"$f":"ROUND(Z62*$D$60,2)","v":0},null,null,null,{"$f":"ROUND(AD62*$D$60,2)","v":0},null,null,null,{"$f":"ROUND(AH62*$D$60,2)","v":0},null,null,null,{"$f":"SUM(F60:AK60)","v":0}]
[{"$f":"IF(A60=\"F\",A60,\"\")","v":""}]
[{"$f":"IF(A61=\"F\",A61,\"\")","v":""},null,null,null,null,0.54,null,null,null,{"$f":"1-F62","v":0.45999999999999996},null,null,null,{"$f":"1-J62","v":0.54},null,null,null,{"$f":"1-N62","v":0.45999999999999996},null,null,null,{"$f":"1-R62","v":0.54},null,null,null,{"$f":"1-V62","v":0.45999999999999996},null,null,null,{"$f":"1-Z62","v":0.54},null,null,null,{"$f":"1-AD62","v":0.45999999999999996},null,null,null,{"$f":"IFERROR(E60/100,\"\")","v":0}]
[{"$f":"IF(D63>0,\"F\",\"\")","v":""},"ESQUADRIAS METÁLICAS",null,{"$f":"Orçamento!X1363","v":0},{"$f":"Orçamento!AA1363","v":0},{"$f":"ROUND(F65*$D$63,2)","v":0},null,null,null,{"$f":"ROUND(J65*$D$63,2)","v":0},null,null,null,{"$f":"ROUND(N65*$D$63,2)","v":0},null,null,null,{"$f":"ROUND(R65*$D$63,2)","v":0},null,null,null,{"$f":"ROUND(V65*$D$63,2)","v":0},null,null,null,{"$f":"ROUND(Z65*$D$63,2)","v":0},null,null,null,{"$f":"ROUND(AD65*$D$63,2)","v":0},null,null,null,{"$f":"ROUND(AH65*$D$63,2)","v":0},null,null,null,{"$f":"SUM(F63:AK63)","v":0},{"$f":"IF(AL63=D63,\"OK\",\"ERRO\")","v":"OK"}]
[{"$f":"IF(A63=\"F\",A63,\"\")","v":""}]
[{"$f":"IF(A64=\"F\",A64,\"\")","v":""},null,null,null,null,0,null,null,null,0,null,null,null,0,null,null,null,0,null,null,null,0,null,null,null,0,null,null,null,0.4,null,null,null,0.6,null,null,null,{"$f":"IFERROR(E63/100,\"\")","v":0},{"$f":"IF((F65+J65+AH65+N65+R65+V65+Z65+AD65)=100%,\"OK\",\"ERRO\")","v":"OK"}]
[{"$f":"IF(D66>0,\"F\",\"\")","v":""},"VIDROS",null,{"$f":"Orçamento!X1364","v":0},{"$f":"Orçamento!AA1364","v":0},{"$f":"ROUND(F68*$D$66,2)","v":0},null,null,null,{"$f":"ROUND(J68*$D$66,2)","v":0},null,null,null,{"$f":"ROUND(N68*$D$66,2)","v":0},null,null,null,{"$f":"ROUND(R68*$D$66,2)","v":0},null,null,null,{"$f":"ROUND(V68*$D$66,2)","v":0},null,null,null,{"$f":"ROUND(Z68*$D$66,2)","v":0},null,null,null,{"$f":"ROUND(AD68*$D$66,2)","v":0},null,null,null,{"$f":"ROUND(AH68*$D$66,2)","v":0},null,null,null,{"$f":"SUM(F66:AK66)","v":0},{"$f":"IF(AL66=D66,\"OK\",\"ERRO\")","v":"OK"}]
[{"$f":"IF(A66=\"F\",A66,\"\")","v":""}]
[{"$f":"IF(A67=\"F\",A67,\"\")","v":""},null,null,null,null,0,null,null,null,null,null,null,null,0,null,null,null,0,null,null,null,0,null,null,null,0,null,null,null,0,null,null,null,1,null,null,null,{"$f":"IFERROR(E66/100,\"\")","v":0},{"$f":"IF((F68+J68+AH68+N68+R68+V68+Z68+AD68)=100%,\"OK\",\"ERRO\")","v":"OK"}]
[{"$f":"IF(D69>0,\"F\",\"\")","v":""},"REVESTIMENTO DE PAREDE",null,{"$f":"Orçamento!X1365","v":0},{"$f":"Orçamento!AA1365","v":0},{"$f":"ROUND(F71*$D$69,2)","v":0},null,null,null,{"$f":"ROUND(J71*$D$69,2)","v":0},null,null,null,{"$f":"ROUND(N71*$D$69,2)","v":0},null,null,null,{"$f":"ROUND(R71*$D$69,2)","v":0},null,null,null,{"$f":"ROUND(V71*$D$69,2)","v":0},null,null,null,{"$f":"ROUND(Z71*$D$69,2)","v":0},null,null,null,{"$f":"ROUND(AD71*$D$69,2)","v":0},null,null,null,{"$f":"ROUND(AH71*$D$69,2)","v":0},null,null,null,{"$f":"SUM(F69:AK69)","v":0},{"$f":"IF(AL69=D69,\"OK\",\"ERRO\")","v":"OK"}]
[{"$f":"IF(A69=\"F\",A69,\"\")","v":""}]
[{"$f":"IF(A70=\"F\",A70,\"\")","v":""},null,null,null,null,0,null,null,null,0,null,null,null,0,null,null,null,0,null,null,null,0.21,null,null,null,0.45,null,null,null,0.33999999999999997,null,null,null,0,null,null,null,{"$f":"IFERROR(E69/100,\"\")","v":0},{"$f":"IF((F71+J71+AH71+N71+R71+V71+Z71+AD71)=100%,\"OK\",\"ERRO\")","v":"OK"}]
[{"$f":"IF(D72>0,\"F\",\"\")","v":""},"FORROS",null,{"$f":"Orçamento!X1366","v":0},{"$f":"Orçamento!AA1366","v":0},{"$f":"ROUND(F74*$D$72,2)","v":0},null,null,null,{"$f":"ROUND(J74*$D$72,2)","v":0},null,null,null,{"$f":"ROUND(N74*$D$72,2)","v":0},null,null,null,{"$f":"ROUND(R74*$D$72,2)","v":0},null,null,null,{"$f":"ROUND(V74*$D$72,2)","v":0},null,null,null,{"$f":"ROUND(Z74*$D$72,2)","v":0},null,null,null,{"$f":"ROUND(AD74*$D$72,2)","v":0},null,null,null,{"$f":"ROUND(AH74*$D$72,2)","v":0},null,null,null,{"$f":"SUM(F72:AK72)","v":0},{"$f":"IF(AL72=D72,\"OK\",\"ERRO\")","v":"OK"}]
[{"$f":"IF(A72=\"F\",A72,\"\")","v":""}]
[{"$f":"IF(A73=\"F\",A73,\"\")","v":""},null,null,null,null,0,null,null,null,0,null,null,null,0,null,null,null,0,null,null,null,0,null,null,null,0,null,null,null,0,null,null,null,1,null,null,null,{"$f":"IFERROR(E72/100,\"\")","v":0},{"$f":"IF((F74+J74+AH74+N74+R74+V74+Z74+AD74)=100%,\"OK\",\"ERRO\")","v":"OK"}]
[{"$f":"IF(D75>0,\"F\",\"\")","v":""},"REVESTIMENTO DE PISO",null,{"$f":"Orçamento!X1367","v":0},{"$f":"Orçamento!AA1367","v":0},{"$f":"ROUND(F77*$D$75,2)","v":0},null,null,null,{"$f":"ROUND(J77*$D$75,2)","v":0},null,null,null,{"$f":"ROUND(N77*$D$75,2)","v":0},null,null,null,{"$f":"ROUND(R77*$D$75,2)","v":0},null,null,null,{"$f":"ROUND(V77*$D$75,2)","v":0},null,null,null,{"$f":"ROUND(Z77*$D$75,2)","v":0},null,null,null,{"$f":"ROUND(AD77*$D$75,2)","v":0},null,null,null,{"$f":"ROUND(AH77*$D$75,2)","v":0},null,null,null,{"$f":"SUM(F75:AK75)","v":0},{"$f":"IF(AL75=D75,\"OK\",\"ERRO\")","v":"OK"}]
[{"$f":"IF(A75=\"F\",A75,\"\")","v":""}]
[{"$f":"IF(A76=\"F\",A76,\"\")","v":""},null,null,null,null,0,null,null,null,0,null,null,null,0,null,null,null,0.09,null,null,null,0.17,null,null,null,0,null,null,null,0.14299999999999999,null,null,null,0.59699999999999998,null,null,null,{"$f":"IFERROR(E75/100,\"\")","v":0},{"$f":"IF((F77+J77+AH77+N77+R77+V77+Z77+AD77)=100%,\"OK\",\"ERRO\")","v":"OK"}]
[{"$f":"IF(D78>0,\"F\",\"\")","v":""},"FERRAGENS",null,{"$f":"Orçamento!X1368","v":0},{"$f":"Orçamento!AA1368","v":0},{"$f":"ROUND(F80*$D$78,2)","v":0},null,null,null,{"$f":"ROUND(J80*$D$78,2)","v":0},null,null,null,{"$f":"ROUND(N80*$D$78,2)","v":0},null,null,null,{"$f":"ROUND(R80*$D$78,2)","v":0},null,null,null,{"$f":"ROUND(V80*$D$78,2)","v":0},null,null,null,{"$f":"ROUND(Z80*$D$78,2)","v":0},null,null,null,{"$f":"ROUND(AD80*$D$78,2)","v":0},null,null,null,{"$f":"ROUND(AH80*$D$78,2)","v":0},null,null,null,{"$f":"SUM(F78:AK78)","v":0},{"$f":"IF(AL78=D78,\"OK\",\"ERRO\")","v":"OK"}]
[{"$f":"IF(A78=\"F\",A78,\"\")","v":""}]
[{"$f":"IF(A79=\"F\",A79,\"\")","v":""},null,null,null,null,null,null,null,null,null,null,null,null,0,null,null,null,0,null,null,null,0,null,null,null,0,null,null,null,0,null,null,null,1,null,null,null,{"$f":"IFERROR(E78/100,\"\")","v":0},{"$f":"IF((F80+J80+AH80+N80+R80+V80+Z80+AD80)=100%,\"OK\",\"ERRO\")","v":"OK"}]
[{"$f":"IF(D81>0,\"F\",\"\")","v":""},"MARCENARIA",null,{"$f":"Orçamento!X1369","v":0},{"$f":"Orçamento!AA1369","v":0},{"$f":"ROUND(F83*$D$81,2)","v":0},null,null,null,{"$f":"ROUND(J83*$D$81,2)","v":0},null,null,null,{"$f":"ROUND(N83*$D$81,2)","v":0},null,null,null,{"$f":"ROUND(R83*$D$81,2)","v":0},null,null,null,{"$f":"ROUND(V83*$D$81,2)","v":0},null,null,null,{"$f":"ROUND(Z83*$D$81,2)","v":0},null,null,null,{"$f":"ROUND(AD83*$D$81,2)","v":0},null,null,null,{"$f":"ROUND(AH83*$D$81,2)","v":0},null,null,null,{"$f":"SUM(F81:AK81)","v":0},{"$f":"IF(AL81=D81,\"OK\",\"ERRO\")","v":"OK"}]
[{"$f":"IF(A81=\"F\",A81,\"\")","v":""}]
[{"$f":"IF(A82=\"F\",A82,\"\")","v":""},null,null,null,null,null,null,null,null,null,null,null,null,0,null,null,null,0,null,null,null,0,null,null,null,0,null,null,null,0,null,null,null,1,null,null,null,{"$f":"IFERROR(E81/100,\"\")","v":0},{"$f":"IF((F83+J83+AH83+N83+R83+V83+Z83+AD83)=100%,\"OK\",\"ERRO\")","v":"OK"}]
[{"$f":"IF(D84>0,\"F\",\"\")","v":""},"ADMINISTRAÇÃO - MENSALISTAS",null,{"$f":"Orçamento!X1370","v":0},{"$f":"Orçamento!AA1370","v":0},{"$f":"ROUND(F86*$D$84,2)","v":0},null,null,null,{"$f":"ROUND(J86*$D$84,2)","v":0},null,null,null,{"$f":"ROUND(N86*$D$84,2)","v":0},null,null,null,{"$f":"ROUND(R86*$D$84,2)","v":0},null,null,null,{"$f":"ROUND(V86*$D$84,2)","v":0},null,null,null,{"$f":"ROUND(Z86*$D$84,2)","v":0},null,null,null,{"$f":"ROUND(AD86*$D$84,2)","v":0},null,null,null,{"$f":"ROUND(AH86*$D$84,2)","v":0},null,null,null,{"$f":"SUM(F84:AK84)","v":0},{"$f":"IF(AL84=D84,\"OK\",\"ERRO\")","v":"OK"}]
[{"$f":"IF(A84=\"F\",A84,\"\")","v":""}]
[{"$f":"IF(A85=\"F\",A85,\"\")","v":""},null,null,null,null,0.123,null,null,null,{"$f":"F86","v":0.123},null,null,null,{"$f":"J86","v":0.123},null,null,null,{"$f":"N86","v":0.123},null,null,null,{"$f":"R86","v":0.123},null,null,null,{"$f":"V86","v":0.123},null,null,null,{"$f":"Z86","v":0.123},null,null,null,{"$f":"1-SUM(F86:AG86)","v":0.13900000000000001},null,null,null,{"$f":"IFERROR(E84/100,\"\")","v":0},{"$f":"IF((F86+J86+AH86+N86+R86+V86+Z86+AD86)=100%,\"OK\",\"ERRO\")","v":"OK"}]
[{"$f":"IF(D87>0,\"F\",\"\")","v":""},"PINTURA",null,{"$f":"Orçamento!X1371","v":0},{"$f":"Orçamento!AA1371","v":0},{"$f":"ROUND(F89*$D$87,2)","v":0},null,null,null,{"$f":"ROUND(J89*$D$87,2)","v":0},null,null,null,{"$f":"ROUND(N89*$D$87,2)","v":0},null,null,null,{"$f":"ROUND(R89*$D$87,2)","v":0},null,null,null,{"$f":"ROUND(V89*$D$87,2)","v":0},null,null,null,{"$f":"ROUND(Z89*$D$87,2)","v":0},null,null,null,{"$f":"ROUND(AD89*$D$87,2)","v":0},null,null,null,{"$f":"ROUND(AH89*$D$87,2)","v":0},null,null,null,{"$f":"SUM(F87:AK87)","v":0},{"$f":"IF(AL87=D87,\"OK\",\"ERRO\")","v":"OK"}]
[{"$f":"IF(A87=\"F\",A87,\"\")","v":""}]
[{"$f":"IF(A88=\"F\",A88,\"\")","v":""},null,null,null,null,0,null,null,null,0,null,null,null,0,null,null,null,0,null,null,null,0,null,null,null,0.25,null,null,null,0.39450000000000002,null,null,null,{"$f":"1-SUM(Z89:AG89)","v":0.35549999999999993},null,null,null,{"$f":"IFERROR(E87/100,\"\")","v":0},{"$f":"IF((F89+J89+AH89+N89+R89+V89+Z89+AD89)=100%,\"OK\",\"ERRO\")","v":"OK"}]
[{"$f":"IF(D90>0,\"F\",\"\")","v":""},"DIVERSOS",null,{"$f":"Orçamento!X1372","v":0},{"$f":"Orçamento!AA1372","v":0},{"$f":"ROUND(F92*$D$90,2)","v":0},null,null,null,{"$f":"ROUND(J92*$D$90,2)","v":0},null,null,null,{"$f":"ROUND(N92*$D$90,2)","v":0},null,null,null,{"$f":"ROUND(R92*$D$90,2)","v":0},null,null,null,{"$f":"ROUND(V92*$D$90,2)","v":0},null,null,null,{"$f":"ROUND(Z92*$D$90,2)","v":0},null,null,null,{"$f":"ROUND(AD92*$D$90,2)","v":0},null,null,null,{"$f":"ROUND(AH92*$D$90,2)","v":0},null,null,null,{"$f":"SUM(F90:AK90)","v":0},{"$f":"IF(AL90=D90,\"OK\",\"ERRO\")","v":"OK"}]
[{"$f":"IF(A90=\"F\",A90,\"\")","v":""}]
[{"$f":"IF(A91=\"F\",A91,\"\")","v":""},null,null,null,null,0.19500000000000001,null,null,null,9.0999999999999998E-2,null,null,null,3.7499999999999999E-2,null,null,null,3.39E-2,null,null,null,3.4000000000000002E-2,null,null,null,4.9000000000000002E-2,null,null,null,0.14099999999999999,null,null,null,{"$f":"1-SUM(F92:AG92)","v":0.41860000000000008},null,null,null,{"$f":"IFERROR(E90/100,\"\")","v":0},{"$f":"IF((F92+J92+AH92+N92+R92+V92+Z92+AD92)=100%,\"OK\",\"ERRO\")","v":"OK"}]
["F","CUSTO DO ORÇAMENTO",null,{"$f":"SUM(D15:D92)","v":0},{"$f":"SUM(E15:E92)","v":0},{"$f":"F15+F18+F21+F24+F27+F30+F33+F36+F39+F42+F45+F48+F51+F54+F57+F60+F63+F66+F69+F72+F75+F78+F81+F84+F87+F90","v":0},null,null,null,{"$f":"J15+J18+J21+J24+J27+J30+J33+J36+J39+J42+J45+J48+J51+J54+J57+J60+J63+J66+J69+J72+J75+J78+J81+J84+J87+J90","v":0},null,null,null,{"$f":"N15+N18+N21+N24+N27+N30+N33+N36+N39+N42+N45+N48+N51+N54+N57+N60+N63+N66+N69+N72+N75+N78+N81+N84+N87+N90","v":0},null,null,null,{"$f":"R15+R18+R21+R24+R27+R30+R33+R36+R39+R42+R45+R48+R51+R54+R57+R60+R63+R66+R69+R72+R75+R78+R81+R84+R87+R90","v":0},null,null,null,{"$f":"V15+V18+V21+V24+V27+V30+V33+V36+V39+V42+V45+V48+V51+V54+V57+V60+V63+V66+V69+V72+V75+V78+V81+V84+V87+V90","v":0},null,null,null,{"$f":"Z15+Z18+Z21+Z24+Z27+Z30+Z33+Z36+Z39+Z42+Z45+Z48+Z51+Z54+Z57+Z60+Z63+Z66+Z69+Z72+Z75+Z78+Z81+Z84+Z87+Z90","v":0},null,null,null,{"$f":"AD15+AD18+AD21+AD24+AD27+AD30+AD33+AD36+AD39+AD42+AD45+AD48+AD51+AD54+AD57+AD60+AD63+AD66+AD69+AD72+AD75+AD78+AD81+AD84+AD87+AD90","v":0},null,null,null,{"$f":"AH15+AH18+AH21+AH24+AH27+AH30+AH33+AH36+AH39+AH42+AH45+AH48+AH51+AH54+AH57+AH60+AH63+AH66+AH69+AH72+AH75+AH78+AH81+AH84+AH87+AH90","v":0},null,null,null,{"$f":"AL15+AL18+AL21+AL24+AL27+AL30+AL33+AL36+AL39+AL42+AL45+AL48+AL51+AL54+AL57+AL60+AL63+AL66+AL69+AL72+AL75+AL78+AL81+AL84+AL87+AL90","v":0},{"$f":"IF(AL93=D93,\"OK\",\"ERRO\")","v":"OK"}]
["F","PERCENTUAIS:",null,null,null,{"$f":"IFERROR(F93/$D$93,\"\")","v":""},null,null,null,{"$f":"IFERROR(J93/$D$93,\"\")","v":""},null,null,null,{"$f":"IFERROR(N93/$D$93,\"\")","v":""},null,null,null,{"$f":"IFERROR(R93/$D$93,\"\")","v":""},null,null,null,{"$f":"IFERROR(V93/$D$93,\"\")","v":""},null,null,null,{"$f":"IFERROR(Z93/$D$93,\"\")","v":""},null,null,null,{"$f":"IFERROR(AD93/$D$93,\"\")","v":""},null,null,null,{"$f":"IFERROR(AH93/$D$93,\"\")","v":""},null,null,null,{"$f":"SUM(F94:AK94)","v":0}]
["F","TOTAIS ACUMULADOS:",null,null,null,{"$f":"F93","v":0},null,null,null,{"$f":"F95+J93","v":0},null,null,null,{"$f":"J95+N93","v":0},null,null,null,{"$f":"N95+R93","v":0},null,null,null,{"$f":"R95+V93","v":0},null,null,null,{"$f":"V95+Z93","v":0},null,null,null,{"$f":"Z95+AD93","v":0},null,null,null,{"$f":"AD95+AH93","v":0}]
["F","PERCENTUAIS  ACUMULADOS:",null,null,null,{"$f":"F94","v":""},null,null,null,{"$f":"IFERROR(F96+J94,\"\")","v":""},null,null,null,{"$f":"IFERROR(J96+N94,\"\")","v":""},null,null,null,{"$f":"IFERROR(N96+R94,\"\")","v":""},null,null,null,{"$f":"IFERROR(R96+V94,\"\")","v":""},null,null,null,{"$f":"IFERROR(V96+Z94,\"\")","v":""},null,null,null,{"$f":"IFERROR(Z96+AD94,\"\")","v":""},null,null,null,{"$f":"IFERROR(AD96+AH94,\"\")","v":""}]
["F"]
["F","OBSERVAÇÕES:"]
["F","Os pagamentos somente poderão ser efetuados mediante medição e atesto pelos técnicos da Secretaria da Educação. "]

{"sheet":"Composição BDI","index":4,"n_rows":45,"n_cols":9,"rows_kept":45,"cut":false,"hidden":false,"merged":[[18,5,18,8],[17,0,17,3],[16,0,16,3],[44,0,44,3],[42,0,42,3],[43,0,43,3],[18,0,18,3],[36,0,36,3],[39,0,39,3],[38,0,38,3],[40,0,40,3],[29,0,29,2],[32,0,32,3],[33,0,33,3],[34,0,34,3],[35,0,35,3],[0,0,0,3],[2,0,2,3],[3,0,3,3],[1,0,1,3],[5,0,5,3],[4,0,4,3],[12,0,12,3],[13,0,13,3],[14,0,14,3],[15,0,15,3],[6,0,6,3],[8,0,8,3],[7,0,7,3],[9,0,9,3],[11,0,11,3],[10,0,10,3]]}
[]
[]
["UNIDADE ESCOLAR"]
[{"$f":"Orçamento!$O$4","v":"COLÉGIO ESTADUAL EXALTINA SOARES DOS SANTOS"}]
[]
["OBRA"]
[{"$f":"Orçamento!$O$7","v":"IMPLANTAÇÃO E CONSTRUÇÃO"}]
[]
["ENDEREÇO"]
[{"$f":"Orçamento!$R$10","v":"AV PEDRO NUNES, CENTRO, CEP:73930-000"}]
[]
["CIDADE"]
[{"$f":"Orçamento!$X$7","v":"SIMOLÂNDIA"}]
[]
["CRE"]
[{"$f":"Orçamento!$O$10","v":"POSSE"}]
[]
["DETALHAMENTO DA COMPOSIÇÃO DE BDI"]
["COMPOSIÇÃO BDI PARA OBRAS CIVIS",null,null,null,null,"BDI CONSTRUÇÃO E REFORMA"]
["DESCRIÇÃO","COEF.","TAXA % (a.m)","% no preço de venda",null,"Situação","1º Quartil","Médio","3º Quartil"]
["1) COFINS",1,0.03,{"$f":"C21","v":0.03},null,{"$f":"IF(OR(C21<G21,C21>I21),\"FORA DO INTERVALO\",\"OK\")","v":"OK"},0.03,0.03,0.03]
["2) PIS",1,6.4999999999999997E-3,{"$f":"C22","v":6.4999999999999997E-3},null,{"$f":"IF(OR(C22<G22,C22>I22),\"FORA DO INTERVALO\",\"OK\")","v":"OK"},6.4999999999999997E-3,6.4999999999999997E-3,6.4999999999999997E-3]
["3) ISSQN",1,1.4999999999999999E-2,{"$f":"C23*B23","v":1.4999999999999999E-2},null,"FORA DO INTERVALO",0.02,3.5000000000000003E-2,0.05]
["4) CPRB",1,4.4999999999999998E-2,{"$f":"C24","v":4.4999999999999998E-2},null,"OK",4.4999999999999998E-2,4.4999999999999998E-2,4.4999999999999998E-2]
["5) Administração Central",1,0.04,0.04,null,"OK",0.03,0.04,5.5E-2]
["6) Despesas Financeiras",1,5.5999999999999999E-3,5.5999999999999999E-3,null,"FORA DO INTERVALO",5.8999999999999999E-3,1.23E-2,1.3899999999999999E-2]
["7) Seguros + Garantias",1,1.1999999999999999E-3,1.1999999999999999E-3,null,"FORA DO INTERVALO",8.0000000000000002E-3,8.0000000000000002E-3,0.01]
["8) Risco",1,9.7000000000000003E-3,9.7000000000000003E-3,null,"OK",9.7000000000000003E-3,1.2699999999999999E-2,1.2699999999999999E-2]
["9) Lucro",1,7.1999999999999995E-2,7.1999999999999995E-2,null,"OK",6.1600000000000002E-2,7.3999999999999996E-2,8.9599999999999999E-2]
["BDI - FINAL",null,null,{"$f":"(((1+D25+D27+D28)*(1+D26)*(1+D29))/(1-(D21+D22+D23+D24))-1)","v":0.25387223340343157},null,"FORA DO INTERVALO",0.2034,0.22120000000000001,0.25]
[]
["Notas:"]
["(1) e (2) Alíquota definida por lei."]
["(3) Alíquota e base de cálculo definidas pela legislação municipal."]
["(4) Alíquota definida pelas leis 12.546/11, 12844/13 e 13.161/15 (CPRB – contribuição previdenciária sobre a receita bruta)."]
["(5) Valores definidos a partir dos limites no Acórdão nº 2.622/2013 - TCU – Plenário. Valores entre o 1º e 3º quartis."]
["(6) Valor calculado pela expressão matemática do acórdão 2.369/2011 – TCU – Plenário e disponibilizado pela AGETOP em dezembro de 2018. (Foi utilizado para o cálculo a média da Taxa SELIC no período de 11/2017 a 10/2018)"]
[]
["(7) Valores definidos pela AGETOP a partir dos limites no Acórdão nº 2.622/2013 - TCU – Plenário. Valores médios. \n\nObservação da AGETOP: (Seguros contra erros de execução, incêndio e explosão, danos da natureza (vendaval, destelhamento, alagamento, inundação, desmoronamento, geadas etc.), emprego de material defeituoso ou inadequado, roubo e/ou furto qualificado, quebra de equipamentos, desmoronamento de estrutura, nas modalidades de Obras Civis em Construção (OCC); Instalação e Montagem (IM); e Obras Civis em Construção e Instalação e Montagem (OCC/IM). Bem como coberturas adicionais para ampliação dessas coberturas básicas, como: cobertura de responsabilidade civil geral, cobertura de responsabilidade civil cruzada, cobertura de despesas extraordinárias, cobertura de tumultos, cobertura de desentulho do local, cobertura de riscos do fabricante, dentre outras, incluindo o seguro de vida em grupo regido pela convenção coletiva dos trabalhadores na indústria da construção civil). A partir de 24/02/2015 por intermédio da Portaria 449/2015 a Presidência da AGETOP, na pessoa do Senhor Jayme Eduardo Rincon, determinou a exclusão dos valores referentes aos Seguros de Risco de Engenharia e Responsabilidade Civil do Profissional na composição do cálculo do B.D.I.."]
["(8) Valores definidos a partir dos limites no Acórdão nº 2.622/2013 - TCU – Plenário. Valores entre 1º e 3° quartis."]
["(9) Valores definidos a partir dos limites definidos no Acórdão nº 2.622/2013 - TCU – Plenário. Valores adotados e praticados no mercado ( “ ex ante ” ) ou aqueles entre os 1º e 3º quartis."]
[]
["(*) A fórmula para estipulação da taxa de BDI estimado adotado é a mesma que foi aplicada para a obtenção das tabelas contidas no Acórdão n. 2.622/2013 – TCUPlenário"]
[]
["Obs.: Para obras com valores superiores a R$ 20.000.000,00 sugere-se recalcular o BDI, dimensionando as taxas de administração central e lucro para patamares inferiores ao estipulado acima."]

{"sheet":"Relatório CENTRAL","index":5,"n_rows":40,"n_cols":5,"rows_kept":40,"cut":false,"hidden":false,"merged":[[0,1,0,4],[6,3,6,4],[9,3,9,4],[1,1,1,4],[2,1,2,2],[2,3,2,4],[3,1,3,2],[3,3,3,4],[4,1,4,4],[5,1,5,2],[5,3,5,4],[6,1,6,2],[7,1,7,4],[8,1,8,2],[8,3,8,4],[9,1,9,2],[10,1,10,4],[11,1,11,4],[39,1,39,2],[9,0,11,0]]}
[]
[]
[null,"UNIDADE ESCOLAR",null,"CIDADE"]
[null,{"$f":"Orçamento!$O$4","v":"COLÉGIO ESTADUAL EXALTINA SOARES DOS SANTOS"},null,{"$f":"Orçamento!$X$7","v":"SIMOLÂNDIA"}]
[]
[null,"OBRA",null,"CRE"]
[null,{"$f":"Orçamento!$O$7","v":"IMPLANTAÇÃO E CONSTRUÇÃO"},null,{"$f":"Orçamento!$O$10","v":"POSSE"}]
[]
[null,"ENDEREÇO",null,"DATA"]
["FILTRO",{"$f":"Orçamento!$R$10","v":"AV PEDRO NUNES, CENTRO, CEP:73930-000"},null,{"$f":"Orçamento!$S$7","v":"2020-07-07"}]
[]
[null,"RELATÓRIO CENTRAL"]
["↓","CÓDIGO","ETAPA","PREÇO  (R$) C/ BDI","PARTIC  ( % )"]
[{"$f":"IF(D14>0,\"F\",\"\")","v":""},{"$f":"Orçamento!O1347","v":"a."},{"$f":"Orçamento!P1347","v":"SERVIÇOS PRELIMINARES"},{"$f":"Orçamento!X1347","v":0},{"$f":"Orçamento!AA1347","v":0}]
[{"$f":"IF(D15>0,\"F\",\"\")","v":""},{"$f":"Orçamento!O1348","v":"b."},{"$f":"Orçamento!P1348","v":"TRANSPORTES"},{"$f":"Orçamento!X1348","v":0},{"$f":"Orçamento!AA1348","v":0}]
["",{"$f":"Orçamento!O1349","v":"c."},{"$f":"Orçamento!P1349","v":"SERVIÇO EM TERRA"},{"$f":"Orçamento!X1349","v":0},{"$f":"Orçamento!AA1349","v":0}]
["",{"$f":"Orçamento!O1350","v":"d."},{"$f":"Orçamento!P1350","v":"FUNDAÇÕES E SONDAGENS"},{"$f":"Orçamento!X1350","v":0},{"$f":"Orçamento!AA1350","v":0}]
["",{"$f":"Orçamento!O1351","v":"e."},{"$f":"Orçamento!P1351","v":"ESTRUTURA"},{"$f":"Orçamento!X1351","v":0},{"$f":"Orçamento!AA1351","v":0}]
["",{"$f":"Orçamento!O1352","v":"f."},{"$f":"Orçamento!P1352","v":"INSTALAÇÕES ELÉTRICAS"},{"$f":"Orçamento!X1352","v":0},{"$f":"Orçamento!AA1352","v":0}]
["",{"$f":"Orçamento!O1353","v":"g."},{"$f":"Orçamento!P1353","v":"INSTALAÇÕES HIDROSSANITÁRIAS"},{"$f":"Orçamento!X1353","v":0},{"$f":"Orçamento!AA1353","v":0}]
["",{"$f":"Orçamento!O1354","v":"h"},{"$f":"Orçamento!P1354","v":"INSTALAÇÕES ESPECIAIS"},{"$f":"Orçamento!X1354","v":0},{"$f":"Orçamento!AA1354","v":0}]
["",{"$f":"Orçamento!O1355","v":"i."},{"$f":"Orçamento!P1355","v":"ALVENARIAS E DIVISÓRIAS"},{"$f":"Orçamento!X1355","v":0},{"$f":"Orçamento!AA1355","v":0}]
["",{"$f":"Orçamento!O1356","v":"j."},{"$f":"Orçamento!P1356","v":"ALVENARIA AUTO-PORTANTE"},{"$f":"Orçamento!X1356","v":0},{"$f":"Orçamento!AA1356","v":0}]
["",{"$f":"Orçamento!O1357","v":"k."},{"$f":"Orçamento!P1357","v":"IMPERMEABILIZAÇÃO"},{"$f":"Orçamento!X1357","v":0},{"$f":"Orçamento!AA1357","v":0}]
["",{"$f":"Orçamento!O1358","v":"l."},{"$f":"Orçamento!P1358","v":"ISOLAMENTO TÉRMICO E ACÚSTICO"},{"$f":"Orçamento!X1358","v":0},{"$f":"Orçamento!AA1358","v":0}]
["",{"$f":"Orçamento!O1359","v":"m."},{"$f":"Orçamento!P1359","v":"ESTRUTURA DE MADEIRA"},{"$f":"Orçamento!X1359","v":0},{"$f":"Orçamento!AA1359","v":0}]
["",{"$f":"Orçamento!O1360","v":"n."},{"$f":"Orçamento!P1360","v":"ESTRUTURAS METÁLICAS"},{"$f":"Orçamento!X1360","v":0},{"$f":"Orçamento!AA1360","v":0}]
["",{"$f":"Orçamento!O1361","v":"o."},{"$f":"Orçamento!P1361","v":"COBERTURAS"},{"$f":"Orçamento!X1361","v":0},{"$f":"Orçamento!AA1361","v":0}]
["",{"$f":"Orçamento!O1362","v":"p."},{"$f":"Orçamento!P1362","v":"ESQUADRIAS DE MADEIRA"},{"$f":"Orçamento!X1362","v":0},{"$f":"Orçamento!AA1362","v":0}]
["",{"$f":"Orçamento!O1363","v":"q."},{"$f":"Orçamento!P1363","v":"ESQUADRIAS METÁLICAS"},{"$f":"Orçamento!X1363","v":0},{"$f":"Orçamento!AA1363","v":0}]
["",{"$f":"Orçamento!O1364","v":"r."},{"$f":"Orçamento!P1364","v":"VIDROS"},{"$f":"Orçamento!X1364","v":0},{"$f":"Orçamento!AA1364","v":0}]
["",{"$f":"Orçamento!O1365","v":"s."},{"$f":"Orçamento!P1365","v":"REVESTIMENTO DE PAREDE"},{"$f":"Orçamento!X1365","v":0},{"$f":"Orçamento!AA1365","v":0}]
["",{"$f":"Orçamento!O1366","v":"t."},{"$f":"Orçamento!P1366","v":"FORROS"},{"$f":"Orçamento!X1366","v":0},{"$f":"Orçamento!AA1366","v":0}]
["",{"$f":"Orçamento!O1367","v":"u."},{"$f":"Orçamento!P1367","v":"REVESTIMENTO DE PISO"},{"$f":"Orçamento!X1367","v":0},{"$f":"Orçamento!AA1367","v":0}]
["",{"$f":"Orçamento!O1368","v":"v."},{"$f":"Orçamento!P1368","v":"FERRAGENS"},{"$f":"Orçamento!X1368","v":0},{"$f":"Orçamento!AA1368","v":0}]
["",{"$f":"Orçamento!O1369","v":"w."},{"$f":"Orçamento!P1369","v":"MARCENARIA"},{"$f":"Orçamento!X1369","v":0},{"$f":"Orçamento!AA1369","v":0}]
["",{"$f":"Orçamento!O1370","v":"x."},{"$f":"Orçamento!P1370","v":"ADMINISTRAÇÃO"},{"$f":"Orçamento!X1370","v":0},{"$f":"Orçamento!AA1370","v":0}]
["",{"$f":"Orçamento!O1371","v":"y."},{"$f":"Orçamento!P1371","v":"PINTURA"},{"$f":"Orçamento!X1371","v":0},{"$f":"Orçamento!AA1371","v":0}]
["",{"$f":"Orçamento!O1372","v":"z."},{"$f":"Orçamento!P1372","v":"DIVERSOS"},{"$f":"Orçamento!X1372","v":0},{"$f":"Orçamento!AA1372","v":0}]
["F","TOTAL GERAL DO ORÇAMENTO (R$) C/BDI",null,{"$f":"SUM(D14:D39)","v":0},{"$f":"SUM(E14:E39)","v":0}]

{"sheet":"Parc Maior Relev","index":6,"n_rows":19,"n_cols":7,"rows_kept":19,"cut":false,"hidden":false,"merged":[[0,1,0,6],[11,1,11,6],[1,1,1,6],[2,1,2,3],[2,4,2,6],[3,1,3,3],[3,4,3,6],[4,1,4,6],[5,1,5,3],[5,4,5,6],[9,1,9,3],[9,4,9,6],[10,1,10,6],[6,1,6,3],[6,4,6,6],[7,1,7,6],[10,0,12,0],[8,1,8,3],[8,4,8,6],[19,3,19,7],[17,1,17,6]]}
[]
[]
[null,"UNIDADE ESCOLAR",null,null,"CÓDIGO INEP"]
[null,{"$f":"Orçamento!$O$4","v":"COLÉGIO ESTADUAL EXALTINA SOARES DOS SANTOS"},null,null,{"$f":"Orçamento!$X$4","v":52042944}]
[]
[null,"OBRA",null,null,"CIDADE"]
[null,{"$f":"Orçamento!$O$7","v":"IMPLANTAÇÃO E CONSTRUÇÃO"},null,null,{"$f":"Orçamento!$X$7","v":"SIMOLÂNDIA"}]
[]
[null,"CRE",null,null,"ÁREA TOTAL CONSTRUÍDA (M²)"]
[null,{"$f":"Orçamento!$O$10","v":"POSSE"},null,null,{"$f":"Orçamento!$S$13","v":1496.75}]
["FILTRO"]
[null,"PARCELA DE MAIOR RELEVÂNCIA"]
[null,"CÓDIGO","SERVIÇO","DESCRIÇÃO","UNID","QUANT","PARC. MAIOR RELEV (50%)"]
[{"$f":"IF(F14>0,\"F\",\"\")","v":"F"},"e.","ESTRUTURA","CONCRETO ARMADO","M³",{"$f":"39.59+70.76","v":110.35000000000001},{"$f":"F14*0.5","v":55.175000000000004}]
[{"$f":"IF(F15>0,\"F\",\"\")","v":"F"},{"$f":"Somatório!B25","v":"i."},{"$f":"IFERROR(VLOOKUP(B15,Orçamento!$O$1347:$P$1372,2,FALSE),\"(inserir código ao lado)\")","v":"ALVENARIAS E DIVISÓRIAS"},"ALVENARIA DE TIJOLO","M²",785.72,{"$f":"F15*0.5","v":392.86}]
[{"$f":"IF(F16>0,\"F\",\"\")","v":"F"},{"$f":"Somatório!B37","v":"u."},{"$f":"IFERROR(VLOOKUP(B16,Orçamento!$O$1347:$P$1372,2,FALSE),\"(inserir código ao lado)\")","v":"REVESTIMENTO DE PISO"},"GRANITINA","M²",660.38,330.19]
["F"]
["F","(*) Para os fins do inciso I dp § 1º do Art. 30 da Lei Federal 8.666/93, são consideradas parcelas de maior relevância técnica as execuções apresentadas"]
["F"]

{"sheet":"Composições","index":7,"n_rows":424,"n_cols":10,"rows_kept":424,"cut":false,"hidden":false,"merged":[[412,5,413,5],[412,6,412,7],[412,8,412,9],[418,1,418,7],[423,1,423,7],[412,0,413,0],[412,1,413,1],[412,2,413,2],[412,3,413,3],[412,4,413,4],[350,3,351,3],[350,4,351,4],[399,1,400,1],[399,2,400,2],[399,3,400,3],[399,4,400,4],[373,1,374,1],[373,2,374,2],[373,3,374,3],[373,4,374,4],[399,5,400,5],[399,6,399,7],[399,8,399,9],[405,1,405,7],[410,1,410,7],[399,0,400,0],[386,1,387,1],[386,2,387,2],[386,3,387,3],[386,4,387,4],[386,5,387,5],[386,6,386,7],[386,8,386,9],[392,1,392,7],[397,1,397,7],[386,0,387,0],[373,5,374,5],[373,6,373,7],[373,8,373,9],[379,1,379,7],[384,1,384,7],[373,0,374,0],[371,1,371,7],[338,5,339,5],[338,6,338,7],[338,8,338,9],[344,1,344,7],[348,1,348,7],[350,5,351,5],[350,6,350,7],[350,8,350,9],[356,1,356,7],[338,0,339,0],[338,1,339,1],[338,2,339,2],[338,3,339,3],[338,4,339,4],[350,0,351,0],[350,1,351,1],[350,2,351,2],[326,5,327,5],[326,6,326,7],[326,8,326,9],[332,1,332,7],[336,1,336,7],[326,0,327,0],[326,1,327,1],[326,2,327,2],[326,3,327,3],[326,4,327,4],[314,5,315,5],[314,6,314,7],[314,8,314,9],[320,1,320,7],[324,1,324,7],[314,0,315,0],[314,1,315,1],[314,2,315,2],[314,3,315,3],[314,4,315,4],[302,5,303,5],[302,6,302,7],[302,8,302,9],[308,1,308,7],[312,1,312,7],[302,0,303,0],[302,1,303,1],[302,2,303,2],[302,3,303,3],[302,4,303,4],[290,5,291,5],[290,6,290,7],[290,8,290,9],[296,1,296,7],[300,1,300,7],[290,0,291,0],[290,1,291,1],[290,2,291,2],[290,3,291,3],[290,4,291,4],[278,5,279,5],[278,6,278,7],[278,8,278,9],[284,1,284,7],[288,1,288,7],[278,0,279,0],[278,1,279,1],[278,2,279,2],[278,3,279,3],[278,4,279,4],[266,5,267,5],[266,6,266,7],[266,8,266,9],[272,1,272,7],[276,1,276,7],[266,0,267,0],[266,1,267,1],[266,2,267,2],[266,3,267,3],[266,4,267,4],[254,5,255,5],[254,6,254,7],[254,8,254,9],[260,1,260,7],[264,1,264,7],[254,0,255,0],[254,1,255,1],[254,2,255,2],[254,3,255,3],[254,4,255,4],[242,5,243,5],[242,6,242,7],[242,8,242,9],[248,1,248,7],[252,1,252,7],[242,0,243,0],[242,1,243,1],[242,2,243,2],[242,3,243,3],[242,4,243,4],[230,5,231,5],[230,6,230,7],[230,8,230,9],[236,1,236,7],[240,1,240,7],[230,0,231,0],[230,1,231,1],[230,2,231,2],[230,3,231,3],[230,4,231,4],[218,5,219,5],[218,6,218,7],[218,8,218,9],[224,1,224,7],[228,1,228,7],[218,0,219,0],[218,1,219,1],[218,2,219,2],[218,3,219,3],[218,4,219,4],[206,5,207,5],[206,6,206,7],[206,8,206,9],[212,1,212,7],[216,1,216,7],[206,0,207,0],[206,1,207,1],[206,2,207,2],[206,3,207,3],[206,4,207,4],[194,5,195,5],[194,6,194,7],[194,8,194,9],[200,1,200,7],[204,1,204,7],[194,0,195,0],[194,1,195,1],[194,2,195,2],[194,3,195,3],[194,4,195,4],[182,5,183,5],[182,6,182,7],[182,8,182,9],[188,1,188,7],[192,1,192,7],[182,0,183,0],[182,1,183,1],[182,2,183,2],[182,3,183,3],[182,4,183,4],[170,5,171,5],[170,6,170,7],[170,8,170,9],[176,1,176,7],[180,1,180,7],[170,0,171,0],[170,1,171,1],[170,2,171,2],[170,3,171,3],[170,4,171,4],[158,5,159,5],[158,6,158,7],[158,8,158,9],[164,1,164,7],[168,1,168,7],[158,0,159,0],[158,1,159,1],[158,2,159,2],[158,3,159,3],[158,4,159,4],[146,5,147,5],[146,6,146,7],[146,8,146,9],[152,1,152,7],[156,1,156,7],[146,0,147,0],[146,1,147,1],[146,2,147,2],[146,3,147,3],[146,4,147,4],[136,5,137,5],[136,6,136,7],[136,8,136,9],[141,1,141,7],[144,1,144,7],[136,0,137,0],[136,1,137,1],[136,2,137,2],[136,3,137,3],[136,4,137,4],[124,5,125,5],[124,6,124,7],[124,8,124,9],[130,1,130,7],[134,1,134,7],[124,0,125,0],[124,1,125,1],[124,2,125,2],[124,3,125,3],[124,4,125,4],[112,5,113,5],[112,6,112,7],[112,8,112,9],[118,1,118,7],[122,1,122,7],[112,0,113,0],[112,1,113,1],[112,2,113,2],[112,3,113,3],[112,4,113,4],[100,5,101,5],[100,6,100,7],[100,8,100,9],[106,1,106,7],[110,1,110,7],[100,0,101,0],[100,1,101,1],[100,2,101,2],[100,3,101,3],[100,4,101,4],[91,5,92,5],[91,6,91,7],[91,8,91,9],[96,1,96,7],[98,1,98,7],[91,0,92,0],[91,1,92,1],[91,2,92,2],[91,3,92,3],[91,4,92,4],[78,5,79,5],[78,6,78,7],[78,8,78,9],[83,1,83,7],[89,1,89,7],[78,0,79,0],[78,1,79,1],[78,2,79,2],[78,3,79,3],[78,4,79,4],[66,5,67,5],[66,6,66,7],[66,8,66,9],[72,1,72,7],[76,1,76,7],[66,0,67,0],[66,1,67,1],[66,2,67,2],[66,3,67,3],[66,4,67,4],[54,5,55,5],[54,6,54,7],[54,8,54,9],[60,1,60,7],[64,1,64,7],[54,0,55,0],[54,1,55,1],[54,2,55,2],[54,3,55,3],[54,4,55,4],[45,5,46,5],[45,6,45,7],[45,8,45,9],[50,1,50,7],[52,1,52,7],[45,0,46,0],[45,1,46,1],[45,2,46,2],[45,3,46,3],[45,4,46,4],[29,5,30,5],[29,6,29,7],[29,8,29,9],[35,1,35,7],[43,1,43,7],[29,0,30,0],[29,1,30,1],[29,2,30,2],[29,3,30,3],[29,4,30,4],[16,5,17,5],[16,6,16,7],[16,8,16,9],[22,1,22,7],[27,1,27,7],[16,0,17,0],[16,1,17,1],[16,2,17,2],[16,3,17,3],[16,4,17,4],[15,0,15,9],[13,0,13,2],[13,3,13,6],[1,0,1,9],[3,7,3,9],[4,7,4,9],[6,7,6,9],[7,7,7,9],[6,0,6,6],[10,8,10,9],[13,8,13,9],[14,0,14,9],[8,0,8,9],[5,0,5,9],[2,0,2,9],[0,0,0,8],[10,0,10,2],[10,3,10,6],[11,0,11,9],[12,0,12,2],[12,3,12,6],[12,7,12,8],[7,0,7,6],[9,0,9,2],[9,3,9,6],[9,7,9,8],[3,0,3,6],[4,0,4,6]]}
[]
[]
[]
["UNIDADE ESCOLAR",null,null,null,null,null,null,"CÓDIGO INEP"]
[{"$f":"Orçamento!$O$4","v":"COLÉGIO ESTADUAL EXALTINA SOARES DOS SANTOS"},null,null,null,null,null,null,{"$f":"Orçamento!$X$4","v":52042944}]
[]
["OBRA",null,null,null,null,null,null,"CIDADE"]
[{"$f":"Orçamento!$O$7","v":"IMPLANTAÇÃO E CONSTRUÇÃO"},null,null,null,null,null,null,{"$f":"Orçamento!$X$7","v":"SIMOLÂNDIA"}]
[]
["CRE",null,null,"ENDEREÇO",null,null,null,"REFERÊNCIA AGETOP"]
[{"$f":"Orçamento!$O$10","v":"POSSE"},null,null,{"$f":"Orçamento!$R$10","v":"AV PEDRO NUNES, CENTRO, CEP:73930-000"},null,null,null,{"$f":"Orçamento!$X$10","v":"DEZ/18"},{"$f":"Orçamento!$Y$10","v":"DESONERADA"}]
[]
["DATA",null,null,"ÁREA TOTAL CONSTRUÍDA (M²)",null,null,null,"REFERÊNCIA SINAPI"]
[{"$f":"Orçamento!$S$7","v":"2020-07-07"},null,null,{"$f":"Orçamento!$S$13","v":1496.75},null,null,null,{"$f":"Orçamento!$X$13","v":"ABR/19"},{"$f":"Orçamento!$Y$13","v":"DESONERADA"}]
[]
["COMPOSIÇÕES DE CUSTOS UNITÁRIOS - SEE-GO"]
[199,"FONTE","CÓDIGO","DESCRIÇÃO","UNIDADE","COEFIC.","CUSTO UNITÁRIO",null,"CUSTO  TOTAL (A) + (B) + (C) + (D) + (E)"]
[null,null,null,null,null,null,"DESONERADO","NÃO DESONER.","DESONERADO","NÃO DESONER."]
[null,"COMPOSIÇÃO","COMP 199_SEE","ESTACA A TRADO DIAM.40 CM S/FERRO","M",null,null,null,52.819999999999993,54.989999999999995]
[null,"AGETOP_I",5,"SERVENTE","h     ",0.64790000000000003,8.1999999999999993,9.51,5.31,6.16]
[null,"AGETOP_I",4,"PEDREIRO","h     ",0.56559999999999999,13.4,15.53,7.58,8.7799999999999994]
[null,"AGETOP_I",32,"OPERADOR DE BETONEIRA ","h     ",8.09E-2,9.85,11.41,0.8,0.92]
[null,"MÃO DE OBRA (B) - TOTAL",null,null,null,null,null,null,13.690000000000001,15.86]
[null,"AGETOP_I",2804,"AREIA GROSSA","m3",7.2590000000000002E-2,90,90,6.53,6.53]
[null,"AGETOP_I",2386,"BRITA No. 01","m3",8.9419999999999999E-2,85.36,85.36,7.63,7.63]
[null,"AGETOP_I",2497,"BRITA No.02","m3",8.9419999999999999E-2,74.900000000000006,74.900000000000006,6.7,6.7]
[null,"AGETOP_I",1215,"CIMENTO PORTLAND C.P. 32","Kg",46.848799999999997,0.39,0.39,18.27,18.27]
[null,"MATERIAL (C) - TOTAL",null,null,null,null,null,null,39.129999999999995,39.129999999999995]
[]
[334,"FONTE","CÓDIGO","DESCRIÇÃO","UNIDADE","COEFIC.","CUSTO UNITÁRIO",null,"CUSTO  TOTAL (A) + (B) + (C) + (D) + (E)"]
[null,null,null,null,null,null,"DESONERADO","NÃO DESONER.","DESONERADO","NÃO DESONER."]
[null,"COMPOSIÇÃO","COMP 334_SEE","ALVENARIA DE BLOCO DE CONCRETO ESTRUTURAL 14X19X39, FBK 4,5MPA","M2",null,null,null,60.86,63.76]
[null,"AGETOP_I",4,"PEDREIRO","h     ",0.86,13.4,15.53,11.52,13.36]
[null,"AGETOP_I",5,"SERVENTE","h     ",0.65,8.1999999999999993,9.51,5.33,6.18]
[null,null,null,"","",null,0,0,0,0]
[null,"MÃO DE OBRA (B) - TOTAL",null,null,null,null,null,null,16.850000000000001,19.54]
[null,"SINAPI",88715,"ARGAMASSA TRAÇO 1:2:9 (CIMENTO, CAL E AREIA MÉDIA) PARA EMBOÇO/MASSA ÚNICA/ASSENTAMENTO DE ALVENARIA DE VEDAÇÃO, PREPARO MECÂNICO COM BETONEIRA 400 L. AF_09/2014","M3",1.6400000000000001E-2,380.3,393.02,6.24,6.45]
[null,"SINAPI_I",25070,"BLOCO CONCRETO ESTRUTURAL 14 X 19 X 39 CM, FBK 4,5 MPA (NBR 6136)","UN    ",9.5299999999999994,"2,52",2.52,24.02,24.02]
[null,"SINAPI_I",34547,"TELA DE ACO SOLDADA GALVANIZADA/ZINCADA PARA ALVENARIA, FIO  D = *1,20 A 1,70* MM, MALHA 15 X 15 MM, (C X L) *50 X 12* CM","M     ",0.39500000000000002,"2,23",2.23,0.88,0.88]
[null,"SINAPI_I",38594,"MEIO BLOCO CONCRETO ESTRUTURAL 14 X 19 X 34 CM, FBK 14 MPA (NBR 6136)","UN    ",1.47,"3,18",3.18,4.67,4.67]
[null,"SINAPI_I",38591,"BLOCO CONCRETO ESTRUTURAL 14 X 19 X 34 CM, FBK 4,5 MPA (NBR 6136)","UN    ",0.73,"2,49",2.4900000000000002,1.82,1.82]
[null,"SINAPI_I",38595,"MEIA CANALETA CONCRETO ESTRUTURAL 14 X 19 X 19 CM, FBK 4,5 MPA (NBR 6136)","UN    ",0.12,"1,52",1.52,0.18,0.18]
[null,"SINAPI_I",38597,"CANALETA CONCRETO ESTRUTURAL 14 X 19 X 39 CM, FBK 4,5 MPA (NBR 6136)","UN    ",2.2000000000000002,"2,82",2.82,6.2,6.2]
[null,"MATERIAL (C) - TOTAL",null,null,null,null,null,null,44.01,44.22]
[]
[34,"FONTE","CÓDIGO","DESCRIÇÃO","UNIDADE","COEFIC.","CUSTO UNITÁRIO",null,"CUSTO  TOTAL (A) + (B) + (C) + (D) + (E)"]
[null,null,null,null,null,null,"DESONERADO","NÃO DESONER.","DESONERADO","NÃO DESONER."]
[null,"COMPOSIÇÃO","COMP 034_SEE","TERMINAL AÉREO SPDA 30CM Fo Go DIAM. 5/16\" COM SUPORTE","UN ",null,null,null,16.259999999999998,17.29]
[null,"AGETOP_I",8,"AJUDANTE","h     ",0.3,8.1999999999999993,9.51,2.46,2.85]
[null,"AGETOP_I",12,"ELETRICISTA","h     ",0.3,13.4,15.53,4.0199999999999996,4.66]
[null,"MÃO DE OBRA (B) - TOTAL",null,null,null,null,null,null,6.4799999999999995,7.51]
[null,"SINAPI_I",7571,"TERMINAL AEREO EM ACO GALVANIZADO DN 5/16\", COMPRIMENTO DE 350MM, COM BASE DE FIXACAO HORIZONTAL","UN    ",1,"9,78",9.7799999999999994,9.7799999999999994,9.7799999999999994]
[null,"MATERIAL (C) - TOTAL",null,null,null,null,null,null,9.7799999999999994,9.7799999999999994]
[]
[35,"FONTE","CÓDIGO","DESCRIÇÃO","UNIDADE","COEFIC.","CUSTO UNITÁRIO",null,"CUSTO  TOTAL (A) + (B) + (C) + (D) + (E)"]
[null,null,null,null,null,null,"DESONERADO","NÃO DESONER.","DESONERADO","NÃO DESONER."]
[null,"COMPOSIÇÃO","COMP 035_SEE","CLIPS 3/8 P/ CABO DE AÇO BELGO","UN ",null,null,null,1.9000000000000004,2.1800000000000002]
[null,"AGETOP_I",8,"AJUDANTE","h     ",8.3299999999999999E-2,8.1999999999999993,9.51,0.68,0.79]
[null,"AGETOP_I",12,"ELETRICISTA","h     ",8.3299999999999999E-2,13.4,15.53,1.1200000000000001,1.29]
[null,null,null,"","",null,0,0,0,0]
[null,"MÃO DE OBRA (B) - TOTAL",null,null,null,null,null,null,1.8000000000000003,2.08]
[null,"COTAÇÃO","COT 003_SEE","CLIPS 3/8 P/ CABO DE AÇO BELGO","UN ",1,0.10333333333333333,0.10333333333333333,0.1,0.1]
[null,null,null,"","",null,0,0,0,0]
[null,null,null,"","",null,0,0,0,0]
[null,"MATERIAL (C) - TOTAL",null,null,null,null,null,null,0.1,0.1]
[]
[37,"FONTE","CÓDIGO","DESCRIÇÃO","UNIDADE","COEFIC.","CUSTO UNITÁRIO",null,"CUSTO  TOTAL (A) + (B) + (C) + (D) + (E)"]
[null,null,null,null,null,null,"DESONERADO","NÃO DESONER.","DESONERADO","NÃO DESONER."]
[null,"COMPOSIÇÃO","COMP 037_SEE","CAIXA DE INSPEÇÃO PVC 300X250MM+TP P/CX INSP GALV FOGO 300MM","UN ",null,null,null,44.44,47.47]
[null,"AGETOP_I",8,"AJUDANTE","h     ",0.88,8.1999999999999993,9.51,7.22,8.3699999999999992]
[null,"AGETOP_I",12,"ELETRICISTA","h     ",0.88,13.4,15.53,11.79,13.67]
[null,null,null,"","",null,0,0,0,0]
[null,"MÃO DE OBRA (B) - TOTAL",null,null,null,null,null,null,19.009999999999998,22.04]
[null,"COTAÇÃO","COT 005_SEE","CAIXA DE INSPEÇÃO PVC 300x250mm","UN ",1,18.3,18.3,18.3,18.3]
[null,"COTAÇÃO","COT 006_SEE","TAMPA PARA CAIXA DE INSPEÇÃO - GALVANIZADA FOGO 300 mm","UN ",1,7.13,7.13,7.13,7.13]
[null,null,null,"","",null,0,0,0,0]
[null,"MATERIAL (C) - TOTAL",null,null,null,null,null,null,25.43,25.43]
[]
[42,"FONTE","CÓDIGO","DESCRIÇÃO","UNIDADE","COEFIC.","CUSTO UNITÁRIO",null,"CUSTO  TOTAL (A) + (B) + (C) + (D) + (E)"]
[null,null,null,null,null,null,"DESONERADO","NÃO DESONER.","DESONERADO","NÃO DESONER."]
[null,"COMPOSIÇÃO","COMP 042_SEE","MASTRO P/PARA RAIO 1.1/2 6MT+ABRAC C/3 ESTAI P/MASTRO 1.1/2+SINALEIRO TOPO C/FOTOCELULA+ABRAC PARA SINALEIRO","UN ",null,null,null,397.36,402.53]
[null,"AGETOP_I",8,"AJUDANTE","h     ",1.5,8.1999999999999993,9.51,12.3,14.27]
[null,"AGETOP_I",12,"ELETRICISTA","h     ",1.5,13.4,15.53,20.100000000000001,23.3]
[null,"MÃO DE OBRA (B) - TOTAL",null,null,null,null,null,null,32.400000000000006,37.57]
[null,"SINAPI_I",12357,"MASTRO SIMPLES GALVANIZADO DIAMETRO NOMINAL 1 1/2\", COMPRIMENTO 3 M","UN    ",2,"142,18",142.18,284.36,284.36]
[null,"SINAPI_I",11270,"ABRACADEIRA DE LATAO PARA FIXACAO DE CABO PARA-RAIO, DIMENSOES 32 X 24 X 24 MM","UN    ",2,"1,81",1.81,3.62,3.62]
[null,"SINAPI_I",2510,"RELE FOTOELETRICO INTERNO E EXTERNO BIVOLT 1000 W, DE CONECTOR, SEM BASE","UN    ",1,"17,07",17.07,17.07,17.07]
[null,"SINAPI_I",39380,"BASE PARA RELE COM SUPORTE METALICO","UN    ",1,"9,77",9.77,9.77,9.77]
[null,"SINAPI_I",38061,"SINALIZADOR NOTURNO SIMPLES PARA PARA-RAIOS, SEM RELE FOTOELETRICO","UN    ",1,"50,14",50.14,50.14,50.14]
[null,"MATERIAL (C) - TOTAL",null,null,null,null,null,null,364.96,364.96]
[]
[43,"FONTE","CÓDIGO","DESCRIÇÃO","UNIDADE","COEFIC.","CUSTO UNITÁRIO",null,"CUSTO  TOTAL (A) + (B) + (C) + (D) + (E)"]
[null,null,null,null,null,null,"DESONERADO","NÃO DESONER.","DESONERADO","NÃO DESONER."]
[null,"COMPOSIÇÃO","COMP 043_SEE","APOIO PARA MASTRO 2\"","UN ",null,null,null,67.44,68.3]
[null,"AGETOP_I",8,"AJUDANTE","h     ",0.25,8.1999999999999993,9.51,2.0499999999999998,2.38]
[null,"AGETOP_I",12,"ELETRICISTA","h     ",0.25,13.4,15.53,3.35,3.88]
[null,"MÃO DE OBRA (B) - TOTAL",null,null,null,null,null,null,5.4,6.26]
[null,"SINAPI_I",38060,"BASE PARA MASTRO DE PARA-RAIOS DIAMETRO NOMINAL 1 1/2\"","UN    ",1,"62,04",62.04,62.04,62.04]
[null,"MATERIAL (C) - TOTAL",null,null,null,null,null,null,62.04,62.04]
[]
[229,"FONTE","CÓDIGO","DESCRIÇÃO","UNIDADE","COEFIC.","CUSTO UNITÁRIO",null,"CUSTO  TOTAL (A) + (B) + (C) + (D) + (E)"]
[null,null,null,null,null,null,"DESONERADO","NÃO DESONER.","DESONERADO","NÃO DESONER."]
[null,"COMPOSIÇÃO","COMP 229_SEE","CAIXA PARA HIDROMETRO CONCRETO PRE-MOLDADO","UN ",null,null,null,134.25,144.57]
[null,"AGETOP_I",5,"SERVENTE","h     ",3,8.1999999999999993,9.51,24.6,28.53]
[null,"AGETOP_I",4,"PEDREIRO","h     ",3,13.4,15.53,40.200000000000003,46.59]
[null,null,null,"","",null,0,0,0,0]
[null,"MÃO DE OBRA (B) - TOTAL",null,null,null,null,null,null,64.800000000000011,75.12]
[null,"SINAPI_I",11882,"CAIXA PARA HIDROMETRO CONCRETO PRE MOLDADO","UN    ",1,"69,45",69.45,69.45,69.45]
[null,null,null,"","",null,0,0,0,0]
[null,null,null,"","",null,0,0,0,0]
[null,"MATERIAL (C) - TOTAL",null,null,null,null,null,null,69.45,69.45]
[]
[230,"FONTE","CÓDIGO","DESCRIÇÃO","UNIDADE","COEFIC.","CUSTO UNITÁRIO",null,"CUSTO  TOTAL (A) + (B) + (C) + (D) + (E)"]
[null,null,null,null,null,null,"DESONERADO","NÃO DESONER.","DESONERADO","NÃO DESONER."]
[null,"COMPOSIÇÃO","COMP 230_SEE","HIDROMETRO 20,0 M3/H DN 1 1/2\"","UN ",null,null,null,893.17,897.3]
[null,"AGETOP_I",8,"AJUDANTE","h     ",1.2,8.1999999999999993,9.51,9.84,11.41]
[null,"AGETOP_I",11,"ENCANADOR","h     ",1.2,13.4,15.53,16.079999999999998,18.64]
[null,null,null,"","",null,0,0,0,0]
[null,"MÃO DE OBRA (B) - TOTAL",null,null,null,null,null,null,25.919999999999998,30.05]
[null,"SINAPI_I",12772,"HIDROMETRO MULTIJATO, VAZAO MAXIMA DE 20,0 M3/H, DE 1 1/2\"","UN    ",1,"865,91",865.91,865.91,865.91]
[null,"AGETOP_I","H689","FITA VEDAROSCA 12 MM","m",4.8,0.28000000000000003,0.28000000000000003,1.34,1.34]
[null,null,null,"","",null,0,0,0,0]
[null,"MATERIAL (C) - TOTAL",null,null,null,null,null,null,867.25,867.25]
[]
[403,"FONTE","CÓDIGO","DESCRIÇÃO","UNIDADE","COEFIC.","CUSTO UNITÁRIO",null,"CUSTO  TOTAL (A) + (B) + (C) + (D) + (E)"]
[null,null,null,null,null,null,"DESONERADO","NÃO DESONER.","DESONERADO","NÃO DESONER."]
[null,"COMPOSIÇÃO","COMP 403_SEE","HIDROMETRO MULTIJATO, VAZAO MAXIMA DE 7,0 M3/H, DE 1\" FORNECIMENTO E INSTALAÇÃO.","UN ",null,null,null,400.72999999999996,402.89]
[null,"SINAPI",88248,"AUXILIAR DE ENCANADOR OU BOMBEIRO HIDRÁULICO COM ENCARGOS COMPLEMENTARES","H",0.6,13.76,15.26,8.26,9.16]
[null,"SINAPI",88267,"ENCANADOR OU BOMBEIRO HIDRÁULICO COM ENCARGOS COMPLEMENTARES","H",0.6,17.71,19.82,10.63,11.89]
[null,null,null,"","",null,0,0,0,0]
[null,"MÃO DE OBRA (B) - TOTAL",null,null,null,null,null,null,18.89,21.05]
[null,"SINAPI_I",3148,"FITA VEDA ROSCA EM ROLOS DE 18 MM X 50 M (L X C)","UN    ",0.02,"12,87",12.87,0.26,0.26]
[null,"SINAPI_I",12775,"HIDROMETRO MULTIJATO, VAZAO MAXIMA DE 7,0 M3/H, DE 1\"","UN    ",1,"381,58",381.58,381.58,381.58]
[null,null,null,"","",null,0,0,0,0]
[null,"MATERIAL (C) - TOTAL",null,null,null,null,null,null,381.84,381.84]
[]
[28,"FONTE","CÓDIGO","DESCRIÇÃO","UNIDADE","COEFIC.","CUSTO UNITÁRIO",null,"CUSTO  TOTAL (A) + (B) + (C) + (D) + (E)"]
[null,null,null,null,null,null,"DESONERADO","NÃO DESONER.","DESONERADO","NÃO DESONER."]
[null,"COMPOSIÇÃO","COMP 028_SEE","ADAPTADOR PVC SOLDAVEL FLANGES LIVRES P/ CAIXA D' AGUA 85 MM X 3\"","UN ",null,null,null,171.24999999999997,171.55999999999997]
[null,"AGETOP_I",8,"AJUDANTE","h     ",0.09,8.1999999999999993,9.51,0.74,0.86]
[null,"AGETOP_I",11,"ENCANADOR","h     ",0.09,13.4,15.53,1.21,1.4]
[null,"MÃO DE OBRA (B) - TOTAL",null,null,null,null,null,null,1.95,2.2599999999999998]
[null,"AGETOP_I","H689","FITA VEDAROSCA 12 MM","m",4.5,0.28000000000000003,0.28000000000000003,1.26,1.26]
[null,"SINAPI_I",74,"ADAPTADOR PVC SOLDAVEL, COM FLANGES LIVRES, 85 MM X 3\", PARA CAIXA D' AGUA","UN    ",1,"168,04",168.04,168.04,168.04]
[null,"MATERIAL (C) - TOTAL",null,null,null,null,null,null,169.29999999999998,169.29999999999998]
[]
[331,"FONTE","CÓDIGO","DESCRIÇÃO","UNIDADE","COEFIC.","CUSTO UNITÁRIO",null,"CUSTO  TOTAL (A) + (B) + (C) + (D) + (E)"]
[null,null,null,null,null,null,"DESONERADO","NÃO DESONER.","DESONERADO","NÃO DESONER."]
[null,"COMPOSIÇÃO","COMP 331_SEE","VALVULA PÉ DE CRIVO 1.1/4\"","UN ",null,null,null,66.41,68.3]
[null,"AGETOP_I",8,"AJUDANTE","h     ",0.55000000000000004,8.1999999999999993,9.51,4.51,5.23]
[null,"AGETOP_I",11,"ENCANADOR","h     ",0.55000000000000004,13.4,15.53,7.37,8.5399999999999991]
[null,null,null,"","",null,0,0,0,0]
[null,"MÃO DE OBRA (B) - TOTAL",null,null,null,null,null,null,11.879999999999999,13.77]
[null,"SINAPI_I",118,"PASTA VEDA JUNTAS/ROSCA, LATA DE *500* G, PARA INSTALACOES DE GAS E OUTROS","UN    ",2.4E-2,"74,52",74.52,1.79,1.79]
[null,"AGETOP_I","H689","FITA VEDAROSCA 12 MM","m",1.3,0.28000000000000003,0.28000000000000003,0.36,0.36]
[null,"SINAPI_I",10233,"VALVULA DE RETENCAO DE BRONZE, PE COM CRIVOS, EXTREMIDADE COM ROSCA, DE 1 1/4\", PARA FUNDO DE POCO","UN    ",1,"52,38",52.38,52.38,52.38]
[null,"MATERIAL (C) - TOTAL",null,null,null,null,null,null,54.53,54.53]
[]
[555,"FONTE","CÓDIGO","DESCRIÇÃO","UNID ","COEFIC.","CUSTO UNITÁRIO",null,"CUSTO  TOTAL (A) + (B) + (C) + (D) + (E)"]
[null,null,null,null,null,null,"DESONERADO","NÃO DESONER.","DESONERADO","NÃO DESONER."]
[null,"COMPOSIÇÃO","COMP 555_SEE","TORNEIRA BÓIA AUTOMÁTICA 1\"","UN ","-","-","-",45.18,46.14]
[null,"AGETOP_I",8,"AJUDANTE","h     ",0.28000000000000003,8.1999999999999993,9.51,2.2999999999999998,2.66]
[null,"AGETOP_I",11,"ENCANADOR","h     ",0.28000000000000003,13.4,15.53,3.75,4.3499999999999996]
[null,null,null,"","",null,0,0,0,0]
[null,"MÃO DE OBRA (B) - TOTAL",null,null,null,null,null,null,6.05,7.01]
[null,"COTAÇÃO","COT 297_SEE","TORNEIRA BÓIA AUTOMÁTICA","UN ",1,39,39,39,39]
[null,"AGETOP_I","H689","FITA VEDAROSCA 12 MM","m",0.47,0.28000000000000003,0.28000000000000003,0.13,0.13]
[null,null,null,"","",null,0,0,0,0]
[null,"MATERIAL (C) - TOTAL",null,null,null,null,null,null,39.130000000000003,39.130000000000003]
[]
[235,"FONTE","CÓDIGO","DESCRIÇÃO","UNIDADE","COEFIC.","CUSTO UNITÁRIO",null,"CUSTO  TOTAL (A) + (B) + (C) + (D) + (E)"]
[null,null,null,null,null,null,"DESONERADO","NÃO DESONER.","DESONERADO","NÃO DESONER."]
[null,"COMPOSIÇÃO","COMP 235_SEE","PLACA DE SINALIZAÇÃO EM PVC COD 01 - (300X300) PROIBIDO FUMAR","UN ",null,null,null,25.269999999999996,25.389999999999997]
[null,"AGETOP_I",5,"SERVENTE","h     ",0.09,8.1999999999999993,9.51,0.74,0.86]
[null,null,null,"","",null,0,0,0,0]
[null,null,null,"","",null,0,0,0,0]
[null,"MÃO DE OBRA (B) - TOTAL",null,null,null,null,null,null,0.74,0.86]
[null,"AGETOP_I",3070,"BUCHA DE NYLON S-6","un",2,0.04,0.04,0.08,0.08]
[null,"AGETOP_I",3393,"PARAFUSO P/BUCHA S-6","un",2,0.08,0.08,0.16,0.16]
[null,"SINAPI_I",37556,"PLACA DE SINALIZACAO DE SEGURANCA CONTRA INCENDIO, FOTOLUMINESCENTE, QUADRADA, *20 X 20* CM, EM PVC *2* MM ANTI-CHAMAS (SIMBOLOS, CORES E PICTOGRAMAS CONFORME NBR 13434)","UN    ",1,"24,29",24.29,24.29,24.29]
[null,"MATERIAL (C) - TOTAL",null,null,null,null,null,null,24.529999999999998,24.529999999999998]
[]
[236,"FONTE","CÓDIGO","DESCRIÇÃO","UNIDADE","COEFIC.","CUSTO UNITÁRIO",null,"CUSTO  TOTAL (A) + (B) + (C) + (D) + (E)"]
[null,null,null,null,null,null,"DESONERADO","NÃO DESONER.","DESONERADO","NÃO DESONER."]
[null,"COMPOSIÇÃO","COMP 236_SEE","PLACA DE SINALIZAÇÃO EM PVC COD 06 - (300X300) PERIGO INFLAMÁVEL","UN ",null,null,null,25.269999999999996,25.389999999999997]
[null,"AGETOP_I",5,"SERVENTE","h     ",0.09,8.1999999999999993,9.51,0.74,0.86]
[null,null,null,"","",null,0,0,0,0]
[null,null,null,"","",null,0,0,0,0]
[null,"MÃO DE OBRA (B) - TOTAL",null,null,null,null,null,null,0.74,0.86]
[null,"AGETOP_I",3070,"BUCHA DE NYLON S-6","un",2,0.04,0.04,0.08,0.08]
[null,"AGETOP_I",3393,"PARAFUSO P/BUCHA S-6","un",2,0.08,0.08,0.16,0.16]
[null,"SINAPI_I",37556,"PLACA DE SINALIZACAO DE SEGURANCA CONTRA INCENDIO, FOTOLUMINESCENTE, QUADRADA, *20 X 20* CM, EM PVC *2* MM ANTI-CHAMAS (SIMBOLOS, CORES E PICTOGRAMAS CONFORME NBR 13434)","UN    ",1,"24,29",24.29,24.29,24.29]
[null,"MATERIAL (C) - TOTAL",null,null,null,null,null,null,24.529999999999998,24.529999999999998]
[]
[411,"FONTE","CÓDIGO","DESCRIÇÃO","UNIDADE","COEFIC.","CUSTO UNITÁRIO",null,"CUSTO  TOTAL (A) + (B) + (C) + (D) + (E)"]
[null,null,null,null,null,null,"DESONERADO","NÃO DESONER.","DESONERADO","NÃO DESONER."]
[null,"COMPOSIÇÃO","COMP 411_SEE","PLACA DE SINALIZAÇÃO EM PVC COD 13 - (316X158) SAÍDA DE EMERGÊNCIA","UN ",null,null,null,30.769999999999996,30.889999999999997]
[null,"AGETOP_I",5,"SERVENTE","h     ",0.09,8.1999999999999993,9.51,0.74,0.86]
[null,null,null,"","",null,0,0,0,0]
[null,null,null,"","",null,0,0,0,0]
[null,"MÃO DE OBRA (B) - TOTAL",null,null,null,null,null,null,0.74,0.86]
[null,"AGETOP_I",3070,"BUCHA DE NYLON S-6","un",2,0.04,0.04,0.08,0.08]
[null,"AGETOP_I",3393,"PARAFUSO P/BUCHA S-6","un",2,0.08,0.08,0.16,0.16]
[null,"SINAPI_I",37559,"PLACA DE SINALIZACAO DE SEGURANCA CONTRA INCENDIO, FOTOLUMINESCENTE, RETANGULAR, *12 X 40* CM, EM PVC *2* MM ANTI-CHAMAS (SIMBOLOS, CORES E PICTOGRAMAS CONFORME NBR 13434)","UN    ",1,"29,79",29.79,29.79,29.79]
[null,"MATERIAL (C) - TOTAL",null,null,null,null,null,null,30.029999999999998,30.029999999999998]
[]
[412,"FONTE","CÓDIGO","DESCRIÇÃO","UNIDADE","COEFIC.","CUSTO UNITÁRIO",null,"CUSTO  TOTAL (A) + (B) + (C) + (D) + (E)"]
[null,null,null,null,null,null,"DESONERADO","NÃO DESONER.","DESONERADO","NÃO DESONER."]
[null,"COMPOSIÇÃO","COMP 412_SEE","PLACA DE SINALIZAÇÃO EM PVC COD 17 - (316X158) MENSAGEM \"SAÍDA\"","UN ",null,null,null,30.769999999999996,30.889999999999997]
[null,"AGETOP_I",5,"SERVENTE","h     ",0.09,8.1999999999999993,9.51,0.74,0.86]
[null,null,null,"","",null,0,0,0,0]
[null,null,null,"","",null,0,0,0,0]
[null,"MÃO DE OBRA (B) - TOTAL",null,null,null,null,null,null,0.74,0.86]
[null,"AGETOP_I",3070,"BUCHA DE NYLON S-6","un",2,0.04,0.04,0.08,0.08]
[null,"AGETOP_I",3393,"PARAFUSO P/BUCHA S-6","un",2,0.08,0.08,0.16,0.16]
[null,"SINAPI_I",37559,"PLACA DE SINALIZACAO DE SEGURANCA CONTRA INCENDIO, FOTOLUMINESCENTE, RETANGULAR, *12 X 40* CM, EM PVC *2* MM ANTI-CHAMAS (SIMBOLOS, CORES E PICTOGRAMAS CONFORME NBR 13434)","UN    ",1,"29,79",29.79,29.79,29.79]
[null,"MATERIAL (C) - TOTAL",null,null,null,null,null,null,30.029999999999998,30.029999999999998]
[]
[382,"FONTE","CÓDIGO","DESCRIÇÃO","UNIDADE","COEFIC.","CUSTO UNITÁRIO",null,"CUSTO  TOTAL (A) + (B) + (C) + (D) + (E)"]
[null,null,null,null,null,null,"DESONERADO","NÃO DESONER.","DESONERADO","NÃO DESONER."]
[null,"COMPOSIÇÃO","COMP 382_SEE","TE DE REDUCAO DE FERRO GALVANIZADO, COM ROSCA BSP, DE 3/4\" X 1/2\"","UN ",null,null,null,20.6,22.69]
[null,"AGETOP_I",8,"AJUDANTE","h     ",0.6,8.1999999999999993,9.51,4.92,5.71]
[null,"AGETOP_I",11,"ENCANADOR","h     ",0.61050000000000004,13.4,15.53,8.18,9.48]
[null,null,null,"","",null,0,0,0,0]
[null,"MÃO DE OBRA (B) - TOTAL",null,null,null,null,null,null,13.1,15.190000000000001]
[null,"SINAPI_I",3146,"FITA VEDA ROSCA EM ROLOS DE 18 MM X 10 M (L X C)","UN    ",0.12075471698113208,"3,49",3.49,0.42,0.42]
[null,"SINAPI_I",6302,"TE DE REDUCAO DE FERRO GALVANIZADO, COM ROSCA BSP, DE 3/4\" X 1/2\"","UN    ",1,"7,08",7.08,7.08,7.08]
[null,null,null,"","",null,0,0,0,0]
[null,"MATERIAL (C) - TOTAL",null,null,null,null,null,null,7.5,7.5]
[]
[383,"FONTE","CÓDIGO","DESCRIÇÃO","UNIDADE","COEFIC.","CUSTO UNITÁRIO",null,"CUSTO  TOTAL (A) + (B) + (C) + (D) + (E)"]
[null,null,null,null,null,null,"DESONERADO","NÃO DESONER.","DESONERADO","NÃO DESONER."]
[null,"COMPOSIÇÃO","COMP 383_SEE","BUCHA DE REDUCAO DE FERRO GALVANIZADO, COM ROSCA BSP, DE 1/2\" X 1/4\"","UN ",null,null,null,6.4,6.9499999999999993]
[null,"AGETOP_I",8,"AJUDANTE","h     ",0.16,8.1999999999999993,9.51,1.31,1.52]
[null,"AGETOP_I",11,"ENCANADOR","h     ",0.16,13.4,15.53,2.14,2.48]
[null,null,null,"","",null,0,0,0,0]
[null,"MÃO DE OBRA (B) - TOTAL",null,null,null,null,null,null,3.45,4]
[null,"AGETOP_I","H689","FITA VEDAROSCA 12 MM","m",1.2,0.28000000000000003,0.28000000000000003,0.34,0.34]
[null,"SINAPI_I",770,"BUCHA DE REDUCAO DE FERRO GALVANIZADO, COM ROSCA BSP, DE 1/2\" X 1/4\"","UN    ",1,"2,61",2.61,2.61,2.61]
[null,null,null,"","",null,0,0,0,0]
[null,"MATERIAL (C) - TOTAL",null,null,null,null,null,null,2.9499999999999997,2.9499999999999997]
[]
[212,"FONTE","CÓDIGO","DESCRIÇÃO","UNIDADE","COEFIC.","CUSTO UNITÁRIO",null,"CUSTO  TOTAL (A) + (B) + (C) + (D) + (E)"]
[null,null,null,null,null,null,"DESONERADO","NÃO DESONER.","DESONERADO","NÃO DESONER."]
[null,"COMPOSIÇÃO","COMP 212_SEE","NIPLE DE REDUÇÃO 1/2\" X 1/4\" BSP","UN ",null,null,null,9.5,10.050000000000001]
[null,"AGETOP_I",8,"AJUDANTE","h     ",0.16,8.1999999999999993,9.51,1.31,1.52]
[null,"AGETOP_I",11,"ENCANADOR","h     ",0.16,13.4,15.53,2.14,2.48]
[null,null,null,"","",null,0,0,0,0]
[null,"MÃO DE OBRA (B) - TOTAL",null,null,null,null,null,null,3.45,4]
[null,"COTAÇÃO","COT 103_SEE","NIPLE DE REDUÇÃO 1/2\" X 1/4\" BSP","UN",1,6.0533333333333337,6.0533333333333337,6.05,6.05]
[null,null,null,"","",null,0,0,0,0]
[null,null,null,"","",null,0,0,0,0]
[null,"MATERIAL (C) - TOTAL",null,null,null,null,null,null,6.05,6.05]
[]
[213,"FONTE","CÓDIGO","DESCRIÇÃO","UNIDADE","COEFIC.","CUSTO UNITÁRIO",null,"CUSTO  TOTAL (A) + (B) + (C) + (D) + (E)"]
[null,null,null,null,null,null,"DESONERADO","NÃO DESONER.","DESONERADO","NÃO DESONER."]
[null,"COMPOSIÇÃO","COMP 213_SEE","NIPLE DE REDUÇÃO 3/4\" X 1/2\" BSP","UN ",null,null,null,13.16,13.71]
[null,"AGETOP_I",8,"AJUDANTE","h     ",0.16,8.1999999999999993,9.51,1.31,1.52]
[null,"AGETOP_I",11,"ENCANADOR","h     ",0.16,13.4,15.53,2.14,2.48]
[null,null,null,"","",null,0,0,0,0]
[null,"MÃO DE OBRA (B) - TOTAL",null,null,null,null,null,null,3.45,4]
[null,"COTAÇÃO","COT 104_SEE","NIPLE DE REDUÇÃO 3/4\" X 1/2\" BSP","UN",1,9.7099999999999991,9.7099999999999991,9.7100000000000009,9.7100000000000009]
[null,null,null,"","",null,0,0,0,0]
[null,null,null,"","",null,0,0,0,0]
[null,"MATERIAL (C) - TOTAL",null,null,null,null,null,null,9.7100000000000009,9.7100000000000009]
[]
[237,"FONTE","CÓDIGO","DESCRIÇÃO","UNIDADE","COEFIC.","CUSTO UNITÁRIO",null,"CUSTO  TOTAL (A) + (B) + (C) + (D) + (E)"]
[null,null,null,null,null,null,"DESONERADO","NÃO DESONER.","DESONERADO","NÃO DESONER."]
[null,"COMPOSIÇÃO","COMP 237_SEE","FITA ANTICORROSIVA","M",null,null,null,11.120000000000001,11.809999999999999]
[null,"AGETOP_I",8,"AJUDANTE","h     ",0.2,8.1999999999999993,9.51,1.64,1.9]
[null,"AGETOP_I",12,"ELETRICISTA","h     ",0.2,13.4,15.53,2.68,3.11]
[null,null,null,"","",null,0,0,0,0]
[null,"MÃO DE OBRA (B) - TOTAL",null,null,null,null,null,null,4.32,5.01]
[null,"SINAPI_I",39634,"FITA ADESIVA ANTICORROSIVA DE PVC FLEXIVEL, COR PRETA, PARA PROTECAO TUBULACAO, 50 MM X 30 M (L X C), E= *0,25* MM","M     ",1,"6,80",6.8,6.8,6.8]
[null,null,null,"","",null,0,0,0,0]
[null,null,null,"","",null,0,0,0,0]
[null,"MATERIAL (C) - TOTAL",null,null,null,null,null,null,6.8,6.8]
[]
[542,"FONTE","CÓDIGO","DESCRIÇÃO","UNIDADE","COEFIC.","CUSTO UNITÁRIO",null,"CUSTO  TOTAL (A) + (B) + (C) + (D) + (E)"]
[null,null,null,null,null,null,"DESONERADO","NÃO DESONER.","DESONERADO","NÃO DESONER."]
[null,"COMPOSIÇÃO","COMP 542_SEE","VÁLVULA UGV 3/4\" (S) LATÃO","UN ",null,null,null,25.17,26.66]
[null,"AGETOP_I",8,"AJUDANTE","h     ",0.432,8.1999999999999993,9.51,3.54,4.1100000000000003]
[null,"AGETOP_I",11,"ENCANADOR","h     ",0.432,13.4,15.53,5.79,6.71]
[null,null,null,"","",null,0,0,0,0]
[null,"MÃO DE OBRA (B) - TOTAL",null,null,null,null,null,null,9.33,10.82]
[null,"COTAÇÃO","COT 281_SEE","VÁLVULA UGV 3/4\" (S) LATÃO","UN ",1,15.836666666666666,15.836666666666666,15.84,15.84]
[null,null,null,"","",null,0,0,0,0]
[null,null,null,"","",null,0,0,0,0]
[null,"MATERIAL (C) - TOTAL",null,null,null,null,null,null,15.84,15.84]
[]
[543,"FONTE","CÓDIGO","DESCRIÇÃO","UNIDADE","COEFIC.","CUSTO UNITÁRIO",null,"CUSTO  TOTAL (A) + (B) + (C) + (D) + (E)"]
[null,null,null,null,null,null,"DESONERADO","NÃO DESONER.","DESONERADO","NÃO DESONER."]
[null,"COMPOSIÇÃO","COMP 543_SEE","VÁLVULA UGV 1/2\" (S) LATÃO","UN ",null,null,null,24.5,25.990000000000002]
[null,"AGETOP_I",8,"AJUDANTE","h     ",0.432,8.1999999999999993,9.51,3.54,4.1100000000000003]
[null,"AGETOP_I",11,"ENCANADOR","h     ",0.432,13.4,15.53,5.79,6.71]
[null,null,null,"","",null,0,0,0,0]
[null,"MÃO DE OBRA (B) - TOTAL",null,null,null,null,null,null,9.33,10.82]
[null,"COTAÇÃO","COT 282_SEE","VÁLVULA UGV 1/2\" (S) LATÃO","UN ",1,15.166666666666666,15.166666666666666,15.17,15.17]
[null,null,null,"","",null,0,0,0,0]
[null,null,null,"","",null,0,0,0,0]
[null,"MATERIAL (C) - TOTAL",null,null,null,null,null,null,15.17,15.17]
[]
[211,"FONTE","CÓDIGO","DESCRIÇÃO","UNIDADE","COEFIC.","CUSTO UNITÁRIO",null,"CUSTO  TOTAL (A) + (B) + (C) + (D) + (E)"]
[null,null,null,null,null,null,"DESONERADO","NÃO DESONER.","DESONERADO","NÃO DESONER."]
[null,"COMPOSIÇÃO","COMP 211_SEE","REGULADOR DE 2º ESTÁGIO 5KG/H","UN ",null,null,null,85.46,89.419999999999987]
[null,"AGETOP_I",8,"AJUDANTE","h     ",1.1499999999999999,8.1999999999999993,9.51,9.43,10.94]
[null,"AGETOP_I",11,"ENCANADOR","h     ",1.1499999999999999,13.4,15.53,15.41,17.86]
[null,null,null,"","",null,0,0,0,0]
[null,"MÃO DE OBRA (B) - TOTAL",null,null,null,null,null,null,24.84,28.799999999999997]
[null,"COTAÇÃO","COT 102_SEE","REGULADOR DE 2º ESTÁGIO 5KG/H","UN",1,59.833333333333336,59.833333333333336,59.83,59.83]
[null,"AGETOP_I","H689","FITA VEDAROSCA 12 MM","m",2.82,0.28000000000000003,0.28000000000000003,0.79,0.79]
[null,null,null,"","",null,0,0,0,0]
[null,"MATERIAL (C) - TOTAL",null,null,null,null,null,null,60.62,60.62]
[]
[210,"FONTE","CÓDIGO","DESCRIÇÃO","UNIDADE","COEFIC.","CUSTO UNITÁRIO",null,"CUSTO  TOTAL (A) + (B) + (C) + (D) + (E)"]
[null,null,null,null,null,null,"DESONERADO","NÃO DESONER.","DESONERADO","NÃO DESONER."]
[null,"COMPOSIÇÃO","COMP 210_SEE","REGULADOR DE 1º ESTÁGIO 60KG/H MODELO AP-40  COM MANÔMETRO","UN ",null,null,null,231.21,235.17000000000002]
[null,"AGETOP_I",8,"AJUDANTE","h     ",1.1499999999999999,8.1999999999999993,9.51,9.43,10.94]
[null,"AGETOP_I",11,"ENCANADOR","h     ",1.1499999999999999,13.4,15.53,15.41,17.86]
[null,null,null,"","",null,0,0,0,0]
[null,"MÃO DE OBRA (B) - TOTAL",null,null,null,null,null,null,24.84,28.799999999999997]
[null,"COTAÇÃO","COT 101_SEE","REGULADOR DE 1º ESTÁGIO 60KG/H MODELO AP-40  COM MANÔMETRO","UN",1,205.57666666666668,205.57666666666668,205.58,205.58]
[null,"AGETOP_I","H689","FITA VEDAROSCA 12 MM","m",2.82,0.28000000000000003,0.28000000000000003,0.79,0.79]
[null,null,null,"","",null,0,0,0,0]
[null,"MATERIAL (C) - TOTAL",null,null,null,null,null,null,206.37,206.37]
[]
[235,"FONTE","CÓDIGO","DESCRIÇÃO","UNIDADE","COEFIC.","CUSTO UNITÁRIO",null,"CUSTO  TOTAL (A) + (B) + (C) + (D) + (E)"]
[null,null,null,null,null,null,"DESONERADO","NÃO DESONER.","DESONERADO","NÃO DESONER."]
[null,"COMPOSIÇÃO","COMP 235_SEE","PLACA DE SINALIZAÇÃO EM PVC COD 01 - (300X300) PROIBIDO FUMAR","UN ",null,null,null,25.269999999999996,25.389999999999997]
[null,"AGETOP_I",5,"SERVENTE","h     ",0.09,8.1999999999999993,9.51,0.74,0.86]
[null,null,null,"","",null,0,0,0,0]
[null,null,null,"","",null,0,0,0,0]
[null,"MÃO DE OBRA (B) - TOTAL",null,null,null,null,null,null,0.74,0.86]
[null,"AGETOP_I",3070,"BUCHA DE NYLON S-6","un",2,0.04,0.04,0.08,0.08]
[null,"AGETOP_I",3393,"PARAFUSO P/BUCHA S-6","un",2,0.08,0.08,0.16,0.16]
[null,"SINAPI_I",37556,"PLACA DE SINALIZACAO DE SEGURANCA CONTRA INCENDIO, FOTOLUMINESCENTE, QUADRADA, *20 X 20* CM, EM PVC *2* MM ANTI-CHAMAS (SIMBOLOS, CORES E PICTOGRAMAS CONFORME NBR 13434)","UN    ",1,"24,29",24.29,24.29,24.29]
[null,"MATERIAL (C) - TOTAL",null,null,null,null,null,null,24.529999999999998,24.529999999999998]
[]
[236,"FONTE","CÓDIGO","DESCRIÇÃO","UNIDADE","COEFIC.","CUSTO UNITÁRIO",null,"CUSTO  TOTAL (A) + (B) + (C) + (D) + (E)"]
[null,null,null,null,null,null,"DESONERADO","NÃO DESONER.","DESONERADO","NÃO DESONER."]
[null,"COMPOSIÇÃO","COMP 236_SEE","PLACA DE SINALIZAÇÃO EM PVC COD 06 - (300X300) PERIGO INFLAMÁVEL","UN ",null,null,null,25.269999999999996,25.389999999999997]
[null,"AGETOP_I",5,"SERVENTE","h     ",0.09,8.1999999999999993,9.51,0.74,0.86]
[null,null,null,"","",null,0,0,0,0]
[null,null,null,"","",null,0,0,0,0]
[null,"MÃO DE OBRA (B) - TOTAL",null,null,null,null,null,null,0.74,0.86]
[null,"AGETOP_I",3070,"BUCHA DE NYLON S-6","un",2,0.04,0.04,0.08,0.08]
[null,"AGETOP_I",3393,"PARAFUSO P/BUCHA S-6","un",2,0.08,0.08,0.16,0.16]
[null,"SINAPI_I",37556,"PLACA DE SINALIZACAO DE SEGURANCA CONTRA INCENDIO, FOTOLUMINESCENTE, QUADRADA, *20 X 20* CM, EM PVC *2* MM ANTI-CHAMAS (SIMBOLOS, CORES E PICTOGRAMAS CONFORME NBR 13434)","UN    ",1,"24,29",24.29,24.29,24.29]
[null,"MATERIAL (C) - TOTAL",null,null,null,null,null,null,24.529999999999998,24.529999999999998]
[]
[84,"FONTE","CÓDIGO","DESCRIÇÃO","UNIDADE","COEFIC.","CUSTO UNITÁRIO",null,"CUSTO  TOTAL (A) + (B) + (C) + (D) + (E)"]
[null,null,null,null,null,null,"DESONERADO","NÃO DESONER.","DESONERADO","NÃO DESONER."]
[null,"COMPOSIÇÃO","COMP 084_SEE","GUARDA-CORPO COM CORRIMÃO - SEDUC","M",null,null,null,204.60000000000002,209.46]
[null,"AGETOP_I",25,"OFICIAL \"B\"","h     ",1.1000000000000001,13.4,15.53,14.74,17.079999999999998]
[null,"AGETOP_I",8,"AJUDANTE","h     ",1.1000000000000001,8.1999999999999993,9.51,9.02,10.46]
[null,null,null,"","",null,0,0,0,0]
[null,"MÃO DE OBRA (B) - TOTAL",null,null,null,null,null,null,23.759999999999998,27.54]
[null,"AGETOP_I",2376,"TUBO INDUSTRIAL 2\" CHAPA 13 ","Kg",7.7778,5.23,5.23,40.68,40.68]
[null,"AGETOP_I",2504,"TUBO INDUSTRIAL D=25 MM CHAPA 13 ","Kg",4.6319999999999997,5.07,5.07,23.48,23.48]
[null,"AGETOP_I",2377,"TUBO INDUSTRIAL 40X40 CH.13","Kg",6.3419999999999996,5.07,5.07,32.15,32.15]
[null,"AGETOP_I",2421,"TUBO INDUSTRIAL 1.1/2\" CHAPA 13 ","Kg",1.4862,5.07,5.07,7.54,7.54]
[null,"AGETOP_I",2417,"MASSA PLASTICA","Kg",0.2041,10.58,10.58,2.16,2.16]
[null,"AGETOP_I",2246,"ELETRODO 2.5 OK","Kg",0.11459999999999999,8.6999999999999993,8.6999999999999993,1,1]
[null,"AGETOP_I",1672,"LIXA PARA FERRO ( NÚMERO 100 )","un",0.25509999999999999,2.12,2.12,0.54,0.54]
[null,"AGETOP_I",1264,"DISCO DE DESBASTE 7/8\" P/ CONC./FERRO (1/4\" X 7\")","un",5.0999999999999997E-2,7,7,0.36,0.36]
[null,"AGETOP_I",1334,"DISCO DE CORTE DIAM. 5/8\"- 10\"","un",0.373,5.5,5.5,2.0499999999999998,2.0499999999999998]
[null,"AGETOP_I",2902,"FABRICAÇÃO / MONTAGEM","un",1,50.44,50.44,50.44,50.44]
[null,"AGETOP_I",2150,"CHAPA DE FERRO DOBRADA No.13","Kg",0.43519999999999998,5.28,5.28,2.2999999999999998,2.2999999999999998]
[null,"AGETOP_I",2719,"CHAPA PERFILADA 3/16\"","Kg",1.0979999999999999,5.04,5.04,5.53,5.53]
[null,"AGETOP_I",2436,"ACO CA-25 - 6,3 MM (1/4\") - BARRA LISA A-36","Kg",0.38124999999999998,5.13,5.13,1.96,1.96]
[null,"AGETOP",261602,"PINT.ESMALTE/ESQUAD.FERRO C/FUNDO ANTICOR.","m2    ",0.78,13.65,15.04,10.65,11.73]
[null,"MATERIAL (C) - TOTAL",null,null,null,null,null,null,180.84000000000003,181.92000000000002]
[]
[415,"FONTE","CÓDIGO","DESCRIÇÃO","UNIDADE","COEFIC.","CUSTO UNITÁRIO",null,"CUSTO  TOTAL (A) + (B) + (C) + (D) + (E)"]
[null,null,null,null,null,null,"DESONERADO","NÃO DESONER.","DESONERADO","NÃO DESONER."]
[null,"COMPOSIÇÃO","COMP 415_SEE","PEITORIL EM GRANITO CINZA, LARGURA VARIÁVEL E PINGADEIRA","M2",null,null,null,203.92000000000002,206.57]
[null,"AGETOP_I",28,"AZULEJISTA","h     ",0.66910000000000003,13.4,15.53,8.9700000000000006,10.39]
[null,"AGETOP_I",5,"SERVENTE","h     ",0.93879999999999997,8.1999999999999993,9.51,7.7,8.93]
[null,null,null,"","",null,0,0,0,0]
[null,"MÃO DE OBRA (B) - TOTAL",null,null,null,null,null,null,16.670000000000002,19.32]
[null,"AGETOP_I",1421,"GRANITO POLIDO P/BANCADA 2 CM","m2",1,180,180,180,180]
[null,"AGETOP_I",1215,"CIMENTO PORTLAND C.P. 32","Kg",10.34,0.39,0.39,4.03,4.03]
[null,"AGETOP_I",2690,"ARGAMASSA DE REJUNTAMENTO","Kg",0.32,3.54,3.54,1.1299999999999999,1.1299999999999999]
[null,"AGETOP_I",104,"AREIA MEDIA ","m3",2.52E-2,82.85,82.85,2.09,2.09]
[null,"MATERIAL (C) - TOTAL",null,null,null,null,null,null,187.25,187.25]
[]
[415,"FONTE","CÓDIGO","DESCRIÇÃO","UNIDADE","COEFIC.","CUSTO UNITÁRIO",null,"CUSTO  TOTAL (A) + (B) + (C) + (D) + (E)"]
[null,null,null,null,null,null,"DESONERADO","NÃO DESONER.","DESONERADO","NÃO DESONER."]
[null,"COMPOSIÇÃO","COMP 415_SEE","PEITORIL EM GRANITO CINZA, LARGURA VARIÁVEL E PINGADEIRA","M2",null,null,null,203.92000000000002,206.57]
[null,"AGETOP_I",28,"AZULEJISTA","h     ",0.66910000000000003,13.4,15.53,8.9700000000000006,10.39]
[null,"AGETOP_I",5,"SERVENTE","h     ",0.93879999999999997,8.1999999999999993,9.51,7.7,8.93]
[null,null,null,"","",null,0,0,0,0]
[null,"MÃO DE OBRA (B) - TOTAL",null,null,null,null,null,null,16.670000000000002,19.32]
[null,"AGETOP_I",1421,"GRANITO POLIDO P/BANCADA 2 CM","m2",1,180,180,180,180]
[null,"AGETOP_I",1215,"CIMENTO PORTLAND C.P. 32","Kg",10.34,0.39,0.39,4.03,4.03]
[null,"AGETOP_I",2690,"ARGAMASSA DE REJUNTAMENTO","Kg",0.32,3.54,3.54,1.1299999999999999,1.1299999999999999]
[null,"AGETOP_I",104,"AREIA MEDIA ","m3",2.52E-2,82.85,82.85,2.09,2.09]
[null,"MATERIAL (C) - TOTAL",null,null,null,null,null,null,187.25,187.25]
[]
[415,"FONTE","CÓDIGO","DESCRIÇÃO","UNIDADE","COEFIC.","CUSTO UNITÁRIO",null,"CUSTO  TOTAL (A) + (B) + (C) + (D) + (E)"]
[null,null,null,null,null,null,"DESONERADO","NÃO DESONER.","DESONERADO","NÃO DESONER."]
[null,"COMPOSIÇÃO","COMP 415_SEE","PEITORIL EM GRANITO CINZA, LARGURA VARIÁVEL E PINGADEIRA","M2",null,null,null,203.92000000000002,206.57]
[null,"AGETOP_I",28,"AZULEJISTA","h     ",0.66910000000000003,13.4,15.53,8.9700000000000006,10.39]
[null,"AGETOP_I",5,"SERVENTE","h     ",0.93879999999999997,8.1999999999999993,9.51,7.7,8.93]
[null,null,null,"","",null,0,0,0,0]
[null,"MÃO DE OBRA (B) - TOTAL",null,null,null,null,null,null,16.670000000000002,19.32]
[null,"AGETOP_I",1421,"GRANITO POLIDO P/BANCADA 2 CM","m2",1,180,180,180,180]
[null,"AGETOP_I",1215,"CIMENTO PORTLAND C.P. 32","Kg",10.34,0.39,0.39,4.03,4.03]
[null,"AGETOP_I",2690,"ARGAMASSA DE REJUNTAMENTO","Kg",0.32,3.54,3.54,1.1299999999999999,1.1299999999999999]
[null,"AGETOP_I",104,"AREIA MEDIA ","m3",2.52E-2,82.85,82.85,2.09,2.09]
[null,"MATERIAL (C) - TOTAL",null,null,null,null,null,null,187.25,187.25]
[]
[415,"FONTE","CÓDIGO","DESCRIÇÃO","UNIDADE","COEFIC.","CUSTO UNITÁRIO",null,"CUSTO  TOTAL (A) + (B) + (C) + (D) + (E)"]
[null,null,null,null,null,null,"DESONERADO","NÃO DESONER.","DESONERADO","NÃO DESONER."]
[null,"COMPOSIÇÃO","COMP 415_SEE","PEITORIL EM GRANITO CINZA, LARGURA VARIÁVEL E PINGADEIRA","M2",null,null,null,203.92000000000002,206.57]
[null,"AGETOP_I",28,"AZULEJISTA","h     ",0.66910000000000003,13.4,15.53,8.9700000000000006,10.39]
[null,"AGETOP_I",5,"SERVENTE","h     ",0.93879999999999997,8.1999999999999993,9.51,7.7,8.93]
[null,null,null,"","",null,0,0,0,0]
[null,"MÃO DE OBRA (B) - TOTAL",null,null,null,null,null,null,16.670000000000002,19.32]
[null,"AGETOP_I",1421,"GRANITO POLIDO P/BANCADA 2 CM","m2",1,180,180,180,180]
[null,"AGETOP_I",1215,"CIMENTO PORTLAND C.P. 32","Kg",10.34,0.39,0.39,4.03,4.03]
[null,"AGETOP_I",2690,"ARGAMASSA DE REJUNTAMENTO","Kg",0.32,3.54,3.54,1.1299999999999999,1.1299999999999999]
[null,"AGETOP_I",104,"AREIA MEDIA ","m3",2.52E-2,82.85,82.85,2.09,2.09]
[null,"MATERIAL (C) - TOTAL",null,null,null,null,null,null,187.25,187.25]