{"text_format":"1","workbook":"xlsx","n_sheets":8,"sheets":["Orçamento","Resumo ","Somatório","Cronog_90_Dias","Composição BDI","Relatório CENTRAL","Parc Maior Relev","Composições"],"not_rendered":{"charts":0,"images":3,"macros":1,"external_links":0,"defined_names":79,"comments":3,"pivot_tables":0},"unopened":[],"bounds":{"document_bytes":16777216,"sheet_cells":100000,"rows_first":2000,"rows_last":500,"rows_between":2000,"halvings":0,"cell_chars":16384,"cell_head_chars":4096},"cells_cut":0,"cells_raw":0,"read":"whole","date_system":"1900"}

{"sheet":"Orçamento","index":0,"n_rows":766,"n_cols":24,"rows_kept":766,"cut":false,"hidden":false,"merged":[[747,18,747,20],[747,21,747,22],[748,15,748,17],[748,18,748,20],[748,21,748,22],[749,15,749,17],[749,18,749,20],[749,21,749,22],[744,15,744,17],[744,18,744,20],[744,21,744,22],[745,15,745,17],[745,18,745,20],[745,21,745,22],[746,15,746,17],[746,18,746,20],[746,21,746,22],[758,18,758,20],[758,21,758,22],[753,15,753,17],[753,18,753,20],[753,21,753,22],[754,15,754,17],[754,18,754,20],[754,21,754,22],[755,15,755,17],[755,18,755,20],[755,21,755,22],[734,14,734,17],[741,15,741,17],[707,15,707,17],[762,18,762,20],[762,21,762,22],[750,15,750,17],[750,18,750,20],[750,21,750,22],[751,15,751,17],[751,18,751,20],[751,21,751,22],[752,15,752,17],[752,18,752,20],[752,21,752,22],[756,15,756,17],[756,18,756,20],[756,21,756,22],[757,15,757,17],[757,18,757,20],[757,21,757,22],[758,15,758,17],[747,15,747,17],[702,16,702,22],[765,18,765,20],[765,21,765,22],[762,14,762,17],[759,15,759,17],[759,18,759,20],[759,21,759,22],[760,15,760,17],[760,18,760,20],[760,21,760,22],[761,15,761,17],[761,18,761,20],[761,21,761,22],[764,18,764,20],[764,21,764,22],[763,18,763,20],[763,21,763,22],[740,14,740,23],[741,18,741,20],[741,21,741,22],[742,15,742,17],[742,18,742,20],[742,21,742,22],[743,15,743,17],[743,18,743,20],[743,21,743,22],[698,16,698,22],[699,16,699,22],[700,16,700,22],[3,21,3,22],[2,21,2,22],[5,21,5,22],[10,14,10,23],[13,14,13,23],[6,21,6,22],[9,17,9,20],[2,14,2,20],[3,14,3,20],[5,18,5,20],[6,18,6,20],[11,18,11,20],[12,18,12,20],[6,14,6,17],[5,14,5,17],[720,15,720,17],[721,15,721,17],[722,15,722,17],[723,15,723,17],[724,15,724,17],[725,15,725,17],[726,15,726,17],[727,15,727,17],[728,15,728,17],[708,15,708,17],[709,15,709,17],[710,15,710,17],[711,15,711,17],[712,15,712,17],[713,15,713,17],[714,15,714,17],[715,15,715,17],[716,15,716,17],[729,15,729,17],[730,15,730,17],[731,15,731,17],[732,15,732,17],[733,15,733,17],[706,14,706,23],[695,20,695,21],[694,20,694,21],[690,17,695,17],[690,20,690,21],[707,18,707,20],[707,21,707,22],[708,18,708,20],[708,21,708,22],[696,20,696,21],[716,18,716,20],[716,21,716,22],[717,18,717,20],[717,21,717,22],[718,18,718,20],[718,21,718,22],[719,18,719,20],[719,21,719,22],[731,18,731,20],[734,18,734,20],[734,21,734,22],[731,21,731,22],[732,18,732,20],[732,21,732,22],[733,18,733,20],[733,21,733,22],[723,18,723,20],[723,21,723,22],[730,18,730,20],[730,21,730,22],[725,21,725,22],[726,18,726,20],[726,21,726,22],[728,18,728,20],[724,18,724,20],[724,21,724,22],[725,18,725,20],[735,18,735,20],[735,21,735,22],[722,18,722,20],[722,21,722,22],[715,18,715,20],[715,21,715,22],[737,18,737,20],[737,21,737,22],[691,20,691,21],[713,18,713,20],[713,21,713,22],[714,18,714,20],[714,21,714,22],[712,18,712,20],[712,21,712,22],[721,18,721,20],[692,20,692,21],[703,18,703,22],[709,18,709,20],[709,21,709,22],[710,18,710,20],[710,21,710,22],[711,18,711,20],[711,21,711,22],[701,16,701,22],[8,12,9,12],[736,18,736,20],[736,21,736,22],[0,14,0,22],[8,14,8,16],[9,14,9,16],[11,14,11,16],[12,14,12,16],[14,14,14,22],[1,14,1,22],[4,14,4,22],[7,14,7,22],[720,18,720,20],[720,21,720,22],[728,21,728,22],[717,15,717,17],[718,15,718,17],[719,15,719,17],[721,21,721,22],[729,18,729,20],[729,21,729,22],[727,18,727,20],[727,21,727,22]]}
[]
[]
[null,null,null,null,null,null,null,null,null,null,null,null,null,null,"UNIDADE ESCOLAR",null,null,null,null,null,null,"CÓDIGO INEP"]
[null,null,null,null,null,null,null,null,null,null,null,null,null,null,"COLÉGIO ESTADUAL DOM EMANUEL",null,null,null,null,null,null,52065812]
[]
["Nmax",null,null,null,null,null,null,null,null,null,null,null,null,null,"OBRA",null,null,null,"DATA",null,null,"CIDADE"]
[{"$f":"MAX($C$18:$C$690)","v":4},null,null,null,null,null,null,null,null,null,null,null,null,null,"REFORMA",null,null,null,"2020-05-12",null,null,"GOIANDIRA"]
[]
[null,null,null,null,null,null,null,null,null,null,null,null,"",null,"CRE",null,null,"ENDEREÇO",null,null,null,"REFERÊNCIA AGETOP"]
[null,null,null,null,null,null,null,null,null,null,null,null,null,null,"CATALÃO",null,null,"AV ILDEFONSO TELES 1, CENTRO, CEP:75740-000",null,null,null,"DEZ/18","DESONERADA"]
[]
[null,null,null,null,null,null,null,null,null,null,null,null,null,null,"ÁREA EXISTENTE (M²)",null,null,"ÁREA A CONSTRUIR (M²)","ÁREA TOTAL CONSTRUÍDA (M²)",null,null,"REFERÊNCIA SINAPI"]
[null,null,null,null,null,null,null,null,null,null,null,null,null,null,1690.6,null,null,532.19000000000005,2222.79,null,null,"FEV/19","DESONERADA"]
[]
[null,null,null,null,null,null,null,null,null,null,null,"FILTRO",null,null,"PLANILHA ORÇAMENTÁRIA"]
["Nível E","Save Nivel","Nível C","Altura","n1","n2","n3","n4","n5","Czero","Cnível","↓","Nível","Nível Corrigido","ITEM","TABELA","CODIGO","DESCRIÇÃO DOS SERVIÇOS","UNID","QUANT","MAT","MO","T.SERVIÇO","OBSERVAÇÕES¹"]
[{"$f":"CHOOSE(1+LOG(1+2*(ORÇAMENTO.Nivel=\"Nível 1\")+4*(ORÇAMENTO.Nivel=\"Nível 2\")+8*(ORÇAMENTO.Nivel=\"Nível 3\")+16*(ORÇAMENTO.Nivel=\"Nível 4\")+32*(ORÇAMENTO.Nivel=\"Serviço\"),2),0,1,2,3,4,\"S\")","v":"S"},{"$f":"IF(OR(C17=\"s\",C17=0),OFFSET(B17,-1,0),C17)","v":"Save Nivel"},{"$f":"IF(OFFSET(C17,-1,0)=\"L\",1,IF(OFFSET(C17,-1,0)=1,2,IF(OR(A17=\"s\",A17=0),\"S\",IF(AND(OFFSET(C17,-1,0)=2,A17=4),3,IF(AND(OR(OFFSET(C17,-1,0)=\"s\",OFFSET(C17,-1,0)=0),A17<>\"s\",A17>OFFSET(B17,-1,0)),OFFSET(B17,-1,0),A17)))))","v":"S"},{"$f":"IF(OR(C17=\"S\",C17=0),0,IF(ISERROR(K17),J17,SMALL(J17:K17,1)))","v":0},{"$f":"IF($C17=1,OFFSET(E17,-1,0)+1,OFFSET(E17,-1,0))","v":"n1"},{"$f":"IF($C17=1,0,IF($C17=2,OFFSET(F17,-1,0)+1,OFFSET(F17,-1,0)))","v":"n2"},{"$f":"IF(AND($C17<=2,$C17<>0),0,IF($C17=3,OFFSET(G17,-1,0)+1,OFFSET(G17,-1,0)))","v":"n3"},{"$f":"IF(AND($C17<=3,$C17<>0),0,IF($C17=4,OFFSET(H17,-1,0)+1,OFFSET(H17,-1,0)))","v":"n4"},{"$f":"IF(AND($C17<=4,$C17<>0),0,IF(AND($C17=\"S\",$W17>0),OFFSET(I17,-1,0)+1,OFFSET(I17,-1,0)))","v":"n5"},{"$f":"IF(OR($C17=\"S\",$C17=0),0,MATCH(0,OFFSET($D17,1,$C17,ROW($C$690)-ROW($C17)),0))","v":0},{"$f":"IF(OR($C17=\"S\",$C17=0),0,MATCH(OFFSET($D17,0,$C17)+1,OFFSET($D17,1,$C17,ROW($C$690)-ROW($C17)),0))","v":0},"","Serviço","Serviço","-","SINAPI",null,"(sem código)","-",null,0,0,0,""]
[0,null,"L",{"$f":"COUNTA(OFFSET(D18,1,0):D$690)","v":671},{"$f":"LEFT(O19,1)-1","v":0},null,null,null,null,null,null,"F","LOTE","LOTE","REFORMA - COLÉGIO ESTADUAL DOM EMANUEL",null,null,null,null,null,null,null,532698.46000000008]
[1,{"$f":"IF(OR(C19=\"s\",C19=0),OFFSET(B19,-1,0),C19)","v":1},{"$f":"IF(OFFSET(C19,-1,0)=\"L\",1,IF(OFFSET(C19,-1,0)=1,2,IF(OR(A19=\"s\",A19=0),\"S\",IF(AND(OFFSET(C19,-1,0)=2,A19=4),3,IF(AND(OR(OFFSET(C19,-1,0)=\"s\",OFFSET(C19,-1,0)=0),A19<>\"s\",A19>OFFSET(B19,-1,0)),OFFSET(B19,-1,0),A19)))))","v":1},{"$f":"IF(OR(C19=\"S\",C19=0),0,IF(ISERROR(K19),J19,SMALL(J19:K19,1)))","v":147},{"$f":"IF($C19=1,OFFSET(E19,-1,0)+1,OFFSET(E19,-1,0))","v":1},{"$f":"IF($C19=1,0,IF($C19=2,OFFSET(F19,-1,0)+1,OFFSET(F19,-1,0)))","v":0},{"$f":"IF(AND($C19<=2,$C19<>0),0,IF($C19=3,OFFSET(G19,-1,0)+1,OFFSET(G19,-1,0)))","v":0},{"$f":"IF(AND($C19<=3,$C19<>0),0,IF($C19=4,OFFSET(H19,-1,0)+1,OFFSET(H19,-1,0)))","v":0},0,{"$f":"IF(OR($C19=\"S\",$C19=0),0,MATCH(0,OFFSET($D19,1,$C19,ROW($C$690)-ROW($C19)),0))","v":671},{"$f":"IF(OR($C19=\"S\",$C19=0),0,MATCH(OFFSET($D19,0,$C19)+1,OFFSET($D19,1,$C19,ROW($C$690)-ROW($C19)),0))","v":147},"F","Nível 1","Nível 1","1.","AGETOP",null,"REFORMA"]
[2,{"$f":"IF(OR(C20=\"s\",C20=0),OFFSET(B20,-1,0),C20)","v":2},{"$f":"IF(OFFSET(C20,-1,0)=\"L\",1,IF(OFFSET(C20,-1,0)=1,2,IF(OR(A20=\"s\",A20=0),\"S\",IF(AND(OFFSET(C20,-1,0)=2,A20=4),3,IF(AND(OR(OFFSET(C20,-1,0)=\"s\",OFFSET(C20,-1,0)=0),A20<>\"s\",A20>OFFSET(B20,-1,0)),OFFSET(B20,-1,0),A20)))))","v":2},{"$f":"IF(OR(C20=\"S\",C20=0),0,IF(ISERROR(K20),J20,SMALL(J20:K20,1)))","v":15},{"$f":"IF($C20=1,OFFSET(E20,-1,0)+1,OFFSET(E20,-1,0))","v":1},{"$f":"IF($C20=1,0,IF($C20=2,OFFSET(F20,-1,0)+1,OFFSET(F20,-1,0)))","v":1},{"$f":"IF(AND($C20<=2,$C20<>0),0,IF($C20=3,OFFSET(G20,-1,0)+1,OFFSET(G20,-1,0)))","v":0},{"$f":"IF(AND($C20<=3,$C20<>0),0,IF($C20=4,OFFSET(H20,-1,0)+1,OFFSET(H20,-1,0)))","v":0},0,146,15,"F","Nível 2","Nível 2","1.1.","AGETOP",null,"SERVIÇOS PRELIMINARES"]
["S",{"$f":"IF(OR(C21=\"s\",C21=0),OFFSET(B21,-1,0),C21)","v":2},{"$f":"IF(OFFSET(C21,-1,0)=\"L\",1,IF(OFFSET(C21,-1,0)=1,2,IF(OR(A21=\"s\",A21=0),\"S\",IF(AND(OFFSET(C21,-1,0)=2,A21=4),3,IF(AND(OR(OFFSET(C21,-1,0)=\"s\",OFFSET(C21,-1,0)=0),A21<>\"s\",A21>OFFSET(B21,-1,0)),OFFSET(B21,-1,0),A21)))))","v":"S"},{"$f":"IF(OR(C21=\"S\",C21=0),0,IF(ISERROR(K21),J21,SMALL(J21:K21,1)))","v":0},1,1,0,0,0,0,0,"F","Serviço","Serviço","1.1.0.0.1.","AGETOP",20101,"DEMOLICAO COBERTURA TELHA CERAMICA C/ TRANSP. ATÉ CB. E CARGA","m2    ",683.7,null,null,null,""]
["S",2,"S",0,1,1,0,0,0,0,0,"F","Serviço","Serviço","1.1.0.0.2.","AGETOP",20109,"DEM.PISO CIMENT.SOBRE LASTRO CONC.C/TR.ATE CB. E CARGA","m2    ",771.86,null,null,null,""]
["S",2,"S",0,1,1,0,0,0,0,0,"F","Serviço","Serviço","1.1.0.0.3.","AGETOP",20121,"DEM. MANUAL EM CONCR.SIMPLES C/TR.ATE CB.E CARGA (O.C.)","m3    ",10.58,null,null,null,""]
["S",2,"S",0,1,1,0,0,0,0,0,"F","Serviço","Serviço","1.1.0.0.4.","SINAPI",97633,"DEMOLIÇÃO DE REVESTIMENTO CERÂMICO, DE FORMA MANUAL, SEM REAPROVEITAMENTO. AF_12/2017","M2",88.29,null,null,null,"Referência: AGETOP - 20115"]
["S",2,"S",0,1,1,0,0,0,0,0,"F","Serviço","Serviço","1.1.0.0.5.","SINAPI",97622,"DEMOLIÇÃO DE ALVENARIA DE BLOCO FURADO, DE FORMA MANUAL, SEM REAPROVEITAMENTO. AF_12/2017","M3",13.4,null,null,null,"Referência: AGETOP - 20118"]
["S",2,"S",0,1,1,0,0,0,0,0,"F","Serviço","Serviço","1.1.0.0.6.","AGETOP",20139,"DEMOLIÇAO DE BANCADAS C/ TRANSP. ATÉ CB. E CARGA","m2    ",7.03,null,null,null,""]
["S",2,"S",0,1,1,0,0,0,0,0,"F","Serviço","Serviço","1.1.0.0.7.","AGETOP",20163,"DEMOLIÇÃO DAS INSTALAÇÕES HIDROSANITÁRIAS E AFINS C/ TRANSP. ATÉ CB. E CARGA","H     ",8,null,null,null,""]
["S",2,"S",0,1,1,0,0,0,0,0,"F","Serviço","Serviço","1.1.0.0.8.","SINAPI","74209/1","PLACA DE OBRA EM CHAPA DE ACO GALVANIZADO","M2",4.5,null,null,null,"Referência: AGETOP - 21301"]
["S",2,"S",0,1,1,0,0,0,0,0,"F","Serviço","Serviço","1.1.0.0.9.","SINAPI",97661,"REMOÇÃO DE CABOS ELÉTRICOS, DE FORMA MANUAL, SEM REAPROVEITAMENTO. AF_12/2017","M",200,null,null,null,""]
["S",2,"S",0,1,1,0,0,0,0,0,"F","Serviço","Serviço","1.1.0.0.10.","SINAPI",97660,"REMOÇÃO DE INTERRUPTORES/TOMADAS ELÉTRICAS, DE FORMA MANUAL, SEM REAPROVEITAMENTO. AF_12/2017","UN",5,null,null,null,""]
["S",2,"S",0,1,1,0,0,0,0,0,"F","Serviço","Serviço","1.1.0.0.11.","SINAPI",97665,"REMOÇÃO DE LUMINÁRIAS, DE FORMA MANUAL, SEM REAPROVEITAMENTO. AF_12/2017","UN",10,null,null,null,""]
["S",2,"S",0,1,1,0,0,0,0,0,"F","Serviço","Serviço","1.1.0.0.12.","COMPOSIÇÃO","COMP 001_SEE","RETIRADA DA ESTRUTURA/TABELA DE BASQUETE C/ TRANSP ATÉ CB. E CARGA","UN ",2,null,null,null,""]
["S",2,"S",0,1,1,0,0,0,0,0,"F","Serviço","Serviço","1.1.0.0.13.","SINAPI",97645,"REMOÇÃO DE JANELAS, DE FORMA MANUAL, SEM REAPROVEITAMENTO. AF_12/2017","M2",12,null,null,null,"Referência: AGETOP - 20106"]
["S",2,"S",0,1,1,0,0,0,0,0,"F","Serviço","Serviço","1.1.0.0.14.","SINAPI",97600,"RETIRADA DE REFLETOR EM ALUMÍNIO COM SUPORTE E ALÇA, LÂMPADA 125 W OU SIMILAR","UN",4,null,null,null,""]
[2,2,2,3,1,2,0,0,0,131,3,"F","Nível 2","Nível 2","1.2.","AGETOP",null,"TRANSPORTES","-",null,null,null,null,""]
["S",2,"S",0,1,2,0,0,0,0,0,"F","Serviço","Serviço","1.2.0.0.1.","SINAPI",72900,"TRANSPORTE DE ENTULHO COM CAMINHAO BASCULANTE 6 M3, RODOVIA PAVIMENTADA, DMT 0,5 A 1,0 KM","M3",66.987499999999997,null,null,null,""]
["S",2,"S",0,1,2,0,0,0,0,0,"F","Serviço","Serviço","1.2.0.0.2.","SINAPI",72897,"CARGA MANUAL DE ENTULHO EM CAMINHAO BASCULANTE 6 M3","M3",66.987499999999997,null,null,null,""]
[2,2,2,10,1,3,0,0,0,128,10,"F","Nível 2","Nível 2","1.3.","AGETOP",null,"SERVIÇO EM TERRA","-",null,null,null,null,""]
["S",2,"S",0,1,3,0,0,0,0,0,"F","Serviço","Serviço","1.3.0.0.1.","SINAPI",79480,"ESCAVACAO MECANICA CAMPO ABERTO EM SOLO EXCETO ROCHA ATE 2,00M PROFUNDIDADE","M3",0.25,null,null,null,"Referência: AGETOP - 41004"]
["S",2,"S",0,1,3,0,0,0,0,0,"F","Serviço","Serviço","1.3.0.0.2.","SINAPI",72898,"CARGA E DESCARGA MECANIZADAS DE ENTULHO EM CAMINHAO BASCULANTE 6 M3","M3",0.25,null,null,null,"Referência: AGETOP - 41005"]
["S",2,"S",0,1,3,0,0,0,0,0,"F","Serviço","Serviço","1.3.0.0.3.","AGETOP",41012,"INDENIZAÇÃO DE JAZIDA","m3    ",0.25,null,null,null,""]
["S",2,"S",0,1,3,0,0,0,0,0,"F","Serviço","Serviço","1.3.0.0.4.","AGETOP",41006,"TRANSPORTE DE MATERIAL ESCAVADO M3.KM","m3km  ",2,null,null,null,""]
["S",2,"S",0,1,3,0,0,0,0,0,"F","Serviço","Serviço","1.3.0.0.5.","SINAPI","74005/2","COMPACTACAO MECANICA C/ CONTROLE DO GC>=95% DO PN (AREAS) (C/MONIVELADORA 140 HP E ROLO COMPRESSOR VIBRATORIO 80 HP)","M3",0.2,null,null,null,"Referência: AGETOP - 41008"]
[{"$f":"CHOOSE(1+LOG(1+2*(ORÇAMENTO.Nivel=\"Nível 1\")+4*(ORÇAMENTO.Nivel=\"Nível 2\")+8*(ORÇAMENTO.Nivel=\"Nível 3\")+16*(ORÇAMENTO.Nivel=\"Nível 4\")+32*(ORÇAMENTO.Nivel=\"Serviço\"),2),0,1,2,3,4,\"S\")","v":"S"},2,"S",0,{"$f":"IF($C44=1,OFFSET(E44,-1,0)+1,OFFSET(E44,-1,0))","v":1},{"$f":"IF($C44=1,0,IF($C44=2,OFFSET(F44,-1,0)+1,OFFSET(F44,-1,0)))","v":3},{"$f":"IF(AND($C44<=2,$C44<>0),0,IF($C44=3,OFFSET(G44,-1,0)+1,OFFSET(G44,-1,0)))","v":0},{"$f":"IF(AND($C44<=3,$C44<>0),0,IF($C44=4,OFFSET(H44,-1,0)+1,OFFSET(H44,-1,0)))","v":0},{"$f":"IF(AND($C44<=4,$C44<>0),0,IF(AND($C44=\"S\",$W44>0),OFFSET(I44,-1,0)+1,OFFSET(I44,-1,0)))","v":0},0,0,"F","Serviço","Serviço","1.3.0.0.6.","AGETOP",41140,"REGULARIZAÇÃO DO TERRENO SEM APILOAMENTO COM TRANSPORTE MANUAL DA TERRA ESCAVADA ","m2    ",172.86,null,null,null,""]
["S",2,"S",0,1,3,0,0,0,0,0,"F","Serviço","Serviço","1.3.0.0.7.","AGETOP",41002,"APILOAMENTO","m2    ",2.7,null,null,null,""]
["S",2,"S",0,1,3,0,0,0,0,0,"F","Serviço","Serviço","1.3.0.0.8.","SINAPI",93358,"ESCAVAÇÃO MANUAL DE VALA COM PROFUNDIDADE MENOR OU IGUAL A 1,30 M. AF_03/2016","M3",8,null,null,null,"Referência: AGETOP - 40101"]
["S",2,"S",0,1,3,0,0,0,0,0,"F","Serviço","Serviço","1.3.0.0.9.","SINAPI",96995,"REATERRO MANUAL APILOADO COM SOQUETE. AF_10/2017","M3",8,null,null,null,"Referência: AGETOP - 40902"]
[{"$f":"CHOOSE(1+LOG(1+2*(ORÇAMENTO.Nivel=\"Nível 1\")+4*(ORÇAMENTO.Nivel=\"Nível 2\")+8*(ORÇAMENTO.Nivel=\"Nível 3\")+16*(ORÇAMENTO.Nivel=\"Nível 4\")+32*(ORÇAMENTO.Nivel=\"Serviço\"),2),0,1,2,3,4,\"S\")","v":2},{"$f":"IF(OR(C48=\"s\",C48=0),OFFSET(B48,-1,0),C48)","v":2},{"$f":"IF(OFFSET(C48,-1,0)=\"L\",1,IF(OFFSET(C48,-1,0)=1,2,IF(OR(A48=\"s\",A48=0),\"S\",IF(AND(OFFSET(C48,-1,0)=2,A48=4),3,IF(AND(OR(OFFSET(C48,-1,0)=\"s\",OFFSET(C48,-1,0)=0),A48<>\"s\",A48>OFFSET(B48,-1,0)),OFFSET(B48,-1,0),A48)))))","v":2},{"$f":"IF(OR(C48=\"S\",C48=0),0,IF(ISERROR(K48),J48,SMALL(J48:K48,1)))","v":57},{"$f":"IF($C48=1,OFFSET(E48,-1,0)+1,OFFSET(E48,-1,0))","v":1},{"$f":"IF($C48=1,0,IF($C48=2,OFFSET(F48,-1,0)+1,OFFSET(F48,-1,0)))","v":4},{"$f":"IF(AND($C48<=2,$C48<>0),0,IF($C48=3,OFFSET(G48,-1,0)+1,OFFSET(G48,-1,0)))","v":0},{"$f":"IF(AND($C48<=3,$C48<>0),0,IF($C48=4,OFFSET(H48,-1,0)+1,OFFSET(H48,-1,0)))","v":0},{"$f":"IF(AND($C48<=4,$C48<>0),0,IF(AND($C48=\"S\",$W48>0),OFFSET(I48,-1,0)+1,OFFSET(I48,-1,0)))","v":0},118,57,"F","Nível 2","Nível 2","1.4.",null,null,"INSTALAÇÕES ELÉTRICAS","-",null,null,null,null,""]
["S",2,"S",0,1,4,0,0,0,0,0,"F","Serviço","Serviço","1.4.0.0.1.","AGETOP",70351,"BRACADEIRA METALICA TIPO \"U\" DIAM. 3/4\"","Un    ",150,null,null,null,""]
["S",2,"S",0,1,4,0,0,0,0,0,"F","Serviço","Serviço","1.4.0.0.2.","AGETOP",70352,"BRACADEIRA METALICA TIPO \"U\" DIAM. 1\"","Un    ",60,null,null,null,""]
["S",2,"S",0,1,4,0,0,0,0,0,"F","Serviço","Serviço","1.4.0.0.3.","AGETOP",70355,"BRACADEIRA METALICA TIPO \"U\" DIAM. 2\"","Un    ",10,null,null,null,""]
["S",2,"S",0,1,4,0,0,0,0,0,"F","Serviço","Serviço","1.4.0.0.4.","AGETOP",70421,"BUCHA E ARRUELA METALICA DIAM. 3/4\"","PR    ",20,null,null,null,""]
["S",2,"S",0,1,4,0,0,0,0,0,"F","Serviço","Serviço","1.4.0.0.5.","AGETOP",70422,"BUCHA E ARRUELA METALICA DIAM. 1\"","PR    ",10,null,null,null,""]
["S",2,"S",0,1,4,0,0,0,0,0,"F","Serviço","Serviço","1.4.0.0.6.","AGETOP",70425,"BUCHA E ARRUELA METALICA DIAM. 2\"","PR    ",8,null,null,null,""]
["S",2,"S",0,1,4,0,0,0,0,0,"F","Serviço","Serviço","1.4.0.0.7.","SINAPI",91926,"CABO DE COBRE FLEXÍVEL ISOLADO, 2,5 MM², ANTI-CHAMA 450/750 V, PARA CIRCUITOS TERMINAIS - FORNECIMENTO E INSTALAÇÃO. AF_12/2015","M",1600,null,null,null,""]
["S",2,"S",0,1,4,0,0,0,0,0,"F","Serviço","Serviço","1.4.0.0.8.","SINAPI",91929,"CABO DE COBRE FLEXÍVEL ISOLADO, 4 MM², ANTI-CHAMA 0,6/1,0 KV, PARA CIRCUITOS TERMINAIS - FORNECIMENTO E INSTALAÇÃO. AF_12/2015","M",1100,null,null,null,""]
["S",2,"S",0,1,4,0,0,0,0,0,"F","Serviço","Serviço","1.4.0.0.9.","SINAPI",91931,"CABO DE COBRE FLEXÍVEL ISOLADO, 6 MM², ANTI-CHAMA 0,6/1,0 KV, PARA CIRCUITOS TERMINAIS - FORNECIMENTO E INSTALAÇÃO. AF_12/2015","M",1250,null,null,null,""]
["S",2,"S",0,1,4,0,0,0,0,0,"F","Serviço","Serviço","1.4.0.0.10.","SINAPI",91933,"CABO DE COBRE FLEXÍVEL ISOLADO, 10 MM², ANTI-CHAMA 0,6/1,0 KV, PARA CIRCUITOS TERMINAIS - FORNECIMENTO E INSTALAÇÃO. AF_12/2015","M",360,null,null,null,"Referência: AGETOP - 70509"]
["S",2,"S",0,1,4,0,0,0,0,0,"F","Serviço","Serviço","1.4.0.0.11.","SINAPI",92984,"CABO DE COBRE FLEXÍVEL ISOLADO, 25 MM², ANTI-CHAMA 0,6/1,0 KV, PARA DISTRIBUIÇÃO - FORNECIMENTO E INSTALAÇÃO. AF_12/2015","M",15,null,null,null,"Referência: AGETOP - 70510"]
["S",2,"S",0,1,4,0,0,0,0,0,"F","Serviço","Serviço","1.4.0.0.12.","SINAPI",92985,"CABO DE COBRE FLEXÍVEL ISOLADO, 35 MM², ANTI-CHAMA 450/750 V, PARA DISTRIBUIÇÃO - FORNECIMENTO E INSTALAÇÃO. AF_12/2015","M",60,null,null,null,"Referência: AGETOP - 70511"]
["S",2,"S",0,1,4,0,0,0,0,0,"F","Serviço","Serviço","1.4.0.0.13.","SINAPI",96971,"CORDOALHA DE COBRE NU 16 MM², NÃO ENTERRADA, COM ISOLADOR - FORNECIMENTO E INSTALAÇÃO. AF_12/2017","M",15,null,null,null,"Referência: AGETOP - 70541"]
["S",2,"S",0,1,4,0,0,0,0,0,"F","Serviço","Serviço","1.4.0.0.14.","SINAPI",92867,"CAIXA RETANGULAR 4\" X 2\" ALTA (2,00 M DO PISO), METÁLICA, INSTALADA EM PAREDE - FORNECIMENTO E INSTALAÇÃO. AF_12/2015","UN",3,null,null,null,"Referência: AGETOP - 70680"]
[{"$f":"CHOOSE(1+LOG(1+2*(ORÇAMENTO.Nivel=\"Nível 1\")+4*(ORÇAMENTO.Nivel=\"Nível 2\")+8*(ORÇAMENTO.Nivel=\"Nível 3\")+16*(ORÇAMENTO.Nivel=\"Nível 4\")+32*(ORÇAMENTO.Nivel=\"Serviço\"),2),0,1,2,3,4,\"S\")","v":"S"},2,"S",0,1,4,0,0,{"$f":"IF(AND($C63<=4,$C63<>0),0,IF(AND($C63=\"S\",$W63>0),OFFSET(I63,-1,0)+1,OFFSET(I63,-1,0)))","v":0},0,0,"F","Serviço","Serviço","1.4.0.0.15.","SINAPI",92865,"CAIXA OCTOGONAL 4\" X 4\", METÁLICA, INSTALADA EM LAJE - FORNECIMENTO E INSTALAÇÃO. AF_12/2015","UN",30,null,null,null,"Referência: AGETOP - 70682"]
["S",2,"S",0,1,4,0,0,0,0,0,"F","Serviço","Serviço","1.4.0.0.16.","SINAPI",92868,"CAIXA RETANGULAR 4\" X 2\" MÉDIA (1,30 M DO PISO), METÁLICA, INSTALADA EM PAREDE - FORNECIMENTO E INSTALAÇÃO. AF_12/2015","UN",2,null,null,null,"Referência: AGETOP - 70691"]
["S",2,"S",0,1,4,0,0,0,0,0,"F","Serviço","Serviço","1.4.0.0.17.","SINAPI",97891,"CAIXA ENTERRADA ELÉTRICA RETANGULAR, EM ALVENARIA COM BLOCOS DE CONCRETO, FUNDO COM BRITA, DIMENSÕES INTERNAS: 0,4X0,4X0,4 M. AF_05/2018","UN",8,null,null,null,"Referência: AGETOP - 70692"]
["S",2,"S",0,{"$f":"IF($C66=1,OFFSET(E66,-1,0)+1,OFFSET(E66,-1,0))","v":1},{"$f":"IF($C66=1,0,IF($C66=2,OFFSET(F66,-1,0)+1,OFFSET(F66,-1,0)))","v":4},{"$f":"IF(AND($C66<=2,$C66<>0),0,IF($C66=3,OFFSET(G66,-1,0)+1,OFFSET(G66,-1,0)))","v":0},{"$f":"IF(AND($C66<=3,$C66<>0),0,IF($C66=4,OFFSET(H66,-1,0)+1,OFFSET(H66,-1,0)))","v":0},0,0,0,"F","Serviço","Serviço","1.4.0.0.18.","AGETOP",70255,"ATERRAMENTO - SOLDA EXOTÉRMICA - CARTUCHO 90 G","un    ",1,null,null,null,""]
["S",2,"S",0,1,4,0,0,0,0,0,"F","Serviço","Serviço","1.4.0.0.19.","AGETOP",70352,"BRACADEIRA METALICA TIPO \"U\" DIAM. 1\"","Un    ",4,null,null,null,""]
["S",2,"S",0,1,4,0,0,0,0,0,"F","Serviço","Serviço","1.4.0.0.20.","SINAPI",95801,"CONDULETE DE ALUMÍNIO, TIPO X, PARA ELETRODUTO DE AÇO GALVANIZADO DN 20 MM (3/4''), APARENTE - FORNECIMENTO E INSTALAÇÃO. AF_11/2016_P","UN",30,null,null,null,"Referência: AGETOP - 70929"]
["S",2,"S",0,1,4,0,0,0,0,0,"F","Serviço","Serviço","1.4.0.0.21.","SINAPI",93653,"DISJUNTOR MONOPOLAR TIPO DIN, CORRENTE NOMINAL DE 10A - FORNECIMENTO E INSTALAÇÃO. AF_04/2016","UN",8,null,null,null,""]
["S",2,"S",0,1,4,0,0,0,0,0,"F","Serviço","Serviço","1.4.0.0.22.","SINAPI",93654,"DISJUNTOR MONOPOLAR TIPO DIN, CORRENTE NOMINAL DE 16A - FORNECIMENTO E INSTALAÇÃO. AF_04/2016","UN",38,null,null,null,""]
["S",2,"S",0,1,4,0,0,0,0,0,"F","Serviço","Serviço","1.4.0.0.23.","SINAPI",93671,"DISJUNTOR TRIPOLAR TIPO DIN, CORRENTE NOMINAL DE 32A - FORNECIMENTO E INSTALAÇÃO. AF_04/2016","UN",4,null,null,null,"Referência: AGETOP - 71171"]
["S",{"$f":"IF(OR(C72=\"s\",C72=0),OFFSET(B72,-1,0),C72)","v":2},{"$f":"IF(OFFSET(C72,-1,0)=\"L\",1,IF(OFFSET(C72,-1,0)=1,2,IF(OR(A72=\"s\",A72=0),\"S\",IF(AND(OFFSET(C72,-1,0)=2,A72=4),3,IF(AND(OR(OFFSET(C72,-1,0)=\"s\",OFFSET(C72,-1,0)=0),A72<>\"s\",A72>OFFSET(B72,-1,0)),OFFSET(B72,-1,0),A72)))))","v":"S"},{"$f":"IF(OR(C72=\"S\",C72=0),0,IF(ISERROR(K72),J72,SMALL(J72:K72,1)))","v":0},1,4,0,0,0,0,0,"F","Serviço","Serviço","1.4.0.0.24.","SINAPI",93672,"DISJUNTOR TRIPOLAR TIPO DIN, CORRENTE NOMINAL DE 40A - FORNECIMENTO E INSTALAÇÃO. AF_04/2016","UN",4,null,null,null,"Referência: AGETOP - 71173"]
["S",2,"S",0,1,4,0,0,0,0,0,"F","Serviço","Serviço","1.4.0.0.25.","SINAPI",93673,"DISJUNTOR TRIPOLAR TIPO DIN, CORRENTE NOMINAL DE 50A - FORNECIMENTO E INSTALAÇÃO. AF_04/2016","UN",2,null,null,null,"Referência: AGETOP - 71174"]
["S",2,"S",0,1,4,0,0,0,0,0,"F","Serviço","Serviço","1.4.0.0.26.","SINAPI","74130/5","DISJUNTOR TERMOMAGNETICO TRIPOLAR PADRAO NEMA (AMERICANO) 60 A 100A 240V, FORNECIMENTO E INSTALACAO","UN",2,null,null,null,""]
["S",2,"S",0,1,4,0,0,0,0,0,"F","Serviço","Serviço","1.4.0.0.27.","AGETOP",71184,"DISPOSITIVO DE PROTEÇÃO CONTRA SURTOS (D.P.S.) 275V DE 8 A 40KA","Un    ",4,null,null,null,"Referência: AGETOP - 71184"]
["S",2,"S",0,1,4,0,0,0,0,0,"F","Serviço","Serviço","1.4.0.0.28.","AGETOP",71824,"PADRÃO TRIFASICO 35 MM H=7 METROS","Un    ",1,null,null,null,""]
["S",2,"S",0,1,4,0,0,0,0,0,"F","Serviço","Serviço","1.4.0.0.29.","SINAPI",91844,"ELETRODUTO FLEXÍVEL CORRUGADO, PVC, DN 25 MM (3/4\"), PARA CIRCUITOS TERMINAIS, INSTALADO EM LAJE - FORNECIMENTO E INSTALAÇÃO. AF_12/2015","M",600,null,null,null,""]
["S",2,"S",0,1,4,0,0,0,0,0,"F","Serviço","Serviço","1.4.0.0.30.","AGETOP",71201,"ELETRODUTO DE PVC RIGIDO DIAMETRO 3/4\"","M     ",98,null,null,null,""]
["S",2,"S",0,1,4,0,0,0,0,0,"F","Serviço","Serviço","1.4.0.0.31.","AGETOP",71194,"ELETRODUTO PVC FLEXÍVEL - MANGUEIRA CORRUGADA LEVE - DIAM. 25MM","M     ",70,null,null,null,""]
["S",2,"S",0,1,4,0,0,0,0,0,"F","Serviço","Serviço","1.4.0.0.32.","AGETOP",71202,"ELETRODUTO DE PVC RIGIDO DIAMETRO 1\"","M     ",270,null,null,null,""]
["S",2,"S",0,1,4,0,0,0,0,0,"F","Serviço","Serviço","1.4.0.0.33.","AGETOP",71203,"ELETRODUTO DE PVC RIGIDO DIAMETRO 1.1/2\"","M     ",130,null,null,null,""]
["S",2,"S",0,1,4,0,0,0,0,0,"F","Serviço","Serviço","1.4.0.0.34.","AGETOP",71205,"ELETRODUTO DE PVC RIGIDO DIAMETRO 2\"","M     ",40,null,null,null,""]
["S",2,"S",0,1,4,0,0,0,{"$f":"IF(OR($C83=\"S\",$C83=0),0,MATCH(0,OFFSET($D83,1,$C83,ROW($C$690)-ROW($C83)),0))","v":0},{"$f":"IF(OR($C83=\"S\",$C83=0),0,MATCH(OFFSET($D83,0,$C83)+1,OFFSET($D83,1,$C83,ROW($C$690)-ROW($C83)),0))","v":0},"F","Serviço","Serviço","1.4.0.0.35.","AGETOP",71215,"ELETRODUTO EM AÇO GALVANIZADO A FOGO DIÂMETRO 2\" - PESADO ","M     ",6,null,null,null,"Referência: AGETOP - 71215"]
["S",2,"S",0,1,4,0,0,0,0,0,"F","Serviço","Serviço","1.4.0.0.36.","AGETOP",71321,"FITA DE AUTO FUSAO, ROLO E 10,00 MM","Un    ",1,null,null,null,"Referência: AGETOP - 71321"]
["S",2,"S",0,1,4,0,0,0,0,0,"F","Serviço","Serviço","1.4.0.0.37.","AGETOP",71331,"FITA ISOLANTE, ROLO DE 20,00 M","Un    ",1,null,null,null,"Referência: AGETOP - 71331"]
["S",2,"S",0,1,4,0,0,0,0,0,"F","Serviço","Serviço","1.4.0.0.38.","AGETOP",71381,"HASTE REV.COBRE(COPPERWELD)  5/8\" X 3,00 M C/CONECTOR","Un    ",3,null,null,null,"Referência: AGETOP - 71381"]
["S",2,"S",0,1,4,0,0,0,0,0,"F","Serviço","Serviço","1.4.0.0.39.","SINAPI",91953,"INTERRUPTOR SIMPLES (1 MÓDULO), 10A/250V, INCLUINDO SUPORTE E PLACA - FORNECIMENTO E INSTALAÇÃO. AF_12/2015","UN",30,null,null,null,"Referência: AGETOP - 71440"]
["S",2,"S",0,1,4,0,0,0,0,0,"F","Serviço","Serviço","1.4.0.0.40.","SINAPI",72278,"LAMPADA VAPOR METALICO 400W - FORNECIMENTO E INSTALACAO","UN",12,null,null,null,"Referência: AGETOP - 71527"]
["S",2,"S",0,1,4,0,0,0,0,0,"F","Serviço","Serviço","1.4.0.0.41.","COMPOSIÇÃO","COMP 387_SEE","LÂMPADA LED TUBULAR 18W ","UN ",196,null,null,null,"Referência: AGETOP - 71567"]
["S",2,"S",0,1,4,0,0,0,0,0,"F","Serviço","Serviço","1.4.0.0.42.","SINAPI",93043,"LÂMPADA LED 10 W BIVOLT BRANCA, FORMATO TRADICIONAL (BASE E27) - FORNECIMENTO E INSTALAÇÃO","UN",5,null,null,null,"Referência: AGETOP - 71577"]
["S",2,"S",0,1,4,0,0,0,0,0,"F","Serviço","Serviço","1.4.0.0.43.","SINAPI",97585,"LUMINÁRIA TIPO CALHA, DE SOBREPOR, COM 2 LÂMPADAS TUBULARES DE 18 W - FORNECIMENTO E INSTALAÇÃO. AF_11/2017","UN",25,null,null,null,""]
["S",2,"S",0,1,4,0,0,0,0,0,"F","Serviço","Serviço","1.4.0.0.44.","SINAPI",91884,"LUVA PARA ELETRODUTO, PVC, ROSCÁVEL, DN 25 MM (3/4\"), PARA CIRCUITOS TERMINAIS, INSTALADA EM PAREDE - FORNECIMENTO E INSTALAÇÃO. AF_12/2015","UN",100,null,null,null,"Referência: AGETOP - 71701"]
["S",2,"S",0,1,4,0,0,0,0,0,"F","Serviço","Serviço","1.4.0.0.45.","SINAPI",91885,"LUVA PARA ELETRODUTO, PVC, ROSCÁVEL, DN 32 MM (1\"), PARA CIRCUITOS TERMINAIS, INSTALADA EM PAREDE - FORNECIMENTO E INSTALAÇÃO. AF_12/2015","UN",60,null,null,null,"Referência: AGETOP - 71702"]
["S",2,"S",0,1,4,0,0,0,0,0,"F","Serviço","Serviço","1.4.0.0.46.","SINAPI",93013,"LUVA PARA ELETRODUTO, PVC, ROSCÁVEL, DN 50 MM (1 1/2\") - FORNECIMENTO E INSTALAÇÃO. AF_12/2015","UN",65,null,null,null,""]
["S",2,"S",0,1,4,0,0,0,0,0,"F","Serviço","Serviço","1.4.0.0.47.","SINAPI",93014,"LUVA PARA ELETRODUTO, PVC, ROSCÁVEL, DN 60 MM (2\") - FORNECIMENTO E INSTALAÇÃO. AF_12/2015","UN",10,null,null,null,"Referência: AGETOP - 71704"]
["S",2,"S",0,1,4,0,0,0,0,0,"F","Serviço","Serviço","1.4.0.0.48.","SINAPI",91902,"CURVA 90 GRAUS PARA ELETRODUTO, PVC, ROSCÁVEL, DN 25 MM (3/4\"), PARA CIRCUITOS TERMINAIS, INSTALADA EM LAJE - FORNECIMENTO E INSTALAÇÃO. AF_12/2015","UN",10,null,null,null,""]
["S",2,"S",0,1,4,0,0,0,0,0,"F","Serviço","Serviço","1.4.0.0.49.","SINAPI",91905,"CURVA 90 GRAUS PARA ELETRODUTO, PVC, ROSCÁVEL, DN 32 MM (1\"), PARA CIRCUITOS TERMINAIS, INSTALADA EM LAJE - FORNECIMENTO E INSTALAÇÃO. AF_12/2015","UN",6,null,null,null,"Referência: AGETOP - 71741"]
["S",2,"S",0,1,4,0,0,0,0,0,"F","Serviço","Serviço","1.4.0.0.50.","SINAPI",93020,"CURVA 90 GRAUS PARA ELETRODUTO, PVC, ROSCÁVEL, DN 60 MM (2\") - FORNECIMENTO E INSTALAÇÃO. AF_12/2015","UN",2,null,null,null,"Referência: AGETOP - 71744"]
["S",2,"S",0,1,4,0,0,0,0,0,"F","Serviço","Serviço","1.4.0.0.51.","SINAPI","74131/6","QUADRO DE DISTRIBUICAO DE ENERGIA DE EMBUTIR, EM CHAPA METALICA, PARA 32 DISJUNTORES TERMOMAGNETICOS MONOPOLARES, COM BARRAMENTO TRIFASICO E NEUTRO, FORNECIMENTO E INSTALACAO","UN",1,null,null,null,"Referência: AGETOP - 72198"]
["S",2,"S",0,1,4,0,0,0,0,0,"F","Serviço","Serviço","1.4.0.0.52.","SINAPI",83463,"QUADRO DE DISTRIBUICAO DE ENERGIA EM CHAPA DE ACO GALVANIZADO, PARA 12 DISJUNTORES TERMOMAGNETICOS MONOPOLARES, COM BARRAMENTO TRIFASICO E NEUTRO - FORNECIMENTO E INSTALACAO","UN",3,null,null,null,""]
["S",2,"S",0,1,4,0,0,0,0,0,"F","Serviço","Serviço","1.4.0.0.53.","AGETOP",72238,"REATOR AFP USO EXTERNO V.METALICO 400 W","Un    ",12,null,null,null,"Referência: AGETOP - 72238"]
["S",2,"S",0,1,4,0,0,0,0,0,"F","Serviço","Serviço","1.4.0.0.54.","SINAPI",91996,"TOMADA MÉDIA DE EMBUTIR (1 MÓDULO), 2P+T 10 A, INCLUINDO SUPORTE E PLACA - FORNECIMENTO E INSTALAÇÃO. AF_12/2015","UN",15,null,null,null,"Referência: AGETOP - 72578"]
["S",2,"S",0,1,4,0,0,0,0,0,"F","Serviço","Serviço","1.4.0.0.55.","SINAPI",92000,"TOMADA BAIXA DE EMBUTIR (1 MÓDULO), 2P+T 10 A, INCLUINDO SUPORTE E PLACA - FORNECIMENTO E INSTALAÇÃO. AF_12/2015","UN",5,null,null,null,"Referência: AGETOP - 72578"]
["S",2,"S",0,1,4,0,0,0,0,0,"F","Serviço","Serviço","1.4.0.0.56.","SINAPI",91993,"TOMADA ALTA DE EMBUTIR (1 MÓDULO), 2P+T 20 A, INCLUINDO SUPORTE E PLACA - FORNECIMENTO E INSTALAÇÃO. AF_12/2015","UN",32,null,null,null,"Referência: AGETOP - 72585"]
[2,2,2,27,1,5,0,0,0,61,27,"F","Nível 2","Nível 2","1.5.","SINAPI",null,"INSTALAÇÕES ESPECIAIS","-",null,null,null,null,""]
["S",2,"S",0,1,5,0,0,0,0,0,"F","Serviço","Serviço","1.5.0.0.1.","AGETOP",91007,"CENTRAL DE GÁS PADRÃO AGETOP SEM INSTALAÇÕES (1+1 CILINDRO 45 KG)","Un    ",1,null,null,null,""]
["S",2,"S",0,1,5,0,0,0,0,0,"F","Serviço","Serviço","1.5.0.0.2.","AGETOP",91023,"UNIÃO S/BRONZE PRETA 3/4\" NPT 300 LBS","Un    ",3,null,null,null,""]
["S",2,"S",0,1,5,0,0,0,0,0,"F","Serviço","Serviço","1.5.0.0.3.","COMPOSIÇÃO","COMP 382_SEE","TE DE REDUCAO DE FERRO GALVANIZADO, COM ROSCA BSP, DE 3/4\" X 1/2\"","UN ",1,null,null,null,""]
["S",2,"S",0,1,5,0,0,0,0,0,"F","Serviço","Serviço","1.5.0.0.4.","COMPOSIÇÃO","COMP 383_SEE","BUCHA DE REDUCAO DE FERRO GALVANIZADO, COM ROSCA BSP, DE 1/2\" X 1/4\"","UN ",3,null,null,null,""]
["S",2,"S",0,1,5,0,0,0,0,0,"F","Serviço","Serviço","1.5.0.0.5.","AGETOP",91021,"LUVA GALVANIZADO DE REDUÇÃO 3/4\" X 1/2\" (GÁS)","Un    ",2,null,null,null,""]
["S",2,"S",0,1,5,0,0,0,0,0,"F","Serviço","Serviço","1.5.0.0.6.","SINAPI",92692,"NIPLE, EM FERRO GALVANIZADO, CONEXÃO ROSQUEADA, DN 15 (1/2\"), INSTALADO EM RAMAIS E SUB-RAMAIS DE GÁS - FORNECIMENTO E INSTALAÇÃO. AF_12/2015","UN",6,null,null,null,""]
["S",2,"S",0,1,5,0,0,0,0,0,"F","Serviço","Serviço","1.5.0.0.7.","AGETOP",91031,"NIPLE DUPLO 300 PSI 3/4\"","Un    ",6,null,null,null,""]
["S",2,"S",0,1,5,0,0,0,0,0,"F","Serviço","Serviço","1.5.0.0.8.","COMPOSIÇÃO","COMP 212_SEE","NIPLE DE REDUÇÃO 1/2\" X 1/4\" BSP","UN ",4,null,null,null,""]
["S",2,"S",0,1,5,0,0,0,0,0,"F","Serviço","Serviço","1.5.0.0.9.","COMPOSIÇÃO","COMP 213_SEE","NIPLE DE REDUÇÃO 3/4\" X 1/2\" BSP","UN ",4,null,null,null,""]
["S",2,"S",0,1,5,0,0,0,0,0,"F","Serviço","Serviço","1.5.0.0.10.","SINAPI",92688,"TUBO DE AÇO GALVANIZADO COM COSTURA, CLASSE MÉDIA, CONEXÃO ROSQUEADA, DN 20 (3/4\"), INSTALADO EM RAMAIS E SUB-RAMAIS DE GÁS - FORNECIMENTO E INSTALAÇÃO. AF_12/2015","M",12,null,null,null,""]
["S",2,"S",0,1,5,0,0,0,0,0,"F","Serviço","Serviço","1.5.0.0.11.","SINAPI",92701,"JOELHO 90 GRAUS, EM FERRO GALVANIZADO, CONEXÃO ROSQUEADA, DN 20 (3/4\"), INSTALADO EM RAMAIS E SUB-RAMAIS DE GÁS - FORNECIMENTO E INSTALAÇÃO. AF_12/2015","UN",4,null,null,null,""]
["S",2,"S",0,1,5,0,0,0,0,0,"F","Serviço","Serviço","1.5.0.0.12.","COMPOSIÇÃO","COMP 237_SEE","FITA ANTICORROSIVA","M",8,null,null,null,""]
["S",2,"S",0,1,5,0,0,0,0,0,"F","Serviço","Serviço","1.5.0.0.13.","AGETOP",91025,"VÁLVULA ESFERICA LATÃO 3/4\"","Un    ",3,null,null,null,""]
["S",2,"S",0,1,5,0,0,0,0,0,"F","Serviço","Serviço","1.5.0.0.14.","COMPOSIÇÃO","COMP 542_SEE","VÁLVULA UGV 3/4\" (S) LATÃO","UN ",1,null,null,null,""]
["S",2,"S",0,1,5,0,0,0,0,0,"F","Serviço","Serviço","1.5.0.0.15.","COMPOSIÇÃO","COMP 543_SEE","VÁLVULA UGV 1/2\" (S) LATÃO","UN ",1,null,null,null,""]
["S",2,"S",0,1,5,0,0,0,0,0,"F","Serviço","Serviço","1.5.0.0.16.","AGETOP",91029,"VALVULA DE RETENÇÃO LATÃO 1/2\" X 7/16\" NPT","Un    ",1,null,null,null,""]
["S",2,"S",0,1,5,0,0,0,0,0,"F","Serviço","Serviço","1.5.0.0.17.","COMPOSIÇÃO","COMP 211_SEE","REGULADOR DE 2º ESTÁGIO 5KG/H","UN ",1,null,null,null,""]
["S",2,"S",0,1,5,0,0,0,0,0,"F","Serviço","Serviço","1.5.0.0.18.","COMPOSIÇÃO","COMP 210_SEE","REGULADOR DE 1º ESTÁGIO 60KG/H MODELO AP-40  COM MANÔMETRO","UN ",1,null,null,null,""]
["S",2,"S",0,1,5,0,0,0,0,0,"","Serviço","Serviço","-",null,null,"(sem código)","-",null,null,null,null,""]
["S",2,"S",0,1,5,0,0,0,0,0,"F","Serviço","Serviço","1.5.0.0.19.","AGETOP",85003,"EXTINTOR PO QUIMICO SECO (6 KG) - CAPACIDADE EXTINTORA 20 BC","Un    ",1,null,null,null,""]
["S",2,"S",0,1,5,0,0,0,0,0,"F","Serviço","Serviço","1.5.0.0.20.","COMPOSIÇÃO","COMP 235_SEE","PLACA DE SINALIZAÇÃO EM PVC COD 01 - (300X300) PROIBIDO FUMAR","UN ",2,null,null,null,""]
["S",2,"S",0,1,5,0,0,0,0,0,"F","Serviço","Serviço","1.5.0.0.21.","COMPOSIÇÃO","COMP 236_SEE","PLACA DE SINALIZAÇÃO EM PVC COD 06 - (300X300) PERIGO INFLAMÁVEL","UN ",2,null,null,null,""]
["S",2,"S",0,1,5,0,0,0,0,0,"F","Serviço","Serviço","1.5.0.0.22.","AGETOP",91043,"BRAÇADEIRA METALICA TIPO \"D\" DIAM. 3/4\"","Un    ",4,null,null,null,""]
["S",2,"S",0,1,5,0,0,0,0,0,"F","Serviço","Serviço","1.5.0.0.23.","AGETOP",71863,"PARAFUSO P/BUCHA S-10","Un    ",8,null,null,null,""]
["S",2,"S",0,1,5,0,0,0,0,0,"F","Serviço","Serviço","1.5.0.0.24.","AGETOP",70393,"BUCHA DE NYLON S-10","Un    ",8,null,null,null,""]
["S",2,"S",0,1,5,0,0,0,0,0,"F","Serviço","Serviço","1.5.0.0.25.","AGETOP",91045,"SUPORTE PARA COLETOR","Un    ",2,null,null,null,""]
[{"$f":"CHOOSE(1+LOG(1+2*(ORÇAMENTO.Nivel=\"Nível 1\")+4*(ORÇAMENTO.Nivel=\"Nível 2\")+8*(ORÇAMENTO.Nivel=\"Nível 3\")+16*(ORÇAMENTO.Nivel=\"Nível 4\")+32*(ORÇAMENTO.Nivel=\"Serviço\"),2),0,1,2,3,4,\"S\")","v":2},{"$f":"IF(OR(C132=\"s\",C132=0),OFFSET(B132,-1,0),C132)","v":2},{"$f":"IF(OFFSET(C132,-1,0)=\"L\",1,IF(OFFSET(C132,-1,0)=1,2,IF(OR(A132=\"s\",A132=0),\"S\",IF(AND(OFFSET(C132,-1,0)=2,A132=4),3,IF(AND(OR(OFFSET(C132,-1,0)=\"s\",OFFSET(C132,-1,0)=0),A132<>\"s\",A132>OFFSET(B132,-1,0)),OFFSET(B132,-1,0),A132)))))","v":2},{"$f":"IF(OR(C132=\"S\",C132=0),0,IF(ISERROR(K132),J132,SMALL(J132:K132,1)))","v":2},{"$f":"IF($C132=1,OFFSET(E132,-1,0)+1,OFFSET(E132,-1,0))","v":1},{"$f":"IF($C132=1,0,IF($C132=2,OFFSET(F132,-1,0)+1,OFFSET(F132,-1,0)))","v":6},{"$f":"IF(AND($C132<=2,$C132<>0),0,IF($C132=3,OFFSET(G132,-1,0)+1,OFFSET(G132,-1,0)))","v":0},{"$f":"IF(AND($C132<=3,$C132<>0),0,IF($C132=4,OFFSET(H132,-1,0)+1,OFFSET(H132,-1,0)))","v":0},{"$f":"IF(AND($C132<=4,$C132<>0),0,IF(AND($C132=\"S\",$W132>0),OFFSET(I132,-1,0)+1,OFFSET(I132,-1,0)))","v":0},34,2,"F","Nível 2","Nível 2","1.6.","AGETOP",91045,"ALVENARIAS E DIVISÓRIAS","Un    ",null,null,null,null,""]
["S",2,"S",0,{"$f":"IF($C133=1,OFFSET(E133,-1,0)+1,OFFSET(E133,-1,0))","v":1},{"$f":"IF($C133=1,0,IF($C133=2,OFFSET(F133,-1,0)+1,OFFSET(F133,-1,0)))","v":6},{"$f":"IF(AND($C133<=2,$C133<>0),0,IF($C133=3,OFFSET(G133,-1,0)+1,OFFSET(G133,-1,0)))","v":0},{"$f":"IF(AND($C133<=3,$C133<>0),0,IF($C133=4,OFFSET(H133,-1,0)+1,OFFSET(H133,-1,0)))","v":0},0,0,0,"F","Serviço","Serviço","1.6.0.0.1.","SINAPI",87520,"ALVENARIA DE VEDAÇÃO DE BLOCOS CERÂMICOS FURADOS NA HORIZONTAL DE 9X19X19CM (ESPESSURA 9CM) DE PAREDES COM ÁREA LÍQUIDA MAIOR OU IGUAL A 6M² COM VÃOS E ARGAMASSA DE ASSENTAMENTO COM PREPARO MANUAL. AF_06/2014","M2",0.26,null,null,null,""]
[2,{"$f":"IF(OR(C134=\"s\",C134=0),OFFSET(B134,-1,0),C134)","v":2},{"$f":"IF(OFFSET(C134,-1,0)=\"L\",1,IF(OFFSET(C134,-1,0)=1,2,IF(OR(A134=\"s\",A134=0),\"S\",IF(AND(OFFSET(C134,-1,0)=2,A134=4),3,IF(AND(OR(OFFSET(C134,-1,0)=\"s\",OFFSET(C134,-1,0)=0),A134<>\"s\",A134>OFFSET(B134,-1,0)),OFFSET(B134,-1,0),A134)))))","v":2},{"$f":"IF(OR(C134=\"S\",C134=0),0,IF(ISERROR(K134),J134,SMALL(J134:K134,1)))","v":6},1,7,0,0,0,32,6,"F","Nível 2","Nível 2","1.7.",null,null,"COBERTURAS","-",null,null,null,null,""]
[3,3,3,5,1,7,1,0,0,5,18,"F","Nível 3","Nível 3","1.7.1.",null,null,"CERÂMICA","-",null,null,null,null,""]
["S",3,"S",0,1,7,1,0,0,0,0,"F","Serviço","Serviço","1.7.1.0.1.","SINAPI",94445,"TELHAMENTO COM TELHA CERÂMICA CAPA-CANAL, TIPO PLAN, COM ATÉ 2 ÁGUAS, INCLUSO TRANSPORTE VERTICAL. AF_06/2016","M2",683.7,null,null,null,"Referência: AGETOP - 160401"]
["S",3,"S",0,1,7,1,0,0,0,0,"F","Serviço","Serviço","1.7.1.0.2.","SINAPI",94221,"CUMEEIRA PARA TELHA CERÂMICA EMBOÇADA COM ARGAMASSA TRAÇO 1:2:9 (CIMENTO, CAL E AREIA) PARA TELHADOS COM ATÉ 2 ÁGUAS, INCLUSO TRANSPORTE VERTICAL. AF_06/2016","M",188.91,null,null,null,""]
["S",3,"S",0,1,7,1,0,0,0,0,"F","Serviço","Serviço","1.7.1.0.3.","SINAPI",94224,"EMBOÇAMENTO COM ARGAMASSA TRAÇO 1:2:9 (CIMENTO, CAL E AREIA). AF_06/2016","M",326.33,null,null,null,"Referência: AGETOP - 160403"]
["S",3,"S",0,1,7,1,0,0,0,0,"F","Serviço","Serviço","1.7.1.0.4.","AGETOP",160421,"MAO DE OBRA PARA COBERTURA C/TELHA COLONIAL PLAN","m2    ",1367.4,null,null,null,""]
[2,2,2,2,1,8,0,0,0,26,2,"F","Nível 2","Nível 2","1.8.",null,null,"ESQUADRIAS METÁLICAS","-",null,null,null,null,""]
["S",2,"S",0,1,8,0,0,0,0,0,"F","Serviço","Serviço","1.8.0.0.1.","COMPOSIÇÃO","COMP 084_SEE","GUARDA-CORPO COM CORRIMÃO - SEDUC","M",4.2,null,null,null,""]
[2,2,2,3,1,9,0,0,0,24,3,"F","Nível 2","Nível 2","1.9.",null,null,"REVESTIMENTO DE PAREDE","-",null,null,null,null,""]
[{"$f":"CHOOSE(1+LOG(1+2*(ORÇAMENTO.Nivel=\"Nível 1\")+4*(ORÇAMENTO.Nivel=\"Nível 2\")+8*(ORÇAMENTO.Nivel=\"Nível 3\")+16*(ORÇAMENTO.Nivel=\"Nível 4\")+32*(ORÇAMENTO.Nivel=\"Serviço\"),2),0,1,2,3,4,\"S\")","v":"S"},2,"S",0,1,9,0,0,{"$f":"IF(AND($C143<=4,$C143<>0),0,IF(AND($C143=\"S\",$W143>0),OFFSET(I143,-1,0)+1,OFFSET(I143,-1,0)))","v":0},0,0,"F","Serviço","Serviço","1.9.0.0.1.","SINAPI",87904,"CHAPISCO APLICADO EM ALVENARIA (COM PRESENÇA DE VÃOS) E ESTRUTURAS DE CONCRETO DE FACHADA, COM COLHER DE PEDREIRO.  ARGAMASSA TRAÇO 1:3 COM PREPARO MANUAL. AF_06/2014","M2",0.26,null,null,null,"Referência: AGETOP - 200101"]
["S",2,"S",0,{"$f":"IF($C144=1,OFFSET(E144,-1,0)+1,OFFSET(E144,-1,0))","v":1},{"$f":"IF($C144=1,0,IF($C144=2,OFFSET(F144,-1,0)+1,OFFSET(F144,-1,0)))","v":9},{"$f":"IF(AND($C144<=2,$C144<>0),0,IF($C144=3,OFFSET(G144,-1,0)+1,OFFSET(G144,-1,0)))","v":0},{"$f":"IF(AND($C144<=3,$C144<>0),0,IF($C144=4,OFFSET(H144,-1,0)+1,OFFSET(H144,-1,0)))","v":0},0,0,0,"F","Serviço","Serviço","1.9.0.0.2.","SINAPI",87547,"MASSA ÚNICA, PARA RECEBIMENTO DE PINTURA, EM ARGAMASSA TRAÇO 1:2:8, PREPARO MECÂNICO COM BETONEIRA 400L, APLICADA MANUALMENTE EM FACES INTERNAS DE PAREDES, ESPESSURA DE 10MM, COM EXECUÇÃO DE TALISCAS. AF_06/2014","M2",88.550000000000011,null,null,null,""]
[2,{"$f":"IF(OR(C145=\"s\",C145=0),OFFSET(B145,-1,0),C145)","v":2},{"$f":"IF(OFFSET(C145,-1,0)=\"L\",1,IF(OFFSET(C145,-1,0)=1,2,IF(OR(A145=\"s\",A145=0),\"S\",IF(AND(OFFSET(C145,-1,0)=2,A145=4),3,IF(AND(OR(OFFSET(C145,-1,0)=\"s\",OFFSET(C145,-1,0)=0),A145<>\"s\",A145>OFFSET(B145,-1,0)),OFFSET(B145,-1,0),A145)))))","v":2},{"$f":"IF(OR(C145=\"S\",C145=0),0,IF(ISERROR(K145),J145,SMALL(J145:K145,1)))","v":4},1,10,0,0,0,21,4,"F","Nível 2","Nível 2","1.10.",null,null,"REVESTIMENTO DE PISO","-",null,null,null,null,""]
["S",2,"S",0,1,10,0,0,0,0,0,"F","Serviço","Serviço","1.10.0.0.1.","SINAPI",94992,"EXECUÇÃO DE PASSEIO (CALÇADA) OU PISO DE CONCRETO COM CONCRETO MOLDADO IN LOCO, FEITO EM OBRA, ACABAMENTO CONVENCIONAL, ESPESSURA 6 CM, ARMADO. AF_07/2016","M2",175.56,null,null,null,"Referência: AGETOP - 220104"]
["S",2,"S",0,1,10,0,0,0,{"$f":"IF(OR($C147=\"S\",$C147=0),0,MATCH(0,OFFSET($D147,1,$C147,ROW($C$690)-ROW($C147)),0))","v":0},{"$f":"IF(OR($C147=\"S\",$C147=0),0,MATCH(OFFSET($D147,0,$C147)+1,OFFSET($D147,1,$C147,ROW($C$690)-ROW($C147)),0))","v":0},"F","Serviço","Serviço","1.10.0.0.2.","AGETOP",221120,"PISO DE BORRACHA COLORIDO MODELO TÁTIL ( ALERTA OU DIRECIONAL) INCLUSO CONTRAPISO (1CI:3ARML) C/ E=2CM E NATA DE CIMENTO","m2    ",3.43,null,null,null,""]
["S",2,"S",0,1,10,0,0,0,0,0,"F","Serviço","Serviço","1.10.0.0.3.","AGETOP",221126,"PISO DE LADRILHO HIDRÁULICO COLORIDO MODELO TÁTIL ( ALERTA OU DIRECIONAL) SEM LASTRO","m2    ",21.12,null,null,null,""]
[2,2,2,6,1,11,0,0,0,17,6,"F","Nível 2","Nível 2","1.11.",null,null,"ADMINISTRAÇÃO","-",null,null,null,null,""]
[3,3,3,3,1,11,1,0,0,5,3,"F","Nível 3","Nível 3","1.11.1.",null,null,"MENSALISTAS","-",null,null,null,null,""]
["S",3,"S",0,1,11,1,0,0,0,0,"F","Serviço","Serviço","1.11.1.0.1.","SINAPI",90778,"ENGENHEIRO CIVIL DE OBRA PLENO COM ENCARGOS COMPLEMENTARES","H",132,null,null,null,"Referência: AGETOP - 250101"]
["S",3,"S",0,1,11,1,0,0,0,0,"F","Serviço","Serviço","1.11.1.0.2.","SINAPI",90776,"ENCARREGADO GERAL COM ENCARGOS COMPLEMENTARES","H",660,null,null,null,"Referência: AGETOP - 250103"]
[3,3,3,2,1,11,2,0,0,2,9,"F","Nível 3","Nível 3","1.11.2.","SINAPI",null,"LAUDO DE ESTANQUEIDADE","-",null,null,null,null,""]
["S",3,"S",0,1,11,2,0,0,0,0,"F","Serviço","Serviço","1.11.2.0.1.","SINAPI",90778,"ENGENHEIRO CIVIL DE OBRA PLENO COM ENCARGOS COMPLEMENTARES","H",16,null,null,null,"Referência: AGETOP - 250101"]
[2,2,2,9,1,12,0,0,0,11,9,"F","Nível 2","Nível 2","1.12.",null,null,"PINTURA","-",null,null,null,null,""]
[3,3,3,4,1,12,1,0,0,8,4,"F","Nível 3","Nível 3","1.12.1.",null,null,"ESMALTE SINTÉTICO","-",null,null,null,null,""]
["S",3,"S",0,1,12,1,0,0,0,0,"F","Serviço","Serviço","1.12.1.0.1.","AGETOP",260105,"REMOCAO DE PINTURA ANTIGA A OLEO OU ESMALTE","m2    ",950.41,null,null,null,""]
["S",3,"S",0,1,12,1,0,0,0,0,"F","Serviço","Serviço","1.12.1.0.2.","SINAPI",88497,"APLICAÇÃO E LIXAMENTO DE MASSA LÁTEX EM PAREDES, DUAS DEMÃOS. AF_06/2014","M2",950.41,null,null,null,"Referência: AGETOP - 261300"]
[{"$f":"CHOOSE(1+LOG(1+2*(ORÇAMENTO.Nivel=\"Nível 1\")+4*(ORÇAMENTO.Nivel=\"Nível 2\")+8*(ORÇAMENTO.Nivel=\"Nível 3\")+16*(ORÇAMENTO.Nivel=\"Nível 4\")+32*(ORÇAMENTO.Nivel=\"Serviço\"),2),0,1,2,3,4,\"S\")","v":"S"},3,"S",0,1,12,1,0,{"$f":"IF(AND($C159<=4,$C159<>0),0,IF(AND($C159=\"S\",$W159>0),OFFSET(I159,-1,0)+1,OFFSET(I159,-1,0)))","v":0},0,0,"F","Serviço","Serviço","1.12.1.0.3.","AGETOP",261550,"PINT.ESMALTE SINT.PAREDES - 2 DEM.C/SELADOR","m2    ",950.41,null,null,null,""]
[3,3,3,2,1,12,2,0,0,4,2,"F","Nível 3","Nível 3","1.12.2.","AGETOP",null,"LÁTEX ACRÍLICA","-",null,null,null,null,""]
["S",3,"S",0,{"$f":"IF($C161=1,OFFSET(E161,-1,0)+1,OFFSET(E161,-1,0))","v":1},{"$f":"IF($C161=1,0,IF($C161=2,OFFSET(F161,-1,0)+1,OFFSET(F161,-1,0)))","v":12},{"$f":"IF(AND($C161<=2,$C161<>0),0,IF($C161=3,OFFSET(G161,-1,0)+1,OFFSET(G161,-1,0)))","v":2},{"$f":"IF(AND($C161<=3,$C161<>0),0,IF($C161=4,OFFSET(H161,-1,0)+1,OFFSET(H161,-1,0)))","v":0},0,0,0,"F","Serviço","Serviço","1.12.2.0.1.","SINAPI",88489,"APLICAÇÃO MANUAL DE PINTURA COM TINTA LÁTEX ACRÍLICA EM PAREDES, DUAS DEMÃOS. AF_06/2014","M2",2080.9899999999998,null,null,null,"Referência: AGETOP - 261001"]
[3,3,3,2,1,12,3,0,0,2,67,"F","Nível 3","Nível 3","1.12.3.","AGETOP",null,"TETO","-",null,null,null,null,""]
["S",3,"S",0,1,12,3,0,0,0,0,"F","Serviço","Serviço","1.12.3.0.1.","SINAPI",88486,"APLICAÇÃO MANUAL DE PINTURA COM TINTA LÁTEX PVA EM TETO, DUAS DEMÃOS. AF_06/2014","M2",1029.3900000000001,null,null,null,"Referência: AGETOP - 261302"]
[2,{"$f":"IF(OR(C164=\"s\",C164=0),OFFSET(B164,-1,0),C164)","v":2},{"$f":"IF(OFFSET(C164,-1,0)=\"L\",1,IF(OFFSET(C164,-1,0)=1,2,IF(OR(A164=\"s\",A164=0),\"S\",IF(AND(OFFSET(C164,-1,0)=2,A164=4),3,IF(AND(OR(OFFSET(C164,-1,0)=\"s\",OFFSET(C164,-1,0)=0),A164<>\"s\",A164>OFFSET(B164,-1,0)),OFFSET(B164,-1,0),A164)))))","v":2},{"$f":"IF(OR(C164=\"S\",C164=0),0,IF(ISERROR(K164),J164,SMALL(J164:K164,1)))","v":2},1,13,0,0,0,2,238,"F","Nível 2","Nível 2","1.13.",null,null,"DIVERSOS","-",null,null,null,null,""]
["S",2,"S",0,1,13,0,0,0,0,0,"F","Serviço","Serviço","1.13.0.0.1.","AGETOP",270501,"LIMPEZA FINAL DE OBRA - (OBRAS CIVIS)","m2    ",400,null,null,null,""]
[1,1,1,76,2,0,0,0,0,524,76,"F","Nível 1","Nível 1","2.","SINAPI",null,"IMPLANTAÇÃO","-",null,null,null,null,""]
[2,2,2,2,2,1,0,0,0,75,2,"F","Nível 2","Nível 2","2.1.","SINAPI",null,"SERVIÇOS PRELIMINARES","-",null,null,null,null,""]
["S",2,"S",0,2,1,0,0,0,0,0,"F","Serviço","Serviço","2.1.0.0.1.","SINAPI",97600,"INSTALAÇÃO DE  REFLETOR EM ALUMÍNIO COM SUPORTE E ALÇA, LÂMPADA 125 W OU SIMILAR","UN",4,null,null,null,""]
[2,2,2,5,2,2,0,0,0,73,5,"F","Nível 2","Nível 2","2.2.","SINAPI",null,"SERVIÇO EM TERRA","-",null,null,null,null,""]
["S",2,"S",0,2,2,0,0,0,0,0,"F","Serviço","Serviço","2.2.0.0.1.","SINAPI",94315,"ATERRO MECANIZADO DE VALA COM RETROESCAVADEIRA (CAPACIDADE DA CAÇAMBA DA RETRO: 0,26 M³ / POTÊNCIA: 88 HP), LARGURA ATÉ 0,8 M, PROFUNDIDADE ATÉ 1,5 M, COM SOLO ARGILO-ARENOSO. AF_05/2016","M3",82.86,null,null,null,""]
["S",2,"S",0,2,2,0,0,0,0,0,"F","Serviço","Serviço","2.2.0.0.2.","AGETOP",41140,"REGULARIZAÇÃO DO TERRENO SEM APILOAMENTO COM TRANSPORTE MANUAL DA TERRA ESCAVADA ","m2    ",791.88,null,null,null,""]
["S",2,"S",0,2,2,0,0,0,0,0,"F","Serviço","Serviço","2.2.0.0.3.","AGETOP",41002,"APILOAMENTO","m2    ",791.88,null,null,null,""]
["S",2,"S",0,2,2,0,0,0,0,0,"F","Serviço","Serviço","2.2.0.0.4.","AGETOP",20190,"LIMPEZA MECANICA DE TERRENO","m2    ",410,null,null,null,""]
[{"$f":"CHOOSE(1+LOG(1+2*(ORÇAMENTO.Nivel=\"Nível 1\")+4*(ORÇAMENTO.Nivel=\"Nível 2\")+8*(ORÇAMENTO.Nivel=\"Nível 3\")+16*(ORÇAMENTO.Nivel=\"Nível 4\")+32*(ORÇAMENTO.Nivel=\"Serviço\"),2),0,1,2,3,4,\"S\")","v":2},{"$f":"IF(OR(C174=\"s\",C174=0),OFFSET(B174,-1,0),C174)","v":2},{"$f":"IF(OFFSET(C174,-1,0)=\"L\",1,IF(OFFSET(C174,-1,0)=1,2,IF(OR(A174=\"s\",A174=0),\"S\",IF(AND(OFFSET(C174,-1,0)=2,A174=4),3,IF(AND(OR(OFFSET(C174,-1,0)=\"s\",OFFSET(C174,-1,0)=0),A174<>\"s\",A174>OFFSET(B174,-1,0)),OFFSET(B174,-1,0),A174)))))","v":2},{"$f":"IF(OR(C174=\"S\",C174=0),0,IF(ISERROR(K174),J174,SMALL(J174:K174,1)))","v":62},{"$f":"IF($C174=1,OFFSET(E174,-1,0)+1,OFFSET(E174,-1,0))","v":2},{"$f":"IF($C174=1,0,IF($C174=2,OFFSET(F174,-1,0)+1,OFFSET(F174,-1,0)))","v":3},{"$f":"IF(AND($C174<=2,$C174<>0),0,IF($C174=3,OFFSET(G174,-1,0)+1,OFFSET(G174,-1,0)))","v":0},{"$f":"IF(AND($C174<=3,$C174<>0),0,IF($C174=4,OFFSET(H174,-1,0)+1,OFFSET(H174,-1,0)))","v":0},{"$f":"IF(AND($C174<=4,$C174<>0),0,IF(AND($C174=\"S\",$W174>0),OFFSET(I174,-1,0)+1,OFFSET(I174,-1,0)))","v":0},68,62,"F","Nível 2","Nível 2","2.3.","SINAPI",null,"INSTALAÇÕES HIDROSSANITÁRIAS","-",null,null,null,null,""]
[3,3,3,6,2,3,1,0,0,61,6,"F","Nível 3","Nível 3","2.3.1.","SINAPI",null,"PEÇAS E ACESSÓRIOS","-",null,null,null,null,""]
[4,4,4,3,2,3,1,1,0,5,3,"F","Nível 4","Nível 4","2.3.1.1.","SINAPI",null,"CAIXAS E CURVAS","-",null,null,null,null,""]
["S",4,"S",0,2,3,1,1,0,0,0,"F","Serviço","Serviço","2.3.1.1.1.","SINAPI",6171,"TAMPA DE CONCRETO ARMADO 60X60X5CM PARA CAIXA","UN",7,null,null,null,""]
["S",4,"S",0,2,3,1,1,0,0,0,"F","Serviço","Serviço","2.3.1.1.2.","AGETOP",70715,"CAIXA DE PASSAGEM 60X60X80CM FUNDO DE BRITA SEM TAMPA","Un    ",7,null,null,null,"Referência: AGETOP - 70715"]
[4,4,4,2,2,3,1,2,0,2,12,"F","Nível 4","Nível 4","2.3.1.2.","SINAPI",null,"REGISTRO","-",null,null,null,null,""]
["S",4,"S",0,2,3,1,2,0,0,0,"F","Serviço","Serviço","2.3.1.2.1.","SINAPI",94499,"REGISTRO DE GAVETA BRUTO, LATÃO, ROSCÁVEL, 2 1/2\u0094, INSTALADO EM RESERVAÇÃO DE ÁGUA DE EDIFICAÇÃO QUE POSSUA RESERVATÓRIO DE FIBRA/FIBROCIMENTO \u0096 FORNECIMENTO E INSTALAÇÃO. AF_06/2016","UN",2,null,null,null,"Referência: AGETOP - 80910"]
[3,3,3,40,2,3,2,0,0,55,40,"F","Nível 3","Nível 3","2.3.2.","SINAPI",null,"ÁGUA FRIA","-",null,null,null,null,""]
[4,4,4,6,2,3,2,1,0,39,6,"F","Nível 4","Nível 4","2.3.2.1.","SINAPI",null,"TUBOS DE PVC SOLDÁVEL","-",null,null,null,null,""]
["S",4,"S",0,2,3,2,1,0,0,0,"F","Serviço","Serviço","2.3.2.1.1.","SINAPI",89402,"TUBO, PVC, SOLDÁVEL, DN 25MM, INSTALADO EM RAMAL DE DISTRIBUIÇÃO DE ÁGUA - FORNECIMENTO E INSTALAÇÃO. AF_12/2014","M",12,null,null,null,"Referência: AGETOP - 81003"]
["S",4,"S",0,2,3,2,1,0,0,0,"F","Serviço","Serviço","2.3.2.1.2.","SINAPI",89447,"TUBO, PVC, SOLDÁVEL, DN 32MM, INSTALADO EM PRUMADA DE ÁGUA - FORNECIMENTO E INSTALAÇÃO. AF_12/2014","M",90,null,null,null,""]
["S",4,"S",0,2,3,2,1,0,0,0,"F","Serviço","Serviço","2.3.2.1.3.","SINAPI",89449,"TUBO, PVC, SOLDÁVEL, DN 50MM, INSTALADO EM PRUMADA DE ÁGUA - FORNECIMENTO E INSTALAÇÃO. AF_12/2014","M",12,null,null,null,""]
["S",4,"S",0,2,3,2,1,0,0,0,"F","Serviço","Serviço","2.3.2.1.4.","SINAPI",89450,"TUBO, PVC, SOLDÁVEL, DN 60MM, INSTALADO EM PRUMADA DE ÁGUA - FORNECIMENTO E INSTALAÇÃO. AF_12/2014","M",24,null,null,null,""]
["S",4,"S",0,2,3,2,1,0,0,0,"F","Serviço","Serviço","2.3.2.1.5.","SINAPI",89451,"TUBO, PVC, SOLDÁVEL, DN 75MM, INSTALADO EM PRUMADA DE ÁGUA - FORNECIMENTO E INSTALAÇÃO. AF_12/2014","M",54,null,null,null,""]
[4,4,4,3,2,3,2,2,0,33,3,"F","Nível 4","Nível 4","2.3.2.2.","SINAPI",null,"ADAPTADORES DE PVC SOLDÁVEL","-",null,null,null,null,""]
["S",4,"S",0,2,3,2,2,0,0,0,"F","Serviço","Serviço","2.3.2.2.1.","SINAPI",94709,"ADAPTADOR COM FLANGES LIVRES, PVC, SOLDÁVEL, DN 32 MM X 1 , INSTALADO EM RESERVAÇÃO DE ÁGUA DE EDIFICAÇÃO QUE POSSUA RESERVATÓRIO DE FIBRA/FIBROCIMENTO   FORNECIMENTO E INSTALAÇÃO. AF_06/2016","UN",1,null,null,null,"Referência: AGETOP - 81042"]
["S",4,"S",0,2,3,2,2,0,0,0,"F","Serviço","Serviço","2.3.2.2.2.","SINAPI",94713,"ADAPTADOR COM FLANGES LIVRES, PVC, SOLDÁVEL, DN 75 MM X 2 1/2 , INSTALADO EM RESERVAÇÃO DE ÁGUA DE EDIFICAÇÃO QUE POSSUA RESERVATÓRIO DE FIBRA/FIBROCIMENTO   FORNECIMENTO E INSTALAÇÃO. AF_06/2016","UN",2,null,null,null,""]
[4,4,4,6,2,3,2,3,0,30,6,"F","Nível 4","Nível 4","2.3.2.3.","SINAPI",null,"LUVAS DE PVC","-",null,null,null,null,""]
["S",4,"S",0,2,3,2,3,0,0,0,"F","Serviço","Serviço","2.3.2.3.1.","SINAPI",89528,"LUVA, PVC, SOLDÁVEL, DN 25MM, INSTALADO EM PRUMADA DE ÁGUA - FORNECIMENTO E INSTALAÇÃO. AF_12/2014","UN",2,null,null,null,""]
["S",4,"S",0,2,3,2,3,0,0,0,"F","Serviço","Serviço","2.3.2.3.2.","SINAPI",89434,"LUVA SOLDÁVEL E COM ROSCA, PVC, SOLDÁVEL, DN 32MM X 1\u0094, INSTALADO EM RAMAL DE DISTRIBUIÇÃO DE ÁGUA - FORNECIMENTO E INSTALAÇÃO. AF_12/2014","UN",17,null,null,null,"Referência: AGETOP - 81103"]
["S",4,"S",0,2,3,2,3,0,0,0,"F","Serviço","Serviço","2.3.2.3.3.","SINAPI",89575,"LUVA, PVC, SOLDÁVEL, DN 50MM, INSTALADO EM PRUMADA DE ÁGUA - FORNECIMENTO E INSTALAÇÃO. AF_12/2014","UN",3,null,null,null,"Referência: AGETOP - 81105"]
["S",4,"S",0,2,3,2,3,0,0,0,"F","Serviço","Serviço","2.3.2.3.4.","SINAPI",89597,"LUVA, PVC, SOLDÁVEL, DN 60MM, INSTALADO EM PRUMADA DE ÁGUA - FORNECIMENTO E INSTALAÇÃO. AF_12/2014","UN",6,null,null,null,""]
["S",4,"S",0,2,3,2,3,0,0,0,"F","Serviço","Serviço","2.3.2.3.5.","SINAPI",89611,"LUVA, PVC, SOLDÁVEL, DN 75MM, INSTALADO EM PRUMADA DE ÁGUA - FORNECIMENTO E INSTALAÇÃO. AF_12/2014","UN",11,null,null,null,""]
[4,4,4,7,2,3,2,4,0,24,7,"F","Nível 4","Nível 4","2.3.2.4.","SINAPI",null,"BUCHA","-",null,null,null,null,""]
["S",4,"S",0,2,3,2,4,0,0,0,"F","Serviço","Serviço","2.3.2.4.1.","SINAPI",96662,"BUCHA DE REDUÇÃO, PPR, 32 X 25, CLASSE PN 25, INSTALADO EM RAMAL DE DISTRIBUIÇÃO DE ÁGUA \u0096 FORNECIMENTO E INSTALAÇÃO . AF_06/2015","UN",2,null,null,null,"Referência: AGETOP - 81162"]
["S",4,"S",0,2,3,2,4,0,0,0,"F","Serviço","Serviço","2.3.2.4.2.","SINAPI",89605,"LUVA DE REDUÇÃO, PVC, SOLDÁVEL, DN 60MM X 50MM, INSTALADO EM PRUMADA DE ÁGUA - FORNECIMENTO E INSTALAÇÃO. AF_12/2014","UN",6,null,null,null,"Referência: AGETOP - 81165"]
["S",4,"S",0,2,3,2,4,0,0,0,"F","Serviço","Serviço","2.3.2.4.3.","SINAPI",89579,"LUVA DE REDUÇÃO, PVC, SOLDÁVEL, DN 50MM X 25MM, INSTALADO EM PRUMADA DE ÁGUA   FORNECIMENTO E INSTALAÇÃO. AF_12/2014","UN",6,null,null,null,"Referência: AGETOP - 81179"]
["S",4,"S",0,2,3,2,4,0,0,0,"F","Serviço","Serviço","2.3.2.4.4.","AGETOP",81180,"BUCHA DE REDUCAO SOLDAVEL LONGA 50 X 32 mm","Un    ",2,null,null,null,""]
["S",4,"S",0,2,3,2,4,0,0,0,"F","Serviço","Serviço","2.3.2.4.5.","AGETOP",81185,"BUCHA DE REDUÇÃO SOLDÁVEL LONGA 75 X 50 MM","un    ",4,null,null,null,""]
["S",4,"S",0,2,3,2,4,0,0,0,"F","Serviço","Serviço","2.3.2.4.6.","AGETOP",81166,"BUCHA DE REDUCAO SOLDAVEL CURTA 75 X 60 mm","Un    ",2,null,null,null,""]
[4,4,4,5,2,3,2,5,0,17,5,"F","Nível 4","Nível 4","2.3.2.5.","SINAPI",null,"JOELHO","-",null,null,null,null,""]
["S",4,"S",0,2,3,2,5,0,0,0,"F","Serviço","Serviço","2.3.2.5.1.","SINAPI",89413,"JOELHO 90 GRAUS, PVC, SOLDÁVEL, DN 32MM, INSTALADO EM RAMAL DE DISTRIBUIÇÃO DE ÁGUA - FORNECIMENTO E INSTALAÇÃO. AF_12/2014","UN",4,null,null,null,"Referência: AGETOP - 81322"]
["S",4,"S",0,2,3,2,5,0,0,0,"F","Serviço","Serviço","2.3.2.5.2.","SINAPI",89501,"JOELHO 90 GRAUS, PVC, SOLDÁVEL, DN 50MM, INSTALADO EM PRUMADA DE ÁGUA - FORNECIMENTO E INSTALAÇÃO. AF_12/2014","UN",3,null,null,null,""]
["S",4,"S",0,2,3,2,5,0,0,0,"F","Serviço","Serviço","2.3.2.5.3.","SINAPI",89505,"JOELHO 90 GRAUS, PVC, SOLDÁVEL, DN 60MM, INSTALADO EM PRUMADA DE ÁGUA - FORNECIMENTO E INSTALAÇÃO. AF_12/2014","UN",2,null,null,null,""]
["S",4,"S",0,2,3,2,5,0,0,0,"F","Serviço","Serviço","2.3.2.5.4.","SINAPI",89513,"JOELHO 90 GRAUS, PVC, SOLDÁVEL, DN 75MM, INSTALADO EM PRUMADA DE ÁGUA - FORNECIMENTO E INSTALAÇÃO. AF_12/2014","UN",7,null,null,null,"Referência: AGETOP - 81326"]
[4,4,4,9,2,3,2,6,0,12,9,"F","Nível 4","Nível 4","2.3.2.6.","SINAPI",null,"TÊ","-",null,null,null,null,""]
["S",4,"S",0,2,3,2,6,0,0,0,"F","Serviço","Serviço","2.3.2.6.1.","SINAPI",89617,"TE, PVC, SOLDÁVEL, DN 25MM, INSTALADO EM PRUMADA DE ÁGUA - FORNECIMENTO E INSTALAÇÃO. AF_12/2014","UN",2,null,null,null,""]
["S",4,"S",0,2,3,2,6,0,{"$f":"IF(OR($C211=\"S\",$C211=0),0,MATCH(0,OFFSET($D211,1,$C211,ROW($C$690)-ROW($C211)),0))","v":0},{"$f":"IF(OR($C211=\"S\",$C211=0),0,MATCH(OFFSET($D211,0,$C211)+1,OFFSET($D211,1,$C211,ROW($C$690)-ROW($C211)),0))","v":0},"F","Serviço","Serviço","2.3.2.6.2.","SINAPI",89443,"TE, PVC, SOLDÁVEL, DN 32MM, INSTALADO EM RAMAL DE DISTRIBUIÇÃO DE ÁGUA - FORNECIMENTO E INSTALAÇÃO. AF_12/2014","UN",1,null,null,null,"Referência: AGETOP - 81403"]
["S",4,"S",0,2,3,2,6,0,0,0,"F","Serviço","Serviço","2.3.2.6.3.","SINAPI",89625,"TE, PVC, SOLDÁVEL, DN 50MM, INSTALADO EM PRUMADA DE ÁGUA - FORNECIMENTO E INSTALAÇÃO. AF_12/2014","UN",2,null,null,null,"Referência: AGETOP - 81405"]
["S",4,"S",0,2,3,2,6,0,0,0,"F","Serviço","Serviço","2.3.2.6.4.","SINAPI",89628,"TE, PVC, SOLDÁVEL, DN 60MM, INSTALADO EM PRUMADA DE ÁGUA - FORNECIMENTO E INSTALAÇÃO. AF_12/2014","UN",6,null,null,null,""]
["S",4,"S",0,2,3,2,6,0,0,0,"F","Serviço","Serviço","2.3.2.6.5.","SINAPI",89629,"TE, PVC, SOLDÁVEL, DN 75MM, INSTALADO EM PRUMADA DE ÁGUA - FORNECIMENTO E INSTALAÇÃO. AF_12/2014","UN",2,null,null,null,"Referência: AGETOP - 81407"]
["S",4,"S",0,2,3,2,6,0,0,0,"F","Serviço","Serviço","2.3.2.6.6.","SINAPI",89627,"TÊ DE REDUÇÃO, PVC, SOLDÁVEL, DN 50MM X 25MM, INSTALADO EM PRUMADA DE ÁGUA - FORNECIMENTO E INSTALAÇÃO. AF_12/2014","UN",3,null,null,null,""]
["S",4,"S",0,2,3,2,6,0,0,0,"F","Serviço","Serviço","2.3.2.6.7.","AGETOP",81425,"TE REDUCAO 90 GRAUS SOLDAVEL 50 X 32 mm","Un    ",1,null,null,null,""]
["S",4,"S",0,2,3,2,6,0,0,0,"F","Serviço","Serviço","2.3.2.6.8.","SINAPI",94698,"TÊ DE REDUÇÃO, PVC, SOLDÁVEL, DN 75 MM X 50 MM, INSTALADO EM RESERVAÇÃO DE ÁGUA DE EDIFICAÇÃO QUE POSSUA RESERVATÓRIO DE FIBRA/FIBROCIMENTO   FORNECIMENTO E INSTALAÇÃO. AF_06/2016","UN",1,null,null,null,"Referência: AGETOP - 81427"]
[4,4,4,3,2,3,2,7,0,3,{"$error":"#N/A"},"F","Nível 4","Nível 4","2.3.2.7.","SINAPI",null,"ADESIVOS","-",null,null,null,null,""]
["S",4,"S",0,2,3,2,7,0,0,0,"F","Serviço","Serviço","2.3.2.7.1.","AGETOP",81501,"ADESIVO PLASTICO - FRASCO 850 G","Un    ",4,null,null,null,""]
["S",4,"S",0,2,3,2,7,0,0,0,"F","Serviço","Serviço","2.3.2.7.2.","AGETOP",81504,"SOLUCAO LIMPADORA 1000 CM3","Un    ",4,null,null,null,""]
[3,3,3,8,2,3,3,0,0,15,8,"F","Nível 3","Nível 3","2.3.3.","SINAPI",null,"ESGOTO SANITÁRIO","-",null,null,null,null,""]
["S",3,"S",0,2,3,3,0,0,0,0,"F","Serviço","Serviço","2.3.3.0.1.","SINAPI",89778,"LUVA SIMPLES, PVC, SERIE NORMAL, ESGOTO PREDIAL, DN 100 MM, JUNTA ELÁSTICA, FORNECIDO E INSTALADO EM RAMAL DE DESCARGA OU RAMAL DE ESGOTO SANITÁRIO. AF_12/2014","UN",20,null,null,null,"Referência: AGETOP - 82004"]
["S",3,"S",0,2,3,3,0,0,0,0,"F","Serviço","Serviço","2.3.3.0.2.","SINAPI",89800,"TUBO PVC, SERIE NORMAL, ESGOTO PREDIAL, DN 100 MM, FORNECIDO E INSTALADO EM PRUMADA DE ESGOTO SANITÁRIO OU VENTILAÇÃO. AF_12/2014","M",114,null,null,null,""]
["S",3,"S",0,2,3,3,0,0,0,0,"F","Serviço","Serviço","2.3.3.0.3.","AGETOP",80845,"CAIXA DE ALVENARIA 20x20x25 CM (REVESTIMENTO IMPERMEABILIZADO), FUNDO DE BRITA SEM TAMPA - PARA REGISTRO/TORNEIRA JARDIM","Un    ",2,null,null,null,""]
["S",3,"S",0,2,3,3,0,0,0,0,"F","Serviço","Serviço","2.3.3.0.4.","AGETOP",80840,"TAMPA T-5 ARTICULADA 20X20","Un    ",2,null,null,null,""]
["S",3,"S",0,2,3,3,0,0,0,0,"F","Serviço","Serviço","2.3.3.0.5.","AGETOP",81869,"FOSSA SEPTICA 8700 LITROS COM IMPERMEABILIZAÇÃO","Un    ",1,null,null,null,""]
["S",3,"S",0,2,3,3,0,0,0,0,"F","Serviço","Serviço","2.3.3.0.6.","AGETOP",81874,"SUMIDOURO COM DIÂMETRO=1,60M E  PROFUNDIDADE=4,50 M","Un    ",2,null,null,null,""]
["S",3,"S",0,2,3,3,0,0,0,0,"F","Serviço","Serviço","2.3.3.0.7.","AGETOP",81881,"RES.METALICO TAÇA AÇO PATINÁVEL-V=10M3-COL.SEC.H=6M+FUNDAÇÃO+LOGOTIPO","Un    ",1,null,null,null,""]
[3,3,3,7,2,3,4,0,0,7,{"$error":"#N/A"},"F","Nível 3","Nível 3","2.3.4.","SINAPI",null,"INSTALAÇÕES DE INCÊNDIO","-",null,null,null,null,""]
["S",3,"S",0,2,3,4,0,0,0,0,"F","Serviço","Serviço","2.3.4.0.1.","AGETOP",85006,"EXTINTOR MULTI USO EM PO A B C (6 KG) - CAPACIDADE EXTINTORA 3A 20BC","un    ",7,null,null,null,""]
["S",3,"S",0,2,3,4,0,0,0,0,"F","Serviço","Serviço","2.3.4.0.2.","AGETOP",85005,"EXTINTOR AGUA PRESSURIZADA (10 LITROS) - CAPACIDADE EXTINTORA 2A","Un    ",2,null,null,null,""]
["S",3,"S",0,2,3,4,0,0,0,0,"F","Serviço","Serviço","2.3.4.0.3.","COMPOSIÇÃO","COMP 024_SEE","SINALIZADOR FOTOLUMINESCENTE PARA EXTINTOR","UN ",9,null,null,null,""]
["S",3,"S",0,2,3,4,0,0,0,0,"F","Serviço","Serviço","2.3.4.0.4.","COMPOSIÇÃO","COMP 025_SEE","SINALIZADOR FOTOLUMINESCENTE DE EMERGÊNCIA","UN ",14,null,null,null,""]
["S",3,"S",0,2,3,4,0,0,0,0,"F","Serviço","Serviço","2.3.4.0.5.","COMPOSIÇÃO","COMP 277_SEE","MARCAÇÃO NO PISO - 1X1 M PARA EXTINTOR","M2",9,null,null,null,""]
["S",3,"S",0,2,3,4,0,0,0,0,"F","Serviço","Serviço","2.3.4.0.6.","AGETOP",71598,"LUMINÁRIA DE EMERGÊNCIA 30 LEDS","un    ",10,null,null,null,""]
[{"$f":"CHOOSE(1+LOG(1+2*(ORÇAMENTO.Nivel=\"Nível 1\")+4*(ORÇAMENTO.Nivel=\"Nível 2\")+8*(ORÇAMENTO.Nivel=\"Nível 3\")+16*(ORÇAMENTO.Nivel=\"Nível 4\")+32*(ORÇAMENTO.Nivel=\"Serviço\"),2),0,1,2,3,4,\"S\")","v":2},{"$f":"IF(OR(C236=\"s\",C236=0),OFFSET(B236,-1,0),C236)","v":2},{"$f":"IF(OFFSET(C236,-1,0)=\"L\",1,IF(OFFSET(C236,-1,0)=1,2,IF(OR(A236=\"s\",A236=0),\"S\",IF(AND(OFFSET(C236,-1,0)=2,A236=4),3,IF(AND(OR(OFFSET(C236,-1,0)=\"s\",OFFSET(C236,-1,0)=0),A236<>\"s\",A236>OFFSET(B236,-1,0)),OFFSET(B236,-1,0),A236)))))","v":2},{"$f":"IF(OR(C236=\"S\",C236=0),0,IF(ISERROR(K236),J236,SMALL(J236:K236,1)))","v":2},{"$f":"IF($C236=1,OFFSET(E236,-1,0)+1,OFFSET(E236,-1,0))","v":2},{"$f":"IF($C236=1,0,IF($C236=2,OFFSET(F236,-1,0)+1,OFFSET(F236,-1,0)))","v":4},{"$f":"IF(AND($C236<=2,$C236<>0),0,IF($C236=3,OFFSET(G236,-1,0)+1,OFFSET(G236,-1,0)))","v":0},{"$f":"IF(AND($C236<=3,$C236<>0),0,IF($C236=4,OFFSET(H236,-1,0)+1,OFFSET(H236,-1,0)))","v":0},{"$f":"IF(AND($C236<=4,$C236<>0),0,IF(AND($C236=\"S\",$W236>0),OFFSET(I236,-1,0)+1,OFFSET(I236,-1,0)))","v":0},6,2,"F","Nível 2","Nível 2","2.4.","SINAPI",null,"REVESTIMENTO DE PISO","-",null,null,null,null,""]
["S",2,"S",0,2,4,0,0,0,0,0,"F","Serviço","Serviço","2.4.0.0.1.","SINAPI",94992,"EXECUÇÃO DE PASSEIO (CALÇADA) OU PISO DE CONCRETO COM CONCRETO MOLDADO IN LOCO, FEITO EM OBRA, ACABAMENTO CONVENCIONAL, ESPESSURA 6 CM, ARMADO. AF_07/2016","M2",112.9,null,null,null,"Referência: AGETOP - 220104"]
[2,2,2,2,2,5,0,0,0,4,2,"F","Nível 2","Nível 2","2.5.","SINAPI",null,"ESQUADRIAS METÁLICAS","-",null,null,null,null,""]
["S",2,"S",0,2,5,0,0,0,0,0,"F","Serviço","Serviço","2.5.0.0.1.","SINAPI","74238/2","PORTAO EM TELA ARAME GALVANIZADO N.12 MALHA 2\" E MOLDURA EM TUBOS DE ACO COM DUAS FOLHAS DE ABRIR, INCLUSO FERRAGENS","M2",5,null,null,null,"Referência: AGETOP - 180281"]
[2,2,2,2,2,6,0,0,0,2,78,"F","Nível 2","Nível 2","2.6.","SINAPI",null,"PINTURA","-",null,null,null,null,""]
["S",2,"S",0,2,6,0,0,0,0,0,"F","Serviço","Serviço","2.6.0.0.1.","SINAPI","74145/1","PINTURA ESMALTE FOSCO, DUAS DEMAOS, SOBRE SUPERFICIE METALICA, INCLUSO UMA DEMAO DE FUNDO ANTICORROSIVO. UTILIZACAO DE REVOLVER ( AR-COMPRIMIDO).","M2",10,null,null,null,"Referência: AGETOP - 261602"]
[1,1,1,184,3,0,0,0,0,448,184,"F","Nível 1","Nível 1","3.","SINAPI",null,"COZINHA COM REFEITÓRIO PADRÃO SEDUC","-",null,null,null,null,""]
[2,2,2,2,3,1,0,0,0,183,2,"F","Nível 2","Nível 2","3.1.","SINAPI",null,"SERVIÇOS PRELIMINARES","-",null,null,null,null,""]
["S",2,"S",0,3,1,0,0,0,0,0,"F","Serviço","Serviço","3.1.0.0.1.","AGETOP",20701,"LOCAÇÃO DA OBRA, EXECUÇÃO DE GABARITO SEM REAPROVEITAMENTO, INCLUSO PINTURA (FACE INTERNA DO RIPÃO 15CM) E PIQUETE COM TESTEMUNHA","m2    ",139.75,null,null,null,""]
[2,2,2,3,3,2,0,0,0,181,3,"F","Nível 2","Nível 2","3.2.","AGETOP",null,"TRANSPORTES","-",null,null,null,null,""]
["S",2,"S",0,3,2,0,0,0,0,0,"F","Serviço","Serviço","3.2.0.0.1.","SINAPI",72900,"TRANSPORTE DE ENTULHO COM CAMINHAO BASCULANTE 6 M3, RODOVIA PAVIMENTADA, DMT 0,5 A 1,0 KM","M3",10,null,null,null,""]
["S",2,"S",0,3,2,0,0,0,0,0,"F","Serviço","Serviço","3.2.0.0.2.","SINAPI",72897,"CARGA MANUAL DE ENTULHO EM CAMINHAO BASCULANTE 6 M3","M3",10,null,null,null,""]
[{"$f":"CHOOSE(1+LOG(1+2*(ORÇAMENTO.Nivel=\"Nível 1\")+4*(ORÇAMENTO.Nivel=\"Nível 2\")+8*(ORÇAMENTO.Nivel=\"Nível 3\")+16*(ORÇAMENTO.Nivel=\"Nível 4\")+32*(ORÇAMENTO.Nivel=\"Serviço\"),2),0,1,2,3,4,\"S\")","v":2},{"$f":"IF(OR(C248=\"s\",C248=0),OFFSET(B248,-1,0),C248)","v":2},{"$f":"IF(OFFSET(C248,-1,0)=\"L\",1,IF(OFFSET(C248,-1,0)=1,2,IF(OR(A248=\"s\",A248=0),\"S\",IF(AND(OFFSET(C248,-1,0)=2,A248=4),3,IF(AND(OR(OFFSET(C248,-1,0)=\"s\",OFFSET(C248,-1,0)=0),A248<>\"s\",A248>OFFSET(B248,-1,0)),OFFSET(B248,-1,0),A248)))))","v":2},{"$f":"IF(OR(C248=\"S\",C248=0),0,IF(ISERROR(K248),J248,SMALL(J248:K248,1)))","v":2},{"$f":"IF($C248=1,OFFSET(E248,-1,0)+1,OFFSET(E248,-1,0))","v":3},{"$f":"IF($C248=1,0,IF($C248=2,OFFSET(F248,-1,0)+1,OFFSET(F248,-1,0)))","v":3},{"$f":"IF(AND($C248<=2,$C248<>0),0,IF($C248=3,OFFSET(G248,-1,0)+1,OFFSET(G248,-1,0)))","v":0},{"$f":"IF(AND($C248<=3,$C248<>0),0,IF($C248=4,OFFSET(H248,-1,0)+1,OFFSET(H248,-1,0)))","v":0},{"$f":"IF(AND($C248<=4,$C248<>0),0,IF(AND($C248=\"S\",$W248>0),OFFSET(I248,-1,0)+1,OFFSET(I248,-1,0)))","v":0},178,2,"F","Nível 2","Nível 2","3.3.","AGETOP",null,"SERVIÇO EM TERRA","-",null,null,null,null,""]
["S",2,"S",0,3,3,0,0,0,0,0,"F","Serviço","Serviço","3.3.0.0.1.","AGETOP",41002,"APILOAMENTO","m2    ",139.75,null,null,null,""]
[2,2,2,20,3,4,0,0,0,176,20,"F","Nível 2","Nível 2","3.4.","AGETOP",null,"FUNDAÇÕES E SONDAGENS","-",null,null,null,null,""]
[3,3,3,9,3,4,1,0,0,19,9,"F","Nível 3","Nível 3","3.4.1.","SINAPI",null,"ESTACAS E BLOCOS","-",null,null,null,null,""]
["S",3,"S",0,3,4,1,0,0,0,0,"F","Serviço","Serviço","3.4.1.0.1.","SINAPI",98230,"ESTACA BROCA DE CONCRETO, DIÂMETRO DE 30 CM, PROFUNDIDADE DE ATÉ 3 M, ESCAVAÇÃO MANUAL COM TRADO CONCHA, NÃO ARMADA. AF_03/2018","M",101.5,null,null,null,"Referência: AGETOP - 50302"]
["S",3,"S",0,3,4,1,0,0,0,0,"F","Serviço","Serviço","3.4.1.0.2.","SINAPI",96522,"ESCAVAÇÃO MANUAL PARA BLOCO DE COROAMENTO OU SAPATA, SEM PREVISÃO DE FÔRMA. AF_06/2017","M3",5.19,null,null,null,"Referência: AGETOP - 50901"]
["S",3,"S",0,3,4,1,0,0,0,0,"F","Serviço","Serviço","3.4.1.0.3.","SINAPI",94963,"CONCRETO FCK = 15MPA, TRAÇO 1:3,4:3,5 (CIMENTO/ AREIA MÉDIA/ BRITA 1)  - PREPARO MECÂNICO COM BETONEIRA 400 L. AF_07/2016","M3",3.4,null,null,null,""]
["S",3,"S",0,3,4,1,0,0,0,0,"F","Serviço","Serviço","3.4.1.0.4.","SINAPI","74157/4","LANCAMENTO/APLICACAO MANUAL DE CONCRETO EM FUNDACOES","M3",3.4,null,null,null,"Referência: AGETOP - 51055"]
["S",3,"S",0,3,4,1,0,0,0,0,"F","Serviço","Serviço","3.4.1.0.5.","AGETOP",60191,"FORMA DE TABUA CINTA BALDRAME U=8 VEZES","m2    ",23.7,null,null,null,""]
["S",3,"S",0,3,4,1,0,0,0,0,"F","Serviço","Serviço","3.4.1.0.6.","SINAPI",96543,"ARMAÇÃO DE BLOCO, VIGA BALDRAME E SAPATA UTILIZANDO AÇO CA-60 DE 5 MM - MONTAGEM. AF_06/2017","KG",98.2,null,null,null,"Referência: AGETOP - 52014"]
["S",3,"S",0,3,4,1,0,0,0,0,"F","Serviço","Serviço","3.4.1.0.7.","SINAPI",96546,"ARMAÇÃO DE BLOCO, VIGA BALDRAME OU SAPATA UTILIZANDO AÇO CA-50 DE 10 MM - MONTAGEM. AF_06/2017","KG",226.54,null,null,null,"Referência: AGETOP - 52005"]
["S",3,"S",0,3,4,1,0,0,0,0,"F","Serviço","Serviço","3.4.1.0.8.","SINAPI",96547,"ARMAÇÃO DE BLOCO, VIGA BALDRAME OU SAPATA UTILIZANDO AÇO CA-50 DE 12,5 MM - MONTAGEM. AF_06/2017","KG",240,null,null,null,"Referência: AGETOP - 52006"]
[3,3,3,8,3,4,2,0,0,10,8,"F","Nível 3","Nível 3","3.4.2.","SINAPI",null,"VIGAS BALDRAMES","-",null,null,null,null,""]
["S",3,"S",0,3,4,2,0,0,0,0,"F","Serviço","Serviço","3.4.2.0.1.","AGETOP",60191,"FORMA DE TABUA CINTA BALDRAME U=8 VEZES","m2    ",41.5,null,null,null,""]
["S",3,"S",0,3,4,2,0,0,0,0,"F","Serviço","Serviço","3.4.2.0.2.","SINAPI",94964,"CONCRETO FCK = 20MPA, TRAÇO 1:2,7:3 (CIMENTO/ AREIA MÉDIA/ BRITA 1)  - PREPARO MECÂNICO COM BETONEIRA 400 L. AF_07/2016","M3",2.4,null,null,null,""]
["S",3,"S",0,3,4,2,0,0,0,0,"F","Serviço","Serviço","3.4.2.0.3.","SINAPI","74157/4","LANCAMENTO/APLICACAO MANUAL DE CONCRETO EM FUNDACOES","M3",2.4,null,null,null,"Referência: AGETOP - 51055"]
["S",3,"S",0,3,4,2,0,0,0,0,"F","Serviço","Serviço","3.4.2.0.4.","SINAPI",96544,"ARMAÇÃO DE BLOCO, VIGA BALDRAME OU SAPATA UTILIZANDO AÇO CA-50 DE 6,3 MM - MONTAGEM. AF_06/2017","KG",47,null,null,null,"Referência: AGETOP - 52003"]
["S",3,"S",0,3,4,2,0,0,0,0,"F","Serviço","Serviço","3.4.2.0.5.","SINAPI",96545,"ARMAÇÃO DE BLOCO, VIGA BALDRAME OU SAPATA UTILIZANDO AÇO CA-50 DE 8 MM - MONTAGEM. AF_06/2017","KG",49,null,null,null,"Referência: AGETOP - 52004"]
["S",3,"S",0,3,4,2,0,0,0,0,"F","Serviço","Serviço","3.4.2.0.6.","SINAPI",96546,"ARMAÇÃO DE BLOCO, VIGA BALDRAME OU SAPATA UTILIZANDO AÇO CA-50 DE 10 MM - MONTAGEM. AF_06/2017","KG",38,null,null,null,"Referência: AGETOP - 52005"]
["S",3,"S",0,3,4,2,0,0,0,0,"F","Serviço","Serviço","3.4.2.0.7.","SINAPI",96543,"ARMAÇÃO DE BLOCO, VIGA BALDRAME E SAPATA UTILIZANDO AÇO CA-60 DE 5 MM - MONTAGEM. AF_06/2017","KG",72,null,null,null,"Referência: AGETOP - 52014"]
[3,3,3,2,3,4,3,0,0,2,{"$error":"#N/A"},"F","Nível 3","Nível 3","3.4.3.","SINAPI",null,"OUTROS","-",null,null,null,null,""]
["S",3,"S",0,3,4,3,0,0,0,0,"F","Serviço","Serviço","3.4.3.0.1.","AGETOP",50101,"SONDAGENS P/INTERIOR - (OBRAS CIVIS)","m     ",28,null,null,null,""]
[2,2,2,20,3,5,0,0,0,156,20,"F","Nível 2","Nível 2","3.5.","AGETOP",null,"ESTRUTURA","-",null,null,null,null,""]
[3,3,3,8,3,5,1,0,0,19,8,"F","Nível 3","Nível 3","3.5.1.","AGETOP",null,"PILARES","-",null,null,null,null,""]
["S",3,"S",0,3,5,1,0,0,0,0,"F","Serviço","Serviço","3.5.1.0.1.","SINAPI",92426,"MONTAGEM E DESMONTAGEM DE FÔRMA DE PILARES RETANGULARES E ESTRUTURAS SIMILARES COM ÁREA MÉDIA DAS SEÇÕES MENOR OU IGUAL A 0,25 M², PÉ-DIREITO SIMPLES, EM CHAPA DE MADEIRA COMPENSADA RESINADA, 8 UTILIZAÇÕES. AF_12/2015","M2",59.6,null,null,null,""]
["S",3,"S",0,3,5,1,0,0,0,0,"F","Serviço","Serviço","3.5.1.0.2.","SINAPI",94964,"CONCRETO FCK = 20MPA, TRAÇO 1:2,7:3 (CIMENTO/ AREIA MÉDIA/ BRITA 1)  - PREPARO MECÂNICO COM BETONEIRA 400 L. AF_07/2016","M3",2.5,null,null,null,""]
["S",3,"S",0,3,5,1,0,0,0,0,"F","Serviço","Serviço","3.5.1.0.3.","SINAPI",92873,"LANÇAMENTO COM USO DE BALDES, ADENSAMENTO E ACABAMENTO DE CONCRETO EM ESTRUTURAS. AF_12/2015","M3",2.5,null,null,null,"Referência: AGETOP - 51055"]
["S",3,"S",0,3,5,1,0,0,{"$f":"IF(OR($C275=\"S\",$C275=0),0,MATCH(0,OFFSET($D275,1,$C275,ROW($C$690)-ROW($C275)),0))","v":0},{"$f":"IF(OR($C275=\"S\",$C275=0),0,MATCH(OFFSET($D275,0,$C275)+1,OFFSET($D275,1,$C275,ROW($C$690)-ROW($C275)),0))","v":0},"F","Serviço","Serviço","3.5.1.0.4.","SINAPI",92776,"ARMAÇÃO DE PILAR OU VIGA DE UMA ESTRUTURA CONVENCIONAL DE CONCRETO ARMADO EM UMA EDIFICAÇÃO TÉRREA OU SOBRADO UTILIZANDO AÇO CA-50 DE 6,3 MM - MONTAGEM. AF_12/2015","KG",42,null,null,null,"Referência: AGETOP - 60303"]
["S",3,"S",0,3,5,1,0,0,0,0,"F","Serviço","Serviço","3.5.1.0.5.","SINAPI",92777,"ARMAÇÃO DE PILAR OU VIGA DE UMA ESTRUTURA CONVENCIONAL DE CONCRETO ARMADO EM UMA EDIFICAÇÃO TÉRREA OU SOBRADO UTILIZANDO AÇO CA-50 DE 8,0 MM - MONTAGEM. AF_12/2015","KG",64,null,null,null,"Referência: AGETOP - 60304"]
[{"$f":"CHOOSE(1+LOG(1+2*(ORÇAMENTO.Nivel=\"Nível 1\")+4*(ORÇAMENTO.Nivel=\"Nível 2\")+8*(ORÇAMENTO.Nivel=\"Nível 3\")+16*(ORÇAMENTO.Nivel=\"Nível 4\")+32*(ORÇAMENTO.Nivel=\"Serviço\"),2),0,1,2,3,4,\"S\")","v":"S"},3,"S",0,3,5,1,0,{"$f":"IF(AND($C277<=4,$C277<>0),0,IF(AND($C277=\"S\",$W277>0),OFFSET(I277,-1,0)+1,OFFSET(I277,-1,0)))","v":0},0,0,"F","Serviço","Serviço","3.5.1.0.6.","SINAPI",92778,"ARMAÇÃO DE PILAR OU VIGA DE UMA ESTRUTURA CONVENCIONAL DE CONCRETO ARMADO EM UMA EDIFICAÇÃO TÉRREA OU SOBRADO UTILIZANDO AÇO CA-50 DE 10,0 MM - MONTAGEM. AF_12/2015","KG",165.46,null,null,null,"Referência: AGETOP - 60305"]
["S",3,"S",0,3,5,1,0,0,0,0,"F","Serviço","Serviço","3.5.1.0.7.","SINAPI",92775,"ARMAÇÃO DE PILAR OU VIGA DE UMA ESTRUTURA CONVENCIONAL DE CONCRETO ARMADO EM UMA EDIFICAÇÃO TÉRREA OU SOBRADO UTILIZANDO AÇO CA-60 DE 5,0 MM - MONTAGEM. AF_12/2015","KG",22.8,null,null,null,"Referência: AGETOP - 60314"]
[3,3,3,9,3,5,2,0,0,11,9,"F","Nível 3","Nível 3","3.5.2.",null,null,"VIGAS DE COBERTURA","-",null,null,null,null,""]
["S",3,"S",0,{"$f":"IF($C280=1,OFFSET(E280,-1,0)+1,OFFSET(E280,-1,0))","v":3},{"$f":"IF($C280=1,0,IF($C280=2,OFFSET(F280,-1,0)+1,OFFSET(F280,-1,0)))","v":5},{"$f":"IF(AND($C280<=2,$C280<>0),0,IF($C280=3,OFFSET(G280,-1,0)+1,OFFSET(G280,-1,0)))","v":2},{"$f":"IF(AND($C280<=3,$C280<>0),0,IF($C280=4,OFFSET(H280,-1,0)+1,OFFSET(H280,-1,0)))","v":0},0,0,0,"F","Serviço","Serviço","3.5.2.0.1.","SINAPI",92464,"MONTAGEM E DESMONTAGEM DE FÔRMA DE VIGA, ESCORAMENTO METÁLICO, PÉ-DIREITO SIMPLES, EM CHAPA DE MADEIRA RESINADA, 8 UTILIZAÇÕES. AF_12/2015","M2",40.9,null,null,null,"Referência: AGETOP - 60204"]
["S",3,"S",0,3,5,2,0,0,0,0,"F","Serviço","Serviço","3.5.2.0.2.","SINAPI",94964,"CONCRETO FCK = 20MPA, TRAÇO 1:2,7:3 (CIMENTO/ AREIA MÉDIA/ BRITA 1)  - PREPARO MECÂNICO COM BETONEIRA 400 L. AF_07/2016","M3",2.4,null,null,null,""]
["S",3,"S",0,3,5,2,0,0,0,0,"F","Serviço","Serviço","3.5.2.0.3.","SINAPI",92873,"LANÇAMENTO COM USO DE BALDES, ADENSAMENTO E ACABAMENTO DE CONCRETO EM ESTRUTURAS. AF_12/2015","M3",2.4,null,null,null,"Referência: AGETOP - 51055"]
["S",3,"S",0,3,5,2,0,0,0,0,"F","Serviço","Serviço","3.5.2.0.4.","SINAPI",92776,"ARMAÇÃO DE PILAR OU VIGA DE UMA ESTRUTURA CONVENCIONAL DE CONCRETO ARMADO EM UMA EDIFICAÇÃO TÉRREA OU SOBRADO UTILIZANDO AÇO CA-50 DE 6,3 MM - MONTAGEM. AF_12/2015","KG",18,null,null,null,"Referência: AGETOP - 60303"]
["S",3,"S",0,3,5,2,0,0,0,0,"F","Serviço","Serviço","3.5.2.0.5.","SINAPI",92777,"ARMAÇÃO DE PILAR OU VIGA DE UMA ESTRUTURA CONVENCIONAL DE CONCRETO ARMADO EM UMA EDIFICAÇÃO TÉRREA OU SOBRADO UTILIZANDO AÇO CA-50 DE 8,0 MM - MONTAGEM. AF_12/2015","KG",35,null,null,null,"Referência: AGETOP - 60304"]
["S",3,"S",0,3,5,2,0,0,0,0,"F","Serviço","Serviço","3.5.2.0.6.","SINAPI",92778,"ARMAÇÃO DE PILAR OU VIGA DE UMA ESTRUTURA CONVENCIONAL DE CONCRETO ARMADO EM UMA EDIFICAÇÃO TÉRREA OU SOBRADO UTILIZANDO AÇO CA-50 DE 10,0 MM - MONTAGEM. AF_12/2015","KG",89,null,null,null,"Referência: AGETOP - 60305"]
["S",3,"S",0,3,5,2,0,0,0,0,"F","Serviço","Serviço","3.5.2.0.7.","SINAPI",92779,"ARMAÇÃO DE PILAR OU VIGA DE UMA ESTRUTURA CONVENCIONAL DE CONCRETO ARMADO EM UMA EDIFICAÇÃO TÉRREA OU SOBRADO UTILIZANDO AÇO CA-50 DE 12,5 MM - MONTAGEM. AF_12/2015","KG",24,null,null,null,"Referência: AGETOP - 60306"]
["S",3,"S",0,3,5,2,0,0,0,0,"F","Serviço","Serviço","3.5.2.0.8.","SINAPI",92775,"ARMAÇÃO DE PILAR OU VIGA DE UMA ESTRUTURA CONVENCIONAL DE CONCRETO ARMADO EM UMA EDIFICAÇÃO TÉRREA OU SOBRADO UTILIZANDO AÇO CA-60 DE 5,0 MM - MONTAGEM. AF_12/2015","KG",57,null,null,null,"Referência: AGETOP - 60314"]
[3,3,3,2,3,5,3,0,0,2,{"$error":"#N/A"},"F","Nível 3","Nível 3","3.5.3.",null,null,"LAJE","-",null,null,null,null,""]
["S",3,"S",0,3,5,3,0,0,0,0,"F","Serviço","Serviço","3.5.3.0.1.","SINAPI","74202/1","LAJE PRE-MOLDADA P/FORRO, SOBRECARGA 100KG/M2, VAOS ATE 3,50M/E=8CM, C/LAJOTAS E CAP.C/CONC FCK=20MPA, 3CM, INTER-EIXO 38CM, C/ESCORAMENTO (REAPR.3X) E FERRAGEM NEGATIVA","M2",40.75,null,null,null,""]
[2,2,2,28,3,6,0,0,0,136,28,"F","Nível 2","Nível 2","3.6.",null,null,"INSTALAÇÕES ELÉTRICAS","-",null,null,null,null,""]
["S",2,"S",0,3,6,0,0,0,0,0,"F","Serviço","Serviço","3.6.0.0.1.","AGETOP",70421,"BUCHA E ARRUELA METALICA DIAM. 3/4\"","PR    ",3,null,null,null,""]
["S",2,"S",0,3,6,0,0,0,0,0,"F","Serviço","Serviço","3.6.0.0.2.","SINAPI",92868,"CAIXA RETANGULAR 4\" X 2\" MÉDIA (1,30 M DO PISO), METÁLICA, INSTALADA EM PAREDE - FORNECIMENTO E INSTALAÇÃO. AF_12/2015","UN",26,null,null,null,"Referência: AGETOP - 70691"]
["S",2,"S",0,3,6,0,0,0,0,0,"F","Serviço","Serviço","3.6.0.0.3.","SINAPI",92866,"CAIXA SEXTAVADA 3\" X 3\", METÁLICA, INSTALADA EM LAJE - FORNECIMENTO E INSTALAÇÃO. AF_12/2015","UN",10,null,null,null,"Referência: AGETOP - 70680"]
["S",2,"S",0,3,6,0,0,0,0,0,"F","Serviço","Serviço","3.6.0.0.4.","SINAPI",91902,"CURVA 90 GRAUS PARA ELETRODUTO, PVC, ROSCÁVEL, DN 25 MM (3/4\"), PARA CIRCUITOS TERMINAIS, INSTALADA EM LAJE - FORNECIMENTO E INSTALAÇÃO. AF_12/2015","UN",6,null,null,null,"Referência: AGETOP - 71141"]
["S",2,"S",0,3,6,0,0,0,0,0,"F","Serviço","Serviço","3.6.0.0.5.","SINAPI",97585,"LUMINÁRIA TIPO CALHA, DE SOBREPOR, COM 2 LÂMPADAS TUBULARES DE 18 W - FORNECIMENTO E INSTALAÇÃO. AF_11/2017","UN",2,null,null,null,""]
["S",2,"S",0,3,6,0,0,0,0,0,"F","Serviço","Serviço","3.6.0.0.6.","SINAPI",97586,"LUMINÁRIA TIPO CALHA, DE SOBREPOR, COM 2 LÂMPADAS TUBULARES DE 36 W - FORNECIMENTO E INSTALAÇÃO. AF_11/2017","UN",14,null,null,null,""]
["S",2,"S",0,3,6,0,0,0,0,0,"F","Serviço","Serviço","3.6.0.0.7.","SINAPI",97584,"LUMINÁRIA TIPO CALHA, DE SOBREPOR, COM 1 LÂMPADA TUBULAR DE 36 W - FORNECIMENTO E INSTALAÇÃO. AF_11/2017","UN",2,null,null,null,""]
["S",2,"S",0,3,6,0,0,0,0,0,"F","Serviço","Serviço","3.6.0.0.8.","SINAPI",91884,"LUVA PARA ELETRODUTO, PVC, ROSCÁVEL, DN 25 MM (3/4\"), PARA CIRCUITOS TERMINAIS, INSTALADA EM PAREDE - FORNECIMENTO E INSTALAÇÃO. AF_12/2015","UN",3,null,null,null,"Referência: AGETOP - 71741"]
["S",2,"S",0,3,6,0,0,0,0,0,"F","Serviço","Serviço","3.6.0.0.9.","SINAPI",91927,"CABO DE COBRE FLEXÍVEL ISOLADO, 2,5 MM², ANTI-CHAMA 0,6/1,0 KV, PARA CIRCUITOS TERMINAIS - FORNECIMENTO E INSTALAÇÃO. AF_12/2015","M",723.31000000000006,null,null,null,"Referência: AGETOP - 70581"]
["S",2,"S",0,3,6,0,0,0,0,0,"F","Serviço","Serviço","3.6.0.0.10.","SINAPI",91931,"CABO DE COBRE FLEXÍVEL ISOLADO, 6 MM², ANTI-CHAMA 0,6/1,0 KV, PARA CIRCUITOS TERMINAIS - FORNECIMENTO E INSTALAÇÃO. AF_12/2015","M",60.8,null,null,null,"Referência: AGETOP - 70583"]
["S",2,"S",0,3,6,0,0,0,0,0,"F","Serviço","Serviço","3.6.0.0.11.","SINAPI",93654,"DISJUNTOR MONOPOLAR TIPO DIN, CORRENTE NOMINAL DE 16A - FORNECIMENTO E INSTALAÇÃO. AF_04/2016","UN",11,null,null,null,""]
["S",2,"S",0,3,6,0,0,0,0,0,"F","Serviço","Serviço","3.6.0.0.12.","SINAPI",93656,"DISJUNTOR MONOPOLAR TIPO DIN, CORRENTE NOMINAL DE 25A - FORNECIMENTO E INSTALAÇÃO. AF_04/2016","UN",1,null,null,null,""]
["S",2,"S",0,3,6,0,0,0,0,0,"F","Serviço","Serviço","3.6.0.0.13.","SINAPI",93673,"DISJUNTOR TRIPOLAR TIPO DIN, CORRENTE NOMINAL DE 50A - FORNECIMENTO E INSTALAÇÃO. AF_04/2016","UN",1,null,null,null,"Referência: AGETOP - 71172"]
["S",2,"S",0,3,6,0,0,0,0,0,"F","Serviço","Serviço","3.6.0.0.14.","AGETOP",71456,"INTERRUPTOR DIFERENCIAL RESIDUAL (D.R.) TETRAPOLAR DE 40A-30mA","Un    ",1,null,null,null,"Referência: AGETOP - 71450"]
["S",2,"S",0,3,6,0,0,0,0,0,"F","Serviço","Serviço","3.6.0.0.15.","SINAPI",91844,"ELETRODUTO FLEXÍVEL CORRUGADO, PVC, DN 25 MM (3/4\"), PARA CIRCUITOS TERMINAIS, INSTALADO EM LAJE - FORNECIMENTO E INSTALAÇÃO. AF_12/2015","M",96.82,null,null,null,""]
["S",2,"S",0,3,6,0,0,0,0,0,"F","Serviço","Serviço","3.6.0.0.16.","SINAPI",91846,"ELETRODUTO FLEXÍVEL CORRUGADO, PVC, DN 32 MM (1\"), PARA CIRCUITOS TERMINAIS, INSTALADO EM LAJE - FORNECIMENTO E INSTALAÇÃO. AF_12/2015","M",10.1,null,null,null,""]
["S",2,"S",0,3,6,0,0,0,0,0,"F","Serviço","Serviço","3.6.0.0.17.","SINAPI","73798/1","DUTO ESPIRAL FLEXIVEL SINGELO PEAD D=50MM(2\") REVESTIDO COM PVC COM FIO GUIA DE ACO GALVANIZADO, LANCADO DIRETO NO SOLO, INCL CONEXOES","M",31.1,null,null,null,"Referência: AGETOP - 71197"]
["S",2,"S",0,3,6,0,0,0,0,0,"F","Serviço","Serviço","3.6.0.0.18.","COMPOSIÇÃO","COMP 387_SEE","LÂMPADA LED TUBULAR 18W ","UN ",29,null,null,null,""]
["S",2,"S",0,3,6,0,0,0,0,0,"F","Serviço","Serviço","3.6.0.0.19.","SINAPI",97611,"LÂMPADA COMPACTA FLUORESCENTE DE 15 W, BASE E27 - FORNECIMENTO E INSTALAÇÃO. AF_11/2017","UN",2,null,null,null,"Referência: AGETOP - 71567"]
["S",2,"S",0,3,6,0,0,0,0,0,"F","Serviço","Serviço","3.6.0.0.20.","SINAPI",92000,"TOMADA BAIXA DE EMBUTIR (1 MÓDULO), 2P+T 10 A, INCLUINDO SUPORTE E PLACA - FORNECIMENTO E INSTALAÇÃO. AF_12/2015","UN",3,null,null,null,"Referência: AGETOP - 72578"]
["S",2,"S",0,3,6,0,0,0,0,0,"F","Serviço","Serviço","3.6.0.0.21.","SINAPI",91996,"TOMADA MÉDIA DE EMBUTIR (1 MÓDULO), 2P+T 10 A, INCLUINDO SUPORTE E PLACA - FORNECIMENTO E INSTALAÇÃO. AF_12/2015","UN",14,null,null,null,"Referência: AGETOP - 72578"]
["S",2,"S",0,3,6,0,0,0,0,0,"F","Serviço","Serviço","3.6.0.0.22.","SINAPI",91992,"TOMADA ALTA DE EMBUTIR (1 MÓDULO), 2P+T 10 A, INCLUINDO SUPORTE E PLACA - FORNECIMENTO E INSTALAÇÃO. AF_12/2015","UN",1,null,null,null,"Referência: AGETOP - 72578"]
["S",2,"S",0,3,6,0,0,0,0,0,"F","Serviço","Serviço","3.6.0.0.23.","SINAPI",91955,"INTERRUPTOR PARALELO (1 MÓDULO), 10A/250V, INCLUINDO SUPORTE E PLACA - FORNECIMENTO E INSTALAÇÃO. AF_12/2015","UN",4,null,null,null,"Referência: AGETOP - 71431"]
["S",2,"S",0,3,6,0,0,0,0,0,"F","Serviço","Serviço","3.6.0.0.24.","SINAPI",91953,"INTERRUPTOR SIMPLES (1 MÓDULO), 10A/250V, INCLUINDO SUPORTE E PLACA - FORNECIMENTO E INSTALAÇÃO. AF_12/2015","UN",5,null,null,null,"Referência: AGETOP - 71440"]
["S",2,"S",0,3,6,0,0,0,0,0,"F","Serviço","Serviço","3.6.0.0.25.","SINAPI",91959,"INTERRUPTOR SIMPLES (2 MÓDULOS), 10A/250V, INCLUINDO SUPORTE E PLACA - FORNECIMENTO E INSTALAÇÃO. AF_12/2015","UN",1,null,null,null,"Referência: AGETOP - 71441"]
["S",2,"S",0,3,6,0,0,0,0,0,"F","Serviço","Serviço","3.6.0.0.26.","SINAPI",96986,"HASTE DE ATERRAMENTO 3/4  PARA SPDA - FORNECIMENTO E INSTALAÇÃO. AF_12/2017","UN",3,null,null,null,"Referência: AGETOP - 71380"]
["S",2,"S",0,3,6,0,0,0,0,0,"F","Serviço","Serviço","3.6.0.0.27.","SINAPI","74131/4","QUADRO DE DISTRIBUICAO DE ENERGIA DE EMBUTIR, EM CHAPA METALICA, PARA 18 DISJUNTORES TERMOMAGNETICOS MONOPOLARES, COM BARRAMENTO TRIFASICO E NEUTRO, FORNECIMENTO E INSTALACAO","UN",1,null,null,null,""]
[2,2,2,60,3,7,0,0,0,108,60,"F","Nível 2","Nível 2","3.7.",null,null,"INSTALAÇÕES HIDROSSANITÁRIAS","-",null,null,null,null,""]
["S",2,"S",0,3,7,0,0,0,0,0,"F","Serviço","Serviço","3.7.0.0.1.","AGETOP",80502,"VASO SANITARIO","Un    ",1,null,null,null,""]
["S",2,"S",0,3,7,0,0,0,0,0,"F","Serviço","Serviço","3.7.0.0.2.","AGETOP",80510,"ANEL DE VEDAÇÃO PARA VASO SANITÁRIO","Un    ",1,null,null,null,""]
["S",2,"S",0,3,7,0,0,0,0,0,"F","Serviço","Serviço","3.7.0.0.3.","AGETOP",80513,"TUBO PARA VÁLVULA DE DESCARGA ( CURTO 1.1/4\" )","Un    ",1,null,null,null,""]
["S",2,"S",0,3,7,0,0,0,0,0,"F","Serviço","Serviço","3.7.0.0.4.","AGETOP",80514,"TUBO DE LIGACAO PVC CROMADO 1.1/2\" / ESPUDE  - (ENTRADA)","Un    ",1,null,null,null,""]
["S",2,"S",0,3,7,0,0,0,0,0,"F","Serviço","Serviço","3.7.0.0.5.","AGETOP",80517,"VÁLVULA DE DESCARGA DUPLO ACIONAMENTO COM ACABAMENTO CROMADO ANTIVANDALISMO","Un    ",1,null,null,null,""]
["S",2,"S",0,3,7,0,0,0,0,0,"F","Serviço","Serviço","3.7.0.0.6.","AGETOP",80520,"CONJUNTO DE FIXACAO P/VASO SANITARIO (PAR)","CJ    ",1,null,null,null,""]
["S",2,"S",0,3,7,0,0,0,0,0,"F","Serviço","Serviço","3.7.0.0.7.","AGETOP",80526,"ASSENTO EM POLIPROPILENO COM SISTEMA DE FECHAMENTO SUAVE PARA VASO SANITÁRIO","Un    ",1,null,null,null,""]
["S",2,"S",0,3,7,0,0,0,0,0,"F","Serviço","Serviço","3.7.0.0.8.","SINAPI",95544,"PAPELEIRA DE PAREDE EM METAL CROMADO SEM TAMPA, INCLUSO FIXAÇÃO. AF_10/2016","UN",1,null,null,null,"Referência: AGETOP - 80532"]
["S",2,"S",0,3,7,0,0,0,0,0,"F","Serviço","Serviço","3.7.0.0.9.","COMPOSIÇÃO","COMP 209_SEE","TOALHEIRO PLÁSTICO TIPO DISPENSER PARA PAPEL TOALHA INTERFOLHADO","UN ",1,null,null,null,""]
["S",2,"S",0,3,7,0,0,0,0,0,"F","Serviço","Serviço","3.7.0.0.10.","AGETOP",80542,"LAVATÓRIO MÉDIO SEM COLUNA","Un    ",2,null,null,null,""]
["S",2,"S",0,3,7,0,0,0,0,0,"F","Serviço","Serviço","3.7.0.0.11.","AGETOP",80550,"FIXACAO P/LAVATORIO (PAR)","PAR   ",2,null,null,null,""]
["S",2,"S",0,3,7,0,0,0,0,0,"F","Serviço","Serviço","3.7.0.0.12.","SINAPI",86885,"ENGATE FLEXÍVEL EM PLÁSTICO BRANCO, 1/2\" X 40CM - FORNECIMENTO E INSTALAÇÃO. AF_12/2013","UN",2,null,null,null,""]
["S",2,"S",0,3,7,0,0,0,0,0,"F","Serviço","Serviço","3.7.0.0.13.","SINAPI",86883,"SIFÃO DO TIPO FLEXÍVEL EM PVC 1\u0094 X 1.1/2\u0094 - FORNECIMENTO E INSTALAÇÃO. AF_12/2013","UN",2,null,null,null,""]
["S",2,"S",0,3,7,0,0,0,0,0,"F","Serviço","Serviço","3.7.0.0.14.","SINAPI",86906,"TORNEIRA CROMADA DE MESA, 1/2\" OU 3/4\", PARA LAVATÓRIO, PADRÃO POPULAR - FORNECIMENTO E INSTALAÇÃO. AF_12/2013","UN",2,null,null,null,"Referência: AGETOP - 80570"]
["S",2,"S",0,3,7,0,0,0,0,0,"F","Serviço","Serviço","3.7.0.0.15.","AGETOP",80580,"VALVULA P/LAVATORIO OU BEBEDOURO METALICO DIAMETRO 1\"","Un    ",2,null,null,null,""]
["S",2,"S",0,3,7,0,0,0,0,0,"F","Serviço","Serviço","3.7.0.0.16.","SINAPI",86911,"TORNEIRA CROMADA LONGA, DE PAREDE, 1/2\" OU 3/4\", PARA PIA DE COZINHA, PADRÃO POPULAR - FORNECIMENTO E INSTALAÇÃO. AF_12/2013","UN",5,null,null,null,""]
["S",2,"S",0,3,7,0,0,0,0,0,"F","Serviço","Serviço","3.7.0.0.17.","AGETOP",80671,"SIFAO PVC P/PIA 1.1/2\" X 2\"","Un    ",5,null,null,null,""]
["S",2,"S",0,3,7,0,0,0,0,0,"F","Serviço","Serviço","3.7.0.0.18.","SINAPI",86878,"VÁLVULA EM METAL CROMADO TIPO AMERICANA 3.1/2\" X 1.1/2\" PARA PIA - FORNECIMENTO E INSTALAÇÃO. AF_12/2013","UN",5,null,null,null,""]
["S",2,"S",0,3,7,0,0,0,0,0,"F","Serviço","Serviço","3.7.0.0.19.","AGETOP",80687,"CUBA INOX 35X40X15CM E=0,6MM-AÇO 304 (CUBA Nº 3)","Un    ",4,null,null,null,""]
["S",2,"S",0,3,7,0,0,0,0,0,"F","Serviço","Serviço","3.7.0.0.20.","AGETOP",80693,"TANQUE (PANELAO) INOX 60 X 70 X 40 CM CH.18","Un    ",1,null,null,null,""]
["S",2,"S",0,3,7,0,0,0,{"$f":"IF(OR($C339=\"S\",$C339=0),0,MATCH(0,OFFSET($D339,1,$C339,ROW($C$690)-ROW($C339)),0))","v":0},{"$f":"IF(OR($C339=\"S\",$C339=0),0,MATCH(OFFSET($D339,0,$C339)+1,OFFSET($D339,1,$C339,ROW($C$690)-ROW($C339)),0))","v":0},"F","Serviço","Serviço","3.7.0.0.21.","AGETOP",80819,"SIFÃO METÁLICO PARA TANQUE DE 1 1/4\" X 1 1/2\"","un    ",1,null,null,null,""]
["S",2,"S",0,3,7,0,0,0,0,0,"F","Serviço","Serviço","3.7.0.0.22.","AGETOP",80830,"VALVULA P/TANQUE METALICA DIAM.1\" S/LADRAO","Un    ",1,null,null,null,""]
["S",2,"S",0,3,7,0,0,0,0,0,"F","Serviço","Serviço","3.7.0.0.23.","AGETOP",81846,"CAIXA DE GORDURA E INSPEÇÃO EM PVC/ABS 19 LITROS COM TAMPA E PORTA TAMPA E CESTO DE LIMPEZA REMOVÍVEL","un    ",1,null,null,null,""]
["S",2,"S",0,3,7,0,0,0,0,0,"F","Serviço","Serviço","3.7.0.0.24.","SINAPI",94495,"REGISTRO DE GAVETA BRUTO, LATÃO, ROSCÁVEL, 1\u0094, INSTALADO EM RESERVAÇÃO DE ÁGUA DE EDIFICAÇÃO QUE POSSUA RESERVATÓRIO DE FIBRA/FIBROCIMENTO \u0096 FORNECIMENTO E INSTALAÇÃO. AF_06/2016","UN",1,null,null,null,"Referência: AGETOP - 80903"]
["S",2,"S",0,3,7,0,0,0,0,0,"F","Serviço","Serviço","3.7.0.0.25.","SINAPI",89353,"REGISTRO DE GAVETA BRUTO, LATÃO, ROSCÁVEL, 3/4\", FORNECIDO E INSTALADO EM RAMAL DE ÁGUA. AF_12/2014","UN",4,null,null,null,"Referência: AGETOP - 80902"]
["S",2,"S",0,3,7,0,0,0,0,0,"F","Serviço","Serviço","3.7.0.0.26.","SINAPI",95141,"ADAPTADOR COM FLANGES LIVRES, PVC, SOLDÁVEL LONGO, DN  25 MM X 3/4 , INSTALADO EM RESERVAÇÃO DE ÁGUA DE EDIFICAÇÃO QUE POSSUA RESERVATÓRIO DE FIBRA/FIBROCIMENTO    FORNECIMENTO E INSTALAÇÃO. AF_06/2016","UN",14,null,null,null,"Referência: AGETOP - 81041"]
["S",2,"S",0,3,7,0,0,0,0,0,"F","Serviço","Serviço","3.7.0.0.27.","SINAPI",94785,"ADAPTADOR COM FLANGES LIVRES, PVC, SOLDÁVEL LONGO, DN 32 MM X 1 , INSTALADO EM RESERVAÇÃO DE ÁGUA DE EDIFICAÇÃO QUE POSSUA RESERVATÓRIO DE FIBRA/FIBROCIMENTO   FORNECIMENTO E INSTALAÇÃO. AF_06/2016","UN",2,null,null,null,"Referência: AGETOP - 81042"]
["S",2,"S",0,3,7,0,0,0,0,0,"F","Serviço","Serviço","3.7.0.0.28.","AGETOP",81504,"SOLUCAO LIMPADORA 1000 CM3","Un    ",5,null,null,null,""]
["S",2,"S",0,3,7,0,0,0,0,0,"F","Serviço","Serviço","3.7.0.0.29.","AGETOP",81663,"CORPO CX. SIFONADA DIAM. 150 X 150 X 50","Un    ",2,null,null,null,""]
["S",2,"S",0,3,7,0,0,0,0,0,"F","Serviço","Serviço","3.7.0.0.30.","SINAPI",89708,"CAIXA SIFONADA, PVC, DN 150 X 185 X 75 MM, JUNTA ELÁSTICA, FORNECIDA E INSTALADA EM RAMAL DE DESCARGA OU EM RAMAL DE ESGOTO SANITÁRIO. AF_12/2014","UN",2,null,null,null,"Referência: AGETOP - 81664"]
["S",2,"S",0,3,7,0,0,0,0,0,"F","Serviço","Serviço","3.7.0.0.31.","AGETOP",81771,"GRELHA QUADRADA BRANCA DIAM. 150 MM","Un    ",2,null,null,null,""]
["S",2,"S",0,3,7,0,0,0,0,0,"F","Serviço","Serviço","3.7.0.0.32.","AGETOP",81885,"TERMINAL DE VENTILACAO DIAMETRO 50 MM","Un    ",1,null,null,null,""]
["S",2,"S",0,3,7,0,0,0,0,0,"F","Serviço","Serviço","3.7.0.0.33.","AGETOP",81831,"CAIXA DE INSPEÇÃO - ALVENARIA DE 1/2 VEZ COM REVESTIMENTO INTERNO EM REBOCO PAULISTA A-14 (COM ADIÇÃO DE IMPERMEABILIZANTE)","m2    ",3,null,null,null,""]
["S",2,"S",0,3,7,0,0,0,0,0,"F","Serviço","Serviço","3.7.0.0.34.","AGETOP",81825,"CAIXA DE PASSAGEM 60 X 60 CM SEM TAMPA","Un    ",5,null,null,null,""]
["S",2,"S",0,3,7,0,0,0,0,0,"F","Serviço","Serviço","3.7.0.0.35.","AGETOP",81826,"TAMPA EM CONCRETO ARMADO 25 MPA E=5CM PARA A CAIXA DE PASSAGEM 60X60CM","Un    ",5,null,null,null,""]
["S",2,"S",0,3,7,0,0,0,0,0,"F","Serviço","Serviço","3.7.0.0.36.","SINAPI",89402,"TUBO, PVC, SOLDÁVEL, DN 25MM, INSTALADO EM RAMAL DE DISTRIBUIÇÃO DE ÁGUA - FORNECIMENTO E INSTALAÇÃO. AF_12/2014","M",25,null,null,null,"Referência: AGETOP - 81003"]
["S",2,"S",0,3,7,0,0,0,0,0,"F","Serviço","Serviço","3.7.0.0.37.","SINAPI",89403,"TUBO, PVC, SOLDÁVEL, DN 32MM, INSTALADO EM RAMAL DE DISTRIBUIÇÃO DE ÁGUA - FORNECIMENTO E INSTALAÇÃO. AF_12/2014","M",20,null,null,null,"Referência: AGETOP - 81004"]
["S",2,"S",0,3,7,0,0,0,0,0,"F","Serviço","Serviço","3.7.0.0.38.","SINAPI",89617,"TE, PVC, SOLDÁVEL, DN 25MM, INSTALADO EM PRUMADA DE ÁGUA - FORNECIMENTO E INSTALAÇÃO. AF_12/2014","UN",3,null,null,null,""]
["S",2,"S",0,3,7,0,0,0,0,0,"F","Serviço","Serviço","3.7.0.0.39.","SINAPI",89620,"TE, PVC, SOLDÁVEL, DN 32MM, INSTALADO EM PRUMADA DE ÁGUA - FORNECIMENTO E INSTALAÇÃO. AF_12/2014","UN",3,null,null,null,"Referência: AGETOP - 81403"]
["S",2,"S",0,3,7,0,0,0,0,0,"F","Serviço","Serviço","3.7.0.0.40.","SINAPI",89622,"TÊ DE REDUÇÃO, PVC, SOLDÁVEL, DN 32MM X 25MM, INSTALADO EM PRUMADA DE ÁGUA - FORNECIMENTO E INSTALAÇÃO. AF_12/2014","UN",2,null,null,null,"Referência: AGETOP - 81421"]
["S",2,"S",0,3,7,0,0,0,0,0,"F","Serviço","Serviço","3.7.0.0.41.","SINAPI",89802,"JOELHO 45 GRAUS, PVC, SERIE NORMAL, ESGOTO PREDIAL, DN 50 MM, JUNTA ELÁSTICA, FORNECIDO E INSTALADO EM PRUMADA DE ESGOTO SANITÁRIO OU VENTILAÇÃO. AF_12/2014","UN",7,null,null,null,""]
["S",2,"S",0,3,7,0,0,0,0,0,"F","Serviço","Serviço","3.7.0.0.42.","SINAPI",89724,"JOELHO 90 GRAUS, PVC, SERIE NORMAL, ESGOTO PREDIAL, DN 40 MM, JUNTA SOLDÁVEL, FORNECIDO E INSTALADO EM RAMAL DE DESCARGA OU RAMAL DE ESGOTO SANITÁRIO. AF_12/2014","UN",12,null,null,null,""]
["S",2,"S",0,3,7,0,0,0,0,0,"F","Serviço","Serviço","3.7.0.0.43.","SINAPI",89731,"JOELHO 90 GRAUS, PVC, SERIE NORMAL, ESGOTO PREDIAL, DN 50 MM, JUNTA ELÁSTICA, FORNECIDO E INSTALADO EM RAMAL DE DESCARGA OU RAMAL DE ESGOTO SANITÁRIO. AF_12/2014","UN",3,null,null,null,""]
["S",2,"S",0,3,7,0,0,0,0,0,"F","Serviço","Serviço","3.7.0.0.44.","AGETOP",81973,"JUNCAO SIMPLES DIAM. 100 X 50 MM","Un    ",1,null,null,null,""]
["S",2,"S",0,3,7,0,0,0,0,0,"F","Serviço","Serviço","3.7.0.0.45.","SINAPI",89834,"JUNÇÃO SIMPLES, PVC, SERIE NORMAL, ESGOTO PREDIAL, DN 100 X 100 MM, JUNTA ELÁSTICA, FORNECIDO E INSTALADO EM PRUMADA DE ESGOTO SANITÁRIO OU VENTILAÇÃO. AF_12/2014","UN",1,null,null,null,"Referência: AGETOP - 81975"]
["S",2,"S",0,3,7,0,0,0,0,0,"F","Serviço","Serviço","3.7.0.0.46.","AGETOP",81981,"JUNÇÃO DUPLA DIAMETRO 75 MM","Un    ",1,null,null,null,""]
["S",2,"S",0,3,7,0,0,0,0,0,"F","Serviço","Serviço","3.7.0.0.47.","SINAPI",89753,"LUVA SIMPLES, PVC, SERIE NORMAL, ESGOTO PREDIAL, DN 50 MM, JUNTA ELÁSTICA, FORNECIDO E INSTALADO EM RAMAL DE DESCARGA OU RAMAL DE ESGOTO SANITÁRIO. AF_12/2014","UN",8,null,null,null,"Referência: AGETOP - 82002"]
["S",2,"S",0,3,7,0,0,0,0,0,"F","Serviço","Serviço","3.7.0.0.48.","SINAPI",89778,"LUVA SIMPLES, PVC, SERIE NORMAL, ESGOTO PREDIAL, DN 100 MM, JUNTA ELÁSTICA, FORNECIDO E INSTALADO EM RAMAL DE DESCARGA OU RAMAL DE ESGOTO SANITÁRIO. AF_12/2014","UN",2,null,null,null,"Referência: AGETOP - 82004"]
["S",2,"S",0,3,7,0,0,0,0,0,"F","Serviço","Serviço","3.7.0.0.49.","AGETOP",82051,"PORTA GRELHA QUADRADA BRANCO DIAM. 150 MM","Un    ",2,null,null,null,""]
["S",2,"S",0,3,7,0,0,0,0,0,"F","Serviço","Serviço","3.7.0.0.50.","AGETOP",82103,"REDUCAO EXCENTRICA 100 X 50 MM","Un    ",1,null,null,null,""]
["S",2,"S",0,3,7,0,0,0,0,0,"F","Serviço","Serviço","3.7.0.0.51.","AGETOP",82233,"TE SANITARIO DIAMETRO 100 X 50 MM","Un    ",1,null,null,null,""]
["S",2,"S",0,3,7,0,0,0,0,0,"F","Serviço","Serviço","3.7.0.0.52.","SINAPI",89711,"TUBO PVC, SERIE NORMAL, ESGOTO PREDIAL, DN 40 MM, FORNECIDO E INSTALADO EM RAMAL DE DESCARGA OU RAMAL DE ESGOTO SANITÁRIO. AF_12/2014","M",14,null,null,null,"Referência: AGETOP - 82301"]
["S",2,"S",0,3,7,0,0,0,0,0,"F","Serviço","Serviço","3.7.0.0.53.","SINAPI",89712,"TUBO PVC, SERIE NORMAL, ESGOTO PREDIAL, DN 50 MM, FORNECIDO E INSTALADO EM RAMAL DE DESCARGA OU RAMAL DE ESGOTO SANITÁRIO. AF_12/2014","M",26,null,null,null,"Referência: AGETOP - 82302"]
["S",2,"S",0,3,7,0,0,0,0,0,"F","Serviço","Serviço","3.7.0.0.54.","AGETOP",82374,"TUBO FERRO GALVANIZADO DIAM.3/4\"","m     ",10,null,null,null,""]
["S",2,"S",0,3,7,0,0,0,0,0,"F","Serviço","Serviço","3.7.0.0.55.","SINAPI",83635,"EXTINTOR INCENDIO TP PO QUIMICO 6KG - FORNECIMENTO E INSTALACAO","UN",1,null,null,null,"Referência: AGETOP - 85003"]
["S",2,"S",0,3,7,0,0,0,0,0,"F","Serviço","Serviço","3.7.0.0.56.","SINAPI",96702,"BUCHA DE REDUÇÃO, PPR, 32 X 25, CLASSE PN 25, INSTALADO EM PRUMADA DE ÁGUA \u0096 FORNECIMENTO E INSTALAÇÃO . AF_06/2015","UN",25,null,null,null,"Referência: AGETOP - 81162"]
["S",2,"S",0,3,7,0,0,0,0,0,"F","Serviço","Serviço","3.7.0.0.57.","SINAPI",94672,"JOELHO 90 GRAUS COM BUCHA DE LATÃO, PVC, SOLDÁVEL, DN  25 MM, X 3/4\u0094 INSTALADO EM RESERVAÇÃO DE ÁGUA DE EDIFICAÇÃO QUE POSSUA RESERVATÓRIO DE FIBRA/FIBROCIMENTO   FORNECIMENTO E INSTALAÇÃO. AF_06/2016","UN",6,null,null,null,""]
["S",2,"S",0,3,7,0,0,0,0,0,"F","Serviço","Serviço","3.7.0.0.58.","SINAPI",89362,"JOELHO 90 GRAUS, PVC, SOLDÁVEL, DN 25MM, INSTALADO EM RAMAL OU SUB-RAMAL DE ÁGUA - FORNECIMENTO E INSTALAÇÃO. AF_12/2014","UN",6,null,null,null,"Referência: AGETOP - 81321"]
["S",2,"S",0,3,7,0,0,0,0,0,"F","Serviço","Serviço","3.7.0.0.59.","SINAPI",89546,"BUCHA DE REDUÇÃO LONGA, PVC, SERIE R, ÁGUA PLUVIAL, DN 50 X 40 MM, JUNTA ELÁSTICA, FORNECIDO E INSTALADO EM RAMAL DE ENCAMINHAMENTO. AF_12/2014","UN",6,null,null,null,"Referência: AGETOP - 81602"]
[2,2,2,5,3,8,0,0,0,48,5,"F","Nível 2","Nível 2","3.8.","AGETOP",91045,"ALVENARIAS E DIVISÓRIAS","Un    ",null,null,null,null,""]
["S",2,"S",0,3,8,0,0,0,0,0,"F","Serviço","Serviço","3.8.0.0.1.","SINAPI","73937/1","COBOGO DE CONCRETO (ELEMENTO VAZADO), 7X50X50CM, ASSENTADO COM ARGAMASSA TRACO 1:4 (CIMENTO E AREIA)","M2",16.3,null,null,null,"Referência: AGETOP - 100501"]
["S",2,"S",0,3,8,0,0,0,0,0,"F","Serviço","Serviço","3.8.0.0.2.","SINAPI",72132,"ALVENARIA EM TIJOLO CERAMICO MACICO 5X10X20CM 1/2 VEZ (ESPESSURA 10CM), ASSENTADO COM ARGAMASSA TRACO 1:2:8 (CIMENTO, CAL E AREIA)","M2",17.11,null,null,null,""]
["S",2,"S",0,3,8,0,0,0,0,0,"F","Serviço","Serviço","3.8.0.0.3.","SINAPI",87489,"ALVENARIA DE VEDAÇÃO DE BLOCOS CERÂMICOS FURADOS NA VERTICAL DE 9X19X39CM (ESPESSURA 9CM) DE PAREDES COM ÁREA LÍQUIDA MAIOR OU IGUAL A 6M² COM VÃOS E ARGAMASSA DE ASSENTAMENTO COM PREPARO EM BETONEIRA. AF_06/2014","M2",142.08000000000001,null,null,null,"Referência: AGETOP - 100201"]
["S",2,"S",0,3,8,0,0,0,0,0,"F","Serviço","Serviço","3.8.0.0.4.","SINAPI",93202,"FIXAÇÃO (ENCUNHAMENTO) DE ALVENARIA DE VEDAÇÃO COM TIJOLO MACIÇO. AF_03/2016","M",27,null,null,null,"Referência: AGETOP - 100204"]
[2,2,2,2,3,9,0,0,0,43,2,"F","Nível 2","Nível 2","3.9.",null,null,"IMPERMEABILIZACAO","-",null,null,null,null,""]
["S",2,"S",0,3,9,0,0,0,0,0,"F","Serviço","Serviço","3.9.0.0.1.","SINAPI",98562,"IMPERMEABILIZAÇÃO DE FLOREIRA OU VIGA BALDRAME COM ARGAMASSA DE CIMENTO E AREIA, COM ADITIVO IMPERMEABILIZANTE, E = 2 CM. AF_06/2018","M2",43.03,null,null,null,"Referência: AGETOP - 120902"]
[2,2,2,2,3,10,0,0,0,41,2,"F","Nível 2","Nível 2","3.10.",null,null,"ESTRUTURAS METÁLICAS","-",null,null,null,null,""]
["S",2,"S",0,3,10,0,0,0,0,0,"F","Serviço","Serviço","3.10.0.0.1.","AGETOP",150103,"ESTRUTURA METÁLICA CONVENCIONAL EM AÇO DO TIPO USI SAC-300 COM FUNDO ANTICORROSIVO","Kg    ",1956.5,null,null,null,""]
[2,2,2,6,3,11,0,0,0,39,6,"F","Nível 2","Nível 2","3.11.",null,null,"COBERTURAS","-",null,null,null,null,""]
[3,3,3,5,3,11,1,0,0,5,20,"F","Nível 3","Nível 3","3.11.1.",null,null,"CERÂMICA","-",null,null,null,null,""]
["S",3,"S",0,3,11,1,0,0,0,0,"F","Serviço","Serviço","3.11.1.0.1.","SINAPI",94445,"TELHAMENTO COM TELHA CERÂMICA CAPA-CANAL, TIPO PLAN, COM ATÉ 2 ÁGUAS, INCLUSO TRANSPORTE VERTICAL. AF_06/2016","M2",182.07,null,null,null,"Referência: AGETOP - 160401"]
["S",3,"S",0,3,11,1,0,0,0,0,"F","Serviço","Serviço","3.11.1.0.2.","SINAPI",94221,"CUMEEIRA PARA TELHA CERÂMICA EMBOÇADA COM ARGAMASSA TRAÇO 1:2:9 (CIMENTO, CAL E AREIA) PARA TELHADOS COM ATÉ 2 ÁGUAS, INCLUSO TRANSPORTE VERTICAL. AF_06/2016","M",17.68,null,null,null,""]
["S",3,"S",0,3,11,1,0,0,0,0,"F","Serviço","Serviço","3.11.1.0.3.","SINAPI",94224,"EMBOÇAMENTO COM ARGAMASSA TRAÇO 1:2:9 (CIMENTO, CAL E AREIA). AF_06/2016","M",20.399999999999999,null,null,null,"Referência: AGETOP - 160403"]
["S",3,"S",0,3,11,1,0,0,0,0,"F","Serviço","Serviço","3.11.1.0.4.","SINAPI",94224,"EMBOÇAMENTO COM ARGAMASSA TRAÇO 1:2:9 (CIMENTO, CAL E AREIA). AF_06/2016","M",35.36,null,null,null,"Referência: AGETOP - 160404"]
[2,2,2,5,3,12,0,0,0,33,5,"F","Nível 2","Nível 2","3.12.",null,null,"ESQUADRIAS METÁLICAS","-",null,null,null,null,""]
["S",2,"S",0,3,12,0,0,0,0,0,"F","Serviço","Serviço","3.12.0.0.1.","SINAPI",94570,"JANELA DE ALUMÍNIO DE CORRER, 2 FOLHAS, FIXAÇÃO COM PARAFUSO SOBRE CONTRAMARCO (EXCLUSIVE CONTRAMARCO), COM VIDROS PADRONIZADA. AF_07/2016","M2",5.52,null,null,null,"Referência: AGETOP - 180381"]
["S",2,"S",0,3,12,0,0,0,0,0,"F","Serviço","Serviço","3.12.0.0.2.","SINAPI","74136/3","PORTA DE ACO CHAPA 24, DE ENROLAR, RAIADA, LARGA COM ACABAMENTO GALVANIZADO NATURAL","M2",5.74,null,null,null,"Referência: AGETOP - 180303"]
["S",2,"S",0,3,12,0,0,0,0,0,"F","Serviço","Serviço","3.12.0.0.3.","SINAPI","73933/4","PORTA DE FERRO DE ABRIR TIPO BARRA CHATA, COM REQUADRO E GUARNICAO COMPLETA","M2",8.64,null,null,null,"Referência: AGETOP - 180501"]
["S",2,"S",0,3,12,0,0,0,0,0,"F","Serviço","Serviço","3.12.0.0.4.","AGETOP",180307,"PORTAO /CHAPA TRAPEZ / TUBO DE ACO PT-5 C/FERRAGEM","m2    ",4,null,null,null,""]
[2,2,2,4,3,13,0,0,0,28,4,"F","Nível 2","Nível 2","3.13.",null,null,"REVESTIMENTO DE PAREDE","-",null,null,null,null,""]
["S",2,"S",0,3,13,0,0,0,0,0,"F","Serviço","Serviço","3.13.0.0.1.","SINAPI",87553,"EMBOÇO, PARA RECEBIMENTO DE CERÂMICA, EM ARGAMASSA TRAÇO 1:2:8, PREPARO MECÂNICO COM BETONEIRA 400L, APLICADO MANUALMENTE EM FACES INTERNAS DE PAREDES, PARA AMBIENTE COM ÁREA MAIOR QUE 10M2, ESPESSURA DE 10MM, COM EXECUÇÃO DE TALISCAS. AF_06/2014","M2",186.65,null,null,null,""]
["S",2,"S",0,3,13,0,0,0,0,0,"F","Serviço","Serviço","3.13.0.0.2.","SINAPI",87904,"CHAPISCO APLICADO EM ALVENARIA (COM PRESENÇA DE VÃOS) E ESTRUTURAS DE CONCRETO DE FACHADA, COM COLHER DE PEDREIRO.  ARGAMASSA TRAÇO 1:3 COM PREPARO MANUAL. AF_06/2014","M2",284.16000000000003,null,null,null,"Referência: AGETOP - 200101"]
["S",2,"S",0,3,13,0,0,0,0,0,"F","Serviço","Serviço","3.13.0.0.3.","SINAPI",87273,"REVESTIMENTO CERÂMICO PARA PAREDES INTERNAS COM PLACAS TIPO ESMALTADA EXTRA DE DIMENSÕES 33X45 CM APLICADAS EM AMBIENTES DE ÁREA MAIOR QUE 5 M² NA ALTURA INTEIRA DAS PAREDES. AF_06/2014","M2",127.56500000000001,null,null,null,""]
[2,2,2,3,3,14,0,0,0,24,3,"F","Nível 2","Nível 2","3.14.",null,null,"FORROS","-",null,null,null,null,""]
["S",2,"S",0,3,14,0,0,0,{"$f":"IF(OR($C403=\"S\",$C403=0),0,MATCH(0,OFFSET($D403,1,$C403,ROW($C$690)-ROW($C403)),0))","v":0},{"$f":"IF(OR($C403=\"S\",$C403=0),0,MATCH(OFFSET($D403,0,$C403)+1,OFFSET($D403,1,$C403,ROW($C$690)-ROW($C403)),0))","v":0},"F","Serviço","Serviço","3.14.0.0.1.","SINAPI",87884,"CHAPISCO APLICADO NO TETO, COM ROLO PARA TEXTURA ACRÍLICA. ARGAMASSA INDUSTRIALIZADA COM PREPARO MANUAL. AF_06/2014","M2",40.75,null,null,null,"Referência: AGETOP - 210102"]
["S",2,"S",0,3,14,0,0,0,0,0,"F","Serviço","Serviço","3.14.0.0.2.","SINAPI",90408,"MASSA ÚNICA, PARA RECEBIMENTO DE PINTURA, EM ARGAMASSA TRAÇO 1:2:8, PREPARO MECÂNICO COM BETONEIRA 400L, APLICADA MANUALMENTE EM TETO, ESPESSURA DE 10MM, COM EXECUÇÃO DE TALISCAS. AF_03/2015","M2",40.75,null,null,null,"Referência: AGETOP - 210401"]
[2,2,2,8,3,15,0,0,0,21,8,"F","Nível 2","Nível 2","3.15.",null,null,"REVESTIMENTO DE PISO","-",null,null,null,null,""]
[3,3,3,2,3,15,1,0,0,7,2,"F","Nível 3","Nível 3","3.15.1.",null,null,"LASTRO","-",null,null,null,null,""]
["S",3,"S",0,3,15,1,0,0,0,0,"F","Serviço","Serviço","3.15.1.0.1.","AGETOP",220101,"LASTRO DE CONCRETO REGULARIZADO IMPERMEABILIZADO 1:3:6 ESP=5CM (BASE)","m2    ",139.75,null,null,null,""]
[3,3,3,3,3,15,2,0,0,5,3,"F","Nível 3","Nível 3","3.15.2.",null,null,"GRANITINA","-",null,null,null,null,""]
["S",3,"S",0,3,15,2,0,0,0,0,"F","Serviço","Serviço","3.15.2.0.1.","SINAPI",84191,"PISO EM GRANILITE, MARMORITE OU GRANITINA ESPESSURA 8 MM, INCLUSO JUNTAS DE DILATACAO PLASTICAS","M2",144.74029999999999,null,null,null,"Referência: AGETOP - 221101"]
["S",3,"S",0,3,15,2,0,0,0,0,"F","Serviço","Serviço","3.15.2.0.2.","AGETOP",221104,"RASPAGEM E APLICAÇÃO RESINA ACRÍLICA DUAS DEMÃOS","m2    ",144.74029999999999,null,null,null,""]
[3,3,3,2,3,15,3,0,0,2,{"$error":"#N/A"},"F","Nível 3","Nível 3","3.15.3.",null,null,"PASSEIO (CALÇADA)","-",null,null,null,null,""]
["S",3,"S",0,3,15,3,0,0,0,0,"F","Serviço","Serviço","3.15.3.0.1.","AGETOP",220100,"PASSEIO PROTECAO EM CONC.DESEMPEN.5 CM 1:2,5:3,5 ( INCLUSO ESPELHO DE 30CM/ESCAVAÇÃO/REATERRO/APILOAMENTO/ATERRO INTERNO)","m2    ",35.04,null,null,null,""]
[2,2,2,2,3,16,0,0,0,13,2,"F","Nível 2","Nível 2","3.16.",null,null,"MARCENARIA","-",null,null,null,null,""]
["S",2,"S",0,3,16,0,0,0,0,0,"F","Serviço","Serviço","3.16.0.0.1.","AGETOP",240209,"PRATELEIRA EST.CAIBRO 4+1 TABUAS APARELHADAS E ENVERNIZADAS","m     ",3.2,null,null,null,""]
[2,2,2,8,3,17,0,0,0,11,8,"F","Nível 2","Nível 2","3.17.",null,null,"PINTURA","-",null,null,null,null,""]
[3,3,3,7,3,17,1,0,0,7,27,"F","Nível 3","Nível 3","3.17.1.",null,null,"ESMALTE SINTÉTICO","-",null,null,null,null,""]
["S",3,"S",0,3,17,1,0,0,0,0,"F","Serviço","Serviço","3.17.1.0.1.","SINAPI",88497,"APLICAÇÃO E LIXAMENTO DE MASSA LÁTEX EM PAREDES, DUAS DEMÃOS. AF_06/2014","M2",128,null,null,null,"Referência: AGETOP - 261300"]
["S",3,"S",0,3,17,1,0,0,0,0,"F","Serviço","Serviço","3.17.1.0.2.","SINAPI",88486,"APLICAÇÃO MANUAL DE PINTURA COM TINTA LÁTEX PVA EM TETO, DUAS DEMÃOS. AF_06/2014","M2",40.75,null,null,null,"Referência: AGETOP - 261307"]
["S",3,"S",0,3,17,1,0,0,0,0,"F","Serviço","Serviço","3.17.1.0.3.","AGETOP",261550,"PINT.ESMALTE SINT.PAREDES - 2 DEM.C/SELADOR","m2    ",87.25,null,null,null,""]
["S",3,"S",0,3,17,1,0,0,0,0,"F","Serviço","Serviço","3.17.1.0.4.","SINAPI",88489,"APLICAÇÃO MANUAL DE PINTURA COM TINTA LÁTEX ACRÍLICA EM PAREDES, DUAS DEMÃOS. AF_06/2014","M2",87.25,null,null,null,"Referência: AGETOP - 261000"]
["S",3,"S",0,3,17,1,0,0,0,0,"F","Serviço","Serviço","3.17.1.0.5.","SINAPI","74145/1","PINTURA ESMALTE FOSCO, DUAS DEMAOS, SOBRE SUPERFICIE METALICA, INCLUSO UMA DEMAO DE FUNDO ANTICORROSIVO. UTILIZACAO DE REVOLVER ( AR-COMPRIMIDO).","M2",87.25,null,null,null,"Referência: AGETOP - 261602"]
["S",3,"S",0,3,17,1,0,0,0,0,"F","Serviço","Serviço","3.17.1.0.6.","SINAPI","74145/1","PINTURA ESMALTE FOSCO, DUAS DEMAOS, SOBRE SUPERFICIE METALICA, INCLUSO UMA DEMAO DE FUNDO ANTICORROSIVO. UTILIZACAO DE REVOLVER ( AR-COMPRIMIDO).","M2",364.14,null,null,null,"Referência: AGETOP - 261609"]
[2,2,2,3,3,18,0,0,0,3,{"$error":"#N/A"},"F","Nível 2","Nível 2","3.18.",null,null,"DIVERSOS","-",null,null,null,null,""]
["S",2,"S",0,3,18,0,0,0,0,0,"F","Serviço","Serviço","3.18.0.0.1.","AGETOP",270501,"LIMPEZA FINAL DE OBRA - (OBRAS CIVIS)","m2    ",139.75,null,null,null,""]
["S",2,"S",0,3,18,0,0,0,0,0,"F","Serviço","Serviço","3.18.0.0.2.","AGETOP",271608,"BANCADA DE GRANITO C/ESPELHO","m2    ",6.8250000000000002,null,null,null,""]
[1,1,1,182,4,0,0,0,0,264,182,"F","Nível 1","Nível 1","4.","SINAPI",null,"VESTIÁRIO PADRÃO SÉCULO XX1","-",null,null,null,null,""]
[2,2,2,2,4,1,0,0,0,181,2,"F","Nível 2","Nível 2","4.1.","SINAPI",null,"SERVIÇOS PRELIMINARES","-",null,null,null,null,""]
["S",2,"S",0,4,1,0,0,0,0,0,"F","Serviço","Serviço","4.1.0.0.1.","AGETOP",20701,"LOCAÇÃO DA OBRA, EXECUÇÃO DE GABARITO SEM REAPROVEITAMENTO, INCLUSO PINTURA (FACE INTERNA DO RIPÃO 15CM) E PIQUETE COM TESTEMUNHA","m2    ",55.42,null,null,null,""]
[{"$f":"CHOOSE(1+LOG(1+2*(ORÇAMENTO.Nivel=\"Nível 1\")+4*(ORÇAMENTO.Nivel=\"Nível 2\")+8*(ORÇAMENTO.Nivel=\"Nível 3\")+16*(ORÇAMENTO.Nivel=\"Nível 4\")+32*(ORÇAMENTO.Nivel=\"Serviço\"),2),0,1,2,3,4,\"S\")","v":2},{"$f":"IF(OR(C429=\"s\",C429=0),OFFSET(B429,-1,0),C429)","v":2},{"$f":"IF(OFFSET(C429,-1,0)=\"L\",1,IF(OFFSET(C429,-1,0)=1,2,IF(OR(A429=\"s\",A429=0),\"S\",IF(AND(OFFSET(C429,-1,0)=2,A429=4),3,IF(AND(OR(OFFSET(C429,-1,0)=\"s\",OFFSET(C429,-1,0)=0),A429<>\"s\",A429>OFFSET(B429,-1,0)),OFFSET(B429,-1,0),A429)))))","v":2},{"$f":"IF(OR(C429=\"S\",C429=0),0,IF(ISERROR(K429),J429,SMALL(J429:K429,1)))","v":3},{"$f":"IF($C429=1,OFFSET(E429,-1,0)+1,OFFSET(E429,-1,0))","v":4},{"$f":"IF($C429=1,0,IF($C429=2,OFFSET(F429,-1,0)+1,OFFSET(F429,-1,0)))","v":2},{"$f":"IF(AND($C429<=2,$C429<>0),0,IF($C429=3,OFFSET(G429,-1,0)+1,OFFSET(G429,-1,0)))","v":0},{"$f":"IF(AND($C429<=3,$C429<>0),0,IF($C429=4,OFFSET(H429,-1,0)+1,OFFSET(H429,-1,0)))","v":0},{"$f":"IF(AND($C429<=4,$C429<>0),0,IF(AND($C429=\"S\",$W429>0),OFFSET(I429,-1,0)+1,OFFSET(I429,-1,0)))","v":0},179,3,"F","Nível 2","Nível 2","4.2.",null,null,"TRANSPORTES","-",null,null,null,null,""]
["S",2,"S",0,4,2,0,0,0,0,0,"F","Serviço","Serviço","4.2.0.0.1.","SINAPI",72900,"TRANSPORTE DE ENTULHO COM CAMINHAO BASCULANTE 6 M3, RODOVIA PAVIMENTADA, DMT 0,5 A 1,0 KM","M3",3.88,null,null,null,""]
["S",2,"S",0,4,2,0,0,0,0,0,"F","Serviço","Serviço","4.2.0.0.2.","SINAPI",72897,"CARGA MANUAL DE ENTULHO EM CAMINHAO BASCULANTE 6 M3","M3",3.88,null,null,null,""]
[2,2,2,22,4,3,0,0,0,176,22,"F","Nível 2","Nível 2","4.3.",null,null,"FUNDAÇÕES E SONDAGENS","-",null,null,null,null,""]
[3,3,3,10,4,3,1,0,0,21,10,"F","Nível 3","Nível 3","4.3.1.","SINAPI",null,"ESTACAS E BLOCOS","-",null,null,null,null,""]
["S",3,"S",0,4,3,1,0,0,0,0,"F","Serviço","Serviço","4.3.1.0.1.","SINAPI",98230,"ESTACA BROCA DE CONCRETO, DIÂMETRO DE 30 CM, PROFUNDIDADE DE ATÉ 3 M, ESCAVAÇÃO MANUAL COM TRADO CONCHA, NÃO ARMADA. AF_03/2018","M",69.5,null,null,null,"Referência: AGETOP - 50302"]
["S",3,"S",0,4,3,1,0,0,0,0,"F","Serviço","Serviço","4.3.1.0.2.","SINAPI",96522,"ESCAVAÇÃO MANUAL PARA BLOCO DE COROAMENTO OU SAPATA, SEM PREVISÃO DE FÔRMA. AF_06/2017","M3",4.08,null,null,null,"Referência: AGETOP - 50901"]
["S",3,"S",0,4,3,1,0,0,0,0,"F","Serviço","Serviço","4.3.1.0.3.","SINAPI",93382,"REATERRO MANUAL DE VALAS COM COMPACTAÇÃO MECANIZADA. AF_04/2016","M3",1.98,null,null,null,"Referência: AGETOP - 50905"]
["S",3,"S",0,4,3,1,0,0,0,0,"F","Serviço","Serviço","4.3.1.0.4.","SINAPI",94964,"CONCRETO FCK = 20MPA, TRAÇO 1:2,7:3 (CIMENTO/ AREIA MÉDIA/ BRITA 1)  - PREPARO MECÂNICO COM BETONEIRA 400 L. AF_07/2016","M3",2.1,null,null,null,""]
["S",3,"S",0,4,3,1,0,0,0,0,"F","Serviço","Serviço","4.3.1.0.5.","SINAPI","74157/4","LANCAMENTO/APLICACAO MANUAL DE CONCRETO EM FUNDACOES","M3",2.1,null,null,null,"Referência: AGETOP - 51060"]
["S",3,"S",0,4,3,1,0,0,0,0,"F","Serviço","Serviço","4.3.1.0.6.","SINAPI",94103,"LASTRO DE VALA COM PREPARO DE FUNDO, LARGURA MENOR QUE 1,5 M, COM CAMADA DE BRITA, LANÇAMENTO MANUAL, EM LOCAL COM NÍVEL BAIXO DE INTERFERÊNCIA. AF_06/2016","M3",3.5,null,null,null,"Referência: AGETOP - 51027"]
["S",3,"S",0,4,3,1,0,0,0,0,"F","Serviço","Serviço","4.3.1.0.7.","SINAPI",96545,"ARMAÇÃO DE BLOCO, VIGA BALDRAME OU SAPATA UTILIZANDO AÇO CA-50 DE 8 MM - MONTAGEM. AF_06/2017","KG",43.51,null,null,null,"Referência: AGETOP - 52004"]
["S",3,"S",0,4,3,1,0,0,0,0,"F","Serviço","Serviço","4.3.1.0.8.","SINAPI",96546,"ARMAÇÃO DE BLOCO, VIGA BALDRAME OU SAPATA UTILIZANDO AÇO CA-50 DE 10 MM - MONTAGEM. AF_06/2017","KG",24.99,null,null,null,"Referência: AGETOP - 52005"]
["S",3,"S",0,4,3,1,0,0,0,0,"F","Serviço","Serviço","4.3.1.0.9.","SINAPI",96543,"ARMAÇÃO DE BLOCO, VIGA BALDRAME E SAPATA UTILIZANDO AÇO CA-60 DE 5 MM - MONTAGEM. AF_06/2017","KG",36.79,null,null,null,"Referência: AGETOP - 52014"]
[3,3,3,11,4,3,2,0,0,11,28,"F","Nível 3","Nível 3","4.3.2.","SINAPI",null,"VIGAS BALDRAMES","-",null,null,null,null,""]
["S",3,"S",0,4,3,2,0,0,0,0,"F","Serviço","Serviço","4.3.2.0.1.","SINAPI",96527,"ESCAVAÇÃO MANUAL DE VALA PARA VIGA BALDRAME, COM PREVISÃO DE FÔRMA. AF_06/2017","M3",5.6750400000000019,null,null,null,"Referência: AGETOP - 40101"]
["S",3,"S",0,4,3,2,0,0,0,0,"F","Serviço","Serviço","4.3.2.0.2.","SINAPI",94103,"LASTRO DE VALA COM PREPARO DE FUNDO, LARGURA MENOR QUE 1,5 M, COM CAMADA DE BRITA, LANÇAMENTO MANUAL, EM LOCAL COM NÍVEL BAIXO DE INTERFERÊNCIA. AF_06/2016","M3",0.40536000000000005,null,null,null,"Referência: AGETOP - 51027"]
["S",3,"S",0,4,3,2,0,0,0,0,"F","Serviço","Serviço","4.3.2.0.3.","SINAPI",96995,"REATERRO MANUAL APILOADO COM SOQUETE. AF_10/2017","M3",4.0536000000000021,null,null,null,"Referência: AGETOP - 50903"]
["S",3,"S",0,4,3,2,0,0,0,0,"F","Serviço","Serviço","4.3.2.0.4.","AGETOP",60191,"FORMA DE TABUA CINTA BALDRAME U=8 VEZES","m2    ",27.024000000000001,null,null,null,""]
["S",3,"S",0,4,3,2,0,0,0,0,"F","Serviço","Serviço","4.3.2.0.5.","SINAPI",94964,"CONCRETO FCK = 20MPA, TRAÇO 1:2,7:3 (CIMENTO/ AREIA MÉDIA/ BRITA 1)  - PREPARO MECÂNICO COM BETONEIRA 400 L. AF_07/2016","M3",1.62144,null,null,null,""]
["S",3,"S",0,4,3,2,0,0,0,0,"F","Serviço","Serviço","4.3.2.0.6.","SINAPI",92873,"LANÇAMENTO COM USO DE BALDES, ADENSAMENTO E ACABAMENTO DE CONCRETO EM ESTRUTURAS. AF_12/2015","M3",1.62144,null,null,null,"Referência: AGETOP - 51055"]
["S",3,"S",0,4,3,2,0,0,0,0,"F","Serviço","Serviço","4.3.2.0.7.","SINAPI",96544,"ARMAÇÃO DE BLOCO, VIGA BALDRAME OU SAPATA UTILIZANDO AÇO CA-50 DE 6,3 MM - MONTAGEM. AF_06/2017","KG",49.29,null,null,null,"Referência: AGETOP - 52003"]
["S",3,"S",0,4,3,2,0,0,0,0,"F","Serviço","Serviço","4.3.2.0.8.","SINAPI",96545,"ARMAÇÃO DE BLOCO, VIGA BALDRAME OU SAPATA UTILIZANDO AÇO CA-50 DE 8 MM - MONTAGEM. AF_06/2017","KG",30.49,null,null,null,"Referência: AGETOP - 52004"]
["S",3,"S",0,4,3,2,0,0,0,0,"F","Serviço","Serviço","4.3.2.0.9.","SINAPI",96546,"ARMAÇÃO DE BLOCO, VIGA BALDRAME OU SAPATA UTILIZANDO AÇO CA-50 DE 10 MM - MONTAGEM. AF_06/2017","KG",12.15,null,null,null,"Referência: AGETOP - 52005"]
["S",3,"S",0,4,3,2,0,0,0,0,"F","Serviço","Serviço","4.3.2.0.10.","SINAPI",96543,"ARMAÇÃO DE BLOCO, VIGA BALDRAME E SAPATA UTILIZANDO AÇO CA-60 DE 5 MM - MONTAGEM. AF_06/2017","KG",55.9,null,null,null,"Referência: AGETOP - 52014"]
[2,2,2,19,4,4,0,0,0,154,19,"F","Nível 2","Nível 2","4.4.",null,null,"ESTRUTURA","-",null,null,null,null,""]
[3,3,3,7,4,4,1,0,0,18,7,"F","Nível 3","Nível 3","4.4.1.","SINAPI",null,"PILARES","-",null,null,null,null,""]
["S",3,"S",0,4,4,1,0,0,0,0,"F","Serviço","Serviço","4.4.1.0.1.","SINAPI",92418,"MONTAGEM E DESMONTAGEM DE FÔRMA DE PILARES RETANGULARES E ESTRUTURAS SIMILARES COM ÁREA MÉDIA DAS SEÇÕES MENOR OU IGUAL A 0,25 M², PÉ-DIREITO SIMPLES, EM CHAPA DE MADEIRA COMPENSADA RESINADA, 4 UTILIZAÇÕES. AF_12/2015","M2",18.143999999999998,null,null,null,"Referência: AGETOP - 60209"]
["S",3,"S",0,4,4,1,0,0,0,0,"F","Serviço","Serviço","4.4.1.0.2.","SINAPI",94964,"CONCRETO FCK = 20MPA, TRAÇO 1:2,7:3 (CIMENTO/ AREIA MÉDIA/ BRITA 1)  - PREPARO MECÂNICO COM BETONEIRA 400 L. AF_07/2016","M3",0.72575999999999996,null,null,null,""]
["S",3,"S",0,4,4,1,0,0,0,0,"F","Serviço","Serviço","4.4.1.0.3.","SINAPI",92873,"LANÇAMENTO COM USO DE BALDES, ADENSAMENTO E ACABAMENTO DE CONCRETO EM ESTRUTURAS. AF_12/2015","M3",0.72575999999999996,null,null,null,"Referência: AGETOP - 51055"]
["S",3,"S",0,4,4,1,0,0,0,0,"F","Serviço","Serviço","4.4.1.0.4.","SINAPI",92777,"ARMAÇÃO DE PILAR OU VIGA DE UMA ESTRUTURA CONVENCIONAL DE CONCRETO ARMADO EM UMA EDIFICAÇÃO TÉRREA OU SOBRADO UTILIZANDO AÇO CA-50 DE 8,0 MM - MONTAGEM. AF_12/2015","KG",24.49,null,null,null,"Referência: AGETOP - 52004"]
["S",3,"S",0,4,4,1,0,0,0,0,"F","Serviço","Serviço","4.4.1.0.5.","SINAPI",92778,"ARMAÇÃO DE PILAR OU VIGA DE UMA ESTRUTURA CONVENCIONAL DE CONCRETO ARMADO EM UMA EDIFICAÇÃO TÉRREA OU SOBRADO UTILIZANDO AÇO CA-50 DE 10,0 MM - MONTAGEM. AF_12/2015","KG",87.29,null,null,null,"Referência: AGETOP - 52005"]
["S",3,"S",0,4,4,1,0,0,0,0,"F","Serviço","Serviço","4.4.1.0.6.","SINAPI",92775,"ARMAÇÃO DE PILAR OU VIGA DE UMA ESTRUTURA CONVENCIONAL DE CONCRETO ARMADO EM UMA EDIFICAÇÃO TÉRREA OU SOBRADO UTILIZANDO AÇO CA-60 DE 5,0 MM - MONTAGEM. AF_12/2015","KG",30.95,null,null,null,"Referência: AGETOP - 52014"]
[3,3,3,9,4,4,2,0,0,11,9,"F","Nível 3","Nível 3","4.4.2.","SINAPI",null,"VIGAS DE COBERTURA","-",null,null,null,null,""]
["S",3,"S",0,4,4,2,0,0,0,0,"F","Serviço","Serviço","4.4.2.0.1.","SINAPI",92475,"MONTAGEM E DESMONTAGEM DE FÔRMA DE VIGA, ESCORAMENTO COM GARFO DE MADEIRA, PÉ-DIREITO SIMPLES, EM CHAPA DE MADEIRA PLASTIFICADA, 14 UTILIZAÇÕES. AF_12/2015","M2",35.1312,null,null,null,"Referência: AGETOP - 60209"]
["S",3,"S",0,4,4,2,0,0,0,0,"F","Serviço","Serviço","4.4.2.0.2.","SINAPI",94964,"CONCRETO FCK = 20MPA, TRAÇO 1:2,7:3 (CIMENTO/ AREIA MÉDIA/ BRITA 1)  - PREPARO MECÂNICO COM BETONEIRA 400 L. AF_07/2016","M3",1.62144,null,null,null,""]
["S",3,"S",0,4,4,2,0,0,0,0,"F","Serviço","Serviço","4.4.2.0.3.","SINAPI",92873,"LANÇAMENTO COM USO DE BALDES, ADENSAMENTO E ACABAMENTO DE CONCRETO EM ESTRUTURAS. AF_12/2015","M3",1.62144,null,null,null,"Referência: AGETOP - 51055"]
["S",3,"S",0,4,4,2,0,0,0,0,"F","Serviço","Serviço","4.4.2.0.4.","SINAPI",92776,"ARMAÇÃO DE PILAR OU VIGA DE UMA ESTRUTURA CONVENCIONAL DE CONCRETO ARMADO EM UMA EDIFICAÇÃO TÉRREA OU SOBRADO UTILIZANDO AÇO CA-50 DE 6,3 MM - MONTAGEM. AF_12/2015","KG",30.09,null,null,null,"Referência: AGETOP - 52003"]
["S",3,"S",0,4,4,2,0,0,{"$f":"IF(OR($C467=\"S\",$C467=0),0,MATCH(0,OFFSET($D467,1,$C467,ROW($C$690)-ROW($C467)),0))","v":0},{"$f":"IF(OR($C467=\"S\",$C467=0),0,MATCH(OFFSET($D467,0,$C467)+1,OFFSET($D467,1,$C467,ROW($C$690)-ROW($C467)),0))","v":0},"F","Serviço","Serviço","4.4.2.0.5.","SINAPI",92777,"ARMAÇÃO DE PILAR OU VIGA DE UMA ESTRUTURA CONVENCIONAL DE CONCRETO ARMADO EM UMA EDIFICAÇÃO TÉRREA OU SOBRADO UTILIZANDO AÇO CA-50 DE 8,0 MM - MONTAGEM. AF_12/2015","KG",4.49,null,null,null,"Referência: AGETOP - 52004"]
["S",3,"S",0,4,4,2,0,0,0,0,"F","Serviço","Serviço","4.4.2.0.6.","SINAPI",92778,"ARMAÇÃO DE PILAR OU VIGA DE UMA ESTRUTURA CONVENCIONAL DE CONCRETO ARMADO EM UMA EDIFICAÇÃO TÉRREA OU SOBRADO UTILIZANDO AÇO CA-50 DE 10,0 MM - MONTAGEM. AF_12/2015","KG",51.33,null,null,null,"Referência: AGETOP - 52005"]
["S",3,"S",0,4,4,2,0,0,0,0,"F","Serviço","Serviço","4.4.2.0.7.","SINAPI",92779,"ARMAÇÃO DE PILAR OU VIGA DE UMA ESTRUTURA CONVENCIONAL DE CONCRETO ARMADO EM UMA EDIFICAÇÃO TÉRREA OU SOBRADO UTILIZANDO AÇO CA-50 DE 12,5 MM - MONTAGEM. AF_12/2015","KG",36.590000000000003,null,null,null,"Referência: AGETOP - 52006"]
["S",3,"S",0,4,4,2,0,0,0,0,"F","Serviço","Serviço","4.4.2.0.8.","SINAPI",92775,"ARMAÇÃO DE PILAR OU VIGA DE UMA ESTRUTURA CONVENCIONAL DE CONCRETO ARMADO EM UMA EDIFICAÇÃO TÉRREA OU SOBRADO UTILIZANDO AÇO CA-60 DE 5,0 MM - MONTAGEM. AF_12/2015","KG",43.37,null,null,null,"Referência: AGETOP - 52014"]
[3,3,3,2,4,4,3,0,0,2,{"$error":"#N/A"},"F","Nível 3","Nível 3","4.4.3.","SINAPI",null,"LAJE","-",null,null,null,null,""]
["S",3,"S",0,4,4,3,0,0,0,0,"F","Serviço","Serviço","4.4.3.0.1.","SINAPI","74202/1","LAJE PRE-MOLDADA P/FORRO, SOBRECARGA 100KG/M2, VAOS ATE 3,50M/E=8CM, C/LAJOTAS E CAP.C/CONC FCK=20MPA, 3CM, INTER-EIXO 38CM, C/ESCORAMENTO (REAPR.3X) E FERRAGEM NEGATIVA","M2",55.42,null,null,null,""]
[2,2,2,25,4,5,0,0,0,135,25,"F","Nível 2","Nível 2","4.5.",null,null,"INSTALAÇÕES ELÉTRICAS","-",null,null,null,null,""]
["S",2,"S",0,4,5,0,0,0,0,0,"F","Serviço","Serviço","4.5.0.0.1.","SINAPI",91173,"FIXAÇÃO DE TUBOS VERTICAIS DE PPR DIÂMETROS MENORES OU IGUAIS A 40 MM COM ABRAÇADEIRA METÁLICA RÍGIDA TIPO D 1/2\", FIXADA EM PERFILADO EM ALVENARIA. AF_05/2015","M",30,null,null,null,""]
["S",2,"S",0,4,5,0,0,0,0,0,"F","Serviço","Serviço","4.5.0.0.2.","SINAPI",91168,"FIXAÇÃO DE TUBOS HORIZONTAIS DE PPR DIÂMETROS MAIORES QUE 40 MM E MENORES OU IGUAIS A 75 MM COM ABRAÇADEIRA METÁLICA RÍGIDA TIPO D 1 1/2\", FIXADA EM PERFILADO EM LAJE. AF_05/2015","M",18,null,null,null,""]
["S",2,"S",0,4,5,0,0,0,0,0,"F","Serviço","Serviço","4.5.0.0.3.","SINAPI",91872,"ELETRODUTO RÍGIDO ROSCÁVEL, PVC, DN 32 MM (1\"), PARA CIRCUITOS TERMINAIS, INSTALADO EM PAREDE - FORNECIMENTO E INSTALAÇÃO. AF_12/2015","M",30,null,null,null,"Referência: AGETOP - 71202"]
["S",2,"S",0,4,5,0,0,0,0,0,"F","Serviço","Serviço","4.5.0.0.4.","SINAPI",91885,"LUVA PARA ELETRODUTO, PVC, ROSCÁVEL, DN 32 MM (1\"), PARA CIRCUITOS TERMINAIS, INSTALADA EM PAREDE - FORNECIMENTO E INSTALAÇÃO. AF_12/2015","UN",10,null,null,null,"Referência: AGETOP - 71742"]
["S",2,"S",0,4,5,0,0,0,0,0,"F","Serviço","Serviço","4.5.0.0.5.","SINAPI",93009,"ELETRODUTO RÍGIDO ROSCÁVEL, PVC, DN 60 MM (2\") - FORNECIMENTO E INSTALAÇÃO. AF_12/2015","M",20,null,null,null,""]
["S",2,"S",0,4,5,0,0,0,0,0,"F","Serviço","Serviço","4.5.0.0.6.","SINAPI",93014,"LUVA PARA ELETRODUTO, PVC, ROSCÁVEL, DN 60 MM (2\") - FORNECIMENTO E INSTALAÇÃO. AF_12/2015","UN",6,null,null,null,"Referência: AGETOP - 71745"]
["S",2,"S",0,4,5,0,0,0,0,0,"F","Serviço","Serviço","4.5.0.0.7.","SINAPI",91905,"CURVA 90 GRAUS PARA ELETRODUTO, PVC, ROSCÁVEL, DN 32 MM (1\"), PARA CIRCUITOS TERMINAIS, INSTALADA EM LAJE - FORNECIMENTO E INSTALAÇÃO. AF_12/2015","UN",2,null,null,null,"Referência: AGETOP - 71142"]
["S",2,"S",0,4,5,0,0,0,0,0,"F","Serviço","Serviço","4.5.0.0.8.","SINAPI",93020,"CURVA 90 GRAUS PARA ELETRODUTO, PVC, ROSCÁVEL, DN 60 MM (2\") - FORNECIMENTO E INSTALAÇÃO. AF_12/2015","UN",2,null,null,null,""]
["S",2,"S",0,4,5,0,0,0,0,0,"F","Serviço","Serviço","4.5.0.0.9.","SINAPI",91927,"CABO DE COBRE FLEXÍVEL ISOLADO, 2,5 MM², ANTI-CHAMA 0,6/1,0 KV, PARA CIRCUITOS TERMINAIS - FORNECIMENTO E INSTALAÇÃO. AF_12/2015","M",150,null,null,null,"Referência: AGETOP - 70581"]
["S",2,"S",0,4,5,0,0,0,0,0,"F","Serviço","Serviço","4.5.0.0.10.","SINAPI",91931,"CABO DE COBRE FLEXÍVEL ISOLADO, 6 MM², ANTI-CHAMA 0,6/1,0 KV, PARA CIRCUITOS TERMINAIS - FORNECIMENTO E INSTALAÇÃO. AF_12/2015","M",200,null,null,null,"Referência: AGETOP - 70583"]
["S",2,"S",0,4,5,0,0,0,0,0,"F","Serviço","Serviço","4.5.0.0.11.","SINAPI",97591,"LUMINÁRIA TIPO PLAFON REDONDO COM VIDRO FOSCO, DE SOBREPOR, COM 2 LÂMPADAS DE 15 W - FORNECIMENTO E INSTALAÇÃO. AF_11/2017","UN",8,null,null,null,""]
["S",2,"S",0,4,5,0,0,0,0,0,"F","Serviço","Serviço","4.5.0.0.12.","SINAPI",91940,"CAIXA RETANGULAR 4\" X 2\" MÉDIA (1,30 M DO PISO), PVC, INSTALADA EM PAREDE - FORNECIMENTO E INSTALAÇÃO. AF_12/2015","UN",12,null,null,null,""]
["S",2,"S",0,4,5,0,0,0,0,0,"F","Serviço","Serviço","4.5.0.0.13.","SINAPI",83446,"CAIXA DE PASSAGEM 30X30X40 COM TAMPA E DRENO BRITA","UN",1,null,null,null,""]
["S",2,"S",0,4,5,0,0,0,0,0,"F","Serviço","Serviço","4.5.0.0.14.","SINAPI",93654,"DISJUNTOR MONOPOLAR TIPO DIN, CORRENTE NOMINAL DE 16A - FORNECIMENTO E INSTALAÇÃO. AF_04/2016","UN",1,null,null,null,""]
["S",2,"S",0,4,5,0,0,0,0,0,"F","Serviço","Serviço","4.5.0.0.15.","SINAPI",93670,"DISJUNTOR TRIPOLAR TIPO DIN, CORRENTE NOMINAL DE 25A - FORNECIMENTO E INSTALAÇÃO. AF_04/2016","UN",8,null,null,null,""]
["S",2,"S",0,4,5,0,0,0,0,0,"F","Serviço","Serviço","4.5.0.0.16.","SINAPI",93672,"DISJUNTOR TRIPOLAR TIPO DIN, CORRENTE NOMINAL DE 40A - FORNECIMENTO E INSTALAÇÃO. AF_04/2016","UN",1,null,null,null,""]
["S",2,"S",0,4,5,0,0,0,0,0,"F","Serviço","Serviço","4.5.0.0.17.","AGETOP",71331,"FITA ISOLANTE, ROLO DE 20,00 M","Un    ",1,null,null,null,""]
["S",2,"S",0,4,5,0,0,0,0,0,"F","Serviço","Serviço","4.5.0.0.18.","AGETOP",71321,"FITA DE AUTO FUSAO, ROLO E 10,00 MM","Un    ",1,null,null,null,""]
["S",2,"S",0,4,5,0,0,0,0,0,"F","Serviço","Serviço","4.5.0.0.19.","SINAPI",93043,"LÂMPADA LED 10 W BIVOLT BRANCA, FORMATO TRADICIONAL (BASE E27) - FORNECIMENTO E INSTALAÇÃO","UN",16,null,null,null,""]
["S",2,"S",0,4,5,0,0,0,0,0,"F","Serviço","Serviço","4.5.0.0.20.","AGETOP",71450,"INTERRUPTOR DIFERENCIAL RESIDUAL (D.R.) BIPOLAR DE 25A-30mA","Un    ",8,null,null,null,""]
["S",2,"S",0,4,5,0,0,0,0,0,"F","Serviço","Serviço","4.5.0.0.21.","SINAPI","74131/4","QUADRO DE DISTRIBUICAO DE ENERGIA DE EMBUTIR, EM CHAPA METALICA, PARA 18 DISJUNTORES TERMOMAGNETICOS MONOPOLARES, COM BARRAMENTO TRIFASICO E NEUTRO, FORNECIMENTO E INSTALACAO","UN",1,null,null,null,""]
["S",2,"S",0,4,5,0,0,0,0,0,"F","Serviço","Serviço","4.5.0.0.22.","SINAPI",91996,"TOMADA MÉDIA DE EMBUTIR (1 MÓDULO), 2P+T 10 A, INCLUINDO SUPORTE E PLACA - FORNECIMENTO E INSTALAÇÃO. AF_12/2015","UN",4,null,null,null,"Referência: AGETOP - 72578"]
["S",2,"S",0,4,5,0,0,0,0,0,"F","Serviço","Serviço","4.5.0.0.23.","SINAPI",91991,"TOMADA ALTA DE EMBUTIR (1 MÓDULO), 2P+T 20 A, SEM SUPORTE E SEM PLACA - FORNECIMENTO E INSTALAÇÃO. AF_12/2015","UN",8,null,null,null,""]
["S",2,"S",0,4,5,0,0,0,0,0,"F","Serviço","Serviço","4.5.0.0.24.","SINAPI",97599,"LUMINÁRIA DE EMERGÊNCIA - FORNECIMENTO E INSTALAÇÃO. AF_11/2017","UN",2,null,null,null,""]
[2,2,2,68,4,6,0,0,0,110,68,"F","Nível 2","Nível 2","4.6.",null,null,"INSTALAÇÕES HIDROSSANITÁRIAS","-",null,null,null,null,""]
[3,3,3,67,4,6,1,0,0,67,176,"F","Nível 3","Nível 3","4.6.1.","SINAPI",null,"PEÇAS E ACESSÓRIOS","-",null,null,null,null,""]
["S",3,"S",0,4,6,1,0,0,0,0,"F","Serviço","Serviço","4.6.1.0.1.","SINAPI",95470,"VASO SANITARIO SIFONADO CONVENCIONAL COM LOUÇA BRANCA, INCLUSO CONJUNTO DE LIGAÇÃO PARA BACIA SANITÁRIA AJUSTÁVEL - FORNECIMENTO E INSTALAÇÃO. AF_10/2016","UN",4,null,null,null,""]
["S",3,"S",0,4,6,1,0,0,0,0,"F","Serviço","Serviço","4.6.1.0.2.","SINAPI",99635,"VÁLVULA DE DESCARGA METÁLICA, BASE 1 1/2 \", ACABAMENTO METALICO CROMADO - FORNECIMENTO E INSTALAÇÃO. AF_01/2019","UN",4,null,null,null,"Referência: AGETOP - 80515"]
["S",3,"S",0,4,6,1,0,0,0,0,"F","Serviço","Serviço","4.6.1.0.3.","AGETOP",80526,"ASSENTO EM POLIPROPILENO COM SISTEMA DE FECHAMENTO SUAVE PARA VASO SANITÁRIO","Un    ",4,null,null,null,"Referência: AGETOP - 80526"]
["S",3,"S",0,4,6,1,0,0,0,0,"F","Serviço","Serviço","4.6.1.0.4.","SINAPI",95544,"PAPELEIRA DE PAREDE EM METAL CROMADO SEM TAMPA, INCLUSO FIXAÇÃO. AF_10/2016","UN",4,null,null,null,""]
["S",3,"S",0,4,6,1,0,0,0,0,"F","Serviço","Serviço","4.6.1.0.5.","SINAPI",86884,"ENGATE FLEXÍVEL EM PLÁSTICO BRANCO, 1/2\" X 30CM - FORNECIMENTO E INSTALAÇÃO. AF_12/2013","UN",8,null,null,null,""]
["S",3,"S",0,4,6,1,0,0,0,0,"F","Serviço","Serviço","4.6.1.0.6.","SINAPI",86903,"LAVATÓRIO LOUÇA BRANCA COM COLUNA, 45 X 55CM OU EQUIVALENTE, PADRÃO MÉDIO - FORNECIMENTO E INSTALAÇÃO. AF_12/2013","UN",6,null,null,null,"Referência: AGETOP - 80541"]
["S",3,"S",0,4,6,1,0,0,0,0,"F","Serviço","Serviço","4.6.1.0.7.","AGETOP",80550,"FIXACAO P/LAVATORIO (PAR)","PAR   ",6,null,null,null,""]
["S",3,"S",0,4,6,1,0,0,0,0,"F","Serviço","Serviço","4.6.1.0.8.","SINAPI",86906,"TORNEIRA CROMADA DE MESA, 1/2\" OU 3/4\", PARA LAVATÓRIO, PADRÃO POPULAR - FORNECIMENTO E INSTALAÇÃO. AF_12/2013","UN",8,null,null,null,""]
["S",3,"S",0,4,6,1,0,0,0,0,"F","Serviço","Serviço","4.6.1.0.9.","SINAPI",86883,"SIFÃO DO TIPO FLEXÍVEL EM PVC 1\u0094 X 1.1/2\u0094 - FORNECIMENTO E INSTALAÇÃO. AF_12/2013","UN",8,null,null,null,""]
[{"$f":"CHOOSE(1+LOG(1+2*(ORÇAMENTO.Nivel=\"Nível 1\")+4*(ORÇAMENTO.Nivel=\"Nível 2\")+8*(ORÇAMENTO.Nivel=\"Nível 3\")+16*(ORÇAMENTO.Nivel=\"Nível 4\")+32*(ORÇAMENTO.Nivel=\"Serviço\"),2),0,1,2,3,4,\"S\")","v":"S"},{"$f":"IF(OR(C509=\"s\",C509=0),OFFSET(B509,-1,0),C509)","v":3},{"$f":"IF(OFFSET(C509,-1,0)=\"L\",1,IF(OFFSET(C509,-1,0)=1,2,IF(OR(A509=\"s\",A509=0),\"S\",IF(AND(OFFSET(C509,-1,0)=2,A509=4),3,IF(AND(OR(OFFSET(C509,-1,0)=\"s\",OFFSET(C509,-1,0)=0),A509<>\"s\",A509>OFFSET(B509,-1,0)),OFFSET(B509,-1,0),A509)))))","v":"S"},{"$f":"IF(OR(C509=\"S\",C509=0),0,IF(ISERROR(K509),J509,SMALL(J509:K509,1)))","v":0},{"$f":"IF($C509=1,OFFSET(E509,-1,0)+1,OFFSET(E509,-1,0))","v":4},{"$f":"IF($C509=1,0,IF($C509=2,OFFSET(F509,-1,0)+1,OFFSET(F509,-1,0)))","v":6},{"$f":"IF(AND($C509<=2,$C509<>0),0,IF($C509=3,OFFSET(G509,-1,0)+1,OFFSET(G509,-1,0)))","v":1},{"$f":"IF(AND($C509<=3,$C509<>0),0,IF($C509=4,OFFSET(H509,-1,0)+1,OFFSET(H509,-1,0)))","v":0},{"$f":"IF(AND($C509<=4,$C509<>0),0,IF(AND($C509=\"S\",$W509>0),OFFSET(I509,-1,0)+1,OFFSET(I509,-1,0)))","v":0},0,0,"F","Serviço","Serviço","4.6.1.0.10.","SINAPI",86877,"VÁLVULA EM METAL CROMADO 1.1/2\" X 1.1/2\" PARA TANQUE OU LAVATÓRIO, COM OU SEM LADRÃO - FORNECIMENTO E INSTALAÇÃO. AF_12/2013","UN",8,null,null,null,"Referência: AGETOP - 80830"]
["S",3,"S",0,4,6,1,0,0,0,0,"F","Serviço","Serviço","4.6.1.0.11.","SINAPI",86901,"CUBA DE EMBUTIR OVAL EM LOUÇA BRANCA, 35 X 50CM OU EQUIVALENTE - FORNECIMENTO E INSTALAÇÃO. AF_12/2013","UN",2,null,null,null,"Referência: AGETOP - 80587"]
["S",3,"S",0,4,6,1,0,0,0,0,"F","Serviço","Serviço","4.6.1.0.12.","SINAPI","74234/1","MICTORIO SIFONADO DE LOUCA BRANCA COM PERTENCES, COM REGISTRO DE PRESSAO 1/2\" COM CANOPLA CROMADA ACABAMENTO SIMPLES E CONJUNTO PARA FIXACAO  - FORNECIMENTO E INSTALACAO","UN",2,null,null,null,"Referência: AGETOP - 80601"]
["S",3,"S",0,4,6,1,0,0,0,0,"F","Serviço","Serviço","4.6.1.0.13.","AGETOP",81501,"ADESIVO PLASTICO - FRASCO 850 G","Un    ",8,null,null,null,""]
["S",3,"S",0,4,6,1,0,0,0,0,"F","Serviço","Serviço","4.6.1.0.14.","AGETOP",80730,"CABIDE TIPO GANCHO EM LOUÇA","Un    ",8,null,null,null,""]
["S",3,"S",0,4,6,1,0,0,0,0,"F","Serviço","Serviço","4.6.1.0.15.","SINAPI",95547,"SABONETEIRA PLASTICA TIPO DISPENSER PARA SABONETE LIQUIDO COM RESERVATORIO 800 A 1500 ML, INCLUSO FIXAÇÃO. AF_10/2016","UN",8,null,null,null,""]
["S",3,"S",0,4,6,1,0,0,0,0,"F","Serviço","Serviço","4.6.1.0.16.","SINAPI",89353,"REGISTRO DE GAVETA BRUTO, LATÃO, ROSCÁVEL, 3/4\", FORNECIDO E INSTALADO EM RAMAL DE ÁGUA. AF_12/2014","UN",9,null,null,null,"Referência: AGETOP - 80902"]
["S",3,"S",0,4,6,1,0,0,0,0,"F","Serviço","Serviço","4.6.1.0.17.","AGETOP",80927,"REGISTRO DE GAVETA C/CANOPLA DIAMETRO 1\"","Un    ",2,null,null,null,""]
["S",3,"S",0,4,6,1,0,0,0,0,"F","Serviço","Serviço","4.6.1.0.18.","SINAPI",89351,"REGISTRO DE PRESSÃO BRUTO, LATÃO,  ROSCÁVEL, 3/4\u0094, FORNECIDO E INSTALADO EM RAMAL DE ÁGUA. AF_12/2014","UN",8,null,null,null,""]
["S",3,"S",0,4,6,1,0,0,0,0,"F","Serviço","Serviço","4.6.1.0.19.","SINAPI",89446,"TUBO, PVC, SOLDÁVEL, DN 25MM, INSTALADO EM PRUMADA DE ÁGUA - FORNECIMENTO E INSTALAÇÃO. AF_12/2014","M",42,null,null,null,""]
["S",3,"S",0,4,6,1,0,0,0,0,"F","Serviço","Serviço","4.6.1.0.20.","SINAPI",89447,"TUBO, PVC, SOLDÁVEL, DN 32MM, INSTALADO EM PRUMADA DE ÁGUA - FORNECIMENTO E INSTALAÇÃO. AF_12/2014","M",15,null,null,null,""]
["S",3,"S",0,4,6,1,0,0,0,0,"F","Serviço","Serviço","4.6.1.0.21.","SINAPI",89449,"TUBO, PVC, SOLDÁVEL, DN 50MM, INSTALADO EM PRUMADA DE ÁGUA - FORNECIMENTO E INSTALAÇÃO. AF_12/2014","M",15,null,null,null,""]
["S",3,"S",0,4,6,1,0,0,0,0,"F","Serviço","Serviço","4.6.1.0.22.","SINAPI",89450,"TUBO, PVC, SOLDÁVEL, DN 60MM, INSTALADO EM PRUMADA DE ÁGUA - FORNECIMENTO E INSTALAÇÃO. AF_12/2014","M",72,null,null,null,""]
["S",3,"S",0,4,6,1,0,0,0,0,"F","Serviço","Serviço","4.6.1.0.23.","SINAPI",94656,"ADAPTADOR CURTO COM BOLSA E ROSCA PARA REGISTRO, PVC, SOLDÁVEL, DN  25 MM X 3/4 , INSTALADO EM RESERVAÇÃO DE ÁGUA DE EDIFICAÇÃO QUE POSSUA RESERVATÓRIO DE FIBRA/FIBROCIMENTO   FORNECIMENTO E INSTALAÇÃO. AF_06/2016","UN",26,null,null,null,""]
["S",3,"S",0,4,6,1,0,0,0,0,"F","Serviço","Serviço","4.6.1.0.24.","SINAPI",89436,"ADAPTADOR CURTO COM BOLSA E ROSCA PARA REGISTRO, PVC, SOLDÁVEL, DN 32MM X 1\u0094, INSTALADO EM RAMAL DE DISTRIBUIÇÃO DE ÁGUA - FORNECIMENTO E INSTALAÇÃO. AF_12/2014","UN",4,null,null,null,""]
["S",3,"S",0,4,6,1,0,0,0,0,"F","Serviço","Serviço","4.6.1.0.25.","SINAPI",89596,"ADAPTADOR CURTO COM BOLSA E ROSCA PARA REGISTRO, PVC, SOLDÁVEL, DN 50MM X 1.1/2\u0094, INSTALADO EM PRUMADA DE ÁGUA - FORNECIMENTO E INSTALAÇÃO. AF_12/2014","UN",4,null,null,null,""]
["S",3,"S",0,4,6,1,0,0,0,0,"F","Serviço","Serviço","4.6.1.0.26.","SINAPI",94657,"LUVA PVC, SOLDÁVEL, DN  25 MM, INSTALADA EM RESERVAÇÃO DE ÁGUA DE EDIFICAÇÃO QUE POSSUA RESERVATÓRIO DE FIBRA/FIBROCIMENTO   FORNECIMENTO E INSTALAÇÃO. AF_06/2016","UN",4,null,null,null,""]
["S",3,"S",0,4,6,1,0,0,0,0,"F","Serviço","Serviço","4.6.1.0.27.","AGETOP",81162,"BUCHA DE REDUCAO SOLD.CURTA 32 X 25 MM","Un    ",3,null,null,null,""]
["S",3,"S",0,4,6,1,0,0,0,0,"F","Serviço","Serviço","4.6.1.0.28.","AGETOP",81165,"BUCHA DE REDUCAO SOLD. CURTA 60 X 50 mm","Un    ",4,null,null,null,""]
["S",3,"S",0,4,6,1,0,0,0,0,"F","Serviço","Serviço","4.6.1.0.29.","AGETOP",81179,"BUCHA DE REDUCAO SOLDAVEL LONGA 50 X 25 mm","Un    ",4,null,null,null,""]
["S",3,"S",0,4,6,1,0,0,0,0,"F","Serviço","Serviço","4.6.1.0.30.","AGETOP",81180,"BUCHA DE REDUCAO SOLDAVEL LONGA 50 X 32 mm","Un    ",3,null,null,null,""]
["S",3,"S",0,4,6,1,0,0,0,0,"F","Serviço","Serviço","4.6.1.0.31.","SINAPI",89362,"JOELHO 90 GRAUS, PVC, SOLDÁVEL, DN 25MM, INSTALADO EM RAMAL OU SUB-RAMAL DE ÁGUA - FORNECIMENTO E INSTALAÇÃO. AF_12/2014","UN",28,null,null,null,""]
["S",3,"S",0,4,6,1,0,0,{"$f":"IF(OR($C531=\"S\",$C531=0),0,MATCH(0,OFFSET($D531,1,$C531,ROW($C$690)-ROW($C531)),0))","v":0},{"$f":"IF(OR($C531=\"S\",$C531=0),0,MATCH(OFFSET($D531,0,$C531)+1,OFFSET($D531,1,$C531,ROW($C$690)-ROW($C531)),0))","v":0},"F","Serviço","Serviço","4.6.1.0.32.","SINAPI",89367,"JOELHO 90 GRAUS, PVC, SOLDÁVEL, DN 32MM, INSTALADO EM RAMAL OU SUB-RAMAL DE ÁGUA - FORNECIMENTO E INSTALAÇÃO. AF_12/2014","UN",6,null,null,null,""]
["S",3,"S",0,4,6,1,0,0,0,0,"F","Serviço","Serviço","4.6.1.0.33.","SINAPI",89501,"JOELHO 90 GRAUS, PVC, SOLDÁVEL, DN 50MM, INSTALADO EM PRUMADA DE ÁGUA - FORNECIMENTO E INSTALAÇÃO. AF_12/2014","UN",9,null,null,null,""]
["S",3,"S",0,4,6,1,0,0,0,0,"F","Serviço","Serviço","4.6.1.0.34.","SINAPI",89505,"JOELHO 90 GRAUS, PVC, SOLDÁVEL, DN 60MM, INSTALADO EM PRUMADA DE ÁGUA - FORNECIMENTO E INSTALAÇÃO. AF_12/2014","UN",2,null,null,null,""]
["S",3,"S",0,4,6,1,0,0,0,0,"F","Serviço","Serviço","4.6.1.0.35.","AGETOP",81360,"JOELHO RED.90 GRAUS SOLD.C/BUCHA LATAO 25X1/2\"","Un    ",16,null,null,null,""]
["S",3,"S",0,4,6,1,0,0,0,0,"F","Serviço","Serviço","4.6.1.0.36.","SINAPI",89395,"TE, PVC, SOLDÁVEL, DN 25MM, INSTALADO EM RAMAL OU SUB-RAMAL DE ÁGUA - FORNECIMENTO E INSTALAÇÃO. AF_12/2014","UN",1,null,null,null,""]
["S",3,"S",0,4,6,1,0,0,0,0,"F","Serviço","Serviço","4.6.1.0.37.","SINAPI",89398,"TE, PVC, SOLDÁVEL, DN 32MM, INSTALADO EM RAMAL OU SUB-RAMAL DE ÁGUA - FORNECIMENTO E INSTALAÇÃO. AF_12/2014","UN",1,null,null,null,""]
["S",3,"S",0,4,6,1,0,0,0,0,"F","Serviço","Serviço","4.6.1.0.38.","SINAPI",89625,"TE, PVC, SOLDÁVEL, DN 50MM, INSTALADO EM PRUMADA DE ÁGUA - FORNECIMENTO E INSTALAÇÃO. AF_12/2014","UN",4,null,null,null,"Referência: AGETOP - 81405"]
["S",3,"S",0,4,6,1,0,0,0,0,"F","Serviço","Serviço","4.6.1.0.39.","SINAPI",89628,"TE, PVC, SOLDÁVEL, DN 60MM, INSTALADO EM PRUMADA DE ÁGUA - FORNECIMENTO E INSTALAÇÃO. AF_12/2014","UN",5,null,null,null,""]
["S",3,"S",0,4,6,1,0,0,0,0,"F","Serviço","Serviço","4.6.1.0.40.","AGETOP",81445,"TE RED.SOLD.90GR.BUC.LATAO BOLSA CENT.25X25X1/2\"","Un    ",6,null,null,null,""]
["S",3,"S",0,4,6,1,0,0,0,0,"F","Serviço","Serviço","4.6.1.0.41.","AGETOP",81501,"ADESIVO PLASTICO - FRASCO 850 G","Un    ",1,null,null,null,""]
["S",3,"S",0,4,6,1,0,0,0,0,"F","Serviço","Serviço","4.6.1.0.42.","AGETOP",81504,"SOLUCAO LIMPADORA 1000 CM3","Un    ",1,null,null,null,""]
["S",3,"S",0,4,6,1,0,0,0,0,"F","Serviço","Serviço","4.6.1.0.43.","AGETOP",81664,"CORPO CX. SIFONADA DIAM. 150 X 185 X 75","Un    ",4,null,null,null,""]
["S",3,"S",0,4,6,1,0,0,0,0,"F","Serviço","Serviço","4.6.1.0.44.","SINAPI",89710,"RALO SECO, PVC, DN 100 X 40 MM, JUNTA SOLDÁVEL, FORNECIDO E INSTALADO EM RAMAL DE DESCARGA OU EM RAMAL DE ESGOTO SANITÁRIO. AF_12/2014","UN",6,null,null,null,""]
["S",3,"S",0,4,6,1,0,0,0,0,"F","Serviço","Serviço","4.6.1.0.45.","SINAPI",94677,"CURVA 90 GRAUS, PVC, SOLDÁVEL, DN 40 MM, INSTALADO EM RESERVAÇÃO DE ÁGUA DE EDIFICAÇÃO QUE POSSUA RESERVATÓRIO DE FIBRA/FIBROCIMENTO   FORNECIMENTO E INSTALAÇÃO. AF_06/2016","UN",18,null,null,null,""]
["S",3,"S",0,4,6,1,0,0,0,0,"F","Serviço","Serviço","4.6.1.0.46.","SINAPI",95694,"CURVA 90 GRAUS, PVC, SERIE R, ÁGUA PLUVIAL, DN 100 MM, JUNTA ELÁSTICA, FORNECIDO E INSTALADO EM RAMAL DE ENCAMINHAMENTO. AF_12/2014","UN",4,null,null,null,""]
["S",3,"S",0,4,6,1,0,0,0,0,"F","Serviço","Serviço","4.6.1.0.47.","AGETOP",81778,"GRELHA QUADRADA CROMADA DIAM. 150 MM","Un    ",4,null,null,null,""]
["S",3,"S",0,4,6,1,0,0,0,0,"F","Serviço","Serviço","4.6.1.0.48.","AGETOP",81790,"GRELHA REDONDA BRANCA DIAM. 100 MM","Un    ",6,null,null,null,""]
["S",3,"S",0,4,6,1,0,0,0,0,"F","Serviço","Serviço","4.6.1.0.49.","AGETOP",81825,"CAIXA DE PASSAGEM 60 X 60 CM SEM TAMPA","Un    ",2,null,null,null,""]
[{"$f":"CHOOSE(1+LOG(1+2*(ORÇAMENTO.Nivel=\"Nível 1\")+4*(ORÇAMENTO.Nivel=\"Nível 2\")+8*(ORÇAMENTO.Nivel=\"Nível 3\")+16*(ORÇAMENTO.Nivel=\"Nível 4\")+32*(ORÇAMENTO.Nivel=\"Serviço\"),2),0,1,2,3,4,\"S\")","v":"S"},{"$f":"IF(OR(C549=\"s\",C549=0),OFFSET(B549,-1,0),C549)","v":3},{"$f":"IF(OFFSET(C549,-1,0)=\"L\",1,IF(OFFSET(C549,-1,0)=1,2,IF(OR(A549=\"s\",A549=0),\"S\",IF(AND(OFFSET(C549,-1,0)=2,A549=4),3,IF(AND(OR(OFFSET(C549,-1,0)=\"s\",OFFSET(C549,-1,0)=0),A549<>\"s\",A549>OFFSET(B549,-1,0)),OFFSET(B549,-1,0),A549)))))","v":"S"},{"$f":"IF(OR(C549=\"S\",C549=0),0,IF(ISERROR(K549),J549,SMALL(J549:K549,1)))","v":0},{"$f":"IF($C549=1,OFFSET(E549,-1,0)+1,OFFSET(E549,-1,0))","v":4},{"$f":"IF($C549=1,0,IF($C549=2,OFFSET(F549,-1,0)+1,OFFSET(F549,-1,0)))","v":6},{"$f":"IF(AND($C549<=2,$C549<>0),0,IF($C549=3,OFFSET(G549,-1,0)+1,OFFSET(G549,-1,0)))","v":1},{"$f":"IF(AND($C549<=3,$C549<>0),0,IF($C549=4,OFFSET(H549,-1,0)+1,OFFSET(H549,-1,0)))","v":0},{"$f":"IF(AND($C549<=4,$C549<>0),0,IF(AND($C549=\"S\",$W549>0),OFFSET(I549,-1,0)+1,OFFSET(I549,-1,0)))","v":0},0,0,"F","Serviço","Serviço","4.6.1.0.50.","AGETOP",81825,"CAIXA DE PASSAGEM 60 X 60 CM SEM TAMPA","Un    ",2,null,null,null,""]
["S",3,"S",0,4,6,1,0,0,0,0,"F","Serviço","Serviço","4.6.1.0.51.","AGETOP",81885,"TERMINAL DE VENTILACAO DIAMETRO 50 MM","Un    ",2,null,null,null,""]
["S",3,"S",0,4,6,1,0,0,0,0,"F","Serviço","Serviço","4.6.1.0.52.","SINAPI",94676,"JOELHO 90 GRAUS, PVC, SOLDÁVEL, DN 40 MM INSTALADO EM RESERVAÇÃO DE ÁGUA DE EDIFICAÇÃO QUE POSSUA RESERVATÓRIO DE FIBRA/FIBROCIMENTO   FORNECIMENTO E INSTALAÇÃO. AF_06/2016","UN",20,null,null,null,""]
["S",3,"S",0,4,6,1,0,0,0,0,"F","Serviço","Serviço","4.6.1.0.53.","SINAPI",94676,"JOELHO 90 GRAUS, PVC, SOLDÁVEL, DN 40 MM INSTALADO EM RESERVAÇÃO DE ÁGUA DE EDIFICAÇÃO QUE POSSUA RESERVATÓRIO DE FIBRA/FIBROCIMENTO   FORNECIMENTO E INSTALAÇÃO. AF_06/2016","UN",2,null,null,null,""]
["S",3,"S",0,4,6,1,0,0,0,0,"F","Serviço","Serviço","4.6.1.0.54.","SINAPI",89732,"JOELHO 45 GRAUS, PVC, SERIE NORMAL, ESGOTO PREDIAL, DN 50 MM, JUNTA ELÁSTICA, FORNECIDO E INSTALADO EM RAMAL DE DESCARGA OU RAMAL DE ESGOTO SANITÁRIO. AF_12/2014","UN",2,null,null,null,""]
["S",3,"S",0,4,6,1,0,0,0,0,"F","Serviço","Serviço","4.6.1.0.55.","SINAPI",89726,"JOELHO 45 GRAUS, PVC, SERIE NORMAL, ESGOTO PREDIAL, DN 40 MM, JUNTA SOLDÁVEL, FORNECIDO E INSTALADO EM RAMAL DE DESCARGA OU RAMAL DE ESGOTO SANITÁRIO. AF_12/2014","UN",12,null,null,null,""]
["S",3,"S",0,4,6,1,0,0,0,0,"F","Serviço","Serviço","4.6.1.0.56.","SINAPI",89731,"JOELHO 90 GRAUS, PVC, SERIE NORMAL, ESGOTO PREDIAL, DN 50 MM, JUNTA ELÁSTICA, FORNECIDO E INSTALADO EM RAMAL DE DESCARGA OU RAMAL DE ESGOTO SANITÁRIO. AF_12/2014","UN",2,null,null,null,""]
["S",3,"S",0,4,6,1,0,0,0,0,"F","Serviço","Serviço","4.6.1.0.57.","SINAPI",89744,"JOELHO 90 GRAUS, PVC, SERIE NORMAL, ESGOTO PREDIAL, DN 100 MM, JUNTA ELÁSTICA, FORNECIDO E INSTALADO EM RAMAL DE DESCARGA OU RAMAL DE ESGOTO SANITÁRIO. AF_12/2014","UN",4,null,null,null,""]
["S",3,"S",0,4,6,1,0,0,0,0,"F","Serviço","Serviço","4.6.1.0.58.","AGETOP",82055,"PORTA GRELHA QUADRADO P/GRELHA RED.CROM.DIAM.100 M","Un    ",6,null,null,null,""]
["S",3,"S",0,4,6,1,0,0,0,0,"F","Serviço","Serviço","4.6.1.0.59.","AGETOP",82052,"PORTA GRELHA QUADRADO CROMADO DIAM.150 MM","Un    ",4,null,null,null,""]
["S",3,"S",0,4,6,1,0,0,0,0,"F","Serviço","Serviço","4.6.1.0.60.","AGETOP",82230,"TE SANITARIO DIAMETRO 50 X 50 MM","Un    ",6,null,null,null,""]
["S",3,"S",0,4,6,1,0,0,0,0,"F","Serviço","Serviço","4.6.1.0.61.","SINAPI",89630,"TE DE REDUÇÃO, PVC, SOLDÁVEL, DN 75MM X 50MM, INSTALADO EM PRUMADA DE ÁGUA - FORNECIMENTO E INSTALAÇÃO. AF_12/2014","UN",4,null,null,null,""]
["S",3,"S",0,4,6,1,0,0,0,0,"F","Serviço","Serviço","4.6.1.0.62.","AGETOP",82233,"TE SANITARIO DIAMETRO 100 X 50 MM","Un    ",4,null,null,null,""]
["S",3,"S",0,4,6,1,0,0,0,0,"F","Serviço","Serviço","4.6.1.0.63.","SINAPI",89508,"TUBO PVC, SÉRIE R, ÁGUA PLUVIAL, DN 40 MM, FORNECIDO E INSTALADO EM RAMAL DE ENCAMINHAMENTO. AF_12/2014","M",31,null,null,null,""]
["S",3,"S",0,4,6,1,0,0,0,0,"F","Serviço","Serviço","4.6.1.0.64.","SINAPI",89509,"TUBO PVC, SÉRIE R, ÁGUA PLUVIAL, DN 50 MM, FORNECIDO E INSTALADO EM RAMAL DE ENCAMINHAMENTO. AF_12/2014","M",18,null,null,null,""]
["S",3,"S",0,4,6,1,0,0,0,0,"F","Serviço","Serviço","4.6.1.0.65.","SINAPI",89511,"TUBO PVC, SÉRIE R, ÁGUA PLUVIAL, DN 75 MM, FORNECIDO E INSTALADO EM RAMAL DE ENCAMINHAMENTO. AF_12/2014","M",18,null,null,null,""]
["S",3,"S",0,4,6,1,0,0,0,0,"F","Serviço","Serviço","4.6.1.0.66.","SINAPI",89512,"TUBO PVC, SÉRIE R, ÁGUA PLUVIAL, DN 100 MM, FORNECIDO E INSTALADO EM RAMAL DE ENCAMINHAMENTO. AF_12/2014","M",38,null,null,null,""]
[2,2,2,4,4,7,0,0,0,42,4,"F","Nível 2","Nível 2","4.7.","SINAPI",null,"ALVENARIAS E DIVISÓRIAS","-",null,null,null,null,""]
["S",2,"S",0,4,7,0,0,0,0,0,"F","Serviço","Serviço","4.7.0.0.1.","SINAPI",87511,"ALVENARIA DE VEDAÇÃO DE BLOCOS CERÂMICOS FURADOS NA HORIZONTAL DE 9X19X19CM (ESPESSURA 9CM) DE PAREDES COM ÁREA LÍQUIDA MENOR QUE 6M² COM VÃOS E ARGAMASSA DE ASSENTAMENTO COM PREPARO EM BETONEIRA. AF_06/2014","M2",51.947999999999993,null,null,null,"Referência: AGETOP - 100201"]
["S",2,"S",0,4,7,0,0,0,0,0,"F","Serviço","Serviço","4.7.0.0.2.","AGETOP",100602,"ALVENARIA DE TIJOLO LAMINADO 1/2 VEZ  - ARG. (1CI : 1CH : 5ARML)","m2    ",64.94,null,null,null,""]
["S",2,"S",0,4,7,0,0,0,0,0,"F","Serviço","Serviço","4.7.0.0.3.","SINAPI",79627,"DIVISORIA EM GRANITO BRANCO POLIDO, ESP = 3CM, ASSENTADO COM ARGAMASSA TRACO 1:4, ARREMATE EM CIMENTO BRANCO, EXCLUSIVE FERRAGENS","M2",0.9,null,null,null,"Referência: AGETOP - 100320"]
[2,2,2,2,4,8,0,0,0,38,2,"F","Nível 2","Nível 2","4.8.","SINAPI",null,"IMPERMEABILIZACAO","-",null,null,null,null,""]
["S",2,"S",0,4,8,0,0,0,0,0,"F","Serviço","Serviço","4.8.0.0.1.","SINAPI","74106/1","IMPERMEABILIZACAO DE ESTRUTURAS ENTERRADAS, COM TINTA ASFALTICA, DUAS DEMAOS.","M2",48,null,null,null,""]
[2,2,2,2,4,9,0,0,0,36,2,"F","Nível 2","Nível 2","4.9.","AGETOP",null,"ESTRUTURA DE MADEIRA","-",null,null,null,null,""]
["S",2,"S",0,4,9,0,0,0,0,0,"F","Serviço","Serviço","4.9.0.0.1.","AGETOP",140200,"EST.MAD.TELHA FIBROCIM. COM APOIOS EM LAJES/VIGAS OU PAREDES(SOMENTE TERÇAS) C/FERRAGENS","m2    ",55.42,null,null,null,""]
[2,2,2,4,4,10,0,0,0,34,4,"F","Nível 2","Nível 2","4.10.","AGETOP",null,"COBERTURAS","-",null,null,null,null,""]
["S",2,"S",0,4,10,0,0,0,0,0,"F","Serviço","Serviço","4.10.0.0.1.","SINAPI",94210,"TELHAMENTO COM TELHA ONDULADA DE FIBROCIMENTO E = 6 MM, COM RECOBRIMENTO LATERAL DE 1 1/4 DE ONDA PARA TELHADO COM INCLINAÇÃO MÁXIMA DE 10°, COM ATÉ 2 ÁGUAS, INCLUSO IÇAMENTO. AF_06/2016","M2",55.42,null,null,null,"Referência: AGETOP - 160501"]
["S",2,"S",0,4,10,0,0,0,0,0,"F","Serviço","Serviço","4.10.0.0.2.","SINAPI",94228,"CALHA EM CHAPA DE AÇO GALVANIZADO NÚMERO 24, DESENVOLVIMENTO DE 50 CM, INCLUSO TRANSPORTE VERTICAL. AF_06/2016","M",10.039999999999999,null,null,null,"Referência: AGETOP - 160601"]
["S",2,"S",0,4,10,0,0,0,0,0,"F","Serviço","Serviço","4.10.0.0.3.","SINAPI",94231,"RUFO EM CHAPA DE AÇO GALVANIZADO NÚMERO 24, CORTE DE 25 CM, INCLUSO TRANSPORTE VERTICAL. AF_06/2016","M",29.519999999999996,null,null,null,"Referência: AGETOP - 160602"]
[2,2,2,4,4,11,0,0,0,30,4,"F","Nível 2","Nível 2","4.11.","AGETOP",null,"ESQUADRIAS METÁLICAS","-",null,null,null,null,""]
["S",2,"S",0,4,11,0,0,0,0,0,"F","Serviço","Serviço","4.11.0.0.1.","SINAPI",94559,"JANELA DE AÇO BASCULANTE, FIXAÇÃO COM ARGAMASSA, SEM VIDROS, PADRONIZADA. AF_07/2016","M2",6.2799999999999994,null,null,null,"Referência: AGETOP - 180404"]
["S",2,"S",0,4,11,0,0,0,0,0,"F","Serviço","Serviço","4.11.0.0.2.","SINAPI","73933/4","PORTA DE FERRO DE ABRIR TIPO BARRA CHATA, COM REQUADRO E GUARNICAO COMPLETA","M2",3.7800000000000002,null,null,null,"Referência: AGETOP - 180501"]
["S",2,"S",0,4,11,0,0,0,0,0,"F","Serviço","Serviço","4.11.0.0.3.","SINAPI","73933/4","PORTA DE FERRO DE ABRIR TIPO BARRA CHATA, COM REQUADRO E GUARNICAO COMPLETA","M2",10.240000000000002,null,null,null,"Referência: AGETOP - 180509"]
[2,2,2,2,4,12,0,0,0,26,2,"F","Nível 2","Nível 2","4.12.","AGETOP",null,"VIDROS","-",null,null,null,null,""]
["S",2,"S",0,4,12,0,0,0,0,0,"F","Serviço","Serviço","4.12.0.0.1.","SINAPI",72117,"VIDRO LISO COMUM TRANSPARENTE, ESPESSURA 4MM","M2",5.3379999999999992,null,null,null,"Referência: AGETOP - 190102"]
[2,2,2,5,4,13,0,0,0,24,5,"F","Nível 2","Nível 2","4.13.","AGETOP",null,"REVESTIMENTO DE PAREDE","-",null,null,null,null,""]
["S",2,"S",0,4,13,0,0,0,0,0,"F","Serviço","Serviço","4.13.0.0.1.","SINAPI",87548,"MASSA ÚNICA, PARA RECEBIMENTO DE PINTURA, EM ARGAMASSA TRAÇO 1:2:8, PREPARO MANUAL, APLICADA MANUALMENTE EM FACES INTERNAS DE PAREDES, ESPESSURA DE 10MM, COM EXECUÇÃO DE TALISCAS. AF_06/2014","M2",54.575999999999965,null,null,null,"Referência: AGETOP - 200403"]
["S",2,"S",0,4,13,0,0,0,0,0,"F","Serviço","Serviço","4.13.0.0.2.","SINAPI",87273,"REVESTIMENTO CERÂMICO PARA PAREDES INTERNAS COM PLACAS TIPO ESMALTADA EXTRA DE DIMENSÕES 33X45 CM APLICADAS EM AMBIENTES DE ÁREA MAIOR QUE 5 M² NA ALTURA INTEIRA DAS PAREDES. AF_06/2014","M2",145.80000000000001,null,null,null,""]
["S",2,"S",0,4,13,0,0,0,0,0,"F","Serviço","Serviço","4.13.0.0.3.","SINAPI",87549,"EMBOÇO, PARA RECEBIMENTO DE CERÂMICA, EM ARGAMASSA TRAÇO 1:2:8, PREPARO MECÂNICO COM BETONEIRA 400L, APLICADO MANUALMENTE EM FACES INTERNAS DE PAREDES, PARA AMBIENTE COM ÁREA ENTRE 5M2 E 10M2, ESPESSURA DE 10MM, COM EXECUÇÃO DE TALISCAS. AF_06/2014","M2",145.80000000000001,null,null,null,"Referência: AGETOP - 200201"]
["S",2,"S",0,4,13,0,0,0,0,0,"F","Serviço","Serviço","4.13.0.0.4.","SINAPI",87904,"CHAPISCO APLICADO EM ALVENARIA (COM PRESENÇA DE VÃOS) E ESTRUTURAS DE CONCRETO DE FACHADA, COM COLHER DE PEDREIRO.  ARGAMASSA TRAÇO 1:3 COM PREPARO MANUAL. AF_06/2014","M2",200.37599999999998,null,null,null,"Referência: AGETOP - 200101"]
[2,2,2,3,4,14,0,0,0,19,3,"F","Nível 2","Nível 2","4.14.","AGETOP",null,"FORROS","-",null,null,null,null,""]
["S",2,"S",0,4,14,0,0,0,0,0,"F","Serviço","Serviço","4.14.0.0.1.","SINAPI",87414,"APLICAÇÃO MANUAL DE GESSO DESEMPENADO (SEM TALISCAS) EM TETO DE AMBIENTES DE ÁREA MAIOR QUE 10M², ESPESSURA DE 1,0CM. AF_06/2014","M2",55.42,null,null,null,"Referência: AGETOP - 210515"]
[{"$f":"CHOOSE(1+LOG(1+2*(ORÇAMENTO.Nivel=\"Nível 1\")+4*(ORÇAMENTO.Nivel=\"Nível 2\")+8*(ORÇAMENTO.Nivel=\"Nível 3\")+16*(ORÇAMENTO.Nivel=\"Nível 4\")+32*(ORÇAMENTO.Nivel=\"Serviço\"),2),0,1,2,3,4,\"S\")","v":"S"},{"$f":"IF(OR(C591=\"s\",C591=0),OFFSET(B591,-1,0),C591)","v":2},{"$f":"IF(OFFSET(C591,-1,0)=\"L\",1,IF(OFFSET(C591,-1,0)=1,2,IF(OR(A591=\"s\",A591=0),\"S\",IF(AND(OFFSET(C591,-1,0)=2,A591=4),3,IF(AND(OR(OFFSET(C591,-1,0)=\"s\",OFFSET(C591,-1,0)=0),A591<>\"s\",A591>OFFSET(B591,-1,0)),OFFSET(B591,-1,0),A591)))))","v":"S"},{"$f":"IF(OR(C591=\"S\",C591=0),0,IF(ISERROR(K591),J591,SMALL(J591:K591,1)))","v":0},{"$f":"IF($C591=1,OFFSET(E591,-1,0)+1,OFFSET(E591,-1,0))","v":4},{"$f":"IF($C591=1,0,IF($C591=2,OFFSET(F591,-1,0)+1,OFFSET(F591,-1,0)))","v":14},{"$f":"IF(AND($C591<=2,$C591<>0),0,IF($C591=3,OFFSET(G591,-1,0)+1,OFFSET(G591,-1,0)))","v":0},{"$f":"IF(AND($C591<=3,$C591<>0),0,IF($C591=4,OFFSET(H591,-1,0)+1,OFFSET(H591,-1,0)))","v":0},{"$f":"IF(AND($C591<=4,$C591<>0),0,IF(AND($C591=\"S\",$W591>0),OFFSET(I591,-1,0)+1,OFFSET(I591,-1,0)))","v":0},0,0,"F","Serviço","Serviço","4.14.0.0.2.","SINAPI",87884,"CHAPISCO APLICADO NO TETO, COM ROLO PARA TEXTURA ACRÍLICA. ARGAMASSA INDUSTRIALIZADA COM PREPARO MANUAL. AF_06/2014","M2",55.42,null,null,null,"Referência: AGETOP - 210101"]
[2,2,2,4,4,15,0,0,0,16,4,"F","Nível 2","Nível 2","4.15.","SINAPI",null,"REVESTIMENTO DE PISO","-",null,null,null,null,""]
["S",2,"S",0,4,15,0,0,0,0,0,"F","Serviço","Serviço","4.15.0.0.1.","SINAPI",95241,"LASTRO DE CONCRETO MAGRO, APLICADO EM PISOS OU RADIERS, ESPESSURA DE 5 CM. AF_07/2016","M2",50.8,null,null,null,"Referência: AGETOP - 220050"]
["S",2,"S",0,4,15,0,0,0,0,0,"F","Serviço","Serviço","4.15.0.0.2.","SINAPI",87250,"REVESTIMENTO CERÂMICO PARA PISO COM PLACAS TIPO ESMALTADA EXTRA DE DIMENSÕES 45X45 CM APLICADA EM AMBIENTES DE ÁREA ENTRE 5 M2 E 10 M2. AF_06/2014","M2",50.8,null,null,null,""]
["S",2,"S",0,4,15,0,0,0,{"$f":"IF(OR($C595=\"S\",$C595=0),0,MATCH(0,OFFSET($D595,1,$C595,ROW($C$690)-ROW($C595)),0))","v":0},{"$f":"IF(OR($C595=\"S\",$C595=0),0,MATCH(OFFSET($D595,0,$C595)+1,OFFSET($D595,1,$C595,ROW($C$690)-ROW($C595)),0))","v":0},"F","Serviço","Serviço","4.15.0.0.3.","SINAPI",94992,"EXECUÇÃO DE PASSEIO (CALÇADA) OU PISO DE CONCRETO COM CONCRETO MOLDADO IN LOCO, FEITO EM OBRA, ACABAMENTO CONVENCIONAL, ESPESSURA 6 CM, ARMADO. AF_07/2016","M2",17.7,null,null,null,"Referência: AGETOP - 220060"]
[2,2,2,3,4,16,0,0,0,12,3,"F","Nível 2","Nível 2","4.16.","AGETOP",null,"FERRAGENS","-",null,null,null,null,""]
["S",2,"S",0,4,16,0,0,0,0,0,"F","Serviço","Serviço","4.16.0.0.1.","AGETOP",230176,"BARRA DE APOIO EM AÇO INOX - 80 CM ","un    ",6,null,null,null,""]
["S",2,"S",0,4,16,0,0,0,0,0,"F","Serviço","Serviço","4.16.0.0.2.","AGETOP",230174,"BARRA DE APOIO EM AÇO INOX - 40 CM","un    ",6,null,null,null,""]
[2,2,2,5,4,17,0,0,0,9,5,"F","Nível 2","Nível 2","4.17.","AGETOP",null,"PINTURA","-",null,null,null,null,""]
["S",2,"S",0,4,17,0,0,0,0,0,"F","Serviço","Serviço","4.17.0.0.1.","AGETOP",260801,"PINTURA A BASE DE SILICONE 1 DEMAO","m2    ",74.616,null,null,null,""]
["S",2,"S",0,4,17,0,0,0,0,0,"F","Serviço","Serviço","4.17.0.0.2.","SINAPI",88497,"APLICAÇÃO E LIXAMENTO DE MASSA LÁTEX EM PAREDES, DUAS DEMÃOS. AF_06/2014","M2",54.575999999999965,null,null,null,"Referência: AGETOP - 261300"]
["S",2,"S",0,4,17,0,0,0,0,0,"F","Serviço","Serviço","4.17.0.0.3.","SINAPI",88489,"APLICAÇÃO MANUAL DE PINTURA COM TINTA LÁTEX ACRÍLICA EM PAREDES, DUAS DEMÃOS. AF_06/2014","M2",54.575999999999965,null,null,null,"Referência: AGETOP - 261000"]
["S",2,"S",0,4,17,0,0,0,0,0,"F","Serviço","Serviço","4.17.0.0.4.","SINAPI","74145/1","PINTURA ESMALTE FOSCO, DUAS DEMAOS, SOBRE SUPERFICIE METALICA, INCLUSO UMA DEMAO DE FUNDO ANTICORROSIVO. UTILIZACAO DE REVOLVER ( AR-COMPRIMIDO).","M2",40.6,null,null,null,"Referência: AGETOP - 261602"]
[2,2,2,4,4,18,0,0,0,4,{"$error":"#N/A"},"F","Nível 2","Nível 2","4.18.","AGETOP",null,"DIVERSOS","-",null,null,null,null,""]
["S",2,"S",0,4,18,0,0,0,0,0,"F","Serviço","Serviço","4.18.0.0.1.","AGETOP",271303,"BANCO DE CONCRETO POLIDO BASE EM ALVENARIA REBOCADA E PINTADA - PADRÃO AGETOP 2015","m     ",7.8,null,null,null,""]
["S",2,"S",0,4,18,0,0,0,0,0,"F","Serviço","Serviço","4.18.0.0.2.","COMPOSIÇÃO","COMP 541_SEE","BANCADA DE GRANITO CINZA POLIDO - FORNECIMENTO E INSTALAÇÃO. ","M2    ",0.41,null,null,null,""]
["S",2,"S",0,4,18,0,0,0,0,0,"F","Serviço","Serviço","4.18.0.0.3.","AGETOP",270501,"LIMPEZA FINAL DE OBRA - (OBRAS CIVIS)","m2    ",55.42,null,null,null,""]
[1,1,1,82,5,0,0,0,0,82,{"$error":"#N/A"},"F","Nível 1","Nível 1","5.","SINAPI",null,"QUADRA EM ARCO MODELO 01 SEDUC","-",null,null,null,null,""]
[2,2,2,2,5,1,0,0,0,81,2,"F","Nível 2","Nível 2","5.1.","SINAPI",null,"SERVIÇOS PRELIMINARES","-",null,null,null,null,""]
["S",2,"S",0,5,1,0,0,0,0,0,"F","Serviço","Serviço","5.1.0.0.1.","AGETOP",20701,"LOCAÇÃO DA OBRA, EXECUÇÃO DE GABARITO SEM REAPROVEITAMENTO, INCLUSO PINTURA (FACE INTERNA DO RIPÃO 15CM) E PIQUETE COM TESTEMUNHA","m2    ",337.2,null,null,null,"Referência: AGETOP - 20701"]
[2,2,2,3,5,2,0,0,0,79,3,"F","Nível 2","Nível 2","5.2.","AGETOP",null,"SERVIÇO EM TERRA","-",null,null,null,null,""]
["S",2,"S",0,5,2,0,0,0,0,0,"F","Serviço","Serviço","5.2.0.0.1.","AGETOP",41140,"REGULARIZAÇÃO DO TERRENO SEM APILOAMENTO COM TRANSPORTE MANUAL DA TERRA ESCAVADA ","m2    ",462.14,null,null,null,""]
["S",2,"S",0,5,2,0,0,0,0,0,"F","Serviço","Serviço","5.2.0.0.2.","AGETOP",41002,"APILOAMENTO","m2    ",462.14,null,null,null,""]
[2,2,2,12,5,3,0,0,0,76,12,"F","Nível 2","Nível 2","5.3.","AGETOP",null,"FUNDAÇÕES E SONDAGENS","-",null,null,null,null,""]
[3,3,3,11,5,3,1,0,0,11,60,"F","Nível 3","Nível 3","5.3.1.","SINAPI",null,"ESTACAS E BLOCOS","-",null,null,null,null,""]
["S",3,"S",0,5,3,1,0,0,0,0,"F","Serviço","Serviço","5.3.1.0.1.","SINAPI",98230,"ESTACA BROCA DE CONCRETO, DIÂMETRO DE 30 CM, PROFUNDIDADE DE ATÉ 3 M, ESCAVAÇÃO MANUAL COM TRADO CONCHA, NÃO ARMADA. AF_03/2018","M",90,null,null,null,"Referência: AGETOP - 50302"]
["S",3,"S",0,5,3,1,0,0,0,0,"F","Serviço","Serviço","5.3.1.0.2.","AGETOP",51009,"FORMA TABUA PINHO P/FUNDACOES U=3V - (OBRAS CIVIS)","m2    ",42,null,null,null,""]
["S",3,"S",0,5,3,1,0,0,0,0,"F","Serviço","Serviço","5.3.1.0.3.","SINAPI",96522,"ESCAVAÇÃO MANUAL PARA BLOCO DE COROAMENTO OU SAPATA, SEM PREVISÃO DE FÔRMA. AF_06/2017","M3",21.4,null,null,null,"Referência: AGETOP - 50901"]
["S",3,"S",0,5,3,1,0,0,0,0,"F","Serviço","Serviço","5.3.1.0.4.","AGETOP",50902,"APILOAMENTO (BLOCOS/SAPATAS)","m2    ",9.9,null,null,null,""]
["S",3,"S",0,5,3,1,0,0,0,0,"F","Serviço","Serviço","5.3.1.0.5.","SINAPI",96995,"REATERRO MANUAL APILOADO COM SOQUETE. AF_10/2017","M3",9.5299999999999994,null,null,null,"Referência: AGETOP - 50903"]
["S",3,"S",0,5,3,1,0,0,0,0,"F","Serviço","Serviço","5.3.1.0.6.","SINAPI",94964,"CONCRETO FCK = 20MPA, TRAÇO 1:2,7:3 (CIMENTO/ AREIA MÉDIA/ BRITA 1)  - PREPARO MECÂNICO COM BETONEIRA 400 L. AF_07/2016","M3",11.1,null,null,null,""]
["S",3,"S",0,5,3,1,0,0,0,0,"F","Serviço","Serviço","5.3.1.0.7.","SINAPI","74157/4","LANCAMENTO/APLICACAO MANUAL DE CONCRETO EM FUNDACOES","M3",11.1,null,null,null,"Referência: AGETOP - 51055"]
["S",3,"S",0,5,3,1,0,0,0,0,"F","Serviço","Serviço","5.3.1.0.8.","SINAPI",96544,"ARMAÇÃO DE BLOCO, VIGA BALDRAME OU SAPATA UTILIZANDO AÇO CA-50 DE 6,3 MM - MONTAGEM. AF_06/2017","KG",117.2,null,null,null,"Referência: AGETOP - 52003"]
["S",3,"S",0,5,3,1,0,0,0,0,"F","Serviço","Serviço","5.3.1.0.9.","SINAPI",96545,"ARMAÇÃO DE BLOCO, VIGA BALDRAME OU SAPATA UTILIZANDO AÇO CA-50 DE 8 MM - MONTAGEM. AF_06/2017","KG",218.3,null,null,null,"Referência: AGETOP - 52004"]
["S",3,"S",0,5,3,1,0,0,0,0,"F","Serviço","Serviço","5.3.1.0.10.","SINAPI",96543,"ARMAÇÃO DE BLOCO, VIGA BALDRAME E SAPATA UTILIZANDO AÇO CA-60 DE 5 MM - MONTAGEM. AF_06/2017","KG",83.3,null,null,null,"Referência: AGETOP - 52014"]
[2,2,2,10,5,4,0,0,0,64,10,"F","Nível 2","Nível 2","5.4.","AGETOP",null,"ESTRUTURA","-",null,null,null,null,""]
[3,3,3,9,5,4,1,0,0,9,48,"F","Nível 3","Nível 3","5.4.1.","AGETOP",null,"PILARES","-",null,null,null,null,""]
["S",3,"S",0,5,4,1,0,0,0,0,"F","Serviço","Serviço","5.4.1.0.1.","SINAPI",92426,"MONTAGEM E DESMONTAGEM DE FÔRMA DE PILARES RETANGULARES E ESTRUTURAS SIMILARES COM ÁREA MÉDIA DAS SEÇÕES MENOR OU IGUAL A 0,25 M², PÉ-DIREITO SIMPLES, EM CHAPA DE MADEIRA COMPENSADA RESINADA, 8 UTILIZAÇÕES. AF_12/2015","M2",114.96,null,null,null,""]
["S",3,"S",0,5,4,1,0,0,0,0,"F","Serviço","Serviço","5.4.1.0.2.","AGETOP",60207,"FORMA CH.COMPENSADA 12MM-VIGA/PILAR U=2V - (OBRAS CIVIS","m2    ",104.86,null,null,null,""]
["S",3,"S",0,5,4,1,0,0,0,0,"F","Serviço","Serviço","5.4.1.0.3.","SINAPI",94964,"CONCRETO FCK = 20MPA, TRAÇO 1:2,7:3 (CIMENTO/ AREIA MÉDIA/ BRITA 1)  - PREPARO MECÂNICO COM BETONEIRA 400 L. AF_07/2016","M3",13.51,null,null,null,""]
["S",3,"S",0,5,4,1,0,0,0,0,"F","Serviço","Serviço","5.4.1.0.4.","SINAPI",92873,"LANÇAMENTO COM USO DE BALDES, ADENSAMENTO E ACABAMENTO DE CONCRETO EM ESTRUTURAS. AF_12/2015","M3",13.51,null,null,null,"Referência: AGETOP - 51055"]
["S",3,"S",0,5,4,1,0,0,0,0,"F","Serviço","Serviço","5.4.1.0.5.","SINAPI",92776,"ARMAÇÃO DE PILAR OU VIGA DE UMA ESTRUTURA CONVENCIONAL DE CONCRETO ARMADO EM UMA EDIFICAÇÃO TÉRREA OU SOBRADO UTILIZANDO AÇO CA-50 DE 6,3 MM - MONTAGEM. AF_12/2015","KG",112.8,null,null,null,"Referência: AGETOP - 60303"]
["S",3,"S",0,5,4,1,0,0,0,0,"F","Serviço","Serviço","5.4.1.0.6.","SINAPI",92777,"ARMAÇÃO DE PILAR OU VIGA DE UMA ESTRUTURA CONVENCIONAL DE CONCRETO ARMADO EM UMA EDIFICAÇÃO TÉRREA OU SOBRADO UTILIZANDO AÇO CA-50 DE 8,0 MM - MONTAGEM. AF_12/2015","KG",193.2,null,null,null,"Referência: AGETOP - 60304"]
["S",3,"S",0,5,4,1,0,0,0,0,"F","Serviço","Serviço","5.4.1.0.7.","SINAPI",92778,"ARMAÇÃO DE PILAR OU VIGA DE UMA ESTRUTURA CONVENCIONAL DE CONCRETO ARMADO EM UMA EDIFICAÇÃO TÉRREA OU SOBRADO UTILIZANDO AÇO CA-50 DE 10,0 MM - MONTAGEM. AF_12/2015","KG",812.6,null,null,null,"Referência: AGETOP - 60305"]
["S",3,"S",0,5,4,1,0,0,0,0,"F","Serviço","Serviço","5.4.1.0.8.","SINAPI",92775,"ARMAÇÃO DE PILAR OU VIGA DE UMA ESTRUTURA CONVENCIONAL DE CONCRETO ARMADO EM UMA EDIFICAÇÃO TÉRREA OU SOBRADO UTILIZANDO AÇO CA-60 DE 5,0 MM - MONTAGEM. AF_12/2015","KG",280.8,null,null,null,"Referência: AGETOP - 60314"]
[2,2,2,23,5,5,0,0,0,54,23,"F","Nível 2","Nível 2","5.5.",null,null,"INSTALAÇÕES ELÉTRICAS","-",null,null,null,null,""]
["S",2,"S",0,5,5,0,0,0,0,0,"F","Serviço","Serviço","5.5.0.0.1.","AGETOP",70351,"BRACADEIRA METALICA TIPO \"U\" DIAM. 3/4\"","Un    ",50,null,null,null,""]
["S",2,"S",0,5,5,0,0,0,0,0,"F","Serviço","Serviço","5.5.0.0.2.","AGETOP",70714,"CAIXA DE PASSAGEM 50X50X80CM FUNDO DE BRITA SEM TAMPA","Un    ",1,null,null,null,""]
["S",2,"S",0,5,5,0,0,0,0,0,"F","Serviço","Serviço","5.5.0.0.3.","AGETOP",71190,"ELETROCALHA CH.Aº PRE ZN. FOGO \"C\" C/ABAS 50X50 MM S/TAMPA","M     ",25,null,null,null,""]
["S",2,"S",0,5,5,0,0,0,0,0,"F","Serviço","Serviço","5.5.0.0.4.","AGETOP",71291,"FIO ISOLADO PVC 750 V, No. 2,5 MM2","M     ",300,null,null,null,""]
["S",2,"S",0,5,5,0,0,0,0,0,"F","Serviço","Serviço","5.5.0.0.5.","AGETOP",71522,"LAMPADA A VAPOR MERCURIO 400 W","Un    ",8,null,null,null,""]
["S",2,"S",0,5,5,0,0,0,0,0,"F","Serviço","Serviço","5.5.0.0.6.","AGETOP",70421,"BUCHA E ARRUELA METALICA DIAM. 3/4\"","PR    ",12,null,null,null,""]
["S",2,"S",0,5,5,0,0,0,0,0,"F","Serviço","Serviço","5.5.0.0.7.","AGETOP",70422,"BUCHA E ARRUELA METALICA DIAM. 1\"","PR    ",1,null,null,null,""]
["S",2,"S",0,5,5,0,0,0,0,0,"F","Serviço","Serviço","5.5.0.0.8.","AGETOP",72190,"QUADRO DE DISTRIBUIÇÃO DE EMBUTIR METÁLICO CB-24E - 150A","Un    ",1,null,null,null,""]
["S",2,"S",0,5,5,0,0,0,0,0,"F","Serviço","Serviço","5.5.0.0.9.","AGETOP",72250,"REATOR EXTERNO V. MERCÚRIO  AFP 1 X 400 W","Un    ",8,null,null,null,""]
["S",2,"S",0,5,5,0,0,0,0,0,"F","Serviço","Serviço","5.5.0.0.10.","AGETOP",70927,"CONDULETE DE PVC - TAMPÃO DE 3/4\"  ","un    ",8,null,null,null,""]
["S",2,"S",0,5,5,0,0,0,0,0,"F","Serviço","Serviço","5.5.0.0.11.","SINAPI",91929,"CABO DE COBRE FLEXÍVEL ISOLADO, 4 MM², ANTI-CHAMA 0,6/1,0 KV, PARA CIRCUITOS TERMINAIS - FORNECIMENTO E INSTALAÇÃO. AF_12/2015","M",80,null,null,null,"Referência: AGETOP - 70582"]
["S",2,"S",0,5,5,0,0,0,0,0,"F","Serviço","Serviço","5.5.0.0.12.","SINAPI",92868,"CAIXA RETANGULAR 4\" X 2\" MÉDIA (1,30 M DO PISO), METÁLICA, INSTALADA EM PAREDE - FORNECIMENTO E INSTALAÇÃO. AF_12/2015","UN",4,null,null,null,"Referência: AGETOP - 70691"]
["S",2,"S",0,5,5,0,0,0,0,0,"F","Serviço","Serviço","5.5.0.0.13.","SINAPI",91902,"CURVA 90 GRAUS PARA ELETRODUTO, PVC, ROSCÁVEL, DN 25 MM (3/4\"), PARA CIRCUITOS TERMINAIS, INSTALADA EM LAJE - FORNECIMENTO E INSTALAÇÃO. AF_12/2015","UN",4,null,null,null,"Referência: AGETOP - 71141"]
["S",2,"S",0,5,5,0,0,0,0,0,"F","Serviço","Serviço","5.5.0.0.14.","SINAPI",91905,"CURVA 90 GRAUS PARA ELETRODUTO, PVC, ROSCÁVEL, DN 32 MM (1\"), PARA CIRCUITOS TERMINAIS, INSTALADA EM LAJE - FORNECIMENTO E INSTALAÇÃO. AF_12/2015","UN",1,null,null,null,"Referência: AGETOP - 71142"]
["S",2,"S",0,5,5,0,0,0,0,0,"F","Serviço","Serviço","5.5.0.0.15.","SINAPI",93653,"DISJUNTOR MONOPOLAR TIPO DIN, CORRENTE NOMINAL DE 10A - FORNECIMENTO E INSTALAÇÃO. AF_04/2016","UN",3,null,null,null,""]
["S",2,"S",0,5,5,0,0,0,0,0,"F","Serviço","Serviço","5.5.0.0.16.","SINAPI",93671,"DISJUNTOR TRIPOLAR TIPO DIN, CORRENTE NOMINAL DE 32A - FORNECIMENTO E INSTALAÇÃO. AF_04/2016","UN",1,null,null,null,"Referência: AGETOP - 71173"]
["S",2,"S",0,5,5,0,0,0,0,0,"F","Serviço","Serviço","5.5.0.0.17.","SINAPI",91844,"ELETRODUTO FLEXÍVEL CORRUGADO, PVC, DN 25 MM (3/4\"), PARA CIRCUITOS TERMINAIS, INSTALADO EM LAJE - FORNECIMENTO E INSTALAÇÃO. AF_12/2015","M",100,null,null,null,""]
["S",2,"S",0,5,5,0,0,0,0,0,"F","Serviço","Serviço","5.5.0.0.18.","SINAPI",91872,"ELETRODUTO RÍGIDO ROSCÁVEL, PVC, DN 32 MM (1\"), PARA CIRCUITOS TERMINAIS, INSTALADO EM PAREDE - FORNECIMENTO E INSTALAÇÃO. AF_12/2015","M",15,null,null,null,"Referência: AGETOP - 71202"]
["S",{"$f":"IF(OR(C655=\"s\",C655=0),OFFSET(B655,-1,0),C655)","v":2},{"$f":"IF(OFFSET(C655,-1,0)=\"L\",1,IF(OFFSET(C655,-1,0)=1,2,IF(OR(A655=\"s\",A655=0),\"S\",IF(AND(OFFSET(C655,-1,0)=2,A655=4),3,IF(AND(OR(OFFSET(C655,-1,0)=\"s\",OFFSET(C655,-1,0)=0),A655<>\"s\",A655>OFFSET(B655,-1,0)),OFFSET(B655,-1,0),A655)))))","v":"S"},{"$f":"IF(OR(C655=\"S\",C655=0),0,IF(ISERROR(K655),J655,SMALL(J655:K655,1)))","v":0},{"$f":"IF($C655=1,OFFSET(E655,-1,0)+1,OFFSET(E655,-1,0))","v":5},{"$f":"IF($C655=1,0,IF($C655=2,OFFSET(F655,-1,0)+1,OFFSET(F655,-1,0)))","v":5},{"$f":"IF(AND($C655<=2,$C655<>0),0,IF($C655=3,OFFSET(G655,-1,0)+1,OFFSET(G655,-1,0)))","v":0},{"$f":"IF(AND($C655<=3,$C655<>0),0,IF($C655=4,OFFSET(H655,-1,0)+1,OFFSET(H655,-1,0)))","v":0},{"$f":"IF(AND($C655<=4,$C655<>0),0,IF(AND($C655=\"S\",$W655>0),OFFSET(I655,-1,0)+1,OFFSET(I655,-1,0)))","v":0},0,0,"F","Serviço","Serviço","5.5.0.0.19.","AGETOP",71321,"FITA DE AUTO FUSAO, ROLO E 10,00 MM","Un    ",1,null,null,null,"Referência: AGETOP - 71321"]
["S",2,"S",0,5,5,0,0,0,0,0,"F","Serviço","Serviço","5.5.0.0.20.","AGETOP",71450,"INTERRUPTOR DIFERENCIAL RESIDUAL (D.R.) BIPOLAR DE 25A-30mA","Un    ",4,null,null,null,"Referência: AGETOP - 71450"]
["S",2,"S",0,5,5,0,0,0,0,0,"F","Serviço","Serviço","5.5.0.0.21.","SINAPI",91885,"LUVA PARA ELETRODUTO, PVC, ROSCÁVEL, DN 32 MM (1\"), PARA CIRCUITOS TERMINAIS, INSTALADA EM PAREDE - FORNECIMENTO E INSTALAÇÃO. AF_12/2015","UN",5,null,null,null,"Referência: AGETOP - 71742"]
["S",2,"S",0,5,5,0,0,0,0,0,"F","Serviço","Serviço","5.5.0.0.22.","SINAPI",91996,"TOMADA MÉDIA DE EMBUTIR (1 MÓDULO), 2P+T 10 A, INCLUINDO SUPORTE E PLACA - FORNECIMENTO E INSTALAÇÃO. AF_12/2015","UN",4,null,null,null,"Referência: AGETOP - 72578"]
[2,2,2,4,5,6,0,0,0,{"$f":"IF(OR($C659=\"S\",$C659=0),0,MATCH(0,OFFSET($D659,1,$C659,ROW($C$690)-ROW($C659)),0))","v":31},{"$f":"IF(OR($C659=\"S\",$C659=0),0,MATCH(OFFSET($D659,0,$C659)+1,OFFSET($D659,1,$C659,ROW($C$690)-ROW($C659)),0))","v":4},"F","Nível 2","Nível 2","5.6.",null,null,"ALVENARIAS E DIVISÓRIAS","-",null,null,null,null,""]
["S",2,"S",0,5,6,0,0,0,0,0,"F","Serviço","Serviço","5.6.0.0.1.","SINAPI",72132,"ALVENARIA EM TIJOLO CERAMICO MACICO 5X10X20CM 1/2 VEZ (ESPESSURA 10CM), ASSENTADO COM ARGAMASSA TRACO 1:2:8 (CIMENTO, CAL E AREIA)","M2",23.6,null,null,null,""]
["S",2,"S",0,5,6,0,0,0,0,0,"F","Serviço","Serviço","5.6.0.0.2.","SINAPI",87520,"ALVENARIA DE VEDAÇÃO DE BLOCOS CERÂMICOS FURADOS NA HORIZONTAL DE 9X19X19CM (ESPESSURA 9CM) DE PAREDES COM ÁREA LÍQUIDA MAIOR OU IGUAL A 6M² COM VÃOS E ARGAMASSA DE ASSENTAMENTO COM PREPARO MANUAL. AF_06/2014","M2",63.5,null,null,null,""]
["S",2,"S",0,5,6,0,0,0,0,0,"F","Serviço","Serviço","5.6.0.0.3.","AGETOP",100501,"ELEMENTO VAZADO DE CONCRETO","m2    ",4,null,null,null,""]
[2,2,2,2,5,7,0,0,0,27,2,"F","Nível 2","Nível 2","5.7.",null,null,"IMPERMEABILIZACAO","-",null,null,null,null,""]
["S",2,"S",0,5,7,0,0,0,0,0,"F","Serviço","Serviço","5.7.0.0.1.","SINAPI",98562,"IMPERMEABILIZAÇÃO DE FLOREIRA OU VIGA BALDRAME COM ARGAMASSA DE CIMENTO E AREIA, COM ADITIVO IMPERMEABILIZANTE, E = 2 CM. AF_06/2018","M2",43,null,null,null,"Referência: AGETOP - 120902"]
[2,2,2,2,5,8,0,0,0,25,2,"F","Nível 2","Nível 2","5.8.",null,null,"ESTRUTURAS METÁLICAS","-",null,null,null,null,""]
["S",2,"S",0,5,8,0,0,0,0,0,"F","Serviço","Serviço","5.8.0.0.1.","AGETOP",150103,"ESTRUTURA METÁLICA CONVENCIONAL EM AÇO DO TIPO USI SAC-300 COM FUNDO ANTICORROSIVO","Kg    ",4421.76,null,null,null,""]
[2,2,2,2,5,9,0,0,0,23,2,"F","Nível 2","Nível 2","5.9.",null,null,"COBERTURAS","-",null,null,null,null,""]
["S",2,"S",0,5,9,0,0,0,0,0,"F","Serviço","Serviço","5.9.0.0.1.","AGETOP",160969,"COBERTURA COM TELHA CHAPA GALVANIZADA TRAPEZOIDAL 0,43 MM COM ACESSÓRIOS","m2    ",478.51,null,null,null,""]
[2,2,2,3,5,10,0,0,0,21,3,"F","Nível 2","Nível 2","5.10.",null,null,"REVESTIMENTO DE PAREDE","-",null,null,null,null,""]
["S",2,"S",0,5,10,0,0,0,0,0,"F","Serviço","Serviço","5.10.0.0.1.","SINAPI",87904,"CHAPISCO APLICADO EM ALVENARIA (COM PRESENÇA DE VÃOS) E ESTRUTURAS DE CONCRETO DE FACHADA, COM COLHER DE PEDREIRO.  ARGAMASSA TRAÇO 1:3 COM PREPARO MANUAL. AF_06/2014","M2",174.2,null,null,null,"Referência: AGETOP - 200101"]
["S",2,"S",0,5,10,0,0,0,0,0,"F","Serviço","Serviço","5.10.0.0.2.","SINAPI",87547,"MASSA ÚNICA, PARA RECEBIMENTO DE PINTURA, EM ARGAMASSA TRAÇO 1:2:8, PREPARO MECÂNICO COM BETONEIRA 400L, APLICADA MANUALMENTE EM FACES INTERNAS DE PAREDES, ESPESSURA DE 10MM, COM EXECUÇÃO DE TALISCAS. AF_06/2014","M2",174.2,null,null,null,""]
[2,2,2,7,5,11,0,0,0,18,7,"F","Nível 2","Nível 2","5.11.",null,null,"REVESTIMENTO DE PISO","-",null,null,null,null,""]
[3,3,3,2,5,11,1,0,0,6,2,"F","Nível 3","Nível 3","5.11.1.",null,null,"CONCRETO","-",null,null,null,null,""]
["S",3,"S",0,5,11,1,0,0,0,0,"F","Serviço","Serviço","5.11.1.0.1.","SINAPI",94992,"EXECUÇÃO DE PASSEIO (CALÇADA) OU PISO DE CONCRETO COM CONCRETO MOLDADO IN LOCO, FEITO EM OBRA, ACABAMENTO CONVENCIONAL, ESPESSURA 6 CM, ARMADO. AF_07/2016","M2",19.440000000000001,null,null,null,"Referência: AGETOP - 220104"]
[3,3,3,2,5,11,2,0,0,4,2,"F","Nível 3","Nível 3","5.11.2.",null,null,"LAMINADO","-",null,null,null,null,""]
["S",3,"S",0,5,11,2,0,0,0,0,"F","Serviço","Serviço","5.11.2.0.1.","AGETOP",220061,"PISO LAMINADO COM CONCRETO USINADO 20MPA E=7 CM  ","m2    ",67.34,null,null,null,""]
[3,3,3,2,5,11,3,0,0,2,{"$error":"#N/A"},"F","Nível 3","Nível 3","5.11.3.",null,null,"PASSEIO (CALÇADA)","-",null,null,null,null,""]
["S",3,"S",0,5,11,3,0,0,0,0,"F","Serviço","Serviço","5.11.3.0.1.","AGETOP",220100,"PASSEIO PROTECAO EM CONC.DESEMPEN.5 CM 1:2,5:3,5 ( INCLUSO ESPELHO DE 30CM/ESCAVAÇÃO/REATERRO/APILOAMENTO/ATERRO INTERNO)","m2    ",67.34,null,null,null,""]
[2,2,2,7,5,12,0,0,0,11,7,"F","Nível 2","Nível 2","5.12.",null,null,"PINTURA","-",null,null,null,null,""]
[3,3,3,2,5,12,1,0,0,6,2,"F","Nível 3","Nível 3","5.12.1.",null,null,"ESMALTE SINTÉTICO","-",null,null,null,null,""]
["S",3,"S",0,5,12,1,0,0,0,0,"F","Serviço","Serviço","5.12.1.0.1.","AGETOP",261550,"PINT.ESMALTE SINT.PAREDES - 2 DEM.C/SELADOR","m2    ",219.1,null,null,null,""]
[3,3,3,2,5,12,2,0,0,4,2,"F","Nível 3","Nível 3","5.12.2.","AGETOP",null,"LÁTEX ACRÍLICA","-",null,null,null,null,""]
["S",3,"S",0,5,12,2,0,0,0,0,"F","Serviço","Serviço","5.12.2.0.1.","SINAPI",88489,"APLICAÇÃO MANUAL DE PINTURA COM TINTA LÁTEX ACRÍLICA EM PAREDES, DUAS DEMÃOS. AF_06/2014","M2",174.2,null,null,null,"Referência: AGETOP - 261001"]
[3,3,3,2,5,12,3,0,0,2,{"$error":"#N/A"},"F","Nível 3","Nível 3","5.12.3.","AGETOP",null,"QUADRA DE ESPORTES","-",null,null,null,null,""]
["S",3,"S",0,5,12,3,0,0,0,0,"F","Serviço","Serviço","5.12.3.0.1.","SINAPI",41595,"PINTURA ACRILICA DE FAIXAS DE DEMARCACAO EM QUADRA POLIESPORTIVA, 5 CM DE LARGURA","M",72,null,null,null,"Referência: AGETOP - 261700"]
[2,2,2,4,5,13,0,0,0,4,{"$error":"#N/A"},"F","Nível 2","Nível 2","5.13.",null,null,"DIVERSOS","-",null,null,null,null,""]
["S",2,"S",0,5,13,0,0,0,0,0,"F","Serviço","Serviço","5.13.0.0.1.","AGETOP",270501,"LIMPEZA FINAL DE OBRA - (OBRAS CIVIS)","m2    ",337.2,null,null,null,""]
["S",2,"S",0,5,13,0,0,0,0,0,"F","Serviço","Serviço","5.13.0.0.2.","SINAPI","74244/1","ALAMBRADO PARA QUADRA POLIESPORTIVA, ESTRUTURADO POR TUBOS DE ACO GALVANIZADO, COM COSTURA, DIN 2440, DIAMETRO 2\", COM TELA DE ARAME GALVANIZADO, FIO 14 BWG E MALHA QUADRADA 5X5CM","M2",109.6,null,null,null,"Referência: AGETOP - 270621"]
["S",2,"S",0,5,13,0,0,0,0,0,"F","Serviço","Serviço","5.13.0.0.3.","AGETOP",271103,"CONJUNTO PARA VOLEIBOL EM FERRO GALVANIZADO COM PINTURA (2 SUPORTES)","CJ    ",1,null,null,null,""]
[-1,null,-1,null,0,0,0,0,0,null,null,"F"]
[null,null,null,null,null,null,null,null,null,null,null,"F",null,null,null,null,null,"OBS: OS QUANTITATIVOS DE MATERIAIS  DAS INSTALAÇÕES HIDROSSANITÁRIAS, ELÉTRICAS E ESPECIAIS SÃO FORNECIDOS PELOS PROFISSIONAIS RESPONSÁVEIS PELOS RESPECTIVOS PROJETOS.",null,null,"VALOR TOTAL"]
[null,null,null,null,null,null,null,null,null,null,null,"F",null,null,null,null,null,null,null,null,"VALOR BDI (30,44%)"]
[null,null,null,null,null,null,null,null,null,null,null,"F",null,null,null,null,null,null,null,null,"TOTAL ORÇAMENTO"]
[null,null,null,null,null,null,null,null,null,null,null,"F"]
[null,null,null,null,null,null,null,null,null,null,null,"F",null,null,null,null,null,null,null,null,"CUSTO POR M2 ³"]
[null,null,null,null,null,null,null,null,null,null,null,"F",null,null,null,null,null,null,null,null,"MATERIAL S/ BDI"]
[null,null,null,null,null,null,null,null,null,null,null,"F",null,null,null,null,null,null,null,null,"MÃO DE OBRA S/ BDI"]
[null,null,null,null,null,null,null,null,null,null,null,"F"]
[null,null,null,null,null,null,null,null,null,null,null,"F",null,null,null,null,"(1) Conforme previsto pelo DECRETO Nº 7.983, DE 8 DE ABRIL DE 2013, os preços adotados são aqueles constantes dos sistemas de referência indicados. Justifica-se o uso dos preços destas composições de custos unitários devido ao seu valor ser menor à mediana de seus correspondentes na tabela SINAPI;"]
[null,null,null,null,null,null,null,null,null,null,null,"F",null,null,null,null,"(2) Optou-se pelo uso das composições de custos da AGETOP para itens não presentes na SINAPI;"]
[null,null,null,null,null,null,null,null,null,null,null,"F",null,null,null,null,"(3) Para itens da AGETOP, os vidros não estão inclusos nas esquadrias e já foram considerados os custos de contramarco para as esquadrias de alumínio;"]
[null,null,null,null,null,null,null,null,null,null,null,"F",null,null,null,null,"(4) Nos casos em que houver execução de granitina, considerou-se que o quantitativo para o rodapé, de altura igual a 7cm, foi incorporado na área de piso;"]
[null,null,null,null,null,null,null,null,null,null,null,"F",null,null,null,null,"(5) O custo unitário aproximado por metro quadrado é calculado dividindo-se o valor total do orçamento pela área total de construção."]
[null,null,null,null,null,null,null,null,null,null,null,"F"]
[null,null,null,null,null,null,null,null,null,null,null,"F"]
[]
[null,null,null,null,null,null,null,null,null,null,null,null,null,null,"SOMATÓRIO DE SERVIÇOS"]
[null,null,null,null,null,null,null,null,null,null,null,null,null,null,"ITEM","DESCRIÇÃO DOS SERVIÇOS",null,null,"PREÇO SEM BDI",null,null,"PREÇO COM BDI",null,"PARTICIPAÇÃO ( % )"]
[null,null,null,null,null,null,null,null,null,null,null,null,null,null,"a.","SERVIÇOS PRELIMINARES",null,null,{"$f":"SUMIF($R$19:$R$690,$P709,$W$19:$W$690)","v":0},null,null,{"$f":"ROUND(S709*(1+BDI.Taxa),2)","v":0},null,{"$f":"IFERROR(ROUND($V709*100/$W$693,2),0)","v":0}]
[null,null,null,null,null,null,null,null,null,null,null,null,null,null,"b.","TRANSPORTES",null,null,0,null,null,0,null,{"$f":"IFERROR(ROUND($V710*100/$W$693,2),0)","v":0}]
[null,null,null,null,null,null,null,null,null,null,null,null,null,null,"c.","SERVIÇO EM TERRA",null,null,0,null,null,0,null,0]
[null,null,null,null,null,null,null,null,null,null,null,null,null,null,"d.","FUNDAÇÕES E SONDAGENS",null,null,0,null,null,0,null,0]
[null,null,null,null,null,null,null,null,null,null,null,null,null,null,"e.","ESTRUTURA",null,null,0,null,null,0,null,0]
[null,null,null,null,null,null,null,null,null,null,null,null,null,null,"f.","INSTALAÇÕES ELÉTRICAS",null,null,0,null,null,0,null,0]
[null,null,null,null,null,null,null,null,null,null,null,null,null,null,"g.","INSTALAÇÕES HIDROSSANITÁRIAS",null,null,0,null,null,0,null,0]
[null,null,null,null,null,null,null,null,null,null,null,null,null,null,"h","INSTALAÇÕES ESPECIAIS",null,null,0,null,null,0,null,0]
[null,null,null,null,null,null,null,null,null,null,null,null,null,null,"i.","ALVENARIAS E DIVISÓRIAS",null,null,0,null,null,0,null,0]
[null,null,null,null,null,null,null,null,null,null,null,null,null,null,"j.","ALVENARIA AUTO-PORTANTE",null,null,0,null,null,0,null,0]
[null,null,null,null,null,null,null,null,null,null,null,null,null,null,"k.","IMPERMEABILIZACAO",null,null,0,null,null,0,null,0]
[null,null,null,null,null,null,null,null,null,null,null,null,null,null,"l.","ISOLAMENTO TÉRMICO E ACÚSTICO",null,null,0,null,null,0,null,0]
[null,null,null,null,null,null,null,null,null,null,null,null,null,null,"m.","ESTRUTURA DE MADEIRA",null,null,0,null,null,0,null,0]
[null,null,null,null,null,null,null,null,null,null,null,null,null,null,"n.","ESTRUTURAS METÁLICAS",null,null,0,null,null,0,null,0]
[null,null,null,null,null,null,null,null,null,null,null,null,null,null,"o.","COBERTURAS",null,null,0,null,null,0,null,0]
[null,null,null,null,null,null,null,null,null,null,null,null,null,null,"p.","ESQUADRIAS DE MADEIRA",null,null,0,null,null,0,null,0]
[null,null,null,null,null,null,null,null,null,null,null,null,null,null,"q.","ESQUADRIAS METÁLICAS",null,null,0,null,null,{"$f":"ROUND(S725*(1+BDI.Taxa),2)","v":0},null,0]
[null,null,null,null,null,null,null,null,null,null,null,null,null,null,"r.","VIDROS",null,null,0,null,null,0,null,0]
[null,null,null,null,null,null,null,null,null,null,null,null,null,null,"s.","REVESTIMENTO DE PAREDE",null,null,0,null,null,0,null,0]
[null,null,null,null,null,null,null,null,null,null,null,null,null,null,"t.","FORROS",null,null,0,null,null,0,null,0]
[null,null,null,null,null,null,null,null,null,null,null,null,null,null,"u.","REVESTIMENTO DE PISO",null,null,0,null,null,0,null,0]
[null,null,null,null,null,null,null,null,null,null,null,null,null,null,"v.","FERRAGENS",null,null,0,null,null,0,null,0]
[null,null,null,null,null,null,null,null,null,null,null,null,null,null,"w.","MARCENARIA",null,null,0,null,null,0,null,0]
[null,null,null,null,null,null,null,null,null,null,null,null,null,null,"x.","ADMINISTRAÇÃO",null,null,0,null,null,0,null,0]
[null,null,null,null,null,null,null,null,null,null,null,null,null,null,"y.","PINTURA",null,null,0,null,null,{"$f":"ROUND(S733*(1+BDI.Taxa),2)","v":0},null,0]
[null,null,null,null,null,null,null,null,null,null,null,null,null,null,"z.","DIVERSOS",null,null,0,null,null,{"$f":"IF(S734>0,IF((SUM(V709:W733)+ROUND(S734*(1+BDI.Taxa),2))<>V736,V736-SUM(V709:W733),ROUND(S734*(1+BDI.Taxa),2)),0)","v":0},null,{"$f":"IF(S734>0,IF((SUM(X709:X733)+IFERROR(ROUND($V734*100/$W$693,2),0))<>X736,X736-SUM(X709:X733),IFERROR(ROUND($V734*100/$W$693,2),0)),0)","v":0}]
[null,null,null,null,null,null,null,null,null,null,null,null,null,null,"TOTAL GERAL DO ORÇAMENTO (R$)",null,null,null,{"$f":"SUM(S709:U734)","v":0},null,null,{"$f":"SUM(V709:W734)","v":0},null,{"$f":"SUM(X709:X734)","v":0}]
[null,null,null,null,null,null,null,null,null,null,null,null,null,null,null,null,null,null,{"$f":"$W$691","v":0},null,null,{"$f":"$W$693","v":0},null,100]
[null,null,null,null,null,null,null,null,null,null,null,null,null,null,null,null,null,null,"(TOTAL SEM BDI)",null,null,"(TOTAL COM BDI)",null,"(ARRED porcentagem)"]
[null,null,null,null,null,null,null,null,null,null,null,null,null,null,null,null,null,null,{"$f":"IF(AND(S735=S736,S735>0),\"OK\",\"ERRO\")","v":"ERRO"},null,null,{"$f":"IF(AND(V735=V736,V735>0),\"OK\",\"ERRO\")","v":"ERRO"},null,{"$f":"IF(X735=100,\"OK\",\"ERRO\")","v":"ERRO"}]
[]
[]
[null,null,null,null,null,null,null,null,null,null,null,null,null,null,"RESUMO GERAL DO ORÇAMENTO"]
[null,null,null,null,null,null,null,null,null,null,null,null,null,null,"ITEM","DESCRIÇÃO DOS SERVIÇOS",null,null,"PREÇO SEM BDI",null,null,"PREÇO COM BDI",null,"PARTICIPAÇÃO ( % )"]
[null,null,null,null,null,null,null,null,null,null,null,null,null,null,"1.",{"$f":"IFERROR(VLOOKUP(O743,$O$19:$W$690,4,FALSE),\"\")","v":"REFORMA"},null,null,{"$f":"IF(P744=\"\",$S$764-SUM(OFFSET($S$742:S742,0,0,COUNTA($S$742:S742),1)),SUMIF($R$19:$R$690,$P743,$W$19:$W$690))","v":0},null,null,{"$f":"IF(P744=\"\",$V$764-SUM(OFFSET($V$742:V742,0,0,COUNTA($V$742:V742),1)),ROUND(S743*(1+BDI.Taxa),2))","v":0},null,{"$f":"IF(P744=\"\",$X$764-SUM(OFFSET($X$742:X742,0,0,COUNTA($X$742:X742),1)),ROUND(V743*100/ORÇAMENTO.TotalOrçamento,2))","v":{"$error":"#DIV/0!"}}]
[null,null,null,null,null,null,null,null,null,null,null,null,null,null,"2.","IMPLANTAÇÃO",null,null,{"$f":"IF(P745=\"\",$S$764-SUM(OFFSET($S$742:S743,0,0,COUNTA($S$742:S743),1)),SUMIF($R$19:$R$690,$P744,$W$19:$W$690))","v":0},null,null,{"$f":"IF(P745=\"\",$V$764-SUM(OFFSET($V$742:V743,0,0,COUNTA($V$742:V743),1)),ROUND(S744*(1+BDI.Taxa),2))","v":0},null,{"$f":"IFERROR(ROUND($V744*100/$W$693,2),0)","v":0}]
[null,null,null,null,null,null,null,null,null,null,null,null,null,null,"3.","COZINHA COM REFEITÓRIO PADRÃO SEDUC",null,null,{"$f":"IF(P746=\"\",$S$764-SUM(OFFSET($S$742:S744,0,0,COUNTA($S$742:S744),1)),SUMIF($R$19:$R$690,$P745,$W$19:$W$690))","v":0},null,null,{"$f":"IF(P746=\"\",$V$764-SUM(OFFSET($V$742:V744,0,0,COUNTA($V$742:V744),1)),ROUND(S745*(1+BDI.Taxa),2))","v":0},null,0]
[null,null,null,null,null,null,null,null,null,null,null,null,null,null,"4.","VESTIÁRIO PADRÃO SÉCULO XX1",null,null,{"$f":"IF(P747=\"\",$S$764-SUM(OFFSET($S$742:S745,0,0,COUNTA($S$742:S745),1)),SUMIF($R$19:$R$690,$P746,$W$19:$W$690))","v":0},null,null,{"$f":"IF(P747=\"\",$V$764-SUM(OFFSET($V$742:V745,0,0,COUNTA($V$742:V745),1)),ROUND(S746*(1+BDI.Taxa),2))","v":0},null,0]
[null,null,null,null,null,null,null,null,null,null,null,null,null,null,"5.","QUADRA EM ARCO MODELO 01 SEDUC",null,null,{"$f":"IF(P748=\"\",$S$764-SUM(OFFSET($S$742:S746,0,0,COUNTA($S$742:S746),1)),SUMIF($R$19:$R$690,$P747,$W$19:$W$690))","v":0},null,null,{"$f":"IF(P748=\"\",$V$764-SUM(OFFSET($V$742:V746,0,0,COUNTA($V$742:V746),1)),ROUND(S747*(1+BDI.Taxa),2))","v":0},null,0]
[null,null,null,null,null,null,null,null,null,null,null,null,null,null,"6.","",null,null,{"$f":"IF(P749=\"\",$S$764-SUM(OFFSET($S$742:S747,0,0,COUNTA($S$742:S747),1)),SUMIF($R$19:$R$690,$P748,$W$19:$W$690))","v":0},null,null,{"$f":"IF(P749=\"\",$V$764-SUM(OFFSET($V$742:V747,0,0,COUNTA($V$742:V747),1)),ROUND(S748*(1+BDI.Taxa),2))","v":0},null,0]
[null,null,null,null,null,null,null,null,null,null,null,null,null,null,"7.","",null,null,{"$f":"IF(P750=\"\",$S$764-SUM(OFFSET($S$742:S748,0,0,COUNTA($S$742:S748),1)),SUMIF($R$19:$R$690,$P749,$W$19:$W$690))","v":0},null,null,{"$f":"IF(P750=\"\",$V$764-SUM(OFFSET($V$742:V748,0,0,COUNTA($V$742:V748),1)),ROUND(S749*(1+BDI.Taxa),2))","v":0},null,0]
[null,null,null,null,null,null,null,null,null,null,null,null,null,null,"8.","",null,null,{"$f":"IF(P751=\"\",$S$764-SUM(OFFSET($S$742:S749,0,0,COUNTA($S$742:S749),1)),SUMIF($R$19:$R$690,$P750,$W$19:$W$690))","v":0},null,null,{"$f":"IF(P751=\"\",$V$764-SUM(OFFSET($V$742:V749,0,0,COUNTA($V$742:V749),1)),ROUND(S750*(1+BDI.Taxa),2))","v":0},null,0]
[null,null,null,null,null,null,null,null,null,null,null,null,null,null,"9.","",null,null,{"$f":"IF(P752=\"\",$S$764-SUM(OFFSET($S$742:S750,0,0,COUNTA($S$742:S750),1)),SUMIF($R$19:$R$690,$P751,$W$19:$W$690))","v":0},null,null,{"$f":"IF(P752=\"\",$V$764-SUM(OFFSET($V$742:V750,0,0,COUNTA($V$742:V750),1)),ROUND(S751*(1+BDI.Taxa),2))","v":0},null,0]
[null,null,null,null,null,null,null,null,null,null,null,null,null,null,"10.","",null,null,{"$f":"IF(P753=\"\",$S$764-SUM(OFFSET($S$742:S751,0,0,COUNTA($S$742:S751),1)),SUMIF($R$19:$R$690,$P752,$W$19:$W$690))","v":0},null,null,{"$f":"IF(P753=\"\",$V$764-SUM(OFFSET($V$742:V751,0,0,COUNTA($V$742:V751),1)),ROUND(S752*(1+BDI.Taxa),2))","v":0},null,0]
[null,null,null,null,null,null,null,null,null,null,null,null,null,null,"11.","",null,null,{"$f":"IF(P754=\"\",$S$764-SUM(OFFSET($S$742:S752,0,0,COUNTA($S$742:S752),1)),SUMIF($R$19:$R$690,$P753,$W$19:$W$690))","v":0},null,null,{"$f":"IF(P754=\"\",$V$764-SUM(OFFSET($V$742:V752,0,0,COUNTA($V$742:V752),1)),ROUND(S753*(1+BDI.Taxa),2))","v":0},null,0]
[null,null,null,null,null,null,null,null,null,null,null,null,null,null,"12.","",null,null,{"$f":"IF(P755=\"\",$S$764-SUM(OFFSET($S$742:S753,0,0,COUNTA($S$742:S753),1)),SUMIF($R$19:$R$690,$P754,$W$19:$W$690))","v":0},null,null,{"$f":"IF(P755=\"\",$V$764-SUM(OFFSET($V$742:V753,0,0,COUNTA($V$742:V753),1)),ROUND(S754*(1+BDI.Taxa),2))","v":0},null,0]
[null,null,null,null,null,null,null,null,null,null,null,null,null,null,"13.","",null,null,{"$f":"IF(P756=\"\",$S$764-SUM(OFFSET($S$742:S754,0,0,COUNTA($S$742:S754),1)),SUMIF($R$19:$R$690,$P755,$W$19:$W$690))","v":0},null,null,{"$f":"IF(P756=\"\",$V$764-SUM(OFFSET($V$742:V754,0,0,COUNTA($V$742:V754),1)),ROUND(S755*(1+BDI.Taxa),2))","v":0},null,0]
[null,null,null,null,null,null,null,null,null,null,null,null,null,null,"14.","",null,null,{"$f":"IF(P757=\"\",$S$764-SUM(OFFSET($S$742:S755,0,0,COUNTA($S$742:S755),1)),SUMIF($R$19:$R$690,$P756,$W$19:$W$690))","v":0},null,null,{"$f":"IF(P757=\"\",$V$764-SUM(OFFSET($V$742:V755,0,0,COUNTA($V$742:V755),1)),ROUND(S756*(1+BDI.Taxa),2))","v":0},null,0]
[null,null,null,null,null,null,null,null,null,null,null,null,null,null,"15.","",null,null,{"$f":"IF(P758=\"\",$S$764-SUM(OFFSET($S$742:S756,0,0,COUNTA($S$742:S756),1)),SUMIF($R$19:$R$690,$P757,$W$19:$W$690))","v":0},null,null,{"$f":"IF(P758=\"\",$V$764-SUM(OFFSET($V$742:V756,0,0,COUNTA($V$742:V756),1)),ROUND(S757*(1+BDI.Taxa),2))","v":0},null,0]
[null,null,null,null,null,null,null,null,null,null,null,null,null,null,"16.","",null,null,{"$f":"IF(P759=\"\",$S$764-SUM(OFFSET($S$742:S757,0,0,COUNTA($S$742:S757),1)),SUMIF($R$19:$R$690,$P758,$W$19:$W$690))","v":0},null,null,{"$f":"IF(P759=\"\",$V$764-SUM(OFFSET($V$742:V757,0,0,COUNTA($V$742:V757),1)),ROUND(S758*(1+BDI.Taxa),2))","v":0},null,0]
[null,null,null,null,null,null,null,null,null,null,null,null,null,null,"17.","",null,null,{"$f":"IF(P760=\"\",$S$764-SUM(OFFSET($S$742:S758,0,0,COUNTA($S$742:S758),1)),SUMIF($R$19:$R$690,$P759,$W$19:$W$690))","v":0},null,null,{"$f":"IF(P760=\"\",$V$764-SUM(OFFSET($V$742:V758,0,0,COUNTA($V$742:V758),1)),ROUND(S759*(1+BDI.Taxa),2))","v":0},null,0]
[null,null,null,null,null,null,null,null,null,null,null,null,null,null,"18.","",null,null,{"$f":"IF(P761=\"\",$S$764-SUM(OFFSET($S$742:S759,0,0,COUNTA($S$742:S759),1)),SUMIF($R$19:$R$690,$P760,$W$19:$W$690))","v":0},null,null,{"$f":"IF(P761=\"\",$V$764-SUM(OFFSET($V$742:V759,0,0,COUNTA($V$742:V759),1)),ROUND(S760*(1+BDI.Taxa),2))","v":0},null,0]
[null,null,null,null,null,null,null,null,null,null,null,null,null,null,"19.","",null,null,{"$f":"IF(P762=\"\",$S$764-SUM(OFFSET($S$742:S760,0,0,COUNTA($S$742:S760),1)),SUMIF($R$19:$R$690,$P761,$W$19:$W$690))","v":0},null,null,{"$f":"IF(P762=\"\",$V$764-SUM(OFFSET($V$742:V760,0,0,COUNTA($V$742:V760),1)),ROUND(S761*(1+BDI.Taxa),2))","v":0},null,0]
[null,null,null,null,null,null,null,null,null,null,null,null,null,null,"20.","",null,null,{"$f":"IF(P763=\"\",$S$764-SUM(OFFSET($S$742:S761,0,0,COUNTA($S$742:S761),1)),SUMIF($R$19:$R$690,$P762,$W$19:$W$690))","v":0},null,null,{"$f":"IF(P763=\"\",$V$764-SUM(OFFSET($V$742:V761,0,0,COUNTA($V$742:V761),1)),ROUND(S762*(1+BDI.Taxa),2))","v":0},null,0]
[null,null,null,null,null,null,null,null,null,null,null,null,null,null,"TOTAL GERAL DO ORÇAMENTO (R$)",null,null,null,{"$f":"SUM(S743:U762)","v":0},null,null,{"$f":"SUM(V743:W762)","v":0},null,{"$f":"SUM(X743:X762)","v":{"$error":"#DIV/0!"}}]
[null,null,null,null,null,null,null,null,null,null,null,null,null,null,null,null,null,null,{"$f":"$W$691","v":0},null,null,{"$f":"$W$693","v":0},null,100]
[null,null,null,null,null,null,null,null,null,null,null,null,null,null,null,null,null,null,"(TOTAL SEM BDI)",null,null,"(TOTAL COM BDI)",null,"(ARRED porcentagem)"]
[null,null,null,null,null,null,null,null,null,null,null,null,null,null,null,null,null,null,{"$f":"IF(AND(S763=S764,S763>0),\"OK\",\"ERRO\")","v":"ERRO"},null,null,{"$f":"IF(AND(V763=V764,V763>0),\"OK\",\"ERRO\")","v":"ERRO"},null,{"$f":"IF(AND(X763=100,S743<>0),\"OK\",\"ERRO\")","v":{"$error":"#DIV/0!"}}]

{"sheet":"Resumo ","index":1,"n_rows":39,"n_cols":9,"rows_kept":39,"cut":false,"hidden":false,"merged":[[13,0,14,0],[34,2,34,3],[35,2,35,3],[31,2,31,3],[32,2,32,3],[33,2,33,3],[28,2,28,3],[29,2,29,3],[30,2,30,3],[0,1,0,8],[36,1,36,5],[2,1,2,5],[3,1,3,5],[5,1,5,5],[6,1,6,5],[8,1,8,5],[9,1,9,5],[11,3,11,5],[12,3,12,5],[10,1,10,8],[11,6,11,8],[12,6,12,8],[25,2,25,3],[21,2,21,3],[22,2,22,3],[6,6,6,8],[7,1,7,8],[8,6,8,8],[9,6,9,8],[13,1,13,8],[1,1,1,8],[2,6,2,8],[3,6,3,8],[4,1,4,8],[5,6,5,8],[42,3,42,7],[11,1,11,2],[12,1,12,2],[15,2,15,3],[16,2,16,3],[14,1,14,8],[17,2,17,3],[23,2,23,3],[18,2,18,3],[19,2,19,3],[20,2,20,3],[41,3,41,7],[24,2,24,3],[26,2,26,3],[27,2,27,3],[38,1,38,8]]}
[]
[]
[null,"UNIDADE ESCOLAR",null,null,null,null,"CÓDIGO INEP"]
[null,{"$f":"Orçamento!$O$4","v":"COLÉGIO ESTADUAL DOM EMANUEL"},null,null,null,null,{"$f":"Orçamento!V4","v":52065812}]
[]
[null,"OBRA",null,null,null,null,"CIDADE"]
[null,{"$f":"Orçamento!$O$7","v":"REFORMA"},null,null,null,null,{"$f":"Orçamento!$V$7","v":"GOIANDIRA"}]
[]
[null,"ENDEREÇO",null,null,null,null,"CRE"]
[null,{"$f":"Orçamento!$R$10","v":"AV ILDEFONSO TELES 1, CENTRO, CEP:75740-000"},null,null,null,null,{"$f":"Orçamento!$O$10","v":"CATALÃO"}]
[]
[null,"REFERÊNCIA",null,"DATA",null,null,"ÁREA TOTAL CONSTRUÍDA (M²)"]
[null,{"$f":"CONCATENATE(\"AGETOP E SINAPI - \",Orçamento!$W$10)","v":"AGETOP E SINAPI - DESONERADA"},null,{"$f":"Orçamento!$S$7","v":"2020-05-12"},null,null,{"$f":"Orçamento!$S$13","v":2222.79}]
["FILTRO"]
[null,"RESUMO GERAL DO ORÇAMENTO"]
["↓","ITEM","DESCRIÇÃO DOS SERVIÇOS",null,"UNID","QUANT","PREÇO SEM BDI","PREÇO COM BDI","PARTICIP. (%)"]
[{"$f":"IF(E17>0,\"F\",\"\")","v":"F"},"1.",{"$f":"Orçamento!$P743","v":"REFORMA"},null,"UN ",1,{"$f":"IFERROR(Orçamento!S743,\"-\")","v":0},{"$f":"IFERROR(Orçamento!V743,\"\")","v":0},{"$f":"Orçamento!X743","v":{"$error":"#DIV/0!"}}]
[{"$f":"IF(E18>0,\"F\",\"\")","v":"F"},"2.",{"$f":"Orçamento!$P744","v":"IMPLANTAÇÃO"},null,"UN ",1,{"$f":"IFERROR(Orçamento!S744,\"-\")","v":0},{"$f":"IFERROR(Orçamento!V744,\"\")","v":0},{"$f":"Orçamento!X744","v":0}]
["F","3.",{"$f":"Orçamento!$P745","v":"COZINHA COM REFEITÓRIO PADRÃO SEDUC"},null,"UN ",1,{"$f":"IFERROR(Orçamento!S745,\"-\")","v":0},{"$f":"IFERROR(Orçamento!V745,\"\")","v":0},{"$f":"Orçamento!X745","v":0}]
["F","4.",{"$f":"Orçamento!$P746","v":"VESTIÁRIO PADRÃO SÉCULO XX1"},null,"UN ",1,{"$f":"IFERROR(Orçamento!S746,\"-\")","v":0},{"$f":"IFERROR(Orçamento!V746,\"\")","v":0},{"$f":"Orçamento!X746","v":0}]
["F","5.",{"$f":"Orçamento!$P747","v":"QUADRA EM ARCO MODELO 01 SEDUC"},null,"UN ",1,{"$f":"IFERROR(Orçamento!S747,\"-\")","v":0},{"$f":"IFERROR(Orçamento!V747,\"\")","v":0},{"$f":"Orçamento!X747","v":0}]
["","6.",{"$f":"Orçamento!$P748","v":""},null,null,null,{"$f":"IFERROR(Orçamento!S748,\"-\")","v":0},{"$f":"IFERROR(Orçamento!V748,\"\")","v":0},{"$f":"Orçamento!X748","v":0}]
["","7.",{"$f":"Orçamento!$P749","v":""},null,null,null,{"$f":"IFERROR(Orçamento!S749,\"-\")","v":0},{"$f":"IFERROR(Orçamento!V749,\"\")","v":0},{"$f":"Orçamento!X749","v":0}]
["","8.",{"$f":"Orçamento!$P750","v":""},null,null,null,{"$f":"IFERROR(Orçamento!S750,\"-\")","v":0},{"$f":"IFERROR(Orçamento!V750,\"\")","v":0},{"$f":"Orçamento!X750","v":0}]
["","9.",{"$f":"Orçamento!$P751","v":""},null,null,null,{"$f":"IFERROR(Orçamento!S751,\"-\")","v":0},{"$f":"IFERROR(Orçamento!V751,\"\")","v":0},{"$f":"Orçamento!X751","v":0}]
["","10.",{"$f":"Orçamento!$P752","v":""},null,null,null,{"$f":"IFERROR(Orçamento!S752,\"-\")","v":0},{"$f":"IFERROR(Orçamento!V752,\"\")","v":0},{"$f":"Orçamento!X752","v":0}]
["","11.",{"$f":"Orçamento!$P753","v":""},null,null,null,{"$f":"IFERROR(Orçamento!S753,\"-\")","v":0},{"$f":"IFERROR(Orçamento!V753,\"\")","v":0},{"$f":"Orçamento!X753","v":0}]
["","12.",{"$f":"Orçamento!$P754","v":""},null,null,null,{"$f":"IFERROR(Orçamento!S754,\"-\")","v":0},{"$f":"IFERROR(Orçamento!V754,\"\")","v":0},{"$f":"Orçamento!X754","v":0}]
["","13.",{"$f":"Orçamento!$P755","v":""},null,null,null,{"$f":"IFERROR(Orçamento!S755,\"-\")","v":0},{"$f":"IFERROR(Orçamento!V755,\"\")","v":0},{"$f":"Orçamento!X755","v":0}]
["","14.",{"$f":"Orçamento!$P756","v":""},null,null,null,{"$f":"IFERROR(Orçamento!S756,\"-\")","v":0},{"$f":"IFERROR(Orçamento!V756,\"\")","v":0},{"$f":"Orçamento!X756","v":0}]
["","15.",{"$f":"Orçamento!$P757","v":""},null,null,null,{"$f":"IFERROR(Orçamento!S757,\"-\")","v":0},{"$f":"IFERROR(Orçamento!V757,\"\")","v":0},{"$f":"Orçamento!X757","v":0}]
["","16.",{"$f":"Orçamento!$P758","v":""},null,null,null,{"$f":"IFERROR(Orçamento!S758,\"-\")","v":0},{"$f":"IFERROR(Orçamento!V758,\"\")","v":0},{"$f":"Orçamento!X758","v":0}]
["","17.",{"$f":"Orçamento!$P759","v":""},null,null,null,{"$f":"IFERROR(Orçamento!S759,\"-\")","v":0},{"$f":"IFERROR(Orçamento!V759,\"\")","v":0},{"$f":"Orçamento!X759","v":0}]
["","18.",{"$f":"Orçamento!$P760","v":""},null,null,null,{"$f":"IFERROR(Orçamento!S760,\"-\")","v":0},{"$f":"IFERROR(Orçamento!V760,\"\")","v":0},{"$f":"Orçamento!X760","v":0}]
["","19.",{"$f":"Orçamento!$P761","v":""},null,null,null,{"$f":"IFERROR(Orçamento!S761,\"-\")","v":0},{"$f":"IFERROR(Orçamento!V761,\"\")","v":0},{"$f":"Orçamento!X761","v":0}]
["","20.",{"$f":"Orçamento!$P762","v":""},null,null,null,{"$f":"IFERROR(Orçamento!S762,\"-\")","v":0},{"$f":"IFERROR(Orçamento!V762,\"\")","v":0},{"$f":"Orçamento!X762","v":0}]
["F","TOTAL GERAL DO ORÇAMENTO (R$)",null,null,null,null,{"$f":"SUM(G17:G36)","v":0},0,{"$f":"SUM(I17:I36)","v":{"$error":"#DIV/0!"}}]
["F"]
["F"]

{"sheet":"Somatório","index":2,"n_rows":45,"n_cols":6,"rows_kept":45,"cut":false,"hidden":false,"merged":[[13,0,14,0],[42,1,42,2],[44,1,44,5],[47,3,47,5],[48,3,48,5],[13,1,13,5],[9,1,9,3],[9,4,9,5],[11,1,11,2],[11,4,11,5],[12,1,12,2],[12,4,12,5],[0,1,0,5],[14,1,14,5],[2,1,2,3],[2,4,2,5],[3,1,3,3],[3,4,3,5],[5,1,5,3],[5,4,5,5],[6,1,6,3],[6,4,6,5],[8,1,8,3],[8,4,8,5],[1,1,1,5],[4,1,4,5],[7,1,7,5],[10,1,10,5]]}
[]
[]
[null,"UNIDADE ESCOLAR",null,null,"CÓDIGO INEP"]
[null,{"$f":"Orçamento!$O$4","v":"COLÉGIO ESTADUAL DOM EMANUEL"},null,null,{"$f":"Orçamento!V4","v":52065812}]
[]
[null,"OBRA",null,null,"CIDADE"]
[null,{"$f":"Orçamento!$O$7","v":"REFORMA"},null,null,{"$f":"Orçamento!$V$7","v":"GOIANDIRA"}]
[]
[null,"ENDEREÇO",null,null,"CRE"]
[null,{"$f":"Orçamento!$R$10","v":"AV ILDEFONSO TELES 1, CENTRO, CEP:75740-000"},null,null,{"$f":"Orçamento!$O$10","v":"CATALÃO"}]
[]
[null,"REFERÊNCIA",null,"DATA","ÁREA TOTAL CONSTRUÍDA (M²)"]
[null,{"$f":"CONCATENATE(\"AGETOP E SINAPI - \",Orçamento!$W$10)","v":"AGETOP E SINAPI - DESONERADA"},null,{"$f":"Orçamento!$S$7","v":"2020-05-12"},{"$f":"Orçamento!$S$13","v":2222.79}]
["FILTRO"]
[null,"SOMATÓRIO DE SERVIÇOS"]
["↓","ITEM","DESCRIÇÃO DOS SERVIÇOS","PREÇO SEM BDI (R$)","PREÇO COM BDI (R$)","PARTIC.  ( % )"]
[{"$f":"IF(D17>0,\"F\",\"\")","v":""},"a.",{"$f":"Orçamento!P709","v":"SERVIÇOS PRELIMINARES"},{"$f":"Orçamento!S709","v":0},{"$f":"Orçamento!V709","v":0},{"$f":"Orçamento!X709","v":0}]
[{"$f":"IF(D18>0,\"F\",\"\")","v":""},"b.",{"$f":"Orçamento!P710","v":"TRANSPORTES"},{"$f":"Orçamento!S710","v":0},{"$f":"Orçamento!V710","v":0},{"$f":"Orçamento!X710","v":0}]
["","c.",{"$f":"Orçamento!P711","v":"SERVIÇO EM TERRA"},{"$f":"Orçamento!S711","v":0},{"$f":"Orçamento!V711","v":0},{"$f":"Orçamento!X711","v":0}]
["","d.",{"$f":"Orçamento!P712","v":"FUNDAÇÕES E SONDAGENS"},{"$f":"Orçamento!S712","v":0},{"$f":"Orçamento!V712","v":0},{"$f":"Orçamento!X712","v":0}]
["","e.",{"$f":"Orçamento!P713","v":"ESTRUTURA"},{"$f":"Orçamento!S713","v":0},{"$f":"Orçamento!V713","v":0},{"$f":"Orçamento!X713","v":0}]
["","f.",{"$f":"Orçamento!P714","v":"INSTALAÇÕES ELÉTRICAS"},{"$f":"Orçamento!S714","v":0},{"$f":"Orçamento!V714","v":0},{"$f":"Orçamento!X714","v":0}]
["","g.",{"$f":"Orçamento!P715","v":"INSTALAÇÕES HIDROSSANITÁRIAS"},{"$f":"Orçamento!S715","v":0},{"$f":"Orçamento!V715","v":0},{"$f":"Orçamento!X715","v":0}]
["","h",{"$f":"Orçamento!P716","v":"INSTALAÇÕES ESPECIAIS"},{"$f":"Orçamento!S716","v":0},{"$f":"Orçamento!V716","v":0},{"$f":"Orçamento!X716","v":0}]
["","i.",{"$f":"Orçamento!P717","v":"ALVENARIAS E DIVISÓRIAS"},{"$f":"Orçamento!S717","v":0},{"$f":"Orçamento!V717","v":0},{"$f":"Orçamento!X717","v":0}]
["","j.",{"$f":"Orçamento!P718","v":"ALVENARIA AUTO-PORTANTE"},{"$f":"Orçamento!S718","v":0},{"$f":"Orçamento!V718","v":0},{"$f":"Orçamento!X718","v":0}]
["","k.",{"$f":"Orçamento!P719","v":"IMPERMEABILIZACAO"},{"$f":"Orçamento!S719","v":0},{"$f":"Orçamento!V719","v":0},{"$f":"Orçamento!X719","v":0}]
["","l.",{"$f":"Orçamento!P720","v":"ISOLAMENTO TÉRMICO E ACÚSTICO"},{"$f":"Orçamento!S720","v":0},{"$f":"Orçamento!V720","v":0},{"$f":"Orçamento!X720","v":0}]
["","m.",{"$f":"Orçamento!P721","v":"ESTRUTURA DE MADEIRA"},{"$f":"Orçamento!S721","v":0},{"$f":"Orçamento!V721","v":0},{"$f":"Orçamento!X721","v":0}]
["","n.",{"$f":"Orçamento!P722","v":"ESTRUTURAS METÁLICAS"},{"$f":"Orçamento!S722","v":0},{"$f":"Orçamento!V722","v":0},{"$f":"Orçamento!X722","v":0}]
["","o.",{"$f":"Orçamento!P723","v":"COBERTURAS"},{"$f":"Orçamento!S723","v":0},{"$f":"Orçamento!V723","v":0},{"$f":"Orçamento!X723","v":0}]
["","p.",{"$f":"Orçamento!P724","v":"ESQUADRIAS DE MADEIRA"},{"$f":"Orçamento!S724","v":0},{"$f":"Orçamento!V724","v":0},{"$f":"Orçamento!X724","v":0}]
["","q.",{"$f":"Orçamento!P725","v":"ESQUADRIAS METÁLICAS"},{"$f":"Orçamento!S725","v":0},{"$f":"Orçamento!V725","v":0},{"$f":"Orçamento!X725","v":0}]
["","r.",{"$f":"Orçamento!P726","v":"VIDROS"},{"$f":"Orçamento!S726","v":0},{"$f":"Orçamento!V726","v":0},{"$f":"Orçamento!X726","v":0}]
["","s.",{"$f":"Orçamento!P727","v":"REVESTIMENTO DE PAREDE"},{"$f":"Orçamento!S727","v":0},{"$f":"Orçamento!V727","v":0},{"$f":"Orçamento!X727","v":0}]
["","t.",{"$f":"Orçamento!P728","v":"FORROS"},{"$f":"Orçamento!S728","v":0},{"$f":"Orçamento!V728","v":0},{"$f":"Orçamento!X728","v":0}]
["","u.",{"$f":"Orçamento!P729","v":"REVESTIMENTO DE PISO"},{"$f":"Orçamento!S729","v":0},{"$f":"Orçamento!V729","v":0},{"$f":"Orçamento!X729","v":0}]
["","v.",{"$f":"Orçamento!P730","v":"FERRAGENS"},{"$f":"Orçamento!S730","v":0},{"$f":"Orçamento!V730","v":0},{"$f":"Orçamento!X730","v":0}]
["","w.",{"$f":"Orçamento!P731","v":"MARCENARIA"},{"$f":"Orçamento!S731","v":0},{"$f":"Orçamento!V731","v":0},{"$f":"Orçamento!X731","v":0}]
["","x.",{"$f":"Orçamento!P732","v":"ADMINISTRAÇÃO"},{"$f":"Orçamento!S732","v":0},{"$f":"Orçamento!V732","v":0},{"$f":"Orçamento!X732","v":0}]
["","y.",{"$f":"Orçamento!P733","v":"PINTURA"},{"$f":"Orçamento!S733","v":0},{"$f":"Orçamento!V733","v":0},{"$f":"Orçamento!X733","v":0}]
["","z.",{"$f":"Orçamento!P734","v":"DIVERSOS"},{"$f":"Orçamento!S734","v":0},{"$f":"Orçamento!V734","v":0},{"$f":"Orçamento!X734","v":0}]
["F","TOTAL GERAL DO ORÇAMENTO",null,{"$f":"SUM(D17:D42)","v":0},{"$f":"SUM(E17:E42)","v":0},{"$f":"SUM(F17:F42)","v":0}]
[]
[null,"(*) Para itens da AGETOP, os vidros não estão inclusos nas esquadrias e já foram considerados os custos de contramarco para as esquadrias de alumínio;"]

{"sheet":"Cronog_90_Dias","index":3,"n_rows":99,"n_cols":18,"rows_kept":99,"cut":false,"hidden":false,"merged":[[2,1,2,7],[5,1,5,7],[6,1,6,7],[8,1,8,7],[9,1,9,7],[4,1,4,17],[7,1,7,17],[0,1,0,17],[1,1,1,17],[2,8,2,17],[12,0,13,0],[9,0,11,0],[11,1,11,17],[92,1,92,2],[92,5,92,8],[92,13,92,16],[93,1,93,2],[93,5,93,8],[93,13,93,16],[74,13,74,16],[74,5,74,8],[68,13,68,16],[70,5,70,8],[70,13,70,16],[59,5,59,8],[71,1,73,2],[71,4,73,4],[71,5,71,8],[71,13,71,16],[73,5,73,8],[73,13,73,16],[59,13,59,16],[61,5,61,8],[61,13,61,16],[94,1,94,2],[94,5,94,8],[94,13,94,16],[76,5,76,8],[76,13,76,16],[77,5,77,8],[77,13,77,16],[79,5,79,8],[79,13,79,16],[80,5,80,8],[80,13,80,16],[82,5,82,8],[82,13,82,16],[77,3,79,3],[80,3,82,3],[86,1,88,2],[80,4,82,4],[86,9,86,12],[88,9,88,12],[89,9,89,12],[91,9,91,12],[92,9,92,12],[93,9,93,12],[94,9,94,12],[95,1,95,2],[95,5,95,8],[95,13,95,16],[97,1,97,4],[98,1,98,17],[86,13,86,16],[88,5,88,8],[88,13,88,16],[85,5,85,8],[85,13,85,16],[89,1,91,2],[89,4,91,4],[89,5,89,8],[89,13,89,16],[91,5,91,8],[91,13,91,16],[89,3,91,3],[86,4,88,4],[86,5,86,8],[86,3,88,3],[83,1,85,2],[83,4,85,4],[83,5,83,8],[83,13,83,16],[68,5,68,8],[65,5,65,8],[65,13,65,16],[67,5,67,8],[67,13,67,16],[65,3,67,3],[62,13,62,16],[64,5,64,8],[64,13,64,16],[62,5,62,8],[53,13,53,16],[55,5,55,8],[55,13,55,16],[50,5,50,8],[50,13,50,16],[52,5,52,8],[52,13,52,16],[56,13,56,16],[58,5,58,8],[58,13,58,16],[53,5,53,8],[56,5,56,8],[50,9,50,12],[52,9,52,12],[53,9,53,12],[55,9,55,12],[56,9,56,12],[58,9,58,12],[44,13,44,16],[46,5,46,8],[46,13,46,16],[47,1,49,2],[47,4,49,4],[47,5,47,8],[47,13,47,16],[49,5,49,8],[49,13,49,16],[44,5,44,8],[47,3,49,3],[44,9,44,12],[46,9,46,12],[47,9,47,12],[49,9,49,12],[35,13,35,16],[37,5,37,8],[37,13,37,16],[35,3,37,3],[40,13,40,16],[38,3,40,3],[38,13,38,16],[41,1,43,2],[41,4,43,4],[41,5,41,8],[41,13,41,16],[43,5,43,8],[43,13,43,16],[41,3,43,3],[35,5,35,8],[38,5,38,8],[40,5,40,8],[35,9,35,12],[37,9,37,12],[38,9,38,12],[40,9,40,12],[41,9,41,12],[43,9,43,12],[29,13,29,16],[31,5,31,8],[31,13,31,16],[32,1,34,2],[32,4,34,4],[32,5,32,8],[32,13,32,16],[34,5,34,8],[34,13,34,16],[32,3,34,3],[29,5,29,8],[29,1,31,2],[29,4,31,4],[29,9,29,12],[31,9,31,12],[32,9,32,12],[34,9,34,12],[26,1,28,2],[26,4,28,4],[26,5,26,8],[26,13,26,16],[28,5,28,8],[28,13,28,16],[23,3,25,3],[23,1,25,2],[23,4,25,4],[23,5,23,8],[26,3,28,3],[26,9,26,12],[28,9,28,12],[14,3,16,3],[17,3,19,3],[14,4,16,4],[14,5,14,8],[14,13,14,16],[16,5,16,8],[16,13,16,16],[23,13,23,16],[25,5,25,8],[25,13,25,16],[17,13,17,16],[19,5,19,8],[19,13,19,16],[25,9,25,12],[20,1,22,2],[20,4,22,4],[20,5,20,8],[20,13,20,16],[22,5,22,8],[22,13,22,16],[20,3,22,3],[83,3,85,3],[53,4,55,4],[59,1,61,2],[59,4,61,4],[74,1,76,2],[77,1,79,2],[77,4,79,4],[80,1,82,2],[65,1,67,2],[68,3,70,3],[62,3,64,3],[68,1,70,2],[56,3,58,3],[65,4,67,4],[71,3,73,3],[74,3,76,3],[74,4,76,4],[56,1,58,2],[68,4,70,4],[44,3,46,3],[62,1,64,2],[62,4,64,4],[38,1,40,2],[38,4,40,4],[59,3,61,3],[44,1,46,2],[44,4,46,4],[53,1,55,2],[50,1,52,2],[50,4,52,4],[10,1,10,17],[9,8,9,17],[8,8,8,17],[3,8,3,17],[6,8,6,17],[5,8,5,17],[3,1,3,7],[56,4,58,4],[29,3,31,3],[35,1,37,2],[35,4,37,4],[50,3,52,3],[53,3,55,3],[12,17,13,17],[13,1,13,2],[13,5,13,8],[13,13,13,16],[12,3,13,3],[12,13,12,16],[14,1,16,2],[12,5,12,8],[17,1,19,2],[17,4,19,4],[17,5,17,8],[12,9,12,12],[13,9,13,12],[14,9,14,12],[16,9,16,12],[17,9,17,12],[19,9,19,12],[20,9,20,12],[22,9,22,12],[23,9,23,12],[59,9,59,12],[61,9,61,12],[62,9,62,12],[64,9,64,12],[65,9,65,12],[67,9,67,12],[68,9,68,12],[70,9,70,12],[71,9,71,12],[95,9,95,12],[73,9,73,12],[74,9,74,12],[76,9,76,12],[77,9,77,12],[79,9,79,12],[80,9,80,12],[82,9,82,12],[83,9,83,12],[85,9,85,12]]}
[]
[]
[null,"UNIDADE ESCOLAR",null,null,null,null,null,null,"PRAZO"]
[null,{"$f":"Orçamento!$O$4","v":"COLÉGIO ESTADUAL DOM EMANUEL"},null,null,null,null,null,null,"90 DIAS CORRIDOS"]
[]
[null,"OBRA",null,null,null,null,null,null,"DATA"]
[null,{"$f":"Orçamento!$O$7","v":"REFORMA"},null,null,null,null,null,null,{"$f":"Orçamento!$S$7","v":"2020-05-12"}]
[]
[null,"LOCAL",null,null,null,null,null,null,"ÁREA TOTAL CONSTRUÍDA (M²)"]
["FILTRO",{"$f":"Orçamento!$V$7","v":"GOIANDIRA"},null,null,null,null,null,null,{"$f":"Orçamento!$S$13","v":2222.79}]
[]
[null,"CRONOGRAMA - FÍSICO FINANCEIRO"]
["↓","CUSTO TOTAL:",{"$f":"D93","v":0},"VALOR","Dias:",30,null,null,null,60,null,null,null,90,null,null,null,"TOTAL"]
[null,"DESCRIÇÃO DOS SERVIÇOS",null,null,"%","1ª PARCELA",null,null,null,"2ª PARCELA",null,null,null,"3ª PARCELA"]
[{"$f":"IF(D15>0,\"F\",\"\")","v":""},"SERVIÇOS PRELIMINARES",null,{"$f":"Orçamento!V709","v":0},{"$f":"Orçamento!X709","v":0},{"$f":"ROUND(F17*$D$15,2)","v":0},null,null,null,{"$f":"ROUND(J17*$D$15,2)","v":0},null,null,null,{"$f":"ROUND(N17*$D$15,2)","v":0},null,null,null,{"$f":"SUM(F15:Q15)","v":0}]
[{"$f":"IF(A15=\"F\",A15,\"\")","v":""}]
[{"$f":"IF(A16=\"F\",A16,\"\")","v":""},null,null,null,null,1,null,null,null,null,null,null,null,{"$f":"1-F17","v":0},null,null,null,{"$f":"IFERROR(E15/100,\"\")","v":0}]
[{"$f":"IF(D18>0,\"F\",\"\")","v":""},"TRANSPORTES",null,{"$f":"Orçamento!V710","v":0},{"$f":"Orçamento!X710","v":0},{"$f":"ROUND(F20*$D$18,2)","v":0},null,null,null,{"$f":"ROUND(J20*$D$18,2)","v":0},null,null,null,{"$f":"D18-F18-J18","v":0},null,null,null,{"$f":"SUM(F18:Q18)","v":0}]
[{"$f":"IF(A18=\"F\",A18,\"\")","v":""}]
[{"$f":"IF(A19=\"F\",A19,\"\")","v":""},null,null,null,null,0.33,null,null,null,0.33,null,null,null,0.34,null,null,null,{"$f":"IFERROR(E18/100,\"\")","v":0}]
[{"$f":"IF(D21>0,\"F\",\"\")","v":""},"SERVIÇO EM TERRA",null,{"$f":"Orçamento!V711","v":0},{"$f":"Orçamento!X711","v":0},{"$f":"ROUND(F23*$D$21,2)","v":0},null,null,null,{"$f":"ROUND(J23*$D$21,2)","v":0},null,null,null,{"$f":"ROUND(N23*$D$21,2)","v":0},null,null,null,{"$f":"SUM(F21:Q21)","v":0}]
[{"$f":"IF(A21=\"F\",A21,\"\")","v":""}]
[{"$f":"IF(A22=\"F\",A22,\"\")","v":""},null,null,null,null,0.7,null,null,null,0.3,null,null,null,null,null,null,null,{"$f":"IFERROR(E21/100,\"\")","v":0}]
[{"$f":"IF(D24>0,\"F\",\"\")","v":""},"FUNDAÇÕES E SONDAGENS",null,{"$f":"Orçamento!V712","v":0},{"$f":"Orçamento!X712","v":0},{"$f":"ROUND(F26*$D$24,2)","v":0},null,null,null,{"$f":"ROUND(J26*$D$24,2)","v":0},null,null,null,{"$f":"ROUND(N26*$D$24,2)","v":0},null,null,null,{"$f":"SUM(F24:Q24)","v":0}]
[{"$f":"IF(A24=\"F\",A24,\"\")","v":""}]
[{"$f":"IF(A25=\"F\",A25,\"\")","v":""},null,null,null,null,1,null,null,null,null,null,null,null,{"$f":"1-F26","v":0},null,null,null,{"$f":"IFERROR(E24/100,\"\")","v":0}]
[{"$f":"IF(D27>0,\"F\",\"\")","v":""},"ESTRUTURA",null,{"$f":"Orçamento!V713","v":0},{"$f":"Orçamento!X713","v":0},{"$f":"ROUND(F29*$D$27,2)","v":0},null,null,null,{"$f":"ROUND(J29*$D$27,2)","v":0},null,null,null,{"$f":"ROUND(N29*$D$27,2)","v":0},null,null,null,{"$f":"SUM(F27:Q27)","v":0}]
[{"$f":"IF(A27=\"F\",A27,\"\")","v":""}]
[{"$f":"IF(A28=\"F\",A28,\"\")","v":""},null,null,null,null,0.6,null,null,null,0.4,null,null,null,null,null,null,null,{"$f":"IFERROR(E27/100,\"\")","v":0}]
[{"$f":"IF(D30>0,\"F\",\"\")","v":""},"INST.ELET/TELEFÔNICA/CABEAMENTO ESTRUTURADO",null,{"$f":"Orçamento!V714","v":0},{"$f":"Orçamento!X714","v":0},{"$f":"ROUND(F32*$D$30,2)","v":0},null,null,null,{"$f":"ROUND(J32*$D$30,2)","v":0},null,null,null,{"$f":"ROUND(N32*$D$30,2)","v":0},null,null,null,{"$f":"SUM(F30:Q30)","v":0}]
[{"$f":"IF(A30=\"F\",A30,\"\")","v":""}]
[{"$f":"IF(A31=\"F\",A31,\"\")","v":""},null,null,null,null,0.4,null,null,null,0.31,null,null,null,0.28999999999999998,null,null,null,{"$f":"IFERROR(E30/100,\"\")","v":0}]
[{"$f":"IF(D33>0,\"F\",\"\")","v":""},"INSTALAÇÕES HIDROSSANITÁRIAS",null,{"$f":"Orçamento!V715","v":0},{"$f":"Orçamento!X715","v":0},{"$f":"ROUND(F35*$D$33,2)","v":0},null,null,null,{"$f":"ROUND(J35*$D$33,2)","v":0},null,null,null,{"$f":"ROUND(N35*$D$33,2)","v":0},null,null,null,{"$f":"SUM(F33:Q33)","v":0}]
[{"$f":"IF(A33=\"F\",A33,\"\")","v":""}]
[{"$f":"IF(A34=\"F\",A34,\"\")","v":""},null,null,null,null,0.2,null,null,null,0.28999999999999998,null,null,null,0.51,null,null,null,{"$f":"IFERROR(E33/100,\"\")","v":0}]
[{"$f":"IF(D36>0,\"F\",\"\")","v":""},"INSTALAÇÕES ESPECIAIS",null,{"$f":"Orçamento!V716","v":0},{"$f":"Orçamento!X716","v":0},{"$f":"ROUND(F38*$D$36,2)","v":0},null,null,null,{"$f":"ROUND(J38*$D$36,2)","v":0},null,null,null,{"$f":"ROUND(N38*$D$36,2)","v":0},null,null,null,{"$f":"SUM(F36:Q36)","v":0}]
[{"$f":"IF(A36=\"F\",A36,\"\")","v":""}]
[{"$f":"IF(A37=\"F\",A37,\"\")","v":""},null,null,null,null,1,null,null,null,null,null,null,null,{"$f":"1-F38","v":0},null,null,null,{"$f":"IFERROR(E36/100,\"\")","v":0}]
[{"$f":"IF(D39>0,\"F\",\"\")","v":""},"ALVENARIA E DIVISÓRIAS",null,{"$f":"Orçamento!V717","v":0},{"$f":"Orçamento!X717","v":0},{"$f":"ROUND(F41*$D$39,2)","v":0},null,null,null,{"$f":"ROUND(J41*$D$39,2)","v":0},null,null,null,{"$f":"D39-F39-J39","v":0},null,null,null,{"$f":"SUM(F39:Q39)","v":0}]
[{"$f":"IF(A39=\"F\",A39,\"\")","v":""}]
[{"$f":"IF(A40=\"F\",A40,\"\")","v":""},null,null,null,null,0.28999999999999998,null,null,null,0.31,null,null,null,0.4,null,null,null,{"$f":"IFERROR(E39/100,\"\")","v":0}]
[{"$f":"IF(D42>0,\"F\",\"\")","v":""},"ALVENARIA AUTO-PORTANTE",null,{"$f":"Orçamento!V718","v":0},{"$f":"Orçamento!X718","v":0},{"$f":"ROUND(F44*$D$42,2)","v":0},null,null,null,{"$f":"ROUND(J44*$D$42,2)","v":0},null,null,null,{"$f":"ROUND(N44*$D$42,2)","v":0},null,null,null,{"$f":"SUM(F42:Q42)","v":0}]
[{"$f":"IF(A42=\"F\",A42,\"\")","v":""}]
[{"$f":"IF(A43=\"F\",A43,\"\")","v":""},null,null,null,null,null,null,null,null,null,null,null,null,{"$f":"1-F44","v":1},null,null,null,{"$f":"IFERROR(E42/100,\"\")","v":0}]
[{"$f":"IF(D45>0,\"F\",\"\")","v":""},"IMPERMEABILIZAÇÃO",null,{"$f":"Orçamento!V719","v":0},{"$f":"Orçamento!X719","v":0},{"$f":"D45-J45","v":0},null,null,null,{"$f":"ROUND(J47*$D$45,2)","v":0},null,null,null,{"$f":"ROUND(N47*$D$45,2)","v":0},null,null,null,{"$f":"SUM(F45:Q45)","v":0}]
[{"$f":"IF(A45=\"F\",A45,\"\")","v":""}]
[{"$f":"IF(A46=\"F\",A46,\"\")","v":""},null,null,null,null,0.7,null,null,null,0.3,null,null,null,null,null,null,null,{"$f":"IFERROR(E45/100,\"\")","v":0}]
[{"$f":"IF(D48>0,\"F\",\"\")","v":""},"ISOLAMENTO TÉRMICO E ACÚSTICO",null,{"$f":"Orçamento!V720","v":0},{"$f":"Orçamento!X720","v":0},{"$f":"ROUND(F50*$D$48,2)","v":0},null,null,null,{"$f":"ROUND(J50*$D$48,2)","v":0},null,null,null,{"$f":"ROUND(N50*$D$48,2)","v":0},null,null,null,{"$f":"SUM(F48:Q48)","v":0}]
[{"$f":"IF(A48=\"F\",A48,\"\")","v":""}]
[{"$f":"IF(A49=\"F\",A49,\"\")","v":""},null,null,null,null,0.5,null,null,null,null,null,null,null,{"$f":"1-F50","v":0.5},null,null,null,{"$f":"IFERROR(E48/100,\"\")","v":0}]
[{"$f":"IF(D51>0,\"F\",\"\")","v":""},"ESTRUTURA DE MADEIRA",null,{"$f":"Orçamento!V721","v":0},{"$f":"Orçamento!X721","v":0},{"$f":"ROUND(F53*$D$51,2)","v":0},null,null,null,{"$f":"ROUND(J53*$D$51,2)","v":0},null,null,null,{"$f":"ROUND(N53*$D$51,2)","v":0},null,null,null,{"$f":"SUM(F51:Q51)","v":0}]
[{"$f":"IF(A51=\"F\",A51,\"\")","v":""}]
[{"$f":"IF(A52=\"F\",A52,\"\")","v":""},null,null,null,null,0.8,null,null,null,0.2,null,null,null,null,null,null,null,{"$f":"IFERROR(E51/100,\"\")","v":0}]
[{"$f":"IF(D54>0,\"F\",\"\")","v":""},"ESTRUTURA METÁLICA",null,{"$f":"Orçamento!V722","v":0},{"$f":"Orçamento!X722","v":0},{"$f":"ROUND(F56*$D$54,2)","v":0},null,null,null,{"$f":"ROUND(J56*$D$54,2)","v":0},null,null,null,{"$f":"ROUND(N56*$D$54,2)","v":0},null,null,null,{"$f":"SUM(F54:Q54)","v":0}]
[{"$f":"IF(A54=\"F\",A54,\"\")","v":""}]
[{"$f":"IF(A55=\"F\",A55,\"\")","v":""},null,null,null,null,1,null,null,null,null,null,null,null,null,null,null,null,{"$f":"IFERROR(E54/100,\"\")","v":0}]
[{"$f":"IF(D57>0,\"F\",\"\")","v":""},"COBERTURAS",null,{"$f":"Orçamento!V723","v":0},{"$f":"Orçamento!X723","v":0},{"$f":"ROUND(F59*$D$57,2)","v":0},null,null,null,{"$f":"ROUND(J59*$D$57,2)","v":0},null,null,null,{"$f":"ROUND(N59*$D$57,2)","v":0},null,null,null,{"$f":"SUM(F57:Q57)","v":0}]
[{"$f":"IF(A57=\"F\",A57,\"\")","v":""}]
[{"$f":"IF(A58=\"F\",A58,\"\")","v":""},null,null,null,null,0,null,null,null,0.49,null,null,null,0.51,null,null,null,{"$f":"IFERROR(E57/100,\"\")","v":0}]
[{"$f":"IF(D60>0,\"F\",\"\")","v":""},"ESQUADRIAS DE MADEIRA",null,{"$f":"Orçamento!V724","v":0},{"$f":"Orçamento!X724","v":0},{"$f":"ROUND(F62*$D$60,2)","v":0},null,null,null,{"$f":"ROUND(J62*$D$60,2)","v":0},null,null,null,{"$f":"ROUND(N62*$D$60,2)","v":0},null,null,null,{"$f":"SUM(F60:Q60)","v":0}]
[{"$f":"IF(A60=\"F\",A60,\"\")","v":""}]
[{"$f":"IF(A61=\"F\",A61,\"\")","v":""},null,null,null,null,0.54,null,null,null,null,null,null,null,{"$f":"1-F62","v":0.45999999999999996},null,null,null,{"$f":"IFERROR(E60/100,\"\")","v":0}]
[{"$f":"IF(D63>0,\"F\",\"\")","v":""},"ESQUADRIAS METÁLICAS",null,{"$f":"Orçamento!V725","v":0},{"$f":"Orçamento!X725","v":0},{"$f":"ROUND(F65*$D$63,2)","v":0},null,null,null,{"$f":"ROUND(J65*$D$63,2)","v":0},null,null,null,{"$f":"ROUND(N65*$D$63,2)","v":0},null,null,null,{"$f":"SUM(F63:Q63)","v":0}]
[{"$f":"IF(A63=\"F\",A63,\"\")","v":""}]
[{"$f":"IF(A64=\"F\",A64,\"\")","v":""},null,null,null,null,null,null,null,null,0.49,null,null,null,0.51,null,null,null,{"$f":"IFERROR(E63/100,\"\")","v":0}]
[{"$f":"IF(D66>0,\"F\",\"\")","v":""},"VIDROS",null,{"$f":"Orçamento!V726","v":0},{"$f":"Orçamento!X726","v":0},{"$f":"ROUND(F68*$D$66,2)","v":0},null,null,null,{"$f":"ROUND(J68*$D$66,2)","v":0},null,null,null,{"$f":"ROUND(N68*$D$66,2)","v":0},null,null,null,{"$f":"SUM(F66:Q66)","v":0}]
[{"$f":"IF(A66=\"F\",A66,\"\")","v":""}]
[{"$f":"IF(A67=\"F\",A67,\"\")","v":""},null,null,null,null,0,null,null,null,null,null,null,null,{"$f":"1-F68","v":1},null,null,null,{"$f":"IFERROR(E66/100,\"\")","v":0}]
[{"$f":"IF(D69>0,\"F\",\"\")","v":""},"REVESTIMENTO DE PAREDE",null,{"$f":"Orçamento!V727","v":0},{"$f":"Orçamento!X727","v":0},{"$f":"ROUND(F71*$D$69,2)","v":0},null,null,null,{"$f":"D69-N69-F69","v":0},null,null,null,{"$f":"ROUND(N71*$D$69,2)","v":0},null,null,null,{"$f":"SUM(F69:Q69)","v":0}]
[{"$f":"IF(A69=\"F\",A69,\"\")","v":""}]
[{"$f":"IF(A70=\"F\",A70,\"\")","v":""},null,null,null,null,0.2,null,null,null,0.31,null,null,null,0.49,null,null,null,{"$f":"IFERROR(E69/100,\"\")","v":0}]
[{"$f":"IF(D72>0,\"F\",\"\")","v":""},"FORROS",null,{"$f":"Orçamento!V728","v":0},{"$f":"Orçamento!X728","v":0},{"$f":"ROUND(F74*$D$72,2)","v":0},null,null,null,{"$f":"ROUND(J74*$D$72,2)","v":0},null,null,null,{"$f":"ROUND(N74*$D$72,2)","v":0},null,null,null,{"$f":"SUM(F72:Q72)","v":0}]
[{"$f":"IF(A72=\"F\",A72,\"\")","v":""}]
[{"$f":"IF(A73=\"F\",A73,\"\")","v":""},null,null,null,null,null,null,null,null,0.25,null,null,null,0.75,null,null,null,{"$f":"IFERROR(E72/100,\"\")","v":0}]
[{"$f":"IF(D75>0,\"F\",\"\")","v":""},"REVESTIMENTO DE PISO",null,{"$f":"Orçamento!V729","v":0},{"$f":"Orçamento!X729","v":0},{"$f":"ROUND(F77*$D$75,2)","v":0},null,null,null,{"$f":"ROUND(J77*$D$75,2)","v":0},null,null,null,{"$f":"D75-F75-J75","v":0},null,null,null,{"$f":"SUM(F75:Q75)","v":0}]
[{"$f":"IF(A75=\"F\",A75,\"\")","v":""}]
[{"$f":"IF(A76=\"F\",A76,\"\")","v":""},null,null,null,null,0.3,null,null,null,0.3,null,null,null,0.4,null,null,null,{"$f":"IFERROR(E75/100,\"\")","v":0}]
[{"$f":"IF(D78>0,\"F\",\"\")","v":""},"FERRAGENS",null,{"$f":"Orçamento!V730","v":0},{"$f":"Orçamento!X730","v":0},{"$f":"ROUND(F80*$D$78,2)","v":0},null,null,null,{"$f":"ROUND(J80*$D$78,2)","v":0},null,null,null,{"$f":"ROUND(N80*$D$78,2)","v":0},null,null,null,{"$f":"SUM(F78:Q78)","v":0}]
[{"$f":"IF(A78=\"F\",A78,\"\")","v":""}]
[{"$f":"IF(A79=\"F\",A79,\"\")","v":""},null,null,null,null,0,null,null,null,null,null,null,null,{"$f":"1-F80","v":1},null,null,null,{"$f":"IFERROR(E78/100,\"\")","v":0}]
[{"$f":"IF(D81>0,\"F\",\"\")","v":""},"MARCENARIA",null,{"$f":"Orçamento!V731","v":0},{"$f":"Orçamento!X731","v":0},{"$f":"ROUND(F83*$D$81,2)","v":0},null,null,null,{"$f":"ROUND(J83*$D$81,2)","v":0},null,null,null,{"$f":"ROUND(N83*$D$81,2)","v":0},null,null,null,{"$f":"SUM(F81:Q81)","v":0}]
[{"$f":"IF(A81=\"F\",A81,\"\")","v":""}]
[{"$f":"IF(A82=\"F\",A82,\"\")","v":""},null,null,null,null,0.19,null,null,null,0.33,null,null,null,0.48,null,null,null,{"$f":"IFERROR(E81/100,\"\")","v":0}]
[{"$f":"IF(D84>0,\"F\",\"\")","v":""},"ADMINISTRAÇÃO - MENSALISTAS",null,{"$f":"Orçamento!V732","v":0},{"$f":"Orçamento!X732","v":0},{"$f":"ROUND(F86*$D$84,2)","v":0},null,null,null,{"$f":"ROUND(J86*$D$84,2)","v":0},null,null,null,{"$f":"D84-F84-J84","v":0},null,null,null,{"$f":"SUM(F84:Q84)","v":0}]
[{"$f":"IF(A84=\"F\",A84,\"\")","v":""}]
[{"$f":"IF(A85=\"F\",A85,\"\")","v":""},null,null,null,null,0.33,null,null,null,0.33,null,null,null,0.34,null,null,null,{"$f":"IFERROR(E84/100,\"\")","v":0}]
[{"$f":"IF(D87>0,\"F\",\"\")","v":""},"PINTURA",null,{"$f":"Orçamento!V733","v":0},{"$f":"Orçamento!X733","v":0},{"$f":"ROUND(F89*$D$87,2)","v":0},null,null,null,{"$f":"ROUND(J89*$D$87,2)","v":0},null,null,null,{"$f":"ROUND(N89*$D$87,2)","v":0},null,null,null,{"$f":"SUM(F87:Q87)","v":0}]
[{"$f":"IF(A87=\"F\",A87,\"\")","v":""}]
[{"$f":"IF(A88=\"F\",A88,\"\")","v":""},null,null,null,null,0,null,null,null,0.2,null,null,null,0.8,null,null,null,{"$f":"IFERROR(E87/100,\"\")","v":0}]
[{"$f":"IF(D90>0,\"F\",\"\")","v":""},"DIVERSOS",null,{"$f":"Orçamento!V734","v":0},{"$f":"Orçamento!X734","v":0},{"$f":"ROUND(F92*$D$90,2)","v":0},null,null,null,{"$f":"ROUND(J92*$D$90,2)","v":0},null,null,null,{"$f":"ROUND(N92*$D$90,2)","v":0},null,null,null,{"$f":"SUM(F90:Q90)","v":0}]
[{"$f":"IF(A90=\"F\",A90,\"\")","v":""}]
[{"$f":"IF(A91=\"F\",A91,\"\")","v":""},null,null,null,null,0.31,null,null,null,0.33,null,null,null,0.36,null,null,null,{"$f":"IFERROR(E90/100,\"\")","v":0}]
["F","CUSTO DO ORÇAMENTO",null,{"$f":"SUM(D15:D92)","v":0},{"$f":"SUM(E15:E92)","v":0},{"$f":"F15+F18+F21+F24+F27+F30+F33+F36+F39+F42+F45+F48+F51+F54+F57+F60+F63+F66+F69+F72+F75+F78+F81+F84+F87+F90","v":0},null,null,null,{"$f":"J15+J18+J21+J24+J27+J30+J33+J36+J39+J42+J45+J48+J51+J54+J57+J60+J63+J66+J69+J72+J75+J78+J81+J84+J87+J90","v":0},null,null,null,{"$f":"N15+N18+N21+N24+N27+N30+N33+N36+N39+N42+N45+N48+N51+N54+N57+N60+N63+N66+N69+N72+N75+N78+N81+N84+N87+N90","v":0},null,null,null,{"$f":"R15+R18+R21+R24+R27+R30+R33+R36+R39+R42+R45+R48+R51+R54+R57+R60+R63+R66+R69+R72+R75+R78+R81+R84+R87+R90","v":0}]
["F","PERCENTUAIS:",null,null,null,{"$f":"IFERROR(F93/D93,\"\")","v":""},null,null,null,{"$f":"IFERROR(J93/D93,\"\")","v":""},null,null,null,{"$f":"IFERROR(N93/D93,\"\")","v":""},null,null,null,{"$f":"SUM(F94:Q94)","v":0}]
["F","TOTAIS ACUMULADOS:",null,null,null,{"$f":"F93","v":0},null,null,null,{"$f":"F95+J93","v":0},null,null,null,{"$f":"J95+N93","v":0}]
["F","PERCENTUAIS  ACUMULADOS:",null,null,null,{"$f":"F94","v":""},null,null,null,{"$f":"IFERROR(F96+J94,\"\")","v":""},null,null,null,{"$f":"IFERROR(J96+N94,\"\")","v":""}]
["F"]
["F","OBSERVAÇÕES:"]
["F","Os pagamentos somente poderão ser efetuados mediante medição e atesto pelos técnicos da Secretaria da Educação. "]

{"sheet":"Composição BDI","index":4,"n_rows":45,"n_cols":9,"rows_kept":45,"cut":false,"hidden":false,"merged":[[11,0,11,3],[12,0,12,3],[14,0,14,3],[15,0,15,3],[13,0,13,3],[0,0,0,3],[1,0,1,3],[4,0,4,3],[7,0,7,3],[10,0,10,3],[2,0,2,3],[3,0,3,3],[5,0,5,3],[6,0,6,3],[8,0,8,3],[9,0,9,3],[18,5,18,8],[17,0,17,3],[16,0,16,3],[44,0,44,3],[42,0,42,3],[43,0,43,3],[18,0,18,3],[36,0,36,3],[39,0,39,3],[38,0,38,3],[40,0,40,3],[29,0,29,2],[32,0,32,3],[33,0,33,3],[34,0,34,3],[35,0,35,3]]}
[]
[]
["UNIDADE ESCOLAR"]
[{"$f":"Orçamento!$O$4","v":"COLÉGIO ESTADUAL DOM EMANUEL"}]
[]
["OBRA"]
[{"$f":"Orçamento!$O$7","v":"REFORMA"}]
[]
["ENDEREÇO"]
[{"$f":"Orçamento!$R$10","v":"AV ILDEFONSO TELES 1, CENTRO, CEP:75740-000"}]
[]
["CIDADE"]
[{"$f":"Orçamento!$V$7","v":"GOIANDIRA"}]
[]
["CRE"]
[{"$f":"Orçamento!$O$10","v":"CATALÃO"}]
[]
["DETALHAMENTO DA COMPOSIÇÃO DE BDI"]
["COMPOSIÇÃO BDI PARA OBRAS CIVIS",null,null,null,null,"BDI CONSTRUÇÃO E REFORMA"]
["DESCRIÇÃO","COEF.","TAXA % (a.m)","% no preço de venda",null,"Situação","1º Quartil","Médio","3º Quartil"]
["1) COFINS",1,0.03,{"$f":"C21","v":0.03},null,{"$f":"IF(OR(C21<G21,C21>I21),\"FORA DO INTERVALO\",\"OK\")","v":"OK"},0.03,0.03,0.03]
["2) PIS",1,6.4999999999999997E-3,{"$f":"C22","v":6.4999999999999997E-3},null,{"$f":"IF(OR(C22<G22,C22>I22),\"FORA DO INTERVALO\",\"OK\")","v":"OK"},6.4999999999999997E-3,6.4999999999999997E-3,6.4999999999999997E-3]
["3) ISSQN",1,0.05,{"$f":"C23*B23","v":0.05},null,"OK",0.02,3.5000000000000003E-2,0.05]
["4) CPRB",1,4.4999999999999998E-2,{"$f":"C24","v":4.4999999999999998E-2},null,"OK",4.4999999999999998E-2,4.4999999999999998E-2,4.4999999999999998E-2]
["5) Administração Central",1,0.04,0.04,null,"OK",0.03,0.04,5.5E-2]
["6) Despesas Financeiras",1,5.5999999999999999E-3,5.5999999999999999E-3,null,"FORA DO INTERVALO",5.8999999999999999E-3,1.23E-2,1.3899999999999999E-2]
["7) Seguros + Garantias",1,1.1999999999999999E-3,1.1999999999999999E-3,null,"FORA DO INTERVALO",8.0000000000000002E-3,8.0000000000000002E-3,0.01]
["8) Risco",1,9.7000000000000003E-3,9.7000000000000003E-3,null,"OK",9.7000000000000003E-3,1.2699999999999999E-2,1.2699999999999999E-2]
["9) Lucro",1,7.1999999999999995E-2,7.1999999999999995E-2,null,"OK",6.1600000000000002E-2,7.3999999999999996E-2,8.9599999999999999E-2]
["BDI - FINAL",null,null,{"$f":"(((1+D25+D27+D28)*(1+D26)*(1+D29))/(1-(D21+D22+D23+D24))-1)","v":0.30440249036269473},null,"FORA DO INTERVALO",0.2034,0.22120000000000001,0.25]
[]
["Notas:"]
["(1) e (2) Alíquota definida por lei."]
["(3) Alíquota e base de cálculo definidas pela legislação municipal."]
["(4) Alíquota definida pelas leis 12.546/11, 12844/13 e 13.161/15 (CPRB – contribuição previdenciária sobre a receita bruta)."]
["(5) Valores definidos a partir dos limites no Acórdão nº 2.622/2013 - TCU – Plenário. Valores entre o 1º e 3º quartis."]
["(6) Valor calculado pela expressão matemática do acórdão 2.369/2011 – TCU – Plenário e disponibilizado pela AGETOP em dezembro de 2018. (Foi utilizado para o cálculo a média da Taxa SELIC no período de 11/2017 a 10/2018)"]
[]
["(7) Valores definidos pela AGETOP a partir dos limites no Acórdão nº 2.622/2013 - TCU – Plenário. Valores médios. \n\nObservação da AGETOP: (Seguros contra erros de execução, incêndio e explosão, danos da natureza (vendaval, destelhamento, alagamento, inundação, desmoronamento, geadas etc.), emprego de material defeituoso ou inadequado, roubo e/ou furto qualificado, quebra de equipamentos, desmoronamento de estrutura, nas modalidades de Obras Civis em Construção (OCC); Instalação e Montagem (IM); e Obras Civis em Construção e Instalação e Montagem (OCC/IM). Bem como coberturas adicionais para ampliação dessas coberturas básicas, como: cobertura de responsabilidade civil geral, cobertura de responsabilidade civil cruzada, cobertura de despesas extraordinárias, cobertura de tumultos, cobertura de desentulho do local, cobertura de riscos do fabricante, dentre outras, incluindo o seguro de vida em grupo regido pela convenção coletiva dos trabalhadores na indústria da construção civil). A partir de 24/02/2015 por intermédio da Portaria 449/2015 a Presidência da AGETOP, na pessoa do Senhor Jayme Eduardo Rincon, determinou a exclusão dos valores referentes aos Seguros de Risco de Engenharia e Responsabilidade Civil do Profissional na composição do cálculo do B.D.I.."]
["(8) Valores definidos a partir dos limites no Acórdão nº 2.622/2013 - TCU – Plenário. Valores entre 1º e 3° quartis."]
["(9) Valores definidos a partir dos limites definidos no Acórdão nº 2.622/2013 - TCU – Plenário. Valores adotados e praticados no mercado ( “ ex ante ” ) ou aqueles entre os 1º e 3º quartis."]
[]
["(*) A fórmula para estipulação da taxa de BDI estimado adotado é a mesma que foi aplicada para a obtenção das tabelas contidas no Acórdão n. 2.622/2013 – TCUPlenário"]
[]
["Obs.: Para obras com valores superiores a R$ 20.000.000,00 sugere-se recalcular o BDI, dimensionando as taxas de administração central e lucro para patamares inferiores ao estipulado acima."]

{"sheet":"Relatório CENTRAL","index":5,"n_rows":40,"n_cols":5,"rows_kept":40,"cut":false,"hidden":false,"merged":[[9,0,11,0],[0,1,0,4],[6,3,6,4],[9,3,9,4],[1,1,1,4],[2,1,2,2],[2,3,2,4],[3,1,3,2],[3,3,3,4],[4,1,4,4],[5,1,5,2],[5,3,5,4],[6,1,6,2],[7,1,7,4],[8,1,8,2],[8,3,8,4],[9,1,9,2],[10,1,10,4],[11,1,11,4],[39,1,39,2]]}
[]
[]
[null,"UNIDADE ESCOLAR",null,"CIDADE"]
[null,{"$f":"Orçamento!$O$4","v":"COLÉGIO ESTADUAL DOM EMANUEL"},null,{"$f":"Orçamento!$V$7","v":"GOIANDIRA"}]
[]
[null,"OBRA",null,"CRE"]
[null,{"$f":"Orçamento!$O$7","v":"REFORMA"},null,{"$f":"Orçamento!$O$10","v":"CATALÃO"}]
[]
[null,"ENDEREÇO",null,"DATA"]
["FILTRO",{"$f":"Orçamento!$R$10","v":"AV ILDEFONSO TELES 1, CENTRO, CEP:75740-000"},null,{"$f":"Orçamento!$S$7","v":"2020-05-12"}]
[]
[null,"RELATÓRIO CENTRAL"]
["↓","CÓDIGO","ETAPA","PREÇO  (R$) C/ BDI","PARTIC  ( % )"]
[{"$f":"IF(D14>0,\"F\",\"\")","v":""},{"$f":"Orçamento!O709","v":"a."},{"$f":"Orçamento!P709","v":"SERVIÇOS PRELIMINARES"},{"$f":"Orçamento!V709","v":0},{"$f":"Orçamento!X709","v":0}]
[{"$f":"IF(D15>0,\"F\",\"\")","v":""},{"$f":"Orçamento!O710","v":"b."},{"$f":"Orçamento!P710","v":"TRANSPORTES"},{"$f":"Orçamento!V710","v":0},{"$f":"Orçamento!X710","v":0}]
["",{"$f":"Orçamento!O711","v":"c."},{"$f":"Orçamento!P711","v":"SERVIÇO EM TERRA"},{"$f":"Orçamento!V711","v":0},{"$f":"Orçamento!X711","v":0}]
["",{"$f":"Orçamento!O712","v":"d."},{"$f":"Orçamento!P712","v":"FUNDAÇÕES E SONDAGENS"},{"$f":"Orçamento!V712","v":0},{"$f":"Orçamento!X712","v":0}]
["",{"$f":"Orçamento!O713","v":"e."},{"$f":"Orçamento!P713","v":"ESTRUTURA"},{"$f":"Orçamento!V713","v":0},{"$f":"Orçamento!X713","v":0}]
["",{"$f":"Orçamento!O714","v":"f."},{"$f":"Orçamento!P714","v":"INSTALAÇÕES ELÉTRICAS"},{"$f":"Orçamento!V714","v":0},{"$f":"Orçamento!X714","v":0}]
["",{"$f":"Orçamento!O715","v":"g."},{"$f":"Orçamento!P715","v":"INSTALAÇÕES HIDROSSANITÁRIAS"},{"$f":"Orçamento!V715","v":0},{"$f":"Orçamento!X715","v":0}]
["",{"$f":"Orçamento!O716","v":"h"},{"$f":"Orçamento!P716","v":"INSTALAÇÕES ESPECIAIS"},{"$f":"Orçamento!V716","v":0},{"$f":"Orçamento!X716","v":0}]
["",{"$f":"Orçamento!O717","v":"i."},{"$f":"Orçamento!P717","v":"ALVENARIAS E DIVISÓRIAS"},{"$f":"Orçamento!V717","v":0},{"$f":"Orçamento!X717","v":0}]
["",{"$f":"Orçamento!O718","v":"j."},{"$f":"Orçamento!P718","v":"ALVENARIA AUTO-PORTANTE"},{"$f":"Orçamento!V718","v":0},{"$f":"Orçamento!X718","v":0}]
["",{"$f":"Orçamento!O719","v":"k."},{"$f":"Orçamento!P719","v":"IMPERMEABILIZACAO"},{"$f":"Orçamento!V719","v":0},{"$f":"Orçamento!X719","v":0}]
["",{"$f":"Orçamento!O720","v":"l."},{"$f":"Orçamento!P720","v":"ISOLAMENTO TÉRMICO E ACÚSTICO"},{"$f":"Orçamento!V720","v":0},{"$f":"Orçamento!X720","v":0}]
["",{"$f":"Orçamento!O721","v":"m."},{"$f":"Orçamento!P721","v":"ESTRUTURA DE MADEIRA"},{"$f":"Orçamento!V721","v":0},{"$f":"Orçamento!X721","v":0}]
["",{"$f":"Orçamento!O722","v":"n."},{"$f":"Orçamento!P722","v":"ESTRUTURAS METÁLICAS"},{"$f":"Orçamento!V722","v":0},{"$f":"Orçamento!X722","v":0}]
["",{"$f":"Orçamento!O723","v":"o."},{"$f":"Orçamento!P723","v":"COBERTURAS"},{"$f":"Orçamento!V723","v":0},{"$f":"Orçamento!X723","v":0}]
["",{"$f":"Orçamento!O724","v":"p."},{"$f":"Orçamento!P724","v":"ESQUADRIAS DE MADEIRA"},{"$f":"Orçamento!V724","v":0},{"$f":"Orçamento!X724","v":0}]
["",{"$f":"Orçamento!O725","v":"q."},{"$f":"Orçamento!P725","v":"ESQUADRIAS METÁLICAS"},{"$f":"Orçamento!V725","v":0},{"$f":"Orçamento!X725","v":0}]
["",{"$f":"Orçamento!O726","v":"r."},{"$f":"Orçamento!P726","v":"VIDROS"},{"$f":"Orçamento!V726","v":0},{"$f":"Orçamento!X726","v":0}]
["",{"$f":"Orçamento!O727","v":"s."},{"$f":"Orçamento!P727","v":"REVESTIMENTO DE PAREDE"},{"$f":"Orçamento!V727","v":0},{"$f":"Orçamento!X727","v":0}]
["",{"$f":"Orçamento!O728","v":"t."},{"$f":"Orçamento!P728","v":"FORROS"},{"$f":"Orçamento!V728","v":0},{"$f":"Orçamento!X728","v":0}]
["",{"$f":"Orçamento!O729","v":"u."},{"$f":"Orçamento!P729","v":"REVESTIMENTO DE PISO"},{"$f":"Orçamento!V729","v":0},{"$f":"Orçamento!X729","v":0}]
["",{"$f":"Orçamento!O730","v":"v."},{"$f":"Orçamento!P730","v":"FERRAGENS"},{"$f":"Orçamento!V730","v":0},{"$f":"Orçamento!X730","v":0}]
["",{"$f":"Orçamento!O731","v":"w."},{"$f":"Orçamento!P731","v":"MARCENARIA"},{"$f":"Orçamento!V731","v":0},{"$f":"Orçamento!X731","v":0}]
["",{"$f":"Orçamento!O732","v":"x."},{"$f":"Orçamento!P732","v":"ADMINISTRAÇÃO"},{"$f":"Orçamento!V732","v":0},{"$f":"Orçamento!X732","v":0}]
["",{"$f":"Orçamento!O733","v":"y."},{"$f":"Orçamento!P733","v":"PINTURA"},{"$f":"Orçamento!V733","v":0},{"$f":"Orçamento!X733","v":0}]
["",{"$f":"Orçamento!O734","v":"z."},{"$f":"Orçamento!P734","v":"DIVERSOS"},{"$f":"Orçamento!V734","v":0},{"$f":"Orçamento!X734","v":0}]
["F","TOTAL GERAL DO ORÇAMENTO (R$) C/BDI",null,{"$f":"SUM(D14:D39)","v":0},{"$f":"SUM(E14:E39)","v":0}]

{"sheet":"Parc Maior Relev","index":6,"n_rows":21,"n_cols":7,"rows_kept":21,"cut":false,"hidden":false,"merged":[[0,1,0,6],[11,1,11,6],[1,1,1,6],[2,1,2,3],[2,4,2,6],[3,1,3,3],[3,4,3,6],[4,1,4,6],[5,1,5,3],[5,4,5,6],[9,1,9,3],[9,4,9,6],[10,1,10,6],[6,1,6,3],[6,4,6,6],[7,1,7,6],[10,0,12,0],[8,1,8,3],[8,4,8,6],[21,3,21,7],[19,1,19,6]]}
[]
[]
[null,"UNIDADE ESCOLAR",null,null,"CÓDIGO INEP"]
[null,{"$f":"Orçamento!$O$4","v":"COLÉGIO ESTADUAL DOM EMANUEL"},null,null,{"$f":"Orçamento!$V$4","v":52065812}]
[]
[null,"OBRA",null,null,"CIDADE"]
[null,{"$f":"Orçamento!$O$7","v":"REFORMA"},null,null,{"$f":"Orçamento!$V$7","v":"GOIANDIRA"}]
[]
[null,"CRE",null,null,"ÁREA TOTAL CONSTRUÍDA (M²)"]
[null,{"$f":"Orçamento!$O$10","v":"CATALÃO"},null,null,{"$f":"Orçamento!$S$13","v":2222.79}]
["FILTRO"]
[null,"PARCELA DE MAIOR RELEVÂNCIA"]
[null,"CÓDIGO","SERVIÇO","DESCRIÇÃO","UNID","QUANT","PARC. MAIOR RELEV (50%)"]
[{"$f":"IF(F14>0,\"F\",\"\")","v":"F"},"U.",{"$f":"IFERROR(VLOOKUP(B14,Orçamento!$O$709:$P$734,2,FALSE),\"(inserir código ao lado)\")","v":"REVESTIMENTO DE PISO"},"PISO DE CONCRETO DESEMPENADO","M²",{"$f":"Orçamento!T146+Orçamento!T412+Orçamento!T595+Orçamento!T678","v":295.64},{"$f":"F14*0.5","v":147.82}]
[{"$f":"IF(F15>0,\"F\",\"\")","v":""}]
[{"$f":"IF(F16>0,\"F\",\"\")","v":""},null,{"$f":"IFERROR(VLOOKUP(B16,Orçamento!$O$709:$P$734,2,FALSE),\"(inserir código ao lado)\")","v":"(inserir código ao lado)"},null,{"$f":"IFERROR(VLOOKUP($D16,Orçamento!$R$20:$W$690,2,FALSE),\"-\")","v":"-"},{"$f":"SUMIF(Orçamento!$R$20:$R$690,'Parc Maior Relev'!D16,Orçamento!$T$20:$T$690)","v":0},{"$f":"F16*0.5","v":0}]
["",null,{"$f":"IFERROR(VLOOKUP(B17,Orçamento!$O$709:$P$734,2,FALSE),\"(inserir código ao lado)\")","v":"(inserir código ao lado)"},null,{"$f":"IFERROR(VLOOKUP($D17,Orçamento!$R$20:$W$690,2,FALSE),\"-\")","v":"-"},{"$f":"SUMIF(Orçamento!$R$20:$R$690,'Parc Maior Relev'!D17,Orçamento!$T$20:$T$690)","v":0},0]
["",null,{"$f":"IFERROR(VLOOKUP(B18,Orçamento!$O$709:$P$734,2,FALSE),\"(inserir código ao lado)\")","v":"(inserir código ao lado)"},null,{"$f":"IFERROR(VLOOKUP($D18,Orçamento!$R$20:$W$690,2,FALSE),\"-\")","v":"-"},{"$f":"SUMIF(Orçamento!$R$20:$R$690,'Parc Maior Relev'!D18,Orçamento!$T$20:$T$690)","v":0},0]
["F"]
["F","(*) Para os fins do inciso I dp § 1º do Art. 30 da Lei Federal 8.666/93, são consideradas parcelas de maior relevância técnica as execuções apresentadas"]
["F"]

{"sheet":"Composições","index":7,"n_rows":266,"n_cols":10,"rows_kept":266,"cut":false,"hidden":false,"merged":[[15,0,15,9],[13,0,13,2],[13,3,13,6],[1,0,1,9],[3,7,3,9],[4,7,4,9],[6,7,6,9],[7,7,7,9],[6,0,6,6],[10,8,10,9],[13,8,13,9],[14,0,14,9],[8,0,8,9],[5,0,5,9],[2,0,2,9],[0,0,0,8],[10,0,10,2],[10,3,10,6],[11,0,11,9],[12,0,12,2],[12,3,12,6],[12,7,12,8],[7,0,7,6],[9,0,9,2],[9,3,9,6],[9,7,9,8],[3,0,3,6],[4,0,4,6],[16,5,17,5],[16,6,16,7],[16,8,16,9],[21,1,21,7],[25,1,25,7],[16,0,17,0],[16,1,17,1],[16,2,17,2],[16,3,17,3],[16,4,17,4],[27,5,28,5],[27,6,27,7],[27,8,27,9],[33,1,33,7],[37,1,37,7],[27,0,28,0],[27,1,28,1],[27,2,28,2],[27,3,28,3],[27,4,28,4],[39,5,40,5],[39,6,39,7],[39,8,39,9],[45,1,45,7],[49,1,49,7],[39,0,40,0],[39,1,40,1],[39,2,40,2],[39,3,40,3],[39,4,40,4],[51,5,52,5],[51,6,51,7],[51,8,51,9],[57,1,57,7],[61,1,61,7],[51,0,52,0],[51,1,52,1],[51,2,52,2],[51,3,52,3],[51,4,52,4],[63,5,64,5],[63,6,63,7],[63,8,63,9],[69,1,69,7],[73,1,73,7],[63,0,64,0],[63,1,64,1],[63,2,64,2],[63,3,64,3],[63,4,64,4],[75,5,76,5],[75,6,75,7],[75,8,75,9],[81,1,81,7],[85,1,85,7],[75,0,76,0],[75,1,76,1],[75,2,76,2],[75,3,76,3],[75,4,76,4],[87,5,88,5],[87,6,87,7],[87,8,87,9],[93,1,93,7],[97,1,97,7],[87,0,88,0],[87,1,88,1],[87,2,88,2],[87,3,88,3],[87,4,88,4],[99,5,100,5],[99,6,99,7],[99,8,99,9],[105,1,105,7],[109,1,109,7],[99,0,100,0],[99,1,100,1],[99,2,100,2],[99,3,100,3],[99,4,100,4],[111,5,112,5],[111,6,111,7],[111,8,111,9],[117,1,117,7],[121,1,121,7],[111,0,112,0],[111,1,112,1],[111,2,112,2],[111,3,112,3],[111,4,112,4],[123,5,124,5],[123,6,123,7],[123,8,123,9],[129,1,129,7],[133,1,133,7],[123,0,124,0],[123,1,124,1],[123,2,124,2],[123,3,124,3],[123,4,124,4],[135,5,136,5],[135,6,135,7],[135,8,135,9],[141,1,141,7],[145,1,145,7],[135,0,136,0],[135,1,136,1],[135,2,136,2],[135,3,136,3],[135,4,136,4],[147,5,148,5],[147,6,147,7],[147,8,147,9],[153,1,153,7],[157,1,157,7],[147,0,148,0],[147,1,148,1],[147,2,148,2],[147,3,148,3],[147,4,148,4],[159,5,160,5],[159,6,159,7],[159,8,159,9],[165,1,165,7],[169,1,169,7],[159,0,160,0],[159,1,160,1],[159,2,160,2],[159,3,160,3],[159,4,160,4],[171,5,172,5],[171,6,171,7],[171,8,171,9],[177,1,177,7],[192,1,192,7],[171,0,172,0],[171,1,172,1],[171,2,172,2],[171,3,172,3],[171,4,172,4],[194,5,195,5],[194,6,194,7],[194,8,194,9],[200,1,200,7],[204,1,204,7],[194,0,195,0],[194,1,195,1],[194,2,195,2],[194,3,195,3],[194,4,195,4],[206,5,207,5],[206,6,206,7],[206,8,206,9],[210,1,210,7],[214,1,214,7],[206,0,207,0],[206,1,207,1],[206,2,207,2],[206,3,207,3],[206,4,207,4],[216,5,217,5],[216,6,216,7],[216,8,216,9],[222,1,222,7],[229,1,229,7],[216,0,217,0],[216,1,217,1],[216,2,217,2],[216,3,217,3],[216,4,217,4],[231,5,232,5],[231,6,231,7],[231,8,231,9],[237,1,237,7],[241,1,241,7],[231,0,232,0],[231,1,232,1],[231,2,232,2],[231,3,232,3],[231,4,232,4],[243,5,244,5],[243,6,243,7],[243,8,243,9],[248,1,248,7],[251,1,251,7],[243,0,244,0],[243,1,244,1],[243,2,244,2],[243,3,244,3],[243,4,244,4],[253,5,254,5],[253,6,253,7],[253,8,253,9],[259,1,259,7],[265,1,265,7],[253,0,254,0],[253,1,254,1],[253,2,254,2],[253,3,254,3],[253,4,254,4]]}
[]
[]
[]
["UNIDADE ESCOLAR",null,null,null,null,null,null,"CÓDIGO INEP"]
[{"$f":"Orçamento!$O$4","v":"COLÉGIO ESTADUAL DOM EMANUEL"},null,null,null,null,null,null,{"$f":"Orçamento!$V$4","v":52065812}]
[]
["OBRA",null,null,null,null,null,null,"CIDADE"]
[{"$f":"Orçamento!$O$7","v":"REFORMA"},null,null,null,null,null,null,{"$f":"Orçamento!$V$7","v":"GOIANDIRA"}]
[]
["CRE",null,null,"ENDEREÇO",null,null,null,"REFERÊNCIA AGETOP"]
[{"$f":"Orçamento!$O$10","v":"CATALÃO"},null,null,{"$f":"Orçamento!$R$10","v":"AV ILDEFONSO TELES 1, CENTRO, CEP:75740-000"},null,null,null,{"$f":"Orçamento!$V$10","v":"DEZ/18"},{"$f":"Orçamento!$W$10","v":"DESONERADA"}]
[]
["DATA",null,null,"ÁREA TOTAL CONSTRUÍDA (M²)",null,null,null,"REFERÊNCIA SINAPI"]
[{"$f":"Orçamento!$S$7","v":"2020-05-12"},null,null,{"$f":"Orçamento!$S$13","v":2222.79},null,null,null,{"$f":"Orçamento!$V$13","v":"FEV/19"},{"$f":"Orçamento!$W$13","v":"DESONERADA"}]
[]
["COMPOSIÇÕES DE CUSTOS UNITÁRIOS - SEE-GO"]
[1,"FONTE","CÓDIGO","DESCRIÇÃO","UNIDADE","COEFIC.","CUSTO UNITÁRIO",null,"CUSTO  TOTAL (A) + (B) + (C) + (D) + (E)"]
[null,null,null,null,null,null,"DESONERADA","ONERADA","DESONERADA","ONERADA"]
[null,"COMPOSIÇÃO","COMP 001_SEE","RETIRADA DA ESTRUTURA/TABELA DE BASQUETE C/ TRANSP ATÉ CB. E CARGA","UN ","-","-","-",47.3,54.84]
[null,"AGETOP_I",5,"SERVENTE","h     ",2.5,8.1999999999999993,9.51,20.5,23.78]
[null,"AGETOP_I",4,"PEDREIRO","h     ",2,13.4,15.53,26.8,31.06]
[null,"MÃO DE OBRA (B) - TOTAL",null,null,null,null,null,null,47.3,54.84]
[null,null,null,"","",null,0,0,0,0]
[null,null,null,"","",null,0,0,0,0]
[null,null,null,"","",null,0,0,0,0]
[null,"MATERIAL (C) - TOTAL",null,null,null,null,null,null,0,0]
[]
[387,"FONTE","CÓDIGO","DESCRIÇÃO","UNIDADE","COEFIC.","CUSTO UNITÁRIO",null,"CUSTO  TOTAL (A) + (B) + (C) + (D) + (E)"]
[null,null,null,null,null,null,"DESONERADA","ONERADA","DESONERADA","ONERADA"]
[null,"COMPOSIÇÃO","COMP 387_SEE","LÂMPADA LED TUBULAR 18W ","UN ",null,null,null,22.28,22.330000000000002]
[null,"AGETOP_I",8,"AJUDANTE","h     ",1.4999999999999999E-2,8.1999999999999993,9.51,0.12,0.14000000000000001]
[null,"AGETOP_I",12,"ELETRICISTA","h     ",1.4999999999999999E-2,13.4,15.53,0.2,0.23]
[null,null,null,"","",null,0,0,0,0]
[null,"MÃO DE OBRA (B) - TOTAL",null,null,null,null,null,null,0.32,0.37]
[null,"COTAÇÃO","COT 195_SEE","LÂMPADA LED TUBULAR 18W ","UN",1,21.959999999999997,21.959999999999997,21.96,21.96]
[null,null,null,"","",null,0,0,0,0]
[null,null,null,"","",null,0,0,0,0]
[null,"MATERIAL (C) - TOTAL",null,null,null,null,null,null,21.96,21.96]
[]
[382,"FONTE","CÓDIGO","DESCRIÇÃO","UNIDADE","COEFIC.","CUSTO UNITÁRIO",null,"CUSTO  TOTAL (A) + (B) + (C) + (D) + (E)"]
[null,null,null,null,null,null,"DESONERADA","ONERADA","DESONERADA","ONERADA"]
[null,"COMPOSIÇÃO","COMP 382_SEE","TE DE REDUCAO DE FERRO GALVANIZADO, COM ROSCA BSP, DE 3/4\" X 1/2\"","UN ",null,null,null,20.6,22.69]
[null,"AGETOP_I",8,"AJUDANTE","h     ",0.6,8.1999999999999993,9.51,4.92,5.71]
[null,"AGETOP_I",11,"ENCANADOR","h     ",0.61050000000000004,13.4,15.53,8.18,9.48]
[null,null,null,"","",null,0,0,0,0]
[null,"MÃO DE OBRA (B) - TOTAL",null,null,null,null,null,null,13.1,15.190000000000001]
[null,"SINAPI_I",3146,"FITA VEDA ROSCA EM ROLOS DE 18 MM X 10 M (L X C)","UN    ",0.12075471698113208,"3,49",3.49,0.42,0.42]
[null,"SINAPI_I",6302,"TE DE REDUCAO DE FERRO GALVANIZADO, COM ROSCA BSP, DE 3/4\" X 1/2\"","UN    ",1,"7,08",7.08,7.08,7.08]
[null,null,null,"","",null,0,0,0,0]
[null,"MATERIAL (C) - TOTAL",null,null,null,null,null,null,7.5,7.5]
[]
[383,"FONTE","CÓDIGO","DESCRIÇÃO","UNIDADE","COEFIC.","CUSTO UNITÁRIO",null,"CUSTO  TOTAL (A) + (B) + (C) + (D) + (E)"]
[null,null,null,null,null,null,"DESONERADA","ONERADA","DESONERADA","ONERADA"]
[null,"COMPOSIÇÃO","COMP 383_SEE","BUCHA DE REDUCAO DE FERRO GALVANIZADO, COM ROSCA BSP, DE 1/2\" X 1/4\"","UN ",null,null,null,6.4,6.9499999999999993]
[null,"AGETOP_I",8,"AJUDANTE","h     ",0.16,8.1999999999999993,9.51,1.31,1.52]
[null,"AGETOP_I",11,"ENCANADOR","h     ",0.16,13.4,15.53,2.14,2.48]
[null,null,null,"","",null,0,0,0,0]
[null,"MÃO DE OBRA (B) - TOTAL",null,null,null,null,null,null,3.45,4]
[null,"AGETOP_I","H689","FITA VEDAROSCA 12 MM","m",1.2,0.28000000000000003,0.28000000000000003,0.34,0.34]
[null,"SINAPI_I",770,"BUCHA DE REDUCAO DE FERRO GALVANIZADO, COM ROSCA BSP, DE 1/2\" X 1/4\"","UN    ",1,"2,61",2.61,2.61,2.61]
[null,null,null,"","",null,0,0,0,0]
[null,"MATERIAL (C) - TOTAL",null,null,null,null,null,null,2.9499999999999997,2.9499999999999997]
[]
[212,"FONTE","CÓDIGO","DESCRIÇÃO","UNIDADE","COEFIC.","CUSTO UNITÁRIO",null,"CUSTO  TOTAL (A) + (B) + (C) + (D) + (E)"]
[null,null,null,null,null,null,"DESONERADA","ONERADA","DESONERADA","ONERADA"]
[null,"COMPOSIÇÃO","COMP 212_SEE","NIPLE DE REDUÇÃO 1/2\" X 1/4\" BSP","UN ",null,null,null,9.5,10.050000000000001]
[null,"AGETOP_I",8,"AJUDANTE","h     ",0.16,8.1999999999999993,9.51,1.31,1.52]
[null,"AGETOP_I",11,"ENCANADOR","h     ",0.16,13.4,15.53,2.14,2.48]
[null,null,null,"","",null,0,0,0,0]
[null,"MÃO DE OBRA (B) - TOTAL",null,null,null,null,null,null,3.45,4]
[null,"COTAÇÃO","COT 103_SEE","NIPLE DE REDUÇÃO 1/2\" X 1/4\" BSP","UN",1,6.0533333333333337,6.0533333333333337,6.05,6.05]
[null,null,null,"","",null,0,0,0,0]
[null,null,null,"","",null,0,0,0,0]
[null,"MATERIAL (C) - TOTAL",null,null,null,null,null,null,6.05,6.05]
[]
[213,"FONTE","CÓDIGO","DESCRIÇÃO","UNIDADE","COEFIC.","CUSTO UNITÁRIO",null,"CUSTO  TOTAL (A) + (B) + (C) + (D) + (E)"]
[null,null,null,null,null,null,"DESONERADA","ONERADA","DESONERADA","ONERADA"]
[null,"COMPOSIÇÃO","COMP 213_SEE","NIPLE DE REDUÇÃO 3/4\" X 1/2\" BSP","UN ",null,null,null,13.16,13.71]
[null,"AGETOP_I",8,"AJUDANTE","h     ",0.16,8.1999999999999993,9.51,1.31,1.52]
[null,"AGETOP_I",11,"ENCANADOR","h     ",0.16,13.4,15.53,2.14,2.48]
[null,null,null,"","",null,0,0,0,0]
[null,"MÃO DE OBRA (B) - TOTAL",null,null,null,null,null,null,3.45,4]
[null,"COTAÇÃO","COT 104_SEE","NIPLE DE REDUÇÃO 3/4\" X 1/2\" BSP","UN",1,9.7099999999999991,9.7099999999999991,9.7100000000000009,9.7100000000000009]
[null,null,null,"","",null,0,0,0,0]
[null,null,null,"","",null,0,0,0,0]
[null,"MATERIAL (C) - TOTAL",null,null,null,null,null,null,9.7100000000000009,9.7100000000000009]
[]
[237,"FONTE","CÓDIGO","DESCRIÇÃO","UNIDADE","COEFIC.","CUSTO UNITÁRIO",null,"CUSTO  TOTAL (A) + (B) + (C) + (D) + (E)"]
[null,null,null,null,null,null,"DESONERADA","ONERADA","DESONERADA","ONERADA"]
[null,"COMPOSIÇÃO","COMP 237_SEE","FITA ANTICORROSIVA","M",null,null,null,11.120000000000001,11.809999999999999]
[null,"AGETOP_I",8,"AJUDANTE","h     ",0.2,8.1999999999999993,9.51,1.64,1.9]
[null,"AGETOP_I",12,"ELETRICISTA","h     ",0.2,13.4,15.53,2.68,3.11]
[null,null,null,"","",null,0,0,0,0]
[null,"MÃO DE OBRA (B) - TOTAL",null,null,null,null,null,null,4.32,5.01]
[null,"SINAPI_I",39634,"FITA ADESIVA ANTICORROSIVA DE PVC FLEXIVEL, COR PRETA, PARA PROTECAO TUBULACAO, 50 MM X 30 M (L X C), E= *0,25* MM","M     ",1,"6,80",6.8,6.8,6.8]
[null,null,null,"","",null,0,0,0,0]
[null,null,null,"","",null,0,0,0,0]
[null,"MATERIAL (C) - TOTAL",null,null,null,null,null,null,6.8,6.8]
[]
[542,"FONTE","CÓDIGO","DESCRIÇÃO","UNIDADE","COEFIC.","CUSTO UNITÁRIO",null,"CUSTO  TOTAL (A) + (B) + (C) + (D) + (E)"]
[null,null,null,null,null,null,"DESONERADA","ONERADA","DESONERADA","ONERADA"]
[null,"COMPOSIÇÃO","COMP 542_SEE","VÁLVULA UGV 3/4\" (S) LATÃO","UN ",null,null,null,25.17,26.66]
[null,"AGETOP_I",8,"AJUDANTE","h     ",0.432,8.1999999999999993,9.51,3.54,4.1100000000000003]
[null,"AGETOP_I",11,"ENCANADOR","h     ",0.432,13.4,15.53,5.79,6.71]
[null,null,null,"","",null,0,0,0,0]
[null,"MÃO DE OBRA (B) - TOTAL",null,null,null,null,null,null,9.33,10.82]
[null,"COTAÇÃO","COT 281_SEE","VÁLVULA UGV 3/4\" (S) LATÃO","UN ",1,15.836666666666666,15.836666666666666,15.84,15.84]
[null,null,null,"","",null,0,0,0,0]
[null,null,null,"","",null,0,0,0,0]
[null,"MATERIAL (C) - TOTAL",null,null,null,null,null,null,15.84,15.84]
[]
[543,"FONTE","CÓDIGO","DESCRIÇÃO","UNIDADE","COEFIC.","CUSTO UNITÁRIO",null,"CUSTO  TOTAL (A) + (B) + (C) + (D) + (E)"]
[null,null,null,null,null,null,"DESONERADA","ONERADA","DESONERADA","ONERADA"]
[null,"COMPOSIÇÃO","COMP 543_SEE","VÁLVULA UGV 1/2\" (S) LATÃO","UN ",null,null,null,24.5,25.990000000000002]
[null,"AGETOP_I",8,"AJUDANTE","h     ",0.432,8.1999999999999993,9.51,3.54,4.1100000000000003]
[null,"AGETOP_I",11,"ENCANADOR","h     ",0.432,13.4,15.53,5.79,6.71]
[null,null,null,"","",null,0,0,0,0]
[null,"MÃO DE OBRA (B) - TOTAL",null,null,null,null,null,null,9.33,10.82]
[null,"COTAÇÃO","COT 282_SEE","VÁLVULA UGV 1/2\" (S) LATÃO","UN ",1,15.166666666666666,15.166666666666666,15.17,15.17]
[null,null,null,"","",null,0,0,0,0]
[null,null,null,"","",null,0,0,0,0]
[null,"MATERIAL (C) - TOTAL",null,null,null,null,null,null,15.17,15.17]
[]
[211,"FONTE","CÓDIGO","DESCRIÇÃO","UNIDADE","COEFIC.","CUSTO UNITÁRIO",null,"CUSTO  TOTAL (A) + (B) + (C) + (D) + (E)"]
[null,null,null,null,null,null,"DESONERADA","ONERADA","DESONERADA","ONERADA"]
[null,"COMPOSIÇÃO","COMP 211_SEE","REGULADOR DE 2º ESTÁGIO 5KG/H","UN ",null,null,null,85.46,89.419999999999987]
[null,"AGETOP_I",8,"AJUDANTE","h     ",1.1499999999999999,8.1999999999999993,9.51,9.43,10.94]
[null,"AGETOP_I",11,"ENCANADOR","h     ",1.1499999999999999,13.4,15.53,15.41,17.86]
[null,null,null,"","",null,0,0,0,0]
[null,"MÃO DE OBRA (B) - TOTAL",null,null,null,null,null,null,24.84,28.799999999999997]
[null,"COTAÇÃO","COT 102_SEE","REGULADOR DE 2º ESTÁGIO 5KG/H","UN",1,59.833333333333336,59.833333333333336,59.83,59.83]
[null,"AGETOP_I","H689","FITA VEDAROSCA 12 MM","m",2.82,0.28000000000000003,0.28000000000000003,0.79,0.79]
[null,null,null,"","",null,0,0,0,0]
[null,"MATERIAL (C) - TOTAL",null,null,null,null,null,null,60.62,60.62]
[]
[210,"FONTE","CÓDIGO","DESCRIÇÃO","UNIDADE","COEFIC.","CUSTO UNITÁRIO",null,"CUSTO  TOTAL (A) + (B) + (C) + (D) + (E)"]
[null,null,null,null,null,null,"DESONERADA","ONERADA","DESONERADA","ONERADA"]
[null,"COMPOSIÇÃO","COMP 210_SEE","REGULADOR DE 1º ESTÁGIO 60KG/H MODELO AP-40  COM MANÔMETRO","UN ",null,null,null,231.21,235.17000000000002]
[null,"AGETOP_I",8,"AJUDANTE","h     ",1.1499999999999999,8.1999999999999993,9.51,9.43,10.94]
[null,"AGETOP_I",11,"ENCANADOR","h     ",1.1499999999999999,13.4,15.53,15.41,17.86]
[null,null,null,"","",null,0,0,0,0]
[null,"MÃO DE OBRA (B) - TOTAL",null,null,null,null,null,null,24.84,28.799999999999997]
[null,"COTAÇÃO","COT 101_SEE","REGULADOR DE 1º ESTÁGIO 60KG/H MODELO AP-40  COM MANÔMETRO","UN",1,205.57666666666668,205.57666666666668,205.58,205.58]
[null,"AGETOP_I","H689","FITA VEDAROSCA 12 MM","m",2.82,0.28000000000000003,0.28000000000000003,0.79,0.79]
[null,null,null,"","",null,0,0,0,0]
[null,"MATERIAL (C) - TOTAL",null,null,null,null,null,null,206.37,206.37]
[]
[235,"FONTE","CÓDIGO","DESCRIÇÃO","UNIDADE","COEFIC.","CUSTO UNITÁRIO",null,"CUSTO  TOTAL (A) + (B) + (C) + (D) + (E)"]
[null,null,null,null,null,null,"DESONERADA","ONERADA","DESONERADA","ONERADA"]
[null,"COMPOSIÇÃO","COMP 235_SEE","PLACA DE SINALIZAÇÃO EM PVC COD 01 - (300X300) PROIBIDO FUMAR","UN ",null,null,null,25.269999999999996,25.389999999999997]
[null,"AGETOP_I",5,"SERVENTE","h     ",0.09,8.1999999999999993,9.51,0.74,0.86]
[null,null,null,"","",null,0,0,0,0]
[null,null,null,"","",null,0,0,0,0]
[null,"MÃO DE OBRA (B) - TOTAL",null,null,null,null,null,null,0.74,0.86]
[null,"AGETOP_I",3070,"BUCHA DE NYLON S-6","un",2,0.04,0.04,0.08,0.08]
[null,"AGETOP_I",3393,"PARAFUSO P/BUCHA S-6","un",2,0.08,0.08,0.16,0.16]
[null,"SINAPI_I",37556,"PLACA DE SINALIZACAO DE SEGURANCA CONTRA INCENDIO, FOTOLUMINESCENTE, QUADRADA, *20 X 20* CM, EM PVC *2* MM ANTI-CHAMAS (SIMBOLOS, CORES E PICTOGRAMAS CONFORME NBR 13434)","UN    ",1,"24,29",24.29,24.29,24.29]
[null,"MATERIAL (C) - TOTAL",null,null,null,null,null,null,24.529999999999998,24.529999999999998]
[]
[236,"FONTE","CÓDIGO","DESCRIÇÃO","UNIDADE","COEFIC.","CUSTO UNITÁRIO",null,"CUSTO  TOTAL (A) + (B) + (C) + (D) + (E)"]
[null,null,null,null,null,null,"DESONERADA","ONERADA","DESONERADA","ONERADA"]
[null,"COMPOSIÇÃO","COMP 236_SEE","PLACA DE SINALIZAÇÃO EM PVC COD 06 - (300X300) PERIGO INFLAMÁVEL","UN ",null,null,null,25.269999999999996,25.389999999999997]
[null,"AGETOP_I",5,"SERVENTE","h     ",0.09,8.1999999999999993,9.51,0.74,0.86]
[null,null,null,"","",null,0,0,0,0]
[null,null,null,"","",null,0,0,0,0]
[null,"MÃO DE OBRA (B) - TOTAL",null,null,null,null,null,null,0.74,0.86]
[null,"AGETOP_I",3070,"BUCHA DE NYLON S-6","un",2,0.04,0.04,0.08,0.08]
[null,"AGETOP_I",3393,"PARAFUSO P/BUCHA S-6","un",2,0.08,0.08,0.16,0.16]
[null,"SINAPI_I",37556,"PLACA DE SINALIZACAO DE SEGURANCA CONTRA INCENDIO, FOTOLUMINESCENTE, QUADRADA, *20 X 20* CM, EM PVC *2* MM ANTI-CHAMAS (SIMBOLOS, CORES E PICTOGRAMAS CONFORME NBR 13434)","UN    ",1,"24,29",24.29,24.29,24.29]
[null,"MATERIAL (C) - TOTAL",null,null,null,null,null,null,24.529999999999998,24.529999999999998]
[]
[84,"FONTE","CÓDIGO","DESCRIÇÃO","UNIDADE","COEFIC.","CUSTO UNITÁRIO",null,"CUSTO  TOTAL (A) + (B) + (C) + (D) + (E)"]
[null,null,null,null,null,null,"DESONERADA","ONERADA","DESONERADA","ONERADA"]
[null,"COMPOSIÇÃO","COMP 084_SEE","GUARDA-CORPO COM CORRIMÃO - SEDUC","M",null,null,null,204.60000000000002,209.46]
[null,"AGETOP_I",25,"OFICIAL \"B\"","h     ",1.1000000000000001,13.4,15.53,14.74,17.079999999999998]
[null,"AGETOP_I",8,"AJUDANTE","h     ",1.1000000000000001,8.1999999999999993,9.51,9.02,10.46]
[null,null,null,"","",null,0,0,0,0]
[null,"MÃO DE OBRA (B) - TOTAL",null,null,null,null,null,null,23.759999999999998,27.54]
[null,"AGETOP_I",2376,"TUBO INDUSTRIAL 2\" CHAPA 13 ","Kg",7.7778,5.23,5.23,40.68,40.68]
[null,"AGETOP_I",2504,"TUBO INDUSTRIAL D=25 MM CHAPA 13 ","Kg",4.6319999999999997,5.07,5.07,23.48,23.48]
[null,"AGETOP_I",2377,"TUBO INDUSTRIAL 40X40 CH.13","Kg",6.3419999999999996,5.07,5.07,32.15,32.15]
[null,"AGETOP_I",2421,"TUBO INDUSTRIAL 1.1/2\" CHAPA 13 ","Kg",1.4862,5.07,5.07,7.54,7.54]
[null,"AGETOP_I",2417,"MASSA PLASTICA","Kg",0.2041,10.58,10.58,2.16,2.16]
[null,"AGETOP_I",2246,"ELETRODO 2.5 OK","Kg",0.11459999999999999,8.6999999999999993,8.6999999999999993,1,1]
[null,"AGETOP_I",1672,"LIXA PARA FERRO ( NÚMERO 100 )","un",0.25509999999999999,2.12,2.12,0.54,0.54]
[null,"AGETOP_I",1264,"DISCO DE DESBASTE 7/8\" P/ CONC./FERRO (1/4\" X 7\")","un",5.0999999999999997E-2,7,7,0.36,0.36]
[null,"AGETOP_I",1334,"DISCO DE CORTE DIAM. 5/8\"- 10\"","un",0.373,5.5,5.5,2.0499999999999998,2.0499999999999998]
[null,"AGETOP_I",2902,"FABRICAÇÃO / MONTAGEM","un",1,50.44,50.44,50.44,50.44]
[null,"AGETOP_I",2150,"CHAPA DE FERRO DOBRADA No.13","Kg",0.43519999999999998,5.28,5.28,2.2999999999999998,2.2999999999999998]
[null,"AGETOP_I",2719,"CHAPA PERFILADA 3/16\"","Kg",1.0979999999999999,5.04,5.04,5.53,5.53]
[null,"AGETOP_I",2436,"ACO CA-25 - 6,3 MM (1/4\") - BARRA LISA A-36","Kg",0.38124999999999998,5.13,5.13,1.96,1.96]
[null,"AGETOP",261602,"PINT.ESMALTE/ESQUAD.FERRO C/FUNDO ANTICOR.","m2    ",0.78,13.65,15.04,10.65,11.73]
[null,"MATERIAL (C) - TOTAL",null,null,null,null,null,null,180.84000000000003,181.92000000000002]
[]
[24,"FONTE","CÓDIGO","DESCRIÇÃO","UNIDADE","COEFIC.","CUSTO UNITÁRIO",null,"CUSTO  TOTAL (A) + (B) + (C) + (D) + (E)"]
[null,null,null,null,null,null,"DESONERADA","ONERADA","DESONERADA","ONERADA"]
[null,"COMPOSIÇÃO","COMP 024_SEE","SINALIZADOR FOTOLUMINESCENTE PARA EXTINTOR","UN ",null,"-","-",25.269999999999996,25.389999999999997]
[null,"AGETOP_I",5,"SERVENTE","h     ",0.09,8.1999999999999993,9.51,0.74,0.86]
[null,null,null,"","",null,0,0,0,0]
[null,null,null,"","",null,0,0,0,0]
[null,"MÃO DE OBRA (B) - TOTAL",null,null,null,null,null,null,0.74,0.86]
[null,"AGETOP_I",3070,"BUCHA DE NYLON S-6","un",2,0.04,0.04,0.08,0.08]
[null,"AGETOP_I",3393,"PARAFUSO P/BUCHA S-6","un",2,0.08,0.08,0.16,0.16]
[null,"SINAPI_I",37556,"PLACA DE SINALIZACAO DE SEGURANCA CONTRA INCENDIO, FOTOLUMINESCENTE, QUADRADA, *20 X 20* CM, EM PVC *2* MM ANTI-CHAMAS (SIMBOLOS, CORES E PICTOGRAMAS CONFORME NBR 13434)","UN    ",1,"24,29",24.29,24.29,24.29]
[null,"MATERIAL (C) - TOTAL",null,null,null,null,null,null,24.529999999999998,24.529999999999998]
[]
[25,"FONTE","CÓDIGO","DESCRIÇÃO","UNIDADE","COEFIC.","CUSTO UNITÁRIO",null,"CUSTO  TOTAL (A) + (B) + (C) + (D) + (E)"]
[null,null,null,null,null,null,"DESONERADA","ONERADA","DESONERADA","ONERADA"]
[null,"COMPOSIÇÃO","COMP 025_SEE","SINALIZADOR FOTOLUMINESCENTE DE EMERGÊNCIA","UN ",null,"-","-",25.269999999999996,25.389999999999997]
[null,"AGETOP_I",5,"SERVENTE","h     ",0.09,8.1999999999999993,9.51,0.74,0.86]
[null,"MÃO DE OBRA (B) - TOTAL",null,null,null,null,null,null,0.74,0.86]
[null,"AGETOP_I",3070,"BUCHA DE NYLON S-6","un",2,0.04,0.04,0.08,0.08]
[null,"AGETOP_I",3393,"PARAFUSO P/BUCHA S-6","un",2,0.08,0.08,0.16,0.16]
[null,"SINAPI_I",37556,"PLACA DE SINALIZACAO DE SEGURANCA CONTRA INCENDIO, FOTOLUMINESCENTE, QUADRADA, *20 X 20* CM, EM PVC *2* MM ANTI-CHAMAS (SIMBOLOS, CORES E PICTOGRAMAS CONFORME NBR 13434)","UN    ",1,"24,29",24.29,24.29,24.29]
[null,"MATERIAL (C) - TOTAL",null,null,null,null,null,null,24.529999999999998,24.529999999999998]
[]
[277,"FONTE","CÓDIGO","DESCRIÇÃO","UNIDADE","COEFIC.","CUSTO UNITÁRIO",null,"CUSTO  TOTAL (A) + (B) + (C) + (D) + (E)"]
[null,null,null,null,null,null,"DESONERADA","ONERADA","DESONERADA","ONERADA"]
[null,"COMPOSIÇÃO","COMP 277_SEE","MARCAÇÃO NO PISO - 1X1 M PARA EXTINTOR","M2",null,null,null,28,28.080000000000002]
[null,"AGETOP_I",5,"SERVENTE","h     ",3.3300000000000003E-2,8.1999999999999993,9.51,0.27,0.32]
[null,null,null,"","",null,0,0,0,0]
[null,null,null,"","",null,0,0,0,0]
[null,"MÃO DE OBRA (B) - TOTAL",null,null,null,null,null,null,0.27,0.32]
[null,"SINAPI_I",5318,"SOLVENTE DILUENTE A BASE DE AGUARRAS","L     ",0.13,"11,97",11.97,1.56,1.56]
[null,"SINAPI",5824,"CAMINHÃO TOCO, PBT 16.000 KG, CARGA ÚTIL MÁX. 10.685 KG, DIST. ENTRE EIXOS 4,8 M, POTÊNCIA 189 CV, INCLUSIVE CARROCERIA FIXA ABERTA DE MADEIRA P/ TRANSPORTE GERAL DE CARGA SECA, DIMEN. APROX. 2,5 X 7,00 X 0,50 M - CHP DIURNO. AF_06/2014","CHP",3.3E-3,136.72,139.93,0.45,0.46]
[null,"SINAPI_I",7343,"TINTA A BASE DE RESINA ACRILICA, PARA SINALIZACAO HORIZONTAL VIARIA (NBR 11862)","L     ",0.6,"11,17",11.17,6.7,6.7]
[null,"SINAPI_I",7348,"TINTA ACRILICA PREMIUM PARA PISO","L     ",0.03,"12,00",12,0.36,0.36]
[null,"SINAPI_I",25972,"MICROESFERAS DE VIDRO PARA SINALIZACAO HORIZONTAL VIARIA, TIPO I-B (PREMIX) - NBR 16184","KG    ",2.14,"8,55",8.5500000000000007,18.3,18.3]
[null,"SINAPI",95133,"MÁQUINA DEMARCADORA DE FAIXA DE TRÁFEGO À FRIO, AUTOPROPELIDA, POTÊNCIA 38 HP - CHP DIURNO. AF_07/2016","CHP",3.3E-3,110.22,113.8,0.36,0.38]
[null,"MATERIAL (C) - TOTAL",null,null,null,null,null,null,27.73,27.76]
[]
[387,"FONTE","CÓDIGO","DESCRIÇÃO","UNIDADE","COEFIC.","CUSTO UNITÁRIO",null,"CUSTO  TOTAL (A) + (B) + (C) + (D) + (E)"]
[null,null,null,null,null,null,"DESONERADA","ONERADA","DESONERADA","ONERADA"]
[null,"COMPOSIÇÃO","COMP 387_SEE","LÂMPADA LED TUBULAR 18W ","UN ",null,null,null,22.28,22.330000000000002]
[null,"AGETOP_I",8,"AJUDANTE","h     ",1.4999999999999999E-2,8.1999999999999993,9.51,0.12,0.14000000000000001]
[null,"AGETOP_I",12,"ELETRICISTA","h     ",1.4999999999999999E-2,13.4,15.53,0.2,0.23]
[null,null,null,"","",null,0,0,0,0]
[null,"MÃO DE OBRA (B) - TOTAL",null,null,null,null,null,null,0.32,0.37]
[null,"COTAÇÃO","COT 195_SEE","LÂMPADA LED TUBULAR 18W ","UN",1,21.959999999999997,21.959999999999997,21.96,21.96]
[null,null,null,"","",null,0,0,0,0]
[null,null,null,"","",null,0,0,0,0]
[null,"MATERIAL (C) - TOTAL",null,null,null,null,null,null,21.96,21.96]
[]
[209,"FONTE","CÓDIGO","DESCRIÇÃO","UNIDADE","COEFIC.","CUSTO UNITÁRIO",null,"CUSTO  TOTAL (A) + (B) + (C) + (D) + (E)"]
[null,null,null,null,null,null,"DESONERADA","ONERADA","DESONERADA","ONERADA"]
[null,"COMPOSIÇÃO","COMP 209_SEE","TOALHEIRO PLÁSTICO TIPO DISPENSER PARA PAPEL TOALHA INTERFOLHADO","UN ",null,null,null,47.76,48.62]
[null,"AGETOP_I",8,"AJUDANTE","h     ",0.25,8.1999999999999993,9.51,2.0499999999999998,2.38]
[null,"AGETOP_I",4,"PEDREIRO","h     ",0.25,13.4,15.53,3.35,3.88]
[null,"MÃO DE OBRA (B) - TOTAL",null,null,null,null,null,null,5.4,6.26]
[null,"SINAPI_I",37401,"TOALHEIRO PLASTICO TIPO DISPENSER PARA PAPEL TOALHA INTERFOLHADO","UN    ",1,"41,56",41.56,41.56,41.56]
[null,"AGETOP_I",2221,"PARAFUSO COM BUCHA S-8","un",4,0.2,0.2,0.8,0.8]
[null,"MATERIAL (C) - TOTAL",null,null,null,null,null,null,42.36,42.36]
[]
[541,"FONTE","CÓDIGO","DESCRIÇÃO","UNIDADE","COEFIC.","CUSTO UNITÁRIO",null,"CUSTO  TOTAL (A) + (B) + (C) + (D) + (E)"]
[null,null,null,null,null,null,"DESONERADA","ONERADA","DESONERADA","ONERADA"]
[null,"COMPOSIÇÃO","COMP 541_SEE","BANCADA DE GRANITO CINZA POLIDO - FORNECIMENTO E INSTALAÇÃO. ","M2    ",null,null,null,464.13,468.99]
[null,"SINAPI",88274,"MARMORISTA/GRANITEIRO COM ENCARGOS COMPLEMENTARES","H",1.6555555555555557,17.37,19.420000000000002,28.76,32.15]
[null,"SINAPI",88316,"SERVENTE COM ENCARGOS COMPLEMENTARES","H",1.088888888888889,12.87,14.22,14.01,15.48]
[null,null,null,"","",null,0,0,0,0]
[null,"MÃO DE OBRA (B) - TOTAL",null,null,null,null,null,null,42.77,47.629999999999995]
[null,"SINAPI_I",4823,"MASSA PLASTICA PARA MARMORE/GRANITO","KG    ",0.58088888888888901,"29,24",29.24,16.989999999999998,16.989999999999998]
[null,"SINAPI_I",7568,"BUCHA DE NYLON SEM ABA S10, COM PARAFUSO DE 6,10 X 65 MM EM ACO ZINCADO COM ROSCA SOBERBA, CABECA CHATA E FENDA PHILLIPS","UN    ",6.666666666666667,"0,43",0.43,2.87,2.87]
[null,"SINAPI_I",11795,"GRANITO PARA BANCADA, POLIDO, TIPO ANDORINHA/ QUARTZ/ CASTELO/ CORUMBA OU OUTROS EQUIVALENTES DA REGIAO, E=  *2,5* CM","M2    ",1.1166666666666667,"290,56",290.56,324.45999999999998,324.45999999999998]
[null,"SINAPI_I",37329,"REJUNTE EPOXI BRANCO","KG    ",3.9E-2,"39,87",39.869999999999997,1.55,1.55]
[null,"SINAPI_I",37591,"SUPORTE MAO-FRANCESA EM ACO, ABAS IGUAIS 40 CM, CAPACIDADE MINIMA 70 KG, BRANCO","UN    ",2.2222222222222223,"33,97",33.97,75.489999999999995,75.489999999999995]
[null,"MATERIAL (C) - TOTAL",null,null,null,null,null,null,421.36,421.36]