{"text_format":"1","workbook":"xlsx","n_sheets":8,"sheets":["Orçamento","Resumo ","Somatório","Cronog_90_Dias","Composição BDI","Relatório CENTRAL","Parc Maior Relev","Composições"],"not_rendered":{"charts":0,"images":3,"macros":1,"external_links":1,"defined_names":123,"comments":3,"pivot_tables":0},"unopened":[],"bounds":{"document_bytes":16777216,"sheet_cells":100000,"rows_first":2000,"rows_last":500,"rows_between":2000,"halvings":0,"cell_chars":16384,"cell_head_chars":4096},"cells_cut":0,"cells_raw":0,"read":"whole","date_system":"1900"}

{"sheet":"Orçamento","index":0,"n_rows":385,"n_cols":24,"rows_kept":385,"cut":false,"hidden":false,"merged":[[320,16,320,22],[355,18,355,20],[355,21,355,22],[0,14,0,22],[8,14,8,16],[9,14,9,16],[11,14,11,16],[12,14,12,16],[14,14,14,22],[1,14,1,22],[4,14,4,22],[7,14,7,22],[339,18,339,20],[339,21,339,22],[347,21,347,22],[336,15,336,17],[337,15,337,17],[338,15,338,17],[340,21,340,22],[348,18,348,20],[348,21,348,22],[346,18,346,20],[346,21,346,22],[354,18,354,20],[354,21,354,22],[341,18,341,20],[341,21,341,22],[334,18,334,20],[334,21,334,22],[356,18,356,20],[356,21,356,22],[310,20,310,21],[332,18,332,20],[332,21,332,22],[333,18,333,20],[333,21,333,22],[331,18,331,20],[331,21,331,22],[340,18,340,20],[311,20,311,21],[322,18,322,22],[328,18,328,20],[328,21,328,22],[329,18,329,20],[329,21,329,22],[330,18,330,20],[330,21,330,22],[353,18,353,20],[353,21,353,22],[350,21,350,22],[351,18,351,20],[351,21,351,22],[352,18,352,20],[352,21,352,22],[342,18,342,20],[342,21,342,22],[349,18,349,20],[349,21,349,22],[344,21,344,22],[345,18,345,20],[345,21,345,22],[347,18,347,20],[343,18,343,20],[343,21,343,22],[344,18,344,20],[348,15,348,17],[349,15,349,17],[350,15,350,17],[351,15,351,17],[352,15,352,17],[325,14,325,23],[314,20,314,21],[313,20,313,21],[309,17,314,17],[309,20,309,21],[326,18,326,20],[326,21,326,22],[327,18,327,20],[327,21,327,22],[315,20,315,21],[335,18,335,20],[335,21,335,22],[336,18,336,20],[336,21,336,22],[337,18,337,20],[337,21,337,22],[338,18,338,20],[338,21,338,22],[350,18,350,20],[327,15,327,17],[328,15,328,17],[329,15,329,17],[330,15,330,17],[331,15,331,17],[332,15,332,17],[333,15,333,17],[334,15,334,17],[335,15,335,17],[339,15,339,17],[340,15,340,17],[341,15,341,17],[342,15,342,17],[343,15,343,17],[344,15,344,17],[345,15,345,17],[346,15,346,17],[347,15,347,17],[317,16,317,22],[318,16,318,22],[319,16,319,22],[3,21,3,22],[2,21,2,22],[5,21,5,22],[10,14,10,23],[13,14,13,23],[6,21,6,22],[9,17,9,20],[2,14,2,20],[3,14,3,20],[5,18,5,20],[6,18,6,20],[11,18,11,20],[12,18,12,20],[6,14,6,17],[5,14,5,17],[321,16,321,22],[384,18,384,20],[384,21,384,22],[381,14,381,17],[378,15,378,17],[378,18,378,20],[378,21,378,22],[379,15,379,17],[379,18,379,20],[379,21,379,22],[380,15,380,17],[380,18,380,20],[380,21,380,22],[383,18,383,20],[383,21,383,22],[382,18,382,20],[382,21,382,22],[359,14,359,23],[360,18,360,20],[360,21,360,22],[361,15,361,17],[361,18,361,20],[361,21,361,22],[362,15,362,17],[353,14,353,17],[360,15,360,17],[326,15,326,17],[381,18,381,20],[381,21,381,22],[369,15,369,17],[369,18,369,20],[369,21,369,22],[370,15,370,17],[370,18,370,20],[370,21,370,22],[371,15,371,17],[371,18,371,20],[371,21,371,22],[375,15,375,17],[375,18,375,20],[375,21,375,22],[376,15,376,17],[376,18,376,20],[376,21,376,22],[377,15,377,17],[366,15,366,17],[362,18,362,20],[362,21,362,22],[377,18,377,20],[377,21,377,22],[372,15,372,17],[372,18,372,20],[372,21,372,22],[373,15,373,17],[373,18,373,20],[373,21,373,22],[374,15,374,17],[374,18,374,20],[374,21,374,22],[366,18,366,20],[366,21,366,22],[367,15,367,17],[367,18,367,20],[367,21,367,22],[368,15,368,17],[368,18,368,20],[368,21,368,22],[363,15,363,17],[363,18,363,20],[363,21,363,22],[364,15,364,17],[364,18,364,20],[364,21,364,22],[365,15,365,17],[365,18,365,20],[365,21,365,22]]}
[]
[]
[null,null,null,null,null,null,null,null,null,null,null,null,null,null,"UNIDADE ESCOLAR",null,null,null,null,null,null,"CÓDIGO INEP"]
[null,null,null,null,null,null,null,null,null,null,null,null,null,null,"COLÉGIO ESTADUAL CORONEL ERNESTO ANTONIO DE ARAÚJO",null,null,null,null,null,null,52041824]
[]
["Nmax",null,null,null,null,null,null,null,null,null,null,null,null,null,"OBRA",null,null,null,"DATA",null,null,"CIDADE"]
[{"$f":"MAX($C$18:$C$309)","v":4},null,null,null,null,null,null,null,null,null,null,null,null,null,"IMPLANTAÇÃO",null,null,null,"2020-05-12",null,null,"POSSE"]
[]
[null,null,null,null,null,null,null,null,null,null,null,null,null,null,"CRE",null,null,"ENDEREÇO",null,null,null,"REFERÊNCIA AGETOP"]
[null,null,null,null,null,null,null,null,null,null,null,null,null,null,"POSSE",null,null,"RUA JESUS JOSE DE ALMEIDA, CENTRO, CEP:73900-000",null,null,null,"ABR/19","ONERADA"]
[]
[null,null,null,null,null,null,null,null,null,null,null,null,null,null,"ÁREA EXISTENTE (M²)",null,null,"ÁREA A CONSTRUIR (M²)","ÁREA TOTAL CONSTRUÍDA (M²)",null,null,"REFERÊNCIA SINAPI"]
[null,null,null,null,null,null,null,null,null,null,null,null,null,null,842.35,null,null,432.77,1275.1199999999999,null,null,"SET/19","ONERADA"]
[]
[null,null,null,null,null,null,null,null,null,null,null,"FILTRO",null,null,"PLANILHA ORÇAMENTÁRIA"]
["Nível E","Save Nivel","Nível C","Altura","n1","n2","n3","n4","n5","Czero","Cnível","↓","Nível","Nível Corrigido","ITEM","TABELA","CODIGO","DESCRIÇÃO DOS SERVIÇOS","UNID","QUANT","MAT","MO","T.SERVIÇO","OBSERVAÇÕES¹"]
[{"$f":"CHOOSE(1+LOG(1+2*(ORÇAMENTO.Nivel=\"Nível 1\")+4*(ORÇAMENTO.Nivel=\"Nível 2\")+8*(ORÇAMENTO.Nivel=\"Nível 3\")+16*(ORÇAMENTO.Nivel=\"Nível 4\")+32*(ORÇAMENTO.Nivel=\"Serviço\"),2),0,1,2,3,4,\"S\")","v":"S"},{"$f":"IF(OR(C17=\"s\",C17=0),OFFSET(B17,-1,0),C17)","v":"Save Nivel"},{"$f":"IF(OFFSET(C17,-1,0)=\"L\",1,IF(OFFSET(C17,-1,0)=1,2,IF(OR(A17=\"s\",A17=0),\"S\",IF(AND(OFFSET(C17,-1,0)=2,A17=4),3,IF(AND(OR(OFFSET(C17,-1,0)=\"s\",OFFSET(C17,-1,0)=0),A17<>\"s\",A17>OFFSET(B17,-1,0)),OFFSET(B17,-1,0),A17)))))","v":"S"},{"$f":"IF(OR(C17=\"S\",C17=0),0,IF(ISERROR(K17),J17,SMALL(J17:K17,1)))","v":0},{"$f":"IF($C17=1,OFFSET(E17,-1,0)+1,OFFSET(E17,-1,0))","v":"n1"},{"$f":"IF($C17=1,0,IF($C17=2,OFFSET(F17,-1,0)+1,OFFSET(F17,-1,0)))","v":"n2"},{"$f":"IF(AND($C17<=2,$C17<>0),0,IF($C17=3,OFFSET(G17,-1,0)+1,OFFSET(G17,-1,0)))","v":"n3"},{"$f":"IF(AND($C17<=3,$C17<>0),0,IF($C17=4,OFFSET(H17,-1,0)+1,OFFSET(H17,-1,0)))","v":"n4"},{"$f":"IF(AND($C17<=4,$C17<>0),0,IF(AND($C17=\"S\",$W17>0),OFFSET(I17,-1,0)+1,OFFSET(I17,-1,0)))","v":"n5"},{"$f":"IF(OR($C17=\"S\",$C17=0),0,MATCH(0,OFFSET($D17,1,$C17,ROW($C$309)-ROW($C17)),0))","v":0},{"$f":"IF(OR($C17=\"S\",$C17=0),0,MATCH(OFFSET($D17,0,$C17)+1,OFFSET($D17,1,$C17,ROW($C$309)-ROW($C17)),0))","v":0},"","Serviço","Serviço","-","SINAPI",null,"(sem código)","-",null,0,0,0,""]
[0,null,"L",{"$f":"COUNTA(OFFSET(D18,1,0):D$309)","v":290},{"$f":"LEFT(O19,1)-1","v":0},null,null,null,null,null,null,"F","LOTE","LOTE","IMPLANTAÇÃO - COLÉGIO ESTADUAL CORONEL ERNESTO ANTONIO DE ARAÚJO",null,null,null,null,null,null,null,363240.48]
[1,{"$f":"IF(OR(C19=\"s\",C19=0),OFFSET(B19,-1,0),C19)","v":1},{"$f":"IF(OFFSET(C19,-1,0)=\"L\",1,IF(OFFSET(C19,-1,0)=1,2,IF(OR(A19=\"s\",A19=0),\"S\",IF(AND(OFFSET(C19,-1,0)=2,A19=4),3,IF(AND(OR(OFFSET(C19,-1,0)=\"s\",OFFSET(C19,-1,0)=0),A19<>\"s\",A19>OFFSET(B19,-1,0)),OFFSET(B19,-1,0),A19)))))","v":1},{"$f":"IF(OR(C19=\"S\",C19=0),0,IF(ISERROR(K19),J19,SMALL(J19:K19,1)))","v":211},{"$f":"IF($C19=1,OFFSET(E19,-1,0)+1,OFFSET(E19,-1,0))","v":1},{"$f":"IF($C19=1,0,IF($C19=2,OFFSET(F19,-1,0)+1,OFFSET(F19,-1,0)))","v":0},{"$f":"IF(AND($C19<=2,$C19<>0),0,IF($C19=3,OFFSET(G19,-1,0)+1,OFFSET(G19,-1,0)))","v":0},{"$f":"IF(AND($C19<=3,$C19<>0),0,IF($C19=4,OFFSET(H19,-1,0)+1,OFFSET(H19,-1,0)))","v":0},0,{"$f":"IF(OR($C19=\"S\",$C19=0),0,MATCH(0,OFFSET($D19,1,$C19,ROW($C$309)-ROW($C19)),0))","v":290},{"$f":"IF(OR($C19=\"S\",$C19=0),0,MATCH(OFFSET($D19,0,$C19)+1,OFFSET($D19,1,$C19,ROW($C$309)-ROW($C19)),0))","v":211},"F","Nível 1","Nível 1","1.","AGETOP",null,"IMPLANTAÇÃO"]
[2,{"$f":"IF(OR(C20=\"s\",C20=0),OFFSET(B20,-1,0),C20)","v":2},{"$f":"IF(OFFSET(C20,-1,0)=\"L\",1,IF(OFFSET(C20,-1,0)=1,2,IF(OR(A20=\"s\",A20=0),\"S\",IF(AND(OFFSET(C20,-1,0)=2,A20=4),3,IF(AND(OR(OFFSET(C20,-1,0)=\"s\",OFFSET(C20,-1,0)=0),A20<>\"s\",A20>OFFSET(B20,-1,0)),OFFSET(B20,-1,0),A20)))))","v":2},{"$f":"IF(OR(C20=\"S\",C20=0),0,IF(ISERROR(K20),J20,SMALL(J20:K20,1)))","v":14},{"$f":"IF($C20=1,OFFSET(E20,-1,0)+1,OFFSET(E20,-1,0))","v":1},{"$f":"IF($C20=1,0,IF($C20=2,OFFSET(F20,-1,0)+1,OFFSET(F20,-1,0)))","v":1},{"$f":"IF(AND($C20<=2,$C20<>0),0,IF($C20=3,OFFSET(G20,-1,0)+1,OFFSET(G20,-1,0)))","v":0},{"$f":"IF(AND($C20<=3,$C20<>0),0,IF($C20=4,OFFSET(H20,-1,0)+1,OFFSET(H20,-1,0)))","v":0},0,210,14,"F","Nível 2","Nível 2","1.1.","AGETOP",null,"SERVIÇOS PRELIMINARES"]
[{"$f":"CHOOSE(1+LOG(1+2*(ORÇAMENTO.Nivel=\"Nível 1\")+4*(ORÇAMENTO.Nivel=\"Nível 2\")+8*(ORÇAMENTO.Nivel=\"Nível 3\")+16*(ORÇAMENTO.Nivel=\"Nível 4\")+32*(ORÇAMENTO.Nivel=\"Serviço\"),2),0,1,2,3,4,\"S\")","v":"S"},{"$f":"IF(OR(C21=\"s\",C21=0),OFFSET(B21,-1,0),C21)","v":2},{"$f":"IF(OFFSET(C21,-1,0)=\"L\",1,IF(OFFSET(C21,-1,0)=1,2,IF(OR(A21=\"s\",A21=0),\"S\",IF(AND(OFFSET(C21,-1,0)=2,A21=4),3,IF(AND(OR(OFFSET(C21,-1,0)=\"s\",OFFSET(C21,-1,0)=0),A21<>\"s\",A21>OFFSET(B21,-1,0)),OFFSET(B21,-1,0),A21)))))","v":"S"},{"$f":"IF(OR(C21=\"S\",C21=0),0,IF(ISERROR(K21),J21,SMALL(J21:K21,1)))","v":0},{"$f":"IF($C21=1,OFFSET(E21,-1,0)+1,OFFSET(E21,-1,0))","v":1},{"$f":"IF($C21=1,0,IF($C21=2,OFFSET(F21,-1,0)+1,OFFSET(F21,-1,0)))","v":1},{"$f":"IF(AND($C21<=2,$C21<>0),0,IF($C21=3,OFFSET(G21,-1,0)+1,OFFSET(G21,-1,0)))","v":0},{"$f":"IF(AND($C21<=3,$C21<>0),0,IF($C21=4,OFFSET(H21,-1,0)+1,OFFSET(H21,-1,0)))","v":0},{"$f":"IF(AND($C21<=4,$C21<>0),0,IF(AND($C21=\"S\",$W21>0),OFFSET(I21,-1,0)+1,OFFSET(I21,-1,0)))","v":0},0,0,"F","Serviço","Serviço","1.1.0.0.1.","SINAPI",97640,"REMOÇÃO DE FORROS DE DRYWALL, PVC E FIBROMINERAL, DE FORMA MANUAL, SEM REAPROVEITAMENTO. AF_12/2017","M2",691.32,null,null,null,""]
["S",2,"S",0,1,1,0,0,0,0,0,"F","Serviço","Serviço","1.1.0.0.2.","SINAPI",97642,"REMOÇÃO DE TRAMA METÁLICA OU DE MADEIRA PARA FORRO, DE FORMA MANUAL, SEM REAPROVEITAMENTO. AF_12/2017","M2",591.32000000000005,null,null,null,""]
["S",2,"S",0,1,1,0,0,0,0,0,"F","Serviço","Serviço","1.1.0.0.3.","SINAPI",97645,"REMOÇÃO DE JANELAS, DE FORMA MANUAL, SEM REAPROVEITAMENTO. AF_12/2017","M2",1,null,null,null,"Referência: AGETOP - 20106"]
["S",2,"S",0,1,1,0,0,0,0,0,"F","Serviço","Serviço","1.1.0.0.4.","SINAPI",97644,"REMOÇÃO DE PORTAS, DE FORMA MANUAL, SEM REAPROVEITAMENTO. AF_12/2017","M2",27.2,null,null,null,"Referência: AGETOP - 20106"]
["S",2,"S",0,1,1,0,0,0,0,0,"F","Serviço","Serviço","1.1.0.0.5.","AGETOP",20111,"DEM.PISO CERAM.SOBRE LASTRO CONC.C/TR.CB.E CARGA","m2    ",780.54,null,null,null,""]
["S",2,"S",0,1,1,0,0,0,0,0,"F","Serviço","Serviço","1.1.0.0.6.","SINAPI",97633,"DEMOLIÇÃO DE REVESTIMENTO CERÂMICO, DE FORMA MANUAL, SEM REAPROVEITAMENTO. AF_12/2017","M2",215,null,null,null,"Referência: AGETOP - 20115"]
["S",2,"S",0,1,1,0,0,0,0,0,"F","Serviço","Serviço","1.1.0.0.7.","SINAPI",97622,"DEMOLIÇÃO DE ALVENARIA DE BLOCO FURADO, DE FORMA MANUAL, SEM REAPROVEITAMENTO. AF_12/2017","M3",2.46,null,null,null,"Referência: AGETOP - 20118"]
["S",2,"S",0,1,1,0,0,0,0,0,"F","Serviço","Serviço","1.1.0.0.8.","AGETOP",20137,"DEMOLIÇAO BACIA SANITARIA C/ TRANSP. ATÉ CB. E CARGA","Un    ",11,null,null,null,""]
["S",2,"S",0,1,1,0,0,0,0,0,"F","Serviço","Serviço","1.1.0.0.9.","AGETOP",20138,"DEMOLIÇAO DE LAVATÓRIO C/ TRANSP. ATÉ CB. E CARGA","Un    ",4,null,null,null,""]
["S",2,"S",0,1,1,0,0,0,0,0,"F","Serviço","Serviço","1.1.0.0.10.","AGETOP",20140,"DEMOLIÇAO DE VÁLVULA DE DESCARGA C/ TRANSP. ATÉ CB. E CARGA","Un    ",11,null,null,null,""]
["S",2,"S",0,1,1,0,0,0,0,0,"F","Serviço","Serviço","1.1.0.0.11.","AGETOP",20146,"DEMOLIÇÃO DE MICTÓRIO C/ TRANSP. ATÉ CB. E CARGA","Un    ",2,null,null,null,""]
["S",2,"S",0,1,1,0,0,0,0,0,"F","Serviço","Serviço","1.1.0.0.12.","AGETOP",20163,"DEMOLIÇÃO DAS INSTALAÇÕES HIDROSANITÁRIAS E AFINS C/ TRANSP. ATÉ CB. E CARGA","H     ",1,null,null,null,""]
["S",2,"S",0,1,1,0,0,0,0,0,"F","Serviço","Serviço","1.1.0.0.13.","SINAPI","74209/1","PLACA DE OBRA EM CHAPA DE ACO GALVANIZADO","M2",7.5,null,null,null,"Referência: AGETOP - 21301"]
[2,2,2,3,1,2,0,0,0,196,3,"F","Nível 2","Nível 2","1.2.","SINAPI",null,"TRANSPORTES","-",null,null,null,null,""]
["S",2,"S",0,1,2,0,0,0,0,0,"F","Serviço","Serviço","1.2.0.0.1.","SINAPI",72900,"TRANSPORTE DE ENTULHO COM CAMINHAO BASCULANTE 6 M3, RODOVIA PAVIMENTADA, DMT 0,5 A 1,0 KM","M3",30.29,null,null,null,""]
["S",2,"S",0,1,2,0,0,0,0,0,"F","Serviço","Serviço","1.2.0.0.2.","SINAPI",72897,"CARGA MANUAL DE ENTULHO EM CAMINHAO BASCULANTE 6 M3","M3",30.29,null,null,null,""]
[2,2,2,12,1,3,0,0,0,193,12,"F","Nível 2","Nível 2","1.3.","AGETOP",null,"SERVIÇO EM TERRA","-",null,null,null,null,""]
[3,3,3,3,1,3,1,0,0,11,3,"F","Nível 3","Nível 3","1.3.1.","SINAPI",null,"INST. ELÉTRICAS","-",null,null,null,null,""]
["S",3,"S",0,1,3,1,0,0,0,0,"F","Serviço","Serviço","1.3.1.0.1.","SINAPI",93358,"ESCAVAÇÃO MANUAL DE VALA COM PROFUNDIDADE MENOR OU IGUAL A 1,30 M. AF_03/2016","M3",21.85,null,null,null,"Referência: AGETOP - 40101"]
["S",3,"S",0,1,3,1,0,0,0,0,"F","Serviço","Serviço","1.3.1.0.2.","SINAPI",96995,"REATERRO MANUAL APILOADO COM SOQUETE. AF_10/2017","M3",21.85,null,null,null,"Referência: AGETOP - 40902"]
[3,3,3,8,1,3,2,0,0,8,70,"F","Nível 3","Nível 3","1.3.2.","SINAPI",null,"AMPLIAÇÃO","-",null,null,null,null,""]
["S",3,"S",0,1,3,2,0,0,0,0,"F","Serviço","Serviço","1.3.2.0.1.","SINAPI",79480,"ESCAVACAO MECANICA CAMPO ABERTO EM SOLO EXCETO ROCHA ATE 2,00M PROFUNDIDADE","M3",238.75,null,null,null,"Referência: AGETOP - 41004"]
["S",3,"S",0,1,3,2,0,0,0,0,"F","Serviço","Serviço","1.3.2.0.2.","SINAPI",72898,"CARGA E DESCARGA MECANIZADAS DE ENTULHO EM CAMINHAO BASCULANTE 6 M3","M3",238.75,null,null,null,"Referência: AGETOP - 41005"]
["S",3,"S",0,1,3,2,0,0,0,0,"F","Serviço","Serviço","1.3.2.0.3.","AGETOP",41012,"INDENIZAÇÃO DE JAZIDA","m3    ",238.75,null,null,null,""]
["S",3,"S",0,1,3,2,0,0,0,0,"F","Serviço","Serviço","1.3.2.0.4.","AGETOP",41006,"TRANSPORTE DE MATERIAL ESCAVADO M3.KM","m3km  ",2387.5,null,null,null,""]
["S",3,"S",0,1,3,2,0,0,0,0,"F","Serviço","Serviço","1.3.2.0.5.","SINAPI","74005/2","COMPACTACAO MECANICA C/ CONTROLE DO GC>=95% DO PN (AREAS) (C/MONIVELADORA 140 HP E ROLO COMPRESSOR VIBRATORIO 80 HP)","M3",191,null,null,null,"Referência: AGETOP - 41008"]
["S",3,"S",0,1,3,2,0,0,0,0,"F","Serviço","Serviço","1.3.2.0.6.","AGETOP",41140,"REGULARIZAÇÃO DO TERRENO SEM APILOAMENTO COM TRANSPORTE MANUAL DA TERRA ESCAVADA ","m2    ",764,null,null,null,""]
["S",3,"S",0,1,3,2,0,0,0,0,"F","Serviço","Serviço","1.3.2.0.7.","AGETOP",40905,"APILOAMENTO MECÂNICO","m2    ",764,null,null,null,""]
[2,2,2,9,1,4,0,0,0,181,9,"F","Nível 2","Nível 2","1.4.",null,null,"INSTALAÇÕES ELÉTRICAS","-",null,null,null,null,""]
["S",2,"S",0,1,4,0,0,0,0,0,"F","Serviço","Serviço","1.4.0.0.1.","SINAPI",91929,"CABO DE COBRE FLEXÍVEL ISOLADO, 4 MM², ANTI-CHAMA 0,6/1,0 KV, PARA CIRCUITOS TERMINAIS - FORNECIMENTO E INSTALAÇÃO. AF_12/2015","M",237.1,null,null,null,"Referência: AGETOP - 70582"]
["S",2,"S",0,1,4,0,0,0,{"$f":"IF(OR($C51=\"S\",$C51=0),0,MATCH(0,OFFSET($D51,1,$C51,ROW($C$309)-ROW($C51)),0))","v":0},{"$f":"IF(OR($C51=\"S\",$C51=0),0,MATCH(OFFSET($D51,0,$C51)+1,OFFSET($D51,1,$C51,ROW($C$309)-ROW($C51)),0))","v":0},"F","Serviço","Serviço","1.4.0.0.2.","SINAPI",93656,"DISJUNTOR MONOPOLAR TIPO DIN, CORRENTE NOMINAL DE 25A - FORNECIMENTO E INSTALAÇÃO. AF_04/2016","UN",1,null,null,null,""]
["S",2,"S",0,1,4,0,0,0,0,0,"F","Serviço","Serviço","1.4.0.0.3.","SINAPI",91872,"ELETRODUTO RÍGIDO ROSCÁVEL, PVC, DN 32 MM (1\"), PARA CIRCUITOS TERMINAIS, INSTALADO EM PAREDE - FORNECIMENTO E INSTALAÇÃO. AF_12/2015","M",43.11,null,null,null,"Referência: AGETOP - 71202"]
["S",2,"S",0,1,4,0,0,0,0,0,"F","Serviço","Serviço","1.4.0.0.4.","SINAPI",97892,"CAIXA ENTERRADA ELÉTRICA RETANGULAR, EM ALVENARIA COM BLOCOS DE CONCRETO, FUNDO COM BRITA, DIMENSÕES INTERNAS: 0,6X0,6X0,6 M. AF_05/2018","UN",3,null,null,null,""]
["S",2,"S",0,1,4,0,0,0,0,0,"F","Serviço","Serviço","1.4.0.0.5.","SINAPI",91917,"CURVA 90 GRAUS PARA ELETRODUTO, PVC, ROSCÁVEL, DN 32 MM (1\"), PARA CIRCUITOS TERMINAIS, INSTALADA EM PAREDE - FORNECIMENTO E INSTALAÇÃO. AF_12/2015","UN",3,null,null,null,""]
["S",2,"S",0,1,4,0,0,0,0,0,"F","Serviço","Serviço","1.4.0.0.6.","AGETOP",71321,"FITA DE AUTO FUSAO, ROLO E 10,00 MM","Un    ",10,null,null,null,""]
["S",2,"S",0,1,4,0,0,0,0,0,"F","Serviço","Serviço","1.4.0.0.7.","AGETOP",71331,"FITA ISOLANTE, ROLO DE 20,00 M","Un    ",10,null,null,null,""]
["S",2,"S",0,1,4,0,0,0,0,0,"F","Serviço","Serviço","1.4.0.0.8.","SINAPI",91885,"LUVA PARA ELETRODUTO, PVC, ROSCÁVEL, DN 32 MM (1\"), PARA CIRCUITOS TERMINAIS, INSTALADA EM PAREDE - FORNECIMENTO E INSTALAÇÃO. AF_12/2015","UN",4,null,null,null,"Referência: AGETOP - 71742"]
[2,2,2,95,1,5,0,0,0,172,95,"F","Nível 2","Nível 2","1.5.","AGETOP",null,"INSTALAÇÕES HIDROSSANITÁRIAS","-",null,null,null,null,""]
[3,3,3,27,1,5,1,0,0,94,27,"F","Nível 3","Nível 3","1.5.1.","SINAPI",null,"PEÇAS E ACESSÓRIOS","-",null,null,null,null,""]
[4,4,4,9,1,5,1,1,0,26,9,"F","Nível 4","Nível 4","1.5.1.1.","SINAPI",null,"VASO SANITÁRIO / ACESSÓRIOS","-",null,null,null,null,""]
["S",4,"S",0,1,5,1,1,0,0,0,"F","Serviço","Serviço","1.5.1.1.1.","SINAPI",95470,"VASO SANITARIO SIFONADO CONVENCIONAL COM LOUÇA BRANCA, INCLUSO CONJUNTO DE LIGAÇÃO PARA BACIA SANITÁRIA AJUSTÁVEL - FORNECIMENTO E INSTALAÇÃO. AF_10/2016","UN",11,null,null,null,""]
["S",4,"S",0,1,5,1,1,0,0,0,"F","Serviço","Serviço","1.5.1.1.2.","AGETOP",80514,"TUBO DE LIGACAO PVC CROMADO 1.1/2\" / ESPUDE  - (ENTRADA)","Un    ",11,null,null,null,""]
["S",4,"S",0,1,5,1,1,0,0,0,"F","Serviço","Serviço","1.5.1.1.3.","AGETOP",80513,"TUBO PARA VÁLVULA DE DESCARGA ( CURTO 1.1/4\" )","Un    ",11,null,null,null,""]
["S",4,"S",0,1,5,1,1,0,0,0,"F","Serviço","Serviço","1.5.1.1.4.","SINAPI",99635,"VÁLVULA DE DESCARGA METÁLICA, BASE 1 1/2 \", ACABAMENTO METALICO CROMADO - FORNECIMENTO E INSTALAÇÃO. AF_01/2019","UN",11,null,null,null,"Referência: AGETOP - 80515"]
["S",4,"S",0,1,5,1,1,0,0,0,"F","Serviço","Serviço","1.5.1.1.5.","AGETOP",80520,"CONJUNTO DE FIXACAO P/VASO SANITARIO (PAR)","CJ    ",11,null,null,null,""]
["S",4,"S",0,1,5,1,1,0,0,0,"F","Serviço","Serviço","1.5.1.1.6.","AGETOP",80510,"ANEL DE VEDAÇÃO PARA VASO SANITÁRIO","Un    ",11,null,null,null,""]
["S",4,"S",0,1,5,1,1,0,0,0,"F","Serviço","Serviço","1.5.1.1.7.","AGETOP",80526,"ASSENTO EM POLIPROPILENO COM SISTEMA DE FECHAMENTO SUAVE PARA VASO SANITÁRIO","Un    ",11,null,null,null,""]
["S",4,"S",0,1,5,1,1,0,0,0,"F","Serviço","Serviço","1.5.1.1.8.","SINAPI",95544,"PAPELEIRA DE PAREDE EM METAL CROMADO SEM TAMPA, INCLUSO FIXAÇÃO. AF_10/2016","UN",11,null,null,null,""]
[4,4,4,9,1,5,1,2,0,17,9,"F","Nível 4","Nível 4","1.5.1.2.","SINAPI",null,"LAVATÓRIO / ACESSÓRIOS","-",null,null,null,null,""]
["S",4,"S",0,1,5,1,2,0,0,0,"F","Serviço","Serviço","1.5.1.2.1.","AGETOP",80590,"CUBA DE LOUCA DE EMBUTIR OVAL MÉDIA ","Un    ",5,null,null,null,""]
["S",4,"S",0,1,5,1,2,0,0,0,"F","Serviço","Serviço","1.5.1.2.2.","AGETOP",80542,"LAVATÓRIO MÉDIO SEM COLUNA","Un    ",4,null,null,null,""]
["S",4,"S",0,1,5,1,2,0,0,0,"F","Serviço","Serviço","1.5.1.2.3.","AGETOP",80550,"FIXACAO P/LAVATORIO (PAR)","PAR   ",4,null,null,null,""]
["S",4,"S",0,1,5,1,2,0,0,0,"F","Serviço","Serviço","1.5.1.2.4.","AGETOP",80556,"LIGAÇÃO FLEXÍVEL PVC DIAM.1/2\" (ENGATE)","Un    ",9,null,null,null,""]
["S",4,"S",0,1,5,1,2,0,0,0,"F","Serviço","Serviço","1.5.1.2.5.","SINAPI",86883,"SIFÃO DO TIPO FLEXÍVEL EM PVC 1\u0094 X 1.1/2\u0094 - FORNECIMENTO E INSTALAÇÃO. AF_12/2013","UN",9,null,null,null,""]
["S",4,"S",0,1,5,1,2,0,0,0,"F","Serviço","Serviço","1.5.1.2.6.","SINAPI",86915,"TORNEIRA CROMADA DE MESA, 1/2\" OU 3/4\", PARA LAVATÓRIO, PADRÃO MÉDIO - FORNECIMENTO E INSTALAÇÃO. AF_12/2013","UN",9,null,null,null,"Referência: AGETOP - 80570"]
["S",4,"S",0,1,5,1,2,0,0,0,"F","Serviço","Serviço","1.5.1.2.7.","SINAPI",86877,"VÁLVULA EM METAL CROMADO 1.1/2\" X 1.1/2\" PARA TANQUE OU LAVATÓRIO, COM OU SEM LADRÃO - FORNECIMENTO E INSTALAÇÃO. AF_12/2013","UN",9,null,null,null,"Referência: AGETOP - 80580"]
["S",4,"S",0,1,5,1,2,0,0,0,"F","Serviço","Serviço","1.5.1.2.8.","SINAPI","74234/1","MICTORIO SIFONADO DE LOUCA BRANCA COM PERTENCES, COM REGISTRO DE PRESSAO 1/2\" COM CANOPLA CROMADA ACABAMENTO SIMPLES E CONJUNTO PARA FIXACAO  - FORNECIMENTO E INSTALACAO","UN",2,null,null,null,"Referência: AGETOP - 80601"]
[4,4,4,4,1,5,1,3,0,8,4,"F","Nível 4","Nível 4","1.5.1.3.","SINAPI",null,"FILTRO E CHUVEIROS","-",null,null,null,null,""]
["S",4,"S",0,1,5,1,3,0,0,0,"F","Serviço","Serviço","1.5.1.3.1.","SINAPI",9535,"CHUVEIRO ELETRICO COMUM CORPO PLASTICO TIPO DUCHA, FORNECIMENTO E INSTALACAO","UN",2,null,null,null,""]
["S",4,"S",0,1,5,1,3,0,0,0,"F","Serviço","Serviço","1.5.1.3.2.","SINAPI",95543,"PORTA TOALHA BANHO EM METAL CROMADO, TIPO BARRA, INCLUSO FIXAÇÃO. AF_10/2016","UN",2,null,null,null,""]
["S",4,"S",0,1,5,1,3,0,0,0,"F","Serviço","Serviço","1.5.1.3.3.","SINAPI",88571,"SABONETEIRA DE SOBREPOR (FIXADA NA PAREDE), TIPO CONCHA, EM ACO INOXIDAVEL - FORNECIMENTO E INSTALACAO","UN",2,null,null,null,"Referência: AGETOP - 80741"]
[4,4,4,4,1,5,1,4,0,4,18,"F","Nível 4","Nível 4","1.5.1.4.","SINAPI",null,"REGISTROS","-",null,null,null,null,""]
["S",4,"S",0,1,5,1,4,0,{"$f":"IF(OR($C83=\"S\",$C83=0),0,MATCH(0,OFFSET($D83,1,$C83,ROW($C$309)-ROW($C83)),0))","v":0},{"$f":"IF(OR($C83=\"S\",$C83=0),0,MATCH(OFFSET($D83,0,$C83)+1,OFFSET($D83,1,$C83,ROW($C$309)-ROW($C83)),0))","v":0},"F","Serviço","Serviço","1.5.1.4.1.","AGETOP",80925,"REGISTRO DE GAVETA C/CANOPLA DIAMETRO 1/2\"","Un    ",2,null,null,null,""]
["S",4,"S",0,1,5,1,4,0,0,0,"F","Serviço","Serviço","1.5.1.4.2.","AGETOP",80926,"REGISTRO DE GAVETA C/CANOPLA DIAMETRO 3/4\"","Un    ",2,null,null,null,""]
["S",4,"S",0,1,5,1,4,0,0,0,"F","Serviço","Serviço","1.5.1.4.3.","AGETOP",80946,"REGISTRO DE PRESSAO C/CANOPLA CROMADA DIAM.3/4\"","Un    ",2,null,null,null,""]
[3,3,3,25,1,5,2,0,0,67,25,"F","Nível 3","Nível 3","1.5.2.","SINAPI",null,"ÁGUA FRIA","-",null,null,null,null,""]
[4,4,4,4,1,5,2,1,0,24,4,"F","Nível 4","Nível 4","1.5.2.1.","SINAPI",null,"TUBOS DE PVC SOLDÁVEL","-",null,null,null,null,""]
["S",4,"S",0,1,5,2,1,0,0,0,"F","Serviço","Serviço","1.5.2.1.1.","SINAPI",89402,"TUBO, PVC, SOLDÁVEL, DN 25MM, INSTALADO EM RAMAL DE DISTRIBUIÇÃO DE ÁGUA - FORNECIMENTO E INSTALAÇÃO. AF_12/2014","M",15,null,null,null,"Referência: AGETOP - 81003"]
["S",4,"S",0,1,5,2,1,0,0,0,"F","Serviço","Serviço","1.5.2.1.2.","SINAPI",89447,"TUBO, PVC, SOLDÁVEL, DN 32MM, INSTALADO EM PRUMADA DE ÁGUA - FORNECIMENTO E INSTALAÇÃO. AF_12/2014","M",7,null,null,null,""]
[{"$f":"CHOOSE(1+LOG(1+2*(ORÇAMENTO.Nivel=\"Nível 1\")+4*(ORÇAMENTO.Nivel=\"Nível 2\")+8*(ORÇAMENTO.Nivel=\"Nível 3\")+16*(ORÇAMENTO.Nivel=\"Nível 4\")+32*(ORÇAMENTO.Nivel=\"Serviço\"),2),0,1,2,3,4,\"S\")","v":"S"},4,"S",0,1,5,2,1,0,0,0,"F","Serviço","Serviço","1.5.2.1.3.","AGETOP",81006,"TUBO SOLDAVEL PVC MARROM DIAM. 50 mm","m     ",6,null,null,null,""]
[4,4,4,3,1,5,2,2,0,20,3,"F","Nível 4","Nível 4","1.5.2.2.","SINAPI",null,"ADAPTADORES DE PVC SOLDÁVEL","-",null,null,null,null,""]
["S",4,"S",0,1,5,2,2,0,0,0,"F","Serviço","Serviço","1.5.2.2.1.","SINAPI",94656,"ADAPTADOR CURTO COM BOLSA E ROSCA PARA REGISTRO, PVC, SOLDÁVEL, DN  25 MM X 3/4 , INSTALADO EM RESERVAÇÃO DE ÁGUA DE EDIFICAÇÃO QUE POSSUA RESERVATÓRIO DE FIBRA/FIBROCIMENTO   FORNECIMENTO E INSTALAÇÃO. AF_06/2016","UN",6,null,null,null,"Referência: AGETOP - 81066"]
["S",4,"S",0,1,5,2,2,0,0,0,"F","Serviço","Serviço","1.5.2.2.2.","SINAPI",94662,"ADAPTADOR CURTO COM BOLSA E ROSCA PARA REGISTRO, PVC, SOLDÁVEL, DN 50 MM X 1 1/2 , INSTALADO EM RESERVAÇÃO DE ÁGUA DE EDIFICAÇÃO QUE POSSUA RESERVATÓRIO DE FIBRA/FIBROCIMENTO   FORNECIMENTO E INSTALAÇÃO. AF_06/2016","UN",15,null,null,null,"Referência: AGETOP - 81069"]
[4,4,4,2,1,5,2,3,0,17,2,"F","Nível 4","Nível 4","1.5.2.3.","SINAPI",null,"LUVAS DE PVC","-",null,null,null,null,""]
["S",4,"S",0,1,5,2,3,0,0,0,"F","Serviço","Serviço","1.5.2.3.1.","AGETOP",81131,"LUVA SOLDAVEL C/ROSCA DIAMETRO 25 X 3/4\"","Un    ",2,null,null,null,""]
[4,4,4,4,1,5,2,4,0,15,4,"F","Nível 4","Nível 4","1.5.2.4.","SINAPI",null,"JOELHO","-",null,null,null,null,""]
["S",4,"S",0,1,5,2,4,0,0,0,"F","Serviço","Serviço","1.5.2.4.1.","AGETOP",81340,"JOELHO REDUÇÃO 90º SOLDÁVEL  32 mm X 25 mm","Un    ",4,null,null,null,""]
["S",4,"S",0,1,5,2,4,0,0,0,"F","Serviço","Serviço","1.5.2.4.2.","SINAPI",94672,"JOELHO 90 GRAUS COM BUCHA DE LATÃO, PVC, SOLDÁVEL, DN  25 MM, X 3/4\u0094 INSTALADO EM RESERVAÇÃO DE ÁGUA DE EDIFICAÇÃO QUE POSSUA RESERVATÓRIO DE FIBRA/FIBROCIMENTO   FORNECIMENTO E INSTALAÇÃO. AF_06/2016","UN",3,null,null,null,""]
["S",4,"S",0,1,5,2,4,0,0,0,"F","Serviço","Serviço","1.5.2.4.3.","SINAPI",90373,"JOELHO 90 GRAUS COM BUCHA DE LATÃO, PVC, SOLDÁVEL, DN 25MM, X 1/2\u0094 INSTALADO EM RAMAL OU SUB-RAMAL DE ÁGUA - FORNECIMENTO E INSTALAÇÃO. AF_12/2014","UN",4,null,null,null,"Referência: AGETOP - 81360"]
[4,4,4,5,1,5,2,5,0,11,5,"F","Nível 4","Nível 4","1.5.2.5.","SINAPI",null,"TÊ","-",null,null,null,null,""]
["S",4,"S",0,1,5,2,5,0,0,0,"F","Serviço","Serviço","1.5.2.5.1.","SINAPI",89617,"TE, PVC, SOLDÁVEL, DN 25MM, INSTALADO EM PRUMADA DE ÁGUA - FORNECIMENTO E INSTALAÇÃO. AF_12/2014","UN",1,null,null,null,""]
["S",4,"S",0,1,5,2,5,0,0,0,"F","Serviço","Serviço","1.5.2.5.2.","SINAPI",89443,"TE, PVC, SOLDÁVEL, DN 32MM, INSTALADO EM RAMAL DE DISTRIBUIÇÃO DE ÁGUA - FORNECIMENTO E INSTALAÇÃO. AF_12/2014","UN",2,null,null,null,"Referência: AGETOP - 81403"]
["S",4,"S",0,1,5,2,5,0,0,0,"F","Serviço","Serviço","1.5.2.5.3.","SINAPI",89441,"TÊ COM BUCHA DE LATÃO NA BOLSA CENTRAL, PVC, SOLDÁVEL, DN 25MM X 1/2\u0094, INSTALADO EM RAMAL DE DISTRIBUIÇÃO DE ÁGUA - FORNECIMENTO E INSTALAÇÃO. AF_12/2014","UN",4,null,null,null,""]
["S",4,"S",0,1,5,2,5,0,0,0,"F","Serviço","Serviço","1.5.2.5.4.","AGETOP",81425,"TE REDUCAO 90 GRAUS SOLDAVEL 50 X 32 mm","Un    ",2,null,null,null,""]
[4,4,4,3,1,5,2,6,0,6,3,"F","Nível 4","Nível 4","1.5.2.6.","SINAPI",null,"ADESIVOS","-",null,null,null,null,""]
["S",4,"S",0,1,5,2,6,0,0,0,"F","Serviço","Serviço","1.5.2.6.1.","AGETOP",81501,"ADESIVO PLASTICO - FRASCO 850 G","Un    ",3,null,null,null,""]
["S",4,"S",0,1,5,2,6,0,0,0,"F","Serviço","Serviço","1.5.2.6.2.","AGETOP",81504,"SOLUCAO LIMPADORA 1000 CM3","Un    ",3,null,null,null,""]
[4,4,4,3,1,5,2,7,0,3,{"$error":"#N/A"},"F","Nível 4","Nível 4","1.5.2.7.","SINAPI",null,"CURVAS","-",null,null,null,null,""]
["S",{"$f":"IF(OR(C109=\"s\",C109=0),OFFSET(B109,-1,0),C109)","v":4},{"$f":"IF(OFFSET(C109,-1,0)=\"L\",1,IF(OFFSET(C109,-1,0)=1,2,IF(OR(A109=\"s\",A109=0),\"S\",IF(AND(OFFSET(C109,-1,0)=2,A109=4),3,IF(AND(OR(OFFSET(C109,-1,0)=\"s\",OFFSET(C109,-1,0)=0),A109<>\"s\",A109>OFFSET(B109,-1,0)),OFFSET(B109,-1,0),A109)))))","v":"S"},{"$f":"IF(OR(C109=\"S\",C109=0),0,IF(ISERROR(K109),J109,SMALL(J109:K109,1)))","v":0},{"$f":"IF($C109=1,OFFSET(E109,-1,0)+1,OFFSET(E109,-1,0))","v":1},{"$f":"IF($C109=1,0,IF($C109=2,OFFSET(F109,-1,0)+1,OFFSET(F109,-1,0)))","v":5},{"$f":"IF(AND($C109<=2,$C109<>0),0,IF($C109=3,OFFSET(G109,-1,0)+1,OFFSET(G109,-1,0)))","v":2},{"$f":"IF(AND($C109<=3,$C109<>0),0,IF($C109=4,OFFSET(H109,-1,0)+1,OFFSET(H109,-1,0)))","v":7},{"$f":"IF(AND($C109<=4,$C109<>0),0,IF(AND($C109=\"S\",$W109>0),OFFSET(I109,-1,0)+1,OFFSET(I109,-1,0)))","v":0},0,0,"F","Serviço","Serviço","1.5.2.7.1.","SINAPI",89410,"CURVA 90 GRAUS, PVC, SOLDÁVEL, DN 25MM, INSTALADO EM RAMAL DE DISTRIBUIÇÃO DE ÁGUA - FORNECIMENTO E INSTALAÇÃO. AF_12/2014","UN",4,null,null,null,""]
["S",4,"S",0,1,5,2,7,0,0,0,"F","Serviço","Serviço","1.5.2.7.2.","SINAPI",89415,"CURVA 90 GRAUS, PVC, SOLDÁVEL, DN 32MM, INSTALADO EM RAMAL DE DISTRIBUIÇÃO DE ÁGUA - FORNECIMENTO E INSTALAÇÃO. AF_12/2014","UN",2,null,null,null,"Referência: AGETOP - 81538"]
[3,3,3,27,1,5,3,0,0,42,27,"F","Nível 3","Nível 3","1.5.3.","SINAPI",null,"ESGOTO SANITÁRIO","-",null,null,null,null,""]
[4,4,4,5,1,5,3,1,0,26,5,"F","Nível 4","Nível 4","1.5.3.1.","SINAPI",null,"CORPO DE CAIXA SIFONADA / RALO","-",null,null,null,null,""]
["S",4,"S",0,1,5,3,1,0,0,0,"F","Serviço","Serviço","1.5.3.1.1.","AGETOP",81663,"CORPO CX. SIFONADA DIAM. 150 X 150 X 50","Un    ",4,null,null,null,""]
["S",4,"S",0,1,5,3,1,0,0,0,"F","Serviço","Serviço","1.5.3.1.2.","AGETOP",81784,"GRELHA REDONDA ACO INOX ROTATIVA DIAM. 150 MM","Un    ",4,null,null,null,""]
["S",4,"S",0,1,5,3,1,0,{"$f":"IF(OR($C115=\"S\",$C115=0),0,MATCH(0,OFFSET($D115,1,$C115,ROW($C$309)-ROW($C115)),0))","v":0},{"$f":"IF(OR($C115=\"S\",$C115=0),0,MATCH(OFFSET($D115,0,$C115)+1,OFFSET($D115,1,$C115,ROW($C$309)-ROW($C115)),0))","v":0},"F","Serviço","Serviço","1.5.3.1.3.","AGETOP",81785,"GRELHA REDONDA ACO INOX SIMPLES DIAM. 100 MM","Un    ",4,null,null,null,""]
["S",4,"S",0,1,5,3,1,0,0,0,"F","Serviço","Serviço","1.5.3.1.4.","AGETOP",81681,"CORPO RALO SECO CILINDRICO 100 X 40","Un    ",2,null,null,null,""]
[4,4,4,3,1,5,3,2,0,21,3,"F","Nível 4","Nível 4","1.5.3.2.","SINAPI",null,"CURVAS","-",null,null,null,null,""]
["S",4,"S",0,1,5,3,2,0,0,0,"F","Serviço","Serviço","1.5.3.2.1.","SINAPI",89728,"CURVA CURTA 90 GRAUS, PVC, SERIE NORMAL, ESGOTO PREDIAL, DN 40 MM, JUNTA SOLDÁVEL, FORNECIDO E INSTALADO EM RAMAL DE DESCARGA OU RAMAL DE ESGOTO SANITÁRIO. AF_12/2014","UN",7,null,null,null,""]
["S",4,"S",0,1,5,3,2,0,0,0,"F","Serviço","Serviço","1.5.3.2.2.","AGETOP",81731,"CURVA 90 GRAUS CURTA DIAM. 50 MM","Un    ",2,null,null,null,""]
[4,4,4,8,1,5,3,3,0,18,8,"F","Nível 4","Nível 4","1.5.3.3.","SINAPI",null,"JOELHOS","-",null,null,null,null,""]
["S",4,"S",0,1,5,3,3,0,0,0,"F","Serviço","Serviço","1.5.3.3.1.","SINAPI",89726,"JOELHO 45 GRAUS, PVC, SERIE NORMAL, ESGOTO PREDIAL, DN 40 MM, JUNTA SOLDÁVEL, FORNECIDO E INSTALADO EM RAMAL DE DESCARGA OU RAMAL DE ESGOTO SANITÁRIO. AF_12/2014","UN",2,null,null,null,""]
["S",4,"S",0,1,5,3,3,0,0,0,"F","Serviço","Serviço","1.5.3.3.2.","SINAPI",89802,"JOELHO 45 GRAUS, PVC, SERIE NORMAL, ESGOTO PREDIAL, DN 50 MM, JUNTA ELÁSTICA, FORNECIDO E INSTALADO EM PRUMADA DE ESGOTO SANITÁRIO OU VENTILAÇÃO. AF_12/2014","UN",1,null,null,null,""]
["S",4,"S",0,1,5,3,3,0,0,0,"F","Serviço","Serviço","1.5.3.3.3.","SINAPI",89531,"JOELHO 45 GRAUS, PVC, SERIE R, ÁGUA PLUVIAL, DN 100 MM, JUNTA ELÁSTICA, FORNECIDO E INSTALADO EM RAMAL DE ENCAMINHAMENTO. AF_12/2014","UN",2,null,null,null,""]
["S",4,"S",0,1,5,3,3,0,0,0,"F","Serviço","Serviço","1.5.3.3.4.","AGETOP",81928,"JOELHO 90 GRAUS C/ANEL 50 MM","Un    ",7,null,null,null,""]
["S",4,"S",0,1,5,3,3,0,0,0,"F","Serviço","Serviço","1.5.3.3.5.","SINAPI",89724,"JOELHO 90 GRAUS, PVC, SERIE NORMAL, ESGOTO PREDIAL, DN 40 MM, JUNTA SOLDÁVEL, FORNECIDO E INSTALADO EM RAMAL DE DESCARGA OU RAMAL DE ESGOTO SANITÁRIO. AF_12/2014","UN",4,null,null,null,""]
["S",4,"S",0,1,5,3,3,0,0,0,"F","Serviço","Serviço","1.5.3.3.6.","SINAPI",89731,"JOELHO 90 GRAUS, PVC, SERIE NORMAL, ESGOTO PREDIAL, DN 50 MM, JUNTA ELÁSTICA, FORNECIDO E INSTALADO EM RAMAL DE DESCARGA OU RAMAL DE ESGOTO SANITÁRIO. AF_12/2014","UN",6,null,null,null,""]
["S",4,"S",0,1,5,3,3,0,0,0,"F","Serviço","Serviço","1.5.3.3.7.","SINAPI",89744,"JOELHO 90 GRAUS, PVC, SERIE NORMAL, ESGOTO PREDIAL, DN 100 MM, JUNTA ELÁSTICA, FORNECIDO E INSTALADO EM RAMAL DE DESCARGA OU RAMAL DE ESGOTO SANITÁRIO. AF_12/2014","UN",6,null,null,null,"Referência: AGETOP - 81938"]
[4,4,4,6,1,5,3,4,0,10,6,"F","Nível 4","Nível 4","1.5.3.4.","SINAPI",null,"TÊ","-",null,null,null,null,""]
["S",4,"S",0,1,5,3,4,0,0,0,"F","Serviço","Serviço","1.5.3.4.1.","SINAPI",89825,"TE, PVC, SERIE NORMAL, ESGOTO PREDIAL, DN 50 X 50 MM, JUNTA ELÁSTICA, FORNECIDO E INSTALADO EM PRUMADA DE ESGOTO SANITÁRIO OU VENTILAÇÃO. AF_12/2014","UN",4,null,null,null,""]
["S",4,"S",0,1,5,3,4,0,0,0,"F","Serviço","Serviço","1.5.3.4.2.","SINAPI",89796,"TE, PVC, SERIE NORMAL, ESGOTO PREDIAL, DN 100 X 100 MM, JUNTA ELÁSTICA, FORNECIDO E INSTALADO EM RAMAL DE DESCARGA OU RAMAL DE ESGOTO SANITÁRIO. AF_12/2014","UN",2,null,null,null,"Referência: AGETOP - 82235"]
["S",4,"S",0,1,5,3,4,0,0,0,"F","Serviço","Serviço","1.5.3.4.3.","AGETOP",81975,"JUNCAO SIMPLES DIAM. 100 X 100 MM","Un    ",2,null,null,null,""]
["S",4,"S",0,1,5,3,4,0,0,0,"F","Serviço","Serviço","1.5.3.4.4.","AGETOP",81973,"JUNCAO SIMPLES DIAM. 100 X 50 MM","Un    ",3,null,null,null,""]
["S",4,"S",0,1,5,3,4,0,0,0,"F","Serviço","Serviço","1.5.3.4.5.","AGETOP",81970,"JUNCAO SIMPLES DIAMETRO 50 X 50 MM","Un    ",2,null,null,null,""]
[4,4,4,4,1,5,3,5,0,4,{"$error":"#N/A"},"F","Nível 4","Nível 4","1.5.3.5.","SINAPI",null,"TUBOS","-",null,null,null,null,""]
["S",4,"S",0,1,5,3,5,0,0,0,"F","Serviço","Serviço","1.5.3.5.1.","SINAPI",89711,"TUBO PVC, SERIE NORMAL, ESGOTO PREDIAL, DN 40 MM, FORNECIDO E INSTALADO EM RAMAL DE DESCARGA OU RAMAL DE ESGOTO SANITÁRIO. AF_12/2014","M",12,null,null,null,"Referência: AGETOP - 82301"]
["S",4,"S",0,1,5,3,5,0,0,0,"F","Serviço","Serviço","1.5.3.5.2.","SINAPI",89798,"TUBO PVC, SERIE NORMAL, ESGOTO PREDIAL, DN 50 MM, FORNECIDO E INSTALADO EM PRUMADA DE ESGOTO SANITÁRIO OU VENTILAÇÃO. AF_12/2014","M",27,null,null,null,""]
["S",4,"S",0,1,5,3,5,0,0,0,"F","Serviço","Serviço","1.5.3.5.3.","SINAPI",89800,"TUBO PVC, SERIE NORMAL, ESGOTO PREDIAL, DN 100 MM, FORNECIDO E INSTALADO EM PRUMADA DE ESGOTO SANITÁRIO OU VENTILAÇÃO. AF_12/2014","M",18,null,null,null,""]
[3,3,3,4,1,5,4,0,0,15,4,"F","Nível 3","Nível 3","1.5.4.","SINAPI",null,"OUTROS","-",null,null,null,null,""]
["S",3,"S",0,1,5,4,0,0,0,0,"F","Serviço","Serviço","1.5.4.0.1.","AGETOP",81825,"CAIXA DE PASSAGEM 60 X 60 CM SEM TAMPA","Un    ",2,null,null,null,""]
["S",3,"S",0,1,5,4,0,0,0,0,"F","Serviço","Serviço","1.5.4.0.2.","AGETOP",81826,"TAMPA EM CONCRETO ARMADO 25 MPA E=5CM PARA A CAIXA DE PASSAGEM 60X60CM","Un    ",2,null,null,null,""]
["S",3,"S",0,1,5,4,0,0,0,0,"F","Serviço","Serviço","1.5.4.0.3.","AGETOP",81885,"TERMINAL DE VENTILACAO DIAMETRO 50 MM","Un    ",4,null,null,null,""]
[3,{"$f":"IF(OR(C142=\"s\",C142=0),OFFSET(B142,-1,0),C142)","v":3},{"$f":"IF(OFFSET(C142,-1,0)=\"L\",1,IF(OFFSET(C142,-1,0)=1,2,IF(OR(A142=\"s\",A142=0),\"S\",IF(AND(OFFSET(C142,-1,0)=2,A142=4),3,IF(AND(OR(OFFSET(C142,-1,0)=\"s\",OFFSET(C142,-1,0)=0),A142<>\"s\",A142>OFFSET(B142,-1,0)),OFFSET(B142,-1,0),A142)))))","v":3},{"$f":"IF(OR(C142=\"S\",C142=0),0,IF(ISERROR(K142),J142,SMALL(J142:K142,1)))","v":11},{"$f":"IF($C142=1,OFFSET(E142,-1,0)+1,OFFSET(E142,-1,0))","v":1},{"$f":"IF($C142=1,0,IF($C142=2,OFFSET(F142,-1,0)+1,OFFSET(F142,-1,0)))","v":5},{"$f":"IF(AND($C142<=2,$C142<>0),0,IF($C142=3,OFFSET(G142,-1,0)+1,OFFSET(G142,-1,0)))","v":5},{"$f":"IF(AND($C142<=3,$C142<>0),0,IF($C142=4,OFFSET(H142,-1,0)+1,OFFSET(H142,-1,0)))","v":0},{"$f":"IF(AND($C142<=4,$C142<>0),0,IF(AND($C142=\"S\",$W142>0),OFFSET(I142,-1,0)+1,OFFSET(I142,-1,0)))","v":0},11,{"$error":"#N/A"},"F","Nível 3","Nível 3","1.5.5.","SINAPI",null,"INSTALAÇÕES DE INCENDIO","-",null,null,null,null,""]
["S",3,"S",0,1,5,5,0,0,0,0,"F","Serviço","Serviço","1.5.5.0.1.","AGETOP",85003,"EXTINTOR PO QUIMICO SECO (6 KG) - CAPACIDADE EXTINTORA 20 BC","Un    ",1,null,null,null,""]
["S",3,"S",0,1,5,5,0,0,0,0,"F","Serviço","Serviço","1.5.5.0.2.","AGETOP",85006,"EXTINTOR MULTI USO EM PO A B C (6 KG) - CAPACIDADE EXTINTORA 3A 20BC","un    ",4,null,null,null,""]
["S",3,"S",0,1,5,5,0,0,0,0,"F","Serviço","Serviço","1.5.5.0.3.","SINAPI",97599,"LUMINÁRIA DE EMERGÊNCIA - FORNECIMENTO E INSTALAÇÃO. AF_11/2017","UN",9,null,null,null,""]
["S",3,"S",0,1,5,5,0,0,0,0,"F","Serviço","Serviço","1.5.5.0.4.","COMPOSIÇÃO","COMP 024_SEE","SINALIZADOR FOTOLUMINESCENTE PARA EXTINTOR","UN ",5,null,null,null,""]
["S",3,"S",0,1,5,5,0,0,{"$f":"IF(OR($C147=\"S\",$C147=0),0,MATCH(0,OFFSET($D147,1,$C147,ROW($C$309)-ROW($C147)),0))","v":0},{"$f":"IF(OR($C147=\"S\",$C147=0),0,MATCH(OFFSET($D147,0,$C147)+1,OFFSET($D147,1,$C147,ROW($C$309)-ROW($C147)),0))","v":0},"F","Serviço","Serviço","1.5.5.0.5.","COMPOSIÇÃO","COMP 025_SEE","SINALIZADOR FOTOLUMINESCENTE DE EMERGÊNCIA","UN ",34,null,null,null,""]
["S",3,"S",0,1,5,5,0,0,0,0,"F","Serviço","Serviço","1.5.5.0.6.","COMPOSIÇÃO","COMP 277_SEE","MARCAÇÃO NO PISO - 1X1 M PARA EXTINTOR","M2",5,null,null,null,""]
["S",3,"S",0,1,5,5,0,0,0,0,"F","Serviço","Serviço","1.5.5.0.7.","COMPOSIÇÃO","COMP 235_SEE","PLACA DE SINALIZAÇÃO EM PVC COD 01 - (300X300) PROIBIDO FUMAR","UN ",2,null,null,null,""]
["S",3,"S",0,1,5,5,0,0,0,0,"F","Serviço","Serviço","1.5.5.0.8.","COMPOSIÇÃO","COMP 236_SEE","PLACA DE SINALIZAÇÃO EM PVC COD 06 - (300X300) PERIGO INFLAMÁVEL","UN ",2,null,null,null,""]
["S",3,"S",0,1,5,5,0,0,0,0,"F","Serviço","Serviço","1.5.5.0.9.","COMPOSIÇÃO","COMP 411_SEE","PLACA DE SINALIZAÇÃO EM PVC COD 13 - (316X158) SAÍDA DE EMERGÊNCIA","UN ",2,null,null,null,""]
["S",3,"S",0,1,5,5,0,0,0,0,"F","Serviço","Serviço","1.5.5.0.10.","COMPOSIÇÃO","COMP 412_SEE","PLACA DE SINALIZAÇÃO EM PVC COD 17 - (316X158) MENSAGEM \"SAÍDA\"","UN ",1,null,null,null,""]
[2,2,2,27,1,6,0,0,0,77,27,"F","Nível 2","Nível 2","1.6.","AGETOP",80723,"INSTALAÇÕES ESPECIAIS","Un    ",2,null,null,null,""]
["S",2,"S",0,1,6,0,0,0,0,0,"F","Serviço","Serviço","1.6.0.0.1.","AGETOP",91007,"CENTRAL DE GÁS PADRÃO GOINFRA SEM INSTALAÇÕES (1+1 CILINDRO 45 KG)","Un    ",1,null,null,null,""]
["S",2,"S",0,1,6,0,0,0,0,0,"F","Serviço","Serviço","1.6.0.0.2.","AGETOP",91023,"UNIÃO S/BRONZE PRETA 3/4\" NPT 300 LBS","Un    ",3,null,null,null,""]
["S",2,"S",0,1,6,0,0,0,0,0,"F","Serviço","Serviço","1.6.0.0.3.","COMPOSIÇÃO","COMP 382_SEE","TE DE REDUCAO DE FERRO GALVANIZADO, COM ROSCA BSP, DE 3/4\" X 1/2\"","UN ",1,null,null,null,""]
["S",2,"S",0,1,6,0,0,0,0,0,"F","Serviço","Serviço","1.6.0.0.4.","COMPOSIÇÃO","COMP 383_SEE","BUCHA DE REDUCAO DE FERRO GALVANIZADO, COM ROSCA BSP, DE 1/2\" X 1/4\"","UN ",3,null,null,null,""]
["S",2,"S",0,1,6,0,0,0,0,0,"F","Serviço","Serviço","1.6.0.0.5.","AGETOP",91021,"LUVA GALVANIZADO DE REDUÇÃO 3/4\" X 1/2\" (GÁS)","Un    ",2,null,null,null,""]
["S",2,"S",0,1,6,0,0,0,0,0,"F","Serviço","Serviço","1.6.0.0.6.","SINAPI",92692,"NIPLE, EM FERRO GALVANIZADO, CONEXÃO ROSQUEADA, DN 15 (1/2\"), INSTALADO EM RAMAIS E SUB-RAMAIS DE GÁS - FORNECIMENTO E INSTALAÇÃO. AF_12/2015","UN",6,null,null,null,""]
["S",2,"S",0,1,6,0,0,0,0,0,"F","Serviço","Serviço","1.6.0.0.7.","AGETOP",91031,"NIPLE DUPLO 300 PSI 3/4\"","Un    ",6,null,null,null,""]
["S",2,"S",0,1,6,0,0,0,0,0,"F","Serviço","Serviço","1.6.0.0.8.","COMPOSIÇÃO","COMP 212_SEE","NIPLE DE REDUÇÃO 1/2\" X 1/4\" BSP","UN ",4,null,null,null,""]
["S",2,"S",0,1,6,0,0,0,0,0,"F","Serviço","Serviço","1.6.0.0.9.","COMPOSIÇÃO","COMP 213_SEE","NIPLE DE REDUÇÃO 3/4\" X 1/2\" BSP","UN ",4,null,null,null,""]
["S",2,"S",0,1,6,0,0,0,0,0,"F","Serviço","Serviço","1.6.0.0.10.","SINAPI",92688,"TUBO DE AÇO GALVANIZADO COM COSTURA, CLASSE MÉDIA, CONEXÃO ROSQUEADA, DN 20 (3/4\"), INSTALADO EM RAMAIS E SUB-RAMAIS DE GÁS - FORNECIMENTO E INSTALAÇÃO. AF_12/2015","M",12,null,null,null,""]
["S",2,"S",0,1,6,0,0,0,0,0,"F","Serviço","Serviço","1.6.0.0.11.","SINAPI",92701,"JOELHO 90 GRAUS, EM FERRO GALVANIZADO, CONEXÃO ROSQUEADA, DN 20 (3/4\"), INSTALADO EM RAMAIS E SUB-RAMAIS DE GÁS - FORNECIMENTO E INSTALAÇÃO. AF_12/2015","UN",7,null,null,null,""]
["S",2,"S",0,1,6,0,0,0,0,0,"F","Serviço","Serviço","1.6.0.0.12.","COMPOSIÇÃO","COMP 237_SEE","FITA ANTICORROSIVA","M",8,null,null,null,""]
["S",2,"S",0,1,6,0,0,0,0,0,"F","Serviço","Serviço","1.6.0.0.13.","AGETOP",91025,"VÁLVULA ESFERICA LATÃO 3/4\"","Un    ",3,null,null,null,""]
["S",2,"S",0,1,6,0,0,0,0,0,"F","Serviço","Serviço","1.6.0.0.14.","AGETOP",91019,"TE PRETO 90º 3/4\" NPT 300 LBS","Un    ",1,null,null,null,""]
["S",2,"S",0,1,6,0,0,0,0,0,"F","Serviço","Serviço","1.6.0.0.15.","COMPOSIÇÃO","COMP 542_SEE","VÁLVULA UGV 3/4\" (S) LATÃO","UN ",4,null,null,null,""]
["S",2,"S",0,1,6,0,0,0,0,0,"F","Serviço","Serviço","1.6.0.0.16.","COMPOSIÇÃO","COMP 543_SEE","VÁLVULA UGV 1/2\" (S) LATÃO","UN ",4,null,null,null,""]
["S",2,"S",0,1,6,0,0,0,0,0,"F","Serviço","Serviço","1.6.0.0.17.","AGETOP",91029,"VALVULA DE RETENÇÃO LATÃO 1/2\" X 7/16\" NPT","Un    ",4,null,null,null,""]
["S",2,"S",0,1,6,0,0,0,0,0,"F","Serviço","Serviço","1.6.0.0.18.","COMPOSIÇÃO","COMP 211_SEE","REGULADOR DE 2º ESTÁGIO 5KG/H","UN ",4,null,null,null,""]
["S",2,"S",0,1,6,0,0,0,0,0,"F","Serviço","Serviço","1.6.0.0.19.","COMPOSIÇÃO","COMP 210_SEE","REGULADOR DE 1º ESTÁGIO 60KG/H MODELO AP-40  COM MANÔMETRO","UN ",1,null,null,null,""]
["S",2,"S",0,1,6,0,0,0,0,0,"F","Serviço","Serviço","1.6.0.0.20.","AGETOP",85003,"EXTINTOR PO QUIMICO SECO (6 KG) - CAPACIDADE EXTINTORA 20 BC","Un    ",1,null,null,null,""]
["S",2,"S",0,1,6,0,0,0,0,0,"F","Serviço","Serviço","1.6.0.0.21.","COMPOSIÇÃO","COMP 235_SEE","PLACA DE SINALIZAÇÃO EM PVC COD 01 - (300X300) PROIBIDO FUMAR","UN ",2,null,null,null,""]
["S",2,"S",0,1,6,0,0,0,0,0,"F","Serviço","Serviço","1.6.0.0.22.","COMPOSIÇÃO","COMP 236_SEE","PLACA DE SINALIZAÇÃO EM PVC COD 06 - (300X300) PERIGO INFLAMÁVEL","UN ",2,null,null,null,""]
["S",2,"S",0,1,6,0,0,0,0,0,"F","Serviço","Serviço","1.6.0.0.23.","AGETOP",91043,"BRAÇADEIRA METALICA TIPO \"D\" DIAM. 3/4\"","Un    ",5,null,null,null,""]
["S",2,"S",0,1,6,0,0,0,0,0,"F","Serviço","Serviço","1.6.0.0.24.","AGETOP",71863,"PARAFUSO P/BUCHA S-10","Un    ",10,null,null,null,""]
["S",2,"S",0,1,6,0,0,0,0,0,"F","Serviço","Serviço","1.6.0.0.25.","AGETOP",70393,"BUCHA DE NYLON S-10","Un    ",10,null,null,null,""]
["S",2,"S",0,1,6,0,0,0,{"$f":"IF(OR($C179=\"S\",$C179=0),0,MATCH(0,OFFSET($D179,1,$C179,ROW($C$309)-ROW($C179)),0))","v":0},{"$f":"IF(OR($C179=\"S\",$C179=0),0,MATCH(OFFSET($D179,0,$C179)+1,OFFSET($D179,1,$C179,ROW($C$309)-ROW($C179)),0))","v":0},"F","Serviço","Serviço","1.6.0.0.26.","AGETOP",91045,"SUPORTE PARA COLETOR","Un    ",2,null,null,null,""]
[2,2,2,3,1,7,0,0,0,50,3,"F","Nível 2","Nível 2","1.7.","AGETOP",91045,"ALVENARIAS E DIVISÓRIAS","Un    ",null,null,null,null,""]
["S",2,"S",0,1,7,0,0,0,0,0,"F","Serviço","Serviço","1.7.0.0.1.","SINAPI",87520,"ALVENARIA DE VEDAÇÃO DE BLOCOS CERÂMICOS FURADOS NA HORIZONTAL DE 9X19X19CM (ESPESSURA 9CM) DE PAREDES COM ÁREA LÍQUIDA MAIOR OU IGUAL A 6M² COM VÃOS E ARGAMASSA DE ASSENTAMENTO COM PREPARO MANUAL. AF_06/2014","M2",14,null,null,null,"Referência: AGETOP - 100201"]
["S",2,"S",0,1,7,0,0,0,0,0,"F","Serviço","Serviço","1.7.0.0.2.","SINAPI",79627,"DIVISORIA EM GRANITO BRANCO POLIDO, ESP = 3CM, ASSENTADO COM ARGAMASSA TRACO 1:4, ARREMATE EM CIMENTO BRANCO, EXCLUSIVE FERRAGENS","M2",1.4,null,null,null,"Referência: AGETOP - 100320"]
[2,2,2,4,1,8,0,0,0,47,4,"F","Nível 2","Nível 2","1.8.",null,null,"ESQUADRIAS METÁLICAS","-",null,null,null,null,""]
["S",2,"S",0,1,8,0,0,0,0,0,"F","Serviço","Serviço","1.8.0.0.1.","AGETOP",180380,"ESQ. MAXIMO AR CHAPA/VIDRO J4 C/FERRAGENS","m2    ",1.5,null,null,null,""]
["S",2,"S",0,1,8,0,0,0,0,0,"F","Serviço","Serviço","1.8.0.0.2.","SINAPI","73933/4","PORTA DE FERRO DE ABRIR TIPO BARRA CHATA, COM REQUADRO E GUARNICAO COMPLETA","M2",8.1999999999999993,null,null,null,"Referência: AGETOP - 180501"]
["S",2,"S",0,1,8,0,0,0,0,0,"F","Serviço","Serviço","1.8.0.0.3.","AGETOP",180509,"PORTA ABRIR CH.P/WC PF-10 C/FERRAGENS","m2    ",17.82,null,null,null,""]
[2,2,2,2,1,9,0,0,0,43,2,"F","Nível 2","Nível 2","1.9.",null,null,"VIDROS","-",null,null,null,null,""]
["S",2,"S",0,1,9,0,0,0,0,0,"F","Serviço","Serviço","1.9.0.0.1.","SINAPI",72117,"VIDRO LISO COMUM TRANSPARENTE, ESPESSURA 4MM","M2",1.5,null,null,null,"Referência: AGETOP - 190102"]
[2,2,2,5,1,10,0,0,0,41,5,"F","Nível 2","Nível 2","1.10.",null,null,"REVESTIMENTO DE PAREDE","-",null,null,null,null,""]
["S",2,"S",0,1,10,0,0,0,0,0,"F","Serviço","Serviço","1.10.0.0.1.","SINAPI",87553,"EMBOÇO, PARA RECEBIMENTO DE CERÂMICA, EM ARGAMASSA TRAÇO 1:2:8, PREPARO MECÂNICO COM BETONEIRA 400L, APLICADO MANUALMENTE EM FACES INTERNAS DE PAREDES, PARA AMBIENTE COM ÁREA MAIOR QUE 10M2, ESPESSURA DE 10MM, COM EXECUÇÃO DE TALISCAS. AF_06/2014","M2",44.1,null,null,null,""]
["S",2,"S",0,1,10,0,0,0,0,0,"F","Serviço","Serviço","1.10.0.0.2.","SINAPI",87904,"CHAPISCO APLICADO EM ALVENARIA (COM PRESENÇA DE VÃOS) E ESTRUTURAS DE CONCRETO DE FACHADA, COM COLHER DE PEDREIRO.  ARGAMASSA TRAÇO 1:3 COM PREPARO MANUAL. AF_06/2014","M2",44.1,null,null,null,"Referência: AGETOP - 200101"]
["S",2,"S",0,1,10,0,0,0,0,0,"F","Serviço","Serviço","1.10.0.0.3.","SINAPI",87547,"MASSA ÚNICA, PARA RECEBIMENTO DE PINTURA, EM ARGAMASSA TRAÇO 1:2:8, PREPARO MECÂNICO COM BETONEIRA 400L, APLICADA MANUALMENTE EM FACES INTERNAS DE PAREDES, ESPESSURA DE 10MM, COM EXECUÇÃO DE TALISCAS. AF_06/2014","M2",2.76,null,null,null,""]
["S",2,"S",0,1,10,0,0,0,0,0,"F","Serviço","Serviço","1.10.0.0.4.","SINAPI",87273,"REVESTIMENTO CERÂMICO PARA PAREDES INTERNAS COM PLACAS TIPO ESMALTADA EXTRA DE DIMENSÕES 33X45 CM APLICADAS EM AMBIENTES DE ÁREA MAIOR QUE 5 M² NA ALTURA INTEIRA DAS PAREDES. AF_06/2014","M2",232,null,null,null,""]
[2,2,2,5,1,11,0,0,0,36,5,"F","Nível 2","Nível 2","1.11.","SINAPI",null,"FORROS","-",null,null,null,null,""]
[3,3,3,2,1,11,1,0,0,4,2,"F","Nível 3","Nível 3","1.11.1.","SINAPI",null,"PVC SEM ESTRUTURA","-",null,null,null,null,""]
["S",3,"S",0,1,11,1,0,0,0,0,"F","Serviço","Serviço","1.11.1.0.1.","AGETOP",210461,"FORRO DE PVC SEM ESTRUTURA DE METALON (COM REPINTURA DA ESTRUTURA COM TINTA ALQUÍDICA D.F.)","m2    ",100,null,null,null,""]
[3,3,3,2,1,11,2,0,0,2,8,"F","Nível 3","Nível 3","1.11.2.","SINAPI",null,"PVC COM ESTRUTURA","-",null,null,null,null,""]
["S",3,"S",0,1,11,2,0,0,0,0,"F","Serviço","Serviço","1.11.2.0.1.","SINAPI",96116,"FORRO EM RÉGUAS DE PVC, FRISADO, PARA AMBIENTES COMERCIAIS, INCLUSIVE ESTRUTURA DE FIXAÇÃO. AF_05/2017_P","M2",591.32000000000005,null,null,null,"Referência: AGETOP - 210460"]
[2,2,2,8,1,12,0,0,0,31,8,"F","Nível 2","Nível 2","1.12.",null,null,"REVESTIMENTO DE PISO","-",null,null,null,null,""]
[3,3,3,3,1,12,1,0,0,7,3,"F","Nível 3","Nível 3","1.12.1.",null,null,"GRANITINA","-",null,null,null,null,""]
["S",3,"S",0,1,12,1,0,0,0,0,"F","Serviço","Serviço","1.12.1.0.1.","SINAPI",84191,"PISO EM GRANILITE, MARMORITE OU GRANITINA ESPESSURA 8 MM, INCLUSO JUNTAS DE DILATACAO PLASTICAS","M2",725.84,null,null,null,"Referência: AGETOP - 221101"]
["S",3,"S",0,1,12,1,0,0,0,0,"F","Serviço","Serviço","1.12.1.0.2.","AGETOP",221104,"RASPAGEM E APLICAÇÃO RESINA ACRÍLICA DUAS DEMÃOS","m2    ",725.84,null,null,null,""]
[3,3,3,2,1,12,2,0,0,4,2,"F","Nível 3","Nível 3","1.12.2.",null,null,"CERÂMICO","-",null,null,null,null,""]
["S",3,"S",0,1,12,2,0,0,0,0,"F","Serviço","Serviço","1.12.2.0.1.","SINAPI",87251,"REVESTIMENTO CERÂMICO PARA PISO COM PLACAS TIPO ESMALTADA EXTRA DE DIMENSÕES 45X45 CM APLICADA EM AMBIENTES DE ÁREA MAIOR QUE 10 M2. AF_06/2014","M2",54.7,null,null,null,""]
[3,3,3,2,1,12,3,0,0,2,{"$error":"#N/A"},"F","Nível 3","Nível 3","1.12.3.","SINAPI",null,"CONCRETO","-",null,null,null,null,""]
["S",3,"S",0,1,12,3,0,0,0,0,"F","Serviço","Serviço","1.12.3.0.1.","AGETOP",220102,"PISO CONCRETO DESEMPENADO ESPESSURA = 5 CM  1:2,5:3,5","m2    ",134,null,null,null,""]
[2,2,2,3,1,13,0,0,0,23,3,"F","Nível 2","Nível 2","1.13.","SINAPI",null,"FERRAGENS","-",null,null,null,null,""]
["S",2,"S",0,1,13,0,0,0,0,0,"F","Serviço","Serviço","1.13.0.0.1.","AGETOP",230174,"BARRA DE APOIO EM AÇO INOX - 40 CM","un    ",6,null,null,null,""]
["S",2,"S",0,1,13,0,0,0,0,0,"F","Serviço","Serviço","1.13.0.0.2.","AGETOP",230176,"BARRA DE APOIO EM AÇO INOX - 80 CM ","un    ",6,null,null,null,""]
[2,2,2,6,1,14,0,0,0,20,6,"F","Nível 2","Nível 2","1.14.",null,null,"ADMINISTRAÇÃO","-",null,null,null,null,""]
[3,3,3,3,1,14,1,0,0,{"$f":"IF(OR($C211=\"S\",$C211=0),0,MATCH(0,OFFSET($D211,1,$C211,ROW($C$309)-ROW($C211)),0))","v":5},{"$f":"IF(OR($C211=\"S\",$C211=0),0,MATCH(OFFSET($D211,0,$C211)+1,OFFSET($D211,1,$C211,ROW($C$309)-ROW($C211)),0))","v":3},"F","Nível 3","Nível 3","1.14.1.",null,null,"MENSALISTAS","-",null,null,null,null,""]
["S",3,"S",0,1,14,1,0,0,0,0,"F","Serviço","Serviço","1.14.1.0.1.","SINAPI",90778,"ENGENHEIRO CIVIL DE OBRA PLENO COM ENCARGOS COMPLEMENTARES","H",132,null,null,null,"Referência: AGETOP - 250101"]
["S",3,"S",0,1,14,1,0,0,0,0,"F","Serviço","Serviço","1.14.1.0.2.","SINAPI",90776,"ENCARREGADO GERAL COM ENCARGOS COMPLEMENTARES","H",660,null,null,null,"Referência: AGETOP - 250103"]
[3,3,3,2,1,14,2,0,0,2,11,"F","Nível 3","Nível 3","1.14.2.","SINAPI",null,"LAUDO DE ESTANQUEIDADE","-",null,null,null,null,""]
["S",3,"S",0,1,14,2,0,0,0,0,"F","Serviço","Serviço","1.14.2.0.1.","SINAPI",90778,"ENGENHEIRO CIVIL DE OBRA PLENO COM ENCARGOS COMPLEMENTARES","H",16,null,null,null,"Referência: AGETOP - 250101"]
[2,2,2,11,1,15,0,0,0,14,11,"F","Nível 2","Nível 2","1.15.",null,null,"PINTURA","-",null,null,null,null,""]
[3,3,3,4,1,15,1,0,0,10,4,"F","Nível 3","Nível 3","1.15.1.",null,null,"ESMALTE SINTÉTICO","-",null,null,null,null,""]
["S",3,"S",0,1,15,1,0,0,0,0,"F","Serviço","Serviço","1.15.1.0.1.","AGETOP",260105,"REMOCAO DE PINTURA ANTIGA A OLEO OU ESMALTE","m2    ",50,null,null,null,""]
["S",3,"S",0,1,15,1,0,0,0,0,"F","Serviço","Serviço","1.15.1.0.2.","SINAPI",88497,"APLICAÇÃO E LIXAMENTO DE MASSA LÁTEX EM PAREDES, DUAS DEMÃOS. AF_06/2014","M2",50,null,null,null,"Referência: AGETOP - 261300"]
["S",3,"S",0,1,15,1,0,0,0,0,"F","Serviço","Serviço","1.15.1.0.3.","AGETOP",261550,"PINT.ESMALTE SINT.PAREDES - 2 DEM.C/SELADOR","m2    ",1053,null,null,null,""]
[3,3,3,4,1,15,2,0,0,6,4,"F","Nível 3","Nível 3","1.15.2.","AGETOP",null,"LÁTEX ACRÍLICA","-",null,null,null,null,""]
["S",3,"S",0,1,15,2,0,0,0,0,"F","Serviço","Serviço","1.15.2.0.1.","SINAPI",88497,"APLICAÇÃO E LIXAMENTO DE MASSA LÁTEX EM PAREDES, DUAS DEMÃOS. AF_06/2014","M2",50,null,null,null,"Referência: AGETOP - 261300"]
["S",3,"S",0,1,15,2,0,0,0,0,"F","Serviço","Serviço","1.15.2.0.2.","SINAPI",88489,"APLICAÇÃO MANUAL DE PINTURA COM TINTA LÁTEX ACRÍLICA EM PAREDES, DUAS DEMÃOS. AF_06/2014","M2",1153,null,null,null,"Referência: AGETOP - 261001"]
["S",3,"S",0,1,15,2,0,0,0,0,"F","Serviço","Serviço","1.15.2.0.3.","AGETOP",260104,"REMOCAO DE PINTURA ANTIGA A LATEX","m2    ",50,null,null,null,""]
[3,3,3,2,1,15,3,0,0,2,{"$error":"#N/A"},"F","Nível 3","Nível 3","1.15.3.","AGETOP",null,"ESQUADRIAS NOVAS","-",null,null,null,null,""]
["S",3,"S",0,1,15,3,0,0,0,0,"F","Serviço","Serviço","1.15.3.0.1.","SINAPI","74145/1","PINTURA ESMALTE FOSCO, DUAS DEMAOS, SOBRE SUPERFICIE METALICA, INCLUSO UMA DEMAO DE FUNDO ANTICORROSIVO. UTILIZACAO DE REVOLVER ( AR-COMPRIMIDO).","M2",81.06,null,null,null,"Referência: AGETOP - 261602"]
[2,2,2,3,1,16,0,0,0,3,{"$error":"#N/A"},"F","Nível 2","Nível 2","1.16.",null,null,"DIVERSOS","-",null,null,null,null,""]
["S",2,"S",0,1,16,0,0,0,0,0,"F","Serviço","Serviço","1.16.0.0.1.","AGETOP",270501,"LIMPEZA FINAL DE OBRA - (OBRAS CIVIS)","m2    ",200,null,null,null,""]
["S",2,"S",0,1,16,0,0,0,0,0,"F","Serviço","Serviço","1.16.0.0.2.","AGETOP",271608,"BANCADA DE GRANITO C/ESPELHO","m2    ",2.1,null,null,null,""]
[1,1,1,79,2,0,0,0,0,79,{"$error":"#N/A"},"F","Nível 1","Nível 1","2.","SINAPI",null,"QUADRA EM ARCO MODELO 02 SEDUC","-",null,null,null,null,""]
[2,2,2,2,2,1,0,0,0,78,2,"F","Nível 2","Nível 2","2.1.","SINAPI",null,"SERVIÇOS PRELIMINARES","-",null,null,null,null,""]
["S",2,"S",0,2,1,0,0,0,0,0,"F","Serviço","Serviço","2.1.0.0.1.","AGETOP",20702,"LOCAÇÃO DE OBRAS DE PEQUENO PORTE COM CAVALETE, INCLUSO PINTURA ( FACE INTERNA DO SARRAFO 10CM) E PIQUETE COM TESTEMUNHA","m2    ",432.77,null,null,null,""]
[2,2,2,3,2,2,0,0,0,76,3,"F","Nível 2","Nível 2","2.2.","AGETOP",null,"SERVIÇO EM TERRA","-",null,null,null,null,""]
["S",2,"S",0,2,2,0,0,0,0,0,"F","Serviço","Serviço","2.2.0.0.1.","AGETOP",41002,"APILOAMENTO","m2    ",583.85,null,null,null,""]
["S",2,"S",0,2,2,0,0,0,0,0,"F","Serviço","Serviço","2.2.0.0.2.","AGETOP",41140,"REGULARIZAÇÃO DO TERRENO SEM APILOAMENTO COM TRANSPORTE MANUAL DA TERRA ESCAVADA ","m2    ",583.85,null,null,null,""]
[2,2,2,11,2,3,0,0,0,73,11,"F","Nível 2","Nível 2","2.3.","AGETOP",null,"FUNDAÇÕES E SONDAGENS","-",null,null,null,null,""]
["S",2,"S",0,2,3,0,0,0,0,0,"F","Serviço","Serviço","2.3.0.0.1.","SINAPI",98230,"ESTACA BROCA DE CONCRETO, DIÂMETRO DE 30 CM, PROFUNDIDADE DE ATÉ 3 M, ESCAVAÇÃO MANUAL COM TRADO CONCHA, NÃO ARMADA. AF_03/2018","M",90,null,null,null,"Referência: AGETOP - 50302"]
["S",2,"S",0,2,3,0,0,0,0,0,"F","Serviço","Serviço","2.3.0.0.2.","SINAPI",96522,"ESCAVAÇÃO MANUAL PARA BLOCO DE COROAMENTO OU SAPATA, SEM PREVISÃO DE FÔRMA. AF_06/2017","M3",21.4,null,null,null,"Referência: AGETOP - 50901"]
["S",2,"S",0,2,3,0,0,0,0,0,"F","Serviço","Serviço","2.3.0.0.3.","AGETOP",50902,"APILOAMENTO (BLOCOS/SAPATAS)","m2    ",9.9,null,null,null,""]
["S",2,"S",0,2,3,0,0,0,0,0,"F","Serviço","Serviço","2.3.0.0.4.","SINAPI",96995,"REATERRO MANUAL APILOADO COM SOQUETE. AF_10/2017","M3",9.5299999999999994,null,null,null,"Referência: AGETOP - 40902"]
["S",2,"S",0,2,3,0,0,0,0,0,"F","Serviço","Serviço","2.3.0.0.5.","AGETOP",51009,"FORMA TABUA PINHO P/FUNDACOES U=3V - (OBRAS CIVIS)","m2    ",42,null,null,null,""]
["S",2,"S",0,2,3,0,0,0,0,0,"F","Serviço","Serviço","2.3.0.0.6.","SINAPI",96544,"ARMAÇÃO DE BLOCO, VIGA BALDRAME OU SAPATA UTILIZANDO AÇO CA-50 DE 6,3 MM - MONTAGEM. AF_06/2017","KG",117.2,null,null,null,"Referência: AGETOP - 52003"]
["S",2,"S",0,2,3,0,0,0,0,0,"F","Serviço","Serviço","2.3.0.0.7.","SINAPI",96545,"ARMAÇÃO DE BLOCO, VIGA BALDRAME OU SAPATA UTILIZANDO AÇO CA-50 DE 8 MM - MONTAGEM. AF_06/2017","KG",218.3,null,null,null,"Referência: AGETOP - 52004"]
["S",2,"S",0,2,3,0,0,0,0,0,"F","Serviço","Serviço","2.3.0.0.8.","SINAPI",96543,"ARMAÇÃO DE BLOCO, VIGA BALDRAME E SAPATA UTILIZANDO AÇO CA-60 DE 5 MM - MONTAGEM. AF_06/2017","KG",83.3,null,null,null,"Referência: AGETOP - 52014"]
["S",2,"S",0,2,3,0,0,0,0,0,"F","Serviço","Serviço","2.3.0.0.9.","SINAPI",94964,"CONCRETO FCK = 20MPA, TRAÇO 1:2,7:3 (CIMENTO/ AREIA MÉDIA/ BRITA 1)  - PREPARO MECÂNICO COM BETONEIRA 400 L. AF_07/2016","M3",11.1,null,null,null,""]
["S",2,"S",0,2,3,0,0,0,0,0,"F","Serviço","Serviço","2.3.0.0.10.","SINAPI","74157/4","LANCAMENTO/APLICACAO MANUAL DE CONCRETO EM FUNDACOES","M3",11.1,null,null,null,"Referência: AGETOP - 51026"]
[2,2,2,9,2,4,0,0,0,62,9,"F","Nível 2","Nível 2","2.4.","AGETOP",null,"ESTRUTURA","-",null,null,null,null,""]
["S",2,"S",0,2,4,0,0,0,0,0,"F","Serviço","Serviço","2.4.0.0.1.","AGETOP",60191,"FORMA DE TABUA CINTA BALDRAME U=8 VEZES","m2    ",114.96,null,null,null,""]
["S",2,"S",0,2,4,0,0,0,0,0,"F","Serviço","Serviço","2.4.0.0.2.","AGETOP",60207,"FORMA CH.COMPENSADA 12MM-VIGA/PILAR U=2V - (OBRAS CIVIS","m2    ",202.37,null,null,null,""]
["S",2,"S",0,2,4,0,0,0,0,0,"F","Serviço","Serviço","2.4.0.0.3.","SINAPI",92762,"ARMAÇÃO DE PILAR OU VIGA DE UMA ESTRUTURA CONVENCIONAL DE CONCRETO ARMADO EM UM EDIFÍCIO DE MÚLTIPLOS PAVIMENTOS UTILIZANDO AÇO CA-50 DE 10,0 MM - MONTAGEM. AF_12/2015","KG",896.3,null,null,null,"Referência: AGETOP - 60305"]
["S",2,"S",0,2,4,0,0,0,0,0,"F","Serviço","Serviço","2.4.0.0.4.","SINAPI",92761,"ARMAÇÃO DE PILAR OU VIGA DE UMA ESTRUTURA CONVENCIONAL DE CONCRETO ARMADO EM UM EDIFÍCIO DE MÚLTIPLOS PAVIMENTOS UTILIZANDO AÇO CA-50 DE 8,0 MM - MONTAGEM. AF_12/2015","KG",382.1,null,null,null,"Referência: AGETOP - 60304"]
["S",2,"S",0,2,4,0,0,0,0,0,"F","Serviço","Serviço","2.4.0.0.5.","SINAPI",92760,"ARMAÇÃO DE PILAR OU VIGA DE UMA ESTRUTURA CONVENCIONAL DE CONCRETO ARMADO EM UM EDIFÍCIO DE MÚLTIPLOS PAVIMENTOS UTILIZANDO AÇO CA-50 DE 6,3 MM - MONTAGEM. AF_12/2015","KG",112.8,null,null,null,"Referência: AGETOP - 60303"]
["S",2,"S",0,2,4,0,0,0,0,0,"F","Serviço","Serviço","2.4.0.0.6.","SINAPI",92768,"ARMAÇÃO DE LAJE DE UMA ESTRUTURA CONVENCIONAL DE CONCRETO ARMADO EM UM EDIFÍCIO DE MÚLTIPLOS PAVIMENTOS UTILIZANDO AÇO CA-60 DE 5,0 MM - MONTAGEM. AF_12/2015","KG",304.10000000000002,null,null,null,"Referência: AGETOP - 60314"]
["S",2,"S",0,2,4,0,0,0,0,0,"F","Serviço","Serviço","2.4.0.0.7.","SINAPI",94964,"CONCRETO FCK = 20MPA, TRAÇO 1:2,7:3 (CIMENTO/ AREIA MÉDIA/ BRITA 1)  - PREPARO MECÂNICO COM BETONEIRA 400 L. AF_07/2016","M3",18.98,null,null,null,""]
["S",2,"S",0,2,4,0,0,0,0,0,"F","Serviço","Serviço","2.4.0.0.8.","SINAPI",92874,"LANÇAMENTO COM USO DE BOMBA, ADENSAMENTO E ACABAMENTO DE CONCRETO EM ESTRUTURAS. AF_12/2015","M3",18.98,null,null,null,""]
[2,2,2,28,2,5,0,0,0,53,28,"F","Nível 2","Nível 2","2.5.","AGETOP",null,"INSTALAÇÕES ELÉTRICAS","-",null,null,null,null,""]
["S",2,"S",0,2,5,0,0,0,0,0,"F","Serviço","Serviço","2.5.0.0.1.","AGETOP",70351,"BRACADEIRA METALICA TIPO \"U\" DIAM. 3/4\"","Un    ",60,null,null,null,""]
["S",2,"S",0,2,5,0,0,0,0,0,"F","Serviço","Serviço","2.5.0.0.2.","AGETOP",70421,"BUCHA E ARRUELA METALICA DIAM. 3/4\"","PR    ",12,null,null,null,""]
["S",2,"S",0,2,5,0,0,0,0,0,"F","Serviço","Serviço","2.5.0.0.3.","AGETOP",70422,"BUCHA E ARRUELA METALICA DIAM. 1\"","PR    ",1,null,null,null,""]
["S",2,"S",0,2,5,0,0,0,0,0,"F","Serviço","Serviço","2.5.0.0.4.","SINAPI",91929,"CABO DE COBRE FLEXÍVEL ISOLADO, 4 MM², ANTI-CHAMA 0,6/1,0 KV, PARA CIRCUITOS TERMINAIS - FORNECIMENTO E INSTALAÇÃO. AF_12/2015","M",80,null,null,null,"Referência: AGETOP - 70582"]
["S",2,"S",0,2,5,0,0,0,0,0,"F","Serviço","Serviço","2.5.0.0.5.","AGETOP",70634,"CAIXA DE PASSAGEM -  TAMPA EM CONCRETO ARMADO 25 MPA E=5CM","m2    ",0.25,null,null,null,""]
["S",2,"S",0,2,5,0,0,0,0,0,"F","Serviço","Serviço","2.5.0.0.6.","SINAPI",92868,"CAIXA RETANGULAR 4\" X 2\" MÉDIA (1,30 M DO PISO), METÁLICA, INSTALADA EM PAREDE - FORNECIMENTO E INSTALAÇÃO. AF_12/2015","UN",4,null,null,null,"Referência: AGETOP - 70691"]
["S",2,"S",0,2,5,0,0,0,0,0,"F","Serviço","Serviço","2.5.0.0.7.","AGETOP",70714,"CAIXA DE PASSAGEM 50X50X80CM FUNDO DE BRITA SEM TAMPA","Un    ",1,null,null,null,""]
["S",2,"S",0,2,5,0,0,0,0,0,"F","Serviço","Serviço","2.5.0.0.8.","SINAPI",91902,"CURVA 90 GRAUS PARA ELETRODUTO, PVC, ROSCÁVEL, DN 25 MM (3/4\"), PARA CIRCUITOS TERMINAIS, INSTALADA EM LAJE - FORNECIMENTO E INSTALAÇÃO. AF_12/2015","UN",4,null,null,null,"Referência: AGETOP - 71141"]
["S",2,"S",0,2,5,0,0,0,0,0,"F","Serviço","Serviço","2.5.0.0.9.","SINAPI",91905,"CURVA 90 GRAUS PARA ELETRODUTO, PVC, ROSCÁVEL, DN 32 MM (1\"), PARA CIRCUITOS TERMINAIS, INSTALADA EM LAJE - FORNECIMENTO E INSTALAÇÃO. AF_12/2015","UN",1,null,null,null,"Referência: AGETOP - 71142"]
["S",2,"S",0,2,5,0,0,0,0,0,"F","Serviço","Serviço","2.5.0.0.10.","SINAPI",93653,"DISJUNTOR MONOPOLAR TIPO DIN, CORRENTE NOMINAL DE 10A - FORNECIMENTO E INSTALAÇÃO. AF_04/2016","UN",3,null,null,null,""]
["S",2,"S",0,2,5,0,0,0,0,0,"F","Serviço","Serviço","2.5.0.0.11.","SINAPI",93671,"DISJUNTOR TRIPOLAR TIPO DIN, CORRENTE NOMINAL DE 32A - FORNECIMENTO E INSTALAÇÃO. AF_04/2016","UN",1,null,null,null,"Referência: AGETOP - 71173"]
["S",2,"S",0,2,5,0,0,0,0,0,"F","Serviço","Serviço","2.5.0.0.12.","AGETOP",71190,"ELETROCALHA CH.Aº PRE ZN. FOGO \"C\" C/ABAS 50X50 MM S/TAMPA","M     ",28,null,null,null,""]
["S",2,"S",0,2,5,0,0,0,0,0,"F","Serviço","Serviço","2.5.0.0.13.","AGETOP",71202,"ELETRODUTO DE PVC RIGIDO DIAMETRO 1\"","M     ",15,null,null,null,""]
["S",2,"S",0,2,5,0,0,0,0,0,"F","Serviço","Serviço","2.5.0.0.14.","SINAPI",91184,"FIXAÇÃO DE TUBOS HORIZONTAIS DE PPR DIÂMETROS MAIORES QUE 75 MM COM ABRAÇADEIRA METÁLICA FLEXÍVEL 18 MM, FIXADA DIRETAMENTE NA LAJE. AF_05/2015","M",120,null,null,null,""]
["S",2,"S",0,2,5,0,0,0,0,0,"F","Serviço","Serviço","2.5.0.0.15.","AGETOP",71291,"FIO ISOLADO PVC 750 V, No. 2,5 MM2","M     ",360,null,null,null,""]
["S",2,"S",0,2,5,0,0,0,0,0,"F","Serviço","Serviço","2.5.0.0.16.","AGETOP",71321,"FITA DE AUTO FUSAO, ROLO E 10,00 MM","Un    ",1,null,null,null,""]
["S",2,"S",0,2,5,0,0,0,0,0,"F","Serviço","Serviço","2.5.0.0.17.","AGETOP",71450,"INTERRUPTOR DIFERENCIAL RESIDUAL (D.R.) BIPOLAR DE 25A-30mA","Un    ",1,null,null,null,""]
["S",2,"S",0,2,5,0,0,0,0,0,"F","Serviço","Serviço","2.5.0.0.18.","AGETOP",71522,"LAMPADA A VAPOR MERCURIO 400 W","Un    ",10,null,null,null,""]
["S",2,"S",0,2,5,0,0,0,{"$f":"IF(OR($C275=\"S\",$C275=0),0,MATCH(0,OFFSET($D275,1,$C275,ROW($C$309)-ROW($C275)),0))","v":0},{"$f":"IF(OR($C275=\"S\",$C275=0),0,MATCH(OFFSET($D275,0,$C275)+1,OFFSET($D275,1,$C275,ROW($C$309)-ROW($C275)),0))","v":0},"F","Serviço","Serviço","2.5.0.0.19.","AGETOP",71660,"LUMINÁRIA CIRCULAR COM VIDRO PARA QUADRA ATÉ 400 W - BASE E-40","Un    ",10,null,null,null,""]
["S",2,"S",0,2,5,0,0,0,0,0,"F","Serviço","Serviço","2.5.0.0.20.","SINAPI",91885,"LUVA PARA ELETRODUTO, PVC, ROSCÁVEL, DN 32 MM (1\"), PARA CIRCUITOS TERMINAIS, INSTALADA EM PAREDE - FORNECIMENTO E INSTALAÇÃO. AF_12/2015","UN",5,null,null,null,"Referência: AGETOP - 71742"]
["S",2,"S",0,2,5,0,0,0,0,0,"F","Serviço","Serviço","2.5.0.0.21.","SINAPI",95801,"CONDULETE DE ALUMÍNIO, TIPO X, PARA ELETRODUTO DE AÇO GALVANIZADO DN 20 MM (3/4''), APARENTE - FORNECIMENTO E INSTALAÇÃO. AF_11/2016_P","UN",10,null,null,null,"Referência: AGETOP - 70929"]
["S",2,"S",0,2,5,0,0,0,0,0,"F","Serviço","Serviço","2.5.0.0.22.","AGETOP",70930,"CONDULETE METÁLICO - ADAPTADOR DE SAÍDA 3/4\" ","un    ",10,null,null,null,""]
["S",2,"S",0,2,5,0,0,0,0,0,"F","Serviço","Serviço","2.5.0.0.23.","SINAPI","74131/5","QUADRO DE DISTRIBUICAO DE ENERGIA DE EMBUTIR, EM CHAPA METALICA, PARA 24 DISJUNTORES TERMOMAGNETICOS MONOPOLARES, COM BARRAMENTO TRIFASICO E NEUTRO, FORNECIMENTO E INSTALACAO","UN",1,null,null,null,""]
["S",2,"S",0,2,5,0,0,0,0,0,"F","Serviço","Serviço","2.5.0.0.24.","AGETOP",72250,"REATOR EXTERNO V. MERCÚRIO  AFP 1 X 400 W","Un    ",10,null,null,null,""]
["S",2,"S",0,2,5,0,0,0,0,0,"F","Serviço","Serviço","2.5.0.0.25.","AGETOP",72395,"TAMPA CEGA PARA CONDULETE METÁLICO","Un    ",10,null,null,null,""]
["S",2,"S",0,2,5,0,0,0,0,0,"F","Serviço","Serviço","2.5.0.0.26.","SINAPI",91996,"TOMADA MÉDIA DE EMBUTIR (1 MÓDULO), 2P+T 10 A, INCLUINDO SUPORTE E PLACA - FORNECIMENTO E INSTALAÇÃO. AF_12/2015","UN",4,null,null,null,"Referência: AGETOP - 72578"]
["S",2,"S",0,2,5,0,0,0,0,0,"F","Serviço","Serviço","2.5.0.0.27.","SINAPI",93014,"LUVA PARA ELETRODUTO, PVC, ROSCÁVEL, DN 60 MM (2\") - FORNECIMENTO E INSTALAÇÃO. AF_12/2015","UN",4,null,null,null,"Referência: AGETOP - 71745"]
[2,2,2,4,2,6,0,0,0,25,4,"F","Nível 2","Nível 2","2.6.","AGETOP",null,"ALVENARIAS E DIVISÓRIAS","-",null,null,null,null,""]
["S",2,"S",0,2,6,0,0,0,0,0,"F","Serviço","Serviço","2.6.0.0.1.","SINAPI",72132,"ALVENARIA EM TIJOLO CERAMICO MACICO 5X10X20CM 1/2 VEZ (ESPESSURA 10CM), ASSENTADO COM ARGAMASSA TRACO 1:2:8 (CIMENTO, CAL E AREIA)","M2",27.2,null,null,null,"Referência: AGETOP - 100102"]
["S",2,"S",0,2,6,0,0,0,0,0,"F","Serviço","Serviço","2.6.0.0.2.","SINAPI",87496,"ALVENARIA DE VEDAÇÃO DE BLOCOS CERÂMICOS FURADOS NA HORIZONTAL DE 9X19X19CM (ESPESSURA 9CM) DE PAREDES COM ÁREA LÍQUIDA MENOR QUE 6M² SEM VÃOS E ARGAMASSA DE ASSENTAMENTO COM PREPARO MANUAL. AF_06/2014","M2",71.5,null,null,null,"Referência: AGETOP - 100201"]
["S",2,"S",0,2,6,0,0,0,0,0,"F","Serviço","Serviço","2.6.0.0.3.","SINAPI","73937/1","COBOGO DE CONCRETO (ELEMENTO VAZADO), 7X50X50CM, ASSENTADO COM ARGAMASSA TRACO 1:4 (CIMENTO E AREIA)","M2",93.9,null,null,null,"Referência: AGETOP - 100501"]
[2,2,2,2,2,7,0,0,0,21,2,"F","Nível 2","Nível 2","2.7.","AGETOP",null,"IMPERMEABILIZAÇÃO","-",null,null,null,null,""]
["S",2,"S",0,2,7,0,0,0,0,0,"F","Serviço","Serviço","2.7.0.0.1.","SINAPI",98562,"IMPERMEABILIZAÇÃO DE FLOREIRA OU VIGA BALDRAME COM ARGAMASSA DE CIMENTO E AREIA, COM ADITIVO IMPERMEABILIZANTE, E = 2 CM. AF_06/2018","M2",54,null,null,null,"Referência: AGETOP - 120902"]
[2,2,2,2,2,8,0,0,0,19,2,"F","Nível 2","Nível 2","2.8.","AGETOP",null,"ESTRUTURAS METÁLICAS","-",null,null,null,null,""]
["S",2,"S",0,2,8,0,0,0,0,0,"F","Serviço","Serviço","2.8.0.0.1.","AGETOP",150103,"ESTRUTURA METÁLICA CONVENCIONAL EM AÇO DO TIPO USI SAC-300 COM FUNDO ANTICORROSIVO","Kg    ",4830.01,null,null,null,""]
[2,2,2,2,2,9,0,0,0,17,2,"F","Nível 2","Nível 2","2.9.","AGETOP",null,"COBERTURAS","-",null,null,null,null,""]
["S",2,"S",0,2,9,0,0,0,0,0,"F","Serviço","Serviço","2.9.0.0.1.","AGETOP",160969,"COBERTURA COM TELHA CHAPA GALVANIZADA TRAPEZOIDAL 0,43 MM COM ACESSÓRIOS","m2    ",497.35,null,null,null,""]
[2,2,2,3,2,10,0,0,0,15,3,"F","Nível 2","Nível 2","2.10.","AGETOP",null,"REVESTIMENTO DE PAREDE","-",null,null,null,null,""]
["S",2,"S",0,2,10,0,0,0,0,0,"F","Serviço","Serviço","2.10.0.0.1.","SINAPI",87878,"CHAPISCO APLICADO EM ALVENARIAS E ESTRUTURAS DE CONCRETO INTERNAS, COM COLHER DE PEDREIRO.  ARGAMASSA TRAÇO 1:3 COM PREPARO MANUAL. AF_06/2014","M2",98.7,null,null,null,""]
["S",2,"S",0,2,10,0,0,0,0,0,"F","Serviço","Serviço","2.10.0.0.2.","SINAPI",87547,"MASSA ÚNICA, PARA RECEBIMENTO DE PINTURA, EM ARGAMASSA TRAÇO 1:2:8, PREPARO MECÂNICO COM BETONEIRA 400L, APLICADA MANUALMENTE EM FACES INTERNAS DE PAREDES, ESPESSURA DE 10MM, COM EXECUÇÃO DE TALISCAS. AF_06/2014","M2",98.7,null,null,null,""]
[2,2,2,4,2,11,0,0,0,12,4,"F","Nível 2","Nível 2","2.11.","AGETOP",null,"REVESTIMENTO DE PISO","-",null,null,null,null,""]
["S",2,"S",0,2,11,0,0,0,0,0,"F","Serviço","Serviço","2.11.0.0.1.","AGETOP",220061,"PISO LAMINADO COM CONCRETO USINADO 20MPA E=7 CM  ","m2    ",403.5,null,null,null,""]
["S",2,"S",0,2,11,0,0,0,0,0,"F","Serviço","Serviço","2.11.0.0.2.","AGETOP",220100,"PASSEIO PROTECAO EM CONC.DESEMPEN.5 CM 1:2,5:3,5 ( INCLUSO ESPELHO DE 30CM/ESCAVAÇÃO/REATERRO/APILOAMENTO/ATERRO INTERNO)","m2    ",74.44,null,null,null,""]
["S",2,"S",0,2,11,0,0,0,0,0,"F","Serviço","Serviço","2.11.0.0.3.","SINAPI",94992,"EXECUÇÃO DE PASSEIO (CALÇADA) OU PISO DE CONCRETO COM CONCRETO MOLDADO IN LOCO, FEITO EM OBRA, ACABAMENTO CONVENCIONAL, ESPESSURA 6 CM, ARMADO. AF_07/2016","M2",27.74,null,null,null,""]
[2,2,2,4,2,12,0,0,0,8,4,"F","Nível 2","Nível 2","2.12.","AGETOP",null,"PINTURA","-",null,null,null,null,""]
["S",2,"S",0,2,12,0,0,0,0,0,"F","Serviço","Serviço","2.12.0.0.1.","SINAPI",88489,"APLICAÇÃO MANUAL DE PINTURA COM TINTA LÁTEX ACRÍLICA EM PAREDES, DUAS DEMÃOS. AF_06/2014","M2",98.7,null,null,null,"Referência: AGETOP - 261001"]
["S",2,"S",0,2,12,0,0,0,0,0,"F","Serviço","Serviço","2.12.0.0.2.","AGETOP",261609,"PINTURA ESMALTE ALQUIDICO ESTR.METALICA 2 DEMAOS","m2    ",251.2,null,null,null,""]
["S",2,"S",0,2,12,0,0,0,0,0,"F","Serviço","Serviço","2.12.0.0.3.","SINAPI",41595,"PINTURA ACRILICA DE FAIXAS DE DEMARCACAO EM QUADRA POLIESPORTIVA, 5 CM DE LARGURA","M",72,null,null,null,"Referência: AGETOP - 261700"]
[2,2,2,4,2,13,0,0,0,4,{"$error":"#N/A"},"F","Nível 2","Nível 2","2.13.","AGETOP",null,"DIVERSOS","-",null,null,null,null,""]
["S",2,"S",0,2,13,0,0,0,0,0,"F","Serviço","Serviço","2.13.0.0.1.","AGETOP",270501,"LIMPEZA FINAL DE OBRA - (OBRAS CIVIS)","m2    ",432.77,null,null,null,""]
["S",2,"S",0,2,13,0,0,0,0,0,"F","Serviço","Serviço","2.13.0.0.2.","AGETOP",270621,"ALAMBRADO EM TUBO INDUSTRIAL 2\"#2,28 E TELA MALHA 4\" FIO 12 (QUADRA ESPORTE EXISTENTE) SEM PINTURA","m2    ",125.6,null,null,null,""]
["S",2,"S",0,2,13,0,0,0,0,0,"F","Serviço","Serviço","2.13.0.0.3.","AGETOP",271103,"CONJUNTO PARA VOLEIBOL EM FERRO GALVANIZADO COM PINTURA (2 SUPORTES)","CJ    ",1,null,null,null,""]
[-1,null,-1,null,0,0,0,0,0,null,null,"F"]
[null,null,null,null,null,null,null,null,null,null,null,"F",null,null,null,null,null,"OBS: OS QUANTITATIVOS DE MATERIAIS  DAS INSTALAÇÕES HIDROSSANITÁRIAS, ELÉTRICAS E ESPECIAIS SÃO FORNECIDOS PELOS PROFISSIONAIS RESPONSÁVEIS PELOS RESPECTIVOS PROJETOS.",null,null,"VALOR TOTAL"]
[null,null,null,null,null,null,null,null,null,null,null,"F",null,null,null,null,null,null,null,null,"VALOR BDI (20,35%)"]
[null,null,null,null,null,null,null,null,null,null,null,"F",null,null,null,null,null,null,null,null,"TOTAL ORÇAMENTO"]
[null,null,null,null,null,null,null,null,null,null,null,"F"]
[null,null,null,null,null,null,null,null,null,null,null,"F",null,null,null,null,null,null,null,null,"CUSTO POR M2 ³"]
[null,null,null,null,null,null,null,null,null,null,null,"F",null,null,null,null,null,null,null,null,"MATERIAL S/ BDI"]
[null,null,null,null,null,null,null,null,null,null,null,"F",null,null,null,null,null,null,null,null,"MÃO DE OBRA S/ BDI"]
[null,null,null,null,null,null,null,null,null,null,null,"F"]
[null,null,null,null,null,null,null,null,null,null,null,"F",null,null,null,null,"(1) Conforme previsto pelo DECRETO Nº 7.983, DE 8 DE ABRIL DE 2013, os preços adotados são aqueles constantes dos sistemas de referência indicados. Justifica-se o uso dos preços destas composições de custos unitários devido ao seu valor ser menor à mediana de seus correspondentes na tabela SINAPI;"]
[null,null,null,null,null,null,null,null,null,null,null,"F",null,null,null,null,"(2) Optou-se pelo uso das composições de custos da AGETOP para itens não presentes na SINAPI;"]
[null,null,null,null,null,null,null,null,null,null,null,"F",null,null,null,null,"(3) Para itens da AGETOP, os vidros não estão inclusos nas esquadrias e já foram considerados os custos de contramarco para as esquadrias de alumínio;"]
[null,null,null,null,null,null,null,null,null,null,null,"F",null,null,null,null,"(4) Nos casos em que houver execução de granitina e omissão do item AGETOP 221102, considerou-se que o quantitativo para o rodapé, de altura igual a 7cm, foi incorporado na área de piso;"]
[null,null,null,null,null,null,null,null,null,null,null,"F",null,null,null,null,"(5) O custo unitário aproximado por metro quadrado é calculado dividindo-se o valor total do orçamento pela área total de construção."]
[null,null,null,null,null,null,null,null,null,null,null,"F"]
[null,null,null,null,null,null,null,null,null,null,null,"F"]
[]
[null,null,null,null,null,null,null,null,null,null,null,null,null,null,"SOMATÓRIO DE SERVIÇOS"]
[null,null,null,null,null,null,null,null,null,null,null,null,null,null,"ITEM","DESCRIÇÃO DOS SERVIÇOS",null,null,"PREÇO SEM BDI",null,null,"PREÇO COM BDI",null,"PARTICIPAÇÃO ( % )"]
[null,null,null,null,null,null,null,null,null,null,null,null,null,null,"a.","SERVIÇOS PRELIMINARES",null,null,{"$f":"SUMIF($R$19:$R$309,$P328,$W$19:$W$309)","v":0},null,null,{"$f":"ROUND(S328*(1+BDI.Taxa),2)","v":0},null,{"$f":"IFERROR(ROUND($V328*100/$W$312,2),0)","v":0}]
[null,null,null,null,null,null,null,null,null,null,null,null,null,null,"b.","TRANSPORTES",null,null,0,null,null,0,null,{"$f":"IFERROR(ROUND($V329*100/$W$312,2),0)","v":0}]
[null,null,null,null,null,null,null,null,null,null,null,null,null,null,"c.","SERVIÇO EM TERRA",null,null,0,null,null,0,null,0]
[null,null,null,null,null,null,null,null,null,null,null,null,null,null,"d.","FUNDAÇÕES E SONDAGENS",null,null,0,null,null,0,null,0]
[null,null,null,null,null,null,null,null,null,null,null,null,null,null,"e.","ESTRUTURA",null,null,0,null,null,0,null,0]
[null,null,null,null,null,null,null,null,null,null,null,null,null,null,"f.","INSTALAÇÕES ELÉTRICAS",null,null,0,null,null,0,null,0]
[null,null,null,null,null,null,null,null,null,null,null,null,null,null,"g.","INSTALAÇÕES HIDROSSANITÁRIAS",null,null,0,null,null,0,null,0]
[null,null,null,null,null,null,null,null,null,null,null,null,null,null,"h","INSTALAÇÕES ESPECIAIS",null,null,0,null,null,0,null,0]
[null,null,null,null,null,null,null,null,null,null,null,null,null,null,"i.","ALVENARIAS E DIVISÓRIAS",null,null,0,null,null,0,null,0]
[null,null,null,null,null,null,null,null,null,null,null,null,null,null,"j.","ALVENARIA AUTO-PORTANTE",null,null,0,null,null,0,null,0]
[null,null,null,null,null,null,null,null,null,null,null,null,null,null,"k.","IMPERMEABILIZAÇÃO",null,null,0,null,null,0,null,0]
[null,null,null,null,null,null,null,null,null,null,null,null,null,null,"l.","ISOLAMENTO TÉRMICO E ACÚSTICO",null,null,0,null,null,0,null,0]
[null,null,null,null,null,null,null,null,null,null,null,null,null,null,"m.","ESTRUTURA DE MADEIRA",null,null,0,null,null,0,null,0]
[null,null,null,null,null,null,null,null,null,null,null,null,null,null,"n.","ESTRUTURAS METÁLICAS",null,null,0,null,null,0,null,0]
[null,null,null,null,null,null,null,null,null,null,null,null,null,null,"o.","COBERTURAS",null,null,0,null,null,0,null,0]
[null,null,null,null,null,null,null,null,null,null,null,null,null,null,"p.","ESQUADRIAS DE MADEIRA",null,null,0,null,null,0,null,0]
[null,null,null,null,null,null,null,null,null,null,null,null,null,null,"q.","ESQUADRIAS METÁLICAS",null,null,0,null,null,{"$f":"ROUND(S344*(1+BDI.Taxa),2)","v":0},null,0]
[null,null,null,null,null,null,null,null,null,null,null,null,null,null,"r.","VIDROS",null,null,0,null,null,0,null,0]
[null,null,null,null,null,null,null,null,null,null,null,null,null,null,"s.","REVESTIMENTO DE PAREDE",null,null,0,null,null,0,null,0]
[null,null,null,null,null,null,null,null,null,null,null,null,null,null,"t.","FORROS",null,null,0,null,null,0,null,0]
[null,null,null,null,null,null,null,null,null,null,null,null,null,null,"u.","REVESTIMENTO DE PISO",null,null,0,null,null,0,null,0]
[null,null,null,null,null,null,null,null,null,null,null,null,null,null,"v.","FERRAGENS",null,null,0,null,null,0,null,0]
[null,null,null,null,null,null,null,null,null,null,null,null,null,null,"w.","MARCENARIA",null,null,0,null,null,0,null,0]
[null,null,null,null,null,null,null,null,null,null,null,null,null,null,"x.","ADMINISTRAÇÃO",null,null,0,null,null,0,null,0]
[null,null,null,null,null,null,null,null,null,null,null,null,null,null,"y.","PINTURA",null,null,0,null,null,{"$f":"ROUND(S352*(1+BDI.Taxa),2)","v":0},null,0]
[null,null,null,null,null,null,null,null,null,null,null,null,null,null,"z.","DIVERSOS",null,null,0,null,null,{"$f":"IF(S353>0,IF((SUM(V328:W352)+ROUND(S353*(1+BDI.Taxa),2))<>V355,V355-SUM(V328:W352),ROUND(S353*(1+BDI.Taxa),2)),0)","v":0},null,{"$f":"IF(S353>0,IF((SUM(X328:X352)+IFERROR(ROUND($V353*100/$W$312,2),0))<>X355,X355-SUM(X328:X352),IFERROR(ROUND($V353*100/$W$312,2),0)),0)","v":0}]
[null,null,null,null,null,null,null,null,null,null,null,null,null,null,"TOTAL GERAL DO ORÇAMENTO (R$)",null,null,null,{"$f":"SUM(S328:U353)","v":0},null,null,{"$f":"SUM(V328:W353)","v":0},null,{"$f":"SUM(X328:X353)","v":0}]
[null,null,null,null,null,null,null,null,null,null,null,null,null,null,null,null,null,null,{"$f":"$W$310","v":0},null,null,{"$f":"$W$312","v":0},null,100]
[null,null,null,null,null,null,null,null,null,null,null,null,null,null,null,null,null,null,"(TOTAL SEM BDI)",null,null,"(TOTAL COM BDI)",null,"(ARRED porcentagem)"]
[null,null,null,null,null,null,null,null,null,null,null,null,null,null,null,null,null,null,{"$f":"IF(AND(S354=S355,S354>0),\"OK\",\"ERRO\")","v":"ERRO"},null,null,{"$f":"IF(AND(V354=V355,V354>0),\"OK\",\"ERRO\")","v":"ERRO"},null,{"$f":"IF(X354=100,\"OK\",\"ERRO\")","v":"ERRO"}]
[]
[]
[null,null,null,null,null,null,null,null,null,null,null,null,null,null,"RESUMO GERAL DO ORÇAMENTO"]
[null,null,null,null,null,null,null,null,null,null,null,null,null,null,"ITEM","DESCRIÇÃO DOS SERVIÇOS",null,null,"PREÇO SEM BDI",null,null,"PREÇO COM BDI",null,"PARTICIPAÇÃO ( % )"]
[null,null,null,null,null,null,null,null,null,null,null,null,null,null,"1.",{"$f":"IFERROR(VLOOKUP(O362,$O$19:$W$309,4,FALSE),\"\")","v":"IMPLANTAÇÃO"},null,null,{"$f":"IF(P363=\"\",$S$383-SUM(OFFSET($S$361:S361,0,0,COUNTA($S$361:S361),1)),SUMIF($R$19:$R$309,$P362,$W$19:$W$309))","v":0},null,null,{"$f":"IF(P363=\"\",$V$383-SUM(OFFSET($V$361:V361,0,0,COUNTA($V$361:V361),1)),ROUND(S362*(1+BDI.Taxa),2))","v":0},null,{"$f":"IF(P363=\"\",$X$383-SUM(OFFSET($X$361:X361,0,0,COUNTA($X$361:X361),1)),ROUND(V362*100/ORÇAMENTO.TotalOrçamento,2))","v":{"$error":"#DIV/0!"}}]
[null,null,null,null,null,null,null,null,null,null,null,null,null,null,"2.","QUADRA EM ARCO MODELO 02 SEDUC",null,null,{"$f":"IF(P364=\"\",$S$383-SUM(OFFSET($S$361:S362,0,0,COUNTA($S$361:S362),1)),SUMIF($R$19:$R$309,$P363,$W$19:$W$309))","v":0},null,null,{"$f":"IF(P364=\"\",$V$383-SUM(OFFSET($V$361:V362,0,0,COUNTA($V$361:V362),1)),ROUND(S363*(1+BDI.Taxa),2))","v":0},null,{"$f":"IF(P364=\"\",$X$383-SUM(OFFSET($X$361:X362,0,0,COUNTA($X$361:X362),1)),ROUND(V363*100/ORÇAMENTO.TotalOrçamento,2))","v":{"$error":"#DIV/0!"}}]
[null,null,null,null,null,null,null,null,null,null,null,null,null,null,"3.","",null,null,{"$f":"IF(P365=\"\",$S$383-SUM(OFFSET($S$361:S363,0,0,COUNTA($S$361:S363),1)),SUMIF($R$19:$R$309,$P364,$W$19:$W$309))","v":0},null,null,{"$f":"IF(P365=\"\",$V$383-SUM(OFFSET($V$361:V363,0,0,COUNTA($V$361:V363),1)),ROUND(S364*(1+BDI.Taxa),2))","v":0},null,{"$f":"IF(P365=\"\",$X$383-SUM(OFFSET($X$361:X363,0,0,COUNTA($X$361:X363),1)),ROUND(V364*100/ORÇAMENTO.TotalOrçamento,2))","v":{"$error":"#DIV/0!"}}]
[null,null,null,null,null,null,null,null,null,null,null,null,null,null,"4.","",null,null,{"$f":"IF(P366=\"\",$S$383-SUM(OFFSET($S$361:S364,0,0,COUNTA($S$361:S364),1)),SUMIF($R$19:$R$309,$P365,$W$19:$W$309))","v":0},null,null,{"$f":"IF(P366=\"\",$V$383-SUM(OFFSET($V$361:V364,0,0,COUNTA($V$361:V364),1)),ROUND(S365*(1+BDI.Taxa),2))","v":0},null,{"$f":"IF(P366=\"\",$X$383-SUM(OFFSET($X$361:X364,0,0,COUNTA($X$361:X364),1)),ROUND(V365*100/ORÇAMENTO.TotalOrçamento,2))","v":{"$error":"#DIV/0!"}}]
[null,null,null,null,null,null,null,null,null,null,null,null,null,null,"5.","",null,null,{"$f":"IF(P367=\"\",$S$383-SUM(OFFSET($S$361:S365,0,0,COUNTA($S$361:S365),1)),SUMIF($R$19:$R$309,$P366,$W$19:$W$309))","v":0},null,null,{"$f":"IF(P367=\"\",$V$383-SUM(OFFSET($V$361:V365,0,0,COUNTA($V$361:V365),1)),ROUND(S366*(1+BDI.Taxa),2))","v":0},null,{"$f":"IF(P367=\"\",$X$383-SUM(OFFSET($X$361:X365,0,0,COUNTA($X$361:X365),1)),ROUND(V366*100/ORÇAMENTO.TotalOrçamento,2))","v":{"$error":"#DIV/0!"}}]
[null,null,null,null,null,null,null,null,null,null,null,null,null,null,"6.","",null,null,{"$f":"IF(P368=\"\",$S$383-SUM(OFFSET($S$361:S366,0,0,COUNTA($S$361:S366),1)),SUMIF($R$19:$R$309,$P367,$W$19:$W$309))","v":0},null,null,{"$f":"IF(P368=\"\",$V$383-SUM(OFFSET($V$361:V366,0,0,COUNTA($V$361:V366),1)),ROUND(S367*(1+BDI.Taxa),2))","v":0},null,{"$f":"IF(P368=\"\",$X$383-SUM(OFFSET($X$361:X366,0,0,COUNTA($X$361:X366),1)),ROUND(V367*100/ORÇAMENTO.TotalOrçamento,2))","v":{"$error":"#DIV/0!"}}]
[null,null,null,null,null,null,null,null,null,null,null,null,null,null,"7.","",null,null,{"$f":"IF(P369=\"\",$S$383-SUM(OFFSET($S$361:S367,0,0,COUNTA($S$361:S367),1)),SUMIF($R$19:$R$309,$P368,$W$19:$W$309))","v":0},null,null,{"$f":"IF(P369=\"\",$V$383-SUM(OFFSET($V$361:V367,0,0,COUNTA($V$361:V367),1)),ROUND(S368*(1+BDI.Taxa),2))","v":0},null,{"$f":"IF(P369=\"\",$X$383-SUM(OFFSET($X$361:X367,0,0,COUNTA($X$361:X367),1)),ROUND(V368*100/ORÇAMENTO.TotalOrçamento,2))","v":{"$error":"#DIV/0!"}}]
[null,null,null,null,null,null,null,null,null,null,null,null,null,null,"8.","",null,null,{"$f":"IF(P370=\"\",$S$383-SUM(OFFSET($S$361:S368,0,0,COUNTA($S$361:S368),1)),SUMIF($R$19:$R$309,$P369,$W$19:$W$309))","v":0},null,null,{"$f":"IF(P370=\"\",$V$383-SUM(OFFSET($V$361:V368,0,0,COUNTA($V$361:V368),1)),ROUND(S369*(1+BDI.Taxa),2))","v":0},null,{"$f":"IF(P370=\"\",$X$383-SUM(OFFSET($X$361:X368,0,0,COUNTA($X$361:X368),1)),ROUND(V369*100/ORÇAMENTO.TotalOrçamento,2))","v":{"$error":"#DIV/0!"}}]
[null,null,null,null,null,null,null,null,null,null,null,null,null,null,"9.","",null,null,{"$f":"IF(P371=\"\",$S$383-SUM(OFFSET($S$361:S369,0,0,COUNTA($S$361:S369),1)),SUMIF($R$19:$R$309,$P370,$W$19:$W$309))","v":0},null,null,{"$f":"IF(P371=\"\",$V$383-SUM(OFFSET($V$361:V369,0,0,COUNTA($V$361:V369),1)),ROUND(S370*(1+BDI.Taxa),2))","v":0},null,{"$f":"IF(P371=\"\",$X$383-SUM(OFFSET($X$361:X369,0,0,COUNTA($X$361:X369),1)),ROUND(V370*100/ORÇAMENTO.TotalOrçamento,2))","v":{"$error":"#DIV/0!"}}]
[null,null,null,null,null,null,null,null,null,null,null,null,null,null,"10.","",null,null,{"$f":"IF(P372=\"\",$S$383-SUM(OFFSET($S$361:S370,0,0,COUNTA($S$361:S370),1)),SUMIF($R$19:$R$309,$P371,$W$19:$W$309))","v":0},null,null,{"$f":"IF(P372=\"\",$V$383-SUM(OFFSET($V$361:V370,0,0,COUNTA($V$361:V370),1)),ROUND(S371*(1+BDI.Taxa),2))","v":0},null,{"$f":"IF(P372=\"\",$X$383-SUM(OFFSET($X$361:X370,0,0,COUNTA($X$361:X370),1)),ROUND(V371*100/ORÇAMENTO.TotalOrçamento,2))","v":{"$error":"#DIV/0!"}}]
[null,null,null,null,null,null,null,null,null,null,null,null,null,null,"11.","",null,null,{"$f":"IF(P373=\"\",$S$383-SUM(OFFSET($S$361:S371,0,0,COUNTA($S$361:S371),1)),SUMIF($R$19:$R$309,$P372,$W$19:$W$309))","v":0},null,null,{"$f":"IF(P373=\"\",$V$383-SUM(OFFSET($V$361:V371,0,0,COUNTA($V$361:V371),1)),ROUND(S372*(1+BDI.Taxa),2))","v":0},null,{"$f":"IF(P373=\"\",$X$383-SUM(OFFSET($X$361:X371,0,0,COUNTA($X$361:X371),1)),ROUND(V372*100/ORÇAMENTO.TotalOrçamento,2))","v":{"$error":"#DIV/0!"}}]
[null,null,null,null,null,null,null,null,null,null,null,null,null,null,"12.","",null,null,{"$f":"IF(P374=\"\",$S$383-SUM(OFFSET($S$361:S372,0,0,COUNTA($S$361:S372),1)),SUMIF($R$19:$R$309,$P373,$W$19:$W$309))","v":0},null,null,{"$f":"IF(P374=\"\",$V$383-SUM(OFFSET($V$361:V372,0,0,COUNTA($V$361:V372),1)),ROUND(S373*(1+BDI.Taxa),2))","v":0},null,{"$f":"IF(P374=\"\",$X$383-SUM(OFFSET($X$361:X372,0,0,COUNTA($X$361:X372),1)),ROUND(V373*100/ORÇAMENTO.TotalOrçamento,2))","v":{"$error":"#DIV/0!"}}]
[null,null,null,null,null,null,null,null,null,null,null,null,null,null,"13.","",null,null,{"$f":"IF(P375=\"\",$S$383-SUM(OFFSET($S$361:S373,0,0,COUNTA($S$361:S373),1)),SUMIF($R$19:$R$309,$P374,$W$19:$W$309))","v":0},null,null,{"$f":"IF(P375=\"\",$V$383-SUM(OFFSET($V$361:V373,0,0,COUNTA($V$361:V373),1)),ROUND(S374*(1+BDI.Taxa),2))","v":0},null,{"$f":"IF(P375=\"\",$X$383-SUM(OFFSET($X$361:X373,0,0,COUNTA($X$361:X373),1)),ROUND(V374*100/ORÇAMENTO.TotalOrçamento,2))","v":{"$error":"#DIV/0!"}}]
[null,null,null,null,null,null,null,null,null,null,null,null,null,null,"14.","",null,null,{"$f":"IF(P376=\"\",$S$383-SUM(OFFSET($S$361:S374,0,0,COUNTA($S$361:S374),1)),SUMIF($R$19:$R$309,$P375,$W$19:$W$309))","v":0},null,null,{"$f":"IF(P376=\"\",$V$383-SUM(OFFSET($V$361:V374,0,0,COUNTA($V$361:V374),1)),ROUND(S375*(1+BDI.Taxa),2))","v":0},null,{"$f":"IF(P376=\"\",$X$383-SUM(OFFSET($X$361:X374,0,0,COUNTA($X$361:X374),1)),ROUND(V375*100/ORÇAMENTO.TotalOrçamento,2))","v":{"$error":"#DIV/0!"}}]
[null,null,null,null,null,null,null,null,null,null,null,null,null,null,"15.","",null,null,{"$f":"IF(P377=\"\",$S$383-SUM(OFFSET($S$361:S375,0,0,COUNTA($S$361:S375),1)),SUMIF($R$19:$R$309,$P376,$W$19:$W$309))","v":0},null,null,{"$f":"IF(P377=\"\",$V$383-SUM(OFFSET($V$361:V375,0,0,COUNTA($V$361:V375),1)),ROUND(S376*(1+BDI.Taxa),2))","v":0},null,{"$f":"IF(P377=\"\",$X$383-SUM(OFFSET($X$361:X375,0,0,COUNTA($X$361:X375),1)),ROUND(V376*100/ORÇAMENTO.TotalOrçamento,2))","v":{"$error":"#DIV/0!"}}]
[null,null,null,null,null,null,null,null,null,null,null,null,null,null,"16.","",null,null,{"$f":"IF(P378=\"\",$S$383-SUM(OFFSET($S$361:S376,0,0,COUNTA($S$361:S376),1)),SUMIF($R$19:$R$309,$P377,$W$19:$W$309))","v":0},null,null,{"$f":"IF(P378=\"\",$V$383-SUM(OFFSET($V$361:V376,0,0,COUNTA($V$361:V376),1)),ROUND(S377*(1+BDI.Taxa),2))","v":0},null,{"$f":"IF(P378=\"\",$X$383-SUM(OFFSET($X$361:X376,0,0,COUNTA($X$361:X376),1)),ROUND(V377*100/ORÇAMENTO.TotalOrçamento,2))","v":{"$error":"#DIV/0!"}}]
[null,null,null,null,null,null,null,null,null,null,null,null,null,null,"17.","",null,null,{"$f":"IF(P379=\"\",$S$383-SUM(OFFSET($S$361:S377,0,0,COUNTA($S$361:S377),1)),SUMIF($R$19:$R$309,$P378,$W$19:$W$309))","v":0},null,null,{"$f":"IF(P379=\"\",$V$383-SUM(OFFSET($V$361:V377,0,0,COUNTA($V$361:V377),1)),ROUND(S378*(1+BDI.Taxa),2))","v":0},null,{"$f":"IF(P379=\"\",$X$383-SUM(OFFSET($X$361:X377,0,0,COUNTA($X$361:X377),1)),ROUND(V378*100/ORÇAMENTO.TotalOrçamento,2))","v":{"$error":"#DIV/0!"}}]
[null,null,null,null,null,null,null,null,null,null,null,null,null,null,"18.","",null,null,{"$f":"IF(P380=\"\",$S$383-SUM(OFFSET($S$361:S378,0,0,COUNTA($S$361:S378),1)),SUMIF($R$19:$R$309,$P379,$W$19:$W$309))","v":0},null,null,{"$f":"IF(P380=\"\",$V$383-SUM(OFFSET($V$361:V378,0,0,COUNTA($V$361:V378),1)),ROUND(S379*(1+BDI.Taxa),2))","v":0},null,{"$f":"IF(P380=\"\",$X$383-SUM(OFFSET($X$361:X378,0,0,COUNTA($X$361:X378),1)),ROUND(V379*100/ORÇAMENTO.TotalOrçamento,2))","v":{"$error":"#DIV/0!"}}]
[null,null,null,null,null,null,null,null,null,null,null,null,null,null,"19.","",null,null,{"$f":"IF(P381=\"\",$S$383-SUM(OFFSET($S$361:S379,0,0,COUNTA($S$361:S379),1)),SUMIF($R$19:$R$309,$P380,$W$19:$W$309))","v":0},null,null,{"$f":"IF(P381=\"\",$V$383-SUM(OFFSET($V$361:V379,0,0,COUNTA($V$361:V379),1)),ROUND(S380*(1+BDI.Taxa),2))","v":0},null,{"$f":"IF(P381=\"\",$X$383-SUM(OFFSET($X$361:X379,0,0,COUNTA($X$361:X379),1)),ROUND(V380*100/ORÇAMENTO.TotalOrçamento,2))","v":{"$error":"#DIV/0!"}}]
[null,null,null,null,null,null,null,null,null,null,null,null,null,null,"20.","",null,null,{"$f":"IF(P382=\"\",$S$383-SUM(OFFSET($S$361:S380,0,0,COUNTA($S$361:S380),1)),SUMIF($R$19:$R$309,$P381,$W$19:$W$309))","v":0},null,null,{"$f":"IF(P382=\"\",$V$383-SUM(OFFSET($V$361:V380,0,0,COUNTA($V$361:V380),1)),ROUND(S381*(1+BDI.Taxa),2))","v":0},null,{"$f":"IF(P382=\"\",$X$383-SUM(OFFSET($X$361:X380,0,0,COUNTA($X$361:X380),1)),ROUND(V381*100/ORÇAMENTO.TotalOrçamento,2))","v":{"$error":"#DIV/0!"}}]
[null,null,null,null,null,null,null,null,null,null,null,null,null,null,"TOTAL GERAL DO ORÇAMENTO (R$)",null,null,null,{"$f":"SUM(S362:U381)","v":0},null,null,{"$f":"SUM(V362:W381)","v":0},null,{"$f":"SUM(X362:X381)","v":{"$error":"#DIV/0!"}}]
[null,null,null,null,null,null,null,null,null,null,null,null,null,null,null,null,null,null,{"$f":"$W$310","v":0},null,null,{"$f":"$W$312","v":0},null,100]
[null,null,null,null,null,null,null,null,null,null,null,null,null,null,null,null,null,null,"(TOTAL SEM BDI)",null,null,"(TOTAL COM BDI)",null,"(ARRED porcentagem)"]
[null,null,null,null,null,null,null,null,null,null,null,null,null,null,null,null,null,null,{"$f":"IF(AND(S382=S383,S382>0),\"OK\",\"ERRO\")","v":"ERRO"},null,null,{"$f":"IF(AND(V382=V383,V382>0),\"OK\",\"ERRO\")","v":"ERRO"},null,{"$f":"IF(AND(X382=100,S362<>0),\"OK\",\"ERRO\")","v":{"$error":"#DIV/0!"}}]

{"sheet":"Resumo ","index":1,"n_rows":39,"n_cols":9,"rows_kept":39,"cut":false,"hidden":false,"merged":[[42,3,42,7],[11,1,11,2],[12,1,12,2],[15,2,15,3],[16,2,16,3],[14,1,14,8],[17,2,17,3],[23,2,23,3],[18,2,18,3],[19,2,19,3],[20,2,20,3],[41,3,41,7],[24,2,24,3],[26,2,26,3],[27,2,27,3],[38,1,38,8],[1,1,1,8],[2,6,2,8],[3,6,3,8],[4,1,4,8],[5,6,5,8],[6,6,6,8],[7,1,7,8],[8,6,8,8],[9,6,9,8],[13,1,13,8],[0,1,0,8],[36,1,36,5],[2,1,2,5],[3,1,3,5],[5,1,5,5],[6,1,6,5],[8,1,8,5],[9,1,9,5],[11,3,11,5],[12,3,12,5],[10,1,10,8],[11,6,11,8],[12,6,12,8],[25,2,25,3],[21,2,21,3],[22,2,22,3],[13,0,14,0],[34,2,34,3],[35,2,35,3],[31,2,31,3],[32,2,32,3],[33,2,33,3],[28,2,28,3],[29,2,29,3],[30,2,30,3]]}
[]
[]
[null,"UNIDADE ESCOLAR",null,null,null,null,"CÓDIGO INEP"]
[null,{"$f":"Orçamento!$O$4","v":"COLÉGIO ESTADUAL CORONEL ERNESTO ANTONIO DE ARAÚJO"},null,null,null,null,{"$f":"Orçamento!V4","v":52041824}]
[]
[null,"OBRA",null,null,null,null,"CIDADE"]
[null,{"$f":"Orçamento!$O$7","v":"IMPLANTAÇÃO"},null,null,null,null,{"$f":"Orçamento!$V$7","v":"POSSE"}]
[]
[null,"ENDEREÇO",null,null,null,null,"CRE"]
[null,{"$f":"Orçamento!$R$10","v":"RUA JESUS JOSE DE ALMEIDA, CENTRO, CEP:73900-000"},null,null,null,null,{"$f":"Orçamento!$O$10","v":"POSSE"}]
[]
[null,"REFERÊNCIA",null,"DATA",null,null,"ÁREA TOTAL CONSTRUÍDA (M²)"]
[null,{"$f":"CONCATENATE(\"AGETOP E SINAPI - \",Orçamento!$W$10)","v":"AGETOP E SINAPI - ONERADA"},null,{"$f":"Orçamento!$S$7","v":"2020-05-12"},null,null,{"$f":"Orçamento!$S$13","v":1275.1199999999999}]
["FILTRO"]
[null,"RESUMO GERAL DO ORÇAMENTO"]
["↓","ITEM","DESCRIÇÃO DOS SERVIÇOS",null,"UNID","QUANT","PREÇO SEM BDI","PREÇO COM BDI","PARTICIP. (%)"]
[{"$f":"IF(E17>0,\"F\",\"\")","v":"F"},"1.",{"$f":"Orçamento!$P362","v":"IMPLANTAÇÃO"},null,"UN ",1,{"$f":"IFERROR(Orçamento!S362,\"-\")","v":0},{"$f":"IFERROR(Orçamento!V362,\"\")","v":0},{"$f":"Orçamento!X362","v":{"$error":"#DIV/0!"}}]
[{"$f":"IF(E18>0,\"F\",\"\")","v":"F"},"2.",{"$f":"Orçamento!$P363","v":"QUADRA EM ARCO MODELO 02 SEDUC"},null,"UN ",1,{"$f":"IFERROR(Orçamento!S363,\"-\")","v":0},{"$f":"IFERROR(Orçamento!V363,\"\")","v":0},{"$f":"Orçamento!X363","v":{"$error":"#DIV/0!"}}]
["","3.",{"$f":"Orçamento!$P364","v":""},null,null,null,{"$f":"IFERROR(Orçamento!S364,\"-\")","v":0},{"$f":"IFERROR(Orçamento!V364,\"\")","v":0},{"$f":"Orçamento!X364","v":{"$error":"#DIV/0!"}}]
["","4.",{"$f":"Orçamento!$P365","v":""},null,null,null,{"$f":"IFERROR(Orçamento!S365,\"-\")","v":0},{"$f":"IFERROR(Orçamento!V365,\"\")","v":0},{"$f":"Orçamento!X365","v":{"$error":"#DIV/0!"}}]
["","5.",{"$f":"Orçamento!$P366","v":""},null,null,null,{"$f":"IFERROR(Orçamento!S366,\"-\")","v":0},{"$f":"IFERROR(Orçamento!V366,\"\")","v":0},{"$f":"Orçamento!X366","v":{"$error":"#DIV/0!"}}]
["","6.",{"$f":"Orçamento!$P367","v":""},null,null,null,{"$f":"IFERROR(Orçamento!S367,\"-\")","v":0},{"$f":"IFERROR(Orçamento!V367,\"\")","v":0},{"$f":"Orçamento!X367","v":{"$error":"#DIV/0!"}}]
["","7.",{"$f":"Orçamento!$P368","v":""},null,null,null,{"$f":"IFERROR(Orçamento!S368,\"-\")","v":0},{"$f":"IFERROR(Orçamento!V368,\"\")","v":0},{"$f":"Orçamento!X368","v":{"$error":"#DIV/0!"}}]
["","8.",{"$f":"Orçamento!$P369","v":""},null,null,null,{"$f":"IFERROR(Orçamento!S369,\"-\")","v":0},{"$f":"IFERROR(Orçamento!V369,\"\")","v":0},{"$f":"Orçamento!X369","v":{"$error":"#DIV/0!"}}]
["","9.",{"$f":"Orçamento!$P370","v":""},null,null,null,{"$f":"IFERROR(Orçamento!S370,\"-\")","v":0},{"$f":"IFERROR(Orçamento!V370,\"\")","v":0},{"$f":"Orçamento!X370","v":{"$error":"#DIV/0!"}}]
["","10.",{"$f":"Orçamento!$P371","v":""},null,null,null,{"$f":"IFERROR(Orçamento!S371,\"-\")","v":0},{"$f":"IFERROR(Orçamento!V371,\"\")","v":0},{"$f":"Orçamento!X371","v":{"$error":"#DIV/0!"}}]
["","11.",{"$f":"Orçamento!$P372","v":""},null,null,null,{"$f":"IFERROR(Orçamento!S372,\"-\")","v":0},{"$f":"IFERROR(Orçamento!V372,\"\")","v":0},{"$f":"Orçamento!X372","v":{"$error":"#DIV/0!"}}]
["","12.",{"$f":"Orçamento!$P373","v":""},null,null,null,{"$f":"IFERROR(Orçamento!S373,\"-\")","v":0},{"$f":"IFERROR(Orçamento!V373,\"\")","v":0},{"$f":"Orçamento!X373","v":{"$error":"#DIV/0!"}}]
["","13.",{"$f":"Orçamento!$P374","v":""},null,null,null,{"$f":"IFERROR(Orçamento!S374,\"-\")","v":0},{"$f":"IFERROR(Orçamento!V374,\"\")","v":0},{"$f":"Orçamento!X374","v":{"$error":"#DIV/0!"}}]
["","14.",{"$f":"Orçamento!$P375","v":""},null,null,null,{"$f":"IFERROR(Orçamento!S375,\"-\")","v":0},{"$f":"IFERROR(Orçamento!V375,\"\")","v":0},{"$f":"Orçamento!X375","v":{"$error":"#DIV/0!"}}]
["","15.",{"$f":"Orçamento!$P376","v":""},null,null,null,{"$f":"IFERROR(Orçamento!S376,\"-\")","v":0},{"$f":"IFERROR(Orçamento!V376,\"\")","v":0},{"$f":"Orçamento!X376","v":{"$error":"#DIV/0!"}}]
["","16.",{"$f":"Orçamento!$P377","v":""},null,null,null,{"$f":"IFERROR(Orçamento!S377,\"-\")","v":0},{"$f":"IFERROR(Orçamento!V377,\"\")","v":0},{"$f":"Orçamento!X377","v":{"$error":"#DIV/0!"}}]
["","17.",{"$f":"Orçamento!$P378","v":""},null,null,null,{"$f":"IFERROR(Orçamento!S378,\"-\")","v":0},{"$f":"IFERROR(Orçamento!V378,\"\")","v":0},{"$f":"Orçamento!X378","v":{"$error":"#DIV/0!"}}]
["","18.",{"$f":"Orçamento!$P379","v":""},null,null,null,{"$f":"IFERROR(Orçamento!S379,\"-\")","v":0},{"$f":"IFERROR(Orçamento!V379,\"\")","v":0},{"$f":"Orçamento!X379","v":{"$error":"#DIV/0!"}}]
["","19.",{"$f":"Orçamento!$P380","v":""},null,null,null,{"$f":"IFERROR(Orçamento!S380,\"-\")","v":0},{"$f":"IFERROR(Orçamento!V380,\"\")","v":0},{"$f":"Orçamento!X380","v":{"$error":"#DIV/0!"}}]
["","20.",{"$f":"Orçamento!$P381","v":""},null,null,null,{"$f":"IFERROR(Orçamento!S381,\"-\")","v":0},{"$f":"IFERROR(Orçamento!V381,\"\")","v":0},{"$f":"Orçamento!X381","v":{"$error":"#DIV/0!"}}]
["F","TOTAL GERAL DO ORÇAMENTO (R$)",null,null,null,null,{"$f":"SUM(G17:G36)","v":0},0,{"$f":"SUM(I17:I36)","v":{"$error":"#DIV/0!"}}]
["F"]
["F"]

{"sheet":"Somatório","index":2,"n_rows":45,"n_cols":9,"rows_kept":45,"cut":false,"hidden":false,"merged":[[0,1,0,5],[14,1,14,5],[2,1,2,3],[2,4,2,5],[3,1,3,3],[3,4,3,5],[5,1,5,3],[5,4,5,5],[6,1,6,3],[6,4,6,5],[8,1,8,3],[8,4,8,5],[1,1,1,5],[4,1,4,5],[7,1,7,5],[10,1,10,5],[9,1,9,3],[9,4,9,5],[11,1,11,2],[11,4,11,5],[12,1,12,2],[12,4,12,5],[13,0,14,0],[42,1,42,2],[44,1,44,5],[47,3,47,5],[48,3,48,5],[13,1,13,5]]}
[]
[]
[null,"UNIDADE ESCOLAR",null,null,"CÓDIGO INEP"]
[null,{"$f":"Orçamento!$O$4","v":"COLÉGIO ESTADUAL CORONEL ERNESTO ANTONIO DE ARAÚJO"},null,null,{"$f":"Orçamento!V4","v":52041824}]
[]
[null,"OBRA",null,null,"CIDADE"]
[null,{"$f":"Orçamento!$O$7","v":"IMPLANTAÇÃO"},null,null,{"$f":"Orçamento!$V$7","v":"POSSE"}]
[]
[null,"ENDEREÇO",null,null,"CRE"]
[null,{"$f":"Orçamento!$R$10","v":"RUA JESUS JOSE DE ALMEIDA, CENTRO, CEP:73900-000"},null,null,{"$f":"Orçamento!$O$10","v":"POSSE"}]
[]
[null,"REFERÊNCIA",null,"DATA","ÁREA TOTAL CONSTRUÍDA (M²)"]
[null,{"$f":"CONCATENATE(\"AGETOP E SINAPI - \",Orçamento!$W$10)","v":"AGETOP E SINAPI - ONERADA"},null,{"$f":"Orçamento!$S$7","v":"2020-05-12"},{"$f":"Orçamento!$S$13","v":1275.1199999999999}]
["FILTRO"]
[null,"SOMATÓRIO DE SERVIÇOS"]
["↓","ITEM","DESCRIÇÃO DOS SERVIÇOS","PREÇO SEM BDI (R$)","PREÇO COM BDI (R$)","PARTIC.  ( % )"]
[{"$f":"IF(D17>0,\"F\",\"\")","v":""},"a.",{"$f":"Orçamento!P328","v":"SERVIÇOS PRELIMINARES"},{"$f":"Orçamento!S328","v":0},{"$f":"Orçamento!V328","v":0},{"$f":"Orçamento!X328","v":0},3,0,2]
[{"$f":"IF(D18>0,\"F\",\"\")","v":""},"b.",{"$f":"Orçamento!P329","v":"TRANSPORTES"},{"$f":"Orçamento!S329","v":0},{"$f":"Orçamento!V329","v":0},{"$f":"Orçamento!X329","v":0},2,6,3]
["","c.",{"$f":"Orçamento!P330","v":"SERVIÇO EM TERRA"},{"$f":"Orçamento!S330","v":0},{"$f":"Orçamento!V330","v":0},{"$f":"Orçamento!X330","v":0},0,8,7]
["","d.",{"$f":"Orçamento!P331","v":"FUNDAÇÕES E SONDAGENS"},{"$f":"Orçamento!S331","v":0},{"$f":"Orçamento!V331","v":0},{"$f":"Orçamento!X331","v":0},8,5,7]
["","e.",{"$f":"Orçamento!P332","v":"ESTRUTURA"},{"$f":"Orçamento!S332","v":0},{"$f":"Orçamento!V332","v":0},{"$f":"Orçamento!X332","v":0},3,7,0]
["","f.",{"$f":"Orçamento!P333","v":"INSTALAÇÕES ELÉTRICAS"},{"$f":"Orçamento!S333","v":0},{"$f":"Orçamento!V333","v":0},{"$f":"Orçamento!X333","v":0},9,8,7]
["","g.",{"$f":"Orçamento!P334","v":"INSTALAÇÕES HIDROSSANITÁRIAS"},{"$f":"Orçamento!S334","v":0},{"$f":"Orçamento!V334","v":0},{"$f":"Orçamento!X334","v":0},7,3,3]
["","h.",{"$f":"Orçamento!P335","v":"INSTALAÇÕES ESPECIAIS"},{"$f":"Orçamento!S335","v":0},{"$f":"Orçamento!V335","v":0},{"$f":"Orçamento!X335","v":0},8,4,1]
["","i.",{"$f":"Orçamento!P336","v":"ALVENARIAS E DIVISÓRIAS"},{"$f":"Orçamento!S336","v":0},{"$f":"Orçamento!V336","v":0},{"$f":"Orçamento!X336","v":0},4,0,8]
["","j.",{"$f":"Orçamento!P337","v":"ALVENARIA AUTO-PORTANTE"},{"$f":"Orçamento!S337","v":0},{"$f":"Orçamento!V337","v":0},{"$f":"Orçamento!X337","v":0}]
["","k.",{"$f":"Orçamento!P338","v":"IMPERMEABILIZAÇÃO"},{"$f":"Orçamento!S338","v":0},{"$f":"Orçamento!V338","v":0},{"$f":"Orçamento!X338","v":0},0,5,5]
["","l.",{"$f":"Orçamento!P339","v":"ISOLAMENTO TÉRMICO E ACÚSTICO"},{"$f":"Orçamento!S339","v":0},{"$f":"Orçamento!V339","v":0},{"$f":"Orçamento!X339","v":0}]
["","m.",{"$f":"Orçamento!P340","v":"ESTRUTURA DE MADEIRA"},{"$f":"Orçamento!S340","v":0},{"$f":"Orçamento!V340","v":0},{"$f":"Orçamento!X340","v":0}]
["","n.",{"$f":"Orçamento!P341","v":"ESTRUTURAS METÁLICAS"},{"$f":"Orçamento!S341","v":0},{"$f":"Orçamento!V341","v":0},{"$f":"Orçamento!X341","v":0},0,2,5]
["","o.",{"$f":"Orçamento!P342","v":"COBERTURAS"},{"$f":"Orçamento!S342","v":0},{"$f":"Orçamento!V342","v":0},{"$f":"Orçamento!X342","v":0},0,1,6]
["","p.",{"$f":"Orçamento!P343","v":"ESQUADRIAS DE MADEIRA"},{"$f":"Orçamento!S343","v":0},{"$f":"Orçamento!V343","v":0},{"$f":"Orçamento!X343","v":0}]
["","q.",{"$f":"Orçamento!P344","v":"ESQUADRIAS METÁLICAS"},{"$f":"Orçamento!S344","v":0},{"$f":"Orçamento!V344","v":0},{"$f":"Orçamento!X344","v":0},5,1,3]
["","r.",{"$f":"Orçamento!P345","v":"VIDROS"},{"$f":"Orçamento!S345","v":0},{"$f":"Orçamento!V345","v":0},{"$f":"Orçamento!X345","v":0},0,4,3]
["","s.",{"$f":"Orçamento!P346","v":"REVESTIMENTO DE PAREDE"},{"$f":"Orçamento!S346","v":0},{"$f":"Orçamento!V346","v":0},{"$f":"Orçamento!X346","v":0},0,2,2]
["","t.",{"$f":"Orçamento!P347","v":"FORROS"},{"$f":"Orçamento!S347","v":0},{"$f":"Orçamento!V347","v":0},{"$f":"Orçamento!X347","v":0},6,7,2]
["","u.",{"$f":"Orçamento!P348","v":"REVESTIMENTO DE PISO"},{"$f":"Orçamento!S348","v":0},{"$f":"Orçamento!V348","v":0},{"$f":"Orçamento!X348","v":0},6,0,7]
["","v.",{"$f":"Orçamento!P349","v":"FERRAGENS"},{"$f":"Orçamento!S349","v":0},{"$f":"Orçamento!V349","v":0},{"$f":"Orçamento!X349","v":0},6,1,5]
["","w.",{"$f":"Orçamento!P350","v":"MARCENARIA"},{"$f":"Orçamento!S350","v":0},{"$f":"Orçamento!V350","v":0},{"$f":"Orçamento!X350","v":0}]
["","x.",{"$f":"Orçamento!P351","v":"ADMINISTRAÇÃO"},{"$f":"Orçamento!S351","v":0},{"$f":"Orçamento!V351","v":0},{"$f":"Orçamento!X351","v":0},6,0,8]
["","y.",{"$f":"Orçamento!P352","v":"PINTURA"},{"$f":"Orçamento!S352","v":0},{"$f":"Orçamento!V352","v":0},{"$f":"Orçamento!X352","v":0},2,7,4]
["","z.",{"$f":"Orçamento!P353","v":"DIVERSOS"},{"$f":"Orçamento!S353","v":0},{"$f":"Orçamento!V353","v":0},{"$f":"Orçamento!X353","v":0},3,3,2]
["F","TOTAL GERAL DO ORÇAMENTO",null,{"$f":"SUM(D17:D42)","v":0},0,0,78,74,90]
[]
[null,"(*) Para itens da AGETOP, os vidros não estão inclusos nas esquadrias e já foram considerados os custos de contramarco para as esquadrias de alumínio;"]

{"sheet":"Cronog_90_Dias","index":3,"n_rows":99,"n_cols":18,"rows_kept":99,"cut":false,"hidden":false,"merged":[[95,9,95,12],[73,9,73,12],[74,9,74,12],[76,9,76,12],[77,9,77,12],[79,9,79,12],[80,9,80,12],[82,9,82,12],[83,9,83,12],[85,9,85,12],[59,9,59,12],[61,9,61,12],[62,9,62,12],[64,9,64,12],[65,9,65,12],[67,9,67,12],[68,9,68,12],[70,9,70,12],[71,9,71,12],[12,9,12,12],[13,9,13,12],[14,9,14,12],[16,9,16,12],[17,9,17,12],[19,9,19,12],[20,9,20,12],[22,9,22,12],[23,9,23,12],[10,1,10,17],[9,8,9,17],[8,8,8,17],[3,8,3,17],[6,8,6,17],[5,8,5,17],[3,1,3,7],[56,4,58,4],[29,3,31,3],[35,1,37,2],[35,4,37,4],[50,3,52,3],[53,3,55,3],[12,17,13,17],[13,1,13,2],[13,5,13,8],[13,13,13,16],[12,3,13,3],[12,13,12,16],[14,1,16,2],[12,5,12,8],[17,1,19,2],[17,4,19,4],[17,5,17,8],[56,1,58,2],[68,4,70,4],[44,3,46,3],[62,1,64,2],[62,4,64,4],[38,1,40,2],[38,4,40,4],[59,3,61,3],[44,1,46,2],[44,4,46,4],[53,1,55,2],[50,1,52,2],[50,4,52,4],[20,1,22,2],[20,4,22,4],[20,5,20,8],[20,13,20,16],[22,5,22,8],[22,13,22,16],[20,3,22,3],[83,3,85,3],[53,4,55,4],[59,1,61,2],[59,4,61,4],[74,1,76,2],[77,1,79,2],[77,4,79,4],[80,1,82,2],[65,1,67,2],[68,3,70,3],[62,3,64,3],[68,1,70,2],[56,3,58,3],[65,4,67,4],[71,3,73,3],[74,3,76,3],[74,4,76,4],[14,3,16,3],[17,3,19,3],[14,4,16,4],[14,5,14,8],[14,13,14,16],[16,5,16,8],[16,13,16,16],[23,13,23,16],[25,5,25,8],[25,13,25,16],[17,13,17,16],[19,5,19,8],[19,13,19,16],[25,9,25,12],[26,1,28,2],[26,4,28,4],[26,5,26,8],[26,13,26,16],[28,5,28,8],[28,13,28,16],[23,3,25,3],[23,1,25,2],[23,4,25,4],[23,5,23,8],[26,3,28,3],[26,9,26,12],[28,9,28,12],[29,13,29,16],[31,5,31,8],[31,13,31,16],[32,1,34,2],[32,4,34,4],[32,5,32,8],[32,13,32,16],[34,5,34,8],[34,13,34,16],[32,3,34,3],[29,5,29,8],[29,1,31,2],[29,4,31,4],[29,9,29,12],[31,9,31,12],[32,9,32,12],[34,9,34,12],[35,13,35,16],[37,5,37,8],[37,13,37,16],[35,3,37,3],[40,13,40,16],[38,3,40,3],[38,13,38,16],[41,1,43,2],[41,4,43,4],[41,5,41,8],[41,13,41,16],[43,5,43,8],[43,13,43,16],[41,3,43,3],[35,5,35,8],[38,5,38,8],[40,5,40,8],[35,9,35,12],[37,9,37,12],[38,9,38,12],[40,9,40,12],[41,9,41,12],[43,9,43,12],[44,13,44,16],[46,5,46,8],[46,13,46,16],[47,1,49,2],[47,4,49,4],[47,5,47,8],[47,13,47,16],[49,5,49,8],[49,13,49,16],[44,5,44,8],[47,3,49,3],[44,9,44,12],[46,9,46,12],[47,9,47,12],[49,9,49,12],[53,13,53,16],[55,5,55,8],[55,13,55,16],[50,5,50,8],[50,13,50,16],[52,5,52,8],[52,13,52,16],[56,13,56,16],[58,5,58,8],[58,13,58,16],[53,5,53,8],[56,5,56,8],[50,9,50,12],[52,9,52,12],[53,9,53,12],[55,9,55,12],[56,9,56,12],[58,9,58,12],[68,5,68,8],[65,5,65,8],[65,13,65,16],[67,5,67,8],[67,13,67,16],[65,3,67,3],[62,13,62,16],[64,5,64,8],[64,13,64,16],[62,5,62,8],[95,1,95,2],[95,5,95,8],[95,13,95,16],[97,1,97,4],[98,1,98,17],[86,13,86,16],[88,5,88,8],[88,13,88,16],[85,5,85,8],[85,13,85,16],[89,1,91,2],[89,4,91,4],[89,5,89,8],[89,13,89,16],[91,5,91,8],[91,13,91,16],[89,3,91,3],[86,4,88,4],[86,5,86,8],[86,3,88,3],[83,1,85,2],[83,4,85,4],[83,5,83,8],[83,13,83,16],[94,1,94,2],[94,5,94,8],[94,13,94,16],[76,5,76,8],[76,13,76,16],[77,5,77,8],[77,13,77,16],[79,5,79,8],[79,13,79,16],[80,5,80,8],[80,13,80,16],[82,5,82,8],[82,13,82,16],[77,3,79,3],[80,3,82,3],[86,1,88,2],[80,4,82,4],[86,9,86,12],[88,9,88,12],[89,9,89,12],[91,9,91,12],[92,9,92,12],[93,9,93,12],[94,9,94,12],[12,0,13,0],[9,0,11,0],[11,1,11,17],[92,1,92,2],[92,5,92,8],[92,13,92,16],[93,1,93,2],[93,5,93,8],[93,13,93,16],[74,13,74,16],[74,5,74,8],[68,13,68,16],[70,5,70,8],[70,13,70,16],[59,5,59,8],[71,1,73,2],[71,4,73,4],[71,5,71,8],[71,13,71,16],[73,5,73,8],[73,13,73,16],[59,13,59,16],[61,5,61,8],[61,13,61,16],[2,1,2,7],[5,1,5,7],[6,1,6,7],[8,1,8,7],[9,1,9,7],[4,1,4,17],[7,1,7,17],[0,1,0,17],[1,1,1,17],[2,8,2,17]]}
[]
[]
[null,"UNIDADE ESCOLAR",null,null,null,null,null,null,"PRAZO"]
[null,{"$f":"Orçamento!$O$4","v":"COLÉGIO ESTADUAL CORONEL ERNESTO ANTONIO DE ARAÚJO"},null,null,null,null,null,null,"90 DIAS CORRIDOS"]
[]
[null,"OBRA",null,null,null,null,null,null,"DATA"]
[null,{"$f":"Orçamento!$O$7","v":"IMPLANTAÇÃO"},null,null,null,null,null,null,{"$f":"Orçamento!$S$7","v":"2020-05-12"}]
[]
[null,"LOCAL",null,null,null,null,null,null,"ÁREA TOTAL CONSTRUÍDA (M²)"]
["FILTRO",{"$f":"Orçamento!$V$7","v":"POSSE"},null,null,null,null,null,null,{"$f":"Orçamento!$S$13","v":1275.1199999999999}]
[]
[null,"CRONOGRAMA - FÍSICO FINANCEIRO"]
["↓","CUSTO TOTAL:",{"$f":"D93","v":0},"VALOR","Dias:",30,null,null,null,60,null,null,null,90,null,null,null,"TOTAL"]
[null,"DESCRIÇÃO DOS SERVIÇOS",null,null,"%","1ª PARCELA",null,null,null,"2ª PARCELA",null,null,null,"3ª PARCELA"]
[{"$f":"IF(D15>0,\"F\",\"\")","v":""},"SERVIÇOS PRELIMINARES",null,{"$f":"Orçamento!V328","v":0},{"$f":"Orçamento!X328","v":0},{"$f":"ROUND(F17*$D$15,2)","v":0},null,null,null,{"$f":"ROUND(J17*$D$15,2)","v":0},null,null,null,{"$f":"ROUND(N17*$D$15,2)","v":0},null,null,null,{"$f":"SUM(F15:Q15)","v":0}]
[{"$f":"IF(A15=\"F\",A15,\"\")","v":""}]
[{"$f":"IF(A16=\"F\",A16,\"\")","v":""},null,null,null,null,1,null,null,null,0,null,null,null,{"$f":"1-F17-J17","v":0},null,null,null,{"$f":"IFERROR(E15/100,\"\")","v":0}]
[{"$f":"IF(D18>0,\"F\",\"\")","v":""},"TRANSPORTES",null,{"$f":"Orçamento!V329","v":0},{"$f":"Orçamento!X329","v":0},{"$f":"ROUND(F20*$D$18,2)-0.01","v":-0.01},null,null,null,{"$f":"ROUND(J20*$D$18,2)","v":0},null,null,null,{"$f":"ROUND(N20*$D$18,2)","v":0},null,null,null,{"$f":"SUM(F18:Q18)","v":-0.01}]
[{"$f":"IF(A18=\"F\",A18,\"\")","v":""}]
[{"$f":"IF(A19=\"F\",A19,\"\")","v":""},null,null,null,null,0.4,null,null,null,0.3,null,null,null,{"$f":"1-F20-J20","v":0.3},null,null,null,{"$f":"IFERROR(E18/100,\"\")","v":0}]
[{"$f":"IF(D21>0,\"F\",\"\")","v":""},"SERVIÇO EM TERRA",null,{"$f":"Orçamento!V330","v":0},{"$f":"Orçamento!X330","v":0},{"$f":"ROUND(F23*$D$21,2)","v":0},null,null,null,{"$f":"ROUND(J23*$D$21,2)","v":0},null,null,null,{"$f":"ROUND(N23*$D$21,2)","v":0},null,null,null,{"$f":"SUM(F21:Q21)","v":0}]
[{"$f":"IF(A21=\"F\",A21,\"\")","v":""}]
[{"$f":"IF(A22=\"F\",A22,\"\")","v":""},null,null,null,null,1,null,null,null,0,null,null,null,{"$f":"1-F23-J23","v":0},null,null,null,{"$f":"IFERROR(E21/100,\"\")","v":0}]
[{"$f":"IF(D24>0,\"F\",\"\")","v":""},"FUNDAÇÕES E SONDAGENS",null,{"$f":"Orçamento!V331","v":0},{"$f":"Orçamento!X331","v":0},{"$f":"ROUND(F26*$D$24,2)","v":0},null,null,null,{"$f":"ROUND(J26*$D$24,2)","v":0},null,null,null,{"$f":"ROUND(N26*$D$24,2)","v":0},null,null,null,{"$f":"SUM(F24:Q24)","v":0}]
[{"$f":"IF(A24=\"F\",A24,\"\")","v":""}]
[{"$f":"IF(A25=\"F\",A25,\"\")","v":""},null,null,null,null,1,null,null,null,0,null,null,null,{"$f":"1-F26-J26","v":0},null,null,null,{"$f":"IFERROR(E24/100,\"\")","v":0}]
[{"$f":"IF(D27>0,\"F\",\"\")","v":""},"ESTRUTURA",null,{"$f":"Orçamento!V332","v":0},{"$f":"Orçamento!X332","v":0},{"$f":"ROUND(F29*$D$27,2)","v":0},null,null,null,{"$f":"ROUND(J29*$D$27,2)","v":0},null,null,null,{"$f":"ROUND(N29*$D$27,2)","v":0},null,null,null,{"$f":"SUM(F27:Q27)","v":0}]
[{"$f":"IF(A27=\"F\",A27,\"\")","v":""}]
[{"$f":"IF(A28=\"F\",A28,\"\")","v":""},null,null,null,null,0.54,null,null,null,0.46,null,null,null,{"$f":"1-F29-J29","v":0},null,null,null,{"$f":"IFERROR(E27/100,\"\")","v":0}]
[{"$f":"IF(D30>0,\"F\",\"\")","v":""},"INST.ELET/TELEFÔNICA/CABEAMENTO ESTRUTURADO",null,{"$f":"Orçamento!V333","v":0},{"$f":"Orçamento!X333","v":0},{"$f":"ROUND(F32*$D$30,2)","v":0},null,null,null,{"$f":"ROUND(J32*$D$30,2)","v":0},null,null,null,{"$f":"ROUND(N32*$D$30,2)","v":0},null,null,null,{"$f":"SUM(F30:Q30)","v":0}]
[{"$f":"IF(A30=\"F\",A30,\"\")","v":""}]
[{"$f":"IF(A31=\"F\",A31,\"\")","v":""},null,null,null,null,0,null,null,null,{"$f":"1-B32","v":1},null,null,null,{"$f":"1-F32-J32","v":0},null,null,null,{"$f":"IFERROR(E30/100,\"\")","v":0}]
[{"$f":"IF(D33>0,\"F\",\"\")","v":""},"INSTALAÇÕES HIDROSSANITÁRIAS",null,{"$f":"Orçamento!V334","v":0},{"$f":"Orçamento!X334","v":0},{"$f":"ROUND(F35*$D$33,2)","v":0},null,null,null,{"$f":"ROUND(J35*$D$33,2)","v":0},null,null,null,{"$f":"ROUND(N35*$D$33,2)","v":0},null,null,null,{"$f":"SUM(F33:Q33)","v":0}]
[{"$f":"IF(A33=\"F\",A33,\"\")","v":""}]
[{"$f":"IF(A34=\"F\",A34,\"\")","v":""},null,null,null,null,0,null,null,null,{"$f":"1-B35","v":1},null,null,null,{"$f":"1-F35-J35","v":0},null,null,null,{"$f":"IFERROR(E33/100,\"\")","v":0}]
[{"$f":"IF(D36>0,\"F\",\"\")","v":""},"INSTALAÇÕES ESPECIAIS",null,{"$f":"Orçamento!V335","v":0},{"$f":"Orçamento!X335","v":0},{"$f":"ROUND(F38*$D$36,2)","v":0},null,null,null,{"$f":"ROUND(J38*$D$36,2)","v":0},null,null,null,{"$f":"ROUND(N38*$D$36,2)","v":0},null,null,null,{"$f":"SUM(F36:Q36)","v":0}]
[{"$f":"IF(A36=\"F\",A36,\"\")","v":""}]
[{"$f":"IF(A37=\"F\",A37,\"\")","v":""},null,null,null,null,0,null,null,null,{"$f":"1-B38","v":1},null,null,null,{"$f":"1-F38-J38","v":0},null,null,null,{"$f":"IFERROR(E36/100,\"\")","v":0}]
[{"$f":"IF(D39>0,\"F\",\"\")","v":""},"ALVENARIA E DIVISÓRIAS",null,{"$f":"Orçamento!V336","v":0},{"$f":"Orçamento!X336","v":0},{"$f":"ROUND(F41*$D$39,2)","v":0},null,null,null,{"$f":"ROUND(J41*$D$39,2)","v":0},null,null,null,{"$f":"ROUND(N41*$D$39,2)","v":0},null,null,null,{"$f":"SUM(F39:Q39)","v":0}]
[{"$f":"IF(A39=\"F\",A39,\"\")","v":""}]
[{"$f":"IF(A40=\"F\",A40,\"\")","v":""},null,null,null,null,0,null,null,null,{"$f":"1-B41","v":1},null,null,null,{"$f":"1-F41-J41","v":0},null,null,null,{"$f":"IFERROR(E39/100,\"\")","v":0}]
[{"$f":"IF(D42>0,\"F\",\"\")","v":""},"ALVENARIA AUTO-PORTANTE",null,{"$f":"Orçamento!V337","v":0},{"$f":"Orçamento!X337","v":0},{"$f":"ROUND(F44*$D$42,2)","v":0},null,null,null,{"$f":"ROUND(J44*$D$42,2)","v":0},null,null,null,{"$f":"ROUND(N44*$D$42,2)","v":0},null,null,null,{"$f":"SUM(F42:Q42)","v":0}]
[{"$f":"IF(A42=\"F\",A42,\"\")","v":""}]
[{"$f":"IF(A43=\"F\",A43,\"\")","v":""},null,null,null,null,0,null,null,null,{"$f":"1-B44","v":1},null,null,null,{"$f":"1-F44-J44","v":0},null,null,null,{"$f":"IFERROR(E42/100,\"\")","v":0}]
[{"$f":"IF(D45>0,\"F\",\"\")","v":""},"IMPERMEABILIZAÇÃO",null,{"$f":"Orçamento!V338","v":0},{"$f":"Orçamento!X338","v":0},{"$f":"ROUND(F47*$D$45,2)","v":0},null,null,null,{"$f":"ROUND(J47*$D$45,2)","v":0},null,null,null,{"$f":"ROUND(N47*$D$45,2)","v":0},null,null,null,{"$f":"SUM(F45:Q45)","v":0}]
[{"$f":"IF(A45=\"F\",A45,\"\")","v":""}]
[{"$f":"IF(A46=\"F\",A46,\"\")","v":""},null,null,null,null,0.85,null,null,null,0.15,null,null,null,{"$f":"1-F47-J47","v":0},null,null,null,{"$f":"IFERROR(E45/100,\"\")","v":0}]
[{"$f":"IF(D48>0,\"F\",\"\")","v":""},"ISOLAMENTO TÉRMICO E ACÚSTICO",null,{"$f":"Orçamento!V339","v":0},{"$f":"Orçamento!X339","v":0},{"$f":"ROUND(F50*$D$48,2)","v":0},null,null,null,{"$f":"ROUND(J50*$D$48,2)","v":0},null,null,null,{"$f":"ROUND(N50*$D$48,2)","v":0},null,null,null,{"$f":"SUM(F48:Q48)","v":0}]
[{"$f":"IF(A48=\"F\",A48,\"\")","v":""}]
[{"$f":"IF(A49=\"F\",A49,\"\")","v":""},null,null,null,null,0,null,null,null,{"$f":"1-B50","v":1},null,null,null,{"$f":"1-F50-J50","v":0},null,null,null,{"$f":"IFERROR(E48/100,\"\")","v":0}]
[{"$f":"IF(D51>0,\"F\",\"\")","v":""},"ESTRUTURA DE MADEIRA",null,{"$f":"Orçamento!V340","v":0},{"$f":"Orçamento!X340","v":0},{"$f":"ROUND(F53*$D$51,2)","v":0},null,null,null,{"$f":"ROUND(J53*$D$51,2)","v":0},null,null,null,{"$f":"ROUND(N53*$D$51,2)","v":0},null,null,null,{"$f":"SUM(F51:Q51)","v":0}]
[{"$f":"IF(A51=\"F\",A51,\"\")","v":""}]
[{"$f":"IF(A52=\"F\",A52,\"\")","v":""},null,null,null,null,0,null,null,null,0.57999999999999996,null,null,null,{"$f":"1-F53-J53","v":0.42000000000000004},null,null,null,{"$f":"IFERROR(E51/100,\"\")","v":0}]
[{"$f":"IF(D54>0,\"F\",\"\")","v":""},"ESTRUTURA METÁLICA",null,{"$f":"Orçamento!V341","v":0},{"$f":"Orçamento!X341","v":0},{"$f":"ROUND(F56*$D$54,2)","v":0},null,null,null,{"$f":"ROUND(J56*$D$54,2)","v":0},null,null,null,{"$f":"ROUND(N56*$D$54,2)","v":0},null,null,null,{"$f":"SUM(F54:Q54)","v":0}]
[{"$f":"IF(A54=\"F\",A54,\"\")","v":""}]
[{"$f":"IF(A55=\"F\",A55,\"\")","v":""},null,null,null,null,0,null,null,null,0.57999999999999996,null,null,null,{"$f":"1-F56-J56","v":0.42000000000000004},null,null,null,{"$f":"IFERROR(E54/100,\"\")","v":0}]
[{"$f":"IF(D57>0,\"F\",\"\")","v":""},"COBERTURAS",null,{"$f":"Orçamento!V342","v":0},{"$f":"Orçamento!X342","v":0},{"$f":"ROUND(F59*$D$57,2)","v":0},null,null,null,{"$f":"ROUND(J59*$D$57,2)","v":0},null,null,null,{"$f":"ROUND(N59*$D$57,2)","v":0},null,null,null,{"$f":"SUM(F57:Q57)","v":0}]
[{"$f":"IF(A57=\"F\",A57,\"\")","v":""}]
[{"$f":"IF(A58=\"F\",A58,\"\")","v":""},null,null,null,null,0,null,null,null,0,null,null,null,{"$f":"1-F59-J59","v":1},null,null,null,{"$f":"IFERROR(E57/100,\"\")","v":0}]
[{"$f":"IF(D60>0,\"F\",\"\")","v":""},"ESQUADRIAS DE MADEIRA",null,{"$f":"Orçamento!V343","v":0},{"$f":"Orçamento!X343","v":0},{"$f":"ROUND(F62*$D$60,2)","v":0},null,null,null,{"$f":"ROUND(J62*$D$60,2)","v":0},null,null,null,{"$f":"ROUND(N62*$D$60,2)","v":0},null,null,null,{"$f":"SUM(F60:Q60)","v":0}]
[{"$f":"IF(A60=\"F\",A60,\"\")","v":""}]
[{"$f":"IF(A61=\"F\",A61,\"\")","v":""},null,null,null,null,0,null,null,null,0.4,null,null,null,{"$f":"1-F62-J62","v":0.6},null,null,null,{"$f":"IFERROR(E60/100,\"\")","v":0}]
[{"$f":"IF(D63>0,\"F\",\"\")","v":""},"ESQUADRIAS METÁLICAS",null,{"$f":"Orçamento!V344","v":0},{"$f":"Orçamento!X344","v":0},{"$f":"ROUND(F65*$D$63,2)","v":0},null,null,null,{"$f":"ROUND(J65*$D$63,2)","v":0},null,null,null,{"$f":"ROUND(N65*$D$63,2)","v":0},null,null,null,{"$f":"SUM(F63:Q63)","v":0}]
[{"$f":"IF(A63=\"F\",A63,\"\")","v":""}]
[{"$f":"IF(A64=\"F\",A64,\"\")","v":""},null,null,null,null,0,null,null,null,0.45,null,null,null,{"$f":"1-F65-J65","v":0.55000000000000004},null,null,null,{"$f":"IFERROR(E63/100,\"\")","v":0}]
[{"$f":"IF(D66>0,\"F\",\"\")","v":""},"VIDROS",null,{"$f":"Orçamento!V345","v":0},{"$f":"Orçamento!X345","v":0},{"$f":"ROUND(F68*$D$66,2)","v":0},null,null,null,{"$f":"ROUND(J68*$D$66,2)","v":0},null,null,null,{"$f":"ROUND(N68*$D$66,2)","v":0},null,null,null,{"$f":"SUM(F66:Q66)","v":0}]
[{"$f":"IF(A66=\"F\",A66,\"\")","v":""}]
[{"$f":"IF(A67=\"F\",A67,\"\")","v":""},null,null,null,null,0,null,null,null,0,null,null,null,{"$f":"1-F68-J68","v":1},null,null,null,{"$f":"IFERROR(E66/100,\"\")","v":0}]
[{"$f":"IF(D69>0,\"F\",\"\")","v":""},"REVESTIMENTO DE PAREDE",null,{"$f":"Orçamento!V346","v":0},{"$f":"Orçamento!X346","v":0},{"$f":"ROUND(F71*$D$69,2)","v":0},null,null,null,{"$f":"ROUND(J71*$D$69,2)","v":0},null,null,null,{"$f":"ROUND(N71*$D$69,2)","v":0},null,null,null,{"$f":"SUM(F69:Q69)","v":0}]
[{"$f":"IF(A69=\"F\",A69,\"\")","v":""}]
[{"$f":"IF(A70=\"F\",A70,\"\")","v":""},null,null,null,null,0,null,null,null,0.4,null,null,null,{"$f":"1-F71-J71","v":0.6},null,null,null,{"$f":"IFERROR(E69/100,\"\")","v":0}]
[{"$f":"IF(D72>0,\"F\",\"\")","v":""},"FORROS",null,{"$f":"Orçamento!V347","v":0},{"$f":"Orçamento!X347","v":0},{"$f":"ROUND(F74*$D$72,2)","v":0},null,null,null,{"$f":"ROUND(J74*$D$72,2)","v":0},null,null,null,{"$f":"ROUND(N74*$D$72,2)","v":0},null,null,null,{"$f":"SUM(F72:Q72)","v":0}]
[{"$f":"IF(A72=\"F\",A72,\"\")","v":""}]
[{"$f":"IF(A73=\"F\",A73,\"\")","v":""},null,null,null,null,0,null,null,null,0.4,null,null,null,{"$f":"1-F74-J74","v":0.6},null,null,null,{"$f":"IFERROR(E72/100,\"\")","v":0}]
[{"$f":"IF(D75>0,\"F\",\"\")","v":""},"REVESTIMENTO DE PISO",null,{"$f":"Orçamento!V348","v":0},{"$f":"Orçamento!X348","v":0},{"$f":"ROUND(F77*$D$75,2)","v":0},null,null,null,{"$f":"ROUND(J77*$D$75,2)","v":0},null,null,null,{"$f":"ROUND(N77*$D$75,2)","v":0},null,null,null,{"$f":"SUM(F75:Q75)","v":0}]
[{"$f":"IF(A75=\"F\",A75,\"\")","v":""}]
[{"$f":"IF(A76=\"F\",A76,\"\")","v":""},null,null,null,null,0,null,null,null,0.4,null,null,null,{"$f":"1-F77-J77","v":0.6},null,null,null,{"$f":"IFERROR(E75/100,\"\")","v":0}]
[{"$f":"IF(D78>0,\"F\",\"\")","v":""},"FERRAGENS",null,{"$f":"Orçamento!V349","v":0},{"$f":"Orçamento!X349","v":0},{"$f":"ROUND(F80*$D$78,2)","v":0},null,null,null,{"$f":"ROUND(J80*$D$78,2)","v":0},null,null,null,{"$f":"ROUND(N80*$D$78,2)","v":0},null,null,null,{"$f":"SUM(F78:Q78)","v":0}]
[{"$f":"IF(A78=\"F\",A78,\"\")","v":""}]
[{"$f":"IF(A79=\"F\",A79,\"\")","v":""},null,null,null,null,0,null,null,null,0,null,null,null,{"$f":"1-F80-J80","v":1},null,null,null,{"$f":"IFERROR(E78/100,\"\")","v":0}]
[{"$f":"IF(D81>0,\"F\",\"\")","v":""},"MARCENARIA",null,{"$f":"Orçamento!V350","v":0},{"$f":"Orçamento!X350","v":0},{"$f":"ROUND(F83*$D$81,2)","v":0},null,null,null,{"$f":"ROUND(J83*$D$81,2)","v":0},null,null,null,{"$f":"ROUND(N83*$D$81,2)","v":0},null,null,null,{"$f":"SUM(F81:Q81)","v":0}]
[{"$f":"IF(A81=\"F\",A81,\"\")","v":""}]
[{"$f":"IF(A82=\"F\",A82,\"\")","v":""},null,null,null,null,0,null,null,null,0,null,null,null,{"$f":"1-F83-J83","v":1},null,null,null,{"$f":"IFERROR(E81/100,\"\")","v":0}]
[{"$f":"IF(D84>0,\"F\",\"\")","v":""},"ADMINISTRAÇÃO - MENSALISTAS",null,{"$f":"Orçamento!V351","v":0},{"$f":"Orçamento!X351","v":0},{"$f":"ROUND(F86*$D$84,2)","v":0},null,null,null,{"$f":"ROUND(J86*$D$84,2)","v":0},null,null,null,{"$f":"ROUND(N86*$D$84,2)-0.01","v":-0.01},null,null,null,{"$f":"SUM(F84:Q84)","v":-0.01}]
[{"$f":"IF(A84=\"F\",A84,\"\")","v":""}]
[{"$f":"IF(A85=\"F\",A85,\"\")","v":""},null,null,null,null,0.34,null,null,null,0.33,null,null,null,0.33,null,null,null,{"$f":"IFERROR(E84/100,\"\")","v":0}]
[{"$f":"IF(D87>0,\"F\",\"\")","v":""},"PINTURA",null,{"$f":"Orçamento!V352","v":0},{"$f":"Orçamento!X352","v":0},{"$f":"ROUND(F89*$D$87,2)","v":0},null,null,null,{"$f":"ROUND(J89*$D$87,2)","v":0},null,null,null,{"$f":"ROUND(N89*$D$87,2)","v":0},null,null,null,{"$f":"SUM(F87:Q87)","v":0}]
[{"$f":"IF(A87=\"F\",A87,\"\")","v":""}]
[{"$f":"IF(A88=\"F\",A88,\"\")","v":""},null,null,null,null,0,null,null,null,0,null,null,null,{"$f":"1-F89-J89","v":1},null,null,null,{"$f":"IFERROR(E87/100,\"\")","v":0}]
[{"$f":"IF(D90>0,\"F\",\"\")","v":""},"DIVERSOS",null,{"$f":"Orçamento!V353","v":0},{"$f":"Orçamento!X353","v":0},{"$f":"ROUND(F92*$D$90,2)","v":0},null,null,null,{"$f":"ROUND(J92*$D$90,2)","v":0},null,null,null,{"$f":"ROUND(N92*$D$90,2)","v":0},null,null,null,{"$f":"SUM(F90:Q90)","v":0}]
[{"$f":"IF(A90=\"F\",A90,\"\")","v":""}]
[{"$f":"IF(A91=\"F\",A91,\"\")","v":""},null,null,null,null,0,null,null,null,0,null,null,null,{"$f":"1-F92-J92","v":1},null,null,null,{"$f":"IFERROR(E90/100,\"\")","v":0}]
["F","CUSTO DO ORÇAMENTO",null,{"$f":"SUM(D15:D92)","v":0},{"$f":"SUM(E15:E92)","v":0},{"$f":"F15+F18+F21+F24+F27+F30+F33+F36+F39+F42+F45+F48+F51+F54+F57+F60+F63+F66+F69+F72+F75+F78+F81+F84+F87+F90","v":-0.01},null,null,null,{"$f":"J15+J18+J21+J24+J27+J30+J33+J36+J39+J42+J45+J48+J51+J54+J57+J60+J63+J66+J69+J72+J75+J78+J81+J84+J87+J90","v":0},null,null,null,{"$f":"N15+N18+N21+N24+N27+N30+N33+N36+N39+N42+N45+N48+N51+N54+N57+N60+N63+N66+N69+N72+N75+N78+N81+N84+N87+N90","v":-0.01},null,null,null,{"$f":"R15+R18+R21+R24+R27+R30+R33+R36+R39+R42+R45+R48+R51+R54+R57+R60+R63+R66+R69+R72+R75+R78+R81+R84+R87+R90","v":-0.02}]
["F","PERCENTUAIS:",null,null,null,{"$f":"IFERROR(F93/D93,\"\")","v":""},null,null,null,{"$f":"IFERROR(J93/D93,\"\")","v":""},null,null,null,{"$f":"IFERROR(N93/D93,\"\")","v":""},null,null,null,{"$f":"SUM(F94:Q94)","v":0}]
["F","TOTAIS ACUMULADOS:",null,null,null,{"$f":"F93","v":-0.01},null,null,null,{"$f":"F95+J93","v":-0.01},null,null,null,{"$f":"J95+N93","v":-0.02}]
["F","PERCENTUAIS  ACUMULADOS:",null,null,null,{"$f":"F94","v":""},null,null,null,{"$f":"J94+F96","v":{"$error":"#VALUE!"}},null,null,null,{"$f":"IFERROR(J96+N94,\"\")","v":""}]
["F"]
["F","OBSERVAÇÕES:"]
["F","Os pagamentos somente poderão ser efetuados mediante medição e atesto pelos técnicos da Secretaria da Educação. "]

{"sheet":"Composição BDI","index":4,"n_rows":45,"n_cols":9,"rows_kept":45,"cut":false,"hidden":false,"merged":[[18,5,18,8],[17,0,17,3],[16,0,16,3],[44,0,44,3],[42,0,42,3],[43,0,43,3],[18,0,18,3],[36,0,36,3],[39,0,39,3],[38,0,38,3],[40,0,40,3],[29,0,29,2],[32,0,32,3],[33,0,33,3],[34,0,34,3],[35,0,35,3],[0,0,0,3],[1,0,1,3],[4,0,4,3],[7,0,7,3],[10,0,10,3],[2,0,2,3],[3,0,3,3],[5,0,5,3],[6,0,6,3],[8,0,8,3],[9,0,9,3],[11,0,11,3],[12,0,12,3],[14,0,14,3],[15,0,15,3],[13,0,13,3]]}
[]
[]
["UNIDADE ESCOLAR"]
[{"$f":"Orçamento!$O$4","v":"COLÉGIO ESTADUAL CORONEL ERNESTO ANTONIO DE ARAÚJO"}]
[]
["OBRA"]
[{"$f":"Orçamento!$O$7","v":"IMPLANTAÇÃO"}]
[]
["ENDEREÇO"]
[{"$f":"Orçamento!$R$10","v":"RUA JESUS JOSE DE ALMEIDA, CENTRO, CEP:73900-000"}]
[]
["CIDADE"]
[{"$f":"Orçamento!$V$7","v":"POSSE"}]
[]
["CRE"]
[{"$f":"Orçamento!$O$10","v":"POSSE"}]
[]
["DETALHAMENTO DA COMPOSIÇÃO DE BDI"]
["COMPOSIÇÃO BDI PARA OBRAS CIVIS",null,null,null,null,"BDI CONSTRUÇÃO E REFORMA"]
["DESCRIÇÃO","COEF.","TAXA % (a.m)","% no preço de venda",null,"Situação","1º Quartil","Médio","3º Quartil"]
["1) COFINS",1,0.03,{"$f":"C21","v":0.03},null,{"$f":"IF(OR(C21<G21,C21>I21),\"FORA DO INTERVALO\",\"OK\")","v":"OK"},0.03,0.03,0.03]
["2) PIS",1,6.4999999999999997E-3,{"$f":"C22","v":6.4999999999999997E-3},null,{"$f":"IF(OR(C22<G22,C22>I22),\"FORA DO INTERVALO\",\"OK\")","v":"OK"},6.4999999999999997E-3,6.4999999999999997E-3,6.4999999999999997E-3]
["3) ISSQN",1,0.03,{"$f":"C23*B23","v":0.03},null,"OK",0.02,3.5000000000000003E-2,0.05]
["4) CPRB",1,0,{"$f":"C24","v":0},null,"FORA DO INTERVALO",4.4999999999999998E-2,4.4999999999999998E-2,4.4999999999999998E-2]
["5) Administração Central",1,0.04,0.04,null,"OK",0.03,0.04,5.5E-2]
["6) Despesas Financeiras",1,5.5999999999999999E-3,5.5999999999999999E-3,null,"FORA DO INTERVALO",5.8999999999999999E-3,1.23E-2,1.3899999999999999E-2]
["7) Seguros + Garantias",1,1.1999999999999999E-3,1.1999999999999999E-3,null,"FORA DO INTERVALO",8.0000000000000002E-3,8.0000000000000002E-3,0.01]
["8) Risco",1,9.7000000000000003E-3,9.7000000000000003E-3,null,"OK",9.7000000000000003E-3,1.2699999999999999E-2,1.2699999999999999E-2]
["9) Lucro",1,6.3100000000000003E-2,6.3100000000000003E-2,null,"OK",6.1600000000000002E-2,7.3999999999999996E-2,8.9599999999999999E-2]
["BDI - FINAL",null,null,{"$f":"(((1+D25+D27+D28)*(1+D26)*(1+D29))/(1-(D21+D22+D23+D24))-1)","v":0.20350099199143035},null,{"$f":"IF(OR(D30<G30,D30>I30),\"FORA DO INTERVALO\",\"OK\")","v":"OK"},0.2034,0.22120000000000001,0.25]
[]
["Notas:"]
["(1) e (2) Alíquota definida por lei."]
["(3) Alíquota e base de cálculo definidas pela legislação municipal."]
["(4) Alíquota definida pelas leis 12.546/11, 12844/13 e 13.161/15 (CPRB – contribuição previdenciária sobre a receita bruta)."]
["(5) Valores definidos a partir dos limites no Acórdão nº 2.622/2013 - TCU – Plenário. Valores entre o 1º e 3º quartis."]
["(6) Valor calculado pela expressão matemática do acórdão 2.369/2011 – TCU – Plenário e disponibilizado pela AGETOP em dezembro de 2018. (Foi utilizado para o cálculo a média da Taxa SELIC no período de 11/2017 a 10/2018)"]
[]
["(7) Valores definidos pela AGETOP a partir dos limites no Acórdão nº 2.622/2013 - TCU – Plenário. Valores médios. \n\nObservação da AGETOP: (Seguros contra erros de execução, incêndio e explosão, danos da natureza (vendaval, destelhamento, alagamento, inundação, desmoronamento, geadas etc.), emprego de material defeituoso ou inadequado, roubo e/ou furto qualificado, quebra de equipamentos, desmoronamento de estrutura, nas modalidades de Obras Civis em Construção (OCC); Instalação e Montagem (IM); e Obras Civis em Construção e Instalação e Montagem (OCC/IM). Bem como coberturas adicionais para ampliação dessas coberturas básicas, como: cobertura de responsabilidade civil geral, cobertura de responsabilidade civil cruzada, cobertura de despesas extraordinárias, cobertura de tumultos, cobertura de desentulho do local, cobertura de riscos do fabricante, dentre outras, incluindo o seguro de vida em grupo regido pela convenção coletiva dos trabalhadores na indústria da construção civil). A partir de 24/02/2015 por intermédio da Portaria 449/2015 a Presidência da AGETOP, na pessoa do Senhor Jayme Eduardo Rincon, determinou a exclusão dos valores referentes aos Seguros de Risco de Engenharia e Responsabilidade Civil do Profissional na composição do cálculo do B.D.I.."]
["(8) Valores definidos a partir dos limites no Acórdão nº 2.622/2013 - TCU – Plenário. Valores entre 1º e 3° quartis."]
["(9) Valores definidos a partir dos limites definidos no Acórdão nº 2.622/2013 - TCU – Plenário. Valores adotados e praticados no mercado ( “ ex ante ” ) ou aqueles entre os 1º e 3º quartis."]
[]
["(*) A fórmula para estipulação da taxa de BDI estimado adotado é a mesma que foi aplicada para a obtenção das tabelas contidas no Acórdão n. 2.622/2013 – TCUPlenário"]
[]
["Obs.: Para obras com valores superiores a R$ 20.000.000,00 sugere-se recalcular o BDI, dimensionando as taxas de administração central e lucro para patamares inferiores ao estipulado acima."]

{"sheet":"Relatório CENTRAL","index":5,"n_rows":40,"n_cols":7,"rows_kept":40,"cut":false,"hidden":false,"merged":[[7,1,7,4],[8,1,8,2],[8,3,8,4],[9,1,9,2],[10,1,10,4],[11,1,11,4],[39,1,39,2],[9,0,11,0],[0,1,0,4],[6,3,6,4],[9,3,9,4],[1,1,1,4],[2,1,2,2],[2,3,2,4],[3,1,3,2],[3,3,3,4],[4,1,4,4],[5,1,5,2],[5,3,5,4],[6,1,6,2]]}
[]
[]
[null,"UNIDADE ESCOLAR",null,"CIDADE"]
[null,{"$f":"Orçamento!$O$4","v":"COLÉGIO ESTADUAL CORONEL ERNESTO ANTONIO DE ARAÚJO"},null,{"$f":"Orçamento!$V$7","v":"POSSE"}]
[]
[null,"OBRA",null,"CRE"]
[null,{"$f":"Orçamento!$O$7","v":"IMPLANTAÇÃO"},null,{"$f":"Orçamento!$O$10","v":"POSSE"}]
[]
[null,"ENDEREÇO",null,"DATA"]
["FILTRO",{"$f":"Orçamento!$R$10","v":"RUA JESUS JOSE DE ALMEIDA, CENTRO, CEP:73900-000"},null,{"$f":"Orçamento!$S$7","v":"2020-05-12"}]
[]
[null,"RELATÓRIO CENTRAL"]
["↓","CÓDIGO","ETAPA","PREÇO  (R$) C/ BDI","PARTIC  ( % )"]
[{"$f":"IF(D14>0,\"F\",\"\")","v":""},{"$f":"Orçamento!O328","v":"a."},{"$f":"Orçamento!P328","v":"SERVIÇOS PRELIMINARES"},{"$f":"Orçamento!V328","v":0},{"$f":"Orçamento!X328","v":0},0,2]
[{"$f":"IF(D15>0,\"F\",\"\")","v":""},{"$f":"Orçamento!O329","v":"b."},{"$f":"Orçamento!P329","v":"TRANSPORTES"},{"$f":"Orçamento!V329","v":0},{"$f":"Orçamento!X329","v":0},6,3]
["",{"$f":"Orçamento!O330","v":"c."},{"$f":"Orçamento!P330","v":"SERVIÇO EM TERRA"},{"$f":"Orçamento!V330","v":0},{"$f":"Orçamento!X330","v":0},8,7]
["",{"$f":"Orçamento!O331","v":"d."},{"$f":"Orçamento!P331","v":"FUNDAÇÕES E SONDAGENS"},{"$f":"Orçamento!V331","v":0},{"$f":"Orçamento!X331","v":0},5,7]
["",{"$f":"Orçamento!O332","v":"e."},{"$f":"Orçamento!P332","v":"ESTRUTURA"},{"$f":"Orçamento!V332","v":0},{"$f":"Orçamento!X332","v":0},7,0]
["",{"$f":"Orçamento!O333","v":"f."},{"$f":"Orçamento!P333","v":"INSTALAÇÕES ELÉTRICAS"},{"$f":"Orçamento!V333","v":0},{"$f":"Orçamento!X333","v":0},8,7]
["",{"$f":"Orçamento!O334","v":"g."},{"$f":"Orçamento!P334","v":"INSTALAÇÕES HIDROSSANITÁRIAS"},{"$f":"Orçamento!V334","v":0},{"$f":"Orçamento!X334","v":0},3,3]
["",{"$f":"Orçamento!O335","v":"h"},{"$f":"Orçamento!P335","v":"INSTALAÇÕES ESPECIAIS"},{"$f":"Orçamento!V335","v":0},{"$f":"Orçamento!X335","v":0},4,1]
["",{"$f":"Orçamento!O336","v":"i."},{"$f":"Orçamento!P336","v":"ALVENARIAS E DIVISÓRIAS"},{"$f":"Orçamento!V336","v":0},{"$f":"Orçamento!X336","v":0},0,8]
["",{"$f":"Orçamento!O337","v":"j."},{"$f":"Orçamento!P337","v":"ALVENARIA AUTO-PORTANTE"},{"$f":"Orçamento!V337","v":0},{"$f":"Orçamento!X337","v":0}]
["",{"$f":"Orçamento!O338","v":"k."},{"$f":"Orçamento!P338","v":"IMPERMEABILIZAÇÃO"},{"$f":"Orçamento!V338","v":0},{"$f":"Orçamento!X338","v":0},5,5]
["",{"$f":"Orçamento!O339","v":"l."},{"$f":"Orçamento!P339","v":"ISOLAMENTO TÉRMICO E ACÚSTICO"},{"$f":"Orçamento!V339","v":0},{"$f":"Orçamento!X339","v":0}]
["",{"$f":"Orçamento!O340","v":"m."},{"$f":"Orçamento!P340","v":"ESTRUTURA DE MADEIRA"},{"$f":"Orçamento!V340","v":0},{"$f":"Orçamento!X340","v":0}]
["",{"$f":"Orçamento!O341","v":"n."},{"$f":"Orçamento!P341","v":"ESTRUTURAS METÁLICAS"},{"$f":"Orçamento!V341","v":0},{"$f":"Orçamento!X341","v":0},2,5]
["",{"$f":"Orçamento!O342","v":"o."},{"$f":"Orçamento!P342","v":"COBERTURAS"},{"$f":"Orçamento!V342","v":0},{"$f":"Orçamento!X342","v":0},1,6]
["",{"$f":"Orçamento!O343","v":"p."},{"$f":"Orçamento!P343","v":"ESQUADRIAS DE MADEIRA"},{"$f":"Orçamento!V343","v":0},{"$f":"Orçamento!X343","v":0}]
["",{"$f":"Orçamento!O344","v":"q."},{"$f":"Orçamento!P344","v":"ESQUADRIAS METÁLICAS"},{"$f":"Orçamento!V344","v":0},{"$f":"Orçamento!X344","v":0},1,3]
["",{"$f":"Orçamento!O345","v":"r."},{"$f":"Orçamento!P345","v":"VIDROS"},{"$f":"Orçamento!V345","v":0},{"$f":"Orçamento!X345","v":0},4,3]
["",{"$f":"Orçamento!O346","v":"s."},{"$f":"Orçamento!P346","v":"REVESTIMENTO DE PAREDE"},{"$f":"Orçamento!V346","v":0},{"$f":"Orçamento!X346","v":0},2,2]
["",{"$f":"Orçamento!O347","v":"t."},{"$f":"Orçamento!P347","v":"FORROS"},{"$f":"Orçamento!V347","v":0},{"$f":"Orçamento!X347","v":0},7,2]
["",{"$f":"Orçamento!O348","v":"u."},{"$f":"Orçamento!P348","v":"REVESTIMENTO DE PISO"},{"$f":"Orçamento!V348","v":0},{"$f":"Orçamento!X348","v":0},0,7]
["",{"$f":"Orçamento!O349","v":"v."},{"$f":"Orçamento!P349","v":"FERRAGENS"},{"$f":"Orçamento!V349","v":0},{"$f":"Orçamento!X349","v":0},1,5]
["",{"$f":"Orçamento!O350","v":"w."},{"$f":"Orçamento!P350","v":"MARCENARIA"},{"$f":"Orçamento!V350","v":0},{"$f":"Orçamento!X350","v":0}]
["",{"$f":"Orçamento!O351","v":"x."},{"$f":"Orçamento!P351","v":"ADMINISTRAÇÃO"},{"$f":"Orçamento!V351","v":0},{"$f":"Orçamento!X351","v":0},0,8]
["",{"$f":"Orçamento!O352","v":"y."},{"$f":"Orçamento!P352","v":"PINTURA"},{"$f":"Orçamento!V352","v":0},{"$f":"Orçamento!X352","v":0},7,4]
["",{"$f":"Orçamento!O353","v":"z."},{"$f":"Orçamento!P353","v":"DIVERSOS"},{"$f":"Orçamento!V353","v":0},{"$f":"Orçamento!X353","v":0},3,2]
["F","TOTAL GERAL DO ORÇAMENTO (R$) C/BDI",null,{"$f":"SUM(D14:D39)","v":0},{"$f":"SUM(E14:E39)","v":0},{"$f":"SUM(F14:F39)","v":74},{"$f":"SUM(G14:G39)","v":90}]

{"sheet":"Parc Maior Relev","index":6,"n_rows":32,"n_cols":7,"rows_kept":32,"cut":false,"hidden":false,"merged":[[10,0,12,0],[8,1,8,3],[8,4,8,6],[32,3,32,7],[30,1,30,6],[0,1,0,6],[11,1,11,6],[1,1,1,6],[2,1,2,3],[2,4,2,6],[3,1,3,3],[3,4,3,6],[4,1,4,6],[5,1,5,3],[5,4,5,6],[9,1,9,3],[9,4,9,6],[10,1,10,6],[6,1,6,3],[6,4,6,6],[7,1,7,6]]}
[]
[]
[null,"UNIDADE ESCOLAR",null,null,"CÓDIGO INEP"]
[null,{"$f":"Orçamento!$O$4","v":"COLÉGIO ESTADUAL CORONEL ERNESTO ANTONIO DE ARAÚJO"},null,null,{"$f":"Orçamento!$V$4","v":52041824}]
[]
[null,"OBRA",null,null,"CIDADE"]
[null,{"$f":"Orçamento!$O$7","v":"IMPLANTAÇÃO"},null,null,{"$f":"Orçamento!$V$7","v":"POSSE"}]
[]
[null,"CRE",null,null,"ÁREA TOTAL CONSTRUÍDA (M²)"]
[null,{"$f":"Orçamento!$O$10","v":"POSSE"},null,null,{"$f":"Orçamento!$S$13","v":1275.1199999999999}]
["FILTRO"]
[null,"PARCELA DE MAIOR RELEVÂNCIA"]
[null,"CÓDIGO","SERVIÇO","DESCRIÇÃO","UNID","QUANT","PARC. MAIOR RELEV (100%)"]
[null,70000,"INSTALAÇÕES ELÉTRICAS","SUBESTAÇÃO","KVA",{"$f":"SUMIF(Orçamento!$R$20:$R$309,'Parc Maior Relev'!D14,Orçamento!$T$20:$T$309)","v":0},{"$f":"F14","v":0}]
[null,"CÓDIGO","SERVIÇO","DESCRIÇÃO","UNID","QUANT","PARC. MAIOR RELEV (50%)"]
[null,70000,"INSTALAÇÕES ELÉTRICAS","INSTALAÇÕES ELÉTRICAS","KVA",{"$f":"SUMIF(Orçamento!$R$20:$R$309,'Parc Maior Relev'!D16,Orçamento!$T$20:$T$309)","v":0},{"$f":"F16*0.5","v":0}]
[null,160000,"COBERTURAS","TELHA CERÂMICA","M2",{"$f":"SUMIF(Orçamento!$R$20:$R$309,'Parc Maior Relev'!D17,Orçamento!$T$20:$T$309)","v":0},{"$f":"F17*0.5","v":0}]
[null,160000,"COBERTURAS","TELHA FIBROCIMENTO","M2",{"$f":"SUMIF(Orçamento!$R$20:$R$309,'Parc Maior Relev'!D18,Orçamento!$T$20:$T$309)","v":0},0]
[null,160000,"COBERTURAS","TELHA METÁLICA","M2",{"$f":"Orçamento!T293","v":497.35},248.67500000000001]
[null,200000,"REVESTIMENTO DE PAREDE","REBOCO","M2",{"$f":"SUMIF(Orçamento!$R$20:$R$309,'Parc Maior Relev'!D20,Orçamento!$T$20:$T$309)","v":0},{"$f":"F20*0.5","v":0}]
[null,200000,"REVESTIMENTO DE PAREDE","REVESTIMENTO CERÂMICO","M2",{"$f":"SUMIF(Orçamento!$R$20:$R$309,'Parc Maior Relev'!D21,Orçamento!$T$20:$T$309)","v":0},0]
[null,210000,"FORROS","FORRO DE GESSO","M2",{"$f":"SUMIF(Orçamento!$R$20:$R$309,'Parc Maior Relev'!D22,Orçamento!$T$20:$T$309)","v":0},{"$f":"F22*0.5","v":0}]
[null,210000,"FORROS","FORRO PVC","M2",{"$f":"SUMIF(Orçamento!$R$20:$R$309,'Parc Maior Relev'!D23,Orçamento!$T$20:$T$309)","v":0},0]
[null,210000,"FORROS","FORRO ACARTONADO","M2",{"$f":"SUMIF(Orçamento!$R$20:$R$309,'Parc Maior Relev'!D24,Orçamento!$T$20:$T$309)","v":0},0]
[null,220000,"REVESTIMENTO DE PISO","PISO GRANITINA","M2",{"$f":"Orçamento!T201","v":725.84},362.92]
[null,220000,"REVESTIMENTO DE PISO","PISO LAMINADO","M2",{"$f":"Orçamento!T298","v":403.5},201.75]
[null,220000,"REVESTIMENTO DE PISO","PISO CONCRETO DESEMPENADO","M2",{"$f":"SUMIF(Orçamento!$R$20:$R$309,'Parc Maior Relev'!D27,Orçamento!$T$20:$T$309)","v":0},0]
[null,220000,"REVESTIMENTO DE PISO","PISO CERÂMICO","M2",{"$f":"SUMIF(Orçamento!$R$20:$R$309,'Parc Maior Relev'!D28,Orçamento!$T$20:$T$309)","v":0},{"$f":"F28*0.5","v":0}]
[null,260000,"PINTURA","PINTURA","M2",{"$f":"SUMIF(Orçamento!$R$20:$R$309,'Parc Maior Relev'!D29,Orçamento!$T$20:$T$309)","v":0},0]
["F"]
["F","(*) Para os fins do inciso I dp § 1º do Art. 30 da Lei Federal 8.666/93, são consideradas parcelas de maior relevância técnica as execuções apresentadas"]
["F"]

{"sheet":"Composições","index":7,"n_rows":232,"n_cols":10,"rows_kept":232,"cut":false,"hidden":false,"merged":[[221,5,222,5],[221,6,221,7],[221,8,221,9],[227,1,227,7],[231,1,231,7],[221,0,222,0],[221,1,222,1],[221,2,222,2],[221,3,222,3],[221,4,222,4],[209,5,210,5],[209,6,209,7],[209,8,209,9],[215,1,215,7],[219,1,219,7],[209,0,210,0],[209,1,210,1],[209,2,210,2],[209,3,210,3],[209,4,210,4],[197,5,198,5],[197,6,197,7],[197,8,197,9],[203,1,203,7],[207,1,207,7],[197,0,198,0],[197,1,198,1],[197,2,198,2],[197,3,198,3],[197,4,198,4],[185,5,186,5],[185,6,185,7],[185,8,185,9],[191,1,191,7],[195,1,195,7],[185,0,186,0],[185,1,186,1],[185,2,186,2],[185,3,186,3],[185,4,186,4],[173,5,174,5],[173,6,173,7],[173,8,173,9],[179,1,179,7],[183,1,183,7],[173,0,174,0],[173,1,174,1],[173,2,174,2],[173,3,174,3],[173,4,174,4],[161,5,162,5],[161,6,161,7],[161,8,161,9],[167,1,167,7],[171,1,171,7],[161,0,162,0],[161,1,162,1],[161,2,162,2],[161,3,162,3],[161,4,162,4],[149,5,150,5],[149,6,149,7],[149,8,149,9],[155,1,155,7],[159,1,159,7],[149,0,150,0],[149,1,150,1],[149,2,150,2],[149,3,150,3],[149,4,150,4],[137,5,138,5],[137,6,137,7],[137,8,137,9],[143,1,143,7],[147,1,147,7],[137,0,138,0],[137,1,138,1],[137,2,138,2],[137,3,138,3],[137,4,138,4],[125,5,126,5],[125,6,125,7],[125,8,125,9],[131,1,131,7],[135,1,135,7],[125,0,126,0],[125,1,126,1],[125,2,126,2],[125,3,126,3],[125,4,126,4],[113,5,114,5],[113,6,113,7],[113,8,113,9],[119,1,119,7],[123,1,123,7],[113,0,114,0],[113,1,114,1],[113,2,114,2],[113,3,114,3],[113,4,114,4],[101,5,102,5],[101,6,101,7],[101,8,101,9],[107,1,107,7],[111,1,111,7],[101,0,102,0],[101,1,102,1],[101,2,102,2],[101,3,102,3],[101,4,102,4],[89,5,90,5],[89,6,89,7],[89,8,89,9],[95,1,95,7],[99,1,99,7],[89,0,90,0],[89,1,90,1],[89,2,90,2],[89,3,90,3],[89,4,90,4],[77,5,78,5],[77,6,77,7],[77,8,77,9],[83,1,83,7],[87,1,87,7],[77,0,78,0],[77,1,78,1],[77,2,78,2],[77,3,78,3],[77,4,78,4],[65,5,66,5],[65,6,65,7],[65,8,65,9],[71,1,71,7],[75,1,75,7],[65,0,66,0],[65,1,66,1],[65,2,66,2],[65,3,66,3],[65,4,66,4],[53,5,54,5],[53,6,53,7],[53,8,53,9],[59,1,59,7],[63,1,63,7],[53,0,54,0],[53,1,54,1],[53,2,54,2],[53,3,54,3],[53,4,54,4],[38,5,39,5],[38,6,38,7],[38,8,38,9],[44,1,44,7],[51,1,51,7],[38,0,39,0],[38,1,39,1],[38,2,39,2],[38,3,39,3],[38,4,39,4],[28,5,29,5],[28,6,28,7],[28,8,28,9],[32,1,32,7],[36,1,36,7],[28,0,29,0],[28,1,29,1],[28,2,29,2],[28,3,29,3],[28,4,29,4],[16,5,17,5],[16,6,16,7],[16,8,16,9],[22,1,22,7],[26,1,26,7],[16,0,17,0],[16,1,17,1],[16,2,17,2],[16,3,17,3],[16,4,17,4],[0,0,0,8],[10,0,10,2],[10,3,10,6],[11,0,11,9],[12,0,12,2],[12,3,12,6],[12,7,12,8],[7,0,7,6],[9,0,9,2],[9,3,9,6],[9,7,9,8],[3,0,3,6],[4,0,4,6],[15,0,15,9],[13,0,13,2],[13,3,13,6],[1,0,1,9],[3,7,3,9],[4,7,4,9],[6,7,6,9],[7,7,7,9],[6,0,6,6],[10,8,10,9],[13,8,13,9],[14,0,14,9],[8,0,8,9],[5,0,5,9],[2,0,2,9]]}
[]
[]
[]
["UNIDADE ESCOLAR",null,null,null,null,null,null,"CÓDIGO INEP"]
[{"$f":"Orçamento!$O$4","v":"COLÉGIO ESTADUAL CORONEL ERNESTO ANTONIO DE ARAÚJO"},null,null,null,null,null,null,{"$f":"Orçamento!$V$4","v":52041824}]
[]
["OBRA",null,null,null,null,null,null,"CIDADE"]
[{"$f":"Orçamento!$O$7","v":"IMPLANTAÇÃO"},null,null,null,null,null,null,{"$f":"Orçamento!$V$7","v":"POSSE"}]
[]
["CRE",null,null,"ENDEREÇO",null,null,null,"REFERÊNCIA AGETOP"]
[{"$f":"Orçamento!$O$10","v":"POSSE"},null,null,{"$f":"Orçamento!$R$10","v":"RUA JESUS JOSE DE ALMEIDA, CENTRO, CEP:73900-000"},null,null,null,{"$f":"Orçamento!$V$10","v":"ABR/19"},{"$f":"Orçamento!$W$10","v":"ONERADA"}]
[]
["DATA",null,null,"ÁREA TOTAL CONSTRUÍDA (M²)",null,null,null,"REFERÊNCIA SINAPI"]
[{"$f":"Orçamento!$S$7","v":"2020-05-12"},null,null,{"$f":"Orçamento!$S$13","v":1275.1199999999999},null,null,null,{"$f":"Orçamento!$V$13","v":"SET/19"},{"$f":"Orçamento!$W$13","v":"ONERADA"}]
[]
["COMPOSIÇÕES DE CUSTOS UNITÁRIOS - SEE-GO"]
[24,"FONTE","CÓDIGO","DESCRIÇÃO","UNIDADE","COEFIC.","CUSTO UNITÁRIO",null,"CUSTO  TOTAL (A) + (B) + (C) + (D) + (E)"]
[null,null,null,null,null,null,"DESONERADO","NÃO DESONER.","DESONERADO","NÃO DESONER."]
[null,"COMPOSIÇÃO","COMP 024_SEE","SINALIZADOR FOTOLUMINESCENTE PARA EXTINTOR","UN ",null,"-","-",25.269999999999996,25.389999999999997]
[null,"AGETOP_I",5,"SERVENTE","h     ",0.09,8.1999999999999993,9.51,0.74,0.86]
[null,null,null,"","",null,0,0,0,0]
[null,null,null,"","",null,0,0,0,0]
[null,"MÃO DE OBRA (B) - TOTAL",null,null,null,null,null,null,0.74,0.86]
[null,"AGETOP_I",3070,"BUCHA DE NYLON S-6","un",2,0.04,0.04,0.08,0.08]
[null,"AGETOP_I",3393,"PARAFUSO P/BUCHA S-6","un",2,0.08,0.08,0.16,0.16]
[null,"SINAPI_I",37556,"PLACA DE SINALIZACAO DE SEGURANCA CONTRA INCENDIO, FOTOLUMINESCENTE, QUADRADA, *20 X 20* CM, EM PVC *2* MM ANTI-CHAMAS (SIMBOLOS, CORES E PICTOGRAMAS CONFORME NBR 13434)","UN    ",1,24.29,24.29,24.29,24.29]
[null,"MATERIAL (C) - TOTAL",null,null,null,null,null,null,24.529999999999998,24.529999999999998]
[]
[25,"FONTE","CÓDIGO","DESCRIÇÃO","UNIDADE","COEFIC.","CUSTO UNITÁRIO",null,"CUSTO  TOTAL (A) + (B) + (C) + (D) + (E)"]
[null,null,null,null,null,null,"DESONERADO","NÃO DESONER.","DESONERADO","NÃO DESONER."]
[null,"COMPOSIÇÃO","COMP 025_SEE","SINALIZADOR FOTOLUMINESCENTE DE EMERGÊNCIA","UN ",null,"-","-",25.269999999999996,25.389999999999997]
[null,"AGETOP_I",5,"SERVENTE","h     ",0.09,8.1999999999999993,9.51,0.74,0.86]
[null,"MÃO DE OBRA (B) - TOTAL",null,null,null,null,null,null,0.74,0.86]
[null,"AGETOP_I",3070,"BUCHA DE NYLON S-6","un",2,0.04,0.04,0.08,0.08]
[null,"AGETOP_I",3393,"PARAFUSO P/BUCHA S-6","un",2,0.08,0.08,0.16,0.16]
[null,"SINAPI_I",37556,"PLACA DE SINALIZACAO DE SEGURANCA CONTRA INCENDIO, FOTOLUMINESCENTE, QUADRADA, *20 X 20* CM, EM PVC *2* MM ANTI-CHAMAS (SIMBOLOS, CORES E PICTOGRAMAS CONFORME NBR 13434)","UN    ",1,24.29,24.29,24.29,24.29]
[null,"MATERIAL (C) - TOTAL",null,null,null,null,null,null,24.529999999999998,24.529999999999998]
[]
[277,"FONTE","CÓDIGO","DESCRIÇÃO","UNIDADE","COEFIC.","CUSTO UNITÁRIO",null,"CUSTO  TOTAL (A) + (B) + (C) + (D) + (E)"]
[null,null,null,null,null,null,"DESONERADO","NÃO DESONER.","DESONERADO","NÃO DESONER."]
[null,"COMPOSIÇÃO","COMP 277_SEE","MARCAÇÃO NO PISO - 1X1 M PARA EXTINTOR","M2",null,null,null,29.31,29.389999999999997]
[null,"AGETOP_I",5,"SERVENTE","h     ",3.3300000000000003E-2,8.1999999999999993,9.51,0.27,0.32]
[null,null,null,"","",null,0,0,0,0]
[null,null,null,"","",null,0,0,0,0]
[null,"MÃO DE OBRA (B) - TOTAL",null,null,null,null,null,null,0.27,0.32]
[null,"SINAPI_I",5318,"SOLVENTE DILUENTE A BASE DE AGUARRAS","L     ",0.13,11.16,11.16,1.45,1.45]
[null,"SINAPI",5824,"CAMINHÃO TOCO, PBT 16.000 KG, CARGA ÚTIL MÁX. 10.685 KG, DIST. ENTRE EIXOS 4,8 M, POTÊNCIA 189 CV, INCLUSIVE CARROCERIA FIXA ABERTA DE MADEIRA P/ TRANSPORTE GERAL DE CARGA SECA, DIMEN. APROX. 2,5 X 7,00 X 0,50 M - CHP DIURNO. AF_06/2014","CHP",3.3E-3,139.12,142.33000000000001,0.46,0.47]
[null,"SINAPI_I",7343,"TINTA A BASE DE RESINA ACRILICA, PARA SINALIZACAO HORIZONTAL VIARIA (NBR 11862)","L     ",0.6,12.11,12.11,7.27,7.27]
[null,"SINAPI_I",7348,"TINTA ACRILICA PREMIUM PARA PISO","L     ",0.03,12.41,12.41,0.37,0.37]
[null,"SINAPI_I",25972,"MICROESFERAS DE VIDRO PARA SINALIZACAO HORIZONTAL VIARIA, TIPO I-B (PREMIX) - NBR 16184","KG    ",2.14,8.94,8.94,19.13,19.13]
[null,"SINAPI",95133,"MÁQUINA DEMARCADORA DE FAIXA DE TRÁFEGO À FRIO, AUTOPROPELIDA, POTÊNCIA 38 HP - CHP DIURNO. AF_07/2016","CHP",3.3E-3,110.32,113.9,0.36,0.38]
[null,"MATERIAL (C) - TOTAL",null,null,null,null,null,null,29.04,29.069999999999997]
[]
[235,"FONTE","CÓDIGO","DESCRIÇÃO","UNIDADE","COEFIC.","CUSTO UNITÁRIO",null,"CUSTO  TOTAL (A) + (B) + (C) + (D) + (E)"]
[null,null,null,null,null,null,"DESONERADO","NÃO DESONER.","DESONERADO","NÃO DESONER."]
[null,"COMPOSIÇÃO","COMP 235_SEE","PLACA DE SINALIZAÇÃO EM PVC COD 01 - (300X300) PROIBIDO FUMAR","UN ",null,null,null,25.269999999999996,25.389999999999997]
[null,"AGETOP_I",5,"SERVENTE","h     ",0.09,8.1999999999999993,9.51,0.74,0.86]
[null,null,null,"","",null,0,0,0,0]
[null,null,null,"","",null,0,0,0,0]
[null,"MÃO DE OBRA (B) - TOTAL",null,null,null,null,null,null,0.74,0.86]
[null,"AGETOP_I",3070,"BUCHA DE NYLON S-6","un",2,0.04,0.04,0.08,0.08]
[null,"AGETOP_I",3393,"PARAFUSO P/BUCHA S-6","un",2,0.08,0.08,0.16,0.16]
[null,"SINAPI_I",37556,"PLACA DE SINALIZACAO DE SEGURANCA CONTRA INCENDIO, FOTOLUMINESCENTE, QUADRADA, *20 X 20* CM, EM PVC *2* MM ANTI-CHAMAS (SIMBOLOS, CORES E PICTOGRAMAS CONFORME NBR 13434)","UN    ",1,24.29,24.29,24.29,24.29]
[null,"MATERIAL (C) - TOTAL",null,null,null,null,null,null,24.529999999999998,24.529999999999998]
[]
[236,"FONTE","CÓDIGO","DESCRIÇÃO","UNIDADE","COEFIC.","CUSTO UNITÁRIO",null,"CUSTO  TOTAL (A) + (B) + (C) + (D) + (E)"]
[null,null,null,null,null,null,"DESONERADO","NÃO DESONER.","DESONERADO","NÃO DESONER."]
[null,"COMPOSIÇÃO","COMP 236_SEE","PLACA DE SINALIZAÇÃO EM PVC COD 06 - (300X300) PERIGO INFLAMÁVEL","UN ",null,null,null,25.269999999999996,25.389999999999997]
[null,"AGETOP_I",5,"SERVENTE","h     ",0.09,8.1999999999999993,9.51,0.74,0.86]
[null,null,null,"","",null,0,0,0,0]
[null,null,null,"","",null,0,0,0,0]
[null,"MÃO DE OBRA (B) - TOTAL",null,null,null,null,null,null,0.74,0.86]
[null,"AGETOP_I",3070,"BUCHA DE NYLON S-6","un",2,0.04,0.04,0.08,0.08]
[null,"AGETOP_I",3393,"PARAFUSO P/BUCHA S-6","un",2,0.08,0.08,0.16,0.16]
[null,"SINAPI_I",37556,"PLACA DE SINALIZACAO DE SEGURANCA CONTRA INCENDIO, FOTOLUMINESCENTE, QUADRADA, *20 X 20* CM, EM PVC *2* MM ANTI-CHAMAS (SIMBOLOS, CORES E PICTOGRAMAS CONFORME NBR 13434)","UN    ",1,24.29,24.29,24.29,24.29]
[null,"MATERIAL (C) - TOTAL",null,null,null,null,null,null,24.529999999999998,24.529999999999998]
[]
[411,"FONTE","CÓDIGO","DESCRIÇÃO","UNIDADE","COEFIC.","CUSTO UNITÁRIO",null,"CUSTO  TOTAL (A) + (B) + (C) + (D) + (E)"]
[null,null,null,null,null,null,"DESONERADO","NÃO DESONER.","DESONERADO","NÃO DESONER."]
[null,"COMPOSIÇÃO","COMP 411_SEE","PLACA DE SINALIZAÇÃO EM PVC COD 13 - (316X158) SAÍDA DE EMERGÊNCIA","UN ",null,null,null,30.769999999999996,30.889999999999997]
[null,"AGETOP_I",5,"SERVENTE","h     ",0.09,8.1999999999999993,9.51,0.74,0.86]
[null,null,null,"","",null,0,0,0,0]
[null,null,null,"","",null,0,0,0,0]
[null,"MÃO DE OBRA (B) - TOTAL",null,null,null,null,null,null,0.74,0.86]
[null,"AGETOP_I",3070,"BUCHA DE NYLON S-6","un",2,0.04,0.04,0.08,0.08]
[null,"AGETOP_I",3393,"PARAFUSO P/BUCHA S-6","un",2,0.08,0.08,0.16,0.16]
[null,"SINAPI_I",37559,"PLACA DE SINALIZACAO DE SEGURANCA CONTRA INCENDIO, FOTOLUMINESCENTE, RETANGULAR, *12 X 40* CM, EM PVC *2* MM ANTI-CHAMAS (SIMBOLOS, CORES E PICTOGRAMAS CONFORME NBR 13434)","UN    ",1,29.79,29.79,29.79,29.79]
[null,"MATERIAL (C) - TOTAL",null,null,null,null,null,null,30.029999999999998,30.029999999999998]
[]
[412,"FONTE","CÓDIGO","DESCRIÇÃO","UNIDADE","COEFIC.","CUSTO UNITÁRIO",null,"CUSTO  TOTAL (A) + (B) + (C) + (D) + (E)"]
[null,null,null,null,null,null,"DESONERADO","NÃO DESONER.","DESONERADO","NÃO DESONER."]
[null,"COMPOSIÇÃO","COMP 412_SEE","PLACA DE SINALIZAÇÃO EM PVC COD 17 - (316X158) MENSAGEM \"SAÍDA\"","UN ",null,null,null,30.769999999999996,30.889999999999997]
[null,"AGETOP_I",5,"SERVENTE","h     ",0.09,8.1999999999999993,9.51,0.74,0.86]
[null,null,null,"","",null,0,0,0,0]
[null,null,null,"","",null,0,0,0,0]
[null,"MÃO DE OBRA (B) - TOTAL",null,null,null,null,null,null,0.74,0.86]
[null,"AGETOP_I",3070,"BUCHA DE NYLON S-6","un",2,0.04,0.04,0.08,0.08]
[null,"AGETOP_I",3393,"PARAFUSO P/BUCHA S-6","un",2,0.08,0.08,0.16,0.16]
[null,"SINAPI_I",37559,"PLACA DE SINALIZACAO DE SEGURANCA CONTRA INCENDIO, FOTOLUMINESCENTE, RETANGULAR, *12 X 40* CM, EM PVC *2* MM ANTI-CHAMAS (SIMBOLOS, CORES E PICTOGRAMAS CONFORME NBR 13434)","UN    ",1,29.79,29.79,29.79,29.79]
[null,"MATERIAL (C) - TOTAL",null,null,null,null,null,null,30.029999999999998,30.029999999999998]
[]
[382,"FONTE","CÓDIGO","DESCRIÇÃO","UNIDADE","COEFIC.","CUSTO UNITÁRIO",null,"CUSTO  TOTAL (A) + (B) + (C) + (D) + (E)"]
[null,null,null,null,null,null,"DESONERADO","NÃO DESONER.","DESONERADO","NÃO DESONER."]
[null,"COMPOSIÇÃO","COMP 382_SEE","TE DE REDUCAO DE FERRO GALVANIZADO, COM ROSCA BSP, DE 3/4\" X 1/2\"","UN ",null,null,null,21.96,24.05]
[null,"AGETOP_I",8,"AJUDANTE","h     ",0.6,8.1999999999999993,9.51,4.92,5.71]
[null,"AGETOP_I",11,"ENCANADOR","h     ",0.61050000000000004,13.4,15.53,8.18,9.48]
[null,null,null,"","",null,0,0,0,0]
[null,"MÃO DE OBRA (B) - TOTAL",null,null,null,null,null,null,13.1,15.190000000000001]
[null,"SINAPI_I",3146,"FITA VEDA ROSCA EM ROLOS DE 18 MM X 10 M (L X C)","UN    ",0.12075471698113208,4.17,4.17,0.5,0.5]
[null,"SINAPI_I",6302,"TE DE REDUCAO DE FERRO GALVANIZADO, COM ROSCA BSP, DE 3/4\" X 1/2\"","UN    ",1,8.36,8.36,8.36,8.36]
[null,null,null,"","",null,0,0,0,0]
[null,"MATERIAL (C) - TOTAL",null,null,null,null,null,null,8.86,8.86]
[]
[383,"FONTE","CÓDIGO","DESCRIÇÃO","UNIDADE","COEFIC.","CUSTO UNITÁRIO",null,"CUSTO  TOTAL (A) + (B) + (C) + (D) + (E)"]
[null,null,null,null,null,null,"DESONERADO","NÃO DESONER.","DESONERADO","NÃO DESONER."]
[null,"COMPOSIÇÃO","COMP 383_SEE","BUCHA DE REDUCAO DE FERRO GALVANIZADO, COM ROSCA BSP, DE 1/2\" X 1/4\"","UN ",null,null,null,6.87,7.42]
[null,"AGETOP_I",8,"AJUDANTE","h     ",0.16,8.1999999999999993,9.51,1.31,1.52]
[null,"AGETOP_I",11,"ENCANADOR","h     ",0.16,13.4,15.53,2.14,2.48]
[null,null,null,"","",null,0,0,0,0]
[null,"MÃO DE OBRA (B) - TOTAL",null,null,null,null,null,null,3.45,4]
[null,"AGETOP_I","H689","FITA VEDAROSCA 12 MM","m",1.2,0.28000000000000003,0.28000000000000003,0.34,0.34]
[null,"SINAPI_I",770,"BUCHA DE REDUCAO DE FERRO GALVANIZADO, COM ROSCA BSP, DE 1/2\" X 1/4\"","UN    ",1,3.08,3.08,3.08,3.08]
[null,null,null,"","",null,0,0,0,0]
[null,"MATERIAL (C) - TOTAL",null,null,null,null,null,null,3.42,3.42]
[]
[212,"FONTE","CÓDIGO","DESCRIÇÃO","UNIDADE","COEFIC.","CUSTO UNITÁRIO",null,"CUSTO  TOTAL (A) + (B) + (C) + (D) + (E)"]
[null,null,null,null,null,null,"DESONERADO","NÃO DESONER.","DESONERADO","NÃO DESONER."]
[null,"COMPOSIÇÃO","COMP 212_SEE","NIPLE DE REDUÇÃO 1/2\" X 1/4\" BSP","UN ",null,null,null,9.5,10.050000000000001]
[null,"AGETOP_I",8,"AJUDANTE","h     ",0.16,8.1999999999999993,9.51,1.31,1.52]
[null,"AGETOP_I",11,"ENCANADOR","h     ",0.16,13.4,15.53,2.14,2.48]
[null,null,null,"","",null,0,0,0,0]
[null,"MÃO DE OBRA (B) - TOTAL",null,null,null,null,null,null,3.45,4]
[null,"COTAÇÃO","COT 103_SEE","NIPLE DE REDUÇÃO 1/2\" X 1/4\" BSP","UN",1,6.0533333333333337,6.0533333333333337,6.05,6.05]
[null,null,null,"","",null,0,0,0,0]
[null,null,null,"","",null,0,0,0,0]
[null,"MATERIAL (C) - TOTAL",null,null,null,null,null,null,6.05,6.05]
[]
[213,"FONTE","CÓDIGO","DESCRIÇÃO","UNIDADE","COEFIC.","CUSTO UNITÁRIO",null,"CUSTO  TOTAL (A) + (B) + (C) + (D) + (E)"]
[null,null,null,null,null,null,"DESONERADO","NÃO DESONER.","DESONERADO","NÃO DESONER."]
[null,"COMPOSIÇÃO","COMP 213_SEE","NIPLE DE REDUÇÃO 3/4\" X 1/2\" BSP","UN ",null,null,null,13.16,13.71]
[null,"AGETOP_I",8,"AJUDANTE","h     ",0.16,8.1999999999999993,9.51,1.31,1.52]
[null,"AGETOP_I",11,"ENCANADOR","h     ",0.16,13.4,15.53,2.14,2.48]
[null,null,null,"","",null,0,0,0,0]
[null,"MÃO DE OBRA (B) - TOTAL",null,null,null,null,null,null,3.45,4]
[null,"COTAÇÃO","COT 104_SEE","NIPLE DE REDUÇÃO 3/4\" X 1/2\" BSP","UN",1,9.7099999999999991,9.7099999999999991,9.7100000000000009,9.7100000000000009]
[null,null,null,"","",null,0,0,0,0]
[null,null,null,"","",null,0,0,0,0]
[null,"MATERIAL (C) - TOTAL",null,null,null,null,null,null,9.7100000000000009,9.7100000000000009]
[]
[237,"FONTE","CÓDIGO","DESCRIÇÃO","UNIDADE","COEFIC.","CUSTO UNITÁRIO",null,"CUSTO  TOTAL (A) + (B) + (C) + (D) + (E)"]
[null,null,null,null,null,null,"DESONERADO","NÃO DESONER.","DESONERADO","NÃO DESONER."]
[null,"COMPOSIÇÃO","COMP 237_SEE","FITA ANTICORROSIVA","M",null,null,null,12.44,13.129999999999999]
[null,"AGETOP_I",8,"AJUDANTE","h     ",0.2,8.1999999999999993,9.51,1.64,1.9]
[null,"AGETOP_I",12,"ELETRICISTA","h     ",0.2,13.4,15.53,2.68,3.11]
[null,null,null,"","",null,0,0,0,0]
[null,"MÃO DE OBRA (B) - TOTAL",null,null,null,null,null,null,4.32,5.01]
[null,"SINAPI_I",39634,"FITA ADESIVA ANTICORROSIVA DE PVC FLEXIVEL, COR PRETA, PARA PROTECAO TUBULACAO, 50 MM X 30 M (L X C), E= *0,25* MM","M     ",1,8.1199999999999992,8.1199999999999992,8.1199999999999992,8.1199999999999992]
[null,null,null,"","",null,0,0,0,0]
[null,null,null,"","",null,0,0,0,0]
[null,"MATERIAL (C) - TOTAL",null,null,null,null,null,null,8.1199999999999992,8.1199999999999992]
[]
[542,"FONTE","CÓDIGO","DESCRIÇÃO","UNIDADE","COEFIC.","CUSTO UNITÁRIO",null,"CUSTO  TOTAL (A) + (B) + (C) + (D) + (E)"]
[null,null,null,null,null,null,"DESONERADO","NÃO DESONER.","DESONERADO","NÃO DESONER."]
[null,"COMPOSIÇÃO","COMP 542_SEE","VÁLVULA UGV 3/4\" (S) LATÃO","UN ",null,null,null,25.17,26.66]
[null,"AGETOP_I",8,"AJUDANTE","h     ",0.432,8.1999999999999993,9.51,3.54,4.1100000000000003]
[null,"AGETOP_I",11,"ENCANADOR","h     ",0.432,13.4,15.53,5.79,6.71]
[null,null,null,"","",null,0,0,0,0]
[null,"MÃO DE OBRA (B) - TOTAL",null,null,null,null,null,null,9.33,10.82]
[null,"COTAÇÃO","COT 281_SEE","VÁLVULA UGV 3/4\" (S) LATÃO","UN ",1,15.836666666666666,15.836666666666666,15.84,15.84]
[null,null,null,"","",null,0,0,0,0]
[null,null,null,"","",null,0,0,0,0]
[null,"MATERIAL (C) - TOTAL",null,null,null,null,null,null,15.84,15.84]
[]
[543,"FONTE","CÓDIGO","DESCRIÇÃO","UNIDADE","COEFIC.","CUSTO UNITÁRIO",null,"CUSTO  TOTAL (A) + (B) + (C) + (D) + (E)"]
[null,null,null,null,null,null,"DESONERADO","NÃO DESONER.","DESONERADO","NÃO DESONER."]
[null,"COMPOSIÇÃO","COMP 543_SEE","VÁLVULA UGV 1/2\" (S) LATÃO","UN ",null,null,null,24.5,25.990000000000002]
[null,"AGETOP_I",8,"AJUDANTE","h     ",0.432,8.1999999999999993,9.51,3.54,4.1100000000000003]
[null,"AGETOP_I",11,"ENCANADOR","h     ",0.432,13.4,15.53,5.79,6.71]
[null,null,null,"","",null,0,0,0,0]
[null,"MÃO DE OBRA (B) - TOTAL",null,null,null,null,null,null,9.33,10.82]
[null,"COTAÇÃO","COT 282_SEE","VÁLVULA UGV 1/2\" (S) LATÃO","UN ",1,15.166666666666666,15.166666666666666,15.17,15.17]
[null,null,null,"","",null,0,0,0,0]
[null,null,null,"","",null,0,0,0,0]
[null,"MATERIAL (C) - TOTAL",null,null,null,null,null,null,15.17,15.17]
[]
[211,"FONTE","CÓDIGO","DESCRIÇÃO","UNIDADE","COEFIC.","CUSTO UNITÁRIO",null,"CUSTO  TOTAL (A) + (B) + (C) + (D) + (E)"]
[null,null,null,null,null,null,"DESONERADO","NÃO DESONER.","DESONERADO","NÃO DESONER."]
[null,"COMPOSIÇÃO","COMP 211_SEE","REGULADOR DE 2º ESTÁGIO 5KG/H","UN ",null,null,null,85.46,89.419999999999987]
[null,"AGETOP_I",8,"AJUDANTE","h     ",1.1499999999999999,8.1999999999999993,9.51,9.43,10.94]
[null,"AGETOP_I",11,"ENCANADOR","h     ",1.1499999999999999,13.4,15.53,15.41,17.86]
[null,null,null,"","",null,0,0,0,0]
[null,"MÃO DE OBRA (B) - TOTAL",null,null,null,null,null,null,24.84,28.799999999999997]
[null,"COTAÇÃO","COT 102_SEE","REGULADOR DE 2º ESTÁGIO 5KG/H","UN",1,59.833333333333336,59.833333333333336,59.83,59.83]
[null,"AGETOP_I","H689","FITA VEDAROSCA 12 MM","m",2.82,0.28000000000000003,0.28000000000000003,0.79,0.79]
[null,null,null,"","",null,0,0,0,0]
[null,"MATERIAL (C) - TOTAL",null,null,null,null,null,null,60.62,60.62]
[]
[210,"FONTE","CÓDIGO","DESCRIÇÃO","UNIDADE","COEFIC.","CUSTO UNITÁRIO",null,"CUSTO  TOTAL (A) + (B) + (C) + (D) + (E)"]
[null,null,null,null,null,null,"DESONERADO","NÃO DESONER.","DESONERADO","NÃO DESONER."]
[null,"COMPOSIÇÃO","COMP 210_SEE","REGULADOR DE 1º ESTÁGIO 60KG/H MODELO AP-40  COM MANÔMETRO","UN ",null,null,null,231.21,235.17000000000002]
[null,"AGETOP_I",8,"AJUDANTE","h     ",1.1499999999999999,8.1999999999999993,9.51,9.43,10.94]
[null,"AGETOP_I",11,"ENCANADOR","h     ",1.1499999999999999,13.4,15.53,15.41,17.86]
[null,null,null,"","",null,0,0,0,0]
[null,"MÃO DE OBRA (B) - TOTAL",null,null,null,null,null,null,24.84,28.799999999999997]
[null,"COTAÇÃO","COT 101_SEE","REGULADOR DE 1º ESTÁGIO 60KG/H MODELO AP-40  COM MANÔMETRO","UN",1,205.57666666666668,205.57666666666668,205.58,205.58]
[null,"AGETOP_I","H689","FITA VEDAROSCA 12 MM","m",2.82,0.28000000000000003,0.28000000000000003,0.79,0.79]
[null,null,null,"","",null,0,0,0,0]
[null,"MATERIAL (C) - TOTAL",null,null,null,null,null,null,206.37,206.37]
[]
[235,"FONTE","CÓDIGO","DESCRIÇÃO","UNIDADE","COEFIC.","CUSTO UNITÁRIO",null,"CUSTO  TOTAL (A) + (B) + (C) + (D) + (E)"]
[null,null,null,null,null,null,"DESONERADO","NÃO DESONER.","DESONERADO","NÃO DESONER."]
[null,"COMPOSIÇÃO","COMP 235_SEE","PLACA DE SINALIZAÇÃO EM PVC COD 01 - (300X300) PROIBIDO FUMAR","UN ",null,null,null,25.269999999999996,25.389999999999997]
[null,"AGETOP_I",5,"SERVENTE","h     ",0.09,8.1999999999999993,9.51,0.74,0.86]
[null,null,null,"","",null,0,0,0,0]
[null,null,null,"","",null,0,0,0,0]
[null,"MÃO DE OBRA (B) - TOTAL",null,null,null,null,null,null,0.74,0.86]
[null,"AGETOP_I",3070,"BUCHA DE NYLON S-6","un",2,0.04,0.04,0.08,0.08]
[null,"AGETOP_I",3393,"PARAFUSO P/BUCHA S-6","un",2,0.08,0.08,0.16,0.16]
[null,"SINAPI_I",37556,"PLACA DE SINALIZACAO DE SEGURANCA CONTRA INCENDIO, FOTOLUMINESCENTE, QUADRADA, *20 X 20* CM, EM PVC *2* MM ANTI-CHAMAS (SIMBOLOS, CORES E PICTOGRAMAS CONFORME NBR 13434)","UN    ",1,24.29,24.29,24.29,24.29]
[null,"MATERIAL (C) - TOTAL",null,null,null,null,null,null,24.529999999999998,24.529999999999998]
[]
[236,"FONTE","CÓDIGO","DESCRIÇÃO","UNIDADE","COEFIC.","CUSTO UNITÁRIO",null,"CUSTO  TOTAL (A) + (B) + (C) + (D) + (E)"]
[null,null,null,null,null,null,"DESONERADO","NÃO DESONER.","DESONERADO","NÃO DESONER."]
[null,"COMPOSIÇÃO","COMP 236_SEE","PLACA DE SINALIZAÇÃO EM PVC COD 06 - (300X300) PERIGO INFLAMÁVEL","UN ",null,null,null,25.269999999999996,25.389999999999997]
[null,"AGETOP_I",5,"SERVENTE","h     ",0.09,8.1999999999999993,9.51,0.74,0.86]
[null,null,null,"","",null,0,0,0,0]
[null,null,null,"","",null,0,0,0,0]
[null,"MÃO DE OBRA (B) - TOTAL",null,null,null,null,null,null,0.74,0.86]
[null,"AGETOP_I",3070,"BUCHA DE NYLON S-6","un",2,0.04,0.04,0.08,0.08]
[null,"AGETOP_I",3393,"PARAFUSO P/BUCHA S-6","un",2,0.08,0.08,0.16,0.16]
[null,"SINAPI_I",37556,"PLACA DE SINALIZACAO DE SEGURANCA CONTRA INCENDIO, FOTOLUMINESCENTE, QUADRADA, *20 X 20* CM, EM PVC *2* MM ANTI-CHAMAS (SIMBOLOS, CORES E PICTOGRAMAS CONFORME NBR 13434)","UN    ",1,24.29,24.29,24.29,24.29]
[null,"MATERIAL (C) - TOTAL",null,null,null,null,null,null,24.529999999999998,24.529999999999998]