{"text_format":"1","workbook":"xlsx","n_sheets":7,"sheets":["Orçamento","Resumo ","Somatório","Cronog_90_Dias","Composição BDI","Relatório CENTRAL","Parc Maior Relev"],"not_rendered":{"charts":0,"images":4,"macros":1,"external_links":2,"defined_names":149,"comments":2,"pivot_tables":0},"unopened":[],"bounds":{"document_bytes":16777216,"sheet_cells":100000,"rows_first":2000,"rows_last":500,"rows_between":2000,"halvings":0,"cell_chars":16384,"cell_head_chars":4096},"cells_cut":0,"cells_raw":0,"read":"whole","date_system":"1900"}

{"sheet":"Orçamento","index":0,"n_rows":463,"n_cols":24,"rows_kept":463,"cut":false,"hidden":false,"merged":[[3,12,10,12],[398,16,398,22],[433,18,433,20],[433,21,433,22],[0,14,0,22],[8,14,8,16],[9,14,9,16],[11,14,11,16],[12,14,12,16],[14,14,14,22],[1,14,1,22],[4,14,4,22],[7,14,7,22],[417,18,417,20],[417,21,417,22],[425,21,425,22],[414,15,414,17],[415,15,415,17],[416,15,416,17],[418,21,418,22],[426,18,426,20],[426,21,426,22],[424,18,424,20],[424,21,424,22],[432,18,432,20],[432,21,432,22],[419,18,419,20],[419,21,419,22],[412,18,412,20],[412,21,412,22],[434,18,434,20],[434,21,434,22],[388,20,388,21],[410,18,410,20],[410,21,410,22],[411,18,411,20],[411,21,411,22],[409,18,409,20],[409,21,409,22],[418,18,418,20],[389,20,389,21],[400,18,400,22],[406,18,406,20],[406,21,406,22],[407,18,407,20],[407,21,407,22],[408,18,408,20],[408,21,408,22],[431,18,431,20],[431,21,431,22],[428,21,428,22],[429,18,429,20],[429,21,429,22],[430,18,430,20],[430,21,430,22],[420,18,420,20],[420,21,420,22],[427,18,427,20],[427,21,427,22],[422,21,422,22],[423,18,423,20],[423,21,423,22],[425,18,425,20],[421,18,421,20],[421,21,421,22],[422,18,422,20],[426,15,426,17],[427,15,427,17],[428,15,428,17],[429,15,429,17],[430,15,430,17],[403,14,403,23],[392,20,392,21],[391,20,391,21],[387,17,392,17],[387,20,387,21],[404,18,404,20],[404,21,404,22],[405,18,405,20],[405,21,405,22],[393,20,393,21],[413,18,413,20],[413,21,413,22],[414,18,414,20],[414,21,414,22],[415,18,415,20],[415,21,415,22],[416,18,416,20],[416,21,416,22],[428,18,428,20],[405,15,405,17],[406,15,406,17],[407,15,407,17],[408,15,408,17],[409,15,409,17],[410,15,410,17],[411,15,411,17],[412,15,412,17],[413,15,413,17],[417,15,417,17],[418,15,418,17],[419,15,419,17],[420,15,420,17],[421,15,421,17],[422,15,422,17],[423,15,423,17],[424,15,424,17],[425,15,425,17],[395,16,395,22],[396,16,396,22],[397,16,397,22],[3,21,3,22],[2,21,2,22],[5,21,5,22],[10,14,10,23],[13,14,13,23],[6,21,6,22],[2,14,2,20],[3,14,3,20],[5,18,5,20],[6,18,6,20],[6,14,6,17],[5,14,5,17],[12,21,12,22],[12,18,12,20],[8,18,8,20],[8,21,8,22],[9,19,9,20],[437,14,437,23],[438,18,438,20],[438,21,438,22],[439,15,439,17],[439,18,439,20],[439,21,439,22],[440,15,440,17],[440,18,440,20],[440,21,440,22],[444,15,444,17],[442,18,442,20],[442,21,442,22],[462,18,462,20],[462,21,462,22],[459,14,459,17],[456,15,456,17],[456,18,456,20],[456,21,456,22],[457,15,457,17],[457,18,457,20],[457,21,457,22],[458,15,458,17],[458,18,458,20],[458,21,458,22],[461,18,461,20],[461,21,461,22],[460,18,460,20],[460,21,460,22],[441,18,441,20],[441,21,441,22],[442,15,442,17],[431,14,431,17],[438,15,438,17],[404,15,404,17],[459,18,459,20],[459,21,459,22],[447,15,447,17],[447,18,447,20],[447,21,447,22],[448,15,448,17],[448,18,448,20],[448,21,448,22],[449,15,449,17],[449,18,449,20],[449,21,449,22],[453,15,453,17],[453,18,453,20],[453,21,453,22],[454,15,454,17],[454,18,454,20],[454,21,454,22],[455,15,455,17],[443,15,443,17],[443,18,443,20],[443,21,443,22],[399,16,399,22],[455,18,455,20],[455,21,455,22],[450,15,450,17],[450,18,450,20],[450,21,450,22],[451,15,451,17],[451,18,451,20],[451,21,451,22],[452,15,452,17],[452,18,452,20],[452,21,452,22],[444,18,444,20],[444,21,444,22],[445,15,445,17],[445,18,445,20],[445,21,445,22],[446,15,446,17],[446,18,446,20],[446,21,446,22],[441,15,441,17]]}
[]
[]
[null,null,null,null,null,null,null,null,null,null,null,null,null,null,"UNIDADE ESCOLAR",null,null,null,null,null,null,"CÓDIGO INEP"]
[null,null,null,null,null,null,null,null,null,null,null,null,null,null,"COLÉGIO ESTADUAL DESOR HAMILTON BARROS VELASCO",null,null,null,null,null,null,52057259]
[]
["Nmax",null,null,null,null,null,null,null,null,null,null,null,null,null,"OBRA",null,null,null,"DATA",null,null,"CIDADE"]
[{"$f":"MAX($C$18:$C$387)","v":3},null,null,null,null,null,null,null,null,null,null,null,null,null,"AMPLIAÇÃO E REFORMA",null,null,null,"2020-05-12",null,null,"PALMINÓPOLIS"]
[]
[null,null,null,null,null,null,null,null,null,null,null,null,null,null,"CRE",null,null,"ENDEREÇO","REFERÊNCIA AGETOP",null,null,"REFERÊNCIA SINAPI"]
[null,null,null,null,null,null,null,null,null,null,null,null,null,null,"PALMEIRAS",null,null,"RUA DEP ANTONIO Q BARRETO, CENTRO, CEP:75990-000","ABR/19","DESONERADA",null,"NOV/19","DESONERADA"]
[]
[null,null,null,null,null,null,null,null,null,null,null,null,null,null,"ÁREA EXISTENTE (M²)",null,null,"ÁREA A CONSTRUIR (M²)","ÁREA A DEMOLIR (M²)",null,null,"ÁREA TOTAL CONSTRUÍDA (M²)"]
[null,null,null,null,null,null,null,null,null,null,null,null,null,null,2343.66,null,null,48.43,0,null,null,2392.0899999999997]
[]
[null,null,null,null,null,null,null,null,null,null,null,"FILTRO",null,null,"PLANILHA ORÇAMENTÁRIA"]
["Nível E","Save Nivel","Nível C","Altura","n1","n2","n3","n4","n5","Czero","Cnível","↓","Nível","Nível Corrigido","ITEM","TABELA","CODIGO","DESCRIÇÃO DOS SERVIÇOS","UNID","QUANT","MAT","MO","T.SERVIÇO","OBSERVAÇÕES¹"]
[{"$f":"CHOOSE(1+LOG(1+2*(ORÇAMENTO.Nivel=\"Nível 1\")+4*(ORÇAMENTO.Nivel=\"Nível 2\")+8*(ORÇAMENTO.Nivel=\"Nível 3\")+16*(ORÇAMENTO.Nivel=\"Nível 4\")+32*(ORÇAMENTO.Nivel=\"Serviço\"),2),0,1,2,3,4,\"S\")","v":"S"},{"$f":"IF(OR(C17=\"s\",C17=0),OFFSET(B17,-1,0),C17)","v":"Save Nivel"},{"$f":"IF(OFFSET(C17,-1,0)=\"L\",1,IF(OFFSET(C17,-1,0)=1,2,IF(OR(A17=\"s\",A17=0),\"S\",IF(AND(OFFSET(C17,-1,0)=2,A17=4),3,IF(AND(OR(OFFSET(C17,-1,0)=\"s\",OFFSET(C17,-1,0)=0),A17<>\"s\",A17>OFFSET(B17,-1,0)),OFFSET(B17,-1,0),A17)))))","v":"S"},{"$f":"IF(OR(C17=\"S\",C17=0),0,IF(ISERROR(K17),J17,SMALL(J17:K17,1)))","v":0},{"$f":"IF($C17=1,OFFSET(E17,-1,0)+1,OFFSET(E17,-1,0))","v":"n1"},{"$f":"IF($C17=1,0,IF($C17=2,OFFSET(F17,-1,0)+1,OFFSET(F17,-1,0)))","v":"n2"},{"$f":"IF(AND($C17<=2,$C17<>0),0,IF($C17=3,OFFSET(G17,-1,0)+1,OFFSET(G17,-1,0)))","v":"n3"},{"$f":"IF(AND($C17<=3,$C17<>0),0,IF($C17=4,OFFSET(H17,-1,0)+1,OFFSET(H17,-1,0)))","v":"n4"},{"$f":"IF(AND($C17<=4,$C17<>0),0,IF(AND($C17=\"S\",$W17>0),OFFSET(I17,-1,0)+1,OFFSET(I17,-1,0)))","v":"n5"},{"$f":"IF(OR($C17=\"S\",$C17=0),0,MATCH(0,OFFSET($D17,1,$C17,ROW($C$387)-ROW($C17)),0))","v":0},{"$f":"IF(OR($C17=\"S\",$C17=0),0,MATCH(OFFSET($D17,0,$C17)+1,OFFSET($D17,1,$C17,ROW($C$387)-ROW($C17)),0))","v":0},"","Serviço","Serviço","-","SINAPI",null,"(sem código)","-",null,0,0,0,""]
[0,null,"L",{"$f":"COUNTA(OFFSET(D18,1,0):D$387)","v":368},{"$f":"LEFT(O19,1)-1","v":0},null,null,null,null,null,null,"F","LOTE","LOTE","AMPLIAÇÃO E REFORMA - COLÉGIO ESTADUAL DESOR HAMILTON BARROS VELASCO",null,null,null,null,null,null,null,314293.92000000004]
[{"$f":"CHOOSE(1+LOG(1+2*(ORÇAMENTO.Nivel=\"Nível 1\")+4*(ORÇAMENTO.Nivel=\"Nível 2\")+8*(ORÇAMENTO.Nivel=\"Nível 3\")+16*(ORÇAMENTO.Nivel=\"Nível 4\")+32*(ORÇAMENTO.Nivel=\"Serviço\"),2),0,1,2,3,4,\"S\")","v":1},{"$f":"IF(OR(C19=\"s\",C19=0),OFFSET(B19,-1,0),C19)","v":1},{"$f":"IF(OFFSET(C19,-1,0)=\"L\",1,IF(OFFSET(C19,-1,0)=1,2,IF(OR(A19=\"s\",A19=0),\"S\",IF(AND(OFFSET(C19,-1,0)=2,A19=4),3,IF(AND(OR(OFFSET(C19,-1,0)=\"s\",OFFSET(C19,-1,0)=0),A19<>\"s\",A19>OFFSET(B19,-1,0)),OFFSET(B19,-1,0),A19)))))","v":1},{"$f":"IF(OR(C19=\"S\",C19=0),0,IF(ISERROR(K19),J19,SMALL(J19:K19,1)))","v":198},{"$f":"IF($C19=1,OFFSET(E19,-1,0)+1,OFFSET(E19,-1,0))","v":1},{"$f":"IF($C19=1,0,IF($C19=2,OFFSET(F19,-1,0)+1,OFFSET(F19,-1,0)))","v":0},{"$f":"IF(AND($C19<=2,$C19<>0),0,IF($C19=3,OFFSET(G19,-1,0)+1,OFFSET(G19,-1,0)))","v":0},{"$f":"IF(AND($C19<=3,$C19<>0),0,IF($C19=4,OFFSET(H19,-1,0)+1,OFFSET(H19,-1,0)))","v":0},{"$f":"IF(AND($C19<=4,$C19<>0),0,IF(AND($C19=\"S\",$W19>0),OFFSET(I19,-1,0)+1,OFFSET(I19,-1,0)))","v":0},{"$f":"IF(OR($C19=\"S\",$C19=0),0,MATCH(0,OFFSET($D19,1,$C19,ROW($C$387)-ROW($C19)),0))","v":368},{"$f":"IF(OR($C19=\"S\",$C19=0),0,MATCH(OFFSET($D19,0,$C19)+1,OFFSET($D19,1,$C19,ROW($C$387)-ROW($C19)),0))","v":198},"F","Nível 1","Nível 1","1.","AGETOP",null,"REFORMA"]
[2,{"$f":"IF(OR(C20=\"s\",C20=0),OFFSET(B20,-1,0),C20)","v":2},{"$f":"IF(OFFSET(C20,-1,0)=\"L\",1,IF(OFFSET(C20,-1,0)=1,2,IF(OR(A20=\"s\",A20=0),\"S\",IF(AND(OFFSET(C20,-1,0)=2,A20=4),3,IF(AND(OR(OFFSET(C20,-1,0)=\"s\",OFFSET(C20,-1,0)=0),A20<>\"s\",A20>OFFSET(B20,-1,0)),OFFSET(B20,-1,0),A20)))))","v":2},{"$f":"IF(OR(C20=\"S\",C20=0),0,IF(ISERROR(K20),J20,SMALL(J20:K20,1)))","v":16},{"$f":"IF($C20=1,OFFSET(E20,-1,0)+1,OFFSET(E20,-1,0))","v":1},{"$f":"IF($C20=1,0,IF($C20=2,OFFSET(F20,-1,0)+1,OFFSET(F20,-1,0)))","v":1},{"$f":"IF(AND($C20<=2,$C20<>0),0,IF($C20=3,OFFSET(G20,-1,0)+1,OFFSET(G20,-1,0)))","v":0},{"$f":"IF(AND($C20<=3,$C20<>0),0,IF($C20=4,OFFSET(H20,-1,0)+1,OFFSET(H20,-1,0)))","v":0},{"$f":"IF(AND($C20<=4,$C20<>0),0,IF(AND($C20=\"S\",$W20>0),OFFSET(I20,-1,0)+1,OFFSET(I20,-1,0)))","v":0},197,16,"F","Nível 2","Nível 2","1.1.","AGETOP",null,"SERVIÇOS PRELIMINARES"]
[3,{"$f":"IF(OR(C21=\"s\",C21=0),OFFSET(B21,-1,0),C21)","v":3},{"$f":"IF(OFFSET(C21,-1,0)=\"L\",1,IF(OFFSET(C21,-1,0)=1,2,IF(OR(A21=\"s\",A21=0),\"S\",IF(AND(OFFSET(C21,-1,0)=2,A21=4),3,IF(AND(OR(OFFSET(C21,-1,0)=\"s\",OFFSET(C21,-1,0)=0),A21<>\"s\",A21>OFFSET(B21,-1,0)),OFFSET(B21,-1,0),A21)))))","v":3},{"$f":"IF(OR(C21=\"S\",C21=0),0,IF(ISERROR(K21),J21,SMALL(J21:K21,1)))","v":2},{"$f":"IF($C21=1,OFFSET(E21,-1,0)+1,OFFSET(E21,-1,0))","v":1},{"$f":"IF($C21=1,0,IF($C21=2,OFFSET(F21,-1,0)+1,OFFSET(F21,-1,0)))","v":1},{"$f":"IF(AND($C21<=2,$C21<>0),0,IF($C21=3,OFFSET(G21,-1,0)+1,OFFSET(G21,-1,0)))","v":1},{"$f":"IF(AND($C21<=3,$C21<>0),0,IF($C21=4,OFFSET(H21,-1,0)+1,OFFSET(H21,-1,0)))","v":0},{"$f":"IF(AND($C21<=4,$C21<>0),0,IF(AND($C21=\"S\",$W21>0),OFFSET(I21,-1,0)+1,OFFSET(I21,-1,0)))","v":0},15,2,"F","Nível 3","Nível 3","1.1.1.","SINAPI",null,"BARRACÃO DE EVENTOS","-",null,null,null,null,""]
["S",3,"S",0,1,1,1,0,0,0,0,"F","Serviço","Serviço","1.1.1.1.","AGETOP",20109,"DEM.PISO CIMENT.SOBRE LASTRO CONC.C/TR.ATE CB. E CARGA","m2    ",322.54000000000002,null,null,null,""]
[3,3,3,2,1,1,2,0,0,13,2,"F","Nível 3","Nível 3","1.1.2.","SINAPI",null,"BLOCO 03","-",null,null,null,null,""]
["S",3,"S",0,1,1,2,0,0,0,0,"F","Serviço","Serviço","1.1.2.1.","SINAPI",97645,"REMOÇÃO DE JANELAS, DE FORMA MANUAL, SEM REAPROVEITAMENTO. AF_12/2017","M2",45.9,null,null,null,"Referência: AGETOP - 20106"]
[3,3,3,2,1,1,3,0,0,11,2,"F","Nível 3","Nível 3","1.1.3.","SINAPI",null,"FOSSA","-",null,null,null,null,""]
["S",3,"S",0,1,1,3,0,0,0,0,"F","Serviço","Serviço","1.1.3.1.","SINAPI",97622,"DEMOLIÇÃO DE ALVENARIA DE BLOCO FURADO, DE FORMA MANUAL, SEM REAPROVEITAMENTO. AF_12/2017","M3",30,null,null,null,"Referência: AGETOP - 20118"]
[3,3,3,2,1,1,4,0,0,9,2,"F","Nível 3","Nível 3","1.1.4.","SINAPI",null,"PISO TÁTIL","-",null,null,null,null,""]
["S",3,"S",0,1,1,4,0,0,0,0,"F","Serviço","Serviço","1.1.4.1.","AGETOP",20109,"DEM.PISO CIMENT.SOBRE LASTRO CONC.C/TR.ATE CB. E CARGA","m2    ",30.1,null,null,null,""]
[3,3,3,3,1,1,5,0,0,7,3,"F","Nível 3","Nível 3","1.1.5.","SINAPI",null,"COBERTURA","-",null,null,null,null,""]
["S",3,"S",0,1,1,5,0,0,0,0,"F","Serviço","Serviço","1.1.5.1.","AGETOP",20101,"DEMOLICAO COBERTURA TELHA CERAMICA C/ TRANSP. ATÉ CB. E CARGA","m2    ",305.83,null,null,null,""]
["S",3,"S",0,1,1,5,0,0,0,0,"F","Serviço","Serviço","1.1.5.2.","AGETOP",20136,"DEMOLICAO DE CAIBROS E RIPAS C/ TRANSP. ATÉ CB. E CARGA","m2    ",305.83,null,null,null,""]
[3,3,3,2,1,1,6,0,0,4,2,"F","Nível 3","Nível 3","1.1.6.","SINAPI",null,"PASSEIO","-",null,null,null,null,""]
["S",3,"S",0,1,1,6,0,0,0,0,"F","Serviço","Serviço","1.1.6.1.","COMPOSIÇÃO","COMP 408_SEE","DEMOLIÇÃO PISO ARENITO SERRADO (PEDRA DE PIRENÓPOLIS ASSENTADA EM BARRO E REJUNTE COM\nARGAMASSA)","M2",699.77,null,null,null,""]
[3,3,3,2,1,1,7,0,0,2,{"$error":"#N/A"},"F","Nível 3","Nível 3","1.1.7.","SINAPI",null,"OUTROS","-",null,null,null,null,""]
[{"$f":"CHOOSE(1+LOG(1+2*(ORÇAMENTO.Nivel=\"Nível 1\")+4*(ORÇAMENTO.Nivel=\"Nível 2\")+8*(ORÇAMENTO.Nivel=\"Nível 3\")+16*(ORÇAMENTO.Nivel=\"Nível 4\")+32*(ORÇAMENTO.Nivel=\"Serviço\"),2),0,1,2,3,4,\"S\")","v":"S"},{"$f":"IF(OR(C35=\"s\",C35=0),OFFSET(B35,-1,0),C35)","v":3},{"$f":"IF(OFFSET(C35,-1,0)=\"L\",1,IF(OFFSET(C35,-1,0)=1,2,IF(OR(A35=\"s\",A35=0),\"S\",IF(AND(OFFSET(C35,-1,0)=2,A35=4),3,IF(AND(OR(OFFSET(C35,-1,0)=\"s\",OFFSET(C35,-1,0)=0),A35<>\"s\",A35>OFFSET(B35,-1,0)),OFFSET(B35,-1,0),A35)))))","v":"S"},{"$f":"IF(OR(C35=\"S\",C35=0),0,IF(ISERROR(K35),J35,SMALL(J35:K35,1)))","v":0},{"$f":"IF($C35=1,OFFSET(E35,-1,0)+1,OFFSET(E35,-1,0))","v":1},{"$f":"IF($C35=1,0,IF($C35=2,OFFSET(F35,-1,0)+1,OFFSET(F35,-1,0)))","v":1},{"$f":"IF(AND($C35<=2,$C35<>0),0,IF($C35=3,OFFSET(G35,-1,0)+1,OFFSET(G35,-1,0)))","v":7},{"$f":"IF(AND($C35<=3,$C35<>0),0,IF($C35=4,OFFSET(H35,-1,0)+1,OFFSET(H35,-1,0)))","v":0},{"$f":"IF(AND($C35<=4,$C35<>0),0,IF(AND($C35=\"S\",$W35>0),OFFSET(I35,-1,0)+1,OFFSET(I35,-1,0)))","v":0},0,0,"F","Serviço","Serviço","1.1.7.1.","SINAPI","74209/1","PLACA DE OBRA EM CHAPA DE ACO GALVANIZADO","M2",7.5,null,null,null,"Referência: AGETOP - 21301"]
[2,{"$f":"IF(OR(C36=\"s\",C36=0),OFFSET(B36,-1,0),C36)","v":2},{"$f":"IF(OFFSET(C36,-1,0)=\"L\",1,IF(OFFSET(C36,-1,0)=1,2,IF(OR(A36=\"s\",A36=0),\"S\",IF(AND(OFFSET(C36,-1,0)=2,A36=4),3,IF(AND(OR(OFFSET(C36,-1,0)=\"s\",OFFSET(C36,-1,0)=0),A36<>\"s\",A36>OFFSET(B36,-1,0)),OFFSET(B36,-1,0),A36)))))","v":2},{"$f":"IF(OR(C36=\"S\",C36=0),0,IF(ISERROR(K36),J36,SMALL(J36:K36,1)))","v":3},{"$f":"IF($C36=1,OFFSET(E36,-1,0)+1,OFFSET(E36,-1,0))","v":1},{"$f":"IF($C36=1,0,IF($C36=2,OFFSET(F36,-1,0)+1,OFFSET(F36,-1,0)))","v":2},{"$f":"IF(AND($C36<=2,$C36<>0),0,IF($C36=3,OFFSET(G36,-1,0)+1,OFFSET(G36,-1,0)))","v":0},{"$f":"IF(AND($C36<=3,$C36<>0),0,IF($C36=4,OFFSET(H36,-1,0)+1,OFFSET(H36,-1,0)))","v":0},{"$f":"IF(AND($C36<=4,$C36<>0),0,IF(AND($C36=\"S\",$W36>0),OFFSET(I36,-1,0)+1,OFFSET(I36,-1,0)))","v":0},181,3,"F","Nível 2","Nível 2","1.2.","AGETOP",null,"TRANSPORTES","-",null,null,null,null,""]
["S",2,"S",0,1,2,0,0,0,0,0,"F","Serviço","Serviço","1.2.0.1.","SINAPI",72900,"TRANSPORTE DE ENTULHO COM CAMINHAO BASCULANTE 6 M3, RODOVIA PAVIMENTADA, DMT 0,5 A 1,0 KM","M3",48.091000000000001,null,null,null,""]
["S",2,"S",0,1,2,0,0,0,0,0,"F","Serviço","Serviço","1.2.0.2.","SINAPI",72897,"CARGA MANUAL DE ENTULHO EM CAMINHAO BASCULANTE 6 M3","M3",48.091000000000001,null,null,null,""]
[2,2,2,12,1,3,0,0,0,178,12,"F","Nível 2","Nível 2","1.3.","AGETOP",null,"SERVIÇO EM TERRA","-",null,null,null,null,""]
[3,3,3,8,1,3,1,0,0,11,8,"F","Nível 3","Nível 3","1.3.1.","SINAPI",null,"BLOCO PADRÃO SANITÁRIO","-",null,null,null,null,""]
["S",3,"S",0,1,3,1,0,0,0,0,"F","Serviço","Serviço","1.3.1.1.","SINAPI",79480,"ESCAVACAO MECANICA CAMPO ABERTO EM SOLO EXCETO ROCHA ATE 2,00M PROFUNDIDADE","M3",11.887499999999999,null,null,null,"Referência: AGETOP - 41004"]
["S",3,"S",0,1,3,1,0,0,0,0,"F","Serviço","Serviço","1.3.1.2.","SINAPI",72898,"CARGA E DESCARGA MECANIZADAS DE ENTULHO EM CAMINHAO BASCULANTE 6 M3","M3",11.887499999999999,null,null,null,"Referência: AGETOP - 41005"]
["S",3,"S",0,1,3,1,0,0,0,0,"F","Serviço","Serviço","1.3.1.3.","AGETOP",41012,"INDENIZAÇÃO DE JAZIDA","m3    ",11.887499999999999,null,null,null,""]
["S",3,"S",0,1,3,1,0,0,0,0,"F","Serviço","Serviço","1.3.1.4.","AGETOP",41006,"TRANSPORTE DE MATERIAL ESCAVADO M3.KM","m3km  ",118.875,null,null,null,""]
["S",3,"S",0,1,3,1,0,0,0,0,"F","Serviço","Serviço","1.3.1.5.","SINAPI","74005/1","COMPACTACAO MECANICA, SEM CONTROLE DO GC (C/COMPACTADOR PLACA 400 KG)","M3",9.51,null,null,null,"Referência: AGETOP - 41009"]
["S",3,"S",0,1,3,1,0,0,0,0,"F","Serviço","Serviço","1.3.1.6.","AGETOP",41140,"REGULARIZAÇÃO DO TERRENO SEM APILOAMENTO COM TRANSPORTE MANUAL DA TERRA ESCAVADA ","m2    ",63.42,null,null,null,""]
["S",3,"S",0,1,3,1,0,0,0,0,"F","Serviço","Serviço","1.3.1.7.","AGETOP",41002,"APILOAMENTO","m2    ",63.42,null,null,null,""]
[3,3,3,3,1,3,2,0,0,3,151,"F","Nível 3","Nível 3","1.3.2.","SINAPI",null,"PASSEIO","-",null,null,null,null,""]
["S",3,"S",0,1,3,2,0,0,0,0,"F","Serviço","Serviço","1.3.2.1.","AGETOP",41140,"REGULARIZAÇÃO DO TERRENO SEM APILOAMENTO COM TRANSPORTE MANUAL DA TERRA ESCAVADA ","m2    ",699.77,null,null,null,""]
["S",3,"S",0,1,3,2,0,0,0,0,"F","Serviço","Serviço","1.3.2.2.","AGETOP",41002,"APILOAMENTO","m2    ",699.77,null,null,null,""]
[{"$f":"CHOOSE(1+LOG(1+2*(ORÇAMENTO.Nivel=\"Nível 1\")+4*(ORÇAMENTO.Nivel=\"Nível 2\")+8*(ORÇAMENTO.Nivel=\"Nível 3\")+16*(ORÇAMENTO.Nivel=\"Nível 4\")+32*(ORÇAMENTO.Nivel=\"Serviço\"),2),0,1,2,3,4,\"S\")","v":2},{"$f":"IF(OR(C51=\"s\",C51=0),OFFSET(B51,-1,0),C51)","v":2},{"$f":"IF(OFFSET(C51,-1,0)=\"L\",1,IF(OFFSET(C51,-1,0)=1,2,IF(OR(A51=\"s\",A51=0),\"S\",IF(AND(OFFSET(C51,-1,0)=2,A51=4),3,IF(AND(OR(OFFSET(C51,-1,0)=\"s\",OFFSET(C51,-1,0)=0),A51<>\"s\",A51>OFFSET(B51,-1,0)),OFFSET(B51,-1,0),A51)))))","v":2},{"$f":"IF(OR(C51=\"S\",C51=0),0,IF(ISERROR(K51),J51,SMALL(J51:K51,1)))","v":70},{"$f":"IF($C51=1,OFFSET(E51,-1,0)+1,OFFSET(E51,-1,0))","v":1},{"$f":"IF($C51=1,0,IF($C51=2,OFFSET(F51,-1,0)+1,OFFSET(F51,-1,0)))","v":4},{"$f":"IF(AND($C51<=2,$C51<>0),0,IF($C51=3,OFFSET(G51,-1,0)+1,OFFSET(G51,-1,0)))","v":0},{"$f":"IF(AND($C51<=3,$C51<>0),0,IF($C51=4,OFFSET(H51,-1,0)+1,OFFSET(H51,-1,0)))","v":0},{"$f":"IF(AND($C51<=4,$C51<>0),0,IF(AND($C51=\"S\",$W51>0),OFFSET(I51,-1,0)+1,OFFSET(I51,-1,0)))","v":0},{"$f":"IF(OR($C51=\"S\",$C51=0),0,MATCH(0,OFFSET($D51,1,$C51,ROW($C$387)-ROW($C51)),0))","v":166},{"$f":"IF(OR($C51=\"S\",$C51=0),0,MATCH(OFFSET($D51,0,$C51)+1,OFFSET($D51,1,$C51,ROW($C$387)-ROW($C51)),0))","v":70},"F","Nível 2","Nível 2","1.4.",null,null,"INSTALAÇÕES ELÉTRICAS","-",null,null,null,null,""]
["S",2,"S",0,1,4,0,0,0,0,0,"F","Serviço","Serviço","1.4.0.1.","AGETOP",70351,"BRACADEIRA METALICA TIPO \"U\" DIAM. 3/4\"","Un    ",100,null,null,null,""]
["S",2,"S",0,1,4,0,0,0,0,0,"F","Serviço","Serviço","1.4.0.2.","AGETOP",70352,"BRACADEIRA METALICA TIPO \"U\" DIAM. 1\"","Un    ",10,null,null,null,""]
["S",2,"S",0,1,4,0,0,0,0,0,"F","Serviço","Serviço","1.4.0.3.","AGETOP",70353,"BRACADEIRA METALICA TIPO \"U\" DIAM. 1.1/4\"","Un    ",15,null,null,null,""]
["S",2,"S",0,1,4,0,0,0,0,0,"F","Serviço","Serviço","1.4.0.4.","AGETOP",70354,"BRACADEIRA METALICA TIPO \"U\" DIAM. 1.1/2\"","Un    ",5,null,null,null,""]
["S",2,"S",0,1,4,0,0,0,0,0,"F","Serviço","Serviço","1.4.0.5.","AGETOP",70355,"BRACADEIRA METALICA TIPO \"U\" DIAM. 2\"","Un    ",10,null,null,null,""]
["S",2,"S",0,1,4,0,0,0,0,0,"F","Serviço","Serviço","1.4.0.6.","AGETOP",70391,"BUCHA DE NYLON S-6","Un    ",100,null,null,null,""]
["S",2,"S",0,1,4,0,0,0,0,0,"F","Serviço","Serviço","1.4.0.7.","AGETOP",70421,"BUCHA E ARRUELA METALICA DIAM. 3/4\"","PR    ",35,null,null,null,""]
["S",2,"S",0,1,4,0,0,0,0,0,"F","Serviço","Serviço","1.4.0.8.","AGETOP",70422,"BUCHA E ARRUELA METALICA DIAM. 1\"","PR    ",6,null,null,null,""]
["S",2,"S",0,1,4,0,0,0,0,0,"F","Serviço","Serviço","1.4.0.9.","AGETOP",70423,"BUCHA E ARRUELA METALICA DIAM. 1.1/4\"","PR    ",4,null,null,null,""]
["S",2,"S",0,1,4,0,0,0,0,0,"F","Serviço","Serviço","1.4.0.10.","AGETOP",70424,"BUCHA E ARRUELA METALICA DIAM. 1.1/2\"","PR    ",4,null,null,null,""]
["S",2,"S",0,1,4,0,0,0,0,0,"F","Serviço","Serviço","1.4.0.11.","AGETOP",70425,"BUCHA E ARRUELA METALICA DIAM. 2\"","PR    ",8,null,null,null,""]
["S",2,"S",0,1,4,0,0,0,0,0,"F","Serviço","Serviço","1.4.0.12.","AGETOP",70541,"CABO DE COBRE NU No. 16 MM2 (6,94 M/KG)","M     ",70,null,null,null,""]
["S",2,"S",0,1,4,0,0,0,0,0,"F","Serviço","Serviço","1.4.0.13.","AGETOP",70582,"CABO PVC (70ºC) 1 KV No. 4 MM2","M     ",80,null,null,null,""]
["S",2,"S",0,1,4,0,0,0,0,0,"F","Serviço","Serviço","1.4.0.14.","AGETOP",70584,"CABO PVC (70ºC) 1 KV No. 10 MM2","M     ",25,null,null,null,""]
["S",2,"S",0,1,4,0,0,0,0,0,"F","Serviço","Serviço","1.4.0.15.","AGETOP",70585,"CABO PVC (70ºC) 1 KV No. 16 MM2","M     ",25,null,null,null,""]
["S",2,"S",0,1,4,0,0,0,0,0,"F","Serviço","Serviço","1.4.0.16.","AGETOP",70587,"CABO PVC (70ºC) 1 KV No. 35 MM2","M     ",100,null,null,null,""]
[{"$f":"CHOOSE(1+LOG(1+2*(ORÇAMENTO.Nivel=\"Nível 1\")+4*(ORÇAMENTO.Nivel=\"Nível 2\")+8*(ORÇAMENTO.Nivel=\"Nível 3\")+16*(ORÇAMENTO.Nivel=\"Nível 4\")+32*(ORÇAMENTO.Nivel=\"Serviço\"),2),0,1,2,3,4,\"S\")","v":"S"},2,"S",0,1,4,0,0,0,0,0,"F","Serviço","Serviço","1.4.0.17.","AGETOP",70646,"CAIXA DE PASSAGEM METÁLICA DE EMBUTIR 20X20X10 CM","Un    ",2,null,null,null,""]
["S",2,"S",0,1,4,0,0,0,0,0,"F","Serviço","Serviço","1.4.0.18.","AGETOP",70648,"CAIXA DE PASSAGEM METÁLICA DE EMBUTIR  40X40X15 CM","Un    ",2,null,null,null,""]
["S",2,"S",0,1,4,0,0,0,0,0,"F","Serviço","Serviço","1.4.0.19.","AGETOP",70681,"CAIXA METALICA OCTOGONAL FUNDO MOVEL, SIMPLES 2\"","Un    ",40,null,null,null,""]
["S",2,"S",0,1,4,0,0,0,0,0,"F","Serviço","Serviço","1.4.0.20.","AGETOP",70691,"CAIXA METALICA RET. 4\" X 2\" X 2\"","Un    ",20,null,null,null,""]
["S",2,"S",0,1,4,0,0,0,0,0,"F","Serviço","Serviço","1.4.0.21.","AGETOP",70692,"CAIXA METALICA QUADRADA 4\"X4\"X2\"","Un    ",5,null,null,null,""]
["S",2,"S",0,1,4,0,0,0,0,0,"F","Serviço","Serviço","1.4.0.22.","AGETOP",71141,"CURVA DE 90 GRAUS DE PVC RIGIDO DIAM. 3/4\"","Un    ",30,null,null,null,""]
["S",2,"S",0,1,4,0,0,0,0,0,"F","Serviço","Serviço","1.4.0.23.","AGETOP",71142,"CURVA DE 90 GRAUS DE PVC RIGIDO DIAM. 1\"","Un    ",15,null,null,null,""]
["S",2,"S",0,1,4,0,0,0,0,0,"F","Serviço","Serviço","1.4.0.24.","AGETOP",71143,"CURVA DE 90 GRAUS DE PVC RIGIDO DIAM. 1.1/4\"","Un    ",7,null,null,null,""]
["S",{"$f":"IF(OR(C76=\"s\",C76=0),OFFSET(B76,-1,0),C76)","v":2},{"$f":"IF(OFFSET(C76,-1,0)=\"L\",1,IF(OFFSET(C76,-1,0)=1,2,IF(OR(A76=\"s\",A76=0),\"S\",IF(AND(OFFSET(C76,-1,0)=2,A76=4),3,IF(AND(OR(OFFSET(C76,-1,0)=\"s\",OFFSET(C76,-1,0)=0),A76<>\"s\",A76>OFFSET(B76,-1,0)),OFFSET(B76,-1,0),A76)))))","v":"S"},{"$f":"IF(OR(C76=\"S\",C76=0),0,IF(ISERROR(K76),J76,SMALL(J76:K76,1)))","v":0},{"$f":"IF($C76=1,OFFSET(E76,-1,0)+1,OFFSET(E76,-1,0))","v":1},{"$f":"IF($C76=1,0,IF($C76=2,OFFSET(F76,-1,0)+1,OFFSET(F76,-1,0)))","v":4},{"$f":"IF(AND($C76<=2,$C76<>0),0,IF($C76=3,OFFSET(G76,-1,0)+1,OFFSET(G76,-1,0)))","v":0},{"$f":"IF(AND($C76<=3,$C76<>0),0,IF($C76=4,OFFSET(H76,-1,0)+1,OFFSET(H76,-1,0)))","v":0},{"$f":"IF(AND($C76<=4,$C76<>0),0,IF(AND($C76=\"S\",$W76>0),OFFSET(I76,-1,0)+1,OFFSET(I76,-1,0)))","v":0},0,0,"F","Serviço","Serviço","1.4.0.25.","AGETOP",71144,"CURVA DE 90 GRAUS DE PVC RIGIDO DIAM. 1.1/2\"","Un    ",3,null,null,null,""]
["S",2,"S",0,1,4,0,0,0,0,0,"F","Serviço","Serviço","1.4.0.26.","AGETOP",71145,"CURVA DE 90 GRAUS DE PVC RIGIDO DIAM. 2\"","Un    ",10,null,null,null,""]
["S",2,"S",0,1,4,0,0,0,0,0,"F","Serviço","Serviço","1.4.0.27.","AGETOP",71171,"DISJUNTOR MONOPOLAR DE 10 A 32-A","Un    ",21,null,null,null,""]
["S",2,"S",0,1,4,0,0,0,0,0,"F","Serviço","Serviço","1.4.0.28.","AGETOP",71173,"DISJUNTOR TRIPOLAR DE 10 A 35-A","Un    ",2,null,null,null,""]
["S",2,"S",0,1,4,0,0,0,0,0,"F","Serviço","Serviço","1.4.0.29.","AGETOP",71174,"DISJUNTOR TRIPOLAR 40 A 50A","Un    ",2,null,null,null,""]
["S",2,"S",0,1,4,0,0,0,0,0,"F","Serviço","Serviço","1.4.0.30.","AGETOP",71175,"DISJUNTOR TRIPOLAR DE 60 A 100-A","Un    ",1,null,null,null,""]
["S",2,"S",0,1,4,0,0,0,0,0,"F","Serviço","Serviço","1.4.0.31.","AGETOP",71184,"DISPOSITIVO DE PROTEÇÃO CONTRA SURTOS (D.P.S.) 275V DE 8 A 40KA","Un    ",6,null,null,null,""]
["S",2,"S",0,1,4,0,0,0,{"$f":"IF(OR($C83=\"S\",$C83=0),0,MATCH(0,OFFSET($D83,1,$C83,ROW($C$387)-ROW($C83)),0))","v":0},{"$f":"IF(OR($C83=\"S\",$C83=0),0,MATCH(OFFSET($D83,0,$C83)+1,OFFSET($D83,1,$C83,ROW($C$387)-ROW($C83)),0))","v":0},"F","Serviço","Serviço","1.4.0.32.","AGETOP",71201,"ELETRODUTO DE PVC RIGIDO DIAMETRO 3/4\"","M     ",420,null,null,null,""]
["S",{"$f":"IF(OR(C84=\"s\",C84=0),OFFSET(B84,-1,0),C84)","v":2},{"$f":"IF(OFFSET(C84,-1,0)=\"L\",1,IF(OFFSET(C84,-1,0)=1,2,IF(OR(A84=\"s\",A84=0),\"S\",IF(AND(OFFSET(C84,-1,0)=2,A84=4),3,IF(AND(OR(OFFSET(C84,-1,0)=\"s\",OFFSET(C84,-1,0)=0),A84<>\"s\",A84>OFFSET(B84,-1,0)),OFFSET(B84,-1,0),A84)))))","v":"S"},{"$f":"IF(OR(C84=\"S\",C84=0),0,IF(ISERROR(K84),J84,SMALL(J84:K84,1)))","v":0},{"$f":"IF($C84=1,OFFSET(E84,-1,0)+1,OFFSET(E84,-1,0))","v":1},{"$f":"IF($C84=1,0,IF($C84=2,OFFSET(F84,-1,0)+1,OFFSET(F84,-1,0)))","v":4},{"$f":"IF(AND($C84<=2,$C84<>0),0,IF($C84=3,OFFSET(G84,-1,0)+1,OFFSET(G84,-1,0)))","v":0},{"$f":"IF(AND($C84<=3,$C84<>0),0,IF($C84=4,OFFSET(H84,-1,0)+1,OFFSET(H84,-1,0)))","v":0},{"$f":"IF(AND($C84<=4,$C84<>0),0,IF(AND($C84=\"S\",$W84>0),OFFSET(I84,-1,0)+1,OFFSET(I84,-1,0)))","v":0},0,0,"F","Serviço","Serviço","1.4.0.33.","AGETOP",71202,"ELETRODUTO DE PVC RIGIDO DIAMETRO 1\"","M     ",90,null,null,null,""]
["S",2,"S",0,1,4,0,0,0,0,0,"F","Serviço","Serviço","1.4.0.34.","AGETOP",71203,"ELETRODUTO DE PVC RIGIDO DIAMETRO 1.1/2\"","M     ",15,null,null,null,""]
["S",2,"S",0,1,4,0,0,0,0,0,"F","Serviço","Serviço","1.4.0.35.","AGETOP",71204,"ELETRODUTO DE PVC RIGIDO DIAMETRO 1.1/4\"","M     ",40,null,null,null,""]
["S",2,"S",0,1,4,0,0,0,0,0,"F","Serviço","Serviço","1.4.0.36.","AGETOP",71205,"ELETRODUTO DE PVC RIGIDO DIAMETRO 2\"","M     ",60,null,null,null,""]
["S",2,"S",0,1,4,0,0,0,0,0,"F","Serviço","Serviço","1.4.0.37.","AGETOP",71291,"FIO ISOLADO PVC 750 V, No. 2,5 MM2","M     ",1000,null,null,null,""]
["S",2,"S",0,1,4,0,0,0,0,0,"F","Serviço","Serviço","1.4.0.38.","AGETOP",71292,"FIO ISOLADO PVC 750 V, No. 4 MM2","M     ",2000,null,null,null,""]
["S",2,"S",0,1,4,0,0,0,0,0,"F","Serviço","Serviço","1.4.0.39.","AGETOP",71321,"FITA DE AUTO FUSAO, ROLO E 10,00 MM","Un    ",5,null,null,null,""]
["S",2,"S",0,1,4,0,0,0,0,0,"F","Serviço","Serviço","1.4.0.40.","AGETOP",71331,"FITA ISOLANTE, ROLO DE 20,00 M","Un    ",5,null,null,null,""]
["S",2,"S",0,1,4,0,0,0,0,0,"F","Serviço","Serviço","1.4.0.41.","AGETOP",71381,"HASTE REV.COBRE(COPPERWELD)  5/8\" X 3,00 M C/CONECTOR","Un    ",8,null,null,null,""]
["S",2,"S",0,1,4,0,0,0,0,0,"F","Serviço","Serviço","1.4.0.42.","AGETOP",71440,"INTERRUPTOR SIMPLES (1 SECAO)","Un    ",20,null,null,null,""]
["S",2,"S",0,1,4,0,0,0,0,0,"F","Serviço","Serviço","1.4.0.43.","AGETOP",71441,"INTERRUPTOR SIMPLES (2 SECOES)","Un    ",1,null,null,null,""]
["S",2,"S",0,1,4,0,0,0,0,0,"F","Serviço","Serviço","1.4.0.44.","AGETOP",71442,"INTERRUPTOR SIMPLES (3 SECOES)","Un    ",1,null,null,null,""]
["S",2,"S",0,1,4,0,0,0,0,0,"F","Serviço","Serviço","1.4.0.45.","AGETOP",71450,"INTERRUPTOR DIFERENCIAL RESIDUAL (D.R.) BIPOLAR DE 25A-30mA","Un    ",8,null,null,null,""]
["S",2,"S",0,1,4,0,0,0,0,0,"F","Serviço","Serviço","1.4.0.46.","AGETOP",71577,"LAMPADA COMPACTA ELETRÔNICA COM REATOR INTEGRADO  25/26 W","Un    ",80,null,null,null,""]
["S",2,"S",0,1,4,0,0,0,0,0,"F","Serviço","Serviço","1.4.0.47.","AGETOP",72238,"REATOR AFP USO EXTERNO V.METALICO 400 W","Un    ",15,null,null,null,""]
["S",2,"S",0,1,4,0,0,0,0,0,"F","Serviço","Serviço","1.4.0.48.","AGETOP",71644,"LUMINÁRIA TIPO PLAFON DE SOBREPOR QUADRADA PARA 02 LÂMPADAS","Un    ",40,null,null,null,""]
["S",2,"S",0,1,4,0,0,0,0,0,"F","Serviço","Serviço","1.4.0.49.","AGETOP",71684,"LUMINÁRIA TIPO PROJETOR RETANGULAR ATÉ 400 W - BASE E-40","un    ",15,null,null,null,""]
["S",2,"S",0,1,4,0,0,0,0,0,"F","Serviço","Serviço","1.4.0.50.","AGETOP",71741,"LUVA PVC ROSQUEAVEL DIAMETRO 3/4\"","Un    ",140,null,null,null,""]
["S",2,"S",0,1,4,0,0,0,0,0,"F","Serviço","Serviço","1.4.0.51.","AGETOP",71742,"LUVA PVC ROSQUEAVEL DIAMETRO 1\"","Un    ",30,null,null,null,""]
["S",2,"S",0,1,4,0,0,0,0,0,"F","Serviço","Serviço","1.4.0.52.","AGETOP",71743,"LUVA PVC ROSQUEAVEL DIAMETRO 1.1/4\"","Un    ",14,null,null,null,""]
["S",2,"S",0,1,4,0,0,0,0,0,"F","Serviço","Serviço","1.4.0.53.","AGETOP",71744,"LUVA PVC ROSQUEAVEL DIAMETRO 1.1/2\"","Un    ",5,null,null,null,""]
["S",2,"S",0,1,4,0,0,0,0,0,"F","Serviço","Serviço","1.4.0.54.","AGETOP",71745,"LUVA PVC ROSQUEAVEL DIAMETRO 2\"","Un    ",20,null,null,null,""]
["S",2,"S",0,1,4,0,0,0,0,0,"F","Serviço","Serviço","1.4.0.55.","AGETOP",71861,"PARAFUSO P/BUCHA S-6","Un    ",200,null,null,null,""]
["S",2,"S",0,1,4,0,0,0,0,0,"F","Serviço","Serviço","1.4.0.56.","AGETOP",72170,"QUADRO DE DISTRIBUIÇÃO DE EMBUTIR EM PVC CB 12E - 80A","Un    ",2,null,null,null,""]
["S",2,"S",0,1,4,0,0,0,0,0,"F","Serviço","Serviço","1.4.0.57.","AGETOP",72172,"QUADRO DE DISTRIBUIÇÃO DE EMBUTIR EM PVC CB 36E - 80A","un    ",1,null,null,null,""]
["S",2,"S",0,1,4,0,0,0,0,0,"F","Serviço","Serviço","1.4.0.58.","AGETOP",72238,"REATOR AFP USO EXTERNO V.METALICO 400 W","Un    ",15,null,null,null,""]
["S",2,"S",0,1,4,0,0,0,0,0,"F","Serviço","Serviço","1.4.0.59.","AGETOP",72425,"TAMPA CEGA PLASTICA RETANGULAR 4\"X2\"","Un    ",93,null,null,null,""]
["S",2,"S",0,1,4,0,0,0,0,0,"F","Serviço","Serviço","1.4.0.60.","AGETOP",72520,"TERMINAL DE PRESSAO 16 MM2","Un    ",6,null,null,null,""]
["S",2,"S",0,1,4,0,0,0,0,0,"F","Serviço","Serviço","1.4.0.61.","AGETOP",72523,"TERMINAL DE PRESSAO 25 MM2","Un    ",4,null,null,null,""]
["S",2,"S",0,1,4,0,0,0,0,0,"F","Serviço","Serviço","1.4.0.62.","AGETOP",72578,"TOMADA HEXAGONAL 2P + T - 10A - 250V","Un    ",50,null,null,null,""]
["S",2,"S",0,1,4,0,0,0,0,0,"F","Serviço","Serviço","1.4.0.63.","AGETOP",72585,"TOMADA HEXAGONAL 2P + T - 20A - 250V","Un    ",21,null,null,null,""]
["S",2,"S",0,1,4,0,0,0,{"$f":"IF(OR($C115=\"S\",$C115=0),0,MATCH(0,OFFSET($D115,1,$C115,ROW($C$387)-ROW($C115)),0))","v":0},{"$f":"IF(OR($C115=\"S\",$C115=0),0,MATCH(OFFSET($D115,0,$C115)+1,OFFSET($D115,1,$C115,ROW($C$387)-ROW($C115)),0))","v":0},"F","Serviço","Serviço","1.4.0.64.","AGETOP",81829,"CAIXA DE INSPEÇÃO - TAMPA EM CONCRETO ARMADO 25 MPA E=5CM ","m2    ",1,null,null,null,""]
["S",2,"S",0,1,4,0,0,0,0,0,"F","Serviço","Serviço","1.4.0.65.","AGETOP",81830,"CAIXA DE INSPEÇÃO - LASTRO DE CONCRETO (COM ADIÇÃO DE IMPERMEABILIZANTE) 20 MPA E=5CM PARA O FUNDO","m3    ",0.5,null,null,null,""]
["S",2,"S",0,1,4,0,0,0,0,0,"F","Serviço","Serviço","1.4.0.66.","AGETOP",81832,"CAIXA DE INSPEÇÃO - ALVENARIA DE 1 VEZ COM REVESTIMENTO INTERNO EM REBOCO PAULISTA A-14 (COM ADIÇÃO DE IMPERMEABILIZANTE)","m2    ",1,null,null,null,""]
["S",2,"S",0,1,4,0,0,0,0,0,"F","Serviço","Serviço","1.4.0.67.","AGETOP",81833,"CAIXA DE INSPEÇÃO - ESCAVAÇÃO MANUAL / REATERRO/ APILOAMENTO DO FUNDO ","m3    ",0.5,null,null,null,""]
["S",2,"S",0,1,4,0,0,0,0,0,"F","Serviço","Serviço","1.4.0.68.","AGETOP",120210,"MASTIQUE A BASE DE POLIURETANO COM PRÉVIO PREPARO E TRATAMENTO DA SUPERFÍCIE","CM3   ",500,null,null,null,""]
["S",2,"S",0,1,4,0,0,0,0,0,"F","Serviço","Serviço","1.4.0.69.","AGETOP",71824,"PADRÃO TRIFASICO 35 MM H=7 METROS","Un    ",1,null,null,null,""]
[{"$f":"CHOOSE(1+LOG(1+2*(ORÇAMENTO.Nivel=\"Nível 1\")+4*(ORÇAMENTO.Nivel=\"Nível 2\")+8*(ORÇAMENTO.Nivel=\"Nível 3\")+16*(ORÇAMENTO.Nivel=\"Nível 4\")+32*(ORÇAMENTO.Nivel=\"Serviço\"),2),0,1,2,3,4,\"S\")","v":2},2,2,15,1,5,0,0,0,96,15,"F","Nível 2","Nível 2","1.5.","AGETOP",null,"INSTALAÇÕES HIDROSSANITÁRIAS","-",null,null,null,null,""]
["S",2,"S",0,1,5,0,0,0,0,0,"F","Serviço","Serviço","1.5.0.1.","AGETOP",81869,"FOSSA SEPTICA 8700 LITROS COM IMPERMEABILIZAÇÃO","Un    ",1,null,null,null,""]
["S",2,"S",0,1,5,0,0,0,0,0,"F","Serviço","Serviço","1.5.0.2.","AGETOP",81874,"SUMIDOURO COM DIÂMETRO=1,60M E  PROFUNDIDADE=4,50 M","Un    ",1,null,null,null,""]
["S",2,"S",0,1,5,0,0,0,0,0,"F","Serviço","Serviço","1.5.0.3.","AGETOP",81501,"ADESIVO PLASTICO - FRASCO 850 G","Un    ",2,null,null,null,""]
["S",2,"S",0,1,5,0,0,0,0,0,"F","Serviço","Serviço","1.5.0.4.","AGETOP",81504,"SOLUCAO LIMPADORA 1000 CM3","Un    ",2,null,null,null,""]
["S",2,"S",0,1,5,0,0,0,0,0,"F","Serviço","Serviço","1.5.0.5.","AGETOP",80910,"REGISTRO DE GAVETA BRUTO DIAMETRO 2.1/2\"","Un    ",1,null,null,null,""]
["S",2,"S",0,1,5,0,0,0,0,0,"F","Serviço","Serviço","1.5.0.6.","AGETOP",80845,"CAIXA DE ALVENARIA 20x20x25 CM (REVESTIMENTO IMPERMEABILIZADO), FUNDO DE BRITA SEM TAMPA - PARA REGISTRO/TORNEIRA JARDIM","Un    ",1,null,null,null,""]
["S",2,"S",0,1,5,0,0,0,0,0,"F","Serviço","Serviço","1.5.0.7.","AGETOP",81071,"ADAPTADOR SOLDAVEL CURTO C/BR P/REG.75X2.1/2\"","Un    ",1,null,null,null,""]
["S",2,"S",0,1,5,0,0,0,0,0,"F","Serviço","Serviço","1.5.0.8.","AGETOP",81071,"ADAPTADOR SOLDAVEL CURTO C/BR P/REG.75X2.1/2\"","Un    ",2,null,null,null,""]
["S",2,"S",0,1,5,0,0,0,0,0,"F","Serviço","Serviço","1.5.0.9.","AGETOP",81326,"JOELHO 90 GRAUS SOLDAVEL DIAMETRO 75 mm","Un    ",3,null,null,null,""]
["S",2,"S",0,1,5,0,0,0,0,0,"F","Serviço","Serviço","1.5.0.10.","AGETOP",81107,"LUVA SOLDAVEL DIAMETRO 75 mm","Un    ",8,null,null,null,""]
["S",2,"S",0,1,5,0,0,0,0,0,"F","Serviço","Serviço","1.5.0.11.","AGETOP",81008,"TUBO SOLDAVEL PVC MARROM DIAMETRO 75 mm","m     ",48,null,null,null,""]
["S",2,"S",0,1,5,0,0,0,0,0,"F","Serviço","Serviço","1.5.0.12.","AGETOP",81827,"CAIXA DE AREIA 60X60CM FUNDO DE BRITA SEM TAMPA","Un    ",3,null,null,null,""]
["S",2,"S",0,1,5,0,0,0,0,0,"F","Serviço","Serviço","1.5.0.13.","AGETOP",81826,"TAMPA EM CONCRETO ARMADO 25 MPA E=5CM PARA A CAIXA DE PASSAGEM 60X60CM","Un    ",3,null,null,null,""]
["S",2,"S",0,1,5,0,0,0,0,0,"F","Serviço","Serviço","1.5.0.14.","AGETOP",82304,"TUBO SOLDAVEL P/ESGOTO DIAM. 100 MM","m     ",18,null,null,null,""]
[{"$f":"CHOOSE(1+LOG(1+2*(ORÇAMENTO.Nivel=\"Nível 1\")+4*(ORÇAMENTO.Nivel=\"Nível 2\")+8*(ORÇAMENTO.Nivel=\"Nível 3\")+16*(ORÇAMENTO.Nivel=\"Nível 4\")+32*(ORÇAMENTO.Nivel=\"Serviço\"),2),0,1,2,3,4,\"S\")","v":2},{"$f":"IF(OR(C136=\"s\",C136=0),OFFSET(B136,-1,0),C136)","v":2},{"$f":"IF(OFFSET(C136,-1,0)=\"L\",1,IF(OFFSET(C136,-1,0)=1,2,IF(OR(A136=\"s\",A136=0),\"S\",IF(AND(OFFSET(C136,-1,0)=2,A136=4),3,IF(AND(OR(OFFSET(C136,-1,0)=\"s\",OFFSET(C136,-1,0)=0),A136<>\"s\",A136>OFFSET(B136,-1,0)),OFFSET(B136,-1,0),A136)))))","v":2},{"$f":"IF(OR(C136=\"S\",C136=0),0,IF(ISERROR(K136),J136,SMALL(J136:K136,1)))","v":37},{"$f":"IF($C136=1,OFFSET(E136,-1,0)+1,OFFSET(E136,-1,0))","v":1},{"$f":"IF($C136=1,0,IF($C136=2,OFFSET(F136,-1,0)+1,OFFSET(F136,-1,0)))","v":6},{"$f":"IF(AND($C136<=2,$C136<>0),0,IF($C136=3,OFFSET(G136,-1,0)+1,OFFSET(G136,-1,0)))","v":0},{"$f":"IF(AND($C136<=3,$C136<>0),0,IF($C136=4,OFFSET(H136,-1,0)+1,OFFSET(H136,-1,0)))","v":0},{"$f":"IF(AND($C136<=4,$C136<>0),0,IF(AND($C136=\"S\",$W136>0),OFFSET(I136,-1,0)+1,OFFSET(I136,-1,0)))","v":0},81,37,"F","Nível 2","Nível 2","1.6.",null,null,"INSTALAÇÕES ESPECIAIS","-",null,null,null,null,""]
[3,3,3,27,1,6,1,0,0,36,27,"F","Nível 3","Nível 3","1.6.1.","SINAPI",null,"CENTRAL DE GÁS","-",null,null,null,null,""]
["S",3,"S",0,1,6,1,0,0,0,0,"F","Serviço","Serviço","1.6.1.1.","AGETOP",91007,"CENTRAL DE GÁS PADRÃO GOINFRA SEM INSTALAÇÕES (1+1 CILINDRO 45 KG)","Un    ",1,null,null,null,""]
["S",3,"S",0,1,6,1,0,0,0,0,"F","Serviço","Serviço","1.6.1.2.","AGETOP",91023,"UNIÃO S/BRONZE PRETA 3/4\" NPT 300 LBS","Un    ",3,null,null,null,""]
["S",3,"S",0,1,6,1,0,0,0,0,"F","Serviço","Serviço","1.6.1.3.","COMPOSIÇÃO","COMP 382_SEE","TE DE REDUCAO DE FERRO GALVANIZADO, COM ROSCA BSP, DE 3/4\" X 1/2\"","UN ",1,null,null,null,""]
["S",3,"S",0,1,6,1,0,0,0,0,"F","Serviço","Serviço","1.6.1.4.","COMPOSIÇÃO","COMP 383_SEE","BUCHA DE REDUCAO DE FERRO GALVANIZADO, COM ROSCA BSP, DE 1/2\" X 1/4\"","UN ",3,null,null,null,""]
["S",3,"S",0,1,6,1,0,0,0,0,"F","Serviço","Serviço","1.6.1.5.","AGETOP",91021,"LUVA GALVANIZADO DE REDUÇÃO 3/4\" X 1/2\" (GÁS)","Un    ",2,null,null,null,""]
["S",3,"S",0,1,6,1,0,0,0,0,"F","Serviço","Serviço","1.6.1.6.","SINAPI",92692,"NIPLE, EM FERRO GALVANIZADO, CONEXÃO ROSQUEADA, DN 15 (1/2\"), INSTALADO EM RAMAIS E SUB-RAMAIS DE GÁS - FORNECIMENTO E INSTALAÇÃO. AF_12/2015","UN",2,null,null,null,""]
["S",3,"S",0,1,6,1,0,0,0,0,"F","Serviço","Serviço","1.6.1.7.","AGETOP",91031,"NIPLE DUPLO 300 PSI 3/4\"","Un    ",6,null,null,null,""]
["S",3,"S",0,1,6,1,0,0,0,0,"F","Serviço","Serviço","1.6.1.8.","COMPOSIÇÃO","COMP 212_SEE","NIPLE DE REDUÇÃO 1/2\" X 1/4\" BSP","UN ",3,null,null,null,""]
["S",3,"S",0,1,6,1,0,0,0,0,"F","Serviço","Serviço","1.6.1.9.","COMPOSIÇÃO","COMP 213_SEE","NIPLE DE REDUÇÃO 3/4\" X 1/2\" BSP","UN ",3,null,null,null,""]
["S",3,"S",0,1,6,1,0,0,{"$f":"IF(OR($C147=\"S\",$C147=0),0,MATCH(0,OFFSET($D147,1,$C147,ROW($C$387)-ROW($C147)),0))","v":0},{"$f":"IF(OR($C147=\"S\",$C147=0),0,MATCH(OFFSET($D147,0,$C147)+1,OFFSET($D147,1,$C147,ROW($C$387)-ROW($C147)),0))","v":0},"F","Serviço","Serviço","1.6.1.10.","SINAPI",92688,"TUBO DE AÇO GALVANIZADO COM COSTURA, CLASSE MÉDIA, CONEXÃO ROSQUEADA, DN 20 (3/4\"), INSTALADO EM RAMAIS E SUB-RAMAIS DE GÁS - FORNECIMENTO E INSTALAÇÃO. AF_12/2015","M",30,null,null,null,""]
["S",3,"S",0,1,6,1,0,0,0,0,"F","Serviço","Serviço","1.6.1.11.","SINAPI",92701,"JOELHO 90 GRAUS, EM FERRO GALVANIZADO, CONEXÃO ROSQUEADA, DN 20 (3/4\"), INSTALADO EM RAMAIS E SUB-RAMAIS DE GÁS - FORNECIMENTO E INSTALAÇÃO. AF_12/2015","UN",12,null,null,null,""]
["S",3,"S",0,1,6,1,0,0,0,0,"F","Serviço","Serviço","1.6.1.12.","COMPOSIÇÃO","COMP 237_SEE","FITA ANTICORROSIVA","M",10,null,null,null,""]
["S",3,"S",0,1,6,1,0,0,0,0,"F","Serviço","Serviço","1.6.1.13.","AGETOP",91025,"VÁLVULA ESFERICA LATÃO 3/4\"","Un    ",4,null,null,null,""]
["S",3,"S",0,1,6,1,0,0,0,0,"F","Serviço","Serviço","1.6.1.14.","AGETOP",91019,"TE PRETO 90º 3/4\" NPT 300 LBS","Un    ",2,null,null,null,""]
["S",3,"S",0,1,6,1,0,0,0,0,"F","Serviço","Serviço","1.6.1.15.","COMPOSIÇÃO","COMP 542_SEE","VÁLVULA UGV 3/4\" (S) LATÃO","UN ",2,null,null,null,""]
["S",3,"S",0,1,6,1,0,0,0,0,"F","Serviço","Serviço","1.6.1.16.","COMPOSIÇÃO","COMP 543_SEE","VÁLVULA UGV 1/2\" (S) LATÃO","UN ",2,null,null,null,""]
["S",3,"S",0,1,6,1,0,0,0,0,"F","Serviço","Serviço","1.6.1.17.","AGETOP",91029,"VALVULA DE RETENÇÃO LATÃO 1/2\" X 7/16\" NPT","Un    ",5,null,null,null,""]
["S",3,"S",0,1,6,1,0,0,0,0,"F","Serviço","Serviço","1.6.1.18.","COMPOSIÇÃO","COMP 210_SEE","REGULADOR DE 1º ESTÁGIO 60KG/H MODELO AP-40  COM MANÔMETRO","UN ",1,null,null,null,""]
["S",3,"S",0,1,6,1,0,0,0,0,"F","Serviço","Serviço","1.6.1.19.","AGETOP",85003,"EXTINTOR PO QUIMICO SECO (6 KG) - CAPACIDADE EXTINTORA 20 BC","Un    ",1,null,null,null,""]
["S",3,"S",0,1,6,1,0,0,0,0,"F","Serviço","Serviço","1.6.1.20.","COMPOSIÇÃO","COMP 235_SEE","PLACA DE SINALIZAÇÃO EM PVC COD 01 - (300X300) PROIBIDO FUMAR","UN ",1,null,null,null,""]
["S",3,"S",0,1,6,1,0,0,0,0,"F","Serviço","Serviço","1.6.1.21.","COMPOSIÇÃO","COMP 236_SEE","PLACA DE SINALIZAÇÃO EM PVC COD 06 - (300X300) PERIGO INFLAMÁVEL","UN ",1,null,null,null,""]
["S",3,"S",0,1,6,1,0,0,0,0,"F","Serviço","Serviço","1.6.1.22.","AGETOP",91043,"BRAÇADEIRA METALICA TIPO \"D\" DIAM. 3/4\"","Un    ",10,null,null,null,""]
["S",3,"S",0,1,6,1,0,0,0,0,"F","Serviço","Serviço","1.6.1.23.","AGETOP",71863,"PARAFUSO P/BUCHA S-10","Un    ",26,null,null,null,""]
["S",3,"S",0,1,6,1,0,0,0,0,"F","Serviço","Serviço","1.6.1.24.","AGETOP",70393,"BUCHA DE NYLON S-10","Un    ",26,null,null,null,""]
["S",3,"S",0,1,6,1,0,0,0,0,"F","Serviço","Serviço","1.6.1.25.","AGETOP",91045,"SUPORTE PARA COLETOR","Un    ",3,null,null,null,""]
["S",3,"S",0,1,6,1,0,0,0,0,"F","Serviço","Serviço","1.6.1.26.","COMPOSIÇÃO","COMP 045_SEE","LAUDO DE ESTANQUEIDADE","UN ",1,null,null,null,""]
[3,3,3,9,1,6,2,0,0,9,35,"F","Nível 3","Nível 3","1.6.2.","AGETOP",null,"INSTALAÇÕES DE INCÊNDIO","-",null,null,null,null,""]
["S",3,"S",0,1,6,2,0,0,0,0,"F","Serviço","Serviço","1.6.2.1.","AGETOP",85003,"EXTINTOR PO QUIMICO SECO (6 KG) - CAPACIDADE EXTINTORA 20 BC","Un    ",6,null,null,null,""]
["S",3,"S",0,1,6,2,0,0,0,0,"F","Serviço","Serviço","1.6.2.2.","AGETOP",85005,"EXTINTOR AGUA PRESSURIZADA (10 LITROS) - CAPACIDADE EXTINTORA 2A","Un    ",4,null,null,null,""]
["S",3,"S",0,1,6,2,0,0,0,0,"F","Serviço","Serviço","1.6.2.3.","SINAPI",97599,"LUMINÁRIA DE EMERGÊNCIA - FORNECIMENTO E INSTALAÇÃO. AF_11/2017","UN",16,null,null,null,""]
["S",3,"S",0,1,6,2,0,0,0,0,"F","Serviço","Serviço","1.6.2.4.","COMPOSIÇÃO","COMP 024_SEE","SINALIZADOR FOTOLUMINESCENTE PARA EXTINTOR","UN ",10,null,null,null,""]
["S",3,"S",0,1,6,2,0,0,0,0,"F","Serviço","Serviço","1.6.2.5.","COMPOSIÇÃO","COMP 025_SEE","SINALIZADOR FOTOLUMINESCENTE DE EMERGÊNCIA","UN ",30,null,null,null,""]
["S",3,"S",0,1,6,2,0,0,0,0,"F","Serviço","Serviço","1.6.2.6.","COMPOSIÇÃO","COMP 277_SEE","MARCAÇÃO NO PISO - 1X1 M PARA EXTINTOR","M2",10,null,null,null,""]
["S",3,"S",0,1,6,2,0,0,0,0,"F","Serviço","Serviço","1.6.2.7.","COMPOSIÇÃO","COMP 235_SEE","PLACA DE SINALIZAÇÃO EM PVC COD 01 - (300X300) PROIBIDO FUMAR","UN ",1,null,null,null,""]
["S",3,"S",0,1,6,2,0,0,0,0,"F","Serviço","Serviço","1.6.2.8.","COMPOSIÇÃO","COMP 236_SEE","PLACA DE SINALIZAÇÃO EM PVC COD 06 - (300X300) PERIGO INFLAMÁVEL","UN ",1,null,null,null,""]
[{"$f":"CHOOSE(1+LOG(1+2*(ORÇAMENTO.Nivel=\"Nível 1\")+4*(ORÇAMENTO.Nivel=\"Nível 2\")+8*(ORÇAMENTO.Nivel=\"Nível 3\")+16*(ORÇAMENTO.Nivel=\"Nível 4\")+32*(ORÇAMENTO.Nivel=\"Serviço\"),2),0,1,2,3,4,\"S\")","v":2},2,2,3,1,7,0,0,0,44,3,"F","Nível 2","Nível 2","1.7.",null,null,"ESTRUTURA DE MADEIRA","-",null,null,null,null,""]
[{"$f":"CHOOSE(1+LOG(1+2*(ORÇAMENTO.Nivel=\"Nível 1\")+4*(ORÇAMENTO.Nivel=\"Nível 2\")+8*(ORÇAMENTO.Nivel=\"Nível 3\")+16*(ORÇAMENTO.Nivel=\"Nível 4\")+32*(ORÇAMENTO.Nivel=\"Serviço\"),2),0,1,2,3,4,\"S\")","v":3},{"$f":"IF(OR(C174=\"s\",C174=0),OFFSET(B174,-1,0),C174)","v":3},{"$f":"IF(OFFSET(C174,-1,0)=\"L\",1,IF(OFFSET(C174,-1,0)=1,2,IF(OR(A174=\"s\",A174=0),\"S\",IF(AND(OFFSET(C174,-1,0)=2,A174=4),3,IF(AND(OR(OFFSET(C174,-1,0)=\"s\",OFFSET(C174,-1,0)=0),A174<>\"s\",A174>OFFSET(B174,-1,0)),OFFSET(B174,-1,0),A174)))))","v":3},{"$f":"IF(OR(C174=\"S\",C174=0),0,IF(ISERROR(K174),J174,SMALL(J174:K174,1)))","v":2},{"$f":"IF($C174=1,OFFSET(E174,-1,0)+1,OFFSET(E174,-1,0))","v":1},{"$f":"IF($C174=1,0,IF($C174=2,OFFSET(F174,-1,0)+1,OFFSET(F174,-1,0)))","v":7},{"$f":"IF(AND($C174<=2,$C174<>0),0,IF($C174=3,OFFSET(G174,-1,0)+1,OFFSET(G174,-1,0)))","v":1},{"$f":"IF(AND($C174<=3,$C174<>0),0,IF($C174=4,OFFSET(H174,-1,0)+1,OFFSET(H174,-1,0)))","v":0},{"$f":"IF(AND($C174<=4,$C174<>0),0,IF(AND($C174=\"S\",$W174>0),OFFSET(I174,-1,0)+1,OFFSET(I174,-1,0)))","v":0},2,11,"F","Nível 3","Nível 3","1.7.1.","SINAPI",null,"COBERTURA","-",null,null,null,null,""]
["S",3,"S",0,1,7,1,0,0,0,0,"F","Serviço","Serviço","1.7.1.1.","AGETOP",140202,"GRADEADO CAIBROS/RIPAS","m2    ",305.83,null,null,null,""]
[2,2,2,6,1,8,0,0,0,41,6,"F","Nível 2","Nível 2","1.8.",null,null,"COBERTURAS","-",null,null,null,null,""]
[3,3,3,5,1,8,1,0,0,{"$f":"IF(OR($C177=\"S\",$C177=0),0,MATCH(0,OFFSET($D177,1,$C177,ROW($C$387)-ROW($C177)),0))","v":5},{"$f":"IF(OR($C177=\"S\",$C177=0),0,MATCH(OFFSET($D177,0,$C177)+1,OFFSET($D177,1,$C177,ROW($C$387)-ROW($C177)),0))","v":8},"F","Nível 3","Nível 3","1.8.1.","SINAPI",null,"COBERTURA","-",null,null,null,null,""]
["S",3,"S",0,1,8,1,0,0,0,0,"F","Serviço","Serviço","1.8.1.1.","AGETOP",160100,"COBERTURA COM TELHA AMERICANA  RESINADA COR VERMELHA","m2    ",305.83,null,null,null,""]
["S",3,"S",0,1,8,1,0,0,0,0,"F","Serviço","Serviço","1.8.1.2.","AGETOP",160403,"EMBOCAMENTO LATERAL  (OITOES)","m     ",39.4,null,null,null,""]
["S",3,"S",0,1,8,1,0,0,0,0,"F","Serviço","Serviço","1.8.1.3.","AGETOP",160404,"EMBOCAMENTO DE BEIRAL","M     ",32.24,null,null,null,""]
["S",3,"S",0,1,8,1,0,0,0,0,"F","Serviço","Serviço","1.8.1.4.","SINAPI",94221,"CUMEEIRA PARA TELHA CERÂMICA EMBOÇADA COM ARGAMASSA TRAÇO 1:2:9 (CIMENTO, CAL E AREIA) PARA TELHADOS COM ATÉ 2 ÁGUAS, INCLUSO TRANSPORTE VERTICAL. AF_07/2019","M",16.12,null,null,null,""]
[2,2,2,5,1,9,0,0,0,35,5,"F","Nível 2","Nível 2","1.9.",null,null,"ESQUADRIAS METÁLICAS","-",null,null,null,null,""]
[3,3,3,2,1,9,1,0,0,4,2,"F","Nível 3","Nível 3","1.9.1.","SINAPI",null,"BLOCO 03","-",null,null,null,null,""]
["S",3,"S",0,1,9,1,0,0,0,0,"F","Serviço","Serviço","1.9.1.1.","SINAPI",94559,"JANELA DE AÇO BASCULANTE, FIXAÇÃO COM ARGAMASSA, SEM VIDROS, PADRONIZADA. AF_07/2016","M2",45.9,null,null,null,"Referência: AGETOP - 180404"]
[3,{"$f":"IF(OR(C185=\"s\",C185=0),OFFSET(B185,-1,0),C185)","v":3},{"$f":"IF(OFFSET(C185,-1,0)=\"L\",1,IF(OFFSET(C185,-1,0)=1,2,IF(OR(A185=\"s\",A185=0),\"S\",IF(AND(OFFSET(C185,-1,0)=2,A185=4),3,IF(AND(OR(OFFSET(C185,-1,0)=\"s\",OFFSET(C185,-1,0)=0),A185<>\"s\",A185>OFFSET(B185,-1,0)),OFFSET(B185,-1,0),A185)))))","v":3},{"$f":"IF(OR(C185=\"S\",C185=0),0,IF(ISERROR(K185),J185,SMALL(J185:K185,1)))","v":2},{"$f":"IF($C185=1,OFFSET(E185,-1,0)+1,OFFSET(E185,-1,0))","v":1},{"$f":"IF($C185=1,0,IF($C185=2,OFFSET(F185,-1,0)+1,OFFSET(F185,-1,0)))","v":9},{"$f":"IF(AND($C185<=2,$C185<>0),0,IF($C185=3,OFFSET(G185,-1,0)+1,OFFSET(G185,-1,0)))","v":2},{"$f":"IF(AND($C185<=3,$C185<>0),0,IF($C185=4,OFFSET(H185,-1,0)+1,OFFSET(H185,-1,0)))","v":0},{"$f":"IF(AND($C185<=4,$C185<>0),0,IF(AND($C185=\"S\",$W185>0),OFFSET(I185,-1,0)+1,OFFSET(I185,-1,0)))","v":0},2,14,"F","Nível 3","Nível 3","1.9.2.","SINAPI",null,"ESCADAS E RAMPAS","-",null,null,null,null,""]
["S",3,"S",0,1,9,2,0,0,0,0,"F","Serviço","Serviço","1.9.2.1.","COMPOSIÇÃO","COMP 084_SEE","GUARDA-CORPO COM CORRIMÃO - SEDUC","M",82,null,null,null,""]
[2,{"$f":"IF(OR(C187=\"s\",C187=0),OFFSET(B187,-1,0),C187)","v":2},{"$f":"IF(OFFSET(C187,-1,0)=\"L\",1,IF(OFFSET(C187,-1,0)=1,2,IF(OR(A187=\"s\",A187=0),\"S\",IF(AND(OFFSET(C187,-1,0)=2,A187=4),3,IF(AND(OR(OFFSET(C187,-1,0)=\"s\",OFFSET(C187,-1,0)=0),A187<>\"s\",A187>OFFSET(B187,-1,0)),OFFSET(B187,-1,0),A187)))))","v":2},{"$f":"IF(OR(C187=\"S\",C187=0),0,IF(ISERROR(K187),J187,SMALL(J187:K187,1)))","v":3},{"$f":"IF($C187=1,OFFSET(E187,-1,0)+1,OFFSET(E187,-1,0))","v":1},{"$f":"IF($C187=1,0,IF($C187=2,OFFSET(F187,-1,0)+1,OFFSET(F187,-1,0)))","v":10},{"$f":"IF(AND($C187<=2,$C187<>0),0,IF($C187=3,OFFSET(G187,-1,0)+1,OFFSET(G187,-1,0)))","v":0},{"$f":"IF(AND($C187<=3,$C187<>0),0,IF($C187=4,OFFSET(H187,-1,0)+1,OFFSET(H187,-1,0)))","v":0},{"$f":"IF(AND($C187<=4,$C187<>0),0,IF(AND($C187=\"S\",$W187>0),OFFSET(I187,-1,0)+1,OFFSET(I187,-1,0)))","v":0},30,3,"F","Nível 2","Nível 2","1.10.",null,null,"VIDROS","-",null,null,null,null,""]
[{"$f":"CHOOSE(1+LOG(1+2*(ORÇAMENTO.Nivel=\"Nível 1\")+4*(ORÇAMENTO.Nivel=\"Nível 2\")+8*(ORÇAMENTO.Nivel=\"Nível 3\")+16*(ORÇAMENTO.Nivel=\"Nível 4\")+32*(ORÇAMENTO.Nivel=\"Serviço\"),2),0,1,2,3,4,\"S\")","v":3},{"$f":"IF(OR(C188=\"s\",C188=0),OFFSET(B188,-1,0),C188)","v":3},{"$f":"IF(OFFSET(C188,-1,0)=\"L\",1,IF(OFFSET(C188,-1,0)=1,2,IF(OR(A188=\"s\",A188=0),\"S\",IF(AND(OFFSET(C188,-1,0)=2,A188=4),3,IF(AND(OR(OFFSET(C188,-1,0)=\"s\",OFFSET(C188,-1,0)=0),A188<>\"s\",A188>OFFSET(B188,-1,0)),OFFSET(B188,-1,0),A188)))))","v":3},{"$f":"IF(OR(C188=\"S\",C188=0),0,IF(ISERROR(K188),J188,SMALL(J188:K188,1)))","v":2},{"$f":"IF($C188=1,OFFSET(E188,-1,0)+1,OFFSET(E188,-1,0))","v":1},{"$f":"IF($C188=1,0,IF($C188=2,OFFSET(F188,-1,0)+1,OFFSET(F188,-1,0)))","v":10},{"$f":"IF(AND($C188<=2,$C188<>0),0,IF($C188=3,OFFSET(G188,-1,0)+1,OFFSET(G188,-1,0)))","v":1},{"$f":"IF(AND($C188<=3,$C188<>0),0,IF($C188=4,OFFSET(H188,-1,0)+1,OFFSET(H188,-1,0)))","v":0},{"$f":"IF(AND($C188<=4,$C188<>0),0,IF(AND($C188=\"S\",$W188>0),OFFSET(I188,-1,0)+1,OFFSET(I188,-1,0)))","v":0},2,9,"F","Nível 3","Nível 3","1.10.1.","SINAPI",null,"BLOCO 03","-",null,null,null,null,""]
[{"$f":"CHOOSE(1+LOG(1+2*(ORÇAMENTO.Nivel=\"Nível 1\")+4*(ORÇAMENTO.Nivel=\"Nível 2\")+8*(ORÇAMENTO.Nivel=\"Nível 3\")+16*(ORÇAMENTO.Nivel=\"Nível 4\")+32*(ORÇAMENTO.Nivel=\"Serviço\"),2),0,1,2,3,4,\"S\")","v":"S"},3,"S",0,1,10,1,0,0,0,0,"F","Serviço","Serviço","1.10.1.1.","SINAPI",72117,"VIDRO LISO COMUM TRANSPARENTE, ESPESSURA 4MM","M2",45.9,null,null,null,"Referência: AGETOP - 190102"]
[2,2,2,3,1,11,0,0,0,27,3,"F","Nível 2","Nível 2","1.11.",null,null,"REVESTIMENTO DE PAREDE","-",null,null,null,null,""]
[{"$f":"CHOOSE(1+LOG(1+2*(ORÇAMENTO.Nivel=\"Nível 1\")+4*(ORÇAMENTO.Nivel=\"Nível 2\")+8*(ORÇAMENTO.Nivel=\"Nível 3\")+16*(ORÇAMENTO.Nivel=\"Nível 4\")+32*(ORÇAMENTO.Nivel=\"Serviço\"),2),0,1,2,3,4,\"S\")","v":3},{"$f":"IF(OR(C191=\"s\",C191=0),OFFSET(B191,-1,0),C191)","v":3},{"$f":"IF(OFFSET(C191,-1,0)=\"L\",1,IF(OFFSET(C191,-1,0)=1,2,IF(OR(A191=\"s\",A191=0),\"S\",IF(AND(OFFSET(C191,-1,0)=2,A191=4),3,IF(AND(OR(OFFSET(C191,-1,0)=\"s\",OFFSET(C191,-1,0)=0),A191<>\"s\",A191>OFFSET(B191,-1,0)),OFFSET(B191,-1,0),A191)))))","v":3},{"$f":"IF(OR(C191=\"S\",C191=0),0,IF(ISERROR(K191),J191,SMALL(J191:K191,1)))","v":2},{"$f":"IF($C191=1,OFFSET(E191,-1,0)+1,OFFSET(E191,-1,0))","v":1},{"$f":"IF($C191=1,0,IF($C191=2,OFFSET(F191,-1,0)+1,OFFSET(F191,-1,0)))","v":11},{"$f":"IF(AND($C191<=2,$C191<>0),0,IF($C191=3,OFFSET(G191,-1,0)+1,OFFSET(G191,-1,0)))","v":1},{"$f":"IF(AND($C191<=3,$C191<>0),0,IF($C191=4,OFFSET(H191,-1,0)+1,OFFSET(H191,-1,0)))","v":0},{"$f":"IF(AND($C191<=4,$C191<>0),0,IF(AND($C191=\"S\",$W191>0),OFFSET(I191,-1,0)+1,OFFSET(I191,-1,0)))","v":0},2,6,"F","Nível 3","Nível 3","1.11.1.","SINAPI",null,"BARRACÃO DE EVENTOS","-",null,null,null,null,""]
["S",3,"S",0,1,11,1,0,0,0,0,"F","Serviço","Serviço","1.11.1.1.","SINAPI",87547,"MASSA ÚNICA, PARA RECEBIMENTO DE PINTURA, EM ARGAMASSA TRAÇO 1:2:8, PREPARO MECÂNICO COM BETONEIRA 400L, APLICADA MANUALMENTE EM FACES INTERNAS DE PAREDES, ESPESSURA DE 10MM, COM EXECUÇÃO DE TALISCAS. AF_06/2014","M2",189.94,null,null,null,""]
[2,2,2,8,1,12,0,0,0,24,8,"F","Nível 2","Nível 2","1.12.",null,null,"REVESTIMENTO DE PISO","-",null,null,null,null,""]
[3,3,3,3,1,12,1,0,0,7,3,"F","Nível 3","Nível 3","1.12.1.","SINAPI",null,"BARRACÃO DE EVENTOS","-",null,null,null,null,""]
["S",3,"S",0,1,12,1,0,0,0,0,"F","Serviço","Serviço","1.12.1.1.","SINAPI",84191,"PISO EM GRANILITE, MARMORITE OU GRANITINA ESPESSURA 8 MM, INCLUSO JUNTAS DE DILATACAO PLASTICAS","M2",327.69060000000002,null,null,null,"Referência: AGETOP - 221101"]
["S",3,"S",0,1,12,1,0,0,0,0,"F","Serviço","Serviço","1.12.1.2.","AGETOP",221104,"RASPAGEM E APLICAÇÃO RESINA ACRÍLICA DUAS DEMÃOS","m2    ",327.69060000000002,null,null,null,""]
[3,3,3,2,1,12,2,0,0,4,2,"F","Nível 3","Nível 3","1.12.2.","SINAPI",null,"PISO TÁTIL","-",null,null,null,null,""]
["S",3,"S",0,1,12,2,0,0,0,0,"F","Serviço","Serviço","1.12.2.1.","AGETOP",221126,"PISO DE LADRILHO HIDRÁULICO COLORIDO MODELO TÁTIL ( ALERTA OU DIRECIONAL) SEM LASTRO","m2    ",130.13999999999999,null,null,null,""]
[3,3,3,2,1,12,3,0,0,2,{"$error":"#N/A"},"F","Nível 3","Nível 3","1.12.3.","SINAPI",null,"PASSEIO","-",null,null,null,null,""]
["S",3,"S",0,1,12,3,0,0,0,0,"F","Serviço","Serviço","1.12.3.1.","AGETOP",220102,"PISO CONCRETO DESEMPENADO ESPESSURA = 5 CM  1:2,5:3,5","m2    ",699.77,null,null,null,""]
[2,{"$f":"IF(OR(C201=\"s\",C201=0),OFFSET(B201,-1,0),C201)","v":2},{"$f":"IF(OFFSET(C201,-1,0)=\"L\",1,IF(OFFSET(C201,-1,0)=1,2,IF(OR(A201=\"s\",A201=0),\"S\",IF(AND(OFFSET(C201,-1,0)=2,A201=4),3,IF(AND(OR(OFFSET(C201,-1,0)=\"s\",OFFSET(C201,-1,0)=0),A201<>\"s\",A201>OFFSET(B201,-1,0)),OFFSET(B201,-1,0),A201)))))","v":2},{"$f":"IF(OR(C201=\"S\",C201=0),0,IF(ISERROR(K201),J201,SMALL(J201:K201,1)))","v":4},{"$f":"IF($C201=1,OFFSET(E201,-1,0)+1,OFFSET(E201,-1,0))","v":1},{"$f":"IF($C201=1,0,IF($C201=2,OFFSET(F201,-1,0)+1,OFFSET(F201,-1,0)))","v":13},{"$f":"IF(AND($C201<=2,$C201<>0),0,IF($C201=3,OFFSET(G201,-1,0)+1,OFFSET(G201,-1,0)))","v":0},{"$f":"IF(AND($C201<=3,$C201<>0),0,IF($C201=4,OFFSET(H201,-1,0)+1,OFFSET(H201,-1,0)))","v":0},{"$f":"IF(AND($C201<=4,$C201<>0),0,IF(AND($C201=\"S\",$W201>0),OFFSET(I201,-1,0)+1,OFFSET(I201,-1,0)))","v":0},16,4,"F","Nível 2","Nível 2","1.13.",null,null,"ADMINISTRAÇÃO","-",null,null,null,null,""]
[3,3,3,3,1,13,1,0,0,3,6,"F","Nível 3","Nível 3","1.13.1.",null,null,"MENSALISTAS","-",null,null,null,null,""]
["S",3,"S",0,1,13,1,0,0,0,0,"F","Serviço","Serviço","1.13.1.1.","SINAPI",90778,"ENGENHEIRO CIVIL DE OBRA PLENO COM ENCARGOS COMPLEMENTARES","H",132,null,null,null,"Referência: AGETOP - 250101"]
["S",3,"S",0,1,13,1,0,0,{"$f":"IF(OR($C204=\"S\",$C204=0),0,MATCH(0,OFFSET($D204,1,$C204,ROW($C$387)-ROW($C204)),0))","v":0},{"$f":"IF(OR($C204=\"S\",$C204=0),0,MATCH(OFFSET($D204,0,$C204)+1,OFFSET($D204,1,$C204,ROW($C$387)-ROW($C204)),0))","v":0},"F","Serviço","Serviço","1.13.1.2.","SINAPI",90776,"ENCARREGADO GERAL COM ENCARGOS COMPLEMENTARES","H",660,null,null,null,"Referência: AGETOP - 250103"]
[{"$f":"CHOOSE(1+LOG(1+2*(ORÇAMENTO.Nivel=\"Nível 1\")+4*(ORÇAMENTO.Nivel=\"Nível 2\")+8*(ORÇAMENTO.Nivel=\"Nível 3\")+16*(ORÇAMENTO.Nivel=\"Nível 4\")+32*(ORÇAMENTO.Nivel=\"Serviço\"),2),0,1,2,3,4,\"S\")","v":2},2,2,10,1,14,0,0,0,12,10,"F","Nível 2","Nível 2","1.14.",null,null,"PINTURA","-",null,null,null,null,""]
[3,3,3,2,1,14,1,0,0,9,2,"F","Nível 3","Nível 3","1.14.1.","SINAPI",null,"BLOCO 03","-",null,null,null,null,""]
["S",3,"S",0,1,14,1,0,0,0,0,"F","Serviço","Serviço","1.14.1.1.","SINAPI","74145/1","PINTURA ESMALTE FOSCO, DUAS DEMAOS, SOBRE SUPERFICIE METALICA, INCLUSO UMA DEMAO DE FUNDO ANTICORROSIVO. UTILIZACAO DE REVOLVER ( AR-COMPRIMIDO).","M2",91.8,null,null,null,"Referência: AGETOP - 261602"]
[3,3,3,7,1,14,2,0,0,7,47,"F","Nível 3","Nível 3","1.14.2.","SINAPI",null,"PINTURA GERAL","-",null,null,null,null,""]
["S",3,"S",0,1,14,2,0,0,0,0,"F","Serviço","Serviço","1.14.2.1.","AGETOP",260104,"REMOCAO DE PINTURA ANTIGA A LATEX","m2    ",1053.8399999999999,null,null,null,""]
["S",3,"S",0,1,14,2,0,0,0,0,"F","Serviço","Serviço","1.14.2.2.","SINAPI",88497,"APLICAÇÃO E LIXAMENTO DE MASSA LÁTEX EM PAREDES, DUAS DEMÃOS. AF_06/2014","M2",1053.8399999999999,null,null,null,"Referência: AGETOP - 261300"]
["S",3,"S",0,1,14,2,0,0,0,0,"F","Serviço","Serviço","1.14.2.3.","AGETOP",261550,"PINT.ESMALTE SINT.PAREDES - 2 DEM.C/SELADOR","m2    ",1174.8499999999999,null,null,null,""]
["S",3,"S",0,1,14,2,0,0,0,0,"F","Serviço","Serviço","1.14.2.4.","SINAPI",88489,"APLICAÇÃO MANUAL DE PINTURA COM TINTA LÁTEX ACRÍLICA EM PAREDES, DUAS DEMÃOS. AF_06/2014","M2",1881.08,null,null,null,"Referência: AGETOP - 261001"]
["S",3,"S",0,1,14,2,0,0,0,0,"F","Serviço","Serviço","1.14.2.5.","AGETOP",260105,"REMOCAO DE PINTURA ANTIGA A OLEO OU ESMALTE","m2    ",257.8,null,null,null,""]
[{"$f":"CHOOSE(1+LOG(1+2*(ORÇAMENTO.Nivel=\"Nível 1\")+4*(ORÇAMENTO.Nivel=\"Nível 2\")+8*(ORÇAMENTO.Nivel=\"Nível 3\")+16*(ORÇAMENTO.Nivel=\"Nível 4\")+32*(ORÇAMENTO.Nivel=\"Serviço\"),2),0,1,2,3,4,\"S\")","v":"S"},{"$f":"IF(OR(C214=\"s\",C214=0),OFFSET(B214,-1,0),C214)","v":3},{"$f":"IF(OFFSET(C214,-1,0)=\"L\",1,IF(OFFSET(C214,-1,0)=1,2,IF(OR(A214=\"s\",A214=0),\"S\",IF(AND(OFFSET(C214,-1,0)=2,A214=4),3,IF(AND(OR(OFFSET(C214,-1,0)=\"s\",OFFSET(C214,-1,0)=0),A214<>\"s\",A214>OFFSET(B214,-1,0)),OFFSET(B214,-1,0),A214)))))","v":"S"},{"$f":"IF(OR(C214=\"S\",C214=0),0,IF(ISERROR(K214),J214,SMALL(J214:K214,1)))","v":0},{"$f":"IF($C214=1,OFFSET(E214,-1,0)+1,OFFSET(E214,-1,0))","v":1},{"$f":"IF($C214=1,0,IF($C214=2,OFFSET(F214,-1,0)+1,OFFSET(F214,-1,0)))","v":14},{"$f":"IF(AND($C214<=2,$C214<>0),0,IF($C214=3,OFFSET(G214,-1,0)+1,OFFSET(G214,-1,0)))","v":2},{"$f":"IF(AND($C214<=3,$C214<>0),0,IF($C214=4,OFFSET(H214,-1,0)+1,OFFSET(H214,-1,0)))","v":0},{"$f":"IF(AND($C214<=4,$C214<>0),0,IF(AND($C214=\"S\",$W214>0),OFFSET(I214,-1,0)+1,OFFSET(I214,-1,0)))","v":0},0,0,"F","Serviço","Serviço","1.14.2.6.","SINAPI","73924/3","PINTURA ESMALTE FOSCO, DUAS DEMAOS, SOBRE SUPERFICIE METALICA","M2",257.8,null,null,null,"Referência: AGETOP - 261503"]
[2,2,2,2,1,15,0,0,0,2,155,"F","Nível 2","Nível 2","1.15.",null,null,"DIVERSOS","-",null,null,null,null,""]
["S",2,"S",0,1,15,0,0,0,0,0,"F","Serviço","Serviço","1.15.0.1.","AGETOP",270501,"LIMPEZA FINAL DE OBRA - (OBRAS CIVIS)","m2    ",150,null,null,null,""]
[1,1,1,170,2,0,0,0,0,170,{"$error":"#N/A"},"F","Nível 1","Nível 1","2.","SINAPI",null,"BLOCO SANITÁRIO PADRÃO SEDUC 2013","-",null,null,null,null,""]
[2,2,2,2,2,1,0,0,0,169,2,"F","Nível 2","Nível 2","2.1.","SINAPI",null,"SERVIÇOS PRELIMINARES","-",null,null,null,null,""]
["S",2,"S",0,2,1,0,0,0,0,0,"F","Serviço","Serviço","2.1.0.1.","AGETOP",20701,"LOCAÇÃO DA OBRA, EXECUÇÃO DE GABARITO SEM REAPROVEITAMENTO, INCLUSO PINTURA (FACE INTERNA DO RIPÃO 15CM) E PIQUETE COM TESTEMUNHA","m2    ",48.43,null,null,null,""]
[2,2,2,3,2,2,0,0,0,167,3,"F","Nível 2","Nível 2","2.2.",null,null,"TRANSPORTES","-",null,null,null,null,""]
["S",2,"S",0,2,2,0,0,0,0,0,"F","Serviço","Serviço","2.2.0.1.","SINAPI",72900,"TRANSPORTE DE ENTULHO COM CAMINHAO BASCULANTE 6 M3, RODOVIA PAVIMENTADA, DMT 0,5 A 1,0 KM","M3",3.39,null,null,null,""]
["S",2,"S",0,2,2,0,0,0,0,0,"F","Serviço","Serviço","2.2.0.2.","SINAPI",72897,"CARGA MANUAL DE ENTULHO EM CAMINHAO BASCULANTE 6 M3","M3",3.39,null,null,null,""]
[2,2,2,3,2,3,0,0,0,164,3,"F","Nível 2","Nível 2","2.3.",null,null,"SERVIÇO EM TERRA","-",null,null,null,null,""]
["S",2,"S",0,2,3,0,0,0,0,0,"F","Serviço","Serviço","2.3.0.1.","AGETOP",41140,"REGULARIZAÇÃO DO TERRENO SEM APILOAMENTO COM TRANSPORTE MANUAL DA TERRA ESCAVADA ","m2    ",48.43,null,null,null,""]
["S",2,"S",0,2,3,0,0,0,0,0,"F","Serviço","Serviço","2.3.0.2.","SINAPI","74005/1","COMPACTACAO MECANICA, SEM CONTROLE DO GC (C/COMPACTADOR PLACA 400 KG)","M3",9.68,null,null,null,"Referência: AGETOP - 41009"]
[2,2,2,13,2,4,0,0,0,161,13,"F","Nível 2","Nível 2","2.4.",null,null,"FUNDAÇÕES E SONDAGENS","-",null,null,null,null,""]
[3,3,3,4,2,4,1,0,0,12,4,"F","Nível 3","Nível 3","2.4.1.","SINAPI",null,"ESTACAS","-",null,null,null,null,""]
["S",3,"S",0,2,4,1,0,0,0,0,"F","Serviço","Serviço","2.4.1.1.","SINAPI",98230,"ESTACA BROCA DE CONCRETO, DIÂMETRO DE 30 CM, PROFUNDIDADE DE ATÉ 3 M, ESCAVAÇÃO MANUAL COM TRADO CONCHA, NÃO ARMADA. AF_03/2018","M",36.5,null,null,null,"Referência: AGETOP - 50302"]
["S",3,"S",0,2,4,1,0,0,0,0,"F","Serviço","Serviço","2.4.1.2.","SINAPI",95576,"MONTAGEM DE ARMADURA LONGITUDINAL/TRANSVERSAL DE ESTACAS DE SEÇÃO CIRCULAR, DIÂMETRO = 8,0 MM. AF_11/2016","KG",21.27,null,null,null,"Referência: AGETOP - 52004"]
["S",3,"S",0,2,4,1,0,0,0,0,"F","Serviço","Serviço","2.4.1.3.","SINAPI",95583,"MONTAGEM DE ARMADURA TRANSVERSAL DE ESTACAS DE SEÇÃO CIRCULAR, DIÂMETRO = 5,0 MM. AF_11/2016","KG",10.9,null,null,null,"Referência: AGETOP - 52014"]
[3,3,3,8,2,4,2,0,0,8,24,"F","Nível 3","Nível 3","2.4.2.","SINAPI",null,"BLOCOS","-",null,null,null,null,""]
["S",3,"S",0,2,4,2,0,0,0,0,"F","Serviço","Serviço","2.4.2.1.","SINAPI",96522,"ESCAVAÇÃO MANUAL PARA BLOCO DE COROAMENTO OU SAPATA, SEM PREVISÃO DE FÔRMA. AF_06/2017","M3",1.92,null,null,null,"Referência: AGETOP - 50901"]
["S",3,"S",0,2,4,2,0,0,0,0,"F","Serviço","Serviço","2.4.2.2.","SINAPI",96619,"LASTRO DE CONCRETO MAGRO, APLICADO EM BLOCOS DE COROAMENTO OU SAPATAS, ESPESSURA DE 5 CM. AF_08/2017","M2",0.16,null,null,null,""]
["S",3,"S",0,2,4,2,0,0,0,0,"F","Serviço","Serviço","2.4.2.3.","SINAPI",96544,"ARMAÇÃO DE BLOCO, VIGA BALDRAME OU SAPATA UTILIZANDO AÇO CA-50 DE 6,3 MM - MONTAGEM. AF_06/2017","KG",8.18,null,null,null,"Referência: AGETOP - 52003"]
["S",3,"S",0,2,4,2,0,0,0,0,"F","Serviço","Serviço","2.4.2.4.","SINAPI",96545,"ARMAÇÃO DE BLOCO, VIGA BALDRAME OU SAPATA UTILIZANDO AÇO CA-50 DE 8 MM - MONTAGEM. AF_06/2017","KG",3.63,null,null,null,"Referência: AGETOP - 52004"]
["S",3,"S",0,2,4,2,0,0,0,0,"F","Serviço","Serviço","2.4.2.5.","SINAPI",96546,"ARMAÇÃO DE BLOCO, VIGA BALDRAME OU SAPATA UTILIZANDO AÇO CA-50 DE 10 MM - MONTAGEM. AF_06/2017","KG",7.27,null,null,null,"Referência: AGETOP - 52005"]
["S",3,"S",0,2,4,2,0,0,0,0,"F","Serviço","Serviço","2.4.2.6.","SINAPI",94964,"CONCRETO FCK = 20MPA, TRAÇO 1:2,7:3 (CIMENTO/ AREIA MÉDIA/ BRITA 1)  - PREPARO MECÂNICO COM BETONEIRA 400 L. AF_07/2016","M3",1.76,null,null,null,""]
["S",3,"S",0,2,4,2,0,0,0,0,"F","Serviço","Serviço","2.4.2.7.","SINAPI","74157/4","LANCAMENTO/APLICACAO MANUAL DE CONCRETO EM FUNDACOES","M3",1.76,null,null,null,"Referência: AGETOP - 51026"]
[2,2,2,23,2,5,0,0,0,148,23,"F","Nível 2","Nível 2","2.5.",null,null,"ESTRUTURA","-",null,null,null,null,""]
[3,3,3,9,2,5,1,0,0,22,9,"F","Nível 3","Nível 3","2.5.1.","SINAPI",null,"VIGAS BALDRAMES","-",null,null,null,null,""]
["S",3,"S",0,2,5,1,0,0,0,0,"F","Serviço","Serviço","2.5.1.1.","SINAPI",96527,"ESCAVAÇÃO MANUAL DE VALA PARA VIGA BALDRAME, COM PREVISÃO DE FÔRMA. AF_06/2017","M3",4.5599999999999996,null,null,null,"Referência: AGETOP - 40101"]
["S",3,"S",0,2,5,1,0,0,0,0,"F","Serviço","Serviço","2.5.1.2.","SINAPI",96536,"FABRICAÇÃO, MONTAGEM E DESMONTAGEM DE FÔRMA PARA VIGA BALDRAME, EM MADEIRA SERRADA, E=25 MM, 4 UTILIZAÇÕES. AF_06/2017","M2",26.11,null,null,null,"Referência: AGETOP - 51009"]
["S",3,"S",0,2,5,1,0,0,0,0,"F","Serviço","Serviço","2.5.1.3.","SINAPI",96545,"ARMAÇÃO DE BLOCO, VIGA BALDRAME OU SAPATA UTILIZANDO AÇO CA-50 DE 8 MM - MONTAGEM. AF_06/2017","KG",46.5,null,null,null,"Referência: AGETOP - 52004"]
["S",3,"S",0,2,5,1,0,0,0,0,"F","Serviço","Serviço","2.5.1.4.","SINAPI",96546,"ARMAÇÃO DE BLOCO, VIGA BALDRAME OU SAPATA UTILIZANDO AÇO CA-50 DE 10 MM - MONTAGEM. AF_06/2017","KG",45,null,null,null,"Referência: AGETOP - 52005"]
["S",3,"S",0,2,5,1,0,0,0,0,"F","Serviço","Serviço","2.5.1.5.","SINAPI",96543,"ARMAÇÃO DE BLOCO, VIGA BALDRAME E SAPATA UTILIZANDO AÇO CA-60 DE 5 MM - MONTAGEM. AF_06/2017","KG",35.770000000000003,null,null,null,"Referência: AGETOP - 52014"]
["S",3,"S",0,2,5,1,0,0,0,0,"F","Serviço","Serviço","2.5.1.6.","SINAPI",94964,"CONCRETO FCK = 20MPA, TRAÇO 1:2,7:3 (CIMENTO/ AREIA MÉDIA/ BRITA 1)  - PREPARO MECÂNICO COM BETONEIRA 400 L. AF_07/2016","M3",1.95,null,null,null,""]
["S",3,"S",0,2,5,1,0,0,0,0,"F","Serviço","Serviço","2.5.1.7.","SINAPI",92873,"LANÇAMENTO COM USO DE BALDES, ADENSAMENTO E ACABAMENTO DE CONCRETO EM ESTRUTURAS. AF_12/2015","M3",1.95,null,null,null,"Referência: AGETOP - 60801"]
["S",3,"S",0,2,5,1,0,0,0,0,"F","Serviço","Serviço","2.5.1.8.","SINAPI",96995,"REATERRO MANUAL APILOADO COM SOQUETE. AF_10/2017","M3",2.6099999999999994,null,null,null,"Referência: AGETOP - 40902"]
[3,3,3,6,2,5,2,0,0,13,6,"F","Nível 3","Nível 3","2.5.2.","SINAPI",null,"PILARES","-",null,null,null,null,""]
["S",3,"S",0,2,5,2,0,0,0,0,"F","Serviço","Serviço","2.5.2.1.","SINAPI",92418,"MONTAGEM E DESMONTAGEM DE FÔRMA DE PILARES RETANGULARES E ESTRUTURAS SIMILARES COM ÁREA MÉDIA DAS SEÇÕES MENOR OU IGUAL A 0,25 M², PÉ-DIREITO SIMPLES, EM CHAPA DE MADEIRA COMPENSADA RESINADA, 4 UTILIZAÇÕES. AF_12/2015","M2",38.700000000000003,null,null,null,"Referência: AGETOP - 60209"]
["S",3,"S",0,2,5,2,0,0,0,0,"F","Serviço","Serviço","2.5.2.2.","SINAPI",92778,"ARMAÇÃO DE PILAR OU VIGA DE UMA ESTRUTURA CONVENCIONAL DE CONCRETO ARMADO EM UMA EDIFICAÇÃO TÉRREA OU SOBRADO UTILIZANDO AÇO CA-50 DE 10,0 MM - MONTAGEM. AF_12/2015","KG",176.14,null,null,null,"Referência: AGETOP - 60305"]
["S",3,"S",0,2,5,2,0,0,0,0,"F","Serviço","Serviço","2.5.2.3.","SINAPI",92775,"ARMAÇÃO DE PILAR OU VIGA DE UMA ESTRUTURA CONVENCIONAL DE CONCRETO ARMADO EM UMA EDIFICAÇÃO TÉRREA OU SOBRADO UTILIZANDO AÇO CA-60 DE 5,0 MM - MONTAGEM. AF_12/2015","KG",61.39,null,null,null,"Referência: AGETOP - 60314"]
["S",3,"S",0,2,5,2,0,0,0,0,"F","Serviço","Serviço","2.5.2.4.","SINAPI",94964,"CONCRETO FCK = 20MPA, TRAÇO 1:2,7:3 (CIMENTO/ AREIA MÉDIA/ BRITA 1)  - PREPARO MECÂNICO COM BETONEIRA 400 L. AF_07/2016","M3",1.93,null,null,null,""]
["S",3,"S",0,2,5,2,0,0,0,0,"F","Serviço","Serviço","2.5.2.5.","SINAPI",92873,"LANÇAMENTO COM USO DE BALDES, ADENSAMENTO E ACABAMENTO DE CONCRETO EM ESTRUTURAS. AF_12/2015","M3",1.93,null,null,null,"Referência: AGETOP - 60801"]
[3,3,3,7,2,5,3,0,0,7,{"$error":"#N/A"},"F","Nível 3","Nível 3","2.5.3.","SINAPI",null,"VIGAS DE COBERTURA","-",null,null,null,null,""]
["S",3,"S",0,2,5,3,0,0,0,0,"F","Serviço","Serviço","2.5.3.1.","SINAPI",96536,"FABRICAÇÃO, MONTAGEM E DESMONTAGEM DE FÔRMA PARA VIGA BALDRAME, EM MADEIRA SERRADA, E=25 MM, 4 UTILIZAÇÕES. AF_06/2017","M2",26.11,null,null,null,"Referência: AGETOP - 51009"]
["S",3,"S",0,2,5,3,0,0,0,0,"F","Serviço","Serviço","2.5.3.2.","SINAPI",96545,"ARMAÇÃO DE BLOCO, VIGA BALDRAME OU SAPATA UTILIZANDO AÇO CA-50 DE 8 MM - MONTAGEM. AF_06/2017","KG",46.5,null,null,null,"Referência: AGETOP - 52004"]
["S",3,"S",0,2,5,3,0,0,0,0,"F","Serviço","Serviço","2.5.3.3.","SINAPI",96546,"ARMAÇÃO DE BLOCO, VIGA BALDRAME OU SAPATA UTILIZANDO AÇO CA-50 DE 10 MM - MONTAGEM. AF_06/2017","KG",45,null,null,null,"Referência: AGETOP - 52005"]
["S",3,"S",0,2,5,3,0,0,0,0,"F","Serviço","Serviço","2.5.3.4.","SINAPI",96543,"ARMAÇÃO DE BLOCO, VIGA BALDRAME E SAPATA UTILIZANDO AÇO CA-60 DE 5 MM - MONTAGEM. AF_06/2017","KG",35.770000000000003,null,null,null,"Referência: AGETOP - 52014"]
["S",3,"S",0,2,5,3,0,0,0,0,"F","Serviço","Serviço","2.5.3.5.","SINAPI",94964,"CONCRETO FCK = 20MPA, TRAÇO 1:2,7:3 (CIMENTO/ AREIA MÉDIA/ BRITA 1)  - PREPARO MECÂNICO COM BETONEIRA 400 L. AF_07/2016","M3",1.95,null,null,null,""]
["S",3,"S",0,2,5,3,0,0,0,0,"F","Serviço","Serviço","2.5.3.6.","SINAPI",92873,"LANÇAMENTO COM USO DE BALDES, ADENSAMENTO E ACABAMENTO DE CONCRETO EM ESTRUTURAS. AF_12/2015","M3",1.95,null,null,null,"Referência: AGETOP - 60801"]
[2,2,2,24,2,6,0,0,0,125,24,"F","Nível 2","Nível 2","2.6.",null,null,"INSTALAÇÕES ELÉTRICAS","-",null,null,null,null,""]
["S",2,"S",0,2,6,0,0,0,0,0,"F","Serviço","Serviço","2.6.0.1.","SINAPI",91182,"FIXAÇÃO DE TUBOS HORIZONTAIS DE PPR DIÂMETROS MENORES OU IGUAIS A 40 MM COM ABRAÇADEIRA METÁLICA FLEXÍVEL 18 MM, FIXADA DIRETAMENTE NA LAJE. AF_05/2015","M",10,null,null,null,""]
["S",2,"S",0,2,6,0,0,0,0,0,"F","Serviço","Serviço","2.6.0.2.","SINAPI",95541,"FIXAÇÃO UTILIZANDO PARAFUSO E BUCHA DE NYLON, SOMENTE MÃO DE OBRA. AF_10/2016","UN",24,null,null,null,""]
["S",2,"S",0,2,6,0,0,0,0,0,"F","Serviço","Serviço","2.6.0.3.","SINAPI",91927,"CABO DE COBRE FLEXÍVEL ISOLADO, 2,5 MM², ANTI-CHAMA 0,6/1,0 KV, PARA CIRCUITOS TERMINAIS - FORNECIMENTO E INSTALAÇÃO. AF_12/2015","M",100,null,null,null,"Referência: AGETOP - 70581"]
["S",2,"S",0,2,6,0,0,0,0,0,"F","Serviço","Serviço","2.6.0.4.","SINAPI",91931,"CABO DE COBRE FLEXÍVEL ISOLADO, 6 MM², ANTI-CHAMA 0,6/1,0 KV, PARA CIRCUITOS TERMINAIS - FORNECIMENTO E INSTALAÇÃO. AF_12/2015","M",20,null,null,null,"Referência: AGETOP - 70583"]
["S",2,"S",0,2,6,0,0,0,0,0,"F","Serviço","Serviço","2.6.0.5.","SINAPI",92868,"CAIXA RETANGULAR 4\" X 2\" MÉDIA (1,30 M DO PISO), METÁLICA, INSTALADA EM PAREDE - FORNECIMENTO E INSTALAÇÃO. AF_12/2015","UN",5,null,null,null,"Referência: AGETOP - 70691"]
["S",2,"S",0,2,6,0,0,0,{"$f":"IF(OR($C268=\"S\",$C268=0),0,MATCH(0,OFFSET($D268,1,$C268,ROW($C$387)-ROW($C268)),0))","v":0},{"$f":"IF(OR($C268=\"S\",$C268=0),0,MATCH(OFFSET($D268,0,$C268)+1,OFFSET($D268,1,$C268,ROW($C$387)-ROW($C268)),0))","v":0},"F","Serviço","Serviço","2.6.0.6.","SINAPI",92865,"CAIXA OCTOGONAL 4\" X 4\", METÁLICA, INSTALADA EM LAJE - FORNECIMENTO E INSTALAÇÃO. AF_12/2015","UN",7,null,null,null,"Referência: AGETOP - 70682"]
["S",2,"S",0,2,6,0,0,0,0,0,"F","Serviço","Serviço","2.6.0.7.","SINAPI",83446,"CAIXA DE PASSAGEM 30X30X40 COM TAMPA E DRENO BRITA","UN",1,null,null,null,""]
["S",2,"S",0,2,6,0,0,0,0,0,"F","Serviço","Serviço","2.6.0.8.","SINAPI",91914,"CURVA 90 GRAUS PARA ELETRODUTO, PVC, ROSCÁVEL, DN 25 MM (3/4\"), PARA CIRCUITOS TERMINAIS, INSTALADA EM PAREDE - FORNECIMENTO E INSTALAÇÃO. AF_12/2015","UN",7,null,null,null,""]
["S",2,"S",0,2,6,0,0,0,0,0,"F","Serviço","Serviço","2.6.0.9.","SINAPI",91917,"CURVA 90 GRAUS PARA ELETRODUTO, PVC, ROSCÁVEL, DN 32 MM (1\"), PARA CIRCUITOS TERMINAIS, INSTALADA EM PAREDE - FORNECIMENTO E INSTALAÇÃO. AF_12/2015","UN",3,null,null,null,""]
["S",2,"S",0,2,6,0,0,0,0,0,"F","Serviço","Serviço","2.6.0.10.","SINAPI",93358,"ESCAVAÇÃO MANUAL DE VALA COM PROFUNDIDADE MENOR OU IGUAL A 1,30 M. AF_03/2016","M3",0.51200000000000001,null,null,null,"Referência: AGETOP - 40101"]
["S",2,"S",0,2,6,0,0,0,0,0,"F","Serviço","Serviço","2.6.0.11.","SINAPI",93654,"DISJUNTOR MONOPOLAR TIPO DIN, CORRENTE NOMINAL DE 16A - FORNECIMENTO E INSTALAÇÃO. AF_04/2016","UN",1,null,null,null,""]
["S",2,"S",0,2,6,0,0,0,0,0,"F","Serviço","Serviço","2.6.0.12.","SINAPI",93657,"DISJUNTOR MONOPOLAR TIPO DIN, CORRENTE NOMINAL DE 32A - FORNECIMENTO E INSTALAÇÃO. AF_04/2016","UN",1,null,null,null,""]
["S",2,"S",0,2,6,0,0,0,0,0,"F","Serviço","Serviço","2.6.0.13.","SINAPI",93671,"DISJUNTOR TRIPOLAR TIPO DIN, CORRENTE NOMINAL DE 32A - FORNECIMENTO E INSTALAÇÃO. AF_04/2016","UN",1,null,null,null,"Referência: AGETOP - 71173"]
["S",2,"S",0,2,6,0,0,0,0,0,"F","Serviço","Serviço","2.6.0.14.","SINAPI",91871,"ELETRODUTO RÍGIDO ROSCÁVEL, PVC, DN 25 MM (3/4\"), PARA CIRCUITOS TERMINAIS, INSTALADO EM PAREDE - FORNECIMENTO E INSTALAÇÃO. AF_12/2015","M",30,null,null,null,"Referência: AGETOP - 71201"]
["S",2,"S",0,2,6,0,0,0,0,0,"F","Serviço","Serviço","2.6.0.15.","SINAPI",91872,"ELETRODUTO RÍGIDO ROSCÁVEL, PVC, DN 32 MM (1\"), PARA CIRCUITOS TERMINAIS, INSTALADO EM PAREDE - FORNECIMENTO E INSTALAÇÃO. AF_12/2015","M",6,null,null,null,"Referência: AGETOP - 71202"]
["S",2,"S",0,2,6,0,0,0,0,0,"F","Serviço","Serviço","2.6.0.16.","SINAPI",91953,"INTERRUPTOR SIMPLES (1 MÓDULO), 10A/250V, INCLUINDO SUPORTE E PLACA - FORNECIMENTO E INSTALAÇÃO. AF_12/2015","UN",4,null,null,null,"Referência: AGETOP - 71440"]
["S",2,"S",0,2,6,0,0,0,0,0,"F","Serviço","Serviço","2.6.0.17.","AGETOP",71450,"INTERRUPTOR DIFERENCIAL RESIDUAL (D.R.) BIPOLAR DE 25A-30mA","Un    ",1,null,null,null,""]
["S",2,"S",0,2,6,0,0,0,0,0,"F","Serviço","Serviço","2.6.0.18.","SINAPI",97585,"LUMINÁRIA TIPO CALHA, DE SOBREPOR, COM 2 LÂMPADAS TUBULARES DE 18 W - FORNECIMENTO E INSTALAÇÃO. AF_11/2017","UN",5,null,null,null,""]
["S",2,"S",0,2,6,0,0,0,0,0,"F","Serviço","Serviço","2.6.0.19.","SINAPI",97586,"LUMINÁRIA TIPO CALHA, DE SOBREPOR, COM 2 LÂMPADAS TUBULARES DE 36 W - FORNECIMENTO E INSTALAÇÃO. AF_11/2017","UN",2,null,null,null,""]
["S",2,"S",0,2,6,0,0,0,0,0,"F","Serviço","Serviço","2.6.0.20.","SINAPI",91884,"LUVA PARA ELETRODUTO, PVC, ROSCÁVEL, DN 25 MM (3/4\"), PARA CIRCUITOS TERMINAIS, INSTALADA EM PAREDE - FORNECIMENTO E INSTALAÇÃO. AF_12/2015","UN",10,null,null,null,"Referência: AGETOP - 71741"]
["S",2,"S",0,2,6,0,0,0,0,0,"F","Serviço","Serviço","2.6.0.21.","SINAPI",91885,"LUVA PARA ELETRODUTO, PVC, ROSCÁVEL, DN 32 MM (1\"), PARA CIRCUITOS TERMINAIS, INSTALADA EM PAREDE - FORNECIMENTO E INSTALAÇÃO. AF_12/2015","UN",2,null,null,null,"Referência: AGETOP - 71742"]
["S",2,"S",0,2,6,0,0,0,0,0,"F","Serviço","Serviço","2.6.0.22.","SINAPI",83463,"QUADRO DE DISTRIBUICAO DE ENERGIA EM CHAPA DE ACO GALVANIZADO, PARA 12 DISJUNTORES TERMOMAGNETICOS MONOPOLARES, COM BARRAMENTO TRIFASICO E NEUTRO - FORNECIMENTO E INSTALACAO","UN",1,null,null,null,""]
["S",2,"S",0,2,6,0,0,0,0,0,"F","Serviço","Serviço","2.6.0.23.","SINAPI",91993,"TOMADA ALTA DE EMBUTIR (1 MÓDULO), 2P+T 20 A, INCLUINDO SUPORTE E PLACA - FORNECIMENTO E INSTALAÇÃO. AF_12/2015","UN",1,null,null,null,"Referência: AGETOP - 72585"]
[2,2,2,56,2,7,0,0,0,101,56,"F","Nível 2","Nível 2","2.7.",null,null,"INSTALAÇÕES HIDROSSANITÁRIAS","-",null,null,null,null,""]
[3,3,3,24,2,7,1,0,0,55,24,"F","Nível 3","Nível 3","2.7.1.","SINAPI",null,"PEÇAS E ACESSÓRIOS","-",null,null,null,null,""]
["S",3,"S",0,2,7,1,0,0,0,0,"F","Serviço","Serviço","2.7.1.1.","SINAPI",95470,"VASO SANITARIO SIFONADO CONVENCIONAL COM LOUÇA BRANCA, INCLUSO CONJUNTO DE LIGAÇÃO PARA BACIA SANITÁRIA AJUSTÁVEL - FORNECIMENTO E INSTALAÇÃO. AF_10/2016","UN",7,null,null,null,""]
["S",3,"S",0,2,7,1,0,0,0,0,"F","Serviço","Serviço","2.7.1.2.","AGETOP",80518,"VÁLVULA DE DESCARGA COM SISTEMA PASSANTE EM POLÍMERO - OPÇÃO ECONÔMICA ( ALTA SEGURANÇA)","Un    ",7,null,null,null,""]
["S",3,"S",0,2,7,1,0,0,0,0,"F","Serviço","Serviço","2.7.1.3.","AGETOP",80526,"ASSENTO EM POLIPROPILENO COM SISTEMA DE FECHAMENTO SUAVE PARA VASO SANITÁRIO","Un    ",7,null,null,null,""]
["S",3,"S",0,2,7,1,0,0,0,0,"F","Serviço","Serviço","2.7.1.4.","COMPOSIÇÃO","COMP 209_SEE","TOALHEIRO PLÁSTICO TIPO DISPENSER PARA PAPEL TOALHA INTERFOLHADO","UN ",3,null,null,null,""]
["S",3,"S",0,2,7,1,0,0,0,0,"F","Serviço","Serviço","2.7.1.5.","SINAPI",95544,"PAPELEIRA DE PAREDE EM METAL CROMADO SEM TAMPA, INCLUSO FIXAÇÃO. AF_10/2016","UN",7,null,null,null,""]
["S",3,"S",0,2,7,1,0,0,0,0,"F","Serviço","Serviço","2.7.1.6.","SINAPI",86904,"LAVATÓRIO LOUÇA BRANCA SUSPENSO, 29,5 X 39CM OU EQUIVALENTE, PADRÃO POPULAR - FORNECIMENTO E INSTALAÇÃO. AF_12/2013","UN",1,null,null,null,""]
["S",3,"S",0,2,7,1,0,0,0,0,"F","Serviço","Serviço","2.7.1.7.","SINAPI",86884,"ENGATE FLEXÍVEL EM PLÁSTICO BRANCO, 1/2\" X 30CM - FORNECIMENTO E INSTALAÇÃO. AF_12/2013","UN",5,null,null,null,""]
["S",3,"S",0,2,7,1,0,0,0,0,"F","Serviço","Serviço","2.7.1.8.","SINAPI",86883,"SIFÃO DO TIPO FLEXÍVEL EM PVC 1\u0094 X 1.1/2\u0094 - FORNECIMENTO E INSTALAÇÃO. AF_12/2013","UN",5,null,null,null,""]
["S",3,"S",0,2,7,1,0,0,0,0,"F","Serviço","Serviço","2.7.1.9.","SINAPI",86906,"TORNEIRA CROMADA DE MESA, 1/2\" OU 3/4\", PARA LAVATÓRIO, PADRÃO POPULAR - FORNECIMENTO E INSTALAÇÃO. AF_12/2013","UN",5,null,null,null,""]
["S",3,"S",0,2,7,1,0,0,0,0,"F","Serviço","Serviço","2.7.1.10.","SINAPI",86877,"VÁLVULA EM METAL CROMADO 1.1/2\" X 1.1/2\" PARA TANQUE OU LAVATÓRIO, COM OU SEM LADRÃO - FORNECIMENTO E INSTALAÇÃO. AF_12/2013","UN",5,null,null,null,""]
["S",3,"S",0,2,7,1,0,0,0,0,"F","Serviço","Serviço","2.7.1.11.","SINAPI",86901,"CUBA DE EMBUTIR OVAL EM LOUÇA BRANCA, 35 X 50CM OU EQUIVALENTE - FORNECIMENTO E INSTALAÇÃO. AF_12/2013","UN",4,null,null,null,"Referência: AGETOP - 80587"]
["S",3,"S",0,2,7,1,0,0,0,0,"F","Serviço","Serviço","2.7.1.12.","SINAPI",9535,"CHUVEIRO ELETRICO COMUM CORPO PLASTICO TIPO DUCHA, FORNECIMENTO E INSTALACAO","UN",1,null,null,null,""]
["S",3,"S",0,2,7,1,0,0,0,0,"F","Serviço","Serviço","2.7.1.13.","SINAPI",95543,"PORTA TOALHA BANHO EM METAL CROMADO, TIPO BARRA, INCLUSO FIXAÇÃO. AF_10/2016","UN",1,null,null,null,""]
["S",3,"S",0,2,7,1,0,0,0,0,"F","Serviço","Serviço","2.7.1.14.","SINAPI",95545,"SABONETEIRA DE PAREDE EM METAL CROMADO, INCLUSO FIXAÇÃO. AF_10/2016","UN",1,null,null,null,""]
["S",3,"S",0,2,7,1,0,0,0,0,"F","Serviço","Serviço","2.7.1.15.","SINAPI",86913,"TORNEIRA CROMADA 1/2\" OU 3/4\" PARA TANQUE, PADRÃO POPULAR - FORNECIMENTO E INSTALAÇÃO. AF_12/2013","UN",2,null,null,null,""]
["S",3,"S",0,2,7,1,0,0,0,0,"F","Serviço","Serviço","2.7.1.16.","SINAPI",89708,"CAIXA SIFONADA, PVC, DN 150 X 185 X 75 MM, JUNTA ELÁSTICA, FORNECIDA E INSTALADA EM RAMAL DE DESCARGA OU EM RAMAL DE ESGOTO SANITÁRIO. AF_12/2014","UN",3,null,null,null,""]
["S",3,"S",0,2,7,1,0,0,0,0,"F","Serviço","Serviço","2.7.1.17.","SINAPI",89709,"RALO SIFONADO, PVC, DN 100 X 40 MM, JUNTA SOLDÁVEL, FORNECIDO E INSTALADO EM RAMAL DE DESCARGA OU EM RAMAL DE ESGOTO SANITÁRIO. AF_12/2014","UN",1,null,null,null,""]
["S",3,"S",0,2,7,1,0,0,0,0,"F","Serviço","Serviço","2.7.1.18.","AGETOP",82101,"REDUCAO EXCENTRICA 75 X 50 MM","Un    ",3,null,null,null,""]
["S",3,"S",0,2,7,1,0,0,0,0,"F","Serviço","Serviço","2.7.1.19.","AGETOP",81695,"PROLONGAMENTO PARA CAIXA SIFONADA 100 MM","M     ",1,null,null,null,""]
["S",3,"S",0,2,7,1,0,0,0,0,"F","Serviço","Serviço","2.7.1.20.","AGETOP",81696,"PROLONGAMENTO PARA CAIXA SIFONADA 150 MM","M     ",3,null,null,null,""]
["S",3,"S",0,2,7,1,0,0,0,0,"F","Serviço","Serviço","2.7.1.21.","SINAPI",97906,"CAIXA ENTERRADA HIDRÁULICA RETANGULAR, EM ALVENARIA COM BLOCOS DE CONCRETO, DIMENSÕES INTERNAS: 0,6X0,6X0,6 M PARA REDE DE ESGOTO. AF_05/2018","UN",2,null,null,null,""]
["S",3,"S",0,2,7,1,0,0,0,0,"F","Serviço","Serviço","2.7.1.22.","SINAPI",6171,"TAMPA DE CONCRETO ARMADO 60X60X5CM PARA CAIXA","UN",2,null,null,null,""]
["S",3,"S",0,2,7,1,0,0,0,0,"F","Serviço","Serviço","2.7.1.23.","AGETOP",81885,"TERMINAL DE VENTILACAO DIAMETRO 50 MM","Un    ",2,null,null,null,""]
[3,3,3,21,2,7,2,0,0,31,21,"F","Nível 3","Nível 3","2.7.2.",null,null,"ÁGUA FRIA","-",null,null,null,null,""]
["S",3,"S",0,2,7,2,0,0,0,0,"F","Serviço","Serviço","2.7.2.1.","SINAPI",89985,"REGISTRO DE PRESSÃO BRUTO, LATÃO, ROSCÁVEL, 3/4\", COM ACABAMENTO E CANOPLA CROMADOS. FORNECIDO E INSTALADO EM RAMAL DE ÁGUA. AF_12/2014","UN",1,null,null,null,"Referência: AGETOP - 80926"]
["S",3,"S",0,2,7,2,0,0,0,0,"F","Serviço","Serviço","2.7.2.2.","SINAPI",94794,"REGISTRO DE GAVETA BRUTO, LATÃO, ROSCÁVEL, 1 1/2\u0094, COM ACABAMENTO E CANOPLA CROMADOS, INSTALADO EM RESERVAÇÃO DE ÁGUA DE EDIFICAÇÃO QUE POSSUA RESERVATÓRIO DE FIBRA/FIBROCIMENTO \u0096 FORNECIMENTO E INSTALAÇÃO. AF_06/2016","UN",3,null,null,null,"Referência: AGETOP - 80929"]
["S",3,"S",0,2,7,2,0,0,0,0,"F","Serviço","Serviço","2.7.2.3.","SINAPI",89987,"REGISTRO DE GAVETA BRUTO, LATÃO, ROSCÁVEL, 3/4\", COM ACABAMENTO E CANOPLA CROMADOS. FORNECIDO E INSTALADO EM RAMAL DE ÁGUA. AF_12/2014","UN",2,null,null,null,"Referência: AGETOP - 80926"]
["S",3,"S",0,2,7,2,0,0,0,0,"F","Serviço","Serviço","2.7.2.4.","SINAPI",89402,"TUBO, PVC, SOLDÁVEL, DN 25MM, INSTALADO EM RAMAL DE DISTRIBUIÇÃO DE ÁGUA - FORNECIMENTO E INSTALAÇÃO. AF_12/2014","M",24,null,null,null,"Referência: AGETOP - 81003"]
["S",3,"S",0,2,7,2,0,0,0,0,"F","Serviço","Serviço","2.7.2.5.","SINAPI",94651,"TUBO, PVC, SOLDÁVEL, DN 50 MM, INSTALADO EM RESERVAÇÃO DE ÁGUA DE EDIFICAÇÃO QUE POSSUA RESERVATÓRIO DE FIBRA/FIBROCIMENTO   FORNECIMENTO E INSTALAÇÃO. AF_06/2016","M",54,null,null,null,"Referência: AGETOP - 81006"]
["S",3,"S",0,2,7,2,0,0,0,0,"F","Serviço","Serviço","2.7.2.6.","SINAPI",94652,"TUBO, PVC, SOLDÁVEL, DN 60 MM, INSTALADO EM RESERVAÇÃO DE ÁGUA DE EDIFICAÇÃO QUE POSSUA RESERVATÓRIO DE FIBRA/FIBROCIMENTO   FORNECIMENTO E INSTALAÇÃO. AF_06/2016","M",6,null,null,null,""]
["S",3,"S",0,2,7,2,0,0,0,0,"F","Serviço","Serviço","2.7.2.7.","SINAPI",89429,"ADAPTADOR CURTO COM BOLSA E ROSCA PARA REGISTRO, PVC, SOLDÁVEL, DN 25MM X 3/4\u0094, INSTALADO EM RAMAL DE DISTRIBUIÇÃO DE ÁGUA - FORNECIMENTO E INSTALAÇÃO. AF_12/2014","UN",6,null,null,null,"Referência: AGETOP - 81066"]
["S",3,"S",0,2,7,2,0,0,0,0,"F","Serviço","Serviço","2.7.2.8.","SINAPI",89596,"ADAPTADOR CURTO COM BOLSA E ROSCA PARA REGISTRO, PVC, SOLDÁVEL, DN 50MM X 1.1/2\u0094, INSTALADO EM PRUMADA DE ÁGUA - FORNECIMENTO E INSTALAÇÃO. AF_12/2014","UN",13,null,null,null,"Referência: AGETOP - 81069"]
["S",3,"S",0,2,7,2,0,0,0,0,"F","Serviço","Serviço","2.7.2.9.","SINAPI",89605,"LUVA DE REDUÇÃO, PVC, SOLDÁVEL, DN 60MM X 50MM, INSTALADO EM PRUMADA DE ÁGUA - FORNECIMENTO E INSTALAÇÃO. AF_12/2014","UN",2,null,null,null,""]
["S",3,"S",0,2,7,2,0,0,0,0,"F","Serviço","Serviço","2.7.2.10.","SINAPI",89579,"LUVA DE REDUÇÃO, PVC, SOLDÁVEL, DN 50MM X 25MM, INSTALADO EM PRUMADA DE ÁGUA   FORNECIMENTO E INSTALAÇÃO. AF_12/2014","UN",1,null,null,null,""]
["S",3,"S",0,2,7,2,0,0,0,0,"F","Serviço","Serviço","2.7.2.11.","SINAPI",89605,"LUVA DE REDUÇÃO, PVC, SOLDÁVEL, DN 60MM X 50MM, INSTALADO EM PRUMADA DE ÁGUA - FORNECIMENTO E INSTALAÇÃO. AF_12/2014","UN",1,null,null,null,""]
["S",3,"S",0,2,7,2,0,0,0,0,"F","Serviço","Serviço","2.7.2.12.","SINAPI",89408,"JOELHO 90 GRAUS, PVC, SOLDÁVEL, DN 25MM, INSTALADO EM RAMAL DE DISTRIBUIÇÃO DE ÁGUA - FORNECIMENTO E INSTALAÇÃO. AF_12/2014","UN",9,null,null,null,""]
["S",3,"S",0,2,7,2,0,0,0,0,"F","Serviço","Serviço","2.7.2.13.","SINAPI",94678,"JOELHO 90 GRAUS, PVC, SOLDÁVEL, DN 50 MM INSTALADO EM RESERVAÇÃO DE ÁGUA DE EDIFICAÇÃO QUE POSSUA RESERVATÓRIO DE FIBRA/FIBROCIMENTO   FORNECIMENTO E INSTALAÇÃO. AF_06/2016","UN",12,null,null,null,"Referência: AGETOP - 81324"]
["S",3,"S",0,2,7,2,0,0,0,0,"F","Serviço","Serviço","2.7.2.14.","SINAPI",90373,"JOELHO 90 GRAUS COM BUCHA DE LATÃO, PVC, SOLDÁVEL, DN 25MM, X 1/2\u0094 INSTALADO EM RAMAL OU SUB-RAMAL DE ÁGUA - FORNECIMENTO E INSTALAÇÃO. AF_12/2014","UN",4,null,null,null,"Referência: AGETOP - 81360"]
["S",3,"S",0,2,7,2,0,0,0,0,"F","Serviço","Serviço","2.7.2.15.","SINAPI",94672,"JOELHO 90 GRAUS COM BUCHA DE LATÃO, PVC, SOLDÁVEL, DN  25 MM, X 3/4\u0094 INSTALADO EM RESERVAÇÃO DE ÁGUA DE EDIFICAÇÃO QUE POSSUA RESERVATÓRIO DE FIBRA/FIBROCIMENTO   FORNECIMENTO E INSTALAÇÃO. AF_06/2016","UN",2,null,null,null,""]
["S",3,"S",0,2,7,2,0,0,0,0,"F","Serviço","Serviço","2.7.2.16.","SINAPI",89440,"TE, PVC, SOLDÁVEL, DN 25MM, INSTALADO EM RAMAL DE DISTRIBUIÇÃO DE ÁGUA - FORNECIMENTO E INSTALAÇÃO. AF_12/2014","UN",2,null,null,null,"Referência: AGETOP - 81402"]
["S",3,"S",0,2,7,2,0,0,0,0,"F","Serviço","Serviço","2.7.2.17.","SINAPI",94694,"TÊ, PVC, SOLDÁVEL, DN 50 MM INSTALADO EM RESERVAÇÃO DE ÁGUA DE EDIFICAÇÃO QUE POSSUA RESERVATÓRIO DE FIBRA/FIBROCIMENTO   FORNECIMENTO E INSTALAÇÃO. AF_06/2016","UN",5,null,null,null,"Referência: AGETOP - 81405"]
["S",3,"S",0,2,7,2,0,0,0,0,"F","Serviço","Serviço","2.7.2.18.","SINAPI",89627,"TÊ DE REDUÇÃO, PVC, SOLDÁVEL, DN 50MM X 25MM, INSTALADO EM PRUMADA DE ÁGUA - FORNECIMENTO E INSTALAÇÃO. AF_12/2014","UN",3,null,null,null,""]
["S",3,"S",0,2,7,2,0,0,0,0,"F","Serviço","Serviço","2.7.2.19.","SINAPI",94698,"TÊ DE REDUÇÃO, PVC, SOLDÁVEL, DN 75 MM X 50 MM, INSTALADO EM RESERVAÇÃO DE ÁGUA DE EDIFICAÇÃO QUE POSSUA RESERVATÓRIO DE FIBRA/FIBROCIMENTO   FORNECIMENTO E INSTALAÇÃO. AF_06/2016","UN",1,null,null,null,"Referência: AGETOP - 81427"]
["S",3,"S",0,2,7,2,0,0,0,0,"F","Serviço","Serviço","2.7.2.20.","SINAPI",89441,"TÊ COM BUCHA DE LATÃO NA BOLSA CENTRAL, PVC, SOLDÁVEL, DN 25MM X 1/2\u0094, INSTALADO EM RAMAL DE DISTRIBUIÇÃO DE ÁGUA - FORNECIMENTO E INSTALAÇÃO. AF_12/2014","UN",2,null,null,null,""]
[3,3,3,10,2,7,3,0,0,{"$f":"IF(OR($C332=\"S\",$C332=0),0,MATCH(0,OFFSET($D332,1,$C332,ROW($C$387)-ROW($C332)),0))","v":10},{"$f":"IF(OR($C332=\"S\",$C332=0),0,MATCH(OFFSET($D332,0,$C332)+1,OFFSET($D332,1,$C332,ROW($C$387)-ROW($C332)),0))","v":{"$error":"#N/A"}},"F","Nível 3","Nível 3","2.7.3.","SINAPI",null,"ESGOTO","-",null,null,null,null,""]
["S",3,"S",0,2,7,3,0,0,0,0,"F","Serviço","Serviço","2.7.3.1.","SINAPI",89732,"JOELHO 45 GRAUS, PVC, SERIE NORMAL, ESGOTO PREDIAL, DN 50 MM, JUNTA ELÁSTICA, FORNECIDO E INSTALADO EM RAMAL DE DESCARGA OU RAMAL DE ESGOTO SANITÁRIO. AF_12/2014","UN",2,null,null,null,""]
["S",3,"S",0,2,7,3,0,0,0,0,"F","Serviço","Serviço","2.7.3.2.","AGETOP",81927,"JOELHO 90 GRAUS C/ANEL 40 mm ","Un    ",5,null,null,null,""]
["S",3,"S",0,2,7,3,0,0,0,0,"F","Serviço","Serviço","2.7.3.3.","SINAPI",89724,"JOELHO 90 GRAUS, PVC, SERIE NORMAL, ESGOTO PREDIAL, DN 40 MM, JUNTA SOLDÁVEL, FORNECIDO E INSTALADO EM RAMAL DE DESCARGA OU RAMAL DE ESGOTO SANITÁRIO. AF_12/2014","UN",5,null,null,null,""]
["S",3,"S",0,2,7,3,0,0,0,0,"F","Serviço","Serviço","2.7.3.4.","SINAPI",89731,"JOELHO 90 GRAUS, PVC, SERIE NORMAL, ESGOTO PREDIAL, DN 50 MM, JUNTA ELÁSTICA, FORNECIDO E INSTALADO EM RAMAL DE DESCARGA OU RAMAL DE ESGOTO SANITÁRIO. AF_12/2014","UN",6,null,null,null,""]
["S",3,"S",0,2,7,3,0,0,0,0,"F","Serviço","Serviço","2.7.3.5.","SINAPI",89744,"JOELHO 90 GRAUS, PVC, SERIE NORMAL, ESGOTO PREDIAL, DN 100 MM, JUNTA ELÁSTICA, FORNECIDO E INSTALADO EM RAMAL DE DESCARGA OU RAMAL DE ESGOTO SANITÁRIO. AF_12/2014","UN",7,null,null,null,"Referência: AGETOP - 81938"]
["S",3,"S",0,2,7,3,0,0,0,0,"F","Serviço","Serviço","2.7.3.6.","SINAPI",89784,"TE, PVC, SERIE NORMAL, ESGOTO PREDIAL, DN 50 X 50 MM, JUNTA ELÁSTICA, FORNECIDO E INSTALADO EM RAMAL DE DESCARGA OU RAMAL DE ESGOTO SANITÁRIO. AF_12/2014","UN",4,null,null,null,"Referência: AGETOP - 82230"]
["S",3,"S",0,2,7,3,0,0,0,0,"F","Serviço","Serviço","2.7.3.7.","SINAPI",89711,"TUBO PVC, SERIE NORMAL, ESGOTO PREDIAL, DN 40 MM, FORNECIDO E INSTALADO EM RAMAL DE DESCARGA OU RAMAL DE ESGOTO SANITÁRIO. AF_12/2014","M",18,null,null,null,"Referência: AGETOP - 82301"]
["S",3,"S",0,2,7,3,0,0,0,0,"F","Serviço","Serviço","2.7.3.8.","SINAPI",89712,"TUBO PVC, SERIE NORMAL, ESGOTO PREDIAL, DN 50 MM, FORNECIDO E INSTALADO EM RAMAL DE DESCARGA OU RAMAL DE ESGOTO SANITÁRIO. AF_12/2014","M",36,null,null,null,"Referência: AGETOP - 82302"]
["S",3,"S",0,2,7,3,0,0,0,0,"F","Serviço","Serviço","2.7.3.9.","SINAPI",89714,"TUBO PVC, SERIE NORMAL, ESGOTO PREDIAL, DN 100 MM, FORNECIDO E INSTALADO EM RAMAL DE DESCARGA OU RAMAL DE ESGOTO SANITÁRIO. AF_12/2014","M",12,null,null,null,"Referência: AGETOP - 82304"]
[2,2,2,3,2,8,0,0,0,45,3,"F","Nível 2","Nível 2","2.8.","SINAPI",null,"ALVENARIAS E DIVISÓRIAS","-",null,null,null,null,""]
["S",2,"S",0,2,8,0,0,0,0,0,"F","Serviço","Serviço","2.8.0.1.","SINAPI",87511,"ALVENARIA DE VEDAÇÃO DE BLOCOS CERÂMICOS FURADOS NA HORIZONTAL DE 9X19X19CM (ESPESSURA 9CM) DE PAREDES COM ÁREA LÍQUIDA MENOR QUE 6M² COM VÃOS E ARGAMASSA DE ASSENTAMENTO COM PREPARO EM BETONEIRA. AF_06/2014","M2",100.74,null,null,null,"Referência: AGETOP - 100201"]
["S",2,"S",0,2,8,0,0,0,0,0,"F","Serviço","Serviço","2.8.0.2.","SINAPI",79627,"DIVISORIA EM GRANITO BRANCO POLIDO, ESP = 3CM, ASSENTADO COM ARGAMASSA TRACO 1:4, ARREMATE EM CIMENTO BRANCO, EXCLUSIVE FERRAGENS","M2",20.51,null,null,null,"Referência: AGETOP - 100320"]
[2,2,2,2,2,9,0,0,0,42,2,"F","Nível 2","Nível 2","2.9.","SINAPI",null,"IMPERMEABILIZAÇÃO","-",null,null,null,null,""]
["S",2,"S",0,2,9,0,0,0,0,0,"F","Serviço","Serviço","2.9.0.1.","SINAPI","74106/1","IMPERMEABILIZACAO DE ESTRUTURAS ENTERRADAS, COM TINTA ASFALTICA, DUAS DEMAOS.","M2",32.64,null,null,null,""]
[2,2,2,2,2,10,0,0,0,40,2,"F","Nível 2","Nível 2","2.10.","AGETOP",null,"ESTRUTURAS METÁLICAS","-",null,null,null,null,""]
["S",2,"S",0,2,10,0,0,0,0,0,"F","Serviço","Serviço","2.10.0.1.","AGETOP",150204,"ESTRUTURA METÁLICA CONVENCIONAL EM AÇO DO TIPO MR-250 / ASTM A36 COM FUNDO ANTICORROSIVO","Kg    ",941,null,null,null,""]
[2,2,2,4,2,11,0,0,0,38,4,"F","Nível 2","Nível 2","2.11.","AGETOP",null,"COBERTURAS","-",null,null,null,null,""]
["S",2,"S",0,2,11,0,0,0,0,0,"F","Serviço","Serviço","2.11.0.1.","SINAPI",94445,"TELHAMENTO COM TELHA CERÂMICA CAPA-CANAL, TIPO PLAN, COM ATÉ 2 ÁGUAS, INCLUSO TRANSPORTE VERTICAL. AF_07/2019","M2",66.61,null,null,null,"Referência: AGETOP - 160401"]
["S",2,"S",0,2,11,0,0,0,0,0,"F","Serviço","Serviço","2.11.0.2.","SINAPI",94221,"CUMEEIRA PARA TELHA CERÂMICA EMBOÇADA COM ARGAMASSA TRAÇO 1:2:9 (CIMENTO, CAL E AREIA) PARA TELHADOS COM ATÉ 2 ÁGUAS, INCLUSO TRANSPORTE VERTICAL. AF_07/2019","M",7.49,null,null,null,""]
["S",2,"S",0,2,11,0,0,0,0,0,"F","Serviço","Serviço","2.11.0.3.","SINAPI",94224,"EMBOÇAMENTO COM ARGAMASSA TRAÇO 1:2:9 (CIMENTO, CAL E AREIA). AF_07/2019","M",32.78,null,null,null,"Referência: AGETOP - 160403"]
[2,2,2,4,2,12,0,0,0,34,4,"F","Nível 2","Nível 2","2.12.","AGETOP",null,"ESQUADRIAS METÁLICAS","-",null,null,null,null,""]
["S",2,"S",0,2,12,0,0,0,0,0,"F","Serviço","Serviço","2.12.0.1.","SINAPI","73933/4","PORTA DE FERRO DE ABRIR TIPO BARRA CHATA, COM REQUADRO E GUARNICAO COMPLETA","M2",5.67,null,null,null,"Referência: AGETOP - 180501"]
["S",{"$f":"IF(OR(C355=\"s\",C355=0),OFFSET(B355,-1,0),C355)","v":2},{"$f":"IF(OFFSET(C355,-1,0)=\"L\",1,IF(OFFSET(C355,-1,0)=1,2,IF(OR(A355=\"s\",A355=0),\"S\",IF(AND(OFFSET(C355,-1,0)=2,A355=4),3,IF(AND(OR(OFFSET(C355,-1,0)=\"s\",OFFSET(C355,-1,0)=0),A355<>\"s\",A355>OFFSET(B355,-1,0)),OFFSET(B355,-1,0),A355)))))","v":"S"},{"$f":"IF(OR(C355=\"S\",C355=0),0,IF(ISERROR(K355),J355,SMALL(J355:K355,1)))","v":0},{"$f":"IF($C355=1,OFFSET(E355,-1,0)+1,OFFSET(E355,-1,0))","v":2},{"$f":"IF($C355=1,0,IF($C355=2,OFFSET(F355,-1,0)+1,OFFSET(F355,-1,0)))","v":12},{"$f":"IF(AND($C355<=2,$C355<>0),0,IF($C355=3,OFFSET(G355,-1,0)+1,OFFSET(G355,-1,0)))","v":0},{"$f":"IF(AND($C355<=3,$C355<>0),0,IF($C355=4,OFFSET(H355,-1,0)+1,OFFSET(H355,-1,0)))","v":0},{"$f":"IF(AND($C355<=4,$C355<>0),0,IF(AND($C355=\"S\",$W355>0),OFFSET(I355,-1,0)+1,OFFSET(I355,-1,0)))","v":0},0,0,"F","Serviço","Serviço","2.12.0.2.","SINAPI","73933/4","PORTA DE FERRO DE ABRIR TIPO BARRA CHATA, COM REQUADRO E GUARNICAO COMPLETA","M2",6.48,null,null,null,"Referência: AGETOP - 180501"]
["S",2,"S",0,2,12,0,0,0,0,0,"F","Serviço","Serviço","2.12.0.3.","SINAPI",94559,"JANELA DE AÇO BASCULANTE, FIXAÇÃO COM ARGAMASSA, SEM VIDROS, PADRONIZADA. AF_07/2016","M2",3,null,null,null,"Referência: AGETOP - 180404"]
[2,2,2,2,2,13,0,0,0,30,2,"F","Nível 2","Nível 2","2.13.","AGETOP",null,"VIDROS","-",null,null,null,null,""]
["S",2,"S",0,2,13,0,0,0,0,0,"F","Serviço","Serviço","2.13.0.1.","SINAPI",72117,"VIDRO LISO COMUM TRANSPARENTE, ESPESSURA 4MM","M2",3,null,null,null,"Referência: AGETOP - 190102"]
[2,2,2,9,2,14,0,0,0,28,9,"F","Nível 2","Nível 2","2.14.","AGETOP",null,"REVESTIMENTO DE PAREDE","-",null,null,null,null,""]
["S",2,"S",0,2,14,0,0,0,0,0,"F","Serviço","Serviço","2.14.0.1.","SINAPI",87904,"CHAPISCO APLICADO EM ALVENARIA (COM PRESENÇA DE VÃOS) E ESTRUTURAS DE CONCRETO DE FACHADA, COM COLHER DE PEDREIRO.  ARGAMASSA TRAÇO 1:3 COM PREPARO MANUAL. AF_06/2014","M2",201.48,null,null,null,"Referência: AGETOP - 200101"]
["S",2,"S",0,2,14,0,0,0,0,0,"F","Serviço","Serviço","2.14.0.2.","SINAPI",87548,"MASSA ÚNICA, PARA RECEBIMENTO DE PINTURA, EM ARGAMASSA TRAÇO 1:2:8, PREPARO MANUAL, APLICADA MANUALMENTE EM FACES INTERNAS DE PAREDES, ESPESSURA DE 10MM, COM EXECUÇÃO DE TALISCAS. AF_06/2014","M2",31.302000000000003,null,null,null,"Referência: AGETOP - 200500"]
["S",2,"S",0,2,14,0,0,0,0,0,"F","Serviço","Serviço","2.14.0.3.","SINAPI",87792,"EMBOÇO OU MASSA ÚNICA EM ARGAMASSA TRAÇO 1:2:8, PREPARO MECÂNICO COM BETONEIRA 400 L, APLICADA MANUALMENTE EM PANOS CEGOS DE FACHADA (SEM PRESENÇA DE VÃOS), ESPESSURA DE 25 MM. AF_06/2014","M2",43.977000000000004,null,null,null,""]
["S",2,"S",0,2,14,0,0,0,0,0,"F","Serviço","Serviço","2.14.0.4.","SINAPI",87777,"EMBOÇO OU MASSA ÚNICA EM ARGAMASSA TRAÇO 1:2:8, PREPARO MANUAL, APLICADA MANUALMENTE EM PANOS DE FACHADA COM PRESENÇA DE VÃOS, ESPESSURA DE 25 MM. AF_06/2014","M2",34.923999999999999,null,null,null,""]
["S",2,"S",0,2,14,0,0,0,0,0,"F","Serviço","Serviço","2.14.0.5.","SINAPI",87275,"REVESTIMENTO CERÂMICO PARA PAREDES INTERNAS COM PLACAS TIPO ESMALTADA EXTRA  DE DIMENSÕES 33X45 CM APLICADAS EM AMBIENTES DE ÁREA MAIOR QUE 5 M² A MEIA ALTURA DAS PAREDES. AF_06/2014","M2",56.747,null,null,null,"Referência: AGETOP - 201302"]
["S",2,"S",0,2,14,0,0,0,0,0,"F","Serviço","Serviço","2.14.0.6.","SINAPI",87274,"REVESTIMENTO CERÂMICO PARA PAREDES INTERNAS COM PLACAS TIPO ESMALTADA EXTRA DE DIMENSÕES 33X45 CM APLICADAS EM AMBIENTES DE ÁREA MENOR QUE 5 M² A MEIA ALTURA DAS PAREDES. AF_06/2014","M2",10.649999999999999,null,null,null,"Referência: AGETOP - 201302"]
["S",2,"S",0,2,14,0,0,0,0,0,"F","Serviço","Serviço","2.14.0.7.","SINAPI",87549,"EMBOÇO, PARA RECEBIMENTO DE CERÂMICA, EM ARGAMASSA TRAÇO 1:2:8, PREPARO MECÂNICO COM BETONEIRA 400L, APLICADO MANUALMENTE EM FACES INTERNAS DE PAREDES, PARA AMBIENTE COM ÁREA ENTRE 5M2 E 10M2, ESPESSURA DE 10MM, COM EXECUÇÃO DE TALISCAS. AF_06/2014","M2",67.397000000000006,null,null,null,"Referência: AGETOP - 200201"]
["S",2,"S",0,2,14,0,0,0,0,0,"F","Serviço","Serviço","2.14.0.8.","SINAPI",87545,"EMBOÇO, PARA RECEBIMENTO DE CERÂMICA, EM ARGAMASSA TRAÇO 1:2:8, PREPARO MECÂNICO COM BETONEIRA 400L, APLICADO MANUALMENTE EM FACES INTERNAS DE PAREDES, PARA AMBIENTE COM ÁREA MENOR QUE 5M2, ESPESSURA DE 10MM, COM EXECUÇÃO DE TALISCAS. AF_06/2014","M2",22.950000000000003,null,null,null,"Referência: AGETOP - 200201"]
[2,2,2,2,2,15,0,0,0,19,2,"F","Nível 2","Nível 2","2.15.","AGETOP",null,"FORROS","-",null,null,null,null,""]
["S",2,"S",0,2,15,0,0,0,0,0,"F","Serviço","Serviço","2.15.0.1.","SINAPI",96111,"FORRO EM RÉGUAS DE PVC, FRISADO, PARA AMBIENTES RESIDENCIAIS, INCLUSIVE ESTRUTURA DE FIXAÇÃO. AF_05/2017_P","M2",25.159999999999997,null,null,null,"Referência: AGETOP - 210460"]
[2,2,2,6,2,16,0,0,0,17,6,"F","Nível 2","Nível 2","2.16.","SINAPI",null,"REVESTIMENTO DE PISO","-",null,null,null,null,""]
["S",2,"S",0,2,16,0,0,0,0,0,"F","Serviço","Serviço","2.16.0.1.","AGETOP",220101,"LASTRO DE CONCRETO REGULARIZADO IMPERMEABILIZADO 1:3:6 ESP=5CM (BASE)","m2    ",44.01,null,null,null,""]
["S",2,"S",0,2,16,0,0,0,0,0,"F","Serviço","Serviço","2.16.0.2.","AGETOP",221104,"RASPAGEM E APLICAÇÃO RESINA ACRÍLICA DUAS DEMÃOS","m2    ",19.447800000000001,null,null,null,""]
["S",2,"S",0,2,16,0,0,0,0,0,"F","Serviço","Serviço","2.16.0.3.","SINAPI",84191,"PISO EM GRANILITE, MARMORITE OU GRANITINA ESPESSURA 8 MM, INCLUSO JUNTAS DE DILATACAO PLASTICAS","M2",19.447800000000001,null,null,null,"Referência: AGETOP - 221101"]
["S",2,"S",0,2,16,0,0,0,0,0,"F","Serviço","Serviço","2.16.0.4.","SINAPI",87247,"REVESTIMENTO CERÂMICO PARA PISO COM PLACAS TIPO ESMALTADA EXTRA DE DIMENSÕES 35X35 CM APLICADA EM AMBIENTES DE ÁREA ENTRE 5 M2 E 10 M2. AF_06/2014","M2",25.159999999999997,null,null,null,""]
["S",2,"S",0,2,16,0,0,0,0,0,"F","Serviço","Serviço","2.16.0.5.","SINAPI",94992,"EXECUÇÃO DE PASSEIO (CALÇADA) OU PISO DE CONCRETO COM CONCRETO MOLDADO IN LOCO, FEITO EM OBRA, ACABAMENTO CONVENCIONAL, ESPESSURA 6 CM, ARMADO. AF_07/2016","M2",14.99,null,null,null,""]
[2,2,2,3,2,17,0,0,0,11,3,"F","Nível 2","Nível 2","2.17.","AGETOP",null,"FERRAGENS","-",null,null,null,null,""]
["S",2,"S",0,2,17,0,0,0,0,0,"F","Serviço","Serviço","2.17.0.1.","AGETOP",230176,"BARRA DE APOIO EM AÇO INOX - 80 CM ","un    ",6,null,null,null,""]
["S",2,"S",0,2,17,0,0,0,0,0,"F","Serviço","Serviço","2.17.0.2.","AGETOP",230174,"BARRA DE APOIO EM AÇO INOX - 40 CM","un    ",3,null,null,null,""]
[2,2,2,4,2,18,0,0,0,8,4,"F","Nível 2","Nível 2","2.18.","AGETOP",null,"PINTURA","-",null,null,null,null,""]
["S",2,"S",0,2,18,0,0,0,0,0,"F","Serviço","Serviço","2.18.0.1.","SINAPI","74145/1","PINTURA ESMALTE FOSCO, DUAS DEMAOS, SOBRE SUPERFICIE METALICA, INCLUSO UMA DEMAO DE FUNDO ANTICORROSIVO. UTILIZACAO DE REVOLVER ( AR-COMPRIMIDO).","M2",42.45,null,null,null,"Referência: AGETOP - 261602"]
["S",2,"S",0,2,18,0,0,0,0,0,"F","Serviço","Serviço","2.18.0.2.","SINAPI",88489,"APLICAÇÃO MANUAL DE PINTURA COM TINTA LÁTEX ACRÍLICA EM PAREDES, DUAS DEMÃOS. AF_06/2014","M2",110.20300000000002,null,null,null,"Referência: AGETOP - 261001"]
["S",2,"S",0,2,18,0,0,0,0,0,"F","Serviço","Serviço","2.18.0.3.","SINAPI",88497,"APLICAÇÃO E LIXAMENTO DE MASSA LÁTEX EM PAREDES, DUAS DEMÃOS. AF_06/2014","M2",31.302000000000003,null,null,null,"Referência: AGETOP - 261300"]
[2,2,2,4,2,19,0,0,0,4,{"$error":"#N/A"},"F","Nível 2","Nível 2","2.19.","AGETOP",null,"DIVERSOS","-",null,null,null,null,""]
["S",2,"S",0,2,19,0,0,0,0,0,"F","Serviço","Serviço","2.19.0.1.","AGETOP",270501,"LIMPEZA FINAL DE OBRA - (OBRAS CIVIS)","m2    ",48.43,null,null,null,""]
["S",2,"S",0,2,19,0,0,0,0,0,"F","Serviço","Serviço","2.19.0.2.","COMPOSIÇÃO","COMP 541_SEE","BANCADA DE GRANITO CINZA POLIDO - FORNECIMENTO E INSTALAÇÃO. ","M2    ",2.42,null,null,null,""]
["S",2,"S",0,2,19,0,0,0,0,0,"F","Serviço","Serviço","2.19.0.3.","COMPOSIÇÃO","COMP 206_SEE","BANCO ARTICULADO PARA BANHO, EM ACO INOX POLIDO, 70* CM X 45* CM","UN ",1,null,null,null,""]
[-1,null,-1,null,0,0,0,0,0,null,null,"F"]
[null,null,null,null,null,null,null,null,null,null,null,"F",null,null,null,null,null,"OBS: OS QUANTITATIVOS DE MATERIAIS  DAS INSTALAÇÕES HIDROSSANITÁRIAS, ELÉTRICAS E ESPECIAIS SÃO FORNECIDOS PELOS PROFISSIONAIS RESPONSÁVEIS PELOS RESPECTIVOS PROJETOS.",null,null,"VALOR TOTAL"]
[null,null,null,null,null,null,null,null,null,null,null,"F",null,null,null,null,null,null,null,null,"VALOR BDI (26,37%)"]
[null,null,null,null,null,null,null,null,null,null,null,"F",null,null,null,null,null,null,null,null,"TOTAL ORÇAMENTO"]
[null,null,null,null,null,null,null,null,null,null,null,"F"]
[null,null,null,null,null,null,null,null,null,null,null,"F",null,null,null,null,null,null,null,null,"CUSTO POR M2 ³"]
[null,null,null,null,null,null,null,null,null,null,null,"F",null,null,null,null,null,null,null,null,"MATERIAL S/ BDI"]
[null,null,null,null,null,null,null,null,null,null,null,"F",null,null,null,null,null,null,null,null,"MÃO DE OBRA S/ BDI"]
[null,null,null,null,null,null,null,null,null,null,null,"F"]
[null,null,null,null,null,null,null,null,null,null,null,"F",null,null,null,null,"(1) Conforme previsto pelo DECRETO Nº 7.983, DE 8 DE ABRIL DE 2013, os preços adotados são aqueles constantes dos sistemas de referência indicados. Justifica-se o uso dos preços destas composições de custos unitários devido ao seu valor ser menor à mediana de seus correspondentes na tabela SINAPI;"]
[null,null,null,null,null,null,null,null,null,null,null,"F",null,null,null,null,"(2) Optou-se pelo uso das composições de custos da AGETOP para itens não presentes na SINAPI;"]
[null,null,null,null,null,null,null,null,null,null,null,"F",null,null,null,null,"(3) Para itens da AGETOP, os vidros não estão inclusos nas esquadrias e já foram considerados os custos de contramarco para as esquadrias de alumínio;"]
[null,null,null,null,null,null,null,null,null,null,null,"F",null,null,null,null,"(4) Nos casos em que houver execução de granitina e omissão do item AGETOP 221102, considerou-se que o quantitativo para o rodapé, de altura igual a 7cm, foi incorporado na área de piso;"]
[null,null,null,null,null,null,null,null,null,null,null,"F",null,null,null,null,"(5) O custo unitário aproximado por metro quadrado é calculado dividindo-se o valor total do orçamento pela área total de construção."]
[null,null,null,null,null,null,null,null,null,null,null,"F"]
[null,null,null,null,null,null,null,null,null,null,null,"F"]
[]
[null,null,null,null,null,null,null,null,null,null,null,null,null,null,"SOMATÓRIO DE SERVIÇOS"]
[null,null,null,null,null,null,null,null,null,null,null,null,null,null,"ITEM","DESCRIÇÃO DOS SERVIÇOS",null,null,"PREÇO SEM BDI",null,null,"PREÇO COM BDI",null,"PARTICIPAÇÃO ( % )"]
[null,null,null,null,null,null,null,null,null,null,null,null,null,null,"a.","SERVIÇOS PRELIMINARES",null,null,{"$f":"SUMIF($R$19:$R$387,$P406,$W$19:$W$387)","v":0},null,null,{"$f":"ROUND(S406*(1+BDI.Taxa),2)","v":0},null,{"$f":"IFERROR(ROUND($V406*100/$W$390,2),0)","v":0}]
[null,null,null,null,null,null,null,null,null,null,null,null,null,null,"b.","TRANSPORTES",null,null,0,null,null,0,null,{"$f":"IFERROR(ROUND($V407*100/$W$390,2),0)","v":0}]
[null,null,null,null,null,null,null,null,null,null,null,null,null,null,"c.","SERVIÇO EM TERRA",null,null,0,null,null,0,null,0]
[null,null,null,null,null,null,null,null,null,null,null,null,null,null,"d.","FUNDAÇÕES E SONDAGENS",null,null,0,null,null,0,null,0]
[null,null,null,null,null,null,null,null,null,null,null,null,null,null,"e.","ESTRUTURA",null,null,0,null,null,0,null,0]
[null,null,null,null,null,null,null,null,null,null,null,null,null,null,"f.","INSTALAÇÕES ELÉTRICAS",null,null,0,null,null,0,null,0]
[null,null,null,null,null,null,null,null,null,null,null,null,null,null,"g.","INSTALAÇÕES HIDROSSANITÁRIAS",null,null,0,null,null,0,null,0]
[null,null,null,null,null,null,null,null,null,null,null,null,null,null,"h","INSTALAÇÕES ESPECIAIS",null,null,0,null,null,0,null,0]
[null,null,null,null,null,null,null,null,null,null,null,null,null,null,"i.","ALVENARIAS E DIVISÓRIAS",null,null,0,null,null,0,null,0]
[null,null,null,null,null,null,null,null,null,null,null,null,null,null,"j.","ALVENARIA AUTO-PORTANTE",null,null,0,null,null,0,null,0]
[null,null,null,null,null,null,null,null,null,null,null,null,null,null,"k.","IMPERMEABILIZAÇÃO",null,null,0,null,null,0,null,0]
[null,null,null,null,null,null,null,null,null,null,null,null,null,null,"l.","ISOLAMENTO TÉRMICO E ACÚSTICO",null,null,0,null,null,0,null,0]
[null,null,null,null,null,null,null,null,null,null,null,null,null,null,"m.","ESTRUTURA DE MADEIRA",null,null,0,null,null,0,null,0]
[null,null,null,null,null,null,null,null,null,null,null,null,null,null,"n.","ESTRUTURAS METÁLICAS",null,null,0,null,null,0,null,0]
[null,null,null,null,null,null,null,null,null,null,null,null,null,null,"o.","COBERTURAS",null,null,0,null,null,0,null,0]
[null,null,null,null,null,null,null,null,null,null,null,null,null,null,"p.","ESQUADRIAS DE MADEIRA",null,null,0,null,null,0,null,0]
[null,null,null,null,null,null,null,null,null,null,null,null,null,null,"q.","ESQUADRIAS METÁLICAS",null,null,0,null,null,{"$f":"ROUND(S422*(1+BDI.Taxa),2)","v":0},null,0]
[null,null,null,null,null,null,null,null,null,null,null,null,null,null,"r.","VIDROS",null,null,0,null,null,0,null,0]
[null,null,null,null,null,null,null,null,null,null,null,null,null,null,"s.","REVESTIMENTO DE PAREDE",null,null,0,null,null,0,null,0]
[null,null,null,null,null,null,null,null,null,null,null,null,null,null,"t.","FORROS",null,null,0,null,null,0,null,0]
[null,null,null,null,null,null,null,null,null,null,null,null,null,null,"u.","REVESTIMENTO DE PISO",null,null,0,null,null,0,null,0]
[null,null,null,null,null,null,null,null,null,null,null,null,null,null,"v.","FERRAGENS",null,null,0,null,null,0,null,0]
[null,null,null,null,null,null,null,null,null,null,null,null,null,null,"w.","MARCENARIA",null,null,0,null,null,0,null,0]
[null,null,null,null,null,null,null,null,null,null,null,null,null,null,"x.","ADMINISTRAÇÃO",null,null,0,null,null,0,null,0]
[null,null,null,null,null,null,null,null,null,null,null,null,null,null,"y.","PINTURA",null,null,0,null,null,{"$f":"ROUND(S430*(1+BDI.Taxa),2)","v":0},null,0]
[null,null,null,null,null,null,null,null,null,null,null,null,null,null,"z.","DIVERSOS",null,null,0,null,null,{"$f":"IF(S431>0,IF((SUM(V406:W430)+ROUND(S431*(1+BDI.Taxa),2))<>V433,V433-SUM(V406:W430),ROUND(S431*(1+BDI.Taxa),2)),0)","v":0},null,{"$f":"IF(S431>0,IF((SUM(X406:X430)+IFERROR(ROUND($V431*100/$W$390,2),0))<>X433,X433-SUM(X406:X430),IFERROR(ROUND($V431*100/$W$390,2),0)),0)","v":0}]
[null,null,null,null,null,null,null,null,null,null,null,null,null,null,"TOTAL GERAL DO ORÇAMENTO (R$)",null,null,null,{"$f":"SUM(S406:U431)","v":0},null,null,{"$f":"SUM(V406:W431)","v":0},null,{"$f":"SUM(X406:X431)","v":0}]
[null,null,null,null,null,null,null,null,null,null,null,null,null,null,null,null,null,null,{"$f":"$W$388","v":0},null,null,{"$f":"$W$390","v":0},null,100]
[null,null,null,null,null,null,null,null,null,null,null,null,null,null,null,null,null,null,"(TOTAL SEM BDI)",null,null,"(TOTAL COM BDI)",null,"(ARRED porcentagem)"]
[null,null,null,null,null,null,null,null,null,null,null,null,null,null,null,null,null,null,{"$f":"IF(AND(S432=S433,S432>0),\"OK\",\"ERRO\")","v":"ERRO"},null,null,{"$f":"IF(AND(V432=V433,V432>0),\"OK\",\"ERRO\")","v":"ERRO"},null,{"$f":"IF(X432=100,\"OK\",\"ERRO\")","v":"ERRO"}]
[]
[]
[null,null,null,null,null,null,null,null,null,null,null,null,null,null,"RESUMO GERAL DO ORÇAMENTO"]
[null,null,null,null,null,null,null,null,null,null,null,null,null,null,"ITEM","DESCRIÇÃO DOS SERVIÇOS",null,null,"PREÇO SEM BDI",null,null,"PREÇO COM BDI",null,"PARTICIPAÇÃO ( % )"]
[null,null,null,null,null,null,null,null,null,null,null,null,null,null,"1.",{"$f":"IFERROR(VLOOKUP(O440,$O$19:$W$387,4,FALSE),\"\")","v":"REFORMA"},null,null,{"$f":"IF(P441=\"\",$S$461-SUM(OFFSET($S$439:S439,0,0,COUNTA($S$439:S439),1)),SUMIF($R$19:$R$387,$P440,$W$19:$W$387))","v":0},null,null,{"$f":"IF(P441=\"\",$V$461-SUM(OFFSET($V$439:V439,0,0,COUNTA($V$439:V439),1)),ROUND(S440*(1+BDI.Taxa),2))","v":0},null,{"$f":"IF(P441=\"\",$X$461-SUM(OFFSET($X$439:X439,0,0,COUNTA($X$439:X439),1)),ROUND(V440*100/ORÇAMENTO.Totalorçamento,2))","v":{"$error":"#DIV/0!"}}]
[null,null,null,null,null,null,null,null,null,null,null,null,null,null,"2.","BLOCO SANITÁRIO PADRÃO SEDUC 2013",null,null,{"$f":"IF(P442=\"\",$S$461-SUM(OFFSET($S$439:S440,0,0,COUNTA($S$439:S440),1)),SUMIF($R$19:$R$387,$P441,$W$19:$W$387))","v":0},null,null,{"$f":"IF(P442=\"\",$V$461-SUM(OFFSET($V$439:V440,0,0,COUNTA($V$439:V440),1)),ROUND(S441*(1+BDI.Taxa),2))","v":0},null,{"$f":"IF(P442=\"\",$X$461-SUM(OFFSET($X$439:X440,0,0,COUNTA($X$439:X440),1)),ROUND(V441*100/ORÇAMENTO.Totalorçamento,2))","v":{"$error":"#DIV/0!"}}]
[null,null,null,null,null,null,null,null,null,null,null,null,null,null,"3.","",null,null,{"$f":"IF(P443=\"\",$S$461-SUM(OFFSET($S$439:S441,0,0,COUNTA($S$439:S441),1)),SUMIF($R$19:$R$387,$P442,$W$19:$W$387))","v":0},null,null,{"$f":"IF(P443=\"\",$V$461-SUM(OFFSET($V$439:V441,0,0,COUNTA($V$439:V441),1)),ROUND(S442*(1+BDI.Taxa),2))","v":0},null,{"$f":"IF(P443=\"\",$X$461-SUM(OFFSET($X$439:X441,0,0,COUNTA($X$439:X441),1)),ROUND(V442*100/ORÇAMENTO.Totalorçamento,2))","v":{"$error":"#DIV/0!"}}]
[null,null,null,null,null,null,null,null,null,null,null,null,null,null,"4.","",null,null,{"$f":"IF(P444=\"\",$S$461-SUM(OFFSET($S$439:S442,0,0,COUNTA($S$439:S442),1)),SUMIF($R$19:$R$387,$P443,$W$19:$W$387))","v":0},null,null,{"$f":"IF(P444=\"\",$V$461-SUM(OFFSET($V$439:V442,0,0,COUNTA($V$439:V442),1)),ROUND(S443*(1+BDI.Taxa),2))","v":0},null,{"$f":"IF(P444=\"\",$X$461-SUM(OFFSET($X$439:X442,0,0,COUNTA($X$439:X442),1)),ROUND(V443*100/ORÇAMENTO.Totalorçamento,2))","v":{"$error":"#DIV/0!"}}]
[null,null,null,null,null,null,null,null,null,null,null,null,null,null,"5.","",null,null,{"$f":"IF(P445=\"\",$S$461-SUM(OFFSET($S$439:S443,0,0,COUNTA($S$439:S443),1)),SUMIF($R$19:$R$387,$P444,$W$19:$W$387))","v":0},null,null,{"$f":"IF(P445=\"\",$V$461-SUM(OFFSET($V$439:V443,0,0,COUNTA($V$439:V443),1)),ROUND(S444*(1+BDI.Taxa),2))","v":0},null,{"$f":"IF(P445=\"\",$X$461-SUM(OFFSET($X$439:X443,0,0,COUNTA($X$439:X443),1)),ROUND(V444*100/ORÇAMENTO.Totalorçamento,2))","v":{"$error":"#DIV/0!"}}]
[null,null,null,null,null,null,null,null,null,null,null,null,null,null,"6.","",null,null,{"$f":"IF(P446=\"\",$S$461-SUM(OFFSET($S$439:S444,0,0,COUNTA($S$439:S444),1)),SUMIF($R$19:$R$387,$P445,$W$19:$W$387))","v":0},null,null,{"$f":"IF(P446=\"\",$V$461-SUM(OFFSET($V$439:V444,0,0,COUNTA($V$439:V444),1)),ROUND(S445*(1+BDI.Taxa),2))","v":0},null,{"$f":"IF(P446=\"\",$X$461-SUM(OFFSET($X$439:X444,0,0,COUNTA($X$439:X444),1)),ROUND(V445*100/ORÇAMENTO.Totalorçamento,2))","v":{"$error":"#DIV/0!"}}]
[null,null,null,null,null,null,null,null,null,null,null,null,null,null,"7.","",null,null,{"$f":"IF(P447=\"\",$S$461-SUM(OFFSET($S$439:S445,0,0,COUNTA($S$439:S445),1)),SUMIF($R$19:$R$387,$P446,$W$19:$W$387))","v":0},null,null,{"$f":"IF(P447=\"\",$V$461-SUM(OFFSET($V$439:V445,0,0,COUNTA($V$439:V445),1)),ROUND(S446*(1+BDI.Taxa),2))","v":0},null,{"$f":"IF(P447=\"\",$X$461-SUM(OFFSET($X$439:X445,0,0,COUNTA($X$439:X445),1)),ROUND(V446*100/ORÇAMENTO.Totalorçamento,2))","v":{"$error":"#DIV/0!"}}]
[null,null,null,null,null,null,null,null,null,null,null,null,null,null,"8.","",null,null,{"$f":"IF(P448=\"\",$S$461-SUM(OFFSET($S$439:S446,0,0,COUNTA($S$439:S446),1)),SUMIF($R$19:$R$387,$P447,$W$19:$W$387))","v":0},null,null,{"$f":"IF(P448=\"\",$V$461-SUM(OFFSET($V$439:V446,0,0,COUNTA($V$439:V446),1)),ROUND(S447*(1+BDI.Taxa),2))","v":0},null,{"$f":"IF(P448=\"\",$X$461-SUM(OFFSET($X$439:X446,0,0,COUNTA($X$439:X446),1)),ROUND(V447*100/ORÇAMENTO.Totalorçamento,2))","v":{"$error":"#DIV/0!"}}]
[null,null,null,null,null,null,null,null,null,null,null,null,null,null,"9.","",null,null,{"$f":"IF(P449=\"\",$S$461-SUM(OFFSET($S$439:S447,0,0,COUNTA($S$439:S447),1)),SUMIF($R$19:$R$387,$P448,$W$19:$W$387))","v":0},null,null,{"$f":"IF(P449=\"\",$V$461-SUM(OFFSET($V$439:V447,0,0,COUNTA($V$439:V447),1)),ROUND(S448*(1+BDI.Taxa),2))","v":0},null,{"$f":"IF(P449=\"\",$X$461-SUM(OFFSET($X$439:X447,0,0,COUNTA($X$439:X447),1)),ROUND(V448*100/ORÇAMENTO.Totalorçamento,2))","v":{"$error":"#DIV/0!"}}]
[null,null,null,null,null,null,null,null,null,null,null,null,null,null,"10.","",null,null,{"$f":"IF(P450=\"\",$S$461-SUM(OFFSET($S$439:S448,0,0,COUNTA($S$439:S448),1)),SUMIF($R$19:$R$387,$P449,$W$19:$W$387))","v":0},null,null,{"$f":"IF(P450=\"\",$V$461-SUM(OFFSET($V$439:V448,0,0,COUNTA($V$439:V448),1)),ROUND(S449*(1+BDI.Taxa),2))","v":0},null,{"$f":"IF(P450=\"\",$X$461-SUM(OFFSET($X$439:X448,0,0,COUNTA($X$439:X448),1)),ROUND(V449*100/ORÇAMENTO.Totalorçamento,2))","v":{"$error":"#DIV/0!"}}]
[null,null,null,null,null,null,null,null,null,null,null,null,null,null,"11.","",null,null,{"$f":"IF(P451=\"\",$S$461-SUM(OFFSET($S$439:S449,0,0,COUNTA($S$439:S449),1)),SUMIF($R$19:$R$387,$P450,$W$19:$W$387))","v":0},null,null,{"$f":"IF(P451=\"\",$V$461-SUM(OFFSET($V$439:V449,0,0,COUNTA($V$439:V449),1)),ROUND(S450*(1+BDI.Taxa),2))","v":0},null,{"$f":"IF(P451=\"\",$X$461-SUM(OFFSET($X$439:X449,0,0,COUNTA($X$439:X449),1)),ROUND(V450*100/ORÇAMENTO.Totalorçamento,2))","v":{"$error":"#DIV/0!"}}]
[null,null,null,null,null,null,null,null,null,null,null,null,null,null,"12.","",null,null,{"$f":"IF(P452=\"\",$S$461-SUM(OFFSET($S$439:S450,0,0,COUNTA($S$439:S450),1)),SUMIF($R$19:$R$387,$P451,$W$19:$W$387))","v":0},null,null,{"$f":"IF(P452=\"\",$V$461-SUM(OFFSET($V$439:V450,0,0,COUNTA($V$439:V450),1)),ROUND(S451*(1+BDI.Taxa),2))","v":0},null,{"$f":"IF(P452=\"\",$X$461-SUM(OFFSET($X$439:X450,0,0,COUNTA($X$439:X450),1)),ROUND(V451*100/ORÇAMENTO.Totalorçamento,2))","v":{"$error":"#DIV/0!"}}]
[null,null,null,null,null,null,null,null,null,null,null,null,null,null,"13.","",null,null,{"$f":"IF(P453=\"\",$S$461-SUM(OFFSET($S$439:S451,0,0,COUNTA($S$439:S451),1)),SUMIF($R$19:$R$387,$P452,$W$19:$W$387))","v":0},null,null,{"$f":"IF(P453=\"\",$V$461-SUM(OFFSET($V$439:V451,0,0,COUNTA($V$439:V451),1)),ROUND(S452*(1+BDI.Taxa),2))","v":0},null,{"$f":"IF(P453=\"\",$X$461-SUM(OFFSET($X$439:X451,0,0,COUNTA($X$439:X451),1)),ROUND(V452*100/ORÇAMENTO.Totalorçamento,2))","v":{"$error":"#DIV/0!"}}]
[null,null,null,null,null,null,null,null,null,null,null,null,null,null,"14.","",null,null,{"$f":"IF(P454=\"\",$S$461-SUM(OFFSET($S$439:S452,0,0,COUNTA($S$439:S452),1)),SUMIF($R$19:$R$387,$P453,$W$19:$W$387))","v":0},null,null,{"$f":"IF(P454=\"\",$V$461-SUM(OFFSET($V$439:V452,0,0,COUNTA($V$439:V452),1)),ROUND(S453*(1+BDI.Taxa),2))","v":0},null,{"$f":"IF(P454=\"\",$X$461-SUM(OFFSET($X$439:X452,0,0,COUNTA($X$439:X452),1)),ROUND(V453*100/ORÇAMENTO.Totalorçamento,2))","v":{"$error":"#DIV/0!"}}]
[null,null,null,null,null,null,null,null,null,null,null,null,null,null,"15.","",null,null,{"$f":"IF(P455=\"\",$S$461-SUM(OFFSET($S$439:S453,0,0,COUNTA($S$439:S453),1)),SUMIF($R$19:$R$387,$P454,$W$19:$W$387))","v":0},null,null,{"$f":"IF(P455=\"\",$V$461-SUM(OFFSET($V$439:V453,0,0,COUNTA($V$439:V453),1)),ROUND(S454*(1+BDI.Taxa),2))","v":0},null,{"$f":"IF(P455=\"\",$X$461-SUM(OFFSET($X$439:X453,0,0,COUNTA($X$439:X453),1)),ROUND(V454*100/ORÇAMENTO.Totalorçamento,2))","v":{"$error":"#DIV/0!"}}]
[null,null,null,null,null,null,null,null,null,null,null,null,null,null,"16.","",null,null,{"$f":"IF(P456=\"\",$S$461-SUM(OFFSET($S$439:S454,0,0,COUNTA($S$439:S454),1)),SUMIF($R$19:$R$387,$P455,$W$19:$W$387))","v":0},null,null,{"$f":"IF(P456=\"\",$V$461-SUM(OFFSET($V$439:V454,0,0,COUNTA($V$439:V454),1)),ROUND(S455*(1+BDI.Taxa),2))","v":0},null,{"$f":"IF(P456=\"\",$X$461-SUM(OFFSET($X$439:X454,0,0,COUNTA($X$439:X454),1)),ROUND(V455*100/ORÇAMENTO.Totalorçamento,2))","v":{"$error":"#DIV/0!"}}]
[null,null,null,null,null,null,null,null,null,null,null,null,null,null,"17.","",null,null,{"$f":"IF(P457=\"\",$S$461-SUM(OFFSET($S$439:S455,0,0,COUNTA($S$439:S455),1)),SUMIF($R$19:$R$387,$P456,$W$19:$W$387))","v":0},null,null,{"$f":"IF(P457=\"\",$V$461-SUM(OFFSET($V$439:V455,0,0,COUNTA($V$439:V455),1)),ROUND(S456*(1+BDI.Taxa),2))","v":0},null,{"$f":"IF(P457=\"\",$X$461-SUM(OFFSET($X$439:X455,0,0,COUNTA($X$439:X455),1)),ROUND(V456*100/ORÇAMENTO.Totalorçamento,2))","v":{"$error":"#DIV/0!"}}]
[null,null,null,null,null,null,null,null,null,null,null,null,null,null,"18.","",null,null,{"$f":"IF(P458=\"\",$S$461-SUM(OFFSET($S$439:S456,0,0,COUNTA($S$439:S456),1)),SUMIF($R$19:$R$387,$P457,$W$19:$W$387))","v":0},null,null,{"$f":"IF(P458=\"\",$V$461-SUM(OFFSET($V$439:V456,0,0,COUNTA($V$439:V456),1)),ROUND(S457*(1+BDI.Taxa),2))","v":0},null,{"$f":"IF(P458=\"\",$X$461-SUM(OFFSET($X$439:X456,0,0,COUNTA($X$439:X456),1)),ROUND(V457*100/ORÇAMENTO.Totalorçamento,2))","v":{"$error":"#DIV/0!"}}]
[null,null,null,null,null,null,null,null,null,null,null,null,null,null,"19.","",null,null,{"$f":"IF(P459=\"\",$S$461-SUM(OFFSET($S$439:S457,0,0,COUNTA($S$439:S457),1)),SUMIF($R$19:$R$387,$P458,$W$19:$W$387))","v":0},null,null,{"$f":"IF(P459=\"\",$V$461-SUM(OFFSET($V$439:V457,0,0,COUNTA($V$439:V457),1)),ROUND(S458*(1+BDI.Taxa),2))","v":0},null,{"$f":"IF(P459=\"\",$X$461-SUM(OFFSET($X$439:X457,0,0,COUNTA($X$439:X457),1)),ROUND(V458*100/ORÇAMENTO.Totalorçamento,2))","v":{"$error":"#DIV/0!"}}]
[null,null,null,null,null,null,null,null,null,null,null,null,null,null,"20.","",null,null,{"$f":"IF(P460=\"\",$S$461-SUM(OFFSET($S$439:S458,0,0,COUNTA($S$439:S458),1)),SUMIF($R$19:$R$387,$P459,$W$19:$W$387))","v":0},null,null,{"$f":"IF(P460=\"\",$V$461-SUM(OFFSET($V$439:V458,0,0,COUNTA($V$439:V458),1)),ROUND(S459*(1+BDI.Taxa),2))","v":0},null,{"$f":"IF(P460=\"\",$X$461-SUM(OFFSET($X$439:X458,0,0,COUNTA($X$439:X458),1)),ROUND(V459*100/ORÇAMENTO.Totalorçamento,2))","v":{"$error":"#DIV/0!"}}]
[null,null,null,null,null,null,null,null,null,null,null,null,null,null,"TOTAL GERAL DO ORÇAMENTO (R$)",null,null,null,{"$f":"SUM(S440:U459)","v":0},null,null,{"$f":"SUM(V440:W459)","v":0},null,{"$f":"SUM(X440:X459)","v":{"$error":"#DIV/0!"}}]
[null,null,null,null,null,null,null,null,null,null,null,null,null,null,null,null,null,null,{"$f":"$W$388","v":0},null,null,{"$f":"$W$390","v":0},null,100]
[null,null,null,null,null,null,null,null,null,null,null,null,null,null,null,null,null,null,"(TOTAL SEM BDI)",null,null,"(TOTAL COM BDI)",null,"(ARRED porcentagem)"]
[null,null,null,null,null,null,null,null,null,null,null,null,null,null,null,null,null,null,{"$f":"IF(AND(S460=S461,S460>0),\"OK\",\"ERRO\")","v":"ERRO"},null,null,{"$f":"IF(AND(V460=V461,V460>0),\"OK\",\"ERRO\")","v":"ERRO"},null,{"$f":"IF(AND(X460=100,S440<>0),\"OK\",\"ERRO\")","v":{"$error":"#DIV/0!"}}]

{"sheet":"Resumo ","index":1,"n_rows":39,"n_cols":9,"rows_kept":39,"cut":false,"hidden":false,"merged":[[42,3,42,7],[11,1,11,2],[12,1,12,2],[15,2,15,3],[16,2,16,3],[14,1,14,8],[17,2,17,3],[23,2,23,3],[18,2,18,3],[19,2,19,3],[20,2,20,3],[41,3,41,7],[24,2,24,3],[26,2,26,3],[27,2,27,3],[38,1,38,8],[1,1,1,8],[2,6,2,8],[3,6,3,8],[4,1,4,8],[5,6,5,8],[6,6,6,8],[7,1,7,8],[8,6,8,8],[9,6,9,8],[13,1,13,8],[0,1,0,8],[36,1,36,5],[2,1,2,5],[3,1,3,5],[5,1,5,5],[6,1,6,5],[8,1,8,5],[9,1,9,5],[11,3,11,5],[12,3,12,5],[10,1,10,8],[11,6,11,8],[12,6,12,8],[25,2,25,3],[21,2,21,3],[22,2,22,3],[13,0,14,0],[34,2,34,3],[35,2,35,3],[31,2,31,3],[32,2,32,3],[33,2,33,3],[28,2,28,3],[29,2,29,3],[30,2,30,3]]}
[]
[]
[null,"UNIDADE ESCOLAR",null,null,null,null,"CÓDIGO INEP"]
[null,{"$f":"Orçamento!$O$4","v":"COLÉGIO ESTADUAL DESOR HAMILTON BARROS VELASCO"},null,null,null,null,{"$f":"Orçamento!V4","v":52057259}]
[]
[null,"OBRA",null,null,null,null,"CIDADE"]
[null,{"$f":"Orçamento!$O$7","v":"AMPLIAÇÃO E REFORMA"},null,null,null,null,{"$f":"Orçamento!$V$7","v":"PALMINÓPOLIS"}]
[]
[null,"ENDEREÇO",null,null,null,null,"CRE"]
[null,{"$f":"Orçamento!$R$10","v":"RUA DEP ANTONIO Q BARRETO, CENTRO, CEP:75990-000"},null,null,null,null,{"$f":"Orçamento!$O$10","v":"PALMEIRAS"}]
[]
[null,"REFERÊNCIA",null,"DATA",null,null,"ÁREA TOTAL CONSTRUÍDA (M²)"]
[null,{"$f":"CONCATENATE(\"AGETOP E SINAPI - \",Orçamento!$T$10)","v":"AGETOP E SINAPI - DESONERADA"},null,{"$f":"Orçamento!$S$7","v":"2020-05-12"},null,null,{"$f":"Orçamento!$V$13","v":2392.0899999999997}]
["FILTRO"]
[null,"RESUMO GERAL DO ORÇAMENTO"]
["↓","ITEM","DESCRIÇÃO DOS SERVIÇOS",null,"UNID","QUANT","PREÇO SEM BDI","PREÇO COM BDI","PARTICIP. (%)"]
[{"$f":"IF(H17>0,\"F\",\"\")","v":""},"1.",{"$f":"Orçamento!$P440","v":"REFORMA"},null,{"$f":"IF(C17<>\"\",\"UN\",\"\")","v":"UN"},{"$f":"IF(C17<>\"\",1,\"\")","v":1},{"$f":"IFERROR(Orçamento!S440,\"-\")","v":0},{"$f":"IFERROR(Orçamento!V440,\"\")","v":0},{"$f":"Orçamento!X440","v":{"$error":"#DIV/0!"}}]
[{"$f":"IF(H18>0,\"F\",\"\")","v":""},"2.",{"$f":"Orçamento!$P441","v":"BLOCO SANITÁRIO PADRÃO SEDUC 2013"},null,{"$f":"IF(C18<>\"\",\"UN\",\"\")","v":"UN"},{"$f":"IF(C18<>\"\",1,\"\")","v":1},{"$f":"IFERROR(Orçamento!S441,\"-\")","v":0},{"$f":"IFERROR(Orçamento!V441,\"\")","v":0},{"$f":"Orçamento!X441","v":{"$error":"#DIV/0!"}}]
[{"$f":"IF(H19>0,\"F\",\"\")","v":""},"3.",{"$f":"Orçamento!$P442","v":""},null,"","",{"$f":"IFERROR(Orçamento!S442,\"-\")","v":0},{"$f":"IFERROR(Orçamento!V442,\"\")","v":0},{"$f":"Orçamento!X442","v":{"$error":"#DIV/0!"}}]
["","4.",{"$f":"Orçamento!$P443","v":""},null,"","",{"$f":"IFERROR(Orçamento!S443,\"-\")","v":0},{"$f":"IFERROR(Orçamento!V443,\"\")","v":0},{"$f":"Orçamento!X443","v":{"$error":"#DIV/0!"}}]
["","5.",{"$f":"Orçamento!$P444","v":""},null,"","",{"$f":"IFERROR(Orçamento!S444,\"-\")","v":0},{"$f":"IFERROR(Orçamento!V444,\"\")","v":0},{"$f":"Orçamento!X444","v":{"$error":"#DIV/0!"}}]
["","6.",{"$f":"Orçamento!$P445","v":""},null,"","",{"$f":"IFERROR(Orçamento!S445,\"-\")","v":0},{"$f":"IFERROR(Orçamento!V445,\"\")","v":0},{"$f":"Orçamento!X445","v":{"$error":"#DIV/0!"}}]
["","7.",{"$f":"Orçamento!$P446","v":""},null,"","",{"$f":"IFERROR(Orçamento!S446,\"-\")","v":0},{"$f":"IFERROR(Orçamento!V446,\"\")","v":0},{"$f":"Orçamento!X446","v":{"$error":"#DIV/0!"}}]
["","8.",{"$f":"Orçamento!$P447","v":""},null,"","",{"$f":"IFERROR(Orçamento!S447,\"-\")","v":0},{"$f":"IFERROR(Orçamento!V447,\"\")","v":0},{"$f":"Orçamento!X447","v":{"$error":"#DIV/0!"}}]
["","9.",{"$f":"Orçamento!$P448","v":""},null,"","",{"$f":"IFERROR(Orçamento!S448,\"-\")","v":0},{"$f":"IFERROR(Orçamento!V448,\"\")","v":0},{"$f":"Orçamento!X448","v":{"$error":"#DIV/0!"}}]
["","10.",{"$f":"Orçamento!$P449","v":""},null,"","",{"$f":"IFERROR(Orçamento!S449,\"-\")","v":0},{"$f":"IFERROR(Orçamento!V449,\"\")","v":0},{"$f":"Orçamento!X449","v":{"$error":"#DIV/0!"}}]
["","11.",{"$f":"Orçamento!$P450","v":""},null,"","",{"$f":"IFERROR(Orçamento!S450,\"-\")","v":0},{"$f":"IFERROR(Orçamento!V450,\"\")","v":0},{"$f":"Orçamento!X450","v":{"$error":"#DIV/0!"}}]
["","12.",{"$f":"Orçamento!$P451","v":""},null,"","",{"$f":"IFERROR(Orçamento!S451,\"-\")","v":0},{"$f":"IFERROR(Orçamento!V451,\"\")","v":0},{"$f":"Orçamento!X451","v":{"$error":"#DIV/0!"}}]
["","13.",{"$f":"Orçamento!$P452","v":""},null,"","",{"$f":"IFERROR(Orçamento!S452,\"-\")","v":0},{"$f":"IFERROR(Orçamento!V452,\"\")","v":0},{"$f":"Orçamento!X452","v":{"$error":"#DIV/0!"}}]
["","14.",{"$f":"Orçamento!$P453","v":""},null,"","",{"$f":"IFERROR(Orçamento!S453,\"-\")","v":0},{"$f":"IFERROR(Orçamento!V453,\"\")","v":0},{"$f":"Orçamento!X453","v":{"$error":"#DIV/0!"}}]
["","15.",{"$f":"Orçamento!$P454","v":""},null,"","",{"$f":"IFERROR(Orçamento!S454,\"-\")","v":0},{"$f":"IFERROR(Orçamento!V454,\"\")","v":0},{"$f":"Orçamento!X454","v":{"$error":"#DIV/0!"}}]
["","16.",{"$f":"Orçamento!$P455","v":""},null,"","",{"$f":"IFERROR(Orçamento!S455,\"-\")","v":0},{"$f":"IFERROR(Orçamento!V455,\"\")","v":0},{"$f":"Orçamento!X455","v":{"$error":"#DIV/0!"}}]
["","17.",{"$f":"Orçamento!$P456","v":""},null,"","",{"$f":"IFERROR(Orçamento!S456,\"-\")","v":0},{"$f":"IFERROR(Orçamento!V456,\"\")","v":0},{"$f":"Orçamento!X456","v":{"$error":"#DIV/0!"}}]
["","18.",{"$f":"Orçamento!$P457","v":""},null,"","",{"$f":"IFERROR(Orçamento!S457,\"-\")","v":0},{"$f":"IFERROR(Orçamento!V457,\"\")","v":0},{"$f":"Orçamento!X457","v":{"$error":"#DIV/0!"}}]
["","19.",{"$f":"Orçamento!$P458","v":""},null,"","",{"$f":"IFERROR(Orçamento!S458,\"-\")","v":0},{"$f":"IFERROR(Orçamento!V458,\"\")","v":0},{"$f":"Orçamento!X458","v":{"$error":"#DIV/0!"}}]
["","20.",{"$f":"Orçamento!$P459","v":""},null,"","",{"$f":"IFERROR(Orçamento!S459,\"-\")","v":0},{"$f":"IFERROR(Orçamento!V459,\"\")","v":0},{"$f":"Orçamento!X459","v":{"$error":"#DIV/0!"}}]
["F","TOTAL GERAL DO ORÇAMENTO (R$)",null,null,null,null,{"$f":"SUM(G17:G36)","v":0},{"$f":"SUM(H17:H36)","v":0},{"$f":"SUM(I17:I36)","v":{"$error":"#DIV/0!"}}]
["F"]
["F"]

{"sheet":"Somatório","index":2,"n_rows":45,"n_cols":6,"rows_kept":45,"cut":false,"hidden":false,"merged":[[0,1,0,5],[14,1,14,5],[2,1,2,3],[2,4,2,5],[3,1,3,3],[3,4,3,5],[5,1,5,3],[5,4,5,5],[6,1,6,3],[6,4,6,5],[8,1,8,3],[8,4,8,5],[1,1,1,5],[4,1,4,5],[7,1,7,5],[10,1,10,5],[9,1,9,3],[9,4,9,5],[11,1,11,2],[11,4,11,5],[12,1,12,2],[12,4,12,5],[13,0,14,0],[42,1,42,2],[44,1,44,5],[47,3,47,5],[48,3,48,5],[13,1,13,5]]}
[]
[]
[null,"UNIDADE ESCOLAR",null,null,"CÓDIGO INEP"]
[null,{"$f":"Orçamento!$O$4","v":"COLÉGIO ESTADUAL DESOR HAMILTON BARROS VELASCO"},null,null,{"$f":"Orçamento!V4","v":52057259}]
[]
[null,"OBRA",null,null,"CIDADE"]
[null,{"$f":"Orçamento!$O$7","v":"AMPLIAÇÃO E REFORMA"},null,null,{"$f":"Orçamento!$V$7","v":"PALMINÓPOLIS"}]
[]
[null,"ENDEREÇO",null,null,"CRE"]
[null,{"$f":"Orçamento!$R$10","v":"RUA DEP ANTONIO Q BARRETO, CENTRO, CEP:75990-000"},null,null,{"$f":"Orçamento!$O$10","v":"PALMEIRAS"}]
[]
[null,"REFERÊNCIA",null,"DATA","ÁREA TOTAL CONSTRUÍDA (M²)"]
[null,{"$f":"CONCATENATE(\"AGETOP E SINAPI - \",Orçamento!$T$10)","v":"AGETOP E SINAPI - DESONERADA"},null,{"$f":"Orçamento!$S$7","v":"2020-05-12"},{"$f":"Orçamento!$V$13","v":2392.0899999999997}]
["FILTRO"]
[null,"SOMATÓRIO DE SERVIÇOS"]
["↓","ITEM","DESCRIÇÃO DOS SERVIÇOS","PREÇO SEM BDI (R$)","PREÇO COM BDI (R$)","PARTIC.  ( % )"]
[{"$f":"IF(D17>0,\"F\",\"\")","v":""},"a.",{"$f":"Orçamento!P406","v":"SERVIÇOS PRELIMINARES"},{"$f":"Orçamento!S406","v":0},{"$f":"Orçamento!V406","v":0},{"$f":"Orçamento!X406","v":0}]
[{"$f":"IF(D18>0,\"F\",\"\")","v":""},"b.",{"$f":"Orçamento!P407","v":"TRANSPORTES"},{"$f":"Orçamento!S407","v":0},{"$f":"Orçamento!V407","v":0},{"$f":"Orçamento!X407","v":0}]
["","c.",{"$f":"Orçamento!P408","v":"SERVIÇO EM TERRA"},{"$f":"Orçamento!S408","v":0},{"$f":"Orçamento!V408","v":0},{"$f":"Orçamento!X408","v":0}]
["","d.",{"$f":"Orçamento!P409","v":"FUNDAÇÕES E SONDAGENS"},{"$f":"Orçamento!S409","v":0},{"$f":"Orçamento!V409","v":0},{"$f":"Orçamento!X409","v":0}]
["","e.",{"$f":"Orçamento!P410","v":"ESTRUTURA"},{"$f":"Orçamento!S410","v":0},{"$f":"Orçamento!V410","v":0},{"$f":"Orçamento!X410","v":0}]
["","f.",{"$f":"Orçamento!P411","v":"INSTALAÇÕES ELÉTRICAS"},{"$f":"Orçamento!S411","v":0},{"$f":"Orçamento!V411","v":0},{"$f":"Orçamento!X411","v":0}]
["","g.",{"$f":"Orçamento!P412","v":"INSTALAÇÕES HIDROSSANITÁRIAS"},{"$f":"Orçamento!S412","v":0},{"$f":"Orçamento!V412","v":0},{"$f":"Orçamento!X412","v":0}]
["","h.",{"$f":"Orçamento!P413","v":"INSTALAÇÕES ESPECIAIS"},{"$f":"Orçamento!S413","v":0},{"$f":"Orçamento!V413","v":0},{"$f":"Orçamento!X413","v":0}]
["","i.",{"$f":"Orçamento!P414","v":"ALVENARIAS E DIVISÓRIAS"},{"$f":"Orçamento!S414","v":0},{"$f":"Orçamento!V414","v":0},{"$f":"Orçamento!X414","v":0}]
["","j.",{"$f":"Orçamento!P415","v":"ALVENARIA AUTO-PORTANTE"},{"$f":"Orçamento!S415","v":0},{"$f":"Orçamento!V415","v":0},{"$f":"Orçamento!X415","v":0}]
["","k.",{"$f":"Orçamento!P416","v":"IMPERMEABILIZAÇÃO"},{"$f":"Orçamento!S416","v":0},{"$f":"Orçamento!V416","v":0},{"$f":"Orçamento!X416","v":0}]
["","l.",{"$f":"Orçamento!P417","v":"ISOLAMENTO TÉRMICO E ACÚSTICO"},{"$f":"Orçamento!S417","v":0},{"$f":"Orçamento!V417","v":0},{"$f":"Orçamento!X417","v":0}]
["","m.",{"$f":"Orçamento!P418","v":"ESTRUTURA DE MADEIRA"},{"$f":"Orçamento!S418","v":0},{"$f":"Orçamento!V418","v":0},{"$f":"Orçamento!X418","v":0}]
["","n.",{"$f":"Orçamento!P419","v":"ESTRUTURAS METÁLICAS"},{"$f":"Orçamento!S419","v":0},{"$f":"Orçamento!V419","v":0},{"$f":"Orçamento!X419","v":0}]
["","o.",{"$f":"Orçamento!P420","v":"COBERTURAS"},{"$f":"Orçamento!S420","v":0},{"$f":"Orçamento!V420","v":0},{"$f":"Orçamento!X420","v":0}]
["","p.",{"$f":"Orçamento!P421","v":"ESQUADRIAS DE MADEIRA"},{"$f":"Orçamento!S421","v":0},{"$f":"Orçamento!V421","v":0},{"$f":"Orçamento!X421","v":0}]
["","q.",{"$f":"Orçamento!P422","v":"ESQUADRIAS METÁLICAS"},{"$f":"Orçamento!S422","v":0},{"$f":"Orçamento!V422","v":0},{"$f":"Orçamento!X422","v":0}]
["","r.",{"$f":"Orçamento!P423","v":"VIDROS"},{"$f":"Orçamento!S423","v":0},{"$f":"Orçamento!V423","v":0},{"$f":"Orçamento!X423","v":0}]
["","s.",{"$f":"Orçamento!P424","v":"REVESTIMENTO DE PAREDE"},{"$f":"Orçamento!S424","v":0},{"$f":"Orçamento!V424","v":0},{"$f":"Orçamento!X424","v":0}]
["","t.",{"$f":"Orçamento!P425","v":"FORROS"},{"$f":"Orçamento!S425","v":0},{"$f":"Orçamento!V425","v":0},{"$f":"Orçamento!X425","v":0}]
["","u.",{"$f":"Orçamento!P426","v":"REVESTIMENTO DE PISO"},{"$f":"Orçamento!S426","v":0},{"$f":"Orçamento!V426","v":0},{"$f":"Orçamento!X426","v":0}]
["","v.",{"$f":"Orçamento!P427","v":"FERRAGENS"},{"$f":"Orçamento!S427","v":0},{"$f":"Orçamento!V427","v":0},{"$f":"Orçamento!X427","v":0}]
["","w.",{"$f":"Orçamento!P428","v":"MARCENARIA"},{"$f":"Orçamento!S428","v":0},{"$f":"Orçamento!V428","v":0},{"$f":"Orçamento!X428","v":0}]
["","x.",{"$f":"Orçamento!P429","v":"ADMINISTRAÇÃO"},{"$f":"Orçamento!S429","v":0},{"$f":"Orçamento!V429","v":0},{"$f":"Orçamento!X429","v":0}]
["","y.",{"$f":"Orçamento!P430","v":"PINTURA"},{"$f":"Orçamento!S430","v":0},{"$f":"Orçamento!V430","v":0},{"$f":"Orçamento!X430","v":0}]
["","z.",{"$f":"Orçamento!P431","v":"DIVERSOS"},{"$f":"Orçamento!S431","v":0},{"$f":"Orçamento!V431","v":0},{"$f":"Orçamento!X431","v":0}]
["F","TOTAL GERAL DO ORÇAMENTO",null,{"$f":"SUM(D17:D42)","v":0},{"$f":"SUM(E17:E42)","v":0},{"$f":"SUM(F17:F42)","v":0}]
[]
[null,"(*) Para itens da AGETOP, os vidros não estão inclusos nas esquadrias e já foram considerados os custos de contramarco para as esquadrias de alumínio;"]

{"sheet":"Cronog_90_Dias","index":3,"n_rows":99,"n_cols":20,"rows_kept":99,"cut":false,"hidden":false,"merged":[[97,1,97,4],[98,1,98,17],[94,1,94,2],[94,5,94,8],[94,9,94,12],[94,13,94,16],[95,1,95,2],[95,5,95,8],[95,9,95,12],[95,13,95,16],[92,1,92,2],[92,5,92,8],[92,9,92,12],[92,13,92,16],[93,1,93,2],[93,5,93,8],[93,9,93,12],[93,13,93,16],[89,1,91,2],[89,3,91,3],[89,4,91,4],[89,5,89,8],[89,9,89,12],[89,13,89,16],[91,5,91,8],[91,9,91,12],[91,13,91,16],[86,1,88,2],[86,3,88,3],[86,4,88,4],[86,5,86,8],[86,9,86,12],[86,13,86,16],[88,5,88,8],[88,9,88,12],[88,13,88,16],[83,1,85,2],[83,3,85,3],[83,4,85,4],[83,5,83,8],[83,9,83,12],[83,13,83,16],[85,5,85,8],[85,9,85,12],[85,13,85,16],[80,1,82,2],[80,3,82,3],[80,4,82,4],[80,5,80,8],[80,9,80,12],[80,13,80,16],[82,5,82,8],[82,9,82,12],[82,13,82,16],[77,1,79,2],[77,3,79,3],[77,4,79,4],[77,5,77,8],[77,9,77,12],[77,13,77,16],[79,5,79,8],[79,9,79,12],[79,13,79,16],[74,1,76,2],[74,3,76,3],[74,4,76,4],[74,5,74,8],[74,9,74,12],[74,13,74,16],[76,5,76,8],[76,9,76,12],[76,13,76,16],[71,1,73,2],[71,3,73,3],[71,4,73,4],[71,5,71,8],[71,9,71,12],[71,13,71,16],[73,5,73,8],[73,9,73,12],[73,13,73,16],[68,1,70,2],[68,3,70,3],[68,4,70,4],[68,5,68,8],[68,9,68,12],[68,13,68,16],[70,5,70,8],[70,9,70,12],[70,13,70,16],[65,1,67,2],[65,3,67,3],[65,4,67,4],[65,5,65,8],[65,9,65,12],[65,13,65,16],[67,5,67,8],[67,9,67,12],[67,13,67,16],[62,1,64,2],[62,3,64,3],[62,4,64,4],[62,5,62,8],[62,9,62,12],[62,13,62,16],[64,5,64,8],[64,9,64,12],[64,13,64,16],[59,1,61,2],[59,3,61,3],[59,4,61,4],[59,5,59,8],[59,9,59,12],[59,13,59,16],[61,5,61,8],[61,9,61,12],[61,13,61,16],[56,1,58,2],[56,3,58,3],[56,4,58,4],[56,5,56,8],[56,9,56,12],[56,13,56,16],[58,5,58,8],[58,9,58,12],[58,13,58,16],[53,1,55,2],[53,3,55,3],[53,4,55,4],[53,5,53,8],[53,9,53,12],[53,13,53,16],[55,5,55,8],[55,9,55,12],[55,13,55,16],[50,1,52,2],[50,3,52,3],[50,4,52,4],[50,5,50,8],[50,9,50,12],[50,13,50,16],[52,5,52,8],[52,9,52,12],[52,13,52,16],[47,1,49,2],[47,3,49,3],[47,4,49,4],[47,5,47,8],[47,9,47,12],[47,13,47,16],[49,5,49,8],[49,9,49,12],[49,13,49,16],[44,1,46,2],[44,3,46,3],[44,4,46,4],[44,5,44,8],[44,9,44,12],[44,13,44,16],[46,5,46,8],[46,9,46,12],[46,13,46,16],[41,1,43,2],[41,3,43,3],[41,4,43,4],[41,5,41,8],[41,9,41,12],[41,13,41,16],[43,5,43,8],[43,9,43,12],[43,13,43,16],[38,1,40,2],[38,3,40,3],[38,4,40,4],[38,5,38,8],[38,9,38,12],[38,13,38,16],[40,5,40,8],[40,9,40,12],[40,13,40,16],[35,1,37,2],[35,3,37,3],[35,4,37,4],[35,5,35,8],[35,9,35,12],[35,13,35,16],[37,5,37,8],[37,9,37,12],[37,13,37,16],[32,1,34,2],[32,3,34,3],[32,4,34,4],[32,5,32,8],[32,9,32,12],[32,13,32,16],[34,5,34,8],[34,9,34,12],[34,13,34,16],[29,1,31,2],[29,3,31,3],[29,4,31,4],[29,5,29,8],[29,9,29,12],[29,13,29,16],[31,5,31,8],[31,9,31,12],[31,13,31,16],[26,1,28,2],[26,3,28,3],[26,4,28,4],[26,5,26,8],[26,9,26,12],[26,13,26,16],[28,5,28,8],[28,9,28,12],[28,13,28,16],[23,1,25,2],[23,3,25,3],[23,4,25,4],[23,5,23,8],[23,9,23,12],[23,13,23,16],[25,5,25,8],[25,9,25,12],[25,13,25,16],[20,1,22,2],[20,3,22,3],[20,4,22,4],[20,5,20,8],[20,9,20,12],[20,13,20,16],[22,5,22,8],[22,9,22,12],[22,13,22,16],[17,1,19,2],[17,3,19,3],[17,4,19,4],[17,5,17,8],[17,9,17,12],[17,13,17,16],[19,5,19,8],[19,9,19,12],[19,13,19,16],[14,1,16,2],[14,3,16,3],[14,4,16,4],[14,5,14,8],[14,9,14,12],[14,13,14,16],[16,5,16,8],[16,9,16,12],[16,13,16,16],[12,0,13,0],[12,3,13,3],[12,5,12,8],[12,9,12,12],[12,13,12,16],[12,17,13,17],[13,1,13,2],[13,5,13,8],[13,9,13,12],[13,13,13,16],[0,1,0,17],[1,1,1,17],[2,1,2,7],[2,8,2,17],[3,1,3,7],[3,8,3,17],[8,1,8,7],[8,8,8,17],[9,0,11,0],[9,1,9,7],[9,8,9,17],[10,1,10,17],[11,1,11,17],[4,1,4,17],[5,1,5,7],[5,8,5,17],[6,1,6,7],[6,8,6,17],[7,1,7,17]]}
[]
[]
[null,"UNIDADE ESCOLAR",null,null,null,null,null,null,"PRAZO"]
[null,{"$f":"Orçamento!O4","v":"COLÉGIO ESTADUAL DESOR HAMILTON BARROS VELASCO"},null,null,null,null,null,null,"90 DIAS CORRIDOS"]
[]
[null,"OBRA",null,null,null,null,null,null,"DATA"]
[null,{"$f":"Orçamento!O7","v":"AMPLIAÇÃO E REFORMA"},null,null,null,null,null,null,{"$f":"Orçamento!S7","v":"2020-05-12"}]
[]
[null,"LOCAL",null,null,null,null,null,null,"ÁREA TOTAL CONSTRUÍDA (M²)"]
["FILTRO",{"$f":"Orçamento!V7","v":"PALMINÓPOLIS"},null,null,null,null,null,null,{"$f":"Orçamento!V13","v":2392.0899999999997}]
[]
[null,"CRONOGRAMA - FÍSICO FINANCEIRO"]
["↓","CUSTO TOTAL:",{"$f":"D93","v":0},"VALOR","Dias:",30,null,null,null,60,null,null,null,90,null,null,null,"TOTAL"]
[null,"DESCRIÇÃO DOS SERVIÇOS",null,null,"%","1ª PARCELA",null,null,null,"2ª PARCELA",null,null,null,"3ª PARCELA"]
[{"$f":"IF(D15>0,\"F\",\"\")","v":""},"SERVIÇOS PRELIMINARES",null,{"$f":"Orçamento!V406","v":0},{"$f":"Orçamento!X406","v":0},{"$f":"ROUND(F17*$D$15,2)","v":0},null,null,null,{"$f":"ROUND(J17*$D$15,2)","v":0},null,null,null,{"$f":"ROUND(N17*$D$15,2)","v":0},null,null,null,{"$f":"SUM(F15:Q15)","v":0},null,{"$f":"IF(D15=R15,\"OK\",\"ERRO\")","v":"OK"}]
[{"$f":"IF(A15=\"F\",A15,\"\")","v":""}]
[{"$f":"IF(A16=\"F\",A16,\"\")","v":""},null,null,null,null,1,null,null,null,0,null,null,null,{"$f":"1-F17-J17","v":0},null,null,null,{"$f":"IFERROR(E15/100,\"\")","v":0},null,{"$f":"IF(E15=R17*100,\"OK\",\"ERRO\")","v":"OK"}]
[{"$f":"IF(D18>0,\"F\",\"\")","v":""},"TRANSPORTES",null,{"$f":"Orçamento!V407","v":0},{"$f":"Orçamento!X407","v":0},{"$f":"ROUND(F20*$D$18,2)","v":0},null,null,null,{"$f":"ROUND(J20*$D$18,2)","v":0},null,null,null,{"$f":"ROUND(N20*$D$18,2)","v":0},null,null,null,{"$f":"SUM(F18:Q18)","v":0},null,{"$f":"IF(D18=R18,\"OK\",\"ERRO\")","v":"OK"}]
[{"$f":"IF(A18=\"F\",A18,\"\")","v":""}]
[{"$f":"IF(A19=\"F\",A19,\"\")","v":""},null,null,null,null,0.37,null,null,null,0.3,null,null,null,{"$f":"1-F20-J20","v":0.33},null,null,null,{"$f":"IFERROR(E18/100,\"\")","v":0},null,{"$f":"IF(E18=R20*100,\"OK\",\"ERRO\")","v":"OK"}]
[{"$f":"IF(D21>0,\"F\",\"\")","v":""},"SERVIÇO EM TERRA",null,{"$f":"Orçamento!V408","v":0},{"$f":"Orçamento!X408","v":0},{"$f":"ROUND(F23*$D$21,2)","v":0},null,null,null,{"$f":"ROUND(J23*$D$21,2)","v":0},null,null,null,{"$f":"ROUND(N23*$D$21,2)","v":0},null,null,null,{"$f":"SUM(F21:Q21)","v":0},null,{"$f":"IF(D21=R21,\"OK\",\"ERRO\")","v":"OK"}]
[{"$f":"IF(A21=\"F\",A21,\"\")","v":""}]
[{"$f":"IF(A22=\"F\",A22,\"\")","v":""},null,null,null,null,1,null,null,null,0,null,null,null,{"$f":"1-F23-J23","v":0},null,null,null,{"$f":"IFERROR(E21/100,\"\")","v":0},null,{"$f":"IF(E21=R23*100,\"OK\",\"ERRO\")","v":"OK"}]
[{"$f":"IF(D24>0,\"F\",\"\")","v":""},"FUNDAÇÕES E SONDAGENS",null,{"$f":"Orçamento!V409","v":0},{"$f":"Orçamento!X409","v":0},{"$f":"ROUND(F26*$D$24,2)","v":0},null,null,null,{"$f":"ROUND(J26*$D$24,2)","v":0},null,null,null,{"$f":"ROUND(N26*$D$24,2)","v":0},null,null,null,{"$f":"SUM(F24:Q24)","v":0},null,{"$f":"IF(D24=R24,\"OK\",\"ERRO\")","v":"OK"}]
[{"$f":"IF(A24=\"F\",A24,\"\")","v":""}]
[{"$f":"IF(A25=\"F\",A25,\"\")","v":""},null,null,null,null,1,null,null,null,0,null,null,null,{"$f":"1-F26-J26","v":0},null,null,null,{"$f":"IFERROR(E24/100,\"\")","v":0},null,{"$f":"IF(E24=R26*100,\"OK\",\"ERRO\")","v":"OK"}]
[{"$f":"IF(D27>0,\"F\",\"\")","v":""},"ESTRUTURA",null,{"$f":"Orçamento!V410","v":0},{"$f":"Orçamento!X410","v":0},{"$f":"ROUND(F29*$D$27,2)","v":0},null,null,null,{"$f":"ROUND(J29*$D$27,2)","v":0},null,null,null,{"$f":"ROUND(N29*$D$27,2)","v":0},null,null,null,{"$f":"SUM(F27:Q27)","v":0},null,{"$f":"IF(D27=R27,\"OK\",\"ERRO\")","v":"OK"}]
[{"$f":"IF(A27=\"F\",A27,\"\")","v":""}]
[{"$f":"IF(A28=\"F\",A28,\"\")","v":""},null,null,null,null,0.54,null,null,null,0.46,null,null,null,{"$f":"1-F29-J29","v":0},null,null,null,{"$f":"IFERROR(E27/100,\"\")","v":0},null,{"$f":"IF(E27=R29*100,\"OK\",\"ERRO\")","v":"OK"}]
[{"$f":"IF(D30>0,\"F\",\"\")","v":""},"INST.ELET/TELEFÔNICA/CABEAMENTO ESTRUTURADO",null,{"$f":"Orçamento!V411","v":0},{"$f":"Orçamento!X411","v":0},{"$f":"ROUND(F32*$D$30,2)","v":0},null,null,null,{"$f":"ROUND(J32*$D$30,2)","v":0},null,null,null,{"$f":"ROUND(N32*$D$30,2)","v":0},null,null,null,{"$f":"SUM(F30:Q30)","v":0},null,{"$f":"IF(D30=R30,\"OK\",\"ERRO\")","v":"OK"}]
[{"$f":"IF(A30=\"F\",A30,\"\")","v":""}]
[{"$f":"IF(A31=\"F\",A31,\"\")","v":""},null,null,null,null,0,null,null,null,{"$f":"1-B32","v":1},null,null,null,{"$f":"1-F32-J32","v":0},null,null,null,{"$f":"IFERROR(E30/100,\"\")","v":0},null,{"$f":"IF(E30=R32*100,\"OK\",\"ERRO\")","v":"OK"}]
[{"$f":"IF(D33>0,\"F\",\"\")","v":""},"INSTALAÇÕES HIDROSSANITÁRIAS",null,{"$f":"Orçamento!V412","v":0},{"$f":"Orçamento!X412","v":0},{"$f":"ROUND(F35*$D$33,2)","v":0},null,null,null,{"$f":"ROUND(J35*$D$33,2)","v":0},null,null,null,{"$f":"ROUND(N35*$D$33,2)","v":0},null,null,null,{"$f":"SUM(F33:Q33)","v":0},null,{"$f":"IF(D33=R33,\"OK\",\"ERRO\")","v":"OK"}]
[{"$f":"IF(A33=\"F\",A33,\"\")","v":""}]
[{"$f":"IF(A34=\"F\",A34,\"\")","v":""},null,null,null,null,0,null,null,null,{"$f":"1-B35","v":1},null,null,null,{"$f":"1-F35-J35","v":0},null,null,null,{"$f":"IFERROR(E33/100,\"\")","v":0},null,{"$f":"IF(E33=R35*100,\"OK\",\"ERRO\")","v":"OK"}]
[{"$f":"IF(D36>0,\"F\",\"\")","v":""},"INSTALAÇÕES ESPECIAIS",null,{"$f":"Orçamento!V413","v":0},{"$f":"Orçamento!X413","v":0},{"$f":"ROUND(F38*$D$36,2)","v":0},null,null,null,{"$f":"ROUND(J38*$D$36,2)","v":0},null,null,null,{"$f":"ROUND(N38*$D$36,2)","v":0},null,null,null,{"$f":"SUM(F36:Q36)","v":0},null,{"$f":"IF(D36=R36,\"OK\",\"ERRO\")","v":"OK"}]
[{"$f":"IF(A36=\"F\",A36,\"\")","v":""}]
[{"$f":"IF(A37=\"F\",A37,\"\")","v":""},null,null,null,null,0,null,null,null,{"$f":"1-B38","v":1},null,null,null,{"$f":"1-F38-J38","v":0},null,null,null,{"$f":"IFERROR(E36/100,\"\")","v":0},null,{"$f":"IF(E36=R38*100,\"OK\",\"ERRO\")","v":"OK"}]
[{"$f":"IF(D39>0,\"F\",\"\")","v":""},"ALVENARIA E DIVISÓRIAS",null,{"$f":"Orçamento!V414","v":0},{"$f":"Orçamento!X414","v":0},{"$f":"ROUND(F41*$D$39,2)","v":0},null,null,null,{"$f":"ROUND(J41*$D$39,2)","v":0},null,null,null,{"$f":"ROUND(N41*$D$39,2)","v":0},null,null,null,{"$f":"SUM(F39:Q39)","v":0},null,{"$f":"IF(D39=R39,\"OK\",\"ERRO\")","v":"OK"}]
[{"$f":"IF(A39=\"F\",A39,\"\")","v":""}]
[{"$f":"IF(A40=\"F\",A40,\"\")","v":""},null,null,null,null,0,null,null,null,{"$f":"1-B41","v":1},null,null,null,{"$f":"1-F41-J41","v":0},null,null,null,{"$f":"IFERROR(E39/100,\"\")","v":0},null,{"$f":"IF(E39=R41*100,\"OK\",\"ERRO\")","v":"OK"}]
[{"$f":"IF(D42>0,\"F\",\"\")","v":""},"ALVENARIA AUTO-PORTANTE",null,{"$f":"Orçamento!V415","v":0},{"$f":"Orçamento!X415","v":0},{"$f":"ROUND(F44*$D$42,2)","v":0},null,null,null,{"$f":"ROUND(J44*$D$42,2)","v":0},null,null,null,{"$f":"ROUND(N44*$D$42,2)","v":0},null,null,null,{"$f":"SUM(F42:Q42)","v":0},null,{"$f":"IF(D42=R42,\"OK\",\"ERRO\")","v":"OK"}]
[{"$f":"IF(A42=\"F\",A42,\"\")","v":""}]
[{"$f":"IF(A43=\"F\",A43,\"\")","v":""},null,null,null,null,0,null,null,null,{"$f":"1-B44","v":1},null,null,null,{"$f":"1-F44-J44","v":0},null,null,null,{"$f":"IFERROR(E42/100,\"\")","v":0},null,{"$f":"IF(E42=R44*100,\"OK\",\"ERRO\")","v":"OK"}]
[{"$f":"IF(D45>0,\"F\",\"\")","v":""},"IMPERMEABILIZAÇÃO",null,{"$f":"Orçamento!V416","v":0},{"$f":"Orçamento!X416","v":0},{"$f":"ROUND(F47*$D$45,2)","v":0},null,null,null,{"$f":"ROUND(J47*$D$45,2)","v":0},null,null,null,{"$f":"ROUND(N47*$D$45,2)","v":0},null,null,null,{"$f":"SUM(F45:Q45)","v":0},null,{"$f":"IF(D45=R45,\"OK\",\"ERRO\")","v":"OK"}]
[{"$f":"IF(A45=\"F\",A45,\"\")","v":""}]
[{"$f":"IF(A46=\"F\",A46,\"\")","v":""},null,null,null,null,0.85,null,null,null,0.15,null,null,null,{"$f":"1-F47-J47","v":0},null,null,null,{"$f":"IFERROR(E45/100,\"\")","v":0},null,{"$f":"IF(E45=R47*100,\"OK\",\"ERRO\")","v":"OK"}]
[{"$f":"IF(D48>0,\"F\",\"\")","v":""},"ISOLAMENTO TÉRMICO E ACÚSTICO",null,{"$f":"Orçamento!V417","v":0},{"$f":"Orçamento!X417","v":0},{"$f":"ROUND(F50*$D$48,2)","v":0},null,null,null,{"$f":"ROUND(J50*$D$48,2)","v":0},null,null,null,{"$f":"ROUND(N50*$D$48,2)","v":0},null,null,null,{"$f":"SUM(F48:Q48)","v":0},null,{"$f":"IF(D48=R48,\"OK\",\"ERRO\")","v":"OK"}]
[{"$f":"IF(A48=\"F\",A48,\"\")","v":""}]
[{"$f":"IF(A49=\"F\",A49,\"\")","v":""},null,null,null,null,0,null,null,null,{"$f":"1-B50","v":1},null,null,null,{"$f":"1-F50-J50","v":0},null,null,null,{"$f":"IFERROR(E48/100,\"\")","v":0},null,{"$f":"IF(E48=R50*100,\"OK\",\"ERRO\")","v":"OK"}]
[{"$f":"IF(D51>0,\"F\",\"\")","v":""},"ESTRUTURA DE MADEIRA",null,{"$f":"Orçamento!V418","v":0},{"$f":"Orçamento!X418","v":0},{"$f":"ROUND(F53*$D$51,2)","v":0},null,null,null,{"$f":"ROUND(J53*$D$51,2)","v":0},null,null,null,{"$f":"ROUND(N53*$D$51,2)","v":0},null,null,null,{"$f":"SUM(F51:Q51)","v":0},null,{"$f":"IF(D51=R51,\"OK\",\"ERRO\")","v":"OK"}]
[{"$f":"IF(A51=\"F\",A51,\"\")","v":""}]
[{"$f":"IF(A52=\"F\",A52,\"\")","v":""},null,null,null,null,0,null,null,null,0.57999999999999996,null,null,null,{"$f":"1-F53-J53","v":0.42000000000000004},null,null,null,{"$f":"IFERROR(E51/100,\"\")","v":0},null,{"$f":"IF(E51=R53*100,\"OK\",\"ERRO\")","v":"OK"}]
[{"$f":"IF(D54>0,\"F\",\"\")","v":""},"ESTRUTURA METÁLICA",null,{"$f":"Orçamento!V419","v":0},{"$f":"Orçamento!X419","v":0},{"$f":"ROUND(F56*$D$54,2)","v":0},null,null,null,{"$f":"ROUND(J56*$D$54,2)","v":0},null,null,null,{"$f":"ROUND(N56*$D$54,2)","v":0},null,null,null,{"$f":"SUM(F54:Q54)","v":0},null,{"$f":"IF(D54=R54,\"OK\",\"ERRO\")","v":"OK"}]
[{"$f":"IF(A54=\"F\",A54,\"\")","v":""}]
[{"$f":"IF(A55=\"F\",A55,\"\")","v":""},null,null,null,null,0,null,null,null,0.57999999999999996,null,null,null,{"$f":"1-F56-J56","v":0.42000000000000004},null,null,null,{"$f":"IFERROR(E54/100,\"\")","v":0},null,{"$f":"IF(E54=R56*100,\"OK\",\"ERRO\")","v":"OK"}]
[{"$f":"IF(D57>0,\"F\",\"\")","v":""},"COBERTURAS",null,{"$f":"Orçamento!V420","v":0},{"$f":"Orçamento!X420","v":0},{"$f":"ROUND(F59*$D$57,2)","v":0},null,null,null,{"$f":"ROUND(J59*$D$57,2)","v":0},null,null,null,{"$f":"ROUND(N59*$D$57,2)","v":0},null,null,null,{"$f":"SUM(F57:Q57)","v":0},null,{"$f":"IF(D57=R57,\"OK\",\"ERRO\")","v":"OK"}]
[{"$f":"IF(A57=\"F\",A57,\"\")","v":""}]
[{"$f":"IF(A58=\"F\",A58,\"\")","v":""},null,null,null,null,0,null,null,null,0,null,null,null,{"$f":"1-F59-J59","v":1},null,null,null,{"$f":"IFERROR(E57/100,\"\")","v":0},null,{"$f":"IF(E57=R59*100,\"OK\",\"ERRO\")","v":"OK"}]
[{"$f":"IF(D60>0,\"F\",\"\")","v":""},"ESQUADRIAS DE MADEIRA",null,{"$f":"Orçamento!V421","v":0},{"$f":"Orçamento!X421","v":0},{"$f":"ROUND(F62*$D$60,2)","v":0},null,null,null,{"$f":"ROUND(J62*$D$60,2)","v":0},null,null,null,{"$f":"ROUND(N62*$D$60,2)","v":0},null,null,null,{"$f":"SUM(F60:Q60)","v":0},null,{"$f":"IF(D60=R60,\"OK\",\"ERRO\")","v":"OK"}]
[{"$f":"IF(A60=\"F\",A60,\"\")","v":""}]
[{"$f":"IF(A61=\"F\",A61,\"\")","v":""},null,null,null,null,0,null,null,null,0.4,null,null,null,{"$f":"1-F62-J62","v":0.6},null,null,null,{"$f":"IFERROR(E60/100,\"\")","v":0},null,{"$f":"IF(E60=R62*100,\"OK\",\"ERRO\")","v":"OK"}]
[{"$f":"IF(D63>0,\"F\",\"\")","v":""},"ESQUADRIAS METÁLICAS",null,{"$f":"Orçamento!V422","v":0},{"$f":"Orçamento!X422","v":0},{"$f":"ROUND(F65*$D$63,2)","v":0},null,null,null,{"$f":"ROUND(J65*$D$63,2)","v":0},null,null,null,{"$f":"ROUND(N65*$D$63,2)","v":0},null,null,null,{"$f":"SUM(F63:Q63)","v":0},null,{"$f":"IF(D63=R63,\"OK\",\"ERRO\")","v":"OK"}]
[{"$f":"IF(A63=\"F\",A63,\"\")","v":""}]
[{"$f":"IF(A64=\"F\",A64,\"\")","v":""},null,null,null,null,0,null,null,null,0.45,null,null,null,{"$f":"1-F65-J65","v":0.55000000000000004},null,null,null,{"$f":"IFERROR(E63/100,\"\")","v":0},null,{"$f":"IF(E63=R65*100,\"OK\",\"ERRO\")","v":"OK"}]
[{"$f":"IF(D66>0,\"F\",\"\")","v":""},"VIDROS",null,{"$f":"Orçamento!V423","v":0},{"$f":"Orçamento!X423","v":0},{"$f":"ROUND(F68*$D$66,2)","v":0},null,null,null,{"$f":"ROUND(J68*$D$66,2)","v":0},null,null,null,{"$f":"ROUND(N68*$D$66,2)","v":0},null,null,null,{"$f":"SUM(F66:Q66)","v":0},null,{"$f":"IF(D66=R66,\"OK\",\"ERRO\")","v":"OK"}]
[{"$f":"IF(A66=\"F\",A66,\"\")","v":""}]
[{"$f":"IF(A67=\"F\",A67,\"\")","v":""},null,null,null,null,0,null,null,null,0,null,null,null,{"$f":"1-F68-J68","v":1},null,null,null,{"$f":"IFERROR(E66/100,\"\")","v":0},null,{"$f":"IF(E66=R68*100,\"OK\",\"ERRO\")","v":"OK"}]
[{"$f":"IF(D69>0,\"F\",\"\")","v":""},"REVESTIMENTO DE PAREDE",null,{"$f":"Orçamento!V424","v":0},{"$f":"Orçamento!X424","v":0},{"$f":"ROUND(F71*$D$69,2)","v":0},null,null,null,{"$f":"ROUND(J71*$D$69,2)","v":0},null,null,null,{"$f":"ROUND(N71*$D$69,2)","v":0},null,null,null,{"$f":"SUM(F69:Q69)","v":0},null,{"$f":"IF(D69=R69,\"OK\",\"ERRO\")","v":"OK"}]
[{"$f":"IF(A69=\"F\",A69,\"\")","v":""}]
[{"$f":"IF(A70=\"F\",A70,\"\")","v":""},null,null,null,null,0,null,null,null,0.4,null,null,null,{"$f":"1-F71-J71","v":0.6},null,null,null,{"$f":"IFERROR(E69/100,\"\")","v":0},null,{"$f":"IF(E69=R71*100,\"OK\",\"ERRO\")","v":"OK"}]
[{"$f":"IF(D72>0,\"F\",\"\")","v":""},"FORROS",null,{"$f":"Orçamento!V425","v":0},{"$f":"Orçamento!X425","v":0},{"$f":"ROUND(F74*$D$72,2)","v":0},null,null,null,{"$f":"ROUND(J74*$D$72,2)","v":0},null,null,null,{"$f":"ROUND(N74*$D$72,2)","v":0},null,null,null,{"$f":"SUM(F72:Q72)","v":0},null,{"$f":"IF(D72=R72,\"OK\",\"ERRO\")","v":"OK"}]
[{"$f":"IF(A72=\"F\",A72,\"\")","v":""}]
[{"$f":"IF(A73=\"F\",A73,\"\")","v":""},null,null,null,null,0,null,null,null,0.4,null,null,null,{"$f":"1-F74-J74","v":0.6},null,null,null,{"$f":"IFERROR(E72/100,\"\")","v":0},null,{"$f":"IF(E72=R74*100,\"OK\",\"ERRO\")","v":"OK"}]
[{"$f":"IF(D75>0,\"F\",\"\")","v":""},"REVESTIMENTO DE PISO",null,{"$f":"Orçamento!V426","v":0},{"$f":"Orçamento!X426","v":0},{"$f":"ROUND(F77*$D$75,2)","v":0},null,null,null,{"$f":"ROUND(J77*$D$75,2)","v":0},null,null,null,{"$f":"ROUND(N77*$D$75,2)","v":0},null,null,null,{"$f":"SUM(F75:Q75)","v":0},null,{"$f":"IF(D75=R75,\"OK\",\"ERRO\")","v":"OK"}]
[{"$f":"IF(A75=\"F\",A75,\"\")","v":""}]
[{"$f":"IF(A76=\"F\",A76,\"\")","v":""},null,null,null,null,0,null,null,null,0.4,null,null,null,{"$f":"1-F77-J77","v":0.6},null,null,null,{"$f":"IFERROR(E75/100,\"\")","v":0},null,{"$f":"IF(E75=R77*100,\"OK\",\"ERRO\")","v":"OK"}]
[{"$f":"IF(D78>0,\"F\",\"\")","v":""},"FERRAGENS",null,{"$f":"Orçamento!V427","v":0},{"$f":"Orçamento!X427","v":0},{"$f":"ROUND(F80*$D$78,2)","v":0},null,null,null,{"$f":"ROUND(J80*$D$78,2)","v":0},null,null,null,{"$f":"ROUND(N80*$D$78,2)","v":0},null,null,null,{"$f":"SUM(F78:Q78)","v":0},null,{"$f":"IF(D78=R78,\"OK\",\"ERRO\")","v":"OK"}]
[{"$f":"IF(A78=\"F\",A78,\"\")","v":""}]
[{"$f":"IF(A79=\"F\",A79,\"\")","v":""},null,null,null,null,0,null,null,null,0,null,null,null,{"$f":"1-F80-J80","v":1},null,null,null,{"$f":"IFERROR(E78/100,\"\")","v":0},null,{"$f":"IF(E78=R80*100,\"OK\",\"ERRO\")","v":"OK"}]
[{"$f":"IF(D81>0,\"F\",\"\")","v":""},"MARCENARIA",null,{"$f":"Orçamento!V428","v":0},{"$f":"Orçamento!X428","v":0},{"$f":"ROUND(F83*$D$81,2)","v":0},null,null,null,{"$f":"ROUND(J83*$D$81,2)","v":0},null,null,null,{"$f":"ROUND(N83*$D$81,2)","v":0},null,null,null,{"$f":"SUM(F81:Q81)","v":0},null,{"$f":"IF(D81=R81,\"OK\",\"ERRO\")","v":"OK"}]
[{"$f":"IF(A81=\"F\",A81,\"\")","v":""}]
[{"$f":"IF(A82=\"F\",A82,\"\")","v":""},null,null,null,null,0,null,null,null,0,null,null,null,{"$f":"1-F83-J83","v":1},null,null,null,{"$f":"IFERROR(E81/100,\"\")","v":0},null,{"$f":"IF(E81=R83*100,\"OK\",\"ERRO\")","v":"OK"}]
[{"$f":"IF(D84>0,\"F\",\"\")","v":""},"ADMINISTRAÇÃO - MENSALISTAS",null,{"$f":"Orçamento!V429","v":0},{"$f":"Orçamento!X429","v":0},{"$f":"ROUND(F86*$D$84,2)","v":0},null,null,null,{"$f":"ROUND(J86*$D$84,2)","v":0},null,null,null,{"$f":"ROUND(N86*$D$84,2)","v":0},null,null,null,{"$f":"SUM(F84:Q84)","v":0},null,{"$f":"IF(D84=R84,\"OK\",\"ERRO\")","v":"OK"}]
[{"$f":"IF(A84=\"F\",A84,\"\")","v":""}]
[{"$f":"IF(A85=\"F\",A85,\"\")","v":""},null,null,null,null,0.34,null,null,null,0.33,null,null,null,0.33,null,null,null,{"$f":"IFERROR(E84/100,\"\")","v":0},null,{"$f":"IF(E84=R86*100,\"OK\",\"ERRO\")","v":"OK"}]
[{"$f":"IF(D87>0,\"F\",\"\")","v":""},"PINTURA",null,{"$f":"Orçamento!V430","v":0},{"$f":"Orçamento!X430","v":0},{"$f":"ROUND(F89*$D$87,2)","v":0},null,null,null,{"$f":"ROUND(J89*$D$87,2)","v":0},null,null,null,{"$f":"ROUND(N89*$D$87,2)","v":0},null,null,null,{"$f":"SUM(F87:Q87)","v":0},null,{"$f":"IF(D87=R87,\"OK\",\"ERRO\")","v":"OK"}]
[{"$f":"IF(A87=\"F\",A87,\"\")","v":""}]
[{"$f":"IF(A88=\"F\",A88,\"\")","v":""},null,null,null,null,0,null,null,null,0,null,null,null,{"$f":"1-F89-J89","v":1},null,null,null,{"$f":"IFERROR(E87/100,\"\")","v":0},null,{"$f":"IF(E87=R89*100,\"OK\",\"ERRO\")","v":"OK"}]
[{"$f":"IF(D90>0,\"F\",\"\")","v":""},"DIVERSOS",null,{"$f":"Orçamento!V431","v":0},{"$f":"Orçamento!X431","v":0},{"$f":"ROUND(F92*$D$90,2)","v":0},null,null,null,{"$f":"ROUND(J92*$D$90,2)","v":0},null,null,null,{"$f":"ROUND(N92*$D$90,2)","v":0},null,null,null,{"$f":"SUM(F90:Q90)","v":0},null,{"$f":"IF(D90=R90,\"OK\",\"ERRO\")","v":"OK"}]
[{"$f":"IF(A90=\"F\",A90,\"\")","v":""}]
[{"$f":"IF(A91=\"F\",A91,\"\")","v":""},null,null,null,null,0,null,null,null,0,null,null,null,{"$f":"1-F92-J92","v":1},null,null,null,{"$f":"IFERROR(E90/100,\"\")","v":0},null,{"$f":"IF(E90=R92*100,\"OK\",\"ERRO\")","v":"OK"}]
["F","CUSTO DO ORÇAMENTO",null,{"$f":"SUM(D15:D92)","v":0},{"$f":"SUM(E15:E92)","v":0},{"$f":"F15+F18+F21+F24+F27+F30+F33+F36+F39+F42+F45+F48+F51+F54+F57+F60+F63+F66+F69+F72+F75+F78+F81+F84+F87+F90","v":0},null,null,null,{"$f":"J15+J18+J21+J24+J27+J30+J33+J36+J39+J42+J45+J48+J51+J54+J57+J60+J63+J66+J69+J72+J75+J78+J81+J84+J87+J90","v":0},null,null,null,{"$f":"N15+N18+N21+N24+N27+N30+N33+N36+N39+N42+N45+N48+N51+N54+N57+N60+N63+N66+N69+N72+N75+N78+N81+N84+N87+N90","v":0},null,null,null,{"$f":"R15+R18+R21+R24+R27+R30+R33+R36+R39+R42+R45+R48+R51+R54+R57+R60+R63+R66+R69+R72+R75+R78+R81+R84+R87+R90","v":0}]
["F","PERCENTUAIS:",null,null,null,{"$f":"IFERROR(F93/D93,\"\")","v":""},null,null,null,{"$f":"IFERROR(J93/D93,\"\")","v":""},null,null,null,{"$f":"IFERROR(N93/D93,\"\")","v":""},null,null,null,{"$f":"SUM(F94:Q94)","v":0}]
["F","TOTAIS ACUMULADOS:",null,null,null,{"$f":"F93","v":0},null,null,null,{"$f":"F95+J93","v":0},null,null,null,{"$f":"J95+N93","v":0}]
["F","PERCENTUAIS  ACUMULADOS:",null,null,null,{"$f":"F94","v":""},null,null,null,{"$f":"J94+F96","v":{"$error":"#VALUE!"}},null,null,null,{"$f":"IFERROR(J96+N94,\"\")","v":""}]
["F"]
["F","OBSERVAÇÕES:"]
["F","Os pagamentos somente poderão ser efetuados mediante medição e atesto pelos técnicos da Secretaria da Educação. "]

{"sheet":"Composição BDI","index":4,"n_rows":45,"n_cols":9,"rows_kept":45,"cut":false,"hidden":false,"merged":[[18,5,18,8],[17,0,17,3],[16,0,16,3],[44,0,44,3],[42,0,42,3],[43,0,43,3],[18,0,18,3],[36,0,36,3],[39,0,39,3],[38,0,38,3],[40,0,40,3],[29,0,29,2],[32,0,32,3],[33,0,33,3],[34,0,34,3],[35,0,35,3],[0,0,0,3],[1,0,1,3],[4,0,4,3],[7,0,7,3],[10,0,10,3],[2,0,2,3],[3,0,3,3],[5,0,5,3],[6,0,6,3],[8,0,8,3],[9,0,9,3],[11,0,11,3],[12,0,12,3],[14,0,14,3],[15,0,15,3],[13,0,13,3]]}
[]
[]
["UNIDADE ESCOLAR"]
[{"$f":"Orçamento!$O$4","v":"COLÉGIO ESTADUAL DESOR HAMILTON BARROS VELASCO"}]
[]
["OBRA"]
[{"$f":"Orçamento!$O$7","v":"AMPLIAÇÃO E REFORMA"}]
[]
["ENDEREÇO"]
[{"$f":"Orçamento!$R$10","v":"RUA DEP ANTONIO Q BARRETO, CENTRO, CEP:75990-000"}]
[]
["CIDADE"]
[{"$f":"Orçamento!$V$7","v":"PALMINÓPOLIS"}]
[]
["CRE"]
[{"$f":"Orçamento!$O$10","v":"PALMEIRAS"}]
[]
["DETALHAMENTO DA COMPOSIÇÃO DE BDI"]
["COMPOSIÇÃO BDI PARA OBRAS CIVIS",null,null,null,null,"BDI CONSTRUÇÃO E REFORMA"]
["DESCRIÇÃO","COEF.","TAXA % (a.m)","% no preço de venda",null,"Situação","1º Quartil","Médio","3º Quartil"]
["1) COFINS",1,0.03,{"$f":"C21","v":0.03},null,{"$f":"IF(OR(C21<G21,C21>I21),\"FORA DO INTERVALO\",\"OK\")","v":"OK"},0.03,0.03,0.03]
["2) PIS",1,6.4999999999999997E-3,{"$f":"C22","v":6.4999999999999997E-3},null,{"$f":"IF(OR(C22<G22,C22>I22),\"FORA DO INTERVALO\",\"OK\")","v":"OK"},6.4999999999999997E-3,6.4999999999999997E-3,6.4999999999999997E-3]
["3) ISSQN",1,0.02,{"$f":"C23*B23","v":0.02},null,"OK",0.02,3.5000000000000003E-2,0.05]
["4) CPRB",1,4.4999999999999998E-2,{"$f":"C24","v":4.4999999999999998E-2},null,"OK",4.4999999999999998E-2,4.4999999999999998E-2,4.4999999999999998E-2]
["5) Administração Central",1,4.0399999999999998E-2,4.0399999999999998E-2,null,"OK",0.03,0.04,5.5E-2]
["6) Despesas Financeiras",1,5.5999999999999999E-3,5.5999999999999999E-3,null,"FORA DO INTERVALO",5.8999999999999999E-3,1.23E-2,1.3899999999999999E-2]
["7) Seguros + Garantias",1,1.1999999999999999E-3,1.1999999999999999E-3,null,"FORA DO INTERVALO",8.0000000000000002E-3,8.0000000000000002E-3,0.01]
["8) Risco",1,9.7000000000000003E-3,9.7000000000000003E-3,null,"OK",9.7000000000000003E-3,1.2699999999999999E-2,1.2699999999999999E-2]
["9) Lucro",1,7.3999999999999996E-2,7.3999999999999996E-2,null,"OK",6.1600000000000002E-2,7.3999999999999996E-2,8.9599999999999999E-2]
["BDI - FINAL",null,null,{"$f":"(((1+D25+D27+D28)*(1+D26)*(1+D29))/(1-(D21+D22+D23+D24))-1)","v":0.26368295906510886},null,{"$f":"IF(OR(D30<G30,D30>I30),\"FORA DO INTERVALO\",\"OK\")","v":"FORA DO INTERVALO"},0.2034,0.22120000000000001,0.25]
[]
["Notas:"]
["(1) e (2) Alíquota definida por lei."]
["(3) Alíquota e base de cálculo definidas pela legislação municipal."]
["(4) Alíquota definida pelas leis 12.546/11, 12844/13 e 13.161/15 (CPRB – contribuição previdenciária sobre a receita bruta)."]
["(5) Valores definidos a partir dos limites no Acórdão nº 2.622/2013 - TCU – Plenário. Valores entre o 1º e 3º quartis."]
["(6) Valor calculado pela expressão matemática do acórdão 2.369/2011 – TCU – Plenário e disponibilizado pela AGETOP em dezembro de 2018. (Foi utilizado para o cálculo a média da Taxa SELIC no período de 11/2017 a 10/2018)"]
[]
["(7) Valores definidos pela AGETOP a partir dos limites no Acórdão nº 2.622/2013 - TCU – Plenário. Valores médios. \n\nObservação da AGETOP: (Seguros contra erros de execução, incêndio e explosão, danos da natureza (vendaval, destelhamento, alagamento, inundação, desmoronamento, geadas etc.), emprego de material defeituoso ou inadequado, roubo e/ou furto qualificado, quebra de equipamentos, desmoronamento de estrutura, nas modalidades de Obras Civis em Construção (OCC); Instalação e Montagem (IM); e Obras Civis em Construção e Instalação e Montagem (OCC/IM). Bem como coberturas adicionais para ampliação dessas coberturas básicas, como: cobertura de responsabilidade civil geral, cobertura de responsabilidade civil cruzada, cobertura de despesas extraordinárias, cobertura de tumultos, cobertura de desentulho do local, cobertura de riscos do fabricante, dentre outras, incluindo o seguro de vida em grupo regido pela convenção coletiva dos trabalhadores na indústria da construção civil). A partir de 24/02/2015 por intermédio da Portaria 449/2015 a Presidência da AGETOP, na pessoa do Senhor Jayme Eduardo Rincon, determinou a exclusão dos valores referentes aos Seguros de Risco de Engenharia e Responsabilidade Civil do Profissional na composição do cálculo do B.D.I.."]
["(8) Valores definidos a partir dos limites no Acórdão nº 2.622/2013 - TCU – Plenário. Valores entre 1º e 3° quartis."]
["(9) Valores definidos a partir dos limites definidos no Acórdão nº 2.622/2013 - TCU – Plenário. Valores adotados e praticados no mercado ( “ ex ante ” ) ou aqueles entre os 1º e 3º quartis."]
[]
["(*) A fórmula para estipulação da taxa de BDI estimado adotado é a mesma que foi aplicada para a obtenção das tabelas contidas no Acórdão n. 2.622/2013 – TCUPlenário"]
[]
["Obs.: Para obras com valores superiores a R$ 20.000.000,00 sugere-se recalcular o BDI, dimensionando as taxas de administração central e lucro para patamares inferiores ao estipulado acima."]

{"sheet":"Relatório CENTRAL","index":5,"n_rows":40,"n_cols":5,"rows_kept":40,"cut":false,"hidden":false,"merged":[[9,1,9,2],[10,1,10,4],[11,1,11,4],[39,1,39,2],[9,0,11,0],[0,1,0,4],[6,3,6,4],[9,3,9,4],[1,1,1,4],[2,1,2,2],[2,3,2,4],[3,1,3,2],[3,3,3,4],[4,1,4,4],[5,1,5,2],[5,3,5,4],[6,1,6,2],[7,1,7,4],[8,1,8,2],[8,3,8,4]]}
[]
[]
[null,"UNIDADE ESCOLAR",null,"CIDADE"]
[null,{"$f":"Orçamento!$O$4","v":"COLÉGIO ESTADUAL DESOR HAMILTON BARROS VELASCO"},null,{"$f":"Orçamento!$V$7","v":"PALMINÓPOLIS"}]
[]
[null,"OBRA",null,"CRE"]
[null,{"$f":"Orçamento!$O$7","v":"AMPLIAÇÃO E REFORMA"},null,{"$f":"Orçamento!$O$10","v":"PALMEIRAS"}]
[]
[null,"ENDEREÇO",null,"DATA"]
["FILTRO",{"$f":"Orçamento!$R$10","v":"RUA DEP ANTONIO Q BARRETO, CENTRO, CEP:75990-000"},null,{"$f":"Orçamento!$S$7","v":"2020-05-12"}]
[]
[null,"RELATÓRIO CENTRAL"]
["↓","CÓDIGO","ETAPA","PREÇO  (R$) C/ BDI","PARTIC  ( % )"]
[{"$f":"IF(D14>0,\"F\",\"\")","v":""},{"$f":"Orçamento!O406","v":"a."},{"$f":"Orçamento!P406","v":"SERVIÇOS PRELIMINARES"},{"$f":"Orçamento!V406","v":0},{"$f":"Orçamento!X406","v":0}]
[{"$f":"IF(D15>0,\"F\",\"\")","v":""},{"$f":"Orçamento!O407","v":"b."},{"$f":"Orçamento!P407","v":"TRANSPORTES"},{"$f":"Orçamento!V407","v":0},{"$f":"Orçamento!X407","v":0}]
["",{"$f":"Orçamento!O408","v":"c."},{"$f":"Orçamento!P408","v":"SERVIÇO EM TERRA"},{"$f":"Orçamento!V408","v":0},{"$f":"Orçamento!X408","v":0}]
["",{"$f":"Orçamento!O409","v":"d."},{"$f":"Orçamento!P409","v":"FUNDAÇÕES E SONDAGENS"},{"$f":"Orçamento!V409","v":0},{"$f":"Orçamento!X409","v":0}]
["",{"$f":"Orçamento!O410","v":"e."},{"$f":"Orçamento!P410","v":"ESTRUTURA"},{"$f":"Orçamento!V410","v":0},{"$f":"Orçamento!X410","v":0}]
["",{"$f":"Orçamento!O411","v":"f."},{"$f":"Orçamento!P411","v":"INSTALAÇÕES ELÉTRICAS"},{"$f":"Orçamento!V411","v":0},{"$f":"Orçamento!X411","v":0}]
["",{"$f":"Orçamento!O412","v":"g."},{"$f":"Orçamento!P412","v":"INSTALAÇÕES HIDROSSANITÁRIAS"},{"$f":"Orçamento!V412","v":0},{"$f":"Orçamento!X412","v":0}]
["",{"$f":"Orçamento!O413","v":"h"},{"$f":"Orçamento!P413","v":"INSTALAÇÕES ESPECIAIS"},{"$f":"Orçamento!V413","v":0},{"$f":"Orçamento!X413","v":0}]
["",{"$f":"Orçamento!O414","v":"i."},{"$f":"Orçamento!P414","v":"ALVENARIAS E DIVISÓRIAS"},{"$f":"Orçamento!V414","v":0},{"$f":"Orçamento!X414","v":0}]
["",{"$f":"Orçamento!O415","v":"j."},{"$f":"Orçamento!P415","v":"ALVENARIA AUTO-PORTANTE"},{"$f":"Orçamento!V415","v":0},{"$f":"Orçamento!X415","v":0}]
["",{"$f":"Orçamento!O416","v":"k."},{"$f":"Orçamento!P416","v":"IMPERMEABILIZAÇÃO"},{"$f":"Orçamento!V416","v":0},{"$f":"Orçamento!X416","v":0}]
["",{"$f":"Orçamento!O417","v":"l."},{"$f":"Orçamento!P417","v":"ISOLAMENTO TÉRMICO E ACÚSTICO"},{"$f":"Orçamento!V417","v":0},{"$f":"Orçamento!X417","v":0}]
["",{"$f":"Orçamento!O418","v":"m."},{"$f":"Orçamento!P418","v":"ESTRUTURA DE MADEIRA"},{"$f":"Orçamento!V418","v":0},{"$f":"Orçamento!X418","v":0}]
["",{"$f":"Orçamento!O419","v":"n."},{"$f":"Orçamento!P419","v":"ESTRUTURAS METÁLICAS"},{"$f":"Orçamento!V419","v":0},{"$f":"Orçamento!X419","v":0}]
["",{"$f":"Orçamento!O420","v":"o."},{"$f":"Orçamento!P420","v":"COBERTURAS"},{"$f":"Orçamento!V420","v":0},{"$f":"Orçamento!X420","v":0}]
["",{"$f":"Orçamento!O421","v":"p."},{"$f":"Orçamento!P421","v":"ESQUADRIAS DE MADEIRA"},{"$f":"Orçamento!V421","v":0},{"$f":"Orçamento!X421","v":0}]
["",{"$f":"Orçamento!O422","v":"q."},{"$f":"Orçamento!P422","v":"ESQUADRIAS METÁLICAS"},{"$f":"Orçamento!V422","v":0},{"$f":"Orçamento!X422","v":0}]
["",{"$f":"Orçamento!O423","v":"r."},{"$f":"Orçamento!P423","v":"VIDROS"},{"$f":"Orçamento!V423","v":0},{"$f":"Orçamento!X423","v":0}]
["",{"$f":"Orçamento!O424","v":"s."},{"$f":"Orçamento!P424","v":"REVESTIMENTO DE PAREDE"},{"$f":"Orçamento!V424","v":0},{"$f":"Orçamento!X424","v":0}]
["",{"$f":"Orçamento!O425","v":"t."},{"$f":"Orçamento!P425","v":"FORROS"},{"$f":"Orçamento!V425","v":0},{"$f":"Orçamento!X425","v":0}]
["",{"$f":"Orçamento!O426","v":"u."},{"$f":"Orçamento!P426","v":"REVESTIMENTO DE PISO"},{"$f":"Orçamento!V426","v":0},{"$f":"Orçamento!X426","v":0}]
["",{"$f":"Orçamento!O427","v":"v."},{"$f":"Orçamento!P427","v":"FERRAGENS"},{"$f":"Orçamento!V427","v":0},{"$f":"Orçamento!X427","v":0}]
["",{"$f":"Orçamento!O428","v":"w."},{"$f":"Orçamento!P428","v":"MARCENARIA"},{"$f":"Orçamento!V428","v":0},{"$f":"Orçamento!X428","v":0}]
["",{"$f":"Orçamento!O429","v":"x."},{"$f":"Orçamento!P429","v":"ADMINISTRAÇÃO"},{"$f":"Orçamento!V429","v":0},{"$f":"Orçamento!X429","v":0}]
["",{"$f":"Orçamento!O430","v":"y."},{"$f":"Orçamento!P430","v":"PINTURA"},{"$f":"Orçamento!V430","v":0},{"$f":"Orçamento!X430","v":0}]
["",{"$f":"Orçamento!O431","v":"z."},{"$f":"Orçamento!P431","v":"DIVERSOS"},{"$f":"Orçamento!V431","v":0},{"$f":"Orçamento!X431","v":0}]
["F","TOTAL GERAL DO ORÇAMENTO (R$) C/BDI",null,{"$f":"SUM(D14:D39)","v":0},{"$f":"SUM(E14:E39)","v":0}]

{"sheet":"Parc Maior Relev","index":6,"n_rows":35,"n_cols":7,"rows_kept":35,"cut":false,"hidden":false,"merged":[[8,1,8,3],[8,4,8,6],[35,3,35,7],[33,1,33,6],[10,0,11,0],[0,1,0,6],[11,1,11,6],[1,1,1,6],[2,1,2,3],[2,4,2,6],[3,1,3,3],[3,4,3,6],[4,1,4,6],[5,1,5,3],[5,4,5,6],[9,1,9,3],[9,4,9,6],[10,1,10,6],[6,1,6,3],[6,4,6,6],[7,1,7,6]]}
[]
[]
[null,"UNIDADE ESCOLAR",null,null,"CÓDIGO INEP"]
[null,{"$f":"Orçamento!$O$4","v":"COLÉGIO ESTADUAL DESOR HAMILTON BARROS VELASCO"},null,null,{"$f":"Orçamento!$V$4","v":52057259}]
[]
[null,"OBRA",null,null,"CIDADE"]
[null,{"$f":"Orçamento!$O$7","v":"AMPLIAÇÃO E REFORMA"},null,null,{"$f":"Orçamento!$V$7","v":"PALMINÓPOLIS"}]
[]
[null,"CRE",null,null,"ÁREA TOTAL CONSTRUÍDA (M²)"]
[null,{"$f":"Orçamento!$O$10","v":"PALMEIRAS"},null,null,{"$f":"Orçamento!$V$13","v":2392.0899999999997}]
["FILTRO"]
[null,"PARCELA DE MAIOR RELEVÂNCIA"]
[{"$f":"IF(G14>0,\"F\",\"\")","v":""},"CÓDIGO","SERVIÇO","DESCRIÇÃO","UNID","QUANT","PARC. MAIOR RELEV (100%)"]
[{"$f":"IF(G14>0,\"F\",\"\")","v":""},{"$f":"Somatório!B22","v":"f."},"INSTALAÇÕES ELÉTRICAS","SUBESTAÇÃO","KVA",{"$f":"SUMIF(Orçamento!$R$20:$R$387,'Parc Maior Relev'!D14,Orçamento!$T$20:$T$387)","v":0},{"$f":"F14","v":0}]
[{"$f":"IF(SUM(G16:G32)>0,\"F\",\"\")","v":"F"},"CÓDIGO","SERVIÇO","DESCRIÇÃO","UNID","QUANT","PARC. MAIOR RELEV (50%)"]
[{"$f":"IF(G16>0,\"F\",\"\")","v":""},{"$f":"Somatório!B21","v":"e."},"ESTRUTURA","CONCRETO","M3",{"$f":"SUMIF(Orçamento!$R$20:$R$387,'Parc Maior Relev'!D16,Orçamento!$T$20:$T$387)","v":0},{"$f":"F16*0.5","v":0}]
[{"$f":"IF(G17>0,\"F\",\"\")","v":""},"f.","INSTALAÇÕES ELÉTRICAS","INSTALAÇÕES ELÉTRICAS","KVA",{"$f":"SUMIF(Orçamento!$R$20:$R$387,'Parc Maior Relev'!D17,Orçamento!$T$20:$T$387)","v":0},{"$f":"F17","v":0}]
[{"$f":"IF(G18>0,\"F\",\"\")","v":""},{"$f":"Somatório!B25","v":"i."},"ALVENARIA E DIVISÓRIAS","ALVENARIA DE TIJOLOS","M2",{"$f":"SUMIF(Orçamento!$R$20:$R$387,'Parc Maior Relev'!D18,Orçamento!$T$20:$T$387)","v":0},{"$f":"F18*0.5","v":0}]
["",{"$f":"Somatório!B29","v":"m."},"ESTRUTURA DE MADEIRA","ESTRUTURA DE MADEIRA","M2",{"$f":"SUMIF(Orçamento!$R$20:$R$387,'Parc Maior Relev'!D19,Orçamento!$T$20:$T$387)","v":0},0]
["",{"$f":"Somatório!B31","v":"o."},"COBERTURAS","COBERTURA CERÂMICA","M2",{"$f":"SUMIF(Orçamento!$R$20:$R$387,'Parc Maior Relev'!D20,Orçamento!$T$20:$T$387)","v":0},0]
["","o.","COBERTURAS","COBERTURA COM TELHA METÁLICA","M2",{"$f":"SUMIF(Orçamento!$R$20:$R$387,'Parc Maior Relev'!D21,Orçamento!$T$20:$T$387)","v":0},0]
["",{"$f":"Somatório!B35","v":"s."},"REVESTIMENTO DE PAREDE","CHAPISCO","M2",{"$f":"SUMIF(Orçamento!$R$20:$R$387,'Parc Maior Relev'!D22,Orçamento!$T$20:$T$387)","v":0},0]
["","s.","REVESTIMENTO DE PAREDE","REBOCO","M2",{"$f":"SUMIF(Orçamento!$R$20:$R$387,'Parc Maior Relev'!D23,Orçamento!$T$20:$T$387)","v":0},{"$f":"F23*0.5","v":0}]
["","s.","REVESTIMENTO DE PAREDE","REVESTIMENTO CERÂMICO","M2",{"$f":"SUMIF(Orçamento!$R$20:$R$387,'Parc Maior Relev'!D24,Orçamento!$T$20:$T$387)","v":0},{"$f":"F24*0.5","v":0}]
["",{"$f":"Somatório!B36","v":"t."},"FORROS","FORRO DE GESSO","M2",{"$f":"SUMIF(Orçamento!$R$20:$R$387,'Parc Maior Relev'!D25,Orçamento!$T$20:$T$387)","v":0},{"$f":"F25*0.5","v":0}]
["","t.","FORROS","FORRO DE PVC","M2",{"$f":"SUMIF(Orçamento!$R$20:$R$387,'Parc Maior Relev'!D26,Orçamento!$T$20:$T$387)","v":0},{"$f":"F26*0.5","v":0}]
["","t.","FORROS","FORRO DE GESSO ACARTONADO","M2",{"$f":"SUMIF(Orçamento!$R$20:$R$387,'Parc Maior Relev'!D27,Orçamento!$T$20:$T$387)","v":0},{"$f":"F27*0.5","v":0}]
["F","u.","REVESTIMENTO DE PISO","PISO DE GRANITINA","M2",{"$f":"Orçamento!T373+Orçamento!T195","v":347.13840000000005},173.56920000000002]
["","u.","REVESTIMENTO DE PISO","PISO LAMINADO","M2",{"$f":"SUMIF(Orçamento!$R$20:$R$387,'Parc Maior Relev'!D29,Orçamento!$T$20:$T$387)","v":0},0]
["","u.","REVESTIMENTO DE PISO","PISO DE CONCRETO DESEMPENADO","M2",{"$f":"SUMIF(Orçamento!$R$20:$R$387,'Parc Maior Relev'!D30,Orçamento!$T$20:$T$387)","v":0},0]
["","u.","REVESTIMENTO DE PISO","PISO CERÂMICO","M2",{"$f":"SUMIF(Orçamento!$R$20:$R$387,'Parc Maior Relev'!D31,Orçamento!$T$20:$T$387)","v":0},{"$f":"F31*0.5","v":0}]
["F","y.","PINTURA","PINTURA","M2",{"$f":"Orçamento!T212+Orçamento!T381","v":1991.2829999999999},995.64149999999995]
["F"]
["F","(*) Para os fins do inciso I dp § 1º do Art. 30 da Lei Federal 8.666/93, são consideradas parcelas de maior relevância técnica as execuções apresentadas"]
["F"]