{"text_format":"1","workbook":"xlsx","n_sheets":8,"sheets":["Orçamento","Resumo ","Somatório","Cronog_120_Dias","Composição BDI","Relatório CENTRAL","Parc Maior Relev","Composições"],"not_rendered":{"charts":0,"images":4,"macros":1,"external_links":0,"defined_names":80,"comments":3,"pivot_tables":0},"unopened":[],"bounds":{"document_bytes":16777216,"sheet_cells":100000,"rows_first":2000,"rows_last":500,"rows_between":2000,"halvings":0,"cell_chars":16384,"cell_head_chars":4096},"cells_cut":0,"cells_raw":0,"read":"whole","date_system":"1900"}

{"sheet":"Orçamento","index":0,"n_rows":987,"n_cols":27,"rows_kept":987,"cut":false,"hidden":false,"merged":[[929,23,929,25],[930,23,930,25],[931,23,931,25],[932,23,932,25],[933,23,933,25],[934,23,934,25],[935,23,935,25],[936,23,936,25],[937,23,937,25],[974,23,974,25],[975,23,975,25],[976,23,976,25],[977,23,977,25],[978,23,978,25],[979,23,979,25],[956,23,956,25],[957,23,957,25],[958,23,958,25],[943,18,943,22],[936,18,936,22],[950,15,950,17],[951,15,951,17],[952,15,952,17],[962,23,962,25],[963,23,963,25],[964,23,964,25],[965,23,965,25],[954,23,954,25],[938,23,938,25],[939,23,939,25],[940,23,940,25],[941,23,941,25],[942,23,942,25],[943,23,943,25],[944,23,944,25],[945,23,945,25],[946,23,946,25],[947,23,947,25],[948,23,948,25],[0,14,0,24],[8,14,8,16],[9,14,9,16],[11,14,11,16],[12,14,12,16],[14,14,14,24],[1,14,1,24],[4,14,4,24],[7,14,7,24],[953,18,953,22],[954,18,954,22],[944,18,944,22],[951,18,951,22],[947,18,947,22],[949,18,949,22],[945,18,945,22],[946,18,946,22],[955,23,955,25],[949,23,949,25],[950,23,950,25],[951,23,951,25],[952,23,952,25],[953,23,953,25],[950,18,950,22],[948,18,948,22],[948,15,948,17],[922,16,922,24],[912,23,912,24],[913,23,913,24],[928,23,928,25],[953,15,953,17],[954,15,954,17],[927,14,927,26],[911,17,916,17],[928,18,928,22],[929,18,929,22],[937,18,937,22],[938,18,938,22],[939,18,939,22],[940,18,940,22],[952,18,952,22],[949,15,949,17],[929,15,929,17],[930,15,930,17],[931,15,931,17],[932,15,932,17],[933,15,933,17],[934,15,934,17],[935,15,935,17],[923,16,923,24],[8,23,8,25],[9,24,9,25],[941,15,941,17],[942,15,942,17],[943,15,943,17],[944,15,944,17],[945,15,945,17],[946,15,946,17],[936,15,936,17],[937,15,937,17],[934,18,934,22],[935,18,935,22],[933,18,933,22],[942,18,942,22],[924,18,924,24],[930,18,930,22],[931,18,931,22],[932,18,932,22],[941,18,941,22],[938,15,938,17],[939,15,939,17],[940,15,940,17],[911,23,911,24],[919,16,919,24],[920,16,920,24],[921,16,921,24],[10,14,10,26],[13,14,13,26],[9,17,9,22],[2,14,2,22],[3,14,3,22],[5,18,5,22],[6,18,6,22],[11,18,11,22],[12,18,12,22],[6,14,6,17],[5,14,5,17],[3,23,3,25],[2,23,2,25],[5,23,5,25],[6,23,6,25],[928,15,928,17],[983,18,983,22],[971,15,971,17],[971,18,971,22],[972,15,972,17],[972,18,972,22],[973,15,973,17],[973,18,973,22],[977,15,977,17],[977,18,977,22],[978,15,978,17],[978,18,978,22],[979,15,979,17],[968,15,968,17],[983,14,983,17],[980,15,980,17],[980,18,980,22],[981,15,981,17],[981,18,981,22],[982,15,982,17],[982,18,982,22],[964,15,964,17],[964,18,964,22],[947,15,947,17],[980,23,980,25],[981,23,981,25],[982,23,982,25],[983,23,983,25],[984,23,984,25],[985,23,985,25],[986,23,986,25],[955,14,955,17],[962,15,962,17],[986,18,986,22],[985,18,985,22],[984,18,984,22],[958,18,958,22],[955,18,955,22],[957,18,957,22],[956,18,956,22],[966,23,966,25],[967,23,967,25],[968,23,968,25],[969,23,969,25],[970,23,970,25],[971,23,971,25],[972,23,972,25],[973,23,973,25],[979,18,979,22],[974,15,974,17],[974,18,974,22],[975,15,975,17],[975,18,975,22],[976,15,976,17],[976,18,976,22],[12,24,12,25],[11,23,11,25],[968,18,968,22],[969,15,969,17],[969,18,969,22],[970,15,970,17],[970,18,970,22],[965,15,965,17],[965,18,965,22],[966,15,966,17],[966,18,966,22],[967,15,967,17],[967,18,967,22],[961,14,961,26],[962,18,962,22],[963,15,963,17],[963,18,963,22]]}
[]
[]
[null,null,null,null,null,null,null,null,null,null,null,null,null,null,"UNIDADE ESCOLAR",null,null,null,null,null,null,null,null,"CÓDIGO INEP"]
[null,null,null,null,null,null,null,null,null,null,null,null,null,null,"CENTRO DE ENSINO EM PERÍODO INTEGRAL PRÉ-UNIVERSITÁRIO",null,null,null,null,null,null,null,null,52033570]
[]
["Nmax",null,null,null,null,null,null,null,null,null,null,null,null,null,"OBRA",null,null,null,"DATA",null,null,null,null,"CIDADE"]
[{"$f":"MAX($C$18:$C$911)","v":4},null,null,null,null,null,null,null,null,null,null,null,null,null,"REFORMA E AMPLIAÇÃO",null,null,null,"2020-04-23",null,null,null,null,"GOIÂNIA"]
[]
[null,null,null,null,null,null,null,null,null,null,null,null,null,null,"CRE",null,null,"ENDEREÇO",null,null,null,null,null,"REFERÊNCIA AGETOP"]
[null,null,null,null,null,null,null,null,null,null,null,null,null,null,"GOIÂNIA",null,null,"RUA 240 S/N, ST UNIVERSITARIO, CEP:74440-460",null,null,null,null,null,"DEZ/18","ONERADA"]
[]
[null,null,null,null,null,null,null,null,null,null,null,null,null,null,"ÁREA EXISTENTE (M²)",null,null,"ÁREA A CONSTRUIR (M²)","ÁREA TOTAL CONSTRUÍDA (M²)",null,null,null,null,"REFERÊNCIA SINAPI"]
[null,null,null,null,null,null,null,null,null,null,null,null,null,null,3842.27,null,null,800.98,4643.25,null,null,null,null,"JUL/19","ONERADA"]
[]
[null,null,null,null,null,null,null,null,null,null,null,"FILTRO",null,null,"PLANILHA ORÇAMENTÁRIA"]
["Nível E","Save Nivel","Nível C","Altura","n1","n2","n3","n4","n5","Czero","Cnível","↓","Nível","Nível Corrigido","ITEM","TABELA","CODIGO","DESCRIÇÃO DOS SERVIÇOS","UNID","QUANT","REPET","QUANT TOTAL","MAT","MO","VALOR UNIT","VALOR TOTAL","OBSERVAÇÕES¹"]
[{"$f":"CHOOSE(1+LOG(1+2*(ORÇAMENTO.Nivel=\"Nível 1\")+4*(ORÇAMENTO.Nivel=\"Nível 2\")+8*(ORÇAMENTO.Nivel=\"Nível 3\")+16*(ORÇAMENTO.Nivel=\"Nível 4\")+32*(ORÇAMENTO.Nivel=\"Serviço\"),2),0,1,2,3,4,\"S\")","v":"S"},{"$f":"IF(OR(C17=\"s\",C17=0),OFFSET(B17,-1,0),C17)","v":"Save Nivel"},{"$f":"IF(OFFSET(C17,-1,0)=\"L\",1,IF(OFFSET(C17,-1,0)=1,2,IF(OR(A17=\"s\",A17=0),\"S\",IF(AND(OFFSET(C17,-1,0)=2,A17=4),3,IF(AND(OR(OFFSET(C17,-1,0)=\"s\",OFFSET(C17,-1,0)=0),A17<>\"s\",A17>OFFSET(B17,-1,0)),OFFSET(B17,-1,0),A17)))))","v":"S"},{"$f":"IF(OR(C17=\"S\",C17=0),0,IF(ISERROR(K17),J17,SMALL(J17:K17,1)))","v":0},{"$f":"IF($C17=1,OFFSET(E17,-1,0)+1,OFFSET(E17,-1,0))","v":"n1"},{"$f":"IF($C17=1,0,IF($C17=2,OFFSET(F17,-1,0)+1,OFFSET(F17,-1,0)))","v":"n2"},{"$f":"IF(AND($C17<=2,$C17<>0),0,IF($C17=3,OFFSET(G17,-1,0)+1,OFFSET(G17,-1,0)))","v":"n3"},{"$f":"IF(AND($C17<=3,$C17<>0),0,IF($C17=4,OFFSET(H17,-1,0)+1,OFFSET(H17,-1,0)))","v":"n4"},{"$f":"IF(AND($C17<=4,$C17<>0),0,IF(AND($C17=\"S\",$Y17>0),OFFSET(I17,-1,0)+1,OFFSET(I17,-1,0)))","v":"n5"},{"$f":"IF(OR($C17=\"S\",$C17=0),0,MATCH(0,OFFSET($D17,1,$C17,ROW($C$911)-ROW($C17)),0))","v":0},{"$f":"IF(OR($C17=\"S\",$C17=0),0,MATCH(OFFSET($D17,0,$C17)+1,OFFSET($D17,1,$C17,ROW($C$911)-ROW($C17)),0))","v":0},"","Serviço","Serviço","-","SINAPI",null,"(sem código)","-",null,"REPET","-",0,0,0,"-",""]
[0,null,"L",{"$f":"COUNTA(OFFSET(D18,1,0):D$911)","v":892},{"$f":"LEFT(O19,1)-1","v":0},null,null,null,null,null,null,"F","LOTE","LOTE","REFORMA E AMPLIAÇÃO - CENTRO DE ENSINO EM PERÍODO INTEGRAL PRÉ-UNIVERSITÁRIO",null,null,null,null,null,null,null,null,null,null,996414.63000000187]
[1,{"$f":"IF(OR(C19=\"s\",C19=0),OFFSET(B19,-1,0),C19)","v":1},{"$f":"IF(OFFSET(C19,-1,0)=\"L\",1,IF(OFFSET(C19,-1,0)=1,2,IF(OR(A19=\"s\",A19=0),\"S\",IF(AND(OFFSET(C19,-1,0)=2,A19=4),3,IF(AND(OR(OFFSET(C19,-1,0)=\"s\",OFFSET(C19,-1,0)=0),A19<>\"s\",A19>OFFSET(B19,-1,0)),OFFSET(B19,-1,0),A19)))))","v":1},{"$f":"IF(OR(C19=\"S\",C19=0),0,IF(ISERROR(K19),J19,SMALL(J19:K19,1)))","v":361},{"$f":"IF($C19=1,OFFSET(E19,-1,0)+1,OFFSET(E19,-1,0))","v":1},{"$f":"IF($C19=1,0,IF($C19=2,OFFSET(F19,-1,0)+1,OFFSET(F19,-1,0)))","v":0},{"$f":"IF(AND($C19<=2,$C19<>0),0,IF($C19=3,OFFSET(G19,-1,0)+1,OFFSET(G19,-1,0)))","v":0},{"$f":"IF(AND($C19<=3,$C19<>0),0,IF($C19=4,OFFSET(H19,-1,0)+1,OFFSET(H19,-1,0)))","v":0},0,{"$f":"IF(OR($C19=\"S\",$C19=0),0,MATCH(0,OFFSET($D19,1,$C19,ROW($C$911)-ROW($C19)),0))","v":892},{"$f":"IF(OR($C19=\"S\",$C19=0),0,MATCH(OFFSET($D19,0,$C19)+1,OFFSET($D19,1,$C19,ROW($C$911)-ROW($C19)),0))","v":361},"F","Nível 1","Nível 1","1.","AGETOP",null,"REFORMA","UN",1,1]
[2,{"$f":"IF(OR(C20=\"s\",C20=0),OFFSET(B20,-1,0),C20)","v":2},{"$f":"IF(OFFSET(C20,-1,0)=\"L\",1,IF(OFFSET(C20,-1,0)=1,2,IF(OR(A20=\"s\",A20=0),\"S\",IF(AND(OFFSET(C20,-1,0)=2,A20=4),3,IF(AND(OR(OFFSET(C20,-1,0)=\"s\",OFFSET(C20,-1,0)=0),A20<>\"s\",A20>OFFSET(B20,-1,0)),OFFSET(B20,-1,0),A20)))))","v":2},{"$f":"IF(OR(C20=\"S\",C20=0),0,IF(ISERROR(K20),J20,SMALL(J20:K20,1)))","v":21},{"$f":"IF($C20=1,OFFSET(E20,-1,0)+1,OFFSET(E20,-1,0))","v":1},{"$f":"IF($C20=1,0,IF($C20=2,OFFSET(F20,-1,0)+1,OFFSET(F20,-1,0)))","v":1},{"$f":"IF(AND($C20<=2,$C20<>0),0,IF($C20=3,OFFSET(G20,-1,0)+1,OFFSET(G20,-1,0)))","v":0},{"$f":"IF(AND($C20<=3,$C20<>0),0,IF($C20=4,OFFSET(H20,-1,0)+1,OFFSET(H20,-1,0)))","v":0},0,360,21,"F","Nível 2","Nível 2","1.1.","AGETOP",null,"SERVIÇOS PRELIMINARES","-",null,1]
[3,3,3,4,1,1,1,0,0,20,4,"F","Nível 3","Nível 3","1.1.1.","SINAPI",null,"ACESSIBILIDADE","-",null,1,null,null,null,null,null,""]
["S",3,"S",0,1,1,1,0,0,0,0,"F","Serviço","Serviço","1.1.1.0.1.","SINAPI",97645,"REMOÇÃO DE JANELAS, DE FORMA MANUAL, SEM REAPROVEITAMENTO. AF_12/2017","M2",79.14,1,null,null,null,null,null,"Referência: AGETOP - 20106"]
["S",3,"S",0,1,1,1,0,0,0,0,"F","Serviço","Serviço","1.1.1.0.2.","SINAPI",97622,"DEMOLIÇÃO DE ALVENARIA DE BLOCO FURADO, DE FORMA MANUAL, SEM REAPROVEITAMENTO. AF_12/2017","M3",1.7999999999999998,1,null,null,null,null,null,"Referência: AGETOP - 20118"]
["S",3,"S",0,1,1,1,0,0,0,0,"F","Serviço","Serviço","1.1.1.0.3.","AGETOP",20128,"DEM.PILAR CONC.ARM.MANUAL C/TR.ATE CB.E CARGA(OC)","m3    ",1.08,1,null,null,null,null,null,""]
[3,3,3,6,1,1,2,0,0,16,6,"F","Nível 3","Nível 3","1.1.2.","SINAPI",null,"ANTIGA COZINHA","-",null,1,null,null,null,null,null,""]
["S",3,"S",0,1,1,2,0,0,0,0,"F","Serviço","Serviço","1.1.2.0.1.","SINAPI",97622,"DEMOLIÇÃO DE ALVENARIA DE BLOCO FURADO, DE FORMA MANUAL, SEM REAPROVEITAMENTO. AF_12/2017","M3",2.9655,1,null,null,null,null,null,"Referência: AGETOP - 20118"]
["S",3,"S",0,1,1,2,0,0,0,0,"F","Serviço","Serviço","1.1.2.0.2.","SINAPI",97644,"REMOÇÃO DE PORTAS, DE FORMA MANUAL, SEM REAPROVEITAMENTO. AF_12/2017","M2",8.5000000000000018,1,null,null,null,null,null,"Referência: AGETOP - 20106"]
["S",3,"S",0,1,1,2,0,0,0,0,"F","Serviço","Serviço","1.1.2.0.3.","AGETOP",20139,"DEMOLIÇAO DE BANCADAS C/ TRANSP. ATÉ CB. E CARGA","m2    ",9.7100000000000009,1,null,null,null,null,null,""]
["S",3,"S",0,1,1,2,0,0,0,0,"F","Serviço","Serviço","1.1.2.0.4.","AGETOP",20163,"DEMOLIÇÃO DAS INSTALAÇÕES HIDROSANITÁRIAS E AFINS C/ TRANSP. ATÉ CB. E CARGA","H     ",3,1,null,null,null,null,null,""]
["S",3,"S",0,1,1,2,0,0,0,0,"F","Serviço","Serviço","1.1.2.0.5.","SINAPI",97633,"DEMOLIÇÃO DE REVESTIMENTO CERÂMICO, DE FORMA MANUAL, SEM REAPROVEITAMENTO. AF_12/2017","M2",132.47999999999999,1,null,null,null,null,null,"Referência: AGETOP - 20115"]
[3,3,3,5,1,1,3,0,0,10,5,"F","Nível 3","Nível 3","1.1.3.","SINAPI",null,"SANITÁRIOS","-",null,1,null,null,null,null,null,""]
["S",3,"S",0,1,1,3,0,0,0,0,"F","Serviço","Serviço","1.1.3.0.1.","SINAPI",97633,"DEMOLIÇÃO DE REVESTIMENTO CERÂMICO, DE FORMA MANUAL, SEM REAPROVEITAMENTO. AF_12/2017","M2",332.55,1,null,null,null,null,null,"Referência: AGETOP - 20115"]
["S",3,"S",0,1,1,3,0,0,0,0,"F","Serviço","Serviço","1.1.3.0.2.","AGETOP",20163,"DEMOLIÇÃO DAS INSTALAÇÕES HIDROSANITÁRIAS E AFINS C/ TRANSP. ATÉ CB. E CARGA","H     ",4,1,null,null,null,null,null,""]
["S",3,"S",0,1,1,3,0,0,0,0,"F","Serviço","Serviço","1.1.3.0.3.","AGETOP",20140,"DEMOLIÇAO DE VÁLVULA DE DESCARGA C/ TRANSP. ATÉ CB. E CARGA","Un    ",4,1,null,null,null,null,null,""]
["S",{"$f":"IF(OR(C35=\"s\",C35=0),OFFSET(B35,-1,0),C35)","v":3},{"$f":"IF(OFFSET(C35,-1,0)=\"L\",1,IF(OFFSET(C35,-1,0)=1,2,IF(OR(A35=\"s\",A35=0),\"S\",IF(AND(OFFSET(C35,-1,0)=2,A35=4),3,IF(AND(OR(OFFSET(C35,-1,0)=\"s\",OFFSET(C35,-1,0)=0),A35<>\"s\",A35>OFFSET(B35,-1,0)),OFFSET(B35,-1,0),A35)))))","v":"S"},{"$f":"IF(OR(C35=\"S\",C35=0),0,IF(ISERROR(K35),J35,SMALL(J35:K35,1)))","v":0},{"$f":"IF($C35=1,OFFSET(E35,-1,0)+1,OFFSET(E35,-1,0))","v":1},{"$f":"IF($C35=1,0,IF($C35=2,OFFSET(F35,-1,0)+1,OFFSET(F35,-1,0)))","v":1},{"$f":"IF(AND($C35<=2,$C35<>0),0,IF($C35=3,OFFSET(G35,-1,0)+1,OFFSET(G35,-1,0)))","v":3},{"$f":"IF(AND($C35<=3,$C35<>0),0,IF($C35=4,OFFSET(H35,-1,0)+1,OFFSET(H35,-1,0)))","v":0},0,0,0,"F","Serviço","Serviço","1.1.3.0.4.","SINAPI",97644,"REMOÇÃO DE PORTAS, DE FORMA MANUAL, SEM REAPROVEITAMENTO. AF_12/2017","M2",2.64,1,null,null,null,null,null,"Referência: AGETOP - 20106"]
[3,{"$f":"IF(OR(C36=\"s\",C36=0),OFFSET(B36,-1,0),C36)","v":3},{"$f":"IF(OFFSET(C36,-1,0)=\"L\",1,IF(OFFSET(C36,-1,0)=1,2,IF(OR(A36=\"s\",A36=0),\"S\",IF(AND(OFFSET(C36,-1,0)=2,A36=4),3,IF(AND(OR(OFFSET(C36,-1,0)=\"s\",OFFSET(C36,-1,0)=0),A36<>\"s\",A36>OFFSET(B36,-1,0)),OFFSET(B36,-1,0),A36)))))","v":3},{"$f":"IF(OR(C36=\"S\",C36=0),0,IF(ISERROR(K36),J36,SMALL(J36:K36,1)))","v":2},1,1,4,0,0,5,2,"F","Nível 3","Nível 3","1.1.4.","SINAPI",null,"REFORMA GERAL","-",null,1,null,null,null,null,null,""]
["S",3,"S",0,1,1,4,0,0,0,0,"F","Serviço","Serviço","1.1.4.0.1.","SINAPI","74209/1","PLACA DE OBRA EM CHAPA DE ACO GALVANIZADO","M2",7.5,1,null,null,null,null,null,"Referência: AGETOP - 21301"]
[3,3,3,3,1,1,5,0,0,{"$f":"IF(OR($C38=\"S\",$C38=0),0,MATCH(0,OFFSET($D38,1,$C38,ROW($C$911)-ROW($C38)),0))","v":3},{"$f":"IF(OR($C38=\"S\",$C38=0),0,MATCH(OFFSET($D38,0,$C38)+1,OFFSET($D38,1,$C38,ROW($C$911)-ROW($C38)),0))","v":{"$error":"#N/A"}},"F","Nível 3","Nível 3","1.1.5.","SINAPI",null,"SALA DE DIRETORIA","-",null,1,null,null,null,null,null,""]
["S",3,"S",0,1,1,5,0,0,0,0,"F","Serviço","Serviço","1.1.5.0.1.","SINAPI",97644,"REMOÇÃO DE PORTAS, DE FORMA MANUAL, SEM REAPROVEITAMENTO. AF_12/2017","M2",1.6800000000000002,1,null,null,null,null,null,"Referência: AGETOP - 20106"]
["S",3,"S",0,1,1,5,0,0,0,0,"F","Serviço","Serviço","1.1.5.0.2.","SINAPI",97622,"DEMOLIÇÃO DE ALVENARIA DE BLOCO FURADO, DE FORMA MANUAL, SEM REAPROVEITAMENTO. AF_12/2017","M3",0.28949999999999998,1,null,null,null,null,null,"Referência: AGETOP - 20118"]
[2,2,2,3,1,2,0,0,0,{"$f":"IF(OR($C41=\"S\",$C41=0),0,MATCH(0,OFFSET($D41,1,$C41,ROW($C$911)-ROW($C41)),0))","v":339},{"$f":"IF(OR($C41=\"S\",$C41=0),0,MATCH(OFFSET($D41,0,$C41)+1,OFFSET($D41,1,$C41,ROW($C$911)-ROW($C41)),0))","v":3},"F","Nível 2","Nível 2","1.2.","AGETOP",null,"TRANSPORTES","-",null,1,null,null,null,null,null,""]
["S",2,"S",0,1,2,0,0,0,0,0,"F","Serviço","Serviço","1.2.0.0.1.","SINAPI",72900,"TRANSPORTE DE ENTULHO COM CAMINHAO BASCULANTE 6 M3, RODOVIA PAVIMENTADA, DMT 0,5 A 1,0 KM","M3",38.397599999999997,1,null,null,null,null,null,""]
["S",{"$f":"IF(OR(C43=\"s\",C43=0),OFFSET(B43,-1,0),C43)","v":2},{"$f":"IF(OFFSET(C43,-1,0)=\"L\",1,IF(OFFSET(C43,-1,0)=1,2,IF(OR(A43=\"s\",A43=0),\"S\",IF(AND(OFFSET(C43,-1,0)=2,A43=4),3,IF(AND(OR(OFFSET(C43,-1,0)=\"s\",OFFSET(C43,-1,0)=0),A43<>\"s\",A43>OFFSET(B43,-1,0)),OFFSET(B43,-1,0),A43)))))","v":"S"},{"$f":"IF(OR(C43=\"S\",C43=0),0,IF(ISERROR(K43),J43,SMALL(J43:K43,1)))","v":0},{"$f":"IF($C43=1,OFFSET(E43,-1,0)+1,OFFSET(E43,-1,0))","v":1},{"$f":"IF($C43=1,0,IF($C43=2,OFFSET(F43,-1,0)+1,OFFSET(F43,-1,0)))","v":2},{"$f":"IF(AND($C43<=2,$C43<>0),0,IF($C43=3,OFFSET(G43,-1,0)+1,OFFSET(G43,-1,0)))","v":0},{"$f":"IF(AND($C43<=3,$C43<>0),0,IF($C43=4,OFFSET(H43,-1,0)+1,OFFSET(H43,-1,0)))","v":0},0,0,0,"F","Serviço","Serviço","1.2.0.0.2.","SINAPI",72897,"CARGA MANUAL DE ENTULHO EM CAMINHAO BASCULANTE 6 M3","M3",38.397599999999997,1,null,null,null,null,null,""]
[2,2,2,14,1,3,0,0,0,336,14,"F","Nível 2","Nível 2","1.3.","AGETOP",null,"SERVIÇO EM TERRA","-",null,1,null,null,null,null,null,""]
[3,3,3,13,1,3,1,0,0,13,22,"F","Nível 3","Nível 3","1.3.1.",null,null,"AQUISIÇÃO DE TERRA (SOMENTE ATERRO)","-",null,1,null,null,null,null,null,""]
[4,{"$f":"IF(OR(C46=\"s\",C46=0),OFFSET(B46,-1,0),C46)","v":4},{"$f":"IF(OFFSET(C46,-1,0)=\"L\",1,IF(OFFSET(C46,-1,0)=1,2,IF(OR(A46=\"s\",A46=0),\"S\",IF(AND(OFFSET(C46,-1,0)=2,A46=4),3,IF(AND(OR(OFFSET(C46,-1,0)=\"s\",OFFSET(C46,-1,0)=0),A46<>\"s\",A46>OFFSET(B46,-1,0)),OFFSET(B46,-1,0),A46)))))","v":4},{"$f":"IF(OR(C46=\"S\",C46=0),0,IF(ISERROR(K46),J46,SMALL(J46:K46,1)))","v":6},{"$f":"IF($C46=1,OFFSET(E46,-1,0)+1,OFFSET(E46,-1,0))","v":1},{"$f":"IF($C46=1,0,IF($C46=2,OFFSET(F46,-1,0)+1,OFFSET(F46,-1,0)))","v":3},{"$f":"IF(AND($C46<=2,$C46<>0),0,IF($C46=3,OFFSET(G46,-1,0)+1,OFFSET(G46,-1,0)))","v":1},{"$f":"IF(AND($C46<=3,$C46<>0),0,IF($C46=4,OFFSET(H46,-1,0)+1,OFFSET(H46,-1,0)))","v":1},0,12,6,"F","Nível 4","Nível 4","1.3.1.1.","SINAPI",null,"ACESSIBILIDADE","-",null,1,null,null,null,null,null,""]
["S",4,"S",0,1,3,1,1,0,0,0,"F","Serviço","Serviço","1.3.1.1.1.","SINAPI",79480,"ESCAVACAO MECANICA CAMPO ABERTO EM SOLO EXCETO ROCHA ATE 2,00M PROFUNDIDADE","M3",3.1940000000000004,1,null,null,null,null,null,"Referência: AGETOP - 41004"]
["S",4,"S",0,1,3,1,1,0,0,0,"F","Serviço","Serviço","1.3.1.1.2.","SINAPI",72898,"CARGA E DESCARGA MECANIZADAS DE ENTULHO EM CAMINHAO BASCULANTE 6 M3","M3",3.9874999999999998,1,null,null,null,null,null,"Referência: AGETOP - 41005"]
["S",4,"S",0,1,3,1,1,0,0,0,"F","Serviço","Serviço","1.3.1.1.3.","AGETOP",41012,"INDENIZAÇÃO DE JAZIDA","m3    ",3.9874999999999998,1,null,null,null,null,null,""]
["S",4,"S",0,1,3,1,1,0,0,0,"F","Serviço","Serviço","1.3.1.1.4.","AGETOP",41006,"TRANSPORTE DE MATERIAL ESCAVADO M3.KM","m3km  ",31.9,1,null,null,null,null,null,""]
["S",4,"S",0,1,3,1,1,0,0,0,"F","Serviço","Serviço","1.3.1.1.5.","SINAPI","74005/2","COMPACTACAO MECANICA C/ CONTROLE DO GC>=95% DO PN (AREAS) (C/MONIVELADORA 140 HP E ROLO COMPRESSOR VIBRATORIO 80 HP)","M3",3.9874999999999998,1,null,null,null,null,null,"Referência: AGETOP - 41008"]
[4,4,4,6,1,3,1,2,0,6,123,"F","Nível 4","Nível 4","1.3.1.2.",null,null,"ACESSIBILIDADE - RAMPA","-",null,1,null,null,null,null,null,""]
["S",4,"S",0,1,3,1,2,0,0,0,"F","Serviço","Serviço","1.3.1.2.1.","SINAPI",79480,"ESCAVACAO MECANICA CAMPO ABERTO EM SOLO EXCETO ROCHA ATE 2,00M PROFUNDIDADE","M3",0.34,1,null,null,null,null,null,"Referência: AGETOP - 41004"]
["S",4,"S",0,1,3,1,2,0,0,0,"F","Serviço","Serviço","1.3.1.2.2.","SINAPI",72898,"CARGA E DESCARGA MECANIZADAS DE ENTULHO EM CAMINHAO BASCULANTE 6 M3","M3",0.42500000000000004,1,null,null,null,null,null,"Referência: AGETOP - 41005"]
["S",4,"S",0,1,3,1,2,0,0,0,"F","Serviço","Serviço","1.3.1.2.3.","AGETOP",41012,"INDENIZAÇÃO DE JAZIDA","m3    ",0.43,1,null,null,null,null,null,""]
["S",4,"S",0,1,3,1,2,0,0,0,"F","Serviço","Serviço","1.3.1.2.4.","AGETOP",41006,"TRANSPORTE DE MATERIAL ESCAVADO M3.KM","m3km  ",3.4000000000000004,1,null,null,null,null,null,""]
["S",4,"S",0,1,3,1,2,0,0,0,"F","Serviço","Serviço","1.3.1.2.5.","SINAPI","74005/2","COMPACTACAO MECANICA C/ CONTROLE DO GC>=95% DO PN (AREAS) (C/MONIVELADORA 140 HP E ROLO COMPRESSOR VIBRATORIO 80 HP)","M3",0.42500000000000004,1,null,null,null,null,null,"Referência: AGETOP - 41008"]
[{"$f":"CHOOSE(1+LOG(1+2*(ORÇAMENTO.Nivel=\"Nível 1\")+4*(ORÇAMENTO.Nivel=\"Nível 2\")+8*(ORÇAMENTO.Nivel=\"Nível 3\")+16*(ORÇAMENTO.Nivel=\"Nível 4\")+32*(ORÇAMENTO.Nivel=\"Serviço\"),2),0,1,2,3,4,\"S\")","v":2},{"$f":"IF(OR(C58=\"s\",C58=0),OFFSET(B58,-1,0),C58)","v":2},{"$f":"IF(OFFSET(C58,-1,0)=\"L\",1,IF(OFFSET(C58,-1,0)=1,2,IF(OR(A58=\"s\",A58=0),\"S\",IF(AND(OFFSET(C58,-1,0)=2,A58=4),3,IF(AND(OR(OFFSET(C58,-1,0)=\"s\",OFFSET(C58,-1,0)=0),A58<>\"s\",A58>OFFSET(B58,-1,0)),OFFSET(B58,-1,0),A58)))))","v":2},{"$f":"IF(OR(C58=\"S\",C58=0),0,IF(ISERROR(K58),J58,SMALL(J58:K58,1)))","v":17},{"$f":"IF($C58=1,OFFSET(E58,-1,0)+1,OFFSET(E58,-1,0))","v":1},{"$f":"IF($C58=1,0,IF($C58=2,OFFSET(F58,-1,0)+1,OFFSET(F58,-1,0)))","v":4},{"$f":"IF(AND($C58<=2,$C58<>0),0,IF($C58=3,OFFSET(G58,-1,0)+1,OFFSET(G58,-1,0)))","v":0},{"$f":"IF(AND($C58<=3,$C58<>0),0,IF($C58=4,OFFSET(H58,-1,0)+1,OFFSET(H58,-1,0)))","v":0},{"$f":"IF(AND($C58<=4,$C58<>0),0,IF(AND($C58=\"S\",$Y58>0),OFFSET(I58,-1,0)+1,OFFSET(I58,-1,0)))","v":0},322,17,"F","Nível 2","Nível 2","1.4.","AGETOP",null,"FUNDAÇÕES E SONDAGENS","-",null,1,null,null,null,null,null,""]
[3,3,3,8,1,4,1,0,0,16,8,"F","Nível 3","Nível 3","1.4.1.","SINAPI",null,"ESTACAS E BLOCOS","-",null,1,null,null,null,null,null,""]
["S",3,"S",0,1,4,1,0,0,0,0,"F","Serviço","Serviço","1.4.1.0.1.","COMPOSIÇÃO","COMP 199_SEE","ESTACA A TRADO DIAM.40 CM S/FERRO","M",17.5,1,null,null,null,null,null,""]
["S",3,"S",0,1,4,1,0,0,0,0,"F","Serviço","Serviço","1.4.1.0.2.","SINAPI",96522,"ESCAVAÇÃO MANUAL PARA BLOCO DE COROAMENTO OU SAPATA, SEM PREVISÃO DE FÔRMA. AF_06/2017","M3",7.46,1,null,null,null,null,null,"Referência: AGETOP - 50901"]
["S",3,"S",0,1,4,1,0,0,0,0,"F","Serviço","Serviço","1.4.1.0.3.","SINAPI",94963,"CONCRETO FCK = 15MPA, TRAÇO 1:3,4:3,5 (CIMENTO/ AREIA MÉDIA/ BRITA 1)  - PREPARO MECÂNICO COM BETONEIRA 400 L. AF_07/2016","M3",7.4599999999999991,1,null,null,null,null,null,""]
["S",3,"S",0,1,4,1,0,0,0,0,"F","Serviço","Serviço","1.4.1.0.4.","SINAPI","74157/4","LANCAMENTO/APLICACAO MANUAL DE CONCRETO EM FUNDACOES","M3",7.46,1,null,null,null,null,null,"Referência: AGETOP - 51026"]
["S",3,"S",0,1,4,1,0,0,0,0,"F","Serviço","Serviço","1.4.1.0.5.","SINAPI",96545,"ARMAÇÃO DE BLOCO, VIGA BALDRAME OU SAPATA UTILIZANDO AÇO CA-50 DE 8 MM - MONTAGEM. AF_06/2017","KG",30,1,null,null,null,null,null,"Referência: AGETOP - 52004"]
["S",3,"S",0,1,4,1,0,0,0,0,"F","Serviço","Serviço","1.4.1.0.6.","SINAPI",96546,"ARMAÇÃO DE BLOCO, VIGA BALDRAME OU SAPATA UTILIZANDO AÇO CA-50 DE 10 MM - MONTAGEM. AF_06/2017","KG",57,1,null,null,null,null,null,"Referência: AGETOP - 52005"]
["S",3,"S",0,1,4,1,0,0,0,0,"F","Serviço","Serviço","1.4.1.0.7.","SINAPI",96543,"ARMAÇÃO DE BLOCO, VIGA BALDRAME E SAPATA UTILIZANDO AÇO CA-60 DE 5 MM - MONTAGEM. AF_06/2017","KG",22,1,null,null,null,null,null,"Referência: AGETOP - 52014"]
[3,3,3,8,1,4,2,0,0,8,37,"F","Nível 3","Nível 3","1.4.2.","SINAPI",null,"VIGAS BALDRAMES","-",null,1,null,null,null,null,null,""]
["S",3,"S",0,1,4,2,0,0,0,0,"F","Serviço","Serviço","1.4.2.0.1.","SINAPI",96527,"ESCAVAÇÃO MANUAL DE VALA PARA VIGA BALDRAME, COM PREVISÃO DE FÔRMA. AF_06/2017","M3",0.96,1,null,null,null,null,null,"Referência: AGETOP - 40101"]
["S",3,"S",0,1,4,2,0,0,0,0,"F","Serviço","Serviço","1.4.2.0.2.","AGETOP",60191,"FORMA DE TABUA CINTA BALDRAME U=8 VEZES","m2    ",36.61,1,null,null,null,null,null,""]
["S",3,"S",0,1,4,2,0,0,0,0,"F","Serviço","Serviço","1.4.2.0.3.","SINAPI",94963,"CONCRETO FCK = 15MPA, TRAÇO 1:3,4:3,5 (CIMENTO/ AREIA MÉDIA/ BRITA 1)  - PREPARO MECÂNICO COM BETONEIRA 400 L. AF_07/2016","M3",2.09,1,null,null,null,null,null,""]
["S",3,"S",0,1,4,2,0,0,0,0,"F","Serviço","Serviço","1.4.2.0.4.","SINAPI","74157/4","LANCAMENTO/APLICACAO MANUAL DE CONCRETO EM FUNDACOES","M3",2.09,1,null,null,null,null,null,"Referência: AGETOP - 51026"]
["S",3,"S",0,1,4,2,0,0,0,0,"F","Serviço","Serviço","1.4.2.0.5.","SINAPI",96545,"ARMAÇÃO DE BLOCO, VIGA BALDRAME OU SAPATA UTILIZANDO AÇO CA-50 DE 8 MM - MONTAGEM. AF_06/2017","KG",88,1,null,null,null,null,null,"Referência: AGETOP - 52004"]
["S",3,"S",0,1,4,2,0,0,0,0,"F","Serviço","Serviço","1.4.2.0.6.","SINAPI",96546,"ARMAÇÃO DE BLOCO, VIGA BALDRAME OU SAPATA UTILIZANDO AÇO CA-50 DE 10 MM - MONTAGEM. AF_06/2017","KG",25,1,null,null,null,null,null,"Referência: AGETOP - 52005"]
["S",3,"S",0,1,4,2,0,0,0,0,"F","Serviço","Serviço","1.4.2.0.7.","SINAPI",96543,"ARMAÇÃO DE BLOCO, VIGA BALDRAME E SAPATA UTILIZANDO AÇO CA-60 DE 5 MM - MONTAGEM. AF_06/2017","KG",50,1,null,null,null,null,null,"Referência: AGETOP - 52014"]
[2,2,2,14,1,5,0,0,0,305,14,"F","Nível 2","Nível 2","1.5.","AGETOP",null,"ESTRUTURA","-",null,1,null,null,null,null,null,""]
[3,3,3,7,1,5,1,0,0,13,7,"F","Nível 3","Nível 3","1.5.1.","AGETOP",null,"PILAR","-",null,1,null,null,null,null,null,""]
["S",3,"S",0,1,5,1,0,0,0,0,"F","Serviço","Serviço","1.5.1.0.1.","SINAPI",92426,"MONTAGEM E DESMONTAGEM DE FÔRMA DE PILARES RETANGULARES E ESTRUTURAS SIMILARES COM ÁREA MÉDIA DAS SEÇÕES MENOR OU IGUAL A 0,25 M², PÉ-DIREITO SIMPLES, EM CHAPA DE MADEIRA COMPENSADA RESINADA, 8 UTILIZAÇÕES. AF_12/2015","M2",21.63,1,null,null,null,null,null,""]
["S",3,"S",0,1,5,1,0,0,0,0,"F","Serviço","Serviço","1.5.1.0.2.","SINAPI",94964,"CONCRETO FCK = 20MPA, TRAÇO 1:2,7:3 (CIMENTO/ AREIA MÉDIA/ BRITA 1)  - PREPARO MECÂNICO COM BETONEIRA 400 L. AF_07/2016","M3",2.27,1,null,null,null,null,null,""]
["S",3,"S",0,1,5,1,0,0,0,0,"F","Serviço","Serviço","1.5.1.0.3.","SINAPI",92873,"LANÇAMENTO COM USO DE BALDES, ADENSAMENTO E ACABAMENTO DE CONCRETO EM ESTRUTURAS. AF_12/2015","M3",2.27,1,null,null,null,null,null,"Referência: AGETOP - 60801"]
["S",{"$f":"IF(OR(C80=\"s\",C80=0),OFFSET(B80,-1,0),C80)","v":3},{"$f":"IF(OFFSET(C80,-1,0)=\"L\",1,IF(OFFSET(C80,-1,0)=1,2,IF(OR(A80=\"s\",A80=0),\"S\",IF(AND(OFFSET(C80,-1,0)=2,A80=4),3,IF(AND(OR(OFFSET(C80,-1,0)=\"s\",OFFSET(C80,-1,0)=0),A80<>\"s\",A80>OFFSET(B80,-1,0)),OFFSET(B80,-1,0),A80)))))","v":"S"},{"$f":"IF(OR(C80=\"S\",C80=0),0,IF(ISERROR(K80),J80,SMALL(J80:K80,1)))","v":0},{"$f":"IF($C80=1,OFFSET(E80,-1,0)+1,OFFSET(E80,-1,0))","v":1},{"$f":"IF($C80=1,0,IF($C80=2,OFFSET(F80,-1,0)+1,OFFSET(F80,-1,0)))","v":5},{"$f":"IF(AND($C80<=2,$C80<>0),0,IF($C80=3,OFFSET(G80,-1,0)+1,OFFSET(G80,-1,0)))","v":1},{"$f":"IF(AND($C80<=3,$C80<>0),0,IF($C80=4,OFFSET(H80,-1,0)+1,OFFSET(H80,-1,0)))","v":0},0,0,0,"F","Serviço","Serviço","1.5.1.0.4.","SINAPI",92777,"ARMAÇÃO DE PILAR OU VIGA DE UMA ESTRUTURA CONVENCIONAL DE CONCRETO ARMADO EM UMA EDIFICAÇÃO TÉRREA OU SOBRADO UTILIZANDO AÇO CA-50 DE 8,0 MM - MONTAGEM. AF_12/2015","KG",104,1,null,null,null,null,null,"Referência: AGETOP - 60304"]
["S",3,"S",0,1,5,1,0,0,0,0,"F","Serviço","Serviço","1.5.1.0.5.","SINAPI",92778,"ARMAÇÃO DE PILAR OU VIGA DE UMA ESTRUTURA CONVENCIONAL DE CONCRETO ARMADO EM UMA EDIFICAÇÃO TÉRREA OU SOBRADO UTILIZANDO AÇO CA-50 DE 10,0 MM - MONTAGEM. AF_12/2015","KG",206,1,null,null,null,null,null,"Referência: AGETOP - 60305"]
["S",3,"S",0,1,5,1,0,0,0,0,"F","Serviço","Serviço","1.5.1.0.6.","SINAPI",92775,"ARMAÇÃO DE PILAR OU VIGA DE UMA ESTRUTURA CONVENCIONAL DE CONCRETO ARMADO EM UMA EDIFICAÇÃO TÉRREA OU SOBRADO UTILIZANDO AÇO CA-60 DE 5,0 MM - MONTAGEM. AF_12/2015","KG",133,1,null,null,null,null,null,"Referência: AGETOP - 60314"]
[3,3,3,6,1,5,2,0,0,6,21,"F","Nível 3","Nível 3","1.5.2.",null,null,"VIGA DE COBERTURA","-",null,1,null,null,null,null,null,""]
["S",3,"S",0,1,5,2,0,0,0,0,"F","Serviço","Serviço","1.5.2.0.1.","SINAPI",92464,"MONTAGEM E DESMONTAGEM DE FÔRMA DE VIGA, ESCORAMENTO METÁLICO, PÉ-DIREITO SIMPLES, EM CHAPA DE MADEIRA RESINADA, 8 UTILIZAÇÕES. AF_12/2015","M2",11.12,1,null,null,null,null,null,"Referência: AGETOP - 60209"]
["S",3,"S",0,1,5,2,0,0,0,0,"F","Serviço","Serviço","1.5.2.0.2.","SINAPI",94964,"CONCRETO FCK = 20MPA, TRAÇO 1:2,7:3 (CIMENTO/ AREIA MÉDIA/ BRITA 1)  - PREPARO MECÂNICO COM BETONEIRA 400 L. AF_07/2016","M3",0.64,1,null,null,null,null,null,""]
["S",3,"S",0,1,5,2,0,0,0,0,"F","Serviço","Serviço","1.5.2.0.3.","SINAPI",92873,"LANÇAMENTO COM USO DE BALDES, ADENSAMENTO E ACABAMENTO DE CONCRETO EM ESTRUTURAS. AF_12/2015","M3",0.64,1,null,null,null,null,null,"Referência: AGETOP - 60801"]
[{"$f":"CHOOSE(1+LOG(1+2*(ORÇAMENTO.Nivel=\"Nível 1\")+4*(ORÇAMENTO.Nivel=\"Nível 2\")+8*(ORÇAMENTO.Nivel=\"Nível 3\")+16*(ORÇAMENTO.Nivel=\"Nível 4\")+32*(ORÇAMENTO.Nivel=\"Serviço\"),2),0,1,2,3,4,\"S\")","v":"S"},3,"S",0,1,5,2,0,{"$f":"IF(AND($C87<=4,$C87<>0),0,IF(AND($C87=\"S\",$Y87>0),OFFSET(I87,-1,0)+1,OFFSET(I87,-1,0)))","v":0},0,0,"F","Serviço","Serviço","1.5.2.0.4.","SINAPI",92777,"ARMAÇÃO DE PILAR OU VIGA DE UMA ESTRUTURA CONVENCIONAL DE CONCRETO ARMADO EM UMA EDIFICAÇÃO TÉRREA OU SOBRADO UTILIZANDO AÇO CA-50 DE 8,0 MM - MONTAGEM. AF_12/2015","KG",28,1,null,null,null,null,null,"Referência: AGETOP - 60304"]
["S",3,"S",0,{"$f":"IF($C88=1,OFFSET(E88,-1,0)+1,OFFSET(E88,-1,0))","v":1},{"$f":"IF($C88=1,0,IF($C88=2,OFFSET(F88,-1,0)+1,OFFSET(F88,-1,0)))","v":5},{"$f":"IF(AND($C88<=2,$C88<>0),0,IF($C88=3,OFFSET(G88,-1,0)+1,OFFSET(G88,-1,0)))","v":2},{"$f":"IF(AND($C88<=3,$C88<>0),0,IF($C88=4,OFFSET(H88,-1,0)+1,OFFSET(H88,-1,0)))","v":0},0,0,0,"F","Serviço","Serviço","1.5.2.0.5.","SINAPI",92775,"ARMAÇÃO DE PILAR OU VIGA DE UMA ESTRUTURA CONVENCIONAL DE CONCRETO ARMADO EM UMA EDIFICAÇÃO TÉRREA OU SOBRADO UTILIZANDO AÇO CA-60 DE 5,0 MM - MONTAGEM. AF_12/2015","KG",14,1,null,null,null,null,null,"Referência: AGETOP - 60314"]
[2,{"$f":"IF(OR(C89=\"s\",C89=0),OFFSET(B89,-1,0),C89)","v":2},{"$f":"IF(OFFSET(C89,-1,0)=\"L\",1,IF(OFFSET(C89,-1,0)=1,2,IF(OR(A89=\"s\",A89=0),\"S\",IF(AND(OFFSET(C89,-1,0)=2,A89=4),3,IF(AND(OR(OFFSET(C89,-1,0)=\"s\",OFFSET(C89,-1,0)=0),A89<>\"s\",A89>OFFSET(B89,-1,0)),OFFSET(B89,-1,0),A89)))))","v":2},{"$f":"IF(OR(C89=\"S\",C89=0),0,IF(ISERROR(K89),J89,SMALL(J89:K89,1)))","v":73},1,6,0,0,0,291,73,"F","Nível 2","Nível 2","1.6.",null,null,"INSTALAÇÕES ELÉTRICAS","-",null,1,null,null,null,null,null,""]
[3,{"$f":"IF(OR(C90=\"s\",C90=0),OFFSET(B90,-1,0),C90)","v":3},{"$f":"IF(OFFSET(C90,-1,0)=\"L\",1,IF(OFFSET(C90,-1,0)=1,2,IF(OR(A90=\"s\",A90=0),\"S\",IF(AND(OFFSET(C90,-1,0)=2,A90=4),3,IF(AND(OR(OFFSET(C90,-1,0)=\"s\",OFFSET(C90,-1,0)=0),A90<>\"s\",A90>OFFSET(B90,-1,0)),OFFSET(B90,-1,0),A90)))))","v":3},{"$f":"IF(OR(C90=\"S\",C90=0),0,IF(ISERROR(K90),J90,SMALL(J90:K90,1)))","v":4},{"$f":"IF($C90=1,OFFSET(E90,-1,0)+1,OFFSET(E90,-1,0))","v":1},{"$f":"IF($C90=1,0,IF($C90=2,OFFSET(F90,-1,0)+1,OFFSET(F90,-1,0)))","v":6},{"$f":"IF(AND($C90<=2,$C90<>0),0,IF($C90=3,OFFSET(G90,-1,0)+1,OFFSET(G90,-1,0)))","v":1},{"$f":"IF(AND($C90<=3,$C90<>0),0,IF($C90=4,OFFSET(H90,-1,0)+1,OFFSET(H90,-1,0)))","v":0},0,72,4,"F","Nível 3","Nível 3","1.6.1.","SINAPI",null,"SUBESTAÇÃO","-",null,1,null,null,null,null,null,""]
["S",3,"S",0,1,6,1,0,0,0,0,"F","Serviço","Serviço","1.6.1.0.1.","AGETOP",70268,"BARRA DE COBRE 2\" X 3/16\"  (2,0865 KG/M)","m     ",1.5,1,null,null,null,null,null,""]
["S",3,"S",0,1,6,1,0,0,0,0,"F","Serviço","Serviço","1.6.1.0.2.","AGETOP",71186,"DISPOSITIVO DE PROTEÇÃO CONTRA SURTOS (D.P.S.) 275V DE 90KA","Un    ",3,1,null,null,null,null,null,""]
["S",3,"S",0,1,6,1,0,0,0,0,"F","Serviço","Serviço","1.6.1.0.3.","AGETOP",71380,"HASTE REV.COBRE(COPPERWELD)  3/4\" X 2,40 M C/CONECTOR","Un    ",4,1,null,null,null,null,null,""]
[3,3,3,10,1,6,2,0,0,68,10,"F","Nível 3","Nível 3","1.6.2.","SINAPI",null,"QUADRO DE DISTRIBUIÇÃO","-",null,1,null,null,null,null,null,""]
["S",3,"S",0,1,6,2,0,0,0,0,"F","Serviço","Serviço","1.6.2.0.1.","SINAPI","74131/4","QUADRO DE DISTRIBUICAO DE ENERGIA DE EMBUTIR, EM CHAPA METALICA, PARA 18 DISJUNTORES TERMOMAGNETICOS MONOPOLARES, COM BARRAMENTO TRIFASICO E NEUTRO, FORNECIMENTO E INSTALACAO","UN",6,1,null,null,null,null,null,""]
["S",3,"S",0,1,6,2,0,0,0,0,"F","Serviço","Serviço","1.6.2.0.2.","SINAPI","74131/5","QUADRO DE DISTRIBUICAO DE ENERGIA DE EMBUTIR, EM CHAPA METALICA, PARA 24 DISJUNTORES TERMOMAGNETICOS MONOPOLARES, COM BARRAMENTO TRIFASICO E NEUTRO, FORNECIMENTO E INSTALACAO","UN",3,1,null,null,null,null,null,""]
["S",3,"S",0,1,6,2,0,0,0,0,"F","Serviço","Serviço","1.6.2.0.3.","SINAPI",93671,"DISJUNTOR TRIPOLAR TIPO DIN, CORRENTE NOMINAL DE 32A - FORNECIMENTO E INSTALAÇÃO. AF_04/2016","UN",4,1,null,null,null,null,null,"Referência: AGETOP - 71173"]
["S",3,"S",0,1,6,2,0,0,0,0,"F","Serviço","Serviço","1.6.2.0.4.","SINAPI",93672,"DISJUNTOR TRIPOLAR TIPO DIN, CORRENTE NOMINAL DE 40A - FORNECIMENTO E INSTALAÇÃO. AF_04/2016","UN",1,1,null,null,null,null,null,"Referência: AGETOP - 71174"]
["S",3,"S",0,1,6,2,0,0,0,0,"F","Serviço","Serviço","1.6.2.0.5.","SINAPI",93673,"DISJUNTOR TRIPOLAR TIPO DIN, CORRENTE NOMINAL DE 50A - FORNECIMENTO E INSTALAÇÃO. AF_04/2016","UN",4,1,null,null,null,null,null,"Referência: AGETOP - 71174"]
["S",3,"S",0,1,6,2,0,0,0,0,"F","Serviço","Serviço","1.6.2.0.6.","AGETOP",71175,"DISJUNTOR TRIPOLAR DE 60 A 100-A","Un    ",3,1,null,null,null,null,null,""]
["S",3,"S",0,1,6,2,0,0,0,0,"F","Serviço","Serviço","1.6.2.0.7.","SINAPI",93656,"DISJUNTOR MONOPOLAR TIPO DIN, CORRENTE NOMINAL DE 25A - FORNECIMENTO E INSTALAÇÃO. AF_04/2016","UN",37,1,null,null,null,null,null,""]
["S",3,"S",0,1,6,2,0,0,0,0,"F","Serviço","Serviço","1.6.2.0.8.","SINAPI",93654,"DISJUNTOR MONOPOLAR TIPO DIN, CORRENTE NOMINAL DE 16A - FORNECIMENTO E INSTALAÇÃO. AF_04/2016","UN",35,1,null,null,null,null,null,""]
["S",3,"S",0,1,6,2,0,0,0,0,"F","Serviço","Serviço","1.6.2.0.9.","SINAPI",93653,"DISJUNTOR MONOPOLAR TIPO DIN, CORRENTE NOMINAL DE 10A - FORNECIMENTO E INSTALAÇÃO. AF_04/2016","UN",33,1,null,null,null,null,null,""]
[3,3,3,8,1,6,3,0,0,58,8,"F","Nível 3","Nível 3","1.6.3.",null,null,"CABOS E FIOS","-",null,1,null,null,null,null,null,""]
[{"$f":"CHOOSE(1+LOG(1+2*(ORÇAMENTO.Nivel=\"Nível 1\")+4*(ORÇAMENTO.Nivel=\"Nível 2\")+8*(ORÇAMENTO.Nivel=\"Nível 3\")+16*(ORÇAMENTO.Nivel=\"Nível 4\")+32*(ORÇAMENTO.Nivel=\"Serviço\"),2),0,1,2,3,4,\"S\")","v":"S"},3,"S",0,1,6,3,0,{"$f":"IF(AND($C105<=4,$C105<>0),0,IF(AND($C105=\"S\",$Y105>0),OFFSET(I105,-1,0)+1,OFFSET(I105,-1,0)))","v":0},{"$f":"IF(OR($C105=\"S\",$C105=0),0,MATCH(0,OFFSET($D105,1,$C105,ROW($C$911)-ROW($C105)),0))","v":0},{"$f":"IF(OR($C105=\"S\",$C105=0),0,MATCH(OFFSET($D105,0,$C105)+1,OFFSET($D105,1,$C105,ROW($C$911)-ROW($C105)),0))","v":0},"F","Serviço","Serviço","1.6.3.0.1.","SINAPI",91926,"CABO DE COBRE FLEXÍVEL ISOLADO, 2,5 MM², ANTI-CHAMA 450/750 V, PARA CIRCUITOS TERMINAIS - FORNECIMENTO E INSTALAÇÃO. AF_12/2015","M",4850,1,null,null,null,null,null,"Referência: AGETOP - 70563"]
["S",3,"S",0,1,6,3,0,0,0,0,"F","Serviço","Serviço","1.6.3.0.2.","SINAPI",91928,"CABO DE COBRE FLEXÍVEL ISOLADO, 4 MM², ANTI-CHAMA 450/750 V, PARA CIRCUITOS TERMINAIS - FORNECIMENTO E INSTALAÇÃO. AF_12/2015","M",3980,1,null,null,null,null,null,"Referência: AGETOP - 70564"]
["S",3,"S",0,1,6,3,0,0,0,0,"F","Serviço","Serviço","1.6.3.0.3.","SINAPI",91930,"CABO DE COBRE FLEXÍVEL ISOLADO, 6 MM², ANTI-CHAMA 450/750 V, PARA CIRCUITOS TERMINAIS - FORNECIMENTO E INSTALAÇÃO. AF_12/2015","M",1563,1,null,null,null,null,null,"Referência: AGETOP - 70565"]
["S",3,"S",0,{"$f":"IF($C108=1,OFFSET(E108,-1,0)+1,OFFSET(E108,-1,0))","v":1},{"$f":"IF($C108=1,0,IF($C108=2,OFFSET(F108,-1,0)+1,OFFSET(F108,-1,0)))","v":6},{"$f":"IF(AND($C108<=2,$C108<>0),0,IF($C108=3,OFFSET(G108,-1,0)+1,OFFSET(G108,-1,0)))","v":3},{"$f":"IF(AND($C108<=3,$C108<>0),0,IF($C108=4,OFFSET(H108,-1,0)+1,OFFSET(H108,-1,0)))","v":0},0,0,0,"F","Serviço","Serviço","1.6.3.0.4.","SINAPI",92979,"CABO DE COBRE FLEXÍVEL ISOLADO, 10 MM², ANTI-CHAMA 450/750 V, PARA DISTRIBUIÇÃO - FORNECIMENTO E INSTALAÇÃO. AF_12/2015","M",1554.11,1,null,null,null,null,null,""]
["S",3,"S",0,1,6,3,0,0,0,0,"F","Serviço","Serviço","1.6.3.0.5.","SINAPI",92981,"CABO DE COBRE FLEXÍVEL ISOLADO, 16 MM², ANTI-CHAMA 450/750 V, PARA DISTRIBUIÇÃO - FORNECIMENTO E INSTALAÇÃO. AF_12/2015","M",943.56,1,null,null,null,null,null,""]
["S",3,"S",0,1,6,3,0,0,0,0,"F","Serviço","Serviço","1.6.3.0.6.","SINAPI",92983,"CABO DE COBRE FLEXÍVEL ISOLADO, 25 MM², ANTI-CHAMA 450/750 V, PARA DISTRIBUIÇÃO - FORNECIMENTO E INSTALAÇÃO. AF_12/2015","M",1789,1,null,null,null,null,null,""]
["S",3,"S",0,1,6,3,0,0,0,0,"F","Serviço","Serviço","1.6.3.0.7.","SINAPI",92985,"CABO DE COBRE FLEXÍVEL ISOLADO, 35 MM², ANTI-CHAMA 450/750 V, PARA DISTRIBUIÇÃO - FORNECIMENTO E INSTALAÇÃO. AF_12/2015","M",331.04,1,null,null,null,null,null,""]
[3,3,3,36,1,6,4,0,0,50,36,"F","Nível 3","Nível 3","1.6.4.",null,null,"ELETRODUTOS E ACESSÓRIOS","-",null,1,null,null,null,null,null,""]
["S",3,"S",0,1,6,4,0,0,0,0,"F","Serviço","Serviço","1.6.4.0.1.","SINAPI",91867,"ELETRODUTO RÍGIDO ROSCÁVEL, PVC, DN 25 MM (3/4\"), PARA CIRCUITOS TERMINAIS, INSTALADO EM LAJE - FORNECIMENTO E INSTALAÇÃO. AF_12/2015","M",2462,1,null,null,null,null,null,"Referência: AGETOP - 71201"]
["S",{"$f":"IF(OR(C114=\"s\",C114=0),OFFSET(B114,-1,0),C114)","v":3},{"$f":"IF(OFFSET(C114,-1,0)=\"L\",1,IF(OFFSET(C114,-1,0)=1,2,IF(OR(A114=\"s\",A114=0),\"S\",IF(AND(OFFSET(C114,-1,0)=2,A114=4),3,IF(AND(OR(OFFSET(C114,-1,0)=\"s\",OFFSET(C114,-1,0)=0),A114<>\"s\",A114>OFFSET(B114,-1,0)),OFFSET(B114,-1,0),A114)))))","v":"S"},{"$f":"IF(OR(C114=\"S\",C114=0),0,IF(ISERROR(K114),J114,SMALL(J114:K114,1)))","v":0},1,6,4,0,0,0,0,"F","Serviço","Serviço","1.6.4.0.2.","SINAPI",91868,"ELETRODUTO RÍGIDO ROSCÁVEL, PVC, DN 32 MM (1\"), PARA CIRCUITOS TERMINAIS, INSTALADO EM LAJE - FORNECIMENTO E INSTALAÇÃO. AF_12/2015","M",1987,1,null,null,null,null,null,"Referência: AGETOP - 71202"]
["S",3,"S",0,1,6,4,0,0,0,0,"F","Serviço","Serviço","1.6.4.0.3.","SINAPI",93008,"ELETRODUTO RÍGIDO ROSCÁVEL, PVC, DN 50 MM (1 1/2\") - FORNECIMENTO E INSTALAÇÃO. AF_12/2015","M",989,1,null,null,null,null,null,""]
["S",3,"S",0,1,6,4,0,0,0,0,"F","Serviço","Serviço","1.6.4.0.4.","SINAPI",93009,"ELETRODUTO RÍGIDO ROSCÁVEL, PVC, DN 60 MM (2\") - FORNECIMENTO E INSTALAÇÃO. AF_12/2015","M",769,1,null,null,null,null,null,""]
["S",3,"S",0,1,6,4,0,0,0,0,"F","Serviço","Serviço","1.6.4.0.5.","SINAPI",93012,"ELETRODUTO RÍGIDO ROSCÁVEL, PVC, DN 110 MM (4\") - FORNECIMENTO E INSTALAÇÃO. AF_12/2015","M",25,1,null,null,null,null,null,""]
["S",3,"S",0,1,6,4,0,0,0,0,"F","Serviço","Serviço","1.6.4.0.6.","AGETOP",70351,"BRACADEIRA METALICA TIPO \"U\" DIAM. 3/4\"","Un    ",500,1,null,null,null,null,null,""]
["S",3,"S",0,1,6,4,0,0,0,0,"F","Serviço","Serviço","1.6.4.0.7.","AGETOP",70352,"BRACADEIRA METALICA TIPO \"U\" DIAM. 1\"","Un    ",362,1,null,null,null,null,null,""]
["S",3,"S",0,1,6,4,0,0,0,0,"F","Serviço","Serviço","1.6.4.0.8.","AGETOP",70354,"BRACADEIRA METALICA TIPO \"U\" DIAM. 1.1/2\"","Un    ",199,1,null,null,null,null,null,""]
["S",3,"S",0,1,6,4,0,0,0,0,"F","Serviço","Serviço","1.6.4.0.9.","AGETOP",70355,"BRACADEIRA METALICA TIPO \"U\" DIAM. 2\"","Un    ",197,1,null,null,null,null,null,""]
["S",3,"S",0,1,6,4,0,0,0,0,"F","Serviço","Serviço","1.6.4.0.10.","AGETOP",70358,"BRACADEIRA METALICA TIPO \"U\" DIAM. 4\"","Un    ",9,1,null,null,null,null,null,""]
["S",3,"S",0,1,6,4,0,0,0,0,"F","Serviço","Serviço","1.6.4.0.11.","SINAPI",91879,"LUVA PARA ELETRODUTO, PVC, ROSCÁVEL, DN 25 MM (3/4\"), PARA CIRCUITOS TERMINAIS, INSTALADA EM LAJE - FORNECIMENTO E INSTALAÇÃO. AF_12/2015","UN",500,1,null,null,null,null,null,"Referência: AGETOP - 71741"]
["S",3,"S",0,1,6,4,0,0,0,0,"F","Serviço","Serviço","1.6.4.0.12.","SINAPI",91880,"LUVA PARA ELETRODUTO, PVC, ROSCÁVEL, DN 32 MM (1\"), PARA CIRCUITOS TERMINAIS, INSTALADA EM LAJE - FORNECIMENTO E INSTALAÇÃO. AF_12/2015","UN",362,1,null,null,null,null,null,"Referência: AGETOP - 71742"]
["S",3,"S",0,1,6,4,0,0,0,0,"F","Serviço","Serviço","1.6.4.0.13.","SINAPI",93013,"LUVA PARA ELETRODUTO, PVC, ROSCÁVEL, DN 50 MM (1 1/2\") - FORNECIMENTO E INSTALAÇÃO. AF_12/2015","UN",199,1,null,null,null,null,null,"Referência: AGETOP - 71744"]
["S",3,"S",0,1,6,4,0,0,0,0,"F","Serviço","Serviço","1.6.4.0.14.","SINAPI",93014,"LUVA PARA ELETRODUTO, PVC, ROSCÁVEL, DN 60 MM (2\") - FORNECIMENTO E INSTALAÇÃO. AF_12/2015","UN",197,1,null,null,null,null,null,"Referência: AGETOP - 71745"]
["S",3,"S",0,1,6,4,0,0,0,0,"F","Serviço","Serviço","1.6.4.0.15.","SINAPI",93017,"LUVA PARA ELETRODUTO, PVC, ROSCÁVEL, DN 110 MM (4\") - FORNECIMENTO E INSTALAÇÃO. AF_12/2015","UN",9,1,null,null,null,null,null,"Referência: AGETOP - 71748"]
["S",3,"S",0,1,6,4,0,0,0,0,"F","Serviço","Serviço","1.6.4.0.16.","SINAPI",92867,"CAIXA RETANGULAR 4\" X 2\" ALTA (2,00 M DO PISO), METÁLICA, INSTALADA EM PAREDE - FORNECIMENTO E INSTALAÇÃO. AF_12/2015","UN",110,1,null,null,null,null,null,""]
["S",3,"S",0,1,6,4,0,0,0,0,"F","Serviço","Serviço","1.6.4.0.17.","SINAPI",92869,"CAIXA RETANGULAR 4\" X 2\" BAIXA (0,30 M DO PISO), METÁLICA, INSTALADA EM PAREDE - FORNECIMENTO E INSTALAÇÃO. AF_12/2015","UN",135,1,null,null,null,null,null,""]
["S",3,"S",0,1,6,4,0,0,0,0,"F","Serviço","Serviço","1.6.4.0.18.","SINAPI",92868,"CAIXA RETANGULAR 4\" X 2\" MÉDIA (1,30 M DO PISO), METÁLICA, INSTALADA EM PAREDE - FORNECIMENTO E INSTALAÇÃO. AF_12/2015","UN",15,1,null,null,null,null,null,"Referência: AGETOP - 70691"]
["S",3,"S",0,1,6,4,0,0,0,0,"F","Serviço","Serviço","1.6.4.0.19.","SINAPI",95801,"CONDULETE DE ALUMÍNIO, TIPO X, PARA ELETRODUTO DE AÇO GALVANIZADO DN 20 MM (3/4''), APARENTE - FORNECIMENTO E INSTALAÇÃO. AF_11/2016_P","UN",500,1,null,null,null,null,null,"Referência: AGETOP - 70929"]
["S",3,"S",0,1,6,4,0,0,0,0,"F","Serviço","Serviço","1.6.4.0.20.","AGETOP",72395,"TAMPA CEGA PARA CONDULETE METÁLICO","Un    ",500,1,null,null,null,null,null,""]
["S",3,"S",0,1,6,4,0,0,0,0,"F","Serviço","Serviço","1.6.4.0.21.","SINAPI",97887,"CAIXA ENTERRADA ELÉTRICA RETANGULAR, EM ALVENARIA COM TIJOLOS CERÂMICOS MACIÇOS, FUNDO COM BRITA, DIMENSÕES INTERNAS: 0,4X0,4X0,4 M. AF_05/2018","UN",9,1,null,null,null,null,null,""]
["S",3,"S",0,1,6,4,0,0,0,0,"F","Serviço","Serviço","1.6.4.0.22.","SINAPI",6171,"TAMPA DE CONCRETO ARMADO 60X60X5CM PARA CAIXA","UN",1,1,null,null,null,null,null,""]
["S",3,"S",0,1,6,4,0,0,0,0,"F","Serviço","Serviço","1.6.4.0.23.","AGETOP",71861,"PARAFUSO P/BUCHA S-6","Un    ",700,1,null,null,null,null,null,""]
["S",3,"S",0,1,6,4,0,0,0,0,"F","Serviço","Serviço","1.6.4.0.24.","AGETOP",70391,"BUCHA DE NYLON S-6","Un    ",700,1,null,null,null,null,null,""]
["S",3,"S",0,1,6,4,0,0,0,0,"F","Serviço","Serviço","1.6.4.0.25.","SINAPI",91992,"TOMADA ALTA DE EMBUTIR (1 MÓDULO), 2P+T 10 A, INCLUINDO SUPORTE E PLACA - FORNECIMENTO E INSTALAÇÃO. AF_12/2015","UN",52,1,null,null,null,null,null,""]
["S",3,"S",0,1,6,4,0,0,0,0,"F","Serviço","Serviço","1.6.4.0.26.","SINAPI",91993,"TOMADA ALTA DE EMBUTIR (1 MÓDULO), 2P+T 20 A, INCLUINDO SUPORTE E PLACA - FORNECIMENTO E INSTALAÇÃO. AF_12/2015","UN",58,1,null,null,null,null,null,"Referência: AGETOP - 72585"]
["S",3,"S",0,1,6,4,0,0,0,0,"F","Serviço","Serviço","1.6.4.0.27.","SINAPI",92000,"TOMADA BAIXA DE EMBUTIR (1 MÓDULO), 2P+T 10 A, INCLUINDO SUPORTE E PLACA - FORNECIMENTO E INSTALAÇÃO. AF_12/2015","UN",135,1,null,null,null,null,null,"Referência: AGETOP - 72578"]
["S",3,"S",0,1,6,4,0,0,0,0,"F","Serviço","Serviço","1.6.4.0.28.","SINAPI",91996,"TOMADA MÉDIA DE EMBUTIR (1 MÓDULO), 2P+T 10 A, INCLUINDO SUPORTE E PLACA - FORNECIMENTO E INSTALAÇÃO. AF_12/2015","UN",15,1,null,null,null,null,null,"Referência: AGETOP - 72578"]
["S",3,"S",0,1,6,4,0,0,0,0,"F","Serviço","Serviço","1.6.4.0.29.","SINAPI",97585,"LUMINÁRIA TIPO CALHA, DE SOBREPOR, COM 2 LÂMPADAS TUBULARES DE 18 W - FORNECIMENTO E INSTALAÇÃO. AF_11/2017","UN",388,1,null,null,null,null,null,""]
["S",3,"S",0,1,6,4,0,0,0,0,"F","Serviço","Serviço","1.6.4.0.30.","SINAPI",97593,"LUMINÁRIA TIPO SPOT, DE SOBREPOR, COM 1 LÂMPADA DE 15 W - FORNECIMENTO E INSTALAÇÃO. AF_11/2017","UN",43,1,null,null,null,null,null,"Referência: AGETOP - 71688"]
["S",3,"S",0,1,6,4,0,0,0,0,"F","Serviço","Serviço","1.6.4.0.31.","SINAPI",97606,"LUMINÁRIA ARANDELA TIPO MEIA-LUA, PARA 1 LÂMPADA DE 15 W - FORNECIMENTO E INSTALAÇÃO. AF_11/2017","UN",4,1,null,null,null,null,null,""]
["S",3,"S",0,1,6,4,0,0,0,0,"F","Serviço","Serviço","1.6.4.0.32.","SINAPI",93043,"LÂMPADA LED 10 W BIVOLT BRANCA, FORMATO TRADICIONAL (BASE E27) - FORNECIMENTO E INSTALAÇÃO","UN",4,1,null,null,null,null,null,""]
["S",3,"S",0,1,6,4,0,0,0,0,"F","Serviço","Serviço","1.6.4.0.33.","SINAPI",97601,"REFLETOR EM ALUMÍNIO COM SUPORTE E ALÇA, LÂMPADA 250 W - FORNECIMENTO E INSTALAÇÃO. AF_11/2017","UN",48,1,null,null,null,null,null,""]
["S",3,"S",0,1,6,4,0,0,0,0,"F","Serviço","Serviço","1.6.4.0.34.","SINAPI","73831/8","LAMPADA DE VAPOR DE SODIO DE 250WX220V - FORNECIMENTO E INSTALACAO","UN",48,1,null,null,null,null,null,""]
["S",3,"S",0,1,6,4,0,0,0,0,"F","Serviço","Serviço","1.6.4.0.35.","AGETOP",20162,"DEMOLIÇÃO DAS INSTALAÇÕES ELÉTRICAS E AFINS C/ TRANSP. ATÉ CB. E CARGA","H     ",40,1,null,null,null,null,null,""]
[3,3,3,14,1,6,5,0,0,14,{"$error":"#N/A"},"F","Nível 3","Nível 3","1.6.5.",null,null,"IMPLANTAÇÃO","-",null,1,null,null,null,null,null,""]
["S",3,"S",0,1,6,5,0,0,0,0,"F","Serviço","Serviço","1.6.5.0.1.","SINAPI","74131/4","QUADRO DE DISTRIBUICAO DE ENERGIA DE EMBUTIR, EM CHAPA METALICA, PARA 18 DISJUNTORES TERMOMAGNETICOS MONOPOLARES, COM BARRAMENTO TRIFASICO E NEUTRO, FORNECIMENTO E INSTALACAO","UN",4,1,null,null,null,null,null,""]
["S",3,"S",0,1,6,5,0,0,0,0,"F","Serviço","Serviço","1.6.5.0.2.","SINAPI",92979,"CABO DE COBRE FLEXÍVEL ISOLADO, 10 MM², ANTI-CHAMA 450/750 V, PARA DISTRIBUIÇÃO - FORNECIMENTO E INSTALAÇÃO. AF_12/2015","M",586.27,1,null,null,null,null,null,""]
["S",3,"S",0,1,6,5,0,0,0,0,"F","Serviço","Serviço","1.6.5.0.3.","SINAPI",91930,"CABO DE COBRE FLEXÍVEL ISOLADO, 6 MM², ANTI-CHAMA 450/750 V, PARA CIRCUITOS TERMINAIS - FORNECIMENTO E INSTALAÇÃO. AF_12/2015","M",1248.9000000000001,1,null,null,null,null,null,"Referência: AGETOP - 70565"]
["S",3,"S",0,1,6,5,0,0,0,0,"F","Serviço","Serviço","1.6.5.0.4.","SINAPI",91864,"ELETRODUTO RÍGIDO ROSCÁVEL, PVC, DN 32 MM (1\"), PARA CIRCUITOS TERMINAIS, INSTALADO EM FORRO - FORNECIMENTO E INSTALAÇÃO. AF_12/2015","M",149.63,1,null,null,null,null,null,""]
["S",3,"S",0,1,6,5,0,0,0,0,"F","Serviço","Serviço","1.6.5.0.5.","SINAPI",93008,"ELETRODUTO RÍGIDO ROSCÁVEL, PVC, DN 50 MM (1 1/2\") - FORNECIMENTO E INSTALAÇÃO. AF_12/2015","M",117.25,1,null,null,null,null,null,""]
["S",3,"S",0,1,6,5,0,0,0,0,"F","Serviço","Serviço","1.6.5.0.6.","SINAPI",91885,"LUVA PARA ELETRODUTO, PVC, ROSCÁVEL, DN 32 MM (1\"), PARA CIRCUITOS TERMINAIS, INSTALADA EM PAREDE - FORNECIMENTO E INSTALAÇÃO. AF_12/2015","UN",50,1,null,null,null,null,null,"Referência: AGETOP - 71742"]
["S",3,"S",0,1,6,5,0,0,0,0,"F","Serviço","Serviço","1.6.5.0.7.","SINAPI",93013,"LUVA PARA ELETRODUTO, PVC, ROSCÁVEL, DN 50 MM (1 1/2\") - FORNECIMENTO E INSTALAÇÃO. AF_12/2015","UN",40,1,null,null,null,null,null,"Referência: AGETOP - 71744"]
["S",3,"S",0,1,6,5,0,0,0,0,"F","Serviço","Serviço","1.6.5.0.8.","AGETOP",70352,"BRACADEIRA METALICA TIPO \"U\" DIAM. 1\"","Un    ",50,1,null,null,null,null,null,""]
["S",3,"S",0,1,6,5,0,0,0,0,"F","Serviço","Serviço","1.6.5.0.9.","AGETOP",70354,"BRACADEIRA METALICA TIPO \"U\" DIAM. 1.1/2\"","Un    ",40,1,null,null,null,null,null,""]
["S",3,"S",0,1,6,5,0,0,0,0,"F","Serviço","Serviço","1.6.5.0.10.","SINAPI",97889,"CAIXA ENTERRADA ELÉTRICA RETANGULAR, EM ALVENARIA COM TIJOLOS CERÂMICOS MACIÇOS, FUNDO COM BRITA, DIMENSÕES INTERNAS: 0,8X0,8X0,6 M. AF_05/2018","UN",5,1,null,null,null,null,null,""]
["S",3,"S",0,1,6,5,0,0,0,0,"F","Serviço","Serviço","1.6.5.0.11.","SINAPI",6171,"TAMPA DE CONCRETO ARMADO 60X60X5CM PARA CAIXA","UN",5,1,null,null,null,null,null,""]
["S",3,"S",0,1,6,5,0,0,0,0,"F","Serviço","Serviço","1.6.5.0.12.","AGETOP",71861,"PARAFUSO P/BUCHA S-6","Un    ",300,1,null,null,null,null,null,""]
["S",3,"S",0,1,6,5,0,0,0,0,"F","Serviço","Serviço","1.6.5.0.13.","AGETOP",70391,"BUCHA DE NYLON S-6","Un    ",300,1,null,null,null,null,null,""]
[{"$f":"CHOOSE(1+LOG(1+2*(ORÇAMENTO.Nivel=\"Nível 1\")+4*(ORÇAMENTO.Nivel=\"Nível 2\")+8*(ORÇAMENTO.Nivel=\"Nível 3\")+16*(ORÇAMENTO.Nivel=\"Nível 4\")+32*(ORÇAMENTO.Nivel=\"Serviço\"),2),0,1,2,3,4,\"S\")","v":2},{"$f":"IF(OR(C162=\"s\",C162=0),OFFSET(B162,-1,0),C162)","v":2},{"$f":"IF(OFFSET(C162,-1,0)=\"L\",1,IF(OFFSET(C162,-1,0)=1,2,IF(OR(A162=\"s\",A162=0),\"S\",IF(AND(OFFSET(C162,-1,0)=2,A162=4),3,IF(AND(OR(OFFSET(C162,-1,0)=\"s\",OFFSET(C162,-1,0)=0),A162<>\"s\",A162>OFFSET(B162,-1,0)),OFFSET(B162,-1,0),A162)))))","v":2},{"$f":"IF(OR(C162=\"S\",C162=0),0,IF(ISERROR(K162),J162,SMALL(J162:K162,1)))","v":128},{"$f":"IF($C162=1,OFFSET(E162,-1,0)+1,OFFSET(E162,-1,0))","v":1},{"$f":"IF($C162=1,0,IF($C162=2,OFFSET(F162,-1,0)+1,OFFSET(F162,-1,0)))","v":7},{"$f":"IF(AND($C162<=2,$C162<>0),0,IF($C162=3,OFFSET(G162,-1,0)+1,OFFSET(G162,-1,0)))","v":0},{"$f":"IF(AND($C162<=3,$C162<>0),0,IF($C162=4,OFFSET(H162,-1,0)+1,OFFSET(H162,-1,0)))","v":0},{"$f":"IF(AND($C162<=4,$C162<>0),0,IF(AND($C162=\"S\",$Y162>0),OFFSET(I162,-1,0)+1,OFFSET(I162,-1,0)))","v":0},218,128,"F","Nível 2","Nível 2","1.7.","AGETOP",null,"INSTALAÇÕES HIDROSSANITÁRIAS","-",null,1,null,null,null,null,null,""]
[3,3,3,25,1,7,1,0,0,127,25,"F","Nível 3","Nível 3","1.7.1.","SINAPI",null,"PEÇAS E ACESSÓRIOS","-",null,1,null,null,null,null,null,""]
[4,4,4,3,1,7,1,1,0,24,3,"F","Nível 4","Nível 4","1.7.1.1.","SINAPI",null,"CAIXAS E CURVAS","-",null,1,null,null,null,null,null,""]
["S",4,"S",0,1,7,1,1,0,0,0,"F","Serviço","Serviço","1.7.1.1.1.","AGETOP",71140,"CURVA DE 90 GRAUS DE PVC RIGIDO DIAM.1/2\"","Un    ",2,1,null,null,null,null,null,""]
["S",4,"S",0,1,7,1,1,0,0,0,"F","Serviço","Serviço","1.7.1.1.2.","AGETOP",71141,"CURVA DE 90 GRAUS DE PVC RIGIDO DIAM. 3/4\"","Un    ",2,1,null,null,null,null,null,""]
[4,4,4,8,1,7,1,2,0,21,8,"F","Nível 4","Nível 4","1.7.1.2.","SINAPI",null,"VASO SANITÁRIO / ACESSÓRIOS","-",null,1,null,null,null,null,null,""]
["S",4,"S",0,1,7,1,2,0,0,0,"F","Serviço","Serviço","1.7.1.2.1.","SINAPI",95470,"VASO SANITARIO SIFONADO CONVENCIONAL COM LOUÇA BRANCA, INCLUSO CONJUNTO DE LIGAÇÃO PARA BACIA SANITÁRIA AJUSTÁVEL - FORNECIMENTO E INSTALAÇÃO. AF_10/2016","UN",2,1,null,null,null,null,null,""]
["S",4,"S",0,1,7,1,2,0,{"$f":"IF(OR($C169=\"S\",$C169=0),0,MATCH(0,OFFSET($D169,1,$C169,ROW($C$911)-ROW($C169)),0))","v":0},{"$f":"IF(OR($C169=\"S\",$C169=0),0,MATCH(OFFSET($D169,0,$C169)+1,OFFSET($D169,1,$C169,ROW($C$911)-ROW($C169)),0))","v":0},"F","Serviço","Serviço","1.7.1.2.2.","SINAPI",99635,"VÁLVULA DE DESCARGA METÁLICA, BASE 1 1/2 \", ACABAMENTO METALICO CROMADO - FORNECIMENTO E INSTALAÇÃO. AF_01/2019","UN",2,1,null,null,null,null,null,"Referência: AGETOP - 80515"]
["S",4,"S",0,1,7,1,2,0,0,0,"F","Serviço","Serviço","1.7.1.2.3.","AGETOP",80520,"CONJUNTO DE FIXACAO P/VASO SANITARIO (PAR)","CJ    ",2,1,null,null,null,null,null,""]
["S",4,"S",0,1,7,1,2,0,0,0,"F","Serviço","Serviço","1.7.1.2.4.","AGETOP",80513,"TUBO PARA VÁLVULA DE DESCARGA ( CURTO 1.1/4\" )","Un    ",2,1,null,null,null,null,null,""]
["S",4,"S",0,1,7,1,2,0,0,0,"F","Serviço","Serviço","1.7.1.2.5.","AGETOP",80526,"ASSENTO EM POLIPROPILENO COM SISTEMA DE FECHAMENTO SUAVE PARA VASO SANITÁRIO","Un    ",2,1,null,null,null,null,null,""]
["S",4,"S",0,1,7,1,2,0,0,0,"F","Serviço","Serviço","1.7.1.2.6.","AGETOP",80510,"ANEL DE VEDAÇÃO PARA VASO SANITÁRIO","Un    ",2,1,null,null,null,null,null,""]
["S",4,"S",0,1,7,1,2,0,0,0,"F","Serviço","Serviço","1.7.1.2.7.","SINAPI",95544,"PAPELEIRA DE PAREDE EM METAL CROMADO SEM TAMPA, INCLUSO FIXAÇÃO. AF_10/2016","UN",2,1,null,null,null,null,null,""]
[4,4,4,7,1,7,1,3,0,13,7,"F","Nível 4","Nível 4","1.7.1.3.","SINAPI",null,"LAVATÓRIO / ACESSÓRIOS","-",null,1,null,null,null,null,null,""]
["S",4,"S",0,1,7,1,3,0,0,0,"F","Serviço","Serviço","1.7.1.3.1.","AGETOP",80542,"LAVATÓRIO MÉDIO SEM COLUNA","Un    ",2,1,null,null,null,null,null,""]
["S",4,"S",0,1,7,1,3,0,0,0,"F","Serviço","Serviço","1.7.1.3.2.","AGETOP",80550,"FIXACAO P/LAVATORIO (PAR)","PAR   ",2,1,null,null,null,null,null,""]
["S",4,"S",0,1,7,1,3,0,0,0,"F","Serviço","Serviço","1.7.1.3.3.","AGETOP",80556,"LIGAÇÃO FLEXÍVEL PVC DIAM.1/2\" (ENGATE)","Un    ",2,1,null,null,null,null,null,""]
["S",4,"S",0,1,7,1,3,0,0,0,"F","Serviço","Serviço","1.7.1.3.4.","SINAPI",86883,"SIFÃO DO TIPO FLEXÍVEL EM PVC 1\u0094 X 1.1/2\u0094 - FORNECIMENTO E INSTALAÇÃO. AF_12/2013","UN",2,1,null,null,null,null,null,""]
["S",4,"S",0,1,7,1,3,0,0,0,"F","Serviço","Serviço","1.7.1.3.5.","SINAPI",86915,"TORNEIRA CROMADA DE MESA, 1/2\" OU 3/4\", PARA LAVATÓRIO, PADRÃO MÉDIO - FORNECIMENTO E INSTALAÇÃO. AF_12/2013","UN",2,1,null,null,null,null,null,"Referência: AGETOP - 80570"]
["S",4,"S",0,1,7,1,3,0,0,0,"F","Serviço","Serviço","1.7.1.3.6.","SINAPI",86877,"VÁLVULA EM METAL CROMADO 1.1/2\" X 1.1/2\" PARA TANQUE OU LAVATÓRIO, COM OU SEM LADRÃO - FORNECIMENTO E INSTALAÇÃO. AF_12/2013","UN",2,1,null,null,null,null,null,""]
[4,4,4,4,1,7,1,4,0,6,4,"F","Nível 4","Nível 4","1.7.1.4.","SINAPI",null,"PIA / ACESSÓRIOS","-",null,1,null,null,null,null,null,""]
["S",4,"S",0,1,7,1,4,0,0,0,"F","Serviço","Serviço","1.7.1.4.1.","SINAPI",86912,"TORNEIRA CROMADA LONGA, DE PAREDE, 1/2\" OU 3/4\", PARA PIA DE COZINHA, PADRÃO MÉDIO - FORNECIMENTO E INSTALAÇÃO. AF_12/2013","UN",2,1,null,null,null,null,null,""]
["S",4,"S",0,1,7,1,4,0,0,0,"F","Serviço","Serviço","1.7.1.4.2.","SINAPI",86881,"SIFÃO DO TIPO GARRAFA EM METAL CROMADO 1 X 1.1/2\" - FORNECIMENTO E INSTALAÇÃO. AF_12/2013","UN",2,1,null,null,null,null,null,"Referência: AGETOP - 80670"]
["S",4,"S",0,1,7,1,4,0,0,0,"F","Serviço","Serviço","1.7.1.4.3.","SINAPI",86878,"VÁLVULA EM METAL CROMADO TIPO AMERICANA 3.1/2\" X 1.1/2\" PARA PIA - FORNECIMENTO E INSTALAÇÃO. AF_12/2013","UN",2,1,null,null,null,null,null,""]
[{"$f":"CHOOSE(1+LOG(1+2*(ORÇAMENTO.Nivel=\"Nível 1\")+4*(ORÇAMENTO.Nivel=\"Nível 2\")+8*(ORÇAMENTO.Nivel=\"Nível 3\")+16*(ORÇAMENTO.Nivel=\"Nível 4\")+32*(ORÇAMENTO.Nivel=\"Serviço\"),2),0,1,2,3,4,\"S\")","v":4},4,4,2,1,7,1,5,{"$f":"IF(AND($C186<=4,$C186<>0),0,IF(AND($C186=\"S\",$Y186>0),OFFSET(I186,-1,0)+1,OFFSET(I186,-1,0)))","v":0},2,29,"F","Nível 4","Nível 4","1.7.1.5.","SINAPI",null,"REGISTROS","-",null,1,null,null,null,null,null,""]
["S",4,"S",0,{"$f":"IF($C187=1,OFFSET(E187,-1,0)+1,OFFSET(E187,-1,0))","v":1},{"$f":"IF($C187=1,0,IF($C187=2,OFFSET(F187,-1,0)+1,OFFSET(F187,-1,0)))","v":7},{"$f":"IF(AND($C187<=2,$C187<>0),0,IF($C187=3,OFFSET(G187,-1,0)+1,OFFSET(G187,-1,0)))","v":1},{"$f":"IF(AND($C187<=3,$C187<>0),0,IF($C187=4,OFFSET(H187,-1,0)+1,OFFSET(H187,-1,0)))","v":5},0,0,0,"F","Serviço","Serviço","1.7.1.5.1.","SINAPI",94794,"REGISTRO DE GAVETA BRUTO, LATÃO, ROSCÁVEL, 1 1/2\u0094, COM ACABAMENTO E CANOPLA CROMADOS, INSTALADO EM RESERVAÇÃO DE ÁGUA DE EDIFICAÇÃO QUE POSSUA RESERVATÓRIO DE FIBRA/FIBROCIMENTO \u0096 FORNECIMENTO E INSTALAÇÃO. AF_06/2016","UN",2,1,null,null,null,null,null,"Referência: AGETOP - 80929"]
[3,{"$f":"IF(OR(C188=\"s\",C188=0),OFFSET(B188,-1,0),C188)","v":3},{"$f":"IF(OFFSET(C188,-1,0)=\"L\",1,IF(OFFSET(C188,-1,0)=1,2,IF(OR(A188=\"s\",A188=0),\"S\",IF(AND(OFFSET(C188,-1,0)=2,A188=4),3,IF(AND(OR(OFFSET(C188,-1,0)=\"s\",OFFSET(C188,-1,0)=0),A188<>\"s\",A188>OFFSET(B188,-1,0)),OFFSET(B188,-1,0),A188)))))","v":3},{"$f":"IF(OR(C188=\"S\",C188=0),0,IF(ISERROR(K188),J188,SMALL(J188:K188,1)))","v":38},1,7,2,0,0,102,38,"F","Nível 3","Nível 3","1.7.2.","SINAPI",null,"ÁGUA FRIA","-",null,1,null,null,null,null,null,""]
[4,4,4,4,1,7,2,1,0,37,4,"F","Nível 4","Nível 4","1.7.2.1.","SINAPI",null,"TUBOS DE PVC SOLDÁVEL","-",null,1,null,null,null,null,null,""]
["S",4,"S",0,1,7,2,1,0,0,0,"F","Serviço","Serviço","1.7.2.1.1.","SINAPI",89402,"TUBO, PVC, SOLDÁVEL, DN 25MM, INSTALADO EM RAMAL DE DISTRIBUIÇÃO DE ÁGUA - FORNECIMENTO E INSTALAÇÃO. AF_12/2014","M",72,1,null,null,null,null,null,"Referência: AGETOP - 81003"]
["S",4,"S",0,1,7,2,1,0,0,0,"F","Serviço","Serviço","1.7.2.1.2.","SINAPI",89449,"TUBO, PVC, SOLDÁVEL, DN 50MM, INSTALADO EM PRUMADA DE ÁGUA - FORNECIMENTO E INSTALAÇÃO. AF_12/2014","M",30,1,null,null,null,null,null,""]
["S",4,"S",0,1,7,2,1,0,0,0,"F","Serviço","Serviço","1.7.2.1.3.","SINAPI",89451,"TUBO, PVC, SOLDÁVEL, DN 75MM, INSTALADO EM PRUMADA DE ÁGUA - FORNECIMENTO E INSTALAÇÃO. AF_12/2014","M",102,1,null,null,null,null,null,""]
[4,4,4,3,1,7,2,2,0,33,3,"F","Nível 4","Nível 4","1.7.2.2.","SINAPI",null,"ADAPTADORES DE PVC SOLDÁVEL","-",null,1,null,null,null,null,null,""]
["S",4,"S",0,1,7,2,2,0,0,0,"F","Serviço","Serviço","1.7.2.2.1.","SINAPI",94711,"ADAPTADOR COM FLANGES LIVRES, PVC, SOLDÁVEL, DN 50 MM X 1 1/2 , INSTALADO EM RESERVAÇÃO DE ÁGUA DE EDIFICAÇÃO QUE POSSUA RESERVATÓRIO DE FIBRA/FIBROCIMENTO   FORNECIMENTO E INSTALAÇÃO. AF_06/2016","UN",10,1,null,null,null,null,null,"Referência: AGETOP - 81043"]
["S",4,"S",0,1,7,2,2,0,0,0,"F","Serviço","Serviço","1.7.2.2.2.","SINAPI",95141,"ADAPTADOR COM FLANGES LIVRES, PVC, SOLDÁVEL LONGO, DN  25 MM X 3/4 , INSTALADO EM RESERVAÇÃO DE ÁGUA DE EDIFICAÇÃO QUE POSSUA RESERVATÓRIO DE FIBRA/FIBROCIMENTO    FORNECIMENTO E INSTALAÇÃO. AF_06/2016","UN",4,1,null,null,null,null,null,""]
[4,4,4,6,1,7,2,3,0,30,6,"F","Nível 4","Nível 4","1.7.2.3.","SINAPI",null,"LUVAS DE PVC","-",null,1,null,null,null,null,null,""]
["S",4,"S",0,1,7,2,3,0,0,0,"F","Serviço","Serviço","1.7.2.3.1.","SINAPI",89528,"LUVA, PVC, SOLDÁVEL, DN 25MM, INSTALADO EM PRUMADA DE ÁGUA - FORNECIMENTO E INSTALAÇÃO. AF_12/2014","UN",5,1,null,null,null,null,null,""]
["S",4,"S",0,1,7,2,3,0,0,0,"F","Serviço","Serviço","1.7.2.3.2.","SINAPI",89558,"LUVA, PVC, SOLDÁVEL, DN 40MM, INSTALADO EM PRUMADA DE ÁGUA - FORNECIMENTO E INSTALAÇÃO. AF_12/2014","UN",5,1,null,null,null,null,null,""]
["S",4,"S",0,1,7,2,3,0,0,0,"F","Serviço","Serviço","1.7.2.3.3.","SINAPI",89575,"LUVA, PVC, SOLDÁVEL, DN 50MM, INSTALADO EM PRUMADA DE ÁGUA - FORNECIMENTO E INSTALAÇÃO. AF_12/2014","UN",5,1,null,null,null,null,null,"Referência: AGETOP - 81105"]
["S",4,"S",0,1,7,2,3,0,0,0,"F","Serviço","Serviço","1.7.2.3.4.","SINAPI",89611,"LUVA, PVC, SOLDÁVEL, DN 75MM, INSTALADO EM PRUMADA DE ÁGUA - FORNECIMENTO E INSTALAÇÃO. AF_12/2014","UN",5,1,null,null,null,null,null,""]
["S",4,"S",0,1,7,2,3,0,0,0,"F","Serviço","Serviço","1.7.2.3.5.","SINAPI",89534,"LUVA SOLDÁVEL E COM ROSCA, PVC, SOLDÁVEL, DN 25MM X 3/4\u0094, INSTALADO EM PRUMADA DE ÁGUA - FORNECIMENTO E INSTALAÇÃO. AF_12/2014","UN",5,1,null,null,null,null,null,""]
[4,4,4,6,1,7,2,4,0,24,6,"F","Nível 4","Nível 4","1.7.2.4.","SINAPI",null,"BUCHAS","-",null,1,null,null,null,null,null,""]
["S",4,"S",0,1,7,2,4,0,0,0,"F","Serviço","Serviço","1.7.2.4.1.","SINAPI",96662,"BUCHA DE REDUÇÃO, PPR, 32 X 25, CLASSE PN 25, INSTALADO EM RAMAL DE DISTRIBUIÇÃO DE ÁGUA \u0096 FORNECIMENTO E INSTALAÇÃO . AF_06/2015","UN",5,1,null,null,null,null,null,""]
["S",4,"S",0,1,7,2,4,0,0,0,"F","Serviço","Serviço","1.7.2.4.2.","SINAPI",89605,"LUVA DE REDUÇÃO, PVC, SOLDÁVEL, DN 60MM X 50MM, INSTALADO EM PRUMADA DE ÁGUA - FORNECIMENTO E INSTALAÇÃO. AF_12/2014","UN",5,1,null,null,null,null,null,""]
["S",4,"S",0,1,7,2,4,0,0,0,"F","Serviço","Serviço","1.7.2.4.3.","SINAPI",89579,"LUVA DE REDUÇÃO, PVC, SOLDÁVEL, DN 50MM X 25MM, INSTALADO EM PRUMADA DE ÁGUA   FORNECIMENTO E INSTALAÇÃO. AF_12/2014","UN",5,1,null,null,null,null,null,""]
["S",4,"S",0,1,7,2,4,0,0,0,"F","Serviço","Serviço","1.7.2.4.4.","AGETOP",81180,"BUCHA DE REDUCAO SOLDAVEL LONGA 50 X 32 mm","Un    ",5,1,null,null,null,null,null,""]
["S",4,"S",0,1,7,2,4,0,0,0,"F","Serviço","Serviço","1.7.2.4.5.","AGETOP",81185,"BUCHA DE REDUÇÃO SOLDÁVEL LONGA 75 X 50 MM","un    ",5,1,null,null,null,null,null,""]
[4,4,4,7,1,7,2,5,0,18,7,"F","Nível 4","Nível 4","1.7.2.5.","SINAPI",null,"JOELHO","-",null,1,null,null,null,null,null,""]
["S",4,"S",0,1,7,2,5,0,0,0,"F","Serviço","Serviço","1.7.2.5.1.","SINAPI",89498,"JOELHO 45 GRAUS, PVC, SOLDÁVEL, DN 40MM, INSTALADO EM PRUMADA DE ÁGUA - FORNECIMENTO E INSTALAÇÃO. AF_12/2014","UN",6,1,null,null,null,null,null,""]
["S",4,"S",0,1,7,2,5,0,0,0,"F","Serviço","Serviço","1.7.2.5.2.","SINAPI",89481,"JOELHO 90 GRAUS, PVC, SOLDÁVEL, DN 25MM, INSTALADO EM PRUMADA DE ÁGUA - FORNECIMENTO E INSTALAÇÃO. AF_12/2014","UN",15,1,null,null,null,null,null,""]
["S",4,"S",0,1,7,2,5,0,0,0,"F","Serviço","Serviço","1.7.2.5.3.","SINAPI",89501,"JOELHO 90 GRAUS, PVC, SOLDÁVEL, DN 50MM, INSTALADO EM PRUMADA DE ÁGUA - FORNECIMENTO E INSTALAÇÃO. AF_12/2014","UN",12,1,null,null,null,null,null,""]
["S",4,"S",0,1,7,2,5,0,0,0,"F","Serviço","Serviço","1.7.2.5.4.","SINAPI",89513,"JOELHO 90 GRAUS, PVC, SOLDÁVEL, DN 75MM, INSTALADO EM PRUMADA DE ÁGUA - FORNECIMENTO E INSTALAÇÃO. AF_12/2014","UN",10,1,null,null,null,null,null,"Referência: AGETOP - 81326"]
["S",4,"S",0,1,7,2,5,0,0,0,"F","Serviço","Serviço","1.7.2.5.5.","SINAPI",89529,"JOELHO 90 GRAUS, PVC, SERIE R, ÁGUA PLUVIAL, DN 100 MM, JUNTA ELÁSTICA, FORNECIDO E INSTALADO EM RAMAL DE ENCAMINHAMENTO. AF_12/2014","UN",3,1,null,null,null,null,null,""]
["S",4,"S",0,1,7,2,5,0,0,0,"F","Serviço","Serviço","1.7.2.5.6.","AGETOP",81380,"JOELHO 90 GRAUS C/ROSCA E BUCHA LATAO DIAM.1/2\"","Un    ",4,1,null,null,null,null,null,""]
[{"$f":"CHOOSE(1+LOG(1+2*(ORÇAMENTO.Nivel=\"Nível 1\")+4*(ORÇAMENTO.Nivel=\"Nível 2\")+8*(ORÇAMENTO.Nivel=\"Nível 3\")+16*(ORÇAMENTO.Nivel=\"Nível 4\")+32*(ORÇAMENTO.Nivel=\"Serviço\"),2),0,1,2,3,4,\"S\")","v":4},4,4,6,{"$f":"IF($C215=1,OFFSET(E215,-1,0)+1,OFFSET(E215,-1,0))","v":1},{"$f":"IF($C215=1,0,IF($C215=2,OFFSET(F215,-1,0)+1,OFFSET(F215,-1,0)))","v":7},{"$f":"IF(AND($C215<=2,$C215<>0),0,IF($C215=3,OFFSET(G215,-1,0)+1,OFFSET(G215,-1,0)))","v":2},{"$f":"IF(AND($C215<=3,$C215<>0),0,IF($C215=4,OFFSET(H215,-1,0)+1,OFFSET(H215,-1,0)))","v":6},{"$f":"IF(AND($C215<=4,$C215<>0),0,IF(AND($C215=\"S\",$Y215>0),OFFSET(I215,-1,0)+1,OFFSET(I215,-1,0)))","v":0},11,6,"F","Nível 4","Nível 4","1.7.2.6.","SINAPI",null,"TÊ","-",null,1,null,null,null,null,null,""]
["S",{"$f":"IF(OR(C216=\"s\",C216=0),OFFSET(B216,-1,0),C216)","v":4},{"$f":"IF(OFFSET(C216,-1,0)=\"L\",1,IF(OFFSET(C216,-1,0)=1,2,IF(OR(A216=\"s\",A216=0),\"S\",IF(AND(OFFSET(C216,-1,0)=2,A216=4),3,IF(AND(OR(OFFSET(C216,-1,0)=\"s\",OFFSET(C216,-1,0)=0),A216<>\"s\",A216>OFFSET(B216,-1,0)),OFFSET(B216,-1,0),A216)))))","v":"S"},{"$f":"IF(OR(C216=\"S\",C216=0),0,IF(ISERROR(K216),J216,SMALL(J216:K216,1)))","v":0},1,7,2,6,0,0,0,"F","Serviço","Serviço","1.7.2.6.1.","SINAPI",89617,"TE, PVC, SOLDÁVEL, DN 25MM, INSTALADO EM PRUMADA DE ÁGUA - FORNECIMENTO E INSTALAÇÃO. AF_12/2014","UN",5,1,null,null,null,null,null,""]
["S",4,"S",0,1,7,2,6,0,0,0,"F","Serviço","Serviço","1.7.2.6.2.","SINAPI",89623,"TE, PVC, SOLDÁVEL, DN 40MM, INSTALADO EM PRUMADA DE ÁGUA - FORNECIMENTO E INSTALAÇÃO. AF_12/2014","UN",5,1,null,null,null,null,null,""]
["S",4,"S",0,1,7,2,6,0,0,0,"F","Serviço","Serviço","1.7.2.6.3.","SINAPI",89625,"TE, PVC, SOLDÁVEL, DN 50MM, INSTALADO EM PRUMADA DE ÁGUA - FORNECIMENTO E INSTALAÇÃO. AF_12/2014","UN",5,1,null,null,null,null,null,""]
["S",4,"S",0,1,7,2,6,0,0,0,"F","Serviço","Serviço","1.7.2.6.4.","SINAPI",89627,"TÊ DE REDUÇÃO, PVC, SOLDÁVEL, DN 50MM X 25MM, INSTALADO EM PRUMADA DE ÁGUA - FORNECIMENTO E INSTALAÇÃO. AF_12/2014","UN",5,1,null,null,null,null,null,""]
["S",4,"S",0,1,7,2,6,0,0,0,"F","Serviço","Serviço","1.7.2.6.5.","SINAPI",94698,"TÊ DE REDUÇÃO, PVC, SOLDÁVEL, DN 75 MM X 50 MM, INSTALADO EM RESERVAÇÃO DE ÁGUA DE EDIFICAÇÃO QUE POSSUA RESERVATÓRIO DE FIBRA/FIBROCIMENTO   FORNECIMENTO E INSTALAÇÃO. AF_06/2016","UN",5,1,null,null,null,null,null,"Referência: AGETOP - 81427"]
[4,4,4,2,1,7,2,7,0,5,2,"F","Nível 4","Nível 4","1.7.2.7.","SINAPI",null,"UNIÃO","-",null,1,null,null,null,null,null,""]
["S",4,"S",0,1,7,2,7,0,0,0,"F","Serviço","Serviço","1.7.2.7.1.","SINAPI",89612,"UNIÃO, PVC, SOLDÁVEL, DN 75MM, INSTALADO EM PRUMADA DE ÁGUA - FORNECIMENTO E INSTALAÇÃO. AF_12/2014","UN",3,1,null,null,null,null,null,""]
[4,4,4,3,1,7,2,8,0,3,{"$error":"#N/A"},"F","Nível 4","Nível 4","1.7.2.8.","SINAPI",null,"ADESIVOS","-",null,1,null,null,null,null,null,""]
["S",4,"S",0,1,7,2,8,0,0,0,"F","Serviço","Serviço","1.7.2.8.1.","AGETOP",81501,"ADESIVO PLASTICO - FRASCO 850 G","Un    ",6,1,null,null,null,null,null,""]
["S",4,"S",0,1,7,2,8,0,0,0,"F","Serviço","Serviço","1.7.2.8.2.","AGETOP",81504,"SOLUCAO LIMPADORA 1000 CM3","Un    ",6,1,null,null,null,null,null,""]
[3,3,3,15,1,7,3,0,0,64,15,"F","Nível 3","Nível 3","1.7.3.","SINAPI",null,"ESGOTO SANITÁRIO","-",null,1,null,null,null,null,null,""]
[4,4,4,2,1,7,3,1,0,14,2,"F","Nível 4","Nível 4","1.7.3.1.","SINAPI",null,"CORPO DE CAIXA SIFONADA / RALO","-",null,1,null,null,null,null,null,""]
["S",4,"S",0,1,7,3,1,0,0,0,"F","Serviço","Serviço","1.7.3.1.1.","AGETOP",81663,"CORPO CX. SIFONADA DIAM. 150 X 150 X 50","Un    ",2,1,null,null,null,null,null,""]
[4,4,4,5,1,7,3,2,0,12,5,"F","Nível 4","Nível 4","1.7.3.2.","SINAPI",null,"JOELHOS","-",null,1,null,null,null,null,null,""]
["S",4,"S",0,1,7,3,2,0,0,0,"F","Serviço","Serviço","1.7.3.2.1.","SINAPI",89726,"JOELHO 45 GRAUS, PVC, SERIE NORMAL, ESGOTO PREDIAL, DN 40 MM, JUNTA SOLDÁVEL, FORNECIDO E INSTALADO EM RAMAL DE DESCARGA OU RAMAL DE ESGOTO SANITÁRIO. AF_12/2014","UN",3,1,null,null,null,null,null,""]
["S",4,"S",0,1,7,3,2,0,0,0,"F","Serviço","Serviço","1.7.3.2.2.","SINAPI",89802,"JOELHO 45 GRAUS, PVC, SERIE NORMAL, ESGOTO PREDIAL, DN 50 MM, JUNTA ELÁSTICA, FORNECIDO E INSTALADO EM PRUMADA DE ESGOTO SANITÁRIO OU VENTILAÇÃO. AF_12/2014","UN",5,1,null,null,null,null,null,""]
["S",4,"S",0,1,7,3,2,0,0,0,"F","Serviço","Serviço","1.7.3.2.3.","SINAPI",89806,"JOELHO 45 GRAUS, PVC, SERIE NORMAL, ESGOTO PREDIAL, DN 75 MM, JUNTA ELÁSTICA, FORNECIDO E INSTALADO EM PRUMADA DE ESGOTO SANITÁRIO OU VENTILAÇÃO. AF_12/2014","UN",3,1,null,null,null,null,null,""]
["S",4,"S",0,1,7,3,2,0,{"$f":"IF(OR($C233=\"S\",$C233=0),0,MATCH(0,OFFSET($D233,1,$C233,ROW($C$911)-ROW($C233)),0))","v":0},{"$f":"IF(OR($C233=\"S\",$C233=0),0,MATCH(OFFSET($D233,0,$C233)+1,OFFSET($D233,1,$C233,ROW($C$911)-ROW($C233)),0))","v":0},"F","Serviço","Serviço","1.7.3.2.4.","SINAPI",89724,"JOELHO 90 GRAUS, PVC, SERIE NORMAL, ESGOTO PREDIAL, DN 40 MM, JUNTA SOLDÁVEL, FORNECIDO E INSTALADO EM RAMAL DE DESCARGA OU RAMAL DE ESGOTO SANITÁRIO. AF_12/2014","UN",3,1,null,null,null,null,null,""]
[4,4,4,3,1,7,3,3,0,7,3,"F","Nível 4","Nível 4","1.7.3.3.","SINAPI",null,"JUNÇÕES","-",null,1,null,null,null,null,null,""]
["S",4,"S",0,1,7,3,3,0,0,0,"F","Serviço","Serviço","1.7.3.3.1.","SINAPI",89785,"JUNÇÃO SIMPLES, PVC, SERIE NORMAL, ESGOTO PREDIAL, DN 50 X 50 MM, JUNTA ELÁSTICA, FORNECIDO E INSTALADO EM RAMAL DE DESCARGA OU RAMAL DE ESGOTO SANITÁRIO. AF_12/2014","UN",5,1,null,null,null,null,null,"Referência: AGETOP - 81970"]
["S",4,"S",0,1,7,3,3,0,0,0,"F","Serviço","Serviço","1.7.3.3.2.","AGETOP",81973,"JUNCAO SIMPLES DIAM. 100 X 50 MM","Un    ",5,1,null,null,null,null,null,""]
[{"$f":"CHOOSE(1+LOG(1+2*(ORÇAMENTO.Nivel=\"Nível 1\")+4*(ORÇAMENTO.Nivel=\"Nível 2\")+8*(ORÇAMENTO.Nivel=\"Nível 3\")+16*(ORÇAMENTO.Nivel=\"Nível 4\")+32*(ORÇAMENTO.Nivel=\"Serviço\"),2),0,1,2,3,4,\"S\")","v":4},{"$f":"IF(OR(C237=\"s\",C237=0),OFFSET(B237,-1,0),C237)","v":4},{"$f":"IF(OFFSET(C237,-1,0)=\"L\",1,IF(OFFSET(C237,-1,0)=1,2,IF(OR(A237=\"s\",A237=0),\"S\",IF(AND(OFFSET(C237,-1,0)=2,A237=4),3,IF(AND(OR(OFFSET(C237,-1,0)=\"s\",OFFSET(C237,-1,0)=0),A237<>\"s\",A237>OFFSET(B237,-1,0)),OFFSET(B237,-1,0),A237)))))","v":4},{"$f":"IF(OR(C237=\"S\",C237=0),0,IF(ISERROR(K237),J237,SMALL(J237:K237,1)))","v":4},{"$f":"IF($C237=1,OFFSET(E237,-1,0)+1,OFFSET(E237,-1,0))","v":1},{"$f":"IF($C237=1,0,IF($C237=2,OFFSET(F237,-1,0)+1,OFFSET(F237,-1,0)))","v":7},{"$f":"IF(AND($C237<=2,$C237<>0),0,IF($C237=3,OFFSET(G237,-1,0)+1,OFFSET(G237,-1,0)))","v":3},{"$f":"IF(AND($C237<=3,$C237<>0),0,IF($C237=4,OFFSET(H237,-1,0)+1,OFFSET(H237,-1,0)))","v":4},{"$f":"IF(AND($C237<=4,$C237<>0),0,IF(AND($C237=\"S\",$Y237>0),OFFSET(I237,-1,0)+1,OFFSET(I237,-1,0)))","v":0},4,{"$error":"#N/A"},"F","Nível 4","Nível 4","1.7.3.4.","SINAPI",null,"TUBOS","-",null,1,null,null,null,null,null,""]
["S",4,"S",0,1,7,3,4,0,0,0,"F","Serviço","Serviço","1.7.3.4.1.","SINAPI",89711,"TUBO PVC, SERIE NORMAL, ESGOTO PREDIAL, DN 40 MM, FORNECIDO E INSTALADO EM RAMAL DE DESCARGA OU RAMAL DE ESGOTO SANITÁRIO. AF_12/2014","M",18,1,null,null,null,null,null,"Referência: AGETOP - 82301"]
["S",4,"S",0,1,7,3,4,0,0,0,"F","Serviço","Serviço","1.7.3.4.2.","SINAPI",89798,"TUBO PVC, SERIE NORMAL, ESGOTO PREDIAL, DN 50 MM, FORNECIDO E INSTALADO EM PRUMADA DE ESGOTO SANITÁRIO OU VENTILAÇÃO. AF_12/2014","M",18,1,null,null,null,null,null,""]
["S",4,"S",0,1,7,3,4,0,0,0,"F","Serviço","Serviço","1.7.3.4.3.","SINAPI",89800,"TUBO PVC, SERIE NORMAL, ESGOTO PREDIAL, DN 100 MM, FORNECIDO E INSTALADO EM PRUMADA DE ESGOTO SANITÁRIO OU VENTILAÇÃO. AF_12/2014","M",132,1,null,null,null,null,null,""]
[3,3,3,7,1,7,4,0,0,49,7,"F","Nível 3","Nível 3","1.7.4.","SINAPI",null,"DIVERSOS","-",null,1,null,null,null,null,null,""]
["S",3,"S",0,1,7,4,0,0,0,0,"F","Serviço","Serviço","1.7.4.0.1.","SINAPI",95674,"HIDRÔMETRO DN 20 (½\u0094), 3,0 M³/H \u0096 FORNECIMENTO E INSTALAÇÃO. AF_11/2016","UN",1,1,null,null,null,null,null,"Referência: AGETOP - 81811"]
["S",3,"S",0,1,7,4,0,0,0,0,"F","Serviço","Serviço","1.7.4.0.2.","AGETOP",81815,"KIT CAVALETE D=25MM P/HIDRÔMETRO 1,5-3,0-5,0 M3/MURETA/CAIXA","Un    ",1,1,null,null,null,null,null,""]
["S",3,"S",0,1,7,4,0,0,0,0,"F","Serviço","Serviço","1.7.4.0.3.","AGETOP",81825,"CAIXA DE PASSAGEM 60 X 60 CM SEM TAMPA","Un    ",5,1,null,null,null,null,null,""]
["S",3,"S",0,1,7,4,0,0,0,0,"F","Serviço","Serviço","1.7.4.0.4.","AGETOP",81826,"TAMPA EM CONCRETO ARMADO 25 MPA E=5CM PARA A CAIXA DE PASSAGEM 60X60CM","Un    ",5,1,null,null,null,null,null,""]
["S",3,"S",0,1,7,4,0,0,0,0,"F","Serviço","Serviço","1.7.4.0.5.","AGETOP",81881,"RES.METALICO TAÇA AÇO PATINÁVEL-V=10M3-COL.SEC.H=6M+FUNDAÇÃO+LOGOTIPO","Un    ",1,1,null,null,null,null,null,""]
["S",3,"S",0,1,7,4,0,0,0,0,"F","Serviço","Serviço","1.7.4.0.6.","SINAPI",94797,"TORNEIRA DE BOIA, ROSCÁVEL, 1\u0094, FORNECIDA E INSTALADA EM RESERVAÇÃO DE ÁGUA. AF_06/2016","UN",1,1,null,null,null,null,null,""]
[3,3,3,42,1,7,5,0,0,42,{"$error":"#N/A"},"F","Nível 3","Nível 3","1.7.5.","SINAPI",null,"INSTALAÇÕES DE INCÊNDIO","-",null,1,null,null,null,null,null,""]
["S",3,"S",0,1,7,5,0,0,0,0,"F","Serviço","Serviço","1.7.5.0.1.","COMPOSIÇÃO","COMP 040_SEE","CONJUNTO MOTOR-BOMBA ELÉTRICA TRIFÁSICO 380/220 V PARA VZ= 24,33 M³/H, HM= 46,24 M POTÊNCIA= 7,5 CV","UN ",1,1,null,null,null,null,null,""]
["S",3,"S",0,1,7,5,0,0,0,0,"F","Serviço","Serviço","1.7.5.0.2.","AGETOP",81882,"RES.METALICO TAÇA AÇO PATINÁVEL-V=15M3-COL.SEC.H=6M+FUNDAÇÃO+LOGOTIPO","Un    ",1,1,null,null,null,null,null,""]
["S",3,"S",0,1,7,5,0,0,0,0,"F","Serviço","Serviço","1.7.5.0.3.","COMPOSIÇÃO","COMP 558_SEE","BOMBA DE PRESSURIZAÇÃO JOCKEY 3,0 CV","UN ",1,1,null,null,null,null,null,""]
["S",3,"S",0,1,7,5,0,0,0,0,"F","Serviço","Serviço","1.7.5.0.4.","AGETOP",72338,"SIRENE METALICA ALCANCE 500 M","Un    ",2,1,null,null,null,null,null,""]
["S",3,"S",0,1,7,5,0,0,0,0,"F","Serviço","Serviço","1.7.5.0.5.","AGETOP",81003,"TUBO SOLDAVEL PVC MARROM DIAMETRO 25 mm","M     ",24,1,null,null,null,null,null,""]
["S",3,"S",0,1,7,5,0,0,0,0,"F","Serviço","Serviço","1.7.5.0.6.","SINAPI",94708,"ADAPTADOR COM FLANGES LIVRES, PVC, SOLDÁVEL, DN  25 MM X 3/4 , INSTALADO EM RESERVAÇÃO DE ÁGUA DE EDIFICAÇÃO QUE POSSUA RESERVATÓRIO DE FIBRA/FIBROCIMENTO   FORNECIMENTO E INSTALAÇÃO. AF_06/2016","UN",2,1,null,null,null,null,null,"Referência: AGETOP - 81041"]
["S",3,"S",0,1,7,5,0,0,0,0,"F","Serviço","Serviço","1.7.5.0.7.","SINAPI",94489,"REGISTRO DE ESFERA, PVC, SOLDÁVEL, DN  25 MM, INSTALADO EM RESERVAÇÃO DE ÁGUA DE EDIFICAÇÃO QUE POSSUA RESERVATÓRIO DE FIBRA/FIBROCIMENTO   FORNECIMENTO E INSTALAÇÃO. AF_06/2016","UN",2,1,null,null,null,null,null,""]
["S",3,"S",0,1,7,5,0,0,0,0,"F","Serviço","Serviço","1.7.5.0.8.","AGETOP",80903,"REGISTRO DE GAVETA BRUTO DIAMETRO 1\"","Un    ",1,1,null,null,null,null,null,""]
["S",3,"S",0,1,7,5,0,0,0,0,"F","Serviço","Serviço","1.7.5.0.9.","AGETOP",80910,"REGISTRO DE GAVETA BRUTO DIAMETRO 2.1/2\"","Un    ",2,1,null,null,null,null,null,""]
["S",3,"S",0,1,7,5,0,0,0,0,"F","Serviço","Serviço","1.7.5.0.10.","AGETOP",82379,"TUBO FERRO GALVANIZADO DIAM.2.1/2\"","m     ",320,1,null,null,null,null,null,""]
["S",3,"S",0,1,7,5,0,0,0,0,"F","Serviço","Serviço","1.7.5.0.11.","AGETOP",85003,"EXTINTOR PO QUIMICO SECO (6 KG) - CAPACIDADE EXTINTORA 20 BC","Un    ",12,1,null,null,null,null,null,""]
["S",3,"S",0,1,7,5,0,0,0,0,"F","Serviço","Serviço","1.7.5.0.12.","AGETOP",85011,"CAIXA DE INCÊNDIO METÁLICA COM SUPORTE PARA MANGUEIRA, TAMPA E MURETA 17X60X90 CM C/PINTURA","Un    ",8,1,null,null,null,null,null,""]
["S",3,"S",0,1,7,5,0,0,0,0,"F","Serviço","Serviço","1.7.5.0.13.","AGETOP",85017,"MANGUEIRA DE INCÊNDIO D.I. = 38 MM TIPO 2 COMP. = 15 M","CJ    ",16,1,null,null,null,null,null,""]
["S",3,"S",0,1,7,5,0,0,0,0,"F","Serviço","Serviço","1.7.5.0.14.","AGETOP",85025,"ESGUICHO REGULÁVEL 1.1/2\"","Un    ",8,1,null,null,null,null,null,""]
["S",3,"S",0,1,7,5,0,0,0,0,"F","Serviço","Serviço","1.7.5.0.15.","AGETOP",85027,"ADAPTADOR P/ENGATE STORZ 2.1/2\" X 1.1/2\"","Un    ",9,1,null,null,null,null,null,""]
["S",3,"S",0,1,7,5,0,0,0,0,"F","Serviço","Serviço","1.7.5.0.16.","AGETOP",85031,"REGISTRO GLOBO ANGULAR 2.1/2\"","Un    ",8,1,null,null,null,null,null,""]
["S",3,"S",0,1,7,5,0,0,0,0,"F","Serviço","Serviço","1.7.5.0.17.","AGETOP",85035,"TAMPÃO CEGO COM CORRENTE 2.1/2\"","Un    ",8,1,null,null,null,null,null,""]
["S",3,"S",0,1,7,5,0,0,0,0,"F","Serviço","Serviço","1.7.5.0.18.","AGETOP",85037,"TANQUE DE PRESSÃO DE 10 L","Un    ",1,1,null,null,null,null,null,""]
["S",3,"S",0,1,7,5,0,0,0,0,"F","Serviço","Serviço","1.7.5.0.19.","AGETOP",85039,"PRESSOSTATO 50 A 80 PSI","Un    ",1,1,null,null,null,null,null,""]
["S",3,"S",0,1,7,5,0,0,0,0,"F","Serviço","Serviço","1.7.5.0.20.","AGETOP",85041,"MANOMETRO - 0 A 10 KG/CM2","Un    ",1,1,null,null,null,null,null,""]
["S",3,"S",0,1,7,5,0,0,0,0,"F","Serviço","Serviço","1.7.5.0.21.","AGETOP",85047,"NIPLE DUPLO FERRO GALVANIZADO 2.1/2\"","Un    ",14,1,null,null,null,null,null,""]
["S",3,"S",0,1,7,5,0,0,0,0,"F","Serviço","Serviço","1.7.5.0.22.","AGETOP",85077,"VÁLVULA DE RETENÇÃO HORIZONTAL 2.1/2\"","Un    ",2,1,null,null,null,null,null,""]
["S",3,"S",0,1,7,5,0,0,0,0,"F","Serviço","Serviço","1.7.5.0.23.","COMPOSIÇÃO","COMP 017_SEE","REDUCAO GIRATÓRIA TIPO STORZ LATAO P/ INST. PREDIAL COMBATE A INCENDIO ENGATE RAPIDO 2.1/2\" X 1.1/2\"","UN ",8,1,null,null,null,null,null,""]
["S",3,"S",0,1,7,5,0,0,0,0,"F","Serviço","Serviço","1.7.5.0.24.","COMPOSIÇÃO","COMP 018_SEE","CHAVE DUPLA P/ CONEXÕES TIPO STORZ EM LATÃO ENGATE RÁPIDO 1 1/2\" X 2 1/2\"","UN ",8,1,null,null,null,null,null,""]
["S",3,"S",0,1,7,5,0,0,0,0,"F","Serviço","Serviço","1.7.5.0.25.","COMPOSIÇÃO","COMP 087_SEE","REGISTRO DE GAVETA COM HASTE ASCENDENTE DE BRONZE 2 1/2\"","UN ",2,1,null,null,null,null,null,""]
["S",3,"S",0,1,7,5,0,0,0,0,"F","Serviço","Serviço","1.7.5.0.26.","COMPOSIÇÃO","COMP 019_SEE","TAMPÃO LATAO C/ CORRENTE P/ INSTALAÇÃO PREDIAL COMBATE A INCÊNDIO ENGATE RÁPIDO 1 1/2\"","UN ",8,1,null,null,null,null,null,""]
["S",3,"S",0,1,7,5,0,0,0,0,"F","Serviço","Serviço","1.7.5.0.27.","COMPOSIÇÃO","COMP 088_SEE","TE DE FERRO GALVANIZADO 90º X 2.1/2\" X 1\"","UN ",1,1,null,null,null,null,null,""]
["S",3,"S",0,1,7,5,0,0,0,0,"F","Serviço","Serviço","1.7.5.0.28.","AGETOP",85056,"TÊ DE FERRO GALVANIZADO 90º X 2 1/2\"","un    ",11,1,null,null,null,null,null,""]
["S",3,"S",0,1,7,5,0,0,0,0,"F","Serviço","Serviço","1.7.5.0.29.","COMPOSIÇÃO","COMP 030_SEE","COTOVELO DE FERRO GALV. 90° X 2 1/2\"","UN ",25,1,null,null,null,null,null,""]
["S",3,"S",0,1,7,5,0,0,0,0,"F","Serviço","Serviço","1.7.5.0.30.","COMPOSIÇÃO","COMP 077_SEE","UNIAO FERRO GALV C/ASSENTO CONICO BRONZE 2 1/2\"","UN ",8,1,null,null,null,null,null,""]
["S",3,"S",0,1,7,5,0,0,0,0,"F","Serviço","Serviço","1.7.5.0.31.","COMPOSIÇÃO","COMP 076_SEE","CURVA FERRO GALVANIZADO 45G ROSCA MACHO/FEMEA REF. 2 1/2\"","UN ",2,1,null,null,null,null,null,""]
["S",3,"S",0,1,7,5,0,0,0,0,"F","Serviço","Serviço","1.7.5.0.32.","COMPOSIÇÃO","COMP 022_SEE","TAMPÃO FOFO 40X50CM C/INSCRIÇÃO ","UN ",1,1,null,null,null,null,null,""]
["S",3,"S",0,1,7,5,0,0,0,0,"F","Serviço","Serviço","1.7.5.0.33.","COMPOSIÇÃO","COMP 024_SEE","SINALIZADOR FOTOLUMINESCENTE PARA EXTINTOR","UN ",12,1,null,null,null,null,null,""]
["S",3,"S",0,1,7,5,0,0,0,0,"F","Serviço","Serviço","1.7.5.0.34.","COMPOSIÇÃO","COMP 186_SEE","BOTOEIRA BOMBA DE INCÊNDIO C/ MARTELO CONVENCIONAL/ ANALÓGICA","UN ",8,1,null,null,null,null,null,""]
["S",3,"S",0,1,7,5,0,0,0,0,"F","Serviço","Serviço","1.7.5.0.35.","COMPOSIÇÃO","COMP 188_SEE","ACIONADOR MANUAL DE ALARME","UN ",8,1,null,null,null,null,null,""]
["S",3,"S",0,1,7,5,0,0,0,0,"F","Serviço","Serviço","1.7.5.0.36.","COMPOSIÇÃO","COMP 190_SEE","CENTRAL DE DETECÇÃO E ALARME DE 40 SETORES COM BATERIA","UN ",1,1,null,null,null,null,null,""]
["S",3,"S",0,1,7,5,0,0,0,0,"F","Serviço","Serviço","1.7.5.0.37.","COMPOSIÇÃO","COMP 025_SEE","SINALIZADOR FOTOLUMINESCENTE DE EMERGÊNCIA","UN ",36,1,null,null,null,null,null,""]
["S",3,"S",0,1,7,5,0,0,0,0,"F","Serviço","Serviço","1.7.5.0.38.","COMPOSIÇÃO","COMP 277_SEE","MARCAÇÃO NO PISO - 1X1 M PARA EXTINTOR","M2",12,1,null,null,null,null,null,""]
["S",3,"S",0,1,7,5,0,0,0,0,"F","Serviço","Serviço","1.7.5.0.39.","COMPOSIÇÃO","COMP 080_SEE","BUCHA REDUCAO FERRO GALV ROSCA REF. 2 1/2\"X1\"","UN ",1,1,null,null,null,null,null,""]
["S",3,"S",0,1,7,5,0,0,0,0,"F","Serviço","Serviço","1.7.5.0.40.","COMPOSIÇÃO","COMP 077_SEE","UNIAO FERRO GALV C/ASSENTO CONICO BRONZE 2 1/2\"","UN ",8,1,null,null,null,null,null,""]
["S",3,"S",0,1,7,5,0,0,0,0,"F","Serviço","Serviço","1.7.5.0.41.","SINAPI",97599,"LUMINÁRIA DE EMERGÊNCIA - FORNECIMENTO E INSTALAÇÃO. AF_11/2017","UN",31,1,null,null,null,null,null,""]
[{"$f":"CHOOSE(1+LOG(1+2*(ORÇAMENTO.Nivel=\"Nível 1\")+4*(ORÇAMENTO.Nivel=\"Nível 2\")+8*(ORÇAMENTO.Nivel=\"Nível 3\")+16*(ORÇAMENTO.Nivel=\"Nível 4\")+32*(ORÇAMENTO.Nivel=\"Serviço\"),2),0,1,2,3,4,\"S\")","v":2},2,2,11,1,8,0,0,{"$f":"IF(AND($C290<=4,$C290<>0),0,IF(AND($C290=\"S\",$Y290>0),OFFSET(I290,-1,0)+1,OFFSET(I290,-1,0)))","v":0},90,11,"F","Nível 2","Nível 2","1.8.","AGETOP",91045,"ALVENARIAS E DIVISÓRIAS","Un    ",null,1,null,null,null,null,null,""]
[3,3,3,2,1,8,1,0,0,10,2,"F","Nível 3","Nível 3","1.8.1.","SINAPI",null,"ACESSIBILIDADE","-",null,1,null,null,null,null,null,""]
["S",3,"S",0,1,8,1,0,0,0,0,"F","Serviço","Serviço","1.8.1.0.1.","SINAPI",87520,"ALVENARIA DE VEDAÇÃO DE BLOCOS CERÂMICOS FURADOS NA HORIZONTAL DE 9X19X19CM (ESPESSURA 9CM) DE PAREDES COM ÁREA LÍQUIDA MAIOR OU IGUAL A 6M² COM VÃOS E ARGAMASSA DE ASSENTAMENTO COM PREPARO MANUAL. AF_06/2014","M2",91.2,1,null,null,null,null,null,"Referência: AGETOP - 100201"]
[3,3,3,2,1,8,2,0,0,8,2,"F","Nível 3","Nível 3","1.8.2.","SINAPI",null,"ANTIGA COZINHA","-",null,1,null,null,null,null,null,""]
["S",3,"S",0,1,8,2,0,0,0,0,"F","Serviço","Serviço","1.8.2.0.1.","SINAPI",87495,"ALVENARIA DE VEDAÇÃO DE BLOCOS CERÂMICOS FURADOS NA HORIZONTAL DE 9X19X19CM (ESPESSURA 9CM) DE PAREDES COM ÁREA LÍQUIDA MENOR QUE 6M² SEM VÃOS E ARGAMASSA DE ASSENTAMENTO COM PREPARO EM BETONEIRA. AF_06/2014","M2",1.93,1,null,null,null,null,null,"Referência: AGETOP - 100201"]
[3,3,3,2,1,8,3,0,0,6,2,"F","Nível 3","Nível 3","1.8.3.","SINAPI",null,"ACESSIBILIDADE - ALVENARIA PARA RAMPA","-",null,1,null,null,null,null,null,""]
["S",3,"S",0,1,8,3,0,0,0,0,"F","Serviço","Serviço","1.8.3.0.1.","SINAPI",87520,"ALVENARIA DE VEDAÇÃO DE BLOCOS CERÂMICOS FURADOS NA HORIZONTAL DE 9X19X19CM (ESPESSURA 9CM) DE PAREDES COM ÁREA LÍQUIDA MAIOR OU IGUAL A 6M² COM VÃOS E ARGAMASSA DE ASSENTAMENTO COM PREPARO MANUAL. AF_06/2014","M2",44.26,1,null,null,null,null,null,"Referência: AGETOP - 100201"]
[3,3,3,2,1,8,4,0,0,4,2,"F","Nível 3","Nível 3","1.8.4.","SINAPI",null,"ALVENARIA PARA ESCADA","-",null,1,null,null,null,null,null,""]
["S",3,"S",0,1,8,4,0,0,0,0,"F","Serviço","Serviço","1.8.4.0.1.","SINAPI",87495,"ALVENARIA DE VEDAÇÃO DE BLOCOS CERÂMICOS FURADOS NA HORIZONTAL DE 9X19X19CM (ESPESSURA 9CM) DE PAREDES COM ÁREA LÍQUIDA MENOR QUE 6M² SEM VÃOS E ARGAMASSA DE ASSENTAMENTO COM PREPARO EM BETONEIRA. AF_06/2014","M2",0.34,1,null,null,null,null,null,"Referência: AGETOP - 100201"]
[3,3,3,2,1,8,5,0,0,{"$f":"IF(OR($C299=\"S\",$C299=0),0,MATCH(0,OFFSET($D299,1,$C299,ROW($C$911)-ROW($C299)),0))","v":2},{"$f":"IF(OR($C299=\"S\",$C299=0),0,MATCH(OFFSET($D299,0,$C299)+1,OFFSET($D299,1,$C299,ROW($C$911)-ROW($C299)),0))","v":{"$error":"#N/A"}},"F","Nível 3","Nível 3","1.8.5.","SINAPI",null,"SALA DE DIRETORIA","-",null,1,null,null,null,null,null,""]
["S",3,"S",0,1,8,5,0,0,0,0,"F","Serviço","Serviço","1.8.5.0.1.","SINAPI",87495,"ALVENARIA DE VEDAÇÃO DE BLOCOS CERÂMICOS FURADOS NA HORIZONTAL DE 9X19X19CM (ESPESSURA 9CM) DE PAREDES COM ÁREA LÍQUIDA MENOR QUE 6M² SEM VÃOS E ARGAMASSA DE ASSENTAMENTO COM PREPARO EM BETONEIRA. AF_06/2014","M2",1.93,1,null,null,null,null,null,"Referência: AGETOP - 100201"]
[2,{"$f":"IF(OR(C301=\"s\",C301=0),OFFSET(B301,-1,0),C301)","v":2},{"$f":"IF(OFFSET(C301,-1,0)=\"L\",1,IF(OFFSET(C301,-1,0)=1,2,IF(OR(A301=\"s\",A301=0),\"S\",IF(AND(OFFSET(C301,-1,0)=2,A301=4),3,IF(AND(OR(OFFSET(C301,-1,0)=\"s\",OFFSET(C301,-1,0)=0),A301<>\"s\",A301>OFFSET(B301,-1,0)),OFFSET(B301,-1,0),A301)))))","v":2},{"$f":"IF(OR(C301=\"S\",C301=0),0,IF(ISERROR(K301),J301,SMALL(J301:K301,1)))","v":2},{"$f":"IF($C301=1,OFFSET(E301,-1,0)+1,OFFSET(E301,-1,0))","v":1},{"$f":"IF($C301=1,0,IF($C301=2,OFFSET(F301,-1,0)+1,OFFSET(F301,-1,0)))","v":9},{"$f":"IF(AND($C301<=2,$C301<>0),0,IF($C301=3,OFFSET(G301,-1,0)+1,OFFSET(G301,-1,0)))","v":0},{"$f":"IF(AND($C301<=3,$C301<>0),0,IF($C301=4,OFFSET(H301,-1,0)+1,OFFSET(H301,-1,0)))","v":0},0,{"$f":"IF(OR($C301=\"S\",$C301=0),0,MATCH(0,OFFSET($D301,1,$C301,ROW($C$911)-ROW($C301)),0))","v":79},{"$f":"IF(OR($C301=\"S\",$C301=0),0,MATCH(OFFSET($D301,0,$C301)+1,OFFSET($D301,1,$C301,ROW($C$911)-ROW($C301)),0))","v":2},"F","Nível 2","Nível 2","1.9.",null,null,"IMPERMEABILIZAÇÃO","-",null,1,null,null,null,null,null,""]
["S",2,"S",0,1,9,0,0,0,0,0,"F","Serviço","Serviço","1.9.0.0.1.","SINAPI",98562,"IMPERMEABILIZAÇÃO DE FLOREIRA OU VIGA BALDRAME COM ARGAMASSA DE CIMENTO E AREIA, COM ADITIVO IMPERMEABILIZANTE, E = 2 CM. AF_06/2018","M2",36.61,1,null,null,null,null,null,"Referência: AGETOP - 120902"]
[2,2,2,7,1,10,0,0,0,77,7,"F","Nível 2","Nível 2","1.10.",null,null,"ESQUADRIAS METÁLICAS","-",null,1,null,null,null,null,null,""]
[3,{"$f":"IF(OR(C304=\"s\",C304=0),OFFSET(B304,-1,0),C304)","v":3},{"$f":"IF(OFFSET(C304,-1,0)=\"L\",1,IF(OFFSET(C304,-1,0)=1,2,IF(OR(A304=\"s\",A304=0),\"S\",IF(AND(OFFSET(C304,-1,0)=2,A304=4),3,IF(AND(OR(OFFSET(C304,-1,0)=\"s\",OFFSET(C304,-1,0)=0),A304<>\"s\",A304>OFFSET(B304,-1,0)),OFFSET(B304,-1,0),A304)))))","v":3},{"$f":"IF(OR(C304=\"S\",C304=0),0,IF(ISERROR(K304),J304,SMALL(J304:K304,1)))","v":2},{"$f":"IF($C304=1,OFFSET(E304,-1,0)+1,OFFSET(E304,-1,0))","v":1},{"$f":"IF($C304=1,0,IF($C304=2,OFFSET(F304,-1,0)+1,OFFSET(F304,-1,0)))","v":10},{"$f":"IF(AND($C304<=2,$C304<>0),0,IF($C304=3,OFFSET(G304,-1,0)+1,OFFSET(G304,-1,0)))","v":1},{"$f":"IF(AND($C304<=3,$C304<>0),0,IF($C304=4,OFFSET(H304,-1,0)+1,OFFSET(H304,-1,0)))","v":0},0,6,2,"F","Nível 3","Nível 3","1.10.1.","SINAPI",null,"ANTIGA COZINHA","-",null,1,null,null,null,null,null,""]
["S",3,"S",0,1,10,1,0,0,0,0,"F","Serviço","Serviço","1.10.1.0.1.","AGETOP",180401,"ESQ.DE CORRER CHAPA/VIDRO J9/J10/J12/J13 C/FERRAGENS","m2    ",6.8200000000000012,1,null,null,null,null,null,""]
[3,{"$f":"IF(OR(C306=\"s\",C306=0),OFFSET(B306,-1,0),C306)","v":3},{"$f":"IF(OFFSET(C306,-1,0)=\"L\",1,IF(OFFSET(C306,-1,0)=1,2,IF(OR(A306=\"s\",A306=0),\"S\",IF(AND(OFFSET(C306,-1,0)=2,A306=4),3,IF(AND(OR(OFFSET(C306,-1,0)=\"s\",OFFSET(C306,-1,0)=0),A306<>\"s\",A306>OFFSET(B306,-1,0)),OFFSET(B306,-1,0),A306)))))","v":3},{"$f":"IF(OR(C306=\"S\",C306=0),0,IF(ISERROR(K306),J306,SMALL(J306:K306,1)))","v":2},{"$f":"IF($C306=1,OFFSET(E306,-1,0)+1,OFFSET(E306,-1,0))","v":1},{"$f":"IF($C306=1,0,IF($C306=2,OFFSET(F306,-1,0)+1,OFFSET(F306,-1,0)))","v":10},{"$f":"IF(AND($C306<=2,$C306<>0),0,IF($C306=3,OFFSET(G306,-1,0)+1,OFFSET(G306,-1,0)))","v":2},{"$f":"IF(AND($C306<=3,$C306<>0),0,IF($C306=4,OFFSET(H306,-1,0)+1,OFFSET(H306,-1,0)))","v":0},0,4,2,"F","Nível 3","Nível 3","1.10.2.","SINAPI",null,"SANITÁRIOS","-",null,1,null,null,null,null,null,""]
["S",3,"S",0,1,10,2,0,0,0,0,"F","Serviço","Serviço","1.10.2.0.1.","SINAPI","73933/4","PORTA DE FERRO DE ABRIR TIPO BARRA CHATA, COM REQUADRO E GUARNICAO COMPLETA","M2",1.7600000000000002,1,null,null,null,null,null,"Referência: AGETOP - 180501"]
[3,3,3,2,1,10,3,0,0,{"$f":"IF(OR($C308=\"S\",$C308=0),0,MATCH(0,OFFSET($D308,1,$C308,ROW($C$911)-ROW($C308)),0))","v":2},{"$f":"IF(OR($C308=\"S\",$C308=0),0,MATCH(OFFSET($D308,0,$C308)+1,OFFSET($D308,1,$C308,ROW($C$911)-ROW($C308)),0))","v":15},"F","Nível 3","Nível 3","1.10.3.","SINAPI",null,"SALA DE DIRETORIA","-",null,1,null,null,null,null,null,""]
["S",3,"S",0,1,10,3,0,0,0,0,"F","Serviço","Serviço","1.10.3.0.1.","SINAPI","73933/4","PORTA DE FERRO DE ABRIR TIPO BARRA CHATA, COM REQUADRO E GUARNICAO COMPLETA","M2",1.6800000000000002,1,null,null,null,null,null,"Referência: AGETOP - 180501"]
[2,2,2,3,1,11,0,0,0,{"$f":"IF(OR($C310=\"S\",$C310=0),0,MATCH(0,OFFSET($D310,1,$C310,ROW($C$911)-ROW($C310)),0))","v":70},{"$f":"IF(OR($C310=\"S\",$C310=0),0,MATCH(OFFSET($D310,0,$C310)+1,OFFSET($D310,1,$C310,ROW($C$911)-ROW($C310)),0))","v":3},"F","Nível 2","Nível 2","1.11.",null,null,"VIDROS","-",null,1,null,null,null,null,null,""]
[3,{"$f":"IF(OR(C311=\"s\",C311=0),OFFSET(B311,-1,0),C311)","v":3},{"$f":"IF(OFFSET(C311,-1,0)=\"L\",1,IF(OFFSET(C311,-1,0)=1,2,IF(OR(A311=\"s\",A311=0),\"S\",IF(AND(OFFSET(C311,-1,0)=2,A311=4),3,IF(AND(OR(OFFSET(C311,-1,0)=\"s\",OFFSET(C311,-1,0)=0),A311<>\"s\",A311>OFFSET(B311,-1,0)),OFFSET(B311,-1,0),A311)))))","v":3},{"$f":"IF(OR(C311=\"S\",C311=0),0,IF(ISERROR(K311),J311,SMALL(J311:K311,1)))","v":2},{"$f":"IF($C311=1,OFFSET(E311,-1,0)+1,OFFSET(E311,-1,0))","v":1},{"$f":"IF($C311=1,0,IF($C311=2,OFFSET(F311,-1,0)+1,OFFSET(F311,-1,0)))","v":11},{"$f":"IF(AND($C311<=2,$C311<>0),0,IF($C311=3,OFFSET(G311,-1,0)+1,OFFSET(G311,-1,0)))","v":1},{"$f":"IF(AND($C311<=3,$C311<>0),0,IF($C311=4,OFFSET(H311,-1,0)+1,OFFSET(H311,-1,0)))","v":0},0,2,6,"F","Nível 3","Nível 3","1.11.1.","SINAPI",null,"ANTIGA COZINHA","-",null,1,null,null,null,null,null,""]
["S",3,"S",0,1,11,1,0,0,0,0,"F","Serviço","Serviço","1.11.1.0.1.","SINAPI",72117,"VIDRO LISO COMUM TRANSPARENTE, ESPESSURA 4MM","M2",6.82,1,null,null,null,null,null,"Referência: AGETOP - 190102"]
[2,2,2,17,1,12,0,0,0,67,17,"F","Nível 2","Nível 2","1.12.",null,null,"REVESTIMENTO DE PAREDE","-",null,1,null,null,null,null,null,""]
[3,3,3,3,1,12,1,0,0,16,3,"F","Nível 3","Nível 3","1.12.1.","SINAPI",null,"ACESSIBILIDADE - ELEVADOR","-",null,1,null,null,null,null,null,""]
["S",3,"S",0,1,12,1,0,0,0,0,"F","Serviço","Serviço","1.12.1.0.1.","SINAPI",87904,"CHAPISCO APLICADO EM ALVENARIA (COM PRESENÇA DE VÃOS) E ESTRUTURAS DE CONCRETO DE FACHADA, COM COLHER DE PEDREIRO.  ARGAMASSA TRAÇO 1:3 COM PREPARO MANUAL. AF_06/2014","M2",91.2,1,null,null,null,null,null,"Referência: AGETOP - 200101"]
["S",3,"S",0,1,12,1,0,0,0,0,"F","Serviço","Serviço","1.12.1.0.2.","SINAPI",87547,"MASSA ÚNICA, PARA RECEBIMENTO DE PINTURA, EM ARGAMASSA TRAÇO 1:2:8, PREPARO MECÂNICO COM BETONEIRA 400L, APLICADA MANUALMENTE EM FACES INTERNAS DE PAREDES, ESPESSURA DE 10MM, COM EXECUÇÃO DE TALISCAS. AF_06/2014","M2",91.2,1,null,null,null,null,null,""]
[3,3,3,3,1,12,2,0,0,13,3,"F","Nível 3","Nível 3","1.12.2.","SINAPI",null,"ACESSIBILIDADE - RAMPA","-",null,1,null,null,null,null,null,""]
["S",3,"S",0,1,12,2,0,0,0,0,"F","Serviço","Serviço","1.12.2.0.1.","SINAPI",87904,"CHAPISCO APLICADO EM ALVENARIA (COM PRESENÇA DE VÃOS) E ESTRUTURAS DE CONCRETO DE FACHADA, COM COLHER DE PEDREIRO.  ARGAMASSA TRAÇO 1:3 COM PREPARO MANUAL. AF_06/2014","M2",4.74,1,null,null,null,null,null,"Referência: AGETOP - 200101"]
["S",3,"S",0,1,12,2,0,0,0,0,"F","Serviço","Serviço","1.12.2.0.2.","SINAPI",87547,"MASSA ÚNICA, PARA RECEBIMENTO DE PINTURA, EM ARGAMASSA TRAÇO 1:2:8, PREPARO MECÂNICO COM BETONEIRA 400L, APLICADA MANUALMENTE EM FACES INTERNAS DE PAREDES, ESPESSURA DE 10MM, COM EXECUÇÃO DE TALISCAS. AF_06/2014","M2",4.74,1,null,null,null,null,null,""]
[3,3,3,3,1,12,3,0,0,10,3,"F","Nível 3","Nível 3","1.12.3.","SINAPI",null,"ACESSIBILIDADE - ESCADA","-",null,1,null,null,null,null,null,""]
["S",3,"S",0,1,12,3,0,0,0,0,"F","Serviço","Serviço","1.12.3.0.1.","SINAPI",87904,"CHAPISCO APLICADO EM ALVENARIA (COM PRESENÇA DE VÃOS) E ESTRUTURAS DE CONCRETO DE FACHADA, COM COLHER DE PEDREIRO.  ARGAMASSA TRAÇO 1:3 COM PREPARO MANUAL. AF_06/2014","M2",0.34,1,null,null,null,null,null,"Referência: AGETOP - 200101"]
["S",3,"S",0,1,12,3,0,0,0,0,"F","Serviço","Serviço","1.12.3.0.2.","SINAPI",87547,"MASSA ÚNICA, PARA RECEBIMENTO DE PINTURA, EM ARGAMASSA TRAÇO 1:2:8, PREPARO MECÂNICO COM BETONEIRA 400L, APLICADA MANUALMENTE EM FACES INTERNAS DE PAREDES, ESPESSURA DE 10MM, COM EXECUÇÃO DE TALISCAS. AF_06/2014","M2",0.34,1,null,null,null,null,null,""]
[3,3,3,4,1,12,4,0,0,7,4,"F","Nível 3","Nível 3","1.12.4.","SINAPI",null,"SANITÁRIOS ","-",null,1,null,null,null,null,null,""]
["S",3,"S",0,1,12,4,0,0,0,0,"F","Serviço","Serviço","1.12.4.0.1.","SINAPI",87553,"EMBOÇO, PARA RECEBIMENTO DE CERÂMICA, EM ARGAMASSA TRAÇO 1:2:8, PREPARO MECÂNICO COM BETONEIRA 400L, APLICADO MANUALMENTE EM FACES INTERNAS DE PAREDES, PARA AMBIENTE COM ÁREA MAIOR QUE 10M2, ESPESSURA DE 10MM, COM EXECUÇÃO DE TALISCAS. AF_06/2014","M2",35.64,1,null,null,null,null,null,""]
[{"$f":"CHOOSE(1+LOG(1+2*(ORÇAMENTO.Nivel=\"Nível 1\")+4*(ORÇAMENTO.Nivel=\"Nível 2\")+8*(ORÇAMENTO.Nivel=\"Nível 3\")+16*(ORÇAMENTO.Nivel=\"Nível 4\")+32*(ORÇAMENTO.Nivel=\"Serviço\"),2),0,1,2,3,4,\"S\")","v":"S"},3,"S",0,1,12,4,0,{"$f":"IF(AND($C325<=4,$C325<>0),0,IF(AND($C325=\"S\",$Y325>0),OFFSET(I325,-1,0)+1,OFFSET(I325,-1,0)))","v":0},0,0,"F","Serviço","Serviço","1.12.4.0.2.","SINAPI",87904,"CHAPISCO APLICADO EM ALVENARIA (COM PRESENÇA DE VÃOS) E ESTRUTURAS DE CONCRETO DE FACHADA, COM COLHER DE PEDREIRO.  ARGAMASSA TRAÇO 1:3 COM PREPARO MANUAL. AF_06/2014","M2",35.64,1,null,null,null,null,null,"Referência: AGETOP - 200101"]
["S",3,"S",0,{"$f":"IF($C326=1,OFFSET(E326,-1,0)+1,OFFSET(E326,-1,0))","v":1},{"$f":"IF($C326=1,0,IF($C326=2,OFFSET(F326,-1,0)+1,OFFSET(F326,-1,0)))","v":12},{"$f":"IF(AND($C326<=2,$C326<>0),0,IF($C326=3,OFFSET(G326,-1,0)+1,OFFSET(G326,-1,0)))","v":4},{"$f":"IF(AND($C326<=3,$C326<>0),0,IF($C326=4,OFFSET(H326,-1,0)+1,OFFSET(H326,-1,0)))","v":0},0,0,0,"F","Serviço","Serviço","1.12.4.0.3.","SINAPI",87273,"REVESTIMENTO CERÂMICO PARA PAREDES INTERNAS COM PLACAS TIPO ESMALTADA EXTRA DE DIMENSÕES 33X45 CM APLICADAS EM AMBIENTES DE ÁREA MAIOR QUE 5 M² NA ALTURA INTEIRA DAS PAREDES. AF_06/2014","M2",368.19,1,null,null,null,null,null,""]
[3,3,3,3,1,12,5,0,0,{"$f":"IF(OR($C327=\"S\",$C327=0),0,MATCH(0,OFFSET($D327,1,$C327,ROW($C$911)-ROW($C327)),0))","v":3},{"$f":"IF(OR($C327=\"S\",$C327=0),0,MATCH(OFFSET($D327,0,$C327)+1,OFFSET($D327,1,$C327,ROW($C$911)-ROW($C327)),0))","v":{"$error":"#N/A"}},"F","Nível 3","Nível 3","1.12.5.","SINAPI",null,"SALA DE DIRETORIA","-",null,1,null,null,null,null,null,""]
["S",3,"S",0,1,12,5,0,0,0,0,"F","Serviço","Serviço","1.12.5.0.1.","SINAPI",87904,"CHAPISCO APLICADO EM ALVENARIA (COM PRESENÇA DE VÃOS) E ESTRUTURAS DE CONCRETO DE FACHADA, COM COLHER DE PEDREIRO.  ARGAMASSA TRAÇO 1:3 COM PREPARO MANUAL. AF_06/2014","M2",3.87,1,null,null,null,null,null,"Referência: AGETOP - 200101"]
["S",3,"S",0,1,12,5,0,0,0,0,"F","Serviço","Serviço","1.12.5.0.2.","SINAPI",87547,"MASSA ÚNICA, PARA RECEBIMENTO DE PINTURA, EM ARGAMASSA TRAÇO 1:2:8, PREPARO MECÂNICO COM BETONEIRA 400L, APLICADA MANUALMENTE EM FACES INTERNAS DE PAREDES, ESPESSURA DE 10MM, COM EXECUÇÃO DE TALISCAS. AF_06/2014","M2",3.87,1,null,null,null,null,null,""]
[2,{"$f":"IF(OR(C330=\"s\",C330=0),OFFSET(B330,-1,0),C330)","v":2},{"$f":"IF(OFFSET(C330,-1,0)=\"L\",1,IF(OFFSET(C330,-1,0)=1,2,IF(OR(A330=\"s\",A330=0),\"S\",IF(AND(OFFSET(C330,-1,0)=2,A330=4),3,IF(AND(OR(OFFSET(C330,-1,0)=\"s\",OFFSET(C330,-1,0)=0),A330<>\"s\",A330>OFFSET(B330,-1,0)),OFFSET(B330,-1,0),A330)))))","v":2},{"$f":"IF(OR(C330=\"S\",C330=0),0,IF(ISERROR(K330),J330,SMALL(J330:K330,1)))","v":15},1,13,0,0,0,{"$f":"IF(OR($C330=\"S\",$C330=0),0,MATCH(0,OFFSET($D330,1,$C330,ROW($C$911)-ROW($C330)),0))","v":50},{"$f":"IF(OR($C330=\"S\",$C330=0),0,MATCH(OFFSET($D330,0,$C330)+1,OFFSET($D330,1,$C330,ROW($C$911)-ROW($C330)),0))","v":15},"F","Nível 2","Nível 2","1.13.",null,null,"REVESTIMENTO DE PISO","-",null,1,null,null,null,null,null,""]
[3,3,3,4,1,13,1,0,0,14,4,"F","Nível 3","Nível 3","1.13.1.",null,null,"GRANITINA","-",null,1,null,null,null,null,null,""]
[4,{"$f":"IF(OR(C332=\"s\",C332=0),OFFSET(B332,-1,0),C332)","v":4},{"$f":"IF(OFFSET(C332,-1,0)=\"L\",1,IF(OFFSET(C332,-1,0)=1,2,IF(OR(A332=\"s\",A332=0),\"S\",IF(AND(OFFSET(C332,-1,0)=2,A332=4),3,IF(AND(OR(OFFSET(C332,-1,0)=\"s\",OFFSET(C332,-1,0)=0),A332<>\"s\",A332>OFFSET(B332,-1,0)),OFFSET(B332,-1,0),A332)))))","v":4},{"$f":"IF(OR(C332=\"S\",C332=0),0,IF(ISERROR(K332),J332,SMALL(J332:K332,1)))","v":3},{"$f":"IF($C332=1,OFFSET(E332,-1,0)+1,OFFSET(E332,-1,0))","v":1},{"$f":"IF($C332=1,0,IF($C332=2,OFFSET(F332,-1,0)+1,OFFSET(F332,-1,0)))","v":13},{"$f":"IF(AND($C332<=2,$C332<>0),0,IF($C332=3,OFFSET(G332,-1,0)+1,OFFSET(G332,-1,0)))","v":1},{"$f":"IF(AND($C332<=3,$C332<>0),0,IF($C332=4,OFFSET(H332,-1,0)+1,OFFSET(H332,-1,0)))","v":1},0,3,6,"F","Nível 4","Nível 4","1.13.1.1.","SINAPI",null,"ACESSIBILIDADE ","-",null,1,null,null,null,null,null,""]
["S",4,"S",0,1,13,1,1,0,0,0,"F","Serviço","Serviço","1.13.1.1.1.","SINAPI",84191,"PISO EM GRANILITE, MARMORITE OU GRANITINA ESPESSURA 8 MM, INCLUSO JUNTAS DE DILATACAO PLASTICAS","M2",16.09,1,null,null,null,null,null,"Referência: AGETOP - 221101"]
["S",4,"S",0,1,13,1,1,0,0,0,"F","Serviço","Serviço","1.13.1.1.2.","AGETOP",221104,"RASPAGEM E APLICAÇÃO RESINA ACRÍLICA DUAS DEMÃOS","m2    ",16.09,1,null,null,null,null,null,""]
[3,3,3,7,1,13,2,0,0,10,7,"F","Nível 3","Nível 3","1.13.2.",null,null,"CONCRETO","-",null,1,null,null,null,null,null,""]
[4,{"$f":"IF(OR(C336=\"s\",C336=0),OFFSET(B336,-1,0),C336)","v":4},{"$f":"IF(OFFSET(C336,-1,0)=\"L\",1,IF(OFFSET(C336,-1,0)=1,2,IF(OR(A336=\"s\",A336=0),\"S\",IF(AND(OFFSET(C336,-1,0)=2,A336=4),3,IF(AND(OR(OFFSET(C336,-1,0)=\"s\",OFFSET(C336,-1,0)=0),A336<>\"s\",A336>OFFSET(B336,-1,0)),OFFSET(B336,-1,0),A336)))))","v":4},{"$f":"IF(OR(C336=\"S\",C336=0),0,IF(ISERROR(K336),J336,SMALL(J336:K336,1)))","v":2},{"$f":"IF($C336=1,OFFSET(E336,-1,0)+1,OFFSET(E336,-1,0))","v":1},{"$f":"IF($C336=1,0,IF($C336=2,OFFSET(F336,-1,0)+1,OFFSET(F336,-1,0)))","v":13},{"$f":"IF(AND($C336<=2,$C336<>0),0,IF($C336=3,OFFSET(G336,-1,0)+1,OFFSET(G336,-1,0)))","v":2},{"$f":"IF(AND($C336<=3,$C336<>0),0,IF($C336=4,OFFSET(H336,-1,0)+1,OFFSET(H336,-1,0)))","v":1},0,6,2,"F","Nível 4","Nível 4","1.13.2.1.","SINAPI",null,"PISO PARA RAMPA","-",null,1,null,null,null,null,null,""]
["S",4,"S",0,1,13,2,1,0,0,0,"F","Serviço","Serviço","1.13.2.1.1.","SINAPI",94992,"EXECUÇÃO DE PASSEIO (CALÇADA) OU PISO DE CONCRETO COM CONCRETO MOLDADO IN LOCO, FEITO EM OBRA, ACABAMENTO CONVENCIONAL, ESPESSURA 6 CM, ARMADO. AF_07/2016","M2",76.84,1,null,null,null,null,null,""]
[4,4,4,2,1,13,2,2,0,4,2,"F","Nível 4","Nível 4","1.13.2.2.","SINAPI",null,"PISO PARA ESCADA","-",null,1,null,null,null,null,null,""]
["S",4,"S",0,1,13,2,2,0,0,0,"F","Serviço","Serviço","1.13.2.2.1.","SINAPI",94992,"EXECUÇÃO DE PASSEIO (CALÇADA) OU PISO DE CONCRETO COM CONCRETO MOLDADO IN LOCO, FEITO EM OBRA, ACABAMENTO CONVENCIONAL, ESPESSURA 6 CM, ARMADO. AF_07/2016","M2",1.1000000000000001,1,null,null,null,null,null,""]
[4,4,4,2,1,13,2,3,0,2,{"$error":"#N/A"},"F","Nível 4","Nível 4","1.13.2.3.","SINAPI",null,"PISO PARA LAJE","-",null,1,null,null,null,null,null,""]
["S",4,"S",0,1,13,2,3,0,0,0,"F","Serviço","Serviço","1.13.2.3.1.","SINAPI",94992,"EXECUÇÃO DE PASSEIO (CALÇADA) OU PISO DE CONCRETO COM CONCRETO MOLDADO IN LOCO, FEITO EM OBRA, ACABAMENTO CONVENCIONAL, ESPESSURA 6 CM, ARMADO. AF_07/2016","M2",16.09,1,null,null,null,null,null,""]
[3,{"$f":"IF(OR(C342=\"s\",C342=0),OFFSET(B342,-1,0),C342)","v":3},{"$f":"IF(OFFSET(C342,-1,0)=\"L\",1,IF(OFFSET(C342,-1,0)=1,2,IF(OR(A342=\"s\",A342=0),\"S\",IF(AND(OFFSET(C342,-1,0)=2,A342=4),3,IF(AND(OR(OFFSET(C342,-1,0)=\"s\",OFFSET(C342,-1,0)=0),A342<>\"s\",A342>OFFSET(B342,-1,0)),OFFSET(B342,-1,0),A342)))))","v":3},{"$f":"IF(OR(C342=\"S\",C342=0),0,IF(ISERROR(K342),J342,SMALL(J342:K342,1)))","v":3},{"$f":"IF($C342=1,OFFSET(E342,-1,0)+1,OFFSET(E342,-1,0))","v":1},{"$f":"IF($C342=1,0,IF($C342=2,OFFSET(F342,-1,0)+1,OFFSET(F342,-1,0)))","v":13},{"$f":"IF(AND($C342<=2,$C342<>0),0,IF($C342=3,OFFSET(G342,-1,0)+1,OFFSET(G342,-1,0)))","v":3},{"$f":"IF(AND($C342<=3,$C342<>0),0,IF($C342=4,OFFSET(H342,-1,0)+1,OFFSET(H342,-1,0)))","v":0},0,3,26,"F","Nível 3","Nível 3","1.13.3.","SINAPI",null,"ACESSIBILIDADE","-",null,1,null,null,null,null,null,""]
[4,4,4,2,1,13,3,1,0,2,{"$error":"#N/A"},"F","Nível 4","Nível 4","1.13.3.1.",null,null,"PODOTÁTIL","-",null,1,null,null,null,null,null,""]
["S",4,"S",0,1,13,3,1,0,0,0,"F","Serviço","Serviço","1.13.3.1.1.","AGETOP",221126,"PISO DE LADRILHO HIDRÁULICO COLORIDO MODELO TÁTIL ( ALERTA OU DIRECIONAL) SEM LASTRO","m2    ",174.53,1,null,null,null,null,null,""]
[2,2,2,7,1,14,0,0,0,35,7,"F","Nível 2","Nível 2","1.14.",null,null,"FERRAGENS","-",null,1,null,null,null,null,null,""]
[3,3,3,3,1,14,1,0,0,6,3,"F","Nível 3","Nível 3","1.14.1.","SINAPI",null,"ACESSIBILIDADE","-",null,1,null,null,null,null,null,""]
["S",3,"S",0,1,14,1,0,0,0,0,"F","Serviço","Serviço","1.14.1.0.1.","COMPOSIÇÃO","COMP 084_SEE","GUARDA-CORPO COM CORRIMÃO - SEDUC","M",98.4,1,null,null,null,null,null,""]
["S",3,"S",0,1,14,1,0,0,0,0,"F","Serviço","Serviço","1.14.1.0.2.","COMPOSIÇÃO","COMP 083_SEE","CORRIMÃO PISO - SEDUC","M",118.1,1,null,null,null,null,null,""]
[3,3,3,3,1,14,2,0,0,3,17,"F","Nível 3","Nível 3","1.14.2.","SINAPI",null,"SANITÁRIO","-",null,1,null,null,null,null,null,""]
["S",3,"S",0,1,14,2,0,0,0,0,"F","Serviço","Serviço","1.14.2.0.1.","AGETOP",230174,"BARRA DE APOIO EM AÇO INOX - 40 CM","un    ",3,1,null,null,null,null,null,""]
["S",3,"S",0,1,14,2,0,0,0,0,"F","Serviço","Serviço","1.14.2.0.2.","AGETOP",230176,"BARRA DE APOIO EM AÇO INOX - 80 CM ","un    ",3,1,null,null,null,null,null,""]
[2,2,2,6,1,15,0,0,0,28,6,"F","Nível 2","Nível 2","1.15.",null,null,"ADMINISTRAÇÃO","-",null,1,null,null,null,null,null,""]
[3,3,3,3,1,15,1,0,0,5,3,"F","Nível 3","Nível 3","1.15.1.",null,null,"MENSALISTAS","-",null,1,null,null,null,null,null,""]
["S",3,"S",0,1,15,1,0,0,0,0,"F","Serviço","Serviço","1.15.1.0.1.","SINAPI",90778,"ENGENHEIRO CIVIL DE OBRA PLENO COM ENCARGOS COMPLEMENTARES","H",176,1,null,null,null,null,null,"Referência: AGETOP - 250101"]
["S",3,"S",0,1,15,1,0,0,0,0,"F","Serviço","Serviço","1.15.1.0.2.","SINAPI",90776,"ENCARREGADO GERAL COM ENCARGOS COMPLEMENTARES","H",880,1,null,null,null,null,null,"Referência: AGETOP - 250103"]
[3,3,3,2,1,15,2,0,0,2,10,"F","Nível 3","Nível 3","1.15.2.",null,null,"LAUDO DE ESTANQUEIDADE","-",null,1,null,null,null,null,null,""]
["S",3,"S",0,1,15,2,0,0,0,0,"F","Serviço","Serviço","1.15.2.0.1.","SINAPI",90778,"ENGENHEIRO CIVIL DE OBRA PLENO COM ENCARGOS COMPLEMENTARES","H",16,1,null,null,null,null,null,"Referência: AGETOP - 250101"]
[2,2,2,17,1,16,0,0,0,22,17,"F","Nível 2","Nível 2","1.16.",null,null,"PINTURA","-",null,1,null,null,null,null,null,""]
[3,3,3,5,1,16,1,0,0,16,5,"F","Nível 3","Nível 3","1.16.1.","SINAPI",null,"ANTIGA COZINHA","-",null,1,null,null,null,null,null,""]
["S",3,"S",0,1,16,1,0,0,0,0,"F","Serviço","Serviço","1.16.1.0.1.","SINAPI","74145/1","PINTURA ESMALTE FOSCO, DUAS DEMAOS, SOBRE SUPERFICIE METALICA, INCLUSO UMA DEMAO DE FUNDO ANTICORROSIVO. UTILIZACAO DE REVOLVER ( AR-COMPRIMIDO).","M2",13.64,1,null,null,null,null,null,"Referência: AGETOP - 261602"]
["S",3,"S",0,1,16,1,0,0,0,0,"F","Serviço","Serviço","1.16.1.0.2.","SINAPI",88497,"APLICAÇÃO E LIXAMENTO DE MASSA LÁTEX EM PAREDES, DUAS DEMÃOS. AF_06/2014","M2",132.47999999999999,1,null,null,null,null,null,"Referência: AGETOP - 261300"]
["S",3,"S",0,1,16,1,0,0,0,0,"F","Serviço","Serviço","1.16.1.0.3.","AGETOP",261550,"PINT.ESMALTE SINT.PAREDES - 2 DEM.C/SELADOR","m2    ",66.239999999999995,1,null,null,null,null,null,""]
["S",3,"S",0,1,16,1,0,0,0,0,"F","Serviço","Serviço","1.16.1.0.4.","SINAPI",88489,"APLICAÇÃO MANUAL DE PINTURA COM TINTA LÁTEX ACRÍLICA EM PAREDES, DUAS DEMÃOS. AF_06/2014","M2",66.239999999999995,1,null,null,null,null,null,"Referência: AGETOP - 261001"]
[3,3,3,2,1,16,2,0,0,11,2,"F","Nível 3","Nível 3","1.16.2.","SINAPI",null,"SANITÁRIO","-",null,1,null,null,null,null,null,""]
["S",3,"S",0,1,16,2,0,0,0,0,"F","Serviço","Serviço","1.16.2.0.1.","SINAPI","74145/1","PINTURA ESMALTE FOSCO, DUAS DEMAOS, SOBRE SUPERFICIE METALICA, INCLUSO UMA DEMAO DE FUNDO ANTICORROSIVO. UTILIZACAO DE REVOLVER ( AR-COMPRIMIDO).","M2",3.52,1,null,null,null,null,null,"Referência: AGETOP - 261602"]
[{"$f":"CHOOSE(1+LOG(1+2*(ORÇAMENTO.Nivel=\"Nível 1\")+4*(ORÇAMENTO.Nivel=\"Nível 2\")+8*(ORÇAMENTO.Nivel=\"Nível 3\")+16*(ORÇAMENTO.Nivel=\"Nível 4\")+32*(ORÇAMENTO.Nivel=\"Serviço\"),2),0,1,2,3,4,\"S\")","v":3},{"$f":"IF(OR(C366=\"s\",C366=0),OFFSET(B366,-1,0),C366)","v":3},{"$f":"IF(OFFSET(C366,-1,0)=\"L\",1,IF(OFFSET(C366,-1,0)=1,2,IF(OR(A366=\"s\",A366=0),\"S\",IF(AND(OFFSET(C366,-1,0)=2,A366=4),3,IF(AND(OR(OFFSET(C366,-1,0)=\"s\",OFFSET(C366,-1,0)=0),A366<>\"s\",A366>OFFSET(B366,-1,0)),OFFSET(B366,-1,0),A366)))))","v":3},{"$f":"IF(OR(C366=\"S\",C366=0),0,IF(ISERROR(K366),J366,SMALL(J366:K366,1)))","v":2},{"$f":"IF($C366=1,OFFSET(E366,-1,0)+1,OFFSET(E366,-1,0))","v":1},{"$f":"IF($C366=1,0,IF($C366=2,OFFSET(F366,-1,0)+1,OFFSET(F366,-1,0)))","v":16},{"$f":"IF(AND($C366<=2,$C366<>0),0,IF($C366=3,OFFSET(G366,-1,0)+1,OFFSET(G366,-1,0)))","v":3},{"$f":"IF(AND($C366<=3,$C366<>0),0,IF($C366=4,OFFSET(H366,-1,0)+1,OFFSET(H366,-1,0)))","v":0},{"$f":"IF(AND($C366<=4,$C366<>0),0,IF(AND($C366=\"S\",$Y366>0),OFFSET(I366,-1,0)+1,OFFSET(I366,-1,0)))","v":0},9,2,"F","Nível 3","Nível 3","1.16.3.","AGETOP",null,"PINTURA EM RAMPA","-",null,1,null,null,null,null,null,""]
["S",3,"S",0,1,16,3,0,0,0,0,"F","Serviço","Serviço","1.16.3.0.1.","SINAPI","74245/1","PINTURA ACRILICA EM PISO CIMENTADO DUAS DEMAOS","M2",4.74,1,null,null,null,null,null,"Referência: AGETOP - 261703"]
[3,3,3,2,1,16,4,0,0,7,2,"F","Nível 3","Nível 3","1.16.4.",null,null,"PINTURA PARA ESCADA","-",null,1,null,null,null,null,null,""]
["S",3,"S",0,1,16,4,0,0,0,0,"F","Serviço","Serviço","1.16.4.0.1.","SINAPI","74245/1","PINTURA ACRILICA EM PISO CIMENTADO DUAS DEMAOS","M2",0.34,1,null,null,null,null,null,"Referência: AGETOP - 261703"]
[3,3,3,5,1,16,5,0,0,{"$f":"IF(OR($C370=\"S\",$C370=0),0,MATCH(0,OFFSET($D370,1,$C370,ROW($C$911)-ROW($C370)),0))","v":5},{"$f":"IF(OR($C370=\"S\",$C370=0),0,MATCH(OFFSET($D370,0,$C370)+1,OFFSET($D370,1,$C370,ROW($C$911)-ROW($C370)),0))","v":{"$error":"#N/A"}},"F","Nível 3","Nível 3","1.16.5.","SINAPI",null,"SALA DE DIRETORIA","-",null,1,null,null,null,null,null,""]
["S",3,"S",0,1,16,5,0,0,0,0,"F","Serviço","Serviço","1.16.5.0.1.","SINAPI","74145/1","PINTURA ESMALTE FOSCO, DUAS DEMAOS, SOBRE SUPERFICIE METALICA, INCLUSO UMA DEMAO DE FUNDO ANTICORROSIVO. UTILIZACAO DE REVOLVER ( AR-COMPRIMIDO).","M2",3.36,1,null,null,null,null,null,"Referência: AGETOP - 261602"]
["S",3,"S",0,1,16,5,0,0,0,0,"F","Serviço","Serviço","1.16.5.0.2.","SINAPI",88497,"APLICAÇÃO E LIXAMENTO DE MASSA LÁTEX EM PAREDES, DUAS DEMÃOS. AF_06/2014","M2",3.87,1,null,null,null,null,null,"Referência: AGETOP - 261300"]
["S",3,"S",0,1,16,5,0,0,0,0,"F","Serviço","Serviço","1.16.5.0.3.","AGETOP",261550,"PINT.ESMALTE SINT.PAREDES - 2 DEM.C/SELADOR","m2    ",1.93,1,null,null,null,null,null,""]
["S",3,"S",0,1,16,5,0,0,0,0,"F","Serviço","Serviço","1.16.5.0.4.","SINAPI",88489,"APLICAÇÃO MANUAL DE PINTURA COM TINTA LÁTEX ACRÍLICA EM PAREDES, DUAS DEMÃOS. AF_06/2014","M2",1.93,1,null,null,null,null,null,"Referência: AGETOP - 261001"]
[2,2,2,5,1,17,0,0,0,{"$f":"IF(OR($C375=\"S\",$C375=0),0,MATCH(0,OFFSET($D375,1,$C375,ROW($C$911)-ROW($C375)),0))","v":5},{"$f":"IF(OR($C375=\"S\",$C375=0),0,MATCH(OFFSET($D375,0,$C375)+1,OFFSET($D375,1,$C375,ROW($C$911)-ROW($C375)),0))","v":248},"F","Nível 2","Nível 2","1.17.",null,null,"DIVERSOS","-",null,1,null,null,null,null,null,""]
[3,{"$f":"IF(OR(C376=\"s\",C376=0),OFFSET(B376,-1,0),C376)","v":3},{"$f":"IF(OFFSET(C376,-1,0)=\"L\",1,IF(OFFSET(C376,-1,0)=1,2,IF(OR(A376=\"s\",A376=0),\"S\",IF(AND(OFFSET(C376,-1,0)=2,A376=4),3,IF(AND(OR(OFFSET(C376,-1,0)=\"s\",OFFSET(C376,-1,0)=0),A376<>\"s\",A376>OFFSET(B376,-1,0)),OFFSET(B376,-1,0),A376)))))","v":3},{"$f":"IF(OR(C376=\"S\",C376=0),0,IF(ISERROR(K376),J376,SMALL(J376:K376,1)))","v":2},{"$f":"IF($C376=1,OFFSET(E376,-1,0)+1,OFFSET(E376,-1,0))","v":1},{"$f":"IF($C376=1,0,IF($C376=2,OFFSET(F376,-1,0)+1,OFFSET(F376,-1,0)))","v":17},{"$f":"IF(AND($C376<=2,$C376<>0),0,IF($C376=3,OFFSET(G376,-1,0)+1,OFFSET(G376,-1,0)))","v":1},{"$f":"IF(AND($C376<=3,$C376<>0),0,IF($C376=4,OFFSET(H376,-1,0)+1,OFFSET(H376,-1,0)))","v":0},0,4,2,"F","Nível 3","Nível 3","1.17.1.","SINAPI",null,"ACESSIBILIDADE - ELEVADOR","-",null,1,null,null,null,null,null,""]
["S",{"$f":"IF(OR(C377=\"s\",C377=0),OFFSET(B377,-1,0),C377)","v":3},{"$f":"IF(OFFSET(C377,-1,0)=\"L\",1,IF(OFFSET(C377,-1,0)=1,2,IF(OR(A377=\"s\",A377=0),\"S\",IF(AND(OFFSET(C377,-1,0)=2,A377=4),3,IF(AND(OR(OFFSET(C377,-1,0)=\"s\",OFFSET(C377,-1,0)=0),A377<>\"s\",A377>OFFSET(B377,-1,0)),OFFSET(B377,-1,0),A377)))))","v":"S"},{"$f":"IF(OR(C377=\"S\",C377=0),0,IF(ISERROR(K377),J377,SMALL(J377:K377,1)))","v":0},{"$f":"IF($C377=1,OFFSET(E377,-1,0)+1,OFFSET(E377,-1,0))","v":1},{"$f":"IF($C377=1,0,IF($C377=2,OFFSET(F377,-1,0)+1,OFFSET(F377,-1,0)))","v":17},{"$f":"IF(AND($C377<=2,$C377<>0),0,IF($C377=3,OFFSET(G377,-1,0)+1,OFFSET(G377,-1,0)))","v":1},{"$f":"IF(AND($C377<=3,$C377<>0),0,IF($C377=4,OFFSET(H377,-1,0)+1,OFFSET(H377,-1,0)))","v":0},0,0,0,"F","Serviço","Serviço","1.17.1.0.1.","COMPOSIÇÃO","COMP 086_SEE","ELEVADOR (PLATAFORMA VERTICAL) MODELO HERA OU EQUIVALENTE 02 PARADAS - CAPACIDADE 280KG (INSTALADO)","UN ",2,1,null,null,null,null,null,""]
[3,{"$f":"IF(OR(C378=\"s\",C378=0),OFFSET(B378,-1,0),C378)","v":3},{"$f":"IF(OFFSET(C378,-1,0)=\"L\",1,IF(OFFSET(C378,-1,0)=1,2,IF(OR(A378=\"s\",A378=0),\"S\",IF(AND(OFFSET(C378,-1,0)=2,A378=4),3,IF(AND(OR(OFFSET(C378,-1,0)=\"s\",OFFSET(C378,-1,0)=0),A378<>\"s\",A378>OFFSET(B378,-1,0)),OFFSET(B378,-1,0),A378)))))","v":3},{"$f":"IF(OR(C378=\"S\",C378=0),0,IF(ISERROR(K378),J378,SMALL(J378:K378,1)))","v":2},{"$f":"IF($C378=1,OFFSET(E378,-1,0)+1,OFFSET(E378,-1,0))","v":1},{"$f":"IF($C378=1,0,IF($C378=2,OFFSET(F378,-1,0)+1,OFFSET(F378,-1,0)))","v":17},{"$f":"IF(AND($C378<=2,$C378<>0),0,IF($C378=3,OFFSET(G378,-1,0)+1,OFFSET(G378,-1,0)))","v":2},{"$f":"IF(AND($C378<=3,$C378<>0),0,IF($C378=4,OFFSET(H378,-1,0)+1,OFFSET(H378,-1,0)))","v":0},0,2,96,"F","Nível 3","Nível 3","1.17.2.","SINAPI",null,"REFORMA GERAL","-",null,1,null,null,null,null,null,""]
["S",3,"S",0,1,17,2,0,0,0,0,"F","Serviço","Serviço","1.17.2.0.1.","AGETOP",270501,"LIMPEZA FINAL DE OBRA - (OBRAS CIVIS)","m2    ",200,1,null,null,null,null,null,""]
[1,1,1,34,2,0,0,0,0,531,34,"F","Nível 1","Nível 1","2.","SINAPI",null,"IMPLANTAÇÃO","UN",1,1,null,null,null,null,null,""]
[2,2,2,5,2,1,0,0,0,33,5,"F","Nível 2","Nível 2","2.1.","SINAPI",null,"SERVIÇOS PRELIMINARES","-",null,1,null,null,null,null,null,""]
["S",2,"S",0,2,1,0,0,0,0,0,"F","Serviço","Serviço","2.1.0.0.1.","SINAPI",98533,"PODA EM ALTURA DE ÁRVORE COM DIÂMETRO DE TRONCO MAIOR OU IGUAL A 0,20 M E MENOR QUE 0,40 M.AF_05/2018","UN",13,1,null,null,null,null,null,""]
["S",2,"S",0,2,1,0,0,0,0,0,"F","Serviço","Serviço","2.1.0.0.2.","SINAPI",98529,"CORTE RASO E RECORTE DE ÁRVORE COM DIÂMETRO DE TRONCO MAIOR OU IGUAL A 0,20 M E MENOR QUE 0,40 M.AF_05/2018","UN",13,1,null,null,null,null,null,""]
["S",2,"S",0,2,1,0,0,0,0,0,"F","Serviço","Serviço","2.1.0.0.3.","SINAPI",98526,"REMOÇÃO DE RAÍZES REMANESCENTES DE TRONCO DE ÁRVORE COM DIÂMETRO MAIOR OU IGUAL A 0,20 M E MENOR QUE 0,40 M.AF_05/2018","UN",13,1,null,null,null,null,null,""]
["S",2,"S",0,2,1,0,0,0,0,0,"F","Serviço","Serviço","2.1.0.0.4.","SINAPI",97622,"DEMOLIÇÃO DE ALVENARIA DE BLOCO FURADO, DE FORMA MANUAL, SEM REAPROVEITAMENTO. AF_12/2017","M3",9.0854999999999997,1,null,null,null,null,null,"Referência: AGETOP - 20118"]
[2,2,2,2,2,2,0,0,0,28,2,"F","Nível 2","Nível 2","2.2.","SINAPI",null,"SERVIÇO EM TERRA","-",null,1,null,null,null,null,null,""]
["S",2,"S",0,2,2,0,0,0,0,0,"F","Serviço","Serviço","2.2.0.0.1.","AGETOP",41140,"REGULARIZAÇÃO DO TERRENO SEM APILOAMENTO COM TRANSPORTE MANUAL DA TERRA ESCAVADA ","m2    ",800.98,1,null,null,null,null,null,""]
[2,2,2,26,2,3,0,0,0,26,41,"F","Nível 2","Nível 2","2.3.","SINAPI",null,"INSTALAÇÕES ESPECIAIS","-",null,1,null,null,null,null,null,""]
["S",2,"S",0,2,3,0,0,0,0,0,"F","Serviço","Serviço","2.3.0.0.1.","AGETOP",91007,"CENTRAL DE GÁS PADRÃO AGETOP SEM INSTALAÇÕES (1+1 CILINDRO 45 KG)","Un    ",1,1,null,null,null,null,null,""]
["S",2,"S",0,2,3,0,0,0,0,0,"F","Serviço","Serviço","2.3.0.0.2.","AGETOP",91023,"UNIÃO S/BRONZE PRETA 3/4\" NPT 300 LBS","Un    ",3,1,null,null,null,null,null,""]
["S",2,"S",0,2,3,0,0,0,0,0,"F","Serviço","Serviço","2.3.0.0.3.","COMPOSIÇÃO","COMP 382_SEE","TE DE REDUCAO DE FERRO GALVANIZADO, COM ROSCA BSP, DE 3/4\" X 1/2\"","UN ",1,1,null,null,null,null,null,""]
["S",2,"S",0,2,3,0,0,0,0,0,"F","Serviço","Serviço","2.3.0.0.4.","COMPOSIÇÃO","COMP 383_SEE","BUCHA DE REDUCAO DE FERRO GALVANIZADO, COM ROSCA BSP, DE 1/2\" X 1/4\"","UN ",3,1,null,null,null,null,null,""]
["S",2,"S",0,2,3,0,0,0,0,0,"F","Serviço","Serviço","2.3.0.0.5.","AGETOP",91021,"LUVA GALVANIZADO DE REDUÇÃO 3/4\" X 1/2\" (GÁS)","Un    ",2,1,null,null,null,null,null,""]
["S",2,"S",0,2,3,0,0,0,0,0,"F","Serviço","Serviço","2.3.0.0.6.","SINAPI",92692,"NIPLE, EM FERRO GALVANIZADO, CONEXÃO ROSQUEADA, DN 15 (1/2\"), INSTALADO EM RAMAIS E SUB-RAMAIS DE GÁS - FORNECIMENTO E INSTALAÇÃO. AF_12/2015","UN",6,1,null,null,null,null,null,""]
["S",2,"S",0,2,3,0,0,0,0,0,"F","Serviço","Serviço","2.3.0.0.7.","AGETOP",91031,"NIPLE DUPLO 300 PSI 3/4\"","Un    ",6,1,null,null,null,null,null,""]
["S",2,"S",0,2,3,0,0,0,0,0,"F","Serviço","Serviço","2.3.0.0.8.","COMPOSIÇÃO","COMP 212_SEE","NIPLE DE REDUÇÃO 1/2\" X 1/4\" BSP","UN ",4,1,null,null,null,null,null,""]
["S",2,"S",0,2,3,0,0,0,0,0,"F","Serviço","Serviço","2.3.0.0.9.","COMPOSIÇÃO","COMP 213_SEE","NIPLE DE REDUÇÃO 3/4\" X 1/2\" BSP","UN ",4,1,null,null,null,null,null,""]
["S",2,"S",0,2,3,0,0,0,0,0,"F","Serviço","Serviço","2.3.0.0.10.","SINAPI",92688,"TUBO DE AÇO GALVANIZADO COM COSTURA, CLASSE MÉDIA, CONEXÃO ROSQUEADA, DN 20 (3/4\"), INSTALADO EM RAMAIS E SUB-RAMAIS DE GÁS - FORNECIMENTO E INSTALAÇÃO. AF_12/2015","M",12,1,null,null,null,null,null,""]
["S",2,"S",0,2,3,0,0,0,0,0,"F","Serviço","Serviço","2.3.0.0.11.","SINAPI",92701,"JOELHO 90 GRAUS, EM FERRO GALVANIZADO, CONEXÃO ROSQUEADA, DN 20 (3/4\"), INSTALADO EM RAMAIS E SUB-RAMAIS DE GÁS - FORNECIMENTO E INSTALAÇÃO. AF_12/2015","UN",5,1,null,null,null,null,null,""]
["S",2,"S",0,2,3,0,0,0,0,0,"F","Serviço","Serviço","2.3.0.0.12.","COMPOSIÇÃO","COMP 237_SEE","FITA ANTICORROSIVA","M",6,1,null,null,null,null,null,""]
["S",2,"S",0,2,3,0,0,0,0,0,"F","Serviço","Serviço","2.3.0.0.13.","AGETOP",91025,"VÁLVULA ESFERICA LATÃO 3/4\"","Un    ",3,1,null,null,null,null,null,""]
["S",2,"S",0,2,3,0,0,0,0,0,"F","Serviço","Serviço","2.3.0.0.14.","COMPOSIÇÃO","COMP 542_SEE","VÁLVULA UGV 3/4\" (S) LATÃO","UN ",2,1,null,null,null,null,null,""]
["S",2,"S",0,2,3,0,0,0,0,0,"F","Serviço","Serviço","2.3.0.0.15.","COMPOSIÇÃO","COMP 543_SEE","VÁLVULA UGV 1/2\" (S) LATÃO","UN ",2,1,null,null,null,null,null,""]
["S",2,"S",0,2,3,0,0,0,0,0,"F","Serviço","Serviço","2.3.0.0.16.","AGETOP",91029,"VALVULA DE RETENÇÃO LATÃO 1/2\" X 7/16\" NPT","Un    ",2,1,null,null,null,null,null,""]
["S",2,"S",0,2,3,0,0,0,0,0,"F","Serviço","Serviço","2.3.0.0.17.","COMPOSIÇÃO","COMP 211_SEE","REGULADOR DE 2º ESTÁGIO 5KG/H","UN ",2,1,null,null,null,null,null,""]
["S",2,"S",0,2,3,0,0,0,0,0,"F","Serviço","Serviço","2.3.0.0.18.","COMPOSIÇÃO","COMP 210_SEE","REGULADOR DE 1º ESTÁGIO 60KG/H MODELO AP-40  COM MANÔMETRO","UN ",1,1,null,null,null,null,null,""]
["S",2,"S",0,2,3,0,0,0,0,0,"F","Serviço","Serviço","2.3.0.0.19.","AGETOP",85003,"EXTINTOR PO QUIMICO SECO (6 KG) - CAPACIDADE EXTINTORA 20 BC","Un    ",1,1,null,null,null,null,null,""]
["S",2,"S",0,2,3,0,0,0,0,0,"F","Serviço","Serviço","2.3.0.0.20.","COMPOSIÇÃO","COMP 235_SEE","PLACA DE SINALIZAÇÃO EM PVC COD 01 - (300X300) PROIBIDO FUMAR","UN ",2,1,null,null,null,null,null,""]
["S",2,"S",0,2,3,0,0,0,0,0,"F","Serviço","Serviço","2.3.0.0.21.","COMPOSIÇÃO","COMP 236_SEE","PLACA DE SINALIZAÇÃO EM PVC COD 06 - (300X300) PERIGO INFLAMÁVEL","UN ",2,1,null,null,null,null,null,""]
["S",2,"S",0,2,3,0,0,0,0,0,"F","Serviço","Serviço","2.3.0.0.22.","AGETOP",91043,"BRAÇADEIRA METALICA TIPO \"D\" DIAM. 3/4\"","Un    ",5,1,null,null,null,null,null,""]
["S",2,"S",0,2,3,0,0,0,0,0,"F","Serviço","Serviço","2.3.0.0.23.","AGETOP",71863,"PARAFUSO P/BUCHA S-10","Un    ",10,1,null,null,null,null,null,""]
["S",2,"S",0,2,3,0,0,0,0,0,"F","Serviço","Serviço","2.3.0.0.24.","AGETOP",70393,"BUCHA DE NYLON S-10","Un    ",10,1,null,null,null,null,null,""]
["S",2,"S",0,2,3,0,0,0,0,0,"F","Serviço","Serviço","2.3.0.0.25.","AGETOP",91045,"SUPORTE PARA COLETOR","Un    ",2,1,null,null,null,null,null,""]
[1,1,1,34,3,0,0,0,0,497,34,"F","Nível 1","Nível 1","3.","SINAPI",null,"PASSARELA  COBERTA MODELO 2","UN",13,13,null,null,null,null,null,""]
[2,2,2,2,3,1,0,0,0,33,2,"F","Nível 2","Nível 2","3.1.","SINAPI",null,"SERVIÇOS PRELIMINARES","-",null,13,null,null,null,null,null,""]
["S",2,"S",0,3,1,0,0,0,0,0,"F","Serviço","Serviço","3.1.0.0.1.","AGETOP",20701,"LOCAÇÃO DA OBRA, EXECUÇÃO DE GABARITO SEM REAPROVEITAMENTO, INCLUSO PINTURA (FACE INTERNA DO RIPÃO 15CM) E PIQUETE COM TESTEMUNHA","m2    ",20.16,13,null,null,null,null,null,""]
[2,2,2,3,3,2,0,0,0,31,3,"F","Nível 2","Nível 2","3.2.","AGETOP",null,"TRANSPORTES","-",null,13,null,null,null,null,null,""]
["S",2,"S",0,3,2,0,0,0,0,0,"F","Serviço","Serviço","3.2.0.0.1.","SINAPI",72900,"TRANSPORTE DE ENTULHO COM CAMINHAO BASCULANTE 6 M3, RODOVIA PAVIMENTADA, DMT 0,5 A 1,0 KM","M3",6,13,null,null,null,null,null,""]
["S",2,"S",0,3,2,0,0,0,0,0,"F","Serviço","Serviço","3.2.0.0.2.","SINAPI",72897,"CARGA MANUAL DE ENTULHO EM CAMINHAO BASCULANTE 6 M3","M3",6,13,null,null,null,null,null,""]
[2,2,2,9,3,3,0,0,0,28,9,"F","Nível 2","Nível 2","3.3.","AGETOP",null,"FUNDAÇÕES E SONDAGENS","-",null,13,null,null,null,null,null,""]
["S",2,"S",0,3,3,0,0,0,0,0,"F","Serviço","Serviço","3.3.0.0.1.","SINAPI",96534,"FABRICAÇÃO, MONTAGEM E DESMONTAGEM DE FÔRMA PARA BLOCO DE COROAMENTO, EM MADEIRA SERRADA, E=25 MM, 4 UTILIZAÇÕES. AF_06/2017","M2",5.28,13,null,null,null,null,null,"Referência: AGETOP - 51009"]
["S",2,"S",0,3,3,0,0,0,{"$f":"IF(OR($C422=\"S\",$C422=0),0,MATCH(0,OFFSET($D422,1,$C422,ROW($C$911)-ROW($C422)),0))","v":0},{"$f":"IF(OR($C422=\"S\",$C422=0),0,MATCH(OFFSET($D422,0,$C422)+1,OFFSET($D422,1,$C422,ROW($C$911)-ROW($C422)),0))","v":0},"F","Serviço","Serviço","3.3.0.0.2.","SINAPI",96523,"ESCAVAÇÃO MANUAL PARA BLOCO DE COROAMENTO OU SAPATA, COM PREVISÃO DE FÔRMA. AF_06/2017","M3",1.0289999999999999,13,null,null,null,null,null,"Referência: AGETOP - 50901"]
["S",2,"S",0,3,3,0,0,0,0,0,"F","Serviço","Serviço","3.3.0.0.3.","AGETOP",50902,"APILOAMENTO (BLOCOS/SAPATAS)","m2    ",1,13,null,null,null,null,null,""]
["S",2,"S",0,3,3,0,0,0,0,0,"F","Serviço","Serviço","3.3.0.0.4.","SINAPI",96995,"REATERRO MANUAL APILOADO COM SOQUETE. AF_10/2017","M3",0.44899999999999995,13,null,null,null,null,null,"Referência: AGETOP - 40902"]
["S",2,"S",0,3,3,0,0,0,0,0,"F","Serviço","Serviço","3.3.0.0.5.","SINAPI",94964,"CONCRETO FCK = 20MPA, TRAÇO 1:2,7:3 (CIMENTO/ AREIA MÉDIA/ BRITA 1)  - PREPARO MECÂNICO COM BETONEIRA 400 L. AF_07/2016","M3",0.57999999999999996,13,null,null,null,null,null,""]
["S",2,"S",0,3,3,0,0,0,0,0,"F","Serviço","Serviço","3.3.0.0.6.","SINAPI","74157/4","LANCAMENTO/APLICACAO MANUAL DE CONCRETO EM FUNDACOES","M3",0.57999999999999996,13,null,null,null,null,null,"Referência: AGETOP - 51026"]
[{"$f":"CHOOSE(1+LOG(1+2*(ORÇAMENTO.Nivel=\"Nível 1\")+4*(ORÇAMENTO.Nivel=\"Nível 2\")+8*(ORÇAMENTO.Nivel=\"Nível 3\")+16*(ORÇAMENTO.Nivel=\"Nível 4\")+32*(ORÇAMENTO.Nivel=\"Serviço\"),2),0,1,2,3,4,\"S\")","v":"S"},2,"S",0,3,3,0,0,{"$f":"IF(AND($C427<=4,$C427<>0),0,IF(AND($C427=\"S\",$Y427>0),OFFSET(I427,-1,0)+1,OFFSET(I427,-1,0)))","v":0},0,0,"F","Serviço","Serviço","3.3.0.0.7.","SINAPI",96547,"ARMAÇÃO DE BLOCO, VIGA BALDRAME OU SAPATA UTILIZANDO AÇO CA-50 DE 12,5 MM - MONTAGEM. AF_06/2017","KG",13.18181818181818,13,null,null,null,null,null,""]
["S",2,"S",0,3,3,0,0,0,0,0,"F","Serviço","Serviço","3.3.0.0.8.","SINAPI",96543,"ARMAÇÃO DE BLOCO, VIGA BALDRAME E SAPATA UTILIZANDO AÇO CA-60 DE 5 MM - MONTAGEM. AF_06/2017","KG",8.7272727272727266,13,null,null,null,null,null,"Referência: AGETOP - 52014"]
[2,2,2,6,3,4,0,0,0,{"$f":"IF(OR($C429=\"S\",$C429=0),0,MATCH(0,OFFSET($D429,1,$C429,ROW($C$911)-ROW($C429)),0))","v":19},{"$f":"IF(OR($C429=\"S\",$C429=0),0,MATCH(OFFSET($D429,0,$C429)+1,OFFSET($D429,1,$C429,ROW($C$911)-ROW($C429)),0))","v":6},"F","Nível 2","Nível 2","3.4.","AGETOP",null,"ESTRUTURA","-",null,13,null,null,null,null,null,""]
["S",2,"S",0,{"$f":"IF($C430=1,OFFSET(E430,-1,0)+1,OFFSET(E430,-1,0))","v":3},{"$f":"IF($C430=1,0,IF($C430=2,OFFSET(F430,-1,0)+1,OFFSET(F430,-1,0)))","v":4},{"$f":"IF(AND($C430<=2,$C430<>0),0,IF($C430=3,OFFSET(G430,-1,0)+1,OFFSET(G430,-1,0)))","v":0},{"$f":"IF(AND($C430<=3,$C430<>0),0,IF($C430=4,OFFSET(H430,-1,0)+1,OFFSET(H430,-1,0)))","v":0},0,0,0,"F","Serviço","Serviço","3.4.0.0.1.","SINAPI",92426,"MONTAGEM E DESMONTAGEM DE FÔRMA DE PILARES RETANGULARES E ESTRUTURAS SIMILARES COM ÁREA MÉDIA DAS SEÇÕES MENOR OU IGUAL A 0,25 M², PÉ-DIREITO SIMPLES, EM CHAPA DE MADEIRA COMPENSADA RESINADA, 8 UTILIZAÇÕES. AF_12/2015","M2",1.29,13,null,null,null,null,null,""]
["S",2,"S",0,3,4,0,0,0,0,0,"F","Serviço","Serviço","3.4.0.0.2.","SINAPI",94964,"CONCRETO FCK = 20MPA, TRAÇO 1:2,7:3 (CIMENTO/ AREIA MÉDIA/ BRITA 1)  - PREPARO MECÂNICO COM BETONEIRA 400 L. AF_07/2016","M3",0.11,13,null,null,null,null,null,""]
["S",2,"S",0,3,4,0,0,0,0,0,"F","Serviço","Serviço","3.4.0.0.3.","SINAPI",92873,"LANÇAMENTO COM USO DE BALDES, ADENSAMENTO E ACABAMENTO DE CONCRETO EM ESTRUTURAS. AF_12/2015","M3",0.11,13,null,null,null,null,null,"Referência: AGETOP - 60801"]
["S",2,"S",0,3,4,0,0,0,0,0,"F","Serviço","Serviço","3.4.0.0.4.","SINAPI",92779,"ARMAÇÃO DE PILAR OU VIGA DE UMA ESTRUTURA CONVENCIONAL DE CONCRETO ARMADO EM UMA EDIFICAÇÃO TÉRREA OU SOBRADO UTILIZANDO AÇO CA-50 DE 12,5 MM - MONTAGEM. AF_12/2015","KG",2.8181818181818179,13,null,null,null,null,null,""]
["S",2,"S",0,3,4,0,0,0,0,0,"F","Serviço","Serviço","3.4.0.0.5.","SINAPI",92775,"ARMAÇÃO DE PILAR OU VIGA DE UMA ESTRUTURA CONVENCIONAL DE CONCRETO ARMADO EM UMA EDIFICAÇÃO TÉRREA OU SOBRADO UTILIZANDO AÇO CA-60 DE 5,0 MM - MONTAGEM. AF_12/2015","KG",1.4545454545454546,13,null,null,null,null,null,"Referência: AGETOP - 60314"]
[2,2,2,2,3,5,0,0,0,13,2,"F","Nível 2","Nível 2","3.5.",null,null,"IMPERMEABILIZAÇÃO","-",null,13,null,null,null,null,null,""]
["S",{"$f":"IF(OR(C436=\"s\",C436=0),OFFSET(B436,-1,0),C436)","v":2},{"$f":"IF(OFFSET(C436,-1,0)=\"L\",1,IF(OFFSET(C436,-1,0)=1,2,IF(OR(A436=\"s\",A436=0),\"S\",IF(AND(OFFSET(C436,-1,0)=2,A436=4),3,IF(AND(OR(OFFSET(C436,-1,0)=\"s\",OFFSET(C436,-1,0)=0),A436<>\"s\",A436>OFFSET(B436,-1,0)),OFFSET(B436,-1,0),A436)))))","v":"S"},{"$f":"IF(OR(C436=\"S\",C436=0),0,IF(ISERROR(K436),J436,SMALL(J436:K436,1)))","v":0},3,5,0,0,0,0,0,"F","Serviço","Serviço","3.5.0.0.1.","SINAPI",98562,"IMPERMEABILIZAÇÃO DE FLOREIRA OU VIGA BALDRAME COM ARGAMASSA DE CIMENTO E AREIA, COM ADITIVO IMPERMEABILIZANTE, E = 2 CM. AF_06/2018","M2",3.6,13,null,null,null,null,null,"Referência: AGETOP - 120902"]
[2,2,2,2,3,6,0,0,0,11,2,"F","Nível 2","Nível 2","3.6.",null,null,"IMPERMEABILIZAÇÃO","-",null,13,null,null,null,null,null,""]
["S",2,"S",0,3,6,0,0,0,0,0,"F","Serviço","Serviço","3.6.0.0.1.","AGETOP",150103,"ESTRUTURA METÁLICA CONVENCIONAL EM AÇO DO TIPO USI SAC-300 COM FUNDO ANTICORROSIVO","Kg    ",270.56000000000006,13,null,null,null,null,null,""]
[2,2,2,3,3,7,0,0,0,9,3,"F","Nível 2","Nível 2","3.7.",null,null,"COBERTURAS","-",null,13,null,null,null,null,null,""]
["S",2,"S",0,3,7,0,0,0,0,0,"F","Serviço","Serviço","3.7.0.0.1.","SINAPI",94213,"TELHAMENTO COM TELHA DE AÇO/ALUMÍNIO E = 0,5 MM, COM ATÉ 2 ÁGUAS, INCLUSO IÇAMENTO. AF_07/2019","M2",25.92,13,null,null,null,null,null,"Referência: AGETOP - 160905"]
["S",2,"S",0,3,7,0,0,0,0,0,"F","Serviço","Serviço","3.7.0.0.2.","SINAPI",94228,"CALHA EM CHAPA DE AÇO GALVANIZADO NÚMERO 24, DESENVOLVIMENTO DE 50 CM, INCLUSO TRANSPORTE VERTICAL. AF_07/2019","M",7.2,13,null,null,null,null,null,"Referência: AGETOP - 160601"]
[2,2,2,4,3,8,0,0,0,6,4,"F","Nível 2","Nível 2","3.8.",null,null,"REVESTIMENTO DE PISO","-",null,13,null,null,null,null,null,""]
["S",2,"S",0,3,8,0,0,0,0,0,"F","Serviço","Serviço","3.8.0.0.1.","SINAPI",95241,"LASTRO DE CONCRETO MAGRO, APLICADO EM PISOS OU RADIERS, ESPESSURA DE 5 CM. AF_07/2016","M2",20.16,13,null,null,null,null,null,""]
["S",2,"S",0,3,8,0,0,0,0,0,"F","Serviço","Serviço","3.8.0.0.2.","SINAPI",84191,"PISO EM GRANILITE, MARMORITE OU GRANITINA ESPESSURA 8 MM, INCLUSO JUNTAS DE DILATACAO PLASTICAS","M2",20.16,13,null,null,null,null,null,"Referência: AGETOP - 221101"]
["S",2,"S",0,3,8,0,0,0,0,0,"F","Serviço","Serviço","3.8.0.0.3.","AGETOP",221104,"RASPAGEM E APLICAÇÃO RESINA ACRÍLICA DUAS DEMÃOS","m2    ",20.72,13,null,null,null,null,null,""]
[2,2,2,2,3,9,0,0,0,2,145,"F","Nível 2","Nível 2","3.9.",null,null,"PINTURA","-",null,13,null,null,null,null,null,""]
["S",2,"S",0,3,9,0,0,0,0,0,"F","Serviço","Serviço","3.9.0.0.1.","SINAPI","74145/1","PINTURA ESMALTE FOSCO, DUAS DEMAOS, SOBRE SUPERFICIE METALICA, INCLUSO UMA DEMAO DE FUNDO ANTICORROSIVO. UTILIZACAO DE REVOLVER ( AR-COMPRIMIDO).","M2",51.84,13,null,null,null,null,null,"Referência: AGETOP - 261602"]
[1,1,1,186,4,0,0,0,0,463,186,"F","Nível 1","Nível 1","4.","SINAPI",null,"COZINHA COM REFEITÓRIO ","UN",1,1,null,null,null,null,null,""]
[2,2,2,2,4,1,0,0,0,185,2,"F","Nível 2","Nível 2","4.1.","SINAPI",null,"SERVIÇOS PRELIMINARES","-",null,1,null,null,null,null,null,""]
["S",2,"S",0,4,1,0,0,0,0,0,"F","Serviço","Serviço","4.1.0.0.1.","AGETOP",20701,"LOCAÇÃO DA OBRA, EXECUÇÃO DE GABARITO SEM REAPROVEITAMENTO, INCLUSO PINTURA (FACE INTERNA DO RIPÃO 15CM) E PIQUETE COM TESTEMUNHA","m2    ",139.75,1,null,null,null,null,null,""]
[2,2,2,3,4,2,0,0,0,183,3,"F","Nível 2","Nível 2","4.2.","AGETOP",null,"TRANSPORTES","-",null,1,null,null,null,null,null,""]
["S",2,"S",0,4,2,0,0,0,0,0,"F","Serviço","Serviço","4.2.0.0.1.","SINAPI",72900,"TRANSPORTE DE ENTULHO COM CAMINHAO BASCULANTE 6 M3, RODOVIA PAVIMENTADA, DMT 0,5 A 1,0 KM","M3",10,1,null,null,null,null,null,""]
["S",2,"S",0,4,2,0,0,0,0,0,"F","Serviço","Serviço","4.2.0.0.2.","SINAPI",72897,"CARGA MANUAL DE ENTULHO EM CAMINHAO BASCULANTE 6 M3","M3",10,1,null,null,null,null,null,""]
[2,2,2,2,4,3,0,0,0,180,2,"F","Nível 2","Nível 2","4.3.","AGETOP",null,"SERVIÇO EM TERRA","-",null,1,null,null,null,null,null,""]
["S",2,"S",0,4,3,0,0,0,0,0,"F","Serviço","Serviço","4.3.0.0.1.","AGETOP",41002,"APILOAMENTO","m2    ",139.75,1,null,null,null,null,null,""]
[2,2,2,20,4,4,0,0,0,178,20,"F","Nível 2","Nível 2","4.4.","AGETOP",null,"FUNDAÇÕES E SONDAGENS","-",null,1,null,null,null,null,null,""]
[3,3,3,9,4,4,1,0,0,19,9,"F","Nível 3","Nível 3","4.4.1.","SINAPI",null,"ESTACAS E BLOCOS","-",null,1,null,null,null,null,null,""]
["S",3,"S",0,4,4,1,0,0,0,0,"F","Serviço","Serviço","4.4.1.0.1.","SINAPI",98230,"ESTACA BROCA DE CONCRETO, DIÂMETRO DE 30 CM, PROFUNDIDADE DE ATÉ 3 M, ESCAVAÇÃO MANUAL COM TRADO CONCHA, NÃO ARMADA. AF_03/2018","M",101.5,1,null,null,null,null,null,"Referência: AGETOP - 50302"]
["S",3,"S",0,4,4,1,0,0,0,0,"F","Serviço","Serviço","4.4.1.0.2.","SINAPI",96522,"ESCAVAÇÃO MANUAL PARA BLOCO DE COROAMENTO OU SAPATA, SEM PREVISÃO DE FÔRMA. AF_06/2017","M3",5.19,1,null,null,null,null,null,"Referência: AGETOP - 50901"]
["S",3,"S",0,4,4,1,0,0,0,0,"F","Serviço","Serviço","4.4.1.0.3.","SINAPI",94963,"CONCRETO FCK = 15MPA, TRAÇO 1:3,4:3,5 (CIMENTO/ AREIA MÉDIA/ BRITA 1)  - PREPARO MECÂNICO COM BETONEIRA 400 L. AF_07/2016","M3",3.4,1,null,null,null,null,null,""]
["S",3,"S",0,4,4,1,0,0,0,0,"F","Serviço","Serviço","4.4.1.0.4.","SINAPI","74157/4","LANCAMENTO/APLICACAO MANUAL DE CONCRETO EM FUNDACOES","M3",3.4,1,null,null,null,null,null,"Referência: AGETOP - 51026"]
["S",3,"S",0,4,4,1,0,0,0,0,"F","Serviço","Serviço","4.4.1.0.5.","AGETOP",60191,"FORMA DE TABUA CINTA BALDRAME U=8 VEZES","m2    ",23.7,1,null,null,null,null,null,""]
["S",3,"S",0,4,4,1,0,0,0,0,"F","Serviço","Serviço","4.4.1.0.6.","SINAPI",96543,"ARMAÇÃO DE BLOCO, VIGA BALDRAME E SAPATA UTILIZANDO AÇO CA-60 DE 5 MM - MONTAGEM. AF_06/2017","KG",98.2,1,null,null,null,null,null,"Referência: AGETOP - 52014"]
["S",3,"S",0,4,4,1,0,0,0,0,"F","Serviço","Serviço","4.4.1.0.7.","SINAPI",96546,"ARMAÇÃO DE BLOCO, VIGA BALDRAME OU SAPATA UTILIZANDO AÇO CA-50 DE 10 MM - MONTAGEM. AF_06/2017","KG",226.54,1,null,null,null,null,null,"Referência: AGETOP - 52005"]
["S",3,"S",0,4,4,1,0,0,0,0,"F","Serviço","Serviço","4.4.1.0.8.","SINAPI",96547,"ARMAÇÃO DE BLOCO, VIGA BALDRAME OU SAPATA UTILIZANDO AÇO CA-50 DE 12,5 MM - MONTAGEM. AF_06/2017","KG",240,1,null,null,null,null,null,""]
[3,3,3,8,4,4,2,0,0,10,8,"F","Nível 3","Nível 3","4.4.2.","SINAPI",null,"VIGAS BALDRAMES","-",null,1,null,null,null,null,null,""]
["S",3,"S",0,4,4,2,0,0,0,0,"F","Serviço","Serviço","4.4.2.0.1.","AGETOP",60191,"FORMA DE TABUA CINTA BALDRAME U=8 VEZES","m2    ",41.5,1,null,null,null,null,null,""]
["S",3,"S",0,4,4,2,0,0,0,0,"F","Serviço","Serviço","4.4.2.0.2.","SINAPI",94964,"CONCRETO FCK = 20MPA, TRAÇO 1:2,7:3 (CIMENTO/ AREIA MÉDIA/ BRITA 1)  - PREPARO MECÂNICO COM BETONEIRA 400 L. AF_07/2016","M3",2.4,1,null,null,null,null,null,""]
["S",3,"S",0,4,4,2,0,0,0,0,"F","Serviço","Serviço","4.4.2.0.3.","SINAPI","74157/4","LANCAMENTO/APLICACAO MANUAL DE CONCRETO EM FUNDACOES","M3",2.4,1,null,null,null,null,null,"Referência: AGETOP - 51026"]
["S",3,"S",0,4,4,2,0,0,0,0,"F","Serviço","Serviço","4.4.2.0.4.","SINAPI",96544,"ARMAÇÃO DE BLOCO, VIGA BALDRAME OU SAPATA UTILIZANDO AÇO CA-50 DE 6,3 MM - MONTAGEM. AF_06/2017","KG",47,1,null,null,null,null,null,"Referência: AGETOP - 52003"]
["S",3,"S",0,4,4,2,0,0,0,0,"F","Serviço","Serviço","4.4.2.0.5.","SINAPI",96545,"ARMAÇÃO DE BLOCO, VIGA BALDRAME OU SAPATA UTILIZANDO AÇO CA-50 DE 8 MM - MONTAGEM. AF_06/2017","KG",49,1,null,null,null,null,null,"Referência: AGETOP - 52004"]
["S",3,"S",0,4,4,2,0,0,0,0,"F","Serviço","Serviço","4.4.2.0.6.","SINAPI",96546,"ARMAÇÃO DE BLOCO, VIGA BALDRAME OU SAPATA UTILIZANDO AÇO CA-50 DE 10 MM - MONTAGEM. AF_06/2017","KG",38,1,null,null,null,null,null,"Referência: AGETOP - 52005"]
["S",3,"S",0,4,4,2,0,0,0,0,"F","Serviço","Serviço","4.4.2.0.7.","SINAPI",96543,"ARMAÇÃO DE BLOCO, VIGA BALDRAME E SAPATA UTILIZANDO AÇO CA-60 DE 5 MM - MONTAGEM. AF_06/2017","KG",72,1,null,null,null,null,null,"Referência: AGETOP - 52014"]
[3,3,3,2,4,4,3,0,0,2,311,"F","Nível 3","Nível 3","4.4.3.","SINAPI",null,"OUTROS","-",null,1,null,null,null,null,null,""]
["S",3,"S",0,4,4,3,0,0,0,0,"F","Serviço","Serviço","4.4.3.0.1.","AGETOP",50101,"SONDAGENS P/INTERIOR - (OBRAS CIVIS)","m     ",28,1,null,null,null,null,null,""]
[2,2,2,20,4,5,0,0,0,158,20,"F","Nível 2","Nível 2","4.5.","AGETOP",null,"ESTRUTURA","-",null,1,null,null,null,null,null,""]
[3,3,3,8,4,5,1,0,0,19,8,"F","Nível 3","Nível 3","4.5.1.","AGETOP",null,"PILAR","-",null,1,null,null,null,null,null,""]
["S",3,"S",0,4,5,1,0,0,0,0,"F","Serviço","Serviço","4.5.1.0.1.","SINAPI",92426,"MONTAGEM E DESMONTAGEM DE FÔRMA DE PILARES RETANGULARES E ESTRUTURAS SIMILARES COM ÁREA MÉDIA DAS SEÇÕES MENOR OU IGUAL A 0,25 M², PÉ-DIREITO SIMPLES, EM CHAPA DE MADEIRA COMPENSADA RESINADA, 8 UTILIZAÇÕES. AF_12/2015","M2",59.6,1,null,null,null,null,null,""]
["S",3,"S",0,4,5,1,0,0,0,0,"F","Serviço","Serviço","4.5.1.0.2.","SINAPI",94964,"CONCRETO FCK = 20MPA, TRAÇO 1:2,7:3 (CIMENTO/ AREIA MÉDIA/ BRITA 1)  - PREPARO MECÂNICO COM BETONEIRA 400 L. AF_07/2016","M3",2.5,1,null,null,null,null,null,""]
["S",3,"S",0,4,5,1,0,0,0,0,"F","Serviço","Serviço","4.5.1.0.3.","SINAPI",92873,"LANÇAMENTO COM USO DE BALDES, ADENSAMENTO E ACABAMENTO DE CONCRETO EM ESTRUTURAS. AF_12/2015","M3",2.5,1,null,null,null,null,null,"Referência: AGETOP - 60801"]
["S",3,"S",0,4,5,1,0,0,0,0,"F","Serviço","Serviço","4.5.1.0.4.","SINAPI",92776,"ARMAÇÃO DE PILAR OU VIGA DE UMA ESTRUTURA CONVENCIONAL DE CONCRETO ARMADO EM UMA EDIFICAÇÃO TÉRREA OU SOBRADO UTILIZANDO AÇO CA-50 DE 6,3 MM - MONTAGEM. AF_12/2015","KG",42,1,null,null,null,null,null,"Referência: AGETOP - 60303"]
["S",3,"S",0,4,5,1,0,0,0,0,"F","Serviço","Serviço","4.5.1.0.5.","SINAPI",92777,"ARMAÇÃO DE PILAR OU VIGA DE UMA ESTRUTURA CONVENCIONAL DE CONCRETO ARMADO EM UMA EDIFICAÇÃO TÉRREA OU SOBRADO UTILIZANDO AÇO CA-50 DE 8,0 MM - MONTAGEM. AF_12/2015","KG",64,1,null,null,null,null,null,"Referência: AGETOP - 60304"]
["S",3,"S",0,4,5,1,0,0,0,0,"F","Serviço","Serviço","4.5.1.0.6.","SINAPI",92778,"ARMAÇÃO DE PILAR OU VIGA DE UMA ESTRUTURA CONVENCIONAL DE CONCRETO ARMADO EM UMA EDIFICAÇÃO TÉRREA OU SOBRADO UTILIZANDO AÇO CA-50 DE 10,0 MM - MONTAGEM. AF_12/2015","KG",165.46,1,null,null,null,null,null,"Referência: AGETOP - 60305"]
["S",3,"S",0,4,5,1,0,0,0,0,"F","Serviço","Serviço","4.5.1.0.7.","SINAPI",92775,"ARMAÇÃO DE PILAR OU VIGA DE UMA ESTRUTURA CONVENCIONAL DE CONCRETO ARMADO EM UMA EDIFICAÇÃO TÉRREA OU SOBRADO UTILIZANDO AÇO CA-60 DE 5,0 MM - MONTAGEM. AF_12/2015","KG",22.8,1,null,null,null,null,null,"Referência: AGETOP - 60314"]
[3,3,3,9,4,5,2,0,0,11,9,"F","Nível 3","Nível 3","4.5.2.",null,null,"VIGA DE COBERTURA","-",null,1,null,null,null,null,null,""]
["S",3,"S",0,4,5,2,0,0,0,0,"F","Serviço","Serviço","4.5.2.0.1.","SINAPI",92464,"MONTAGEM E DESMONTAGEM DE FÔRMA DE VIGA, ESCORAMENTO METÁLICO, PÉ-DIREITO SIMPLES, EM CHAPA DE MADEIRA RESINADA, 8 UTILIZAÇÕES. AF_12/2015","M2",40.9,1,null,null,null,null,null,"Referência: AGETOP - 60209"]
["S",3,"S",0,4,5,2,0,0,0,0,"F","Serviço","Serviço","4.5.2.0.2.","SINAPI",94964,"CONCRETO FCK = 20MPA, TRAÇO 1:2,7:3 (CIMENTO/ AREIA MÉDIA/ BRITA 1)  - PREPARO MECÂNICO COM BETONEIRA 400 L. AF_07/2016","M3",2.4,1,null,null,null,null,null,""]
["S",3,"S",0,4,5,2,0,0,0,0,"F","Serviço","Serviço","4.5.2.0.3.","SINAPI",92873,"LANÇAMENTO COM USO DE BALDES, ADENSAMENTO E ACABAMENTO DE CONCRETO EM ESTRUTURAS. AF_12/2015","M3",2.4,1,null,null,null,null,null,"Referência: AGETOP - 60801"]
["S",3,"S",0,4,5,2,0,0,0,0,"F","Serviço","Serviço","4.5.2.0.4.","SINAPI",92776,"ARMAÇÃO DE PILAR OU VIGA DE UMA ESTRUTURA CONVENCIONAL DE CONCRETO ARMADO EM UMA EDIFICAÇÃO TÉRREA OU SOBRADO UTILIZANDO AÇO CA-50 DE 6,3 MM - MONTAGEM. AF_12/2015","KG",18,1,null,null,null,null,null,"Referência: AGETOP - 60303"]
["S",3,"S",0,4,5,2,0,0,0,0,"F","Serviço","Serviço","4.5.2.0.5.","SINAPI",92777,"ARMAÇÃO DE PILAR OU VIGA DE UMA ESTRUTURA CONVENCIONAL DE CONCRETO ARMADO EM UMA EDIFICAÇÃO TÉRREA OU SOBRADO UTILIZANDO AÇO CA-50 DE 8,0 MM - MONTAGEM. AF_12/2015","KG",35,1,null,null,null,null,null,"Referência: AGETOP - 60304"]
[{"$f":"CHOOSE(1+LOG(1+2*(ORÇAMENTO.Nivel=\"Nível 1\")+4*(ORÇAMENTO.Nivel=\"Nível 2\")+8*(ORÇAMENTO.Nivel=\"Nível 3\")+16*(ORÇAMENTO.Nivel=\"Nível 4\")+32*(ORÇAMENTO.Nivel=\"Serviço\"),2),0,1,2,3,4,\"S\")","v":"S"},3,"S",0,4,5,2,0,{"$f":"IF(AND($C491<=4,$C491<>0),0,IF(AND($C491=\"S\",$Y491>0),OFFSET(I491,-1,0)+1,OFFSET(I491,-1,0)))","v":0},0,0,"F","Serviço","Serviço","4.5.2.0.6.","SINAPI",92778,"ARMAÇÃO DE PILAR OU VIGA DE UMA ESTRUTURA CONVENCIONAL DE CONCRETO ARMADO EM UMA EDIFICAÇÃO TÉRREA OU SOBRADO UTILIZANDO AÇO CA-50 DE 10,0 MM - MONTAGEM. AF_12/2015","KG",89,1,null,null,null,null,null,"Referência: AGETOP - 60305"]
["S",3,"S",0,4,5,2,0,0,0,0,"F","Serviço","Serviço","4.5.2.0.7.","SINAPI",92779,"ARMAÇÃO DE PILAR OU VIGA DE UMA ESTRUTURA CONVENCIONAL DE CONCRETO ARMADO EM UMA EDIFICAÇÃO TÉRREA OU SOBRADO UTILIZANDO AÇO CA-50 DE 12,5 MM - MONTAGEM. AF_12/2015","KG",24,1,null,null,null,null,null,""]
["S",3,"S",0,4,5,2,0,0,{"$f":"IF(OR($C493=\"S\",$C493=0),0,MATCH(0,OFFSET($D493,1,$C493,ROW($C$911)-ROW($C493)),0))","v":0},{"$f":"IF(OR($C493=\"S\",$C493=0),0,MATCH(OFFSET($D493,0,$C493)+1,OFFSET($D493,1,$C493,ROW($C$911)-ROW($C493)),0))","v":0},"F","Serviço","Serviço","4.5.2.0.8.","SINAPI",92775,"ARMAÇÃO DE PILAR OU VIGA DE UMA ESTRUTURA CONVENCIONAL DE CONCRETO ARMADO EM UMA EDIFICAÇÃO TÉRREA OU SOBRADO UTILIZANDO AÇO CA-60 DE 5,0 MM - MONTAGEM. AF_12/2015","KG",57,1,null,null,null,null,null,"Referência: AGETOP - 60314"]
[3,3,3,2,{"$f":"IF($C494=1,OFFSET(E494,-1,0)+1,OFFSET(E494,-1,0))","v":4},{"$f":"IF($C494=1,0,IF($C494=2,OFFSET(F494,-1,0)+1,OFFSET(F494,-1,0)))","v":5},{"$f":"IF(AND($C494<=2,$C494<>0),0,IF($C494=3,OFFSET(G494,-1,0)+1,OFFSET(G494,-1,0)))","v":3},{"$f":"IF(AND($C494<=3,$C494<>0),0,IF($C494=4,OFFSET(H494,-1,0)+1,OFFSET(H494,-1,0)))","v":0},0,2,291,"F","Nível 3","Nível 3","4.5.3.",null,null,"LAJE","-",null,1,null,null,null,null,null,""]
["S",3,"S",0,4,5,3,0,0,0,0,"F","Serviço","Serviço","4.5.3.0.1.","SINAPI","74202/1","LAJE PRE-MOLDADA P/FORRO, SOBRECARGA 100KG/M2, VAOS ATE 3,50M/E=8CM, C/LAJOTAS E CAP.C/CONC FCK=20MPA, 3CM, INTER-EIXO 38CM, C/ESCORAMENTO (REAPR.3X) E FERRAGEM NEGATIVA","M2",40.75,1,null,null,null,null,null,""]
[2,2,2,28,4,6,0,0,0,138,28,"F","Nível 2","Nível 2","4.6.",null,null,"INSTALAÇÕES ELÉTRICAS","-",null,1,null,null,null,null,null,""]
["S",2,"S",0,4,6,0,0,0,0,0,"F","Serviço","Serviço","4.6.0.0.1.","AGETOP",70421,"BUCHA E ARRUELA METALICA DIAM. 3/4\"","PR    ",3,1,null,null,null,null,null,""]
["S",2,"S",0,4,6,0,0,0,0,0,"F","Serviço","Serviço","4.6.0.0.2.","SINAPI",92868,"CAIXA RETANGULAR 4\" X 2\" MÉDIA (1,30 M DO PISO), METÁLICA, INSTALADA EM PAREDE - FORNECIMENTO E INSTALAÇÃO. AF_12/2015","UN",26,1,null,null,null,null,null,"Referência: AGETOP - 70691"]
["S",2,"S",0,4,6,0,0,0,0,0,"F","Serviço","Serviço","4.6.0.0.3.","SINAPI",92866,"CAIXA SEXTAVADA 3\" X 3\", METÁLICA, INSTALADA EM LAJE - FORNECIMENTO E INSTALAÇÃO. AF_12/2015","UN",10,1,null,null,null,null,null,"Referência: AGETOP - 70680"]
["S",{"$f":"IF(OR(C500=\"s\",C500=0),OFFSET(B500,-1,0),C500)","v":2},{"$f":"IF(OFFSET(C500,-1,0)=\"L\",1,IF(OFFSET(C500,-1,0)=1,2,IF(OR(A500=\"s\",A500=0),\"S\",IF(AND(OFFSET(C500,-1,0)=2,A500=4),3,IF(AND(OR(OFFSET(C500,-1,0)=\"s\",OFFSET(C500,-1,0)=0),A500<>\"s\",A500>OFFSET(B500,-1,0)),OFFSET(B500,-1,0),A500)))))","v":"S"},{"$f":"IF(OR(C500=\"S\",C500=0),0,IF(ISERROR(K500),J500,SMALL(J500:K500,1)))","v":0},4,6,0,0,0,0,0,"F","Serviço","Serviço","4.6.0.0.4.","SINAPI",91902,"CURVA 90 GRAUS PARA ELETRODUTO, PVC, ROSCÁVEL, DN 25 MM (3/4\"), PARA CIRCUITOS TERMINAIS, INSTALADA EM LAJE - FORNECIMENTO E INSTALAÇÃO. AF_12/2015","UN",6,1,null,null,null,null,null,"Referência: AGETOP - 71141"]
["S",2,"S",0,4,6,0,0,0,0,0,"F","Serviço","Serviço","4.6.0.0.5.","SINAPI",97585,"LUMINÁRIA TIPO CALHA, DE SOBREPOR, COM 2 LÂMPADAS TUBULARES DE 18 W - FORNECIMENTO E INSTALAÇÃO. AF_11/2017","UN",2,1,null,null,null,null,null,""]
["S",2,"S",0,4,6,0,0,0,0,0,"F","Serviço","Serviço","4.6.0.0.6.","SINAPI",97586,"LUMINÁRIA TIPO CALHA, DE SOBREPOR, COM 2 LÂMPADAS TUBULARES DE 36 W - FORNECIMENTO E INSTALAÇÃO. AF_11/2017","UN",14,1,null,null,null,null,null,""]
["S",2,"S",0,4,6,0,0,0,0,0,"F","Serviço","Serviço","4.6.0.0.7.","SINAPI",97584,"LUMINÁRIA TIPO CALHA, DE SOBREPOR, COM 1 LÂMPADA TUBULAR DE 36 W - FORNECIMENTO E INSTALAÇÃO. AF_11/2017","UN",2,1,null,null,null,null,null,""]
["S",2,"S",0,4,6,0,0,0,0,0,"F","Serviço","Serviço","4.6.0.0.8.","SINAPI",91884,"LUVA PARA ELETRODUTO, PVC, ROSCÁVEL, DN 25 MM (3/4\"), PARA CIRCUITOS TERMINAIS, INSTALADA EM PAREDE - FORNECIMENTO E INSTALAÇÃO. AF_12/2015","UN",3,1,null,null,null,null,null,"Referência: AGETOP - 71741"]
["S",2,"S",0,4,6,0,0,0,0,0,"F","Serviço","Serviço","4.6.0.0.9.","SINAPI",91927,"CABO DE COBRE FLEXÍVEL ISOLADO, 2,5 MM², ANTI-CHAMA 0,6/1,0 KV, PARA CIRCUITOS TERMINAIS - FORNECIMENTO E INSTALAÇÃO. AF_12/2015","M",723.31000000000006,1,null,null,null,null,null,"Referência: AGETOP - 70581"]
["S",2,"S",0,4,6,0,0,0,0,0,"F","Serviço","Serviço","4.6.0.0.10.","SINAPI",91931,"CABO DE COBRE FLEXÍVEL ISOLADO, 6 MM², ANTI-CHAMA 0,6/1,0 KV, PARA CIRCUITOS TERMINAIS - FORNECIMENTO E INSTALAÇÃO. AF_12/2015","M",60.8,1,null,null,null,null,null,"Referência: AGETOP - 70583"]
["S",2,"S",0,4,6,0,0,0,0,0,"F","Serviço","Serviço","4.6.0.0.11.","SINAPI",93654,"DISJUNTOR MONOPOLAR TIPO DIN, CORRENTE NOMINAL DE 16A - FORNECIMENTO E INSTALAÇÃO. AF_04/2016","UN",11,1,null,null,null,null,null,""]
["S",2,"S",0,4,6,0,0,0,0,0,"F","Serviço","Serviço","4.6.0.0.12.","SINAPI",93656,"DISJUNTOR MONOPOLAR TIPO DIN, CORRENTE NOMINAL DE 25A - FORNECIMENTO E INSTALAÇÃO. AF_04/2016","UN",1,1,null,null,null,null,null,""]
["S",2,"S",0,4,6,0,0,0,0,0,"F","Serviço","Serviço","4.6.0.0.13.","SINAPI",93673,"DISJUNTOR TRIPOLAR TIPO DIN, CORRENTE NOMINAL DE 50A - FORNECIMENTO E INSTALAÇÃO. AF_04/2016","UN",1,1,null,null,null,null,null,"Referência: AGETOP - 71174"]
["S",2,"S",0,4,6,0,0,0,0,0,"F","Serviço","Serviço","4.6.0.0.14.","AGETOP",71456,"INTERRUPTOR DIFERENCIAL RESIDUAL (D.R.) TETRAPOLAR DE 40A-30mA","Un    ",1,1,null,null,null,null,null,""]
["S",2,"S",0,4,6,0,0,0,0,0,"F","Serviço","Serviço","4.6.0.0.15.","SINAPI",91844,"ELETRODUTO FLEXÍVEL CORRUGADO, PVC, DN 25 MM (3/4\"), PARA CIRCUITOS TERMINAIS, INSTALADO EM LAJE - FORNECIMENTO E INSTALAÇÃO. AF_12/2015","M",96.82,1,null,null,null,null,null,""]
["S",2,"S",0,4,6,0,0,0,0,0,"F","Serviço","Serviço","4.6.0.0.16.","SINAPI",91846,"ELETRODUTO FLEXÍVEL CORRUGADO, PVC, DN 32 MM (1\"), PARA CIRCUITOS TERMINAIS, INSTALADO EM LAJE - FORNECIMENTO E INSTALAÇÃO. AF_12/2015","M",10.1,1,null,null,null,null,null,""]
["S",2,"S",0,4,6,0,0,0,0,0,"F","Serviço","Serviço","4.6.0.0.17.","SINAPI","73798/1","DUTO ESPIRAL FLEXIVEL SINGELO PEAD D=50MM(2\") REVESTIDO COM PVC COM FIO GUIA DE ACO GALVANIZADO, LANCADO DIRETO NO SOLO, INCL CONEXOES","M",31.1,1,null,null,null,null,null,"Referência: AGETOP - 71197"]
["S",2,"S",0,4,6,0,0,0,0,0,"F","Serviço","Serviço","4.6.0.0.18.","COMPOSIÇÃO","COMP 387_SEE","LÂMPADA LED TUBULAR 18W ","UN ",29,1,null,null,null,null,null,""]
["S",2,"S",0,4,6,0,0,0,0,0,"F","Serviço","Serviço","4.6.0.0.19.","SINAPI",97611,"LÂMPADA COMPACTA FLUORESCENTE DE 15 W, BASE E27 - FORNECIMENTO E INSTALAÇÃO. AF_11/2017","UN",2,1,null,null,null,null,null,"Referência: AGETOP - 71567"]
["S",2,"S",0,4,6,0,0,0,0,0,"F","Serviço","Serviço","4.6.0.0.20.","SINAPI",92000,"TOMADA BAIXA DE EMBUTIR (1 MÓDULO), 2P+T 10 A, INCLUINDO SUPORTE E PLACA - FORNECIMENTO E INSTALAÇÃO. AF_12/2015","UN",3,1,null,null,null,null,null,"Referência: AGETOP - 72578"]
["S",2,"S",0,4,6,0,0,0,0,0,"F","Serviço","Serviço","4.6.0.0.21.","SINAPI",91996,"TOMADA MÉDIA DE EMBUTIR (1 MÓDULO), 2P+T 10 A, INCLUINDO SUPORTE E PLACA - FORNECIMENTO E INSTALAÇÃO. AF_12/2015","UN",14,1,null,null,null,null,null,"Referência: AGETOP - 72578"]
["S",2,"S",0,4,6,0,0,0,0,0,"F","Serviço","Serviço","4.6.0.0.22.","SINAPI",91992,"TOMADA ALTA DE EMBUTIR (1 MÓDULO), 2P+T 10 A, INCLUINDO SUPORTE E PLACA - FORNECIMENTO E INSTALAÇÃO. AF_12/2015","UN",1,1,null,null,null,null,null,""]
["S",2,"S",0,4,6,0,0,0,0,0,"F","Serviço","Serviço","4.6.0.0.23.","SINAPI",91955,"INTERRUPTOR PARALELO (1 MÓDULO), 10A/250V, INCLUINDO SUPORTE E PLACA - FORNECIMENTO E INSTALAÇÃO. AF_12/2015","UN",4,1,null,null,null,null,null,"Referência: AGETOP - 71431"]
["S",2,"S",0,4,6,0,0,0,0,0,"F","Serviço","Serviço","4.6.0.0.24.","SINAPI",91953,"INTERRUPTOR SIMPLES (1 MÓDULO), 10A/250V, INCLUINDO SUPORTE E PLACA - FORNECIMENTO E INSTALAÇÃO. AF_12/2015","UN",5,1,null,null,null,null,null,"Referência: AGETOP - 71440"]
["S",2,"S",0,4,6,0,0,0,0,0,"F","Serviço","Serviço","4.6.0.0.25.","SINAPI",91959,"INTERRUPTOR SIMPLES (2 MÓDULOS), 10A/250V, INCLUINDO SUPORTE E PLACA - FORNECIMENTO E INSTALAÇÃO. AF_12/2015","UN",1,1,null,null,null,null,null,"Referência: AGETOP - 71441"]
["S",2,"S",0,4,6,0,0,0,0,0,"F","Serviço","Serviço","4.6.0.0.26.","SINAPI",96986,"HASTE DE ATERRAMENTO 3/4  PARA SPDA - FORNECIMENTO E INSTALAÇÃO. AF_12/2017","UN",3,1,null,null,null,null,null,""]
["S",2,"S",0,4,6,0,0,0,0,0,"F","Serviço","Serviço","4.6.0.0.27.","SINAPI","74131/4","QUADRO DE DISTRIBUICAO DE ENERGIA DE EMBUTIR, EM CHAPA METALICA, PARA 18 DISJUNTORES TERMOMAGNETICOS MONOPOLARES, COM BARRAMENTO TRIFASICO E NEUTRO, FORNECIMENTO E INSTALACAO","UN",1,1,null,null,null,null,null,""]
[2,2,2,60,4,7,0,0,0,110,60,"F","Nível 2","Nível 2","4.7.",null,null,"INSTALAÇÕES HIDROSSANITÁRIAS","-",null,1,null,null,null,null,null,""]
["S",2,"S",0,4,7,0,0,0,0,0,"F","Serviço","Serviço","4.7.0.0.1.","AGETOP",80502,"VASO SANITARIO","Un    ",1,1,null,null,null,null,null,""]
["S",2,"S",0,4,7,0,0,0,0,0,"F","Serviço","Serviço","4.7.0.0.2.","AGETOP",80510,"ANEL DE VEDAÇÃO PARA VASO SANITÁRIO","Un    ",1,1,null,null,null,null,null,""]
["S",2,"S",0,4,7,0,0,0,0,0,"F","Serviço","Serviço","4.7.0.0.3.","AGETOP",80513,"TUBO PARA VÁLVULA DE DESCARGA ( CURTO 1.1/4\" )","Un    ",1,1,null,null,null,null,null,""]
["S",2,"S",0,4,7,0,0,0,0,0,"F","Serviço","Serviço","4.7.0.0.4.","AGETOP",80514,"TUBO DE LIGACAO PVC CROMADO 1.1/2\" / ESPUDE  - (ENTRADA)","Un    ",1,1,null,null,null,null,null,""]
["S",2,"S",0,4,7,0,0,0,0,0,"F","Serviço","Serviço","4.7.0.0.5.","AGETOP",80517,"VÁLVULA DE DESCARGA DUPLO ACIONAMENTO COM ACABAMENTO CROMADO ANTIVANDALISMO","Un    ",1,1,null,null,null,null,null,""]
["S",2,"S",0,4,7,0,0,0,0,0,"F","Serviço","Serviço","4.7.0.0.6.","AGETOP",80520,"CONJUNTO DE FIXACAO P/VASO SANITARIO (PAR)","CJ    ",1,1,null,null,null,null,null,""]
["S",2,"S",0,4,7,0,0,0,0,0,"F","Serviço","Serviço","4.7.0.0.7.","AGETOP",80526,"ASSENTO EM POLIPROPILENO COM SISTEMA DE FECHAMENTO SUAVE PARA VASO SANITÁRIO","Un    ",1,1,null,null,null,null,null,""]
["S",2,"S",0,4,7,0,0,0,0,0,"F","Serviço","Serviço","4.7.0.0.8.","SINAPI",95544,"PAPELEIRA DE PAREDE EM METAL CROMADO SEM TAMPA, INCLUSO FIXAÇÃO. AF_10/2016","UN",1,1,null,null,null,null,null,""]
["S",2,"S",0,4,7,0,0,0,0,0,"F","Serviço","Serviço","4.7.0.0.9.","COMPOSIÇÃO","COMP 209_SEE","TOALHEIRO PLÁSTICO TIPO DISPENSER PARA PAPEL TOALHA INTERFOLHADO","UN ",1,1,null,null,null,null,null,""]
["S",2,"S",0,4,7,0,0,0,0,0,"F","Serviço","Serviço","4.7.0.0.10.","AGETOP",80542,"LAVATÓRIO MÉDIO SEM COLUNA","Un    ",2,1,null,null,null,null,null,""]
["S",2,"S",0,4,7,0,0,0,0,0,"F","Serviço","Serviço","4.7.0.0.11.","AGETOP",80550,"FIXACAO P/LAVATORIO (PAR)","PAR   ",2,1,null,null,null,null,null,""]
["S",2,"S",0,4,7,0,0,0,0,0,"F","Serviço","Serviço","4.7.0.0.12.","SINAPI",86885,"ENGATE FLEXÍVEL EM PLÁSTICO BRANCO, 1/2\" X 40CM - FORNECIMENTO E INSTALAÇÃO. AF_12/2013","UN",2,1,null,null,null,null,null,""]
["S",2,"S",0,4,7,0,0,0,0,0,"F","Serviço","Serviço","4.7.0.0.13.","SINAPI",86883,"SIFÃO DO TIPO FLEXÍVEL EM PVC 1\u0094 X 1.1/2\u0094 - FORNECIMENTO E INSTALAÇÃO. AF_12/2013","UN",2,1,null,null,null,null,null,""]
["S",2,"S",0,4,7,0,0,0,0,0,"F","Serviço","Serviço","4.7.0.0.14.","SINAPI",86906,"TORNEIRA CROMADA DE MESA, 1/2\" OU 3/4\", PARA LAVATÓRIO, PADRÃO POPULAR - FORNECIMENTO E INSTALAÇÃO. AF_12/2013","UN",2,1,null,null,null,null,null,""]
["S",2,"S",0,4,7,0,0,0,0,0,"F","Serviço","Serviço","4.7.0.0.15.","AGETOP",80580,"VALVULA P/LAVATORIO OU BEBEDOURO METALICO DIAMETRO 1\"","Un    ",2,1,null,null,null,null,null,""]
["S",2,"S",0,4,7,0,0,0,0,0,"F","Serviço","Serviço","4.7.0.0.16.","SINAPI",86911,"TORNEIRA CROMADA LONGA, DE PAREDE, 1/2\" OU 3/4\", PARA PIA DE COZINHA, PADRÃO POPULAR - FORNECIMENTO E INSTALAÇÃO. AF_12/2013","UN",5,1,null,null,null,null,null,""]
["S",2,"S",0,4,7,0,0,0,0,0,"F","Serviço","Serviço","4.7.0.0.17.","AGETOP",80671,"SIFAO PVC P/PIA 1.1/2\" X 2\"","Un    ",5,1,null,null,null,null,null,""]
["S",2,"S",0,4,7,0,0,0,0,0,"F","Serviço","Serviço","4.7.0.0.18.","SINAPI",86878,"VÁLVULA EM METAL CROMADO TIPO AMERICANA 3.1/2\" X 1.1/2\" PARA PIA - FORNECIMENTO E INSTALAÇÃO. AF_12/2013","UN",5,1,null,null,null,null,null,""]
["S",2,"S",0,4,7,0,0,0,0,0,"F","Serviço","Serviço","4.7.0.0.19.","AGETOP",80687,"CUBA INOX 35X40X15CM E=0,6MM-AÇO 304 (CUBA Nº 3)","Un    ",4,1,null,null,null,null,null,""]
["S",2,"S",0,4,7,0,0,0,0,0,"F","Serviço","Serviço","4.7.0.0.20.","AGETOP",80693,"TANQUE (PANELAO) INOX 60 X 70 X 40 CM CH.18","Un    ",1,1,null,null,null,null,null,""]
["S",2,"S",0,4,7,0,0,0,0,0,"F","Serviço","Serviço","4.7.0.0.21.","AGETOP",80819,"SIFÃO METÁLICO PARA TANQUE DE 1 1/4\" X 1 1/2\"","un    ",1,1,null,null,null,null,null,""]
["S",2,"S",0,4,7,0,0,0,0,0,"F","Serviço","Serviço","4.7.0.0.22.","AGETOP",80830,"VALVULA P/TANQUE METALICA DIAM.1\" S/LADRAO","Un    ",1,1,null,null,null,null,null,""]
["S",2,"S",0,4,7,0,0,0,0,0,"F","Serviço","Serviço","4.7.0.0.23.","AGETOP",81846,"CAIXA DE GORDURA E INSPEÇÃO EM PVC/ABS 19 LITROS COM TAMPA E PORTA TAMPA E CESTO DE LIMPEZA REMOVÍVEL","un    ",1,1,null,null,null,null,null,""]
["S",2,"S",0,4,7,0,0,0,0,0,"F","Serviço","Serviço","4.7.0.0.24.","SINAPI",94495,"REGISTRO DE GAVETA BRUTO, LATÃO, ROSCÁVEL, 1\u0094, INSTALADO EM RESERVAÇÃO DE ÁGUA DE EDIFICAÇÃO QUE POSSUA RESERVATÓRIO DE FIBRA/FIBROCIMENTO \u0096 FORNECIMENTO E INSTALAÇÃO. AF_06/2016","UN",1,1,null,null,null,null,null,"Referência: AGETOP - 80903"]
["S",2,"S",0,4,7,0,0,0,0,0,"F","Serviço","Serviço","4.7.0.0.25.","SINAPI",89353,"REGISTRO DE GAVETA BRUTO, LATÃO, ROSCÁVEL, 3/4\", FORNECIDO E INSTALADO EM RAMAL DE ÁGUA. AF_12/2014","UN",4,1,null,null,null,null,null,"Referência: AGETOP - 80902"]
["S",2,"S",0,4,7,0,0,0,0,0,"F","Serviço","Serviço","4.7.0.0.26.","SINAPI",95141,"ADAPTADOR COM FLANGES LIVRES, PVC, SOLDÁVEL LONGO, DN  25 MM X 3/4 , INSTALADO EM RESERVAÇÃO DE ÁGUA DE EDIFICAÇÃO QUE POSSUA RESERVATÓRIO DE FIBRA/FIBROCIMENTO    FORNECIMENTO E INSTALAÇÃO. AF_06/2016","UN",14,1,null,null,null,null,null,""]
["S",2,"S",0,4,7,0,0,0,0,0,"F","Serviço","Serviço","4.7.0.0.27.","SINAPI",94785,"ADAPTADOR COM FLANGES LIVRES, PVC, SOLDÁVEL LONGO, DN 32 MM X 1 , INSTALADO EM RESERVAÇÃO DE ÁGUA DE EDIFICAÇÃO QUE POSSUA RESERVATÓRIO DE FIBRA/FIBROCIMENTO   FORNECIMENTO E INSTALAÇÃO. AF_06/2016","UN",2,1,null,null,null,null,null,""]
["S",2,"S",0,4,7,0,0,0,0,0,"F","Serviço","Serviço","4.7.0.0.28.","AGETOP",81504,"SOLUCAO LIMPADORA 1000 CM3","Un    ",5,1,null,null,null,null,null,""]
["S",2,"S",0,4,7,0,0,0,0,0,"F","Serviço","Serviço","4.7.0.0.29.","AGETOP",81663,"CORPO CX. SIFONADA DIAM. 150 X 150 X 50","Un    ",2,1,null,null,null,null,null,""]
["S",2,"S",0,4,7,0,0,0,0,0,"F","Serviço","Serviço","4.7.0.0.30.","SINAPI",89708,"CAIXA SIFONADA, PVC, DN 150 X 185 X 75 MM, JUNTA ELÁSTICA, FORNECIDA E INSTALADA EM RAMAL DE DESCARGA OU EM RAMAL DE ESGOTO SANITÁRIO. AF_12/2014","UN",2,1,null,null,null,null,null,""]
[{"$f":"CHOOSE(1+LOG(1+2*(ORÇAMENTO.Nivel=\"Nível 1\")+4*(ORÇAMENTO.Nivel=\"Nível 2\")+8*(ORÇAMENTO.Nivel=\"Nível 3\")+16*(ORÇAMENTO.Nivel=\"Nível 4\")+32*(ORÇAMENTO.Nivel=\"Serviço\"),2),0,1,2,3,4,\"S\")","v":"S"},2,"S",0,4,7,0,0,{"$f":"IF(AND($C555<=4,$C555<>0),0,IF(AND($C555=\"S\",$Y555>0),OFFSET(I555,-1,0)+1,OFFSET(I555,-1,0)))","v":0},0,0,"F","Serviço","Serviço","4.7.0.0.31.","AGETOP",81771,"GRELHA QUADRADA BRANCA DIAM. 150 MM","Un    ",2,1,null,null,null,null,null,""]
["S",2,"S",0,4,7,0,0,0,0,0,"F","Serviço","Serviço","4.7.0.0.32.","AGETOP",81885,"TERMINAL DE VENTILACAO DIAMETRO 50 MM","Un    ",1,1,null,null,null,null,null,""]
["S",2,"S",0,4,7,0,0,0,{"$f":"IF(OR($C557=\"S\",$C557=0),0,MATCH(0,OFFSET($D557,1,$C557,ROW($C$911)-ROW($C557)),0))","v":0},{"$f":"IF(OR($C557=\"S\",$C557=0),0,MATCH(OFFSET($D557,0,$C557)+1,OFFSET($D557,1,$C557,ROW($C$911)-ROW($C557)),0))","v":0},"F","Serviço","Serviço","4.7.0.0.33.","AGETOP",81831,"CAIXA DE INSPEÇÃO - ALVENARIA DE 1/2 VEZ COM REVESTIMENTO INTERNO EM REBOCO PAULISTA A-14 (COM ADIÇÃO DE IMPERMEABILIZANTE)","m2    ",3,1,null,null,null,null,null,""]
["S",2,"S",0,{"$f":"IF($C558=1,OFFSET(E558,-1,0)+1,OFFSET(E558,-1,0))","v":4},{"$f":"IF($C558=1,0,IF($C558=2,OFFSET(F558,-1,0)+1,OFFSET(F558,-1,0)))","v":7},{"$f":"IF(AND($C558<=2,$C558<>0),0,IF($C558=3,OFFSET(G558,-1,0)+1,OFFSET(G558,-1,0)))","v":0},{"$f":"IF(AND($C558<=3,$C558<>0),0,IF($C558=4,OFFSET(H558,-1,0)+1,OFFSET(H558,-1,0)))","v":0},0,0,0,"F","Serviço","Serviço","4.7.0.0.34.","AGETOP",81825,"CAIXA DE PASSAGEM 60 X 60 CM SEM TAMPA","Un    ",5,1,null,null,null,null,null,""]
["S",2,"S",0,4,7,0,0,0,0,0,"F","Serviço","Serviço","4.7.0.0.35.","AGETOP",81826,"TAMPA EM CONCRETO ARMADO 25 MPA E=5CM PARA A CAIXA DE PASSAGEM 60X60CM","Un    ",5,1,null,null,null,null,null,""]
["S",2,"S",0,4,7,0,0,0,0,0,"F","Serviço","Serviço","4.7.0.0.36.","SINAPI",89402,"TUBO, PVC, SOLDÁVEL, DN 25MM, INSTALADO EM RAMAL DE DISTRIBUIÇÃO DE ÁGUA - FORNECIMENTO E INSTALAÇÃO. AF_12/2014","M",25,1,null,null,null,null,null,"Referência: AGETOP - 81003"]
["S",2,"S",0,4,7,0,0,0,0,0,"F","Serviço","Serviço","4.7.0.0.37.","SINAPI",89403,"TUBO, PVC, SOLDÁVEL, DN 32MM, INSTALADO EM RAMAL DE DISTRIBUIÇÃO DE ÁGUA - FORNECIMENTO E INSTALAÇÃO. AF_12/2014","M",20,1,null,null,null,null,null,"Referência: AGETOP - 81004"]
["S",2,"S",0,4,7,0,0,0,0,0,"F","Serviço","Serviço","4.7.0.0.38.","SINAPI",89617,"TE, PVC, SOLDÁVEL, DN 25MM, INSTALADO EM PRUMADA DE ÁGUA - FORNECIMENTO E INSTALAÇÃO. AF_12/2014","UN",3,1,null,null,null,null,null,""]
["S",2,"S",0,4,7,0,0,0,0,0,"F","Serviço","Serviço","4.7.0.0.39.","SINAPI",89620,"TE, PVC, SOLDÁVEL, DN 32MM, INSTALADO EM PRUMADA DE ÁGUA - FORNECIMENTO E INSTALAÇÃO. AF_12/2014","UN",3,1,null,null,null,null,null,"Referência: AGETOP - 81403"]
["S",{"$f":"IF(OR(C564=\"s\",C564=0),OFFSET(B564,-1,0),C564)","v":2},{"$f":"IF(OFFSET(C564,-1,0)=\"L\",1,IF(OFFSET(C564,-1,0)=1,2,IF(OR(A564=\"s\",A564=0),\"S\",IF(AND(OFFSET(C564,-1,0)=2,A564=4),3,IF(AND(OR(OFFSET(C564,-1,0)=\"s\",OFFSET(C564,-1,0)=0),A564<>\"s\",A564>OFFSET(B564,-1,0)),OFFSET(B564,-1,0),A564)))))","v":"S"},{"$f":"IF(OR(C564=\"S\",C564=0),0,IF(ISERROR(K564),J564,SMALL(J564:K564,1)))","v":0},4,7,0,0,0,0,0,"F","Serviço","Serviço","4.7.0.0.40.","SINAPI",89622,"TÊ DE REDUÇÃO, PVC, SOLDÁVEL, DN 32MM X 25MM, INSTALADO EM PRUMADA DE ÁGUA - FORNECIMENTO E INSTALAÇÃO. AF_12/2014","UN",2,1,null,null,null,null,null,"Referência: AGETOP - 81421"]
["S",2,"S",0,4,7,0,0,0,0,0,"F","Serviço","Serviço","4.7.0.0.41.","SINAPI",89802,"JOELHO 45 GRAUS, PVC, SERIE NORMAL, ESGOTO PREDIAL, DN 50 MM, JUNTA ELÁSTICA, FORNECIDO E INSTALADO EM PRUMADA DE ESGOTO SANITÁRIO OU VENTILAÇÃO. AF_12/2014","UN",7,1,null,null,null,null,null,""]
["S",2,"S",0,4,7,0,0,0,0,0,"F","Serviço","Serviço","4.7.0.0.42.","SINAPI",89724,"JOELHO 90 GRAUS, PVC, SERIE NORMAL, ESGOTO PREDIAL, DN 40 MM, JUNTA SOLDÁVEL, FORNECIDO E INSTALADO EM RAMAL DE DESCARGA OU RAMAL DE ESGOTO SANITÁRIO. AF_12/2014","UN",12,1,null,null,null,null,null,""]
["S",2,"S",0,4,7,0,0,0,0,0,"F","Serviço","Serviço","4.7.0.0.43.","SINAPI",89731,"JOELHO 90 GRAUS, PVC, SERIE NORMAL, ESGOTO PREDIAL, DN 50 MM, JUNTA ELÁSTICA, FORNECIDO E INSTALADO EM RAMAL DE DESCARGA OU RAMAL DE ESGOTO SANITÁRIO. AF_12/2014","UN",3,1,null,null,null,null,null,""]
["S",2,"S",0,4,7,0,0,0,0,0,"F","Serviço","Serviço","4.7.0.0.44.","AGETOP",81973,"JUNCAO SIMPLES DIAM. 100 X 50 MM","Un    ",1,1,null,null,null,null,null,""]
["S",2,"S",0,4,7,0,0,0,0,0,"F","Serviço","Serviço","4.7.0.0.45.","SINAPI",89834,"JUNÇÃO SIMPLES, PVC, SERIE NORMAL, ESGOTO PREDIAL, DN 100 X 100 MM, JUNTA ELÁSTICA, FORNECIDO E INSTALADO EM PRUMADA DE ESGOTO SANITÁRIO OU VENTILAÇÃO. AF_12/2014","UN",1,1,null,null,null,null,null,""]
["S",2,"S",0,4,7,0,0,0,0,0,"F","Serviço","Serviço","4.7.0.0.46.","AGETOP",81981,"JUNÇÃO DUPLA DIAMETRO 75 MM","Un    ",1,1,null,null,null,null,null,""]
["S",2,"S",0,4,7,0,0,0,0,0,"F","Serviço","Serviço","4.7.0.0.47.","SINAPI",89753,"LUVA SIMPLES, PVC, SERIE NORMAL, ESGOTO PREDIAL, DN 50 MM, JUNTA ELÁSTICA, FORNECIDO E INSTALADO EM RAMAL DE DESCARGA OU RAMAL DE ESGOTO SANITÁRIO. AF_12/2014","UN",8,1,null,null,null,null,null,"Referência: AGETOP - 82002"]
["S",2,"S",0,4,7,0,0,0,0,0,"F","Serviço","Serviço","4.7.0.0.48.","SINAPI",89778,"LUVA SIMPLES, PVC, SERIE NORMAL, ESGOTO PREDIAL, DN 100 MM, JUNTA ELÁSTICA, FORNECIDO E INSTALADO EM RAMAL DE DESCARGA OU RAMAL DE ESGOTO SANITÁRIO. AF_12/2014","UN",2,1,null,null,null,null,null,"Referência: AGETOP - 82004"]
["S",2,"S",0,4,7,0,0,0,0,0,"F","Serviço","Serviço","4.7.0.0.49.","AGETOP",82051,"PORTA GRELHA QUADRADA BRANCO DIAM. 150 MM","Un    ",2,1,null,null,null,null,null,""]
["S",2,"S",0,4,7,0,0,0,0,0,"F","Serviço","Serviço","4.7.0.0.50.","AGETOP",82103,"REDUCAO EXCENTRICA 100 X 50 MM","Un    ",1,1,null,null,null,null,null,""]
["S",2,"S",0,4,7,0,0,0,0,0,"F","Serviço","Serviço","4.7.0.0.51.","AGETOP",82233,"TE SANITARIO DIAMETRO 100 X 50 MM","Un    ",1,1,null,null,null,null,null,""]
["S",2,"S",0,4,7,0,0,0,0,0,"F","Serviço","Serviço","4.7.0.0.52.","SINAPI",89711,"TUBO PVC, SERIE NORMAL, ESGOTO PREDIAL, DN 40 MM, FORNECIDO E INSTALADO EM RAMAL DE DESCARGA OU RAMAL DE ESGOTO SANITÁRIO. AF_12/2014","M",14,1,null,null,null,null,null,"Referência: AGETOP - 82301"]
["S",2,"S",0,4,7,0,0,0,0,0,"F","Serviço","Serviço","4.7.0.0.53.","SINAPI",89712,"TUBO PVC, SERIE NORMAL, ESGOTO PREDIAL, DN 50 MM, FORNECIDO E INSTALADO EM RAMAL DE DESCARGA OU RAMAL DE ESGOTO SANITÁRIO. AF_12/2014","M",26,1,null,null,null,null,null,"Referência: AGETOP - 82302"]
["S",2,"S",0,4,7,0,0,0,0,0,"F","Serviço","Serviço","4.7.0.0.54.","AGETOP",82374,"TUBO FERRO GALVANIZADO DIAM.3/4\"","m     ",10,1,null,null,null,null,null,""]
["S",2,"S",0,4,7,0,0,0,0,0,"F","Serviço","Serviço","4.7.0.0.55.","SINAPI",83635,"EXTINTOR INCENDIO TP PO QUIMICO 6KG - FORNECIMENTO E INSTALACAO","UN",1,1,null,null,null,null,null,""]
["S",2,"S",0,4,7,0,0,0,0,0,"F","Serviço","Serviço","4.7.0.0.56.","SINAPI",96702,"BUCHA DE REDUÇÃO, PPR, 32 X 25, CLASSE PN 25, INSTALADO EM PRUMADA DE ÁGUA \u0096 FORNECIMENTO E INSTALAÇÃO . AF_06/2015","UN",25,1,null,null,null,null,null,""]
["S",2,"S",0,4,7,0,0,0,0,0,"F","Serviço","Serviço","4.7.0.0.57.","SINAPI",94672,"JOELHO 90 GRAUS COM BUCHA DE LATÃO, PVC, SOLDÁVEL, DN  25 MM, X 3/4\u0094 INSTALADO EM RESERVAÇÃO DE ÁGUA DE EDIFICAÇÃO QUE POSSUA RESERVATÓRIO DE FIBRA/FIBROCIMENTO   FORNECIMENTO E INSTALAÇÃO. AF_06/2016","UN",6,1,null,null,null,null,null,""]
["S",2,"S",0,4,7,0,0,0,0,0,"F","Serviço","Serviço","4.7.0.0.58.","SINAPI",89362,"JOELHO 90 GRAUS, PVC, SOLDÁVEL, DN 25MM, INSTALADO EM RAMAL OU SUB-RAMAL DE ÁGUA - FORNECIMENTO E INSTALAÇÃO. AF_12/2014","UN",6,1,null,null,null,null,null,"Referência: AGETOP - 81321"]
["S",2,"S",0,4,7,0,0,0,0,0,"F","Serviço","Serviço","4.7.0.0.59.","SINAPI",89546,"BUCHA DE REDUÇÃO LONGA, PVC, SERIE R, ÁGUA PLUVIAL, DN 50 X 40 MM, JUNTA ELÁSTICA, FORNECIDO E INSTALADO EM RAMAL DE ENCAMINHAMENTO. AF_12/2014","UN",6,1,null,null,null,null,null,""]
[2,2,2,5,4,8,0,0,0,50,5,"F","Nível 2","Nível 2","4.8.",null,null,"ALVENARIAS E DIVISÓRIAS","-",null,1,null,null,null,null,null,""]
["S",2,"S",0,4,8,0,0,0,0,0,"F","Serviço","Serviço","4.8.0.0.1.","SINAPI","73937/1","COBOGO DE CONCRETO (ELEMENTO VAZADO), 7X50X50CM, ASSENTADO COM ARGAMASSA TRACO 1:4 (CIMENTO E AREIA)","M2",16.3,1,null,null,null,null,null,"Referência: AGETOP - 100501"]
["S",2,"S",0,4,8,0,0,0,0,0,"F","Serviço","Serviço","4.8.0.0.2.","SINAPI",72132,"ALVENARIA EM TIJOLO CERAMICO MACICO 5X10X20CM 1/2 VEZ (ESPESSURA 10CM), ASSENTADO COM ARGAMASSA TRACO 1:2:8 (CIMENTO, CAL E AREIA)","M2",17.11,1,null,null,null,null,null,""]
["S",2,"S",0,4,8,0,0,0,0,0,"F","Serviço","Serviço","4.8.0.0.3.","SINAPI",87489,"ALVENARIA DE VEDAÇÃO DE BLOCOS CERÂMICOS FURADOS NA VERTICAL DE 9X19X39CM (ESPESSURA 9CM) DE PAREDES COM ÁREA LÍQUIDA MAIOR OU IGUAL A 6M² COM VÃOS E ARGAMASSA DE ASSENTAMENTO COM PREPARO EM BETONEIRA. AF_06/2014","M2",142.08000000000001,1,null,null,null,null,null,""]
["S",2,"S",0,4,8,0,0,0,0,0,"F","Serviço","Serviço","4.8.0.0.4.","SINAPI",93202,"FIXAÇÃO (ENCUNHAMENTO) DE ALVENARIA DE VEDAÇÃO COM TIJOLO MACIÇO. AF_03/2016","M",27,1,null,null,null,null,null,"Referência: AGETOP - 100204"]
[2,2,2,2,4,9,0,0,0,45,2,"F","Nível 2","Nível 2","4.9.",null,null,"IMPERMEABILIZAÇÃO","-",null,1,null,null,null,null,null,""]
["S",2,"S",0,4,9,0,0,0,0,0,"F","Serviço","Serviço","4.9.0.0.1.","SINAPI",98562,"IMPERMEABILIZAÇÃO DE FLOREIRA OU VIGA BALDRAME COM ARGAMASSA DE CIMENTO E AREIA, COM ADITIVO IMPERMEABILIZANTE, E = 2 CM. AF_06/2018","M2",43.03,1,null,null,null,null,null,"Referência: AGETOP - 120902"]
[2,2,2,2,4,10,0,0,0,43,2,"F","Nível 2","Nível 2","4.10.",null,null,"ESTRUTURAS METÁLICAS","-",null,1,null,null,null,null,null,""]
["S",2,"S",0,4,10,0,0,0,0,0,"F","Serviço","Serviço","4.10.0.0.1.","AGETOP",150103,"ESTRUTURA METÁLICA CONVENCIONAL EM AÇO DO TIPO USI SAC-300 COM FUNDO ANTICORROSIVO","Kg    ",1956.5,1,null,null,null,null,null,""]
[2,2,2,6,4,11,0,0,0,41,6,"F","Nível 2","Nível 2","4.11.",null,null,"COBERTURAS","-",null,1,null,null,null,null,null,""]
[3,3,3,5,4,11,1,0,0,5,22,"F","Nível 3","Nível 3","4.11.1.",null,null,"CERÂMICA","-",null,1,null,null,null,null,null,""]
["S",3,"S",0,4,11,1,0,0,0,0,"F","Serviço","Serviço","4.11.1.0.1.","SINAPI",94445,"TELHAMENTO COM TELHA CERÂMICA CAPA-CANAL, TIPO PLAN, COM ATÉ 2 ÁGUAS, INCLUSO TRANSPORTE VERTICAL. AF_07/2019","M2",182.07,1,null,null,null,null,null,"Referência: AGETOP - 160401"]
["S",3,"S",0,4,11,1,0,0,0,0,"F","Serviço","Serviço","4.11.1.0.2.","SINAPI",94221,"CUMEEIRA PARA TELHA CERÂMICA EMBOÇADA COM ARGAMASSA TRAÇO 1:2:9 (CIMENTO, CAL E AREIA) PARA TELHADOS COM ATÉ 2 ÁGUAS, INCLUSO TRANSPORTE VERTICAL. AF_07/2019","M",17.68,1,null,null,null,null,null,""]
["S",3,"S",0,4,11,1,0,0,0,0,"F","Serviço","Serviço","4.11.1.0.3.","SINAPI",94224,"EMBOÇAMENTO COM ARGAMASSA TRAÇO 1:2:9 (CIMENTO, CAL E AREIA). AF_07/2019","M",20.399999999999999,1,null,null,null,null,null,"Referência: AGETOP - 160403"]
["S",3,"S",0,4,11,1,0,0,0,0,"F","Serviço","Serviço","4.11.1.0.4.","SINAPI",94224,"EMBOÇAMENTO COM ARGAMASSA TRAÇO 1:2:9 (CIMENTO, CAL E AREIA). AF_07/2019","M",35.36,1,null,null,null,null,null,"Referência: AGETOP - 160403"]
[2,2,2,5,4,12,0,0,0,35,5,"F","Nível 2","Nível 2","4.12.",null,null,"ESQUADRIAS METÁLICAS","-",null,1,null,null,null,null,null,""]
["S",2,"S",0,4,12,0,0,0,0,0,"F","Serviço","Serviço","4.12.0.0.1.","SINAPI",94570,"JANELA DE ALUMÍNIO DE CORRER, 2 FOLHAS, FIXAÇÃO COM PARAFUSO SOBRE CONTRAMARCO (EXCLUSIVE CONTRAMARCO), COM VIDROS PADRONIZADA. AF_07/2016","M2",5.52,1,null,null,null,null,null,""]
["S",2,"S",0,4,12,0,0,0,0,0,"F","Serviço","Serviço","4.12.0.0.2.","SINAPI","74136/3","PORTA DE ACO CHAPA 24, DE ENROLAR, RAIADA, LARGA COM ACABAMENTO GALVANIZADO NATURAL","M2",5.74,1,null,null,null,null,null,"Referência: AGETOP - 180303"]
["S",2,"S",0,4,12,0,0,0,0,0,"F","Serviço","Serviço","4.12.0.0.3.","SINAPI","73933/4","PORTA DE FERRO DE ABRIR TIPO BARRA CHATA, COM REQUADRO E GUARNICAO COMPLETA","M2",8.64,1,null,null,null,null,null,"Referência: AGETOP - 180501"]
["S",2,"S",0,4,12,0,0,0,0,0,"F","Serviço","Serviço","4.12.0.0.4.","AGETOP",180307,"PORTAO /CHAPA TRAPEZ / TUBO DE ACO PT-5 C/FERRAGEM","m2    ",4,1,null,null,null,null,null,""]
[2,2,2,2,4,13,0,0,0,30,2,"","Nível 2","Nível 2","-",null,null,"VIDROS","-",null,1,null,null,null,null,null,""]
["S",2,"S",0,4,13,0,0,0,0,0,"","Serviço","Serviço","-","SINAPI",72117,"VIDRO LISO COMUM TRANSPARENTE, ESPESSURA 4MM","M2",null,1,null,null,null,null,null,"Referência: AGETOP - 190102"]
[2,2,2,4,4,14,0,0,0,28,4,"F","Nível 2","Nível 2","4.14.",null,null,"REVESTIMENTO DE PAREDE","-",null,1,null,null,null,null,null,""]
["S",2,"S",0,4,14,0,0,0,0,0,"F","Serviço","Serviço","4.14.0.0.1.","SINAPI",87553,"EMBOÇO, PARA RECEBIMENTO DE CERÂMICA, EM ARGAMASSA TRAÇO 1:2:8, PREPARO MECÂNICO COM BETONEIRA 400L, APLICADO MANUALMENTE EM FACES INTERNAS DE PAREDES, PARA AMBIENTE COM ÁREA MAIOR QUE 10M2, ESPESSURA DE 10MM, COM EXECUÇÃO DE TALISCAS. AF_06/2014","M2",186.65,1,null,null,null,null,null,""]
["S",2,"S",0,4,14,0,0,0,0,0,"F","Serviço","Serviço","4.14.0.0.2.","SINAPI",87904,"CHAPISCO APLICADO EM ALVENARIA (COM PRESENÇA DE VÃOS) E ESTRUTURAS DE CONCRETO DE FACHADA, COM COLHER DE PEDREIRO.  ARGAMASSA TRAÇO 1:3 COM PREPARO MANUAL. AF_06/2014","M2",284.16000000000003,1,null,null,null,null,null,"Referência: AGETOP - 200101"]
["S",2,"S",0,4,14,0,0,0,0,0,"F","Serviço","Serviço","4.14.0.0.3.","SINAPI",87273,"REVESTIMENTO CERÂMICO PARA PAREDES INTERNAS COM PLACAS TIPO ESMALTADA EXTRA DE DIMENSÕES 33X45 CM APLICADAS EM AMBIENTES DE ÁREA MAIOR QUE 5 M² NA ALTURA INTEIRA DAS PAREDES. AF_06/2014","M2",127.56500000000001,1,null,null,null,null,null,""]
[2,2,2,3,4,15,0,0,0,24,3,"F","Nível 2","Nível 2","4.15.",null,null,"FORROS","-",null,1,null,null,null,null,null,""]
["S",2,"S",0,4,15,0,0,0,0,0,"F","Serviço","Serviço","4.15.0.0.1.","SINAPI",87884,"CHAPISCO APLICADO NO TETO, COM ROLO PARA TEXTURA ACRÍLICA. ARGAMASSA INDUSTRIALIZADA COM PREPARO MANUAL. AF_06/2014","M2",40.75,1,null,null,null,null,null,"Referência: AGETOP - 210102"]
["S",2,"S",0,4,15,0,0,0,0,0,"F","Serviço","Serviço","4.15.0.0.2.","SINAPI",90408,"MASSA ÚNICA, PARA RECEBIMENTO DE PINTURA, EM ARGAMASSA TRAÇO 1:2:8, PREPARO MECÂNICO COM BETONEIRA 400L, APLICADA MANUALMENTE EM TETO, ESPESSURA DE 10MM, COM EXECUÇÃO DE TALISCAS. AF_03/2015","M2",40.75,1,null,null,null,null,null,"Referência: AGETOP - 210401"]
[2,2,2,8,4,16,0,0,0,21,8,"F","Nível 2","Nível 2","4.16.",null,null,"REVESTIMENTO DE PISO","-",null,1,null,null,null,null,null,""]
[3,3,3,2,4,16,1,0,0,7,2,"F","Nível 3","Nível 3","4.16.1.",null,null,"LASTRO","-",null,1,null,null,null,null,null,""]
["S",3,"S",0,4,16,1,0,0,0,0,"F","Serviço","Serviço","4.16.1.0.1.","AGETOP",220101,"LASTRO DE CONCRETO REGULARIZADO IMPERMEABILIZADO 1:3:6 ESP=5CM (BASE)","m2    ",139.75,1,null,null,null,null,null,""]
[3,3,3,3,4,16,2,0,0,5,3,"F","Nível 3","Nível 3","4.16.2.",null,null,"GRANITINA ","-",null,1,null,null,null,null,null,""]
["S",3,"S",0,4,16,2,0,0,0,0,"F","Serviço","Serviço","4.16.2.0.1.","SINAPI",84191,"PISO EM GRANILITE, MARMORITE OU GRANITINA ESPESSURA 8 MM, INCLUSO JUNTAS DE DILATACAO PLASTICAS","M2",144.74029999999999,1,null,null,null,null,null,"Referência: AGETOP - 221101"]
["S",3,"S",0,4,16,2,0,0,0,0,"F","Serviço","Serviço","4.16.2.0.2.","AGETOP",221104,"RASPAGEM E APLICAÇÃO RESINA ACRÍLICA DUAS DEMÃOS","m2    ",144.74029999999999,1,null,null,null,null,null,""]
[{"$f":"CHOOSE(1+LOG(1+2*(ORÇAMENTO.Nivel=\"Nível 1\")+4*(ORÇAMENTO.Nivel=\"Nível 2\")+8*(ORÇAMENTO.Nivel=\"Nível 3\")+16*(ORÇAMENTO.Nivel=\"Nível 4\")+32*(ORÇAMENTO.Nivel=\"Serviço\"),2),0,1,2,3,4,\"S\")","v":3},3,3,2,4,16,3,0,{"$f":"IF(AND($C619<=4,$C619<>0),0,IF(AND($C619=\"S\",$Y619>0),OFFSET(I619,-1,0)+1,OFFSET(I619,-1,0)))","v":0},2,166,"F","Nível 3","Nível 3","4.16.3.",null,null,"PASSEIO (CALÇADA)","-",null,1,null,null,null,null,null,""]
["S",3,"S",0,4,16,3,0,0,0,0,"F","Serviço","Serviço","4.16.3.0.1.","AGETOP",220100,"PASSEIO PROTECAO EM CONC.DESEMPEN.5 CM 1:2,5:3,5 ( INCLUSO ESPELHO DE 30CM/ESCAVAÇÃO/REATERRO/APILOAMENTO/ATERRO INTERNO)","m2    ",35.04,1,null,null,null,null,null,""]
[2,2,2,2,4,17,0,0,0,{"$f":"IF(OR($C621=\"S\",$C621=0),0,MATCH(0,OFFSET($D621,1,$C621,ROW($C$911)-ROW($C621)),0))","v":13},{"$f":"IF(OR($C621=\"S\",$C621=0),0,MATCH(OFFSET($D621,0,$C621)+1,OFFSET($D621,1,$C621,ROW($C$911)-ROW($C621)),0))","v":2},"F","Nível 2","Nível 2","4.17.",null,null,"MARCENARIA","-",null,1,null,null,null,null,null,""]
["S",2,"S",0,{"$f":"IF($C622=1,OFFSET(E622,-1,0)+1,OFFSET(E622,-1,0))","v":4},{"$f":"IF($C622=1,0,IF($C622=2,OFFSET(F622,-1,0)+1,OFFSET(F622,-1,0)))","v":17},{"$f":"IF(AND($C622<=2,$C622<>0),0,IF($C622=3,OFFSET(G622,-1,0)+1,OFFSET(G622,-1,0)))","v":0},{"$f":"IF(AND($C622<=3,$C622<>0),0,IF($C622=4,OFFSET(H622,-1,0)+1,OFFSET(H622,-1,0)))","v":0},0,0,0,"F","Serviço","Serviço","4.17.0.0.1.","AGETOP",240209,"PRATELEIRA EST.CAIBRO 4+1 TABUAS APARELHADAS E ENVERNIZADAS","m     ",3.2,1,null,null,null,null,null,""]
[2,2,2,8,4,18,0,0,0,11,8,"F","Nível 2","Nível 2","4.18.",null,null,"PINTURA","-",null,1,null,null,null,null,null,""]
[3,3,3,7,4,18,1,0,0,7,71,"F","Nível 3","Nível 3","4.18.1.",null,null,"ESMALTE SINTÉTICO","-",null,1,null,null,null,null,null,""]
["S",3,"S",0,4,18,1,0,0,0,0,"F","Serviço","Serviço","4.18.1.0.1.","SINAPI",88497,"APLICAÇÃO E LIXAMENTO DE MASSA LÁTEX EM PAREDES, DUAS DEMÃOS. AF_06/2014","M2",128,1,null,null,null,null,null,"Referência: AGETOP - 261300"]
["S",3,"S",0,4,18,1,0,0,0,0,"F","Serviço","Serviço","4.18.1.0.2.","SINAPI",88486,"APLICAÇÃO MANUAL DE PINTURA COM TINTA LÁTEX PVA EM TETO, DUAS DEMÃOS. AF_06/2014","M2",40.75,1,null,null,null,null,null,"Referência: AGETOP - 261307"]
["S",3,"S",0,4,18,1,0,0,0,0,"F","Serviço","Serviço","4.18.1.0.3.","AGETOP",261550,"PINT.ESMALTE SINT.PAREDES - 2 DEM.C/SELADOR","m2    ",87.25,1,null,null,null,null,null,""]
["S",{"$f":"IF(OR(C628=\"s\",C628=0),OFFSET(B628,-1,0),C628)","v":3},{"$f":"IF(OFFSET(C628,-1,0)=\"L\",1,IF(OFFSET(C628,-1,0)=1,2,IF(OR(A628=\"s\",A628=0),\"S\",IF(AND(OFFSET(C628,-1,0)=2,A628=4),3,IF(AND(OR(OFFSET(C628,-1,0)=\"s\",OFFSET(C628,-1,0)=0),A628<>\"s\",A628>OFFSET(B628,-1,0)),OFFSET(B628,-1,0),A628)))))","v":"S"},{"$f":"IF(OR(C628=\"S\",C628=0),0,IF(ISERROR(K628),J628,SMALL(J628:K628,1)))","v":0},4,18,1,0,0,0,0,"F","Serviço","Serviço","4.18.1.0.4.","SINAPI",88489,"APLICAÇÃO MANUAL DE PINTURA COM TINTA LÁTEX ACRÍLICA EM PAREDES, DUAS DEMÃOS. AF_06/2014","M2",87.25,1,null,null,null,null,null,"Referência: AGETOP - 261001"]
["S",3,"S",0,4,18,1,0,0,0,0,"F","Serviço","Serviço","4.18.1.0.5.","SINAPI","74145/1","PINTURA ESMALTE FOSCO, DUAS DEMAOS, SOBRE SUPERFICIE METALICA, INCLUSO UMA DEMAO DE FUNDO ANTICORROSIVO. UTILIZACAO DE REVOLVER ( AR-COMPRIMIDO).","M2",87.25,1,null,null,null,null,null,"Referência: AGETOP - 261602"]
["S",3,"S",0,4,18,1,0,0,0,0,"F","Serviço","Serviço","4.18.1.0.6.","SINAPI","74145/1","PINTURA ESMALTE FOSCO, DUAS DEMAOS, SOBRE SUPERFICIE METALICA, INCLUSO UMA DEMAO DE FUNDO ANTICORROSIVO. UTILIZACAO DE REVOLVER ( AR-COMPRIMIDO).","M2",364.14,1,null,null,null,null,null,"Referência: AGETOP - 261602"]
[2,2,2,3,4,19,0,0,0,3,{"$error":"#N/A"},"F","Nível 2","Nível 2","4.19.",null,null,"DIVERSOS","-",null,1,null,null,null,null,null,""]
["S",2,"S",0,4,19,0,0,0,0,0,"F","Serviço","Serviço","4.19.0.0.1.","AGETOP",270501,"LIMPEZA FINAL DE OBRA - (OBRAS CIVIS)","m2    ",139.75,1,null,null,null,null,null,""]
["S",2,"S",0,4,19,0,0,0,0,0,"F","Serviço","Serviço","4.19.0.0.2.","AGETOP",271608,"BANCADA DE GRANITO C/ESPELHO","m2    ",6.8250000000000002,1,null,null,null,null,null,""]
[1,1,1,111,5,0,0,0,0,277,111,"F","Nível 1","Nível 1","5.","SINAPI",null,"PÁTIO MULTIUSO 3","UN",2,2,null,null,null,null,null,""]
[2,2,2,2,5,1,0,0,0,110,2,"F","Nível 2","Nível 2","5.1.","SINAPI",null,"SERVIÇOS PRELIMINARES","-",null,2,null,null,null,null,null,""]
["S",2,"S",0,5,1,0,0,0,0,0,"F","Serviço","Serviço","5.1.0.0.1.","SINAPI",99059,"LOCACAO CONVENCIONAL DE OBRA, UTILIZANDO GABARITO DE TÁBUAS CORRIDAS PONTALETADAS A CADA 2,00M -  2 UTILIZAÇÕES. AF_10/2018","M",133.97999999999999,2,null,null,null,null,null,""]
[2,2,2,2,5,2,0,0,0,108,2,"F","Nível 2","Nível 2","5.2.","SINAPI",null,"TRANSPORTES","-",null,2,null,null,null,null,null,""]
["S",2,"S",0,5,2,0,0,0,0,0,"F","Serviço","Serviço","5.2.0.0.1.","SINAPI",72897,"CARGA MANUAL DE ENTULHO EM CAMINHAO BASCULANTE 6 M3","M3",12,2,null,null,null,null,null,""]
[{"$f":"CHOOSE(1+LOG(1+2*(ORÇAMENTO.Nivel=\"Nível 1\")+4*(ORÇAMENTO.Nivel=\"Nível 2\")+8*(ORÇAMENTO.Nivel=\"Nível 3\")+16*(ORÇAMENTO.Nivel=\"Nível 4\")+32*(ORÇAMENTO.Nivel=\"Serviço\"),2),0,1,2,3,4,\"S\")","v":2},{"$f":"IF(OR(C639=\"s\",C639=0),OFFSET(B639,-1,0),C639)","v":2},{"$f":"IF(OFFSET(C639,-1,0)=\"L\",1,IF(OFFSET(C639,-1,0)=1,2,IF(OR(A639=\"s\",A639=0),\"S\",IF(AND(OFFSET(C639,-1,0)=2,A639=4),3,IF(AND(OR(OFFSET(C639,-1,0)=\"s\",OFFSET(C639,-1,0)=0),A639<>\"s\",A639>OFFSET(B639,-1,0)),OFFSET(B639,-1,0),A639)))))","v":2},{"$f":"IF(OR(C639=\"S\",C639=0),0,IF(ISERROR(K639),J639,SMALL(J639:K639,1)))","v":8},{"$f":"IF($C639=1,OFFSET(E639,-1,0)+1,OFFSET(E639,-1,0))","v":5},{"$f":"IF($C639=1,0,IF($C639=2,OFFSET(F639,-1,0)+1,OFFSET(F639,-1,0)))","v":3},{"$f":"IF(AND($C639<=2,$C639<>0),0,IF($C639=3,OFFSET(G639,-1,0)+1,OFFSET(G639,-1,0)))","v":0},{"$f":"IF(AND($C639<=3,$C639<>0),0,IF($C639=4,OFFSET(H639,-1,0)+1,OFFSET(H639,-1,0)))","v":0},{"$f":"IF(AND($C639<=4,$C639<>0),0,IF(AND($C639=\"S\",$Y639>0),OFFSET(I639,-1,0)+1,OFFSET(I639,-1,0)))","v":0},106,8,"F","Nível 2","Nível 2","5.3.","SINAPI",null,"SERVIÇO EM TERRA","-",null,2,null,null,null,null,null,""]
["S",2,"S",0,5,3,0,0,0,0,0,"F","Serviço","Serviço","5.3.0.0.1.","SINAPI",93358,"ESCAVAÇÃO MANUAL DE VALA COM PROFUNDIDADE MENOR OU IGUAL A 1,30 M. AF_03/2016","M3",3,2,null,null,null,null,null,"Referência: AGETOP - 40101"]
["S",2,"S",0,5,3,0,0,0,0,0,"F","Serviço","Serviço","5.3.0.0.2.","SINAPI",96995,"REATERRO MANUAL APILOADO COM SOQUETE. AF_10/2017","M3",1.5,2,null,null,null,null,null,"Referência: AGETOP - 40902"]
["S",2,"S",0,5,3,0,0,0,0,0,"F","Serviço","Serviço","5.3.0.0.3.","SINAPI",79480,"ESCAVACAO MECANICA CAMPO ABERTO EM SOLO EXCETO ROCHA ATE 2,00M PROFUNDIDADE","M3",33.75,2,null,null,null,null,null,"Referência: AGETOP - 41004"]
["S",2,"S",0,5,3,0,0,0,0,0,"F","Serviço","Serviço","5.3.0.0.4.","SINAPI",72898,"CARGA E DESCARGA MECANIZADAS DE ENTULHO EM CAMINHAO BASCULANTE 6 M3","M3",33.75,2,null,null,null,null,null,"Referência: AGETOP - 41005"]
["S",2,"S",0,5,3,0,0,0,0,0,"F","Serviço","Serviço","5.3.0.0.5.","AGETOP",41012,"INDENIZAÇÃO DE JAZIDA","m3    ",33.75,2,null,null,null,null,null,""]
["S",2,"S",0,5,3,0,0,0,0,0,"F","Serviço","Serviço","5.3.0.0.6.","AGETOP",41006,"TRANSPORTE DE MATERIAL ESCAVADO M3.KM","m3km  ",135,2,null,null,null,null,null,""]
["S",2,"S",0,5,3,0,0,0,0,0,"F","Serviço","Serviço","5.3.0.0.7.","SINAPI","74005/2","COMPACTACAO MECANICA C/ CONTROLE DO GC>=95% DO PN (AREAS) (C/MONIVELADORA 140 HP E ROLO COMPRESSOR VIBRATORIO 80 HP)","M3",27,2,null,null,null,null,null,"Referência: AGETOP - 41008"]
[2,2,2,11,5,4,0,0,0,98,11,"F","Nível 2","Nível 2","5.4.","SINAPI",null,"FUNDAÇÕES E SONDAGENS","-",null,2,null,null,null,null,null,""]
["S",2,"S",0,5,4,0,0,0,0,0,"F","Serviço","Serviço","5.4.0.0.1.","SINAPI",98230,"ESTACA BROCA DE CONCRETO, DIÂMETRO DE 30 CM, PROFUNDIDADE DE ATÉ 3 M, ESCAVAÇÃO MANUAL COM TRADO CONCHA, NÃO ARMADA. AF_03/2018","M",49,2,null,null,null,null,null,"Referência: AGETOP - 50302"]
["S",2,"S",0,5,4,0,0,0,0,0,"F","Serviço","Serviço","5.4.0.0.2.","SINAPI",96521,"ESCAVAÇÃO MECANIZADA PARA BLOCO DE COROAMENTO OU SAPATA, COM PREVISÃO DE FÔRMA, COM RETROESCAVADEIRA. AF_06/2017","M3",4.8600000000000003,2,null,null,null,null,null,""]
["S",2,"S",0,5,4,0,0,0,0,0,"F","Serviço","Serviço","5.4.0.0.3.","SINAPI",93382,"REATERRO MANUAL DE VALAS COM COMPACTAÇÃO MECANIZADA. AF_04/2016","M3",0.36,2,null,null,null,null,null,"Referência: AGETOP - 40904"]
["S",2,"S",0,5,4,0,0,0,0,0,"F","Serviço","Serviço","5.4.0.0.4.","SINAPI",96534,"FABRICAÇÃO, MONTAGEM E DESMONTAGEM DE FÔRMA PARA BLOCO DE COROAMENTO, EM MADEIRA SERRADA, E=25 MM, 4 UTILIZAÇÕES. AF_06/2017","M2",4.5,2,null,null,null,null,null,"Referência: AGETOP - 51009"]
["S",2,"S",0,5,4,0,0,0,0,0,"F","Serviço","Serviço","5.4.0.0.5.","SINAPI",94963,"CONCRETO FCK = 15MPA, TRAÇO 1:3,4:3,5 (CIMENTO/ AREIA MÉDIA/ BRITA 1)  - PREPARO MECÂNICO COM BETONEIRA 400 L. AF_07/2016","M3",0.23,2,null,null,null,null,null,""]
["S",2,"S",0,5,4,0,0,0,0,0,"F","Serviço","Serviço","5.4.0.0.6.","SINAPI",94964,"CONCRETO FCK = 20MPA, TRAÇO 1:2,7:3 (CIMENTO/ AREIA MÉDIA/ BRITA 1)  - PREPARO MECÂNICO COM BETONEIRA 400 L. AF_07/2016","M3",2.7,2,null,null,null,null,null,""]
["S",2,"S",0,5,4,0,0,0,0,0,"F","Serviço","Serviço","5.4.0.0.7.","SINAPI",92874,"LANÇAMENTO COM USO DE BOMBA, ADENSAMENTO E ACABAMENTO DE CONCRETO EM ESTRUTURAS. AF_12/2015","M3",2.93,2,null,null,null,null,null,""]
["S",2,"S",0,5,4,0,0,0,0,0,"F","Serviço","Serviço","5.4.0.0.8.","SINAPI",96544,"ARMAÇÃO DE BLOCO, VIGA BALDRAME OU SAPATA UTILIZANDO AÇO CA-50 DE 6,3 MM - MONTAGEM. AF_06/2017","KG",33,2,null,null,null,null,null,"Referência: AGETOP - 52003"]
["S",2,"S",0,5,4,0,0,0,0,0,"F","Serviço","Serviço","5.4.0.0.9.","SINAPI",96545,"ARMAÇÃO DE BLOCO, VIGA BALDRAME OU SAPATA UTILIZANDO AÇO CA-50 DE 8 MM - MONTAGEM. AF_06/2017","KG",148,2,null,null,null,null,null,"Referência: AGETOP - 52004"]
["S",2,"S",0,5,4,0,0,0,0,0,"F","Serviço","Serviço","5.4.0.0.10.","SINAPI",96543,"ARMAÇÃO DE BLOCO, VIGA BALDRAME E SAPATA UTILIZANDO AÇO CA-60 DE 5 MM - MONTAGEM. AF_06/2017","KG",26,2,null,null,null,null,null,"Referência: AGETOP - 52014"]
[2,2,2,8,5,5,0,0,0,87,8,"F","Nível 2","Nível 2","5.5.","SINAPI",null,"ESTRUTURA","-",null,2,null,null,null,null,null,""]
["S",2,"S",0,5,5,0,0,0,0,0,"F","Serviço","Serviço","5.5.0.0.1.","SINAPI",92415,"MONTAGEM E DESMONTAGEM DE FÔRMA DE PILARES RETANGULARES E ESTRUTURAS SIMILARES COM ÁREA MÉDIA DAS SEÇÕES MAIOR QUE 0,25 M², PÉ-DIREITO SIMPLES, EM CHAPA DE MADEIRA COMPENSADA RESINADA, 2 UTILIZAÇÕES. AF_12/2015","M2",40.270000000000003,2,null,null,null,null,null,""]
["S",2,"S",0,5,5,0,0,0,0,0,"F","Serviço","Serviço","5.5.0.0.2.","AGETOP",60192,"FORMA DE TABUA CINTA/PILAR SOBRE/ENTRE ALVENARIA U=8 VEZES","m2    ",93.44,2,null,null,null,null,null,""]
["S",2,"S",0,5,5,0,0,0,0,0,"F","Serviço","Serviço","5.5.0.0.3.","SINAPI",92777,"ARMAÇÃO DE PILAR OU VIGA DE UMA ESTRUTURA CONVENCIONAL DE CONCRETO ARMADO EM UMA EDIFICAÇÃO TÉRREA OU SOBRADO UTILIZANDO AÇO CA-50 DE 8,0 MM - MONTAGEM. AF_12/2015","KG",104,2,null,null,null,null,null,"Referência: AGETOP - 60304"]
["S",2,"S",0,5,5,0,0,0,0,0,"F","Serviço","Serviço","5.5.0.0.4.","SINAPI",92778,"ARMAÇÃO DE PILAR OU VIGA DE UMA ESTRUTURA CONVENCIONAL DE CONCRETO ARMADO EM UMA EDIFICAÇÃO TÉRREA OU SOBRADO UTILIZANDO AÇO CA-50 DE 10,0 MM - MONTAGEM. AF_12/2015","KG",295,2,null,null,null,null,null,"Referência: AGETOP - 60305"]
["S",2,"S",0,5,5,0,0,0,0,0,"F","Serviço","Serviço","5.5.0.0.5.","SINAPI",92775,"ARMAÇÃO DE PILAR OU VIGA DE UMA ESTRUTURA CONVENCIONAL DE CONCRETO ARMADO EM UMA EDIFICAÇÃO TÉRREA OU SOBRADO UTILIZANDO AÇO CA-60 DE 5,0 MM - MONTAGEM. AF_12/2015","KG",143,2,null,null,null,null,null,"Referência: AGETOP - 60314"]
["S",2,"S",0,5,5,0,0,0,0,0,"F","Serviço","Serviço","5.5.0.0.6.","SINAPI",94964,"CONCRETO FCK = 20MPA, TRAÇO 1:2,7:3 (CIMENTO/ AREIA MÉDIA/ BRITA 1)  - PREPARO MECÂNICO COM BETONEIRA 400 L. AF_07/2016","M3",5.08,2,null,null,null,null,null,""]
["S",2,"S",0,5,5,0,0,0,0,0,"F","Serviço","Serviço","5.5.0.0.7.","SINAPI",92874,"LANÇAMENTO COM USO DE BOMBA, ADENSAMENTO E ACABAMENTO DE CONCRETO EM ESTRUTURAS. AF_12/2015","M3",5.08,2,null,null,null,null,null,""]
[2,2,2,18,5,6,0,0,0,79,18,"F","Nível 2","Nível 2","5.6.","SINAPI",null,"INSTALAÇÕES ELÉTRICAS","-",null,2,null,null,null,null,null,""]
["S",2,"S",0,5,6,0,0,0,0,0,"F","Serviço","Serviço","5.6.0.0.1.","AGETOP",70351,"BRACADEIRA METALICA TIPO \"U\" DIAM. 3/4\"","Un    ",30,2,null,null,null,null,null,""]
["S",2,"S",0,5,6,0,0,0,0,0,"F","Serviço","Serviço","5.6.0.0.2.","AGETOP",70421,"BUCHA E ARRUELA METALICA DIAM. 3/4\"","PR    ",15,2,null,null,null,null,null,""]
["S",2,"S",0,5,6,0,0,0,0,0,"F","Serviço","Serviço","5.6.0.0.3.","SINAPI",91927,"CABO DE COBRE FLEXÍVEL ISOLADO, 2,5 MM², ANTI-CHAMA 0,6/1,0 KV, PARA CIRCUITOS TERMINAIS - FORNECIMENTO E INSTALAÇÃO. AF_12/2015","M",210,2,null,null,null,null,null,"Referência: AGETOP - 70581"]
["S",2,"S",0,5,6,0,0,0,0,0,"F","Serviço","Serviço","5.6.0.0.4.","SINAPI",91936,"CAIXA OCTOGONAL 4\" X 4\", PVC, INSTALADA EM LAJE - FORNECIMENTO E INSTALAÇÃO. AF_12/2015","UN",12,2,null,null,null,null,null,""]
["S",2,"S",0,5,6,0,0,0,0,0,"F","Serviço","Serviço","5.6.0.0.5.","SINAPI",91940,"CAIXA RETANGULAR 4\" X 2\" MÉDIA (1,30 M DO PISO), PVC, INSTALADA EM PAREDE - FORNECIMENTO E INSTALAÇÃO. AF_12/2015","UN",5,2,null,null,null,null,null,""]
["S",2,"S",0,5,6,0,0,0,0,0,"F","Serviço","Serviço","5.6.0.0.6.","SINAPI",95817,"CONDULETE DE PVC, TIPO X, PARA ELETRODUTO DE PVC SOLDÁVEL DN 25 MM (3/4''), APARENTE - FORNECIMENTO E INSTALAÇÃO. AF_11/2016","UN",5,2,null,null,null,null,null,""]
["S",2,"S",0,5,6,0,0,0,0,0,"F","Serviço","Serviço","5.6.0.0.7.","SINAPI",91914,"CURVA 90 GRAUS PARA ELETRODUTO, PVC, ROSCÁVEL, DN 25 MM (3/4\"), PARA CIRCUITOS TERMINAIS, INSTALADA EM PAREDE - FORNECIMENTO E INSTALAÇÃO. AF_12/2015","UN",5,2,null,null,null,null,null,""]
["S",2,"S",0,5,6,0,0,0,0,0,"F","Serviço","Serviço","5.6.0.0.8.","SINAPI",93654,"DISJUNTOR MONOPOLAR TIPO DIN, CORRENTE NOMINAL DE 16A - FORNECIMENTO E INSTALAÇÃO. AF_04/2016","UN",4,2,null,null,null,null,null,""]
["S",2,"S",0,5,6,0,0,0,0,0,"F","Serviço","Serviço","5.6.0.0.9.","SINAPI",93671,"DISJUNTOR TRIPOLAR TIPO DIN, CORRENTE NOMINAL DE 32A - FORNECIMENTO E INSTALAÇÃO. AF_04/2016","UN",1,2,null,null,null,null,null,"Referência: AGETOP - 71173"]
["S",2,"S",0,5,6,0,0,0,0,0,"F","Serviço","Serviço","5.6.0.0.10.","SINAPI",91871,"ELETRODUTO RÍGIDO ROSCÁVEL, PVC, DN 25 MM (3/4\"), PARA CIRCUITOS TERMINAIS, INSTALADO EM PAREDE - FORNECIMENTO E INSTALAÇÃO. AF_12/2015","M",45,2,null,null,null,null,null,"Referência: AGETOP - 71201"]
["S",2,"S",0,5,6,0,0,0,0,0,"F","Serviço","Serviço","5.6.0.0.11.","SINAPI",91981,"INTERRUPTOR BIPOLAR (1 MÓDULO), 10A/250V, INCLUINDO SUPORTE E PLACA - FORNECIMENTO E INSTALAÇÃO. AF_09/2017","UN",3,2,null,null,null,null,null,""]
["S",2,"S",0,5,6,0,0,0,0,0,"F","Serviço","Serviço","5.6.0.0.12.","SINAPI",91967,"INTERRUPTOR SIMPLES (3 MÓDULOS), 10A/250V, INCLUINDO SUPORTE E PLACA - FORNECIMENTO E INSTALAÇÃO. AF_12/2015","UN",1,2,null,null,null,null,null,"Referência: AGETOP - 71442"]
["S",2,"S",0,5,6,0,0,0,0,0,"F","Serviço","Serviço","5.6.0.0.13.","SINAPI",97610,"LÂMPADA COMPACTA DE LED 10 W, BASE E27 - FORNECIMENTO E INSTALAÇÃO. AF_11/2017","UN",24,2,null,null,null,null,null,""]
["S",2,"S",0,5,6,0,0,0,0,0,"F","Serviço","Serviço","5.6.0.0.14.","SINAPI",97591,"LUMINÁRIA TIPO PLAFON REDONDO COM VIDRO FOSCO, DE SOBREPOR, COM 2 LÂMPADAS DE 15 W - FORNECIMENTO E INSTALAÇÃO. AF_11/2017","UN",12,2,null,null,null,null,null,""]
["S",2,"S",0,5,6,0,0,0,0,0,"F","Serviço","Serviço","5.6.0.0.15.","SINAPI",91884,"LUVA PARA ELETRODUTO, PVC, ROSCÁVEL, DN 25 MM (3/4\"), PARA CIRCUITOS TERMINAIS, INSTALADA EM PAREDE - FORNECIMENTO E INSTALAÇÃO. AF_12/2015","UN",15,2,null,null,null,null,null,"Referência: AGETOP - 71741"]
["S",2,"S",0,5,6,0,0,0,0,0,"F","Serviço","Serviço","5.6.0.0.16.","SINAPI",91996,"TOMADA MÉDIA DE EMBUTIR (1 MÓDULO), 2P+T 10 A, INCLUINDO SUPORTE E PLACA - FORNECIMENTO E INSTALAÇÃO. AF_12/2015","UN",3,2,null,null,null,null,null,"Referência: AGETOP - 72578"]
["S",2,"S",0,5,6,0,0,0,0,0,"F","Serviço","Serviço","5.6.0.0.17.","SINAPI",91997,"TOMADA MÉDIA DE EMBUTIR (1 MÓDULO), 2P+T 20 A, INCLUINDO SUPORTE E PLACA - FORNECIMENTO E INSTALAÇÃO. AF_12/2015","UN",1,2,null,null,null,null,null,""]
[2,2,2,30,5,7,0,0,0,61,30,"F","Nível 2","Nível 2","5.7.","SINAPI",null,"INSTALAÇÕES HIDROSSANITÁRIAS","-",null,2,null,null,null,null,null,""]
[3,3,3,10,5,7,1,0,0,{"$f":"IF(OR($C685=\"S\",$C685=0),0,MATCH(0,OFFSET($D685,1,$C685,ROW($C$911)-ROW($C685)),0))","v":29},{"$f":"IF(OR($C685=\"S\",$C685=0),0,MATCH(OFFSET($D685,0,$C685)+1,OFFSET($D685,1,$C685,ROW($C$911)-ROW($C685)),0))","v":10},"F","Nível 3","Nível 3","5.7.1.","SINAPI",null,"PEÇAS E ACESSÓRIOS","-",null,2,null,null,null,null,null,""]
["S",3,"S",0,5,7,1,0,0,0,0,"F","Serviço","Serviço","5.7.1.0.1.","AGETOP",81501,"ADESIVO PLASTICO - FRASCO 850 G","Un    ",2,2,null,null,null,null,null,""]
["S",3,"S",0,5,7,1,0,0,0,0,"F","Serviço","Serviço","5.7.1.0.2.","AGETOP",81504,"SOLUCAO LIMPADORA 1000 CM3","Un    ",2,2,null,null,null,null,null,""]
["S",3,"S",0,5,7,1,0,0,0,0,"F","Serviço","Serviço","5.7.1.0.3.","AGETOP",81825,"CAIXA DE PASSAGEM 60 X 60 CM SEM TAMPA","Un    ",1,2,null,null,null,null,null,""]
["S",3,"S",0,5,7,1,0,0,0,0,"F","Serviço","Serviço","5.7.1.0.4.","SINAPI",6171,"TAMPA DE CONCRETO ARMADO 60X60X5CM PARA CAIXA","UN",1,2,null,null,null,null,null,""]
["S",3,"S",0,5,7,1,0,0,0,0,"F","Serviço","Serviço","5.7.1.0.5.","SINAPI",86901,"CUBA DE EMBUTIR OVAL EM LOUÇA BRANCA, 35 X 50CM OU EQUIVALENTE - FORNECIMENTO E INSTALAÇÃO. AF_12/2013","UN",2,2,null,null,null,null,null,"Referência: AGETOP - 80587"]
["S",3,"S",0,5,7,1,0,0,0,0,"F","Serviço","Serviço","5.7.1.0.6.","AGETOP",80556,"LIGAÇÃO FLEXÍVEL PVC DIAM.1/2\" (ENGATE)","Un    ",2,2,null,null,null,null,null,""]
["S",3,"S",0,5,7,1,0,0,0,0,"F","Serviço","Serviço","5.7.1.0.7.","AGETOP",80562,"SIFAO FLEXIVEL UNIVERSAL ( SANFONADO) EM PVC PARA LAVATORIO","Un    ",2,2,null,null,null,null,null,""]
["S",3,"S",0,5,7,1,0,0,0,0,"F","Serviço","Serviço","5.7.1.0.8.","SINAPI",86877,"VÁLVULA EM METAL CROMADO 1.1/2\" X 1.1/2\" PARA TANQUE OU LAVATÓRIO, COM OU SEM LADRÃO - FORNECIMENTO E INSTALAÇÃO. AF_12/2013","UN",2,2,null,null,null,null,null,""]
["S",3,"S",0,5,7,1,0,0,0,0,"F","Serviço","Serviço","5.7.1.0.9.","AGETOP",80570,"TORNEIRA DE MESA PARA LAVATÓRIO DIÂMETRO DE 1/2\"","Un    ",2,2,null,null,null,null,null,""]
[3,3,3,12,5,7,2,0,0,19,12,"F","Nível 3","Nível 3","5.7.2.","SINAPI",null,"ÁGUA FRIA","-",null,2,null,null,null,null,null,""]
["S",3,"S",0,5,7,2,0,0,0,0,"F","Serviço","Serviço","5.7.2.0.1.","AGETOP",80927,"REGISTRO DE GAVETA C/CANOPLA DIAMETRO 1\"","Un    ",1,2,null,null,null,null,null,""]
["S",3,"S",0,5,7,2,0,0,0,0,"F","Serviço","Serviço","5.7.2.0.2.","SINAPI",89402,"TUBO, PVC, SOLDÁVEL, DN 25MM, INSTALADO EM RAMAL DE DISTRIBUIÇÃO DE ÁGUA - FORNECIMENTO E INSTALAÇÃO. AF_12/2014","M",3,2,null,null,null,null,null,"Referência: AGETOP - 81003"]
["S",3,"S",0,5,7,2,0,0,0,0,"F","Serviço","Serviço","5.7.2.0.3.","SINAPI",89447,"TUBO, PVC, SOLDÁVEL, DN 32MM, INSTALADO EM PRUMADA DE ÁGUA - FORNECIMENTO E INSTALAÇÃO. AF_12/2014","M",6,2,null,null,null,null,null,""]
["S",3,"S",0,5,7,2,0,0,0,0,"F","Serviço","Serviço","5.7.2.0.4.","SINAPI",94709,"ADAPTADOR COM FLANGES LIVRES, PVC, SOLDÁVEL, DN 32 MM X 1 , INSTALADO EM RESERVAÇÃO DE ÁGUA DE EDIFICAÇÃO QUE POSSUA RESERVATÓRIO DE FIBRA/FIBROCIMENTO   FORNECIMENTO E INSTALAÇÃO. AF_06/2016","UN",2,2,null,null,null,null,null,"Referência: AGETOP - 81042"]
["S",3,"S",0,5,7,2,0,0,0,0,"F","Serviço","Serviço","5.7.2.0.5.","SINAPI",96662,"BUCHA DE REDUÇÃO, PPR, 32 X 25, CLASSE PN 25, INSTALADO EM RAMAL DE DISTRIBUIÇÃO DE ÁGUA \u0096 FORNECIMENTO E INSTALAÇÃO . AF_06/2015","UN",1,2,null,null,null,null,null,""]
["S",3,"S",0,5,7,2,0,0,0,0,"F","Serviço","Serviço","5.7.2.0.6.","SINAPI",89481,"JOELHO 90 GRAUS, PVC, SOLDÁVEL, DN 25MM, INSTALADO EM PRUMADA DE ÁGUA - FORNECIMENTO E INSTALAÇÃO. AF_12/2014","UN",1,2,null,null,null,null,null,""]
["S",3,"S",0,5,7,2,0,0,0,0,"F","Serviço","Serviço","5.7.2.0.7.","AGETOP",81341,"JOELHO 90 GRAUS ROSCAVEL 1/2\" (MARROM)","Un    ",3,2,null,null,null,null,null,""]
[{"$f":"CHOOSE(1+LOG(1+2*(ORÇAMENTO.Nivel=\"Nível 1\")+4*(ORÇAMENTO.Nivel=\"Nível 2\")+8*(ORÇAMENTO.Nivel=\"Nível 3\")+16*(ORÇAMENTO.Nivel=\"Nível 4\")+32*(ORÇAMENTO.Nivel=\"Serviço\"),2),0,1,2,3,4,\"S\")","v":"S"},{"$f":"IF(OR(C703=\"s\",C703=0),OFFSET(B703,-1,0),C703)","v":3},{"$f":"IF(OFFSET(C703,-1,0)=\"L\",1,IF(OFFSET(C703,-1,0)=1,2,IF(OR(A703=\"s\",A703=0),\"S\",IF(AND(OFFSET(C703,-1,0)=2,A703=4),3,IF(AND(OR(OFFSET(C703,-1,0)=\"s\",OFFSET(C703,-1,0)=0),A703<>\"s\",A703>OFFSET(B703,-1,0)),OFFSET(B703,-1,0),A703)))))","v":"S"},{"$f":"IF(OR(C703=\"S\",C703=0),0,IF(ISERROR(K703),J703,SMALL(J703:K703,1)))","v":0},{"$f":"IF($C703=1,OFFSET(E703,-1,0)+1,OFFSET(E703,-1,0))","v":5},{"$f":"IF($C703=1,0,IF($C703=2,OFFSET(F703,-1,0)+1,OFFSET(F703,-1,0)))","v":7},{"$f":"IF(AND($C703<=2,$C703<>0),0,IF($C703=3,OFFSET(G703,-1,0)+1,OFFSET(G703,-1,0)))","v":2},{"$f":"IF(AND($C703<=3,$C703<>0),0,IF($C703=4,OFFSET(H703,-1,0)+1,OFFSET(H703,-1,0)))","v":0},{"$f":"IF(AND($C703<=4,$C703<>0),0,IF(AND($C703=\"S\",$Y703>0),OFFSET(I703,-1,0)+1,OFFSET(I703,-1,0)))","v":0},0,0,"F","Serviço","Serviço","5.7.2.0.8.","AGETOP",81342,"JOELHO 90 GRAUS ROSCAVEL DIAMETRO 3/4\"","Un    ",1,2,null,null,null,null,null,""]
["S",3,"S",0,5,7,2,0,0,0,0,"F","Serviço","Serviço","5.7.2.0.9.","AGETOP",81322,"JOELHO 90 GRAUS SOLDAVEL DIAMETRO 32 MM (1\")","Un    ",20,2,null,null,null,null,null,""]
["S",3,"S",0,5,7,2,0,0,0,0,"F","Serviço","Serviço","5.7.2.0.10.","AGETOP",81421,"TE REDUCAO 90 GRAUS SOLDAVEL 32 X 25 mm","Un    ",2,2,null,null,null,null,null,""]
["S",3,"S",0,5,7,2,0,0,0,0,"F","Serviço","Serviço","5.7.2.0.11.","SINAPI",89617,"TE, PVC, SOLDÁVEL, DN 25MM, INSTALADO EM PRUMADA DE ÁGUA - FORNECIMENTO E INSTALAÇÃO. AF_12/2014","UN",1,2,null,null,null,null,null,""]
[3,3,3,7,5,7,3,0,0,7,78,"F","Nível 3","Nível 3","5.7.3.","SINAPI",null,"ESGOTO","-",null,2,null,null,null,null,null,""]
["S",3,"S",0,5,7,3,0,0,0,0,"F","Serviço","Serviço","5.7.3.0.1.","AGETOP",81663,"CORPO CX. SIFONADA DIAM. 150 X 150 X 50","Un    ",1,2,null,null,null,null,null,""]
["S",3,"S",0,5,7,3,0,0,0,0,"F","Serviço","Serviço","5.7.3.0.2.","SINAPI",89726,"JOELHO 45 GRAUS, PVC, SERIE NORMAL, ESGOTO PREDIAL, DN 40 MM, JUNTA SOLDÁVEL, FORNECIDO E INSTALADO EM RAMAL DE DESCARGA OU RAMAL DE ESGOTO SANITÁRIO. AF_12/2014","UN",2,2,null,null,null,null,null,""]
["S",3,"S",0,5,7,3,0,0,0,0,"F","Serviço","Serviço","5.7.3.0.3.","SINAPI",89724,"JOELHO 90 GRAUS, PVC, SERIE NORMAL, ESGOTO PREDIAL, DN 40 MM, JUNTA SOLDÁVEL, FORNECIDO E INSTALADO EM RAMAL DE DESCARGA OU RAMAL DE ESGOTO SANITÁRIO. AF_12/2014","UN",3,2,null,null,null,null,null,""]
["S",3,"S",0,5,7,3,0,0,0,0,"F","Serviço","Serviço","5.7.3.0.4.","AGETOP",81927,"JOELHO 90 GRAUS C/ANEL 40 mm ","Un    ",3,2,null,null,null,null,null,""]
["S",3,"S",0,5,7,3,0,0,0,0,"F","Serviço","Serviço","5.7.3.0.5.","SINAPI",89711,"TUBO PVC, SERIE NORMAL, ESGOTO PREDIAL, DN 40 MM, FORNECIDO E INSTALADO EM RAMAL DE DESCARGA OU RAMAL DE ESGOTO SANITÁRIO. AF_12/2014","M",6,2,null,null,null,null,null,"Referência: AGETOP - 82301"]
["S",3,"S",0,5,7,3,0,0,0,0,"F","Serviço","Serviço","5.7.3.0.6.","SINAPI",89798,"TUBO PVC, SERIE NORMAL, ESGOTO PREDIAL, DN 50 MM, FORNECIDO E INSTALADO EM PRUMADA DE ESGOTO SANITÁRIO OU VENTILAÇÃO. AF_12/2014","M",3,2,null,null,null,null,null,""]
[2,2,2,4,5,8,0,0,0,31,4,"F","Nível 2","Nível 2","5.8.","SINAPI",null,"ALVENARIAS E DIVISÓRIAS","-",null,2,null,null,null,null,null,""]
["S",2,"S",0,5,8,0,0,0,0,0,"F","Serviço","Serviço","5.8.0.0.1.","SINAPI",87471,"ALVENARIA DE VEDAÇÃO DE BLOCOS CERÂMICOS FURADOS NA VERTICAL DE 9X19X39CM (ESPESSURA 9CM) DE PAREDES COM ÁREA LÍQUIDA MENOR QUE 6M² SEM VÃOS E ARGAMASSA DE ASSENTAMENTO COM PREPARO EM BETONEIRA. AF_06/2014","M2",56.3,2,null,null,null,null,null,""]
["S",2,"S",0,5,8,0,0,0,0,0,"F","Serviço","Serviço","5.8.0.0.2.","SINAPI",93202,"FIXAÇÃO (ENCUNHAMENTO) DE ALVENARIA DE VEDAÇÃO COM TIJOLO MACIÇO. AF_03/2016","M",5.6,2,null,null,null,null,null,"Referência: AGETOP - 100204"]
["S",2,"S",0,5,8,0,0,0,0,0,"F","Serviço","Serviço","5.8.0.0.3.","SINAPI",95465,"COBOGO CERAMICO (ELEMENTO VAZADO), 9X20X20CM, ASSENTADO COM ARGAMASSA TRACO 1:4 DE CIMENTO E AREIA","M2",35.909999999999997,2,null,null,null,null,null,""]
[2,2,2,2,5,9,0,0,0,27,2,"F","Nível 2","Nível 2","5.9.","SINAPI",null,"IMPERMEABILIZAÇÃO","-",null,2,null,null,null,null,null,""]
["S",2,"S",0,5,9,0,0,0,0,0,"F","Serviço","Serviço","5.9.0.0.1.","SINAPI",98562,"IMPERMEABILIZAÇÃO DE FLOREIRA OU VIGA BALDRAME COM ARGAMASSA DE CIMENTO E AREIA, COM ADITIVO IMPERMEABILIZANTE, E = 2 CM. AF_06/2018","M2",40.35,2,null,null,null,null,null,"Referência: AGETOP - 120902"]
[2,2,2,2,5,10,0,0,0,25,2,"F","Nível 2","Nível 2","5.10.","SINAPI",null,"ESTRUTURAS METÁLICAS","-",null,2,null,null,null,null,null,""]
["S",2,"S",0,5,10,0,0,0,0,0,"F","Serviço","Serviço","5.10.0.0.1.","AGETOP",150103,"ESTRUTURA METÁLICA CONVENCIONAL EM AÇO DO TIPO USI SAC-300 COM FUNDO ANTICORROSIVO","Kg    ",2414.2600000000002,2,null,null,null,null,null,""]
[2,2,2,4,5,11,0,0,0,23,4,"F","Nível 2","Nível 2","5.11.","SINAPI",null,"COBERTURAS","-",null,2,null,null,null,null,null,""]
["S",2,"S",0,5,11,0,0,0,0,0,"F","Serviço","Serviço","5.11.0.0.1.","SINAPI",94445,"TELHAMENTO COM TELHA CERÂMICA CAPA-CANAL, TIPO PLAN, COM ATÉ 2 ÁGUAS, INCLUSO TRANSPORTE VERTICAL. AF_07/2019","M2",179.17,2,null,null,null,null,null,"Referência: AGETOP - 160401"]
["S",2,"S",0,5,11,0,0,0,0,0,"F","Serviço","Serviço","5.11.0.0.2.","SINAPI",94221,"CUMEEIRA PARA TELHA CERÂMICA EMBOÇADA COM ARGAMASSA TRAÇO 1:2:9 (CIMENTO, CAL E AREIA) PARA TELHADOS COM ATÉ 2 ÁGUAS, INCLUSO TRANSPORTE VERTICAL. AF_07/2019","M",21.85,2,null,null,null,null,null,""]
["S",2,"S",0,5,11,0,0,0,0,0,"F","Serviço","Serviço","5.11.0.0.3.","SINAPI",94224,"EMBOÇAMENTO COM ARGAMASSA TRAÇO 1:2:9 (CIMENTO, CAL E AREIA). AF_07/2019","M",60.5,2,null,null,null,null,null,"Referência: AGETOP - 160403"]
[2,2,2,5,5,12,0,0,0,19,5,"F","Nível 2","Nível 2","5.12.","SINAPI",null,"REVESTIMENTO DE PAREDE","-",null,2,null,null,null,null,null,""]
["S",2,"S",0,5,12,0,0,0,0,0,"F","Serviço","Serviço","5.12.0.0.1.","SINAPI",87879,"CHAPISCO APLICADO EM ALVENARIAS E ESTRUTURAS DE CONCRETO INTERNAS, COM COLHER DE PEDREIRO.  ARGAMASSA TRAÇO 1:3 COM PREPARO EM BETONEIRA 400L. AF_06/2014","M2",98.18,2,null,null,null,null,null,""]
["S",2,"S",0,5,12,0,0,0,0,0,"F","Serviço","Serviço","5.12.0.0.2.","SINAPI",87286,"ARGAMASSA TRAÇO 1:1:6 (CIMENTO, CAL E AREIA MÉDIA) PARA EMBOÇO/MASSA ÚNICA/ASSENTAMENTO DE ALVENARIA DE VEDAÇÃO, PREPARO MECÂNICO COM BETONEIRA 400 L. AF_06/2014","M3",3.15,2,null,null,null,null,null,""]
["S",2,"S",0,5,12,0,0,0,0,0,"F","Serviço","Serviço","5.12.0.0.3.","SINAPI",87336,"ARGAMASSA TRAÇO 1:2:8 (CIMENTO, CAL E AREIA MÉDIA) PARA EMBOÇO/MASSA ÚNICA/ASSENTAMENTO DE ALVENARIA DE VEDAÇÃO, PREPARO MECÂNICO COM MISTURADOR DE EIXO HORIZONTAL DE 600 KG. AF_06/2014","M3",2.9454000000000002,2,null,null,null,null,null,""]
["S",2,"S",0,5,12,0,0,0,0,0,"F","Serviço","Serviço","5.12.0.0.4.","SINAPI",87274,"REVESTIMENTO CERÂMICO PARA PAREDES INTERNAS COM PLACAS TIPO ESMALTADA EXTRA DE DIMENSÕES 33X45 CM APLICADAS EM AMBIENTES DE ÁREA MENOR QUE 5 M² A MEIA ALTURA DAS PAREDES. AF_06/2014","M2",3.15,2,null,null,null,null,null,"Referência: AGETOP - 201302"]
[2,2,2,6,5,13,0,0,0,14,6,"F","Nível 2","Nível 2","5.13.","SINAPI",null,"REVESTIMENTO DE PISO","-",null,2,null,null,null,null,null,""]
["S",2,"S",0,5,13,0,0,0,0,0,"F","Serviço","Serviço","5.13.0.0.1.","SINAPI",95241,"LASTRO DE CONCRETO MAGRO, APLICADO EM PISOS OU RADIERS, ESPESSURA DE 5 CM. AF_07/2016","M2",133.97999999999999,2,null,null,null,null,null,""]
["S",2,"S",0,5,13,0,0,0,0,0,"F","Serviço","Serviço","5.13.0.0.2.","SINAPI",84191,"PISO EM GRANILITE, MARMORITE OU GRANITINA ESPESSURA 8 MM, INCLUSO JUNTAS DE DILATACAO PLASTICAS","M2",133.97999999999999,2,null,null,null,null,null,"Referência: AGETOP - 221101"]
["S",2,"S",0,5,13,0,0,0,0,0,"F","Serviço","Serviço","5.13.0.0.3.","SINAPI","73850/1","RODAPE EM MARMORITE, ALTURA 10CM","M",24.5,2,null,null,null,null,null,""]
["S",2,"S",0,5,13,0,0,0,0,0,"F","Serviço","Serviço","5.13.0.0.4.","AGETOP",221104,"RASPAGEM E APLICAÇÃO RESINA ACRÍLICA DUAS DEMÃOS","m2    ",136.42999999999998,2,null,null,null,null,null,""]
["S",2,"S",0,5,13,0,0,0,0,0,"F","Serviço","Serviço","5.13.0.0.5.","SINAPI",94992,"EXECUÇÃO DE PASSEIO (CALÇADA) OU PISO DE CONCRETO COM CONCRETO MOLDADO IN LOCO, FEITO EM OBRA, ACABAMENTO CONVENCIONAL, ESPESSURA 6 CM, ARMADO. AF_07/2016","M2",33.72,2,null,null,null,null,null,""]
[2,2,2,4,5,14,0,0,0,8,4,"F","Nível 2","Nível 2","5.14.","SINAPI",null,"PINTURA","-",null,2,null,null,null,null,null,""]
["S",2,"S",0,5,14,0,0,0,0,0,"F","Serviço","Serviço","5.14.0.0.1.","SINAPI","74133/1","EMASSAMENTO COM MASSA A OLEO, UMA DEMAO","M2",21.35,2,null,null,null,null,null,""]
["S",2,"S",0,5,14,0,0,0,0,0,"F","Serviço","Serviço","5.14.0.0.2.","SINAPI",88489,"APLICAÇÃO MANUAL DE PINTURA COM TINTA LÁTEX ACRÍLICA EM PAREDES, DUAS DEMÃOS. AF_06/2014","M2",53.7,2,null,null,null,null,null,"Referência: AGETOP - 261001"]
["S",2,"S",0,5,14,0,0,0,0,0,"F","Serviço","Serviço","5.14.0.0.3.","SINAPI",79464,"PINTURA A OLEO, 2 DEMAOS","M2",21.35,2,null,null,null,null,null,""]
[2,2,2,4,5,15,0,0,0,4,152,"F","Nível 2","Nível 2","5.15.","SINAPI",null,"DIVERSOS","-",null,2,null,null,null,null,null,""]
["S",2,"S",0,5,15,0,0,0,0,0,"F","Serviço","Serviço","5.15.0.0.1.","AGETOP",270501,"LIMPEZA FINAL DE OBRA - (OBRAS CIVIS)","m2    ",133.97999999999999,2,null,null,null,null,null,""]
["S",2,"S",0,5,15,0,0,0,0,0,"F","Serviço","Serviço","5.15.0.0.2.","AGETOP",271608,"BANCADA DE GRANITO C/ESPELHO","m2    ",1,2,null,null,null,null,null,""]
["S",2,"S",0,5,15,0,0,0,0,0,"F","Serviço","Serviço","5.15.0.0.3.","AGETOP",271303,"BANCO DE CONCRETO POLIDO BASE EM ALVENARIA REBOCADA E PINTADA - PADRÃO AGETOP 2015","m     ",15.75,2,null,null,null,null,null,""]
[1,1,1,166,6,0,0,0,0,166,{"$error":"#N/A"},"F","Nível 1","Nível 1","6.","SINAPI",null,"SANITÁRIOS","UN",1,1,null,null,null,null,null,""]
[2,2,2,2,6,1,0,0,0,165,2,"F","Nível 2","Nível 2","6.1.","SINAPI",null,"SERVIÇOS PRELIMINARES","-",null,1,null,null,null,null,null,""]
["S",2,"S",0,6,1,0,0,0,0,0,"F","Serviço","Serviço","6.1.0.0.1.","AGETOP",20701,"LOCAÇÃO DA OBRA, EXECUÇÃO DE GABARITO SEM REAPROVEITAMENTO, INCLUSO PINTURA (FACE INTERNA DO RIPÃO 15CM) E PIQUETE COM TESTEMUNHA","m2    ",48.43,1,null,null,null,null,null,""]
[2,2,2,3,6,2,0,0,0,163,3,"F","Nível 2","Nível 2","6.2.",null,null,"TRANSPORTES","-",null,1,null,null,null,null,null,""]
["S",2,"S",0,6,2,0,0,0,{"$f":"IF(OR($C749=\"S\",$C749=0),0,MATCH(0,OFFSET($D749,1,$C749,ROW($C$911)-ROW($C749)),0))","v":0},{"$f":"IF(OR($C749=\"S\",$C749=0),0,MATCH(OFFSET($D749,0,$C749)+1,OFFSET($D749,1,$C749,ROW($C$911)-ROW($C749)),0))","v":0},"F","Serviço","Serviço","6.2.0.0.1.","SINAPI",72900,"TRANSPORTE DE ENTULHO COM CAMINHAO BASCULANTE 6 M3, RODOVIA PAVIMENTADA, DMT 0,5 A 1,0 KM","M3",18,1,null,null,null,null,null,""]
["S",2,"S",0,6,2,0,0,0,0,0,"F","Serviço","Serviço","6.2.0.0.2.","SINAPI",72897,"CARGA MANUAL DE ENTULHO EM CAMINHAO BASCULANTE 6 M3","M3",18,1,null,null,null,null,null,""]
[2,2,2,3,6,3,0,0,0,160,3,"F","Nível 2","Nível 2","6.3.",null,null,"SERVIÇO EM TERRA","-",null,1,null,null,null,null,null,""]
["S",2,"S",0,6,3,0,0,0,0,0,"F","Serviço","Serviço","6.3.0.0.1.","SINAPI",79472,"REGULARIZACAO DE SUPERFICIES EM TERRA COM MOTONIVELADORA","M2",48.43,1,null,null,null,null,null,""]
["S",2,"S",0,6,3,0,0,0,0,0,"F","Serviço","Serviço","6.3.0.0.2.","SINAPI","74005/1","COMPACTACAO MECANICA, SEM CONTROLE DO GC (C/COMPACTADOR PLACA 400 KG)","M3",9.6859999999999999,1,null,null,null,null,null,"Referência: AGETOP - 41009"]
[2,2,2,10,6,4,0,0,0,157,10,"F","Nível 2","Nível 2","6.4.",null,null,"FUNDAÇÕES E SONDAGENS","-",null,1,null,null,null,null,null,""]
["S",2,"S",0,6,4,0,0,0,0,0,"F","Serviço","Serviço","6.4.0.0.1.","SINAPI",98230,"ESTACA BROCA DE CONCRETO, DIÂMETRO DE 30 CM, PROFUNDIDADE DE ATÉ 3 M, ESCAVAÇÃO MANUAL COM TRADO CONCHA, NÃO ARMADA. AF_03/2018","M",18,1,null,null,null,null,null,"Referência: AGETOP - 50302"]
["S",2,"S",0,6,4,0,0,0,0,0,"F","Serviço","Serviço","6.4.0.0.2.","SINAPI",96522,"ESCAVAÇÃO MANUAL PARA BLOCO DE COROAMENTO OU SAPATA, SEM PREVISÃO DE FÔRMA. AF_06/2017","M3",10.16,1,null,null,null,null,null,"Referência: AGETOP - 50901"]
["S",2,"S",0,6,4,0,0,0,0,0,"F","Serviço","Serviço","6.4.0.0.3.","SINAPI",93382,"REATERRO MANUAL DE VALAS COM COMPACTAÇÃO MECANIZADA. AF_04/2016","M3",7.44,1,null,null,null,null,null,"Referência: AGETOP - 40904"]
["S",2,"S",0,6,4,0,0,0,0,0,"F","Serviço","Serviço","6.4.0.0.4.","SINAPI",94964,"CONCRETO FCK = 20MPA, TRAÇO 1:2,7:3 (CIMENTO/ AREIA MÉDIA/ BRITA 1)  - PREPARO MECÂNICO COM BETONEIRA 400 L. AF_07/2016","M3",2.7199999999999998,1,null,null,null,null,null,""]
["S",2,"S",0,6,4,0,0,0,0,0,"F","Serviço","Serviço","6.4.0.0.5.","SINAPI","74157/4","LANCAMENTO/APLICACAO MANUAL DE CONCRETO EM FUNDACOES","M3",2.7199999999999998,1,null,null,null,null,null,"Referência: AGETOP - 51026"]
["S",2,"S",0,6,4,0,0,0,0,0,"F","Serviço","Serviço","6.4.0.0.6.","SINAPI",94103,"LASTRO DE VALA COM PREPARO DE FUNDO, LARGURA MENOR QUE 1,5 M, COM CAMADA DE BRITA, LANÇAMENTO MANUAL, EM LOCAL COM NÍVEL BAIXO DE INTERFERÊNCIA. AF_06/2016","M3",0.78,1,null,null,null,null,null,"Referência: AGETOP - 60470"]
["S",2,"S",0,6,4,0,0,0,0,0,"F","Serviço","Serviço","6.4.0.0.7.","SINAPI",96544,"ARMAÇÃO DE BLOCO, VIGA BALDRAME OU SAPATA UTILIZANDO AÇO CA-50 DE 6,3 MM - MONTAGEM. AF_06/2017","KG",33.54545454545454,1,null,null,null,null,null,"Referência: AGETOP - 52003"]
["S",2,"S",0,6,4,0,0,0,0,0,"F","Serviço","Serviço","6.4.0.0.8.","SINAPI",96545,"ARMAÇÃO DE BLOCO, VIGA BALDRAME OU SAPATA UTILIZANDO AÇO CA-50 DE 8 MM - MONTAGEM. AF_06/2017","KG",21.27272727272727,1,null,null,null,null,null,"Referência: AGETOP - 52004"]
["S",2,"S",0,6,4,0,0,0,0,0,"F","Serviço","Serviço","6.4.0.0.9.","SINAPI",96543,"ARMAÇÃO DE BLOCO, VIGA BALDRAME E SAPATA UTILIZANDO AÇO CA-60 DE 5 MM - MONTAGEM. AF_06/2017","KG",10.909090909090908,1,null,null,null,null,null,"Referência: AGETOP - 52014"]
[2,2,2,23,6,5,0,0,0,147,23,"F","Nível 2","Nível 2","6.5.",null,null,"ESTRUTURA","-",null,1,null,null,null,null,null,""]
[3,3,3,7,6,5,1,0,0,22,7,"F","Nível 3","Nível 3","6.5.1.","SINAPI",null,"VIGAS BALDRAMES","-",null,1,null,null,null,null,null,""]
["S",3,"S",0,6,5,1,0,0,0,0,"F","Serviço","Serviço","6.5.1.0.1.","SINAPI",96536,"FABRICAÇÃO, MONTAGEM E DESMONTAGEM DE FÔRMA PARA VIGA BALDRAME, EM MADEIRA SERRADA, E=25 MM, 4 UTILIZAÇÕES. AF_06/2017","M2",36.125,1,null,null,null,null,null,""]
["S",3,"S",0,6,5,1,0,0,0,0,"F","Serviço","Serviço","6.5.1.0.2.","SINAPI",96545,"ARMAÇÃO DE BLOCO, VIGA BALDRAME OU SAPATA UTILIZANDO AÇO CA-50 DE 8 MM - MONTAGEM. AF_06/2017","KG",48.409090909090907,1,null,null,null,null,null,"Referência: AGETOP - 52004"]
["S",3,"S",0,6,5,1,0,0,0,0,"F","Serviço","Serviço","6.5.1.0.3.","SINAPI",96546,"ARMAÇÃO DE BLOCO, VIGA BALDRAME OU SAPATA UTILIZANDO AÇO CA-50 DE 10 MM - MONTAGEM. AF_06/2017","KG",48.090909090909086,1,null,null,null,null,null,"Referência: AGETOP - 52005"]
["S",3,"S",0,6,5,1,0,0,0,0,"F","Serviço","Serviço","6.5.1.0.4.","SINAPI",96543,"ARMAÇÃO DE BLOCO, VIGA BALDRAME E SAPATA UTILIZANDO AÇO CA-60 DE 5 MM - MONTAGEM. AF_06/2017","KG",40.700000000000003,1,null,null,null,null,null,"Referência: AGETOP - 52014"]
["S",3,"S",0,6,5,1,0,0,0,0,"F","Serviço","Serviço","6.5.1.0.5.","SINAPI",94964,"CONCRETO FCK = 20MPA, TRAÇO 1:2,7:3 (CIMENTO/ AREIA MÉDIA/ BRITA 1)  - PREPARO MECÂNICO COM BETONEIRA 400 L. AF_07/2016","M3",2.165,1,null,null,null,null,null,""]
["S",3,"S",0,6,5,1,0,0,0,0,"F","Serviço","Serviço","6.5.1.0.6.","SINAPI",92873,"LANÇAMENTO COM USO DE BALDES, ADENSAMENTO E ACABAMENTO DE CONCRETO EM ESTRUTURAS. AF_12/2015","M3",2.165,1,null,null,null,null,null,"Referência: AGETOP - 60801"]
[3,3,3,6,6,5,2,0,0,15,6,"F","Nível 3","Nível 3","6.5.2.","SINAPI",null,"PILARES","-",null,1,null,null,null,null,null,""]
["S",3,"S",0,6,5,2,0,0,0,0,"F","Serviço","Serviço","6.5.2.0.1.","SINAPI",92418,"MONTAGEM E DESMONTAGEM DE FÔRMA DE PILARES RETANGULARES E ESTRUTURAS SIMILARES COM ÁREA MÉDIA DAS SEÇÕES MENOR OU IGUAL A 0,25 M², PÉ-DIREITO SIMPLES, EM CHAPA DE MADEIRA COMPENSADA RESINADA, 4 UTILIZAÇÕES. AF_12/2015","M2",38.22,1,null,null,null,null,null,"Referência: AGETOP - 60209"]
["S",3,"S",0,6,5,2,0,0,0,0,"F","Serviço","Serviço","6.5.2.0.2.","SINAPI",92778,"ARMAÇÃO DE PILAR OU VIGA DE UMA ESTRUTURA CONVENCIONAL DE CONCRETO ARMADO EM UMA EDIFICAÇÃO TÉRREA OU SOBRADO UTILIZANDO AÇO CA-50 DE 10,0 MM - MONTAGEM. AF_12/2015","KG",172.36363636363635,1,null,null,null,null,null,"Referência: AGETOP - 60305"]
["S",3,"S",0,6,5,2,0,0,0,0,"F","Serviço","Serviço","6.5.2.0.3.","SINAPI",92775,"ARMAÇÃO DE PILAR OU VIGA DE UMA ESTRUTURA CONVENCIONAL DE CONCRETO ARMADO EM UMA EDIFICAÇÃO TÉRREA OU SOBRADO UTILIZANDO AÇO CA-60 DE 5,0 MM - MONTAGEM. AF_12/2015","KG",59.181818181818173,1,null,null,null,null,null,"Referência: AGETOP - 60314"]
["S",3,"S",0,6,5,2,0,0,0,0,"F","Serviço","Serviço","6.5.2.0.4.","SINAPI",94964,"CONCRETO FCK = 20MPA, TRAÇO 1:2,7:3 (CIMENTO/ AREIA MÉDIA/ BRITA 1)  - PREPARO MECÂNICO COM BETONEIRA 400 L. AF_07/2016","M3",1.91,1,null,null,null,null,null,""]
["S",3,"S",0,6,5,2,0,0,0,0,"F","Serviço","Serviço","6.5.2.0.5.","SINAPI",92873,"LANÇAMENTO COM USO DE BALDES, ADENSAMENTO E ACABAMENTO DE CONCRETO EM ESTRUTURAS. AF_12/2015","M3",1.91,1,null,null,null,null,null,"Referência: AGETOP - 60801"]
[3,3,3,7,6,5,3,0,0,9,7,"F","Nível 3","Nível 3","6.5.3.","SINAPI",null,"VIGAS DE COBERTURA","-",null,1,null,null,null,null,null,""]
["S",3,"S",0,6,5,3,0,0,0,0,"F","Serviço","Serviço","6.5.3.0.1.","SINAPI",92475,"MONTAGEM E DESMONTAGEM DE FÔRMA DE VIGA, ESCORAMENTO COM GARFO DE MADEIRA, PÉ-DIREITO SIMPLES, EM CHAPA DE MADEIRA PLASTIFICADA, 14 UTILIZAÇÕES. AF_12/2015","M2",36.125,1,null,null,null,null,null,""]
["S",3,"S",0,6,5,3,0,0,0,0,"F","Serviço","Serviço","6.5.3.0.2.","SINAPI",92777,"ARMAÇÃO DE PILAR OU VIGA DE UMA ESTRUTURA CONVENCIONAL DE CONCRETO ARMADO EM UMA EDIFICAÇÃO TÉRREA OU SOBRADO UTILIZANDO AÇO CA-50 DE 8,0 MM - MONTAGEM. AF_12/2015","KG",48.409090909090907,1,null,null,null,null,null,"Referência: AGETOP - 60304"]
["S",3,"S",0,6,5,3,0,0,0,0,"F","Serviço","Serviço","6.5.3.0.3.","SINAPI",92778,"ARMAÇÃO DE PILAR OU VIGA DE UMA ESTRUTURA CONVENCIONAL DE CONCRETO ARMADO EM UMA EDIFICAÇÃO TÉRREA OU SOBRADO UTILIZANDO AÇO CA-50 DE 10,0 MM - MONTAGEM. AF_12/2015","KG",48.090909090909086,1,null,null,null,null,null,"Referência: AGETOP - 60305"]
["S",3,"S",0,6,5,3,0,0,0,0,"F","Serviço","Serviço","6.5.3.0.4.","SINAPI",92775,"ARMAÇÃO DE PILAR OU VIGA DE UMA ESTRUTURA CONVENCIONAL DE CONCRETO ARMADO EM UMA EDIFICAÇÃO TÉRREA OU SOBRADO UTILIZANDO AÇO CA-60 DE 5,0 MM - MONTAGEM. AF_12/2015","KG",40.700000000000003,1,null,null,null,null,null,"Referência: AGETOP - 60314"]
["S",3,"S",0,6,5,3,0,0,0,0,"F","Serviço","Serviço","6.5.3.0.5.","SINAPI",94964,"CONCRETO FCK = 20MPA, TRAÇO 1:2,7:3 (CIMENTO/ AREIA MÉDIA/ BRITA 1)  - PREPARO MECÂNICO COM BETONEIRA 400 L. AF_07/2016","M3",2.165,1,null,null,null,null,null,""]
["S",3,"S",0,6,5,3,0,0,0,0,"F","Serviço","Serviço","6.5.3.0.6.","SINAPI",92873,"LANÇAMENTO COM USO DE BALDES, ADENSAMENTO E ACABAMENTO DE CONCRETO EM ESTRUTURAS. AF_12/2015","M3",2.165,1,null,null,null,null,null,"Referência: AGETOP - 60801"]
[3,3,3,2,6,5,4,0,0,2,{"$error":"#N/A"},"F","Nível 3","Nível 3","6.5.4.","SINAPI",null,"LAJE","-",null,1,null,null,null,null,null,""]
["S",3,"S",0,6,5,4,0,0,0,0,"F","Serviço","Serviço","6.5.4.0.1.","SINAPI","74202/1","LAJE PRE-MOLDADA P/FORRO, SOBRECARGA 100KG/M2, VAOS ATE 3,50M/E=8CM, C/LAJOTAS E CAP.C/CONC FCK=20MPA, 3CM, INTER-EIXO 38CM, C/ESCORAMENTO (REAPR.3X) E FERRAGEM NEGATIVA","M2",25.16,1,null,null,null,null,null,""]
[2,2,2,24,6,6,0,0,0,124,24,"F","Nível 2","Nível 2","6.6.",null,null,"INSTALAÇÕES ELÉTRICAS","-",null,1,null,null,null,null,null,""]
["S",2,"S",0,6,6,0,0,0,0,0,"F","Serviço","Serviço","6.6.0.0.1.","SINAPI",91182,"FIXAÇÃO DE TUBOS HORIZONTAIS DE PPR DIÂMETROS MENORES OU IGUAIS A 40 MM COM ABRAÇADEIRA METÁLICA FLEXÍVEL 18 MM, FIXADA DIRETAMENTE NA LAJE. AF_05/2015","M",10,1,null,null,null,null,null,""]
["S",2,"S",0,6,6,0,0,0,0,0,"F","Serviço","Serviço","6.6.0.0.2.","SINAPI",95541,"FIXAÇÃO UTILIZANDO PARAFUSO E BUCHA DE NYLON, SOMENTE MÃO DE OBRA. AF_10/2016","UN",24,1,null,null,null,null,null,""]
["S",2,"S",0,6,6,0,0,0,0,0,"F","Serviço","Serviço","6.6.0.0.3.","SINAPI",91927,"CABO DE COBRE FLEXÍVEL ISOLADO, 2,5 MM², ANTI-CHAMA 0,6/1,0 KV, PARA CIRCUITOS TERMINAIS - FORNECIMENTO E INSTALAÇÃO. AF_12/2015","M",100,1,null,null,null,null,null,"Referência: AGETOP - 70581"]
["S",2,"S",0,6,6,0,0,0,0,0,"F","Serviço","Serviço","6.6.0.0.4.","SINAPI",91931,"CABO DE COBRE FLEXÍVEL ISOLADO, 6 MM², ANTI-CHAMA 0,6/1,0 KV, PARA CIRCUITOS TERMINAIS - FORNECIMENTO E INSTALAÇÃO. AF_12/2015","M",20,1,null,null,null,null,null,"Referência: AGETOP - 70583"]
["S",2,"S",0,6,6,0,0,0,0,0,"F","Serviço","Serviço","6.6.0.0.5.","SINAPI",92868,"CAIXA RETANGULAR 4\" X 2\" MÉDIA (1,30 M DO PISO), METÁLICA, INSTALADA EM PAREDE - FORNECIMENTO E INSTALAÇÃO. AF_12/2015","UN",5,1,null,null,null,null,null,"Referência: AGETOP - 70691"]
["S",2,"S",0,6,6,0,0,0,0,0,"F","Serviço","Serviço","6.6.0.0.6.","SINAPI",92865,"CAIXA OCTOGONAL 4\" X 4\", METÁLICA, INSTALADA EM LAJE - FORNECIMENTO E INSTALAÇÃO. AF_12/2015","UN",7,1,null,null,null,null,null,"Referência: AGETOP - 70682"]
["S",2,"S",0,6,6,0,0,0,0,0,"F","Serviço","Serviço","6.6.0.0.7.","SINAPI",83446,"CAIXA DE PASSAGEM 30X30X40 COM TAMPA E DRENO BRITA","UN",1,1,null,null,null,null,null,""]
["S",2,"S",0,6,6,0,0,0,0,0,"F","Serviço","Serviço","6.6.0.0.8.","SINAPI",91914,"CURVA 90 GRAUS PARA ELETRODUTO, PVC, ROSCÁVEL, DN 25 MM (3/4\"), PARA CIRCUITOS TERMINAIS, INSTALADA EM PAREDE - FORNECIMENTO E INSTALAÇÃO. AF_12/2015","UN",7,1,null,null,null,null,null,""]
["S",2,"S",0,6,6,0,0,0,0,0,"F","Serviço","Serviço","6.6.0.0.9.","SINAPI",91917,"CURVA 90 GRAUS PARA ELETRODUTO, PVC, ROSCÁVEL, DN 32 MM (1\"), PARA CIRCUITOS TERMINAIS, INSTALADA EM PAREDE - FORNECIMENTO E INSTALAÇÃO. AF_12/2015","UN",3,1,null,null,null,null,null,""]
["S",2,"S",0,6,6,0,0,0,0,0,"F","Serviço","Serviço","6.6.0.0.10.","SINAPI",93358,"ESCAVAÇÃO MANUAL DE VALA COM PROFUNDIDADE MENOR OU IGUAL A 1,30 M. AF_03/2016","M3",0.51200000000000001,1,null,null,null,null,null,"Referência: AGETOP - 40101"]
["S",2,"S",0,6,6,0,0,0,0,0,"F","Serviço","Serviço","6.6.0.0.11.","SINAPI",93654,"DISJUNTOR MONOPOLAR TIPO DIN, CORRENTE NOMINAL DE 16A - FORNECIMENTO E INSTALAÇÃO. AF_04/2016","UN",1,1,null,null,null,null,null,""]
["S",2,"S",0,6,6,0,0,0,0,0,"F","Serviço","Serviço","6.6.0.0.12.","SINAPI",93657,"DISJUNTOR MONOPOLAR TIPO DIN, CORRENTE NOMINAL DE 32A - FORNECIMENTO E INSTALAÇÃO. AF_04/2016","UN",1,1,null,null,null,null,null,""]
["S",2,"S",0,6,6,0,0,0,0,0,"F","Serviço","Serviço","6.6.0.0.13.","SINAPI",93671,"DISJUNTOR TRIPOLAR TIPO DIN, CORRENTE NOMINAL DE 32A - FORNECIMENTO E INSTALAÇÃO. AF_04/2016","UN",1,1,null,null,null,null,null,"Referência: AGETOP - 71173"]
["S",2,"S",0,6,6,0,0,0,0,0,"F","Serviço","Serviço","6.6.0.0.14.","SINAPI",91871,"ELETRODUTO RÍGIDO ROSCÁVEL, PVC, DN 25 MM (3/4\"), PARA CIRCUITOS TERMINAIS, INSTALADO EM PAREDE - FORNECIMENTO E INSTALAÇÃO. AF_12/2015","M",30,1,null,null,null,null,null,"Referência: AGETOP - 71201"]
["S",2,"S",0,6,6,0,0,0,0,0,"F","Serviço","Serviço","6.6.0.0.15.","SINAPI",91872,"ELETRODUTO RÍGIDO ROSCÁVEL, PVC, DN 32 MM (1\"), PARA CIRCUITOS TERMINAIS, INSTALADO EM PAREDE - FORNECIMENTO E INSTALAÇÃO. AF_12/2015","M",6,1,null,null,null,null,null,"Referência: AGETOP - 71202"]
["S",2,"S",0,6,6,0,0,0,0,0,"F","Serviço","Serviço","6.6.0.0.16.","SINAPI",91953,"INTERRUPTOR SIMPLES (1 MÓDULO), 10A/250V, INCLUINDO SUPORTE E PLACA - FORNECIMENTO E INSTALAÇÃO. AF_12/2015","UN",4,1,null,null,null,null,null,"Referência: AGETOP - 71440"]
["S",2,"S",0,6,6,0,0,0,0,0,"F","Serviço","Serviço","6.6.0.0.17.","AGETOP",71450,"INTERRUPTOR DIFERENCIAL RESIDUAL (D.R.) BIPOLAR DE 25A-30mA","Un    ",1,1,null,null,null,null,null,""]
["S",2,"S",0,6,6,0,0,0,0,0,"F","Serviço","Serviço","6.6.0.0.18.","SINAPI",97585,"LUMINÁRIA TIPO CALHA, DE SOBREPOR, COM 2 LÂMPADAS TUBULARES DE 18 W - FORNECIMENTO E INSTALAÇÃO. AF_11/2017","UN",5,1,null,null,null,null,null,""]
["S",2,"S",0,6,6,0,0,0,0,0,"F","Serviço","Serviço","6.6.0.0.19.","SINAPI",97586,"LUMINÁRIA TIPO CALHA, DE SOBREPOR, COM 2 LÂMPADAS TUBULARES DE 36 W - FORNECIMENTO E INSTALAÇÃO. AF_11/2017","UN",2,1,null,null,null,null,null,""]
["S",2,"S",0,6,6,0,0,0,0,0,"F","Serviço","Serviço","6.6.0.0.20.","SINAPI",91884,"LUVA PARA ELETRODUTO, PVC, ROSCÁVEL, DN 25 MM (3/4\"), PARA CIRCUITOS TERMINAIS, INSTALADA EM PAREDE - FORNECIMENTO E INSTALAÇÃO. AF_12/2015","UN",10,1,null,null,null,null,null,"Referência: AGETOP - 71741"]
["S",2,"S",0,6,6,0,0,0,0,0,"F","Serviço","Serviço","6.6.0.0.21.","SINAPI",91885,"LUVA PARA ELETRODUTO, PVC, ROSCÁVEL, DN 32 MM (1\"), PARA CIRCUITOS TERMINAIS, INSTALADA EM PAREDE - FORNECIMENTO E INSTALAÇÃO. AF_12/2015","UN",2,1,null,null,null,null,null,"Referência: AGETOP - 71742"]
["S",2,"S",0,6,6,0,0,0,0,0,"F","Serviço","Serviço","6.6.0.0.22.","SINAPI",83463,"QUADRO DE DISTRIBUICAO DE ENERGIA EM CHAPA DE ACO GALVANIZADO, PARA 12 DISJUNTORES TERMOMAGNETICOS MONOPOLARES, COM BARRAMENTO TRIFASICO E NEUTRO - FORNECIMENTO E INSTALACAO","UN",1,1,null,null,null,null,null,""]
["S",2,"S",0,6,6,0,0,0,0,0,"F","Serviço","Serviço","6.6.0.0.23.","SINAPI",91993,"TOMADA ALTA DE EMBUTIR (1 MÓDULO), 2P+T 20 A, INCLUINDO SUPORTE E PLACA - FORNECIMENTO E INSTALAÇÃO. AF_12/2015","UN",1,1,null,null,null,null,null,"Referência: AGETOP - 72585"]
[2,2,2,56,6,7,0,0,0,100,56,"F","Nível 2","Nível 2","6.7.",null,null,"INSTALAÇÕES HIDROSSANITÁRIAS","-",null,1,null,null,null,null,null,""]
[3,3,3,24,6,7,1,0,0,55,24,"F","Nível 3","Nível 3","6.7.1.","SINAPI",null,"PEÇAS E ACESSÓRIOS","-",null,1,null,null,null,null,null,""]
["S",3,"S",0,6,7,1,0,0,{"$f":"IF(OR($C813=\"S\",$C813=0),0,MATCH(0,OFFSET($D813,1,$C813,ROW($C$911)-ROW($C813)),0))","v":0},{"$f":"IF(OR($C813=\"S\",$C813=0),0,MATCH(OFFSET($D813,0,$C813)+1,OFFSET($D813,1,$C813,ROW($C$911)-ROW($C813)),0))","v":0},"F","Serviço","Serviço","6.7.1.0.1.","SINAPI",95470,"VASO SANITARIO SIFONADO CONVENCIONAL COM LOUÇA BRANCA, INCLUSO CONJUNTO DE LIGAÇÃO PARA BACIA SANITÁRIA AJUSTÁVEL - FORNECIMENTO E INSTALAÇÃO. AF_10/2016","UN",7,1,null,null,null,null,null,""]
["S",3,"S",0,6,7,1,0,0,0,0,"F","Serviço","Serviço","6.7.1.0.2.","AGETOP",80518,"VÁLVULA DE DESCARGA COM SISTEMA PASSANTE EM POLÍMERO - OPÇÃO ECONÔMICA ( ALTA SEGURANÇA)","Un    ",7,1,null,null,null,null,null,""]
["S",3,"S",0,6,7,1,0,0,0,0,"F","Serviço","Serviço","6.7.1.0.3.","AGETOP",80526,"ASSENTO EM POLIPROPILENO COM SISTEMA DE FECHAMENTO SUAVE PARA VASO SANITÁRIO","Un    ",7,1,null,null,null,null,null,""]
["S",3,"S",0,6,7,1,0,0,0,0,"F","Serviço","Serviço","6.7.1.0.4.","COMPOSIÇÃO","COMP 209_SEE","TOALHEIRO PLÁSTICO TIPO DISPENSER PARA PAPEL TOALHA INTERFOLHADO","UN ",3,1,null,null,null,null,null,""]
["S",3,"S",0,6,7,1,0,0,0,0,"F","Serviço","Serviço","6.7.1.0.5.","SINAPI",95544,"PAPELEIRA DE PAREDE EM METAL CROMADO SEM TAMPA, INCLUSO FIXAÇÃO. AF_10/2016","UN",7,1,null,null,null,null,null,""]
["S",3,"S",0,6,7,1,0,0,0,0,"F","Serviço","Serviço","6.7.1.0.6.","SINAPI",86904,"LAVATÓRIO LOUÇA BRANCA SUSPENSO, 29,5 X 39CM OU EQUIVALENTE, PADRÃO POPULAR - FORNECIMENTO E INSTALAÇÃO. AF_12/2013","UN",1,1,null,null,null,null,null,""]
["S",3,"S",0,6,7,1,0,0,0,0,"F","Serviço","Serviço","6.7.1.0.7.","SINAPI",86884,"ENGATE FLEXÍVEL EM PLÁSTICO BRANCO, 1/2\" X 30CM - FORNECIMENTO E INSTALAÇÃO. AF_12/2013","UN",5,1,null,null,null,null,null,""]
["S",3,"S",0,6,7,1,0,0,0,0,"F","Serviço","Serviço","6.7.1.0.8.","SINAPI",86883,"SIFÃO DO TIPO FLEXÍVEL EM PVC 1\u0094 X 1.1/2\u0094 - FORNECIMENTO E INSTALAÇÃO. AF_12/2013","UN",5,1,null,null,null,null,null,""]
["S",3,"S",0,6,7,1,0,0,0,0,"F","Serviço","Serviço","6.7.1.0.9.","SINAPI",86906,"TORNEIRA CROMADA DE MESA, 1/2\" OU 3/4\", PARA LAVATÓRIO, PADRÃO POPULAR - FORNECIMENTO E INSTALAÇÃO. AF_12/2013","UN",5,1,null,null,null,null,null,""]
["S",3,"S",0,6,7,1,0,0,0,0,"F","Serviço","Serviço","6.7.1.0.10.","SINAPI",86877,"VÁLVULA EM METAL CROMADO 1.1/2\" X 1.1/2\" PARA TANQUE OU LAVATÓRIO, COM OU SEM LADRÃO - FORNECIMENTO E INSTALAÇÃO. AF_12/2013","UN",5,1,null,null,null,null,null,""]
["S",3,"S",0,6,7,1,0,0,0,0,"F","Serviço","Serviço","6.7.1.0.11.","SINAPI",86901,"CUBA DE EMBUTIR OVAL EM LOUÇA BRANCA, 35 X 50CM OU EQUIVALENTE - FORNECIMENTO E INSTALAÇÃO. AF_12/2013","UN",4,1,null,null,null,null,null,"Referência: AGETOP - 80587"]
["S",3,"S",0,6,7,1,0,0,0,0,"F","Serviço","Serviço","6.7.1.0.12.","SINAPI",9535,"CHUVEIRO ELETRICO COMUM CORPO PLASTICO TIPO DUCHA, FORNECIMENTO E INSTALACAO","UN",1,1,null,null,null,null,null,""]
["S",3,"S",0,6,7,1,0,0,0,0,"F","Serviço","Serviço","6.7.1.0.13.","SINAPI",95543,"PORTA TOALHA BANHO EM METAL CROMADO, TIPO BARRA, INCLUSO FIXAÇÃO. AF_10/2016","UN",1,1,null,null,null,null,null,""]
["S",3,"S",0,6,7,1,0,0,0,0,"F","Serviço","Serviço","6.7.1.0.14.","SINAPI",95545,"SABONETEIRA DE PAREDE EM METAL CROMADO, INCLUSO FIXAÇÃO. AF_10/2016","UN",1,1,null,null,null,null,null,""]
["S",3,"S",0,6,7,1,0,0,0,0,"F","Serviço","Serviço","6.7.1.0.15.","SINAPI",86913,"TORNEIRA CROMADA 1/2\" OU 3/4\" PARA TANQUE, PADRÃO POPULAR - FORNECIMENTO E INSTALAÇÃO. AF_12/2013","UN",2,1,null,null,null,null,null,""]
["S",3,"S",0,6,7,1,0,0,0,0,"F","Serviço","Serviço","6.7.1.0.16.","SINAPI",89708,"CAIXA SIFONADA, PVC, DN 150 X 185 X 75 MM, JUNTA ELÁSTICA, FORNECIDA E INSTALADA EM RAMAL DE DESCARGA OU EM RAMAL DE ESGOTO SANITÁRIO. AF_12/2014","UN",3,1,null,null,null,null,null,""]
["S",3,"S",0,6,7,1,0,0,0,0,"F","Serviço","Serviço","6.7.1.0.17.","SINAPI",89709,"RALO SIFONADO, PVC, DN 100 X 40 MM, JUNTA SOLDÁVEL, FORNECIDO E INSTALADO EM RAMAL DE DESCARGA OU EM RAMAL DE ESGOTO SANITÁRIO. AF_12/2014","UN",1,1,null,null,null,null,null,""]
["S",3,"S",0,6,7,1,0,0,0,0,"F","Serviço","Serviço","6.7.1.0.18.","AGETOP",82101,"REDUCAO EXCENTRICA 75 X 50 MM","Un    ",3,1,null,null,null,null,null,""]
["S",3,"S",0,6,7,1,0,0,0,0,"F","Serviço","Serviço","6.7.1.0.19.","AGETOP",81695,"PROLONGAMENTO PARA CAIXA SIFONADA 100 MM","M     ",1,1,null,null,null,null,null,""]
["S",3,"S",0,6,7,1,0,0,0,0,"F","Serviço","Serviço","6.7.1.0.20.","AGETOP",81696,"PROLONGAMENTO PARA CAIXA SIFONADA 150 MM","M     ",3,1,null,null,null,null,null,""]
["S",3,"S",0,6,7,1,0,0,0,0,"F","Serviço","Serviço","6.7.1.0.21.","SINAPI",97906,"CAIXA ENTERRADA HIDRÁULICA RETANGULAR, EM ALVENARIA COM BLOCOS DE CONCRETO, DIMENSÕES INTERNAS: 0,6X0,6X0,6 M PARA REDE DE ESGOTO. AF_05/2018","UN",2,1,null,null,null,null,null,""]
["S",3,"S",0,6,7,1,0,0,0,0,"F","Serviço","Serviço","6.7.1.0.22.","SINAPI",6171,"TAMPA DE CONCRETO ARMADO 60X60X5CM PARA CAIXA","UN",2,1,null,null,null,null,null,""]
["S",3,"S",0,6,7,1,0,0,0,0,"F","Serviço","Serviço","6.7.1.0.23.","AGETOP",81885,"TERMINAL DE VENTILACAO DIAMETRO 50 MM","Un    ",2,1,null,null,null,null,null,""]
[3,3,3,21,6,7,2,0,0,31,21,"F","Nível 3","Nível 3","6.7.2.",null,null,"ÁGUA FRIA","-",null,1,null,null,null,null,null,""]
["S",3,"S",0,6,7,2,0,0,0,0,"F","Serviço","Serviço","6.7.2.0.1.","SINAPI",89985,"REGISTRO DE PRESSÃO BRUTO, LATÃO, ROSCÁVEL, 3/4\", COM ACABAMENTO E CANOPLA CROMADOS. FORNECIDO E INSTALADO EM RAMAL DE ÁGUA. AF_12/2014","UN",1,1,null,null,null,null,null,"Referência: AGETOP - 80926"]
["S",3,"S",0,6,7,2,0,0,0,0,"F","Serviço","Serviço","6.7.2.0.2.","SINAPI",94794,"REGISTRO DE GAVETA BRUTO, LATÃO, ROSCÁVEL, 1 1/2\u0094, COM ACABAMENTO E CANOPLA CROMADOS, INSTALADO EM RESERVAÇÃO DE ÁGUA DE EDIFICAÇÃO QUE POSSUA RESERVATÓRIO DE FIBRA/FIBROCIMENTO \u0096 FORNECIMENTO E INSTALAÇÃO. AF_06/2016","UN",3,1,null,null,null,null,null,"Referência: AGETOP - 80929"]
["S",3,"S",0,6,7,2,0,0,0,0,"F","Serviço","Serviço","6.7.2.0.3.","SINAPI",89987,"REGISTRO DE GAVETA BRUTO, LATÃO, ROSCÁVEL, 3/4\", COM ACABAMENTO E CANOPLA CROMADOS. FORNECIDO E INSTALADO EM RAMAL DE ÁGUA. AF_12/2014","UN",2,1,null,null,null,null,null,"Referência: AGETOP - 80926"]
["S",3,"S",0,6,7,2,0,0,0,0,"F","Serviço","Serviço","6.7.2.0.4.","SINAPI",89402,"TUBO, PVC, SOLDÁVEL, DN 25MM, INSTALADO EM RAMAL DE DISTRIBUIÇÃO DE ÁGUA - FORNECIMENTO E INSTALAÇÃO. AF_12/2014","M",24,1,null,null,null,null,null,"Referência: AGETOP - 81003"]
["S",3,"S",0,6,7,2,0,0,0,0,"F","Serviço","Serviço","6.7.2.0.5.","SINAPI",94651,"TUBO, PVC, SOLDÁVEL, DN 50 MM, INSTALADO EM RESERVAÇÃO DE ÁGUA DE EDIFICAÇÃO QUE POSSUA RESERVATÓRIO DE FIBRA/FIBROCIMENTO   FORNECIMENTO E INSTALAÇÃO. AF_06/2016","M",54,1,null,null,null,null,null,"Referência: AGETOP - 81006"]
["S",3,"S",0,6,7,2,0,0,0,0,"F","Serviço","Serviço","6.7.2.0.6.","SINAPI",94652,"TUBO, PVC, SOLDÁVEL, DN 60 MM, INSTALADO EM RESERVAÇÃO DE ÁGUA DE EDIFICAÇÃO QUE POSSUA RESERVATÓRIO DE FIBRA/FIBROCIMENTO   FORNECIMENTO E INSTALAÇÃO. AF_06/2016","M",6,1,null,null,null,null,null,""]
["S",3,"S",0,6,7,2,0,0,0,0,"F","Serviço","Serviço","6.7.2.0.7.","SINAPI",89429,"ADAPTADOR CURTO COM BOLSA E ROSCA PARA REGISTRO, PVC, SOLDÁVEL, DN 25MM X 3/4\u0094, INSTALADO EM RAMAL DE DISTRIBUIÇÃO DE ÁGUA - FORNECIMENTO E INSTALAÇÃO. AF_12/2014","UN",6,1,null,null,null,null,null,"Referência: AGETOP - 81066"]
["S",3,"S",0,6,7,2,0,0,0,0,"F","Serviço","Serviço","6.7.2.0.8.","SINAPI",89596,"ADAPTADOR CURTO COM BOLSA E ROSCA PARA REGISTRO, PVC, SOLDÁVEL, DN 50MM X 1.1/2\u0094, INSTALADO EM PRUMADA DE ÁGUA - FORNECIMENTO E INSTALAÇÃO. AF_12/2014","UN",13,1,null,null,null,null,null,"Referência: AGETOP - 81069"]
["S",3,"S",0,6,7,2,0,0,0,0,"F","Serviço","Serviço","6.7.2.0.9.","SINAPI",89605,"LUVA DE REDUÇÃO, PVC, SOLDÁVEL, DN 60MM X 50MM, INSTALADO EM PRUMADA DE ÁGUA - FORNECIMENTO E INSTALAÇÃO. AF_12/2014","UN",2,1,null,null,null,null,null,""]
["S",3,"S",0,6,7,2,0,0,0,0,"F","Serviço","Serviço","6.7.2.0.10.","SINAPI",89579,"LUVA DE REDUÇÃO, PVC, SOLDÁVEL, DN 50MM X 25MM, INSTALADO EM PRUMADA DE ÁGUA   FORNECIMENTO E INSTALAÇÃO. AF_12/2014","UN",1,1,null,null,null,null,null,""]
["S",3,"S",0,6,7,2,0,0,0,0,"F","Serviço","Serviço","6.7.2.0.11.","SINAPI",89605,"LUVA DE REDUÇÃO, PVC, SOLDÁVEL, DN 60MM X 50MM, INSTALADO EM PRUMADA DE ÁGUA - FORNECIMENTO E INSTALAÇÃO. AF_12/2014","UN",1,1,null,null,null,null,null,""]
["S",3,"S",0,6,7,2,0,0,0,0,"F","Serviço","Serviço","6.7.2.0.12.","SINAPI",89408,"JOELHO 90 GRAUS, PVC, SOLDÁVEL, DN 25MM, INSTALADO EM RAMAL DE DISTRIBUIÇÃO DE ÁGUA - FORNECIMENTO E INSTALAÇÃO. AF_12/2014","UN",9,1,null,null,null,null,null,""]
["S",3,"S",0,6,7,2,0,0,0,0,"F","Serviço","Serviço","6.7.2.0.13.","SINAPI",94678,"JOELHO 90 GRAUS, PVC, SOLDÁVEL, DN 50 MM INSTALADO EM RESERVAÇÃO DE ÁGUA DE EDIFICAÇÃO QUE POSSUA RESERVATÓRIO DE FIBRA/FIBROCIMENTO   FORNECIMENTO E INSTALAÇÃO. AF_06/2016","UN",12,1,null,null,null,null,null,"Referência: AGETOP - 81324"]
["S",3,"S",0,6,7,2,0,0,0,0,"F","Serviço","Serviço","6.7.2.0.14.","SINAPI",90373,"JOELHO 90 GRAUS COM BUCHA DE LATÃO, PVC, SOLDÁVEL, DN 25MM, X 1/2\u0094 INSTALADO EM RAMAL OU SUB-RAMAL DE ÁGUA - FORNECIMENTO E INSTALAÇÃO. AF_12/2014","UN",4,1,null,null,null,null,null,"Referência: AGETOP - 81360"]
["S",3,"S",0,6,7,2,0,0,0,0,"F","Serviço","Serviço","6.7.2.0.15.","SINAPI",94672,"JOELHO 90 GRAUS COM BUCHA DE LATÃO, PVC, SOLDÁVEL, DN  25 MM, X 3/4\u0094 INSTALADO EM RESERVAÇÃO DE ÁGUA DE EDIFICAÇÃO QUE POSSUA RESERVATÓRIO DE FIBRA/FIBROCIMENTO   FORNECIMENTO E INSTALAÇÃO. AF_06/2016","UN",2,1,null,null,null,null,null,""]
["S",3,"S",0,6,7,2,0,0,0,0,"F","Serviço","Serviço","6.7.2.0.16.","SINAPI",89440,"TE, PVC, SOLDÁVEL, DN 25MM, INSTALADO EM RAMAL DE DISTRIBUIÇÃO DE ÁGUA - FORNECIMENTO E INSTALAÇÃO. AF_12/2014","UN",2,1,null,null,null,null,null,"Referência: AGETOP - 81402"]
["S",3,"S",0,6,7,2,0,0,0,0,"F","Serviço","Serviço","6.7.2.0.17.","SINAPI",94694,"TÊ, PVC, SOLDÁVEL, DN 50 MM INSTALADO EM RESERVAÇÃO DE ÁGUA DE EDIFICAÇÃO QUE POSSUA RESERVATÓRIO DE FIBRA/FIBROCIMENTO   FORNECIMENTO E INSTALAÇÃO. AF_06/2016","UN",5,1,null,null,null,null,null,"Referência: AGETOP - 81405"]
["S",3,"S",0,6,7,2,0,0,0,0,"F","Serviço","Serviço","6.7.2.0.18.","SINAPI",89627,"TÊ DE REDUÇÃO, PVC, SOLDÁVEL, DN 50MM X 25MM, INSTALADO EM PRUMADA DE ÁGUA - FORNECIMENTO E INSTALAÇÃO. AF_12/2014","UN",3,1,null,null,null,null,null,""]
["S",3,"S",0,6,7,2,0,0,0,0,"F","Serviço","Serviço","6.7.2.0.19.","SINAPI",94698,"TÊ DE REDUÇÃO, PVC, SOLDÁVEL, DN 75 MM X 50 MM, INSTALADO EM RESERVAÇÃO DE ÁGUA DE EDIFICAÇÃO QUE POSSUA RESERVATÓRIO DE FIBRA/FIBROCIMENTO   FORNECIMENTO E INSTALAÇÃO. AF_06/2016","UN",1,1,null,null,null,null,null,"Referência: AGETOP - 81427"]
["S",3,"S",0,6,7,2,0,0,0,0,"F","Serviço","Serviço","6.7.2.0.20.","SINAPI",89441,"TÊ COM BUCHA DE LATÃO NA BOLSA CENTRAL, PVC, SOLDÁVEL, DN 25MM X 1/2\u0094, INSTALADO EM RAMAL DE DISTRIBUIÇÃO DE ÁGUA - FORNECIMENTO E INSTALAÇÃO. AF_12/2014","UN",2,1,null,null,null,null,null,""]
[3,3,3,10,6,7,3,0,0,10,{"$error":"#N/A"},"F","Nível 3","Nível 3","6.7.3.","SINAPI",null,"ESGOTO","-",null,1,null,null,null,null,null,""]
["S",3,"S",0,6,7,3,0,0,0,0,"F","Serviço","Serviço","6.7.3.0.1.","SINAPI",89732,"JOELHO 45 GRAUS, PVC, SERIE NORMAL, ESGOTO PREDIAL, DN 50 MM, JUNTA ELÁSTICA, FORNECIDO E INSTALADO EM RAMAL DE DESCARGA OU RAMAL DE ESGOTO SANITÁRIO. AF_12/2014","UN",2,1,null,null,null,null,null,""]
["S",3,"S",0,6,7,3,0,0,0,0,"F","Serviço","Serviço","6.7.3.0.2.","AGETOP",81927,"JOELHO 90 GRAUS C/ANEL 40 mm ","Un    ",5,1,null,null,null,null,null,""]
["S",3,"S",0,6,7,3,0,0,0,0,"F","Serviço","Serviço","6.7.3.0.3.","SINAPI",89724,"JOELHO 90 GRAUS, PVC, SERIE NORMAL, ESGOTO PREDIAL, DN 40 MM, JUNTA SOLDÁVEL, FORNECIDO E INSTALADO EM RAMAL DE DESCARGA OU RAMAL DE ESGOTO SANITÁRIO. AF_12/2014","UN",5,1,null,null,null,null,null,""]
["S",3,"S",0,6,7,3,0,0,0,0,"F","Serviço","Serviço","6.7.3.0.4.","SINAPI",89731,"JOELHO 90 GRAUS, PVC, SERIE NORMAL, ESGOTO PREDIAL, DN 50 MM, JUNTA ELÁSTICA, FORNECIDO E INSTALADO EM RAMAL DE DESCARGA OU RAMAL DE ESGOTO SANITÁRIO. AF_12/2014","UN",6,1,null,null,null,null,null,""]
["S",3,"S",0,6,7,3,0,0,0,0,"F","Serviço","Serviço","6.7.3.0.5.","SINAPI",89744,"JOELHO 90 GRAUS, PVC, SERIE NORMAL, ESGOTO PREDIAL, DN 100 MM, JUNTA ELÁSTICA, FORNECIDO E INSTALADO EM RAMAL DE DESCARGA OU RAMAL DE ESGOTO SANITÁRIO. AF_12/2014","UN",7,1,null,null,null,null,null,"Referência: AGETOP - 81938"]
["S",3,"S",0,6,7,3,0,0,0,0,"F","Serviço","Serviço","6.7.3.0.6.","SINAPI",89784,"TE, PVC, SERIE NORMAL, ESGOTO PREDIAL, DN 50 X 50 MM, JUNTA ELÁSTICA, FORNECIDO E INSTALADO EM RAMAL DE DESCARGA OU RAMAL DE ESGOTO SANITÁRIO. AF_12/2014","UN",4,1,null,null,null,null,null,"Referência: AGETOP - 82230"]
["S",3,"S",0,6,7,3,0,0,0,0,"F","Serviço","Serviço","6.7.3.0.7.","SINAPI",89711,"TUBO PVC, SERIE NORMAL, ESGOTO PREDIAL, DN 40 MM, FORNECIDO E INSTALADO EM RAMAL DE DESCARGA OU RAMAL DE ESGOTO SANITÁRIO. AF_12/2014","M",18,1,null,null,null,null,null,"Referência: AGETOP - 82301"]
["S",3,"S",0,6,7,3,0,0,0,0,"F","Serviço","Serviço","6.7.3.0.8.","SINAPI",89712,"TUBO PVC, SERIE NORMAL, ESGOTO PREDIAL, DN 50 MM, FORNECIDO E INSTALADO EM RAMAL DE DESCARGA OU RAMAL DE ESGOTO SANITÁRIO. AF_12/2014","M",36,1,null,null,null,null,null,"Referência: AGETOP - 82302"]
["S",3,"S",0,6,7,3,0,0,0,0,"F","Serviço","Serviço","6.7.3.0.9.","SINAPI",89714,"TUBO PVC, SERIE NORMAL, ESGOTO PREDIAL, DN 100 MM, FORNECIDO E INSTALADO EM RAMAL DE DESCARGA OU RAMAL DE ESGOTO SANITÁRIO. AF_12/2014","M",12,1,null,null,null,null,null,"Referência: AGETOP - 82304"]
[{"$f":"CHOOSE(1+LOG(1+2*(ORÇAMENTO.Nivel=\"Nível 1\")+4*(ORÇAMENTO.Nivel=\"Nível 2\")+8*(ORÇAMENTO.Nivel=\"Nível 3\")+16*(ORÇAMENTO.Nivel=\"Nível 4\")+32*(ORÇAMENTO.Nivel=\"Serviço\"),2),0,1,2,3,4,\"S\")","v":2},{"$f":"IF(OR(C867=\"s\",C867=0),OFFSET(B867,-1,0),C867)","v":2},{"$f":"IF(OFFSET(C867,-1,0)=\"L\",1,IF(OFFSET(C867,-1,0)=1,2,IF(OR(A867=\"s\",A867=0),\"S\",IF(AND(OFFSET(C867,-1,0)=2,A867=4),3,IF(AND(OR(OFFSET(C867,-1,0)=\"s\",OFFSET(C867,-1,0)=0),A867<>\"s\",A867>OFFSET(B867,-1,0)),OFFSET(B867,-1,0),A867)))))","v":2},{"$f":"IF(OR(C867=\"S\",C867=0),0,IF(ISERROR(K867),J867,SMALL(J867:K867,1)))","v":3},{"$f":"IF($C867=1,OFFSET(E867,-1,0)+1,OFFSET(E867,-1,0))","v":6},{"$f":"IF($C867=1,0,IF($C867=2,OFFSET(F867,-1,0)+1,OFFSET(F867,-1,0)))","v":8},{"$f":"IF(AND($C867<=2,$C867<>0),0,IF($C867=3,OFFSET(G867,-1,0)+1,OFFSET(G867,-1,0)))","v":0},{"$f":"IF(AND($C867<=3,$C867<>0),0,IF($C867=4,OFFSET(H867,-1,0)+1,OFFSET(H867,-1,0)))","v":0},{"$f":"IF(AND($C867<=4,$C867<>0),0,IF(AND($C867=\"S\",$Y867>0),OFFSET(I867,-1,0)+1,OFFSET(I867,-1,0)))","v":0},44,3,"F","Nível 2","Nível 2","6.8.","SINAPI",null,"ALVENARIAS E DIVISÓRIAS","-",null,1,null,null,null,null,null,""]
["S",2,"S",0,6,8,0,0,0,0,0,"F","Serviço","Serviço","6.8.0.0.1.","SINAPI",87511,"ALVENARIA DE VEDAÇÃO DE BLOCOS CERÂMICOS FURADOS NA HORIZONTAL DE 9X19X19CM (ESPESSURA 9CM) DE PAREDES COM ÁREA LÍQUIDA MENOR QUE 6M² COM VÃOS E ARGAMASSA DE ASSENTAMENTO COM PREPARO EM BETONEIRA. AF_06/2014","M2",121.72,1,null,null,null,null,null,"Referência: AGETOP - 100201"]
["S",2,"S",0,6,8,0,0,0,0,0,"F","Serviço","Serviço","6.8.0.0.2.","SINAPI",79627,"DIVISORIA EM GRANITO BRANCO POLIDO, ESP = 3CM, ASSENTADO COM ARGAMASSA TRACO 1:4, ARREMATE EM CIMENTO BRANCO, EXCLUSIVE FERRAGENS","M2",19.564999999999998,1,null,null,null,null,null,"Referência: AGETOP - 100320"]
[2,2,2,2,6,9,0,0,0,41,2,"F","Nível 2","Nível 2","6.9.","SINAPI",null,"IMPERMEABILIZAÇÃO","-",null,1,null,null,null,null,null,""]
["S",2,"S",0,6,9,0,0,0,0,0,"F","Serviço","Serviço","6.9.0.0.1.","SINAPI","74106/1","IMPERMEABILIZACAO DE ESTRUTURAS ENTERRADAS, COM TINTA ASFALTICA, DUAS DEMAOS.","M2",48,1,null,null,null,null,null,""]
[2,2,2,2,6,10,0,0,0,39,2,"F","Nível 2","Nível 2","6.10.","AGETOP",null,"ESTRUTURA DE MADEIRA","-",null,1,null,null,null,null,null,""]
["S",2,"S",0,6,10,0,0,0,0,0,"F","Serviço","Serviço","6.10.0.0.1.","AGETOP",140102,"ESTRUTURA-TELHA CERAMICA V=7 A 10 M C/FERRAGENS","m2    ",67,1,null,null,null,null,null,""]
[2,2,2,4,6,11,0,0,0,37,4,"F","Nível 2","Nível 2","6.11.","AGETOP",null,"COBERTURAS","-",null,1,null,null,null,null,null,""]
["S",2,"S",0,6,11,0,0,0,0,0,"F","Serviço","Serviço","6.11.0.0.1.","SINAPI",94445,"TELHAMENTO COM TELHA CERÂMICA CAPA-CANAL, TIPO PLAN, COM ATÉ 2 ÁGUAS, INCLUSO TRANSPORTE VERTICAL. AF_07/2019","M2",67,1,null,null,null,null,null,"Referência: AGETOP - 160401"]
["S",2,"S",0,6,11,0,0,0,0,0,"F","Serviço","Serviço","6.11.0.0.2.","SINAPI",94221,"CUMEEIRA PARA TELHA CERÂMICA EMBOÇADA COM ARGAMASSA TRAÇO 1:2:9 (CIMENTO, CAL E AREIA) PARA TELHADOS COM ATÉ 2 ÁGUAS, INCLUSO TRANSPORTE VERTICAL. AF_07/2019","M",7.5,1,null,null,null,null,null,""]
["S",2,"S",0,6,11,0,0,0,{"$f":"IF(OR($C877=\"S\",$C877=0),0,MATCH(0,OFFSET($D877,1,$C877,ROW($C$911)-ROW($C877)),0))","v":0},{"$f":"IF(OR($C877=\"S\",$C877=0),0,MATCH(OFFSET($D877,0,$C877)+1,OFFSET($D877,1,$C877,ROW($C$911)-ROW($C877)),0))","v":0},"F","Serviço","Serviço","6.11.0.0.3.","SINAPI",94224,"EMBOÇAMENTO COM ARGAMASSA TRAÇO 1:2:9 (CIMENTO, CAL E AREIA). AF_07/2019","M",32.799999999999997,1,null,null,null,null,null,"Referência: AGETOP - 160403"]
[2,2,2,4,6,12,0,0,0,33,4,"F","Nível 2","Nível 2","6.12.","AGETOP",null,"ESQUADRIAS METÁLICAS","-",null,1,null,null,null,null,null,""]
["S",2,"S",0,6,12,0,0,0,0,0,"F","Serviço","Serviço","6.12.0.0.1.","SINAPI","73933/4","PORTA DE FERRO DE ABRIR TIPO BARRA CHATA, COM REQUADRO E GUARNICAO COMPLETA","M2",5.67,1,null,null,null,null,null,"Referência: AGETOP - 180501"]
["S",2,"S",0,6,12,0,0,0,0,0,"F","Serviço","Serviço","6.12.0.0.2.","SINAPI","73933/4","PORTA DE FERRO DE ABRIR TIPO BARRA CHATA, COM REQUADRO E GUARNICAO COMPLETA","M2",6.48,1,null,null,null,null,null,"Referência: AGETOP - 180501"]
["S",2,"S",0,6,12,0,0,0,0,0,"F","Serviço","Serviço","6.12.0.0.3.","SINAPI",94559,"JANELA DE AÇO BASCULANTE, FIXAÇÃO COM ARGAMASSA, SEM VIDROS, PADRONIZADA. AF_07/2016","M2",3,1,null,null,null,null,null,"Referência: AGETOP - 180404"]
[2,2,2,2,6,13,0,0,0,29,2,"F","Nível 2","Nível 2","6.13.","AGETOP",null,"VIDROS","-",null,1,null,null,null,null,null,""]
["S",2,"S",0,6,13,0,0,0,0,0,"F","Serviço","Serviço","6.13.0.0.1.","SINAPI",72117,"VIDRO LISO COMUM TRANSPARENTE, ESPESSURA 4MM","M2",3,1,null,null,null,null,null,"Referência: AGETOP - 190102"]
[2,2,2,7,6,14,0,0,0,27,7,"F","Nível 2","Nível 2","6.14.","AGETOP",null,"REVESTIMENTO DE PAREDE","-",null,1,null,null,null,null,null,""]
["S",2,"S",0,6,14,0,0,0,0,0,"F","Serviço","Serviço","6.14.0.0.1.","SINAPI",87548,"MASSA ÚNICA, PARA RECEBIMENTO DE PINTURA, EM ARGAMASSA TRAÇO 1:2:8, PREPARO MANUAL, APLICADA MANUALMENTE EM FACES INTERNAS DE PAREDES, ESPESSURA DE 10MM, COM EXECUÇÃO DE TALISCAS. AF_06/2014","M2",165.09,1,null,null,null,null,null,"Referência: AGETOP - 200500"]
["S",2,"S",0,6,14,0,0,0,0,0,"F","Serviço","Serviço","6.14.0.0.2.","SINAPI",87272,"REVESTIMENTO CERÂMICO PARA PAREDES INTERNAS COM PLACAS TIPO ESMALTADA EXTRA  DE DIMENSÕES 33X45 CM APLICADAS EM AMBIENTES DE ÁREA MENOR QUE 5 M² NA ALTURA INTEIRA DAS PAREDES. AF_06/2014","M2",22.95,1,null,null,null,null,null,"Referência: AGETOP - 201302"]
["S",2,"S",0,6,14,0,0,0,0,0,"F","Serviço","Serviço","6.14.0.0.3.","SINAPI",87273,"REVESTIMENTO CERÂMICO PARA PAREDES INTERNAS COM PLACAS TIPO ESMALTADA EXTRA DE DIMENSÕES 33X45 CM APLICADAS EM AMBIENTES DE ÁREA MAIOR QUE 5 M² NA ALTURA INTEIRA DAS PAREDES. AF_06/2014","M2",55.4,1,null,null,null,null,null,""]
["S",2,"S",0,6,14,0,0,0,0,0,"F","Serviço","Serviço","6.14.0.0.4.","SINAPI",87549,"EMBOÇO, PARA RECEBIMENTO DE CERÂMICA, EM ARGAMASSA TRAÇO 1:2:8, PREPARO MECÂNICO COM BETONEIRA 400L, APLICADO MANUALMENTE EM FACES INTERNAS DE PAREDES, PARA AMBIENTE COM ÁREA ENTRE 5M2 E 10M2, ESPESSURA DE 10MM, COM EXECUÇÃO DE TALISCAS. AF_06/2014","M2",55.4,1,null,null,null,null,null,"Referência: AGETOP - 200201"]
[{"$f":"CHOOSE(1+LOG(1+2*(ORÇAMENTO.Nivel=\"Nível 1\")+4*(ORÇAMENTO.Nivel=\"Nível 2\")+8*(ORÇAMENTO.Nivel=\"Nível 3\")+16*(ORÇAMENTO.Nivel=\"Nível 4\")+32*(ORÇAMENTO.Nivel=\"Serviço\"),2),0,1,2,3,4,\"S\")","v":"S"},{"$f":"IF(OR(C889=\"s\",C889=0),OFFSET(B889,-1,0),C889)","v":2},{"$f":"IF(OFFSET(C889,-1,0)=\"L\",1,IF(OFFSET(C889,-1,0)=1,2,IF(OR(A889=\"s\",A889=0),\"S\",IF(AND(OFFSET(C889,-1,0)=2,A889=4),3,IF(AND(OR(OFFSET(C889,-1,0)=\"s\",OFFSET(C889,-1,0)=0),A889<>\"s\",A889>OFFSET(B889,-1,0)),OFFSET(B889,-1,0),A889)))))","v":"S"},{"$f":"IF(OR(C889=\"S\",C889=0),0,IF(ISERROR(K889),J889,SMALL(J889:K889,1)))","v":0},{"$f":"IF($C889=1,OFFSET(E889,-1,0)+1,OFFSET(E889,-1,0))","v":6},{"$f":"IF($C889=1,0,IF($C889=2,OFFSET(F889,-1,0)+1,OFFSET(F889,-1,0)))","v":14},{"$f":"IF(AND($C889<=2,$C889<>0),0,IF($C889=3,OFFSET(G889,-1,0)+1,OFFSET(G889,-1,0)))","v":0},{"$f":"IF(AND($C889<=3,$C889<>0),0,IF($C889=4,OFFSET(H889,-1,0)+1,OFFSET(H889,-1,0)))","v":0},{"$f":"IF(AND($C889<=4,$C889<>0),0,IF(AND($C889=\"S\",$Y889>0),OFFSET(I889,-1,0)+1,OFFSET(I889,-1,0)))","v":0},0,0,"F","Serviço","Serviço","6.14.0.0.5.","SINAPI",87545,"EMBOÇO, PARA RECEBIMENTO DE CERÂMICA, EM ARGAMASSA TRAÇO 1:2:8, PREPARO MECÂNICO COM BETONEIRA 400L, APLICADO MANUALMENTE EM FACES INTERNAS DE PAREDES, PARA AMBIENTE COM ÁREA MENOR QUE 5M2, ESPESSURA DE 10MM, COM EXECUÇÃO DE TALISCAS. AF_06/2014","M2",22.950000000000003,1,null,null,null,null,null,"Referência: AGETOP - 200201"]
["S",2,"S",0,6,14,0,0,0,0,0,"F","Serviço","Serviço","6.14.0.0.6.","SINAPI",87904,"CHAPISCO APLICADO EM ALVENARIA (COM PRESENÇA DE VÃOS) E ESTRUTURAS DE CONCRETO DE FACHADA, COM COLHER DE PEDREIRO.  ARGAMASSA TRAÇO 1:3 COM PREPARO MANUAL. AF_06/2014","M2",243.44,1,null,null,null,null,null,"Referência: AGETOP - 200101"]
[2,2,2,2,6,15,0,0,0,20,2,"F","Nível 2","Nível 2","6.15.","AGETOP",null,"FORROS","-",null,1,null,null,null,null,null,""]
["S",2,"S",0,6,15,0,0,0,0,0,"F","Serviço","Serviço","6.15.0.0.1.","SINAPI",96111,"FORRO EM RÉGUAS DE PVC, FRISADO, PARA AMBIENTES RESIDENCIAIS, INCLUSIVE ESTRUTURA DE FIXAÇÃO. AF_05/2017_P","M2",25.16,1,null,null,null,null,null,"Referência: AGETOP - 210460"]
[2,2,2,6,6,16,0,0,0,18,6,"F","Nível 2","Nível 2","6.16.","SINAPI",null,"REVESTIMENTO DE PISO","-",null,1,null,null,null,null,null,""]
["S",2,"S",0,6,16,0,0,0,0,0,"F","Serviço","Serviço","6.16.0.0.1.","SINAPI",95241,"LASTRO DE CONCRETO MAGRO, APLICADO EM PISOS OU RADIERS, ESPESSURA DE 5 CM. AF_07/2016","M2",48.43,1,null,null,null,null,null,""]
["S",2,"S",0,6,16,0,0,0,0,0,"F","Serviço","Serviço","6.16.0.0.2.","AGETOP",221104,"RASPAGEM E APLICAÇÃO RESINA ACRÍLICA DUAS DEMÃOS","m2    ",18.850000000000001,1,null,null,null,null,null,""]
["S",2,"S",0,6,16,0,0,0,0,0,"F","Serviço","Serviço","6.16.0.0.3.","SINAPI",84191,"PISO EM GRANILITE, MARMORITE OU GRANITINA ESPESSURA 8 MM, INCLUSO JUNTAS DE DILATACAO PLASTICAS","M2",18.850000000000001,1,null,null,null,null,null,"Referência: AGETOP - 221101"]
["S",2,"S",0,6,16,0,0,0,0,0,"F","Serviço","Serviço","6.16.0.0.4.","SINAPI",87247,"REVESTIMENTO CERÂMICO PARA PISO COM PLACAS TIPO ESMALTADA EXTRA DE DIMENSÕES 35X35 CM APLICADA EM AMBIENTES DE ÁREA ENTRE 5 M2 E 10 M2. AF_06/2014","M2",25.16,1,null,null,null,null,null,""]
["S",2,"S",0,6,16,0,0,0,0,0,"F","Serviço","Serviço","6.16.0.0.5.","SINAPI",94992,"EXECUÇÃO DE PASSEIO (CALÇADA) OU PISO DE CONCRETO COM CONCRETO MOLDADO IN LOCO, FEITO EM OBRA, ACABAMENTO CONVENCIONAL, ESPESSURA 6 CM, ARMADO. AF_07/2016","M2",15,1,null,null,null,null,null,""]
[2,2,2,3,6,17,0,0,0,12,3,"F","Nível 2","Nível 2","6.17.","AGETOP",null,"FORROS","-",null,1,null,null,null,null,null,""]
["S",2,"S",0,6,17,0,0,0,0,0,"F","Serviço","Serviço","6.17.0.0.1.","AGETOP",230176,"BARRA DE APOIO EM AÇO INOX - 80 CM ","un    ",4,1,null,null,null,null,null,""]
[{"$f":"CHOOSE(1+LOG(1+2*(ORÇAMENTO.Nivel=\"Nível 1\")+4*(ORÇAMENTO.Nivel=\"Nível 2\")+8*(ORÇAMENTO.Nivel=\"Nível 3\")+16*(ORÇAMENTO.Nivel=\"Nível 4\")+32*(ORÇAMENTO.Nivel=\"Serviço\"),2),0,1,2,3,4,\"S\")","v":"S"},{"$f":"IF(OR(C901=\"s\",C901=0),OFFSET(B901,-1,0),C901)","v":2},{"$f":"IF(OFFSET(C901,-1,0)=\"L\",1,IF(OFFSET(C901,-1,0)=1,2,IF(OR(A901=\"s\",A901=0),\"S\",IF(AND(OFFSET(C901,-1,0)=2,A901=4),3,IF(AND(OR(OFFSET(C901,-1,0)=\"s\",OFFSET(C901,-1,0)=0),A901<>\"s\",A901>OFFSET(B901,-1,0)),OFFSET(B901,-1,0),A901)))))","v":"S"},{"$f":"IF(OR(C901=\"S\",C901=0),0,IF(ISERROR(K901),J901,SMALL(J901:K901,1)))","v":0},{"$f":"IF($C901=1,OFFSET(E901,-1,0)+1,OFFSET(E901,-1,0))","v":6},{"$f":"IF($C901=1,0,IF($C901=2,OFFSET(F901,-1,0)+1,OFFSET(F901,-1,0)))","v":17},{"$f":"IF(AND($C901<=2,$C901<>0),0,IF($C901=3,OFFSET(G901,-1,0)+1,OFFSET(G901,-1,0)))","v":0},{"$f":"IF(AND($C901<=3,$C901<>0),0,IF($C901=4,OFFSET(H901,-1,0)+1,OFFSET(H901,-1,0)))","v":0},{"$f":"IF(AND($C901<=4,$C901<>0),0,IF(AND($C901=\"S\",$Y901>0),OFFSET(I901,-1,0)+1,OFFSET(I901,-1,0)))","v":0},0,0,"F","Serviço","Serviço","6.17.0.0.2.","AGETOP",230174,"BARRA DE APOIO EM AÇO INOX - 40 CM","un    ",2,1,null,null,null,null,null,""]
[2,2,2,5,6,18,0,0,0,9,5,"F","Nível 2","Nível 2","6.18.","AGETOP",null,"REVESTIMENTO DE PISO","-",null,1,null,null,null,null,null,""]
["S",2,"S",0,6,18,0,0,0,0,0,"F","Serviço","Serviço","6.18.0.0.1.","SINAPI","74145/1","PINTURA ESMALTE FOSCO, DUAS DEMAOS, SOBRE SUPERFICIE METALICA, INCLUSO UMA DEMAO DE FUNDO ANTICORROSIVO. UTILIZACAO DE REVOLVER ( AR-COMPRIMIDO).","M2",30.3,1,null,null,null,null,null,"Referência: AGETOP - 261602"]
["S",2,"S",0,6,18,0,0,0,0,0,"F","Serviço","Serviço","6.18.0.0.2.","SINAPI",88489,"APLICAÇÃO MANUAL DE PINTURA COM TINTA LÁTEX ACRÍLICA EM PAREDES, DUAS DEMÃOS. AF_06/2014","M2",95.92,1,null,null,null,null,null,"Referência: AGETOP - 261001"]
["S",2,"S",0,6,18,0,0,0,0,0,"F","Serviço","Serviço","6.18.0.0.3.","SINAPI",88487,"APLICAÇÃO MANUAL DE PINTURA COM TINTA LÁTEX PVA EM PAREDES, DUAS DEMÃOS. AF_06/2014","M2",31,1,null,null,null,null,null,""]
["S",2,"S",0,6,18,0,0,0,0,0,"F","Serviço","Serviço","6.18.0.0.4.","SINAPI",88497,"APLICAÇÃO E LIXAMENTO DE MASSA LÁTEX EM PAREDES, DUAS DEMÃOS. AF_06/2014","M2",31,1,null,null,null,null,null,"Referência: AGETOP - 261300"]
[2,2,2,4,6,19,0,0,0,4,{"$error":"#N/A"},"F","Nível 2","Nível 2","6.19.","AGETOP",null,"DIVERSOS","-",null,1,null,null,null,null,null,""]
["S",2,"S",0,6,19,0,0,0,0,0,"F","Serviço","Serviço","6.19.0.0.1.","AGETOP",270501,"LIMPEZA FINAL DE OBRA - (OBRAS CIVIS)","m2    ",48.43,1,null,null,null,null,null,""]
["S",2,"S",0,6,19,0,0,0,0,0,"F","Serviço","Serviço","6.19.0.0.2.","COMPOSIÇÃO","COMP 541_SEE","BANCADA DE GRANITO CINZA POLIDO - FORNECIMENTO E INSTALAÇÃO. ","M2    ",2.42,1,null,null,null,null,null,""]
[{"$f":"CHOOSE(1+LOG(1+2*(ORÇAMENTO.Nivel=\"Nível 1\")+4*(ORÇAMENTO.Nivel=\"Nível 2\")+8*(ORÇAMENTO.Nivel=\"Nível 3\")+16*(ORÇAMENTO.Nivel=\"Nível 4\")+32*(ORÇAMENTO.Nivel=\"Serviço\"),2),0,1,2,3,4,\"S\")","v":"S"},{"$f":"IF(OR(C910=\"s\",C910=0),OFFSET(B910,-1,0),C910)","v":2},{"$f":"IF(OFFSET(C910,-1,0)=\"L\",1,IF(OFFSET(C910,-1,0)=1,2,IF(OR(A910=\"s\",A910=0),\"S\",IF(AND(OFFSET(C910,-1,0)=2,A910=4),3,IF(AND(OR(OFFSET(C910,-1,0)=\"s\",OFFSET(C910,-1,0)=0),A910<>\"s\",A910>OFFSET(B910,-1,0)),OFFSET(B910,-1,0),A910)))))","v":"S"},{"$f":"IF(OR(C910=\"S\",C910=0),0,IF(ISERROR(K910),J910,SMALL(J910:K910,1)))","v":0},{"$f":"IF($C910=1,OFFSET(E910,-1,0)+1,OFFSET(E910,-1,0))","v":6},{"$f":"IF($C910=1,0,IF($C910=2,OFFSET(F910,-1,0)+1,OFFSET(F910,-1,0)))","v":19},{"$f":"IF(AND($C910<=2,$C910<>0),0,IF($C910=3,OFFSET(G910,-1,0)+1,OFFSET(G910,-1,0)))","v":0},{"$f":"IF(AND($C910<=3,$C910<>0),0,IF($C910=4,OFFSET(H910,-1,0)+1,OFFSET(H910,-1,0)))","v":0},{"$f":"IF(AND($C910<=4,$C910<>0),0,IF(AND($C910=\"S\",$Y910>0),OFFSET(I910,-1,0)+1,OFFSET(I910,-1,0)))","v":0},0,0,"F","Serviço","Serviço","6.19.0.0.3.","COMPOSIÇÃO","COMP 206_SEE","BANCO ARTICULADO PARA BANHO, EM ACO INOX POLIDO, 70* CM X 45* CM","UN ",1,1,null,null,null,null,null,""]
[-1,null,-1,null,0,0,0,0,0,null,null,"F"]
[null,null,null,null,null,null,null,null,null,null,null,"F",null,null,null,null,null,"OBS: OS QUANTITATIVOS DE MATERIAIS  DAS INSTALAÇÕES HIDROSSANITÁRIAS, ELÉTRICAS E ESPECIAIS SÃO FORNECIDOS PELOS PROFISSIONAIS RESPONSÁVEIS PELOS RESPECTIVOS PROJETOS.",null,null,null,null,null,"VALOR TOTAL",null,996414.63000000024]
[null,null,null,null,null,null,null,null,null,null,null,"F",null,null,null,null,null,null,null,null,null,null,null,"VALOR BDI (20,34%)",null,202684.86]
[null,null,null,null,null,null,null,null,null,null,null,"F",null,null,null,null,null,null,null,null,null,null,null,"TOTAL ORÇAMENTO",null,1199099.4900000002]
[null,null,null,null,null,null,null,null,null,null,null,"F"]
[null,null,null,null,null,null,null,null,null,null,null,"F",null,null,null,null,null,null,null,null,null,null,null,"CUSTO POR M2 ³",null,258.24573089969317]
[null,null,null,null,null,null,null,null,null,null,null,"F",null,null,null,null,null,null,null,null,null,null,null,"MATERIAL S/ BDI",null,588416.32999999996]
[null,null,null,null,null,null,null,null,null,null,null,"F",null,null,null,null,null,null,null,null,null,null,null,"MÃO DE OBRA S/ BDI",null,407998.30000000028]
[null,null,null,null,null,null,null,null,null,null,null,"F"]
[null,null,null,null,null,null,null,null,null,null,null,"F",null,null,null,null,"(1) Conforme previsto pelo DECRETO Nº 7.983, DE 8 DE ABRIL DE 2013, os preços adotados são aqueles constantes dos sistemas de referência indicados. Justifica-se o uso dos preços destas composições de custos unitários devido ao seu valor ser menor à mediana de seus correspondentes na tabela SINAPI;"]
[null,null,null,null,null,null,null,null,null,null,null,"F",null,null,null,null,"(2) Optou-se pelo uso das composições de custos da AGETOP para itens não presentes na SINAPI;"]
[null,null,null,null,null,null,null,null,null,null,null,"F",null,null,null,null,"(3) Para itens da AGETOP, os vidros não estão inclusos nas esquadrias e já foram considerados os custos de contramarco para as esquadrias de alumínio;"]
[null,null,null,null,null,null,null,null,null,null,null,"F",null,null,null,null,"(4) Nos casos em que houver execução de granitina e omissão do item AGETOP 221102, considerou-se que o quantitativo para o rodapé, de altura igual a 7cm, foi incorporado na área de piso;"]
[null,null,null,null,null,null,null,null,null,null,null,"F",null,null,null,null,"(5) O custo unitário aproximado por metro quadrado é calculado dividindo-se o valor total do orçamento pela área total de construção."]
[null,null,null,null,null,null,null,null,null,null,null,"F"]
[null,null,null,null,null,null,null,null,null,null,null,"F"]
[]
[null,null,null,null,null,null,null,null,null,null,null,null,null,null,"SOMATÓRIO DE SERVIÇOS"]
[null,null,null,null,null,null,null,null,null,null,null,null,null,null,"ITEM","DESCRIÇÃO DOS SERVIÇOS",null,null,"PREÇO SEM BDI",null,null,null,null,"PREÇO COM BDI",null,null,"PARTICIPAÇÃO ( % )"]
[null,null,null,null,null,null,null,null,null,null,null,null,null,null,"a.","SERVIÇOS PRELIMINARES",null,null,{"$f":"SUMIF($R$19:$R$911,$P930,$Z$19:$Z$911)","v":0},null,null,null,null,{"$f":"ROUND(S930*(1+BDI.Taxa),2)","v":0},null,null,{"$f":"IFERROR(ROUND($X930*100/$Z$914,2),0)","v":0}]
[null,null,null,null,null,null,null,null,null,null,null,null,null,null,"b.","TRANSPORTES",null,null,0,null,null,null,null,0,null,null,0]
[null,null,null,null,null,null,null,null,null,null,null,null,null,null,"c.","SERVIÇO EM TERRA",null,null,0,null,null,null,null,0,null,null,0]
[null,null,null,null,null,null,null,null,null,null,null,null,null,null,"d.","FUNDAÇÕES E SONDAGENS",null,null,0,null,null,null,null,0,null,null,0]
[null,null,null,null,null,null,null,null,null,null,null,null,null,null,"e.","ESTRUTURA",null,null,0,null,null,null,null,0,null,null,0]
[null,null,null,null,null,null,null,null,null,null,null,null,null,null,"f.","INSTALAÇÕES ELÉTRICAS",null,null,0,null,null,null,null,0,null,null,0]
[null,null,null,null,null,null,null,null,null,null,null,null,null,null,"g.","INSTALAÇÕES HIDROSSANITÁRIAS",null,null,0,null,null,null,null,0,null,null,0]
[null,null,null,null,null,null,null,null,null,null,null,null,null,null,"h","INSTALAÇÕES ESPECIAIS",null,null,0,null,null,null,null,0,null,null,0]
[null,null,null,null,null,null,null,null,null,null,null,null,null,null,"i.","ALVENARIAS E DIVISÓRIAS",null,null,0,null,null,null,null,0,null,null,0]
[null,null,null,null,null,null,null,null,null,null,null,null,null,null,"j.","ALVENARIA AUTO-PORTANTE",null,null,0,null,null,null,null,0,null,null,0]
[null,null,null,null,null,null,null,null,null,null,null,null,null,null,"k.","IMPERMEABILIZAÇÃO",null,null,0,null,null,null,null,0,null,null,0]
[null,null,null,null,null,null,null,null,null,null,null,null,null,null,"l.","ISOLAMENTO TÉRMICO E ACÚSTICO",null,null,0,null,null,null,null,0,null,null,0]
[null,null,null,null,null,null,null,null,null,null,null,null,null,null,"m.","ESTRUTURA DE MADEIRA",null,null,0,null,null,null,null,0,null,null,0]
[null,null,null,null,null,null,null,null,null,null,null,null,null,null,"n.","ESTRUTURAS METÁLICAS",null,null,0,null,null,null,null,0,null,null,0]
[null,null,null,null,null,null,null,null,null,null,null,null,null,null,"o.","COBERTURAS",null,null,0,null,null,null,null,0,null,null,0]
[null,null,null,null,null,null,null,null,null,null,null,null,null,null,"p.","ESQUADRIAS DE MADEIRA",null,null,0,null,null,null,null,0,null,null,0]
[null,null,null,null,null,null,null,null,null,null,null,null,null,null,"q.","ESQUADRIAS METÁLICAS",null,null,0,null,null,null,null,{"$f":"ROUND(S946*(1+BDI.Taxa),2)","v":0},null,null,0]
[null,null,null,null,null,null,null,null,null,null,null,null,null,null,"r.","VIDROS",null,null,0,null,null,null,null,0,null,null,0]
[null,null,null,null,null,null,null,null,null,null,null,null,null,null,"s.","REVESTIMENTO DE PAREDE",null,null,0,null,null,null,null,0,null,null,0]
[null,null,null,null,null,null,null,null,null,null,null,null,null,null,"t.","FORROS",null,null,0,null,null,null,null,0,null,null,0]
[null,null,null,null,null,null,null,null,null,null,null,null,null,null,"u.","REVESTIMENTO DE PISO",null,null,0,null,null,null,null,0,null,null,0]
[null,null,null,null,null,null,null,null,null,null,null,null,null,null,"v.","FERRAGENS",null,null,0,null,null,null,null,0,null,null,0]
[null,null,null,null,null,null,null,null,null,null,null,null,null,null,"w.","MARCENARIA",null,null,0,null,null,null,null,0,null,null,0]
[null,null,null,null,null,null,null,null,null,null,null,null,null,null,"x.","ADMINISTRAÇÃO",null,null,0,null,null,null,null,0,null,null,0]
[null,null,null,null,null,null,null,null,null,null,null,null,null,null,"y.","PINTURA",null,null,0,null,null,null,null,{"$f":"ROUND(S954*(1+BDI.Taxa),2)","v":0},null,null,0]
[null,null,null,null,null,null,null,null,null,null,null,null,null,null,"z.","DIVERSOS",null,null,0,null,null,null,null,{"$f":"IF(S955>0,IF((SUM(X930:Y954)+ROUND(S955*(1+BDI.Taxa),2))<>X957,X957-SUM(X930:Y954),ROUND(S955*(1+BDI.Taxa),2)),0)","v":0},null,null,{"$f":"IF(S955>0,IF((SUM(AA930:AA954)+IFERROR(ROUND($X955*100/$Z$914,2),0))<>AA957,AA957-SUM(AA930:AA954),IFERROR(ROUND($X955*100/$Z$914,2),0)),0)","v":0}]
[null,null,null,null,null,null,null,null,null,null,null,null,null,null,"TOTAL GERAL DO ORÇAMENTO (R$)",null,null,null,{"$f":"SUM(S930:W955)","v":0},null,null,null,null,{"$f":"SUM(X930:Y955)","v":0},null,null,{"$f":"SUM(AA930:AA955)","v":0}]
[null,null,null,null,null,null,null,null,null,null,null,null,null,null,null,null,null,null,{"$f":"$Z$912","v":996414.63000000024},null,null,null,null,{"$f":"$Z$914","v":1199099.4900000002},null,null,100]
[null,null,null,null,null,null,null,null,null,null,null,null,null,null,null,null,null,null,"(TOTAL SEM BDI)",null,null,null,null,"(TOTAL COM BDI)",null,null,"(ARRED porcentagem)"]
[null,null,null,null,null,null,null,null,null,null,null,null,null,null,null,null,null,null,{"$f":"IF(AND(S956=S957,S956>0),\"OK\",\"ERRO\")","v":"ERRO"},null,null,null,null,{"$f":"IF(AND(X956=X957,X956>0),\"OK\",\"ERRO\")","v":"ERRO"},null,null,{"$f":"IF(AA956=100,\"OK\",\"ERRO\")","v":"ERRO"}]
[]
[]
[null,null,null,null,null,null,null,null,null,null,null,null,null,null,"RESUMO GERAL DO ORÇAMENTO"]
[null,null,null,null,null,null,null,null,null,null,null,null,null,null,"ITEM","DESCRIÇÃO DOS SERVIÇOS",null,null,"PREÇO SEM BDI",null,null,null,null,"PREÇO COM BDI",null,null,"PARTICIPAÇÃO ( % )"]
[null,null,null,null,null,null,null,null,null,null,null,null,null,null,"1.",{"$f":"IFERROR(VLOOKUP(O964,$O$19:$Y$911,4,FALSE),\"\")","v":"REFORMA"},null,null,{"$f":"IF(P965=\"\",$S$985-SUM(OFFSET($S$963:S963,0,0,COUNTA($S$963:S963),1)),SUMIF($R$19:$R$911,$P964,$Z$19:$Z$911))","v":0},null,null,null,null,{"$f":"IF(P965=\"\",$X$985-SUM(OFFSET($X$963:X963,0,0,COUNTA($X$963:X963),1)),ROUND(S964*(1+BDI.Taxa),2))","v":0},null,null,{"$f":"IF(P965=\"\",$AA$985-SUM(OFFSET($AA$963:AA963,0,0,COUNTA($AA$963:AA963),1)),ROUND(X964*100/ORÇAMENTO.TotalOrçamento,2))","v":0}]
[null,null,null,null,null,null,null,null,null,null,null,null,null,null,"2.","IMPLANTAÇÃO",null,null,{"$f":"IF(P966=\"\",$S$985-SUM(OFFSET($S$963:S964,0,0,COUNTA($S$963:S964),1)),SUMIF($R$19:$R$911,$P965,$Z$19:$Z$911))","v":0},null,null,null,null,{"$f":"IF(P966=\"\",$X$985-SUM(OFFSET($X$963:X964,0,0,COUNTA($X$963:X964),1)),ROUND(S965*(1+BDI.Taxa),2))","v":0},null,null,{"$f":"IF(P966=\"\",$AA$985-SUM(OFFSET($AA$963:AA964,0,0,COUNTA($AA$963:AA964),1)),ROUND(X965*100/ORÇAMENTO.TotalOrçamento,2))","v":0}]
[null,null,null,null,null,null,null,null,null,null,null,null,null,null,"3.","PASSARELA  COBERTA MODELO 2",null,null,{"$f":"IF(P967=\"\",$S$985-SUM(OFFSET($S$963:S965,0,0,COUNTA($S$963:S965),1)),SUMIF($R$19:$R$911,$P966,$Z$19:$Z$911))","v":0},null,null,null,null,{"$f":"IF(P967=\"\",$X$985-SUM(OFFSET($X$963:X965,0,0,COUNTA($X$963:X965),1)),ROUND(S966*(1+BDI.Taxa),2))","v":0},null,null,{"$f":"IF(P967=\"\",$AA$985-SUM(OFFSET($AA$963:AA965,0,0,COUNTA($AA$963:AA965),1)),ROUND(X966*100/ORÇAMENTO.TotalOrçamento,2))","v":0}]
[null,null,null,null,null,null,null,null,null,null,null,null,null,null,"4.","COZINHA COM REFEITÓRIO ",null,null,{"$f":"IF(P968=\"\",$S$985-SUM(OFFSET($S$963:S966,0,0,COUNTA($S$963:S966),1)),SUMIF($R$19:$R$911,$P967,$Z$19:$Z$911))","v":0},null,null,null,null,{"$f":"IF(P968=\"\",$X$985-SUM(OFFSET($X$963:X966,0,0,COUNTA($X$963:X966),1)),ROUND(S967*(1+BDI.Taxa),2))","v":0},null,null,{"$f":"IF(P968=\"\",$AA$985-SUM(OFFSET($AA$963:AA966,0,0,COUNTA($AA$963:AA966),1)),ROUND(X967*100/ORÇAMENTO.TotalOrçamento,2))","v":0}]
[null,null,null,null,null,null,null,null,null,null,null,null,null,null,"5.","PÁTIO MULTIUSO 3",null,null,{"$f":"IF(P969=\"\",$S$985-SUM(OFFSET($S$963:S967,0,0,COUNTA($S$963:S967),1)),SUMIF($R$19:$R$911,$P968,$Z$19:$Z$911))","v":0},null,null,null,null,{"$f":"IF(P969=\"\",$X$985-SUM(OFFSET($X$963:X967,0,0,COUNTA($X$963:X967),1)),ROUND(S968*(1+BDI.Taxa),2))","v":0},null,null,{"$f":"IF(P969=\"\",$AA$985-SUM(OFFSET($AA$963:AA967,0,0,COUNTA($AA$963:AA967),1)),ROUND(X968*100/ORÇAMENTO.TotalOrçamento,2))","v":0}]
[null,null,null,null,null,null,null,null,null,null,null,null,null,null,"6.","SANITÁRIOS",null,null,{"$f":"IF(P970=\"\",$S$985-SUM(OFFSET($S$963:S968,0,0,COUNTA($S$963:S968),1)),SUMIF($R$19:$R$911,$P969,$Z$19:$Z$911))","v":996414.63000000024},null,null,null,null,{"$f":"IF(P970=\"\",$X$985-SUM(OFFSET($X$963:X968,0,0,COUNTA($X$963:X968),1)),ROUND(S969*(1+BDI.Taxa),2))","v":1199099.4900000002},null,null,{"$f":"IF(P970=\"\",$AA$985-SUM(OFFSET($AA$963:AA968,0,0,COUNTA($AA$963:AA968),1)),ROUND(X969*100/ORÇAMENTO.TotalOrçamento,2))","v":100}]
[null,null,null,null,null,null,null,null,null,null,null,null,null,null,"7.","",null,null,{"$f":"IF(P971=\"\",$S$985-SUM(OFFSET($S$963:S969,0,0,COUNTA($S$963:S969),1)),SUMIF($R$19:$R$911,$P970,$Z$19:$Z$911))","v":0},null,null,null,null,{"$f":"IF(P971=\"\",$X$985-SUM(OFFSET($X$963:X969,0,0,COUNTA($X$963:X969),1)),ROUND(S970*(1+BDI.Taxa),2))","v":0},null,null,{"$f":"IF(P971=\"\",$AA$985-SUM(OFFSET($AA$963:AA969,0,0,COUNTA($AA$963:AA969),1)),ROUND(X970*100/ORÇAMENTO.TotalOrçamento,2))","v":0}]
[null,null,null,null,null,null,null,null,null,null,null,null,null,null,"8.","",null,null,{"$f":"IF(P972=\"\",$S$985-SUM(OFFSET($S$963:S970,0,0,COUNTA($S$963:S970),1)),SUMIF($R$19:$R$911,$P971,$Z$19:$Z$911))","v":0},null,null,null,null,{"$f":"IF(P972=\"\",$X$985-SUM(OFFSET($X$963:X970,0,0,COUNTA($X$963:X970),1)),ROUND(S971*(1+BDI.Taxa),2))","v":0},null,null,{"$f":"IF(P972=\"\",$AA$985-SUM(OFFSET($AA$963:AA970,0,0,COUNTA($AA$963:AA970),1)),ROUND(X971*100/ORÇAMENTO.TotalOrçamento,2))","v":0}]
[null,null,null,null,null,null,null,null,null,null,null,null,null,null,"9.","",null,null,{"$f":"IF(P973=\"\",$S$985-SUM(OFFSET($S$963:S971,0,0,COUNTA($S$963:S971),1)),SUMIF($R$19:$R$911,$P972,$Z$19:$Z$911))","v":0},null,null,null,null,{"$f":"IF(P973=\"\",$X$985-SUM(OFFSET($X$963:X971,0,0,COUNTA($X$963:X971),1)),ROUND(S972*(1+BDI.Taxa),2))","v":0},null,null,{"$f":"IF(P973=\"\",$AA$985-SUM(OFFSET($AA$963:AA971,0,0,COUNTA($AA$963:AA971),1)),ROUND(X972*100/ORÇAMENTO.TotalOrçamento,2))","v":0}]
[null,null,null,null,null,null,null,null,null,null,null,null,null,null,"10.","",null,null,{"$f":"IF(P974=\"\",$S$985-SUM(OFFSET($S$963:S972,0,0,COUNTA($S$963:S972),1)),SUMIF($R$19:$R$911,$P973,$Z$19:$Z$911))","v":0},null,null,null,null,{"$f":"IF(P974=\"\",$X$985-SUM(OFFSET($X$963:X972,0,0,COUNTA($X$963:X972),1)),ROUND(S973*(1+BDI.Taxa),2))","v":0},null,null,{"$f":"IF(P974=\"\",$AA$985-SUM(OFFSET($AA$963:AA972,0,0,COUNTA($AA$963:AA972),1)),ROUND(X973*100/ORÇAMENTO.TotalOrçamento,2))","v":0}]
[null,null,null,null,null,null,null,null,null,null,null,null,null,null,"11.","",null,null,{"$f":"IF(P975=\"\",$S$985-SUM(OFFSET($S$963:S973,0,0,COUNTA($S$963:S973),1)),SUMIF($R$19:$R$911,$P974,$Z$19:$Z$911))","v":0},null,null,null,null,{"$f":"IF(P975=\"\",$X$985-SUM(OFFSET($X$963:X973,0,0,COUNTA($X$963:X973),1)),ROUND(S974*(1+BDI.Taxa),2))","v":0},null,null,{"$f":"IF(P975=\"\",$AA$985-SUM(OFFSET($AA$963:AA973,0,0,COUNTA($AA$963:AA973),1)),ROUND(X974*100/ORÇAMENTO.TotalOrçamento,2))","v":0}]
[null,null,null,null,null,null,null,null,null,null,null,null,null,null,"12.","",null,null,{"$f":"IF(P976=\"\",$S$985-SUM(OFFSET($S$963:S974,0,0,COUNTA($S$963:S974),1)),SUMIF($R$19:$R$911,$P975,$Z$19:$Z$911))","v":0},null,null,null,null,{"$f":"IF(P976=\"\",$X$985-SUM(OFFSET($X$963:X974,0,0,COUNTA($X$963:X974),1)),ROUND(S975*(1+BDI.Taxa),2))","v":0},null,null,{"$f":"IF(P976=\"\",$AA$985-SUM(OFFSET($AA$963:AA974,0,0,COUNTA($AA$963:AA974),1)),ROUND(X975*100/ORÇAMENTO.TotalOrçamento,2))","v":0}]
[null,null,null,null,null,null,null,null,null,null,null,null,null,null,"13.","",null,null,{"$f":"IF(P977=\"\",$S$985-SUM(OFFSET($S$963:S975,0,0,COUNTA($S$963:S975),1)),SUMIF($R$19:$R$911,$P976,$Z$19:$Z$911))","v":0},null,null,null,null,{"$f":"IF(P977=\"\",$X$985-SUM(OFFSET($X$963:X975,0,0,COUNTA($X$963:X975),1)),ROUND(S976*(1+BDI.Taxa),2))","v":0},null,null,{"$f":"IF(P977=\"\",$AA$985-SUM(OFFSET($AA$963:AA975,0,0,COUNTA($AA$963:AA975),1)),ROUND(X976*100/ORÇAMENTO.TotalOrçamento,2))","v":0}]
[null,null,null,null,null,null,null,null,null,null,null,null,null,null,"14.","",null,null,{"$f":"IF(P978=\"\",$S$985-SUM(OFFSET($S$963:S976,0,0,COUNTA($S$963:S976),1)),SUMIF($R$19:$R$911,$P977,$Z$19:$Z$911))","v":0},null,null,null,null,{"$f":"IF(P978=\"\",$X$985-SUM(OFFSET($X$963:X976,0,0,COUNTA($X$963:X976),1)),ROUND(S977*(1+BDI.Taxa),2))","v":0},null,null,{"$f":"IF(P978=\"\",$AA$985-SUM(OFFSET($AA$963:AA976,0,0,COUNTA($AA$963:AA976),1)),ROUND(X977*100/ORÇAMENTO.TotalOrçamento,2))","v":0}]
[null,null,null,null,null,null,null,null,null,null,null,null,null,null,"15.","",null,null,{"$f":"IF(P979=\"\",$S$985-SUM(OFFSET($S$963:S977,0,0,COUNTA($S$963:S977),1)),SUMIF($R$19:$R$911,$P978,$Z$19:$Z$911))","v":0},null,null,null,null,{"$f":"IF(P979=\"\",$X$985-SUM(OFFSET($X$963:X977,0,0,COUNTA($X$963:X977),1)),ROUND(S978*(1+BDI.Taxa),2))","v":0},null,null,{"$f":"IF(P979=\"\",$AA$985-SUM(OFFSET($AA$963:AA977,0,0,COUNTA($AA$963:AA977),1)),ROUND(X978*100/ORÇAMENTO.TotalOrçamento,2))","v":0}]
[null,null,null,null,null,null,null,null,null,null,null,null,null,null,"16.","",null,null,{"$f":"IF(P980=\"\",$S$985-SUM(OFFSET($S$963:S978,0,0,COUNTA($S$963:S978),1)),SUMIF($R$19:$R$911,$P979,$Z$19:$Z$911))","v":0},null,null,null,null,{"$f":"IF(P980=\"\",$X$985-SUM(OFFSET($X$963:X978,0,0,COUNTA($X$963:X978),1)),ROUND(S979*(1+BDI.Taxa),2))","v":0},null,null,{"$f":"IF(P980=\"\",$AA$985-SUM(OFFSET($AA$963:AA978,0,0,COUNTA($AA$963:AA978),1)),ROUND(X979*100/ORÇAMENTO.TotalOrçamento,2))","v":0}]
[null,null,null,null,null,null,null,null,null,null,null,null,null,null,"17.","",null,null,{"$f":"IF(P981=\"\",$S$985-SUM(OFFSET($S$963:S979,0,0,COUNTA($S$963:S979),1)),SUMIF($R$19:$R$911,$P980,$Z$19:$Z$911))","v":0},null,null,null,null,{"$f":"IF(P981=\"\",$X$985-SUM(OFFSET($X$963:X979,0,0,COUNTA($X$963:X979),1)),ROUND(S980*(1+BDI.Taxa),2))","v":0},null,null,{"$f":"IF(P981=\"\",$AA$985-SUM(OFFSET($AA$963:AA979,0,0,COUNTA($AA$963:AA979),1)),ROUND(X980*100/ORÇAMENTO.TotalOrçamento,2))","v":0}]
[null,null,null,null,null,null,null,null,null,null,null,null,null,null,"18.","",null,null,{"$f":"IF(P982=\"\",$S$985-SUM(OFFSET($S$963:S980,0,0,COUNTA($S$963:S980),1)),SUMIF($R$19:$R$911,$P981,$Z$19:$Z$911))","v":0},null,null,null,null,{"$f":"IF(P982=\"\",$X$985-SUM(OFFSET($X$963:X980,0,0,COUNTA($X$963:X980),1)),ROUND(S981*(1+BDI.Taxa),2))","v":0},null,null,{"$f":"IF(P982=\"\",$AA$985-SUM(OFFSET($AA$963:AA980,0,0,COUNTA($AA$963:AA980),1)),ROUND(X981*100/ORÇAMENTO.TotalOrçamento,2))","v":0}]
[null,null,null,null,null,null,null,null,null,null,null,null,null,null,"19.","",null,null,{"$f":"IF(P983=\"\",$S$985-SUM(OFFSET($S$963:S981,0,0,COUNTA($S$963:S981),1)),SUMIF($R$19:$R$911,$P982,$Z$19:$Z$911))","v":0},null,null,null,null,{"$f":"IF(P983=\"\",$X$985-SUM(OFFSET($X$963:X981,0,0,COUNTA($X$963:X981),1)),ROUND(S982*(1+BDI.Taxa),2))","v":0},null,null,{"$f":"IF(P983=\"\",$AA$985-SUM(OFFSET($AA$963:AA981,0,0,COUNTA($AA$963:AA981),1)),ROUND(X982*100/ORÇAMENTO.TotalOrçamento,2))","v":0}]
[null,null,null,null,null,null,null,null,null,null,null,null,null,null,"20.","",null,null,{"$f":"IF(P984=\"\",$S$985-SUM(OFFSET($S$963:S982,0,0,COUNTA($S$963:S982),1)),SUMIF($R$19:$R$911,$P983,$Z$19:$Z$911))","v":0},null,null,null,null,{"$f":"IF(P984=\"\",$X$985-SUM(OFFSET($X$963:X982,0,0,COUNTA($X$963:X982),1)),ROUND(S983*(1+BDI.Taxa),2))","v":0},null,null,{"$f":"IF(P984=\"\",$AA$985-SUM(OFFSET($AA$963:AA982,0,0,COUNTA($AA$963:AA982),1)),ROUND(X983*100/ORÇAMENTO.TotalOrçamento,2))","v":0}]
[null,null,null,null,null,null,null,null,null,null,null,null,null,null,"TOTAL GERAL DO ORÇAMENTO (R$)",null,null,null,{"$f":"SUM(S964:W983)","v":996414.63000000024},null,null,null,null,{"$f":"SUM(X964:Y983)","v":1199099.4900000002},null,null,{"$f":"SUM(AA964:AA983)","v":100}]
[null,null,null,null,null,null,null,null,null,null,null,null,null,null,null,null,null,null,{"$f":"$Z$912","v":996414.63000000024},null,null,null,null,{"$f":"$Z$914","v":1199099.4900000002},null,null,100]
[null,null,null,null,null,null,null,null,null,null,null,null,null,null,null,null,null,null,"(TOTAL SEM BDI)",null,null,null,null,"(TOTAL COM BDI)",null,null,"(ARRED porcentagem)"]
[null,null,null,null,null,null,null,null,null,null,null,null,null,null,null,null,null,null,{"$f":"IF(AND(S984=S985,S984>0),\"OK\",\"ERRO\")","v":"OK"},null,null,null,null,{"$f":"IF(AND(X984=X985,X984>0),\"OK\",\"ERRO\")","v":"OK"},null,null,{"$f":"IF(AND(AA984=100,S964<>0),\"OK\",\"ERRO\")","v":"ERRO"}]

{"sheet":"Resumo ","index":1,"n_rows":39,"n_cols":9,"rows_kept":39,"cut":false,"hidden":false,"merged":[[42,3,42,7],[41,3,41,7],[38,1,38,8],[22,2,22,5],[23,2,23,5],[24,2,24,5],[25,2,25,5],[26,2,26,5],[32,2,32,5],[33,2,33,5],[34,2,34,5],[35,2,35,5],[27,2,27,5],[28,2,28,5],[29,2,29,5],[30,2,30,5],[31,2,31,5],[1,1,1,8],[2,6,2,8],[3,6,3,8],[4,1,4,8],[5,6,5,8],[6,6,6,8],[7,1,7,8],[8,6,8,8],[9,6,9,8],[13,1,13,8],[11,1,11,2],[12,1,12,2],[0,1,0,8],[36,1,36,5],[2,1,2,5],[3,1,3,5],[5,1,5,5],[6,1,6,5],[8,1,8,5],[9,1,9,5],[11,3,11,5],[12,3,12,5],[10,1,10,8],[11,6,11,8],[12,6,12,8],[19,2,19,5],[20,2,20,5],[21,2,21,5],[13,0,14,0],[15,2,15,5],[16,2,16,5],[17,2,17,5],[18,2,18,5],[14,1,14,8]]}
[]
[]
[null,"UNIDADE ESCOLAR",null,null,null,null,"CÓDIGO INEP"]
[null,{"$f":"Orçamento!$O$4","v":"CENTRO DE ENSINO EM PERÍODO INTEGRAL PRÉ-UNIVERSITÁRIO"},null,null,null,null,{"$f":"Orçamento!X4","v":52033570}]
[]
[null,"OBRA",null,null,null,null,"CIDADE"]
[null,{"$f":"Orçamento!$O$7","v":"REFORMA E AMPLIAÇÃO"},null,null,null,null,{"$f":"Orçamento!$X$7","v":"GOIÂNIA"}]
[]
[null,"ENDEREÇO",null,null,null,null,"CRE"]
[null,{"$f":"Orçamento!$R$10","v":"RUA 240 S/N, ST UNIVERSITARIO, CEP:74440-460"},null,null,null,null,{"$f":"Orçamento!$O$10","v":"GOIÂNIA"}]
[]
[null,"REFERÊNCIA",null,"DATA",null,null,"ÁREA TOTAL CONSTRUÍDA (M²)"]
[null,{"$f":"CONCATENATE(\"AGETOP E SINAPI - \",Orçamento!$Y$10)","v":"AGETOP E SINAPI - ONERADA"},null,{"$f":"Orçamento!$S$7","v":"2020-04-23"},null,null,{"$f":"Orçamento!$S$13","v":4643.25}]
["FILTRO"]
[null,"RESUMO GERAL DO ORÇAMENTO"]
["↓","ITEM","DESCRIÇÃO DOS SERVIÇOS",null,null,null,"PREÇO SEM BDI","PREÇO COM BDI","PARTICIP. (%)"]
[{"$f":"IF(G17>0,\"F\",\"\")","v":""},"1.",{"$f":"Orçamento!$P964","v":"REFORMA"},null,null,null,{"$f":"IFERROR(Orçamento!S964,\"-\")","v":0},{"$f":"IFERROR(Orçamento!X964,\"\")","v":0},{"$f":"Orçamento!AA964","v":0}]
[{"$f":"IF(G18>0,\"F\",\"\")","v":""},"2.",{"$f":"Orçamento!$P965","v":"IMPLANTAÇÃO"},null,null,null,{"$f":"IFERROR(Orçamento!S965,\"-\")","v":0},{"$f":"IFERROR(Orçamento!X965,\"\")","v":0},{"$f":"Orçamento!AA965","v":0}]
["","3.",{"$f":"Orçamento!$P966","v":"PASSARELA  COBERTA MODELO 2"},null,null,null,{"$f":"IFERROR(Orçamento!S966,\"-\")","v":0},{"$f":"IFERROR(Orçamento!X966,\"\")","v":0},{"$f":"Orçamento!AA966","v":0}]
["","4.",{"$f":"Orçamento!$P967","v":"COZINHA COM REFEITÓRIO "},null,null,null,{"$f":"IFERROR(Orçamento!S967,\"-\")","v":0},{"$f":"IFERROR(Orçamento!X967,\"\")","v":0},{"$f":"Orçamento!AA967","v":0}]
["","5.",{"$f":"Orçamento!$P968","v":"PÁTIO MULTIUSO 3"},null,null,null,{"$f":"IFERROR(Orçamento!S968,\"-\")","v":0},{"$f":"IFERROR(Orçamento!X968,\"\")","v":0},{"$f":"Orçamento!AA968","v":0}]
["F","6.",{"$f":"Orçamento!$P969","v":"SANITÁRIOS"},null,null,null,{"$f":"IFERROR(Orçamento!S969,\"-\")","v":996414.63000000024},{"$f":"IFERROR(Orçamento!X969,\"\")","v":1199099.4900000002},{"$f":"Orçamento!AA969","v":100}]
["","7.",{"$f":"Orçamento!$P970","v":""},null,null,null,{"$f":"IFERROR(Orçamento!S970,\"-\")","v":0},{"$f":"IFERROR(Orçamento!X970,\"\")","v":0},{"$f":"Orçamento!AA970","v":0}]
["","8.",{"$f":"Orçamento!$P971","v":""},null,null,null,{"$f":"IFERROR(Orçamento!S971,\"-\")","v":0},{"$f":"IFERROR(Orçamento!X971,\"\")","v":0},{"$f":"Orçamento!AA971","v":0}]
["","9.",{"$f":"Orçamento!$P972","v":""},null,null,null,{"$f":"IFERROR(Orçamento!S972,\"-\")","v":0},{"$f":"IFERROR(Orçamento!X972,\"\")","v":0},{"$f":"Orçamento!AA972","v":0}]
["","10.",{"$f":"Orçamento!$P973","v":""},null,null,null,{"$f":"IFERROR(Orçamento!S973,\"-\")","v":0},{"$f":"IFERROR(Orçamento!X973,\"\")","v":0},{"$f":"Orçamento!AA973","v":0}]
["","11.",{"$f":"Orçamento!$P974","v":""},null,null,null,{"$f":"IFERROR(Orçamento!S974,\"-\")","v":0},{"$f":"IFERROR(Orçamento!X974,\"\")","v":0},{"$f":"Orçamento!AA974","v":0}]
["","12.",{"$f":"Orçamento!$P975","v":""},null,null,null,{"$f":"IFERROR(Orçamento!S975,\"-\")","v":0},{"$f":"IFERROR(Orçamento!X975,\"\")","v":0},{"$f":"Orçamento!AA975","v":0}]
["","13.",{"$f":"Orçamento!$P976","v":""},null,null,null,{"$f":"IFERROR(Orçamento!S976,\"-\")","v":0},{"$f":"IFERROR(Orçamento!X976,\"\")","v":0},{"$f":"Orçamento!AA976","v":0}]
["","14.",{"$f":"Orçamento!$P977","v":""},null,null,null,{"$f":"IFERROR(Orçamento!S977,\"-\")","v":0},{"$f":"IFERROR(Orçamento!X977,\"\")","v":0},{"$f":"Orçamento!AA977","v":0}]
["","15.",{"$f":"Orçamento!$P978","v":""},null,null,null,{"$f":"IFERROR(Orçamento!S978,\"-\")","v":0},{"$f":"IFERROR(Orçamento!X978,\"\")","v":0},{"$f":"Orçamento!AA978","v":0}]
["","16.",{"$f":"Orçamento!$P979","v":""},null,null,null,{"$f":"IFERROR(Orçamento!S979,\"-\")","v":0},{"$f":"IFERROR(Orçamento!X979,\"\")","v":0},{"$f":"Orçamento!AA979","v":0}]
["","17.",{"$f":"Orçamento!$P980","v":""},null,null,null,{"$f":"IFERROR(Orçamento!S980,\"-\")","v":0},{"$f":"IFERROR(Orçamento!X980,\"\")","v":0},{"$f":"Orçamento!AA980","v":0}]
["","18.",{"$f":"Orçamento!$P981","v":""},null,null,null,{"$f":"IFERROR(Orçamento!S981,\"-\")","v":0},{"$f":"IFERROR(Orçamento!X981,\"\")","v":0},{"$f":"Orçamento!AA981","v":0}]
["","19.",{"$f":"Orçamento!$P982","v":""},null,null,null,{"$f":"IFERROR(Orçamento!S982,\"-\")","v":0},{"$f":"IFERROR(Orçamento!X982,\"\")","v":0},{"$f":"Orçamento!AA982","v":0}]
["","20.",{"$f":"Orçamento!$P983","v":""},null,null,null,{"$f":"IFERROR(Orçamento!S983,\"-\")","v":0},{"$f":"IFERROR(Orçamento!X983,\"\")","v":0},{"$f":"Orçamento!AA983","v":0}]
["F","TOTAL GERAL DO ORÇAMENTO (R$)",null,null,null,null,{"$f":"SUM(G17:G36)","v":996414.63000000024},{"$f":"SUM(H17:H36)","v":1199099.4900000002},{"$f":"SUM(I17:I36)","v":100}]
["F"]
["F"]

{"sheet":"Somatório","index":2,"n_rows":45,"n_cols":6,"rows_kept":45,"cut":false,"hidden":false,"merged":[[0,1,0,5],[14,1,14,5],[2,1,2,3],[2,4,2,5],[3,1,3,3],[3,4,3,5],[5,1,5,3],[5,4,5,5],[6,1,6,3],[6,4,6,5],[8,1,8,3],[8,4,8,5],[1,1,1,5],[4,1,4,5],[7,1,7,5],[10,1,10,5],[9,1,9,3],[9,4,9,5],[11,1,11,2],[11,4,11,5],[12,1,12,2],[12,4,12,5],[13,0,14,0],[42,1,42,2],[44,1,44,5],[47,3,47,5],[48,3,48,5],[13,1,13,5]]}
[]
[]
[null,"UNIDADE ESCOLAR",null,null,"CÓDIGO INEP"]
[null,{"$f":"Orçamento!$O$4","v":"CENTRO DE ENSINO EM PERÍODO INTEGRAL PRÉ-UNIVERSITÁRIO"},null,null,{"$f":"Orçamento!X4","v":52033570}]
[]
[null,"OBRA",null,null,"CIDADE"]
[null,{"$f":"Orçamento!$O$7","v":"REFORMA E AMPLIAÇÃO"},null,null,{"$f":"Orçamento!$X$7","v":"GOIÂNIA"}]
[]
[null,"ENDEREÇO",null,null,"CRE"]
[null,{"$f":"Orçamento!$R$10","v":"RUA 240 S/N, ST UNIVERSITARIO, CEP:74440-460"},null,null,{"$f":"Orçamento!$O$10","v":"GOIÂNIA"}]
[]
[null,"REFERÊNCIA",null,"DATA","ÁREA TOTAL CONSTRUÍDA (M²)"]
[null,{"$f":"CONCATENATE(\"AGETOP E SINAPI - \",Orçamento!$Y$10)","v":"AGETOP E SINAPI - ONERADA"},null,{"$f":"Orçamento!$S$7","v":"2020-04-23"},{"$f":"Orçamento!$S$13","v":4643.25}]
["FILTRO"]
[null,"SOMATÓRIO DE SERVIÇOS"]
["↓","ITEM","DESCRIÇÃO DOS SERVIÇOS","PREÇO SEM BDI (R$)","PREÇO COM BDI (R$)","PARTIC.  ( % )"]
[{"$f":"IF(D17>0,\"F\",\"\")","v":""},"a.",{"$f":"Orçamento!P930","v":"SERVIÇOS PRELIMINARES"},{"$f":"Orçamento!S930","v":0},{"$f":"Orçamento!X930","v":0},{"$f":"Orçamento!AA930","v":0}]
[{"$f":"IF(D18>0,\"F\",\"\")","v":""},"b.",{"$f":"Orçamento!P931","v":"TRANSPORTES"},{"$f":"Orçamento!S931","v":0},{"$f":"Orçamento!X931","v":0},{"$f":"Orçamento!AA931","v":0}]
["","c.",{"$f":"Orçamento!P932","v":"SERVIÇO EM TERRA"},{"$f":"Orçamento!S932","v":0},{"$f":"Orçamento!X932","v":0},{"$f":"Orçamento!AA932","v":0}]
["","d.",{"$f":"Orçamento!P933","v":"FUNDAÇÕES E SONDAGENS"},{"$f":"Orçamento!S933","v":0},{"$f":"Orçamento!X933","v":0},{"$f":"Orçamento!AA933","v":0}]
["","e.",{"$f":"Orçamento!P934","v":"ESTRUTURA"},{"$f":"Orçamento!S934","v":0},{"$f":"Orçamento!X934","v":0},{"$f":"Orçamento!AA934","v":0}]
["","f.",{"$f":"Orçamento!P935","v":"INSTALAÇÕES ELÉTRICAS"},{"$f":"Orçamento!S935","v":0},{"$f":"Orçamento!X935","v":0},{"$f":"Orçamento!AA935","v":0}]
["","g.",{"$f":"Orçamento!P936","v":"INSTALAÇÕES HIDROSSANITÁRIAS"},{"$f":"Orçamento!S936","v":0},{"$f":"Orçamento!X936","v":0},{"$f":"Orçamento!AA936","v":0}]
["","h",{"$f":"Orçamento!P937","v":"INSTALAÇÕES ESPECIAIS"},{"$f":"Orçamento!S937","v":0},{"$f":"Orçamento!X937","v":0},{"$f":"Orçamento!AA937","v":0}]
["","i.",{"$f":"Orçamento!P938","v":"ALVENARIAS E DIVISÓRIAS"},{"$f":"Orçamento!S938","v":0},{"$f":"Orçamento!X938","v":0},{"$f":"Orçamento!AA938","v":0}]
["","j.",{"$f":"Orçamento!P939","v":"ALVENARIA AUTO-PORTANTE"},{"$f":"Orçamento!S939","v":0},{"$f":"Orçamento!X939","v":0},{"$f":"Orçamento!AA939","v":0}]
["","k.",{"$f":"Orçamento!P940","v":"IMPERMEABILIZAÇÃO"},{"$f":"Orçamento!S940","v":0},{"$f":"Orçamento!X940","v":0},{"$f":"Orçamento!AA940","v":0}]
["","l.",{"$f":"Orçamento!P941","v":"ISOLAMENTO TÉRMICO E ACÚSTICO"},{"$f":"Orçamento!S941","v":0},{"$f":"Orçamento!X941","v":0},{"$f":"Orçamento!AA941","v":0}]
["","m.",{"$f":"Orçamento!P942","v":"ESTRUTURA DE MADEIRA"},{"$f":"Orçamento!S942","v":0},{"$f":"Orçamento!X942","v":0},{"$f":"Orçamento!AA942","v":0}]
["","n.",{"$f":"Orçamento!P943","v":"ESTRUTURAS METÁLICAS"},{"$f":"Orçamento!S943","v":0},{"$f":"Orçamento!X943","v":0},{"$f":"Orçamento!AA943","v":0}]
["","o.",{"$f":"Orçamento!P944","v":"COBERTURAS"},{"$f":"Orçamento!S944","v":0},{"$f":"Orçamento!X944","v":0},{"$f":"Orçamento!AA944","v":0}]
["","p.",{"$f":"Orçamento!P945","v":"ESQUADRIAS DE MADEIRA"},{"$f":"Orçamento!S945","v":0},{"$f":"Orçamento!X945","v":0},{"$f":"Orçamento!AA945","v":0}]
["","q.",{"$f":"Orçamento!P946","v":"ESQUADRIAS METÁLICAS"},{"$f":"Orçamento!S946","v":0},{"$f":"Orçamento!X946","v":0},{"$f":"Orçamento!AA946","v":0}]
["","r.",{"$f":"Orçamento!P947","v":"VIDROS"},{"$f":"Orçamento!S947","v":0},{"$f":"Orçamento!X947","v":0},{"$f":"Orçamento!AA947","v":0}]
["","s.",{"$f":"Orçamento!P948","v":"REVESTIMENTO DE PAREDE"},{"$f":"Orçamento!S948","v":0},{"$f":"Orçamento!X948","v":0},{"$f":"Orçamento!AA948","v":0}]
["","t.",{"$f":"Orçamento!P949","v":"FORROS"},{"$f":"Orçamento!S949","v":0},{"$f":"Orçamento!X949","v":0},{"$f":"Orçamento!AA949","v":0}]
["","u.",{"$f":"Orçamento!P950","v":"REVESTIMENTO DE PISO"},{"$f":"Orçamento!S950","v":0},{"$f":"Orçamento!X950","v":0},{"$f":"Orçamento!AA950","v":0}]
["","v.",{"$f":"Orçamento!P951","v":"FERRAGENS"},{"$f":"Orçamento!S951","v":0},{"$f":"Orçamento!X951","v":0},{"$f":"Orçamento!AA951","v":0}]
["","w.",{"$f":"Orçamento!P952","v":"MARCENARIA"},{"$f":"Orçamento!S952","v":0},{"$f":"Orçamento!X952","v":0},{"$f":"Orçamento!AA952","v":0}]
["","x.",{"$f":"Orçamento!P953","v":"ADMINISTRAÇÃO"},{"$f":"Orçamento!S953","v":0},{"$f":"Orçamento!X953","v":0},{"$f":"Orçamento!AA953","v":0}]
["","y.",{"$f":"Orçamento!P954","v":"PINTURA"},{"$f":"Orçamento!S954","v":0},{"$f":"Orçamento!X954","v":0},{"$f":"Orçamento!AA954","v":0}]
["","z.",{"$f":"Orçamento!P955","v":"DIVERSOS"},{"$f":"Orçamento!S955","v":0},{"$f":"Orçamento!X955","v":0},{"$f":"Orçamento!AA955","v":0}]
["F","TOTAL GERAL DO ORÇAMENTO",null,{"$f":"SUM(D17:D42)","v":0},{"$f":"SUM(E17:E42)","v":0},{"$f":"SUM(F17:F42)","v":0}]
[]
[null,"(*) Para itens da AGETOP, os vidros não estão inclusos nas esquadrias e já foram considerados os custos de contramarco para as esquadrias de alumínio;"]

{"sheet":"Cronog_120_Dias","index":3,"n_rows":99,"n_cols":22,"rows_kept":99,"cut":false,"hidden":false,"merged":[[86,13,86,16],[88,13,88,16],[89,13,89,16],[91,13,91,16],[92,13,92,16],[93,13,93,16],[94,13,94,16],[95,13,95,16],[73,13,73,16],[74,13,74,16],[76,13,76,16],[77,13,77,16],[79,13,79,16],[80,13,80,16],[82,13,82,16],[83,13,83,16],[85,13,85,16],[59,13,59,16],[61,13,61,16],[62,13,62,16],[64,13,64,16],[65,13,65,16],[67,13,67,16],[68,13,68,16],[70,13,70,16],[71,13,71,16],[40,13,40,16],[41,13,41,16],[43,13,43,16],[44,13,44,16],[46,13,46,16],[47,13,47,16],[49,13,49,16],[50,13,50,16],[52,13,52,16],[91,9,91,12],[92,9,92,12],[93,9,93,12],[94,9,94,12],[95,9,95,12],[12,13,12,16],[13,13,13,16],[14,13,14,16],[16,13,16,16],[17,13,17,16],[19,13,19,16],[20,13,20,16],[22,13,22,16],[23,13,23,16],[25,13,25,16],[26,13,26,16],[28,13,28,16],[29,13,29,16],[31,13,31,16],[32,13,32,16],[34,13,34,16],[35,13,35,16],[37,13,37,16],[38,13,38,16],[73,9,73,12],[74,9,74,12],[76,9,76,12],[77,9,77,12],[79,9,79,12],[80,9,80,12],[82,9,82,12],[83,9,83,12],[85,9,85,12],[59,9,59,12],[61,9,61,12],[62,9,62,12],[64,9,64,12],[65,9,65,12],[67,9,67,12],[68,9,68,12],[70,9,70,12],[71,9,71,12],[40,9,40,12],[41,9,41,12],[43,9,43,12],[44,9,44,12],[46,9,46,12],[47,9,47,12],[49,9,49,12],[50,9,50,12],[52,9,52,12],[12,9,12,12],[13,9,13,12],[14,9,14,12],[16,9,16,12],[17,9,17,12],[19,9,19,12],[20,9,20,12],[22,9,22,12],[23,9,23,12],[0,1,0,21],[2,1,2,7],[3,1,3,7],[5,1,5,7],[6,1,6,7],[8,1,8,7],[9,1,9,7],[1,1,1,21],[7,1,7,21],[4,1,4,21],[10,1,10,21],[9,8,9,21],[8,8,8,21],[3,8,3,21],[6,8,6,21],[5,8,5,21],[2,8,2,21],[50,1,52,2],[71,3,73,3],[12,21,13,21],[13,1,13,2],[13,5,13,8],[13,17,13,20],[12,3,13,3],[12,17,12,20],[14,1,16,2],[12,5,12,8],[17,1,19,2],[17,4,19,4],[17,5,17,8],[17,17,17,20],[19,5,19,8],[19,17,19,20],[20,1,22,2],[65,1,67,2],[68,3,70,3],[62,3,64,3],[68,1,70,2],[56,3,58,3],[65,4,67,4],[74,3,76,3],[50,4,52,4],[74,4,76,4],[56,1,58,2],[56,4,58,4],[50,3,52,3],[53,3,55,3],[68,4,70,4],[62,1,64,2],[62,4,64,4],[59,3,61,3],[53,1,55,2],[53,4,55,4],[59,1,61,2],[59,4,61,4],[74,1,76,2],[20,4,22,4],[20,5,20,8],[20,17,20,20],[22,5,22,8],[22,17,22,20],[20,3,22,3],[14,3,16,3],[17,3,19,3],[14,4,16,4],[14,5,14,8],[14,17,14,20],[16,5,16,8],[16,17,16,20],[23,17,23,20],[25,5,25,8],[25,17,25,20],[26,1,28,2],[26,4,28,4],[26,5,26,8],[26,17,26,20],[28,5,28,8],[28,17,28,20],[23,3,25,3],[23,1,25,2],[23,4,25,4],[23,5,23,8],[26,3,28,3],[25,9,25,12],[26,9,26,12],[28,9,28,12],[29,17,29,20],[31,5,31,8],[31,17,31,20],[32,1,34,2],[32,4,34,4],[32,5,32,8],[32,17,32,20],[34,5,34,8],[34,17,34,20],[32,3,34,3],[29,5,29,8],[29,1,31,2],[29,4,31,4],[29,3,31,3],[29,9,29,12],[31,9,31,12],[32,9,32,12],[34,9,34,12],[35,17,35,20],[37,5,37,8],[37,17,37,20],[35,3,37,3],[40,17,40,20],[38,3,40,3],[38,17,38,20],[41,1,43,2],[41,4,43,4],[41,5,41,8],[41,17,41,20],[43,5,43,8],[43,17,43,20],[41,3,43,3],[35,5,35,8],[38,5,38,8],[40,5,40,8],[35,1,37,2],[35,4,37,4],[38,1,40,2],[38,4,40,4],[35,9,35,12],[37,9,37,12],[38,9,38,12],[44,17,44,20],[46,5,46,8],[46,17,46,20],[47,1,49,2],[47,4,49,4],[47,5,47,8],[47,17,47,20],[49,5,49,8],[49,17,49,20],[44,5,44,8],[47,3,49,3],[44,3,46,3],[44,1,46,2],[44,4,46,4],[53,17,53,20],[55,5,55,8],[55,17,55,20],[50,5,50,8],[50,17,50,20],[52,5,52,8],[52,17,52,20],[56,17,56,20],[58,5,58,8],[58,17,58,20],[53,5,53,8],[56,5,56,8],[53,9,53,12],[55,9,55,12],[56,9,56,12],[58,9,58,12],[53,13,53,16],[55,13,55,16],[56,13,56,16],[58,13,58,16],[68,5,68,8],[65,5,65,8],[65,17,65,20],[67,5,67,8],[67,17,67,20],[65,3,67,3],[62,17,62,20],[64,5,64,8],[64,17,64,20],[62,5,62,8],[95,1,95,2],[95,5,95,8],[95,17,95,20],[97,1,97,4],[98,1,98,21],[86,17,86,20],[88,5,88,8],[88,17,88,20],[85,5,85,8],[85,17,85,20],[89,1,91,2],[89,4,91,4],[89,5,89,8],[89,17,89,20],[91,5,91,8],[91,17,91,20],[89,3,91,3],[86,4,88,4],[86,5,86,8],[86,3,88,3],[83,1,85,2],[83,4,85,4],[83,5,83,8],[83,17,83,20],[94,1,94,2],[94,5,94,8],[94,17,94,20],[76,5,76,8],[76,17,76,20],[77,5,77,8],[77,17,77,20],[79,5,79,8],[79,17,79,20],[80,5,80,8],[80,17,80,20],[82,5,82,8],[82,17,82,20],[77,3,79,3],[80,3,82,3],[86,1,88,2],[80,4,82,4],[83,3,85,3],[77,1,79,2],[77,4,79,4],[80,1,82,2],[86,9,86,12],[88,9,88,12],[89,9,89,12],[12,0,13,0],[9,0,11,0],[11,1,11,21],[92,1,92,2],[92,5,92,8],[92,17,92,20],[93,1,93,2],[93,5,93,8],[93,17,93,20],[74,17,74,20],[74,5,74,8],[68,17,68,20],[70,5,70,8],[70,17,70,20],[59,5,59,8],[71,1,73,2],[71,4,73,4],[71,5,71,8],[71,17,71,20],[73,5,73,8],[73,17,73,20],[59,17,59,20],[61,5,61,8],[61,17,61,20]]}
[]
[]
[null,"UNIDADE ESCOLAR",null,null,null,null,null,null,"PRAZO"]
[null,{"$f":"Orçamento!$O$4","v":"CENTRO DE ENSINO EM PERÍODO INTEGRAL PRÉ-UNIVERSITÁRIO"},null,null,null,null,null,null,"120 DIAS CORRIDOS"]
[]
[null,"OBRA",null,null,null,null,null,null,"DATA"]
[null,{"$f":"Orçamento!$O$7","v":"REFORMA E AMPLIAÇÃO"},null,null,null,null,null,null,{"$f":"Orçamento!$S$7","v":"2020-04-23"}]
[]
[null,"LOCAL",null,null,null,null,null,null,"ÁREA TOTAL CONSTRUÍDA (M²)"]
["FILTRO",{"$f":"Orçamento!$X$7","v":"GOIÂNIA"},null,null,null,null,null,null,{"$f":"Orçamento!$S$13","v":4643.25}]
[]
[null,"CRONOGRAMA - FÍSICO FINANCEIRO"]
["↓","CUSTO TOTAL:",{"$f":"D93","v":0},"VALOR","Dias:",30,null,null,null,60,null,null,null,90,null,null,null,120,null,null,null,"TOTAL"]
[null,"DESCRIÇÃO DOS SERVIÇOS",null,null,"%","1ª PARCELA",null,null,null,"2ª PARCELA",null,null,null,"2ª PARCELA",null,null,null,"2ª PARCELA"]
[{"$f":"IF(D15>0,\"F\",\"\")","v":""},"SERVIÇOS PRELIMINARES",null,{"$f":"Orçamento!X930","v":0},{"$f":"Orçamento!AA930","v":0},{"$f":"ROUND(F17*$D$15,2)+0.01","v":0.01},null,null,null,{"$f":"ROUND(J17*$D$15,2)","v":0},null,null,null,{"$f":"ROUND(N17*$D$15,2)","v":0},null,null,null,{"$f":"ROUND(R17*$D$15,2)","v":0},null,null,null,{"$f":"SUM(F15:U15)","v":0.01}]
[{"$f":"IF(A15=\"F\",A15,\"\")","v":""}]
[{"$f":"IF(A16=\"F\",A16,\"\")","v":""},null,null,null,null,0.27,null,null,null,0.23,null,null,null,0.26,null,null,null,0.24,null,null,null,{"$f":"IFERROR(E15/100,\"\")","v":0}]
[{"$f":"IF(D18>0,\"F\",\"\")","v":""},"TRANSPORTES",null,{"$f":"Orçamento!X931","v":0},{"$f":"Orçamento!AA931","v":0},{"$f":"ROUND(F20*$D$18,2)-0.01","v":-0.01},null,null,null,{"$f":"ROUND(J20*$D$18,2)","v":0},null,null,null,{"$f":"ROUND(N20*$D$18,2)","v":0},null,null,null,{"$f":"ROUND(R20*$D$18,2)","v":0},null,null,null,{"$f":"SUM(F18:U18)","v":-0.01}]
[{"$f":"IF(A18=\"F\",A18,\"\")","v":""}]
[{"$f":"IF(A19=\"F\",A19,\"\")","v":""},null,null,null,null,0.5,null,null,null,0.2,null,null,null,0.19,null,null,null,0.11,null,null,null,{"$f":"IFERROR(E18/100,\"\")","v":0}]
[{"$f":"IF(D21>0,\"F\",\"\")","v":""},"SERVIÇO EM TERRA",null,{"$f":"Orçamento!X932","v":0},{"$f":"Orçamento!AA932","v":0},{"$f":"ROUND(F23*$D$21,2)","v":0},null,null,null,{"$f":"ROUND(J23*$D$21,2)","v":0},null,null,null,{"$f":"ROUND(N23*$D$21,2)","v":0},null,null,null,{"$f":"ROUND(R23*$D$21,2)","v":0},null,null,null,{"$f":"SUM(F21:U21)","v":0}]
[{"$f":"IF(A21=\"F\",A21,\"\")","v":""}]
[{"$f":"IF(A22=\"F\",A22,\"\")","v":""},null,null,null,null,0.8,null,null,null,0.2,null,null,null,null,null,null,null,null,null,null,null,{"$f":"IFERROR(E21/100,\"\")","v":0}]
[{"$f":"IF(D24>0,\"F\",\"\")","v":""},"FUNDAÇÕES E SONDAGENS",null,{"$f":"Orçamento!X933","v":0},{"$f":"Orçamento!AA933","v":0},{"$f":"ROUND(F26*$D$24,2)","v":0},null,null,null,{"$f":"ROUND(J26*$D$24,2)","v":0},null,null,null,{"$f":"ROUND(N26*$D$24,2)","v":0},null,null,null,{"$f":"ROUND(R26*$D$24,2)","v":0},null,null,null,{"$f":"SUM(F24:U24)","v":0}]
[{"$f":"IF(A24=\"F\",A24,\"\")","v":""}]
[{"$f":"IF(A25=\"F\",A25,\"\")","v":""},null,null,null,null,0.8,null,null,null,0.2,null,null,null,null,null,null,null,null,null,null,null,{"$f":"IFERROR(E24/100,\"\")","v":0}]
[{"$f":"IF(D27>0,\"F\",\"\")","v":""},"ESTRUTURA",null,{"$f":"Orçamento!X934","v":0},{"$f":"Orçamento!AA934","v":0},{"$f":"ROUND(F29*$D$27,2)","v":0},null,null,null,{"$f":"ROUND(J29*$D$27,2)","v":0},null,null,null,{"$f":"ROUND(N29*$D$27,2)","v":0},null,null,null,{"$f":"ROUND(R29*$D$27,2)","v":0},null,null,null,{"$f":"SUM(F27:U27)","v":0}]
[{"$f":"IF(A27=\"F\",A27,\"\")","v":""}]
[{"$f":"IF(A28=\"F\",A28,\"\")","v":""},null,null,null,null,0.2,null,null,null,0.8,null,null,null,null,null,null,null,null,null,null,null,{"$f":"IFERROR(E27/100,\"\")","v":0}]
[{"$f":"IF(D30>0,\"F\",\"\")","v":""},"INST.ELET/TELEFÔNICA/CABEAMENTO ESTRUTURADO",null,{"$f":"Orçamento!X935","v":0},{"$f":"Orçamento!AA935","v":0},{"$f":"ROUND(F32*$D$30,2)","v":0},null,null,null,{"$f":"ROUND(J32*$D$30,2)","v":0},null,null,null,{"$f":"ROUND(N32*$D$30,2)+0.01","v":0.01},null,null,null,{"$f":"ROUND(R32*$D$30,2)","v":0},null,null,null,{"$f":"SUM(F30:U30)","v":0.01}]
[{"$f":"IF(A30=\"F\",A30,\"\")","v":""}]
[{"$f":"IF(A31=\"F\",A31,\"\")","v":""},null,null,null,null,0.2,null,null,null,0.3,null,null,null,0.3,null,null,null,0.2,null,null,null,{"$f":"IFERROR(E30/100,\"\")","v":0}]
[{"$f":"IF(D33>0,\"F\",\"\")","v":""},"INSTALAÇÕES HIDROSSANITÁRIAS",null,{"$f":"Orçamento!X936","v":0},{"$f":"Orçamento!AA936","v":0},{"$f":"ROUND(F35*$D$33,2)","v":0},null,null,null,{"$f":"ROUND(J35*$D$33,2)-0.01","v":-0.01},null,null,null,{"$f":"ROUND(N35*$D$33,2)","v":0},null,null,null,{"$f":"ROUND(R35*$D$33,2)","v":0},null,null,null,{"$f":"SUM(F33:U33)","v":-0.01}]
[{"$f":"IF(A33=\"F\",A33,\"\")","v":""}]
[{"$f":"IF(A34=\"F\",A34,\"\")","v":""},null,null,null,null,0.2,null,null,null,0.31,null,null,null,0.28999999999999998,null,null,null,0.2,null,null,null,{"$f":"IFERROR(E33/100,\"\")","v":0}]
[{"$f":"IF(D36>0,\"F\",\"\")","v":""},"INSTALAÇÕES ESPECIAIS",null,{"$f":"Orçamento!X937","v":0},{"$f":"Orçamento!AA937","v":0},{"$f":"ROUND(F38*$D$36,2)","v":0},null,null,null,{"$f":"ROUND(J38*$D$36,2)","v":0},null,null,null,{"$f":"ROUND(N38*$D$36,2)","v":0},null,null,null,{"$f":"ROUND(R38*$D$36,2)","v":0},null,null,null,{"$f":"SUM(F36:U36)","v":0}]
[{"$f":"IF(A36=\"F\",A36,\"\")","v":""}]
[{"$f":"IF(A37=\"F\",A37,\"\")","v":""},null,null,null,null,null,null,null,null,null,null,null,null,null,null,null,null,1,null,null,null,{"$f":"IFERROR(E36/100,\"\")","v":0}]
[{"$f":"IF(D39>0,\"F\",\"\")","v":""},"ALVENARIA E DIVISÓRIAS",null,{"$f":"Orçamento!X938","v":0},{"$f":"Orçamento!AA938","v":0},{"$f":"ROUND(F41*$D$39,2)","v":0},null,null,null,{"$f":"ROUND(J41*$D$39,2)","v":0},null,null,null,{"$f":"ROUND(N41*$D$39,2)","v":0},null,null,null,{"$f":"ROUND(R41*$D$39,2)","v":0},null,null,null,{"$f":"SUM(F39:U39)","v":0}]
[{"$f":"IF(A39=\"F\",A39,\"\")","v":""}]
[{"$f":"IF(A40=\"F\",A40,\"\")","v":""},null,null,null,null,null,null,null,null,0.6,null,null,null,0.4,null,null,null,null,null,null,null,{"$f":"IFERROR(E39/100,\"\")","v":0}]
[{"$f":"IF(D42>0,\"F\",\"\")","v":""},"ALVENARIA AUTO-PORTANTE",null,{"$f":"Orçamento!X939","v":0},{"$f":"Orçamento!AA939","v":0},{"$f":"ROUND(F44*$D$42,2)","v":0},null,null,null,{"$f":"ROUND(J44*$D$42,2)","v":0},null,null,null,{"$f":"ROUND(N44*$D$42,2)","v":0},null,null,null,{"$f":"ROUND(R44*$D$42,2)","v":0},null,null,null,{"$f":"SUM(F42:U42)","v":0}]
[{"$f":"IF(A42=\"F\",A42,\"\")","v":""}]
[{"$f":"IF(A43=\"F\",A43,\"\")","v":""},null,null,null,null,1,null,null,null,{"$f":"1-B44","v":1},null,null,null,{"$f":"1-B44","v":1},null,null,null,{"$f":"1-F44","v":0},null,null,null,{"$f":"IFERROR(E42/100,\"\")","v":0}]
[{"$f":"IF(D45>0,\"F\",\"\")","v":""},"IMPERMEABILIZAÇÃO",null,{"$f":"Orçamento!X940","v":0},{"$f":"Orçamento!AA940","v":0},{"$f":"ROUND(F47*$D$45,2)","v":0},null,null,null,{"$f":"ROUND(J47*$D$45,2)","v":0},null,null,null,{"$f":"ROUND(N47*$D$45,2)","v":0},null,null,null,{"$f":"ROUND(R47*$D$45,2)","v":0},null,null,null,{"$f":"SUM(F45:U45)","v":0}]
[{"$f":"IF(A45=\"F\",A45,\"\")","v":""}]
[{"$f":"IF(A46=\"F\",A46,\"\")","v":""},null,null,null,null,0.8,null,null,null,0.2,null,null,null,null,null,null,null,null,null,null,null,{"$f":"IFERROR(E45/100,\"\")","v":0}]
[{"$f":"IF(D48>0,\"F\",\"\")","v":""},"ISOLAMENTO TÉRMICO E ACÚSTICO",null,{"$f":"Orçamento!X941","v":0},{"$f":"Orçamento!AA941","v":0},{"$f":"ROUND(F50*$D$48,2)","v":0},null,null,null,{"$f":"ROUND(J50*$D$48,2)","v":0},null,null,null,{"$f":"ROUND(N50*$D$48,2)","v":0},null,null,null,{"$f":"ROUND(R50*$D$48,2)","v":0},null,null,null,{"$f":"SUM(F48:U48)","v":0}]
[{"$f":"IF(A48=\"F\",A48,\"\")","v":""}]
[{"$f":"IF(A49=\"F\",A49,\"\")","v":""},null,null,null,null,0.5,null,null,null,{"$f":"1-B50","v":1},null,null,null,{"$f":"1-B50","v":1},null,null,null,{"$f":"1-F50","v":0.5},null,null,null,{"$f":"IFERROR(E48/100,\"\")","v":0}]
[{"$f":"IF(D51>0,\"F\",\"\")","v":""},"ESTRUTURA DE MADEIRA",null,{"$f":"Orçamento!X942","v":0},{"$f":"Orçamento!AA942","v":0},{"$f":"ROUND(F53*$D$51,2)","v":0},null,null,null,{"$f":"ROUND(J53*$D$51,2)","v":0},null,null,null,{"$f":"ROUND(N53*$D$51,2)","v":0},null,null,null,{"$f":"ROUND(R53*$D$51,2)","v":0},null,null,null,{"$f":"SUM(F51:U51)","v":0}]
[{"$f":"IF(A51=\"F\",A51,\"\")","v":""}]
[{"$f":"IF(A52=\"F\",A52,\"\")","v":""},null,null,null,null,null,null,null,null,1,null,null,null,null,null,null,null,null,null,null,null,{"$f":"IFERROR(E51/100,\"\")","v":0}]
[{"$f":"IF(D54>0,\"F\",\"\")","v":""},"ESTRUTURA METÁLICA",null,{"$f":"Orçamento!X943","v":0},{"$f":"Orçamento!AA943","v":0},{"$f":"ROUND(F56*$D$54,2)","v":0},null,null,null,{"$f":"ROUND(J56*$D$54,2)","v":0},null,null,null,{"$f":"ROUND(N56*$D$54,2)","v":0},null,null,null,{"$f":"ROUND(R56*$D$54,2)","v":0},null,null,null,{"$f":"SUM(F54:U54)","v":0}]
[{"$f":"IF(A54=\"F\",A54,\"\")","v":""}]
[{"$f":"IF(A55=\"F\",A55,\"\")","v":""},null,null,null,null,0.2,null,null,null,0.8,null,null,null,null,null,null,null,null,null,null,null,{"$f":"IFERROR(E54/100,\"\")","v":0}]
[{"$f":"IF(D57>0,\"F\",\"\")","v":""},"COBERTURAS",null,{"$f":"Orçamento!X944","v":0},{"$f":"Orçamento!AA944","v":0},{"$f":"ROUND(F59*$D$57,2)","v":0},null,null,null,{"$f":"ROUND(J59*$D$57,2)","v":0},null,null,null,{"$f":"ROUND(N59*$D$57,2)","v":0},null,null,null,{"$f":"ROUND(R59*$D$57,2)","v":0},null,null,null,{"$f":"SUM(F57:U57)","v":0}]
[{"$f":"IF(A57=\"F\",A57,\"\")","v":""}]
[{"$f":"IF(A58=\"F\",A58,\"\")","v":""},null,null,null,null,0,null,null,null,0.25,null,null,null,0.6,null,null,null,0.15,null,null,null,{"$f":"IFERROR(E57/100,\"\")","v":0}]
[{"$f":"IF(D60>0,\"F\",\"\")","v":""},"ESQUADRIAS DE MADEIRA",null,{"$f":"Orçamento!X945","v":0},{"$f":"Orçamento!AA945","v":0},{"$f":"ROUND(F62*$D$60,2)","v":0},null,null,null,{"$f":"ROUND(J62*$D$60,2)","v":0},null,null,null,{"$f":"ROUND(N62*$D$60,2)","v":0},null,null,null,{"$f":"ROUND(R62*$D$60,2)","v":0},null,null,null,{"$f":"SUM(F60:U60)","v":0}]
[{"$f":"IF(A60=\"F\",A60,\"\")","v":""}]
[{"$f":"IF(A61=\"F\",A61,\"\")","v":""},null,null,null,null,0.54,null,null,null,{"$f":"1-B62","v":1},null,null,null,{"$f":"1-B62","v":1},null,null,null,{"$f":"1-F62","v":0.45999999999999996},null,null,null,{"$f":"IFERROR(E60/100,\"\")","v":0}]
[{"$f":"IF(D63>0,\"F\",\"\")","v":""},"ESQUADRIAS METÁLICAS",null,{"$f":"Orçamento!X946","v":0},{"$f":"Orçamento!AA946","v":0},{"$f":"ROUND(F65*$D$63,2)","v":0},null,null,null,{"$f":"ROUND(J65*$D$63,2)","v":0},null,null,null,{"$f":"ROUND(N65*$D$63,2)","v":0},null,null,null,{"$f":"ROUND(R65*$D$63,2)","v":0},null,null,null,{"$f":"SUM(F63:U63)","v":0}]
[{"$f":"IF(A63=\"F\",A63,\"\")","v":""}]
[{"$f":"IF(A64=\"F\",A64,\"\")","v":""},null,null,null,null,null,null,null,null,null,null,null,null,null,null,null,null,{"$f":"1-F65","v":1},null,null,null,{"$f":"IFERROR(E63/100,\"\")","v":0}]
[{"$f":"IF(D66>0,\"F\",\"\")","v":""},"VIDROS",null,{"$f":"Orçamento!X947","v":0},{"$f":"Orçamento!AA947","v":0},{"$f":"ROUND(F68*$D$66,2)","v":0},null,null,null,{"$f":"ROUND(J68*$D$66,2)","v":0},null,null,null,{"$f":"ROUND(N68*$D$66,2)","v":0},null,null,null,{"$f":"ROUND(R68*$D$66,2)","v":0},null,null,null,{"$f":"SUM(F66:U66)","v":0}]
[{"$f":"IF(A66=\"F\",A66,\"\")","v":""}]
[{"$f":"IF(A67=\"F\",A67,\"\")","v":""},null,null,null,null,0,null,null,null,null,null,null,null,null,null,null,null,{"$f":"1-F68","v":1},null,null,null,{"$f":"IFERROR(E66/100,\"\")","v":0}]
[{"$f":"IF(D69>0,\"F\",\"\")","v":""},"REVESTIMENTO DE PAREDE",null,{"$f":"Orçamento!X948","v":0},{"$f":"Orçamento!AA948","v":0},{"$f":"ROUND(F71*$D$69,2)","v":0},null,null,null,{"$f":"ROUND(J71*$D$69,2)","v":0},null,null,null,{"$f":"ROUND(N71*$D$69,2)","v":0},null,null,null,{"$f":"ROUND(R71*$D$69,2)","v":0},null,null,null,{"$f":"SUM(F69:U69)","v":0}]
[{"$f":"IF(A69=\"F\",A69,\"\")","v":""}]
[{"$f":"IF(A70=\"F\",A70,\"\")","v":""},null,null,null,null,null,null,null,null,0.6,null,null,null,0.4,null,null,null,null,null,null,null,{"$f":"IFERROR(E69/100,\"\")","v":0}]
[{"$f":"IF(D72>0,\"F\",\"\")","v":""},"FORROS",null,{"$f":"Orçamento!X949","v":0},{"$f":"Orçamento!AA949","v":0},{"$f":"ROUND(F74*$D$72,2)","v":0},null,null,null,{"$f":"ROUND(J74*$D$72,2)","v":0},null,null,null,{"$f":"ROUND(N74*$D$72,2)","v":0},null,null,null,{"$f":"ROUND(R74*$D$72,2)","v":0},null,null,null,{"$f":"SUM(F72:U72)","v":0}]
[{"$f":"IF(A72=\"F\",A72,\"\")","v":""}]
[{"$f":"IF(A73=\"F\",A73,\"\")","v":""},null,null,null,null,null,null,null,null,null,null,null,null,null,null,null,null,{"$f":"1-F74","v":1},null,null,null,{"$f":"IFERROR(E72/100,\"\")","v":0}]
[{"$f":"IF(D75>0,\"F\",\"\")","v":""},"REVESTIMENTO DE PISO",null,{"$f":"Orçamento!X950","v":0},{"$f":"Orçamento!AA950","v":0},{"$f":"ROUND(F77*$D$75,2)","v":0},null,null,null,{"$f":"ROUND(J77*$D$75,2)","v":0},null,null,null,{"$f":"ROUND(N77*$D$75,2)","v":0},null,null,null,{"$f":"ROUND(R77*$D$75,2)","v":0},null,null,null,{"$f":"SUM(F75:U75)","v":0}]
[{"$f":"IF(A75=\"F\",A75,\"\")","v":""}]
[{"$f":"IF(A76=\"F\",A76,\"\")","v":""},null,null,null,null,0.21,null,null,null,0.28999999999999998,null,null,null,0.4,null,null,null,0.1,null,null,null,{"$f":"IFERROR(E75/100,\"\")","v":0}]
[{"$f":"IF(D78>0,\"F\",\"\")","v":""},"FERRAGENS",null,{"$f":"Orçamento!X951","v":0},{"$f":"Orçamento!AA951","v":0},{"$f":"ROUND(F80*$D$78,2)","v":0},null,null,null,{"$f":"ROUND(J80*$D$78,2)","v":0},null,null,null,{"$f":"ROUND(N80*$D$78,2)","v":0},null,null,null,{"$f":"ROUND(R80*$D$78,2)","v":0},null,null,null,{"$f":"SUM(F78:U78)","v":0}]
[{"$f":"IF(A78=\"F\",A78,\"\")","v":""}]
[{"$f":"IF(A79=\"F\",A79,\"\")","v":""},null,null,null,null,0,null,null,null,null,null,null,null,null,null,null,null,{"$f":"1-F80","v":1},null,null,null,{"$f":"IFERROR(E78/100,\"\")","v":0}]
[{"$f":"IF(D81>0,\"F\",\"\")","v":""},"MARCENARIA",null,{"$f":"Orçamento!X952","v":0},{"$f":"Orçamento!AA952","v":0},{"$f":"ROUND(F83*$D$81,2)","v":0},null,null,null,{"$f":"ROUND(J83*$D$81,2)","v":0},null,null,null,{"$f":"ROUND(N83*$D$81,2)","v":0},null,null,null,{"$f":"ROUND(R83*$D$81,2)-0.01","v":-0.01},null,null,null,{"$f":"SUM(F81:U81)","v":-0.01}]
[{"$f":"IF(A81=\"F\",A81,\"\")","v":""}]
[{"$f":"IF(A82=\"F\",A82,\"\")","v":""},null,null,null,null,null,null,null,null,null,null,null,null,0.3,null,null,null,0.7,null,null,null,{"$f":"IFERROR(E81/100,\"\")","v":0}]
[{"$f":"IF(D84>0,\"F\",\"\")","v":""},"ADMINISTRAÇÃO - MENSALISTAS",null,{"$f":"Orçamento!X953","v":0},{"$f":"Orçamento!AA953","v":0},{"$f":"ROUND(F86*$D$84,2)","v":0},null,null,null,{"$f":"ROUND(J86*$D$84,2)","v":0},null,null,null,{"$f":"ROUND(N86*$D$84,2)","v":0},null,null,null,{"$f":"ROUND(R86*$D$84,2)","v":0},null,null,null,{"$f":"SUM(F84:U84)","v":0}]
[{"$f":"IF(A84=\"F\",A84,\"\")","v":""}]
[{"$f":"IF(A85=\"F\",A85,\"\")","v":""},null,null,null,null,0.21329999999999999,null,null,null,0.34060000000000001,null,null,null,0.25159999999999999,null,null,null,0.19450000000000001,null,null,null,{"$f":"IFERROR(E84/100,\"\")","v":0}]
[{"$f":"IF(D87>0,\"F\",\"\")","v":""},"PINTURA",null,{"$f":"Orçamento!X954","v":0},{"$f":"Orçamento!AA954","v":0},{"$f":"ROUND(F89*$D$87,2)","v":0},null,null,null,{"$f":"ROUND(J89*$D$87,2)","v":0},null,null,null,{"$f":"ROUND(N89*$D$87,2)","v":0},null,null,null,{"$f":"ROUND(R89*$D$87,2)","v":0},null,null,null,{"$f":"SUM(F87:U87)","v":0}]
[{"$f":"IF(A87=\"F\",A87,\"\")","v":""}]
[{"$f":"IF(A88=\"F\",A88,\"\")","v":""},null,null,null,null,0,null,null,null,null,null,null,null,0.7,null,null,null,0.3,null,null,null,{"$f":"IFERROR(E87/100,\"\")","v":0}]
[{"$f":"IF(D90>0,\"F\",\"\")","v":""},"DIVERSOS",null,{"$f":"Orçamento!X955","v":0},{"$f":"Orçamento!AA955","v":0},{"$f":"ROUND(F92*$D$90,2)","v":0},null,null,null,{"$f":"ROUND(J92*$D$90,2)","v":0},null,null,null,{"$f":"ROUND(N92*$D$90,2)","v":0},null,null,null,{"$f":"ROUND(R92*$D$90,2)","v":0},null,null,null,{"$f":"SUM(F90:U90)","v":0}]
[{"$f":"IF(A90=\"F\",A90,\"\")","v":""}]
[{"$f":"IF(A91=\"F\",A91,\"\")","v":""},null,null,null,null,0.2,null,null,null,0.2,null,null,null,0.3,null,null,null,0.3,null,null,null,{"$f":"IFERROR(E90/100,\"\")","v":0}]
["F","CUSTO DO ORÇAMENTO",null,{"$f":"SUM(D15:D92)","v":0},{"$f":"SUM(E15:E92)","v":0},{"$f":"F15+F18+F21+F24+F27+F30+F33+F36+F39+F42+F45+F48+F51+F54+F57+F60+F63+F66+F69+F72+F75+F78+F81+F84+F87+F90","v":0},null,null,null,{"$f":"J15+J18+J21+J24+J27+J30+J33+J36+J39+J42+J45+J48+J51+J54+J57+J60+J63+J66+J69+J72+J75+J78+J81+J84+J87+J90","v":-0.01},null,null,null,{"$f":"N15+N18+N21+N24+N27+N30+N33+N36+N39+N42+N45+N48+N51+N54+N57+N60+N63+N66+N69+N72+N75+N78+N81+N84+N87+N90","v":0.01},null,null,null,{"$f":"R15+R18+R21+R24+R27+R30+R33+R36+R39+R42+R45+R48+R51+R54+R57+R60+R63+R66+R69+R72+R75+R78+R81+R84+R87+R90","v":-0.01},null,null,null,{"$f":"V15+V18+V21+V24+V27+V30+V33+V36+V39+V42+V45+V48+V51+V54+V57+V60+V63+V66+V69+V72+V75+V78+V81+V84+V87+V90","v":-0.01}]
["F","PERCENTUAIS:",null,null,null,{"$f":"IFERROR(F93/D93,\"\")","v":""},null,null,null,{"$f":"IFERROR(J93/D93,\"\")","v":""},null,null,null,{"$f":"IFERROR(N93/D93,\"\")","v":""},null,null,null,{"$f":"IFERROR(R93/D93,\"\")","v":""},null,null,null,{"$f":"SUM(F94:U94)","v":0}]
["F","TOTAIS ACUMULADOS:",null,null,null,{"$f":"F93","v":0},null,null,null,{"$f":"F95+J93","v":-0.01},null,null,null,{"$f":"J95+N93","v":0},null,null,null,{"$f":"N95+R93","v":-0.01}]
["F","PERCENTUAIS  ACUMULADOS:",null,null,null,{"$f":"F94","v":""},null,null,null,{"$f":"IFERROR(F96+J94,\"\")","v":""},null,null,null,{"$f":"IFERROR(J96+N94,\"\")","v":""},null,null,null,{"$f":"IFERROR(N96+R94,\"\")","v":""}]
["F"]
["F","OBSERVAÇÕES:"]
["F","Os pagamentos somente poderão ser efetuados mediante medição e atesto pelos técnicos da Secretaria da Educação. "]

{"sheet":"Composição BDI","index":4,"n_rows":45,"n_cols":9,"rows_kept":45,"cut":false,"hidden":false,"merged":[[12,0,12,3],[13,0,13,3],[14,0,14,3],[15,0,15,3],[6,0,6,3],[8,0,8,3],[7,0,7,3],[9,0,9,3],[11,0,11,3],[10,0,10,3],[0,0,0,3],[2,0,2,3],[3,0,3,3],[1,0,1,3],[5,0,5,3],[4,0,4,3],[18,5,18,8],[17,0,17,3],[16,0,16,3],[44,0,44,3],[42,0,42,3],[43,0,43,3],[18,0,18,3],[36,0,36,3],[39,0,39,3],[38,0,38,3],[40,0,40,3],[29,0,29,2],[32,0,32,3],[33,0,33,3],[34,0,34,3],[35,0,35,3]]}
[]
[]
["UNIDADE ESCOLAR"]
[{"$f":"Orçamento!$O$4","v":"CENTRO DE ENSINO EM PERÍODO INTEGRAL PRÉ-UNIVERSITÁRIO"}]
[]
["OBRA"]
[{"$f":"Orçamento!$O$7","v":"REFORMA E AMPLIAÇÃO"}]
[]
["ENDEREÇO"]
[{"$f":"Orçamento!$R$10","v":"RUA 240 S/N, ST UNIVERSITARIO, CEP:74440-460"}]
[]
["CIDADE"]
[{"$f":"Orçamento!$X$7","v":"GOIÂNIA"}]
[]
["CRE"]
[{"$f":"Orçamento!$O$10","v":"GOIÂNIA"}]
[]
["DETALHAMENTO DA COMPOSIÇÃO DE BDI"]
["COMPOSIÇÃO BDI PARA OBRAS CIVIS",null,null,null,null,"BDI CONSTRUÇÃO E REFORMA"]
["DESCRIÇÃO","COEF.","TAXA % (a.m)","% no preço de venda",null,"Situação","1º Quartil","Médio","3º Quartil"]
["1) COFINS",1,0.03,{"$f":"C21","v":0.03},null,{"$f":"IF(OR(C21<G21,C21>I21),\"FORA DO INTERVALO\",\"OK\")","v":"OK"},0.03,0.03,0.03]
["2) PIS",1,6.4999999999999997E-3,{"$f":"C22","v":6.4999999999999997E-3},null,{"$f":"IF(OR(C22<G22,C22>I22),\"FORA DO INTERVALO\",\"OK\")","v":"OK"},6.4999999999999997E-3,6.4999999999999997E-3,6.4999999999999997E-3]
["3) ISSQN",1,0.03,{"$f":"C23*B23","v":0.03},null,"OK",0.02,3.5000000000000003E-2,0.05]
["4) CPRB",1,0,{"$f":"C24","v":0},null,"FORA DO INTERVALO",4.4999999999999998E-2,4.4999999999999998E-2,4.4999999999999998E-2]
["5) Administração Central",1,3.1199999999999999E-2,3.1199999999999999E-2,null,"OK",0.03,0.04,5.5E-2]
["6) Despesas Financeiras",1,5.5999999999999999E-3,5.5999999999999999E-3,null,"FORA DO INTERVALO",5.8999999999999999E-3,1.23E-2,1.3899999999999999E-2]
["7) Seguros + Garantias",1,1.1999999999999999E-3,1.1999999999999999E-3,null,"FORA DO INTERVALO",8.0000000000000002E-3,8.0000000000000002E-3,0.01]
["8) Risco",1,9.7000000000000003E-3,9.7000000000000003E-3,null,"OK",9.7000000000000003E-3,1.2699999999999999E-2,1.2699999999999999E-2]
["9) Lucro",1,7.1999999999999995E-2,7.1999999999999995E-2,null,"OK",6.1600000000000002E-2,7.3999999999999996E-2,8.9599999999999999E-2]
["BDI - FINAL",null,null,{"$f":"(((1+D25+D27+D28)*(1+D26)*(1+D29))/(1-(D21+D22+D23+D24))-1)","v":0.20341417752544211},null,"FORA DO INTERVALO",0.2034,0.22120000000000001,0.25]
[]
["Notas:"]
["(1) e (2) Alíquota definida por lei."]
["(3) Alíquota e base de cálculo definidas pela legislação municipal."]
["(4) Alíquota definida pelas leis 12.546/11, 12844/13 e 13.161/15 (CPRB – contribuição previdenciária sobre a receita bruta)."]
["(5) Valores definidos a partir dos limites no Acórdão nº 2.622/2013 - TCU – Plenário. Valores entre o 1º e 3º quartis."]
["(6) Valor calculado pela expressão matemática do acórdão 2.369/2011 – TCU – Plenário e disponibilizado pela AGETOP em dezembro de 2018. (Foi utilizado para o cálculo a média da Taxa SELIC no período de 11/2017 a 10/2018)"]
[]
["(7) Valores definidos pela AGETOP a partir dos limites no Acórdão nº 2.622/2013 - TCU – Plenário. Valores médios. \n\nObservação da AGETOP: (Seguros contra erros de execução, incêndio e explosão, danos da natureza (vendaval, destelhamento, alagamento, inundação, desmoronamento, geadas etc.), emprego de material defeituoso ou inadequado, roubo e/ou furto qualificado, quebra de equipamentos, desmoronamento de estrutura, nas modalidades de Obras Civis em Construção (OCC); Instalação e Montagem (IM); e Obras Civis em Construção e Instalação e Montagem (OCC/IM). Bem como coberturas adicionais para ampliação dessas coberturas básicas, como: cobertura de responsabilidade civil geral, cobertura de responsabilidade civil cruzada, cobertura de despesas extraordinárias, cobertura de tumultos, cobertura de desentulho do local, cobertura de riscos do fabricante, dentre outras, incluindo o seguro de vida em grupo regido pela convenção coletiva dos trabalhadores na indústria da construção civil). A partir de 24/02/2015 por intermédio da Portaria 449/2015 a Presidência da AGETOP, na pessoa do Senhor Jayme Eduardo Rincon, determinou a exclusão dos valores referentes aos Seguros de Risco de Engenharia e Responsabilidade Civil do Profissional na composição do cálculo do B.D.I.."]
["(8) Valores definidos a partir dos limites no Acórdão nº 2.622/2013 - TCU – Plenário. Valores entre 1º e 3° quartis."]
["(9) Valores definidos a partir dos limites definidos no Acórdão nº 2.622/2013 - TCU – Plenário. Valores adotados e praticados no mercado ( “ ex ante ” ) ou aqueles entre os 1º e 3º quartis."]
[]
["(*) A fórmula para estipulação da taxa de BDI estimado adotado é a mesma que foi aplicada para a obtenção das tabelas contidas no Acórdão n. 2.622/2013 – TCUPlenário"]
[]
["Obs.: Para obras com valores superiores a R$ 20.000.000,00 sugere-se recalcular o BDI, dimensionando as taxas de administração central e lucro para patamares inferiores ao estipulado acima."]

{"sheet":"Relatório CENTRAL","index":5,"n_rows":40,"n_cols":5,"rows_kept":40,"cut":false,"hidden":false,"merged":[[7,1,7,4],[8,1,8,2],[8,3,8,4],[9,1,9,2],[10,1,10,4],[11,1,11,4],[39,1,39,2],[9,0,11,0],[0,1,0,4],[6,3,6,4],[9,3,9,4],[1,1,1,4],[2,1,2,2],[2,3,2,4],[3,1,3,2],[3,3,3,4],[4,1,4,4],[5,1,5,2],[5,3,5,4],[6,1,6,2]]}
[]
[]
[null,"UNIDADE ESCOLAR",null,"CIDADE"]
[null,{"$f":"Orçamento!$O$4","v":"CENTRO DE ENSINO EM PERÍODO INTEGRAL PRÉ-UNIVERSITÁRIO"},null,{"$f":"Orçamento!$X$7","v":"GOIÂNIA"}]
[]
[null,"OBRA",null,"CRE"]
[null,{"$f":"Orçamento!$O$7","v":"REFORMA E AMPLIAÇÃO"},null,{"$f":"Orçamento!$O$10","v":"GOIÂNIA"}]
[]
[null,"ENDEREÇO",null,"DATA"]
["FILTRO",{"$f":"Orçamento!$R$10","v":"RUA 240 S/N, ST UNIVERSITARIO, CEP:74440-460"},null,{"$f":"Orçamento!$S$7","v":"2020-04-23"}]
[]
[null,"RELATÓRIO CENTRAL"]
["↓","CÓDIGO","ETAPA","PREÇO  (R$) C/ BDI","PARTIC  ( % )"]
[{"$f":"IF(D14>0,\"F\",\"\")","v":""},{"$f":"Orçamento!O930","v":"a."},{"$f":"Orçamento!P930","v":"SERVIÇOS PRELIMINARES"},{"$f":"Orçamento!X930","v":0},{"$f":"Orçamento!AA930","v":0}]
[{"$f":"IF(D15>0,\"F\",\"\")","v":""},{"$f":"Orçamento!O931","v":"b."},{"$f":"Orçamento!P931","v":"TRANSPORTES"},{"$f":"Orçamento!X931","v":0},{"$f":"Orçamento!AA931","v":0}]
["",{"$f":"Orçamento!O932","v":"c."},{"$f":"Orçamento!P932","v":"SERVIÇO EM TERRA"},{"$f":"Orçamento!X932","v":0},{"$f":"Orçamento!AA932","v":0}]
["",{"$f":"Orçamento!O933","v":"d."},{"$f":"Orçamento!P933","v":"FUNDAÇÕES E SONDAGENS"},{"$f":"Orçamento!X933","v":0},{"$f":"Orçamento!AA933","v":0}]
["",{"$f":"Orçamento!O934","v":"e."},{"$f":"Orçamento!P934","v":"ESTRUTURA"},{"$f":"Orçamento!X934","v":0},{"$f":"Orçamento!AA934","v":0}]
["",{"$f":"Orçamento!O935","v":"f."},{"$f":"Orçamento!P935","v":"INSTALAÇÕES ELÉTRICAS"},{"$f":"Orçamento!X935","v":0},{"$f":"Orçamento!AA935","v":0}]
["",{"$f":"Orçamento!O936","v":"g."},{"$f":"Orçamento!P936","v":"INSTALAÇÕES HIDROSSANITÁRIAS"},{"$f":"Orçamento!X936","v":0},{"$f":"Orçamento!AA936","v":0}]
["",{"$f":"Orçamento!O937","v":"h"},{"$f":"Orçamento!P937","v":"INSTALAÇÕES ESPECIAIS"},{"$f":"Orçamento!X937","v":0},{"$f":"Orçamento!AA937","v":0}]
["",{"$f":"Orçamento!O938","v":"i."},{"$f":"Orçamento!P938","v":"ALVENARIAS E DIVISÓRIAS"},{"$f":"Orçamento!X938","v":0},{"$f":"Orçamento!AA938","v":0}]
["",{"$f":"Orçamento!O939","v":"j."},{"$f":"Orçamento!P939","v":"ALVENARIA AUTO-PORTANTE"},{"$f":"Orçamento!X939","v":0},{"$f":"Orçamento!AA939","v":0}]
["",{"$f":"Orçamento!O940","v":"k."},{"$f":"Orçamento!P940","v":"IMPERMEABILIZAÇÃO"},{"$f":"Orçamento!X940","v":0},{"$f":"Orçamento!AA940","v":0}]
["",{"$f":"Orçamento!O941","v":"l."},{"$f":"Orçamento!P941","v":"ISOLAMENTO TÉRMICO E ACÚSTICO"},{"$f":"Orçamento!X941","v":0},{"$f":"Orçamento!AA941","v":0}]
["",{"$f":"Orçamento!O942","v":"m."},{"$f":"Orçamento!P942","v":"ESTRUTURA DE MADEIRA"},{"$f":"Orçamento!X942","v":0},{"$f":"Orçamento!AA942","v":0}]
["",{"$f":"Orçamento!O943","v":"n."},{"$f":"Orçamento!P943","v":"ESTRUTURAS METÁLICAS"},{"$f":"Orçamento!X943","v":0},{"$f":"Orçamento!AA943","v":0}]
["",{"$f":"Orçamento!O944","v":"o."},{"$f":"Orçamento!P944","v":"COBERTURAS"},{"$f":"Orçamento!X944","v":0},{"$f":"Orçamento!AA944","v":0}]
["",{"$f":"Orçamento!O945","v":"p."},{"$f":"Orçamento!P945","v":"ESQUADRIAS DE MADEIRA"},{"$f":"Orçamento!X945","v":0},{"$f":"Orçamento!AA945","v":0}]
["",{"$f":"Orçamento!O946","v":"q."},{"$f":"Orçamento!P946","v":"ESQUADRIAS METÁLICAS"},{"$f":"Orçamento!X946","v":0},{"$f":"Orçamento!AA946","v":0}]
["",{"$f":"Orçamento!O947","v":"r."},{"$f":"Orçamento!P947","v":"VIDROS"},{"$f":"Orçamento!X947","v":0},{"$f":"Orçamento!AA947","v":0}]
["",{"$f":"Orçamento!O948","v":"s."},{"$f":"Orçamento!P948","v":"REVESTIMENTO DE PAREDE"},{"$f":"Orçamento!X948","v":0},{"$f":"Orçamento!AA948","v":0}]
["",{"$f":"Orçamento!O949","v":"t."},{"$f":"Orçamento!P949","v":"FORROS"},{"$f":"Orçamento!X949","v":0},{"$f":"Orçamento!AA949","v":0}]
["",{"$f":"Orçamento!O950","v":"u."},{"$f":"Orçamento!P950","v":"REVESTIMENTO DE PISO"},{"$f":"Orçamento!X950","v":0},{"$f":"Orçamento!AA950","v":0}]
["",{"$f":"Orçamento!O951","v":"v."},{"$f":"Orçamento!P951","v":"FERRAGENS"},{"$f":"Orçamento!X951","v":0},{"$f":"Orçamento!AA951","v":0}]
["",{"$f":"Orçamento!O952","v":"w."},{"$f":"Orçamento!P952","v":"MARCENARIA"},{"$f":"Orçamento!X952","v":0},{"$f":"Orçamento!AA952","v":0}]
["",{"$f":"Orçamento!O953","v":"x."},{"$f":"Orçamento!P953","v":"ADMINISTRAÇÃO"},{"$f":"Orçamento!X953","v":0},{"$f":"Orçamento!AA953","v":0}]
["",{"$f":"Orçamento!O954","v":"y."},{"$f":"Orçamento!P954","v":"PINTURA"},{"$f":"Orçamento!X954","v":0},{"$f":"Orçamento!AA954","v":0}]
["",{"$f":"Orçamento!O955","v":"z."},{"$f":"Orçamento!P955","v":"DIVERSOS"},{"$f":"Orçamento!X955","v":0},{"$f":"Orçamento!AA955","v":0}]
["F","TOTAL GERAL DO ORÇAMENTO (R$) C/BDI",null,{"$f":"SUM(D14:D39)","v":0},{"$f":"SUM(E14:E39)","v":0}]

{"sheet":"Parc Maior Relev","index":6,"n_rows":21,"n_cols":7,"rows_kept":21,"cut":false,"hidden":false,"merged":[[10,0,12,0],[8,1,8,3],[8,4,8,6],[21,3,21,7],[19,1,19,6],[0,1,0,6],[11,1,11,6],[1,1,1,6],[2,1,2,3],[2,4,2,6],[3,1,3,3],[3,4,3,6],[4,1,4,6],[5,1,5,3],[5,4,5,6],[9,1,9,3],[9,4,9,6],[10,1,10,6],[6,1,6,3],[6,4,6,6],[7,1,7,6]]}
[]
[]
[null,"UNIDADE ESCOLAR",null,null,"CÓDIGO INEP"]
[null,{"$f":"Orçamento!$O$4","v":"CENTRO DE ENSINO EM PERÍODO INTEGRAL PRÉ-UNIVERSITÁRIO"},null,null,{"$f":"Orçamento!$X$4","v":52033570}]
[]
[null,"OBRA",null,null,"CIDADE"]
[null,{"$f":"Orçamento!$O$7","v":"REFORMA E AMPLIAÇÃO"},null,null,{"$f":"Orçamento!$X$7","v":"GOIÂNIA"}]
[]
[null,"CRE",null,null,"ÁREA TOTAL CONSTRUÍDA (M²)"]
[null,{"$f":"Orçamento!$O$10","v":"GOIÂNIA"},null,null,{"$f":"Orçamento!$S$13","v":4643.25}]
["FILTRO"]
[null,"PARCELA DE MAIOR RELEVÂNCIA"]
[null,"CÓDIGO","SERVIÇO","DESCRIÇÃO","UNID","QUANT","PARC. MAIOR RELEV (50%)"]
[{"$f":"IF(F14>0,\"F\",\"\")","v":"F"},"U.",{"$f":"IFERROR(VLOOKUP(B14,Orçamento!$O$930:$P$955,2,FALSE),\"(inserir código ao lado)\")","v":"REVESTIMENTO DE PISO"},"PISO TÁTIL","M²",{"$f":"Orçamento!T344","v":174.53},{"$f":"F14*0.5","v":87.265000000000001}]
[{"$f":"IF(F15>0,\"F\",\"\")","v":""},"O.",{"$f":"IFERROR(VLOOKUP(B15,Orçamento!$O$930:$P$955,2,FALSE),\"(inserir código ao lado)\")","v":"COBERTURAS"},"TELHA CERÂMICA","M²",{"$f":"Orçamento!V723+Orçamento!V875+Orçamento!V595","v":0},{"$f":"F15*0.5","v":0}]
[{"$f":"IF(F16>0,\"F\",\"\")","v":""},null,{"$f":"IFERROR(VLOOKUP(B16,Orçamento!$O$930:$P$955,2,FALSE),\"(inserir código ao lado)\")","v":"(inserir código ao lado)"},null,{"$f":"IFERROR(VLOOKUP($D16,Orçamento!$R$20:$Y$911,2,FALSE),\"-\")","v":"-"},{"$f":"SUMIF(Orçamento!$R$20:$R$911,'Parc Maior Relev'!D16,Orçamento!$T$20:$T$911)","v":0},{"$f":"F16*0.5","v":0}]
[{"$f":"IF(F17>0,\"F\",\"\")","v":""},null,{"$f":"IFERROR(VLOOKUP(B17,Orçamento!$O$930:$P$955,2,FALSE),\"(inserir código ao lado)\")","v":"(inserir código ao lado)"},null,{"$f":"IFERROR(VLOOKUP($D17,Orçamento!$R$20:$Y$911,2,FALSE),\"-\")","v":"-"},{"$f":"SUMIF(Orçamento!$R$20:$R$911,'Parc Maior Relev'!D17,Orçamento!$T$20:$T$911)","v":0},{"$f":"F17*0.5","v":0}]
[{"$f":"IF(F18>0,\"F\",\"\")","v":""},null,{"$f":"IFERROR(VLOOKUP(B18,Orçamento!$O$930:$P$955,2,FALSE),\"(inserir código ao lado)\")","v":"(inserir código ao lado)"},null,{"$f":"IFERROR(VLOOKUP($D18,Orçamento!$R$20:$Y$911,2,FALSE),\"-\")","v":"-"},{"$f":"SUMIF(Orçamento!$R$20:$R$911,'Parc Maior Relev'!D18,Orçamento!$T$20:$T$911)","v":0},{"$f":"F18*0.5","v":0}]
["F"]
["F","(*) Para os fins do inciso I dp § 1º do Art. 30 da Lei Federal 8.666/93, são consideradas parcelas de maior relevância técnica as execuções apresentadas"]
["F"]

{"sheet":"Composições","index":7,"n_rows":492,"n_cols":10,"rows_kept":492,"cut":false,"hidden":false,"merged":[[481,5,482,5],[481,6,481,7],[481,8,481,9],[487,1,487,7],[491,1,491,7],[481,0,482,0],[481,1,482,1],[481,2,482,2],[481,3,482,3],[481,4,482,4],[467,5,468,5],[467,6,467,7],[467,8,467,9],[473,1,473,7],[479,1,479,7],[467,0,468,0],[467,1,468,1],[467,2,468,2],[467,3,468,3],[467,4,468,4],[457,5,458,5],[457,6,457,7],[457,8,457,9],[462,1,462,7],[465,1,465,7],[457,0,458,0],[457,1,458,1],[457,2,458,2],[457,3,458,3],[457,4,458,4],[447,5,448,5],[447,6,447,7],[447,8,447,9],[452,1,452,7],[455,1,455,7],[447,0,448,0],[447,1,448,1],[447,2,448,2],[447,3,448,3],[447,4,448,4],[435,5,436,5],[435,6,435,7],[435,8,435,9],[441,1,441,7],[445,1,445,7],[435,0,436,0],[435,1,436,1],[435,2,436,2],[435,3,436,3],[435,4,436,4],[423,5,424,5],[423,6,423,7],[423,8,423,9],[429,1,429,7],[433,1,433,7],[423,0,424,0],[423,1,424,1],[423,2,424,2],[423,3,424,3],[423,4,424,4],[411,5,412,5],[411,6,411,7],[411,8,411,9],[417,1,417,7],[421,1,421,7],[411,0,412,0],[411,1,412,1],[411,2,412,2],[411,3,412,3],[411,4,412,4],[399,5,400,5],[399,6,399,7],[399,8,399,9],[405,1,405,7],[409,1,409,7],[399,0,400,0],[399,1,400,1],[399,2,400,2],[399,3,400,3],[399,4,400,4],[387,5,388,5],[387,6,387,7],[387,8,387,9],[393,1,393,7],[397,1,397,7],[387,0,388,0],[387,1,388,1],[387,2,388,2],[387,3,388,3],[387,4,388,4],[375,5,376,5],[375,6,375,7],[375,8,375,9],[381,1,381,7],[385,1,385,7],[375,0,376,0],[375,1,376,1],[375,2,376,2],[375,3,376,3],[375,4,376,4],[363,5,364,5],[363,6,363,7],[363,8,363,9],[369,1,369,7],[373,1,373,7],[363,0,364,0],[363,1,364,1],[363,2,364,2],[363,3,364,3],[363,4,364,4],[351,5,352,5],[351,6,351,7],[351,8,351,9],[357,1,357,7],[361,1,361,7],[351,0,352,0],[351,1,352,1],[351,2,352,2],[351,3,352,3],[351,4,352,4],[339,5,340,5],[339,6,339,7],[339,8,339,9],[345,1,345,7],[349,1,349,7],[339,0,340,0],[339,1,340,1],[339,2,340,2],[339,3,340,3],[339,4,340,4],[327,5,328,5],[327,6,327,7],[327,8,327,9],[333,1,333,7],[337,1,337,7],[327,0,328,0],[327,1,328,1],[327,2,328,2],[327,3,328,3],[327,4,328,4],[315,5,316,5],[315,6,315,7],[315,8,315,9],[321,1,321,7],[325,1,325,7],[315,0,316,0],[315,1,316,1],[315,2,316,2],[315,3,316,3],[315,4,316,4],[303,5,304,5],[303,6,303,7],[303,8,303,9],[309,1,309,7],[313,1,313,7],[303,0,304,0],[303,1,304,1],[303,2,304,2],[303,3,304,3],[303,4,304,4],[291,5,292,5],[291,6,291,7],[291,8,291,9],[297,1,297,7],[301,1,301,7],[291,0,292,0],[291,1,292,1],[291,2,292,2],[291,3,292,3],[291,4,292,4],[271,5,272,5],[271,6,271,7],[271,8,271,9],[276,1,276,7],[289,1,289,7],[271,0,272,0],[271,1,272,1],[271,2,272,2],[271,3,272,3],[271,4,272,4],[248,5,249,5],[248,6,248,7],[248,8,248,9],[254,1,254,7],[269,1,269,7],[248,0,249,0],[248,1,249,1],[248,2,249,2],[248,3,249,3],[248,4,249,4],[238,5,239,5],[238,6,238,7],[238,8,238,9],[243,1,243,7],[246,1,246,7],[238,0,239,0],[238,1,239,1],[238,2,239,2],[238,3,239,3],[238,4,239,4],[228,5,229,5],[228,6,228,7],[228,8,228,9],[233,1,233,7],[236,1,236,7],[228,0,229,0],[228,1,229,1],[228,2,229,2],[228,3,229,3],[228,4,229,4],[213,5,214,5],[213,6,213,7],[213,8,213,9],[219,1,219,7],[226,1,226,7],[213,0,214,0],[213,1,214,1],[213,2,214,2],[213,3,214,3],[213,4,214,4],[203,5,204,5],[203,6,203,7],[203,8,203,9],[207,1,207,7],[211,1,211,7],[203,0,204,0],[203,1,204,1],[203,2,204,2],[203,3,204,3],[203,4,204,4],[191,5,192,5],[191,6,191,7],[191,8,191,9],[197,1,197,7],[201,1,201,7],[191,0,192,0],[191,1,192,1],[191,2,192,2],[191,3,192,3],[191,4,192,4],[179,5,180,5],[179,6,179,7],[179,8,179,9],[185,1,185,7],[189,1,189,7],[179,0,180,0],[179,1,180,1],[179,2,180,2],[179,3,180,3],[179,4,180,4],[167,5,168,5],[167,6,167,7],[167,8,167,9],[173,1,173,7],[177,1,177,7],[167,0,168,0],[167,1,168,1],[167,2,168,2],[167,3,168,3],[167,4,168,4],[155,5,156,5],[155,6,155,7],[155,8,155,9],[161,1,161,7],[165,1,165,7],[155,0,156,0],[155,1,156,1],[155,2,156,2],[155,3,156,3],[155,4,156,4],[143,5,144,5],[143,6,143,7],[143,8,143,9],[149,1,149,7],[153,1,153,7],[143,0,144,0],[143,1,144,1],[143,2,144,2],[143,3,144,3],[143,4,144,4],[133,5,134,5],[133,6,133,7],[133,8,133,9],[138,1,138,7],[141,1,141,7],[133,0,134,0],[133,1,134,1],[133,2,134,2],[133,3,134,3],[133,4,134,4],[123,5,124,5],[123,6,123,7],[123,8,123,9],[128,1,128,7],[131,1,131,7],[123,0,124,0],[123,1,124,1],[123,2,124,2],[123,3,124,3],[123,4,124,4],[113,5,114,5],[113,6,113,7],[113,8,113,9],[118,1,118,7],[121,1,121,7],[113,0,114,0],[113,1,114,1],[113,2,114,2],[113,3,114,3],[113,4,114,4],[101,5,102,5],[101,6,101,7],[101,8,101,9],[107,1,107,7],[111,1,111,7],[101,0,102,0],[101,1,102,1],[101,2,102,2],[101,3,102,3],[101,4,102,4],[89,5,90,5],[89,6,89,7],[89,8,89,9],[95,1,95,7],[99,1,99,7],[89,0,90,0],[89,1,90,1],[89,2,90,2],[89,3,90,3],[89,4,90,4],[77,5,78,5],[77,6,77,7],[77,8,77,9],[83,1,83,7],[87,1,87,7],[77,0,78,0],[77,1,78,1],[77,2,78,2],[77,3,78,3],[77,4,78,4],[65,5,66,5],[65,6,65,7],[65,8,65,9],[71,1,71,7],[75,1,75,7],[65,0,66,0],[65,1,66,1],[65,2,66,2],[65,3,66,3],[65,4,66,4],[53,5,54,5],[53,6,53,7],[53,8,53,9],[59,1,59,7],[63,1,63,7],[53,0,54,0],[53,1,54,1],[53,2,54,2],[53,3,54,3],[53,4,54,4],[41,5,42,5],[41,6,41,7],[41,8,41,9],[47,1,47,7],[51,1,51,7],[41,0,42,0],[41,1,42,1],[41,2,42,2],[41,3,42,3],[41,4,42,4],[29,5,30,5],[29,6,29,7],[29,8,29,9],[35,1,35,7],[39,1,39,7],[29,0,30,0],[29,1,30,1],[29,2,30,2],[29,3,30,3],[29,4,30,4],[16,5,17,5],[16,6,16,7],[16,8,16,9],[22,1,22,7],[27,1,27,7],[16,0,17,0],[16,1,17,1],[16,2,17,2],[16,3,17,3],[16,4,17,4],[0,0,0,8],[10,0,10,2],[10,3,10,6],[11,0,11,9],[12,0,12,2],[12,3,12,6],[12,7,12,8],[7,0,7,6],[9,0,9,2],[9,3,9,6],[9,7,9,8],[3,0,3,6],[4,0,4,6],[15,0,15,9],[13,0,13,2],[13,3,13,6],[1,0,1,9],[3,7,3,9],[4,7,4,9],[6,7,6,9],[7,7,7,9],[6,0,6,6],[10,8,10,9],[13,8,13,9],[14,0,14,9],[8,0,8,9],[5,0,5,9],[2,0,2,9]]}
[]
[]
[]
["UNIDADE ESCOLAR",null,null,null,null,null,null,"CÓDIGO INEP"]
[{"$f":"Orçamento!$O$4","v":"CENTRO DE ENSINO EM PERÍODO INTEGRAL PRÉ-UNIVERSITÁRIO"},null,null,null,null,null,null,{"$f":"Orçamento!$X$4","v":52033570}]
[]
["OBRA",null,null,null,null,null,null,"CIDADE"]
[{"$f":"Orçamento!$O$7","v":"REFORMA E AMPLIAÇÃO"},null,null,null,null,null,null,{"$f":"Orçamento!$X$7","v":"GOIÂNIA"}]
[]
["CRE",null,null,"ENDEREÇO",null,null,null,"REFERÊNCIA AGETOP"]
[{"$f":"Orçamento!$O$10","v":"GOIÂNIA"},null,null,{"$f":"Orçamento!$R$10","v":"RUA 240 S/N, ST UNIVERSITARIO, CEP:74440-460"},null,null,null,{"$f":"Orçamento!$X$10","v":"DEZ/18"},{"$f":"Orçamento!$Y$10","v":"ONERADA"}]
[]
["DATA",null,null,"ÁREA TOTAL CONSTRUÍDA (M²)",null,null,null,"REFERÊNCIA SINAPI"]
[{"$f":"Orçamento!$S$7","v":"2020-04-23"},null,null,{"$f":"Orçamento!$S$13","v":4643.25},null,null,null,{"$f":"Orçamento!$X$13","v":"JUL/19"},{"$f":"Orçamento!$Y$13","v":"ONERADA"}]
[]
["COMPOSIÇÕES DE CUSTOS UNITÁRIOS - SEE-GO"]
[199,"FONTE","CÓDIGO","DESCRIÇÃO","UNIDADE","COEFIC.","CUSTO UNITÁRIO",null,"CUSTO  TOTAL (A) + (B) + (C) + (D) + (E)"]
[null,null,null,null,null,null,"DESONERADO","NÃO DESONER.","DESONERADO","NÃO DESONER."]
[null,"COMPOSIÇÃO","COMP 199_SEE","ESTACA A TRADO DIAM.40 CM S/FERRO","M",null,null,null,52.819999999999993,54.989999999999995]
[null,"AGETOP_I",5,"SERVENTE","h     ",0.64790000000000003,8.1999999999999993,9.51,5.31,6.16]
[null,"AGETOP_I",4,"PEDREIRO","h     ",0.56559999999999999,13.4,15.53,7.58,8.7799999999999994]
[null,"AGETOP_I",32,"OPERADOR DE BETONEIRA ","h     ",8.09E-2,9.85,11.41,0.8,0.92]
[null,"MÃO DE OBRA (B) - TOTAL",null,null,null,null,null,null,13.690000000000001,15.86]
[null,"AGETOP_I",2804,"AREIA GROSSA","m3",7.2590000000000002E-2,90,90,6.53,6.53]
[null,"AGETOP_I",2386,"BRITA No. 01","m3",8.9419999999999999E-2,85.36,85.36,7.63,7.63]
[null,"AGETOP_I",2497,"BRITA No.02","m3",8.9419999999999999E-2,74.900000000000006,74.900000000000006,6.7,6.7]
[null,"AGETOP_I",1215,"CIMENTO PORTLAND C.P. 32","Kg",46.848799999999997,0.39,0.39,18.27,18.27]
[null,"MATERIAL (C) - TOTAL",null,null,null,null,null,null,39.129999999999995,39.129999999999995]
[]
[40,"FONTE","CÓDIGO","DESCRIÇÃO","UNIDADE","COEFIC.","CUSTO UNITÁRIO",null,"CUSTO  TOTAL (A) + (B) + (C) + (D) + (E)"]
[null,null,null,null,null,null,"DESONERADO","NÃO DESONER.","DESONERADO","NÃO DESONER."]
[null,"COMPOSIÇÃO","COMP 040_SEE","CONJUNTO MOTOR-BOMBA ELÉTRICA TRIFÁSICO 380/220 V PARA VZ= 24,33 M³/H, HM= 46,24 M POTÊNCIA= 7,5 CV","UN ",null,null,null,3965.4700000000003,3992.9900000000002]
[null,"AGETOP_I",8,"AJUDANTE","h     ",8,8.1999999999999993,9.51,65.599999999999994,76.08]
[null,"AGETOP_I",11,"ENCANADOR","h     ",8,13.4,15.53,107.2,124.24]
[null,null,null,"","",null,0,0,0,0]
[null,"MÃO DE OBRA (B) - TOTAL",null,null,null,null,null,null,172.8,200.32]
[null,"COTAÇÃO","COT 008_SEE","CONJUNTO MOTOR-BOMBA ELÉTRICA TRIFÁSICO 380/220 V PARA VZ= 24,33 M³/H, HM= 46,24 M POTÊNCIA= 7,5 CV","UN ",1,3792.6666666666665,3792.6666666666665,3792.67,3792.67]
[null,null,null,"","",null,0,0,0,0]
[null,null,null,"","",null,0,0,0,0]
[null,"MATERIAL (C) - TOTAL",null,null,null,null,null,null,3792.67,3792.67]
[]
[558,"FONTE","CÓDIGO","DESCRIÇÃO","UNID ","COEFIC.","CUSTO UNITÁRIO",null,"CUSTO  TOTAL (A) + (B) + (C) + (D) + (E)"]
[null,null,null,null,null,null,"DESONERADO","NÃO DESONER.","DESONERADO","NÃO DESONER."]
[null,"COMPOSIÇÃO","COMP 558_SEE","BOMBA DE PRESSURIZAÇÃO JOCKEY 3,0 CV","UN ","-","-","-",2687.07,2714.59]
[null,"AGETOP_I",8,"AJUDANTE","h     ",8,8.1999999999999993,9.51,65.599999999999994,76.08]
[null,"AGETOP_I",12,"ELETRICISTA","h     ",8,13.4,15.53,107.2,124.24]
[null,null,null,"","",null,0,0,0,0]
[null,"MÃO DE OBRA (B) - TOTAL",null,null,null,null,null,null,172.8,200.32]
[null,"COTAÇÃO","COT 303_SEE","BOMBA DE PRESSURIZAÇÃO JOCKEY 3,0 CV","UN ",1,2514.2666666666669,2514.2666666666669,2514.27,2514.27]
[null,null,null,"","",null,0,0,0,0]
[null,null,null,"","",null,0,0,0,0]
[null,"MATERIAL (C) - TOTAL",null,null,null,null,null,null,2514.27,2514.27]
[]
[17,"FONTE","CÓDIGO","DESCRIÇÃO","UNIDADE","COEFIC.","CUSTO UNITÁRIO",null,"CUSTO  TOTAL (A) + (B) + (C) + (D) + (E)"]
[null,null,null,null,null,null,"DESONERADO","NÃO DESONER.","DESONERADO","NÃO DESONER."]
[null,"COMPOSIÇÃO","COMP 017_SEE","REDUCAO GIRATÓRIA TIPO STORZ LATAO P/ INST. PREDIAL COMBATE A INCENDIO ENGATE RAPIDO 2.1/2\" X 1.1/2\"","UN ",null,"-","-",99.14,99.69]
[null,"AGETOP_I",8,"AJUDANTE","h     ",0.16,8.1999999999999993,9.51,1.31,1.52]
[null,"AGETOP_I",11,"ENCANADOR","h     ",0.16,13.4,15.53,2.14,2.48]
[null,null,null,"","",null,0,0,0,0]
[null,"MÃO DE OBRA (B) - TOTAL",null,null,null,null,null,null,3.45,4]
[null,"SINAPI_I",20972,"REDUCAO FIXA TIPO STORZ, ENGATE RAPIDO 2.1/2\" X 1.1/2\", EM LATAO, PARA INSTALACAO PREDIAL COMBATE A INCENDIO PREDIAL","UN    ",1,95.69,95.69,95.69,95.69]
[null,null,null,"","",null,0,0,0,0]
[null,null,null,"","",null,0,0,0,0]
[null,"MATERIAL (C) - TOTAL",null,null,null,null,null,null,95.69,95.69]
[]
[18,"FONTE","CÓDIGO","DESCRIÇÃO","UNIDADE","COEFIC.","CUSTO UNITÁRIO",null,"CUSTO  TOTAL (A) + (B) + (C) + (D) + (E)"]
[null,null,null,null,null,null,"DESONERADO","NÃO DESONER.","DESONERADO","NÃO DESONER."]
[null,"COMPOSIÇÃO","COMP 018_SEE","CHAVE DUPLA P/ CONEXÕES TIPO STORZ EM LATÃO ENGATE RÁPIDO 1 1/2\" X 2 1/2\"","UN ",null,"-","-",14.76,15.08]
[null,"AGETOP_I",11,"ENCANADOR","h     ",0.15,13.4,15.53,2.0099999999999998,2.33]
[null,null,null,"","",null,0,0,0,0]
[null,null,null,"","",null,0,0,0,0]
[null,"MÃO DE OBRA (B) - TOTAL",null,null,null,null,null,null,2.0099999999999998,2.33]
[null,"SINAPI_I",20971,"CHAVE DUPLA PARA CONEXOES TIPO STORZ, ENGATE RAPIDO 1 1/2\" X 2 1/2\", EM LATAO, PARA INSTALACAO PREDIAL COMBATE A INCENDIO","UN    ",1,12.75,12.75,12.75,12.75]
[null,null,null,"","",null,0,0,0,0]
[null,null,null,"","",null,0,0,0,0]
[null,"MATERIAL (C) - TOTAL",null,null,null,null,null,null,12.75,12.75]
[]
[87,"FONTE","CÓDIGO","DESCRIÇÃO","UNIDADE","COEFIC.","CUSTO UNITÁRIO",null,"CUSTO  TOTAL (A) + (B) + (C) + (D) + (E)"]
[null,null,null,null,null,null,"DESONERADO","NÃO DESONER.","DESONERADO","NÃO DESONER."]
[null,"COMPOSIÇÃO","COMP 087_SEE","REGISTRO DE GAVETA COM HASTE ASCENDENTE DE BRONZE 2 1/2\"","UN ",null,null,null,257.29999999999995,261.26]
[null,"AGETOP_I",8,"AJUDANTE","h     ",1.1499999999999999,8.1999999999999993,9.51,9.43,10.94]
[null,"AGETOP_I",11,"ENCANADOR","h     ",1.1499999999999999,13.4,15.53,15.41,17.86]
[null,null,null,"","",null,0,0,0,0]
[null,"MÃO DE OBRA (B) - TOTAL",null,null,null,null,null,null,24.84,28.799999999999997]
[null,"AGETOP_I","H689","FITA VEDAROSCA 12 MM","m",2.82,0.28000000000000003,0.28000000000000003,0.79,0.79]
[null,"COTAÇÃO","COT 017_SEE","REGISTRO DE GAVETA COM HASTE ASCENDENTE DE BRONZE 2 1/2\"","UN ",1,231.66666666666666,231.66666666666666,231.67,231.67]
[null,null,null,"","",null,0,0,0,0]
[null,"MATERIAL (C) - TOTAL",null,null,null,null,null,null,232.45999999999998,232.45999999999998]
[]
[19,"FONTE","CÓDIGO","DESCRIÇÃO","UNIDADE","COEFIC.","CUSTO UNITÁRIO",null,"CUSTO  TOTAL (A) + (B) + (C) + (D) + (E)"]
[null,null,null,null,null,null,"DESONERADO","NÃO DESONER.","DESONERADO","NÃO DESONER."]
[null,"COMPOSIÇÃO","COMP 019_SEE","TAMPÃO LATAO C/ CORRENTE P/ INSTALAÇÃO PREDIAL COMBATE A INCÊNDIO ENGATE RÁPIDO 1 1/2\"","UN ",null,"-","-",55.550000000000004,56.07]
[null,"AGETOP_I",11,"ENCANADOR","h     ",0.15,13.4,15.53,2.0099999999999998,2.33]
[null,"AGETOP_I",8,"AJUDANTE","h     ",0.15,8.1999999999999993,9.51,1.23,1.43]
[null,null,null,"","",null,0,0,0,0]
[null,"MÃO DE OBRA (B) - TOTAL",null,null,null,null,null,null,3.2399999999999998,3.76]
[null,"SINAPI_I",20964,"TAMPAO COM CORRENTE, EM LATAO, ENGATE RAPIDO 1 1/2\", PARA INSTALACAO PREDIAL DE COMBATE A INCENDIO","UN    ",1,52.31,52.31,52.31,52.31]
[null,null,null,"","",null,0,0,0,0]
[null,null,null,"","",null,0,0,0,0]
[null,"MATERIAL (C) - TOTAL",null,null,null,null,null,null,52.31,52.31]
[]
[88,"FONTE","CÓDIGO","DESCRIÇÃO","UNIDADE","COEFIC.","CUSTO UNITÁRIO",null,"CUSTO  TOTAL (A) + (B) + (C) + (D) + (E)"]
[null,null,null,null,null,null,"DESONERADO","NÃO DESONER.","DESONERADO","NÃO DESONER."]
[null,"COMPOSIÇÃO","COMP 088_SEE","TE DE FERRO GALVANIZADO 90º X 2.1/2\" X 1\"","UN ",null,null,null,91.65,93.79]
[null,"AGETOP_I",8,"AJUDANTE","h     ",0.624,8.1999999999999993,9.51,5.12,5.93]
[null,"AGETOP_I",11,"ENCANADOR","h     ",0.624,13.4,15.53,8.36,9.69]
[null,null,null,"","",null,0,0,0,0]
[null,"MÃO DE OBRA (B) - TOTAL",null,null,null,null,null,null,13.48,15.62]
[null,"AGETOP_I","H689","FITA VEDAROSCA 12 MM","m",1.2,0.28000000000000003,0.28000000000000003,0.34,0.34]
[null,"SINAPI_I",6307,"TE DE REDUCAO DE FERRO GALVANIZADO, COM ROSCA BSP, DE 2 1/2\" X 1\"","UN    ",1,77.83,77.83,77.83,77.83]
[null,null,null,"","",null,0,0,0,0]
[null,"MATERIAL (C) - TOTAL",null,null,null,null,null,null,78.17,78.17]
[]
[30,"FONTE","CÓDIGO","DESCRIÇÃO","UNIDADE","COEFIC.","CUSTO UNITÁRIO",null,"CUSTO  TOTAL (A) + (B) + (C) + (D) + (E)"]
[null,null,null,null,null,null,"DESONERADO","NÃO DESONER.","DESONERADO","NÃO DESONER."]
[null,"COMPOSIÇÃO","COMP 030_SEE","COTOVELO DE FERRO GALV. 90° X 2 1/2\"","UN ",null,null,null,72.34,75.509999999999991]
[null,"AGETOP_I",8,"AJUDANTE","h     ",0.92,8.1999999999999993,9.51,7.54,8.75]
[null,"AGETOP_I",11,"ENCANADOR","h     ",0.92,13.4,15.53,12.33,14.29]
[null,"MÃO DE OBRA (B) - TOTAL",null,null,null,null,null,null,19.87,23.04]
[null,"SINAPI_I",3470,"COTOVELO 90 GRAUS DE FERRO GALVANIZADO, COM ROSCA BSP, DE 2 1/2\"","UN    ",1,51.91,51.91,51.91,51.91]
[null,"AGETOP_I","H689","FITA VEDAROSCA 12 MM","m",2,0.28000000000000003,0.28000000000000003,0.56000000000000005,0.56000000000000005]
[null,"MATERIAL (C) - TOTAL",null,null,null,null,null,null,52.47,52.47]
[]
[77,"FONTE","CÓDIGO","DESCRIÇÃO","UNIDADE","COEFIC.","CUSTO UNITÁRIO",null,"CUSTO  TOTAL (A) + (B) + (C) + (D) + (E)"]
[null,null,null,null,null,null,"DESONERADO","NÃO DESONER.","DESONERADO","NÃO DESONER."]
[null,"COMPOSIÇÃO","COMP 077_SEE","UNIAO FERRO GALV C/ASSENTO CONICO BRONZE 2 1/2\"","UN ",null,null,null,157.36000000000001,158.72999999999999]
[null,"AGETOP_I",8,"AJUDANTE","h     ",0.4,8.1999999999999993,9.51,3.28,3.8]
[null,"AGETOP_I",11,"ENCANADOR","h     ",0.4,13.4,15.53,5.36,6.21]
[null,"MÃO DE OBRA (B) - TOTAL",null,null,null,null,null,null,8.64,10.01]
[null,"AGETOP_I","H689","FITA VEDAROSCA 12 MM","m",2.4,0.28000000000000003,0.28000000000000003,0.67,0.67]
[null,"SINAPI_I",12427,"UNIAO COM ASSENTO CONICO DE BRONZE, DIAMETRO 2 1/2\"","UN    ",1,148.05000000000001,148.05000000000001,148.05000000000001,148.05000000000001]
[null,"MATERIAL (C) - TOTAL",null,null,null,null,null,null,148.72,148.72]
[]
[76,"FONTE","CÓDIGO","DESCRIÇÃO","UNIDADE","COEFIC.","CUSTO UNITÁRIO",null,"CUSTO  TOTAL (A) + (B) + (C) + (D) + (E)"]
[null,null,null,null,null,null,"DESONERADO","NÃO DESONER.","DESONERADO","NÃO DESONER."]
[null,"COMPOSIÇÃO","COMP 076_SEE","CURVA FERRO GALVANIZADO 45G ROSCA MACHO/FEMEA REF. 2 1/2\"","UN ",null,null,null,122.92,126.09]
[null,"AGETOP_I",8,"AJUDANTE","h     ",0.92,8.1999999999999993,9.51,7.54,8.75]
[null,"AGETOP_I",11,"ENCANADOR","h     ",0.92,13.4,15.53,12.33,14.29]
[null,"MÃO DE OBRA (B) - TOTAL",null,null,null,null,null,null,19.87,23.04]
[null,"SINAPI_I",3148,"FITA VEDA ROSCA EM ROLOS DE 18 MM X 50 M (L X C)","UN    ",4.9099999999999998E-2,12.9,12.9,0.63,0.63]
[null,"SINAPI_I",1784,"CURVA 45 GRAUS DE FERRO GALVANIZADO, COM ROSCA BSP MACHO/FEMEA, DE 2 1/2\"","UN    ",1,102.42,102.42,102.42,102.42]
[null,"MATERIAL (C) - TOTAL",null,null,null,null,null,null,103.05,103.05]
[]
[22,"FONTE","CÓDIGO","DESCRIÇÃO","UNIDADE","COEFIC.","CUSTO UNITÁRIO",null,"CUSTO  TOTAL (A) + (B) + (C) + (D) + (E)"]
[null,null,null,null,null,null,"DESONERADO","NÃO DESONER.","DESONERADO","NÃO DESONER."]
[null,"COMPOSIÇÃO","COMP 022_SEE","TAMPÃO FOFO 40X50CM C/INSCRIÇÃO ","UN ",null,"-","-",199.82999999999998,200.15]
[null,"AGETOP_I",11,"ENCANADOR","h     ",0.15,13.4,15.53,2.0099999999999998,2.33]
[null,null,null,"","",null,0,0,0,0]
[null,null,null,"","",null,0,0,0,0]
[null,"MÃO DE OBRA (B) - TOTAL",null,null,null,null,null,null,2.0099999999999998,2.33]
[null,"SINAPI_I",11293,"TAMPAO FOFO SIMPLES COM BASE, CLASSE A15 CARGA MAX 1,5 T, 400 X 500 MM, COM INSCRICAO INCENDIO","UN    ",1,197.82,197.82,197.82,197.82]
[null,null,null,"","",null,0,0,0,0]
[null,null,null,"","",null,0,0,0,0]
[null,"MATERIAL (C) - TOTAL",null,null,null,null,null,null,197.82,197.82]
[]
[24,"FONTE","CÓDIGO","DESCRIÇÃO","UNIDADE","COEFIC.","CUSTO UNITÁRIO",null,"CUSTO  TOTAL (A) + (B) + (C) + (D) + (E)"]
[null,null,null,null,null,null,"DESONERADO","NÃO DESONER.","DESONERADO","NÃO DESONER."]
[null,"COMPOSIÇÃO","COMP 024_SEE","SINALIZADOR FOTOLUMINESCENTE PARA EXTINTOR","UN ",null,"-","-",24.109999999999996,24.229999999999997]
[null,"AGETOP_I",5,"SERVENTE","h     ",0.09,8.1999999999999993,9.51,0.74,0.86]
[null,null,null,"","",null,0,0,0,0]
[null,null,null,"","",null,0,0,0,0]
[null,"MÃO DE OBRA (B) - TOTAL",null,null,null,null,null,null,0.74,0.86]
[null,"AGETOP_I",3070,"BUCHA DE NYLON S-6","un",2,0.04,0.04,0.08,0.08]
[null,"AGETOP_I",3393,"PARAFUSO P/BUCHA S-6","un",2,0.08,0.08,0.16,0.16]
[null,"SINAPI_I",37556,"PLACA DE SINALIZACAO DE SEGURANCA CONTRA INCENDIO, FOTOLUMINESCENTE, QUADRADA, *20 X 20* CM, EM PVC *2* MM ANTI-CHAMAS (SIMBOLOS, CORES E PICTOGRAMAS CONFORME NBR 13434)","UN    ",1,23.13,23.13,23.13,23.13]
[null,"MATERIAL (C) - TOTAL",null,null,null,null,null,null,23.369999999999997,23.369999999999997]
[]
[186,"FONTE","CÓDIGO","DESCRIÇÃO","UNIDADE","COEFIC.","CUSTO UNITÁRIO",null,"CUSTO  TOTAL (A) + (B) + (C) + (D) + (E)"]
[null,null,null,null,null,null,"DESONERADO","NÃO DESONER.","DESONERADO","NÃO DESONER."]
[null,"COMPOSIÇÃO","COMP 186_SEE","BOTOEIRA BOMBA DE INCÊNDIO C/ MARTELO CONVENCIONAL/ ANALÓGICA","UN ",null,null,null,85.1,88.539999999999992]
[null,"AGETOP_I",8,"AJUDANTE","h     ",1,8.1999999999999993,9.51,8.1999999999999993,9.51]
[null,"AGETOP_I",12,"ELETRICISTA","h     ",1,13.4,15.53,13.4,15.53]
[null,null,null,"","",null,0,0,0,0]
[null,"MÃO DE OBRA (B) - TOTAL",null,null,null,null,null,null,21.6,25.04]
[null,"COTAÇÃO","COT 088_SEE","BOTOEIRA BOMBA DE INCÊNDIO C/ MARTELO CONVENCIONAL/ ANALÓGICA","UN",1,63.5,63.5,63.5,63.5]
[null,null,null,"","",null,0,0,0,0]
[null,null,null,"","",null,0,0,0,0]
[null,"MATERIAL (C) - TOTAL",null,null,null,null,null,null,63.5,63.5]
[]
[188,"FONTE","CÓDIGO","DESCRIÇÃO","UNIDADE","COEFIC.","CUSTO UNITÁRIO",null,"CUSTO  TOTAL (A) + (B) + (C) + (D) + (E)"]
[null,null,null,null,null,null,"DESONERADO","NÃO DESONER.","DESONERADO","NÃO DESONER."]
[null,"COMPOSIÇÃO","COMP 188_SEE","ACIONADOR MANUAL DE ALARME","UN ",null,null,null,100.61,103.36]
[null,"AGETOP_I",8,"AJUDANTE","h     ",0.8,8.1999999999999993,9.51,6.56,7.61]
[null,"AGETOP_I",12,"ELETRICISTA","h     ",0.8,13.4,15.53,10.72,12.42]
[null,null,null,"","",null,0,0,0,0]
[null,"MÃO DE OBRA (B) - TOTAL",null,null,null,null,null,null,17.28,20.03]
[null,"COTAÇÃO","COT 090_SEE","ACIONADOR MANUAL DE ALARME","UN",1,83.333333333333329,83.333333333333329,83.33,83.33]
[null,null,null,"","",null,0,0,0,0]
[null,null,null,"","",null,0,0,0,0]
[null,"MATERIAL (C) - TOTAL",null,null,null,null,null,null,83.33,83.33]
[]
[190,"FONTE","CÓDIGO","DESCRIÇÃO","UNIDADE","COEFIC.","CUSTO UNITÁRIO",null,"CUSTO  TOTAL (A) + (B) + (C) + (D) + (E)"]
[null,null,null,null,null,null,"DESONERADO","NÃO DESONER.","DESONERADO","NÃO DESONER."]
[null,"COMPOSIÇÃO","COMP 190_SEE","CENTRAL DE DETECÇÃO E ALARME DE 40 SETORES COM BATERIA","UN ",null,null,null,1136.1300000000001,1163.6500000000001]
[null,"AGETOP_I",8,"AJUDANTE","h     ",8,8.1999999999999993,9.51,65.599999999999994,76.08]
[null,"AGETOP_I",12,"ELETRICISTA","h     ",8,13.4,15.53,107.2,124.24]
[null,null,null,"","",null,0,0,0,0]
[null,"MÃO DE OBRA (B) - TOTAL",null,null,null,null,null,null,172.8,200.32]
[null,"COTAÇÃO","COT 092_SEE","CENTRAL DE DETECÇÃO E ALARME DE 40 SETORES COM BATERIA (PREÇO MÉDIO)","UN",1,963.33333333333337,963.33333333333337,963.33,963.33]
[null,null,null,"","",null,0,0,0,0]
[null,null,null,"","",null,0,0,0,0]
[null,"MATERIAL (C) - TOTAL",null,null,null,null,null,null,963.33,963.33]
[]
[25,"FONTE","CÓDIGO","DESCRIÇÃO","UNIDADE","COEFIC.","CUSTO UNITÁRIO",null,"CUSTO  TOTAL (A) + (B) + (C) + (D) + (E)"]
[null,null,null,null,null,null,"DESONERADO","NÃO DESONER.","DESONERADO","NÃO DESONER."]
[null,"COMPOSIÇÃO","COMP 025_SEE","SINALIZADOR FOTOLUMINESCENTE DE EMERGÊNCIA","UN ",null,"-","-",24.109999999999996,24.229999999999997]
[null,"AGETOP_I",5,"SERVENTE","h     ",0.09,8.1999999999999993,9.51,0.74,0.86]
[null,"MÃO DE OBRA (B) - TOTAL",null,null,null,null,null,null,0.74,0.86]
[null,"AGETOP_I",3070,"BUCHA DE NYLON S-6","un",2,0.04,0.04,0.08,0.08]
[null,"AGETOP_I",3393,"PARAFUSO P/BUCHA S-6","un",2,0.08,0.08,0.16,0.16]
[null,"SINAPI_I",37556,"PLACA DE SINALIZACAO DE SEGURANCA CONTRA INCENDIO, FOTOLUMINESCENTE, QUADRADA, *20 X 20* CM, EM PVC *2* MM ANTI-CHAMAS (SIMBOLOS, CORES E PICTOGRAMAS CONFORME NBR 13434)","UN    ",1,23.13,23.13,23.13,23.13]
[null,"MATERIAL (C) - TOTAL",null,null,null,null,null,null,23.369999999999997,23.369999999999997]
[]
[277,"FONTE","CÓDIGO","DESCRIÇÃO","UNIDADE","COEFIC.","CUSTO UNITÁRIO",null,"CUSTO  TOTAL (A) + (B) + (C) + (D) + (E)"]
[null,null,null,null,null,null,"DESONERADO","NÃO DESONER.","DESONERADO","NÃO DESONER."]
[null,"COMPOSIÇÃO","COMP 277_SEE","MARCAÇÃO NO PISO - 1X1 M PARA EXTINTOR","M2",null,null,null,28.63,28.7]
[null,"AGETOP_I",5,"SERVENTE","h     ",3.3300000000000003E-2,8.1999999999999993,9.51,0.27,0.32]
[null,null,null,"","",null,0,0,0,0]
[null,null,null,"","",null,0,0,0,0]
[null,"MÃO DE OBRA (B) - TOTAL",null,null,null,null,null,null,0.27,0.32]
[null,"SINAPI_I",5318,"SOLVENTE DILUENTE A BASE DE AGUARRAS","L     ",0.13,11.98,11.98,1.56,1.56]
[null,"SINAPI",5824,"CAMINHÃO TOCO, PBT 16.000 KG, CARGA ÚTIL MÁX. 10.685 KG, DIST. ENTRE EIXOS 4,8 M, POTÊNCIA 189 CV, INCLUSIVE CARROCERIA FIXA ABERTA DE MADEIRA P/ TRANSPORTE GERAL DE CARGA SECA, DIMEN. APROX. 2,5 X 7,00 X 0,50 M - CHP DIURNO. AF_06/2014","CHP",3.3E-3,137.26,140.47,0.45,0.46]
[null,"SINAPI_I",7343,"TINTA A BASE DE RESINA ACRILICA, PARA SINALIZACAO HORIZONTAL VIARIA (NBR 11862)","L     ",0.6,11.05,11.05,6.63,6.63]
[null,"SINAPI_I",7348,"TINTA ACRILICA PREMIUM PARA PISO","L     ",0.03,12,12,0.36,0.36]
[null,"SINAPI_I",25972,"MICROESFERAS DE VIDRO PARA SINALIZACAO HORIZONTAL VIARIA, TIPO I-B (PREMIX) - NBR 16184","KG    ",2.14,8.8800000000000008,8.8800000000000008,19,19]
[null,"SINAPI",95133,"MÁQUINA DEMARCADORA DE FAIXA DE TRÁFEGO À FRIO, AUTOPROPELIDA, POTÊNCIA 38 HP - CHP DIURNO. AF_07/2016","CHP",3.3E-3,109.96,113.54,0.36,0.37]
[null,"MATERIAL (C) - TOTAL",null,null,null,null,null,null,28.36,28.38]
[]
[80,"FONTE","CÓDIGO","DESCRIÇÃO","UNIDADE","COEFIC.","CUSTO UNITÁRIO",null,"CUSTO  TOTAL (A) + (B) + (C) + (D) + (E)"]
[null,null,null,null,null,null,"DESONERADO","NÃO DESONER.","DESONERADO","NÃO DESONER."]
[null,"COMPOSIÇÃO","COMP 080_SEE","BUCHA REDUCAO FERRO GALV ROSCA REF. 2 1/2\"X1\"","UN ",null,null,null,31.92,32.880000000000003]
[null,"AGETOP_I",8,"AJUDANTE","h     ",0.28000000000000003,8.1999999999999993,9.51,2.2999999999999998,2.66]
[null,"AGETOP_I",11,"ENCANADOR","h     ",0.28000000000000003,13.4,15.53,3.75,4.3499999999999996]
[null,"MÃO DE OBRA (B) - TOTAL",null,null,null,null,null,null,6.05,7.01]
[null,"SINAPI_I",3148,"FITA VEDA ROSCA EM ROLOS DE 18 MM X 50 M (L X C)","UN    ",2.4500000000000001E-2,12.9,12.9,0.32,0.32]
[null,"SINAPI_I",773,"BUCHA DE REDUCAO DE FERRO GALVANIZADO, COM ROSCA BSP, DE 2 1/2\" X 1\"","UN    ",1,25.55,25.55,25.55,25.55]
[null,"MATERIAL (C) - TOTAL",null,null,null,null,null,null,25.87,25.87]
[]
[77,"FONTE","CÓDIGO","DESCRIÇÃO","UNIDADE","COEFIC.","CUSTO UNITÁRIO",null,"CUSTO  TOTAL (A) + (B) + (C) + (D) + (E)"]
[null,null,null,null,null,null,"DESONERADO","NÃO DESONER.","DESONERADO","NÃO DESONER."]
[null,"COMPOSIÇÃO","COMP 077_SEE","UNIAO FERRO GALV C/ASSENTO CONICO BRONZE 2 1/2\"","UN ",null,null,null,157.36000000000001,158.72999999999999]
[null,"AGETOP_I",8,"AJUDANTE","h     ",0.4,8.1999999999999993,9.51,3.28,3.8]
[null,"AGETOP_I",11,"ENCANADOR","h     ",0.4,13.4,15.53,5.36,6.21]
[null,"MÃO DE OBRA (B) - TOTAL",null,null,null,null,null,null,8.64,10.01]
[null,"AGETOP_I","H689","FITA VEDAROSCA 12 MM","m",2.4,0.28000000000000003,0.28000000000000003,0.67,0.67]
[null,"SINAPI_I",12427,"UNIAO COM ASSENTO CONICO DE BRONZE, DIAMETRO 2 1/2\"","UN    ",1,148.05000000000001,148.05000000000001,148.05000000000001,148.05000000000001]
[null,"MATERIAL (C) - TOTAL",null,null,null,null,null,null,148.72,148.72]
[]
[84,"FONTE","CÓDIGO","DESCRIÇÃO","UNIDADE","COEFIC.","CUSTO UNITÁRIO",null,"CUSTO  TOTAL (A) + (B) + (C) + (D) + (E)"]
[null,null,null,null,null,null,"DESONERADO","NÃO DESONER.","DESONERADO","NÃO DESONER."]
[null,"COMPOSIÇÃO","COMP 084_SEE","GUARDA-CORPO COM CORRIMÃO - SEDUC","M",null,null,null,204.60000000000002,209.46]
[null,"AGETOP_I",25,"OFICIAL \"B\"","h     ",1.1000000000000001,13.4,15.53,14.74,17.079999999999998]
[null,"AGETOP_I",8,"AJUDANTE","h     ",1.1000000000000001,8.1999999999999993,9.51,9.02,10.46]
[null,null,null,"","",null,0,0,0,0]
[null,"MÃO DE OBRA (B) - TOTAL",null,null,null,null,null,null,23.759999999999998,27.54]
[null,"AGETOP_I",2376,"TUBO INDUSTRIAL 2\" CHAPA 13 ","Kg",7.7778,5.23,5.23,40.68,40.68]
[null,"AGETOP_I",2504,"TUBO INDUSTRIAL D=25 MM CHAPA 13 ","Kg",4.6319999999999997,5.07,5.07,23.48,23.48]
[null,"AGETOP_I",2377,"TUBO INDUSTRIAL 40X40 CH.13","Kg",6.3419999999999996,5.07,5.07,32.15,32.15]
[null,"AGETOP_I",2421,"TUBO INDUSTRIAL 1.1/2\" CHAPA 13 ","Kg",1.4862,5.07,5.07,7.54,7.54]
[null,"AGETOP_I",2417,"MASSA PLASTICA","Kg",0.2041,10.58,10.58,2.16,2.16]
[null,"AGETOP_I",2246,"ELETRODO 2.5 OK","Kg",0.11459999999999999,8.6999999999999993,8.6999999999999993,1,1]
[null,"AGETOP_I",1672,"LIXA PARA FERRO ( NÚMERO 100 )","un",0.25509999999999999,2.12,2.12,0.54,0.54]
[null,"AGETOP_I",1264,"DISCO DE DESBASTE 7/8\" P/ CONC./FERRO (1/4\" X 7\")","un",5.0999999999999997E-2,7,7,0.36,0.36]
[null,"AGETOP_I",1334,"DISCO DE CORTE DIAM. 5/8\"- 10\"","un",0.373,5.5,5.5,2.0499999999999998,2.0499999999999998]
[null,"AGETOP_I",2902,"FABRICAÇÃO / MONTAGEM","un",1,50.44,50.44,50.44,50.44]
[null,"AGETOP_I",2150,"CHAPA DE FERRO DOBRADA No.13","Kg",0.43519999999999998,5.28,5.28,2.2999999999999998,2.2999999999999998]
[null,"AGETOP_I",2719,"CHAPA PERFILADA 3/16\"","Kg",1.0979999999999999,5.04,5.04,5.53,5.53]
[null,"AGETOP_I",2436,"ACO CA-25 - 6,3 MM (1/4\") - BARRA LISA A-36","Kg",0.38124999999999998,5.13,5.13,1.96,1.96]
[null,"AGETOP",261602,"PINT.ESMALTE/ESQUAD.FERRO C/FUNDO ANTICOR.","m2    ",0.78,13.65,15.04,10.65,11.73]
[null,"MATERIAL (C) - TOTAL",null,null,null,null,null,null,180.84000000000003,181.92000000000002]
[]
[83,"FONTE","CÓDIGO","DESCRIÇÃO","UNIDADE","COEFIC.","CUSTO UNITÁRIO",null,"CUSTO  TOTAL (A) + (B) + (C) + (D) + (E)"]
[null,null,null,null,null,null,"DESONERADO","NÃO DESONER.","DESONERADO","NÃO DESONER."]
[null,"COMPOSIÇÃO","COMP 083_SEE","CORRIMÃO PISO - SEDUC","M",null,null,null,141.9,145.95000000000002]
[null,"AGETOP_I",25,"OFICIAL \"B\"","h     ",1,13.4,15.53,13.4,15.53]
[null,"AGETOP_I",8,"AJUDANTE","h     ",1,8.1999999999999993,9.51,8.1999999999999993,9.51]
[null,"MÃO DE OBRA (B) - TOTAL",null,null,null,null,null,null,21.6,25.04]
[null,"AGETOP_I",2376,"TUBO INDUSTRIAL 2\" CHAPA 13 ","Kg",8.2197499999999994,5.23,5.23,42.99,42.99]
[null,"AGETOP_I",2504,"TUBO INDUSTRIAL D=25 MM CHAPA 13 ","Kg",1.1000000000000001,5.07,5.07,5.58,5.58]
[null,"AGETOP_I",2417,"MASSA PLASTICA","Kg",0.2041,10.58,10.58,2.16,2.16]
[null,"AGETOP_I",2246,"ELETRODO 2.5 OK","Kg",0.11459999999999999,8.6999999999999993,8.6999999999999993,1,1]
[null,"AGETOP_I",1672,"LIXA PARA FERRO ( NÚMERO 100 )","un",0.125,2.12,2.12,0.27,0.27]
[null,"AGETOP_I",1264,"DISCO DE DESBASTE 7/8\" P/ CONC./FERRO (1/4\" X 7\")","un",2.5000000000000001E-2,7,7,0.18,0.18]
[null,"AGETOP_I",1334,"DISCO DE CORTE DIAM. 5/8\"- 10\"","un",0.1865,5.5,5.5,1.03,1.03]
[null,"AGETOP_I",2902,"FABRICAÇÃO / MONTAGEM","un",1,50.44,50.44,50.44,50.44]
[null,"AGETOP_I",2150,"CHAPA DE FERRO DOBRADA No.13","Kg",0.43519999999999998,5.28,5.28,2.2999999999999998,2.2999999999999998]
[null,"AGETOP_I",2719,"CHAPA PERFILADA 3/16\"","Kg",1.1644000000000001,5.04,5.04,5.87,5.87]
[null,"AGETOP_I",2436,"ACO CA-25 - 6,3 MM (1/4\") - BARRA LISA A-36","Kg",0.48150000000000004,5.13,5.13,2.4700000000000002,2.4700000000000002]
[null,"AGETOP",261602,"PINT.ESMALTE/ESQUAD.FERRO C/FUNDO ANTICOR.","m2    ",0.44,13.65,15.04,6.01,6.62]
[null,"MATERIAL (C) - TOTAL",null,null,null,null,null,null,120.30000000000001,120.91000000000001]
[]
[86,"FONTE","CÓDIGO","DESCRIÇÃO","UNIDADE","COEFIC.","CUSTO UNITÁRIO",null,"CUSTO  TOTAL (A) + (B) + (C) + (D) + (E)"]
[null,null,null,null,null,null,"DESONERADO","NÃO DESONER.","DESONERADO","NÃO DESONER."]
[null,"COMPOSIÇÃO","COMP 086_SEE","ELEVADOR (PLATAFORMA VERTICAL) MODELO HERA OU EQUIVALENTE 02 PARADAS - CAPACIDADE 280KG (INSTALADO)","UN ",null,null,null,37873.33,37873.33]
[null,null,null,"","",null,0,0,0,0]
[null,null,null,"","",null,0,0,0,0]
[null,null,null,"","",null,0,0,0,0]
[null,"MÃO DE OBRA (B) - TOTAL",null,null,null,null,null,null,0,0]
[null,"COTAÇÃO","COT 016_SEE","ELEVADOR (PLATAFORMA VERTICAL) MODELO HERA OU EQUIVALENTE 02 PARADAS - CAPACIDADE 280KG (INSTALADO)","UN ",1,37873.333333333336,37873.333333333336,37873.33,37873.33]
[null,null,null,"","",null,0,0,0,0]
[null,null,null,"","",null,0,0,0,0]
[null,"MATERIAL (C) - TOTAL",null,null,null,null,null,null,37873.33,37873.33]
[]
[382,"FONTE","CÓDIGO","DESCRIÇÃO","UNIDADE","COEFIC.","CUSTO UNITÁRIO",null,"CUSTO  TOTAL (A) + (B) + (C) + (D) + (E)"]
[null,null,null,null,null,null,"DESONERADO","NÃO DESONER.","DESONERADO","NÃO DESONER."]
[null,"COMPOSIÇÃO","COMP 382_SEE","TE DE REDUCAO DE FERRO GALVANIZADO, COM ROSCA BSP, DE 3/4\" X 1/2\"","UN ",null,null,null,22.42,24.51]
[null,"AGETOP_I",8,"AJUDANTE","h     ",0.6,8.1999999999999993,9.51,4.92,5.71]
[null,"AGETOP_I",11,"ENCANADOR","h     ",0.61050000000000004,13.4,15.53,8.18,9.48]
[null,null,null,"","",null,0,0,0,0]
[null,"MÃO DE OBRA (B) - TOTAL",null,null,null,null,null,null,13.1,15.190000000000001]
[null,"SINAPI_I",3146,"FITA VEDA ROSCA EM ROLOS DE 18 MM X 10 M (L X C)","UN    ",0.12075471698113208,3.5,3.5,0.42,0.42]
[null,"SINAPI_I",6302,"TE DE REDUCAO DE FERRO GALVANIZADO, COM ROSCA BSP, DE 3/4\" X 1/2\"","UN    ",1,8.9,8.9,8.9,8.9]
[null,null,null,"","",null,0,0,0,0]
[null,"MATERIAL (C) - TOTAL",null,null,null,null,null,null,9.32,9.32]
[]
[383,"FONTE","CÓDIGO","DESCRIÇÃO","UNIDADE","COEFIC.","CUSTO UNITÁRIO",null,"CUSTO  TOTAL (A) + (B) + (C) + (D) + (E)"]
[null,null,null,null,null,null,"DESONERADO","NÃO DESONER.","DESONERADO","NÃO DESONER."]
[null,"COMPOSIÇÃO","COMP 383_SEE","BUCHA DE REDUCAO DE FERRO GALVANIZADO, COM ROSCA BSP, DE 1/2\" X 1/4\"","UN ",null,null,null,7.07,7.6199999999999992]
[null,"AGETOP_I",8,"AJUDANTE","h     ",0.16,8.1999999999999993,9.51,1.31,1.52]
[null,"AGETOP_I",11,"ENCANADOR","h     ",0.16,13.4,15.53,2.14,2.48]
[null,null,null,"","",null,0,0,0,0]
[null,"MÃO DE OBRA (B) - TOTAL",null,null,null,null,null,null,3.45,4]
[null,"AGETOP_I","H689","FITA VEDAROSCA 12 MM","m",1.2,0.28000000000000003,0.28000000000000003,0.34,0.34]
[null,"SINAPI_I",770,"BUCHA DE REDUCAO DE FERRO GALVANIZADO, COM ROSCA BSP, DE 1/2\" X 1/4\"","UN    ",1,3.28,3.28,3.28,3.28]
[null,null,null,"","",null,0,0,0,0]
[null,"MATERIAL (C) - TOTAL",null,null,null,null,null,null,3.6199999999999997,3.6199999999999997]
[]
[212,"FONTE","CÓDIGO","DESCRIÇÃO","UNIDADE","COEFIC.","CUSTO UNITÁRIO",null,"CUSTO  TOTAL (A) + (B) + (C) + (D) + (E)"]
[null,null,null,null,null,null,"DESONERADO","NÃO DESONER.","DESONERADO","NÃO DESONER."]
[null,"COMPOSIÇÃO","COMP 212_SEE","NIPLE DE REDUÇÃO 1/2\" X 1/4\" BSP","UN ",null,null,null,9.5,10.050000000000001]
[null,"AGETOP_I",8,"AJUDANTE","h     ",0.16,8.1999999999999993,9.51,1.31,1.52]
[null,"AGETOP_I",11,"ENCANADOR","h     ",0.16,13.4,15.53,2.14,2.48]
[null,null,null,"","",null,0,0,0,0]
[null,"MÃO DE OBRA (B) - TOTAL",null,null,null,null,null,null,3.45,4]
[null,"COTAÇÃO","COT 103_SEE","NIPLE DE REDUÇÃO 1/2\" X 1/4\" BSP","UN",1,6.0533333333333337,6.0533333333333337,6.05,6.05]
[null,null,null,"","",null,0,0,0,0]
[null,null,null,"","",null,0,0,0,0]
[null,"MATERIAL (C) - TOTAL",null,null,null,null,null,null,6.05,6.05]
[]
[213,"FONTE","CÓDIGO","DESCRIÇÃO","UNIDADE","COEFIC.","CUSTO UNITÁRIO",null,"CUSTO  TOTAL (A) + (B) + (C) + (D) + (E)"]
[null,null,null,null,null,null,"DESONERADO","NÃO DESONER.","DESONERADO","NÃO DESONER."]
[null,"COMPOSIÇÃO","COMP 213_SEE","NIPLE DE REDUÇÃO 3/4\" X 1/2\" BSP","UN ",null,null,null,13.16,13.71]
[null,"AGETOP_I",8,"AJUDANTE","h     ",0.16,8.1999999999999993,9.51,1.31,1.52]
[null,"AGETOP_I",11,"ENCANADOR","h     ",0.16,13.4,15.53,2.14,2.48]
[null,null,null,"","",null,0,0,0,0]
[null,"MÃO DE OBRA (B) - TOTAL",null,null,null,null,null,null,3.45,4]
[null,"COTAÇÃO","COT 104_SEE","NIPLE DE REDUÇÃO 3/4\" X 1/2\" BSP","UN",1,9.7099999999999991,9.7099999999999991,9.7100000000000009,9.7100000000000009]
[null,null,null,"","",null,0,0,0,0]
[null,null,null,"","",null,0,0,0,0]
[null,"MATERIAL (C) - TOTAL",null,null,null,null,null,null,9.7100000000000009,9.7100000000000009]
[]
[237,"FONTE","CÓDIGO","DESCRIÇÃO","UNIDADE","COEFIC.","CUSTO UNITÁRIO",null,"CUSTO  TOTAL (A) + (B) + (C) + (D) + (E)"]
[null,null,null,null,null,null,"DESONERADO","NÃO DESONER.","DESONERADO","NÃO DESONER."]
[null,"COMPOSIÇÃO","COMP 237_SEE","FITA ANTICORROSIVA","M",null,null,null,11.14,11.83]
[null,"AGETOP_I",8,"AJUDANTE","h     ",0.2,8.1999999999999993,9.51,1.64,1.9]
[null,"AGETOP_I",12,"ELETRICISTA","h     ",0.2,13.4,15.53,2.68,3.11]
[null,null,null,"","",null,0,0,0,0]
[null,"MÃO DE OBRA (B) - TOTAL",null,null,null,null,null,null,4.32,5.01]
[null,"SINAPI_I",39634,"FITA ADESIVA ANTICORROSIVA DE PVC FLEXIVEL, COR PRETA, PARA PROTECAO TUBULACAO, 50 MM X 30 M (L X C), E= *0,25* MM","M     ",1,6.82,6.82,6.82,6.82]
[null,null,null,"","",null,0,0,0,0]
[null,null,null,"","",null,0,0,0,0]
[null,"MATERIAL (C) - TOTAL",null,null,null,null,null,null,6.82,6.82]
[]
[542,"FONTE","CÓDIGO","DESCRIÇÃO","UNIDADE","COEFIC.","CUSTO UNITÁRIO",null,"CUSTO  TOTAL (A) + (B) + (C) + (D) + (E)"]
[null,null,null,null,null,null,"DESONERADO","NÃO DESONER.","DESONERADO","NÃO DESONER."]
[null,"COMPOSIÇÃO","COMP 542_SEE","VÁLVULA UGV 3/4\" (S) LATÃO","UN ",null,null,null,25.17,26.66]
[null,"AGETOP_I",8,"AJUDANTE","h     ",0.432,8.1999999999999993,9.51,3.54,4.1100000000000003]
[null,"AGETOP_I",11,"ENCANADOR","h     ",0.432,13.4,15.53,5.79,6.71]
[null,null,null,"","",null,0,0,0,0]
[null,"MÃO DE OBRA (B) - TOTAL",null,null,null,null,null,null,9.33,10.82]
[null,"COTAÇÃO","COT 281_SEE","VÁLVULA UGV 3/4\" (S) LATÃO","UN ",1,15.836666666666666,15.836666666666666,15.84,15.84]
[null,null,null,"","",null,0,0,0,0]
[null,null,null,"","",null,0,0,0,0]
[null,"MATERIAL (C) - TOTAL",null,null,null,null,null,null,15.84,15.84]
[]
[543,"FONTE","CÓDIGO","DESCRIÇÃO","UNIDADE","COEFIC.","CUSTO UNITÁRIO",null,"CUSTO  TOTAL (A) + (B) + (C) + (D) + (E)"]
[null,null,null,null,null,null,"DESONERADO","NÃO DESONER.","DESONERADO","NÃO DESONER."]
[null,"COMPOSIÇÃO","COMP 543_SEE","VÁLVULA UGV 1/2\" (S) LATÃO","UN ",null,null,null,24.5,25.990000000000002]
[null,"AGETOP_I",8,"AJUDANTE","h     ",0.432,8.1999999999999993,9.51,3.54,4.1100000000000003]
[null,"AGETOP_I",11,"ENCANADOR","h     ",0.432,13.4,15.53,5.79,6.71]
[null,null,null,"","",null,0,0,0,0]
[null,"MÃO DE OBRA (B) - TOTAL",null,null,null,null,null,null,9.33,10.82]
[null,"COTAÇÃO","COT 282_SEE","VÁLVULA UGV 1/2\" (S) LATÃO","UN ",1,15.166666666666666,15.166666666666666,15.17,15.17]
[null,null,null,"","",null,0,0,0,0]
[null,null,null,"","",null,0,0,0,0]
[null,"MATERIAL (C) - TOTAL",null,null,null,null,null,null,15.17,15.17]
[]
[211,"FONTE","CÓDIGO","DESCRIÇÃO","UNIDADE","COEFIC.","CUSTO UNITÁRIO",null,"CUSTO  TOTAL (A) + (B) + (C) + (D) + (E)"]
[null,null,null,null,null,null,"DESONERADO","NÃO DESONER.","DESONERADO","NÃO DESONER."]
[null,"COMPOSIÇÃO","COMP 211_SEE","REGULADOR DE 2º ESTÁGIO 5KG/H","UN ",null,null,null,85.46,89.419999999999987]
[null,"AGETOP_I",8,"AJUDANTE","h     ",1.1499999999999999,8.1999999999999993,9.51,9.43,10.94]
[null,"AGETOP_I",11,"ENCANADOR","h     ",1.1499999999999999,13.4,15.53,15.41,17.86]
[null,null,null,"","",null,0,0,0,0]
[null,"MÃO DE OBRA (B) - TOTAL",null,null,null,null,null,null,24.84,28.799999999999997]
[null,"COTAÇÃO","COT 102_SEE","REGULADOR DE 2º ESTÁGIO 5KG/H","UN",1,59.833333333333336,59.833333333333336,59.83,59.83]
[null,"AGETOP_I","H689","FITA VEDAROSCA 12 MM","m",2.82,0.28000000000000003,0.28000000000000003,0.79,0.79]
[null,null,null,"","",null,0,0,0,0]
[null,"MATERIAL (C) - TOTAL",null,null,null,null,null,null,60.62,60.62]
[]
[210,"FONTE","CÓDIGO","DESCRIÇÃO","UNIDADE","COEFIC.","CUSTO UNITÁRIO",null,"CUSTO  TOTAL (A) + (B) + (C) + (D) + (E)"]
[null,null,null,null,null,null,"DESONERADO","NÃO DESONER.","DESONERADO","NÃO DESONER."]
[null,"COMPOSIÇÃO","COMP 210_SEE","REGULADOR DE 1º ESTÁGIO 60KG/H MODELO AP-40  COM MANÔMETRO","UN ",null,null,null,231.21,235.17000000000002]
[null,"AGETOP_I",8,"AJUDANTE","h     ",1.1499999999999999,8.1999999999999993,9.51,9.43,10.94]
[null,"AGETOP_I",11,"ENCANADOR","h     ",1.1499999999999999,13.4,15.53,15.41,17.86]
[null,null,null,"","",null,0,0,0,0]
[null,"MÃO DE OBRA (B) - TOTAL",null,null,null,null,null,null,24.84,28.799999999999997]
[null,"COTAÇÃO","COT 101_SEE","REGULADOR DE 1º ESTÁGIO 60KG/H MODELO AP-40  COM MANÔMETRO","UN",1,205.57666666666668,205.57666666666668,205.58,205.58]
[null,"AGETOP_I","H689","FITA VEDAROSCA 12 MM","m",2.82,0.28000000000000003,0.28000000000000003,0.79,0.79]
[null,null,null,"","",null,0,0,0,0]
[null,"MATERIAL (C) - TOTAL",null,null,null,null,null,null,206.37,206.37]
[]
[235,"FONTE","CÓDIGO","DESCRIÇÃO","UNIDADE","COEFIC.","CUSTO UNITÁRIO",null,"CUSTO  TOTAL (A) + (B) + (C) + (D) + (E)"]
[null,null,null,null,null,null,"DESONERADO","NÃO DESONER.","DESONERADO","NÃO DESONER."]
[null,"COMPOSIÇÃO","COMP 235_SEE","PLACA DE SINALIZAÇÃO EM PVC COD 01 - (300X300) PROIBIDO FUMAR","UN ",null,null,null,24.109999999999996,24.229999999999997]
[null,"AGETOP_I",5,"SERVENTE","h     ",0.09,8.1999999999999993,9.51,0.74,0.86]
[null,null,null,"","",null,0,0,0,0]
[null,null,null,"","",null,0,0,0,0]
[null,"MÃO DE OBRA (B) - TOTAL",null,null,null,null,null,null,0.74,0.86]
[null,"AGETOP_I",3070,"BUCHA DE NYLON S-6","un",2,0.04,0.04,0.08,0.08]
[null,"AGETOP_I",3393,"PARAFUSO P/BUCHA S-6","un",2,0.08,0.08,0.16,0.16]
[null,"SINAPI_I",37556,"PLACA DE SINALIZACAO DE SEGURANCA CONTRA INCENDIO, FOTOLUMINESCENTE, QUADRADA, *20 X 20* CM, EM PVC *2* MM ANTI-CHAMAS (SIMBOLOS, CORES E PICTOGRAMAS CONFORME NBR 13434)","UN    ",1,23.13,23.13,23.13,23.13]
[null,"MATERIAL (C) - TOTAL",null,null,null,null,null,null,23.369999999999997,23.369999999999997]
[]
[236,"FONTE","CÓDIGO","DESCRIÇÃO","UNIDADE","COEFIC.","CUSTO UNITÁRIO",null,"CUSTO  TOTAL (A) + (B) + (C) + (D) + (E)"]
[null,null,null,null,null,null,"DESONERADO","NÃO DESONER.","DESONERADO","NÃO DESONER."]
[null,"COMPOSIÇÃO","COMP 236_SEE","PLACA DE SINALIZAÇÃO EM PVC COD 06 - (300X300) PERIGO INFLAMÁVEL","UN ",null,null,null,24.109999999999996,24.229999999999997]
[null,"AGETOP_I",5,"SERVENTE","h     ",0.09,8.1999999999999993,9.51,0.74,0.86]
[null,null,null,"","",null,0,0,0,0]
[null,null,null,"","",null,0,0,0,0]
[null,"MÃO DE OBRA (B) - TOTAL",null,null,null,null,null,null,0.74,0.86]
[null,"AGETOP_I",3070,"BUCHA DE NYLON S-6","un",2,0.04,0.04,0.08,0.08]
[null,"AGETOP_I",3393,"PARAFUSO P/BUCHA S-6","un",2,0.08,0.08,0.16,0.16]
[null,"SINAPI_I",37556,"PLACA DE SINALIZACAO DE SEGURANCA CONTRA INCENDIO, FOTOLUMINESCENTE, QUADRADA, *20 X 20* CM, EM PVC *2* MM ANTI-CHAMAS (SIMBOLOS, CORES E PICTOGRAMAS CONFORME NBR 13434)","UN    ",1,23.13,23.13,23.13,23.13]
[null,"MATERIAL (C) - TOTAL",null,null,null,null,null,null,23.369999999999997,23.369999999999997]
[]
[387,"FONTE","CÓDIGO","DESCRIÇÃO","UNIDADE","COEFIC.","CUSTO UNITÁRIO",null,"CUSTO  TOTAL (A) + (B) + (C) + (D) + (E)"]
[null,null,null,null,null,null,"DESONERADO","NÃO DESONER.","DESONERADO","NÃO DESONER."]
[null,"COMPOSIÇÃO","COMP 387_SEE","LÂMPADA LED TUBULAR 18W ","UN ",null,null,null,22.28,22.330000000000002]
[null,"AGETOP_I",8,"AJUDANTE","h     ",1.4999999999999999E-2,8.1999999999999993,9.51,0.12,0.14000000000000001]
[null,"AGETOP_I",12,"ELETRICISTA","h     ",1.4999999999999999E-2,13.4,15.53,0.2,0.23]
[null,null,null,"","",null,0,0,0,0]
[null,"MÃO DE OBRA (B) - TOTAL",null,null,null,null,null,null,0.32,0.37]
[null,"COTAÇÃO","COT 195_SEE","LÂMPADA LED TUBULAR 18W ","UN",1,21.959999999999997,21.959999999999997,21.96,21.96]
[null,null,null,"","",null,0,0,0,0]
[null,null,null,"","",null,0,0,0,0]
[null,"MATERIAL (C) - TOTAL",null,null,null,null,null,null,21.96,21.96]
[]
[209,"FONTE","CÓDIGO","DESCRIÇÃO","UNIDADE","COEFIC.","CUSTO UNITÁRIO",null,"CUSTO  TOTAL (A) + (B) + (C) + (D) + (E)"]
[null,null,null,null,null,null,"DESONERADO","NÃO DESONER.","DESONERADO","NÃO DESONER."]
[null,"COMPOSIÇÃO","COMP 209_SEE","TOALHEIRO PLÁSTICO TIPO DISPENSER PARA PAPEL TOALHA INTERFOLHADO","UN ",null,null,null,55.889999999999993,56.749999999999993]
[null,"AGETOP_I",8,"AJUDANTE","h     ",0.25,8.1999999999999993,9.51,2.0499999999999998,2.38]
[null,"AGETOP_I",4,"PEDREIRO","h     ",0.25,13.4,15.53,3.35,3.88]
[null,"MÃO DE OBRA (B) - TOTAL",null,null,null,null,null,null,5.4,6.26]
[null,"SINAPI_I",37401,"TOALHEIRO PLASTICO TIPO DISPENSER PARA PAPEL TOALHA INTERFOLHADO","UN    ",1,49.69,49.69,49.69,49.69]
[null,"AGETOP_I",2221,"PARAFUSO COM BUCHA S-8","un",4,0.2,0.2,0.8,0.8]
[null,"MATERIAL (C) - TOTAL",null,null,null,null,null,null,50.489999999999995,50.489999999999995]
[]
[209,"FONTE","CÓDIGO","DESCRIÇÃO","UNIDADE","COEFIC.","CUSTO UNITÁRIO",null,"CUSTO  TOTAL (A) + (B) + (C) + (D) + (E)"]
[null,null,null,null,null,null,"DESONERADO","NÃO DESONER.","DESONERADO","NÃO DESONER."]
[null,"COMPOSIÇÃO","COMP 209_SEE","TOALHEIRO PLÁSTICO TIPO DISPENSER PARA PAPEL TOALHA INTERFOLHADO","UN ",null,null,null,55.889999999999993,56.749999999999993]
[null,"AGETOP_I",8,"AJUDANTE","h     ",0.25,8.1999999999999993,9.51,2.0499999999999998,2.38]
[null,"AGETOP_I",4,"PEDREIRO","h     ",0.25,13.4,15.53,3.35,3.88]
[null,"MÃO DE OBRA (B) - TOTAL",null,null,null,null,null,null,5.4,6.26]
[null,"SINAPI_I",37401,"TOALHEIRO PLASTICO TIPO DISPENSER PARA PAPEL TOALHA INTERFOLHADO","UN    ",1,49.69,49.69,49.69,49.69]
[null,"AGETOP_I",2221,"PARAFUSO COM BUCHA S-8","un",4,0.2,0.2,0.8,0.8]
[null,"MATERIAL (C) - TOTAL",null,null,null,null,null,null,50.489999999999995,50.489999999999995]
[]
[541,"FONTE","CÓDIGO","DESCRIÇÃO","UNIDADE","COEFIC.","CUSTO UNITÁRIO",null,"CUSTO  TOTAL (A) + (B) + (C) + (D) + (E)"]
[null,null,null,null,null,null,"DESONERADO","NÃO DESONER.","DESONERADO","NÃO DESONER."]
[null,"COMPOSIÇÃO","COMP 541_SEE","BANCADA DE GRANITO CINZA POLIDO - FORNECIMENTO E INSTALAÇÃO. ","M2    ",null,null,null,496.72999999999996,501.59999999999997]
[null,"SINAPI",88274,"MARMORISTA/GRANITEIRO COM ENCARGOS COMPLEMENTARES","H",1.6555555555555557,17.559999999999999,19.61,29.07,32.47]
[null,"SINAPI",88316,"SERVENTE COM ENCARGOS COMPLEMENTARES","H",1.088888888888889,12.97,14.32,14.12,15.59]
[null,null,null,"","",null,0,0,0,0]
[null,"MÃO DE OBRA (B) - TOTAL",null,null,null,null,null,null,43.19,48.06]
[null,"SINAPI_I",4823,"MASSA PLASTICA PARA MARMORE/GRANITO","KG    ",0.58088888888888901,29.31,29.31,17.03,17.03]
[null,"SINAPI_I",7568,"BUCHA DE NYLON SEM ABA S10, COM PARAFUSO DE 6,10 X 65 MM EM ACO ZINCADO COM ROSCA SOBERBA, CABECA CHATA E FENDA PHILLIPS","UN    ",6.666666666666667,0.36,0.36,2.4,2.4]
[null,"SINAPI_I",11795,"GRANITO PARA BANCADA, POLIDO, TIPO ANDORINHA/ QUARTZ/ CASTELO/ CORUMBA OU OUTROS EQUIVALENTES DA REGIAO, E=  *2,5* CM","M2    ",1.1166666666666667,319.39,319.39,356.65,356.65]
[null,"SINAPI_I",37329,"REJUNTE EPOXI BRANCO","KG    ",3.9E-2,39.869999999999997,39.869999999999997,1.55,1.55]
[null,"SINAPI_I",37591,"SUPORTE MAO-FRANCESA EM ACO, ABAS IGUAIS 40 CM, CAPACIDADE MINIMA 70 KG, BRANCO","UN    ",2.2222222222222223,34.159999999999997,34.159999999999997,75.91,75.91]
[null,"MATERIAL (C) - TOTAL",null,null,null,null,null,null,453.53999999999996,453.53999999999996]
[]
[206,"FONTE","CÓDIGO","DESCRIÇÃO","UNIDADE","COEFIC.","CUSTO UNITÁRIO",null,"CUSTO  TOTAL (A) + (B) + (C) + (D) + (E)"]
[null,null,null,null,null,null,"DESONERADO","NÃO DESONER.","DESONERADO","NÃO DESONER."]
[null,"COMPOSIÇÃO","COMP 206_SEE","BANCO ARTICULADO PARA BANHO, EM ACO INOX POLIDO, 70* CM X 45* CM","UN ",null,null,null,690.09,693.53]
[null,"AGETOP_I",8,"AJUDANTE","h     ",1,8.1999999999999993,9.51,8.1999999999999993,9.51]
[null,"AGETOP_I",11,"ENCANADOR","h     ",1,13.4,15.53,13.4,15.53]
[null,null,null,"","",null,0,0,0,0]
[null,"MÃO DE OBRA (B) - TOTAL",null,null,null,null,null,null,21.6,25.04]
[null,"SINAPI_I",36215,"BANCO ARTICULADO PARA BANHO, EM ACO INOX POLIDO, 70* CM X 45* CM","UN    ",1,666.89,666.89,666.89,666.89]
[null,"AGETOP_I",2221,"PARAFUSO COM BUCHA S-8","un",8,0.2,0.2,1.6,1.6]
[null,null,null,"","",null,0,0,0,0]
[null,"MATERIAL (C) - TOTAL",null,null,null,null,null,null,668.49,668.49]