{"text_format":"1","workbook":"xlsx","n_sheets":8,"sheets":["Orçamento","Resumo ","Somatório","Cronog_120_Dias","Composição BDI","Relatório CENTRAL","Parc Maior Relev","Composições"],"not_rendered":{"charts":0,"images":4,"macros":1,"external_links":0,"defined_names":80,"comments":3,"pivot_tables":0},"unopened":[],"bounds":{"document_bytes":16777216,"sheet_cells":100000,"rows_first":2000,"rows_last":500,"rows_between":2000,"halvings":0,"cell_chars":16384,"cell_head_chars":4096},"cells_cut":0,"cells_raw":0,"read":"whole","date_system":"1900"}

{"sheet":"Orçamento","index":0,"n_rows":987,"n_cols":27,"rows_kept":987,"cut":false,"hidden":false,"merged":[[929,23,929,25],[930,23,930,25],[931,23,931,25],[932,23,932,25],[933,23,933,25],[934,23,934,25],[935,23,935,25],[936,23,936,25],[937,23,937,25],[974,23,974,25],[975,23,975,25],[976,23,976,25],[977,23,977,25],[978,23,978,25],[979,23,979,25],[956,23,956,25],[957,23,957,25],[958,23,958,25],[943,18,943,22],[936,18,936,22],[950,15,950,17],[951,15,951,17],[952,15,952,17],[962,23,962,25],[963,23,963,25],[964,23,964,25],[965,23,965,25],[954,23,954,25],[938,23,938,25],[939,23,939,25],[940,23,940,25],[941,23,941,25],[942,23,942,25],[943,23,943,25],[944,23,944,25],[945,23,945,25],[946,23,946,25],[947,23,947,25],[948,23,948,25],[0,14,0,24],[8,14,8,16],[9,14,9,16],[11,14,11,16],[12,14,12,16],[14,14,14,24],[1,14,1,24],[4,14,4,24],[7,14,7,24],[953,18,953,22],[954,18,954,22],[944,18,944,22],[951,18,951,22],[947,18,947,22],[949,18,949,22],[945,18,945,22],[946,18,946,22],[955,23,955,25],[949,23,949,25],[950,23,950,25],[951,23,951,25],[952,23,952,25],[953,23,953,25],[950,18,950,22],[948,18,948,22],[948,15,948,17],[922,16,922,24],[912,23,912,24],[913,23,913,24],[928,23,928,25],[953,15,953,17],[954,15,954,17],[927,14,927,26],[911,17,916,17],[928,18,928,22],[929,18,929,22],[937,18,937,22],[938,18,938,22],[939,18,939,22],[940,18,940,22],[952,18,952,22],[949,15,949,17],[929,15,929,17],[930,15,930,17],[931,15,931,17],[932,15,932,17],[933,15,933,17],[934,15,934,17],[935,15,935,17],[923,16,923,24],[8,23,8,25],[9,24,9,25],[941,15,941,17],[942,15,942,17],[943,15,943,17],[944,15,944,17],[945,15,945,17],[946,15,946,17],[936,15,936,17],[937,15,937,17],[934,18,934,22],[935,18,935,22],[933,18,933,22],[942,18,942,22],[924,18,924,24],[930,18,930,22],[931,18,931,22],[932,18,932,22],[941,18,941,22],[938,15,938,17],[939,15,939,17],[940,15,940,17],[911,23,911,24],[919,16,919,24],[920,16,920,24],[921,16,921,24],[10,14,10,26],[13,14,13,26],[9,17,9,22],[2,14,2,22],[3,14,3,22],[5,18,5,22],[6,18,6,22],[11,18,11,22],[12,18,12,22],[6,14,6,17],[5,14,5,17],[3,23,3,25],[2,23,2,25],[5,23,5,25],[6,23,6,25],[928,15,928,17],[983,18,983,22],[971,15,971,17],[971,18,971,22],[972,15,972,17],[972,18,972,22],[973,15,973,17],[973,18,973,22],[977,15,977,17],[977,18,977,22],[978,15,978,17],[978,18,978,22],[979,15,979,17],[968,15,968,17],[983,14,983,17],[980,15,980,17],[980,18,980,22],[981,15,981,17],[981,18,981,22],[982,15,982,17],[982,18,982,22],[964,15,964,17],[964,18,964,22],[947,15,947,17],[980,23,980,25],[981,23,981,25],[982,23,982,25],[983,23,983,25],[984,23,984,25],[985,23,985,25],[986,23,986,25],[955,14,955,17],[962,15,962,17],[986,18,986,22],[985,18,985,22],[984,18,984,22],[958,18,958,22],[955,18,955,22],[957,18,957,22],[956,18,956,22],[966,23,966,25],[967,23,967,25],[968,23,968,25],[969,23,969,25],[970,23,970,25],[971,23,971,25],[972,23,972,25],[973,23,973,25],[979,18,979,22],[974,15,974,17],[974,18,974,22],[975,15,975,17],[975,18,975,22],[976,15,976,17],[976,18,976,22],[12,24,12,25],[11,23,11,25],[968,18,968,22],[969,15,969,17],[969,18,969,22],[970,15,970,17],[970,18,970,22],[965,15,965,17],[965,18,965,22],[966,15,966,17],[966,18,966,22],[967,15,967,17],[967,18,967,22],[961,14,961,26],[962,18,962,22],[963,15,963,17],[963,18,963,22]]}
[]
[]
[null,null,null,null,null,null,null,null,null,null,null,null,null,null,"UNIDADE ESCOLAR",null,null,null,null,null,null,null,null,"CÓDIGO INEP"]
[null,null,null,null,null,null,null,null,null,null,null,null,null,null,"CENTRO DE ENSINO EM PERÍODO INTEGRAL PRÉ-UNIVERSITÁRIO",null,null,null,null,null,null,null,null,52033570]
[]
["Nmax",null,null,null,null,null,null,null,null,null,null,null,null,null,"OBRA",null,null,null,"DATA",null,null,null,null,"CIDADE"]
[{"$f":"MAX($C$18:$C$911)","v":4},null,null,null,null,null,null,null,null,null,null,null,null,null,"REFORMA E AMPLIAÇÃO",null,null,null,"2020-04-23",null,null,null,null,"GOIÂNIA"]
[]
[null,null,null,null,null,null,null,null,null,null,null,null,null,null,"CRE",null,null,"ENDEREÇO",null,null,null,null,null,"REFERÊNCIA AGETOP"]
[null,null,null,null,null,null,null,null,null,null,null,null,null,null,"GOIÂNIA",null,null,"RUA 240 S/N, ST UNIVERSITARIO, CEP:74440-460",null,null,null,null,null,"DEZ/18","ONERADA"]
[]
[null,null,null,null,null,null,null,null,null,null,null,null,null,null,"ÁREA EXISTENTE (M²)",null,null,"ÁREA A CONSTRUIR (M²)","ÁREA TOTAL CONSTRUÍDA (M²)",null,null,null,null,"REFERÊNCIA SINAPI"]
[null,null,null,null,null,null,null,null,null,null,null,null,null,null,3842.27,null,null,800.98,4643.25,null,null,null,null,"JUL/19","ONERADA"]
[]
[null,null,null,null,null,null,null,null,null,null,null,"FILTRO",null,null,"PLANILHA ORÇAMENTÁRIA"]
{"$rows_left_out":973}
{"sheet":"Resumo ","index":1,"n_rows":39,"n_cols":9,"rows_kept":39,"cut":false,"hidden":false,"merged":[[42,3,42,7],[41,3,41,7],[38,1,38,8],[22,2,22,5],[23,2,23,5],[24,2,24,5],[25,2,25,5],[26,2,26,5],[32,2,32,5],[33,2,33,5],[34,2,34,5],[35,2,35,5],[27,2,27,5],[28,2,28,5],[29,2,29,5],[30,2,30,5],[31,2,31,5],[1,1,1,8],[2,6,2,8],[3,6,3,8],[4,1,4,8],[5,6,5,8],[6,6,6,8],[7,1,7,8],[8,6,8,8],[9,6,9,8],[13,1,13,8],[11,1,11,2],[12,1,12,2],[0,1,0,8],[36,1,36,5],[2,1,2,5],[3,1,3,5],[5,1,5,5],[6,1,6,5],[8,1,8,5],[9,1,9,5],[11,3,11,5],[12,3,12,5],[10,1,10,8],[11,6,11,8],[12,6,12,8],[19,2,19,5],[20,2,20,5],[21,2,21,5],[13,0,14,0],[15,2,15,5],[16,2,16,5],[17,2,17,5],[18,2,18,5],[14,1,14,8]]}
[]
[]
[null,"UNIDADE ESCOLAR",null,null,null,null,"CÓDIGO INEP"]
[null,{"$f":"Orçamento!$O$4","v":"CENTRO DE ENSINO EM PERÍODO INTEGRAL PRÉ-UNIVERSITÁRIO"},null,null,null,null,{"$f":"Orçamento!X4","v":52033570}]
[]
[null,"OBRA",null,null,null,null,"CIDADE"]
[null,{"$f":"Orçamento!$O$7","v":"REFORMA E AMPLIAÇÃO"},null,null,null,null,{"$f":"Orçamento!$X$7","v":"GOIÂNIA"}]
[]
[null,"ENDEREÇO",null,null,null,null,"CRE"]
[null,{"$f":"Orçamento!$R$10","v":"RUA 240 S/N, ST UNIVERSITARIO, CEP:74440-460"},null,null,null,null,{"$f":"Orçamento!$O$10","v":"GOIÂNIA"}]
[]
[null,"REFERÊNCIA",null,"DATA",null,null,"ÁREA TOTAL CONSTRUÍDA (M²)"]
[null,{"$f":"CONCATENATE(\"AGETOP E SINAPI - \",Orçamento!$Y$10)","v":"AGETOP E SINAPI - ONERADA"},null,{"$f":"Orçamento!$S$7","v":"2020-04-23"},null,null,{"$f":"Orçamento!$S$13","v":4643.25}]
["FILTRO"]
[null,"RESUMO GERAL DO ORÇAMENTO"]
{"$rows_left_out":25}
{"sheet":"Somatório","index":2,"n_rows":45,"n_cols":6,"rows_kept":45,"cut":false,"hidden":false,"merged":[[0,1,0,5],[14,1,14,5],[2,1,2,3],[2,4,2,5],[3,1,3,3],[3,4,3,5],[5,1,5,3],[5,4,5,5],[6,1,6,3],[6,4,6,5],[8,1,8,3],[8,4,8,5],[1,1,1,5],[4,1,4,5],[7,1,7,5],[10,1,10,5],[9,1,9,3],[9,4,9,5],[11,1,11,2],[11,4,11,5],[12,1,12,2],[12,4,12,5],[13,0,14,0],[42,1,42,2],[44,1,44,5],[47,3,47,5],[48,3,48,5],[13,1,13,5]]}
[]
[]
[null,"UNIDADE ESCOLAR",null,null,"CÓDIGO INEP"]
[null,{"$f":"Orçamento!$O$4","v":"CENTRO DE ENSINO EM PERÍODO INTEGRAL PRÉ-UNIVERSITÁRIO"},null,null,{"$f":"Orçamento!X4","v":52033570}]
[]
[null,"OBRA",null,null,"CIDADE"]
[null,{"$f":"Orçamento!$O$7","v":"REFORMA E AMPLIAÇÃO"},null,null,{"$f":"Orçamento!$X$7","v":"GOIÂNIA"}]
[]
[null,"ENDEREÇO",null,null,"CRE"]
[null,{"$f":"Orçamento!$R$10","v":"RUA 240 S/N, ST UNIVERSITARIO, CEP:74440-460"},null,null,{"$f":"Orçamento!$O$10","v":"GOIÂNIA"}]
[]
[null,"REFERÊNCIA",null,"DATA","ÁREA TOTAL CONSTRUÍDA (M²)"]
[null,{"$f":"CONCATENATE(\"AGETOP E SINAPI - \",Orçamento!$Y$10)","v":"AGETOP E SINAPI - ONERADA"},null,{"$f":"Orçamento!$S$7","v":"2020-04-23"},{"$f":"Orçamento!$S$13","v":4643.25}]
["FILTRO"]
[null,"SOMATÓRIO DE SERVIÇOS"]
{"$rows_left_out":31}
{"sheet":"Cronog_120_Dias","index":3,"n_rows":99,"n_cols":22,"rows_kept":99,"cut":false,"hidden":false,"merged":[[86,13,86,16],[88,13,88,16],[89,13,89,16],[91,13,91,16],[92,13,92,16],[93,13,93,16],[94,13,94,16],[95,13,95,16],[73,13,73,16],[74,13,74,16],[76,13,76,16],[77,13,77,16],[79,13,79,16],[80,13,80,16],[82,13,82,16],[83,13,83,16],[85,13,85,16],[59,13,59,16],[61,13,61,16],[62,13,62,16],[64,13,64,16],[65,13,65,16],[67,13,67,16],[68,13,68,16],[70,13,70,16],[71,13,71,16],[40,13,40,16],[41,13,41,16],[43,13,43,16],[44,13,44,16],[46,13,46,16],[47,13,47,16],[49,13,49,16],[50,13,50,16],[52,13,52,16],[91,9,91,12],[92,9,92,12],[93,9,93,12],[94,9,94,12],[95,9,95,12],[12,13,12,16],[13,13,13,16],[14,13,14,16],[16,13,16,16],[17,13,17,16],[19,13,19,16],[20,13,20,16],[22,13,22,16],[23,13,23,16],[25,13,25,16],[26,13,26,16],[28,13,28,16],[29,13,29,16],[31,13,31,16],[32,13,32,16],[34,13,34,16],[35,13,35,16],[37,13,37,16],[38,13,38,16],[73,9,73,12],[74,9,74,12],[76,9,76,12],[77,9,77,12],[79,9,79,12],[80,9,80,12],[82,9,82,12],[83,9,83,12],[85,9,85,12],[59,9,59,12],[61,9,61,12],[62,9,62,12],[64,9,64,12],[65,9,65,12],[67,9,67,12],[68,9,68,12],[70,9,70,12],[71,9,71,12],[40,9,40,12],[41,9,41,12],[43,9,43,12],[44,9,44,12],[46,9,46,12],[47,9,47,12],[49,9,49,12],[50,9,50,12],[52,9,52,12],[12,9,12,12],[13,9,13,12],[14,9,14,12],[16,9,16,12],[17,9,17,12],[19,9,19,12],[20,9,20,12],[22,9,22,12],[23,9,23,12],[0,1,0,21],[2,1,2,7],[3,1,3,7],[5,1,5,7],[6,1,6,7],[8,1,8,7],[9,1,9,7],[1,1,1,21],[7,1,7,21],[4,1,4,21],[10,1,10,21],[9,8,9,21],[8,8,8,21],[3,8,3,21],[6,8,6,21],[5,8,5,21],[2,8,2,21],[50,1,52,2],[71,3,73,3],[12,21,13,21],[13,1,13,2],[13,5,13,8],[13,17,13,20],[12,3,13,3],[12,17,12,20],[14,1,16,2],[12,5,12,8],[17,1,19,2],[17,4,19,4],[17,5,17,8],[17,17,17,20],[19,5,19,8],[19,17,19,20],[20,1,22,2],[65,1,67,2],[68,3,70,3],[62,3,64,3],[68,1,70,2],[56,3,58,3],[65,4,67,4],[74,3,76,3],[50,4,52,4],[74,4,76,4],[56,1,58,2],[56,4,58,4],[50,3,52,3],[53,3,55,3],[68,4,70,4],[62,1,64,2],[62,4,64,4],[59,3,61,3],[53,1,55,2],[53,4,55,4],[59,1,61,2],[59,4,61,4],[74,1,76,2],[20,4,22,4],[20,5,20,8],[20,17,20,20],[22,5,22,8],[22,17,22,20],[20,3,22,3],[14,3,16,3],[17,3,19,3],[14,4,16,4],[14,5,14,8],[14,17,14,20],[16,5,16,8],[16,17,16,20],[23,17,23,20],[25,5,25,8],[25,17,25,20],[26,1,28,2],[26,4,28,4],[26,5,26,8],[26,17,26,20],[28,5,28,8],[28,17,28,20],[23,3,25,3],[23,1,25,2],[23,4,25,4],[23,5,23,8],[26,3,28,3],[25,9,25,12],[26,9,26,12],[28,9,28,12],[29,17,29,20],[31,5,31,8],[31,17,31,20],[32,1,34,2],[32,4,34,4],[32,5,32,8],[32,17,32,20],[34,5,34,8],[34,17,34,20],[32,3,34,3],[29,5,29,8],[29,1,31,2],[29,4,31,4],[29,3,31,3],[29,9,29,12],[31,9,31,12],[32,9,32,12],[34,9,34,12],[35,17,35,20],[37,5,37,8],[37,17,37,20],[35,3,37,3],[40,17,40,20],[38,3,40,3],[38,17,38,20],[41,1,43,2],[41,4,43,4],[41,5,41,8],[41,17,41,20],[43,5,43,8],[43,17,43,20],[41,3,43,3],[35,5,35,8],[38,5,38,8],[40,5,40,8],[35,1,37,2],[35,4,37,4],[38,1,40,2],[38,4,40,4],[35,9,35,12],[37,9,37,12],[38,9,38,12],[44,17,44,20],[46,5,46,8],[46,17,46,20],[47,1,49,2],[47,4,49,4],[47,5,47,8],[47,17,47,20],[49,5,49,8],[49,17,49,20],[44,5,44,8],[47,3,49,3],[44,3,46,3],[44,1,46,2],[44,4,46,4],[53,17,53,20],[55,5,55,8],[55,17,55,20],[50,5,50,8],[50,17,50,20],[52,5,52,8],[52,17,52,20],[56,17,56,20],[58,5,58,8],[58,17,58,20],[53,5,53,8],[56,5,56,8],[53,9,53,12],[55,9,55,12],[56,9,56,12],[58,9,58,12],[53,13,53,16],[55,13,55,16],[56,13,56,16],[58,13,58,16],[68,5,68,8],[65,5,65,8],[65,17,65,20],[67,5,67,8],[67,17,67,20],[65,3,67,3],[62,17,62,20],[64,5,64,8],[64,17,64,20],[62,5,62,8],[95,1,95,2],[95,5,95,8],[95,17,95,20],[97,1,97,4],[98,1,98,21],[86,17,86,20],[88,5,88,8],[88,17,88,20],[85,5,85,8],[85,17,85,20],[89,1,91,2],[89,4,91,4],[89,5,89,8],[89,17,89,20],[91,5,91,8],[91,17,91,20],[89,3,91,3],[86,4,88,4],[86,5,86,8],[86,3,88,3],[83,1,85,2],[83,4,85,4],[83,5,83,8],[83,17,83,20],[94,1,94,2],[94,5,94,8],[94,17,94,20],[76,5,76,8],[76,17,76,20],[77,5,77,8],[77,17,77,20],[79,5,79,8],[79,17,79,20],[80,5,80,8],[80,17,80,20],[82,5,82,8],[82,17,82,20],[77,3,79,3],[80,3,82,3],[86,1,88,2],[80,4,82,4],[83,3,85,3],[77,1,79,2],[77,4,79,4],[80,1,82,2],[86,9,86,12],[88,9,88,12],[89,9,89,12],[12,0,13,0],[9,0,11,0],[11,1,11,21],[92,1,92,2],[92,5,92,8],[92,17,92,20],[93,1,93,2],[93,5,93,8],[93,17,93,20],[74,17,74,20],[74,5,74,8],[68,17,68,20],[70,5,70,8],[70,17,70,20],[59,5,59,8],[71,1,73,2],[71,4,73,4],[71,5,71,8],[71,17,71,20],[73,5,73,8],[73,17,73,20],[59,17,59,20],[61,5,61,8],[61,17,61,20]]}
[]
[]
[null,"UNIDADE ESCOLAR",null,null,null,null,null,null,"PRAZO"]
[null,{"$f":"Orçamento!$O$4","v":"CENTRO DE ENSINO EM PERÍODO INTEGRAL PRÉ-UNIVERSITÁRIO"},null,null,null,null,null,null,"120 DIAS CORRIDOS"]
[]
[null,"OBRA",null,null,null,null,null,null,"DATA"]
[null,{"$f":"Orçamento!$O$7","v":"REFORMA E AMPLIAÇÃO"},null,null,null,null,null,null,{"$f":"Orçamento!$S$7","v":"2020-04-23"}]
[]
[null,"LOCAL",null,null,null,null,null,null,"ÁREA TOTAL CONSTRUÍDA (M²)"]
["FILTRO",{"$f":"Orçamento!$X$7","v":"GOIÂNIA"},null,null,null,null,null,null,{"$f":"Orçamento!$S$13","v":4643.25}]
[]
[null,"CRONOGRAMA - FÍSICO FINANCEIRO"]
["↓","CUSTO TOTAL:",{"$f":"D93","v":0},"VALOR","Dias:",30,null,null,null,60,null,null,null,90,null,null,null,120,null,null,null,"TOTAL"]
[null,"DESCRIÇÃO DOS SERVIÇOS",null,null,"%","1ª PARCELA",null,null,null,"2ª PARCELA",null,null,null,"2ª PARCELA",null,null,null,"2ª PARCELA"]
[{"$f":"IF(D15>0,\"F\",\"\")","v":""},"SERVIÇOS PRELIMINARES",null,{"$f":"Orçamento!X930","v":0},{"$f":"Orçamento!AA930","v":0},{"$f":"ROUND(F17*$D$15,2)+0.01","v":0.01},null,null,null,{"$f":"ROUND(J17*$D$15,2)","v":0},null,null,null,{"$f":"ROUND(N17*$D$15,2)","v":0},null,null,null,{"$f":"ROUND(R17*$D$15,2)","v":0},null,null,null,{"$f":"SUM(F15:U15)","v":0.01}]
{"$rows_left_out":85}
{"sheet":"Composição BDI","index":4,"n_rows":45,"n_cols":9,"rows_kept":45,"cut":false,"hidden":false,"merged":[[12,0,12,3],[13,0,13,3],[14,0,14,3],[15,0,15,3],[6,0,6,3],[8,0,8,3],[7,0,7,3],[9,0,9,3],[11,0,11,3],[10,0,10,3],[0,0,0,3],[2,0,2,3],[3,0,3,3],[1,0,1,3],[5,0,5,3],[4,0,4,3],[18,5,18,8],[17,0,17,3],[16,0,16,3],[44,0,44,3],[42,0,42,3],[43,0,43,3],[18,0,18,3],[36,0,36,3],[39,0,39,3],[38,0,38,3],[40,0,40,3],[29,0,29,2],[32,0,32,3],[33,0,33,3],[34,0,34,3],[35,0,35,3]]}
[]
[]
["UNIDADE ESCOLAR"]
[{"$f":"Orçamento!$O$4","v":"CENTRO DE ENSINO EM PERÍODO INTEGRAL PRÉ-UNIVERSITÁRIO"}]
[]
["OBRA"]
[{"$f":"Orçamento!$O$7","v":"REFORMA E AMPLIAÇÃO"}]
[]
["ENDEREÇO"]
[{"$f":"Orçamento!$R$10","v":"RUA 240 S/N, ST UNIVERSITARIO, CEP:74440-460"}]
[]
["CIDADE"]
[{"$f":"Orçamento!$X$7","v":"GOIÂNIA"}]
[]
["CRE"]
{"$rows_left_out":31}
{"sheet":"Relatório CENTRAL","index":5,"n_rows":40,"n_cols":5,"rows_kept":40,"cut":false,"hidden":false,"merged":[[7,1,7,4],[8,1,8,2],[8,3,8,4],[9,1,9,2],[10,1,10,4],[11,1,11,4],[39,1,39,2],[9,0,11,0],[0,1,0,4],[6,3,6,4],[9,3,9,4],[1,1,1,4],[2,1,2,2],[2,3,2,4],[3,1,3,2],[3,3,3,4],[4,1,4,4],[5,1,5,2],[5,3,5,4],[6,1,6,2]]}
[]
[]
[null,"UNIDADE ESCOLAR",null,"CIDADE"]
[null,{"$f":"Orçamento!$O$4","v":"CENTRO DE ENSINO EM PERÍODO INTEGRAL PRÉ-UNIVERSITÁRIO"},null,{"$f":"Orçamento!$X$7","v":"GOIÂNIA"}]
[]
[null,"OBRA",null,"CRE"]
[null,{"$f":"Orçamento!$O$7","v":"REFORMA E AMPLIAÇÃO"},null,{"$f":"Orçamento!$O$10","v":"GOIÂNIA"}]
[]
[null,"ENDEREÇO",null,"DATA"]
["FILTRO",{"$f":"Orçamento!$R$10","v":"RUA 240 S/N, ST UNIVERSITARIO, CEP:74440-460"},null,{"$f":"Orçamento!$S$7","v":"2020-04-23"}]
[]
[null,"RELATÓRIO CENTRAL"]
["↓","CÓDIGO","ETAPA","PREÇO  (R$) C/ BDI","PARTIC  ( % )"]
[{"$f":"IF(D14>0,\"F\",\"\")","v":""},{"$f":"Orçamento!O930","v":"a."},{"$f":"Orçamento!P930","v":"SERVIÇOS PRELIMINARES"},{"$f":"Orçamento!X930","v":0},{"$f":"Orçamento!AA930","v":0}]
[{"$f":"IF(D15>0,\"F\",\"\")","v":""},{"$f":"Orçamento!O931","v":"b."},{"$f":"Orçamento!P931","v":"TRANSPORTES"},{"$f":"Orçamento!X931","v":0},{"$f":"Orçamento!AA931","v":0}]
{"$rows_left_out":26}
{"sheet":"Parc Maior Relev","index":6,"n_rows":21,"n_cols":7,"rows_kept":21,"cut":false,"hidden":false,"merged":[[10,0,12,0],[8,1,8,3],[8,4,8,6],[21,3,21,7],[19,1,19,6],[0,1,0,6],[11,1,11,6],[1,1,1,6],[2,1,2,3],[2,4,2,6],[3,1,3,3],[3,4,3,6],[4,1,4,6],[5,1,5,3],[5,4,5,6],[9,1,9,3],[9,4,9,6],[10,1,10,6],[6,1,6,3],[6,4,6,6],[7,1,7,6]]}
[]
[]
[null,"UNIDADE ESCOLAR",null,null,"CÓDIGO INEP"]
[null,{"$f":"Orçamento!$O$4","v":"CENTRO DE ENSINO EM PERÍODO INTEGRAL PRÉ-UNIVERSITÁRIO"},null,null,{"$f":"Orçamento!$X$4","v":52033570}]
[]
[null,"OBRA",null,null,"CIDADE"]
[null,{"$f":"Orçamento!$O$7","v":"REFORMA E AMPLIAÇÃO"},null,null,{"$f":"Orçamento!$X$7","v":"GOIÂNIA"}]
[]
[null,"CRE",null,null,"ÁREA TOTAL CONSTRUÍDA (M²)"]
[null,{"$f":"Orçamento!$O$10","v":"GOIÂNIA"},null,null,{"$f":"Orçamento!$S$13","v":4643.25}]
["FILTRO"]
[null,"PARCELA DE MAIOR RELEVÂNCIA"]
[null,"CÓDIGO","SERVIÇO","DESCRIÇÃO","UNID","QUANT","PARC. MAIOR RELEV (50%)"]
[{"$f":"IF(F14>0,\"F\",\"\")","v":"F"},"U.",{"$f":"IFERROR(VLOOKUP(B14,Orçamento!$O$930:$P$955,2,FALSE),\"(inserir código ao lado)\")","v":"REVESTIMENTO DE PISO"},"PISO TÁTIL","M²",{"$f":"Orçamento!T344","v":174.53},{"$f":"F14*0.5","v":87.265000000000001}]
[{"$f":"IF(F15>0,\"F\",\"\")","v":""},"O.",{"$f":"IFERROR(VLOOKUP(B15,Orçamento!$O$930:$P$955,2,FALSE),\"(inserir código ao lado)\")","v":"COBERTURAS"},"TELHA CERÂMICA","M²",{"$f":"Orçamento!V723+Orçamento!V875+Orçamento!V595","v":0},{"$f":"F15*0.5","v":0}]
{"$rows_left_out":7}
{"sheet":"Composições","index":7,"n_rows":492,"n_cols":10,"rows_kept":492,"cut":false,"hidden":false,"merged":[[481,5,482,5],[481,6,481,7],[481,8,481,9],[487,1,487,7],[491,1,491,7],[481,0,482,0],[481,1,482,1],[481,2,482,2],[481,3,482,3],[481,4,482,4],[467,5,468,5],[467,6,467,7],[467,8,467,9],[473,1,473,7],[479,1,479,7],[467,0,468,0],[467,1,468,1],[467,2,468,2],[467,3,468,3],[467,4,468,4],[457,5,458,5],[457,6,457,7],[457,8,457,9],[462,1,462,7],[465,1,465,7],[457,0,458,0],[457,1,458,1],[457,2,458,2],[457,3,458,3],[457,4,458,4],[447,5,448,5],[447,6,447,7],[447,8,447,9],[452,1,452,7],[455,1,455,7],[447,0,448,0],[447,1,448,1],[447,2,448,2],[447,3,448,3],[447,4,448,4],[435,5,436,5],[435,6,435,7],[435,8,435,9],[441,1,441,7],[445,1,445,7],[435,0,436,0],[435,1,436,1],[435,2,436,2],[435,3,436,3],[435,4,436,4],[423,5,424,5],[423,6,423,7],[423,8,423,9],[429,1,429,7],[433,1,433,7],[423,0,424,0],[423,1,424,1],[423,2,424,2],[423,3,424,3],[423,4,424,4],[411,5,412,5],[411,6,411,7],[411,8,411,9],[417,1,417,7],[421,1,421,7],[411,0,412,0],[411,1,412,1],[411,2,412,2],[411,3,412,3],[411,4,412,4],[399,5,400,5],[399,6,399,7],[399,8,399,9],[405,1,405,7],[409,1,409,7],[399,0,400,0],[399,1,400,1],[399,2,400,2],[399,3,400,3],[399,4,400,4],[387,5,388,5],[387,6,387,7],[387,8,387,9],[393,1,393,7],[397,1,397,7],[387,0,388,0],[387,1,388,1],[387,2,388,2],[387,3,388,3],[387,4,388,4],[375,5,376,5],[375,6,375,7],[375,8,375,9],[381,1,381,7],[385,1,385,7],[375,0,376,0],[375,1,376,1],[375,2,376,2],[375,3,376,3],[375,4,376,4],[363,5,364,5],[363,6,363,7],[363,8,363,9],[369,1,369,7],[373,1,373,7],[363,0,364,0],[363,1,364,1],[363,2,364,2],[363,3,364,3],[363,4,364,4],[351,5,352,5],[351,6,351,7],[351,8,351,9],[357,1,357,7],[361,1,361,7],[351,0,352,0],[351,1,352,1],[351,2,352,2],[351,3,352,3],[351,4,352,4],[339,5,340,5],[339,6,339,7],[339,8,339,9],[345,1,345,7],[349,1,349,7],[339,0,340,0],[339,1,340,1],[339,2,340,2],[339,3,340,3],[339,4,340,4],[327,5,328,5],[327,6,327,7],[327,8,327,9],[333,1,333,7],[337,1,337,7],[327,0,328,0],[327,1,328,1],[327,2,328,2],[327,3,328,3],[327,4,328,4],[315,5,316,5],[315,6,315,7],[315,8,315,9],[321,1,321,7],[325,1,325,7],[315,0,316,0],[315,1,316,1],[315,2,316,2],[315,3,316,3],[315,4,316,4],[303,5,304,5],[303,6,303,7],[303,8,303,9],[309,1,309,7],[313,1,313,7],[303,0,304,0],[303,1,304,1],[303,2,304,2],[303,3,304,3],[303,4,304,4],[291,5,292,5],[291,6,291,7],[291,8,291,9],[297,1,297,7],[301,1,301,7],[291,0,292,0],[291,1,292,1],[291,2,292,2],[291,3,292,3],[291,4,292,4],[271,5,272,5],[271,6,271,7],[271,8,271,9],[276,1,276,7],[289,1,289,7],[271,0,272,0],[271,1,272,1],[271,2,272,2],[271,3,272,3],[271,4,272,4],[248,5,249,5],[248,6,248,7],[248,8,248,9],[254,1,254,7],[269,1,269,7],[248,0,249,0],[248,1,249,1],[248,2,249,2],[248,3,249,3],[248,4,249,4],[238,5,239,5],[238,6,238,7],[238,8,238,9],[243,1,243,7],[246,1,246,7],[238,0,239,0],[238,1,239,1],[238,2,239,2],[238,3,239,3],[238,4,239,4],[228,5,229,5],[228,6,228,7],[228,8,228,9],[233,1,233,7],[236,1,236,7],[228,0,229,0],[228,1,229,1],[228,2,229,2],[228,3,229,3],[228,4,229,4],[213,5,214,5],[213,6,213,7],[213,8,213,9],[219,1,219,7],[226,1,226,7],[213,0,214,0],[213,1,214,1],[213,2,214,2],[213,3,214,3],[213,4,214,4],[203,5,204,5],[203,6,203,7],[203,8,203,9],[207,1,207,7],[211,1,211,7],[203,0,204,0],[203,1,204,1],[203,2,204,2],[203,3,204,3],[203,4,204,4],[191,5,192,5],[191,6,191,7],[191,8,191,9],[197,1,197,7],[201,1,201,7],[191,0,192,0],[191,1,192,1],[191,2,192,2],[191,3,192,3],[191,4,192,4],[179,5,180,5],[179,6,179,7],[179,8,179,9],[185,1,185,7],[189,1,189,7],[179,0,180,0],[179,1,180,1],[179,2,180,2],[179,3,180,3],[179,4,180,4],[167,5,168,5],[167,6,167,7],[167,8,167,9],[173,1,173,7],[177,1,177,7],[167,0,168,0],[167,1,168,1],[167,2,168,2],[167,3,168,3],[167,4,168,4],[155,5,156,5],[155,6,155,7],[155,8,155,9],[161,1,161,7],[165,1,165,7],[155,0,156,0],[155,1,156,1],[155,2,156,2],[155,3,156,3],[155,4,156,4],[143,5,144,5],[143,6,143,7],[143,8,143,9],[149,1,149,7],[153,1,153,7],[143,0,144,0],[143,1,144,1],[143,2,144,2],[143,3,144,3],[143,4,144,4],[133,5,134,5],[133,6,133,7],[133,8,133,9],[138,1,138,7],[141,1,141,7],[133,0,134,0],[133,1,134,1],[133,2,134,2],[133,3,134,3],[133,4,134,4],[123,5,124,5],[123,6,123,7],[123,8,123,9],[128,1,128,7],[131,1,131,7],[123,0,124,0],[123,1,124,1],[123,2,124,2],[123,3,124,3],[123,4,124,4],[113,5,114,5],[113,6,113,7],[113,8,113,9],[118,1,118,7],[121,1,121,7],[113,0,114,0],[113,1,114,1],[113,2,114,2],[113,3,114,3],[113,4,114,4],[101,5,102,5],[101,6,101,7],[101,8,101,9],[107,1,107,7],[111,1,111,7],[101,0,102,0],[101,1,102,1],[101,2,102,2],[101,3,102,3],[101,4,102,4],[89,5,90,5],[89,6,89,7],[89,8,89,9],[95,1,95,7],[99,1,99,7],[89,0,90,0],[89,1,90,1],[89,2,90,2],[89,3,90,3],[89,4,90,4],[77,5,78,5],[77,6,77,7],[77,8,77,9],[83,1,83,7],[87,1,87,7],[77,0,78,0],[77,1,78,1],[77,2,78,2],[77,3,78,3],[77,4,78,4],[65,5,66,5],[65,6,65,7],[65,8,65,9],[71,1,71,7],[75,1,75,7],[65,0,66,0],[65,1,66,1],[65,2,66,2],[65,3,66,3],[65,4,66,4],[53,5,54,5],[53,6,53,7],[53,8,53,9],[59,1,59,7],[63,1,63,7],[53,0,54,0],[53,1,54,1],[53,2,54,2],[53,3,54,3],[53,4,54,4],[41,5,42,5],[41,6,41,7],[41,8,41,9],[47,1,47,7],[51,1,51,7],[41,0,42,0],[41,1,42,1],[41,2,42,2],[41,3,42,3],[41,4,42,4],[29,5,30,5],[29,6,29,7],[29,8,29,9],[35,1,35,7],[39,1,39,7],[29,0,30,0],[29,1,30,1],[29,2,30,2],[29,3,30,3],[29,4,30,4],[16,5,17,5],[16,6,16,7],[16,8,16,9],[22,1,22,7],[27,1,27,7],[16,0,17,0],[16,1,17,1],[16,2,17,2],[16,3,17,3],[16,4,17,4],[0,0,0,8],[10,0,10,2],[10,3,10,6],[11,0,11,9],[12,0,12,2],[12,3,12,6],[12,7,12,8],[7,0,7,6],[9,0,9,2],[9,3,9,6],[9,7,9,8],[3,0,3,6],[4,0,4,6],[15,0,15,9],[13,0,13,2],[13,3,13,6],[1,0,1,9],[3,7,3,9],[4,7,4,9],[6,7,6,9],[7,7,7,9],[6,0,6,6],[10,8,10,9],[13,8,13,9],[14,0,14,9],[8,0,8,9],[5,0,5,9],[2,0,2,9]]}
[]
[]
[]
["UNIDADE ESCOLAR",null,null,null,null,null,null,"CÓDIGO INEP"]
[{"$f":"Orçamento!$O$4","v":"CENTRO DE ENSINO EM PERÍODO INTEGRAL PRÉ-UNIVERSITÁRIO"},null,null,null,null,null,null,{"$f":"Orçamento!$X$4","v":52033570}]
[]
["OBRA",null,null,null,null,null,null,"CIDADE"]
[{"$f":"Orçamento!$O$7","v":"REFORMA E AMPLIAÇÃO"},null,null,null,null,null,null,{"$f":"Orçamento!$X$7","v":"GOIÂNIA"}]
[]
["CRE",null,null,"ENDEREÇO",null,null,null,"REFERÊNCIA AGETOP"]
[{"$f":"Orçamento!$O$10","v":"GOIÂNIA"},null,null,{"$f":"Orçamento!$R$10","v":"RUA 240 S/N, ST UNIVERSITARIO, CEP:74440-460"},null,null,null,{"$f":"Orçamento!$X$10","v":"DEZ/18"},{"$f":"Orçamento!$Y$10","v":"ONERADA"}]
[]
["DATA",null,null,"ÁREA TOTAL CONSTRUÍDA (M²)",null,null,null,"REFERÊNCIA SINAPI"]
[{"$f":"Orçamento!$S$7","v":"2020-04-23"},null,null,{"$f":"Orçamento!$S$13","v":4643.25},null,null,null,{"$f":"Orçamento!$X$13","v":"JUL/19"},{"$f":"Orçamento!$Y$13","v":"ONERADA"}]
[]
{"$rows_left_out":477}