{"text_format":"1","workbook":"xlsx","n_sheets":8,"sheets":["Orçamento","Resumo ","Somatório","Cronog_120_Dias","Composição BDI","Relatório CENTRAL","Parc Maior Relev","Composições"],"not_rendered":{"charts":0,"images":4,"macros":1,"external_links":1,"defined_names":124,"comments":3,"pivot_tables":0},"unopened":[],"bounds":{"document_bytes":16777216,"sheet_cells":100000,"rows_first":2000,"rows_last":500,"rows_between":2000,"halvings":0,"cell_chars":16384,"cell_head_chars":4096},"cells_cut":0,"cells_raw":0,"read":"whole","date_system":"1900"}

{"sheet":"Orçamento","index":0,"n_rows":824,"n_cols":24,"rows_kept":824,"cut":false,"hidden":false,"merged":[[759,16,759,22],[8,12,9,12],[794,18,794,20],[794,21,794,22],[0,14,0,22],[8,14,8,16],[9,14,9,16],[11,14,11,16],[12,14,12,16],[14,14,14,22],[1,14,1,22],[4,14,4,22],[7,14,7,22],[778,18,778,20],[778,21,778,22],[786,21,786,22],[775,15,775,17],[776,15,776,17],[777,15,777,17],[779,21,779,22],[787,18,787,20],[787,21,787,22],[785,18,785,20],[785,21,785,22],[793,18,793,20],[793,21,793,22],[780,18,780,20],[780,21,780,22],[773,18,773,20],[773,21,773,22],[795,18,795,20],[795,21,795,22],[749,20,749,21],[771,18,771,20],[771,21,771,22],[772,18,772,20],[772,21,772,22],[770,18,770,20],[770,21,770,22],[779,18,779,20],[750,20,750,21],[761,18,761,22],[767,18,767,20],[767,21,767,22],[768,18,768,20],[768,21,768,22],[769,18,769,20],[769,21,769,22],[792,18,792,20],[792,21,792,22],[789,21,789,22],[790,18,790,20],[790,21,790,22],[791,18,791,20],[791,21,791,22],[781,18,781,20],[781,21,781,22],[788,18,788,20],[788,21,788,22],[783,21,783,22],[784,18,784,20],[784,21,784,22],[786,18,786,20],[782,18,782,20],[782,21,782,22],[783,18,783,20],[787,15,787,17],[788,15,788,17],[789,15,789,17],[790,15,790,17],[791,15,791,17],[764,14,764,23],[753,20,753,21],[752,20,752,21],[748,17,753,17],[748,20,748,21],[765,18,765,20],[765,21,765,22],[766,18,766,20],[766,21,766,22],[754,20,754,21],[774,18,774,20],[774,21,774,22],[775,18,775,20],[775,21,775,22],[776,18,776,20],[776,21,776,22],[777,18,777,20],[777,21,777,22],[789,18,789,20],[766,15,766,17],[767,15,767,17],[768,15,768,17],[769,15,769,17],[770,15,770,17],[771,15,771,17],[772,15,772,17],[773,15,773,17],[774,15,774,17],[778,15,778,17],[779,15,779,17],[780,15,780,17],[781,15,781,17],[782,15,782,17],[783,15,783,17],[784,15,784,17],[785,15,785,17],[786,15,786,17],[756,16,756,22],[757,16,757,22],[758,16,758,22],[3,21,3,22],[2,21,2,22],[5,21,5,22],[10,14,10,23],[13,14,13,23],[6,21,6,22],[9,17,9,20],[2,14,2,20],[3,14,3,20],[5,18,5,20],[6,18,6,20],[11,18,11,20],[12,18,12,20],[6,14,6,17],[5,14,5,17],[760,16,760,22],[823,18,823,20],[823,21,823,22],[820,14,820,17],[817,15,817,17],[817,18,817,20],[817,21,817,22],[818,15,818,17],[818,18,818,20],[818,21,818,22],[819,15,819,17],[819,18,819,20],[819,21,819,22],[822,18,822,20],[822,21,822,22],[821,18,821,20],[821,21,821,22],[798,14,798,23],[799,18,799,20],[799,21,799,22],[800,15,800,17],[800,18,800,20],[800,21,800,22],[801,15,801,17],[792,14,792,17],[799,15,799,17],[765,15,765,17],[820,18,820,20],[820,21,820,22],[808,15,808,17],[808,18,808,20],[808,21,808,22],[809,15,809,17],[809,18,809,20],[809,21,809,22],[810,15,810,17],[810,18,810,20],[810,21,810,22],[814,15,814,17],[814,18,814,20],[814,21,814,22],[815,15,815,17],[815,18,815,20],[815,21,815,22],[816,15,816,17],[805,15,805,17],[801,18,801,20],[801,21,801,22],[816,18,816,20],[816,21,816,22],[811,15,811,17],[811,18,811,20],[811,21,811,22],[812,15,812,17],[812,18,812,20],[812,21,812,22],[813,15,813,17],[813,18,813,20],[813,21,813,22],[805,18,805,20],[805,21,805,22],[806,15,806,17],[806,18,806,20],[806,21,806,22],[807,15,807,17],[807,18,807,20],[807,21,807,22],[802,15,802,17],[802,18,802,20],[802,21,802,22],[803,15,803,17],[803,18,803,20],[803,21,803,22],[804,15,804,17],[804,18,804,20],[804,21,804,22]]}
[]
[]
[null,null,null,null,null,null,null,null,null,null,null,null,null,null,"UNIDADE ESCOLAR",null,null,null,null,null,null,"CÓDIGO INEP"]
[null,null,null,null,null,null,null,null,null,null,null,null,null,null,"CENTRO DE ENSINO EM PERÍODO INTEGRAL JOSÉ SALVIANO AZEVEDO",null,null,null,null,null,null,52055256]
[]
["Nmax",null,null,null,null,null,null,null,null,null,null,null,null,null,"OBRA",null,null,null,"DATA",null,null,"CIDADE"]
[{"$f":"MAX($C$18:$C$748)","v":4},null,null,null,null,null,null,null,null,null,null,null,null,null,"REFORMA E REFORMA",null,null,null,"2020-04-23",null,null,"SANTA HELENA DE GOIÁS"]
[]
[null,null,null,null,null,null,null,null,null,null,null,null,"",null,"CRE",null,null,"ENDEREÇO",null,null,null,"REFERÊNCIA AGETOP"]
[null,null,null,null,null,null,null,null,null,null,null,null,null,null,"SANTA HELENA",null,null,"RUA JACINTO F SOUSA 950, CENTRO, CEP:75920-000",null,null,null,"DEZ/18","DESONERADA"]
[]
[null,null,null,null,null,null,null,null,null,null,null,null,null,null,"ÁREA EXISTENTE (M²)",null,null,"ÁREA A CONSTRUIR (M²)","ÁREA TOTAL CONSTRUÍDA (M²)",null,null,"REFERÊNCIA SINAPI"]
[null,null,null,null,null,null,null,null,null,null,null,null,null,null,3489.7,null,null,1031.94,4521.6399999999994,null,null,"JUL/19","DESONERADA"]
[]
[null,null,null,null,null,null,null,null,null,null,null,"FILTRO",null,null,"PLANILHA ORÇAMENTÁRIA"]
["Nível E","Save Nivel","Nível C","Altura","n1","n2","n3","n4","n5","Czero","Cnível","↓","Nível","Nível Corrigido","ITEM","TABELA","CODIGO","DESCRIÇÃO DOS SERVIÇOS","UNID","QUANT","MAT","MO","T.SERVIÇO","OBSERVAÇÕES¹"]
[{"$f":"CHOOSE(1+LOG(1+2*(ORÇAMENTO.Nivel=\"Nível 1\")+4*(ORÇAMENTO.Nivel=\"Nível 2\")+8*(ORÇAMENTO.Nivel=\"Nível 3\")+16*(ORÇAMENTO.Nivel=\"Nível 4\")+32*(ORÇAMENTO.Nivel=\"Serviço\"),2),0,1,2,3,4,\"S\")","v":"S"},{"$f":"IF(OR(C17=\"s\",C17=0),OFFSET(B17,-1,0),C17)","v":"Save Nivel"},{"$f":"IF(OFFSET(C17,-1,0)=\"L\",1,IF(OFFSET(C17,-1,0)=1,2,IF(OR(A17=\"s\",A17=0),\"S\",IF(AND(OFFSET(C17,-1,0)=2,A17=4),3,IF(AND(OR(OFFSET(C17,-1,0)=\"s\",OFFSET(C17,-1,0)=0),A17<>\"s\",A17>OFFSET(B17,-1,0)),OFFSET(B17,-1,0),A17)))))","v":"S"},{"$f":"IF(OR(C17=\"S\",C17=0),0,IF(ISERROR(K17),J17,SMALL(J17:K17,1)))","v":0},{"$f":"IF($C17=1,OFFSET(E17,-1,0)+1,OFFSET(E17,-1,0))","v":"n1"},{"$f":"IF($C17=1,0,IF($C17=2,OFFSET(F17,-1,0)+1,OFFSET(F17,-1,0)))","v":"n2"},{"$f":"IF(AND($C17<=2,$C17<>0),0,IF($C17=3,OFFSET(G17,-1,0)+1,OFFSET(G17,-1,0)))","v":"n3"},{"$f":"IF(AND($C17<=3,$C17<>0),0,IF($C17=4,OFFSET(H17,-1,0)+1,OFFSET(H17,-1,0)))","v":"n4"},{"$f":"IF(AND($C17<=4,$C17<>0),0,IF(AND($C17=\"S\",$W17>0),OFFSET(I17,-1,0)+1,OFFSET(I17,-1,0)))","v":"n5"},{"$f":"IF(OR($C17=\"S\",$C17=0),0,MATCH(0,OFFSET($D17,1,$C17,ROW($C$748)-ROW($C17)),0))","v":0},{"$f":"IF(OR($C17=\"S\",$C17=0),0,MATCH(OFFSET($D17,0,$C17)+1,OFFSET($D17,1,$C17,ROW($C$748)-ROW($C17)),0))","v":0},"","Serviço","Serviço","-","SINAPI",null,"(sem código)","-",null,0,0,0,""]
[0,null,"L",{"$f":"COUNTA(OFFSET(D18,1,0):D$748)","v":729},{"$f":"LEFT(O19,1)-1","v":0},null,null,null,null,null,null,"F","LOTE","LOTE","REFORMA E REFORMA - CENTRO DE ENSINO EM PERÍODO INTEGRAL JOSÉ SALVIANO AZEVEDO",null,null,null,null,null,null,null,0]
[1,{"$f":"IF(OR(C19=\"s\",C19=0),OFFSET(B19,-1,0),C19)","v":1},{"$f":"IF(OFFSET(C19,-1,0)=\"L\",1,IF(OFFSET(C19,-1,0)=1,2,IF(OR(A19=\"s\",A19=0),\"S\",IF(AND(OFFSET(C19,-1,0)=2,A19=4),3,IF(AND(OR(OFFSET(C19,-1,0)=\"s\",OFFSET(C19,-1,0)=0),A19<>\"s\",A19>OFFSET(B19,-1,0)),OFFSET(B19,-1,0),A19)))))","v":1},{"$f":"IF(OR(C19=\"S\",C19=0),0,IF(ISERROR(K19),J19,SMALL(J19:K19,1)))","v":275},{"$f":"IF($C19=1,OFFSET(E19,-1,0)+1,OFFSET(E19,-1,0))","v":1},{"$f":"IF($C19=1,0,IF($C19=2,OFFSET(F19,-1,0)+1,OFFSET(F19,-1,0)))","v":0},{"$f":"IF(AND($C19<=2,$C19<>0),0,IF($C19=3,OFFSET(G19,-1,0)+1,OFFSET(G19,-1,0)))","v":0},{"$f":"IF(AND($C19<=3,$C19<>0),0,IF($C19=4,OFFSET(H19,-1,0)+1,OFFSET(H19,-1,0)))","v":0},0,{"$f":"IF(OR($C19=\"S\",$C19=0),0,MATCH(0,OFFSET($D19,1,$C19,ROW($C$748)-ROW($C19)),0))","v":729},{"$f":"IF(OR($C19=\"S\",$C19=0),0,MATCH(OFFSET($D19,0,$C19)+1,OFFSET($D19,1,$C19,ROW($C$748)-ROW($C19)),0))","v":275},"F","Nível 1","Nível 1","1.","AGETOP",null,"REFORMA"]
[2,{"$f":"IF(OR(C20=\"s\",C20=0),OFFSET(B20,-1,0),C20)","v":2},{"$f":"IF(OFFSET(C20,-1,0)=\"L\",1,IF(OFFSET(C20,-1,0)=1,2,IF(OR(A20=\"s\",A20=0),\"S\",IF(AND(OFFSET(C20,-1,0)=2,A20=4),3,IF(AND(OR(OFFSET(C20,-1,0)=\"s\",OFFSET(C20,-1,0)=0),A20<>\"s\",A20>OFFSET(B20,-1,0)),OFFSET(B20,-1,0),A20)))))","v":2},{"$f":"IF(OR(C20=\"S\",C20=0),0,IF(ISERROR(K20),J20,SMALL(J20:K20,1)))","v":29},{"$f":"IF($C20=1,OFFSET(E20,-1,0)+1,OFFSET(E20,-1,0))","v":1},{"$f":"IF($C20=1,0,IF($C20=2,OFFSET(F20,-1,0)+1,OFFSET(F20,-1,0)))","v":1},{"$f":"IF(AND($C20<=2,$C20<>0),0,IF($C20=3,OFFSET(G20,-1,0)+1,OFFSET(G20,-1,0)))","v":0},{"$f":"IF(AND($C20<=3,$C20<>0),0,IF($C20=4,OFFSET(H20,-1,0)+1,OFFSET(H20,-1,0)))","v":0},0,274,29,"","Nível 2","Nível 2","-","AGETOP",null,"SERVIÇOS PRELIMINARES"]
[3,3,3,6,1,1,1,0,0,28,6,"","Nível 3","Nível 3","-","SINAPI",null,"BANHEIROS","-",null,null,null,null,""]
["S",3,"S",0,1,1,1,0,0,0,0,"","Serviço","Serviço","-","SINAPI",97622,"DEMOLIÇÃO DE ALVENARIA DE BLOCO FURADO, DE FORMA MANUAL, SEM REAPROVEITAMENTO. AF_12/2017","M3",1.02,null,null,null,"Referência: AGETOP - 20118"]
["S",3,"S",0,1,1,1,0,0,0,0,"","Serviço","Serviço","-","AGETOP",20137,"DEMOLIÇAO BACIA SANITARIA C/ TRANSP. ATÉ CB. E CARGA","Un    ",2,null,null,null,""]
["S",3,"S",0,1,1,1,0,0,0,0,"","Serviço","Serviço","-","SINAPI",97644,"REMOÇÃO DE PORTAS, DE FORMA MANUAL, SEM REAPROVEITAMENTO. AF_12/2017","M2",6.4,null,null,null,"Referência: AGETOP - 20106"]
["S",3,"S",0,1,1,1,0,0,0,0,"","Serviço","Serviço","-","AGETOP",20138,"DEMOLIÇAO DE LAVATÓRIO C/ TRANSP. ATÉ CB. E CARGA","Un    ",2,null,null,null,""]
["S",3,"S",0,1,1,1,0,0,0,0,"","Serviço","Serviço","-","AGETOP",20163,"DEMOLIÇÃO DAS INSTALAÇÕES HIDROSANITÁRIAS E AFINS C/ TRANSP. ATÉ CB. E CARGA","H     ",2,null,null,null,""]
[3,3,3,4,1,1,2,0,0,22,4,"","Nível 3","Nível 3","-","SINAPI",null,"COBERTURA DE QUADRA","-",null,null,null,null,""]
["S",3,"S",0,1,1,2,0,0,0,0,"","Serviço","Serviço","-","SINAPI",97622,"DEMOLIÇÃO DE ALVENARIA DE BLOCO FURADO, DE FORMA MANUAL, SEM REAPROVEITAMENTO. AF_12/2017","M3",2.1,null,null,null,"Referência: AGETOP - 20118"]
["S",3,"S",0,1,1,2,0,0,0,0,"","Serviço","Serviço","-","AGETOP",20109,"DEM.PISO CIMENT.SOBRE LASTRO CONC.C/TR.ATE CB. E CARGA","m2    ",625,null,null,null,""]
["S",3,"S",0,1,1,2,0,0,0,0,"","Serviço","Serviço","-","AGETOP",72080,"POSTE/TRAFO - CAMINHÃO MUNCK 12 TON. (MÍNIMO 4H/DIA)","H     ",4,null,null,null,""]
[3,3,3,2,1,1,3,0,0,18,2,"","Nível 3","Nível 3","-","SINAPI",null,"MURO","-",null,null,null,null,""]
["S",3,"S",0,1,1,3,0,0,0,0,"","Serviço","Serviço","-","SINAPI",97622,"DEMOLIÇÃO DE ALVENARIA DE BLOCO FURADO, DE FORMA MANUAL, SEM REAPROVEITAMENTO. AF_12/2017","M3",179.00549999999998,null,null,null,"Referência: AGETOP - 20118"]
[3,3,3,2,1,1,4,0,0,16,2,"","Nível 3","Nível 3","-","AGETOP",null,"ELEMENTO VAZADO","-",null,null,null,null,""]
["S",3,"S",0,1,1,4,0,0,0,0,"","Serviço","Serviço","-","SINAPI",97622,"DEMOLIÇÃO DE ALVENARIA DE BLOCO FURADO, DE FORMA MANUAL, SEM REAPROVEITAMENTO. AF_12/2017","M3",9.75,null,null,null,"Referência: AGETOP - 20118"]
[3,3,3,2,1,1,5,0,0,14,2,"","Nível 3","Nível 3","-","SINAPI",null,"CAF","-",null,null,null,null,""]
["S",3,"S",0,1,1,5,0,0,0,0,"","Serviço","Serviço","-","SINAPI",97622,"DEMOLIÇÃO DE ALVENARIA DE BLOCO FURADO, DE FORMA MANUAL, SEM REAPROVEITAMENTO. AF_12/2017","M3",1.6830000000000001,null,null,null,"Referência: AGETOP - 20118"]
[3,3,3,2,1,1,6,0,0,12,2,"","Nível 3","Nível 3","-","SINAPI",null,"COORDENAÇÃO PEDAGÓGICA","-",null,null,null,null,""]
["S",3,"S",0,1,1,6,0,0,0,0,"","Serviço","Serviço","-","SINAPI",97622,"DEMOLIÇÃO DE ALVENARIA DE BLOCO FURADO, DE FORMA MANUAL, SEM REAPROVEITAMENTO. AF_12/2017","M3",0.33600000000000002,null,null,null,"Referência: AGETOP - 20118"]
[3,3,3,2,1,1,7,0,0,10,2,"","Nível 3","Nível 3","-","SINAPI",null,"SECRETARIA","-",null,null,null,null,""]
["S",3,"S",0,1,1,7,0,0,0,0,"","Serviço","Serviço","-","SINAPI",97622,"DEMOLIÇÃO DE ALVENARIA DE BLOCO FURADO, DE FORMA MANUAL, SEM REAPROVEITAMENTO. AF_12/2017","M3",0.64800000000000002,null,null,null,"Referência: AGETOP - 20118"]
[3,3,3,3,1,1,8,0,0,8,3,"","Nível 3","Nível 3","-","SINAPI",null,"DML","-",null,null,null,null,""]
["S",3,"S",0,1,1,8,0,0,0,0,"","Serviço","Serviço","-","SINAPI",97622,"DEMOLIÇÃO DE ALVENARIA DE BLOCO FURADO, DE FORMA MANUAL, SEM REAPROVEITAMENTO. AF_12/2017","M3",0.29399999999999998,null,null,null,"Referência: AGETOP - 20118"]
["S",3,"S",0,1,1,8,0,0,0,0,"","Serviço","Serviço","-","SINAPI",97644,"REMOÇÃO DE PORTAS, DE FORMA MANUAL, SEM REAPROVEITAMENTO. AF_12/2017","M2",1.47,null,null,null,"Referência: AGETOP - 20106"]
[3,3,3,3,1,1,9,0,0,5,3,"","Nível 3","Nível 3","-","SINAPI",null,"ANTIGA DESPENSA","-",null,null,null,null,""]
["S",3,"S",0,1,1,9,0,0,0,0,"","Serviço","Serviço","-","SINAPI",97622,"DEMOLIÇÃO DE ALVENARIA DE BLOCO FURADO, DE FORMA MANUAL, SEM REAPROVEITAMENTO. AF_12/2017","M3",3.4019999999999997,null,null,null,"Referência: AGETOP - 20118"]
["S",3,"S",0,1,1,9,0,0,0,0,"","Serviço","Serviço","-","SINAPI",97644,"REMOÇÃO DE PORTAS, DE FORMA MANUAL, SEM REAPROVEITAMENTO. AF_12/2017","M2",1.68,null,null,null,"Referência: AGETOP - 20106"]
[3,{"$f":"IF(OR(C47=\"s\",C47=0),OFFSET(B47,-1,0),C47)","v":3},{"$f":"IF(OFFSET(C47,-1,0)=\"L\",1,IF(OFFSET(C47,-1,0)=1,2,IF(OR(A47=\"s\",A47=0),\"S\",IF(AND(OFFSET(C47,-1,0)=2,A47=4),3,IF(AND(OR(OFFSET(C47,-1,0)=\"s\",OFFSET(C47,-1,0)=0),A47<>\"s\",A47>OFFSET(B47,-1,0)),OFFSET(B47,-1,0),A47)))))","v":3},{"$f":"IF(OR(C47=\"S\",C47=0),0,IF(ISERROR(K47),J47,SMALL(J47:K47,1)))","v":2},1,1,10,0,0,2,{"$error":"#N/A"},"","Nível 3","Nível 3","-","SINAPI",null,"REFORMA GERAL","-",null,null,null,null,""]
["S",3,"S",0,1,1,10,0,0,0,0,"","Serviço","Serviço","-","SINAPI","74209/1","PLACA DE OBRA EM CHAPA DE ACO GALVANIZADO","M2",7.5,null,null,null,"Referência: AGETOP - 21301"]
[2,2,2,2,1,2,0,0,0,245,2,"","Nível 2","Nível 2","-","AGETOP",null,"TRANSPORTES","-",null,null,null,null,""]
["S",2,"S",0,1,2,0,0,0,0,0,"","Serviço","Serviço","-","SINAPI",72900,"TRANSPORTE DE ENTULHO COM CAMINHAO BASCULANTE 6 M3, RODOVIA PAVIMENTADA, DMT 0,5 A 1,0 KM","M3",241.98849999999999,null,null,null,""]
[2,2,2,4,1,3,0,0,0,243,4,"","Nível 2","Nível 2","-","AGETOP",null,"SERVIÇO EM TERRA","-",null,null,null,null,""]
[3,3,3,3,1,3,1,0,0,3,59,"","Nível 3","Nível 3","-","SINAPI",null,"SERVIÇOS ELÉTRICOS","-",null,null,null,null,""]
[{"$f":"CHOOSE(1+LOG(1+2*(ORÇAMENTO.Nivel=\"Nível 1\")+4*(ORÇAMENTO.Nivel=\"Nível 2\")+8*(ORÇAMENTO.Nivel=\"Nível 3\")+16*(ORÇAMENTO.Nivel=\"Nível 4\")+32*(ORÇAMENTO.Nivel=\"Serviço\"),2),0,1,2,3,4,\"S\")","v":"S"},3,"S",0,1,3,1,0,{"$f":"IF(AND($C53<=4,$C53<>0),0,IF(AND($C53=\"S\",$W53>0),OFFSET(I53,-1,0)+1,OFFSET(I53,-1,0)))","v":0},0,0,"","Serviço","Serviço","-","SINAPI",94315,"ATERRO MECANIZADO DE VALA COM RETROESCAVADEIRA (CAPACIDADE DA CAÇAMBA DA RETRO: 0,26 M³ / POTÊNCIA: 88 HP), LARGURA ATÉ 0,8 M, PROFUNDIDADE ATÉ 1,5 M, COM SOLO ARGILO-ARENOSO. AF_05/2016","M3",15.48,null,null,null,""]
["S",3,"S",0,1,3,1,0,0,0,0,"","Serviço","Serviço","-","SINAPI",93358,"ESCAVAÇÃO MANUAL DE VALA COM PROFUNDIDADE MENOR OU IGUAL A 1,30 M. AF_03/2016","M3",15.48,null,null,null,"Referência: AGETOP - 40101"]
[{"$f":"CHOOSE(1+LOG(1+2*(ORÇAMENTO.Nivel=\"Nível 1\")+4*(ORÇAMENTO.Nivel=\"Nível 2\")+8*(ORÇAMENTO.Nivel=\"Nível 3\")+16*(ORÇAMENTO.Nivel=\"Nível 4\")+32*(ORÇAMENTO.Nivel=\"Serviço\"),2),0,1,2,3,4,\"S\")","v":2},{"$f":"IF(OR(C55=\"s\",C55=0),OFFSET(B55,-1,0),C55)","v":2},{"$f":"IF(OFFSET(C55,-1,0)=\"L\",1,IF(OFFSET(C55,-1,0)=1,2,IF(OR(A55=\"s\",A55=0),\"S\",IF(AND(OFFSET(C55,-1,0)=2,A55=4),3,IF(AND(OR(OFFSET(C55,-1,0)=\"s\",OFFSET(C55,-1,0)=0),A55<>\"s\",A55>OFFSET(B55,-1,0)),OFFSET(B55,-1,0),A55)))))","v":2},{"$f":"IF(OR(C55=\"S\",C55=0),0,IF(ISERROR(K55),J55,SMALL(J55:K55,1)))","v":30},{"$f":"IF($C55=1,OFFSET(E55,-1,0)+1,OFFSET(E55,-1,0))","v":1},{"$f":"IF($C55=1,0,IF($C55=2,OFFSET(F55,-1,0)+1,OFFSET(F55,-1,0)))","v":4},{"$f":"IF(AND($C55<=2,$C55<>0),0,IF($C55=3,OFFSET(G55,-1,0)+1,OFFSET(G55,-1,0)))","v":0},{"$f":"IF(AND($C55<=3,$C55<>0),0,IF($C55=4,OFFSET(H55,-1,0)+1,OFFSET(H55,-1,0)))","v":0},{"$f":"IF(AND($C55<=4,$C55<>0),0,IF(AND($C55=\"S\",$W55>0),OFFSET(I55,-1,0)+1,OFFSET(I55,-1,0)))","v":0},239,30,"","Nível 2","Nível 2","-",null,null,"INSTALAÇÕES ELÉTRICAS","-",null,null,null,null,""]
["S",2,"S",0,1,4,0,0,0,0,0,"","Serviço","Serviço","-","SINAPI",91931,"CABO DE COBRE FLEXÍVEL ISOLADO, 6 MM², ANTI-CHAMA 0,6/1,0 KV, PARA CIRCUITOS TERMINAIS - FORNECIMENTO E INSTALAÇÃO. AF_12/2015","M",680,null,null,null,"Referência: AGETOP - 70583"]
["S",2,"S",0,1,4,0,0,0,0,0,"","Serviço","Serviço","-","SINAPI",92984,"CABO DE COBRE FLEXÍVEL ISOLADO, 25 MM², ANTI-CHAMA 0,6/1,0 KV, PARA DISTRIBUIÇÃO - FORNECIMENTO E INSTALAÇÃO. AF_12/2015","M",80,null,null,null,"Referência: AGETOP - 70511"]
["S",2,"S",0,1,4,0,0,0,0,0,"","Serviço","Serviço","-","SINAPI",92986,"CABO DE COBRE FLEXÍVEL ISOLADO, 35 MM², ANTI-CHAMA 0,6/1,0 KV, PARA DISTRIBUIÇÃO - FORNECIMENTO E INSTALAÇÃO. AF_12/2015","M",320,null,null,null,"Referência: AGETOP - 70512"]
["S",2,"S",0,1,4,0,0,0,0,0,"","Serviço","Serviço","-","SINAPI",83366,"CAIXA DE PASSAGEM PARA TELEFONE 15X15X10CM (SOBREPOR), FORNECIMENTO E INSTALACAO.","UN",4,null,null,null,"Referência: AGETOP - 70645"]
["S",2,"S",0,1,4,0,0,0,0,0,"","Serviço","Serviço","-","SINAPI",97891,"CAIXA ENTERRADA ELÉTRICA RETANGULAR, EM ALVENARIA COM BLOCOS DE CONCRETO, FUNDO COM BRITA, DIMENSÕES INTERNAS: 0,4X0,4X0,4 M. AF_05/2018","UN",1,null,null,null,""]
["S",2,"S",0,1,4,0,0,0,0,0,"","Serviço","Serviço","-","SINAPI",97892,"CAIXA ENTERRADA ELÉTRICA RETANGULAR, EM ALVENARIA COM BLOCOS DE CONCRETO, FUNDO COM BRITA, DIMENSÕES INTERNAS: 0,6X0,6X0,6 M. AF_05/2018","UN",2,null,null,null,""]
["S",2,"S",0,1,4,0,0,0,0,0,"","Serviço","Serviço","-","SINAPI",92869,"CAIXA RETANGULAR 4\" X 2\" BAIXA (0,30 M DO PISO), METÁLICA, INSTALADA EM PAREDE - FORNECIMENTO E INSTALAÇÃO. AF_12/2015","UN",8,null,null,null,""]
["S",2,"S",0,1,4,0,0,0,0,0,"","Serviço","Serviço","-","SINAPI",92868,"CAIXA RETANGULAR 4\" X 2\" MÉDIA (1,30 M DO PISO), METÁLICA, INSTALADA EM PAREDE - FORNECIMENTO E INSTALAÇÃO. AF_12/2015","UN",12,null,null,null,"Referência: AGETOP - 70691"]
["S",2,"S",0,1,4,0,0,0,0,0,"","Serviço","Serviço","-","SINAPI",92867,"CAIXA RETANGULAR 4\" X 2\" ALTA (2,00 M DO PISO), METÁLICA, INSTALADA EM PAREDE - FORNECIMENTO E INSTALAÇÃO. AF_12/2015","UN",12,null,null,null,""]
["S",2,"S",0,1,4,0,0,0,0,0,"","Serviço","Serviço","-","AGETOP",71141,"CURVA DE 90 GRAUS DE PVC RIGIDO DIAM. 3/4\"","Un    ",15,null,null,null,""]
["S",2,"S",0,1,4,0,0,0,0,0,"","Serviço","Serviço","-","AGETOP",71142,"CURVA DE 90 GRAUS DE PVC RIGIDO DIAM. 1\"","Un    ",3,null,null,null,""]
["S",2,"S",0,1,4,0,0,0,0,0,"","Serviço","Serviço","-","AGETOP",71144,"CURVA DE 90 GRAUS DE PVC RIGIDO DIAM. 1.1/2\"","Un    ",1,null,null,null,""]
["S",2,"S",0,1,4,0,0,0,0,0,"","Serviço","Serviço","-","SINAPI",93653,"DISJUNTOR MONOPOLAR TIPO DIN, CORRENTE NOMINAL DE 10A - FORNECIMENTO E INSTALAÇÃO. AF_04/2016","UN",3,null,null,null,""]
["S",2,"S",0,1,4,0,0,0,0,0,"","Serviço","Serviço","-","SINAPI",93654,"DISJUNTOR MONOPOLAR TIPO DIN, CORRENTE NOMINAL DE 16A - FORNECIMENTO E INSTALAÇÃO. AF_04/2016","UN",17,null,null,null,""]
[{"$f":"CHOOSE(1+LOG(1+2*(ORÇAMENTO.Nivel=\"Nível 1\")+4*(ORÇAMENTO.Nivel=\"Nível 2\")+8*(ORÇAMENTO.Nivel=\"Nível 3\")+16*(ORÇAMENTO.Nivel=\"Nível 4\")+32*(ORÇAMENTO.Nivel=\"Serviço\"),2),0,1,2,3,4,\"S\")","v":"S"},2,"S",0,1,4,0,0,{"$f":"IF(AND($C70<=4,$C70<>0),0,IF(AND($C70=\"S\",$W70>0),OFFSET(I70,-1,0)+1,OFFSET(I70,-1,0)))","v":0},0,0,"","Serviço","Serviço","-","SINAPI",93656,"DISJUNTOR MONOPOLAR TIPO DIN, CORRENTE NOMINAL DE 25A - FORNECIMENTO E INSTALAÇÃO. AF_04/2016","UN",4,null,null,null,""]
["S",2,"S",0,1,4,0,0,0,0,0,"","Serviço","Serviço","-","SINAPI",93671,"DISJUNTOR TRIPOLAR TIPO DIN, CORRENTE NOMINAL DE 32A - FORNECIMENTO E INSTALAÇÃO. AF_04/2016","UN",2,null,null,null,"Referência: AGETOP - 71173"]
["S",2,"S",0,1,4,0,0,0,0,0,"","Serviço","Serviço","-","SINAPI",93672,"DISJUNTOR TRIPOLAR TIPO DIN, CORRENTE NOMINAL DE 40A - FORNECIMENTO E INSTALAÇÃO. AF_04/2016","UN",2,null,null,null,"Referência: AGETOP - 71174"]
["S",2,"S",0,{"$f":"IF($C73=1,OFFSET(E73,-1,0)+1,OFFSET(E73,-1,0))","v":1},{"$f":"IF($C73=1,0,IF($C73=2,OFFSET(F73,-1,0)+1,OFFSET(F73,-1,0)))","v":4},{"$f":"IF(AND($C73<=2,$C73<>0),0,IF($C73=3,OFFSET(G73,-1,0)+1,OFFSET(G73,-1,0)))","v":0},{"$f":"IF(AND($C73<=3,$C73<>0),0,IF($C73=4,OFFSET(H73,-1,0)+1,OFFSET(H73,-1,0)))","v":0},0,0,0,"","Serviço","Serviço","-","AGETOP",71450,"INTERRUPTOR DIFERENCIAL RESIDUAL (D.R.) BIPOLAR DE 25A-30mA","Un    ",6,null,null,null,""]
["S",2,"S",0,1,4,0,0,0,0,0,"","Serviço","Serviço","-","AGETOP",71184,"DISPOSITIVO DE PROTEÇÃO CONTRA SURTOS (D.P.S.) 275V DE 8 A 40KA","Un    ",6,null,null,null,""]
["S",2,"S",0,1,4,0,0,0,0,0,"","Serviço","Serviço","-","SINAPI",97667,"ELETRODUTO FLEXÍVEL CORRUGADO, PEAD, DN 50 (1 ½\u0094)  - FORNECIMENTO E INSTALAÇÃO. AF_04/2016","M",42,null,null,null,""]
["S",2,"S",0,1,4,0,0,0,0,0,"","Serviço","Serviço","-","SINAPI",97668,"ELETRODUTO FLEXÍVEL CORRUGADO, PEAD, DN 63 (2\")  - FORNECIMENTO E INSTALAÇÃO. AF_04/2016","M",21,null,null,null,""]
["S",2,"S",0,1,4,0,0,0,0,0,"","Serviço","Serviço","-","SINAPI",97669,"ELETRODUTO FLEXÍVEL CORRUGADO, PEAD, DN 90 (3\u0094) - FORNECIMENTO E INSTALAÇÃO. AF_04/2016","M",48,null,null,null,""]
["S",2,"S",0,1,4,0,0,0,0,0,"","Serviço","Serviço","-","AGETOP",71321,"FITA DE AUTO FUSAO, ROLO E 10,00 MM","Un    ",3,null,null,null,""]
["S",{"$f":"IF(OR(C79=\"s\",C79=0),OFFSET(B79,-1,0),C79)","v":2},{"$f":"IF(OFFSET(C79,-1,0)=\"L\",1,IF(OFFSET(C79,-1,0)=1,2,IF(OR(A79=\"s\",A79=0),\"S\",IF(AND(OFFSET(C79,-1,0)=2,A79=4),3,IF(AND(OR(OFFSET(C79,-1,0)=\"s\",OFFSET(C79,-1,0)=0),A79<>\"s\",A79>OFFSET(B79,-1,0)),OFFSET(B79,-1,0),A79)))))","v":"S"},{"$f":"IF(OR(C79=\"S\",C79=0),0,IF(ISERROR(K79),J79,SMALL(J79:K79,1)))","v":0},1,4,0,0,0,0,0,"","Serviço","Serviço","-","AGETOP",71331,"FITA ISOLANTE, ROLO DE 20,00 M","Un    ",2,null,null,null,""]
["S",2,"S",0,1,4,0,0,0,0,0,"","Serviço","Serviço","-","AGETOP",71380,"HASTE REV.COBRE(COPPERWELD)  3/4\" X 2,40 M C/CONECTOR","Un    ",9,null,null,null,""]
["S",2,"S",0,1,4,0,0,0,0,0,"","Serviço","Serviço","-","AGETOP",70540,"CABO DE COBRE NU No. 10 MM2 (11,11M /KG)","M     ",42,null,null,null,""]
["S",2,"S",0,1,4,0,0,0,0,0,"","Serviço","Serviço","-","SINAPI",91864,"ELETRODUTO RÍGIDO ROSCÁVEL, PVC, DN 32 MM (1\"), PARA CIRCUITOS TERMINAIS, INSTALADO EM FORRO - FORNECIMENTO E INSTALAÇÃO. AF_12/2015","M",9,null,null,null,""]
["S",2,"S",0,1,4,0,0,0,{"$f":"IF(OR($C83=\"S\",$C83=0),0,MATCH(0,OFFSET($D83,1,$C83,ROW($C$748)-ROW($C83)),0))","v":0},{"$f":"IF(OR($C83=\"S\",$C83=0),0,MATCH(OFFSET($D83,0,$C83)+1,OFFSET($D83,1,$C83,ROW($C$748)-ROW($C83)),0))","v":0},"","Serviço","Serviço","-","SINAPI","74131/8","QUADRO DE DISTRIBUICAO DE ENERGIA DE EMBUTIR, EM CHAPA METALICA, PARA 50 DISJUNTORES TERMOMAGNETICOS MONOPOLARES, COM BARRAMENTO TRIFASICO E NEUTRO, FORNECIMENTO E INSTALACAO","UN",1,null,null,null,"Referência: AGETOP - 72201"]
["S",2,"S",0,1,4,0,0,0,0,0,"","Serviço","Serviço","-","SINAPI",90458,"QUEBRA EM ALVENARIA PARA INSTALAÇÃO DE QUADRO DISTRIBUIÇÃO GRANDE (76X40 CM). AF_05/2015","UN",1,null,null,null,""]
[{"$f":"CHOOSE(1+LOG(1+2*(ORÇAMENTO.Nivel=\"Nível 1\")+4*(ORÇAMENTO.Nivel=\"Nível 2\")+8*(ORÇAMENTO.Nivel=\"Nível 3\")+16*(ORÇAMENTO.Nivel=\"Nível 4\")+32*(ORÇAMENTO.Nivel=\"Serviço\"),2),0,1,2,3,4,\"S\")","v":2},{"$f":"IF(OR(C85=\"s\",C85=0),OFFSET(B85,-1,0),C85)","v":2},{"$f":"IF(OFFSET(C85,-1,0)=\"L\",1,IF(OFFSET(C85,-1,0)=1,2,IF(OR(A85=\"s\",A85=0),\"S\",IF(AND(OFFSET(C85,-1,0)=2,A85=4),3,IF(AND(OR(OFFSET(C85,-1,0)=\"s\",OFFSET(C85,-1,0)=0),A85<>\"s\",A85>OFFSET(B85,-1,0)),OFFSET(B85,-1,0),A85)))))","v":2},{"$f":"IF(OR(C85=\"S\",C85=0),0,IF(ISERROR(K85),J85,SMALL(J85:K85,1)))","v":108},{"$f":"IF($C85=1,OFFSET(E85,-1,0)+1,OFFSET(E85,-1,0))","v":1},{"$f":"IF($C85=1,0,IF($C85=2,OFFSET(F85,-1,0)+1,OFFSET(F85,-1,0)))","v":5},{"$f":"IF(AND($C85<=2,$C85<>0),0,IF($C85=3,OFFSET(G85,-1,0)+1,OFFSET(G85,-1,0)))","v":0},{"$f":"IF(AND($C85<=3,$C85<>0),0,IF($C85=4,OFFSET(H85,-1,0)+1,OFFSET(H85,-1,0)))","v":0},{"$f":"IF(AND($C85<=4,$C85<>0),0,IF(AND($C85=\"S\",$W85>0),OFFSET(I85,-1,0)+1,OFFSET(I85,-1,0)))","v":0},209,108,"","Nível 2","Nível 2","-","AGETOP",null,"INSTALAÇÕES HIDROSSANITÁRIAS","-",null,null,null,null,""]
[3,3,3,25,1,5,1,0,0,107,25,"","Nível 3","Nível 3","-","SINAPI",null,"PEÇAS E ACESSÓRIOS","-",null,null,null,null,""]
[4,4,4,5,1,5,1,1,0,24,5,"","Nível 4","Nível 4","-","SINAPI",null,"CAIXAS E CURVAS","-",null,null,null,null,""]
["S",4,"S",0,1,5,1,1,0,0,0,"","Serviço","Serviço","-","AGETOP",81825,"CAIXA DE PASSAGEM 60 X 60 CM SEM TAMPA","Un    ",4,null,null,null,""]
["S",4,"S",0,1,5,1,1,0,0,0,"","Serviço","Serviço","-","AGETOP",81826,"TAMPA EM CONCRETO ARMADO 25 MPA E=5CM PARA A CAIXA DE PASSAGEM 60X60CM","Un    ",4,null,null,null,""]
["S",4,"S",0,1,5,1,1,0,0,0,"","Serviço","Serviço","-","AGETOP",81827,"CAIXA DE AREIA 60X60CM FUNDO DE BRITA SEM TAMPA","Un    ",3,null,null,null,""]
["S",4,"S",0,1,5,1,1,0,0,0,"","Serviço","Serviço","-","AGETOP",81537,"CURVA 90 GRAUS SOLDAVEL DIAMETRO 25 mm","Un    ",2,null,null,null,""]
[4,4,4,4,1,5,1,2,0,19,4,"","Nível 4","Nível 4","-","SINAPI",null,"VASO SANITÁRIO E ACESSÓRIOS","-",null,null,null,null,""]
["S",4,"S",0,1,5,1,2,0,0,0,"","Serviço","Serviço","-","AGETOP",80502,"VASO SANITARIO","Un    ",2,null,null,null,""]
["S",4,"S",0,1,5,1,2,0,0,0,"","Serviço","Serviço","-","AGETOP",80510,"ANEL DE VEDAÇÃO PARA VASO SANITÁRIO","Un    ",2,null,null,null,""]
["S",4,"S",0,1,5,1,2,0,0,0,"","Serviço","Serviço","-","AGETOP",80520,"CONJUNTO DE FIXACAO P/VASO SANITARIO (PAR)","CJ    ",2,null,null,null,""]
[4,4,4,7,1,5,1,3,0,15,7,"","Nível 4","Nível 4","-","SINAPI",null,"LAVATÓRIO E ACESSÓRIOS","-",null,null,null,null,""]
["S",4,"S",0,1,5,1,3,0,0,0,"","Serviço","Serviço","-","AGETOP",80542,"LAVATÓRIO MÉDIO SEM COLUNA","Un    ",2,null,null,null,""]
["S",4,"S",0,1,5,1,3,0,0,0,"","Serviço","Serviço","-","AGETOP",80550,"FIXACAO P/LAVATORIO (PAR)","PAR   ",2,null,null,null,""]
["S",4,"S",0,1,5,1,3,0,0,0,"","Serviço","Serviço","-","AGETOP",80556,"LIGAÇÃO FLEXÍVEL PVC DIAM.1/2\" (ENGATE)","Un    ",2,null,null,null,""]
["S",4,"S",0,1,5,1,3,0,0,0,"","Serviço","Serviço","-","AGETOP",80561,"SIFAO P/LAVATORIO PVC DIAM.1\"X1.1/2\"","Un    ",2,null,null,null,""]
["S",4,"S",0,1,5,1,3,0,0,0,"","Serviço","Serviço","-","AGETOP",80570,"TORNEIRA DE MESA PARA LAVATÓRIO DIÂMETRO DE 1/2\"","Un    ",2,null,null,null,""]
["S",4,"S",0,1,5,1,3,0,0,0,"","Serviço","Serviço","-","AGETOP",80580,"VALVULA P/LAVATORIO OU BEBEDOURO METALICO DIAMETRO 1\"","Un    ",2,null,null,null,""]
[4,4,4,4,1,5,1,4,0,8,4,"","Nível 4","Nível 4","-","SINAPI",null,"FILTRO E CHUVEIROS","-",null,null,null,null,""]
["S",4,"S",0,1,5,1,4,0,0,0,"","Serviço","Serviço","-","AGETOP",80723,"CHUVEIRO PVC COM BRACO DE PVC (DUCHA FRIA)","Un    ",2,null,null,null,""]
["S",4,"S",0,1,5,1,4,0,0,0,"","Serviço","Serviço","-","SINAPI",95543,"PORTA TOALHA BANHO EM METAL CROMADO, TIPO BARRA, INCLUSO FIXAÇÃO. AF_10/2016","UN",2,null,null,null,""]
["S",4,"S",0,1,5,1,4,0,0,0,"","Serviço","Serviço","-","SINAPI",88571,"SABONETEIRA DE SOBREPOR (FIXADA NA PAREDE), TIPO CONCHA, EM ACO INOXIDAVEL - FORNECIMENTO E INSTALACAO","UN",2,null,null,null,"Referência: AGETOP - 80741"]
[4,4,4,4,1,5,1,5,0,4,23,"","Nível 4","Nível 4","-","SINAPI",null,"REGISTROS","-",null,null,null,null,""]
["S",4,"S",0,1,5,1,5,0,0,0,"","Serviço","Serviço","-","AGETOP",80902,"REGISTRO DE GAVETA BRUTO DIAMETRO 3/4\"","Un    ",2,null,null,null,""]
["S",4,"S",0,1,5,1,5,0,0,0,"","Serviço","Serviço","-","AGETOP",80905,"REGISTRO DE GAVETA BRUTO DIAMETRO 1.1/2\"","Un    ",2,null,null,null,""]
["S",4,"S",0,1,5,1,5,0,0,0,"","Serviço","Serviço","-","AGETOP",80946,"REGISTRO DE PRESSAO C/CANOPLA CROMADA DIAM.3/4\"","Un    ",2,null,null,null,""]
[3,3,3,25,1,5,2,0,0,82,25,"","Nível 3","Nível 3","-","SINAPI",null,"ÁGUA FRIA","-",null,null,null,null,""]
[4,4,4,4,1,5,2,1,0,24,4,"","Nível 4","Nível 4","-","SINAPI",null,"TUBOS DE PVC SOLDÁVEL","-",null,null,null,null,""]
["S",4,"S",0,1,5,2,1,0,0,0,"","Serviço","Serviço","-","AGETOP",81003,"TUBO SOLDAVEL PVC MARROM DIAMETRO 25 mm","M     ",33,null,null,null,""]
["S",4,"S",0,1,5,2,1,0,0,0,"","Serviço","Serviço","-","AGETOP",81006,"TUBO SOLDAVEL PVC MARROM DIAM. 50 mm","m     ",14,null,null,null,""]
["S",4,"S",0,1,5,2,1,0,0,0,"","Serviço","Serviço","-","AGETOP",81007,"TUBO SOLDAVEL PVC MARROM DIAMETRO 60 mm (2\")","m     ",20,null,null,null,""]
[4,4,4,3,1,5,2,2,0,20,3,"","Nível 4","Nível 4","-","SINAPI",null,"ADAPTADORES DE PVC SOLDÁVEL","-",null,null,null,null,""]
["S",4,"S",0,1,5,2,2,0,0,0,"","Serviço","Serviço","-","AGETOP",81066,"ADAPTAD.SOLD.CURTO C/BOLSA E ROSCA P/REG.25X3/4\"","Un    ",6,null,null,null,""]
["S",4,"S",0,1,5,2,2,0,0,0,"","Serviço","Serviço","-","AGETOP",81069,"ADAPTAD.SOLD.CURTO C/BOLSA/ROSCA P/REG.50X11/2\"","Un    ",2,null,null,null,""]
[4,4,4,2,1,5,2,3,0,17,2,"","Nível 4","Nível 4","-","SINAPI",null,"LUVAS DE PVC","-",null,null,null,null,""]
["S",4,"S",0,1,5,2,3,0,0,0,"","Serviço","Serviço","-","AGETOP",81131,"LUVA SOLDAVEL C/ROSCA DIAMETRO 25 X 3/4\"","Un    ",2,null,null,null,""]
[4,4,4,3,1,5,2,4,0,15,3,"","Nível 4","Nível 4","-","SINAPI",null,"BUCHAS","-",null,null,null,null,""]
["S",4,"S",0,1,5,2,4,0,0,0,"","Serviço","Serviço","-","AGETOP",81181,"BUCHA DE REDUCAO SOLDAVEL LONGA 60 X 25 mm","Un    ",2,null,null,null,""]
["S",4,"S",0,1,5,2,4,0,0,0,"","Serviço","Serviço","-","AGETOP",81184,"BUCHA DE REDUCAO SOLDAVEL LONGA 60 X 50 mm","Un    ",2,null,null,null,""]
[4,4,4,6,1,5,2,5,0,12,6,"","Nível 4","Nível 4","-","SINAPI",null,"JOELHO","-",null,null,null,null,""]
["S",4,"S",0,1,5,2,5,0,0,0,"","Serviço","Serviço","-","AGETOP",81321,"JOELHO 90 GRAUS SOLDAVEL DIAMETRO 25 MM","Un    ",4,null,null,null,""]
["S",4,"S",0,1,5,2,5,0,0,0,"","Serviço","Serviço","-","AGETOP",81324,"JOELHO 90 GRAUS SOLDAVEL 50 mm (MARROM)","Un    ",7,null,null,null,""]
["S",4,"S",0,1,5,2,5,0,0,0,"","Serviço","Serviço","-","AGETOP",81325,"JOELHO 90 GRAUS SOLDAVEL DIAMETRO 60 mm","Un    ",5,null,null,null,""]
["S",4,"S",0,1,5,2,5,0,0,0,"","Serviço","Serviço","-","AGETOP",81360,"JOELHO RED.90 GRAUS SOLD.C/BUCHA LATAO 25X1/2\"","Un    ",2,null,null,null,""]
["S",4,"S",0,1,5,2,5,{"$f":"IF(AND($C129<=4,$C129<>0),0,IF(AND($C129=\"S\",$W129>0),OFFSET(I129,-1,0)+1,OFFSET(I129,-1,0)))","v":0},0,0,"","Serviço","Serviço","-","AGETOP",81369,"JOELHO 90 GRAUS SOLD. C/BUCHA LATAO 25 X 3/4\"","Un    ",2,null,null,null,""]
[4,4,4,3,1,5,2,6,0,6,3,"","Nível 4","Nível 4","-","SINAPI",null,"TÊ","-",null,null,null,null,""]
["S",4,"S",0,1,5,2,6,0,0,0,"","Serviço","Serviço","-","AGETOP",81406,"TE 90 GRAUS SOLDAVEL DIMETRO 60 mm","Un    ",5,null,null,null,""]
["S",4,"S",0,{"$f":"IF($C132=1,OFFSET(E132,-1,0)+1,OFFSET(E132,-1,0))","v":1},{"$f":"IF($C132=1,0,IF($C132=2,OFFSET(F132,-1,0)+1,OFFSET(F132,-1,0)))","v":5},{"$f":"IF(AND($C132<=2,$C132<>0),0,IF($C132=3,OFFSET(G132,-1,0)+1,OFFSET(G132,-1,0)))","v":2},{"$f":"IF(AND($C132<=3,$C132<>0),0,IF($C132=4,OFFSET(H132,-1,0)+1,OFFSET(H132,-1,0)))","v":6},0,0,0,"","Serviço","Serviço","-","AGETOP",81424,"TE REDUCAO 90 GRAUS SOLDAVEL 50 X 25 mm","Un    ",2,null,null,null,""]
[4,4,4,3,1,5,2,7,0,3,{"$error":"#N/A"},"","Nível 4","Nível 4","-","SINAPI",null,"ADESIVOS","-",null,null,null,null,""]
["S",4,"S",0,1,5,2,7,0,0,0,"","Serviço","Serviço","-","AGETOP",81501,"ADESIVO PLASTICO - FRASCO 850 G","Un    ",1,null,null,null,""]
["S",4,"S",0,1,5,2,7,0,0,0,"","Serviço","Serviço","-","AGETOP",81504,"SOLUCAO LIMPADORA 1000 CM3","Un    ",1,null,null,null,""]
[3,3,3,14,1,5,3,0,0,57,14,"","Nível 3","Nível 3","-","SINAPI",null,"ESGOTO SANITÁRIO","-",null,null,null,null,""]
[4,4,4,4,1,5,3,1,0,13,4,"","Nível 4","Nível 4","-","SINAPI",null,"CORPO DE CAIXA SINFONADA / RLAO","-",null,null,null,null,""]
["S",{"$f":"IF(OR(C138=\"s\",C138=0),OFFSET(B138,-1,0),C138)","v":4},{"$f":"IF(OFFSET(C138,-1,0)=\"L\",1,IF(OFFSET(C138,-1,0)=1,2,IF(OR(A138=\"s\",A138=0),\"S\",IF(AND(OFFSET(C138,-1,0)=2,A138=4),3,IF(AND(OR(OFFSET(C138,-1,0)=\"s\",OFFSET(C138,-1,0)=0),A138<>\"s\",A138>OFFSET(B138,-1,0)),OFFSET(B138,-1,0),A138)))))","v":"S"},{"$f":"IF(OR(C138=\"S\",C138=0),0,IF(ISERROR(K138),J138,SMALL(J138:K138,1)))","v":0},1,5,3,1,0,0,0,"","Serviço","Serviço","-","AGETOP",81681,"CORPO RALO SECO CILINDRICO 100 X 40","Un    ",2,null,null,null,""]
["S",4,"S",0,1,5,3,1,0,0,0,"","Serviço","Serviço","-","AGETOP",81695,"PROLONGAMENTO PARA CAIXA SIFONADA 100 MM","M     ",2,null,null,null,""]
["S",4,"S",0,1,5,3,1,0,0,0,"","Serviço","Serviço","-","AGETOP",81790,"GRELHA REDONDA BRANCA DIAM. 100 MM","Un    ",2,null,null,null,""]
[4,4,4,3,1,5,3,2,0,9,3,"","Nível 4","Nível 4","-","SINAPI",null,"CURVAS","-",null,null,null,null,""]
["S",4,"S",0,1,5,3,2,0,0,0,"","Serviço","Serviço","-","AGETOP",81730,"CURVA 90 GRAUS CURTA DIAM. 40 MM","Un    ",2,null,null,null,""]
["S",4,"S",0,1,5,3,2,0,0,0,"","Serviço","Serviço","-","AGETOP",81733,"CURVA 90 GRAUS CURTA DIAM. 100 MM","Un    ",2,null,null,null,""]
[4,4,4,2,1,5,3,3,0,6,2,"","Nível 4","Nível 4","-","SINAPI",null,"JOELHOS","-",null,null,null,null,""]
["S",4,"S",0,1,5,3,3,0,0,0,"","Serviço","Serviço","-","AGETOP",81927,"JOELHO 90 GRAUS C/ANEL 40 mm ","Un    ",2,null,null,null,""]
[4,4,4,4,1,5,3,4,0,4,{"$error":"#N/A"},"","Nível 4","Nível 4","-","SINAPI",null,"TUBOS DE PVC SOLDÁVEL","-",null,null,null,null,""]
["S",4,"S",0,1,5,3,4,0,{"$f":"IF(OR($C147=\"S\",$C147=0),0,MATCH(0,OFFSET($D147,1,$C147,ROW($C$748)-ROW($C147)),0))","v":0},{"$f":"IF(OR($C147=\"S\",$C147=0),0,MATCH(OFFSET($D147,0,$C147)+1,OFFSET($D147,1,$C147,ROW($C$748)-ROW($C147)),0))","v":0},"","Serviço","Serviço","-","AGETOP",82301,"TUBO SOLD.P/ESGOTO DIAM. 40 MM","m     ",15,null,null,null,""]
["S",4,"S",0,1,5,3,4,0,0,0,"","Serviço","Serviço","-","AGETOP",82303,"TUBO SOLDAVEL P/ESGOTO DIAM.75 MM","m     ",11,null,null,null,""]
["S",4,"S",0,1,5,3,4,0,0,0,"","Serviço","Serviço","-","AGETOP",82304,"TUBO SOLDAVEL P/ESGOTO DIAM. 100 MM","m     ",96,null,null,null,""]
[3,3,3,3,1,5,4,0,0,43,3,"","Nível 3","Nível 3","-","SINAPI",null,"OUTROS","-",null,null,null,null,""]
["S",3,"S",0,1,5,4,0,0,0,0,"","Serviço","Serviço","-","AGETOP",81883,"RES.METALICO TAÇA AÇO PATINÁVEL-V=20M3-COL.SEC.H=6M+FUNDAÇÃO+LOGOTIPO","un    ",1,null,null,null,""]
["S",3,"S",0,1,5,4,0,0,0,0,"","Serviço","Serviço","-","AGETOP",81889,"TORNEIRA BOIA DIAMETRO 1\" (25 MM )","Un    ",1,null,null,null,""]
[{"$f":"CHOOSE(1+LOG(1+2*(ORÇAMENTO.Nivel=\"Nível 1\")+4*(ORÇAMENTO.Nivel=\"Nível 2\")+8*(ORÇAMENTO.Nivel=\"Nível 3\")+16*(ORÇAMENTO.Nivel=\"Nível 4\")+32*(ORÇAMENTO.Nivel=\"Serviço\"),2),0,1,2,3,4,\"S\")","v":3},3,3,40,1,5,5,0,0,40,{"$error":"#N/A"},"","Nível 3","Nível 3","-","SINAPI",null,"INSTALAÇÕES DE INCÊNDIO","-",null,null,null,null,""]
["S",3,"S",0,1,5,5,0,0,0,0,"","Serviço","Serviço","-","COMPOSIÇÃO","COMP 040_SEE","CONJUNTO MOTOR-BOMBA ELÉTRICA TRIFÁSICO 380/220 V PARA VZ= 24,33 M³/H, HM= 46,24 M POTÊNCIA= 7,5 CV","UN ",1,null,null,null,""]
["S",3,"S",0,1,5,5,0,0,0,0,"","Serviço","Serviço","-","AGETOP",72338,"SIRENE METALICA ALCANCE 500 M","Un    ",1,null,null,null,""]
["S",3,"S",0,1,5,5,0,0,0,0,"","Serviço","Serviço","-","AGETOP",80910,"REGISTRO DE GAVETA BRUTO DIAMETRO 2.1/2\"","Un    ",2,null,null,null,""]
["S",3,"S",0,1,5,5,0,0,0,0,"","Serviço","Serviço","-","AGETOP",82379,"TUBO FERRO GALVANIZADO DIAM.2.1/2\"","m     ",246,null,null,null,""]
["S",3,"S",0,1,5,5,0,0,0,0,"","Serviço","Serviço","-","AGETOP",85003,"EXTINTOR PO QUIMICO SECO (6 KG) - CAPACIDADE EXTINTORA 20 BC","Un    ",2,null,null,null,""]
["S",3,"S",0,1,5,5,0,0,0,0,"","Serviço","Serviço","-","AGETOP",85006,"EXTINTOR MULTI USO EM PO A B C (6 KG) - CAPACIDADE EXTINTORA 3A 20BC","un    ",5,null,null,null,""]
["S",3,"S",0,1,5,5,0,0,0,0,"","Serviço","Serviço","-","AGETOP",85011,"CAIXA DE INCÊNDIO METÁLICA COM SUPORTE PARA MANGUEIRA, TAMPA E MURETA 17X60X90 CM C/PINTURA","Un    ",4,null,null,null,""]
["S",3,"S",0,1,5,5,0,0,0,0,"","Serviço","Serviço","-","AGETOP",85017,"MANGUEIRA DE INCÊNDIO D.I. = 38 MM TIPO 2 COMP. = 15 M","CJ    ",8,null,null,null,""]
["S",3,"S",0,1,5,5,0,0,0,0,"","Serviço","Serviço","-","AGETOP",85025,"ESGUICHO REGULÁVEL 1.1/2\"","Un    ",4,null,null,null,""]
["S",3,"S",0,1,5,5,0,0,0,0,"","Serviço","Serviço","-","AGETOP",85027,"ADAPTADOR P/ENGATE STORZ 2.1/2\" X 1.1/2\"","Un    ",5,null,null,null,""]
["S",3,"S",0,1,5,5,0,0,0,0,"","Serviço","Serviço","-","AGETOP",85031,"REGISTRO GLOBO ANGULAR 2.1/2\"","Un    ",4,null,null,null,""]
["S",3,"S",0,1,5,5,0,0,0,0,"","Serviço","Serviço","-","AGETOP",85035,"TAMPÃO CEGO COM CORRENTE 2.1/2\"","Un    ",5,null,null,null,""]
["S",3,"S",0,1,5,5,0,0,0,0,"","Serviço","Serviço","-","AGETOP",85037,"TANQUE DE PRESSÃO DE 10 L","Un    ",1,null,null,null,""]
["S",3,"S",0,1,5,5,0,0,0,0,"","Serviço","Serviço","-","AGETOP",85039,"PRESSOSTATO 50 A 80 PSI","Un    ",1,null,null,null,""]
["S",3,"S",0,1,5,5,0,0,0,0,"","Serviço","Serviço","-","AGETOP",85041,"MANOMETRO - 0 A 10 KG/CM2","Un    ",1,null,null,null,""]
["S",3,"S",0,1,5,5,0,0,0,0,"","Serviço","Serviço","-","AGETOP",85047,"NIPLE DUPLO FERRO GALVANIZADO 2.1/2\"","Un    ",4,null,null,null,""]
["S",3,"S",0,1,5,5,0,0,0,0,"","Serviço","Serviço","-","AGETOP",85077,"VÁLVULA DE RETENÇÃO HORIZONTAL 2.1/2\"","Un    ",2,null,null,null,""]
["S",3,"S",0,1,5,5,0,0,0,0,"","Serviço","Serviço","-","COMPOSIÇÃO","COMP 017_SEE","REDUCAO GIRATÓRIA TIPO STORZ LATAO P/ INST. PREDIAL COMBATE A INCENDIO ENGATE RAPIDO 2.1/2\" X 1.1/2\"","UN ",5,null,null,null,""]
["S",3,"S",0,1,5,5,0,0,0,0,"","Serviço","Serviço","-","COMPOSIÇÃO","COMP 018_SEE","CHAVE DUPLA P/ CONEXÕES TIPO STORZ EM LATÃO ENGATE RÁPIDO 1 1/2\" X 2 1/2\"","UN ",4,null,null,null,""]
["S",3,"S",0,1,5,5,0,0,0,0,"","Serviço","Serviço","-","AGETOP",80981,"REGISTRO DE ESFERA DIAMETRO 2.1/2\"","Un    ",1,null,null,null,""]
["S",3,"S",0,1,5,5,0,0,0,0,"","Serviço","Serviço","-","COMPOSIÇÃO","COMP 087_SEE","REGISTRO DE GAVETA COM HASTE ASCENDENTE DE BRONZE 2 1/2\"","UN ",1,null,null,null,""]
["S",3,"S",0,1,5,5,0,0,0,0,"","Serviço","Serviço","-","COMPOSIÇÃO","COMP 019_SEE","TAMPÃO LATAO C/ CORRENTE P/ INSTALAÇÃO PREDIAL COMBATE A INCÊNDIO ENGATE RÁPIDO 1 1/2\"","UN ",1,null,null,null,""]
["S",3,"S",0,1,5,5,0,0,0,0,"","Serviço","Serviço","-","AGETOP",85056,"TÊ DE FERRO GALVANIZADO 90º X 2 1/2\"","un    ",7,null,null,null,""]
["S",3,"S",0,1,5,5,0,0,0,0,"","Serviço","Serviço","-","COMPOSIÇÃO","COMP 030_SEE","COTOVELO DE FERRO GALV. 90° X 2 1/2\"","UN ",17,null,null,null,""]
["S",3,"S",0,1,5,5,0,0,0,0,"","Serviço","Serviço","-","COMPOSIÇÃO","COMP 077_SEE","UNIAO FERRO GALV C/ASSENTO CONICO BRONZE 2 1/2\"","UN ",6,null,null,null,""]
["S",3,"S",0,1,5,5,0,0,0,0,"","Serviço","Serviço","-","COMPOSIÇÃO","COMP 559_SEE","ADAPTADOR PARA CAIXA D´ÁGUA 150MM 2.1/2\" ","UN ",1,null,null,null,""]
["S",3,"S",0,1,5,5,0,0,0,0,"","Serviço","Serviço","-","COMPOSIÇÃO","COMP 022_SEE","TAMPÃO FOFO 40X50CM C/INSCRIÇÃO ","UN ",1,null,null,null,""]
["S",3,"S",0,1,5,5,0,0,0,0,"","Serviço","Serviço","-","COMPOSIÇÃO","COMP 546_SEE","BUJÃO DE REBORDO 2.1/2\"","UN ",1,null,null,null,""]
["S",3,"S",0,1,5,5,0,0,0,0,"","Serviço","Serviço","-","COMPOSIÇÃO","COMP 186_SEE","BOTOEIRA BOMBA DE INCÊNDIO C/ MARTELO CONVENCIONAL/ ANALÓGICA","UN ",1,null,null,null,""]
["S",3,"S",0,1,5,5,0,0,0,0,"","Serviço","Serviço","-","COMPOSIÇÃO","COMP 188_SEE","ACIONADOR MANUAL DE ALARME","UN ",5,null,null,null,""]
["S",3,"S",0,1,5,5,0,0,0,0,"","Serviço","Serviço","-","COMPOSIÇÃO","COMP 190_SEE","CENTRAL DE DETECÇÃO E ALARME DE 40 SETORES COM BATERIA","UN ",1,null,null,null,""]
["S",3,"S",0,1,5,5,0,0,0,0,"","Serviço","Serviço","-","SINAPI",97599,"LUMINÁRIA DE EMERGÊNCIA - FORNECIMENTO E INSTALAÇÃO. AF_11/2017","UN",19,null,null,null,""]
["S",3,"S",0,1,5,5,0,0,0,0,"","Serviço","Serviço","-","COMPOSIÇÃO","COMP 024_SEE","SINALIZADOR FOTOLUMINESCENTE PARA EXTINTOR","UN ",7,null,null,null,""]
["S",3,"S",0,1,5,5,0,0,0,0,"","Serviço","Serviço","-","COMPOSIÇÃO","COMP 025_SEE","SINALIZADOR FOTOLUMINESCENTE DE EMERGÊNCIA","UN ",24,null,null,null,""]
["S",3,"S",0,1,5,5,0,0,0,0,"","Serviço","Serviço","-","COMPOSIÇÃO","COMP 277_SEE","MARCAÇÃO NO PISO - 1X1 M PARA EXTINTOR","M2",7,null,null,null,""]
["S",3,"S",0,1,5,5,0,0,0,0,"","Serviço","Serviço","-","COMPOSIÇÃO","COMP 235_SEE","PLACA DE SINALIZAÇÃO EM PVC COD 01 - (300X300) PROIBIDO FUMAR","UN ",1,null,null,null,""]
["S",3,"S",0,1,5,5,0,0,0,0,"","Serviço","Serviço","-","COMPOSIÇÃO","COMP 236_SEE","PLACA DE SINALIZAÇÃO EM PVC COD 06 - (300X300) PERIGO INFLAMÁVEL","UN ",1,null,null,null,""]
["S",3,"S",0,1,5,5,0,0,0,0,"","Serviço","Serviço","-","COMPOSIÇÃO","COMP 411_SEE","PLACA DE SINALIZAÇÃO EM PVC COD 13 - (316X158) SAÍDA DE EMERGÊNCIA","UN ",1,null,null,null,""]
["S",3,"S",0,1,5,5,0,0,0,0,"","Serviço","Serviço","-","COMPOSIÇÃO","COMP 412_SEE","PLACA DE SINALIZAÇÃO EM PVC COD 17 - (316X158) MENSAGEM \"SAÍDA\"","UN ",1,null,null,null,""]
[{"$f":"CHOOSE(1+LOG(1+2*(ORÇAMENTO.Nivel=\"Nível 1\")+4*(ORÇAMENTO.Nivel=\"Nível 2\")+8*(ORÇAMENTO.Nivel=\"Nível 3\")+16*(ORÇAMENTO.Nivel=\"Nível 4\")+32*(ORÇAMENTO.Nivel=\"Serviço\"),2),0,1,2,3,4,\"S\")","v":2},{"$f":"IF(OR(C193=\"s\",C193=0),OFFSET(B193,-1,0),C193)","v":2},{"$f":"IF(OFFSET(C193,-1,0)=\"L\",1,IF(OFFSET(C193,-1,0)=1,2,IF(OR(A193=\"s\",A193=0),\"S\",IF(AND(OFFSET(C193,-1,0)=2,A193=4),3,IF(AND(OR(OFFSET(C193,-1,0)=\"s\",OFFSET(C193,-1,0)=0),A193<>\"s\",A193>OFFSET(B193,-1,0)),OFFSET(B193,-1,0),A193)))))","v":2},{"$f":"IF(OR(C193=\"S\",C193=0),0,IF(ISERROR(K193),J193,SMALL(J193:K193,1)))","v":26},{"$f":"IF($C193=1,OFFSET(E193,-1,0)+1,OFFSET(E193,-1,0))","v":1},{"$f":"IF($C193=1,0,IF($C193=2,OFFSET(F193,-1,0)+1,OFFSET(F193,-1,0)))","v":6},{"$f":"IF(AND($C193<=2,$C193<>0),0,IF($C193=3,OFFSET(G193,-1,0)+1,OFFSET(G193,-1,0)))","v":0},{"$f":"IF(AND($C193<=3,$C193<>0),0,IF($C193=4,OFFSET(H193,-1,0)+1,OFFSET(H193,-1,0)))","v":0},{"$f":"IF(AND($C193<=4,$C193<>0),0,IF(AND($C193=\"S\",$W193>0),OFFSET(I193,-1,0)+1,OFFSET(I193,-1,0)))","v":0},101,26,"","Nível 2","Nível 2","-",null,null,"INSTALAÇÕES ESPECIAIS","-",null,null,null,null,""]
["S",2,"S",0,1,6,0,0,0,0,0,"","Serviço","Serviço","-","AGETOP",91007,"CENTRAL DE GÁS PADRÃO AGETOP SEM INSTALAÇÕES (1+1 CILINDRO 45 KG)","Un    ",1,null,null,null,""]
["S",2,"S",0,1,6,0,0,0,0,0,"","Serviço","Serviço","-","AGETOP",91023,"UNIÃO S/BRONZE PRETA 3/4\" NPT 300 LBS","Un    ",3,null,null,null,""]
["S",2,"S",0,1,6,0,0,0,0,0,"","Serviço","Serviço","-","COMPOSIÇÃO","COMP 382_SEE","TE DE REDUCAO DE FERRO GALVANIZADO, COM ROSCA BSP, DE 3/4\" X 1/2\"","UN ",1,null,null,null,""]
["S",2,"S",0,1,6,0,0,0,0,0,"","Serviço","Serviço","-","COMPOSIÇÃO","COMP 383_SEE","BUCHA DE REDUCAO DE FERRO GALVANIZADO, COM ROSCA BSP, DE 1/2\" X 1/4\"","UN ",3,null,null,null,""]
["S",2,"S",0,1,6,0,0,0,0,0,"","Serviço","Serviço","-","AGETOP",91021,"LUVA GALVANIZADO DE REDUÇÃO 3/4\" X 1/2\" (GÁS)","Un    ",2,null,null,null,""]
["S",2,"S",0,1,6,0,0,0,0,0,"","Serviço","Serviço","-","SINAPI",92692,"NIPLE, EM FERRO GALVANIZADO, CONEXÃO ROSQUEADA, DN 15 (1/2\"), INSTALADO EM RAMAIS E SUB-RAMAIS DE GÁS - FORNECIMENTO E INSTALAÇÃO. AF_12/2015","UN",6,null,null,null,""]
["S",2,"S",0,1,6,0,0,0,0,0,"","Serviço","Serviço","-","AGETOP",91031,"NIPLE DUPLO 300 PSI 3/4\"","Un    ",6,null,null,null,""]
["S",2,"S",0,1,6,0,0,0,0,0,"","Serviço","Serviço","-","COMPOSIÇÃO","COMP 212_SEE","NIPLE DE REDUÇÃO 1/2\" X 1/4\" BSP","UN ",4,null,null,null,""]
["S",2,"S",0,1,6,0,0,0,0,0,"","Serviço","Serviço","-","COMPOSIÇÃO","COMP 213_SEE","NIPLE DE REDUÇÃO 3/4\" X 1/2\" BSP","UN ",4,null,null,null,""]
["S",2,"S",0,1,6,0,0,0,0,0,"","Serviço","Serviço","-","SINAPI",92688,"TUBO DE AÇO GALVANIZADO COM COSTURA, CLASSE MÉDIA, CONEXÃO ROSQUEADA, DN 20 (3/4\"), INSTALADO EM RAMAIS E SUB-RAMAIS DE GÁS - FORNECIMENTO E INSTALAÇÃO. AF_12/2015","M",6,null,null,null,""]
["S",2,"S",0,1,6,0,0,0,0,0,"","Serviço","Serviço","-","SINAPI",92701,"JOELHO 90 GRAUS, EM FERRO GALVANIZADO, CONEXÃO ROSQUEADA, DN 20 (3/4\"), INSTALADO EM RAMAIS E SUB-RAMAIS DE GÁS - FORNECIMENTO E INSTALAÇÃO. AF_12/2015","UN",4,null,null,null,""]
["S",2,"S",0,1,6,0,0,0,0,0,"","Serviço","Serviço","-","COMPOSIÇÃO","COMP 237_SEE","FITA ANTICORROSIVA","M",5,null,null,null,""]
["S",2,"S",0,1,6,0,0,0,0,0,"","Serviço","Serviço","-","AGETOP",91025,"VÁLVULA ESFERICA LATÃO 3/4\"","Un    ",3,null,null,null,""]
["S",2,"S",0,1,6,0,0,0,0,0,"","Serviço","Serviço","-","COMPOSIÇÃO","COMP 542_SEE","VÁLVULA UGV 3/4\" (S) LATÃO","UN ",2,null,null,null,""]
["S",2,"S",0,1,6,0,0,0,0,0,"","Serviço","Serviço","-","COMPOSIÇÃO","COMP 543_SEE","VÁLVULA UGV 1/2\" (S) LATÃO","UN ",2,null,null,null,""]
["S",2,"S",0,1,6,0,0,0,0,0,"","Serviço","Serviço","-","AGETOP",91029,"VALVULA DE RETENÇÃO LATÃO 1/2\" X 7/16\" NPT","Un    ",2,null,null,null,""]
["S",2,"S",0,1,6,0,0,0,0,0,"","Serviço","Serviço","-","COMPOSIÇÃO","COMP 211_SEE","REGULADOR DE 2º ESTÁGIO 5KG/H","UN ",2,null,null,null,""]
["S",2,"S",0,1,6,0,0,0,{"$f":"IF(OR($C211=\"S\",$C211=0),0,MATCH(0,OFFSET($D211,1,$C211,ROW($C$748)-ROW($C211)),0))","v":0},{"$f":"IF(OR($C211=\"S\",$C211=0),0,MATCH(OFFSET($D211,0,$C211)+1,OFFSET($D211,1,$C211,ROW($C$748)-ROW($C211)),0))","v":0},"","Serviço","Serviço","-","COMPOSIÇÃO","COMP 210_SEE","REGULADOR DE 1º ESTÁGIO 60KG/H MODELO AP-40  COM MANÔMETRO","UN ",1,null,null,null,""]
["S",2,"S",0,1,6,0,0,0,0,0,"","Serviço","Serviço","-","AGETOP",85003,"EXTINTOR PO QUIMICO SECO (6 KG) - CAPACIDADE EXTINTORA 20 BC","Un    ",1,null,null,null,""]
["S",2,"S",0,1,6,0,0,0,0,0,"","Serviço","Serviço","-","COMPOSIÇÃO","COMP 235_SEE","PLACA DE SINALIZAÇÃO EM PVC COD 01 - (300X300) PROIBIDO FUMAR","UN ",2,null,null,null,""]
["S",2,"S",0,1,6,0,0,0,0,0,"","Serviço","Serviço","-","COMPOSIÇÃO","COMP 236_SEE","PLACA DE SINALIZAÇÃO EM PVC COD 06 - (300X300) PERIGO INFLAMÁVEL","UN ",2,null,null,null,""]
["S",2,"S",0,1,6,0,0,0,0,0,"","Serviço","Serviço","-","AGETOP",91043,"BRAÇADEIRA METALICA TIPO \"D\" DIAM. 3/4\"","Un    ",4,null,null,null,""]
["S",2,"S",0,1,6,0,0,0,0,0,"","Serviço","Serviço","-","AGETOP",71863,"PARAFUSO P/BUCHA S-10","Un    ",8,null,null,null,""]
["S",2,"S",0,1,6,0,0,0,0,0,"","Serviço","Serviço","-","AGETOP",70393,"BUCHA DE NYLON S-10","Un    ",8,null,null,null,""]
["S",2,"S",0,1,6,0,0,0,0,0,"","Serviço","Serviço","-","AGETOP",91045,"SUPORTE PARA COLETOR","Un    ",2,null,null,null,""]
[{"$f":"CHOOSE(1+LOG(1+2*(ORÇAMENTO.Nivel=\"Nível 1\")+4*(ORÇAMENTO.Nivel=\"Nível 2\")+8*(ORÇAMENTO.Nivel=\"Nível 3\")+16*(ORÇAMENTO.Nivel=\"Nível 4\")+32*(ORÇAMENTO.Nivel=\"Serviço\"),2),0,1,2,3,4,\"S\")","v":2},2,2,5,1,7,0,0,{"$f":"IF(AND($C219<=4,$C219<>0),0,IF(AND($C219=\"S\",$W219>0),OFFSET(I219,-1,0)+1,OFFSET(I219,-1,0)))","v":0},75,5,"","Nível 2","Nível 2","-","AGETOP",91045,"ALVENARIAS E DIVISÓRIAS","Un    ",null,null,null,null,""]
[3,{"$f":"IF(OR(C220=\"s\",C220=0),OFFSET(B220,-1,0),C220)","v":3},{"$f":"IF(OFFSET(C220,-1,0)=\"L\",1,IF(OFFSET(C220,-1,0)=1,2,IF(OR(A220=\"s\",A220=0),\"S\",IF(AND(OFFSET(C220,-1,0)=2,A220=4),3,IF(AND(OR(OFFSET(C220,-1,0)=\"s\",OFFSET(C220,-1,0)=0),A220<>\"s\",A220>OFFSET(B220,-1,0)),OFFSET(B220,-1,0),A220)))))","v":3},{"$f":"IF(OR(C220=\"S\",C220=0),0,IF(ISERROR(K220),J220,SMALL(J220:K220,1)))","v":2},{"$f":"IF($C220=1,OFFSET(E220,-1,0)+1,OFFSET(E220,-1,0))","v":1},{"$f":"IF($C220=1,0,IF($C220=2,OFFSET(F220,-1,0)+1,OFFSET(F220,-1,0)))","v":7},{"$f":"IF(AND($C220<=2,$C220<>0),0,IF($C220=3,OFFSET(G220,-1,0)+1,OFFSET(G220,-1,0)))","v":1},{"$f":"IF(AND($C220<=3,$C220<>0),0,IF($C220=4,OFFSET(H220,-1,0)+1,OFFSET(H220,-1,0)))","v":0},0,4,2,"","Nível 3","Nível 3","-","SINAPI",null,"BANHEIROS","-",null,null,null,null,""]
["S",3,"S",0,1,7,1,0,0,0,0,"","Serviço","Serviço","-","SINAPI",87520,"ALVENARIA DE VEDAÇÃO DE BLOCOS CERÂMICOS FURADOS NA HORIZONTAL DE 9X19X19CM (ESPESSURA 9CM) DE PAREDES COM ÁREA LÍQUIDA MAIOR OU IGUAL A 6M² COM VÃOS E ARGAMASSA DE ASSENTAMENTO COM PREPARO MANUAL. AF_06/2014","M2",3.2,null,null,null,"Referência: AGETOP - 100201"]
[3,3,3,2,1,7,2,0,0,2,14,"","Nível 3","Nível 3","-","SINAPI",null,"DML","-",null,null,null,null,""]
["S",3,"S",0,1,7,2,0,0,0,0,"","Serviço","Serviço","-","SINAPI",87520,"ALVENARIA DE VEDAÇÃO DE BLOCOS CERÂMICOS FURADOS NA HORIZONTAL DE 9X19X19CM (ESPESSURA 9CM) DE PAREDES COM ÁREA LÍQUIDA MAIOR OU IGUAL A 6M² COM VÃOS E ARGAMASSA DE ASSENTAMENTO COM PREPARO MANUAL. AF_06/2014","M2",1.96,null,null,null,"Referência: AGETOP - 100201"]
[2,2,2,2,1,8,0,0,0,70,2,"","Nível 2","Nível 2","-",null,null,"IMPERMEABILIZAÇÃO","-",null,null,null,null,""]
["S",2,"S",0,1,8,0,0,0,0,0,"","Serviço","Serviço","-","SINAPI",98562,"IMPERMEABILIZAÇÃO DE FLOREIRA OU VIGA BALDRAME COM ARGAMASSA DE CIMENTO E AREIA, COM ADITIVO IMPERMEABILIZANTE, E = 2 CM. AF_06/2018","M2",50.78,null,null,null,"Referência: AGETOP - 120902"]
[2,2,2,2,1,9,0,0,0,68,2,"","Nível 2","Nível 2","-",null,null,"ESTRUTURAS METÁLICAS","-",null,null,null,null,""]
["S",2,"S",0,1,9,0,0,0,0,0,"","Serviço","Serviço","-","AGETOP",150103,"ESTRUTURA METÁLICA CONVENCIONAL EM AÇO DO TIPO USI SAC-300 COM FUNDO ANTICORROSIVO","Kg    ",2455.39,null,null,null,""]
[2,2,2,3,1,10,0,0,0,66,3,"","Nível 2","Nível 2","-",null,null,"COBERTURAS","-",null,null,null,null,""]
[3,3,3,2,1,10,1,0,0,2,5,"","Nível 3","Nível 3","-",null,null,"METÁLICA","-",null,null,null,null,""]
["S",3,"S",0,1,10,1,0,0,0,0,"","Serviço","Serviço","-","SINAPI",94213,"TELHAMENTO COM TELHA DE AÇO/ALUMÍNIO E = 0,5 MM, COM ATÉ 2 ÁGUAS, INCLUSO IÇAMENTO. AF_07/2019","M2",75.75,null,null,null,"Referência: AGETOP - 160905"]
[2,2,2,9,1,11,0,0,0,63,9,"","Nível 2","Nível 2","-",null,null,"ESQUADRIAS METÁLICAS","-",null,null,null,null,""]
[3,3,3,2,1,11,1,0,0,8,2,"","Nível 3","Nível 3","-","SINAPI",null,"BANHEIROS","-",null,null,null,null,""]
["S",3,"S",0,1,11,1,0,0,0,0,"","Serviço","Serviço","-","AGETOP",180509,"PORTA ABRIR CH.P/WC PF-10 C/FERRAGENS","m2    ",3.2,null,null,null,""]
[3,3,3,2,1,11,2,0,0,6,2,"","Nível 3","Nível 3","-","SINAPI",null,"COORDENAÇÃO PEDAGÓGICA","-",null,null,null,null,""]
["S",3,"S",0,1,11,2,0,0,0,0,"","Serviço","Serviço","-","SINAPI","73933/4","PORTA DE FERRO DE ABRIR TIPO BARRA CHATA, COM REQUADRO E GUARNICAO COMPLETA","M2",1.68,null,null,null,"Referência: AGETOP - 180501"]
[3,3,3,2,1,11,3,0,0,4,2,"","Nível 3","Nível 3","-","SINAPI",null,"SECRETARIA","-",null,null,null,null,""]
["S",3,"S",0,1,11,3,0,0,0,0,"","Serviço","Serviço","-","AGETOP",180401,"ESQ.DE CORRER CHAPA/VIDRO J9/J10/J12/J13 C/FERRAGENS","m2    ",4.8,null,null,null,""]
[3,3,3,2,1,11,4,0,0,2,333,"","Nível 3","Nível 3","-","SINAPI",null,"DML","-",null,null,null,null,""]
["S",3,"S",0,1,11,4,0,0,0,0,"","Serviço","Serviço","-","SINAPI","73933/4","PORTA DE FERRO DE ABRIR TIPO BARRA CHATA, COM REQUADRO E GUARNICAO COMPLETA","M2",1.47,null,null,null,"Referência: AGETOP - 180501"]
[2,2,2,3,1,12,0,0,0,54,3,"","Nível 2","Nível 2","-","SINAPI",null,"VIDROS","-",null,null,null,null,""]
[3,3,3,2,1,12,1,0,0,2,6,"","Nível 3","Nível 3","-","SINAPI",null,"SECRETARIA","-",null,null,null,null,""]
["S",3,"S",0,1,12,1,0,0,0,0,"","Serviço","Serviço","-","AGETOP",190102,"VIDRO LISO 4 MM - COLOCADO","m2    ",4.8,null,null,null,""]
[2,2,2,11,1,13,0,0,0,51,11,"","Nível 2","Nível 2","-",null,null,"REVESTIMENTO DE PAREDE","-",null,null,null,null,""]
[3,3,3,3,1,13,1,0,0,10,3,"","Nível 3","Nível 3","-","SINAPI",null,"COBERTURA DE QUADRA","-",null,null,null,null,""]
["S",3,"S",0,1,13,1,0,0,0,0,"","Serviço","Serviço","-","SINAPI",87904,"CHAPISCO APLICADO EM ALVENARIA (COM PRESENÇA DE VÃOS) E ESTRUTURAS DE CONCRETO DE FACHADA, COM COLHER DE PEDREIRO.  ARGAMASSA TRAÇO 1:3 COM PREPARO MANUAL. AF_06/2014","M2",146.30000000000001,null,null,null,"Referência: AGETOP - 200101"]
["S",3,"S",0,1,13,1,0,0,0,0,"","Serviço","Serviço","-","SINAPI",87547,"MASSA ÚNICA, PARA RECEBIMENTO DE PINTURA, EM ARGAMASSA TRAÇO 1:2:8, PREPARO MECÂNICO COM BETONEIRA 400L, APLICADA MANUALMENTE EM FACES INTERNAS DE PAREDES, ESPESSURA DE 10MM, COM EXECUÇÃO DE TALISCAS. AF_06/2014","M2",146.30000000000001,null,null,null,"Referência: AGETOP - 200500"]
[3,3,3,3,1,13,2,0,0,7,3,"","Nível 3","Nível 3","-","SINAPI",null,"MURO","-",null,null,null,null,""]
["S",3,"S",0,1,13,2,0,0,0,0,"","Serviço","Serviço","-","SINAPI",87904,"CHAPISCO APLICADO EM ALVENARIA (COM PRESENÇA DE VÃOS) E ESTRUTURAS DE CONCRETO DE FACHADA, COM COLHER DE PEDREIRO.  ARGAMASSA TRAÇO 1:3 COM PREPARO MANUAL. AF_06/2014","M2",2386.7399999999998,null,null,null,"Referência: AGETOP - 200101"]
["S",3,"S",0,1,13,2,0,0,0,0,"","Serviço","Serviço","-","SINAPI",87547,"MASSA ÚNICA, PARA RECEBIMENTO DE PINTURA, EM ARGAMASSA TRAÇO 1:2:8, PREPARO MECÂNICO COM BETONEIRA 400L, APLICADA MANUALMENTE EM FACES INTERNAS DE PAREDES, ESPESSURA DE 10MM, COM EXECUÇÃO DE TALISCAS. AF_06/2014","M2",2386.7399999999998,null,null,null,"Referência: AGETOP - 200500"]
[3,3,3,4,1,13,3,0,0,4,33,"","Nível 3","Nível 3","-","SINAPI",null,"BANHEIROS","-",null,null,null,null,""]
["S",3,"S",0,1,13,3,0,0,0,0,"","Serviço","Serviço","-","SINAPI",87904,"CHAPISCO APLICADO EM ALVENARIA (COM PRESENÇA DE VÃOS) E ESTRUTURAS DE CONCRETO DE FACHADA, COM COLHER DE PEDREIRO.  ARGAMASSA TRAÇO 1:3 COM PREPARO MANUAL. AF_06/2014","M2",6.4,null,null,null,"Referência: AGETOP - 200101"]
["S",3,"S",0,1,13,3,0,0,0,0,"","Serviço","Serviço","-","SINAPI",87553,"EMBOÇO, PARA RECEBIMENTO DE CERÂMICA, EM ARGAMASSA TRAÇO 1:2:8, PREPARO MECÂNICO COM BETONEIRA 400L, APLICADO MANUALMENTE EM FACES INTERNAS DE PAREDES, PARA AMBIENTE COM ÁREA MAIOR QUE 10M2, ESPESSURA DE 10MM, COM EXECUÇÃO DE TALISCAS. AF_06/2014","M2",6.4,null,null,null,""]
["S",3,"S",0,1,13,3,0,0,0,0,"","Serviço","Serviço","-","SINAPI",87273,"REVESTIMENTO CERÂMICO PARA PAREDES INTERNAS COM PLACAS TIPO ESMALTADA EXTRA DE DIMENSÕES 33X45 CM APLICADAS EM AMBIENTES DE ÁREA MAIOR QUE 5 M² NA ALTURA INTEIRA DAS PAREDES. AF_06/2014","M2",6.4,null,null,null,""]
[{"$f":"CHOOSE(1+LOG(1+2*(ORÇAMENTO.Nivel=\"Nível 1\")+4*(ORÇAMENTO.Nivel=\"Nível 2\")+8*(ORÇAMENTO.Nivel=\"Nível 3\")+16*(ORÇAMENTO.Nivel=\"Nível 4\")+32*(ORÇAMENTO.Nivel=\"Serviço\"),2),0,1,2,3,4,\"S\")","v":2},{"$f":"IF(OR(C254=\"s\",C254=0),OFFSET(B254,-1,0),C254)","v":2},{"$f":"IF(OFFSET(C254,-1,0)=\"L\",1,IF(OFFSET(C254,-1,0)=1,2,IF(OR(A254=\"s\",A254=0),\"S\",IF(AND(OFFSET(C254,-1,0)=2,A254=4),3,IF(AND(OR(OFFSET(C254,-1,0)=\"s\",OFFSET(C254,-1,0)=0),A254<>\"s\",A254>OFFSET(B254,-1,0)),OFFSET(B254,-1,0),A254)))))","v":2},{"$f":"IF(OR(C254=\"S\",C254=0),0,IF(ISERROR(K254),J254,SMALL(J254:K254,1)))","v":5},{"$f":"IF($C254=1,OFFSET(E254,-1,0)+1,OFFSET(E254,-1,0))","v":1},{"$f":"IF($C254=1,0,IF($C254=2,OFFSET(F254,-1,0)+1,OFFSET(F254,-1,0)))","v":14},{"$f":"IF(AND($C254<=2,$C254<>0),0,IF($C254=3,OFFSET(G254,-1,0)+1,OFFSET(G254,-1,0)))","v":0},{"$f":"IF(AND($C254<=3,$C254<>0),0,IF($C254=4,OFFSET(H254,-1,0)+1,OFFSET(H254,-1,0)))","v":0},{"$f":"IF(AND($C254<=4,$C254<>0),0,IF(AND($C254=\"S\",$W254>0),OFFSET(I254,-1,0)+1,OFFSET(I254,-1,0)))","v":0},40,5,"","Nível 2","Nível 2","-",null,null,"REVESTIMENTO DE PISO","-",null,null,null,null,""]
[3,3,3,2,1,14,1,0,0,4,2,"","Nível 3","Nível 3","-","SINAPI",null,"PISO DE CONCRETO - PARTE ELÉTRICA","-",null,null,null,null,""]
["S",3,"S",0,1,14,1,0,0,0,0,"","Serviço","Serviço","-","AGETOP",220102,"PISO CONCRETO DESEMPENADO ESPESSURA = 5 CM  1:2,5:3,5","m2    ",18.3,null,null,null,""]
[3,3,3,2,1,14,2,0,0,2,21,"","Nível 3","Nível 3","-",null,null,"ACESSIBILIDADE - PISO PODOTÁTIL","-",null,null,null,null,""]
["S",3,"S",0,1,14,2,0,0,0,0,"","Serviço","Serviço","-","AGETOP",221120,"PISO DE BORRACHA COLORIDO MODELO TÁTIL ( ALERTA OU DIRECIONAL) INCLUSO CONTRAPISO (1CI:3ARML) C/ E=2CM E NATA DE CIMENTO","m2    ",9.77,null,null,null,""]
[2,2,2,4,1,15,0,0,0,35,4,"","Nível 2","Nível 2","-",null,null,"FERRAGENS","-",null,null,null,null,""]
[3,3,3,3,1,15,1,0,0,3,7,"","Nível 3","Nível 3","-","SINAPI",null,"BANHEIROS","-",null,null,null,null,""]
["S",3,"S",0,1,15,1,0,0,0,0,"","Serviço","Serviço","-","AGETOP",230174,"BARRA DE APOIO EM AÇO INOX - 40 CM","un    ",6,null,null,null,""]
["S",3,"S",0,1,15,1,0,0,0,0,"","Serviço","Serviço","-","AGETOP",230176,"BARRA DE APOIO EM AÇO INOX - 80 CM ","un    ",6,null,null,null,""]
[2,2,2,6,1,16,0,0,0,31,6,"","Nível 2","Nível 2","-",null,null,"ADMINISTRAÇÃO","-",null,null,null,null,""]
[3,3,3,3,1,16,1,0,0,5,3,"","Nível 3","Nível 3","-",null,null,"MENSALISTAS","-",null,null,null,null,""]
["S",3,"S",0,1,16,1,0,0,0,0,"","Serviço","Serviço","-","SINAPI",90778,"ENGENHEIRO CIVIL DE OBRA PLENO COM ENCARGOS COMPLEMENTARES","H",176,null,null,null,"Referência: AGETOP - 250101"]
["S",3,"S",0,1,16,1,0,0,0,0,"","Serviço","Serviço","-","SINAPI",90776,"ENCARREGADO GERAL COM ENCARGOS COMPLEMENTARES","H",880,null,null,null,"Referência: AGETOP - 250103"]
[3,3,3,2,1,16,2,0,0,2,11,"","Nível 3","Nível 3","-",null,null,"LAUDO DE ESTANQUEIDADE","-",null,null,null,null,""]
["S",3,"S",0,1,16,2,0,0,0,0,"","Serviço","Serviço","-","SINAPI",90778,"ENGENHEIRO CIVIL DE OBRA PLENO COM ENCARGOS COMPLEMENTARES","H",16,null,null,null,"Referência: AGETOP - 250101"]
[2,2,2,16,1,17,0,0,0,25,16,"","Nível 2","Nível 2","-",null,null,"PINTURA","-",null,null,null,null,""]
[3,3,3,5,1,17,1,0,0,15,5,"","Nível 3","Nível 3","-","SINAPI",null,"COBERTURA DE QUADRA","-",null,null,null,null,""]
["S",3,"S",0,1,17,1,0,0,0,0,"","Serviço","Serviço","-","SINAPI",88489,"APLICAÇÃO MANUAL DE PINTURA COM TINTA LÁTEX ACRÍLICA EM PAREDES, DUAS DEMÃOS. AF_06/2014","M2",146.30000000000001,null,null,null,"Referência: AGETOP - 261001"]
["S",3,"S",0,1,17,1,0,0,0,0,"","Serviço","Serviço","-","SINAPI",41595,"PINTURA ACRILICA DE FAIXAS DE DEMARCACAO EM QUADRA POLIESPORTIVA, 5 CM DE LARGURA","M",196.57,null,null,null,"Referência: AGETOP - 261700"]
["S",3,"S",0,1,17,1,0,0,0,0,"","Serviço","Serviço","-","SINAPI","74245/1","PINTURA ACRILICA EM PISO CIMENTADO DUAS DEMAOS","M2",589.72,null,null,null,"Referência: AGETOP - 261703"]
["S",3,"S",0,1,17,1,0,0,0,0,"","Serviço","Serviço","-","SINAPI","74145/1","PINTURA ESMALTE FOSCO, DUAS DEMAOS, SOBRE SUPERFICIE METALICA, INCLUSO UMA DEMAO DE FUNDO ANTICORROSIVO. UTILIZACAO DE REVOLVER ( AR-COMPRIMIDO).","M2",48.4,null,null,null,"Referência: AGETOP - 261602"]
[{"$f":"CHOOSE(1+LOG(1+2*(ORÇAMENTO.Nivel=\"Nível 1\")+4*(ORÇAMENTO.Nivel=\"Nível 2\")+8*(ORÇAMENTO.Nivel=\"Nível 3\")+16*(ORÇAMENTO.Nivel=\"Nível 4\")+32*(ORÇAMENTO.Nivel=\"Serviço\"),2),0,1,2,3,4,\"S\")","v":3},{"$f":"IF(OR(C275=\"s\",C275=0),OFFSET(B275,-1,0),C275)","v":3},{"$f":"IF(OFFSET(C275,-1,0)=\"L\",1,IF(OFFSET(C275,-1,0)=1,2,IF(OR(A275=\"s\",A275=0),\"S\",IF(AND(OFFSET(C275,-1,0)=2,A275=4),3,IF(AND(OR(OFFSET(C275,-1,0)=\"s\",OFFSET(C275,-1,0)=0),A275<>\"s\",A275>OFFSET(B275,-1,0)),OFFSET(B275,-1,0),A275)))))","v":3},{"$f":"IF(OR(C275=\"S\",C275=0),0,IF(ISERROR(K275),J275,SMALL(J275:K275,1)))","v":3},{"$f":"IF($C275=1,OFFSET(E275,-1,0)+1,OFFSET(E275,-1,0))","v":1},{"$f":"IF($C275=1,0,IF($C275=2,OFFSET(F275,-1,0)+1,OFFSET(F275,-1,0)))","v":17},{"$f":"IF(AND($C275<=2,$C275<>0),0,IF($C275=3,OFFSET(G275,-1,0)+1,OFFSET(G275,-1,0)))","v":2},{"$f":"IF(AND($C275<=3,$C275<>0),0,IF($C275=4,OFFSET(H275,-1,0)+1,OFFSET(H275,-1,0)))","v":0},{"$f":"IF(AND($C275<=4,$C275<>0),0,IF(AND($C275=\"S\",$W275>0),OFFSET(I275,-1,0)+1,OFFSET(I275,-1,0)))","v":0},{"$f":"IF(OR($C275=\"S\",$C275=0),0,MATCH(0,OFFSET($D275,1,$C275,ROW($C$748)-ROW($C275)),0))","v":10},{"$f":"IF(OR($C275=\"S\",$C275=0),0,MATCH(OFFSET($D275,0,$C275)+1,OFFSET($D275,1,$C275,ROW($C$748)-ROW($C275)),0))","v":3},"","Nível 3","Nível 3","-","SINAPI",null,"MURO - LETREIRO","-",null,null,null,null,""]
["S",3,"S",0,1,17,2,0,0,0,0,"","Serviço","Serviço","-","AGETOP",261620,"LETREIRO MÉDIO A GRANDE PORTE EM PAREDE FEITO A PINCEL","m2    ",7.2,null,null,null,""]
["S",3,"S",0,1,17,2,0,0,0,0,"","Serviço","Serviço","-","SINAPI",88489,"APLICAÇÃO MANUAL DE PINTURA COM TINTA LÁTEX ACRÍLICA EM PAREDES, DUAS DEMÃOS. AF_06/2014","M2",2386.7399999999998,null,null,null,"Referência: AGETOP - 261001"]
[3,3,3,5,1,17,3,0,0,7,5,"","Nível 3","Nível 3","-","SINAPI",null,"PINTURA EXTERNA E ESQUADRIAS","-",null,null,null,null,""]
["S",3,"S",0,1,17,3,0,0,0,0,"","Serviço","Serviço","-","AGETOP",260105,"REMOCAO DE PINTURA ANTIGA A OLEO OU ESMALTE","m2    ",1047.17,null,null,null,""]
["S",3,"S",0,1,17,3,0,0,0,0,"","Serviço","Serviço","-","SINAPI",88489,"APLICAÇÃO MANUAL DE PINTURA COM TINTA LÁTEX ACRÍLICA EM PAREDES, DUAS DEMÃOS. AF_06/2014","M2",793.45,null,null,null,"Referência: AGETOP - 261001"]
["S",3,"S",0,1,17,3,0,0,0,0,"","Serviço","Serviço","-","SINAPI","74145/1","PINTURA ESMALTE FOSCO, DUAS DEMAOS, SOBRE SUPERFICIE METALICA, INCLUSO UMA DEMAO DE FUNDO ANTICORROSIVO. UTILIZACAO DE REVOLVER ( AR-COMPRIMIDO).","M2",28.65,null,null,null,"Referência: AGETOP - 261602"]
["S",3,"S",0,1,17,3,0,0,0,0,"","Serviço","Serviço","-","SINAPI","73924/3","PINTURA ESMALTE FOSCO, DUAS DEMAOS, SOBRE SUPERFICIE METALICA","M2",430.16999999999996,null,null,null,"Referência: AGETOP - 261503"]
[3,3,3,2,1,17,4,0,0,{"$f":"IF(OR($C283=\"S\",$C283=0),0,MATCH(0,OFFSET($D283,1,$C283,ROW($C$748)-ROW($C283)),0))","v":2},{"$f":"IF(OR($C283=\"S\",$C283=0),0,MATCH(OFFSET($D283,0,$C283)+1,OFFSET($D283,1,$C283,ROW($C$748)-ROW($C283)),0))","v":288},"","Nível 3","Nível 3","-","SINAPI",null,"ESTRUTURA METÁLICA","-",null,null,null,null,""]
["S",3,"S",0,1,17,4,0,0,0,0,"","Serviço","Serviço","-","AGETOP",261609,"PINTURA ESMALTE ALQUIDICO ESTR.METALICA 2 DEMAOS","m2    ",75.75,null,null,null,""]
[2,2,2,9,1,18,0,0,0,{"$f":"IF(OR($C285=\"S\",$C285=0),0,MATCH(0,OFFSET($D285,1,$C285,ROW($C$748)-ROW($C285)),0))","v":9},{"$f":"IF(OR($C285=\"S\",$C285=0),0,MATCH(OFFSET($D285,0,$C285)+1,OFFSET($D285,1,$C285,ROW($C$748)-ROW($C285)),0))","v":276},"","Nível 2","Nível 2","-",null,null,"DIVERSOS","-",null,null,null,null,""]
[3,3,3,2,1,18,1,0,0,8,2,"","Nível 3","Nível 3","-","SINAPI",null,"MURO","-",null,null,null,null,""]
["S",3,"S",0,1,18,1,0,0,0,0,"","Serviço","Serviço","-","AGETOP",270312,"MURO DE ALVENARIA TIJOLO FURADO 1/2 VEZ ( H=2,50M) COM FUNDAÇÃO - SEM REVESTIMENTOS (PADRÃO AGETOP)","m2    ",1193.3699999999999,null,null,null,""]
[3,3,3,2,1,18,2,0,0,6,2,"","Nível 3","Nível 3","-","SINAPI",null,"SECRETARIA","-",null,null,null,null,""]
["S",3,"S",0,1,18,2,0,0,0,0,"","Serviço","Serviço","-","AGETOP",271608,"BANCADA DE GRANITO C/ESPELHO","m2    ",1,null,null,null,""]
[3,3,3,2,1,18,3,0,0,4,2,"","Nível 3","Nível 3","-","SINAPI",null,"ANTIGA DESPENSA","-",null,null,null,null,""]
["S",3,"S",0,1,18,3,0,0,0,0,"","Serviço","Serviço","-","AGETOP",100501,"ELEMENTO VAZADO DE CONCRETO","m2    ",11.28,null,null,null,""]
[3,3,3,2,1,18,4,0,0,2,279,"","Nível 3","Nível 3","-","SINAPI",null,"REFORMA GERAL","-",null,null,null,null,""]
["S",3,"S",0,1,18,4,0,0,0,0,"","Serviço","Serviço","-","AGETOP",270501,"LIMPEZA FINAL DE OBRA - (OBRAS CIVIS)","m2    ",1200,null,null,null,""]
[1,1,1,50,2,0,0,0,0,454,50,"F","Nível 1","Nível 1","2.","SINAPI",null,"IMPLANTAÇÃO","-",null,null,null,null,""]
[2,2,2,2,2,1,0,0,0,49,2,"","Nível 2","Nível 2","-","SINAPI",null,"SERVIÇOS PRELIMINARES","-",null,null,null,null,""]
["S",2,"S",0,2,1,0,0,0,0,0,"","Serviço","Serviço","-","AGETOP",72080,"POSTE/TRAFO - CAMINHÃO MUNCK 12 TON. (MÍNIMO 4H/DIA)","H     ",4,null,null,null,""]
[2,2,2,13,2,2,0,0,0,47,13,"","Nível 2","Nível 2","-","SINAPI",null,"SERVIÇO EM TERRA","-",null,null,null,null,""]
[3,3,3,6,2,2,1,0,0,12,6,"","Nível 3","Nível 3","-","SINAPI",null,"IMPLANTAÇÃO COZINHA ","-",null,null,null,null,""]
["S",3,"S",0,2,2,1,0,0,0,0,"","Serviço","Serviço","-","SINAPI",79480,"ESCAVACAO MECANICA CAMPO ABERTO EM SOLO EXCETO ROCHA ATE 2,00M PROFUNDIDADE","M3",11.03,null,null,null,"Referência: AGETOP - 41004"]
["S",3,"S",0,2,2,1,0,0,0,0,"","Serviço","Serviço","-","SINAPI",72898,"CARGA E DESCARGA MECANIZADAS DE ENTULHO EM CAMINHAO BASCULANTE 6 M3","M3",11.03,null,null,null,"Referência: AGETOP - 41005"]
["S",3,"S",0,2,2,1,0,0,0,0,"","Serviço","Serviço","-","AGETOP",41012,"INDENIZAÇÃO DE JAZIDA","m3    ",11.03,null,null,null,""]
["S",3,"S",0,2,2,1,0,0,0,0,"","Serviço","Serviço","-","AGETOP",41006,"TRANSPORTE DE MATERIAL ESCAVADO M3.KM","m3km  ",110.3,null,null,null,""]
["S",3,"S",0,2,2,1,0,0,0,0,"","Serviço","Serviço","-","SINAPI","74005/2","COMPACTACAO MECANICA C/ CONTROLE DO GC>=95% DO PN (AREAS) (C/MONIVELADORA 140 HP E ROLO COMPRESSOR VIBRATORIO 80 HP)","M3",8.69,null,null,null,"Referência: AGETOP - 41008"]
[3,3,3,6,2,2,2,0,0,6,263,"","Nível 3","Nível 3","-","SINAPI",null,"IMPLANTAÇÃO VESTIÁRIO","-",null,null,null,null,""]
["S",3,"S",0,2,2,2,0,0,0,0,"","Serviço","Serviço","-","SINAPI",79480,"ESCAVACAO MECANICA CAMPO ABERTO EM SOLO EXCETO ROCHA ATE 2,00M PROFUNDIDADE","M3",15.98,null,null,null,"Referência: AGETOP - 41004"]
["S",3,"S",0,2,2,2,0,0,0,0,"","Serviço","Serviço","-","SINAPI",72898,"CARGA E DESCARGA MECANIZADAS DE ENTULHO EM CAMINHAO BASCULANTE 6 M3","M3",15.98,null,null,null,"Referência: AGETOP - 41005"]
["S",3,"S",0,2,2,2,0,0,0,0,"","Serviço","Serviço","-","AGETOP",41012,"INDENIZAÇÃO DE JAZIDA","m3    ",15.98,null,null,null,""]
["S",3,"S",0,2,2,2,0,0,0,0,"","Serviço","Serviço","-","AGETOP",41006,"TRANSPORTE DE MATERIAL ESCAVADO M3.KM","m3km  ",159.80000000000001,null,null,null,""]
["S",3,"S",0,2,2,2,0,0,0,0,"","Serviço","Serviço","-","SINAPI","74005/2","COMPACTACAO MECANICA C/ CONTROLE DO GC>=95% DO PN (AREAS) (C/MONIVELADORA 140 HP E ROLO COMPRESSOR VIBRATORIO 80 HP)","M3",12.79,null,null,null,"Referência: AGETOP - 41008"]
[2,2,2,16,2,3,0,0,0,34,16,"","Nível 2","Nível 2","-","SINAPI",null,"FUNDAÇÕES E SONDAGENS","-",null,null,null,null,""]
[3,3,3,9,2,3,1,0,0,15,9,"","Nível 3","Nível 3","-","SINAPI",null,"ESTACAS E BLOCOS","-",null,null,null,null,""]
["S",3,"S",0,2,3,1,0,0,0,0,"","Serviço","Serviço","-","AGETOP",51009,"FORMA TABUA PINHO P/FUNDACOES U=3V - (OBRAS CIVIS)","m2    ",22.4,null,null,null,""]
["S",3,"S",0,2,3,1,0,0,0,0,"","Serviço","Serviço","-","SINAPI",98230,"ESTACA BROCA DE CONCRETO, DIÂMETRO DE 30 CM, PROFUNDIDADE DE ATÉ 3 M, ESCAVAÇÃO MANUAL COM TRADO CONCHA, NÃO ARMADA. AF_03/2018","M",34,null,null,null,"Referência: AGETOP - 50302"]
["S",3,"S",0,2,3,1,0,0,0,0,"","Serviço","Serviço","-","SINAPI",96522,"ESCAVAÇÃO MANUAL PARA BLOCO DE COROAMENTO OU SAPATA, SEM PREVISÃO DE FÔRMA. AF_06/2017","M3",2.65,null,null,null,"Referência: AGETOP - 50901"]
["S",3,"S",0,2,3,1,0,0,0,0,"","Serviço","Serviço","-","SINAPI",94965,"CONCRETO FCK = 25MPA, TRAÇO 1:2,3:2,7 (CIMENTO/ AREIA MÉDIA/ BRITA 1)  - PREPARO MECÂNICO COM BETONEIRA 400 L. AF_07/2016","M3",5.84,null,null,null,"Referência: AGETOP - 51030"]
["S",3,"S",0,2,3,1,0,0,0,0,"","Serviço","Serviço","-","SINAPI","74157/4","LANCAMENTO/APLICACAO MANUAL DE CONCRETO EM FUNDACOES","M3",5.84,null,null,null,"Referência: AGETOP - 51026"]
["S",3,"S",0,2,3,1,0,0,{"$f":"IF(OR($C317=\"S\",$C317=0),0,MATCH(0,OFFSET($D317,1,$C317,ROW($C$748)-ROW($C317)),0))","v":0},{"$f":"IF(OR($C317=\"S\",$C317=0),0,MATCH(OFFSET($D317,0,$C317)+1,OFFSET($D317,1,$C317,ROW($C$748)-ROW($C317)),0))","v":0},"","Serviço","Serviço","-","SINAPI",96544,"ARMAÇÃO DE BLOCO, VIGA BALDRAME OU SAPATA UTILIZANDO AÇO CA-50 DE 6,3 MM - MONTAGEM. AF_06/2017","KG",51.5,null,null,null,"Referência: AGETOP - 52003"]
["S",3,"S",0,2,3,1,0,0,0,0,"","Serviço","Serviço","-","SINAPI",96545,"ARMAÇÃO DE BLOCO, VIGA BALDRAME OU SAPATA UTILIZANDO AÇO CA-50 DE 8 MM - MONTAGEM. AF_06/2017","KG",108.9,null,null,null,"Referência: AGETOP - 52004"]
["S",3,"S",0,2,3,1,0,0,0,0,"","Serviço","Serviço","-","SINAPI",96547,"ARMAÇÃO DE BLOCO, VIGA BALDRAME OU SAPATA UTILIZANDO AÇO CA-50 DE 12,5 MM - MONTAGEM. AF_06/2017","KG",291.8,null,null,null,""]
[3,3,3,6,2,3,2,0,0,6,247,"","Nível 3","Nível 3","-","SINAPI",null,"VIGA BALDRAME","-",null,null,null,null,""]
["S",3,"S",0,2,3,2,0,0,0,0,"","Serviço","Serviço","-","AGETOP",60191,"FORMA DE TABUA CINTA BALDRAME U=8 VEZES","m2    ",50.78,null,null,null,""]
["S",3,"S",0,2,3,2,0,0,0,0,"","Serviço","Serviço","-","SINAPI",94965,"CONCRETO FCK = 25MPA, TRAÇO 1:2,3:2,7 (CIMENTO/ AREIA MÉDIA/ BRITA 1)  - PREPARO MECÂNICO COM BETONEIRA 400 L. AF_07/2016","M3",3.05,null,null,null,"Referência: AGETOP - 51030"]
["S",3,"S",0,2,3,2,0,0,0,0,"","Serviço","Serviço","-","SINAPI","74157/4","LANCAMENTO/APLICACAO MANUAL DE CONCRETO EM FUNDACOES","M3",3.05,null,null,null,"Referência: AGETOP - 51026"]
["S",3,"S",0,2,3,2,0,0,0,0,"","Serviço","Serviço","-","SINAPI",96544,"ARMAÇÃO DE BLOCO, VIGA BALDRAME OU SAPATA UTILIZANDO AÇO CA-50 DE 6,3 MM - MONTAGEM. AF_06/2017","KG",96.7,null,null,null,"Referência: AGETOP - 52003"]
["S",3,"S",0,2,3,2,0,0,0,0,"","Serviço","Serviço","-","SINAPI",96545,"ARMAÇÃO DE BLOCO, VIGA BALDRAME OU SAPATA UTILIZANDO AÇO CA-50 DE 8 MM - MONTAGEM. AF_06/2017","KG",117.1,null,null,null,"Referência: AGETOP - 52004"]
[2,2,2,2,2,4,0,0,0,18,2,"","Nível 2","Nível 2","-","SINAPI",null,"ESQUADRIAS METÁLICAS","-",null,null,null,null,""]
["S",2,"S",0,2,4,0,0,0,0,0,"","Serviço","Serviço","-","AGETOP",180323,"GRELHA PADRÃO AGETOP DE FERRO CHATO COM BERÇO (ESPAÇAMENTO ENTRE FACES = 1,5CM - NBR 9050 ACESSIBILIDADE)","m2    ",20.2,null,null,null,""]
[2,2,2,3,2,5,0,0,0,16,3,"","Nível 2","Nível 2","-","SINAPI",null,"REVESTIMENTO DE PAREDE","-",null,null,null,null,""]
["S",2,"S",0,2,5,0,0,0,0,0,"","Serviço","Serviço","-","SINAPI",87904,"CHAPISCO APLICADO EM ALVENARIA (COM PRESENÇA DE VÃOS) E ESTRUTURAS DE CONCRETO DE FACHADA, COM COLHER DE PEDREIRO.  ARGAMASSA TRAÇO 1:3 COM PREPARO MANUAL. AF_06/2014","M2",146.30000000000001,null,null,null,"Referência: AGETOP - 200101"]
["S",2,"S",0,2,5,0,0,0,0,0,"","Serviço","Serviço","-","SINAPI",87547,"MASSA ÚNICA, PARA RECEBIMENTO DE PINTURA, EM ARGAMASSA TRAÇO 1:2:8, PREPARO MECÂNICO COM BETONEIRA 400L, APLICADA MANUALMENTE EM FACES INTERNAS DE PAREDES, ESPESSURA DE 10MM, COM EXECUÇÃO DE TALISCAS. AF_06/2014","M2",146.30000000000001,null,null,null,"Referência: AGETOP - 200500"]
[2,2,2,5,2,6,0,0,0,13,5,"","Nível 2","Nível 2","-","SINAPI",null,"REVESTIMENTO DE PISO","-",null,null,null,null,""]
[3,3,3,2,2,6,1,0,0,4,2,"","Nível 3","Nível 3","-","SINAPI",null,"COBERTURA DE QUADRA","-",null,null,null,null,""]
["S",3,"S",0,2,6,1,0,0,0,0,"","Serviço","Serviço","-","AGETOP",220061,"PISO LAMINADO COM CONCRETO USINADO 20MPA E=7 CM  ","m2    ",589.72,null,null,null,""]
[3,3,3,2,2,6,2,0,0,2,233,"","Nível 3","Nível 3","-","SINAPI",null,"COZINHA","-",null,null,null,null,""]
["S",3,"S",0,2,6,2,0,0,0,0,"","Serviço","Serviço","-","AGETOP",220102,"PISO CONCRETO DESEMPENADO ESPESSURA = 5 CM  1:2,5:3,5","m2    ",222.11,null,null,null,""]
[2,2,2,5,2,7,0,0,0,8,5,"","Nível 2","Nível 2","-","SINAPI",null,"PINTURA","-",null,null,null,null,""]
["S",2,"S",0,2,7,0,0,0,0,0,"","Serviço","Serviço","-","SINAPI",88489,"APLICAÇÃO MANUAL DE PINTURA COM TINTA LÁTEX ACRÍLICA EM PAREDES, DUAS DEMÃOS. AF_06/2014","M2",146.30000000000001,null,null,null,"Referência: AGETOP - 261001"]
["S",2,"S",0,2,7,0,0,0,0,0,"","Serviço","Serviço","-","SINAPI",41595,"PINTURA ACRILICA DE FAIXAS DE DEMARCACAO EM QUADRA POLIESPORTIVA, 5 CM DE LARGURA","M",196.57,null,null,null,"Referência: AGETOP - 261700"]
["S",2,"S",0,2,7,0,0,0,0,0,"","Serviço","Serviço","-","SINAPI","74245/1","PINTURA ACRILICA EM PISO CIMENTADO DUAS DEMAOS","M2",589.72,null,null,null,"Referência: AGETOP - 261703"]
["S",2,"S",0,2,7,0,0,0,0,0,"","Serviço","Serviço","-","SINAPI","74145/1","PINTURA ESMALTE FOSCO, DUAS DEMAOS, SOBRE SUPERFICIE METALICA, INCLUSO UMA DEMAO DE FUNDO ANTICORROSIVO. UTILIZACAO DE REVOLVER ( AR-COMPRIMIDO).","M2",48.4,null,null,null,"Referência: AGETOP - 261602"]
[2,2,2,3,2,8,0,0,0,3,69,"","Nível 2","Nível 2","-","SINAPI",null,"DIVERSOS","-",null,null,null,null,""]
["S",2,"S",0,2,8,0,0,0,0,0,"","Serviço","Serviço","-","COMPOSIÇÃO","COMP 031_SEE","MURETA P/ QUAD. POLIESP. ALV. DE TIJ. FURADO - 1/2 VEZ - C/ CHP. E PEDRISCO - H=0,80 M","M",91.4375,null,null,null,""]
["S",2,"S",0,2,8,0,0,0,{"$f":"IF(OR($C343=\"S\",$C343=0),0,MATCH(0,OFFSET($D343,1,$C343,ROW($C$748)-ROW($C343)),0))","v":0},{"$f":"IF(OR($C343=\"S\",$C343=0),0,MATCH(OFFSET($D343,0,$C343)+1,OFFSET($D343,1,$C343,ROW($C$748)-ROW($C343)),0))","v":0},"","Serviço","Serviço","-","AGETOP",271417,"CANALETA CONCRETO DESEMPENADO 5 CM PD.AGETOP","m     ",60.5,null,null,null,""]
[1,1,1,68,3,0,0,0,0,404,68,"F","Nível 1","Nível 1","3.","SINAPI",null,"COBERTURA DE QUADRA EM ARCO MODELO 3","-",null,null,null,null,""]
[2,2,2,2,3,1,0,0,0,67,2,"","Nível 2","Nível 2","-","SINAPI",null,"SERVIÇOS PRELIMINARES","-",null,null,null,null,""]
["S",2,"S",0,3,1,0,0,0,0,0,"","Serviço","Serviço","-","AGETOP",20701,"LOCAÇÃO DA OBRA, EXECUÇÃO DE GABARITO SEM REAPROVEITAMENTO, INCLUSO PINTURA (FACE INTERNA DO RIPÃO 15CM) E PIQUETE COM TESTEMUNHA","m2    ",30,null,null,null,""]
[2,2,2,10,3,2,0,0,0,65,10,"","Nível 2","Nível 2","-","AGETOP",null,"FUNDAÇÕES E SONDAGENS","-",null,null,null,null,""]
[3,3,3,9,3,2,1,0,0,9,216,"","Nível 3","Nível 3","-","SINAPI",null,"ESTACAS E BLOCOS","-",null,null,null,null,""]
["S",3,"S",0,3,2,1,0,0,0,0,"","Serviço","Serviço","-","SINAPI",98230,"ESTACA BROCA DE CONCRETO, DIÂMETRO DE 30 CM, PROFUNDIDADE DE ATÉ 3 M, ESCAVAÇÃO MANUAL COM TRADO CONCHA, NÃO ARMADA. AF_03/2018","M",120,null,null,null,"Referência: AGETOP - 50302"]
["S",3,"S",0,3,2,1,0,0,0,0,"","Serviço","Serviço","-","SINAPI",96522,"ESCAVAÇÃO MANUAL PARA BLOCO DE COROAMENTO OU SAPATA, SEM PREVISÃO DE FÔRMA. AF_06/2017","M3",5.4,null,null,null,"Referência: AGETOP - 50901"]
["S",3,"S",0,3,2,1,0,0,0,0,"","Serviço","Serviço","-","AGETOP",50902,"APILOAMENTO (BLOCOS/SAPATAS)","m2    ",10.8,null,null,null,""]
["S",3,"S",0,3,2,1,0,0,0,0,"","Serviço","Serviço","-","SINAPI",94963,"CONCRETO FCK = 15MPA, TRAÇO 1:3,4:3,5 (CIMENTO/ AREIA MÉDIA/ BRITA 1)  - PREPARO MECÂNICO COM BETONEIRA 400 L. AF_07/2016","M3",11.64,null,null,null,""]
["S",3,"S",0,3,2,1,0,0,0,0,"","Serviço","Serviço","-","SINAPI","74157/4","LANCAMENTO/APLICACAO MANUAL DE CONCRETO EM FUNDACOES","M3",11.64,null,null,null,"Referência: AGETOP - 51026"]
["S",3,"S",0,3,2,1,0,0,0,0,"","Serviço","Serviço","-","SINAPI",96544,"ARMAÇÃO DE BLOCO, VIGA BALDRAME OU SAPATA UTILIZANDO AÇO CA-50 DE 6,3 MM - MONTAGEM. AF_06/2017","KG",128.4,null,null,null,"Referência: AGETOP - 52003"]
["S",3,"S",0,3,2,1,0,0,0,0,"","Serviço","Serviço","-","SINAPI",96545,"ARMAÇÃO DE BLOCO, VIGA BALDRAME OU SAPATA UTILIZANDO AÇO CA-50 DE 8 MM - MONTAGEM. AF_06/2017","KG",196.6,null,null,null,"Referência: AGETOP - 52004"]
["S",3,"S",0,3,2,1,0,0,0,0,"","Serviço","Serviço","-","SINAPI",96543,"ARMAÇÃO DE BLOCO, VIGA BALDRAME E SAPATA UTILIZANDO AÇO CA-60 DE 5 MM - MONTAGEM. AF_06/2017","KG",66.7,null,null,null,"Referência: AGETOP - 52014"]
[2,2,2,9,3,3,0,0,0,55,9,"","Nível 2","Nível 2","-","AGETOP",null,"ESTRUTURA","-",null,null,null,null,""]
[3,3,3,8,3,3,1,0,0,8,206,"","Nível 3","Nível 3","-","AGETOP",null,"PILARES","-",null,null,null,null,""]
["S",3,"S",0,3,3,1,0,0,0,0,"","Serviço","Serviço","-","SINAPI",92426,"MONTAGEM E DESMONTAGEM DE FÔRMA DE PILARES RETANGULARES E ESTRUTURAS SIMILARES COM ÁREA MÉDIA DAS SEÇÕES MENOR OU IGUAL A 0,25 M², PÉ-DIREITO SIMPLES, EM CHAPA DE MADEIRA COMPENSADA RESINADA, 8 UTILIZAÇÕES. AF_12/2015","M2",145.57,null,null,null,""]
["S",3,"S",0,3,3,1,0,0,0,0,"","Serviço","Serviço","-","AGETOP",60191,"FORMA DE TABUA CINTA BALDRAME U=8 VEZES","m2    ",24.84,null,null,null,""]
["S",3,"S",0,3,3,1,0,0,0,0,"","Serviço","Serviço","-","SINAPI",94964,"CONCRETO FCK = 20MPA, TRAÇO 1:2,7:3 (CIMENTO/ AREIA MÉDIA/ BRITA 1)  - PREPARO MECÂNICO COM BETONEIRA 400 L. AF_07/2016","M3",11.33,null,null,null,""]
["S",3,"S",0,3,3,1,0,0,0,0,"","Serviço","Serviço","-","SINAPI",92873,"LANÇAMENTO COM USO DE BALDES, ADENSAMENTO E ACABAMENTO DE CONCRETO EM ESTRUTURAS. AF_12/2015","M3",11.33,null,null,null,"Referência: AGETOP - 60801"]
[{"$f":"CHOOSE(1+LOG(1+2*(ORÇAMENTO.Nivel=\"Nível 1\")+4*(ORÇAMENTO.Nivel=\"Nível 2\")+8*(ORÇAMENTO.Nivel=\"Nível 3\")+16*(ORÇAMENTO.Nivel=\"Nível 4\")+32*(ORÇAMENTO.Nivel=\"Serviço\"),2),0,1,2,3,4,\"S\")","v":"S"},3,"S",0,3,3,1,0,{"$f":"IF(AND($C363<=4,$C363<>0),0,IF(AND($C363=\"S\",$W363>0),OFFSET(I363,-1,0)+1,OFFSET(I363,-1,0)))","v":0},0,0,"","Serviço","Serviço","-","SINAPI",92776,"ARMAÇÃO DE PILAR OU VIGA DE UMA ESTRUTURA CONVENCIONAL DE CONCRETO ARMADO EM UMA EDIFICAÇÃO TÉRREA OU SOBRADO UTILIZANDO AÇO CA-50 DE 6,3 MM - MONTAGEM. AF_12/2015","KG",106,null,null,null,"Referência: AGETOP - 60303"]
["S",3,"S",0,3,3,1,0,0,0,0,"","Serviço","Serviço","-","SINAPI",92778,"ARMAÇÃO DE PILAR OU VIGA DE UMA ESTRUTURA CONVENCIONAL DE CONCRETO ARMADO EM UMA EDIFICAÇÃO TÉRREA OU SOBRADO UTILIZANDO AÇO CA-50 DE 10,0 MM - MONTAGEM. AF_12/2015","KG",962.1,null,null,null,"Referência: AGETOP - 60305"]
["S",3,"S",0,3,3,1,0,0,0,0,"","Serviço","Serviço","-","SINAPI",92775,"ARMAÇÃO DE PILAR OU VIGA DE UMA ESTRUTURA CONVENCIONAL DE CONCRETO ARMADO EM UMA EDIFICAÇÃO TÉRREA OU SOBRADO UTILIZANDO AÇO CA-60 DE 5,0 MM - MONTAGEM. AF_12/2015","KG",220.8,null,null,null,"Referência: AGETOP - 60314"]
[2,2,2,35,{"$f":"IF($C366=1,OFFSET(E366,-1,0)+1,OFFSET(E366,-1,0))","v":3},{"$f":"IF($C366=1,0,IF($C366=2,OFFSET(F366,-1,0)+1,OFFSET(F366,-1,0)))","v":4},{"$f":"IF(AND($C366<=2,$C366<>0),0,IF($C366=3,OFFSET(G366,-1,0)+1,OFFSET(G366,-1,0)))","v":0},{"$f":"IF(AND($C366<=3,$C366<>0),0,IF($C366=4,OFFSET(H366,-1,0)+1,OFFSET(H366,-1,0)))","v":0},0,46,35,"","Nível 2","Nível 2","-","SINAPI",null,"INSTALAÇÕES ELÉTRICAS","-",null,null,null,null,""]
["S",2,"S",0,3,4,0,0,0,0,0,"","Serviço","Serviço","-","AGETOP",70351,"BRACADEIRA METALICA TIPO \"U\" DIAM. 3/4\"","Un    ",55,null,null,null,""]
["S",2,"S",0,3,4,0,0,0,0,0,"","Serviço","Serviço","-","AGETOP",70352,"BRACADEIRA METALICA TIPO \"U\" DIAM. 1\"","Un    ",3,null,null,null,""]
["S",2,"S",0,3,4,0,0,0,0,0,"","Serviço","Serviço","-","AGETOP",70354,"BRACADEIRA METALICA TIPO \"U\" DIAM. 1.1/2\"","Un    ",1,null,null,null,""]
["S",2,"S",0,3,4,0,0,0,0,0,"","Serviço","Serviço","-","AGETOP",70421,"BUCHA E ARRUELA METALICA DIAM. 3/4\"","PR    ",14,null,null,null,""]
["S",2,"S",0,3,4,0,0,0,0,0,"","Serviço","Serviço","-","AGETOP",70422,"BUCHA E ARRUELA METALICA DIAM. 1\"","PR    ",2,null,null,null,""]
["S",2,"S",0,3,4,0,0,0,0,0,"","Serviço","Serviço","-","AGETOP",70424,"BUCHA E ARRUELA METALICA DIAM. 1.1/2\"","PR    ",2,null,null,null,""]
["S",2,"S",0,3,4,0,0,0,0,0,"","Serviço","Serviço","-","SINAPI",96971,"CORDOALHA DE COBRE NU 16 MM², NÃO ENTERRADA, COM ISOLADOR - FORNECIMENTO E INSTALAÇÃO. AF_12/2017","M",8,null,null,null,"Referência: AGETOP - 70541"]
["S",2,"S",0,3,4,0,0,0,0,0,"","Serviço","Serviço","-","AGETOP",70561,"CABO ISOLADO PP 3 X 2,5 MM2","M     ",5,null,null,null,""]
["S",2,"S",0,3,4,0,0,0,0,0,"","Serviço","Serviço","-","SINAPI",91927,"CABO DE COBRE FLEXÍVEL ISOLADO, 2,5 MM², ANTI-CHAMA 0,6/1,0 KV, PARA CIRCUITOS TERMINAIS - FORNECIMENTO E INSTALAÇÃO. AF_12/2015","M",420,null,null,null,"Referência: AGETOP - 70581"]
["S",2,"S",0,3,4,0,0,0,0,0,"","Serviço","Serviço","-","SINAPI",91931,"CABO DE COBRE FLEXÍVEL ISOLADO, 6 MM², ANTI-CHAMA 0,6/1,0 KV, PARA CIRCUITOS TERMINAIS - FORNECIMENTO E INSTALAÇÃO. AF_12/2015","M",12,null,null,null,"Referência: AGETOP - 70583"]
["S",2,"S",0,3,4,0,0,0,0,0,"","Serviço","Serviço","-","SINAPI",97886,"CAIXA ENTERRADA ELÉTRICA RETANGULAR, EM ALVENARIA COM TIJOLOS CERÂMICOS MACIÇOS, FUNDO COM BRITA, DIMENSÕES INTERNAS: 0,3X0,3X0,3 M. AF_05/2018","UN",1,null,null,null,""]
["S",2,"S",0,3,4,0,0,0,0,0,"","Serviço","Serviço","-","SINAPI",95801,"CONDULETE DE ALUMÍNIO, TIPO X, PARA ELETRODUTO DE AÇO GALVANIZADO DN 20 MM (3/4''), APARENTE - FORNECIMENTO E INSTALAÇÃO. AF_11/2016_P","UN",16,null,null,null,"Referência: AGETOP - 70929"]
["S",2,"S",0,3,4,0,0,0,0,0,"","Serviço","Serviço","-","AGETOP",70930,"CONDULETE METÁLICO - ADAPTADOR DE SAÍDA 3/4\" ","un    ",16,null,null,null,""]
["S",2,"S",0,3,4,0,0,0,0,0,"","Serviço","Serviço","-","SINAPI",93018,"CURVA 90 GRAUS PARA ELETRODUTO, PVC, ROSCÁVEL, DN 50 MM (1 1/2\") - FORNECIMENTO E INSTALAÇÃO. AF_12/2015","UN",1,null,null,null,""]
["S",2,"S",0,3,4,0,0,0,0,0,"","Serviço","Serviço","-","SINAPI",93655,"DISJUNTOR MONOPOLAR TIPO DIN, CORRENTE NOMINAL DE 20A - FORNECIMENTO E INSTALAÇÃO. AF_04/2016","UN",5,null,null,null,""]
["S",2,"S",0,3,4,0,0,0,0,0,"","Serviço","Serviço","-","SINAPI",93671,"DISJUNTOR TRIPOLAR TIPO DIN, CORRENTE NOMINAL DE 32A - FORNECIMENTO E INSTALAÇÃO. AF_04/2016","UN",1,null,null,null,"Referência: AGETOP - 71173"]
["S",2,"S",0,3,4,0,0,0,0,0,"","Serviço","Serviço","-","AGETOP",71184,"DISPOSITIVO DE PROTEÇÃO CONTRA SURTOS (D.P.S.) 275V DE 8 A 40KA","Un    ",3,null,null,null,""]
["S",2,"S",0,3,4,0,0,0,0,0,"","Serviço","Serviço","-","SINAPI",91834,"ELETRODUTO FLEXÍVEL CORRUGADO, PVC, DN 25 MM (3/4\"), PARA CIRCUITOS TERMINAIS, INSTALADO EM FORRO - FORNECIMENTO E INSTALAÇÃO. AF_12/2015","M",80,null,null,null,"Referência: AGETOP - 71194"]
["S",2,"S",0,3,4,0,0,0,0,0,"","Serviço","Serviço","-","SINAPI",95749,"ELETRODUTO DE AÇO GALVANIZADO, CLASSE LEVE, DN 20 MM (3/4\u0092\u0092), APARENTE, INSTALADO EM PAREDE - FORNECIMENTO E INSTALAÇÃO. AF_11/2016_P","M",30,null,null,null,"Referência: AGETOP - 71211"]
["S",2,"S",0,3,4,0,0,0,0,0,"","Serviço","Serviço","-","SINAPI",95750,"ELETRODUTO DE AÇO GALVANIZADO, CLASSE LEVE, DN 25 MM (1\u0092\u0092), APARENTE, INSTALADO EM PAREDE - FORNECIMENTO E INSTALAÇÃO. AF_11/2016_P","M",5,null,null,null,""]
["S",2,"S",0,3,4,0,0,0,0,0,"","Serviço","Serviço","-","SINAPI",93008,"ELETRODUTO RÍGIDO ROSCÁVEL, PVC, DN 50 MM (1 1/2\") - FORNECIMENTO E INSTALAÇÃO. AF_12/2015","M",3,null,null,null,""]
["S",2,"S",0,3,4,0,0,0,0,0,"","Serviço","Serviço","-","AGETOP",71321,"FITA DE AUTO FUSAO, ROLO E 10,00 MM","Un    ",1,null,null,null,""]
["S",2,"S",0,3,4,0,0,0,0,0,"","Serviço","Serviço","-","AGETOP",71331,"FITA ISOLANTE, ROLO DE 20,00 M","Un    ",2,null,null,null,""]
["S",2,"S",0,3,4,0,0,0,0,0,"","Serviço","Serviço","-","AGETOP",71381,"HASTE REV.COBRE(COPPERWELD)  5/8\" X 3,00 M C/CONECTOR","Un    ",3,null,null,null,""]
["S",2,"S",0,3,4,0,0,0,0,0,"","Serviço","Serviço","-","SINAPI",72278,"LAMPADA VAPOR METALICO 400W - FORNECIMENTO E INSTALACAO","UN",12,null,null,null,"Referência: AGETOP - 71527"]
["S",2,"S",0,3,4,0,0,0,0,0,"","Serviço","Serviço","-","AGETOP",71660,"LUMINÁRIA CIRCULAR COM VIDRO PARA QUADRA ATÉ 400 W - BASE E-40","Un    ",12,null,null,null,""]
["S",2,"S",0,3,4,0,0,0,0,0,"","Serviço","Serviço","-","SINAPI",91875,"LUVA PARA ELETRODUTO, PVC, ROSCÁVEL, DN 25 MM (3/4\"), PARA CIRCUITOS TERMINAIS, INSTALADA EM FORRO - FORNECIMENTO E INSTALAÇÃO. AF_12/2015","UN",12,null,null,null,""]
["S",2,"S",0,3,4,0,0,0,0,0,"","Serviço","Serviço","-","SINAPI",95757,"LUVA DE EMENDA PARA ELETRODUTO, AÇO GALVANIZADO, DN 20 MM (3/4''), APARENTE, INSTALADA EM PAREDE - FORNECIMENTO E INSTALAÇÃO. AF_11/2016_P","UN",10,null,null,null,"Referência: AGETOP - 71701"]
["S",2,"S",0,3,4,0,0,0,0,0,"","Serviço","Serviço","-","SINAPI",95758,"LUVA DE EMENDA PARA ELETRODUTO, AÇO GALVANIZADO, DN 25 MM (1''), APARENTE, INSTALADA EM PAREDE - FORNECIMENTO E INSTALAÇÃO. AF_11/2016_P","UN",3,null,null,null,"Referência: AGETOP - 71702"]
["S",2,"S",0,3,4,0,0,0,0,0,"","Serviço","Serviço","-","SINAPI",93013,"LUVA PARA ELETRODUTO, PVC, ROSCÁVEL, DN 50 MM (1 1/2\") - FORNECIMENTO E INSTALAÇÃO. AF_12/2015","UN",1,null,null,null,"Referência: AGETOP - 71744"]
["S",2,"S",0,3,4,0,0,0,0,0,"","Serviço","Serviço","-","SINAPI",83463,"QUADRO DE DISTRIBUICAO DE ENERGIA EM CHAPA DE ACO GALVANIZADO, PARA 12 DISJUNTORES TERMOMAGNETICOS MONOPOLARES, COM BARRAMENTO TRIFASICO E NEUTRO - FORNECIMENTO E INSTALACAO","UN",1,null,null,null,""]
["S",2,"S",0,3,4,0,0,0,0,0,"","Serviço","Serviço","-","AGETOP",72238,"REATOR AFP USO EXTERNO V.METALICO 400 W","Un    ",12,null,null,null,""]
["S",2,"S",0,3,4,0,0,0,0,0,"","Serviço","Serviço","-","AGETOP",72395,"TAMPA CEGA PARA CONDULETE METÁLICO","Un    ",16,null,null,null,""]
["S",2,"S",0,3,4,0,0,0,0,0,"","Serviço","Serviço","-","SINAPI",92000,"TOMADA BAIXA DE EMBUTIR (1 MÓDULO), 2P+T 10 A, INCLUINDO SUPORTE E PLACA - FORNECIMENTO E INSTALAÇÃO. AF_12/2015","UN",4,null,null,null,"Referência: AGETOP - 72578"]
[2,2,2,2,{"$f":"IF($C401=1,OFFSET(E401,-1,0)+1,OFFSET(E401,-1,0))","v":3},{"$f":"IF($C401=1,0,IF($C401=2,OFFSET(F401,-1,0)+1,OFFSET(F401,-1,0)))","v":5},{"$f":"IF(AND($C401<=2,$C401<>0),0,IF($C401=3,OFFSET(G401,-1,0)+1,OFFSET(G401,-1,0)))","v":0},{"$f":"IF(AND($C401<=3,$C401<>0),0,IF($C401=4,OFFSET(H401,-1,0)+1,OFFSET(H401,-1,0)))","v":0},0,11,2,"","Nível 2","Nível 2","-",null,null,"IMPERMEABILIZAÇÃO","-",null,null,null,null,""]
["S",2,"S",0,3,5,0,0,0,0,0,"","Serviço","Serviço","-","SINAPI",98562,"IMPERMEABILIZAÇÃO DE FLOREIRA OU VIGA BALDRAME COM ARGAMASSA DE CIMENTO E AREIA, COM ADITIVO IMPERMEABILIZANTE, E = 2 CM. AF_06/2018","M2",24.84,null,null,null,"Referência: AGETOP - 120902"]
[2,2,2,2,3,6,0,0,0,9,2,"","Nível 2","Nível 2","-",null,null,"ESTRUTURAS METÁLICAS","-",null,null,null,null,""]
["S",2,"S",0,3,6,0,0,0,0,0,"","Serviço","Serviço","-","AGETOP",150103,"ESTRUTURA METÁLICA CONVENCIONAL EM AÇO DO TIPO USI SAC-300 COM FUNDO ANTICORROSIVO","Kg    ",7145,null,null,null,""]
[2,2,2,2,3,7,0,0,0,7,2,"","Nível 2","Nível 2","-",null,null,"COBERTURAS","-",null,null,null,null,""]
["S",2,"S",0,3,7,0,0,0,0,0,"","Serviço","Serviço","-","AGETOP",160969,"COBERTURA COM TELHA CHAPA GALVANIZADA TRAPEZOIDAL 0,43 MM COM ACESSÓRIOS","m2    ",817,null,null,null,""]
[2,{"$f":"IF(OR(C407=\"s\",C407=0),OFFSET(B407,-1,0),C407)","v":2},{"$f":"IF(OFFSET(C407,-1,0)=\"L\",1,IF(OFFSET(C407,-1,0)=1,2,IF(OR(A407=\"s\",A407=0),\"S\",IF(AND(OFFSET(C407,-1,0)=2,A407=4),3,IF(AND(OR(OFFSET(C407,-1,0)=\"s\",OFFSET(C407,-1,0)=0),A407<>\"s\",A407>OFFSET(B407,-1,0)),OFFSET(B407,-1,0),A407)))))","v":2},{"$f":"IF(OR(C407=\"S\",C407=0),0,IF(ISERROR(K407),J407,SMALL(J407:K407,1)))","v":3},3,8,0,0,0,5,3,"","Nível 2","Nível 2","-",null,null,"PINTURA","-",null,null,null,null,""]
[3,3,3,2,3,8,1,0,0,2,156,"","Nível 3","Nível 3","-","AGETOP",null,"ESTRUTURA METÁLICA","-",null,null,null,null,""]
["S",3,"S",0,3,8,1,0,0,0,0,"","Serviço","Serviço","-","SINAPI","74145/1","PINTURA ESMALTE FOSCO, DUAS DEMAOS, SOBRE SUPERFICIE METALICA, INCLUSO UMA DEMAO DE FUNDO ANTICORROSIVO. UTILIZACAO DE REVOLVER ( AR-COMPRIMIDO).","M2",294,null,null,null,"Referência: AGETOP - 261602"]
[2,2,2,2,3,9,0,0,0,2,120,"","Nível 2","Nível 2","-",null,null,"DIVERSOS","-",null,null,null,null,""]
["S",2,"S",0,3,9,0,0,0,0,0,"","Serviço","Serviço","-","AGETOP",270501,"LIMPEZA FINAL DE OBRA - (OBRAS CIVIS)","m2    ",589.72,null,null,null,""]
[1,1,1,164,4,0,0,0,0,336,164,"F","Nível 1","Nível 1","4.","SINAPI",null,"COZINHA SEDUC OPÇÃO 2","-",null,null,null,null,""]
[2,2,2,2,4,1,0,0,0,163,2,"","Nível 2","Nível 2","-","SINAPI",null,"SERVIÇOS PRELIMINARES","-",null,null,null,null,""]
["S",2,"S",0,4,1,0,0,0,0,0,"","Serviço","Serviço","-","AGETOP",20701,"LOCAÇÃO DA OBRA, EXECUÇÃO DE GABARITO SEM REAPROVEITAMENTO, INCLUSO PINTURA (FACE INTERNA DO RIPÃO 15CM) E PIQUETE COM TESTEMUNHA","m2    ",56.76,null,null,null,""]
[2,2,2,2,4,2,0,0,0,161,2,"","Nível 2","Nível 2","-","AGETOP",null,"TRANSPORTES","-",null,null,null,null,""]
["S",2,"S",0,4,2,0,0,0,0,0,"","Serviço","Serviço","-","SINAPI",72900,"TRANSPORTE DE ENTULHO COM CAMINHAO BASCULANTE 6 M3, RODOVIA PAVIMENTADA, DMT 0,5 A 1,0 KM","M3",7,null,null,null,""]
[2,2,2,3,4,3,0,0,0,159,3,"","Nível 2","Nível 2","-","AGETOP",null,"SERVIÇO EM TERRA","-",null,null,null,null,""]
["S",2,"S",0,4,3,0,0,0,0,0,"","Serviço","Serviço","-","SINAPI",79480,"ESCAVACAO MECANICA CAMPO ABERTO EM SOLO EXCETO ROCHA ATE 2,00M PROFUNDIDADE","M3",139.75,null,null,null,"Referência: AGETOP - 41004"]
["S",2,"S",0,4,3,0,0,0,0,0,"","Serviço","Serviço","-","AGETOP",41002,"APILOAMENTO","m2    ",140.75,null,null,null,""]
[2,2,2,5,4,4,0,0,0,156,5,"","Nível 2","Nível 2","-","AGETOP",null,"FUNDAÇÕES E SONDAGENS","-",null,null,null,null,""]
["S",2,"S",0,4,4,0,0,0,0,0,"","Serviço","Serviço","-","AGETOP",50901,"ESCAVACAO MANUAL DE VALAS (SAPATAS/BLOCOS)","m3    ",5,null,null,null,""]
["S",2,"S",0,4,4,0,0,0,0,0,"","Serviço","Serviço","-","SINAPI",94970,"CONCRETO FCK = 20MPA, TRAÇO 1:2,7:3 (CIMENTO/ AREIA MÉDIA/ BRITA 1)  - PREPARO MECÂNICO COM BETONEIRA 600 L. AF_07/2016","M3",1.92,null,null,null,""]
["S",2,"S",0,4,4,0,0,0,0,0,"","Serviço","Serviço","-","SINAPI","74157/4","LANCAMENTO/APLICACAO MANUAL DE CONCRETO EM FUNDACOES","M3",1.92,null,null,null,"Referência: AGETOP - 51026"]
["S",2,"S",0,4,4,0,0,0,0,0,"","Serviço","Serviço","-","SINAPI",96545,"ARMAÇÃO DE BLOCO, VIGA BALDRAME OU SAPATA UTILIZANDO AÇO CA-50 DE 8 MM - MONTAGEM. AF_06/2017","KG",67,null,null,null,"Referência: AGETOP - 52004"]
[2,2,2,10,4,5,0,0,0,151,10,"","Nível 2","Nível 2","-","AGETOP",null,"ESTRUTURA","-",null,null,null,null,""]
["S",2,"S",0,4,5,0,0,0,0,0,"","Serviço","Serviço","-","SINAPI",92426,"MONTAGEM E DESMONTAGEM DE FÔRMA DE PILARES RETANGULARES E ESTRUTURAS SIMILARES COM ÁREA MÉDIA DAS SEÇÕES MENOR OU IGUAL A 0,25 M², PÉ-DIREITO SIMPLES, EM CHAPA DE MADEIRA COMPENSADA RESINADA, 8 UTILIZAÇÕES. AF_12/2015","M2",92.24,null,null,null,""]
["S",2,"S",0,4,5,0,0,0,0,0,"","Serviço","Serviço","-","AGETOP",60191,"FORMA DE TABUA CINTA BALDRAME U=8 VEZES","m2    ",51.56,null,null,null,""]
["S",2,"S",0,4,5,0,0,0,0,0,"","Serviço","Serviço","-","AGETOP",61101,"FORRO EM LAJE PRE-MOLDADA INC.CAPEAMENTO/FERR.DISTRIB./ESCORAMENTO E FORMA/DESFORMA","m2    ",40.75,null,null,null,""]
["S",2,"S",0,4,5,0,0,0,0,0,"","Serviço","Serviço","-","SINAPI",94964,"CONCRETO FCK = 20MPA, TRAÇO 1:2,7:3 (CIMENTO/ AREIA MÉDIA/ BRITA 1)  - PREPARO MECÂNICO COM BETONEIRA 400 L. AF_07/2016","M3",4.51,null,null,null,""]
["S",2,"S",0,4,5,0,0,0,0,0,"","Serviço","Serviço","-","SINAPI",92873,"LANÇAMENTO COM USO DE BALDES, ADENSAMENTO E ACABAMENTO DE CONCRETO EM ESTRUTURAS. AF_12/2015","M3",4.51,null,null,null,"Referência: AGETOP - 60801"]
["S",2,"S",0,4,5,0,0,0,0,0,"","Serviço","Serviço","-","SINAPI",92777,"ARMAÇÃO DE PILAR OU VIGA DE UMA ESTRUTURA CONVENCIONAL DE CONCRETO ARMADO EM UMA EDIFICAÇÃO TÉRREA OU SOBRADO UTILIZANDO AÇO CA-50 DE 8,0 MM - MONTAGEM. AF_12/2015","KG",68.5,null,null,null,"Referência: AGETOP - 60304"]
["S",2,"S",0,4,5,0,0,0,0,0,"","Serviço","Serviço","-","SINAPI",92778,"ARMAÇÃO DE PILAR OU VIGA DE UMA ESTRUTURA CONVENCIONAL DE CONCRETO ARMADO EM UMA EDIFICAÇÃO TÉRREA OU SOBRADO UTILIZANDO AÇO CA-50 DE 10,0 MM - MONTAGEM. AF_12/2015","KG",305.8,null,null,null,"Referência: AGETOP - 60305"]
["S",2,"S",0,4,5,0,0,0,0,0,"","Serviço","Serviço","-","SINAPI",92779,"ARMAÇÃO DE PILAR OU VIGA DE UMA ESTRUTURA CONVENCIONAL DE CONCRETO ARMADO EM UMA EDIFICAÇÃO TÉRREA OU SOBRADO UTILIZANDO AÇO CA-50 DE 12,5 MM - MONTAGEM. AF_12/2015","KG",16.3,null,null,null,""]
["S",2,"S",0,4,5,0,0,0,0,0,"","Serviço","Serviço","-","SINAPI",92775,"ARMAÇÃO DE PILAR OU VIGA DE UMA ESTRUTURA CONVENCIONAL DE CONCRETO ARMADO EM UMA EDIFICAÇÃO TÉRREA OU SOBRADO UTILIZANDO AÇO CA-60 DE 5,0 MM - MONTAGEM. AF_12/2015","KG",116.2,null,null,null,"Referência: AGETOP - 60314"]
[2,2,2,26,4,6,0,0,0,141,26,"","Nível 2","Nível 2","-",null,null,"INSTALAÇÕES ELÉTRICAS","-",null,null,null,null,""]
["S",2,"S",0,4,6,0,0,0,0,0,"","Serviço","Serviço","-","AGETOP",70421,"BUCHA E ARRUELA METALICA DIAM. 3/4\"","PR    ",3,null,null,null,""]
["S",2,"S",0,4,6,0,0,0,0,0,"","Serviço","Serviço","-","AGETOP",70580,"CABO PVC (70ºC) 1 KV No 1,5 MM2","M     ",108.2,null,null,null,""]
["S",2,"S",0,4,6,0,0,0,0,0,"","Serviço","Serviço","-","AGETOP",70581,"CABO PVC (70ºC) 1 KV No. 2,5 MM2","M     ",356.5,null,null,null,""]
["S",2,"S",0,4,6,0,0,0,0,0,"","Serviço","Serviço","-","AGETOP",70583,"CABO PVC (70ºC) 1 KV No. 6 MM2","M     ",60.8,null,null,null,""]
["S",2,"S",0,4,6,0,0,0,0,0,"","Serviço","Serviço","-","SINAPI",92866,"CAIXA SEXTAVADA 3\" X 3\", METÁLICA, INSTALADA EM LAJE - FORNECIMENTO E INSTALAÇÃO. AF_12/2015","UN",10,null,null,null,"Referência: AGETOP - 70680"]
["S",2,"S",0,4,6,0,0,0,0,0,"","Serviço","Serviço","-","SINAPI",92868,"CAIXA RETANGULAR 4\" X 2\" MÉDIA (1,30 M DO PISO), METÁLICA, INSTALADA EM PAREDE - FORNECIMENTO E INSTALAÇÃO. AF_12/2015","UN",26,null,null,null,"Referência: AGETOP - 70691"]
["S",2,"S",0,4,6,0,0,0,{"$f":"IF(OR($C442=\"S\",$C442=0),0,MATCH(0,OFFSET($D442,1,$C442,ROW($C$748)-ROW($C442)),0))","v":0},{"$f":"IF(OR($C442=\"S\",$C442=0),0,MATCH(OFFSET($D442,0,$C442)+1,OFFSET($D442,1,$C442,ROW($C$748)-ROW($C442)),0))","v":0},"","Serviço","Serviço","-","SINAPI",91902,"CURVA 90 GRAUS PARA ELETRODUTO, PVC, ROSCÁVEL, DN 25 MM (3/4\"), PARA CIRCUITOS TERMINAIS, INSTALADA EM LAJE - FORNECIMENTO E INSTALAÇÃO. AF_12/2015","UN",1,null,null,null,"Referência: AGETOP - 71141"]
["S",2,"S",0,4,6,0,0,0,0,0,"","Serviço","Serviço","-","SINAPI",93653,"DISJUNTOR MONOPOLAR TIPO DIN, CORRENTE NOMINAL DE 10A - FORNECIMENTO E INSTALAÇÃO. AF_04/2016","UN",12,null,null,null,""]
["S",2,"S",0,4,6,0,0,0,0,0,"","Serviço","Serviço","-","SINAPI",93654,"DISJUNTOR MONOPOLAR TIPO DIN, CORRENTE NOMINAL DE 16A - FORNECIMENTO E INSTALAÇÃO. AF_04/2016","UN",1,null,null,null,""]
["S",2,"S",0,4,6,0,0,0,0,0,"","Serviço","Serviço","-","AGETOP",71450,"INTERRUPTOR DIFERENCIAL RESIDUAL (D.R.) BIPOLAR DE 25A-30mA","Un    ",12,null,null,null,""]
["S",2,"S",0,4,6,0,0,0,0,0,"","Serviço","Serviço","-","SINAPI",91844,"ELETRODUTO FLEXÍVEL CORRUGADO, PVC, DN 25 MM (3/4\"), PARA CIRCUITOS TERMINAIS, INSTALADO EM LAJE - FORNECIMENTO E INSTALAÇÃO. AF_12/2015","M",40,null,null,null,""]
["S",2,"S",0,4,6,0,0,0,0,0,"","Serviço","Serviço","-","SINAPI",91846,"ELETRODUTO FLEXÍVEL CORRUGADO, PVC, DN 32 MM (1\"), PARA CIRCUITOS TERMINAIS, INSTALADO EM LAJE - FORNECIMENTO E INSTALAÇÃO. AF_12/2015","M",10.1,null,null,null,""]
["S",2,"S",0,4,6,0,0,0,0,0,"","Serviço","Serviço","-","AGETOP",71197,"ELETRODUTO PVC FLEXÍVEL - MANGUEIRA CORRUGADA REFORÇADA - DIAM. 50MM","M     ",31.1,null,null,null,""]
["S",2,"S",0,4,6,0,0,0,0,0,"","Serviço","Serviço","-","SINAPI",97617,"LÂMPADA TUBULAR FLUORESCENTE T10 DE 20/40 W, BASE G13 - FORNECIMENTO E INSTALAÇÃO. AF_11/2017_P","UN",1,null,null,null,""]
["S",2,"S",0,4,6,0,0,0,0,0,"","Serviço","Serviço","-","SINAPI",83392,"REATOR PARA LAMPADA FLUORESCENTE 1X20W PARTIDA RAPIDA FORNECIMENTO E INSTALACAO","UN",4,null,null,null,""]
["S",2,"S",0,4,6,0,0,0,0,0,"","Serviço","Serviço","-","SINAPI",83393,"REATOR PARA LAMPADA FLUORESCENTE 1X40W PARTIDA RAPIDA FORNECIMENTO E INSTALACAO","UN",2,null,null,null,""]
["S",2,"S",0,4,6,0,0,0,0,0,"","Serviço","Serviço","-","AGETOP",72341,"SOQUETE ANTIVIBRATORIO P/LAMP.FLUORESCENTE","Un    ",34,null,null,null,""]
["S",2,"S",0,4,6,0,0,0,0,0,"","Serviço","Serviço","-","SINAPI",91955,"INTERRUPTOR PARALELO (1 MÓDULO), 10A/250V, INCLUINDO SUPORTE E PLACA - FORNECIMENTO E INSTALAÇÃO. AF_12/2015","UN",2,null,null,null,"Referência: AGETOP - 71431"]
["S",2,"S",0,4,6,0,0,0,0,0,"","Serviço","Serviço","-","SINAPI",91953,"INTERRUPTOR SIMPLES (1 MÓDULO), 10A/250V, INCLUINDO SUPORTE E PLACA - FORNECIMENTO E INSTALAÇÃO. AF_12/2015","UN",5,null,null,null,"Referência: AGETOP - 71440"]
["S",2,"S",0,4,6,0,0,0,0,0,"","Serviço","Serviço","-","SINAPI",91959,"INTERRUPTOR SIMPLES (2 MÓDULOS), 10A/250V, INCLUINDO SUPORTE E PLACA - FORNECIMENTO E INSTALAÇÃO. AF_12/2015","UN",1,null,null,null,"Referência: AGETOP - 71441"]
["S",2,"S",0,4,6,0,0,0,0,0,"","Serviço","Serviço","-","AGETOP",71380,"HASTE REV.COBRE(COPPERWELD)  3/4\" X 2,40 M C/CONECTOR","Un    ",3,null,null,null,""]
["S",2,"S",0,4,6,0,0,0,0,0,"","Serviço","Serviço","-","SINAPI",97611,"LÂMPADA COMPACTA FLUORESCENTE DE 15 W, BASE E27 - FORNECIMENTO E INSTALAÇÃO. AF_11/2017","UN",1,null,null,null,"Referência: AGETOP - 71567"]
["S",2,"S",0,4,6,0,0,0,0,0,"","Serviço","Serviço","-","AGETOP",72190,"QUADRO DE DISTRIBUIÇÃO DE EMBUTIR METÁLICO CB-24E - 150A","Un    ",1,null,null,null,""]
["S",2,"S",0,4,6,0,0,0,0,0,"","Serviço","Serviço","-","SINAPI",91884,"LUVA PARA ELETRODUTO, PVC, ROSCÁVEL, DN 25 MM (3/4\"), PARA CIRCUITOS TERMINAIS, INSTALADA EM PAREDE - FORNECIMENTO E INSTALAÇÃO. AF_12/2015","UN",3,null,null,null,"Referência: AGETOP - 71741"]
["S",2,"S",0,4,6,0,0,0,0,0,"","Serviço","Serviço","-","SINAPI",91996,"TOMADA MÉDIA DE EMBUTIR (1 MÓDULO), 2P+T 10 A, INCLUINDO SUPORTE E PLACA - FORNECIMENTO E INSTALAÇÃO. AF_12/2015","UN",17,null,null,null,"Referência: AGETOP - 72578"]
[2,2,2,57,4,7,0,0,0,115,57,"","Nível 2","Nível 2","-","AGETOP",null,"INSTALAÇÕES HIDROSSANITÁRIAS","-",null,null,null,null,""]
[{"$f":"CHOOSE(1+LOG(1+2*(ORÇAMENTO.Nivel=\"Nível 1\")+4*(ORÇAMENTO.Nivel=\"Nível 2\")+8*(ORÇAMENTO.Nivel=\"Nível 3\")+16*(ORÇAMENTO.Nivel=\"Nível 4\")+32*(ORÇAMENTO.Nivel=\"Serviço\"),2),0,1,2,3,4,\"S\")","v":3},3,3,56,4,7,1,0,{"$f":"IF(AND($C462<=4,$C462<>0),0,IF(AND($C462=\"S\",$W462>0),OFFSET(I462,-1,0)+1,OFFSET(I462,-1,0)))","v":0},56,102,"","Nível 3","Nível 3","-","SINAPI",null,"PEÇAS E ACESSÓRIOS","-",null,null,null,null,""]
["S",3,"S",0,4,7,1,0,0,0,0,"","Serviço","Serviço","-","AGETOP",81825,"CAIXA DE PASSAGEM 60 X 60 CM SEM TAMPA","Un    ",5,null,null,null,""]
["S",3,"S",0,4,7,1,0,0,0,0,"","Serviço","Serviço","-","AGETOP",81826,"TAMPA EM CONCRETO ARMADO 25 MPA E=5CM PARA A CAIXA DE PASSAGEM 60X60CM","Un    ",5,null,null,null,""]
["S",3,"S",0,{"$f":"IF($C465=1,OFFSET(E465,-1,0)+1,OFFSET(E465,-1,0))","v":4},{"$f":"IF($C465=1,0,IF($C465=2,OFFSET(F465,-1,0)+1,OFFSET(F465,-1,0)))","v":7},{"$f":"IF(AND($C465<=2,$C465<>0),0,IF($C465=3,OFFSET(G465,-1,0)+1,OFFSET(G465,-1,0)))","v":1},{"$f":"IF(AND($C465<=3,$C465<>0),0,IF($C465=4,OFFSET(H465,-1,0)+1,OFFSET(H465,-1,0)))","v":0},0,0,0,"","Serviço","Serviço","-","AGETOP",80510,"ANEL DE VEDAÇÃO PARA VASO SANITÁRIO","Un    ",1,null,null,null,""]
["S",3,"S",0,4,7,1,0,0,0,0,"","Serviço","Serviço","-","AGETOP",80512,"TUBO DE DESCIDA PARA CAIXA DE DESCARGA ( LONGO 1 1/4\" )","Un    ",1,null,null,null,""]
["S",3,"S",0,4,7,1,0,0,0,0,"","Serviço","Serviço","-","AGETOP",80514,"TUBO DE LIGACAO PVC CROMADO 1.1/2\" / ESPUDE  - (ENTRADA)","Un    ",1,null,null,null,""]
["S",3,"S",0,4,7,1,0,0,0,0,"","Serviço","Serviço","-","AGETOP",80515,"VÁLVULA DE DESCARGA DUPLO ACIONAMENTO COM ACABAMENTO CROMADO ","Un    ",14,null,null,null,""]
["S",3,"S",0,4,7,1,0,0,0,0,"","Serviço","Serviço","-","AGETOP",80520,"CONJUNTO DE FIXACAO P/VASO SANITARIO (PAR)","CJ    ",1,null,null,null,""]
["S",3,"S",0,4,7,1,0,0,0,0,"","Serviço","Serviço","-","AGETOP",80532,"PORTA PAPEL HIGIÊNICO EM METAL/ACABAMENTO CROMADO","Un    ",1,null,null,null,""]
["S",{"$f":"IF(OR(C471=\"s\",C471=0),OFFSET(B471,-1,0),C471)","v":3},{"$f":"IF(OFFSET(C471,-1,0)=\"L\",1,IF(OFFSET(C471,-1,0)=1,2,IF(OR(A471=\"s\",A471=0),\"S\",IF(AND(OFFSET(C471,-1,0)=2,A471=4),3,IF(AND(OR(OFFSET(C471,-1,0)=\"s\",OFFSET(C471,-1,0)=0),A471<>\"s\",A471>OFFSET(B471,-1,0)),OFFSET(B471,-1,0),A471)))))","v":"S"},{"$f":"IF(OR(C471=\"S\",C471=0),0,IF(ISERROR(K471),J471,SMALL(J471:K471,1)))","v":0},4,7,1,0,0,0,0,"","Serviço","Serviço","-","AGETOP",80542,"LAVATÓRIO MÉDIO SEM COLUNA","Un    ",1,null,null,null,""]
["S",3,"S",0,4,7,1,0,0,0,0,"","Serviço","Serviço","-","AGETOP",80550,"FIXACAO P/LAVATORIO (PAR)","PAR   ",1,null,null,null,""]
["S",3,"S",0,4,7,1,0,0,0,0,"","Serviço","Serviço","-","AGETOP",80556,"LIGAÇÃO FLEXÍVEL PVC DIAM.1/2\" (ENGATE)","Un    ",1,null,null,null,""]
["S",3,"S",0,4,7,1,0,0,0,0,"","Serviço","Serviço","-","AGETOP",80562,"SIFAO FLEXIVEL UNIVERSAL ( SANFONADO) EM PVC PARA LAVATORIO","Un    ",1,null,null,null,""]
["S",3,"S",0,4,7,1,0,0,0,0,"","Serviço","Serviço","-","AGETOP",80570,"TORNEIRA DE MESA PARA LAVATÓRIO DIÂMETRO DE 1/2\"","Un    ",4,null,null,null,""]
["S",3,"S",0,4,7,1,0,0,0,0,"","Serviço","Serviço","-","AGETOP",80580,"VALVULA P/LAVATORIO OU BEBEDOURO METALICO DIAMETRO 1\"","Un    ",1,null,null,null,""]
["S",3,"S",0,4,7,1,0,0,0,0,"","Serviço","Serviço","-","SINAPI",86911,"TORNEIRA CROMADA LONGA, DE PAREDE, 1/2\" OU 3/4\", PARA PIA DE COZINHA, PADRÃO POPULAR - FORNECIMENTO E INSTALAÇÃO. AF_12/2013","UN",5,null,null,null,""]
["S",3,"S",0,4,7,1,0,0,0,0,"","Serviço","Serviço","-","AGETOP",80671,"SIFAO PVC P/PIA 1.1/2\" X 2\"","Un    ",5,null,null,null,""]
["S",3,"S",0,4,7,1,0,0,0,0,"","Serviço","Serviço","-","AGETOP",80680,"VALVULA P/PIA TIPO AMERICANA DIAM.3.1/2\" (METAL)","Un    ",5,null,null,null,""]
["S",3,"S",0,4,7,1,0,0,0,0,"","Serviço","Serviço","-","AGETOP",80687,"CUBA INOX 35X40X15CM E=0,6MM-AÇO 304 (CUBA Nº 3)","Un    ",4,null,null,null,""]
["S",3,"S",0,4,7,1,0,0,0,0,"","Serviço","Serviço","-","AGETOP",80693,"TANQUE (PANELAO) INOX 60 X 70 X 40 CM CH.18","Un    ",1,null,null,null,""]
["S",3,"S",0,4,7,1,0,0,0,0,"","Serviço","Serviço","-","AGETOP",81846,"CAIXA DE GORDURA E INSPEÇÃO EM PVC/ABS 19 LITROS COM TAMPA E PORTA TAMPA E CESTO DE LIMPEZA REMOVÍVEL","un    ",1,null,null,null,""]
["S",3,"S",0,4,7,1,0,0,0,0,"","Serviço","Serviço","-","SINAPI",94495,"REGISTRO DE GAVETA BRUTO, LATÃO, ROSCÁVEL, 1\u0094, INSTALADO EM RESERVAÇÃO DE ÁGUA DE EDIFICAÇÃO QUE POSSUA RESERVATÓRIO DE FIBRA/FIBROCIMENTO \u0096 FORNECIMENTO E INSTALAÇÃO. AF_06/2016","UN",1,null,null,null,"Referência: AGETOP - 80903"]
["S",3,"S",0,4,7,1,0,0,0,0,"","Serviço","Serviço","-","SINAPI",89987,"REGISTRO DE GAVETA BRUTO, LATÃO, ROSCÁVEL, 3/4\", COM ACABAMENTO E CANOPLA CROMADOS. FORNECIDO E INSTALADO EM RAMAL DE ÁGUA. AF_12/2014","UN",1,null,null,null,"Referência: AGETOP - 80926"]
["S",3,"S",0,4,7,1,0,0,0,0,"","Serviço","Serviço","-","SINAPI",89985,"REGISTRO DE PRESSÃO BRUTO, LATÃO, ROSCÁVEL, 3/4\", COM ACABAMENTO E CANOPLA CROMADOS. FORNECIDO E INSTALADO EM RAMAL DE ÁGUA. AF_12/2014","UN",4,null,null,null,"Referência: AGETOP - 80926"]
["S",3,"S",0,4,7,1,0,0,0,0,"","Serviço","Serviço","-","SINAPI",89356,"TUBO, PVC, SOLDÁVEL, DN 25MM, INSTALADO EM RAMAL OU SUB-RAMAL DE ÁGUA - FORNECIMENTO E INSTALAÇÃO. AF_12/2014","M",25,null,null,null,"Referência: AGETOP - 81003"]
["S",3,"S",0,4,7,1,0,0,0,0,"","Serviço","Serviço","-","SINAPI",89357,"TUBO, PVC, SOLDÁVEL, DN 32MM, INSTALADO EM RAMAL OU SUB-RAMAL DE ÁGUA - FORNECIMENTO E INSTALAÇÃO. AF_12/2014","M",19,null,null,null,"Referência: AGETOP - 81004"]
["S",3,"S",0,4,7,1,0,0,0,0,"","Serviço","Serviço","-","SINAPI",94708,"ADAPTADOR COM FLANGES LIVRES, PVC, SOLDÁVEL, DN  25 MM X 3/4 , INSTALADO EM RESERVAÇÃO DE ÁGUA DE EDIFICAÇÃO QUE POSSUA RESERVATÓRIO DE FIBRA/FIBROCIMENTO   FORNECIMENTO E INSTALAÇÃO. AF_06/2016","UN",14,null,null,null,"Referência: AGETOP - 81041"]
["S",3,"S",0,4,7,1,0,0,0,0,"","Serviço","Serviço","-","SINAPI",94709,"ADAPTADOR COM FLANGES LIVRES, PVC, SOLDÁVEL, DN 32 MM X 1 , INSTALADO EM RESERVAÇÃO DE ÁGUA DE EDIFICAÇÃO QUE POSSUA RESERVATÓRIO DE FIBRA/FIBROCIMENTO   FORNECIMENTO E INSTALAÇÃO. AF_06/2016","UN",2,null,null,null,"Referência: AGETOP - 81042"]
["S",3,"S",0,4,7,1,0,0,0,0,"","Serviço","Serviço","-","AGETOP",81162,"BUCHA DE REDUCAO SOLD.CURTA 32 X 25 MM","Un    ",2,null,null,null,""]
["S",3,"S",0,4,7,1,0,0,0,0,"","Serviço","Serviço","-","SINAPI",89866,"JOELHO 90 GRAUS, PVC, SOLDÁVEL, DN 25MM, INSTALADO EM DRENO DE AR-CONDICIONADO - FORNECIMENTO E INSTALAÇÃO. AF_12/2014","UN",6,null,null,null,""]
["S",3,"S",0,4,7,1,0,0,0,0,"","Serviço","Serviço","-","SINAPI",94672,"JOELHO 90 GRAUS COM BUCHA DE LATÃO, PVC, SOLDÁVEL, DN  25 MM, X 3/4\u0094 INSTALADO EM RESERVAÇÃO DE ÁGUA DE EDIFICAÇÃO QUE POSSUA RESERVATÓRIO DE FIBRA/FIBROCIMENTO   FORNECIMENTO E INSTALAÇÃO. AF_06/2016","UN",6,null,null,null,""]
["S",3,"S",0,4,7,1,0,0,0,0,"","Serviço","Serviço","-","AGETOP",81402,"TE 90 GRAUS SOLDAVEL DIAMETRO 25 mm","Un    ",2,null,null,null,""]
["S",3,"S",0,4,7,1,0,0,0,0,"","Serviço","Serviço","-","SINAPI",94691,"TÊ DE REDUÇÃO, PVC, SOLDÁVEL, DN 32 MM X  25 MM, INSTALADO EM RESERVAÇÃO DE ÁGUA DE EDIFICAÇÃO QUE POSSUA RESERVATÓRIO DE FIBRA/FIBROCIMENTO   FORNECIMENTO E INSTALAÇÃO. AF_06/2016","UN",1,null,null,null,"Referência: AGETOP - 81421"]
["S",3,"S",0,4,7,1,0,0,0,0,"","Serviço","Serviço","-","AGETOP",81602,"BUCHA DE REDUCAO LONGA DIAM. 50 X 40 MM","Un    ",5,null,null,null,""]
["S",3,"S",0,4,7,1,0,0,0,0,"","Serviço","Serviço","-","AGETOP",81663,"CORPO CX. SIFONADA DIAM. 150 X 150 X 50","Un    ",2,null,null,null,""]
["S",3,"S",0,4,7,1,0,0,0,0,"","Serviço","Serviço","-","AGETOP",81771,"GRELHA QUADRADA BRANCA DIAM. 150 MM","Un    ",2,null,null,null,""]
["S",3,"S",0,4,7,1,0,0,0,0,"","Serviço","Serviço","-","AGETOP",81885,"TERMINAL DE VENTILACAO DIAMETRO 50 MM","Un    ",1,null,null,null,""]
["S",3,"S",0,4,7,1,0,0,0,0,"","Serviço","Serviço","-","AGETOP",81831,"CAIXA DE INSPEÇÃO - ALVENARIA DE 1/2 VEZ COM REVESTIMENTO INTERNO EM REBOCO PAULISTA A-14 (COM ADIÇÃO DE IMPERMEABILIZANTE)","m2    ",3,null,null,null,""]
["S",3,"S",0,4,7,1,0,0,0,0,"","Serviço","Serviço","-","SINAPI",89802,"JOELHO 45 GRAUS, PVC, SERIE NORMAL, ESGOTO PREDIAL, DN 50 MM, JUNTA ELÁSTICA, FORNECIDO E INSTALADO EM PRUMADA DE ESGOTO SANITÁRIO OU VENTILAÇÃO. AF_12/2014","UN",7,null,null,null,""]
["S",3,"S",0,4,7,1,0,0,0,0,"","Serviço","Serviço","-","SINAPI",89732,"JOELHO 45 GRAUS, PVC, SERIE NORMAL, ESGOTO PREDIAL, DN 50 MM, JUNTA ELÁSTICA, FORNECIDO E INSTALADO EM RAMAL DE DESCARGA OU RAMAL DE ESGOTO SANITÁRIO. AF_12/2014","UN",7,null,null,null,""]
["S",3,"S",0,4,7,1,0,0,0,0,"","Serviço","Serviço","-","SINAPI",89724,"JOELHO 90 GRAUS, PVC, SERIE NORMAL, ESGOTO PREDIAL, DN 40 MM, JUNTA SOLDÁVEL, FORNECIDO E INSTALADO EM RAMAL DE DESCARGA OU RAMAL DE ESGOTO SANITÁRIO. AF_12/2014","UN",12,null,null,null,""]
["S",3,"S",0,4,7,1,0,0,0,0,"","Serviço","Serviço","-","SINAPI",89801,"JOELHO 90 GRAUS, PVC, SERIE NORMAL, ESGOTO PREDIAL, DN 50 MM, JUNTA ELÁSTICA, FORNECIDO E INSTALADO EM PRUMADA DE ESGOTO SANITÁRIO OU VENTILAÇÃO. AF_12/2014","UN",2,null,null,null,""]
["S",3,"S",0,4,7,1,0,0,0,0,"","Serviço","Serviço","-","AGETOP",81973,"JUNCAO SIMPLES DIAM. 100 X 50 MM","Un    ",1,null,null,null,""]
["S",3,"S",0,4,7,1,0,0,0,0,"","Serviço","Serviço","-","SINAPI",89834,"JUNÇÃO SIMPLES, PVC, SERIE NORMAL, ESGOTO PREDIAL, DN 100 X 100 MM, JUNTA ELÁSTICA, FORNECIDO E INSTALADO EM PRUMADA DE ESGOTO SANITÁRIO OU VENTILAÇÃO. AF_12/2014","UN",1,null,null,null,""]
["S",3,"S",0,4,7,1,0,0,{"$f":"IF(OR($C506=\"S\",$C506=0),0,MATCH(0,OFFSET($D506,1,$C506,ROW($C$748)-ROW($C506)),0))","v":0},{"$f":"IF(OR($C506=\"S\",$C506=0),0,MATCH(OFFSET($D506,0,$C506)+1,OFFSET($D506,1,$C506,ROW($C$748)-ROW($C506)),0))","v":0},"","Serviço","Serviço","-","AGETOP",81981,"JUNÇÃO DUPLA DIAMETRO 75 MM","Un    ",1,null,null,null,""]
["S",3,"S",0,4,7,1,0,0,0,0,"","Serviço","Serviço","-","SINAPI",89813,"LUVA SIMPLES, PVC, SERIE NORMAL, ESGOTO PREDIAL, DN 50 MM, JUNTA ELÁSTICA, FORNECIDO E INSTALADO EM PRUMADA DE ESGOTO SANITÁRIO OU VENTILAÇÃO. AF_12/2014","UN",8,null,null,null,""]
["S",3,"S",0,4,7,1,0,0,0,0,"","Serviço","Serviço","-","SINAPI",89821,"LUVA SIMPLES, PVC, SERIE NORMAL, ESGOTO PREDIAL, DN 100 MM, JUNTA ELÁSTICA, FORNECIDO E INSTALADO EM PRUMADA DE ESGOTO SANITÁRIO OU VENTILAÇÃO. AF_12/2014","UN",2,null,null,null,"Referência: AGETOP - 82004"]
["S",3,"S",0,4,7,1,0,0,0,0,"","Serviço","Serviço","-","AGETOP",82051,"PORTA GRELHA QUADRADA BRANCO DIAM. 150 MM","Un    ",2,null,null,null,""]
["S",3,"S",0,4,7,1,0,0,0,0,"","Serviço","Serviço","-","AGETOP",82103,"REDUCAO EXCENTRICA 100 X 50 MM","Un    ",1,null,null,null,""]
["S",3,"S",0,4,7,1,0,0,0,0,"","Serviço","Serviço","-","AGETOP",82233,"TE SANITARIO DIAMETRO 100 X 50 MM","Un    ",1,null,null,null,""]
["S",3,"S",0,4,7,1,0,0,0,0,"","Serviço","Serviço","-","SINAPI",89711,"TUBO PVC, SERIE NORMAL, ESGOTO PREDIAL, DN 40 MM, FORNECIDO E INSTALADO EM RAMAL DE DESCARGA OU RAMAL DE ESGOTO SANITÁRIO. AF_12/2014","M",14,null,null,null,"Referência: AGETOP - 82301"]
["S",3,"S",0,4,7,1,0,0,0,0,"","Serviço","Serviço","-","SINAPI",89798,"TUBO PVC, SERIE NORMAL, ESGOTO PREDIAL, DN 50 MM, FORNECIDO E INSTALADO EM PRUMADA DE ESGOTO SANITÁRIO OU VENTILAÇÃO. AF_12/2014","M",26,null,null,null,""]
["S",3,"S",0,4,7,1,0,0,0,0,"","Serviço","Serviço","-","SINAPI",89800,"TUBO PVC, SERIE NORMAL, ESGOTO PREDIAL, DN 100 MM, FORNECIDO E INSTALADO EM PRUMADA DE ESGOTO SANITÁRIO OU VENTILAÇÃO. AF_12/2014","M",35,null,null,null,""]
["S",3,"S",0,4,7,1,0,0,0,0,"","Serviço","Serviço","-","AGETOP",82374,"TUBO FERRO GALVANIZADO DIAM.3/4\"","m     ",10,null,null,null,""]
["S",3,"S",0,4,7,1,0,0,0,0,"","Serviço","Serviço","-","AGETOP",85003,"EXTINTOR PO QUIMICO SECO (6 KG) - CAPACIDADE EXTINTORA 20 BC","Un    ",1,null,null,null,""]
["S",3,"S",0,4,7,1,0,0,0,0,"","Serviço","Serviço","-","SINAPI",95470,"VASO SANITARIO SIFONADO CONVENCIONAL COM LOUÇA BRANCA, INCLUSO CONJUNTO DE LIGAÇÃO PARA BACIA SANITÁRIA AJUSTÁVEL - FORNECIMENTO E INSTALAÇÃO. AF_10/2016","UN",1,null,null,null,""]
[2,2,2,9,4,8,0,0,0,58,9,"","Nível 2","Nível 2","-",null,null,"INSTALAÇÕES ESPECIAIS","-",null,null,null,null,""]
["S",2,"S",0,4,8,0,0,0,0,0,"","Serviço","Serviço","-","AGETOP",91007,"CENTRAL DE GÁS PADRÃO AGETOP SEM INSTALAÇÕES (1+1 CILINDRO 45 KG)","Un    ",1,null,null,null,""]
["S",2,"S",0,4,8,0,0,0,0,0,"","Serviço","Serviço","-","AGETOP",91011,"REGULADOR TIPO FRG 45 C/MANÔMETRO DPV","Un    ",1,null,null,null,""]
["S",2,"S",0,4,8,0,0,0,0,0,"","Serviço","Serviço","-","AGETOP",91013,"TUBO GALVANIZADO DIN 2440 DE 1/2\"","M     ",10,null,null,null,""]
["S",2,"S",0,4,8,0,0,0,0,0,"","Serviço","Serviço","-","AGETOP",91017,"COTOVELO 300 PSI 1/2\"","Un    ",4,null,null,null,""]
["S",2,"S",0,4,8,0,0,0,0,0,"","Serviço","Serviço","-","AGETOP",91029,"VALVULA DE RETENÇÃO LATÃO 1/2\" X 7/16\" NPT","Un    ",1,null,null,null,""]
["S",2,"S",0,4,8,0,0,0,0,0,"","Serviço","Serviço","-","AGETOP",91039,"TAMPÃO 300 PSI PRETO 3/4\"","Un    ",2,null,null,null,""]
["S",2,"S",0,4,8,0,0,0,0,0,"","Serviço","Serviço","-","AGETOP",91041,"MANGOTE FLEXIVEL PRETO 7/8 \" X 7/16\" - 500 MM","Un    ",2,null,null,null,""]
[{"$f":"CHOOSE(1+LOG(1+2*(ORÇAMENTO.Nivel=\"Nível 1\")+4*(ORÇAMENTO.Nivel=\"Nível 2\")+8*(ORÇAMENTO.Nivel=\"Nível 3\")+16*(ORÇAMENTO.Nivel=\"Nível 4\")+32*(ORÇAMENTO.Nivel=\"Serviço\"),2),0,1,2,3,4,\"S\")","v":"S"},2,"S",0,4,8,0,0,{"$f":"IF(AND($C526<=4,$C526<>0),0,IF(AND($C526=\"S\",$W526>0),OFFSET(I526,-1,0)+1,OFFSET(I526,-1,0)))","v":0},0,0,"","Serviço","Serviço","-","AGETOP",91043,"BRAÇADEIRA METALICA TIPO \"D\" DIAM. 3/4\"","Un    ",2,null,null,null,""]
[2,2,2,3,4,9,0,0,0,49,3,"","Nível 2","Nível 2","-",null,null,"ALVENARIAS E DIVISÓRIAS","-",null,null,null,null,""]
["S",2,"S",0,4,9,0,0,0,0,0,"","Serviço","Serviço","-","SINAPI","73937/1","COBOGO DE CONCRETO (ELEMENTO VAZADO), 7X50X50CM, ASSENTADO COM ARGAMASSA TRACO 1:4 (CIMENTO E AREIA)","M2",19,null,null,null,"Referência: AGETOP - 100501"]
["S",2,"S",0,{"$f":"IF($C529=1,OFFSET(E529,-1,0)+1,OFFSET(E529,-1,0))","v":4},{"$f":"IF($C529=1,0,IF($C529=2,OFFSET(F529,-1,0)+1,OFFSET(F529,-1,0)))","v":9},{"$f":"IF(AND($C529<=2,$C529<>0),0,IF($C529=3,OFFSET(G529,-1,0)+1,OFFSET(G529,-1,0)))","v":0},{"$f":"IF(AND($C529<=3,$C529<>0),0,IF($C529=4,OFFSET(H529,-1,0)+1,OFFSET(H529,-1,0)))","v":0},0,0,0,"","Serviço","Serviço","-","SINAPI",87520,"ALVENARIA DE VEDAÇÃO DE BLOCOS CERÂMICOS FURADOS NA HORIZONTAL DE 9X19X19CM (ESPESSURA 9CM) DE PAREDES COM ÁREA LÍQUIDA MAIOR OU IGUAL A 6M² COM VÃOS E ARGAMASSA DE ASSENTAMENTO COM PREPARO MANUAL. AF_06/2014","M2",160.80000000000001,null,null,null,"Referência: AGETOP - 100201"]
[2,2,2,2,4,10,0,0,0,46,2,"","Nível 2","Nível 2","-",null,null,"IMPERMEABILIZAÇÃO","-",null,null,null,null,""]
["S",2,"S",0,4,10,0,0,0,0,0,"","Serviço","Serviço","-","SINAPI",98562,"IMPERMEABILIZAÇÃO DE FLOREIRA OU VIGA BALDRAME COM ARGAMASSA DE CIMENTO E AREIA, COM ADITIVO IMPERMEABILIZANTE, E = 2 CM. AF_06/2018","M2",51.56,null,null,null,"Referência: AGETOP - 120902"]
[2,2,2,2,4,11,0,0,0,44,2,"","Nível 2","Nível 2","-",null,null,"ESTRUTURAS METÁLICAS","-",null,null,null,null,""]
["S",2,"S",0,4,11,0,0,0,0,0,"","Serviço","Serviço","-","AGETOP",150103,"ESTRUTURA METÁLICA CONVENCIONAL EM AÇO DO TIPO USI SAC-300 COM FUNDO ANTICORROSIVO","Kg    ",1253.57,null,null,null,""]
[2,2,2,6,4,12,0,0,0,42,6,"","Nível 2","Nível 2","-",null,null,"COBERTURAS","-",null,null,null,null,""]
[3,{"$f":"IF(OR(C535=\"s\",C535=0),OFFSET(B535,-1,0),C535)","v":3},{"$f":"IF(OFFSET(C535,-1,0)=\"L\",1,IF(OFFSET(C535,-1,0)=1,2,IF(OR(A535=\"s\",A535=0),\"S\",IF(AND(OFFSET(C535,-1,0)=2,A535=4),3,IF(AND(OR(OFFSET(C535,-1,0)=\"s\",OFFSET(C535,-1,0)=0),A535<>\"s\",A535>OFFSET(B535,-1,0)),OFFSET(B535,-1,0),A535)))))","v":3},{"$f":"IF(OR(C535=\"S\",C535=0),0,IF(ISERROR(K535),J535,SMALL(J535:K535,1)))","v":5},4,12,1,0,0,5,29,"","Nível 3","Nível 3","-",null,null,"TELHA CERÂMICA","-",null,null,null,null,""]
["S",3,"S",0,4,12,1,0,0,0,0,"","Serviço","Serviço","-","SINAPI",94445,"TELHAMENTO COM TELHA CERÂMICA CAPA-CANAL, TIPO PLAN, COM ATÉ 2 ÁGUAS, INCLUSO TRANSPORTE VERTICAL. AF_07/2019","M2",71.37,null,null,null,"Referência: AGETOP - 160401"]
["S",3,"S",0,4,12,1,0,0,0,0,"","Serviço","Serviço","-","SINAPI",94221,"CUMEEIRA PARA TELHA CERÂMICA EMBOÇADA COM ARGAMASSA TRAÇO 1:2:9 (CIMENTO, CAL E AREIA) PARA TELHADOS COM ATÉ 2 ÁGUAS, INCLUSO TRANSPORTE VERTICAL. AF_07/2019","M",7.2,null,null,null,""]
["S",3,"S",0,4,12,1,0,0,0,0,"","Serviço","Serviço","-","SINAPI",94224,"EMBOÇAMENTO COM ARGAMASSA TRAÇO 1:2:9 (CIMENTO, CAL E AREIA). AF_07/2019","M",20.399999999999999,null,null,null,"Referência: AGETOP - 160403"]
["S",3,"S",0,4,12,1,0,0,0,0,"","Serviço","Serviço","-","SINAPI",94224,"EMBOÇAMENTO COM ARGAMASSA TRAÇO 1:2:9 (CIMENTO, CAL E AREIA). AF_07/2019","M",14.4,null,null,null,"Referência: AGETOP - 160403"]
[2,2,2,5,4,13,0,0,0,36,5,"","Nível 2","Nível 2","-",null,null,"ESQUADRIAS METÁLICAS","-",null,null,null,null,""]
["S",2,"S",0,4,13,0,0,0,0,0,"","Serviço","Serviço","-","SINAPI","74136/3","PORTA DE ACO CHAPA 24, DE ENROLAR, RAIADA, LARGA COM ACABAMENTO GALVANIZADO NATURAL","M2",5.76,null,null,null,"Referência: AGETOP - 180303"]
["S",2,"S",0,4,13,0,0,0,0,0,"","Serviço","Serviço","-","AGETOP",180307,"PORTAO /CHAPA TRAPEZ / TUBO DE ACO PT-5 C/FERRAGEM","m2    ",4,null,null,null,""]
["S",2,"S",0,4,13,0,0,0,0,0,"","Serviço","Serviço","-","AGETOP",180381,"ESQ. MAXIMO AR CHAPA/VIDRO J3/J5/J6/J8 C/FERRAGENS","m2    ",5.52,null,null,null,""]
["S",2,"S",0,4,13,0,0,0,0,0,"","Serviço","Serviço","-","SINAPI","73933/4","PORTA DE FERRO DE ABRIR TIPO BARRA CHATA, COM REQUADRO E GUARNICAO COMPLETA","M2",9.24,null,null,null,"Referência: AGETOP - 180501"]
[2,2,2,2,4,14,0,0,0,31,2,"","Nível 2","Nível 2","-",null,null,"VIDROS","-",null,null,null,null,""]
["S",2,"S",0,4,14,0,0,0,0,0,"","Serviço","Serviço","-","SINAPI",72117,"VIDRO LISO COMUM TRANSPARENTE, ESPESSURA 4MM","M2",5.52,null,null,null,"Referência: AGETOP - 190102"]
[2,2,2,4,4,15,0,0,0,29,4,"","Nível 2","Nível 2","-",null,null,"REVESTIMENTO DE PAREDE","-",null,null,null,null,""]
["S",2,"S",0,4,15,0,0,0,0,0,"","Serviço","Serviço","-","SINAPI",87553,"EMBOÇO, PARA RECEBIMENTO DE CERÂMICA, EM ARGAMASSA TRAÇO 1:2:8, PREPARO MECÂNICO COM BETONEIRA 400L, APLICADO MANUALMENTE EM FACES INTERNAS DE PAREDES, PARA AMBIENTE COM ÁREA MAIOR QUE 10M2, ESPESSURA DE 10MM, COM EXECUÇÃO DE TALISCAS. AF_06/2014","M2",128.43,null,null,null,""]
["S",2,"S",0,4,15,0,0,0,0,0,"","Serviço","Serviço","-","SINAPI",87904,"CHAPISCO APLICADO EM ALVENARIA (COM PRESENÇA DE VÃOS) E ESTRUTURAS DE CONCRETO DE FACHADA, COM COLHER DE PEDREIRO.  ARGAMASSA TRAÇO 1:3 COM PREPARO MANUAL. AF_06/2014","M2",309.60000000000002,null,null,null,"Referência: AGETOP - 200101"]
["S",2,"S",0,4,15,0,0,0,0,0,"","Serviço","Serviço","-","SINAPI",87273,"REVESTIMENTO CERÂMICO PARA PAREDES INTERNAS COM PLACAS TIPO ESMALTADA EXTRA DE DIMENSÕES 33X45 CM APLICADAS EM AMBIENTES DE ÁREA MAIOR QUE 5 M² NA ALTURA INTEIRA DAS PAREDES. AF_06/2014","M2",128.43,null,null,null,""]
[2,2,2,3,4,16,0,0,0,25,3,"","Nível 2","Nível 2","-",null,null,"FORROS","-",null,null,null,null,""]
["S",2,"S",0,4,16,0,0,0,0,0,"","Serviço","Serviço","-","SINAPI",87884,"CHAPISCO APLICADO NO TETO, COM ROLO PARA TEXTURA ACRÍLICA. ARGAMASSA INDUSTRIALIZADA COM PREPARO MANUAL. AF_06/2014","M2",40.75,null,null,null,"Referência: AGETOP - 210102"]
["S",2,"S",0,4,16,0,0,0,0,0,"","Serviço","Serviço","-","SINAPI",90408,"MASSA ÚNICA, PARA RECEBIMENTO DE PINTURA, EM ARGAMASSA TRAÇO 1:2:8, PREPARO MECÂNICO COM BETONEIRA 400L, APLICADA MANUALMENTE EM TETO, ESPESSURA DE 10MM, COM EXECUÇÃO DE TALISCAS. AF_03/2015","M2",40.75,null,null,null,"Referência: AGETOP - 210401"]
[2,2,2,5,4,17,0,0,0,22,5,"","Nível 2","Nível 2","-",null,null,"REVESTIMENTO DE PISO","-",null,null,null,null,""]
["S",2,"S",0,4,17,0,0,0,0,0,"","Serviço","Serviço","-","SINAPI",95241,"LASTRO DE CONCRETO MAGRO, APLICADO EM PISOS OU RADIERS, ESPESSURA DE 5 CM. AF_07/2016","M2",56.76,null,null,null,""]
["S",2,"S",0,4,17,0,0,0,0,0,"","Serviço","Serviço","-","AGETOP",221104,"RASPAGEM E APLICAÇÃO RESINA ACRÍLICA DUAS DEMÃOS","m2    ",68.900000000000006,null,null,null,""]
["S",2,"S",0,4,17,0,0,0,0,0,"","Serviço","Serviço","-","AGETOP",221106,"GRANITINA 8MM FUNDIDA COM CONTRAPISO (1CI:3ARML) E=2CM E JUNTA PLASTICA 27MM (COM ÓXIDO DE FERRO)","m2    ",68.900000000000006,null,null,null,""]
["S",2,"S",0,4,17,0,0,0,0,0,"","Serviço","Serviço","-","AGETOP",220100,"PASSEIO PROTECAO EM CONC.DESEMPEN.5 CM 1:2,5:3,5 ( INCLUSO ESPELHO DE 30CM/ESCAVAÇÃO/REATERRO/APILOAMENTO/ATERRO INTERNO)","m2    ",30.21,null,null,null,""]
[2,2,2,2,4,18,0,0,0,17,2,"","Nível 2","Nível 2","-","SINAPI",null,"MARCENARIA","-",null,null,null,null,""]
["S",2,"S",0,4,18,0,0,0,0,0,"","Serviço","Serviço","-","AGETOP",240209,"PRATELEIRA EST.CAIBRO 4+1 TABUAS APARELHADAS E ENVERNIZADAS","m     ",3.2,null,null,null,""]
[2,2,2,12,4,19,0,0,0,15,12,"","Nível 2","Nível 2","-",null,null,"PINTURA","-",null,null,null,null,""]
[3,3,3,2,4,19,1,0,0,11,2,"","Nível 3","Nível 3","-",null,null,"ESMALTE SINTÉTICO","-",null,null,null,null,""]
["S",3,"S",0,4,19,1,0,0,0,0,"","Serviço","Serviço","-","AGETOP",261550,"PINT.ESMALTE SINT.PAREDES - 2 DEM.C/SELADOR","m2    ",40,null,null,null,""]
[3,3,3,3,4,19,2,0,0,9,3,"","Nível 3","Nível 3","-","AGETOP",null,"LÁTEX ACRÍLICA","-",null,null,null,null,""]
["S",3,"S",0,4,19,2,0,0,0,0,"","Serviço","Serviço","-","SINAPI",88489,"APLICAÇÃO MANUAL DE PINTURA COM TINTA LÁTEX ACRÍLICA EM PAREDES, DUAS DEMÃOS. AF_06/2014","M2",190.17,null,null,null,"Referência: AGETOP - 261001"]
["S",3,"S",0,4,19,2,0,0,0,0,"","Serviço","Serviço","-","AGETOP",261304,"EMASSAMENTO ACRILICO 2 DEMAOS","m2    ",230.17,null,null,null,""]
[3,3,3,2,4,19,3,0,0,6,2,"","Nível 3","Nível 3","-","AGETOP",null,"ESQUADRIAS NOVAS","-",null,null,null,null,""]
["S",3,"S",0,4,19,3,0,0,0,0,"","Serviço","Serviço","-","SINAPI","74145/1","PINTURA ESMALTE FOSCO, DUAS DEMAOS, SOBRE SUPERFICIE METALICA, INCLUSO UMA DEMAO DE FUNDO ANTICORROSIVO. UTILIZACAO DE REVOLVER ( AR-COMPRIMIDO).","M2",47,null,null,null,"Referência: AGETOP - 261602"]
[3,3,3,2,4,19,4,0,0,4,2,"","Nível 3","Nível 3","-","AGETOP",null,"ESTRUTURA METÁLICA","-",null,null,null,null,""]
["S",3,"S",0,4,19,4,0,0,{"$f":"IF(OR($C570=\"S\",$C570=0),0,MATCH(0,OFFSET($D570,1,$C570,ROW($C$748)-ROW($C570)),0))","v":0},{"$f":"IF(OR($C570=\"S\",$C570=0),0,MATCH(OFFSET($D570,0,$C570)+1,OFFSET($D570,1,$C570,ROW($C$748)-ROW($C570)),0))","v":0},"","Serviço","Serviço","-","SINAPI","74145/1","PINTURA ESMALTE FOSCO, DUAS DEMAOS, SOBRE SUPERFICIE METALICA, INCLUSO UMA DEMAO DE FUNDO ANTICORROSIVO. UTILIZACAO DE REVOLVER ( AR-COMPRIMIDO).","M2",71.37,null,null,null,"Referência: AGETOP - 261602"]
[3,3,3,2,4,19,5,0,0,2,{"$error":"#N/A"},"","Nível 3","Nível 3","-","AGETOP",null,"VERNIZ","-",null,null,null,null,""]
["S",3,"S",0,4,19,5,0,0,0,0,"","Serviço","Serviço","-","AGETOP",260902,"PINTURA C/VERNIZ ACRILICO-02 DEMAOS","m2    ",12,null,null,null,""]
[2,2,2,3,4,20,0,0,0,3,{"$error":"#N/A"},"","Nível 2","Nível 2","-",null,null,"DIVERSOS","-",null,null,null,null,""]
["S",2,"S",0,4,20,0,0,0,0,0,"","Serviço","Serviço","-","AGETOP",270501,"LIMPEZA FINAL DE OBRA - (OBRAS CIVIS)","m2    ",56.76,null,null,null,""]
["S",2,"S",0,4,20,0,0,0,0,0,"","Serviço","Serviço","-","AGETOP",271608,"BANCADA DE GRANITO C/ESPELHO","m2    ",6.4,null,null,null,""]
[1,1,1,172,5,0,0,0,0,172,{"$error":"#N/A"},"F","Nível 1","Nível 1","5.","SINAPI",null,"VESTIÁRIO PADRÃO SEDUC","-",null,null,null,null,""]
[2,2,2,2,5,1,0,0,0,171,2,"","Nível 2","Nível 2","-","SINAPI",null,"SERVIÇOS PRELIMINARES","-",null,null,null,null,""]
["S",2,"S",0,5,1,0,0,0,0,0,"","Serviço","Serviço","-","AGETOP",20701,"LOCAÇÃO DA OBRA, EXECUÇÃO DE GABARITO SEM REAPROVEITAMENTO, INCLUSO PINTURA (FACE INTERNA DO RIPÃO 15CM) E PIQUETE COM TESTEMUNHA","m2    ",98.23,null,null,null,""]
[2,2,2,3,5,2,0,0,0,169,3,"","Nível 2","Nível 2","-","SINAPI",null,"TRANSPORTES","-",null,null,null,null,""]
["S",2,"S",0,5,2,0,0,0,0,0,"","Serviço","Serviço","-","SINAPI",72897,"CARGA MANUAL DE ENTULHO EM CAMINHAO BASCULANTE 6 M3","M3",10,null,null,null,""]
["S",2,"S",0,5,2,0,0,0,0,0,"","Serviço","Serviço","-","SINAPI",72900,"TRANSPORTE DE ENTULHO COM CAMINHAO BASCULANTE 6 M3, RODOVIA PAVIMENTADA, DMT 0,5 A 1,0 KM","M3",10,null,null,null,""]
[2,2,2,3,5,3,0,0,0,166,3,"","Nível 2","Nível 2","-","SINAPI",null,"SERVIÇO EM TERRA","-",null,null,null,null,""]
["S",2,"S",0,5,3,0,0,0,0,0,"","Serviço","Serviço","-","SINAPI",93358,"ESCAVAÇÃO MANUAL DE VALA COM PROFUNDIDADE MENOR OU IGUAL A 1,30 M. AF_03/2016","M3",7,null,null,null,"Referência: AGETOP - 40101"]
["S",2,"S",0,5,3,0,0,0,0,0,"","Serviço","Serviço","-","AGETOP",41002,"APILOAMENTO","m2    ",132.78,null,null,null,""]
[2,2,2,8,5,4,0,0,0,163,8,"","Nível 2","Nível 2","-","SINAPI",null,"FUNDAÇÕES E SONDAGENS","-",null,null,null,null,""]
["S",2,"S",0,5,4,0,0,0,0,0,"","Serviço","Serviço","-","SINAPI",95474,"ALVENARIA DE EMBASAMENTO EM TIJOLOS CERAMICOS MACICOS 5X10X20CM, ASSENTADO  COM ARGAMASSA TRACO 1:2:8 (CIMENTO, CAL E AREIA)","M3",0.4,null,null,null,"Referência: AGETOP - 50201"]
["S",2,"S",0,5,4,0,0,0,0,0,"","Serviço","Serviço","-","SINAPI",98230,"ESTACA BROCA DE CONCRETO, DIÂMETRO DE 30 CM, PROFUNDIDADE DE ATÉ 3 M, ESCAVAÇÃO MANUAL COM TRADO CONCHA, NÃO ARMADA. AF_03/2018","M",49.5,null,null,null,"Referência: AGETOP - 50302"]
["S",2,"S",0,5,4,0,0,0,0,0,"","Serviço","Serviço","-","SINAPI",94963,"CONCRETO FCK = 15MPA, TRAÇO 1:3,4:3,5 (CIMENTO/ AREIA MÉDIA/ BRITA 1)  - PREPARO MECÂNICO COM BETONEIRA 400 L. AF_07/2016","M3",6.81,null,null,null,""]
["S",2,"S",0,5,4,0,0,0,0,0,"","Serviço","Serviço","-","AGETOP",51026,"LANÇAMENTO/APLICAÇÃO/ADENSAMENTO DE CONCRETO EM FUNDAÇÃO- (O.C.)","m3    ",6.81,null,null,null,""]
[{"$f":"CHOOSE(1+LOG(1+2*(ORÇAMENTO.Nivel=\"Nível 1\")+4*(ORÇAMENTO.Nivel=\"Nível 2\")+8*(ORÇAMENTO.Nivel=\"Nível 3\")+16*(ORÇAMENTO.Nivel=\"Nível 4\")+32*(ORÇAMENTO.Nivel=\"Serviço\"),2),0,1,2,3,4,\"S\")","v":"S"},2,"S",0,5,4,0,0,{"$f":"IF(AND($C590<=4,$C590<>0),0,IF(AND($C590=\"S\",$W590>0),OFFSET(I590,-1,0)+1,OFFSET(I590,-1,0)))","v":0},0,0,"","Serviço","Serviço","-","SINAPI",96545,"ARMAÇÃO DE BLOCO, VIGA BALDRAME OU SAPATA UTILIZANDO AÇO CA-50 DE 8 MM - MONTAGEM. AF_06/2017","KG",60,null,null,null,"Referência: AGETOP - 52004"]
["S",2,"S",0,5,4,0,0,0,0,0,"","Serviço","Serviço","-","SINAPI",96546,"ARMAÇÃO DE BLOCO, VIGA BALDRAME OU SAPATA UTILIZANDO AÇO CA-50 DE 10 MM - MONTAGEM. AF_06/2017","KG",80,null,null,null,"Referência: AGETOP - 52005"]
["S",2,"S",0,5,4,0,0,0,0,0,"","Serviço","Serviço","-","SINAPI",96543,"ARMAÇÃO DE BLOCO, VIGA BALDRAME E SAPATA UTILIZANDO AÇO CA-60 DE 5 MM - MONTAGEM. AF_06/2017","KG",54,null,null,null,"Referência: AGETOP - 52014"]
[2,2,2,8,{"$f":"IF($C593=1,OFFSET(E593,-1,0)+1,OFFSET(E593,-1,0))","v":5},{"$f":"IF($C593=1,0,IF($C593=2,OFFSET(F593,-1,0)+1,OFFSET(F593,-1,0)))","v":5},{"$f":"IF(AND($C593<=2,$C593<>0),0,IF($C593=3,OFFSET(G593,-1,0)+1,OFFSET(G593,-1,0)))","v":0},{"$f":"IF(AND($C593<=3,$C593<>0),0,IF($C593=4,OFFSET(H593,-1,0)+1,OFFSET(H593,-1,0)))","v":0},0,155,8,"","Nível 2","Nível 2","-","SINAPI",null,"ESTRUTURA","-",null,null,null,null,""]
["S",2,"S",0,5,5,0,0,0,0,0,"","Serviço","Serviço","-","AGETOP",60208,"FORMA CH.COMPENSADA 12MM-VIGA/PILAR U=3V - (OBRAS CIVIS","m2    ",54.36,null,null,null,""]
["S",2,"S",0,5,5,0,0,0,0,0,"","Serviço","Serviço","-","SINAPI",92778,"ARMAÇÃO DE PILAR OU VIGA DE UMA ESTRUTURA CONVENCIONAL DE CONCRETO ARMADO EM UMA EDIFICAÇÃO TÉRREA OU SOBRADO UTILIZANDO AÇO CA-50 DE 10,0 MM - MONTAGEM. AF_12/2015","KG",207,null,null,null,"Referência: AGETOP - 60305"]
["S",2,"S",0,5,5,0,0,0,0,0,"","Serviço","Serviço","-","SINAPI",92779,"ARMAÇÃO DE PILAR OU VIGA DE UMA ESTRUTURA CONVENCIONAL DE CONCRETO ARMADO EM UMA EDIFICAÇÃO TÉRREA OU SOBRADO UTILIZANDO AÇO CA-50 DE 12,5 MM - MONTAGEM. AF_12/2015","KG",322,null,null,null,""]
["S",2,"S",0,5,5,0,0,0,0,0,"","Serviço","Serviço","-","SINAPI",92775,"ARMAÇÃO DE PILAR OU VIGA DE UMA ESTRUTURA CONVENCIONAL DE CONCRETO ARMADO EM UMA EDIFICAÇÃO TÉRREA OU SOBRADO UTILIZANDO AÇO CA-60 DE 5,0 MM - MONTAGEM. AF_12/2015","KG",246.2,null,null,null,"Referência: AGETOP - 60314"]
["S",2,"S",0,5,5,0,0,0,0,0,"","Serviço","Serviço","-","SINAPI",94964,"CONCRETO FCK = 20MPA, TRAÇO 1:2,7:3 (CIMENTO/ AREIA MÉDIA/ BRITA 1)  - PREPARO MECÂNICO COM BETONEIRA 400 L. AF_07/2016","M3",8.83,null,null,null,""]
["S",{"$f":"IF(OR(C599=\"s\",C599=0),OFFSET(B599,-1,0),C599)","v":2},{"$f":"IF(OFFSET(C599,-1,0)=\"L\",1,IF(OFFSET(C599,-1,0)=1,2,IF(OR(A599=\"s\",A599=0),\"S\",IF(AND(OFFSET(C599,-1,0)=2,A599=4),3,IF(AND(OR(OFFSET(C599,-1,0)=\"s\",OFFSET(C599,-1,0)=0),A599<>\"s\",A599>OFFSET(B599,-1,0)),OFFSET(B599,-1,0),A599)))))","v":"S"},{"$f":"IF(OR(C599=\"S\",C599=0),0,IF(ISERROR(K599),J599,SMALL(J599:K599,1)))","v":0},5,5,0,0,0,0,0,"","Serviço","Serviço","-","AGETOP",60802,"LANÇAMENTO/APLICAÇÃO/ADENSAMENTO DE CONCRETO EM ESTRUTURA - (O.C.)","m3    ",8.83,null,null,null,""]
["S",2,"S",0,5,5,0,0,0,0,0,"","Serviço","Serviço","-","SINAPI","74202/1","LAJE PRE-MOLDADA P/FORRO, SOBRECARGA 100KG/M2, VAOS ATE 3,50M/E=8CM, C/LAJOTAS E CAP.C/CONC FCK=20MPA, 3CM, INTER-EIXO 38CM, C/ESCORAMENTO (REAPR.3X) E FERRAGEM NEGATIVA","M2",67,null,null,null,""]
[2,2,2,34,5,6,0,0,0,147,34,"","Nível 2","Nível 2","-","SINAPI",null,"INSTALAÇÕES ELÉTRICAS","-",null,null,null,null,""]
["S",2,"S",0,5,6,0,0,0,0,0,"","Serviço","Serviço","-","AGETOP",70351,"BRACADEIRA METALICA TIPO \"U\" DIAM. 3/4\"","Un    ",5,null,null,null,""]
["S",2,"S",0,5,6,0,0,0,0,0,"","Serviço","Serviço","-","AGETOP",70352,"BRACADEIRA METALICA TIPO \"U\" DIAM. 1\"","Un    ",5,null,null,null,""]
["S",2,"S",0,5,6,0,0,0,0,0,"","Serviço","Serviço","-","AGETOP",70355,"BRACADEIRA METALICA TIPO \"U\" DIAM. 2\"","Un    ",5,null,null,null,""]
["S",2,"S",0,5,6,0,0,0,0,0,"","Serviço","Serviço","-","AGETOP",70421,"BUCHA E ARRUELA METALICA DIAM. 3/4\"","PR    ",25,null,null,null,""]
["S",2,"S",0,5,6,0,0,0,0,0,"","Serviço","Serviço","-","AGETOP",70422,"BUCHA E ARRUELA METALICA DIAM. 1\"","PR    ",10,null,null,null,""]
["S",2,"S",0,5,6,0,0,0,0,0,"","Serviço","Serviço","-","AGETOP",70425,"BUCHA E ARRUELA METALICA DIAM. 2\"","PR    ",5,null,null,null,""]
["S",2,"S",0,5,6,0,0,0,0,0,"","Serviço","Serviço","-","SINAPI",91927,"CABO DE COBRE FLEXÍVEL ISOLADO, 2,5 MM², ANTI-CHAMA 0,6/1,0 KV, PARA CIRCUITOS TERMINAIS - FORNECIMENTO E INSTALAÇÃO. AF_12/2015","M",170,null,null,null,"Referência: AGETOP - 70581"]
["S",2,"S",0,5,6,0,0,0,0,0,"","Serviço","Serviço","-","SINAPI",91929,"CABO DE COBRE FLEXÍVEL ISOLADO, 4 MM², ANTI-CHAMA 0,6/1,0 KV, PARA CIRCUITOS TERMINAIS - FORNECIMENTO E INSTALAÇÃO. AF_12/2015","M",280,null,null,null,"Referência: AGETOP - 70582"]
["S",2,"S",0,5,6,0,0,0,0,0,"","Serviço","Serviço","-","SINAPI",92984,"CABO DE COBRE FLEXÍVEL ISOLADO, 25 MM², ANTI-CHAMA 0,6/1,0 KV, PARA DISTRIBUIÇÃO - FORNECIMENTO E INSTALAÇÃO. AF_12/2015","M",22,null,null,null,"Referência: AGETOP - 70511"]
["S",2,"S",0,5,6,0,0,0,0,0,"","Serviço","Serviço","-","SINAPI",92986,"CABO DE COBRE FLEXÍVEL ISOLADO, 35 MM², ANTI-CHAMA 0,6/1,0 KV, PARA DISTRIBUIÇÃO - FORNECIMENTO E INSTALAÇÃO. AF_12/2015","M",209,null,null,null,"Referência: AGETOP - 70512"]
["S",2,"S",0,5,6,0,0,0,0,0,"","Serviço","Serviço","-","SINAPI",92868,"CAIXA RETANGULAR 4\" X 2\" MÉDIA (1,30 M DO PISO), METÁLICA, INSTALADA EM PAREDE - FORNECIMENTO E INSTALAÇÃO. AF_12/2015","UN",7,null,null,null,"Referência: AGETOP - 70691"]
["S",2,"S",0,5,6,0,0,0,0,0,"","Serviço","Serviço","-","SINAPI",92867,"CAIXA RETANGULAR 4\" X 2\" ALTA (2,00 M DO PISO), METÁLICA, INSTALADA EM PAREDE - FORNECIMENTO E INSTALAÇÃO. AF_12/2015","UN",12,null,null,null,""]
["S",2,"S",0,5,6,0,0,0,0,0,"","Serviço","Serviço","-","SINAPI",97893,"CAIXA ENTERRADA ELÉTRICA RETANGULAR, EM ALVENARIA COM BLOCOS DE CONCRETO, FUNDO COM BRITA, DIMENSÕES INTERNAS: 0,8X0,8X0,6 M. AF_05/2018","UN",1,null,null,null,""]
["S",2,"S",0,5,6,0,0,0,0,0,"","Serviço","Serviço","-","SINAPI",91902,"CURVA 90 GRAUS PARA ELETRODUTO, PVC, ROSCÁVEL, DN 25 MM (3/4\"), PARA CIRCUITOS TERMINAIS, INSTALADA EM LAJE - FORNECIMENTO E INSTALAÇÃO. AF_12/2015","UN",20,null,null,null,"Referência: AGETOP - 71141"]
["S",2,"S",0,5,6,0,0,0,0,0,"","Serviço","Serviço","-","SINAPI",93653,"DISJUNTOR MONOPOLAR TIPO DIN, CORRENTE NOMINAL DE 10A - FORNECIMENTO E INSTALAÇÃO. AF_04/2016","UN",1,null,null,null,""]
["S",2,"S",0,5,6,0,0,0,0,0,"","Serviço","Serviço","-","SINAPI",93654,"DISJUNTOR MONOPOLAR TIPO DIN, CORRENTE NOMINAL DE 16A - FORNECIMENTO E INSTALAÇÃO. AF_04/2016","UN",1,null,null,null,""]
["S",2,"S",0,5,6,0,0,0,0,0,"","Serviço","Serviço","-","SINAPI",93656,"DISJUNTOR MONOPOLAR TIPO DIN, CORRENTE NOMINAL DE 25A - FORNECIMENTO E INSTALAÇÃO. AF_04/2016","UN",12,null,null,null,""]
["S",2,"S",0,5,6,0,0,0,0,0,"","Serviço","Serviço","-","SINAPI","74130/5","DISJUNTOR TERMOMAGNETICO TRIPOLAR PADRAO NEMA (AMERICANO) 60 A 100A 240V, FORNECIMENTO E INSTALACAO","UN",2,null,null,null,""]
["S",2,"S",0,5,6,0,0,0,0,0,"","Serviço","Serviço","-","AGETOP",71450,"INTERRUPTOR DIFERENCIAL RESIDUAL (D.R.) BIPOLAR DE 25A-30mA","Un    ",12,null,null,null,""]
["S",2,"S",0,5,6,0,0,0,0,0,"","Serviço","Serviço","-","SINAPI",91953,"INTERRUPTOR SIMPLES (1 MÓDULO), 10A/250V, INCLUINDO SUPORTE E PLACA - FORNECIMENTO E INSTALAÇÃO. AF_12/2015","UN",5,null,null,null,"Referência: AGETOP - 71440"]
["S",2,"S",0,5,6,0,0,0,0,0,"","Serviço","Serviço","-","SINAPI",91871,"ELETRODUTO RÍGIDO ROSCÁVEL, PVC, DN 25 MM (3/4\"), PARA CIRCUITOS TERMINAIS, INSTALADO EM PAREDE - FORNECIMENTO E INSTALAÇÃO. AF_12/2015","M",65,null,null,null,"Referência: AGETOP - 71201"]
["S",2,"S",0,5,6,0,0,0,0,0,"","Serviço","Serviço","-","SINAPI",91872,"ELETRODUTO RÍGIDO ROSCÁVEL, PVC, DN 32 MM (1\"), PARA CIRCUITOS TERMINAIS, INSTALADO EM PAREDE - FORNECIMENTO E INSTALAÇÃO. AF_12/2015","M",30,null,null,null,"Referência: AGETOP - 71202"]
["S",2,"S",0,5,6,0,0,0,0,0,"","Serviço","Serviço","-","SINAPI",93009,"ELETRODUTO RÍGIDO ROSCÁVEL, PVC, DN 60 MM (2\") - FORNECIMENTO E INSTALAÇÃO. AF_12/2015","M",15,null,null,null,""]
["S",2,"S",0,5,6,0,0,0,0,0,"","Serviço","Serviço","-","AGETOP",71321,"FITA DE AUTO FUSAO, ROLO E 10,00 MM","Un    ",1,null,null,null,""]
["S",2,"S",0,5,6,0,0,0,0,0,"","Serviço","Serviço","-","AGETOP",71331,"FITA ISOLANTE, ROLO DE 20,00 M","Un    ",10,null,null,null,""]
["S",2,"S",0,5,6,0,0,0,0,0,"","Serviço","Serviço","-","SINAPI",97586,"LUMINÁRIA TIPO CALHA, DE SOBREPOR, COM 2 LÂMPADAS TUBULARES DE 36 W - FORNECIMENTO E INSTALAÇÃO. AF_11/2017","UN",14,null,null,null,""]
["S",2,"S",0,5,6,0,0,0,0,0,"","Serviço","Serviço","-","COMPOSIÇÃO","COMP 387_SEE","LÂMPADA LED TUBULAR 18W ","UN ",28,null,null,null,""]
["S",2,"S",0,5,6,0,0,0,0,0,"","Serviço","Serviço","-","SINAPI",91884,"LUVA PARA ELETRODUTO, PVC, ROSCÁVEL, DN 25 MM (3/4\"), PARA CIRCUITOS TERMINAIS, INSTALADA EM PAREDE - FORNECIMENTO E INSTALAÇÃO. AF_12/2015","UN",25,null,null,null,"Referência: AGETOP - 71741"]
["S",2,"S",0,5,6,0,0,0,0,0,"","Serviço","Serviço","-","SINAPI",91885,"LUVA PARA ELETRODUTO, PVC, ROSCÁVEL, DN 32 MM (1\"), PARA CIRCUITOS TERMINAIS, INSTALADA EM PAREDE - FORNECIMENTO E INSTALAÇÃO. AF_12/2015","UN",10,null,null,null,"Referência: AGETOP - 71742"]
["S",2,"S",0,5,6,0,0,0,0,0,"","Serviço","Serviço","-","SINAPI",93014,"LUVA PARA ELETRODUTO, PVC, ROSCÁVEL, DN 60 MM (2\") - FORNECIMENTO E INSTALAÇÃO. AF_12/2015","UN",5,null,null,null,"Referência: AGETOP - 71745"]
["S",2,"S",0,5,6,0,0,0,0,0,"","Serviço","Serviço","-","SINAPI","74131/5","QUADRO DE DISTRIBUICAO DE ENERGIA DE EMBUTIR, EM CHAPA METALICA, PARA 24 DISJUNTORES TERMOMAGNETICOS MONOPOLARES, COM BARRAMENTO TRIFASICO E NEUTRO, FORNECIMENTO E INSTALACAO","UN",4,null,null,null,""]
["S",2,"S",0,5,6,0,0,0,0,0,"","Serviço","Serviço","-","SINAPI",91996,"TOMADA MÉDIA DE EMBUTIR (1 MÓDULO), 2P+T 10 A, INCLUINDO SUPORTE E PLACA - FORNECIMENTO E INSTALAÇÃO. AF_12/2015","UN",2,null,null,null,"Referência: AGETOP - 72578"]
["S",2,"S",0,5,6,0,0,0,{"$f":"IF(OR($C634=\"S\",$C634=0),0,MATCH(0,OFFSET($D634,1,$C634,ROW($C$748)-ROW($C634)),0))","v":0},{"$f":"IF(OR($C634=\"S\",$C634=0),0,MATCH(OFFSET($D634,0,$C634)+1,OFFSET($D634,1,$C634,ROW($C$748)-ROW($C634)),0))","v":0},"","Serviço","Serviço","-","SINAPI",91993,"TOMADA ALTA DE EMBUTIR (1 MÓDULO), 2P+T 20 A, INCLUINDO SUPORTE E PLACA - FORNECIMENTO E INSTALAÇÃO. AF_12/2015","UN",12,null,null,null,"Referência: AGETOP - 72585"]
[2,2,2,71,5,7,0,0,0,113,71,"","Nível 2","Nível 2","-","SINAPI",null,"INSTALAÇÕES HIDROSSANITÁRIAS","-",null,null,null,null,""]
["S",2,"S",0,5,7,0,0,0,0,0,"","Serviço","Serviço","-","AGETOP",81825,"CAIXA DE PASSAGEM 60 X 60 CM SEM TAMPA","Un    ",4,null,null,null,""]
["S",2,"S",0,5,7,0,0,0,0,0,"","Serviço","Serviço","-","AGETOP",81826,"TAMPA EM CONCRETO ARMADO 25 MPA E=5CM PARA A CAIXA DE PASSAGEM 60X60CM","Un    ",4,null,null,null,""]
["S",2,"S",0,5,7,0,0,0,0,0,"","Serviço","Serviço","-","AGETOP",80502,"VASO SANITARIO","Un    ",8,null,null,null,""]
["S",2,"S",0,5,7,0,0,0,0,0,"","Serviço","Serviço","-","AGETOP",80510,"ANEL DE VEDAÇÃO PARA VASO SANITÁRIO","Un    ",8,null,null,null,""]
["S",2,"S",0,5,7,0,0,0,0,0,"","Serviço","Serviço","-","AGETOP",80512,"TUBO DE DESCIDA PARA CAIXA DE DESCARGA ( LONGO 1 1/4\" )","Un    ",8,null,null,null,""]
["S",2,"S",0,5,7,0,0,0,0,0,"","Serviço","Serviço","-","AGETOP",80518,"VÁLVULA DE DESCARGA COM SISTEMA PASSANTE EM POLÍMERO - OPÇÃO ECONÔMICA ( ALTA SEGURANÇA)","Un    ",8,null,null,null,""]
["S",2,"S",0,5,7,0,0,0,0,0,"","Serviço","Serviço","-","AGETOP",80520,"CONJUNTO DE FIXACAO P/VASO SANITARIO (PAR)","CJ    ",8,null,null,null,""]
["S",2,"S",0,5,7,0,0,0,0,0,"","Serviço","Serviço","-","SINAPI",95544,"PAPELEIRA DE PAREDE EM METAL CROMADO SEM TAMPA, INCLUSO FIXAÇÃO. AF_10/2016","UN",4,null,null,null,""]
["S",2,"S",0,5,7,0,0,0,0,0,"","Serviço","Serviço","-","AGETOP",80532,"PORTA PAPEL HIGIÊNICO EM METAL/ACABAMENTO CROMADO","Un    ",8,null,null,null,""]
["S",2,"S",0,5,7,0,0,0,0,0,"","Serviço","Serviço","-","AGETOP",80590,"CUBA DE LOUCA DE EMBUTIR OVAL MÉDIA ","Un    ",6,null,null,null,""]
["S",2,"S",0,5,7,0,0,0,0,0,"","Serviço","Serviço","-","AGETOP",80550,"FIXACAO P/LAVATORIO (PAR)","PAR   ",6,null,null,null,""]
["S",2,"S",0,5,7,0,0,0,0,0,"","Serviço","Serviço","-","AGETOP",80556,"LIGAÇÃO FLEXÍVEL PVC DIAM.1/2\" (ENGATE)","Un    ",6,null,null,null,""]
["S",2,"S",0,5,7,0,0,0,0,0,"","Serviço","Serviço","-","SINAPI",86883,"SIFÃO DO TIPO FLEXÍVEL EM PVC 1\u0094 X 1.1/2\u0094 - FORNECIMENTO E INSTALAÇÃO. AF_12/2013","UN",6,null,null,null,""]
["S",2,"S",0,5,7,0,0,0,0,0,"","Serviço","Serviço","-","SINAPI",86915,"TORNEIRA CROMADA DE MESA, 1/2\" OU 3/4\", PARA LAVATÓRIO, PADRÃO MÉDIO - FORNECIMENTO E INSTALAÇÃO. AF_12/2013","UN",6,null,null,null,"Referência: AGETOP - 80570"]
["S",2,"S",0,5,7,0,0,0,0,0,"","Serviço","Serviço","-","SINAPI",86877,"VÁLVULA EM METAL CROMADO 1.1/2\" X 1.1/2\" PARA TANQUE OU LAVATÓRIO, COM OU SEM LADRÃO - FORNECIMENTO E INSTALAÇÃO. AF_12/2013","UN",6,null,null,null,""]
["S",2,"S",0,5,7,0,0,0,0,0,"","Serviço","Serviço","-","SINAPI",9535,"CHUVEIRO ELETRICO COMUM CORPO PLASTICO TIPO DUCHA, FORNECIMENTO E INSTALACAO","UN",12,null,null,null,""]
["S",2,"S",0,5,7,0,0,0,0,0,"","Serviço","Serviço","-","AGETOP",80730,"CABIDE TIPO GANCHO EM LOUÇA","Un    ",12,null,null,null,""]
["S",2,"S",0,5,7,0,0,0,0,0,"","Serviço","Serviço","-","AGETOP",80740,"MEIA SABONETEIRA EM LOUÇA DE EMBUTIR","Un    ",12,null,null,null,""]
[{"$f":"CHOOSE(1+LOG(1+2*(ORÇAMENTO.Nivel=\"Nível 1\")+4*(ORÇAMENTO.Nivel=\"Nível 2\")+8*(ORÇAMENTO.Nivel=\"Nível 3\")+16*(ORÇAMENTO.Nivel=\"Nível 4\")+32*(ORÇAMENTO.Nivel=\"Serviço\"),2),0,1,2,3,4,\"S\")","v":"S"},2,"S",0,5,7,0,0,{"$f":"IF(AND($C654<=4,$C654<>0),0,IF(AND($C654=\"S\",$W654>0),OFFSET(I654,-1,0)+1,OFFSET(I654,-1,0)))","v":0},0,0,"","Serviço","Serviço","-","SINAPI",89987,"REGISTRO DE GAVETA BRUTO, LATÃO, ROSCÁVEL, 3/4\", COM ACABAMENTO E CANOPLA CROMADOS. FORNECIDO E INSTALADO EM RAMAL DE ÁGUA. AF_12/2014","UN",2,null,null,null,"Referência: AGETOP - 80926"]
["S",2,"S",0,5,7,0,0,0,0,0,"","Serviço","Serviço","-","AGETOP",80927,"REGISTRO DE GAVETA C/CANOPLA DIAMETRO 1\"","Un    ",2,null,null,null,""]
["S",2,"S",0,5,7,0,0,0,0,0,"","Serviço","Serviço","-","SINAPI",94794,"REGISTRO DE GAVETA BRUTO, LATÃO, ROSCÁVEL, 1 1/2\u0094, COM ACABAMENTO E CANOPLA CROMADOS, INSTALADO EM RESERVAÇÃO DE ÁGUA DE EDIFICAÇÃO QUE POSSUA RESERVATÓRIO DE FIBRA/FIBROCIMENTO \u0096 FORNECIMENTO E INSTALAÇÃO. AF_06/2016","UN",6,null,null,null,"Referência: AGETOP - 80929"]
["S",2,"S",0,{"$f":"IF($C657=1,OFFSET(E657,-1,0)+1,OFFSET(E657,-1,0))","v":5},{"$f":"IF($C657=1,0,IF($C657=2,OFFSET(F657,-1,0)+1,OFFSET(F657,-1,0)))","v":7},{"$f":"IF(AND($C657<=2,$C657<>0),0,IF($C657=3,OFFSET(G657,-1,0)+1,OFFSET(G657,-1,0)))","v":0},{"$f":"IF(AND($C657<=3,$C657<>0),0,IF($C657=4,OFFSET(H657,-1,0)+1,OFFSET(H657,-1,0)))","v":0},0,0,0,"","Serviço","Serviço","-","AGETOP",80946,"REGISTRO DE PRESSAO C/CANOPLA CROMADA DIAM.3/4\"","Un    ",12,null,null,null,""]
["S",2,"S",0,5,7,0,0,0,0,0,"","Serviço","Serviço","-","SINAPI",89402,"TUBO, PVC, SOLDÁVEL, DN 25MM, INSTALADO EM RAMAL DE DISTRIBUIÇÃO DE ÁGUA - FORNECIMENTO E INSTALAÇÃO. AF_12/2014","M",45,null,null,null,"Referência: AGETOP - 81003"]
["S",2,"S",0,5,7,0,0,0,0,0,"","Serviço","Serviço","-","SINAPI",89447,"TUBO, PVC, SOLDÁVEL, DN 32MM, INSTALADO EM PRUMADA DE ÁGUA - FORNECIMENTO E INSTALAÇÃO. AF_12/2014","M",12,null,null,null,""]
["S",2,"S",0,5,7,0,0,0,0,0,"","Serviço","Serviço","-","SINAPI",89449,"TUBO, PVC, SOLDÁVEL, DN 50MM, INSTALADO EM PRUMADA DE ÁGUA - FORNECIMENTO E INSTALAÇÃO. AF_12/2014","M",42,null,null,null,""]
["S",2,"S",0,5,7,0,0,0,0,0,"","Serviço","Serviço","-","AGETOP",81007,"TUBO SOLDAVEL PVC MARROM DIAMETRO 60 mm (2\")","m     ",12,null,null,null,""]
["S",2,"S",0,5,7,0,0,0,0,0,"","Serviço","Serviço","-","SINAPI",89538,"ADAPTADOR CURTO COM BOLSA E ROSCA PARA REGISTRO, PVC, SOLDÁVEL, DN 25MM X 3/4\u0094, INSTALADO EM PRUMADA DE ÁGUA - FORNECIMENTO E INSTALAÇÃO. AF_12/2014","UN",28,null,null,null,""]
["S",{"$f":"IF(OR(C663=\"s\",C663=0),OFFSET(B663,-1,0),C663)","v":2},{"$f":"IF(OFFSET(C663,-1,0)=\"L\",1,IF(OFFSET(C663,-1,0)=1,2,IF(OR(A663=\"s\",A663=0),\"S\",IF(AND(OFFSET(C663,-1,0)=2,A663=4),3,IF(AND(OR(OFFSET(C663,-1,0)=\"s\",OFFSET(C663,-1,0)=0),A663<>\"s\",A663>OFFSET(B663,-1,0)),OFFSET(B663,-1,0),A663)))))","v":"S"},{"$f":"IF(OR(C663=\"S\",C663=0),0,IF(ISERROR(K663),J663,SMALL(J663:K663,1)))","v":0},5,7,0,0,0,0,0,"","Serviço","Serviço","-","AGETOP",81067,"ADAPTAD.SOLD.CURTO C/BOLSA E ROSCA P/REG.32X1\"","Un    ",4,null,null,null,""]
["S",2,"S",0,5,7,0,0,0,0,0,"","Serviço","Serviço","-","SINAPI",89596,"ADAPTADOR CURTO COM BOLSA E ROSCA PARA REGISTRO, PVC, SOLDÁVEL, DN 50MM X 1.1/2\u0094, INSTALADO EM PRUMADA DE ÁGUA - FORNECIMENTO E INSTALAÇÃO. AF_12/2014","UN",24,null,null,null,"Referência: AGETOP - 81069"]
["S",2,"S",0,5,7,0,0,0,0,0,"","Serviço","Serviço","-","SINAPI",89579,"LUVA DE REDUÇÃO, PVC, SOLDÁVEL, DN 50MM X 25MM, INSTALADO EM PRUMADA DE ÁGUA   FORNECIMENTO E INSTALAÇÃO. AF_12/2014","UN",8,null,null,null,""]
["S",2,"S",0,5,7,0,0,0,0,0,"","Serviço","Serviço","-","AGETOP",81184,"BUCHA DE REDUCAO SOLDAVEL LONGA 60 X 50 mm","Un    ",2,null,null,null,""]
["S",2,"S",0,5,7,0,0,0,0,0,"","Serviço","Serviço","-","SINAPI",89481,"JOELHO 90 GRAUS, PVC, SOLDÁVEL, DN 25MM, INSTALADO EM PRUMADA DE ÁGUA - FORNECIMENTO E INSTALAÇÃO. AF_12/2014","UN",20,null,null,null,""]
["S",2,"S",0,5,7,0,0,0,0,0,"","Serviço","Serviço","-","SINAPI",89413,"JOELHO 90 GRAUS, PVC, SOLDÁVEL, DN 32MM, INSTALADO EM RAMAL DE DISTRIBUIÇÃO DE ÁGUA - FORNECIMENTO E INSTALAÇÃO. AF_12/2014","UN",2,null,null,null,"Referência: AGETOP - 81322"]
["S",2,"S",0,5,7,0,0,0,0,0,"","Serviço","Serviço","-","AGETOP",81324,"JOELHO 90 GRAUS SOLDAVEL 50 mm (MARROM)","Un    ",12,null,null,null,""]
["S",2,"S",0,5,7,0,0,0,0,0,"","Serviço","Serviço","-","AGETOP",81360,"JOELHO RED.90 GRAUS SOLD.C/BUCHA LATAO 25X1/2\"","Un    ",18,null,null,null,""]
["S",2,"S",0,5,7,0,0,0,0,0,"","Serviço","Serviço","-","SINAPI",89501,"JOELHO 90 GRAUS, PVC, SOLDÁVEL, DN 50MM, INSTALADO EM PRUMADA DE ÁGUA - FORNECIMENTO E INSTALAÇÃO. AF_12/2014","UN",4,null,null,null,""]
["S",2,"S",0,5,7,0,0,0,0,0,"","Serviço","Serviço","-","SINAPI",89617,"TE, PVC, SOLDÁVEL, DN 25MM, INSTALADO EM PRUMADA DE ÁGUA - FORNECIMENTO E INSTALAÇÃO. AF_12/2014","UN",4,null,null,null,""]
["S",2,"S",0,5,7,0,0,0,0,0,"","Serviço","Serviço","-","SINAPI",89625,"TE, PVC, SOLDÁVEL, DN 50MM, INSTALADO EM PRUMADA DE ÁGUA - FORNECIMENTO E INSTALAÇÃO. AF_12/2014","UN",18,null,null,null,"Referência: AGETOP - 81405"]
["S",2,"S",0,5,7,0,0,0,0,0,"","Serviço","Serviço","-","AGETOP",81421,"TE REDUCAO 90 GRAUS SOLDAVEL 32 X 25 mm","Un    ",8,null,null,null,""]
["S",2,"S",0,5,7,0,0,0,0,0,"","Serviço","Serviço","-","SINAPI",89627,"TÊ DE REDUÇÃO, PVC, SOLDÁVEL, DN 50MM X 25MM, INSTALADO EM PRUMADA DE ÁGUA - FORNECIMENTO E INSTALAÇÃO. AF_12/2014","UN",2,null,null,null,""]
["S",2,"S",0,5,7,0,0,0,0,0,"","Serviço","Serviço","-","AGETOP",81425,"TE REDUCAO 90 GRAUS SOLDAVEL 50 X 32 mm","Un    ",4,null,null,null,""]
["S",2,"S",0,5,7,0,0,0,0,0,"","Serviço","Serviço","-","AGETOP",81445,"TE RED.SOLD.90GR.BUC.LATAO BOLSA CENT.25X25X1/2\"","Un    ",4,null,null,null,""]
["S",2,"S",0,5,7,0,0,0,0,0,"","Serviço","Serviço","-","AGETOP",81602,"BUCHA DE REDUCAO LONGA DIAM. 50 X 40 MM","Un    ",10,null,null,null,""]
["S",2,"S",0,5,7,0,0,0,0,0,"","Serviço","Serviço","-","AGETOP",81663,"CORPO CX. SIFONADA DIAM. 150 X 150 X 50","Un    ",2,null,null,null,""]
["S",2,"S",0,5,7,0,0,0,0,0,"","Serviço","Serviço","-","AGETOP",81664,"CORPO CX. SIFONADA DIAM. 150 X 185 X 75","Un    ",2,null,null,null,""]
["S",2,"S",0,5,7,0,0,0,0,0,"","Serviço","Serviço","-","AGETOP",81679,"CORPO RALO SIFONADO CONICO DIAM. 100 X 40","Un    ",12,null,null,null,""]
["S",2,"S",0,5,7,0,0,0,0,0,"","Serviço","Serviço","-","AGETOP",81770,"GRELHA QUADRADA BRANCA DIAM. 100 MM","Un    ",2,null,null,null,""]
["S",2,"S",0,5,7,0,0,0,0,0,"","Serviço","Serviço","-","AGETOP",81771,"GRELHA QUADRADA BRANCA DIAM. 150 MM","Un    ",2,null,null,null,""]
["S",2,"S",0,5,7,0,0,0,0,0,"","Serviço","Serviço","-","AGETOP",81885,"TERMINAL DE VENTILACAO DIAMETRO 50 MM","Un    ",5,null,null,null,""]
["S",2,"S",0,5,7,0,0,0,0,0,"","Serviço","Serviço","-","SINAPI",89726,"JOELHO 45 GRAUS, PVC, SERIE NORMAL, ESGOTO PREDIAL, DN 40 MM, JUNTA SOLDÁVEL, FORNECIDO E INSTALADO EM RAMAL DE DESCARGA OU RAMAL DE ESGOTO SANITÁRIO. AF_12/2014","UN",2,null,null,null,""]
["S",2,"S",0,5,7,0,0,0,0,0,"","Serviço","Serviço","-","SINAPI",89806,"JOELHO 45 GRAUS, PVC, SERIE NORMAL, ESGOTO PREDIAL, DN 75 MM, JUNTA ELÁSTICA, FORNECIDO E INSTALADO EM PRUMADA DE ESGOTO SANITÁRIO OU VENTILAÇÃO. AF_12/2014","UN",2,null,null,null,""]
["S",2,"S",0,5,7,0,0,0,0,0,"","Serviço","Serviço","-","SINAPI",89724,"JOELHO 90 GRAUS, PVC, SERIE NORMAL, ESGOTO PREDIAL, DN 40 MM, JUNTA SOLDÁVEL, FORNECIDO E INSTALADO EM RAMAL DE DESCARGA OU RAMAL DE ESGOTO SANITÁRIO. AF_12/2014","UN",6,null,null,null,""]
["S",2,"S",0,5,7,0,0,0,0,0,"","Serviço","Serviço","-","SINAPI",89731,"JOELHO 90 GRAUS, PVC, SERIE NORMAL, ESGOTO PREDIAL, DN 50 MM, JUNTA ELÁSTICA, FORNECIDO E INSTALADO EM RAMAL DE DESCARGA OU RAMAL DE ESGOTO SANITÁRIO. AF_12/2014","UN",10,null,null,null,""]
["S",2,"S",0,5,7,0,0,0,0,0,"","Serviço","Serviço","-","AGETOP",81938,"JOELHO 90 GRAUS DIAMETRO 100 MM","Un    ",8,null,null,null,""]
["S",2,"S",0,5,7,0,0,0,0,0,"","Serviço","Serviço","-","SINAPI",89806,"JOELHO 45 GRAUS, PVC, SERIE NORMAL, ESGOTO PREDIAL, DN 75 MM, JUNTA ELÁSTICA, FORNECIDO E INSTALADO EM PRUMADA DE ESGOTO SANITÁRIO OU VENTILAÇÃO. AF_12/2014","UN",6,null,null,null,""]
["S",2,"S",0,5,7,0,0,0,0,0,"","Serviço","Serviço","-","SINAPI",89785,"JUNÇÃO SIMPLES, PVC, SERIE NORMAL, ESGOTO PREDIAL, DN 50 X 50 MM, JUNTA ELÁSTICA, FORNECIDO E INSTALADO EM RAMAL DE DESCARGA OU RAMAL DE ESGOTO SANITÁRIO. AF_12/2014","UN",10,null,null,null,"Referência: AGETOP - 81970"]
["S",2,"S",0,5,7,0,0,0,0,0,"","Serviço","Serviço","-","SINAPI",89797,"JUNÇÃO SIMPLES, PVC, SERIE NORMAL, ESGOTO PREDIAL, DN 100 X 100 MM, JUNTA ELÁSTICA, FORNECIDO E INSTALADO EM RAMAL DE DESCARGA OU RAMAL DE ESGOTO SANITÁRIO. AF_12/2014","UN",6,null,null,null,"Referência: AGETOP - 81975"]
["S",2,"S",0,5,7,0,0,0,0,0,"","Serviço","Serviço","-","SINAPI",89752,"LUVA SIMPLES, PVC, SERIE NORMAL, ESGOTO PREDIAL, DN 40 MM, JUNTA SOLDÁVEL, FORNECIDO E INSTALADO EM RAMAL DE DESCARGA OU RAMAL DE ESGOTO SANITÁRIO. AF_12/2014","UN",12,null,null,null,"Referência: AGETOP - 82001"]
["S",2,"S",0,5,7,0,0,0,0,0,"","Serviço","Serviço","-","SINAPI",89753,"LUVA SIMPLES, PVC, SERIE NORMAL, ESGOTO PREDIAL, DN 50 MM, JUNTA ELÁSTICA, FORNECIDO E INSTALADO EM RAMAL DE DESCARGA OU RAMAL DE ESGOTO SANITÁRIO. AF_12/2014","UN",12,null,null,null,"Referência: AGETOP - 82002"]
["S",2,"S",0,5,7,0,0,0,0,0,"","Serviço","Serviço","-","SINAPI",89774,"LUVA SIMPLES, PVC, SERIE NORMAL, ESGOTO PREDIAL, DN 75 MM, JUNTA ELÁSTICA, FORNECIDO E INSTALADO EM RAMAL DE DESCARGA OU RAMAL DE ESGOTO SANITÁRIO. AF_12/2014","UN",2,null,null,null,"Referência: AGETOP - 82003"]
["S",2,"S",0,5,7,0,0,0,0,0,"","Serviço","Serviço","-","SINAPI",89778,"LUVA SIMPLES, PVC, SERIE NORMAL, ESGOTO PREDIAL, DN 100 MM, JUNTA ELÁSTICA, FORNECIDO E INSTALADO EM RAMAL DE DESCARGA OU RAMAL DE ESGOTO SANITÁRIO. AF_12/2014","UN",6,null,null,null,"Referência: AGETOP - 82004"]
["S",2,"S",0,5,7,0,0,0,0,0,"","Serviço","Serviço","-","AGETOP",82053,"PORTA GRELHA QUADRADO P/GREL.QUADRADA DIAM. 100 MM","Un    ",2,null,null,null,""]
["S",2,"S",0,5,7,0,0,0,{"$f":"IF(OR($C698=\"S\",$C698=0),0,MATCH(0,OFFSET($D698,1,$C698,ROW($C$748)-ROW($C698)),0))","v":0},{"$f":"IF(OR($C698=\"S\",$C698=0),0,MATCH(OFFSET($D698,0,$C698)+1,OFFSET($D698,1,$C698,ROW($C$748)-ROW($C698)),0))","v":0},"","Serviço","Serviço","-","AGETOP",82071,"PORTA GRELHA REDONDO BRANCO DIAM. 150 MM","Un    ",2,null,null,null,""]
["S",2,"S",0,5,7,0,0,0,0,0,"","Serviço","Serviço","-","SINAPI",89557,"REDUÇÃO EXCÊNTRICA, PVC, SERIE R, ÁGUA PLUVIAL, DN 100 X 75 MM, JUNTA ELÁSTICA, FORNECIDO E INSTALADO EM RAMAL DE ENCAMINHAMENTO. AF_12/2014","UN",2,null,null,null,"Referência: AGETOP - 82102"]
["S",2,"S",0,5,7,0,0,0,0,0,"","Serviço","Serviço","-","SINAPI",89825,"TE, PVC, SERIE NORMAL, ESGOTO PREDIAL, DN 50 X 50 MM, JUNTA ELÁSTICA, FORNECIDO E INSTALADO EM PRUMADA DE ESGOTO SANITÁRIO OU VENTILAÇÃO. AF_12/2014","UN",1,null,null,null,""]
["S",2,"S",0,5,7,0,0,0,0,0,"","Serviço","Serviço","-","AGETOP",82231,"TE SANITARIO DIAMETRO 75 X 50 MM","Un    ",2,null,null,null,""]
["S",2,"S",0,5,7,0,0,0,0,0,"","Serviço","Serviço","-","SINAPI",89771,"TUBO, CPVC, SOLDÁVEL, DN 42MM, INSTALADO EM PRUMADA DE ÁGUA \u0096 FORNECIMENTO E INSTALAÇÃO. AF_12/2014","M",21,null,null,null,""]
["S",2,"S",0,5,7,0,0,0,0,0,"","Serviço","Serviço","-","SINAPI",89798,"TUBO PVC, SERIE NORMAL, ESGOTO PREDIAL, DN 50 MM, FORNECIDO E INSTALADO EM PRUMADA DE ESGOTO SANITÁRIO OU VENTILAÇÃO. AF_12/2014","M",48,null,null,null,""]
["S",2,"S",0,5,7,0,0,0,0,0,"","Serviço","Serviço","-","SINAPI",89799,"TUBO PVC, SERIE NORMAL, ESGOTO PREDIAL, DN 75 MM, FORNECIDO E INSTALADO EM PRUMADA DE ESGOTO SANITÁRIO OU VENTILAÇÃO. AF_12/2014","M",9,null,null,null,""]
["S",2,"S",0,5,7,0,0,0,0,0,"","Serviço","Serviço","-","SINAPI",89800,"TUBO PVC, SERIE NORMAL, ESGOTO PREDIAL, DN 100 MM, FORNECIDO E INSTALADO EM PRUMADA DE ESGOTO SANITÁRIO OU VENTILAÇÃO. AF_12/2014","M",30,null,null,null,""]
[2,2,2,4,5,8,0,0,0,42,4,"","Nível 2","Nível 2","-","SINAPI",null,"ALVENARIAS E DIVISÓRIAS","-",null,null,null,null,""]
["S",2,"S",0,5,8,0,0,0,0,0,"","Serviço","Serviço","-","SINAPI",87503,"ALVENARIA DE VEDAÇÃO DE BLOCOS CERÂMICOS FURADOS NA HORIZONTAL DE 9X19X19CM (ESPESSURA 9CM) DE PAREDES COM ÁREA LÍQUIDA MAIOR OU IGUAL A 6M² SEM VÃOS E ARGAMASSA DE ASSENTAMENTO COM PREPARO EM BETONEIRA. AF_06/2014","M2",176,null,null,null,"Referência: AGETOP - 100201"]
["S",2,"S",0,5,8,0,0,0,0,0,"","Serviço","Serviço","-","SINAPI",72132,"ALVENARIA EM TIJOLO CERAMICO MACICO 5X10X20CM 1/2 VEZ (ESPESSURA 10CM), ASSENTADO COM ARGAMASSA TRACO 1:2:8 (CIMENTO, CAL E AREIA)","M2",39,null,null,null,"Referência: AGETOP - 100102"]
["S",2,"S",0,5,8,0,0,0,0,0,"","Serviço","Serviço","-","SINAPI",93202,"FIXAÇÃO (ENCUNHAMENTO) DE ALVENARIA DE VEDAÇÃO COM TIJOLO MACIÇO. AF_03/2016","M",60.4,null,null,null,"Referência: AGETOP - 100204"]
[2,2,2,2,5,9,0,0,0,38,2,"","Nível 2","Nível 2","-","SINAPI",null,"IMPERMEABILIZAÇÃO","-",null,null,null,null,""]
["S",2,"S",0,5,9,0,0,0,0,0,"","Serviço","Serviço","-","SINAPI",98562,"IMPERMEABILIZAÇÃO DE FLOREIRA OU VIGA BALDRAME COM ARGAMASSA DE CIMENTO E AREIA, COM ADITIVO IMPERMEABILIZANTE, E = 2 CM. AF_06/2018","M2",60.4,null,null,null,"Referência: AGETOP - 120902"]
[2,2,2,3,5,10,0,0,0,36,3,"","Nível 2","Nível 2","-","SINAPI",null,"ESTRUTURA DE MADEIRA","-",null,null,null,null,""]
["S",2,"S",0,5,10,0,0,0,0,0,"","Serviço","Serviço","-","AGETOP",140101,"ESTRUTURA-TELHA CERÂMICA V=3 A 7 M. C/FERRAGENS","m2    ",132.78,null,null,null,""]
["S",2,"S",0,5,10,0,0,0,0,0,"","Serviço","Serviço","-","AGETOP",140301,"TRATAMENTO P/ESTRUTURA DE TELHADO","m2    ",132.78,null,null,null,""]
[2,2,2,4,5,11,0,0,0,33,4,"","Nível 2","Nível 2","-","SINAPI",null,"COBERTURAS","-",null,null,null,null,""]
["S",2,"S",0,5,11,0,0,0,0,0,"","Serviço","Serviço","-","SINAPI",94445,"TELHAMENTO COM TELHA CERÂMICA CAPA-CANAL, TIPO PLAN, COM ATÉ 2 ÁGUAS, INCLUSO TRANSPORTE VERTICAL. AF_07/2019","M2",132.78,null,null,null,"Referência: AGETOP - 160401"]
["S",2,"S",0,5,11,0,0,0,0,0,"","Serviço","Serviço","-","SINAPI",94221,"CUMEEIRA PARA TELHA CERÂMICA EMBOÇADA COM ARGAMASSA TRAÇO 1:2:9 (CIMENTO, CAL E AREIA) PARA TELHADOS COM ATÉ 2 ÁGUAS, INCLUSO TRANSPORTE VERTICAL. AF_07/2019","M",11.02,null,null,null,""]
[{"$f":"CHOOSE(1+LOG(1+2*(ORÇAMENTO.Nivel=\"Nível 1\")+4*(ORÇAMENTO.Nivel=\"Nível 2\")+8*(ORÇAMENTO.Nivel=\"Nível 3\")+16*(ORÇAMENTO.Nivel=\"Nível 4\")+32*(ORÇAMENTO.Nivel=\"Serviço\"),2),0,1,2,3,4,\"S\")","v":"S"},2,"S",0,5,11,0,0,{"$f":"IF(AND($C718<=4,$C718<>0),0,IF(AND($C718=\"S\",$W718>0),OFFSET(I718,-1,0)+1,OFFSET(I718,-1,0)))","v":0},0,0,"","Serviço","Serviço","-","SINAPI",94224,"EMBOÇAMENTO COM ARGAMASSA TRAÇO 1:2:9 (CIMENTO, CAL E AREIA). AF_07/2019","M",47.04,null,null,null,"Referência: AGETOP - 160403"]
[2,2,2,4,5,12,0,0,0,29,4,"","Nível 2","Nível 2","-","SINAPI",null,"ESQUADRIAS METÁLICAS","-",null,null,null,null,""]
["S",2,"S",0,5,12,0,0,0,0,0,"","Serviço","Serviço","-","SINAPI","73933/4","PORTA DE FERRO DE ABRIR TIPO BARRA CHATA, COM REQUADRO E GUARNICAO COMPLETA","M2",6.72,null,null,null,"Referência: AGETOP - 180501"]
["S",2,"S",0,{"$f":"IF($C721=1,OFFSET(E721,-1,0)+1,OFFSET(E721,-1,0))","v":5},{"$f":"IF($C721=1,0,IF($C721=2,OFFSET(F721,-1,0)+1,OFFSET(F721,-1,0)))","v":12},{"$f":"IF(AND($C721<=2,$C721<>0),0,IF($C721=3,OFFSET(G721,-1,0)+1,OFFSET(G721,-1,0)))","v":0},{"$f":"IF(AND($C721<=3,$C721<>0),0,IF($C721=4,OFFSET(H721,-1,0)+1,OFFSET(H721,-1,0)))","v":0},0,0,0,"","Serviço","Serviço","-","SINAPI","73933/4","PORTA DE FERRO DE ABRIR TIPO BARRA CHATA, COM REQUADRO E GUARNICAO COMPLETA","M2",7.56,null,null,null,"Referência: AGETOP - 180501"]
["S",2,"S",0,5,12,0,0,0,0,0,"","Serviço","Serviço","-","AGETOP",180381,"ESQ. MAXIMO AR CHAPA/VIDRO J3/J5/J6/J8 C/FERRAGENS","m2    ",17.28,null,null,null,""]
[2,2,2,5,5,13,0,0,0,25,5,"","Nível 2","Nível 2","-","SINAPI",null,"REVESTIMENTO DE PAREDE","-",null,null,null,null,""]
["S",2,"S",0,5,13,0,0,0,0,0,"","Serviço","Serviço","-","SINAPI",87553,"EMBOÇO, PARA RECEBIMENTO DE CERÂMICA, EM ARGAMASSA TRAÇO 1:2:8, PREPARO MECÂNICO COM BETONEIRA 400L, APLICADO MANUALMENTE EM FACES INTERNAS DE PAREDES, PARA AMBIENTE COM ÁREA MAIOR QUE 10M2, ESPESSURA DE 10MM, COM EXECUÇÃO DE TALISCAS. AF_06/2014","M2",330.72,null,null,null,""]
["S",2,"S",0,5,13,0,0,0,0,0,"","Serviço","Serviço","-","SINAPI",87904,"CHAPISCO APLICADO EM ALVENARIA (COM PRESENÇA DE VÃOS) E ESTRUTURAS DE CONCRETO DE FACHADA, COM COLHER DE PEDREIRO.  ARGAMASSA TRAÇO 1:3 COM PREPARO MANUAL. AF_06/2014","M2",444.42,null,null,null,"Referência: AGETOP - 200101"]
["S",2,"S",0,5,13,0,0,0,0,0,"","Serviço","Serviço","-","SINAPI",87547,"MASSA ÚNICA, PARA RECEBIMENTO DE PINTURA, EM ARGAMASSA TRAÇO 1:2:8, PREPARO MECÂNICO COM BETONEIRA 400L, APLICADA MANUALMENTE EM FACES INTERNAS DE PAREDES, ESPESSURA DE 10MM, COM EXECUÇÃO DE TALISCAS. AF_06/2014","M2",113.7,null,null,null,"Referência: AGETOP - 200500"]
["S",{"$f":"IF(OR(C727=\"s\",C727=0),OFFSET(B727,-1,0),C727)","v":2},{"$f":"IF(OFFSET(C727,-1,0)=\"L\",1,IF(OFFSET(C727,-1,0)=1,2,IF(OR(A727=\"s\",A727=0),\"S\",IF(AND(OFFSET(C727,-1,0)=2,A727=4),3,IF(AND(OR(OFFSET(C727,-1,0)=\"s\",OFFSET(C727,-1,0)=0),A727<>\"s\",A727>OFFSET(B727,-1,0)),OFFSET(B727,-1,0),A727)))))","v":"S"},{"$f":"IF(OR(C727=\"S\",C727=0),0,IF(ISERROR(K727),J727,SMALL(J727:K727,1)))","v":0},5,13,0,0,0,0,0,"","Serviço","Serviço","-","SINAPI",87273,"REVESTIMENTO CERÂMICO PARA PAREDES INTERNAS COM PLACAS TIPO ESMALTADA EXTRA DE DIMENSÕES 33X45 CM APLICADAS EM AMBIENTES DE ÁREA MAIOR QUE 5 M² NA ALTURA INTEIRA DAS PAREDES. AF_06/2014","M2",330.72,null,null,null,""]
[2,2,2,2,5,14,0,0,0,20,2,"","Nível 2","Nível 2","-","SINAPI",null,"VIDROS","-",null,null,null,null,""]
["S",2,"S",0,5,14,0,0,0,0,0,"","Serviço","Serviço","-","SINAPI",72117,"VIDRO LISO COMUM TRANSPARENTE, ESPESSURA 4MM","M2",6.72,null,null,null,"Referência: AGETOP - 190102"]
[2,2,2,5,5,15,0,0,0,18,5,"","Nível 2","Nível 2","-","SINAPI",null,"REVESTIMENTO DE PISO","-",null,null,null,null,""]
["S",2,"S",0,5,15,0,0,0,0,0,"","Serviço","Serviço","-","AGETOP",220100,"PASSEIO PROTECAO EM CONC.DESEMPEN.5 CM 1:2,5:3,5 ( INCLUSO ESPELHO DE 30CM/ESCAVAÇÃO/REATERRO/APILOAMENTO/ATERRO INTERNO)","m2    ",25.26,null,null,null,""]
["S",2,"S",0,5,15,0,0,0,0,0,"","Serviço","Serviço","-","AGETOP",220101,"LASTRO DE CONCRETO REGULARIZADO IMPERMEABILIZADO 1:3:6 ESP=5CM (BASE)","m2    ",123.49,null,null,null,""]
["S",2,"S",0,5,15,0,0,0,0,0,"","Serviço","Serviço","-","SINAPI",84191,"PISO EM GRANILITE, MARMORITE OU GRANITINA ESPESSURA 8 MM, INCLUSO JUNTAS DE DILATACAO PLASTICAS","M2",108.03,null,null,null,"Referência: AGETOP - 221101"]
["S",2,"S",0,5,15,0,0,0,0,0,"","Serviço","Serviço","-","AGETOP",221104,"RASPAGEM E APLICAÇÃO RESINA ACRÍLICA DUAS DEMÃOS","m2    ",108.03,null,null,null,""]
[2,2,2,3,5,16,0,0,0,13,3,"","Nível 2","Nível 2","-","SINAPI",null,"FERRAGENS","-",null,null,null,null,""]
["S",2,"S",0,5,16,0,0,0,0,0,"","Serviço","Serviço","-","AGETOP",230174,"BARRA DE APOIO EM AÇO INOX - 40 CM","un    ",4,null,null,null,""]
["S",2,"S",0,5,16,0,0,0,0,0,"","Serviço","Serviço","-","AGETOP",230176,"BARRA DE APOIO EM AÇO INOX - 80 CM ","un    ",4,null,null,null,""]
[2,2,2,6,5,17,0,0,0,10,6,"","Nível 2","Nível 2","-","SINAPI",null,"PINTURA","-",null,null,null,null,""]
["S",2,"S",0,5,17,0,0,0,0,0,"","Serviço","Serviço","-","SINAPI",88497,"APLICAÇÃO E LIXAMENTO DE MASSA LÁTEX EM PAREDES, DUAS DEMÃOS. AF_06/2014","M2",67,null,null,null,"Referência: AGETOP - 261300"]
["S",2,"S",0,5,17,0,0,0,0,0,"","Serviço","Serviço","-","SINAPI",88489,"APLICAÇÃO MANUAL DE PINTURA COM TINTA LÁTEX ACRÍLICA EM PAREDES, DUAS DEMÃOS. AF_06/2014","M2",113.7,null,null,null,"Referência: AGETOP - 261001"]
["S",2,"S",0,5,17,0,0,0,0,0,"","Serviço","Serviço","-","AGETOP",261304,"EMASSAMENTO ACRILICO 2 DEMAOS","m2    ",113.7,null,null,null,""]
["S",2,"S",0,5,17,0,0,0,0,0,"","Serviço","Serviço","-","SINAPI",88486,"APLICAÇÃO MANUAL DE PINTURA COM TINTA LÁTEX PVA EM TETO, DUAS DEMÃOS. AF_06/2014","M2",67,null,null,null,"Referência: AGETOP - 261307"]
["S",2,"S",0,5,17,0,0,0,0,0,"","Serviço","Serviço","-","SINAPI","74145/1","PINTURA ESMALTE FOSCO, DUAS DEMAOS, SOBRE SUPERFICIE METALICA, INCLUSO UMA DEMAO DE FUNDO ANTICORROSIVO. UTILIZACAO DE REVOLVER ( AR-COMPRIMIDO).","M2",63.12,null,null,null,"Referência: AGETOP - 261602"]
[2,2,2,4,5,18,0,0,0,4,{"$error":"#N/A"},"","Nível 2","Nível 2","-","SINAPI",null,"DIVERSOS","-",null,null,null,null,""]
["S",2,"S",0,5,18,0,0,0,0,0,"","Serviço","Serviço","-","AGETOP",270501,"LIMPEZA FINAL DE OBRA - (OBRAS CIVIS)","m2    ",98.23,null,null,null,""]
["S",2,"S",0,5,18,0,0,0,0,0,"","Serviço","Serviço","-","AGETOP",271608,"BANCADA DE GRANITO C/ESPELHO","m2    ",2.4,null,null,null,""]
["S",2,"S",0,5,18,0,0,0,0,0,"","Serviço","Serviço","-","AGETOP",271303,"BANCO DE CONCRETO POLIDO BASE EM ALVENARIA REBOCADA E PINTADA - PADRÃO AGETOP 2015","m     ",6,null,null,null,""]
[-1,null,-1,null,0,0,0,0,0,null,null,"F"]
[null,null,null,null,null,null,null,null,null,null,null,"F",null,null,null,null,null,"OBS: OS QUANTITATIVOS DE MATERIAIS  DAS INSTALAÇÕES HIDROSSANITÁRIAS, ELÉTRICAS E ESPECIAIS SÃO FORNECIDOS PELOS PROFISSIONAIS RESPONSÁVEIS PELOS RESPECTIVOS PROJETOS.",null,null,"VALOR TOTAL",null,0]
[null,null,null,null,null,null,null,null,null,null,null,"F",null,null,null,null,null,null,null,null,"VALOR BDI (26,44%)",null,0]
[null,null,null,null,null,null,null,null,null,null,null,"F",null,null,null,null,null,null,null,null,"TOTAL ORÇAMENTO",null,0]
[null,null,null,null,null,null,null,null,null,null,null,"F"]
[null,null,null,null,null,null,null,null,null,null,null,"F",null,null,null,null,null,null,null,null,"CUSTO POR M2 ³",null,0]
[null,null,null,null,null,null,null,null,null,null,null,"F",null,null,null,null,null,null,null,null,"MATERIAL S/ BDI",null,0]
[null,null,null,null,null,null,null,null,null,null,null,"F",null,null,null,null,null,null,null,null,"MÃO DE OBRA S/ BDI",null,0]
[null,null,null,null,null,null,null,null,null,null,null,"F"]
[null,null,null,null,null,null,null,null,null,null,null,"F",null,null,null,null,"(1) Conforme previsto pelo DECRETO Nº 7.983, DE 8 DE ABRIL DE 2013, os preços adotados são aqueles constantes dos sistemas de referência indicados. Justifica-se o uso dos preços destas composições de custos unitários devido ao seu valor ser menor à mediana de seus correspondentes na tabela SINAPI;"]
[null,null,null,null,null,null,null,null,null,null,null,"F",null,null,null,null,"(2) Optou-se pelo uso das composições de custos da AGETOP para itens não presentes na SINAPI;"]
[null,null,null,null,null,null,null,null,null,null,null,"F",null,null,null,null,"(3) Para itens da AGETOP, os vidros não estão inclusos nas esquadrias e já foram considerados os custos de contramarco para as esquadrias de alumínio;"]
[null,null,null,null,null,null,null,null,null,null,null,"F",null,null,null,null,"(4) Nos casos em que houver execução de granitina e omissão do item AGETOP 221102, considerou-se que o quantitativo para o rodapé, de altura igual a 7cm, foi incorporado na área de piso;"]
[null,null,null,null,null,null,null,null,null,null,null,"F",null,null,null,null,"(5) O custo unitário aproximado por metro quadrado é calculado dividindo-se o valor total do orçamento pela área total de construção."]
[null,null,null,null,null,null,null,null,null,null,null,"F"]
[null,null,null,null,null,null,null,null,null,null,null,"F"]
[]
[null,null,null,null,null,null,null,null,null,null,null,null,null,null,"SOMATÓRIO DE SERVIÇOS"]
[null,null,null,null,null,null,null,null,null,null,null,null,null,null,"ITEM","DESCRIÇÃO DOS SERVIÇOS",null,null,"PREÇO SEM BDI",null,null,"PREÇO COM BDI",null,"PARTICIPAÇÃO ( % )"]
[null,null,null,null,null,null,null,null,null,null,null,null,null,null,"a.","SERVIÇOS PRELIMINARES",null,null,{"$f":"SUMIF($R$19:$R$748,$P767,$W$19:$W$748)","v":0},null,null,{"$f":"ROUND(S767*(1+BDI.Taxa),2)","v":0},null,{"$f":"IFERROR(ROUND($V767*100/$W$751,2),0)","v":0}]
[null,null,null,null,null,null,null,null,null,null,null,null,null,null,"b.","TRANSPORTES",null,null,0,null,null,0,null,{"$f":"IFERROR(ROUND($V768*100/$W$751,2),0)","v":0}]
[null,null,null,null,null,null,null,null,null,null,null,null,null,null,"c.","SERVIÇO EM TERRA",null,null,0,null,null,0,null,0]
[null,null,null,null,null,null,null,null,null,null,null,null,null,null,"d.","FUNDAÇÕES E SONDAGENS",null,null,0,null,null,0,null,0]
[null,null,null,null,null,null,null,null,null,null,null,null,null,null,"e.","ESTRUTURA",null,null,0,null,null,0,null,0]
[null,null,null,null,null,null,null,null,null,null,null,null,null,null,"f.","INSTALAÇÕES ELÉTRICAS",null,null,0,null,null,0,null,0]
[null,null,null,null,null,null,null,null,null,null,null,null,null,null,"g.","INSTALAÇÕES HIDROSSANITÁRIAS",null,null,0,null,null,0,null,0]
[null,null,null,null,null,null,null,null,null,null,null,null,null,null,"h","INSTALAÇÕES ESPECIAIS",null,null,0,null,null,0,null,0]
[null,null,null,null,null,null,null,null,null,null,null,null,null,null,"i.","ALVENARIAS E DIVISÓRIAS",null,null,0,null,null,0,null,0]
[null,null,null,null,null,null,null,null,null,null,null,null,null,null,"j.","ALVENARIA AUTO-PORTANTE",null,null,0,null,null,0,null,0]
[null,null,null,null,null,null,null,null,null,null,null,null,null,null,"k.","IMPERMEABILIZAÇÃO",null,null,0,null,null,0,null,0]
[null,null,null,null,null,null,null,null,null,null,null,null,null,null,"l.","ISOLAMENTO TÉRMICO E ACÚSTICO",null,null,0,null,null,0,null,0]
[null,null,null,null,null,null,null,null,null,null,null,null,null,null,"m.","ESTRUTURA DE MADEIRA",null,null,0,null,null,0,null,0]
[null,null,null,null,null,null,null,null,null,null,null,null,null,null,"n.","ESTRUTURAS METÁLICAS",null,null,0,null,null,0,null,0]
[null,null,null,null,null,null,null,null,null,null,null,null,null,null,"o.","COBERTURAS",null,null,0,null,null,0,null,0]
[null,null,null,null,null,null,null,null,null,null,null,null,null,null,"p.","ESQUADRIAS DE MADEIRA",null,null,0,null,null,0,null,0]
[null,null,null,null,null,null,null,null,null,null,null,null,null,null,"q.","ESQUADRIAS METÁLICAS",null,null,0,null,null,{"$f":"ROUND(S783*(1+BDI.Taxa),2)","v":0},null,0]
[null,null,null,null,null,null,null,null,null,null,null,null,null,null,"r.","VIDROS",null,null,0,null,null,0,null,0]
[null,null,null,null,null,null,null,null,null,null,null,null,null,null,"s.","REVESTIMENTO DE PAREDE",null,null,0,null,null,0,null,0]
[null,null,null,null,null,null,null,null,null,null,null,null,null,null,"t.","FORROS",null,null,0,null,null,0,null,0]
[null,null,null,null,null,null,null,null,null,null,null,null,null,null,"u.","REVESTIMENTO DE PISO",null,null,0,null,null,0,null,0]
[null,null,null,null,null,null,null,null,null,null,null,null,null,null,"v.","FERRAGENS",null,null,0,null,null,0,null,0]
[null,null,null,null,null,null,null,null,null,null,null,null,null,null,"w.","MARCENARIA",null,null,0,null,null,0,null,0]
[null,null,null,null,null,null,null,null,null,null,null,null,null,null,"x.","ADMINISTRAÇÃO",null,null,0,null,null,0,null,0]
[null,null,null,null,null,null,null,null,null,null,null,null,null,null,"y.","PINTURA",null,null,0,null,null,{"$f":"ROUND(S791*(1+BDI.Taxa),2)","v":0},null,0]
[null,null,null,null,null,null,null,null,null,null,null,null,null,null,"z.","DIVERSOS",null,null,0,null,null,{"$f":"IF(S792>0,IF((SUM(V767:W791)+ROUND(S792*(1+BDI.Taxa),2))<>V794,V794-SUM(V767:W791),ROUND(S792*(1+BDI.Taxa),2)),0)","v":0},null,{"$f":"IF(S792>0,IF((SUM(X767:X791)+IFERROR(ROUND($V792*100/$W$751,2),0))<>X794,X794-SUM(X767:X791),IFERROR(ROUND($V792*100/$W$751,2),0)),0)","v":0}]
[null,null,null,null,null,null,null,null,null,null,null,null,null,null,"TOTAL GERAL DO ORÇAMENTO (R$)",null,null,null,{"$f":"SUM(S767:U792)","v":0},null,null,{"$f":"SUM(V767:W792)","v":0},null,{"$f":"SUM(X767:X792)","v":0}]
[null,null,null,null,null,null,null,null,null,null,null,null,null,null,null,null,null,null,{"$f":"$W$749","v":0},null,null,{"$f":"$W$751","v":0},null,100]
[null,null,null,null,null,null,null,null,null,null,null,null,null,null,null,null,null,null,"(TOTAL SEM BDI)",null,null,"(TOTAL COM BDI)",null,"(ARRED porcentagem)"]
[null,null,null,null,null,null,null,null,null,null,null,null,null,null,null,null,null,null,{"$f":"IF(AND(S793=S794,S793>0),\"OK\",\"ERRO\")","v":"ERRO"},null,null,{"$f":"IF(AND(V793=V794,V793>0),\"OK\",\"ERRO\")","v":"ERRO"},null,{"$f":"IF(X793=100,\"OK\",\"ERRO\")","v":"ERRO"}]
[]
[]
[null,null,null,null,null,null,null,null,null,null,null,null,null,null,"RESUMO GERAL DO ORÇAMENTO"]
[null,null,null,null,null,null,null,null,null,null,null,null,null,null,"ITEM","DESCRIÇÃO DOS SERVIÇOS",null,null,"PREÇO SEM BDI",null,null,"PREÇO COM BDI",null,"PARTICIPAÇÃO ( % )"]
[null,null,null,null,null,null,null,null,null,null,null,null,null,null,"1.",{"$f":"IFERROR(VLOOKUP(O801,$O$19:$W$748,4,FALSE),\"\")","v":"REFORMA"},null,null,{"$f":"IF(P802=\"\",$S$822-SUM(OFFSET($S$800:S800,0,0,COUNTA($S$800:S800),1)),SUMIF($R$19:$R$748,$P801,$W$19:$W$748))","v":0},null,null,{"$f":"IF(P802=\"\",$V$822-SUM(OFFSET($V$800:V800,0,0,COUNTA($V$800:V800),1)),ROUND(S801*(1+BDI.Taxa),2))","v":0},null,{"$f":"IF(P802=\"\",$X$822-SUM(OFFSET($X$800:X800,0,0,COUNTA($X$800:X800),1)),ROUND(V801*100/ORÇAMENTO.TotalOrçamento,2))","v":{"$error":"#DIV/0!"}}]
[null,null,null,null,null,null,null,null,null,null,null,null,null,null,"2.","IMPLANTAÇÃO",null,null,{"$f":"IF(P803=\"\",$S$822-SUM(OFFSET($S$800:S801,0,0,COUNTA($S$800:S801),1)),SUMIF($R$19:$R$748,$P802,$W$19:$W$748))","v":0},null,null,{"$f":"IF(P803=\"\",$V$822-SUM(OFFSET($V$800:V801,0,0,COUNTA($V$800:V801),1)),ROUND(S802*(1+BDI.Taxa),2))","v":0},null,{"$f":"IF(P803=\"\",$X$822-SUM(OFFSET($X$800:X801,0,0,COUNTA($X$800:X801),1)),ROUND(V802*100/ORÇAMENTO.TotalOrçamento,2))","v":{"$error":"#DIV/0!"}}]
[null,null,null,null,null,null,null,null,null,null,null,null,null,null,"3.","COBERTURA DE QUADRA EM ARCO MODELO 3",null,null,{"$f":"IF(P804=\"\",$S$822-SUM(OFFSET($S$800:S802,0,0,COUNTA($S$800:S802),1)),SUMIF($R$19:$R$748,$P803,$W$19:$W$748))","v":0},null,null,{"$f":"IF(P804=\"\",$V$822-SUM(OFFSET($V$800:V802,0,0,COUNTA($V$800:V802),1)),ROUND(S803*(1+BDI.Taxa),2))","v":0},null,{"$f":"IF(P804=\"\",$X$822-SUM(OFFSET($X$800:X802,0,0,COUNTA($X$800:X802),1)),ROUND(V803*100/ORÇAMENTO.TotalOrçamento,2))","v":{"$error":"#DIV/0!"}}]
[null,null,null,null,null,null,null,null,null,null,null,null,null,null,"4.","COZINHA SEDUC OPÇÃO 2",null,null,{"$f":"IF(P805=\"\",$S$822-SUM(OFFSET($S$800:S803,0,0,COUNTA($S$800:S803),1)),SUMIF($R$19:$R$748,$P804,$W$19:$W$748))","v":0},null,null,{"$f":"IF(P805=\"\",$V$822-SUM(OFFSET($V$800:V803,0,0,COUNTA($V$800:V803),1)),ROUND(S804*(1+BDI.Taxa),2))","v":0},null,{"$f":"IF(P805=\"\",$X$822-SUM(OFFSET($X$800:X803,0,0,COUNTA($X$800:X803),1)),ROUND(V804*100/ORÇAMENTO.TotalOrçamento,2))","v":{"$error":"#DIV/0!"}}]
[null,null,null,null,null,null,null,null,null,null,null,null,null,null,"5.","VESTIÁRIO PADRÃO SEDUC",null,null,{"$f":"IF(P806=\"\",$S$822-SUM(OFFSET($S$800:S804,0,0,COUNTA($S$800:S804),1)),SUMIF($R$19:$R$748,$P805,$W$19:$W$748))","v":0},null,null,{"$f":"IF(P806=\"\",$V$822-SUM(OFFSET($V$800:V804,0,0,COUNTA($V$800:V804),1)),ROUND(S805*(1+BDI.Taxa),2))","v":0},null,{"$f":"IF(P806=\"\",$X$822-SUM(OFFSET($X$800:X804,0,0,COUNTA($X$800:X804),1)),ROUND(V805*100/ORÇAMENTO.TotalOrçamento,2))","v":{"$error":"#DIV/0!"}}]
[null,null,null,null,null,null,null,null,null,null,null,null,null,null,"6.","",null,null,{"$f":"IF(P807=\"\",$S$822-SUM(OFFSET($S$800:S805,0,0,COUNTA($S$800:S805),1)),SUMIF($R$19:$R$748,$P806,$W$19:$W$748))","v":0},null,null,{"$f":"IF(P807=\"\",$V$822-SUM(OFFSET($V$800:V805,0,0,COUNTA($V$800:V805),1)),ROUND(S806*(1+BDI.Taxa),2))","v":0},null,{"$f":"IF(P807=\"\",$X$822-SUM(OFFSET($X$800:X805,0,0,COUNTA($X$800:X805),1)),ROUND(V806*100/ORÇAMENTO.TotalOrçamento,2))","v":{"$error":"#DIV/0!"}}]
[null,null,null,null,null,null,null,null,null,null,null,null,null,null,"7.","",null,null,{"$f":"IF(P808=\"\",$S$822-SUM(OFFSET($S$800:S806,0,0,COUNTA($S$800:S806),1)),SUMIF($R$19:$R$748,$P807,$W$19:$W$748))","v":0},null,null,{"$f":"IF(P808=\"\",$V$822-SUM(OFFSET($V$800:V806,0,0,COUNTA($V$800:V806),1)),ROUND(S807*(1+BDI.Taxa),2))","v":0},null,{"$f":"IF(P808=\"\",$X$822-SUM(OFFSET($X$800:X806,0,0,COUNTA($X$800:X806),1)),ROUND(V807*100/ORÇAMENTO.TotalOrçamento,2))","v":{"$error":"#DIV/0!"}}]
[null,null,null,null,null,null,null,null,null,null,null,null,null,null,"8.","",null,null,{"$f":"IF(P809=\"\",$S$822-SUM(OFFSET($S$800:S807,0,0,COUNTA($S$800:S807),1)),SUMIF($R$19:$R$748,$P808,$W$19:$W$748))","v":0},null,null,{"$f":"IF(P809=\"\",$V$822-SUM(OFFSET($V$800:V807,0,0,COUNTA($V$800:V807),1)),ROUND(S808*(1+BDI.Taxa),2))","v":0},null,{"$f":"IF(P809=\"\",$X$822-SUM(OFFSET($X$800:X807,0,0,COUNTA($X$800:X807),1)),ROUND(V808*100/ORÇAMENTO.TotalOrçamento,2))","v":{"$error":"#DIV/0!"}}]
[null,null,null,null,null,null,null,null,null,null,null,null,null,null,"9.","",null,null,{"$f":"IF(P810=\"\",$S$822-SUM(OFFSET($S$800:S808,0,0,COUNTA($S$800:S808),1)),SUMIF($R$19:$R$748,$P809,$W$19:$W$748))","v":0},null,null,{"$f":"IF(P810=\"\",$V$822-SUM(OFFSET($V$800:V808,0,0,COUNTA($V$800:V808),1)),ROUND(S809*(1+BDI.Taxa),2))","v":0},null,{"$f":"IF(P810=\"\",$X$822-SUM(OFFSET($X$800:X808,0,0,COUNTA($X$800:X808),1)),ROUND(V809*100/ORÇAMENTO.TotalOrçamento,2))","v":{"$error":"#DIV/0!"}}]
[null,null,null,null,null,null,null,null,null,null,null,null,null,null,"10.","",null,null,{"$f":"IF(P811=\"\",$S$822-SUM(OFFSET($S$800:S809,0,0,COUNTA($S$800:S809),1)),SUMIF($R$19:$R$748,$P810,$W$19:$W$748))","v":0},null,null,{"$f":"IF(P811=\"\",$V$822-SUM(OFFSET($V$800:V809,0,0,COUNTA($V$800:V809),1)),ROUND(S810*(1+BDI.Taxa),2))","v":0},null,{"$f":"IF(P811=\"\",$X$822-SUM(OFFSET($X$800:X809,0,0,COUNTA($X$800:X809),1)),ROUND(V810*100/ORÇAMENTO.TotalOrçamento,2))","v":{"$error":"#DIV/0!"}}]
[null,null,null,null,null,null,null,null,null,null,null,null,null,null,"11.","",null,null,{"$f":"IF(P812=\"\",$S$822-SUM(OFFSET($S$800:S810,0,0,COUNTA($S$800:S810),1)),SUMIF($R$19:$R$748,$P811,$W$19:$W$748))","v":0},null,null,{"$f":"IF(P812=\"\",$V$822-SUM(OFFSET($V$800:V810,0,0,COUNTA($V$800:V810),1)),ROUND(S811*(1+BDI.Taxa),2))","v":0},null,{"$f":"IF(P812=\"\",$X$822-SUM(OFFSET($X$800:X810,0,0,COUNTA($X$800:X810),1)),ROUND(V811*100/ORÇAMENTO.TotalOrçamento,2))","v":{"$error":"#DIV/0!"}}]
[null,null,null,null,null,null,null,null,null,null,null,null,null,null,"12.","",null,null,{"$f":"IF(P813=\"\",$S$822-SUM(OFFSET($S$800:S811,0,0,COUNTA($S$800:S811),1)),SUMIF($R$19:$R$748,$P812,$W$19:$W$748))","v":0},null,null,{"$f":"IF(P813=\"\",$V$822-SUM(OFFSET($V$800:V811,0,0,COUNTA($V$800:V811),1)),ROUND(S812*(1+BDI.Taxa),2))","v":0},null,{"$f":"IF(P813=\"\",$X$822-SUM(OFFSET($X$800:X811,0,0,COUNTA($X$800:X811),1)),ROUND(V812*100/ORÇAMENTO.TotalOrçamento,2))","v":{"$error":"#DIV/0!"}}]
[null,null,null,null,null,null,null,null,null,null,null,null,null,null,"13.","",null,null,{"$f":"IF(P814=\"\",$S$822-SUM(OFFSET($S$800:S812,0,0,COUNTA($S$800:S812),1)),SUMIF($R$19:$R$748,$P813,$W$19:$W$748))","v":0},null,null,{"$f":"IF(P814=\"\",$V$822-SUM(OFFSET($V$800:V812,0,0,COUNTA($V$800:V812),1)),ROUND(S813*(1+BDI.Taxa),2))","v":0},null,{"$f":"IF(P814=\"\",$X$822-SUM(OFFSET($X$800:X812,0,0,COUNTA($X$800:X812),1)),ROUND(V813*100/ORÇAMENTO.TotalOrçamento,2))","v":{"$error":"#DIV/0!"}}]
[null,null,null,null,null,null,null,null,null,null,null,null,null,null,"14.","",null,null,{"$f":"IF(P815=\"\",$S$822-SUM(OFFSET($S$800:S813,0,0,COUNTA($S$800:S813),1)),SUMIF($R$19:$R$748,$P814,$W$19:$W$748))","v":0},null,null,{"$f":"IF(P815=\"\",$V$822-SUM(OFFSET($V$800:V813,0,0,COUNTA($V$800:V813),1)),ROUND(S814*(1+BDI.Taxa),2))","v":0},null,{"$f":"IF(P815=\"\",$X$822-SUM(OFFSET($X$800:X813,0,0,COUNTA($X$800:X813),1)),ROUND(V814*100/ORÇAMENTO.TotalOrçamento,2))","v":{"$error":"#DIV/0!"}}]
[null,null,null,null,null,null,null,null,null,null,null,null,null,null,"15.","",null,null,{"$f":"IF(P816=\"\",$S$822-SUM(OFFSET($S$800:S814,0,0,COUNTA($S$800:S814),1)),SUMIF($R$19:$R$748,$P815,$W$19:$W$748))","v":0},null,null,{"$f":"IF(P816=\"\",$V$822-SUM(OFFSET($V$800:V814,0,0,COUNTA($V$800:V814),1)),ROUND(S815*(1+BDI.Taxa),2))","v":0},null,{"$f":"IF(P816=\"\",$X$822-SUM(OFFSET($X$800:X814,0,0,COUNTA($X$800:X814),1)),ROUND(V815*100/ORÇAMENTO.TotalOrçamento,2))","v":{"$error":"#DIV/0!"}}]
[null,null,null,null,null,null,null,null,null,null,null,null,null,null,"16.","",null,null,{"$f":"IF(P817=\"\",$S$822-SUM(OFFSET($S$800:S815,0,0,COUNTA($S$800:S815),1)),SUMIF($R$19:$R$748,$P816,$W$19:$W$748))","v":0},null,null,{"$f":"IF(P817=\"\",$V$822-SUM(OFFSET($V$800:V815,0,0,COUNTA($V$800:V815),1)),ROUND(S816*(1+BDI.Taxa),2))","v":0},null,{"$f":"IF(P817=\"\",$X$822-SUM(OFFSET($X$800:X815,0,0,COUNTA($X$800:X815),1)),ROUND(V816*100/ORÇAMENTO.TotalOrçamento,2))","v":{"$error":"#DIV/0!"}}]
[null,null,null,null,null,null,null,null,null,null,null,null,null,null,"17.","",null,null,{"$f":"IF(P818=\"\",$S$822-SUM(OFFSET($S$800:S816,0,0,COUNTA($S$800:S816),1)),SUMIF($R$19:$R$748,$P817,$W$19:$W$748))","v":0},null,null,{"$f":"IF(P818=\"\",$V$822-SUM(OFFSET($V$800:V816,0,0,COUNTA($V$800:V816),1)),ROUND(S817*(1+BDI.Taxa),2))","v":0},null,{"$f":"IF(P818=\"\",$X$822-SUM(OFFSET($X$800:X816,0,0,COUNTA($X$800:X816),1)),ROUND(V817*100/ORÇAMENTO.TotalOrçamento,2))","v":{"$error":"#DIV/0!"}}]
[null,null,null,null,null,null,null,null,null,null,null,null,null,null,"18.","",null,null,{"$f":"IF(P819=\"\",$S$822-SUM(OFFSET($S$800:S817,0,0,COUNTA($S$800:S817),1)),SUMIF($R$19:$R$748,$P818,$W$19:$W$748))","v":0},null,null,{"$f":"IF(P819=\"\",$V$822-SUM(OFFSET($V$800:V817,0,0,COUNTA($V$800:V817),1)),ROUND(S818*(1+BDI.Taxa),2))","v":0},null,{"$f":"IF(P819=\"\",$X$822-SUM(OFFSET($X$800:X817,0,0,COUNTA($X$800:X817),1)),ROUND(V818*100/ORÇAMENTO.TotalOrçamento,2))","v":{"$error":"#DIV/0!"}}]
[null,null,null,null,null,null,null,null,null,null,null,null,null,null,"19.","",null,null,{"$f":"IF(P820=\"\",$S$822-SUM(OFFSET($S$800:S818,0,0,COUNTA($S$800:S818),1)),SUMIF($R$19:$R$748,$P819,$W$19:$W$748))","v":0},null,null,{"$f":"IF(P820=\"\",$V$822-SUM(OFFSET($V$800:V818,0,0,COUNTA($V$800:V818),1)),ROUND(S819*(1+BDI.Taxa),2))","v":0},null,{"$f":"IF(P820=\"\",$X$822-SUM(OFFSET($X$800:X818,0,0,COUNTA($X$800:X818),1)),ROUND(V819*100/ORÇAMENTO.TotalOrçamento,2))","v":{"$error":"#DIV/0!"}}]
[null,null,null,null,null,null,null,null,null,null,null,null,null,null,"20.","",null,null,{"$f":"IF(P821=\"\",$S$822-SUM(OFFSET($S$800:S819,0,0,COUNTA($S$800:S819),1)),SUMIF($R$19:$R$748,$P820,$W$19:$W$748))","v":0},null,null,{"$f":"IF(P821=\"\",$V$822-SUM(OFFSET($V$800:V819,0,0,COUNTA($V$800:V819),1)),ROUND(S820*(1+BDI.Taxa),2))","v":0},null,{"$f":"IF(P821=\"\",$X$822-SUM(OFFSET($X$800:X819,0,0,COUNTA($X$800:X819),1)),ROUND(V820*100/ORÇAMENTO.TotalOrçamento,2))","v":{"$error":"#DIV/0!"}}]
[null,null,null,null,null,null,null,null,null,null,null,null,null,null,"TOTAL GERAL DO ORÇAMENTO (R$)",null,null,null,{"$f":"SUM(S801:U820)","v":0},null,null,{"$f":"SUM(V801:W820)","v":0},null,{"$f":"SUM(X801:X820)","v":{"$error":"#DIV/0!"}}]
[null,null,null,null,null,null,null,null,null,null,null,null,null,null,null,null,null,null,{"$f":"$W$749","v":0},null,null,{"$f":"$W$751","v":0},null,100]
[null,null,null,null,null,null,null,null,null,null,null,null,null,null,null,null,null,null,"(TOTAL SEM BDI)",null,null,"(TOTAL COM BDI)",null,"(ARRED porcentagem)"]
[null,null,null,null,null,null,null,null,null,null,null,null,null,null,null,null,null,null,{"$f":"IF(AND(S821=S822,S821>0),\"OK\",\"ERRO\")","v":"ERRO"},null,null,{"$f":"IF(AND(V821=V822,V821>0),\"OK\",\"ERRO\")","v":"ERRO"},null,{"$f":"IF(AND(X821=100,S801<>0),\"OK\",\"ERRO\")","v":{"$error":"#DIV/0!"}}]

{"sheet":"Resumo ","index":1,"n_rows":39,"n_cols":9,"rows_kept":39,"cut":false,"hidden":false,"merged":[[42,3,42,7],[11,1,11,2],[12,1,12,2],[15,2,15,3],[16,2,16,3],[14,1,14,8],[17,2,17,3],[23,2,23,3],[18,2,18,3],[19,2,19,3],[20,2,20,3],[41,3,41,7],[24,2,24,3],[26,2,26,3],[27,2,27,3],[38,1,38,8],[1,1,1,8],[2,6,2,8],[3,6,3,8],[4,1,4,8],[5,6,5,8],[6,6,6,8],[7,1,7,8],[8,6,8,8],[9,6,9,8],[13,1,13,8],[0,1,0,8],[36,1,36,5],[2,1,2,5],[3,1,3,5],[5,1,5,5],[6,1,6,5],[8,1,8,5],[9,1,9,5],[11,3,11,5],[12,3,12,5],[10,1,10,8],[11,6,11,8],[12,6,12,8],[25,2,25,3],[21,2,21,3],[22,2,22,3],[13,0,14,0],[34,2,34,3],[35,2,35,3],[31,2,31,3],[32,2,32,3],[33,2,33,3],[28,2,28,3],[29,2,29,3],[30,2,30,3]]}
[]
[]
[null,"UNIDADE ESCOLAR",null,null,null,null,"CÓDIGO INEP"]
[null,{"$f":"Orçamento!$O$4","v":"CENTRO DE ENSINO EM PERÍODO INTEGRAL JOSÉ SALVIANO AZEVEDO"},null,null,null,null,{"$f":"Orçamento!V4","v":52055256}]
[]
[null,"OBRA",null,null,null,null,"CIDADE"]
[null,{"$f":"Orçamento!$O$7","v":"REFORMA E REFORMA"},null,null,null,null,{"$f":"Orçamento!$V$7","v":"SANTA HELENA DE GOIÁS"}]
[]
[null,"ENDEREÇO",null,null,null,null,"CRE"]
[null,{"$f":"Orçamento!$R$10","v":"RUA JACINTO F SOUSA 950, CENTRO, CEP:75920-000"},null,null,null,null,{"$f":"Orçamento!$O$10","v":"SANTA HELENA"}]
[]
[null,"REFERÊNCIA",null,"DATA",null,null,"ÁREA TOTAL CONSTRUÍDA (M²)"]
[null,{"$f":"CONCATENATE(\"AGETOP E SINAPI - \",Orçamento!$W$10)","v":"AGETOP E SINAPI - DESONERADA"},null,{"$f":"Orçamento!$S$7","v":"2020-04-23"},null,null,{"$f":"Orçamento!$S$13","v":4521.6399999999994}]
["FILTRO"]
[null,"RESUMO GERAL DO ORÇAMENTO"]
["↓","ITEM","DESCRIÇÃO DOS SERVIÇOS",null,"UNID","QUANT","PREÇO SEM BDI","PREÇO COM BDI","PARTICIP. (%)"]
[{"$f":"IF(E17>0,\"F\",\"\")","v":"F"},"1.",{"$f":"Orçamento!$P801","v":"REFORMA"},null,"UN ",1,{"$f":"IFERROR(Orçamento!S801,\"-\")","v":0},{"$f":"IFERROR(Orçamento!V801,\"\")","v":0},{"$f":"Orçamento!X801","v":{"$error":"#DIV/0!"}}]
[{"$f":"IF(E18>0,\"F\",\"\")","v":"F"},"2.",{"$f":"Orçamento!$P802","v":"IMPLANTAÇÃO"},null,"UN ",1,{"$f":"IFERROR(Orçamento!S802,\"-\")","v":0},{"$f":"IFERROR(Orçamento!V802,\"\")","v":0},{"$f":"Orçamento!X802","v":{"$error":"#DIV/0!"}}]
["F","3.",{"$f":"Orçamento!$P803","v":"COBERTURA DE QUADRA EM ARCO MODELO 3"},null,"UN ",1,{"$f":"IFERROR(Orçamento!S803,\"-\")","v":0},{"$f":"IFERROR(Orçamento!V803,\"\")","v":0},{"$f":"Orçamento!X803","v":{"$error":"#DIV/0!"}}]
["F","4.",{"$f":"Orçamento!$P804","v":"COZINHA SEDUC OPÇÃO 2"},null,"UN ",1,{"$f":"IFERROR(Orçamento!S804,\"-\")","v":0},{"$f":"IFERROR(Orçamento!V804,\"\")","v":0},{"$f":"Orçamento!X804","v":{"$error":"#DIV/0!"}}]
["F","5.",{"$f":"Orçamento!$P805","v":"VESTIÁRIO PADRÃO SEDUC"},null,"UN ",1,{"$f":"IFERROR(Orçamento!S805,\"-\")","v":0},{"$f":"IFERROR(Orçamento!V805,\"\")","v":0},{"$f":"Orçamento!X805","v":{"$error":"#DIV/0!"}}]
["","6.",{"$f":"Orçamento!$P806","v":""},null,null,null,{"$f":"IFERROR(Orçamento!S806,\"-\")","v":0},{"$f":"IFERROR(Orçamento!V806,\"\")","v":0},{"$f":"Orçamento!X806","v":{"$error":"#DIV/0!"}}]
["","7.",{"$f":"Orçamento!$P807","v":""},null,null,null,{"$f":"IFERROR(Orçamento!S807,\"-\")","v":0},{"$f":"IFERROR(Orçamento!V807,\"\")","v":0},{"$f":"Orçamento!X807","v":{"$error":"#DIV/0!"}}]
["","8.",{"$f":"Orçamento!$P808","v":""},null,null,null,{"$f":"IFERROR(Orçamento!S808,\"-\")","v":0},{"$f":"IFERROR(Orçamento!V808,\"\")","v":0},{"$f":"Orçamento!X808","v":{"$error":"#DIV/0!"}}]
["","9.",{"$f":"Orçamento!$P809","v":""},null,null,null,{"$f":"IFERROR(Orçamento!S809,\"-\")","v":0},{"$f":"IFERROR(Orçamento!V809,\"\")","v":0},{"$f":"Orçamento!X809","v":{"$error":"#DIV/0!"}}]
["","10.",{"$f":"Orçamento!$P810","v":""},null,null,null,{"$f":"IFERROR(Orçamento!S810,\"-\")","v":0},{"$f":"IFERROR(Orçamento!V810,\"\")","v":0},{"$f":"Orçamento!X810","v":{"$error":"#DIV/0!"}}]
["","11.",{"$f":"Orçamento!$P811","v":""},null,null,null,{"$f":"IFERROR(Orçamento!S811,\"-\")","v":0},{"$f":"IFERROR(Orçamento!V811,\"\")","v":0},{"$f":"Orçamento!X811","v":{"$error":"#DIV/0!"}}]
["","12.",{"$f":"Orçamento!$P812","v":""},null,null,null,{"$f":"IFERROR(Orçamento!S812,\"-\")","v":0},{"$f":"IFERROR(Orçamento!V812,\"\")","v":0},{"$f":"Orçamento!X812","v":{"$error":"#DIV/0!"}}]
["","13.",{"$f":"Orçamento!$P813","v":""},null,null,null,{"$f":"IFERROR(Orçamento!S813,\"-\")","v":0},{"$f":"IFERROR(Orçamento!V813,\"\")","v":0},{"$f":"Orçamento!X813","v":{"$error":"#DIV/0!"}}]
["","14.",{"$f":"Orçamento!$P814","v":""},null,null,null,{"$f":"IFERROR(Orçamento!S814,\"-\")","v":0},{"$f":"IFERROR(Orçamento!V814,\"\")","v":0},{"$f":"Orçamento!X814","v":{"$error":"#DIV/0!"}}]
["","15.",{"$f":"Orçamento!$P815","v":""},null,null,null,{"$f":"IFERROR(Orçamento!S815,\"-\")","v":0},{"$f":"IFERROR(Orçamento!V815,\"\")","v":0},{"$f":"Orçamento!X815","v":{"$error":"#DIV/0!"}}]
["","16.",{"$f":"Orçamento!$P816","v":""},null,null,null,{"$f":"IFERROR(Orçamento!S816,\"-\")","v":0},{"$f":"IFERROR(Orçamento!V816,\"\")","v":0},{"$f":"Orçamento!X816","v":{"$error":"#DIV/0!"}}]
["","17.",{"$f":"Orçamento!$P817","v":""},null,null,null,{"$f":"IFERROR(Orçamento!S817,\"-\")","v":0},{"$f":"IFERROR(Orçamento!V817,\"\")","v":0},{"$f":"Orçamento!X817","v":{"$error":"#DIV/0!"}}]
["","18.",{"$f":"Orçamento!$P818","v":""},null,null,null,{"$f":"IFERROR(Orçamento!S818,\"-\")","v":0},{"$f":"IFERROR(Orçamento!V818,\"\")","v":0},{"$f":"Orçamento!X818","v":{"$error":"#DIV/0!"}}]
["","19.",{"$f":"Orçamento!$P819","v":""},null,null,null,{"$f":"IFERROR(Orçamento!S819,\"-\")","v":0},{"$f":"IFERROR(Orçamento!V819,\"\")","v":0},{"$f":"Orçamento!X819","v":{"$error":"#DIV/0!"}}]
["","20.",{"$f":"Orçamento!$P820","v":""},null,null,null,{"$f":"IFERROR(Orçamento!S820,\"-\")","v":0},{"$f":"IFERROR(Orçamento!V820,\"\")","v":0},{"$f":"Orçamento!X820","v":{"$error":"#DIV/0!"}}]
["F","TOTAL GERAL DO ORÇAMENTO (R$)",null,null,null,null,{"$f":"SUM(G17:G36)","v":0},0,{"$f":"SUM(I17:I36)","v":{"$error":"#DIV/0!"}}]
["F"]
["F"]

{"sheet":"Somatório","index":2,"n_rows":45,"n_cols":6,"rows_kept":45,"cut":false,"hidden":false,"merged":[[0,1,0,5],[14,1,14,5],[2,1,2,3],[2,4,2,5],[3,1,3,3],[3,4,3,5],[5,1,5,3],[5,4,5,5],[6,1,6,3],[6,4,6,5],[8,1,8,3],[8,4,8,5],[1,1,1,5],[4,1,4,5],[7,1,7,5],[10,1,10,5],[9,1,9,3],[9,4,9,5],[11,1,11,2],[11,4,11,5],[12,1,12,2],[12,4,12,5],[13,0,14,0],[42,1,42,2],[44,1,44,5],[47,3,47,5],[48,3,48,5],[13,1,13,5]]}
[]
[]
[null,"UNIDADE ESCOLAR",null,null,"CÓDIGO INEP"]
[null,{"$f":"Orçamento!$O$4","v":"CENTRO DE ENSINO EM PERÍODO INTEGRAL JOSÉ SALVIANO AZEVEDO"},null,null,{"$f":"Orçamento!V4","v":52055256}]
[]
[null,"OBRA",null,null,"CIDADE"]
[null,{"$f":"Orçamento!$O$7","v":"REFORMA E REFORMA"},null,null,{"$f":"Orçamento!$V$7","v":"SANTA HELENA DE GOIÁS"}]
[]
[null,"ENDEREÇO",null,null,"CRE"]
[null,{"$f":"Orçamento!$R$10","v":"RUA JACINTO F SOUSA 950, CENTRO, CEP:75920-000"},null,null,{"$f":"Orçamento!$O$10","v":"SANTA HELENA"}]
[]
[null,"REFERÊNCIA",null,"DATA","ÁREA TOTAL CONSTRUÍDA (M²)"]
[null,{"$f":"CONCATENATE(\"AGETOP E SINAPI - \",Orçamento!$W$10)","v":"AGETOP E SINAPI - DESONERADA"},null,{"$f":"Orçamento!$S$7","v":"2020-04-23"},{"$f":"Orçamento!$S$13","v":4521.6399999999994}]
["FILTRO"]
[null,"SOMATÓRIO DE SERVIÇOS"]
["↓","ITEM","DESCRIÇÃO DOS SERVIÇOS","PREÇO SEM BDI (R$)","PREÇO COM BDI (R$)","PARTIC.  ( % )"]
[{"$f":"IF(D17>0,\"F\",\"\")","v":""},"a.",{"$f":"Orçamento!P767","v":"SERVIÇOS PRELIMINARES"},{"$f":"Orçamento!S767","v":0},{"$f":"Orçamento!V767","v":0},{"$f":"Orçamento!X767","v":0}]
[{"$f":"IF(D18>0,\"F\",\"\")","v":""},"b.",{"$f":"Orçamento!P768","v":"TRANSPORTES"},{"$f":"Orçamento!S768","v":0},{"$f":"Orçamento!V768","v":0},{"$f":"Orçamento!X768","v":0}]
["","c.",{"$f":"Orçamento!P769","v":"SERVIÇO EM TERRA"},{"$f":"Orçamento!S769","v":0},{"$f":"Orçamento!V769","v":0},{"$f":"Orçamento!X769","v":0}]
["","d.",{"$f":"Orçamento!P770","v":"FUNDAÇÕES E SONDAGENS"},{"$f":"Orçamento!S770","v":0},{"$f":"Orçamento!V770","v":0},{"$f":"Orçamento!X770","v":0}]
["","e.",{"$f":"Orçamento!P771","v":"ESTRUTURA"},{"$f":"Orçamento!S771","v":0},{"$f":"Orçamento!V771","v":0},{"$f":"Orçamento!X771","v":0}]
["","f.",{"$f":"Orçamento!P772","v":"INSTALAÇÕES ELÉTRICAS"},{"$f":"Orçamento!S772","v":0},{"$f":"Orçamento!V772","v":0},{"$f":"Orçamento!X772","v":0}]
["","g.",{"$f":"Orçamento!P773","v":"INSTALAÇÕES HIDROSSANITÁRIAS"},{"$f":"Orçamento!S773","v":0},{"$f":"Orçamento!V773","v":0},{"$f":"Orçamento!X773","v":0}]
["","h.",{"$f":"Orçamento!P774","v":"INSTALAÇÕES ESPECIAIS"},{"$f":"Orçamento!S774","v":0},{"$f":"Orçamento!V774","v":0},{"$f":"Orçamento!X774","v":0}]
["","i.",{"$f":"Orçamento!P775","v":"ALVENARIAS E DIVISÓRIAS"},{"$f":"Orçamento!S775","v":0},{"$f":"Orçamento!V775","v":0},{"$f":"Orçamento!X775","v":0}]
["","j.",{"$f":"Orçamento!P776","v":"ALVENARIA AUTO-PORTANTE"},{"$f":"Orçamento!S776","v":0},{"$f":"Orçamento!V776","v":0},{"$f":"Orçamento!X776","v":0}]
["","k.",{"$f":"Orçamento!P777","v":"IMPERMEABILIZAÇÃO"},{"$f":"Orçamento!S777","v":0},{"$f":"Orçamento!V777","v":0},{"$f":"Orçamento!X777","v":0}]
["","l.",{"$f":"Orçamento!P778","v":"ISOLAMENTO TÉRMICO E ACÚSTICO"},{"$f":"Orçamento!S778","v":0},{"$f":"Orçamento!V778","v":0},{"$f":"Orçamento!X778","v":0}]
["","m.",{"$f":"Orçamento!P779","v":"ESTRUTURA DE MADEIRA"},{"$f":"Orçamento!S779","v":0},{"$f":"Orçamento!V779","v":0},{"$f":"Orçamento!X779","v":0}]
["","n.",{"$f":"Orçamento!P780","v":"ESTRUTURAS METÁLICAS"},{"$f":"Orçamento!S780","v":0},{"$f":"Orçamento!V780","v":0},{"$f":"Orçamento!X780","v":0}]
["","o.",{"$f":"Orçamento!P781","v":"COBERTURAS"},{"$f":"Orçamento!S781","v":0},{"$f":"Orçamento!V781","v":0},{"$f":"Orçamento!X781","v":0}]
["","p.",{"$f":"Orçamento!P782","v":"ESQUADRIAS DE MADEIRA"},{"$f":"Orçamento!S782","v":0},{"$f":"Orçamento!V782","v":0},{"$f":"Orçamento!X782","v":0}]
["","q.",{"$f":"Orçamento!P783","v":"ESQUADRIAS METÁLICAS"},{"$f":"Orçamento!S783","v":0},{"$f":"Orçamento!V783","v":0},{"$f":"Orçamento!X783","v":0}]
["","r.",{"$f":"Orçamento!P784","v":"VIDROS"},{"$f":"Orçamento!S784","v":0},{"$f":"Orçamento!V784","v":0},{"$f":"Orçamento!X784","v":0}]
["","s.",{"$f":"Orçamento!P785","v":"REVESTIMENTO DE PAREDE"},{"$f":"Orçamento!S785","v":0},{"$f":"Orçamento!V785","v":0},{"$f":"Orçamento!X785","v":0}]
["","t.",{"$f":"Orçamento!P786","v":"FORROS"},{"$f":"Orçamento!S786","v":0},{"$f":"Orçamento!V786","v":0},{"$f":"Orçamento!X786","v":0}]
["","u.",{"$f":"Orçamento!P787","v":"REVESTIMENTO DE PISO"},{"$f":"Orçamento!S787","v":0},{"$f":"Orçamento!V787","v":0},{"$f":"Orçamento!X787","v":0}]
["","v.",{"$f":"Orçamento!P788","v":"FERRAGENS"},{"$f":"Orçamento!S788","v":0},{"$f":"Orçamento!V788","v":0},{"$f":"Orçamento!X788","v":0}]
["","w.",{"$f":"Orçamento!P789","v":"MARCENARIA"},{"$f":"Orçamento!S789","v":0},{"$f":"Orçamento!V789","v":0},{"$f":"Orçamento!X789","v":0}]
["","x.",{"$f":"Orçamento!P790","v":"ADMINISTRAÇÃO"},{"$f":"Orçamento!S790","v":0},{"$f":"Orçamento!V790","v":0},{"$f":"Orçamento!X790","v":0}]
["","y.",{"$f":"Orçamento!P791","v":"PINTURA"},{"$f":"Orçamento!S791","v":0},{"$f":"Orçamento!V791","v":0},{"$f":"Orçamento!X791","v":0}]
["","z.",{"$f":"Orçamento!P792","v":"DIVERSOS"},{"$f":"Orçamento!S792","v":0},{"$f":"Orçamento!V792","v":0},{"$f":"Orçamento!X792","v":0}]
["F","TOTAL GERAL DO ORÇAMENTO",null,{"$f":"SUM(D17:D42)","v":0},{"$f":"SUM(E17:E42)","v":0},{"$f":"SUM(F17:F42)","v":0}]
[]
[null,"(*) Para itens da AGETOP, os vidros não estão inclusos nas esquadrias e já foram considerados os custos de contramarco para as esquadrias de alumínio;"]

{"sheet":"Cronog_120_Dias","index":3,"n_rows":99,"n_cols":22,"rows_kept":99,"cut":false,"hidden":false,"merged":[[10,1,10,21],[9,8,9,21],[8,8,8,21],[3,8,3,21],[6,8,6,21],[5,8,5,21],[3,1,3,7],[56,4,58,4],[29,3,31,3],[35,1,37,2],[35,4,37,4],[50,3,52,3],[53,3,55,3],[12,21,13,21],[13,1,13,2],[13,5,13,8],[13,17,13,20],[12,3,13,3],[12,17,12,20],[14,1,16,2],[12,5,12,8],[17,1,19,2],[17,4,19,4],[17,5,17,8],[56,1,58,2],[68,4,70,4],[44,3,46,3],[62,1,64,2],[62,4,64,4],[38,1,40,2],[38,4,40,4],[59,3,61,3],[44,1,46,2],[44,4,46,4],[53,1,55,2],[50,1,52,2],[50,4,52,4],[20,1,22,2],[20,4,22,4],[20,5,20,8],[20,17,20,20],[22,5,22,8],[22,17,22,20],[20,3,22,3],[83,3,85,3],[53,4,55,4],[59,1,61,2],[59,4,61,4],[74,1,76,2],[77,1,79,2],[77,4,79,4],[80,1,82,2],[65,1,67,2],[68,3,70,3],[62,3,64,3],[68,1,70,2],[56,3,58,3],[65,4,67,4],[71,3,73,3],[74,3,76,3],[74,4,76,4],[14,3,16,3],[17,3,19,3],[14,4,16,4],[14,5,14,8],[14,17,14,20],[16,5,16,8],[16,17,16,20],[23,17,23,20],[25,5,25,8],[25,17,25,20],[17,17,17,20],[19,5,19,8],[19,17,19,20],[26,1,28,2],[26,4,28,4],[26,5,26,8],[26,17,26,20],[28,5,28,8],[28,17,28,20],[23,3,25,3],[23,1,25,2],[23,4,25,4],[23,5,23,8],[26,3,28,3],[25,9,25,12],[26,9,26,12],[28,9,28,12],[29,17,29,20],[31,5,31,8],[31,17,31,20],[32,1,34,2],[32,4,34,4],[32,5,32,8],[32,17,32,20],[34,5,34,8],[34,17,34,20],[32,3,34,3],[29,5,29,8],[29,1,31,2],[29,4,31,4],[29,9,29,12],[31,9,31,12],[32,9,32,12],[34,9,34,12],[35,17,35,20],[37,5,37,8],[37,17,37,20],[35,3,37,3],[40,17,40,20],[38,3,40,3],[38,17,38,20],[41,1,43,2],[41,4,43,4],[41,5,41,8],[41,17,41,20],[43,5,43,8],[43,17,43,20],[41,3,43,3],[35,5,35,8],[38,5,38,8],[40,5,40,8],[35,9,35,12],[37,9,37,12],[38,9,38,12],[40,9,40,12],[41,9,41,12],[43,9,43,12],[44,17,44,20],[46,5,46,8],[46,17,46,20],[47,1,49,2],[47,4,49,4],[47,5,47,8],[47,17,47,20],[49,5,49,8],[49,17,49,20],[44,5,44,8],[47,3,49,3],[44,9,44,12],[46,9,46,12],[47,9,47,12],[49,9,49,12],[46,13,46,16],[47,13,47,16],[49,13,49,16],[53,17,53,20],[55,5,55,8],[55,17,55,20],[50,5,50,8],[50,17,50,20],[52,5,52,8],[52,17,52,20],[56,17,56,20],[58,5,58,8],[58,17,58,20],[53,5,53,8],[56,5,56,8],[50,9,50,12],[52,9,52,12],[53,9,53,12],[55,9,55,12],[56,9,56,12],[58,9,58,12],[50,13,50,16],[52,13,52,16],[53,13,53,16],[55,13,55,16],[56,13,56,16],[58,13,58,16],[68,5,68,8],[65,5,65,8],[65,17,65,20],[67,5,67,8],[67,17,67,20],[65,3,67,3],[62,17,62,20],[64,5,64,8],[64,17,64,20],[62,5,62,8],[95,1,95,2],[95,5,95,8],[95,17,95,20],[97,1,97,4],[98,1,98,21],[86,17,86,20],[88,5,88,8],[88,17,88,20],[85,5,85,8],[85,17,85,20],[89,1,91,2],[89,4,91,4],[89,5,89,8],[89,17,89,20],[91,5,91,8],[91,17,91,20],[89,3,91,3],[86,4,88,4],[86,5,86,8],[86,3,88,3],[83,1,85,2],[83,4,85,4],[83,5,83,8],[83,17,83,20],[94,1,94,2],[94,5,94,8],[94,17,94,20],[76,5,76,8],[76,17,76,20],[77,5,77,8],[77,17,77,20],[79,5,79,8],[79,17,79,20],[80,5,80,8],[80,17,80,20],[82,5,82,8],[82,17,82,20],[77,3,79,3],[80,3,82,3],[86,1,88,2],[80,4,82,4],[86,9,86,12],[88,9,88,12],[89,9,89,12],[91,9,91,12],[92,9,92,12],[93,9,93,12],[94,9,94,12],[12,0,13,0],[9,0,11,0],[11,1,11,21],[92,1,92,2],[92,5,92,8],[92,17,92,20],[93,1,93,2],[93,5,93,8],[93,17,93,20],[74,17,74,20],[74,5,74,8],[68,17,68,20],[70,5,70,8],[70,17,70,20],[59,5,59,8],[71,1,73,2],[71,4,73,4],[71,5,71,8],[71,17,71,20],[73,5,73,8],[73,17,73,20],[59,17,59,20],[61,5,61,8],[61,17,61,20],[2,1,2,7],[5,1,5,7],[6,1,6,7],[8,1,8,7],[9,1,9,7],[4,1,4,21],[7,1,7,21],[0,1,0,21],[1,1,1,21],[2,8,2,21],[12,9,12,12],[13,9,13,12],[14,9,14,12],[16,9,16,12],[17,9,17,12],[19,9,19,12],[20,9,20,12],[22,9,22,12],[23,9,23,12],[59,9,59,12],[61,9,61,12],[62,9,62,12],[64,9,64,12],[65,9,65,12],[67,9,67,12],[68,9,68,12],[70,9,70,12],[71,9,71,12],[73,9,73,12],[74,9,74,12],[76,9,76,12],[77,9,77,12],[79,9,79,12],[80,9,80,12],[82,9,82,12],[83,9,83,12],[85,9,85,12],[95,9,95,12],[12,13,12,16],[13,13,13,16],[14,13,14,16],[16,13,16,16],[17,13,17,16],[19,13,19,16],[20,13,20,16],[22,13,22,16],[23,13,23,16],[25,13,25,16],[26,13,26,16],[28,13,28,16],[29,13,29,16],[31,13,31,16],[32,13,32,16],[34,13,34,16],[35,13,35,16],[37,13,37,16],[38,13,38,16],[40,13,40,16],[41,13,41,16],[43,13,43,16],[44,13,44,16],[59,13,59,16],[61,13,61,16],[62,13,62,16],[64,13,64,16],[65,13,65,16],[67,13,67,16],[68,13,68,16],[70,13,70,16],[71,13,71,16],[86,13,86,16],[88,13,88,16],[89,13,89,16],[91,13,91,16],[92,13,92,16],[93,13,93,16],[94,13,94,16],[95,13,95,16],[73,13,73,16],[74,13,74,16],[76,13,76,16],[77,13,77,16],[79,13,79,16],[80,13,80,16],[82,13,82,16],[83,13,83,16],[85,13,85,16]]}
[]
[]
[null,"UNIDADE ESCOLAR",null,null,null,null,null,null,"PRAZO"]
[null,{"$f":"Orçamento!$O$4","v":"CENTRO DE ENSINO EM PERÍODO INTEGRAL JOSÉ SALVIANO AZEVEDO"},null,null,null,null,null,null,"120 DIAS CORRIDOS"]
[]
[null,"OBRA",null,null,null,null,null,null,"DATA"]
[null,{"$f":"Orçamento!$O$7","v":"REFORMA E REFORMA"},null,null,null,null,null,null,{"$f":"Orçamento!$S$7","v":"2020-04-23"}]
[]
[null,"LOCAL",null,null,null,null,null,null,"ÁREA TOTAL CONSTRUÍDA (M²)"]
["FILTRO",{"$f":"Orçamento!$V$7","v":"SANTA HELENA DE GOIÁS"},null,null,null,null,null,null,{"$f":"Orçamento!$S$13","v":4521.6399999999994}]
[]
[null,"CRONOGRAMA - FÍSICO FINANCEIRO"]
["↓","CUSTO TOTAL:",{"$f":"D93","v":0},"VALOR","Dias:",30,null,null,null,60,null,null,null,90,null,null,null,120,null,null,null,"TOTAL"]
[null,"DESCRIÇÃO DOS SERVIÇOS",null,null,"%","1ª PARCELA",null,null,null,"2ª PARCELA",null,null,null,"2ª PARCELA",null,null,null,"2ª PARCELA"]
[{"$f":"IF(D15>0,\"F\",\"\")","v":""},"SERVIÇOS PRELIMINARES",null,{"$f":"Orçamento!V767","v":0},{"$f":"Orçamento!X767","v":0},{"$f":"D15-J15-N15-R15","v":0},null,null,null,{"$f":"ROUND(J17*$D$15,2)","v":0},null,null,null,{"$f":"ROUND(N17*$D$15,2)","v":0},null,null,null,{"$f":"ROUND(R17*$D$15,2)","v":0},null,null,null,{"$f":"SUM(F15:U15)","v":0}]
[{"$f":"IF(A15=\"F\",A15,\"\")","v":""}]
[{"$f":"IF(A16=\"F\",A16,\"\")","v":""},null,null,null,null,0.3,null,null,null,0.25,null,null,null,0.25,null,null,null,0.2,null,null,null,{"$f":"IFERROR(E15/100,\"\")","v":0}]
[{"$f":"IF(D18>0,\"F\",\"\")","v":""},"TRANSPORTES",null,{"$f":"Orçamento!V768","v":0},{"$f":"Orçamento!X768","v":0},{"$f":"ROUND(F20*$D$18,2)-0.01","v":-0.01},null,null,null,{"$f":"ROUND(J20*$D$18,2)","v":0},null,null,null,{"$f":"ROUND(N20*$D$18,2)","v":0},null,null,null,{"$f":"ROUND(R20*$D$18,2)","v":0},null,null,null,{"$f":"SUM(F18:U18)","v":-0.01}]
[{"$f":"IF(A18=\"F\",A18,\"\")","v":""}]
[{"$f":"IF(A19=\"F\",A19,\"\")","v":""},null,null,null,null,0.27,null,null,null,0.23,null,null,null,0.25,null,null,null,0.25,null,null,null,{"$f":"IFERROR(E18/100,\"\")","v":0}]
[{"$f":"IF(D21>0,\"F\",\"\")","v":""},"SERVIÇO EM TERRA",null,{"$f":"Orçamento!V769","v":0},{"$f":"Orçamento!X769","v":0},{"$f":"ROUND(F23*$D$21,2)","v":0},null,null,null,{"$f":"ROUND(J23*$D$21,2)","v":0},null,null,null,{"$f":"ROUND(N23*$D$21,2)","v":0},null,null,null,{"$f":"ROUND(R23*$D$21,2)","v":0},null,null,null,{"$f":"SUM(F21:U21)","v":0}]
[{"$f":"IF(A21=\"F\",A21,\"\")","v":""}]
[{"$f":"IF(A22=\"F\",A22,\"\")","v":""},null,null,null,null,1,null,null,null,null,null,null,null,null,null,null,null,{"$f":"1-F23","v":0},null,null,null,{"$f":"IFERROR(E21/100,\"\")","v":0}]
[{"$f":"IF(D24>0,\"F\",\"\")","v":""},"FUNDAÇÕES E SONDAGENS",null,{"$f":"Orçamento!V770","v":0},{"$f":"Orçamento!X770","v":0},{"$f":"ROUND(F26*$D$24,2)","v":0},null,null,null,{"$f":"ROUND(J26*$D$24,2)","v":0},null,null,null,{"$f":"ROUND(N26*$D$24,2)","v":0},null,null,null,{"$f":"ROUND(R26*$D$24,2)","v":0},null,null,null,{"$f":"SUM(F24:U24)","v":0}]
[{"$f":"IF(A24=\"F\",A24,\"\")","v":""}]
[{"$f":"IF(A25=\"F\",A25,\"\")","v":""},null,null,null,null,0.8,null,null,null,0.2,null,null,null,null,null,null,null,null,null,null,null,{"$f":"IFERROR(E24/100,\"\")","v":0}]
[{"$f":"IF(D27>0,\"F\",\"\")","v":""},"ESTRUTURA",null,{"$f":"Orçamento!V771","v":0},{"$f":"Orçamento!X771","v":0},{"$f":"ROUND(F29*$D$27,2)","v":0},null,null,null,{"$f":"ROUND(J29*$D$27,2)","v":0},null,null,null,{"$f":"ROUND(N29*$D$27,2)","v":0},null,null,null,{"$f":"ROUND(R29*$D$27,2)","v":0},null,null,null,{"$f":"SUM(F27:U27)","v":0}]
[{"$f":"IF(A27=\"F\",A27,\"\")","v":""}]
[{"$f":"IF(A28=\"F\",A28,\"\")","v":""},null,null,null,null,0.2,null,null,null,0.8,null,null,null,null,null,null,null,null,null,null,null,{"$f":"IFERROR(E27/100,\"\")","v":0}]
[{"$f":"IF(D30>0,\"F\",\"\")","v":""},"INST.ELET/TELEFÔNICA/CABEAMENTO ESTRUTURADO",null,{"$f":"Orçamento!V772","v":0},{"$f":"Orçamento!X772","v":0},{"$f":"ROUND(F32*$D$30,2)","v":0},null,null,null,{"$f":"ROUND(J32*$D$30,2)","v":0},null,null,null,{"$f":"ROUND(N32*$D$30,2)","v":0},null,null,null,{"$f":"ROUND(R32*$D$30,2)","v":0},null,null,null,{"$f":"SUM(F30:U30)","v":0}]
[{"$f":"IF(A30=\"F\",A30,\"\")","v":""}]
[{"$f":"IF(A31=\"F\",A31,\"\")","v":""},null,null,null,null,0.4,null,null,null,0.3,null,null,null,0.2,null,null,null,0.1,null,null,null,{"$f":"IFERROR(E30/100,\"\")","v":0}]
[{"$f":"IF(D33>0,\"F\",\"\")","v":""},"INSTALAÇÕES HIDROSSANITÁRIAS",null,{"$f":"Orçamento!V773","v":0},{"$f":"Orçamento!X773","v":0},{"$f":"D33-J33-N33","v":0},null,null,null,{"$f":"ROUND(J35*$D$33,2)","v":0},null,null,null,{"$f":"ROUND(N35*$D$33,2)","v":0},null,null,null,{"$f":"ROUND(R35*$D$33,2)","v":0},null,null,null,{"$f":"SUM(F33:U33)","v":0}]
[{"$f":"IF(A33=\"F\",A33,\"\")","v":""}]
[{"$f":"IF(A34=\"F\",A34,\"\")","v":""},null,null,null,null,0.4,null,null,null,0.3,null,null,null,0.3,null,null,null,null,null,null,null,{"$f":"IFERROR(E33/100,\"\")","v":0}]
[{"$f":"IF(D36>0,\"F\",\"\")","v":""},"INSTALAÇÕES ESPECIAIS",null,{"$f":"Orçamento!V774","v":0},{"$f":"Orçamento!X774","v":0},{"$f":"ROUND(F38*$D$36,2)","v":0},null,null,null,{"$f":"ROUND(J38*$D$36,2)","v":0},null,null,null,{"$f":"ROUND(N38*$D$36,2)","v":0},null,null,null,{"$f":"ROUND(R38*$D$36,2)","v":0},null,null,null,{"$f":"SUM(F36:U36)","v":0}]
[{"$f":"IF(A36=\"F\",A36,\"\")","v":""}]
[{"$f":"IF(A37=\"F\",A37,\"\")","v":""},null,null,null,null,1,null,null,null,null,null,null,null,null,null,null,null,{"$f":"1-F38","v":0},null,null,null,{"$f":"IFERROR(E36/100,\"\")","v":0}]
[{"$f":"IF(D39>0,\"F\",\"\")","v":""},"ALVENARIA E DIVISÓRIAS",null,{"$f":"Orçamento!V775","v":0},{"$f":"Orçamento!X775","v":0},{"$f":"ROUND(F41*$D$39,2)","v":0},null,null,null,{"$f":"ROUND(J41*$D$39,2)","v":0},null,null,null,{"$f":"ROUND(N41*$D$39,2)","v":0},null,null,null,{"$f":"ROUND(R41*$D$39,2)","v":0},null,null,null,{"$f":"SUM(F39:U39)","v":0}]
[{"$f":"IF(A39=\"F\",A39,\"\")","v":""}]
[{"$f":"IF(A40=\"F\",A40,\"\")","v":""},null,null,null,null,null,null,null,null,0.6,null,null,null,0.2,null,null,null,0.2,null,null,null,{"$f":"IFERROR(E39/100,\"\")","v":0}]
[{"$f":"IF(D42>0,\"F\",\"\")","v":""},"ALVENARIA AUTO-PORTANTE",null,{"$f":"Orçamento!V776","v":0},{"$f":"Orçamento!X776","v":0},{"$f":"ROUND(F44*$D$42,2)","v":0},null,null,null,{"$f":"ROUND(J44*$D$42,2)","v":0},null,null,null,{"$f":"ROUND(N44*$D$42,2)","v":0},null,null,null,{"$f":"ROUND(R44*$D$42,2)","v":0},null,null,null,{"$f":"SUM(F42:U42)","v":0}]
[{"$f":"IF(A42=\"F\",A42,\"\")","v":""}]
[{"$f":"IF(A43=\"F\",A43,\"\")","v":""},null,null,null,null,1,null,null,null,{"$f":"1-B44","v":1},null,null,null,{"$f":"1-B44","v":1},null,null,null,{"$f":"1-F44","v":0},null,null,null,{"$f":"IFERROR(E42/100,\"\")","v":0}]
[{"$f":"IF(D45>0,\"F\",\"\")","v":""},"IMPERMEABILIZAÇÃO",null,{"$f":"Orçamento!V777","v":0},{"$f":"Orçamento!X777","v":0},{"$f":"ROUND(F47*$D$45,2)","v":0},null,null,null,{"$f":"ROUND(J47*$D$45,2)","v":0},null,null,null,{"$f":"ROUND(N47*$D$45,2)","v":0},null,null,null,{"$f":"ROUND(R47*$D$45,2)","v":0},null,null,null,{"$f":"SUM(F45:U45)","v":0}]
[{"$f":"IF(A45=\"F\",A45,\"\")","v":""}]
[{"$f":"IF(A46=\"F\",A46,\"\")","v":""},null,null,null,null,0.8,null,null,null,0.2,null,null,null,null,null,null,null,null,null,null,null,{"$f":"IFERROR(E45/100,\"\")","v":0}]
[{"$f":"IF(D48>0,\"F\",\"\")","v":""},"ISOLAMENTO TÉRMICO E ACÚSTICO",null,{"$f":"Orçamento!V778","v":0},{"$f":"Orçamento!X778","v":0},{"$f":"ROUND(F50*$D$48,2)","v":0},null,null,null,{"$f":"ROUND(J50*$D$48,2)","v":0},null,null,null,{"$f":"ROUND(N50*$D$48,2)","v":0},null,null,null,{"$f":"ROUND(R50*$D$48,2)","v":0},null,null,null,{"$f":"SUM(F48:U48)","v":0}]
[{"$f":"IF(A48=\"F\",A48,\"\")","v":""}]
[{"$f":"IF(A49=\"F\",A49,\"\")","v":""},null,null,null,null,0.5,null,null,null,{"$f":"1-B50","v":1},null,null,null,{"$f":"1-B50","v":1},null,null,null,{"$f":"1-F50","v":0.5},null,null,null,{"$f":"IFERROR(E48/100,\"\")","v":0}]
[{"$f":"IF(D51>0,\"F\",\"\")","v":""},"ESTRUTURA DE MADEIRA",null,{"$f":"Orçamento!V779","v":0},{"$f":"Orçamento!X779","v":0},{"$f":"ROUND(F53*$D$51,2)","v":0},null,null,null,{"$f":"ROUND(J53*$D$51,2)","v":0},null,null,null,{"$f":"ROUND(N53*$D$51,2)","v":0},null,null,null,{"$f":"ROUND(R53*$D$51,2)","v":0},null,null,null,{"$f":"SUM(F51:U51)","v":0}]
[{"$f":"IF(A51=\"F\",A51,\"\")","v":""}]
[{"$f":"IF(A52=\"F\",A52,\"\")","v":""},null,null,null,null,0.2,null,null,null,0.8,null,null,null,null,null,null,null,null,null,null,null,{"$f":"IFERROR(E51/100,\"\")","v":0}]
[{"$f":"IF(D54>0,\"F\",\"\")","v":""},"ESTRUTURA METÁLICA",null,{"$f":"Orçamento!V780","v":0},{"$f":"Orçamento!X780","v":0},{"$f":"ROUND(F56*$D$54,2)","v":0},null,null,null,{"$f":"ROUND(J56*$D$54,2)","v":0},null,null,null,{"$f":"ROUND(N56*$D$54,2)","v":0},null,null,null,{"$f":"ROUND(R56*$D$54,2)","v":0},null,null,null,{"$f":"SUM(F54:U54)","v":0}]
[{"$f":"IF(A54=\"F\",A54,\"\")","v":""}]
[{"$f":"IF(A55=\"F\",A55,\"\")","v":""},null,null,null,null,0.2,null,null,null,0.8,null,null,null,null,null,null,null,null,null,null,null,{"$f":"IFERROR(E54/100,\"\")","v":0}]
[{"$f":"IF(D57>0,\"F\",\"\")","v":""},"COBERTURAS",null,{"$f":"Orçamento!V781","v":0},{"$f":"Orçamento!X781","v":0},{"$f":"ROUND(F59*$D$57,2)","v":0},null,null,null,{"$f":"ROUND(J59*$D$57,2)","v":0},null,null,null,{"$f":"ROUND(N59*$D$57,2)","v":0},null,null,null,{"$f":"ROUND(R59*$D$57,2)","v":0},null,null,null,{"$f":"SUM(F57:U57)","v":0}]
[{"$f":"IF(A57=\"F\",A57,\"\")","v":""}]
[{"$f":"IF(A58=\"F\",A58,\"\")","v":""},null,null,null,null,0,null,null,null,0.6,null,null,null,0.4,null,null,null,null,null,null,null,{"$f":"IFERROR(E57/100,\"\")","v":0}]
[{"$f":"IF(D60>0,\"F\",\"\")","v":""},"ESQUADRIAS DE MADEIRA",null,{"$f":"Orçamento!V782","v":0},{"$f":"Orçamento!X782","v":0},{"$f":"ROUND(F62*$D$60,2)","v":0},null,null,null,{"$f":"ROUND(J62*$D$60,2)","v":0},null,null,null,{"$f":"ROUND(N62*$D$60,2)","v":0},null,null,null,{"$f":"ROUND(R62*$D$60,2)","v":0},null,null,null,{"$f":"SUM(F60:U60)","v":0}]
[{"$f":"IF(A60=\"F\",A60,\"\")","v":""}]
[{"$f":"IF(A61=\"F\",A61,\"\")","v":""},null,null,null,null,0.54,null,null,null,{"$f":"1-B62","v":1},null,null,null,{"$f":"1-B62","v":1},null,null,null,{"$f":"1-F62","v":0.45999999999999996},null,null,null,{"$f":"IFERROR(E60/100,\"\")","v":0}]
[{"$f":"IF(D63>0,\"F\",\"\")","v":""},"ESQUADRIAS METÁLICAS",null,{"$f":"Orçamento!V783","v":0},{"$f":"Orçamento!X783","v":0},{"$f":"ROUND(F65*$D$63,2)","v":0},null,null,null,{"$f":"ROUND(J65*$D$63,2)","v":0},null,null,null,{"$f":"ROUND(N65*$D$63,2)","v":0},null,null,null,{"$f":"ROUND(R65*$D$63,2)","v":0},null,null,null,{"$f":"SUM(F63:U63)","v":0}]
[{"$f":"IF(A63=\"F\",A63,\"\")","v":""}]
[{"$f":"IF(A64=\"F\",A64,\"\")","v":""},null,null,null,null,null,null,null,null,0.6,null,null,null,0.4,null,null,null,null,null,null,null,{"$f":"IFERROR(E63/100,\"\")","v":0}]
[{"$f":"IF(D66>0,\"F\",\"\")","v":""},"VIDROS",null,{"$f":"Orçamento!V784","v":0},{"$f":"Orçamento!X784","v":0},{"$f":"ROUND(F68*$D$66,2)","v":0},null,null,null,{"$f":"ROUND(J68*$D$66,2)","v":0},null,null,null,{"$f":"ROUND(N68*$D$66,2)","v":0},null,null,null,{"$f":"ROUND(R68*$D$66,2)","v":0},null,null,null,{"$f":"SUM(F66:U66)","v":0}]
[{"$f":"IF(A66=\"F\",A66,\"\")","v":""}]
[{"$f":"IF(A67=\"F\",A67,\"\")","v":""},null,null,null,null,0,null,null,null,null,null,null,null,null,null,null,null,{"$f":"1-F68","v":1},null,null,null,{"$f":"IFERROR(E66/100,\"\")","v":0}]
[{"$f":"IF(D69>0,\"F\",\"\")","v":""},"REVESTIMENTO DE PAREDE",null,{"$f":"Orçamento!V785","v":0},{"$f":"Orçamento!X785","v":0},{"$f":"ROUND(F71*$D$69,2)","v":0},null,null,null,{"$f":"D69-N69-R69","v":0},null,null,null,{"$f":"ROUND(N71*$D$69,2)","v":0},null,null,null,{"$f":"ROUND(R71*$D$69,2)","v":0},null,null,null,{"$f":"SUM(F69:U69)","v":0}]
[{"$f":"IF(A69=\"F\",A69,\"\")","v":""}]
[{"$f":"IF(A70=\"F\",A70,\"\")","v":""},null,null,null,null,null,null,null,null,0.6,null,null,null,0.2,null,null,null,0.2,null,null,null,{"$f":"IFERROR(E69/100,\"\")","v":0}]
[{"$f":"IF(D72>0,\"F\",\"\")","v":""},"FORROS",null,{"$f":"Orçamento!V786","v":0},{"$f":"Orçamento!X786","v":0},{"$f":"ROUND(F74*$D$72,2)","v":0},null,null,null,{"$f":"ROUND(J74*$D$72,2)","v":0},null,null,null,{"$f":"ROUND(N74*$D$72,2)","v":0},null,null,null,{"$f":"ROUND(R74*$D$72,2)","v":0},null,null,null,{"$f":"SUM(F72:U72)","v":0}]
[{"$f":"IF(A72=\"F\",A72,\"\")","v":""}]
[{"$f":"IF(A73=\"F\",A73,\"\")","v":""},null,null,null,null,null,null,null,null,null,null,null,null,null,null,null,null,{"$f":"1-F74","v":1},null,null,null,{"$f":"IFERROR(E72/100,\"\")","v":0}]
[{"$f":"IF(D75>0,\"F\",\"\")","v":""},"REVESTIMENTO DE PISO",null,{"$f":"Orçamento!V787","v":0},{"$f":"Orçamento!X787","v":0},{"$f":"ROUND(F77*$D$75,2)","v":0},null,null,null,{"$f":"ROUND(J77*$D$75,2)","v":0},null,null,null,{"$f":"ROUND(N77*$D$75,2)","v":0},null,null,null,{"$f":"ROUND(R77*$D$75,2)","v":0},null,null,null,{"$f":"SUM(F75:U75)","v":0}]
[{"$f":"IF(A75=\"F\",A75,\"\")","v":""}]
[{"$f":"IF(A76=\"F\",A76,\"\")","v":""},null,null,null,null,0.2,null,null,null,0.3,null,null,null,0.5,null,null,null,null,null,null,null,{"$f":"IFERROR(E75/100,\"\")","v":0}]
[{"$f":"IF(D78>0,\"F\",\"\")","v":""},"FERRAGENS",null,{"$f":"Orçamento!V788","v":0},{"$f":"Orçamento!X788","v":0},{"$f":"ROUND(F80*$D$78,2)","v":0},null,null,null,{"$f":"ROUND(J80*$D$78,2)","v":0},null,null,null,{"$f":"ROUND(N80*$D$78,2)","v":0},null,null,null,{"$f":"ROUND(R80*$D$78,2)","v":0},null,null,null,{"$f":"SUM(F78:U78)","v":0}]
[{"$f":"IF(A78=\"F\",A78,\"\")","v":""}]
[{"$f":"IF(A79=\"F\",A79,\"\")","v":""},null,null,null,null,0,null,null,null,null,null,null,null,null,null,null,null,{"$f":"1-F80","v":1},null,null,null,{"$f":"IFERROR(E78/100,\"\")","v":0}]
[{"$f":"IF(D81>0,\"F\",\"\")","v":""},"MARCENARIA",null,{"$f":"Orçamento!V789","v":0},{"$f":"Orçamento!X789","v":0},{"$f":"ROUND(F83*$D$81,2)","v":0},null,null,null,{"$f":"ROUND(J83*$D$81,2)","v":0},null,null,null,{"$f":"ROUND(N83*$D$81,2)","v":0},null,null,null,{"$f":"ROUND(R83*$D$81,2)","v":0},null,null,null,{"$f":"SUM(F81:U81)","v":0}]
[{"$f":"IF(A81=\"F\",A81,\"\")","v":""}]
[{"$f":"IF(A82=\"F\",A82,\"\")","v":""},null,null,null,null,null,null,null,null,null,null,null,null,0.8,null,null,null,0.2,null,null,null,{"$f":"IFERROR(E81/100,\"\")","v":0}]
[{"$f":"IF(D84>0,\"F\",\"\")","v":""},"ADMINISTRAÇÃO - MENSALISTAS",null,{"$f":"Orçamento!V790","v":0},{"$f":"Orçamento!X790","v":0},{"$f":"ROUND(F86*$D$84,2)-0.01","v":-0.01},null,null,null,{"$f":"ROUND(J86*$D$84,2)","v":0},null,null,null,{"$f":"ROUND(N86*$D$84,2)","v":0},null,null,null,{"$f":"ROUND(R86*$D$84,2)","v":0},null,null,null,{"$f":"SUM(F84:U84)","v":-0.01}]
[{"$f":"IF(A84=\"F\",A84,\"\")","v":""}]
[{"$f":"IF(A85=\"F\",A85,\"\")","v":""},null,null,null,null,0.26,null,null,null,0.24,null,null,null,0.26,null,null,null,0.24,null,null,null,{"$f":"IFERROR(E84/100,\"\")","v":0}]
[{"$f":"IF(D87>0,\"F\",\"\")","v":""},"PINTURA",null,{"$f":"Orçamento!V791","v":0},{"$f":"Orçamento!X791","v":0},{"$f":"ROUND(F89*$D$87,2)","v":0},null,null,null,{"$f":"ROUND(J89*$D$87,2)","v":0},null,null,null,{"$f":"ROUND(N89*$D$87,2)","v":0},null,null,null,{"$f":"ROUND(R89*$D$87,2)","v":0},null,null,null,{"$f":"SUM(F87:U87)","v":0}]
[{"$f":"IF(A87=\"F\",A87,\"\")","v":""}]
[{"$f":"IF(A88=\"F\",A88,\"\")","v":""},null,null,null,null,0,null,null,null,null,null,null,null,0.6,null,null,null,0.4,null,null,null,{"$f":"IFERROR(E87/100,\"\")","v":0}]
[{"$f":"IF(D90>0,\"F\",\"\")","v":""},"DIVERSOS",null,{"$f":"Orçamento!V792","v":0},{"$f":"Orçamento!X792","v":0},{"$f":"D90-J90-N90-R90","v":0},null,null,null,{"$f":"ROUND(J92*$D$90,2)","v":0},null,null,null,{"$f":"ROUND(N92*$D$90,2)","v":0},null,null,null,{"$f":"ROUND(R92*$D$90,2)","v":0},null,null,null,{"$f":"SUM(F90:U90)","v":0}]
[{"$f":"IF(A90=\"F\",A90,\"\")","v":""}]
[{"$f":"IF(A91=\"F\",A91,\"\")","v":""},null,null,null,null,0.26,null,null,null,0.24,null,null,null,0.26,null,null,null,0.24,null,null,null,{"$f":"IFERROR(E90/100,\"\")","v":0}]
["F","CUSTO DO ORÇAMENTO",null,{"$f":"SUM(D15:D92)","v":0},{"$f":"SUM(E15:E92)","v":0},{"$f":"F15+F18+F21+F24+F27+F30+F33+F36+F39+F42+F45+F48+F51+F54+F57+F60+F63+F66+F69+F72+F75+F78+F81+F84+F87+F90","v":-0.02},null,null,null,{"$f":"J15+J18+J21+J24+J27+J30+J33+J36+J39+J42+J45+J48+J51+J54+J57+J60+J63+J66+J69+J72+J75+J78+J81+J84+J87+J90","v":0},null,null,null,{"$f":"N15+N18+N21+N24+N27+N30+N33+N36+N39+N42+N45+N48+N51+N54+N57+N60+N63+N66+N69+N72+N75+N78+N81+N84+N87+N90","v":0},null,null,null,{"$f":"R15+R18+R21+R24+R27+R30+R33+R36+R39+R42+R45+R48+R51+R54+R57+R60+R63+R66+R69+R72+R75+R78+R81+R84+R87+R90","v":0},null,null,null,{"$f":"V15+V18+V21+V24+V27+V30+V33+V36+V39+V42+V45+V48+V51+V54+V57+V60+V63+V66+V69+V72+V75+V78+V81+V84+V87+V90","v":-0.02}]
["F","PERCENTUAIS:",null,null,null,{"$f":"TRUNC(IFERROR(F93/D93,\"\"),4)","v":{"$error":"#VALUE!"}},null,null,null,{"$f":"TRUNC(IFERROR(J93/D93,\"\"),4)","v":{"$error":"#VALUE!"}},null,null,null,{"$f":"TRUNC(IFERROR(N93/D93,\"\"),4)","v":{"$error":"#VALUE!"}},null,null,null,{"$f":"ROUNDUP(IFERROR(R93/D93,\"\"),4)","v":{"$error":"#VALUE!"}},null,null,null,{"$f":"SUM(F94:U94)","v":{"$error":"#VALUE!"}}]
["F","TOTAIS ACUMULADOS:",null,null,null,{"$f":"F93","v":-0.02},null,null,null,{"$f":"F95+J93","v":-0.02},null,null,null,{"$f":"J95+N93","v":-0.02},null,null,null,{"$f":"N95+R93","v":-0.02}]
["F","PERCENTUAIS  ACUMULADOS:",null,null,null,{"$f":"F94","v":{"$error":"#VALUE!"}},null,null,null,{"$f":"F96+J94","v":{"$error":"#VALUE!"}},null,null,null,{"$f":"J96+N94","v":{"$error":"#VALUE!"}},null,null,null,{"$f":"N96+R94","v":{"$error":"#VALUE!"}}]
["F"]
["F","OBSERVAÇÕES:"]
["F","Os pagamentos somente poderão ser efetuados mediante medição e atesto pelos técnicos da Secretaria da Educação. "]

{"sheet":"Composição BDI","index":4,"n_rows":45,"n_cols":9,"rows_kept":45,"cut":false,"hidden":false,"merged":[[18,5,18,8],[17,0,17,3],[16,0,16,3],[44,0,44,3],[42,0,42,3],[43,0,43,3],[18,0,18,3],[36,0,36,3],[39,0,39,3],[38,0,38,3],[40,0,40,3],[29,0,29,2],[32,0,32,3],[33,0,33,3],[34,0,34,3],[35,0,35,3],[0,0,0,3],[1,0,1,3],[4,0,4,3],[7,0,7,3],[10,0,10,3],[2,0,2,3],[3,0,3,3],[5,0,5,3],[6,0,6,3],[8,0,8,3],[9,0,9,3],[11,0,11,3],[12,0,12,3],[14,0,14,3],[15,0,15,3],[13,0,13,3]]}
[]
[]
["UNIDADE ESCOLAR"]
[{"$f":"Orçamento!$O$4","v":"CENTRO DE ENSINO EM PERÍODO INTEGRAL JOSÉ SALVIANO AZEVEDO"}]
[]
["OBRA"]
[{"$f":"Orçamento!$O$7","v":"REFORMA E REFORMA"}]
[]
["ENDEREÇO"]
[{"$f":"Orçamento!$R$10","v":"RUA JACINTO F SOUSA 950, CENTRO, CEP:75920-000"}]
[]
["CIDADE"]
[{"$f":"Orçamento!$V$7","v":"SANTA HELENA DE GOIÁS"}]
[]
["CRE"]
[{"$f":"Orçamento!$O$10","v":"SANTA HELENA"}]
[]
["DETALHAMENTO DA COMPOSIÇÃO DE BDI"]
["COMPOSIÇÃO BDI PARA OBRAS CIVIS",null,null,null,null,"BDI CONSTRUÇÃO E REFORMA"]
["DESCRIÇÃO","COEF.","TAXA % (a.m)","% no preço de venda",null,"Situação","1º Quartil","Médio","3º Quartil"]
["1) COFINS",1,0.03,{"$f":"C21","v":0.03},null,{"$f":"IF(OR(C21<G21,C21>I21),\"FORA DO INTERVALO\",\"OK\")","v":"OK"},0.03,0.03,0.03]
["2) PIS",1,6.4999999999999997E-3,{"$f":"C22","v":6.4999999999999997E-3},null,{"$f":"IF(OR(C22<G22,C22>I22),\"FORA DO INTERVALO\",\"OK\")","v":"OK"},6.4999999999999997E-3,6.4999999999999997E-3,6.4999999999999997E-3]
["3) ISSQN",1,0.03,{"$f":"C23*B23","v":0.03},null,"OK",0.02,3.5000000000000003E-2,0.05]
["4) CPRB",1,4.4999999999999998E-2,{"$f":"C24","v":4.4999999999999998E-2},null,"OK",4.4999999999999998E-2,4.4999999999999998E-2,4.4999999999999998E-2]
["5) Administração Central",1,3.1199999999999999E-2,3.1199999999999999E-2,null,"OK",0.03,0.04,5.5E-2]
["6) Despesas Financeiras",1,5.5999999999999999E-3,5.5999999999999999E-3,null,"FORA DO INTERVALO",5.8999999999999999E-3,1.23E-2,1.3899999999999999E-2]
["7) Seguros + Garantias",1,1.1999999999999999E-3,1.1999999999999999E-3,null,"FORA DO INTERVALO",8.0000000000000002E-3,8.0000000000000002E-3,0.01]
["8) Risco",1,9.7000000000000003E-3,9.7000000000000003E-3,null,"OK",9.7000000000000003E-3,1.2699999999999999E-2,1.2699999999999999E-2]
["9) Lucro",1,7.1999999999999995E-2,7.1999999999999995E-2,null,"OK",6.1600000000000002E-2,7.3999999999999996E-2,8.9599999999999999E-2]
["BDI - FINAL",null,null,{"$f":"(((1+D25+D27+D28)*(1+D26)*(1+D29))/(1-(D21+D22+D23+D24))-1)","v":0.26436368567248203},null,{"$f":"IF(OR(D30<G30,D30>I30),\"FORA DO INTERVALO\",\"OK\")","v":"FORA DO INTERVALO"},0.2034,0.22120000000000001,0.25]
[]
["Notas:"]
["(1) e (2) Alíquota definida por lei."]
["(3) Alíquota e base de cálculo definidas pela legislação municipal."]
["(4) Alíquota definida pelas leis 12.546/11, 12844/13 e 13.161/15 (CPRB – contribuição previdenciária sobre a receita bruta)."]
["(5) Valores definidos a partir dos limites no Acórdão nº 2.622/2013 - TCU – Plenário. Valores entre o 1º e 3º quartis."]
["(6) Valor calculado pela expressão matemática do acórdão 2.369/2011 – TCU – Plenário e disponibilizado pela AGETOP em dezembro de 2018. (Foi utilizado para o cálculo a média da Taxa SELIC no período de 11/2017 a 10/2018)"]
[]
["(7) Valores definidos pela AGETOP a partir dos limites no Acórdão nº 2.622/2013 - TCU – Plenário. Valores médios. \n\nObservação da AGETOP: (Seguros contra erros de execução, incêndio e explosão, danos da natureza (vendaval, destelhamento, alagamento, inundação, desmoronamento, geadas etc.), emprego de material defeituoso ou inadequado, roubo e/ou furto qualificado, quebra de equipamentos, desmoronamento de estrutura, nas modalidades de Obras Civis em Construção (OCC); Instalação e Montagem (IM); e Obras Civis em Construção e Instalação e Montagem (OCC/IM). Bem como coberturas adicionais para ampliação dessas coberturas básicas, como: cobertura de responsabilidade civil geral, cobertura de responsabilidade civil cruzada, cobertura de despesas extraordinárias, cobertura de tumultos, cobertura de desentulho do local, cobertura de riscos do fabricante, dentre outras, incluindo o seguro de vida em grupo regido pela convenção coletiva dos trabalhadores na indústria da construção civil). A partir de 24/02/2015 por intermédio da Portaria 449/2015 a Presidência da AGETOP, na pessoa do Senhor Jayme Eduardo Rincon, determinou a exclusão dos valores referentes aos Seguros de Risco de Engenharia e Responsabilidade Civil do Profissional na composição do cálculo do B.D.I.."]
["(8) Valores definidos a partir dos limites no Acórdão nº 2.622/2013 - TCU – Plenário. Valores entre 1º e 3° quartis."]
["(9) Valores definidos a partir dos limites definidos no Acórdão nº 2.622/2013 - TCU – Plenário. Valores adotados e praticados no mercado ( “ ex ante ” ) ou aqueles entre os 1º e 3º quartis."]
[]
["(*) A fórmula para estipulação da taxa de BDI estimado adotado é a mesma que foi aplicada para a obtenção das tabelas contidas no Acórdão n. 2.622/2013 – TCUPlenário"]
[]
["Obs.: Para obras com valores superiores a R$ 20.000.000,00 sugere-se recalcular o BDI, dimensionando as taxas de administração central e lucro para patamares inferiores ao estipulado acima."]

{"sheet":"Relatório CENTRAL","index":5,"n_rows":40,"n_cols":5,"rows_kept":40,"cut":false,"hidden":false,"merged":[[10,1,10,4],[11,1,11,4],[39,1,39,2],[9,0,11,0],[0,1,0,4],[6,3,6,4],[9,3,9,4],[1,1,1,4],[2,1,2,2],[2,3,2,4],[3,1,3,2],[3,3,3,4],[4,1,4,4],[5,1,5,2],[5,3,5,4],[6,1,6,2],[7,1,7,4],[8,1,8,2],[8,3,8,4],[9,1,9,2]]}
[]
[]
[null,"UNIDADE ESCOLAR",null,"CIDADE"]
[null,{"$f":"Orçamento!$O$4","v":"CENTRO DE ENSINO EM PERÍODO INTEGRAL JOSÉ SALVIANO AZEVEDO"},null,{"$f":"Orçamento!$V$7","v":"SANTA HELENA DE GOIÁS"}]
[]
[null,"OBRA",null,"CRE"]
[null,{"$f":"Orçamento!$O$7","v":"REFORMA E REFORMA"},null,{"$f":"Orçamento!$O$10","v":"SANTA HELENA"}]
[]
[null,"ENDEREÇO",null,"DATA"]
["FILTRO",{"$f":"Orçamento!$R$10","v":"RUA JACINTO F SOUSA 950, CENTRO, CEP:75920-000"},null,{"$f":"Orçamento!$S$7","v":"2020-04-23"}]
[]
[null,"RELATÓRIO CENTRAL"]
["↓","CÓDIGO","ETAPA","PREÇO  (R$) C/ BDI","PARTIC  ( % )"]
[{"$f":"IF(D14>0,\"F\",\"\")","v":""},{"$f":"Orçamento!O767","v":"a."},{"$f":"Orçamento!P767","v":"SERVIÇOS PRELIMINARES"},{"$f":"Orçamento!V767","v":0},{"$f":"Orçamento!X767","v":0}]
[{"$f":"IF(D15>0,\"F\",\"\")","v":""},{"$f":"Orçamento!O768","v":"b."},{"$f":"Orçamento!P768","v":"TRANSPORTES"},{"$f":"Orçamento!V768","v":0},{"$f":"Orçamento!X768","v":0}]
["",{"$f":"Orçamento!O769","v":"c."},{"$f":"Orçamento!P769","v":"SERVIÇO EM TERRA"},{"$f":"Orçamento!V769","v":0},{"$f":"Orçamento!X769","v":0}]
["",{"$f":"Orçamento!O770","v":"d."},{"$f":"Orçamento!P770","v":"FUNDAÇÕES E SONDAGENS"},{"$f":"Orçamento!V770","v":0},{"$f":"Orçamento!X770","v":0}]
["",{"$f":"Orçamento!O771","v":"e."},{"$f":"Orçamento!P771","v":"ESTRUTURA"},{"$f":"Orçamento!V771","v":0},{"$f":"Orçamento!X771","v":0}]
["",{"$f":"Orçamento!O772","v":"f."},{"$f":"Orçamento!P772","v":"INSTALAÇÕES ELÉTRICAS"},{"$f":"Orçamento!V772","v":0},{"$f":"Orçamento!X772","v":0}]
["",{"$f":"Orçamento!O773","v":"g."},{"$f":"Orçamento!P773","v":"INSTALAÇÕES HIDROSSANITÁRIAS"},{"$f":"Orçamento!V773","v":0},{"$f":"Orçamento!X773","v":0}]
["",{"$f":"Orçamento!O774","v":"h"},{"$f":"Orçamento!P774","v":"INSTALAÇÕES ESPECIAIS"},{"$f":"Orçamento!V774","v":0},{"$f":"Orçamento!X774","v":0}]
["",{"$f":"Orçamento!O775","v":"i."},{"$f":"Orçamento!P775","v":"ALVENARIAS E DIVISÓRIAS"},{"$f":"Orçamento!V775","v":0},{"$f":"Orçamento!X775","v":0}]
["",{"$f":"Orçamento!O776","v":"j."},{"$f":"Orçamento!P776","v":"ALVENARIA AUTO-PORTANTE"},{"$f":"Orçamento!V776","v":0},{"$f":"Orçamento!X776","v":0}]
["",{"$f":"Orçamento!O777","v":"k."},{"$f":"Orçamento!P777","v":"IMPERMEABILIZAÇÃO"},{"$f":"Orçamento!V777","v":0},{"$f":"Orçamento!X777","v":0}]
["",{"$f":"Orçamento!O778","v":"l."},{"$f":"Orçamento!P778","v":"ISOLAMENTO TÉRMICO E ACÚSTICO"},{"$f":"Orçamento!V778","v":0},{"$f":"Orçamento!X778","v":0}]
["",{"$f":"Orçamento!O779","v":"m."},{"$f":"Orçamento!P779","v":"ESTRUTURA DE MADEIRA"},{"$f":"Orçamento!V779","v":0},{"$f":"Orçamento!X779","v":0}]
["",{"$f":"Orçamento!O780","v":"n."},{"$f":"Orçamento!P780","v":"ESTRUTURAS METÁLICAS"},{"$f":"Orçamento!V780","v":0},{"$f":"Orçamento!X780","v":0}]
["",{"$f":"Orçamento!O781","v":"o."},{"$f":"Orçamento!P781","v":"COBERTURAS"},{"$f":"Orçamento!V781","v":0},{"$f":"Orçamento!X781","v":0}]
["",{"$f":"Orçamento!O782","v":"p."},{"$f":"Orçamento!P782","v":"ESQUADRIAS DE MADEIRA"},{"$f":"Orçamento!V782","v":0},{"$f":"Orçamento!X782","v":0}]
["",{"$f":"Orçamento!O783","v":"q."},{"$f":"Orçamento!P783","v":"ESQUADRIAS METÁLICAS"},{"$f":"Orçamento!V783","v":0},{"$f":"Orçamento!X783","v":0}]
["",{"$f":"Orçamento!O784","v":"r."},{"$f":"Orçamento!P784","v":"VIDROS"},{"$f":"Orçamento!V784","v":0},{"$f":"Orçamento!X784","v":0}]
["",{"$f":"Orçamento!O785","v":"s."},{"$f":"Orçamento!P785","v":"REVESTIMENTO DE PAREDE"},{"$f":"Orçamento!V785","v":0},{"$f":"Orçamento!X785","v":0}]
["",{"$f":"Orçamento!O786","v":"t."},{"$f":"Orçamento!P786","v":"FORROS"},{"$f":"Orçamento!V786","v":0},{"$f":"Orçamento!X786","v":0}]
["",{"$f":"Orçamento!O787","v":"u."},{"$f":"Orçamento!P787","v":"REVESTIMENTO DE PISO"},{"$f":"Orçamento!V787","v":0},{"$f":"Orçamento!X787","v":0}]
["",{"$f":"Orçamento!O788","v":"v."},{"$f":"Orçamento!P788","v":"FERRAGENS"},{"$f":"Orçamento!V788","v":0},{"$f":"Orçamento!X788","v":0}]
["",{"$f":"Orçamento!O789","v":"w."},{"$f":"Orçamento!P789","v":"MARCENARIA"},{"$f":"Orçamento!V789","v":0},{"$f":"Orçamento!X789","v":0}]
["",{"$f":"Orçamento!O790","v":"x."},{"$f":"Orçamento!P790","v":"ADMINISTRAÇÃO"},{"$f":"Orçamento!V790","v":0},{"$f":"Orçamento!X790","v":0}]
["",{"$f":"Orçamento!O791","v":"y."},{"$f":"Orçamento!P791","v":"PINTURA"},{"$f":"Orçamento!V791","v":0},{"$f":"Orçamento!X791","v":0}]
["",{"$f":"Orçamento!O792","v":"z."},{"$f":"Orçamento!P792","v":"DIVERSOS"},{"$f":"Orçamento!V792","v":0},{"$f":"Orçamento!X792","v":0}]
["F","TOTAL GERAL DO ORÇAMENTO (R$) C/BDI",null,{"$f":"SUM(D14:D39)","v":0},{"$f":"SUM(E14:E39)","v":0}]

{"sheet":"Parc Maior Relev","index":6,"n_rows":31,"n_cols":8,"rows_kept":31,"cut":false,"hidden":false,"merged":[[10,0,12,0],[8,1,8,3],[8,4,8,6],[31,3,31,7],[29,1,29,6],[0,1,0,6],[11,1,11,6],[1,1,1,6],[2,1,2,3],[2,4,2,6],[3,1,3,3],[3,4,3,6],[4,1,4,6],[5,1,5,3],[5,4,5,6],[9,1,9,3],[9,4,9,6],[10,1,10,6],[6,1,6,3],[6,4,6,6],[7,1,7,6]]}
[]
[]
[null,"UNIDADE ESCOLAR",null,null,"CÓDIGO INEP"]
[null,{"$f":"Orçamento!$O$4","v":"CENTRO DE ENSINO EM PERÍODO INTEGRAL JOSÉ SALVIANO AZEVEDO"},null,null,{"$f":"Orçamento!$V$4","v":52055256}]
[]
[null,"OBRA",null,null,"CIDADE"]
[null,{"$f":"Orçamento!$O$7","v":"REFORMA E REFORMA"},null,null,{"$f":"Orçamento!$V$7","v":"SANTA HELENA DE GOIÁS"}]
[]
[null,"CRE",null,null,"ÁREA TOTAL CONSTRUÍDA (M²)"]
[null,{"$f":"Orçamento!$O$10","v":"SANTA HELENA"},null,null,{"$f":"Orçamento!$S$13","v":4521.6399999999994}]
["FILTRO"]
[null,"PARCELA DE MAIOR RELEVÂNCIA"]
[null,"CÓDIGO","SERVIÇO","DESCRIÇÃO","UNID","QUANT","PARC. MAIOR RELEV (50%)"]
[{"$f":"IF(F14>0,\"F\",\"\")","v":""},70000,"INSTALAÇÕES ELÉTRICAS","INSTALAÇÕES ELÉTRICAS","KVA",{"$f":"SUMIF(Orçamento!$R$20:$R$748,'Parc Maior Relev'!D14,Orçamento!$T$20:$T$748)","v":0},{"$f":"F14*0.5","v":0}]
[null,70000,"INSTALAÇÕES ELÉTRICAS","SUBESTAÇÃO","KVA",{"$f":"SUMIF(Orçamento!$R$20:$R$748,'Parc Maior Relev'!D15,Orçamento!$T$20:$T$748)","v":0},{"$f":"F15*0.5","v":0},1]
[null,80000,"INSTALAÇÕES HIDROSSANITÁRIAS","RESERVATÓRIO","UNID",{"$f":"SUMIF(Orçamento!$R$20:$R$748,'Parc Maior Relev'!D16,Orçamento!$T$20:$T$748)","v":0},{"$f":"F16*0.5","v":0},1]
[null,160000,"COBERTURAS","TELHA CERÂMICA","M2",{"$f":"SUMIF(Orçamento!$R$20:$R$748,'Parc Maior Relev'!D17,Orçamento!$T$20:$T$748)","v":0},{"$f":"F17*0.5","v":0}]
[null,160000,"COBERTURAS","TELHA FIBROCIMENTO","M2",{"$f":"SUMIF(Orçamento!$R$20:$R$748,'Parc Maior Relev'!D18,Orçamento!$T$20:$T$748)","v":0},0]
[null,160000,"COBERTURAS","TELHA METÁLICA","M2",{"$f":"SUMIF(Orçamento!$R$20:$R$748,'Parc Maior Relev'!D19,Orçamento!$T$20:$T$748)","v":0},0]
["F",70000,"INSTALAÇÕES ELÉTRICAS","INSTALAÇÕES ELÉTRICAS","KVA",131.30000000000001,{"$f":"F20*0.5","v":65.650000000000006}]
[null,200000,"REVESTIMENTO DE PAREDE","REVESTIMENTO CERÂMICO","M2",{"$f":"SUMIF(Orçamento!$R$20:$R$748,'Parc Maior Relev'!D21,Orçamento!$T$20:$T$748)","v":0},0]
[null,210000,"FORROS","FORRO DE GESSO","M2",{"$f":"SUMIF(Orçamento!$R$20:$R$748,'Parc Maior Relev'!D22,Orçamento!$T$20:$T$748)","v":0},{"$f":"F22*0.5","v":0}]
[null,210000,"FORROS","FORRO PVC","M2",{"$f":"SUMIF(Orçamento!$R$20:$R$748,'Parc Maior Relev'!D23,Orçamento!$T$20:$T$748)","v":0},0]
[null,210000,"FORROS","FORRO ACARTONADO","M2",{"$f":"SUMIF(Orçamento!$R$20:$R$748,'Parc Maior Relev'!D24,Orçamento!$T$20:$T$748)","v":0},0]
[null,220000,"REVESTIMENTO DE PISO","PISO GRANITINA","M2",{"$f":"SUMIF(Orçamento!$R$20:$R$748,'Parc Maior Relev'!D25,Orçamento!$T$20:$T$748)","v":0},0]
[null,220000,"REVESTIMENTO DE PISO","PISO CONCRETO DESEMPENADO","M2",{"$f":"SUMIF(Orçamento!$R$20:$R$748,'Parc Maior Relev'!D26,Orçamento!$T$20:$T$748)","v":0},0]
[null,220000,"REVESTIMENTO DE PISO","PISO CERÂMICO","M2",{"$f":"SUMIF(Orçamento!$R$20:$R$748,'Parc Maior Relev'!D27,Orçamento!$T$20:$T$748)","v":0},{"$f":"F27*0.5","v":0}]
[null,260000,"PINTURA","PINTURA","M2",{"$f":"SUMIF(Orçamento!$R$20:$R$748,'Parc Maior Relev'!D28,Orçamento!$T$20:$T$748)","v":0},0]
["F"]
["F","(*) Para os fins do inciso I dp § 1º do Art. 30 da Lei Federal 8.666/93, são consideradas parcelas de maior relevância técnica as execuções apresentadas"]
["F"]

{"sheet":"Composições","index":7,"n_rows":422,"n_cols":10,"rows_kept":422,"cut":false,"hidden":false,"merged":[[0,0,0,8],[10,0,10,2],[10,3,10,6],[11,0,11,9],[12,0,12,2],[12,3,12,6],[12,7,12,8],[7,0,7,6],[9,0,9,2],[9,3,9,6],[9,7,9,8],[3,0,3,6],[4,0,4,6],[15,0,15,9],[13,0,13,2],[13,3,13,6],[1,0,1,9],[3,7,3,9],[4,7,4,9],[6,7,6,9],[7,7,7,9],[6,0,6,6],[10,8,10,9],[13,8,13,9],[14,0,14,9],[8,0,8,9],[5,0,5,9],[2,0,2,9],[16,5,17,5],[16,6,16,7],[16,8,16,9],[22,1,22,7],[26,1,26,7],[16,0,17,0],[16,1,17,1],[16,2,17,2],[16,3,17,3],[16,4,17,4],[28,5,29,5],[28,6,28,7],[28,8,28,9],[34,1,34,7],[38,1,38,7],[28,0,29,0],[28,1,29,1],[28,2,29,2],[28,3,29,3],[28,4,29,4],[40,5,41,5],[40,6,40,7],[40,8,40,9],[46,1,46,7],[50,1,50,7],[40,0,41,0],[40,1,41,1],[40,2,41,2],[40,3,41,3],[40,4,41,4],[52,5,53,5],[52,6,52,7],[52,8,52,9],[58,1,58,7],[62,1,62,7],[52,0,53,0],[52,1,53,1],[52,2,53,2],[52,3,53,3],[52,4,53,4],[64,5,65,5],[64,6,64,7],[64,8,64,9],[70,1,70,7],[74,1,74,7],[64,0,65,0],[64,1,65,1],[64,2,65,2],[64,3,65,3],[64,4,65,4],[76,5,77,5],[76,6,76,7],[76,8,76,9],[81,1,81,7],[84,1,84,7],[76,0,77,0],[76,1,77,1],[76,2,77,2],[76,3,77,3],[76,4,77,4],[86,5,87,5],[86,6,86,7],[86,8,86,9],[91,1,91,7],[94,1,94,7],[86,0,87,0],[86,1,87,1],[86,2,87,2],[86,3,87,3],[86,4,87,4],[96,5,97,5],[96,6,96,7],[96,8,96,9],[102,1,102,7],[106,1,106,7],[96,0,97,0],[96,1,97,1],[96,2,97,2],[96,3,97,3],[96,4,97,4],[108,5,109,5],[108,6,108,7],[108,8,108,9],[114,1,114,7],[118,1,118,7],[108,0,109,0],[108,1,109,1],[108,2,109,2],[108,3,109,3],[108,4,109,4],[120,5,121,5],[120,6,120,7],[120,8,120,9],[126,1,126,7],[130,1,130,7],[120,0,121,0],[120,1,121,1],[120,2,121,2],[120,3,121,3],[120,4,121,4],[132,5,133,5],[132,6,132,7],[132,8,132,9],[138,1,138,7],[142,1,142,7],[132,0,133,0],[132,1,133,1],[132,2,133,2],[132,3,133,3],[132,4,133,4],[144,5,145,5],[144,6,144,7],[144,8,144,9],[150,1,150,7],[154,1,154,7],[144,0,145,0],[144,1,145,1],[144,2,145,2],[144,3,145,3],[144,4,145,4],[156,5,157,5],[156,6,156,7],[156,8,156,9],[162,1,162,7],[166,1,166,7],[156,0,157,0],[156,1,157,1],[156,2,157,2],[156,3,157,3],[156,4,157,4],[168,5,169,5],[168,6,168,7],[168,8,168,9],[174,1,174,7],[178,1,178,7],[168,0,169,0],[168,1,169,1],[168,2,169,2],[168,3,169,3],[168,4,169,4],[180,5,181,5],[180,6,180,7],[180,8,180,9],[184,1,184,7],[188,1,188,7],[180,0,181,0],[180,1,181,1],[180,2,181,2],[180,3,181,3],[180,4,181,4],[190,5,191,5],[190,6,190,7],[190,8,190,9],[196,1,196,7],[203,1,203,7],[190,0,191,0],[190,1,191,1],[190,2,191,2],[190,3,191,3],[190,4,191,4],[205,5,206,5],[205,6,205,7],[205,8,205,9],[211,1,211,7],[215,1,215,7],[205,0,206,0],[205,1,206,1],[205,2,206,2],[205,3,206,3],[205,4,206,4],[217,5,218,5],[217,6,217,7],[217,8,217,9],[223,1,223,7],[227,1,227,7],[217,0,218,0],[217,1,218,1],[217,2,218,2],[217,3,218,3],[217,4,218,4],[229,5,230,5],[229,6,229,7],[229,8,229,9],[235,1,235,7],[239,1,239,7],[229,0,230,0],[229,1,230,1],[229,2,230,2],[229,3,230,3],[229,4,230,4],[241,5,242,5],[241,6,241,7],[241,8,241,9],[247,1,247,7],[251,1,251,7],[241,0,242,0],[241,1,242,1],[241,2,242,2],[241,3,242,3],[241,4,242,4],[253,5,254,5],[253,6,253,7],[253,8,253,9],[259,1,259,7],[263,1,263,7],[253,0,254,0],[253,1,254,1],[253,2,254,2],[253,3,254,3],[253,4,254,4],[265,5,266,5],[265,6,265,7],[265,8,265,9],[271,1,271,7],[275,1,275,7],[265,0,266,0],[265,1,266,1],[265,2,266,2],[265,3,266,3],[265,4,266,4],[277,5,278,5],[277,6,277,7],[277,8,277,9],[283,1,283,7],[287,1,287,7],[277,0,278,0],[277,1,278,1],[277,2,278,2],[277,3,278,3],[277,4,278,4],[289,5,290,5],[289,6,289,7],[289,8,289,9],[295,1,295,7],[299,1,299,7],[289,0,290,0],[289,1,290,1],[289,2,290,2],[289,3,290,3],[289,4,290,4],[301,5,302,5],[301,6,301,7],[301,8,301,9],[307,1,307,7],[311,1,311,7],[301,0,302,0],[301,1,302,1],[301,2,302,2],[301,3,302,3],[301,4,302,4],[313,5,314,5],[313,6,313,7],[313,8,313,9],[319,1,319,7],[323,1,323,7],[313,0,314,0],[313,1,314,1],[313,2,314,2],[313,3,314,3],[313,4,314,4],[325,5,326,5],[325,6,325,7],[325,8,325,9],[331,1,331,7],[335,1,335,7],[325,0,326,0],[325,1,326,1],[325,2,326,2],[325,3,326,3],[325,4,326,4],[337,5,338,5],[337,6,337,7],[337,8,337,9],[343,1,343,7],[347,1,347,7],[337,0,338,0],[337,1,338,1],[337,2,338,2],[337,3,338,3],[337,4,338,4],[349,5,350,5],[349,6,349,7],[349,8,349,9],[355,1,355,7],[359,1,359,7],[349,0,350,0],[349,1,350,1],[349,2,350,2],[349,3,350,3],[349,4,350,4],[361,5,362,5],[361,6,361,7],[361,8,361,9],[367,1,367,7],[371,1,371,7],[361,0,362,0],[361,1,362,1],[361,2,362,2],[361,3,362,3],[361,4,362,4],[373,5,374,5],[373,6,373,7],[373,8,373,9],[379,1,379,7],[383,1,383,7],[373,0,374,0],[373,1,374,1],[373,2,374,2],[373,3,374,3],[373,4,374,4],[411,8,411,9],[385,5,386,5],[385,6,385,7],[385,8,385,9],[385,0,386,0],[385,1,386,1],[385,2,386,2],[385,3,386,3],[385,4,386,4],[394,1,394,7],[417,1,417,7],[421,1,421,7],[409,1,409,7],[411,0,412,0],[411,1,412,1],[411,2,412,2],[411,3,412,3],[411,4,412,4],[411,5,412,5],[411,6,411,7]]}
[]
[]
[]
["UNIDADE ESCOLAR",null,null,null,null,null,null,"CÓDIGO INEP"]
[{"$f":"Orçamento!$O$4","v":"CENTRO DE ENSINO EM PERÍODO INTEGRAL JOSÉ SALVIANO AZEVEDO"},null,null,null,null,null,null,{"$f":"Orçamento!$V$4","v":52055256}]
[]
["OBRA",null,null,null,null,null,null,"CIDADE"]
[{"$f":"Orçamento!$O$7","v":"REFORMA E REFORMA"},null,null,null,null,null,null,{"$f":"Orçamento!$V$7","v":"SANTA HELENA DE GOIÁS"}]
[]
["CRE",null,null,"ENDEREÇO",null,null,null,"REFERÊNCIA AGETOP"]
[{"$f":"Orçamento!$O$10","v":"SANTA HELENA"},null,null,{"$f":"Orçamento!$R$10","v":"RUA JACINTO F SOUSA 950, CENTRO, CEP:75920-000"},null,null,null,{"$f":"Orçamento!$V$10","v":"DEZ/18"},{"$f":"Orçamento!$W$10","v":"DESONERADA"}]
[]
["DATA",null,null,"ÁREA TOTAL CONSTRUÍDA (M²)",null,null,null,"REFERÊNCIA SINAPI"]
[{"$f":"Orçamento!$S$7","v":"2020-04-23"},null,null,{"$f":"Orçamento!$S$13","v":4521.6399999999994},null,null,null,{"$f":"Orçamento!$V$13","v":"JUL/19"},{"$f":"Orçamento!$W$13","v":"DESONERADA"}]
[]
["COMPOSIÇÕES DE CUSTOS UNITÁRIOS - SEE-GO"]
[40,"FONTE","CÓDIGO","DESCRIÇÃO","UNIDADE","COEFIC.","CUSTO UNITÁRIO",null,"CUSTO  TOTAL (A) + (B) + (C) + (D) + (E)"]
[null,null,null,null,null,null,"DESONERADO","NÃO DESONER.","DESONERADO","NÃO DESONER."]
[null,"COMPOSIÇÃO","COMP 040_SEE","CONJUNTO MOTOR-BOMBA ELÉTRICA TRIFÁSICO 380/220 V PARA VZ= 24,33 M³/H, HM= 46,24 M POTÊNCIA= 7,5 CV","UN ",null,null,null,3965.4700000000003,3992.9900000000002]
[null,"AGETOP_I",8,"AJUDANTE","h     ",8,8.1999999999999993,9.51,65.599999999999994,76.08]
[null,"AGETOP_I",11,"ENCANADOR","h     ",8,13.4,15.53,107.2,124.24]
[null,null,null,"","",null,0,0,0,0]
[null,"MÃO DE OBRA (B) - TOTAL",null,null,null,null,null,null,172.8,200.32]
[null,"COTAÇÃO","COT 008_SEE","CONJUNTO MOTOR-BOMBA ELÉTRICA TRIFÁSICO 380/220 V PARA VZ= 24,33 M³/H, HM= 46,24 M POTÊNCIA= 7,5 CV","UN ",1,3792.6666666666665,3792.6666666666665,3792.67,3792.67]
[null,null,null,"","",null,0,0,0,0]
[null,null,null,"","",null,0,0,0,0]
[null,"MATERIAL (C) - TOTAL",null,null,null,null,null,null,3792.67,3792.67]
[]
[17,"FONTE","CÓDIGO","DESCRIÇÃO","UNIDADE","COEFIC.","CUSTO UNITÁRIO",null,"CUSTO  TOTAL (A) + (B) + (C) + (D) + (E)"]
[null,null,null,null,null,null,"DESONERADO","NÃO DESONER.","DESONERADO","NÃO DESONER."]
[null,"COMPOSIÇÃO","COMP 017_SEE","REDUCAO GIRATÓRIA TIPO STORZ LATAO P/ INST. PREDIAL COMBATE A INCENDIO ENGATE RAPIDO 2.1/2\" X 1.1/2\"","UN ",null,"-","-",99.14,99.69]
[null,"AGETOP_I",8,"AJUDANTE","h     ",0.16,8.1999999999999993,9.51,1.31,1.52]
[null,"AGETOP_I",11,"ENCANADOR","h     ",0.16,13.4,15.53,2.14,2.48]
[null,null,null,"","",null,0,0,0,0]
[null,"MÃO DE OBRA (B) - TOTAL",null,null,null,null,null,null,3.45,4]
[null,"SINAPI_I",20972,"REDUCAO FIXA TIPO STORZ, ENGATE RAPIDO 2.1/2\" X 1.1/2\", EM LATAO, PARA INSTALACAO PREDIAL COMBATE A INCENDIO PREDIAL                                                                                                                                                                                                                                                                                                                                                                                      ","UN    ",1,95.69,95.69,95.69,95.69]
[null,null,null,"","",null,0,0,0,0]
[null,null,null,"","",null,0,0,0,0]
[null,"MATERIAL (C) - TOTAL",null,null,null,null,null,null,95.69,95.69]
[]
[18,"FONTE","CÓDIGO","DESCRIÇÃO","UNIDADE","COEFIC.","CUSTO UNITÁRIO",null,"CUSTO  TOTAL (A) + (B) + (C) + (D) + (E)"]
[null,null,null,null,null,null,"DESONERADO","NÃO DESONER.","DESONERADO","NÃO DESONER."]
[null,"COMPOSIÇÃO","COMP 018_SEE","CHAVE DUPLA P/ CONEXÕES TIPO STORZ EM LATÃO ENGATE RÁPIDO 1 1/2\" X 2 1/2\"","UN ",null,"-","-",14.76,15.08]
[null,"AGETOP_I",11,"ENCANADOR","h     ",0.15,13.4,15.53,2.0099999999999998,2.33]
[null,null,null,"","",null,0,0,0,0]
[null,null,null,"","",null,0,0,0,0]
[null,"MÃO DE OBRA (B) - TOTAL",null,null,null,null,null,null,2.0099999999999998,2.33]
[null,"SINAPI_I",20971,"CHAVE DUPLA PARA CONEXOES TIPO STORZ, ENGATE RAPIDO 1 1/2\" X 2 1/2\", EM LATAO, PARA INSTALACAO PREDIAL COMBATE A INCENDIO                                                                                                                                                                                                                                                                                                                                                                                 ","UN    ",1,12.75,12.75,12.75,12.75]
[null,null,null,"","",null,0,0,0,0]
[null,null,null,"","",null,0,0,0,0]
[null,"MATERIAL (C) - TOTAL",null,null,null,null,null,null,12.75,12.75]
[]
[87,"FONTE","CÓDIGO","DESCRIÇÃO","UNIDADE","COEFIC.","CUSTO UNITÁRIO",null,"CUSTO  TOTAL (A) + (B) + (C) + (D) + (E)"]
[null,null,null,null,null,null,"DESONERADO","NÃO DESONER.","DESONERADO","NÃO DESONER."]
[null,"COMPOSIÇÃO","COMP 087_SEE","REGISTRO DE GAVETA COM HASTE ASCENDENTE DE BRONZE 2 1/2\"","UN ",null,null,null,257.29999999999995,261.26]
[null,"AGETOP_I",8,"AJUDANTE","h     ",1.1499999999999999,8.1999999999999993,9.51,9.43,10.94]
[null,"AGETOP_I",11,"ENCANADOR","h     ",1.1499999999999999,13.4,15.53,15.41,17.86]
[null,null,null,"","",null,0,0,0,0]
[null,"MÃO DE OBRA (B) - TOTAL",null,null,null,null,null,null,24.84,28.799999999999997]
[null,"AGETOP_I","H689","FITA VEDAROSCA 12 MM","m",2.82,0.28000000000000003,0.28000000000000003,0.79,0.79]
[null,"COTAÇÃO","COT 017_SEE","REGISTRO DE GAVETA COM HASTE ASCENDENTE DE BRONZE 2 1/2\"","UN ",1,231.66666666666666,231.66666666666666,231.67,231.67]
[null,null,null,"","",null,0,0,0,0]
[null,"MATERIAL (C) - TOTAL",null,null,null,null,null,null,232.45999999999998,232.45999999999998]
[]
[19,"FONTE","CÓDIGO","DESCRIÇÃO","UNIDADE","COEFIC.","CUSTO UNITÁRIO",null,"CUSTO  TOTAL (A) + (B) + (C) + (D) + (E)"]
[null,null,null,null,null,null,"DESONERADO","NÃO DESONER.","DESONERADO","NÃO DESONER."]
[null,"COMPOSIÇÃO","COMP 019_SEE","TAMPÃO LATAO C/ CORRENTE P/ INSTALAÇÃO PREDIAL COMBATE A INCÊNDIO ENGATE RÁPIDO 1 1/2\"","UN ",null,"-","-",55.550000000000004,56.07]
[null,"AGETOP_I",11,"ENCANADOR","h     ",0.15,13.4,15.53,2.0099999999999998,2.33]
[null,"AGETOP_I",8,"AJUDANTE","h     ",0.15,8.1999999999999993,9.51,1.23,1.43]
[null,null,null,"","",null,0,0,0,0]
[null,"MÃO DE OBRA (B) - TOTAL",null,null,null,null,null,null,3.2399999999999998,3.76]
[null,"SINAPI_I",20964,"TAMPAO COM CORRENTE, EM LATAO, ENGATE RAPIDO 1 1/2\", PARA INSTALACAO PREDIAL DE COMBATE A INCENDIO                                                                                                                                                                                                                                                                                                                                                                                                        ","UN    ",1,52.31,52.31,52.31,52.31]
[null,null,null,"","",null,0,0,0,0]
[null,null,null,"","",null,0,0,0,0]
[null,"MATERIAL (C) - TOTAL",null,null,null,null,null,null,52.31,52.31]
[]
[30,"FONTE","CÓDIGO","DESCRIÇÃO","UNIDADE","COEFIC.","CUSTO UNITÁRIO",null,"CUSTO  TOTAL (A) + (B) + (C) + (D) + (E)"]
[null,null,null,null,null,null,"DESONERADO","NÃO DESONER.","DESONERADO","NÃO DESONER."]
[null,"COMPOSIÇÃO","COMP 030_SEE","COTOVELO DE FERRO GALV. 90° X 2 1/2\"","UN ",null,null,null,69.16,72.33]
[null,"AGETOP_I",8,"AJUDANTE","h     ",0.92,8.1999999999999993,9.51,7.54,8.75]
[null,"AGETOP_I",11,"ENCANADOR","h     ",0.92,13.4,15.53,12.33,14.29]
[null,"MÃO DE OBRA (B) - TOTAL",null,null,null,null,null,null,19.87,23.04]
[null,"SINAPI_I",3470,"COTOVELO 90 GRAUS DE FERRO GALVANIZADO, COM ROSCA BSP, DE 2 1/2\"                                                                                                                                                                                                                                                                                                                                                                                                                                          ","UN    ",1,48.73,48.73,48.73,48.73]
[null,"AGETOP_I","H689","FITA VEDAROSCA 12 MM","m",2,0.28000000000000003,0.28000000000000003,0.56000000000000005,0.56000000000000005]
[null,"MATERIAL (C) - TOTAL",null,null,null,null,null,null,49.29,49.29]
[]
[77,"FONTE","CÓDIGO","DESCRIÇÃO","UNIDADE","COEFIC.","CUSTO UNITÁRIO",null,"CUSTO  TOTAL (A) + (B) + (C) + (D) + (E)"]
[null,null,null,null,null,null,"DESONERADO","NÃO DESONER.","DESONERADO","NÃO DESONER."]
[null,"COMPOSIÇÃO","COMP 077_SEE","UNIAO FERRO GALV C/ASSENTO CONICO BRONZE 2 1/2\"","UN ",null,null,null,148.30000000000001,149.66999999999999]
[null,"AGETOP_I",8,"AJUDANTE","h     ",0.4,8.1999999999999993,9.51,3.28,3.8]
[null,"AGETOP_I",11,"ENCANADOR","h     ",0.4,13.4,15.53,5.36,6.21]
[null,"MÃO DE OBRA (B) - TOTAL",null,null,null,null,null,null,8.64,10.01]
[null,"AGETOP_I","H689","FITA VEDAROSCA 12 MM","m",2.4,0.28000000000000003,0.28000000000000003,0.67,0.67]
[null,"SINAPI_I",12427,"UNIAO COM ASSENTO CONICO DE BRONZE, DIAMETRO 2 1/2\"                                                                                                                                                                                                                                                                                                                                                                                                                                                       ","UN    ",1,138.99,138.99,138.99,138.99]
[null,"MATERIAL (C) - TOTAL",null,null,null,null,null,null,139.66,139.66]
[]
[559,"FONTE","CÓDIGO","DESCRIÇÃO","UNID ","COEFIC.","CUSTO UNITÁRIO",null,"CUSTO  TOTAL (A) + (B) + (C) + (D) + (E)"]
[null,null,null,null,null,null,"DESONERADO","NÃO DESONER.","DESONERADO","NÃO DESONER."]
[null,"COMPOSIÇÃO","COMP 559_SEE","ADAPTADOR PARA CAIXA D´ÁGUA 150MM 2.1/2\" ","UN ","-","-","-",101.95,102.26]
[null,"AGETOP_I",11,"ENCANADOR","h     ",0.09,13.4,15.53,1.21,1.4]
[null,"AGETOP_I",8,"AJUDANTE","h     ",0.09,8.1999999999999993,9.51,0.74,0.86]
[null,null,null,"","",null,0,0,0,0]
[null,"MÃO DE OBRA (B) - TOTAL",null,null,null,null,null,null,1.95,2.2599999999999998]
[null,"COTAÇÃO","COT 304_SEE","ADAPTADOR PARA CAIXA D´ÁGUA 150MM 2.1/2\" ","UN ",1,100,100,100,100]
[null,null,null,"","",null,0,0,0,0]
[null,null,null,"","",null,0,0,0,0]
[null,"MATERIAL (C) - TOTAL",null,null,null,null,null,null,100,100]
[]
[22,"FONTE","CÓDIGO","DESCRIÇÃO","UNIDADE","COEFIC.","CUSTO UNITÁRIO",null,"CUSTO  TOTAL (A) + (B) + (C) + (D) + (E)"]
[null,null,null,null,null,null,"DESONERADO","NÃO DESONER.","DESONERADO","NÃO DESONER."]
[null,"COMPOSIÇÃO","COMP 022_SEE","TAMPÃO FOFO 40X50CM C/INSCRIÇÃO ","UN ",null,"-","-",199.82999999999998,200.15]
[null,"AGETOP_I",11,"ENCANADOR","h     ",0.15,13.4,15.53,2.0099999999999998,2.33]
[null,null,null,"","",null,0,0,0,0]
[null,null,null,"","",null,0,0,0,0]
[null,"MÃO DE OBRA (B) - TOTAL",null,null,null,null,null,null,2.0099999999999998,2.33]
[null,"SINAPI_I",11293,"TAMPAO FOFO SIMPLES COM BASE, CLASSE A15 CARGA MAX 1,5 T, 400 X 500 MM, COM INSCRICAO INCENDIO                                                                                                                                                                                                                                                                                                                                                                                                            ","UN    ",1,197.82,197.82,197.82,197.82]
[null,null,null,"","",null,0,0,0,0]
[null,null,null,"","",null,0,0,0,0]
[null,"MATERIAL (C) - TOTAL",null,null,null,null,null,null,197.82,197.82]
[]
[546,"FONTE","CÓDIGO","DESCRIÇÃO","UNID ","COEFIC.","CUSTO UNITÁRIO",null,"CUSTO  TOTAL (A) + (B) + (C) + (D) + (E)"]
[null,null,null,null,null,null,"DESONERADO","NÃO DESONER.","DESONERADO","NÃO DESONER."]
[null,"COMPOSIÇÃO","COMP 546_SEE","BUJÃO DE REBORDO 2.1/2\"","UN ","-","-","-",16.509999999999998,16.760000000000002]
[null,"AGETOP_I",8,"AJUDANTE","h     ",7.0000000000000007E-2,8.1999999999999993,9.51,0.56999999999999995,0.67]
[null,"AGETOP_I",11,"ENCANADOR","h     ",7.0000000000000007E-2,13.4,15.53,0.94,1.0900000000000001]
[null,null,null,"","",null,0,0,0,0]
[null,"MÃO DE OBRA (B) - TOTAL",null,null,null,null,null,null,1.5099999999999998,1.7600000000000002]
[null,"COTAÇÃO","COT 286_SEE","BUJÃO DE REBORDO 2.1/2\"","UN ",1,15,15,15,15]
[null,null,null,"","",null,0,0,0,0]
[null,null,null,"","",null,0,0,0,0]
[null,"MATERIAL (C) - TOTAL",null,null,null,null,null,null,15,15]
[]
[186,"FONTE","CÓDIGO","DESCRIÇÃO","UNIDADE","COEFIC.","CUSTO UNITÁRIO",null,"CUSTO  TOTAL (A) + (B) + (C) + (D) + (E)"]
[null,null,null,null,null,null,"DESONERADO","NÃO DESONER.","DESONERADO","NÃO DESONER."]
[null,"COMPOSIÇÃO","COMP 186_SEE","BOTOEIRA BOMBA DE INCÊNDIO C/ MARTELO CONVENCIONAL/ ANALÓGICA","UN ",null,null,null,85.1,88.539999999999992]
[null,"AGETOP_I",8,"AJUDANTE","h     ",1,8.1999999999999993,9.51,8.1999999999999993,9.51]
[null,"AGETOP_I",12,"ELETRICISTA","h     ",1,13.4,15.53,13.4,15.53]
[null,null,null,"","",null,0,0,0,0]
[null,"MÃO DE OBRA (B) - TOTAL",null,null,null,null,null,null,21.6,25.04]
[null,"COTAÇÃO","COT 088_SEE","BOTOEIRA BOMBA DE INCÊNDIO C/ MARTELO CONVENCIONAL/ ANALÓGICA","UN",1,63.5,63.5,63.5,63.5]
[null,null,null,"","",null,0,0,0,0]
[null,null,null,"","",null,0,0,0,0]
[null,"MATERIAL (C) - TOTAL",null,null,null,null,null,null,63.5,63.5]
[]
[188,"FONTE","CÓDIGO","DESCRIÇÃO","UNIDADE","COEFIC.","CUSTO UNITÁRIO",null,"CUSTO  TOTAL (A) + (B) + (C) + (D) + (E)"]
[null,null,null,null,null,null,"DESONERADO","NÃO DESONER.","DESONERADO","NÃO DESONER."]
[null,"COMPOSIÇÃO","COMP 188_SEE","ACIONADOR MANUAL DE ALARME","UN ",null,null,null,100.61,103.36]
[null,"AGETOP_I",8,"AJUDANTE","h     ",0.8,8.1999999999999993,9.51,6.56,7.61]
[null,"AGETOP_I",12,"ELETRICISTA","h     ",0.8,13.4,15.53,10.72,12.42]
[null,null,null,"","",null,0,0,0,0]
[null,"MÃO DE OBRA (B) - TOTAL",null,null,null,null,null,null,17.28,20.03]
[null,"COTAÇÃO","COT 090_SEE","ACIONADOR MANUAL DE ALARME","UN",1,83.333333333333329,83.333333333333329,83.33,83.33]
[null,null,null,"","",null,0,0,0,0]
[null,null,null,"","",null,0,0,0,0]
[null,"MATERIAL (C) - TOTAL",null,null,null,null,null,null,83.33,83.33]
[]
[190,"FONTE","CÓDIGO","DESCRIÇÃO","UNIDADE","COEFIC.","CUSTO UNITÁRIO",null,"CUSTO  TOTAL (A) + (B) + (C) + (D) + (E)"]
[null,null,null,null,null,null,"DESONERADO","NÃO DESONER.","DESONERADO","NÃO DESONER."]
[null,"COMPOSIÇÃO","COMP 190_SEE","CENTRAL DE DETECÇÃO E ALARME DE 40 SETORES COM BATERIA","UN ",null,null,null,1136.1300000000001,1163.6500000000001]
[null,"AGETOP_I",8,"AJUDANTE","h     ",8,8.1999999999999993,9.51,65.599999999999994,76.08]
[null,"AGETOP_I",12,"ELETRICISTA","h     ",8,13.4,15.53,107.2,124.24]
[null,null,null,"","",null,0,0,0,0]
[null,"MÃO DE OBRA (B) - TOTAL",null,null,null,null,null,null,172.8,200.32]
[null,"COTAÇÃO","COT 092_SEE","CENTRAL DE DETECÇÃO E ALARME DE 40 SETORES COM BATERIA (PREÇO MÉDIO)","UN",1,963.33333333333337,963.33333333333337,963.33,963.33]
[null,null,null,"","",null,0,0,0,0]
[null,null,null,"","",null,0,0,0,0]
[null,"MATERIAL (C) - TOTAL",null,null,null,null,null,null,963.33,963.33]
[]
[24,"FONTE","CÓDIGO","DESCRIÇÃO","UNIDADE","COEFIC.","CUSTO UNITÁRIO",null,"CUSTO  TOTAL (A) + (B) + (C) + (D) + (E)"]
[null,null,null,null,null,null,"DESONERADO","NÃO DESONER.","DESONERADO","NÃO DESONER."]
[null,"COMPOSIÇÃO","COMP 024_SEE","SINALIZADOR FOTOLUMINESCENTE PARA EXTINTOR","UN ",null,"-","-",24.109999999999996,24.229999999999997]
[null,"AGETOP_I",5,"SERVENTE","h     ",0.09,8.1999999999999993,9.51,0.74,0.86]
[null,null,null,"","",null,0,0,0,0]
[null,null,null,"","",null,0,0,0,0]
[null,"MÃO DE OBRA (B) - TOTAL",null,null,null,null,null,null,0.74,0.86]
[null,"AGETOP_I",3070,"BUCHA DE NYLON S-6","un",2,0.04,0.04,0.08,0.08]
[null,"AGETOP_I",3393,"PARAFUSO P/BUCHA S-6","un",2,0.08,0.08,0.16,0.16]
[null,"SINAPI_I",37556,"PLACA DE SINALIZACAO DE SEGURANCA CONTRA INCENDIO, FOTOLUMINESCENTE, QUADRADA, *20 X 20* CM, EM PVC *2* MM ANTI-CHAMAS (SIMBOLOS, CORES E PICTOGRAMAS CONFORME NBR 13434)                                                                                                                                                                                                                                                                                                                                 ","UN    ",1,23.13,23.13,23.13,23.13]
[null,"MATERIAL (C) - TOTAL",null,null,null,null,null,null,23.369999999999997,23.369999999999997]
[]
[25,"FONTE","CÓDIGO","DESCRIÇÃO","UNIDADE","COEFIC.","CUSTO UNITÁRIO",null,"CUSTO  TOTAL (A) + (B) + (C) + (D) + (E)"]
[null,null,null,null,null,null,"DESONERADO","NÃO DESONER.","DESONERADO","NÃO DESONER."]
[null,"COMPOSIÇÃO","COMP 025_SEE","SINALIZADOR FOTOLUMINESCENTE DE EMERGÊNCIA","UN ",null,"-","-",24.109999999999996,24.229999999999997]
[null,"AGETOP_I",5,"SERVENTE","h     ",0.09,8.1999999999999993,9.51,0.74,0.86]
[null,"MÃO DE OBRA (B) - TOTAL",null,null,null,null,null,null,0.74,0.86]
[null,"AGETOP_I",3070,"BUCHA DE NYLON S-6","un",2,0.04,0.04,0.08,0.08]
[null,"AGETOP_I",3393,"PARAFUSO P/BUCHA S-6","un",2,0.08,0.08,0.16,0.16]
[null,"SINAPI_I",37556,"PLACA DE SINALIZACAO DE SEGURANCA CONTRA INCENDIO, FOTOLUMINESCENTE, QUADRADA, *20 X 20* CM, EM PVC *2* MM ANTI-CHAMAS (SIMBOLOS, CORES E PICTOGRAMAS CONFORME NBR 13434)                                                                                                                                                                                                                                                                                                                                 ","UN    ",1,23.13,23.13,23.13,23.13]
[null,"MATERIAL (C) - TOTAL",null,null,null,null,null,null,23.369999999999997,23.369999999999997]
[]
[277,"FONTE","CÓDIGO","DESCRIÇÃO","UNIDADE","COEFIC.","CUSTO UNITÁRIO",null,"CUSTO  TOTAL (A) + (B) + (C) + (D) + (E)"]
[null,null,null,null,null,null,"DESONERADO","NÃO DESONER.","DESONERADO","NÃO DESONER."]
[null,"COMPOSIÇÃO","COMP 277_SEE","MARCAÇÃO NO PISO - 1X1 M PARA EXTINTOR","M2",null,null,null,28.81,28.88]
[null,"AGETOP_I",5,"SERVENTE","h     ",3.3300000000000003E-2,8.1999999999999993,9.51,0.27,0.32]
[null,null,null,"","",null,0,0,0,0]
[null,null,null,"","",null,0,0,0,0]
[null,"MÃO DE OBRA (B) - TOTAL",null,null,null,null,null,null,0.27,0.32]
[null,"SINAPI_I",5318,"SOLVENTE DILUENTE A BASE DE AGUARRAS                                                                                                                                                                                                                                                                                                                                                                                                                                                                      ","L     ",0.13,11.78,11.78,1.53,1.53]
[null,"SINAPI",5824,"CAMINHÃO TOCO, PBT 16.000 KG, CARGA ÚTIL MÁX. 10.685 KG, DIST. ENTRE EIXOS 4,8 M, POTÊNCIA 189 CV, INCLUSIVE CARROCERIA FIXA ABERTA DE MADEIRA P/ TRANSPORTE GERAL DE CARGA SECA, DIMEN. APROX. 2,5 X 7,00 X 0,50 M - CHP DIURNO. AF_06/2014","CHP",3.3E-3,135.91,139.12,0.45,0.46]
[null,"SINAPI_I",7343,"TINTA A BASE DE RESINA ACRILICA, PARA SINALIZACAO HORIZONTAL VIARIA (NBR 11862)                                                                                                                                                                                                                                                                                                                                                                                                                           ","L     ",0.6,11.38,11.38,6.83,6.83]
[null,"SINAPI_I",7348,"TINTA ACRILICA PREMIUM PARA PISO                                                                                                                                                                                                                                                                                                                                                                                                                                                                          ","L     ",0.03,12.4,12.4,0.37,0.37]
[null,"SINAPI_I",25972,"MICROESFERAS DE VIDRO PARA SINALIZACAO HORIZONTAL VIARIA, TIPO I-B (PREMIX) - NBR 16184                                                                                                                                                                                                                                                                                                                                                                                                                   ","KG    ",2.14,8.8800000000000008,8.8800000000000008,19,19]
[null,"SINAPI",95133,"MÁQUINA DEMARCADORA DE FAIXA DE TRÁFEGO À FRIO, AUTOPROPELIDA, POTÊNCIA 38 HP - CHP DIURNO. AF_07/2016","CHP",3.3E-3,109.81,113.39,0.36,0.37]
[null,"MATERIAL (C) - TOTAL",null,null,null,null,null,null,28.54,28.56]
[]
[235,"FONTE","CÓDIGO","DESCRIÇÃO","UNIDADE","COEFIC.","CUSTO UNITÁRIO",null,"CUSTO  TOTAL (A) + (B) + (C) + (D) + (E)"]
[null,null,null,null,null,null,"DESONERADO","NÃO DESONER.","DESONERADO","NÃO DESONER."]
[null,"COMPOSIÇÃO","COMP 235_SEE","PLACA DE SINALIZAÇÃO EM PVC COD 01 - (300X300) PROIBIDO FUMAR","UN ",null,null,null,24.109999999999996,24.229999999999997]
[null,"AGETOP_I",5,"SERVENTE","h     ",0.09,8.1999999999999993,9.51,0.74,0.86]
[null,null,null,"","",null,0,0,0,0]
[null,null,null,"","",null,0,0,0,0]
[null,"MÃO DE OBRA (B) - TOTAL",null,null,null,null,null,null,0.74,0.86]
[null,"AGETOP_I",3070,"BUCHA DE NYLON S-6","un",2,0.04,0.04,0.08,0.08]
[null,"AGETOP_I",3393,"PARAFUSO P/BUCHA S-6","un",2,0.08,0.08,0.16,0.16]
[null,"SINAPI_I",37556,"PLACA DE SINALIZACAO DE SEGURANCA CONTRA INCENDIO, FOTOLUMINESCENTE, QUADRADA, *20 X 20* CM, EM PVC *2* MM ANTI-CHAMAS (SIMBOLOS, CORES E PICTOGRAMAS CONFORME NBR 13434)                                                                                                                                                                                                                                                                                                                                 ","UN    ",1,23.13,23.13,23.13,23.13]
[null,"MATERIAL (C) - TOTAL",null,null,null,null,null,null,23.369999999999997,23.369999999999997]
[]
[236,"FONTE","CÓDIGO","DESCRIÇÃO","UNIDADE","COEFIC.","CUSTO UNITÁRIO",null,"CUSTO  TOTAL (A) + (B) + (C) + (D) + (E)"]
[null,null,null,null,null,null,"DESONERADO","NÃO DESONER.","DESONERADO","NÃO DESONER."]
[null,"COMPOSIÇÃO","COMP 236_SEE","PLACA DE SINALIZAÇÃO EM PVC COD 06 - (300X300) PERIGO INFLAMÁVEL","UN ",null,null,null,24.109999999999996,24.229999999999997]
[null,"AGETOP_I",5,"SERVENTE","h     ",0.09,8.1999999999999993,9.51,0.74,0.86]
[null,null,null,"","",null,0,0,0,0]
[null,null,null,"","",null,0,0,0,0]
[null,"MÃO DE OBRA (B) - TOTAL",null,null,null,null,null,null,0.74,0.86]
[null,"AGETOP_I",3070,"BUCHA DE NYLON S-6","un",2,0.04,0.04,0.08,0.08]
[null,"AGETOP_I",3393,"PARAFUSO P/BUCHA S-6","un",2,0.08,0.08,0.16,0.16]
[null,"SINAPI_I",37556,"PLACA DE SINALIZACAO DE SEGURANCA CONTRA INCENDIO, FOTOLUMINESCENTE, QUADRADA, *20 X 20* CM, EM PVC *2* MM ANTI-CHAMAS (SIMBOLOS, CORES E PICTOGRAMAS CONFORME NBR 13434)                                                                                                                                                                                                                                                                                                                                 ","UN    ",1,23.13,23.13,23.13,23.13]
[null,"MATERIAL (C) - TOTAL",null,null,null,null,null,null,23.369999999999997,23.369999999999997]
[]
[411,"FONTE","CÓDIGO","DESCRIÇÃO","UNIDADE","COEFIC.","CUSTO UNITÁRIO",null,"CUSTO  TOTAL (A) + (B) + (C) + (D) + (E)"]
[null,null,null,null,null,null,"DESONERADO","NÃO DESONER.","DESONERADO","NÃO DESONER."]
[null,"COMPOSIÇÃO","COMP 411_SEE","PLACA DE SINALIZAÇÃO EM PVC COD 13 - (316X158) SAÍDA DE EMERGÊNCIA","UN ",null,null,null,29.349999999999998,29.47]
[null,"AGETOP_I",5,"SERVENTE","h     ",0.09,8.1999999999999993,9.51,0.74,0.86]
[null,null,null,"","",null,0,0,0,0]
[null,null,null,"","",null,0,0,0,0]
[null,"MÃO DE OBRA (B) - TOTAL",null,null,null,null,null,null,0.74,0.86]
[null,"AGETOP_I",3070,"BUCHA DE NYLON S-6","un",2,0.04,0.04,0.08,0.08]
[null,"AGETOP_I",3393,"PARAFUSO P/BUCHA S-6","un",2,0.08,0.08,0.16,0.16]
[null,"SINAPI_I",37559,"PLACA DE SINALIZACAO DE SEGURANCA CONTRA INCENDIO, FOTOLUMINESCENTE, RETANGULAR, *12 X 40* CM, EM PVC *2* MM ANTI-CHAMAS (SIMBOLOS, CORES E PICTOGRAMAS CONFORME NBR 13434)                                                                                                                                                                                                                                                                                                                               ","UN    ",1,28.37,28.37,28.37,28.37]
[null,"MATERIAL (C) - TOTAL",null,null,null,null,null,null,28.61,28.61]
[]
[412,"FONTE","CÓDIGO","DESCRIÇÃO","UNIDADE","COEFIC.","CUSTO UNITÁRIO",null,"CUSTO  TOTAL (A) + (B) + (C) + (D) + (E)"]
[null,null,null,null,null,null,"DESONERADO","NÃO DESONER.","DESONERADO","NÃO DESONER."]
[null,"COMPOSIÇÃO","COMP 412_SEE","PLACA DE SINALIZAÇÃO EM PVC COD 17 - (316X158) MENSAGEM \"SAÍDA\"","UN ",null,null,null,29.349999999999998,29.47]
[null,"AGETOP_I",5,"SERVENTE","h     ",0.09,8.1999999999999993,9.51,0.74,0.86]
[null,null,null,"","",null,0,0,0,0]
[null,null,null,"","",null,0,0,0,0]
[null,"MÃO DE OBRA (B) - TOTAL",null,null,null,null,null,null,0.74,0.86]
[null,"AGETOP_I",3070,"BUCHA DE NYLON S-6","un",2,0.04,0.04,0.08,0.08]
[null,"AGETOP_I",3393,"PARAFUSO P/BUCHA S-6","un",2,0.08,0.08,0.16,0.16]
[null,"SINAPI_I",37559,"PLACA DE SINALIZACAO DE SEGURANCA CONTRA INCENDIO, FOTOLUMINESCENTE, RETANGULAR, *12 X 40* CM, EM PVC *2* MM ANTI-CHAMAS (SIMBOLOS, CORES E PICTOGRAMAS CONFORME NBR 13434)                                                                                                                                                                                                                                                                                                                               ","UN    ",1,28.37,28.37,28.37,28.37]
[null,"MATERIAL (C) - TOTAL",null,null,null,null,null,null,28.61,28.61]
[]
[382,"FONTE","CÓDIGO","DESCRIÇÃO","UNIDADE","COEFIC.","CUSTO UNITÁRIO",null,"CUSTO  TOTAL (A) + (B) + (C) + (D) + (E)"]
[null,null,null,null,null,null,"DESONERADO","NÃO DESONER.","DESONERADO","NÃO DESONER."]
[null,"COMPOSIÇÃO","COMP 382_SEE","TE DE REDUCAO DE FERRO GALVANIZADO, COM ROSCA BSP, DE 3/4\" X 1/2\"","UN ",null,null,null,21.93,24.020000000000003]
[null,"AGETOP_I",8,"AJUDANTE","h     ",0.6,8.1999999999999993,9.51,4.92,5.71]
[null,"AGETOP_I",11,"ENCANADOR","h     ",0.61050000000000004,13.4,15.53,8.18,9.48]
[null,null,null,"","",null,0,0,0,0]
[null,"MÃO DE OBRA (B) - TOTAL",null,null,null,null,null,null,13.1,15.190000000000001]
[null,"SINAPI_I",3146,"FITA VEDA ROSCA EM ROLOS DE 18 MM X 10 M (L X C)                                                                                                                                                                                                                                                                                                                                                                                                                                                          ","UN    ",0.12075471698113208,3.9,3.9,0.47,0.47]
[null,"SINAPI_I",6302,"TE DE REDUCAO DE FERRO GALVANIZADO, COM ROSCA BSP, DE 3/4\" X 1/2\"                                                                                                                                                                                                                                                                                                                                                                                                                                         ","UN    ",1,8.36,8.36,8.36,8.36]
[null,null,null,"","",null,0,0,0,0]
[null,"MATERIAL (C) - TOTAL",null,null,null,null,null,null,8.83,8.83]
[]
[383,"FONTE","CÓDIGO","DESCRIÇÃO","UNIDADE","COEFIC.","CUSTO UNITÁRIO",null,"CUSTO  TOTAL (A) + (B) + (C) + (D) + (E)"]
[null,null,null,null,null,null,"DESONERADO","NÃO DESONER.","DESONERADO","NÃO DESONER."]
[null,"COMPOSIÇÃO","COMP 383_SEE","BUCHA DE REDUCAO DE FERRO GALVANIZADO, COM ROSCA BSP, DE 1/2\" X 1/4\"","UN ",null,null,null,6.87,7.42]
[null,"AGETOP_I",8,"AJUDANTE","h     ",0.16,8.1999999999999993,9.51,1.31,1.52]
[null,"AGETOP_I",11,"ENCANADOR","h     ",0.16,13.4,15.53,2.14,2.48]
[null,null,null,"","",null,0,0,0,0]
[null,"MÃO DE OBRA (B) - TOTAL",null,null,null,null,null,null,3.45,4]
[null,"AGETOP_I","H689","FITA VEDAROSCA 12 MM","m",1.2,0.28000000000000003,0.28000000000000003,0.34,0.34]
[null,"SINAPI_I",770,"BUCHA DE REDUCAO DE FERRO GALVANIZADO, COM ROSCA BSP, DE 1/2\" X 1/4\"                                                                                                                                                                                                                                                                                                                                                                                                                                      ","UN    ",1,3.08,3.08,3.08,3.08]
[null,null,null,"","",null,0,0,0,0]
[null,"MATERIAL (C) - TOTAL",null,null,null,null,null,null,3.42,3.42]
[]
[212,"FONTE","CÓDIGO","DESCRIÇÃO","UNIDADE","COEFIC.","CUSTO UNITÁRIO",null,"CUSTO  TOTAL (A) + (B) + (C) + (D) + (E)"]
[null,null,null,null,null,null,"DESONERADO","NÃO DESONER.","DESONERADO","NÃO DESONER."]
[null,"COMPOSIÇÃO","COMP 212_SEE","NIPLE DE REDUÇÃO 1/2\" X 1/4\" BSP","UN ",null,null,null,9.5,10.050000000000001]
[null,"AGETOP_I",8,"AJUDANTE","h     ",0.16,8.1999999999999993,9.51,1.31,1.52]
[null,"AGETOP_I",11,"ENCANADOR","h     ",0.16,13.4,15.53,2.14,2.48]
[null,null,null,"","",null,0,0,0,0]
[null,"MÃO DE OBRA (B) - TOTAL",null,null,null,null,null,null,3.45,4]
[null,"COTAÇÃO","COT 103_SEE","NIPLE DE REDUÇÃO 1/2\" X 1/4\" BSP","UN",1,6.0533333333333337,6.0533333333333337,6.05,6.05]
[null,null,null,"","",null,0,0,0,0]
[null,null,null,"","",null,0,0,0,0]
[null,"MATERIAL (C) - TOTAL",null,null,null,null,null,null,6.05,6.05]
[]
[213,"FONTE","CÓDIGO","DESCRIÇÃO","UNIDADE","COEFIC.","CUSTO UNITÁRIO",null,"CUSTO  TOTAL (A) + (B) + (C) + (D) + (E)"]
[null,null,null,null,null,null,"DESONERADO","NÃO DESONER.","DESONERADO","NÃO DESONER."]
[null,"COMPOSIÇÃO","COMP 213_SEE","NIPLE DE REDUÇÃO 3/4\" X 1/2\" BSP","UN ",null,null,null,13.16,13.71]
[null,"AGETOP_I",8,"AJUDANTE","h     ",0.16,8.1999999999999993,9.51,1.31,1.52]
[null,"AGETOP_I",11,"ENCANADOR","h     ",0.16,13.4,15.53,2.14,2.48]
[null,null,null,"","",null,0,0,0,0]
[null,"MÃO DE OBRA (B) - TOTAL",null,null,null,null,null,null,3.45,4]
[null,"COTAÇÃO","COT 104_SEE","NIPLE DE REDUÇÃO 3/4\" X 1/2\" BSP","UN",1,9.7099999999999991,9.7099999999999991,9.7100000000000009,9.7100000000000009]
[null,null,null,"","",null,0,0,0,0]
[null,null,null,"","",null,0,0,0,0]
[null,"MATERIAL (C) - TOTAL",null,null,null,null,null,null,9.7100000000000009,9.7100000000000009]
[]
[237,"FONTE","CÓDIGO","DESCRIÇÃO","UNIDADE","COEFIC.","CUSTO UNITÁRIO",null,"CUSTO  TOTAL (A) + (B) + (C) + (D) + (E)"]
[null,null,null,null,null,null,"DESONERADO","NÃO DESONER.","DESONERADO","NÃO DESONER."]
[null,"COMPOSIÇÃO","COMP 237_SEE","FITA ANTICORROSIVA","M",null,null,null,11.92,12.61]
[null,"AGETOP_I",8,"AJUDANTE","h     ",0.2,8.1999999999999993,9.51,1.64,1.9]
[null,"AGETOP_I",12,"ELETRICISTA","h     ",0.2,13.4,15.53,2.68,3.11]
[null,null,null,"","",null,0,0,0,0]
[null,"MÃO DE OBRA (B) - TOTAL",null,null,null,null,null,null,4.32,5.01]
[null,"SINAPI_I",39634,"FITA ADESIVA ANTICORROSIVA DE PVC FLEXIVEL, COR PRETA, PARA PROTECAO TUBULACAO, 50 MM X 30 M (L X C), E= *0,25* MM                                                                                                                                                                                                                                                                                                                                                                                        ","M     ",1,7.6,7.6,7.6,7.6]
[null,null,null,"","",null,0,0,0,0]
[null,null,null,"","",null,0,0,0,0]
[null,"MATERIAL (C) - TOTAL",null,null,null,null,null,null,7.6,7.6]
[]
[542,"FONTE","CÓDIGO","DESCRIÇÃO","UNIDADE","COEFIC.","CUSTO UNITÁRIO",null,"CUSTO  TOTAL (A) + (B) + (C) + (D) + (E)"]
[null,null,null,null,null,null,"DESONERADO","NÃO DESONER.","DESONERADO","NÃO DESONER."]
[null,"COMPOSIÇÃO","COMP 542_SEE","VÁLVULA UGV 3/4\" (S) LATÃO","UN ",null,null,null,25.17,26.66]
[null,"AGETOP_I",8,"AJUDANTE","h     ",0.432,8.1999999999999993,9.51,3.54,4.1100000000000003]
[null,"AGETOP_I",11,"ENCANADOR","h     ",0.432,13.4,15.53,5.79,6.71]
[null,null,null,"","",null,0,0,0,0]
[null,"MÃO DE OBRA (B) - TOTAL",null,null,null,null,null,null,9.33,10.82]
[null,"COTAÇÃO","COT 281_SEE","VÁLVULA UGV 3/4\" (S) LATÃO","UN ",1,15.836666666666666,15.836666666666666,15.84,15.84]
[null,null,null,"","",null,0,0,0,0]
[null,null,null,"","",null,0,0,0,0]
[null,"MATERIAL (C) - TOTAL",null,null,null,null,null,null,15.84,15.84]
[]
[543,"FONTE","CÓDIGO","DESCRIÇÃO","UNIDADE","COEFIC.","CUSTO UNITÁRIO",null,"CUSTO  TOTAL (A) + (B) + (C) + (D) + (E)"]
[null,null,null,null,null,null,"DESONERADO","NÃO DESONER.","DESONERADO","NÃO DESONER."]
[null,"COMPOSIÇÃO","COMP 543_SEE","VÁLVULA UGV 1/2\" (S) LATÃO","UN ",null,null,null,24.5,25.990000000000002]
[null,"AGETOP_I",8,"AJUDANTE","h     ",0.432,8.1999999999999993,9.51,3.54,4.1100000000000003]
[null,"AGETOP_I",11,"ENCANADOR","h     ",0.432,13.4,15.53,5.79,6.71]
[null,null,null,"","",null,0,0,0,0]
[null,"MÃO DE OBRA (B) - TOTAL",null,null,null,null,null,null,9.33,10.82]
[null,"COTAÇÃO","COT 282_SEE","VÁLVULA UGV 1/2\" (S) LATÃO","UN ",1,15.166666666666666,15.166666666666666,15.17,15.17]
[null,null,null,"","",null,0,0,0,0]
[null,null,null,"","",null,0,0,0,0]
[null,"MATERIAL (C) - TOTAL",null,null,null,null,null,null,15.17,15.17]
[]
[211,"FONTE","CÓDIGO","DESCRIÇÃO","UNIDADE","COEFIC.","CUSTO UNITÁRIO",null,"CUSTO  TOTAL (A) + (B) + (C) + (D) + (E)"]
[null,null,null,null,null,null,"DESONERADO","NÃO DESONER.","DESONERADO","NÃO DESONER."]
[null,"COMPOSIÇÃO","COMP 211_SEE","REGULADOR DE 2º ESTÁGIO 5KG/H","UN ",null,null,null,85.46,89.419999999999987]
[null,"AGETOP_I",8,"AJUDANTE","h     ",1.1499999999999999,8.1999999999999993,9.51,9.43,10.94]
[null,"AGETOP_I",11,"ENCANADOR","h     ",1.1499999999999999,13.4,15.53,15.41,17.86]
[null,null,null,"","",null,0,0,0,0]
[null,"MÃO DE OBRA (B) - TOTAL",null,null,null,null,null,null,24.84,28.799999999999997]
[null,"COTAÇÃO","COT 102_SEE","REGULADOR DE 2º ESTÁGIO 5KG/H","UN",1,59.833333333333336,59.833333333333336,59.83,59.83]
[null,"AGETOP_I","H689","FITA VEDAROSCA 12 MM","m",2.82,0.28000000000000003,0.28000000000000003,0.79,0.79]
[null,null,null,"","",null,0,0,0,0]
[null,"MATERIAL (C) - TOTAL",null,null,null,null,null,null,60.62,60.62]
[]
[210,"FONTE","CÓDIGO","DESCRIÇÃO","UNIDADE","COEFIC.","CUSTO UNITÁRIO",null,"CUSTO  TOTAL (A) + (B) + (C) + (D) + (E)"]
[null,null,null,null,null,null,"DESONERADO","NÃO DESONER.","DESONERADO","NÃO DESONER."]
[null,"COMPOSIÇÃO","COMP 210_SEE","REGULADOR DE 1º ESTÁGIO 60KG/H MODELO AP-40  COM MANÔMETRO","UN ",null,null,null,231.21,235.17000000000002]
[null,"AGETOP_I",8,"AJUDANTE","h     ",1.1499999999999999,8.1999999999999993,9.51,9.43,10.94]
[null,"AGETOP_I",11,"ENCANADOR","h     ",1.1499999999999999,13.4,15.53,15.41,17.86]
[null,null,null,"","",null,0,0,0,0]
[null,"MÃO DE OBRA (B) - TOTAL",null,null,null,null,null,null,24.84,28.799999999999997]
[null,"COTAÇÃO","COT 101_SEE","REGULADOR DE 1º ESTÁGIO 60KG/H MODELO AP-40  COM MANÔMETRO","UN",1,205.57666666666668,205.57666666666668,205.58,205.58]
[null,"AGETOP_I","H689","FITA VEDAROSCA 12 MM","m",2.82,0.28000000000000003,0.28000000000000003,0.79,0.79]
[null,null,null,"","",null,0,0,0,0]
[null,"MATERIAL (C) - TOTAL",null,null,null,null,null,null,206.37,206.37]
[]
[235,"FONTE","CÓDIGO","DESCRIÇÃO","UNIDADE","COEFIC.","CUSTO UNITÁRIO",null,"CUSTO  TOTAL (A) + (B) + (C) + (D) + (E)"]
[null,null,null,null,null,null,"DESONERADO","NÃO DESONER.","DESONERADO","NÃO DESONER."]
[null,"COMPOSIÇÃO","COMP 235_SEE","PLACA DE SINALIZAÇÃO EM PVC COD 01 - (300X300) PROIBIDO FUMAR","UN ",null,null,null,24.109999999999996,24.229999999999997]
[null,"AGETOP_I",5,"SERVENTE","h     ",0.09,8.1999999999999993,9.51,0.74,0.86]
[null,null,null,"","",null,0,0,0,0]
[null,null,null,"","",null,0,0,0,0]
[null,"MÃO DE OBRA (B) - TOTAL",null,null,null,null,null,null,0.74,0.86]
[null,"AGETOP_I",3070,"BUCHA DE NYLON S-6","un",2,0.04,0.04,0.08,0.08]
[null,"AGETOP_I",3393,"PARAFUSO P/BUCHA S-6","un",2,0.08,0.08,0.16,0.16]
[null,"SINAPI_I",37556,"PLACA DE SINALIZACAO DE SEGURANCA CONTRA INCENDIO, FOTOLUMINESCENTE, QUADRADA, *20 X 20* CM, EM PVC *2* MM ANTI-CHAMAS (SIMBOLOS, CORES E PICTOGRAMAS CONFORME NBR 13434)                                                                                                                                                                                                                                                                                                                                 ","UN    ",1,23.13,23.13,23.13,23.13]
[null,"MATERIAL (C) - TOTAL",null,null,null,null,null,null,23.369999999999997,23.369999999999997]
[]
[236,"FONTE","CÓDIGO","DESCRIÇÃO","UNIDADE","COEFIC.","CUSTO UNITÁRIO",null,"CUSTO  TOTAL (A) + (B) + (C) + (D) + (E)"]
[null,null,null,null,null,null,"DESONERADO","NÃO DESONER.","DESONERADO","NÃO DESONER."]
[null,"COMPOSIÇÃO","COMP 236_SEE","PLACA DE SINALIZAÇÃO EM PVC COD 06 - (300X300) PERIGO INFLAMÁVEL","UN ",null,null,null,24.109999999999996,24.229999999999997]
[null,"AGETOP_I",5,"SERVENTE","h     ",0.09,8.1999999999999993,9.51,0.74,0.86]
[null,null,null,"","",null,0,0,0,0]
[null,null,null,"","",null,0,0,0,0]
[null,"MÃO DE OBRA (B) - TOTAL",null,null,null,null,null,null,0.74,0.86]
[null,"AGETOP_I",3070,"BUCHA DE NYLON S-6","un",2,0.04,0.04,0.08,0.08]
[null,"AGETOP_I",3393,"PARAFUSO P/BUCHA S-6","un",2,0.08,0.08,0.16,0.16]
[null,"SINAPI_I",37556,"PLACA DE SINALIZACAO DE SEGURANCA CONTRA INCENDIO, FOTOLUMINESCENTE, QUADRADA, *20 X 20* CM, EM PVC *2* MM ANTI-CHAMAS (SIMBOLOS, CORES E PICTOGRAMAS CONFORME NBR 13434)                                                                                                                                                                                                                                                                                                                                 ","UN    ",1,23.13,23.13,23.13,23.13]
[null,"MATERIAL (C) - TOTAL",null,null,null,null,null,null,23.369999999999997,23.369999999999997]
[]
[31,"FONTE","CÓDIGO","DESCRIÇÃO","UNIDADE","COEFIC.","CUSTO UNITÁRIO",null,"CUSTO  TOTAL (A) + (B) + (C) + (D) + (E)"]
[null,null,null,null,null,null,"DESONERADO","NÃO DESONER.","DESONERADO","NÃO DESONER."]
[null,"COMPOSIÇÃO","COMP 031_SEE","MURETA P/ QUAD. POLIESP. ALV. DE TIJ. FURADO - 1/2 VEZ - C/ CHP. E PEDRISCO - H=0,80 M","M",null,null,null,31.649999999999995,33.459999999999994]
[null,"AGETOP_I",5,"SERVENTE","h     ",0.50848000000000004,8.1999999999999993,9.51,4.17,4.84]
[null,"AGETOP_I",4,"PEDREIRO","h     ",0.2278,13.4,15.53,3.05,3.54]
[null,"AGETOP_I",32,"OPERADOR DE BETONEIRA ","h     ",3.6499999999999998E-2,9.85,11.41,0.36,0.42]
[null,"AGETOP_I",8,"AJUDANTE","h     ",0.17269999999999999,8.1999999999999993,9.51,1.42,1.64]
[null,"AGETOP_I",6,"ARMADOR","h     ",0.1145,13.4,15.53,1.53,1.78]
[null,"AGETOP_I",10,"CARPINTEIRO","h     ",5.5500000000000001E-2,13.4,15.53,0.74,0.86]
[null,"MÃO DE OBRA (B) - TOTAL",null,null,null,null,null,null,11.27,13.079999999999998]
[null,"AGETOP_I",104,"AREIA MEDIA ","m3",2.2440000000000002E-2,82.85,82.85,1.86,1.86]
[null,"AGETOP_I",102,"ARAME RECOZIDO 18","Kg",2.9839999999999998E-2,6.75,6.75,0.2,0.2]
[null,"AGETOP_I",2426,"ARAME GALVANIZADO No. 12 BWG","Kg",2.5600000000000002E-3,6.5,6.5,0.02,0.02]
[null,"AGETOP_I",2448,"ACO CA-60 B - 5,0 MM","Kg",0.50471999999999995,4.45,4.45,2.25,2.25]
[null,"AGETOP_I",2437,"ACO CA-50 - 6,3 MM (1/4\")","Kg",0.33,4.28,4.28,1.41,1.41]
[null,"AGETOP_I",2438,"ACO CA-50 - 8,0 MM (5/16\")","Kg",0.80456000000000005,4.0999999999999996,4.0999999999999996,3.3,3.3]
[null,"AGETOP_I",2386,"BRITA No. 01","m3",1.6719999999999999E-2,85.36,85.36,1.43,1.43]
[null,"AGETOP_I",2497,"BRITA No.02","m3",1.6719999999999999E-2,74.900000000000006,74.900000000000006,1.25,1.25]
[null,"AGETOP_I",1221,"CAL HIDRATADA","Kg",0.67584,0.54,0.54,0.36,0.36]
[null,"AGETOP_I",1215,"CIMENTO PORTLAND C.P. 32","Kg",6.6745599999999996,0.39,0.39,2.6,2.6]
[null,"AGETOP_I",2034,"TIJOLO FURADO 19x19x9","un",8.3699200000000005,0.48,0.48,4.0199999999999996,4.0199999999999996]
[null,"AGETOP_I",2023,"TABUA PARA FORMA(30CM)","m",0.17743999999999999,5.63,5.63,1,1]
[null,"AGETOP_I",1861,"PREGO 18x24","Kg",1.2840000000000001E-2,5.99,5.99,0.08,0.08]
[null,"AGETOP_I",1858,"PONTALETE 3x3\"","m",0.11384,5.24,5.24,0.6,0.6]
[null,"MATERIAL (C) - TOTAL",null,null,null,null,null,null,20.379999999999995,20.379999999999995]
[]
[387,"FONTE","CÓDIGO","DESCRIÇÃO","UNIDADE","COEFIC.","CUSTO UNITÁRIO",null,"CUSTO  TOTAL (A) + (B) + (C) + (D) + (E)"]
[null,null,null,null,null,null,"DESONERADO","NÃO DESONER.","DESONERADO","NÃO DESONER."]
[null,"COMPOSIÇÃO","COMP 387_SEE","LÂMPADA LED TUBULAR 18W ","UN ",null,null,null,22.28,22.330000000000002]
[null,"AGETOP_I",8,"AJUDANTE","h     ",1.4999999999999999E-2,8.1999999999999993,9.51,0.12,0.14000000000000001]
[null,"AGETOP_I",12,"ELETRICISTA","h     ",1.4999999999999999E-2,13.4,15.53,0.2,0.23]
[null,null,null,"","",null,0,0,0,0]
[null,"MÃO DE OBRA (B) - TOTAL",null,null,null,null,null,null,0.32,0.37]
[null,"COTAÇÃO","COT 195_SEE","LÂMPADA LED TUBULAR 18W ","UN",1,21.959999999999997,21.959999999999997,21.96,21.96]
[null,null,null,"","",null,0,0,0,0]
[null,null,null,"","",null,0,0,0,0]
[null,"MATERIAL (C) - TOTAL",null,null,null,null,null,null,21.96,21.96]