{"text_format":"1","workbook":"xlsx","n_sheets":8,"sheets":["Orçamento","Resumo ","Somatório","Cronog_120_Dias","Composição BDI","Relatório CENTRAL","Parc Maior Relev","Composições"],"not_rendered":{"charts":0,"images":3,"macros":1,"external_links":0,"defined_names":79,"comments":2,"pivot_tables":0},"unopened":[],"bounds":{"document_bytes":16777216,"sheet_cells":100000,"rows_first":2000,"rows_last":500,"rows_between":2000,"halvings":0,"cell_chars":16384,"cell_head_chars":4096},"cells_cut":0,"cells_raw":0,"read":"whole","date_system":"1900"}

{"sheet":"Orçamento","index":0,"n_rows":379,"n_cols":24,"rows_kept":379,"cut":false,"hidden":false,"merged":[[314,16,314,22],[8,12,9,12],[349,18,349,20],[349,21,349,22],[0,14,0,22],[8,14,8,16],[9,14,9,16],[11,14,11,16],[12,14,12,16],[14,14,14,22],[1,14,1,22],[4,14,4,22],[7,14,7,22],[333,18,333,20],[333,21,333,22],[341,21,341,22],[330,15,330,17],[331,15,331,17],[332,15,332,17],[334,21,334,22],[342,18,342,20],[342,21,342,22],[340,18,340,20],[340,21,340,22],[348,18,348,20],[348,21,348,22],[335,18,335,20],[335,21,335,22],[328,18,328,20],[328,21,328,22],[350,18,350,20],[350,21,350,22],[304,20,304,21],[326,18,326,20],[326,21,326,22],[327,18,327,20],[327,21,327,22],[325,18,325,20],[325,21,325,22],[334,18,334,20],[305,20,305,21],[316,18,316,22],[322,18,322,20],[322,21,322,22],[323,18,323,20],[323,21,323,22],[324,18,324,20],[324,21,324,22],[347,18,347,20],[347,21,347,22],[344,21,344,22],[345,18,345,20],[345,21,345,22],[346,18,346,20],[346,21,346,22],[336,18,336,20],[336,21,336,22],[343,18,343,20],[343,21,343,22],[338,21,338,22],[339,18,339,20],[339,21,339,22],[341,18,341,20],[337,18,337,20],[337,21,337,22],[338,18,338,20],[342,15,342,17],[343,15,343,17],[344,15,344,17],[345,15,345,17],[346,15,346,17],[319,14,319,23],[308,20,308,21],[307,20,307,21],[303,17,308,17],[303,20,303,21],[320,18,320,20],[320,21,320,22],[321,18,321,20],[321,21,321,22],[309,20,309,21],[329,18,329,20],[329,21,329,22],[330,18,330,20],[330,21,330,22],[331,18,331,20],[331,21,331,22],[332,18,332,20],[332,21,332,22],[344,18,344,20],[321,15,321,17],[322,15,322,17],[323,15,323,17],[324,15,324,17],[325,15,325,17],[326,15,326,17],[327,15,327,17],[328,15,328,17],[329,15,329,17],[333,15,333,17],[334,15,334,17],[335,15,335,17],[336,15,336,17],[337,15,337,17],[338,15,338,17],[339,15,339,17],[340,15,340,17],[341,15,341,17],[311,16,311,22],[312,16,312,22],[313,16,313,22],[3,21,3,22],[2,21,2,22],[5,21,5,22],[10,14,10,23],[13,14,13,23],[6,21,6,22],[9,17,9,20],[2,14,2,20],[3,14,3,20],[5,18,5,20],[6,18,6,20],[11,18,11,20],[12,18,12,20],[6,14,6,17],[5,14,5,17],[315,16,315,22],[378,18,378,20],[378,21,378,22],[375,14,375,17],[372,15,372,17],[372,18,372,20],[372,21,372,22],[373,15,373,17],[373,18,373,20],[373,21,373,22],[374,15,374,17],[374,18,374,20],[374,21,374,22],[377,18,377,20],[377,21,377,22],[376,18,376,20],[376,21,376,22],[353,14,353,23],[354,18,354,20],[354,21,354,22],[355,15,355,17],[355,18,355,20],[355,21,355,22],[356,15,356,17],[347,14,347,17],[354,15,354,17],[320,15,320,17],[375,18,375,20],[375,21,375,22],[363,15,363,17],[363,18,363,20],[363,21,363,22],[364,15,364,17],[364,18,364,20],[364,21,364,22],[365,15,365,17],[365,18,365,20],[365,21,365,22],[369,15,369,17],[369,18,369,20],[369,21,369,22],[370,15,370,17],[370,18,370,20],[370,21,370,22],[371,15,371,17],[360,15,360,17],[356,18,356,20],[356,21,356,22],[371,18,371,20],[371,21,371,22],[366,15,366,17],[366,18,366,20],[366,21,366,22],[367,15,367,17],[367,18,367,20],[367,21,367,22],[368,15,368,17],[368,18,368,20],[368,21,368,22],[360,18,360,20],[360,21,360,22],[361,15,361,17],[361,18,361,20],[361,21,361,22],[362,15,362,17],[362,18,362,20],[362,21,362,22],[357,15,357,17],[357,18,357,20],[357,21,357,22],[358,15,358,17],[358,18,358,20],[358,21,358,22],[359,15,359,17],[359,18,359,20],[359,21,359,22]]}
[]
[]
[null,null,null,null,null,null,null,null,null,null,null,null,null,null,"UNIDADE ESCOLAR",null,null,null,null,null,null,"CÓDIGO INEP"]
[null,null,null,null,null,null,null,null,null,null,null,null,null,null,"ESCOLA ESTADUAL EDMO TEIXEIRA",null,null,null,null,null,null,52027147]
[]
["Nmax",null,null,null,null,null,null,null,null,null,null,null,null,null,"OBRA",null,null,null,"DATA",null,null,"CIDADE"]
[{"$f":"MAX($C$18:$C$303)","v":4},null,null,null,null,null,null,null,null,null,null,null,null,null,"REFORMA E IMPLANTAÇÃO",null,null,null,"2020-04-23",null,null,"IPORÁ"]
[]
[null,null,null,null,null,null,null,null,null,null,null,null,"",null,"CRE",null,null,"ENDEREÇO",null,null,null,"REFERÊNCIA AGETOP"]
[null,null,null,null,null,null,null,null,null,null,null,null,null,null,"IPORÁ",null,null,"AV. CAIAPÓ 282, SAO FRANCISCO, CEP:76200-000",null,null,null,"DEZ/18","DESONERADA"]
[]
[null,null,null,null,null,null,null,null,null,null,null,null,null,null,"ÁREA EXISTENTE (M²)",null,null,"ÁREA A CONSTRUIR (M²)","ÁREA TOTAL CONSTRUÍDA (M²)",null,null,"REFERÊNCIA SINAPI"]
[null,null,null,null,null,null,null,null,null,null,null,null,null,null,787.17,null,null,337.2,1124.3699999999999,null,null,"MAI/19","DESONERADA"]
[]
[null,null,null,null,null,null,null,null,null,null,null,"FILTRO",null,null,"PLANILHA ORÇAMENTÁRIA"]
["Nível E","Save Nivel","Nível C","Altura","n1","n2","n3","n4","n5","Czero","Cnível","↓","Nível","Nível Corrigido","ITEM","TABELA","CODIGO","DESCRIÇÃO DOS SERVIÇOS","UNID","QUANT","MAT","MO","T.SERVIÇO","OBSERVAÇÕES¹"]
[{"$f":"CHOOSE(1+LOG(1+2*(ORÇAMENTO.Nivel=\"Nível 1\")+4*(ORÇAMENTO.Nivel=\"Nível 2\")+8*(ORÇAMENTO.Nivel=\"Nível 3\")+16*(ORÇAMENTO.Nivel=\"Nível 4\")+32*(ORÇAMENTO.Nivel=\"Serviço\"),2),0,1,2,3,4,\"S\")","v":"S"},{"$f":"IF(OR(C17=\"s\",C17=0),OFFSET(B17,-1,0),C17)","v":"Save Nivel"},{"$f":"IF(OFFSET(C17,-1,0)=\"L\",1,IF(OFFSET(C17,-1,0)=1,2,IF(OR(A17=\"s\",A17=0),\"S\",IF(AND(OFFSET(C17,-1,0)=2,A17=4),3,IF(AND(OR(OFFSET(C17,-1,0)=\"s\",OFFSET(C17,-1,0)=0),A17<>\"s\",A17>OFFSET(B17,-1,0)),OFFSET(B17,-1,0),A17)))))","v":"S"},{"$f":"IF(OR(C17=\"S\",C17=0),0,IF(ISERROR(K17),J17,SMALL(J17:K17,1)))","v":0},{"$f":"IF($C17=1,OFFSET(E17,-1,0)+1,OFFSET(E17,-1,0))","v":"n1"},{"$f":"IF($C17=1,0,IF($C17=2,OFFSET(F17,-1,0)+1,OFFSET(F17,-1,0)))","v":"n2"},{"$f":"IF(AND($C17<=2,$C17<>0),0,IF($C17=3,OFFSET(G17,-1,0)+1,OFFSET(G17,-1,0)))","v":"n3"},{"$f":"IF(AND($C17<=3,$C17<>0),0,IF($C17=4,OFFSET(H17,-1,0)+1,OFFSET(H17,-1,0)))","v":"n4"},{"$f":"IF(AND($C17<=4,$C17<>0),0,IF(AND($C17=\"S\",$W17>0),OFFSET(I17,-1,0)+1,OFFSET(I17,-1,0)))","v":"n5"},{"$f":"IF(OR($C17=\"S\",$C17=0),0,MATCH(0,OFFSET($D17,1,$C17,ROW($C$303)-ROW($C17)),0))","v":0},{"$f":"IF(OR($C17=\"S\",$C17=0),0,MATCH(OFFSET($D17,0,$C17)+1,OFFSET($D17,1,$C17,ROW($C$303)-ROW($C17)),0))","v":0},"","Serviço","Serviço","-","SINAPI",null,"(sem código)","-",null,0,0,0,""]
[0,null,"L",{"$f":"COUNTA(OFFSET(D18,1,0):D$303)","v":284},{"$f":"LEFT(O19,1)-1","v":0},null,null,null,null,null,null,"F","LOTE","LOTE","REFORMA E IMPLANTAÇÃO - ESCOLA ESTADUAL EDMO TEIXEIRA",null,null,null,null,null,null,null,384166.85000000009]
[1,{"$f":"IF(OR(C19=\"s\",C19=0),OFFSET(B19,-1,0),C19)","v":1},{"$f":"IF(OFFSET(C19,-1,0)=\"L\",1,IF(OFFSET(C19,-1,0)=1,2,IF(OR(A19=\"s\",A19=0),\"S\",IF(AND(OFFSET(C19,-1,0)=2,A19=4),3,IF(AND(OR(OFFSET(C19,-1,0)=\"s\",OFFSET(C19,-1,0)=0),A19<>\"s\",A19>OFFSET(B19,-1,0)),OFFSET(B19,-1,0),A19)))))","v":1},{"$f":"IF(OR(C19=\"S\",C19=0),0,IF(ISERROR(K19),J19,SMALL(J19:K19,1)))","v":189},{"$f":"IF($C19=1,OFFSET(E19,-1,0)+1,OFFSET(E19,-1,0))","v":1},{"$f":"IF($C19=1,0,IF($C19=2,OFFSET(F19,-1,0)+1,OFFSET(F19,-1,0)))","v":0},{"$f":"IF(AND($C19<=2,$C19<>0),0,IF($C19=3,OFFSET(G19,-1,0)+1,OFFSET(G19,-1,0)))","v":0},{"$f":"IF(AND($C19<=3,$C19<>0),0,IF($C19=4,OFFSET(H19,-1,0)+1,OFFSET(H19,-1,0)))","v":0},0,{"$f":"IF(OR($C19=\"S\",$C19=0),0,MATCH(0,OFFSET($D19,1,$C19,ROW($C$303)-ROW($C19)),0))","v":284},{"$f":"IF(OR($C19=\"S\",$C19=0),0,MATCH(OFFSET($D19,0,$C19)+1,OFFSET($D19,1,$C19,ROW($C$303)-ROW($C19)),0))","v":189},"F","Nível 1","Nível 1","1.","AGETOP",null,"REFORMA"]
[2,{"$f":"IF(OR(C20=\"s\",C20=0),OFFSET(B20,-1,0),C20)","v":2},{"$f":"IF(OFFSET(C20,-1,0)=\"L\",1,IF(OFFSET(C20,-1,0)=1,2,IF(OR(A20=\"s\",A20=0),\"S\",IF(AND(OFFSET(C20,-1,0)=2,A20=4),3,IF(AND(OR(OFFSET(C20,-1,0)=\"s\",OFFSET(C20,-1,0)=0),A20<>\"s\",A20>OFFSET(B20,-1,0)),OFFSET(B20,-1,0),A20)))))","v":2},{"$f":"IF(OR(C20=\"S\",C20=0),0,IF(ISERROR(K20),J20,SMALL(J20:K20,1)))","v":17},{"$f":"IF($C20=1,OFFSET(E20,-1,0)+1,OFFSET(E20,-1,0))","v":1},{"$f":"IF($C20=1,0,IF($C20=2,OFFSET(F20,-1,0)+1,OFFSET(F20,-1,0)))","v":1},{"$f":"IF(AND($C20<=2,$C20<>0),0,IF($C20=3,OFFSET(G20,-1,0)+1,OFFSET(G20,-1,0)))","v":0},{"$f":"IF(AND($C20<=3,$C20<>0),0,IF($C20=4,OFFSET(H20,-1,0)+1,OFFSET(H20,-1,0)))","v":0},0,188,17,"F","Nível 2","Nível 2","1.1.","AGETOP",null,"SERVIÇOS PRELIMINARES"]
[3,{"$f":"IF(OR(C21=\"s\",C21=0),OFFSET(B21,-1,0),C21)","v":3},{"$f":"IF(OFFSET(C21,-1,0)=\"L\",1,IF(OFFSET(C21,-1,0)=1,2,IF(OR(A21=\"s\",A21=0),\"S\",IF(AND(OFFSET(C21,-1,0)=2,A21=4),3,IF(AND(OR(OFFSET(C21,-1,0)=\"s\",OFFSET(C21,-1,0)=0),A21<>\"s\",A21>OFFSET(B21,-1,0)),OFFSET(B21,-1,0),A21)))))","v":3},{"$f":"IF(OR(C21=\"S\",C21=0),0,IF(ISERROR(K21),J21,SMALL(J21:K21,1)))","v":12},1,1,1,0,0,16,12,"F","Nível 3","Nível 3","1.1.1.","SINAPI",null,"DEMOLIÇÃO","-",null,null,null,null,""]
["S",3,"S",0,1,1,1,0,0,0,0,"F","Serviço","Serviço","1.1.1.0.1.","SINAPI",98530,"CORTE RASO E RECORTE DE ÁRVORE COM DIÂMETRO DE TRONCO MAIOR OU IGUAL A 0,40 M E MENOR QUE 0,60 M.AF_05/2018","UN",4,null,null,null,""]
["S",3,"S",0,1,1,1,0,0,0,0,"F","Serviço","Serviço","1.1.1.0.2.","SINAPI",98527,"REMOÇÃO DE RAÍZES REMANESCENTES DE TRONCO DE ÁRVORE COM DIÂMETRO MAIOR OU IGUAL A 0,40 M E MENOR QUE 0,60 M.AF_05/2018","UN",4,null,null,null,""]
["S",3,"S",0,1,1,1,0,0,0,0,"F","Serviço","Serviço","1.1.1.0.3.","AGETOP",20141,"DEMOLIÇAO DE CAIXA DESCARGA EXTERNA C/ TRANSP. ATÉ CB. E CARGA","Un    ",1,null,null,null,""]
["S",3,"S",0,1,1,1,0,0,0,0,"F","Serviço","Serviço","1.1.1.0.4.","AGETOP",20137,"DEMOLIÇAO BACIA SANITARIA C/ TRANSP. ATÉ CB. E CARGA","Un    ",1,null,null,null,""]
["S",3,"S",0,1,1,1,0,0,0,0,"F","Serviço","Serviço","1.1.1.0.5.","AGETOP",20138,"DEMOLIÇAO DE LAVATÓRIO C/ TRANSP. ATÉ CB. E CARGA","Un    ",1,null,null,null,""]
["S",3,"S",0,1,1,1,0,0,0,0,"F","Serviço","Serviço","1.1.1.0.6.","AGETOP",20134,"DEM.DE FORRO GESSO C/TRANSP.ATE CB.E CARGA","m2    ",48.91,null,null,null,""]
["S",3,"S",0,1,1,1,0,0,0,0,"F","Serviço","Serviço","1.1.1.0.7.","AGETOP",20121,"DEM. MANUAL EM CONCR.SIMPLES C/TR.ATE CB.E CARGA (O.C.)","m3    ",34.963000000000001,null,null,null,""]
["S",3,"S",0,1,1,1,0,0,0,0,"F","Serviço","Serviço","1.1.1.0.8.","AGETOP",20101,"DEMOLICAO COBERTURA TELHA CERAMICA C/ TRANSP. ATÉ CB. E CARGA","m2    ",415.52,null,null,null,""]
["S",3,"S",0,1,1,1,0,0,0,0,"F","Serviço","Serviço","1.1.1.0.9.","AGETOP",20109,"DEM.PISO CIMENT.SOBRE LASTRO CONC.C/TR.ATE CB. E CARGA","m2    ",554.28000000000009,null,null,null,""]
["S",3,"S",0,1,1,1,0,0,0,0,"F","Serviço","Serviço","1.1.1.0.10.","AGETOP",20163,"DEMOLIÇÃO DAS INSTALAÇÕES HIDROSANITÁRIAS E AFINS C/ TRANSP. ATÉ CB. E CARGA","H     ",2,null,null,null,""]
["S",3,"S",0,1,1,1,0,0,0,0,"F","Serviço","Serviço","1.1.1.0.11.","SINAPI","74209/1","PLACA DE OBRA EM CHAPA DE ACO GALVANIZADO","M2",4.5,null,null,null,"Referência: AGETOP - 21301"]
[3,3,3,4,1,1,2,0,0,4,138,"F","Nível 3","Nível 3","1.1.2.","SINAPI",null,"DEMOLIÇÃO DE ITENS ELÉTRICOS","-",null,null,null,null,""]
["S",3,"S",0,1,1,2,0,0,0,0,"F","Serviço","Serviço","1.1.2.0.1.","SINAPI",97661,"REMOÇÃO DE CABOS ELÉTRICOS, DE FORMA MANUAL, SEM REAPROVEITAMENTO. AF_12/2017","M",2000,null,null,null,""]
["S",3,"S",0,1,1,2,0,0,0,0,"F","Serviço","Serviço","1.1.2.0.2.","SINAPI",97660,"REMOÇÃO DE INTERRUPTORES/TOMADAS ELÉTRICAS, DE FORMA MANUAL, SEM REAPROVEITAMENTO. AF_12/2017","UN",35,null,null,null,""]
["S",3,"S",0,1,1,2,0,0,0,0,"F","Serviço","Serviço","1.1.2.0.3.","SINAPI",97665,"REMOÇÃO DE LUMINÁRIAS, DE FORMA MANUAL, SEM REAPROVEITAMENTO. AF_12/2017","UN",60,null,null,null,""]
[2,2,2,3,1,2,0,0,0,171,3,"F","Nível 2","Nível 2","1.2.","AGETOP",null,"TRANSPORTES","-",null,null,null,null,""]
["S",2,"S",0,1,2,0,0,0,0,0,"F","Serviço","Serviço","1.2.0.0.1.","SINAPI",72900,"TRANSPORTE DE ENTULHO COM CAMINHAO BASCULANTE 6 M3, RODOVIA PAVIMENTADA, DMT 0,5 A 1,0 KM","M3",65.035200000000003,null,null,null,""]
["S",2,"S",0,1,2,0,0,0,0,0,"F","Serviço","Serviço","1.2.0.0.2.","SINAPI",72897,"CARGA MANUAL DE ENTULHO EM CAMINHAO BASCULANTE 6 M3","M3",65.035200000000003,null,null,null,""]
[2,2,2,7,1,3,0,0,0,168,7,"F","Nível 2","Nível 2","1.3.","AGETOP",null,"SERVIÇO EM TERRA","-",null,null,null,null,""]
[3,3,3,3,1,3,1,0,0,6,3,"F","Nível 3","Nível 3","1.3.1.",null,null,"SERVIÇO DE TERRA - REFERENTE A INSTALAÇÃO ELÉTRICA","-",null,null,null,null,""]
["S",3,"S",0,1,3,1,0,0,0,0,"F","Serviço","Serviço","1.3.1.0.1.","SINAPI",93358,"ESCAVAÇÃO MANUAL DE VALA COM PROFUNDIDADE MENOR OU IGUAL A 1,30 M. AF_03/2016","M3",7.8,null,null,null,"Referência: AGETOP - 40101"]
["S",3,"S",0,1,3,1,0,0,0,0,"F","Serviço","Serviço","1.3.1.0.2.","SINAPI",96995,"REATERRO MANUAL APILOADO COM SOQUETE. AF_10/2017","M3",7.8,null,null,null,"Referência: AGETOP - 40902"]
[3,3,3,3,1,3,2,0,0,3,127,"F","Nível 3","Nível 3","1.3.2.",null,null,"OUTROS SERVIÇOS","-",null,null,null,null,""]
[{"$f":"CHOOSE(1+LOG(1+2*(ORÇAMENTO.Nivel=\"Nível 1\")+4*(ORÇAMENTO.Nivel=\"Nível 2\")+8*(ORÇAMENTO.Nivel=\"Nível 3\")+16*(ORÇAMENTO.Nivel=\"Nível 4\")+32*(ORÇAMENTO.Nivel=\"Serviço\"),2),0,1,2,3,4,\"S\")","v":"S"},3,"S",0,{"$f":"IF($C45=1,OFFSET(E45,-1,0)+1,OFFSET(E45,-1,0))","v":1},{"$f":"IF($C45=1,0,IF($C45=2,OFFSET(F45,-1,0)+1,OFFSET(F45,-1,0)))","v":3},{"$f":"IF(AND($C45<=2,$C45<>0),0,IF($C45=3,OFFSET(G45,-1,0)+1,OFFSET(G45,-1,0)))","v":2},{"$f":"IF(AND($C45<=3,$C45<>0),0,IF($C45=4,OFFSET(H45,-1,0)+1,OFFSET(H45,-1,0)))","v":0},{"$f":"IF(AND($C45<=4,$C45<>0),0,IF(AND($C45=\"S\",$W45>0),OFFSET(I45,-1,0)+1,OFFSET(I45,-1,0)))","v":0},0,0,"F","Serviço","Serviço","1.3.2.0.1.","SINAPI","74005/1","COMPACTACAO MECANICA, SEM CONTROLE DO GC (C/COMPACTADOR PLACA 400 KG)","M3",139.85,null,null,null,"Referência: AGETOP - 41009"]
["S",3,"S",0,1,3,2,0,0,0,0,"F","Serviço","Serviço","1.3.2.0.2.","AGETOP",41140,"REGULARIZAÇÃO DO TERRENO SEM APILOAMENTO COM TRANSPORTE MANUAL DA TERRA ESCAVADA ","m2    ",699.26,null,null,null,""]
[{"$f":"CHOOSE(1+LOG(1+2*(ORÇAMENTO.Nivel=\"Nível 1\")+4*(ORÇAMENTO.Nivel=\"Nível 2\")+8*(ORÇAMENTO.Nivel=\"Nível 3\")+16*(ORÇAMENTO.Nivel=\"Nível 4\")+32*(ORÇAMENTO.Nivel=\"Serviço\"),2),0,1,2,3,4,\"S\")","v":2},{"$f":"IF(OR(C47=\"s\",C47=0),OFFSET(B47,-1,0),C47)","v":2},{"$f":"IF(OFFSET(C47,-1,0)=\"L\",1,IF(OFFSET(C47,-1,0)=1,2,IF(OR(A47=\"s\",A47=0),\"S\",IF(AND(OFFSET(C47,-1,0)=2,A47=4),3,IF(AND(OR(OFFSET(C47,-1,0)=\"s\",OFFSET(C47,-1,0)=0),A47<>\"s\",A47>OFFSET(B47,-1,0)),OFFSET(B47,-1,0),A47)))))","v":2},{"$f":"IF(OR(C47=\"S\",C47=0),0,IF(ISERROR(K47),J47,SMALL(J47:K47,1)))","v":60},{"$f":"IF($C47=1,OFFSET(E47,-1,0)+1,OFFSET(E47,-1,0))","v":1},{"$f":"IF($C47=1,0,IF($C47=2,OFFSET(F47,-1,0)+1,OFFSET(F47,-1,0)))","v":4},{"$f":"IF(AND($C47<=2,$C47<>0),0,IF($C47=3,OFFSET(G47,-1,0)+1,OFFSET(G47,-1,0)))","v":0},{"$f":"IF(AND($C47<=3,$C47<>0),0,IF($C47=4,OFFSET(H47,-1,0)+1,OFFSET(H47,-1,0)))","v":0},{"$f":"IF(AND($C47<=4,$C47<>0),0,IF(AND($C47=\"S\",$W47>0),OFFSET(I47,-1,0)+1,OFFSET(I47,-1,0)))","v":0},161,60,"F","Nível 2","Nível 2","1.4.",null,null,"INSTALAÇÕES ELÉTRICAS","-",null,null,null,null,""]
["S",2,"S",0,1,4,0,0,0,0,0,"F","Serviço","Serviço","1.4.0.0.1.","AGETOP",70351,"BRACADEIRA METALICA TIPO \"U\" DIAM. 3/4\"","Un    ",350,null,null,null,""]
["S",2,"S",0,1,4,0,0,0,0,0,"F","Serviço","Serviço","1.4.0.0.2.","AGETOP",70352,"BRACADEIRA METALICA TIPO \"U\" DIAM. 1\"","Un    ",100,null,null,null,""]
["S",2,"S",0,1,4,0,0,0,0,0,"F","Serviço","Serviço","1.4.0.0.3.","AGETOP",70355,"BRACADEIRA METALICA TIPO \"U\" DIAM. 2\"","Un    ",18.5,null,null,null,""]
["S",2,"S",0,1,4,0,0,0,0,0,"F","Serviço","Serviço","1.4.0.0.4.","AGETOP",70421,"BUCHA E ARRUELA METALICA DIAM. 3/4\"","PR    ",50,null,null,null,""]
["S",2,"S",0,1,4,0,0,0,0,0,"F","Serviço","Serviço","1.4.0.0.5.","AGETOP",70422,"BUCHA E ARRUELA METALICA DIAM. 1\"","PR    ",10,null,null,null,""]
["S",2,"S",0,1,4,0,0,0,0,0,"F","Serviço","Serviço","1.4.0.0.6.","AGETOP",70425,"BUCHA E ARRUELA METALICA DIAM. 2\"","PR    ",6,null,null,null,""]
["S",2,"S",0,1,4,0,0,0,0,0,"F","Serviço","Serviço","1.4.0.0.7.","SINAPI",92982,"CABO DE COBRE FLEXÍVEL ISOLADO, 16 MM², ANTI-CHAMA 0,6/1,0 KV, PARA DISTRIBUIÇÃO - FORNECIMENTO E INSTALAÇÃO. AF_12/2015","M",30,null,null,null,"Referência: AGETOP - 70510"]
["S",2,"S",0,1,4,0,0,0,0,0,"F","Serviço","Serviço","1.4.0.0.8.","SINAPI",92984,"CABO DE COBRE FLEXÍVEL ISOLADO, 25 MM², ANTI-CHAMA 0,6/1,0 KV, PARA DISTRIBUIÇÃO - FORNECIMENTO E INSTALAÇÃO. AF_12/2015","M",120,null,null,null,"Referência: AGETOP - 70511"]
["S",2,"S",0,1,4,0,0,0,0,0,"F","Serviço","Serviço","1.4.0.0.9.","SINAPI",96971,"CORDOALHA DE COBRE NU 16 MM², NÃO ENTERRADA, COM ISOLADOR - FORNECIMENTO E INSTALAÇÃO. AF_12/2017","M",12,null,null,null,"Referência: AGETOP - 70541"]
["S",2,"S",0,1,4,0,0,0,0,0,"F","Serviço","Serviço","1.4.0.0.10.","SINAPI",91927,"CABO DE COBRE FLEXÍVEL ISOLADO, 2,5 MM², ANTI-CHAMA 0,6/1,0 KV, PARA CIRCUITOS TERMINAIS - FORNECIMENTO E INSTALAÇÃO. AF_12/2015","M",1799,null,null,null,"Referência: AGETOP - 70581"]
["S",2,"S",0,1,4,0,0,0,0,0,"F","Serviço","Serviço","1.4.0.0.11.","SINAPI",91929,"CABO DE COBRE FLEXÍVEL ISOLADO, 4 MM², ANTI-CHAMA 0,6/1,0 KV, PARA CIRCUITOS TERMINAIS - FORNECIMENTO E INSTALAÇÃO. AF_12/2015","M",294.2,null,null,null,"Referência: AGETOP - 70582"]
["S",2,"S",0,1,4,0,0,0,0,0,"F","Serviço","Serviço","1.4.0.0.12.","SINAPI",91931,"CABO DE COBRE FLEXÍVEL ISOLADO, 6 MM², ANTI-CHAMA 0,6/1,0 KV, PARA CIRCUITOS TERMINAIS - FORNECIMENTO E INSTALAÇÃO. AF_12/2015","M",672,null,null,null,"Referência: AGETOP - 70583"]
["S",2,"S",0,1,4,0,0,0,0,0,"F","Serviço","Serviço","1.4.0.0.13.","SINAPI",91933,"CABO DE COBRE FLEXÍVEL ISOLADO, 10 MM², ANTI-CHAMA 0,6/1,0 KV, PARA CIRCUITOS TERMINAIS - FORNECIMENTO E INSTALAÇÃO. AF_12/2015","M",150,null,null,null,"Referência: AGETOP - 70584"]
["S",2,"S",0,1,4,0,0,0,0,0,"F","Serviço","Serviço","1.4.0.0.14.","SINAPI",91935,"CABO DE COBRE FLEXÍVEL ISOLADO, 16 MM², ANTI-CHAMA 0,6/1,0 KV, PARA CIRCUITOS TERMINAIS - FORNECIMENTO E INSTALAÇÃO. AF_12/2015","M",30,null,null,null,"Referência: AGETOP - 70585"]
[{"$f":"CHOOSE(1+LOG(1+2*(ORÇAMENTO.Nivel=\"Nível 1\")+4*(ORÇAMENTO.Nivel=\"Nível 2\")+8*(ORÇAMENTO.Nivel=\"Nível 3\")+16*(ORÇAMENTO.Nivel=\"Nível 4\")+32*(ORÇAMENTO.Nivel=\"Serviço\"),2),0,1,2,3,4,\"S\")","v":"S"},2,"S",0,1,4,0,0,{"$f":"IF(AND($C62<=4,$C62<>0),0,IF(AND($C62=\"S\",$W62>0),OFFSET(I62,-1,0)+1,OFFSET(I62,-1,0)))","v":0},0,0,"F","Serviço","Serviço","1.4.0.0.15.","SINAPI",92866,"CAIXA SEXTAVADA 3\" X 3\", METÁLICA, INSTALADA EM LAJE - FORNECIMENTO E INSTALAÇÃO. AF_12/2015","UN",67,null,null,null,"Referência: AGETOP - 70680"]
["S",2,"S",0,1,4,0,0,0,0,0,"F","Serviço","Serviço","1.4.0.0.16.","SINAPI",92868,"CAIXA RETANGULAR 4\" X 2\" MÉDIA (1,30 M DO PISO), METÁLICA, INSTALADA EM PAREDE - FORNECIMENTO E INSTALAÇÃO. AF_12/2015","UN",73,null,null,null,"Referência: AGETOP - 70691"]
["S",2,"S",0,1,4,0,0,0,0,0,"F","Serviço","Serviço","1.4.0.0.17.","SINAPI",92871,"CAIXA RETANGULAR 4\" X 4\" MÉDIA (1,30 M DO PISO), METÁLICA, INSTALADA EM PAREDE - FORNECIMENTO E INSTALAÇÃO. AF_12/2015","UN",5,null,null,null,"Referência: AGETOP - 70692"]
["S",2,"S",0,{"$f":"IF($C65=1,OFFSET(E65,-1,0)+1,OFFSET(E65,-1,0))","v":1},{"$f":"IF($C65=1,0,IF($C65=2,OFFSET(F65,-1,0)+1,OFFSET(F65,-1,0)))","v":4},{"$f":"IF(AND($C65<=2,$C65<>0),0,IF($C65=3,OFFSET(G65,-1,0)+1,OFFSET(G65,-1,0)))","v":0},{"$f":"IF(AND($C65<=3,$C65<>0),0,IF($C65=4,OFFSET(H65,-1,0)+1,OFFSET(H65,-1,0)))","v":0},0,0,0,"F","Serviço","Serviço","1.4.0.0.18.","SINAPI",97893,"CAIXA ENTERRADA ELÉTRICA RETANGULAR, EM ALVENARIA COM BLOCOS DE CONCRETO, FUNDO COM BRITA, DIMENSÕES INTERNAS: 0,8X0,8X0,6 M. AF_05/2018","UN",4,null,null,null,""]
["S",2,"S",0,1,4,0,0,0,0,0,"F","Serviço","Serviço","1.4.0.0.19.","SINAPI",95817,"CONDULETE DE PVC, TIPO X, PARA ELETRODUTO DE PVC SOLDÁVEL DN 25 MM (3/4''), APARENTE - FORNECIMENTO E INSTALAÇÃO. AF_11/2016","UN",70,null,null,null,""]
["S",2,"S",0,1,4,0,0,0,0,0,"F","Serviço","Serviço","1.4.0.0.20.","SINAPI",95818,"CONDULETE DE PVC, TIPO X, PARA ELETRODUTO DE PVC SOLDÁVEL DN 32 MM (1''), APARENTE - FORNECIMENTO E INSTALAÇÃO. AF_11/2016","UN",15,null,null,null,""]
["S",2,"S",0,1,4,0,0,0,0,0,"F","Serviço","Serviço","1.4.0.0.21.","SINAPI",91902,"CURVA 90 GRAUS PARA ELETRODUTO, PVC, ROSCÁVEL, DN 25 MM (3/4\"), PARA CIRCUITOS TERMINAIS, INSTALADA EM LAJE - FORNECIMENTO E INSTALAÇÃO. AF_12/2015","UN",50,null,null,null,"Referência: AGETOP - 71141"]
["S",2,"S",0,1,4,0,0,0,0,0,"F","Serviço","Serviço","1.4.0.0.22.","SINAPI",91905,"CURVA 90 GRAUS PARA ELETRODUTO, PVC, ROSCÁVEL, DN 32 MM (1\"), PARA CIRCUITOS TERMINAIS, INSTALADA EM LAJE - FORNECIMENTO E INSTALAÇÃO. AF_12/2015","UN",30,null,null,null,"Referência: AGETOP - 71142"]
["S",{"$f":"IF(OR(C70=\"s\",C70=0),OFFSET(B70,-1,0),C70)","v":2},{"$f":"IF(OFFSET(C70,-1,0)=\"L\",1,IF(OFFSET(C70,-1,0)=1,2,IF(OR(A70=\"s\",A70=0),\"S\",IF(AND(OFFSET(C70,-1,0)=2,A70=4),3,IF(AND(OR(OFFSET(C70,-1,0)=\"s\",OFFSET(C70,-1,0)=0),A70<>\"s\",A70>OFFSET(B70,-1,0)),OFFSET(B70,-1,0),A70)))))","v":"S"},{"$f":"IF(OR(C70=\"S\",C70=0),0,IF(ISERROR(K70),J70,SMALL(J70:K70,1)))","v":0},1,4,0,0,0,0,0,"F","Serviço","Serviço","1.4.0.0.23.","SINAPI",93020,"CURVA 90 GRAUS PARA ELETRODUTO, PVC, ROSCÁVEL, DN 60 MM (2\") - FORNECIMENTO E INSTALAÇÃO. AF_12/2015","UN",7,null,null,null,""]
["S",2,"S",0,1,4,0,0,0,0,0,"F","Serviço","Serviço","1.4.0.0.24.","SINAPI",93653,"DISJUNTOR MONOPOLAR TIPO DIN, CORRENTE NOMINAL DE 10A - FORNECIMENTO E INSTALAÇÃO. AF_04/2016","UN",8,null,null,null,""]
["S",2,"S",0,1,4,0,0,0,0,0,"F","Serviço","Serviço","1.4.0.0.25.","SINAPI",93654,"DISJUNTOR MONOPOLAR TIPO DIN, CORRENTE NOMINAL DE 16A - FORNECIMENTO E INSTALAÇÃO. AF_04/2016","UN",5,null,null,null,""]
["S",2,"S",0,1,4,0,0,0,0,0,"F","Serviço","Serviço","1.4.0.0.26.","SINAPI",93656,"DISJUNTOR MONOPOLAR TIPO DIN, CORRENTE NOMINAL DE 25A - FORNECIMENTO E INSTALAÇÃO. AF_04/2016","UN",10,null,null,null,""]
["S",2,"S",0,1,4,0,0,0,0,0,"F","Serviço","Serviço","1.4.0.0.27.","SINAPI",93658,"DISJUNTOR MONOPOLAR TIPO DIN, CORRENTE NOMINAL DE 40A - FORNECIMENTO E INSTALAÇÃO. AF_04/2016","UN",2,null,null,null,""]
["S",2,"S",0,1,4,0,0,0,0,0,"F","Serviço","Serviço","1.4.0.0.28.","SINAPI",93671,"DISJUNTOR TRIPOLAR TIPO DIN, CORRENTE NOMINAL DE 32A - FORNECIMENTO E INSTALAÇÃO. AF_04/2016","UN",5,null,null,null,"Referência: AGETOP - 71173"]
["S",2,"S",0,1,4,0,0,0,0,0,"F","Serviço","Serviço","1.4.0.0.29.","SINAPI",93673,"DISJUNTOR TRIPOLAR TIPO DIN, CORRENTE NOMINAL DE 50A - FORNECIMENTO E INSTALAÇÃO. AF_04/2016","UN",2,null,null,null,"Referência: AGETOP - 71174"]
["S",2,"S",0,1,4,0,0,0,0,0,"F","Serviço","Serviço","1.4.0.0.30.","SINAPI","74130/5","DISJUNTOR TERMOMAGNETICO TRIPOLAR PADRAO NEMA (AMERICANO) 60 A 100A 240V, FORNECIMENTO E INSTALACAO","UN",2,null,null,null,""]
["S",2,"S",0,1,4,0,0,0,0,0,"F","Serviço","Serviço","1.4.0.0.31.","AGETOP",71184,"DISPOSITIVO DE PROTEÇÃO CONTRA SURTOS (D.P.S.) 275V DE 8 A 40KA","Un    ",4,null,null,null,""]
["S",2,"S",0,1,4,0,0,0,0,0,"F","Serviço","Serviço","1.4.0.0.32.","SINAPI",91846,"ELETRODUTO FLEXÍVEL CORRUGADO, PVC, DN 32 MM (1\"), PARA CIRCUITOS TERMINAIS, INSTALADO EM LAJE - FORNECIMENTO E INSTALAÇÃO. AF_12/2015","M",35,null,null,null,""]
["S",2,"S",0,1,4,0,0,0,0,0,"F","Serviço","Serviço","1.4.0.0.33.","SINAPI",91871,"ELETRODUTO RÍGIDO ROSCÁVEL, PVC, DN 25 MM (3/4\"), PARA CIRCUITOS TERMINAIS, INSTALADO EM PAREDE - FORNECIMENTO E INSTALAÇÃO. AF_12/2015","M",700,null,null,null,"Referência: AGETOP - 71201"]
["S",2,"S",0,1,4,0,0,0,0,0,"F","Serviço","Serviço","1.4.0.0.34.","SINAPI",91872,"ELETRODUTO RÍGIDO ROSCÁVEL, PVC, DN 32 MM (1\"), PARA CIRCUITOS TERMINAIS, INSTALADO EM PAREDE - FORNECIMENTO E INSTALAÇÃO. AF_12/2015","M",200,null,null,null,"Referência: AGETOP - 71202"]
["S",2,"S",0,1,4,0,0,0,0,0,"F","Serviço","Serviço","1.4.0.0.35.","SINAPI",93009,"ELETRODUTO RÍGIDO ROSCÁVEL, PVC, DN 60 MM (2\") - FORNECIMENTO E INSTALAÇÃO. AF_12/2015","M",30,null,null,null,""]
["S",2,"S",0,1,4,0,0,0,{"$f":"IF(OR($C83=\"S\",$C83=0),0,MATCH(0,OFFSET($D83,1,$C83,ROW($C$303)-ROW($C83)),0))","v":0},{"$f":"IF(OR($C83=\"S\",$C83=0),0,MATCH(OFFSET($D83,0,$C83)+1,OFFSET($D83,1,$C83,ROW($C$303)-ROW($C83)),0))","v":0},"F","Serviço","Serviço","1.4.0.0.36.","AGETOP",71215,"ELETRODUTO EM AÇO GALVANIZADO A FOGO DIÂMETRO 2\" - PESADO ","M     ",7,null,null,null,""]
["S",2,"S",0,1,4,0,0,0,0,0,"F","Serviço","Serviço","1.4.0.0.37.","AGETOP",71321,"FITA DE AUTO FUSAO, ROLO E 10,00 MM","Un    ",1,null,null,null,""]
["S",2,"S",0,1,4,0,0,0,0,0,"F","Serviço","Serviço","1.4.0.0.38.","AGETOP",71331,"FITA ISOLANTE, ROLO DE 20,00 M","Un    ",3,null,null,null,""]
["S",2,"S",0,1,4,0,0,0,0,0,"F","Serviço","Serviço","1.4.0.0.39.","AGETOP",71381,"HASTE REV.COBRE(COPPERWELD)  5/8\" X 3,00 M C/CONECTOR","Un    ",3,null,null,null,""]
["S",2,"S",0,1,4,0,0,0,0,0,"F","Serviço","Serviço","1.4.0.0.40.","SINAPI",91953,"INTERRUPTOR SIMPLES (1 MÓDULO), 10A/250V, INCLUINDO SUPORTE E PLACA - FORNECIMENTO E INSTALAÇÃO. AF_12/2015","UN",23,null,null,null,"Referência: AGETOP - 71440"]
["S",2,"S",0,1,4,0,0,0,0,0,"F","Serviço","Serviço","1.4.0.0.41.","COMPOSIÇÃO","COMP 387_SEE","LÂMPADA LED TUBULAR 18W ","UN ",150,null,null,null,""]
["S",2,"S",0,1,4,0,0,0,0,0,"F","Serviço","Serviço","1.4.0.0.42.","SINAPI",93043,"LÂMPADA LED 10 W BIVOLT BRANCA, FORMATO TRADICIONAL (BASE E27) - FORNECIMENTO E INSTALAÇÃO","UN",3,null,null,null,""]
["S",2,"S",0,1,4,0,0,0,0,0,"F","Serviço","Serviço","1.4.0.0.43.","SINAPI",97585,"LUMINÁRIA TIPO CALHA, DE SOBREPOR, COM 2 LÂMPADAS TUBULARES DE 18 W - FORNECIMENTO E INSTALAÇÃO. AF_11/2017","UN",75,null,null,null,""]
["S",2,"S",0,1,4,0,0,0,0,0,"F","Serviço","Serviço","1.4.0.0.44.","SINAPI",97593,"LUMINÁRIA TIPO SPOT, DE SOBREPOR, COM 1 LÂMPADA DE 15 W - FORNECIMENTO E INSTALAÇÃO. AF_11/2017","UN",3,null,null,null,"Referência: AGETOP - 71688"]
["S",2,"S",0,1,4,0,0,0,0,0,"F","Serviço","Serviço","1.4.0.0.45.","SINAPI",95757,"LUVA DE EMENDA PARA ELETRODUTO, AÇO GALVANIZADO, DN 20 MM (3/4''), APARENTE, INSTALADA EM PAREDE - FORNECIMENTO E INSTALAÇÃO. AF_11/2016_P","UN",350,null,null,null,"Referência: AGETOP - 71701"]
["S",2,"S",0,1,4,0,0,0,0,0,"F","Serviço","Serviço","1.4.0.0.46.","SINAPI",95758,"LUVA DE EMENDA PARA ELETRODUTO, AÇO GALVANIZADO, DN 25 MM (1''), APARENTE, INSTALADA EM PAREDE - FORNECIMENTO E INSTALAÇÃO. AF_11/2016_P","UN",100,null,null,null,"Referência: AGETOP - 71702"]
["S",2,"S",0,1,4,0,0,0,0,0,"F","Serviço","Serviço","1.4.0.0.47.","SINAPI",91884,"LUVA PARA ELETRODUTO, PVC, ROSCÁVEL, DN 25 MM (3/4\"), PARA CIRCUITOS TERMINAIS, INSTALADA EM PAREDE - FORNECIMENTO E INSTALAÇÃO. AF_12/2015","UN",200,null,null,null,"Referência: AGETOP - 71741"]
["S",2,"S",0,1,4,0,0,0,0,0,"F","Serviço","Serviço","1.4.0.0.48.","AGETOP",71705,"LUVA EM AÇO GALVANIZADO DIÂMETRO 2\"","Un    ",3,null,null,null,""]
["S",2,"S",0,1,4,0,0,0,0,0,"F","Serviço","Serviço","1.4.0.0.49.","SINAPI",91885,"LUVA PARA ELETRODUTO, PVC, ROSCÁVEL, DN 32 MM (1\"), PARA CIRCUITOS TERMINAIS, INSTALADA EM PAREDE - FORNECIMENTO E INSTALAÇÃO. AF_12/2015","UN",100,null,null,null,"Referência: AGETOP - 71742"]
["S",2,"S",0,1,4,0,0,0,0,0,"F","Serviço","Serviço","1.4.0.0.50.","SINAPI",93014,"LUVA PARA ELETRODUTO, PVC, ROSCÁVEL, DN 60 MM (2\") - FORNECIMENTO E INSTALAÇÃO. AF_12/2015","UN",40,null,null,null,"Referência: AGETOP - 71745"]
["S",2,"S",0,1,4,0,0,0,0,0,"F","Serviço","Serviço","1.4.0.0.51.","AGETOP",71826,"PADRÃO TRIFASICO 25 MM H=7 METROS","Un    ",1,null,null,null,""]
["S",2,"S",0,1,4,0,0,0,0,0,"F","Serviço","Serviço","1.4.0.0.52.","SINAPI",84402,"QUADRO DE DISTRIBUICAO DE ENERGIA P/ 6 DISJUNTORES TERMOMAGNETICOS MONOPOLARES SEM BARRAMENTO, DE EMBUTIR, EM CHAPA METALICA - FORNECIMENTO E INSTALACAO","UN",1,null,null,null,""]
["S",2,"S",0,1,4,0,0,0,0,0,"F","Serviço","Serviço","1.4.0.0.53.","AGETOP",72170,"QUADRO DE DISTRIBUIÇÃO DE EMBUTIR EM PVC CB 12E - 80A","Un    ",1,null,null,null,""]
["S",2,"S",0,1,4,0,0,0,0,0,"F","Serviço","Serviço","1.4.0.0.54.","SINAPI","74131/5","QUADRO DE DISTRIBUICAO DE ENERGIA DE EMBUTIR, EM CHAPA METALICA, PARA 24 DISJUNTORES TERMOMAGNETICOS MONOPOLARES, COM BARRAMENTO TRIFASICO E NEUTRO, FORNECIMENTO E INSTALACAO","UN",2,null,null,null,""]
["S",2,"S",0,1,4,0,0,0,0,0,"F","Serviço","Serviço","1.4.0.0.55.","AGETOP",72385,"TAMPA CEGA PARA CONDULETE DE PVC","Un    ",85,null,null,null,""]
["S",2,"S",0,1,4,0,0,0,0,0,"F","Serviço","Serviço","1.4.0.0.56.","AGETOP",72400,"TAMPA CEGA PLASTICA QUADRADA 4\"X4\"","Un    ",5,null,null,null,""]
["S",2,"S",0,1,4,0,0,0,0,0,"F","Serviço","Serviço","1.4.0.0.57.","SINAPI",92000,"TOMADA BAIXA DE EMBUTIR (1 MÓDULO), 2P+T 10 A, INCLUINDO SUPORTE E PLACA - FORNECIMENTO E INSTALAÇÃO. AF_12/2015","UN",38,null,null,null,"Referência: AGETOP - 72578"]
["S",2,"S",0,1,4,0,0,0,0,0,"F","Serviço","Serviço","1.4.0.0.58.","SINAPI",91993,"TOMADA ALTA DE EMBUTIR (1 MÓDULO), 2P+T 20 A, INCLUINDO SUPORTE E PLACA - FORNECIMENTO E INSTALAÇÃO. AF_12/2015","UN",10,null,null,null,"Referência: AGETOP - 72585"]
["S",2,"S",0,1,4,0,0,0,0,0,"F","Serviço","Serviço","1.4.0.0.59.","SINAPI",98111,"CAIXA DE INSPEÇÃO PARA ATERRAMENTO, CIRCULAR, EM POLIETILENO, DIÂMETRO INTERNO = 0,3 M. AF_05/2018","UN",1,null,null,null,""]
[{"$f":"CHOOSE(1+LOG(1+2*(ORÇAMENTO.Nivel=\"Nível 1\")+4*(ORÇAMENTO.Nivel=\"Nível 2\")+8*(ORÇAMENTO.Nivel=\"Nível 3\")+16*(ORÇAMENTO.Nivel=\"Nível 4\")+32*(ORÇAMENTO.Nivel=\"Serviço\"),2),0,1,2,3,4,\"S\")","v":2},{"$f":"IF(OR(C107=\"s\",C107=0),OFFSET(B107,-1,0),C107)","v":2},{"$f":"IF(OFFSET(C107,-1,0)=\"L\",1,IF(OFFSET(C107,-1,0)=1,2,IF(OR(A107=\"s\",A107=0),\"S\",IF(AND(OFFSET(C107,-1,0)=2,A107=4),3,IF(AND(OR(OFFSET(C107,-1,0)=\"s\",OFFSET(C107,-1,0)=0),A107<>\"s\",A107>OFFSET(B107,-1,0)),OFFSET(B107,-1,0),A107)))))","v":2},{"$f":"IF(OR(C107=\"S\",C107=0),0,IF(ISERROR(K107),J107,SMALL(J107:K107,1)))","v":19},{"$f":"IF($C107=1,OFFSET(E107,-1,0)+1,OFFSET(E107,-1,0))","v":1},{"$f":"IF($C107=1,0,IF($C107=2,OFFSET(F107,-1,0)+1,OFFSET(F107,-1,0)))","v":5},{"$f":"IF(AND($C107<=2,$C107<>0),0,IF($C107=3,OFFSET(G107,-1,0)+1,OFFSET(G107,-1,0)))","v":0},{"$f":"IF(AND($C107<=3,$C107<>0),0,IF($C107=4,OFFSET(H107,-1,0)+1,OFFSET(H107,-1,0)))","v":0},{"$f":"IF(AND($C107<=4,$C107<>0),0,IF(AND($C107=\"S\",$W107>0),OFFSET(I107,-1,0)+1,OFFSET(I107,-1,0)))","v":0},101,19,"F","Nível 2","Nível 2","1.5.","AGETOP",null,"INSTALAÇÕES HIDROSSANITÁRIAS","-",null,null,null,null,""]
[3,3,3,11,1,5,1,0,0,18,11,"F","Nível 3","Nível 3","1.5.1.","SINAPI",null,"PEÇAS E ACESSÓRIOS","-",null,null,null,null,""]
[4,4,4,5,1,5,1,1,0,10,5,"F","Nível 4","Nível 4","1.5.1.1.","SINAPI",null,"VASO SANITÁRIO / ACESSÓRIOS","-",null,null,null,null,""]
["S",4,"S",0,1,5,1,1,0,0,0,"F","Serviço","Serviço","1.5.1.1.1.","SINAPI",95470,"VASO SANITARIO SIFONADO CONVENCIONAL COM LOUÇA BRANCA, INCLUSO CONJUNTO DE LIGAÇÃO PARA BACIA SANITÁRIA AJUSTÁVEL - FORNECIMENTO E INSTALAÇÃO. AF_10/2016","UN",1,null,null,null,""]
["S",4,"S",0,1,5,1,1,0,0,0,"F","Serviço","Serviço","1.5.1.1.2.","AGETOP",80511,"CAIXA DE DESCARGA EXTERNA","Un    ",1,null,null,null,""]
["S",4,"S",0,1,5,1,1,0,0,0,"F","Serviço","Serviço","1.5.1.1.3.","AGETOP",80520,"CONJUNTO DE FIXACAO P/VASO SANITARIO (PAR)","CJ    ",1,null,null,null,""]
["S",4,"S",0,1,5,1,1,0,0,0,"F","Serviço","Serviço","1.5.1.1.4.","AGETOP",80526,"ASSENTO EM POLIPROPILENO COM SISTEMA DE FECHAMENTO SUAVE PARA VASO SANITÁRIO","Un    ",1,null,null,null,""]
[4,4,4,5,1,5,1,2,0,5,{"$error":"#N/A"},"F","Nível 4","Nível 4","1.5.1.2.","SINAPI",null,"LAVATÓRIO / ACESSÓRIOS","-",null,null,null,null,""]
["S",4,"S",0,1,5,1,2,0,0,0,"F","Serviço","Serviço","1.5.1.2.1.","AGETOP",80556,"LIGAÇÃO FLEXÍVEL PVC DIAM.1/2\" (ENGATE)","Un    ",1,null,null,null,""]
["S",4,"S",0,1,5,1,2,0,0,0,"F","Serviço","Serviço","1.5.1.2.2.","SINAPI",86883,"SIFÃO DO TIPO FLEXÍVEL EM PVC 1\u0094 X 1.1/2\u0094 - FORNECIMENTO E INSTALAÇÃO. AF_12/2013","UN",1,null,null,null,""]
["S",4,"S",0,1,5,1,2,0,0,0,"F","Serviço","Serviço","1.5.1.2.3.","SINAPI",86915,"TORNEIRA CROMADA DE MESA, 1/2\" OU 3/4\", PARA LAVATÓRIO, PADRÃO MÉDIO - FORNECIMENTO E INSTALAÇÃO. AF_12/2013","UN",1,null,null,null,"Referência: AGETOP - 80570"]
["S",4,"S",0,1,5,1,2,0,0,0,"F","Serviço","Serviço","1.5.1.2.4.","SINAPI",86901,"CUBA DE EMBUTIR OVAL EM LOUÇA BRANCA, 35 X 50CM OU EQUIVALENTE - FORNECIMENTO E INSTALAÇÃO. AF_12/2013","UN",1,null,null,null,"Referência: AGETOP - 80587"]
[{"$f":"CHOOSE(1+LOG(1+2*(ORÇAMENTO.Nivel=\"Nível 1\")+4*(ORÇAMENTO.Nivel=\"Nível 2\")+8*(ORÇAMENTO.Nivel=\"Nível 3\")+16*(ORÇAMENTO.Nivel=\"Nível 4\")+32*(ORÇAMENTO.Nivel=\"Serviço\"),2),0,1,2,3,4,\"S\")","v":3},{"$f":"IF(OR(C119=\"s\",C119=0),OFFSET(B119,-1,0),C119)","v":3},{"$f":"IF(OFFSET(C119,-1,0)=\"L\",1,IF(OFFSET(C119,-1,0)=1,2,IF(OR(A119=\"s\",A119=0),\"S\",IF(AND(OFFSET(C119,-1,0)=2,A119=4),3,IF(AND(OR(OFFSET(C119,-1,0)=\"s\",OFFSET(C119,-1,0)=0),A119<>\"s\",A119>OFFSET(B119,-1,0)),OFFSET(B119,-1,0),A119)))))","v":3},{"$f":"IF(OR(C119=\"S\",C119=0),0,IF(ISERROR(K119),J119,SMALL(J119:K119,1)))","v":7},{"$f":"IF($C119=1,OFFSET(E119,-1,0)+1,OFFSET(E119,-1,0))","v":1},{"$f":"IF($C119=1,0,IF($C119=2,OFFSET(F119,-1,0)+1,OFFSET(F119,-1,0)))","v":5},{"$f":"IF(AND($C119<=2,$C119<>0),0,IF($C119=3,OFFSET(G119,-1,0)+1,OFFSET(G119,-1,0)))","v":2},{"$f":"IF(AND($C119<=3,$C119<>0),0,IF($C119=4,OFFSET(H119,-1,0)+1,OFFSET(H119,-1,0)))","v":0},{"$f":"IF(AND($C119<=4,$C119<>0),0,IF(AND($C119=\"S\",$W119>0),OFFSET(I119,-1,0)+1,OFFSET(I119,-1,0)))","v":0},7,52,"F","Nível 3","Nível 3","1.5.2.","SINAPI",null,"INCÊNDIO ","-",null,null,null,null,""]
["S",3,"S",0,1,5,2,0,0,0,0,"F","Serviço","Serviço","1.5.2.0.1.","AGETOP",85003,"EXTINTOR PO QUIMICO SECO (6 KG) - CAPACIDADE EXTINTORA 20 BC","Un    ",1,null,null,null,""]
["S",3,"S",0,1,5,2,0,0,0,0,"F","Serviço","Serviço","1.5.2.0.2.","AGETOP",85006,"EXTINTOR MULTI USO EM PO A B C (6 KG) - CAPACIDADE EXTINTORA 3A 20BC","un    ",5,null,null,null,""]
["S",3,"S",0,1,5,2,0,0,0,0,"F","Serviço","Serviço","1.5.2.0.3.","COMPOSIÇÃO","COMP 024_SEE","SINALIZADOR FOTOLUMINESCENTE PARA EXTINTOR","UN ",6,null,null,null,""]
["S",3,"S",0,1,5,2,0,0,0,0,"F","Serviço","Serviço","1.5.2.0.4.","SINAPI",97599,"LUMINÁRIA DE EMERGÊNCIA - FORNECIMENTO E INSTALAÇÃO. AF_11/2017","UN",10,null,null,null,""]
["S",3,"S",0,1,5,2,0,0,0,0,"F","Serviço","Serviço","1.5.2.0.5.","COMPOSIÇÃO","COMP 025_SEE","SINALIZADOR FOTOLUMINESCENTE DE EMERGÊNCIA","UN ",25,null,null,null,""]
["S",3,"S",0,1,5,2,0,0,0,0,"F","Serviço","Serviço","1.5.2.0.6.","COMPOSIÇÃO","COMP 277_SEE","MARCAÇÃO NO PISO - 1X1 M PARA EXTINTOR","M2",6,null,null,null,""]
[2,2,2,26,1,6,0,0,0,82,26,"F","Nível 2","Nível 2","1.6.",null,null,"INSTALAÇÕES ESPECIAIS","-",null,null,null,null,""]
["S",2,"S",0,1,6,0,0,0,0,0,"F","Serviço","Serviço","1.6.0.0.1.","AGETOP",91007,"CENTRAL DE GÁS PADRÃO AGETOP SEM INSTALAÇÕES (1+1 CILINDRO 45 KG)","Un    ",1,null,null,null,""]
["S",2,"S",0,1,6,0,0,0,0,0,"F","Serviço","Serviço","1.6.0.0.2.","AGETOP",91023,"UNIÃO S/BRONZE PRETA 3/4\" NPT 300 LBS","Un    ",3,null,null,null,""]
["S",2,"S",0,1,6,0,0,0,0,0,"F","Serviço","Serviço","1.6.0.0.3.","COMPOSIÇÃO","COMP 382_SEE","TE DE REDUCAO DE FERRO GALVANIZADO, COM ROSCA BSP, DE 3/4\" X 1/2\"","UN ",1,null,null,null,""]
["S",2,"S",0,1,6,0,0,0,0,0,"F","Serviço","Serviço","1.6.0.0.4.","COMPOSIÇÃO","COMP 383_SEE","BUCHA DE REDUCAO DE FERRO GALVANIZADO, COM ROSCA BSP, DE 1/2\" X 1/4\"","UN ",3,null,null,null,""]
["S",2,"S",0,1,6,0,0,0,0,0,"F","Serviço","Serviço","1.6.0.0.5.","AGETOP",91021,"LUVA GALVANIZADO DE REDUÇÃO 3/4\" X 1/2\" (GÁS)","Un    ",2,null,null,null,""]
["S",2,"S",0,1,6,0,0,0,0,0,"F","Serviço","Serviço","1.6.0.0.6.","SINAPI",92692,"NIPLE, EM FERRO GALVANIZADO, CONEXÃO ROSQUEADA, DN 15 (1/2\"), INSTALADO EM RAMAIS E SUB-RAMAIS DE GÁS - FORNECIMENTO E INSTALAÇÃO. AF_12/2015","UN",6,null,null,null,""]
["S",2,"S",0,1,6,0,0,0,0,0,"F","Serviço","Serviço","1.6.0.0.7.","AGETOP",91031,"NIPLE DUPLO 300 PSI 3/4\"","Un    ",6,null,null,null,""]
["S",2,"S",0,1,6,0,0,0,0,0,"F","Serviço","Serviço","1.6.0.0.8.","COMPOSIÇÃO","COMP 212_SEE","NIPLE DE REDUÇÃO 1/2\" X 1/4\" BSP","UN ",4,null,null,null,""]
["S",2,"S",0,1,6,0,0,0,0,0,"F","Serviço","Serviço","1.6.0.0.9.","COMPOSIÇÃO","COMP 213_SEE","NIPLE DE REDUÇÃO 3/4\" X 1/2\" BSP","UN ",4,null,null,null,""]
["S",2,"S",0,1,6,0,0,0,0,0,"F","Serviço","Serviço","1.6.0.0.10.","SINAPI",92688,"TUBO DE AÇO GALVANIZADO COM COSTURA, CLASSE MÉDIA, CONEXÃO ROSQUEADA, DN 20 (3/4\"), INSTALADO EM RAMAIS E SUB-RAMAIS DE GÁS - FORNECIMENTO E INSTALAÇÃO. AF_12/2015","M",12,null,null,null,""]
["S",2,"S",0,1,6,0,0,0,0,0,"F","Serviço","Serviço","1.6.0.0.11.","SINAPI",92701,"JOELHO 90 GRAUS, EM FERRO GALVANIZADO, CONEXÃO ROSQUEADA, DN 20 (3/4\"), INSTALADO EM RAMAIS E SUB-RAMAIS DE GÁS - FORNECIMENTO E INSTALAÇÃO. AF_12/2015","UN",7,null,null,null,""]
["S",2,"S",0,1,6,0,0,0,0,0,"F","Serviço","Serviço","1.6.0.0.12.","COMPOSIÇÃO","COMP 237_SEE","FITA ANTICORROSIVA","M",5,null,null,null,""]
["S",2,"S",0,1,6,0,0,0,0,0,"F","Serviço","Serviço","1.6.0.0.13.","AGETOP",91025,"VÁLVULA ESFERICA LATÃO 3/4\"","Un    ",3,null,null,null,""]
["S",2,"S",0,1,6,0,0,0,0,0,"F","Serviço","Serviço","1.6.0.0.14.","COMPOSIÇÃO","COMP 542_SEE","VÁLVULA UGV 3/4\" (S) LATÃO","UN ",1,null,null,null,""]
["S",2,"S",0,1,6,0,0,0,0,0,"F","Serviço","Serviço","1.6.0.0.15.","COMPOSIÇÃO","COMP 543_SEE","VÁLVULA UGV 1/2\" (S) LATÃO","UN ",1,null,null,null,""]
["S",2,"S",0,1,6,0,0,0,0,0,"F","Serviço","Serviço","1.6.0.0.16.","AGETOP",91029,"VALVULA DE RETENÇÃO LATÃO 1/2\" X 7/16\" NPT","Un    ",1,null,null,null,""]
["S",2,"S",0,1,6,0,0,0,0,0,"F","Serviço","Serviço","1.6.0.0.17.","COMPOSIÇÃO","COMP 211_SEE","REGULADOR DE 2º ESTÁGIO 5KG/H","UN ",1,null,null,null,""]
["S",2,"S",0,1,6,0,0,0,0,0,"F","Serviço","Serviço","1.6.0.0.18.","COMPOSIÇÃO","COMP 210_SEE","REGULADOR DE 1º ESTÁGIO 60KG/H MODELO AP-40  COM MANÔMETRO","UN ",1,null,null,null,""]
["S",2,"S",0,1,6,0,0,0,0,0,"F","Serviço","Serviço","1.6.0.0.19.","AGETOP",85003,"EXTINTOR PO QUIMICO SECO (6 KG) - CAPACIDADE EXTINTORA 20 BC","Un    ",1,null,null,null,""]
["S",2,"S",0,1,6,0,0,0,0,0,"F","Serviço","Serviço","1.6.0.0.20.","COMPOSIÇÃO","COMP 235_SEE","PLACA DE SINALIZAÇÃO EM PVC COD 01 - (300X300) PROIBIDO FUMAR","UN ",2,null,null,null,""]
["S",2,"S",0,1,6,0,0,0,{"$f":"IF(OR($C147=\"S\",$C147=0),0,MATCH(0,OFFSET($D147,1,$C147,ROW($C$303)-ROW($C147)),0))","v":0},{"$f":"IF(OR($C147=\"S\",$C147=0),0,MATCH(OFFSET($D147,0,$C147)+1,OFFSET($D147,1,$C147,ROW($C$303)-ROW($C147)),0))","v":0},"F","Serviço","Serviço","1.6.0.0.21.","COMPOSIÇÃO","COMP 236_SEE","PLACA DE SINALIZAÇÃO EM PVC COD 06 - (300X300) PERIGO INFLAMÁVEL","UN ",2,null,null,null,""]
["S",2,"S",0,1,6,0,0,0,0,0,"F","Serviço","Serviço","1.6.0.0.22.","AGETOP",91043,"BRAÇADEIRA METALICA TIPO \"D\" DIAM. 3/4\"","Un    ",5,null,null,null,""]
["S",2,"S",0,1,6,0,0,0,0,0,"F","Serviço","Serviço","1.6.0.0.23.","AGETOP",71863,"PARAFUSO P/BUCHA S-10","Un    ",10,null,null,null,""]
["S",2,"S",0,1,6,0,0,0,0,0,"F","Serviço","Serviço","1.6.0.0.24.","AGETOP",70393,"BUCHA DE NYLON S-10","Un    ",10,null,null,null,""]
["S",2,"S",0,1,6,0,0,0,0,0,"F","Serviço","Serviço","1.6.0.0.25.","AGETOP",91045,"SUPORTE PARA COLETOR","Un    ",2,null,null,null,""]
[{"$f":"CHOOSE(1+LOG(1+2*(ORÇAMENTO.Nivel=\"Nível 1\")+4*(ORÇAMENTO.Nivel=\"Nível 2\")+8*(ORÇAMENTO.Nivel=\"Nível 3\")+16*(ORÇAMENTO.Nivel=\"Nível 4\")+32*(ORÇAMENTO.Nivel=\"Serviço\"),2),0,1,2,3,4,\"S\")","v":2},{"$f":"IF(OR(C152=\"s\",C152=0),OFFSET(B152,-1,0),C152)","v":2},{"$f":"IF(OFFSET(C152,-1,0)=\"L\",1,IF(OFFSET(C152,-1,0)=1,2,IF(OR(A152=\"s\",A152=0),\"S\",IF(AND(OFFSET(C152,-1,0)=2,A152=4),3,IF(AND(OR(OFFSET(C152,-1,0)=\"s\",OFFSET(C152,-1,0)=0),A152<>\"s\",A152>OFFSET(B152,-1,0)),OFFSET(B152,-1,0),A152)))))","v":2},{"$f":"IF(OR(C152=\"S\",C152=0),0,IF(ISERROR(K152),J152,SMALL(J152:K152,1)))","v":6},{"$f":"IF($C152=1,OFFSET(E152,-1,0)+1,OFFSET(E152,-1,0))","v":1},{"$f":"IF($C152=1,0,IF($C152=2,OFFSET(F152,-1,0)+1,OFFSET(F152,-1,0)))","v":7},{"$f":"IF(AND($C152<=2,$C152<>0),0,IF($C152=3,OFFSET(G152,-1,0)+1,OFFSET(G152,-1,0)))","v":0},{"$f":"IF(AND($C152<=3,$C152<>0),0,IF($C152=4,OFFSET(H152,-1,0)+1,OFFSET(H152,-1,0)))","v":0},{"$f":"IF(AND($C152<=4,$C152<>0),0,IF(AND($C152=\"S\",$W152>0),OFFSET(I152,-1,0)+1,OFFSET(I152,-1,0)))","v":0},56,6,"F","Nível 2","Nível 2","1.7.",null,null,"COBERTURAS","-",null,null,null,null,""]
[3,3,3,5,1,7,1,0,0,5,14,"F","Nível 3","Nível 3","1.7.1.",null,null,"CERÂMICA","-",null,null,null,null,""]
["S",3,"S",0,1,7,1,0,0,0,0,"F","Serviço","Serviço","1.7.1.0.1.","SINAPI",94445,"TELHAMENTO COM TELHA CERÂMICA CAPA-CANAL, TIPO PLAN, COM ATÉ 2 ÁGUAS, INCLUSO TRANSPORTE VERTICAL. AF_06/2016","M2",415.52,null,null,null,"Referência: AGETOP - 160401"]
["S",3,"S",0,1,7,1,0,0,0,0,"F","Serviço","Serviço","1.7.1.0.2.","SINAPI",94221,"CUMEEIRA PARA TELHA CERÂMICA EMBOÇADA COM ARGAMASSA TRAÇO 1:2:9 (CIMENTO, CAL E AREIA) PARA TELHADOS COM ATÉ 2 ÁGUAS, INCLUSO TRANSPORTE VERTICAL. AF_06/2016","M",96.01,null,null,null,""]
["S",3,"S",0,1,7,1,0,0,0,0,"F","Serviço","Serviço","1.7.1.0.3.","SINAPI",94224,"EMBOÇAMENTO COM ARGAMASSA TRAÇO 1:2:9 (CIMENTO, CAL E AREIA). AF_06/2016","M",220.55,null,null,null,"Referência: AGETOP - 160403"]
["S",3,"S",0,1,7,1,0,0,0,0,"F","Serviço","Serviço","1.7.1.0.4.","AGETOP",160421,"MAO DE OBRA PARA COBERTURA C/TELHA COLONIAL PLAN","m2    ",831.04,null,null,null,""]
[2,2,2,2,1,8,0,0,0,50,2,"F","Nível 2","Nível 2","1.8.",null,null,"ESQUADRIAS METÁLICAS","-",null,null,null,null,""]
["S",2,"S",0,1,8,0,0,0,0,0,"F","Serviço","Serviço","1.8.0.0.1.","COMPOSIÇÃO","COMP 084_SEE","GUARDA-CORPO COM CORRIMÃO - SEDUC","M",17.600000000000001,null,null,null,""]
[2,2,2,4,1,9,0,0,0,48,4,"F","Nível 2","Nível 2","1.9.",null,null,"REVESTIMENTO DE PAREDE","-",null,null,null,null,""]
["S",2,"S",0,1,9,0,0,0,0,0,"F","Serviço","Serviço","1.9.0.0.1.","SINAPI",87553,"EMBOÇO, PARA RECEBIMENTO DE CERÂMICA, EM ARGAMASSA TRAÇO 1:2:8, PREPARO MECÂNICO COM BETONEIRA 400L, APLICADO MANUALMENTE EM FACES INTERNAS DE PAREDES, PARA AMBIENTE COM ÁREA MAIOR QUE 10M2, ESPESSURA DE 10MM, COM EXECUÇÃO DE TALISCAS. AF_06/2014","M2",17.100000000000001,null,null,null,""]
[{"$f":"CHOOSE(1+LOG(1+2*(ORÇAMENTO.Nivel=\"Nível 1\")+4*(ORÇAMENTO.Nivel=\"Nível 2\")+8*(ORÇAMENTO.Nivel=\"Nível 3\")+16*(ORÇAMENTO.Nivel=\"Nível 4\")+32*(ORÇAMENTO.Nivel=\"Serviço\"),2),0,1,2,3,4,\"S\")","v":"S"},2,"S",0,1,9,0,0,{"$f":"IF(AND($C162<=4,$C162<>0),0,IF(AND($C162=\"S\",$W162>0),OFFSET(I162,-1,0)+1,OFFSET(I162,-1,0)))","v":0},0,0,"F","Serviço","Serviço","1.9.0.0.2.","AGETOP",200102,"COSTURA DE TRINCA EM ALVENARIA  DE TIJOLO","m     ",2,null,null,null,""]
["S",2,"S",0,{"$f":"IF($C163=1,OFFSET(E163,-1,0)+1,OFFSET(E163,-1,0))","v":1},{"$f":"IF($C163=1,0,IF($C163=2,OFFSET(F163,-1,0)+1,OFFSET(F163,-1,0)))","v":9},{"$f":"IF(AND($C163<=2,$C163<>0),0,IF($C163=3,OFFSET(G163,-1,0)+1,OFFSET(G163,-1,0)))","v":0},{"$f":"IF(AND($C163<=3,$C163<>0),0,IF($C163=4,OFFSET(H163,-1,0)+1,OFFSET(H163,-1,0)))","v":0},0,0,0,"F","Serviço","Serviço","1.9.0.0.3.","SINAPI",87273,"REVESTIMENTO CERÂMICO PARA PAREDES INTERNAS COM PLACAS TIPO ESMALTADA EXTRA DE DIMENSÕES 33X45 CM APLICADAS EM AMBIENTES DE ÁREA MAIOR QUE 5 M² NA ALTURA INTEIRA DAS PAREDES. AF_06/2014","M2",17.100000000000001,null,null,null,""]
[2,{"$f":"IF(OR(C164=\"s\",C164=0),OFFSET(B164,-1,0),C164)","v":2},{"$f":"IF(OFFSET(C164,-1,0)=\"L\",1,IF(OFFSET(C164,-1,0)=1,2,IF(OR(A164=\"s\",A164=0),\"S\",IF(AND(OFFSET(C164,-1,0)=2,A164=4),3,IF(AND(OR(OFFSET(C164,-1,0)=\"s\",OFFSET(C164,-1,0)=0),A164<>\"s\",A164>OFFSET(B164,-1,0)),OFFSET(B164,-1,0),A164)))))","v":2},{"$f":"IF(OR(C164=\"S\",C164=0),0,IF(ISERROR(K164),J164,SMALL(J164:K164,1)))","v":13},1,10,0,0,0,44,13,"F","Nível 2","Nível 2","1.10.",null,null,"REVESTIMENTO DE PISO","-",null,null,null,null,""]
[3,3,3,2,1,10,1,0,0,12,2,"F","Nível 3","Nível 3","1.10.1.",null,null,"LASTRO","-",null,null,null,null,""]
["S",3,"S",0,1,10,1,0,0,0,0,"F","Serviço","Serviço","1.10.1.0.1.","AGETOP",220101,"LASTRO DE CONCRETO REGULARIZADO IMPERMEABILIZADO 1:3:6 ESP=5CM (BASE)","m2    ",552.36,null,null,null,""]
[3,3,3,4,1,10,2,0,0,10,4,"F","Nível 3","Nível 3","1.10.2.",null,null,"GRANITINA","-",null,null,null,null,""]
["S",3,"S",0,1,10,2,0,0,0,0,"F","Serviço","Serviço","1.10.2.0.1.","AGETOP",221106,"GRANITINA 8MM FUNDIDA COM CONTRAPISO (1CI:3ARML) E=2CM E JUNTA PLASTICA 27MM (COM ÓXIDO DE FERRO)","m2    ",552.36,null,null,null,""]
["S",3,"S",0,1,10,2,0,0,0,0,"F","Serviço","Serviço","1.10.2.0.2.","AGETOP",221102,"RODAPÉ FUNDIDO DE GRANITINA 7CM","m     ",330.15,null,null,null,""]
["S",3,"S",0,1,10,2,0,0,0,0,"F","Serviço","Serviço","1.10.2.0.3.","AGETOP",221104,"RASPAGEM E APLICAÇÃO RESINA ACRÍLICA DUAS DEMÃOS","m2    ",575.47050000000002,null,null,null,""]
[3,3,3,2,1,10,3,0,0,6,2,"F","Nível 3","Nível 3","1.10.3.",null,null,"CERÂMICO","-",null,null,null,null,""]
["S",3,"S",0,1,10,3,0,0,0,0,"F","Serviço","Serviço","1.10.3.0.1.","AGETOP",220311,"CERÂMICA ANTIDERRAPANTE PEI MAIOR OU IGUAL A 4 COM CONTRA PISO (1CI:3ARML) E ARGAMASSA COLANTE","m2    ",1.95,null,null,null,""]
[3,3,3,2,1,10,4,0,0,4,2,"F","Nível 3","Nível 3","1.10.4.",null,null,"CONCRETO","-",null,null,null,null,""]
["S",3,"S",0,1,10,4,0,0,0,0,"F","Serviço","Serviço","1.10.4.0.1.","AGETOP",220102,"PISO CONCRETO DESEMPENADO ESPESSURA = 5 CM  1:2,5:3,5","m2    ",699.26,null,null,null,""]
[3,3,3,2,1,10,5,0,0,2,28,"F","Nível 3","Nível 3","1.10.5.",null,null,"PODOTÁTIL","-",null,null,null,null,""]
["S",3,"S",0,1,10,5,0,0,0,0,"F","Serviço","Serviço","1.10.5.0.1.","AGETOP",221126,"PISO DE LADRILHO HIDRÁULICO COLORIDO MODELO TÁTIL ( ALERTA OU DIRECIONAL) SEM LASTRO","m2    ",55.11,null,null,null,""]
[2,2,2,3,1,11,0,0,0,31,3,"F","Nível 2","Nível 2","1.11.",null,null,"FERRAGENS","-",null,null,null,null,""]
["S",2,"S",0,1,11,0,0,0,0,0,"F","Serviço","Serviço","1.11.0.0.1.","AGETOP",230174,"BARRA DE APOIO EM AÇO INOX - 40 CM","un    ",2,null,null,null,""]
["S",2,"S",0,1,11,0,0,0,0,0,"F","Serviço","Serviço","1.11.0.0.2.","AGETOP",230176,"BARRA DE APOIO EM AÇO INOX - 80 CM ","un    ",6,null,null,null,""]
[2,2,2,6,1,12,0,0,0,28,6,"F","Nível 2","Nível 2","1.12.",null,null,"ADMINISTRAÇÃO","-",null,null,null,null,""]
[3,3,3,3,1,12,1,0,0,5,3,"F","Nível 3","Nível 3","1.12.1.",null,null,"MENSALISTAS","-",null,null,null,null,""]
["S",3,"S",0,1,12,1,0,0,0,0,"F","Serviço","Serviço","1.12.1.0.1.","SINAPI",90778,"ENGENHEIRO CIVIL DE OBRA PLENO COM ENCARGOS COMPLEMENTARES","H",176,null,null,null,"Referência: AGETOP - 250101"]
["S",3,"S",0,1,12,1,0,0,0,0,"F","Serviço","Serviço","1.12.1.0.2.","SINAPI",90776,"ENCARREGADO GERAL COM ENCARGOS COMPLEMENTARES","H",880,null,null,null,"Referência: AGETOP - 250103"]
[3,3,3,2,1,12,2,0,0,2,10,"F","Nível 3","Nível 3","1.12.2.",null,null,"LAUDO DE ESTANQUEIDADE","-",null,null,null,null,""]
["S",3,"S",0,1,12,2,0,0,0,0,"F","Serviço","Serviço","1.12.2.0.1.","SINAPI",90778,"ENGENHEIRO CIVIL DE OBRA PLENO COM ENCARGOS COMPLEMENTARES","H",16,null,null,null,"Referência: AGETOP - 250101"]
[2,2,2,20,1,13,0,0,0,22,20,"F","Nível 2","Nível 2","1.13.",null,null,"PINTURA","-",null,null,null,null,""]
[3,3,3,4,1,13,1,0,0,19,4,"F","Nível 3","Nível 3","1.13.1.",null,null,"ESMALTE SINTÉTICO","-",null,null,null,null,""]
["S",3,"S",0,1,13,1,0,0,0,0,"F","Serviço","Serviço","1.13.1.0.1.","AGETOP",260105,"REMOCAO DE PINTURA ANTIGA A OLEO OU ESMALTE","m2    ",634.55999999999995,null,null,null,""]
["S",3,"S",0,1,13,1,0,0,0,0,"F","Serviço","Serviço","1.13.1.0.2.","SINAPI",88497,"APLICAÇÃO E LIXAMENTO DE MASSA LÁTEX EM PAREDES, DUAS DEMÃOS. AF_06/2014","M2",190.36799999999997,null,null,null,"Referência: AGETOP - 261300"]
[{"$f":"CHOOSE(1+LOG(1+2*(ORÇAMENTO.Nivel=\"Nível 1\")+4*(ORÇAMENTO.Nivel=\"Nível 2\")+8*(ORÇAMENTO.Nivel=\"Nível 3\")+16*(ORÇAMENTO.Nivel=\"Nível 4\")+32*(ORÇAMENTO.Nivel=\"Serviço\"),2),0,1,2,3,4,\"S\")","v":"S"},3,"S",0,1,13,1,0,{"$f":"IF(AND($C190<=4,$C190<>0),0,IF(AND($C190=\"S\",$W190>0),OFFSET(I190,-1,0)+1,OFFSET(I190,-1,0)))","v":0},0,0,"F","Serviço","Serviço","1.13.1.0.3.","AGETOP",261550,"PINT.ESMALTE SINT.PAREDES - 2 DEM.C/SELADOR","m2    ",634.55999999999995,null,null,null,""]
[3,3,3,3,1,13,2,0,0,15,3,"F","Nível 3","Nível 3","1.13.2.","AGETOP",null,"LÁTEX ACRÍLICA","-",null,null,null,null,""]
["S",3,"S",0,1,13,2,0,0,0,0,"F","Serviço","Serviço","1.13.2.0.1.","SINAPI",88497,"APLICAÇÃO E LIXAMENTO DE MASSA LÁTEX EM PAREDES, DUAS DEMÃOS. AF_06/2014","M2",285.55199999999996,null,null,null,"Referência: AGETOP - 261300"]
["S",3,"S",0,{"$f":"IF($C193=1,OFFSET(E193,-1,0)+1,OFFSET(E193,-1,0))","v":1},{"$f":"IF($C193=1,0,IF($C193=2,OFFSET(F193,-1,0)+1,OFFSET(F193,-1,0)))","v":13},{"$f":"IF(AND($C193<=2,$C193<>0),0,IF($C193=3,OFFSET(G193,-1,0)+1,OFFSET(G193,-1,0)))","v":2},{"$f":"IF(AND($C193<=3,$C193<>0),0,IF($C193=4,OFFSET(H193,-1,0)+1,OFFSET(H193,-1,0)))","v":0},0,0,0,"F","Serviço","Serviço","1.13.2.0.2.","SINAPI",88489,"APLICAÇÃO MANUAL DE PINTURA COM TINTA LÁTEX ACRÍLICA EM PAREDES, DUAS DEMÃOS. AF_06/2014","M2",634.55999999999995,null,null,null,"Referência: AGETOP - 261001"]
[3,3,3,3,1,13,3,0,0,12,3,"F","Nível 3","Nível 3","1.13.3.","AGETOP",null,"TETO","-",null,null,null,null,""]
["S",3,"S",0,1,13,3,0,0,0,0,"F","Serviço","Serviço","1.13.3.0.1.","SINAPI",88496,"APLICAÇÃO E LIXAMENTO DE MASSA LÁTEX EM TETO, DUAS DEMÃOS. AF_06/2014","M2",158.63999999999999,null,null,null,"Referência: AGETOP - 261300"]
["S",3,"S",0,1,13,3,0,0,0,0,"F","Serviço","Serviço","1.13.3.0.2.","SINAPI",88486,"APLICAÇÃO MANUAL DE PINTURA COM TINTA LÁTEX PVA EM TETO, DUAS DEMÃOS. AF_06/2014","M2",579.14,null,null,null,"Referência: AGETOP - 261307"]
[3,3,3,3,1,13,4,0,0,9,3,"F","Nível 3","Nível 3","1.13.4.","AGETOP",null,"EXTERNA","-",null,null,null,null,""]
["S",{"$f":"IF(OR(C198=\"s\",C198=0),OFFSET(B198,-1,0),C198)","v":3},{"$f":"IF(OFFSET(C198,-1,0)=\"L\",1,IF(OFFSET(C198,-1,0)=1,2,IF(OR(A198=\"s\",A198=0),\"S\",IF(AND(OFFSET(C198,-1,0)=2,A198=4),3,IF(AND(OR(OFFSET(C198,-1,0)=\"s\",OFFSET(C198,-1,0)=0),A198<>\"s\",A198>OFFSET(B198,-1,0)),OFFSET(B198,-1,0),A198)))))","v":"S"},{"$f":"IF(OR(C198=\"S\",C198=0),0,IF(ISERROR(K198),J198,SMALL(J198:K198,1)))","v":0},1,13,4,0,0,0,0,"F","Serviço","Serviço","1.13.4.0.1.","AGETOP",260202,"CAIACAO DUAS DEMAOS MUROS E PAREDES - (OB.C.)","m2    ",360,null,null,null,""]
["S",3,"S",0,1,13,4,0,0,0,0,"F","Serviço","Serviço","1.13.4.0.2.","SINAPI",88423,"APLICAÇÃO MANUAL DE PINTURA COM TINTA TEXTURIZADA ACRÍLICA EM PAREDES EXTERNAS DE CASAS, UMA COR. AF_06/2014","M2",492.45,null,null,null,"Referência: AGETOP - 260601"]
[3,3,3,3,1,13,5,0,0,6,3,"F","Nível 3","Nível 3","1.13.5.","AGETOP",null,"ESQUADRIAS EXISTENTES","-",null,null,null,null,""]
["S",3,"S",0,1,13,5,0,0,0,0,"F","Serviço","Serviço","1.13.5.0.1.","AGETOP",260105,"REMOCAO DE PINTURA ANTIGA A OLEO OU ESMALTE","m2    ",238.5,null,null,null,""]
["S",3,"S",0,1,13,5,0,0,0,0,"F","Serviço","Serviço","1.13.5.0.2.","SINAPI","73924/3","PINTURA ESMALTE FOSCO, DUAS DEMAOS, SOBRE SUPERFICIE METALICA","M2",238.5,null,null,null,"Referência: AGETOP - 261503"]
[3,3,3,3,1,13,6,0,0,3,{"$error":"#N/A"},"F","Nível 3","Nível 3","1.13.6.","AGETOP",null,"OUTROS","-",null,null,null,null,""]
["S",3,"S",0,1,13,6,0,0,0,0,"F","Serviço","Serviço","1.13.6.0.1.","AGETOP",200102,"COSTURA DE TRINCA EM ALVENARIA  DE TIJOLO","m     ",2,null,null,null,""]
["S",3,"S",0,1,13,6,0,0,0,0,"F","Serviço","Serviço","1.13.6.0.2.","AGETOP",261620,"LETREIRO MÉDIO A GRANDE PORTE EM PAREDE FEITO A PINCEL","m2    ",7.2,null,null,null,""]
[2,2,2,2,1,14,0,0,0,2,{"$error":"#N/A"},"F","Nível 2","Nível 2","1.14.",null,null,"DIVERSOS","-",null,null,null,null,""]
["S",2,"S",0,1,14,0,0,0,0,0,"F","Serviço","Serviço","1.14.0.0.1.","AGETOP",271608,"BANCADA DE GRANITO C/ESPELHO","m2    ",0.17,null,null,null,""]
[1,1,1,12,2,0,0,0,0,95,12,"F","Nível 1","Nível 1","2.","SINAPI",null,"IMPLANTAÇÃO","-",null,null,null,null,""]
[2,2,2,7,2,1,0,0,0,11,7,"F","Nível 2","Nível 2","2.1.","SINAPI",null,"SERVIÇO EM TERRA","-",null,null,null,null,""]
["S",2,"S",0,2,1,0,0,0,0,0,"F","Serviço","Serviço","2.1.0.0.1.","SINAPI",79480,"ESCAVACAO MECANICA CAMPO ABERTO EM SOLO EXCETO ROCHA ATE 2,00M PROFUNDIDADE","M3",383.5625,null,null,null,"Referência: AGETOP - 41004"]
["S",2,"S",0,2,1,0,0,0,{"$f":"IF(OR($C211=\"S\",$C211=0),0,MATCH(0,OFFSET($D211,1,$C211,ROW($C$303)-ROW($C211)),0))","v":0},{"$f":"IF(OR($C211=\"S\",$C211=0),0,MATCH(OFFSET($D211,0,$C211)+1,OFFSET($D211,1,$C211,ROW($C$303)-ROW($C211)),0))","v":0},"F","Serviço","Serviço","2.1.0.0.2.","SINAPI",72898,"CARGA E DESCARGA MECANIZADAS DE ENTULHO EM CAMINHAO BASCULANTE 6 M3","M3",383.5625,null,null,null,"Referência: AGETOP - 41005"]
["S",2,"S",0,2,1,0,0,0,0,0,"F","Serviço","Serviço","2.1.0.0.3.","AGETOP",41012,"INDENIZAÇÃO DE JAZIDA","m3    ",383.5625,null,null,null,""]
["S",2,"S",0,2,1,0,0,0,0,0,"F","Serviço","Serviço","2.1.0.0.4.","AGETOP",41006,"TRANSPORTE DE MATERIAL ESCAVADO M3.KM","m3km  ",3835.625,null,null,null,""]
["S",2,"S",0,2,1,0,0,0,0,0,"F","Serviço","Serviço","2.1.0.0.5.","SINAPI","74005/2","COMPACTACAO MECANICA C/ CONTROLE DO GC>=95% DO PN (AREAS) (C/MONIVELADORA 140 HP E ROLO COMPRESSOR VIBRATORIO 80 HP)","M3",235.9,null,null,null,"Referência: AGETOP - 41008"]
["S",2,"S",0,2,1,0,0,0,0,0,"F","Serviço","Serviço","2.1.0.0.6.","AGETOP",41140,"REGULARIZAÇÃO DO TERRENO SEM APILOAMENTO COM TRANSPORTE MANUAL DA TERRA ESCAVADA ","m2    ",537.94000000000005,null,null,null,""]
[2,2,2,2,2,2,0,0,0,4,2,"F","Nível 2","Nível 2","2.2.","SINAPI",null,"REVESTIMENTO DE PISO","-",null,null,null,null,""]
["S",2,"S",0,2,2,0,0,0,0,0,"F","Serviço","Serviço","2.2.0.0.1.","AGETOP",220102,"PISO CONCRETO DESEMPENADO ESPESSURA = 5 CM  1:2,5:3,5","m2    ",200.74,null,null,null,""]
[2,2,2,2,2,3,0,0,0,2,20,"F","Nível 2","Nível 2","2.3.","SINAPI",null,"DIVERSOS","-",null,null,null,null,""]
["S",2,"S",0,2,3,0,0,0,0,0,"F","Serviço","Serviço","2.3.0.0.1.","AGETOP",270501,"LIMPEZA FINAL DE OBRA - (OBRAS CIVIS)","m2    ",393.58499999999998,null,null,null,""]
[1,1,1,83,3,0,0,0,0,83,{"$error":"#N/A"},"F","Nível 1","Nível 1","3.","SINAPI",null,"QUADRA EM ARCO MODELO 01 SEDUC","-",null,null,null,null,""]
[2,2,2,2,3,1,0,0,0,82,2,"F","Nível 2","Nível 2","3.1.","SINAPI",null,"SERVIÇOS PRELIMINARES","-",null,null,null,null,""]
["S",2,"S",0,3,1,0,0,0,0,0,"F","Serviço","Serviço","3.1.0.0.1.","AGETOP",20701,"LOCAÇÃO DA OBRA, EXECUÇÃO DE GABARITO SEM REAPROVEITAMENTO, INCLUSO PINTURA (FACE INTERNA DO RIPÃO 15CM) E PIQUETE COM TESTEMUNHA","m2    ",337.2,null,null,null,""]
[2,2,2,3,3,2,0,0,0,80,3,"F","Nível 2","Nível 2","3.2.","SINAPI",null,"SERVIÇO EM TERRA","-",null,null,null,null,""]
["S",2,"S",0,3,2,0,0,0,0,0,"F","Serviço","Serviço","3.2.0.0.1.","AGETOP",41140,"REGULARIZAÇÃO DO TERRENO SEM APILOAMENTO COM TRANSPORTE MANUAL DA TERRA ESCAVADA ","m2    ",462.14,null,null,null,""]
["S",2,"S",0,3,2,0,0,0,0,0,"F","Serviço","Serviço","3.2.0.0.2.","AGETOP",41002,"APILOAMENTO","m2    ",462.14,null,null,null,""]
[2,2,2,12,3,3,0,0,0,77,12,"F","Nível 2","Nível 2","3.3.","SINAPI",null,"FUNDAÇÕES E SONDAGENS","-",null,null,null,null,""]
[3,3,3,11,3,3,1,0,0,11,60,"F","Nível 3","Nível 3","3.3.1.","SINAPI",null,"ESTACAS E BLOCOS","-",null,null,null,null,""]
[{"$f":"CHOOSE(1+LOG(1+2*(ORÇAMENTO.Nivel=\"Nível 1\")+4*(ORÇAMENTO.Nivel=\"Nível 2\")+8*(ORÇAMENTO.Nivel=\"Nível 3\")+16*(ORÇAMENTO.Nivel=\"Nível 4\")+32*(ORÇAMENTO.Nivel=\"Serviço\"),2),0,1,2,3,4,\"S\")","v":"S"},3,"S",0,3,3,1,0,{"$f":"IF(AND($C228<=4,$C228<>0),0,IF(AND($C228=\"S\",$W228>0),OFFSET(I228,-1,0)+1,OFFSET(I228,-1,0)))","v":0},0,0,"F","Serviço","Serviço","3.3.1.0.1.","SINAPI",98230,"ESTACA BROCA DE CONCRETO, DIÂMETRO DE 30 CM, PROFUNDIDADE DE ATÉ 3 M, ESCAVAÇÃO MANUAL COM TRADO CONCHA, NÃO ARMADA. AF_03/2018","M",90,null,null,null,"Referência: AGETOP - 50302"]
["S",3,"S",0,3,3,1,0,0,0,0,"F","Serviço","Serviço","3.3.1.0.2.","AGETOP",51009,"FORMA TABUA PINHO P/FUNDACOES U=3V - (OBRAS CIVIS)","m2    ",42,null,null,null,""]
["S",3,"S",0,3,3,1,0,0,0,0,"F","Serviço","Serviço","3.3.1.0.3.","SINAPI",96522,"ESCAVAÇÃO MANUAL PARA BLOCO DE COROAMENTO OU SAPATA, SEM PREVISÃO DE FÔRMA. AF_06/2017","M3",21.4,null,null,null,"Referência: AGETOP - 50901"]
["S",3,"S",0,{"$f":"IF($C231=1,OFFSET(E231,-1,0)+1,OFFSET(E231,-1,0))","v":3},{"$f":"IF($C231=1,0,IF($C231=2,OFFSET(F231,-1,0)+1,OFFSET(F231,-1,0)))","v":3},{"$f":"IF(AND($C231<=2,$C231<>0),0,IF($C231=3,OFFSET(G231,-1,0)+1,OFFSET(G231,-1,0)))","v":1},{"$f":"IF(AND($C231<=3,$C231<>0),0,IF($C231=4,OFFSET(H231,-1,0)+1,OFFSET(H231,-1,0)))","v":0},0,0,0,"F","Serviço","Serviço","3.3.1.0.4.","AGETOP",50902,"APILOAMENTO (BLOCOS/SAPATAS)","m2    ",9.9,null,null,null,""]
["S",3,"S",0,3,3,1,0,0,0,0,"F","Serviço","Serviço","3.3.1.0.5.","SINAPI",96995,"REATERRO MANUAL APILOADO COM SOQUETE. AF_10/2017","M3",9.5299999999999994,null,null,null,"Referência: AGETOP - 40902"]
["S",3,"S",0,3,3,1,0,0,0,0,"F","Serviço","Serviço","3.3.1.0.6.","SINAPI",94964,"CONCRETO FCK = 20MPA, TRAÇO 1:2,7:3 (CIMENTO/ AREIA MÉDIA/ BRITA 1)  - PREPARO MECÂNICO COM BETONEIRA 400 L. AF_07/2016","M3",11.1,null,null,null,""]
["S",3,"S",0,3,3,1,0,0,0,0,"F","Serviço","Serviço","3.3.1.0.7.","SINAPI","74157/4","LANCAMENTO/APLICACAO MANUAL DE CONCRETO EM FUNDACOES","M3",11.1,null,null,null,"Referência: AGETOP - 51026"]
["S",3,"S",0,3,3,1,0,0,0,0,"F","Serviço","Serviço","3.3.1.0.8.","SINAPI",96544,"ARMAÇÃO DE BLOCO, VIGA BALDRAME OU SAPATA UTILIZANDO AÇO CA-50 DE 6,3 MM - MONTAGEM. AF_06/2017","KG",117.2,null,null,null,"Referência: AGETOP - 52003"]
["S",3,"S",0,3,3,1,0,0,0,0,"F","Serviço","Serviço","3.3.1.0.9.","SINAPI",96545,"ARMAÇÃO DE BLOCO, VIGA BALDRAME OU SAPATA UTILIZANDO AÇO CA-50 DE 8 MM - MONTAGEM. AF_06/2017","KG",218.3,null,null,null,"Referência: AGETOP - 52004"]
["S",{"$f":"IF(OR(C237=\"s\",C237=0),OFFSET(B237,-1,0),C237)","v":3},{"$f":"IF(OFFSET(C237,-1,0)=\"L\",1,IF(OFFSET(C237,-1,0)=1,2,IF(OR(A237=\"s\",A237=0),\"S\",IF(AND(OFFSET(C237,-1,0)=2,A237=4),3,IF(AND(OR(OFFSET(C237,-1,0)=\"s\",OFFSET(C237,-1,0)=0),A237<>\"s\",A237>OFFSET(B237,-1,0)),OFFSET(B237,-1,0),A237)))))","v":"S"},{"$f":"IF(OR(C237=\"S\",C237=0),0,IF(ISERROR(K237),J237,SMALL(J237:K237,1)))","v":0},3,3,1,0,0,0,0,"F","Serviço","Serviço","3.3.1.0.10.","SINAPI",96543,"ARMAÇÃO DE BLOCO, VIGA BALDRAME E SAPATA UTILIZANDO AÇO CA-60 DE 5 MM - MONTAGEM. AF_06/2017","KG",83.3,null,null,null,"Referência: AGETOP - 52014"]
[2,2,2,10,3,4,0,0,0,65,10,"F","Nível 2","Nível 2","3.4.","SINAPI",null,"ESTRUTURA","-",null,null,null,null,""]
[3,3,3,9,3,4,1,0,0,9,48,"F","Nível 3","Nível 3","3.4.1.","SINAPI",null,"PILARES","-",null,null,null,null,""]
["S",3,"S",0,3,4,1,0,0,0,0,"F","Serviço","Serviço","3.4.1.0.1.","SINAPI",92426,"MONTAGEM E DESMONTAGEM DE FÔRMA DE PILARES RETANGULARES E ESTRUTURAS SIMILARES COM ÁREA MÉDIA DAS SEÇÕES MENOR OU IGUAL A 0,25 M², PÉ-DIREITO SIMPLES, EM CHAPA DE MADEIRA COMPENSADA RESINADA, 8 UTILIZAÇÕES. AF_12/2015","M2",114.96,null,null,null,""]
["S",3,"S",0,3,4,1,0,0,0,0,"F","Serviço","Serviço","3.4.1.0.2.","AGETOP",60207,"FORMA CH.COMPENSADA 12MM-VIGA/PILAR U=2V - (OBRAS CIVIS","m2    ",104.86,null,null,null,""]
["S",3,"S",0,3,4,1,0,0,0,0,"F","Serviço","Serviço","3.4.1.0.3.","SINAPI",94964,"CONCRETO FCK = 20MPA, TRAÇO 1:2,7:3 (CIMENTO/ AREIA MÉDIA/ BRITA 1)  - PREPARO MECÂNICO COM BETONEIRA 400 L. AF_07/2016","M3",13.51,null,null,null,""]
["S",3,"S",0,3,4,1,0,0,0,0,"F","Serviço","Serviço","3.4.1.0.4.","SINAPI",92873,"LANÇAMENTO COM USO DE BALDES, ADENSAMENTO E ACABAMENTO DE CONCRETO EM ESTRUTURAS. AF_12/2015","M3",13.51,null,null,null,"Referência: AGETOP - 60801"]
["S",3,"S",0,3,4,1,0,0,0,0,"F","Serviço","Serviço","3.4.1.0.5.","SINAPI",92776,"ARMAÇÃO DE PILAR OU VIGA DE UMA ESTRUTURA CONVENCIONAL DE CONCRETO ARMADO EM UMA EDIFICAÇÃO TÉRREA OU SOBRADO UTILIZANDO AÇO CA-50 DE 6,3 MM - MONTAGEM. AF_12/2015","KG",112.8,null,null,null,"Referência: AGETOP - 60303"]
["S",3,"S",0,3,4,1,0,0,0,0,"F","Serviço","Serviço","3.4.1.0.6.","SINAPI",92777,"ARMAÇÃO DE PILAR OU VIGA DE UMA ESTRUTURA CONVENCIONAL DE CONCRETO ARMADO EM UMA EDIFICAÇÃO TÉRREA OU SOBRADO UTILIZANDO AÇO CA-50 DE 8,0 MM - MONTAGEM. AF_12/2015","KG",193.2,null,null,null,"Referência: AGETOP - 60304"]
["S",3,"S",0,3,4,1,0,0,0,0,"F","Serviço","Serviço","3.4.1.0.7.","SINAPI",92778,"ARMAÇÃO DE PILAR OU VIGA DE UMA ESTRUTURA CONVENCIONAL DE CONCRETO ARMADO EM UMA EDIFICAÇÃO TÉRREA OU SOBRADO UTILIZANDO AÇO CA-50 DE 10,0 MM - MONTAGEM. AF_12/2015","KG",812.6,null,null,null,"Referência: AGETOP - 60305"]
["S",3,"S",0,3,4,1,0,0,0,0,"F","Serviço","Serviço","3.4.1.0.8.","SINAPI",92775,"ARMAÇÃO DE PILAR OU VIGA DE UMA ESTRUTURA CONVENCIONAL DE CONCRETO ARMADO EM UMA EDIFICAÇÃO TÉRREA OU SOBRADO UTILIZANDO AÇO CA-60 DE 5,0 MM - MONTAGEM. AF_12/2015","KG",280.8,null,null,null,"Referência: AGETOP - 60314"]
[2,2,2,23,3,5,0,0,0,55,23,"F","Nível 2","Nível 2","3.5.","SINAPI",null,"INSTALAÇÕES ELÉTRICAS","-",null,null,null,null,""]
["S",2,"S",0,3,5,0,0,0,0,0,"F","Serviço","Serviço","3.5.0.0.1.","AGETOP",70351,"BRACADEIRA METALICA TIPO \"U\" DIAM. 3/4\"","Un    ",50,null,null,null,""]
["S",2,"S",0,3,5,0,0,0,0,0,"F","Serviço","Serviço","3.5.0.0.2.","AGETOP",70714,"CAIXA DE PASSAGEM 50X50X80CM FUNDO DE BRITA SEM TAMPA","Un    ",1,null,null,null,""]
["S",2,"S",0,3,5,0,0,0,0,0,"F","Serviço","Serviço","3.5.0.0.3.","AGETOP",71190,"ELETROCALHA CH.Aº PRE ZN. FOGO \"C\" C/ABAS 50X50 MM S/TAMPA","M     ",25,null,null,null,""]
["S",2,"S",0,3,5,0,0,0,0,0,"F","Serviço","Serviço","3.5.0.0.4.","AGETOP",71291,"FIO ISOLADO PVC 750 V, No. 2,5 MM2","M     ",300,null,null,null,""]
["S",2,"S",0,3,5,0,0,0,0,0,"F","Serviço","Serviço","3.5.0.0.5.","AGETOP",71522,"LAMPADA A VAPOR MERCURIO 400 W","Un    ",8,null,null,null,""]
["S",2,"S",0,3,5,0,0,0,0,0,"F","Serviço","Serviço","3.5.0.0.6.","AGETOP",70421,"BUCHA E ARRUELA METALICA DIAM. 3/4\"","PR    ",12,null,null,null,""]
["S",2,"S",0,3,5,0,0,0,0,0,"F","Serviço","Serviço","3.5.0.0.7.","AGETOP",70422,"BUCHA E ARRUELA METALICA DIAM. 1\"","PR    ",1,null,null,null,""]
["S",2,"S",0,3,5,0,0,0,0,0,"F","Serviço","Serviço","3.5.0.0.8.","SINAPI",72190,"RODAPE BORRACHA LISO, ALTURA = 7CM, ESPESSURA = 2 MM, PARA ARGAMASSA","M",1,null,null,null,""]
["S",2,"S",0,3,5,0,0,0,0,0,"F","Serviço","Serviço","3.5.0.0.9.","AGETOP",72250,"REATOR EXTERNO V. MERCÚRIO  AFP 1 X 400 W","Un    ",8,null,null,null,""]
["S",2,"S",0,3,5,0,0,0,0,0,"F","Serviço","Serviço","3.5.0.0.10.","AGETOP",70927,"CONDULETE DE PVC - TAMPÃO DE 3/4\"  ","un    ",8,null,null,null,""]
["S",2,"S",0,3,5,0,0,0,0,0,"F","Serviço","Serviço","3.5.0.0.11.","SINAPI",91929,"CABO DE COBRE FLEXÍVEL ISOLADO, 4 MM², ANTI-CHAMA 0,6/1,0 KV, PARA CIRCUITOS TERMINAIS - FORNECIMENTO E INSTALAÇÃO. AF_12/2015","M",80,null,null,null,"Referência: AGETOP - 70582"]
["S",2,"S",0,3,5,0,0,0,0,0,"F","Serviço","Serviço","3.5.0.0.12.","SINAPI",92868,"CAIXA RETANGULAR 4\" X 2\" MÉDIA (1,30 M DO PISO), METÁLICA, INSTALADA EM PAREDE - FORNECIMENTO E INSTALAÇÃO. AF_12/2015","UN",4,null,null,null,"Referência: AGETOP - 70691"]
["S",2,"S",0,3,5,0,0,0,0,0,"F","Serviço","Serviço","3.5.0.0.13.","SINAPI",91902,"CURVA 90 GRAUS PARA ELETRODUTO, PVC, ROSCÁVEL, DN 25 MM (3/4\"), PARA CIRCUITOS TERMINAIS, INSTALADA EM LAJE - FORNECIMENTO E INSTALAÇÃO. AF_12/2015","UN",4,null,null,null,"Referência: AGETOP - 71141"]
["S",2,"S",0,3,5,0,0,0,0,0,"F","Serviço","Serviço","3.5.0.0.14.","SINAPI",91905,"CURVA 90 GRAUS PARA ELETRODUTO, PVC, ROSCÁVEL, DN 32 MM (1\"), PARA CIRCUITOS TERMINAIS, INSTALADA EM LAJE - FORNECIMENTO E INSTALAÇÃO. AF_12/2015","UN",1,null,null,null,"Referência: AGETOP - 71142"]
["S",2,"S",0,3,5,0,0,0,0,0,"F","Serviço","Serviço","3.5.0.0.15.","SINAPI",93653,"DISJUNTOR MONOPOLAR TIPO DIN, CORRENTE NOMINAL DE 10A - FORNECIMENTO E INSTALAÇÃO. AF_04/2016","UN",3,null,null,null,""]
["S",2,"S",0,3,5,0,0,0,0,0,"F","Serviço","Serviço","3.5.0.0.16.","SINAPI",93671,"DISJUNTOR TRIPOLAR TIPO DIN, CORRENTE NOMINAL DE 32A - FORNECIMENTO E INSTALAÇÃO. AF_04/2016","UN",1,null,null,null,"Referência: AGETOP - 71173"]
["S",2,"S",0,3,5,0,0,0,0,0,"F","Serviço","Serviço","3.5.0.0.17.","SINAPI",91844,"ELETRODUTO FLEXÍVEL CORRUGADO, PVC, DN 25 MM (3/4\"), PARA CIRCUITOS TERMINAIS, INSTALADO EM LAJE - FORNECIMENTO E INSTALAÇÃO. AF_12/2015","M",100,null,null,null,""]
["S",2,"S",0,3,5,0,0,0,0,0,"F","Serviço","Serviço","3.5.0.0.18.","SINAPI",91872,"ELETRODUTO RÍGIDO ROSCÁVEL, PVC, DN 32 MM (1\"), PARA CIRCUITOS TERMINAIS, INSTALADO EM PAREDE - FORNECIMENTO E INSTALAÇÃO. AF_12/2015","M",15,null,null,null,"Referência: AGETOP - 71202"]
["S",2,"S",0,3,5,0,0,0,0,0,"F","Serviço","Serviço","3.5.0.0.19.","AGETOP",71321,"FITA DE AUTO FUSAO, ROLO E 10,00 MM","Un    ",1,null,null,null,""]
["S",2,"S",0,3,5,0,0,0,0,0,"F","Serviço","Serviço","3.5.0.0.20.","AGETOP",71450,"INTERRUPTOR DIFERENCIAL RESIDUAL (D.R.) BIPOLAR DE 25A-30mA","Un    ",4,null,null,null,""]
["S",2,"S",0,3,5,0,0,0,0,0,"F","Serviço","Serviço","3.5.0.0.21.","SINAPI",91885,"LUVA PARA ELETRODUTO, PVC, ROSCÁVEL, DN 32 MM (1\"), PARA CIRCUITOS TERMINAIS, INSTALADA EM PAREDE - FORNECIMENTO E INSTALAÇÃO. AF_12/2015","UN",5,null,null,null,"Referência: AGETOP - 71742"]
["S",2,"S",0,3,5,0,0,0,0,0,"F","Serviço","Serviço","3.5.0.0.22.","SINAPI",91996,"TOMADA MÉDIA DE EMBUTIR (1 MÓDULO), 2P+T 10 A, INCLUINDO SUPORTE E PLACA - FORNECIMENTO E INSTALAÇÃO. AF_12/2015","UN",4,null,null,null,"Referência: AGETOP - 72578"]
[2,2,2,4,3,6,0,0,0,32,4,"F","Nível 2","Nível 2","3.6.","SINAPI",null,"ALVENARIAS E DIVISÓRIAS","-",null,null,null,null,""]
["S",2,"S",0,3,6,0,0,0,0,0,"F","Serviço","Serviço","3.6.0.0.1.","SINAPI",72132,"ALVENARIA EM TIJOLO CERAMICO MACICO 5X10X20CM 1/2 VEZ (ESPESSURA 10CM), ASSENTADO COM ARGAMASSA TRACO 1:2:8 (CIMENTO, CAL E AREIA)","M2",23.6,null,null,null,"Referência: AGETOP - 100102"]
["S",2,"S",0,3,6,0,0,0,0,0,"F","Serviço","Serviço","3.6.0.0.2.","SINAPI",87520,"ALVENARIA DE VEDAÇÃO DE BLOCOS CERÂMICOS FURADOS NA HORIZONTAL DE 9X19X19CM (ESPESSURA 9CM) DE PAREDES COM ÁREA LÍQUIDA MAIOR OU IGUAL A 6M² COM VÃOS E ARGAMASSA DE ASSENTAMENTO COM PREPARO MANUAL. AF_06/2014","M2",63.5,null,null,null,"Referência: AGETOP - 100201"]
["S",2,"S",0,3,6,0,0,0,0,0,"F","Serviço","Serviço","3.6.0.0.3.","AGETOP",100501,"ELEMENTO VAZADO DE CONCRETO","m2    ",4,null,null,null,""]
[2,2,2,2,3,7,0,0,0,{"$f":"IF(OR($C275=\"S\",$C275=0),0,MATCH(0,OFFSET($D275,1,$C275,ROW($C$303)-ROW($C275)),0))","v":28},{"$f":"IF(OR($C275=\"S\",$C275=0),0,MATCH(OFFSET($D275,0,$C275)+1,OFFSET($D275,1,$C275,ROW($C$303)-ROW($C275)),0))","v":2},"F","Nível 2","Nível 2","3.7.","SINAPI",null,"IMPERMEABILIZAÇÃO","-",null,null,null,null,""]
["S",2,"S",0,3,7,0,0,0,0,0,"F","Serviço","Serviço","3.7.0.0.1.","SINAPI",98562,"IMPERMEABILIZAÇÃO DE FLOREIRA OU VIGA BALDRAME COM ARGAMASSA DE CIMENTO E AREIA, COM ADITIVO IMPERMEABILIZANTE, E = 2 CM. AF_06/2018","M2",43,null,null,null,"Referência: AGETOP - 120902"]
[2,2,2,2,3,8,0,0,0,26,2,"F","Nível 2","Nível 2","3.8.","SINAPI",null,"ESTRUTURAS METÁLICAS","-",null,null,null,null,""]
["S",2,"S",0,3,8,0,0,0,0,0,"F","Serviço","Serviço","3.8.0.0.1.","AGETOP",150103,"ESTRUTURA METÁLICA CONVENCIONAL EM AÇO DO TIPO USI SAC-300 COM FUNDO ANTICORROSIVO","Kg    ",4421.76,null,null,null,""]
[2,2,2,2,3,9,0,0,0,24,2,"F","Nível 2","Nível 2","3.9.","SINAPI",null,"COBERTURAS","-",null,null,null,null,""]
["S",2,"S",0,3,9,0,0,0,0,0,"F","Serviço","Serviço","3.9.0.0.1.","AGETOP",160969,"COBERTURA COM TELHA CHAPA GALVANIZADA TRAPEZOIDAL 0,43 MM COM ACESSÓRIOS","m2    ",478.51,null,null,null,""]
[2,2,2,3,3,10,0,0,0,22,3,"F","Nível 2","Nível 2","3.10.","SINAPI",null,"REVESTIMENTO DE PAREDE","-",null,null,null,null,""]
["S",2,"S",0,3,10,0,0,0,0,0,"F","Serviço","Serviço","3.10.0.0.1.","SINAPI",87904,"CHAPISCO APLICADO EM ALVENARIA (COM PRESENÇA DE VÃOS) E ESTRUTURAS DE CONCRETO DE FACHADA, COM COLHER DE PEDREIRO.  ARGAMASSA TRAÇO 1:3 COM PREPARO MANUAL. AF_06/2014","M2",174.2,null,null,null,"Referência: AGETOP - 200101"]
["S",2,"S",0,3,10,0,0,0,0,0,"F","Serviço","Serviço","3.10.0.0.2.","SINAPI",87547,"MASSA ÚNICA, PARA RECEBIMENTO DE PINTURA, EM ARGAMASSA TRAÇO 1:2:8, PREPARO MECÂNICO COM BETONEIRA 400L, APLICADA MANUALMENTE EM FACES INTERNAS DE PAREDES, ESPESSURA DE 10MM, COM EXECUÇÃO DE TALISCAS. AF_06/2014","M2",174.2,null,null,null,""]
[2,2,2,7,3,11,0,0,0,19,7,"F","Nível 2","Nível 2","3.11.","SINAPI",null,"REVESTIMENTO DE PISO","-",null,null,null,null,""]
[3,3,3,2,3,11,1,0,0,6,2,"F","Nível 3","Nível 3","3.11.1.","SINAPI",null,"CONCRETO","-",null,null,null,null,""]
["S",3,"S",0,3,11,1,0,0,0,0,"F","Serviço","Serviço","3.11.1.0.1.","SINAPI",94992,"EXECUÇÃO DE PASSEIO (CALÇADA) OU PISO DE CONCRETO COM CONCRETO MOLDADO IN LOCO, FEITO EM OBRA, ACABAMENTO CONVENCIONAL, ESPESSURA 6 CM, ARMADO. AF_07/2016","M2",219.1,null,null,null,""]
[3,3,3,2,3,11,2,0,0,4,2,"F","Nível 3","Nível 3","3.11.2.","SINAPI",null,"LAMINADO","-",null,null,null,null,""]
["S",3,"S",0,3,11,2,0,0,0,0,"F","Serviço","Serviço","3.11.2.0.1.","AGETOP",220061,"PISO LAMINADO COM CONCRETO USINADO 20MPA E=7 CM  ","m2    ",174.2,null,null,null,""]
[3,3,3,2,3,11,3,0,0,2,9,"F","Nível 3","Nível 3","3.11.3.","SINAPI",null,"PASSEIO (CALÇADA)","-",null,null,null,null,""]
["S",3,"S",0,3,11,3,0,0,0,0,"F","Serviço","Serviço","3.11.3.0.1.","AGETOP",220100,"PASSEIO PROTECAO EM CONC.DESEMPEN.5 CM 1:2,5:3,5 ( INCLUSO ESPELHO DE 30CM/ESCAVAÇÃO/REATERRO/APILOAMENTO/ATERRO INTERNO)","m2    ",72,null,null,null,""]
[2,2,2,9,3,12,0,0,0,12,9,"F","Nível 2","Nível 2","3.12.","SINAPI",null,"PINTURA","-",null,null,null,null,""]
[3,3,3,2,3,12,1,0,0,8,2,"F","Nível 3","Nível 3","3.12.1.","SINAPI",null,"ESMALTE SINTÉTICO","-",null,null,null,null,""]
["S",3,"S",0,3,12,1,0,0,0,0,"F","Serviço","Serviço","3.12.1.0.1.","AGETOP",261550,"PINT.ESMALTE SINT.PAREDES - 2 DEM.C/SELADOR","m2    ",219.1,null,null,null,""]
[3,3,3,2,3,12,2,0,0,6,2,"F","Nível 3","Nível 3","3.12.2.","SINAPI",null,"LÁTEX ACRÍLICA","-",null,null,null,null,""]
["S",3,"S",0,3,12,2,0,0,0,0,"F","Serviço","Serviço","3.12.2.0.1.","SINAPI",88489,"APLICAÇÃO MANUAL DE PINTURA COM TINTA LÁTEX ACRÍLICA EM PAREDES, DUAS DEMÃOS. AF_06/2014","M2",174.2,null,null,null,"Referência: AGETOP - 261001"]
[3,3,3,2,3,12,3,0,0,4,2,"F","Nível 3","Nível 3","3.12.3.","SINAPI",null,"QUADRA DE ESPORTES","-",null,null,null,null,""]
["S",3,"S",0,3,12,3,0,0,0,0,"F","Serviço","Serviço","3.12.3.0.1.","SINAPI",41595,"PINTURA ACRILICA DE FAIXAS DE DEMARCACAO EM QUADRA POLIESPORTIVA, 5 CM DE LARGURA","M",72,null,null,null,"Referência: AGETOP - 261700"]
[3,3,3,2,3,12,4,0,0,2,{"$error":"#N/A"},"F","Nível 3","Nível 3","3.12.4.","SINAPI",null,"ESTRUTURA METÁLICA","-",null,null,null,null,""]
["S",3,"S",0,3,12,4,0,0,0,0,"F","Serviço","Serviço","3.12.4.0.1.","AGETOP",261609,"PINTURA ESMALTE ALQUIDICO ESTR.METALICA 2 DEMAOS","m2    ",478.51,null,null,null,""]
[2,2,2,3,3,13,0,0,0,3,{"$error":"#N/A"},"F","Nível 2","Nível 2","3.13.","SINAPI",null,"DIVERSOS","-",null,null,null,null,""]
[{"$f":"CHOOSE(1+LOG(1+2*(ORÇAMENTO.Nivel=\"Nível 1\")+4*(ORÇAMENTO.Nivel=\"Nível 2\")+8*(ORÇAMENTO.Nivel=\"Nível 3\")+16*(ORÇAMENTO.Nivel=\"Nível 4\")+32*(ORÇAMENTO.Nivel=\"Serviço\"),2),0,1,2,3,4,\"S\")","v":"S"},2,"S",0,3,13,0,0,{"$f":"IF(AND($C301<=4,$C301<>0),0,IF(AND($C301=\"S\",$W301>0),OFFSET(I301,-1,0)+1,OFFSET(I301,-1,0)))","v":0},0,0,"F","Serviço","Serviço","3.13.0.0.1.","SINAPI","74244/1","ALAMBRADO PARA QUADRA POLIESPORTIVA, ESTRUTURADO POR TUBOS DE ACO GALVANIZADO, COM COSTURA, DIN 2440, DIAMETRO 2\", COM TELA DE ARAME GALVANIZADO, FIO 14 BWG E MALHA QUADRADA 5X5CM","M2",109.6,null,null,null,"Referência: AGETOP - 270621"]
["S",2,"S",0,3,13,0,0,0,0,0,"F","Serviço","Serviço","3.13.0.0.2.","AGETOP",271103,"CONJUNTO PARA VOLEIBOL EM FERRO GALVANIZADO COM PINTURA (2 SUPORTES)","CJ    ",1,null,null,null,""]
[-1,null,-1,null,0,0,0,0,0,null,null,"F"]
[null,null,null,null,null,null,null,null,null,null,null,"F",null,null,null,null,null,"OBS: OS QUANTITATIVOS DE MATERIAIS  DAS INSTALAÇÕES HIDROSSANITÁRIAS, ELÉTRICAS E ESPECIAIS SÃO FORNECIDOS PELOS PROFISSIONAIS RESPONSÁVEIS PELOS RESPECTIVOS PROJETOS.",null,null,"VALOR TOTAL",null,384166.84999999992]
[null,null,null,null,null,null,null,null,null,null,null,"F",null,null,null,null,null,null,null,null,"VALOR BDI (26,40%)",null,101437.23]
[null,null,null,null,null,null,null,null,null,null,null,"F",null,null,null,null,null,null,null,null,"TOTAL ORÇAMENTO",null,485604.0799999999]
[null,null,null,null,null,null,null,null,null,null,null,"F"]
[null,null,null,null,null,null,null,null,null,null,null,"F",null,null,null,null,null,null,null,null,"CUSTO POR M2 ³",null,431.88992947161518]
[null,null,null,null,null,null,null,null,null,null,null,"F",null,null,null,null,null,null,null,null,"MATERIAL S/ BDI",null,251714.99]
[null,null,null,null,null,null,null,null,null,null,null,"F",null,null,null,null,null,null,null,null,"MÃO DE OBRA S/ BDI",null,132451.85999999993]
[null,null,null,null,null,null,null,null,null,null,null,"F"]
[null,null,null,null,null,null,null,null,null,null,null,"F",null,null,null,null,"(1) Conforme previsto pelo DECRETO Nº 7.983, DE 8 DE ABRIL DE 2013, os preços adotados são aqueles constantes dos sistemas de referência indicados. Justifica-se o uso dos preços destas composições de custos unitários devido ao seu valor ser menor à mediana de seus correspondentes na tabela SINAPI;"]
[null,null,null,null,null,null,null,null,null,null,null,"F",null,null,null,null,"(2) Optou-se pelo uso das composições de custos da AGETOP para itens não presentes na SINAPI;"]
[null,null,null,null,null,null,null,null,null,null,null,"F",null,null,null,null,"(3) Para itens da AGETOP, os vidros não estão inclusos nas esquadrias e já foram considerados os custos de contramarco para as esquadrias de alumínio;"]
[null,null,null,null,null,null,null,null,null,null,null,"F",null,null,null,null,"(4) Nos casos em que houver execução de granitina e omissão do item AGETOP 221102, considerou-se que o quantitativo para o rodapé, de altura igual a 7cm, foi incorporado na área de piso;"]
[null,null,null,null,null,null,null,null,null,null,null,"F",null,null,null,null,"(5) O custo unitário aproximado por metro quadrado é calculado dividindo-se o valor total do orçamento pela área total de construção."]
[null,null,null,null,null,null,null,null,null,null,null,"F"]
[null,null,null,null,null,null,null,null,null,null,null,"F"]
[]
[null,null,null,null,null,null,null,null,null,null,null,null,null,null,"SOMATÓRIO DE SERVIÇOS"]
[null,null,null,null,null,null,null,null,null,null,null,null,null,null,"ITEM","DESCRIÇÃO DOS SERVIÇOS",null,null,"PREÇO SEM BDI",null,null,"PREÇO COM BDI",null,"PARTICIPAÇÃO ( % )"]
[null,null,null,null,null,null,null,null,null,null,null,null,null,null,"a.","SERVIÇOS PRELIMINARES",null,null,{"$f":"SUMIF($R$19:$R$303,$P322,$W$19:$W$303)","v":0},null,null,{"$f":"ROUND(S322*(1+BDI.Taxa),2)","v":0},null,{"$f":"IFERROR(ROUND($V322*100/$W$306,2),0)","v":0}]
[null,null,null,null,null,null,null,null,null,null,null,null,null,null,"b.","TRANSPORTES",null,null,0,null,null,0,null,{"$f":"IFERROR(ROUND($V323*100/$W$306,2),0)","v":0}]
[null,null,null,null,null,null,null,null,null,null,null,null,null,null,"c.","SERVIÇO EM TERRA",null,null,0,null,null,0,null,0]
[null,null,null,null,null,null,null,null,null,null,null,null,null,null,"d.","FUNDAÇÕES E SONDAGENS",null,null,0,null,null,0,null,0]
[null,null,null,null,null,null,null,null,null,null,null,null,null,null,"e.","ESTRUTURA",null,null,0,null,null,0,null,0]
[null,null,null,null,null,null,null,null,null,null,null,null,null,null,"f.","INSTALAÇÕES ELÉTRICAS",null,null,0,null,null,0,null,0]
[null,null,null,null,null,null,null,null,null,null,null,null,null,null,"g.","INSTALAÇÕES HIDROSSANITÁRIAS",null,null,0,null,null,0,null,0]
[null,null,null,null,null,null,null,null,null,null,null,null,null,null,"h","INSTALAÇÕES ESPECIAIS",null,null,0,null,null,0,null,0]
[null,null,null,null,null,null,null,null,null,null,null,null,null,null,"i.","ALVENARIAS E DIVISÓRIAS",null,null,0,null,null,0,null,0]
[null,null,null,null,null,null,null,null,null,null,null,null,null,null,"j.","ALVENARIA AUTO-PORTANTE",null,null,0,null,null,0,null,0]
[null,null,null,null,null,null,null,null,null,null,null,null,null,null,"k.","IMPERMEABILIZAÇÃO",null,null,0,null,null,0,null,0]
[null,null,null,null,null,null,null,null,null,null,null,null,null,null,"l.","ISOLAMENTO TÉRMICO E ACÚSTICO",null,null,0,null,null,0,null,0]
[null,null,null,null,null,null,null,null,null,null,null,null,null,null,"m.","ESTRUTURA DE MADEIRA",null,null,0,null,null,0,null,0]
[null,null,null,null,null,null,null,null,null,null,null,null,null,null,"n.","ESTRUTURAS METÁLICAS",null,null,0,null,null,0,null,0]
[null,null,null,null,null,null,null,null,null,null,null,null,null,null,"o.","COBERTURAS",null,null,0,null,null,0,null,0]
[null,null,null,null,null,null,null,null,null,null,null,null,null,null,"p.","ESQUADRIAS DE MADEIRA",null,null,0,null,null,0,null,0]
[null,null,null,null,null,null,null,null,null,null,null,null,null,null,"q.","ESQUADRIAS METÁLICAS",null,null,0,null,null,{"$f":"ROUND(S338*(1+BDI.Taxa),2)","v":0},null,0]
[null,null,null,null,null,null,null,null,null,null,null,null,null,null,"r.","VIDROS",null,null,0,null,null,0,null,0]
[null,null,null,null,null,null,null,null,null,null,null,null,null,null,"s.","REVESTIMENTO DE PAREDE",null,null,0,null,null,0,null,0]
[null,null,null,null,null,null,null,null,null,null,null,null,null,null,"t.","FORROS",null,null,0,null,null,0,null,0]
[null,null,null,null,null,null,null,null,null,null,null,null,null,null,"u.","REVESTIMENTO DE PISO",null,null,0,null,null,0,null,0]
[null,null,null,null,null,null,null,null,null,null,null,null,null,null,"v.","FERRAGENS",null,null,0,null,null,0,null,0]
[null,null,null,null,null,null,null,null,null,null,null,null,null,null,"w.","MARCENARIA",null,null,0,null,null,0,null,0]
[null,null,null,null,null,null,null,null,null,null,null,null,null,null,"x.","ADMINISTRAÇÃO",null,null,0,null,null,0,null,0]
[null,null,null,null,null,null,null,null,null,null,null,null,null,null,"y.","PINTURA",null,null,0,null,null,{"$f":"ROUND(S346*(1+BDI.Taxa),2)","v":0},null,0]
[null,null,null,null,null,null,null,null,null,null,null,null,null,null,"z.","DIVERSOS",null,null,0,null,null,{"$f":"IF(S347>0,IF((SUM(V322:W346)+ROUND(S347*(1+BDI.Taxa),2))<>V349,V349-SUM(V322:W346),ROUND(S347*(1+BDI.Taxa),2)),0)","v":0},null,{"$f":"IF(S347>0,IF((SUM(X322:X346)+IFERROR(ROUND($V347*100/$W$306,2),0))<>X349,X349-SUM(X322:X346),IFERROR(ROUND($V347*100/$W$306,2),0)),0)","v":0}]
[null,null,null,null,null,null,null,null,null,null,null,null,null,null,"TOTAL GERAL DO ORÇAMENTO (R$)",null,null,null,{"$f":"SUM(S322:U347)","v":0},null,null,{"$f":"SUM(V322:W347)","v":0},null,{"$f":"SUM(X322:X347)","v":0}]
[null,null,null,null,null,null,null,null,null,null,null,null,null,null,null,null,null,null,{"$f":"$W$304","v":384166.84999999992},null,null,{"$f":"$W$306","v":485604.0799999999},null,100]
[null,null,null,null,null,null,null,null,null,null,null,null,null,null,null,null,null,null,"(TOTAL SEM BDI)",null,null,"(TOTAL COM BDI)",null,"(ARRED porcentagem)"]
[null,null,null,null,null,null,null,null,null,null,null,null,null,null,null,null,null,null,{"$f":"IF(AND(S348=S349,S348>0),\"OK\",\"ERRO\")","v":"ERRO"},null,null,{"$f":"IF(AND(V348=V349,V348>0),\"OK\",\"ERRO\")","v":"ERRO"},null,{"$f":"IF(X348=100,\"OK\",\"ERRO\")","v":"ERRO"}]
[]
[]
[null,null,null,null,null,null,null,null,null,null,null,null,null,null,"RESUMO GERAL DO ORÇAMENTO"]
[null,null,null,null,null,null,null,null,null,null,null,null,null,null,"ITEM","DESCRIÇÃO DOS SERVIÇOS",null,null,"PREÇO SEM BDI",null,null,"PREÇO COM BDI",null,"PARTICIPAÇÃO ( % )"]
[null,null,null,null,null,null,null,null,null,null,null,null,null,null,"1.",{"$f":"IFERROR(VLOOKUP(O356,$O$19:$W$303,4,FALSE),\"\")","v":"REFORMA"},null,null,{"$f":"IF(P357=\"\",$S$377-SUM(OFFSET($S$355:S355,0,0,COUNTA($S$355:S355),1)),SUMIF($R$19:$R$303,$P356,$W$19:$W$303))","v":0},null,null,{"$f":"IF(P357=\"\",$V$377-SUM(OFFSET($V$355:V355,0,0,COUNTA($V$355:V355),1)),ROUND(S356*(1+BDI.Taxa),2))","v":0},null,{"$f":"IF(P357=\"\",$X$377-SUM(OFFSET($X$355:X355,0,0,COUNTA($X$355:X355),1)),ROUND(V356*100/ORÇAMENTO.TotalOrçamento,2))","v":0}]
[null,null,null,null,null,null,null,null,null,null,null,null,null,null,"2.","IMPLANTAÇÃO",null,null,{"$f":"IF(P358=\"\",$S$377-SUM(OFFSET($S$355:S356,0,0,COUNTA($S$355:S356),1)),SUMIF($R$19:$R$303,$P357,$W$19:$W$303))","v":0},null,null,{"$f":"IF(P358=\"\",$V$377-SUM(OFFSET($V$355:V356,0,0,COUNTA($V$355:V356),1)),ROUND(S357*(1+BDI.Taxa),2))","v":0},null,{"$f":"IF(P358=\"\",$X$377-SUM(OFFSET($X$355:X356,0,0,COUNTA($X$355:X356),1)),ROUND(V357*100/ORÇAMENTO.TotalOrçamento,2))","v":0}]
[null,null,null,null,null,null,null,null,null,null,null,null,null,null,"3.","QUADRA EM ARCO MODELO 01 SEDUC",null,null,{"$f":"IF(P359=\"\",$S$377-SUM(OFFSET($S$355:S357,0,0,COUNTA($S$355:S357),1)),SUMIF($R$19:$R$303,$P358,$W$19:$W$303))","v":384166.84999999992},null,null,{"$f":"IF(P359=\"\",$V$377-SUM(OFFSET($V$355:V357,0,0,COUNTA($V$355:V357),1)),ROUND(S358*(1+BDI.Taxa),2))","v":485604.0799999999},null,{"$f":"IF(P359=\"\",$X$377-SUM(OFFSET($X$355:X357,0,0,COUNTA($X$355:X357),1)),ROUND(V358*100/ORÇAMENTO.TotalOrçamento,2))","v":100}]
[null,null,null,null,null,null,null,null,null,null,null,null,null,null,"4.","",null,null,{"$f":"IF(P360=\"\",$S$377-SUM(OFFSET($S$355:S358,0,0,COUNTA($S$355:S358),1)),SUMIF($R$19:$R$303,$P359,$W$19:$W$303))","v":0},null,null,{"$f":"IF(P360=\"\",$V$377-SUM(OFFSET($V$355:V358,0,0,COUNTA($V$355:V358),1)),ROUND(S359*(1+BDI.Taxa),2))","v":0},null,{"$f":"IF(P360=\"\",$X$377-SUM(OFFSET($X$355:X358,0,0,COUNTA($X$355:X358),1)),ROUND(V359*100/ORÇAMENTO.TotalOrçamento,2))","v":0}]
[null,null,null,null,null,null,null,null,null,null,null,null,null,null,"5.","",null,null,{"$f":"IF(P361=\"\",$S$377-SUM(OFFSET($S$355:S359,0,0,COUNTA($S$355:S359),1)),SUMIF($R$19:$R$303,$P360,$W$19:$W$303))","v":0},null,null,{"$f":"IF(P361=\"\",$V$377-SUM(OFFSET($V$355:V359,0,0,COUNTA($V$355:V359),1)),ROUND(S360*(1+BDI.Taxa),2))","v":0},null,{"$f":"IF(P361=\"\",$X$377-SUM(OFFSET($X$355:X359,0,0,COUNTA($X$355:X359),1)),ROUND(V360*100/ORÇAMENTO.TotalOrçamento,2))","v":0}]
[null,null,null,null,null,null,null,null,null,null,null,null,null,null,"6.","",null,null,{"$f":"IF(P362=\"\",$S$377-SUM(OFFSET($S$355:S360,0,0,COUNTA($S$355:S360),1)),SUMIF($R$19:$R$303,$P361,$W$19:$W$303))","v":0},null,null,{"$f":"IF(P362=\"\",$V$377-SUM(OFFSET($V$355:V360,0,0,COUNTA($V$355:V360),1)),ROUND(S361*(1+BDI.Taxa),2))","v":0},null,{"$f":"IF(P362=\"\",$X$377-SUM(OFFSET($X$355:X360,0,0,COUNTA($X$355:X360),1)),ROUND(V361*100/ORÇAMENTO.TotalOrçamento,2))","v":0}]
[null,null,null,null,null,null,null,null,null,null,null,null,null,null,"7.","",null,null,{"$f":"IF(P363=\"\",$S$377-SUM(OFFSET($S$355:S361,0,0,COUNTA($S$355:S361),1)),SUMIF($R$19:$R$303,$P362,$W$19:$W$303))","v":0},null,null,{"$f":"IF(P363=\"\",$V$377-SUM(OFFSET($V$355:V361,0,0,COUNTA($V$355:V361),1)),ROUND(S362*(1+BDI.Taxa),2))","v":0},null,{"$f":"IF(P363=\"\",$X$377-SUM(OFFSET($X$355:X361,0,0,COUNTA($X$355:X361),1)),ROUND(V362*100/ORÇAMENTO.TotalOrçamento,2))","v":0}]
[null,null,null,null,null,null,null,null,null,null,null,null,null,null,"8.","",null,null,{"$f":"IF(P364=\"\",$S$377-SUM(OFFSET($S$355:S362,0,0,COUNTA($S$355:S362),1)),SUMIF($R$19:$R$303,$P363,$W$19:$W$303))","v":0},null,null,{"$f":"IF(P364=\"\",$V$377-SUM(OFFSET($V$355:V362,0,0,COUNTA($V$355:V362),1)),ROUND(S363*(1+BDI.Taxa),2))","v":0},null,{"$f":"IF(P364=\"\",$X$377-SUM(OFFSET($X$355:X362,0,0,COUNTA($X$355:X362),1)),ROUND(V363*100/ORÇAMENTO.TotalOrçamento,2))","v":0}]
[null,null,null,null,null,null,null,null,null,null,null,null,null,null,"9.","",null,null,{"$f":"IF(P365=\"\",$S$377-SUM(OFFSET($S$355:S363,0,0,COUNTA($S$355:S363),1)),SUMIF($R$19:$R$303,$P364,$W$19:$W$303))","v":0},null,null,{"$f":"IF(P365=\"\",$V$377-SUM(OFFSET($V$355:V363,0,0,COUNTA($V$355:V363),1)),ROUND(S364*(1+BDI.Taxa),2))","v":0},null,{"$f":"IF(P365=\"\",$X$377-SUM(OFFSET($X$355:X363,0,0,COUNTA($X$355:X363),1)),ROUND(V364*100/ORÇAMENTO.TotalOrçamento,2))","v":0}]
[null,null,null,null,null,null,null,null,null,null,null,null,null,null,"10.","",null,null,{"$f":"IF(P366=\"\",$S$377-SUM(OFFSET($S$355:S364,0,0,COUNTA($S$355:S364),1)),SUMIF($R$19:$R$303,$P365,$W$19:$W$303))","v":0},null,null,{"$f":"IF(P366=\"\",$V$377-SUM(OFFSET($V$355:V364,0,0,COUNTA($V$355:V364),1)),ROUND(S365*(1+BDI.Taxa),2))","v":0},null,{"$f":"IF(P366=\"\",$X$377-SUM(OFFSET($X$355:X364,0,0,COUNTA($X$355:X364),1)),ROUND(V365*100/ORÇAMENTO.TotalOrçamento,2))","v":0}]
[null,null,null,null,null,null,null,null,null,null,null,null,null,null,"11.","",null,null,{"$f":"IF(P367=\"\",$S$377-SUM(OFFSET($S$355:S365,0,0,COUNTA($S$355:S365),1)),SUMIF($R$19:$R$303,$P366,$W$19:$W$303))","v":0},null,null,{"$f":"IF(P367=\"\",$V$377-SUM(OFFSET($V$355:V365,0,0,COUNTA($V$355:V365),1)),ROUND(S366*(1+BDI.Taxa),2))","v":0},null,{"$f":"IF(P367=\"\",$X$377-SUM(OFFSET($X$355:X365,0,0,COUNTA($X$355:X365),1)),ROUND(V366*100/ORÇAMENTO.TotalOrçamento,2))","v":0}]
[null,null,null,null,null,null,null,null,null,null,null,null,null,null,"12.","",null,null,{"$f":"IF(P368=\"\",$S$377-SUM(OFFSET($S$355:S366,0,0,COUNTA($S$355:S366),1)),SUMIF($R$19:$R$303,$P367,$W$19:$W$303))","v":0},null,null,{"$f":"IF(P368=\"\",$V$377-SUM(OFFSET($V$355:V366,0,0,COUNTA($V$355:V366),1)),ROUND(S367*(1+BDI.Taxa),2))","v":0},null,{"$f":"IF(P368=\"\",$X$377-SUM(OFFSET($X$355:X366,0,0,COUNTA($X$355:X366),1)),ROUND(V367*100/ORÇAMENTO.TotalOrçamento,2))","v":0}]
[null,null,null,null,null,null,null,null,null,null,null,null,null,null,"13.","",null,null,{"$f":"IF(P369=\"\",$S$377-SUM(OFFSET($S$355:S367,0,0,COUNTA($S$355:S367),1)),SUMIF($R$19:$R$303,$P368,$W$19:$W$303))","v":0},null,null,{"$f":"IF(P369=\"\",$V$377-SUM(OFFSET($V$355:V367,0,0,COUNTA($V$355:V367),1)),ROUND(S368*(1+BDI.Taxa),2))","v":0},null,{"$f":"IF(P369=\"\",$X$377-SUM(OFFSET($X$355:X367,0,0,COUNTA($X$355:X367),1)),ROUND(V368*100/ORÇAMENTO.TotalOrçamento,2))","v":0}]
[null,null,null,null,null,null,null,null,null,null,null,null,null,null,"14.","",null,null,{"$f":"IF(P370=\"\",$S$377-SUM(OFFSET($S$355:S368,0,0,COUNTA($S$355:S368),1)),SUMIF($R$19:$R$303,$P369,$W$19:$W$303))","v":0},null,null,{"$f":"IF(P370=\"\",$V$377-SUM(OFFSET($V$355:V368,0,0,COUNTA($V$355:V368),1)),ROUND(S369*(1+BDI.Taxa),2))","v":0},null,{"$f":"IF(P370=\"\",$X$377-SUM(OFFSET($X$355:X368,0,0,COUNTA($X$355:X368),1)),ROUND(V369*100/ORÇAMENTO.TotalOrçamento,2))","v":0}]
[null,null,null,null,null,null,null,null,null,null,null,null,null,null,"15.","",null,null,{"$f":"IF(P371=\"\",$S$377-SUM(OFFSET($S$355:S369,0,0,COUNTA($S$355:S369),1)),SUMIF($R$19:$R$303,$P370,$W$19:$W$303))","v":0},null,null,{"$f":"IF(P371=\"\",$V$377-SUM(OFFSET($V$355:V369,0,0,COUNTA($V$355:V369),1)),ROUND(S370*(1+BDI.Taxa),2))","v":0},null,{"$f":"IF(P371=\"\",$X$377-SUM(OFFSET($X$355:X369,0,0,COUNTA($X$355:X369),1)),ROUND(V370*100/ORÇAMENTO.TotalOrçamento,2))","v":0}]
[null,null,null,null,null,null,null,null,null,null,null,null,null,null,"16.","",null,null,{"$f":"IF(P372=\"\",$S$377-SUM(OFFSET($S$355:S370,0,0,COUNTA($S$355:S370),1)),SUMIF($R$19:$R$303,$P371,$W$19:$W$303))","v":0},null,null,{"$f":"IF(P372=\"\",$V$377-SUM(OFFSET($V$355:V370,0,0,COUNTA($V$355:V370),1)),ROUND(S371*(1+BDI.Taxa),2))","v":0},null,{"$f":"IF(P372=\"\",$X$377-SUM(OFFSET($X$355:X370,0,0,COUNTA($X$355:X370),1)),ROUND(V371*100/ORÇAMENTO.TotalOrçamento,2))","v":0}]
[null,null,null,null,null,null,null,null,null,null,null,null,null,null,"17.","",null,null,{"$f":"IF(P373=\"\",$S$377-SUM(OFFSET($S$355:S371,0,0,COUNTA($S$355:S371),1)),SUMIF($R$19:$R$303,$P372,$W$19:$W$303))","v":0},null,null,{"$f":"IF(P373=\"\",$V$377-SUM(OFFSET($V$355:V371,0,0,COUNTA($V$355:V371),1)),ROUND(S372*(1+BDI.Taxa),2))","v":0},null,{"$f":"IF(P373=\"\",$X$377-SUM(OFFSET($X$355:X371,0,0,COUNTA($X$355:X371),1)),ROUND(V372*100/ORÇAMENTO.TotalOrçamento,2))","v":0}]
[null,null,null,null,null,null,null,null,null,null,null,null,null,null,"18.","",null,null,{"$f":"IF(P374=\"\",$S$377-SUM(OFFSET($S$355:S372,0,0,COUNTA($S$355:S372),1)),SUMIF($R$19:$R$303,$P373,$W$19:$W$303))","v":0},null,null,{"$f":"IF(P374=\"\",$V$377-SUM(OFFSET($V$355:V372,0,0,COUNTA($V$355:V372),1)),ROUND(S373*(1+BDI.Taxa),2))","v":0},null,{"$f":"IF(P374=\"\",$X$377-SUM(OFFSET($X$355:X372,0,0,COUNTA($X$355:X372),1)),ROUND(V373*100/ORÇAMENTO.TotalOrçamento,2))","v":0}]
[null,null,null,null,null,null,null,null,null,null,null,null,null,null,"19.","",null,null,{"$f":"IF(P375=\"\",$S$377-SUM(OFFSET($S$355:S373,0,0,COUNTA($S$355:S373),1)),SUMIF($R$19:$R$303,$P374,$W$19:$W$303))","v":0},null,null,{"$f":"IF(P375=\"\",$V$377-SUM(OFFSET($V$355:V373,0,0,COUNTA($V$355:V373),1)),ROUND(S374*(1+BDI.Taxa),2))","v":0},null,{"$f":"IF(P375=\"\",$X$377-SUM(OFFSET($X$355:X373,0,0,COUNTA($X$355:X373),1)),ROUND(V374*100/ORÇAMENTO.TotalOrçamento,2))","v":0}]
[null,null,null,null,null,null,null,null,null,null,null,null,null,null,"20.","",null,null,{"$f":"IF(P376=\"\",$S$377-SUM(OFFSET($S$355:S374,0,0,COUNTA($S$355:S374),1)),SUMIF($R$19:$R$303,$P375,$W$19:$W$303))","v":0},null,null,{"$f":"IF(P376=\"\",$V$377-SUM(OFFSET($V$355:V374,0,0,COUNTA($V$355:V374),1)),ROUND(S375*(1+BDI.Taxa),2))","v":0},null,{"$f":"IF(P376=\"\",$X$377-SUM(OFFSET($X$355:X374,0,0,COUNTA($X$355:X374),1)),ROUND(V375*100/ORÇAMENTO.TotalOrçamento,2))","v":0}]
[null,null,null,null,null,null,null,null,null,null,null,null,null,null,"TOTAL GERAL DO ORÇAMENTO (R$)",null,null,null,{"$f":"SUM(S356:U375)","v":384166.84999999992},null,null,{"$f":"SUM(V356:W375)","v":485604.0799999999},null,{"$f":"SUM(X356:X375)","v":100}]
[null,null,null,null,null,null,null,null,null,null,null,null,null,null,null,null,null,null,{"$f":"$W$304","v":384166.84999999992},null,null,{"$f":"$W$306","v":485604.0799999999},null,100]
[null,null,null,null,null,null,null,null,null,null,null,null,null,null,null,null,null,null,"(TOTAL SEM BDI)",null,null,"(TOTAL COM BDI)",null,"(ARRED porcentagem)"]
[null,null,null,null,null,null,null,null,null,null,null,null,null,null,null,null,null,null,{"$f":"IF(AND(S376=S377,S376>0),\"OK\",\"ERRO\")","v":"OK"},null,null,{"$f":"IF(AND(V376=V377,V376>0),\"OK\",\"ERRO\")","v":"OK"},null,{"$f":"IF(AND(X376=100,S356<>0),\"OK\",\"ERRO\")","v":"ERRO"}]

{"sheet":"Resumo ","index":1,"n_rows":22,"n_cols":9,"rows_kept":22,"cut":false,"hidden":false,"merged":[[25,3,25,7],[11,1,11,2],[12,1,12,2],[15,2,15,3],[16,2,16,3],[14,1,14,8],[17,2,17,3],[18,2,18,3],[24,3,24,7],[21,1,21,8],[8,6,8,8],[9,6,9,8],[13,1,13,8],[1,1,1,8],[2,6,2,8],[3,6,3,8],[4,1,4,8],[5,6,5,8],[13,0,14,0],[0,1,0,8],[19,1,19,5],[2,1,2,5],[3,1,3,5],[5,1,5,5],[6,1,6,5],[8,1,8,5],[9,1,9,5],[11,3,11,5],[12,3,12,5],[10,1,10,8],[11,6,11,8],[12,6,12,8],[6,6,6,8],[7,1,7,8]]}
[]
[]
[null,"UNIDADE ESCOLAR",null,null,null,null,"CÓDIGO INEP"]
[null,{"$f":"Orçamento!$O$4","v":"ESCOLA ESTADUAL EDMO TEIXEIRA"},null,null,null,null,{"$f":"Orçamento!V4","v":52027147}]
[]
[null,"OBRA",null,null,null,null,"CIDADE"]
[null,{"$f":"Orçamento!$O$7","v":"REFORMA E IMPLANTAÇÃO"},null,null,null,null,{"$f":"Orçamento!$V$7","v":"IPORÁ"}]
[]
[null,"ENDEREÇO",null,null,null,null,"CRE"]
[null,{"$f":"Orçamento!$R$10","v":"AV. CAIAPÓ 282, SAO FRANCISCO, CEP:76200-000"},null,null,null,null,{"$f":"Orçamento!$O$10","v":"IPORÁ"}]
[]
[null,"REFERÊNCIA",null,"DATA",null,null,"ÁREA TOTAL CONSTRUÍDA (M²)"]
[null,{"$f":"CONCATENATE(\"AGETOP E SINAPI - \",Orçamento!$W$10)","v":"AGETOP E SINAPI - DESONERADA"},null,{"$f":"Orçamento!$S$7","v":"2020-04-23"},null,null,{"$f":"Orçamento!$S$13","v":1124.3699999999999}]
["FILTRO"]
[null,"RESUMO GERAL DO ORÇAMENTO"]
["↓","ITEM","DESCRIÇÃO DOS SERVIÇOS",null,"UNID","QUANT","PREÇO SEM BDI","PREÇO COM BDI","PARTICIP. (%)"]
[{"$f":"IF(E17>0,\"F\",\"\")","v":"F"},"1.",{"$f":"Orçamento!$P356","v":"REFORMA"},null,"UN ",1,{"$f":"IFERROR(Orçamento!S356,\"-\")","v":0},{"$f":"IFERROR(Orçamento!V356,\"\")","v":0},{"$f":"Orçamento!X356","v":0}]
[{"$f":"IF(E18>0,\"F\",\"\")","v":"F"},"2.",{"$f":"Orçamento!$P357","v":"IMPLANTAÇÃO"},null,"UN ",1,{"$f":"IFERROR(Orçamento!S357,\"-\")","v":0},{"$f":"IFERROR(Orçamento!V357,\"\")","v":0},{"$f":"Orçamento!X357","v":0}]
["F","3.",{"$f":"Orçamento!$P358","v":"QUADRA EM ARCO MODELO 01 SEDUC"},null,"UN ",1,{"$f":"IFERROR(Orçamento!S358,\"-\")","v":384166.84999999992},{"$f":"IFERROR(Orçamento!V358,\"\")","v":485604.0799999999},{"$f":"Orçamento!X358","v":100}]
["F","TOTAL GERAL DO ORÇAMENTO (R$)",null,null,null,null,{"$f":"SUM(G17:G19)","v":384166.84999999992},{"$f":"SUM(H17:H19)","v":485604.0799999999},{"$f":"SUM(I17:I19)","v":100}]
["F"]
["F"]

{"sheet":"Somatório","index":2,"n_rows":45,"n_cols":6,"rows_kept":45,"cut":false,"hidden":false,"merged":[[0,1,0,5],[14,1,14,5],[2,1,2,3],[2,4,2,5],[3,1,3,3],[3,4,3,5],[5,1,5,3],[5,4,5,5],[6,1,6,3],[6,4,6,5],[8,1,8,3],[8,4,8,5],[1,1,1,5],[4,1,4,5],[7,1,7,5],[10,1,10,5],[9,1,9,3],[9,4,9,5],[11,1,11,2],[11,4,11,5],[12,1,12,2],[12,4,12,5],[13,0,14,0],[42,1,42,2],[44,1,44,5],[47,3,47,5],[48,3,48,5],[13,1,13,5]]}
[]
[]
[null,"UNIDADE ESCOLAR",null,null,"CÓDIGO INEP"]
[null,{"$f":"Orçamento!$O$4","v":"ESCOLA ESTADUAL EDMO TEIXEIRA"},null,null,{"$f":"Orçamento!V4","v":52027147}]
[]
[null,"OBRA",null,null,"CIDADE"]
[null,{"$f":"Orçamento!$O$7","v":"REFORMA E IMPLANTAÇÃO"},null,null,{"$f":"Orçamento!$V$7","v":"IPORÁ"}]
[]
[null,"ENDEREÇO",null,null,"CRE"]
[null,{"$f":"Orçamento!$R$10","v":"AV. CAIAPÓ 282, SAO FRANCISCO, CEP:76200-000"},null,null,{"$f":"Orçamento!$O$10","v":"IPORÁ"}]
[]
[null,"REFERÊNCIA",null,"DATA","ÁREA TOTAL CONSTRUÍDA (M²)"]
[null,{"$f":"CONCATENATE(\"AGETOP E SINAPI - \",Orçamento!$W$10)","v":"AGETOP E SINAPI - DESONERADA"},null,{"$f":"Orçamento!$S$7","v":"2020-04-23"},{"$f":"Orçamento!$S$13","v":1124.3699999999999}]
["FILTRO"]
[null,"SOMATÓRIO DE SERVIÇOS"]
["↓","ITEM","DESCRIÇÃO DOS SERVIÇOS","PREÇO SEM BDI (R$)","PREÇO COM BDI (R$)","PARTIC.  ( % )"]
[{"$f":"IF(D17>0,\"F\",\"\")","v":""},"a.",{"$f":"Orçamento!P322","v":"SERVIÇOS PRELIMINARES"},{"$f":"Orçamento!S322","v":0},{"$f":"Orçamento!V322","v":0},{"$f":"Orçamento!X322","v":0}]
[{"$f":"IF(D18>0,\"F\",\"\")","v":""},"b.",{"$f":"Orçamento!P323","v":"TRANSPORTES"},{"$f":"Orçamento!S323","v":0},{"$f":"Orçamento!V323","v":0},{"$f":"Orçamento!X323","v":0}]
["","c.",{"$f":"Orçamento!P324","v":"SERVIÇO EM TERRA"},{"$f":"Orçamento!S324","v":0},{"$f":"Orçamento!V324","v":0},{"$f":"Orçamento!X324","v":0}]
["","d.",{"$f":"Orçamento!P325","v":"FUNDAÇÕES E SONDAGENS"},{"$f":"Orçamento!S325","v":0},{"$f":"Orçamento!V325","v":0},{"$f":"Orçamento!X325","v":0}]
["","e.",{"$f":"Orçamento!P326","v":"ESTRUTURA"},{"$f":"Orçamento!S326","v":0},{"$f":"Orçamento!V326","v":0},{"$f":"Orçamento!X326","v":0}]
["","f.",{"$f":"Orçamento!P327","v":"INSTALAÇÕES ELÉTRICAS"},{"$f":"Orçamento!S327","v":0},{"$f":"Orçamento!V327","v":0},{"$f":"Orçamento!X327","v":0}]
["","g.",{"$f":"Orçamento!P328","v":"INSTALAÇÕES HIDROSSANITÁRIAS"},{"$f":"Orçamento!S328","v":0},{"$f":"Orçamento!V328","v":0},{"$f":"Orçamento!X328","v":0}]
["","h.",{"$f":"Orçamento!P329","v":"INSTALAÇÕES ESPECIAIS"},{"$f":"Orçamento!S329","v":0},{"$f":"Orçamento!V329","v":0},{"$f":"Orçamento!X329","v":0}]
["","i.",{"$f":"Orçamento!P330","v":"ALVENARIAS E DIVISÓRIAS"},{"$f":"Orçamento!S330","v":0},{"$f":"Orçamento!V330","v":0},{"$f":"Orçamento!X330","v":0}]
["","j.",{"$f":"Orçamento!P331","v":"ALVENARIA AUTO-PORTANTE"},{"$f":"Orçamento!S331","v":0},{"$f":"Orçamento!V331","v":0},{"$f":"Orçamento!X331","v":0}]
["","k.",{"$f":"Orçamento!P332","v":"IMPERMEABILIZAÇÃO"},{"$f":"Orçamento!S332","v":0},{"$f":"Orçamento!V332","v":0},{"$f":"Orçamento!X332","v":0}]
["","l.",{"$f":"Orçamento!P333","v":"ISOLAMENTO TÉRMICO E ACÚSTICO"},{"$f":"Orçamento!S333","v":0},{"$f":"Orçamento!V333","v":0},{"$f":"Orçamento!X333","v":0}]
["","m.",{"$f":"Orçamento!P334","v":"ESTRUTURA DE MADEIRA"},{"$f":"Orçamento!S334","v":0},{"$f":"Orçamento!V334","v":0},{"$f":"Orçamento!X334","v":0}]
["","n.",{"$f":"Orçamento!P335","v":"ESTRUTURAS METÁLICAS"},{"$f":"Orçamento!S335","v":0},{"$f":"Orçamento!V335","v":0},{"$f":"Orçamento!X335","v":0}]
["","o.",{"$f":"Orçamento!P336","v":"COBERTURAS"},{"$f":"Orçamento!S336","v":0},{"$f":"Orçamento!V336","v":0},{"$f":"Orçamento!X336","v":0}]
["","p.",{"$f":"Orçamento!P337","v":"ESQUADRIAS DE MADEIRA"},{"$f":"Orçamento!S337","v":0},{"$f":"Orçamento!V337","v":0},{"$f":"Orçamento!X337","v":0}]
["","q.",{"$f":"Orçamento!P338","v":"ESQUADRIAS METÁLICAS"},{"$f":"Orçamento!S338","v":0},{"$f":"Orçamento!V338","v":0},{"$f":"Orçamento!X338","v":0}]
["","r.",{"$f":"Orçamento!P339","v":"VIDROS"},{"$f":"Orçamento!S339","v":0},{"$f":"Orçamento!V339","v":0},{"$f":"Orçamento!X339","v":0}]
["","s.",{"$f":"Orçamento!P340","v":"REVESTIMENTO DE PAREDE"},{"$f":"Orçamento!S340","v":0},{"$f":"Orçamento!V340","v":0},{"$f":"Orçamento!X340","v":0}]
["","t.",{"$f":"Orçamento!P341","v":"FORROS"},{"$f":"Orçamento!S341","v":0},{"$f":"Orçamento!V341","v":0},{"$f":"Orçamento!X341","v":0}]
["","u.",{"$f":"Orçamento!P342","v":"REVESTIMENTO DE PISO"},{"$f":"Orçamento!S342","v":0},{"$f":"Orçamento!V342","v":0},{"$f":"Orçamento!X342","v":0}]
["","v.",{"$f":"Orçamento!P343","v":"FERRAGENS"},{"$f":"Orçamento!S343","v":0},{"$f":"Orçamento!V343","v":0},{"$f":"Orçamento!X343","v":0}]
["","w.",{"$f":"Orçamento!P344","v":"MARCENARIA"},{"$f":"Orçamento!S344","v":0},{"$f":"Orçamento!V344","v":0},{"$f":"Orçamento!X344","v":0}]
["","x.",{"$f":"Orçamento!P345","v":"ADMINISTRAÇÃO"},{"$f":"Orçamento!S345","v":0},{"$f":"Orçamento!V345","v":0},{"$f":"Orçamento!X345","v":0}]
["","y.",{"$f":"Orçamento!P346","v":"PINTURA"},{"$f":"Orçamento!S346","v":0},{"$f":"Orçamento!V346","v":0},{"$f":"Orçamento!X346","v":0}]
["","z.",{"$f":"Orçamento!P347","v":"DIVERSOS"},{"$f":"Orçamento!S347","v":0},{"$f":"Orçamento!V347","v":0},{"$f":"Orçamento!X347","v":0}]
["F","TOTAL GERAL DO ORÇAMENTO",null,{"$f":"SUM(D17:D42)","v":0},{"$f":"SUM(E17:E42)","v":0},{"$f":"SUM(F17:F42)","v":0}]
[]
[null,"(*) Para itens da AGETOP, os vidros não estão inclusos nas esquadrias e já foram considerados os custos de contramarco para as esquadrias de alumínio;"]

{"sheet":"Cronog_120_Dias","index":3,"n_rows":99,"n_cols":22,"rows_kept":99,"cut":false,"hidden":false,"merged":[[86,13,86,16],[88,13,88,16],[89,13,89,16],[91,13,91,16],[92,13,92,16],[93,13,93,16],[94,13,94,16],[95,13,95,16],[73,13,73,16],[74,13,74,16],[76,13,76,16],[77,13,77,16],[79,13,79,16],[80,13,80,16],[82,13,82,16],[83,13,83,16],[85,13,85,16],[59,13,59,16],[61,13,61,16],[62,13,62,16],[64,13,64,16],[65,13,65,16],[67,13,67,16],[68,13,68,16],[70,13,70,16],[71,13,71,16],[95,9,95,12],[12,13,12,16],[13,13,13,16],[14,13,14,16],[16,13,16,16],[17,13,17,16],[19,13,19,16],[20,13,20,16],[22,13,22,16],[23,13,23,16],[25,13,25,16],[26,13,26,16],[28,13,28,16],[29,13,29,16],[31,13,31,16],[32,13,32,16],[34,13,34,16],[35,13,35,16],[37,13,37,16],[38,13,38,16],[40,13,40,16],[41,13,41,16],[43,13,43,16],[44,13,44,16],[73,9,73,12],[74,9,74,12],[76,9,76,12],[77,9,77,12],[79,9,79,12],[80,9,80,12],[82,9,82,12],[83,9,83,12],[85,9,85,12],[59,9,59,12],[61,9,61,12],[62,9,62,12],[64,9,64,12],[65,9,65,12],[67,9,67,12],[68,9,68,12],[70,9,70,12],[71,9,71,12],[12,9,12,12],[13,9,13,12],[14,9,14,12],[16,9,16,12],[17,9,17,12],[19,9,19,12],[20,9,20,12],[22,9,22,12],[23,9,23,12],[10,1,10,21],[9,8,9,21],[8,8,8,21],[3,8,3,21],[6,8,6,21],[5,8,5,21],[3,1,3,7],[56,4,58,4],[29,3,31,3],[35,1,37,2],[35,4,37,4],[50,3,52,3],[53,3,55,3],[12,21,13,21],[13,1,13,2],[13,5,13,8],[13,17,13,20],[12,3,13,3],[12,17,12,20],[14,1,16,2],[12,5,12,8],[17,1,19,2],[17,4,19,4],[17,5,17,8],[56,1,58,2],[68,4,70,4],[44,3,46,3],[62,1,64,2],[62,4,64,4],[38,1,40,2],[38,4,40,4],[59,3,61,3],[44,1,46,2],[44,4,46,4],[53,1,55,2],[50,1,52,2],[50,4,52,4],[20,1,22,2],[20,4,22,4],[20,5,20,8],[20,17,20,20],[22,5,22,8],[22,17,22,20],[20,3,22,3],[83,3,85,3],[53,4,55,4],[59,1,61,2],[59,4,61,4],[74,1,76,2],[77,1,79,2],[77,4,79,4],[80,1,82,2],[65,1,67,2],[68,3,70,3],[62,3,64,3],[68,1,70,2],[56,3,58,3],[65,4,67,4],[71,3,73,3],[74,3,76,3],[74,4,76,4],[14,3,16,3],[17,3,19,3],[14,4,16,4],[14,5,14,8],[14,17,14,20],[16,5,16,8],[16,17,16,20],[23,17,23,20],[25,5,25,8],[25,17,25,20],[17,17,17,20],[19,5,19,8],[19,17,19,20],[25,9,25,12],[26,1,28,2],[26,4,28,4],[26,5,26,8],[26,17,26,20],[28,5,28,8],[28,17,28,20],[23,3,25,3],[23,1,25,2],[23,4,25,4],[23,5,23,8],[26,3,28,3],[26,9,26,12],[28,9,28,12],[29,17,29,20],[31,5,31,8],[31,17,31,20],[32,1,34,2],[32,4,34,4],[32,5,32,8],[32,17,32,20],[34,5,34,8],[34,17,34,20],[32,3,34,3],[29,5,29,8],[29,1,31,2],[29,4,31,4],[29,9,29,12],[31,9,31,12],[32,9,32,12],[34,9,34,12],[35,17,35,20],[37,5,37,8],[37,17,37,20],[35,3,37,3],[40,17,40,20],[38,3,40,3],[38,17,38,20],[41,1,43,2],[41,4,43,4],[41,5,41,8],[41,17,41,20],[43,5,43,8],[43,17,43,20],[41,3,43,3],[35,5,35,8],[38,5,38,8],[40,5,40,8],[35,9,35,12],[37,9,37,12],[38,9,38,12],[40,9,40,12],[41,9,41,12],[43,9,43,12],[44,17,44,20],[46,5,46,8],[46,17,46,20],[47,1,49,2],[47,4,49,4],[47,5,47,8],[47,17,47,20],[49,5,49,8],[49,17,49,20],[44,5,44,8],[47,3,49,3],[44,9,44,12],[46,9,46,12],[47,9,47,12],[49,9,49,12],[46,13,46,16],[47,13,47,16],[49,13,49,16],[53,17,53,20],[55,5,55,8],[55,17,55,20],[50,5,50,8],[50,17,50,20],[52,5,52,8],[52,17,52,20],[56,17,56,20],[58,5,58,8],[58,17,58,20],[53,5,53,8],[56,5,56,8],[50,9,50,12],[52,9,52,12],[53,9,53,12],[55,9,55,12],[56,9,56,12],[58,9,58,12],[50,13,50,16],[52,13,52,16],[53,13,53,16],[55,13,55,16],[56,13,56,16],[58,13,58,16],[68,5,68,8],[65,5,65,8],[65,17,65,20],[67,5,67,8],[67,17,67,20],[65,3,67,3],[62,17,62,20],[64,5,64,8],[64,17,64,20],[62,5,62,8],[95,1,95,2],[95,5,95,8],[95,17,95,20],[97,1,97,4],[98,1,98,21],[86,17,86,20],[88,5,88,8],[88,17,88,20],[85,5,85,8],[85,17,85,20],[89,1,91,2],[89,4,91,4],[89,5,89,8],[89,17,89,20],[91,5,91,8],[91,17,91,20],[89,3,91,3],[86,4,88,4],[86,5,86,8],[86,3,88,3],[83,1,85,2],[83,4,85,4],[83,5,83,8],[83,17,83,20],[94,1,94,2],[94,5,94,8],[94,17,94,20],[76,5,76,8],[76,17,76,20],[77,5,77,8],[77,17,77,20],[79,5,79,8],[79,17,79,20],[80,5,80,8],[80,17,80,20],[82,5,82,8],[82,17,82,20],[77,3,79,3],[80,3,82,3],[86,1,88,2],[80,4,82,4],[86,9,86,12],[88,9,88,12],[89,9,89,12],[91,9,91,12],[92,9,92,12],[93,9,93,12],[94,9,94,12],[12,0,13,0],[9,0,11,0],[11,1,11,21],[92,1,92,2],[92,5,92,8],[92,17,92,20],[93,1,93,2],[93,5,93,8],[93,17,93,20],[74,17,74,20],[74,5,74,8],[68,17,68,20],[70,5,70,8],[70,17,70,20],[59,5,59,8],[71,1,73,2],[71,4,73,4],[71,5,71,8],[71,17,71,20],[73,5,73,8],[73,17,73,20],[59,17,59,20],[61,5,61,8],[61,17,61,20],[2,1,2,7],[5,1,5,7],[6,1,6,7],[8,1,8,7],[9,1,9,7],[4,1,4,21],[7,1,7,21],[0,1,0,21],[1,1,1,21],[2,8,2,21]]}
[]
[]
[null,"UNIDADE ESCOLAR",null,null,null,null,null,null,"PRAZO"]
[null,{"$f":"Orçamento!$O$4","v":"ESCOLA ESTADUAL EDMO TEIXEIRA"},null,null,null,null,null,null,"120 DIAS CORRIDOS"]
[]
[null,"OBRA",null,null,null,null,null,null,"DATA"]
[null,{"$f":"Orçamento!$O$7","v":"REFORMA E IMPLANTAÇÃO"},null,null,null,null,null,null,{"$f":"Orçamento!$S$7","v":"2020-04-23"}]
[]
[null,"LOCAL",null,null,null,null,null,null,"ÁREA TOTAL CONSTRUÍDA (M²)"]
["FILTRO",{"$f":"Orçamento!$V$7","v":"IPORÁ"},null,null,null,null,null,null,{"$f":"Orçamento!$S$13","v":1124.3699999999999}]
[]
[null,"CRONOGRAMA - FÍSICO FINANCEIRO"]
["↓","CUSTO TOTAL:",{"$f":"D93","v":0},"VALOR","Dias:",30,null,null,null,60,null,null,null,90,null,null,null,120,null,null,null,"TOTAL"]
[null,"DESCRIÇÃO DOS SERVIÇOS",null,null,"%","1ª PARCELA",null,null,null,"2ª PARCELA",null,null,null,"3ª PARCELA",null,null,null,"4ª PARCELA"]
[{"$f":"IF(D15>0,\"F\",\"\")","v":""},"SERVIÇOS PRELIMINARES",null,{"$f":"Orçamento!V322","v":0},{"$f":"Orçamento!X322","v":0},{"$f":"ROUND(F17*$D$15,2)","v":0},null,null,null,{"$f":"ROUND(J17*$D$15,2)","v":0},null,null,null,{"$f":"ROUND(N17*$D$15,2)","v":0},null,null,null,{"$f":"ROUND(R17*$D$15,2)","v":0},null,null,null,{"$f":"SUM(F15:U15)","v":0}]
[{"$f":"IF(A15=\"F\",A15,\"\")","v":""}]
[{"$f":"IF(A16=\"F\",A16,\"\")","v":""},null,null,null,null,1,null,null,null,null,null,null,null,null,null,null,null,{"$f":"1-(F17+J17+N17)","v":0},null,null,null,{"$f":"IFERROR(E15/100,\"\")","v":0}]
[{"$f":"IF(D18>0,\"F\",\"\")","v":""},"TRANSPORTES",null,{"$f":"Orçamento!V323","v":0},{"$f":"Orçamento!X323","v":0},{"$f":"ROUND(F20*$D$18,2)","v":0},null,null,null,{"$f":"ROUND(J20*$D$18,2)","v":0},null,null,null,{"$f":"ROUND(N20*$D$18,2)","v":0},null,null,null,{"$f":"ROUND(R20*$D$18,2)","v":0},null,null,null,{"$f":"SUM(F18:U18)","v":0}]
[{"$f":"IF(A18=\"F\",A18,\"\")","v":""}]
[{"$f":"IF(A19=\"F\",A19,\"\")","v":""},null,null,null,null,0.8,null,null,null,null,null,null,null,0.2,null,null,null,{"$f":"1-(F20+J20+N20)","v":0},null,null,null,{"$f":"IFERROR(E18/100,\"\")","v":0}]
[{"$f":"IF(D21>0,\"F\",\"\")","v":""},"SERVIÇO EM TERRA",null,{"$f":"Orçamento!V324","v":0},{"$f":"Orçamento!X324","v":0},{"$f":"ROUND(F23*$D$21,2)","v":0},null,null,null,{"$f":"ROUND(J23*$D$21,2)","v":0},null,null,null,{"$f":"ROUND(N23*$D$21,2)","v":0},null,null,null,{"$f":"ROUND(R23*$D$21,2)","v":0},null,null,null,{"$f":"SUM(F21:U21)","v":0}]
[{"$f":"IF(A21=\"F\",A21,\"\")","v":""}]
[{"$f":"IF(A22=\"F\",A22,\"\")","v":""},null,null,null,null,7.0000000000000007E-2,null,null,null,0.83,null,null,null,null,null,null,null,{"$f":"1-(F23+J23+N23)","v":0.10000000000000009},null,null,null,{"$f":"IFERROR(E21/100,\"\")","v":0}]
[{"$f":"IF(D24>0,\"F\",\"\")","v":""},"FUNDAÇÕES E SONDAGENS",null,{"$f":"Orçamento!V325","v":0},{"$f":"Orçamento!X325","v":0},{"$f":"ROUND(F26*$D$24,2)","v":0},null,null,null,{"$f":"ROUND(J26*$D$24,2)","v":0},null,null,null,{"$f":"ROUND(N26*$D$24,2)","v":0},null,null,null,{"$f":"ROUND(R26*$D$24,2)","v":0},null,null,null,{"$f":"SUM(F24:U24)","v":0}]
[{"$f":"IF(A24=\"F\",A24,\"\")","v":""}]
[{"$f":"IF(A25=\"F\",A25,\"\")","v":""},null,null,null,null,0.2,null,null,null,0.8,null,null,null,null,null,null,null,{"$f":"1-(F26+J26+N26)","v":0},null,null,null,{"$f":"IFERROR(E24/100,\"\")","v":0}]
[{"$f":"IF(D27>0,\"F\",\"\")","v":""},"ESTRUTURA",null,{"$f":"Orçamento!V326","v":0},{"$f":"Orçamento!X326","v":0},{"$f":"ROUND(F29*$D$27,2)","v":0},null,null,null,{"$f":"ROUND(J29*$D$27,2)","v":0},null,null,null,{"$f":"ROUND(N29*$D$27,2)","v":0},null,null,null,{"$f":"ROUND(R29*$D$27,2)","v":0},null,null,null,{"$f":"SUM(F27:U27)","v":0}]
[{"$f":"IF(A27=\"F\",A27,\"\")","v":""}]
[{"$f":"IF(A28=\"F\",A28,\"\")","v":""},null,null,null,null,null,null,null,null,0.8,null,null,null,0.2,null,null,null,{"$f":"1-(F29+J29+N29)","v":0},null,null,null,{"$f":"IFERROR(E27/100,\"\")","v":0}]
[{"$f":"IF(D30>0,\"F\",\"\")","v":""},"INST.ELET/TELEFÔNICA/CABEAMENTO ESTRUTURADO",null,{"$f":"Orçamento!V327","v":0},{"$f":"Orçamento!X327","v":0},{"$f":"ROUND(F32*$D$30,2)","v":0},null,null,null,{"$f":"ROUND(J32*$D$30,2)","v":0},null,null,null,{"$f":"ROUND(N32*$D$30,2)","v":0},null,null,null,{"$f":"ROUND(R32*$D$30,2)","v":0},null,null,null,{"$f":"SUM(F30:U30)","v":0}]
[{"$f":"IF(A30=\"F\",A30,\"\")","v":""}]
[{"$f":"IF(A31=\"F\",A31,\"\")","v":""},null,null,null,null,0.15,null,null,null,0.2,null,null,null,0.3,null,null,null,{"$f":"1-(F32+J32+N32)","v":0.35000000000000009},null,null,null,{"$f":"IFERROR(E30/100,\"\")","v":0}]
[{"$f":"IF(D33>0,\"F\",\"\")","v":""},"INSTALAÇÕES HIDROSSANITÁRIAS",null,{"$f":"Orçamento!V328","v":0},{"$f":"Orçamento!X328","v":0},{"$f":"ROUND(F35*$D$33,2)","v":0},null,null,null,{"$f":"ROUND(J35*$D$33,2)","v":0},null,null,null,{"$f":"ROUND(N35*$D$33,2)","v":0},null,null,null,{"$f":"ROUND(R35*$D$33,2)","v":0},null,null,null,{"$f":"SUM(F33:U33)","v":0}]
[{"$f":"IF(A33=\"F\",A33,\"\")","v":""}]
[{"$f":"IF(A34=\"F\",A34,\"\")","v":""},null,null,null,null,null,null,null,null,null,null,null,null,null,null,null,null,{"$f":"1-(F35+J35+N35)","v":1},null,null,null,{"$f":"IFERROR(E33/100,\"\")","v":0}]
[{"$f":"IF(D36>0,\"F\",\"\")","v":""},"INSTALAÇÕES ESPECIAIS",null,{"$f":"Orçamento!V329","v":0},{"$f":"Orçamento!X329","v":0},{"$f":"ROUND(F38*$D$36,2)","v":0},null,null,null,{"$f":"ROUND(J38*$D$36,2)","v":0},null,null,null,{"$f":"ROUND(N38*$D$36,2)","v":0},null,null,null,{"$f":"ROUND(R38*$D$36,2)","v":0},null,null,null,{"$f":"SUM(F36:U36)","v":0}]
[{"$f":"IF(A36=\"F\",A36,\"\")","v":""}]
[{"$f":"IF(A37=\"F\",A37,\"\")","v":""},null,null,null,null,null,null,null,null,1,null,null,null,null,null,null,null,{"$f":"1-(F38+J38+N38)","v":0},null,null,null,{"$f":"IFERROR(E36/100,\"\")","v":0}]
[{"$f":"IF(D39>0,\"F\",\"\")","v":""},"ALVENARIA E DIVISÓRIAS",null,{"$f":"Orçamento!V330","v":0},{"$f":"Orçamento!X330","v":0},{"$f":"ROUND(F41*$D$39,2)","v":0},null,null,null,{"$f":"ROUND(J41*$D$39,2)","v":0},null,null,null,{"$f":"ROUND(N41*$D$39,2)","v":0},null,null,null,{"$f":"ROUND(R41*$D$39,2)","v":0},null,null,null,{"$f":"SUM(F39:U39)","v":0}]
[{"$f":"IF(A39=\"F\",A39,\"\")","v":""}]
[{"$f":"IF(A40=\"F\",A40,\"\")","v":""},null,null,null,null,null,null,null,null,null,null,null,null,1,null,null,null,{"$f":"1-(F41+J41+N41)","v":0},null,null,null,{"$f":"IFERROR(E39/100,\"\")","v":0}]
[{"$f":"IF(D42>0,\"F\",\"\")","v":""},"ALVENARIA AUTO-PORTANTE",null,{"$f":"Orçamento!V331","v":0},{"$f":"Orçamento!X331","v":0},{"$f":"ROUND(F44*$D$42,2)","v":0},null,null,null,{"$f":"ROUND(J44*$D$42,2)","v":0},null,null,null,{"$f":"ROUND(N44*$D$42,2)","v":0},null,null,null,{"$f":"ROUND(R44*$D$42,2)","v":0},null,null,null,{"$f":"SUM(F42:U42)","v":0}]
[{"$f":"IF(A42=\"F\",A42,\"\")","v":""}]
[{"$f":"IF(A43=\"F\",A43,\"\")","v":""},null,null,null,null,null,null,null,null,null,null,null,null,null,null,null,null,{"$f":"1-(F44+J44+N44)","v":1},null,null,null,{"$f":"IFERROR(E42/100,\"\")","v":0}]
[{"$f":"IF(D45>0,\"F\",\"\")","v":""},"IMPERMEABILIZAÇÃO",null,{"$f":"Orçamento!V332","v":0},{"$f":"Orçamento!X332","v":0},{"$f":"ROUND(F47*$D$45,2)","v":0},null,null,null,{"$f":"ROUND(J47*$D$45,2)","v":0},null,null,null,{"$f":"ROUND(N47*$D$45,2)","v":0},null,null,null,{"$f":"ROUND(R47*$D$45,2)","v":0},null,null,null,{"$f":"SUM(F45:U45)","v":0}]
[{"$f":"IF(A45=\"F\",A45,\"\")","v":""}]
[{"$f":"IF(A46=\"F\",A46,\"\")","v":""},null,null,null,null,null,null,null,null,1,null,null,null,null,null,null,null,{"$f":"1-(F47+J47+N47)","v":0},null,null,null,{"$f":"IFERROR(E45/100,\"\")","v":0}]
[{"$f":"IF(D48>0,\"F\",\"\")","v":""},"ISOLAMENTO TÉRMICO E ACÚSTICO",null,{"$f":"Orçamento!V333","v":0},{"$f":"Orçamento!X333","v":0},{"$f":"ROUND(F50*$D$48,2)","v":0},null,null,null,{"$f":"ROUND(J50*$D$48,2)","v":0},null,null,null,{"$f":"ROUND(N50*$D$48,2)","v":0},null,null,null,{"$f":"ROUND(R50*$D$48,2)","v":0},null,null,null,{"$f":"SUM(F48:U48)","v":0}]
[{"$f":"IF(A48=\"F\",A48,\"\")","v":""}]
[{"$f":"IF(A49=\"F\",A49,\"\")","v":""},null,null,null,null,null,null,null,null,null,null,null,null,null,null,null,null,{"$f":"1-(F50+J50+N50)","v":1},null,null,null,{"$f":"IFERROR(E48/100,\"\")","v":0}]
[{"$f":"IF(D51>0,\"F\",\"\")","v":""},"ESTRUTURA DE MADEIRA",null,{"$f":"Orçamento!V334","v":0},{"$f":"Orçamento!X334","v":0},{"$f":"ROUND(F53*$D$51,2)","v":0},null,null,null,{"$f":"ROUND(J53*$D$51,2)","v":0},null,null,null,{"$f":"ROUND(N53*$D$51,2)","v":0},null,null,null,{"$f":"ROUND(R53*$D$51,2)","v":0},null,null,null,{"$f":"SUM(F51:U51)","v":0}]
[{"$f":"IF(A51=\"F\",A51,\"\")","v":""}]
[{"$f":"IF(A52=\"F\",A52,\"\")","v":""},null,null,null,null,null,null,null,null,null,null,null,null,null,null,null,null,{"$f":"1-(F53+J53+N53)","v":1},null,null,null,{"$f":"IFERROR(E51/100,\"\")","v":0}]
[{"$f":"IF(D54>0,\"F\",\"\")","v":""},"ESTRUTURA METÁLICA",null,{"$f":"Orçamento!V335","v":0},{"$f":"Orçamento!X335","v":0},{"$f":"ROUND(F56*$D$54,2)","v":0},null,null,null,{"$f":"ROUND(J56*$D$54,2)","v":0},null,null,null,{"$f":"ROUND(N56*$D$54,2)","v":0},null,null,null,{"$f":"ROUND(R56*$D$54,2)","v":0},null,null,null,{"$f":"SUM(F54:U54)","v":0}]
[{"$f":"IF(A54=\"F\",A54,\"\")","v":""}]
[{"$f":"IF(A55=\"F\",A55,\"\")","v":""},null,null,null,null,null,null,null,null,null,null,null,null,1,null,null,null,{"$f":"1-(F56+J56+N56)","v":0},null,null,null,{"$f":"IFERROR(E54/100,\"\")","v":0}]
[{"$f":"IF(D57>0,\"F\",\"\")","v":""},"COBERTURAS",null,{"$f":"Orçamento!V336","v":0},{"$f":"Orçamento!X336","v":0},{"$f":"ROUND(F59*$D$57,2)","v":0},null,null,null,{"$f":"ROUND(J59*$D$57,2)","v":0},null,null,null,{"$f":"ROUND(N59*$D$57,2)","v":0},null,null,null,{"$f":"ROUND(R59*$D$57,2)","v":0},null,null,null,{"$f":"SUM(F57:U57)","v":0}]
[{"$f":"IF(A57=\"F\",A57,\"\")","v":""}]
[{"$f":"IF(A58=\"F\",A58,\"\")","v":""},null,null,null,null,0,null,null,null,0,null,null,null,0,null,null,null,{"$f":"1-(F59+J59+N59)","v":1},null,null,null,{"$f":"IFERROR(E57/100,\"\")","v":0}]
[{"$f":"IF(D60>0,\"F\",\"\")","v":""},"ESQUADRIAS DE MADEIRA",null,{"$f":"Orçamento!V337","v":0},{"$f":"Orçamento!X337","v":0},{"$f":"ROUND(F62*$D$60,2)","v":0},null,null,null,{"$f":"ROUND(J62*$D$60,2)","v":0},null,null,null,{"$f":"ROUND(N62*$D$60,2)","v":0},null,null,null,{"$f":"ROUND(R62*$D$60,2)","v":0},null,null,null,{"$f":"SUM(F60:U60)","v":0}]
[{"$f":"IF(A60=\"F\",A60,\"\")","v":""}]
[{"$f":"IF(A61=\"F\",A61,\"\")","v":""},null,null,null,null,null,null,null,null,null,null,null,null,null,null,null,null,{"$f":"1-(F62+J62+N62)","v":1},null,null,null,{"$f":"IFERROR(E60/100,\"\")","v":0}]
[{"$f":"IF(D63>0,\"F\",\"\")","v":""},"ESQUADRIAS METÁLICAS",null,{"$f":"Orçamento!V338","v":0},{"$f":"Orçamento!X338","v":0},{"$f":"ROUND(F65*$D$63,2)","v":0},null,null,null,{"$f":"ROUND(J65*$D$63,2)","v":0},null,null,null,{"$f":"ROUND(N65*$D$63,2)","v":0},null,null,null,{"$f":"ROUND(R65*$D$63,2)","v":0},null,null,null,{"$f":"SUM(F63:U63)","v":0}]
[{"$f":"IF(A63=\"F\",A63,\"\")","v":""}]
[{"$f":"IF(A64=\"F\",A64,\"\")","v":""},null,null,null,null,null,null,null,null,null,null,null,null,1,null,null,null,{"$f":"1-(F65+J65+N65)","v":0},null,null,null,{"$f":"IFERROR(E63/100,\"\")","v":0}]
[{"$f":"IF(D66>0,\"F\",\"\")","v":""},"VIDROS",null,{"$f":"Orçamento!V339","v":0},{"$f":"Orçamento!X339","v":0},{"$f":"ROUND(F68*$D$66,2)","v":0},null,null,null,{"$f":"ROUND(J68*$D$66,2)","v":0},null,null,null,{"$f":"ROUND(N68*$D$66,2)","v":0},null,null,null,{"$f":"ROUND(R68*$D$66,2)","v":0},null,null,null,{"$f":"SUM(F66:U66)","v":0}]
[{"$f":"IF(A66=\"F\",A66,\"\")","v":""}]
[{"$f":"IF(A67=\"F\",A67,\"\")","v":""},null,null,null,null,0,null,null,null,0,null,null,null,0,null,null,null,{"$f":"1-(F68+J68+N68)","v":1},null,null,null,{"$f":"IFERROR(E66/100,\"\")","v":0}]
[{"$f":"IF(D69>0,\"F\",\"\")","v":""},"REVESTIMENTO DE PAREDE",null,{"$f":"Orçamento!V340","v":0},{"$f":"Orçamento!X340","v":0},{"$f":"ROUND(F71*$D$69,2)","v":0},null,null,null,{"$f":"ROUND(J71*$D$69,2)","v":0},null,null,null,{"$f":"ROUND(N71*$D$69,2)","v":0},null,null,null,{"$f":"ROUND(R71*$D$69,2)","v":0},null,null,null,{"$f":"SUM(F69:U69)","v":0}]
[{"$f":"IF(A69=\"F\",A69,\"\")","v":""}]
[{"$f":"IF(A70=\"F\",A70,\"\")","v":""},null,null,null,null,1,null,null,null,null,null,null,null,null,null,null,null,{"$f":"1-(F71+J71+N71)","v":0},null,null,null,{"$f":"IFERROR(E69/100,\"\")","v":0}]
[{"$f":"IF(D72>0,\"F\",\"\")","v":""},"FORROS",null,{"$f":"Orçamento!V341","v":0},{"$f":"Orçamento!X341","v":0},{"$f":"ROUND(F74*$D$72,2)","v":0},null,null,null,{"$f":"ROUND(J74*$D$72,2)","v":0},null,null,null,{"$f":"ROUND(N74*$D$72,2)","v":0},null,null,null,{"$f":"ROUND(R74*$D$72,2)","v":0},null,null,null,{"$f":"SUM(F72:U72)","v":0}]
[{"$f":"IF(A72=\"F\",A72,\"\")","v":""}]
[{"$f":"IF(A73=\"F\",A73,\"\")","v":""},null,null,null,null,0.24,null,null,null,0.24,null,null,null,0.24,null,null,null,{"$f":"1-(F74+J74+N74)","v":0.28000000000000003},null,null,null,{"$f":"IFERROR(E72/100,\"\")","v":0}]
[{"$f":"IF(D75>0,\"F\",\"\")","v":""},"REVESTIMENTO DE PISO",null,{"$f":"Orçamento!V342","v":0},{"$f":"Orçamento!X342","v":0},{"$f":"ROUND(F77*$D$75,2)","v":0},null,null,null,{"$f":"ROUND(J77*$D$75,2)","v":0},null,null,null,{"$f":"ROUND(N77*$D$75,2)","v":0},null,null,null,{"$f":"ROUND(R77*$D$75,2)","v":0},null,null,null,{"$f":"SUM(F75:U75)","v":0}]
[{"$f":"IF(A75=\"F\",A75,\"\")","v":""}]
[{"$f":"IF(A76=\"F\",A76,\"\")","v":""},null,null,null,null,null,null,null,null,0.5,null,null,null,0.5,null,null,null,{"$f":"1-(F77+J77+N77)","v":0},null,null,null,{"$f":"IFERROR(E75/100,\"\")","v":0}]
[{"$f":"IF(D78>0,\"F\",\"\")","v":""},"FERRAGENS",null,{"$f":"Orçamento!V343","v":0},{"$f":"Orçamento!X343","v":0},{"$f":"ROUND(F80*$D$78,2)","v":0},null,null,null,{"$f":"ROUND(J80*$D$78,2)","v":0},null,null,null,{"$f":"ROUND(N80*$D$78,2)","v":0},null,null,null,{"$f":"ROUND(R80*$D$78,2)","v":0},null,null,null,{"$f":"SUM(F78:U78)","v":0}]
[{"$f":"IF(A78=\"F\",A78,\"\")","v":""}]
[{"$f":"IF(A79=\"F\",A79,\"\")","v":""},null,null,null,null,0,null,null,null,0,null,null,null,0,null,null,null,{"$f":"1-(F80+J80+N80)","v":1},null,null,null,{"$f":"IFERROR(E78/100,\"\")","v":0}]
[{"$f":"IF(D81>0,\"F\",\"\")","v":""},"MARCENARIA",null,{"$f":"Orçamento!V344","v":0},{"$f":"Orçamento!X344","v":0},{"$f":"ROUND(F83*$D$81,2)","v":0},null,null,null,{"$f":"ROUND(J83*$D$81,2)","v":0},null,null,null,{"$f":"ROUND(N83*$D$81,2)","v":0},null,null,null,{"$f":"ROUND(R83*$D$81,2)","v":0},null,null,null,{"$f":"SUM(F81:U81)","v":0}]
[{"$f":"IF(A81=\"F\",A81,\"\")","v":""}]
[{"$f":"IF(A82=\"F\",A82,\"\")","v":""},null,null,null,null,0.4,null,null,null,0.4,null,null,null,0.4,null,null,null,{"$f":"1-F83","v":0.6},null,null,null,{"$f":"IFERROR(E81/100,\"\")","v":0}]
[{"$f":"IF(D84>0,\"F\",\"\")","v":""},"ADMINISTRAÇÃO - MENSALISTAS",null,{"$f":"Orçamento!V345","v":0},{"$f":"Orçamento!X345","v":0},{"$f":"ROUND(F86*$D$84,2)","v":0},null,null,null,{"$f":"ROUND(J86*$D$84,2)","v":0},null,null,null,{"$f":"ROUND(N86*$D$84,2)","v":0},null,null,null,{"$f":"ROUND(R86*$D$84,2)","v":0},null,null,null,{"$f":"SUM(F84:U84)","v":0}]
[{"$f":"IF(A84=\"F\",A84,\"\")","v":""}]
[{"$f":"IF(A85=\"F\",A85,\"\")","v":""},null,null,null,null,0.25,null,null,null,0.25,null,null,null,0.25,null,null,null,{"$f":"1-(F86+J86+N86)","v":0.25},null,null,null,{"$f":"IFERROR(E84/100,\"\")","v":0}]
[{"$f":"IF(D87>0,\"F\",\"\")","v":""},"PINTURA",null,{"$f":"Orçamento!V346","v":0},{"$f":"Orçamento!X346","v":0},{"$f":"ROUND(F89*$D$87,2)","v":0},null,null,null,{"$f":"ROUND(J89*$D$87,2)","v":0},null,null,null,{"$f":"ROUND(N89*$D$87,2)","v":0},null,null,null,{"$f":"ROUND(R89*$D$87,2)","v":0},null,null,null,{"$f":"SUM(F87:U87)","v":0}]
[{"$f":"IF(A87=\"F\",A87,\"\")","v":""}]
[{"$f":"IF(A88=\"F\",A88,\"\")","v":""},null,null,null,null,0.15,null,null,null,0.2,null,null,null,0.15,null,null,null,{"$f":"1-(F89+J89+N89)","v":0.5},null,null,null,{"$f":"IFERROR(E87/100,\"\")","v":0}]
[{"$f":"IF(D90>0,\"F\",\"\")","v":""},"DIVERSOS",null,{"$f":"Orçamento!V347","v":0},{"$f":"Orçamento!X347","v":0},{"$f":"ROUND(F92*$D$90,2)","v":0},null,null,null,{"$f":"ROUND(J92*$D$90,2)","v":0},null,null,null,{"$f":"ROUND(N92*$D$90,2)","v":0},null,null,null,{"$f":"ROUND(R92*$D$90,2)","v":0},null,null,null,{"$f":"SUM(F90:U90)","v":0}]
[{"$f":"IF(A90=\"F\",A90,\"\")","v":""}]
[{"$f":"IF(A91=\"F\",A91,\"\")","v":""},null,null,null,null,null,null,null,null,null,null,null,null,null,null,null,null,{"$f":"1-(F92+J92+N92)","v":1},null,null,null,{"$f":"IFERROR(E90/100,\"\")","v":0}]
["F","CUSTO DO ORÇAMENTO",null,{"$f":"SUM(D15:D92)","v":0},{"$f":"SUM(E15:E92)","v":0},{"$f":"F15+F18+F21+F24+F27+F30+F33+F36+F39+F42+F45+F48+F51+F54+F57+F60+F63+F66+F69+F72+F75+F78+F81+F84+F87+F90","v":0},null,null,null,{"$f":"J15+J18+J21+J24+J27+J30+J33+J36+J39+J42+J45+J48+J51+J54+J57+J60+J63+J66+J69+J72+J75+J78+J81+J84+J87+J90","v":0},null,null,null,{"$f":"N15+N18+N21+N24+N27+N30+N33+N36+N39+N42+N45+N48+N51+N54+N57+N60+N63+N66+N69+N72+N75+N78+N81+N84+N87+N90","v":0},null,null,null,{"$f":"R15+R18+R21+R24+R27+R30+R33+R36+R39+R42+R45+R48+R51+R54+R57+R60+R63+R66+R69+R72+R75+R78+R81+R84+R87+R90","v":0},null,null,null,{"$f":"V15+V18+V21+V24+V27+V30+V33+V36+V39+V42+V45+V48+V51+V54+V57+V60+V63+V66+V69+V72+V75+V78+V81+V84+V87+V90","v":0}]
["F","PERCENTUAIS:",null,null,null,{"$f":"IFERROR(F93/D93,\"\")","v":""},null,null,null,{"$f":"IFERROR(J93/D93,\"\")","v":""},null,null,null,{"$f":"IFERROR(N93/D93,\"\")","v":""},null,null,null,{"$f":"IFERROR(R93/D93,\"\")","v":""},null,null,null,{"$f":"SUM(F94:U94)","v":0}]
["F","TOTAIS ACUMULADOS:",null,null,null,{"$f":"F93","v":0},null,null,null,{"$f":"J93","v":0},null,null,null,{"$f":"N93","v":0},null,null,null,{"$f":"F95+R93","v":0}]
["F","PERCENTUAIS  ACUMULADOS:",null,null,null,{"$f":"F94","v":""},null,null,null,{"$f":"J94+F96","v":{"$error":"#VALUE!"}},null,null,null,{"$f":"N94+J96","v":{"$error":"#VALUE!"}},null,null,null,{"$f":"IFERROR(N96+R94,\"\")","v":""}]
["F"]
["F","OBSERVAÇÕES:"]
["F","Os pagamentos somente poderão ser efetuados mediante medição e atesto pelos técnicos da Secretaria da Educação. "]

{"sheet":"Composição BDI","index":4,"n_rows":45,"n_cols":9,"rows_kept":45,"cut":false,"hidden":false,"merged":[[18,5,18,8],[17,0,17,3],[16,0,16,3],[44,0,44,3],[42,0,42,3],[43,0,43,3],[18,0,18,3],[36,0,36,3],[39,0,39,3],[38,0,38,3],[40,0,40,3],[29,0,29,2],[32,0,32,3],[33,0,33,3],[34,0,34,3],[35,0,35,3],[0,0,0,3],[1,0,1,3],[4,0,4,3],[7,0,7,3],[10,0,10,3],[2,0,2,3],[3,0,3,3],[5,0,5,3],[6,0,6,3],[8,0,8,3],[9,0,9,3],[11,0,11,3],[12,0,12,3],[14,0,14,3],[15,0,15,3],[13,0,13,3]]}
[]
[]
["UNIDADE ESCOLAR"]
[{"$f":"Orçamento!$O$4","v":"ESCOLA ESTADUAL EDMO TEIXEIRA"}]
[]
["OBRA"]
[{"$f":"Orçamento!$O$7","v":"REFORMA E IMPLANTAÇÃO"}]
[]
["ENDEREÇO"]
[{"$f":"Orçamento!$R$10","v":"AV. CAIAPÓ 282, SAO FRANCISCO, CEP:76200-000"}]
[]
["CIDADE"]
[{"$f":"Orçamento!$V$7","v":"IPORÁ"}]
[]
["CRE"]
[{"$f":"Orçamento!$O$10","v":"IPORÁ"}]
[]
["DETALHAMENTO DA COMPOSIÇÃO DE BDI"]
["COMPOSIÇÃO BDI PARA OBRAS CIVIS",null,null,null,null,"BDI CONSTRUÇÃO E REFORMA"]
["DESCRIÇÃO","COEF.","TAXA % (a.m)","% no preço de venda",null,"Situação","1º Quartil","Médio","3º Quartil"]
["1) COFINS",1,0.03,{"$f":"C21","v":0.03},null,{"$f":"IF(OR(C21<G21,C21>I21),\"FORA DO INTERVALO\",\"OK\")","v":"OK"},0.03,0.03,0.03]
["2) PIS",1,6.4999999999999997E-3,{"$f":"C22","v":6.4999999999999997E-3},null,{"$f":"IF(OR(C22<G22,C22>I22),\"FORA DO INTERVALO\",\"OK\")","v":"OK"},6.4999999999999997E-3,6.4999999999999997E-3,6.4999999999999997E-3]
["3) ISSQN",1,2.5000000000000001E-2,{"$f":"C23*B23","v":2.5000000000000001E-2},null,"OK",0.02,3.5000000000000003E-2,0.05]
["4) CPRB",1,4.4999999999999998E-2,{"$f":"C24","v":4.4999999999999998E-2},null,"OK",4.4999999999999998E-2,4.4999999999999998E-2,4.4999999999999998E-2]
["5) Administração Central",1,3.6799999999999999E-2,3.6799999999999999E-2,null,"OK",0.03,0.04,5.5E-2]
["6) Despesas Financeiras",1,5.5999999999999999E-3,5.5999999999999999E-3,null,"FORA DO INTERVALO",5.8999999999999999E-3,1.23E-2,1.3899999999999999E-2]
["7) Seguros + Garantias",1,1.1999999999999999E-3,1.1999999999999999E-3,null,"FORA DO INTERVALO",8.0000000000000002E-3,8.0000000000000002E-3,0.01]
["8) Risco",1,9.7000000000000003E-3,9.7000000000000003E-3,null,"OK",9.7000000000000003E-3,1.2699999999999999E-2,1.2699999999999999E-2]
["9) Lucro",1,7.1999999999999995E-2,7.1999999999999995E-2,null,"OK",6.1600000000000002E-2,7.3999999999999996E-2,8.9599999999999999E-2]
["BDI - FINAL",null,null,{"$f":"(((1+D25+D27+D28)*(1+D26)*(1+D29))/(1-(D21+D22+D23+D24))-1)","v":0.2640447147621714},null,{"$f":"IF(OR(D30<G30,D30>I30),\"FORA DO INTERVALO\",\"OK\")","v":"FORA DO INTERVALO"},0.2034,0.22120000000000001,0.25]
[]
["Notas:"]
["(1) e (2) Alíquota definida por lei."]
["(3) Alíquota e base de cálculo definidas pela legislação municipal."]
["(4) Alíquota definida pelas leis 12.546/11, 12844/13 e 13.161/15 (CPRB – contribuição previdenciária sobre a receita bruta)."]
["(5) Valores definidos a partir dos limites no Acórdão nº 2.622/2013 - TCU – Plenário. Valores entre o 1º e 3º quartis."]
["(6) Valor calculado pela expressão matemática do acórdão 2.369/2011 – TCU – Plenário e disponibilizado pela AGETOP em dezembro de 2018. (Foi utilizado para o cálculo a média da Taxa SELIC no período de 11/2017 a 10/2018)"]
[]
["(7) Valores definidos pela AGETOP a partir dos limites no Acórdão nº 2.622/2013 - TCU – Plenário. Valores médios. \n\nObservação da AGETOP: (Seguros contra erros de execução, incêndio e explosão, danos da natureza (vendaval, destelhamento, alagamento, inundação, desmoronamento, geadas etc.), emprego de material defeituoso ou inadequado, roubo e/ou furto qualificado, quebra de equipamentos, desmoronamento de estrutura, nas modalidades de Obras Civis em Construção (OCC); Instalação e Montagem (IM); e Obras Civis em Construção e Instalação e Montagem (OCC/IM). Bem como coberturas adicionais para ampliação dessas coberturas básicas, como: cobertura de responsabilidade civil geral, cobertura de responsabilidade civil cruzada, cobertura de despesas extraordinárias, cobertura de tumultos, cobertura de desentulho do local, cobertura de riscos do fabricante, dentre outras, incluindo o seguro de vida em grupo regido pela convenção coletiva dos trabalhadores na indústria da construção civil). A partir de 24/02/2015 por intermédio da Portaria 449/2015 a Presidência da AGETOP, na pessoa do Senhor Jayme Eduardo Rincon, determinou a exclusão dos valores referentes aos Seguros de Risco de Engenharia e Responsabilidade Civil do Profissional na composição do cálculo do B.D.I.."]
["(8) Valores definidos a partir dos limites no Acórdão nº 2.622/2013 - TCU – Plenário. Valores entre 1º e 3° quartis."]
["(9) Valores definidos a partir dos limites definidos no Acórdão nº 2.622/2013 - TCU – Plenário. Valores adotados e praticados no mercado ( “ ex ante ” ) ou aqueles entre os 1º e 3º quartis."]
[]
["(*) A fórmula para estipulação da taxa de BDI estimado adotado é a mesma que foi aplicada para a obtenção das tabelas contidas no Acórdão n. 2.622/2013 – TCUPlenário"]
[]
["Obs.: Para obras com valores superiores a R$ 20.000.000,00 sugere-se recalcular o BDI, dimensionando as taxas de administração central e lucro para patamares inferiores ao estipulado acima."]

{"sheet":"Relatório CENTRAL","index":5,"n_rows":40,"n_cols":5,"rows_kept":40,"cut":false,"hidden":false,"merged":[[39,1,39,2],[9,0,11,0],[0,1,0,4],[6,3,6,4],[9,3,9,4],[1,1,1,4],[2,1,2,2],[2,3,2,4],[3,1,3,2],[3,3,3,4],[4,1,4,4],[5,1,5,2],[5,3,5,4],[6,1,6,2],[7,1,7,4],[8,1,8,2],[8,3,8,4],[9,1,9,2],[10,1,10,4],[11,1,11,4]]}
[]
[]
[null,"UNIDADE ESCOLAR",null,"CIDADE"]
[null,{"$f":"Orçamento!$O$4","v":"ESCOLA ESTADUAL EDMO TEIXEIRA"},null,{"$f":"Orçamento!$V$7","v":"IPORÁ"}]
[]
[null,"OBRA",null,"CRE"]
[null,{"$f":"Orçamento!$O$7","v":"REFORMA E IMPLANTAÇÃO"},null,{"$f":"Orçamento!$O$10","v":"IPORÁ"}]
[]
[null,"ENDEREÇO",null,"DATA"]
["FILTRO",{"$f":"Orçamento!$R$10","v":"AV. CAIAPÓ 282, SAO FRANCISCO, CEP:76200-000"},null,{"$f":"Orçamento!$S$7","v":"2020-04-23"}]
[]
[null,"RELATÓRIO CENTRAL"]
["↓","CÓDIGO","ETAPA","PREÇO  (R$) C/ BDI","PARTIC  ( % )"]
[{"$f":"IF(D14>0,\"F\",\"\")","v":""},{"$f":"Orçamento!O322","v":"a."},{"$f":"Orçamento!P322","v":"SERVIÇOS PRELIMINARES"},{"$f":"Orçamento!V322","v":0},{"$f":"Orçamento!X322","v":0}]
[{"$f":"IF(D15>0,\"F\",\"\")","v":""},{"$f":"Orçamento!O323","v":"b."},{"$f":"Orçamento!P323","v":"TRANSPORTES"},{"$f":"Orçamento!V323","v":0},{"$f":"Orçamento!X323","v":0}]
["",{"$f":"Orçamento!O324","v":"c."},{"$f":"Orçamento!P324","v":"SERVIÇO EM TERRA"},{"$f":"Orçamento!V324","v":0},{"$f":"Orçamento!X324","v":0}]
["",{"$f":"Orçamento!O325","v":"d."},{"$f":"Orçamento!P325","v":"FUNDAÇÕES E SONDAGENS"},{"$f":"Orçamento!V325","v":0},{"$f":"Orçamento!X325","v":0}]
["",{"$f":"Orçamento!O326","v":"e."},{"$f":"Orçamento!P326","v":"ESTRUTURA"},{"$f":"Orçamento!V326","v":0},{"$f":"Orçamento!X326","v":0}]
["",{"$f":"Orçamento!O327","v":"f."},{"$f":"Orçamento!P327","v":"INSTALAÇÕES ELÉTRICAS"},{"$f":"Orçamento!V327","v":0},{"$f":"Orçamento!X327","v":0}]
["",{"$f":"Orçamento!O328","v":"g."},{"$f":"Orçamento!P328","v":"INSTALAÇÕES HIDROSSANITÁRIAS"},{"$f":"Orçamento!V328","v":0},{"$f":"Orçamento!X328","v":0}]
["",{"$f":"Orçamento!O329","v":"h"},{"$f":"Orçamento!P329","v":"INSTALAÇÕES ESPECIAIS"},{"$f":"Orçamento!V329","v":0},{"$f":"Orçamento!X329","v":0}]
["",{"$f":"Orçamento!O330","v":"i."},{"$f":"Orçamento!P330","v":"ALVENARIAS E DIVISÓRIAS"},{"$f":"Orçamento!V330","v":0},{"$f":"Orçamento!X330","v":0}]
["",{"$f":"Orçamento!O331","v":"j."},{"$f":"Orçamento!P331","v":"ALVENARIA AUTO-PORTANTE"},{"$f":"Orçamento!V331","v":0},{"$f":"Orçamento!X331","v":0}]
["",{"$f":"Orçamento!O332","v":"k."},{"$f":"Orçamento!P332","v":"IMPERMEABILIZAÇÃO"},{"$f":"Orçamento!V332","v":0},{"$f":"Orçamento!X332","v":0}]
["",{"$f":"Orçamento!O333","v":"l."},{"$f":"Orçamento!P333","v":"ISOLAMENTO TÉRMICO E ACÚSTICO"},{"$f":"Orçamento!V333","v":0},{"$f":"Orçamento!X333","v":0}]
["",{"$f":"Orçamento!O334","v":"m."},{"$f":"Orçamento!P334","v":"ESTRUTURA DE MADEIRA"},{"$f":"Orçamento!V334","v":0},{"$f":"Orçamento!X334","v":0}]
["",{"$f":"Orçamento!O335","v":"n."},{"$f":"Orçamento!P335","v":"ESTRUTURAS METÁLICAS"},{"$f":"Orçamento!V335","v":0},{"$f":"Orçamento!X335","v":0}]
["",{"$f":"Orçamento!O336","v":"o."},{"$f":"Orçamento!P336","v":"COBERTURAS"},{"$f":"Orçamento!V336","v":0},{"$f":"Orçamento!X336","v":0}]
["",{"$f":"Orçamento!O337","v":"p."},{"$f":"Orçamento!P337","v":"ESQUADRIAS DE MADEIRA"},{"$f":"Orçamento!V337","v":0},{"$f":"Orçamento!X337","v":0}]
["",{"$f":"Orçamento!O338","v":"q."},{"$f":"Orçamento!P338","v":"ESQUADRIAS METÁLICAS"},{"$f":"Orçamento!V338","v":0},{"$f":"Orçamento!X338","v":0}]
["",{"$f":"Orçamento!O339","v":"r."},{"$f":"Orçamento!P339","v":"VIDROS"},{"$f":"Orçamento!V339","v":0},{"$f":"Orçamento!X339","v":0}]
["",{"$f":"Orçamento!O340","v":"s."},{"$f":"Orçamento!P340","v":"REVESTIMENTO DE PAREDE"},{"$f":"Orçamento!V340","v":0},{"$f":"Orçamento!X340","v":0}]
["",{"$f":"Orçamento!O341","v":"t."},{"$f":"Orçamento!P341","v":"FORROS"},{"$f":"Orçamento!V341","v":0},{"$f":"Orçamento!X341","v":0}]
["",{"$f":"Orçamento!O342","v":"u."},{"$f":"Orçamento!P342","v":"REVESTIMENTO DE PISO"},{"$f":"Orçamento!V342","v":0},{"$f":"Orçamento!X342","v":0}]
["",{"$f":"Orçamento!O343","v":"v."},{"$f":"Orçamento!P343","v":"FERRAGENS"},{"$f":"Orçamento!V343","v":0},{"$f":"Orçamento!X343","v":0}]
["",{"$f":"Orçamento!O344","v":"w."},{"$f":"Orçamento!P344","v":"MARCENARIA"},{"$f":"Orçamento!V344","v":0},{"$f":"Orçamento!X344","v":0}]
["",{"$f":"Orçamento!O345","v":"x."},{"$f":"Orçamento!P345","v":"ADMINISTRAÇÃO"},{"$f":"Orçamento!V345","v":0},{"$f":"Orçamento!X345","v":0}]
["",{"$f":"Orçamento!O346","v":"y."},{"$f":"Orçamento!P346","v":"PINTURA"},{"$f":"Orçamento!V346","v":0},{"$f":"Orçamento!X346","v":0}]
["",{"$f":"Orçamento!O347","v":"z."},{"$f":"Orçamento!P347","v":"DIVERSOS"},{"$f":"Orçamento!V347","v":0},{"$f":"Orçamento!X347","v":0}]
["F","TOTAL GERAL DO ORÇAMENTO (R$) C/BDI",null,{"$f":"SUM(D14:D39)","v":0},{"$f":"SUM(E14:E39)","v":0}]

{"sheet":"Parc Maior Relev","index":6,"n_rows":20,"n_cols":7,"rows_kept":20,"cut":false,"hidden":false,"merged":[[10,0,12,0],[8,1,8,3],[8,4,8,6],[20,3,20,7],[18,1,18,6],[0,1,0,6],[11,1,11,6],[1,1,1,6],[2,1,2,3],[2,4,2,6],[3,1,3,3],[3,4,3,6],[4,1,4,6],[5,1,5,3],[5,4,5,6],[9,1,9,3],[9,4,9,6],[10,1,10,6],[6,1,6,3],[6,4,6,6],[7,1,7,6]]}
[]
[]
[null,"UNIDADE ESCOLAR",null,null,"CÓDIGO INEP"]
[null,{"$f":"Orçamento!$O$4","v":"ESCOLA ESTADUAL EDMO TEIXEIRA"},null,null,{"$f":"Orçamento!$V$4","v":52027147}]
[]
[null,"OBRA",null,null,"CIDADE"]
[null,{"$f":"Orçamento!$O$7","v":"REFORMA E IMPLANTAÇÃO"},null,null,{"$f":"Orçamento!$V$7","v":"IPORÁ"}]
[]
[null,"CRE",null,null,"ÁREA TOTAL CONSTRUÍDA (M²)"]
[null,{"$f":"Orçamento!$O$10","v":"IPORÁ"},null,null,{"$f":"Orçamento!$S$13","v":1124.3699999999999}]
["FILTRO"]
[null,"PARCELA DE MAIOR RELEVÂNCIA"]
[null,"CÓDIGO","SERVIÇO","DESCRIÇÃO","UNID","QUANT","PARC. MAIOR RELEV (50%)"]
[null,160000,"COBERTURAS","TELHA CERÂMICA","M2",{"$f":"Orçamento!T154","v":415.52},{"$f":"F14*0.5","v":207.76}]
[null,160000,"COBERTURAS","TELHA METÁLICA","M2",{"$f":"Orçamento!T280","v":478.51},239.255]
[null,220000,"REVESTIMENTO DE PISO","PISO GRANITINA","M2",{"$f":"Orçamento!T168","v":552.36},276.18]
[null,220000,"REVESTIMENTO DE PISO","PISO LAMINADO","M2",{"$f":"Orçamento!T288","v":174.2},87.1]
["F"]
["F","(*) Para os fins do inciso I dp § 1º do Art. 30 da Lei Federal 8.666/93, são consideradas parcelas de maior relevância técnica as execuções apresentadas"]
["F"]

{"sheet":"Composições","index":7,"n_rows":219,"n_cols":10,"rows_kept":219,"cut":false,"hidden":false,"merged":[[197,5,198,5],[197,6,197,7],[197,8,197,9],[203,1,203,7],[218,1,218,7],[197,0,198,0],[197,1,198,1],[197,2,198,2],[197,3,198,3],[197,4,198,4],[185,5,186,5],[185,6,185,7],[185,8,185,9],[191,1,191,7],[195,1,195,7],[185,0,186,0],[185,1,186,1],[185,2,186,2],[185,3,186,3],[185,4,186,4],[173,5,174,5],[173,6,173,7],[173,8,173,9],[179,1,179,7],[183,1,183,7],[173,0,174,0],[173,1,174,1],[173,2,174,2],[173,3,174,3],[173,4,174,4],[161,5,162,5],[161,6,161,7],[161,8,161,9],[167,1,167,7],[171,1,171,7],[161,0,162,0],[161,1,162,1],[161,2,162,2],[161,3,162,3],[161,4,162,4],[149,5,150,5],[149,6,149,7],[149,8,149,9],[155,1,155,7],[159,1,159,7],[149,0,150,0],[149,1,150,1],[149,2,150,2],[149,3,150,3],[149,4,150,4],[137,5,138,5],[137,6,137,7],[137,8,137,9],[143,1,143,7],[147,1,147,7],[137,0,138,0],[137,1,138,1],[137,2,138,2],[137,3,138,3],[137,4,138,4],[125,5,126,5],[125,6,125,7],[125,8,125,9],[131,1,131,7],[135,1,135,7],[125,0,126,0],[125,1,126,1],[125,2,126,2],[125,3,126,3],[125,4,126,4],[113,5,114,5],[113,6,113,7],[113,8,113,9],[119,1,119,7],[123,1,123,7],[113,0,114,0],[113,1,114,1],[113,2,114,2],[113,3,114,3],[113,4,114,4],[101,5,102,5],[101,6,101,7],[101,8,101,9],[107,1,107,7],[111,1,111,7],[101,0,102,0],[101,1,102,1],[101,2,102,2],[101,3,102,3],[101,4,102,4],[89,5,90,5],[89,6,89,7],[89,8,89,9],[95,1,95,7],[99,1,99,7],[89,0,90,0],[89,1,90,1],[89,2,90,2],[89,3,90,3],[89,4,90,4],[77,5,78,5],[77,6,77,7],[77,8,77,9],[83,1,83,7],[87,1,87,7],[77,0,78,0],[77,1,78,1],[77,2,78,2],[77,3,78,3],[77,4,78,4],[65,5,66,5],[65,6,65,7],[65,8,65,9],[71,1,71,7],[75,1,75,7],[65,0,66,0],[65,1,66,1],[65,2,66,2],[65,3,66,3],[65,4,66,4],[50,5,51,5],[50,6,50,7],[50,8,50,9],[56,1,56,7],[63,1,63,7],[50,0,51,0],[50,1,51,1],[50,2,51,2],[50,3,51,3],[50,4,51,4],[40,5,41,5],[40,6,40,7],[40,8,40,9],[44,1,44,7],[48,1,48,7],[40,0,41,0],[40,1,41,1],[40,2,41,2],[40,3,41,3],[40,4,41,4],[28,5,29,5],[28,6,28,7],[28,8,28,9],[34,1,34,7],[38,1,38,7],[28,0,29,0],[28,1,29,1],[28,2,29,2],[28,3,29,3],[28,4,29,4],[16,5,17,5],[16,6,16,7],[16,8,16,9],[22,1,22,7],[26,1,26,7],[16,0,17,0],[16,1,17,1],[16,2,17,2],[16,3,17,3],[16,4,17,4],[0,0,0,8],[10,0,10,2],[10,3,10,6],[11,0,11,9],[12,0,12,2],[12,3,12,6],[12,7,12,8],[7,0,7,6],[9,0,9,2],[9,3,9,6],[9,7,9,8],[3,0,3,6],[4,0,4,6],[15,0,15,9],[13,0,13,2],[13,3,13,6],[1,0,1,9],[3,7,3,9],[4,7,4,9],[6,7,6,9],[7,7,7,9],[6,0,6,6],[10,8,10,9],[13,8,13,9],[14,0,14,9],[8,0,8,9],[5,0,5,9],[2,0,2,9]]}
[]
[]
[]
["UNIDADE ESCOLAR",null,null,null,null,null,null,"CÓDIGO INEP"]
[{"$f":"Orçamento!$O$4","v":"ESCOLA ESTADUAL EDMO TEIXEIRA"},null,null,null,null,null,null,{"$f":"Orçamento!$V$4","v":52027147}]
[]
["OBRA",null,null,null,null,null,null,"CIDADE"]
[{"$f":"Orçamento!$O$7","v":"REFORMA E IMPLANTAÇÃO"},null,null,null,null,null,null,{"$f":"Orçamento!$V$7","v":"IPORÁ"}]
[]
["CRE",null,null,"ENDEREÇO",null,null,null,"REFERÊNCIA AGETOP"]
[{"$f":"Orçamento!$O$10","v":"IPORÁ"},null,null,{"$f":"Orçamento!$R$10","v":"AV. CAIAPÓ 282, SAO FRANCISCO, CEP:76200-000"},null,null,null,{"$f":"Orçamento!$V$10","v":"DEZ/18"},{"$f":"Orçamento!$W$10","v":"DESONERADA"}]
[]
["DATA",null,null,"ÁREA TOTAL CONSTRUÍDA (M²)",null,null,null,"REFERÊNCIA SINAPI"]
[{"$f":"Orçamento!$S$7","v":"2020-04-23"},null,null,{"$f":"Orçamento!$S$13","v":1124.3699999999999},null,null,null,{"$f":"Orçamento!$V$13","v":"MAI/19"},{"$f":"Orçamento!$W$13","v":"DESONERADA"}]
[]
["COMPOSIÇÕES DE CUSTOS UNITÁRIOS - SEE-GO"]
[387,"FONTE","CÓDIGO","DESCRIÇÃO","UNIDADE","COEFIC.","CUSTO UNITÁRIO",null,"CUSTO  TOTAL (A) + (B) + (C) + (D) + (E)"]
[null,null,null,null,null,null,"DESONERADO","NÃO DESONER.","DESONERADO","NÃO DESONER."]
[null,"COMPOSIÇÃO","COMP 387_SEE","LÂMPADA LED TUBULAR 18W ","UN ",null,null,null,22.28,22.330000000000002]
[null,"AGETOP_I",8,"AJUDANTE","h     ",1.4999999999999999E-2,8.1999999999999993,9.51,0.12,0.14000000000000001]
[null,"AGETOP_I",12,"ELETRICISTA","h     ",1.4999999999999999E-2,13.4,15.53,0.2,0.23]
[null,null,null,"","",null,0,0,0,0]
[null,"MÃO DE OBRA (B) - TOTAL",null,null,null,null,null,null,0.32,0.37]
[null,"COTAÇÃO","COT 195_SEE","LÂMPADA LED TUBULAR 18W ","UN",1,21.959999999999997,21.959999999999997,21.96,21.96]
[null,null,null,"","",null,0,0,0,0]
[null,null,null,"","",null,0,0,0,0]
[null,"MATERIAL (C) - TOTAL",null,null,null,null,null,null,21.96,21.96]
[]
[24,"FONTE","CÓDIGO","DESCRIÇÃO","UNIDADE","COEFIC.","CUSTO UNITÁRIO",null,"CUSTO  TOTAL (A) + (B) + (C) + (D) + (E)"]
[null,null,null,null,null,null,"DESONERADO","NÃO DESONER.","DESONERADO","NÃO DESONER."]
[null,"COMPOSIÇÃO","COMP 024_SEE","SINALIZADOR FOTOLUMINESCENTE PARA EXTINTOR","UN ",null,"-","-",25.269999999999996,25.389999999999997]
[null,"AGETOP_I",5,"SERVENTE","h     ",0.09,8.1999999999999993,9.51,0.74,0.86]
[null,null,null,"","",null,0,0,0,0]
[null,null,null,"","",null,0,0,0,0]
[null,"MÃO DE OBRA (B) - TOTAL",null,null,null,null,null,null,0.74,0.86]
[null,"AGETOP_I",3070,"BUCHA DE NYLON S-6","un",2,0.04,0.04,0.08,0.08]
[null,"AGETOP_I",3393,"PARAFUSO P/BUCHA S-6","un",2,0.08,0.08,0.16,0.16]
[null,"SINAPI_I",37556,"PLACA DE SINALIZACAO DE SEGURANCA CONTRA INCENDIO, FOTOLUMINESCENTE, QUADRADA, *20 X 20* CM, EM PVC *2* MM ANTI-CHAMAS (SIMBOLOS, CORES E PICTOGRAMAS CONFORME NBR 13434)","UN    ",1,24.29,24.29,24.29,24.29]
[null,"MATERIAL (C) - TOTAL",null,null,null,null,null,null,24.529999999999998,24.529999999999998]
[]
[25,"FONTE","CÓDIGO","DESCRIÇÃO","UNIDADE","COEFIC.","CUSTO UNITÁRIO",null,"CUSTO  TOTAL (A) + (B) + (C) + (D) + (E)"]
[null,null,null,null,null,null,"DESONERADO","NÃO DESONER.","DESONERADO","NÃO DESONER."]
[null,"COMPOSIÇÃO","COMP 025_SEE","SINALIZADOR FOTOLUMINESCENTE DE EMERGÊNCIA","UN ",null,"-","-",25.269999999999996,25.389999999999997]
[null,"AGETOP_I",5,"SERVENTE","h     ",0.09,8.1999999999999993,9.51,0.74,0.86]
[null,"MÃO DE OBRA (B) - TOTAL",null,null,null,null,null,null,0.74,0.86]
[null,"AGETOP_I",3070,"BUCHA DE NYLON S-6","un",2,0.04,0.04,0.08,0.08]
[null,"AGETOP_I",3393,"PARAFUSO P/BUCHA S-6","un",2,0.08,0.08,0.16,0.16]
[null,"SINAPI_I",37556,"PLACA DE SINALIZACAO DE SEGURANCA CONTRA INCENDIO, FOTOLUMINESCENTE, QUADRADA, *20 X 20* CM, EM PVC *2* MM ANTI-CHAMAS (SIMBOLOS, CORES E PICTOGRAMAS CONFORME NBR 13434)","UN    ",1,24.29,24.29,24.29,24.29]
[null,"MATERIAL (C) - TOTAL",null,null,null,null,null,null,24.529999999999998,24.529999999999998]
[]
[277,"FONTE","CÓDIGO","DESCRIÇÃO","UNIDADE","COEFIC.","CUSTO UNITÁRIO",null,"CUSTO  TOTAL (A) + (B) + (C) + (D) + (E)"]
[null,null,null,null,null,null,"DESONERADO","NÃO DESONER.","DESONERADO","NÃO DESONER."]
[null,"COMPOSIÇÃO","COMP 277_SEE","MARCAÇÃO NO PISO - 1X1 M PARA EXTINTOR","M2",null,null,null,27.48,27.53]
[null,"AGETOP_I",5,"SERVENTE","h     ",3.3300000000000003E-2,8.1999999999999993,9.51,0.27,0.32]
[null,null,null,"","",null,0,0,0,0]
[null,null,null,"","",null,0,0,0,0]
[null,"MÃO DE OBRA (B) - TOTAL",null,null,null,null,null,null,0.27,0.32]
[null,"SINAPI_I",5318,"SOLVENTE DILUENTE A BASE DE AGUARRAS","L     ",0.13,11.98,11.98,1.56,1.56]
[null,"SINAPI",5824,"","",3.3E-3,0,0,0,0]
[null,"SINAPI_I",7343,"TINTA A BASE DE RESINA ACRILICA, PARA SINALIZACAO HORIZONTAL VIARIA (NBR 11862)","L     ",0.6,11.05,11.05,6.63,6.63]
[null,"SINAPI_I",7348,"TINTA ACRILICA PREMIUM PARA PISO","L     ",0.03,11.96,11.96,0.36,0.36]
[null,"SINAPI_I",25972,"MICROESFERAS DE VIDRO PARA SINALIZACAO HORIZONTAL VIARIA, TIPO I-B (PREMIX) - NBR 16184","KG    ",2.14,8.7200000000000006,8.7200000000000006,18.66,18.66]
[null,"SINAPI",95133,"","",3.3E-3,0,0,0,0]
[null,"MATERIAL (C) - TOTAL",null,null,null,null,null,null,27.21,27.21]
[]
[382,"FONTE","CÓDIGO","DESCRIÇÃO","UNIDADE","COEFIC.","CUSTO UNITÁRIO",null,"CUSTO  TOTAL (A) + (B) + (C) + (D) + (E)"]
[null,null,null,null,null,null,"DESONERADO","NÃO DESONER.","DESONERADO","NÃO DESONER."]
[null,"COMPOSIÇÃO","COMP 382_SEE","TE DE REDUCAO DE FERRO GALVANIZADO, COM ROSCA BSP, DE 3/4\" X 1/2\"","UN ",null,null,null,21.35,23.44]
[null,"AGETOP_I",8,"AJUDANTE","h     ",0.6,8.1999999999999993,9.51,4.92,5.71]
[null,"AGETOP_I",11,"ENCANADOR","h     ",0.61050000000000004,13.4,15.53,8.18,9.48]
[null,null,null,"","",null,0,0,0,0]
[null,"MÃO DE OBRA (B) - TOTAL",null,null,null,null,null,null,13.1,15.190000000000001]
[null,"SINAPI_I",3146,"FITA VEDA ROSCA EM ROLOS DE 18 MM X 10 M (L X C)","UN    ",0.12075471698113208,3.5,3.5,0.42,0.42]
[null,"SINAPI_I",6302,"TE DE REDUCAO DE FERRO GALVANIZADO, COM ROSCA BSP, DE 3/4\" X 1/2\"","UN    ",1,7.83,7.83,7.83,7.83]
[null,null,null,"","",null,0,0,0,0]
[null,"MATERIAL (C) - TOTAL",null,null,null,null,null,null,8.25,8.25]
[]
[383,"FONTE","CÓDIGO","DESCRIÇÃO","UNIDADE","COEFIC.","CUSTO UNITÁRIO",null,"CUSTO  TOTAL (A) + (B) + (C) + (D) + (E)"]
[null,null,null,null,null,null,"DESONERADO","NÃO DESONER.","DESONERADO","NÃO DESONER."]
[null,"COMPOSIÇÃO","COMP 383_SEE","BUCHA DE REDUCAO DE FERRO GALVANIZADO, COM ROSCA BSP, DE 1/2\" X 1/4\"","UN ",null,null,null,6.67,7.22]
[null,"AGETOP_I",8,"AJUDANTE","h     ",0.16,8.1999999999999993,9.51,1.31,1.52]
[null,"AGETOP_I",11,"ENCANADOR","h     ",0.16,13.4,15.53,2.14,2.48]
[null,null,null,"","",null,0,0,0,0]
[null,"MÃO DE OBRA (B) - TOTAL",null,null,null,null,null,null,3.45,4]
[null,"AGETOP_I","H689","FITA VEDAROSCA 12 MM","m",1.2,0.28000000000000003,0.28000000000000003,0.34,0.34]
[null,"SINAPI_I",770,"BUCHA DE REDUCAO DE FERRO GALVANIZADO, COM ROSCA BSP, DE 1/2\" X 1/4\"","UN    ",1,2.88,2.88,2.88,2.88]
[null,null,null,"","",null,0,0,0,0]
[null,"MATERIAL (C) - TOTAL",null,null,null,null,null,null,3.2199999999999998,3.2199999999999998]
[]
[212,"FONTE","CÓDIGO","DESCRIÇÃO","UNIDADE","COEFIC.","CUSTO UNITÁRIO",null,"CUSTO  TOTAL (A) + (B) + (C) + (D) + (E)"]
[null,null,null,null,null,null,"DESONERADO","NÃO DESONER.","DESONERADO","NÃO DESONER."]
[null,"COMPOSIÇÃO","COMP 212_SEE","NIPLE DE REDUÇÃO 1/2\" X 1/4\" BSP","UN ",null,null,null,9.5,10.050000000000001]
[null,"AGETOP_I",8,"AJUDANTE","h     ",0.16,8.1999999999999993,9.51,1.31,1.52]
[null,"AGETOP_I",11,"ENCANADOR","h     ",0.16,13.4,15.53,2.14,2.48]
[null,null,null,"","",null,0,0,0,0]
[null,"MÃO DE OBRA (B) - TOTAL",null,null,null,null,null,null,3.45,4]
[null,"COTAÇÃO","COT 103_SEE","NIPLE DE REDUÇÃO 1/2\" X 1/4\" BSP","UN",1,6.0533333333333337,6.0533333333333337,6.05,6.05]
[null,null,null,"","",null,0,0,0,0]
[null,null,null,"","",null,0,0,0,0]
[null,"MATERIAL (C) - TOTAL",null,null,null,null,null,null,6.05,6.05]
[]
[213,"FONTE","CÓDIGO","DESCRIÇÃO","UNIDADE","COEFIC.","CUSTO UNITÁRIO",null,"CUSTO  TOTAL (A) + (B) + (C) + (D) + (E)"]
[null,null,null,null,null,null,"DESONERADO","NÃO DESONER.","DESONERADO","NÃO DESONER."]
[null,"COMPOSIÇÃO","COMP 213_SEE","NIPLE DE REDUÇÃO 3/4\" X 1/2\" BSP","UN ",null,null,null,13.16,13.71]
[null,"AGETOP_I",8,"AJUDANTE","h     ",0.16,8.1999999999999993,9.51,1.31,1.52]
[null,"AGETOP_I",11,"ENCANADOR","h     ",0.16,13.4,15.53,2.14,2.48]
[null,null,null,"","",null,0,0,0,0]
[null,"MÃO DE OBRA (B) - TOTAL",null,null,null,null,null,null,3.45,4]
[null,"COTAÇÃO","COT 104_SEE","NIPLE DE REDUÇÃO 3/4\" X 1/2\" BSP","UN",1,9.7099999999999991,9.7099999999999991,9.7100000000000009,9.7100000000000009]
[null,null,null,"","",null,0,0,0,0]
[null,null,null,"","",null,0,0,0,0]
[null,"MATERIAL (C) - TOTAL",null,null,null,null,null,null,9.7100000000000009,9.7100000000000009]
[]
[237,"FONTE","CÓDIGO","DESCRIÇÃO","UNIDADE","COEFIC.","CUSTO UNITÁRIO",null,"CUSTO  TOTAL (A) + (B) + (C) + (D) + (E)"]
[null,null,null,null,null,null,"DESONERADO","NÃO DESONER.","DESONERADO","NÃO DESONER."]
[null,"COMPOSIÇÃO","COMP 237_SEE","FITA ANTICORROSIVA","M",null,null,null,11.14,11.83]
[null,"AGETOP_I",8,"AJUDANTE","h     ",0.2,8.1999999999999993,9.51,1.64,1.9]
[null,"AGETOP_I",12,"ELETRICISTA","h     ",0.2,13.4,15.53,2.68,3.11]
[null,null,null,"","",null,0,0,0,0]
[null,"MÃO DE OBRA (B) - TOTAL",null,null,null,null,null,null,4.32,5.01]
[null,"SINAPI_I",39634,"FITA ADESIVA ANTICORROSIVA DE PVC FLEXIVEL, COR PRETA, PARA PROTECAO TUBULACAO, 50 MM X 30 M (L X C), E= *0,25* MM","M     ",1,6.82,6.82,6.82,6.82]
[null,null,null,"","",null,0,0,0,0]
[null,null,null,"","",null,0,0,0,0]
[null,"MATERIAL (C) - TOTAL",null,null,null,null,null,null,6.82,6.82]
[]
[542,"FONTE","CÓDIGO","DESCRIÇÃO","UNIDADE","COEFIC.","CUSTO UNITÁRIO",null,"CUSTO  TOTAL (A) + (B) + (C) + (D) + (E)"]
[null,null,null,null,null,null,"DESONERADO","NÃO DESONER.","DESONERADO","NÃO DESONER."]
[null,"COMPOSIÇÃO","COMP 542_SEE","VÁLVULA UGV 3/4\" (S) LATÃO","UN ",null,null,null,25.17,26.66]
[null,"AGETOP_I",8,"AJUDANTE","h     ",0.432,8.1999999999999993,9.51,3.54,4.1100000000000003]
[null,"AGETOP_I",11,"ENCANADOR","h     ",0.432,13.4,15.53,5.79,6.71]
[null,null,null,"","",null,0,0,0,0]
[null,"MÃO DE OBRA (B) - TOTAL",null,null,null,null,null,null,9.33,10.82]
[null,"COTAÇÃO","COT 281_SEE","VÁLVULA UGV 3/4\" (S) LATÃO","UN ",1,15.836666666666666,15.836666666666666,15.84,15.84]
[null,null,null,"","",null,0,0,0,0]
[null,null,null,"","",null,0,0,0,0]
[null,"MATERIAL (C) - TOTAL",null,null,null,null,null,null,15.84,15.84]
[]
[543,"FONTE","CÓDIGO","DESCRIÇÃO","UNIDADE","COEFIC.","CUSTO UNITÁRIO",null,"CUSTO  TOTAL (A) + (B) + (C) + (D) + (E)"]
[null,null,null,null,null,null,"DESONERADO","NÃO DESONER.","DESONERADO","NÃO DESONER."]
[null,"COMPOSIÇÃO","COMP 543_SEE","VÁLVULA UGV 1/2\" (S) LATÃO","UN ",null,null,null,24.5,25.990000000000002]
[null,"AGETOP_I",8,"AJUDANTE","h     ",0.432,8.1999999999999993,9.51,3.54,4.1100000000000003]
[null,"AGETOP_I",11,"ENCANADOR","h     ",0.432,13.4,15.53,5.79,6.71]
[null,null,null,"","",null,0,0,0,0]
[null,"MÃO DE OBRA (B) - TOTAL",null,null,null,null,null,null,9.33,10.82]
[null,"COTAÇÃO","COT 282_SEE","VÁLVULA UGV 1/2\" (S) LATÃO","UN ",1,15.166666666666666,15.166666666666666,15.17,15.17]
[null,null,null,"","",null,0,0,0,0]
[null,null,null,"","",null,0,0,0,0]
[null,"MATERIAL (C) - TOTAL",null,null,null,null,null,null,15.17,15.17]
[]
[211,"FONTE","CÓDIGO","DESCRIÇÃO","UNIDADE","COEFIC.","CUSTO UNITÁRIO",null,"CUSTO  TOTAL (A) + (B) + (C) + (D) + (E)"]
[null,null,null,null,null,null,"DESONERADO","NÃO DESONER.","DESONERADO","NÃO DESONER."]
[null,"COMPOSIÇÃO","COMP 211_SEE","REGULADOR DE 2º ESTÁGIO 5KG/H","UN ",null,null,null,85.46,89.419999999999987]
[null,"AGETOP_I",8,"AJUDANTE","h     ",1.1499999999999999,8.1999999999999993,9.51,9.43,10.94]
[null,"AGETOP_I",11,"ENCANADOR","h     ",1.1499999999999999,13.4,15.53,15.41,17.86]
[null,null,null,"","",null,0,0,0,0]
[null,"MÃO DE OBRA (B) - TOTAL",null,null,null,null,null,null,24.84,28.799999999999997]
[null,"COTAÇÃO","COT 102_SEE","REGULADOR DE 2º ESTÁGIO 5KG/H","UN",1,59.833333333333336,59.833333333333336,59.83,59.83]
[null,"AGETOP_I","H689","FITA VEDAROSCA 12 MM","m",2.82,0.28000000000000003,0.28000000000000003,0.79,0.79]
[null,null,null,"","",null,0,0,0,0]
[null,"MATERIAL (C) - TOTAL",null,null,null,null,null,null,60.62,60.62]
[]
[210,"FONTE","CÓDIGO","DESCRIÇÃO","UNIDADE","COEFIC.","CUSTO UNITÁRIO",null,"CUSTO  TOTAL (A) + (B) + (C) + (D) + (E)"]
[null,null,null,null,null,null,"DESONERADO","NÃO DESONER.","DESONERADO","NÃO DESONER."]
[null,"COMPOSIÇÃO","COMP 210_SEE","REGULADOR DE 1º ESTÁGIO 60KG/H MODELO AP-40  COM MANÔMETRO","UN ",null,null,null,231.21,235.17000000000002]
[null,"AGETOP_I",8,"AJUDANTE","h     ",1.1499999999999999,8.1999999999999993,9.51,9.43,10.94]
[null,"AGETOP_I",11,"ENCANADOR","h     ",1.1499999999999999,13.4,15.53,15.41,17.86]
[null,null,null,"","",null,0,0,0,0]
[null,"MÃO DE OBRA (B) - TOTAL",null,null,null,null,null,null,24.84,28.799999999999997]
[null,"COTAÇÃO","COT 101_SEE","REGULADOR DE 1º ESTÁGIO 60KG/H MODELO AP-40  COM MANÔMETRO","UN",1,205.57666666666668,205.57666666666668,205.58,205.58]
[null,"AGETOP_I","H689","FITA VEDAROSCA 12 MM","m",2.82,0.28000000000000003,0.28000000000000003,0.79,0.79]
[null,null,null,"","",null,0,0,0,0]
[null,"MATERIAL (C) - TOTAL",null,null,null,null,null,null,206.37,206.37]
[]
[235,"FONTE","CÓDIGO","DESCRIÇÃO","UNIDADE","COEFIC.","CUSTO UNITÁRIO",null,"CUSTO  TOTAL (A) + (B) + (C) + (D) + (E)"]
[null,null,null,null,null,null,"DESONERADO","NÃO DESONER.","DESONERADO","NÃO DESONER."]
[null,"COMPOSIÇÃO","COMP 235_SEE","PLACA DE SINALIZAÇÃO EM PVC COD 01 - (300X300) PROIBIDO FUMAR","UN ",null,null,null,25.269999999999996,25.389999999999997]
[null,"AGETOP_I",5,"SERVENTE","h     ",0.09,8.1999999999999993,9.51,0.74,0.86]
[null,null,null,"","",null,0,0,0,0]
[null,null,null,"","",null,0,0,0,0]
[null,"MÃO DE OBRA (B) - TOTAL",null,null,null,null,null,null,0.74,0.86]
[null,"AGETOP_I",3070,"BUCHA DE NYLON S-6","un",2,0.04,0.04,0.08,0.08]
[null,"AGETOP_I",3393,"PARAFUSO P/BUCHA S-6","un",2,0.08,0.08,0.16,0.16]
[null,"SINAPI_I",37556,"PLACA DE SINALIZACAO DE SEGURANCA CONTRA INCENDIO, FOTOLUMINESCENTE, QUADRADA, *20 X 20* CM, EM PVC *2* MM ANTI-CHAMAS (SIMBOLOS, CORES E PICTOGRAMAS CONFORME NBR 13434)","UN    ",1,24.29,24.29,24.29,24.29]
[null,"MATERIAL (C) - TOTAL",null,null,null,null,null,null,24.529999999999998,24.529999999999998]
[]
[236,"FONTE","CÓDIGO","DESCRIÇÃO","UNIDADE","COEFIC.","CUSTO UNITÁRIO",null,"CUSTO  TOTAL (A) + (B) + (C) + (D) + (E)"]
[null,null,null,null,null,null,"DESONERADO","NÃO DESONER.","DESONERADO","NÃO DESONER."]
[null,"COMPOSIÇÃO","COMP 236_SEE","PLACA DE SINALIZAÇÃO EM PVC COD 06 - (300X300) PERIGO INFLAMÁVEL","UN ",null,null,null,25.269999999999996,25.389999999999997]
[null,"AGETOP_I",5,"SERVENTE","h     ",0.09,8.1999999999999993,9.51,0.74,0.86]
[null,null,null,"","",null,0,0,0,0]
[null,null,null,"","",null,0,0,0,0]
[null,"MÃO DE OBRA (B) - TOTAL",null,null,null,null,null,null,0.74,0.86]
[null,"AGETOP_I",3070,"BUCHA DE NYLON S-6","un",2,0.04,0.04,0.08,0.08]
[null,"AGETOP_I",3393,"PARAFUSO P/BUCHA S-6","un",2,0.08,0.08,0.16,0.16]
[null,"SINAPI_I",37556,"PLACA DE SINALIZACAO DE SEGURANCA CONTRA INCENDIO, FOTOLUMINESCENTE, QUADRADA, *20 X 20* CM, EM PVC *2* MM ANTI-CHAMAS (SIMBOLOS, CORES E PICTOGRAMAS CONFORME NBR 13434)","UN    ",1,24.29,24.29,24.29,24.29]
[null,"MATERIAL (C) - TOTAL",null,null,null,null,null,null,24.529999999999998,24.529999999999998]
[]
[84,"FONTE","CÓDIGO","DESCRIÇÃO","UNIDADE","COEFIC.","CUSTO UNITÁRIO",null,"CUSTO  TOTAL (A) + (B) + (C) + (D) + (E)"]
[null,null,null,null,null,null,"DESONERADO","NÃO DESONER.","DESONERADO","NÃO DESONER."]
[null,"COMPOSIÇÃO","COMP 084_SEE","GUARDA-CORPO COM CORRIMÃO - SEDUC","M",null,null,null,204.60000000000002,209.46]
[null,"AGETOP_I",25,"OFICIAL \"B\"","h     ",1.1000000000000001,13.4,15.53,14.74,17.079999999999998]
[null,"AGETOP_I",8,"AJUDANTE","h     ",1.1000000000000001,8.1999999999999993,9.51,9.02,10.46]
[null,null,null,"","",null,0,0,0,0]
[null,"MÃO DE OBRA (B) - TOTAL",null,null,null,null,null,null,23.759999999999998,27.54]
[null,"AGETOP_I",2376,"TUBO INDUSTRIAL 2\" CHAPA 13 ","Kg",7.7778,5.23,5.23,40.68,40.68]
[null,"AGETOP_I",2504,"TUBO INDUSTRIAL D=25 MM CHAPA 13 ","Kg",4.6319999999999997,5.07,5.07,23.48,23.48]
[null,"AGETOP_I",2377,"TUBO INDUSTRIAL 40X40 CH.13","Kg",6.3419999999999996,5.07,5.07,32.15,32.15]
[null,"AGETOP_I",2421,"TUBO INDUSTRIAL 1.1/2\" CHAPA 13 ","Kg",1.4862,5.07,5.07,7.54,7.54]
[null,"AGETOP_I",2417,"MASSA PLASTICA","Kg",0.2041,10.58,10.58,2.16,2.16]
[null,"AGETOP_I",2246,"ELETRODO 2.5 OK","Kg",0.11459999999999999,8.6999999999999993,8.6999999999999993,1,1]
[null,"AGETOP_I",1672,"LIXA PARA FERRO ( NÚMERO 100 )","un",0.25509999999999999,2.12,2.12,0.54,0.54]
[null,"AGETOP_I",1264,"DISCO DE DESBASTE 7/8\" P/ CONC./FERRO (1/4\" X 7\")","un",5.0999999999999997E-2,7,7,0.36,0.36]
[null,"AGETOP_I",1334,"DISCO DE CORTE DIAM. 5/8\"- 10\"","un",0.373,5.5,5.5,2.0499999999999998,2.0499999999999998]
[null,"AGETOP_I",2902,"FABRICAÇÃO / MONTAGEM","un",1,50.44,50.44,50.44,50.44]
[null,"AGETOP_I",2150,"CHAPA DE FERRO DOBRADA No.13","Kg",0.43519999999999998,5.28,5.28,2.2999999999999998,2.2999999999999998]
[null,"AGETOP_I",2719,"CHAPA PERFILADA 3/16\"","Kg",1.0979999999999999,5.04,5.04,5.53,5.53]
[null,"AGETOP_I",2436,"ACO CA-25 - 6,3 MM (1/4\") - BARRA LISA A-36","Kg",0.38124999999999998,5.13,5.13,1.96,1.96]
[null,"AGETOP",261602,"PINT.ESMALTE/ESQUAD.FERRO C/FUNDO ANTICOR.","m2    ",0.78,13.65,15.04,10.65,11.73]
[null,"MATERIAL (C) - TOTAL",null,null,null,null,null,null,180.84000000000003,181.92000000000002]