{"text_format":"1","workbook":"xlsx","n_sheets":9,"sheets":["Orçamento","Resumo ","Somatório","Cronog_90_Dias","Composição BDI","Relatório CENTRAL","Parc Maior Relev","Composições","Cotações"],"not_rendered":{"charts":0,"images":3,"macros":1,"external_links":0,"defined_names":81,"comments":3,"pivot_tables":0},"unopened":[],"bounds":{"document_bytes":16777216,"sheet_cells":100000,"rows_first":2000,"rows_last":500,"rows_between":2000,"halvings":0,"cell_chars":16384,"cell_head_chars":4096},"cells_cut":0,"cells_raw":0,"read":"whole","date_system":"1900"}

{"sheet":"Orçamento","index":0,"n_rows":695,"n_cols":24,"rows_kept":695,"cut":false,"hidden":false,"merged":[[676,18,676,20],[676,21,676,22],[677,15,677,17],[677,18,677,20],[677,21,677,22],[678,15,678,17],[678,18,678,20],[678,21,678,22],[673,15,673,17],[673,18,673,20],[673,21,673,22],[674,15,674,17],[674,18,674,20],[674,21,674,22],[675,15,675,17],[675,18,675,20],[675,21,675,22],[687,18,687,20],[687,21,687,22],[682,15,682,17],[682,18,682,20],[682,21,682,22],[683,15,683,17],[683,18,683,20],[683,21,683,22],[684,15,684,17],[684,18,684,20],[684,21,684,22],[663,14,663,17],[670,15,670,17],[636,15,636,17],[691,18,691,20],[691,21,691,22],[679,15,679,17],[679,18,679,20],[679,21,679,22],[680,15,680,17],[680,18,680,20],[680,21,680,22],[681,15,681,17],[681,18,681,20],[681,21,681,22],[685,15,685,17],[685,18,685,20],[685,21,685,22],[686,15,686,17],[686,18,686,20],[686,21,686,22],[687,15,687,17],[676,15,676,17],[631,16,631,22],[694,18,694,20],[694,21,694,22],[691,14,691,17],[688,15,688,17],[688,18,688,20],[688,21,688,22],[689,15,689,17],[689,18,689,20],[689,21,689,22],[690,15,690,17],[690,18,690,20],[690,21,690,22],[693,18,693,20],[693,21,693,22],[692,18,692,20],[692,21,692,22],[669,14,669,23],[670,18,670,20],[670,21,670,22],[671,15,671,17],[671,18,671,20],[671,21,671,22],[672,15,672,17],[672,18,672,20],[672,21,672,22],[627,16,627,22],[628,16,628,22],[629,16,629,22],[3,21,3,22],[2,21,2,22],[5,21,5,22],[10,14,10,23],[13,14,13,23],[6,21,6,22],[9,17,9,20],[2,14,2,20],[3,14,3,20],[5,18,5,20],[6,18,6,20],[11,18,11,20],[12,18,12,20],[6,14,6,17],[5,14,5,17],[649,15,649,17],[650,15,650,17],[651,15,651,17],[652,15,652,17],[653,15,653,17],[654,15,654,17],[655,15,655,17],[656,15,656,17],[657,15,657,17],[637,15,637,17],[638,15,638,17],[639,15,639,17],[640,15,640,17],[641,15,641,17],[642,15,642,17],[643,15,643,17],[644,15,644,17],[645,15,645,17],[658,15,658,17],[659,15,659,17],[660,15,660,17],[661,15,661,17],[662,15,662,17],[635,14,635,23],[624,20,624,21],[623,20,623,21],[619,17,624,17],[619,20,619,21],[636,18,636,20],[636,21,636,22],[637,18,637,20],[637,21,637,22],[625,20,625,21],[645,18,645,20],[645,21,645,22],[646,18,646,20],[646,21,646,22],[647,18,647,20],[647,21,647,22],[648,18,648,20],[648,21,648,22],[660,18,660,20],[663,18,663,20],[663,21,663,22],[660,21,660,22],[661,18,661,20],[661,21,661,22],[662,18,662,20],[662,21,662,22],[652,18,652,20],[652,21,652,22],[659,18,659,20],[659,21,659,22],[654,21,654,22],[655,18,655,20],[655,21,655,22],[657,18,657,20],[653,18,653,20],[653,21,653,22],[654,18,654,20],[664,18,664,20],[664,21,664,22],[651,18,651,20],[651,21,651,22],[644,18,644,20],[644,21,644,22],[666,18,666,20],[666,21,666,22],[620,20,620,21],[642,18,642,20],[642,21,642,22],[643,18,643,20],[643,21,643,22],[641,18,641,20],[641,21,641,22],[650,18,650,20],[621,20,621,21],[632,18,632,22],[638,18,638,20],[638,21,638,22],[639,18,639,20],[639,21,639,22],[640,18,640,20],[640,21,640,22],[630,16,630,22],[8,12,9,12],[665,18,665,20],[665,21,665,22],[0,14,0,22],[8,14,8,16],[9,14,9,16],[11,14,11,16],[12,14,12,16],[14,14,14,22],[1,14,1,22],[4,14,4,22],[7,14,7,22],[649,18,649,20],[649,21,649,22],[657,21,657,22],[646,15,646,17],[647,15,647,17],[648,15,648,17],[650,21,650,22],[658,18,658,20],[658,21,658,22],[656,18,656,20],[656,21,656,22]]}
[]
[]
[null,null,null,null,null,null,null,null,null,null,null,null,null,null,"UNIDADE ESCOLAR",null,null,null,null,null,null,"CÓDIGO INEP"]
[null,null,null,null,null,null,null,null,null,null,null,null,null,null,"COLÉGIO ESTADUAL PROFESSOR HELI ALVES FERREIRA",null,null,null,null,null,null,52020487]
[]
["Nmax",null,null,null,null,null,null,null,null,null,null,null,"Ajustar altura?",null,"OBRA",null,null,null,"DATA",null,null,"CIDADE"]
[{"$f":"MAX($C$18:$C$619)","v":3},null,null,null,null,null,null,null,null,null,null,null,"NÃO",null,"REFORMA E AMPLIAÇÃO",null,null,null,"2020-04-08",null,null,"ANÁPOLIS"]
[]
[null,null,null,null,null,null,null,null,null,null,null,null,"",null,"CRE",null,null,"ENDEREÇO",null,null,null,"REFERÊNCIA AGETOP"]
[null,null,null,null,null,null,null,null,null,null,null,null,null,null,"ANÁPOLIS",null,null,"RUA LOPO DE SOUZA RAMOS S/N PÇA MAJOR HENRIQUE, JUNDIAI, CEP:75110-410",null,null,null,"DEZ/18","DESONERADA"]
[]
[null,null,null,null,null,null,null,null,null,null,null,null,null,null,"ÁREA EXISTENTE (M²)",null,null,"ÁREA A CONSTRUIR (M²)","ÁREA TOTAL CONSTRUÍDA (M²)",null,null,"REFERÊNCIA SINAPI"]
[null,null,null,null,null,null,null,null,null,null,null,null,null,null,1468.27,null,null,120.82,1589.09,null,null,"MAR/19","DESONERADA"]
[]
[null,null,null,null,null,null,null,null,null,null,null,"FILTRO",null,null,"PLANILHA ORÇAMENTÁRIA"]
["Nível E","Save Nivel","Nível C","Altura","n1","n2","n3","n4","n5","Czero","Cnível","↓","Nível","Nível Corrigido","ITEM","TABELA","CODIGO","DESCRIÇÃO DOS SERVIÇOS","UNID","QUANT","MAT","MO","T.SERVIÇO","OBSERVAÇÕES¹"]
[{"$f":"CHOOSE(1+LOG(1+2*(ORÇAMENTO.Nivel=\"Nível 1\")+4*(ORÇAMENTO.Nivel=\"Nível 2\")+8*(ORÇAMENTO.Nivel=\"Nível 3\")+16*(ORÇAMENTO.Nivel=\"Nível 4\")+32*(ORÇAMENTO.Nivel=\"Serviço\"),2),0,1,2,3,4,\"S\")","v":"S"},{"$f":"IF(OR(C17=\"s\",C17=0),OFFSET(B17,-1,0),C17)","v":"Save Nivel"},{"$f":"IF(OFFSET(C17,-1,0)=\"L\",1,IF(OFFSET(C17,-1,0)=1,2,IF(OR(A17=\"s\",A17=0),\"S\",IF(AND(OFFSET(C17,-1,0)=2,A17=4),3,IF(AND(OR(OFFSET(C17,-1,0)=\"s\",OFFSET(C17,-1,0)=0),A17<>\"s\",A17>OFFSET(B17,-1,0)),OFFSET(B17,-1,0),A17)))))","v":"S"},{"$f":"IF(OR(C17=\"S\",C17=0),0,IF(ISERROR(K17),J17,SMALL(J17:K17,1)))","v":0},{"$f":"IF($C17=1,OFFSET(E17,-1,0)+1,OFFSET(E17,-1,0))","v":"n1"},{"$f":"IF($C17=1,0,IF($C17=2,OFFSET(F17,-1,0)+1,OFFSET(F17,-1,0)))","v":"n2"},{"$f":"IF(AND($C17<=2,$C17<>0),0,IF($C17=3,OFFSET(G17,-1,0)+1,OFFSET(G17,-1,0)))","v":"n3"},{"$f":"IF(AND($C17<=3,$C17<>0),0,IF($C17=4,OFFSET(H17,-1,0)+1,OFFSET(H17,-1,0)))","v":"n4"},{"$f":"IF(AND($C17<=4,$C17<>0),0,IF(AND($C17=\"S\",$W17>0),OFFSET(I17,-1,0)+1,OFFSET(I17,-1,0)))","v":"n5"},{"$f":"IF(OR($C17=\"S\",$C17=0),0,MATCH(0,OFFSET($D17,1,$C17,ROW($C$619)-ROW($C17)),0))","v":0},{"$f":"IF(OR($C17=\"S\",$C17=0),0,MATCH(OFFSET($D17,0,$C17)+1,OFFSET($D17,1,$C17,ROW($C$619)-ROW($C17)),0))","v":0},"","Serviço","Serviço","-","SINAPI",null,"(sem código)","-",null,0,0,0,""]
[0,null,"L",{"$f":"COUNTA(OFFSET(D18,1,0):D$619)","v":600},{"$f":"LEFT(O19,1)-1","v":0},null,null,null,null,null,null,"F","LOTE","LOTE","REFORMA E AMPLIAÇÃO - COLÉGIO ESTADUAL PROFESSOR HELI ALVES FERREIRA",null,null,null,null,null,null,null,0]
[1,{"$f":"IF(OR(C19=\"s\",C19=0),OFFSET(B19,-1,0),C19)","v":1},{"$f":"IF(OFFSET(C19,-1,0)=\"L\",1,IF(OFFSET(C19,-1,0)=1,2,IF(OR(A19=\"s\",A19=0),\"S\",IF(AND(OFFSET(C19,-1,0)=2,A19=4),3,IF(AND(OR(OFFSET(C19,-1,0)=\"s\",OFFSET(C19,-1,0)=0),A19<>\"s\",A19>OFFSET(B19,-1,0)),OFFSET(B19,-1,0),A19)))))","v":1},{"$f":"IF(OR(C19=\"S\",C19=0),0,IF(ISERROR(K19),J19,SMALL(J19:K19,1)))","v":263},{"$f":"IF($C19=1,OFFSET(E19,-1,0)+1,OFFSET(E19,-1,0))","v":1},{"$f":"IF($C19=1,0,IF($C19=2,OFFSET(F19,-1,0)+1,OFFSET(F19,-1,0)))","v":0},{"$f":"IF(AND($C19<=2,$C19<>0),0,IF($C19=3,OFFSET(G19,-1,0)+1,OFFSET(G19,-1,0)))","v":0},{"$f":"IF(AND($C19<=3,$C19<>0),0,IF($C19=4,OFFSET(H19,-1,0)+1,OFFSET(H19,-1,0)))","v":0},0,{"$f":"IF(OR($C19=\"S\",$C19=0),0,MATCH(0,OFFSET($D19,1,$C19,ROW($C$619)-ROW($C19)),0))","v":600},{"$f":"IF(OR($C19=\"S\",$C19=0),0,MATCH(OFFSET($D19,0,$C19)+1,OFFSET($D19,1,$C19,ROW($C$619)-ROW($C19)),0))","v":263},"F","Nível 1","Nível 1","1.","AGETOP",null,"REFORMA",null,null,null,null,0]
[2,{"$f":"IF(OR(C20=\"s\",C20=0),OFFSET(B20,-1,0),C20)","v":2},{"$f":"IF(OFFSET(C20,-1,0)=\"L\",1,IF(OFFSET(C20,-1,0)=1,2,IF(OR(A20=\"s\",A20=0),\"S\",IF(AND(OFFSET(C20,-1,0)=2,A20=4),3,IF(AND(OR(OFFSET(C20,-1,0)=\"s\",OFFSET(C20,-1,0)=0),A20<>\"s\",A20>OFFSET(B20,-1,0)),OFFSET(B20,-1,0),A20)))))","v":2},{"$f":"IF(OR(C20=\"S\",C20=0),0,IF(ISERROR(K20),J20,SMALL(J20:K20,1)))","v":14},{"$f":"IF($C20=1,OFFSET(E20,-1,0)+1,OFFSET(E20,-1,0))","v":1},{"$f":"IF($C20=1,0,IF($C20=2,OFFSET(F20,-1,0)+1,OFFSET(F20,-1,0)))","v":1},{"$f":"IF(AND($C20<=2,$C20<>0),0,IF($C20=3,OFFSET(G20,-1,0)+1,OFFSET(G20,-1,0)))","v":0},{"$f":"IF(AND($C20<=3,$C20<>0),0,IF($C20=4,OFFSET(H20,-1,0)+1,OFFSET(H20,-1,0)))","v":0},0,262,14,"","Nível 2","Nível 2","-","AGETOP",null,"SERVIÇOS PRELIMINARES",null,null,null,null,0]
["S",2,"S",0,1,1,0,0,0,0,0,"","Serviço","Serviço","-","SINAPI",97640,"REMOÇÃO DE FORROS DE DRYWALL, PVC E FIBROMINERAL, DE FORMA MANUAL, SEM REAPROVEITAMENTO. AF_12/2017","M2",40,null,null,0,""]
["S",{"$f":"IF(OR(C22=\"s\",C22=0),OFFSET(B22,-1,0),C22)","v":2},{"$f":"IF(OFFSET(C22,-1,0)=\"L\",1,IF(OFFSET(C22,-1,0)=1,2,IF(OR(A22=\"s\",A22=0),\"S\",IF(AND(OFFSET(C22,-1,0)=2,A22=4),3,IF(AND(OR(OFFSET(C22,-1,0)=\"s\",OFFSET(C22,-1,0)=0),A22<>\"s\",A22>OFFSET(B22,-1,0)),OFFSET(B22,-1,0),A22)))))","v":"S"},{"$f":"IF(OR(C22=\"S\",C22=0),0,IF(ISERROR(K22),J22,SMALL(J22:K22,1)))","v":0},1,1,0,0,0,0,0,"","Serviço","Serviço","-","AGETOP",20101,"DEMOLICAO COBERTURA TELHA CERAMICA C/ TRANSP. ATÉ CB. E CARGA","m2    ",30,null,null,0,""]
["S",2,"S",0,1,1,0,0,0,0,0,"","Serviço","Serviço","-","SINAPI",97645,"REMOÇÃO DE JANELAS, DE FORMA MANUAL, SEM REAPROVEITAMENTO. AF_12/2017","M2",6.16,null,null,0,"Referência: AGETOP - 20106"]
["S",2,"S",0,1,1,0,0,0,0,0,"","Serviço","Serviço","-","SINAPI",97644,"REMOÇÃO DE PORTAS, DE FORMA MANUAL, SEM REAPROVEITAMENTO. AF_12/2017","M2",8.61,null,null,0,"Referência: AGETOP - 20106"]
["S",2,"S",0,1,1,0,0,0,0,0,"","Serviço","Serviço","-","AGETOP",20109,"DEM.PISO CIMENT.SOBRE LASTRO CONC.C/TR.ATE CB. E CARGA","m2    ",3.25,null,null,0,""]
["S",2,"S",0,1,1,0,0,0,0,0,"","Serviço","Serviço","-","AGETOP",20121,"DEM. MANUAL EM CONCR.SIMPLES C/TR.ATE CB.E CARGA (O.C.)","m3    ",8,null,null,0,""]
["S",2,"S",0,1,1,0,0,0,0,0,"","Serviço","Serviço","-","SINAPI",97622,"DEMOLIÇÃO DE ALVENARIA DE BLOCO FURADO, DE FORMA MANUAL, SEM REAPROVEITAMENTO. AF_12/2017","M3",2.2999999999999998,null,null,0,"Referência: AGETOP - 20118"]
["S",2,"S",0,1,1,0,0,0,0,0,"","Serviço","Serviço","-","AGETOP",20140,"DEMOLIÇAO DE VÁLVULA DE DESCARGA C/ TRANSP. ATÉ CB. E CARGA","Un    ",3,null,null,0,""]
["S",2,"S",0,1,1,0,0,0,0,0,"","Serviço","Serviço","-","AGETOP",20146,"DEMOLIÇÃO DE MICTÓRIO C/ TRANSP. ATÉ CB. E CARGA","Un    ",1,null,null,0,""]
["S",2,"S",0,1,1,0,0,0,0,0,"","Serviço","Serviço","-","AGETOP",20162,"DEMOLIÇÃO DAS INSTALAÇÕES ELÉTRICAS E AFINS C/ TRANSP. ATÉ CB. E CARGA","H     ",1,null,null,0,""]
["S",2,"S",0,1,1,0,0,0,0,0,"","Serviço","Serviço","-","AGETOP",20163,"DEMOLIÇÃO DAS INSTALAÇÕES HIDROSANITÁRIAS E AFINS C/ TRANSP. ATÉ CB. E CARGA","H     ",3,null,null,0,""]
["S",2,"S",0,1,1,0,0,0,0,0,"","Serviço","Serviço","-","AGETOP",20117,"DEMOL.REVEST.C/ARGAMASSA C/TR.ATE CB.E CARGA","m2    ",12.6,null,null,0,""]
["S",2,"S",0,1,1,0,0,0,0,0,"","Serviço","Serviço","-","SINAPI","74209/1","PLACA DE OBRA EM CHAPA DE ACO GALVANIZADO","M2",4.5,null,null,0,"Referência: AGETOP - 21301"]
[2,2,2,3,1,2,0,0,0,248,3,"","Nível 2","Nível 2","-","AGETOP",null,"TRANSPORTES","-",null,null,null,0,""]
["S",2,"S",0,1,2,0,0,0,0,0,"","Serviço","Serviço","-","SINAPI",72900,"TRANSPORTE DE ENTULHO COM CAMINHAO BASCULANTE 6 M3, RODOVIA PAVIMENTADA, DMT 0,5 A 1,0 KM","M3",5,null,null,0,""]
["S",2,"S",0,1,2,0,0,0,0,0,"","Serviço","Serviço","-","SINAPI",72897,"CARGA MANUAL DE ENTULHO EM CAMINHAO BASCULANTE 6 M3","M3",5,null,null,0,""]
[2,2,2,7,1,3,0,0,0,245,7,"","Nível 2","Nível 2","-","AGETOP",null,"SERVIÇO EM TERRA","-",null,null,null,0,""]
["S",2,"S",0,1,3,0,0,0,0,0,"","Serviço","Serviço","-","SINAPI",79480,"ESCAVACAO MECANICA CAMPO ABERTO EM SOLO EXCETO ROCHA ATE 2,00M PROFUNDIDADE","M3",7.25,null,null,0,"Referência: AGETOP - 41004"]
["S",2,"S",0,1,3,0,0,0,0,0,"","Serviço","Serviço","-","SINAPI",72898,"CARGA E DESCARGA MECANIZADAS DE ENTULHO EM CAMINHAO BASCULANTE 6 M3","M3",7.25,null,null,0,"Referência: AGETOP - 41005"]
["S",2,"S",0,1,3,0,0,0,0,0,"","Serviço","Serviço","-","AGETOP",41012,"INDENIZAÇÃO DE JAZIDA","m3    ",7.25,null,null,0,""]
["S",2,"S",0,1,3,0,0,0,0,0,"","Serviço","Serviço","-","AGETOP",41006,"TRANSPORTE DE MATERIAL ESCAVADO M3.KM","m3km  ",72.5,null,null,0,""]
["S",2,"S",0,1,3,0,0,0,0,0,"","Serviço","Serviço","-","SINAPI","74005/2","COMPACTACAO MECANICA C/ CONTROLE DO GC>=95% DO PN (AREAS) (C/MONIVELADORA 140 HP E ROLO COMPRESSOR VIBRATORIO 80 HP)","M3",5.8,null,null,0,"Referência: AGETOP - 41008"]
[{"$f":"CHOOSE(1+LOG(1+2*(ORÇAMENTO.Nivel=\"Nível 1\")+4*(ORÇAMENTO.Nivel=\"Nível 2\")+8*(ORÇAMENTO.Nivel=\"Nível 3\")+16*(ORÇAMENTO.Nivel=\"Nível 4\")+32*(ORÇAMENTO.Nivel=\"Serviço\"),2),0,1,2,3,4,\"S\")","v":"S"},2,"S",0,{"$f":"IF($C43=1,OFFSET(E43,-1,0)+1,OFFSET(E43,-1,0))","v":1},{"$f":"IF($C43=1,0,IF($C43=2,OFFSET(F43,-1,0)+1,OFFSET(F43,-1,0)))","v":3},{"$f":"IF(AND($C43<=2,$C43<>0),0,IF($C43=3,OFFSET(G43,-1,0)+1,OFFSET(G43,-1,0)))","v":0},{"$f":"IF(AND($C43<=3,$C43<>0),0,IF($C43=4,OFFSET(H43,-1,0)+1,OFFSET(H43,-1,0)))","v":0},{"$f":"IF(AND($C43<=4,$C43<>0),0,IF(AND($C43=\"S\",$W43>0),OFFSET(I43,-1,0)+1,OFFSET(I43,-1,0)))","v":0},0,0,"","Serviço","Serviço","-","AGETOP",41002,"APILOAMENTO","m2    ",32,null,null,0,""]
[2,2,2,116,1,4,0,0,0,238,116,"","Nível 2","Nível 2","-","SINAPI",null,"INSTALAÇÕES ELÉTRICAS","-",null,null,null,0,""]
[3,3,3,56,1,4,1,0,0,115,56,"","Nível 3","Nível 3","-","SINAPI",null,"REFORMA GERAL","-",null,null,null,0,""]
["S",3,"S",0,1,4,1,0,0,0,0,"","Serviço","Serviço","-","SINAPI","74131/7","QUADRO DE DISTRIBUICAO DE ENERGIA DE EMBUTIR, EM CHAPA METALICA, PARA 40 DISJUNTORES TERMOMAGNETICOS MONOPOLARES, COM BARRAMENTO TRIFASICO E NEUTRO, FORNECIMENTO E INSTALACAO","UN",2,null,null,0,""]
["S",3,"S",0,1,4,1,0,0,0,0,"","Serviço","Serviço","-","SINAPI","74131/6","QUADRO DE DISTRIBUICAO DE ENERGIA DE EMBUTIR, EM CHAPA METALICA, PARA 32 DISJUNTORES TERMOMAGNETICOS MONOPOLARES, COM BARRAMENTO TRIFASICO E NEUTRO, FORNECIMENTO E INSTALACAO","UN",1,null,null,0,"Referência: AGETOP - 72198"]
["S",3,"S",0,1,4,1,0,0,0,0,"","Serviço","Serviço","-","AGETOP",71175,"DISJUNTOR TRIPOLAR DE 60 A 100-A","Un    ",4,null,null,0,""]
["S",3,"S",0,1,4,1,0,0,0,0,"","Serviço","Serviço","-","SINAPI","74130/10","DISJUNTOR TERMOMAGNETICO TRIPOLAR EM CAIXA MOLDADA 175 A 225A 240V, FORNECIMENTO E INSTALACAO","UN",2,null,null,0,""]
["S",3,"S",0,1,4,1,0,0,0,0,"","Serviço","Serviço","-","SINAPI",93656,"DISJUNTOR MONOPOLAR TIPO DIN, CORRENTE NOMINAL DE 25A - FORNECIMENTO E INSTALAÇÃO. AF_04/2016","UN",24,null,null,0,""]
["S",3,"S",0,1,4,1,0,0,{"$f":"IF(OR($C51=\"S\",$C51=0),0,MATCH(0,OFFSET($D51,1,$C51,ROW($C$619)-ROW($C51)),0))","v":0},{"$f":"IF(OR($C51=\"S\",$C51=0),0,MATCH(OFFSET($D51,0,$C51)+1,OFFSET($D51,1,$C51,ROW($C$619)-ROW($C51)),0))","v":0},"","Serviço","Serviço","-","SINAPI",93654,"DISJUNTOR MONOPOLAR TIPO DIN, CORRENTE NOMINAL DE 16A - FORNECIMENTO E INSTALAÇÃO. AF_04/2016","UN",19,null,null,0,""]
["S",3,"S",0,1,4,1,0,0,0,0,"","Serviço","Serviço","-","SINAPI",93653,"DISJUNTOR MONOPOLAR TIPO DIN, CORRENTE NOMINAL DE 10A - FORNECIMENTO E INSTALAÇÃO. AF_04/2016","UN",18,null,null,0,""]
["S",3,"S",0,1,4,1,0,0,0,0,"","Serviço","Serviço","-","AGETOP",71184,"DISPOSITIVO DE PROTEÇÃO CONTRA SURTOS (D.P.S.) 275V DE 8 A 40KA","Un    ",3,null,null,0,""]
["S",3,"S",0,1,4,1,0,0,0,0,"","Serviço","Serviço","-","SINAPI",91926,"CABO DE COBRE FLEXÍVEL ISOLADO, 2,5 MM², ANTI-CHAMA 450/750 V, PARA CIRCUITOS TERMINAIS - FORNECIMENTO E INSTALAÇÃO. AF_12/2015","M",2903,null,null,0,"Referência: AGETOP - 70563"]
["S",3,"S",0,1,4,1,0,0,0,0,"","Serviço","Serviço","-","SINAPI",91928,"CABO DE COBRE FLEXÍVEL ISOLADO, 4 MM², ANTI-CHAMA 450/750 V, PARA CIRCUITOS TERMINAIS - FORNECIMENTO E INSTALAÇÃO. AF_12/2015","M",3394.9,null,null,0,"Referência: AGETOP - 70564"]
["S",3,"S",0,1,4,1,0,0,0,0,"","Serviço","Serviço","-","SINAPI",91930,"CABO DE COBRE FLEXÍVEL ISOLADO, 6 MM², ANTI-CHAMA 450/750 V, PARA CIRCUITOS TERMINAIS - FORNECIMENTO E INSTALAÇÃO. AF_12/2015","M",489.15,null,null,0,"Referência: AGETOP - 70565"]
["S",3,"S",0,1,4,1,0,0,0,0,"","Serviço","Serviço","-","SINAPI",92981,"CABO DE COBRE FLEXÍVEL ISOLADO, 16 MM², ANTI-CHAMA 450/750 V, PARA DISTRIBUIÇÃO - FORNECIMENTO E INSTALAÇÃO. AF_12/2015","M",58.4,null,null,0,""]
["S",3,"S",0,1,4,1,0,0,0,0,"","Serviço","Serviço","-","SINAPI",92990,"CABO DE COBRE FLEXÍVEL ISOLADO, 70 MM², ANTI-CHAMA 0,6/1,0 KV, PARA DISTRIBUIÇÃO - FORNECIMENTO E INSTALAÇÃO. AF_12/2015","M",43.2,null,null,0,"Referência: AGETOP - 70514"]
["S",3,"S",0,1,4,1,0,0,0,0,"","Serviço","Serviço","-","SINAPI",92986,"CABO DE COBRE FLEXÍVEL ISOLADO, 35 MM², ANTI-CHAMA 0,6/1,0 KV, PARA DISTRIBUIÇÃO - FORNECIMENTO E INSTALAÇÃO. AF_12/2015","M",10.8,null,null,0,"Referência: AGETOP - 70512"]
["S",3,"S",0,1,4,1,0,0,0,0,"","Serviço","Serviço","-","AGETOP",70541,"CABO DE COBRE NU No. 16 MM2 (6,94 M/KG)","M     ",10,null,null,0,""]
["S",3,"S",0,1,4,1,0,0,0,0,"","Serviço","Serviço","-","AGETOP",70544,"CABO DE COBRE NÚ No. 50 MM2","M     ",25,null,null,0,""]
["S",3,"S",0,1,4,1,0,0,0,0,"","Serviço","Serviço","-","SINAPI",91834,"ELETRODUTO FLEXÍVEL CORRUGADO, PVC, DN 25 MM (3/4\"), PARA CIRCUITOS TERMINAIS, INSTALADO EM FORRO - FORNECIMENTO E INSTALAÇÃO. AF_12/2015","M",150,null,null,0,"Referência: AGETOP - 71194"]
["S",3,"S",0,1,4,1,0,0,0,0,"","Serviço","Serviço","-","SINAPI",91836,"ELETRODUTO FLEXÍVEL CORRUGADO, PVC, DN 32 MM (1\"), PARA CIRCUITOS TERMINAIS, INSTALADO EM FORRO - FORNECIMENTO E INSTALAÇÃO. AF_12/2015","M",50,null,null,0,"Referência: AGETOP - 71195"]
["S",3,"S",0,1,4,1,0,0,0,0,"","Serviço","Serviço","-","SINAPI",91867,"ELETRODUTO RÍGIDO ROSCÁVEL, PVC, DN 25 MM (3/4\"), PARA CIRCUITOS TERMINAIS, INSTALADO EM LAJE - FORNECIMENTO E INSTALAÇÃO. AF_12/2015","M",974.65,null,null,0,"Referência: AGETOP - 71201"]
["S",3,"S",0,1,4,1,0,0,0,0,"","Serviço","Serviço","-","SINAPI",91868,"ELETRODUTO RÍGIDO ROSCÁVEL, PVC, DN 32 MM (1\"), PARA CIRCUITOS TERMINAIS, INSTALADO EM LAJE - FORNECIMENTO E INSTALAÇÃO. AF_12/2015","M",166.7,null,null,0,"Referência: AGETOP - 71202"]
["S",3,"S",0,1,4,1,0,0,0,0,"","Serviço","Serviço","-","SINAPI",93008,"ELETRODUTO RÍGIDO ROSCÁVEL, PVC, DN 50 MM (1 1/2\") - FORNECIMENTO E INSTALAÇÃO. AF_12/2015","M",89.45,null,null,0,""]
["S",3,"S",0,1,4,1,0,0,0,0,"","Serviço","Serviço","-","SINAPI",93012,"ELETRODUTO RÍGIDO ROSCÁVEL, PVC, DN 110 MM (4\") - FORNECIMENTO E INSTALAÇÃO. AF_12/2015","M",27.4,null,null,0,""]
["S",3,"S",0,1,4,1,0,0,0,0,"","Serviço","Serviço","-","AGETOP",70351,"BRACADEIRA METALICA TIPO \"U\" DIAM. 3/4\"","Un    ",325,null,null,0,""]
["S",3,"S",0,1,4,1,0,0,0,0,"","Serviço","Serviço","-","AGETOP",70352,"BRACADEIRA METALICA TIPO \"U\" DIAM. 1\"","Un    ",56,null,null,0,""]
["S",3,"S",0,1,4,1,0,0,0,0,"","Serviço","Serviço","-","AGETOP",70354,"BRACADEIRA METALICA TIPO \"U\" DIAM. 1.1/2\"","Un    ",30,null,null,0,""]
["S",3,"S",0,1,4,1,0,0,0,0,"","Serviço","Serviço","-","AGETOP",70355,"BRACADEIRA METALICA TIPO \"U\" DIAM. 2\"","Un    ",10,null,null,0,""]
["S",3,"S",0,1,4,1,0,0,0,0,"","Serviço","Serviço","-","AGETOP",70358,"BRACADEIRA METALICA TIPO \"U\" DIAM. 4\"","Un    ",10,null,null,0,""]
["S",3,"S",0,1,4,1,0,0,0,0,"","Serviço","Serviço","-","SINAPI",91879,"LUVA PARA ELETRODUTO, PVC, ROSCÁVEL, DN 25 MM (3/4\"), PARA CIRCUITOS TERMINAIS, INSTALADA EM LAJE - FORNECIMENTO E INSTALAÇÃO. AF_12/2015","UN",325,null,null,0,"Referência: AGETOP - 71741"]
["S",3,"S",0,1,4,1,0,0,0,0,"","Serviço","Serviço","-","SINAPI",91880,"LUVA PARA ELETRODUTO, PVC, ROSCÁVEL, DN 32 MM (1\"), PARA CIRCUITOS TERMINAIS, INSTALADA EM LAJE - FORNECIMENTO E INSTALAÇÃO. AF_12/2015","UN",56,null,null,0,"Referência: AGETOP - 71742"]
["S",3,"S",0,1,4,1,0,0,0,0,"","Serviço","Serviço","-","SINAPI",93013,"LUVA PARA ELETRODUTO, PVC, ROSCÁVEL, DN 50 MM (1 1/2\") - FORNECIMENTO E INSTALAÇÃO. AF_12/2015","UN",30,null,null,0,"Referência: AGETOP - 71744"]
["S",3,"S",0,1,4,1,0,0,0,0,"","Serviço","Serviço","-","SINAPI",93014,"LUVA PARA ELETRODUTO, PVC, ROSCÁVEL, DN 60 MM (2\") - FORNECIMENTO E INSTALAÇÃO. AF_12/2015","UN",10,null,null,0,"Referência: AGETOP - 71745"]
["S",3,"S",0,1,4,1,0,0,0,0,"","Serviço","Serviço","-","SINAPI",93017,"LUVA PARA ELETRODUTO, PVC, ROSCÁVEL, DN 110 MM (4\") - FORNECIMENTO E INSTALAÇÃO. AF_12/2015","UN",10,null,null,0,"Referência: AGETOP - 71748"]
["S",3,"S",0,1,4,1,0,0,0,0,"","Serviço","Serviço","-","SINAPI",95801,"CONDULETE DE ALUMÍNIO, TIPO X, PARA ELETRODUTO DE AÇO GALVANIZADO DN 20 MM (3/4''), APARENTE - FORNECIMENTO E INSTALAÇÃO. AF_11/2016_P","UN",200,null,null,0,"Referência: AGETOP - 70929"]
["S",3,"S",0,1,4,1,0,0,0,0,"","Serviço","Serviço","-","SINAPI",91902,"CURVA 90 GRAUS PARA ELETRODUTO, PVC, ROSCÁVEL, DN 25 MM (3/4\"), PARA CIRCUITOS TERMINAIS, INSTALADA EM LAJE - FORNECIMENTO E INSTALAÇÃO. AF_12/2015","UN",90,null,null,0,"Referência: AGETOP - 71141"]
["S",3,"S",0,1,4,1,0,0,0,0,"","Serviço","Serviço","-","SINAPI",91905,"CURVA 90 GRAUS PARA ELETRODUTO, PVC, ROSCÁVEL, DN 32 MM (1\"), PARA CIRCUITOS TERMINAIS, INSTALADA EM LAJE - FORNECIMENTO E INSTALAÇÃO. AF_12/2015","UN",20,null,null,0,"Referência: AGETOP - 71142"]
["S",3,"S",0,1,4,1,0,0,0,0,"","Serviço","Serviço","-","AGETOP",71124,"CURVA 90 GRAUS AÇO ZINCADO DIÂMETRO 1.1/2\"","Un    ",15,null,null,0,""]
[{"$f":"CHOOSE(1+LOG(1+2*(ORÇAMENTO.Nivel=\"Nível 1\")+4*(ORÇAMENTO.Nivel=\"Nível 2\")+8*(ORÇAMENTO.Nivel=\"Nível 3\")+16*(ORÇAMENTO.Nivel=\"Nível 4\")+32*(ORÇAMENTO.Nivel=\"Serviço\"),2),0,1,2,3,4,\"S\")","v":"S"},3,"S",0,1,4,1,0,{"$f":"IF(AND($C82<=4,$C82<>0),0,IF(AND($C82=\"S\",$W82>0),OFFSET(I82,-1,0)+1,OFFSET(I82,-1,0)))","v":0},0,0,"","Serviço","Serviço","-","AGETOP",71128,"CURVA 90 GRAUS AÇO ZINCADO DIÂMETRO 4\"","Un    ",10,null,null,0,""]
["S",3,"S",0,1,4,1,0,0,{"$f":"IF(OR($C83=\"S\",$C83=0),0,MATCH(0,OFFSET($D83,1,$C83,ROW($C$619)-ROW($C83)),0))","v":0},{"$f":"IF(OR($C83=\"S\",$C83=0),0,MATCH(OFFSET($D83,0,$C83)+1,OFFSET($D83,1,$C83,ROW($C$619)-ROW($C83)),0))","v":0},"","Serviço","Serviço","-","SINAPI",92870,"CAIXA RETANGULAR 4\" X 4\" ALTA (2,00 M DO PISO), METÁLICA, INSTALADA EM PAREDE - FORNECIMENTO E INSTALAÇÃO. AF_12/2015","UN",138,null,null,0,""]
["S",3,"S",0,1,4,1,0,0,0,0,"","Serviço","Serviço","-","SINAPI",91953,"INTERRUPTOR SIMPLES (1 MÓDULO), 10A/250V, INCLUINDO SUPORTE E PLACA - FORNECIMENTO E INSTALAÇÃO. AF_12/2015","UN",28,null,null,0,"Referência: AGETOP - 71440"]
["S",3,"S",0,1,4,1,0,0,0,0,"","Serviço","Serviço","-","SINAPI",91959,"INTERRUPTOR SIMPLES (2 MÓDULOS), 10A/250V, INCLUINDO SUPORTE E PLACA - FORNECIMENTO E INSTALAÇÃO. AF_12/2015","UN",9,null,null,0,"Referência: AGETOP - 71441"]
["S",3,"S",0,1,4,1,0,0,0,0,"","Serviço","Serviço","-","SINAPI",91967,"INTERRUPTOR SIMPLES (3 MÓDULOS), 10A/250V, INCLUINDO SUPORTE E PLACA - FORNECIMENTO E INSTALAÇÃO. AF_12/2015","UN",1,null,null,0,"Referência: AGETOP - 71442"]
["S",3,"S",0,1,4,1,0,0,0,0,"","Serviço","Serviço","-","SINAPI",91954,"INTERRUPTOR PARALELO (1 MÓDULO), 10A/250V, SEM SUPORTE E SEM PLACA - FORNECIMENTO E INSTALAÇÃO. AF_12/2015","UN",4,null,null,0,"Referência: AGETOP - 71431"]
["S",3,"S",0,1,4,1,0,0,0,0,"","Serviço","Serviço","-","SINAPI",91996,"TOMADA MÉDIA DE EMBUTIR (1 MÓDULO), 2P+T 10 A, INCLUINDO SUPORTE E PLACA - FORNECIMENTO E INSTALAÇÃO. AF_12/2015","UN",78,null,null,0,"Referência: AGETOP - 72578"]
["S",3,"S",0,1,4,1,0,0,0,0,"","Serviço","Serviço","-","SINAPI",91993,"TOMADA ALTA DE EMBUTIR (1 MÓDULO), 2P+T 20 A, INCLUINDO SUPORTE E PLACA - FORNECIMENTO E INSTALAÇÃO. AF_12/2015","UN",29,null,null,0,"Referência: AGETOP - 72585"]
["S",3,"S",0,1,4,1,0,0,0,0,"","Serviço","Serviço","-","SINAPI",92004,"TOMADA MÉDIA DE EMBUTIR (2 MÓDULOS), 2P+T 10 A, INCLUINDO SUPORTE E PLACA - FORNECIMENTO E INSTALAÇÃO. AF_12/2015","UN",23,null,null,0,"Referência: AGETOP - 72578"]
["S",3,"S",0,1,4,1,0,0,0,0,"","Serviço","Serviço","-","SINAPI",97585,"LUMINÁRIA TIPO CALHA, DE SOBREPOR, COM 2 LÂMPADAS TUBULARES DE 18 W - FORNECIMENTO E INSTALAÇÃO. AF_11/2017","UN",140,null,null,0,""]
["S",3,"S",0,1,4,1,0,0,0,0,"","Serviço","Serviço","-","SINAPI",97593,"LUMINÁRIA TIPO SPOT, DE SOBREPOR, COM 1 LÂMPADA DE 15 W - FORNECIMENTO E INSTALAÇÃO. AF_11/2017","UN",5,null,null,0,"Referência: AGETOP - 71688"]
["S",3,"S",0,1,4,1,0,0,0,0,"","Serviço","Serviço","-","SINAPI",97605,"LUMINÁRIA ARANDELA TIPO MEIA-LUA, PARA 1 LÂMPADA LED - FORNECIMENTO E INSTALAÇÃO. AF_11/2017","UN",11,null,null,0,""]
["S",3,"S",0,1,4,1,0,0,0,0,"","Serviço","Serviço","-","SINAPI",97610,"LÂMPADA COMPACTA DE LED 10 W, BASE E27 - FORNECIMENTO E INSTALAÇÃO. AF_11/2017","UN",296,null,null,0,""]
["S",3,"S",0,1,4,1,0,0,0,0,"","Serviço","Serviço","-","SINAPI",97889,"CAIXA ENTERRADA ELÉTRICA RETANGULAR, EM ALVENARIA COM TIJOLOS CERÂMICOS MACIÇOS, FUNDO COM BRITA, DIMENSÕES INTERNAS: 0,8X0,8X0,6 M. AF_05/2018","UN",4,null,null,0,""]
["S",3,"S",0,1,4,1,0,0,0,0,"","Serviço","Serviço","-","SINAPI",6171,"TAMPA DE CONCRETO ARMADO 60X60X5CM PARA CAIXA","UN",4,null,null,0,""]
["S",3,"S",0,1,4,1,0,0,0,0,"","Serviço","Serviço","-","AGETOP",71861,"PARAFUSO P/BUCHA S-6","Un    ",300,null,null,0,""]
["S",3,"S",0,1,4,1,0,0,0,0,"","Serviço","Serviço","-","AGETOP",70647,"CAIXA DE PASSAGEM METÁLICA DE EMBUTIR 30X30X12 CM","Un    ",2,null,null,0,""]
["S",3,"S",0,1,4,1,0,0,0,0,"","Serviço","Serviço","-","AGETOP",70391,"BUCHA DE NYLON S-6","Un    ",300,null,null,0,""]
["S",3,"S",0,1,4,1,0,0,0,0,"","Serviço","Serviço","-","AGETOP",20162,"DEMOLIÇÃO DAS INSTALAÇÕES ELÉTRICAS E AFINS C/ TRANSP. ATÉ CB. E CARGA","H     ",100,null,null,0,""]
[3,3,3,19,1,4,2,0,0,59,19,"","Nível 3","Nível 3","-",null,"IMPLANTAÇÃO","ALIMENTAÇÃO","-",null,null,null,0,""]
["S",3,"S",0,1,4,2,0,0,0,0,"","Serviço","Serviço","-","SINAPI","74130/5","DISJUNTOR TERMOMAGNETICO TRIPOLAR PADRAO NEMA (AMERICANO) 60 A 100A 240V, FORNECIMENTO E INSTALACAO","UN",1,null,null,0,""]
["S",3,"S",0,1,4,2,0,0,0,0,"","Serviço","Serviço","-","SINAPI",93670,"DISJUNTOR TRIPOLAR TIPO DIN, CORRENTE NOMINAL DE 25A - FORNECIMENTO E INSTALAÇÃO. AF_04/2016","UN",1,null,null,0,"Referência: AGETOP - 71173"]
["S",3,"S",0,1,4,2,0,0,0,0,"","Serviço","Serviço","-","SINAPI",93672,"DISJUNTOR TRIPOLAR TIPO DIN, CORRENTE NOMINAL DE 40A - FORNECIMENTO E INSTALAÇÃO. AF_04/2016","UN",1,null,null,0,"Referência: AGETOP - 71174"]
["S",3,"S",0,1,4,2,0,0,0,0,"","Serviço","Serviço","-","SINAPI",91929,"CABO DE COBRE FLEXÍVEL ISOLADO, 4 MM², ANTI-CHAMA 0,6/1,0 KV, PARA CIRCUITOS TERMINAIS - FORNECIMENTO E INSTALAÇÃO. AF_12/2015","M",494.27,null,null,0,"Referência: AGETOP - 70582"]
["S",3,"S",0,1,4,2,0,0,0,0,"","Serviço","Serviço","-","SINAPI",91930,"CABO DE COBRE FLEXÍVEL ISOLADO, 6 MM², ANTI-CHAMA 450/750 V, PARA CIRCUITOS TERMINAIS - FORNECIMENTO E INSTALAÇÃO. AF_12/2015","M",337.82,null,null,0,"Referência: AGETOP - 70565"]
["S",3,"S",0,1,4,2,0,0,0,0,"","Serviço","Serviço","-","SINAPI",92979,"CABO DE COBRE FLEXÍVEL ISOLADO, 10 MM², ANTI-CHAMA 450/750 V, PARA DISTRIBUIÇÃO - FORNECIMENTO E INSTALAÇÃO. AF_12/2015","M",402.33,null,null,0,""]
["S",3,"S",0,1,4,2,0,0,0,0,"","Serviço","Serviço","-","SINAPI",93008,"ELETRODUTO RÍGIDO ROSCÁVEL, PVC, DN 50 MM (1 1/2\") - FORNECIMENTO E INSTALAÇÃO. AF_12/2015","M",80.477000000000004,null,null,0,""]
["S",3,"S",0,1,4,2,0,0,0,0,"","Serviço","Serviço","-","SINAPI",91868,"ELETRODUTO RÍGIDO ROSCÁVEL, PVC, DN 32 MM (1\"), PARA CIRCUITOS TERMINAIS, INSTALADO EM LAJE - FORNECIMENTO E INSTALAÇÃO. AF_12/2015","M",166.42,null,null,0,"Referência: AGETOP - 71202"]
["S",3,"S",0,1,4,2,0,0,0,0,"","Serviço","Serviço","-","AGETOP",70354,"BRACADEIRA METALICA TIPO \"U\" DIAM. 1.1/2\"","Un    ",27,null,null,0,""]
["S",3,"S",0,1,4,2,0,0,0,0,"","Serviço","Serviço","-","AGETOP",70352,"BRACADEIRA METALICA TIPO \"U\" DIAM. 1\"","Un    ",56,null,null,0,""]
["S",3,"S",0,1,4,2,0,0,0,0,"","Serviço","Serviço","-","SINAPI",91880,"LUVA PARA ELETRODUTO, PVC, ROSCÁVEL, DN 32 MM (1\"), PARA CIRCUITOS TERMINAIS, INSTALADA EM LAJE - FORNECIMENTO E INSTALAÇÃO. AF_12/2015","UN",56,null,null,0,"Referência: AGETOP - 71742"]
["S",3,"S",0,1,4,2,0,0,0,0,"","Serviço","Serviço","-","SINAPI",93013,"LUVA PARA ELETRODUTO, PVC, ROSCÁVEL, DN 50 MM (1 1/2\") - FORNECIMENTO E INSTALAÇÃO. AF_12/2015","UN",27,null,null,0,"Referência: AGETOP - 71744"]
["S",3,"S",0,1,4,2,0,0,0,0,"","Serviço","Serviço","-","AGETOP",70647,"CAIXA DE PASSAGEM METÁLICA DE EMBUTIR 30X30X12 CM","Un    ",10,null,null,0,""]
["S",3,"S",0,1,4,2,0,0,{"$f":"IF(OR($C115=\"S\",$C115=0),0,MATCH(0,OFFSET($D115,1,$C115,ROW($C$619)-ROW($C115)),0))","v":0},{"$f":"IF(OR($C115=\"S\",$C115=0),0,MATCH(OFFSET($D115,0,$C115)+1,OFFSET($D115,1,$C115,ROW($C$619)-ROW($C115)),0))","v":0},"","Serviço","Serviço","-","SINAPI",97889,"CAIXA ENTERRADA ELÉTRICA RETANGULAR, EM ALVENARIA COM TIJOLOS CERÂMICOS MACIÇOS, FUNDO COM BRITA, DIMENSÕES INTERNAS: 0,8X0,8X0,6 M. AF_05/2018","UN",7,null,null,0,""]
["S",3,"S",0,1,4,2,0,0,0,0,"","Serviço","Serviço","-","SINAPI",6171,"TAMPA DE CONCRETO ARMADO 60X60X5CM PARA CAIXA","UN",7,null,null,0,""]
["S",3,"S",0,1,4,2,0,0,0,0,"","Serviço","Serviço","-","SINAPI",92870,"CAIXA RETANGULAR 4\" X 4\" ALTA (2,00 M DO PISO), METÁLICA, INSTALADA EM PAREDE - FORNECIMENTO E INSTALAÇÃO. AF_12/2015","UN",5,null,null,0,""]
["S",3,"S",0,1,4,2,0,0,0,0,"","Serviço","Serviço","-","AGETOP",71861,"PARAFUSO P/BUCHA S-6","Un    ",150,null,null,0,""]
["S",3,"S",0,1,4,2,0,0,0,0,"","Serviço","Serviço","-","AGETOP",70391,"BUCHA DE NYLON S-6","Un    ",150,null,null,0,""]
[3,3,3,40,1,4,3,0,0,40,91,"","Nível 3","Nível 3","-","SINAPI",null,"SUBESTAÇÃO","-",null,null,null,0,""]
["S",3,"S",0,1,4,3,0,0,0,0,"","Serviço","Serviço","-","AGETOP",70386,"BRAÇO C AÇO GALVANIZADO , CONFORME NTD-17","un    ",1,null,null,0,""]
["S",3,"S",0,1,4,3,0,0,0,0,"","Serviço","Serviço","-","SINAPI","73767/2","ALCA PRE-FORMADA DISTRIBUIÇÃO EM  ACO RECOBERTO COM ALUMINIO PARA CABO 25MM2, ENCAPADO. FORNECIMENTO E INSTALAÇÃO.","UN",1,null,null,0,""]
["S",3,"S",0,1,4,3,0,0,0,0,"","Serviço","Serviço","-","SINAPI","73767/1","GRAMPO PARALELO EM ALUMINIO FUNDIDO OU ESTRUDADO DE 2 PARAFUSOS, PARA CABO DE 6 A 50 MM2, PASTA ANTIOXIDANTE. FORNEC E INSTALAÇÃO.","UN",3,null,null,0,""]
["S",3,"S",0,1,4,3,0,0,0,0,"","Serviço","Serviço","-","SINAPI",83377,"CONECTOR DE PARAFUSO FENDIDO EM LIGA DE COBRE COM SEPARADOR DE CABOS PARA CABO 50 MM2 - FORNECIMENTO E INSTALACAO","UN",6,null,null,0,""]
["S",3,"S",0,1,4,3,0,0,0,0,"","Serviço","Serviço","-","SINAPI",72263,"TERMINAL OU CONECTOR DE PRESSAO - PARA CABO 50MM2 - FORNECIMENTO E INSTALACAO","UN",1,null,null,0,""]
["S",3,"S",0,1,4,3,0,0,0,0,"","Serviço","Serviço","-","AGETOP",71833,"PARA RAIOS DISTRIBUIDOR POLIMÉRICO ÓXIDO DE ZINCO S/CENTELHADOR C/ DESLIGAMENTO AUTOMÁTICO 15KV,10KA","Un    ",3,null,null,0,""]
["S",3,"S",0,1,4,3,0,0,0,0,"","Serviço","Serviço","-","SINAPI",88544,"ARMACAO SECUNDARIA OU REX COMPLETA PARA DUAS LINHAS-FORNECIMENTO E INSTALACAO.","UN",1,null,null,0,""]
["S",3,"S",0,1,4,3,0,0,0,0,"","Serviço","Serviço","-","COMPOSIÇÃO","COMP 046_SEE","CAPUZ PARA PROTEÇÃO DOS PARA RAIOS","UN ",3,null,null,0,""]
["S",3,"S",0,1,4,3,0,0,0,0,"","Serviço","Serviço","-","COMPOSIÇÃO","COMP 047_SEE","CAPUZ DE PROTEÇÃO PARA BUCHA DE TRANSFORMADOR","UN ",3,null,null,0,""]
["S",3,"S",0,1,4,3,0,0,0,0,"","Serviço","Serviço","-","COMPOSIÇÃO","COMP 048_SEE","HASTE ROSQUEADA \"TIRANTE\" 3/8\"","M",0.5,null,null,0,""]
["S",3,"S",0,1,4,3,0,0,0,0,"","Serviço","Serviço","-","COMPOSIÇÃO","COMP 049_SEE","PORCA SEXTAVADA 3/8\"","UN ",8,null,null,0,""]
["S",3,"S",0,1,4,3,0,0,0,0,"","Serviço","Serviço","-","SINAPI","73781/2","ISOLADOR DE PINO TP HI-POT CILINDRICO CLASSE 15KV. FORNECIMENTO E INSTALACAO.","UN",3,null,null,0,""]
["S",3,"S",0,1,4,3,0,0,0,0,"","Serviço","Serviço","-","SINAPI","73781/3","ISOLADOR DE SUSPENSAO (DISCO) TP CAVILHA CLASSE 15KV - 6''. FORNECIMENTO E INSTALACAO.","UN",1,null,null,0,""]
["S",3,"S",0,1,4,3,0,0,0,0,"","Serviço","Serviço","-","AGETOP",70252,"ARRUELA LISA D=5/16\"","Un    ",8,null,null,0,""]
["S",3,"S",0,1,4,3,0,0,0,0,"","Serviço","Serviço","-","AGETOP",70695,"CAIXA METÁLICA PARA PROTEÇÃO GERAL 580X500X216MM ATÉ 175A","Un    ",1,null,null,0,""]
["S",3,"S",0,1,4,3,0,0,0,0,"","Serviço","Serviço","-","AGETOP",70695,"CAIXA METÁLICA PARA PROTEÇÃO GERAL 580X500X216MM ATÉ 175A","Un    ",1,null,null,0,""]
["S",3,"S",0,1,4,3,0,0,0,0,"","Serviço","Serviço","-","AGETOP",70725,"CAIXA METÁLICA PARA T.C. 580X500X216MM - ATÉ 175A","Un    ",1,null,null,0,""]
["S",3,"S",0,1,4,3,0,0,0,0,"","Serviço","Serviço","-","SINAPI",93205,"CINTA DE AMARRAÇÃO DE ALVENARIA MOLDADA IN LOCO COM UTILIZAÇÃO DE BLOCOS CANALETA. AF_03/2016","M",6,null,null,0,""]
["S",3,"S",0,1,4,3,0,0,0,0,"","Serviço","Serviço","-","AGETOP",71268,"ELO FUSÍVEL 6 K","Un    ",3,null,null,0,""]
["S",3,"S",0,1,4,3,0,0,0,0,"","Serviço","Serviço","-","AGETOP",71186,"DISPOSITIVO DE PROTEÇÃO CONTRA SURTOS (D.P.S.) 275V DE 90KA","Un    ",3,null,null,0,""]
["S",3,"S",0,1,4,3,0,0,0,0,"","Serviço","Serviço","-","AGETOP",71320,"FITA DE AUTO FUSAO, ROLO DE 2,00 M","Un    ",5,null,null,0,""]
["S",3,"S",0,1,4,3,0,0,0,0,"","Serviço","Serviço","-","AGETOP",70771,"CANTONEIRA AUXILIAR PARA BRAÇO TIPO C","un    ",3,null,null,0,""]
["S",3,"S",0,1,4,3,0,0,0,0,"","Serviço","Serviço","-","SINAPI",93022,"CURVA 90 GRAUS PARA ELETRODUTO, PVC, ROSCÁVEL, DN 75 MM (2 1/2\") - FORNECIMENTO E INSTALAÇÃO. AF_12/2015","UN",2,null,null,0,""]
["S",3,"S",0,1,4,3,0,0,0,0,"","Serviço","Serviço","-","AGETOP",72329,"SAPATILHA DE AÇO GALVANIZADO PARA POSTE COM TRANSFORMADOR","un    ",3,null,null,0,""]
["S",3,"S",0,1,4,3,0,0,0,0,"","Serviço","Serviço","-","AGETOP",71795,"OLHAL PARA PARAFUSO","un    ",3,null,null,0,""]
["S",3,"S",0,1,4,3,0,0,0,0,"","Serviço","Serviço","-","AGETOP",71761,"MURETA MEDIÇÃO ALVEN. 1 1/2 V.(35CM) REBOC.C/PINTURA ACRÍL. E LAJE CONC. 20MPA MALHA 8.0MM CADA 10CM REVEST.C/ARGAMASSA 1:3 C/ IMPERMEABILIZANTE","m2    ",1,null,null,0,""]
["S",3,"S",0,1,4,3,0,0,{"$f":"IF(OR($C147=\"S\",$C147=0),0,MATCH(0,OFFSET($D147,1,$C147,ROW($C$619)-ROW($C147)),0))","v":0},{"$f":"IF(OR($C147=\"S\",$C147=0),0,MATCH(OFFSET($D147,0,$C147)+1,OFFSET($D147,1,$C147,ROW($C$619)-ROW($C147)),0))","v":0},"","Serviço","Serviço","-","AGETOP",71776,"NIPLE METALICO Fo.Zo. DIAMETRO 2.1/2\"","Un    ",2,null,null,0,""]
["S",3,"S",0,1,4,3,0,0,0,0,"","Serviço","Serviço","-","AGETOP",71791,"NIPLE DUPLO FERRO GALVANIZADO 2\"","Un    ",1,null,null,0,""]
["S",3,"S",0,1,4,3,0,0,0,0,"","Serviço","Serviço","-","SINAPI",73624,"SUPORTE PARA TRANSFORMADOR EM POSTE DE CONCRETO CIRCULAR","UN",2,null,null,0,""]
["S",3,"S",0,1,4,3,0,0,0,0,"","Serviço","Serviço","-","AGETOP",72060,"POSTE DE CONCRETO SC 11/400 - SEM FUNDAÇÃO/CONCRETO","Un    ",1,null,null,0,""]
["S",3,"S",0,1,4,3,0,0,0,0,"","Serviço","Serviço","-","AGETOP",72000,"POSTE - ENGASTAMENTO SIMPLES PARA POSTE DE CONCRETO SEÇÃO CIRCULAR","m3    ",0.2,null,null,0,""]
["S",3,"S",0,1,4,3,0,0,0,0,"","Serviço","Serviço","-","SINAPI",72263,"TERMINAL OU CONECTOR DE PRESSAO - PARA CABO 50MM2 - FORNECIMENTO E INSTALACAO","UN",3,null,null,0,""]
["S",3,"S",0,1,4,3,0,0,0,0,"","Serviço","Serviço","-","AGETOP",72535,"TERMINAL DE PRESSAO 70 MMM2","Un    ",2,null,null,0,""]
["S",3,"S",0,1,4,3,0,0,0,0,"","Serviço","Serviço","-","AGETOP",72528,"TERMINAL DE PRESSAO 35 MM2","Un    ",5,null,null,0,""]
["S",3,"S",0,1,4,3,0,0,0,0,"","Serviço","Serviço","-","AGETOP",72518,"TERMINAL DE PRESSAO 10 MM2","Un    ",1,null,null,0,""]
["S",3,"S",0,1,4,3,0,0,0,0,"","Serviço","Serviço","-","AGETOP",72550,"TERMINAL DE PRESSAO 150 MM2","Un    ",10,null,null,0,""]
["S",3,"S",0,1,4,3,0,0,0,0,"","Serviço","Serviço","-","SINAPI","73857/2","TRANSFORMADOR DISTRIBUICAO  112,5KVA TRIFASICO 60HZ CLASSE 15KV IMERSO EM ÓLEO MINERAL FORNECIMENTO E INSTALACAO","UN",1,null,null,0,""]
["S",3,"S",0,1,4,3,0,0,0,0,"","Serviço","Serviço","-","AGETOP",72630,"TRILHO OU SUPORTE P/BORNE TERMINAL","M     ",0.2,null,null,0,""]
["S",3,"S",0,1,4,3,0,0,0,0,"","Serviço","Serviço","-","AGETOP",72080,"POSTE/TRAFO - CAMINHÃO MUNCK 12 TON. (MÍNIMO 4H/DIA)","H     ",8,null,null,0,""]
[{"$f":"CHOOSE(1+LOG(1+2*(ORÇAMENTO.Nivel=\"Nível 1\")+4*(ORÇAMENTO.Nivel=\"Nível 2\")+8*(ORÇAMENTO.Nivel=\"Nível 3\")+16*(ORÇAMENTO.Nivel=\"Nível 4\")+32*(ORÇAMENTO.Nivel=\"Serviço\"),2),0,1,2,3,4,\"S\")","v":2},{"$f":"IF(OR(C160=\"s\",C160=0),OFFSET(B160,-1,0),C160)","v":2},{"$f":"IF(OFFSET(C160,-1,0)=\"L\",1,IF(OFFSET(C160,-1,0)=1,2,IF(OR(A160=\"s\",A160=0),\"S\",IF(AND(OFFSET(C160,-1,0)=2,A160=4),3,IF(AND(OR(OFFSET(C160,-1,0)=\"s\",OFFSET(C160,-1,0)=0),A160<>\"s\",A160>OFFSET(B160,-1,0)),OFFSET(B160,-1,0),A160)))))","v":2},{"$f":"IF(OR(C160=\"S\",C160=0),0,IF(ISERROR(K160),J160,SMALL(J160:K160,1)))","v":58},{"$f":"IF($C160=1,OFFSET(E160,-1,0)+1,OFFSET(E160,-1,0))","v":1},{"$f":"IF($C160=1,0,IF($C160=2,OFFSET(F160,-1,0)+1,OFFSET(F160,-1,0)))","v":5},{"$f":"IF(AND($C160<=2,$C160<>0),0,IF($C160=3,OFFSET(G160,-1,0)+1,OFFSET(G160,-1,0)))","v":0},{"$f":"IF(AND($C160<=3,$C160<>0),0,IF($C160=4,OFFSET(H160,-1,0)+1,OFFSET(H160,-1,0)))","v":0},{"$f":"IF(AND($C160<=4,$C160<>0),0,IF(AND($C160=\"S\",$W160>0),OFFSET(I160,-1,0)+1,OFFSET(I160,-1,0)))","v":0},122,58,"","Nível 2","Nível 2","-","AGETOP",null,"INSTALAÇÕES HIDROSSANITÁRIAS","-",null,null,null,0,""]
[3,3,3,23,1,5,1,0,0,57,23,"","Nível 3","Nível 3","-","SINAPI",null,"PEÇAS E ACESSÓRIOS","-",null,null,null,0,""]
["S",3,"S",0,1,5,1,0,0,0,0,"","Serviço","Serviço","-","AGETOP",70709,"CAIXA DE PASSAGEM 20X20X25CM FUNDO BRITA SEM TAMPA","Un    ",2,null,null,0,""]
["S",3,"S",0,1,5,1,0,0,0,0,"","Serviço","Serviço","-","SINAPI",6171,"TAMPA DE CONCRETO ARMADO 60X60X5CM PARA CAIXA","UN",1,null,null,0,""]
["S",3,"S",0,1,5,1,0,0,0,0,"","Serviço","Serviço","-","AGETOP",81825,"CAIXA DE PASSAGEM 60 X 60 CM SEM TAMPA","Un    ",1,null,null,0,""]
["S",3,"S",0,1,5,1,0,0,0,0,"","Serviço","Serviço","-","SINAPI",95470,"VASO SANITARIO SIFONADO CONVENCIONAL COM LOUÇA BRANCA, INCLUSO CONJUNTO DE LIGAÇÃO PARA BACIA SANITÁRIA AJUSTÁVEL - FORNECIMENTO E INSTALAÇÃO. AF_10/2016","UN",1,null,null,0,""]
["S",3,"S",0,1,5,1,0,0,0,0,"","Serviço","Serviço","-","AGETOP",80510,"ANEL DE VEDAÇÃO PARA VASO SANITÁRIO","Un    ",1,null,null,0,""]
["S",3,"S",0,1,5,1,0,0,{"$f":"IF(OR($C167=\"S\",$C167=0),0,MATCH(0,OFFSET($D167,1,$C167,ROW($C$619)-ROW($C167)),0))","v":0},{"$f":"IF(OR($C167=\"S\",$C167=0),0,MATCH(OFFSET($D167,0,$C167)+1,OFFSET($D167,1,$C167,ROW($C$619)-ROW($C167)),0))","v":0},"","Serviço","Serviço","-","AGETOP",80513,"TUBO PARA VÁLVULA DE DESCARGA ( CURTO 1.1/4\" )","Un    ",1,null,null,0,""]
["S",3,"S",0,1,5,1,0,0,0,0,"","Serviço","Serviço","-","SINAPI",99635,"VÁLVULA DE DESCARGA METÁLICA, BASE 1 1/2 \", ACABAMENTO METALICO CROMADO - FORNECIMENTO E INSTALAÇÃO. AF_01/2019","UN",4,null,null,0,"Referência: AGETOP - 80515"]
["S",3,"S",0,1,5,1,0,0,0,0,"","Serviço","Serviço","-","AGETOP",80520,"CONJUNTO DE FIXACAO P/VASO SANITARIO (PAR)","CJ    ",1,null,null,0,""]
["S",3,"S",0,1,5,1,0,0,0,0,"","Serviço","Serviço","-","SINAPI",95544,"PAPELEIRA DE PAREDE EM METAL CROMADO SEM TAMPA, INCLUSO FIXAÇÃO. AF_10/2016","UN",1,null,null,0,""]
["S",3,"S",0,1,5,1,0,0,0,0,"","Serviço","Serviço","-","AGETOP",80543,"LAVATÓRIO DE CANTO SEM COLUNA ","un    ",1,null,null,0,""]
["S",3,"S",0,1,5,1,0,0,0,0,"","Serviço","Serviço","-","AGETOP",80550,"FIXACAO P/LAVATORIO (PAR)","PAR   ",1,null,null,0,""]
["S",3,"S",0,1,5,1,0,0,0,0,"","Serviço","Serviço","-","SINAPI",86883,"SIFÃO DO TIPO FLEXÍVEL EM PVC 1\u0094 X 1.1/2\u0094 - FORNECIMENTO E INSTALAÇÃO. AF_12/2013","UN",8,null,null,0,""]
["S",3,"S",0,1,5,1,0,0,0,0,"","Serviço","Serviço","-","SINAPI",86915,"TORNEIRA CROMADA DE MESA, 1/2\" OU 3/4\", PARA LAVATÓRIO, PADRÃO MÉDIO - FORNECIMENTO E INSTALAÇÃO. AF_12/2013","UN",8,null,null,0,"Referência: AGETOP - 80570"]
["S",3,"S",0,1,5,1,0,0,0,0,"","Serviço","Serviço","-","SINAPI",86877,"VÁLVULA EM METAL CROMADO 1.1/2\" X 1.1/2\" PARA TANQUE OU LAVATÓRIO, COM OU SEM LADRÃO - FORNECIMENTO E INSTALAÇÃO. AF_12/2013","UN",1,null,null,0,"Referência: AGETOP - 80580"]
["S",3,"S",0,1,5,1,0,0,0,0,"","Serviço","Serviço","-","SINAPI","74234/1","MICTORIO SIFONADO DE LOUCA BRANCA COM PERTENCES, COM REGISTRO DE PRESSAO 1/2\" COM CANOPLA CROMADA ACABAMENTO SIMPLES E CONJUNTO PARA FIXACAO  - FORNECIMENTO E INSTALACAO","UN",1,null,null,0,"Referência: AGETOP - 80601"]
["S",3,"S",0,1,5,1,0,0,0,0,"","Serviço","Serviço","-","AGETOP",80610,"KIT FERR.P/MICT.LOUCA (ESPUDE,CONEXÃO ENTR.PARAFUSOS)","Un    ",1,null,null,0,""]
["S",3,"S",0,1,5,1,0,0,0,0,"","Serviço","Serviço","-","AGETOP",81791,"GRELHA REDONDA BRANCA DIAM. 150 MM","Un    ",1,null,null,0,""]
["S",3,"S",0,1,5,1,0,0,0,0,"","Serviço","Serviço","-","AGETOP",81663,"CORPO CX. SIFONADA DIAM. 150 X 150 X 50","Un    ",1,null,null,0,""]
["S",3,"S",0,1,5,1,0,0,0,0,"","Serviço","Serviço","-","AGETOP",81696,"PROLONGAMENTO PARA CAIXA SIFONADA 150 MM","M     ",1,null,null,0,""]
["S",3,"S",0,1,5,1,0,0,0,0,"","Serviço","Serviço","-","AGETOP",81501,"ADESIVO PLASTICO - FRASCO 850 G","Un    ",1,null,null,0,""]
["S",3,"S",0,1,5,1,0,0,0,0,"","Serviço","Serviço","-","AGETOP",81504,"SOLUCAO LIMPADORA 1000 CM3","Un    ",1,null,null,0,""]
["S",3,"S",0,1,5,1,0,0,0,0,"","Serviço","Serviço","-","AGETOP",81885,"TERMINAL DE VENTILACAO DIAMETRO 50 MM","Un    ",1,null,null,0,""]
[{"$f":"CHOOSE(1+LOG(1+2*(ORÇAMENTO.Nivel=\"Nível 1\")+4*(ORÇAMENTO.Nivel=\"Nível 2\")+8*(ORÇAMENTO.Nivel=\"Nível 3\")+16*(ORÇAMENTO.Nivel=\"Nível 4\")+32*(ORÇAMENTO.Nivel=\"Serviço\"),2),0,1,2,3,4,\"S\")","v":3},{"$f":"IF(OR(C184=\"s\",C184=0),OFFSET(B184,-1,0),C184)","v":3},{"$f":"IF(OFFSET(C184,-1,0)=\"L\",1,IF(OFFSET(C184,-1,0)=1,2,IF(OR(A184=\"s\",A184=0),\"S\",IF(AND(OFFSET(C184,-1,0)=2,A184=4),3,IF(AND(OR(OFFSET(C184,-1,0)=\"s\",OFFSET(C184,-1,0)=0),A184<>\"s\",A184>OFFSET(B184,-1,0)),OFFSET(B184,-1,0),A184)))))","v":3},{"$f":"IF(OR(C184=\"S\",C184=0),0,IF(ISERROR(K184),J184,SMALL(J184:K184,1)))","v":15},{"$f":"IF($C184=1,OFFSET(E184,-1,0)+1,OFFSET(E184,-1,0))","v":1},{"$f":"IF($C184=1,0,IF($C184=2,OFFSET(F184,-1,0)+1,OFFSET(F184,-1,0)))","v":5},{"$f":"IF(AND($C184<=2,$C184<>0),0,IF($C184=3,OFFSET(G184,-1,0)+1,OFFSET(G184,-1,0)))","v":2},{"$f":"IF(AND($C184<=3,$C184<>0),0,IF($C184=4,OFFSET(H184,-1,0)+1,OFFSET(H184,-1,0)))","v":0},{"$f":"IF(AND($C184<=4,$C184<>0),0,IF(AND($C184=\"S\",$W184>0),OFFSET(I184,-1,0)+1,OFFSET(I184,-1,0)))","v":0},34,15,"","Nível 3","Nível 3","-","SINAPI",null,"ÁGUA FRIA","-",null,null,null,0,""]
["S",3,"S",0,1,5,2,0,0,0,0,"","Serviço","Serviço","-","AGETOP",80905,"REGISTRO DE GAVETA BRUTO DIAMETRO 1.1/2\"","Un    ",1,null,null,0,""]
["S",3,"S",0,1,5,2,0,0,0,0,"","Serviço","Serviço","-","AGETOP",80910,"REGISTRO DE GAVETA BRUTO DIAMETRO 2.1/2\"","Un    ",2,null,null,0,""]
["S",3,"S",0,1,5,2,0,0,0,0,"","Serviço","Serviço","-","SINAPI",89402,"TUBO, PVC, SOLDÁVEL, DN 25MM, INSTALADO EM RAMAL DE DISTRIBUIÇÃO DE ÁGUA - FORNECIMENTO E INSTALAÇÃO. AF_12/2014","M",4,null,null,0,"Referência: AGETOP - 81003"]
["S",3,"S",0,1,5,2,0,0,0,0,"","Serviço","Serviço","-","SINAPI",89449,"TUBO, PVC, SOLDÁVEL, DN 50MM, INSTALADO EM PRUMADA DE ÁGUA - FORNECIMENTO E INSTALAÇÃO. AF_12/2014","M",9,null,null,0,""]
["S",3,"S",0,1,5,2,0,0,0,0,"","Serviço","Serviço","-","SINAPI",89450,"TUBO, PVC, SOLDÁVEL, DN 60MM, INSTALADO EM PRUMADA DE ÁGUA - FORNECIMENTO E INSTALAÇÃO. AF_12/2014","M",20,null,null,0,""]
["S",3,"S",0,1,5,2,0,0,0,0,"","Serviço","Serviço","-","AGETOP",80556,"LIGAÇÃO FLEXÍVEL PVC DIAM.1/2\" (ENGATE)","Un    ",1,null,null,0,""]
["S",3,"S",0,1,5,2,0,0,0,0,"","Serviço","Serviço","-","SINAPI",89596,"ADAPTADOR CURTO COM BOLSA E ROSCA PARA REGISTRO, PVC, SOLDÁVEL, DN 50MM X 1.1/2\u0094, INSTALADO EM PRUMADA DE ÁGUA - FORNECIMENTO E INSTALAÇÃO. AF_12/2014","UN",1,null,null,0,"Referência: AGETOP - 81069"]
["S",3,"S",0,1,5,2,0,0,0,0,"","Serviço","Serviço","-","SINAPI",89605,"LUVA DE REDUÇÃO, PVC, SOLDÁVEL, DN 60MM X 50MM, INSTALADO EM PRUMADA DE ÁGUA - FORNECIMENTO E INSTALAÇÃO. AF_12/2014","UN",1,null,null,0,""]
["S",3,"S",0,1,5,2,0,0,0,0,"","Serviço","Serviço","-","AGETOP",81180,"BUCHA DE REDUCAO SOLDAVEL LONGA 50 X 32 mm","Un    ",1,null,null,0,""]
["S",3,"S",0,1,5,2,0,0,0,0,"","Serviço","Serviço","-","SINAPI",89481,"JOELHO 90 GRAUS, PVC, SOLDÁVEL, DN 25MM, INSTALADO EM PRUMADA DE ÁGUA - FORNECIMENTO E INSTALAÇÃO. AF_12/2014","UN",3,null,null,0,""]
[{"$f":"CHOOSE(1+LOG(1+2*(ORÇAMENTO.Nivel=\"Nível 1\")+4*(ORÇAMENTO.Nivel=\"Nível 2\")+8*(ORÇAMENTO.Nivel=\"Nível 3\")+16*(ORÇAMENTO.Nivel=\"Nível 4\")+32*(ORÇAMENTO.Nivel=\"Serviço\"),2),0,1,2,3,4,\"S\")","v":"S"},3,"S",0,1,5,2,0,{"$f":"IF(AND($C195<=4,$C195<>0),0,IF(AND($C195=\"S\",$W195>0),OFFSET(I195,-1,0)+1,OFFSET(I195,-1,0)))","v":0},0,0,"","Serviço","Serviço","-","SINAPI",89501,"JOELHO 90 GRAUS, PVC, SOLDÁVEL, DN 50MM, INSTALADO EM PRUMADA DE ÁGUA - FORNECIMENTO E INSTALAÇÃO. AF_12/2014","UN",4,null,null,0,""]
["S",3,"S",0,1,5,2,0,0,0,0,"","Serviço","Serviço","-","SINAPI",94680,"JOELHO 90 GRAUS, PVC, SOLDÁVEL, DN 60 MM INSTALADO EM RESERVAÇÃO DE ÁGUA DE EDIFICAÇÃO QUE POSSUA RESERVATÓRIO DE FIBRA/FIBROCIMENTO   FORNECIMENTO E INSTALAÇÃO. AF_06/2016","UN",4,null,null,0,"Referência: AGETOP - 81325"]
["S",3,"S",0,{"$f":"IF($C197=1,OFFSET(E197,-1,0)+1,OFFSET(E197,-1,0))","v":1},{"$f":"IF($C197=1,0,IF($C197=2,OFFSET(F197,-1,0)+1,OFFSET(F197,-1,0)))","v":5},{"$f":"IF(AND($C197<=2,$C197<>0),0,IF($C197=3,OFFSET(G197,-1,0)+1,OFFSET(G197,-1,0)))","v":2},{"$f":"IF(AND($C197<=3,$C197<>0),0,IF($C197=4,OFFSET(H197,-1,0)+1,OFFSET(H197,-1,0)))","v":0},0,0,0,"","Serviço","Serviço","-","AGETOP",81360,"JOELHO RED.90 GRAUS SOLD.C/BUCHA LATAO 25X1/2\"","Un    ",1,null,null,0,""]
["S",{"$f":"IF(OR(C198=\"s\",C198=0),OFFSET(B198,-1,0),C198)","v":3},{"$f":"IF(OFFSET(C198,-1,0)=\"L\",1,IF(OFFSET(C198,-1,0)=1,2,IF(OR(A198=\"s\",A198=0),\"S\",IF(AND(OFFSET(C198,-1,0)=2,A198=4),3,IF(AND(OR(OFFSET(C198,-1,0)=\"s\",OFFSET(C198,-1,0)=0),A198<>\"s\",A198>OFFSET(B198,-1,0)),OFFSET(B198,-1,0),A198)))))","v":"S"},{"$f":"IF(OR(C198=\"S\",C198=0),0,IF(ISERROR(K198),J198,SMALL(J198:K198,1)))","v":0},1,5,2,0,0,{"$f":"IF(OR($C198=\"S\",$C198=0),0,MATCH(0,OFFSET($D198,1,$C198,ROW($C$619)-ROW($C198)),0))","v":0},{"$f":"IF(OR($C198=\"S\",$C198=0),0,MATCH(OFFSET($D198,0,$C198)+1,OFFSET($D198,1,$C198,ROW($C$619)-ROW($C198)),0))","v":0},"","Serviço","Serviço","-","SINAPI",89627,"TÊ DE REDUÇÃO, PVC, SOLDÁVEL, DN 50MM X 25MM, INSTALADO EM PRUMADA DE ÁGUA - FORNECIMENTO E INSTALAÇÃO. AF_12/2014","UN",1,null,null,0,""]
[3,3,3,12,1,5,3,0,0,19,12,"","Nível 3","Nível 3","-","SINAPI",null,"ESGOTO SANITÁRIO","-",null,null,null,0,""]
["S",3,"S",0,1,5,3,0,0,0,0,"","Serviço","Serviço","-","SINAPI",89500,"CURVA 45 GRAUS, PVC, SOLDÁVEL, DN 40MM, INSTALADO EM PRUMADA DE ÁGUA - FORNECIMENTO E INSTALAÇÃO. AF_12/2014","UN",1,null,null,0,"Referência: AGETOP - 81701"]
["S",3,"S",0,1,5,3,0,0,0,0,"","Serviço","Serviço","-","AGETOP",81702,"CURVA 45 GRAUS DIAMETRO 100 MM","Un    ",1,null,null,0,""]
["S",3,"S",0,1,5,3,0,0,0,0,"","Serviço","Serviço","-","SINAPI",89811,"CURVA CURTA 90 GRAUS, PVC, SERIE NORMAL, ESGOTO PREDIAL, DN 100 MM, JUNTA ELÁSTICA, FORNECIDO E INSTALADO EM PRUMADA DE ESGOTO SANITÁRIO OU VENTILAÇÃO. AF_12/2014","UN",1,null,null,0,""]
["S",3,"S",0,1,5,3,0,0,0,0,"","Serviço","Serviço","-","SINAPI",89499,"CURVA 90 GRAUS, PVC, SOLDÁVEL, DN 40MM, INSTALADO EM PRUMADA DE ÁGUA - FORNECIMENTO E INSTALAÇÃO. AF_12/2014","UN",1,null,null,0,""]
["S",3,"S",0,1,5,3,0,0,0,0,"","Serviço","Serviço","-","SINAPI",89731,"JOELHO 90 GRAUS, PVC, SERIE NORMAL, ESGOTO PREDIAL, DN 50 MM, JUNTA ELÁSTICA, FORNECIDO E INSTALADO EM RAMAL DE DESCARGA OU RAMAL DE ESGOTO SANITÁRIO. AF_12/2014","UN",2,null,null,0,""]
["S",3,"S",0,1,5,3,0,0,0,0,"","Serviço","Serviço","-","AGETOP",81927,"JOELHO 90 GRAUS C/ANEL 40 mm ","Un    ",1,null,null,0,""]
["S",3,"S",0,1,5,3,0,0,0,0,"","Serviço","Serviço","-","AGETOP",81973,"JUNCAO SIMPLES DIAM. 100 X 50 MM","Un    ",1,null,null,0,""]
[{"$f":"CHOOSE(1+LOG(1+2*(ORÇAMENTO.Nivel=\"Nível 1\")+4*(ORÇAMENTO.Nivel=\"Nível 2\")+8*(ORÇAMENTO.Nivel=\"Nível 3\")+16*(ORÇAMENTO.Nivel=\"Nível 4\")+32*(ORÇAMENTO.Nivel=\"Serviço\"),2),0,1,2,3,4,\"S\")","v":"S"},{"$f":"IF(OR(C207=\"s\",C207=0),OFFSET(B207,-1,0),C207)","v":3},{"$f":"IF(OFFSET(C207,-1,0)=\"L\",1,IF(OFFSET(C207,-1,0)=1,2,IF(OR(A207=\"s\",A207=0),\"S\",IF(AND(OFFSET(C207,-1,0)=2,A207=4),3,IF(AND(OR(OFFSET(C207,-1,0)=\"s\",OFFSET(C207,-1,0)=0),A207<>\"s\",A207>OFFSET(B207,-1,0)),OFFSET(B207,-1,0),A207)))))","v":"S"},{"$f":"IF(OR(C207=\"S\",C207=0),0,IF(ISERROR(K207),J207,SMALL(J207:K207,1)))","v":0},{"$f":"IF($C207=1,OFFSET(E207,-1,0)+1,OFFSET(E207,-1,0))","v":1},{"$f":"IF($C207=1,0,IF($C207=2,OFFSET(F207,-1,0)+1,OFFSET(F207,-1,0)))","v":5},{"$f":"IF(AND($C207<=2,$C207<>0),0,IF($C207=3,OFFSET(G207,-1,0)+1,OFFSET(G207,-1,0)))","v":3},{"$f":"IF(AND($C207<=3,$C207<>0),0,IF($C207=4,OFFSET(H207,-1,0)+1,OFFSET(H207,-1,0)))","v":0},{"$f":"IF(AND($C207<=4,$C207<>0),0,IF(AND($C207=\"S\",$W207>0),OFFSET(I207,-1,0)+1,OFFSET(I207,-1,0)))","v":0},0,0,"","Serviço","Serviço","-","SINAPI",89825,"TE, PVC, SERIE NORMAL, ESGOTO PREDIAL, DN 50 X 50 MM, JUNTA ELÁSTICA, FORNECIDO E INSTALADO EM PRUMADA DE ESGOTO SANITÁRIO OU VENTILAÇÃO. AF_12/2014","UN",1,null,null,0,""]
["S",3,"S",0,1,5,3,0,0,0,0,"","Serviço","Serviço","-","SINAPI",89711,"TUBO PVC, SERIE NORMAL, ESGOTO PREDIAL, DN 40 MM, FORNECIDO E INSTALADO EM RAMAL DE DESCARGA OU RAMAL DE ESGOTO SANITÁRIO. AF_12/2014","M",1,null,null,0,"Referência: AGETOP - 82301"]
["S",3,"S",0,1,5,3,0,0,0,0,"","Serviço","Serviço","-","SINAPI",89798,"TUBO PVC, SERIE NORMAL, ESGOTO PREDIAL, DN 50 MM, FORNECIDO E INSTALADO EM PRUMADA DE ESGOTO SANITÁRIO OU VENTILAÇÃO. AF_12/2014","M",5,null,null,0,""]
["S",3,"S",0,1,5,3,0,0,0,0,"","Serviço","Serviço","-","SINAPI",89800,"TUBO PVC, SERIE NORMAL, ESGOTO PREDIAL, DN 100 MM, FORNECIDO E INSTALADO EM PRUMADA DE ESGOTO SANITÁRIO OU VENTILAÇÃO. AF_12/2014","M",65,null,null,0,""]
[3,3,3,7,1,5,4,0,0,7,{"$error":"#N/A"},"","Nível 3","Nível 3","-","SINAPI",null,"INST. DE INCÊNDIO","-",null,null,null,0,""]
["S",3,"S",0,1,5,4,0,0,0,0,"","Serviço","Serviço","-","AGETOP",85003,"EXTINTOR PO QUIMICO SECO (6 KG) - CAPACIDADE EXTINTORA 20 BC","Un    ",1,null,null,0,""]
["S",3,"S",0,1,5,4,0,0,0,0,"","Serviço","Serviço","-","AGETOP",85006,"EXTINTOR MULTI USO EM PO A B C (6 KG) - CAPACIDADE EXTINTORA 3A 20BC","un    ",7,null,null,0,""]
["S",3,"S",0,1,5,4,0,0,0,0,"","Serviço","Serviço","-","COMPOSIÇÃO","COMP 024_SEE","SINALIZADOR FOTOLUMINESCENTE PARA EXTINTOR","UN ",8,null,null,0,""]
["S",3,"S",0,1,5,4,0,0,0,0,"","Serviço","Serviço","-","SINAPI",97599,"LUMINÁRIA DE EMERGÊNCIA - FORNECIMENTO E INSTALAÇÃO. AF_11/2017","UN",20,null,null,0,""]
["S",3,"S",0,1,5,4,0,0,0,0,"","Serviço","Serviço","-","COMPOSIÇÃO","COMP 025_SEE","SINALIZADOR FOTOLUMINESCENTE DE EMERGÊNCIA","UN ",30,null,null,0,""]
["S",3,"S",0,1,5,4,0,0,0,0,"","Serviço","Serviço","-","COMPOSIÇÃO","COMP 277_SEE","MARCAÇÃO NO PISO - 1X1 M PARA EXTINTOR","M2",8,null,null,0,""]
[2,2,2,21,1,6,0,0,0,64,21,"","Nível 2","Nível 2","-",null,null,"INSTALAÇÕES ESPECIAIS","-",null,null,null,0,""]
["S",2,"S",0,1,6,0,0,0,0,0,"","Serviço","Serviço","-","AGETOP",91007,"CENTRAL DE GÁS PADRÃO AGETOP SEM INSTALAÇÕES (1+1 CILINDRO 45 KG)","Un    ",1,null,null,0,""]
["S",2,"S",0,1,6,0,0,0,0,0,"","Serviço","Serviço","-","AGETOP",91023,"UNIÃO S/BRONZE PRETA 3/4\" NPT 300 LBS","Un    ",3,null,null,0,""]
["S",2,"S",0,1,6,0,0,0,0,0,"","Serviço","Serviço","-","COMPOSIÇÃO","COMP 382_SEE","TE DE REDUCAO DE FERRO GALVANIZADO, COM ROSCA BSP, DE 3/4\" X 1/2\"","UN ",1,null,null,0,""]
["S",2,"S",0,1,6,0,0,0,0,0,"","Serviço","Serviço","-","COMPOSIÇÃO","COMP 383_SEE","BUCHA DE REDUCAO DE FERRO GALVANIZADO, COM ROSCA BSP, DE 1/2\" X 1/4\"","UN ",3,null,null,0,""]
["S",2,"S",0,1,6,0,0,0,0,0,"","Serviço","Serviço","-","AGETOP",91021,"LUVA GALVANIZADO DE REDUÇÃO 3/4\" X 1/2\" (GÁS)","Un    ",2,null,null,0,""]
["S",2,"S",0,1,6,0,0,0,0,0,"","Serviço","Serviço","-","SINAPI",92692,"NIPLE, EM FERRO GALVANIZADO, CONEXÃO ROSQUEADA, DN 15 (1/2\"), INSTALADO EM RAMAIS E SUB-RAMAIS DE GÁS - FORNECIMENTO E INSTALAÇÃO. AF_12/2015","UN",6,null,null,0,""]
["S",2,"S",0,1,6,0,0,0,0,0,"","Serviço","Serviço","-","AGETOP",91031,"NIPLE DUPLO 300 PSI 3/4\"","Un    ",6,null,null,0,""]
["S",2,"S",0,1,6,0,0,0,0,0,"","Serviço","Serviço","-","COMPOSIÇÃO","COMP 212_SEE","NIPLE DE REDUÇÃO 1/2\" X 1/4\" BSP","UN ",4,null,null,0,""]
["S",2,"S",0,1,6,0,0,0,0,0,"","Serviço","Serviço","-","COMPOSIÇÃO","COMP 213_SEE","NIPLE DE REDUÇÃO 3/4\" X 1/2\" BSP","UN ",4,null,null,0,""]
["S",2,"S",0,1,6,0,0,0,0,0,"","Serviço","Serviço","-","SINAPI",92688,"TUBO DE AÇO GALVANIZADO COM COSTURA, CLASSE MÉDIA, CONEXÃO ROSQUEADA, DN 20 (3/4\"), INSTALADO EM RAMAIS E SUB-RAMAIS DE GÁS - FORNECIMENTO E INSTALAÇÃO. AF_12/2015","M",18,null,null,0,""]
["S",2,"S",0,1,6,0,0,0,0,0,"","Serviço","Serviço","-","SINAPI",92701,"JOELHO 90 GRAUS, EM FERRO GALVANIZADO, CONEXÃO ROSQUEADA, DN 20 (3/4\"), INSTALADO EM RAMAIS E SUB-RAMAIS DE GÁS - FORNECIMENTO E INSTALAÇÃO. AF_12/2015","UN",4,null,null,0,""]
["S",2,"S",0,1,6,0,0,0,0,0,"","Serviço","Serviço","-","AGETOP",91025,"VÁLVULA ESFERICA LATÃO 3/4\"","Un    ",3,null,null,0,""]
["S",2,"S",0,1,6,0,0,0,0,0,"","Serviço","Serviço","-","COMPOSIÇÃO","COMP 210_SEE","REGULADOR DE 1º ESTÁGIO 60KG/H MODELO AP-40  COM MANÔMETRO","UN ",1,null,null,0,""]
["S",2,"S",0,1,6,0,0,0,0,0,"","Serviço","Serviço","-","AGETOP",85003,"EXTINTOR PO QUIMICO SECO (6 KG) - CAPACIDADE EXTINTORA 20 BC","Un    ",1,null,null,0,""]
["S",2,"S",0,1,6,0,0,0,0,0,"","Serviço","Serviço","-","COMPOSIÇÃO","COMP 235_SEE","PLACA DE SINALIZAÇÃO EM PVC COD 01 - (300X300) PROIBIDO FUMAR","UN ",2,null,null,0,""]
["S",2,"S",0,1,6,0,0,0,0,0,"","Serviço","Serviço","-","COMPOSIÇÃO","COMP 236_SEE","PLACA DE SINALIZAÇÃO EM PVC COD 06 - (300X300) PERIGO INFLAMÁVEL","UN ",2,null,null,0,""]
["S",2,"S",0,1,6,0,0,0,0,0,"","Serviço","Serviço","-","AGETOP",91043,"BRAÇADEIRA METALICA TIPO \"D\" DIAM. 3/4\"","Un    ",9,null,null,0,""]
["S",2,"S",0,1,6,0,0,0,0,0,"","Serviço","Serviço","-","AGETOP",71863,"PARAFUSO P/BUCHA S-10","Un    ",18,null,null,0,""]
["S",2,"S",0,1,6,0,0,0,0,0,"","Serviço","Serviço","-","AGETOP",70393,"BUCHA DE NYLON S-10","Un    ",18,null,null,0,""]
["S",2,"S",0,1,6,0,0,0,0,0,"","Serviço","Serviço","-","AGETOP",91045,"SUPORTE PARA COLETOR","Un    ",2,null,null,0,""]
[{"$f":"CHOOSE(1+LOG(1+2*(ORÇAMENTO.Nivel=\"Nível 1\")+4*(ORÇAMENTO.Nivel=\"Nível 2\")+8*(ORÇAMENTO.Nivel=\"Nível 3\")+16*(ORÇAMENTO.Nivel=\"Nível 4\")+32*(ORÇAMENTO.Nivel=\"Serviço\"),2),0,1,2,3,4,\"S\")","v":2},2,2,3,1,7,0,0,{"$f":"IF(AND($C239<=4,$C239<>0),0,IF(AND($C239=\"S\",$W239>0),OFFSET(I239,-1,0)+1,OFFSET(I239,-1,0)))","v":0},43,3,"","Nível 2","Nível 2","-","AGETOP",91045,"ALVENARIAS E DIVISÓRIAS","Un    ",null,null,null,0,""]
["S",2,"S",0,{"$f":"IF($C240=1,OFFSET(E240,-1,0)+1,OFFSET(E240,-1,0))","v":1},{"$f":"IF($C240=1,0,IF($C240=2,OFFSET(F240,-1,0)+1,OFFSET(F240,-1,0)))","v":7},{"$f":"IF(AND($C240<=2,$C240<>0),0,IF($C240=3,OFFSET(G240,-1,0)+1,OFFSET(G240,-1,0)))","v":0},{"$f":"IF(AND($C240<=3,$C240<>0),0,IF($C240=4,OFFSET(H240,-1,0)+1,OFFSET(H240,-1,0)))","v":0},0,0,0,"","Serviço","Serviço","-","SINAPI",87520,"ALVENARIA DE VEDAÇÃO DE BLOCOS CERÂMICOS FURADOS NA HORIZONTAL DE 9X19X19CM (ESPESSURA 9CM) DE PAREDES COM ÁREA LÍQUIDA MAIOR OU IGUAL A 6M² COM VÃOS E ARGAMASSA DE ASSENTAMENTO COM PREPARO MANUAL. AF_06/2014","M2",20,null,null,0,"Referência: AGETOP - 100201"]
["S",{"$f":"IF(OR(C241=\"s\",C241=0),OFFSET(B241,-1,0),C241)","v":2},{"$f":"IF(OFFSET(C241,-1,0)=\"L\",1,IF(OFFSET(C241,-1,0)=1,2,IF(OR(A241=\"s\",A241=0),\"S\",IF(AND(OFFSET(C241,-1,0)=2,A241=4),3,IF(AND(OR(OFFSET(C241,-1,0)=\"s\",OFFSET(C241,-1,0)=0),A241<>\"s\",A241>OFFSET(B241,-1,0)),OFFSET(B241,-1,0),A241)))))","v":"S"},{"$f":"IF(OR(C241=\"S\",C241=0),0,IF(ISERROR(K241),J241,SMALL(J241:K241,1)))","v":0},1,7,0,0,0,0,0,"","Serviço","Serviço","-","COMPOSIÇÃO","COMP 334_SEE","ALVENARIA DE BLOCO DE CONCRETO ESTRUTURAL 14X19X39, FBK 4,5MPA","M2",7.75,null,null,0,""]
[2,2,2,2,1,8,0,0,0,40,2,"","Nível 2","Nível 2","-",null,null,"COBERTURAS","-",null,null,null,0,""]
["S",2,"S",0,1,8,0,0,0,0,0,"","Serviço","Serviço","-","SINAPI",94445,"TELHAMENTO COM TELHA CERÂMICA CAPA-CANAL, TIPO PLAN, COM ATÉ 2 ÁGUAS, INCLUSO TRANSPORTE VERTICAL. AF_06/2016","M2",30,null,null,0,"Referência: AGETOP - 160401"]
[2,2,2,4,1,9,0,0,0,38,4,"","Nível 2","Nível 2","-",null,null,"ESQUADRIAS METÁLICAS","-",null,null,null,0,""]
["S",2,"S",0,1,9,0,0,0,0,0,"","Serviço","Serviço","-","AGETOP",180380,"ESQ. MAXIMO AR CHAPA/VIDRO J4 C/FERRAGENS","m2    ",0.5,null,null,0,""]
["S",2,"S",0,1,9,0,0,0,0,0,"","Serviço","Serviço","-","SINAPI","73933/4","PORTA DE FERRO DE ABRIR TIPO BARRA CHATA, COM REQUADRO E GUARNICAO COMPLETA","M2",6.93,null,null,0,"Referência: AGETOP - 180501"]
["S",2,"S",0,1,9,0,0,0,0,0,"","Serviço","Serviço","-","COMPOSIÇÃO","COMP 007_SEE","GUICHÊ CANTONEIRA/GRADE PARA VIDRO","M²",0.75,null,null,0,""]
[2,2,2,5,1,10,0,0,0,34,5,"","Nível 2","Nível 2","-",null,null,"REVESTIMENTO DE PAREDE","-",null,null,null,0,""]
["S",2,"S",0,1,10,0,0,0,0,0,"","Serviço","Serviço","-","SINAPI",87553,"EMBOÇO, PARA RECEBIMENTO DE CERÂMICA, EM ARGAMASSA TRAÇO 1:2:8, PREPARO MECÂNICO COM BETONEIRA 400L, APLICADO MANUALMENTE EM FACES INTERNAS DE PAREDES, PARA AMBIENTE COM ÁREA MAIOR QUE 10M2, ESPESSURA DE 10MM, COM EXECUÇÃO DE TALISCAS. AF_06/2014","M2",12.6,null,null,0,""]
[{"$f":"CHOOSE(1+LOG(1+2*(ORÇAMENTO.Nivel=\"Nível 1\")+4*(ORÇAMENTO.Nivel=\"Nível 2\")+8*(ORÇAMENTO.Nivel=\"Nível 3\")+16*(ORÇAMENTO.Nivel=\"Nível 4\")+32*(ORÇAMENTO.Nivel=\"Serviço\"),2),0,1,2,3,4,\"S\")","v":"S"},2,"S",0,1,10,0,0,{"$f":"IF(AND($C250<=4,$C250<>0),0,IF(AND($C250=\"S\",$W250>0),OFFSET(I250,-1,0)+1,OFFSET(I250,-1,0)))","v":0},0,0,"","Serviço","Serviço","-","SINAPI",87904,"CHAPISCO APLICADO EM ALVENARIA (COM PRESENÇA DE VÃOS) E ESTRUTURAS DE CONCRETO DE FACHADA, COM COLHER DE PEDREIRO.  ARGAMASSA TRAÇO 1:3 COM PREPARO MANUAL. AF_06/2014","M2",7.75,null,null,0,"Referência: AGETOP - 200101"]
["S",2,"S",0,{"$f":"IF($C251=1,OFFSET(E251,-1,0)+1,OFFSET(E251,-1,0))","v":1},{"$f":"IF($C251=1,0,IF($C251=2,OFFSET(F251,-1,0)+1,OFFSET(F251,-1,0)))","v":10},{"$f":"IF(AND($C251<=2,$C251<>0),0,IF($C251=3,OFFSET(G251,-1,0)+1,OFFSET(G251,-1,0)))","v":0},{"$f":"IF(AND($C251<=3,$C251<>0),0,IF($C251=4,OFFSET(H251,-1,0)+1,OFFSET(H251,-1,0)))","v":0},0,0,0,"","Serviço","Serviço","-","SINAPI",87547,"MASSA ÚNICA, PARA RECEBIMENTO DE PINTURA, EM ARGAMASSA TRAÇO 1:2:8, PREPARO MECÂNICO COM BETONEIRA 400L, APLICADA MANUALMENTE EM FACES INTERNAS DE PAREDES, ESPESSURA DE 10MM, COM EXECUÇÃO DE TALISCAS. AF_06/2014","M2",7.75,null,null,0,""]
["S",2,"S",0,1,10,0,0,0,0,0,"","Serviço","Serviço","-","SINAPI",87273,"REVESTIMENTO CERÂMICO PARA PAREDES INTERNAS COM PLACAS TIPO ESMALTADA EXTRA DE DIMENSÕES 33X45 CM APLICADAS EM AMBIENTES DE ÁREA MAIOR QUE 5 M² NA ALTURA INTEIRA DAS PAREDES. AF_06/2014","M2",12.6,null,null,0,""]
[2,2,2,2,1,11,0,0,0,29,2,"","Nível 2","Nível 2","-",null,null,"FORROS","-",null,null,null,0,""]
["S",2,"S",0,1,11,0,0,0,0,0,"","Serviço","Serviço","-","AGETOP",210461,"FORRO DE PVC SEM ESTRUTURA DE METALON (COM REPINTURA DA ESTRUTURA COM TINTA ALQUÍDICA D.F.)","m2    ",40,null,null,0,""]
[2,{"$f":"IF(OR(C255=\"s\",C255=0),OFFSET(B255,-1,0),C255)","v":2},{"$f":"IF(OFFSET(C255,-1,0)=\"L\",1,IF(OFFSET(C255,-1,0)=1,2,IF(OR(A255=\"s\",A255=0),\"S\",IF(AND(OFFSET(C255,-1,0)=2,A255=4),3,IF(AND(OR(OFFSET(C255,-1,0)=\"s\",OFFSET(C255,-1,0)=0),A255<>\"s\",A255>OFFSET(B255,-1,0)),OFFSET(B255,-1,0),A255)))))","v":2},{"$f":"IF(OR(C255=\"S\",C255=0),0,IF(ISERROR(K255),J255,SMALL(J255:K255,1)))","v":6},1,12,0,0,0,27,6,"","Nível 2","Nível 2","-",null,null,"REVESTIMENTO DE PISO","-",null,null,null,0,""]
["S",2,"S",0,1,12,0,0,0,0,0,"","Serviço","Serviço","-","SINAPI",84191,"PISO EM GRANILITE, MARMORITE OU GRANITINA ESPESSURA 8 MM, INCLUSO JUNTAS DE DILATACAO PLASTICAS","M2",3.25,null,null,0,"Referência: AGETOP - 221101"]
["S",2,"S",0,1,12,0,0,0,0,0,"","Serviço","Serviço","-","AGETOP",221104,"RASPAGEM E APLICAÇÃO RESINA ACRÍLICA DUAS DEMÃOS","m2    ",3.25,null,null,0,""]
["S",2,"S",0,1,12,0,0,0,0,0,"","Serviço","Serviço","-","SINAPI",94992,"EXECUÇÃO DE PASSEIO (CALÇADA) OU PISO DE CONCRETO COM CONCRETO MOLDADO IN LOCO, FEITO EM OBRA, ACABAMENTO CONVENCIONAL, ESPESSURA 6 CM, ARMADO. AF_07/2016","M2",36.25,null,null,0,""]
["S",2,"S",0,1,12,0,0,0,0,0,"","Serviço","Serviço","-","AGETOP",221120,"PISO DE BORRACHA COLORIDO MODELO TÁTIL ( ALERTA OU DIRECIONAL) INCLUSO CONTRAPISO (1CI:3ARML) C/ E=2CM E NATA DE CIMENTO","m2    ",5.38,null,null,0,""]
["S",2,"S",0,1,12,0,0,0,0,0,"","Serviço","Serviço","-","AGETOP",221126,"PISO DE LADRILHO HIDRÁULICO COLORIDO MODELO TÁTIL ( ALERTA OU DIRECIONAL) SEM LASTRO","m2    ",54.25,null,null,0,""]
[2,2,2,3,1,13,0,0,0,21,3,"","Nível 2","Nível 2","-",null,null,"FERRAGENS","-",null,null,null,0,""]
["S",2,"S",0,1,13,0,0,0,{"$f":"IF(OR($C262=\"S\",$C262=0),0,MATCH(0,OFFSET($D262,1,$C262,ROW($C$619)-ROW($C262)),0))","v":0},{"$f":"IF(OR($C262=\"S\",$C262=0),0,MATCH(OFFSET($D262,0,$C262)+1,OFFSET($D262,1,$C262,ROW($C$619)-ROW($C262)),0))","v":0},"","Serviço","Serviço","-","AGETOP",230174,"BARRA DE APOIO EM AÇO INOX - 40 CM","un    ",6,null,null,0,""]
["S",2,"S",0,1,13,0,0,0,0,0,"","Serviço","Serviço","-","AGETOP",230176,"BARRA DE APOIO EM AÇO INOX - 80 CM ","un    ",6,null,null,0,""]
[2,2,2,6,1,14,0,0,0,18,6,"","Nível 2","Nível 2","-",null,null,"ADMINISTRAÇÃO","-",null,null,null,0,""]
[3,3,3,3,1,14,1,0,0,5,3,"","Nível 3","Nível 3","-",null,null,"MENSALISTAS","-",null,null,null,0,""]
["S",3,"S",0,1,14,1,0,0,0,0,"","Serviço","Serviço","-","SINAPI",90778,"ENGENHEIRO CIVIL DE OBRA PLENO COM ENCARGOS COMPLEMENTARES","H",132,null,null,0,"Referência: AGETOP - 250101"]
["S",3,"S",0,1,14,1,0,0,0,0,"","Serviço","Serviço","-","SINAPI",90776,"ENCARREGADO GERAL COM ENCARGOS COMPLEMENTARES","H",660,null,null,0,"Referência: AGETOP - 250103"]
[3,3,3,2,1,14,2,0,0,2,84,"","Nível 3","Nível 3","-",null,null,"LAUDO DE ESTANQUEIDADE","-",null,null,null,0,""]
["S",3,"S",0,1,14,2,0,0,0,0,"","Serviço","Serviço","-","SINAPI",90778,"ENGENHEIRO CIVIL DE OBRA PLENO COM ENCARGOS COMPLEMENTARES","H",16,null,null,0,"Referência: AGETOP - 250101"]
[2,2,2,9,1,15,0,0,0,12,9,"","Nível 2","Nível 2","-",null,null,"PINTURA","-",null,null,null,0,""]
[{"$f":"CHOOSE(1+LOG(1+2*(ORÇAMENTO.Nivel=\"Nível 1\")+4*(ORÇAMENTO.Nivel=\"Nível 2\")+8*(ORÇAMENTO.Nivel=\"Nível 3\")+16*(ORÇAMENTO.Nivel=\"Nível 4\")+32*(ORÇAMENTO.Nivel=\"Serviço\"),2),0,1,2,3,4,\"S\")","v":"S"},2,"S",0,{"$f":"IF($C271=1,OFFSET(E271,-1,0)+1,OFFSET(E271,-1,0))","v":1},{"$f":"IF($C271=1,0,IF($C271=2,OFFSET(F271,-1,0)+1,OFFSET(F271,-1,0)))","v":15},{"$f":"IF(AND($C271<=2,$C271<>0),0,IF($C271=3,OFFSET(G271,-1,0)+1,OFFSET(G271,-1,0)))","v":0},{"$f":"IF(AND($C271<=3,$C271<>0),0,IF($C271=4,OFFSET(H271,-1,0)+1,OFFSET(H271,-1,0)))","v":0},{"$f":"IF(AND($C271<=4,$C271<>0),0,IF(AND($C271=\"S\",$W271>0),OFFSET(I271,-1,0)+1,OFFSET(I271,-1,0)))","v":0},0,0,"","Serviço","Serviço","-","AGETOP",260104,"REMOCAO DE PINTURA ANTIGA A LATEX","m2    ",40,null,null,0,""]
["S",2,"S",0,1,15,0,0,0,0,0,"","Serviço","Serviço","-","SINAPI",88496,"APLICAÇÃO E LIXAMENTO DE MASSA LÁTEX EM TETO, DUAS DEMÃOS. AF_06/2014","M2",40,null,null,0,"Referência: AGETOP - 261300"]
["S",2,"S",0,1,15,0,0,0,0,0,"","Serviço","Serviço","-","SINAPI",88486,"APLICAÇÃO MANUAL DE PINTURA COM TINTA LÁTEX PVA EM TETO, DUAS DEMÃOS. AF_06/2014","M2",150,null,null,0,"Referência: AGETOP - 261307"]
["S",{"$f":"IF(OR(C274=\"s\",C274=0),OFFSET(B274,-1,0),C274)","v":2},{"$f":"IF(OFFSET(C274,-1,0)=\"L\",1,IF(OFFSET(C274,-1,0)=1,2,IF(OR(A274=\"s\",A274=0),\"S\",IF(AND(OFFSET(C274,-1,0)=2,A274=4),3,IF(AND(OR(OFFSET(C274,-1,0)=\"s\",OFFSET(C274,-1,0)=0),A274<>\"s\",A274>OFFSET(B274,-1,0)),OFFSET(B274,-1,0),A274)))))","v":"S"},{"$f":"IF(OR(C274=\"S\",C274=0),0,IF(ISERROR(K274),J274,SMALL(J274:K274,1)))","v":0},1,15,0,0,0,0,0,"","Serviço","Serviço","-","AGETOP",260202,"CAIACAO DUAS DEMAOS MUROS E PAREDES - (OB.C.)","m2    ",800,null,null,0,""]
["S",2,"S",0,1,15,0,0,0,0,0,"","Serviço","Serviço","-","SINAPI","73924/3","PINTURA ESMALTE FOSCO, DUAS DEMAOS, SOBRE SUPERFICIE METALICA","M2",350,null,null,0,"Referência: AGETOP - 261503"]
["S",2,"S",0,1,15,0,0,0,0,0,"","Serviço","Serviço","-","SINAPI","74145/1","PINTURA ESMALTE FOSCO, DUAS DEMAOS, SOBRE SUPERFICIE METALICA, INCLUSO UMA DEMAO DE FUNDO ANTICORROSIVO. UTILIZACAO DE REVOLVER ( AR-COMPRIMIDO).","M2",30.66,null,null,0,"Referência: AGETOP - 261602"]
["S",2,"S",0,1,15,0,0,0,0,0,"","Serviço","Serviço","-","AGETOP",260801,"PINTURA A BASE DE SILICONE 1 DEMAO","m2    ",1568,null,null,0,""]
["S",2,"S",0,1,15,0,0,0,0,0,"","Serviço","Serviço","-","AGETOP",261620,"LETREIRO MÉDIO A GRANDE PORTE EM PAREDE FEITO A PINCEL","m2    ",7.2,null,null,0,""]
[2,2,2,3,1,16,0,0,0,3,110,"","Nível 2","Nível 2","-",null,null,"DIVERSOS","-",null,null,null,0,""]
["S",2,"S",0,1,16,0,0,0,0,0,"","Serviço","Serviço","-","AGETOP",270501,"LIMPEZA FINAL DE OBRA - (OBRAS CIVIS)","m2    ",100,null,null,0,""]
["S",2,"S",0,1,16,0,0,0,0,0,"","Serviço","Serviço","-","COMPOSIÇÃO","COMP 084_SEE","GUARDA-CORPO COM CORRIMÃO - SEDUC","M",14.3,null,null,0,""]
[{"$f":"CHOOSE(1+LOG(1+2*(ORÇAMENTO.Nivel=\"Nível 1\")+4*(ORÇAMENTO.Nivel=\"Nível 2\")+8*(ORÇAMENTO.Nivel=\"Nível 3\")+16*(ORÇAMENTO.Nivel=\"Nível 4\")+32*(ORÇAMENTO.Nivel=\"Serviço\"),2),0,1,2,3,4,\"S\")","v":1},{"$f":"IF(OR(C282=\"s\",C282=0),OFFSET(B282,-1,0),C282)","v":1},{"$f":"IF(OFFSET(C282,-1,0)=\"L\",1,IF(OFFSET(C282,-1,0)=1,2,IF(OR(A282=\"s\",A282=0),\"S\",IF(AND(OFFSET(C282,-1,0)=2,A282=4),3,IF(AND(OR(OFFSET(C282,-1,0)=\"s\",OFFSET(C282,-1,0)=0),A282<>\"s\",A282>OFFSET(B282,-1,0)),OFFSET(B282,-1,0),A282)))))","v":1},{"$f":"IF(OR(C282=\"S\",C282=0),0,IF(ISERROR(K282),J282,SMALL(J282:K282,1)))","v":119},{"$f":"IF($C282=1,OFFSET(E282,-1,0)+1,OFFSET(E282,-1,0))","v":2},{"$f":"IF($C282=1,0,IF($C282=2,OFFSET(F282,-1,0)+1,OFFSET(F282,-1,0)))","v":0},{"$f":"IF(AND($C282<=2,$C282<>0),0,IF($C282=3,OFFSET(G282,-1,0)+1,OFFSET(G282,-1,0)))","v":0},{"$f":"IF(AND($C282<=3,$C282<>0),0,IF($C282=4,OFFSET(H282,-1,0)+1,OFFSET(H282,-1,0)))","v":0},{"$f":"IF(AND($C282<=4,$C282<>0),0,IF(AND($C282=\"S\",$W282>0),OFFSET(I282,-1,0)+1,OFFSET(I282,-1,0)))","v":0},337,119,"F","Nível 1","Nível 1","2.","SINAPI",null,"LABORATÓRIO DE CIÊNCIAS - SEDUC 2019","-",null,null,null,0,""]
[2,2,2,2,2,1,0,0,0,118,2,"","Nível 2","Nível 2","-","SINAPI",null,"SERVIÇOS PRELIMINARES","-",null,null,null,0,""]
["S",2,"S",0,2,1,0,0,0,0,0,"","Serviço","Serviço","-","AGETOP",20701,"LOCAÇÃO DA OBRA, EXECUÇÃO DE GABARITO SEM REAPROVEITAMENTO, INCLUSO PINTURA (FACE INTERNA DO RIPÃO 15CM) E PIQUETE COM TESTEMUNHA","m2    ",52.78,null,null,0,""]
[2,2,2,3,2,2,0,0,0,116,3,"","Nível 2","Nível 2","-","AGETOP",null,"TRANSPORTES","-",null,null,null,0,""]
["S",2,"S",0,2,2,0,0,0,0,0,"","Serviço","Serviço","-","SINAPI",72900,"TRANSPORTE DE ENTULHO COM CAMINHAO BASCULANTE 6 M3, RODOVIA PAVIMENTADA, DMT 0,5 A 1,0 KM","M3",3.69,null,null,0,""]
["S",2,"S",0,2,2,0,0,0,0,0,"","Serviço","Serviço","-","SINAPI",72897,"CARGA MANUAL DE ENTULHO EM CAMINHAO BASCULANTE 6 M3","M3",3.69,null,null,0,""]
[2,2,2,5,2,3,0,0,0,113,5,"","Nível 2","Nível 2","-","AGETOP",null,"SERVIÇO EM TERRA","-",null,null,null,0,""]
["S",2,"S",0,2,3,0,0,0,0,0,"","Serviço","Serviço","-","AGETOP",41140,"REGULARIZAÇÃO DO TERRENO SEM APILOAMENTO COM TRANSPORTE MANUAL DA TERRA ESCAVADA ","m2    ",10.56,null,null,0,""]
["S",2,"S",0,2,3,0,0,0,0,0,"","Serviço","Serviço","-","AGETOP",41002,"APILOAMENTO","m2    ",10.56,null,null,0,""]
["S",2,"S",0,2,3,0,0,0,0,0,"","Serviço","Serviço","-","SINAPI",96527,"ESCAVAÇÃO MANUAL DE VALA PARA VIGA BALDRAME, COM PREVISÃO DE FÔRMA. AF_06/2017","M3",2.0699999999999998,null,null,0,"Referência: AGETOP - 40101"]
["S",2,"S",0,2,3,0,0,0,0,0,"","Serviço","Serviço","-","AGETOP",40902,"REATERRO COM APILOAMENTO","m3    ",3.19,null,null,0,""]
[2,2,2,11,2,4,0,0,0,108,11,"","Nível 2","Nível 2","-","AGETOP",null,"FUNDAÇÕES E SONDAGENS","-",null,null,null,0,""]
["S",2,"S",0,2,4,0,0,0,0,0,"","Serviço","Serviço","-","AGETOP",50901,"ESCAVACAO MANUAL DE VALAS (SAPATAS/BLOCOS)","m3    ",4.95,null,null,0,""]
["S",2,"S",0,2,4,0,0,0,0,0,"","Serviço","Serviço","-","SINAPI",98230,"ESTACA BROCA DE CONCRETO, DIÂMETRO DE 30 CM, PROFUNDIDADE DE ATÉ 3 M, ESCAVAÇÃO MANUAL COM TRADO CONCHA, NÃO ARMADA. AF_03/2018","M",38,null,null,0,"Referência: AGETOP - 50302"]
["S",2,"S",0,2,4,0,0,0,0,0,"","Serviço","Serviço","-","AGETOP",50902,"APILOAMENTO (BLOCOS/SAPATAS)","m2    ",14,null,null,0,""]
["S",2,"S",0,2,4,0,0,0,0,0,"","Serviço","Serviço","-","SINAPI",92776,"ARMAÇÃO DE PILAR OU VIGA DE UMA ESTRUTURA CONVENCIONAL DE CONCRETO ARMADO EM UMA EDIFICAÇÃO TÉRREA OU SOBRADO UTILIZANDO AÇO CA-50 DE 6,3 MM - MONTAGEM. AF_12/2015","KG",18.899999999999999,null,null,0,"Referência: AGETOP - 60303"]
["S",2,"S",0,2,4,0,0,0,0,0,"","Serviço","Serviço","-","SINAPI",92777,"ARMAÇÃO DE PILAR OU VIGA DE UMA ESTRUTURA CONVENCIONAL DE CONCRETO ARMADO EM UMA EDIFICAÇÃO TÉRREA OU SOBRADO UTILIZANDO AÇO CA-50 DE 8,0 MM - MONTAGEM. AF_12/2015","KG",52.2,null,null,0,"Referência: AGETOP - 60304"]
["S",2,"S",0,2,4,0,0,0,0,0,"","Serviço","Serviço","-","SINAPI",92778,"ARMAÇÃO DE PILAR OU VIGA DE UMA ESTRUTURA CONVENCIONAL DE CONCRETO ARMADO EM UMA EDIFICAÇÃO TÉRREA OU SOBRADO UTILIZANDO AÇO CA-50 DE 10,0 MM - MONTAGEM. AF_12/2015","KG",11.7,null,null,0,"Referência: AGETOP - 60305"]
["S",2,"S",0,2,4,0,0,0,0,0,"","Serviço","Serviço","-","SINAPI",92775,"ARMAÇÃO DE PILAR OU VIGA DE UMA ESTRUTURA CONVENCIONAL DE CONCRETO ARMADO EM UMA EDIFICAÇÃO TÉRREA OU SOBRADO UTILIZANDO AÇO CA-60 DE 5,0 MM - MONTAGEM. AF_12/2015","KG",11.7,null,null,0,"Referência: AGETOP - 60314"]
["S",2,"S",0,2,4,0,0,0,0,0,"","Serviço","Serviço","-","SINAPI","74157/4","LANCAMENTO/APLICACAO MANUAL DE CONCRETO EM FUNDACOES","M3",1.26,null,null,0,"Referência: AGETOP - 51055"]
["S",2,"S",0,2,4,0,0,0,0,0,"","Serviço","Serviço","-","SINAPI",94974,"CONCRETO MAGRO PARA LASTRO, TRAÇO 1:4,5:4,5 (CIMENTO/ AREIA MÉDIA/ BRITA 1)  - PREPARO MANUAL. AF_07/2016","M3",0.11,null,null,0,"Referência: AGETOP - 51025"]
["S",2,"S",0,2,4,0,0,0,0,0,"","Serviço","Serviço","-","SINAPI",94963,"CONCRETO FCK = 15MPA, TRAÇO 1:3,4:3,5 (CIMENTO/ AREIA MÉDIA/ BRITA 1)  - PREPARO MECÂNICO COM BETONEIRA 400 L. AF_07/2016","M3",1.26,null,null,0,""]
[2,2,2,10,2,5,0,0,0,97,10,"","Nível 2","Nível 2","-","AGETOP",null,"ESTRUTURA","-",null,null,null,0,""]
["S",2,"S",0,2,5,0,0,0,0,0,"","Serviço","Serviço","-","SINAPI","74202/1","LAJE PRE-MOLDADA P/FORRO, SOBRECARGA 100KG/M2, VAOS ATE 3,50M/E=8CM, C/LAJOTAS E CAP.C/CONC FCK=20MPA, 3CM, INTER-EIXO 38CM, C/ESCORAMENTO (REAPR.3X) E FERRAGEM NEGATIVA","M2",25.81,null,null,0,""]
["S",2,"S",0,2,5,0,0,0,0,0,"","Serviço","Serviço","-","AGETOP",61107,"ESCORAMENTO, MONTAGEM E DESFORMA DA LAJE \"TRELIÇADA\" - U=2 VEZES","m2    ",25.81,null,null,0,""]
["S",2,"S",0,2,5,0,0,0,0,0,"","Serviço","Serviço","-","SINAPI",92777,"ARMAÇÃO DE PILAR OU VIGA DE UMA ESTRUTURA CONVENCIONAL DE CONCRETO ARMADO EM UMA EDIFICAÇÃO TÉRREA OU SOBRADO UTILIZANDO AÇO CA-50 DE 8,0 MM - MONTAGEM. AF_12/2015","KG",89.1,null,null,0,"Referência: AGETOP - 60304"]
["S",2,"S",0,2,5,0,0,0,0,0,"","Serviço","Serviço","-","SINAPI",92778,"ARMAÇÃO DE PILAR OU VIGA DE UMA ESTRUTURA CONVENCIONAL DE CONCRETO ARMADO EM UMA EDIFICAÇÃO TÉRREA OU SOBRADO UTILIZANDO AÇO CA-50 DE 10,0 MM - MONTAGEM. AF_12/2015","KG",129.6,null,null,0,"Referência: AGETOP - 60305"]
["S",2,"S",0,2,5,0,0,0,0,0,"","Serviço","Serviço","-","SINAPI",92779,"ARMAÇÃO DE PILAR OU VIGA DE UMA ESTRUTURA CONVENCIONAL DE CONCRETO ARMADO EM UMA EDIFICAÇÃO TÉRREA OU SOBRADO UTILIZANDO AÇO CA-50 DE 12,5 MM - MONTAGEM. AF_12/2015","KG",15.3,null,null,0,"Referência: AGETOP - 60306"]
["S",2,"S",0,2,5,0,0,0,0,0,"","Serviço","Serviço","-","SINAPI",92775,"ARMAÇÃO DE PILAR OU VIGA DE UMA ESTRUTURA CONVENCIONAL DE CONCRETO ARMADO EM UMA EDIFICAÇÃO TÉRREA OU SOBRADO UTILIZANDO AÇO CA-60 DE 5,0 MM - MONTAGEM. AF_12/2015","KG",84.6,null,null,0,"Referência: AGETOP - 60314"]
["S",2,"S",0,2,5,0,0,0,0,0,"","Serviço","Serviço","-","SINAPI",92459,"MONTAGEM E DESMONTAGEM DE FÔRMA DE VIGA, ESCORAMENTO COM GARFO DE MADEIRA, PÉ-DIREITO SIMPLES, EM CHAPA DE MADEIRA RESINADA, 6 UTILIZAÇÕES. AF_12/2015","M2",73.990000000000009,null,null,0,"Referência: AGETOP - 60209"]
["S",2,"S",0,2,5,0,0,0,0,0,"","Serviço","Serviço","-","SINAPI",94970,"CONCRETO FCK = 20MPA, TRAÇO 1:2,7:3 (CIMENTO/ AREIA MÉDIA/ BRITA 1)  - PREPARO MECÂNICO COM BETONEIRA 600 L. AF_07/2016","M3",4.1400000000000006,null,null,0,""]
["S",2,"S",0,2,5,0,0,0,0,0,"","Serviço","Serviço","-","SINAPI",92873,"LANÇAMENTO COM USO DE BALDES, ADENSAMENTO E ACABAMENTO DE CONCRETO EM ESTRUTURAS. AF_12/2015","M3",4.1400000000000006,null,null,0,"Referência: AGETOP - 60801"]
[2,2,2,21,2,6,0,0,0,87,21,"","Nível 2","Nível 2","-",null,null,"INSTALAÇÕES ELÉTRICAS","-",null,null,null,0,""]
["S",2,"S",0,2,6,0,0,0,0,0,"","Serviço","Serviço","-","AGETOP",70351,"BRACADEIRA METALICA TIPO \"U\" DIAM. 3/4\"","Un    ",40,null,null,0,""]
["S",2,"S",0,2,6,0,0,0,0,0,"","Serviço","Serviço","-","AGETOP",71861,"PARAFUSO P/BUCHA S-6","Un    ",40,null,null,0,""]
["S",2,"S",0,2,6,0,0,0,0,0,"","Serviço","Serviço","-","AGETOP",70391,"BUCHA DE NYLON S-6","Un    ",20,null,null,0,""]
["S",2,"S",0,2,6,0,0,0,0,0,"","Serviço","Serviço","-","AGETOP",70681,"CAIXA METALICA OCTOGONAL FUNDO MOVEL, SIMPLES 2\"","Un    ",8,null,null,0,""]
["S",2,"S",0,2,6,0,0,0,0,0,"","Serviço","Serviço","-","SINAPI",91927,"CABO DE COBRE FLEXÍVEL ISOLADO, 2,5 MM², ANTI-CHAMA 0,6/1,0 KV, PARA CIRCUITOS TERMINAIS - FORNECIMENTO E INSTALAÇÃO. AF_12/2015","M",180,null,null,0,"Referência: AGETOP - 70581"]
["S",2,"S",0,2,6,0,0,0,0,0,"","Serviço","Serviço","-","SINAPI",91929,"CABO DE COBRE FLEXÍVEL ISOLADO, 4 MM², ANTI-CHAMA 0,6/1,0 KV, PARA CIRCUITOS TERMINAIS - FORNECIMENTO E INSTALAÇÃO. AF_12/2015","M",120,null,null,0,"Referência: AGETOP - 70582"]
["S",2,"S",0,2,6,0,0,0,0,0,"","Serviço","Serviço","-","SINAPI",93670,"DISJUNTOR TRIPOLAR TIPO DIN, CORRENTE NOMINAL DE 25A - FORNECIMENTO E INSTALAÇÃO. AF_04/2016","UN",1,null,null,0,"Referência: AGETOP - 71173"]
["S",2,"S",0,2,6,0,0,0,0,0,"","Serviço","Serviço","-","SINAPI",93654,"DISJUNTOR MONOPOLAR TIPO DIN, CORRENTE NOMINAL DE 16A - FORNECIMENTO E INSTALAÇÃO. AF_04/2016","UN",3,null,null,0,""]
["S",2,"S",0,2,6,0,0,0,0,0,"","Serviço","Serviço","-","SINAPI",93656,"DISJUNTOR MONOPOLAR TIPO DIN, CORRENTE NOMINAL DE 25A - FORNECIMENTO E INSTALAÇÃO. AF_04/2016","UN",2,null,null,0,""]
["S",2,"S",0,2,6,0,0,0,0,0,"","Serviço","Serviço","-","AGETOP",71184,"DISPOSITIVO DE PROTEÇÃO CONTRA SURTOS (D.P.S.) 275V DE 8 A 40KA","Un    ",3,null,null,0,""]
["S",2,"S",0,2,6,0,0,0,0,0,"","Serviço","Serviço","-","AGETOP",71411,"INTERRUPTOR 1 SEÇÃO (LINHA X OU EQUIVALENTE)","Un    ",3,null,null,0,""]
["S",2,"S",0,2,6,0,0,0,{"$f":"IF(OR($C326=\"S\",$C326=0),0,MATCH(0,OFFSET($D326,1,$C326,ROW($C$619)-ROW($C326)),0))","v":0},{"$f":"IF(OR($C326=\"S\",$C326=0),0,MATCH(OFFSET($D326,0,$C326)+1,OFFSET($D326,1,$C326,ROW($C$619)-ROW($C326)),0))","v":0},"","Serviço","Serviço","-","SINAPI",92868,"CAIXA RETANGULAR 4\" X 2\" MÉDIA (1,30 M DO PISO), METÁLICA, INSTALADA EM PAREDE - FORNECIMENTO E INSTALAÇÃO. AF_12/2015","UN",21,null,null,0,"Referência: AGETOP - 70691"]
["S",2,"S",0,2,6,0,0,0,0,0,"","Serviço","Serviço","-","AGETOP",72570,"TOMADA HEXAGONAL 2P + T - 10A - 250V (LINHA X OU EQUIVALENTE)","Un    ",17,null,null,0,""]
["S",2,"S",0,2,6,0,0,0,0,0,"","Serviço","Serviço","-","AGETOP",72575,"TOMADA HEXAGONAL 2P + T - 20A - 250V (LINHA X OU EQUIVALENTE)","Un    ",1,null,null,0,""]
["S",2,"S",0,2,6,0,0,0,0,0,"","Serviço","Serviço","-","SINAPI",91842,"ELETRODUTO FLEXÍVEL CORRUGADO, PVC, DN 20 MM (1/2\"), PARA CIRCUITOS TERMINAIS, INSTALADO EM LAJE - FORNECIMENTO E INSTALAÇÃO. AF_12/2015","M",50,null,null,0,""]
["S",2,"S",0,2,6,0,0,0,0,0,"","Serviço","Serviço","-","SINAPI","74131/5","QUADRO DE DISTRIBUICAO DE ENERGIA DE EMBUTIR, EM CHAPA METALICA, PARA 24 DISJUNTORES TERMOMAGNETICOS MONOPOLARES, COM BARRAMENTO TRIFASICO E NEUTRO, FORNECIMENTO E INSTALACAO","UN",1,null,null,0,""]
["S",2,"S",0,2,6,0,0,0,0,0,"","Serviço","Serviço","-","AGETOP",71644,"LUMINÁRIA TIPO PLAFON DE SOBREPOR QUADRADA PARA 02 LÂMPADAS","Un    ",8,null,null,0,""]
["S",2,"S",0,2,6,0,0,0,0,0,"","Serviço","Serviço","-","COMPOSIÇÃO","COMP 387_SEE","LÂMPADA LED TUBULAR 18W ","UN ",16,null,null,0,""]
["S",2,"S",0,2,6,0,0,0,0,0,"","Serviço","Serviço","-","SINAPI",97608,"LUMINÁRIA ARANDELA TIPO TARTARUGA, COM GRADE, PARA 1 LÂMPADA DE 15 W - FORNECIMENTO E INSTALAÇÃO. AF_11/2017","UN",3,null,null,0,""]
["S",2,"S",0,2,6,0,0,0,0,0,"","Serviço","Serviço","-","AGETOP",71331,"FITA ISOLANTE, ROLO DE 20,00 M","Un    ",10,null,null,0,""]
[2,2,2,27,2,7,0,0,0,66,27,"","Nível 2","Nível 2","-","AGETOP",null,"INSTALAÇÕES HIDROSSANITÁRIAS","-",null,null,null,0,""]
[3,3,3,6,2,7,1,0,0,26,6,"","Nível 3","Nível 3","-","SINAPI",null,"PEÇAS E ACESSÓRIOS","-",null,null,null,0,""]
["S",3,"S",0,2,7,1,0,0,0,0,"","Serviço","Serviço","-","COMPOSIÇÃO","COMP 554_SEE","CAIXA DE DECANTAÇÃO","UN ",1,null,null,0,""]
["S",3,"S",0,2,7,1,0,0,0,0,"","Serviço","Serviço","-","SINAPI",86909,"TORNEIRA CROMADA TUBO MÓVEL, DE MESA, 1/2\" OU 3/4\", PARA PIA DE COZINHA, PADRÃO ALTO - FORNECIMENTO E INSTALAÇÃO. AF_12/2013","UN",3,null,null,0,""]
["S",3,"S",0,2,7,1,0,0,0,0,"","Serviço","Serviço","-","SINAPI",86881,"SIFÃO DO TIPO GARRAFA EM METAL CROMADO 1 X 1.1/2\" - FORNECIMENTO E INSTALAÇÃO. AF_12/2013","UN",3,null,null,0,"Referência: AGETOP - 80670"]
["S",3,"S",0,2,7,1,0,0,0,0,"","Serviço","Serviço","-","SINAPI",86878,"VÁLVULA EM METAL CROMADO TIPO AMERICANA 3.1/2\" X 1.1/2\" PARA PIA - FORNECIMENTO E INSTALAÇÃO. AF_12/2013","UN",3,null,null,0,""]
["S",3,"S",0,2,7,1,0,0,0,0,"","Serviço","Serviço","-","SINAPI",89987,"REGISTRO DE GAVETA BRUTO, LATÃO, ROSCÁVEL, 3/4\", COM ACABAMENTO E CANOPLA CROMADOS. FORNECIDO E INSTALADO EM RAMAL DE ÁGUA. AF_12/2014","UN",3,null,null,0,"Referência: AGETOP - 80926"]
[3,3,3,10,2,7,2,0,0,20,10,"","Nível 3","Nível 3","-","SINAPI",null,"ÁGUA FRIA","-",null,null,null,0,""]
["S",3,"S",0,2,7,2,0,0,0,0,"","Serviço","Serviço","-","SINAPI",89402,"TUBO, PVC, SOLDÁVEL, DN 25MM, INSTALADO EM RAMAL DE DISTRIBUIÇÃO DE ÁGUA - FORNECIMENTO E INSTALAÇÃO. AF_12/2014","M",28,null,null,0,"Referência: AGETOP - 81003"]
["S",3,"S",0,2,7,2,0,0,0,0,"","Serviço","Serviço","-","SINAPI",89447,"TUBO, PVC, SOLDÁVEL, DN 32MM, INSTALADO EM PRUMADA DE ÁGUA - FORNECIMENTO E INSTALAÇÃO. AF_12/2014","M",22,null,null,0,""]
["S",3,"S",0,2,7,2,0,0,0,0,"","Serviço","Serviço","-","AGETOP",80556,"LIGAÇÃO FLEXÍVEL PVC DIAM.1/2\" (ENGATE)","Un    ",3,null,null,0,""]
["S",3,"S",0,2,7,2,0,0,0,0,"","Serviço","Serviço","-","SINAPI",89538,"ADAPTADOR CURTO COM BOLSA E ROSCA PARA REGISTRO, PVC, SOLDÁVEL, DN 25MM X 3/4\u0094, INSTALADO EM PRUMADA DE ÁGUA - FORNECIMENTO E INSTALAÇÃO. AF_12/2014","UN",6,null,null,0,""]
["S",3,"S",0,2,7,2,0,0,0,0,"","Serviço","Serviço","-","SINAPI",96662,"BUCHA DE REDUÇÃO, PPR, 32 X 25, CLASSE PN 25, INSTALADO EM RAMAL DE DISTRIBUIÇÃO DE ÁGUA \u0096 FORNECIMENTO E INSTALAÇÃO . AF_06/2015","UN",3,null,null,0,"Referência: AGETOP - 81162"]
["S",3,"S",0,2,7,2,0,0,0,0,"","Serviço","Serviço","-","SINAPI",89481,"JOELHO 90 GRAUS, PVC, SOLDÁVEL, DN 25MM, INSTALADO EM PRUMADA DE ÁGUA - FORNECIMENTO E INSTALAÇÃO. AF_12/2014","UN",6,null,null,0,""]
["S",3,"S",0,2,7,2,0,0,0,0,"","Serviço","Serviço","-","SINAPI",89413,"JOELHO 90 GRAUS, PVC, SOLDÁVEL, DN 32MM, INSTALADO EM RAMAL DE DISTRIBUIÇÃO DE ÁGUA - FORNECIMENTO E INSTALAÇÃO. AF_12/2014","UN",1,null,null,0,"Referência: AGETOP - 81322"]
["S",3,"S",0,2,7,2,0,0,0,0,"","Serviço","Serviço","-","AGETOP",81369,"JOELHO 90 GRAUS SOLD. C/BUCHA LATAO 25 X 3/4\"","Un    ",3,null,null,0,""]
["S",3,"S",0,2,7,2,0,0,0,0,"","Serviço","Serviço","-","SINAPI",89443,"TE, PVC, SOLDÁVEL, DN 32MM, INSTALADO EM RAMAL DE DISTRIBUIÇÃO DE ÁGUA - FORNECIMENTO E INSTALAÇÃO. AF_12/2014","UN",2,null,null,0,"Referência: AGETOP - 81403"]
[3,3,3,6,2,7,3,0,0,10,6,"","Nível 3","Nível 3","-","SINAPI",null,"ESGOTO SANITÁRIO","-",null,null,null,0,""]
["S",3,"S",0,2,7,3,0,0,0,0,"","Serviço","Serviço","-","AGETOP",81550,"CURVA 45º DIAMETRO 50 MM","Un    ",4,null,null,0,""]
["S",3,"S",0,2,7,3,0,0,0,0,"","Serviço","Serviço","-","SINAPI",89731,"JOELHO 90 GRAUS, PVC, SERIE NORMAL, ESGOTO PREDIAL, DN 50 MM, JUNTA ELÁSTICA, FORNECIDO E INSTALADO EM RAMAL DE DESCARGA OU RAMAL DE ESGOTO SANITÁRIO. AF_12/2014","UN",2,null,null,0,""]
["S",3,"S",0,2,7,3,0,0,0,0,"","Serviço","Serviço","-","AGETOP",81973,"JUNCAO SIMPLES DIAM. 100 X 50 MM","Un    ",2,null,null,0,""]
["S",3,"S",0,2,7,3,0,0,0,0,"","Serviço","Serviço","-","SINAPI",89798,"TUBO PVC, SERIE NORMAL, ESGOTO PREDIAL, DN 50 MM, FORNECIDO E INSTALADO EM PRUMADA DE ESGOTO SANITÁRIO OU VENTILAÇÃO. AF_12/2014","M",30,null,null,0,""]
["S",3,"S",0,2,7,3,0,0,0,0,"","Serviço","Serviço","-","SINAPI",89800,"TUBO PVC, SERIE NORMAL, ESGOTO PREDIAL, DN 100 MM, FORNECIDO E INSTALADO EM PRUMADA DE ESGOTO SANITÁRIO OU VENTILAÇÃO. AF_12/2014","M",14,null,null,0,""]
[3,3,3,4,2,7,4,0,0,4,{"$error":"#N/A"},"","Nível 3","Nível 3","-","SINAPI",null,"OUTROS","-",null,null,null,0,""]
["S",3,"S",0,2,7,4,0,0,0,0,"","Serviço","Serviço","-","AGETOP",81825,"CAIXA DE PASSAGEM 60 X 60 CM SEM TAMPA","Un    ",1,null,null,0,""]
["S",3,"S",0,2,7,4,0,0,0,0,"","Serviço","Serviço","-","AGETOP",81826,"TAMPA EM CONCRETO ARMADO 25 MPA E=5CM PARA A CAIXA DE PASSAGEM 60X60CM","Un    ",1,null,null,0,""]
["S",3,"S",0,2,7,4,0,0,0,0,"","Serviço","Serviço","-","AGETOP",81885,"TERMINAL DE VENTILACAO DIAMETRO 50 MM","Un    ",1,null,null,0,""]
[2,2,2,2,2,8,0,0,0,39,2,"","Nível 2","Nível 2","-","AGETOP",91045,"ALVENARIAS E DIVISÓRIAS","Un    ",null,null,null,0,""]
["S",2,"S",0,2,8,0,0,0,0,0,"","Serviço","Serviço","-","SINAPI",87520,"ALVENARIA DE VEDAÇÃO DE BLOCOS CERÂMICOS FURADOS NA HORIZONTAL DE 9X19X19CM (ESPESSURA 9CM) DE PAREDES COM ÁREA LÍQUIDA MAIOR OU IGUAL A 6M² COM VÃOS E ARGAMASSA DE ASSENTAMENTO COM PREPARO MANUAL. AF_06/2014","M2",106.5,null,null,0,"Referência: AGETOP - 100201"]
[2,2,2,2,2,9,0,0,0,37,2,"","Nível 2","Nível 2","-",null,null,"IMPERMEABILIZAÇÃO","-",null,null,null,0,""]
["S",2,"S",0,2,9,0,0,0,0,0,"","Serviço","Serviço","-","SINAPI",98562,"IMPERMEABILIZAÇÃO DE FLOREIRA OU VIGA BALDRAME COM ARGAMASSA DE CIMENTO E AREIA, COM ADITIVO IMPERMEABILIZANTE, E = 2 CM. AF_06/2018","M2",21.94,null,null,0,"Referência: AGETOP - 120902"]
[2,2,2,2,2,10,0,0,0,35,2,"","Nível 2","Nível 2","-",null,null,"ESTRUTURAS METÁLICAS","-",null,null,null,0,""]
["S",2,"S",0,2,10,0,0,0,0,0,"","Serviço","Serviço","-","AGETOP",150204,"ESTRUTURA METÁLICA CONVENCIONAL EM AÇO TIPO MR-250 / ASTM A36 COM FUNDO ANTICORROSIVO","Kg    ",1281.4000000000001,null,null,0,""]
[2,2,2,4,2,11,0,0,0,33,4,"","Nível 2","Nível 2","-",null,null,"COBERTURAS","-",null,null,null,0,""]
["S",2,"S",0,2,11,0,0,0,0,0,"","Serviço","Serviço","-","SINAPI",94445,"TELHAMENTO COM TELHA CERÂMICA CAPA-CANAL, TIPO PLAN, COM ATÉ 2 ÁGUAS, INCLUSO TRANSPORTE VERTICAL. AF_06/2016","M2",101.11,null,null,0,"Referência: AGETOP - 160401"]
["S",2,"S",0,2,11,0,0,0,0,0,"","Serviço","Serviço","-","SINAPI",94221,"CUMEEIRA PARA TELHA CERÂMICA EMBOÇADA COM ARGAMASSA TRAÇO 1:2:9 (CIMENTO, CAL E AREIA) PARA TELHADOS COM ATÉ 2 ÁGUAS, INCLUSO TRANSPORTE VERTICAL. AF_06/2016","M",9.5,null,null,0,""]
["S",2,"S",0,2,11,0,0,0,0,0,"","Serviço","Serviço","-","SINAPI",94224,"EMBOÇAMENTO COM ARGAMASSA TRAÇO 1:2:9 (CIMENTO, CAL E AREIA). AF_06/2016","M",40.299999999999997,null,null,0,"Referência: AGETOP - 160403"]
[2,2,2,3,2,12,0,0,0,29,3,"","Nível 2","Nível 2","-",null,null,"ESQUADRIAS METÁLICAS","-",null,null,null,0,""]
["S",2,"S",0,2,12,0,0,0,0,0,"","Serviço","Serviço","-","SINAPI",94559,"JANELA DE AÇO BASCULANTE, FIXAÇÃO COM ARGAMASSA, SEM VIDROS, PADRONIZADA. AF_07/2016","M2",14.399999999999999,null,null,0,"Referência: AGETOP - 180404"]
["S",2,"S",0,2,12,0,0,0,0,0,"","Serviço","Serviço","-","SINAPI","73933/4","PORTA DE FERRO DE ABRIR TIPO BARRA CHATA, COM REQUADRO E GUARNICAO COMPLETA","M2",1.8900000000000001,null,null,0,"Referência: AGETOP - 180501"]
[2,2,2,2,2,13,0,0,0,26,2,"","Nível 2","Nível 2","-","SINAPI",null,"VIDROS","-",null,null,null,0,""]
["S",2,"S",0,2,13,0,0,0,0,0,"","Serviço","Serviço","-","SINAPI",72117,"VIDRO LISO COMUM TRANSPARENTE, ESPESSURA 4MM","M2",14.4,null,null,0,"Referência: AGETOP - 190102"]
[2,2,2,5,2,14,0,0,0,24,5,"","Nível 2","Nível 2","-",null,null,"REVESTIMENTO DE PAREDE","-",null,null,null,0,""]
["S",2,"S",0,2,14,0,0,0,0,0,"","Serviço","Serviço","-","SINAPI",87553,"EMBOÇO, PARA RECEBIMENTO DE CERÂMICA, EM ARGAMASSA TRAÇO 1:2:8, PREPARO MECÂNICO COM BETONEIRA 400L, APLICADO MANUALMENTE EM FACES INTERNAS DE PAREDES, PARA AMBIENTE COM ÁREA MAIOR QUE 10M2, ESPESSURA DE 10MM, COM EXECUÇÃO DE TALISCAS. AF_06/2014","M2",74.5,null,null,0,""]
["S",2,"S",0,2,14,0,0,0,0,0,"","Serviço","Serviço","-","SINAPI",87904,"CHAPISCO APLICADO EM ALVENARIA (COM PRESENÇA DE VÃOS) E ESTRUTURAS DE CONCRETO DE FACHADA, COM COLHER DE PEDREIRO.  ARGAMASSA TRAÇO 1:3 COM PREPARO MANUAL. AF_06/2014","M2",213,null,null,0,"Referência: AGETOP - 200101"]
["S",2,"S",0,2,14,0,0,0,0,0,"","Serviço","Serviço","-","SINAPI",87547,"MASSA ÚNICA, PARA RECEBIMENTO DE PINTURA, EM ARGAMASSA TRAÇO 1:2:8, PREPARO MECÂNICO COM BETONEIRA 400L, APLICADA MANUALMENTE EM FACES INTERNAS DE PAREDES, ESPESSURA DE 10MM, COM EXECUÇÃO DE TALISCAS. AF_06/2014","M2",138.5,null,null,0,""]
["S",2,"S",0,2,14,0,0,0,0,0,"","Serviço","Serviço","-","SINAPI",87273,"REVESTIMENTO CERÂMICO PARA PAREDES INTERNAS COM PLACAS TIPO ESMALTADA EXTRA DE DIMENSÕES 33X45 CM APLICADAS EM AMBIENTES DE ÁREA MAIOR QUE 5 M² NA ALTURA INTEIRA DAS PAREDES. AF_06/2014","M2",74.5,null,null,0,""]
[2,2,2,2,2,15,0,0,0,19,2,"","Nível 2","Nível 2","-",null,null,"FORROS","-",null,null,null,0,""]
["S",2,"S",0,2,15,0,0,0,0,0,"","Serviço","Serviço","-","SINAPI",87414,"APLICAÇÃO MANUAL DE GESSO DESEMPENADO (SEM TALISCAS) EM TETO DE AMBIENTES DE ÁREA MAIOR QUE 10M², ESPESSURA DE 1,0CM. AF_06/2014","M2",52.78,null,null,0,"Referência: AGETOP - 210515"]
[2,2,2,5,2,16,0,0,0,17,5,"","Nível 2","Nível 2","-",null,null,"REVESTIMENTO DE PISO","-",null,null,null,0,""]
["S",2,"S",0,2,16,0,0,0,0,0,"","Serviço","Serviço","-","SINAPI",84191,"PISO EM GRANILITE, MARMORITE OU GRANITINA ESPESSURA 8 MM, INCLUSO JUNTAS DE DILATACAO PLASTICAS","M2",48.51,null,null,0,"Referência: AGETOP - 221101"]
["S",2,"S",0,2,16,0,0,0,0,0,"","Serviço","Serviço","-","AGETOP",221104,"RASPAGEM E APLICAÇÃO RESINA ACRÍLICA DUAS DEMÃOS","m2    ",48.51,null,null,0,""]
["S",2,"S",0,2,16,0,0,0,0,0,"","Serviço","Serviço","-","SINAPI",94992,"EXECUÇÃO DE PASSEIO (CALÇADA) OU PISO DE CONCRETO COM CONCRETO MOLDADO IN LOCO, FEITO EM OBRA, ACABAMENTO CONVENCIONAL, ESPESSURA 6 CM, ARMADO. AF_07/2016","M2",15.3,null,null,0,""]
["S",2,"S",0,2,16,0,0,0,0,0,"","Serviço","Serviço","-","AGETOP",220100,"PASSEIO PROTECAO EM CONC.DESEMPEN.5 CM 1:2,5:3,5 ( INCLUSO ESPELHO DE 30CM/ESCAVAÇÃO/REATERRO/APILOAMENTO/ATERRO INTERNO)","m2    ",29.04,null,null,0,""]
[2,2,2,8,2,17,0,0,0,12,8,"","Nível 2","Nível 2","-",null,null,"PINTURA","-",null,null,null,0,""]
["S",2,"S",0,2,17,0,0,0,{"$f":"IF(OR($C390=\"S\",$C390=0),0,MATCH(0,OFFSET($D390,1,$C390,ROW($C$619)-ROW($C390)),0))","v":0},{"$f":"IF(OR($C390=\"S\",$C390=0),0,MATCH(OFFSET($D390,0,$C390)+1,OFFSET($D390,1,$C390,ROW($C$619)-ROW($C390)),0))","v":0},"","Serviço","Serviço","-","SINAPI",88497,"APLICAÇÃO E LIXAMENTO DE MASSA LÁTEX EM PAREDES, DUAS DEMÃOS. AF_06/2014","M2",11.5,null,null,0,"Referência: AGETOP - 261300"]
["S",2,"S",0,2,17,0,0,0,0,0,"","Serviço","Serviço","-","AGETOP",261550,"PINT.ESMALTE SINT.PAREDES - 2 DEM.C/SELADOR","m2    ",11.5,null,null,0,""]
["S",2,"S",0,2,17,0,0,0,0,0,"","Serviço","Serviço","-","SINAPI",88497,"APLICAÇÃO E LIXAMENTO DE MASSA LÁTEX EM PAREDES, DUAS DEMÃOS. AF_06/2014","M2",127,null,null,0,"Referência: AGETOP - 261300"]
["S",2,"S",0,2,17,0,0,0,0,0,"","Serviço","Serviço","-","SINAPI",88489,"APLICAÇÃO MANUAL DE PINTURA COM TINTA LÁTEX ACRÍLICA EM PAREDES, DUAS DEMÃOS. AF_06/2014","M2",127,null,null,0,"Referência: AGETOP - 261001"]
["S",2,"S",0,2,17,0,0,0,0,0,"","Serviço","Serviço","-","SINAPI",88496,"APLICAÇÃO E LIXAMENTO DE MASSA LÁTEX EM TETO, DUAS DEMÃOS. AF_06/2014","M2",52.78,null,null,0,"Referência: AGETOP - 261300"]
["S",2,"S",0,2,17,0,0,0,0,0,"","Serviço","Serviço","-","SINAPI",88486,"APLICAÇÃO MANUAL DE PINTURA COM TINTA LÁTEX PVA EM TETO, DUAS DEMÃOS. AF_06/2014","M2",52.78,null,null,0,"Referência: AGETOP - 261307"]
["S",2,"S",0,2,17,0,0,0,0,0,"","Serviço","Serviço","-","SINAPI","74145/1","PINTURA ESMALTE FOSCO, DUAS DEMAOS, SOBRE SUPERFICIE METALICA, INCLUSO UMA DEMAO DE FUNDO ANTICORROSIVO. UTILIZACAO DE REVOLVER ( AR-COMPRIMIDO).","M2",32.6,null,null,0,"Referência: AGETOP - 261602"]
[2,2,2,4,2,18,0,0,0,4,{"$error":"#N/A"},"","Nível 2","Nível 2","-",null,null,"DIVERSOS","-",null,null,null,0,""]
["S",2,"S",0,2,18,0,0,0,0,0,"","Serviço","Serviço","-","AGETOP",270501,"LIMPEZA FINAL DE OBRA - (OBRAS CIVIS)","m2    ",52.78,null,null,0,""]
["S",2,"S",0,2,18,0,0,0,0,0,"","Serviço","Serviço","-","AGETOP",271208,"QD.GIZ EMBOCO/LAM.MELAMINICO COMPL.-ESC.2000 6,87X1,39M","Un    ",1,null,null,0,""]
["S",2,"S",0,2,18,0,0,0,0,0,"","Serviço","Serviço","-","AGETOP",271608,"BANCADA DE GRANITO C/ESPELHO","m2    ",20.3,null,null,0,""]
[1,{"$f":"IF(OR(C401=\"s\",C401=0),OFFSET(B401,-1,0),C401)","v":1},{"$f":"IF(OFFSET(C401,-1,0)=\"L\",1,IF(OFFSET(C401,-1,0)=1,2,IF(OR(A401=\"s\",A401=0),\"S\",IF(AND(OFFSET(C401,-1,0)=2,A401=4),3,IF(AND(OR(OFFSET(C401,-1,0)=\"s\",OFFSET(C401,-1,0)=0),A401<>\"s\",A401>OFFSET(B401,-1,0)),OFFSET(B401,-1,0),A401)))))","v":1},{"$f":"IF(OR(C401=\"S\",C401=0),0,IF(ISERROR(K401),J401,SMALL(J401:K401,1)))","v":181},{"$f":"IF($C401=1,OFFSET(E401,-1,0)+1,OFFSET(E401,-1,0))","v":3},{"$f":"IF($C401=1,0,IF($C401=2,OFFSET(F401,-1,0)+1,OFFSET(F401,-1,0)))","v":0},{"$f":"IF(AND($C401<=2,$C401<>0),0,IF($C401=3,OFFSET(G401,-1,0)+1,OFFSET(G401,-1,0)))","v":0},{"$f":"IF(AND($C401<=3,$C401<>0),0,IF($C401=4,OFFSET(H401,-1,0)+1,OFFSET(H401,-1,0)))","v":0},{"$f":"IF(AND($C401<=4,$C401<>0),0,IF(AND($C401=\"S\",$W401>0),OFFSET(I401,-1,0)+1,OFFSET(I401,-1,0)))","v":0},218,181,"F","Nível 1","Nível 1","3.","SINAPI",null,"BLOCO VESTIÁRIO PADRÃO SEDUC 2019 - SEC. XXI","-",null,null,null,0,""]
[2,2,2,2,3,1,0,0,0,180,2,"","Nível 2","Nível 2","-","SINAPI",null,"SERVIÇOS PRELIMINARES","-",null,null,null,0,""]
["S",2,"S",0,3,1,0,0,0,0,0,"","Serviço","Serviço","-","AGETOP",20701,"LOCAÇÃO DA OBRA, EXECUÇÃO DE GABARITO SEM REAPROVEITAMENTO, INCLUSO PINTURA (FACE INTERNA DO RIPÃO 15CM) E PIQUETE COM TESTEMUNHA","m2    ",55.24,null,null,0,""]
[2,2,2,3,3,2,0,0,0,178,3,"","Nível 2","Nível 2","-",null,null,"TRANSPORTES","-",null,null,null,0,""]
["S",2,"S",0,3,2,0,0,0,0,0,"","Serviço","Serviço","-","SINAPI",72900,"TRANSPORTE DE ENTULHO COM CAMINHAO BASCULANTE 6 M3, RODOVIA PAVIMENTADA, DMT 0,5 A 1,0 KM","M3",3.87,null,null,0,""]
["S",2,"S",0,3,2,0,0,0,0,0,"","Serviço","Serviço","-","SINAPI",72897,"CARGA MANUAL DE ENTULHO EM CAMINHAO BASCULANTE 6 M3","M3",3.87,null,null,0,""]
[2,2,2,22,3,3,0,0,0,175,22,"","Nível 2","Nível 2","-",null,null,"FUNDAÇÕES E SONDAGENS","-",null,null,null,0,""]
[3,3,3,10,3,3,1,0,0,21,10,"","Nível 3","Nível 3","-","SINAPI",null,"ESTACAS E BLOCOS","-",null,null,null,0,""]
["S",3,"S",0,3,3,1,0,0,0,0,"","Serviço","Serviço","-","SINAPI",98230,"ESTACA BROCA DE CONCRETO, DIÂMETRO DE 30 CM, PROFUNDIDADE DE ATÉ 3 M, ESCAVAÇÃO MANUAL COM TRADO CONCHA, NÃO ARMADA. AF_03/2018","M",69.5,null,null,0,"Referência: AGETOP - 50302"]
["S",3,"S",0,3,3,1,0,0,0,0,"","Serviço","Serviço","-","SINAPI",96522,"ESCAVAÇÃO MANUAL PARA BLOCO DE COROAMENTO OU SAPATA, SEM PREVISÃO DE FÔRMA. AF_06/2017","M3",4.08,null,null,0,"Referência: AGETOP - 50901"]
["S",3,"S",0,3,3,1,0,0,0,0,"","Serviço","Serviço","-","SINAPI",93382,"REATERRO MANUAL DE VALAS COM COMPACTAÇÃO MECANIZADA. AF_04/2016","M3",1.98,null,null,0,"Referência: AGETOP - 40904"]
["S",3,"S",0,3,3,1,0,0,0,0,"","Serviço","Serviço","-","SINAPI",94964,"CONCRETO FCK = 20MPA, TRAÇO 1:2,7:3 (CIMENTO/ AREIA MÉDIA/ BRITA 1)  - PREPARO MECÂNICO COM BETONEIRA 400 L. AF_07/2016","M3",2.1,null,null,0,""]
["S",3,"S",0,3,3,1,0,0,0,0,"","Serviço","Serviço","-","SINAPI","74157/4","LANCAMENTO/APLICACAO MANUAL DE CONCRETO EM FUNDACOES","M3",2.1,null,null,0,"Referência: AGETOP - 51055"]
["S",3,"S",0,3,3,1,0,0,0,0,"","Serviço","Serviço","-","SINAPI",94103,"LASTRO DE VALA COM PREPARO DE FUNDO, LARGURA MENOR QUE 1,5 M, COM CAMADA DE BRITA, LANÇAMENTO MANUAL, EM LOCAL COM NÍVEL BAIXO DE INTERFERÊNCIA. AF_06/2016","M3",3.5,null,null,0,"Referência: AGETOP - 60470"]
["S",3,"S",0,3,3,1,0,0,0,0,"","Serviço","Serviço","-","SINAPI",96545,"ARMAÇÃO DE BLOCO, VIGA BALDRAME OU SAPATA UTILIZANDO AÇO CA-50 DE 8 MM - MONTAGEM. AF_06/2017","KG",43.51,null,null,0,"Referência: AGETOP - 52004"]
["S",3,"S",0,3,3,1,0,0,0,0,"","Serviço","Serviço","-","SINAPI",96546,"ARMAÇÃO DE BLOCO, VIGA BALDRAME OU SAPATA UTILIZANDO AÇO CA-50 DE 10 MM - MONTAGEM. AF_06/2017","KG",24.99,null,null,0,"Referência: AGETOP - 52005"]
["S",3,"S",0,3,3,1,0,0,0,0,"","Serviço","Serviço","-","SINAPI",96543,"ARMAÇÃO DE BLOCO, VIGA BALDRAME E SAPATA UTILIZANDO AÇO CA-60 DE 5 MM - MONTAGEM. AF_06/2017","KG",36.79,null,null,0,"Referência: AGETOP - 52014"]
[3,3,3,11,3,3,2,0,0,11,28,"","Nível 3","Nível 3","-","SINAPI",null,"VIGAS BALDRAMES","-",null,null,null,0,""]
["S",3,"S",0,3,3,2,0,0,0,0,"","Serviço","Serviço","-","SINAPI",96527,"ESCAVAÇÃO MANUAL DE VALA PARA VIGA BALDRAME, COM PREVISÃO DE FÔRMA. AF_06/2017","M3",5.68,null,null,0,"Referência: AGETOP - 40101"]
["S",3,"S",0,3,3,2,0,0,0,0,"","Serviço","Serviço","-","SINAPI",94103,"LASTRO DE VALA COM PREPARO DE FUNDO, LARGURA MENOR QUE 1,5 M, COM CAMADA DE BRITA, LANÇAMENTO MANUAL, EM LOCAL COM NÍVEL BAIXO DE INTERFERÊNCIA. AF_06/2016","M3",0.41,null,null,0,"Referência: AGETOP - 60470"]
["S",3,"S",0,3,3,2,0,0,0,0,"","Serviço","Serviço","-","SINAPI",96995,"REATERRO MANUAL APILOADO COM SOQUETE. AF_10/2017","M3",4.05,null,null,0,"Referência: AGETOP - 40902"]
["S",3,"S",0,3,3,2,0,0,0,0,"","Serviço","Serviço","-","AGETOP",60191,"FORMA DE TABUA CINTA BALDRAME U=8 VEZES","m2    ",27.02,null,null,0,""]
["S",3,"S",0,3,3,2,0,0,0,0,"","Serviço","Serviço","-","SINAPI",94964,"CONCRETO FCK = 20MPA, TRAÇO 1:2,7:3 (CIMENTO/ AREIA MÉDIA/ BRITA 1)  - PREPARO MECÂNICO COM BETONEIRA 400 L. AF_07/2016","M3",1.62,null,null,0,""]
["S",3,"S",0,3,3,2,0,0,0,0,"","Serviço","Serviço","-","SINAPI",92873,"LANÇAMENTO COM USO DE BALDES, ADENSAMENTO E ACABAMENTO DE CONCRETO EM ESTRUTURAS. AF_12/2015","M3",1.62,null,null,0,"Referência: AGETOP - 60801"]
["S",3,"S",0,3,3,2,0,0,0,0,"","Serviço","Serviço","-","SINAPI",96544,"ARMAÇÃO DE BLOCO, VIGA BALDRAME OU SAPATA UTILIZANDO AÇO CA-50 DE 6,3 MM - MONTAGEM. AF_06/2017","KG",49.29,null,null,0,"Referência: AGETOP - 52003"]
["S",3,"S",0,3,3,2,0,0,0,0,"","Serviço","Serviço","-","SINAPI",96545,"ARMAÇÃO DE BLOCO, VIGA BALDRAME OU SAPATA UTILIZANDO AÇO CA-50 DE 8 MM - MONTAGEM. AF_06/2017","KG",30.49,null,null,0,"Referência: AGETOP - 52004"]
["S",3,"S",0,3,3,2,0,0,0,0,"","Serviço","Serviço","-","SINAPI",96546,"ARMAÇÃO DE BLOCO, VIGA BALDRAME OU SAPATA UTILIZANDO AÇO CA-50 DE 10 MM - MONTAGEM. AF_06/2017","KG",12.15,null,null,0,"Referência: AGETOP - 52005"]
["S",3,"S",0,3,3,2,0,0,0,0,"","Serviço","Serviço","-","SINAPI",96543,"ARMAÇÃO DE BLOCO, VIGA BALDRAME E SAPATA UTILIZANDO AÇO CA-60 DE 5 MM - MONTAGEM. AF_06/2017","KG",55.9,null,null,0,"Referência: AGETOP - 52014"]
[2,2,2,19,3,4,0,0,0,153,19,"","Nível 2","Nível 2","-",null,null,"ESTRUTURA","-",null,null,null,0,""]
[3,3,3,7,3,4,1,0,0,18,7,"","Nível 3","Nível 3","-","SINAPI",null,"PILARES ","-",null,null,null,0,""]
["S",3,"S",0,3,4,1,0,0,0,0,"","Serviço","Serviço","-","SINAPI",92418,"MONTAGEM E DESMONTAGEM DE FÔRMA DE PILARES RETANGULARES E ESTRUTURAS SIMILARES COM ÁREA MÉDIA DAS SEÇÕES MENOR OU IGUAL A 0,25 M², PÉ-DIREITO SIMPLES, EM CHAPA DE MADEIRA COMPENSADA RESINADA, 4 UTILIZAÇÕES. AF_12/2015","M2",18.14,null,null,0,"Referência: AGETOP - 60209"]
["S",3,"S",0,3,4,1,0,0,0,0,"","Serviço","Serviço","-","SINAPI",94964,"CONCRETO FCK = 20MPA, TRAÇO 1:2,7:3 (CIMENTO/ AREIA MÉDIA/ BRITA 1)  - PREPARO MECÂNICO COM BETONEIRA 400 L. AF_07/2016","M3",0.73,null,null,0,""]
["S",3,"S",0,3,4,1,0,0,0,0,"","Serviço","Serviço","-","SINAPI",92873,"LANÇAMENTO COM USO DE BALDES, ADENSAMENTO E ACABAMENTO DE CONCRETO EM ESTRUTURAS. AF_12/2015","M3",0.73,null,null,0,"Referência: AGETOP - 60801"]
["S",3,"S",0,3,4,1,0,0,0,0,"","Serviço","Serviço","-","SINAPI",92777,"ARMAÇÃO DE PILAR OU VIGA DE UMA ESTRUTURA CONVENCIONAL DE CONCRETO ARMADO EM UMA EDIFICAÇÃO TÉRREA OU SOBRADO UTILIZANDO AÇO CA-50 DE 8,0 MM - MONTAGEM. AF_12/2015","KG",24.49,null,null,0,"Referência: AGETOP - 60304"]
["S",3,"S",0,3,4,1,0,0,0,0,"","Serviço","Serviço","-","SINAPI",92778,"ARMAÇÃO DE PILAR OU VIGA DE UMA ESTRUTURA CONVENCIONAL DE CONCRETO ARMADO EM UMA EDIFICAÇÃO TÉRREA OU SOBRADO UTILIZANDO AÇO CA-50 DE 10,0 MM - MONTAGEM. AF_12/2015","KG",87.29,null,null,0,"Referência: AGETOP - 60305"]
["S",3,"S",0,3,4,1,0,0,0,0,"","Serviço","Serviço","-","SINAPI",92775,"ARMAÇÃO DE PILAR OU VIGA DE UMA ESTRUTURA CONVENCIONAL DE CONCRETO ARMADO EM UMA EDIFICAÇÃO TÉRREA OU SOBRADO UTILIZANDO AÇO CA-60 DE 5,0 MM - MONTAGEM. AF_12/2015","KG",30.95,null,null,0,"Referência: AGETOP - 60314"]
[3,3,3,9,3,4,2,0,0,11,9,"","Nível 3","Nível 3","-","SINAPI",null,"VIGAS DE COBERTURA","-",null,null,null,0,""]
["S",3,"S",0,3,4,2,0,0,0,0,"","Serviço","Serviço","-","SINAPI",92475,"MONTAGEM E DESMONTAGEM DE FÔRMA DE VIGA, ESCORAMENTO COM GARFO DE MADEIRA, PÉ-DIREITO SIMPLES, EM CHAPA DE MADEIRA PLASTIFICADA, 14 UTILIZAÇÕES. AF_12/2015","M2",35.130000000000003,null,null,0,""]
["S",3,"S",0,3,4,2,0,0,0,0,"","Serviço","Serviço","-","SINAPI",94964,"CONCRETO FCK = 20MPA, TRAÇO 1:2,7:3 (CIMENTO/ AREIA MÉDIA/ BRITA 1)  - PREPARO MECÂNICO COM BETONEIRA 400 L. AF_07/2016","M3",1.62,null,null,0,""]
["S",3,"S",0,3,4,2,0,0,0,0,"","Serviço","Serviço","-","SINAPI",92873,"LANÇAMENTO COM USO DE BALDES, ADENSAMENTO E ACABAMENTO DE CONCRETO EM ESTRUTURAS. AF_12/2015","M3",1.62,null,null,0,"Referência: AGETOP - 60801"]
["S",3,"S",0,3,4,2,0,0,0,0,"","Serviço","Serviço","-","SINAPI",92776,"ARMAÇÃO DE PILAR OU VIGA DE UMA ESTRUTURA CONVENCIONAL DE CONCRETO ARMADO EM UMA EDIFICAÇÃO TÉRREA OU SOBRADO UTILIZANDO AÇO CA-50 DE 6,3 MM - MONTAGEM. AF_12/2015","KG",30.09,null,null,0,"Referência: AGETOP - 60303"]
[{"$f":"CHOOSE(1+LOG(1+2*(ORÇAMENTO.Nivel=\"Nível 1\")+4*(ORÇAMENTO.Nivel=\"Nível 2\")+8*(ORÇAMENTO.Nivel=\"Nível 3\")+16*(ORÇAMENTO.Nivel=\"Nível 4\")+32*(ORÇAMENTO.Nivel=\"Serviço\"),2),0,1,2,3,4,\"S\")","v":"S"},3,"S",0,3,4,2,0,0,0,0,"","Serviço","Serviço","-","SINAPI",92777,"ARMAÇÃO DE PILAR OU VIGA DE UMA ESTRUTURA CONVENCIONAL DE CONCRETO ARMADO EM UMA EDIFICAÇÃO TÉRREA OU SOBRADO UTILIZANDO AÇO CA-50 DE 8,0 MM - MONTAGEM. AF_12/2015","KG",4.49,null,null,0,"Referência: AGETOP - 60304"]
["S",3,"S",0,3,4,2,0,0,0,0,"","Serviço","Serviço","-","SINAPI",92778,"ARMAÇÃO DE PILAR OU VIGA DE UMA ESTRUTURA CONVENCIONAL DE CONCRETO ARMADO EM UMA EDIFICAÇÃO TÉRREA OU SOBRADO UTILIZANDO AÇO CA-50 DE 10,0 MM - MONTAGEM. AF_12/2015","KG",51.33,null,null,0,"Referência: AGETOP - 60305"]
["S",3,"S",0,3,4,2,0,0,0,0,"","Serviço","Serviço","-","SINAPI",92779,"ARMAÇÃO DE PILAR OU VIGA DE UMA ESTRUTURA CONVENCIONAL DE CONCRETO ARMADO EM UMA EDIFICAÇÃO TÉRREA OU SOBRADO UTILIZANDO AÇO CA-50 DE 12,5 MM - MONTAGEM. AF_12/2015","KG",36.590000000000003,null,null,0,"Referência: AGETOP - 60306"]
["S",3,"S",0,3,4,2,0,0,0,0,"","Serviço","Serviço","-","SINAPI",92775,"ARMAÇÃO DE PILAR OU VIGA DE UMA ESTRUTURA CONVENCIONAL DE CONCRETO ARMADO EM UMA EDIFICAÇÃO TÉRREA OU SOBRADO UTILIZANDO AÇO CA-60 DE 5,0 MM - MONTAGEM. AF_12/2015","KG",43.37,null,null,0,"Referência: AGETOP - 60314"]
[3,3,3,2,3,4,3,0,0,2,{"$error":"#N/A"},"","Nível 3","Nível 3","-","SINAPI",null,"LAJE","-",null,null,null,0,""]
["S",3,"S",0,3,4,3,0,0,0,0,"","Serviço","Serviço","-","SINAPI","74202/1","LAJE PRE-MOLDADA P/FORRO, SOBRECARGA 100KG/M2, VAOS ATE 3,50M/E=8CM, C/LAJOTAS E CAP.C/CONC FCK=20MPA, 3CM, INTER-EIXO 38CM, C/ESCORAMENTO (REAPR.3X) E FERRAGEM NEGATIVA","M2",55.42,null,null,0,""]
[2,2,2,25,3,5,0,0,0,134,25,"","Nível 2","Nível 2","-",null,null,"INSTALAÇÕES ELÉTRICAS","-",null,null,null,0,""]
["S",2,"S",0,3,5,0,0,0,0,0,"","Serviço","Serviço","-","SINAPI",91173,"FIXAÇÃO DE TUBOS VERTICAIS DE PPR DIÂMETROS MENORES OU IGUAIS A 40 MM COM ABRAÇADEIRA METÁLICA RÍGIDA TIPO D 1/2\", FIXADA EM PERFILADO EM ALVENARIA. AF_05/2015","M",30,null,null,0,""]
["S",2,"S",0,3,5,0,0,0,0,0,"","Serviço","Serviço","-","SINAPI",91168,"FIXAÇÃO DE TUBOS HORIZONTAIS DE PPR DIÂMETROS MAIORES QUE 40 MM E MENORES OU IGUAIS A 75 MM COM ABRAÇADEIRA METÁLICA RÍGIDA TIPO D 1 1/2\", FIXADA EM PERFILADO EM LAJE. AF_05/2015","M",18,null,null,0,""]
["S",2,"S",0,3,5,0,0,0,0,0,"","Serviço","Serviço","-","SINAPI",91872,"ELETRODUTO RÍGIDO ROSCÁVEL, PVC, DN 32 MM (1\"), PARA CIRCUITOS TERMINAIS, INSTALADO EM PAREDE - FORNECIMENTO E INSTALAÇÃO. AF_12/2015","M",30,null,null,0,"Referência: AGETOP - 71202"]
["S",2,"S",0,3,5,0,0,0,0,0,"","Serviço","Serviço","-","SINAPI",91885,"LUVA PARA ELETRODUTO, PVC, ROSCÁVEL, DN 32 MM (1\"), PARA CIRCUITOS TERMINAIS, INSTALADA EM PAREDE - FORNECIMENTO E INSTALAÇÃO. AF_12/2015","UN",10,null,null,0,"Referência: AGETOP - 71742"]
["S",2,"S",0,3,5,0,0,0,0,0,"","Serviço","Serviço","-","SINAPI",93009,"ELETRODUTO RÍGIDO ROSCÁVEL, PVC, DN 60 MM (2\") - FORNECIMENTO E INSTALAÇÃO. AF_12/2015","M",20,null,null,0,""]
["S",2,"S",0,3,5,0,0,0,{"$f":"IF(OR($C454=\"S\",$C454=0),0,MATCH(0,OFFSET($D454,1,$C454,ROW($C$619)-ROW($C454)),0))","v":0},{"$f":"IF(OR($C454=\"S\",$C454=0),0,MATCH(OFFSET($D454,0,$C454)+1,OFFSET($D454,1,$C454,ROW($C$619)-ROW($C454)),0))","v":0},"","Serviço","Serviço","-","SINAPI",93014,"LUVA PARA ELETRODUTO, PVC, ROSCÁVEL, DN 60 MM (2\") - FORNECIMENTO E INSTALAÇÃO. AF_12/2015","UN",6,null,null,0,"Referência: AGETOP - 71745"]
["S",2,"S",0,3,5,0,0,0,0,0,"","Serviço","Serviço","-","SINAPI",91905,"CURVA 90 GRAUS PARA ELETRODUTO, PVC, ROSCÁVEL, DN 32 MM (1\"), PARA CIRCUITOS TERMINAIS, INSTALADA EM LAJE - FORNECIMENTO E INSTALAÇÃO. AF_12/2015","UN",2,null,null,0,"Referência: AGETOP - 71142"]
["S",2,"S",0,3,5,0,0,0,0,0,"","Serviço","Serviço","-","SINAPI",93020,"CURVA 90 GRAUS PARA ELETRODUTO, PVC, ROSCÁVEL, DN 60 MM (2\") - FORNECIMENTO E INSTALAÇÃO. AF_12/2015","UN",2,null,null,0,""]
["S",2,"S",0,3,5,0,0,0,0,0,"","Serviço","Serviço","-","SINAPI",91927,"CABO DE COBRE FLEXÍVEL ISOLADO, 2,5 MM², ANTI-CHAMA 0,6/1,0 KV, PARA CIRCUITOS TERMINAIS - FORNECIMENTO E INSTALAÇÃO. AF_12/2015","M",150,null,null,0,"Referência: AGETOP - 70581"]
["S",2,"S",0,3,5,0,0,0,0,0,"","Serviço","Serviço","-","SINAPI",91931,"CABO DE COBRE FLEXÍVEL ISOLADO, 6 MM², ANTI-CHAMA 0,6/1,0 KV, PARA CIRCUITOS TERMINAIS - FORNECIMENTO E INSTALAÇÃO. AF_12/2015","M",200,null,null,0,"Referência: AGETOP - 70583"]
["S",2,"S",0,3,5,0,0,0,0,0,"","Serviço","Serviço","-","SINAPI",97591,"LUMINÁRIA TIPO PLAFON REDONDO COM VIDRO FOSCO, DE SOBREPOR, COM 2 LÂMPADAS DE 15 W - FORNECIMENTO E INSTALAÇÃO. AF_11/2017","UN",8,null,null,0,""]
["S",2,"S",0,3,5,0,0,0,0,0,"","Serviço","Serviço","-","SINAPI",91940,"CAIXA RETANGULAR 4\" X 2\" MÉDIA (1,30 M DO PISO), PVC, INSTALADA EM PAREDE - FORNECIMENTO E INSTALAÇÃO. AF_12/2015","UN",12,null,null,0,""]
["S",2,"S",0,3,5,0,0,0,0,0,"","Serviço","Serviço","-","SINAPI",83446,"CAIXA DE PASSAGEM 30X30X40 COM TAMPA E DRENO BRITA","UN",1,null,null,0,""]
["S",2,"S",0,3,5,0,0,0,0,0,"","Serviço","Serviço","-","SINAPI",93654,"DISJUNTOR MONOPOLAR TIPO DIN, CORRENTE NOMINAL DE 16A - FORNECIMENTO E INSTALAÇÃO. AF_04/2016","UN",1,null,null,0,""]
["S",2,"S",0,3,5,0,0,0,0,0,"","Serviço","Serviço","-","SINAPI",93670,"DISJUNTOR TRIPOLAR TIPO DIN, CORRENTE NOMINAL DE 25A - FORNECIMENTO E INSTALAÇÃO. AF_04/2016","UN",8,null,null,0,"Referência: AGETOP - 71173"]
["S",2,"S",0,3,5,0,0,0,0,0,"","Serviço","Serviço","-","SINAPI",93672,"DISJUNTOR TRIPOLAR TIPO DIN, CORRENTE NOMINAL DE 40A - FORNECIMENTO E INSTALAÇÃO. AF_04/2016","UN",1,null,null,0,"Referência: AGETOP - 71174"]
["S",2,"S",0,3,5,0,0,0,0,0,"","Serviço","Serviço","-","AGETOP",71331,"FITA ISOLANTE, ROLO DE 20,00 M","Un    ",1,null,null,0,""]
["S",2,"S",0,3,5,0,0,0,0,0,"","Serviço","Serviço","-","AGETOP",71321,"FITA DE AUTO FUSAO, ROLO E 10,00 MM","Un    ",1,null,null,0,""]
["S",2,"S",0,3,5,0,0,0,0,0,"","Serviço","Serviço","-","SINAPI",93043,"LÂMPADA LED 10 W BIVOLT BRANCA, FORMATO TRADICIONAL (BASE E27) - FORNECIMENTO E INSTALAÇÃO","UN",16,null,null,0,""]
["S",2,"S",0,3,5,0,0,0,0,0,"","Serviço","Serviço","-","AGETOP",71450,"INTERRUPTOR DIFERENCIAL RESIDUAL (D.R.) BIPOLAR DE 25A-30mA","Un    ",8,null,null,0,""]
["S",2,"S",0,3,5,0,0,0,0,0,"","Serviço","Serviço","-","SINAPI","74131/4","QUADRO DE DISTRIBUICAO DE ENERGIA DE EMBUTIR, EM CHAPA METALICA, PARA 18 DISJUNTORES TERMOMAGNETICOS MONOPOLARES, COM BARRAMENTO TRIFASICO E NEUTRO, FORNECIMENTO E INSTALACAO","UN",1,null,null,0,""]
["S",2,"S",0,3,5,0,0,0,0,0,"","Serviço","Serviço","-","SINAPI",91996,"TOMADA MÉDIA DE EMBUTIR (1 MÓDULO), 2P+T 10 A, INCLUINDO SUPORTE E PLACA - FORNECIMENTO E INSTALAÇÃO. AF_12/2015","UN",4,null,null,0,"Referência: AGETOP - 72578"]
["S",2,"S",0,3,5,0,0,0,0,0,"","Serviço","Serviço","-","SINAPI",91991,"TOMADA ALTA DE EMBUTIR (1 MÓDULO), 2P+T 20 A, SEM SUPORTE E SEM PLACA - FORNECIMENTO E INSTALAÇÃO. AF_12/2015","UN",8,null,null,0,"Referência: AGETOP - 72585"]
["S",2,"S",0,3,5,0,0,0,0,0,"","Serviço","Serviço","-","SINAPI",97599,"LUMINÁRIA DE EMERGÊNCIA - FORNECIMENTO E INSTALAÇÃO. AF_11/2017","UN",2,null,null,0,""]
[2,2,2,67,3,6,0,0,0,109,67,"","Nível 2","Nível 2","-",null,null,"INSTALAÇÕES HIDROSSANITÁRIAS","-",null,null,null,0,""]
["S",2,"S",0,3,6,0,0,0,0,0,"","Serviço","Serviço","-","SINAPI",95470,"VASO SANITARIO SIFONADO CONVENCIONAL COM LOUÇA BRANCA, INCLUSO CONJUNTO DE LIGAÇÃO PARA BACIA SANITÁRIA AJUSTÁVEL - FORNECIMENTO E INSTALAÇÃO. AF_10/2016","UN",4,null,null,0,""]
["S",2,"S",0,3,6,0,0,0,0,0,"","Serviço","Serviço","-","SINAPI",99635,"VÁLVULA DE DESCARGA METÁLICA, BASE 1 1/2 \", ACABAMENTO METALICO CROMADO - FORNECIMENTO E INSTALAÇÃO. AF_01/2019","UN",4,null,null,0,"Referência: AGETOP - 80515"]
["S",2,"S",0,3,6,0,0,0,0,0,"","Serviço","Serviço","-","AGETOP",80526,"ASSENTO EM POLIPROPILENO COM SISTEMA DE FECHAMENTO SUAVE PARA VASO SANITÁRIO","Un    ",4,null,null,0,""]
["S",2,"S",0,3,6,0,0,0,0,0,"","Serviço","Serviço","-","SINAPI",95544,"PAPELEIRA DE PAREDE EM METAL CROMADO SEM TAMPA, INCLUSO FIXAÇÃO. AF_10/2016","UN",4,null,null,0,""]
["S",2,"S",0,3,6,0,0,0,0,0,"","Serviço","Serviço","-","SINAPI",86884,"ENGATE FLEXÍVEL EM PLÁSTICO BRANCO, 1/2\" X 30CM - FORNECIMENTO E INSTALAÇÃO. AF_12/2013","UN",8,null,null,0,""]
["S",2,"S",0,3,6,0,0,0,0,0,"","Serviço","Serviço","-","SINAPI",86903,"LAVATÓRIO LOUÇA BRANCA COM COLUNA, 45 X 55CM OU EQUIVALENTE, PADRÃO MÉDIO - FORNECIMENTO E INSTALAÇÃO. AF_12/2013","UN",6,null,null,0,"Referência: AGETOP - 80541"]
["S",2,"S",0,3,6,0,0,0,0,0,"","Serviço","Serviço","-","AGETOP",80550,"FIXACAO P/LAVATORIO (PAR)","PAR   ",6,null,null,0,""]
["S",2,"S",0,3,6,0,0,0,0,0,"","Serviço","Serviço","-","SINAPI",86906,"TORNEIRA CROMADA DE MESA, 1/2\" OU 3/4\", PARA LAVATÓRIO, PADRÃO POPULAR - FORNECIMENTO E INSTALAÇÃO. AF_12/2013","UN",8,null,null,0,"Referência: AGETOP - 80570"]
["S",2,"S",0,3,6,0,0,0,0,0,"","Serviço","Serviço","-","SINAPI",86883,"SIFÃO DO TIPO FLEXÍVEL EM PVC 1\u0094 X 1.1/2\u0094 - FORNECIMENTO E INSTALAÇÃO. AF_12/2013","UN",8,null,null,0,""]
["S",2,"S",0,3,6,0,0,0,0,0,"","Serviço","Serviço","-","SINAPI",86877,"VÁLVULA EM METAL CROMADO 1.1/2\" X 1.1/2\" PARA TANQUE OU LAVATÓRIO, COM OU SEM LADRÃO - FORNECIMENTO E INSTALAÇÃO. AF_12/2013","UN",8,null,null,0,"Referência: AGETOP - 80580"]
["S",2,"S",0,3,6,0,0,0,0,0,"","Serviço","Serviço","-","SINAPI",86901,"CUBA DE EMBUTIR OVAL EM LOUÇA BRANCA, 35 X 50CM OU EQUIVALENTE - FORNECIMENTO E INSTALAÇÃO. AF_12/2013","UN",2,null,null,0,"Referência: AGETOP - 80590"]
["S",2,"S",0,3,6,0,0,0,0,0,"","Serviço","Serviço","-","SINAPI","74234/1","MICTORIO SIFONADO DE LOUCA BRANCA COM PERTENCES, COM REGISTRO DE PRESSAO 1/2\" COM CANOPLA CROMADA ACABAMENTO SIMPLES E CONJUNTO PARA FIXACAO  - FORNECIMENTO E INSTALACAO","UN",2,null,null,0,"Referência: AGETOP - 80601"]
["S",2,"S",0,3,6,0,0,0,0,0,"","Serviço","Serviço","-","AGETOP",81501,"ADESIVO PLASTICO - FRASCO 850 G","Un    ",8,null,null,0,""]
["S",2,"S",0,3,6,0,0,0,0,0,"","Serviço","Serviço","-","AGETOP",80730,"CABIDE TIPO GANCHO EM LOUÇA","Un    ",8,null,null,0,""]
["S",2,"S",0,3,6,0,0,0,0,0,"","Serviço","Serviço","-","SINAPI",95547,"SABONETEIRA PLASTICA TIPO DISPENSER PARA SABONETE LIQUIDO COM RESERVATORIO 800 A 1500 ML, INCLUSO FIXAÇÃO. AF_10/2016","UN",8,null,null,0,""]
["S",2,"S",0,3,6,0,0,0,0,0,"","Serviço","Serviço","-","SINAPI",89353,"REGISTRO DE GAVETA BRUTO, LATÃO, ROSCÁVEL, 3/4\", FORNECIDO E INSTALADO EM RAMAL DE ÁGUA. AF_12/2014","UN",9,null,null,0,"Referência: AGETOP - 80902"]
["S",2,"S",0,3,6,0,0,0,0,0,"","Serviço","Serviço","-","AGETOP",80927,"REGISTRO DE GAVETA C/CANOPLA DIAMETRO 1\"","Un    ",2,null,null,0,""]
["S",2,"S",0,3,6,0,0,0,0,0,"","Serviço","Serviço","-","SINAPI",89351,"REGISTRO DE PRESSÃO BRUTO, LATÃO,  ROSCÁVEL, 3/4\u0094, FORNECIDO E INSTALADO EM RAMAL DE ÁGUA. AF_12/2014","UN",8,null,null,0,""]
["S",2,"S",0,3,6,0,0,0,0,0,"","Serviço","Serviço","-","SINAPI",89446,"TUBO, PVC, SOLDÁVEL, DN 25MM, INSTALADO EM PRUMADA DE ÁGUA - FORNECIMENTO E INSTALAÇÃO. AF_12/2014","M",42,null,null,0,""]
["S",2,"S",0,3,6,0,0,0,0,0,"","Serviço","Serviço","-","SINAPI",89447,"TUBO, PVC, SOLDÁVEL, DN 32MM, INSTALADO EM PRUMADA DE ÁGUA - FORNECIMENTO E INSTALAÇÃO. AF_12/2014","M",15,null,null,0,""]
["S",2,"S",0,3,6,0,0,0,0,0,"","Serviço","Serviço","-","SINAPI",89449,"TUBO, PVC, SOLDÁVEL, DN 50MM, INSTALADO EM PRUMADA DE ÁGUA - FORNECIMENTO E INSTALAÇÃO. AF_12/2014","M",15,null,null,0,""]
["S",2,"S",0,3,6,0,0,0,0,0,"","Serviço","Serviço","-","SINAPI",89450,"TUBO, PVC, SOLDÁVEL, DN 60MM, INSTALADO EM PRUMADA DE ÁGUA - FORNECIMENTO E INSTALAÇÃO. AF_12/2014","M",72,null,null,0,""]
["S",2,"S",0,3,6,0,0,0,0,0,"","Serviço","Serviço","-","SINAPI",94656,"ADAPTADOR CURTO COM BOLSA E ROSCA PARA REGISTRO, PVC, SOLDÁVEL, DN  25 MM X 3/4 , INSTALADO EM RESERVAÇÃO DE ÁGUA DE EDIFICAÇÃO QUE POSSUA RESERVATÓRIO DE FIBRA/FIBROCIMENTO   FORNECIMENTO E INSTALAÇÃO. AF_06/2016","UN",26,null,null,0,"Referência: AGETOP - 81066"]
["S",2,"S",0,3,6,0,0,0,0,0,"","Serviço","Serviço","-","SINAPI",89436,"ADAPTADOR CURTO COM BOLSA E ROSCA PARA REGISTRO, PVC, SOLDÁVEL, DN 32MM X 1\u0094, INSTALADO EM RAMAL DE DISTRIBUIÇÃO DE ÁGUA - FORNECIMENTO E INSTALAÇÃO. AF_12/2014","UN",4,null,null,0,"Referência: AGETOP - 81067"]
["S",2,"S",0,3,6,0,0,0,0,0,"","Serviço","Serviço","-","SINAPI",89596,"ADAPTADOR CURTO COM BOLSA E ROSCA PARA REGISTRO, PVC, SOLDÁVEL, DN 50MM X 1.1/2\u0094, INSTALADO EM PRUMADA DE ÁGUA - FORNECIMENTO E INSTALAÇÃO. AF_12/2014","UN",4,null,null,0,"Referência: AGETOP - 81069"]
["S",2,"S",0,3,6,0,0,0,0,0,"","Serviço","Serviço","-","SINAPI",94657,"LUVA PVC, SOLDÁVEL, DN  25 MM, INSTALADA EM RESERVAÇÃO DE ÁGUA DE EDIFICAÇÃO QUE POSSUA RESERVATÓRIO DE FIBRA/FIBROCIMENTO   FORNECIMENTO E INSTALAÇÃO. AF_06/2016","UN",4,null,null,0,"Referência: AGETOP - 81102"]
["S",2,"S",0,3,6,0,0,0,0,0,"","Serviço","Serviço","-","AGETOP",81162,"BUCHA DE REDUCAO SOLD.CURTA 32 X 25 MM","Un    ",3,null,null,0,""]
["S",2,"S",0,3,6,0,0,0,0,0,"","Serviço","Serviço","-","AGETOP",81165,"BUCHA DE REDUCAO SOLD. CURTA 60 X 50 mm","Un    ",4,null,null,0,""]
["S",2,"S",0,3,6,0,0,0,0,0,"","Serviço","Serviço","-","AGETOP",81179,"BUCHA DE REDUCAO SOLDAVEL LONGA 50 X 25 mm","Un    ",4,null,null,0,""]
["S",2,"S",0,3,6,0,0,0,0,0,"","Serviço","Serviço","-","AGETOP",81180,"BUCHA DE REDUCAO SOLDAVEL LONGA 50 X 32 mm","Un    ",3,null,null,0,""]
["S",2,"S",0,3,6,0,0,0,0,0,"","Serviço","Serviço","-","SINAPI",89362,"JOELHO 90 GRAUS, PVC, SOLDÁVEL, DN 25MM, INSTALADO EM RAMAL OU SUB-RAMAL DE ÁGUA - FORNECIMENTO E INSTALAÇÃO. AF_12/2014","UN",28,null,null,0,"Referência: AGETOP - 81321"]
["S",2,"S",0,3,6,0,0,0,0,0,"","Serviço","Serviço","-","SINAPI",89367,"JOELHO 90 GRAUS, PVC, SOLDÁVEL, DN 32MM, INSTALADO EM RAMAL OU SUB-RAMAL DE ÁGUA - FORNECIMENTO E INSTALAÇÃO. AF_12/2014","UN",6,null,null,0,"Referência: AGETOP - 81322"]
["S",2,"S",0,3,6,0,0,0,0,0,"","Serviço","Serviço","-","SINAPI",89501,"JOELHO 90 GRAUS, PVC, SOLDÁVEL, DN 50MM, INSTALADO EM PRUMADA DE ÁGUA - FORNECIMENTO E INSTALAÇÃO. AF_12/2014","UN",9,null,null,0,""]
["S",2,"S",0,3,6,0,0,0,0,0,"","Serviço","Serviço","-","SINAPI",89505,"JOELHO 90 GRAUS, PVC, SOLDÁVEL, DN 60MM, INSTALADO EM PRUMADA DE ÁGUA - FORNECIMENTO E INSTALAÇÃO. AF_12/2014","UN",2,null,null,0,"Referência: AGETOP - 81325"]
["S",2,"S",0,3,6,0,0,0,0,0,"","Serviço","Serviço","-","AGETOP",81360,"JOELHO RED.90 GRAUS SOLD.C/BUCHA LATAO 25X1/2\"","Un    ",16,null,null,0,""]
["S",2,"S",0,3,6,0,0,0,0,0,"","Serviço","Serviço","-","SINAPI",89395,"TE, PVC, SOLDÁVEL, DN 25MM, INSTALADO EM RAMAL OU SUB-RAMAL DE ÁGUA - FORNECIMENTO E INSTALAÇÃO. AF_12/2014","UN",1,null,null,0,"Referência: AGETOP - 81402"]
["S",2,"S",0,3,6,0,0,0,0,0,"","Serviço","Serviço","-","SINAPI",89398,"TE, PVC, SOLDÁVEL, DN 32MM, INSTALADO EM RAMAL OU SUB-RAMAL DE ÁGUA - FORNECIMENTO E INSTALAÇÃO. AF_12/2014","UN",1,null,null,0,"Referência: AGETOP - 81403"]
["S",2,"S",0,3,6,0,0,0,0,0,"","Serviço","Serviço","-","SINAPI",89625,"TE, PVC, SOLDÁVEL, DN 50MM, INSTALADO EM PRUMADA DE ÁGUA - FORNECIMENTO E INSTALAÇÃO. AF_12/2014","UN",4,null,null,0,"Referência: AGETOP - 81405"]
["S",2,"S",0,3,6,0,0,0,0,0,"","Serviço","Serviço","-","SINAPI",89628,"TE, PVC, SOLDÁVEL, DN 60MM, INSTALADO EM PRUMADA DE ÁGUA - FORNECIMENTO E INSTALAÇÃO. AF_12/2014","UN",5,null,null,0,"Referência: AGETOP - 81406"]
["S",2,"S",0,3,6,0,0,0,0,0,"","Serviço","Serviço","-","AGETOP",81445,"TE RED.SOLD.90GR.BUC.LATAO BOLSA CENT.25X25X1/2\"","Un    ",6,null,null,0,""]
["S",2,"S",0,3,6,0,0,0,0,0,"","Serviço","Serviço","-","AGETOP",81501,"ADESIVO PLASTICO - FRASCO 850 G","Un    ",1,null,null,0,""]
["S",2,"S",0,3,6,0,0,0,0,0,"","Serviço","Serviço","-","AGETOP",81504,"SOLUCAO LIMPADORA 1000 CM3","Un    ",1,null,null,0,""]
["S",2,"S",0,3,6,0,0,0,0,0,"","Serviço","Serviço","-","AGETOP",81664,"CORPO CX. SIFONADA DIAM. 150 X 185 X 75","Un    ",4,null,null,0,""]
["S",2,"S",0,3,6,0,0,0,0,0,"","Serviço","Serviço","-","SINAPI",89710,"RALO SECO, PVC, DN 100 X 40 MM, JUNTA SOLDÁVEL, FORNECIDO E INSTALADO EM RAMAL DE DESCARGA OU EM RAMAL DE ESGOTO SANITÁRIO. AF_12/2014","UN",6,null,null,0,""]
["S",2,"S",0,3,6,0,0,0,{"$f":"IF(OR($C518=\"S\",$C518=0),0,MATCH(0,OFFSET($D518,1,$C518,ROW($C$619)-ROW($C518)),0))","v":0},{"$f":"IF(OR($C518=\"S\",$C518=0),0,MATCH(OFFSET($D518,0,$C518)+1,OFFSET($D518,1,$C518,ROW($C$619)-ROW($C518)),0))","v":0},"","Serviço","Serviço","-","SINAPI",94677,"CURVA 90 GRAUS, PVC, SOLDÁVEL, DN 40 MM, INSTALADO EM RESERVAÇÃO DE ÁGUA DE EDIFICAÇÃO QUE POSSUA RESERVATÓRIO DE FIBRA/FIBROCIMENTO   FORNECIMENTO E INSTALAÇÃO. AF_06/2016","UN",18,null,null,0,""]
["S",2,"S",0,3,6,0,0,0,0,0,"","Serviço","Serviço","-","SINAPI",95694,"CURVA 90 GRAUS, PVC, SERIE R, ÁGUA PLUVIAL, DN 100 MM, JUNTA ELÁSTICA, FORNECIDO E INSTALADO EM RAMAL DE ENCAMINHAMENTO. AF_12/2014","UN",4,null,null,0,""]
["S",2,"S",0,3,6,0,0,0,0,0,"","Serviço","Serviço","-","AGETOP",81778,"GRELHA QUADRADA CROMADA DIAM. 150 MM","Un    ",4,null,null,0,""]
["S",2,"S",0,3,6,0,0,0,0,0,"","Serviço","Serviço","-","AGETOP",81790,"GRELHA REDONDA BRANCA DIAM. 100 MM","Un    ",6,null,null,0,""]
["S",2,"S",0,3,6,0,0,0,0,0,"","Serviço","Serviço","-","AGETOP",81825,"CAIXA DE PASSAGEM 60 X 60 CM SEM TAMPA","Un    ",2,null,null,0,""]
["S",2,"S",0,3,6,0,0,0,0,0,"","Serviço","Serviço","-","AGETOP",81825,"CAIXA DE PASSAGEM 60 X 60 CM SEM TAMPA","Un    ",2,null,null,0,""]
["S",2,"S",0,3,6,0,0,0,0,0,"","Serviço","Serviço","-","AGETOP",81885,"TERMINAL DE VENTILACAO DIAMETRO 50 MM","Un    ",2,null,null,0,""]
["S",2,"S",0,3,6,0,0,0,0,0,"","Serviço","Serviço","-","SINAPI",94676,"JOELHO 90 GRAUS, PVC, SOLDÁVEL, DN 40 MM INSTALADO EM RESERVAÇÃO DE ÁGUA DE EDIFICAÇÃO QUE POSSUA RESERVATÓRIO DE FIBRA/FIBROCIMENTO   FORNECIMENTO E INSTALAÇÃO. AF_06/2016","UN",20,null,null,0,"Referência: AGETOP - 81323"]
["S",2,"S",0,3,6,0,0,0,0,0,"","Serviço","Serviço","-","SINAPI",94676,"JOELHO 90 GRAUS, PVC, SOLDÁVEL, DN 40 MM INSTALADO EM RESERVAÇÃO DE ÁGUA DE EDIFICAÇÃO QUE POSSUA RESERVATÓRIO DE FIBRA/FIBROCIMENTO   FORNECIMENTO E INSTALAÇÃO. AF_06/2016","UN",2,null,null,0,"Referência: AGETOP - 81323"]
["S",2,"S",0,3,6,0,0,0,0,0,"","Serviço","Serviço","-","SINAPI",89732,"JOELHO 45 GRAUS, PVC, SERIE NORMAL, ESGOTO PREDIAL, DN 50 MM, JUNTA ELÁSTICA, FORNECIDO E INSTALADO EM RAMAL DE DESCARGA OU RAMAL DE ESGOTO SANITÁRIO. AF_12/2014","UN",2,null,null,0,""]
["S",2,"S",0,3,6,0,0,0,0,0,"","Serviço","Serviço","-","SINAPI",89726,"JOELHO 45 GRAUS, PVC, SERIE NORMAL, ESGOTO PREDIAL, DN 40 MM, JUNTA SOLDÁVEL, FORNECIDO E INSTALADO EM RAMAL DE DESCARGA OU RAMAL DE ESGOTO SANITÁRIO. AF_12/2014","UN",12,null,null,0,""]
["S",2,"S",0,3,6,0,0,0,0,0,"","Serviço","Serviço","-","SINAPI",89731,"JOELHO 90 GRAUS, PVC, SERIE NORMAL, ESGOTO PREDIAL, DN 50 MM, JUNTA ELÁSTICA, FORNECIDO E INSTALADO EM RAMAL DE DESCARGA OU RAMAL DE ESGOTO SANITÁRIO. AF_12/2014","UN",2,null,null,0,""]
["S",2,"S",0,3,6,0,0,0,0,0,"","Serviço","Serviço","-","SINAPI",89744,"JOELHO 90 GRAUS, PVC, SERIE NORMAL, ESGOTO PREDIAL, DN 100 MM, JUNTA ELÁSTICA, FORNECIDO E INSTALADO EM RAMAL DE DESCARGA OU RAMAL DE ESGOTO SANITÁRIO. AF_12/2014","UN",4,null,null,0,"Referência: AGETOP - 81938"]
["S",2,"S",0,3,6,0,0,0,0,0,"","Serviço","Serviço","-","AGETOP",82055,"PORTA GRELHA QUADRADO P/GRELHA RED.CROM.DIAM.100 M","Un    ",6,null,null,0,""]
["S",2,"S",0,3,6,0,0,0,0,0,"","Serviço","Serviço","-","AGETOP",82052,"PORTA GRELHA QUADRADO CROMADO DIAM.150 MM","Un    ",4,null,null,0,""]
["S",2,"S",0,3,6,0,0,0,0,0,"","Serviço","Serviço","-","AGETOP",82230,"TE SANITARIO DIAMETRO 50 X 50 MM","Un    ",6,null,null,0,""]
["S",2,"S",0,3,6,0,0,0,0,0,"","Serviço","Serviço","-","SINAPI",89630,"TE DE REDUÇÃO, PVC, SOLDÁVEL, DN 75MM X 50MM, INSTALADO EM PRUMADA DE ÁGUA - FORNECIMENTO E INSTALAÇÃO. AF_12/2014","UN",4,null,null,0,"Referência: AGETOP - 81427"]
["S",2,"S",0,3,6,0,0,0,0,0,"","Serviço","Serviço","-","AGETOP",82233,"TE SANITARIO DIAMETRO 100 X 50 MM","Un    ",4,null,null,0,""]
["S",2,"S",0,3,6,0,0,0,0,0,"","Serviço","Serviço","-","SINAPI",89508,"TUBO PVC, SÉRIE R, ÁGUA PLUVIAL, DN 40 MM, FORNECIDO E INSTALADO EM RAMAL DE ENCAMINHAMENTO. AF_12/2014","M",31,null,null,0,""]
["S",2,"S",0,3,6,0,0,0,0,0,"","Serviço","Serviço","-","SINAPI",89509,"TUBO PVC, SÉRIE R, ÁGUA PLUVIAL, DN 50 MM, FORNECIDO E INSTALADO EM RAMAL DE ENCAMINHAMENTO. AF_12/2014","M",18,null,null,0,""]
["S",2,"S",0,3,6,0,0,0,0,0,"","Serviço","Serviço","-","SINAPI",89511,"TUBO PVC, SÉRIE R, ÁGUA PLUVIAL, DN 75 MM, FORNECIDO E INSTALADO EM RAMAL DE ENCAMINHAMENTO. AF_12/2014","M",18,null,null,0,""]
["S",2,"S",0,3,6,0,0,0,0,0,"","Serviço","Serviço","-","SINAPI",89512,"TUBO PVC, SÉRIE R, ÁGUA PLUVIAL, DN 100 MM, FORNECIDO E INSTALADO EM RAMAL DE ENCAMINHAMENTO. AF_12/2014","M",38,null,null,0,""]
[2,2,2,4,3,7,0,0,0,42,4,"","Nível 2","Nível 2","-","SINAPI",null,"ALVENARIAS E DIVISÓRIAS","-",null,null,null,0,""]
["S",2,"S",0,3,7,0,0,0,0,0,"","Serviço","Serviço","-","SINAPI",87511,"ALVENARIA DE VEDAÇÃO DE BLOCOS CERÂMICOS FURADOS NA HORIZONTAL DE 9X19X19CM (ESPESSURA 9CM) DE PAREDES COM ÁREA LÍQUIDA MENOR QUE 6M² COM VÃOS E ARGAMASSA DE ASSENTAMENTO COM PREPARO EM BETONEIRA. AF_06/2014","M2",51.95,null,null,0,"Referência: AGETOP - 100201"]
["S",2,"S",0,3,7,0,0,0,0,0,"","Serviço","Serviço","-","AGETOP",100602,"ALVENARIA DE TIJOLO LAMINADO 1/2 VEZ  - ARG. (1CI : 1CH : 5ARML)","m2    ",64.94,null,null,0,""]
["S",2,"S",0,3,7,0,0,0,0,0,"","Serviço","Serviço","-","SINAPI",79627,"DIVISORIA EM GRANITO BRANCO POLIDO, ESP = 3CM, ASSENTADO COM ARGAMASSA TRACO 1:4, ARREMATE EM CIMENTO BRANCO, EXCLUSIVE FERRAGENS","M2",0.9,null,null,0,"Referência: AGETOP - 100320"]
[2,2,2,2,3,8,0,0,0,38,2,"","Nível 2","Nível 2","-","SINAPI",null,"IMPERMEABILIZAÇÃO","-",null,null,null,0,""]
["S",2,"S",0,3,8,0,0,0,0,0,"","Serviço","Serviço","-","SINAPI","74106/1","IMPERMEABILIZACAO DE ESTRUTURAS ENTERRADAS, COM TINTA ASFALTICA, DUAS DEMAOS.","M2",48,null,null,0,""]
[2,2,2,2,3,9,0,0,0,36,2,"","Nível 2","Nível 2","-","AGETOP",null,"ESTRUTURA DE MADEIRA","-",null,null,null,0,""]
["S",2,"S",0,3,9,0,0,0,0,0,"","Serviço","Serviço","-","AGETOP",140200,"EST.MAD.TELHA FIBROCIM. COM APOIOS EM LAJES/VIGAS OU PAREDES(SOMENTE TERÇAS) C/FERRAGENS","m2    ",55.42,null,null,0,""]
[2,2,2,4,3,10,0,0,0,34,4,"","Nível 2","Nível 2","-","AGETOP",null,"COBERTURAS","-",null,null,null,0,""]
["S",2,"S",0,3,10,0,0,0,0,0,"","Serviço","Serviço","-","SINAPI",94210,"TELHAMENTO COM TELHA ONDULADA DE FIBROCIMENTO E = 6 MM, COM RECOBRIMENTO LATERAL DE 1 1/4 DE ONDA PARA TELHADO COM INCLINAÇÃO MÁXIMA DE 10°, COM ATÉ 2 ÁGUAS, INCLUSO IÇAMENTO. AF_06/2016","M2",55.42,null,null,0,"Referência: AGETOP - 160501"]
["S",2,"S",0,3,10,0,0,0,0,0,"","Serviço","Serviço","-","SINAPI",94228,"CALHA EM CHAPA DE AÇO GALVANIZADO NÚMERO 24, DESENVOLVIMENTO DE 50 CM, INCLUSO TRANSPORTE VERTICAL. AF_06/2016","M",10.039999999999999,null,null,0,"Referência: AGETOP - 160601"]
["S",2,"S",0,3,10,0,0,0,0,0,"","Serviço","Serviço","-","SINAPI",94231,"RUFO EM CHAPA DE AÇO GALVANIZADO NÚMERO 24, CORTE DE 25 CM, INCLUSO TRANSPORTE VERTICAL. AF_06/2016","M",29.519999999999996,null,null,0,"Referência: AGETOP - 160602"]
[2,2,2,4,3,11,0,0,0,30,4,"","Nível 2","Nível 2","-","AGETOP",null,"ESQUADRIAS METÁLICAS","-",null,null,null,0,""]
["S",2,"S",0,3,11,0,0,0,0,0,"","Serviço","Serviço","-","SINAPI",94559,"JANELA DE AÇO BASCULANTE, FIXAÇÃO COM ARGAMASSA, SEM VIDROS, PADRONIZADA. AF_07/2016","M2",6.2799999999999994,null,null,0,"Referência: AGETOP - 180404"]
["S",2,"S",0,3,11,0,0,0,0,0,"","Serviço","Serviço","-","SINAPI","73933/4","PORTA DE FERRO DE ABRIR TIPO BARRA CHATA, COM REQUADRO E GUARNICAO COMPLETA","M2",3.7800000000000002,null,null,0,"Referência: AGETOP - 180501"]
["S",2,"S",0,3,11,0,0,0,0,0,"","Serviço","Serviço","-","SINAPI","73933/4","PORTA DE FERRO DE ABRIR TIPO BARRA CHATA, COM REQUADRO E GUARNICAO COMPLETA","M2",10.240000000000002,null,null,0,"Referência: AGETOP - 180501"]
[2,2,2,2,3,12,0,0,0,26,2,"","Nível 2","Nível 2","-","AGETOP",null,"VIDROS","-",null,null,null,0,""]
["S",2,"S",0,3,12,0,0,0,0,0,"","Serviço","Serviço","-","SINAPI",72117,"VIDRO LISO COMUM TRANSPARENTE, ESPESSURA 4MM","M2",5.34,null,null,0,"Referência: AGETOP - 190102"]
[2,2,2,5,3,13,0,0,0,24,5,"","Nível 2","Nível 2","-","AGETOP",null,"REVESTIMENTO DE PAREDE","-",null,null,null,0,""]
["S",2,"S",0,3,13,0,0,0,0,0,"","Serviço","Serviço","-","SINAPI",87548,"MASSA ÚNICA, PARA RECEBIMENTO DE PINTURA, EM ARGAMASSA TRAÇO 1:2:8, PREPARO MANUAL, APLICADA MANUALMENTE EM FACES INTERNAS DE PAREDES, ESPESSURA DE 10MM, COM EXECUÇÃO DE TALISCAS. AF_06/2014","M2",54.58,null,null,0,"Referência: AGETOP - 200500"]
["S",2,"S",0,3,13,0,0,0,0,0,"","Serviço","Serviço","-","SINAPI",87273,"REVESTIMENTO CERÂMICO PARA PAREDES INTERNAS COM PLACAS TIPO ESMALTADA EXTRA DE DIMENSÕES 33X45 CM APLICADAS EM AMBIENTES DE ÁREA MAIOR QUE 5 M² NA ALTURA INTEIRA DAS PAREDES. AF_06/2014","M2",145.80000000000001,null,null,0,""]
["S",2,"S",0,3,13,0,0,0,0,0,"","Serviço","Serviço","-","SINAPI",87549,"EMBOÇO, PARA RECEBIMENTO DE CERÂMICA, EM ARGAMASSA TRAÇO 1:2:8, PREPARO MECÂNICO COM BETONEIRA 400L, APLICADO MANUALMENTE EM FACES INTERNAS DE PAREDES, PARA AMBIENTE COM ÁREA ENTRE 5M2 E 10M2, ESPESSURA DE 10MM, COM EXECUÇÃO DE TALISCAS. AF_06/2014","M2",145.80000000000001,null,null,0,"Referência: AGETOP - 200201"]
["S",2,"S",0,3,13,0,0,0,0,0,"","Serviço","Serviço","-","SINAPI",87904,"CHAPISCO APLICADO EM ALVENARIA (COM PRESENÇA DE VÃOS) E ESTRUTURAS DE CONCRETO DE FACHADA, COM COLHER DE PEDREIRO.  ARGAMASSA TRAÇO 1:3 COM PREPARO MANUAL. AF_06/2014","M2",200.38,null,null,0,"Referência: AGETOP - 200101"]
[2,2,2,3,3,14,0,0,0,19,3,"","Nível 2","Nível 2","-","AGETOP",null,"FORROS","-",null,null,null,0,""]
["S",2,"S",0,3,14,0,0,0,0,0,"","Serviço","Serviço","-","SINAPI",87414,"APLICAÇÃO MANUAL DE GESSO DESEMPENADO (SEM TALISCAS) EM TETO DE AMBIENTES DE ÁREA MAIOR QUE 10M², ESPESSURA DE 1,0CM. AF_06/2014","M2",55.42,null,null,0,"Referência: AGETOP - 210515"]
["S",{"$f":"IF(OR(C565=\"s\",C565=0),OFFSET(B565,-1,0),C565)","v":2},{"$f":"IF(OFFSET(C565,-1,0)=\"L\",1,IF(OFFSET(C565,-1,0)=1,2,IF(OR(A565=\"s\",A565=0),\"S\",IF(AND(OFFSET(C565,-1,0)=2,A565=4),3,IF(AND(OR(OFFSET(C565,-1,0)=\"s\",OFFSET(C565,-1,0)=0),A565<>\"s\",A565>OFFSET(B565,-1,0)),OFFSET(B565,-1,0),A565)))))","v":"S"},{"$f":"IF(OR(C565=\"S\",C565=0),0,IF(ISERROR(K565),J565,SMALL(J565:K565,1)))","v":0},{"$f":"IF($C565=1,OFFSET(E565,-1,0)+1,OFFSET(E565,-1,0))","v":3},{"$f":"IF($C565=1,0,IF($C565=2,OFFSET(F565,-1,0)+1,OFFSET(F565,-1,0)))","v":14},{"$f":"IF(AND($C565<=2,$C565<>0),0,IF($C565=3,OFFSET(G565,-1,0)+1,OFFSET(G565,-1,0)))","v":0},{"$f":"IF(AND($C565<=3,$C565<>0),0,IF($C565=4,OFFSET(H565,-1,0)+1,OFFSET(H565,-1,0)))","v":0},{"$f":"IF(AND($C565<=4,$C565<>0),0,IF(AND($C565=\"S\",$W565>0),OFFSET(I565,-1,0)+1,OFFSET(I565,-1,0)))","v":0},0,0,"","Serviço","Serviço","-","SINAPI",87884,"CHAPISCO APLICADO NO TETO, COM ROLO PARA TEXTURA ACRÍLICA. ARGAMASSA INDUSTRIALIZADA COM PREPARO MANUAL. AF_06/2014","M2",55.42,null,null,0,"Referência: AGETOP - 210102"]
[2,2,2,4,3,15,0,0,0,16,4,"","Nível 2","Nível 2","-","SINAPI",null,"REVESTIMENTO DE PISO","-",null,null,null,0,""]
["S",2,"S",0,3,15,0,0,0,0,0,"","Serviço","Serviço","-","SINAPI",95241,"LASTRO DE CONCRETO MAGRO, APLICADO EM PISOS OU RADIERS, ESPESSURA DE 5 CM. AF_07/2016","M2",50.8,null,null,0,""]
["S",2,"S",0,3,15,0,0,0,0,0,"","Serviço","Serviço","-","SINAPI",87250,"REVESTIMENTO CERÂMICO PARA PISO COM PLACAS TIPO ESMALTADA EXTRA DE DIMENSÕES 45X45 CM APLICADA EM AMBIENTES DE ÁREA ENTRE 5 M2 E 10 M2. AF_06/2014","M2",50.8,null,null,0,""]
["S",2,"S",0,3,15,0,0,0,0,0,"","Serviço","Serviço","-","SINAPI",94992,"EXECUÇÃO DE PASSEIO (CALÇADA) OU PISO DE CONCRETO COM CONCRETO MOLDADO IN LOCO, FEITO EM OBRA, ACABAMENTO CONVENCIONAL, ESPESSURA 6 CM, ARMADO. AF_07/2016","M2",17.7,null,null,0,""]
[2,2,2,3,3,16,0,0,0,12,3,"","Nível 2","Nível 2","-","AGETOP",null,"FERRAGENS","-",null,null,null,0,""]
["S",2,"S",0,3,16,0,0,0,0,0,"","Serviço","Serviço","-","AGETOP",230176,"BARRA DE APOIO EM AÇO INOX - 80 CM ","un    ",6,null,null,0,""]
["S",2,"S",0,3,16,0,0,0,0,0,"","Serviço","Serviço","-","AGETOP",230174,"BARRA DE APOIO EM AÇO INOX - 40 CM","un    ",6,null,null,0,""]
[2,2,2,5,3,17,0,0,0,9,5,"","Nível 2","Nível 2","-","AGETOP",null,"PINTURA","-",null,null,null,0,""]
["S",2,"S",0,3,17,0,0,0,0,0,"","Serviço","Serviço","-","AGETOP",260801,"PINTURA A BASE DE SILICONE 1 DEMAO","m2    ",74.62,null,null,0,""]
["S",2,"S",0,3,17,0,0,0,0,0,"","Serviço","Serviço","-","SINAPI",88497,"APLICAÇÃO E LIXAMENTO DE MASSA LÁTEX EM PAREDES, DUAS DEMÃOS. AF_06/2014","M2",54.58,null,null,0,"Referência: AGETOP - 261300"]
["S",2,"S",0,3,17,0,0,0,0,0,"","Serviço","Serviço","-","SINAPI",88489,"APLICAÇÃO MANUAL DE PINTURA COM TINTA LÁTEX ACRÍLICA EM PAREDES, DUAS DEMÃOS. AF_06/2014","M2",54.58,null,null,0,"Referência: AGETOP - 261001"]
["S",2,"S",0,3,17,0,0,0,0,0,"","Serviço","Serviço","-","SINAPI","74145/1","PINTURA ESMALTE FOSCO, DUAS DEMAOS, SOBRE SUPERFICIE METALICA, INCLUSO UMA DEMAO DE FUNDO ANTICORROSIVO. UTILIZACAO DE REVOLVER ( AR-COMPRIMIDO).","M2",40.6,null,null,0,"Referência: AGETOP - 261602"]
[2,2,2,4,3,18,0,0,0,4,{"$error":"#N/A"},"","Nível 2","Nível 2","-","AGETOP",null,"DIVERSOS","-",null,null,null,0,""]
["S",2,"S",0,3,18,0,0,0,0,0,"","Serviço","Serviço","-","AGETOP",270501,"LIMPEZA FINAL DE OBRA - (OBRAS CIVIS)","m2    ",55.24,null,null,0,""]
["S",2,"S",0,3,18,0,0,0,0,0,"","Serviço","Serviço","-","AGETOP",271303,"BANCO DE CONCRETO POLIDO BASE EM ALVENARIA REBOCADA E PINTADA - PADRÃO AGETOP 2015","m     ",7.8,null,null,0,""]
["S",2,"S",0,3,18,0,0,0,0,0,"","Serviço","Serviço","-","COMPOSIÇÃO","COMP 541_SEE","BANCADA DE GRANITO CINZA POLIDO - FORNECIMENTO E INSTALAÇÃO. ","M2    ",0.41,null,null,0,""]
[{"$f":"CHOOSE(1+LOG(1+2*(ORÇAMENTO.Nivel=\"Nível 1\")+4*(ORÇAMENTO.Nivel=\"Nível 2\")+8*(ORÇAMENTO.Nivel=\"Nível 3\")+16*(ORÇAMENTO.Nivel=\"Nível 4\")+32*(ORÇAMENTO.Nivel=\"Serviço\"),2),0,1,2,3,4,\"S\")","v":1},{"$f":"IF(OR(C582=\"s\",C582=0),OFFSET(B582,-1,0),C582)","v":1},{"$f":"IF(OFFSET(C582,-1,0)=\"L\",1,IF(OFFSET(C582,-1,0)=1,2,IF(OR(A582=\"s\",A582=0),\"S\",IF(AND(OFFSET(C582,-1,0)=2,A582=4),3,IF(AND(OR(OFFSET(C582,-1,0)=\"s\",OFFSET(C582,-1,0)=0),A582<>\"s\",A582>OFFSET(B582,-1,0)),OFFSET(B582,-1,0),A582)))))","v":1},{"$f":"IF(OR(C582=\"S\",C582=0),0,IF(ISERROR(K582),J582,SMALL(J582:K582,1)))","v":37},{"$f":"IF($C582=1,OFFSET(E582,-1,0)+1,OFFSET(E582,-1,0))","v":4},{"$f":"IF($C582=1,0,IF($C582=2,OFFSET(F582,-1,0)+1,OFFSET(F582,-1,0)))","v":0},{"$f":"IF(AND($C582<=2,$C582<>0),0,IF($C582=3,OFFSET(G582,-1,0)+1,OFFSET(G582,-1,0)))","v":0},{"$f":"IF(AND($C582<=3,$C582<>0),0,IF($C582=4,OFFSET(H582,-1,0)+1,OFFSET(H582,-1,0)))","v":0},{"$f":"IF(AND($C582<=4,$C582<>0),0,IF(AND($C582=\"S\",$W582>0),OFFSET(I582,-1,0)+1,OFFSET(I582,-1,0)))","v":0},{"$f":"IF(OR($C582=\"S\",$C582=0),0,MATCH(0,OFFSET($D582,1,$C582,ROW($C$619)-ROW($C582)),0))","v":37},{"$f":"IF(OR($C582=\"S\",$C582=0),0,MATCH(OFFSET($D582,0,$C582)+1,OFFSET($D582,1,$C582,ROW($C$619)-ROW($C582)),0))","v":{"$error":"#N/A"}},"F","Nível 1","Nível 1","4.","SINAPI",null,"PASSARELA COBERTA MOD1 - LAJE PLANA","-",null,null,null,0,""]
[2,2,2,2,4,1,0,0,0,36,2,"","Nível 2","Nível 2","-","SINAPI",null,"SERVIÇOS PRELIMINARES","-",null,null,null,0,""]
["S",2,"S",0,4,1,0,0,0,0,0,"","Serviço","Serviço","-","AGETOP",20701,"LOCAÇÃO DA OBRA, EXECUÇÃO DE GABARITO SEM REAPROVEITAMENTO, INCLUSO PINTURA (FACE INTERNA DO RIPÃO 15CM) E PIQUETE COM TESTEMUNHA","m2    ",12.8,null,null,0,""]
[2,2,2,3,4,2,0,0,0,34,3,"","Nível 2","Nível 2","-",null,null,"TRANSPORTES","-",null,null,null,0,""]
["S",2,"S",0,4,2,0,0,0,0,0,"","Serviço","Serviço","-","SINAPI",72900,"TRANSPORTE DE ENTULHO COM CAMINHAO BASCULANTE 6 M3, RODOVIA PAVIMENTADA, DMT 0,5 A 1,0 KM","M3",0.9,null,null,0,""]
["S",2,"S",0,4,2,0,0,0,0,0,"","Serviço","Serviço","-","SINAPI",72897,"CARGA MANUAL DE ENTULHO EM CAMINHAO BASCULANTE 6 M3","M3",0.9,null,null,0,""]
[2,2,2,3,4,3,0,0,0,31,3,"","Nível 2","Nível 2","-","SINAPI",null,"SERVIÇO EM TERRA","-",null,null,null,0,""]
["S",2,"S",0,4,3,0,0,0,0,0,"","Serviço","Serviço","-","AGETOP",41140,"REGULARIZAÇÃO DO TERRENO SEM APILOAMENTO COM TRANSPORTE MANUAL DA TERRA ESCAVADA ","m2    ",2.56,null,null,0,""]
["S",2,"S",0,4,3,0,0,0,0,0,"","Serviço","Serviço","-","AGETOP",41002,"APILOAMENTO","m2    ",2.56,null,null,0,""]
[2,2,2,6,4,4,0,0,0,28,6,"","Nível 2","Nível 2","-","SINAPI",null,"FUNDAÇÕES E SONDAGENS","-",null,null,null,0,""]
["S",2,"S",0,4,4,0,0,0,0,0,"","Serviço","Serviço","-","SINAPI",98230,"ESTACA BROCA DE CONCRETO, DIÂMETRO DE 30 CM, PROFUNDIDADE DE ATÉ 3 M, ESCAVAÇÃO MANUAL COM TRADO CONCHA, NÃO ARMADA. AF_03/2018","M",3,null,null,0,"Referência: AGETOP - 50302"]
["S",2,"S",0,4,4,0,0,0,0,0,"","Serviço","Serviço","-","SINAPI",94963,"CONCRETO FCK = 15MPA, TRAÇO 1:3,4:3,5 (CIMENTO/ AREIA MÉDIA/ BRITA 1)  - PREPARO MECÂNICO COM BETONEIRA 400 L. AF_07/2016","M3",0.21,null,null,0,""]
["S",2,"S",0,4,4,0,0,0,0,0,"","Serviço","Serviço","-","SINAPI","74157/4","LANCAMENTO/APLICACAO MANUAL DE CONCRETO EM FUNDACOES","M3",0.21,null,null,0,"Referência: AGETOP - 51055"]
["S",2,"S",0,4,4,0,0,0,0,0,"","Serviço","Serviço","-","SINAPI",96544,"ARMAÇÃO DE BLOCO, VIGA BALDRAME OU SAPATA UTILIZANDO AÇO CA-50 DE 6,3 MM - MONTAGEM. AF_06/2017","KG",5.4,null,null,0,"Referência: AGETOP - 52003"]
["S",2,"S",0,4,4,0,0,0,0,0,"","Serviço","Serviço","-","SINAPI",96543,"ARMAÇÃO DE BLOCO, VIGA BALDRAME E SAPATA UTILIZANDO AÇO CA-60 DE 5 MM - MONTAGEM. AF_06/2017","KG",3.6,null,null,0,"Referência: AGETOP - 52014"]
[2,2,2,6,4,5,0,0,0,22,6,"","Nível 2","Nível 2","-","SINAPI",null,"ESTRUTURA","-",null,null,null,0,""]
["S",2,"S",0,4,5,0,0,0,0,0,"","Serviço","Serviço","-","SINAPI",92426,"MONTAGEM E DESMONTAGEM DE FÔRMA DE PILARES RETANGULARES E ESTRUTURAS SIMILARES COM ÁREA MÉDIA DAS SEÇÕES MENOR OU IGUAL A 0,25 M², PÉ-DIREITO SIMPLES, EM CHAPA DE MADEIRA COMPENSADA RESINADA, 8 UTILIZAÇÕES. AF_12/2015","M2",5.6,null,null,0,""]
["S",2,"S",0,4,5,0,0,0,0,0,"","Serviço","Serviço","-","SINAPI",92778,"ARMAÇÃO DE PILAR OU VIGA DE UMA ESTRUTURA CONVENCIONAL DE CONCRETO ARMADO EM UMA EDIFICAÇÃO TÉRREA OU SOBRADO UTILIZANDO AÇO CA-50 DE 10,0 MM - MONTAGEM. AF_12/2015","KG",26.76,null,null,0,"Referência: AGETOP - 60305"]
["S",2,"S",0,4,5,0,0,0,0,0,"","Serviço","Serviço","-","SINAPI",92775,"ARMAÇÃO DE PILAR OU VIGA DE UMA ESTRUTURA CONVENCIONAL DE CONCRETO ARMADO EM UMA EDIFICAÇÃO TÉRREA OU SOBRADO UTILIZANDO AÇO CA-60 DE 5,0 MM - MONTAGEM. AF_12/2015","KG",10.08,null,null,0,"Referência: AGETOP - 60314"]
["S",2,"S",0,4,5,0,0,0,0,0,"","Serviço","Serviço","-","SINAPI",94964,"CONCRETO FCK = 20MPA, TRAÇO 1:2,7:3 (CIMENTO/ AREIA MÉDIA/ BRITA 1)  - PREPARO MECÂNICO COM BETONEIRA 400 L. AF_07/2016","M3",0.26,null,null,0,""]
["S",2,"S",0,4,5,0,0,0,0,0,"","Serviço","Serviço","-","SINAPI",92873,"LANÇAMENTO COM USO DE BALDES, ADENSAMENTO E ACABAMENTO DE CONCRETO EM ESTRUTURAS. AF_12/2015","M3",0.26,null,null,0,"Referência: AGETOP - 60801"]
[2,2,2,2,4,6,0,0,0,16,2,"","Nível 2","Nível 2","-","SINAPI",null,"ESTRUTURAS METÁLICAS","-",null,null,null,0,""]
["S",2,"S",0,4,6,0,0,0,0,0,"","Serviço","Serviço","-","AGETOP",150103,"ESTRUTURA METÁLICA CONVENCIONAL EM AÇO DO TIPO USI SAC-300 COM FUNDO ANTICORROSIVO","Kg    ",58.5,null,null,0,""]
[2,2,2,2,4,7,0,0,0,14,2,"","Nível 2","Nível 2","-","SINAPI",null,"COBERTURAS","-",null,null,null,0,""]
["S",2,"S",0,4,7,0,0,0,0,0,"","Serviço","Serviço","-","AGETOP",160801,"COBERTURA COM TELHA CANALETE 49 OU EQUIV. COM ACESSÓRIOS","m2    ",12.8,null,null,0,""]
[2,2,2,3,4,8,0,0,0,{"$f":"IF(OR($C607=\"S\",$C607=0),0,MATCH(0,OFFSET($D607,1,$C607,ROW($C$619)-ROW($C607)),0))","v":12},{"$f":"IF(OR($C607=\"S\",$C607=0),0,MATCH(OFFSET($D607,0,$C607)+1,OFFSET($D607,1,$C607,ROW($C$619)-ROW($C607)),0))","v":3},"","Nível 2","Nível 2","-","SINAPI",null,"REVESTIMENTO DE PAREDE","-",null,null,null,0,""]
["S",2,"S",0,4,8,0,0,0,{"$f":"IF(OR($C608=\"S\",$C608=0),0,MATCH(0,OFFSET($D608,1,$C608,ROW($C$619)-ROW($C608)),0))","v":0},{"$f":"IF(OR($C608=\"S\",$C608=0),0,MATCH(OFFSET($D608,0,$C608)+1,OFFSET($D608,1,$C608,ROW($C$619)-ROW($C608)),0))","v":0},"","Serviço","Serviço","-","SINAPI",87904,"CHAPISCO APLICADO EM ALVENARIA (COM PRESENÇA DE VÃOS) E ESTRUTURAS DE CONCRETO DE FACHADA, COM COLHER DE PEDREIRO.  ARGAMASSA TRAÇO 1:3 COM PREPARO MANUAL. AF_06/2014","M2",5.6,null,null,0,"Referência: AGETOP - 200101"]
["S",2,"S",0,4,8,0,0,0,0,0,"","Serviço","Serviço","-","SINAPI",87547,"MASSA ÚNICA, PARA RECEBIMENTO DE PINTURA, EM ARGAMASSA TRAÇO 1:2:8, PREPARO MECÂNICO COM BETONEIRA 400L, APLICADA MANUALMENTE EM FACES INTERNAS DE PAREDES, ESPESSURA DE 10MM, COM EXECUÇÃO DE TALISCAS. AF_06/2014","M2",5.6,null,null,0,""]
[2,2,2,4,4,9,0,0,0,{"$f":"IF(OR($C610=\"S\",$C610=0),0,MATCH(0,OFFSET($D610,1,$C610,ROW($C$619)-ROW($C610)),0))","v":9},{"$f":"IF(OR($C610=\"S\",$C610=0),0,MATCH(OFFSET($D610,0,$C610)+1,OFFSET($D610,1,$C610,ROW($C$619)-ROW($C610)),0))","v":4},"","Nível 2","Nível 2","-","SINAPI",null,"REVESTIMENTO DE PISO","-",null,null,null,0,""]
["S",2,"S",0,4,9,0,0,0,0,0,"","Serviço","Serviço","-","SINAPI",95241,"LASTRO DE CONCRETO MAGRO, APLICADO EM PISOS OU RADIERS, ESPESSURA DE 5 CM. AF_07/2016","M2",7.36,null,null,0,""]
["S",2,"S",0,4,9,0,0,0,0,0,"","Serviço","Serviço","-","SINAPI",84191,"PISO EM GRANILITE, MARMORITE OU GRANITINA ESPESSURA 8 MM, INCLUSO JUNTAS DE DILATACAO PLASTICAS","M2",7.45,null,null,0,"Referência: AGETOP - 221101"]
["S",2,"S",0,4,9,0,0,0,0,0,"","Serviço","Serviço","-","AGETOP",221104,"RASPAGEM E APLICAÇÃO RESINA ACRÍLICA DUAS DEMÃOS","m2    ",7.45,null,null,0,""]
[2,2,2,3,4,10,0,0,0,5,3,"","Nível 2","Nível 2","-","SINAPI",null,"PINTURA","-",null,null,null,0,""]
["S",2,"S",0,4,10,0,0,0,0,0,"","Serviço","Serviço","-","SINAPI",88487,"APLICAÇÃO MANUAL DE PINTURA COM TINTA LÁTEX PVA EM PAREDES, DUAS DEMÃOS. AF_06/2014","M2",5.6,null,null,0,""]
["S",2,"S",0,4,10,0,0,0,0,0,"","Serviço","Serviço","-","SINAPI","74145/1","PINTURA ESMALTE FOSCO, DUAS DEMAOS, SOBRE SUPERFICIE METALICA, INCLUSO UMA DEMAO DE FUNDO ANTICORROSIVO. UTILIZACAO DE REVOLVER ( AR-COMPRIMIDO).","M2",12.8,null,null,0,"Referência: AGETOP - 261602"]
[2,2,2,2,4,11,0,0,0,2,{"$error":"#N/A"},"","Nível 2","Nível 2","-","SINAPI",null,"DIVERSOS","-",null,null,null,0,""]
["S",2,"S",0,4,11,0,0,0,0,0,"","Serviço","Serviço","-","AGETOP",270501,"LIMPEZA FINAL DE OBRA - (OBRAS CIVIS)","m2    ",12.8,null,null,0,""]
[-1,null,-1,null,0,0,0,0,0,null,null,"F"]
[null,null,null,null,null,null,null,null,null,null,null,"F",null,null,null,null,null,"OBS: OS QUANTITATIVOS DE MATERIAIS  DAS INSTALAÇÕES HIDROSSANITÁRIAS, ELÉTRICAS E ESPECIAIS SÃO FORNECIDOS PELOS PROFISSIONAIS RESPONSÁVEIS PELOS RESPECTIVOS PROJETOS.",null,null,"VALOR TOTAL",null,0]
[null,null,null,null,null,null,null,null,null,null,null,"F",null,null,null,null,null,null,null,null,"VALOR BDI (27,50%)",null,0]
[null,null,null,null,null,null,null,null,null,null,null,"F",null,null,null,null,null,null,null,null,"TOTAL ORÇAMENTO",null,0]
[null,null,null,null,null,null,null,null,null,null,null,"F"]
[null,null,null,null,null,null,null,null,null,null,null,"F",null,null,null,null,null,null,null,null,"CUSTO POR M2 ³",null,0]
[null,null,null,null,null,null,null,null,null,null,null,"F",null,null,null,null,null,null,null,null,"MATERIAL S/ BDI",null,0]
[null,null,null,null,null,null,null,null,null,null,null,"F",null,null,null,null,null,null,null,null,"MÃO DE OBRA S/ BDI",null,0]
[null,null,null,null,null,null,null,null,null,null,null,"F"]
[null,null,null,null,null,null,null,null,null,null,null,"F",null,null,null,null,"(1) Conforme previsto pelo DECRETO Nº 7.983, DE 8 DE ABRIL DE 2013, os preços adotados são aqueles constantes dos sistemas de referência indicados. Justifica-se o uso dos preços destas composições de custos unitários devido ao seu valor ser menor à mediana de seus correspondentes na tabela SINAPI;"]
[null,null,null,null,null,null,null,null,null,null,null,"F",null,null,null,null,"(2) Optou-se pelo uso das composições de custos da AGETOP para itens não presentes na SINAPI;"]
[null,null,null,null,null,null,null,null,null,null,null,"F",null,null,null,null,"(3) Para itens da AGETOP, os vidros não estão inclusos nas esquadrias e já foram considerados os custos de contramarco para as esquadrias de alumínio;"]
[null,null,null,null,null,null,null,null,null,null,null,"F",null,null,null,null,"(4) Nos casos em que houver execução de granitina e omissão do item AGETOP 221102, considerou-se que o quantitativo para o rodapé, de altura igual a 7cm, foi incorporado na área de piso;"]
[null,null,null,null,null,null,null,null,null,null,null,"F",null,null,null,null,"(5) O custo unitário aproximado por metro quadrado é calculado dividindo-se o valor total do orçamento pela área total de construção."]
[null,null,null,null,null,null,null,null,null,null,null,"F"]
[null,null,null,null,null,null,null,null,null,null,null,"F"]
[]
[null,null,null,null,null,null,null,null,null,null,null,null,null,null,"SOMATÓRIO DE SERVIÇOS"]
[null,null,null,null,null,null,null,null,null,null,null,null,null,null,"ITEM","DESCRIÇÃO DOS SERVIÇOS",null,null,"PREÇO SEM BDI",null,null,"PREÇO COM BDI",null,"PARTICIPAÇÃO ( % )"]
[null,null,null,null,null,null,null,null,null,null,null,null,null,null,"a.","SERVIÇOS PRELIMINARES",null,null,{"$f":"SUMIF($R$19:$R$619,$P638,$W$19:$W$619)","v":0},null,null,{"$f":"ROUND(S638*(1+BDI.Taxa),2)","v":0},null,{"$f":"IFERROR(ROUND($V638*100/$W$622,2),0)","v":0}]
[null,null,null,null,null,null,null,null,null,null,null,null,null,null,"b.","TRANSPORTES",null,null,0,null,null,0,null,{"$f":"IFERROR(ROUND($V639*100/$W$622,2),0)","v":0}]
[null,null,null,null,null,null,null,null,null,null,null,null,null,null,"c.","SERVIÇO EM TERRA",null,null,0,null,null,0,null,0]
[null,null,null,null,null,null,null,null,null,null,null,null,null,null,"d.","FUNDAÇÕES E SONDAGENS",null,null,0,null,null,0,null,0]
[null,null,null,null,null,null,null,null,null,null,null,null,null,null,"e.","ESTRUTURA",null,null,0,null,null,0,null,0]
[null,null,null,null,null,null,null,null,null,null,null,null,null,null,"f.","INSTALAÇÕES ELÉTRICAS",null,null,0,null,null,0,null,0]
[null,null,null,null,null,null,null,null,null,null,null,null,null,null,"g.","INSTALAÇÕES HIDROSSANITÁRIAS",null,null,0,null,null,0,null,0]
[null,null,null,null,null,null,null,null,null,null,null,null,null,null,"h","INSTALAÇÕES ESPECIAIS",null,null,0,null,null,0,null,0]
[null,null,null,null,null,null,null,null,null,null,null,null,null,null,"i.","ALVENARIAS E DIVISÓRIAS",null,null,0,null,null,0,null,0]
[null,null,null,null,null,null,null,null,null,null,null,null,null,null,"j.","ALVENARIA AUTO-PORTANTE",null,null,0,null,null,0,null,0]
[null,null,null,null,null,null,null,null,null,null,null,null,null,null,"k.","IMPERMEABILIZAÇÃO",null,null,0,null,null,0,null,0]
[null,null,null,null,null,null,null,null,null,null,null,null,null,null,"l.","ISOLAMENTO TÉRMICO E ACÚSTICO",null,null,0,null,null,0,null,0]
[null,null,null,null,null,null,null,null,null,null,null,null,null,null,"m.","ESTRUTURA DE MADEIRA",null,null,0,null,null,0,null,0]
[null,null,null,null,null,null,null,null,null,null,null,null,null,null,"n.","ESTRUTURAS METÁLICAS",null,null,0,null,null,0,null,0]
[null,null,null,null,null,null,null,null,null,null,null,null,null,null,"o.","COBERTURAS",null,null,0,null,null,0,null,0]
[null,null,null,null,null,null,null,null,null,null,null,null,null,null,"p.","ESQUADRIAS DE MADEIRA",null,null,0,null,null,0,null,0]
[null,null,null,null,null,null,null,null,null,null,null,null,null,null,"q.","ESQUADRIAS METÁLICAS",null,null,0,null,null,{"$f":"ROUND(S654*(1+BDI.Taxa),2)","v":0},null,0]
[null,null,null,null,null,null,null,null,null,null,null,null,null,null,"r.","VIDROS",null,null,0,null,null,0,null,0]
[null,null,null,null,null,null,null,null,null,null,null,null,null,null,"s.","REVESTIMENTO DE PAREDE",null,null,0,null,null,0,null,0]
[null,null,null,null,null,null,null,null,null,null,null,null,null,null,"t.","FORROS",null,null,0,null,null,0,null,0]
[null,null,null,null,null,null,null,null,null,null,null,null,null,null,"u.","REVESTIMENTO DE PISO",null,null,0,null,null,0,null,0]
[null,null,null,null,null,null,null,null,null,null,null,null,null,null,"v.","FERRAGENS",null,null,0,null,null,0,null,0]
[null,null,null,null,null,null,null,null,null,null,null,null,null,null,"w.","MARCENARIA",null,null,0,null,null,0,null,0]
[null,null,null,null,null,null,null,null,null,null,null,null,null,null,"x.","ADMINISTRAÇÃO",null,null,0,null,null,0,null,0]
[null,null,null,null,null,null,null,null,null,null,null,null,null,null,"y.","PINTURA",null,null,0,null,null,{"$f":"ROUND(S662*(1+BDI.Taxa),2)","v":0},null,0]
[null,null,null,null,null,null,null,null,null,null,null,null,null,null,"z.","DIVERSOS",null,null,0,null,null,{"$f":"IF(S663>0,IF((SUM(V638:W662)+ROUND(S663*(1+BDI.Taxa),2))<>V665,V665-SUM(V638:W662),ROUND(S663*(1+BDI.Taxa),2)),0)","v":0},null,{"$f":"IF(S663>0,IF((SUM(X638:X662)+IFERROR(ROUND($V663*100/$W$622,2),0))<>X665,X665-SUM(X638:X662),IFERROR(ROUND($V663*100/$W$622,2),0)),0)","v":0}]
[null,null,null,null,null,null,null,null,null,null,null,null,null,null,"TOTAL GERAL DO ORÇAMENTO (R$)",null,null,null,{"$f":"SUM(S638:U663)","v":0},null,null,{"$f":"SUM(V638:W663)","v":0},null,{"$f":"SUM(X638:X663)","v":0}]
[null,null,null,null,null,null,null,null,null,null,null,null,null,null,null,null,null,null,{"$f":"$W$620","v":0},null,null,{"$f":"$W$622","v":0},null,100]
[null,null,null,null,null,null,null,null,null,null,null,null,null,null,null,null,null,null,"(TOTAL SEM BDI)",null,null,"(TOTAL COM BDI)",null,"(ARRED porcentagem)"]
[null,null,null,null,null,null,null,null,null,null,null,null,null,null,null,null,null,null,{"$f":"IF(AND(S664=S665,S664>0),\"OK\",\"ERRO\")","v":"ERRO"},null,null,{"$f":"IF(AND(V664=V665,V664>0),\"OK\",\"ERRO\")","v":"ERRO"},null,{"$f":"IF(X664=100,\"OK\",\"ERRO\")","v":"ERRO"}]
[]
[]
[null,null,null,null,null,null,null,null,null,null,null,null,null,null,"RESUMO GERAL DO ORÇAMENTO"]
[null,null,null,null,null,null,null,null,null,null,null,null,null,null,"ITEM","DESCRIÇÃO DOS SERVIÇOS",null,null,"PREÇO SEM BDI",null,null,"PREÇO COM BDI",null,"PARTICIPAÇÃO ( % )"]
[null,null,null,null,null,null,null,null,null,null,null,null,null,null,"1.",{"$f":"IFERROR(VLOOKUP(O672,$O$19:$W$619,4,FALSE),\"\")","v":"REFORMA"},null,null,{"$f":"IF(P673=\"\",$S$693-SUM(OFFSET($S$671:S671,0,0,COUNTA($S$671:S671),1)),SUMIF($R$19:$R$619,$P672,$W$19:$W$619))","v":0},null,null,{"$f":"IF(P673=\"\",$V$693-SUM(OFFSET($V$671:V671,0,0,COUNTA($V$671:V671),1)),ROUND(S672*(1+BDI.Taxa),2))","v":0},null,{"$f":"IF(P673=\"\",$X$693-SUM(OFFSET($X$671:X671,0,0,COUNTA($X$671:X671),1)),ROUND(V672*100/ORÇAMENTO.TotalOrçamento,2))","v":{"$error":"#DIV/0!"}}]
[null,null,null,null,null,null,null,null,null,null,null,null,null,null,"2.","LABORATÓRIO DE CIÊNCIAS - SEDUC 2019",null,null,{"$f":"IF(P674=\"\",$S$693-SUM(OFFSET($S$671:S672,0,0,COUNTA($S$671:S672),1)),SUMIF($R$19:$R$619,$P673,$W$19:$W$619))","v":0},null,null,{"$f":"IF(P674=\"\",$V$693-SUM(OFFSET($V$671:V672,0,0,COUNTA($V$671:V672),1)),ROUND(S673*(1+BDI.Taxa),2))","v":0},null,{"$f":"IF(P674=\"\",$X$693-SUM(OFFSET($X$671:X672,0,0,COUNTA($X$671:X672),1)),ROUND(V673*100/ORÇAMENTO.TotalOrçamento,2))","v":{"$error":"#DIV/0!"}}]
[null,null,null,null,null,null,null,null,null,null,null,null,null,null,"3.","BLOCO VESTIÁRIO PADRÃO SEDUC 2019 - SEC. XXI",null,null,{"$f":"IF(P675=\"\",$S$693-SUM(OFFSET($S$671:S673,0,0,COUNTA($S$671:S673),1)),SUMIF($R$19:$R$619,$P674,$W$19:$W$619))","v":0},null,null,{"$f":"IF(P675=\"\",$V$693-SUM(OFFSET($V$671:V673,0,0,COUNTA($V$671:V673),1)),ROUND(S674*(1+BDI.Taxa),2))","v":0},null,{"$f":"IF(P675=\"\",$X$693-SUM(OFFSET($X$671:X673,0,0,COUNTA($X$671:X673),1)),ROUND(V674*100/ORÇAMENTO.TotalOrçamento,2))","v":{"$error":"#DIV/0!"}}]
[null,null,null,null,null,null,null,null,null,null,null,null,null,null,"4.","PASSARELA COBERTA MOD1 - LAJE PLANA",null,null,{"$f":"IF(P676=\"\",$S$693-SUM(OFFSET($S$671:S674,0,0,COUNTA($S$671:S674),1)),SUMIF($R$19:$R$619,$P675,$W$19:$W$619))","v":0},null,null,{"$f":"IF(P676=\"\",$V$693-SUM(OFFSET($V$671:V674,0,0,COUNTA($V$671:V674),1)),ROUND(S675*(1+BDI.Taxa),2))","v":0},null,{"$f":"IF(P676=\"\",$X$693-SUM(OFFSET($X$671:X674,0,0,COUNTA($X$671:X674),1)),ROUND(V675*100/ORÇAMENTO.TotalOrçamento,2))","v":{"$error":"#DIV/0!"}}]
[null,null,null,null,null,null,null,null,null,null,null,null,null,null,"5.","",null,null,{"$f":"IF(P677=\"\",$S$693-SUM(OFFSET($S$671:S675,0,0,COUNTA($S$671:S675),1)),SUMIF($R$19:$R$619,$P676,$W$19:$W$619))","v":0},null,null,{"$f":"IF(P677=\"\",$V$693-SUM(OFFSET($V$671:V675,0,0,COUNTA($V$671:V675),1)),ROUND(S676*(1+BDI.Taxa),2))","v":0},null,{"$f":"IF(P677=\"\",$X$693-SUM(OFFSET($X$671:X675,0,0,COUNTA($X$671:X675),1)),ROUND(V676*100/ORÇAMENTO.TotalOrçamento,2))","v":{"$error":"#DIV/0!"}}]
[null,null,null,null,null,null,null,null,null,null,null,null,null,null,"6.","",null,null,{"$f":"IF(P678=\"\",$S$693-SUM(OFFSET($S$671:S676,0,0,COUNTA($S$671:S676),1)),SUMIF($R$19:$R$619,$P677,$W$19:$W$619))","v":0},null,null,{"$f":"IF(P678=\"\",$V$693-SUM(OFFSET($V$671:V676,0,0,COUNTA($V$671:V676),1)),ROUND(S677*(1+BDI.Taxa),2))","v":0},null,{"$f":"IF(P678=\"\",$X$693-SUM(OFFSET($X$671:X676,0,0,COUNTA($X$671:X676),1)),ROUND(V677*100/ORÇAMENTO.TotalOrçamento,2))","v":{"$error":"#DIV/0!"}}]
[null,null,null,null,null,null,null,null,null,null,null,null,null,null,"7.","",null,null,{"$f":"IF(P679=\"\",$S$693-SUM(OFFSET($S$671:S677,0,0,COUNTA($S$671:S677),1)),SUMIF($R$19:$R$619,$P678,$W$19:$W$619))","v":0},null,null,{"$f":"IF(P679=\"\",$V$693-SUM(OFFSET($V$671:V677,0,0,COUNTA($V$671:V677),1)),ROUND(S678*(1+BDI.Taxa),2))","v":0},null,{"$f":"IF(P679=\"\",$X$693-SUM(OFFSET($X$671:X677,0,0,COUNTA($X$671:X677),1)),ROUND(V678*100/ORÇAMENTO.TotalOrçamento,2))","v":{"$error":"#DIV/0!"}}]
[null,null,null,null,null,null,null,null,null,null,null,null,null,null,"8.","",null,null,{"$f":"IF(P680=\"\",$S$693-SUM(OFFSET($S$671:S678,0,0,COUNTA($S$671:S678),1)),SUMIF($R$19:$R$619,$P679,$W$19:$W$619))","v":0},null,null,{"$f":"IF(P680=\"\",$V$693-SUM(OFFSET($V$671:V678,0,0,COUNTA($V$671:V678),1)),ROUND(S679*(1+BDI.Taxa),2))","v":0},null,{"$f":"IF(P680=\"\",$X$693-SUM(OFFSET($X$671:X678,0,0,COUNTA($X$671:X678),1)),ROUND(V679*100/ORÇAMENTO.TotalOrçamento,2))","v":{"$error":"#DIV/0!"}}]
[null,null,null,null,null,null,null,null,null,null,null,null,null,null,"9.","",null,null,{"$f":"IF(P681=\"\",$S$693-SUM(OFFSET($S$671:S679,0,0,COUNTA($S$671:S679),1)),SUMIF($R$19:$R$619,$P680,$W$19:$W$619))","v":0},null,null,{"$f":"IF(P681=\"\",$V$693-SUM(OFFSET($V$671:V679,0,0,COUNTA($V$671:V679),1)),ROUND(S680*(1+BDI.Taxa),2))","v":0},null,{"$f":"IF(P681=\"\",$X$693-SUM(OFFSET($X$671:X679,0,0,COUNTA($X$671:X679),1)),ROUND(V680*100/ORÇAMENTO.TotalOrçamento,2))","v":{"$error":"#DIV/0!"}}]
[null,null,null,null,null,null,null,null,null,null,null,null,null,null,"10.","",null,null,{"$f":"IF(P682=\"\",$S$693-SUM(OFFSET($S$671:S680,0,0,COUNTA($S$671:S680),1)),SUMIF($R$19:$R$619,$P681,$W$19:$W$619))","v":0},null,null,{"$f":"IF(P682=\"\",$V$693-SUM(OFFSET($V$671:V680,0,0,COUNTA($V$671:V680),1)),ROUND(S681*(1+BDI.Taxa),2))","v":0},null,{"$f":"IF(P682=\"\",$X$693-SUM(OFFSET($X$671:X680,0,0,COUNTA($X$671:X680),1)),ROUND(V681*100/ORÇAMENTO.TotalOrçamento,2))","v":{"$error":"#DIV/0!"}}]
[null,null,null,null,null,null,null,null,null,null,null,null,null,null,"11.","",null,null,{"$f":"IF(P683=\"\",$S$693-SUM(OFFSET($S$671:S681,0,0,COUNTA($S$671:S681),1)),SUMIF($R$19:$R$619,$P682,$W$19:$W$619))","v":0},null,null,{"$f":"IF(P683=\"\",$V$693-SUM(OFFSET($V$671:V681,0,0,COUNTA($V$671:V681),1)),ROUND(S682*(1+BDI.Taxa),2))","v":0},null,{"$f":"IF(P683=\"\",$X$693-SUM(OFFSET($X$671:X681,0,0,COUNTA($X$671:X681),1)),ROUND(V682*100/ORÇAMENTO.TotalOrçamento,2))","v":{"$error":"#DIV/0!"}}]
[null,null,null,null,null,null,null,null,null,null,null,null,null,null,"12.","",null,null,{"$f":"IF(P684=\"\",$S$693-SUM(OFFSET($S$671:S682,0,0,COUNTA($S$671:S682),1)),SUMIF($R$19:$R$619,$P683,$W$19:$W$619))","v":0},null,null,{"$f":"IF(P684=\"\",$V$693-SUM(OFFSET($V$671:V682,0,0,COUNTA($V$671:V682),1)),ROUND(S683*(1+BDI.Taxa),2))","v":0},null,{"$f":"IF(P684=\"\",$X$693-SUM(OFFSET($X$671:X682,0,0,COUNTA($X$671:X682),1)),ROUND(V683*100/ORÇAMENTO.TotalOrçamento,2))","v":{"$error":"#DIV/0!"}}]
[null,null,null,null,null,null,null,null,null,null,null,null,null,null,"13.","",null,null,{"$f":"IF(P685=\"\",$S$693-SUM(OFFSET($S$671:S683,0,0,COUNTA($S$671:S683),1)),SUMIF($R$19:$R$619,$P684,$W$19:$W$619))","v":0},null,null,{"$f":"IF(P685=\"\",$V$693-SUM(OFFSET($V$671:V683,0,0,COUNTA($V$671:V683),1)),ROUND(S684*(1+BDI.Taxa),2))","v":0},null,{"$f":"IF(P685=\"\",$X$693-SUM(OFFSET($X$671:X683,0,0,COUNTA($X$671:X683),1)),ROUND(V684*100/ORÇAMENTO.TotalOrçamento,2))","v":{"$error":"#DIV/0!"}}]
[null,null,null,null,null,null,null,null,null,null,null,null,null,null,"14.","",null,null,{"$f":"IF(P686=\"\",$S$693-SUM(OFFSET($S$671:S684,0,0,COUNTA($S$671:S684),1)),SUMIF($R$19:$R$619,$P685,$W$19:$W$619))","v":0},null,null,{"$f":"IF(P686=\"\",$V$693-SUM(OFFSET($V$671:V684,0,0,COUNTA($V$671:V684),1)),ROUND(S685*(1+BDI.Taxa),2))","v":0},null,{"$f":"IF(P686=\"\",$X$693-SUM(OFFSET($X$671:X684,0,0,COUNTA($X$671:X684),1)),ROUND(V685*100/ORÇAMENTO.TotalOrçamento,2))","v":{"$error":"#DIV/0!"}}]
[null,null,null,null,null,null,null,null,null,null,null,null,null,null,"15.","",null,null,{"$f":"IF(P687=\"\",$S$693-SUM(OFFSET($S$671:S685,0,0,COUNTA($S$671:S685),1)),SUMIF($R$19:$R$619,$P686,$W$19:$W$619))","v":0},null,null,{"$f":"IF(P687=\"\",$V$693-SUM(OFFSET($V$671:V685,0,0,COUNTA($V$671:V685),1)),ROUND(S686*(1+BDI.Taxa),2))","v":0},null,{"$f":"IF(P687=\"\",$X$693-SUM(OFFSET($X$671:X685,0,0,COUNTA($X$671:X685),1)),ROUND(V686*100/ORÇAMENTO.TotalOrçamento,2))","v":{"$error":"#DIV/0!"}}]
[null,null,null,null,null,null,null,null,null,null,null,null,null,null,"16.","",null,null,{"$f":"IF(P688=\"\",$S$693-SUM(OFFSET($S$671:S686,0,0,COUNTA($S$671:S686),1)),SUMIF($R$19:$R$619,$P687,$W$19:$W$619))","v":0},null,null,{"$f":"IF(P688=\"\",$V$693-SUM(OFFSET($V$671:V686,0,0,COUNTA($V$671:V686),1)),ROUND(S687*(1+BDI.Taxa),2))","v":0},null,{"$f":"IF(P688=\"\",$X$693-SUM(OFFSET($X$671:X686,0,0,COUNTA($X$671:X686),1)),ROUND(V687*100/ORÇAMENTO.TotalOrçamento,2))","v":{"$error":"#DIV/0!"}}]
[null,null,null,null,null,null,null,null,null,null,null,null,null,null,"17.","",null,null,{"$f":"IF(P689=\"\",$S$693-SUM(OFFSET($S$671:S687,0,0,COUNTA($S$671:S687),1)),SUMIF($R$19:$R$619,$P688,$W$19:$W$619))","v":0},null,null,{"$f":"IF(P689=\"\",$V$693-SUM(OFFSET($V$671:V687,0,0,COUNTA($V$671:V687),1)),ROUND(S688*(1+BDI.Taxa),2))","v":0},null,{"$f":"IF(P689=\"\",$X$693-SUM(OFFSET($X$671:X687,0,0,COUNTA($X$671:X687),1)),ROUND(V688*100/ORÇAMENTO.TotalOrçamento,2))","v":{"$error":"#DIV/0!"}}]
[null,null,null,null,null,null,null,null,null,null,null,null,null,null,"18.","",null,null,{"$f":"IF(P690=\"\",$S$693-SUM(OFFSET($S$671:S688,0,0,COUNTA($S$671:S688),1)),SUMIF($R$19:$R$619,$P689,$W$19:$W$619))","v":0},null,null,{"$f":"IF(P690=\"\",$V$693-SUM(OFFSET($V$671:V688,0,0,COUNTA($V$671:V688),1)),ROUND(S689*(1+BDI.Taxa),2))","v":0},null,{"$f":"IF(P690=\"\",$X$693-SUM(OFFSET($X$671:X688,0,0,COUNTA($X$671:X688),1)),ROUND(V689*100/ORÇAMENTO.TotalOrçamento,2))","v":{"$error":"#DIV/0!"}}]
[null,null,null,null,null,null,null,null,null,null,null,null,null,null,"19.","",null,null,{"$f":"IF(P691=\"\",$S$693-SUM(OFFSET($S$671:S689,0,0,COUNTA($S$671:S689),1)),SUMIF($R$19:$R$619,$P690,$W$19:$W$619))","v":0},null,null,{"$f":"IF(P691=\"\",$V$693-SUM(OFFSET($V$671:V689,0,0,COUNTA($V$671:V689),1)),ROUND(S690*(1+BDI.Taxa),2))","v":0},null,{"$f":"IF(P691=\"\",$X$693-SUM(OFFSET($X$671:X689,0,0,COUNTA($X$671:X689),1)),ROUND(V690*100/ORÇAMENTO.TotalOrçamento,2))","v":{"$error":"#DIV/0!"}}]
[null,null,null,null,null,null,null,null,null,null,null,null,null,null,"20.","",null,null,{"$f":"IF(P692=\"\",$S$693-SUM(OFFSET($S$671:S690,0,0,COUNTA($S$671:S690),1)),SUMIF($R$19:$R$619,$P691,$W$19:$W$619))","v":0},null,null,{"$f":"IF(P692=\"\",$V$693-SUM(OFFSET($V$671:V690,0,0,COUNTA($V$671:V690),1)),ROUND(S691*(1+BDI.Taxa),2))","v":0},null,{"$f":"IF(P692=\"\",$X$693-SUM(OFFSET($X$671:X690,0,0,COUNTA($X$671:X690),1)),ROUND(V691*100/ORÇAMENTO.TotalOrçamento,2))","v":{"$error":"#DIV/0!"}}]
[null,null,null,null,null,null,null,null,null,null,null,null,null,null,"TOTAL GERAL DO ORÇAMENTO (R$)",null,null,null,{"$f":"SUM(S672:U691)","v":0},null,null,{"$f":"SUM(V672:W691)","v":0},null,{"$f":"SUM(X672:X691)","v":{"$error":"#DIV/0!"}}]
[null,null,null,null,null,null,null,null,null,null,null,null,null,null,null,null,null,null,{"$f":"$W$620","v":0},null,null,{"$f":"$W$622","v":0},null,100]
[null,null,null,null,null,null,null,null,null,null,null,null,null,null,null,null,null,null,"(TOTAL SEM BDI)",null,null,"(TOTAL COM BDI)",null,"(ARRED porcentagem)"]
[null,null,null,null,null,null,null,null,null,null,null,null,null,null,null,null,null,null,{"$f":"IF(AND(S692=S693,S692>0),\"OK\",\"ERRO\")","v":"ERRO"},null,null,{"$f":"IF(AND(V692=V693,V692>0),\"OK\",\"ERRO\")","v":"ERRO"},null,{"$f":"IF(AND(X692=100,S672<>0),\"OK\",\"ERRO\")","v":{"$error":"#DIV/0!"}}]

{"sheet":"Resumo ","index":1,"n_rows":39,"n_cols":9,"rows_kept":39,"cut":false,"hidden":false,"merged":[[13,0,14,0],[34,2,34,3],[35,2,35,3],[31,2,31,3],[32,2,32,3],[33,2,33,3],[28,2,28,3],[29,2,29,3],[30,2,30,3],[0,1,0,8],[36,1,36,5],[2,1,2,5],[3,1,3,5],[5,1,5,5],[6,1,6,5],[8,1,8,5],[9,1,9,5],[11,3,11,5],[12,3,12,5],[10,1,10,8],[11,6,11,8],[12,6,12,8],[25,2,25,3],[21,2,21,3],[22,2,22,3],[6,6,6,8],[7,1,7,8],[8,6,8,8],[9,6,9,8],[13,1,13,8],[1,1,1,8],[2,6,2,8],[3,6,3,8],[4,1,4,8],[5,6,5,8],[42,3,42,7],[11,1,11,2],[12,1,12,2],[15,2,15,3],[16,2,16,3],[14,1,14,8],[17,2,17,3],[23,2,23,3],[18,2,18,3],[19,2,19,3],[20,2,20,3],[41,3,41,7],[24,2,24,3],[26,2,26,3],[27,2,27,3],[38,1,38,8]]}
[]
[]
[null,"UNIDADE ESCOLAR",null,null,null,null,"CÓDIGO INEP"]
[null,{"$f":"Orçamento!$O$4","v":"COLÉGIO ESTADUAL PROFESSOR HELI ALVES FERREIRA"},null,null,null,null,{"$f":"Orçamento!V4","v":52020487}]
[]
[null,"OBRA",null,null,null,null,"CIDADE"]
[null,{"$f":"Orçamento!$O$7","v":"REFORMA E AMPLIAÇÃO"},null,null,null,null,{"$f":"Orçamento!$V$7","v":"ANÁPOLIS"}]
[]
[null,"ENDEREÇO",null,null,null,null,"CRE"]
[null,{"$f":"Orçamento!$R$10","v":"RUA LOPO DE SOUZA RAMOS S/N PÇA MAJOR HENRIQUE, JUNDIAI, CEP:75110-410"},null,null,null,null,{"$f":"Orçamento!$O$10","v":"ANÁPOLIS"}]
[]
[null,"REFERÊNCIA",null,"DATA",null,null,"ÁREA TOTAL CONSTRUÍDA (M²)"]
[null,{"$f":"CONCATENATE(\"AGETOP E SINAPI - \",Orçamento!$W$10)","v":"AGETOP E SINAPI - DESONERADA"},null,{"$f":"Orçamento!$S$7","v":"2020-04-08"},null,null,{"$f":"Orçamento!$S$13","v":1589.09}]
["FILTRO"]
[null,"RESUMO GERAL DO ORÇAMENTO"]
["↓","ITEM","DESCRIÇÃO DOS SERVIÇOS",null,"UNID","QUANT","PREÇO SEM BDI","PREÇO COM BDI","PARTICIP. (%)"]
[{"$f":"IF(E17>0,\"F\",\"\")","v":"F"},"1.",{"$f":"Orçamento!$P672","v":"REFORMA"},null,"UN ",1,{"$f":"IFERROR(Orçamento!S672,\"-\")","v":0},{"$f":"IFERROR(Orçamento!V672,\"\")","v":0},{"$f":"Orçamento!X672","v":{"$error":"#DIV/0!"}}]
[{"$f":"IF(E18>0,\"F\",\"\")","v":"F"},"2.",{"$f":"Orçamento!$P673","v":"LABORATÓRIO DE CIÊNCIAS - SEDUC 2019"},null,"UN ",1,{"$f":"IFERROR(Orçamento!S673,\"-\")","v":0},{"$f":"IFERROR(Orçamento!V673,\"\")","v":0},{"$f":"Orçamento!X673","v":{"$error":"#DIV/0!"}}]
["F","3.",{"$f":"Orçamento!$P674","v":"BLOCO VESTIÁRIO PADRÃO SEDUC 2019 - SEC. XXI"},null,"UN ",1,{"$f":"IFERROR(Orçamento!S674,\"-\")","v":0},{"$f":"IFERROR(Orçamento!V674,\"\")","v":0},{"$f":"Orçamento!X674","v":{"$error":"#DIV/0!"}}]
["F","4.",{"$f":"Orçamento!$P675","v":"PASSARELA COBERTA MOD1 - LAJE PLANA"},null,"UN ",1,{"$f":"IFERROR(Orçamento!S675,\"-\")","v":0},{"$f":"IFERROR(Orçamento!V675,\"\")","v":0},{"$f":"Orçamento!X675","v":{"$error":"#DIV/0!"}}]
["","5.",{"$f":"Orçamento!$P676","v":""},null,null,null,{"$f":"IFERROR(Orçamento!S676,\"-\")","v":0},{"$f":"IFERROR(Orçamento!V676,\"\")","v":0},{"$f":"Orçamento!X676","v":{"$error":"#DIV/0!"}}]
["","6.",{"$f":"Orçamento!$P677","v":""},null,null,null,{"$f":"IFERROR(Orçamento!S677,\"-\")","v":0},{"$f":"IFERROR(Orçamento!V677,\"\")","v":0},{"$f":"Orçamento!X677","v":{"$error":"#DIV/0!"}}]
["","7.",{"$f":"Orçamento!$P678","v":""},null,null,null,{"$f":"IFERROR(Orçamento!S678,\"-\")","v":0},{"$f":"IFERROR(Orçamento!V678,\"\")","v":0},{"$f":"Orçamento!X678","v":{"$error":"#DIV/0!"}}]
["","8.",{"$f":"Orçamento!$P679","v":""},null,null,null,{"$f":"IFERROR(Orçamento!S679,\"-\")","v":0},{"$f":"IFERROR(Orçamento!V679,\"\")","v":0},{"$f":"Orçamento!X679","v":{"$error":"#DIV/0!"}}]
["","9.",{"$f":"Orçamento!$P680","v":""},null,null,null,{"$f":"IFERROR(Orçamento!S680,\"-\")","v":0},{"$f":"IFERROR(Orçamento!V680,\"\")","v":0},{"$f":"Orçamento!X680","v":{"$error":"#DIV/0!"}}]
["","10.",{"$f":"Orçamento!$P681","v":""},null,null,null,{"$f":"IFERROR(Orçamento!S681,\"-\")","v":0},{"$f":"IFERROR(Orçamento!V681,\"\")","v":0},{"$f":"Orçamento!X681","v":{"$error":"#DIV/0!"}}]
["","11.",{"$f":"Orçamento!$P682","v":""},null,null,null,{"$f":"IFERROR(Orçamento!S682,\"-\")","v":0},{"$f":"IFERROR(Orçamento!V682,\"\")","v":0},{"$f":"Orçamento!X682","v":{"$error":"#DIV/0!"}}]
["","12.",{"$f":"Orçamento!$P683","v":""},null,null,null,{"$f":"IFERROR(Orçamento!S683,\"-\")","v":0},{"$f":"IFERROR(Orçamento!V683,\"\")","v":0},{"$f":"Orçamento!X683","v":{"$error":"#DIV/0!"}}]
["","13.",{"$f":"Orçamento!$P684","v":""},null,null,null,{"$f":"IFERROR(Orçamento!S684,\"-\")","v":0},{"$f":"IFERROR(Orçamento!V684,\"\")","v":0},{"$f":"Orçamento!X684","v":{"$error":"#DIV/0!"}}]
["","14.",{"$f":"Orçamento!$P685","v":""},null,null,null,{"$f":"IFERROR(Orçamento!S685,\"-\")","v":0},{"$f":"IFERROR(Orçamento!V685,\"\")","v":0},{"$f":"Orçamento!X685","v":{"$error":"#DIV/0!"}}]
["","15.",{"$f":"Orçamento!$P686","v":""},null,null,null,{"$f":"IFERROR(Orçamento!S686,\"-\")","v":0},{"$f":"IFERROR(Orçamento!V686,\"\")","v":0},{"$f":"Orçamento!X686","v":{"$error":"#DIV/0!"}}]
["","16.",{"$f":"Orçamento!$P687","v":""},null,null,null,{"$f":"IFERROR(Orçamento!S687,\"-\")","v":0},{"$f":"IFERROR(Orçamento!V687,\"\")","v":0},{"$f":"Orçamento!X687","v":{"$error":"#DIV/0!"}}]
["","17.",{"$f":"Orçamento!$P688","v":""},null,null,null,{"$f":"IFERROR(Orçamento!S688,\"-\")","v":0},{"$f":"IFERROR(Orçamento!V688,\"\")","v":0},{"$f":"Orçamento!X688","v":{"$error":"#DIV/0!"}}]
["","18.",{"$f":"Orçamento!$P689","v":""},null,null,null,{"$f":"IFERROR(Orçamento!S689,\"-\")","v":0},{"$f":"IFERROR(Orçamento!V689,\"\")","v":0},{"$f":"Orçamento!X689","v":{"$error":"#DIV/0!"}}]
["","19.",{"$f":"Orçamento!$P690","v":""},null,null,null,{"$f":"IFERROR(Orçamento!S690,\"-\")","v":0},{"$f":"IFERROR(Orçamento!V690,\"\")","v":0},{"$f":"Orçamento!X690","v":{"$error":"#DIV/0!"}}]
["","20.",{"$f":"Orçamento!$P691","v":""},null,null,null,{"$f":"IFERROR(Orçamento!S691,\"-\")","v":0},{"$f":"IFERROR(Orçamento!V691,\"\")","v":0},{"$f":"Orçamento!X691","v":{"$error":"#DIV/0!"}}]
["F","TOTAL GERAL DO ORÇAMENTO (R$)",null,null,null,null,{"$f":"SUM(G17:G36)","v":0},0,{"$f":"SUM(I17:I36)","v":{"$error":"#DIV/0!"}}]
["F"]
["F"]

{"sheet":"Somatório","index":2,"n_rows":45,"n_cols":16,"rows_kept":45,"cut":false,"hidden":false,"merged":[[13,0,14,0],[42,1,42,2],[44,1,44,5],[47,3,47,5],[48,3,48,5],[13,1,13,5],[9,1,9,3],[9,4,9,5],[11,1,11,2],[11,4,11,5],[12,1,12,2],[12,4,12,5],[0,1,0,5],[14,1,14,5],[2,1,2,3],[2,4,2,5],[3,1,3,3],[3,4,3,5],[5,1,5,3],[5,4,5,5],[6,1,6,3],[6,4,6,5],[8,1,8,3],[8,4,8,5],[1,1,1,5],[4,1,4,5],[7,1,7,5],[10,1,10,5]]}
[]
[]
[null,"UNIDADE ESCOLAR",null,null,"CÓDIGO INEP"]
[null,{"$f":"Orçamento!$O$4","v":"COLÉGIO ESTADUAL PROFESSOR HELI ALVES FERREIRA"},null,null,{"$f":"Orçamento!V4","v":52020487}]
[]
[null,"OBRA",null,null,"CIDADE"]
[null,{"$f":"Orçamento!$O$7","v":"REFORMA E AMPLIAÇÃO"},null,null,{"$f":"Orçamento!$V$7","v":"ANÁPOLIS"}]
[]
[null,"ENDEREÇO",null,null,"CRE"]
[null,{"$f":"Orçamento!$R$10","v":"RUA LOPO DE SOUZA RAMOS S/N PÇA MAJOR HENRIQUE, JUNDIAI, CEP:75110-410"},null,null,{"$f":"Orçamento!$O$10","v":"ANÁPOLIS"}]
[]
[null,"REFERÊNCIA",null,"DATA","ÁREA TOTAL CONSTRUÍDA (M²)",null,null,null,null,null,null,null,{"$f":"0.12","v":0.12},0.4,2.65]
[null,{"$f":"CONCATENATE(\"AGETOP E SINAPI - \",Orçamento!$W$10)","v":"AGETOP E SINAPI - DESONERADA"},null,{"$f":"Orçamento!$S$7","v":"2020-04-08"},{"$f":"Orçamento!$S$13","v":1589.09},null,null,null,null,null,null,null,{"$f":"M12*O12*2","v":0.63600000000000001},{"$f":"N12*O12*2","v":2.12},{"$f":"SUM(M13:N13)","v":2.7560000000000002},{"$f":"O13*2","v":5.5120000000000005}]
["FILTRO"]
[null,"SOMATÓRIO DE SERVIÇOS"]
["↓","ITEM","DESCRIÇÃO DOS SERVIÇOS","PREÇO SEM BDI (R$)","PREÇO COM BDI (R$)","PARTIC.  ( % )"]
[{"$f":"IF(D17>0,\"F\",\"\")","v":""},"a.",{"$f":"Orçamento!P638","v":"SERVIÇOS PRELIMINARES"},{"$f":"Orçamento!S638","v":0},{"$f":"Orçamento!V638","v":0},{"$f":"Orçamento!X638","v":0}]
[{"$f":"IF(D18>0,\"F\",\"\")","v":""},"b.",{"$f":"Orçamento!P639","v":"TRANSPORTES"},{"$f":"Orçamento!S639","v":0},{"$f":"Orçamento!V639","v":0},{"$f":"Orçamento!X639","v":0}]
["","c.",{"$f":"Orçamento!P640","v":"SERVIÇO EM TERRA"},{"$f":"Orçamento!S640","v":0},{"$f":"Orçamento!V640","v":0},{"$f":"Orçamento!X640","v":0}]
["","d.",{"$f":"Orçamento!P641","v":"FUNDAÇÕES E SONDAGENS"},{"$f":"Orçamento!S641","v":0},{"$f":"Orçamento!V641","v":0},{"$f":"Orçamento!X641","v":0}]
["","e.",{"$f":"Orçamento!P642","v":"ESTRUTURA"},{"$f":"Orçamento!S642","v":0},{"$f":"Orçamento!V642","v":0},{"$f":"Orçamento!X642","v":0}]
["","f.",{"$f":"Orçamento!P643","v":"INSTALAÇÕES ELÉTRICAS"},{"$f":"Orçamento!S643","v":0},{"$f":"Orçamento!V643","v":0},{"$f":"Orçamento!X643","v":0}]
["","g.",{"$f":"Orçamento!P644","v":"INSTALAÇÕES HIDROSSANITÁRIAS"},{"$f":"Orçamento!S644","v":0},{"$f":"Orçamento!V644","v":0},{"$f":"Orçamento!X644","v":0}]
["","h",{"$f":"Orçamento!P645","v":"INSTALAÇÕES ESPECIAIS"},{"$f":"Orçamento!S645","v":0},{"$f":"Orçamento!V645","v":0},{"$f":"Orçamento!X645","v":0}]
["","i.",{"$f":"Orçamento!P646","v":"ALVENARIAS E DIVISÓRIAS"},{"$f":"Orçamento!S646","v":0},{"$f":"Orçamento!V646","v":0},{"$f":"Orçamento!X646","v":0}]
["","j.",{"$f":"Orçamento!P647","v":"ALVENARIA AUTO-PORTANTE"},{"$f":"Orçamento!S647","v":0},{"$f":"Orçamento!V647","v":0},{"$f":"Orçamento!X647","v":0}]
["","k.",{"$f":"Orçamento!P648","v":"IMPERMEABILIZAÇÃO"},{"$f":"Orçamento!S648","v":0},{"$f":"Orçamento!V648","v":0},{"$f":"Orçamento!X648","v":0}]
["","l.",{"$f":"Orçamento!P649","v":"ISOLAMENTO TÉRMICO E ACÚSTICO"},{"$f":"Orçamento!S649","v":0},{"$f":"Orçamento!V649","v":0},{"$f":"Orçamento!X649","v":0}]
["","m.",{"$f":"Orçamento!P650","v":"ESTRUTURA DE MADEIRA"},{"$f":"Orçamento!S650","v":0},{"$f":"Orçamento!V650","v":0},{"$f":"Orçamento!X650","v":0}]
["","n.",{"$f":"Orçamento!P651","v":"ESTRUTURAS METÁLICAS"},{"$f":"Orçamento!S651","v":0},{"$f":"Orçamento!V651","v":0},{"$f":"Orçamento!X651","v":0}]
["","o.",{"$f":"Orçamento!P652","v":"COBERTURAS"},{"$f":"Orçamento!S652","v":0},{"$f":"Orçamento!V652","v":0},{"$f":"Orçamento!X652","v":0}]
["","p.",{"$f":"Orçamento!P653","v":"ESQUADRIAS DE MADEIRA"},{"$f":"Orçamento!S653","v":0},{"$f":"Orçamento!V653","v":0},{"$f":"Orçamento!X653","v":0}]
["","q.",{"$f":"Orçamento!P654","v":"ESQUADRIAS METÁLICAS"},{"$f":"Orçamento!S654","v":0},{"$f":"Orçamento!V654","v":0},{"$f":"Orçamento!X654","v":0}]
["","r.",{"$f":"Orçamento!P655","v":"VIDROS"},{"$f":"Orçamento!S655","v":0},{"$f":"Orçamento!V655","v":0},{"$f":"Orçamento!X655","v":0}]
["","s.",{"$f":"Orçamento!P656","v":"REVESTIMENTO DE PAREDE"},{"$f":"Orçamento!S656","v":0},{"$f":"Orçamento!V656","v":0},{"$f":"Orçamento!X656","v":0}]
["","t.",{"$f":"Orçamento!P657","v":"FORROS"},{"$f":"Orçamento!S657","v":0},{"$f":"Orçamento!V657","v":0},{"$f":"Orçamento!X657","v":0}]
["","u.",{"$f":"Orçamento!P658","v":"REVESTIMENTO DE PISO"},{"$f":"Orçamento!S658","v":0},{"$f":"Orçamento!V658","v":0},{"$f":"Orçamento!X658","v":0}]
["","v.",{"$f":"Orçamento!P659","v":"FERRAGENS"},{"$f":"Orçamento!S659","v":0},{"$f":"Orçamento!V659","v":0},{"$f":"Orçamento!X659","v":0}]
["","w.",{"$f":"Orçamento!P660","v":"MARCENARIA"},{"$f":"Orçamento!S660","v":0},{"$f":"Orçamento!V660","v":0},{"$f":"Orçamento!X660","v":0}]
["","x.",{"$f":"Orçamento!P661","v":"ADMINISTRAÇÃO"},{"$f":"Orçamento!S661","v":0},{"$f":"Orçamento!V661","v":0},{"$f":"Orçamento!X661","v":0}]
["","y.",{"$f":"Orçamento!P662","v":"PINTURA"},{"$f":"Orçamento!S662","v":0},{"$f":"Orçamento!V662","v":0},{"$f":"Orçamento!X662","v":0}]
["","z.",{"$f":"Orçamento!P663","v":"DIVERSOS"},{"$f":"Orçamento!S663","v":0},{"$f":"Orçamento!V663","v":0},{"$f":"Orçamento!X663","v":0}]
["F","TOTAL GERAL DO ORÇAMENTO",null,{"$f":"SUM(D17:D42)","v":0},{"$f":"SUM(E17:E42)","v":0},{"$f":"SUM(F17:F42)","v":0}]
[]
[null,"(*) Para itens da AGETOP, os vidros não estão inclusos nas esquadrias e já foram considerados os custos de contramarco para as esquadrias de alumínio;"]

{"sheet":"Cronog_90_Dias","index":3,"n_rows":99,"n_cols":18,"rows_kept":99,"cut":false,"hidden":false,"merged":[[2,1,2,7],[5,1,5,7],[6,1,6,7],[8,1,8,7],[9,1,9,7],[4,1,4,17],[7,1,7,17],[0,1,0,17],[1,1,1,17],[2,8,2,17],[12,0,13,0],[9,0,11,0],[11,1,11,17],[92,1,92,2],[92,5,92,8],[92,13,92,16],[93,1,93,2],[93,5,93,8],[93,13,93,16],[74,13,74,16],[74,5,74,8],[68,13,68,16],[70,5,70,8],[70,13,70,16],[59,5,59,8],[71,1,73,2],[71,4,73,4],[71,5,71,8],[71,13,71,16],[73,5,73,8],[73,13,73,16],[59,13,59,16],[61,5,61,8],[61,13,61,16],[94,1,94,2],[94,5,94,8],[94,13,94,16],[76,5,76,8],[76,13,76,16],[77,5,77,8],[77,13,77,16],[79,5,79,8],[79,13,79,16],[80,5,80,8],[80,13,80,16],[82,5,82,8],[82,13,82,16],[77,3,79,3],[80,3,82,3],[86,1,88,2],[80,4,82,4],[86,9,86,12],[88,9,88,12],[89,9,89,12],[91,9,91,12],[92,9,92,12],[93,9,93,12],[94,9,94,12],[95,1,95,2],[95,5,95,8],[95,13,95,16],[97,1,97,4],[98,1,98,17],[86,13,86,16],[88,5,88,8],[88,13,88,16],[85,5,85,8],[85,13,85,16],[89,1,91,2],[89,4,91,4],[89,5,89,8],[89,13,89,16],[91,5,91,8],[91,13,91,16],[89,3,91,3],[86,4,88,4],[86,5,86,8],[86,3,88,3],[83,1,85,2],[83,4,85,4],[83,5,83,8],[83,13,83,16],[68,5,68,8],[65,5,65,8],[65,13,65,16],[67,5,67,8],[67,13,67,16],[65,3,67,3],[62,13,62,16],[64,5,64,8],[64,13,64,16],[62,5,62,8],[53,13,53,16],[55,5,55,8],[55,13,55,16],[50,5,50,8],[50,13,50,16],[52,5,52,8],[52,13,52,16],[56,13,56,16],[58,5,58,8],[58,13,58,16],[53,5,53,8],[56,5,56,8],[50,9,50,12],[52,9,52,12],[53,9,53,12],[55,9,55,12],[56,9,56,12],[58,9,58,12],[44,13,44,16],[46,5,46,8],[46,13,46,16],[47,1,49,2],[47,4,49,4],[47,5,47,8],[47,13,47,16],[49,5,49,8],[49,13,49,16],[44,5,44,8],[47,3,49,3],[44,9,44,12],[46,9,46,12],[47,9,47,12],[49,9,49,12],[35,13,35,16],[37,5,37,8],[37,13,37,16],[35,3,37,3],[40,13,40,16],[38,3,40,3],[38,13,38,16],[41,1,43,2],[41,4,43,4],[41,5,41,8],[41,13,41,16],[43,5,43,8],[43,13,43,16],[41,3,43,3],[35,5,35,8],[38,5,38,8],[40,5,40,8],[35,9,35,12],[37,9,37,12],[38,9,38,12],[40,9,40,12],[41,9,41,12],[43,9,43,12],[29,13,29,16],[31,5,31,8],[31,13,31,16],[32,1,34,2],[32,4,34,4],[32,5,32,8],[32,13,32,16],[34,5,34,8],[34,13,34,16],[32,3,34,3],[29,5,29,8],[29,1,31,2],[29,4,31,4],[29,9,29,12],[31,9,31,12],[32,9,32,12],[34,9,34,12],[26,1,28,2],[26,4,28,4],[26,5,26,8],[26,13,26,16],[28,5,28,8],[28,13,28,16],[23,3,25,3],[23,1,25,2],[23,4,25,4],[23,5,23,8],[26,3,28,3],[26,9,26,12],[28,9,28,12],[14,3,16,3],[17,3,19,3],[14,4,16,4],[14,5,14,8],[14,13,14,16],[16,5,16,8],[16,13,16,16],[23,13,23,16],[25,5,25,8],[25,13,25,16],[17,13,17,16],[19,5,19,8],[19,13,19,16],[25,9,25,12],[20,1,22,2],[20,4,22,4],[20,5,20,8],[20,13,20,16],[22,5,22,8],[22,13,22,16],[20,3,22,3],[83,3,85,3],[53,4,55,4],[59,1,61,2],[59,4,61,4],[74,1,76,2],[77,1,79,2],[77,4,79,4],[80,1,82,2],[65,1,67,2],[68,3,70,3],[62,3,64,3],[68,1,70,2],[56,3,58,3],[65,4,67,4],[71,3,73,3],[74,3,76,3],[74,4,76,4],[56,1,58,2],[68,4,70,4],[44,3,46,3],[62,1,64,2],[62,4,64,4],[38,1,40,2],[38,4,40,4],[59,3,61,3],[44,1,46,2],[44,4,46,4],[53,1,55,2],[50,1,52,2],[50,4,52,4],[10,1,10,17],[9,8,9,17],[8,8,8,17],[3,8,3,17],[6,8,6,17],[5,8,5,17],[3,1,3,7],[56,4,58,4],[29,3,31,3],[35,1,37,2],[35,4,37,4],[50,3,52,3],[53,3,55,3],[12,17,13,17],[13,1,13,2],[13,5,13,8],[13,13,13,16],[12,3,13,3],[12,13,12,16],[14,1,16,2],[12,5,12,8],[17,1,19,2],[17,4,19,4],[17,5,17,8],[12,9,12,12],[13,9,13,12],[14,9,14,12],[16,9,16,12],[17,9,17,12],[19,9,19,12],[20,9,20,12],[22,9,22,12],[23,9,23,12],[59,9,59,12],[61,9,61,12],[62,9,62,12],[64,9,64,12],[65,9,65,12],[67,9,67,12],[68,9,68,12],[70,9,70,12],[71,9,71,12],[95,9,95,12],[73,9,73,12],[74,9,74,12],[76,9,76,12],[77,9,77,12],[79,9,79,12],[80,9,80,12],[82,9,82,12],[83,9,83,12],[85,9,85,12]]}
[]
[]
[null,"UNIDADE ESCOLAR",null,null,null,null,null,null,"PRAZO"]
[null,{"$f":"Orçamento!$O$4","v":"COLÉGIO ESTADUAL PROFESSOR HELI ALVES FERREIRA"},null,null,null,null,null,null,"90 DIAS CORRIDOS"]
[]
[null,"OBRA",null,null,null,null,null,null,"DATA"]
[null,{"$f":"Orçamento!$O$7","v":"REFORMA E AMPLIAÇÃO"},null,null,null,null,null,null,{"$f":"Orçamento!$S$7","v":"2020-04-08"}]
[]
[null,"LOCAL",null,null,null,null,null,null,"ÁREA TOTAL CONSTRUÍDA (M²)"]
["FILTRO",{"$f":"Orçamento!$V$7","v":"ANÁPOLIS"},null,null,null,null,null,null,{"$f":"Orçamento!$S$13","v":1589.09}]
[]
[null,"CRONOGRAMA - FÍSICO FINANCEIRO"]
["↓","CUSTO TOTAL:",{"$f":"D93","v":0},"VALOR","Dias:",30,null,null,null,60,null,null,null,90,null,null,null,"TOTAL"]
[null,"DESCRIÇÃO DOS SERVIÇOS",null,null,"%","1ª PARCELA",null,null,null,"2ª PARCELA",null,null,null,"3ª PARCELA"]
[{"$f":"IF(D15>0,\"F\",\"\")","v":""},"SERVIÇOS PRELIMINARES",null,{"$f":"Orçamento!V638","v":0},{"$f":"Orçamento!X638","v":0},{"$f":"ROUND(F17*$D$15,2)","v":0},null,null,null,{"$f":"ROUND(J17*$D$15,2)","v":0},null,null,null,{"$f":"ROUND(N17*$D$15,2)","v":0},null,null,null,{"$f":"SUM(F15:Q15)","v":0}]
[{"$f":"IF(A15=\"F\",A15,\"\")","v":""}]
[{"$f":"IF(A16=\"F\",A16,\"\")","v":""},null,null,null,null,0.6,null,null,null,0.4,null,null,null,{"$f":"1-F17-J17","v":0},null,null,null,{"$f":"IFERROR(E15/100,\"\")","v":0}]
[{"$f":"IF(D18>0,\"F\",\"\")","v":""},"TRANSPORTES",null,{"$f":"Orçamento!V639","v":0},{"$f":"Orçamento!X639","v":0},{"$f":"ROUND(F20*$D$18,2)","v":0},null,null,null,{"$f":"ROUND(J20*$D$18,2)","v":0},null,null,null,{"$f":"ROUND(N20*$D$18,2)","v":0},null,null,null,{"$f":"SUM(F18:Q18)","v":0}]
[{"$f":"IF(A18=\"F\",A18,\"\")","v":""}]
[{"$f":"IF(A19=\"F\",A19,\"\")","v":""},null,null,null,null,0.42,null,null,null,0.57999999999999996,null,null,null,{"$f":"1-F20-J20","v":0},null,null,null,{"$f":"IFERROR(E18/100,\"\")","v":0}]
[{"$f":"IF(D21>0,\"F\",\"\")","v":""},"SERVIÇO EM TERRA",null,{"$f":"Orçamento!V640","v":0},{"$f":"Orçamento!X640","v":0},{"$f":"ROUND(F23*$D$21,2)","v":0},null,null,null,{"$f":"ROUND(J23*$D$21,2)","v":0},null,null,null,{"$f":"ROUND(N23*$D$21,2)","v":0},null,null,null,{"$f":"SUM(F21:Q21)","v":0}]
[{"$f":"IF(A21=\"F\",A21,\"\")","v":""}]
[{"$f":"IF(A22=\"F\",A22,\"\")","v":""},null,null,null,null,0.6,null,null,null,0.4,null,null,null,{"$f":"1-F23-J23","v":0},null,null,null,{"$f":"IFERROR(E21/100,\"\")","v":0}]
[{"$f":"IF(D24>0,\"F\",\"\")","v":""},"FUNDAÇÕES E SONDAGENS",null,{"$f":"Orçamento!V641","v":0},{"$f":"Orçamento!X641","v":0},{"$f":"ROUND(F26*$D$24,2)","v":0},null,null,null,{"$f":"ROUND(J26*$D$24,2)","v":0},null,null,null,{"$f":"ROUND(N26*$D$24,2)","v":0},null,null,null,{"$f":"SUM(F24:Q24)","v":0}]
[{"$f":"IF(A24=\"F\",A24,\"\")","v":""}]
[{"$f":"IF(A25=\"F\",A25,\"\")","v":""},null,null,null,null,0.6,null,null,null,0.4,null,null,null,{"$f":"1-F26-J26","v":0},null,null,null,{"$f":"IFERROR(E24/100,\"\")","v":0}]
[{"$f":"IF(D27>0,\"F\",\"\")","v":""},"ESTRUTURA",null,{"$f":"Orçamento!V642","v":0},{"$f":"Orçamento!X642","v":0},{"$f":"ROUND(F29*$D$27,2)","v":0},null,null,null,{"$f":"ROUND(J29*$D$27,2)","v":0},null,null,null,{"$f":"ROUND(N29*$D$27,2)","v":0},null,null,null,{"$f":"SUM(F27:Q27)","v":0}]
[{"$f":"IF(A27=\"F\",A27,\"\")","v":""}]
[{"$f":"IF(A28=\"F\",A28,\"\")","v":""},null,null,null,null,0.2,null,null,null,0.7,null,null,null,{"$f":"1-F29-J29","v":0.10000000000000009},null,null,null,{"$f":"IFERROR(E27/100,\"\")","v":0}]
[{"$f":"IF(D30>0,\"F\",\"\")","v":""},"INST.ELET/TELEFÔNICA/CABEAMENTO ESTRUTURADO",null,{"$f":"Orçamento!V643","v":0},{"$f":"Orçamento!X643","v":0},{"$f":"ROUND(F32*$D$30,2)","v":0},null,null,null,{"$f":"ROUND(J32*$D$30,2)","v":0},null,null,null,{"$f":"ROUND(N32*$D$30,2)","v":0},null,null,null,{"$f":"SUM(F30:Q30)","v":0}]
[{"$f":"IF(A30=\"F\",A30,\"\")","v":""}]
[{"$f":"IF(A31=\"F\",A31,\"\")","v":""},null,null,null,null,0.15,null,null,null,0.75,null,null,null,{"$f":"1-F32-J32","v":9.9999999999999978E-2},null,null,null,{"$f":"IFERROR(E30/100,\"\")","v":0}]
[{"$f":"IF(D33>0,\"F\",\"\")","v":""},"INSTALAÇÕES HIDROSSANITÁRIAS",null,{"$f":"Orçamento!V644","v":0},{"$f":"Orçamento!X644","v":0},{"$f":"ROUND(F35*$D$33,2)","v":0},null,null,null,{"$f":"ROUND(J35*$D$33,2)","v":0},null,null,null,{"$f":"ROUND(N35*$D$33,2)","v":0},null,null,null,{"$f":"SUM(F33:Q33)","v":0}]
[{"$f":"IF(A33=\"F\",A33,\"\")","v":""}]
[{"$f":"IF(A34=\"F\",A34,\"\")","v":""},null,null,null,null,0.2,null,null,null,0.6,null,null,null,{"$f":"1-F35-J35","v":0.20000000000000007},null,null,null,{"$f":"IFERROR(E33/100,\"\")","v":0}]
[{"$f":"IF(D36>0,\"F\",\"\")","v":""},"INSTALAÇÕES ESPECIAIS",null,{"$f":"Orçamento!V645","v":0},{"$f":"Orçamento!X645","v":0},{"$f":"ROUND(F38*$D$36,2)","v":0},null,null,null,{"$f":"ROUND(J38*$D$36,2)","v":0},null,null,null,{"$f":"ROUND(N38*$D$36,2)","v":0},null,null,null,{"$f":"SUM(F36:Q36)","v":0}]
[{"$f":"IF(A36=\"F\",A36,\"\")","v":""}]
[{"$f":"IF(A37=\"F\",A37,\"\")","v":""},null,null,null,null,0.3,null,null,null,0.7,null,null,null,{"$f":"1-F38-J38","v":0},null,null,null,{"$f":"IFERROR(E36/100,\"\")","v":0}]
[{"$f":"IF(D39>0,\"F\",\"\")","v":""},"ALVENARIA E DIVISÓRIAS",null,{"$f":"Orçamento!V646","v":0},{"$f":"Orçamento!X646","v":0},{"$f":"ROUND(F41*$D$39,2)","v":0},null,null,null,{"$f":"ROUND(J41*$D$39,2)","v":0},null,null,null,{"$f":"ROUND(N41*$D$39,2)","v":0},null,null,null,{"$f":"SUM(F39:Q39)","v":0}]
[{"$f":"IF(A39=\"F\",A39,\"\")","v":""}]
[{"$f":"IF(A40=\"F\",A40,\"\")","v":""},null,null,null,null,0.35,null,null,null,0.65,null,null,null,{"$f":"1-F41-J41","v":0},null,null,null,{"$f":"IFERROR(E39/100,\"\")","v":0}]
[{"$f":"IF(D42>0,\"F\",\"\")","v":""},"ALVENARIA AUTO-PORTANTE",null,{"$f":"Orçamento!V647","v":0},{"$f":"Orçamento!X647","v":0},{"$f":"ROUND(F44*$D$42,2)","v":0},null,null,null,{"$f":"ROUND(J44*$D$42,2)","v":0},null,null,null,{"$f":"ROUND(N44*$D$42,2)","v":0},null,null,null,{"$f":"SUM(F42:Q42)","v":0}]
[{"$f":"IF(A42=\"F\",A42,\"\")","v":""}]
[{"$f":"IF(A43=\"F\",A43,\"\")","v":""},null,null,null,null,0.34,null,null,null,0.66,null,null,null,{"$f":"1-F44-J44","v":0},null,null,null,{"$f":"IFERROR(E42/100,\"\")","v":0}]
[{"$f":"IF(D45>0,\"F\",\"\")","v":""},"IMPERMEABILIZAÇÃO",null,{"$f":"Orçamento!V648","v":0},{"$f":"Orçamento!X648","v":0},{"$f":"ROUND(F47*$D$45,2)","v":0},null,null,null,{"$f":"ROUND(J47*$D$45,2)","v":0},null,null,null,{"$f":"ROUND(N47*$D$45,2)","v":0},null,null,null,{"$f":"SUM(F45:Q45)","v":0}]
[{"$f":"IF(A45=\"F\",A45,\"\")","v":""}]
[{"$f":"IF(A46=\"F\",A46,\"\")","v":""},null,null,null,null,0.45,null,null,null,0.55000000000000004,null,null,null,{"$f":"1-F47-J47","v":0},null,null,null,{"$f":"IFERROR(E45/100,\"\")","v":0}]
[{"$f":"IF(D48>0,\"F\",\"\")","v":""},"ISOLAMENTO TÉRMICO E ACÚSTICO",null,{"$f":"Orçamento!V649","v":0},{"$f":"Orçamento!X649","v":0},{"$f":"ROUND(F50*$D$48,2)","v":0},null,null,null,{"$f":"ROUND(J50*$D$48,2)","v":0},null,null,null,{"$f":"ROUND(N50*$D$48,2)","v":0},null,null,null,{"$f":"SUM(F48:Q48)","v":0}]
[{"$f":"IF(A48=\"F\",A48,\"\")","v":""}]
[{"$f":"IF(A49=\"F\",A49,\"\")","v":""},null,null,null,null,0.45,null,null,null,0.55000000000000004,null,null,null,{"$f":"1-F50-J50","v":0},null,null,null,{"$f":"IFERROR(E48/100,\"\")","v":0}]
[{"$f":"IF(D51>0,\"F\",\"\")","v":""},"ESTRUTURA DE MADEIRA",null,{"$f":"Orçamento!V650","v":0},{"$f":"Orçamento!X650","v":0},{"$f":"ROUND(F53*$D$51,2)","v":0},null,null,null,{"$f":"ROUND(J53*$D$51,2)","v":0},null,null,null,{"$f":"ROUND(N53*$D$51,2)","v":0},null,null,null,{"$f":"SUM(F51:Q51)","v":0}]
[{"$f":"IF(A51=\"F\",A51,\"\")","v":""}]
[{"$f":"IF(A52=\"F\",A52,\"\")","v":""},null,null,null,null,0.15,null,null,null,0.7,null,null,null,{"$f":"1-F53-J53","v":0.15000000000000002},null,null,null,{"$f":"IFERROR(E51/100,\"\")","v":0}]
[{"$f":"IF(D54>0,\"F\",\"\")","v":""},"ESTRUTURA METÁLICA",null,{"$f":"Orçamento!V651","v":0},{"$f":"Orçamento!X651","v":0},{"$f":"ROUND(F56*$D$54,2)","v":0},null,null,null,{"$f":"ROUND(J56*$D$54,2)","v":0},null,null,null,{"$f":"ROUND(N56*$D$54,2)","v":0},null,null,null,{"$f":"SUM(F54:Q54)","v":0}]
[{"$f":"IF(A54=\"F\",A54,\"\")","v":""}]
[{"$f":"IF(A55=\"F\",A55,\"\")","v":""},null,null,null,null,0.35,null,null,null,0.65,null,null,null,{"$f":"1-F56-J56","v":0},null,null,null,{"$f":"IFERROR(E54/100,\"\")","v":0}]
[{"$f":"IF(D57>0,\"F\",\"\")","v":""},"COBERTURAS",null,{"$f":"Orçamento!V652","v":0},{"$f":"Orçamento!X652","v":0},{"$f":"ROUND(F59*$D$57,2)","v":0},null,null,null,{"$f":"ROUND(J59*$D$57,2)","v":0},null,null,null,{"$f":"ROUND(N59*$D$57,2)","v":0},null,null,null,{"$f":"SUM(F57:Q57)","v":0}]
[{"$f":"IF(A57=\"F\",A57,\"\")","v":""}]
[{"$f":"IF(A58=\"F\",A58,\"\")","v":""},null,null,null,null,0,null,null,null,0.25,null,null,null,{"$f":"1-F59-J59","v":0.75},null,null,null,{"$f":"IFERROR(E57/100,\"\")","v":0}]
[{"$f":"IF(D60>0,\"F\",\"\")","v":""},"ESQUADRIAS DE MADEIRA",null,{"$f":"Orçamento!V653","v":0},{"$f":"Orçamento!X653","v":0},{"$f":"ROUND(F62*$D$60,2)","v":0},null,null,null,{"$f":"ROUND(J62*$D$60,2)","v":0},null,null,null,{"$f":"ROUND(N62*$D$60,2)","v":0},null,null,null,{"$f":"SUM(F60:Q60)","v":0}]
[{"$f":"IF(A60=\"F\",A60,\"\")","v":""}]
[{"$f":"IF(A61=\"F\",A61,\"\")","v":""},null,null,null,null,0.3,null,null,null,0.55000000000000004,null,null,null,{"$f":"1-F62-J62","v":0.14999999999999991},null,null,null,{"$f":"IFERROR(E60/100,\"\")","v":0}]
[{"$f":"IF(D63>0,\"F\",\"\")","v":""},"ESQUADRIAS METÁLICAS",null,{"$f":"Orçamento!V654","v":0},{"$f":"Orçamento!X654","v":0},{"$f":"ROUND(F65*$D$63,2)","v":0},null,null,null,{"$f":"ROUND(J65*$D$63,2)","v":0},null,null,null,{"$f":"ROUND(N65*$D$63,2)","v":0},null,null,null,{"$f":"SUM(F63:Q63)","v":0}]
[{"$f":"IF(A63=\"F\",A63,\"\")","v":""}]
[{"$f":"IF(A64=\"F\",A64,\"\")","v":""},null,null,null,null,0.3,null,null,null,0.55000000000000004,null,null,null,{"$f":"1-F65-J65","v":0.14999999999999991},null,null,null,{"$f":"IFERROR(E63/100,\"\")","v":0}]
[{"$f":"IF(D66>0,\"F\",\"\")","v":""},"VIDROS",null,{"$f":"Orçamento!V655","v":0},{"$f":"Orçamento!X655","v":0},{"$f":"ROUND(F68*$D$66,2)","v":0},null,null,null,{"$f":"ROUND(J68*$D$66,2)","v":0},null,null,null,{"$f":"ROUND(N68*$D$66,2)","v":0},null,null,null,{"$f":"SUM(F66:Q66)","v":0}]
[{"$f":"IF(A66=\"F\",A66,\"\")","v":""}]
[{"$f":"IF(A67=\"F\",A67,\"\")","v":""},null,null,null,null,0,null,null,null,0,null,null,null,{"$f":"1-F68-J68","v":1},null,null,null,{"$f":"IFERROR(E66/100,\"\")","v":0}]
[{"$f":"IF(D69>0,\"F\",\"\")","v":""},"REVESTIMENTO DE PAREDE",null,{"$f":"Orçamento!V656","v":0},{"$f":"Orçamento!X656","v":0},{"$f":"ROUND(F71*$D$69,2)","v":0},null,null,null,{"$f":"ROUND(J71*$D$69,2)","v":0},null,null,null,{"$f":"ROUND(N71*$D$69,2)","v":0},null,null,null,{"$f":"SUM(F69:Q69)","v":0}]
[{"$f":"IF(A69=\"F\",A69,\"\")","v":""}]
[{"$f":"IF(A70=\"F\",A70,\"\")","v":""},null,null,null,null,0.25,null,null,null,0.6,null,null,null,{"$f":"1-F71-J71","v":0.15000000000000002},null,null,null,{"$f":"IFERROR(E69/100,\"\")","v":0}]
[{"$f":"IF(D72>0,\"F\",\"\")","v":""},"FORROS",null,{"$f":"Orçamento!V657","v":0},{"$f":"Orçamento!X657","v":0},{"$f":"ROUND(F74*$D$72,2)","v":0},null,null,null,{"$f":"ROUND(J74*$D$72,2)","v":0},null,null,null,{"$f":"ROUND(N74*$D$72,2)","v":0},null,null,null,{"$f":"SUM(F72:Q72)","v":0}]
[{"$f":"IF(A72=\"F\",A72,\"\")","v":""}]
[{"$f":"IF(A73=\"F\",A73,\"\")","v":""},null,null,null,null,0.24,null,null,null,0.55000000000000004,null,null,null,{"$f":"1-F74-J74","v":0.20999999999999996},null,null,null,{"$f":"IFERROR(E72/100,\"\")","v":0}]
[{"$f":"IF(D75>0,\"F\",\"\")","v":""},"REVESTIMENTO DE PISO",null,{"$f":"Orçamento!V658","v":0},{"$f":"Orçamento!X658","v":0},{"$f":"ROUND(F77*$D$75,2)","v":0},null,null,null,{"$f":"ROUND(J77*$D$75,2)","v":0},null,null,null,{"$f":"ROUND(N77*$D$75,2)","v":0},null,null,null,{"$f":"SUM(F75:Q75)","v":0}]
[{"$f":"IF(A75=\"F\",A75,\"\")","v":""}]
[{"$f":"IF(A76=\"F\",A76,\"\")","v":""},null,null,null,null,0.3,null,null,null,0.55000000000000004,null,null,null,{"$f":"1-F77-J77","v":0.14999999999999991},null,null,null,{"$f":"IFERROR(E75/100,\"\")","v":0}]
[{"$f":"IF(D78>0,\"F\",\"\")","v":""},"FERRAGENS",null,{"$f":"Orçamento!V659","v":0},{"$f":"Orçamento!X659","v":0},{"$f":"ROUND(F80*$D$78,2)","v":0},null,null,null,{"$f":"ROUND(J80*$D$78,2)","v":0},null,null,null,{"$f":"ROUND(N80*$D$78,2)","v":0},null,null,null,{"$f":"SUM(F78:Q78)","v":0}]
[{"$f":"IF(A78=\"F\",A78,\"\")","v":""}]
[{"$f":"IF(A79=\"F\",A79,\"\")","v":""},null,null,null,null,0,null,null,null,0,null,null,null,{"$f":"1-F80-J80","v":1},null,null,null,{"$f":"IFERROR(E78/100,\"\")","v":0}]
[{"$f":"IF(D81>0,\"F\",\"\")","v":""},"MARCENARIA",null,{"$f":"Orçamento!V660","v":0},{"$f":"Orçamento!X660","v":0},{"$f":"ROUND(F83*$D$81,2)","v":0},null,null,null,{"$f":"ROUND(J83*$D$81,2)","v":0},null,null,null,{"$f":"ROUND(N83*$D$81,2)","v":0},null,null,null,{"$f":"SUM(F81:Q81)","v":0}]
[{"$f":"IF(A81=\"F\",A81,\"\")","v":""}]
[{"$f":"IF(A82=\"F\",A82,\"\")","v":""},null,null,null,null,0,null,null,null,0.77,null,null,null,{"$f":"1-F83-J83","v":0.22999999999999998},null,null,null,{"$f":"IFERROR(E81/100,\"\")","v":0}]
[{"$f":"IF(D84>0,\"F\",\"\")","v":""},"ADMINISTRAÇÃO - MENSALISTAS",null,{"$f":"Orçamento!V661","v":0},{"$f":"Orçamento!X661","v":0},{"$f":"ROUND(F86*$D$84,2)","v":0},null,null,null,{"$f":"ROUND(J86*$D$84,2)","v":0},null,null,null,{"$f":"ROUND(N86*$D$84,2)","v":0},null,null,null,{"$f":"SUM(F84:Q84)","v":0}]
[{"$f":"IF(A84=\"F\",A84,\"\")","v":""}]
[{"$f":"IF(A85=\"F\",A85,\"\")","v":""},null,null,null,null,0.33,null,null,null,0.33,null,null,null,{"$f":"1-F86-J86","v":0.33999999999999991},null,null,null,{"$f":"IFERROR(E84/100,\"\")","v":0}]
[{"$f":"IF(D87>0,\"F\",\"\")","v":""},"PINTURA",null,{"$f":"Orçamento!V662","v":0},{"$f":"Orçamento!X662","v":0},{"$f":"ROUND(F89*$D$87,2)","v":0},null,null,null,{"$f":"ROUND(J89*$D$87,2)","v":0},null,null,null,{"$f":"ROUND(N89*$D$87,2)","v":0},null,null,null,{"$f":"SUM(F87:Q87)","v":0}]
[{"$f":"IF(A87=\"F\",A87,\"\")","v":""}]
[{"$f":"IF(A88=\"F\",A88,\"\")","v":""},null,null,null,null,0,null,null,null,0.5,null,null,null,{"$f":"1-F89-J89","v":0.5},null,null,null,{"$f":"IFERROR(E87/100,\"\")","v":0}]
[{"$f":"IF(D90>0,\"F\",\"\")","v":""},"DIVERSOS",null,{"$f":"Orçamento!V663","v":0},{"$f":"Orçamento!X663","v":0},{"$f":"ROUND(F92*$D$90,2)","v":0},null,null,null,{"$f":"ROUND(J92*$D$90,2)","v":0},null,null,null,{"$f":"ROUND(N92*$D$90,2)","v":0},null,null,null,{"$f":"SUM(F90:Q90)","v":0}]
[{"$f":"IF(A90=\"F\",A90,\"\")","v":""}]
[{"$f":"IF(A91=\"F\",A91,\"\")","v":""},null,null,null,null,0.22,null,null,null,0.6,null,null,null,{"$f":"1-F92-J92","v":0.18000000000000005},null,null,null,{"$f":"IFERROR(E90/100,\"\")","v":0}]
["F","CUSTO DO ORÇAMENTO",null,{"$f":"SUM(D15:D92)","v":0},{"$f":"SUM(E15:E92)","v":0},{"$f":"F15+F18+F21+F24+F27+F30+F33+F36+F39+F42+F45+F48+F51+F54+F57+F60+F63+F66+F69+F72+F75+F78+F81+F84+F87+F90","v":0},null,null,null,{"$f":"J15+J18+J21+J24+J27+J30+J33+J36+J39+J42+J45+J48+J51+J54+J57+J60+J63+J66+J69+J72+J75+J78+J81+J84+J87+J90","v":0},null,null,null,{"$f":"N15+N18+N21+N24+N27+N30+N33+N36+N39+N42+N45+N48+N51+N54+N57+N60+N63+N66+N69+N72+N75+N78+N81+N84+N87+N90","v":0},null,null,null,{"$f":"R15+R18+R21+R24+R27+R30+R33+R36+R39+R42+R45+R48+R51+R54+R57+R60+R63+R66+R69+R72+R75+R78+R81+R84+R87+R90","v":0}]
["F","PERCENTUAIS:",null,null,null,{"$f":"IFERROR(F93/$D$93,\"\")","v":""},null,null,null,{"$f":"IFERROR(J93/$D$93,\"\")","v":""},null,null,null,{"$f":"IFERROR(N93/$D$93,\"\")","v":""},null,null,null,{"$f":"SUM(F94:Q94)","v":0}]
["F","TOTAIS ACUMULADOS:",null,null,null,{"$f":"F93","v":0},null,null,null,{"$f":"F95+J93","v":0},null,null,null,{"$f":"J95+N93","v":0}]
["F","PERCENTUAIS  ACUMULADOS:",null,null,null,{"$f":"F94","v":""},null,null,null,{"$f":"IFERROR(F96+J94,\"\")","v":""},null,null,null,{"$f":"IFERROR(J96+N94,\"\")","v":""}]
["F"]
["F","OBSERVAÇÕES:"]
["F","Os pagamentos somente poderão ser efetuados mediante medição e atesto pelos técnicos da Secretaria da Educação. "]

{"sheet":"Composição BDI","index":4,"n_rows":45,"n_cols":9,"rows_kept":45,"cut":false,"hidden":false,"merged":[[11,0,11,3],[12,0,12,3],[14,0,14,3],[15,0,15,3],[13,0,13,3],[0,0,0,3],[1,0,1,3],[4,0,4,3],[7,0,7,3],[10,0,10,3],[2,0,2,3],[3,0,3,3],[5,0,5,3],[6,0,6,3],[8,0,8,3],[9,0,9,3],[18,5,18,8],[17,0,17,3],[16,0,16,3],[44,0,44,3],[42,0,42,3],[43,0,43,3],[18,0,18,3],[36,0,36,3],[39,0,39,3],[38,0,38,3],[40,0,40,3],[29,0,29,2],[32,0,32,3],[33,0,33,3],[34,0,34,3],[35,0,35,3]]}
[]
[]
["UNIDADE ESCOLAR"]
[{"$f":"Orçamento!$O$4","v":"COLÉGIO ESTADUAL PROFESSOR HELI ALVES FERREIRA"}]
[]
["OBRA"]
[{"$f":"Orçamento!$O$7","v":"REFORMA E AMPLIAÇÃO"}]
[]
["ENDEREÇO"]
[{"$f":"Orçamento!$R$10","v":"RUA LOPO DE SOUZA RAMOS S/N PÇA MAJOR HENRIQUE, JUNDIAI, CEP:75110-410"}]
[]
["CIDADE"]
[{"$f":"Orçamento!$V$7","v":"ANÁPOLIS"}]
[]
["CRE"]
[{"$f":"Orçamento!$O$10","v":"ANÁPOLIS"}]
[]
["DETALHAMENTO DA COMPOSIÇÃO DE BDI"]
["COMPOSIÇÃO BDI PARA OBRAS CIVIS",null,null,null,null,"BDI CONSTRUÇÃO E REFORMA"]
["DESCRIÇÃO","COEF.","TAXA % (a.m)","% no preço de venda",null,"Situação","1º Quartil","Médio","3º Quartil"]
["1) COFINS",1,0.03,{"$f":"C21","v":0.03},null,{"$f":"IF(OR(C21<G21,C21>I21),\"FORA DO INTERVALO\",\"OK\")","v":"OK"},0.03,0.03,0.03]
["2) PIS",1,6.4999999999999997E-3,{"$f":"C22","v":6.4999999999999997E-3},null,{"$f":"IF(OR(C22<G22,C22>I22),\"FORA DO INTERVALO\",\"OK\")","v":"OK"},6.4999999999999997E-3,6.4999999999999997E-3,6.4999999999999997E-3]
["3) ISSQN",1,0.03,{"$f":"C23*B23","v":0.03},null,"OK",0.02,3.5000000000000003E-2,0.05]
["4) CPRB",1,4.4999999999999998E-2,{"$f":"C24","v":4.4999999999999998E-2},null,"OK",4.4999999999999998E-2,4.4999999999999998E-2,4.4999999999999998E-2]
["5) Administração Central",1,0.04,0.04,null,"OK",0.03,0.04,5.5E-2]
["6) Despesas Financeiras",1,5.5999999999999999E-3,5.5999999999999999E-3,null,"FORA DO INTERVALO",5.8999999999999999E-3,1.23E-2,1.3899999999999999E-2]
["7) Seguros + Garantias",1,1.1999999999999999E-3,1.1999999999999999E-3,null,"FORA DO INTERVALO",8.0000000000000002E-3,8.0000000000000002E-3,0.01]
["8) Risco",1,9.7000000000000003E-3,9.7000000000000003E-3,null,"OK",9.7000000000000003E-3,1.2699999999999999E-2,1.2699999999999999E-2]
["9) Lucro",1,7.1999999999999995E-2,7.1999999999999995E-2,null,"OK",6.1600000000000002E-2,7.3999999999999996E-2,8.9599999999999999E-2]
["BDI - FINAL",null,null,{"$f":"(((1+D25+D27+D28)*(1+D26)*(1+D29))/(1-(D21+D22+D23+D24))-1)","v":0.27504058849746826},null,"FORA DO INTERVALO",0.2034,0.22120000000000001,0.25]
[]
["Notas:"]
["(1) e (2) Alíquota definida por lei."]
["(3) Alíquota e base de cálculo definidas pela legislação municipal."]
["(4) Alíquota definida pelas leis 12.546/11, 12844/13 e 13.161/15 (CPRB – contribuição previdenciária sobre a receita bruta)."]
["(5) Valores definidos a partir dos limites no Acórdão nº 2.622/2013 - TCU – Plenário. Valores entre o 1º e 3º quartis."]
["(6) Valor calculado pela expressão matemática do acórdão 2.369/2011 – TCU – Plenário e disponibilizado pela AGETOP em dezembro de 2018. (Foi utilizado para o cálculo a média da Taxa SELIC no período de 11/2017 a 10/2018)"]
[]
["(7) Valores definidos pela AGETOP a partir dos limites no Acórdão nº 2.622/2013 - TCU – Plenário. Valores médios. \n\nObservação da AGETOP: (Seguros contra erros de execução, incêndio e explosão, danos da natureza (vendaval, destelhamento, alagamento, inundação, desmoronamento, geadas etc.), emprego de material defeituoso ou inadequado, roubo e/ou furto qualificado, quebra de equipamentos, desmoronamento de estrutura, nas modalidades de Obras Civis em Construção (OCC); Instalação e Montagem (IM); e Obras Civis em Construção e Instalação e Montagem (OCC/IM). Bem como coberturas adicionais para ampliação dessas coberturas básicas, como: cobertura de responsabilidade civil geral, cobertura de responsabilidade civil cruzada, cobertura de despesas extraordinárias, cobertura de tumultos, cobertura de desentulho do local, cobertura de riscos do fabricante, dentre outras, incluindo o seguro de vida em grupo regido pela convenção coletiva dos trabalhadores na indústria da construção civil). A partir de 24/02/2015 por intermédio da Portaria 449/2015 a Presidência da AGETOP, na pessoa do Senhor Jayme Eduardo Rincon, determinou a exclusão dos valores referentes aos Seguros de Risco de Engenharia e Responsabilidade Civil do Profissional na composição do cálculo do B.D.I.."]
["(8) Valores definidos a partir dos limites no Acórdão nº 2.622/2013 - TCU – Plenário. Valores entre 1º e 3° quartis."]
["(9) Valores definidos a partir dos limites definidos no Acórdão nº 2.622/2013 - TCU – Plenário. Valores adotados e praticados no mercado ( “ ex ante ” ) ou aqueles entre os 1º e 3º quartis."]
[]
["(*) A fórmula para estipulação da taxa de BDI estimado adotado é a mesma que foi aplicada para a obtenção das tabelas contidas no Acórdão n. 2.622/2013 – TCUPlenário"]
[]
["Obs.: Para obras com valores superiores a R$ 20.000.000,00 sugere-se recalcular o BDI, dimensionando as taxas de administração central e lucro para patamares inferiores ao estipulado acima."]

{"sheet":"Relatório CENTRAL","index":5,"n_rows":40,"n_cols":5,"rows_kept":40,"cut":false,"hidden":false,"merged":[[10,1,10,4],[11,1,11,4],[39,1,39,2],[9,0,11,0],[0,1,0,4],[6,3,6,4],[9,3,9,4],[1,1,1,4],[2,1,2,2],[2,3,2,4],[3,1,3,2],[3,3,3,4],[4,1,4,4],[5,1,5,2],[5,3,5,4],[6,1,6,2],[7,1,7,4],[8,1,8,2],[8,3,8,4],[9,1,9,2]]}
[]
[]
[null,"UNIDADE ESCOLAR",null,"CIDADE"]
[null,{"$f":"Orçamento!$O$4","v":"COLÉGIO ESTADUAL PROFESSOR HELI ALVES FERREIRA"},null,{"$f":"Orçamento!$V$7","v":"ANÁPOLIS"}]
[]
[null,"OBRA",null,"CRE"]
[null,{"$f":"Orçamento!$O$7","v":"REFORMA E AMPLIAÇÃO"},null,{"$f":"Orçamento!$O$10","v":"ANÁPOLIS"}]
[]
[null,"ENDEREÇO",null,"DATA"]
["FILTRO",{"$f":"Orçamento!$R$10","v":"RUA LOPO DE SOUZA RAMOS S/N PÇA MAJOR HENRIQUE, JUNDIAI, CEP:75110-410"},null,{"$f":"Orçamento!$S$7","v":"2020-04-08"}]
[]
[null,"RELATÓRIO CENTRAL"]
["↓","CÓDIGO","ETAPA","PREÇO  (R$) C/ BDI","PARTIC  ( % )"]
[{"$f":"IF(D14>0,\"F\",\"\")","v":""},{"$f":"Orçamento!O638","v":"a."},{"$f":"Orçamento!P638","v":"SERVIÇOS PRELIMINARES"},{"$f":"Orçamento!V638","v":0},{"$f":"Orçamento!X638","v":0}]
[{"$f":"IF(D15>0,\"F\",\"\")","v":""},{"$f":"Orçamento!O639","v":"b."},{"$f":"Orçamento!P639","v":"TRANSPORTES"},{"$f":"Orçamento!V639","v":0},{"$f":"Orçamento!X639","v":0}]
["",{"$f":"Orçamento!O640","v":"c."},{"$f":"Orçamento!P640","v":"SERVIÇO EM TERRA"},{"$f":"Orçamento!V640","v":0},{"$f":"Orçamento!X640","v":0}]
["",{"$f":"Orçamento!O641","v":"d."},{"$f":"Orçamento!P641","v":"FUNDAÇÕES E SONDAGENS"},{"$f":"Orçamento!V641","v":0},{"$f":"Orçamento!X641","v":0}]
["",{"$f":"Orçamento!O642","v":"e."},{"$f":"Orçamento!P642","v":"ESTRUTURA"},{"$f":"Orçamento!V642","v":0},{"$f":"Orçamento!X642","v":0}]
["",{"$f":"Orçamento!O643","v":"f."},{"$f":"Orçamento!P643","v":"INSTALAÇÕES ELÉTRICAS"},{"$f":"Orçamento!V643","v":0},{"$f":"Orçamento!X643","v":0}]
["",{"$f":"Orçamento!O644","v":"g."},{"$f":"Orçamento!P644","v":"INSTALAÇÕES HIDROSSANITÁRIAS"},{"$f":"Orçamento!V644","v":0},{"$f":"Orçamento!X644","v":0}]
["",{"$f":"Orçamento!O645","v":"h"},{"$f":"Orçamento!P645","v":"INSTALAÇÕES ESPECIAIS"},{"$f":"Orçamento!V645","v":0},{"$f":"Orçamento!X645","v":0}]
["",{"$f":"Orçamento!O646","v":"i."},{"$f":"Orçamento!P646","v":"ALVENARIAS E DIVISÓRIAS"},{"$f":"Orçamento!V646","v":0},{"$f":"Orçamento!X646","v":0}]
["",{"$f":"Orçamento!O647","v":"j."},{"$f":"Orçamento!P647","v":"ALVENARIA AUTO-PORTANTE"},{"$f":"Orçamento!V647","v":0},{"$f":"Orçamento!X647","v":0}]
["",{"$f":"Orçamento!O648","v":"k."},{"$f":"Orçamento!P648","v":"IMPERMEABILIZAÇÃO"},{"$f":"Orçamento!V648","v":0},{"$f":"Orçamento!X648","v":0}]
["",{"$f":"Orçamento!O649","v":"l."},{"$f":"Orçamento!P649","v":"ISOLAMENTO TÉRMICO E ACÚSTICO"},{"$f":"Orçamento!V649","v":0},{"$f":"Orçamento!X649","v":0}]
["",{"$f":"Orçamento!O650","v":"m."},{"$f":"Orçamento!P650","v":"ESTRUTURA DE MADEIRA"},{"$f":"Orçamento!V650","v":0},{"$f":"Orçamento!X650","v":0}]
["",{"$f":"Orçamento!O651","v":"n."},{"$f":"Orçamento!P651","v":"ESTRUTURAS METÁLICAS"},{"$f":"Orçamento!V651","v":0},{"$f":"Orçamento!X651","v":0}]
["",{"$f":"Orçamento!O652","v":"o."},{"$f":"Orçamento!P652","v":"COBERTURAS"},{"$f":"Orçamento!V652","v":0},{"$f":"Orçamento!X652","v":0}]
["",{"$f":"Orçamento!O653","v":"p."},{"$f":"Orçamento!P653","v":"ESQUADRIAS DE MADEIRA"},{"$f":"Orçamento!V653","v":0},{"$f":"Orçamento!X653","v":0}]
["",{"$f":"Orçamento!O654","v":"q."},{"$f":"Orçamento!P654","v":"ESQUADRIAS METÁLICAS"},{"$f":"Orçamento!V654","v":0},{"$f":"Orçamento!X654","v":0}]
["",{"$f":"Orçamento!O655","v":"r."},{"$f":"Orçamento!P655","v":"VIDROS"},{"$f":"Orçamento!V655","v":0},{"$f":"Orçamento!X655","v":0}]
["",{"$f":"Orçamento!O656","v":"s."},{"$f":"Orçamento!P656","v":"REVESTIMENTO DE PAREDE"},{"$f":"Orçamento!V656","v":0},{"$f":"Orçamento!X656","v":0}]
["",{"$f":"Orçamento!O657","v":"t."},{"$f":"Orçamento!P657","v":"FORROS"},{"$f":"Orçamento!V657","v":0},{"$f":"Orçamento!X657","v":0}]
["",{"$f":"Orçamento!O658","v":"u."},{"$f":"Orçamento!P658","v":"REVESTIMENTO DE PISO"},{"$f":"Orçamento!V658","v":0},{"$f":"Orçamento!X658","v":0}]
["",{"$f":"Orçamento!O659","v":"v."},{"$f":"Orçamento!P659","v":"FERRAGENS"},{"$f":"Orçamento!V659","v":0},{"$f":"Orçamento!X659","v":0}]
["",{"$f":"Orçamento!O660","v":"w."},{"$f":"Orçamento!P660","v":"MARCENARIA"},{"$f":"Orçamento!V660","v":0},{"$f":"Orçamento!X660","v":0}]
["",{"$f":"Orçamento!O661","v":"x."},{"$f":"Orçamento!P661","v":"ADMINISTRAÇÃO"},{"$f":"Orçamento!V661","v":0},{"$f":"Orçamento!X661","v":0}]
["",{"$f":"Orçamento!O662","v":"y."},{"$f":"Orçamento!P662","v":"PINTURA"},{"$f":"Orçamento!V662","v":0},{"$f":"Orçamento!X662","v":0}]
["",{"$f":"Orçamento!O663","v":"z."},{"$f":"Orçamento!P663","v":"DIVERSOS"},{"$f":"Orçamento!V663","v":0},{"$f":"Orçamento!X663","v":0}]
["F","TOTAL GERAL DO ORÇAMENTO (R$) C/BDI",null,{"$f":"SUM(D14:D39)","v":0},{"$f":"SUM(E14:E39)","v":0}]

{"sheet":"Parc Maior Relev","index":6,"n_rows":21,"n_cols":7,"rows_kept":21,"cut":false,"hidden":false,"merged":[[0,1,0,6],[11,1,11,6],[1,1,1,6],[2,1,2,3],[2,4,2,6],[3,1,3,3],[3,4,3,6],[4,1,4,6],[5,1,5,3],[5,4,5,6],[9,1,9,3],[9,4,9,6],[10,1,10,6],[6,1,6,3],[6,4,6,6],[7,1,7,6],[10,0,12,0],[8,1,8,3],[8,4,8,6],[21,3,21,7],[19,1,19,6]]}
[]
[]
[null,"UNIDADE ESCOLAR",null,null,"CÓDIGO INEP"]
[null,{"$f":"Orçamento!$O$4","v":"COLÉGIO ESTADUAL PROFESSOR HELI ALVES FERREIRA"},null,null,{"$f":"Orçamento!$V$4","v":52020487}]
[]
[null,"OBRA",null,null,"CIDADE"]
[null,{"$f":"Orçamento!$O$7","v":"REFORMA E AMPLIAÇÃO"},null,null,{"$f":"Orçamento!$V$7","v":"ANÁPOLIS"}]
[]
[null,"CRE",null,null,"ÁREA TOTAL CONSTRUÍDA (M²)"]
[null,{"$f":"Orçamento!$O$10","v":"ANÁPOLIS"},null,null,{"$f":"Orçamento!$S$13","v":1589.09}]
["FILTRO"]
[null,"PARCELA DE MAIOR RELEVÂNCIA"]
[null,"CÓDIGO","SERVIÇO","DESCRIÇÃO","UNID","QUANT","PARC. MAIOR RELEV (100%)"]
[{"$f":"IF(F14>0,\"F\",\"\")","v":"F"},70000,"INSTALAÇÕES ELÉTRICAS","SUBESTAÇÃO","KVA",112.5,{"$f":"F14","v":112.5}]
[null,"CÓDIGO","SERVIÇO","DESCRIÇÃO","UNID","QUANT","PARC. MAIOR RELEV (50%)"]
[{"$f":"IF(F16>0,\"F\",\"\")","v":"F"},160000,"COBERTURAS","TELHA PLAN","M2",{"$f":"Orçamento!T243+Orçamento!T369","v":131.11000000000001},{"$f":"F16*0.5","v":65.555000000000007}]
[{"$f":"IF(F17>0,\"F\",\"\")","v":"F"},160000,"COBERTURAS","TELHA ONDULADA","M2",{"$f":"Orçamento!T549","v":55.42},{"$f":"F17*0.5","v":27.71}]
["F",220000,"REVESTIMENTO DE PISO","GRANITINA","M2",{"$f":"Orçamento!T256+Orçamento!T385+Orçamento!T612","v":59.21},29.605]
["F"]
["F","(*) Para os fins do inciso I dp § 1º do Art. 30 da Lei Federal 8.666/93, são consideradas parcelas de maior relevância técnica as execuções apresentadas"]
["F"]

{"sheet":"Composições","index":7,"n_rows":281,"n_cols":10,"rows_kept":281,"cut":false,"hidden":false,"merged":[[15,0,15,9],[13,0,13,2],[13,3,13,6],[1,0,1,9],[3,7,3,9],[4,7,4,9],[6,7,6,9],[7,7,7,9],[6,0,6,6],[10,8,10,9],[13,8,13,9],[14,0,14,9],[8,0,8,9],[5,0,5,9],[2,0,2,9],[0,0,0,8],[10,0,10,2],[10,3,10,6],[11,0,11,9],[12,0,12,2],[12,3,12,6],[12,7,12,8],[7,0,7,6],[9,0,9,2],[9,3,9,6],[9,7,9,8],[3,0,3,6],[4,0,4,6],[16,5,17,5],[16,6,16,7],[16,8,16,9],[22,1,22,7],[26,1,26,7],[16,0,17,0],[16,1,17,1],[16,2,17,2],[16,3,17,3],[16,4,17,4],[28,5,29,5],[28,6,28,7],[28,8,28,9],[32,1,32,7],[36,1,36,7],[28,0,29,0],[28,1,29,1],[28,2,29,2],[28,3,29,3],[28,4,29,4],[38,5,39,5],[38,6,38,7],[38,8,38,9],[44,1,44,7],[51,1,51,7],[38,0,39,0],[38,1,39,1],[38,2,39,2],[38,3,39,3],[38,4,39,4],[53,5,54,5],[53,6,53,7],[53,8,53,9],[59,1,59,7],[63,1,63,7],[53,0,54,0],[53,1,54,1],[53,2,54,2],[53,3,54,3],[53,4,54,4],[65,5,66,5],[65,6,65,7],[65,8,65,9],[71,1,71,7],[75,1,75,7],[65,0,66,0],[65,1,66,1],[65,2,66,2],[65,3,66,3],[65,4,66,4],[77,5,78,5],[77,6,77,7],[77,8,77,9],[83,1,83,7],[87,1,87,7],[77,0,78,0],[77,1,78,1],[77,2,78,2],[77,3,78,3],[77,4,78,4],[89,5,90,5],[89,6,89,7],[89,8,89,9],[95,1,95,7],[99,1,99,7],[89,0,90,0],[89,1,90,1],[89,2,90,2],[89,3,90,3],[89,4,90,4],[101,5,102,5],[101,6,101,7],[101,8,101,9],[107,1,107,7],[111,1,111,7],[101,0,102,0],[101,1,102,1],[101,2,102,2],[101,3,102,3],[101,4,102,4],[113,5,114,5],[113,6,113,7],[113,8,113,9],[119,1,119,7],[123,1,123,7],[113,0,114,0],[113,1,114,1],[113,2,114,2],[113,3,114,3],[113,4,114,4],[125,5,126,5],[125,6,125,7],[125,8,125,9],[131,1,131,7],[135,1,135,7],[125,0,126,0],[125,1,126,1],[125,2,126,2],[125,3,126,3],[125,4,126,4],[137,5,138,5],[137,6,137,7],[137,8,137,9],[143,1,143,7],[151,1,151,7],[137,0,138,0],[137,1,138,1],[137,2,138,2],[137,3,138,3],[137,4,138,4],[153,5,154,5],[153,6,153,7],[153,8,153,9],[158,1,158,7],[168,1,168,7],[153,0,154,0],[153,1,154,1],[153,2,154,2],[153,3,154,3],[153,4,154,4],[170,5,171,5],[170,6,170,7],[170,8,170,9],[176,1,176,7],[191,1,191,7],[170,0,171,0],[170,1,171,1],[170,2,171,2],[170,3,171,3],[170,4,171,4],[193,5,194,5],[193,6,193,7],[193,8,193,9],[199,1,199,7],[203,1,203,7],[193,0,194,0],[193,1,194,1],[193,2,194,2],[193,3,194,3],[193,4,194,4],[205,5,206,5],[205,6,205,7],[205,8,205,9],[214,1,214,7],[218,1,218,7],[205,0,206,0],[205,1,206,1],[205,2,206,2],[205,3,206,3],[205,4,206,4],[220,5,221,5],[220,6,220,7],[220,8,220,9],[226,1,226,7],[232,1,232,7],[220,0,221,0],[220,1,221,1],[220,2,221,2],[220,3,221,3],[220,4,221,4],[234,0,235,0],[234,1,235,1],[234,2,235,2],[234,3,235,3],[234,4,235,4],[234,5,235,5],[234,6,234,7],[234,8,234,9],[240,1,240,7],[244,1,244,7],[246,0,247,0],[246,1,247,1],[246,2,247,2],[246,3,247,3],[246,4,247,4],[246,5,247,5],[246,6,246,7],[246,8,246,9],[252,1,252,7],[256,1,256,7],[258,0,259,0],[258,1,259,1],[258,2,259,2],[258,3,259,3],[258,4,259,4],[258,5,259,5],[258,6,258,7],[276,1,276,7],[280,1,280,7],[258,8,258,9],[264,1,264,7],[268,1,268,7],[270,0,271,0],[270,1,271,1],[270,2,271,2],[270,3,271,3],[270,4,271,4],[270,5,271,5],[270,6,270,7],[270,8,270,9]]}
[]
[]
[]
["UNIDADE ESCOLAR",null,null,null,null,null,null,"CÓDIGO INEP"]
[{"$f":"Orçamento!$O$4","v":"COLÉGIO ESTADUAL PROFESSOR HELI ALVES FERREIRA"},null,null,null,null,null,null,{"$f":"Orçamento!$V$4","v":52020487}]
[]
["OBRA",null,null,null,null,null,null,"CIDADE"]
[{"$f":"Orçamento!$O$7","v":"REFORMA E AMPLIAÇÃO"},null,null,null,null,null,null,{"$f":"Orçamento!$V$7","v":"ANÁPOLIS"}]
[]
["CRE",null,null,"ENDEREÇO",null,null,null,"REFERÊNCIA AGETOP"]
[{"$f":"Orçamento!$O$10","v":"ANÁPOLIS"},null,null,{"$f":"Orçamento!$R$10","v":"RUA LOPO DE SOUZA RAMOS S/N PÇA MAJOR HENRIQUE, JUNDIAI, CEP:75110-410"},null,null,null,{"$f":"Orçamento!$V$10","v":"DEZ/18"},{"$f":"Orçamento!$W$10","v":"DESONERADA"}]
[]
["DATA",null,null,"ÁREA TOTAL CONSTRUÍDA (M²)",null,null,null,"REFERÊNCIA SINAPI"]
[{"$f":"Orçamento!$S$7","v":"2020-04-08"},null,null,{"$f":"Orçamento!$S$13","v":1589.09},null,null,null,{"$f":"Orçamento!$V$13","v":"MAR/19"},{"$f":"Orçamento!$W$13","v":"DESONERADA"}]
[]
["COMPOSIÇÕES DE CUSTOS UNITÁRIOS - SEE-GO"]
[24,"FONTE","CÓDIGO","DESCRIÇÃO","UNIDADE","COEFIC.","CUSTO UNITÁRIO",null,"CUSTO  TOTAL (A) + (B) + (C) + (D) + (E)"]
[null,null,null,null,null,null,"DESONERADO","NÃO DESONER.","DESONERADO","NÃO DESONER."]
[null,"COMPOSIÇÃO","COMP 024_SEE","SINALIZADOR FOTOLUMINESCENTE PARA EXTINTOR","UN ",null,"-","-",25.269999999999996,25.389999999999997]
[null,"AGETOP_I",5,"SERVENTE","h     ",0.09,8.1999999999999993,9.51,0.74,0.86]
[null,null,null,"","",null,0,0,0,0]
[null,null,null,"","",null,0,0,0,0]
[null,"MÃO DE OBRA (B) - TOTAL",null,null,null,null,null,null,0.74,0.86]
[null,"AGETOP_I",3070,"BUCHA DE NYLON S-6","un",2,0.04,0.04,0.08,0.08]
[null,"AGETOP_I",3393,"PARAFUSO P/BUCHA S-6","un",2,0.08,0.08,0.16,0.16]
[null,"SINAPI_I",37556,"PLACA DE SINALIZACAO DE SEGURANCA CONTRA INCENDIO, FOTOLUMINESCENTE, QUADRADA, *20 X 20* CM, EM PVC *2* MM ANTI-CHAMAS (SIMBOLOS, CORES E PICTOGRAMAS CONFORME NBR 13434)","UN    ",1,24.29,24.29,24.29,24.29]
[null,"MATERIAL (C) - TOTAL",null,null,null,null,null,null,24.529999999999998,24.529999999999998]
[]
[25,"FONTE","CÓDIGO","DESCRIÇÃO","UNIDADE","COEFIC.","CUSTO UNITÁRIO",null,"CUSTO  TOTAL (A) + (B) + (C) + (D) + (E)"]
[null,null,null,null,null,null,"DESONERADO","NÃO DESONER.","DESONERADO","NÃO DESONER."]
[null,"COMPOSIÇÃO","COMP 025_SEE","SINALIZADOR FOTOLUMINESCENTE DE EMERGÊNCIA","UN ",null,"-","-",25.269999999999996,25.389999999999997]
[null,"AGETOP_I",5,"SERVENTE","h     ",0.09,8.1999999999999993,9.51,0.74,0.86]
[null,"MÃO DE OBRA (B) - TOTAL",null,null,null,null,null,null,0.74,0.86]
[null,"AGETOP_I",3070,"BUCHA DE NYLON S-6","un",2,0.04,0.04,0.08,0.08]
[null,"AGETOP_I",3393,"PARAFUSO P/BUCHA S-6","un",2,0.08,0.08,0.16,0.16]
[null,"SINAPI_I",37556,"PLACA DE SINALIZACAO DE SEGURANCA CONTRA INCENDIO, FOTOLUMINESCENTE, QUADRADA, *20 X 20* CM, EM PVC *2* MM ANTI-CHAMAS (SIMBOLOS, CORES E PICTOGRAMAS CONFORME NBR 13434)","UN    ",1,24.29,24.29,24.29,24.29]
[null,"MATERIAL (C) - TOTAL",null,null,null,null,null,null,24.529999999999998,24.529999999999998]
[]
[277,"FONTE","CÓDIGO","DESCRIÇÃO","UNIDADE","COEFIC.","CUSTO UNITÁRIO",null,"CUSTO  TOTAL (A) + (B) + (C) + (D) + (E)"]
[null,null,null,null,null,null,"DESONERADO","NÃO DESONER.","DESONERADO","NÃO DESONER."]
[null,"COMPOSIÇÃO","COMP 277_SEE","MARCAÇÃO NO PISO - 1X1 M PARA EXTINTOR","M2",null,null,null,27.719999999999995,27.799999999999997]
[null,"AGETOP_I",5,"SERVENTE","h     ",3.3300000000000003E-2,8.1999999999999993,9.51,0.27,0.32]
[null,null,null,"","",null,0,0,0,0]
[null,null,null,"","",null,0,0,0,0]
[null,"MÃO DE OBRA (B) - TOTAL",null,null,null,null,null,null,0.27,0.32]
[null,"SINAPI_I",5318,"SOLVENTE DILUENTE A BASE DE AGUARRAS","L     ",0.13,10.98,10.98,1.43,1.43]
[null,"SINAPI",5824,"CAMINHÃO TOCO, PBT 16.000 KG, CARGA ÚTIL MÁX. 10.685 KG, DIST. ENTRE EIXOS 4,8 M, POTÊNCIA 189 CV, INCLUSIVE CARROCERIA FIXA ABERTA DE MADEIRA P/ TRANSPORTE GERAL DE CARGA SECA, DIMEN. APROX. 2,5 X 7,00 X 0,50 M - CHP DIURNO. AF_06/2014","CHP",3.3E-3,135.91999999999999,139.13,0.45,0.46]
[null,"SINAPI_I",7343,"TINTA A BASE DE RESINA ACRILICA, PARA SINALIZACAO HORIZONTAL VIARIA (NBR 11862)","L     ",0.6,11.69,11.69,7.01,7.01]
[null,"SINAPI_I",7348,"TINTA ACRILICA PREMIUM PARA PISO","L     ",0.03,12.39,12.39,0.37,0.37]
[null,"SINAPI_I",25972,"MICROESFERAS DE VIDRO PARA SINALIZACAO HORIZONTAL VIARIA, TIPO I-B (PREMIX) - NBR 16184","KG    ",2.14,8.33,8.33,17.829999999999998,17.829999999999998]
[null,"SINAPI",95133,"MÁQUINA DEMARCADORA DE FAIXA DE TRÁFEGO À FRIO, AUTOPROPELIDA, POTÊNCIA 38 HP - CHP DIURNO. AF_07/2016","CHP",3.3E-3,110.07,113.65,0.36,0.38]
[null,"MATERIAL (C) - TOTAL",null,null,null,null,null,null,27.449999999999996,27.479999999999997]
[]
[382,"FONTE","CÓDIGO","DESCRIÇÃO","UNIDADE","COEFIC.","CUSTO UNITÁRIO",null,"CUSTO  TOTAL (A) + (B) + (C) + (D) + (E)"]
[null,null,null,null,null,null,"DESONERADO","NÃO DESONER.","DESONERADO","NÃO DESONER."]
[null,"COMPOSIÇÃO","COMP 382_SEE","TE DE REDUCAO DE FERRO GALVANIZADO, COM ROSCA BSP, DE 3/4\" X 1/2\"","UN ",null,null,null,21.83,23.92]
[null,"AGETOP_I",8,"AJUDANTE","h     ",0.6,8.1999999999999993,9.51,4.92,5.71]
[null,"AGETOP_I",11,"ENCANADOR","h     ",0.61050000000000004,13.4,15.53,8.18,9.48]
[null,null,null,"","",null,0,0,0,0]
[null,"MÃO DE OBRA (B) - TOTAL",null,null,null,null,null,null,13.1,15.190000000000001]
[null,"SINAPI_I",3146,"FITA VEDA ROSCA EM ROLOS DE 18 MM X 10 M (L X C)","UN    ",0.12075471698113208,3.5,3.5,0.42,0.42]
[null,"SINAPI_I",6302,"TE DE REDUCAO DE FERRO GALVANIZADO, COM ROSCA BSP, DE 3/4\" X 1/2\"","UN    ",1,8.31,8.31,8.31,8.31]
[null,null,null,"","",null,0,0,0,0]
[null,"MATERIAL (C) - TOTAL",null,null,null,null,null,null,8.73,8.73]
[]
[383,"FONTE","CÓDIGO","DESCRIÇÃO","UNIDADE","COEFIC.","CUSTO UNITÁRIO",null,"CUSTO  TOTAL (A) + (B) + (C) + (D) + (E)"]
[null,null,null,null,null,null,"DESONERADO","NÃO DESONER.","DESONERADO","NÃO DESONER."]
[null,"COMPOSIÇÃO","COMP 383_SEE","BUCHA DE REDUCAO DE FERRO GALVANIZADO, COM ROSCA BSP, DE 1/2\" X 1/4\"","UN ",null,null,null,6.85,7.4]
[null,"AGETOP_I",8,"AJUDANTE","h     ",0.16,8.1999999999999993,9.51,1.31,1.52]
[null,"AGETOP_I",11,"ENCANADOR","h     ",0.16,13.4,15.53,2.14,2.48]
[null,null,null,"","",null,0,0,0,0]
[null,"MÃO DE OBRA (B) - TOTAL",null,null,null,null,null,null,3.45,4]
[null,"AGETOP_I","H689","FITA VEDAROSCA 12 MM","m",1.2,0.28000000000000003,0.28000000000000003,0.34,0.34]
[null,"SINAPI_I",770,"BUCHA DE REDUCAO DE FERRO GALVANIZADO, COM ROSCA BSP, DE 1/2\" X 1/4\"","UN    ",1,3.06,3.06,3.06,3.06]
[null,null,null,"","",null,0,0,0,0]
[null,"MATERIAL (C) - TOTAL",null,null,null,null,null,null,3.4,3.4]
[]
[212,"FONTE","CÓDIGO","DESCRIÇÃO","UNIDADE","COEFIC.","CUSTO UNITÁRIO",null,"CUSTO  TOTAL (A) + (B) + (C) + (D) + (E)"]
[null,null,null,null,null,null,"DESONERADO","NÃO DESONER.","DESONERADO","NÃO DESONER."]
[null,"COMPOSIÇÃO","COMP 212_SEE","NIPLE DE REDUÇÃO 1/2\" X 1/4\" BSP","UN ",null,null,null,9.5,10.050000000000001]
[null,"AGETOP_I",8,"AJUDANTE","h     ",0.16,8.1999999999999993,9.51,1.31,1.52]
[null,"AGETOP_I",11,"ENCANADOR","h     ",0.16,13.4,15.53,2.14,2.48]
[null,null,null,"","",null,0,0,0,0]
[null,"MÃO DE OBRA (B) - TOTAL",null,null,null,null,null,null,3.45,4]
[null,"COTAÇÃO","COT 103_SEE","NIPLE DE REDUÇÃO 1/2\" X 1/4\" BSP","UN",1,6.0533333333333337,6.0533333333333337,6.05,6.05]
[null,null,null,"","",null,0,0,0,0]
[null,null,null,"","",null,0,0,0,0]
[null,"MATERIAL (C) - TOTAL",null,null,null,null,null,null,6.05,6.05]
[]
[213,"FONTE","CÓDIGO","DESCRIÇÃO","UNIDADE","COEFIC.","CUSTO UNITÁRIO",null,"CUSTO  TOTAL (A) + (B) + (C) + (D) + (E)"]
[null,null,null,null,null,null,"DESONERADO","NÃO DESONER.","DESONERADO","NÃO DESONER."]
[null,"COMPOSIÇÃO","COMP 213_SEE","NIPLE DE REDUÇÃO 3/4\" X 1/2\" BSP","UN ",null,null,null,13.16,13.71]
[null,"AGETOP_I",8,"AJUDANTE","h     ",0.16,8.1999999999999993,9.51,1.31,1.52]
[null,"AGETOP_I",11,"ENCANADOR","h     ",0.16,13.4,15.53,2.14,2.48]
[null,null,null,"","",null,0,0,0,0]
[null,"MÃO DE OBRA (B) - TOTAL",null,null,null,null,null,null,3.45,4]
[null,"COTAÇÃO","COT 104_SEE","NIPLE DE REDUÇÃO 3/4\" X 1/2\" BSP","UN",1,9.7099999999999991,9.7099999999999991,9.7100000000000009,9.7100000000000009]
[null,null,null,"","",null,0,0,0,0]
[null,null,null,"","",null,0,0,0,0]
[null,"MATERIAL (C) - TOTAL",null,null,null,null,null,null,9.7100000000000009,9.7100000000000009]
[]
[210,"FONTE","CÓDIGO","DESCRIÇÃO","UNIDADE","COEFIC.","CUSTO UNITÁRIO",null,"CUSTO  TOTAL (A) + (B) + (C) + (D) + (E)"]
[null,null,null,null,null,null,"DESONERADO","NÃO DESONER.","DESONERADO","NÃO DESONER."]
[null,"COMPOSIÇÃO","COMP 210_SEE","REGULADOR DE 1º ESTÁGIO 60KG/H MODELO AP-40  COM MANÔMETRO","UN ",null,null,null,231.21,235.17000000000002]
[null,"AGETOP_I",8,"AJUDANTE","h     ",1.1499999999999999,8.1999999999999993,9.51,9.43,10.94]
[null,"AGETOP_I",11,"ENCANADOR","h     ",1.1499999999999999,13.4,15.53,15.41,17.86]
[null,null,null,"","",null,0,0,0,0]
[null,"MÃO DE OBRA (B) - TOTAL",null,null,null,null,null,null,24.84,28.799999999999997]
[null,"COTAÇÃO","COT 101_SEE","REGULADOR DE 1º ESTÁGIO 60KG/H MODELO AP-40  COM MANÔMETRO","UN",1,205.57666666666668,205.57666666666668,205.58,205.58]
[null,"AGETOP_I","H689","FITA VEDAROSCA 12 MM","m",2.82,0.28000000000000003,0.28000000000000003,0.79,0.79]
[null,null,null,"","",null,0,0,0,0]
[null,"MATERIAL (C) - TOTAL",null,null,null,null,null,null,206.37,206.37]
[]
[235,"FONTE","CÓDIGO","DESCRIÇÃO","UNIDADE","COEFIC.","CUSTO UNITÁRIO",null,"CUSTO  TOTAL (A) + (B) + (C) + (D) + (E)"]
[null,null,null,null,null,null,"DESONERADO","NÃO DESONER.","DESONERADO","NÃO DESONER."]
[null,"COMPOSIÇÃO","COMP 235_SEE","PLACA DE SINALIZAÇÃO EM PVC COD 01 - (300X300) PROIBIDO FUMAR","UN ",null,null,null,25.269999999999996,25.389999999999997]
[null,"AGETOP_I",5,"SERVENTE","h     ",0.09,8.1999999999999993,9.51,0.74,0.86]
[null,null,null,"","",null,0,0,0,0]
[null,null,null,"","",null,0,0,0,0]
[null,"MÃO DE OBRA (B) - TOTAL",null,null,null,null,null,null,0.74,0.86]
[null,"AGETOP_I",3070,"BUCHA DE NYLON S-6","un",2,0.04,0.04,0.08,0.08]
[null,"AGETOP_I",3393,"PARAFUSO P/BUCHA S-6","un",2,0.08,0.08,0.16,0.16]
[null,"SINAPI_I",37556,"PLACA DE SINALIZACAO DE SEGURANCA CONTRA INCENDIO, FOTOLUMINESCENTE, QUADRADA, *20 X 20* CM, EM PVC *2* MM ANTI-CHAMAS (SIMBOLOS, CORES E PICTOGRAMAS CONFORME NBR 13434)","UN    ",1,24.29,24.29,24.29,24.29]
[null,"MATERIAL (C) - TOTAL",null,null,null,null,null,null,24.529999999999998,24.529999999999998]
[]
[236,"FONTE","CÓDIGO","DESCRIÇÃO","UNIDADE","COEFIC.","CUSTO UNITÁRIO",null,"CUSTO  TOTAL (A) + (B) + (C) + (D) + (E)"]
[null,null,null,null,null,null,"DESONERADO","NÃO DESONER.","DESONERADO","NÃO DESONER."]
[null,"COMPOSIÇÃO","COMP 236_SEE","PLACA DE SINALIZAÇÃO EM PVC COD 06 - (300X300) PERIGO INFLAMÁVEL","UN ",null,null,null,25.269999999999996,25.389999999999997]
[null,"AGETOP_I",5,"SERVENTE","h     ",0.09,8.1999999999999993,9.51,0.74,0.86]
[null,null,null,"","",null,0,0,0,0]
[null,null,null,"","",null,0,0,0,0]
[null,"MÃO DE OBRA (B) - TOTAL",null,null,null,null,null,null,0.74,0.86]
[null,"AGETOP_I",3070,"BUCHA DE NYLON S-6","un",2,0.04,0.04,0.08,0.08]
[null,"AGETOP_I",3393,"PARAFUSO P/BUCHA S-6","un",2,0.08,0.08,0.16,0.16]
[null,"SINAPI_I",37556,"PLACA DE SINALIZACAO DE SEGURANCA CONTRA INCENDIO, FOTOLUMINESCENTE, QUADRADA, *20 X 20* CM, EM PVC *2* MM ANTI-CHAMAS (SIMBOLOS, CORES E PICTOGRAMAS CONFORME NBR 13434)","UN    ",1,24.29,24.29,24.29,24.29]
[null,"MATERIAL (C) - TOTAL",null,null,null,null,null,null,24.529999999999998,24.529999999999998]
[]
[334,"FONTE","CÓDIGO","DESCRIÇÃO","UNIDADE","COEFIC.","CUSTO UNITÁRIO",null,"CUSTO  TOTAL (A) + (B) + (C) + (D) + (E)"]
[null,null,null,null,null,null,"DESONERADO","NÃO DESONER.","DESONERADO","NÃO DESONER."]
[null,"COMPOSIÇÃO","COMP 334_SEE","ALVENARIA DE BLOCO DE CONCRETO ESTRUTURAL 14X19X39, FBK 4,5MPA","M2",null,null,null,60.5,63.4]
[null,"AGETOP_I",4,"PEDREIRO","h     ",0.86,13.4,15.53,11.52,13.36]
[null,"AGETOP_I",5,"SERVENTE","h     ",0.65,8.1999999999999993,9.51,5.33,6.18]
[null,null,null,"","",null,0,0,0,0]
[null,"MÃO DE OBRA (B) - TOTAL",null,null,null,null,null,null,16.850000000000001,19.54]
[null,"SINAPI",88715,"ARGAMASSA TRAÇO 1:2:9 (CIMENTO, CAL E AREIA MÉDIA) PARA EMBOÇO/MASSA ÚNICA/ASSENTAMENTO DE ALVENARIA DE VEDAÇÃO, PREPARO MECÂNICO COM BETONEIRA 400 L. AF_09/2014","M3",1.6400000000000001E-2,383.52,396.23,6.29,6.5]
[null,"SINAPI_I",25070,"BLOCO CONCRETO ESTRUTURAL 14 X 19 X 39 CM, FBK 4,5 MPA (NBR 6136)","UN    ",9.5299999999999994,2.4900000000000002,2.4900000000000002,23.73,23.73]
[null,"SINAPI_I",34547,"TELA DE ACO SOLDADA GALVANIZADA/ZINCADA PARA ALVENARIA, FIO  D = *1,20 A 1,70* MM, MALHA 15 X 15 MM, (C X L) *50 X 12* CM","M     ",0.39500000000000002,2.23,2.23,0.88,0.88]
[null,"SINAPI_I",38594,"MEIO BLOCO CONCRETO ESTRUTURAL 14 X 19 X 34 CM, FBK 14 MPA (NBR 6136)","UN    ",1.47,3.15,3.15,4.63,4.63]
[null,"SINAPI_I",38591,"BLOCO CONCRETO ESTRUTURAL 14 X 19 X 34 CM, FBK 4,5 MPA (NBR 6136)","UN    ",0.73,2.46,2.46,1.8,1.8]
[null,"SINAPI_I",38595,"MEIA CANALETA CONCRETO ESTRUTURAL 14 X 19 X 19 CM, FBK 4,5 MPA (NBR 6136)","UN    ",0.12,1.51,1.51,0.18,0.18]
[null,"SINAPI_I",38597,"CANALETA CONCRETO ESTRUTURAL 14 X 19 X 39 CM, FBK 4,5 MPA (NBR 6136)","UN    ",2.2000000000000002,2.79,2.79,6.14,6.14]
[null,"MATERIAL (C) - TOTAL",null,null,null,null,null,null,43.65,43.86]
[]
[7,"FONTE","CÓDIGO","DESCRIÇÃO","UNIDADE","COEFIC.","CUSTO UNITÁRIO",null,"CUSTO  TOTAL (A) + (B) + (C) + (D) + (E)"]
[null,null,null,null,null,null,"DESONERADO","NÃO DESONER.","DESONERADO","NÃO DESONER."]
[null,"COMPOSIÇÃO","COMP 007_SEE","GUICHÊ CANTONEIRA/GRADE PARA VIDRO","M²","-","-","-",227.51,234.15]
[null,"AGETOP_I",4,"PEDREIRO","h     ",2.5,13.4,15.53,33.5,38.83]
[null,"AGETOP_I",5,"SERVENTE","h     ",1,8.1999999999999993,9.51,8.1999999999999993,9.51]
[null,"MÃO DE OBRA (B) - TOTAL",null,null,null,null,null,null,41.7,48.339999999999996]
[null,"AGETOP_I",104,"AREIA MEDIA ","m3",9.7000000000000003E-3,82.85,82.85,0.8,0.8]
[null,"AGETOP_I",1221,"CAL HIDRATADA","Kg",0.73,0.54,0.54,0.39,0.39]
[null,"AGETOP_I",1215,"CIMENTO PORTLAND C.P. 32","Kg",2.67,0.39,0.39,1.04,1.04]
[null,"AGETOP_I",2470,"FERRO CANTONEIRA 1/8\" X 7/8\"","Kg",3.5478000000000001,4.3899999999999997,4.3899999999999997,15.57,15.57]
[null,"AGETOP_I",2423,"FERRO CANTONEIRA 1/8\" X 3/4\"","Kg",7.9390000000000001,4.87,4.87,38.659999999999997,38.659999999999997]
[null,"AGETOP_I",2372,"CHAPA PERFILADA No. 18","Kg",13.320600000000001,5.42,5.42,72.2,72.2]
[null,"SINAPI_I",11552,"PERFIL U / CANALETA DE ALUMINIO, DE ABAS IGUAIS, 1/2\" (1,27 X 1,27 CM), PARA PORTA OU JANELA DE CORRER","M     ",1.306,7.72,7.72,10.08,10.08]
[null,"AGETOP_I",2898,"FABRICAÇÃO / MONTAGEM","un",1,36.729999999999997,36.729999999999997,36.729999999999997,36.729999999999997]
[null,"AGETOP_I",2529,"FECHO FIO REDONDO 4\" ZINCADO C/PARAFUSO DA SOPRANO OU EQUIVALENTE","un",2,5.17,5.17,10.34,10.34]
[null,"MATERIAL (C) - TOTAL",null,null,null,null,null,null,185.81,185.81]
[]
[84,"FONTE","CÓDIGO","DESCRIÇÃO","UNIDADE","COEFIC.","CUSTO UNITÁRIO",null,"CUSTO  TOTAL (A) + (B) + (C) + (D) + (E)"]
[null,null,null,null,null,null,"DESONERADO","NÃO DESONER.","DESONERADO","NÃO DESONER."]
[null,"COMPOSIÇÃO","COMP 084_SEE","GUARDA-CORPO COM CORRIMÃO - SEDUC","M",null,null,null,204.60000000000002,209.46]
[null,"AGETOP_I",25,"OFICIAL \"B\"","h     ",1.1000000000000001,13.4,15.53,14.74,17.079999999999998]
[null,"AGETOP_I",8,"AJUDANTE","h     ",1.1000000000000001,8.1999999999999993,9.51,9.02,10.46]
[null,null,null,"","",null,0,0,0,0]
[null,"MÃO DE OBRA (B) - TOTAL",null,null,null,null,null,null,23.759999999999998,27.54]
[null,"AGETOP_I",2376,"TUBO INDUSTRIAL 2\" CHAPA 13 ","Kg",7.7778,5.23,5.23,40.68,40.68]
[null,"AGETOP_I",2504,"TUBO INDUSTRIAL D=25 MM CHAPA 13 ","Kg",4.6319999999999997,5.07,5.07,23.48,23.48]
[null,"AGETOP_I",2377,"TUBO INDUSTRIAL 40X40 CH.13","Kg",6.3419999999999996,5.07,5.07,32.15,32.15]
[null,"AGETOP_I",2421,"TUBO INDUSTRIAL 1.1/2\" CHAPA 13 ","Kg",1.4862,5.07,5.07,7.54,7.54]
[null,"AGETOP_I",2417,"MASSA PLASTICA","Kg",0.2041,10.58,10.58,2.16,2.16]
[null,"AGETOP_I",2246,"ELETRODO 2.5 OK","Kg",0.11459999999999999,8.6999999999999993,8.6999999999999993,1,1]
[null,"AGETOP_I",1672,"LIXA PARA FERRO ( NÚMERO 100 )","un",0.25509999999999999,2.12,2.12,0.54,0.54]
[null,"AGETOP_I",1264,"DISCO DE DESBASTE 7/8\" P/ CONC./FERRO (1/4\" X 7\")","un",5.0999999999999997E-2,7,7,0.36,0.36]
[null,"AGETOP_I",1334,"DISCO DE CORTE DIAM. 5/8\"- 10\"","un",0.373,5.5,5.5,2.0499999999999998,2.0499999999999998]
[null,"AGETOP_I",2902,"FABRICAÇÃO / MONTAGEM","un",1,50.44,50.44,50.44,50.44]
[null,"AGETOP_I",2150,"CHAPA DE FERRO DOBRADA No.13","Kg",0.43519999999999998,5.28,5.28,2.2999999999999998,2.2999999999999998]
[null,"AGETOP_I",2719,"CHAPA PERFILADA 3/16\"","Kg",1.0979999999999999,5.04,5.04,5.53,5.53]
[null,"AGETOP_I",2436,"ACO CA-25 - 6,3 MM (1/4\") - BARRA LISA A-36","Kg",0.38124999999999998,5.13,5.13,1.96,1.96]
[null,"AGETOP",261602,"PINT.ESMALTE/ESQUAD.FERRO C/FUNDO ANTICOR.","m2    ",0.78,13.65,15.04,10.65,11.73]
[null,"MATERIAL (C) - TOTAL",null,null,null,null,null,null,180.84000000000003,181.92000000000002]
[]
[387,"FONTE","CÓDIGO","DESCRIÇÃO","UNIDADE","COEFIC.","CUSTO UNITÁRIO",null,"CUSTO  TOTAL (A) + (B) + (C) + (D) + (E)"]
[null,null,null,null,null,null,"DESONERADO","NÃO DESONER.","DESONERADO","NÃO DESONER."]
[null,"COMPOSIÇÃO","COMP 387_SEE","LÂMPADA LED TUBULAR 18W ","UN ",null,null,null,22.28,22.330000000000002]
[null,"AGETOP_I",8,"AJUDANTE","h     ",1.4999999999999999E-2,8.1999999999999993,9.51,0.12,0.14000000000000001]
[null,"AGETOP_I",12,"ELETRICISTA","h     ",1.4999999999999999E-2,13.4,15.53,0.2,0.23]
[null,null,null,"","",null,0,0,0,0]
[null,"MÃO DE OBRA (B) - TOTAL",null,null,null,null,null,null,0.32,0.37]
[null,"COTAÇÃO","COT 195_SEE","LÂMPADA LED TUBULAR 18W ","UN",1,21.959999999999997,21.959999999999997,21.96,21.96]
[null,null,null,"","",null,0,0,0,0]
[null,null,null,"","",null,0,0,0,0]
[null,"MATERIAL (C) - TOTAL",null,null,null,null,null,null,21.96,21.96]
[]
[554,"FONTE","CÓDIGO","DESCRIÇÃO","UNID ","COEFIC.","CUSTO UNITÁRIO",null,"CUSTO  TOTAL (A) + (B) + (C) + (D) + (E)"]
[null,null,null,null,null,null,"DESONERADO","NÃO DESONER.","DESONERADO","NÃO DESONER."]
[null,"COMPOSIÇÃO","COMP 554_SEE","CAIXA DE DECANTAÇÃO","UN ","-","-","-",684.7,727.93000000000006]
[null,"AGETOP",81840,"TAMPA  PARA CAIXA PASSAGEM FERRO FUNDIDO T-33 - TRÁFEGO LEVE","Un    ",1,113.84,116.18,113.84,116.18]
[null,"AGETOP",81938,"JOELHO 90 GRAUS DIAMETRO 100 MM","Un    ",1,15.13,16.68,15.13,16.68]
[null,"AGETOP",82235,"TE SANITARIO DIAMETRO 100 X 100 MM","Un    ",1,24.94,26.52,24.94,26.52]
[null,"AGETOP",82304,"TUBO SOLDAVEL P/ESGOTO DIAM. 100 MM","m     ",3,20.45,22.25,61.35,66.75]
[null,"AGETOP",100102,"ALVENARIA DE TIJOLO COMUM 1/2 VEZ - ARG. (1CI : 2CH : 8ARML)","m2    ",8,56.53,60.45,452.24,483.6]
[null,"AGETOP",220050,"LASTRO DE CONCRETO REGULARIZADO SEM IMPERMEAB. 1:3:6 ESP= 5CM (BASE)","m2    ",1,17.2,18.2,17.2,18.2]
[null,"MÃO DE OBRA (B) - TOTAL",null,null,null,null,null,null,684.7,727.93000000000006]
[null,null,null,"","",null,0,0,0,0]
[null,null,null,"","",null,0,0,0,0]
[null,null,null,"","",null,0,0,0,0]
[null,"MATERIAL (C) - TOTAL",null,null,null,null,null,null,0,0]
[]
[541,"FONTE","CÓDIGO","DESCRIÇÃO","UNIDADE","COEFIC.","CUSTO UNITÁRIO",null,"CUSTO  TOTAL (A) + (B) + (C) + (D) + (E)"]
[null,null,null,null,null,null,"DESONERADO","NÃO DESONER.","DESONERADO","NÃO DESONER."]
[null,"COMPOSIÇÃO","COMP 541_SEE","BANCADA DE GRANITO CINZA POLIDO - FORNECIMENTO E INSTALAÇÃO. ","M2    ",null,null,null,481.96,486.81999999999994]
[null,"SINAPI",88274,"MARMORISTA/GRANITEIRO COM ENCARGOS COMPLEMENTARES","H",1.6555555555555557,17.329999999999998,19.38,28.69,32.08]
[null,"SINAPI",88316,"SERVENTE COM ENCARGOS COMPLEMENTARES","H",1.088888888888889,12.83,14.18,13.97,15.44]
[null,null,null,"","",null,0,0,0,0]
[null,"MÃO DE OBRA (B) - TOTAL",null,null,null,null,null,null,42.660000000000004,47.519999999999996]
[null,"SINAPI_I",4823,"MASSA PLASTICA PARA MARMORE/GRANITO","KG    ",0.58088888888888901,28.73,28.73,16.690000000000001,16.690000000000001]
[null,"SINAPI_I",7568,"BUCHA DE NYLON SEM ABA S10, COM PARAFUSO DE 6,10 X 65 MM EM ACO ZINCADO COM ROSCA SOBERBA, CABECA CHATA E FENDA PHILLIPS","UN    ",6.666666666666667,0.49,0.49,3.27,3.27]
[null,"SINAPI_I",11795,"GRANITO PARA BANCADA, POLIDO, TIPO ANDORINHA/ QUARTZ/ CASTELO/ CORUMBA OU OUTROS EQUIVALENTES DA REGIAO, E=  *2,5* CM","M2    ",1.1166666666666667,305.66000000000003,305.66000000000003,341.32,341.32]
[null,"SINAPI_I",37329,"REJUNTE EPOXI BRANCO","KG    ",3.9E-2,39.869999999999997,39.869999999999997,1.55,1.55]
[null,"SINAPI_I",37591,"SUPORTE MAO-FRANCESA EM ACO, ABAS IGUAIS 40 CM, CAPACIDADE MINIMA 70 KG, BRANCO","UN    ",2.2222222222222223,34.409999999999997,34.409999999999997,76.47,76.47]
[null,"MATERIAL (C) - TOTAL",null,null,null,null,null,null,439.29999999999995,439.29999999999995]
[]
[46,"FONTE","CÓDIGO","DESCRIÇÃO","UNIDADE","COEFIC.","CUSTO UNITÁRIO",null,"CUSTO  TOTAL (A) + (B) + (C) + (D) + (E)"]
[null,null,null,null,null,null,"DESONERADO","NÃO DESONER.","DESONERADO","NÃO DESONER."]
[null,"COMPOSIÇÃO",{"$f":"CONCATENATE(LEFT(B237,4),\" \",TEXT(A235,\"000\"),\"_SEE\")","v":"COMP 046_SEE"},"CAPUZ PARA PROTEÇÃO DOS PARA RAIOS","UN ",null,null,null,16.53,16.650000000000002]
[null,"AGETOP_I",8,"AJUDANTE","h     ",3.3300000000000003E-2,8.1999999999999993,9.51,0.27,0.32]
[null,"AGETOP_I",12,"ELETRICISTA","h     ",3.3300000000000003E-2,13.4,15.53,0.45,0.52]
[null,null,null,{"$f":"IFERROR(VLOOKUP(C240,INDIRECT(B240),2,FALSE()),\"\")","v":""},"",null,0,0,0,0]
[null,"MÃO DE OBRA (B) - TOTAL",null,null,null,null,null,null,0.72,0.84000000000000008]
[null,"COTAÇÃO","COT 010_SEE","CAPUZ PARA PROTEÇÃO DOS PARA RAIOS","UN ",1,15.81,15.81,15.81,15.81]
[null,null,null,"","",null,0,0,0,0]
[null,null,null,"","",null,0,0,0,0]
[null,"MATERIAL (C) - TOTAL",null,null,null,null,null,null,15.81,15.81]
[]
[47,"FONTE","CÓDIGO","DESCRIÇÃO","UNIDADE","COEFIC.","CUSTO UNITÁRIO",null,"CUSTO  TOTAL (A) + (B) + (C) + (D) + (E)"]
[null,null,null,null,null,null,"DESONERADO","NÃO DESONER.","DESONERADO","NÃO DESONER."]
[null,"COMPOSIÇÃO","COMP 047_SEE","CAPUZ DE PROTEÇÃO PARA BUCHA DE TRANSFORMADOR","UN ",null,null,null,16.53,16.650000000000002]
[null,"AGETOP_I",8,"AJUDANTE","h     ",3.3300000000000003E-2,8.1999999999999993,9.51,0.27,0.32]
[null,"AGETOP_I",12,"ELETRICISTA","h     ",3.3300000000000003E-2,13.4,15.53,0.45,0.52]
[null,null,null,"","",null,0,0,0,0]
[null,"MÃO DE OBRA (B) - TOTAL",null,null,null,null,null,null,0.72,0.84000000000000008]
[null,"COTAÇÃO","COT 011_SEE","CAPUZ DE PROTEÇÃO PARA BUCHA DE TRANSFORMADOR","UN ",1,15.81,15.81,15.81,15.81]
[null,null,null,"","",null,0,0,0,0]
[null,null,null,"","",null,0,0,0,0]
[null,"MATERIAL (C) - TOTAL",null,null,null,null,null,null,15.81,15.81]
[]
[48,"FONTE","CÓDIGO","DESCRIÇÃO","UNIDADE","COEFIC.","CUSTO UNITÁRIO",null,"CUSTO  TOTAL (A) + (B) + (C) + (D) + (E)"]
[null,null,null,null,null,null,"DESONERADO","NÃO DESONER.","DESONERADO","NÃO DESONER."]
[null,"COMPOSIÇÃO","COMP 048_SEE","HASTE ROSQUEADA \"TIRANTE\" 3/8\"","M",null,null,null,14.02,15.39]
[null,"AGETOP_I",8,"AJUDANTE","h     ",0.4,8.1999999999999993,9.51,3.28,3.8]
[null,"AGETOP_I",12,"ELETRICISTA","h     ",0.4,13.4,15.53,5.36,6.21]
[null,null,null,"","",null,0,0,0,0]
[null,"MÃO DE OBRA (B) - TOTAL",null,null,null,null,null,null,8.64,10.01]
[null,"COTAÇÃO","COT 012_SEE","HASTE ROSQUEADA \"TIRANTE\" 3/8\"","M",1,5.3833333333333329,5.3833333333333329,5.38,5.38]
[null,null,null,"","",null,0,0,0,0]
[null,null,null,"","",null,0,0,0,0]
[null,"MATERIAL (C) - TOTAL",null,null,null,null,null,null,5.38,5.38]
[]
[49,"FONTE","CÓDIGO","DESCRIÇÃO","UNIDADE","COEFIC.","CUSTO UNITÁRIO",null,"CUSTO  TOTAL (A) + (B) + (C) + (D) + (E)"]
[null,null,null,null,null,null,"DESONERADO","NÃO DESONER.","DESONERADO","NÃO DESONER."]
[null,"COMPOSIÇÃO","COMP 049_SEE","PORCA SEXTAVADA 3/8\"","UN ",null,null,null,0.2,0.22]
[null,"AGETOP_I",8,"AJUDANTE","h     ",8.9999999999999993E-3,8.1999999999999993,9.51,7.0000000000000007E-2,0.09]
[null,null,null,"","",null,0,0,0,0]
[null,null,null,"","",null,0,0,0,0]
[null,"MÃO DE OBRA (B) - TOTAL",null,null,null,null,null,null,7.0000000000000007E-2,0.09]
[null,"COTAÇÃO","COT 013_SEE","PORCA SEXTAVADA 3/8\"","UN ",1,0.13,0.13,0.13,0.13]
[null,null,null,"","",null,0,0,0,0]
[null,null,null,"","",null,0,0,0,0]
[null,"MATERIAL (C) - TOTAL",null,null,null,null,null,null,0.13,0.13]

{"sheet":"Cotações","index":8,"n_rows":103,"n_cols":9,"rows_kept":103,"cut":false,"hidden":false,"merged":[[9,0,9,2],[9,3,9,6],[9,7,9,8],[10,0,10,2],[10,3,10,6],[10,8,10,9],[14,0,14,8],[15,0,15,9],[11,0,11,9],[12,0,12,2],[12,3,12,6],[12,7,12,8],[13,0,13,2],[13,3,13,6],[13,8,13,9],[8,0,8,8],[0,0,0,8],[1,0,1,9],[2,0,2,8],[3,0,3,6],[3,7,3,9],[4,0,4,6],[4,7,4,9],[5,0,5,8],[6,0,6,6],[6,7,6,9],[7,0,7,6],[7,7,7,9],[16,7,17,8],[18,7,18,8],[19,3,19,4],[19,5,19,6],[19,7,19,8],[16,1,17,1],[16,2,17,2],[16,3,17,3],[16,4,17,4],[16,5,16,6],[23,3,23,4],[23,7,23,8],[24,3,24,4],[24,7,24,8],[25,3,25,8],[20,3,20,4],[20,7,20,8],[21,3,21,4],[21,7,21,8],[22,3,22,4],[22,7,22,8],[27,7,28,8],[29,7,29,8],[30,3,30,4],[30,5,30,6],[30,7,30,8],[27,1,28,1],[27,2,28,2],[27,3,28,3],[27,4,28,4],[27,5,27,6],[34,3,34,4],[34,7,34,8],[35,3,35,4],[35,7,35,8],[36,3,36,8],[31,3,31,4],[31,7,31,8],[32,3,32,4],[32,7,32,8],[33,3,33,4],[33,7,33,8],[38,7,39,8],[40,7,40,8],[41,3,41,4],[41,5,41,6],[41,7,41,8],[38,1,39,1],[38,2,39,2],[38,3,39,3],[38,4,39,4],[38,5,38,6],[45,3,45,4],[45,7,45,8],[46,3,46,4],[46,7,46,8],[47,3,47,8],[42,3,42,4],[42,7,42,8],[43,3,43,4],[43,7,43,8],[44,3,44,4],[44,7,44,8],[49,7,50,8],[51,7,51,8],[52,3,52,4],[52,5,52,6],[52,7,52,8],[49,1,50,1],[49,2,50,2],[49,3,50,3],[49,4,50,4],[49,5,49,6],[56,3,56,4],[56,7,56,8],[57,3,57,4],[57,7,57,8],[58,3,58,8],[53,3,53,4],[53,7,53,8],[54,3,54,4],[54,7,54,8],[55,3,55,4],[55,7,55,8],[60,1,61,1],[60,2,61,2],[60,3,61,3],[60,4,61,4],[60,5,60,6],[60,7,61,8],[62,7,62,8],[63,3,63,4],[63,5,63,6],[63,7,63,8],[64,3,64,4],[64,7,64,8],[65,3,65,4],[65,7,65,8],[66,3,66,4],[66,7,66,8],[67,3,67,4],[67,7,67,8],[68,3,68,4],[68,7,68,8],[69,3,69,8],[71,1,72,1],[71,2,72,2],[71,3,72,3],[71,4,72,4],[71,5,71,6],[71,7,72,8],[73,7,73,8],[74,3,74,4],[74,5,74,6],[74,7,74,8],[75,3,75,4],[75,7,75,8],[76,3,76,4],[76,7,76,8],[77,3,77,4],[77,7,77,8],[78,3,78,4],[78,7,78,8],[79,3,79,4],[79,7,79,8],[80,3,80,8],[82,1,83,1],[82,2,83,2],[82,3,83,3],[82,4,83,4],[82,5,82,6],[82,7,83,8],[84,7,84,8],[85,3,85,4],[85,5,85,6],[85,7,85,8],[86,3,86,4],[86,7,86,8],[87,3,87,4],[87,7,87,8],[88,3,88,4],[88,7,88,8],[89,3,89,4],[89,7,89,8],[90,3,90,4],[90,7,90,8],[91,3,91,8],[93,1,94,1],[93,2,94,2],[93,3,94,3],[93,4,94,4],[93,5,93,6],[93,7,94,8],[95,7,95,8],[96,3,96,4],[96,5,96,6],[96,7,96,8],[102,3,102,8],[97,3,97,4],[97,7,97,8],[98,3,98,4],[98,7,98,8],[99,3,99,4],[99,7,99,8],[100,3,100,4],[100,7,100,8],[101,3,101,4],[101,7,101,8]]}
[]
[]
[]
["UNIDADE ESCOLAR",null,null,null,null,null,null,"CÓDIGO INEP"]
[{"$f":"Orçamento!$O$4","v":"COLÉGIO ESTADUAL PROFESSOR HELI ALVES FERREIRA"},null,null,null,null,null,null,{"$f":"Orçamento!$V$4","v":52020487}]
[]
["OBRA",null,null,null,null,null,null,"CIDADE"]
[{"$f":"Orçamento!$O$7","v":"REFORMA E AMPLIAÇÃO"},null,null,null,null,null,null,{"$f":"Orçamento!$V$7","v":"ANÁPOLIS"}]
[]
["CRE",null,null,"ENDEREÇO",null,null,null,"REFERÊNCIA AGETOP"]
[{"$f":"Orçamento!$O$10","v":"ANÁPOLIS"},null,null,{"$f":"Orçamento!$R$10","v":"RUA LOPO DE SOUZA RAMOS S/N PÇA MAJOR HENRIQUE, JUNDIAI, CEP:75110-410"},null,null,null,{"$f":"Orçamento!$V$10","v":"DEZ/18"},{"$f":"Orçamento!$W$10","v":"DESONERADA"}]
[]
["DATA",null,null,"ÁREA TOTAL CONSTRUÍDA (M²)",null,null,null,"REFERÊNCIA SINAPI"]
[{"$f":"Orçamento!$S$7","v":"2020-04-08"},null,null,{"$f":"Orçamento!$S$13","v":1589.09},null,null,null,{"$f":"Orçamento!$V$13","v":"MAR/19"},{"$f":"Orçamento!$W$13","v":"DESONERADA"}]
[]
["COTAÇÕES DE PREÇOS - SEE-GO"]
[null,"FONTE","CÓDIGO","DESCRIÇÃO","UNIDADE","MÉDIA",null,"ÍNDICE RETROAÇÃO"]
[null,null,null,null,null,"DESONERADA","ONERADA"]
[103,"COTAÇÃO","COT 103_SEE","NIPLE DE REDUÇÃO 1/2\" X 1/4\" BSP","UN",6.0533333333333337,6.0533333333333337,""]
[null,null,"EMPRESA","NOME DA EMPRESA",null,"COTAÇÕES",null,"DATA COTAÇÃO"]
[null,null,"E070 - FOCO R...","FOCO REPRESENTAÇÃO E CONSULTORIA LTDA-ME",null,4.46,4.46,"12/02/2019"]
[null,null,"E071 - CASA D...","CASA DAS PEÇAS COM E INDUSTRIA DE FOGOES LTDA",null,3.9,3.9,"11/02/2019"]
[null,null,"E072 - AMIG I...","AMIG INSTALAÇÃO DE REDE DE GÁS E INCÊNDIO",null,9.8000000000000007,9.8000000000000007,"08/02/2019"]
[null,null,"","",null,null,null,""]
[null,null,"","",null,null,null,""]
[null,null,"OBSERVAÇÕES:",""]
[]
[null,"FONTE","CÓDIGO","DESCRIÇÃO","UNIDADE","MÉDIA",null,"ÍNDICE RETROAÇÃO"]
[null,null,null,null,null,"DESONERADA","ONERADA"]
[104,"COTAÇÃO","COT 104_SEE","NIPLE DE REDUÇÃO 3/4\" X 1/2\" BSP","UN",9.7099999999999991,9.7099999999999991,""]
[null,null,"EMPRESA","NOME DA EMPRESA",null,"COTAÇÕES",null,"DATA COTAÇÃO"]
[null,null,"E070 - FOCO R...","FOCO REPRESENTAÇÃO E CONSULTORIA LTDA-ME",null,10.93,10.93,"12/02/2019"]
[null,null,"E071 - CASA D...","CASA DAS PEÇAS COM E INDUSTRIA DE FOGOES LTDA",null,5.5,5.5,"11/02/2019"]
[null,null,"E072 - AMIG I...","AMIG INSTALAÇÃO DE REDE DE GÁS E INCÊNDIO",null,12.7,12.7,"08/02/2019"]
[null,null,"","",null,null,null,""]
[null,null,"","",null,null,null,""]
[null,null,"OBSERVAÇÕES:",""]
[]
[null,"FONTE","CÓDIGO","DESCRIÇÃO","UNIDADE","MÉDIA",null,"ÍNDICE RETROAÇÃO"]
[null,null,null,null,null,"DESONERADA","ONERADA"]
[101,"COTAÇÃO","COT 101_SEE","REGULADOR DE 1º ESTÁGIO 60KG/H MODELO AP-40  COM MANÔMETRO","UN",205.57666666666668,205.57666666666668,""]
[null,null,"EMPRESA","NOME DA EMPRESA",null,"COTAÇÕES",null,"DATA COTAÇÃO"]
[null,null,"E070 - FOCO R...","FOCO REPRESENTAÇÃO E CONSULTORIA LTDA-ME",null,148.72999999999999,148.72999999999999,"12/02/2019"]
[null,null,"E071 - CASA D...","CASA DAS PEÇAS COM E INDUSTRIA DE FOGOES LTDA",null,198,198,"11/02/2019"]
[null,null,"E072 - AMIG I...","AMIG INSTALAÇÃO DE REDE DE GÁS E INCÊNDIO",null,270,270,"08/02/2019"]
[null,null,"","",null,null,null,""]
[null,null,"","",null,null,null,""]
[null,null,"OBSERVAÇÕES:",""]
[]
[null,"FONTE","CÓDIGO","DESCRIÇÃO","UNIDADE","MÉDIA",null,"ÍNDICE RETROAÇÃO"]
[null,null,null,null,null,"DESONERADA","ONERADA"]
[195,"COTAÇÃO","COT 195_SEE","LÂMPADA LED TUBULAR 18W ","UN",21.959999999999997,21.959999999999997,""]
[null,null,"EMPRESA","NOME DA EMPRESA",null,"COTAÇÕES",null,"DATA COTAÇÃO"]
[null,null,"E030 - AJEL M...","AJEL MATERIAIS ELÉTRICOS",null,19.89,19.89,""]
[null,null,"E013 - ELETRO...","ELETROTRANSOL",null,25.99,25.99,""]
[null,null,"E014 - MAKRO ...","MAKRO SERVICE",null,20,20,""]
[null,null,"","",null,null,null,""]
[null,null,"","",null,null,null,""]
[null,null,"OBSERVAÇÕES:",""]
[]
[null,"FONTE","CÓDIGO","DESCRIÇÃO","UNIDADE","MÉDIA",null,"ÍNDICE RETROAÇÃO"]
[null,null,null,null,null,"DESONERADA","ONERADA"]
[10,"COTAÇÃO",{"$f":"CONCATENATE(\"COT \",TEXT(A63,\"000\"),\"_SEE\")","v":"COT 010_SEE"},"CAPUZ PARA PROTEÇÃO DOS PARA RAIOS","UN ",{"$f":"IFERROR(AVERAGE(F65:F69),0)","v":15.81},{"$f":"IFERROR(AVERAGE(G65:G69),0)","v":15.81},""]
[null,null,"EMPRESA","NOME DA EMPRESA",null,"COTAÇÕES",null,"DATA COTAÇÃO"]
[null,null,"E013 - ELETRO...","ELETROTRANSOL",null,15.81,15.81,"06/02/2019"]
[null,null,null,{"$f":"IF(C66<>\"\",VLOOKUP(C66,EMPRESAS,3,FALSE),\"\")","v":""},null,null,null,""]
[null,null,null,{"$f":"IF(C67<>\"\",VLOOKUP(C67,EMPRESAS,3,FALSE),\"\")","v":""},null,null,null,""]
[null,null,"",{"$f":"IF(C68<>\"\",VLOOKUP(C68,EMPRESAS,3,FALSE),\"\")","v":""},null,null,null,""]
[null,null,"",{"$f":"IF(C69<>\"\",VLOOKUP(C69,EMPRESAS,3,FALSE),\"\")","v":""},null,null,null,""]
[null,null,"OBSERVAÇÕES:",""]
[]
[null,"FONTE","CÓDIGO","DESCRIÇÃO","UNIDADE","MÉDIA",null,"ÍNDICE RETROAÇÃO"]
[null,null,null,null,null,"DESONERADA","ONERADA"]
[11,"COTAÇÃO",{"$f":"CONCATENATE(\"COT \",TEXT(A74,\"000\"),\"_SEE\")","v":"COT 011_SEE"},"CAPUZ DE PROTEÇÃO PARA BUCHA DE TRANSFORMADOR","UN ",{"$f":"IFERROR(AVERAGE(F76:F80),0)","v":15.81},{"$f":"IFERROR(AVERAGE(G76:G80),0)","v":15.81},""]
[null,null,"EMPRESA","NOME DA EMPRESA",null,"COTAÇÕES",null,"DATA COTAÇÃO"]
[null,null,"E013 - ELETRO...","ELETROTRANSOL",null,15.81,15.81,"06/02/2019"]
[null,null,null,{"$f":"IF(C77<>\"\",VLOOKUP(C77,EMPRESAS,3,FALSE),\"\")","v":""},null,null,null,""]
[null,null,null,{"$f":"IF(C78<>\"\",VLOOKUP(C78,EMPRESAS,3,FALSE),\"\")","v":""},null,null,null,""]
[null,null,"",{"$f":"IF(C79<>\"\",VLOOKUP(C79,EMPRESAS,3,FALSE),\"\")","v":""},null,null,null,""]
[null,null,"",{"$f":"IF(C80<>\"\",VLOOKUP(C80,EMPRESAS,3,FALSE),\"\")","v":""},null,null,null,""]
[null,null,"OBSERVAÇÕES:",""]
[]
[null,"FONTE","CÓDIGO","DESCRIÇÃO","UNIDADE","MÉDIA",null,"ÍNDICE RETROAÇÃO"]
[null,null,null,null,null,"DESONERADA","ONERADA"]
[12,"COTAÇÃO",{"$f":"CONCATENATE(\"COT \",TEXT(A85,\"000\"),\"_SEE\")","v":"COT 012_SEE"},"HASTE ROSQUEADA \"TIRANTE\" 3/8\"","M",{"$f":"IFERROR(AVERAGE(F87:F91),0)","v":5.3833333333333329},{"$f":"IFERROR(AVERAGE(G87:G91),0)","v":5.3833333333333329},""]
[null,null,"EMPRESA","NOME DA EMPRESA",null,"COTAÇÕES",null,"DATA COTAÇÃO"]
[null,null,"E013 - ELETRO...","ELETROTRANSOL",null,{"$f":"16.15/3","v":5.3833333333333329},{"$f":"16.15/3","v":5.3833333333333329},"06/02/2019"]
[null,null,null,{"$f":"IF(C88<>\"\",VLOOKUP(C88,EMPRESAS,3,FALSE),\"\")","v":""},null,null,null,""]
[null,null,null,{"$f":"IF(C89<>\"\",VLOOKUP(C89,EMPRESAS,3,FALSE),\"\")","v":""},null,null,null,""]
[null,null,"",{"$f":"IF(C90<>\"\",VLOOKUP(C90,EMPRESAS,3,FALSE),\"\")","v":""},null,null,null,""]
[null,null,"",{"$f":"IF(C91<>\"\",VLOOKUP(C91,EMPRESAS,3,FALSE),\"\")","v":""},null,null,null,""]
[null,null,"OBSERVAÇÕES:",""]
[]
[null,"FONTE","CÓDIGO","DESCRIÇÃO","UNIDADE","MÉDIA",null,"ÍNDICE RETROAÇÃO"]
[null,null,null,null,null,"DESONERADA","ONERADA"]
[13,"COTAÇÃO",{"$f":"CONCATENATE(\"COT \",TEXT(A96,\"000\"),\"_SEE\")","v":"COT 013_SEE"},"PORCA SEXTAVADA 3/8\"","UN ",{"$f":"IFERROR(AVERAGE(F98:F102),0)","v":0.13},{"$f":"IFERROR(AVERAGE(G98:G102),0)","v":0.13},""]
[null,null,"EMPRESA","NOME DA EMPRESA",null,"COTAÇÕES",null,"DATA COTAÇÃO"]
[null,null,"E013 - ELETRO...","ELETROTRANSOL",null,0.12,0.12,"06/02/2019"]
[null,null,"E055 - SANETA...","SANETAM COMERCIO DE TUBOS E CONEXOES LTDA.",null,0.13,0.13,"06/02/2019"]
[null,null,"E056 - AC COM...","AC COMERCIO DE FERRAMENTAS E PRODUTOS PARA FIXACAO EIRE",null,0.14000000000000001,0.14000000000000001,"06/02/2019"]
[null,null,"",{"$f":"IF(C101<>\"\",VLOOKUP(C101,EMPRESAS,3,FALSE),\"\")","v":""},null,null,null,""]
[null,null,"",{"$f":"IF(C102<>\"\",VLOOKUP(C102,EMPRESAS,3,FALSE),\"\")","v":""},null,null,null,""]
[null,null,"OBSERVAÇÕES:",""]