{"text_format":"1","workbook":"xlsx","n_sheets":8,"sheets":["Orçamento","Resumo ","Somatório","Cronog_120_Dias","Composição BDI","Relatório CENTRAL","Parc Maior Relev","Composições"],"not_rendered":{"charts":0,"images":3,"macros":1,"external_links":0,"defined_names":79,"comments":3,"pivot_tables":0},"unopened":[],"bounds":{"document_bytes":16777216,"sheet_cells":100000,"rows_first":2000,"rows_last":500,"rows_between":2000,"halvings":0,"cell_chars":16384,"cell_head_chars":4096},"cells_cut":0,"cells_raw":0,"read":"whole","date_system":"1900"}

{"sheet":"Orçamento","index":0,"n_rows":692,"n_cols":27,"rows_kept":692,"cut":false,"hidden":false,"merged":[[661,23,661,25],[662,23,662,25],[663,23,663,25],[659,23,659,25],[634,23,634,25],[635,23,635,25],[636,23,636,25],[637,23,637,25],[638,23,638,25],[639,23,639,25],[640,23,640,25],[641,23,641,25],[642,23,642,25],[643,23,643,25],[644,23,644,25],[645,23,645,25],[646,23,646,25],[647,23,647,25],[648,23,648,25],[649,23,649,25],[650,23,650,25],[651,23,651,25],[652,23,652,25],[653,23,653,25],[676,23,676,25],[677,23,677,25],[678,23,678,25],[679,23,679,25],[680,23,680,25],[681,23,681,25],[682,23,682,25],[683,23,683,25],[684,23,684,25],[667,23,667,25],[668,23,668,25],[669,23,669,25],[670,23,670,25],[671,23,671,25],[672,23,672,25],[673,23,673,25],[674,23,674,25],[675,23,675,25],[8,12,9,12],[662,18,662,22],[0,14,0,24],[8,14,8,16],[9,14,9,16],[11,14,11,16],[12,14,12,16],[14,14,14,24],[1,14,1,24],[4,14,4,24],[7,14,7,24],[646,18,646,22],[643,15,643,17],[644,15,644,17],[645,15,645,17],[655,18,655,22],[653,18,653,22],[616,23,616,24],[661,18,661,22],[648,18,648,22],[641,18,641,22],[655,15,655,17],[656,15,656,17],[657,15,657,17],[663,18,663,22],[639,18,639,22],[640,18,640,22],[638,18,638,22],[647,18,647,22],[629,18,629,24],[635,18,635,22],[636,18,636,22],[637,18,637,22],[660,18,660,22],[658,18,658,22],[659,18,659,22],[649,18,649,22],[656,18,656,22],[652,18,652,22],[654,18,654,22],[650,18,650,22],[651,18,651,22],[660,23,660,25],[654,23,654,25],[655,23,655,25],[656,23,656,25],[657,23,657,25],[658,23,658,25],[617,23,617,24],[618,23,618,24],[633,23,633,25],[658,15,658,17],[659,15,659,17],[632,14,632,26],[616,17,621,17],[633,18,633,22],[634,18,634,22],[642,18,642,22],[643,18,643,22],[644,18,644,22],[645,18,645,22],[657,18,657,22],[654,15,654,17],[634,15,634,17],[635,15,635,17],[636,15,636,17],[637,15,637,17],[638,15,638,17],[639,15,639,17],[640,15,640,17],[641,15,641,17],[642,15,642,17],[646,15,646,17],[647,15,647,17],[648,15,648,17],[649,15,649,17],[650,15,650,17],[651,15,651,17],[652,15,652,17],[653,15,653,17],[627,16,627,24],[669,15,669,17],[669,18,669,22],[624,16,624,24],[625,16,625,24],[626,16,626,24],[10,14,10,26],[13,14,13,26],[9,17,9,22],[2,14,2,22],[3,14,3,22],[5,18,5,22],[6,18,6,22],[11,18,11,22],[12,18,12,22],[6,14,6,17],[5,14,5,17],[3,23,3,25],[2,23,2,25],[5,23,5,25],[6,23,6,25],[628,16,628,24],[8,23,8,25],[9,24,9,25],[691,18,691,22],[688,14,688,17],[685,15,685,17],[685,18,685,22],[686,15,686,17],[686,18,686,22],[687,15,687,17],[687,18,687,22],[690,18,690,22],[689,18,689,22],[685,23,685,25],[686,23,686,25],[687,23,687,25],[688,23,688,25],[689,23,689,25],[690,23,690,25],[691,23,691,25],[660,14,660,17],[667,15,667,17],[633,15,633,17],[688,18,688,22],[676,15,676,17],[676,18,676,22],[677,15,677,17],[677,18,677,22],[678,15,678,17],[678,18,678,22],[682,15,682,17],[682,18,682,22],[683,15,683,17],[683,18,683,22],[684,15,684,17],[673,15,673,17],[684,18,684,22],[679,15,679,17],[679,18,679,22],[680,15,680,17],[680,18,680,22],[681,15,681,17],[681,18,681,22],[12,24,12,25],[11,23,11,25],[673,18,673,22],[674,15,674,17],[674,18,674,22],[675,15,675,17],[675,18,675,22],[670,15,670,17],[670,18,670,22],[671,15,671,17],[671,18,671,22],[672,15,672,17],[672,18,672,22],[666,14,666,26],[667,18,667,22],[668,15,668,17],[668,18,668,22]]}
[]
[]
[null,null,null,null,null,null,null,null,null,null,null,null,null,null,"UNIDADE ESCOLAR",null,null,null,null,null,null,null,null,"CÓDIGO INEP"]
[null,null,null,null,null,null,null,null,null,null,null,null,null,null,"COLÉGIO ESTADUAL DELFINO OCLÉCIO MACHADO",null,null,null,null,null,null,null,null,52103099]
[]
["Nmax",null,null,null,null,null,null,null,null,null,null,null,"Ajustar altura?",null,"OBRA",null,null,null,"DATA",null,null,null,null,"CIDADE"]
[{"$f":"MAX($C$18:$C$616)","v":4},null,null,null,null,null,null,null,null,null,null,null,"NÃO",null,"AMPLIAÇÃO",null,null,null,"2020-04-08",null,null,null,null,"LUZIÂNIA"]
[]
[null,null,null,null,null,null,null,null,null,null,null,null,"",null,"CRE",null,null,"ENDEREÇO",null,null,null,null,null,"REFERÊNCIA AGETOP"]
[null,null,null,null,null,null,null,null,null,null,null,null,null,null,"LUZIÂNIA",null,null,"RUA BOTUCATU, AV. GOVERNADOR JOSÉ FELICIANO FERREIRA 02, JARDIM INGA, CEP:72850-310",null,null,null,null,null,"DEZ/18","ONERADA"]
[]
[null,null,null,null,null,null,null,null,null,null,null,null,null,null,"ÁREA EXISTENTE (M²)",null,null,"ÁREA A CONSTRUIR (M²)","ÁREA TOTAL CONSTRUÍDA (M²)",null,null,null,null,"REFERÊNCIA SINAPI"]
[null,null,null,null,null,null,null,null,null,null,null,null,null,null,2971.17,null,null,756.66,3727.83,null,null,null,null,"MAR/19","ONERADA"]
[]
[null,null,null,null,null,null,null,null,null,null,null,"FILTRO",null,null,"PLANILHA ORÇAMENTÁRIA"]
["Nível E","Save Nivel","Nível C","Altura","n1","n2","n3","n4","n5","Czero","Cnível","↓","Nível","Nível Corrigido","ITEM","TABELA","CODIGO","DESCRIÇÃO DOS SERVIÇOS","UNID","QUANT","REPET","QUANT TOTAL","MAT","MO","VALOR UNIT","VALOR TOTAL","OBSERVAÇÕES¹"]
[{"$f":"CHOOSE(1+LOG(1+2*(ORÇAMENTO.Nivel=\"Nível 1\")+4*(ORÇAMENTO.Nivel=\"Nível 2\")+8*(ORÇAMENTO.Nivel=\"Nível 3\")+16*(ORÇAMENTO.Nivel=\"Nível 4\")+32*(ORÇAMENTO.Nivel=\"Serviço\"),2),0,1,2,3,4,\"S\")","v":"S"},{"$f":"IF(OR(C17=\"s\",C17=0),OFFSET(B17,-1,0),C17)","v":"Save Nivel"},{"$f":"IF(OFFSET(C17,-1,0)=\"L\",1,IF(OFFSET(C17,-1,0)=1,2,IF(OR(A17=\"s\",A17=0),\"S\",IF(AND(OFFSET(C17,-1,0)=2,A17=4),3,IF(AND(OR(OFFSET(C17,-1,0)=\"s\",OFFSET(C17,-1,0)=0),A17<>\"s\",A17>OFFSET(B17,-1,0)),OFFSET(B17,-1,0),A17)))))","v":"S"},{"$f":"IF(OR(C17=\"S\",C17=0),0,IF(ISERROR(K17),J17,SMALL(J17:K17,1)))","v":0},{"$f":"IF($C17=1,OFFSET(E17,-1,0)+1,OFFSET(E17,-1,0))","v":"n1"},{"$f":"IF($C17=1,0,IF($C17=2,OFFSET(F17,-1,0)+1,OFFSET(F17,-1,0)))","v":"n2"},{"$f":"IF(AND($C17<=2,$C17<>0),0,IF($C17=3,OFFSET(G17,-1,0)+1,OFFSET(G17,-1,0)))","v":"n3"},{"$f":"IF(AND($C17<=3,$C17<>0),0,IF($C17=4,OFFSET(H17,-1,0)+1,OFFSET(H17,-1,0)))","v":"n4"},{"$f":"IF(AND($C17<=4,$C17<>0),0,IF(AND($C17=\"S\",$Y17>0),OFFSET(I17,-1,0)+1,OFFSET(I17,-1,0)))","v":"n5"},{"$f":"IF(OR($C17=\"S\",$C17=0),0,MATCH(0,OFFSET($D17,1,$C17,ROW($C$616)-ROW($C17)),0))","v":0},{"$f":"IF(OR($C17=\"S\",$C17=0),0,MATCH(OFFSET($D17,0,$C17)+1,OFFSET($D17,1,$C17,ROW($C$616)-ROW($C17)),0))","v":0},"","Serviço","Serviço","-","SINAPI",null,"(sem código)","-",null,"REPET","-",0,0,0,"-",""]
[0,null,"L",{"$f":"COUNTA(OFFSET(D18,1,0):D$616)","v":597},{"$f":"LEFT(O19,1)-1","v":0},null,null,null,null,null,null,"F","LOTE","LOTE","AMPLIAÇÃO - COLÉGIO ESTADUAL DELFINO OCLÉCIO MACHADO",null,null,null,null,null,null,null,null,null,null,0]
[1,{"$f":"IF(OR(C19=\"s\",C19=0),OFFSET(B19,-1,0),C19)","v":1},{"$f":"IF(OFFSET(C19,-1,0)=\"L\",1,IF(OFFSET(C19,-1,0)=1,2,IF(OR(A19=\"s\",A19=0),\"S\",IF(AND(OFFSET(C19,-1,0)=2,A19=4),3,IF(AND(OR(OFFSET(C19,-1,0)=\"s\",OFFSET(C19,-1,0)=0),A19<>\"s\",A19>OFFSET(B19,-1,0)),OFFSET(B19,-1,0),A19)))))","v":1},{"$f":"IF(OR(C19=\"S\",C19=0),0,IF(ISERROR(K19),J19,SMALL(J19:K19,1)))","v":109},{"$f":"IF($C19=1,OFFSET(E19,-1,0)+1,OFFSET(E19,-1,0))","v":1},{"$f":"IF($C19=1,0,IF($C19=2,OFFSET(F19,-1,0)+1,OFFSET(F19,-1,0)))","v":0},{"$f":"IF(AND($C19<=2,$C19<>0),0,IF($C19=3,OFFSET(G19,-1,0)+1,OFFSET(G19,-1,0)))","v":0},{"$f":"IF(AND($C19<=3,$C19<>0),0,IF($C19=4,OFFSET(H19,-1,0)+1,OFFSET(H19,-1,0)))","v":0},0,{"$f":"IF(OR($C19=\"S\",$C19=0),0,MATCH(0,OFFSET($D19,1,$C19,ROW($C$616)-ROW($C19)),0))","v":597},{"$f":"IF(OR($C19=\"S\",$C19=0),0,MATCH(OFFSET($D19,0,$C19)+1,OFFSET($D19,1,$C19,ROW($C$616)-ROW($C19)),0))","v":109},"F","Nível 1","Nível 1","1.","AGETOP",null,"REFORMA","UN",1,1,1,null,null,0,0]
[2,{"$f":"IF(OR(C20=\"s\",C20=0),OFFSET(B20,-1,0),C20)","v":2},{"$f":"IF(OFFSET(C20,-1,0)=\"L\",1,IF(OFFSET(C20,-1,0)=1,2,IF(OR(A20=\"s\",A20=0),\"S\",IF(AND(OFFSET(C20,-1,0)=2,A20=4),3,IF(AND(OR(OFFSET(C20,-1,0)=\"s\",OFFSET(C20,-1,0)=0),A20<>\"s\",A20>OFFSET(B20,-1,0)),OFFSET(B20,-1,0),A20)))))","v":2},{"$f":"IF(OR(C20=\"S\",C20=0),0,IF(ISERROR(K20),J20,SMALL(J20:K20,1)))","v":8},{"$f":"IF($C20=1,OFFSET(E20,-1,0)+1,OFFSET(E20,-1,0))","v":1},{"$f":"IF($C20=1,0,IF($C20=2,OFFSET(F20,-1,0)+1,OFFSET(F20,-1,0)))","v":1},{"$f":"IF(AND($C20<=2,$C20<>0),0,IF($C20=3,OFFSET(G20,-1,0)+1,OFFSET(G20,-1,0)))","v":0},{"$f":"IF(AND($C20<=3,$C20<>0),0,IF($C20=4,OFFSET(H20,-1,0)+1,OFFSET(H20,-1,0)))","v":0},0,108,8,"","Nível 2","Nível 2","-","AGETOP",null,"SERVIÇOS PRELIMINARES","-",null,1,"-",null,null,0,0]
[3,3,3,7,1,1,1,0,0,7,50,"","Nível 3","Nível 3","-","SINAPI",null,"FORRO PVC SEM ESTRUTURA","-",null,1,"-",null,null,0,0,""]
["S",{"$f":"IF(OR(C22=\"s\",C22=0),OFFSET(B22,-1,0),C22)","v":3},{"$f":"IF(OFFSET(C22,-1,0)=\"L\",1,IF(OFFSET(C22,-1,0)=1,2,IF(OR(A22=\"s\",A22=0),\"S\",IF(AND(OFFSET(C22,-1,0)=2,A22=4),3,IF(AND(OR(OFFSET(C22,-1,0)=\"s\",OFFSET(C22,-1,0)=0),A22<>\"s\",A22>OFFSET(B22,-1,0)),OFFSET(B22,-1,0),A22)))))","v":"S"},{"$f":"IF(OR(C22=\"S\",C22=0),0,IF(ISERROR(K22),J22,SMALL(J22:K22,1)))","v":0},1,1,1,0,0,0,0,"","Serviço","Serviço","-","AGETOP",20121,"DEM. MANUAL EM CONCR.SIMPLES C/TR.ATE CB.E CARGA (O.C.)","m3    ",0.60000000000000009,1,0.60000000000000009,null,null,0,0,""]
["S",3,"S",0,1,1,1,0,0,0,0,"","Serviço","Serviço","-","SINAPI",97622,"DEMOLIÇÃO DE ALVENARIA DE BLOCO FURADO, DE FORMA MANUAL, SEM REAPROVEITAMENTO. AF_12/2017","M3",1.28,1,1.28,null,null,0,0,"Referência: AGETOP - 20118"]
["S",3,"S",0,1,1,1,0,0,0,0,"","Serviço","Serviço","-","SINAPI","74209/1","PLACA DE OBRA EM CHAPA DE ACO GALVANIZADO","M2",4.5,1,4.5,null,null,0,0,"Referência: AGETOP - 21301"]
["S",3,"S",0,1,1,1,0,0,0,0,"","Serviço","Serviço","-","AGETOP",21602,"EPI/PPRA/PCMSO/EXAMES/TREINAMENTOS/VISITAS (< 20 EMPREGADOS) - ÁREAS EDIFICADAS/COBERTAS/FECHADAS","m2    ",756.66,1,756.66,null,null,0,0,""]
["S",3,"S",0,1,1,1,0,0,0,0,"","Serviço","Serviço","-","AGETOP",20200,"FERRAMENTAS (MANUAIS/ELÉTRICAS) E MATERIAL DE LIMPEZA PERMANENTE DA OBRA - ÁREAS EDIFICADAS/COBERTAS/FECHADAS","m2    ",756.66,1,756.66,null,null,0,0,""]
["S",3,"S",0,1,1,1,0,0,0,0,"","Serviço","Serviço","-","AGETOP",20302,"DEPÓSITO PARA CIMENTO TIPO I  COM PINTURA PADRÃO AGETOP/2014 (2,20 X 2,262M) A=4,98 M2 ( C/ REAPROV. 1 VEZ ) - INCLUSO PALETES ","Un    ",1,1,1,null,null,0,0,""]
[2,2,2,2,1,2,0,0,0,100,2,"","Nível 2","Nível 2","-","AGETOP",null,"TRANSPORTES","-",null,1,"-",null,null,0,0,""]
["S",2,"S",0,1,2,0,0,0,0,0,"","Serviço","Serviço","-","SINAPI",72900,"TRANSPORTE DE ENTULHO COM CAMINHAO BASCULANTE 6 M3, RODOVIA PAVIMENTADA, DMT 0,5 A 1,0 KM","M3",1.8800000000000001,1,1.8800000000000001,null,null,0,0,""]
[2,2,2,7,1,3,0,0,0,98,7,"","Nível 2","Nível 2","-","AGETOP",null,"SERVIÇO EM TERRA","-",null,1,"-",null,null,0,0,""]
["S",2,"S",0,1,3,0,0,0,0,0,"","Serviço","Serviço","-","SINAPI",79480,"ESCAVACAO MECANICA CAMPO ABERTO EM SOLO EXCETO ROCHA ATE 2,00M PROFUNDIDADE","M3",142.94,1,142.94,null,null,0,0,"Referência: AGETOP - 41004"]
[{"$f":"CHOOSE(1+LOG(1+2*(ORÇAMENTO.Nivel=\"Nível 1\")+4*(ORÇAMENTO.Nivel=\"Nível 2\")+8*(ORÇAMENTO.Nivel=\"Nível 3\")+16*(ORÇAMENTO.Nivel=\"Nível 4\")+32*(ORÇAMENTO.Nivel=\"Serviço\"),2),0,1,2,3,4,\"S\")","v":"S"},2,"S",0,1,3,0,0,{"$f":"IF(AND($C32<=4,$C32<>0),0,IF(AND($C32=\"S\",$Y32>0),OFFSET(I32,-1,0)+1,OFFSET(I32,-1,0)))","v":0},0,0,"","Serviço","Serviço","-","AGETOP",20190,"LIMPEZA MECANICA DE TERRENO","m2    ",3101.61,1,3101.61,null,null,0,0,""]
["S",2,"S",0,1,3,0,0,0,0,0,"","Serviço","Serviço","-","SINAPI",93358,"ESCAVAÇÃO MANUAL DE VALA COM PROFUNDIDADE MENOR OU IGUAL A 1,30 M. AF_03/2016","M3",13,1,13,null,null,0,0,"Referência: AGETOP - 40101"]
["S",2,"S",0,1,3,0,0,0,0,0,"","Serviço","Serviço","-","SINAPI",96995,"REATERRO MANUAL APILOADO COM SOQUETE. AF_10/2017","M3",13,1,13,null,null,0,0,"Referência: AGETOP - 40902"]
["S",2,"S",0,{"$f":"IF($C35=1,OFFSET(E35,-1,0)+1,OFFSET(E35,-1,0))","v":1},{"$f":"IF($C35=1,0,IF($C35=2,OFFSET(F35,-1,0)+1,OFFSET(F35,-1,0)))","v":3},{"$f":"IF(AND($C35<=2,$C35<>0),0,IF($C35=3,OFFSET(G35,-1,0)+1,OFFSET(G35,-1,0)))","v":0},{"$f":"IF(AND($C35<=3,$C35<>0),0,IF($C35=4,OFFSET(H35,-1,0)+1,OFFSET(H35,-1,0)))","v":0},0,0,0,"","Serviço","Serviço","-","AGETOP",41140,"REGULARIZAÇÃO DO TERRENO SEM APILOAMENTO COM TRANSPORTE MANUAL DA TERRA ESCAVADA ","m2    ",1971,1,1971,null,null,0,0,""]
["S",2,"S",0,1,3,0,0,0,0,0,"","Serviço","Serviço","-","AGETOP",40904,"REATERRO COM APILOAMENTO MECÂNICO","m3    ",676.19,1,676.19,null,null,0,0,""]
[{"$f":"CHOOSE(1+LOG(1+2*(ORÇAMENTO.Nivel=\"Nível 1\")+4*(ORÇAMENTO.Nivel=\"Nível 2\")+8*(ORÇAMENTO.Nivel=\"Nível 3\")+16*(ORÇAMENTO.Nivel=\"Nível 4\")+32*(ORÇAMENTO.Nivel=\"Serviço\"),2),0,1,2,3,4,\"S\")","v":2},{"$f":"IF(OR(C37=\"s\",C37=0),OFFSET(B37,-1,0),C37)","v":2},{"$f":"IF(OFFSET(C37,-1,0)=\"L\",1,IF(OFFSET(C37,-1,0)=1,2,IF(OR(A37=\"s\",A37=0),\"S\",IF(AND(OFFSET(C37,-1,0)=2,A37=4),3,IF(AND(OR(OFFSET(C37,-1,0)=\"s\",OFFSET(C37,-1,0)=0),A37<>\"s\",A37>OFFSET(B37,-1,0)),OFFSET(B37,-1,0),A37)))))","v":2},{"$f":"IF(OR(C37=\"S\",C37=0),0,IF(ISERROR(K37),J37,SMALL(J37:K37,1)))","v":21},{"$f":"IF($C37=1,OFFSET(E37,-1,0)+1,OFFSET(E37,-1,0))","v":1},{"$f":"IF($C37=1,0,IF($C37=2,OFFSET(F37,-1,0)+1,OFFSET(F37,-1,0)))","v":4},{"$f":"IF(AND($C37<=2,$C37<>0),0,IF($C37=3,OFFSET(G37,-1,0)+1,OFFSET(G37,-1,0)))","v":0},{"$f":"IF(AND($C37<=3,$C37<>0),0,IF($C37=4,OFFSET(H37,-1,0)+1,OFFSET(H37,-1,0)))","v":0},{"$f":"IF(AND($C37<=4,$C37<>0),0,IF(AND($C37=\"S\",$Y37>0),OFFSET(I37,-1,0)+1,OFFSET(I37,-1,0)))","v":0},91,21,"","Nível 2","Nível 2","-",null,null,"INSTALAÇÕES ELÉTRICAS","-",null,1,"-",null,null,0,0,""]
["S",2,"S",0,1,4,0,0,0,0,0,"","Serviço","Serviço","-","AGETOP",70354,"BRACADEIRA METALICA TIPO \"U\" DIAM. 1.1/2\"","Un    ",25,1,25,null,null,0,0,"Referência: AGETOP - 70354"]
["S",2,"S",0,1,4,0,0,0,0,0,"","Serviço","Serviço","-","AGETOP",70355,"BRACADEIRA METALICA TIPO \"U\" DIAM. 2\"","Un    ",10,1,10,null,null,0,0,"Referência: AGETOP - 70355"]
["S",2,"S",0,1,4,0,0,0,0,0,"","Serviço","Serviço","-","AGETOP",70424,"BUCHA E ARRUELA METALICA DIAM. 1.1/2\"","PR    ",25,1,25,null,null,0,0,"Referência: AGETOP - 70424"]
["S",2,"S",0,1,4,0,0,0,0,0,"","Serviço","Serviço","-","AGETOP",70425,"BUCHA E ARRUELA METALICA DIAM. 2\"","PR    ",10,1,10,null,null,0,0,"Referência: AGETOP - 70425"]
["S",2,"S",0,1,4,0,0,0,0,0,"","Serviço","Serviço","-","SINAPI",91930,"CABO DE COBRE FLEXÍVEL ISOLADO, 6 MM², ANTI-CHAMA 450/750 V, PARA CIRCUITOS TERMINAIS - FORNECIMENTO E INSTALAÇÃO. AF_12/2015","M",369,1,369,null,null,0,0,"Referência: AGETOP - 70583"]
["S",2,"S",0,1,4,0,0,0,0,0,"","Serviço","Serviço","-","SINAPI",92982,"CABO DE COBRE FLEXÍVEL ISOLADO, 16 MM², ANTI-CHAMA 0,6/1,0 KV, PARA DISTRIBUIÇÃO - FORNECIMENTO E INSTALAÇÃO. AF_12/2015","M",293,1,293,null,null,0,0,""]
["S",2,"S",0,1,4,0,0,0,0,0,"","Serviço","Serviço","-","AGETOP",70541,"CABO DE COBRE NU No. 16 MM2 (6,94 M/KG)","M     ",9,1,9,null,null,0,0,"Referência: AGETOP - 70541"]
["S",2,"S",0,1,4,0,0,0,0,0,"","Serviço","Serviço","-","AGETOP",70720,"CAIXA METÁLICA PARA MEDIDOR POLIFÁSICO PADRÃO ENEL 500X380X166MM","Un    ",1,1,1,null,null,0,0,"Referência: AGETOP - 70720"]
["S",2,"S",0,1,4,0,0,0,0,0,"","Serviço","Serviço","-","SINAPI",97892,"CAIXA ENTERRADA ELÉTRICA RETANGULAR, EM ALVENARIA COM BLOCOS DE CONCRETO, FUNDO COM BRITA, DIMENSÕES INTERNAS: 0,6X0,6X0,6 M. AF_05/2018","UN",6,1,6,null,null,0,0,"Referência: AGETOP - 70715"]
["S",2,"S",0,1,4,0,0,0,0,0,"","Serviço","Serviço","-","SINAPI",93671,"DISJUNTOR TRIPOLAR TIPO DIN, CORRENTE NOMINAL DE 32A - FORNECIMENTO E INSTALAÇÃO. AF_04/2016","UN",2,1,2,null,null,0,0,"Referência: AGETOP - 71173"]
["S",2,"S",0,1,4,0,0,0,0,0,"","Serviço","Serviço","-","SINAPI","74130/5","DISJUNTOR TERMOMAGNETICO TRIPOLAR PADRAO NEMA (AMERICANO) 60 A 100A 240V, FORNECIMENTO E INSTALACAO","UN",2,1,2,null,null,0,0,""]
["S",2,"S",0,1,4,0,0,0,0,0,"","Serviço","Serviço","-","AGETOP",71184,"DISPOSITIVO DE PROTEÇÃO CONTRA SURTOS (D.P.S.) 275V DE 8 A 40KA","Un    ",3,1,3,null,null,0,0,"Referência: AGETOP - 71184"]
["S",2,"S",0,1,4,0,0,0,0,0,"","Serviço","Serviço","-","SINAPI",93008,"ELETRODUTO RÍGIDO ROSCÁVEL, PVC, DN 50 MM (1 1/2\") - FORNECIMENTO E INSTALAÇÃO. AF_12/2015","M",75,1,75,null,null,0,0,""]
["S",2,"S",0,1,4,0,0,0,{"$f":"IF(OR($C51=\"S\",$C51=0),0,MATCH(0,OFFSET($D51,1,$C51,ROW($C$616)-ROW($C51)),0))","v":0},{"$f":"IF(OR($C51=\"S\",$C51=0),0,MATCH(OFFSET($D51,0,$C51)+1,OFFSET($D51,1,$C51,ROW($C$616)-ROW($C51)),0))","v":0},"","Serviço","Serviço","-","SINAPI",93009,"ELETRODUTO RÍGIDO ROSCÁVEL, PVC, DN 60 MM (2\") - FORNECIMENTO E INSTALAÇÃO. AF_12/2015","M",30,1,30,null,null,0,0,""]
[{"$f":"CHOOSE(1+LOG(1+2*(ORÇAMENTO.Nivel=\"Nível 1\")+4*(ORÇAMENTO.Nivel=\"Nível 2\")+8*(ORÇAMENTO.Nivel=\"Nível 3\")+16*(ORÇAMENTO.Nivel=\"Nível 4\")+32*(ORÇAMENTO.Nivel=\"Serviço\"),2),0,1,2,3,4,\"S\")","v":"S"},2,"S",0,1,4,0,0,{"$f":"IF(AND($C52<=4,$C52<>0),0,IF(AND($C52=\"S\",$Y52>0),OFFSET(I52,-1,0)+1,OFFSET(I52,-1,0)))","v":0},0,0,"","Serviço","Serviço","-","AGETOP",71321,"FITA DE AUTO FUSAO, ROLO E 10,00 MM","Un    ",5,1,5,null,null,0,0,"Referência: AGETOP - 71321"]
["S",2,"S",0,1,4,0,0,0,0,0,"","Serviço","Serviço","-","AGETOP",71381,"HASTE REV.COBRE(COPPERWELD)  5/8\" X 3,00 M C/CONECTOR","Un    ",3,1,3,null,null,0,0,"Referência: AGETOP - 71381"]
["S",2,"S",0,1,4,0,0,0,0,0,"","Serviço","Serviço","-","SINAPI",93013,"LUVA PARA ELETRODUTO, PVC, ROSCÁVEL, DN 50 MM (1 1/2\") - FORNECIMENTO E INSTALAÇÃO. AF_12/2015","UN",25,1,25,null,null,0,0,"Referência: AGETOP - 71744"]
["S",2,"S",0,{"$f":"IF($C55=1,OFFSET(E55,-1,0)+1,OFFSET(E55,-1,0))","v":1},{"$f":"IF($C55=1,0,IF($C55=2,OFFSET(F55,-1,0)+1,OFFSET(F55,-1,0)))","v":4},{"$f":"IF(AND($C55<=2,$C55<>0),0,IF($C55=3,OFFSET(G55,-1,0)+1,OFFSET(G55,-1,0)))","v":0},{"$f":"IF(AND($C55<=3,$C55<>0),0,IF($C55=4,OFFSET(H55,-1,0)+1,OFFSET(H55,-1,0)))","v":0},0,0,0,"","Serviço","Serviço","-","SINAPI",93014,"LUVA PARA ELETRODUTO, PVC, ROSCÁVEL, DN 60 MM (2\") - FORNECIMENTO E INSTALAÇÃO. AF_12/2015","UN",10,1,10,null,null,0,0,"Referência: AGETOP - 71745"]
["S",2,"S",0,1,4,0,0,0,0,0,"","Serviço","Serviço","-","SINAPI",83463,"QUADRO DE DISTRIBUICAO DE ENERGIA EM CHAPA DE ACO GALVANIZADO, PARA 12 DISJUNTORES TERMOMAGNETICOS MONOPOLARES, COM BARRAMENTO TRIFASICO E NEUTRO - FORNECIMENTO E INSTALACAO","UN",1,1,1,null,null,0,0,"Referência: AGETOP - 72170"]
["S",2,"S",0,1,4,0,0,0,0,0,"","Serviço","Serviço","-","AGETOP",71820,"PADRAO TRIFASICO 16 MM2 H=7 METROS","Un    ",1,1,1,null,null,0,0,"Referência: AGETOP - 71820"]
[{"$f":"CHOOSE(1+LOG(1+2*(ORÇAMENTO.Nivel=\"Nível 1\")+4*(ORÇAMENTO.Nivel=\"Nível 2\")+8*(ORÇAMENTO.Nivel=\"Nível 3\")+16*(ORÇAMENTO.Nivel=\"Nível 4\")+32*(ORÇAMENTO.Nivel=\"Serviço\"),2),0,1,2,3,4,\"S\")","v":2},{"$f":"IF(OR(C58=\"s\",C58=0),OFFSET(B58,-1,0),C58)","v":2},{"$f":"IF(OFFSET(C58,-1,0)=\"L\",1,IF(OFFSET(C58,-1,0)=1,2,IF(OR(A58=\"s\",A58=0),\"S\",IF(AND(OFFSET(C58,-1,0)=2,A58=4),3,IF(AND(OR(OFFSET(C58,-1,0)=\"s\",OFFSET(C58,-1,0)=0),A58<>\"s\",A58>OFFSET(B58,-1,0)),OFFSET(B58,-1,0),A58)))))","v":2},{"$f":"IF(OR(C58=\"S\",C58=0),0,IF(ISERROR(K58),J58,SMALL(J58:K58,1)))","v":40},{"$f":"IF($C58=1,OFFSET(E58,-1,0)+1,OFFSET(E58,-1,0))","v":1},{"$f":"IF($C58=1,0,IF($C58=2,OFFSET(F58,-1,0)+1,OFFSET(F58,-1,0)))","v":5},{"$f":"IF(AND($C58<=2,$C58<>0),0,IF($C58=3,OFFSET(G58,-1,0)+1,OFFSET(G58,-1,0)))","v":0},{"$f":"IF(AND($C58<=3,$C58<>0),0,IF($C58=4,OFFSET(H58,-1,0)+1,OFFSET(H58,-1,0)))","v":0},{"$f":"IF(AND($C58<=4,$C58<>0),0,IF(AND($C58=\"S\",$Y58>0),OFFSET(I58,-1,0)+1,OFFSET(I58,-1,0)))","v":0},70,40,"","Nível 2","Nível 2","-","AGETOP",null,"INSTALAÇÕES HIDROSSANITÁRIAS","-",null,1,"-",null,null,0,0,""]
[3,3,3,12,1,5,1,0,0,39,12,"","Nível 3","Nível 3","-","SINAPI",null,"PEÇAS E ACESSÓRIOS","-",null,1,"-",null,null,0,0,""]
[4,4,4,3,1,5,1,1,0,11,3,"","Nível 4","Nível 4","-","SINAPI",null,"CAIXAS E CURVAS","-",null,1,"-",null,null,0,0,""]
["S",4,"S",0,1,5,1,1,0,0,0,"","Serviço","Serviço","-","SINAPI",89447,"TUBO, PVC, SOLDÁVEL, DN 32MM, INSTALADO EM PRUMADA DE ÁGUA - FORNECIMENTO E INSTALAÇÃO. AF_12/2014","M",85,1,85,null,null,0,0,""]
["S",4,"S",0,1,5,1,1,0,0,0,"","Serviço","Serviço","-","SINAPI",89451,"TUBO, PVC, SOLDÁVEL, DN 75MM, INSTALADO EM PRUMADA DE ÁGUA - FORNECIMENTO E INSTALAÇÃO. AF_12/2014","M",80,1,80,null,null,0,0,""]
[4,4,4,3,1,5,1,2,0,8,3,"","Nível 4","Nível 4","-","SINAPI",null,"JOELHO","-",null,1,"-",null,null,0,0,""]
["S",4,"S",0,1,5,1,2,0,0,0,"","Serviço","Serviço","-","SINAPI",89414,"JOELHO 45 GRAUS, PVC, SOLDÁVEL, DN 32MM, INSTALADO EM RAMAL DE DISTRIBUIÇÃO DE ÁGUA - FORNECIMENTO E INSTALAÇÃO. AF_12/2014","UN",5,1,5,null,null,0,0,"Referência: AGETOP - 81303"]
["S",4,"S",0,1,5,1,2,0,0,0,"","Serviço","Serviço","-","SINAPI",89515,"JOELHO 45 GRAUS, PVC, SOLDÁVEL, DN 75MM, INSTALADO EM PRUMADA DE ÁGUA - FORNECIMENTO E INSTALAÇÃO. AF_12/2014","UN",5,1,5,null,null,0,0,"Referência: AGETOP - 81307"]
[4,4,4,2,1,5,1,3,0,5,2,"","Nível 4","Nível 4","-","SINAPI",null,"TÊ","-",null,1,"-",null,null,0,0,""]
["S",4,"S",0,1,5,1,3,0,0,0,"","Serviço","Serviço","-","SINAPI",89629,"TE, PVC, SOLDÁVEL, DN 75MM, INSTALADO EM PRUMADA DE ÁGUA - FORNECIMENTO E INSTALAÇÃO. AF_12/2014","UN",1,1,1,null,null,0,0,"Referência: AGETOP - 81407"]
[4,4,4,3,1,5,1,4,0,3,{"$error":"#N/A"},"","Nível 4","Nível 4","-","SINAPI",null,"ADESESIVOS","-",null,1,"-",null,null,0,0,""]
["S",4,"S",0,1,5,1,4,0,0,0,"","Serviço","Serviço","-","AGETOP",81501,"ADESIVO PLASTICO - FRASCO 850 G","Un    ",1,1,1,null,null,0,0,"Referência: AGETOP - 81501"]
["S",4,"S",0,1,5,1,4,0,0,0,"","Serviço","Serviço","-","AGETOP",81504,"SOLUCAO LIMPADORA 1000 CM3","Un    ",1,1,1,null,null,0,0,"Referência: AGETOP - 81504"]
[3,3,3,3,1,5,2,0,0,27,3,"","Nível 3","Nível 3","-","SINAPI",null,"ESGOTO SANITÁRIO","-",null,1,"-",null,null,0,0,""]
["S",3,"S",0,1,5,2,0,0,0,0,"","Serviço","Serviço","-","SINAPI",89799,"TUBO PVC, SERIE NORMAL, ESGOTO PREDIAL, DN 75 MM, FORNECIDO E INSTALADO EM PRUMADA DE ESGOTO SANITÁRIO OU VENTILAÇÃO. AF_12/2014","M",18,1,18,null,null,0,0,""]
["S",3,"S",0,1,5,2,0,0,0,0,"","Serviço","Serviço","-","SINAPI",89800,"TUBO PVC, SERIE NORMAL, ESGOTO PREDIAL, DN 100 MM, FORNECIDO E INSTALADO EM PRUMADA DE ESGOTO SANITÁRIO OU VENTILAÇÃO. AF_12/2014","M",36,1,36,null,null,0,0,""]
[3,3,3,4,1,5,3,0,0,24,4,"","Nível 3","Nível 3","-","SINAPI",null,"OUTROS","-",null,1,"-",null,null,0,0,""]
["S",3,"S",0,1,5,3,0,0,0,0,"","Serviço","Serviço","-","AGETOP",81825,"CAIXA DE PASSAGEM 60 X 60 CM SEM TAMPA","Un    ",1,1,1,null,null,0,0,"Referência: AGETOP - 81825"]
["S",3,"S",0,1,5,3,0,0,0,0,"","Serviço","Serviço","-","AGETOP",81826,"TAMPA EM CONCRETO ARMADO 25 MPA E=5CM PARA A CAIXA DE PASSAGEM 60X60CM","Un    ",1,1,1,null,null,0,0,"Referência: AGETOP - 81826"]
["S",3,"S",0,1,5,3,0,0,0,0,"","Serviço","Serviço","-","AGETOP",81828,"CAIXA DE AREIA 60X60CM FUNDO DE BRITA COM GRELHA METÁLICA FERRO CHATO PADRÃO AGETOP ","Un    ",1,1,1,null,null,0,0,""]
[3,3,3,20,1,5,4,0,0,20,{"$error":"#N/A"},"","Nível 3","Nível 3","-","SINAPI",null,"INSTALAÇÕES DE INCÊNDIO","-",null,1,"-",null,null,0,0,""]
["S",3,"S",0,1,5,4,0,0,0,0,"","Serviço","Serviço","-","AGETOP",82379,"TUBO FERRO GALVANIZADO DIAM.2.1/2\"","m     ",114,1,114,null,null,0,0,""]
["S",3,"S",0,1,5,4,0,0,0,0,"","Serviço","Serviço","-","AGETOP",85003,"EXTINTOR PO QUIMICO SECO (6 KG) - CAPACIDADE EXTINTORA 20 BC","Un    ",1,1,1,null,null,0,0,""]
["S",3,"S",0,1,5,4,0,0,0,0,"","Serviço","Serviço","-","AGETOP",85005,"EXTINTOR AGUA PRESSURIZADA (10 LITROS) - CAPACIDADE EXTINTORA 2A","Un    ",1,1,1,null,null,0,0,""]
["S",3,"S",0,1,5,4,0,0,0,0,"","Serviço","Serviço","-","AGETOP",85011,"CAIXA DE INCÊNDIO METÁLICA COM SUPORTE PARA MANGUEIRA, TAMPA E MURETA 17X60X90 CM C/PINTURA","Un    ",2,1,2,null,null,0,0,""]
["S",3,"S",0,1,5,4,0,0,{"$f":"IF(OR($C83=\"S\",$C83=0),0,MATCH(0,OFFSET($D83,1,$C83,ROW($C$616)-ROW($C83)),0))","v":0},{"$f":"IF(OR($C83=\"S\",$C83=0),0,MATCH(OFFSET($D83,0,$C83)+1,OFFSET($D83,1,$C83,ROW($C$616)-ROW($C83)),0))","v":0},"","Serviço","Serviço","-","AGETOP",85017,"MANGUEIRA DE INCÊNDIO D.I. = 38 MM TIPO 2 COMP. = 15 M","CJ    ",4,1,4,null,null,0,0,""]
["S",3,"S",0,1,5,4,0,0,0,0,"","Serviço","Serviço","-","AGETOP",85025,"ESGUICHO REGULÁVEL 1.1/2\"","Un    ",2,1,2,null,null,0,0,""]
["S",3,"S",0,1,5,4,0,0,0,0,"","Serviço","Serviço","-","AGETOP",85027,"ADAPTADOR P/ENGATE STORZ 2.1/2\" X 1.1/2\"","Un    ",2,1,2,null,null,0,0,""]
["S",3,"S",0,1,5,4,0,0,0,0,"","Serviço","Serviço","-","COMPOSIÇÃO","COMP 017_SEE","REDUCAO GIRATÓRIA TIPO STORZ LATAO P/ INST. PREDIAL COMBATE A INCENDIO ENGATE RAPIDO 2.1/2\" X 1.1/2\"","UN ",2,1,2,null,null,0,0,""]
["S",3,"S",0,1,5,4,0,0,0,0,"","Serviço","Serviço","-","COMPOSIÇÃO","COMP 018_SEE","CHAVE DUPLA P/ CONEXÕES TIPO STORZ EM LATÃO ENGATE RÁPIDO 1 1/2\" X 2 1/2\"","UN ",2,1,2,null,null,0,0,""]
["S",3,"S",0,1,5,4,0,0,0,0,"","Serviço","Serviço","-","AGETOP",85056,"TÊ DE FERRO GALVANIZADO 90º X 2 1/2\"","un    ",3,1,3,null,null,0,0,""]
["S",3,"S",0,1,5,4,0,0,0,0,"","Serviço","Serviço","-","COMPOSIÇÃO","COMP 030_SEE","COTOVELO DE FERRO GALV. 90° X 2 1/2\"","UN ",9,1,9,null,null,0,0,""]
["S",3,"S",0,1,5,4,0,0,0,0,"","Serviço","Serviço","-","COMPOSIÇÃO","COMP 077_SEE","UNIAO FERRO GALV C/ASSENTO CONICO BRONZE 2 1/2\"","UN ",2,1,2,null,null,0,0,""]
["S",3,"S",0,1,5,4,0,0,0,0,"","Serviço","Serviço","-","AGETOP",85047,"NIPLE DUPLO FERRO GALVANIZADO 2.1/2\"","Un    ",2,1,2,null,null,0,0,""]
["S",3,"S",0,1,5,4,0,0,0,0,"","Serviço","Serviço","-","COMPOSIÇÃO","COMP 024_SEE","SINALIZADOR FOTOLUMINESCENTE PARA EXTINTOR","UN ",2,1,2,null,null,0,0,""]
["S",3,"S",0,1,5,4,0,0,0,0,"","Serviço","Serviço","-","COMPOSIÇÃO","COMP 188_SEE","ACIONADOR MANUAL DE ALARME","UN ",2,1,2,null,null,0,0,""]
["S",3,"S",0,1,5,4,0,0,0,0,"","Serviço","Serviço","-","COMPOSIÇÃO","COMP 025_SEE","SINALIZADOR FOTOLUMINESCENTE DE EMERGÊNCIA","UN ",10,1,10,null,null,0,0,""]
["S",3,"S",0,1,5,4,0,0,0,0,"","Serviço","Serviço","-","COMPOSIÇÃO","COMP 277_SEE","MARCAÇÃO NO PISO - 1X1 M PARA EXTINTOR","M2",2,1,2,null,null,0,0,""]
["S",3,"S",0,1,5,4,0,0,0,0,"","Serviço","Serviço","-","AGETOP",71598,"LUMINÁRIA DE EMERGÊNCIA 30 LEDS","un    ",4,1,4,null,null,0,0,""]
["S",3,"S",0,1,5,4,0,0,0,0,"","Serviço","Serviço","-","SINAPI",83644,"BOMBA RECALQUE D'AGUA TRIFASICA 10,0 HP","UN",1,1,1,null,null,0,0,""]
[{"$f":"CHOOSE(1+LOG(1+2*(ORÇAMENTO.Nivel=\"Nível 1\")+4*(ORÇAMENTO.Nivel=\"Nível 2\")+8*(ORÇAMENTO.Nivel=\"Nível 3\")+16*(ORÇAMENTO.Nivel=\"Nível 4\")+32*(ORÇAMENTO.Nivel=\"Serviço\"),2),0,1,2,3,4,\"S\")","v":2},{"$f":"IF(OR(C98=\"s\",C98=0),OFFSET(B98,-1,0),C98)","v":2},{"$f":"IF(OFFSET(C98,-1,0)=\"L\",1,IF(OFFSET(C98,-1,0)=1,2,IF(OR(A98=\"s\",A98=0),\"S\",IF(AND(OFFSET(C98,-1,0)=2,A98=4),3,IF(AND(OR(OFFSET(C98,-1,0)=\"s\",OFFSET(C98,-1,0)=0),A98<>\"s\",A98>OFFSET(B98,-1,0)),OFFSET(B98,-1,0),A98)))))","v":2},{"$f":"IF(OR(C98=\"S\",C98=0),0,IF(ISERROR(K98),J98,SMALL(J98:K98,1)))","v":3},{"$f":"IF($C98=1,OFFSET(E98,-1,0)+1,OFFSET(E98,-1,0))","v":1},{"$f":"IF($C98=1,0,IF($C98=2,OFFSET(F98,-1,0)+1,OFFSET(F98,-1,0)))","v":6},{"$f":"IF(AND($C98<=2,$C98<>0),0,IF($C98=3,OFFSET(G98,-1,0)+1,OFFSET(G98,-1,0)))","v":0},{"$f":"IF(AND($C98<=3,$C98<>0),0,IF($C98=4,OFFSET(H98,-1,0)+1,OFFSET(H98,-1,0)))","v":0},{"$f":"IF(AND($C98<=4,$C98<>0),0,IF(AND($C98=\"S\",$Y98>0),OFFSET(I98,-1,0)+1,OFFSET(I98,-1,0)))","v":0},30,3,"","Nível 2","Nível 2","-",null,null,"COBERTURAS","-",null,1,"-",null,null,0,0,""]
[3,3,3,2,1,6,1,0,0,2,10,"","Nível 3","Nível 3","-",null,null,"CALHA E RUFO","-",null,1,"-",null,null,0,0,""]
["S",3,"S",0,1,6,1,0,0,0,0,"","Serviço","Serviço","-","SINAPI",94228,"CALHA EM CHAPA DE AÇO GALVANIZADO NÚMERO 24, DESENVOLVIMENTO DE 50 CM, INCLUSO TRANSPORTE VERTICAL. AF_06/2016","M",18.5,1,18.5,null,null,0,0,"Referência: AGETOP - 160601"]
[2,2,2,3,1,7,0,0,0,27,3,"","Nível 2","Nível 2","-",null,null,"ESQUADRIAS METÁLICAS","-",null,1,"-",null,null,0,0,""]
["S",2,"S",0,1,7,0,0,0,0,0,"","Serviço","Serviço","-","AGETOP",180323,"GRELHA PADRÃO AGETOP DE FERRO CHATO COM BERÇO (ESPAÇAMENTO ENTRE FACES = 1,5CM - NBR 9050 ACESSIBILIDADE)","m2    ",44,1,44,null,null,0,0,""]
["S",2,"S",0,1,7,0,0,0,0,0,"","Serviço","Serviço","-","COMPOSIÇÃO","COMP 082_SEE","CORRIMÃO PAREDE - SEDUC","M",22.34,1,22.34,null,null,0,0,""]
[2,2,2,2,1,8,0,0,0,24,2,"","Nível 2","Nível 2","-",null,null,"REVESTIMENTO DE PAREDE","-",null,1,"-",null,null,0,0,""]
[{"$f":"CHOOSE(1+LOG(1+2*(ORÇAMENTO.Nivel=\"Nível 1\")+4*(ORÇAMENTO.Nivel=\"Nível 2\")+8*(ORÇAMENTO.Nivel=\"Nível 3\")+16*(ORÇAMENTO.Nivel=\"Nível 4\")+32*(ORÇAMENTO.Nivel=\"Serviço\"),2),0,1,2,3,4,\"S\")","v":"S"},2,"S",0,1,8,0,0,{"$f":"IF(AND($C105<=4,$C105<>0),0,IF(AND($C105=\"S\",$Y105>0),OFFSET(I105,-1,0)+1,OFFSET(I105,-1,0)))","v":0},0,0,"","Serviço","Serviço","-","SINAPI",87904,"CHAPISCO APLICADO EM ALVENARIA (COM PRESENÇA DE VÃOS) E ESTRUTURAS DE CONCRETO DE FACHADA, COM COLHER DE PEDREIRO.  ARGAMASSA TRAÇO 1:3 COM PREPARO MANUAL. AF_06/2014","M2",914.4,1,914.4,null,null,0,0,"Referência: AGETOP - 200101"]
[2,{"$f":"IF(OR(C106=\"s\",C106=0),OFFSET(B106,-1,0),C106)","v":2},{"$f":"IF(OFFSET(C106,-1,0)=\"L\",1,IF(OFFSET(C106,-1,0)=1,2,IF(OR(A106=\"s\",A106=0),\"S\",IF(AND(OFFSET(C106,-1,0)=2,A106=4),3,IF(AND(OR(OFFSET(C106,-1,0)=\"s\",OFFSET(C106,-1,0)=0),A106<>\"s\",A106>OFFSET(B106,-1,0)),OFFSET(B106,-1,0),A106)))))","v":2},{"$f":"IF(OR(C106=\"S\",C106=0),0,IF(ISERROR(K106),J106,SMALL(J106:K106,1)))","v":9},{"$f":"IF($C106=1,OFFSET(E106,-1,0)+1,OFFSET(E106,-1,0))","v":1},{"$f":"IF($C106=1,0,IF($C106=2,OFFSET(F106,-1,0)+1,OFFSET(F106,-1,0)))","v":9},{"$f":"IF(AND($C106<=2,$C106<>0),0,IF($C106=3,OFFSET(G106,-1,0)+1,OFFSET(G106,-1,0)))","v":0},{"$f":"IF(AND($C106<=3,$C106<>0),0,IF($C106=4,OFFSET(H106,-1,0)+1,OFFSET(H106,-1,0)))","v":0},0,22,9,"","Nível 2","Nível 2","-",null,null,"REVESTIMENTO DE PISO","-",null,1,"-",null,null,0,0,""]
[3,3,3,2,1,9,1,0,0,8,2,"","Nível 3","Nível 3","-","SINAPI",null,"CONTRAPISO","-",null,1,"-",null,null,0,0,""]
["S",3,"S",0,1,9,1,0,0,0,0,"","Serviço","Serviço","-","SINAPI",87622,"CONTRAPISO EM ARGAMASSA TRAÇO 1:4 (CIMENTO E AREIA), PREPARO MANUAL, APLICADO EM ÁREAS SECAS SOBRE LAJE, ADERIDO, ESPESSURA 2CM. AF_06/2014","M2",2.5,1,2.5,null,null,0,0,""]
[3,3,3,2,1,9,2,0,0,6,2,"","Nível 3","Nível 3","-",null,null,"CONCRETO","-",null,1,"-",null,null,0,0,""]
["S",3,"S",0,1,9,2,0,0,0,0,"","Serviço","Serviço","-","SINAPI",94992,"EXECUÇÃO DE PASSEIO (CALÇADA) OU PISO DE CONCRETO COM CONCRETO MOLDADO IN LOCO, FEITO EM OBRA, ACABAMENTO CONVENCIONAL, ESPESSURA 6 CM, ARMADO. AF_07/2016","M2",980,1,980,null,null,0,0,"Referência: AGETOP - 220104"]
[3,3,3,2,1,9,3,0,0,4,2,"","Nível 3","Nível 3","-",null,null,"PASSEIO (CALÇADA)","-",null,1,"-",null,null,0,0,""]
["S",3,"S",0,1,9,3,0,0,0,0,"","Serviço","Serviço","-","SINAPI",94265,"GUIA (MEIO-FIO) CONCRETO, MOLDADA  IN LOCO  EM TRECHO RETO COM EXTRUSORA, 15 CM BASE X 30 CM ALTURA. AF_06/2016","M",38.799999999999997,1,38.799999999999997,null,null,0,0,""]
[3,3,3,2,1,9,4,0,0,2,{"$error":"#N/A"},"","Nível 3","Nível 3","-",null,null,"PODOTÁTIL","-",null,1,"-",null,null,0,0,""]
["S",3,"S",0,1,9,4,0,0,0,0,"","Serviço","Serviço","-","AGETOP",221126,"PISO DE LADRILHO HIDRÁULICO COLORIDO MODELO TÁTIL ( ALERTA OU DIRECIONAL) SEM LASTRO","m2    ",10.799999999999999,1,10.799999999999999,null,null,0,0,""]
[2,2,2,4,1,10,0,0,0,{"$f":"IF(OR($C115=\"S\",$C115=0),0,MATCH(0,OFFSET($D115,1,$C115,ROW($C$616)-ROW($C115)),0))","v":13},{"$f":"IF(OR($C115=\"S\",$C115=0),0,MATCH(OFFSET($D115,0,$C115)+1,OFFSET($D115,1,$C115,ROW($C$616)-ROW($C115)),0))","v":4},"","Nível 2","Nível 2","-",null,null,"ADMINISTRAÇÃO","-",null,1,"-",null,null,0,0,""]
[3,3,3,3,1,10,1,0,0,3,31,"","Nível 3","Nível 3","-",null,null,"MENSALISTAS","-",null,1,"-",null,null,0,0,""]
["S",3,"S",0,1,10,1,0,0,0,0,"","Serviço","Serviço","-","SINAPI",90778,"ENGENHEIRO CIVIL DE OBRA PLENO COM ENCARGOS COMPLEMENTARES","H",176,1,176,null,null,0,0,"Referência: AGETOP - 250101"]
["S",3,"S",0,1,10,1,0,0,0,0,"","Serviço","Serviço","-","SINAPI",90776,"ENCARREGADO GERAL COM ENCARGOS COMPLEMENTARES","H",880,1,880,null,null,0,0,"Referência: AGETOP - 250103"]
[2,2,2,3,1,11,0,0,0,9,3,"","Nível 2","Nível 2","-",null,null,"PINTURA","-",null,1,"-",null,null,0,0,""]
[{"$f":"CHOOSE(1+LOG(1+2*(ORÇAMENTO.Nivel=\"Nível 1\")+4*(ORÇAMENTO.Nivel=\"Nível 2\")+8*(ORÇAMENTO.Nivel=\"Nível 3\")+16*(ORÇAMENTO.Nivel=\"Nível 4\")+32*(ORÇAMENTO.Nivel=\"Serviço\"),2),0,1,2,3,4,\"S\")","v":3},3,3,2,{"$f":"IF($C120=1,OFFSET(E120,-1,0)+1,OFFSET(E120,-1,0))","v":1},{"$f":"IF($C120=1,0,IF($C120=2,OFFSET(F120,-1,0)+1,OFFSET(F120,-1,0)))","v":11},{"$f":"IF(AND($C120<=2,$C120<>0),0,IF($C120=3,OFFSET(G120,-1,0)+1,OFFSET(G120,-1,0)))","v":1},{"$f":"IF(AND($C120<=3,$C120<>0),0,IF($C120=4,OFFSET(H120,-1,0)+1,OFFSET(H120,-1,0)))","v":0},{"$f":"IF(AND($C120<=4,$C120<>0),0,IF(AND($C120=\"S\",$Y120>0),OFFSET(I120,-1,0)+1,OFFSET(I120,-1,0)))","v":0},2,27,"","Nível 3","Nível 3","-","AGETOP",null,"EXTERNA","-",null,1,"-",null,null,0,0,""]
["S",{"$f":"IF(OR(C121=\"s\",C121=0),OFFSET(B121,-1,0),C121)","v":3},{"$f":"IF(OFFSET(C121,-1,0)=\"L\",1,IF(OFFSET(C121,-1,0)=1,2,IF(OR(A121=\"s\",A121=0),\"S\",IF(AND(OFFSET(C121,-1,0)=2,A121=4),3,IF(AND(OR(OFFSET(C121,-1,0)=\"s\",OFFSET(C121,-1,0)=0),A121<>\"s\",A121>OFFSET(B121,-1,0)),OFFSET(B121,-1,0),A121)))))","v":"S"},{"$f":"IF(OR(C121=\"S\",C121=0),0,IF(ISERROR(K121),J121,SMALL(J121:K121,1)))","v":0},1,11,1,0,0,0,0,"","Serviço","Serviço","-","AGETOP",260202,"CAIACAO DUAS DEMAOS MUROS E PAREDES - (OB.C.)","m2    ",914.4,1,914.4,null,null,0,0,""]
[2,2,2,6,1,12,0,0,0,6,228,"","Nível 2","Nível 2","-",null,null,"DIVERSOS","-",null,1,"-",null,null,0,0,""]
["S",2,"S",0,1,12,0,0,0,0,0,"","Serviço","Serviço","-","SINAPI",98504,"PLANTIO DE GRAMA EM PLACAS. AF_05/2018","M2",991,1,991,null,null,0,0,""]
["S",2,"S",0,1,12,0,0,0,0,0,"","Serviço","Serviço","-","AGETOP",270314,"MURO DE ALVENARIA TIJOLO FURADO 1/2 VEZ ( H=3,00M) COM FUNDAÇÃO - SEM REVESTIMENTOS (PADRÃO AGETOP)","m2    ",457.2,1,457.2,null,null,0,0,""]
["S",2,"S",0,1,12,0,0,0,0,0,"","Serviço","Serviço","-","COMPOSIÇÃO","COMP 029_SEE","PLANTIO DE ARVORE REGIONAL, ALTURA MAIOR QUE 2,00M, EM CAVAS DE 80X80X80CM","UN ",3,1,3,null,null,0,0,""]
["S",2,"S",0,1,12,0,0,0,0,0,"","Serviço","Serviço","-","AGETOP",271417,"CANALETA CONCRETO DESEMPENADO 5 CM PD.AGETOP","m     ",110,1,110,null,null,0,0,""]
["S",2,"S",0,1,12,0,0,0,0,0,"","Serviço","Serviço","-","AGETOP",270501,"LIMPEZA FINAL DE OBRA - (OBRAS CIVIS)","m2    ",700,1,700,null,null,0,0,""]
[1,1,1,260,2,0,0,0,0,488,260,"F","Nível 1","Nível 1","2.","SINAPI",null,"4 SALAS COM VESTIÁRIO","UN",1,1,1,null,null,0,0,""]
[2,2,2,2,2,1,0,0,0,259,2,"","Nível 2","Nível 2","-","SINAPI",null,"SERVIÇOS PRELIMINARES","-",null,1,"-",null,null,0,0,""]
["S",2,"S",0,2,1,0,0,0,0,0,"","Serviço","Serviço","-","AGETOP",20701,"LOCAÇÃO DA OBRA, EXECUÇÃO DE GABARITO SEM REAPROVEITAMENTO, INCLUSO PINTURA (FACE INTERNA DO RIPÃO 15CM) E PIQUETE COM TESTEMUNHA","m2    ",371.75,1,371.75,null,null,0,0,"Referência: AGETOP - 20701"]
[2,2,2,3,2,2,0,0,0,257,3,"","Nível 2","Nível 2","-","AGETOP",null,"TRANSPORTES","-",null,1,"-",null,null,0,0,""]
[{"$f":"CHOOSE(1+LOG(1+2*(ORÇAMENTO.Nivel=\"Nível 1\")+4*(ORÇAMENTO.Nivel=\"Nível 2\")+8*(ORÇAMENTO.Nivel=\"Nível 3\")+16*(ORÇAMENTO.Nivel=\"Nível 4\")+32*(ORÇAMENTO.Nivel=\"Serviço\"),2),0,1,2,3,4,\"S\")","v":"S"},{"$f":"IF(OR(C132=\"s\",C132=0),OFFSET(B132,-1,0),C132)","v":2},{"$f":"IF(OFFSET(C132,-1,0)=\"L\",1,IF(OFFSET(C132,-1,0)=1,2,IF(OR(A132=\"s\",A132=0),\"S\",IF(AND(OFFSET(C132,-1,0)=2,A132=4),3,IF(AND(OR(OFFSET(C132,-1,0)=\"s\",OFFSET(C132,-1,0)=0),A132<>\"s\",A132>OFFSET(B132,-1,0)),OFFSET(B132,-1,0),A132)))))","v":"S"},{"$f":"IF(OR(C132=\"S\",C132=0),0,IF(ISERROR(K132),J132,SMALL(J132:K132,1)))","v":0},{"$f":"IF($C132=1,OFFSET(E132,-1,0)+1,OFFSET(E132,-1,0))","v":2},{"$f":"IF($C132=1,0,IF($C132=2,OFFSET(F132,-1,0)+1,OFFSET(F132,-1,0)))","v":2},{"$f":"IF(AND($C132<=2,$C132<>0),0,IF($C132=3,OFFSET(G132,-1,0)+1,OFFSET(G132,-1,0)))","v":0},{"$f":"IF(AND($C132<=3,$C132<>0),0,IF($C132=4,OFFSET(H132,-1,0)+1,OFFSET(H132,-1,0)))","v":0},{"$f":"IF(AND($C132<=4,$C132<>0),0,IF(AND($C132=\"S\",$Y132>0),OFFSET(I132,-1,0)+1,OFFSET(I132,-1,0)))","v":0},0,0,"","Serviço","Serviço","-","SINAPI",72900,"TRANSPORTE DE ENTULHO COM CAMINHAO BASCULANTE 6 M3, RODOVIA PAVIMENTADA, DMT 0,5 A 1,0 KM","M3",26.02,1,26.02,null,null,0,0,""]
["S",2,"S",0,2,2,0,0,0,0,0,"","Serviço","Serviço","-","SINAPI",72897,"CARGA MANUAL DE ENTULHO EM CAMINHAO BASCULANTE 6 M3","M3",26.02,1,26.02,null,null,0,0,""]
[2,2,2,5,2,3,0,0,0,254,5,"","Nível 2","Nível 2","-","AGETOP",null,"SERVIÇO EM TERRA","-",null,1,"-",null,null,0,0,""]
["S",2,"S",0,2,3,0,0,0,0,0,"","Serviço","Serviço","-","SINAPI",93358,"ESCAVAÇÃO MANUAL DE VALA COM PROFUNDIDADE MENOR OU IGUAL A 1,30 M. AF_03/2016","M3",31.1,1,31.1,null,null,0,0,"Referência: AGETOP - 40101"]
["S",2,"S",0,2,3,0,0,0,0,0,"","Serviço","Serviço","-","SINAPI",96995,"REATERRO MANUAL APILOADO COM SOQUETE. AF_10/2017","M3",23.92,1,23.92,null,null,0,0,"Referência: AGETOP - 40902"]
["S",2,"S",0,2,3,0,0,0,0,0,"","Serviço","Serviço","-","AGETOP",41002,"APILOAMENTO","m2    ",74.350000000000009,1,74.350000000000009,null,null,0,0,""]
["S",2,"S",0,2,3,0,0,0,0,0,"","Serviço","Serviço","-","AGETOP",41003,"ATERRO INTERNO SEM APILOAM.C/TR.EM CARRINHO MÃO","m3    ",74.350000000000009,1,74.350000000000009,null,null,0,0,""]
[2,2,2,17,2,4,0,0,0,249,17,"","Nível 2","Nível 2","-","AGETOP",null,"FUNDAÇÕES E SONDAGENS","-",null,1,"-",null,null,0,0,""]
[3,3,3,7,2,4,1,0,0,16,7,"","Nível 3","Nível 3","-","SINAPI",null,"ESTACAS E BLOCOS","-",null,1,"-",null,null,0,0,""]
["S",3,"S",0,2,4,1,0,0,0,0,"","Serviço","Serviço","-","SINAPI",98230,"ESTACA BROCA DE CONCRETO, DIÂMETRO DE 30 CM, PROFUNDIDADE DE ATÉ 3 M, ESCAVAÇÃO MANUAL COM TRADO CONCHA, NÃO ARMADA. AF_03/2018","M",351.5,1,351.5,null,null,0,0,"Referência: AGETOP - 50302"]
["S",3,"S",0,2,4,1,0,0,0,0,"","Serviço","Serviço","-","SINAPI",96522,"ESCAVAÇÃO MANUAL PARA BLOCO DE COROAMENTO OU SAPATA, SEM PREVISÃO DE FÔRMA. AF_06/2017","M3",24.19,1,24.19,null,null,0,0,"Referência: AGETOP - 50901"]
["S",3,"S",0,2,4,1,0,0,0,0,"","Serviço","Serviço","-","SINAPI",96545,"ARMAÇÃO DE BLOCO, VIGA BALDRAME OU SAPATA UTILIZANDO AÇO CA-50 DE 8 MM - MONTAGEM. AF_06/2017","KG",132,1,132,null,null,0,0,"Referência: AGETOP - 52004"]
["S",3,"S",0,2,4,1,0,0,0,0,"","Serviço","Serviço","-","SINAPI",96543,"ARMAÇÃO DE BLOCO, VIGA BALDRAME E SAPATA UTILIZANDO AÇO CA-60 DE 5 MM - MONTAGEM. AF_06/2017","KG",54,1,54,null,null,0,0,"Referência: AGETOP - 52014"]
["S",3,"S",0,2,4,1,0,0,0,0,"","Serviço","Serviço","-","SINAPI",94964,"CONCRETO FCK = 20MPA, TRAÇO 1:2,7:3 (CIMENTO/ AREIA MÉDIA/ BRITA 1)  - PREPARO MECÂNICO COM BETONEIRA 400 L. AF_07/2016","M3",15.12,1,15.12,null,null,0,0,""]
["S",3,"S",0,2,4,1,0,0,0,0,"","Serviço","Serviço","-","SINAPI","74157/4","LANCAMENTO/APLICACAO MANUAL DE CONCRETO EM FUNDACOES","M3",15.12,1,15.12,null,null,0,0,"Referência: AGETOP - 51055"]
[3,3,3,9,2,4,2,0,0,{"$f":"IF(OR($C147=\"S\",$C147=0),0,MATCH(0,OFFSET($D147,1,$C147,ROW($C$616)-ROW($C147)),0))","v":9},{"$f":"IF(OR($C147=\"S\",$C147=0),0,MATCH(OFFSET($D147,0,$C147)+1,OFFSET($D147,1,$C147,ROW($C$616)-ROW($C147)),0))","v":{"$error":"#N/A"}},"","Nível 3","Nível 3","-","SINAPI",null,"VIGAS BALDRAMES","-",null,1,"-",null,null,0,0,""]
["S",3,"S",0,2,4,2,0,0,0,0,"","Serviço","Serviço","-","AGETOP",60191,"FORMA DE TABUA CINTA BALDRAME U=8 VEZES","m2    ",119.61,1,119.61,null,null,0,0,""]
["S",3,"S",0,2,4,2,0,0,0,0,"","Serviço","Serviço","-","SINAPI",96544,"ARMAÇÃO DE BLOCO, VIGA BALDRAME OU SAPATA UTILIZANDO AÇO CA-50 DE 6,3 MM - MONTAGEM. AF_06/2017","KG",132,1,132,null,null,0,0,"Referência: AGETOP - 52003"]
["S",3,"S",0,2,4,2,0,0,0,0,"","Serviço","Serviço","-","SINAPI",96545,"ARMAÇÃO DE BLOCO, VIGA BALDRAME OU SAPATA UTILIZANDO AÇO CA-50 DE 8 MM - MONTAGEM. AF_06/2017","KG",67,1,67,null,null,0,0,"Referência: AGETOP - 52004"]
["S",3,"S",0,2,4,2,0,0,0,0,"","Serviço","Serviço","-","SINAPI",96546,"ARMAÇÃO DE BLOCO, VIGA BALDRAME OU SAPATA UTILIZANDO AÇO CA-50 DE 10 MM - MONTAGEM. AF_06/2017","KG",123,1,123,null,null,0,0,"Referência: AGETOP - 52005"]
["S",3,"S",0,2,4,2,0,0,0,0,"","Serviço","Serviço","-","SINAPI",96547,"ARMAÇÃO DE BLOCO, VIGA BALDRAME OU SAPATA UTILIZANDO AÇO CA-50 DE 12,5 MM - MONTAGEM. AF_06/2017","KG",103,1,103,null,null,0,0,"Referência: AGETOP - 52006"]
["S",3,"S",0,2,4,2,0,0,0,0,"","Serviço","Serviço","-","SINAPI",96543,"ARMAÇÃO DE BLOCO, VIGA BALDRAME E SAPATA UTILIZANDO AÇO CA-60 DE 5 MM - MONTAGEM. AF_06/2017","KG",241,1,241,null,null,0,0,"Referência: AGETOP - 52014"]
["S",3,"S",0,2,4,2,0,0,{"$f":"IF(OR($C154=\"S\",$C154=0),0,MATCH(0,OFFSET($D154,1,$C154,ROW($C$616)-ROW($C154)),0))","v":0},{"$f":"IF(OR($C154=\"S\",$C154=0),0,MATCH(OFFSET($D154,0,$C154)+1,OFFSET($D154,1,$C154,ROW($C$616)-ROW($C154)),0))","v":0},"","Serviço","Serviço","-","SINAPI",94964,"CONCRETO FCK = 20MPA, TRAÇO 1:2,7:3 (CIMENTO/ AREIA MÉDIA/ BRITA 1)  - PREPARO MECÂNICO COM BETONEIRA 400 L. AF_07/2016","M3",7.1000000000000005,1,7.1000000000000005,null,null,0,0,""]
["S",3,"S",0,2,4,2,0,0,0,0,"","Serviço","Serviço","-","SINAPI","74157/4","LANCAMENTO/APLICACAO MANUAL DE CONCRETO EM FUNDACOES","M3",7.1000000000000005,1,7.1000000000000005,null,null,0,0,"Referência: AGETOP - 51055"]
[2,2,2,19,2,5,0,0,0,232,19,"","Nível 2","Nível 2","-","AGETOP",null,"ESTRUTURA","-",null,1,"-",null,null,0,0,""]
[3,3,3,7,2,5,1,0,0,18,7,"","Nível 3","Nível 3","-","SINAPI",null,"PILARES","-",null,1,"-",null,null,0,0,""]
["S",3,"S",0,2,5,1,0,0,0,0,"","Serviço","Serviço","-","SINAPI",92418,"MONTAGEM E DESMONTAGEM DE FÔRMA DE PILARES RETANGULARES E ESTRUTURAS SIMILARES COM ÁREA MÉDIA DAS SEÇÕES MENOR OU IGUAL A 0,25 M², PÉ-DIREITO SIMPLES, EM CHAPA DE MADEIRA COMPENSADA RESINADA, 4 UTILIZAÇÕES. AF_12/2015","M2",138.56,1,138.56,null,null,0,0,"Referência: AGETOP - 60204"]
["S",3,"S",0,2,5,1,0,0,0,0,"","Serviço","Serviço","-","SINAPI",94964,"CONCRETO FCK = 20MPA, TRAÇO 1:2,7:3 (CIMENTO/ AREIA MÉDIA/ BRITA 1)  - PREPARO MECÂNICO COM BETONEIRA 400 L. AF_07/2016","M3",6.14,1,6.14,null,null,0,0,""]
["S",3,"S",0,2,5,1,0,0,0,0,"","Serviço","Serviço","-","SINAPI",92873,"LANÇAMENTO COM USO DE BALDES, ADENSAMENTO E ACABAMENTO DE CONCRETO EM ESTRUTURAS. AF_12/2015","M3",6.14,1,6.14,null,null,0,0,"Referência: AGETOP - 60801"]
["S",3,"S",0,2,5,1,0,0,0,0,"","Serviço","Serviço","-","SINAPI",92777,"ARMAÇÃO DE PILAR OU VIGA DE UMA ESTRUTURA CONVENCIONAL DE CONCRETO ARMADO EM UMA EDIFICAÇÃO TÉRREA OU SOBRADO UTILIZANDO AÇO CA-50 DE 8,0 MM - MONTAGEM. AF_12/2015","KG",27,1,27,null,null,0,0,"Referência: AGETOP - 60304"]
["S",3,"S",0,2,5,1,0,0,0,0,"","Serviço","Serviço","-","SINAPI",92778,"ARMAÇÃO DE PILAR OU VIGA DE UMA ESTRUTURA CONVENCIONAL DE CONCRETO ARMADO EM UMA EDIFICAÇÃO TÉRREA OU SOBRADO UTILIZANDO AÇO CA-50 DE 10,0 MM - MONTAGEM. AF_12/2015","KG",675,1,675,null,null,0,0,"Referência: AGETOP - 60305"]
["S",3,"S",0,2,5,1,0,0,0,0,"","Serviço","Serviço","-","SINAPI",92775,"ARMAÇÃO DE PILAR OU VIGA DE UMA ESTRUTURA CONVENCIONAL DE CONCRETO ARMADO EM UMA EDIFICAÇÃO TÉRREA OU SOBRADO UTILIZANDO AÇO CA-60 DE 5,0 MM - MONTAGEM. AF_12/2015","KG",319,1,319,null,null,0,0,"Referência: AGETOP - 60314"]
[3,3,3,11,2,5,2,0,0,11,{"$error":"#N/A"},"","Nível 3","Nível 3","-","SINAPI",null,"VIGAS DE COBERTURA","-",null,1,"-",null,null,0,0,""]
["S",3,"S",0,2,5,2,0,0,0,0,"","Serviço","Serviço","-","SINAPI",92456,"MONTAGEM E DESMONTAGEM DE FÔRMA DE VIGA, ESCORAMENTO METÁLICO, PÉ-DIREITO SIMPLES, EM CHAPA DE MADEIRA RESINADA, 4 UTILIZAÇÕES. AF_12/2015","M2",227.91,1,227.91,null,null,0,0,"Referência: AGETOP - 60204"]
["S",3,"S",0,2,5,2,0,0,0,0,"","Serviço","Serviço","-","SINAPI",94964,"CONCRETO FCK = 20MPA, TRAÇO 1:2,7:3 (CIMENTO/ AREIA MÉDIA/ BRITA 1)  - PREPARO MECÂNICO COM BETONEIRA 400 L. AF_07/2016","M3",11.6,1,11.6,null,null,0,0,""]
["S",3,"S",0,2,5,2,0,0,0,0,"","Serviço","Serviço","-","SINAPI",92873,"LANÇAMENTO COM USO DE BALDES, ADENSAMENTO E ACABAMENTO DE CONCRETO EM ESTRUTURAS. AF_12/2015","M3",11.6,1,11.6,null,null,0,0,"Referência: AGETOP - 60801"]
["S",3,"S",0,2,5,2,0,0,0,0,"","Serviço","Serviço","-","SINAPI",92776,"ARMAÇÃO DE PILAR OU VIGA DE UMA ESTRUTURA CONVENCIONAL DE CONCRETO ARMADO EM UMA EDIFICAÇÃO TÉRREA OU SOBRADO UTILIZANDO AÇO CA-50 DE 6,3 MM - MONTAGEM. AF_12/2015","KG",48,1,48,null,null,0,0,"Referência: AGETOP - 60303"]
["S",3,"S",0,2,5,2,0,0,0,0,"","Serviço","Serviço","-","SINAPI",92777,"ARMAÇÃO DE PILAR OU VIGA DE UMA ESTRUTURA CONVENCIONAL DE CONCRETO ARMADO EM UMA EDIFICAÇÃO TÉRREA OU SOBRADO UTILIZANDO AÇO CA-50 DE 8,0 MM - MONTAGEM. AF_12/2015","KG",119,1,119,null,null,0,0,"Referência: AGETOP - 60304"]
["S",3,"S",0,2,5,2,0,0,0,0,"","Serviço","Serviço","-","SINAPI",92778,"ARMAÇÃO DE PILAR OU VIGA DE UMA ESTRUTURA CONVENCIONAL DE CONCRETO ARMADO EM UMA EDIFICAÇÃO TÉRREA OU SOBRADO UTILIZANDO AÇO CA-50 DE 10,0 MM - MONTAGEM. AF_12/2015","KG",18,1,18,null,null,0,0,"Referência: AGETOP - 60305"]
["S",3,"S",0,2,5,2,0,0,0,0,"","Serviço","Serviço","-","SINAPI",92779,"ARMAÇÃO DE PILAR OU VIGA DE UMA ESTRUTURA CONVENCIONAL DE CONCRETO ARMADO EM UMA EDIFICAÇÃO TÉRREA OU SOBRADO UTILIZANDO AÇO CA-50 DE 12,5 MM - MONTAGEM. AF_12/2015","KG",619,1,619,null,null,0,0,"Referência: AGETOP - 60306"]
["S",3,"S",0,2,5,2,0,0,0,0,"","Serviço","Serviço","-","SINAPI",92775,"ARMAÇÃO DE PILAR OU VIGA DE UMA ESTRUTURA CONVENCIONAL DE CONCRETO ARMADO EM UMA EDIFICAÇÃO TÉRREA OU SOBRADO UTILIZANDO AÇO CA-60 DE 5,0 MM - MONTAGEM. AF_12/2015","KG",171,1,171,null,null,0,0,"Referência: AGETOP - 60314"]
["S",3,"S",0,2,5,2,0,0,0,0,"","Serviço","Serviço","-","SINAPI","74202/1","LAJE PRE-MOLDADA P/FORRO, SOBRECARGA 100KG/M2, VAOS ATE 3,50M/E=8CM, C/LAJOTAS E CAP.C/CONC FCK=20MPA, 3CM, INTER-EIXO 38CM, C/ESCORAMENTO (REAPR.3X) E FERRAGEM NEGATIVA","M2",270,1,270,null,null,0,0,""]
["S",3,"S",0,2,5,2,0,0,0,0,"","Serviço","Serviço","-","AGETOP",60010,"VERGA/CONTRAVERGA EM CONCRETO ARMADO FCK = 20 MPA","m3    ",0.05,1,0.05,null,null,0,0,""]
[2,2,2,61,2,6,0,0,0,213,61,"","Nível 2","Nível 2","-",null,null,"INSTALAÇÕES ELÉTRICAS","-",null,1,"-",null,null,0,0,""]
[3,3,3,33,2,6,1,0,0,60,33,"","Nível 3","Nível 3","-","SINAPI",null,"INSTALAÇÃO","-",null,1,"-",null,null,0,0,""]
["S",3,"S",0,2,6,1,0,0,0,0,"","Serviço","Serviço","-","AGETOP",70351,"BRACADEIRA METALICA TIPO \"U\" DIAM. 3/4\"","Un    ",100,1,100,null,null,0,0,""]
["S",3,"S",0,2,6,1,0,0,0,0,"","Serviço","Serviço","-","AGETOP",70352,"BRACADEIRA METALICA TIPO \"U\" DIAM. 1\"","Un    ",20,1,20,null,null,0,0,""]
["S",3,"S",0,2,6,1,0,0,0,0,"","Serviço","Serviço","-","AGETOP",70355,"BRACADEIRA METALICA TIPO \"U\" DIAM. 2\"","Un    ",5,1,5,null,null,0,0,""]
["S",3,"S",0,2,6,1,0,0,0,0,"","Serviço","Serviço","-","AGETOP",70421,"BUCHA E ARRUELA METALICA DIAM. 3/4\"","PR    ",20,1,20,null,null,0,0,""]
["S",3,"S",0,2,6,1,0,0,0,0,"","Serviço","Serviço","-","AGETOP",70422,"BUCHA E ARRUELA METALICA DIAM. 1\"","PR    ",8,1,8,null,null,0,0,""]
["S",3,"S",0,2,6,1,0,0,0,0,"","Serviço","Serviço","-","AGETOP",70425,"BUCHA E ARRUELA METALICA DIAM. 2\"","PR    ",4,1,4,null,null,0,0,""]
["S",3,"S",0,2,6,1,0,0,0,0,"","Serviço","Serviço","-","SINAPI",91926,"CABO DE COBRE FLEXÍVEL ISOLADO, 2,5 MM², ANTI-CHAMA 450/750 V, PARA CIRCUITOS TERMINAIS - FORNECIMENTO E INSTALAÇÃO. AF_12/2015","M",1200,1,1200,null,null,0,0,""]
["S",3,"S",0,2,6,1,0,0,0,0,"","Serviço","Serviço","-","SINAPI",91931,"CABO DE COBRE FLEXÍVEL ISOLADO, 6 MM², ANTI-CHAMA 0,6/1,0 KV, PARA CIRCUITOS TERMINAIS - FORNECIMENTO E INSTALAÇÃO. AF_12/2015","M",10,1,10,null,null,0,0,""]
["S",3,"S",0,2,6,1,0,0,0,0,"","Serviço","Serviço","-","SINAPI",91942,"CAIXA RETANGULAR 4\" X 4\" ALTA (2,00 M DO PISO), PVC, INSTALADA EM PAREDE - FORNECIMENTO E INSTALAÇÃO. AF_12/2015","UN",8,1,8,null,null,0,0,""]
["S",3,"S",0,2,6,1,0,0,0,0,"","Serviço","Serviço","-","SINAPI",91941,"CAIXA RETANGULAR 4\" X 2\" BAIXA (0,30 M DO PISO), PVC, INSTALADA EM PAREDE - FORNECIMENTO E INSTALAÇÃO. AF_12/2015","UN",20,1,20,null,null,0,0,"Referência: AGETOP - 70680"]
["S",3,"S",0,2,6,1,0,0,0,0,"","Serviço","Serviço","-","SINAPI",91936,"CAIXA OCTOGONAL 4\" X 4\", PVC, INSTALADA EM LAJE - FORNECIMENTO E INSTALAÇÃO. AF_12/2015","UN",40,1,40,null,null,0,0,"Referência: AGETOP - 70682"]
["S",3,"S",0,2,6,1,0,0,0,0,"","Serviço","Serviço","-","SINAPI",97891,"CAIXA ENTERRADA ELÉTRICA RETANGULAR, EM ALVENARIA COM BLOCOS DE CONCRETO, FUNDO COM BRITA, DIMENSÕES INTERNAS: 0,4X0,4X0,4 M. AF_05/2018","UN",1,1,1,null,null,0,0,"Referência: AGETOP - 70692"]
["S",3,"S",0,2,6,1,0,0,0,0,"","Serviço","Serviço","-","SINAPI",95817,"CONDULETE DE PVC, TIPO X, PARA ELETRODUTO DE PVC SOLDÁVEL DN 25 MM (3/4''), APARENTE - FORNECIMENTO E INSTALAÇÃO. AF_11/2016","UN",30,1,30,null,null,0,0,"Referência: AGETOP - 70929"]
["S",3,"S",0,2,6,1,0,0,0,0,"","Serviço","Serviço","-","SINAPI",93653,"DISJUNTOR MONOPOLAR TIPO DIN, CORRENTE NOMINAL DE 10A - FORNECIMENTO E INSTALAÇÃO. AF_04/2016","UN",4,1,4,null,null,0,0,""]
["S",3,"S",0,2,6,1,0,0,0,0,"","Serviço","Serviço","-","SINAPI",93654,"DISJUNTOR MONOPOLAR TIPO DIN, CORRENTE NOMINAL DE 16A - FORNECIMENTO E INSTALAÇÃO. AF_04/2016","UN",4,1,4,null,null,0,0,""]
["S",3,"S",0,2,6,1,0,0,0,0,"","Serviço","Serviço","-","SINAPI",93671,"DISJUNTOR TRIPOLAR TIPO DIN, CORRENTE NOMINAL DE 32A - FORNECIMENTO E INSTALAÇÃO. AF_04/2016","UN",2,1,2,null,null,0,0,""]
["S",3,"S",0,2,6,1,0,0,0,0,"","Serviço","Serviço","-","AGETOP",71201,"ELETRODUTO DE PVC RIGIDO DIAMETRO 3/4\"","M     ",250,1,250,null,null,0,0,""]
["S",3,"S",0,2,6,1,0,0,0,0,"","Serviço","Serviço","-","AGETOP",71202,"ELETRODUTO DE PVC RIGIDO DIAMETRO 1\"","M     ",50,1,50,null,null,0,0,""]
["S",3,"S",0,2,6,1,0,0,0,0,"","Serviço","Serviço","-","AGETOP",71205,"ELETRODUTO DE PVC RIGIDO DIAMETRO 2\"","M     ",10,1,10,null,null,0,0,""]
["S",3,"S",0,2,6,1,0,0,0,0,"","Serviço","Serviço","-","AGETOP",71331,"FITA ISOLANTE, ROLO DE 20,00 M","Un    ",1,1,1,null,null,0,0,"Referência: AGETOP - 71331"]
["S",3,"S",0,2,6,1,0,0,0,0,"","Serviço","Serviço","-","SINAPI",92029,"INTERRUPTOR PARALELO (1 MÓDULO) COM 1 TOMADA DE EMBUTIR 2P+T 10 A,  INCLUINDO SUPORTE E PLACA - FORNECIMENTO E INSTALAÇÃO. AF_12/2015","UN",2,1,2,null,null,0,0,""]
["S",3,"S",0,2,6,1,0,0,0,0,"","Serviço","Serviço","-","SINAPI",91953,"INTERRUPTOR SIMPLES (1 MÓDULO), 10A/250V, INCLUINDO SUPORTE E PLACA - FORNECIMENTO E INSTALAÇÃO. AF_12/2015","UN",6,1,6,null,null,0,0,"Referência: AGETOP - 71440"]
["S",3,"S",0,2,6,1,0,0,0,0,"","Serviço","Serviço","-","COMPOSIÇÃO","COMP 387_SEE","LÂMPADA LED TUBULAR 18W ","UN ",80,1,80,null,null,0,0,"Referência: AGETOP - 71567"]
["S",3,"S",0,2,6,1,0,0,0,0,"","Serviço","Serviço","-","SINAPI",97585,"LUMINÁRIA TIPO CALHA, DE SOBREPOR, COM 2 LÂMPADAS TUBULARES DE 18 W - FORNECIMENTO E INSTALAÇÃO. AF_11/2017","UN",40,1,40,null,null,0,0,""]
["S",3,"S",0,2,6,1,0,0,0,0,"","Serviço","Serviço","-","SINAPI",91884,"LUVA PARA ELETRODUTO, PVC, ROSCÁVEL, DN 25 MM (3/4\"), PARA CIRCUITOS TERMINAIS, INSTALADA EM PAREDE - FORNECIMENTO E INSTALAÇÃO. AF_12/2015","UN",100,1,100,null,null,0,0,"Referência: AGETOP - 71701"]
["S",3,"S",0,2,6,1,0,0,0,0,"","Serviço","Serviço","-","SINAPI",91885,"LUVA PARA ELETRODUTO, PVC, ROSCÁVEL, DN 32 MM (1\"), PARA CIRCUITOS TERMINAIS, INSTALADA EM PAREDE - FORNECIMENTO E INSTALAÇÃO. AF_12/2015","UN",20,1,20,null,null,0,0,"Referência: AGETOP - 71702"]
["S",3,"S",0,2,6,1,0,0,0,0,"","Serviço","Serviço","-","SINAPI",93014,"LUVA PARA ELETRODUTO, PVC, ROSCÁVEL, DN 60 MM (2\") - FORNECIMENTO E INSTALAÇÃO. AF_12/2015","UN",5,1,5,null,null,0,0,""]
["S",3,"S",0,2,6,1,0,0,0,0,"","Serviço","Serviço","-","SINAPI",91902,"CURVA 90 GRAUS PARA ELETRODUTO, PVC, ROSCÁVEL, DN 25 MM (3/4\"), PARA CIRCUITOS TERMINAIS, INSTALADA EM LAJE - FORNECIMENTO E INSTALAÇÃO. AF_12/2015","UN",18,1,18,null,null,0,0,"Referência: AGETOP - 71705"]
["S",3,"S",0,2,6,1,0,0,0,0,"","Serviço","Serviço","-","SINAPI",91905,"CURVA 90 GRAUS PARA ELETRODUTO, PVC, ROSCÁVEL, DN 32 MM (1\"), PARA CIRCUITOS TERMINAIS, INSTALADA EM LAJE - FORNECIMENTO E INSTALAÇÃO. AF_12/2015","UN",4,1,4,null,null,0,0,""]
["S",3,"S",0,2,6,1,0,0,0,0,"","Serviço","Serviço","-","SINAPI",93020,"CURVA 90 GRAUS PARA ELETRODUTO, PVC, ROSCÁVEL, DN 60 MM (2\") - FORNECIMENTO E INSTALAÇÃO. AF_12/2015","UN",2,1,2,null,null,0,0,"Referência: AGETOP - 71744"]
["S",3,"S",0,2,6,1,0,0,0,0,"","Serviço","Serviço","-","SINAPI",83463,"QUADRO DE DISTRIBUICAO DE ENERGIA EM CHAPA DE ACO GALVANIZADO, PARA 12 DISJUNTORES TERMOMAGNETICOS MONOPOLARES, COM BARRAMENTO TRIFASICO E NEUTRO - FORNECIMENTO E INSTALACAO","UN",1,1,1,null,null,0,0,"Referência: AGETOP - 72201"]
["S",3,"S",0,2,6,1,0,0,0,0,"","Serviço","Serviço","-","SINAPI",92000,"TOMADA BAIXA DE EMBUTIR (1 MÓDULO), 2P+T 10 A, INCLUINDO SUPORTE E PLACA - FORNECIMENTO E INSTALAÇÃO. AF_12/2015","UN",24,1,24,null,null,0,0,"Referência: AGETOP - 72578"]
[3,3,3,27,2,6,2,0,0,27,{"$error":"#N/A"},"","Nível 3","Nível 3","-","SINAPI",92000,"CABEAMENTO ESTRUTURADO","UN",null,1,"-",null,null,0,0,"Referência: AGETOP - 71141"]
["S",3,"S",0,2,6,2,0,0,0,0,"","Serviço","Serviço","-","AGETOP",70211,"ANILHA PLÁSTICA 25 CM","Un    ",50,1,50,null,null,0,0,""]
["S",3,"S",0,2,6,2,0,0,0,0,"","Serviço","Serviço","-","AGETOP",70422,"BUCHA E ARRUELA METALICA DIAM. 1\"","PR    ",12,1,12,null,null,0,0,""]
["S",3,"S",0,2,6,2,0,0,0,0,"","Serviço","Serviço","-","AGETOP",70425,"BUCHA E ARRUELA METALICA DIAM. 2\"","PR    ",4,1,4,null,null,0,0,""]
["S",3,"S",0,2,6,2,0,0,0,0,"","Serviço","Serviço","-","AGETOP",70626,"CABO UTP-4P, CAT. 6 , 24 AWG","M     ",150,1,150,null,null,0,0,""]
["S",3,"S",0,2,6,2,0,0,0,0,"","Serviço","Serviço","-","SINAPI",83366,"CAIXA DE PASSAGEM PARA TELEFONE 15X15X10CM (SOBREPOR), FORNECIMENTO E INSTALACAO.","UN",1,1,1,null,null,0,0,""]
["S",3,"S",0,2,6,2,0,0,0,0,"","Serviço","Serviço","-","AGETOP",70648,"CAIXA DE PASSAGEM METÁLICA DE EMBUTIR  40X40X15 CM","Un    ",1,1,1,null,null,0,0,""]
["S",3,"S",0,2,6,2,0,0,0,0,"","Serviço","Serviço","-","SINAPI",91936,"CAIXA OCTOGONAL 4\" X 4\", PVC, INSTALADA EM LAJE - FORNECIMENTO E INSTALAÇÃO. AF_12/2015","UN",4,1,4,null,null,0,0,""]
["S",3,"S",0,2,6,2,0,0,0,0,"","Serviço","Serviço","-","SINAPI",92869,"CAIXA RETANGULAR 4\" X 2\" BAIXA (0,30 M DO PISO), METÁLICA, INSTALADA EM PAREDE - FORNECIMENTO E INSTALAÇÃO. AF_12/2015","UN",11,1,11,null,null,0,0,""]
["S",3,"S",0,2,6,2,0,0,{"$f":"IF(OR($C218=\"S\",$C218=0),0,MATCH(0,OFFSET($D218,1,$C218,ROW($C$616)-ROW($C218)),0))","v":0},{"$f":"IF(OR($C218=\"S\",$C218=0),0,MATCH(OFFSET($D218,0,$C218)+1,OFFSET($D218,1,$C218,ROW($C$616)-ROW($C218)),0))","v":0},"","Serviço","Serviço","-","AGETOP",70772,"CERTIFICADO DIGITAL","Un    ",8,1,8,null,null,0,0,""]
["S",3,"S",0,2,6,2,0,0,0,0,"","Serviço","Serviço","-","SINAPI",91905,"CURVA 90 GRAUS PARA ELETRODUTO, PVC, ROSCÁVEL, DN 32 MM (1\"), PARA CIRCUITOS TERMINAIS, INSTALADA EM LAJE - FORNECIMENTO E INSTALAÇÃO. AF_12/2015","UN",14,1,14,null,null,0,0,""]
["S",3,"S",0,2,6,2,0,0,0,0,"","Serviço","Serviço","-","SINAPI",93020,"CURVA 90 GRAUS PARA ELETRODUTO, PVC, ROSCÁVEL, DN 60 MM (2\") - FORNECIMENTO E INSTALAÇÃO. AF_12/2015","UN",2,1,2,null,null,0,0,""]
["S",3,"S",0,2,6,2,0,0,0,0,"","Serviço","Serviço","-","SINAPI",91868,"ELETRODUTO RÍGIDO ROSCÁVEL, PVC, DN 32 MM (1\"), PARA CIRCUITOS TERMINAIS, INSTALADO EM LAJE - FORNECIMENTO E INSTALAÇÃO. AF_12/2015","M",84,1,84,null,null,0,0,""]
["S",3,"S",0,2,6,2,0,0,0,0,"","Serviço","Serviço","-","SINAPI",91872,"ELETRODUTO RÍGIDO ROSCÁVEL, PVC, DN 32 MM (1\"), PARA CIRCUITOS TERMINAIS, INSTALADO EM PAREDE - FORNECIMENTO E INSTALAÇÃO. AF_12/2015","M",15,1,15,null,null,0,0,""]
["S",3,"S",0,2,6,2,0,0,0,0,"","Serviço","Serviço","-","SINAPI",93009,"ELETRODUTO RÍGIDO ROSCÁVEL, PVC, DN 60 MM (2\") - FORNECIMENTO E INSTALAÇÃO. AF_12/2015","M",15,1,15,null,null,0,0,""]
["S",3,"S",0,2,6,2,0,0,0,0,"","Serviço","Serviço","-","AGETOP",71278,"ESPELHO BAQUELITE 4\" X 2\" 1 FURO RJ-45","Un    ",7,1,7,null,null,0,0,""]
["S",3,"S",0,2,6,2,0,0,0,0,"","Serviço","Serviço","-","AGETOP",71282,"FIO DE COBRE NU No. 6 MM2 (18,00 M/KG)","M     ",12,1,12,null,null,0,0,""]
["S",3,"S",0,2,6,2,0,0,0,0,"","Serviço","Serviço","-","SINAPI",91880,"LUVA PARA ELETRODUTO, PVC, ROSCÁVEL, DN 32 MM (1\"), PARA CIRCUITOS TERMINAIS, INSTALADA EM LAJE - FORNECIMENTO E INSTALAÇÃO. AF_12/2015","UN",28,1,28,null,null,0,0,""]
["S",3,"S",0,2,6,2,0,0,0,0,"","Serviço","Serviço","-","SINAPI",91885,"LUVA PARA ELETRODUTO, PVC, ROSCÁVEL, DN 32 MM (1\"), PARA CIRCUITOS TERMINAIS, INSTALADA EM PAREDE - FORNECIMENTO E INSTALAÇÃO. AF_12/2015","UN",5,1,5,null,null,0,0,""]
["S",3,"S",0,2,6,2,0,0,0,0,"","Serviço","Serviço","-","SINAPI",93014,"LUVA PARA ELETRODUTO, PVC, ROSCÁVEL, DN 60 MM (2\") - FORNECIMENTO E INSTALAÇÃO. AF_12/2015","UN",5,1,5,null,null,0,0,""]
["S",3,"S",0,2,6,2,0,0,0,0,"","Serviço","Serviço","-","AGETOP",72226,"RACK FECHADO DE PAREDE COM PORTA EM ACRÍLICO - 12 U´S ","un    ",1,1,1,null,null,0,0,""]
["S",3,"S",0,2,6,2,0,0,0,0,"","Serviço","Serviço","-","AGETOP",72397,"TAMPA CEGA PLÁSTICA 4\"X2\" COM FURO CENTRAL (PARA TV/SOM...)","un    ",4,1,4,null,null,0,0,""]
["S",3,"S",0,2,6,2,0,0,0,0,"","Serviço","Serviço","-","AGETOP",71796,"ORGANIZADOR DE CABOS (GUIA)","Un    ",1,1,1,null,null,0,0,""]
["S",3,"S",0,2,6,2,0,0,0,0,"","Serviço","Serviço","-","SINAPI",98302,"PATCH PANEL 24 PORTAS, CATEGORIA 6 - FORNECIMENTO E INSTALAÇÃO. AF_03/2018","UN",1,1,1,null,null,0,0,""]
["S",3,"S",0,2,6,2,0,0,0,0,"","Serviço","Serviço","-","SINAPI","73749/1","CAIXA ENTERRADA PARA INSTALACOES TELEFONICAS TIPO R1 0,60X0,35X0,50M EM BLOCOS DE CONCRETO ESTRUTURAL","UN",1,1,1,null,null,0,0,""]
["S",3,"S",0,2,6,2,0,0,0,0,"","Serviço","Serviço","-","SINAPI",84798,"TAMPAO FOFO P/ CAIXA R1 PADRAO TELEBRAS COMPLETO - FORNECIMENTO E INSTALACAO","UN",1,1,1,null,null,0,0,""]
["S",3,"S",0,2,6,2,0,0,0,0,"","Serviço","Serviço","-","AGETOP",72556,"TOMADA LOGICA RJ-45 TIPO KEYSTONE JACK, CAT. 6","Un    ",7,1,7,null,null,0,0,""]
[{"$f":"CHOOSE(1+LOG(1+2*(ORÇAMENTO.Nivel=\"Nível 1\")+4*(ORÇAMENTO.Nivel=\"Nível 2\")+8*(ORÇAMENTO.Nivel=\"Nível 3\")+16*(ORÇAMENTO.Nivel=\"Nível 4\")+32*(ORÇAMENTO.Nivel=\"Serviço\"),2),0,1,2,3,4,\"S\")","v":2},{"$f":"IF(OR(C236=\"s\",C236=0),OFFSET(B236,-1,0),C236)","v":2},{"$f":"IF(OFFSET(C236,-1,0)=\"L\",1,IF(OFFSET(C236,-1,0)=1,2,IF(OR(A236=\"s\",A236=0),\"S\",IF(AND(OFFSET(C236,-1,0)=2,A236=4),3,IF(AND(OR(OFFSET(C236,-1,0)=\"s\",OFFSET(C236,-1,0)=0),A236<>\"s\",A236>OFFSET(B236,-1,0)),OFFSET(B236,-1,0),A236)))))","v":2},{"$f":"IF(OR(C236=\"S\",C236=0),0,IF(ISERROR(K236),J236,SMALL(J236:K236,1)))","v":87},{"$f":"IF($C236=1,OFFSET(E236,-1,0)+1,OFFSET(E236,-1,0))","v":2},{"$f":"IF($C236=1,0,IF($C236=2,OFFSET(F236,-1,0)+1,OFFSET(F236,-1,0)))","v":7},{"$f":"IF(AND($C236<=2,$C236<>0),0,IF($C236=3,OFFSET(G236,-1,0)+1,OFFSET(G236,-1,0)))","v":0},{"$f":"IF(AND($C236<=3,$C236<>0),0,IF($C236=4,OFFSET(H236,-1,0)+1,OFFSET(H236,-1,0)))","v":0},{"$f":"IF(AND($C236<=4,$C236<>0),0,IF(AND($C236=\"S\",$Y236>0),OFFSET(I236,-1,0)+1,OFFSET(I236,-1,0)))","v":0},152,87,"","Nível 2","Nível 2","-","AGETOP",null,"INSTALAÇÕES HIDROSSANITÁRIAS","-",null,1,"-",null,null,0,0,""]
["S",2,"S",0,2,7,0,0,0,0,0,"","Serviço","Serviço","-","SINAPI",95470,"VASO SANITARIO SIFONADO CONVENCIONAL COM LOUÇA BRANCA, INCLUSO CONJUNTO DE LIGAÇÃO PARA BACIA SANITÁRIA AJUSTÁVEL - FORNECIMENTO E INSTALAÇÃO. AF_10/2016","UN",6,1,6,null,null,0,0,"Referência: AGETOP - 80502"]
["S",2,"S",0,2,7,0,0,0,0,0,"","Serviço","Serviço","-","SINAPI",99635,"VÁLVULA DE DESCARGA METÁLICA, BASE 1 1/2 \", ACABAMENTO METALICO CROMADO - FORNECIMENTO E INSTALAÇÃO. AF_01/2019","UN",6,1,6,null,null,0,0,"Referência: AGETOP - 80515"]
["S",2,"S",0,2,7,0,0,0,0,0,"","Serviço","Serviço","-","AGETOP",80513,"TUBO PARA VÁLVULA DE DESCARGA ( CURTO 1.1/4\" )","Un    ",6,1,6,null,null,0,0,""]
["S",2,"S",0,2,7,0,0,0,0,0,"","Serviço","Serviço","-","AGETOP",80520,"CONJUNTO DE FIXACAO P/VASO SANITARIO (PAR)","CJ    ",6,1,6,null,null,0,0,""]
["S",2,"S",0,2,7,0,0,0,0,0,"","Serviço","Serviço","-","AGETOP",80514,"TUBO DE LIGACAO PVC CROMADO 1.1/2\" / ESPUDE  - (ENTRADA)","Un    ",6,1,6,null,null,0,0,""]
["S",2,"S",0,2,7,0,0,0,0,0,"","Serviço","Serviço","-","AGETOP",80526,"ASSENTO EM POLIPROPILENO COM SISTEMA DE FECHAMENTO SUAVE PARA VASO SANITÁRIO","Un    ",6,1,6,null,null,0,0,""]
["S",2,"S",0,2,7,0,0,0,0,0,"","Serviço","Serviço","-","SINAPI",95544,"PAPELEIRA DE PAREDE EM METAL CROMADO SEM TAMPA, INCLUSO FIXAÇÃO. AF_10/2016","UN",6,1,6,null,null,0,0,""]
["S",2,"S",0,2,7,0,0,0,0,0,"","Serviço","Serviço","-","AGETOP",80510,"ANEL DE VEDAÇÃO PARA VASO SANITÁRIO","Un    ",6,1,6,null,null,0,0,""]
["S",2,"S",0,2,7,0,0,0,0,0,"","Serviço","Serviço","-","SINAPI",86903,"LAVATÓRIO LOUÇA BRANCA COM COLUNA, 45 X 55CM OU EQUIVALENTE, PADRÃO MÉDIO - FORNECIMENTO E INSTALAÇÃO. AF_12/2013","UN",2,1,2,null,null,0,0,"Referência: AGETOP - 80541"]
["S",2,"S",0,2,7,0,0,0,0,0,"","Serviço","Serviço","-","AGETOP",80556,"LIGAÇÃO FLEXÍVEL PVC DIAM.1/2\" (ENGATE)","Un    ",11,1,11,null,null,0,0,""]
["S",2,"S",0,2,7,0,0,0,0,0,"","Serviço","Serviço","-","SINAPI",86883,"SIFÃO DO TIPO FLEXÍVEL EM PVC 1\u0094 X 1.1/2\u0094 - FORNECIMENTO E INSTALAÇÃO. AF_12/2013","UN",11,1,11,null,null,0,0,""]
["S",2,"S",0,2,7,0,0,0,0,0,"","Serviço","Serviço","-","SINAPI",86915,"TORNEIRA CROMADA DE MESA, 1/2\" OU 3/4\", PARA LAVATÓRIO, PADRÃO MÉDIO - FORNECIMENTO E INSTALAÇÃO. AF_12/2013","UN",11,1,11,null,null,0,0,"Referência: AGETOP - 80570"]
["S",2,"S",0,2,7,0,0,0,0,0,"","Serviço","Serviço","-","SINAPI",86877,"VÁLVULA EM METAL CROMADO 1.1/2\" X 1.1/2\" PARA TANQUE OU LAVATÓRIO, COM OU SEM LADRÃO - FORNECIMENTO E INSTALAÇÃO. AF_12/2013","UN",17,1,17,null,null,0,0,"Referência: AGETOP - 80580"]
["S",2,"S",0,2,7,0,0,0,0,0,"","Serviço","Serviço","-","SINAPI",86901,"CUBA DE EMBUTIR OVAL EM LOUÇA BRANCA, 35 X 50CM OU EQUIVALENTE - FORNECIMENTO E INSTALAÇÃO. AF_12/2013","UN",9,1,9,null,null,0,0,"Referência: AGETOP - 80587"]
["S",2,"S",0,2,7,0,0,0,0,0,"","Serviço","Serviço","-","SINAPI","74234/1","MICTORIO SIFONADO DE LOUCA BRANCA COM PERTENCES, COM REGISTRO DE PRESSAO 1/2\" COM CANOPLA CROMADA ACABAMENTO SIMPLES E CONJUNTO PARA FIXACAO  - FORNECIMENTO E INSTALACAO","UN",3,1,3,null,null,0,0,"Referência: AGETOP - 80601"]
["S",2,"S",0,2,7,0,0,0,0,0,"","Serviço","Serviço","-","AGETOP",80610,"KIT FERR.P/MICT.LOUCA (ESPUDE,CONEXÃO ENTR.PARAFUSOS)","Un    ",3,1,3,null,null,0,0,""]
["S",2,"S",0,2,7,0,0,0,0,0,"","Serviço","Serviço","-","AGETOP",80613,"SIFÃO METÁLICO 1 1/2\" X 2\" P/MICTÓRIO","Un    ",3,1,3,null,null,0,0,""]
["S",2,"S",0,2,7,0,0,0,0,0,"","Serviço","Serviço","-","AGETOP",80620,"VÁLVULA PVC DE 1\" P/MICTÓRIO TIPO COCHO","Un    ",3,1,3,null,null,0,0,""]
["S",2,"S",0,2,7,0,0,0,0,0,"","Serviço","Serviço","-","SINAPI",86912,"TORNEIRA CROMADA LONGA, DE PAREDE, 1/2\" OU 3/4\", PARA PIA DE COZINHA, PADRÃO MÉDIO - FORNECIMENTO E INSTALAÇÃO. AF_12/2013","UN",6,1,6,null,null,0,0,""]
["S",2,"S",0,2,7,0,0,0,0,0,"","Serviço","Serviço","-","SINAPI",89987,"REGISTRO DE GAVETA BRUTO, LATÃO, ROSCÁVEL, 3/4\", COM ACABAMENTO E CANOPLA CROMADOS. FORNECIDO E INSTALADO EM RAMAL DE ÁGUA. AF_12/2014","UN",2,1,2,null,null,0,0,"Referência: AGETOP - 80926"]
["S",2,"S",0,2,7,0,0,0,0,0,"","Serviço","Serviço","-","SINAPI",94792,"REGISTRO DE GAVETA BRUTO, LATÃO, ROSCÁVEL, 1\u0094, COM ACABAMENTO E CANOPLA CROMADOS, INSTALADO EM RESERVAÇÃO DE ÁGUA DE EDIFICAÇÃO QUE POSSUA RESERVATÓRIO DE FIBRA/FIBROCIMENTO \u0096 FORNECIMENTO E INSTALAÇÃO. AF_06/2016","UN",4,1,4,null,null,0,0,"Referência: AGETOP - 80927"]
["S",2,"S",0,2,7,0,0,0,0,0,"","Serviço","Serviço","-","SINAPI",89402,"TUBO, PVC, SOLDÁVEL, DN 25MM, INSTALADO EM RAMAL DE DISTRIBUIÇÃO DE ÁGUA - FORNECIMENTO E INSTALAÇÃO. AF_12/2014","M",24,1,24,null,null,0,0,"Referência: AGETOP - 81003"]
["S",2,"S",0,2,7,0,0,0,0,0,"","Serviço","Serviço","-","SINAPI",89447,"TUBO, PVC, SOLDÁVEL, DN 32MM, INSTALADO EM PRUMADA DE ÁGUA - FORNECIMENTO E INSTALAÇÃO. AF_12/2014","M",12,1,12,null,null,0,0,""]
["S",2,"S",0,2,7,0,0,0,0,0,"","Serviço","Serviço","-","SINAPI",89449,"TUBO, PVC, SOLDÁVEL, DN 50MM, INSTALADO EM PRUMADA DE ÁGUA - FORNECIMENTO E INSTALAÇÃO. AF_12/2014","M",6,1,6,null,null,0,0,""]
["S",2,"S",0,2,7,0,0,0,0,0,"","Serviço","Serviço","-","SINAPI",89450,"TUBO, PVC, SOLDÁVEL, DN 60MM, INSTALADO EM PRUMADA DE ÁGUA - FORNECIMENTO E INSTALAÇÃO. AF_12/2014","M",15,1,15,null,null,0,0,""]
["S",2,"S",0,2,7,0,0,0,0,0,"","Serviço","Serviço","-","SINAPI",89451,"TUBO, PVC, SOLDÁVEL, DN 75MM, INSTALADO EM PRUMADA DE ÁGUA - FORNECIMENTO E INSTALAÇÃO. AF_12/2014","M",6,1,6,null,null,0,0,""]
["S",2,"S",0,2,7,0,0,0,0,0,"","Serviço","Serviço","-","SINAPI",89538,"ADAPTADOR CURTO COM BOLSA E ROSCA PARA REGISTRO, PVC, SOLDÁVEL, DN 25MM X 3/4\u0094, INSTALADO EM PRUMADA DE ÁGUA - FORNECIMENTO E INSTALAÇÃO. AF_12/2014","UN",4,1,4,null,null,0,0,""]
["S",2,"S",0,2,7,0,0,0,0,0,"","Serviço","Serviço","-","SINAPI",89553,"ADAPTADOR CURTO COM BOLSA E ROSCA PARA REGISTRO, PVC, SOLDÁVEL, DN 32MM X 1\u0094, INSTALADO EM PRUMADA DE ÁGUA - FORNECIMENTO E INSTALAÇÃO. AF_12/2014","UN",8,1,8,null,null,0,0,"Referência: AGETOP - 81067"]
["S",2,"S",0,2,7,0,0,0,0,0,"","Serviço","Serviço","-","SINAPI",89596,"ADAPTADOR CURTO COM BOLSA E ROSCA PARA REGISTRO, PVC, SOLDÁVEL, DN 50MM X 1.1/2\u0094, INSTALADO EM PRUMADA DE ÁGUA - FORNECIMENTO E INSTALAÇÃO. AF_12/2014","UN",6,1,6,null,null,0,0,"Referência: AGETOP - 81069"]
["S",2,"S",0,2,7,0,0,0,0,0,"","Serviço","Serviço","-","SINAPI",89528,"LUVA, PVC, SOLDÁVEL, DN 25MM, INSTALADO EM PRUMADA DE ÁGUA - FORNECIMENTO E INSTALAÇÃO. AF_12/2014","UN",3,1,3,null,null,0,0,""]
["S",2,"S",0,2,7,0,0,0,0,0,"","Serviço","Serviço","-","SINAPI",89434,"LUVA SOLDÁVEL E COM ROSCA, PVC, SOLDÁVEL, DN 32MM X 1\u0094, INSTALADO EM RAMAL DE DISTRIBUIÇÃO DE ÁGUA - FORNECIMENTO E INSTALAÇÃO. AF_12/2014","UN",2,1,2,null,null,0,0,"Referência: AGETOP - 81103"]
["S",2,"S",0,2,7,0,0,0,0,0,"","Serviço","Serviço","-","SINAPI",89575,"LUVA, PVC, SOLDÁVEL, DN 50MM, INSTALADO EM PRUMADA DE ÁGUA - FORNECIMENTO E INSTALAÇÃO. AF_12/2014","UN",2,1,2,null,null,0,0,"Referência: AGETOP - 81105"]
["S",2,"S",0,2,7,0,0,0,0,0,"","Serviço","Serviço","-","SINAPI",89597,"LUVA, PVC, SOLDÁVEL, DN 60MM, INSTALADO EM PRUMADA DE ÁGUA - FORNECIMENTO E INSTALAÇÃO. AF_12/2014","UN",1,1,1,null,null,0,0,""]
["S",2,"S",0,2,7,0,0,0,0,0,"","Serviço","Serviço","-","SINAPI",96662,"BUCHA DE REDUÇÃO, PPR, 32 X 25, CLASSE PN 25, INSTALADO EM RAMAL DE DISTRIBUIÇÃO DE ÁGUA \u0096 FORNECIMENTO E INSTALAÇÃO . AF_06/2015","UN",8,1,8,null,null,0,0,"Referência: AGETOP - 81162"]
["S",2,"S",0,2,7,0,0,0,0,0,"","Serviço","Serviço","-","SINAPI",89605,"LUVA DE REDUÇÃO, PVC, SOLDÁVEL, DN 60MM X 50MM, INSTALADO EM PRUMADA DE ÁGUA - FORNECIMENTO E INSTALAÇÃO. AF_12/2014","UN",6,1,6,null,null,0,0,"Referência: AGETOP - 81165"]
["S",2,"S",0,2,7,0,0,0,0,0,"","Serviço","Serviço","-","AGETOP",81166,"BUCHA DE REDUCAO SOLDAVEL CURTA 75 X 60 mm","Un    ",3,1,3,null,null,0,0,""]
[{"$f":"CHOOSE(1+LOG(1+2*(ORÇAMENTO.Nivel=\"Nível 1\")+4*(ORÇAMENTO.Nivel=\"Nível 2\")+8*(ORÇAMENTO.Nivel=\"Nível 3\")+16*(ORÇAMENTO.Nivel=\"Nível 4\")+32*(ORÇAMENTO.Nivel=\"Serviço\"),2),0,1,2,3,4,\"S\")","v":"S"},{"$f":"IF(OR(C273=\"s\",C273=0),OFFSET(B273,-1,0),C273)","v":2},{"$f":"IF(OFFSET(C273,-1,0)=\"L\",1,IF(OFFSET(C273,-1,0)=1,2,IF(OR(A273=\"s\",A273=0),\"S\",IF(AND(OFFSET(C273,-1,0)=2,A273=4),3,IF(AND(OR(OFFSET(C273,-1,0)=\"s\",OFFSET(C273,-1,0)=0),A273<>\"s\",A273>OFFSET(B273,-1,0)),OFFSET(B273,-1,0),A273)))))","v":"S"},{"$f":"IF(OR(C273=\"S\",C273=0),0,IF(ISERROR(K273),J273,SMALL(J273:K273,1)))","v":0},{"$f":"IF($C273=1,OFFSET(E273,-1,0)+1,OFFSET(E273,-1,0))","v":2},{"$f":"IF($C273=1,0,IF($C273=2,OFFSET(F273,-1,0)+1,OFFSET(F273,-1,0)))","v":7},{"$f":"IF(AND($C273<=2,$C273<>0),0,IF($C273=3,OFFSET(G273,-1,0)+1,OFFSET(G273,-1,0)))","v":0},{"$f":"IF(AND($C273<=3,$C273<>0),0,IF($C273=4,OFFSET(H273,-1,0)+1,OFFSET(H273,-1,0)))","v":0},{"$f":"IF(AND($C273<=4,$C273<>0),0,IF(AND($C273=\"S\",$Y273>0),OFFSET(I273,-1,0)+1,OFFSET(I273,-1,0)))","v":0},0,0,"","Serviço","Serviço","-","AGETOP",81181,"BUCHA DE REDUCAO SOLDAVEL LONGA 60 X 25 mm","Un    ",1,1,1,null,null,0,0,""]
["S",2,"S",0,2,7,0,0,0,0,0,"","Serviço","Serviço","-","AGETOP",81182,"BUCHA DE REDUCAO SOLDAVEL LONGA 60 X 32 mm","Un    ",3,1,3,null,null,0,0,""]
["S",2,"S",0,2,7,0,0,0,0,0,"","Serviço","Serviço","-","AGETOP",81164,"BUCHA DE REDUCAO SOLD.CURTO 50 X 40 mm","Un    ",3,1,3,null,null,0,0,""]
["S",2,"S",0,2,7,0,0,0,0,0,"","Serviço","Serviço","-","SINAPI",89481,"JOELHO 90 GRAUS, PVC, SOLDÁVEL, DN 25MM, INSTALADO EM PRUMADA DE ÁGUA - FORNECIMENTO E INSTALAÇÃO. AF_12/2014","UN",12,1,12,null,null,0,0,""]
["S",2,"S",0,2,7,0,0,0,0,0,"","Serviço","Serviço","-","SINAPI",89413,"JOELHO 90 GRAUS, PVC, SOLDÁVEL, DN 32MM, INSTALADO EM RAMAL DE DISTRIBUIÇÃO DE ÁGUA - FORNECIMENTO E INSTALAÇÃO. AF_12/2014","UN",6,1,6,null,null,0,0,"Referência: AGETOP - 81322"]
["S",2,"S",0,2,7,0,0,0,0,0,"","Serviço","Serviço","-","SINAPI",89501,"JOELHO 90 GRAUS, PVC, SOLDÁVEL, DN 50MM, INSTALADO EM PRUMADA DE ÁGUA - FORNECIMENTO E INSTALAÇÃO. AF_12/2014","UN",4,1,4,null,null,0,0,""]
["S",2,"S",0,2,7,0,0,0,0,0,"","Serviço","Serviço","-","SINAPI",89505,"JOELHO 90 GRAUS, PVC, SOLDÁVEL, DN 60MM, INSTALADO EM PRUMADA DE ÁGUA - FORNECIMENTO E INSTALAÇÃO. AF_12/2014","UN",2,1,2,null,null,0,0,"Referência: AGETOP - 81325"]
["S",2,"S",0,2,7,0,0,0,0,0,"","Serviço","Serviço","-","AGETOP",81360,"JOELHO RED.90 GRAUS SOLD.C/BUCHA LATAO 25X1/2\"","Un    ",12,1,12,null,null,0,0,""]
["S",2,"S",0,2,7,0,0,0,0,0,"","Serviço","Serviço","-","AGETOP",81361,"JOELHO REDUCAO 90 GRAUS SOLD./ROSCA 25 X 1/2\"","Un    ",12,1,12,null,null,0,0,""]
["S",2,"S",0,2,7,0,0,0,{"$f":"IF(OR($C282=\"S\",$C282=0),0,MATCH(0,OFFSET($D282,1,$C282,ROW($C$616)-ROW($C282)),0))","v":0},{"$f":"IF(OR($C282=\"S\",$C282=0),0,MATCH(OFFSET($D282,0,$C282)+1,OFFSET($D282,1,$C282,ROW($C$616)-ROW($C282)),0))","v":0},"","Serviço","Serviço","-","SINAPI",89617,"TE, PVC, SOLDÁVEL, DN 25MM, INSTALADO EM PRUMADA DE ÁGUA - FORNECIMENTO E INSTALAÇÃO. AF_12/2014","UN",1,1,1,null,null,0,0,""]
["S",2,"S",0,2,7,0,0,0,0,0,"","Serviço","Serviço","-","SINAPI",89443,"TE, PVC, SOLDÁVEL, DN 32MM, INSTALADO EM RAMAL DE DISTRIBUIÇÃO DE ÁGUA - FORNECIMENTO E INSTALAÇÃO. AF_12/2014","UN",4,1,4,null,null,0,0,"Referência: AGETOP - 81403"]
["S",2,"S",0,2,7,0,0,0,0,0,"","Serviço","Serviço","-","SINAPI",89628,"TE, PVC, SOLDÁVEL, DN 60MM, INSTALADO EM PRUMADA DE ÁGUA - FORNECIMENTO E INSTALAÇÃO. AF_12/2014","UN",9,1,9,null,null,0,0,"Referência: AGETOP - 81406"]
["S",2,"S",0,2,7,0,0,0,0,0,"","Serviço","Serviço","-","SINAPI",89629,"TE, PVC, SOLDÁVEL, DN 75MM, INSTALADO EM PRUMADA DE ÁGUA - FORNECIMENTO E INSTALAÇÃO. AF_12/2014","UN",1,1,1,null,null,0,0,"Referência: AGETOP - 81407"]
["S",2,"S",0,2,7,0,0,0,0,0,"","Serviço","Serviço","-","AGETOP",81445,"TE RED.SOLD.90GR.BUC.LATAO BOLSA CENT.25X25X1/2\"","Un    ",10,1,10,null,null,0,0,""]
["S",2,"S",0,2,7,0,0,0,0,0,"","Serviço","Serviço","-","AGETOP",81501,"ADESIVO PLASTICO - FRASCO 850 G","Un    ",2,1,2,null,null,0,0,""]
["S",2,"S",0,2,7,0,0,0,0,0,"","Serviço","Serviço","-","AGETOP",81504,"SOLUCAO LIMPADORA 1000 CM3","Un    ",2,1,2,null,null,0,0,""]
["S",2,"S",0,2,7,0,0,0,0,0,"","Serviço","Serviço","-","AGETOP",81662,"CORPO CX. SIFONADA DIAM. 100 X 150 X 50","Un    ",2,1,2,null,null,0,0,""]
["S",2,"S",0,2,7,0,0,0,0,0,"","Serviço","Serviço","-","AGETOP",81664,"CORPO CX. SIFONADA DIAM. 150 X 185 X 75","Un    ",2,1,2,null,null,0,0,""]
["S",2,"S",0,2,7,0,0,0,0,0,"","Serviço","Serviço","-","AGETOP",81679,"CORPO RALO SIFONADO CONICO DIAM. 100 X 40","Un    ",2,1,2,null,null,0,0,""]
["S",2,"S",0,2,7,0,0,0,0,0,"","Serviço","Serviço","-","AGETOP",81730,"CURVA 90 GRAUS CURTA DIAM. 40 MM","Un    ",17,1,17,null,null,0,0,""]
["S",2,"S",0,2,7,0,0,0,0,0,"","Serviço","Serviço","-","AGETOP",81733,"CURVA 90 GRAUS CURTA DIAM. 100 MM","Un    ",6,1,6,null,null,0,0,""]
["S",2,"S",0,2,7,0,0,0,0,0,"","Serviço","Serviço","-","SINAPI",89726,"JOELHO 45 GRAUS, PVC, SERIE NORMAL, ESGOTO PREDIAL, DN 40 MM, JUNTA SOLDÁVEL, FORNECIDO E INSTALADO EM RAMAL DE DESCARGA OU RAMAL DE ESGOTO SANITÁRIO. AF_12/2014","UN",18,1,18,null,null,0,0,""]
["S",2,"S",0,2,7,0,0,0,0,0,"","Serviço","Serviço","-","SINAPI",89806,"JOELHO 45 GRAUS, PVC, SERIE NORMAL, ESGOTO PREDIAL, DN 75 MM, JUNTA ELÁSTICA, FORNECIDO E INSTALADO EM PRUMADA DE ESGOTO SANITÁRIO OU VENTILAÇÃO. AF_12/2014","UN",2,1,2,null,null,0,0,""]
["S",2,"S",0,2,7,0,0,0,0,0,"","Serviço","Serviço","-","SINAPI",89724,"JOELHO 90 GRAUS, PVC, SERIE NORMAL, ESGOTO PREDIAL, DN 40 MM, JUNTA SOLDÁVEL, FORNECIDO E INSTALADO EM RAMAL DE DESCARGA OU RAMAL DE ESGOTO SANITÁRIO. AF_12/2014","UN",17,1,17,null,null,0,0,""]
["S",2,"S",0,2,7,0,0,0,0,0,"","Serviço","Serviço","-","SINAPI",89731,"JOELHO 90 GRAUS, PVC, SERIE NORMAL, ESGOTO PREDIAL, DN 50 MM, JUNTA ELÁSTICA, FORNECIDO E INSTALADO EM RAMAL DE DESCARGA OU RAMAL DE ESGOTO SANITÁRIO. AF_12/2014","UN",13,1,13,null,null,0,0,""]
["S",2,"S",0,2,7,0,0,0,0,0,"","Serviço","Serviço","-","SINAPI",89737,"JOELHO 90 GRAUS, PVC, SERIE NORMAL, ESGOTO PREDIAL, DN 75 MM, JUNTA ELÁSTICA, FORNECIDO E INSTALADO EM RAMAL DE DESCARGA OU RAMAL DE ESGOTO SANITÁRIO. AF_12/2014","UN",1,1,1,null,null,0,0,""]
["S",2,"S",0,2,7,0,0,0,0,0,"","Serviço","Serviço","-","SINAPI",89785,"JUNÇÃO SIMPLES, PVC, SERIE NORMAL, ESGOTO PREDIAL, DN 50 X 50 MM, JUNTA ELÁSTICA, FORNECIDO E INSTALADO EM RAMAL DE DESCARGA OU RAMAL DE ESGOTO SANITÁRIO. AF_12/2014","UN",2,1,2,null,null,0,0,"Referência: AGETOP - 81970"]
["S",2,"S",0,2,7,0,0,0,0,0,"","Serviço","Serviço","-","SINAPI",89795,"JUNÇÃO SIMPLES, PVC, SERIE NORMAL, ESGOTO PREDIAL, DN 75 X 75 MM, JUNTA ELÁSTICA, FORNECIDO E INSTALADO EM RAMAL DE DESCARGA OU RAMAL DE ESGOTO SANITÁRIO. AF_12/2014","UN",1,1,1,null,null,0,0,"Referência: AGETOP - 81972"]
["S",2,"S",0,2,7,0,0,0,0,0,"","Serviço","Serviço","-","AGETOP",81971,"JUNCAO SIMPLES DIAM. 75 X 50 MM","Un    ",3,1,3,null,null,0,0,""]
["S",2,"S",0,2,7,0,0,0,0,0,"","Serviço","Serviço","-","SINAPI",89797,"JUNÇÃO SIMPLES, PVC, SERIE NORMAL, ESGOTO PREDIAL, DN 100 X 100 MM, JUNTA ELÁSTICA, FORNECIDO E INSTALADO EM RAMAL DE DESCARGA OU RAMAL DE ESGOTO SANITÁRIO. AF_12/2014","UN",5,1,5,null,null,0,0,"Referência: AGETOP - 81975"]
["S",2,"S",0,2,7,0,0,0,0,0,"","Serviço","Serviço","-","SINAPI",89774,"LUVA SIMPLES, PVC, SERIE NORMAL, ESGOTO PREDIAL, DN 75 MM, JUNTA ELÁSTICA, FORNECIDO E INSTALADO EM RAMAL DE DESCARGA OU RAMAL DE ESGOTO SANITÁRIO. AF_12/2014","UN",1,1,1,null,null,0,0,"Referência: AGETOP - 82003"]
["S",2,"S",0,2,7,0,0,0,0,0,"","Serviço","Serviço","-","SINAPI",89778,"LUVA SIMPLES, PVC, SERIE NORMAL, ESGOTO PREDIAL, DN 100 MM, JUNTA ELÁSTICA, FORNECIDO E INSTALADO EM RAMAL DE DESCARGA OU RAMAL DE ESGOTO SANITÁRIO. AF_12/2014","UN",1,1,1,null,null,0,0,"Referência: AGETOP - 82004"]
["S",2,"S",0,2,7,0,0,0,0,0,"","Serviço","Serviço","-","SINAPI",89549,"REDUÇÃO EXCÊNTRICA, PVC, SERIE R, ÁGUA PLUVIAL, DN 75 X 50 MM, JUNTA ELÁSTICA, FORNECIDO E INSTALADO EM RAMAL DE ENCAMINHAMENTO. AF_12/2014","UN",2,1,2,null,null,0,0,""]
["S",2,"S",0,2,7,0,0,0,0,0,"","Serviço","Serviço","-","SINAPI",89825,"TE, PVC, SERIE NORMAL, ESGOTO PREDIAL, DN 50 X 50 MM, JUNTA ELÁSTICA, FORNECIDO E INSTALADO EM PRUMADA DE ESGOTO SANITÁRIO OU VENTILAÇÃO. AF_12/2014","UN",8,1,8,null,null,0,0,""]
["S",2,"S",0,2,7,0,0,0,0,0,"","Serviço","Serviço","-","AGETOP",82231,"TE SANITARIO DIAMETRO 75 X 50 MM","Un    ",4,1,4,null,null,0,0,""]
["S",2,"S",0,2,7,0,0,0,0,0,"","Serviço","Serviço","-","AGETOP",82233,"TE SANITARIO DIAMETRO 100 X 50 MM","Un    ",6,1,6,null,null,0,0,""]
["S",2,"S",0,2,7,0,0,0,0,0,"","Serviço","Serviço","-","AGETOP",82201,"TE 90 GRAUS DIAMETRO 40 MM - ESGOTO","Un    ",2,1,2,null,null,0,0,""]
["S",2,"S",0,2,7,0,0,0,0,0,"","Serviço","Serviço","-","SINAPI",89711,"TUBO PVC, SERIE NORMAL, ESGOTO PREDIAL, DN 40 MM, FORNECIDO E INSTALADO EM RAMAL DE DESCARGA OU RAMAL DE ESGOTO SANITÁRIO. AF_12/2014","M",27,1,27,null,null,0,0,"Referência: AGETOP - 82301"]
["S",2,"S",0,2,7,0,0,0,0,0,"","Serviço","Serviço","-","SINAPI",89798,"TUBO PVC, SERIE NORMAL, ESGOTO PREDIAL, DN 50 MM, FORNECIDO E INSTALADO EM PRUMADA DE ESGOTO SANITÁRIO OU VENTILAÇÃO. AF_12/2014","M",23,1,23,null,null,0,0,""]
["S",2,"S",0,2,7,0,0,0,0,0,"","Serviço","Serviço","-","SINAPI",89799,"TUBO PVC, SERIE NORMAL, ESGOTO PREDIAL, DN 75 MM, FORNECIDO E INSTALADO EM PRUMADA DE ESGOTO SANITÁRIO OU VENTILAÇÃO. AF_12/2014","M",24,1,24,null,null,0,0,""]
["S",2,"S",0,2,7,0,0,0,0,0,"","Serviço","Serviço","-","SINAPI",89800,"TUBO PVC, SERIE NORMAL, ESGOTO PREDIAL, DN 100 MM, FORNECIDO E INSTALADO EM PRUMADA DE ESGOTO SANITÁRIO OU VENTILAÇÃO. AF_12/2014","M",35,1,35,null,null,0,0,""]
["S",2,"S",0,2,7,0,0,0,0,0,"","Serviço","Serviço","-","AGETOP",81770,"GRELHA QUADRADA BRANCA DIAM. 100 MM","Un    ",2,1,2,null,null,0,0,""]
["S",2,"S",0,2,7,0,0,0,0,0,"","Serviço","Serviço","-","AGETOP",81792,"GRELHA REDONDA CROMADA DIAM.100 MM","Un    ",2,1,2,null,null,0,0,""]
["S",2,"S",0,2,7,0,0,0,0,0,"","Serviço","Serviço","-","AGETOP",81778,"GRELHA QUADRADA CROMADA DIAM. 150 MM","Un    ",2,1,2,null,null,0,0,""]
["S",2,"S",0,2,7,0,0,0,0,0,"","Serviço","Serviço","-","AGETOP",81825,"CAIXA DE PASSAGEM 60 X 60 CM SEM TAMPA","Un    ",5,1,5,null,null,0,0,""]
["S",2,"S",0,2,7,0,0,0,0,0,"","Serviço","Serviço","-","AGETOP",81885,"TERMINAL DE VENTILACAO DIAMETRO 50 MM","Un    ",1,1,1,null,null,0,0,""]
["S",2,"S",0,2,7,0,0,0,0,0,"","Serviço","Serviço","-","COMPOSIÇÃO","COMP 348_SEE","TERMINAL DE VENTILACAO, 75 MM, SERIE NORMAL, ESGOTO PREDIAL","UN ",1,1,1,null,null,0,0,""]
["S",2,"S",0,2,7,0,0,0,0,0,"","Serviço","Serviço","-","AGETOP",81826,"TAMPA EM CONCRETO ARMADO 25 MPA E=5CM PARA A CAIXA DE PASSAGEM 60X60CM","Un    ",5,1,5,null,null,0,0,""]
["S",2,"S",0,2,7,0,0,0,0,0,"","Serviço","Serviço","-","AGETOP",82052,"PORTA GRELHA QUADRADO CROMADO DIAM.150 MM","Un    ",2,1,2,null,null,0,0,""]
["S",2,"S",0,2,7,0,0,0,0,0,"","Serviço","Serviço","-","AGETOP",82053,"PORTA GRELHA QUADRADO P/GREL.QUADRADA DIAM. 100 MM","Un    ",2,1,2,null,null,0,0,""]
[2,2,2,6,2,8,0,0,0,65,6,"","Nível 2","Nível 2","-","AGETOP",null,"ALVENARIAS E DIVISÓRIAS","-",null,1,"-",null,null,0,0,""]
["S",2,"S",0,2,8,0,0,0,0,0,"","Serviço","Serviço","-","SINAPI","73937/1","COBOGO DE CONCRETO (ELEMENTO VAZADO), 7X50X50CM, ASSENTADO COM ARGAMASSA TRACO 1:4 (CIMENTO E AREIA)","M2",1.1399999999999999,1,1.1399999999999999,null,null,0,0,"Referência: AGETOP - 100501"]
["S",2,"S",0,2,8,0,0,0,0,0,"","Serviço","Serviço","-","SINAPI",87520,"ALVENARIA DE VEDAÇÃO DE BLOCOS CERÂMICOS FURADOS NA HORIZONTAL DE 9X19X19CM (ESPESSURA 9CM) DE PAREDES COM ÁREA LÍQUIDA MAIOR OU IGUAL A 6M² COM VÃOS E ARGAMASSA DE ASSENTAMENTO COM PREPARO MANUAL. AF_06/2014","M2",102.56,1,102.56,null,null,0,0,"Referência: AGETOP - 100201"]
["S",2,"S",0,2,8,0,0,0,0,0,"","Serviço","Serviço","-","AGETOP",100603,"ALVENARIA DE TIJOLO LAMINADO 1 VEZ - ARG. (1CI : 1CH : 6ARML)","m2    ",2.85,1,2.85,null,null,0,0,""]
["S",2,"S",0,2,8,0,0,0,0,0,"","Serviço","Serviço","-","AGETOP",100602,"ALVENARIA DE TIJOLO LAMINADO 1/2 VEZ  - ARG. (1CI : 1CH : 5ARML)","m2    ",224.08,1,224.08,null,null,0,0,""]
["S",2,"S",0,2,8,0,0,0,0,0,"","Serviço","Serviço","-","AGETOP",100604,"ALVENARIA DE TIJOLO LAMINADO 1/4 VEZ - ARG. (1CI : 1CH : 5ARML)","m2    ",65.63,1,65.63,null,null,0,0,""]
[2,2,2,5,2,9,0,0,0,59,5,"","Nível 2","Nível 2","-",null,null,"IMPERMEABILIZAÇÃO","-",null,1,"-",null,null,0,0,""]
["S",2,"S",0,2,9,0,0,0,0,0,"","Serviço","Serviço","-","AGETOP",121105,"IMPERMEABILIZAÇÃO DE ALICERCE / \"PÉ\" DE PAREDE / PEITORIL E ALVENARIA DE UM MODO GERAL COM CIMENTO CRISTALIZANTE SEMI FLEXÍVEL - 2 DEMÃOS ( ESPECÍFICO PARA OBRAS DE REFORMA)","m2    ",33.052,1,33.052,null,null,0,0,""]
["S",2,"S",0,2,9,0,0,0,0,0,"","Serviço","Serviço","-","AGETOP",120210,"MASTIQUE A BASE DE POLIURETANO COM PRÉVIO PREPARO E TRATAMENTO DA SUPERFÍCIE","CM3   ",6174,1,6174,null,null,0,0,""]
["S",2,"S",0,2,9,0,0,0,0,0,"","Serviço","Serviço","-","SINAPI",98562,"IMPERMEABILIZAÇÃO DE FLOREIRA OU VIGA BALDRAME COM ARGAMASSA DE CIMENTO E AREIA, COM ADITIVO IMPERMEABILIZANTE, E = 2 CM. AF_06/2018","M2",144.62,1,144.62,null,null,0,0,"Referência: AGETOP - 120902"]
["S",2,"S",0,2,9,0,0,0,0,0,"","Serviço","Serviço","-","AGETOP",120208,"IMPERMEABILIZACAO-ARGAM. SINT.SEMI - FLEXIVEL","m2    ",66.599999999999994,1,66.599999999999994,null,null,0,0,""]
[2,2,2,2,2,10,0,0,0,54,2,"","Nível 2","Nível 2","-",null,null,"ESTRUTURAS METÁLICAS","-",null,1,"-",null,null,0,0,""]
["S",2,"S",0,2,10,0,0,0,0,0,"","Serviço","Serviço","-","AGETOP",150103,"ESTRUTURA METÁLICA CONVENCIONAL EM AÇO DO TIPO USI SAC-300 COM FUNDO ANTICORROSIVO","Kg    ",5953.08,1,5953.08,null,null,0,0,""]
[2,2,2,6,2,11,0,0,0,52,6,"","Nível 2","Nível 2","-",null,null,"COBERTURAS","-",null,1,"-",null,null,0,0,""]
[{"$f":"CHOOSE(1+LOG(1+2*(ORÇAMENTO.Nivel=\"Nível 1\")+4*(ORÇAMENTO.Nivel=\"Nível 2\")+8*(ORÇAMENTO.Nivel=\"Nível 3\")+16*(ORÇAMENTO.Nivel=\"Nível 4\")+32*(ORÇAMENTO.Nivel=\"Serviço\"),2),0,1,2,3,4,\"S\")","v":"S"},{"$f":"IF(OR(C337=\"s\",C337=0),OFFSET(B337,-1,0),C337)","v":2},{"$f":"IF(OFFSET(C337,-1,0)=\"L\",1,IF(OFFSET(C337,-1,0)=1,2,IF(OR(A337=\"s\",A337=0),\"S\",IF(AND(OFFSET(C337,-1,0)=2,A337=4),3,IF(AND(OR(OFFSET(C337,-1,0)=\"s\",OFFSET(C337,-1,0)=0),A337<>\"s\",A337>OFFSET(B337,-1,0)),OFFSET(B337,-1,0),A337)))))","v":"S"},{"$f":"IF(OR(C337=\"S\",C337=0),0,IF(ISERROR(K337),J337,SMALL(J337:K337,1)))","v":0},{"$f":"IF($C337=1,OFFSET(E337,-1,0)+1,OFFSET(E337,-1,0))","v":2},{"$f":"IF($C337=1,0,IF($C337=2,OFFSET(F337,-1,0)+1,OFFSET(F337,-1,0)))","v":11},{"$f":"IF(AND($C337<=2,$C337<>0),0,IF($C337=3,OFFSET(G337,-1,0)+1,OFFSET(G337,-1,0)))","v":0},{"$f":"IF(AND($C337<=3,$C337<>0),0,IF($C337=4,OFFSET(H337,-1,0)+1,OFFSET(H337,-1,0)))","v":0},{"$f":"IF(AND($C337<=4,$C337<>0),0,IF(AND($C337=\"S\",$Y337>0),OFFSET(I337,-1,0)+1,OFFSET(I337,-1,0)))","v":0},0,0,"","Serviço","Serviço","-","SINAPI",94445,"TELHAMENTO COM TELHA CERÂMICA CAPA-CANAL, TIPO PLAN, COM ATÉ 2 ÁGUAS, INCLUSO TRANSPORTE VERTICAL. AF_06/2016","M2",491.8,1,491.8,null,null,0,0,"Referência: AGETOP - 160401"]
["S",2,"S",0,2,11,0,0,0,0,0,"","Serviço","Serviço","-","SINAPI",94221,"CUMEEIRA PARA TELHA CERÂMICA EMBOÇADA COM ARGAMASSA TRAÇO 1:2:9 (CIMENTO, CAL E AREIA) PARA TELHADOS COM ATÉ 2 ÁGUAS, INCLUSO TRANSPORTE VERTICAL. AF_06/2016","M",37.86,1,37.86,null,null,0,0,""]
["S",2,"S",0,2,11,0,0,0,0,0,"","Serviço","Serviço","-","SINAPI",94224,"EMBOÇAMENTO COM ARGAMASSA TRAÇO 1:2:9 (CIMENTO, CAL E AREIA). AF_06/2016","M",25.98,1,25.98,null,null,0,0,"Referência: AGETOP - 160403"]
["S",2,"S",0,2,11,0,0,0,0,0,"","Serviço","Serviço","-","SINAPI",94224,"EMBOÇAMENTO COM ARGAMASSA TRAÇO 1:2:9 (CIMENTO, CAL E AREIA). AF_06/2016","M",75.72,1,75.72,null,null,0,0,"Referência: AGETOP - 160404"]
["S",2,"S",0,2,11,0,0,0,0,0,"","Serviço","Serviço","-","AGETOP",160970,"FECHAMENTO LATERAL COM TELHA GALVANIZADA TRAPEZOIDAL 0,43 MM COM ACESSÓRIOS","m2    ",6.76,1,6.76,null,null,0,0,""]
[2,2,2,8,2,12,0,0,0,46,8,"","Nível 2","Nível 2","-",null,null,"ESQUADRIAS METÁLICAS","-",null,1,"-",null,null,0,0,""]
["S",2,"S",0,2,12,0,0,0,0,0,"","Serviço","Serviço","-","AGETOP",180208,"GRADE PROTECAO TIPO TIJOLINHO GP-1/GP-2","m2    ",11.69,1,11.69,null,null,0,0,""]
["S",2,"S",0,2,12,0,0,0,0,0,"","Serviço","Serviço","-","AGETOP",180406,"ESQUADRIA EM CHAPA METÁLICA TIPO VENEZIANA FIXA COM VENTILAÇÃO  J-20","m2    ",0.72,1,0.72,null,null,0,0,""]
["S",2,"S",0,2,12,0,0,0,0,0,"","Serviço","Serviço","-","SINAPI",94559,"JANELA DE AÇO BASCULANTE, FIXAÇÃO COM ARGAMASSA, SEM VIDROS, PADRONIZADA. AF_07/2016","M2",30.06,1,30.06,null,null,0,0,"Referência: AGETOP - 180404"]
["S",2,"S",0,2,12,0,0,0,{"$f":"IF(OR($C346=\"S\",$C346=0),0,MATCH(0,OFFSET($D346,1,$C346,ROW($C$616)-ROW($C346)),0))","v":0},{"$f":"IF(OR($C346=\"S\",$C346=0),0,MATCH(OFFSET($D346,0,$C346)+1,OFFSET($D346,1,$C346,ROW($C$616)-ROW($C346)),0))","v":0},"","Serviço","Serviço","-","SINAPI",94562,"JANELA DE AÇO DE CORRER, 4 FOLHAS, FIXAÇÃO COM ARGAMASSA, SEM VIDROS, PADRONIZADA. AF_07/2016","M2",30.87,1,30.87,null,null,0,0,"Referência: AGETOP - 180401"]
["S",2,"S",0,2,12,0,0,0,0,0,"","Serviço","Serviço","-","SINAPI","73933/4","PORTA DE FERRO DE ABRIR TIPO BARRA CHATA, COM REQUADRO E GUARNICAO COMPLETA","M2",21.76,1,21.76,null,null,0,0,"Referência: AGETOP - 180501"]
["S",2,"S",0,2,12,0,0,0,0,0,"","Serviço","Serviço","-","SINAPI","73933/4","PORTA DE FERRO DE ABRIR TIPO BARRA CHATA, COM REQUADRO E GUARNICAO COMPLETA","M2",6.4,1,6.4,null,null,0,0,"Referência: AGETOP - 180509"]
["S",2,"S",0,2,12,0,0,0,0,0,"","Serviço","Serviço","-","SINAPI",91341,"PORTA EM ALUMÍNIO DE ABRIR TIPO VENEZIANA COM GUARNIÇÃO, FIXAÇÃO COM PARAFUSOS - FORNECIMENTO E INSTALAÇÃO. AF_08/2015","M2",1.44,1,1.44,null,null,0,0,"Referência: AGETOP - 180504"]
[2,2,2,2,2,13,0,0,0,38,2,"","Nível 2","Nível 2","-",null,null,"VIDROS","-",null,1,"-",null,null,0,0,""]
["S",2,"S",0,2,13,0,0,0,0,0,"","Serviço","Serviço","-","SINAPI",72116,"VIDRO LISO COMUM TRANSPARENTE, ESPESSURA 3MM","M2",39.200000000000003,1,39.200000000000003,null,null,0,0,"Referência: AGETOP - 190101"]
[2,2,2,5,2,14,0,0,0,36,5,"","Nível 2","Nível 2","-",null,null,"REVESTIMENTO DE PAREDE","-",null,1,"-",null,null,0,0,""]
["S",2,"S",0,2,14,0,0,0,0,0,"","Serviço","Serviço","-","SINAPI",87553,"EMBOÇO, PARA RECEBIMENTO DE CERÂMICA, EM ARGAMASSA TRAÇO 1:2:8, PREPARO MECÂNICO COM BETONEIRA 400L, APLICADO MANUALMENTE EM FACES INTERNAS DE PAREDES, PARA AMBIENTE COM ÁREA MAIOR QUE 10M2, ESPESSURA DE 10MM, COM EXECUÇÃO DE TALISCAS. AF_06/2014","M2",144.63999999999999,1,144.63999999999999,null,null,0,0,""]
["S",2,"S",0,2,14,0,0,0,0,0,"","Serviço","Serviço","-","SINAPI",87904,"CHAPISCO APLICADO EM ALVENARIA (COM PRESENÇA DE VÃOS) E ESTRUTURAS DE CONCRETO DE FACHADA, COM COLHER DE PEDREIRO.  ARGAMASSA TRAÇO 1:3 COM PREPARO MANUAL. AF_06/2014","M2",234.92,1,234.92,null,null,0,0,"Referência: AGETOP - 200101"]
["S",2,"S",0,2,14,0,0,0,0,0,"","Serviço","Serviço","-","SINAPI",87547,"MASSA ÚNICA, PARA RECEBIMENTO DE PINTURA, EM ARGAMASSA TRAÇO 1:2:8, PREPARO MECÂNICO COM BETONEIRA 400L, APLICADA MANUALMENTE EM FACES INTERNAS DE PAREDES, ESPESSURA DE 10MM, COM EXECUÇÃO DE TALISCAS. AF_06/2014","M2",94.72,1,94.72,null,null,0,0,""]
["S",2,"S",0,2,14,0,0,0,0,0,"","Serviço","Serviço","-","AGETOP",201302,"REVESTIMENTO COM CERÂMICA ","m2    ",161.13999999999999,1,161.13999999999999,null,null,0,0,""]
[2,2,2,4,2,15,0,0,0,31,4,"","Nível 2","Nível 2","-",null,null,"FORROS","-",null,1,"-",null,null,0,0,""]
["S",2,"S",0,2,15,0,0,0,0,0,"","Serviço","Serviço","-","SINAPI",96120,"ACABAMENTOS PARA FORRO (MOLDURA DE GESSO). AF_05/2017","M",229.28,1,229.28,null,null,0,0,""]
["S",2,"S",0,2,15,0,0,0,0,0,"","Serviço","Serviço","-","SINAPI",87884,"CHAPISCO APLICADO NO TETO, COM ROLO PARA TEXTURA ACRÍLICA. ARGAMASSA INDUSTRIALIZADA COM PREPARO MANUAL. AF_06/2014","M2",235.88,1,235.88,null,null,0,0,"Referência: AGETOP - 210102"]
["S",2,"S",0,2,15,0,0,0,0,0,"","Serviço","Serviço","-","SINAPI",87414,"APLICAÇÃO MANUAL DE GESSO DESEMPENADO (SEM TALISCAS) EM TETO DE AMBIENTES DE ÁREA MAIOR QUE 10M², ESPESSURA DE 1,0CM. AF_06/2014","M2",235.88,1,235.88,null,null,0,0,"Referência: AGETOP - 210515"]
[2,2,2,7,2,16,0,0,0,27,7,"","Nível 2","Nível 2","-",null,null,"REVESTIMENTO DE PISO","-",null,1,"-",null,null,0,0,""]
["S",2,"S",0,2,16,0,0,0,0,0,"","Serviço","Serviço","-","AGETOP",220101,"LASTRO DE CONCRETO REGULARIZADO IMPERMEABILIZADO 1:3:6 ESP=5CM (BASE)","m2    ",332.55,1,332.55,null,null,0,0,""]
["S",2,"S",0,2,16,0,0,0,0,0,"","Serviço","Serviço","-","SINAPI",84191,"PISO EM GRANILITE, MARMORITE OU GRANITINA ESPESSURA 8 MM, INCLUSO JUNTAS DE DILATACAO PLASTICAS","M2",306.43,1,306.43,null,null,0,0,"Referência: AGETOP - 221101"]
["S",2,"S",0,2,16,0,0,0,0,0,"","Serviço","Serviço","-","AGETOP",221104,"RASPAGEM E APLICAÇÃO RESINA ACRÍLICA DUAS DEMÃOS","m2    ",306.43,1,306.43,null,null,0,0,""]
["S",2,"S",0,2,16,0,0,0,0,0,"","Serviço","Serviço","-","SINAPI",87251,"REVESTIMENTO CERÂMICO PARA PISO COM PLACAS TIPO ESMALTADA EXTRA DE DIMENSÕES 45X45 CM APLICADA EM AMBIENTES DE ÁREA MAIOR QUE 10 M2. AF_06/2014","M2",16.5,1,16.5,null,null,0,0,""]
["S",2,"S",0,2,16,0,0,0,0,0,"","Serviço","Serviço","-","SINAPI",94992,"EXECUÇÃO DE PASSEIO (CALÇADA) OU PISO DE CONCRETO COM CONCRETO MOLDADO IN LOCO, FEITO EM OBRA, ACABAMENTO CONVENCIONAL, ESPESSURA 6 CM, ARMADO. AF_07/2016","M2",57.54,1,57.54,null,null,0,0,"Referência: AGETOP - 220100"]
["S",2,"S",0,2,16,0,0,0,0,0,"","Serviço","Serviço","-","AGETOP",220902,"RODAPE DE MASSA (ICI:3 ARMG)","m     ",165.26,1,165.26,null,null,0,0,""]
[2,2,2,3,2,17,0,0,0,20,3,"","Nível 2","Nível 2","-",null,null,"FERRAGENS","-",null,1,"-",null,null,0,0,""]
["S",2,"S",0,2,17,0,0,0,0,0,"","Serviço","Serviço","-","AGETOP",230174,"BARRA DE APOIO EM AÇO INOX - 40 CM","un    ",6,1,6,null,null,0,0,""]
["S",2,"S",0,2,17,0,0,0,0,0,"","Serviço","Serviço","-","AGETOP",230176,"BARRA DE APOIO EM AÇO INOX - 80 CM ","un    ",6,1,6,null,null,0,0,""]
[2,2,2,2,2,18,0,0,0,17,2,"","Nível 2","Nível 2","-",null,null,"MARCENARIA","-",null,1,"-",null,null,0,0,""]
["S",2,"S",0,2,18,0,0,0,0,0,"","Serviço","Serviço","-","AGETOP",240106,"BATE CARTEIRA ENVERNIZADO E ASSENT. 2,5 X 12 CM","M     ",68.12,1,68.12,null,null,0,0,""]
[2,2,2,10,2,19,0,0,0,15,10,"","Nível 2","Nível 2","-",null,null,"PINTURA","-",null,1,"-",null,null,0,0,""]
["S",2,"S",0,2,19,0,0,0,0,0,"","Serviço","Serviço","-","SINAPI",88497,"APLICAÇÃO E LIXAMENTO DE MASSA LÁTEX EM PAREDES, DUAS DEMÃOS. AF_06/2014","M2",217.64000000000001,1,217.64000000000001,null,null,0,0,"Referência: AGETOP - 261300"]
["S",2,"S",0,2,19,0,0,0,0,0,"","Serviço","Serviço","-","SINAPI",88494,"APLICAÇÃO E LIXAMENTO DE MASSA LÁTEX EM TETO, UMA DEMÃO. AF_06/2014","M2",235.4,1,235.4,null,null,0,0,"Referência: AGETOP - 261301"]
["S",2,"S",0,2,19,0,0,0,0,0,"","Serviço","Serviço","-","SINAPI",88486,"APLICAÇÃO MANUAL DE PINTURA COM TINTA LÁTEX PVA EM TETO, DUAS DEMÃOS. AF_06/2014","M2",235.4,1,235.4,null,null,0,0,"Referência: AGETOP - 261302"]
["S",2,"S",0,2,19,0,0,0,0,0,"","Serviço","Serviço","-","SINAPI",88487,"APLICAÇÃO MANUAL DE PINTURA COM TINTA LÁTEX PVA EM PAREDES, DUAS DEMÃOS. AF_06/2014","M2",133.74,1,133.74,null,null,0,0,"Referência: AGETOP - 261302"]
["S",2,"S",0,2,19,0,0,0,0,0,"","Serviço","Serviço","-","SINAPI",95305,"TEXTURA ACRÍLICA, APLICAÇÃO MANUAL EM PAREDE, UMA DEMÃO. AF_09/2016","M2",17.260000000000002,1,17.260000000000002,null,null,0,0,"Referência: AGETOP - 260601"]
["S",2,"S",0,2,19,0,0,0,0,0,"","Serviço","Serviço","-","AGETOP",260801,"PINTURA A BASE DE SILICONE 1 DEMAO","m2    ",372.74000000000007,1,372.74000000000007,null,null,0,0,""]
["S",2,"S",0,2,19,0,0,0,0,0,"","Serviço","Serviço","-","SINAPI",88489,"APLICAÇÃO MANUAL DE PINTURA COM TINTA LÁTEX ACRÍLICA EM PAREDES, DUAS DEMÃOS. AF_06/2014","M2",118.10000000000001,1,118.10000000000001,null,null,0,0,"Referência: AGETOP - 261001"]
["S",2,"S",0,2,19,0,0,0,0,0,"","Serviço","Serviço","-","SINAPI","74145/1","PINTURA ESMALTE FOSCO, DUAS DEMAOS, SOBRE SUPERFICIE METALICA, INCLUSO UMA DEMAO DE FUNDO ANTICORROSIVO. UTILIZACAO DE REVOLVER ( AR-COMPRIMIDO).","M2",169.56,1,169.56,null,null,0,0,"Referência: AGETOP - 261602"]
["S",2,"S",0,2,19,0,0,0,0,0,"","Serviço","Serviço","-","SINAPI","74145/1","PINTURA ESMALTE FOSCO, DUAS DEMAOS, SOBRE SUPERFICIE METALICA, INCLUSO UMA DEMAO DE FUNDO ANTICORROSIVO. UTILIZACAO DE REVOLVER ( AR-COMPRIMIDO).","M2",514.6,1,514.6,null,null,0,0,"Referência: AGETOP - 261609"]
[2,2,2,5,2,20,0,0,0,5,{"$error":"#N/A"},"","Nível 2","Nível 2","-",null,null,"DIVERSOS","-",null,1,"-",null,null,0,0,""]
["S",2,"S",0,2,20,0,0,0,0,0,"","Serviço","Serviço","-","AGETOP",270501,"LIMPEZA FINAL DE OBRA - (OBRAS CIVIS)","m2    ",371.75,1,371.75,null,null,0,0,""]
["S",2,"S",0,2,20,0,0,0,0,0,"","Serviço","Serviço","-","AGETOP",271208,"QD.GIZ EMBOCO/LAM.MELAMINICO COMPL.-ESC.2000 6,87X1,39M","Un    ",4,1,4,null,null,0,0,""]
["S",2,"S",0,2,20,0,0,0,0,0,"","Serviço","Serviço","-","COMPOSIÇÃO","COMP 541_SEE","BANCADA DE GRANITO CINZA POLIDO - FORNECIMENTO E INSTALAÇÃO. ","M2    ",4.88,1,4.88,null,null,0,0,"Referência: AGETOP - 271608"]
["S",2,"S",0,2,20,0,0,0,0,0,"","Serviço","Serviço","-","AGETOP",271307,"BANCO CONCRETO POLIDO BASE EM ALVENARIA TIJOLO APARENTE PINTADA - PADRÃO AGETOP 2015","M     ",25.75,1,25.75,null,null,0,0,""]
[1,1,1,160,3,0,0,0,0,228,160,"F","Nível 1","Nível 1","3.","SINAPI",null,"4 SALAS","UN",1,1,1,null,null,0,0,""]
[2,2,2,2,3,1,0,0,0,159,2,"","Nível 2","Nível 2","-","SINAPI",null,"SERVIÇOS PRELIMINARES","-",null,1,"-",null,null,0,0,""]
["S",2,"S",0,3,1,0,0,0,0,0,"","Serviço","Serviço","-","AGETOP",20701,"LOCAÇÃO DA OBRA, EXECUÇÃO DE GABARITO SEM REAPROVEITAMENTO, INCLUSO PINTURA (FACE INTERNA DO RIPÃO 15CM) E PIQUETE COM TESTEMUNHA","m2    ",296.57,1,296.57,null,null,0,0,"Referência: AGETOP - 20701"]
[{"$f":"CHOOSE(1+LOG(1+2*(ORÇAMENTO.Nivel=\"Nível 1\")+4*(ORÇAMENTO.Nivel=\"Nível 2\")+8*(ORÇAMENTO.Nivel=\"Nível 3\")+16*(ORÇAMENTO.Nivel=\"Nível 4\")+32*(ORÇAMENTO.Nivel=\"Serviço\"),2),0,1,2,3,4,\"S\")","v":2},{"$f":"IF(OR(C391=\"s\",C391=0),OFFSET(B391,-1,0),C391)","v":2},{"$f":"IF(OFFSET(C391,-1,0)=\"L\",1,IF(OFFSET(C391,-1,0)=1,2,IF(OR(A391=\"s\",A391=0),\"S\",IF(AND(OFFSET(C391,-1,0)=2,A391=4),3,IF(AND(OR(OFFSET(C391,-1,0)=\"s\",OFFSET(C391,-1,0)=0),A391<>\"s\",A391>OFFSET(B391,-1,0)),OFFSET(B391,-1,0),A391)))))","v":2},{"$f":"IF(OR(C391=\"S\",C391=0),0,IF(ISERROR(K391),J391,SMALL(J391:K391,1)))","v":3},{"$f":"IF($C391=1,OFFSET(E391,-1,0)+1,OFFSET(E391,-1,0))","v":3},{"$f":"IF($C391=1,0,IF($C391=2,OFFSET(F391,-1,0)+1,OFFSET(F391,-1,0)))","v":2},{"$f":"IF(AND($C391<=2,$C391<>0),0,IF($C391=3,OFFSET(G391,-1,0)+1,OFFSET(G391,-1,0)))","v":0},{"$f":"IF(AND($C391<=3,$C391<>0),0,IF($C391=4,OFFSET(H391,-1,0)+1,OFFSET(H391,-1,0)))","v":0},{"$f":"IF(AND($C391<=4,$C391<>0),0,IF(AND($C391=\"S\",$Y391>0),OFFSET(I391,-1,0)+1,OFFSET(I391,-1,0)))","v":0},157,3,"","Nível 2","Nível 2","-","AGETOP",null,"TRANSPORTES","-",null,1,"-",null,null,0,0,""]
["S",2,"S",0,3,2,0,0,0,0,0,"","Serviço","Serviço","-","SINAPI",72900,"TRANSPORTE DE ENTULHO COM CAMINHAO BASCULANTE 6 M3, RODOVIA PAVIMENTADA, DMT 0,5 A 1,0 KM","M3",20.76,1,20.76,null,null,0,0,""]
["S",2,"S",0,3,2,0,0,0,0,0,"","Serviço","Serviço","-","SINAPI",72897,"CARGA MANUAL DE ENTULHO EM CAMINHAO BASCULANTE 6 M3","M3",20.76,1,20.76,null,null,0,0,""]
[2,2,2,5,3,3,0,0,0,154,5,"","Nível 2","Nível 2","-","AGETOP",null,"SERVIÇO EM TERRA","-",null,1,"-",null,null,0,0,""]
["S",2,"S",0,3,3,0,0,0,0,0,"","Serviço","Serviço","-","SINAPI",93358,"ESCAVAÇÃO MANUAL DE VALA COM PROFUNDIDADE MENOR OU IGUAL A 1,30 M. AF_03/2016","M3",20.76,1,20.76,null,null,0,0,"Referência: AGETOP - 40101"]
["S",2,"S",0,3,3,0,0,0,0,0,"","Serviço","Serviço","-","SINAPI",96995,"REATERRO MANUAL APILOADO COM SOQUETE. AF_10/2017","M3",15.71,1,15.71,null,null,0,0,"Referência: AGETOP - 40902"]
["S",2,"S",0,3,3,0,0,0,0,0,"","Serviço","Serviço","-","AGETOP",41002,"APILOAMENTO","m2    ",59.314,1,59.314,null,null,0,0,""]
["S",2,"S",0,3,3,0,0,0,0,0,"","Serviço","Serviço","-","AGETOP",41003,"ATERRO INTERNO SEM APILOAM.C/TR.EM CARRINHO MÃO","m3    ",59.314,1,59.314,null,null,0,0,""]
[2,2,2,17,3,4,0,0,0,149,17,"","Nível 2","Nível 2","-","AGETOP",null,"FUNDAÇÕES E SONDAGENS","-",null,1,"-",null,null,0,0,""]
[3,3,3,9,3,4,1,0,0,16,9,"","Nível 3","Nível 3","-","SINAPI",null,"ESTACAS E BLOCOS","-",null,1,"-",null,null,0,0,""]
["S",3,"S",0,3,4,1,0,0,0,0,"","Serviço","Serviço","-","SINAPI",98230,"ESTACA BROCA DE CONCRETO, DIÂMETRO DE 30 CM, PROFUNDIDADE DE ATÉ 3 M, ESCAVAÇÃO MANUAL COM TRADO CONCHA, NÃO ARMADA. AF_03/2018","M",239.5,1,239.5,null,null,0,0,"Referência: AGETOP - 50302"]
["S",3,"S",0,3,4,1,0,0,0,0,"","Serviço","Serviço","-","SINAPI",96522,"ESCAVAÇÃO MANUAL PARA BLOCO DE COROAMENTO OU SAPATA, SEM PREVISÃO DE FÔRMA. AF_06/2017","M3",18.82,1,18.82,null,null,0,0,"Referência: AGETOP - 50901"]
["S",3,"S",0,3,4,1,0,0,0,0,"","Serviço","Serviço","-","SINAPI",96544,"ARMAÇÃO DE BLOCO, VIGA BALDRAME OU SAPATA UTILIZANDO AÇO CA-50 DE 6,3 MM - MONTAGEM. AF_06/2017","KG",227,1,227,null,null,0,0,"Referência: AGETOP - 52003"]
["S",3,"S",0,3,4,1,0,0,0,0,"","Serviço","Serviço","-","SINAPI",96545,"ARMAÇÃO DE BLOCO, VIGA BALDRAME OU SAPATA UTILIZANDO AÇO CA-50 DE 8 MM - MONTAGEM. AF_06/2017","KG",241,1,241,null,null,0,0,"Referência: AGETOP - 52004"]
["S",3,"S",0,3,4,1,0,0,0,0,"","Serviço","Serviço","-","SINAPI",96546,"ARMAÇÃO DE BLOCO, VIGA BALDRAME OU SAPATA UTILIZANDO AÇO CA-50 DE 10 MM - MONTAGEM. AF_06/2017","KG",157,1,157,null,null,0,0,"Referência: AGETOP - 52005"]
["S",3,"S",0,3,4,1,0,0,0,0,"","Serviço","Serviço","-","SINAPI",96543,"ARMAÇÃO DE BLOCO, VIGA BALDRAME E SAPATA UTILIZANDO AÇO CA-60 DE 5 MM - MONTAGEM. AF_06/2017","KG",47,1,47,null,null,0,0,"Referência: AGETOP - 52014"]
["S",3,"S",0,3,4,1,0,0,0,0,"","Serviço","Serviço","-","SINAPI",94964,"CONCRETO FCK = 20MPA, TRAÇO 1:2,7:3 (CIMENTO/ AREIA MÉDIA/ BRITA 1)  - PREPARO MECÂNICO COM BETONEIRA 400 L. AF_07/2016","M3",11.76,1,11.76,null,null,0,0,""]
["S",3,"S",0,3,4,1,0,0,0,0,"","Serviço","Serviço","-","SINAPI","74157/4","LANCAMENTO/APLICACAO MANUAL DE CONCRETO EM FUNDACOES","M3",11.76,1,11.76,null,null,0,0,"Referência: AGETOP - 51055"]
[3,3,3,7,3,4,2,0,0,7,{"$error":"#N/A"},"","Nível 3","Nível 3","-",null,null,"VIGAS BALDRAMES","-",null,1,"-",null,null,0,0,""]
["S",3,"S",0,3,4,2,0,0,{"$f":"IF(OR($C410=\"S\",$C410=0),0,MATCH(0,OFFSET($D410,1,$C410,ROW($C$616)-ROW($C410)),0))","v":0},{"$f":"IF(OR($C410=\"S\",$C410=0),0,MATCH(OFFSET($D410,0,$C410)+1,OFFSET($D410,1,$C410,ROW($C$616)-ROW($C410)),0))","v":0},"","Serviço","Serviço","-","AGETOP",60191,"FORMA DE TABUA CINTA BALDRAME U=8 VEZES","m2    ",78.53,1,78.53,null,null,0,0,""]
["S",3,"S",0,3,4,2,0,0,0,0,"","Serviço","Serviço","-","SINAPI",96545,"ARMAÇÃO DE BLOCO, VIGA BALDRAME OU SAPATA UTILIZANDO AÇO CA-50 DE 8 MM - MONTAGEM. AF_06/2017","KG",194,1,194,null,null,0,0,"Referência: AGETOP - 52004"]
["S",3,"S",0,3,4,2,0,0,0,0,"","Serviço","Serviço","-","SINAPI",96547,"ARMAÇÃO DE BLOCO, VIGA BALDRAME OU SAPATA UTILIZANDO AÇO CA-50 DE 12,5 MM - MONTAGEM. AF_06/2017","KG",140,1,140,null,null,0,0,"Referência: AGETOP - 52006"]
["S",3,"S",0,3,4,2,0,0,0,0,"","Serviço","Serviço","-","SINAPI",96543,"ARMAÇÃO DE BLOCO, VIGA BALDRAME E SAPATA UTILIZANDO AÇO CA-60 DE 5 MM - MONTAGEM. AF_06/2017","KG",147,1,147,null,null,0,0,"Referência: AGETOP - 52014"]
["S",3,"S",0,3,4,2,0,0,0,0,"","Serviço","Serviço","-","SINAPI",94964,"CONCRETO FCK = 20MPA, TRAÇO 1:2,7:3 (CIMENTO/ AREIA MÉDIA/ BRITA 1)  - PREPARO MECÂNICO COM BETONEIRA 400 L. AF_07/2016","M3",4.7,1,4.7,null,null,0,0,""]
["S",3,"S",0,3,4,2,0,0,0,0,"","Serviço","Serviço","-","SINAPI","74157/4","LANCAMENTO/APLICACAO MANUAL DE CONCRETO EM FUNDACOES","M3",4.7,1,4.7,null,null,0,0,"Referência: AGETOP - 51055"]
[2,2,2,17,3,5,0,0,0,132,17,"","Nível 2","Nível 2","-","AGETOP",null,"ESTRUTURA","-",null,1,"-",null,null,0,0,""]
[3,3,3,7,3,5,1,0,0,16,7,"","Nível 3","Nível 3","-","SINAPI",null,"PILARES","-",null,1,"-",null,null,0,0,""]
["S",3,"S",0,3,5,1,0,0,0,0,"","Serviço","Serviço","-","SINAPI",92418,"MONTAGEM E DESMONTAGEM DE FÔRMA DE PILARES RETANGULARES E ESTRUTURAS SIMILARES COM ÁREA MÉDIA DAS SEÇÕES MENOR OU IGUAL A 0,25 M², PÉ-DIREITO SIMPLES, EM CHAPA DE MADEIRA COMPENSADA RESINADA, 4 UTILIZAÇÕES. AF_12/2015","M2",102.81,1,102.81,null,null,0,0,"Referência: AGETOP - 60204"]
["S",3,"S",0,3,5,1,0,0,0,0,"","Serviço","Serviço","-","SINAPI",94964,"CONCRETO FCK = 20MPA, TRAÇO 1:2,7:3 (CIMENTO/ AREIA MÉDIA/ BRITA 1)  - PREPARO MECÂNICO COM BETONEIRA 400 L. AF_07/2016","M3",4.6399999999999997,1,4.6399999999999997,null,null,0,0,""]
["S",3,"S",0,3,5,1,0,0,0,0,"","Serviço","Serviço","-","SINAPI",92873,"LANÇAMENTO COM USO DE BALDES, ADENSAMENTO E ACABAMENTO DE CONCRETO EM ESTRUTURAS. AF_12/2015","M3",4.6399999999999997,1,4.6399999999999997,null,null,0,0,"Referência: AGETOP - 60801"]
["S",3,"S",0,3,5,1,0,0,0,0,"","Serviço","Serviço","-","SINAPI",92777,"ARMAÇÃO DE PILAR OU VIGA DE UMA ESTRUTURA CONVENCIONAL DE CONCRETO ARMADO EM UMA EDIFICAÇÃO TÉRREA OU SOBRADO UTILIZANDO AÇO CA-50 DE 8,0 MM - MONTAGEM. AF_12/2015","KG",10,1,10,null,null,0,0,"Referência: AGETOP - 60304"]
["S",3,"S",0,3,5,1,0,0,0,0,"","Serviço","Serviço","-","SINAPI",92778,"ARMAÇÃO DE PILAR OU VIGA DE UMA ESTRUTURA CONVENCIONAL DE CONCRETO ARMADO EM UMA EDIFICAÇÃO TÉRREA OU SOBRADO UTILIZANDO AÇO CA-50 DE 10,0 MM - MONTAGEM. AF_12/2015","KG",553,1,553,null,null,0,0,"Referência: AGETOP - 60305"]
["S",3,"S",0,3,5,1,0,0,0,0,"","Serviço","Serviço","-","SINAPI",92775,"ARMAÇÃO DE PILAR OU VIGA DE UMA ESTRUTURA CONVENCIONAL DE CONCRETO ARMADO EM UMA EDIFICAÇÃO TÉRREA OU SOBRADO UTILIZANDO AÇO CA-60 DE 5,0 MM - MONTAGEM. AF_12/2015","KG",207,1,207,null,null,0,0,"Referência: AGETOP - 60314"]
[3,3,3,9,3,5,2,0,0,9,{"$error":"#N/A"},"","Nível 3","Nível 3","-","SINAPI",null,"VIGAS DE COBERTURA","-",null,1,"-",null,null,0,0,""]
["S",3,"S",0,3,5,2,0,0,0,0,"","Serviço","Serviço","-","SINAPI",92456,"MONTAGEM E DESMONTAGEM DE FÔRMA DE VIGA, ESCORAMENTO METÁLICO, PÉ-DIREITO SIMPLES, EM CHAPA DE MADEIRA RESINADA, 4 UTILIZAÇÕES. AF_12/2015","M2",176.9,1,176.9,null,null,0,0,"Referência: AGETOP - 60204"]
["S",3,"S",0,3,5,2,0,0,0,0,"","Serviço","Serviço","-","SINAPI",94964,"CONCRETO FCK = 20MPA, TRAÇO 1:2,7:3 (CIMENTO/ AREIA MÉDIA/ BRITA 1)  - PREPARO MECÂNICO COM BETONEIRA 400 L. AF_07/2016","M3",9,1,9,null,null,0,0,""]
["S",3,"S",0,3,5,2,0,0,0,0,"","Serviço","Serviço","-","SINAPI",92873,"LANÇAMENTO COM USO DE BALDES, ADENSAMENTO E ACABAMENTO DE CONCRETO EM ESTRUTURAS. AF_12/2015","M3",9,1,9,null,null,0,0,"Referência: AGETOP - 60801"]
["S",3,"S",0,3,5,2,0,0,0,0,"","Serviço","Serviço","-","SINAPI",92777,"ARMAÇÃO DE PILAR OU VIGA DE UMA ESTRUTURA CONVENCIONAL DE CONCRETO ARMADO EM UMA EDIFICAÇÃO TÉRREA OU SOBRADO UTILIZANDO AÇO CA-50 DE 8,0 MM - MONTAGEM. AF_12/2015","KG",153,1,153,null,null,0,0,"Referência: AGETOP - 60304"]
["S",3,"S",0,3,5,2,0,0,0,0,"","Serviço","Serviço","-","SINAPI",92778,"ARMAÇÃO DE PILAR OU VIGA DE UMA ESTRUTURA CONVENCIONAL DE CONCRETO ARMADO EM UMA EDIFICAÇÃO TÉRREA OU SOBRADO UTILIZANDO AÇO CA-50 DE 10,0 MM - MONTAGEM. AF_12/2015","KG",9,1,9,null,null,0,0,"Referência: AGETOP - 60305"]
["S",3,"S",0,3,5,2,0,0,0,0,"","Serviço","Serviço","-","SINAPI",92779,"ARMAÇÃO DE PILAR OU VIGA DE UMA ESTRUTURA CONVENCIONAL DE CONCRETO ARMADO EM UMA EDIFICAÇÃO TÉRREA OU SOBRADO UTILIZANDO AÇO CA-50 DE 12,5 MM - MONTAGEM. AF_12/2015","KG",530,1,530,null,null,0,0,"Referência: AGETOP - 60306"]
["S",3,"S",0,3,5,2,0,0,0,0,"","Serviço","Serviço","-","SINAPI",92775,"ARMAÇÃO DE PILAR OU VIGA DE UMA ESTRUTURA CONVENCIONAL DE CONCRETO ARMADO EM UMA EDIFICAÇÃO TÉRREA OU SOBRADO UTILIZANDO AÇO CA-60 DE 5,0 MM - MONTAGEM. AF_12/2015","KG",131,1,131,null,null,0,0,"Referência: AGETOP - 60314"]
["S",3,"S",0,3,5,2,0,0,0,0,"","Serviço","Serviço","-","SINAPI","74202/1","LAJE PRE-MOLDADA P/FORRO, SOBRECARGA 100KG/M2, VAOS ATE 3,50M/E=8CM, C/LAJOTAS E CAP.C/CONC FCK=20MPA, 3CM, INTER-EIXO 38CM, C/ESCORAMENTO (REAPR.3X) E FERRAGEM NEGATIVA","M2",216,1,216,null,null,0,0,""]
[2,2,2,60,3,6,0,0,0,115,60,"","Nível 2","Nível 2","-",null,null,"INSTALAÇÕES ELÉTRICAS","-",null,1,"-",null,null,0,0,""]
[3,3,3,32,3,6,1,0,0,59,32,"","Nível 3","Nível 3","-","SINAPI",null,"INSTALAÇÃO","-",null,1,"-",null,null,0,0,""]
["S",3,"S",0,3,6,1,0,0,0,0,"","Serviço","Serviço","-","AGETOP",70351,"BRACADEIRA METALICA TIPO \"U\" DIAM. 3/4\"","Un    ",80,1,80,null,null,0,0,""]
["S",3,"S",0,3,6,1,0,0,0,0,"","Serviço","Serviço","-","AGETOP",70352,"BRACADEIRA METALICA TIPO \"U\" DIAM. 1\"","Un    ",20,1,20,null,null,0,0,""]
["S",3,"S",0,3,6,1,0,0,0,0,"","Serviço","Serviço","-","AGETOP",70355,"BRACADEIRA METALICA TIPO \"U\" DIAM. 2\"","Un    ",5,1,5,null,null,0,0,""]
["S",3,"S",0,3,6,1,0,0,0,0,"","Serviço","Serviço","-","AGETOP",70421,"BUCHA E ARRUELA METALICA DIAM. 3/4\"","PR    ",20,1,20,null,null,0,0,""]
["S",3,"S",0,3,6,1,0,0,0,0,"","Serviço","Serviço","-","AGETOP",70422,"BUCHA E ARRUELA METALICA DIAM. 1\"","PR    ",8,1,8,null,null,0,0,""]
["S",3,"S",0,3,6,1,0,0,0,0,"","Serviço","Serviço","-","AGETOP",70425,"BUCHA E ARRUELA METALICA DIAM. 2\"","PR    ",4,1,4,null,null,0,0,""]
["S",3,"S",0,3,6,1,0,0,0,0,"","Serviço","Serviço","-","SINAPI",91926,"CABO DE COBRE FLEXÍVEL ISOLADO, 2,5 MM², ANTI-CHAMA 450/750 V, PARA CIRCUITOS TERMINAIS - FORNECIMENTO E INSTALAÇÃO. AF_12/2015","M",980,1,980,null,null,0,0,""]
["S",3,"S",0,3,6,1,0,0,0,0,"","Serviço","Serviço","-","SINAPI",91931,"CABO DE COBRE FLEXÍVEL ISOLADO, 6 MM², ANTI-CHAMA 0,6/1,0 KV, PARA CIRCUITOS TERMINAIS - FORNECIMENTO E INSTALAÇÃO. AF_12/2015","M",10,1,10,null,null,0,0,""]
["S",3,"S",0,3,6,1,0,0,0,0,"","Serviço","Serviço","-","SINAPI",91942,"CAIXA RETANGULAR 4\" X 4\" ALTA (2,00 M DO PISO), PVC, INSTALADA EM PAREDE - FORNECIMENTO E INSTALAÇÃO. AF_12/2015","UN",8,1,8,null,null,0,0,""]
["S",3,"S",0,3,6,1,0,0,0,0,"","Serviço","Serviço","-","SINAPI",91941,"CAIXA RETANGULAR 4\" X 2\" BAIXA (0,30 M DO PISO), PVC, INSTALADA EM PAREDE - FORNECIMENTO E INSTALAÇÃO. AF_12/2015","UN",20,1,20,null,null,0,0,"Referência: AGETOP - 70680"]
["S",3,"S",0,3,6,1,0,0,0,0,"","Serviço","Serviço","-","SINAPI",91936,"CAIXA OCTOGONAL 4\" X 4\", PVC, INSTALADA EM LAJE - FORNECIMENTO E INSTALAÇÃO. AF_12/2015","UN",40,1,40,null,null,0,0,"Referência: AGETOP - 70682"]
["S",3,"S",0,3,6,1,0,0,0,0,"","Serviço","Serviço","-","SINAPI",97891,"CAIXA ENTERRADA ELÉTRICA RETANGULAR, EM ALVENARIA COM BLOCOS DE CONCRETO, FUNDO COM BRITA, DIMENSÕES INTERNAS: 0,4X0,4X0,4 M. AF_05/2018","UN",1,1,1,null,null,0,0,"Referência: AGETOP - 70692"]
["S",3,"S",0,3,6,1,0,0,0,0,"","Serviço","Serviço","-","SINAPI",95817,"CONDULETE DE PVC, TIPO X, PARA ELETRODUTO DE PVC SOLDÁVEL DN 25 MM (3/4''), APARENTE - FORNECIMENTO E INSTALAÇÃO. AF_11/2016","UN",22,1,22,null,null,0,0,"Referência: AGETOP - 70929"]
["S",3,"S",0,3,6,1,0,0,0,0,"","Serviço","Serviço","-","SINAPI",93654,"DISJUNTOR MONOPOLAR TIPO DIN, CORRENTE NOMINAL DE 16A - FORNECIMENTO E INSTALAÇÃO. AF_04/2016","UN",8,1,8,null,null,0,0,""]
["S",3,"S",0,3,6,1,0,0,0,0,"","Serviço","Serviço","-","SINAPI",93670,"DISJUNTOR TRIPOLAR TIPO DIN, CORRENTE NOMINAL DE 25A - FORNECIMENTO E INSTALAÇÃO. AF_04/2016","UN",2,1,2,null,null,0,0,""]
["S",3,"S",0,3,6,1,0,0,0,0,"","Serviço","Serviço","-","AGETOP",71201,"ELETRODUTO DE PVC RIGIDO DIAMETRO 3/4\"","M     ",200,1,200,null,null,0,0,""]
["S",3,"S",0,3,6,1,0,0,0,0,"","Serviço","Serviço","-","AGETOP",71202,"ELETRODUTO DE PVC RIGIDO DIAMETRO 1\"","M     ",50,1,50,null,null,0,0,""]
["S",3,"S",0,3,6,1,0,0,0,0,"","Serviço","Serviço","-","AGETOP",71205,"ELETRODUTO DE PVC RIGIDO DIAMETRO 2\"","M     ",10,1,10,null,null,0,0,""]
["S",3,"S",0,3,6,1,0,0,0,0,"","Serviço","Serviço","-","AGETOP",71331,"FITA ISOLANTE, ROLO DE 20,00 M","Un    ",1,1,1,null,null,0,0,"Referência: AGETOP - 71331"]
["S",3,"S",0,3,6,1,0,0,0,0,"","Serviço","Serviço","-","SINAPI",92029,"INTERRUPTOR PARALELO (1 MÓDULO) COM 1 TOMADA DE EMBUTIR 2P+T 10 A,  INCLUINDO SUPORTE E PLACA - FORNECIMENTO E INSTALAÇÃO. AF_12/2015","UN",2,1,2,null,null,0,0,""]
["S",3,"S",0,3,6,1,0,0,0,0,"","Serviço","Serviço","-","SINAPI",91953,"INTERRUPTOR SIMPLES (1 MÓDULO), 10A/250V, INCLUINDO SUPORTE E PLACA - FORNECIMENTO E INSTALAÇÃO. AF_12/2015","UN",2,1,2,null,null,0,0,"Referência: AGETOP - 71440"]
["S",3,"S",0,3,6,1,0,0,0,0,"","Serviço","Serviço","-","COMPOSIÇÃO","COMP 387_SEE","LÂMPADA LED TUBULAR 18W ","UN ",62,1,62,null,null,0,0,"Referência: AGETOP - 71567"]
["S",3,"S",0,3,6,1,0,0,0,0,"","Serviço","Serviço","-","SINAPI",97585,"LUMINÁRIA TIPO CALHA, DE SOBREPOR, COM 2 LÂMPADAS TUBULARES DE 18 W - FORNECIMENTO E INSTALAÇÃO. AF_11/2017","UN",31,1,31,null,null,0,0,""]
["S",3,"S",0,3,6,1,0,0,0,0,"","Serviço","Serviço","-","SINAPI",91884,"LUVA PARA ELETRODUTO, PVC, ROSCÁVEL, DN 25 MM (3/4\"), PARA CIRCUITOS TERMINAIS, INSTALADA EM PAREDE - FORNECIMENTO E INSTALAÇÃO. AF_12/2015","UN",80,1,80,null,null,0,0,"Referência: AGETOP - 71701"]
["S",3,"S",0,3,6,1,0,0,0,0,"","Serviço","Serviço","-","SINAPI",91885,"LUVA PARA ELETRODUTO, PVC, ROSCÁVEL, DN 32 MM (1\"), PARA CIRCUITOS TERMINAIS, INSTALADA EM PAREDE - FORNECIMENTO E INSTALAÇÃO. AF_12/2015","UN",20,1,20,null,null,0,0,"Referência: AGETOP - 71702"]
["S",3,"S",0,3,6,1,0,0,0,0,"","Serviço","Serviço","-","SINAPI",93014,"LUVA PARA ELETRODUTO, PVC, ROSCÁVEL, DN 60 MM (2\") - FORNECIMENTO E INSTALAÇÃO. AF_12/2015","UN",5,1,5,null,null,0,0,""]
["S",3,"S",0,3,6,1,0,0,0,0,"","Serviço","Serviço","-","SINAPI",91902,"CURVA 90 GRAUS PARA ELETRODUTO, PVC, ROSCÁVEL, DN 25 MM (3/4\"), PARA CIRCUITOS TERMINAIS, INSTALADA EM LAJE - FORNECIMENTO E INSTALAÇÃO. AF_12/2015","UN",18,1,18,null,null,0,0,"Referência: AGETOP - 71705"]
["S",3,"S",0,3,6,1,0,0,0,0,"","Serviço","Serviço","-","SINAPI",91905,"CURVA 90 GRAUS PARA ELETRODUTO, PVC, ROSCÁVEL, DN 32 MM (1\"), PARA CIRCUITOS TERMINAIS, INSTALADA EM LAJE - FORNECIMENTO E INSTALAÇÃO. AF_12/2015","UN",4,1,4,null,null,0,0,""]
["S",3,"S",0,3,6,1,0,0,0,0,"","Serviço","Serviço","-","SINAPI",93020,"CURVA 90 GRAUS PARA ELETRODUTO, PVC, ROSCÁVEL, DN 60 MM (2\") - FORNECIMENTO E INSTALAÇÃO. AF_12/2015","UN",2,1,2,null,null,0,0,"Referência: AGETOP - 71744"]
["S",3,"S",0,3,6,1,0,0,0,0,"","Serviço","Serviço","-","SINAPI",83463,"QUADRO DE DISTRIBUICAO DE ENERGIA EM CHAPA DE ACO GALVANIZADO, PARA 12 DISJUNTORES TERMOMAGNETICOS MONOPOLARES, COM BARRAMENTO TRIFASICO E NEUTRO - FORNECIMENTO E INSTALACAO","UN",1,1,1,null,null,0,0,"Referência: AGETOP - 72201"]
["S",3,"S",0,3,6,1,0,0,0,0,"","Serviço","Serviço","-","SINAPI",92000,"TOMADA BAIXA DE EMBUTIR (1 MÓDULO), 2P+T 10 A, INCLUINDO SUPORTE E PLACA - FORNECIMENTO E INSTALAÇÃO. AF_12/2015","UN",24,1,24,null,null,0,0,"Referência: AGETOP - 72578"]
[3,3,3,27,3,6,2,0,0,27,{"$error":"#N/A"},"","Nível 3","Nível 3","-","SINAPI",null,"CABEAMENTO ESTRUTURADO","-",null,1,"-",null,null,0,0,"Referência: AGETOP - 71141"]
["S",3,"S",0,3,6,2,0,0,0,0,"","Serviço","Serviço","-","AGETOP",70211,"ANILHA PLÁSTICA 25 CM","Un    ",50,1,50,null,null,0,0,""]
["S",3,"S",0,3,6,2,0,0,0,0,"","Serviço","Serviço","-","AGETOP",70422,"BUCHA E ARRUELA METALICA DIAM. 1\"","PR    ",12,1,12,null,null,0,0,""]
["S",3,"S",0,3,6,2,0,0,0,0,"","Serviço","Serviço","-","AGETOP",70425,"BUCHA E ARRUELA METALICA DIAM. 2\"","PR    ",4,1,4,null,null,0,0,""]
["S",3,"S",0,3,6,2,0,0,0,0,"","Serviço","Serviço","-","AGETOP",70626,"CABO UTP-4P, CAT. 6 , 24 AWG","M     ",150,1,150,null,null,0,0,""]
["S",3,"S",0,3,6,2,0,0,0,0,"","Serviço","Serviço","-","SINAPI",83366,"CAIXA DE PASSAGEM PARA TELEFONE 15X15X10CM (SOBREPOR), FORNECIMENTO E INSTALACAO.","UN",1,1,1,null,null,0,0,""]
["S",3,"S",0,3,6,2,0,0,0,0,"","Serviço","Serviço","-","AGETOP",70648,"CAIXA DE PASSAGEM METÁLICA DE EMBUTIR  40X40X15 CM","Un    ",1,1,1,null,null,0,0,""]
["S",3,"S",0,3,6,2,0,0,0,0,"","Serviço","Serviço","-","SINAPI",91936,"CAIXA OCTOGONAL 4\" X 4\", PVC, INSTALADA EM LAJE - FORNECIMENTO E INSTALAÇÃO. AF_12/2015","UN",4,1,4,null,null,0,0,""]
["S",3,"S",0,3,6,2,0,0,{"$f":"IF(OR($C474=\"S\",$C474=0),0,MATCH(0,OFFSET($D474,1,$C474,ROW($C$616)-ROW($C474)),0))","v":0},{"$f":"IF(OR($C474=\"S\",$C474=0),0,MATCH(OFFSET($D474,0,$C474)+1,OFFSET($D474,1,$C474,ROW($C$616)-ROW($C474)),0))","v":0},"","Serviço","Serviço","-","SINAPI",92869,"CAIXA RETANGULAR 4\" X 2\" BAIXA (0,30 M DO PISO), METÁLICA, INSTALADA EM PAREDE - FORNECIMENTO E INSTALAÇÃO. AF_12/2015","UN",11,1,11,null,null,0,0,""]
["S",3,"S",0,3,6,2,0,0,0,0,"","Serviço","Serviço","-","AGETOP",70772,"CERTIFICADO DIGITAL","Un    ",8,1,8,null,null,0,0,""]
["S",3,"S",0,3,6,2,0,0,0,0,"","Serviço","Serviço","-","SINAPI",91905,"CURVA 90 GRAUS PARA ELETRODUTO, PVC, ROSCÁVEL, DN 32 MM (1\"), PARA CIRCUITOS TERMINAIS, INSTALADA EM LAJE - FORNECIMENTO E INSTALAÇÃO. AF_12/2015","UN",14,1,14,null,null,0,0,""]
["S",3,"S",0,3,6,2,0,0,0,0,"","Serviço","Serviço","-","SINAPI",93020,"CURVA 90 GRAUS PARA ELETRODUTO, PVC, ROSCÁVEL, DN 60 MM (2\") - FORNECIMENTO E INSTALAÇÃO. AF_12/2015","UN",2,1,2,null,null,0,0,""]
["S",3,"S",0,3,6,2,0,0,0,0,"","Serviço","Serviço","-","SINAPI",91868,"ELETRODUTO RÍGIDO ROSCÁVEL, PVC, DN 32 MM (1\"), PARA CIRCUITOS TERMINAIS, INSTALADO EM LAJE - FORNECIMENTO E INSTALAÇÃO. AF_12/2015","M",84,1,84,null,null,0,0,""]
["S",3,"S",0,3,6,2,0,0,0,0,"","Serviço","Serviço","-","SINAPI",91872,"ELETRODUTO RÍGIDO ROSCÁVEL, PVC, DN 32 MM (1\"), PARA CIRCUITOS TERMINAIS, INSTALADO EM PAREDE - FORNECIMENTO E INSTALAÇÃO. AF_12/2015","M",15,1,15,null,null,0,0,""]
["S",3,"S",0,3,6,2,0,0,0,0,"","Serviço","Serviço","-","SINAPI",93009,"ELETRODUTO RÍGIDO ROSCÁVEL, PVC, DN 60 MM (2\") - FORNECIMENTO E INSTALAÇÃO. AF_12/2015","M",15,1,15,null,null,0,0,""]
["S",3,"S",0,3,6,2,0,0,0,0,"","Serviço","Serviço","-","AGETOP",71278,"ESPELHO BAQUELITE 4\" X 2\" 1 FURO RJ-45","Un    ",7,1,7,null,null,0,0,""]
["S",3,"S",0,3,6,2,0,0,0,0,"","Serviço","Serviço","-","AGETOP",71282,"FIO DE COBRE NU No. 6 MM2 (18,00 M/KG)","M     ",12,1,12,null,null,0,0,""]
["S",3,"S",0,3,6,2,0,0,0,0,"","Serviço","Serviço","-","SINAPI",91880,"LUVA PARA ELETRODUTO, PVC, ROSCÁVEL, DN 32 MM (1\"), PARA CIRCUITOS TERMINAIS, INSTALADA EM LAJE - FORNECIMENTO E INSTALAÇÃO. AF_12/2015","UN",28,1,28,null,null,0,0,""]
["S",3,"S",0,3,6,2,0,0,0,0,"","Serviço","Serviço","-","SINAPI",91885,"LUVA PARA ELETRODUTO, PVC, ROSCÁVEL, DN 32 MM (1\"), PARA CIRCUITOS TERMINAIS, INSTALADA EM PAREDE - FORNECIMENTO E INSTALAÇÃO. AF_12/2015","UN",5,1,5,null,null,0,0,""]
["S",3,"S",0,3,6,2,0,0,0,0,"","Serviço","Serviço","-","SINAPI",93014,"LUVA PARA ELETRODUTO, PVC, ROSCÁVEL, DN 60 MM (2\") - FORNECIMENTO E INSTALAÇÃO. AF_12/2015","UN",5,1,5,null,null,0,0,""]
["S",3,"S",0,3,6,2,0,0,0,0,"","Serviço","Serviço","-","AGETOP",72226,"RACK FECHADO DE PAREDE COM PORTA EM ACRÍLICO - 12 U´S ","un    ",1,1,1,null,null,0,0,""]
["S",3,"S",0,3,6,2,0,0,0,0,"","Serviço","Serviço","-","AGETOP",72397,"TAMPA CEGA PLÁSTICA 4\"X2\" COM FURO CENTRAL (PARA TV/SOM...)","un    ",4,1,4,null,null,0,0,""]
["S",3,"S",0,3,6,2,0,0,0,0,"","Serviço","Serviço","-","AGETOP",71796,"ORGANIZADOR DE CABOS (GUIA)","Un    ",1,1,1,null,null,0,0,""]
["S",3,"S",0,3,6,2,0,0,0,0,"","Serviço","Serviço","-","SINAPI",98302,"PATCH PANEL 24 PORTAS, CATEGORIA 6 - FORNECIMENTO E INSTALAÇÃO. AF_03/2018","UN",1,1,1,null,null,0,0,""]
["S",3,"S",0,3,6,2,0,0,0,0,"","Serviço","Serviço","-","SINAPI","73749/1","CAIXA ENTERRADA PARA INSTALACOES TELEFONICAS TIPO R1 0,60X0,35X0,50M EM BLOCOS DE CONCRETO ESTRUTURAL","UN",1,1,1,null,null,0,0,""]
["S",3,"S",0,3,6,2,0,0,0,0,"","Serviço","Serviço","-","SINAPI",84798,"TAMPAO FOFO P/ CAIXA R1 PADRAO TELEBRAS COMPLETO - FORNECIMENTO E INSTALACAO","UN",1,1,1,null,null,0,0,""]
["S",3,"S",0,3,6,2,0,0,0,0,"","Serviço","Serviço","-","AGETOP",72556,"TOMADA LOGICA RJ-45 TIPO KEYSTONE JACK, CAT. 6","Un    ",7,1,7,null,null,0,0,""]
[{"$f":"CHOOSE(1+LOG(1+2*(ORÇAMENTO.Nivel=\"Nível 1\")+4*(ORÇAMENTO.Nivel=\"Nível 2\")+8*(ORÇAMENTO.Nivel=\"Nível 3\")+16*(ORÇAMENTO.Nivel=\"Nível 4\")+32*(ORÇAMENTO.Nivel=\"Serviço\"),2),0,1,2,3,4,\"S\")","v":2},{"$f":"IF(OR(C493=\"s\",C493=0),OFFSET(B493,-1,0),C493)","v":2},{"$f":"IF(OFFSET(C493,-1,0)=\"L\",1,IF(OFFSET(C493,-1,0)=1,2,IF(OR(A493=\"s\",A493=0),\"S\",IF(AND(OFFSET(C493,-1,0)=2,A493=4),3,IF(AND(OR(OFFSET(C493,-1,0)=\"s\",OFFSET(C493,-1,0)=0),A493<>\"s\",A493>OFFSET(B493,-1,0)),OFFSET(B493,-1,0),A493)))))","v":2},{"$f":"IF(OR(C493=\"S\",C493=0),0,IF(ISERROR(K493),J493,SMALL(J493:K493,1)))","v":5},{"$f":"IF($C493=1,OFFSET(E493,-1,0)+1,OFFSET(E493,-1,0))","v":3},{"$f":"IF($C493=1,0,IF($C493=2,OFFSET(F493,-1,0)+1,OFFSET(F493,-1,0)))","v":7},{"$f":"IF(AND($C493<=2,$C493<>0),0,IF($C493=3,OFFSET(G493,-1,0)+1,OFFSET(G493,-1,0)))","v":0},{"$f":"IF(AND($C493<=3,$C493<>0),0,IF($C493=4,OFFSET(H493,-1,0)+1,OFFSET(H493,-1,0)))","v":0},{"$f":"IF(AND($C493<=4,$C493<>0),0,IF(AND($C493=\"S\",$Y493>0),OFFSET(I493,-1,0)+1,OFFSET(I493,-1,0)))","v":0},55,5,"","Nível 2","Nível 2","-","AGETOP",91045,"ALVENARIAS E DIVISÓRIAS","Un    ",null,1,"-",null,null,0,0,""]
["S",2,"S",0,3,7,0,0,0,0,0,"","Serviço","Serviço","-","SINAPI",87520,"ALVENARIA DE VEDAÇÃO DE BLOCOS CERÂMICOS FURADOS NA HORIZONTAL DE 9X19X19CM (ESPESSURA 9CM) DE PAREDES COM ÁREA LÍQUIDA MAIOR OU IGUAL A 6M² COM VÃOS E ARGAMASSA DE ASSENTAMENTO COM PREPARO MANUAL. AF_06/2014","M2",34.090000000000003,1,34.090000000000003,null,null,0,0,"Referência: AGETOP - 100201"]
["S",2,"S",0,3,7,0,0,0,0,0,"","Serviço","Serviço","-","AGETOP",100603,"ALVENARIA DE TIJOLO LAMINADO 1 VEZ - ARG. (1CI : 1CH : 6ARML)","m2    ",2.34,1,2.34,null,null,0,0,""]
["S",2,"S",0,3,7,0,0,0,0,0,"","Serviço","Serviço","-","AGETOP",100604,"ALVENARIA DE TIJOLO LAMINADO 1/4 VEZ - ARG. (1CI : 1CH : 5ARML)","m2    ",51.19,1,51.19,null,null,0,0,""]
["S",2,"S",0,3,7,0,0,0,0,0,"","Serviço","Serviço","-","AGETOP",100602,"ALVENARIA DE TIJOLO LAMINADO 1/2 VEZ  - ARG. (1CI : 1CH : 5ARML)","m2    ",178.84,1,178.84,null,null,0,0,""]
[2,2,2,3,3,8,0,0,0,50,3,"","Nível 2","Nível 2","-",null,null,"IMPERMEABILIZAÇÃO","-",null,1,"-",null,null,0,0,""]
["S",2,"S",0,3,8,0,0,0,0,0,"","Serviço","Serviço","-","AGETOP",121105,"IMPERMEABILIZAÇÃO DE ALICERCE / \"PÉ\" DE PAREDE / PEITORIL E ALVENARIA DE UM MODO GERAL COM CIMENTO CRISTALIZANTE SEMI FLEXÍVEL - 2 DEMÃOS ( ESPECÍFICO PARA OBRAS DE REFORMA)","m2    ",33.049999999999997,1,33.049999999999997,null,null,0,0,""]
["S",2,"S",0,3,8,0,0,0,0,0,"","Serviço","Serviço","-","SINAPI",98562,"IMPERMEABILIZAÇÃO DE FLOREIRA OU VIGA BALDRAME COM ARGAMASSA DE CIMENTO E AREIA, COM ADITIVO IMPERMEABILIZANTE, E = 2 CM. AF_06/2018","M2",96.06,1,96.06,null,null,0,0,"Referência: AGETOP - 120902"]
[2,2,2,2,3,9,0,0,0,47,2,"","Nível 2","Nível 2","-",null,null,"ESTRUTURAS METÁLICAS","-",null,1,"-",null,null,0,0,""]
["S",2,"S",0,3,9,0,0,0,0,0,"","Serviço","Serviço","-","AGETOP",150103,"ESTRUTURA METÁLICA CONVENCIONAL EM AÇO DO TIPO USI SAC-300 COM FUNDO ANTICORROSIVO","Kg    ",4848.08,1,4848.08,null,null,0,0,""]
[2,2,2,6,3,10,0,0,0,45,6,"","Nível 2","Nível 2","-",null,null,"COBERTURAS","-",null,1,"-",null,null,0,0,""]
["S",2,"S",0,3,10,0,0,0,0,0,"","Serviço","Serviço","-","SINAPI",94445,"TELHAMENTO COM TELHA CERÂMICA CAPA-CANAL, TIPO PLAN, COM ATÉ 2 ÁGUAS, INCLUSO TRANSPORTE VERTICAL. AF_06/2016","M2",394.9,1,394.9,null,null,0,0,"Referência: AGETOP - 160401"]
["S",2,"S",0,3,10,0,0,0,0,0,"","Serviço","Serviço","-","SINAPI",94221,"CUMEEIRA PARA TELHA CERÂMICA EMBOÇADA COM ARGAMASSA TRAÇO 1:2:9 (CIMENTO, CAL E AREIA) PARA TELHADOS COM ATÉ 2 ÁGUAS, INCLUSO TRANSPORTE VERTICAL. AF_06/2016","M",30.4,1,30.4,null,null,0,0,""]
["S",2,"S",0,3,10,0,0,0,0,0,"","Serviço","Serviço","-","SINAPI",94224,"EMBOÇAMENTO COM ARGAMASSA TRAÇO 1:2:9 (CIMENTO, CAL E AREIA). AF_06/2016","M",25.98,1,25.98,null,null,0,0,"Referência: AGETOP - 160403"]
["S",2,"S",0,3,10,0,0,0,0,0,"","Serviço","Serviço","-","SINAPI",94224,"EMBOÇAMENTO COM ARGAMASSA TRAÇO 1:2:9 (CIMENTO, CAL E AREIA). AF_06/2016","M",60.8,1,60.8,null,null,0,0,"Referência: AGETOP - 160404"]
["S",2,"S",0,3,10,0,0,0,0,0,"","Serviço","Serviço","-","AGETOP",160970,"FECHAMENTO LATERAL COM TELHA GALVANIZADA TRAPEZOIDAL 0,43 MM COM ACESSÓRIOS","m2    ",6.76,1,6.76,null,null,0,0,""]
[2,2,2,6,3,11,0,0,0,39,6,"","Nível 2","Nível 2","-",null,null,"ESQUADRIAS METÁLICAS","-",null,1,"-",null,null,0,0,""]
["S",2,"S",0,3,11,0,0,0,0,0,"","Serviço","Serviço","-","AGETOP",180208,"GRADE PROTECAO TIPO TIJOLINHO GP-1/GP-2","m2    ",10.25,1,10.25,null,null,0,0,""]
["S",2,"S",0,3,11,0,0,0,0,0,"","Serviço","Serviço","-","AGETOP",180406,"ESQUADRIA EM CHAPA METÁLICA TIPO VENEZIANA FIXA COM VENTILAÇÃO  J-20","m2    ",0.72,1,0.72,null,null,0,0,""]
["S",2,"S",0,3,11,0,0,0,0,0,"","Serviço","Serviço","-","SINAPI",94559,"JANELA DE AÇO BASCULANTE, FIXAÇÃO COM ARGAMASSA, SEM VIDROS, PADRONIZADA. AF_07/2016","M2",23.63,1,23.63,null,null,0,0,"Referência: AGETOP - 180404"]
["S",2,"S",0,3,11,0,0,0,0,0,"","Serviço","Serviço","-","SINAPI",94562,"JANELA DE AÇO DE CORRER, 4 FOLHAS, FIXAÇÃO COM ARGAMASSA, SEM VIDROS, PADRONIZADA. AF_07/2016","M2",30.96,1,30.96,null,null,0,0,"Referência: AGETOP - 180401"]
["S",2,"S",0,3,11,0,0,0,0,0,"","Serviço","Serviço","-","SINAPI","73933/4","PORTA DE FERRO DE ABRIR TIPO BARRA CHATA, COM REQUADRO E GUARNICAO COMPLETA","M2",17.98,1,17.98,null,null,0,0,"Referência: AGETOP - 180501"]
[2,2,2,2,3,12,0,0,0,33,2,"","Nível 2","Nível 2","-",null,null,"VIDROS","-",null,1,"-",null,null,0,0,""]
["S",2,"S",0,3,12,0,0,0,0,0,"","Serviço","Serviço","-","SINAPI",72116,"VIDRO LISO COMUM TRANSPARENTE, ESPESSURA 3MM","M2",31.99,1,31.99,null,null,0,0,"Referência: AGETOP - 190101"]
[2,2,2,5,3,13,0,0,0,31,5,"","Nível 2","Nível 2","-",null,null,"REVESTIMENTO DE PAREDE","-",null,1,"-",null,null,0,0,""]
["S",2,"S",0,3,13,0,0,0,0,0,"","Serviço","Serviço","-","SINAPI",87553,"EMBOÇO, PARA RECEBIMENTO DE CERÂMICA, EM ARGAMASSA TRAÇO 1:2:8, PREPARO MECÂNICO COM BETONEIRA 400L, APLICADO MANUALMENTE EM FACES INTERNAS DE PAREDES, PARA AMBIENTE COM ÁREA MAIOR QUE 10M2, ESPESSURA DE 10MM, COM EXECUÇÃO DE TALISCAS. AF_06/2014","M2",52.89,1,52.89,null,null,0,0,""]
["S",2,"S",0,3,13,0,0,0,0,0,"","Serviço","Serviço","-","SINAPI",87904,"CHAPISCO APLICADO EM ALVENARIA (COM PRESENÇA DE VÃOS) E ESTRUTURAS DE CONCRETO DE FACHADA, COM COLHER DE PEDREIRO.  ARGAMASSA TRAÇO 1:3 COM PREPARO MANUAL. AF_06/2014","M2",127.37,1,127.37,null,null,0,0,"Referência: AGETOP - 200101"]
["S",2,"S",0,3,13,0,0,0,0,0,"","Serviço","Serviço","-","SINAPI",87547,"MASSA ÚNICA, PARA RECEBIMENTO DE PINTURA, EM ARGAMASSA TRAÇO 1:2:8, PREPARO MECÂNICO COM BETONEIRA 400L, APLICADA MANUALMENTE EM FACES INTERNAS DE PAREDES, ESPESSURA DE 10MM, COM EXECUÇÃO DE TALISCAS. AF_06/2014","M2",71.069999999999993,1,71.069999999999993,null,null,0,0,""]
["S",2,"S",0,3,13,0,0,0,0,0,"","Serviço","Serviço","-","SINAPI",87273,"REVESTIMENTO CERÂMICO PARA PAREDES INTERNAS COM PLACAS TIPO ESMALTADA EXTRA DE DIMENSÕES 33X45 CM APLICADAS EM AMBIENTES DE ÁREA MAIOR QUE 5 M² NA ALTURA INTEIRA DAS PAREDES. AF_06/2014","M2",49.59,1,49.59,null,null,0,0,""]
[2,2,2,4,3,14,0,0,0,26,4,"","Nível 2","Nível 2","-",null,null,"FORROS","-",null,1,"-",null,null,0,0,""]
["S",2,"S",0,3,14,0,0,0,0,0,"","Serviço","Serviço","-","SINAPI",96120,"ACABAMENTOS PARA FORRO (MOLDURA DE GESSO). AF_05/2017","M",229.28,1,229.28,null,null,0,0,""]
["S",2,"S",0,3,14,0,0,0,0,0,"","Serviço","Serviço","-","SINAPI",87884,"CHAPISCO APLICADO NO TETO, COM ROLO PARA TEXTURA ACRÍLICA. ARGAMASSA INDUSTRIALIZADA COM PREPARO MANUAL. AF_06/2014","M2",202.4,1,202.4,null,null,0,0,"Referência: AGETOP - 210102"]
["S",2,"S",0,3,14,0,0,0,0,0,"","Serviço","Serviço","-","SINAPI",87414,"APLICAÇÃO MANUAL DE GESSO DESEMPENADO (SEM TALISCAS) EM TETO DE AMBIENTES DE ÁREA MAIOR QUE 10M², ESPESSURA DE 1,0CM. AF_06/2014","M2",202.4,1,202.4,null,null,0,0,"Referência: AGETOP - 210515"]
[2,2,2,6,3,15,0,0,0,22,6,"","Nível 2","Nível 2","-",null,null,"REVESTIMENTO DE PISO","-",null,1,"-",null,null,0,0,""]
["S",2,"S",0,3,15,0,0,0,0,0,"","Serviço","Serviço","-","AGETOP",220101,"LASTRO DE CONCRETO REGULARIZADO IMPERMEABILIZADO 1:3:6 ESP=5CM (BASE)","m2    ",279.22000000000003,1,279.22000000000003,null,null,0,0,""]
["S",2,"S",0,3,15,0,0,0,0,0,"","Serviço","Serviço","-","SINAPI",84191,"PISO EM GRANILITE, MARMORITE OU GRANITINA ESPESSURA 8 MM, INCLUSO JUNTAS DE DILATACAO PLASTICAS","M2",286.58,1,286.58,null,null,0,0,"Referência: AGETOP - 221101"]
["S",2,"S",0,3,15,0,0,0,0,0,"","Serviço","Serviço","-","AGETOP",221104,"RASPAGEM E APLICAÇÃO RESINA ACRÍLICA DUAS DEMÃOS","m2    ",286.58,1,286.58,null,null,0,0,""]
["S",2,"S",0,3,15,0,0,0,0,0,"","Serviço","Serviço","-","SINAPI",94992,"EXECUÇÃO DE PASSEIO (CALÇADA) OU PISO DE CONCRETO COM CONCRETO MOLDADO IN LOCO, FEITO EM OBRA, ACABAMENTO CONVENCIONAL, ESPESSURA 6 CM, ARMADO. AF_07/2016","M2",49.38,1,49.38,null,null,0,0,"Referência: AGETOP - 220100"]
["S",2,"S",0,3,15,0,0,0,0,0,"","Serviço","Serviço","-","AGETOP",220902,"RODAPE DE MASSA (ICI:3 ARMG)","m     ",139.28,1,139.28,null,null,0,0,""]
[2,2,2,2,3,16,0,0,0,16,2,"","Nível 2","Nível 2","-",null,null,"MARCENARIA","-",null,1,"-",null,null,0,0,""]
["S",2,"S",0,3,16,0,0,0,0,0,"","Serviço","Serviço","-","AGETOP",240106,"BATE CARTEIRA ENVERNIZADO E ASSENT. 2,5 X 12 CM","M     ",68.12,1,68.12,null,null,0,0,""]
[{"$f":"CHOOSE(1+LOG(1+2*(ORÇAMENTO.Nivel=\"Nível 1\")+4*(ORÇAMENTO.Nivel=\"Nível 2\")+8*(ORÇAMENTO.Nivel=\"Nível 3\")+16*(ORÇAMENTO.Nivel=\"Nível 4\")+32*(ORÇAMENTO.Nivel=\"Serviço\"),2),0,1,2,3,4,\"S\")","v":2},{"$f":"IF(OR(C534=\"s\",C534=0),OFFSET(B534,-1,0),C534)","v":2},{"$f":"IF(OFFSET(C534,-1,0)=\"L\",1,IF(OFFSET(C534,-1,0)=1,2,IF(OR(A534=\"s\",A534=0),\"S\",IF(AND(OFFSET(C534,-1,0)=2,A534=4),3,IF(AND(OR(OFFSET(C534,-1,0)=\"s\",OFFSET(C534,-1,0)=0),A534<>\"s\",A534>OFFSET(B534,-1,0)),OFFSET(B534,-1,0),A534)))))","v":2},{"$f":"IF(OR(C534=\"S\",C534=0),0,IF(ISERROR(K534),J534,SMALL(J534:K534,1)))","v":10},{"$f":"IF($C534=1,OFFSET(E534,-1,0)+1,OFFSET(E534,-1,0))","v":3},{"$f":"IF($C534=1,0,IF($C534=2,OFFSET(F534,-1,0)+1,OFFSET(F534,-1,0)))","v":17},{"$f":"IF(AND($C534<=2,$C534<>0),0,IF($C534=3,OFFSET(G534,-1,0)+1,OFFSET(G534,-1,0)))","v":0},{"$f":"IF(AND($C534<=3,$C534<>0),0,IF($C534=4,OFFSET(H534,-1,0)+1,OFFSET(H534,-1,0)))","v":0},{"$f":"IF(AND($C534<=4,$C534<>0),0,IF(AND($C534=\"S\",$Y534>0),OFFSET(I534,-1,0)+1,OFFSET(I534,-1,0)))","v":0},14,10,"","Nível 2","Nível 2","-",null,null,"PINTURA","-",null,1,"-",null,null,0,0,""]
["S",2,"S",0,3,17,0,0,0,0,0,"","Serviço","Serviço","-","SINAPI",88497,"APLICAÇÃO E LIXAMENTO DE MASSA LÁTEX EM PAREDES, DUAS DEMÃOS. AF_06/2014","M2",174.69000000000003,1,174.69000000000003,null,null,0,0,"Referência: AGETOP - 261300"]
["S",2,"S",0,3,17,0,0,0,0,0,"","Serviço","Serviço","-","SINAPI",88494,"APLICAÇÃO E LIXAMENTO DE MASSA LÁTEX EM TETO, UMA DEMÃO. AF_06/2014","M2",202.4,1,202.4,null,null,0,0,"Referência: AGETOP - 261301"]
["S",2,"S",0,3,17,0,0,0,0,0,"","Serviço","Serviço","-","SINAPI",88486,"APLICAÇÃO MANUAL DE PINTURA COM TINTA LÁTEX PVA EM TETO, DUAS DEMÃOS. AF_06/2014","M2",202.4,1,202.4,null,null,0,0,"Referência: AGETOP - 261302"]
["S",2,"S",0,3,17,0,0,0,{"$f":"IF(OR($C538=\"S\",$C538=0),0,MATCH(0,OFFSET($D538,1,$C538,ROW($C$616)-ROW($C538)),0))","v":0},{"$f":"IF(OR($C538=\"S\",$C538=0),0,MATCH(OFFSET($D538,0,$C538)+1,OFFSET($D538,1,$C538,ROW($C$616)-ROW($C538)),0))","v":0},"","Serviço","Serviço","-","SINAPI",88487,"APLICAÇÃO MANUAL DE PINTURA COM TINTA LÁTEX PVA EM PAREDES, DUAS DEMÃOS. AF_06/2014","M2",97.79,1,97.79,null,null,0,0,"Referência: AGETOP - 261302"]
["S",2,"S",0,3,17,0,0,0,0,0,"","Serviço","Serviço","-","SINAPI",95305,"TEXTURA ACRÍLICA, APLICAÇÃO MANUAL EM PAREDE, UMA DEMÃO. AF_09/2016","M2",17.260000000000002,1,17.260000000000002,null,null,0,0,"Referência: AGETOP - 260601"]
["S",2,"S",0,3,17,0,0,0,0,0,"","Serviço","Serviço","-","AGETOP",260801,"PINTURA A BASE DE SILICONE 1 DEMAO","m2    ",289.30000000000007,1,289.30000000000007,null,null,0,0,""]
["S",2,"S",0,3,17,0,0,0,0,0,"","Serviço","Serviço","-","SINAPI",88489,"APLICAÇÃO MANUAL DE PINTURA COM TINTA LÁTEX ACRÍLICA EM PAREDES, DUAS DEMÃOS. AF_06/2014","M2",104.26,1,104.26,null,null,0,0,"Referência: AGETOP - 261001"]
["S",2,"S",0,3,17,0,0,0,0,0,"","Serviço","Serviço","-","SINAPI","74145/1","PINTURA ESMALTE FOSCO, DUAS DEMAOS, SOBRE SUPERFICIE METALICA, INCLUSO UMA DEMAO DE FUNDO ANTICORROSIVO. UTILIZACAO DE REVOLVER ( AR-COMPRIMIDO).","M2",134.63999999999999,1,134.63999999999999,null,null,0,0,"Referência: AGETOP - 261602"]
["S",2,"S",0,3,17,0,0,0,0,0,"","Serviço","Serviço","-","SINAPI","74145/1","PINTURA ESMALTE FOSCO, DUAS DEMAOS, SOBRE SUPERFICIE METALICA, INCLUSO UMA DEMAO DE FUNDO ANTICORROSIVO. UTILIZACAO DE REVOLVER ( AR-COMPRIMIDO).","M2",421.72,1,421.72,null,null,0,0,"Referência: AGETOP - 261609"]
[2,2,2,4,3,18,0,0,0,4,{"$error":"#N/A"},"","Nível 2","Nível 2","-",null,null,"DIVERSOS","-",null,1,"-",null,null,0,0,""]
["S",2,"S",0,3,18,0,0,0,0,0,"","Serviço","Serviço","-","AGETOP",270501,"LIMPEZA FINAL DE OBRA - (OBRAS CIVIS)","m2    ",296.57,1,296.57,null,null,0,0,""]
["S",2,"S",0,3,18,0,0,0,0,0,"","Serviço","Serviço","-","AGETOP",271307,"BANCO CONCRETO POLIDO BASE EM ALVENARIA TIJOLO APARENTE PINTADA - PADRÃO AGETOP 2015","M     ",20.38,1,20.38,null,null,0,0,""]
["S",2,"S",0,3,18,0,0,0,0,0,"","Serviço","Serviço","-","AGETOP",271208,"QD.GIZ EMBOCO/LAM.MELAMINICO COMPL.-ESC.2000 6,87X1,39M","Un    ",4,1,4,null,null,0,0,""]
[1,1,1,34,4,0,0,0,0,68,34,"F","Nível 1","Nível 1","4.","SINAPI",null,"PASSARELA MODELO 01 - PADRÃO SÉC. XXI 2015","UN",2,2,2,null,null,0,0,""]
[2,2,2,2,4,1,0,0,0,33,2,"","Nível 2","Nível 2","-","SINAPI",null,"SERVIÇOS PRELIMINARES","-",null,2,"-",null,null,0,0,""]
["S",2,"S",0,4,1,0,0,0,0,0,"","Serviço","Serviço","-","AGETOP",20701,"LOCAÇÃO DA OBRA, EXECUÇÃO DE GABARITO SEM REAPROVEITAMENTO, INCLUSO PINTURA (FACE INTERNA DO RIPÃO 15CM) E PIQUETE COM TESTEMUNHA","m2    ",10.08,2,20.16,null,null,0,0,"Referência: AGETOP - 20701"]
[2,2,2,3,4,2,0,0,0,31,3,"","Nível 2","Nível 2","-","AGETOP",null,"TRANSPORTES","-",null,2,"-",null,null,0,0,""]
["S",2,"S",0,4,2,0,0,0,0,0,"","Serviço","Serviço","-","SINAPI",72900,"TRANSPORTE DE ENTULHO COM CAMINHAO BASCULANTE 6 M3, RODOVIA PAVIMENTADA, DMT 0,5 A 1,0 KM","M3",3,2,6,null,null,0,0,""]
["S",2,"S",0,4,2,0,0,0,0,0,"","Serviço","Serviço","-","SINAPI",72897,"CARGA MANUAL DE ENTULHO EM CAMINHAO BASCULANTE 6 M3","M3",3,2,6,null,null,0,0,""]
[2,2,2,9,4,3,0,0,0,28,9,"","Nível 2","Nível 2","-","AGETOP",null,"FUNDAÇÕES E SONDAGENS","-",null,2,"-",null,null,0,0,""]
["S",2,"S",0,4,3,0,0,0,0,0,"","Serviço","Serviço","-","SINAPI",96534,"FABRICAÇÃO, MONTAGEM E DESMONTAGEM DE FÔRMA PARA BLOCO DE COROAMENTO, EM MADEIRA SERRADA, E=25 MM, 4 UTILIZAÇÕES. AF_06/2017","M2",5.28,2,10.56,null,null,0,0,"Referência: AGETOP - 51009"]
["S",2,"S",0,4,3,0,0,0,0,0,"","Serviço","Serviço","-","SINAPI",96523,"ESCAVAÇÃO MANUAL PARA BLOCO DE COROAMENTO OU SAPATA, COM PREVISÃO DE FÔRMA. AF_06/2017","M3",1.0289999999999999,2,2.0579999999999998,null,null,0,0,"Referência: AGETOP - 50901"]
["S",2,"S",0,4,3,0,0,0,0,0,"","Serviço","Serviço","-","AGETOP",50902,"APILOAMENTO (BLOCOS/SAPATAS)","m2    ",1,2,2,null,null,0,0,""]
["S",2,"S",0,4,3,0,0,0,0,0,"","Serviço","Serviço","-","SINAPI",96995,"REATERRO MANUAL APILOADO COM SOQUETE. AF_10/2017","M3",0.44899999999999995,2,0.89799999999999991,null,null,0,0,"Referência: AGETOP - 50903"]
["S",2,"S",0,4,3,0,0,0,0,0,"","Serviço","Serviço","-","SINAPI",94964,"CONCRETO FCK = 20MPA, TRAÇO 1:2,7:3 (CIMENTO/ AREIA MÉDIA/ BRITA 1)  - PREPARO MECÂNICO COM BETONEIRA 400 L. AF_07/2016","M3",0.57999999999999996,2,1.1599999999999999,null,null,0,0,""]
["S",2,"S",0,4,3,0,0,0,0,0,"","Serviço","Serviço","-","SINAPI","74157/4","LANCAMENTO/APLICACAO MANUAL DE CONCRETO EM FUNDACOES","M3",0.57999999999999996,2,1.1599999999999999,null,null,0,0,"Referência: AGETOP - 51055"]
["S",2,"S",0,4,3,0,0,0,0,0,"","Serviço","Serviço","-","SINAPI",96547,"ARMAÇÃO DE BLOCO, VIGA BALDRAME OU SAPATA UTILIZANDO AÇO CA-50 DE 12,5 MM - MONTAGEM. AF_06/2017","KG",13.18181818181818,2,26.36363636363636,null,null,0,0,"Referência: AGETOP - 52006"]
["S",2,"S",0,4,3,0,0,0,0,0,"","Serviço","Serviço","-","SINAPI",96543,"ARMAÇÃO DE BLOCO, VIGA BALDRAME E SAPATA UTILIZANDO AÇO CA-60 DE 5 MM - MONTAGEM. AF_06/2017","KG",8.7272727272727266,2,17.454545454545453,null,null,0,0,"Referência: AGETOP - 52014"]
[2,2,2,6,4,4,0,0,0,19,6,"","Nível 2","Nível 2","-","AGETOP",null,"ESTRUTURA","-",null,2,"-",null,null,0,0,""]
["S",2,"S",0,4,4,0,0,0,0,0,"","Serviço","Serviço","-","SINAPI",92426,"MONTAGEM E DESMONTAGEM DE FÔRMA DE PILARES RETANGULARES E ESTRUTURAS SIMILARES COM ÁREA MÉDIA DAS SEÇÕES MENOR OU IGUAL A 0,25 M², PÉ-DIREITO SIMPLES, EM CHAPA DE MADEIRA COMPENSADA RESINADA, 8 UTILIZAÇÕES. AF_12/2015","M2",1.29,2,2.58,null,null,0,0,""]
["S",2,"S",0,4,4,0,0,0,0,0,"","Serviço","Serviço","-","SINAPI",94964,"CONCRETO FCK = 20MPA, TRAÇO 1:2,7:3 (CIMENTO/ AREIA MÉDIA/ BRITA 1)  - PREPARO MECÂNICO COM BETONEIRA 400 L. AF_07/2016","M3",0.11,2,0.22,null,null,0,0,""]
["S",2,"S",0,4,4,0,0,0,0,0,"","Serviço","Serviço","-","SINAPI",92873,"LANÇAMENTO COM USO DE BALDES, ADENSAMENTO E ACABAMENTO DE CONCRETO EM ESTRUTURAS. AF_12/2015","M3",0.11,2,0.22,null,null,0,0,"Referência: AGETOP - 51055"]
["S",2,"S",0,4,4,0,0,0,0,0,"","Serviço","Serviço","-","SINAPI",92779,"ARMAÇÃO DE PILAR OU VIGA DE UMA ESTRUTURA CONVENCIONAL DE CONCRETO ARMADO EM UMA EDIFICAÇÃO TÉRREA OU SOBRADO UTILIZANDO AÇO CA-50 DE 12,5 MM - MONTAGEM. AF_12/2015","KG",2.8181818181818179,2,5.6363636363636358,null,null,0,0,"Referência: AGETOP - 60306"]
["S",2,"S",0,4,4,0,0,0,0,0,"","Serviço","Serviço","-","SINAPI",92775,"ARMAÇÃO DE PILAR OU VIGA DE UMA ESTRUTURA CONVENCIONAL DE CONCRETO ARMADO EM UMA EDIFICAÇÃO TÉRREA OU SOBRADO UTILIZANDO AÇO CA-60 DE 5,0 MM - MONTAGEM. AF_12/2015","KG",1.4545454545454546,2,2.9090909090909092,null,null,0,0,"Referência: AGETOP - 60314"]
[2,2,2,2,4,5,0,0,0,13,2,"","Nível 2","Nível 2","-",null,null,"IMPERMEABILIZAÇÃO","-",null,2,"-",null,null,0,0,""]
["S",2,"S",0,4,5,0,0,0,0,0,"","Serviço","Serviço","-","SINAPI",98562,"IMPERMEABILIZAÇÃO DE FLOREIRA OU VIGA BALDRAME COM ARGAMASSA DE CIMENTO E AREIA, COM ADITIVO IMPERMEABILIZANTE, E = 2 CM. AF_06/2018","M2",3.6,2,7.2,null,null,0,0,"Referência: AGETOP - 120902"]
[2,2,2,2,4,6,0,0,0,11,2,"","Nível 2","Nível 2","-",null,null,"ESTRUTURAS METÁLICAS","-",null,2,"-",null,null,0,0,""]
["S",2,"S",0,4,6,0,0,0,0,0,"","Serviço","Serviço","-","AGETOP",150103,"ESTRUTURA METÁLICA CONVENCIONAL EM AÇO DO TIPO USI SAC-300 COM FUNDO ANTICORROSIVO","Kg    ",161.91200000000003,2,323.82400000000007,null,null,0,0,""]
[2,2,2,3,4,7,0,0,0,9,3,"","Nível 2","Nível 2","-",null,null,"COBERTURAS","-",null,2,"-",null,null,0,0,""]
["S",2,"S",0,4,7,0,0,0,0,0,"","Serviço","Serviço","-","SINAPI",94213,"TELHAMENTO COM TELHA DE AÇO/ALUMÍNIO E = 0,5 MM, COM ATÉ 2 ÁGUAS, INCLUSO IÇAMENTO. AF_06/2016","M2",12.96,2,25.92,null,null,0,0,"Referência: AGETOP - 160905"]
["S",2,"S",0,4,7,0,0,0,0,0,"","Serviço","Serviço","-","SINAPI",94228,"CALHA EM CHAPA DE AÇO GALVANIZADO NÚMERO 24, DESENVOLVIMENTO DE 50 CM, INCLUSO TRANSPORTE VERTICAL. AF_06/2016","M",3.6,2,7.2,null,null,0,0,"Referência: AGETOP - 160601"]
[2,2,2,4,4,8,0,0,0,6,4,"","Nível 2","Nível 2","-",null,null,"REVESTIMENTO DE PISO","-",null,2,"-",null,null,0,0,""]
["S",2,"S",0,4,8,0,0,0,0,0,"","Serviço","Serviço","-","SINAPI",95241,"LASTRO DE CONCRETO MAGRO, APLICADO EM PISOS OU RADIERS, ESPESSURA DE 5 CM. AF_07/2016","M2",10.08,2,20.16,null,null,0,0,"Referência: AGETOP - 220050"]
["S",2,"S",0,4,8,0,0,0,0,0,"","Serviço","Serviço","-","SINAPI",84191,"PISO EM GRANILITE, MARMORITE OU GRANITINA ESPESSURA 8 MM, INCLUSO JUNTAS DE DILATACAO PLASTICAS","M2",10.08,2,20.16,null,null,0,0,"Referência: AGETOP - 221101"]
["S",2,"S",0,4,8,0,0,0,0,0,"","Serviço","Serviço","-","AGETOP",221104,"RASPAGEM E APLICAÇÃO RESINA ACRÍLICA DUAS DEMÃOS","m2    ",10.64,2,21.28,null,null,0,0,""]
[2,2,2,2,4,9,0,0,0,2,{"$error":"#N/A"},"","Nível 2","Nível 2","-",null,null,"PINTURA","-",null,2,"-",null,null,0,0,""]
["S",2,"S",0,4,9,0,0,0,0,0,"","Serviço","Serviço","-","SINAPI","74145/1","PINTURA ESMALTE FOSCO, DUAS DEMAOS, SOBRE SUPERFICIE METALICA, INCLUSO UMA DEMAO DE FUNDO ANTICORROSIVO. UTILIZACAO DE REVOLVER ( AR-COMPRIMIDO).","M2",25.92,2,51.84,null,null,0,0,"Referência: AGETOP - 261609"]
[1,1,1,34,5,0,0,0,0,34,{"$error":"#N/A"},"F","Nível 1","Nível 1","5.","SINAPI",null,"PASSARELA MODELO 02 - PADRÃO SÉC. XXI 2015","UN",5,5,5,null,null,0,0,""]
[2,2,2,2,5,1,0,0,0,33,2,"","Nível 2","Nível 2","-","SINAPI",null,"SERVIÇOS PRELIMINARES","-",null,5,"-",null,null,0,0,""]
["S",2,"S",0,5,1,0,0,0,0,0,"","Serviço","Serviço","-","AGETOP",20701,"LOCAÇÃO DA OBRA, EXECUÇÃO DE GABARITO SEM REAPROVEITAMENTO, INCLUSO PINTURA (FACE INTERNA DO RIPÃO 15CM) E PIQUETE COM TESTEMUNHA","m2    ",20.16,5,100.8,null,null,0,0,"Referência: AGETOP - 20701"]
[2,2,2,3,5,2,0,0,0,31,3,"","Nível 2","Nível 2","-","AGETOP",null,"TRANSPORTES","-",null,5,"-",null,null,0,0,""]
["S",2,"S",0,5,2,0,0,0,0,0,"","Serviço","Serviço","-","SINAPI",72900,"TRANSPORTE DE ENTULHO COM CAMINHAO BASCULANTE 6 M3, RODOVIA PAVIMENTADA, DMT 0,5 A 1,0 KM","M3",6,5,30,null,null,0,0,""]
["S",2,"S",0,5,2,0,0,0,0,0,"","Serviço","Serviço","-","SINAPI",72897,"CARGA MANUAL DE ENTULHO EM CAMINHAO BASCULANTE 6 M3","M3",6,5,30,null,null,0,0,""]
[2,2,2,9,5,3,0,0,0,28,9,"","Nível 2","Nível 2","-","AGETOP",null,"FUNDAÇÕES E SONDAGENS","-",null,5,"-",null,null,0,0,""]
["S",2,"S",0,5,3,0,0,0,0,0,"","Serviço","Serviço","-","SINAPI",96534,"FABRICAÇÃO, MONTAGEM E DESMONTAGEM DE FÔRMA PARA BLOCO DE COROAMENTO, EM MADEIRA SERRADA, E=25 MM, 4 UTILIZAÇÕES. AF_06/2017","M2",5.28,5,26.400000000000002,null,null,0,0,"Referência: AGETOP - 51009"]
["S",2,"S",0,5,3,0,0,0,0,0,"","Serviço","Serviço","-","SINAPI",96523,"ESCAVAÇÃO MANUAL PARA BLOCO DE COROAMENTO OU SAPATA, COM PREVISÃO DE FÔRMA. AF_06/2017","M3",1.0289999999999999,5,5.1449999999999996,null,null,0,0,"Referência: AGETOP - 50901"]
["S",2,"S",0,5,3,0,0,0,0,0,"","Serviço","Serviço","-","AGETOP",50902,"APILOAMENTO (BLOCOS/SAPATAS)","m2    ",1,5,5,null,null,0,0,""]
["S",2,"S",0,5,3,0,0,0,0,0,"","Serviço","Serviço","-","SINAPI",96995,"REATERRO MANUAL APILOADO COM SOQUETE. AF_10/2017","M3",0.44899999999999995,5,2.2449999999999997,null,null,0,0,"Referência: AGETOP - 50903"]
["S",2,"S",0,5,3,0,0,0,0,0,"","Serviço","Serviço","-","SINAPI",94964,"CONCRETO FCK = 20MPA, TRAÇO 1:2,7:3 (CIMENTO/ AREIA MÉDIA/ BRITA 1)  - PREPARO MECÂNICO COM BETONEIRA 400 L. AF_07/2016","M3",0.57999999999999996,5,2.9,null,null,0,0,""]
["S",2,"S",0,5,3,0,0,0,0,0,"","Serviço","Serviço","-","SINAPI","74157/4","LANCAMENTO/APLICACAO MANUAL DE CONCRETO EM FUNDACOES","M3",0.57999999999999996,5,2.9,null,null,0,0,"Referência: AGETOP - 51055"]
["S",2,"S",0,5,3,0,0,0,0,0,"","Serviço","Serviço","-","SINAPI",96547,"ARMAÇÃO DE BLOCO, VIGA BALDRAME OU SAPATA UTILIZANDO AÇO CA-50 DE 12,5 MM - MONTAGEM. AF_06/2017","KG",13.18181818181818,5,65.909090909090907,null,null,0,0,"Referência: AGETOP - 52006"]
["S",2,"S",0,5,3,0,0,0,0,0,"","Serviço","Serviço","-","SINAPI",96543,"ARMAÇÃO DE BLOCO, VIGA BALDRAME E SAPATA UTILIZANDO AÇO CA-60 DE 5 MM - MONTAGEM. AF_06/2017","KG",8.7272727272727266,5,43.636363636363633,null,null,0,0,"Referência: AGETOP - 52014"]
[2,2,2,6,5,4,0,0,0,19,6,"","Nível 2","Nível 2","-","AGETOP",null,"ESTRUTURA","-",null,5,"-",null,null,0,0,""]
["S",2,"S",0,5,4,0,0,0,0,0,"","Serviço","Serviço","-","SINAPI",92426,"MONTAGEM E DESMONTAGEM DE FÔRMA DE PILARES RETANGULARES E ESTRUTURAS SIMILARES COM ÁREA MÉDIA DAS SEÇÕES MENOR OU IGUAL A 0,25 M², PÉ-DIREITO SIMPLES, EM CHAPA DE MADEIRA COMPENSADA RESINADA, 8 UTILIZAÇÕES. AF_12/2015","M2",1.29,5,6.45,null,null,0,0,""]
["S",2,"S",0,5,4,0,0,0,0,0,"","Serviço","Serviço","-","SINAPI",94964,"CONCRETO FCK = 20MPA, TRAÇO 1:2,7:3 (CIMENTO/ AREIA MÉDIA/ BRITA 1)  - PREPARO MECÂNICO COM BETONEIRA 400 L. AF_07/2016","M3",0.11,5,0.55000000000000004,null,null,0,0,""]
["S",2,"S",0,5,4,0,0,0,0,0,"","Serviço","Serviço","-","SINAPI",92873,"LANÇAMENTO COM USO DE BALDES, ADENSAMENTO E ACABAMENTO DE CONCRETO EM ESTRUTURAS. AF_12/2015","M3",0.11,5,0.55000000000000004,null,null,0,0,"Referência: AGETOP - 51055"]
["S",2,"S",0,5,4,0,0,0,0,0,"","Serviço","Serviço","-","SINAPI",92779,"ARMAÇÃO DE PILAR OU VIGA DE UMA ESTRUTURA CONVENCIONAL DE CONCRETO ARMADO EM UMA EDIFICAÇÃO TÉRREA OU SOBRADO UTILIZANDO AÇO CA-50 DE 12,5 MM - MONTAGEM. AF_12/2015","KG",2.8181818181818179,5,14.09090909090909,null,null,0,0,"Referência: AGETOP - 60306"]
["S",2,"S",0,5,4,0,0,0,{"$f":"IF(OR($C602=\"S\",$C602=0),0,MATCH(0,OFFSET($D602,1,$C602,ROW($C$616)-ROW($C602)),0))","v":0},{"$f":"IF(OR($C602=\"S\",$C602=0),0,MATCH(OFFSET($D602,0,$C602)+1,OFFSET($D602,1,$C602,ROW($C$616)-ROW($C602)),0))","v":0},"","Serviço","Serviço","-","SINAPI",92775,"ARMAÇÃO DE PILAR OU VIGA DE UMA ESTRUTURA CONVENCIONAL DE CONCRETO ARMADO EM UMA EDIFICAÇÃO TÉRREA OU SOBRADO UTILIZANDO AÇO CA-60 DE 5,0 MM - MONTAGEM. AF_12/2015","KG",1.4545454545454546,5,7.2727272727272734,null,null,0,0,"Referência: AGETOP - 60314"]
[2,2,2,2,5,5,0,0,0,13,2,"","Nível 2","Nível 2","-",null,null,"IMPERMEABILIZAÇÃO","-",null,5,"-",null,null,0,0,""]
["S",2,"S",0,5,5,0,0,0,0,0,"","Serviço","Serviço","-","SINAPI",98562,"IMPERMEABILIZAÇÃO DE FLOREIRA OU VIGA BALDRAME COM ARGAMASSA DE CIMENTO E AREIA, COM ADITIVO IMPERMEABILIZANTE, E = 2 CM. AF_06/2018","M2",3.6,5,18,null,null,0,0,"Referência: AGETOP - 120902"]
[2,2,2,2,5,6,0,0,0,11,2,"","Nível 2","Nível 2","-",null,null,"ESTRUTURAS METÁLICAS","-",null,5,"-",null,null,0,0,""]
["S",2,"S",0,5,6,0,0,0,0,0,"","Serviço","Serviço","-","AGETOP",150103,"ESTRUTURA METÁLICA CONVENCIONAL EM AÇO DO TIPO USI SAC-300 COM FUNDO ANTICORROSIVO","Kg    ",270.56000000000006,5,1352.8000000000002,null,null,0,0,""]
[2,2,2,3,5,7,0,0,0,9,3,"","Nível 2","Nível 2","-",null,null,"COBERTURAS","-",null,5,"-",null,null,0,0,""]
["S",2,"S",0,5,7,0,0,0,0,0,"","Serviço","Serviço","-","SINAPI",94213,"TELHAMENTO COM TELHA DE AÇO/ALUMÍNIO E = 0,5 MM, COM ATÉ 2 ÁGUAS, INCLUSO IÇAMENTO. AF_06/2016","M2",25.92,5,129.60000000000002,null,null,0,0,"Referência: AGETOP - 160905"]
["S",2,"S",0,5,7,0,0,0,0,0,"","Serviço","Serviço","-","SINAPI",94228,"CALHA EM CHAPA DE AÇO GALVANIZADO NÚMERO 24, DESENVOLVIMENTO DE 50 CM, INCLUSO TRANSPORTE VERTICAL. AF_06/2016","M",7.2,5,36,null,null,0,0,"Referência: AGETOP - 160601"]
[2,2,2,4,5,8,0,0,0,6,4,"","Nível 2","Nível 2","-",null,null,"REVESTIMENTO DE PISO","-",null,5,"-",null,null,0,0,""]
["S",2,"S",0,5,8,0,0,0,0,0,"","Serviço","Serviço","-","SINAPI",95241,"LASTRO DE CONCRETO MAGRO, APLICADO EM PISOS OU RADIERS, ESPESSURA DE 5 CM. AF_07/2016","M2",20.16,5,100.8,null,null,0,0,"Referência: AGETOP - 220050"]
["S",2,"S",0,5,8,0,0,0,0,0,"","Serviço","Serviço","-","SINAPI",84191,"PISO EM GRANILITE, MARMORITE OU GRANITINA ESPESSURA 8 MM, INCLUSO JUNTAS DE DILATACAO PLASTICAS","M2",20.16,5,100.8,null,null,0,0,"Referência: AGETOP - 221101"]
["S",2,"S",0,5,8,0,0,0,0,0,"","Serviço","Serviço","-","AGETOP",221104,"RASPAGEM E APLICAÇÃO RESINA ACRÍLICA DUAS DEMÃOS","m2    ",20.72,5,103.6,null,null,0,0,""]
[2,2,2,2,5,9,0,0,0,2,{"$error":"#N/A"},"","Nível 2","Nível 2","-",null,null,"PINTURA","-",null,5,"-",null,null,0,0,""]
["S",2,"S",0,5,9,0,0,0,0,0,"","Serviço","Serviço","-","SINAPI","74145/1","PINTURA ESMALTE FOSCO, DUAS DEMAOS, SOBRE SUPERFICIE METALICA, INCLUSO UMA DEMAO DE FUNDO ANTICORROSIVO. UTILIZACAO DE REVOLVER ( AR-COMPRIMIDO).","M2",51.84,5,259.20000000000005,null,null,0,0,"Referência: AGETOP - 261609"]
[-1,null,-1,null,0,0,0,0,0,null,null,"F"]
[null,null,null,null,null,null,null,null,null,null,null,"F",null,null,null,null,null,"OBS: OS QUANTITATIVOS DE MATERIAIS  DAS INSTALAÇÕES HIDROSSANITÁRIAS, ELÉTRICAS E ESPECIAIS SÃO FORNECIDOS PELOS PROFISSIONAIS RESPONSÁVEIS PELOS RESPECTIVOS PROJETOS.",null,null,null,null,null,"VALOR TOTAL",null,0]
[null,null,null,null,null,null,null,null,null,null,null,"F",null,null,null,null,null,null,null,null,null,null,null,"VALOR BDI (21,36%)",null,0]
[null,null,null,null,null,null,null,null,null,null,null,"F",null,null,null,null,null,null,null,null,null,null,null,"TOTAL ORÇAMENTO",null,0]
[null,null,null,null,null,null,null,null,null,null,null,"F"]
[null,null,null,null,null,null,null,null,null,null,null,"F",null,null,null,null,null,null,null,null,null,null,null,"CUSTO POR M2 ³",null,0]
[null,null,null,null,null,null,null,null,null,null,null,"F",null,null,null,null,null,null,null,null,null,null,null,"MATERIAL S/ BDI",null,0]
[null,null,null,null,null,null,null,null,null,null,null,"F",null,null,null,null,null,null,null,null,null,null,null,"MÃO DE OBRA S/ BDI",null,0]
[null,null,null,null,null,null,null,null,null,null,null,"F"]
[null,null,null,null,null,null,null,null,null,null,null,"F",null,null,null,null,"(1) Conforme previsto pelo DECRETO Nº 7.983, DE 8 DE ABRIL DE 2013, os preços adotados são aqueles constantes dos sistemas de referência indicados. Justifica-se o uso dos preços destas composições de custos unitários devido ao seu valor ser menor à mediana de seus correspondentes na tabela SINAPI;"]
[null,null,null,null,null,null,null,null,null,null,null,"F",null,null,null,null,"(2) Optou-se pelo uso das composições de custos da AGETOP para itens não presentes na SINAPI;"]
[null,null,null,null,null,null,null,null,null,null,null,"F",null,null,null,null,"(3) Para itens da AGETOP, os vidros não estão inclusos nas esquadrias e já foram considerados os custos de contramarco para as esquadrias de alumínio;"]
[null,null,null,null,null,null,null,null,null,null,null,"F",null,null,null,null,"(4) Nos casos em que houver execução de granitina e omissão do item AGETOP 221102, considerou-se que o quantitativo para o rodapé, de altura igual a 7cm, foi incorporado na área de piso;"]
[null,null,null,null,null,null,null,null,null,null,null,"F",null,null,null,null,"(5) O custo unitário aproximado por metro quadrado é calculado dividindo-se o valor total do orçamento pela área total de construção."]
[null,null,null,null,null,null,null,null,null,null,null,"F"]
[null,null,null,null,null,null,null,null,null,null,null,"F"]
[]
[null,null,null,null,null,null,null,null,null,null,null,null,null,null,"SOMATÓRIO DE SERVIÇOS"]
[null,null,null,null,null,null,null,null,null,null,null,null,null,null,"ITEM","DESCRIÇÃO DOS SERVIÇOS",null,null,"PREÇO SEM BDI",null,null,null,null,"PREÇO COM BDI",null,null,"PARTICIPAÇÃO ( % )"]
[null,null,null,null,null,null,null,null,null,null,null,null,null,null,"a.","SERVIÇOS PRELIMINARES",null,null,{"$f":"SUMIF($R$19:$R$616,$P635,$Z$19:$Z$616)","v":0},null,null,null,null,{"$f":"ROUND(S635*(1+BDI.Taxa),2)","v":0},null,null,{"$f":"IFERROR(ROUND($X635*100/$Z$619,2),0)","v":0}]
[null,null,null,null,null,null,null,null,null,null,null,null,null,null,"b.","TRANSPORTES",null,null,0,null,null,null,null,0,null,null,0]
[null,null,null,null,null,null,null,null,null,null,null,null,null,null,"c.","SERVIÇO EM TERRA",null,null,0,null,null,null,null,0,null,null,0]
[null,null,null,null,null,null,null,null,null,null,null,null,null,null,"d.","FUNDAÇÕES E SONDAGENS",null,null,0,null,null,null,null,0,null,null,0]
[null,null,null,null,null,null,null,null,null,null,null,null,null,null,"e.","ESTRUTURA",null,null,0,null,null,null,null,0,null,null,0]
[null,null,null,null,null,null,null,null,null,null,null,null,null,null,"f.","INSTALAÇÕES ELÉTRICAS",null,null,0,null,null,null,null,0,null,null,0]
[null,null,null,null,null,null,null,null,null,null,null,null,null,null,"g.","INSTALAÇÕES HIDROSSANITÁRIAS",null,null,0,null,null,null,null,0,null,null,0]
[null,null,null,null,null,null,null,null,null,null,null,null,null,null,"h","INSTALAÇÕES ESPECIAIS",null,null,0,null,null,null,null,0,null,null,0]
[null,null,null,null,null,null,null,null,null,null,null,null,null,null,"i.","ALVENARIAS E DIVISÓRIAS",null,null,0,null,null,null,null,0,null,null,0]
[null,null,null,null,null,null,null,null,null,null,null,null,null,null,"j.","ALVENARIA AUTO-PORTANTE",null,null,0,null,null,null,null,0,null,null,0]
[null,null,null,null,null,null,null,null,null,null,null,null,null,null,"k.","IMPERMEABILIZAÇÃO",null,null,0,null,null,null,null,0,null,null,0]
[null,null,null,null,null,null,null,null,null,null,null,null,null,null,"l.","ISOLAMENTO TÉRMICO E ACÚSTICO",null,null,0,null,null,null,null,0,null,null,0]
[null,null,null,null,null,null,null,null,null,null,null,null,null,null,"m.","ESTRUTURA DE MADEIRA",null,null,0,null,null,null,null,0,null,null,0]
[null,null,null,null,null,null,null,null,null,null,null,null,null,null,"n.","ESTRUTURAS METÁLICAS",null,null,0,null,null,null,null,0,null,null,0]
[null,null,null,null,null,null,null,null,null,null,null,null,null,null,"o.","COBERTURAS",null,null,0,null,null,null,null,0,null,null,0]
[null,null,null,null,null,null,null,null,null,null,null,null,null,null,"p.","ESQUADRIAS DE MADEIRA",null,null,0,null,null,null,null,0,null,null,0]
[null,null,null,null,null,null,null,null,null,null,null,null,null,null,"q.","ESQUADRIAS METÁLICAS",null,null,0,null,null,null,null,{"$f":"ROUND(S651*(1+BDI.Taxa),2)","v":0},null,null,0]
[null,null,null,null,null,null,null,null,null,null,null,null,null,null,"r.","VIDROS",null,null,0,null,null,null,null,0,null,null,0]
[null,null,null,null,null,null,null,null,null,null,null,null,null,null,"s.","REVESTIMENTO DE PAREDE",null,null,0,null,null,null,null,0,null,null,0]
[null,null,null,null,null,null,null,null,null,null,null,null,null,null,"t.","FORROS",null,null,0,null,null,null,null,0,null,null,0]
[null,null,null,null,null,null,null,null,null,null,null,null,null,null,"u.","REVESTIMENTO DE PISO",null,null,0,null,null,null,null,0,null,null,0]
[null,null,null,null,null,null,null,null,null,null,null,null,null,null,"v.","FERRAGENS",null,null,0,null,null,null,null,0,null,null,0]
[null,null,null,null,null,null,null,null,null,null,null,null,null,null,"w.","MARCENARIA",null,null,0,null,null,null,null,0,null,null,0]
[null,null,null,null,null,null,null,null,null,null,null,null,null,null,"x.","ADMINISTRAÇÃO",null,null,0,null,null,null,null,0,null,null,0]
[null,null,null,null,null,null,null,null,null,null,null,null,null,null,"y.","PINTURA",null,null,0,null,null,null,null,{"$f":"ROUND(S659*(1+BDI.Taxa),2)","v":0},null,null,0]
[null,null,null,null,null,null,null,null,null,null,null,null,null,null,"z.","DIVERSOS",null,null,0,null,null,null,null,{"$f":"IF(S660>0,IF((SUM(X635:Y659)+ROUND(S660*(1+BDI.Taxa),2))<>X662,X662-SUM(X635:Y659),ROUND(S660*(1+BDI.Taxa),2)),0)","v":0},null,null,{"$f":"IF(S660>0,IF((SUM(AA635:AA659)+IFERROR(ROUND($X660*100/$Z$619,2),0))<>AA662,AA662-SUM(AA635:AA659),IFERROR(ROUND($X660*100/$Z$619,2),0)),0)","v":0}]
[null,null,null,null,null,null,null,null,null,null,null,null,null,null,"TOTAL GERAL DO ORÇAMENTO (R$)",null,null,null,{"$f":"SUM(S635:W660)","v":0},null,null,null,null,{"$f":"SUM(X635:Y660)","v":0},null,null,{"$f":"SUM(AA635:AA660)","v":0}]
[null,null,null,null,null,null,null,null,null,null,null,null,null,null,null,null,null,null,{"$f":"$Z$617","v":0},null,null,null,null,{"$f":"$Z$619","v":0},null,null,100]
[null,null,null,null,null,null,null,null,null,null,null,null,null,null,null,null,null,null,"(TOTAL SEM BDI)",null,null,null,null,"(TOTAL COM BDI)",null,null,"(ARRED porcentagem)"]
[null,null,null,null,null,null,null,null,null,null,null,null,null,null,null,null,null,null,{"$f":"IF(AND(S661=S662,S661>0),\"OK\",\"ERRO\")","v":"ERRO"},null,null,null,null,{"$f":"IF(AND(X661=X662,X661>0),\"OK\",\"ERRO\")","v":"ERRO"},null,null,{"$f":"IF(AA661=100,\"OK\",\"ERRO\")","v":"ERRO"}]
[]
[]
[null,null,null,null,null,null,null,null,null,null,null,null,null,null,"RESUMO GERAL DO ORÇAMENTO"]
[null,null,null,null,null,null,null,null,null,null,null,null,null,null,"ITEM","DESCRIÇÃO DOS SERVIÇOS",null,null,"PREÇO SEM BDI",null,null,null,null,"PREÇO COM BDI",null,null,"PARTICIPAÇÃO ( % )"]
[null,null,null,null,null,null,null,null,null,null,null,null,null,null,"1.",{"$f":"IFERROR(VLOOKUP(O669,$O$19:$Y$616,4,FALSE),\"\")","v":"REFORMA"},null,null,{"$f":"IF(P670=\"\",$S$690-SUM(OFFSET($S$668:S668,0,0,COUNTA($S$668:S668),1)),SUMIF($R$19:$R$616,$P669,$Z$19:$Z$616))","v":0},null,null,null,null,{"$f":"IF(P670=\"\",$X$690-SUM(OFFSET($X$668:X668,0,0,COUNTA($X$668:X668),1)),ROUND(S669*(1+BDI.Taxa),2))","v":0},null,null,{"$f":"IF(P670=\"\",$AA$690-SUM(OFFSET($AA$668:AA668,0,0,COUNTA($AA$668:AA668),1)),ROUND(X669*100/ORÇAMENTO.TotalOrçamento,2))","v":{"$error":"#DIV/0!"}}]
[null,null,null,null,null,null,null,null,null,null,null,null,null,null,"2.","4 SALAS COM VESTIÁRIO",null,null,{"$f":"IF(P671=\"\",$S$690-SUM(OFFSET($S$668:S669,0,0,COUNTA($S$668:S669),1)),SUMIF($R$19:$R$616,$P670,$Z$19:$Z$616))","v":0},null,null,null,null,{"$f":"IF(P671=\"\",$X$690-SUM(OFFSET($X$668:X669,0,0,COUNTA($X$668:X669),1)),ROUND(S670*(1+BDI.Taxa),2))","v":0},null,null,{"$f":"IF(P671=\"\",$AA$690-SUM(OFFSET($AA$668:AA669,0,0,COUNTA($AA$668:AA669),1)),ROUND(X670*100/ORÇAMENTO.TotalOrçamento,2))","v":{"$error":"#DIV/0!"}}]
[null,null,null,null,null,null,null,null,null,null,null,null,null,null,"3.","4 SALAS",null,null,{"$f":"IF(P672=\"\",$S$690-SUM(OFFSET($S$668:S670,0,0,COUNTA($S$668:S670),1)),SUMIF($R$19:$R$616,$P671,$Z$19:$Z$616))","v":0},null,null,null,null,{"$f":"IF(P672=\"\",$X$690-SUM(OFFSET($X$668:X670,0,0,COUNTA($X$668:X670),1)),ROUND(S671*(1+BDI.Taxa),2))","v":0},null,null,{"$f":"IF(P672=\"\",$AA$690-SUM(OFFSET($AA$668:AA670,0,0,COUNTA($AA$668:AA670),1)),ROUND(X671*100/ORÇAMENTO.TotalOrçamento,2))","v":{"$error":"#DIV/0!"}}]
[null,null,null,null,null,null,null,null,null,null,null,null,null,null,"4.","PASSARELA MODELO 01 - PADRÃO SÉC. XXI 2015",null,null,{"$f":"IF(P673=\"\",$S$690-SUM(OFFSET($S$668:S671,0,0,COUNTA($S$668:S671),1)),SUMIF($R$19:$R$616,$P672,$Z$19:$Z$616))","v":0},null,null,null,null,{"$f":"IF(P673=\"\",$X$690-SUM(OFFSET($X$668:X671,0,0,COUNTA($X$668:X671),1)),ROUND(S672*(1+BDI.Taxa),2))","v":0},null,null,{"$f":"IF(P673=\"\",$AA$690-SUM(OFFSET($AA$668:AA671,0,0,COUNTA($AA$668:AA671),1)),ROUND(X672*100/ORÇAMENTO.TotalOrçamento,2))","v":{"$error":"#DIV/0!"}}]
[null,null,null,null,null,null,null,null,null,null,null,null,null,null,"5.","PASSARELA MODELO 02 - PADRÃO SÉC. XXI 2015",null,null,{"$f":"IF(P674=\"\",$S$690-SUM(OFFSET($S$668:S672,0,0,COUNTA($S$668:S672),1)),SUMIF($R$19:$R$616,$P673,$Z$19:$Z$616))","v":0},null,null,null,null,{"$f":"IF(P674=\"\",$X$690-SUM(OFFSET($X$668:X672,0,0,COUNTA($X$668:X672),1)),ROUND(S673*(1+BDI.Taxa),2))","v":0},null,null,{"$f":"IF(P674=\"\",$AA$690-SUM(OFFSET($AA$668:AA672,0,0,COUNTA($AA$668:AA672),1)),ROUND(X673*100/ORÇAMENTO.TotalOrçamento,2))","v":{"$error":"#DIV/0!"}}]
[null,null,null,null,null,null,null,null,null,null,null,null,null,null,"6.","",null,null,{"$f":"IF(P675=\"\",$S$690-SUM(OFFSET($S$668:S673,0,0,COUNTA($S$668:S673),1)),SUMIF($R$19:$R$616,$P674,$Z$19:$Z$616))","v":0},null,null,null,null,{"$f":"IF(P675=\"\",$X$690-SUM(OFFSET($X$668:X673,0,0,COUNTA($X$668:X673),1)),ROUND(S674*(1+BDI.Taxa),2))","v":0},null,null,{"$f":"IF(P675=\"\",$AA$690-SUM(OFFSET($AA$668:AA673,0,0,COUNTA($AA$668:AA673),1)),ROUND(X674*100/ORÇAMENTO.TotalOrçamento,2))","v":{"$error":"#DIV/0!"}}]
[null,null,null,null,null,null,null,null,null,null,null,null,null,null,"7.","",null,null,{"$f":"IF(P676=\"\",$S$690-SUM(OFFSET($S$668:S674,0,0,COUNTA($S$668:S674),1)),SUMIF($R$19:$R$616,$P675,$Z$19:$Z$616))","v":0},null,null,null,null,{"$f":"IF(P676=\"\",$X$690-SUM(OFFSET($X$668:X674,0,0,COUNTA($X$668:X674),1)),ROUND(S675*(1+BDI.Taxa),2))","v":0},null,null,{"$f":"IF(P676=\"\",$AA$690-SUM(OFFSET($AA$668:AA674,0,0,COUNTA($AA$668:AA674),1)),ROUND(X675*100/ORÇAMENTO.TotalOrçamento,2))","v":{"$error":"#DIV/0!"}}]
[null,null,null,null,null,null,null,null,null,null,null,null,null,null,"8.","",null,null,{"$f":"IF(P677=\"\",$S$690-SUM(OFFSET($S$668:S675,0,0,COUNTA($S$668:S675),1)),SUMIF($R$19:$R$616,$P676,$Z$19:$Z$616))","v":0},null,null,null,null,{"$f":"IF(P677=\"\",$X$690-SUM(OFFSET($X$668:X675,0,0,COUNTA($X$668:X675),1)),ROUND(S676*(1+BDI.Taxa),2))","v":0},null,null,{"$f":"IF(P677=\"\",$AA$690-SUM(OFFSET($AA$668:AA675,0,0,COUNTA($AA$668:AA675),1)),ROUND(X676*100/ORÇAMENTO.TotalOrçamento,2))","v":{"$error":"#DIV/0!"}}]
[null,null,null,null,null,null,null,null,null,null,null,null,null,null,"9.","",null,null,{"$f":"IF(P678=\"\",$S$690-SUM(OFFSET($S$668:S676,0,0,COUNTA($S$668:S676),1)),SUMIF($R$19:$R$616,$P677,$Z$19:$Z$616))","v":0},null,null,null,null,{"$f":"IF(P678=\"\",$X$690-SUM(OFFSET($X$668:X676,0,0,COUNTA($X$668:X676),1)),ROUND(S677*(1+BDI.Taxa),2))","v":0},null,null,{"$f":"IF(P678=\"\",$AA$690-SUM(OFFSET($AA$668:AA676,0,0,COUNTA($AA$668:AA676),1)),ROUND(X677*100/ORÇAMENTO.TotalOrçamento,2))","v":{"$error":"#DIV/0!"}}]
[null,null,null,null,null,null,null,null,null,null,null,null,null,null,"10.","",null,null,{"$f":"IF(P679=\"\",$S$690-SUM(OFFSET($S$668:S677,0,0,COUNTA($S$668:S677),1)),SUMIF($R$19:$R$616,$P678,$Z$19:$Z$616))","v":0},null,null,null,null,{"$f":"IF(P679=\"\",$X$690-SUM(OFFSET($X$668:X677,0,0,COUNTA($X$668:X677),1)),ROUND(S678*(1+BDI.Taxa),2))","v":0},null,null,{"$f":"IF(P679=\"\",$AA$690-SUM(OFFSET($AA$668:AA677,0,0,COUNTA($AA$668:AA677),1)),ROUND(X678*100/ORÇAMENTO.TotalOrçamento,2))","v":{"$error":"#DIV/0!"}}]
[null,null,null,null,null,null,null,null,null,null,null,null,null,null,"11.","",null,null,{"$f":"IF(P680=\"\",$S$690-SUM(OFFSET($S$668:S678,0,0,COUNTA($S$668:S678),1)),SUMIF($R$19:$R$616,$P679,$Z$19:$Z$616))","v":0},null,null,null,null,{"$f":"IF(P680=\"\",$X$690-SUM(OFFSET($X$668:X678,0,0,COUNTA($X$668:X678),1)),ROUND(S679*(1+BDI.Taxa),2))","v":0},null,null,{"$f":"IF(P680=\"\",$AA$690-SUM(OFFSET($AA$668:AA678,0,0,COUNTA($AA$668:AA678),1)),ROUND(X679*100/ORÇAMENTO.TotalOrçamento,2))","v":{"$error":"#DIV/0!"}}]
[null,null,null,null,null,null,null,null,null,null,null,null,null,null,"12.","",null,null,{"$f":"IF(P681=\"\",$S$690-SUM(OFFSET($S$668:S679,0,0,COUNTA($S$668:S679),1)),SUMIF($R$19:$R$616,$P680,$Z$19:$Z$616))","v":0},null,null,null,null,{"$f":"IF(P681=\"\",$X$690-SUM(OFFSET($X$668:X679,0,0,COUNTA($X$668:X679),1)),ROUND(S680*(1+BDI.Taxa),2))","v":0},null,null,{"$f":"IF(P681=\"\",$AA$690-SUM(OFFSET($AA$668:AA679,0,0,COUNTA($AA$668:AA679),1)),ROUND(X680*100/ORÇAMENTO.TotalOrçamento,2))","v":{"$error":"#DIV/0!"}}]
[null,null,null,null,null,null,null,null,null,null,null,null,null,null,"13.","",null,null,{"$f":"IF(P682=\"\",$S$690-SUM(OFFSET($S$668:S680,0,0,COUNTA($S$668:S680),1)),SUMIF($R$19:$R$616,$P681,$Z$19:$Z$616))","v":0},null,null,null,null,{"$f":"IF(P682=\"\",$X$690-SUM(OFFSET($X$668:X680,0,0,COUNTA($X$668:X680),1)),ROUND(S681*(1+BDI.Taxa),2))","v":0},null,null,{"$f":"IF(P682=\"\",$AA$690-SUM(OFFSET($AA$668:AA680,0,0,COUNTA($AA$668:AA680),1)),ROUND(X681*100/ORÇAMENTO.TotalOrçamento,2))","v":{"$error":"#DIV/0!"}}]
[null,null,null,null,null,null,null,null,null,null,null,null,null,null,"14.","",null,null,{"$f":"IF(P683=\"\",$S$690-SUM(OFFSET($S$668:S681,0,0,COUNTA($S$668:S681),1)),SUMIF($R$19:$R$616,$P682,$Z$19:$Z$616))","v":0},null,null,null,null,{"$f":"IF(P683=\"\",$X$690-SUM(OFFSET($X$668:X681,0,0,COUNTA($X$668:X681),1)),ROUND(S682*(1+BDI.Taxa),2))","v":0},null,null,{"$f":"IF(P683=\"\",$AA$690-SUM(OFFSET($AA$668:AA681,0,0,COUNTA($AA$668:AA681),1)),ROUND(X682*100/ORÇAMENTO.TotalOrçamento,2))","v":{"$error":"#DIV/0!"}}]
[null,null,null,null,null,null,null,null,null,null,null,null,null,null,"15.","",null,null,{"$f":"IF(P684=\"\",$S$690-SUM(OFFSET($S$668:S682,0,0,COUNTA($S$668:S682),1)),SUMIF($R$19:$R$616,$P683,$Z$19:$Z$616))","v":0},null,null,null,null,{"$f":"IF(P684=\"\",$X$690-SUM(OFFSET($X$668:X682,0,0,COUNTA($X$668:X682),1)),ROUND(S683*(1+BDI.Taxa),2))","v":0},null,null,{"$f":"IF(P684=\"\",$AA$690-SUM(OFFSET($AA$668:AA682,0,0,COUNTA($AA$668:AA682),1)),ROUND(X683*100/ORÇAMENTO.TotalOrçamento,2))","v":{"$error":"#DIV/0!"}}]
[null,null,null,null,null,null,null,null,null,null,null,null,null,null,"16.","",null,null,{"$f":"IF(P685=\"\",$S$690-SUM(OFFSET($S$668:S683,0,0,COUNTA($S$668:S683),1)),SUMIF($R$19:$R$616,$P684,$Z$19:$Z$616))","v":0},null,null,null,null,{"$f":"IF(P685=\"\",$X$690-SUM(OFFSET($X$668:X683,0,0,COUNTA($X$668:X683),1)),ROUND(S684*(1+BDI.Taxa),2))","v":0},null,null,{"$f":"IF(P685=\"\",$AA$690-SUM(OFFSET($AA$668:AA683,0,0,COUNTA($AA$668:AA683),1)),ROUND(X684*100/ORÇAMENTO.TotalOrçamento,2))","v":{"$error":"#DIV/0!"}}]
[null,null,null,null,null,null,null,null,null,null,null,null,null,null,"17.","",null,null,{"$f":"IF(P686=\"\",$S$690-SUM(OFFSET($S$668:S684,0,0,COUNTA($S$668:S684),1)),SUMIF($R$19:$R$616,$P685,$Z$19:$Z$616))","v":0},null,null,null,null,{"$f":"IF(P686=\"\",$X$690-SUM(OFFSET($X$668:X684,0,0,COUNTA($X$668:X684),1)),ROUND(S685*(1+BDI.Taxa),2))","v":0},null,null,{"$f":"IF(P686=\"\",$AA$690-SUM(OFFSET($AA$668:AA684,0,0,COUNTA($AA$668:AA684),1)),ROUND(X685*100/ORÇAMENTO.TotalOrçamento,2))","v":{"$error":"#DIV/0!"}}]
[null,null,null,null,null,null,null,null,null,null,null,null,null,null,"18.","",null,null,{"$f":"IF(P687=\"\",$S$690-SUM(OFFSET($S$668:S685,0,0,COUNTA($S$668:S685),1)),SUMIF($R$19:$R$616,$P686,$Z$19:$Z$616))","v":0},null,null,null,null,{"$f":"IF(P687=\"\",$X$690-SUM(OFFSET($X$668:X685,0,0,COUNTA($X$668:X685),1)),ROUND(S686*(1+BDI.Taxa),2))","v":0},null,null,{"$f":"IF(P687=\"\",$AA$690-SUM(OFFSET($AA$668:AA685,0,0,COUNTA($AA$668:AA685),1)),ROUND(X686*100/ORÇAMENTO.TotalOrçamento,2))","v":{"$error":"#DIV/0!"}}]
[null,null,null,null,null,null,null,null,null,null,null,null,null,null,"19.","",null,null,{"$f":"IF(P688=\"\",$S$690-SUM(OFFSET($S$668:S686,0,0,COUNTA($S$668:S686),1)),SUMIF($R$19:$R$616,$P687,$Z$19:$Z$616))","v":0},null,null,null,null,{"$f":"IF(P688=\"\",$X$690-SUM(OFFSET($X$668:X686,0,0,COUNTA($X$668:X686),1)),ROUND(S687*(1+BDI.Taxa),2))","v":0},null,null,{"$f":"IF(P688=\"\",$AA$690-SUM(OFFSET($AA$668:AA686,0,0,COUNTA($AA$668:AA686),1)),ROUND(X687*100/ORÇAMENTO.TotalOrçamento,2))","v":{"$error":"#DIV/0!"}}]
[null,null,null,null,null,null,null,null,null,null,null,null,null,null,"20.","",null,null,{"$f":"IF(P689=\"\",$S$690-SUM(OFFSET($S$668:S687,0,0,COUNTA($S$668:S687),1)),SUMIF($R$19:$R$616,$P688,$Z$19:$Z$616))","v":0},null,null,null,null,{"$f":"IF(P689=\"\",$X$690-SUM(OFFSET($X$668:X687,0,0,COUNTA($X$668:X687),1)),ROUND(S688*(1+BDI.Taxa),2))","v":0},null,null,{"$f":"IF(P689=\"\",$AA$690-SUM(OFFSET($AA$668:AA687,0,0,COUNTA($AA$668:AA687),1)),ROUND(X688*100/ORÇAMENTO.TotalOrçamento,2))","v":{"$error":"#DIV/0!"}}]
[null,null,null,null,null,null,null,null,null,null,null,null,null,null,"TOTAL GERAL DO ORÇAMENTO (R$)",null,null,null,{"$f":"SUM(S669:W688)","v":0},null,null,null,null,{"$f":"SUM(X669:Y688)","v":0},null,null,{"$f":"SUM(AA669:AA688)","v":{"$error":"#DIV/0!"}}]
[null,null,null,null,null,null,null,null,null,null,null,null,null,null,null,null,null,null,{"$f":"$Z$617","v":0},null,null,null,null,{"$f":"$Z$619","v":0},null,null,100]
[null,null,null,null,null,null,null,null,null,null,null,null,null,null,null,null,null,null,"(TOTAL SEM BDI)",null,null,null,null,"(TOTAL COM BDI)",null,null,"(ARRED porcentagem)"]
[null,null,null,null,null,null,null,null,null,null,null,null,null,null,null,null,null,null,{"$f":"IF(AND(S689=S690,S689>0),\"OK\",\"ERRO\")","v":"ERRO"},null,null,null,null,{"$f":"IF(AND(X689=X690,X689>0),\"OK\",\"ERRO\")","v":"ERRO"},null,null,{"$f":"IF(AND(AA689=100,S669<>0),\"OK\",\"ERRO\")","v":{"$error":"#DIV/0!"}}]

{"sheet":"Resumo ","index":1,"n_rows":39,"n_cols":9,"rows_kept":39,"cut":false,"hidden":false,"merged":[[42,3,42,7],[41,3,41,7],[38,1,38,8],[22,2,22,5],[23,2,23,5],[24,2,24,5],[25,2,25,5],[26,2,26,5],[32,2,32,5],[33,2,33,5],[34,2,34,5],[35,2,35,5],[27,2,27,5],[28,2,28,5],[29,2,29,5],[30,2,30,5],[31,2,31,5],[1,1,1,8],[2,6,2,8],[3,6,3,8],[4,1,4,8],[5,6,5,8],[6,6,6,8],[7,1,7,8],[8,6,8,8],[9,6,9,8],[13,1,13,8],[11,1,11,2],[12,1,12,2],[0,1,0,8],[36,1,36,5],[2,1,2,5],[3,1,3,5],[5,1,5,5],[6,1,6,5],[8,1,8,5],[9,1,9,5],[11,3,11,5],[12,3,12,5],[10,1,10,8],[11,6,11,8],[12,6,12,8],[19,2,19,5],[20,2,20,5],[21,2,21,5],[13,0,14,0],[15,2,15,5],[16,2,16,5],[17,2,17,5],[18,2,18,5],[14,1,14,8]]}
[]
[]
[null,"UNIDADE ESCOLAR",null,null,null,null,"CÓDIGO INEP"]
[null,{"$f":"Orçamento!$O$4","v":"COLÉGIO ESTADUAL DELFINO OCLÉCIO MACHADO"},null,null,null,null,{"$f":"Orçamento!X4","v":52103099}]
[]
[null,"OBRA",null,null,null,null,"CIDADE"]
[null,{"$f":"Orçamento!$O$7","v":"AMPLIAÇÃO"},null,null,null,null,{"$f":"Orçamento!$X$7","v":"LUZIÂNIA"}]
[]
[null,"ENDEREÇO",null,null,null,null,"CRE"]
[null,{"$f":"Orçamento!$R$10","v":"RUA BOTUCATU, AV. GOVERNADOR JOSÉ FELICIANO FERREIRA 02, JARDIM INGA, CEP:72850-310"},null,null,null,null,{"$f":"Orçamento!$O$10","v":"LUZIÂNIA"}]
[]
[null,"REFERÊNCIA",null,"DATA",null,null,"ÁREA TOTAL CONSTRUÍDA (M²)"]
[null,{"$f":"CONCATENATE(\"AGETOP E SINAPI - \",Orçamento!$Y$10)","v":"AGETOP E SINAPI - ONERADA"},null,{"$f":"Orçamento!$S$7","v":"2020-04-08"},null,null,{"$f":"Orçamento!$S$13","v":3727.83}]
["FILTRO"]
[null,"RESUMO GERAL DO ORÇAMENTO"]
["↓","ITEM","DESCRIÇÃO DOS SERVIÇOS",null,null,null,"PREÇO SEM BDI","PREÇO COM BDI","PARTICIP. (%)"]
[{"$f":"IF(G17>0,\"F\",\"\")","v":""},"1.",{"$f":"Orçamento!$P669","v":"REFORMA"},null,null,null,{"$f":"IFERROR(Orçamento!S669,\"-\")","v":0},{"$f":"IFERROR(Orçamento!X669,\"\")","v":0},{"$f":"Orçamento!AA669","v":{"$error":"#DIV/0!"}}]
[{"$f":"IF(G18>0,\"F\",\"\")","v":""},"2.",{"$f":"Orçamento!$P670","v":"4 SALAS COM VESTIÁRIO"},null,null,null,{"$f":"IFERROR(Orçamento!S670,\"-\")","v":0},{"$f":"IFERROR(Orçamento!X670,\"\")","v":0},{"$f":"Orçamento!AA670","v":{"$error":"#DIV/0!"}}]
["","3.",{"$f":"Orçamento!$P671","v":"4 SALAS"},null,null,null,{"$f":"IFERROR(Orçamento!S671,\"-\")","v":0},{"$f":"IFERROR(Orçamento!X671,\"\")","v":0},{"$f":"Orçamento!AA671","v":{"$error":"#DIV/0!"}}]
["","4.",{"$f":"Orçamento!$P672","v":"PASSARELA MODELO 01 - PADRÃO SÉC. XXI 2015"},null,null,null,{"$f":"IFERROR(Orçamento!S672,\"-\")","v":0},{"$f":"IFERROR(Orçamento!X672,\"\")","v":0},{"$f":"Orçamento!AA672","v":{"$error":"#DIV/0!"}}]
["","5.",{"$f":"Orçamento!$P673","v":"PASSARELA MODELO 02 - PADRÃO SÉC. XXI 2015"},null,null,null,{"$f":"IFERROR(Orçamento!S673,\"-\")","v":0},{"$f":"IFERROR(Orçamento!X673,\"\")","v":0},{"$f":"Orçamento!AA673","v":{"$error":"#DIV/0!"}}]
["","6.",{"$f":"Orçamento!$P674","v":""},null,null,null,{"$f":"IFERROR(Orçamento!S674,\"-\")","v":0},{"$f":"IFERROR(Orçamento!X674,\"\")","v":0},{"$f":"Orçamento!AA674","v":{"$error":"#DIV/0!"}}]
["","7.",{"$f":"Orçamento!$P675","v":""},null,null,null,{"$f":"IFERROR(Orçamento!S675,\"-\")","v":0},{"$f":"IFERROR(Orçamento!X675,\"\")","v":0},{"$f":"Orçamento!AA675","v":{"$error":"#DIV/0!"}}]
["","8.",{"$f":"Orçamento!$P676","v":""},null,null,null,{"$f":"IFERROR(Orçamento!S676,\"-\")","v":0},{"$f":"IFERROR(Orçamento!X676,\"\")","v":0},{"$f":"Orçamento!AA676","v":{"$error":"#DIV/0!"}}]
["","9.",{"$f":"Orçamento!$P677","v":""},null,null,null,{"$f":"IFERROR(Orçamento!S677,\"-\")","v":0},{"$f":"IFERROR(Orçamento!X677,\"\")","v":0},{"$f":"Orçamento!AA677","v":{"$error":"#DIV/0!"}}]
["","10.",{"$f":"Orçamento!$P678","v":""},null,null,null,{"$f":"IFERROR(Orçamento!S678,\"-\")","v":0},{"$f":"IFERROR(Orçamento!X678,\"\")","v":0},{"$f":"Orçamento!AA678","v":{"$error":"#DIV/0!"}}]
["","11.",{"$f":"Orçamento!$P679","v":""},null,null,null,{"$f":"IFERROR(Orçamento!S679,\"-\")","v":0},{"$f":"IFERROR(Orçamento!X679,\"\")","v":0},{"$f":"Orçamento!AA679","v":{"$error":"#DIV/0!"}}]
["","12.",{"$f":"Orçamento!$P680","v":""},null,null,null,{"$f":"IFERROR(Orçamento!S680,\"-\")","v":0},{"$f":"IFERROR(Orçamento!X680,\"\")","v":0},{"$f":"Orçamento!AA680","v":{"$error":"#DIV/0!"}}]
["","13.",{"$f":"Orçamento!$P681","v":""},null,null,null,{"$f":"IFERROR(Orçamento!S681,\"-\")","v":0},{"$f":"IFERROR(Orçamento!X681,\"\")","v":0},{"$f":"Orçamento!AA681","v":{"$error":"#DIV/0!"}}]
["","14.",{"$f":"Orçamento!$P682","v":""},null,null,null,{"$f":"IFERROR(Orçamento!S682,\"-\")","v":0},{"$f":"IFERROR(Orçamento!X682,\"\")","v":0},{"$f":"Orçamento!AA682","v":{"$error":"#DIV/0!"}}]
["","15.",{"$f":"Orçamento!$P683","v":""},null,null,null,{"$f":"IFERROR(Orçamento!S683,\"-\")","v":0},{"$f":"IFERROR(Orçamento!X683,\"\")","v":0},{"$f":"Orçamento!AA683","v":{"$error":"#DIV/0!"}}]
["","16.",{"$f":"Orçamento!$P684","v":""},null,null,null,{"$f":"IFERROR(Orçamento!S684,\"-\")","v":0},{"$f":"IFERROR(Orçamento!X684,\"\")","v":0},{"$f":"Orçamento!AA684","v":{"$error":"#DIV/0!"}}]
["","17.",{"$f":"Orçamento!$P685","v":""},null,null,null,{"$f":"IFERROR(Orçamento!S685,\"-\")","v":0},{"$f":"IFERROR(Orçamento!X685,\"\")","v":0},{"$f":"Orçamento!AA685","v":{"$error":"#DIV/0!"}}]
["","18.",{"$f":"Orçamento!$P686","v":""},null,null,null,{"$f":"IFERROR(Orçamento!S686,\"-\")","v":0},{"$f":"IFERROR(Orçamento!X686,\"\")","v":0},{"$f":"Orçamento!AA686","v":{"$error":"#DIV/0!"}}]
["","19.",{"$f":"Orçamento!$P687","v":""},null,null,null,{"$f":"IFERROR(Orçamento!S687,\"-\")","v":0},{"$f":"IFERROR(Orçamento!X687,\"\")","v":0},{"$f":"Orçamento!AA687","v":{"$error":"#DIV/0!"}}]
["","20.",{"$f":"Orçamento!$P688","v":""},null,null,null,{"$f":"IFERROR(Orçamento!S688,\"-\")","v":0},{"$f":"IFERROR(Orçamento!X688,\"\")","v":0},{"$f":"Orçamento!AA688","v":{"$error":"#DIV/0!"}}]
["F","TOTAL GERAL DO ORÇAMENTO (R$)",null,null,null,null,{"$f":"SUM(G17:G36)","v":0},0,{"$f":"SUM(I17:I36)","v":{"$error":"#DIV/0!"}}]
["F"]
["F"]

{"sheet":"Somatório","index":2,"n_rows":45,"n_cols":6,"rows_kept":45,"cut":false,"hidden":false,"merged":[[0,1,0,5],[14,1,14,5],[2,1,2,3],[2,4,2,5],[3,1,3,3],[3,4,3,5],[5,1,5,3],[5,4,5,5],[6,1,6,3],[6,4,6,5],[8,1,8,3],[8,4,8,5],[1,1,1,5],[4,1,4,5],[7,1,7,5],[10,1,10,5],[9,1,9,3],[9,4,9,5],[11,1,11,2],[11,4,11,5],[12,1,12,2],[12,4,12,5],[13,0,14,0],[42,1,42,2],[44,1,44,5],[47,3,47,5],[48,3,48,5],[13,1,13,5]]}
[]
[]
[null,"UNIDADE ESCOLAR",null,null,"CÓDIGO INEP"]
[null,{"$f":"Orçamento!$O$4","v":"COLÉGIO ESTADUAL DELFINO OCLÉCIO MACHADO"},null,null,{"$f":"Orçamento!X4","v":52103099}]
[]
[null,"OBRA",null,null,"CIDADE"]
[null,{"$f":"Orçamento!$O$7","v":"AMPLIAÇÃO"},null,null,{"$f":"Orçamento!$X$7","v":"LUZIÂNIA"}]
[]
[null,"ENDEREÇO",null,null,"CRE"]
[null,{"$f":"Orçamento!$R$10","v":"RUA BOTUCATU, AV. GOVERNADOR JOSÉ FELICIANO FERREIRA 02, JARDIM INGA, CEP:72850-310"},null,null,{"$f":"Orçamento!$O$10","v":"LUZIÂNIA"}]
[]
[null,"REFERÊNCIA",null,"DATA","ÁREA TOTAL CONSTRUÍDA (M²)"]
[null,{"$f":"CONCATENATE(\"AGETOP E SINAPI - \",Orçamento!$Y$10)","v":"AGETOP E SINAPI - ONERADA"},null,{"$f":"Orçamento!$S$7","v":"2020-04-08"},{"$f":"Orçamento!$S$13","v":3727.83}]
["FILTRO"]
[null,"SOMATÓRIO DE SERVIÇOS"]
["↓","ITEM","DESCRIÇÃO DOS SERVIÇOS","PREÇO SEM BDI (R$)","PREÇO COM BDI (R$)","PARTIC.  ( % )"]
[{"$f":"IF(D17>0,\"F\",\"\")","v":""},"a.",{"$f":"Orçamento!P635","v":"SERVIÇOS PRELIMINARES"},{"$f":"Orçamento!S635","v":0},{"$f":"Orçamento!X635","v":0},{"$f":"Orçamento!AA635","v":0}]
[{"$f":"IF(D18>0,\"F\",\"\")","v":""},"b.",{"$f":"Orçamento!P636","v":"TRANSPORTES"},{"$f":"Orçamento!S636","v":0},{"$f":"Orçamento!X636","v":0},{"$f":"Orçamento!AA636","v":0}]
["","c.",{"$f":"Orçamento!P637","v":"SERVIÇO EM TERRA"},{"$f":"Orçamento!S637","v":0},{"$f":"Orçamento!X637","v":0},{"$f":"Orçamento!AA637","v":0}]
["","d.",{"$f":"Orçamento!P638","v":"FUNDAÇÕES E SONDAGENS"},{"$f":"Orçamento!S638","v":0},{"$f":"Orçamento!X638","v":0},{"$f":"Orçamento!AA638","v":0}]
["","e.",{"$f":"Orçamento!P639","v":"ESTRUTURA"},{"$f":"Orçamento!S639","v":0},{"$f":"Orçamento!X639","v":0},{"$f":"Orçamento!AA639","v":0}]
["","f.",{"$f":"Orçamento!P640","v":"INSTALAÇÕES ELÉTRICAS"},{"$f":"Orçamento!S640","v":0},{"$f":"Orçamento!X640","v":0},{"$f":"Orçamento!AA640","v":0}]
["","g.",{"$f":"Orçamento!P641","v":"INSTALAÇÕES HIDROSSANITÁRIAS"},{"$f":"Orçamento!S641","v":0},{"$f":"Orçamento!X641","v":0},{"$f":"Orçamento!AA641","v":0}]
["","h",{"$f":"Orçamento!P642","v":"INSTALAÇÕES ESPECIAIS"},{"$f":"Orçamento!S642","v":0},{"$f":"Orçamento!X642","v":0},{"$f":"Orçamento!AA642","v":0}]
["","i.",{"$f":"Orçamento!P643","v":"ALVENARIAS E DIVISÓRIAS"},{"$f":"Orçamento!S643","v":0},{"$f":"Orçamento!X643","v":0},{"$f":"Orçamento!AA643","v":0}]
["","j.",{"$f":"Orçamento!P644","v":"ALVENARIA AUTO-PORTANTE"},{"$f":"Orçamento!S644","v":0},{"$f":"Orçamento!X644","v":0},{"$f":"Orçamento!AA644","v":0}]
["","k.",{"$f":"Orçamento!P645","v":"IMPERMEABILIZAÇÃO"},{"$f":"Orçamento!S645","v":0},{"$f":"Orçamento!X645","v":0},{"$f":"Orçamento!AA645","v":0}]
["","l.",{"$f":"Orçamento!P646","v":"ISOLAMENTO TÉRMICO E ACÚSTICO"},{"$f":"Orçamento!S646","v":0},{"$f":"Orçamento!X646","v":0},{"$f":"Orçamento!AA646","v":0}]
["","m.",{"$f":"Orçamento!P647","v":"ESTRUTURA DE MADEIRA"},{"$f":"Orçamento!S647","v":0},{"$f":"Orçamento!X647","v":0},{"$f":"Orçamento!AA647","v":0}]
["","n.",{"$f":"Orçamento!P648","v":"ESTRUTURAS METÁLICAS"},{"$f":"Orçamento!S648","v":0},{"$f":"Orçamento!X648","v":0},{"$f":"Orçamento!AA648","v":0}]
["","o.",{"$f":"Orçamento!P649","v":"COBERTURAS"},{"$f":"Orçamento!S649","v":0},{"$f":"Orçamento!X649","v":0},{"$f":"Orçamento!AA649","v":0}]
["","p.",{"$f":"Orçamento!P650","v":"ESQUADRIAS DE MADEIRA"},{"$f":"Orçamento!S650","v":0},{"$f":"Orçamento!X650","v":0},{"$f":"Orçamento!AA650","v":0}]
["","q.",{"$f":"Orçamento!P651","v":"ESQUADRIAS METÁLICAS"},{"$f":"Orçamento!S651","v":0},{"$f":"Orçamento!X651","v":0},{"$f":"Orçamento!AA651","v":0}]
["","r.",{"$f":"Orçamento!P652","v":"VIDROS"},{"$f":"Orçamento!S652","v":0},{"$f":"Orçamento!X652","v":0},{"$f":"Orçamento!AA652","v":0}]
["","s.",{"$f":"Orçamento!P653","v":"REVESTIMENTO DE PAREDE"},{"$f":"Orçamento!S653","v":0},{"$f":"Orçamento!X653","v":0},{"$f":"Orçamento!AA653","v":0}]
["","t.",{"$f":"Orçamento!P654","v":"FORROS"},{"$f":"Orçamento!S654","v":0},{"$f":"Orçamento!X654","v":0},{"$f":"Orçamento!AA654","v":0}]
["","u.",{"$f":"Orçamento!P655","v":"REVESTIMENTO DE PISO"},{"$f":"Orçamento!S655","v":0},{"$f":"Orçamento!X655","v":0},{"$f":"Orçamento!AA655","v":0}]
["","v.",{"$f":"Orçamento!P656","v":"FERRAGENS"},{"$f":"Orçamento!S656","v":0},{"$f":"Orçamento!X656","v":0},{"$f":"Orçamento!AA656","v":0}]
["","w.",{"$f":"Orçamento!P657","v":"MARCENARIA"},{"$f":"Orçamento!S657","v":0},{"$f":"Orçamento!X657","v":0},{"$f":"Orçamento!AA657","v":0}]
["","x.",{"$f":"Orçamento!P658","v":"ADMINISTRAÇÃO"},{"$f":"Orçamento!S658","v":0},{"$f":"Orçamento!X658","v":0},{"$f":"Orçamento!AA658","v":0}]
["","y.",{"$f":"Orçamento!P659","v":"PINTURA"},{"$f":"Orçamento!S659","v":0},{"$f":"Orçamento!X659","v":0},{"$f":"Orçamento!AA659","v":0}]
["","z.",{"$f":"Orçamento!P660","v":"DIVERSOS"},{"$f":"Orçamento!S660","v":0},{"$f":"Orçamento!X660","v":0},{"$f":"Orçamento!AA660","v":0}]
["F","TOTAL GERAL DO ORÇAMENTO",null,{"$f":"SUM(D17:D42)","v":0},{"$f":"SUM(E17:E42)","v":0},{"$f":"SUM(F17:F42)","v":0}]
[]
[null,"(*) Para itens da AGETOP, os vidros não estão inclusos nas esquadrias e já foram considerados os custos de contramarco para as esquadrias de alumínio;"]

{"sheet":"Cronog_120_Dias","index":3,"n_rows":99,"n_cols":22,"rows_kept":99,"cut":false,"hidden":false,"merged":[[0,1,0,21],[2,1,2,7],[3,1,3,7],[5,1,5,7],[6,1,6,7],[8,1,8,7],[9,1,9,7],[1,1,1,21],[7,1,7,21],[4,1,4,21],[10,1,10,21],[9,8,9,21],[8,8,8,21],[3,8,3,21],[6,8,6,21],[5,8,5,21],[2,8,2,21],[50,1,52,2],[71,3,73,3],[12,21,13,21],[13,1,13,2],[13,5,13,8],[13,17,13,20],[12,3,13,3],[12,17,12,20],[14,1,16,2],[12,5,12,8],[17,1,19,2],[17,4,19,4],[17,5,17,8],[17,17,17,20],[19,5,19,8],[19,17,19,20],[20,1,22,2],[65,1,67,2],[68,3,70,3],[62,3,64,3],[68,1,70,2],[56,3,58,3],[65,4,67,4],[74,3,76,3],[50,4,52,4],[74,4,76,4],[56,1,58,2],[56,4,58,4],[50,3,52,3],[53,3,55,3],[68,4,70,4],[62,1,64,2],[62,4,64,4],[59,3,61,3],[53,1,55,2],[53,4,55,4],[59,1,61,2],[59,4,61,4],[74,1,76,2],[20,4,22,4],[20,5,20,8],[20,17,20,20],[22,5,22,8],[22,17,22,20],[20,3,22,3],[14,3,16,3],[17,3,19,3],[14,4,16,4],[14,5,14,8],[14,17,14,20],[16,5,16,8],[16,17,16,20],[23,17,23,20],[25,5,25,8],[25,17,25,20],[26,1,28,2],[26,4,28,4],[26,5,26,8],[26,17,26,20],[28,5,28,8],[28,17,28,20],[23,3,25,3],[23,1,25,2],[23,4,25,4],[23,5,23,8],[26,3,28,3],[25,9,25,12],[26,9,26,12],[28,9,28,12],[29,17,29,20],[31,5,31,8],[31,17,31,20],[32,1,34,2],[32,4,34,4],[32,5,32,8],[32,17,32,20],[34,5,34,8],[34,17,34,20],[32,3,34,3],[29,5,29,8],[29,1,31,2],[29,4,31,4],[29,3,31,3],[29,9,29,12],[31,9,31,12],[32,9,32,12],[34,9,34,12],[35,17,35,20],[37,5,37,8],[37,17,37,20],[35,3,37,3],[40,17,40,20],[38,3,40,3],[38,17,38,20],[41,1,43,2],[41,4,43,4],[41,5,41,8],[41,17,41,20],[43,5,43,8],[43,17,43,20],[41,3,43,3],[35,5,35,8],[38,5,38,8],[40,5,40,8],[35,1,37,2],[35,4,37,4],[38,1,40,2],[38,4,40,4],[35,9,35,12],[37,9,37,12],[38,9,38,12],[44,17,44,20],[46,5,46,8],[46,17,46,20],[47,1,49,2],[47,4,49,4],[47,5,47,8],[47,17,47,20],[49,5,49,8],[49,17,49,20],[44,5,44,8],[47,3,49,3],[44,3,46,3],[44,1,46,2],[44,4,46,4],[53,17,53,20],[55,5,55,8],[55,17,55,20],[50,5,50,8],[50,17,50,20],[52,5,52,8],[52,17,52,20],[56,17,56,20],[58,5,58,8],[58,17,58,20],[53,5,53,8],[56,5,56,8],[53,9,53,12],[55,9,55,12],[56,9,56,12],[58,9,58,12],[53,13,53,16],[55,13,55,16],[56,13,56,16],[58,13,58,16],[68,5,68,8],[65,5,65,8],[65,17,65,20],[67,5,67,8],[67,17,67,20],[65,3,67,3],[62,17,62,20],[64,5,64,8],[64,17,64,20],[62,5,62,8],[95,1,95,2],[95,5,95,8],[95,17,95,20],[97,1,97,4],[98,1,98,21],[86,17,86,20],[88,5,88,8],[88,17,88,20],[85,5,85,8],[85,17,85,20],[89,1,91,2],[89,4,91,4],[89,5,89,8],[89,17,89,20],[91,5,91,8],[91,17,91,20],[89,3,91,3],[86,4,88,4],[86,5,86,8],[86,3,88,3],[83,1,85,2],[83,4,85,4],[83,5,83,8],[83,17,83,20],[94,1,94,2],[94,5,94,8],[94,17,94,20],[76,5,76,8],[76,17,76,20],[77,5,77,8],[77,17,77,20],[79,5,79,8],[79,17,79,20],[80,5,80,8],[80,17,80,20],[82,5,82,8],[82,17,82,20],[77,3,79,3],[80,3,82,3],[86,1,88,2],[80,4,82,4],[83,3,85,3],[77,1,79,2],[77,4,79,4],[80,1,82,2],[86,9,86,12],[88,9,88,12],[89,9,89,12],[12,0,13,0],[9,0,11,0],[11,1,11,21],[92,1,92,2],[92,5,92,8],[92,17,92,20],[93,1,93,2],[93,5,93,8],[93,17,93,20],[74,17,74,20],[74,5,74,8],[68,17,68,20],[70,5,70,8],[70,17,70,20],[59,5,59,8],[71,1,73,2],[71,4,73,4],[71,5,71,8],[71,17,71,20],[73,5,73,8],[73,17,73,20],[59,17,59,20],[61,5,61,8],[61,17,61,20],[12,9,12,12],[13,9,13,12],[14,9,14,12],[16,9,16,12],[17,9,17,12],[19,9,19,12],[20,9,20,12],[22,9,22,12],[23,9,23,12],[40,9,40,12],[41,9,41,12],[43,9,43,12],[44,9,44,12],[46,9,46,12],[47,9,47,12],[49,9,49,12],[50,9,50,12],[52,9,52,12],[59,9,59,12],[61,9,61,12],[62,9,62,12],[64,9,64,12],[65,9,65,12],[67,9,67,12],[68,9,68,12],[70,9,70,12],[71,9,71,12],[73,9,73,12],[74,9,74,12],[76,9,76,12],[77,9,77,12],[79,9,79,12],[80,9,80,12],[82,9,82,12],[83,9,83,12],[85,9,85,12],[91,9,91,12],[92,9,92,12],[93,9,93,12],[94,9,94,12],[95,9,95,12],[12,13,12,16],[13,13,13,16],[14,13,14,16],[16,13,16,16],[17,13,17,16],[19,13,19,16],[20,13,20,16],[22,13,22,16],[23,13,23,16],[25,13,25,16],[26,13,26,16],[28,13,28,16],[29,13,29,16],[31,13,31,16],[32,13,32,16],[34,13,34,16],[35,13,35,16],[37,13,37,16],[38,13,38,16],[40,13,40,16],[41,13,41,16],[43,13,43,16],[44,13,44,16],[46,13,46,16],[47,13,47,16],[49,13,49,16],[50,13,50,16],[52,13,52,16],[59,13,59,16],[61,13,61,16],[62,13,62,16],[64,13,64,16],[65,13,65,16],[67,13,67,16],[68,13,68,16],[70,13,70,16],[71,13,71,16],[86,13,86,16],[88,13,88,16],[89,13,89,16],[91,13,91,16],[92,13,92,16],[93,13,93,16],[94,13,94,16],[95,13,95,16],[73,13,73,16],[74,13,74,16],[76,13,76,16],[77,13,77,16],[79,13,79,16],[80,13,80,16],[82,13,82,16],[83,13,83,16],[85,13,85,16]]}
[]
[]
[null,"UNIDADE ESCOLAR",null,null,null,null,null,null,"PRAZO"]
[null,{"$f":"Orçamento!$O$4","v":"COLÉGIO ESTADUAL DELFINO OCLÉCIO MACHADO"},null,null,null,null,null,null,"120 DIAS CORRIDOS"]
[]
[null,"OBRA",null,null,null,null,null,null,"DATA"]
[null,{"$f":"Orçamento!$O$7","v":"AMPLIAÇÃO"},null,null,null,null,null,null,{"$f":"Orçamento!$S$7","v":"2020-04-08"}]
[]
[null,"LOCAL",null,null,null,null,null,null,"ÁREA TOTAL CONSTRUÍDA (M²)"]
["FILTRO",{"$f":"Orçamento!$X$7","v":"LUZIÂNIA"},null,null,null,null,null,null,{"$f":"Orçamento!$S$13","v":3727.83}]
[]
[null,"CRONOGRAMA - FÍSICO FINANCEIRO"]
["↓","CUSTO TOTAL:",{"$f":"D93","v":0},"VALOR","Dias:",30,null,null,null,60,null,null,null,90,null,null,null,120,null,null,null,"TOTAL"]
[null,"DESCRIÇÃO DOS SERVIÇOS",null,null,"%","1ª PARCELA",null,null,null,"2ª PARCELA",null,null,null,"3ª PARCELA",null,null,null,"4ª PARCELA"]
[{"$f":"IF(D15>0,\"F\",\"\")","v":""},"SERVIÇOS PRELIMINARES",null,{"$f":"Orçamento!X635","v":0},{"$f":"Orçamento!AA635","v":0},{"$f":"ROUND(F17*$D$15,2)","v":0},null,null,null,{"$f":"ROUND(J17*$D$15,2)","v":0},null,null,null,{"$f":"ROUND(N17*$D$15,2)","v":0},null,null,null,{"$f":"ROUND(R17*$D$15,2)","v":0},null,null,null,{"$f":"SUM(F15:U15)","v":0}]
[{"$f":"IF(A15=\"F\",A15,\"\")","v":""}]
[{"$f":"IF(A16=\"F\",A16,\"\")","v":""},null,null,null,null,1,null,null,null,null,null,null,null,null,null,null,null,{"$f":"1-F17","v":0},null,null,null,{"$f":"IFERROR(E15/100,\"\")","v":0}]
[{"$f":"IF(D18>0,\"F\",\"\")","v":""},"TRANSPORTES",null,{"$f":"Orçamento!X636","v":0},{"$f":"Orçamento!AA636","v":0},{"$f":"ROUND(F20*$D$18,2)","v":0},null,null,null,{"$f":"ROUND(J20*$D$18,2)","v":0},null,null,null,{"$f":"ROUND(N20*$D$18,2)","v":0},null,null,null,{"$f":"D18-F18-J18-N18","v":0},null,null,null,{"$f":"SUM(F18:U18)","v":0}]
[{"$f":"IF(A18=\"F\",A18,\"\")","v":""}]
[{"$f":"IF(A19=\"F\",A19,\"\")","v":""},null,null,null,null,0.23,null,null,null,0.24,null,null,null,0.28000000000000003,null,null,null,0.25,null,null,null,{"$f":"IFERROR(E18/100,\"\")","v":0}]
[{"$f":"IF(D21>0,\"F\",\"\")","v":""},"SERVIÇO EM TERRA",null,{"$f":"Orçamento!X637","v":0},{"$f":"Orçamento!AA637","v":0},{"$f":"ROUND(F23*$D$21,2)","v":0},null,null,null,{"$f":"ROUND(J23*$D$21,2)","v":0},null,null,null,{"$f":"ROUND(N23*$D$21,2)","v":0},null,null,null,{"$f":"ROUND(R23*$D$21,2)","v":0},null,null,null,{"$f":"SUM(F21:U21)","v":0}]
[{"$f":"IF(A21=\"F\",A21,\"\")","v":""}]
[{"$f":"IF(A22=\"F\",A22,\"\")","v":""},null,null,null,null,1,null,null,null,null,null,null,null,null,null,null,null,{"$f":"1-F23","v":0},null,null,null,{"$f":"IFERROR(E21/100,\"\")","v":0}]
[{"$f":"IF(D24>0,\"F\",\"\")","v":""},"FUNDAÇÕES E SONDAGENS",null,{"$f":"Orçamento!X638","v":0},{"$f":"Orçamento!AA638","v":0},{"$f":"ROUND(F26*$D$24,2)","v":0},null,null,null,{"$f":"ROUND(J26*$D$24,2)","v":0},null,null,null,{"$f":"ROUND(N26*$D$24,2)","v":0},null,null,null,{"$f":"ROUND(R26*$D$24,2)","v":0},null,null,null,{"$f":"SUM(F24:U24)","v":0}]
[{"$f":"IF(A24=\"F\",A24,\"\")","v":""}]
[{"$f":"IF(A25=\"F\",A25,\"\")","v":""},null,null,null,null,0.8,null,null,null,0.2,null,null,null,null,null,null,null,null,null,null,null,{"$f":"IFERROR(E24/100,\"\")","v":0}]
[{"$f":"IF(D27>0,\"F\",\"\")","v":""},"ESTRUTURA",null,{"$f":"Orçamento!X639","v":0},{"$f":"Orçamento!AA639","v":0},{"$f":"ROUND(F29*$D$27,2)","v":0},null,null,null,{"$f":"ROUND(J29*$D$27,2)","v":0},null,null,null,{"$f":"ROUND(N29*$D$27,2)","v":0},null,null,null,{"$f":"ROUND(R29*$D$27,2)","v":0},null,null,null,{"$f":"SUM(F27:U27)","v":0}]
[{"$f":"IF(A27=\"F\",A27,\"\")","v":""}]
[{"$f":"IF(A28=\"F\",A28,\"\")","v":""},null,null,null,null,0.6,null,null,null,0.4,null,null,null,null,null,null,null,null,null,null,null,{"$f":"IFERROR(E27/100,\"\")","v":0}]
[{"$f":"IF(D30>0,\"F\",\"\")","v":""},"INST.ELET/TELEFÔNICA/CABEAMENTO ESTRUTURADO",null,{"$f":"Orçamento!X640","v":0},{"$f":"Orçamento!AA640","v":0},{"$f":"ROUND(F32*$D$30,2)","v":0},null,null,null,{"$f":"ROUND(J32*$D$30,2)","v":0},null,null,null,{"$f":"ROUND(N32*$D$30,2)","v":0},null,null,null,{"$f":"ROUND(R32*$D$30,2)","v":0},null,null,null,{"$f":"SUM(F30:U30)","v":0}]
[{"$f":"IF(A30=\"F\",A30,\"\")","v":""}]
[{"$f":"IF(A31=\"F\",A31,\"\")","v":""},null,null,null,null,0.2,null,null,null,0.5,null,null,null,0.2,null,null,null,0.1,null,null,null,{"$f":"IFERROR(E30/100,\"\")","v":0}]
[{"$f":"IF(D33>0,\"F\",\"\")","v":""},"INSTALAÇÕES HIDROSSANITÁRIAS",null,{"$f":"Orçamento!X641","v":0},{"$f":"Orçamento!AA641","v":0},{"$f":"ROUND(F35*$D$33,2)","v":0},null,null,null,{"$f":"ROUND(J35*$D$33,2)","v":0},null,null,null,{"$f":"ROUND(N35*$D$33,2)","v":0},null,null,null,{"$f":"ROUND(R35*$D$33,2)","v":0},null,null,null,{"$f":"SUM(F33:U33)","v":0}]
[{"$f":"IF(A33=\"F\",A33,\"\")","v":""}]
[{"$f":"IF(A34=\"F\",A34,\"\")","v":""},null,null,null,null,0.2,null,null,null,0.5,null,null,null,0.2,null,null,null,0.1,null,null,null,{"$f":"IFERROR(E33/100,\"\")","v":0}]
[{"$f":"IF(D36>0,\"F\",\"\")","v":""},"INSTALAÇÕES ESPECIAIS",null,{"$f":"Orçamento!X642","v":0},{"$f":"Orçamento!AA642","v":0},{"$f":"ROUND(F38*$D$36,2)","v":0},null,null,null,{"$f":"ROUND(J38*$D$36,2)","v":0},null,null,null,{"$f":"ROUND(N38*$D$36,2)","v":0},null,null,null,{"$f":"ROUND(R38*$D$36,2)","v":0},null,null,null,{"$f":"SUM(F36:U36)","v":0}]
[{"$f":"IF(A36=\"F\",A36,\"\")","v":""}]
[{"$f":"IF(A37=\"F\",A37,\"\")","v":""},null,null,null,null,1,null,null,null,null,null,null,null,null,null,null,null,{"$f":"1-F38","v":0},null,null,null,{"$f":"IFERROR(E36/100,\"\")","v":0}]
[{"$f":"IF(D39>0,\"F\",\"\")","v":""},"ALVENARIA E DIVISÓRIAS",null,{"$f":"Orçamento!X643","v":0},{"$f":"Orçamento!AA643","v":0},{"$f":"ROUND(F41*$D$39,2)","v":0},null,null,null,{"$f":"ROUND(J41*$D$39,2)","v":0},null,null,null,{"$f":"ROUND(N41*$D$39,2)","v":0},null,null,null,{"$f":"ROUND(R41*$D$39,2)","v":0},null,null,null,{"$f":"SUM(F39:U39)","v":0}]
[{"$f":"IF(A39=\"F\",A39,\"\")","v":""}]
[{"$f":"IF(A40=\"F\",A40,\"\")","v":""},null,null,null,null,0.2,null,null,null,0.3,null,null,null,0.3,null,null,null,0.2,null,null,null,{"$f":"IFERROR(E39/100,\"\")","v":0}]
[{"$f":"IF(D42>0,\"F\",\"\")","v":""},"ALVENARIA AUTO-PORTANTE",null,{"$f":"Orçamento!X644","v":0},{"$f":"Orçamento!AA644","v":0},{"$f":"ROUND(F44*$D$42,2)","v":0},null,null,null,{"$f":"ROUND(J44*$D$42,2)","v":0},null,null,null,{"$f":"ROUND(N44*$D$42,2)","v":0},null,null,null,{"$f":"ROUND(R44*$D$42,2)","v":0},null,null,null,{"$f":"SUM(F42:U42)","v":0}]
[{"$f":"IF(A42=\"F\",A42,\"\")","v":""}]
[{"$f":"IF(A43=\"F\",A43,\"\")","v":""},null,null,null,null,1,null,null,null,null,null,null,null,null,null,null,null,{"$f":"1-F44","v":0},null,null,null,{"$f":"IFERROR(E42/100,\"\")","v":0}]
[{"$f":"IF(D45>0,\"F\",\"\")","v":""},"IMPERMEABILIZAÇÃO",null,{"$f":"Orçamento!X645","v":0},{"$f":"Orçamento!AA645","v":0},{"$f":"ROUND(F47*$D$45,2)","v":0},null,null,null,{"$f":"ROUND(J47*$D$45,2)","v":0},null,null,null,{"$f":"ROUND(N47*$D$45,2)","v":0},null,null,null,{"$f":"ROUND(R47*$D$45,2)","v":0},null,null,null,{"$f":"SUM(F45:U45)","v":0}]
[{"$f":"IF(A45=\"F\",A45,\"\")","v":""}]
[{"$f":"IF(A46=\"F\",A46,\"\")","v":""},null,null,null,null,0.8,null,null,null,0.2,null,null,null,null,null,null,null,null,null,null,null,{"$f":"IFERROR(E45/100,\"\")","v":0}]
[{"$f":"IF(D48>0,\"F\",\"\")","v":""},"ISOLAMENTO TÉRMICO E ACÚSTICO",null,{"$f":"Orçamento!X646","v":0},{"$f":"Orçamento!AA646","v":0},{"$f":"ROUND(F50*$D$48,2)","v":0},null,null,null,{"$f":"ROUND(J50*$D$48,2)","v":0},null,null,null,{"$f":"ROUND(N50*$D$48,2)","v":0},null,null,null,{"$f":"ROUND(R50*$D$48,2)","v":0},null,null,null,{"$f":"SUM(F48:U48)","v":0}]
[{"$f":"IF(A48=\"F\",A48,\"\")","v":""}]
[{"$f":"IF(A49=\"F\",A49,\"\")","v":""},null,null,null,null,null,null,null,null,null,null,null,null,null,null,null,null,null,null,null,null,{"$f":"IFERROR(E48/100,\"\")","v":0}]
[{"$f":"IF(D51>0,\"F\",\"\")","v":""},"ESTRUTURA DE MADEIRA",null,{"$f":"Orçamento!X647","v":0},{"$f":"Orçamento!AA647","v":0},{"$f":"ROUND(F53*$D$51,2)","v":0},null,null,null,{"$f":"ROUND(J53*$D$51,2)","v":0},null,null,null,{"$f":"ROUND(N53*$D$51,2)","v":0},null,null,null,{"$f":"ROUND(R53*$D$51,2)","v":0},null,null,null,{"$f":"SUM(F51:U51)","v":0}]
[{"$f":"IF(A51=\"F\",A51,\"\")","v":""}]
[{"$f":"IF(A52=\"F\",A52,\"\")","v":""},null,null,null,null,0.4,null,null,null,{"$f":"1-B53","v":1},null,null,null,{"$f":"1-B53","v":1},null,null,null,{"$f":"1-F53","v":0.6},null,null,null,{"$f":"IFERROR(E51/100,\"\")","v":0}]
[{"$f":"IF(D54>0,\"F\",\"\")","v":""},"ESTRUTURA METÁLICA",null,{"$f":"Orçamento!X648","v":0},{"$f":"Orçamento!AA648","v":0},{"$f":"ROUND(F56*$D$54,2)","v":0},null,null,null,{"$f":"ROUND(J56*$D$54,2)","v":0},null,null,null,{"$f":"ROUND(N56*$D$54,2)","v":0},null,null,null,{"$f":"ROUND(R56*$D$54,2)","v":0},null,null,null,{"$f":"SUM(F54:U54)","v":0}]
[{"$f":"IF(A54=\"F\",A54,\"\")","v":""}]
[{"$f":"IF(A55=\"F\",A55,\"\")","v":""},null,null,null,null,0.8,null,null,null,0.2,null,null,null,null,null,null,null,null,null,null,null,{"$f":"IFERROR(E54/100,\"\")","v":0}]
[{"$f":"IF(D57>0,\"F\",\"\")","v":""},"COBERTURAS",null,{"$f":"Orçamento!X649","v":0},{"$f":"Orçamento!AA649","v":0},{"$f":"ROUND(F59*$D$57,2)","v":0},null,null,null,{"$f":"ROUND(J59*$D$57,2)","v":0},null,null,null,{"$f":"ROUND(N59*$D$57,2)","v":0},null,null,null,{"$f":"ROUND(R59*$D$57,2)","v":0},null,null,null,{"$f":"SUM(F57:U57)","v":0}]
[{"$f":"IF(A57=\"F\",A57,\"\")","v":""}]
[{"$f":"IF(A58=\"F\",A58,\"\")","v":""},null,null,null,null,0,null,null,null,null,null,null,null,0.3,null,null,null,0.7,null,null,null,{"$f":"IFERROR(E57/100,\"\")","v":0}]
[{"$f":"IF(D60>0,\"F\",\"\")","v":""},"ESQUADRIAS DE MADEIRA",null,{"$f":"Orçamento!X650","v":0},{"$f":"Orçamento!AA650","v":0},{"$f":"ROUND(F62*$D$60,2)","v":0},null,null,null,{"$f":"ROUND(J62*$D$60,2)","v":0},null,null,null,{"$f":"ROUND(N62*$D$60,2)","v":0},null,null,null,{"$f":"ROUND(R62*$D$60,2)","v":0},null,null,null,{"$f":"SUM(F60:U60)","v":0}]
[{"$f":"IF(A60=\"F\",A60,\"\")","v":""}]
[{"$f":"IF(A61=\"F\",A61,\"\")","v":""},null,null,null,null,0.54,null,null,null,{"$f":"1-B62","v":1},null,null,null,{"$f":"1-B62","v":1},null,null,null,{"$f":"1-F62","v":0.45999999999999996},null,null,null,{"$f":"IFERROR(E60/100,\"\")","v":0}]
[{"$f":"IF(D63>0,\"F\",\"\")","v":""},"ESQUADRIAS METÁLICAS",null,{"$f":"Orçamento!X651","v":0},{"$f":"Orçamento!AA651","v":0},{"$f":"ROUND(F65*$D$63,2)","v":0},null,null,null,{"$f":"ROUND(J65*$D$63,2)","v":0},null,null,null,{"$f":"ROUND(N65*$D$63,2)","v":0},null,null,null,{"$f":"ROUND(R65*$D$63,2)","v":0},null,null,null,{"$f":"SUM(F63:U63)","v":0}]
[{"$f":"IF(A63=\"F\",A63,\"\")","v":""}]
[{"$f":"IF(A64=\"F\",A64,\"\")","v":""},null,null,null,null,null,null,null,null,null,null,null,null,0.2,null,null,null,0.8,null,null,null,{"$f":"IFERROR(E63/100,\"\")","v":0}]
[{"$f":"IF(D66>0,\"F\",\"\")","v":""},"VIDROS",null,{"$f":"Orçamento!X652","v":0},{"$f":"Orçamento!AA652","v":0},{"$f":"ROUND(F68*$D$66,2)","v":0},null,null,null,{"$f":"ROUND(J68*$D$66,2)","v":0},null,null,null,{"$f":"ROUND(N68*$D$66,2)","v":0},null,null,null,{"$f":"ROUND(R68*$D$66,2)","v":0},null,null,null,{"$f":"SUM(F66:U66)","v":0}]
[{"$f":"IF(A66=\"F\",A66,\"\")","v":""}]
[{"$f":"IF(A67=\"F\",A67,\"\")","v":""},null,null,null,null,0,null,null,null,null,null,null,null,null,null,null,null,{"$f":"1-F68","v":1},null,null,null,{"$f":"IFERROR(E66/100,\"\")","v":0}]
[{"$f":"IF(D69>0,\"F\",\"\")","v":""},"REVESTIMENTO DE PAREDE",null,{"$f":"Orçamento!X653","v":0},{"$f":"Orçamento!AA653","v":0},{"$f":"ROUND(F71*$D$69,2)","v":0},null,null,null,{"$f":"ROUND(J71*$D$69,2)","v":0},null,null,null,{"$f":"ROUND(N71*$D$69,2)","v":0},null,null,null,{"$f":"ROUND(R71*$D$69,2)","v":0},null,null,null,{"$f":"SUM(F69:U69)","v":0}]
[{"$f":"IF(A69=\"F\",A69,\"\")","v":""}]
[{"$f":"IF(A70=\"F\",A70,\"\")","v":""},null,null,null,null,null,null,null,null,0.2,null,null,null,0.5,null,null,null,0.3,null,null,null,{"$f":"IFERROR(E69/100,\"\")","v":0}]
[{"$f":"IF(D72>0,\"F\",\"\")","v":""},"FORROS",null,{"$f":"Orçamento!X654","v":0},{"$f":"Orçamento!AA654","v":0},{"$f":"ROUND(F74*$D$72,2)","v":0},null,null,null,{"$f":"ROUND(J74*$D$72,2)","v":0},null,null,null,{"$f":"ROUND(N74*$D$72,2)","v":0},null,null,null,{"$f":"ROUND(R74*$D$72,2)","v":0},null,null,null,{"$f":"SUM(F72:U72)","v":0}]
[{"$f":"IF(A72=\"F\",A72,\"\")","v":""}]
[{"$f":"IF(A73=\"F\",A73,\"\")","v":""},null,null,null,null,null,null,null,null,null,null,null,null,null,null,null,null,{"$f":"1-F74","v":1},null,null,null,{"$f":"IFERROR(E72/100,\"\")","v":0}]
[{"$f":"IF(D75>0,\"F\",\"\")","v":""},"REVESTIMENTO DE PISO",null,{"$f":"Orçamento!X655","v":0},{"$f":"Orçamento!AA655","v":0},{"$f":"ROUND(F77*$D$75,2)","v":0},null,null,null,{"$f":"ROUND(J77*$D$75,2)","v":0},null,null,null,{"$f":"ROUND(N77*$D$75,2)","v":0},null,null,null,{"$f":"D75-F75-J75-N75","v":0},null,null,null,{"$f":"SUM(F75:U75)","v":0}]
[{"$f":"IF(A75=\"F\",A75,\"\")","v":""}]
[{"$f":"IF(A76=\"F\",A76,\"\")","v":""},null,null,null,null,0.3,null,null,null,0.3,null,null,null,0.19,null,null,null,0.21,null,null,null,{"$f":"IFERROR(E75/100,\"\")","v":0}]
[{"$f":"IF(D78>0,\"F\",\"\")","v":""},"FERRAGENS",null,{"$f":"Orçamento!X656","v":0},{"$f":"Orçamento!AA656","v":0},{"$f":"ROUND(F80*$D$78,2)","v":0},null,null,null,{"$f":"ROUND(J80*$D$78,2)","v":0},null,null,null,{"$f":"ROUND(N80*$D$78,2)","v":0},null,null,null,{"$f":"ROUND(R80*$D$78,2)","v":0},null,null,null,{"$f":"SUM(F78:U78)","v":0}]
[{"$f":"IF(A78=\"F\",A78,\"\")","v":""}]
[{"$f":"IF(A79=\"F\",A79,\"\")","v":""},null,null,null,null,0,null,null,null,null,null,null,null,null,null,null,null,{"$f":"1-F80","v":1},null,null,null,{"$f":"IFERROR(E78/100,\"\")","v":0}]
[{"$f":"IF(D81>0,\"F\",\"\")","v":""},"MARCENARIA",null,{"$f":"Orçamento!X657","v":0},{"$f":"Orçamento!AA657","v":0},{"$f":"ROUND(F83*$D$81,2)","v":0},null,null,null,{"$f":"ROUND(J83*$D$81,2)","v":0},null,null,null,{"$f":"ROUND(N83*$D$81,2)","v":0},null,null,null,{"$f":"ROUND(R83*$D$81,2)","v":0},null,null,null,{"$f":"SUM(F81:U81)","v":0}]
[{"$f":"IF(A81=\"F\",A81,\"\")","v":""}]
[{"$f":"IF(A82=\"F\",A82,\"\")","v":""},null,null,null,null,null,null,null,null,null,null,null,null,null,null,null,null,{"$f":"1-F83","v":1},null,null,null,{"$f":"IFERROR(E81/100,\"\")","v":0}]
[{"$f":"IF(D84>0,\"F\",\"\")","v":""},"ADMINISTRAÇÃO - MENSALISTAS",null,{"$f":"Orçamento!X658","v":0},{"$f":"Orçamento!AA658","v":0},{"$f":"ROUND(F86*$D$84,2)","v":0},null,null,null,{"$f":"ROUND(J86*$D$84,2)","v":0},null,null,null,{"$f":"ROUND(N86*$D$84,2)","v":0},null,null,null,{"$f":"ROUND(R86*$D$84,2)","v":0},null,null,null,{"$f":"SUM(F84:U84)","v":0}]
[{"$f":"IF(A84=\"F\",A84,\"\")","v":""}]
[{"$f":"IF(A85=\"F\",A85,\"\")","v":""},null,null,null,null,0.25,null,null,null,0.25,null,null,null,0.25,null,null,null,0.25,null,null,null,{"$f":"IFERROR(E84/100,\"\")","v":0}]
[{"$f":"IF(D87>0,\"F\",\"\")","v":""},"PINTURA",null,{"$f":"Orçamento!X659","v":0},{"$f":"Orçamento!AA659","v":0},{"$f":"ROUND(F89*$D$87,2)","v":0},null,null,null,{"$f":"ROUND(J89*$D$87,2)","v":0},null,null,null,{"$f":"ROUND(N89*$D$87,2)","v":0},null,null,null,{"$f":"ROUND(R89*$D$87,2)","v":0},null,null,null,{"$f":"SUM(F87:U87)","v":0}]
[{"$f":"IF(A87=\"F\",A87,\"\")","v":""}]
[{"$f":"IF(A88=\"F\",A88,\"\")","v":""},null,null,null,null,0,null,null,null,null,null,null,null,0.2,null,null,null,0.8,null,null,null,{"$f":"IFERROR(E87/100,\"\")","v":0}]
[{"$f":"IF(D90>0,\"F\",\"\")","v":""},"DIVERSOS",null,{"$f":"Orçamento!X660","v":0},{"$f":"Orçamento!AA660","v":0},{"$f":"ROUND(F92*$D$90,2)","v":0},null,null,null,{"$f":"D90-F90-N90-R90","v":0},null,null,null,{"$f":"ROUND(N92*$D$90,2)","v":0},null,null,null,{"$f":"ROUND(R92*$D$90,2)","v":0},null,null,null,{"$f":"SUM(F90:U90)","v":0}]
[{"$f":"IF(A90=\"F\",A90,\"\")","v":""}]
[{"$f":"IF(A91=\"F\",A91,\"\")","v":""},null,null,null,null,0.24,null,null,null,0.26,null,null,null,0.25,null,null,null,0.25,null,null,null,{"$f":"IFERROR(E90/100,\"\")","v":0}]
["F","CUSTO DO ORÇAMENTO",null,{"$f":"SUM(D15:D92)","v":0},{"$f":"SUM(E15:E92)","v":0},{"$f":"F15+F18+F21+F24+F27+F30+F33+F36+F39+F42+F45+F48+F51+F54+F57+F60+F63+F66+F69+F72+F75+F78+F81+F84+F87+F90","v":0},null,null,null,{"$f":"J15+J18+J21+J24+J27+J30+J33+J36+J39+J42+J45+J48+J51+J54+J57+J60+J63+J66+J69+J72+J75+J78+J81+J84+J87+J90","v":0},null,null,null,{"$f":"N15+N18+N21+N24+N27+N30+N33+N36+N39+N42+N45+N48+N51+N54+N57+N60+N63+N66+N69+N72+N75+N78+N81+N84+N87+N90","v":0},null,null,null,{"$f":"R15+R18+R21+R24+R27+R30+R33+R36+R39+R42+R45+R48+R51+R54+R57+R60+R63+R66+R69+R72+R75+R78+R81+R84+R87+R90","v":0},null,null,null,{"$f":"V15+V18+V21+V24+V27+V30+V33+V36+V39+V42+V45+V48+V51+V54+V57+V60+V63+V66+V69+V72+V75+V78+V81+V84+V87+V90","v":0}]
["F","PERCENTUAIS:",null,null,null,{"$f":"IFERROR(F93/D93,\"\")","v":""},null,null,null,{"$f":"IFERROR(J93/D93,\"\")","v":""},null,null,null,{"$f":"IFERROR(N93/D93,\"\")","v":""},null,null,null,{"$f":"IFERROR(R93/D93,\"\")","v":""},null,null,null,{"$f":"SUM(F94:U94)","v":0}]
["F","TOTAIS ACUMULADOS:",null,null,null,{"$f":"F93","v":0},null,null,null,{"$f":"F95+J93","v":0},null,null,null,{"$f":"J95+N93","v":0},null,null,null,{"$f":"N95+R93","v":0}]
["F","PERCENTUAIS  ACUMULADOS:",null,null,null,{"$f":"F94","v":""},null,null,null,{"$f":"IFERROR(F96+J94,\"\")","v":""},null,null,null,{"$f":"IFERROR(J96+N94,\"\")","v":""},null,null,null,{"$f":"IFERROR(N96+R94,\"\")","v":""}]
["F"]
["F","OBSERVAÇÕES:"]
["F","Os pagamentos somente poderão ser efetuados mediante medição e atesto pelos técnicos da Secretaria da Educação. "]

{"sheet":"Composição BDI","index":4,"n_rows":45,"n_cols":9,"rows_kept":45,"cut":false,"hidden":false,"merged":[[12,0,12,3],[13,0,13,3],[14,0,14,3],[15,0,15,3],[6,0,6,3],[8,0,8,3],[7,0,7,3],[9,0,9,3],[11,0,11,3],[10,0,10,3],[0,0,0,3],[2,0,2,3],[3,0,3,3],[1,0,1,3],[5,0,5,3],[4,0,4,3],[18,5,18,8],[17,0,17,3],[16,0,16,3],[44,0,44,3],[42,0,42,3],[43,0,43,3],[18,0,18,3],[36,0,36,3],[39,0,39,3],[38,0,38,3],[40,0,40,3],[29,0,29,2],[32,0,32,3],[33,0,33,3],[34,0,34,3],[35,0,35,3]]}
[]
[]
["UNIDADE ESCOLAR"]
[{"$f":"Orçamento!$O$4","v":"COLÉGIO ESTADUAL DELFINO OCLÉCIO MACHADO"}]
[]
["OBRA"]
[{"$f":"Orçamento!$O$7","v":"AMPLIAÇÃO"}]
[]
["ENDEREÇO"]
[{"$f":"Orçamento!$R$10","v":"RUA BOTUCATU, AV. GOVERNADOR JOSÉ FELICIANO FERREIRA 02, JARDIM INGA, CEP:72850-310"}]
[]
["CIDADE"]
[{"$f":"Orçamento!$X$7","v":"LUZIÂNIA"}]
[]
["CRE"]
[{"$f":"Orçamento!$O$10","v":"LUZIÂNIA"}]
[]
["DETALHAMENTO DA COMPOSIÇÃO DE BDI"]
["COMPOSIÇÃO BDI PARA OBRAS CIVIS",null,null,null,null,"BDI CONSTRUÇÃO E REFORMA"]
["DESCRIÇÃO","COEF.","TAXA % (a.m)","% no preço de venda",null,"Situação","1º Quartil","Médio","3º Quartil"]
["1) COFINS",1,0.03,{"$f":"C21","v":0.03},null,{"$f":"IF(OR(C21<G21,C21>I21),\"FORA DO INTERVALO\",\"OK\")","v":"OK"},0.03,0.03,0.03]
["2) PIS",1,6.4999999999999997E-3,{"$f":"C22","v":6.4999999999999997E-3},null,{"$f":"IF(OR(C22<G22,C22>I22),\"FORA DO INTERVALO\",\"OK\")","v":"OK"},6.4999999999999997E-3,6.4999999999999997E-3,6.4999999999999997E-3]
["3) ISSQN",1,0.03,{"$f":"C23*B23","v":0.03},null,"OK",0.02,3.5000000000000003E-2,0.05]
["4) CPRB",1,0,{"$f":"C24","v":0},null,"FORA DO INTERVALO",4.4999999999999998E-2,4.4999999999999998E-2,4.4999999999999998E-2]
["5) Administração Central",1,0.04,0.04,null,"OK",0.03,0.04,5.5E-2]
["6) Despesas Financeiras",1,5.5999999999999999E-3,5.5999999999999999E-3,null,"FORA DO INTERVALO",5.8999999999999999E-3,1.23E-2,1.3899999999999999E-2]
["7) Seguros + Garantias",1,1.1999999999999999E-3,1.1999999999999999E-3,null,"FORA DO INTERVALO",8.0000000000000002E-3,8.0000000000000002E-3,0.01]
["8) Risco",1,9.7000000000000003E-3,9.7000000000000003E-3,null,"OK",9.7000000000000003E-3,1.2699999999999999E-2,1.2699999999999999E-2]
["9) Lucro",1,7.1999999999999995E-2,7.1999999999999995E-2,null,"OK",6.1600000000000002E-2,7.3999999999999996E-2,8.9599999999999999E-2]
["BDI - FINAL",null,null,{"$f":"(((1+D25+D27+D28)*(1+D26)*(1+D29))/(1-(D21+D22+D23+D24))-1)","v":0.21357639301553344},null,"FORA DO INTERVALO",0.2034,0.22120000000000001,0.25]
[]
["Notas:"]
["(1) e (2) Alíquota definida por lei."]
["(3) Alíquota e base de cálculo definidas pela legislação municipal."]
["(4) Alíquota definida pelas leis 12.546/11, 12844/13 e 13.161/15 (CPRB – contribuição previdenciária sobre a receita bruta)."]
["(5) Valores definidos a partir dos limites no Acórdão nº 2.622/2013 - TCU – Plenário. Valores entre o 1º e 3º quartis."]
["(6) Valor calculado pela expressão matemática do acórdão 2.369/2011 – TCU – Plenário e disponibilizado pela AGETOP em dezembro de 2018. (Foi utilizado para o cálculo a média da Taxa SELIC no período de 11/2017 a 10/2018)"]
[]
["(7) Valores definidos pela AGETOP a partir dos limites no Acórdão nº 2.622/2013 - TCU – Plenário. Valores médios. \n\nObservação da AGETOP: (Seguros contra erros de execução, incêndio e explosão, danos da natureza (vendaval, destelhamento, alagamento, inundação, desmoronamento, geadas etc.), emprego de material defeituoso ou inadequado, roubo e/ou furto qualificado, quebra de equipamentos, desmoronamento de estrutura, nas modalidades de Obras Civis em Construção (OCC); Instalação e Montagem (IM); e Obras Civis em Construção e Instalação e Montagem (OCC/IM). Bem como coberturas adicionais para ampliação dessas coberturas básicas, como: cobertura de responsabilidade civil geral, cobertura de responsabilidade civil cruzada, cobertura de despesas extraordinárias, cobertura de tumultos, cobertura de desentulho do local, cobertura de riscos do fabricante, dentre outras, incluindo o seguro de vida em grupo regido pela convenção coletiva dos trabalhadores na indústria da construção civil). A partir de 24/02/2015 por intermédio da Portaria 449/2015 a Presidência da AGETOP, na pessoa do Senhor Jayme Eduardo Rincon, determinou a exclusão dos valores referentes aos Seguros de Risco de Engenharia e Responsabilidade Civil do Profissional na composição do cálculo do B.D.I.."]
["(8) Valores definidos a partir dos limites no Acórdão nº 2.622/2013 - TCU – Plenário. Valores entre 1º e 3° quartis."]
["(9) Valores definidos a partir dos limites definidos no Acórdão nº 2.622/2013 - TCU – Plenário. Valores adotados e praticados no mercado ( “ ex ante ” ) ou aqueles entre os 1º e 3º quartis."]
[]
["(*) A fórmula para estipulação da taxa de BDI estimado adotado é a mesma que foi aplicada para a obtenção das tabelas contidas no Acórdão n. 2.622/2013 – TCUPlenário"]
[]
["Obs.: Para obras com valores superiores a R$ 20.000.000,00 sugere-se recalcular o BDI, dimensionando as taxas de administração central e lucro para patamares inferiores ao estipulado acima."]

{"sheet":"Relatório CENTRAL","index":5,"n_rows":40,"n_cols":5,"rows_kept":40,"cut":false,"hidden":false,"merged":[[7,1,7,4],[8,1,8,2],[8,3,8,4],[9,1,9,2],[10,1,10,4],[11,1,11,4],[39,1,39,2],[9,0,11,0],[0,1,0,4],[6,3,6,4],[9,3,9,4],[1,1,1,4],[2,1,2,2],[2,3,2,4],[3,1,3,2],[3,3,3,4],[4,1,4,4],[5,1,5,2],[5,3,5,4],[6,1,6,2]]}
[]
[]
[null,"UNIDADE ESCOLAR",null,"CIDADE"]
[null,{"$f":"Orçamento!$O$4","v":"COLÉGIO ESTADUAL DELFINO OCLÉCIO MACHADO"},null,{"$f":"Orçamento!$X$7","v":"LUZIÂNIA"}]
[]
[null,"OBRA",null,"CRE"]
[null,{"$f":"Orçamento!$O$7","v":"AMPLIAÇÃO"},null,{"$f":"Orçamento!$O$10","v":"LUZIÂNIA"}]
[]
[null,"ENDEREÇO",null,"DATA"]
["FILTRO",{"$f":"Orçamento!$R$10","v":"RUA BOTUCATU, AV. GOVERNADOR JOSÉ FELICIANO FERREIRA 02, JARDIM INGA, CEP:72850-310"},null,{"$f":"Orçamento!$S$7","v":"2020-04-08"}]
[]
[null,"RELATÓRIO CENTRAL"]
["↓","CÓDIGO","ETAPA","PREÇO  (R$) C/ BDI","PARTIC  ( % )"]
[{"$f":"IF(D14>0,\"F\",\"\")","v":""},{"$f":"Orçamento!O635","v":"a."},{"$f":"Orçamento!P635","v":"SERVIÇOS PRELIMINARES"},{"$f":"Orçamento!X635","v":0},{"$f":"Orçamento!AA635","v":0}]
[{"$f":"IF(D15>0,\"F\",\"\")","v":""},{"$f":"Orçamento!O636","v":"b."},{"$f":"Orçamento!P636","v":"TRANSPORTES"},{"$f":"Orçamento!X636","v":0},{"$f":"Orçamento!AA636","v":0}]
["",{"$f":"Orçamento!O637","v":"c."},{"$f":"Orçamento!P637","v":"SERVIÇO EM TERRA"},{"$f":"Orçamento!X637","v":0},{"$f":"Orçamento!AA637","v":0}]
["",{"$f":"Orçamento!O638","v":"d."},{"$f":"Orçamento!P638","v":"FUNDAÇÕES E SONDAGENS"},{"$f":"Orçamento!X638","v":0},{"$f":"Orçamento!AA638","v":0}]
["",{"$f":"Orçamento!O639","v":"e."},{"$f":"Orçamento!P639","v":"ESTRUTURA"},{"$f":"Orçamento!X639","v":0},{"$f":"Orçamento!AA639","v":0}]
["",{"$f":"Orçamento!O640","v":"f."},{"$f":"Orçamento!P640","v":"INSTALAÇÕES ELÉTRICAS"},{"$f":"Orçamento!X640","v":0},{"$f":"Orçamento!AA640","v":0}]
["",{"$f":"Orçamento!O641","v":"g."},{"$f":"Orçamento!P641","v":"INSTALAÇÕES HIDROSSANITÁRIAS"},{"$f":"Orçamento!X641","v":0},{"$f":"Orçamento!AA641","v":0}]
["",{"$f":"Orçamento!O642","v":"h"},{"$f":"Orçamento!P642","v":"INSTALAÇÕES ESPECIAIS"},{"$f":"Orçamento!X642","v":0},{"$f":"Orçamento!AA642","v":0}]
["",{"$f":"Orçamento!O643","v":"i."},{"$f":"Orçamento!P643","v":"ALVENARIAS E DIVISÓRIAS"},{"$f":"Orçamento!X643","v":0},{"$f":"Orçamento!AA643","v":0}]
["",{"$f":"Orçamento!O644","v":"j."},{"$f":"Orçamento!P644","v":"ALVENARIA AUTO-PORTANTE"},{"$f":"Orçamento!X644","v":0},{"$f":"Orçamento!AA644","v":0}]
["",{"$f":"Orçamento!O645","v":"k."},{"$f":"Orçamento!P645","v":"IMPERMEABILIZAÇÃO"},{"$f":"Orçamento!X645","v":0},{"$f":"Orçamento!AA645","v":0}]
["",{"$f":"Orçamento!O646","v":"l."},{"$f":"Orçamento!P646","v":"ISOLAMENTO TÉRMICO E ACÚSTICO"},{"$f":"Orçamento!X646","v":0},{"$f":"Orçamento!AA646","v":0}]
["",{"$f":"Orçamento!O647","v":"m."},{"$f":"Orçamento!P647","v":"ESTRUTURA DE MADEIRA"},{"$f":"Orçamento!X647","v":0},{"$f":"Orçamento!AA647","v":0}]
["",{"$f":"Orçamento!O648","v":"n."},{"$f":"Orçamento!P648","v":"ESTRUTURAS METÁLICAS"},{"$f":"Orçamento!X648","v":0},{"$f":"Orçamento!AA648","v":0}]
["",{"$f":"Orçamento!O649","v":"o."},{"$f":"Orçamento!P649","v":"COBERTURAS"},{"$f":"Orçamento!X649","v":0},{"$f":"Orçamento!AA649","v":0}]
["",{"$f":"Orçamento!O650","v":"p."},{"$f":"Orçamento!P650","v":"ESQUADRIAS DE MADEIRA"},{"$f":"Orçamento!X650","v":0},{"$f":"Orçamento!AA650","v":0}]
["",{"$f":"Orçamento!O651","v":"q."},{"$f":"Orçamento!P651","v":"ESQUADRIAS METÁLICAS"},{"$f":"Orçamento!X651","v":0},{"$f":"Orçamento!AA651","v":0}]
["",{"$f":"Orçamento!O652","v":"r."},{"$f":"Orçamento!P652","v":"VIDROS"},{"$f":"Orçamento!X652","v":0},{"$f":"Orçamento!AA652","v":0}]
["",{"$f":"Orçamento!O653","v":"s."},{"$f":"Orçamento!P653","v":"REVESTIMENTO DE PAREDE"},{"$f":"Orçamento!X653","v":0},{"$f":"Orçamento!AA653","v":0}]
["",{"$f":"Orçamento!O654","v":"t."},{"$f":"Orçamento!P654","v":"FORROS"},{"$f":"Orçamento!X654","v":0},{"$f":"Orçamento!AA654","v":0}]
["",{"$f":"Orçamento!O655","v":"u."},{"$f":"Orçamento!P655","v":"REVESTIMENTO DE PISO"},{"$f":"Orçamento!X655","v":0},{"$f":"Orçamento!AA655","v":0}]
["",{"$f":"Orçamento!O656","v":"v."},{"$f":"Orçamento!P656","v":"FERRAGENS"},{"$f":"Orçamento!X656","v":0},{"$f":"Orçamento!AA656","v":0}]
["",{"$f":"Orçamento!O657","v":"w."},{"$f":"Orçamento!P657","v":"MARCENARIA"},{"$f":"Orçamento!X657","v":0},{"$f":"Orçamento!AA657","v":0}]
["",{"$f":"Orçamento!O658","v":"x."},{"$f":"Orçamento!P658","v":"ADMINISTRAÇÃO"},{"$f":"Orçamento!X658","v":0},{"$f":"Orçamento!AA658","v":0}]
["",{"$f":"Orçamento!O659","v":"y."},{"$f":"Orçamento!P659","v":"PINTURA"},{"$f":"Orçamento!X659","v":0},{"$f":"Orçamento!AA659","v":0}]
["",{"$f":"Orçamento!O660","v":"z."},{"$f":"Orçamento!P660","v":"DIVERSOS"},{"$f":"Orçamento!X660","v":0},{"$f":"Orçamento!AA660","v":0}]
["F","TOTAL GERAL DO ORÇAMENTO (R$) C/BDI",null,{"$f":"SUM(D14:D39)","v":0},{"$f":"SUM(E14:E39)","v":0}]

{"sheet":"Parc Maior Relev","index":6,"n_rows":21,"n_cols":7,"rows_kept":21,"cut":false,"hidden":false,"merged":[[10,0,12,0],[8,1,8,3],[8,4,8,6],[21,3,21,7],[19,1,19,6],[0,1,0,6],[11,1,11,6],[1,1,1,6],[2,1,2,3],[2,4,2,6],[3,1,3,3],[3,4,3,6],[4,1,4,6],[5,1,5,3],[5,4,5,6],[9,1,9,3],[9,4,9,6],[10,1,10,6],[6,1,6,3],[6,4,6,6],[7,1,7,6]]}
[]
[]
[null,"UNIDADE ESCOLAR",null,null,"CÓDIGO INEP"]
[null,{"$f":"Orçamento!$O$4","v":"COLÉGIO ESTADUAL DELFINO OCLÉCIO MACHADO"},null,null,{"$f":"Orçamento!$X$4","v":52103099}]
[]
[null,"OBRA",null,null,"CIDADE"]
[null,{"$f":"Orçamento!$O$7","v":"AMPLIAÇÃO"},null,null,{"$f":"Orçamento!$X$7","v":"LUZIÂNIA"}]
[]
[null,"CRE",null,null,"ÁREA TOTAL CONSTRUÍDA (M²)"]
[null,{"$f":"Orçamento!$O$10","v":"LUZIÂNIA"},null,null,{"$f":"Orçamento!$S$13","v":3727.83}]
["FILTRO"]
[null,"PARCELA DE MAIOR RELEVÂNCIA"]
[null,"CÓDIGO","SERVIÇO","DESCRIÇÃO","UNID","QUANT","PARC. MAIOR RELEV (50%)"]
[{"$f":"IF(F14>0,\"F\",\"\")","v":"F"},"i.",{"$f":"IFERROR(VLOOKUP(B14,Orçamento!$O$635:$P$660,2,FALSE),\"(inserir código ao lado)\")","v":"ALVENARIAS E DIVISÓRIAS"},"ALVENARIA DE TIJOLO LAMINADO","M²",402.94,{"$f":"F14*0.5","v":201.47}]
[{"$f":"IF(F15>0,\"F\",\"\")","v":"F"},"u.",{"$f":"IFERROR(VLOOKUP(B15,Orçamento!$O$635:$P$660,2,FALSE),\"(inserir código ao lado)\")","v":"REVESTIMENTO DE PISO"},"PISO DE CONCRETO DESEMPENADO","M²",1086.92,543.46]
[{"$f":"IF(F16>0,\"F\",\"\")","v":""},null,{"$f":"IFERROR(VLOOKUP(B16,Orçamento!$O$635:$P$660,2,FALSE),\"(inserir código ao lado)\")","v":"(inserir código ao lado)"},null,{"$f":"IFERROR(VLOOKUP($D16,Orçamento!$R$20:$Y$616,2,FALSE),\"-\")","v":"-"},{"$f":"SUMIF(Orçamento!$R$20:$R$616,'Parc Maior Relev'!D16,Orçamento!$T$20:$T$616)","v":0},{"$f":"F16*0.5","v":0}]
["",null,{"$f":"IFERROR(VLOOKUP(B17,Orçamento!$O$635:$P$660,2,FALSE),\"(inserir código ao lado)\")","v":"(inserir código ao lado)"},null,{"$f":"IFERROR(VLOOKUP($D17,Orçamento!$R$20:$Y$616,2,FALSE),\"-\")","v":"-"},{"$f":"SUMIF(Orçamento!$R$20:$R$616,'Parc Maior Relev'!D17,Orçamento!$T$20:$T$616)","v":0},0]
["",null,{"$f":"IFERROR(VLOOKUP(B18,Orçamento!$O$635:$P$660,2,FALSE),\"(inserir código ao lado)\")","v":"(inserir código ao lado)"},null,{"$f":"IFERROR(VLOOKUP($D18,Orçamento!$R$20:$Y$616,2,FALSE),\"-\")","v":"-"},{"$f":"SUMIF(Orçamento!$R$20:$R$616,'Parc Maior Relev'!D18,Orçamento!$T$20:$T$616)","v":0},0]
["F"]
["F","(*) Para os fins do inciso I dp § 1º do Art. 30 da Lei Federal 8.666/93, são consideradas parcelas de maior relevância técnica as execuções apresentadas"]
["F"]

{"sheet":"Composições","index":7,"n_rows":190,"n_cols":10,"rows_kept":190,"cut":false,"hidden":false,"merged":[[0,0,0,8],[10,0,10,2],[10,3,10,6],[11,0,11,9],[12,0,12,2],[12,3,12,6],[12,7,12,8],[7,0,7,6],[9,0,9,2],[9,3,9,6],[9,7,9,8],[3,0,3,6],[4,0,4,6],[15,0,15,9],[13,0,13,2],[13,3,13,6],[1,0,1,9],[3,7,3,9],[4,7,4,9],[6,7,6,9],[7,7,7,9],[6,0,6,6],[10,8,10,9],[13,8,13,9],[14,0,14,9],[8,0,8,9],[5,0,5,9],[2,0,2,9],[16,5,17,5],[16,6,16,7],[16,8,16,9],[22,1,22,7],[26,1,26,7],[16,0,17,0],[16,1,17,1],[16,2,17,2],[16,3,17,3],[16,4,17,4],[28,5,29,5],[28,6,28,7],[28,8,28,9],[34,1,34,7],[38,1,38,7],[28,0,29,0],[28,1,29,1],[28,2,29,2],[28,3,29,3],[28,4,29,4],[40,5,41,5],[40,6,40,7],[40,8,40,9],[45,1,45,7],[48,1,48,7],[40,0,41,0],[40,1,41,1],[40,2,41,2],[40,3,41,3],[40,4,41,4],[50,5,51,5],[50,6,50,7],[50,8,50,9],[55,1,55,7],[58,1,58,7],[50,0,51,0],[50,1,51,1],[50,2,51,2],[50,3,51,3],[50,4,51,4],[60,5,61,5],[60,6,60,7],[60,8,60,9],[66,1,66,7],[70,1,70,7],[60,0,61,0],[60,1,61,1],[60,2,61,2],[60,3,61,3],[60,4,61,4],[72,5,73,5],[72,6,72,7],[72,8,72,9],[78,1,78,7],[82,1,82,7],[72,0,73,0],[72,1,73,1],[72,2,73,2],[72,3,73,3],[72,4,73,4],[84,5,85,5],[84,6,84,7],[84,8,84,9],[88,1,88,7],[92,1,92,7],[84,0,85,0],[84,1,85,1],[84,2,85,2],[84,3,85,3],[84,4,85,4],[94,5,95,5],[94,6,94,7],[94,8,94,9],[100,1,100,7],[107,1,107,7],[94,0,95,0],[94,1,95,1],[94,2,95,2],[94,3,95,3],[94,4,95,4],[109,5,110,5],[109,6,109,7],[109,8,109,9],[114,1,114,7],[126,1,126,7],[109,0,110,0],[109,1,110,1],[109,2,110,2],[109,3,110,3],[109,4,110,4],[128,5,129,5],[128,6,128,7],[128,8,128,9],[133,1,133,7],[139,1,139,7],[128,0,129,0],[128,1,129,1],[128,2,129,2],[128,3,129,3],[128,4,129,4],[141,5,142,5],[141,6,141,7],[141,8,141,9],[147,1,147,7],[151,1,151,7],[141,0,142,0],[141,1,142,1],[141,2,142,2],[141,3,142,3],[141,4,142,4],[153,5,154,5],[153,6,153,7],[153,8,153,9],[159,1,159,7],[163,1,163,7],[153,0,154,0],[153,1,154,1],[153,2,154,2],[153,3,154,3],[153,4,154,4],[165,5,166,5],[165,6,165,7],[165,8,165,9],[171,1,171,7],[177,1,177,7],[165,0,166,0],[165,1,166,1],[165,2,166,2],[165,3,166,3],[165,4,166,4],[179,5,180,5],[179,6,179,7],[179,8,179,9],[185,1,185,7],[189,1,189,7],[179,0,180,0],[179,1,180,1],[179,2,180,2],[179,3,180,3],[179,4,180,4]]}
[]
[]
[]
["UNIDADE ESCOLAR",null,null,null,null,null,null,"CÓDIGO INEP"]
[{"$f":"Orçamento!$O$4","v":"COLÉGIO ESTADUAL DELFINO OCLÉCIO MACHADO"},null,null,null,null,null,null,{"$f":"Orçamento!$X$4","v":52103099}]
[]
["OBRA",null,null,null,null,null,null,"CIDADE"]
[{"$f":"Orçamento!$O$7","v":"AMPLIAÇÃO"},null,null,null,null,null,null,{"$f":"Orçamento!$X$7","v":"LUZIÂNIA"}]
[]
["CRE",null,null,"ENDEREÇO",null,null,null,"REFERÊNCIA AGETOP"]
[{"$f":"Orçamento!$O$10","v":"LUZIÂNIA"},null,null,{"$f":"Orçamento!$R$10","v":"RUA BOTUCATU, AV. GOVERNADOR JOSÉ FELICIANO FERREIRA 02, JARDIM INGA, CEP:72850-310"},null,null,null,{"$f":"Orçamento!$X$10","v":"DEZ/18"},{"$f":"Orçamento!$Y$10","v":"ONERADA"}]
[]
["DATA",null,null,"ÁREA TOTAL CONSTRUÍDA (M²)",null,null,null,"REFERÊNCIA SINAPI"]
[{"$f":"Orçamento!$S$7","v":"2020-04-08"},null,null,{"$f":"Orçamento!$S$13","v":3727.83},null,null,null,{"$f":"Orçamento!$X$13","v":"MAR/19"},{"$f":"Orçamento!$Y$13","v":"ONERADA"}]
[]
["COMPOSIÇÕES DE CUSTOS UNITÁRIOS - SEE-GO"]
[17,"FONTE","CÓDIGO","DESCRIÇÃO","UNIDADE","COEFIC.","CUSTO UNITÁRIO",null,"CUSTO  TOTAL (A) + (B) + (C) + (D) + (E)"]
[null,null,null,null,null,null,"DESONERADO","NÃO DESONER.","DESONERADO","NÃO DESONER."]
[null,"COMPOSIÇÃO","COMP 017_SEE","REDUCAO GIRATÓRIA TIPO STORZ LATAO P/ INST. PREDIAL COMBATE A INCENDIO ENGATE RAPIDO 2.1/2\" X 1.1/2\"","UN ",null,"-","-",94.15,94.7]
[null,"AGETOP_I",8,"AJUDANTE","h     ",0.16,8.1999999999999993,9.51,1.31,1.52]
[null,"AGETOP_I",11,"ENCANADOR","h     ",0.16,13.4,15.53,2.14,2.48]
[null,null,null,"","",null,0,0,0,0]
[null,"MÃO DE OBRA (B) - TOTAL",null,null,null,null,null,null,3.45,4]
[null,"SINAPI_I",20972,"REDUCAO FIXA TIPO STORZ, ENGATE RAPIDO 2.1/2\" X 1.1/2\", EM LATAO, PARA INSTALACAO PREDIAL COMBATE A INCENDIO PREDIAL","UN    ",1,90.7,90.7,90.7,90.7]
[null,null,null,"","",null,0,0,0,0]
[null,null,null,"","",null,0,0,0,0]
[null,"MATERIAL (C) - TOTAL",null,null,null,null,null,null,90.7,90.7]
[]
[18,"FONTE","CÓDIGO","DESCRIÇÃO","UNIDADE","COEFIC.","CUSTO UNITÁRIO",null,"CUSTO  TOTAL (A) + (B) + (C) + (D) + (E)"]
[null,null,null,null,null,null,"DESONERADO","NÃO DESONER.","DESONERADO","NÃO DESONER."]
[null,"COMPOSIÇÃO","COMP 018_SEE","CHAVE DUPLA P/ CONEXÕES TIPO STORZ EM LATÃO ENGATE RÁPIDO 1 1/2\" X 2 1/2\"","UN ",null,"-","-",14.1,14.42]
[null,"AGETOP_I",11,"ENCANADOR","h     ",0.15,13.4,15.53,2.0099999999999998,2.33]
[null,null,null,"","",null,0,0,0,0]
[null,null,null,"","",null,0,0,0,0]
[null,"MÃO DE OBRA (B) - TOTAL",null,null,null,null,null,null,2.0099999999999998,2.33]
[null,"SINAPI_I",20971,"CHAVE DUPLA PARA CONEXOES TIPO STORZ, ENGATE RAPIDO 1 1/2\" X 2 1/2\", EM LATAO, PARA INSTALACAO PREDIAL COMBATE A INCENDIO","UN    ",1,12.09,12.09,12.09,12.09]
[null,null,null,"","",null,0,0,0,0]
[null,null,null,"","",null,0,0,0,0]
[null,"MATERIAL (C) - TOTAL",null,null,null,null,null,null,12.09,12.09]
[]
[30,"FONTE","CÓDIGO","DESCRIÇÃO","UNIDADE","COEFIC.","CUSTO UNITÁRIO",null,"CUSTO  TOTAL (A) + (B) + (C) + (D) + (E)"]
[null,null,null,null,null,null,"DESONERADO","NÃO DESONER.","DESONERADO","NÃO DESONER."]
[null,"COMPOSIÇÃO","COMP 030_SEE","COTOVELO DE FERRO GALV. 90° X 2 1/2\"","UN ",null,null,null,68.89,72.06]
[null,"AGETOP_I",8,"AJUDANTE","h     ",0.92,8.1999999999999993,9.51,7.54,8.75]
[null,"AGETOP_I",11,"ENCANADOR","h     ",0.92,13.4,15.53,12.33,14.29]
[null,"MÃO DE OBRA (B) - TOTAL",null,null,null,null,null,null,19.87,23.04]
[null,"SINAPI_I",3470,"COTOVELO 90 GRAUS DE FERRO GALVANIZADO, COM ROSCA BSP, DE 2 1/2\"","UN    ",1,48.46,48.46,48.46,48.46]
[null,"AGETOP_I","H689","FITA VEDAROSCA 12 MM","m",2,0.28000000000000003,0.28000000000000003,0.56000000000000005,0.56000000000000005]
[null,"MATERIAL (C) - TOTAL",null,null,null,null,null,null,49.02,49.02]
[]
[77,"FONTE","CÓDIGO","DESCRIÇÃO","UNIDADE","COEFIC.","CUSTO UNITÁRIO",null,"CUSTO  TOTAL (A) + (B) + (C) + (D) + (E)"]
[null,null,null,null,null,null,"DESONERADO","NÃO DESONER.","DESONERADO","NÃO DESONER."]
[null,"COMPOSIÇÃO","COMP 077_SEE","UNIAO FERRO GALV C/ASSENTO CONICO BRONZE 2 1/2\"","UN ",null,null,null,147.51999999999998,148.88999999999999]
[null,"AGETOP_I",8,"AJUDANTE","h     ",0.4,8.1999999999999993,9.51,3.28,3.8]
[null,"AGETOP_I",11,"ENCANADOR","h     ",0.4,13.4,15.53,5.36,6.21]
[null,"MÃO DE OBRA (B) - TOTAL",null,null,null,null,null,null,8.64,10.01]
[null,"AGETOP_I","H689","FITA VEDAROSCA 12 MM","m",2.4,0.28000000000000003,0.28000000000000003,0.67,0.67]
[null,"SINAPI_I",12427,"UNIAO COM ASSENTO CONICO DE BRONZE, DIAMETRO 2 1/2\"","UN    ",1,138.21,138.21,138.21,138.21]
[null,"MATERIAL (C) - TOTAL",null,null,null,null,null,null,138.88,138.88]
[]
[24,"FONTE","CÓDIGO","DESCRIÇÃO","UNIDADE","COEFIC.","CUSTO UNITÁRIO",null,"CUSTO  TOTAL (A) + (B) + (C) + (D) + (E)"]
[null,null,null,null,null,null,"DESONERADO","NÃO DESONER.","DESONERADO","NÃO DESONER."]
[null,"COMPOSIÇÃO","COMP 024_SEE","SINALIZADOR FOTOLUMINESCENTE PARA EXTINTOR","UN ",null,"-","-",25.269999999999996,25.389999999999997]
[null,"AGETOP_I",5,"SERVENTE","h     ",0.09,8.1999999999999993,9.51,0.74,0.86]
[null,null,null,"","",null,0,0,0,0]
[null,null,null,"","",null,0,0,0,0]
[null,"MÃO DE OBRA (B) - TOTAL",null,null,null,null,null,null,0.74,0.86]
[null,"AGETOP_I",3070,"BUCHA DE NYLON S-6","un",2,0.04,0.04,0.08,0.08]
[null,"AGETOP_I",3393,"PARAFUSO P/BUCHA S-6","un",2,0.08,0.08,0.16,0.16]
[null,"SINAPI_I",37556,"PLACA DE SINALIZACAO DE SEGURANCA CONTRA INCENDIO, FOTOLUMINESCENTE, QUADRADA, *20 X 20* CM, EM PVC *2* MM ANTI-CHAMAS (SIMBOLOS, CORES E PICTOGRAMAS CONFORME NBR 13434)","UN    ",1,24.29,24.29,24.29,24.29]
[null,"MATERIAL (C) - TOTAL",null,null,null,null,null,null,24.529999999999998,24.529999999999998]
[]
[188,"FONTE","CÓDIGO","DESCRIÇÃO","UNIDADE","COEFIC.","CUSTO UNITÁRIO",null,"CUSTO  TOTAL (A) + (B) + (C) + (D) + (E)"]
[null,null,null,null,null,null,"DESONERADO","NÃO DESONER.","DESONERADO","NÃO DESONER."]
[null,"COMPOSIÇÃO","COMP 188_SEE","ACIONADOR MANUAL DE ALARME","UN ",null,null,null,100.61,103.36]
[null,"AGETOP_I",8,"AJUDANTE","h     ",0.8,8.1999999999999993,9.51,6.56,7.61]
[null,"AGETOP_I",12,"ELETRICISTA","h     ",0.8,13.4,15.53,10.72,12.42]
[null,null,null,"","",null,0,0,0,0]
[null,"MÃO DE OBRA (B) - TOTAL",null,null,null,null,null,null,17.28,20.03]
[null,"COTAÇÃO","COT 090_SEE","ACIONADOR MANUAL DE ALARME","UN",1,83.333333333333329,83.333333333333329,83.33,83.33]
[null,null,null,"","",null,0,0,0,0]
[null,null,null,"","",null,0,0,0,0]
[null,"MATERIAL (C) - TOTAL",null,null,null,null,null,null,83.33,83.33]
[]
[25,"FONTE","CÓDIGO","DESCRIÇÃO","UNIDADE","COEFIC.","CUSTO UNITÁRIO",null,"CUSTO  TOTAL (A) + (B) + (C) + (D) + (E)"]
[null,null,null,null,null,null,"DESONERADO","NÃO DESONER.","DESONERADO","NÃO DESONER."]
[null,"COMPOSIÇÃO","COMP 025_SEE","SINALIZADOR FOTOLUMINESCENTE DE EMERGÊNCIA","UN ",null,"-","-",25.269999999999996,25.389999999999997]
[null,"AGETOP_I",5,"SERVENTE","h     ",0.09,8.1999999999999993,9.51,0.74,0.86]
[null,"MÃO DE OBRA (B) - TOTAL",null,null,null,null,null,null,0.74,0.86]
[null,"AGETOP_I",3070,"BUCHA DE NYLON S-6","un",2,0.04,0.04,0.08,0.08]
[null,"AGETOP_I",3393,"PARAFUSO P/BUCHA S-6","un",2,0.08,0.08,0.16,0.16]
[null,"SINAPI_I",37556,"PLACA DE SINALIZACAO DE SEGURANCA CONTRA INCENDIO, FOTOLUMINESCENTE, QUADRADA, *20 X 20* CM, EM PVC *2* MM ANTI-CHAMAS (SIMBOLOS, CORES E PICTOGRAMAS CONFORME NBR 13434)","UN    ",1,24.29,24.29,24.29,24.29]
[null,"MATERIAL (C) - TOTAL",null,null,null,null,null,null,24.529999999999998,24.529999999999998]
[]
[277,"FONTE","CÓDIGO","DESCRIÇÃO","UNIDADE","COEFIC.","CUSTO UNITÁRIO",null,"CUSTO  TOTAL (A) + (B) + (C) + (D) + (E)"]
[null,null,null,null,null,null,"DESONERADO","NÃO DESONER.","DESONERADO","NÃO DESONER."]
[null,"COMPOSIÇÃO","COMP 277_SEE","MARCAÇÃO NO PISO - 1X1 M PARA EXTINTOR","M2",null,null,null,27.719999999999995,27.799999999999997]
[null,"AGETOP_I",5,"SERVENTE","h     ",3.3300000000000003E-2,8.1999999999999993,9.51,0.27,0.32]
[null,null,null,"","",null,0,0,0,0]
[null,null,null,"","",null,0,0,0,0]
[null,"MÃO DE OBRA (B) - TOTAL",null,null,null,null,null,null,0.27,0.32]
[null,"SINAPI_I",5318,"SOLVENTE DILUENTE A BASE DE AGUARRAS","L     ",0.13,10.98,10.98,1.43,1.43]
[null,"SINAPI",5824,"CAMINHÃO TOCO, PBT 16.000 KG, CARGA ÚTIL MÁX. 10.685 KG, DIST. ENTRE EIXOS 4,8 M, POTÊNCIA 189 CV, INCLUSIVE CARROCERIA FIXA ABERTA DE MADEIRA P/ TRANSPORTE GERAL DE CARGA SECA, DIMEN. APROX. 2,5 X 7,00 X 0,50 M - CHP DIURNO. AF_06/2014","CHP",3.3E-3,135.91999999999999,139.13,0.45,0.46]
[null,"SINAPI_I",7343,"TINTA A BASE DE RESINA ACRILICA, PARA SINALIZACAO HORIZONTAL VIARIA (NBR 11862)","L     ",0.6,11.69,11.69,7.01,7.01]
[null,"SINAPI_I",7348,"TINTA ACRILICA PREMIUM PARA PISO","L     ",0.03,12.39,12.39,0.37,0.37]
[null,"SINAPI_I",25972,"MICROESFERAS DE VIDRO PARA SINALIZACAO HORIZONTAL VIARIA, TIPO I-B (PREMIX) - NBR 16184","KG    ",2.14,8.33,8.33,17.829999999999998,17.829999999999998]
[null,"SINAPI",95133,"MÁQUINA DEMARCADORA DE FAIXA DE TRÁFEGO À FRIO, AUTOPROPELIDA, POTÊNCIA 38 HP - CHP DIURNO. AF_07/2016","CHP",3.3E-3,110.07,113.65,0.36,0.38]
[null,"MATERIAL (C) - TOTAL",null,null,null,null,null,null,27.449999999999996,27.479999999999997]
[]
[82,"FONTE","CÓDIGO","DESCRIÇÃO","UNIDADE","COEFIC.","CUSTO UNITÁRIO",null,"CUSTO  TOTAL (A) + (B) + (C) + (D) + (E)"]
[null,null,null,null,null,null,"DESONERADO","NÃO DESONER.","DESONERADO","NÃO DESONER."]
[null,"COMPOSIÇÃO","COMP 082_SEE","CORRIMÃO PAREDE - SEDUC","M",null,null,null,120.16,124.00999999999999]
[null,"AGETOP_I",25,"OFICIAL \"B\"","h     ",1,13.4,15.53,13.4,15.53]
[null,"AGETOP_I",8,"AJUDANTE","h     ",1,8.1999999999999993,9.51,8.1999999999999993,9.51]
[null,"MÃO DE OBRA (B) - TOTAL",null,null,null,null,null,null,21.6,25.04]
[null,"AGETOP_I",2376,"TUBO INDUSTRIAL 2\" CHAPA 13 ","Kg",5.5247999999999999,5.23,5.23,28.89,28.89]
[null,"AGETOP_I",2504,"TUBO INDUSTRIAL D=25 MM CHAPA 13 ","Kg",1.1000000000000001,5.07,5.07,5.58,5.58]
[null,"AGETOP_I",2417,"MASSA PLASTICA","Kg",0.2041,10.58,10.58,2.16,2.16]
[null,"AGETOP_I",2246,"ELETRODO 2.5 OK","Kg",0.11459999999999999,8.6999999999999993,8.6999999999999993,1,1]
[null,"AGETOP_I",1672,"LIXA PARA FERRO ( NÚMERO 100 )","un",0.125,2.12,2.12,0.27,0.27]
[null,"AGETOP_I",1264,"DISCO DE DESBASTE 7/8\" P/ CONC./FERRO (1/4\" X 7\")","un",2.5000000000000001E-2,7,7,0.18,0.18]
[null,"AGETOP_I",1334,"DISCO DE CORTE DIAM. 5/8\"- 10\"","un",0.1865,5.5,5.5,1.03,1.03]
[null,"AGETOP_I",2902,"FABRICAÇÃO / MONTAGEM","un",1,50.44,50.44,50.44,50.44]
[null,"AGETOP_I",2719,"CHAPA PERFILADA 3/16\"","Kg",0.72,5.04,5.04,3.63,3.63]
[null,"AGETOP_I",2436,"ACO CA-25 - 6,3 MM (1/4\") - BARRA LISA A-36","Kg",0.25,5.13,5.13,1.28,1.28]
[null,"AGETOP",261602,"PINT.ESMALTE/ESQUAD.FERRO C/FUNDO ANTICOR.","m2    ",0.3,13.65,15.04,4.0999999999999996,4.51]
[null,"MATERIAL (C) - TOTAL",null,null,null,null,null,null,98.559999999999988,98.97]
[]
[29,"FONTE","CÓDIGO","DESCRIÇÃO","UNIDADE","COEFIC.","CUSTO UNITÁRIO",null,"CUSTO  TOTAL (A) + (B) + (C) + (D) + (E)"]
[null,null,null,null,null,null,"DESONERADO","NÃO DESONER.","DESONERADO","NÃO DESONER."]
[null,"COMPOSIÇÃO","COMP 029_SEE","PLANTIO DE ARVORE REGIONAL, ALTURA MAIOR QUE 2,00M, EM CAVAS DE 80X80X80CM","UN ",null,null,null,60.760000000000005,62.790000000000006]
[null,"AGETOP_I",19,"JARDINEIRO","h     ",0.23,13.4,15.53,3.08,3.57]
[null,"AGETOP_I",5,"SERVENTE","h     ",1.18,8.1999999999999993,9.51,9.68,11.22]
[null,"MÃO DE OBRA (B) - TOTAL",null,null,null,null,null,null,12.76,14.790000000000001]
[null,"AGETOP_I",2057,"TERRA VEGETAL","m3",0.20499999999999999,12.5,12.5,2.56,2.56]
[null,"AGETOP_I",104,"AREIA MEDIA ","m3",6.4000000000000003E-3,82.85,82.85,0.53,0.53]
[null,"AGETOP_I",2792,"CALCÁRIO","Kg",0.8,0.27,0.27,0.22,0.22]
[null,"SINAPI_I",359,"MUDA DE ARVORE ORNAMENTAL, OITI/AROEIRA SALSA/ANGICO/IPE/JACARANDA OU EQUIVALENTE  DA REGIAO, H= *2* M","UN    ",1,43.67,43.67,43.67,43.67]
[null,"AGETOP_I",2791,"ADUBO MINERAL NPK 10/10/10","Kg",0.8,1.28,1.28,1.02,1.02]
[null,"MATERIAL (C) - TOTAL",null,null,null,null,null,null,48.000000000000007,48.000000000000007]
[]
[387,"FONTE","CÓDIGO","DESCRIÇÃO","UNIDADE","COEFIC.","CUSTO UNITÁRIO",null,"CUSTO  TOTAL (A) + (B) + (C) + (D) + (E)"]
[null,null,null,null,null,null,"DESONERADO","NÃO DESONER.","DESONERADO","NÃO DESONER."]
[null,"COMPOSIÇÃO","COMP 387_SEE","LÂMPADA LED TUBULAR 18W ","UN ",null,null,null,22.28,22.330000000000002]
[null,"AGETOP_I",8,"AJUDANTE","h     ",1.4999999999999999E-2,8.1999999999999993,9.51,0.12,0.14000000000000001]
[null,"AGETOP_I",12,"ELETRICISTA","h     ",1.4999999999999999E-2,13.4,15.53,0.2,0.23]
[null,null,null,"","",null,0,0,0,0]
[null,"MÃO DE OBRA (B) - TOTAL",null,null,null,null,null,null,0.32,0.37]
[null,"COTAÇÃO","COT 195_SEE","LÂMPADA LED TUBULAR 18W ","UN",1,21.959999999999997,21.959999999999997,21.96,21.96]
[null,null,null,"","",null,0,0,0,0]
[null,null,null,"","",null,0,0,0,0]
[null,"MATERIAL (C) - TOTAL",null,null,null,null,null,null,21.96,21.96]
[]
[348,"FONTE","CÓDIGO","DESCRIÇÃO","UNIDADE","COEFIC.","CUSTO UNITÁRIO",null,"CUSTO  TOTAL (A) + (B) + (C) + (D) + (E)"]
[null,null,null,null,null,null,"DESONERADO","NÃO DESONER.","DESONERADO","NÃO DESONER."]
[null,"COMPOSIÇÃO","COMP 348_SEE","TERMINAL DE VENTILACAO, 75 MM, SERIE NORMAL, ESGOTO PREDIAL","UN ",null,null,null,8.77,9.02]
[null,"AGETOP_I",11,"ENCANADOR","h     ",7.0000000000000007E-2,13.4,15.53,0.94,1.0900000000000001]
[null,"AGETOP_I",8,"AJUDANTE","h     ",7.0000000000000007E-2,8.1999999999999993,9.51,0.56999999999999995,0.67]
[null,null,null,"","",null,0,0,0,0]
[null,"MÃO DE OBRA (B) - TOTAL",null,null,null,null,null,null,1.5099999999999998,1.7600000000000002]
[null,"SINAPI_I",39320,"TERMINAL DE VENTILACAO, 75 MM, SERIE NORMAL, ESGOTO PREDIAL","UN    ",1,7.26,7.26,7.26,7.26]
[null,null,null,"","",null,0,0,0,0]
[null,null,null,"","",null,0,0,0,0]
[null,"MATERIAL (C) - TOTAL",null,null,null,null,null,null,7.26,7.26]
[]
[541,"FONTE","CÓDIGO","DESCRIÇÃO","UNIDADE","COEFIC.","CUSTO UNITÁRIO",null,"CUSTO  TOTAL (A) + (B) + (C) + (D) + (E)"]
[null,null,null,null,null,null,"DESONERADO","NÃO DESONER.","DESONERADO","NÃO DESONER."]
[null,"COMPOSIÇÃO","COMP 541_SEE","BANCADA DE GRANITO CINZA POLIDO - FORNECIMENTO E INSTALAÇÃO. ","M2    ",null,null,null,481.96,486.81999999999994]
[null,"SINAPI",88274,"MARMORISTA/GRANITEIRO COM ENCARGOS COMPLEMENTARES","H",1.6555555555555557,17.329999999999998,19.38,28.69,32.08]
[null,"SINAPI",88316,"SERVENTE COM ENCARGOS COMPLEMENTARES","H",1.088888888888889,12.83,14.18,13.97,15.44]
[null,null,null,"","",null,0,0,0,0]
[null,"MÃO DE OBRA (B) - TOTAL",null,null,null,null,null,null,42.660000000000004,47.519999999999996]
[null,"SINAPI_I",4823,"MASSA PLASTICA PARA MARMORE/GRANITO","KG    ",0.58088888888888901,28.73,28.73,16.690000000000001,16.690000000000001]
[null,"SINAPI_I",7568,"BUCHA DE NYLON SEM ABA S10, COM PARAFUSO DE 6,10 X 65 MM EM ACO ZINCADO COM ROSCA SOBERBA, CABECA CHATA E FENDA PHILLIPS","UN    ",6.666666666666667,0.49,0.49,3.27,3.27]
[null,"SINAPI_I",11795,"GRANITO PARA BANCADA, POLIDO, TIPO ANDORINHA/ QUARTZ/ CASTELO/ CORUMBA OU OUTROS EQUIVALENTES DA REGIAO, E=  *2,5* CM","M2    ",1.1166666666666667,305.66000000000003,305.66000000000003,341.32,341.32]
[null,"SINAPI_I",37329,"REJUNTE EPOXI BRANCO","KG    ",3.9E-2,39.869999999999997,39.869999999999997,1.55,1.55]
[null,"SINAPI_I",37591,"SUPORTE MAO-FRANCESA EM ACO, ABAS IGUAIS 40 CM, CAPACIDADE MINIMA 70 KG, BRANCO","UN    ",2.2222222222222223,34.409999999999997,34.409999999999997,76.47,76.47]
[null,"MATERIAL (C) - TOTAL",null,null,null,null,null,null,439.29999999999995,439.29999999999995]
[]
[387,"FONTE","CÓDIGO","DESCRIÇÃO","UNIDADE","COEFIC.","CUSTO UNITÁRIO",null,"CUSTO  TOTAL (A) + (B) + (C) + (D) + (E)"]
[null,null,null,null,null,null,"DESONERADO","NÃO DESONER.","DESONERADO","NÃO DESONER."]
[null,"COMPOSIÇÃO","COMP 387_SEE","LÂMPADA LED TUBULAR 18W ","UN ",null,null,null,22.28,22.330000000000002]
[null,"AGETOP_I",8,"AJUDANTE","h     ",1.4999999999999999E-2,8.1999999999999993,9.51,0.12,0.14000000000000001]
[null,"AGETOP_I",12,"ELETRICISTA","h     ",1.4999999999999999E-2,13.4,15.53,0.2,0.23]
[null,null,null,"","",null,0,0,0,0]
[null,"MÃO DE OBRA (B) - TOTAL",null,null,null,null,null,null,0.32,0.37]
[null,"COTAÇÃO","COT 195_SEE","LÂMPADA LED TUBULAR 18W ","UN",1,21.959999999999997,21.959999999999997,21.96,21.96]
[null,null,null,"","",null,0,0,0,0]
[null,null,null,"","",null,0,0,0,0]
[null,"MATERIAL (C) - TOTAL",null,null,null,null,null,null,21.96,21.96]