{"text_format":"1","workbook":"xlsx","n_sheets":8,"sheets":["Orçamento","Resumo ","Somatório","Cronog_120_Dias","Composição BDI","Relatório CENTRAL","Parc Maior Relev","Composições"],"not_rendered":{"charts":0,"images":3,"macros":1,"external_links":0,"defined_names":79,"comments":3,"pivot_tables":0},"unopened":[],"bounds":{"document_bytes":16777216,"sheet_cells":100000,"rows_first":2000,"rows_last":500,"rows_between":2000,"halvings":0,"cell_chars":16384,"cell_head_chars":4096},"cells_cut":0,"cells_raw":0,"read":"whole","date_system":"1900"}

{"sheet":"Orçamento","index":0,"n_rows":692,"n_cols":27,"rows_kept":692,"cut":false,"hidden":false,"merged":[[661,23,661,25],[662,23,662,25],[663,23,663,25],[659,23,659,25],[634,23,634,25],[635,23,635,25],[636,23,636,25],[637,23,637,25],[638,23,638,25],[639,23,639,25],[640,23,640,25],[641,23,641,25],[642,23,642,25],[643,23,643,25],[644,23,644,25],[645,23,645,25],[646,23,646,25],[647,23,647,25],[648,23,648,25],[649,23,649,25],[650,23,650,25],[651,23,651,25],[652,23,652,25],[653,23,653,25],[676,23,676,25],[677,23,677,25],[678,23,678,25],[679,23,679,25],[680,23,680,25],[681,23,681,25],[682,23,682,25],[683,23,683,25],[684,23,684,25],[667,23,667,25],[668,23,668,25],[669,23,669,25],[670,23,670,25],[671,23,671,25],[672,23,672,25],[673,23,673,25],[674,23,674,25],[675,23,675,25],[8,12,9,12],[662,18,662,22],[0,14,0,24],[8,14,8,16],[9,14,9,16],[11,14,11,16],[12,14,12,16],[14,14,14,24],[1,14,1,24],[4,14,4,24],[7,14,7,24],[646,18,646,22],[643,15,643,17],[644,15,644,17],[645,15,645,17],[655,18,655,22],[653,18,653,22],[616,23,616,24],[661,18,661,22],[648,18,648,22],[641,18,641,22],[655,15,655,17],[656,15,656,17],[657,15,657,17],[663,18,663,22],[639,18,639,22],[640,18,640,22],[638,18,638,22],[647,18,647,22],[629,18,629,24],[635,18,635,22],[636,18,636,22],[637,18,637,22],[660,18,660,22],[658,18,658,22],[659,18,659,22],[649,18,649,22],[656,18,656,22],[652,18,652,22],[654,18,654,22],[650,18,650,22],[651,18,651,22],[660,23,660,25],[654,23,654,25],[655,23,655,25],[656,23,656,25],[657,23,657,25],[658,23,658,25],[617,23,617,24],[618,23,618,24],[633,23,633,25],[658,15,658,17],[659,15,659,17],[632,14,632,26],[616,17,621,17],[633,18,633,22],[634,18,634,22],[642,18,642,22],[643,18,643,22],[644,18,644,22],[645,18,645,22],[657,18,657,22],[654,15,654,17],[634,15,634,17],[635,15,635,17],[636,15,636,17],[637,15,637,17],[638,15,638,17],[639,15,639,17],[640,15,640,17],[641,15,641,17],[642,15,642,17],[646,15,646,17],[647,15,647,17],[648,15,648,17],[649,15,649,17],[650,15,650,17],[651,15,651,17],[652,15,652,17],[653,15,653,17],[627,16,627,24],[669,15,669,17],[669,18,669,22],[624,16,624,24],[625,16,625,24],[626,16,626,24],[10,14,10,26],[13,14,13,26],[9,17,9,22],[2,14,2,22],[3,14,3,22],[5,18,5,22],[6,18,6,22],[11,18,11,22],[12,18,12,22],[6,14,6,17],[5,14,5,17],[3,23,3,25],[2,23,2,25],[5,23,5,25],[6,23,6,25],[628,16,628,24],[8,23,8,25],[9,24,9,25],[691,18,691,22],[688,14,688,17],[685,15,685,17],[685,18,685,22],[686,15,686,17],[686,18,686,22],[687,15,687,17],[687,18,687,22],[690,18,690,22],[689,18,689,22],[685,23,685,25],[686,23,686,25],[687,23,687,25],[688,23,688,25],[689,23,689,25],[690,23,690,25],[691,23,691,25],[660,14,660,17],[667,15,667,17],[633,15,633,17],[688,18,688,22],[676,15,676,17],[676,18,676,22],[677,15,677,17],[677,18,677,22],[678,15,678,17],[678,18,678,22],[682,15,682,17],[682,18,682,22],[683,15,683,17],[683,18,683,22],[684,15,684,17],[673,15,673,17],[684,18,684,22],[679,15,679,17],[679,18,679,22],[680,15,680,17],[680,18,680,22],[681,15,681,17],[681,18,681,22],[12,24,12,25],[11,23,11,25],[673,18,673,22],[674,15,674,17],[674,18,674,22],[675,15,675,17],[675,18,675,22],[670,15,670,17],[670,18,670,22],[671,15,671,17],[671,18,671,22],[672,15,672,17],[672,18,672,22],[666,14,666,26],[667,18,667,22],[668,15,668,17],[668,18,668,22]]}
[]
[]
[null,null,null,null,null,null,null,null,null,null,null,null,null,null,"UNIDADE ESCOLAR",null,null,null,null,null,null,null,null,"CÓDIGO INEP"]
[null,null,null,null,null,null,null,null,null,null,null,null,null,null,"COLÉGIO ESTADUAL DELFINO OCLÉCIO MACHADO",null,null,null,null,null,null,null,null,52103099]
[]
["Nmax",null,null,null,null,null,null,null,null,null,null,null,"Ajustar altura?",null,"OBRA",null,null,null,"DATA",null,null,null,null,"CIDADE"]
[{"$f":"MAX($C$18:$C$616)","v":4},null,null,null,null,null,null,null,null,null,null,null,"NÃO",null,"AMPLIAÇÃO",null,null,null,"2020-04-08",null,null,null,null,"LUZIÂNIA"]
[]
[null,null,null,null,null,null,null,null,null,null,null,null,"",null,"CRE",null,null,"ENDEREÇO",null,null,null,null,null,"REFERÊNCIA AGETOP"]
[null,null,null,null,null,null,null,null,null,null,null,null,null,null,"LUZIÂNIA",null,null,"RUA BOTUCATU, AV. GOVERNADOR JOSÉ FELICIANO FERREIRA 02, JARDIM INGA, CEP:72850-310",null,null,null,null,null,"DEZ/18","ONERADA"]
[]
[null,null,null,null,null,null,null,null,null,null,null,null,null,null,"ÁREA EXISTENTE (M²)",null,null,"ÁREA A CONSTRUIR (M²)","ÁREA TOTAL CONSTRUÍDA (M²)",null,null,null,null,"REFERÊNCIA SINAPI"]
[null,null,null,null,null,null,null,null,null,null,null,null,null,null,2971.17,null,null,756.66,3727.83,null,null,null,null,"MAR/19","ONERADA"]
[]
[null,null,null,null,null,null,null,null,null,null,null,"FILTRO",null,null,"PLANILHA ORÇAMENTÁRIA"]
{"$rows_left_out":678}
{"sheet":"Resumo ","index":1,"n_rows":39,"n_cols":9,"rows_kept":39,"cut":false,"hidden":false,"merged":[[42,3,42,7],[41,3,41,7],[38,1,38,8],[22,2,22,5],[23,2,23,5],[24,2,24,5],[25,2,25,5],[26,2,26,5],[32,2,32,5],[33,2,33,5],[34,2,34,5],[35,2,35,5],[27,2,27,5],[28,2,28,5],[29,2,29,5],[30,2,30,5],[31,2,31,5],[1,1,1,8],[2,6,2,8],[3,6,3,8],[4,1,4,8],[5,6,5,8],[6,6,6,8],[7,1,7,8],[8,6,8,8],[9,6,9,8],[13,1,13,8],[11,1,11,2],[12,1,12,2],[0,1,0,8],[36,1,36,5],[2,1,2,5],[3,1,3,5],[5,1,5,5],[6,1,6,5],[8,1,8,5],[9,1,9,5],[11,3,11,5],[12,3,12,5],[10,1,10,8],[11,6,11,8],[12,6,12,8],[19,2,19,5],[20,2,20,5],[21,2,21,5],[13,0,14,0],[15,2,15,5],[16,2,16,5],[17,2,17,5],[18,2,18,5],[14,1,14,8]]}
[]
[]
[null,"UNIDADE ESCOLAR",null,null,null,null,"CÓDIGO INEP"]
[null,{"$f":"Orçamento!$O$4","v":"COLÉGIO ESTADUAL DELFINO OCLÉCIO MACHADO"},null,null,null,null,{"$f":"Orçamento!X4","v":52103099}]
[]
[null,"OBRA",null,null,null,null,"CIDADE"]
[null,{"$f":"Orçamento!$O$7","v":"AMPLIAÇÃO"},null,null,null,null,{"$f":"Orçamento!$X$7","v":"LUZIÂNIA"}]
[]
[null,"ENDEREÇO",null,null,null,null,"CRE"]
[null,{"$f":"Orçamento!$R$10","v":"RUA BOTUCATU, AV. GOVERNADOR JOSÉ FELICIANO FERREIRA 02, JARDIM INGA, CEP:72850-310"},null,null,null,null,{"$f":"Orçamento!$O$10","v":"LUZIÂNIA"}]
[]
[null,"REFERÊNCIA",null,"DATA",null,null,"ÁREA TOTAL CONSTRUÍDA (M²)"]
[null,{"$f":"CONCATENATE(\"AGETOP E SINAPI - \",Orçamento!$Y$10)","v":"AGETOP E SINAPI - ONERADA"},null,{"$f":"Orçamento!$S$7","v":"2020-04-08"},null,null,{"$f":"Orçamento!$S$13","v":3727.83}]
["FILTRO"]
[null,"RESUMO GERAL DO ORÇAMENTO"]
{"$rows_left_out":25}
{"sheet":"Somatório","index":2,"n_rows":45,"n_cols":6,"rows_kept":45,"cut":false,"hidden":false,"merged":[[0,1,0,5],[14,1,14,5],[2,1,2,3],[2,4,2,5],[3,1,3,3],[3,4,3,5],[5,1,5,3],[5,4,5,5],[6,1,6,3],[6,4,6,5],[8,1,8,3],[8,4,8,5],[1,1,1,5],[4,1,4,5],[7,1,7,5],[10,1,10,5],[9,1,9,3],[9,4,9,5],[11,1,11,2],[11,4,11,5],[12,1,12,2],[12,4,12,5],[13,0,14,0],[42,1,42,2],[44,1,44,5],[47,3,47,5],[48,3,48,5],[13,1,13,5]]}
[]
[]
[null,"UNIDADE ESCOLAR",null,null,"CÓDIGO INEP"]
[null,{"$f":"Orçamento!$O$4","v":"COLÉGIO ESTADUAL DELFINO OCLÉCIO MACHADO"},null,null,{"$f":"Orçamento!X4","v":52103099}]
[]
[null,"OBRA",null,null,"CIDADE"]
[null,{"$f":"Orçamento!$O$7","v":"AMPLIAÇÃO"},null,null,{"$f":"Orçamento!$X$7","v":"LUZIÂNIA"}]
[]
[null,"ENDEREÇO",null,null,"CRE"]
[null,{"$f":"Orçamento!$R$10","v":"RUA BOTUCATU, AV. GOVERNADOR JOSÉ FELICIANO FERREIRA 02, JARDIM INGA, CEP:72850-310"},null,null,{"$f":"Orçamento!$O$10","v":"LUZIÂNIA"}]
[]
[null,"REFERÊNCIA",null,"DATA","ÁREA TOTAL CONSTRUÍDA (M²)"]
[null,{"$f":"CONCATENATE(\"AGETOP E SINAPI - \",Orçamento!$Y$10)","v":"AGETOP E SINAPI - ONERADA"},null,{"$f":"Orçamento!$S$7","v":"2020-04-08"},{"$f":"Orçamento!$S$13","v":3727.83}]
["FILTRO"]
[null,"SOMATÓRIO DE SERVIÇOS"]
{"$rows_left_out":31}
{"sheet":"Cronog_120_Dias","index":3,"n_rows":99,"n_cols":22,"rows_kept":99,"cut":false,"hidden":false,"merged":[[0,1,0,21],[2,1,2,7],[3,1,3,7],[5,1,5,7],[6,1,6,7],[8,1,8,7],[9,1,9,7],[1,1,1,21],[7,1,7,21],[4,1,4,21],[10,1,10,21],[9,8,9,21],[8,8,8,21],[3,8,3,21],[6,8,6,21],[5,8,5,21],[2,8,2,21],[50,1,52,2],[71,3,73,3],[12,21,13,21],[13,1,13,2],[13,5,13,8],[13,17,13,20],[12,3,13,3],[12,17,12,20],[14,1,16,2],[12,5,12,8],[17,1,19,2],[17,4,19,4],[17,5,17,8],[17,17,17,20],[19,5,19,8],[19,17,19,20],[20,1,22,2],[65,1,67,2],[68,3,70,3],[62,3,64,3],[68,1,70,2],[56,3,58,3],[65,4,67,4],[74,3,76,3],[50,4,52,4],[74,4,76,4],[56,1,58,2],[56,4,58,4],[50,3,52,3],[53,3,55,3],[68,4,70,4],[62,1,64,2],[62,4,64,4],[59,3,61,3],[53,1,55,2],[53,4,55,4],[59,1,61,2],[59,4,61,4],[74,1,76,2],[20,4,22,4],[20,5,20,8],[20,17,20,20],[22,5,22,8],[22,17,22,20],[20,3,22,3],[14,3,16,3],[17,3,19,3],[14,4,16,4],[14,5,14,8],[14,17,14,20],[16,5,16,8],[16,17,16,20],[23,17,23,20],[25,5,25,8],[25,17,25,20],[26,1,28,2],[26,4,28,4],[26,5,26,8],[26,17,26,20],[28,5,28,8],[28,17,28,20],[23,3,25,3],[23,1,25,2],[23,4,25,4],[23,5,23,8],[26,3,28,3],[25,9,25,12],[26,9,26,12],[28,9,28,12],[29,17,29,20],[31,5,31,8],[31,17,31,20],[32,1,34,2],[32,4,34,4],[32,5,32,8],[32,17,32,20],[34,5,34,8],[34,17,34,20],[32,3,34,3],[29,5,29,8],[29,1,31,2],[29,4,31,4],[29,3,31,3],[29,9,29,12],[31,9,31,12],[32,9,32,12],[34,9,34,12],[35,17,35,20],[37,5,37,8],[37,17,37,20],[35,3,37,3],[40,17,40,20],[38,3,40,3],[38,17,38,20],[41,1,43,2],[41,4,43,4],[41,5,41,8],[41,17,41,20],[43,5,43,8],[43,17,43,20],[41,3,43,3],[35,5,35,8],[38,5,38,8],[40,5,40,8],[35,1,37,2],[35,4,37,4],[38,1,40,2],[38,4,40,4],[35,9,35,12],[37,9,37,12],[38,9,38,12],[44,17,44,20],[46,5,46,8],[46,17,46,20],[47,1,49,2],[47,4,49,4],[47,5,47,8],[47,17,47,20],[49,5,49,8],[49,17,49,20],[44,5,44,8],[47,3,49,3],[44,3,46,3],[44,1,46,2],[44,4,46,4],[53,17,53,20],[55,5,55,8],[55,17,55,20],[50,5,50,8],[50,17,50,20],[52,5,52,8],[52,17,52,20],[56,17,56,20],[58,5,58,8],[58,17,58,20],[53,5,53,8],[56,5,56,8],[53,9,53,12],[55,9,55,12],[56,9,56,12],[58,9,58,12],[53,13,53,16],[55,13,55,16],[56,13,56,16],[58,13,58,16],[68,5,68,8],[65,5,65,8],[65,17,65,20],[67,5,67,8],[67,17,67,20],[65,3,67,3],[62,17,62,20],[64,5,64,8],[64,17,64,20],[62,5,62,8],[95,1,95,2],[95,5,95,8],[95,17,95,20],[97,1,97,4],[98,1,98,21],[86,17,86,20],[88,5,88,8],[88,17,88,20],[85,5,85,8],[85,17,85,20],[89,1,91,2],[89,4,91,4],[89,5,89,8],[89,17,89,20],[91,5,91,8],[91,17,91,20],[89,3,91,3],[86,4,88,4],[86,5,86,8],[86,3,88,3],[83,1,85,2],[83,4,85,4],[83,5,83,8],[83,17,83,20],[94,1,94,2],[94,5,94,8],[94,17,94,20],[76,5,76,8],[76,17,76,20],[77,5,77,8],[77,17,77,20],[79,5,79,8],[79,17,79,20],[80,5,80,8],[80,17,80,20],[82,5,82,8],[82,17,82,20],[77,3,79,3],[80,3,82,3],[86,1,88,2],[80,4,82,4],[83,3,85,3],[77,1,79,2],[77,4,79,4],[80,1,82,2],[86,9,86,12],[88,9,88,12],[89,9,89,12],[12,0,13,0],[9,0,11,0],[11,1,11,21],[92,1,92,2],[92,5,92,8],[92,17,92,20],[93,1,93,2],[93,5,93,8],[93,17,93,20],[74,17,74,20],[74,5,74,8],[68,17,68,20],[70,5,70,8],[70,17,70,20],[59,5,59,8],[71,1,73,2],[71,4,73,4],[71,5,71,8],[71,17,71,20],[73,5,73,8],[73,17,73,20],[59,17,59,20],[61,5,61,8],[61,17,61,20],[12,9,12,12],[13,9,13,12],[14,9,14,12],[16,9,16,12],[17,9,17,12],[19,9,19,12],[20,9,20,12],[22,9,22,12],[23,9,23,12],[40,9,40,12],[41,9,41,12],[43,9,43,12],[44,9,44,12],[46,9,46,12],[47,9,47,12],[49,9,49,12],[50,9,50,12],[52,9,52,12],[59,9,59,12],[61,9,61,12],[62,9,62,12],[64,9,64,12],[65,9,65,12],[67,9,67,12],[68,9,68,12],[70,9,70,12],[71,9,71,12],[73,9,73,12],[74,9,74,12],[76,9,76,12],[77,9,77,12],[79,9,79,12],[80,9,80,12],[82,9,82,12],[83,9,83,12],[85,9,85,12],[91,9,91,12],[92,9,92,12],[93,9,93,12],[94,9,94,12],[95,9,95,12],[12,13,12,16],[13,13,13,16],[14,13,14,16],[16,13,16,16],[17,13,17,16],[19,13,19,16],[20,13,20,16],[22,13,22,16],[23,13,23,16],[25,13,25,16],[26,13,26,16],[28,13,28,16],[29,13,29,16],[31,13,31,16],[32,13,32,16],[34,13,34,16],[35,13,35,16],[37,13,37,16],[38,13,38,16],[40,13,40,16],[41,13,41,16],[43,13,43,16],[44,13,44,16],[46,13,46,16],[47,13,47,16],[49,13,49,16],[50,13,50,16],[52,13,52,16],[59,13,59,16],[61,13,61,16],[62,13,62,16],[64,13,64,16],[65,13,65,16],[67,13,67,16],[68,13,68,16],[70,13,70,16],[71,13,71,16],[86,13,86,16],[88,13,88,16],[89,13,89,16],[91,13,91,16],[92,13,92,16],[93,13,93,16],[94,13,94,16],[95,13,95,16],[73,13,73,16],[74,13,74,16],[76,13,76,16],[77,13,77,16],[79,13,79,16],[80,13,80,16],[82,13,82,16],[83,13,83,16],[85,13,85,16]]}
[]
[]
[null,"UNIDADE ESCOLAR",null,null,null,null,null,null,"PRAZO"]
[null,{"$f":"Orçamento!$O$4","v":"COLÉGIO ESTADUAL DELFINO OCLÉCIO MACHADO"},null,null,null,null,null,null,"120 DIAS CORRIDOS"]
[]
[null,"OBRA",null,null,null,null,null,null,"DATA"]
[null,{"$f":"Orçamento!$O$7","v":"AMPLIAÇÃO"},null,null,null,null,null,null,{"$f":"Orçamento!$S$7","v":"2020-04-08"}]
[]
[null,"LOCAL",null,null,null,null,null,null,"ÁREA TOTAL CONSTRUÍDA (M²)"]
["FILTRO",{"$f":"Orçamento!$X$7","v":"LUZIÂNIA"},null,null,null,null,null,null,{"$f":"Orçamento!$S$13","v":3727.83}]
[]
[null,"CRONOGRAMA - FÍSICO FINANCEIRO"]
["↓","CUSTO TOTAL:",{"$f":"D93","v":0},"VALOR","Dias:",30,null,null,null,60,null,null,null,90,null,null,null,120,null,null,null,"TOTAL"]
[null,"DESCRIÇÃO DOS SERVIÇOS",null,null,"%","1ª PARCELA",null,null,null,"2ª PARCELA",null,null,null,"3ª PARCELA",null,null,null,"4ª PARCELA"]
[{"$f":"IF(D15>0,\"F\",\"\")","v":""},"SERVIÇOS PRELIMINARES",null,{"$f":"Orçamento!X635","v":0},{"$f":"Orçamento!AA635","v":0},{"$f":"ROUND(F17*$D$15,2)","v":0},null,null,null,{"$f":"ROUND(J17*$D$15,2)","v":0},null,null,null,{"$f":"ROUND(N17*$D$15,2)","v":0},null,null,null,{"$f":"ROUND(R17*$D$15,2)","v":0},null,null,null,{"$f":"SUM(F15:U15)","v":0}]
{"$rows_left_out":85}
{"sheet":"Composição BDI","index":4,"n_rows":45,"n_cols":9,"rows_kept":45,"cut":false,"hidden":false,"merged":[[12,0,12,3],[13,0,13,3],[14,0,14,3],[15,0,15,3],[6,0,6,3],[8,0,8,3],[7,0,7,3],[9,0,9,3],[11,0,11,3],[10,0,10,3],[0,0,0,3],[2,0,2,3],[3,0,3,3],[1,0,1,3],[5,0,5,3],[4,0,4,3],[18,5,18,8],[17,0,17,3],[16,0,16,3],[44,0,44,3],[42,0,42,3],[43,0,43,3],[18,0,18,3],[36,0,36,3],[39,0,39,3],[38,0,38,3],[40,0,40,3],[29,0,29,2],[32,0,32,3],[33,0,33,3],[34,0,34,3],[35,0,35,3]]}
[]
[]
["UNIDADE ESCOLAR"]
[{"$f":"Orçamento!$O$4","v":"COLÉGIO ESTADUAL DELFINO OCLÉCIO MACHADO"}]
[]
["OBRA"]
[{"$f":"Orçamento!$O$7","v":"AMPLIAÇÃO"}]
[]
["ENDEREÇO"]
[{"$f":"Orçamento!$R$10","v":"RUA BOTUCATU, AV. GOVERNADOR JOSÉ FELICIANO FERREIRA 02, JARDIM INGA, CEP:72850-310"}]
[]
["CIDADE"]
[{"$f":"Orçamento!$X$7","v":"LUZIÂNIA"}]
[]
["CRE"]
{"$rows_left_out":31}
{"sheet":"Relatório CENTRAL","index":5,"n_rows":40,"n_cols":5,"rows_kept":40,"cut":false,"hidden":false,"merged":[[7,1,7,4],[8,1,8,2],[8,3,8,4],[9,1,9,2],[10,1,10,4],[11,1,11,4],[39,1,39,2],[9,0,11,0],[0,1,0,4],[6,3,6,4],[9,3,9,4],[1,1,1,4],[2,1,2,2],[2,3,2,4],[3,1,3,2],[3,3,3,4],[4,1,4,4],[5,1,5,2],[5,3,5,4],[6,1,6,2]]}
[]
[]
[null,"UNIDADE ESCOLAR",null,"CIDADE"]
[null,{"$f":"Orçamento!$O$4","v":"COLÉGIO ESTADUAL DELFINO OCLÉCIO MACHADO"},null,{"$f":"Orçamento!$X$7","v":"LUZIÂNIA"}]
[]
[null,"OBRA",null,"CRE"]
[null,{"$f":"Orçamento!$O$7","v":"AMPLIAÇÃO"},null,{"$f":"Orçamento!$O$10","v":"LUZIÂNIA"}]
[]
[null,"ENDEREÇO",null,"DATA"]
["FILTRO",{"$f":"Orçamento!$R$10","v":"RUA BOTUCATU, AV. GOVERNADOR JOSÉ FELICIANO FERREIRA 02, JARDIM INGA, CEP:72850-310"},null,{"$f":"Orçamento!$S$7","v":"2020-04-08"}]
[]
[null,"RELATÓRIO CENTRAL"]
["↓","CÓDIGO","ETAPA","PREÇO  (R$) C/ BDI","PARTIC  ( % )"]
[{"$f":"IF(D14>0,\"F\",\"\")","v":""},{"$f":"Orçamento!O635","v":"a."},{"$f":"Orçamento!P635","v":"SERVIÇOS PRELIMINARES"},{"$f":"Orçamento!X635","v":0},{"$f":"Orçamento!AA635","v":0}]
[{"$f":"IF(D15>0,\"F\",\"\")","v":""},{"$f":"Orçamento!O636","v":"b."},{"$f":"Orçamento!P636","v":"TRANSPORTES"},{"$f":"Orçamento!X636","v":0},{"$f":"Orçamento!AA636","v":0}]
{"$rows_left_out":26}
{"sheet":"Parc Maior Relev","index":6,"n_rows":21,"n_cols":7,"rows_kept":21,"cut":false,"hidden":false,"merged":[[10,0,12,0],[8,1,8,3],[8,4,8,6],[21,3,21,7],[19,1,19,6],[0,1,0,6],[11,1,11,6],[1,1,1,6],[2,1,2,3],[2,4,2,6],[3,1,3,3],[3,4,3,6],[4,1,4,6],[5,1,5,3],[5,4,5,6],[9,1,9,3],[9,4,9,6],[10,1,10,6],[6,1,6,3],[6,4,6,6],[7,1,7,6]]}
[]
[]
[null,"UNIDADE ESCOLAR",null,null,"CÓDIGO INEP"]
[null,{"$f":"Orçamento!$O$4","v":"COLÉGIO ESTADUAL DELFINO OCLÉCIO MACHADO"},null,null,{"$f":"Orçamento!$X$4","v":52103099}]
[]
[null,"OBRA",null,null,"CIDADE"]
[null,{"$f":"Orçamento!$O$7","v":"AMPLIAÇÃO"},null,null,{"$f":"Orçamento!$X$7","v":"LUZIÂNIA"}]
[]
[null,"CRE",null,null,"ÁREA TOTAL CONSTRUÍDA (M²)"]
[null,{"$f":"Orçamento!$O$10","v":"LUZIÂNIA"},null,null,{"$f":"Orçamento!$S$13","v":3727.83}]
["FILTRO"]
[null,"PARCELA DE MAIOR RELEVÂNCIA"]
[null,"CÓDIGO","SERVIÇO","DESCRIÇÃO","UNID","QUANT","PARC. MAIOR RELEV (50%)"]
[{"$f":"IF(F14>0,\"F\",\"\")","v":"F"},"i.",{"$f":"IFERROR(VLOOKUP(B14,Orçamento!$O$635:$P$660,2,FALSE),\"(inserir código ao lado)\")","v":"ALVENARIAS E DIVISÓRIAS"},"ALVENARIA DE TIJOLO LAMINADO","M²",402.94,{"$f":"F14*0.5","v":201.47}]
[{"$f":"IF(F15>0,\"F\",\"\")","v":"F"},"u.",{"$f":"IFERROR(VLOOKUP(B15,Orçamento!$O$635:$P$660,2,FALSE),\"(inserir código ao lado)\")","v":"REVESTIMENTO DE PISO"},"PISO DE CONCRETO DESEMPENADO","M²",1086.92,543.46]
{"$rows_left_out":7}
{"sheet":"Composições","index":7,"n_rows":190,"n_cols":10,"rows_kept":190,"cut":false,"hidden":false,"merged":[[0,0,0,8],[10,0,10,2],[10,3,10,6],[11,0,11,9],[12,0,12,2],[12,3,12,6],[12,7,12,8],[7,0,7,6],[9,0,9,2],[9,3,9,6],[9,7,9,8],[3,0,3,6],[4,0,4,6],[15,0,15,9],[13,0,13,2],[13,3,13,6],[1,0,1,9],[3,7,3,9],[4,7,4,9],[6,7,6,9],[7,7,7,9],[6,0,6,6],[10,8,10,9],[13,8,13,9],[14,0,14,9],[8,0,8,9],[5,0,5,9],[2,0,2,9],[16,5,17,5],[16,6,16,7],[16,8,16,9],[22,1,22,7],[26,1,26,7],[16,0,17,0],[16,1,17,1],[16,2,17,2],[16,3,17,3],[16,4,17,4],[28,5,29,5],[28,6,28,7],[28,8,28,9],[34,1,34,7],[38,1,38,7],[28,0,29,0],[28,1,29,1],[28,2,29,2],[28,3,29,3],[28,4,29,4],[40,5,41,5],[40,6,40,7],[40,8,40,9],[45,1,45,7],[48,1,48,7],[40,0,41,0],[40,1,41,1],[40,2,41,2],[40,3,41,3],[40,4,41,4],[50,5,51,5],[50,6,50,7],[50,8,50,9],[55,1,55,7],[58,1,58,7],[50,0,51,0],[50,1,51,1],[50,2,51,2],[50,3,51,3],[50,4,51,4],[60,5,61,5],[60,6,60,7],[60,8,60,9],[66,1,66,7],[70,1,70,7],[60,0,61,0],[60,1,61,1],[60,2,61,2],[60,3,61,3],[60,4,61,4],[72,5,73,5],[72,6,72,7],[72,8,72,9],[78,1,78,7],[82,1,82,7],[72,0,73,0],[72,1,73,1],[72,2,73,2],[72,3,73,3],[72,4,73,4],[84,5,85,5],[84,6,84,7],[84,8,84,9],[88,1,88,7],[92,1,92,7],[84,0,85,0],[84,1,85,1],[84,2,85,2],[84,3,85,3],[84,4,85,4],[94,5,95,5],[94,6,94,7],[94,8,94,9],[100,1,100,7],[107,1,107,7],[94,0,95,0],[94,1,95,1],[94,2,95,2],[94,3,95,3],[94,4,95,4],[109,5,110,5],[109,6,109,7],[109,8,109,9],[114,1,114,7],[126,1,126,7],[109,0,110,0],[109,1,110,1],[109,2,110,2],[109,3,110,3],[109,4,110,4],[128,5,129,5],[128,6,128,7],[128,8,128,9],[133,1,133,7],[139,1,139,7],[128,0,129,0],[128,1,129,1],[128,2,129,2],[128,3,129,3],[128,4,129,4],[141,5,142,5],[141,6,141,7],[141,8,141,9],[147,1,147,7],[151,1,151,7],[141,0,142,0],[141,1,142,1],[141,2,142,2],[141,3,142,3],[141,4,142,4],[153,5,154,5],[153,6,153,7],[153,8,153,9],[159,1,159,7],[163,1,163,7],[153,0,154,0],[153,1,154,1],[153,2,154,2],[153,3,154,3],[153,4,154,4],[165,5,166,5],[165,6,165,7],[165,8,165,9],[171,1,171,7],[177,1,177,7],[165,0,166,0],[165,1,166,1],[165,2,166,2],[165,3,166,3],[165,4,166,4],[179,5,180,5],[179,6,179,7],[179,8,179,9],[185,1,185,7],[189,1,189,7],[179,0,180,0],[179,1,180,1],[179,2,180,2],[179,3,180,3],[179,4,180,4]]}
[]
[]
[]
["UNIDADE ESCOLAR",null,null,null,null,null,null,"CÓDIGO INEP"]
[{"$f":"Orçamento!$O$4","v":"COLÉGIO ESTADUAL DELFINO OCLÉCIO MACHADO"},null,null,null,null,null,null,{"$f":"Orçamento!$X$4","v":52103099}]
[]
["OBRA",null,null,null,null,null,null,"CIDADE"]
[{"$f":"Orçamento!$O$7","v":"AMPLIAÇÃO"},null,null,null,null,null,null,{"$f":"Orçamento!$X$7","v":"LUZIÂNIA"}]
[]
["CRE",null,null,"ENDEREÇO",null,null,null,"REFERÊNCIA AGETOP"]
[{"$f":"Orçamento!$O$10","v":"LUZIÂNIA"},null,null,{"$f":"Orçamento!$R$10","v":"RUA BOTUCATU, AV. GOVERNADOR JOSÉ FELICIANO FERREIRA 02, JARDIM INGA, CEP:72850-310"},null,null,null,{"$f":"Orçamento!$X$10","v":"DEZ/18"},{"$f":"Orçamento!$Y$10","v":"ONERADA"}]
[]
["DATA",null,null,"ÁREA TOTAL CONSTRUÍDA (M²)",null,null,null,"REFERÊNCIA SINAPI"]
[{"$f":"Orçamento!$S$7","v":"2020-04-08"},null,null,{"$f":"Orçamento!$S$13","v":3727.83},null,null,null,{"$f":"Orçamento!$X$13","v":"MAR/19"},{"$f":"Orçamento!$Y$13","v":"ONERADA"}]
[]
{"$rows_left_out":175}