{"text_format":"1","workbook":"xlsx","n_sheets":8,"sheets":["Orçamento","Resumo ","Somatório","Cronog_90_Dias","Composição BDI","Relatório CENTRAL","Parc Maior Relev","Composições"],"not_rendered":{"charts":0,"images":4,"macros":1,"external_links":2,"defined_names":144,"comments":2,"pivot_tables":0},"unopened":[],"bounds":{"document_bytes":16777216,"sheet_cells":100000,"rows_first":2000,"rows_last":500,"rows_between":2000,"halvings":0,"cell_chars":16384,"cell_head_chars":4096},"cells_cut":0,"cells_raw":0,"read":"whole","date_system":"1900"}

{"sheet":"Orçamento","index":0,"n_rows":573,"n_cols":24,"rows_kept":573,"cut":false,"hidden":false,"merged":[[554,18,554,20],[554,21,554,22],[555,15,555,17],[555,18,555,20],[555,21,555,22],[556,15,556,17],[556,18,556,20],[556,21,556,22],[551,15,551,17],[551,18,551,20],[551,21,551,22],[552,15,552,17],[552,18,552,20],[552,21,552,22],[553,15,553,17],[553,18,553,20],[553,21,553,22],[565,18,565,20],[565,21,565,22],[560,15,560,17],[560,18,560,20],[560,21,560,22],[561,15,561,17],[561,18,561,20],[561,21,561,22],[562,15,562,17],[562,18,562,20],[562,21,562,22],[541,14,541,17],[548,15,548,17],[514,15,514,17],[569,18,569,20],[569,21,569,22],[557,15,557,17],[557,18,557,20],[557,21,557,22],[558,15,558,17],[558,18,558,20],[558,21,558,22],[559,15,559,17],[559,18,559,20],[559,21,559,22],[563,15,563,17],[563,18,563,20],[563,21,563,22],[564,15,564,17],[564,18,564,20],[564,21,564,22],[565,15,565,17],[554,15,554,17],[509,16,509,22],[572,18,572,20],[572,21,572,22],[569,14,569,17],[566,15,566,17],[566,18,566,20],[566,21,566,22],[567,15,567,17],[567,18,567,20],[567,21,567,22],[568,15,568,17],[568,18,568,20],[568,21,568,22],[571,18,571,20],[571,21,571,22],[570,18,570,20],[570,21,570,22],[547,14,547,23],[548,18,548,20],[548,21,548,22],[549,15,549,17],[549,18,549,20],[549,21,549,22],[550,15,550,17],[550,18,550,20],[550,21,550,22],[505,16,505,22],[506,16,506,22],[507,16,507,22],[3,21,3,22],[2,21,2,22],[5,21,5,22],[10,14,10,23],[13,14,13,23],[6,21,6,22],[9,17,9,20],[2,14,2,20],[3,14,3,20],[5,18,5,20],[6,18,6,20],[11,18,11,20],[12,18,12,20],[6,14,6,17],[5,14,5,17],[0,14,0,22],[527,15,527,17],[528,15,528,17],[529,15,529,17],[530,15,530,17],[531,15,531,17],[532,15,532,17],[533,15,533,17],[534,15,534,17],[535,15,535,17],[515,15,515,17],[516,15,516,17],[517,15,517,17],[518,15,518,17],[519,15,519,17],[520,15,520,17],[521,15,521,17],[522,15,522,17],[523,15,523,17],[536,15,536,17],[537,15,537,17],[538,15,538,17],[539,15,539,17],[540,15,540,17],[513,14,513,23],[502,20,502,21],[501,20,501,21],[497,17,502,17],[497,20,497,21],[514,18,514,20],[514,21,514,22],[515,18,515,20],[515,21,515,22],[503,20,503,21],[523,18,523,20],[523,21,523,22],[524,18,524,20],[524,21,524,22],[525,18,525,20],[525,21,525,22],[526,18,526,20],[526,21,526,22],[538,18,538,20],[541,18,541,20],[541,21,541,22],[538,21,538,22],[539,18,539,20],[539,21,539,22],[540,18,540,20],[540,21,540,22],[530,18,530,20],[530,21,530,22],[537,18,537,20],[537,21,537,22],[532,21,532,22],[533,18,533,20],[533,21,533,22],[535,18,535,20],[531,18,531,20],[531,21,531,22],[532,18,532,20],[542,18,542,20],[542,21,542,22],[529,18,529,20],[529,21,529,22],[522,18,522,20],[522,21,522,22],[544,18,544,20],[544,21,544,22],[498,20,498,21],[520,18,520,20],[520,21,520,22],[521,18,521,20],[521,21,521,22],[519,18,519,20],[519,21,519,22],[528,18,528,20],[499,20,499,21],[510,18,510,22],[516,18,516,20],[516,21,516,22],[517,18,517,20],[517,21,517,22],[518,18,518,20],[518,21,518,22],[508,16,508,22],[8,12,9,12],[543,18,543,20],[543,21,543,22],[8,14,8,16],[9,14,9,16],[11,14,11,16],[12,14,12,16],[14,14,14,22],[1,14,1,22],[4,14,4,22],[7,14,7,22],[527,18,527,20],[527,21,527,22],[535,21,535,22],[524,15,524,17],[525,15,525,17],[526,15,526,17],[528,21,528,22],[536,18,536,20],[536,21,536,22],[534,18,534,20],[534,21,534,22]]}
[]
[]
[null,null,null,null,null,null,null,null,null,null,null,null,null,null,"UNIDADE ESCOLAR",null,null,null,null,null,null,"CÓDIGO INEP"]
[null,null,null,null,null,null,null,null,null,null,null,null,null,null,"CENTRO DE ENSINO EM PERÍODO INTEGRAL NOVO HORIZONTE",null,null,null,null,null,null,52033945]
[]
["Nmax",null,null,null,null,null,null,null,null,null,null,null,"Ajustar altura?",null,"OBRA",null,null,null,"DATA",null,null,"CIDADE"]
[{"$f":"MAX($C$18:$C$497)","v":3},null,null,null,null,null,null,null,null,null,null,null,"SIM",null,"REFORMA E AMPLIAÇÃO",null,null,null,"2020-04-16",null,null,"GOIÂNIA"]
[]
[null,null,null,null,null,null,null,null,null,null,null,null,"",null,"CRE",null,null,"ENDEREÇO",null,null,null,"REFERÊNCIA AGETOP"]
[null,null,null,null,null,null,null,null,null,null,null,null,null,null,"GOIÂNIA",null,null,"ALAMEDA DAS PALMEIRAS, QD. 51-A S/N, NOVO HORIZONTE, CEP:74363-810",null,null,null,"DEZ/18","DESONERADA"]
[]
[null,null,null,null,null,null,null,null,null,null,null,null,null,null,"ÁREA EXISTENTE (M²)",null,null,"ÁREA A CONSTRUIR (M²)","ÁREA TOTAL CONSTRUÍDA (M²)",null,null,"REFERÊNCIA SINAPI"]
[null,null,null,null,null,null,null,null,null,null,null,null,null,null,2584.56,null,null,98.23,2682.79,null,null,"JUL/19","DESONERADA"]
[]
[null,null,null,null,null,null,null,null,null,null,null,"FILTRO",null,null,"PLANILHA ORÇAMENTÁRIA"]
["Nível E","Save Nivel","Nível C","Altura","n1","n2","n3","n4","n5","Czero","Cnível","↓","Nível","Nível Corrigido","ITEM","TABELA","CODIGO","DESCRIÇÃO DOS SERVIÇOS","UNID","QUANT","MAT","MO","T.SERVIÇO","OBSERVAÇÕES¹"]
[{"$f":"CHOOSE(1+LOG(1+2*(ORÇAMENTO.Nivel=\"Nível 1\")+4*(ORÇAMENTO.Nivel=\"Nível 2\")+8*(ORÇAMENTO.Nivel=\"Nível 3\")+16*(ORÇAMENTO.Nivel=\"Nível 4\")+32*(ORÇAMENTO.Nivel=\"Serviço\"),2),0,1,2,3,4,\"S\")","v":"S"},{"$f":"IF(OR(C17=\"s\",C17=0),OFFSET(B17,-1,0),C17)","v":"Save Nivel"},{"$f":"IF(OFFSET(C17,-1,0)=\"L\",1,IF(OFFSET(C17,-1,0)=1,2,IF(OR(A17=\"s\",A17=0),\"S\",IF(AND(OFFSET(C17,-1,0)=2,A17=4),3,IF(AND(OR(OFFSET(C17,-1,0)=\"s\",OFFSET(C17,-1,0)=0),A17<>\"s\",A17>OFFSET(B17,-1,0)),OFFSET(B17,-1,0),A17)))))","v":"S"},{"$f":"IF(OR(C17=\"S\",C17=0),0,IF(ISERROR(K17),J17,SMALL(J17:K17,1)))","v":0},{"$f":"IF($C17=1,OFFSET(E17,-1,0)+1,OFFSET(E17,-1,0))","v":"n1"},{"$f":"IF($C17=1,0,IF($C17=2,OFFSET(F17,-1,0)+1,OFFSET(F17,-1,0)))","v":"n2"},{"$f":"IF(AND($C17<=2,$C17<>0),0,IF($C17=3,OFFSET(G17,-1,0)+1,OFFSET(G17,-1,0)))","v":"n3"},{"$f":"IF(AND($C17<=3,$C17<>0),0,IF($C17=4,OFFSET(H17,-1,0)+1,OFFSET(H17,-1,0)))","v":"n4"},{"$f":"IF(AND($C17<=4,$C17<>0),0,IF(AND($C17=\"S\",$W17>0),OFFSET(I17,-1,0)+1,OFFSET(I17,-1,0)))","v":"n5"},{"$f":"IF(OR($C17=\"S\",$C17=0),0,MATCH(0,OFFSET($D17,1,$C17,ROW($C$497)-ROW($C17)),0))","v":0},{"$f":"IF(OR($C17=\"S\",$C17=0),0,MATCH(OFFSET($D17,0,$C17)+1,OFFSET($D17,1,$C17,ROW($C$497)-ROW($C17)),0))","v":0},"","Serviço","Serviço","-","SINAPI",null,"(sem código)","-",null,0,0,0,""]
[0,null,"L",{"$f":"COUNTA(OFFSET(D18,1,0):D$497)","v":478},{"$f":"LEFT(O19,1)-1","v":0},null,null,null,null,null,null,"F","LOTE","LOTE","REFORMA E AMPLIAÇÃO - CENTRO DE ENSINO EM PERÍODO INTEGRAL NOVO HORIZONTE",null,null,null,null,null,null,null,0]
[1,{"$f":"IF(OR(C19=\"s\",C19=0),OFFSET(B19,-1,0),C19)","v":1},{"$f":"IF(OFFSET(C19,-1,0)=\"L\",1,IF(OFFSET(C19,-1,0)=1,2,IF(OR(A19=\"s\",A19=0),\"S\",IF(AND(OFFSET(C19,-1,0)=2,A19=4),3,IF(AND(OR(OFFSET(C19,-1,0)=\"s\",OFFSET(C19,-1,0)=0),A19<>\"s\",A19>OFFSET(B19,-1,0)),OFFSET(B19,-1,0),A19)))))","v":1},{"$f":"IF(OR(C19=\"S\",C19=0),0,IF(ISERROR(K19),J19,SMALL(J19:K19,1)))","v":200},{"$f":"IF($C19=1,OFFSET(E19,-1,0)+1,OFFSET(E19,-1,0))","v":1},{"$f":"IF($C19=1,0,IF($C19=2,OFFSET(F19,-1,0)+1,OFFSET(F19,-1,0)))","v":0},{"$f":"IF(AND($C19<=2,$C19<>0),0,IF($C19=3,OFFSET(G19,-1,0)+1,OFFSET(G19,-1,0)))","v":0},{"$f":"IF(AND($C19<=3,$C19<>0),0,IF($C19=4,OFFSET(H19,-1,0)+1,OFFSET(H19,-1,0)))","v":0},0,{"$f":"IF(OR($C19=\"S\",$C19=0),0,MATCH(0,OFFSET($D19,1,$C19,ROW($C$497)-ROW($C19)),0))","v":478},{"$f":"IF(OR($C19=\"S\",$C19=0),0,MATCH(OFFSET($D19,0,$C19)+1,OFFSET($D19,1,$C19,ROW($C$497)-ROW($C19)),0))","v":200},"F","Nível 1","Nível 1","1.","AGETOP",null,"REFORMA",null,null,null,null,0]
[2,{"$f":"IF(OR(C20=\"s\",C20=0),OFFSET(B20,-1,0),C20)","v":2},{"$f":"IF(OFFSET(C20,-1,0)=\"L\",1,IF(OFFSET(C20,-1,0)=1,2,IF(OR(A20=\"s\",A20=0),\"S\",IF(AND(OFFSET(C20,-1,0)=2,A20=4),3,IF(AND(OR(OFFSET(C20,-1,0)=\"s\",OFFSET(C20,-1,0)=0),A20<>\"s\",A20>OFFSET(B20,-1,0)),OFFSET(B20,-1,0),A20)))))","v":2},{"$f":"IF(OR(C20=\"S\",C20=0),0,IF(ISERROR(K20),J20,SMALL(J20:K20,1)))","v":19},{"$f":"IF($C20=1,OFFSET(E20,-1,0)+1,OFFSET(E20,-1,0))","v":1},{"$f":"IF($C20=1,0,IF($C20=2,OFFSET(F20,-1,0)+1,OFFSET(F20,-1,0)))","v":1},{"$f":"IF(AND($C20<=2,$C20<>0),0,IF($C20=3,OFFSET(G20,-1,0)+1,OFFSET(G20,-1,0)))","v":0},{"$f":"IF(AND($C20<=3,$C20<>0),0,IF($C20=4,OFFSET(H20,-1,0)+1,OFFSET(H20,-1,0)))","v":0},0,199,19,"","Nível 2","Nível 2","-","AGETOP",null,"SERVIÇOS PRELIMINARES",null,null,null,null,0]
["S",2,"S",0,1,1,0,0,0,0,0,"","Serviço","Serviço","-","AGETOP",160421,"MAO DE OBRA PARA COBERTURA C/TELHA COLONIAL PLAN","m2    ",883.43,null,null,0,""]
["S",{"$f":"IF(OR(C22=\"s\",C22=0),OFFSET(B22,-1,0),C22)","v":2},{"$f":"IF(OFFSET(C22,-1,0)=\"L\",1,IF(OFFSET(C22,-1,0)=1,2,IF(OR(A22=\"s\",A22=0),\"S\",IF(AND(OFFSET(C22,-1,0)=2,A22=4),3,IF(AND(OR(OFFSET(C22,-1,0)=\"s\",OFFSET(C22,-1,0)=0),A22<>\"s\",A22>OFFSET(B22,-1,0)),OFFSET(B22,-1,0),A22)))))","v":"S"},{"$f":"IF(OR(C22=\"S\",C22=0),0,IF(ISERROR(K22),J22,SMALL(J22:K22,1)))","v":0},1,1,0,0,0,0,0,"","Serviço","Serviço","-","AGETOP",20101,"DEMOLICAO COBERTURA TELHA CERAMICA C/ TRANSP. ATÉ CB. E CARGA","m2    ",883.44,null,null,0,""]
["S",2,"S",0,1,1,0,0,0,0,0,"","Serviço","Serviço","-","SINAPI",97650,"REMOÇÃO DE TRAMA DE MADEIRA PARA COBERTURA, DE FORMA MANUAL, SEM REAPROVEITAMENTO. AF_12/2017","M2",249.24,null,null,0,"Referência: AGETOP - 20136"]
["S",2,"S",0,1,1,0,0,0,0,0,"","Serviço","Serviço","-","AGETOP",20103,"DEMOLIÇÃO ESTRUTURA EM MADEIRA TELHADO C/ TRANSP. ATÉ CB. E CARGA","m2    ",830.82,null,null,0,""]
["S",2,"S",0,1,1,0,0,0,0,0,"","Serviço","Serviço","-","SINAPI",97644,"REMOÇÃO DE PORTAS, DE FORMA MANUAL, SEM REAPROVEITAMENTO. AF_12/2017","M2",3.3600000000000003,null,null,0,"Referência: AGETOP - 20106"]
["S",2,"S",0,1,1,0,0,0,0,0,"","Serviço","Serviço","-","AGETOP",20109,"DEM.PISO CIMENT.SOBRE LASTRO CONC.C/TR.ATE CB. E CARGA","m2    ",672.16000000000008,null,null,0,""]
["S",2,"S",0,1,1,0,0,0,0,0,"","Serviço","Serviço","-","AGETOP",20111,"DEM.PISO CERAM.SOBRE LASTRO CONC.C/TR.CB.E CARGA","m2    ",67.459999999999994,null,null,0,""]
["S",2,"S",0,1,1,0,0,0,0,0,"","Serviço","Serviço","-","AGETOP",20121,"DEM. MANUAL EM CONCR.SIMPLES C/TR.ATE CB.E CARGA (O.C.)","m3    ",39.72,null,null,0,""]
["S",2,"S",0,1,1,0,0,0,0,0,"","Serviço","Serviço","-","SINAPI",97633,"DEMOLIÇÃO DE REVESTIMENTO CERÂMICO, DE FORMA MANUAL, SEM REAPROVEITAMENTO. AF_12/2017","M2",159.49,null,null,0,"Referência: AGETOP - 20115"]
["S",2,"S",0,1,1,0,0,0,0,0,"","Serviço","Serviço","-","SINAPI",97622,"DEMOLIÇÃO DE ALVENARIA DE BLOCO FURADO, DE FORMA MANUAL, SEM REAPROVEITAMENTO. AF_12/2017","M3",0.26700000000000002,null,null,0,"Referência: AGETOP - 20118"]
["S",2,"S",0,1,1,0,0,0,0,0,"","Serviço","Serviço","-","COMPOSIÇÃO","COMP 428_SEE","DEMOLIÇÃO DE ALAMBRADO COM TUBO GALVANIZADO C/ TR. ATE CB. E CARGA ","M",23.06,null,null,0,""]
["S",2,"S",0,1,1,0,0,0,0,0,"","Serviço","Serviço","-","AGETOP",20137,"DEMOLIÇAO BACIA SANITARIA C/ TRANSP. ATÉ CB. E CARGA","Un    ",15,null,null,0,""]
["S",2,"S",0,1,1,0,0,0,0,0,"","Serviço","Serviço","-","AGETOP",20140,"DEMOLIÇAO DE VÁLVULA DE DESCARGA C/ TRANSP. ATÉ CB. E CARGA","Un    ",15,null,null,0,""]
["S",2,"S",0,1,1,0,0,0,0,0,"","Serviço","Serviço","-","AGETOP",20157,"DEMOLIÇÃO CALHAS/ RUFOS EM CHAPA C/TR.AT.C.B.E CARGA","m2    ",6.31,null,null,0,""]
["S",2,"S",0,1,1,0,0,0,0,0,"","Serviço","Serviço","-","SINAPI",98527,"REMOÇÃO DE RAÍZES REMANESCENTES DE TRONCO DE ÁRVORE COM DIÂMETRO MAIOR OU IGUAL A 0,40 M E MENOR QUE 0,60 M.AF_05/2018","UN",1,null,null,0,""]
["S",2,"S",0,1,1,0,0,0,0,0,"","Serviço","Serviço","-","AGETOP",20148,"DEMOLIÇÃO DE FORRO PVC ( SOMENTE O FORRO) C/ TRANSP. ATÉ CB. E CARGA","m2    ",213.16,null,null,0,""]
["S",2,"S",0,1,1,0,0,0,0,0,"","Serviço","Serviço","-","AGETOP",20147,"DEMOLIÇÃO DE FORRO PVC  INCLUSIVE ESTRUTURA DE SUSTENTAÇÃO C/ TRANSP. ATÉ CB. E CARGA","m2    ",373.82,null,null,0,""]
["S",2,"S",0,1,1,0,0,0,0,0,"","Serviço","Serviço","-","SINAPI","74209/1","PLACA DE OBRA EM CHAPA DE ACO GALVANIZADO","M2",4.5,null,null,0,"Referência: AGETOP - 21301"]
[2,2,2,3,1,2,0,0,0,180,3,"","Nível 2","Nível 2","-","AGETOP",null,"TRANSPORTES","-",null,null,null,0,""]
["S",2,"S",0,1,2,0,0,0,0,0,"","Serviço","Serviço","-","SINAPI",72900,"TRANSPORTE DE ENTULHO COM CAMINHAO BASCULANTE 6 M3, RODOVIA PAVIMENTADA, DMT 0,5 A 1,0 KM","M3",106.85205000000002,null,null,0,""]
["S",2,"S",0,1,2,0,0,0,0,0,"","Serviço","Serviço","-","SINAPI",72897,"CARGA MANUAL DE ENTULHO EM CAMINHAO BASCULANTE 6 M3","M3",106.85205000000002,null,null,0,""]
[2,2,2,2,1,3,0,0,0,177,2,"","Nível 2","Nível 2","-","AGETOP",null,"SERVIÇO EM TERRA","-",null,null,null,0,""]
[{"$f":"CHOOSE(1+LOG(1+2*(ORÇAMENTO.Nivel=\"Nível 1\")+4*(ORÇAMENTO.Nivel=\"Nível 2\")+8*(ORÇAMENTO.Nivel=\"Nível 3\")+16*(ORÇAMENTO.Nivel=\"Nível 4\")+32*(ORÇAMENTO.Nivel=\"Serviço\"),2),0,1,2,3,4,\"S\")","v":"S"},2,"S",0,{"$f":"IF($C43=1,OFFSET(E43,-1,0)+1,OFFSET(E43,-1,0))","v":1},{"$f":"IF($C43=1,0,IF($C43=2,OFFSET(F43,-1,0)+1,OFFSET(F43,-1,0)))","v":3},{"$f":"IF(AND($C43<=2,$C43<>0),0,IF($C43=3,OFFSET(G43,-1,0)+1,OFFSET(G43,-1,0)))","v":0},{"$f":"IF(AND($C43<=3,$C43<>0),0,IF($C43=4,OFFSET(H43,-1,0)+1,OFFSET(H43,-1,0)))","v":0},{"$f":"IF(AND($C43<=4,$C43<>0),0,IF(AND($C43=\"S\",$W43>0),OFFSET(I43,-1,0)+1,OFFSET(I43,-1,0)))","v":0},0,0,"","Serviço","Serviço","-","AGETOP",41002,"APILOAMENTO","m2    ",458.54,null,null,0,""]
[{"$f":"CHOOSE(1+LOG(1+2*(ORÇAMENTO.Nivel=\"Nível 1\")+4*(ORÇAMENTO.Nivel=\"Nível 2\")+8*(ORÇAMENTO.Nivel=\"Nível 3\")+16*(ORÇAMENTO.Nivel=\"Nível 4\")+32*(ORÇAMENTO.Nivel=\"Serviço\"),2),0,1,2,3,4,\"S\")","v":2},{"$f":"IF(OR(C44=\"s\",C44=0),OFFSET(B44,-1,0),C44)","v":2},{"$f":"IF(OFFSET(C44,-1,0)=\"L\",1,IF(OFFSET(C44,-1,0)=1,2,IF(OR(A44=\"s\",A44=0),\"S\",IF(AND(OFFSET(C44,-1,0)=2,A44=4),3,IF(AND(OR(OFFSET(C44,-1,0)=\"s\",OFFSET(C44,-1,0)=0),A44<>\"s\",A44>OFFSET(B44,-1,0)),OFFSET(B44,-1,0),A44)))))","v":2},{"$f":"IF(OR(C44=\"S\",C44=0),0,IF(ISERROR(K44),J44,SMALL(J44:K44,1)))","v":68},{"$f":"IF($C44=1,OFFSET(E44,-1,0)+1,OFFSET(E44,-1,0))","v":1},{"$f":"IF($C44=1,0,IF($C44=2,OFFSET(F44,-1,0)+1,OFFSET(F44,-1,0)))","v":4},{"$f":"IF(AND($C44<=2,$C44<>0),0,IF($C44=3,OFFSET(G44,-1,0)+1,OFFSET(G44,-1,0)))","v":0},{"$f":"IF(AND($C44<=3,$C44<>0),0,IF($C44=4,OFFSET(H44,-1,0)+1,OFFSET(H44,-1,0)))","v":0},{"$f":"IF(AND($C44<=4,$C44<>0),0,IF(AND($C44=\"S\",$W44>0),OFFSET(I44,-1,0)+1,OFFSET(I44,-1,0)))","v":0},175,68,"","Nível 2","Nível 2","-",null,null,"INSTALAÇÕES ELÉTRICAS","-",null,null,null,0,""]
["S",2,"S",0,1,4,0,0,0,0,0,"","Serviço","Serviço","-","SINAPI","74131/4","QUADRO DE DISTRIBUICAO DE ENERGIA DE EMBUTIR, EM CHAPA METALICA, PARA 18 DISJUNTORES TERMOMAGNETICOS MONOPOLARES, COM BARRAMENTO TRIFASICO E NEUTRO, FORNECIMENTO E INSTALACAO","UN",2,null,null,0,""]
["S",2,"S",0,1,4,0,0,0,0,0,"","Serviço","Serviço","-","SINAPI","74131/5","QUADRO DE DISTRIBUICAO DE ENERGIA DE EMBUTIR, EM CHAPA METALICA, PARA 24 DISJUNTORES TERMOMAGNETICOS MONOPOLARES, COM BARRAMENTO TRIFASICO E NEUTRO, FORNECIMENTO E INSTALACAO","UN",1,null,null,0,""]
["S",2,"S",0,1,4,0,0,0,0,0,"","Serviço","Serviço","-","SINAPI","74131/7","QUADRO DE DISTRIBUICAO DE ENERGIA DE EMBUTIR, EM CHAPA METALICA, PARA 40 DISJUNTORES TERMOMAGNETICOS MONOPOLARES, COM BARRAMENTO TRIFASICO E NEUTRO, FORNECIMENTO E INSTALACAO","UN",1,null,null,0,""]
["S",2,"S",0,1,4,0,0,0,0,0,"","Serviço","Serviço","-","SINAPI",93673,"DISJUNTOR TRIPOLAR TIPO DIN, CORRENTE NOMINAL DE 50A - FORNECIMENTO E INSTALAÇÃO. AF_04/2016","UN",1,null,null,0,"Referência: AGETOP - 71174"]
["S",2,"S",0,1,4,0,0,0,0,0,"","Serviço","Serviço","-","SINAPI",93670,"DISJUNTOR TRIPOLAR TIPO DIN, CORRENTE NOMINAL DE 25A - FORNECIMENTO E INSTALAÇÃO. AF_04/2016","UN",1,null,null,0,"Referência: AGETOP - 71173"]
["S",2,"S",0,1,4,0,0,0,0,0,"","Serviço","Serviço","-","AGETOP",71175,"DISJUNTOR TRIPOLAR DE 60 A 100-A","Un    ",3,null,null,0,""]
["S",2,"S",0,1,4,0,0,0,{"$f":"IF(OR($C51=\"S\",$C51=0),0,MATCH(0,OFFSET($D51,1,$C51,ROW($C$497)-ROW($C51)),0))","v":0},{"$f":"IF(OR($C51=\"S\",$C51=0),0,MATCH(OFFSET($D51,0,$C51)+1,OFFSET($D51,1,$C51,ROW($C$497)-ROW($C51)),0))","v":0},"","Serviço","Serviço","-","SINAPI","74130/10","DISJUNTOR TERMOMAGNETICO TRIPOLAR EM CAIXA MOLDADA 175 A 225A 240V, FORNECIMENTO E INSTALACAO","UN",2,null,null,0,""]
["S",2,"S",0,1,4,0,0,0,0,0,"","Serviço","Serviço","-","SINAPI",93656,"DISJUNTOR MONOPOLAR TIPO DIN, CORRENTE NOMINAL DE 25A - FORNECIMENTO E INSTALAÇÃO. AF_04/2016","UN",30,null,null,0,""]
["S",2,"S",0,1,4,0,0,0,0,0,"","Serviço","Serviço","-","SINAPI",93654,"DISJUNTOR MONOPOLAR TIPO DIN, CORRENTE NOMINAL DE 16A - FORNECIMENTO E INSTALAÇÃO. AF_04/2016","UN",22,null,null,0,""]
["S",2,"S",0,1,4,0,0,0,0,0,"","Serviço","Serviço","-","SINAPI",93653,"DISJUNTOR MONOPOLAR TIPO DIN, CORRENTE NOMINAL DE 10A - FORNECIMENTO E INSTALAÇÃO. AF_04/2016","UN",25,null,null,0,""]
["S",2,"S",0,1,4,0,0,0,0,0,"","Serviço","Serviço","-","AGETOP",71184,"DISPOSITIVO DE PROTEÇÃO CONTRA SURTOS (D.P.S.) 275V DE 8 A 40KA","Un    ",3,null,null,0,""]
["S",2,"S",0,1,4,0,0,0,0,0,"","Serviço","Serviço","-","SINAPI",91926,"CABO DE COBRE FLEXÍVEL ISOLADO, 2,5 MM², ANTI-CHAMA 450/750 V, PARA CIRCUITOS TERMINAIS - FORNECIMENTO E INSTALAÇÃO. AF_12/2015","M",3071.04,null,null,0,"Referência: AGETOP - 70563"]
["S",2,"S",0,1,4,0,0,0,0,0,"","Serviço","Serviço","-","SINAPI",91928,"CABO DE COBRE FLEXÍVEL ISOLADO, 4 MM², ANTI-CHAMA 450/750 V, PARA CIRCUITOS TERMINAIS - FORNECIMENTO E INSTALAÇÃO. AF_12/2015","M",2842.72,null,null,0,"Referência: AGETOP - 70564"]
["S",2,"S",0,1,4,0,0,0,0,0,"","Serviço","Serviço","-","SINAPI",91930,"CABO DE COBRE FLEXÍVEL ISOLADO, 6 MM², ANTI-CHAMA 450/750 V, PARA CIRCUITOS TERMINAIS - FORNECIMENTO E INSTALAÇÃO. AF_12/2015","M",1703.35,null,null,0,"Referência: AGETOP - 70565"]
["S",2,"S",0,1,4,0,0,0,0,0,"","Serviço","Serviço","-","SINAPI",92979,"CABO DE COBRE FLEXÍVEL ISOLADO, 10 MM², ANTI-CHAMA 450/750 V, PARA DISTRIBUIÇÃO - FORNECIMENTO E INSTALAÇÃO. AF_12/2015","M",548.75,null,null,0,""]
["S",2,"S",0,1,4,0,0,0,0,0,"","Serviço","Serviço","-","SINAPI",92981,"CABO DE COBRE FLEXÍVEL ISOLADO, 16 MM², ANTI-CHAMA 450/750 V, PARA DISTRIBUIÇÃO - FORNECIMENTO E INSTALAÇÃO. AF_12/2015","M",1.5,null,null,0,""]
["S",2,"S",0,1,4,0,0,0,0,0,"","Serviço","Serviço","-","SINAPI",92990,"CABO DE COBRE FLEXÍVEL ISOLADO, 70 MM², ANTI-CHAMA 0,6/1,0 KV, PARA DISTRIBUIÇÃO - FORNECIMENTO E INSTALAÇÃO. AF_12/2015","M",530,null,null,0,"Referência: AGETOP - 70514"]
["S",2,"S",0,1,4,0,0,0,0,0,"","Serviço","Serviço","-","SINAPI",92986,"CABO DE COBRE FLEXÍVEL ISOLADO, 35 MM², ANTI-CHAMA 0,6/1,0 KV, PARA DISTRIBUIÇÃO - FORNECIMENTO E INSTALAÇÃO. AF_12/2015","M",150,null,null,0,"Referência: AGETOP - 70512"]
["S",2,"S",0,1,4,0,0,0,0,0,"","Serviço","Serviço","-","AGETOP",70541,"CABO DE COBRE NU No. 16 MM2 (6,94 M/KG)","M     ",20,null,null,0,""]
["S",2,"S",0,1,4,0,0,0,0,0,"","Serviço","Serviço","-","AGETOP",70544,"CABO DE COBRE NÚ No. 50 MM2","M     ",50,null,null,0,""]
["S",2,"S",0,1,4,0,0,0,0,0,"","Serviço","Serviço","-","SINAPI",91834,"ELETRODUTO FLEXÍVEL CORRUGADO, PVC, DN 25 MM (3/4\"), PARA CIRCUITOS TERMINAIS, INSTALADO EM FORRO - FORNECIMENTO E INSTALAÇÃO. AF_12/2015","M",1555.65,null,null,0,"Referência: AGETOP - 71194"]
["S",2,"S",0,1,4,0,0,0,0,0,"","Serviço","Serviço","-","SINAPI",91836,"ELETRODUTO FLEXÍVEL CORRUGADO, PVC, DN 32 MM (1\"), PARA CIRCUITOS TERMINAIS, INSTALADO EM FORRO - FORNECIMENTO E INSTALAÇÃO. AF_12/2015","M",349.45,null,null,0,"Referência: AGETOP - 71195"]
["S",2,"S",0,1,4,0,0,0,0,0,"","Serviço","Serviço","-","AGETOP",71196,"ELETRODUTO PVC FLEXÍVEL - MANGUEIRA CORRUGADA REFORÇADA - DIAM. 40MM","M     ",201.36,null,null,0,""]
["S",2,"S",0,1,4,0,0,0,0,0,"","Serviço","Serviço","-","AGETOP",71197,"ELETRODUTO PVC FLEXÍVEL - MANGUEIRA CORRUGADA REFORÇADA - DIAM. 50MM","M     ",50,null,null,0,""]
["S",2,"S",0,1,4,0,0,0,0,0,"","Serviço","Serviço","-","AGETOP",71198,"ELETRODUTO PVC FLEXÍVEL - MANGUEIRA CORRUGADA REFORÇADA - DIAM. 60MM","M     ",53.5,null,null,0,""]
["S",2,"S",0,1,4,0,0,0,0,0,"","Serviço","Serviço","-","AGETOP",71199,"ELETRODUTO PVC FLEXÍVEL - MANGUEIRA CORRUGADA REFORÇADA - DIAM. 75MM","M     ",150,null,null,0,""]
["S",2,"S",0,1,4,0,0,0,0,0,"","Serviço","Serviço","-","SINAPI",91867,"ELETRODUTO RÍGIDO ROSCÁVEL, PVC, DN 25 MM (3/4\"), PARA CIRCUITOS TERMINAIS, INSTALADO EM LAJE - FORNECIMENTO E INSTALAÇÃO. AF_12/2015","M",234,null,null,0,"Referência: AGETOP - 71201"]
["S",2,"S",0,1,4,0,0,0,0,0,"","Serviço","Serviço","-","SINAPI",91868,"ELETRODUTO RÍGIDO ROSCÁVEL, PVC, DN 32 MM (1\"), PARA CIRCUITOS TERMINAIS, INSTALADO EM LAJE - FORNECIMENTO E INSTALAÇÃO. AF_12/2015","M",53,null,null,0,"Referência: AGETOP - 71202"]
["S",2,"S",0,1,4,0,0,0,0,0,"","Serviço","Serviço","-","SINAPI",93008,"ELETRODUTO RÍGIDO ROSCÁVEL, PVC, DN 50 MM (1 1/2\") - FORNECIMENTO E INSTALAÇÃO. AF_12/2015","M",30,null,null,0,""]
["S",2,"S",0,1,4,0,0,0,0,0,"","Serviço","Serviço","-","SINAPI",93010,"ELETRODUTO RÍGIDO ROSCÁVEL, PVC, DN 75 MM (2 1/2\") - FORNECIMENTO E INSTALAÇÃO. AF_12/2015","M",8,null,null,0,""]
["S",2,"S",0,1,4,0,0,0,0,0,"","Serviço","Serviço","-","SINAPI",93009,"ELETRODUTO RÍGIDO ROSCÁVEL, PVC, DN 60 MM (2\") - FORNECIMENTO E INSTALAÇÃO. AF_12/2015","M",9,null,null,0,""]
["S",2,"S",0,1,4,0,0,0,0,0,"","Serviço","Serviço","-","SINAPI",93012,"ELETRODUTO RÍGIDO ROSCÁVEL, PVC, DN 110 MM (4\") - FORNECIMENTO E INSTALAÇÃO. AF_12/2015","M",10,null,null,0,""]
["S",2,"S",0,1,4,0,0,0,0,0,"","Serviço","Serviço","-","AGETOP",70351,"BRACADEIRA METALICA TIPO \"U\" DIAM. 3/4\"","Un    ",78,null,null,0,""]
["S",2,"S",0,1,4,0,0,0,0,0,"","Serviço","Serviço","-","AGETOP",70352,"BRACADEIRA METALICA TIPO \"U\" DIAM. 1\"","Un    ",18,null,null,0,""]
["S",2,"S",0,1,4,0,0,0,0,0,"","Serviço","Serviço","-","AGETOP",70354,"BRACADEIRA METALICA TIPO \"U\" DIAM. 1.1/2\"","Un    ",10,null,null,0,""]
["S",2,"S",0,1,4,0,0,0,0,0,"","Serviço","Serviço","-","AGETOP",70355,"BRACADEIRA METALICA TIPO \"U\" DIAM. 2\"","Un    ",3,null,null,0,""]
["S",2,"S",0,1,4,0,0,0,0,0,"","Serviço","Serviço","-","AGETOP",70356,"BRACADEIRA METALICA TIPO \"U\" DIAM. 2.1/2\"","Un    ",3,null,null,0,""]
["S",2,"S",0,1,4,0,0,0,0,0,"","Serviço","Serviço","-","SINAPI",91879,"LUVA PARA ELETRODUTO, PVC, ROSCÁVEL, DN 25 MM (3/4\"), PARA CIRCUITOS TERMINAIS, INSTALADA EM LAJE - FORNECIMENTO E INSTALAÇÃO. AF_12/2015","UN",500,null,null,0,"Referência: AGETOP - 71741"]
["S",2,"S",0,1,4,0,0,0,{"$f":"IF(OR($C83=\"S\",$C83=0),0,MATCH(0,OFFSET($D83,1,$C83,ROW($C$497)-ROW($C83)),0))","v":0},{"$f":"IF(OR($C83=\"S\",$C83=0),0,MATCH(OFFSET($D83,0,$C83)+1,OFFSET($D83,1,$C83,ROW($C$497)-ROW($C83)),0))","v":0},"","Serviço","Serviço","-","SINAPI",91880,"LUVA PARA ELETRODUTO, PVC, ROSCÁVEL, DN 32 MM (1\"), PARA CIRCUITOS TERMINAIS, INSTALADA EM LAJE - FORNECIMENTO E INSTALAÇÃO. AF_12/2015","UN",117,null,null,0,"Referência: AGETOP - 71742"]
["S",2,"S",0,1,4,0,0,0,0,0,"","Serviço","Serviço","-","SINAPI",93013,"LUVA PARA ELETRODUTO, PVC, ROSCÁVEL, DN 50 MM (1 1/2\") - FORNECIMENTO E INSTALAÇÃO. AF_12/2015","UN",68,null,null,0,"Referência: AGETOP - 71744"]
["S",2,"S",0,1,4,0,0,0,0,0,"","Serviço","Serviço","-","SINAPI",93014,"LUVA PARA ELETRODUTO, PVC, ROSCÁVEL, DN 60 MM (2\") - FORNECIMENTO E INSTALAÇÃO. AF_12/2015","UN",17,null,null,0,"Referência: AGETOP - 71745"]
["S",2,"S",0,1,4,0,0,0,0,0,"","Serviço","Serviço","-","SINAPI",93015,"LUVA PARA ELETRODUTO, PVC, ROSCÁVEL, DN 75 MM (2 1/2\") - FORNECIMENTO E INSTALAÇÃO. AF_12/2015","UN",17,null,null,0,""]
[{"$f":"CHOOSE(1+LOG(1+2*(ORÇAMENTO.Nivel=\"Nível 1\")+4*(ORÇAMENTO.Nivel=\"Nível 2\")+8*(ORÇAMENTO.Nivel=\"Nível 3\")+16*(ORÇAMENTO.Nivel=\"Nível 4\")+32*(ORÇAMENTO.Nivel=\"Serviço\"),2),0,1,2,3,4,\"S\")","v":"S"},2,"S",0,1,4,0,0,{"$f":"IF(AND($C87<=4,$C87<>0),0,IF(AND($C87=\"S\",$W87>0),OFFSET(I87,-1,0)+1,OFFSET(I87,-1,0)))","v":0},0,0,"","Serviço","Serviço","-","SINAPI",95801,"CONDULETE DE ALUMÍNIO, TIPO X, PARA ELETRODUTO DE AÇO GALVANIZADO DN 20 MM (3/4''), APARENTE - FORNECIMENTO E INSTALAÇÃO. AF_11/2016_P","UN",260,null,null,0,"Referência: AGETOP - 70929"]
["S",2,"S",0,1,4,0,0,0,0,0,"","Serviço","Serviço","-","SINAPI",91902,"CURVA 90 GRAUS PARA ELETRODUTO, PVC, ROSCÁVEL, DN 25 MM (3/4\"), PARA CIRCUITOS TERMINAIS, INSTALADA EM LAJE - FORNECIMENTO E INSTALAÇÃO. AF_12/2015","UN",50,null,null,0,"Referência: AGETOP - 71141"]
["S",2,"S",0,1,4,0,0,0,0,0,"","Serviço","Serviço","-","SINAPI",91905,"CURVA 90 GRAUS PARA ELETRODUTO, PVC, ROSCÁVEL, DN 32 MM (1\"), PARA CIRCUITOS TERMINAIS, INSTALADA EM LAJE - FORNECIMENTO E INSTALAÇÃO. AF_12/2015","UN",20,null,null,0,"Referência: AGETOP - 71142"]
["S",2,"S",0,{"$f":"IF($C90=1,OFFSET(E90,-1,0)+1,OFFSET(E90,-1,0))","v":1},{"$f":"IF($C90=1,0,IF($C90=2,OFFSET(F90,-1,0)+1,OFFSET(F90,-1,0)))","v":4},{"$f":"IF(AND($C90<=2,$C90<>0),0,IF($C90=3,OFFSET(G90,-1,0)+1,OFFSET(G90,-1,0)))","v":0},{"$f":"IF(AND($C90<=3,$C90<>0),0,IF($C90=4,OFFSET(H90,-1,0)+1,OFFSET(H90,-1,0)))","v":0},0,0,0,"","Serviço","Serviço","-","AGETOP",71124,"CURVA 90 GRAUS AÇO ZINCADO DIÂMETRO 1.1/2\"","Un    ",15,null,null,0,""]
["S",2,"S",0,1,4,0,0,0,0,0,"","Serviço","Serviço","-","AGETOP",71125,"CURVA 90 GRAUS AÇO ZINCADO DIÂMETRO 2\"","Un    ",10,null,null,0,""]
["S",2,"S",0,1,4,0,0,0,0,0,"","Serviço","Serviço","-","AGETOP",71126,"CURVA 90 GRAUS AÇO ZINCADO DIÂMETRO 2.1/2\"","Un    ",5,null,null,0,""]
["S",2,"S",0,1,4,0,0,0,0,0,"","Serviço","Serviço","-","SINAPI",92870,"CAIXA RETANGULAR 4\" X 4\" ALTA (2,00 M DO PISO), METÁLICA, INSTALADA EM PAREDE - FORNECIMENTO E INSTALAÇÃO. AF_12/2015","UN",286,null,null,0,""]
["S",2,"S",0,1,4,0,0,0,0,0,"","Serviço","Serviço","-","SINAPI",91953,"INTERRUPTOR SIMPLES (1 MÓDULO), 10A/250V, INCLUINDO SUPORTE E PLACA - FORNECIMENTO E INSTALAÇÃO. AF_12/2015","UN",20,null,null,0,"Referência: AGETOP - 71440"]
["S",{"$f":"IF(OR(C95=\"s\",C95=0),OFFSET(B95,-1,0),C95)","v":2},{"$f":"IF(OFFSET(C95,-1,0)=\"L\",1,IF(OFFSET(C95,-1,0)=1,2,IF(OR(A95=\"s\",A95=0),\"S\",IF(AND(OFFSET(C95,-1,0)=2,A95=4),3,IF(AND(OR(OFFSET(C95,-1,0)=\"s\",OFFSET(C95,-1,0)=0),A95<>\"s\",A95>OFFSET(B95,-1,0)),OFFSET(B95,-1,0),A95)))))","v":"S"},{"$f":"IF(OR(C95=\"S\",C95=0),0,IF(ISERROR(K95),J95,SMALL(J95:K95,1)))","v":0},1,4,0,0,0,0,0,"","Serviço","Serviço","-","SINAPI",91959,"INTERRUPTOR SIMPLES (2 MÓDULOS), 10A/250V, INCLUINDO SUPORTE E PLACA - FORNECIMENTO E INSTALAÇÃO. AF_12/2015","UN",5,null,null,0,"Referência: AGETOP - 71441"]
["S",2,"S",0,1,4,0,0,0,0,0,"","Serviço","Serviço","-","SINAPI",91967,"INTERRUPTOR SIMPLES (3 MÓDULOS), 10A/250V, INCLUINDO SUPORTE E PLACA - FORNECIMENTO E INSTALAÇÃO. AF_12/2015","UN",20,null,null,0,"Referência: AGETOP - 71442"]
["S",2,"S",0,1,4,0,0,0,0,0,"","Serviço","Serviço","-","SINAPI",92000,"TOMADA BAIXA DE EMBUTIR (1 MÓDULO), 2P+T 10 A, INCLUINDO SUPORTE E PLACA - FORNECIMENTO E INSTALAÇÃO. AF_12/2015","UN",83,null,null,0,"Referência: AGETOP - 72578"]
["S",2,"S",0,1,4,0,0,0,0,0,"","Serviço","Serviço","-","SINAPI",91996,"TOMADA MÉDIA DE EMBUTIR (1 MÓDULO), 2P+T 10 A, INCLUINDO SUPORTE E PLACA - FORNECIMENTO E INSTALAÇÃO. AF_12/2015","UN",12,null,null,0,"Referência: AGETOP - 72578"]
["S",2,"S",0,1,4,0,0,0,0,0,"","Serviço","Serviço","-","SINAPI",91993,"TOMADA ALTA DE EMBUTIR (1 MÓDULO), 2P+T 20 A, INCLUINDO SUPORTE E PLACA - FORNECIMENTO E INSTALAÇÃO. AF_12/2015","UN",46,null,null,0,"Referência: AGETOP - 72585"]
["S",2,"S",0,1,4,0,0,0,0,0,"","Serviço","Serviço","-","SINAPI",97594,"LUMINÁRIA TIPO SPOT, DE SOBREPOR, COM 2 LÂMPADAS DE 15 W - FORNECIMENTO E INSTALAÇÃO. AF_11/2017","UN",282,null,null,0,""]
["S",2,"S",0,1,4,0,0,0,0,0,"","Serviço","Serviço","-","SINAPI","73831/9","LAMPADA DE VAPOR DE SODIO DE 400WX220V - FORNECIMENTO E INSTALACAO","UN",12,null,null,0,""]
["S",2,"S",0,1,4,0,0,0,0,0,"","Serviço","Serviço","-","SINAPI",97610,"LÂMPADA COMPACTA DE LED 10 W, BASE E27 - FORNECIMENTO E INSTALAÇÃO. AF_11/2017","UN",564,null,null,0,""]
["S",2,"S",0,1,4,0,0,0,0,0,"","Serviço","Serviço","-","SINAPI",97601,"REFLETOR EM ALUMÍNIO COM SUPORTE E ALÇA, LÂMPADA 250 W - FORNECIMENTO E INSTALAÇÃO. AF_11/2017","UN",2,null,null,0,""]
["S",2,"S",0,1,4,0,0,0,0,0,"","Serviço","Serviço","-","SINAPI","73831/5","LAMPADA MISTA DE 250W - FORNECIMENTO E INSTALACAO","UN",7,null,null,0,""]
["S",2,"S",0,1,4,0,0,0,0,0,"","Serviço","Serviço","-","SINAPI",83481,"REATOR PARA LAMPADA VAPOR DE MERCURIO 250W USO EXTERNO","UN",7,null,null,0,""]
["S",2,"S",0,1,4,0,0,0,0,0,"","Serviço","Serviço","-","SINAPI",97889,"CAIXA ENTERRADA ELÉTRICA RETANGULAR, EM ALVENARIA COM TIJOLOS CERÂMICOS MACIÇOS, FUNDO COM BRITA, DIMENSÕES INTERNAS: 0,8X0,8X0,6 M. AF_05/2018","UN",5,null,null,0,""]
["S",2,"S",0,1,4,0,0,0,0,0,"","Serviço","Serviço","-","SINAPI",6171,"TAMPA DE CONCRETO ARMADO 60X60X5CM PARA CAIXA","UN",8,null,null,0,""]
["S",2,"S",0,1,4,0,0,0,0,0,"","Serviço","Serviço","-","AGETOP",71861,"PARAFUSO P/BUCHA S-6","Un    ",500,null,null,0,""]
["S",2,"S",0,1,4,0,0,0,0,0,"","Serviço","Serviço","-","AGETOP",70647,"CAIXA DE PASSAGEM METÁLICA DE EMBUTIR 30X30X12 CM","Un    ",6,null,null,0,""]
["S",2,"S",0,1,4,0,0,0,0,0,"","Serviço","Serviço","-","AGETOP",70391,"BUCHA DE NYLON S-6","Un    ",500,null,null,0,""]
["S",2,"S",0,1,4,0,0,0,0,0,"","Serviço","Serviço","-","AGETOP",20162,"DEMOLIÇÃO DAS INSTALAÇÕES ELÉTRICAS E AFINS C/ TRANSP. ATÉ CB. E CARGA","H     ",200,null,null,0,""]
[{"$f":"CHOOSE(1+LOG(1+2*(ORÇAMENTO.Nivel=\"Nível 1\")+4*(ORÇAMENTO.Nivel=\"Nível 2\")+8*(ORÇAMENTO.Nivel=\"Nível 3\")+16*(ORÇAMENTO.Nivel=\"Nível 4\")+32*(ORÇAMENTO.Nivel=\"Serviço\"),2),0,1,2,3,4,\"S\")","v":2},{"$f":"IF(OR(C112=\"s\",C112=0),OFFSET(B112,-1,0),C112)","v":2},{"$f":"IF(OFFSET(C112,-1,0)=\"L\",1,IF(OFFSET(C112,-1,0)=1,2,IF(OR(A112=\"s\",A112=0),\"S\",IF(AND(OFFSET(C112,-1,0)=2,A112=4),3,IF(AND(OR(OFFSET(C112,-1,0)=\"s\",OFFSET(C112,-1,0)=0),A112<>\"s\",A112>OFFSET(B112,-1,0)),OFFSET(B112,-1,0),A112)))))","v":2},{"$f":"IF(OR(C112=\"S\",C112=0),0,IF(ISERROR(K112),J112,SMALL(J112:K112,1)))","v":21},{"$f":"IF($C112=1,OFFSET(E112,-1,0)+1,OFFSET(E112,-1,0))","v":1},{"$f":"IF($C112=1,0,IF($C112=2,OFFSET(F112,-1,0)+1,OFFSET(F112,-1,0)))","v":5},{"$f":"IF(AND($C112<=2,$C112<>0),0,IF($C112=3,OFFSET(G112,-1,0)+1,OFFSET(G112,-1,0)))","v":0},{"$f":"IF(AND($C112<=3,$C112<>0),0,IF($C112=4,OFFSET(H112,-1,0)+1,OFFSET(H112,-1,0)))","v":0},{"$f":"IF(AND($C112<=4,$C112<>0),0,IF(AND($C112=\"S\",$W112>0),OFFSET(I112,-1,0)+1,OFFSET(I112,-1,0)))","v":0},107,21,"","Nível 2","Nível 2","-","AGETOP",null,"INSTALAÇÕES HIDROSSANITÁRIAS","-",null,null,null,0,""]
[3,3,3,10,1,5,1,0,0,20,10,"","Nível 3","Nível 3","-",null,null,"PEÇAS E ACESSÓRIOS","-",null,null,null,0,""]
["S",3,"S",0,1,5,1,0,0,0,0,"","Serviço","Serviço","-","SINAPI",95470,"VASO SANITARIO SIFONADO CONVENCIONAL COM LOUÇA BRANCA, INCLUSO CONJUNTO DE LIGAÇÃO PARA BACIA SANITÁRIA AJUSTÁVEL - FORNECIMENTO E INSTALAÇÃO. AF_10/2016","UN",15,null,null,0,""]
["S",3,"S",0,1,5,1,0,0,0,0,"","Serviço","Serviço","-","SINAPI",99635,"VÁLVULA DE DESCARGA METÁLICA, BASE 1 1/2 \", ACABAMENTO METALICO CROMADO - FORNECIMENTO E INSTALAÇÃO. AF_01/2019","UN",15,null,null,0,"Referência: AGETOP - 80515"]
["S",3,"S",0,1,5,1,0,0,0,0,"","Serviço","Serviço","-","AGETOP",80510,"ANEL DE VEDAÇÃO PARA VASO SANITÁRIO","Un    ",15,null,null,0,""]
["S",3,"S",0,1,5,1,0,0,0,0,"","Serviço","Serviço","-","AGETOP",80520,"CONJUNTO DE FIXACAO P/VASO SANITARIO (PAR)","CJ    ",15,null,null,0,""]
["S",3,"S",0,1,5,1,0,0,0,0,"","Serviço","Serviço","-","AGETOP",80526,"ASSENTO EM POLIPROPILENO COM SISTEMA DE FECHAMENTO SUAVE PARA VASO SANITÁRIO","Un    ",15,null,null,0,""]
["S",3,"S",0,1,5,1,0,0,{"$f":"IF(OR($C119=\"S\",$C119=0),0,MATCH(0,OFFSET($D119,1,$C119,ROW($C$497)-ROW($C119)),0))","v":0},{"$f":"IF(OR($C119=\"S\",$C119=0),0,MATCH(OFFSET($D119,0,$C119)+1,OFFSET($D119,1,$C119,ROW($C$497)-ROW($C119)),0))","v":0},"","Serviço","Serviço","-","SINAPI",97902,"CAIXA ENTERRADA HIDRÁULICA RETANGULAR EM ALVENARIA COM TIJOLOS CERÂMICOS MACIÇOS, DIMENSÕES INTERNAS: 0,6X0,6X0,6 M PARA REDE DE ESGOTO. AF_05/2018","UN",2,null,null,0,""]
["S",3,"S",0,1,5,1,0,0,0,0,"","Serviço","Serviço","-","SINAPI",6171,"TAMPA DE CONCRETO ARMADO 60X60X5CM PARA CAIXA","UN",2,null,null,0,""]
["S",3,"S",0,1,5,1,0,0,0,0,"","Serviço","Serviço","-","AGETOP",80845,"CAIXA DE ALVENARIA 20x20x25 CM (REVESTIMENTO IMPERMEABILIZADO), FUNDO DE BRITA SEM TAMPA - PARA REGISTRO/TORNEIRA JARDIM","Un    ",1,null,null,0,""]
["S",3,"S",0,1,5,1,0,0,0,0,"","Serviço","Serviço","-","AGETOP",80840,"TAMPA T-5 ARTICULADA 20X20","Un    ",1,null,null,0,""]
[3,3,3,3,1,5,2,0,0,10,3,"","Nível 3","Nível 3","-",null,null,"ESGOTO","-",null,null,null,0,""]
["S",3,"S",0,1,5,2,0,0,0,0,"","Serviço","Serviço","-","SINAPI",89800,"TUBO PVC, SERIE NORMAL, ESGOTO PREDIAL, DN 100 MM, FORNECIDO E INSTALADO EM PRUMADA DE ESGOTO SANITÁRIO OU VENTILAÇÃO. AF_12/2014","M",48,null,null,0,""]
["S",3,"S",0,1,5,2,0,0,0,0,"","Serviço","Serviço","-","SINAPI",89778,"LUVA SIMPLES, PVC, SERIE NORMAL, ESGOTO PREDIAL, DN 100 MM, JUNTA ELÁSTICA, FORNECIDO E INSTALADO EM RAMAL DE DESCARGA OU RAMAL DE ESGOTO SANITÁRIO. AF_12/2014","UN",6,null,null,0,"Referência: AGETOP - 82004"]
[3,3,3,7,1,5,3,0,0,7,78,"","Nível 3","Nível 3","-",null,null,"ÁGUA","-",null,null,null,0,""]
["S",3,"S",0,1,5,3,0,0,0,0,"","Serviço","Serviço","-","SINAPI",89451,"TUBO, PVC, SOLDÁVEL, DN 75MM, INSTALADO EM PRUMADA DE ÁGUA - FORNECIMENTO E INSTALAÇÃO. AF_12/2014","M",18,null,null,0,""]
["S",3,"S",0,1,5,3,0,0,0,0,"","Serviço","Serviço","-","SINAPI",89611,"LUVA, PVC, SOLDÁVEL, DN 75MM, INSTALADO EM PRUMADA DE ÁGUA - FORNECIMENTO E INSTALAÇÃO. AF_12/2014","UN",2,null,null,0,""]
["S",3,"S",0,1,5,3,0,0,0,0,"","Serviço","Serviço","-","SINAPI",89513,"JOELHO 90 GRAUS, PVC, SOLDÁVEL, DN 75MM, INSTALADO EM PRUMADA DE ÁGUA - FORNECIMENTO E INSTALAÇÃO. AF_12/2014","UN",4,null,null,0,"Referência: AGETOP - 81326"]
["S",3,"S",0,1,5,3,0,0,0,0,"","Serviço","Serviço","-","SINAPI",94713,"ADAPTADOR COM FLANGES LIVRES, PVC, SOLDÁVEL, DN 75 MM X 2 1/2 , INSTALADO EM RESERVAÇÃO DE ÁGUA DE EDIFICAÇÃO QUE POSSUA RESERVATÓRIO DE FIBRA/FIBROCIMENTO   FORNECIMENTO E INSTALAÇÃO. AF_06/2016","UN",1,null,null,0,""]
["S",3,"S",0,1,5,3,0,0,0,0,"","Serviço","Serviço","-","SINAPI",89613,"ADAPTADOR CURTO COM BOLSA E ROSCA PARA REGISTRO, PVC, SOLDÁVEL, DN 75MM X 2.1/2\u0094, INSTALADO EM PRUMADA DE ÁGUA - FORNECIMENTO E INSTALAÇÃO. AF_12/2014","UN",2,null,null,0,"Referência: AGETOP - 81071"]
["S",3,"S",0,1,5,3,0,0,0,0,"","Serviço","Serviço","-","SINAPI",94499,"REGISTRO DE GAVETA BRUTO, LATÃO, ROSCÁVEL, 2 1/2\u0094, INSTALADO EM RESERVAÇÃO DE ÁGUA DE EDIFICAÇÃO QUE POSSUA RESERVATÓRIO DE FIBRA/FIBROCIMENTO \u0096 FORNECIMENTO E INSTALAÇÃO. AF_06/2016","UN",1,null,null,0,"Referência: AGETOP - 80910"]
[{"$f":"CHOOSE(1+LOG(1+2*(ORÇAMENTO.Nivel=\"Nível 1\")+4*(ORÇAMENTO.Nivel=\"Nível 2\")+8*(ORÇAMENTO.Nivel=\"Nível 3\")+16*(ORÇAMENTO.Nivel=\"Nível 4\")+32*(ORÇAMENTO.Nivel=\"Serviço\"),2),0,1,2,3,4,\"S\")","v":2},{"$f":"IF(OR(C133=\"s\",C133=0),OFFSET(B133,-1,0),C133)","v":2},{"$f":"IF(OFFSET(C133,-1,0)=\"L\",1,IF(OFFSET(C133,-1,0)=1,2,IF(OR(A133=\"s\",A133=0),\"S\",IF(AND(OFFSET(C133,-1,0)=2,A133=4),3,IF(AND(OR(OFFSET(C133,-1,0)=\"s\",OFFSET(C133,-1,0)=0),A133<>\"s\",A133>OFFSET(B133,-1,0)),OFFSET(B133,-1,0),A133)))))","v":2},{"$f":"IF(OR(C133=\"S\",C133=0),0,IF(ISERROR(K133),J133,SMALL(J133:K133,1)))","v":27},{"$f":"IF($C133=1,OFFSET(E133,-1,0)+1,OFFSET(E133,-1,0))","v":1},{"$f":"IF($C133=1,0,IF($C133=2,OFFSET(F133,-1,0)+1,OFFSET(F133,-1,0)))","v":6},{"$f":"IF(AND($C133<=2,$C133<>0),0,IF($C133=3,OFFSET(G133,-1,0)+1,OFFSET(G133,-1,0)))","v":0},{"$f":"IF(AND($C133<=3,$C133<>0),0,IF($C133=4,OFFSET(H133,-1,0)+1,OFFSET(H133,-1,0)))","v":0},{"$f":"IF(AND($C133<=4,$C133<>0),0,IF(AND($C133=\"S\",$W133>0),OFFSET(I133,-1,0)+1,OFFSET(I133,-1,0)))","v":0},86,27,"","Nível 2","Nível 2","-",null,null,"INSTALAÇÕES ESPECIAIS","-",null,null,null,0,""]
[3,3,3,26,1,6,1,0,0,26,56,"","Nível 3","Nível 3","-","SINAPI",null,"CENTRAL DE GÁS","-",null,null,null,0,""]
["S",3,"S",0,1,6,1,0,0,0,0,"","Serviço","Serviço","-","AGETOP",91007,"CENTRAL DE GÁS PADRÃO AGETOP SEM INSTALAÇÕES (1+1 CILINDRO 45 KG)","Un    ",1,null,null,0,""]
["S",3,"S",0,1,6,1,0,0,0,0,"","Serviço","Serviço","-","AGETOP",91023,"UNIÃO S/BRONZE PRETA 3/4\" NPT 300 LBS","Un    ",3,null,null,0,""]
["S",3,"S",0,1,6,1,0,0,0,0,"","Serviço","Serviço","-","COMPOSIÇÃO","COMP 382_SEE","TE DE REDUCAO DE FERRO GALVANIZADO, COM ROSCA BSP, DE 3/4\" X 1/2\"","UN ",1,null,null,0,""]
["S",3,"S",0,1,6,1,0,0,0,0,"","Serviço","Serviço","-","COMPOSIÇÃO","COMP 383_SEE","BUCHA DE REDUCAO DE FERRO GALVANIZADO, COM ROSCA BSP, DE 1/2\" X 1/4\"","UN ",3,null,null,0,""]
["S",3,"S",0,1,6,1,0,0,0,0,"","Serviço","Serviço","-","AGETOP",91021,"LUVA GALVANIZADO DE REDUÇÃO 3/4\" X 1/2\" (GÁS)","Un    ",2,null,null,0,""]
["S",3,"S",0,1,6,1,0,0,0,0,"","Serviço","Serviço","-","SINAPI",92692,"NIPLE, EM FERRO GALVANIZADO, CONEXÃO ROSQUEADA, DN 15 (1/2\"), INSTALADO EM RAMAIS E SUB-RAMAIS DE GÁS - FORNECIMENTO E INSTALAÇÃO. AF_12/2015","UN",6,null,null,0,""]
["S",3,"S",0,1,6,1,0,0,0,0,"","Serviço","Serviço","-","AGETOP",91031,"NIPLE DUPLO 300 PSI 3/4\"","Un    ",6,null,null,0,""]
["S",3,"S",0,1,6,1,0,0,0,0,"","Serviço","Serviço","-","COMPOSIÇÃO","COMP 212_SEE","NIPLE DE REDUÇÃO 1/2\" X 1/4\" BSP","UN ",4,null,null,0,""]
["S",3,"S",0,1,6,1,0,0,0,0,"","Serviço","Serviço","-","COMPOSIÇÃO","COMP 213_SEE","NIPLE DE REDUÇÃO 3/4\" X 1/2\" BSP","UN ",4,null,null,0,""]
["S",3,"S",0,1,6,1,0,0,0,0,"","Serviço","Serviço","-","SINAPI",92688,"TUBO DE AÇO GALVANIZADO COM COSTURA, CLASSE MÉDIA, CONEXÃO ROSQUEADA, DN 20 (3/4\"), INSTALADO EM RAMAIS E SUB-RAMAIS DE GÁS - FORNECIMENTO E INSTALAÇÃO. AF_12/2015","M",12,null,null,0,""]
["S",3,"S",0,1,6,1,0,0,0,0,"","Serviço","Serviço","-","SINAPI",92701,"JOELHO 90 GRAUS, EM FERRO GALVANIZADO, CONEXÃO ROSQUEADA, DN 20 (3/4\"), INSTALADO EM RAMAIS E SUB-RAMAIS DE GÁS - FORNECIMENTO E INSTALAÇÃO. AF_12/2015","UN",7,null,null,0,""]
["S",3,"S",0,1,6,1,0,0,0,0,"","Serviço","Serviço","-","COMPOSIÇÃO","COMP 237_SEE","FITA ANTICORROSIVA","M",5,null,null,0,""]
["S",3,"S",0,1,6,1,0,0,0,0,"","Serviço","Serviço","-","AGETOP",91025,"VÁLVULA ESFERICA LATÃO 3/4\"","Un    ",3,null,null,0,""]
["S",3,"S",0,1,6,1,0,0,0,0,"","Serviço","Serviço","-","COMPOSIÇÃO","COMP 542_SEE","VÁLVULA UGV 3/4\" (S) LATÃO","UN ",2,null,null,0,""]
["S",3,"S",0,1,6,1,0,0,0,0,"","Serviço","Serviço","-","COMPOSIÇÃO","COMP 543_SEE","VÁLVULA UGV 1/2\" (S) LATÃO","UN ",2,null,null,0,""]
["S",3,"S",0,1,6,1,0,0,0,0,"","Serviço","Serviço","-","AGETOP",91029,"VALVULA DE RETENÇÃO LATÃO 1/2\" X 7/16\" NPT","Un    ",2,null,null,0,""]
["S",3,"S",0,1,6,1,0,0,{"$f":"IF(OR($C151=\"S\",$C151=0),0,MATCH(0,OFFSET($D151,1,$C151,ROW($C$497)-ROW($C151)),0))","v":0},{"$f":"IF(OR($C151=\"S\",$C151=0),0,MATCH(OFFSET($D151,0,$C151)+1,OFFSET($D151,1,$C151,ROW($C$497)-ROW($C151)),0))","v":0},"","Serviço","Serviço","-","COMPOSIÇÃO","COMP 211_SEE","REGULADOR DE 2º ESTÁGIO 5KG/H","UN ",2,null,null,0,""]
["S",3,"S",0,1,6,1,0,0,0,0,"","Serviço","Serviço","-","COMPOSIÇÃO","COMP 210_SEE","REGULADOR DE 1º ESTÁGIO 60KG/H MODELO AP-40  COM MANÔMETRO","UN ",1,null,null,0,""]
["S",3,"S",0,1,6,1,0,0,0,0,"","Serviço","Serviço","-","AGETOP",85003,"EXTINTOR PO QUIMICO SECO (6 KG) - CAPACIDADE EXTINTORA 20 BC","Un    ",1,null,null,0,""]
["S",3,"S",0,1,6,1,0,0,0,0,"","Serviço","Serviço","-","COMPOSIÇÃO","COMP 235_SEE","PLACA DE SINALIZAÇÃO EM PVC COD 01 - (300X300) PROIBIDO FUMAR","UN ",2,null,null,0,""]
["S",3,"S",0,1,6,1,0,0,0,0,"","Serviço","Serviço","-","COMPOSIÇÃO","COMP 236_SEE","PLACA DE SINALIZAÇÃO EM PVC COD 06 - (300X300) PERIGO INFLAMÁVEL","UN ",2,null,null,0,""]
["S",3,"S",0,1,6,1,0,0,0,0,"","Serviço","Serviço","-","AGETOP",91043,"BRAÇADEIRA METALICA TIPO \"D\" DIAM. 3/4\"","Un    ",7,null,null,0,""]
["S",3,"S",0,1,6,1,0,0,0,0,"","Serviço","Serviço","-","AGETOP",71863,"PARAFUSO P/BUCHA S-10","Un    ",14,null,null,0,""]
["S",3,"S",0,1,6,1,0,0,0,0,"","Serviço","Serviço","-","AGETOP",70393,"BUCHA DE NYLON S-10","Un    ",14,null,null,0,""]
["S",3,"S",0,1,6,1,0,0,0,0,"","Serviço","Serviço","-","AGETOP",91045,"SUPORTE PARA COLETOR","Un    ",2,null,null,0,""]
[{"$f":"CHOOSE(1+LOG(1+2*(ORÇAMENTO.Nivel=\"Nível 1\")+4*(ORÇAMENTO.Nivel=\"Nível 2\")+8*(ORÇAMENTO.Nivel=\"Nível 3\")+16*(ORÇAMENTO.Nivel=\"Nível 4\")+32*(ORÇAMENTO.Nivel=\"Serviço\"),2),0,1,2,3,4,\"S\")","v":2},2,2,2,1,7,0,0,{"$f":"IF(AND($C160<=4,$C160<>0),0,IF(AND($C160=\"S\",$W160>0),OFFSET(I160,-1,0)+1,OFFSET(I160,-1,0)))","v":0},59,2,"","Nível 2","Nível 2","-",null,null,"ALVENARIAS E DIVISÓRIAS","-",null,null,null,0,""]
["S",2,"S",0,{"$f":"IF($C161=1,OFFSET(E161,-1,0)+1,OFFSET(E161,-1,0))","v":1},{"$f":"IF($C161=1,0,IF($C161=2,OFFSET(F161,-1,0)+1,OFFSET(F161,-1,0)))","v":7},{"$f":"IF(AND($C161<=2,$C161<>0),0,IF($C161=3,OFFSET(G161,-1,0)+1,OFFSET(G161,-1,0)))","v":0},{"$f":"IF(AND($C161<=3,$C161<>0),0,IF($C161=4,OFFSET(H161,-1,0)+1,OFFSET(H161,-1,0)))","v":0},0,0,0,"","Serviço","Serviço","-","SINAPI",87520,"ALVENARIA DE VEDAÇÃO DE BLOCOS CERÂMICOS FURADOS NA HORIZONTAL DE 9X19X19CM (ESPESSURA 9CM) DE PAREDES COM ÁREA LÍQUIDA MAIOR OU IGUAL A 6M² COM VÃOS E ARGAMASSA DE ASSENTAMENTO COM PREPARO MANUAL. AF_06/2014","M2",1.78,null,null,0,"Referência: AGETOP - 100201"]
[2,{"$f":"IF(OR(C162=\"s\",C162=0),OFFSET(B162,-1,0),C162)","v":2},{"$f":"IF(OFFSET(C162,-1,0)=\"L\",1,IF(OFFSET(C162,-1,0)=1,2,IF(OR(A162=\"s\",A162=0),\"S\",IF(AND(OFFSET(C162,-1,0)=2,A162=4),3,IF(AND(OR(OFFSET(C162,-1,0)=\"s\",OFFSET(C162,-1,0)=0),A162<>\"s\",A162>OFFSET(B162,-1,0)),OFFSET(B162,-1,0),A162)))))","v":2},{"$f":"IF(OR(C162=\"S\",C162=0),0,IF(ISERROR(K162),J162,SMALL(J162:K162,1)))","v":3},1,8,0,0,0,57,3,"","Nível 2","Nível 2","-",null,null,"ESTRUTURA DE MADEIRA","-",null,null,null,0,""]
["S",2,"S",0,1,8,0,0,0,0,0,"","Serviço","Serviço","-","AGETOP",140101,"ESTRUTURA-TELHA CERÂMICA V=3 A 7 M. C/FERRAGENS","m2    ",830.82,null,null,0,""]
["S",2,"S",0,1,8,0,0,0,{"$f":"IF(OR($C164=\"S\",$C164=0),0,MATCH(0,OFFSET($D164,1,$C164,ROW($C$497)-ROW($C164)),0))","v":0},{"$f":"IF(OR($C164=\"S\",$C164=0),0,MATCH(OFFSET($D164,0,$C164)+1,OFFSET($D164,1,$C164,ROW($C$497)-ROW($C164)),0))","v":0},"","Serviço","Serviço","-","SINAPI",92541,"TRAMA DE MADEIRA COMPOSTA POR RIPAS, CAIBROS E TERÇAS PARA TELHADOS DE ATÉ 2 ÁGUAS PARA TELHA CERÂMICA CAPA-CANAL, INCLUSO TRANSPORTE VERTICAL. AF_07/2019","M2",249.24,null,null,0,"Referência: AGETOP - 140202"]
[2,2,2,6,1,9,0,0,0,54,6,"","Nível 2","Nível 2","-",null,null,"COBERTURAS","-",null,null,null,0,""]
["S",2,"S",0,1,9,0,0,0,{"$f":"IF(OR($C166=\"S\",$C166=0),0,MATCH(0,OFFSET($D166,1,$C166,ROW($C$497)-ROW($C166)),0))","v":0},{"$f":"IF(OR($C166=\"S\",$C166=0),0,MATCH(OFFSET($D166,0,$C166)+1,OFFSET($D166,1,$C166,ROW($C$497)-ROW($C166)),0))","v":0},"","Serviço","Serviço","-","AGETOP",160421,"MAO DE OBRA PARA COBERTURA C/TELHA COLONIAL PLAN","m2    ",883.43,null,null,0,""]
["S",2,"S",0,1,9,0,0,0,0,0,"","Serviço","Serviço","-","SINAPI",94445,"TELHAMENTO COM TELHA CERÂMICA CAPA-CANAL, TIPO PLAN, COM ATÉ 2 ÁGUAS, INCLUSO TRANSPORTE VERTICAL. AF_07/2019","M2",883.44,null,null,0,"Referência: AGETOP - 160401"]
["S",2,"S",0,1,9,0,0,0,0,0,"","Serviço","Serviço","-","SINAPI",94221,"CUMEEIRA PARA TELHA CERÂMICA EMBOÇADA COM ARGAMASSA TRAÇO 1:2:9 (CIMENTO, CAL E AREIA) PARA TELHADOS COM ATÉ 2 ÁGUAS, INCLUSO TRANSPORTE VERTICAL. AF_07/2019","M",154.41,null,null,0,""]
["S",2,"S",0,1,9,0,0,0,{"$f":"IF(OR($C169=\"S\",$C169=0),0,MATCH(0,OFFSET($D169,1,$C169,ROW($C$497)-ROW($C169)),0))","v":0},{"$f":"IF(OR($C169=\"S\",$C169=0),0,MATCH(OFFSET($D169,0,$C169)+1,OFFSET($D169,1,$C169,ROW($C$497)-ROW($C169)),0))","v":0},"","Serviço","Serviço","-","SINAPI",94224,"EMBOÇAMENTO COM ARGAMASSA TRAÇO 1:2:9 (CIMENTO, CAL E AREIA). AF_07/2019","M",313.29000000000002,null,null,0,"Referência: AGETOP - 160403"]
["S",2,"S",0,1,9,0,0,0,0,0,"","Serviço","Serviço","-","AGETOP",160600,"CALHA DE CHAPA GALVANIZADA","m2    ",6.31,null,null,0,""]
[2,2,2,2,1,10,0,0,0,48,2,"","Nível 2","Nível 2","-",null,null,"ESQUADRIAS METÁLICAS","-",null,null,null,0,""]
["S",2,"S",0,1,10,0,0,0,0,0,"","Serviço","Serviço","-","SINAPI","73933/4","PORTA DE FERRO DE ABRIR TIPO BARRA CHATA, COM REQUADRO E GUARNICAO COMPLETA","M2",5.0400000000000009,null,null,0,"Referência: AGETOP - 180501"]
[2,2,2,5,1,11,0,0,0,46,5,"","Nível 2","Nível 2","-",null,null,"REVESTIMENTO DE PAREDE","-",null,null,null,0,""]
[{"$f":"CHOOSE(1+LOG(1+2*(ORÇAMENTO.Nivel=\"Nível 1\")+4*(ORÇAMENTO.Nivel=\"Nível 2\")+8*(ORÇAMENTO.Nivel=\"Nível 3\")+16*(ORÇAMENTO.Nivel=\"Nível 4\")+32*(ORÇAMENTO.Nivel=\"Serviço\"),2),0,1,2,3,4,\"S\")","v":"S"},2,"S",0,1,11,0,0,{"$f":"IF(AND($C174<=4,$C174<>0),0,IF(AND($C174=\"S\",$W174>0),OFFSET(I174,-1,0)+1,OFFSET(I174,-1,0)))","v":0},0,0,"","Serviço","Serviço","-","SINAPI",87904,"CHAPISCO APLICADO EM ALVENARIA (COM PRESENÇA DE VÃOS) E ESTRUTURAS DE CONCRETO DE FACHADA, COM COLHER DE PEDREIRO.  ARGAMASSA TRAÇO 1:3 COM PREPARO MANUAL. AF_06/2014","M2",3.56,null,null,0,"Referência: AGETOP - 200101"]
["S",2,"S",0,{"$f":"IF($C175=1,OFFSET(E175,-1,0)+1,OFFSET(E175,-1,0))","v":1},{"$f":"IF($C175=1,0,IF($C175=2,OFFSET(F175,-1,0)+1,OFFSET(F175,-1,0)))","v":11},{"$f":"IF(AND($C175<=2,$C175<>0),0,IF($C175=3,OFFSET(G175,-1,0)+1,OFFSET(G175,-1,0)))","v":0},{"$f":"IF(AND($C175<=3,$C175<>0),0,IF($C175=4,OFFSET(H175,-1,0)+1,OFFSET(H175,-1,0)))","v":0},0,0,0,"","Serviço","Serviço","-","SINAPI",87547,"MASSA ÚNICA, PARA RECEBIMENTO DE PINTURA, EM ARGAMASSA TRAÇO 1:2:8, PREPARO MECÂNICO COM BETONEIRA 400L, APLICADA MANUALMENTE EM FACES INTERNAS DE PAREDES, ESPESSURA DE 10MM, COM EXECUÇÃO DE TALISCAS. AF_06/2014","M2",3.56,null,null,0,"Referência: AGETOP - 200500"]
["S",2,"S",0,1,11,0,0,0,0,0,"","Serviço","Serviço","-","SINAPI",87273,"REVESTIMENTO CERÂMICO PARA PAREDES INTERNAS COM PLACAS TIPO ESMALTADA EXTRA DE DIMENSÕES 33X45 CM APLICADAS EM AMBIENTES DE ÁREA MAIOR QUE 5 M² NA ALTURA INTEIRA DAS PAREDES. AF_06/2014","M2",237.88,null,null,0,""]
["S",2,"S",0,1,11,0,0,0,{"$f":"IF(OR($C177=\"S\",$C177=0),0,MATCH(0,OFFSET($D177,1,$C177,ROW($C$497)-ROW($C177)),0))","v":0},{"$f":"IF(OR($C177=\"S\",$C177=0),0,MATCH(OFFSET($D177,0,$C177)+1,OFFSET($D177,1,$C177,ROW($C$497)-ROW($C177)),0))","v":0},"","Serviço","Serviço","-","AGETOP",200201,"EMBOÇO (1CI:4 ARML)","m2    ",78.39,null,null,0,""]
[2,2,2,3,1,12,0,0,0,41,3,"","Nível 2","Nível 2","-",null,null,"FORROS","-",null,null,null,0,""]
["S",2,"S",0,1,12,0,0,0,{"$f":"IF(OR($C179=\"S\",$C179=0),0,MATCH(0,OFFSET($D179,1,$C179,ROW($C$497)-ROW($C179)),0))","v":0},{"$f":"IF(OR($C179=\"S\",$C179=0),0,MATCH(OFFSET($D179,0,$C179)+1,OFFSET($D179,1,$C179,ROW($C$497)-ROW($C179)),0))","v":0},"","Serviço","Serviço","-","AGETOP",210461,"FORRO DE PVC SEM ESTRUTURA DE METALON (COM REPINTURA DA ESTRUTURA COM TINTA ALQUÍDICA D.F.)","m2    ",213.16,null,null,0,""]
["S",{"$f":"IF(OR(C180=\"s\",C180=0),OFFSET(B180,-1,0),C180)","v":2},{"$f":"IF(OFFSET(C180,-1,0)=\"L\",1,IF(OFFSET(C180,-1,0)=1,2,IF(OR(A180=\"s\",A180=0),\"S\",IF(AND(OFFSET(C180,-1,0)=2,A180=4),3,IF(AND(OR(OFFSET(C180,-1,0)=\"s\",OFFSET(C180,-1,0)=0),A180<>\"s\",A180>OFFSET(B180,-1,0)),OFFSET(B180,-1,0),A180)))))","v":"S"},{"$f":"IF(OR(C180=\"S\",C180=0),0,IF(ISERROR(K180),J180,SMALL(J180:K180,1)))","v":0},1,12,0,0,0,0,0,"","Serviço","Serviço","-","SINAPI",96116,"FORRO EM RÉGUAS DE PVC, FRISADO, PARA AMBIENTES COMERCIAIS, INCLUSIVE ESTRUTURA DE FIXAÇÃO. AF_05/2017_P","M2",373.82,null,null,0,"Referência: AGETOP - 210460"]
[2,2,2,5,1,13,0,0,0,38,5,"","Nível 2","Nível 2","-",null,null,"REVESTIMENTO DE PISO","-",null,null,null,0,""]
["S",2,"S",0,1,13,0,0,0,0,0,"","Serviço","Serviço","-","SINAPI",87251,"REVESTIMENTO CERÂMICO PARA PISO COM PLACAS TIPO ESMALTADA EXTRA DE DIMENSÕES 45X45 CM APLICADA EM AMBIENTES DE ÁREA MAIOR QUE 10 M2. AF_06/2014","M2",87.77,null,null,0,""]
["S",2,"S",0,1,13,0,0,0,0,0,"","Serviço","Serviço","-","AGETOP",220102,"PISO CONCRETO DESEMPENADO ESPESSURA = 5 CM  1:2,5:3,5","m2    ",430.24,null,null,0,""]
["S",2,"S",0,1,13,0,0,0,0,0,"","Serviço","Serviço","-","AGETOP",220100,"PASSEIO PROTECAO EM CONC.DESEMPEN.5 CM 1:2,5:3,5 ( INCLUSO ESPELHO DE 30CM/ESCAVAÇÃO/REATERRO/APILOAMENTO/ATERRO INTERNO)","m2    ",39.72,null,null,0,""]
["S",2,"S",0,1,13,0,0,0,0,0,"","Serviço","Serviço","-","AGETOP",221126,"PISO DE LADRILHO HIDRÁULICO COLORIDO MODELO TÁTIL ( ALERTA OU DIRECIONAL) SEM LASTRO","m2    ",35.83,null,null,0,""]
[2,2,2,6,1,14,0,0,0,33,6,"","Nível 2","Nível 2","-",null,null,"ADMINISTRAÇÃO","-",null,null,null,0,""]
[3,3,3,3,1,14,1,0,0,5,3,"","Nível 3","Nível 3","-",null,null,"MENSALISTAS","-",null,null,null,0,""]
["S",3,"S",0,1,14,1,0,0,{"$f":"IF(OR($C188=\"S\",$C188=0),0,MATCH(0,OFFSET($D188,1,$C188,ROW($C$497)-ROW($C188)),0))","v":0},{"$f":"IF(OR($C188=\"S\",$C188=0),0,MATCH(OFFSET($D188,0,$C188)+1,OFFSET($D188,1,$C188,ROW($C$497)-ROW($C188)),0))","v":0},"","Serviço","Serviço","-","SINAPI",90778,"ENGENHEIRO CIVIL DE OBRA PLENO COM ENCARGOS COMPLEMENTARES","H",132,null,null,0,"Referência: AGETOP - 250101"]
["S",3,"S",0,1,14,1,0,0,0,0,"","Serviço","Serviço","-","SINAPI",90776,"ENCARREGADO GERAL COM ENCARGOS COMPLEMENTARES","H",660,null,null,0,"Referência: AGETOP - 250103"]
[3,3,3,2,1,14,2,0,0,2,9,"","Nível 3","Nível 3","-",null,null,"LAUDO DE ESTANQUEIDADE","-",null,null,null,0,""]
["S",3,"S",0,1,14,2,0,0,0,0,"","Serviço","Serviço","-","SINAPI",90778,"ENGENHEIRO CIVIL DE OBRA PLENO COM ENCARGOS COMPLEMENTARES","H",16,null,null,0,"Referência: AGETOP - 250101"]
[2,2,2,19,1,15,0,0,0,27,19,"","Nível 2","Nível 2","-",null,null,"PINTURA","-",null,null,null,0,""]
[3,3,3,4,1,15,1,0,0,18,4,"","Nível 3","Nível 3","-",null,null,"ESMALTE SINTÉTICO","-",null,null,null,0,""]
["S",3,"S",0,1,15,1,0,0,0,0,"","Serviço","Serviço","-","AGETOP",260105,"REMOCAO DE PINTURA ANTIGA A OLEO OU ESMALTE","m2    ",544.37,null,null,0,""]
["S",3,"S",0,1,15,1,0,0,0,0,"","Serviço","Serviço","-","SINAPI",88497,"APLICAÇÃO E LIXAMENTO DE MASSA LÁTEX EM PAREDES, DUAS DEMÃOS. AF_06/2014","M2",544.37,null,null,0,"Referência: AGETOP - 261300"]
[{"$f":"CHOOSE(1+LOG(1+2*(ORÇAMENTO.Nivel=\"Nível 1\")+4*(ORÇAMENTO.Nivel=\"Nível 2\")+8*(ORÇAMENTO.Nivel=\"Nível 3\")+16*(ORÇAMENTO.Nivel=\"Nível 4\")+32*(ORÇAMENTO.Nivel=\"Serviço\"),2),0,1,2,3,4,\"S\")","v":"S"},3,"S",0,1,15,1,0,{"$f":"IF(AND($C196<=4,$C196<>0),0,IF(AND($C196=\"S\",$W196>0),OFFSET(I196,-1,0)+1,OFFSET(I196,-1,0)))","v":0},0,0,"","Serviço","Serviço","-","AGETOP",261550,"PINT.ESMALTE SINT.PAREDES - 2 DEM.C/SELADOR","m2    ",1274.3,null,null,0,""]
[3,3,3,2,1,15,2,0,0,14,2,"","Nível 3","Nível 3","-","AGETOP",null,"LÁTEX ACRÍLICA","-",null,null,null,0,""]
["S",3,"S",0,{"$f":"IF($C198=1,OFFSET(E198,-1,0)+1,OFFSET(E198,-1,0))","v":1},{"$f":"IF($C198=1,0,IF($C198=2,OFFSET(F198,-1,0)+1,OFFSET(F198,-1,0)))","v":15},{"$f":"IF(AND($C198<=2,$C198<>0),0,IF($C198=3,OFFSET(G198,-1,0)+1,OFFSET(G198,-1,0)))","v":2},{"$f":"IF(AND($C198<=3,$C198<>0),0,IF($C198=4,OFFSET(H198,-1,0)+1,OFFSET(H198,-1,0)))","v":0},0,0,0,"","Serviço","Serviço","-","SINAPI",88489,"APLICAÇÃO MANUAL DE PINTURA COM TINTA LÁTEX ACRÍLICA EM PAREDES, DUAS DEMÃOS. AF_06/2014","M2",1053.0999999999999,null,null,0,"Referência: AGETOP - 261001"]
[3,3,3,5,1,15,3,0,0,12,5,"","Nível 3","Nível 3","-","AGETOP",null,"EXTERNA","-",null,null,null,0,""]
["S",{"$f":"IF(OR(C200=\"s\",C200=0),OFFSET(B200,-1,0),C200)","v":3},{"$f":"IF(OFFSET(C200,-1,0)=\"L\",1,IF(OFFSET(C200,-1,0)=1,2,IF(OR(A200=\"s\",A200=0),\"S\",IF(AND(OFFSET(C200,-1,0)=2,A200=4),3,IF(AND(OR(OFFSET(C200,-1,0)=\"s\",OFFSET(C200,-1,0)=0),A200<>\"s\",A200>OFFSET(B200,-1,0)),OFFSET(B200,-1,0),A200)))))","v":"S"},{"$f":"IF(OR(C200=\"S\",C200=0),0,IF(ISERROR(K200),J200,SMALL(J200:K200,1)))","v":0},1,15,3,0,0,0,0,"","Serviço","Serviço","-","AGETOP",260104,"REMOCAO DE PINTURA ANTIGA A LATEX","m2    ",357.73,null,null,0,""]
["S",3,"S",0,1,15,3,0,0,0,0,"","Serviço","Serviço","-","AGETOP",261304,"EMASSAMENTO ACRILICO 2 DEMAOS","m2    ",5.76,null,null,0,""]
["S",3,"S",0,1,15,3,0,0,0,0,"","Serviço","Serviço","-","SINAPI",88423,"APLICAÇÃO MANUAL DE PINTURA COM TINTA TEXTURIZADA ACRÍLICA EM PAREDES EXTERNAS DE CASAS, UMA COR. AF_06/2014","M2",715.46,null,null,0,"Referência: AGETOP - 260601"]
["S",3,"S",0,1,15,3,0,0,0,0,"","Serviço","Serviço","-","SINAPI",88489,"APLICAÇÃO MANUAL DE PINTURA COM TINTA LÁTEX ACRÍLICA EM PAREDES, DUAS DEMÃOS. AF_06/2014","M2",572.64,null,null,0,"Referência: AGETOP - 261001"]
[3,3,3,3,1,15,4,0,0,7,3,"","Nível 3","Nível 3","-","AGETOP",null,"ESQUADRIAS EXISTENTES","-",null,null,null,0,""]
["S",3,"S",0,1,15,4,0,0,0,0,"","Serviço","Serviço","-","AGETOP",260105,"REMOCAO DE PINTURA ANTIGA A OLEO OU ESMALTE","m2    ",479.24,null,null,0,""]
["S",3,"S",0,1,15,4,0,0,0,0,"","Serviço","Serviço","-","SINAPI","73924/3","PINTURA ESMALTE FOSCO, DUAS DEMAOS, SOBRE SUPERFICIE METALICA","M2",479.24,null,null,0,"Referência: AGETOP - 261503"]
[3,3,3,2,1,15,5,0,0,4,2,"","Nível 3","Nível 3","-","SINAPI",null,"ESQUADRIAS NOVAS","-",null,null,null,0,""]
["S",3,"S",0,1,15,5,0,0,0,0,"","Serviço","Serviço","-","SINAPI","74145/1","PINTURA ESMALTE FOSCO, DUAS DEMAOS, SOBRE SUPERFICIE METALICA, INCLUSO UMA DEMAO DE FUNDO ANTICORROSIVO. UTILIZACAO DE REVOLVER ( AR-COMPRIMIDO).","M2",21.11,null,null,0,"Referência: AGETOP - 261602"]
[3,3,3,2,1,15,6,0,0,2,{"$error":"#N/A"},"","Nível 3","Nível 3","-","AGETOP",null,"OUTROS","-",null,null,null,0,""]
["S",3,"S",0,1,15,6,0,0,0,0,"","Serviço","Serviço","-","AGETOP",261620,"LETREIRO MÉDIO A GRANDE PORTE EM PAREDE FEITO A PINCEL","m2    ",7.2,null,null,0,""]
[2,2,2,8,1,16,0,0,0,8,276,"","Nível 2","Nível 2","-",null,null,"DIVERSOS","-",null,null,null,0,""]
["S",2,"S",0,1,16,0,0,0,0,0,"","Serviço","Serviço","-","SINAPI",98504,"PLANTIO DE GRAMA EM PLACAS. AF_05/2018","M2",283.38,null,null,0,""]
["S",2,"S",0,1,16,0,0,0,0,0,"","Serviço","Serviço","-","COMPOSIÇÃO","COMP 196_SEE","COMPL. DE MURO DE ALV. DE TIJ. FURADO - 1/2 VEZ - C/ CHP. PEDRISCO - H=0,50 M","M",129.19999999999999,null,null,0,""]
["S",2,"S",0,1,16,0,0,0,0,0,"","Serviço","Serviço","-","AGETOP",270501,"LIMPEZA FINAL DE OBRA - (OBRAS CIVIS)","m2    ",600,null,null,0,""]
["S",2,"S",0,1,16,0,0,0,0,0,"","Serviço","Serviço","-","AGETOP",271417,"CANALETA CONCRETO DESEMPENADO 5 CM PD.AGETOP","m     ",70.38,null,null,0,""]
["S",2,"S",0,1,16,0,0,0,0,0,"","Serviço","Serviço","-","AGETOP",180323,"GRELHA PADRÃO AGETOP DE FERRO CHATO COM BERÇO (ESPAÇAMENTO ENTRE FACES = 1,5CM - NBR 9050 ACESSIBILIDADE)","m2    ",21.11,null,null,0,""]
["S",2,"S",0,1,16,0,0,0,0,0,"","Serviço","Serviço","-","COMPOSIÇÃO","COMP 082_SEE","CORRIMÃO PAREDE - SEDUC","M",23.06,null,null,0,""]
["S",2,"S",0,1,16,0,0,0,0,0,"","Serviço","Serviço","-","COMPOSIÇÃO","COMP 084_SEE","GUARDA-CORPO COM CORRIMÃO - SEDUC","M",5.45,null,null,0,""]
[1,1,1,106,2,0,0,0,0,278,106,"F","Nível 1","Nível 1","2.","SINAPI",null,"IMPLANTAÇÃO","-",null,null,null,0,""]
[2,2,2,2,2,1,0,0,0,105,2,"","Nível 2","Nível 2","-","SINAPI",null,"SERVIÇOS PRELIMINARES","-",null,null,null,0,""]
["S",2,"S",0,2,1,0,0,0,0,0,"","Serviço","Serviço","-","AGETOP",20109,"DEM.PISO CIMENT.SOBRE LASTRO CONC.C/TR.ATE CB. E CARGA","m2    ",239.73,null,null,0,""]
[2,2,2,3,2,2,0,0,0,103,3,"","Nível 2","Nível 2","-","SINAPI",null,"SERVIÇO EM TERRA","-",null,null,null,0,""]
["S",2,"S",0,2,2,0,0,0,0,0,"","Serviço","Serviço","-","AGETOP",41140,"REGULARIZAÇÃO DO TERRENO SEM APILOAMENTO COM TRANSPORTE MANUAL DA TERRA ESCAVADA ","m2    ",239.73,null,null,0,""]
["S",2,"S",0,2,2,0,0,0,0,0,"","Serviço","Serviço","-","AGETOP",40905,"APILOAMENTO MECÂNICO","m2    ",239.73,null,null,0,""]
[2,2,2,51,2,3,0,0,0,{"$f":"IF(OR($C225=\"S\",$C225=0),0,MATCH(0,OFFSET($D225,1,$C225,ROW($C$497)-ROW($C225)),0))","v":100},{"$f":"IF(OR($C225=\"S\",$C225=0),0,MATCH(OFFSET($D225,0,$C225)+1,OFFSET($D225,1,$C225,ROW($C$497)-ROW($C225)),0))","v":51},"","Nível 2","Nível 2","-","SINAPI",null,"INSTALAÇÕES ELÉTRICAS","-",null,null,null,0,""]
[3,3,3,50,2,3,1,0,0,50,{"$error":"#N/A"},"","Nível 3","Nível 3","-","SINAPI",null,"SUBESTAÇÃO 112,5 KVA","-",null,null,null,0,""]
["S",3,"S",0,2,3,1,0,0,0,0,"","Serviço","Serviço","-","AGETOP",71175,"DISJUNTOR TRIPOLAR DE 60 A 100-A","Un    ",2,null,null,0,""]
["S",3,"S",0,2,3,1,0,0,0,0,"","Serviço","Serviço","-","SINAPI",92985,"CABO DE COBRE FLEXÍVEL ISOLADO, 35 MM², ANTI-CHAMA 450/750 V, PARA DISTRIBUIÇÃO - FORNECIMENTO E INSTALAÇÃO. AF_12/2015","M",997.56,null,null,0,""]
["S",3,"S",0,2,3,1,0,0,0,0,"","Serviço","Serviço","-","SINAPI",93009,"ELETRODUTO RÍGIDO ROSCÁVEL, PVC, DN 60 MM (2\") - FORNECIMENTO E INSTALAÇÃO. AF_12/2015","M",199.52,null,null,0,""]
["S",3,"S",0,2,3,1,0,0,0,0,"","Serviço","Serviço","-","AGETOP",70355,"BRACADEIRA METALICA TIPO \"U\" DIAM. 2\"","Un    ",67,null,null,0,""]
["S",3,"S",0,2,3,1,0,0,0,0,"","Serviço","Serviço","-","SINAPI",93014,"LUVA PARA ELETRODUTO, PVC, ROSCÁVEL, DN 60 MM (2\") - FORNECIMENTO E INSTALAÇÃO. AF_12/2015","UN",67,null,null,0,"Referência: AGETOP - 71745"]
["S",3,"S",0,2,3,1,0,0,0,0,"","Serviço","Serviço","-","AGETOP",70647,"CAIXA DE PASSAGEM METÁLICA DE EMBUTIR 30X30X12 CM","Un    ",3,null,null,0,""]
["S",3,"S",0,2,3,1,0,0,0,0,"","Serviço","Serviço","-","SINAPI",6171,"TAMPA DE CONCRETO ARMADO 60X60X5CM PARA CAIXA","UN",3,null,null,0,""]
["S",3,"S",0,2,3,1,0,0,0,0,"","Serviço","Serviço","-","SINAPI",92870,"CAIXA RETANGULAR 4\" X 4\" ALTA (2,00 M DO PISO), METÁLICA, INSTALADA EM PAREDE - FORNECIMENTO E INSTALAÇÃO. AF_12/2015","UN",3,null,null,0,""]
["S",3,"S",0,2,3,1,0,0,0,0,"","Serviço","Serviço","-","AGETOP",71861,"PARAFUSO P/BUCHA S-6","Un    ",100,null,null,0,""]
["S",3,"S",0,2,3,1,0,0,0,0,"","Serviço","Serviço","-","AGETOP",70391,"BUCHA DE NYLON S-6","Un    ",100,null,null,0,""]
["S",3,"S",0,2,3,1,0,0,0,0,"","Serviço","Serviço","-","AGETOP",70386,"BRAÇO C AÇO GALVANIZADO , CONFORME NTD-17","un    ",1,null,null,0,""]
["S",3,"S",0,2,3,1,0,0,0,0,"","Serviço","Serviço","-","SINAPI","73767/2","ALCA PRE-FORMADA DISTRIBUIÇÃO EM  ACO RECOBERTO COM ALUMINIO PARA CABO 25MM2, ENCAPADO. FORNECIMENTO E INSTALAÇÃO.","UN",1,null,null,0,""]
["S",3,"S",0,2,3,1,0,0,0,0,"","Serviço","Serviço","-","SINAPI","73767/1","GRAMPO PARALELO EM ALUMINIO FUNDIDO OU ESTRUDADO DE 2 PARAFUSOS, PARA CABO DE 6 A 50 MM2, PASTA ANTIOXIDANTE. FORNEC E INSTALAÇÃO.","UN",3,null,null,0,""]
["S",3,"S",0,2,3,1,0,0,0,0,"","Serviço","Serviço","-","SINAPI",83377,"CONECTOR DE PARAFUSO FENDIDO EM LIGA DE COBRE COM SEPARADOR DE CABOS PARA CABO 50 MM2 - FORNECIMENTO E INSTALACAO","UN",6,null,null,0,""]
["S",3,"S",0,2,3,1,0,0,0,0,"","Serviço","Serviço","-","SINAPI",72263,"TERMINAL OU CONECTOR DE PRESSAO - PARA CABO 50MM2 - FORNECIMENTO E INSTALACAO","UN",1,null,null,0,""]
["S",3,"S",0,2,3,1,0,0,0,0,"","Serviço","Serviço","-","AGETOP",71833,"PARA RAIOS DISTRIBUIDOR POLIMÉRICO ÓXIDO DE ZINCO S/CENTELHADOR C/ DESLIGAMENTO AUTOMÁTICO 15KV,10KA","Un    ",3,null,null,0,""]
["S",3,"S",0,2,3,1,0,0,0,0,"","Serviço","Serviço","-","SINAPI",88544,"ARMACAO SECUNDARIA OU REX COMPLETA PARA DUAS LINHAS-FORNECIMENTO E INSTALACAO.","UN",1,null,null,0,""]
["S",3,"S",0,2,3,1,0,0,0,0,"","Serviço","Serviço","-","COMPOSIÇÃO","COMP 046_SEE","CAPUZ PARA PROTEÇÃO DOS PARA RAIOS","UN ",3,null,null,0,""]
["S",3,"S",0,2,3,1,0,0,0,0,"","Serviço","Serviço","-","COMPOSIÇÃO","COMP 047_SEE","CAPUZ DE PROTEÇÃO PARA BUCHA DE TRANSFORMADOR","UN ",3,null,null,0,""]
["S",3,"S",0,2,3,1,0,0,0,0,"","Serviço","Serviço","-","COMPOSIÇÃO","COMP 048_SEE","HASTE ROSQUEADA \"TIRANTE\" 3/8\"","M",0.5,null,null,0,""]
["S",3,"S",0,2,3,1,0,0,0,0,"","Serviço","Serviço","-","COMPOSIÇÃO","COMP 049_SEE","PORCA SEXTAVADA 3/8\"","UN ",8,null,null,0,""]
["S",3,"S",0,2,3,1,0,0,0,0,"","Serviço","Serviço","-","SINAPI","73781/2","ISOLADOR DE PINO TP HI-POT CILINDRICO CLASSE 15KV. FORNECIMENTO E INSTALACAO.","UN",3,null,null,0,""]
["S",3,"S",0,2,3,1,0,0,0,0,"","Serviço","Serviço","-","SINAPI","73781/3","ISOLADOR DE SUSPENSAO (DISCO) TP CAVILHA CLASSE 15KV - 6''. FORNECIMENTO E INSTALACAO.","UN",1,null,null,0,""]
["S",3,"S",0,2,3,1,0,0,0,0,"","Serviço","Serviço","-","AGETOP",70252,"ARRUELA LISA D=5/16\"","Un    ",8,null,null,0,""]
["S",3,"S",0,2,3,1,0,0,0,0,"","Serviço","Serviço","-","AGETOP",70695,"CAIXA METÁLICA PARA PROTEÇÃO GERAL 580X500X216MM ATÉ 175A","Un    ",1,null,null,0,""]
["S",3,"S",0,2,3,1,0,0,0,0,"","Serviço","Serviço","-","AGETOP",70695,"CAIXA METÁLICA PARA PROTEÇÃO GERAL 580X500X216MM ATÉ 175A","Un    ",1,null,null,0,""]
["S",3,"S",0,2,3,1,0,0,0,0,"","Serviço","Serviço","-","AGETOP",70725,"CAIXA METÁLICA PARA T.C. 580X500X216MM - ATÉ 175A","Un    ",1,null,null,0,""]
["S",3,"S",0,2,3,1,0,0,0,0,"","Serviço","Serviço","-","SINAPI",93205,"CINTA DE AMARRAÇÃO DE ALVENARIA MOLDADA IN LOCO COM UTILIZAÇÃO DE BLOCOS CANALETA. AF_03/2016","M",6,null,null,0,""]
["S",3,"S",0,2,3,1,0,0,0,0,"","Serviço","Serviço","-","AGETOP",71268,"ELO FUSÍVEL 6 K","Un    ",3,null,null,0,""]
["S",3,"S",0,2,3,1,0,0,0,0,"","Serviço","Serviço","-","AGETOP",71186,"DISPOSITIVO DE PROTEÇÃO CONTRA SURTOS (D.P.S.) 275V DE 90KA","Un    ",3,null,null,0,""]
["S",3,"S",0,2,3,1,0,0,{"$f":"IF(OR($C257=\"S\",$C257=0),0,MATCH(0,OFFSET($D257,1,$C257,ROW($C$497)-ROW($C257)),0))","v":0},{"$f":"IF(OR($C257=\"S\",$C257=0),0,MATCH(OFFSET($D257,0,$C257)+1,OFFSET($D257,1,$C257,ROW($C$497)-ROW($C257)),0))","v":0},"","Serviço","Serviço","-","AGETOP",71320,"FITA DE AUTO FUSAO, ROLO DE 2,00 M","Un    ",5,null,null,0,""]
["S",3,"S",0,2,3,1,0,0,0,0,"","Serviço","Serviço","-","AGETOP",70771,"CANTONEIRA AUXILIAR PARA BRAÇO TIPO C","un    ",3,null,null,0,""]
["S",3,"S",0,2,3,1,0,0,0,0,"","Serviço","Serviço","-","SINAPI",93022,"CURVA 90 GRAUS PARA ELETRODUTO, PVC, ROSCÁVEL, DN 75 MM (2 1/2\") - FORNECIMENTO E INSTALAÇÃO. AF_12/2015","UN",2,null,null,0,""]
["S",3,"S",0,2,3,1,0,0,0,0,"","Serviço","Serviço","-","AGETOP",72329,"SAPATILHA DE AÇO GALVANIZADO PARA POSTE COM TRANSFORMADOR","un    ",3,null,null,0,""]
["S",3,"S",0,2,3,1,0,0,0,0,"","Serviço","Serviço","-","AGETOP",71795,"OLHAL PARA PARAFUSO","un    ",3,null,null,0,""]
["S",3,"S",0,2,3,1,0,0,0,0,"","Serviço","Serviço","-","AGETOP",71761,"MURETA MEDIÇÃO ALVEN. 1 1/2 V.(35CM) REBOC.C/PINTURA ACRÍL. E LAJE CONC. 20MPA MALHA 8.0MM CADA 10CM REVEST.C/ARGAMASSA 1:3 C/ IMPERMEABILIZANTE","m2    ",1,null,null,0,""]
["S",3,"S",0,2,3,1,0,0,0,0,"","Serviço","Serviço","-","AGETOP",71776,"NIPLE METALICO Fo.Zo. DIAMETRO 2.1/2\"","Un    ",2,null,null,0,""]
["S",3,"S",0,2,3,1,0,0,0,0,"","Serviço","Serviço","-","AGETOP",71791,"NIPLE DUPLO FERRO GALVANIZADO 2\"","Un    ",1,null,null,0,""]
["S",3,"S",0,2,3,1,0,0,0,0,"","Serviço","Serviço","-","SINAPI",73624,"SUPORTE PARA TRANSFORMADOR EM POSTE DE CONCRETO CIRCULAR","UN",2,null,null,0,""]
["S",3,"S",0,2,3,1,0,0,0,0,"","Serviço","Serviço","-","AGETOP",72060,"POSTE DE CONCRETO SC 11/400 - SEM FUNDAÇÃO/CONCRETO","Un    ",1,null,null,0,""]
["S",3,"S",0,2,3,1,0,0,0,0,"","Serviço","Serviço","-","AGETOP",72000,"POSTE - ENGASTAMENTO SIMPLES PARA POSTE DE CONCRETO SEÇÃO CIRCULAR","m3    ",0.2,null,null,0,""]
["S",3,"S",0,2,3,1,0,0,0,0,"","Serviço","Serviço","-","SINAPI",72263,"TERMINAL OU CONECTOR DE PRESSAO - PARA CABO 50MM2 - FORNECIMENTO E INSTALACAO","UN",3,null,null,0,""]
["S",3,"S",0,2,3,1,0,0,0,0,"","Serviço","Serviço","-","AGETOP",72535,"TERMINAL DE PRESSAO 70 MMM2","Un    ",2,null,null,0,""]
["S",3,"S",0,2,3,1,0,0,0,0,"","Serviço","Serviço","-","AGETOP",72528,"TERMINAL DE PRESSAO 35 MM2","Un    ",5,null,null,0,""]
["S",3,"S",0,2,3,1,0,0,0,0,"","Serviço","Serviço","-","AGETOP",72518,"TERMINAL DE PRESSAO 10 MM2","Un    ",1,null,null,0,""]
["S",3,"S",0,2,3,1,0,0,0,0,"","Serviço","Serviço","-","AGETOP",72550,"TERMINAL DE PRESSAO 150 MM2","Un    ",10,null,null,0,""]
["S",3,"S",0,2,3,1,0,0,0,0,"","Serviço","Serviço","-","SINAPI","73857/2","TRANSFORMADOR DISTRIBUICAO  112,5KVA TRIFASICO 60HZ CLASSE 15KV IMERSO EM ÓLEO MINERAL FORNECIMENTO E INSTALACAO","UN",1,null,null,0,""]
["S",3,"S",0,2,3,1,0,0,0,0,"","Serviço","Serviço","-","AGETOP",72630,"TRILHO OU SUPORTE P/BORNE TERMINAL","M     ",0.2,null,null,0,""]
["S",3,"S",0,2,3,1,0,0,0,0,"","Serviço","Serviço","-","AGETOP",72080,"POSTE/TRAFO - CAMINHÃO MUNCK 12 TON. (MÍNIMO 4H/DIA)","H     ",8,null,null,0,""]
[2,2,2,8,2,4,0,0,0,49,8,"","Nível 2","Nível 2","-","SINAPI",null,"INSTALAÇÕES HIDROSSANITÁRIAS","-",null,null,null,0,""]
[3,3,3,7,2,4,1,0,0,7,{"$error":"#N/A"},"","Nível 3","Nível 3","-","SINAPI",null,"ALIMENTAÇÃO DO RESERVATÓRIO","-",null,null,null,0,""]
["S",3,"S",0,2,4,1,0,0,0,0,"","Serviço","Serviço","-","SINAPI",89447,"TUBO, PVC, SOLDÁVEL, DN 32MM, INSTALADO EM PRUMADA DE ÁGUA - FORNECIMENTO E INSTALAÇÃO. AF_12/2014","M",20,null,null,0,""]
["S",3,"S",0,2,4,1,0,0,0,0,"","Serviço","Serviço","-","SINAPI",94495,"REGISTRO DE GAVETA BRUTO, LATÃO, ROSCÁVEL, 1\u0094, INSTALADO EM RESERVAÇÃO DE ÁGUA DE EDIFICAÇÃO QUE POSSUA RESERVATÓRIO DE FIBRA/FIBROCIMENTO \u0096 FORNECIMENTO E INSTALAÇÃO. AF_06/2016","UN",1,null,null,0,"Referência: AGETOP - 80903"]
["S",3,"S",0,2,4,1,0,0,0,0,"","Serviço","Serviço","-","SINAPI",94709,"ADAPTADOR COM FLANGES LIVRES, PVC, SOLDÁVEL, DN 32 MM X 1 , INSTALADO EM RESERVAÇÃO DE ÁGUA DE EDIFICAÇÃO QUE POSSUA RESERVATÓRIO DE FIBRA/FIBROCIMENTO   FORNECIMENTO E INSTALAÇÃO. AF_06/2016","UN",1,null,null,0,"Referência: AGETOP - 81042"]
["S",3,"S",0,2,4,1,0,0,0,0,"","Serviço","Serviço","-","SINAPI",89553,"ADAPTADOR CURTO COM BOLSA E ROSCA PARA REGISTRO, PVC, SOLDÁVEL, DN 32MM X 1\u0094, INSTALADO EM PRUMADA DE ÁGUA - FORNECIMENTO E INSTALAÇÃO. AF_12/2014","UN",2,null,null,0,"Referência: AGETOP - 81067"]
["S",3,"S",0,2,4,1,0,0,0,0,"","Serviço","Serviço","-","SINAPI",89492,"JOELHO 90 GRAUS, PVC, SOLDÁVEL, DN 32MM, INSTALADO EM PRUMADA DE ÁGUA - FORNECIMENTO E INSTALAÇÃO. AF_12/2014","UN",6,null,null,0,""]
["S",3,"S",0,2,4,1,0,0,0,0,"","Serviço","Serviço","-","SINAPI",89541,"LUVA, PVC, SOLDÁVEL, DN 32MM, INSTALADO EM PRUMADA DE ÁGUA - FORNECIMENTO E INSTALAÇÃO. AF_12/2014","UN",3,null,null,0,""]
[2,2,2,39,2,5,0,0,0,41,39,"","Nível 2","Nível 2","-","SINAPI",null,"INSTALAÇÕES ESPECIAIS","-",null,null,null,0,""]
[3,3,3,38,2,5,1,0,0,38,{"$error":"#N/A"},"","Nível 3","Nível 3","-","SINAPI",null,"INCÊNDIO","-",null,null,null,0,""]
["S",3,"S",0,2,5,1,0,0,0,0,"","Serviço","Serviço","-","AGETOP",72338,"SIRENE METALICA ALCANCE 500 M","Un    ",1,null,null,0,""]
["S",3,"S",0,2,5,1,0,0,0,0,"","Serviço","Serviço","-","AGETOP",81882,"RES.METALICO TAÇA AÇO PATINÁVEL-V=15M3-COL.SEC.H=6M+FUNDAÇÃO+LOGOTIPO","Un    ",1,null,null,0,""]
["S",3,"S",0,2,5,1,0,0,0,0,"","Serviço","Serviço","-","AGETOP",80910,"REGISTRO DE GAVETA BRUTO DIAMETRO 2.1/2\"","Un    ",2,null,null,0,""]
["S",3,"S",0,2,5,1,0,0,{"$f":"IF(OR($C289=\"S\",$C289=0),0,MATCH(0,OFFSET($D289,1,$C289,ROW($C$497)-ROW($C289)),0))","v":0},{"$f":"IF(OR($C289=\"S\",$C289=0),0,MATCH(OFFSET($D289,0,$C289)+1,OFFSET($D289,1,$C289,ROW($C$497)-ROW($C289)),0))","v":0},"","Serviço","Serviço","-","AGETOP",82379,"TUBO FERRO GALVANIZADO DIAM.2.1/2\"","m     ",252,null,null,0,""]
["S",3,"S",0,2,5,1,0,0,0,0,"","Serviço","Serviço","-","AGETOP",85003,"EXTINTOR PO QUIMICO SECO (6 KG) - CAPACIDADE EXTINTORA 20 BC","Un    ",2,null,null,0,""]
["S",3,"S",0,2,5,1,0,0,0,0,"","Serviço","Serviço","-","AGETOP",85006,"EXTINTOR MULTI USO EM PO A B C (6 KG) - CAPACIDADE EXTINTORA 3A 20BC","un    ",6,null,null,0,""]
["S",3,"S",0,2,5,1,0,0,0,0,"","Serviço","Serviço","-","AGETOP",85011,"CAIXA DE INCÊNDIO METÁLICA COM SUPORTE PARA MANGUEIRA, TAMPA E MURETA 17X60X90 CM C/PINTURA","Un    ",5,null,null,0,""]
["S",3,"S",0,2,5,1,0,0,0,0,"","Serviço","Serviço","-","AGETOP",85017,"MANGUEIRA DE INCÊNDIO D.I. = 38 MM TIPO 2 COMP. = 15 M","CJ    ",10,null,null,0,""]
["S",3,"S",0,2,5,1,0,0,0,0,"","Serviço","Serviço","-","AGETOP",85025,"ESGUICHO REGULÁVEL 1.1/2\"","Un    ",5,null,null,0,""]
["S",3,"S",0,2,5,1,0,0,0,0,"","Serviço","Serviço","-","AGETOP",85027,"ADAPTADOR P/ENGATE STORZ 2.1/2\" X 1.1/2\"","Un    ",6,null,null,0,""]
["S",3,"S",0,2,5,1,0,0,0,0,"","Serviço","Serviço","-","AGETOP",85031,"REGISTRO GLOBO ANGULAR 2.1/2\"","Un    ",5,null,null,0,""]
["S",3,"S",0,2,5,1,0,0,0,0,"","Serviço","Serviço","-","AGETOP",85035,"TAMPÃO CEGO COM CORRENTE 2.1/2\"","Un    ",6,null,null,0,""]
["S",3,"S",0,2,5,1,0,0,0,0,"","Serviço","Serviço","-","AGETOP",85037,"TANQUE DE PRESSÃO DE 10 L","Un    ",1,null,null,0,""]
["S",3,"S",0,2,5,1,0,0,0,0,"","Serviço","Serviço","-","AGETOP",85039,"PRESSOSTATO 50 A 80 PSI","Un    ",1,null,null,0,""]
["S",3,"S",0,2,5,1,0,0,0,0,"","Serviço","Serviço","-","AGETOP",85041,"MANOMETRO - 0 A 10 KG/CM2","Un    ",1,null,null,0,""]
["S",3,"S",0,2,5,1,0,0,0,0,"","Serviço","Serviço","-","AGETOP",85077,"VÁLVULA DE RETENÇÃO HORIZONTAL 2.1/2\"","Un    ",2,null,null,0,""]
["S",3,"S",0,2,5,1,0,0,0,0,"","Serviço","Serviço","-","COMPOSIÇÃO","COMP 017_SEE","REDUCAO GIRATÓRIA TIPO STORZ LATAO P/ INST. PREDIAL COMBATE A INCENDIO ENGATE RAPIDO 2.1/2\" X 1.1/2\"","UN ",5,null,null,0,""]
["S",3,"S",0,2,5,1,0,0,0,0,"","Serviço","Serviço","-","COMPOSIÇÃO","COMP 018_SEE","CHAVE DUPLA P/ CONEXÕES TIPO STORZ EM LATÃO ENGATE RÁPIDO 1 1/2\" X 2 1/2\"","UN ",5,null,null,0,""]
["S",3,"S",0,2,5,1,0,0,0,0,"","Serviço","Serviço","-","COMPOSIÇÃO","COMP 087_SEE","REGISTRO DE GAVETA COM HASTE ASCENDENTE DE BRONZE 2 1/2\"","UN ",1,null,null,0,""]
["S",3,"S",0,2,5,1,0,0,0,0,"","Serviço","Serviço","-","AGETOP",85056,"TÊ DE FERRO GALVANIZADO 90º X 2 1/2\"","un    ",8,null,null,0,""]
["S",3,"S",0,2,5,1,0,0,0,0,"","Serviço","Serviço","-","COMPOSIÇÃO","COMP 030_SEE","COTOVELO DE FERRO GALV. 90° X 2 1/2\"","UN ",32,null,null,0,""]
["S",3,"S",0,2,5,1,0,0,0,0,"","Serviço","Serviço","-","COMPOSIÇÃO","COMP 077_SEE","UNIAO FERRO GALV C/ASSENTO CONICO BRONZE 2 1/2\"","UN ",6,null,null,0,""]
["S",3,"S",0,2,5,1,0,0,0,0,"","Serviço","Serviço","-","AGETOP",85047,"NIPLE DUPLO FERRO GALVANIZADO 2.1/2\"","Un    ",9,null,null,0,""]
["S",3,"S",0,2,5,1,0,0,0,0,"","Serviço","Serviço","-","COMPOSIÇÃO","COMP 076_SEE","CURVA FERRO GALVANIZADO 45G ROSCA MACHO/FEMEA REF. 2 1/2\"","UN ",1,null,null,0,""]
["S",3,"S",0,2,5,1,0,0,0,0,"","Serviço","Serviço","-","COMPOSIÇÃO","COMP 022_SEE","TAMPÃO FOFO 40X50CM C/INSCRIÇÃO ","UN ",1,null,null,0,""]
["S",3,"S",0,2,5,1,0,0,0,0,"","Serviço","Serviço","-","COMPOSIÇÃO","COMP 024_SEE","SINALIZADOR FOTOLUMINESCENTE PARA EXTINTOR","UN ",8,null,null,0,""]
["S",3,"S",0,2,5,1,0,0,0,0,"","Serviço","Serviço","-","COMPOSIÇÃO","COMP 186_SEE","BOTOEIRA BOMBA DE INCÊNDIO C/ MARTELO CONVENCIONAL/ ANALÓGICA","UN ",1,null,null,0,""]
["S",3,"S",0,2,5,1,0,0,0,0,"","Serviço","Serviço","-","COMPOSIÇÃO","COMP 188_SEE","ACIONADOR MANUAL DE ALARME","UN ",6,null,null,0,""]
["S",3,"S",0,2,5,1,0,0,0,0,"","Serviço","Serviço","-","COMPOSIÇÃO","COMP 190_SEE","CENTRAL DE DETECÇÃO E ALARME DE 40 SETORES COM BATERIA","UN ",1,null,null,0,""]
["S",3,"S",0,2,5,1,0,0,0,0,"","Serviço","Serviço","-","COMPOSIÇÃO","COMP 025_SEE","SINALIZADOR FOTOLUMINESCENTE DE EMERGÊNCIA","UN ",26,null,null,0,""]
["S",3,"S",0,2,5,1,0,0,0,0,"","Serviço","Serviço","-","COMPOSIÇÃO","COMP 277_SEE","MARCAÇÃO NO PISO - 1X1 M PARA EXTINTOR","M2",8,null,null,0,""]
["S",3,"S",0,2,5,1,0,0,0,0,"","Serviço","Serviço","-","AGETOP",71598,"LUMINÁRIA DE EMERGÊNCIA 30 LEDS","un    ",13,null,null,0,""]
["S",3,"S",0,2,5,1,0,0,0,0,"","Serviço","Serviço","-","COMPOSIÇÃO","COMP 040_SEE","CONJUNTO MOTOR-BOMBA ELÉTRICA TRIFÁSICO 380/220 V PARA VZ= 24,33 M³/H, HM= 46,24 M POTÊNCIA= 7,5 CV","UN ",1,null,null,0,""]
["S",3,"S",0,2,5,1,0,0,0,0,"","Serviço","Serviço","-","COMPOSIÇÃO","COMP 546_SEE","BUJÃO DE REBORDO 2.1/2\"","UN ",1,null,null,0,""]
["S",3,"S",0,2,5,1,0,0,0,0,"","Serviço","Serviço","-","COMPOSIÇÃO","COMP 548_SEE","VÁLVULA DE ESFERA BRUTA, METAL, ROSCÁVEL, 2.1/2\" - FORNECIMENTO E INSTALAÇÃO","UN ",1,null,null,0,""]
["S",3,"S",0,2,5,1,0,0,0,0,"","Serviço","Serviço","-","COMPOSIÇÃO","COMP 347_SEE","ADAPTADOR PVC SOLDAVEL, COM FLANGES LIVRES, 75 MM X 2 1/2\", PARA CAIXA D' AGUA","UN ",1,null,null,0,""]
["S",3,"S",0,2,5,1,0,0,0,0,"","Serviço","Serviço","-","AGETOP",70356,"BRACADEIRA METALICA TIPO \"U\" DIAM. 2.1/2\"","Un    ",60,null,null,0,""]
[2,2,2,2,2,6,0,0,0,{"$f":"IF(OR($C323=\"S\",$C323=0),0,MATCH(0,OFFSET($D323,1,$C323,ROW($C$497)-ROW($C323)),0))","v":2},{"$f":"IF(OR($C323=\"S\",$C323=0),0,MATCH(OFFSET($D323,0,$C323)+1,OFFSET($D323,1,$C323,ROW($C$497)-ROW($C323)),0))","v":61},"","Nível 2","Nível 2","-","SINAPI",null,"REVESTIMENTO DE PISO","-",null,null,null,0,""]
["S",2,"S",0,2,6,0,0,0,0,0,"","Serviço","Serviço","-","AGETOP",220102,"PISO CONCRETO DESEMPENADO ESPESSURA = 5 CM  1:2,5:3,5","m2    ",239.73,null,null,0,""]
[1,1,1,172,3,0,0,0,0,{"$f":"IF(OR($C325=\"S\",$C325=0),0,MATCH(0,OFFSET($D325,1,$C325,ROW($C$497)-ROW($C325)),0))","v":172},{"$f":"IF(OR($C325=\"S\",$C325=0),0,MATCH(OFFSET($D325,0,$C325)+1,OFFSET($D325,1,$C325,ROW($C$497)-ROW($C325)),0))","v":{"$error":"#N/A"}},"F","Nível 1","Nível 1","3.","SINAPI",null,"VESTIÁRIO PADRÃO SEDUC 2019","-",null,null,null,0,""]
[2,2,2,2,3,1,0,0,0,171,2,"","Nível 2","Nível 2","-","AGETOP",null,"SERVIÇOS PRELIMINARES","-",null,null,null,0,""]
["S",2,"S",0,3,1,0,0,0,0,0,"","Serviço","Serviço","-","AGETOP",20701,"LOCAÇÃO DA OBRA, EXECUÇÃO DE GABARITO SEM REAPROVEITAMENTO, INCLUSO PINTURA (FACE INTERNA DO RIPÃO 15CM) E PIQUETE COM TESTEMUNHA","m2    ",98.23,null,null,0,""]
[2,2,2,3,3,2,0,0,0,169,3,"","Nível 2","Nível 2","-","SINAPI",null,"TRANSPORTES","-",null,null,null,0,""]
[{"$f":"CHOOSE(1+LOG(1+2*(ORÇAMENTO.Nivel=\"Nível 1\")+4*(ORÇAMENTO.Nivel=\"Nível 2\")+8*(ORÇAMENTO.Nivel=\"Nível 3\")+16*(ORÇAMENTO.Nivel=\"Nível 4\")+32*(ORÇAMENTO.Nivel=\"Serviço\"),2),0,1,2,3,4,\"S\")","v":"S"},2,"S",0,3,2,0,0,{"$f":"IF(AND($C329<=4,$C329<>0),0,IF(AND($C329=\"S\",$W329>0),OFFSET(I329,-1,0)+1,OFFSET(I329,-1,0)))","v":0},0,0,"","Serviço","Serviço","-","SINAPI",72897,"CARGA MANUAL DE ENTULHO EM CAMINHAO BASCULANTE 6 M3","M3",10,null,null,0,""]
["S",2,"S",0,3,2,0,0,0,0,0,"","Serviço","Serviço","-","SINAPI",72900,"TRANSPORTE DE ENTULHO COM CAMINHAO BASCULANTE 6 M3, RODOVIA PAVIMENTADA, DMT 0,5 A 1,0 KM","M3",10,null,null,0,""]
[2,2,2,3,3,3,0,0,0,166,3,"","Nível 2","Nível 2","-","SINAPI",null,"SERVIÇO EM TERRA","-",null,null,null,0,""]
["S",2,"S",0,{"$f":"IF($C332=1,OFFSET(E332,-1,0)+1,OFFSET(E332,-1,0))","v":3},{"$f":"IF($C332=1,0,IF($C332=2,OFFSET(F332,-1,0)+1,OFFSET(F332,-1,0)))","v":3},{"$f":"IF(AND($C332<=2,$C332<>0),0,IF($C332=3,OFFSET(G332,-1,0)+1,OFFSET(G332,-1,0)))","v":0},{"$f":"IF(AND($C332<=3,$C332<>0),0,IF($C332=4,OFFSET(H332,-1,0)+1,OFFSET(H332,-1,0)))","v":0},0,0,0,"","Serviço","Serviço","-","SINAPI",93358,"ESCAVAÇÃO MANUAL DE VALA COM PROFUNDIDADE MENOR OU IGUAL A 1,30 M. AF_03/2016","M3",7,null,null,0,"Referência: AGETOP - 40101"]
["S",2,"S",0,3,3,0,0,0,0,0,"","Serviço","Serviço","-","AGETOP",41002,"APILOAMENTO","m2    ",132.78,null,null,0,""]
[2,2,2,8,3,4,0,0,0,163,8,"","Nível 2","Nível 2","-","SINAPI",null,"FUNDAÇÕES E SONDAGENS","-",null,null,null,0,""]
["S",2,"S",0,3,4,0,0,0,0,0,"","Serviço","Serviço","-","SINAPI",95474,"ALVENARIA DE EMBASAMENTO EM TIJOLOS CERAMICOS MACICOS 5X10X20CM, ASSENTADO  COM ARGAMASSA TRACO 1:2:8 (CIMENTO, CAL E AREIA)","M3",0.4,null,null,0,"Referência: AGETOP - 50201"]
["S",2,"S",0,3,4,0,0,0,0,0,"","Serviço","Serviço","-","SINAPI",98230,"ESTACA BROCA DE CONCRETO, DIÂMETRO DE 30 CM, PROFUNDIDADE DE ATÉ 3 M, ESCAVAÇÃO MANUAL COM TRADO CONCHA, NÃO ARMADA. AF_03/2018","M",49.5,null,null,0,"Referência: AGETOP - 50302"]
["S",2,"S",0,3,4,0,0,0,0,0,"","Serviço","Serviço","-","SINAPI",94963,"CONCRETO FCK = 15MPA, TRAÇO 1:3,4:3,5 (CIMENTO/ AREIA MÉDIA/ BRITA 1)  - PREPARO MECÂNICO COM BETONEIRA 400 L. AF_07/2016","M3",6.81,null,null,0,""]
["S",{"$f":"IF(OR(C338=\"s\",C338=0),OFFSET(B338,-1,0),C338)","v":2},{"$f":"IF(OFFSET(C338,-1,0)=\"L\",1,IF(OFFSET(C338,-1,0)=1,2,IF(OR(A338=\"s\",A338=0),\"S\",IF(AND(OFFSET(C338,-1,0)=2,A338=4),3,IF(AND(OR(OFFSET(C338,-1,0)=\"s\",OFFSET(C338,-1,0)=0),A338<>\"s\",A338>OFFSET(B338,-1,0)),OFFSET(B338,-1,0),A338)))))","v":"S"},{"$f":"IF(OR(C338=\"S\",C338=0),0,IF(ISERROR(K338),J338,SMALL(J338:K338,1)))","v":0},3,4,0,0,0,0,0,"","Serviço","Serviço","-","AGETOP",51026,"LANÇAMENTO/APLICAÇÃO/ADENSAMENTO DE CONCRETO EM FUNDAÇÃO- (O.C.)","m3    ",6.81,null,null,0,""]
["S",2,"S",0,3,4,0,0,0,0,0,"","Serviço","Serviço","-","SINAPI",96545,"ARMAÇÃO DE BLOCO, VIGA BALDRAME OU SAPATA UTILIZANDO AÇO CA-50 DE 8 MM - MONTAGEM. AF_06/2017","KG",60,null,null,0,"Referência: AGETOP - 52004"]
["S",2,"S",0,3,4,0,0,0,0,0,"","Serviço","Serviço","-","SINAPI",96546,"ARMAÇÃO DE BLOCO, VIGA BALDRAME OU SAPATA UTILIZANDO AÇO CA-50 DE 10 MM - MONTAGEM. AF_06/2017","KG",80,null,null,0,"Referência: AGETOP - 52005"]
["S",2,"S",0,3,4,0,0,0,0,0,"","Serviço","Serviço","-","SINAPI",96543,"ARMAÇÃO DE BLOCO, VIGA BALDRAME E SAPATA UTILIZANDO AÇO CA-60 DE 5 MM - MONTAGEM. AF_06/2017","KG",54,null,null,0,"Referência: AGETOP - 52014"]
[2,2,2,8,3,5,0,0,0,155,8,"","Nível 2","Nível 2","-","SINAPI",null,"ESTRUTURA","-",null,null,null,0,""]
["S",2,"S",0,3,5,0,0,0,0,0,"","Serviço","Serviço","-","AGETOP",60208,"FORMA CH.COMPENSADA 12MM-VIGA/PILAR U=3V - (OBRAS CIVIS","m2    ",54.36,null,null,0,""]
["S",2,"S",0,3,5,0,0,0,0,0,"","Serviço","Serviço","-","SINAPI",92778,"ARMAÇÃO DE PILAR OU VIGA DE UMA ESTRUTURA CONVENCIONAL DE CONCRETO ARMADO EM UMA EDIFICAÇÃO TÉRREA OU SOBRADO UTILIZANDO AÇO CA-50 DE 10,0 MM - MONTAGEM. AF_12/2015","KG",207,null,null,0,"Referência: AGETOP - 60305"]
["S",2,"S",0,3,5,0,0,0,0,0,"","Serviço","Serviço","-","SINAPI",92779,"ARMAÇÃO DE PILAR OU VIGA DE UMA ESTRUTURA CONVENCIONAL DE CONCRETO ARMADO EM UMA EDIFICAÇÃO TÉRREA OU SOBRADO UTILIZANDO AÇO CA-50 DE 12,5 MM - MONTAGEM. AF_12/2015","KG",322,null,null,0,""]
["S",2,"S",0,3,5,0,0,0,0,0,"","Serviço","Serviço","-","SINAPI",92775,"ARMAÇÃO DE PILAR OU VIGA DE UMA ESTRUTURA CONVENCIONAL DE CONCRETO ARMADO EM UMA EDIFICAÇÃO TÉRREA OU SOBRADO UTILIZANDO AÇO CA-60 DE 5,0 MM - MONTAGEM. AF_12/2015","KG",246.2,null,null,0,"Referência: AGETOP - 60314"]
["S",2,"S",0,3,5,0,0,0,0,0,"","Serviço","Serviço","-","SINAPI",94964,"CONCRETO FCK = 20MPA, TRAÇO 1:2,7:3 (CIMENTO/ AREIA MÉDIA/ BRITA 1)  - PREPARO MECÂNICO COM BETONEIRA 400 L. AF_07/2016","M3",8.83,null,null,0,""]
["S",2,"S",0,3,5,0,0,0,0,0,"","Serviço","Serviço","-","AGETOP",60802,"LANÇAMENTO/APLICAÇÃO/ADENSAMENTO DE CONCRETO EM ESTRUTURA - (O.C.)","m3    ",8.83,null,null,0,""]
["S",2,"S",0,3,5,0,0,0,0,0,"","Serviço","Serviço","-","SINAPI","74202/1","LAJE PRE-MOLDADA P/FORRO, SOBRECARGA 100KG/M2, VAOS ATE 3,50M/E=8CM, C/LAJOTAS E CAP.C/CONC FCK=20MPA, 3CM, INTER-EIXO 38CM, C/ESCORAMENTO (REAPR.3X) E FERRAGEM NEGATIVA","M2",67,null,null,0,""]
[2,2,2,34,3,6,0,0,0,147,34,"","Nível 2","Nível 2","-","SINAPI",null,"INSTALAÇÕES ELÉTRICAS","-",null,null,null,0,""]
["S",2,"S",0,3,6,0,0,0,0,0,"","Serviço","Serviço","-","AGETOP",70351,"BRACADEIRA METALICA TIPO \"U\" DIAM. 3/4\"","Un    ",5,null,null,0,""]
["S",2,"S",0,3,6,0,0,0,0,0,"","Serviço","Serviço","-","AGETOP",70352,"BRACADEIRA METALICA TIPO \"U\" DIAM. 1\"","Un    ",5,null,null,0,""]
["S",2,"S",0,3,6,0,0,0,0,0,"","Serviço","Serviço","-","AGETOP",70355,"BRACADEIRA METALICA TIPO \"U\" DIAM. 2\"","Un    ",5,null,null,0,""]
["S",2,"S",0,3,6,0,0,0,0,0,"","Serviço","Serviço","-","AGETOP",70421,"BUCHA E ARRUELA METALICA DIAM. 3/4\"","PR    ",25,null,null,0,""]
["S",2,"S",0,3,6,0,0,0,0,0,"","Serviço","Serviço","-","AGETOP",70422,"BUCHA E ARRUELA METALICA DIAM. 1\"","PR    ",10,null,null,0,""]
["S",2,"S",0,3,6,0,0,0,0,0,"","Serviço","Serviço","-","AGETOP",70425,"BUCHA E ARRUELA METALICA DIAM. 2\"","PR    ",5,null,null,0,""]
["S",2,"S",0,3,6,0,0,0,{"$f":"IF(OR($C357=\"S\",$C357=0),0,MATCH(0,OFFSET($D357,1,$C357,ROW($C$497)-ROW($C357)),0))","v":0},{"$f":"IF(OR($C357=\"S\",$C357=0),0,MATCH(OFFSET($D357,0,$C357)+1,OFFSET($D357,1,$C357,ROW($C$497)-ROW($C357)),0))","v":0},"","Serviço","Serviço","-","SINAPI",91927,"CABO DE COBRE FLEXÍVEL ISOLADO, 2,5 MM², ANTI-CHAMA 0,6/1,0 KV, PARA CIRCUITOS TERMINAIS - FORNECIMENTO E INSTALAÇÃO. AF_12/2015","M",170,null,null,0,"Referência: AGETOP - 70581"]
["S",2,"S",0,3,6,0,0,0,0,0,"","Serviço","Serviço","-","SINAPI",91929,"CABO DE COBRE FLEXÍVEL ISOLADO, 4 MM², ANTI-CHAMA 0,6/1,0 KV, PARA CIRCUITOS TERMINAIS - FORNECIMENTO E INSTALAÇÃO. AF_12/2015","M",280,null,null,0,"Referência: AGETOP - 70582"]
["S",2,"S",0,3,6,0,0,0,0,0,"","Serviço","Serviço","-","SINAPI",92984,"CABO DE COBRE FLEXÍVEL ISOLADO, 25 MM², ANTI-CHAMA 0,6/1,0 KV, PARA DISTRIBUIÇÃO - FORNECIMENTO E INSTALAÇÃO. AF_12/2015","M",22,null,null,0,"Referência: AGETOP - 70511"]
["S",2,"S",0,3,6,0,0,0,0,0,"","Serviço","Serviço","-","SINAPI",92986,"CABO DE COBRE FLEXÍVEL ISOLADO, 35 MM², ANTI-CHAMA 0,6/1,0 KV, PARA DISTRIBUIÇÃO - FORNECIMENTO E INSTALAÇÃO. AF_12/2015","M",209,null,null,0,"Referência: AGETOP - 70512"]
["S",2,"S",0,3,6,0,0,0,0,0,"","Serviço","Serviço","-","SINAPI",92868,"CAIXA RETANGULAR 4\" X 2\" MÉDIA (1,30 M DO PISO), METÁLICA, INSTALADA EM PAREDE - FORNECIMENTO E INSTALAÇÃO. AF_12/2015","UN",7,null,null,0,"Referência: AGETOP - 70691"]
["S",2,"S",0,3,6,0,0,0,0,0,"","Serviço","Serviço","-","SINAPI",92867,"CAIXA RETANGULAR 4\" X 2\" ALTA (2,00 M DO PISO), METÁLICA, INSTALADA EM PAREDE - FORNECIMENTO E INSTALAÇÃO. AF_12/2015","UN",12,null,null,0,""]
["S",2,"S",0,3,6,0,0,0,0,0,"","Serviço","Serviço","-","SINAPI",97893,"CAIXA ENTERRADA ELÉTRICA RETANGULAR, EM ALVENARIA COM BLOCOS DE CONCRETO, FUNDO COM BRITA, DIMENSÕES INTERNAS: 0,8X0,8X0,6 M. AF_05/2018","UN",1,null,null,0,""]
["S",2,"S",0,3,6,0,0,0,0,0,"","Serviço","Serviço","-","SINAPI",91902,"CURVA 90 GRAUS PARA ELETRODUTO, PVC, ROSCÁVEL, DN 25 MM (3/4\"), PARA CIRCUITOS TERMINAIS, INSTALADA EM LAJE - FORNECIMENTO E INSTALAÇÃO. AF_12/2015","UN",20,null,null,0,"Referência: AGETOP - 71141"]
["S",2,"S",0,3,6,0,0,0,0,0,"","Serviço","Serviço","-","SINAPI",93653,"DISJUNTOR MONOPOLAR TIPO DIN, CORRENTE NOMINAL DE 10A - FORNECIMENTO E INSTALAÇÃO. AF_04/2016","UN",1,null,null,0,""]
["S",2,"S",0,3,6,0,0,0,0,0,"","Serviço","Serviço","-","SINAPI",93654,"DISJUNTOR MONOPOLAR TIPO DIN, CORRENTE NOMINAL DE 16A - FORNECIMENTO E INSTALAÇÃO. AF_04/2016","UN",1,null,null,0,""]
["S",2,"S",0,3,6,0,0,0,0,0,"","Serviço","Serviço","-","SINAPI",93656,"DISJUNTOR MONOPOLAR TIPO DIN, CORRENTE NOMINAL DE 25A - FORNECIMENTO E INSTALAÇÃO. AF_04/2016","UN",12,null,null,0,""]
["S",2,"S",0,3,6,0,0,0,0,0,"","Serviço","Serviço","-","SINAPI","74130/5","DISJUNTOR TERMOMAGNETICO TRIPOLAR PADRAO NEMA (AMERICANO) 60 A 100A 240V, FORNECIMENTO E INSTALACAO","UN",2,null,null,0,""]
["S",2,"S",0,3,6,0,0,0,0,0,"","Serviço","Serviço","-","AGETOP",71450,"INTERRUPTOR DIFERENCIAL RESIDUAL (D.R.) BIPOLAR DE 25A-30mA","Un    ",12,null,null,0,""]
["S",2,"S",0,3,6,0,0,0,0,0,"","Serviço","Serviço","-","SINAPI",91953,"INTERRUPTOR SIMPLES (1 MÓDULO), 10A/250V, INCLUINDO SUPORTE E PLACA - FORNECIMENTO E INSTALAÇÃO. AF_12/2015","UN",5,null,null,0,"Referência: AGETOP - 71440"]
["S",2,"S",0,3,6,0,0,0,0,0,"","Serviço","Serviço","-","SINAPI",91871,"ELETRODUTO RÍGIDO ROSCÁVEL, PVC, DN 25 MM (3/4\"), PARA CIRCUITOS TERMINAIS, INSTALADO EM PAREDE - FORNECIMENTO E INSTALAÇÃO. AF_12/2015","M",65,null,null,0,"Referência: AGETOP - 71201"]
["S",2,"S",0,3,6,0,0,0,0,0,"","Serviço","Serviço","-","SINAPI",91872,"ELETRODUTO RÍGIDO ROSCÁVEL, PVC, DN 32 MM (1\"), PARA CIRCUITOS TERMINAIS, INSTALADO EM PAREDE - FORNECIMENTO E INSTALAÇÃO. AF_12/2015","M",30,null,null,0,"Referência: AGETOP - 71202"]
["S",2,"S",0,3,6,0,0,0,0,0,"","Serviço","Serviço","-","SINAPI",93009,"ELETRODUTO RÍGIDO ROSCÁVEL, PVC, DN 60 MM (2\") - FORNECIMENTO E INSTALAÇÃO. AF_12/2015","M",15,null,null,0,""]
["S",2,"S",0,3,6,0,0,0,0,0,"","Serviço","Serviço","-","AGETOP",71321,"FITA DE AUTO FUSAO, ROLO E 10,00 MM","Un    ",1,null,null,0,""]
["S",2,"S",0,3,6,0,0,0,0,0,"","Serviço","Serviço","-","AGETOP",71331,"FITA ISOLANTE, ROLO DE 20,00 M","Un    ",10,null,null,0,""]
["S",2,"S",0,3,6,0,0,0,0,0,"","Serviço","Serviço","-","SINAPI",97586,"LUMINÁRIA TIPO CALHA, DE SOBREPOR, COM 2 LÂMPADAS TUBULARES DE 36 W - FORNECIMENTO E INSTALAÇÃO. AF_11/2017","UN",14,null,null,0,""]
["S",2,"S",0,3,6,0,0,0,0,0,"","Serviço","Serviço","-","COMPOSIÇÃO","COMP 387_SEE","LÂMPADA LED TUBULAR 18W ","UN ",28,null,null,0,""]
["S",2,"S",0,3,6,0,0,0,0,0,"","Serviço","Serviço","-","SINAPI",91884,"LUVA PARA ELETRODUTO, PVC, ROSCÁVEL, DN 25 MM (3/4\"), PARA CIRCUITOS TERMINAIS, INSTALADA EM PAREDE - FORNECIMENTO E INSTALAÇÃO. AF_12/2015","UN",25,null,null,0,"Referência: AGETOP - 71741"]
["S",2,"S",0,3,6,0,0,0,0,0,"","Serviço","Serviço","-","SINAPI",91885,"LUVA PARA ELETRODUTO, PVC, ROSCÁVEL, DN 32 MM (1\"), PARA CIRCUITOS TERMINAIS, INSTALADA EM PAREDE - FORNECIMENTO E INSTALAÇÃO. AF_12/2015","UN",10,null,null,0,"Referência: AGETOP - 71742"]
["S",2,"S",0,3,6,0,0,0,0,0,"","Serviço","Serviço","-","SINAPI",93014,"LUVA PARA ELETRODUTO, PVC, ROSCÁVEL, DN 60 MM (2\") - FORNECIMENTO E INSTALAÇÃO. AF_12/2015","UN",5,null,null,0,"Referência: AGETOP - 71745"]
["S",2,"S",0,3,6,0,0,0,0,0,"","Serviço","Serviço","-","SINAPI","74131/5","QUADRO DE DISTRIBUICAO DE ENERGIA DE EMBUTIR, EM CHAPA METALICA, PARA 24 DISJUNTORES TERMOMAGNETICOS MONOPOLARES, COM BARRAMENTO TRIFASICO E NEUTRO, FORNECIMENTO E INSTALACAO","UN",4,null,null,0,""]
["S",2,"S",0,3,6,0,0,0,0,0,"","Serviço","Serviço","-","SINAPI",91996,"TOMADA MÉDIA DE EMBUTIR (1 MÓDULO), 2P+T 10 A, INCLUINDO SUPORTE E PLACA - FORNECIMENTO E INSTALAÇÃO. AF_12/2015","UN",2,null,null,0,"Referência: AGETOP - 72578"]
["S",2,"S",0,3,6,0,0,0,0,0,"","Serviço","Serviço","-","SINAPI",91993,"TOMADA ALTA DE EMBUTIR (1 MÓDULO), 2P+T 20 A, INCLUINDO SUPORTE E PLACA - FORNECIMENTO E INSTALAÇÃO. AF_12/2015","UN",12,null,null,0,"Referência: AGETOP - 72585"]
[2,2,2,71,3,7,0,0,0,113,71,"","Nível 2","Nível 2","-","SINAPI",null,"INSTALAÇÕES HIDROSSANITÁRIAS","-",null,null,null,0,""]
["S",2,"S",0,3,7,0,0,0,0,0,"","Serviço","Serviço","-","AGETOP",81825,"CAIXA DE PASSAGEM 60 X 60 CM SEM TAMPA","Un    ",4,null,null,0,""]
["S",2,"S",0,3,7,0,0,0,0,0,"","Serviço","Serviço","-","AGETOP",81826,"TAMPA EM CONCRETO ARMADO 25 MPA E=5CM PARA A CAIXA DE PASSAGEM 60X60CM","Un    ",4,null,null,0,""]
["S",2,"S",0,3,7,0,0,0,0,0,"","Serviço","Serviço","-","AGETOP",80502,"VASO SANITARIO","Un    ",8,null,null,0,""]
["S",2,"S",0,3,7,0,0,0,0,0,"","Serviço","Serviço","-","AGETOP",80510,"ANEL DE VEDAÇÃO PARA VASO SANITÁRIO","Un    ",8,null,null,0,""]
["S",2,"S",0,3,7,0,0,0,{"$f":"IF(OR($C389=\"S\",$C389=0),0,MATCH(0,OFFSET($D389,1,$C389,ROW($C$497)-ROW($C389)),0))","v":0},{"$f":"IF(OR($C389=\"S\",$C389=0),0,MATCH(OFFSET($D389,0,$C389)+1,OFFSET($D389,1,$C389,ROW($C$497)-ROW($C389)),0))","v":0},"","Serviço","Serviço","-","AGETOP",80512,"TUBO DE DESCIDA PARA CAIXA DE DESCARGA ( LONGO 1 1/4\" )","Un    ",8,null,null,0,""]
["S",2,"S",0,3,7,0,0,0,0,0,"","Serviço","Serviço","-","AGETOP",80518,"VÁLVULA DE DESCARGA COM SISTEMA PASSANTE EM POLÍMERO - OPÇÃO ECONÔMICA ( ALTA SEGURANÇA)","Un    ",8,null,null,0,""]
["S",2,"S",0,3,7,0,0,0,0,0,"","Serviço","Serviço","-","AGETOP",80520,"CONJUNTO DE FIXACAO P/VASO SANITARIO (PAR)","CJ    ",8,null,null,0,""]
["S",2,"S",0,3,7,0,0,0,0,0,"","Serviço","Serviço","-","SINAPI",95544,"PAPELEIRA DE PAREDE EM METAL CROMADO SEM TAMPA, INCLUSO FIXAÇÃO. AF_10/2016","UN",4,null,null,0,""]
[{"$f":"CHOOSE(1+LOG(1+2*(ORÇAMENTO.Nivel=\"Nível 1\")+4*(ORÇAMENTO.Nivel=\"Nível 2\")+8*(ORÇAMENTO.Nivel=\"Nível 3\")+16*(ORÇAMENTO.Nivel=\"Nível 4\")+32*(ORÇAMENTO.Nivel=\"Serviço\"),2),0,1,2,3,4,\"S\")","v":"S"},2,"S",0,3,7,0,0,{"$f":"IF(AND($C393<=4,$C393<>0),0,IF(AND($C393=\"S\",$W393>0),OFFSET(I393,-1,0)+1,OFFSET(I393,-1,0)))","v":0},0,0,"","Serviço","Serviço","-","AGETOP",80532,"PORTA PAPEL HIGIÊNICO EM METAL/ACABAMENTO CROMADO","Un    ",8,null,null,0,""]
["S",2,"S",0,3,7,0,0,0,0,0,"","Serviço","Serviço","-","AGETOP",80590,"CUBA DE LOUCA DE EMBUTIR OVAL MÉDIA ","Un    ",6,null,null,0,""]
["S",2,"S",0,3,7,0,0,0,0,0,"","Serviço","Serviço","-","AGETOP",80550,"FIXACAO P/LAVATORIO (PAR)","PAR   ",6,null,null,0,""]
["S",2,"S",0,{"$f":"IF($C396=1,OFFSET(E396,-1,0)+1,OFFSET(E396,-1,0))","v":3},{"$f":"IF($C396=1,0,IF($C396=2,OFFSET(F396,-1,0)+1,OFFSET(F396,-1,0)))","v":7},{"$f":"IF(AND($C396<=2,$C396<>0),0,IF($C396=3,OFFSET(G396,-1,0)+1,OFFSET(G396,-1,0)))","v":0},{"$f":"IF(AND($C396<=3,$C396<>0),0,IF($C396=4,OFFSET(H396,-1,0)+1,OFFSET(H396,-1,0)))","v":0},0,0,0,"","Serviço","Serviço","-","AGETOP",80556,"LIGAÇÃO FLEXÍVEL PVC DIAM.1/2\" (ENGATE)","Un    ",6,null,null,0,""]
["S",2,"S",0,3,7,0,0,0,0,0,"","Serviço","Serviço","-","SINAPI",86883,"SIFÃO DO TIPO FLEXÍVEL EM PVC 1\u0094 X 1.1/2\u0094 - FORNECIMENTO E INSTALAÇÃO. AF_12/2013","UN",6,null,null,0,""]
["S",2,"S",0,3,7,0,0,0,0,0,"","Serviço","Serviço","-","SINAPI",86915,"TORNEIRA CROMADA DE MESA, 1/2\" OU 3/4\", PARA LAVATÓRIO, PADRÃO MÉDIO - FORNECIMENTO E INSTALAÇÃO. AF_12/2013","UN",6,null,null,0,"Referência: AGETOP - 80570"]
["S",2,"S",0,3,7,0,0,0,0,0,"","Serviço","Serviço","-","SINAPI",86877,"VÁLVULA EM METAL CROMADO 1.1/2\" X 1.1/2\" PARA TANQUE OU LAVATÓRIO, COM OU SEM LADRÃO - FORNECIMENTO E INSTALAÇÃO. AF_12/2013","UN",6,null,null,0,""]
["S",2,"S",0,3,7,0,0,0,0,0,"","Serviço","Serviço","-","SINAPI",9535,"CHUVEIRO ELETRICO COMUM CORPO PLASTICO TIPO DUCHA, FORNECIMENTO E INSTALACAO","UN",12,null,null,0,""]
["S",2,"S",0,3,7,0,0,0,0,0,"","Serviço","Serviço","-","AGETOP",80730,"CABIDE TIPO GANCHO EM LOUÇA","Un    ",12,null,null,0,""]
["S",{"$f":"IF(OR(C402=\"s\",C402=0),OFFSET(B402,-1,0),C402)","v":2},{"$f":"IF(OFFSET(C402,-1,0)=\"L\",1,IF(OFFSET(C402,-1,0)=1,2,IF(OR(A402=\"s\",A402=0),\"S\",IF(AND(OFFSET(C402,-1,0)=2,A402=4),3,IF(AND(OR(OFFSET(C402,-1,0)=\"s\",OFFSET(C402,-1,0)=0),A402<>\"s\",A402>OFFSET(B402,-1,0)),OFFSET(B402,-1,0),A402)))))","v":"S"},{"$f":"IF(OR(C402=\"S\",C402=0),0,IF(ISERROR(K402),J402,SMALL(J402:K402,1)))","v":0},3,7,0,0,0,0,0,"","Serviço","Serviço","-","AGETOP",80740,"MEIA SABONETEIRA EM LOUÇA DE EMBUTIR","Un    ",12,null,null,0,""]
["S",2,"S",0,3,7,0,0,0,0,0,"","Serviço","Serviço","-","SINAPI",89987,"REGISTRO DE GAVETA BRUTO, LATÃO, ROSCÁVEL, 3/4\", COM ACABAMENTO E CANOPLA CROMADOS. FORNECIDO E INSTALADO EM RAMAL DE ÁGUA. AF_12/2014","UN",2,null,null,0,"Referência: AGETOP - 80926"]
["S",2,"S",0,3,7,0,0,0,0,0,"","Serviço","Serviço","-","AGETOP",80927,"REGISTRO DE GAVETA C/CANOPLA DIAMETRO 1\"","Un    ",2,null,null,0,""]
["S",2,"S",0,3,7,0,0,0,0,0,"","Serviço","Serviço","-","SINAPI",94794,"REGISTRO DE GAVETA BRUTO, LATÃO, ROSCÁVEL, 1 1/2\u0094, COM ACABAMENTO E CANOPLA CROMADOS, INSTALADO EM RESERVAÇÃO DE ÁGUA DE EDIFICAÇÃO QUE POSSUA RESERVATÓRIO DE FIBRA/FIBROCIMENTO \u0096 FORNECIMENTO E INSTALAÇÃO. AF_06/2016","UN",6,null,null,0,"Referência: AGETOP - 80929"]
["S",2,"S",0,3,7,0,0,0,0,0,"","Serviço","Serviço","-","AGETOP",80946,"REGISTRO DE PRESSAO C/CANOPLA CROMADA DIAM.3/4\"","Un    ",12,null,null,0,""]
["S",2,"S",0,3,7,0,0,0,0,0,"","Serviço","Serviço","-","SINAPI",89402,"TUBO, PVC, SOLDÁVEL, DN 25MM, INSTALADO EM RAMAL DE DISTRIBUIÇÃO DE ÁGUA - FORNECIMENTO E INSTALAÇÃO. AF_12/2014","M",45,null,null,0,"Referência: AGETOP - 81003"]
["S",2,"S",0,3,7,0,0,0,0,0,"","Serviço","Serviço","-","SINAPI",89447,"TUBO, PVC, SOLDÁVEL, DN 32MM, INSTALADO EM PRUMADA DE ÁGUA - FORNECIMENTO E INSTALAÇÃO. AF_12/2014","M",12,null,null,0,""]
["S",2,"S",0,3,7,0,0,0,0,0,"","Serviço","Serviço","-","SINAPI",89449,"TUBO, PVC, SOLDÁVEL, DN 50MM, INSTALADO EM PRUMADA DE ÁGUA - FORNECIMENTO E INSTALAÇÃO. AF_12/2014","M",42,null,null,0,""]
["S",2,"S",0,3,7,0,0,0,0,0,"","Serviço","Serviço","-","AGETOP",81007,"TUBO SOLDAVEL PVC MARROM DIAMETRO 60 mm (2\")","m     ",12,null,null,0,""]
["S",2,"S",0,3,7,0,0,0,0,0,"","Serviço","Serviço","-","SINAPI",89538,"ADAPTADOR CURTO COM BOLSA E ROSCA PARA REGISTRO, PVC, SOLDÁVEL, DN 25MM X 3/4\u0094, INSTALADO EM PRUMADA DE ÁGUA - FORNECIMENTO E INSTALAÇÃO. AF_12/2014","UN",28,null,null,0,""]
["S",2,"S",0,3,7,0,0,0,0,0,"","Serviço","Serviço","-","AGETOP",81067,"ADAPTAD.SOLD.CURTO C/BOLSA E ROSCA P/REG.32X1\"","Un    ",4,null,null,0,""]
["S",2,"S",0,3,7,0,0,0,0,0,"","Serviço","Serviço","-","SINAPI",89596,"ADAPTADOR CURTO COM BOLSA E ROSCA PARA REGISTRO, PVC, SOLDÁVEL, DN 50MM X 1.1/2\u0094, INSTALADO EM PRUMADA DE ÁGUA - FORNECIMENTO E INSTALAÇÃO. AF_12/2014","UN",24,null,null,0,"Referência: AGETOP - 81069"]
["S",2,"S",0,3,7,0,0,0,0,0,"","Serviço","Serviço","-","SINAPI",89579,"LUVA DE REDUÇÃO, PVC, SOLDÁVEL, DN 50MM X 25MM, INSTALADO EM PRUMADA DE ÁGUA   FORNECIMENTO E INSTALAÇÃO. AF_12/2014","UN",8,null,null,0,""]
["S",2,"S",0,3,7,0,0,0,0,0,"","Serviço","Serviço","-","AGETOP",81184,"BUCHA DE REDUCAO SOLDAVEL LONGA 60 X 50 mm","Un    ",2,null,null,0,""]
["S",2,"S",0,3,7,0,0,0,0,0,"","Serviço","Serviço","-","SINAPI",89481,"JOELHO 90 GRAUS, PVC, SOLDÁVEL, DN 25MM, INSTALADO EM PRUMADA DE ÁGUA - FORNECIMENTO E INSTALAÇÃO. AF_12/2014","UN",20,null,null,0,""]
["S",2,"S",0,3,7,0,0,0,0,0,"","Serviço","Serviço","-","SINAPI",89413,"JOELHO 90 GRAUS, PVC, SOLDÁVEL, DN 32MM, INSTALADO EM RAMAL DE DISTRIBUIÇÃO DE ÁGUA - FORNECIMENTO E INSTALAÇÃO. AF_12/2014","UN",2,null,null,0,"Referência: AGETOP - 81322"]
["S",2,"S",0,3,7,0,0,0,0,0,"","Serviço","Serviço","-","AGETOP",81324,"JOELHO 90 GRAUS SOLDAVEL 50 mm (MARROM)","Un    ",12,null,null,0,""]
["S",2,"S",0,3,7,0,0,0,0,0,"","Serviço","Serviço","-","AGETOP",81360,"JOELHO RED.90 GRAUS SOLD.C/BUCHA LATAO 25X1/2\"","Un    ",18,null,null,0,""]
["S",2,"S",0,3,7,0,0,0,0,0,"","Serviço","Serviço","-","SINAPI",89501,"JOELHO 90 GRAUS, PVC, SOLDÁVEL, DN 50MM, INSTALADO EM PRUMADA DE ÁGUA - FORNECIMENTO E INSTALAÇÃO. AF_12/2014","UN",4,null,null,0,""]
["S",2,"S",0,3,7,0,0,0,{"$f":"IF(OR($C421=\"S\",$C421=0),0,MATCH(0,OFFSET($D421,1,$C421,ROW($C$497)-ROW($C421)),0))","v":0},{"$f":"IF(OR($C421=\"S\",$C421=0),0,MATCH(OFFSET($D421,0,$C421)+1,OFFSET($D421,1,$C421,ROW($C$497)-ROW($C421)),0))","v":0},"","Serviço","Serviço","-","SINAPI",89617,"TE, PVC, SOLDÁVEL, DN 25MM, INSTALADO EM PRUMADA DE ÁGUA - FORNECIMENTO E INSTALAÇÃO. AF_12/2014","UN",4,null,null,0,""]
["S",2,"S",0,3,7,0,0,0,0,0,"","Serviço","Serviço","-","SINAPI",89625,"TE, PVC, SOLDÁVEL, DN 50MM, INSTALADO EM PRUMADA DE ÁGUA - FORNECIMENTO E INSTALAÇÃO. AF_12/2014","UN",18,null,null,0,"Referência: AGETOP - 81405"]
["S",2,"S",0,3,7,0,0,0,0,0,"","Serviço","Serviço","-","AGETOP",81421,"TE REDUCAO 90 GRAUS SOLDAVEL 32 X 25 mm","Un    ",8,null,null,0,""]
["S",2,"S",0,3,7,0,0,0,0,0,"","Serviço","Serviço","-","SINAPI",89627,"TÊ DE REDUÇÃO, PVC, SOLDÁVEL, DN 50MM X 25MM, INSTALADO EM PRUMADA DE ÁGUA - FORNECIMENTO E INSTALAÇÃO. AF_12/2014","UN",2,null,null,0,""]
["S",2,"S",0,3,7,0,0,0,0,0,"","Serviço","Serviço","-","AGETOP",81425,"TE REDUCAO 90 GRAUS SOLDAVEL 50 X 32 mm","Un    ",4,null,null,0,""]
["S",2,"S",0,3,7,0,0,0,0,0,"","Serviço","Serviço","-","AGETOP",81445,"TE RED.SOLD.90GR.BUC.LATAO BOLSA CENT.25X25X1/2\"","Un    ",4,null,null,0,""]
["S",2,"S",0,3,7,0,0,0,0,0,"","Serviço","Serviço","-","AGETOP",81602,"BUCHA DE REDUCAO LONGA DIAM. 50 X 40 MM","Un    ",10,null,null,0,""]
["S",2,"S",0,3,7,0,0,0,0,0,"","Serviço","Serviço","-","AGETOP",81663,"CORPO CX. SIFONADA DIAM. 150 X 150 X 50","Un    ",2,null,null,0,""]
["S",2,"S",0,3,7,0,0,0,0,0,"","Serviço","Serviço","-","AGETOP",81664,"CORPO CX. SIFONADA DIAM. 150 X 185 X 75","Un    ",2,null,null,0,""]
["S",2,"S",0,3,7,0,0,0,0,0,"","Serviço","Serviço","-","AGETOP",81679,"CORPO RALO SIFONADO CONICO DIAM. 100 X 40","Un    ",12,null,null,0,""]
["S",2,"S",0,3,7,0,0,0,0,0,"","Serviço","Serviço","-","AGETOP",81770,"GRELHA QUADRADA BRANCA DIAM. 100 MM","Un    ",2,null,null,0,""]
["S",2,"S",0,3,7,0,0,0,0,0,"","Serviço","Serviço","-","AGETOP",81771,"GRELHA QUADRADA BRANCA DIAM. 150 MM","Un    ",2,null,null,0,""]
["S",2,"S",0,3,7,0,0,0,0,0,"","Serviço","Serviço","-","AGETOP",81885,"TERMINAL DE VENTILACAO DIAMETRO 50 MM","Un    ",5,null,null,0,""]
["S",2,"S",0,3,7,0,0,0,0,0,"","Serviço","Serviço","-","SINAPI",89726,"JOELHO 45 GRAUS, PVC, SERIE NORMAL, ESGOTO PREDIAL, DN 40 MM, JUNTA SOLDÁVEL, FORNECIDO E INSTALADO EM RAMAL DE DESCARGA OU RAMAL DE ESGOTO SANITÁRIO. AF_12/2014","UN",2,null,null,0,""]
["S",2,"S",0,3,7,0,0,0,0,0,"","Serviço","Serviço","-","SINAPI",89806,"JOELHO 45 GRAUS, PVC, SERIE NORMAL, ESGOTO PREDIAL, DN 75 MM, JUNTA ELÁSTICA, FORNECIDO E INSTALADO EM PRUMADA DE ESGOTO SANITÁRIO OU VENTILAÇÃO. AF_12/2014","UN",2,null,null,0,""]
["S",2,"S",0,3,7,0,0,0,0,0,"","Serviço","Serviço","-","SINAPI",89724,"JOELHO 90 GRAUS, PVC, SERIE NORMAL, ESGOTO PREDIAL, DN 40 MM, JUNTA SOLDÁVEL, FORNECIDO E INSTALADO EM RAMAL DE DESCARGA OU RAMAL DE ESGOTO SANITÁRIO. AF_12/2014","UN",6,null,null,0,""]
["S",2,"S",0,3,7,0,0,0,0,0,"","Serviço","Serviço","-","SINAPI",89731,"JOELHO 90 GRAUS, PVC, SERIE NORMAL, ESGOTO PREDIAL, DN 50 MM, JUNTA ELÁSTICA, FORNECIDO E INSTALADO EM RAMAL DE DESCARGA OU RAMAL DE ESGOTO SANITÁRIO. AF_12/2014","UN",10,null,null,0,""]
["S",2,"S",0,3,7,0,0,0,0,0,"","Serviço","Serviço","-","AGETOP",81938,"JOELHO 90 GRAUS DIAMETRO 100 MM","Un    ",8,null,null,0,""]
["S",2,"S",0,3,7,0,0,0,0,0,"","Serviço","Serviço","-","SINAPI",89806,"JOELHO 45 GRAUS, PVC, SERIE NORMAL, ESGOTO PREDIAL, DN 75 MM, JUNTA ELÁSTICA, FORNECIDO E INSTALADO EM PRUMADA DE ESGOTO SANITÁRIO OU VENTILAÇÃO. AF_12/2014","UN",6,null,null,0,""]
["S",2,"S",0,3,7,0,0,0,0,0,"","Serviço","Serviço","-","SINAPI",89785,"JUNÇÃO SIMPLES, PVC, SERIE NORMAL, ESGOTO PREDIAL, DN 50 X 50 MM, JUNTA ELÁSTICA, FORNECIDO E INSTALADO EM RAMAL DE DESCARGA OU RAMAL DE ESGOTO SANITÁRIO. AF_12/2014","UN",10,null,null,0,"Referência: AGETOP - 81970"]
["S",2,"S",0,3,7,0,0,0,0,0,"","Serviço","Serviço","-","SINAPI",89797,"JUNÇÃO SIMPLES, PVC, SERIE NORMAL, ESGOTO PREDIAL, DN 100 X 100 MM, JUNTA ELÁSTICA, FORNECIDO E INSTALADO EM RAMAL DE DESCARGA OU RAMAL DE ESGOTO SANITÁRIO. AF_12/2014","UN",6,null,null,0,"Referência: AGETOP - 81975"]
["S",2,"S",0,3,7,0,0,0,0,0,"","Serviço","Serviço","-","SINAPI",89752,"LUVA SIMPLES, PVC, SERIE NORMAL, ESGOTO PREDIAL, DN 40 MM, JUNTA SOLDÁVEL, FORNECIDO E INSTALADO EM RAMAL DE DESCARGA OU RAMAL DE ESGOTO SANITÁRIO. AF_12/2014","UN",12,null,null,0,"Referência: AGETOP - 82001"]
["S",2,"S",0,3,7,0,0,0,0,0,"","Serviço","Serviço","-","SINAPI",89753,"LUVA SIMPLES, PVC, SERIE NORMAL, ESGOTO PREDIAL, DN 50 MM, JUNTA ELÁSTICA, FORNECIDO E INSTALADO EM RAMAL DE DESCARGA OU RAMAL DE ESGOTO SANITÁRIO. AF_12/2014","UN",12,null,null,0,"Referência: AGETOP - 82002"]
["S",2,"S",0,3,7,0,0,0,0,0,"","Serviço","Serviço","-","SINAPI",89774,"LUVA SIMPLES, PVC, SERIE NORMAL, ESGOTO PREDIAL, DN 75 MM, JUNTA ELÁSTICA, FORNECIDO E INSTALADO EM RAMAL DE DESCARGA OU RAMAL DE ESGOTO SANITÁRIO. AF_12/2014","UN",2,null,null,0,"Referência: AGETOP - 82003"]
["S",2,"S",0,3,7,0,0,0,0,0,"","Serviço","Serviço","-","SINAPI",89778,"LUVA SIMPLES, PVC, SERIE NORMAL, ESGOTO PREDIAL, DN 100 MM, JUNTA ELÁSTICA, FORNECIDO E INSTALADO EM RAMAL DE DESCARGA OU RAMAL DE ESGOTO SANITÁRIO. AF_12/2014","UN",6,null,null,0,"Referência: AGETOP - 82004"]
["S",2,"S",0,3,7,0,0,0,0,0,"","Serviço","Serviço","-","AGETOP",82053,"PORTA GRELHA QUADRADO P/GREL.QUADRADA DIAM. 100 MM","Un    ",2,null,null,0,""]
["S",2,"S",0,3,7,0,0,0,0,0,"","Serviço","Serviço","-","AGETOP",82071,"PORTA GRELHA REDONDO BRANCO DIAM. 150 MM","Un    ",2,null,null,0,""]
["S",2,"S",0,3,7,0,0,0,0,0,"","Serviço","Serviço","-","SINAPI",89557,"REDUÇÃO EXCÊNTRICA, PVC, SERIE R, ÁGUA PLUVIAL, DN 100 X 75 MM, JUNTA ELÁSTICA, FORNECIDO E INSTALADO EM RAMAL DE ENCAMINHAMENTO. AF_12/2014","UN",2,null,null,0,"Referência: AGETOP - 82102"]
["S",2,"S",0,3,7,0,0,0,0,0,"","Serviço","Serviço","-","SINAPI",89825,"TE, PVC, SERIE NORMAL, ESGOTO PREDIAL, DN 50 X 50 MM, JUNTA ELÁSTICA, FORNECIDO E INSTALADO EM PRUMADA DE ESGOTO SANITÁRIO OU VENTILAÇÃO. AF_12/2014","UN",1,null,null,0,""]
["S",2,"S",0,3,7,0,0,0,0,0,"","Serviço","Serviço","-","AGETOP",82231,"TE SANITARIO DIAMETRO 75 X 50 MM","Un    ",2,null,null,0,""]
["S",2,"S",0,3,7,0,0,0,0,0,"","Serviço","Serviço","-","SINAPI",89771,"TUBO, CPVC, SOLDÁVEL, DN 42MM, INSTALADO EM PRUMADA DE ÁGUA \u0096 FORNECIMENTO E INSTALAÇÃO. AF_12/2014","M",21,null,null,0,""]
["S",2,"S",0,3,7,0,0,0,0,0,"","Serviço","Serviço","-","SINAPI",89798,"TUBO PVC, SERIE NORMAL, ESGOTO PREDIAL, DN 50 MM, FORNECIDO E INSTALADO EM PRUMADA DE ESGOTO SANITÁRIO OU VENTILAÇÃO. AF_12/2014","M",48,null,null,0,""]
["S",2,"S",0,3,7,0,0,0,{"$f":"IF(OR($C453=\"S\",$C453=0),0,MATCH(0,OFFSET($D453,1,$C453,ROW($C$497)-ROW($C453)),0))","v":0},{"$f":"IF(OR($C453=\"S\",$C453=0),0,MATCH(OFFSET($D453,0,$C453)+1,OFFSET($D453,1,$C453,ROW($C$497)-ROW($C453)),0))","v":0},"","Serviço","Serviço","-","SINAPI",89799,"TUBO PVC, SERIE NORMAL, ESGOTO PREDIAL, DN 75 MM, FORNECIDO E INSTALADO EM PRUMADA DE ESGOTO SANITÁRIO OU VENTILAÇÃO. AF_12/2014","M",9,null,null,0,""]
["S",2,"S",0,3,7,0,0,0,0,0,"","Serviço","Serviço","-","SINAPI",89800,"TUBO PVC, SERIE NORMAL, ESGOTO PREDIAL, DN 100 MM, FORNECIDO E INSTALADO EM PRUMADA DE ESGOTO SANITÁRIO OU VENTILAÇÃO. AF_12/2014","M",30,null,null,0,""]
[2,2,2,4,3,8,0,0,0,42,4,"","Nível 2","Nível 2","-","SINAPI",null,"ALVENARIAS E DIVISÓRIAS","-",null,null,null,0,""]
["S",2,"S",0,3,8,0,0,0,0,0,"","Serviço","Serviço","-","SINAPI",87503,"ALVENARIA DE VEDAÇÃO DE BLOCOS CERÂMICOS FURADOS NA HORIZONTAL DE 9X19X19CM (ESPESSURA 9CM) DE PAREDES COM ÁREA LÍQUIDA MAIOR OU IGUAL A 6M² SEM VÃOS E ARGAMASSA DE ASSENTAMENTO COM PREPARO EM BETONEIRA. AF_06/2014","M2",176,null,null,0,"Referência: AGETOP - 100201"]
["S",2,"S",0,3,8,0,0,0,0,0,"","Serviço","Serviço","-","SINAPI",72132,"ALVENARIA EM TIJOLO CERAMICO MACICO 5X10X20CM 1/2 VEZ (ESPESSURA 10CM), ASSENTADO COM ARGAMASSA TRACO 1:2:8 (CIMENTO, CAL E AREIA)","M2",39,null,null,0,"Referência: AGETOP - 100102"]
["S",2,"S",0,3,8,0,0,0,0,0,"","Serviço","Serviço","-","SINAPI",93202,"FIXAÇÃO (ENCUNHAMENTO) DE ALVENARIA DE VEDAÇÃO COM TIJOLO MACIÇO. AF_03/2016","M",60.4,null,null,0,"Referência: AGETOP - 100204"]
[2,2,2,2,3,9,0,0,0,38,2,"","Nível 2","Nível 2","-","SINAPI",null,"IMPERMEABILIZAÇÃO","-",null,null,null,0,""]
["S",2,"S",0,3,9,0,0,0,0,0,"","Serviço","Serviço","-","SINAPI",98562,"IMPERMEABILIZAÇÃO DE FLOREIRA OU VIGA BALDRAME COM ARGAMASSA DE CIMENTO E AREIA, COM ADITIVO IMPERMEABILIZANTE, E = 2 CM. AF_06/2018","M2",60.4,null,null,0,"Referência: AGETOP - 120902"]
[2,2,2,3,3,10,0,0,0,36,3,"","Nível 2","Nível 2","-","SINAPI",null,"ESTRUTURA DE MADEIRA","-",null,null,null,0,""]
["S",2,"S",0,3,10,0,0,0,0,0,"","Serviço","Serviço","-","AGETOP",140101,"ESTRUTURA-TELHA CERÂMICA V=3 A 7 M. C/FERRAGENS","m2    ",132.78,null,null,0,""]
["S",2,"S",0,3,10,0,0,0,0,0,"","Serviço","Serviço","-","AGETOP",140301,"TRATAMENTO P/ESTRUTURA DE TELHADO","m2    ",132.78,null,null,0,""]
[2,2,2,4,3,11,0,0,0,33,4,"","Nível 2","Nível 2","-","SINAPI",null,"COBERTURAS","-",null,null,null,0,""]
["S",2,"S",0,3,11,0,0,0,0,0,"","Serviço","Serviço","-","SINAPI",94445,"TELHAMENTO COM TELHA CERÂMICA CAPA-CANAL, TIPO PLAN, COM ATÉ 2 ÁGUAS, INCLUSO TRANSPORTE VERTICAL. AF_07/2019","M2",132.78,null,null,0,"Referência: AGETOP - 160401"]
["S",2,"S",0,3,11,0,0,0,0,0,"","Serviço","Serviço","-","SINAPI",94221,"CUMEEIRA PARA TELHA CERÂMICA EMBOÇADA COM ARGAMASSA TRAÇO 1:2:9 (CIMENTO, CAL E AREIA) PARA TELHADOS COM ATÉ 2 ÁGUAS, INCLUSO TRANSPORTE VERTICAL. AF_07/2019","M",11.02,null,null,0,""]
["S",2,"S",0,3,11,0,0,0,0,0,"","Serviço","Serviço","-","SINAPI",94224,"EMBOÇAMENTO COM ARGAMASSA TRAÇO 1:2:9 (CIMENTO, CAL E AREIA). AF_07/2019","M",47.04,null,null,0,"Referência: AGETOP - 160403"]
[2,2,2,4,3,12,0,0,0,29,4,"","Nível 2","Nível 2","-","SINAPI",null,"ESQUADRIAS METÁLICAS","-",null,null,null,0,""]
["S",2,"S",0,3,12,0,0,0,0,0,"","Serviço","Serviço","-","SINAPI","73933/4","PORTA DE FERRO DE ABRIR TIPO BARRA CHATA, COM REQUADRO E GUARNICAO COMPLETA","M2",6.72,null,null,0,"Referência: AGETOP - 180501"]
["S",2,"S",0,3,12,0,0,0,0,0,"","Serviço","Serviço","-","SINAPI","73933/4","PORTA DE FERRO DE ABRIR TIPO BARRA CHATA, COM REQUADRO E GUARNICAO COMPLETA","M2",7.56,null,null,0,"Referência: AGETOP - 180501"]
["S",2,"S",0,3,12,0,0,0,0,0,"","Serviço","Serviço","-","AGETOP",180381,"ESQ. MAXIMO AR CHAPA/VIDRO J3/J5/J6/J8 C/FERRAGENS","m2    ",17.28,null,null,0,""]
[2,2,2,5,3,13,0,0,0,25,5,"","Nível 2","Nível 2","-","SINAPI",null,"REVESTIMENTO DE PAREDE","-",null,null,null,0,""]
["S",2,"S",0,3,13,0,0,0,0,0,"","Serviço","Serviço","-","SINAPI",87553,"EMBOÇO, PARA RECEBIMENTO DE CERÂMICA, EM ARGAMASSA TRAÇO 1:2:8, PREPARO MECÂNICO COM BETONEIRA 400L, APLICADO MANUALMENTE EM FACES INTERNAS DE PAREDES, PARA AMBIENTE COM ÁREA MAIOR QUE 10M2, ESPESSURA DE 10MM, COM EXECUÇÃO DE TALISCAS. AF_06/2014","M2",330.72,null,null,0,""]
["S",2,"S",0,3,13,0,0,0,0,0,"","Serviço","Serviço","-","SINAPI",87904,"CHAPISCO APLICADO EM ALVENARIA (COM PRESENÇA DE VÃOS) E ESTRUTURAS DE CONCRETO DE FACHADA, COM COLHER DE PEDREIRO.  ARGAMASSA TRAÇO 1:3 COM PREPARO MANUAL. AF_06/2014","M2",444.42,null,null,0,"Referência: AGETOP - 200101"]
["S",2,"S",0,3,13,0,0,0,0,0,"","Serviço","Serviço","-","SINAPI",87547,"MASSA ÚNICA, PARA RECEBIMENTO DE PINTURA, EM ARGAMASSA TRAÇO 1:2:8, PREPARO MECÂNICO COM BETONEIRA 400L, APLICADA MANUALMENTE EM FACES INTERNAS DE PAREDES, ESPESSURA DE 10MM, COM EXECUÇÃO DE TALISCAS. AF_06/2014","M2",113.7,null,null,0,"Referência: AGETOP - 200500"]
["S",2,"S",0,3,13,0,0,0,0,0,"","Serviço","Serviço","-","SINAPI",87273,"REVESTIMENTO CERÂMICO PARA PAREDES INTERNAS COM PLACAS TIPO ESMALTADA EXTRA DE DIMENSÕES 33X45 CM APLICADAS EM AMBIENTES DE ÁREA MAIOR QUE 5 M² NA ALTURA INTEIRA DAS PAREDES. AF_06/2014","M2",330.72,null,null,0,""]
[2,2,2,2,3,14,0,0,0,20,2,"","Nível 2","Nível 2","-","SINAPI",null,"VIDROS","-",null,null,null,0,""]
["S",2,"S",0,3,14,0,0,0,0,0,"","Serviço","Serviço","-","SINAPI",72117,"VIDRO LISO COMUM TRANSPARENTE, ESPESSURA 4MM","M2",6.72,null,null,0,"Referência: AGETOP - 190102"]
[2,2,2,5,3,15,0,0,0,18,5,"","Nível 2","Nível 2","-","SINAPI",null,"REVESTIMENTO DE PISO","-",null,null,null,0,""]
["S",2,"S",0,3,15,0,0,0,0,0,"","Serviço","Serviço","-","AGETOP",220100,"PASSEIO PROTECAO EM CONC.DESEMPEN.5 CM 1:2,5:3,5 ( INCLUSO ESPELHO DE 30CM/ESCAVAÇÃO/REATERRO/APILOAMENTO/ATERRO INTERNO)","m2    ",25.26,null,null,0,""]
["S",2,"S",0,3,15,0,0,0,0,0,"","Serviço","Serviço","-","AGETOP",220101,"LASTRO DE CONCRETO REGULARIZADO IMPERMEABILIZADO 1:3:6 ESP=5CM (BASE)","m2    ",123.49,null,null,0,""]
["S",2,"S",0,3,15,0,0,0,0,0,"","Serviço","Serviço","-","SINAPI",84191,"PISO EM GRANILITE, MARMORITE OU GRANITINA ESPESSURA 8 MM, INCLUSO JUNTAS DE DILATACAO PLASTICAS","M2",108.03,null,null,0,"Referência: AGETOP - 221101"]
["S",2,"S",0,3,15,0,0,0,0,0,"","Serviço","Serviço","-","AGETOP",221104,"RASPAGEM E APLICAÇÃO RESINA ACRÍLICA DUAS DEMÃOS","m2    ",108.03,null,null,0,""]
[2,2,2,3,3,16,0,0,0,13,3,"","Nível 2","Nível 2","-","SINAPI",null,"FERRAGENS","-",null,null,null,0,""]
["S",2,"S",0,3,16,0,0,0,{"$f":"IF(OR($C485=\"S\",$C485=0),0,MATCH(0,OFFSET($D485,1,$C485,ROW($C$497)-ROW($C485)),0))","v":0},{"$f":"IF(OR($C485=\"S\",$C485=0),0,MATCH(OFFSET($D485,0,$C485)+1,OFFSET($D485,1,$C485,ROW($C$497)-ROW($C485)),0))","v":0},"","Serviço","Serviço","-","AGETOP",230174,"BARRA DE APOIO EM AÇO INOX - 40 CM","un    ",4,null,null,0,""]
["S",2,"S",0,3,16,0,0,0,0,0,"","Serviço","Serviço","-","AGETOP",230176,"BARRA DE APOIO EM AÇO INOX - 80 CM ","un    ",4,null,null,0,""]
[2,2,2,6,3,17,0,0,0,10,6,"","Nível 2","Nível 2","-","SINAPI",null,"PINTURA","-",null,null,null,0,""]
["S",2,"S",0,3,17,0,0,0,0,0,"","Serviço","Serviço","-","SINAPI",88497,"APLICAÇÃO E LIXAMENTO DE MASSA LÁTEX EM PAREDES, DUAS DEMÃOS. AF_06/2014","M2",67,null,null,0,"Referência: AGETOP - 261300"]
["S",2,"S",0,3,17,0,0,0,0,0,"","Serviço","Serviço","-","SINAPI",88489,"APLICAÇÃO MANUAL DE PINTURA COM TINTA LÁTEX ACRÍLICA EM PAREDES, DUAS DEMÃOS. AF_06/2014","M2",113.7,null,null,0,"Referência: AGETOP - 261001"]
["S",2,"S",0,3,17,0,0,0,0,0,"","Serviço","Serviço","-","AGETOP",261304,"EMASSAMENTO ACRILICO 2 DEMAOS","m2    ",113.7,null,null,0,""]
["S",2,"S",0,3,17,0,0,0,0,0,"","Serviço","Serviço","-","SINAPI",88486,"APLICAÇÃO MANUAL DE PINTURA COM TINTA LÁTEX PVA EM TETO, DUAS DEMÃOS. AF_06/2014","M2",67,null,null,0,"Referência: AGETOP - 261307"]
["S",2,"S",0,3,17,0,0,0,0,0,"","Serviço","Serviço","-","SINAPI","74145/1","PINTURA ESMALTE FOSCO, DUAS DEMAOS, SOBRE SUPERFICIE METALICA, INCLUSO UMA DEMAO DE FUNDO ANTICORROSIVO. UTILIZACAO DE REVOLVER ( AR-COMPRIMIDO).","M2",63.12,null,null,0,"Referência: AGETOP - 261602"]
[2,2,2,4,3,18,0,0,0,4,{"$error":"#N/A"},"","Nível 2","Nível 2","-","SINAPI",null,"DIVERSOS","-",null,null,null,0,""]
["S",2,"S",0,3,18,0,0,0,0,0,"","Serviço","Serviço","-","AGETOP",270501,"LIMPEZA FINAL DE OBRA - (OBRAS CIVIS)","m2    ",98.23,null,null,0,""]
["S",2,"S",0,3,18,0,0,0,0,0,"","Serviço","Serviço","-","AGETOP",271608,"BANCADA DE GRANITO C/ESPELHO","m2    ",2.4,null,null,0,""]
["S",2,"S",0,3,18,0,0,0,0,0,"","Serviço","Serviço","-","AGETOP",271303,"BANCO DE CONCRETO POLIDO BASE EM ALVENARIA REBOCADA E PINTADA - PADRÃO AGETOP 2015","m     ",6,null,null,0,""]
[-1,null,-1,null,0,0,0,0,0,null,null,"F"]
[null,null,null,null,null,null,null,null,null,null,null,"F",null,null,null,null,null,"OBS: OS QUANTITATIVOS DE MATERIAIS  DAS INSTALAÇÕES HIDROSSANITÁRIAS, ELÉTRICAS E ESPECIAIS SÃO FORNECIDOS PELOS PROFISSIONAIS RESPONSÁVEIS PELOS RESPECTIVOS PROJETOS.",null,null,"VALOR TOTAL",null,0]
[null,null,null,null,null,null,null,null,null,null,null,"F",null,null,null,null,null,null,null,null,"VALOR BDI (26,44%)",null,0]
[null,null,null,null,null,null,null,null,null,null,null,"F",null,null,null,null,null,null,null,null,"TOTAL ORÇAMENTO",null,0]
[null,null,null,null,null,null,null,null,null,null,null,"F"]
[null,null,null,null,null,null,null,null,null,null,null,"F",null,null,null,null,null,null,null,null,"CUSTO POR M2 ³",null,0]
[null,null,null,null,null,null,null,null,null,null,null,"F",null,null,null,null,null,null,null,null,"MATERIAL S/ BDI",null,0]
[null,null,null,null,null,null,null,null,null,null,null,"F",null,null,null,null,null,null,null,null,"MÃO DE OBRA S/ BDI",null,0]
[null,null,null,null,null,null,null,null,null,null,null,"F"]
[null,null,null,null,null,null,null,null,null,null,null,"F",null,null,null,null,"(1) Conforme previsto pelo DECRETO Nº 7.983, DE 8 DE ABRIL DE 2013, os preços adotados são aqueles constantes dos sistemas de referência indicados. Justifica-se o uso dos preços destas composições de custos unitários devido ao seu valor ser menor à mediana de seus correspondentes na tabela SINAPI;"]
[null,null,null,null,null,null,null,null,null,null,null,"F",null,null,null,null,"(2) Optou-se pelo uso das composições de custos da AGETOP para itens não presentes na SINAPI;"]
[null,null,null,null,null,null,null,null,null,null,null,"F",null,null,null,null,"(3) Para itens da AGETOP, os vidros não estão inclusos nas esquadrias e já foram considerados os custos de contramarco para as esquadrias de alumínio;"]
[null,null,null,null,null,null,null,null,null,null,null,"F",null,null,null,null,"(4) Nos casos em que houver execução de granitina e omissão do item AGETOP 221102, considerou-se que o quantitativo para o rodapé, de altura igual a 7cm, foi incorporado na área de piso;"]
[null,null,null,null,null,null,null,null,null,null,null,"F",null,null,null,null,"(5) O custo unitário aproximado por metro quadrado é calculado dividindo-se o valor total do orçamento pela área total de construção."]
[null,null,null,null,null,null,null,null,null,null,null,"F"]
[null,null,null,null,null,null,null,null,null,null,null,"F"]
[]
[null,null,null,null,null,null,null,null,null,null,null,null,null,null,"SOMATÓRIO DE SERVIÇOS"]
[null,null,null,null,null,null,null,null,null,null,null,null,null,null,"ITEM","DESCRIÇÃO DOS SERVIÇOS",null,null,"PREÇO SEM BDI",null,null,"PREÇO COM BDI",null,"PARTICIPAÇÃO ( % )"]
[null,null,null,null,null,null,null,null,null,null,null,null,null,null,"a.","SERVIÇOS PRELIMINARES",null,null,{"$f":"SUMIF($R$19:$R$497,$P516,$W$19:$W$497)","v":0},null,null,{"$f":"ROUND(S516*(1+BDI.Taxa),2)","v":0},null,{"$f":"IFERROR(ROUND($V516*100/$W$500,2),0)","v":0}]
[null,null,null,null,null,null,null,null,null,null,null,null,null,null,"b.","TRANSPORTES",null,null,0,null,null,0,null,{"$f":"IFERROR(ROUND($V517*100/$W$500,2),0)","v":0}]
[null,null,null,null,null,null,null,null,null,null,null,null,null,null,"c.","SERVIÇO EM TERRA",null,null,0,null,null,0,null,0]
[null,null,null,null,null,null,null,null,null,null,null,null,null,null,"d.","FUNDAÇÕES E SONDAGENS",null,null,0,null,null,0,null,0]
[null,null,null,null,null,null,null,null,null,null,null,null,null,null,"e.","ESTRUTURA",null,null,0,null,null,0,null,0]
[null,null,null,null,null,null,null,null,null,null,null,null,null,null,"f.","INSTALAÇÕES ELÉTRICAS",null,null,0,null,null,0,null,0]
[null,null,null,null,null,null,null,null,null,null,null,null,null,null,"g.","INSTALAÇÕES HIDROSSANITÁRIAS",null,null,0,null,null,0,null,0]
[null,null,null,null,null,null,null,null,null,null,null,null,null,null,"h","INSTALAÇÕES ESPECIAIS",null,null,0,null,null,0,null,0]
[null,null,null,null,null,null,null,null,null,null,null,null,null,null,"i.","ALVENARIAS E DIVISÓRIAS",null,null,0,null,null,0,null,0]
[null,null,null,null,null,null,null,null,null,null,null,null,null,null,"j.","ALVENARIA AUTO-PORTANTE",null,null,0,null,null,0,null,0]
[null,null,null,null,null,null,null,null,null,null,null,null,null,null,"k.","IMPERMEABILIZAÇÃO",null,null,0,null,null,0,null,0]
[null,null,null,null,null,null,null,null,null,null,null,null,null,null,"l.","ISOLAMENTO TÉRMICO E ACÚSTICO",null,null,0,null,null,0,null,0]
[null,null,null,null,null,null,null,null,null,null,null,null,null,null,"m.","ESTRUTURA DE MADEIRA",null,null,0,null,null,0,null,0]
[null,null,null,null,null,null,null,null,null,null,null,null,null,null,"n.","ESTRUTURAS METÁLICAS",null,null,0,null,null,0,null,0]
[null,null,null,null,null,null,null,null,null,null,null,null,null,null,"o.","COBERTURAS",null,null,0,null,null,0,null,0]
[null,null,null,null,null,null,null,null,null,null,null,null,null,null,"p.","ESQUADRIAS DE MADEIRA",null,null,0,null,null,0,null,0]
[null,null,null,null,null,null,null,null,null,null,null,null,null,null,"q.","ESQUADRIAS METÁLICAS",null,null,0,null,null,{"$f":"ROUND(S532*(1+BDI.Taxa),2)","v":0},null,0]
[null,null,null,null,null,null,null,null,null,null,null,null,null,null,"r.","VIDROS",null,null,0,null,null,0,null,0]
[null,null,null,null,null,null,null,null,null,null,null,null,null,null,"s.","REVESTIMENTO DE PAREDE",null,null,0,null,null,0,null,0]
[null,null,null,null,null,null,null,null,null,null,null,null,null,null,"t.","FORROS",null,null,0,null,null,0,null,0]
[null,null,null,null,null,null,null,null,null,null,null,null,null,null,"u.","REVESTIMENTO DE PISO",null,null,0,null,null,0,null,0]
[null,null,null,null,null,null,null,null,null,null,null,null,null,null,"v.","FERRAGENS",null,null,0,null,null,0,null,0]
[null,null,null,null,null,null,null,null,null,null,null,null,null,null,"w.","MARCENARIA",null,null,0,null,null,0,null,0]
[null,null,null,null,null,null,null,null,null,null,null,null,null,null,"x.","ADMINISTRAÇÃO",null,null,0,null,null,0,null,0]
[null,null,null,null,null,null,null,null,null,null,null,null,null,null,"y.","PINTURA",null,null,0,null,null,{"$f":"ROUND(S540*(1+BDI.Taxa),2)","v":0},null,0]
[null,null,null,null,null,null,null,null,null,null,null,null,null,null,"z.","DIVERSOS",null,null,0,null,null,{"$f":"IF(S541>0,IF((SUM(V516:W540)+ROUND(S541*(1+BDI.Taxa),2))<>V543,V543-SUM(V516:W540),ROUND(S541*(1+BDI.Taxa),2)),0)","v":0},null,{"$f":"IF(S541>0,IF((SUM(X516:X540)+IFERROR(ROUND($V541*100/$W$500,2),0))<>X543,X543-SUM(X516:X540),IFERROR(ROUND($V541*100/$W$500,2),0)),0)","v":0}]
[null,null,null,null,null,null,null,null,null,null,null,null,null,null,"TOTAL GERAL DO ORÇAMENTO (R$)",null,null,null,{"$f":"SUM(S516:U541)","v":0},null,null,{"$f":"SUM(V516:W541)","v":0},null,{"$f":"SUM(X516:X541)","v":0}]
[null,null,null,null,null,null,null,null,null,null,null,null,null,null,null,null,null,null,{"$f":"$W$498","v":0},null,null,{"$f":"$W$500","v":0},null,100]
[null,null,null,null,null,null,null,null,null,null,null,null,null,null,null,null,null,null,"(TOTAL SEM BDI)",null,null,"(TOTAL COM BDI)",null,"(ARRED porcentagem)"]
[null,null,null,null,null,null,null,null,null,null,null,null,null,null,null,null,null,null,{"$f":"IF(AND(S542=S543,S542>0),\"OK\",\"ERRO\")","v":"ERRO"},null,null,{"$f":"IF(AND(V542=V543,V542>0),\"OK\",\"ERRO\")","v":"ERRO"},null,{"$f":"IF(X542=100,\"OK\",\"ERRO\")","v":"ERRO"}]
[]
[]
[null,null,null,null,null,null,null,null,null,null,null,null,null,null,"RESUMO GERAL DO ORÇAMENTO"]
[null,null,null,null,null,null,null,null,null,null,null,null,null,null,"ITEM","DESCRIÇÃO DOS SERVIÇOS",null,null,"PREÇO SEM BDI",null,null,"PREÇO COM BDI",null,"PARTICIPAÇÃO ( % )"]
[null,null,null,null,null,null,null,null,null,null,null,null,null,null,"1.",{"$f":"IFERROR(VLOOKUP(O550,$O$19:$W$497,4,FALSE),\"\")","v":"REFORMA"},null,null,{"$f":"IF(P551=\"\",$S$571-SUM(OFFSET($S$549:S549,0,0,COUNTA($S$549:S549),1)),SUMIF($R$19:$R$497,$P550,$W$19:$W$497))","v":0},null,null,{"$f":"IF(P551=\"\",$V$571-SUM(OFFSET($V$549:V549,0,0,COUNTA($V$549:V549),1)),ROUND(S550*(1+BDI.Taxa),2))","v":0},null,{"$f":"IF(P551=\"\",$X$571-SUM(OFFSET($X$549:X549,0,0,COUNTA($X$549:X549),1)),ROUND(V550*100/ORÇAMENTO.TotalOrçamento,2))","v":{"$error":"#DIV/0!"}}]
[null,null,null,null,null,null,null,null,null,null,null,null,null,null,"2.","IMPLANTAÇÃO",null,null,{"$f":"IF(P552=\"\",$S$571-SUM(OFFSET($S$549:S550,0,0,COUNTA($S$549:S550),1)),SUMIF($R$19:$R$497,$P551,$W$19:$W$497))","v":0},null,null,{"$f":"IF(P552=\"\",$V$571-SUM(OFFSET($V$549:V550,0,0,COUNTA($V$549:V550),1)),ROUND(S551*(1+BDI.Taxa),2))","v":0},null,{"$f":"IF(P552=\"\",$X$571-SUM(OFFSET($X$549:X550,0,0,COUNTA($X$549:X550),1)),ROUND(V551*100/ORÇAMENTO.TotalOrçamento,2))","v":{"$error":"#DIV/0!"}}]
[null,null,null,null,null,null,null,null,null,null,null,null,null,null,"3.","VESTIÁRIO PADRÃO SEDUC 2019",null,null,{"$f":"IF(P553=\"\",$S$571-SUM(OFFSET($S$549:S551,0,0,COUNTA($S$549:S551),1)),SUMIF($R$19:$R$497,$P552,$W$19:$W$497))","v":0},null,null,{"$f":"IF(P553=\"\",$V$571-SUM(OFFSET($V$549:V551,0,0,COUNTA($V$549:V551),1)),ROUND(S552*(1+BDI.Taxa),2))","v":0},null,{"$f":"IF(P553=\"\",$X$571-SUM(OFFSET($X$549:X551,0,0,COUNTA($X$549:X551),1)),ROUND(V552*100/ORÇAMENTO.TotalOrçamento,2))","v":{"$error":"#DIV/0!"}}]
[null,null,null,null,null,null,null,null,null,null,null,null,null,null,"4.","",null,null,{"$f":"IF(P554=\"\",$S$571-SUM(OFFSET($S$549:S552,0,0,COUNTA($S$549:S552),1)),SUMIF($R$19:$R$497,$P553,$W$19:$W$497))","v":0},null,null,{"$f":"IF(P554=\"\",$V$571-SUM(OFFSET($V$549:V552,0,0,COUNTA($V$549:V552),1)),ROUND(S553*(1+BDI.Taxa),2))","v":0},null,{"$f":"IF(P554=\"\",$X$571-SUM(OFFSET($X$549:X552,0,0,COUNTA($X$549:X552),1)),ROUND(V553*100/ORÇAMENTO.TotalOrçamento,2))","v":{"$error":"#DIV/0!"}}]
[null,null,null,null,null,null,null,null,null,null,null,null,null,null,"5.","",null,null,{"$f":"IF(P555=\"\",$S$571-SUM(OFFSET($S$549:S553,0,0,COUNTA($S$549:S553),1)),SUMIF($R$19:$R$497,$P554,$W$19:$W$497))","v":0},null,null,{"$f":"IF(P555=\"\",$V$571-SUM(OFFSET($V$549:V553,0,0,COUNTA($V$549:V553),1)),ROUND(S554*(1+BDI.Taxa),2))","v":0},null,{"$f":"IF(P555=\"\",$X$571-SUM(OFFSET($X$549:X553,0,0,COUNTA($X$549:X553),1)),ROUND(V554*100/ORÇAMENTO.TotalOrçamento,2))","v":{"$error":"#DIV/0!"}}]
[null,null,null,null,null,null,null,null,null,null,null,null,null,null,"6.","",null,null,{"$f":"IF(P556=\"\",$S$571-SUM(OFFSET($S$549:S554,0,0,COUNTA($S$549:S554),1)),SUMIF($R$19:$R$497,$P555,$W$19:$W$497))","v":0},null,null,{"$f":"IF(P556=\"\",$V$571-SUM(OFFSET($V$549:V554,0,0,COUNTA($V$549:V554),1)),ROUND(S555*(1+BDI.Taxa),2))","v":0},null,{"$f":"IF(P556=\"\",$X$571-SUM(OFFSET($X$549:X554,0,0,COUNTA($X$549:X554),1)),ROUND(V555*100/ORÇAMENTO.TotalOrçamento,2))","v":{"$error":"#DIV/0!"}}]
[null,null,null,null,null,null,null,null,null,null,null,null,null,null,"7.","",null,null,{"$f":"IF(P557=\"\",$S$571-SUM(OFFSET($S$549:S555,0,0,COUNTA($S$549:S555),1)),SUMIF($R$19:$R$497,$P556,$W$19:$W$497))","v":0},null,null,{"$f":"IF(P557=\"\",$V$571-SUM(OFFSET($V$549:V555,0,0,COUNTA($V$549:V555),1)),ROUND(S556*(1+BDI.Taxa),2))","v":0},null,{"$f":"IF(P557=\"\",$X$571-SUM(OFFSET($X$549:X555,0,0,COUNTA($X$549:X555),1)),ROUND(V556*100/ORÇAMENTO.TotalOrçamento,2))","v":{"$error":"#DIV/0!"}}]
[null,null,null,null,null,null,null,null,null,null,null,null,null,null,"8.","",null,null,{"$f":"IF(P558=\"\",$S$571-SUM(OFFSET($S$549:S556,0,0,COUNTA($S$549:S556),1)),SUMIF($R$19:$R$497,$P557,$W$19:$W$497))","v":0},null,null,{"$f":"IF(P558=\"\",$V$571-SUM(OFFSET($V$549:V556,0,0,COUNTA($V$549:V556),1)),ROUND(S557*(1+BDI.Taxa),2))","v":0},null,{"$f":"IF(P558=\"\",$X$571-SUM(OFFSET($X$549:X556,0,0,COUNTA($X$549:X556),1)),ROUND(V557*100/ORÇAMENTO.TotalOrçamento,2))","v":{"$error":"#DIV/0!"}}]
[null,null,null,null,null,null,null,null,null,null,null,null,null,null,"9.","",null,null,{"$f":"IF(P559=\"\",$S$571-SUM(OFFSET($S$549:S557,0,0,COUNTA($S$549:S557),1)),SUMIF($R$19:$R$497,$P558,$W$19:$W$497))","v":0},null,null,{"$f":"IF(P559=\"\",$V$571-SUM(OFFSET($V$549:V557,0,0,COUNTA($V$549:V557),1)),ROUND(S558*(1+BDI.Taxa),2))","v":0},null,{"$f":"IF(P559=\"\",$X$571-SUM(OFFSET($X$549:X557,0,0,COUNTA($X$549:X557),1)),ROUND(V558*100/ORÇAMENTO.TotalOrçamento,2))","v":{"$error":"#DIV/0!"}}]
[null,null,null,null,null,null,null,null,null,null,null,null,null,null,"10.","",null,null,{"$f":"IF(P560=\"\",$S$571-SUM(OFFSET($S$549:S558,0,0,COUNTA($S$549:S558),1)),SUMIF($R$19:$R$497,$P559,$W$19:$W$497))","v":0},null,null,{"$f":"IF(P560=\"\",$V$571-SUM(OFFSET($V$549:V558,0,0,COUNTA($V$549:V558),1)),ROUND(S559*(1+BDI.Taxa),2))","v":0},null,{"$f":"IF(P560=\"\",$X$571-SUM(OFFSET($X$549:X558,0,0,COUNTA($X$549:X558),1)),ROUND(V559*100/ORÇAMENTO.TotalOrçamento,2))","v":{"$error":"#DIV/0!"}}]
[null,null,null,null,null,null,null,null,null,null,null,null,null,null,"11.","",null,null,{"$f":"IF(P561=\"\",$S$571-SUM(OFFSET($S$549:S559,0,0,COUNTA($S$549:S559),1)),SUMIF($R$19:$R$497,$P560,$W$19:$W$497))","v":0},null,null,{"$f":"IF(P561=\"\",$V$571-SUM(OFFSET($V$549:V559,0,0,COUNTA($V$549:V559),1)),ROUND(S560*(1+BDI.Taxa),2))","v":0},null,{"$f":"IF(P561=\"\",$X$571-SUM(OFFSET($X$549:X559,0,0,COUNTA($X$549:X559),1)),ROUND(V560*100/ORÇAMENTO.TotalOrçamento,2))","v":{"$error":"#DIV/0!"}}]
[null,null,null,null,null,null,null,null,null,null,null,null,null,null,"12.","",null,null,{"$f":"IF(P562=\"\",$S$571-SUM(OFFSET($S$549:S560,0,0,COUNTA($S$549:S560),1)),SUMIF($R$19:$R$497,$P561,$W$19:$W$497))","v":0},null,null,{"$f":"IF(P562=\"\",$V$571-SUM(OFFSET($V$549:V560,0,0,COUNTA($V$549:V560),1)),ROUND(S561*(1+BDI.Taxa),2))","v":0},null,{"$f":"IF(P562=\"\",$X$571-SUM(OFFSET($X$549:X560,0,0,COUNTA($X$549:X560),1)),ROUND(V561*100/ORÇAMENTO.TotalOrçamento,2))","v":{"$error":"#DIV/0!"}}]
[null,null,null,null,null,null,null,null,null,null,null,null,null,null,"13.","",null,null,{"$f":"IF(P563=\"\",$S$571-SUM(OFFSET($S$549:S561,0,0,COUNTA($S$549:S561),1)),SUMIF($R$19:$R$497,$P562,$W$19:$W$497))","v":0},null,null,{"$f":"IF(P563=\"\",$V$571-SUM(OFFSET($V$549:V561,0,0,COUNTA($V$549:V561),1)),ROUND(S562*(1+BDI.Taxa),2))","v":0},null,{"$f":"IF(P563=\"\",$X$571-SUM(OFFSET($X$549:X561,0,0,COUNTA($X$549:X561),1)),ROUND(V562*100/ORÇAMENTO.TotalOrçamento,2))","v":{"$error":"#DIV/0!"}}]
[null,null,null,null,null,null,null,null,null,null,null,null,null,null,"14.","",null,null,{"$f":"IF(P564=\"\",$S$571-SUM(OFFSET($S$549:S562,0,0,COUNTA($S$549:S562),1)),SUMIF($R$19:$R$497,$P563,$W$19:$W$497))","v":0},null,null,{"$f":"IF(P564=\"\",$V$571-SUM(OFFSET($V$549:V562,0,0,COUNTA($V$549:V562),1)),ROUND(S563*(1+BDI.Taxa),2))","v":0},null,{"$f":"IF(P564=\"\",$X$571-SUM(OFFSET($X$549:X562,0,0,COUNTA($X$549:X562),1)),ROUND(V563*100/ORÇAMENTO.TotalOrçamento,2))","v":{"$error":"#DIV/0!"}}]
[null,null,null,null,null,null,null,null,null,null,null,null,null,null,"15.","",null,null,{"$f":"IF(P565=\"\",$S$571-SUM(OFFSET($S$549:S563,0,0,COUNTA($S$549:S563),1)),SUMIF($R$19:$R$497,$P564,$W$19:$W$497))","v":0},null,null,{"$f":"IF(P565=\"\",$V$571-SUM(OFFSET($V$549:V563,0,0,COUNTA($V$549:V563),1)),ROUND(S564*(1+BDI.Taxa),2))","v":0},null,{"$f":"IF(P565=\"\",$X$571-SUM(OFFSET($X$549:X563,0,0,COUNTA($X$549:X563),1)),ROUND(V564*100/ORÇAMENTO.TotalOrçamento,2))","v":{"$error":"#DIV/0!"}}]
[null,null,null,null,null,null,null,null,null,null,null,null,null,null,"16.","",null,null,{"$f":"IF(P566=\"\",$S$571-SUM(OFFSET($S$549:S564,0,0,COUNTA($S$549:S564),1)),SUMIF($R$19:$R$497,$P565,$W$19:$W$497))","v":0},null,null,{"$f":"IF(P566=\"\",$V$571-SUM(OFFSET($V$549:V564,0,0,COUNTA($V$549:V564),1)),ROUND(S565*(1+BDI.Taxa),2))","v":0},null,{"$f":"IF(P566=\"\",$X$571-SUM(OFFSET($X$549:X564,0,0,COUNTA($X$549:X564),1)),ROUND(V565*100/ORÇAMENTO.TotalOrçamento,2))","v":{"$error":"#DIV/0!"}}]
[null,null,null,null,null,null,null,null,null,null,null,null,null,null,"17.","",null,null,{"$f":"IF(P567=\"\",$S$571-SUM(OFFSET($S$549:S565,0,0,COUNTA($S$549:S565),1)),SUMIF($R$19:$R$497,$P566,$W$19:$W$497))","v":0},null,null,{"$f":"IF(P567=\"\",$V$571-SUM(OFFSET($V$549:V565,0,0,COUNTA($V$549:V565),1)),ROUND(S566*(1+BDI.Taxa),2))","v":0},null,{"$f":"IF(P567=\"\",$X$571-SUM(OFFSET($X$549:X565,0,0,COUNTA($X$549:X565),1)),ROUND(V566*100/ORÇAMENTO.TotalOrçamento,2))","v":{"$error":"#DIV/0!"}}]
[null,null,null,null,null,null,null,null,null,null,null,null,null,null,"18.","",null,null,{"$f":"IF(P568=\"\",$S$571-SUM(OFFSET($S$549:S566,0,0,COUNTA($S$549:S566),1)),SUMIF($R$19:$R$497,$P567,$W$19:$W$497))","v":0},null,null,{"$f":"IF(P568=\"\",$V$571-SUM(OFFSET($V$549:V566,0,0,COUNTA($V$549:V566),1)),ROUND(S567*(1+BDI.Taxa),2))","v":0},null,{"$f":"IF(P568=\"\",$X$571-SUM(OFFSET($X$549:X566,0,0,COUNTA($X$549:X566),1)),ROUND(V567*100/ORÇAMENTO.TotalOrçamento,2))","v":{"$error":"#DIV/0!"}}]
[null,null,null,null,null,null,null,null,null,null,null,null,null,null,"19.","",null,null,{"$f":"IF(P569=\"\",$S$571-SUM(OFFSET($S$549:S567,0,0,COUNTA($S$549:S567),1)),SUMIF($R$19:$R$497,$P568,$W$19:$W$497))","v":0},null,null,{"$f":"IF(P569=\"\",$V$571-SUM(OFFSET($V$549:V567,0,0,COUNTA($V$549:V567),1)),ROUND(S568*(1+BDI.Taxa),2))","v":0},null,{"$f":"IF(P569=\"\",$X$571-SUM(OFFSET($X$549:X567,0,0,COUNTA($X$549:X567),1)),ROUND(V568*100/ORÇAMENTO.TotalOrçamento,2))","v":{"$error":"#DIV/0!"}}]
[null,null,null,null,null,null,null,null,null,null,null,null,null,null,"20.","",null,null,{"$f":"IF(P570=\"\",$S$571-SUM(OFFSET($S$549:S568,0,0,COUNTA($S$549:S568),1)),SUMIF($R$19:$R$497,$P569,$W$19:$W$497))","v":0},null,null,{"$f":"IF(P570=\"\",$V$571-SUM(OFFSET($V$549:V568,0,0,COUNTA($V$549:V568),1)),ROUND(S569*(1+BDI.Taxa),2))","v":0},null,{"$f":"IF(P570=\"\",$X$571-SUM(OFFSET($X$549:X568,0,0,COUNTA($X$549:X568),1)),ROUND(V569*100/ORÇAMENTO.TotalOrçamento,2))","v":{"$error":"#DIV/0!"}}]
[null,null,null,null,null,null,null,null,null,null,null,null,null,null,"TOTAL GERAL DO ORÇAMENTO (R$)",null,null,null,{"$f":"SUM(S550:U569)","v":0},null,null,{"$f":"SUM(V550:W569)","v":0},null,{"$f":"SUM(X550:X569)","v":{"$error":"#DIV/0!"}}]
[null,null,null,null,null,null,null,null,null,null,null,null,null,null,null,null,null,null,{"$f":"$W$498","v":0},null,null,{"$f":"$W$500","v":0},null,100]
[null,null,null,null,null,null,null,null,null,null,null,null,null,null,null,null,null,null,"(TOTAL SEM BDI)",null,null,"(TOTAL COM BDI)",null,"(ARRED porcentagem)"]
[null,null,null,null,null,null,null,null,null,null,null,null,null,null,null,null,null,null,{"$f":"IF(AND(S570=S571,S570>0),\"OK\",\"ERRO\")","v":"ERRO"},null,null,{"$f":"IF(AND(V570=V571,V570>0),\"OK\",\"ERRO\")","v":"ERRO"},null,{"$f":"IF(AND(X570=100,S550<>0),\"OK\",\"ERRO\")","v":{"$error":"#DIV/0!"}}]

{"sheet":"Resumo ","index":1,"n_rows":39,"n_cols":9,"rows_kept":39,"cut":false,"hidden":false,"merged":[[13,0,14,0],[34,2,34,3],[35,2,35,3],[31,2,31,3],[32,2,32,3],[33,2,33,3],[28,2,28,3],[29,2,29,3],[30,2,30,3],[0,1,0,8],[36,1,36,5],[2,1,2,5],[3,1,3,5],[5,1,5,5],[6,1,6,5],[8,1,8,5],[9,1,9,5],[11,3,11,5],[12,3,12,5],[10,1,10,8],[11,6,11,8],[12,6,12,8],[25,2,25,3],[21,2,21,3],[22,2,22,3],[6,6,6,8],[7,1,7,8],[8,6,8,8],[9,6,9,8],[13,1,13,8],[1,1,1,8],[2,6,2,8],[3,6,3,8],[4,1,4,8],[5,6,5,8],[42,3,42,7],[11,1,11,2],[12,1,12,2],[15,2,15,3],[16,2,16,3],[14,1,14,8],[17,2,17,3],[23,2,23,3],[18,2,18,3],[19,2,19,3],[20,2,20,3],[41,3,41,7],[24,2,24,3],[26,2,26,3],[27,2,27,3],[38,1,38,8]]}
[]
[]
[null,"UNIDADE ESCOLAR",null,null,null,null,"CÓDIGO INEP"]
[null,{"$f":"Orçamento!$O$4","v":"CENTRO DE ENSINO EM PERÍODO INTEGRAL NOVO HORIZONTE"},null,null,null,null,{"$f":"Orçamento!V4","v":52033945}]
[]
[null,"OBRA",null,null,null,null,"CIDADE"]
[null,{"$f":"Orçamento!$O$7","v":"REFORMA E AMPLIAÇÃO"},null,null,null,null,{"$f":"Orçamento!$V$7","v":"GOIÂNIA"}]
[]
[null,"ENDEREÇO",null,null,null,null,"CRE"]
[null,{"$f":"Orçamento!$R$10","v":"ALAMEDA DAS PALMEIRAS, QD. 51-A S/N, NOVO HORIZONTE, CEP:74363-810"},null,null,null,null,{"$f":"Orçamento!$O$10","v":"GOIÂNIA"}]
[]
[null,"REFERÊNCIA",null,"DATA",null,null,"ÁREA TOTAL CONSTRUÍDA (M²)"]
[null,{"$f":"CONCATENATE(\"AGETOP E SINAPI - \",Orçamento!$W$10)","v":"AGETOP E SINAPI - DESONERADA"},null,{"$f":"Orçamento!$S$7","v":"2020-04-16"},null,null,{"$f":"Orçamento!$S$13","v":2682.79}]
["FILTRO"]
[null,"RESUMO GERAL DO ORÇAMENTO"]
["↓","ITEM","DESCRIÇÃO DOS SERVIÇOS",null,"UNID","QUANT","PREÇO SEM BDI","PREÇO COM BDI","PARTICIP. (%)"]
[{"$f":"IF(E17>0,\"F\",\"\")","v":"F"},"1.",{"$f":"Orçamento!$P550","v":"REFORMA"},null,"UN ",1,{"$f":"IFERROR(Orçamento!S550,\"-\")","v":0},{"$f":"IFERROR(Orçamento!V550,\"\")","v":0},{"$f":"Orçamento!X550","v":{"$error":"#DIV/0!"}}]
[{"$f":"IF(E18>0,\"F\",\"\")","v":"F"},"2.",{"$f":"Orçamento!$P551","v":"IMPLANTAÇÃO"},null,"UN ",1,{"$f":"IFERROR(Orçamento!S551,\"-\")","v":0},{"$f":"IFERROR(Orçamento!V551,\"\")","v":0},{"$f":"Orçamento!X551","v":{"$error":"#DIV/0!"}}]
["F","3.",{"$f":"Orçamento!$P552","v":"VESTIÁRIO PADRÃO SEDUC 2019"},null,"UN ",1,{"$f":"IFERROR(Orçamento!S552,\"-\")","v":0},{"$f":"IFERROR(Orçamento!V552,\"\")","v":0},{"$f":"Orçamento!X552","v":{"$error":"#DIV/0!"}}]
["","4.",{"$f":"Orçamento!$P553","v":""},null,null,null,{"$f":"IFERROR(Orçamento!S553,\"-\")","v":0},{"$f":"IFERROR(Orçamento!V553,\"\")","v":0},{"$f":"Orçamento!X553","v":{"$error":"#DIV/0!"}}]
["","5.",{"$f":"Orçamento!$P554","v":""},null,null,null,{"$f":"IFERROR(Orçamento!S554,\"-\")","v":0},{"$f":"IFERROR(Orçamento!V554,\"\")","v":0},{"$f":"Orçamento!X554","v":{"$error":"#DIV/0!"}}]
["","6.",{"$f":"Orçamento!$P555","v":""},null,null,null,{"$f":"IFERROR(Orçamento!S555,\"-\")","v":0},{"$f":"IFERROR(Orçamento!V555,\"\")","v":0},{"$f":"Orçamento!X555","v":{"$error":"#DIV/0!"}}]
["","7.",{"$f":"Orçamento!$P556","v":""},null,null,null,{"$f":"IFERROR(Orçamento!S556,\"-\")","v":0},{"$f":"IFERROR(Orçamento!V556,\"\")","v":0},{"$f":"Orçamento!X556","v":{"$error":"#DIV/0!"}}]
["","8.",{"$f":"Orçamento!$P557","v":""},null,null,null,{"$f":"IFERROR(Orçamento!S557,\"-\")","v":0},{"$f":"IFERROR(Orçamento!V557,\"\")","v":0},{"$f":"Orçamento!X557","v":{"$error":"#DIV/0!"}}]
["","9.",{"$f":"Orçamento!$P558","v":""},null,null,null,{"$f":"IFERROR(Orçamento!S558,\"-\")","v":0},{"$f":"IFERROR(Orçamento!V558,\"\")","v":0},{"$f":"Orçamento!X558","v":{"$error":"#DIV/0!"}}]
["","10.",{"$f":"Orçamento!$P559","v":""},null,null,null,{"$f":"IFERROR(Orçamento!S559,\"-\")","v":0},{"$f":"IFERROR(Orçamento!V559,\"\")","v":0},{"$f":"Orçamento!X559","v":{"$error":"#DIV/0!"}}]
["","11.",{"$f":"Orçamento!$P560","v":""},null,null,null,{"$f":"IFERROR(Orçamento!S560,\"-\")","v":0},{"$f":"IFERROR(Orçamento!V560,\"\")","v":0},{"$f":"Orçamento!X560","v":{"$error":"#DIV/0!"}}]
["","12.",{"$f":"Orçamento!$P561","v":""},null,null,null,{"$f":"IFERROR(Orçamento!S561,\"-\")","v":0},{"$f":"IFERROR(Orçamento!V561,\"\")","v":0},{"$f":"Orçamento!X561","v":{"$error":"#DIV/0!"}}]
["","13.",{"$f":"Orçamento!$P562","v":""},null,null,null,{"$f":"IFERROR(Orçamento!S562,\"-\")","v":0},{"$f":"IFERROR(Orçamento!V562,\"\")","v":0},{"$f":"Orçamento!X562","v":{"$error":"#DIV/0!"}}]
["","14.",{"$f":"Orçamento!$P563","v":""},null,null,null,{"$f":"IFERROR(Orçamento!S563,\"-\")","v":0},{"$f":"IFERROR(Orçamento!V563,\"\")","v":0},{"$f":"Orçamento!X563","v":{"$error":"#DIV/0!"}}]
["","15.",{"$f":"Orçamento!$P564","v":""},null,null,null,{"$f":"IFERROR(Orçamento!S564,\"-\")","v":0},{"$f":"IFERROR(Orçamento!V564,\"\")","v":0},{"$f":"Orçamento!X564","v":{"$error":"#DIV/0!"}}]
["","16.",{"$f":"Orçamento!$P565","v":""},null,null,null,{"$f":"IFERROR(Orçamento!S565,\"-\")","v":0},{"$f":"IFERROR(Orçamento!V565,\"\")","v":0},{"$f":"Orçamento!X565","v":{"$error":"#DIV/0!"}}]
["","17.",{"$f":"Orçamento!$P566","v":""},null,null,null,{"$f":"IFERROR(Orçamento!S566,\"-\")","v":0},{"$f":"IFERROR(Orçamento!V566,\"\")","v":0},{"$f":"Orçamento!X566","v":{"$error":"#DIV/0!"}}]
["","18.",{"$f":"Orçamento!$P567","v":""},null,null,null,{"$f":"IFERROR(Orçamento!S567,\"-\")","v":0},{"$f":"IFERROR(Orçamento!V567,\"\")","v":0},{"$f":"Orçamento!X567","v":{"$error":"#DIV/0!"}}]
["","19.",{"$f":"Orçamento!$P568","v":""},null,null,null,{"$f":"IFERROR(Orçamento!S568,\"-\")","v":0},{"$f":"IFERROR(Orçamento!V568,\"\")","v":0},{"$f":"Orçamento!X568","v":{"$error":"#DIV/0!"}}]
["","20.",{"$f":"Orçamento!$P569","v":""},null,null,null,{"$f":"IFERROR(Orçamento!S569,\"-\")","v":0},{"$f":"IFERROR(Orçamento!V569,\"\")","v":0},{"$f":"Orçamento!X569","v":{"$error":"#DIV/0!"}}]
["F","TOTAL GERAL DO ORÇAMENTO (R$)",null,null,null,null,{"$f":"SUM(G17:G36)","v":0},0,{"$f":"SUM(I17:I36)","v":{"$error":"#DIV/0!"}}]
["F"]
["F"]

{"sheet":"Somatório","index":2,"n_rows":45,"n_cols":6,"rows_kept":45,"cut":false,"hidden":false,"merged":[[13,0,14,0],[42,1,42,2],[44,1,44,5],[47,3,47,5],[48,3,48,5],[13,1,13,5],[9,1,9,3],[9,4,9,5],[11,1,11,2],[11,4,11,5],[12,1,12,2],[12,4,12,5],[0,1,0,5],[14,1,14,5],[2,1,2,3],[2,4,2,5],[3,1,3,3],[3,4,3,5],[5,1,5,3],[5,4,5,5],[6,1,6,3],[6,4,6,5],[8,1,8,3],[8,4,8,5],[1,1,1,5],[4,1,4,5],[7,1,7,5],[10,1,10,5]]}
[]
[]
[null,"UNIDADE ESCOLAR",null,null,"CÓDIGO INEP"]
[null,{"$f":"Orçamento!$O$4","v":"CENTRO DE ENSINO EM PERÍODO INTEGRAL NOVO HORIZONTE"},null,null,{"$f":"Orçamento!V4","v":52033945}]
[]
[null,"OBRA",null,null,"CIDADE"]
[null,{"$f":"Orçamento!$O$7","v":"REFORMA E AMPLIAÇÃO"},null,null,{"$f":"Orçamento!$V$7","v":"GOIÂNIA"}]
[]
[null,"ENDEREÇO",null,null,"CRE"]
[null,{"$f":"Orçamento!$R$10","v":"ALAMEDA DAS PALMEIRAS, QD. 51-A S/N, NOVO HORIZONTE, CEP:74363-810"},null,null,{"$f":"Orçamento!$O$10","v":"GOIÂNIA"}]
[]
[null,"REFERÊNCIA",null,"DATA","ÁREA TOTAL CONSTRUÍDA (M²)"]
[null,{"$f":"CONCATENATE(\"AGETOP E SINAPI - \",Orçamento!$W$10)","v":"AGETOP E SINAPI - DESONERADA"},null,{"$f":"Orçamento!$S$7","v":"2020-04-16"},{"$f":"Orçamento!$S$13","v":2682.79}]
["FILTRO"]
[null,"SOMATÓRIO DE SERVIÇOS"]
["↓","ITEM","DESCRIÇÃO DOS SERVIÇOS","PREÇO SEM BDI (R$)","PREÇO COM BDI (R$)","PARTIC.  ( % )"]
[{"$f":"IF(D17>0,\"F\",\"\")","v":""},"a.",{"$f":"Orçamento!P516","v":"SERVIÇOS PRELIMINARES"},{"$f":"Orçamento!S516","v":0},{"$f":"Orçamento!V516","v":0},{"$f":"Orçamento!X516","v":0}]
[{"$f":"IF(D18>0,\"F\",\"\")","v":""},"b.",{"$f":"Orçamento!P517","v":"TRANSPORTES"},{"$f":"Orçamento!S517","v":0},{"$f":"Orçamento!V517","v":0},{"$f":"Orçamento!X517","v":0}]
["","c.",{"$f":"Orçamento!P518","v":"SERVIÇO EM TERRA"},{"$f":"Orçamento!S518","v":0},{"$f":"Orçamento!V518","v":0},{"$f":"Orçamento!X518","v":0}]
["","d.",{"$f":"Orçamento!P519","v":"FUNDAÇÕES E SONDAGENS"},{"$f":"Orçamento!S519","v":0},{"$f":"Orçamento!V519","v":0},{"$f":"Orçamento!X519","v":0}]
["","e.",{"$f":"Orçamento!P520","v":"ESTRUTURA"},{"$f":"Orçamento!S520","v":0},{"$f":"Orçamento!V520","v":0},{"$f":"Orçamento!X520","v":0}]
["","f.",{"$f":"Orçamento!P521","v":"INSTALAÇÕES ELÉTRICAS"},{"$f":"Orçamento!S521","v":0},{"$f":"Orçamento!V521","v":0},{"$f":"Orçamento!X521","v":0}]
["","g.",{"$f":"Orçamento!P522","v":"INSTALAÇÕES HIDROSSANITÁRIAS"},{"$f":"Orçamento!S522","v":0},{"$f":"Orçamento!V522","v":0},{"$f":"Orçamento!X522","v":0}]
["","h.",{"$f":"Orçamento!P523","v":"INSTALAÇÕES ESPECIAIS"},{"$f":"Orçamento!S523","v":0},{"$f":"Orçamento!V523","v":0},{"$f":"Orçamento!X523","v":0}]
["","i.",{"$f":"Orçamento!P524","v":"ALVENARIAS E DIVISÓRIAS"},{"$f":"Orçamento!S524","v":0},{"$f":"Orçamento!V524","v":0},{"$f":"Orçamento!X524","v":0}]
["","j.",{"$f":"Orçamento!P525","v":"ALVENARIA AUTO-PORTANTE"},{"$f":"Orçamento!S525","v":0},{"$f":"Orçamento!V525","v":0},{"$f":"Orçamento!X525","v":0}]
["","k.",{"$f":"Orçamento!P526","v":"IMPERMEABILIZAÇÃO"},{"$f":"Orçamento!S526","v":0},{"$f":"Orçamento!V526","v":0},{"$f":"Orçamento!X526","v":0}]
["","l.",{"$f":"Orçamento!P527","v":"ISOLAMENTO TÉRMICO E ACÚSTICO"},{"$f":"Orçamento!S527","v":0},{"$f":"Orçamento!V527","v":0},{"$f":"Orçamento!X527","v":0}]
["","m.",{"$f":"Orçamento!P528","v":"ESTRUTURA DE MADEIRA"},{"$f":"Orçamento!S528","v":0},{"$f":"Orçamento!V528","v":0},{"$f":"Orçamento!X528","v":0}]
["","n.",{"$f":"Orçamento!P529","v":"ESTRUTURAS METÁLICAS"},{"$f":"Orçamento!S529","v":0},{"$f":"Orçamento!V529","v":0},{"$f":"Orçamento!X529","v":0}]
["","o.",{"$f":"Orçamento!P530","v":"COBERTURAS"},{"$f":"Orçamento!S530","v":0},{"$f":"Orçamento!V530","v":0},{"$f":"Orçamento!X530","v":0}]
["","p.",{"$f":"Orçamento!P531","v":"ESQUADRIAS DE MADEIRA"},{"$f":"Orçamento!S531","v":0},{"$f":"Orçamento!V531","v":0},{"$f":"Orçamento!X531","v":0}]
["","q.",{"$f":"Orçamento!P532","v":"ESQUADRIAS METÁLICAS"},{"$f":"Orçamento!S532","v":0},{"$f":"Orçamento!V532","v":0},{"$f":"Orçamento!X532","v":0}]
["","r.",{"$f":"Orçamento!P533","v":"VIDROS"},{"$f":"Orçamento!S533","v":0},{"$f":"Orçamento!V533","v":0},{"$f":"Orçamento!X533","v":0}]
["","s.",{"$f":"Orçamento!P534","v":"REVESTIMENTO DE PAREDE"},{"$f":"Orçamento!S534","v":0},{"$f":"Orçamento!V534","v":0},{"$f":"Orçamento!X534","v":0}]
["","t.",{"$f":"Orçamento!P535","v":"FORROS"},{"$f":"Orçamento!S535","v":0},{"$f":"Orçamento!V535","v":0},{"$f":"Orçamento!X535","v":0}]
["","u.",{"$f":"Orçamento!P536","v":"REVESTIMENTO DE PISO"},{"$f":"Orçamento!S536","v":0},{"$f":"Orçamento!V536","v":0},{"$f":"Orçamento!X536","v":0}]
["","v.",{"$f":"Orçamento!P537","v":"FERRAGENS"},{"$f":"Orçamento!S537","v":0},{"$f":"Orçamento!V537","v":0},{"$f":"Orçamento!X537","v":0}]
["","w.",{"$f":"Orçamento!P538","v":"MARCENARIA"},{"$f":"Orçamento!S538","v":0},{"$f":"Orçamento!V538","v":0},{"$f":"Orçamento!X538","v":0}]
["","x.",{"$f":"Orçamento!P539","v":"ADMINISTRAÇÃO"},{"$f":"Orçamento!S539","v":0},{"$f":"Orçamento!V539","v":0},{"$f":"Orçamento!X539","v":0}]
["","y.",{"$f":"Orçamento!P540","v":"PINTURA"},{"$f":"Orçamento!S540","v":0},{"$f":"Orçamento!V540","v":0},{"$f":"Orçamento!X540","v":0}]
["","z.",{"$f":"Orçamento!P541","v":"DIVERSOS"},{"$f":"Orçamento!S541","v":0},{"$f":"Orçamento!V541","v":0},{"$f":"Orçamento!X541","v":0}]
["F","TOTAL GERAL DO ORÇAMENTO",null,{"$f":"SUM(D17:D42)","v":0},{"$f":"SUM(E17:E42)","v":0},{"$f":"SUM(F17:F42)","v":0}]
[]
[null,"(*) Para itens da AGETOP, os vidros não estão inclusos nas esquadrias e já foram considerados os custos de contramarco para as esquadrias de alumínio;"]

{"sheet":"Cronog_90_Dias","index":3,"n_rows":99,"n_cols":22,"rows_kept":99,"cut":false,"hidden":false,"merged":[[0,1,0,17],[1,1,1,17],[2,1,2,7],[2,8,2,17],[3,1,3,7],[3,8,3,17],[8,1,8,7],[8,8,8,17],[9,0,11,0],[9,1,9,7],[9,8,9,17],[10,1,10,17],[11,1,11,17],[4,1,4,17],[5,1,5,7],[5,8,5,17],[6,1,6,7],[6,8,6,17],[7,1,7,17],[12,0,13,0],[12,3,13,3],[12,5,12,8],[12,9,12,12],[12,13,12,16],[12,17,13,17],[13,1,13,2],[13,5,13,8],[13,9,13,12],[13,13,13,16],[14,1,16,2],[14,3,16,3],[14,4,16,4],[14,5,14,8],[14,9,14,12],[14,13,14,16],[16,5,16,8],[16,9,16,12],[16,13,16,16],[17,1,19,2],[17,3,19,3],[17,4,19,4],[17,5,17,8],[17,9,17,12],[17,13,17,16],[19,5,19,8],[19,9,19,12],[19,13,19,16],[20,1,22,2],[20,3,22,3],[20,4,22,4],[20,5,20,8],[20,9,20,12],[20,13,20,16],[22,5,22,8],[22,9,22,12],[22,13,22,16],[23,1,25,2],[23,3,25,3],[23,4,25,4],[23,5,23,8],[23,9,23,12],[23,13,23,16],[25,5,25,8],[25,9,25,12],[25,13,25,16],[26,1,28,2],[26,3,28,3],[26,4,28,4],[26,5,26,8],[26,9,26,12],[26,13,26,16],[28,5,28,8],[28,9,28,12],[28,13,28,16],[29,1,31,2],[29,3,31,3],[29,4,31,4],[29,5,29,8],[29,9,29,12],[29,13,29,16],[31,5,31,8],[31,9,31,12],[31,13,31,16],[32,1,34,2],[32,3,34,3],[32,4,34,4],[32,5,32,8],[32,9,32,12],[32,13,32,16],[34,5,34,8],[34,9,34,12],[34,13,34,16],[35,1,37,2],[35,3,37,3],[35,4,37,4],[35,5,35,8],[35,9,35,12],[35,13,35,16],[37,5,37,8],[37,9,37,12],[37,13,37,16],[38,1,40,2],[38,3,40,3],[38,4,40,4],[38,5,38,8],[38,9,38,12],[38,13,38,16],[40,5,40,8],[40,9,40,12],[40,13,40,16],[41,1,43,2],[41,3,43,3],[41,4,43,4],[41,5,41,8],[41,9,41,12],[41,13,41,16],[43,5,43,8],[43,9,43,12],[43,13,43,16],[44,1,46,2],[44,3,46,3],[44,4,46,4],[44,5,44,8],[44,9,44,12],[44,13,44,16],[46,5,46,8],[46,9,46,12],[46,13,46,16],[47,1,49,2],[47,3,49,3],[47,4,49,4],[47,5,47,8],[47,9,47,12],[47,13,47,16],[49,5,49,8],[49,9,49,12],[49,13,49,16],[50,1,52,2],[50,3,52,3],[50,4,52,4],[50,5,50,8],[50,9,50,12],[50,13,50,16],[52,5,52,8],[52,9,52,12],[52,13,52,16],[53,1,55,2],[53,3,55,3],[53,4,55,4],[53,5,53,8],[53,9,53,12],[53,13,53,16],[55,5,55,8],[55,9,55,12],[55,13,55,16],[56,1,58,2],[56,3,58,3],[56,4,58,4],[56,5,56,8],[56,9,56,12],[56,13,56,16],[58,5,58,8],[58,9,58,12],[58,13,58,16],[59,1,61,2],[59,3,61,3],[59,4,61,4],[59,5,59,8],[59,9,59,12],[59,13,59,16],[61,5,61,8],[61,9,61,12],[61,13,61,16],[62,1,64,2],[62,3,64,3],[62,4,64,4],[62,5,62,8],[62,9,62,12],[62,13,62,16],[64,5,64,8],[64,9,64,12],[64,13,64,16],[65,1,67,2],[65,3,67,3],[65,4,67,4],[65,5,65,8],[65,9,65,12],[65,13,65,16],[67,5,67,8],[67,9,67,12],[67,13,67,16],[68,1,70,2],[68,3,70,3],[68,4,70,4],[68,5,68,8],[68,9,68,12],[68,13,68,16],[70,5,70,8],[70,9,70,12],[70,13,70,16],[71,1,73,2],[71,3,73,3],[71,4,73,4],[71,5,71,8],[71,9,71,12],[71,13,71,16],[73,5,73,8],[73,9,73,12],[73,13,73,16],[74,1,76,2],[74,3,76,3],[74,4,76,4],[74,5,74,8],[74,9,74,12],[74,13,74,16],[76,5,76,8],[76,9,76,12],[76,13,76,16],[77,1,79,2],[77,3,79,3],[77,4,79,4],[77,5,77,8],[77,9,77,12],[77,13,77,16],[79,5,79,8],[79,9,79,12],[79,13,79,16],[80,1,82,2],[80,3,82,3],[80,4,82,4],[80,5,80,8],[80,9,80,12],[80,13,80,16],[82,5,82,8],[82,9,82,12],[82,13,82,16],[83,1,85,2],[83,3,85,3],[83,4,85,4],[83,5,83,8],[83,9,83,12],[83,13,83,16],[85,5,85,8],[85,9,85,12],[85,13,85,16],[86,1,88,2],[86,3,88,3],[86,4,88,4],[86,5,86,8],[86,9,86,12],[86,13,86,16],[88,5,88,8],[88,9,88,12],[88,13,88,16],[92,1,92,2],[92,5,92,8],[92,9,92,12],[92,13,92,16],[93,1,93,2],[93,5,93,8],[93,9,93,12],[93,13,93,16],[89,1,91,2],[89,3,91,3],[89,4,91,4],[89,5,89,8],[89,9,89,12],[89,13,89,16],[91,5,91,8],[91,9,91,12],[91,13,91,16],[97,1,97,4],[98,1,98,17],[94,1,94,2],[94,5,94,8],[94,9,94,12],[94,13,94,16],[95,1,95,2],[95,5,95,8],[95,9,95,12],[95,13,95,16]]}
[]
[]
[null,"UNIDADE ESCOLAR",null,null,null,null,null,null,"PRAZO"]
[null,{"$f":"Orçamento!$O$4","v":"CENTRO DE ENSINO EM PERÍODO INTEGRAL NOVO HORIZONTE"},null,null,null,null,null,null,"90 DIAS CORRIDOS"]
[]
[null,"OBRA",null,null,null,null,null,null,"DATA"]
[null,{"$f":"Orçamento!$O$7","v":"REFORMA E AMPLIAÇÃO"},null,null,null,null,null,null,{"$f":"Orçamento!$S$7","v":"2020-04-16"}]
[]
[null,"LOCAL",null,null,null,null,null,null,"ÁREA TOTAL CONSTRUÍDA (M²)"]
["FILTRO",{"$f":"Orçamento!$V$7","v":"GOIÂNIA"},null,null,null,null,null,null,{"$f":"Orçamento!$S$13","v":2682.79}]
[]
[null,"CRONOGRAMA - FÍSICO FINANCEIRO"]
["↓","CUSTO TOTAL:",{"$f":"D93","v":0},"VALOR","Dias:",30,null,null,null,60,null,null,null,90,null,null,null,"TOTAL"]
[null,"DESCRIÇÃO DOS SERVIÇOS",null,null,"%","1ª PARCELA",null,null,null,"2ª PARCELA",null,null,null,"3ª PARCELA"]
[{"$f":"IF(D15>0,\"F\",\"\")","v":""},"SERVIÇOS PRELIMINARES",null,{"$f":"Orçamento!V516","v":0},{"$f":"Orçamento!X516","v":0},{"$f":"ROUND(F17*$D$15,2)","v":0},null,null,null,{"$f":"ROUND(J17*$D$15,2)","v":0},null,null,null,{"$f":"ROUND(N17*$D$15,2)","v":0},null,null,null,{"$f":"SUM(F15:Q15)","v":0},null,{"$f":"IF(R15=D15,\"OK\",\"ERRO\")","v":"OK"}]
[{"$f":"IF(A15=\"F\",A15,\"\")","v":""}]
[{"$f":"IF(A16=\"F\",A16,\"\")","v":""},null,null,null,null,1,null,null,null,null,null,null,null,{"$f":"1-F17","v":0},null,null,null,{"$f":"IFERROR(E15/100,\"\")","v":0},null,{"$f":"IF(E15%=R17,\"OK\",\"ERRADO\")","v":"OK"}]
[{"$f":"IF(D18>0,\"F\",\"\")","v":""},"TRANSPORTES",null,{"$f":"Orçamento!V517","v":0},{"$f":"Orçamento!X517","v":0},{"$f":"ROUND(F20*$D$18,2)","v":0},null,null,null,{"$f":"ROUND(J20*$D$18,2)","v":0},null,null,null,{"$f":"ROUND(N20*$D$18,2)-0.01","v":-0.01},null,null,null,{"$f":"SUM(F18:Q18)","v":-0.01},null,{"$f":"IF(R18=D18,\"OK\",\"ERRO\")","v":"ERRO"},null,1]
[{"$f":"IF(A18=\"F\",A18,\"\")","v":""}]
[{"$f":"IF(A19=\"F\",A19,\"\")","v":""},null,null,null,null,0.35,null,null,null,0.35,null,null,null,0.3,null,null,null,{"$f":"IFERROR(E18/100,\"\")","v":0},null,{"$f":"IF(E18%=R20,\"OK\",\"ERRADO\")","v":"OK"}]
[{"$f":"IF(D21>0,\"F\",\"\")","v":""},"SERVIÇO EM TERRA",null,{"$f":"Orçamento!V518","v":0},{"$f":"Orçamento!X518","v":0},{"$f":"ROUND(F23*$D$21,2)","v":0},null,null,null,{"$f":"ROUND(J23*$D$21,2)","v":0},null,null,null,{"$f":"ROUND(N23*$D$21,2)","v":0},null,null,null,{"$f":"SUM(F21:Q21)","v":0},null,{"$f":"IF(R21=D21,\"OK\",\"ERRO\")","v":"OK"}]
[{"$f":"IF(A21=\"F\",A21,\"\")","v":""}]
[{"$f":"IF(A22=\"F\",A22,\"\")","v":""},null,null,null,null,1,null,null,null,null,null,null,null,{"$f":"1-F23","v":0},null,null,null,{"$f":"IFERROR(E21/100,\"\")","v":0},null,{"$f":"IF(E21%=R23,\"OK\",\"ERRADO\")","v":"OK"}]
[{"$f":"IF(D24>0,\"F\",\"\")","v":""},"FUNDAÇÕES E SONDAGENS",null,{"$f":"Orçamento!V519","v":0},{"$f":"Orçamento!X519","v":0},{"$f":"ROUND(F26*$D$24,2)","v":0},null,null,null,{"$f":"ROUND(J26*$D$24,2)","v":0},null,null,null,{"$f":"ROUND(N26*$D$24,2)","v":0},null,null,null,{"$f":"SUM(F24:Q24)","v":0},null,{"$f":"IF(R24=D24,\"OK\",\"ERRO\")","v":"OK"}]
[{"$f":"IF(A24=\"F\",A24,\"\")","v":""}]
[{"$f":"IF(A25=\"F\",A25,\"\")","v":""},null,null,null,null,0.8,null,null,null,0.2,null,null,null,null,null,null,null,{"$f":"IFERROR(E24/100,\"\")","v":0},null,{"$f":"IF(E24%=R26,\"OK\",\"ERRADO\")","v":"OK"}]
[{"$f":"IF(D27>0,\"F\",\"\")","v":""},"ESTRUTURA",null,{"$f":"Orçamento!V520","v":0},{"$f":"Orçamento!X520","v":0},{"$f":"ROUND(F29*$D$27,2)","v":0},null,null,null,{"$f":"ROUND(J29*$D$27,2)","v":0},null,null,null,{"$f":"ROUND(N29*$D$27,2)","v":0},null,null,null,{"$f":"SUM(F27:Q27)","v":0},null,{"$f":"IF(R27=D27,\"OK\",\"ERRO\")","v":"OK"}]
[{"$f":"IF(A27=\"F\",A27,\"\")","v":""}]
[{"$f":"IF(A28=\"F\",A28,\"\")","v":""},null,null,null,null,0.2,null,null,null,0.8,null,null,null,null,null,null,null,{"$f":"IFERROR(E27/100,\"\")","v":0},null,{"$f":"IF(E27%=R29,\"OK\",\"ERRADO\")","v":"OK"}]
[{"$f":"IF(D30>0,\"F\",\"\")","v":""},"INST.ELET/TELEFÔNICA/CABEAMENTO ESTRUTURADO",null,{"$f":"Orçamento!V521","v":0},{"$f":"Orçamento!X521","v":0},{"$f":"ROUND(F32*$D$30,2)","v":0},null,null,null,{"$f":"ROUND(J32*$D$30,2)","v":0},null,null,null,{"$f":"ROUND(N32*$D$30,2)-0.01","v":-0.01},null,null,null,{"$f":"SUM(F30:Q30)","v":-0.01},null,{"$f":"IF(R30=D30,\"OK\",\"ERRO\")","v":"ERRO"},null,1]
[{"$f":"IF(A30=\"F\",A30,\"\")","v":""}]
[{"$f":"IF(A31=\"F\",A31,\"\")","v":""},null,null,null,null,0.4,null,null,null,0.35,null,null,null,0.25,null,null,null,{"$f":"IFERROR(E30/100,\"\")","v":0},null,{"$f":"IF(E30%=R32,\"OK\",\"ERRADO\")","v":"OK"}]
[{"$f":"IF(D33>0,\"F\",\"\")","v":""},"INSTALAÇÕES HIDROSSANITÁRIAS",null,{"$f":"Orçamento!V522","v":0},{"$f":"Orçamento!X522","v":0},{"$f":"ROUND(F35*$D$33,2)","v":0},null,null,null,{"$f":"ROUND(J35*$D$33,2)","v":0},null,null,null,{"$f":"ROUND(N35*$D$33,2)","v":0},null,null,null,{"$f":"SUM(F33:Q33)","v":0},null,{"$f":"IF(R33=D33,\"OK\",\"ERRO\")","v":"OK"}]
[{"$f":"IF(A33=\"F\",A33,\"\")","v":""}]
[{"$f":"IF(A34=\"F\",A34,\"\")","v":""},null,null,null,null,0.5,null,null,null,0.25,null,null,null,0.25,null,null,null,{"$f":"IFERROR(E33/100,\"\")","v":0},null,{"$f":"IF(E33%=R35,\"OK\",\"ERRADO\")","v":"OK"}]
[{"$f":"IF(D36>0,\"F\",\"\")","v":""},"INSTALAÇÕES ESPECIAIS",null,{"$f":"Orçamento!V523","v":0},{"$f":"Orçamento!X523","v":0},{"$f":"ROUND(F38*$D$36,2)","v":0},null,null,null,{"$f":"ROUND(J38*$D$36,2)","v":0},null,null,null,{"$f":"ROUND(N38*$D$36,2)","v":0},null,null,null,{"$f":"SUM(F36:Q36)","v":0},null,{"$f":"IF(R36=D36,\"OK\",\"ERRO\")","v":"OK"}]
[{"$f":"IF(A36=\"F\",A36,\"\")","v":""}]
[{"$f":"IF(A37=\"F\",A37,\"\")","v":""},null,null,null,null,0.5,null,null,null,0.2,null,null,null,{"$f":"1-F38-J38","v":0.3},null,null,null,{"$f":"IFERROR(E36/100,\"\")","v":0},null,{"$f":"IF(E36%=R38,\"OK\",\"ERRADO\")","v":"OK"}]
[{"$f":"IF(D39>0,\"F\",\"\")","v":""},"ALVENARIA E DIVISÓRIAS",null,{"$f":"Orçamento!V524","v":0},{"$f":"Orçamento!X524","v":0},{"$f":"D39-J39-N39","v":0},null,null,null,{"$f":"ROUND(J41*$D$39,2)","v":0},null,null,null,{"$f":"ROUND(N41*$D$39,2)","v":0},null,null,null,{"$f":"SUM(F39:Q39)","v":0},null,{"$f":"IF(R39=D39,\"OK\",\"ERRO\")","v":"OK"}]
[{"$f":"IF(A39=\"F\",A39,\"\")","v":""}]
[{"$f":"IF(A40=\"F\",A40,\"\")","v":""},null,null,null,null,0.55000000000000004,null,null,null,0.25,null,null,null,0.2,null,null,null,{"$f":"IFERROR(E39/100,\"\")","v":0},null,{"$f":"IF(E39%=R41,\"OK\",\"ERRADO\")","v":"OK"}]
[{"$f":"IF(D42>0,\"F\",\"\")","v":""},"ALVENARIA AUTO-PORTANTE",null,{"$f":"Orçamento!V525","v":0},{"$f":"Orçamento!X525","v":0},{"$f":"ROUND(F44*$D$42,2)","v":0},null,null,null,{"$f":"ROUND(J44*$D$42,2)","v":0},null,null,null,{"$f":"ROUND(N44*$D$42,2)","v":0},null,null,null,{"$f":"SUM(F42:Q42)","v":0}]
[{"$f":"IF(A42=\"F\",A42,\"\")","v":""}]
[{"$f":"IF(A43=\"F\",A43,\"\")","v":""},null,null,null,null,1,null,null,null,{"$f":"1-B44","v":1},null,null,null,{"$f":"1-F44","v":0},null,null,null,{"$f":"IFERROR(E42/100,\"\")","v":0}]
[{"$f":"IF(D45>0,\"F\",\"\")","v":""},"IMPERMEABILIZAÇÃO",null,{"$f":"Orçamento!V526","v":0},{"$f":"Orçamento!X526","v":0},{"$f":"ROUND(F47*$D$45,2)","v":0},null,null,null,{"$f":"ROUND(J47*$D$45,2)","v":0},null,null,null,{"$f":"ROUND(N47*$D$45,2)","v":0},null,null,null,{"$f":"SUM(F45:Q45)","v":0},null,{"$f":"IF(R45=D45,\"OK\",\"ERRO\")","v":"OK"}]
[{"$f":"IF(A45=\"F\",A45,\"\")","v":""}]
[{"$f":"IF(A46=\"F\",A46,\"\")","v":""},null,null,null,null,0.8,null,null,null,0.2,null,null,null,null,null,null,null,{"$f":"IFERROR(E45/100,\"\")","v":0},null,{"$f":"IF(E45%=R47,\"OK\",\"ERRADO\")","v":"OK"}]
[{"$f":"IF(D48>0,\"F\",\"\")","v":""},"ISOLAMENTO TÉRMICO E ACÚSTICO",null,{"$f":"Orçamento!V527","v":0},{"$f":"Orçamento!X527","v":0},{"$f":"ROUND(F50*$D$48,2)","v":0},null,null,null,{"$f":"ROUND(J50*$D$48,2)","v":0},null,null,null,{"$f":"ROUND(N50*$D$48,2)","v":0},null,null,null,{"$f":"SUM(F48:Q48)","v":0}]
[{"$f":"IF(A48=\"F\",A48,\"\")","v":""}]
[{"$f":"IF(A49=\"F\",A49,\"\")","v":""},null,null,null,null,0.5,null,null,null,{"$f":"1-B50","v":1},null,null,null,{"$f":"1-F50","v":0.5},null,null,null,{"$f":"IFERROR(E48/100,\"\")","v":0}]
[{"$f":"IF(D51>0,\"F\",\"\")","v":""},"ESTRUTURA DE MADEIRA",null,{"$f":"Orçamento!V528","v":0},{"$f":"Orçamento!X528","v":0},{"$f":"ROUND(F53*$D$51,2)","v":0},null,null,null,{"$f":"ROUND(J53*$D$51,2)","v":0},null,null,null,{"$f":"ROUND(N53*$D$51,2)","v":0},null,null,null,{"$f":"SUM(F51:Q51)","v":0},null,{"$f":"IF(R51=D51,\"OK\",\"ERRO\")","v":"OK"}]
[{"$f":"IF(A51=\"F\",A51,\"\")","v":""}]
[{"$f":"IF(A52=\"F\",A52,\"\")","v":""},null,null,null,null,0.2,null,null,null,0.8,null,null,null,null,null,null,null,{"$f":"IFERROR(E51/100,\"\")","v":0},null,{"$f":"IF(E51%=R53,\"OK\",\"ERRADO\")","v":"OK"}]
[{"$f":"IF(D54>0,\"F\",\"\")","v":""},"ESTRUTURA METÁLICA",null,{"$f":"Orçamento!V529","v":0},{"$f":"Orçamento!X529","v":0},{"$f":"ROUND(F56*$D$54,2)","v":0},null,null,null,{"$f":"ROUND(J56*$D$54,2)","v":0},null,null,null,{"$f":"ROUND(N56*$D$54,2)","v":0},null,null,null,{"$f":"SUM(F54:Q54)","v":0},null,{"$f":"IF(R54=D54,\"OK\",\"ERRO\")","v":"OK"}]
[{"$f":"IF(A54=\"F\",A54,\"\")","v":""}]
[{"$f":"IF(A55=\"F\",A55,\"\")","v":""},null,null,null,null,0.2,null,null,null,0.8,null,null,null,null,null,null,null,{"$f":"IFERROR(E54/100,\"\")","v":0},null,{"$f":"IF(E54%=R56,\"OK\",\"ERRADO\")","v":"OK"}]
[{"$f":"IF(D57>0,\"F\",\"\")","v":""},"COBERTURAS",null,{"$f":"Orçamento!V530","v":0},{"$f":"Orçamento!X530","v":0},{"$f":"ROUND(F59*$D$57,2)","v":0},null,null,null,{"$f":"ROUND(J59*$D$57,2)","v":0},null,null,null,{"$f":"ROUND(N59*$D$57,2)","v":0},null,null,null,{"$f":"SUM(F57:Q57)","v":0},null,{"$f":"IF(R57=D57,\"OK\",\"ERRO\")","v":"OK"}]
[{"$f":"IF(A57=\"F\",A57,\"\")","v":""}]
[{"$f":"IF(A58=\"F\",A58,\"\")","v":""},null,null,null,null,0,null,null,null,{"$f":"1-B59","v":1},null,null,null,null,null,null,null,{"$f":"IFERROR(E57/100,\"\")","v":0},null,{"$f":"IF(E57%=R59,\"OK\",\"ERRADO\")","v":"OK"}]
[{"$f":"IF(D60>0,\"F\",\"\")","v":""},"ESQUADRIAS DE MADEIRA",null,{"$f":"Orçamento!V531","v":0},{"$f":"Orçamento!X531","v":0},{"$f":"ROUND(F62*$D$60,2)","v":0},null,null,null,{"$f":"ROUND(J62*$D$60,2)","v":0},null,null,null,{"$f":"ROUND(N62*$D$60,2)","v":0},null,null,null,{"$f":"SUM(F60:Q60)","v":0}]
[{"$f":"IF(A60=\"F\",A60,\"\")","v":""}]
[{"$f":"IF(A61=\"F\",A61,\"\")","v":""},null,null,null,null,0.54,null,null,null,{"$f":"1-B62","v":1},null,null,null,{"$f":"1-F62","v":0.45999999999999996},null,null,null,{"$f":"IFERROR(E60/100,\"\")","v":0}]
[{"$f":"IF(D63>0,\"F\",\"\")","v":""},"ESQUADRIAS METÁLICAS",null,{"$f":"Orçamento!V532","v":0},{"$f":"Orçamento!X532","v":0},{"$f":"ROUND(F65*$D$63,2)","v":0},null,null,null,{"$f":"ROUND(J65*$D$63,2)","v":0},null,null,null,{"$f":"ROUND(N65*$D$63,2)","v":0},null,null,null,{"$f":"SUM(F63:Q63)","v":0},null,{"$f":"IF(R63=D63,\"OK\",\"ERRO\")","v":"OK"}]
[{"$f":"IF(A63=\"F\",A63,\"\")","v":""}]
[{"$f":"IF(A64=\"F\",A64,\"\")","v":""},null,null,null,null,null,null,null,null,null,null,null,null,1,null,null,null,{"$f":"IFERROR(E63/100,\"\")","v":0},null,{"$f":"IF(E63%=R65,\"OK\",\"ERRADO\")","v":"OK"}]
[{"$f":"IF(D66>0,\"F\",\"\")","v":""},"VIDROS",null,{"$f":"Orçamento!V533","v":0},{"$f":"Orçamento!X533","v":0},{"$f":"ROUND(F68*$D$66,2)","v":0},null,null,null,{"$f":"ROUND(J68*$D$66,2)","v":0},null,null,null,{"$f":"ROUND(N68*$D$66,2)","v":0},null,null,null,{"$f":"SUM(F66:Q66)","v":0},null,{"$f":"IF(R66=D66,\"OK\",\"ERRO\")","v":"OK"}]
[{"$f":"IF(A66=\"F\",A66,\"\")","v":""}]
[{"$f":"IF(A67=\"F\",A67,\"\")","v":""},null,null,null,null,0,null,null,null,null,null,null,null,{"$f":"1-F68","v":1},null,null,null,{"$f":"IFERROR(E66/100,\"\")","v":0},null,{"$f":"IF(E66%=R68,\"OK\",\"ERRADO\")","v":"OK"}]
[{"$f":"IF(D69>0,\"F\",\"\")","v":""},"REVESTIMENTO DE PAREDE",null,{"$f":"Orçamento!V534","v":0},{"$f":"Orçamento!X534","v":0},{"$f":"ROUND(F71*$D$69,2)","v":0},null,null,null,{"$f":"ROUND(J71*$D$69,2)","v":0},null,null,null,{"$f":"ROUND(N71*$D$69,2)","v":0},null,null,null,{"$f":"SUM(F69:Q69)","v":0},null,{"$f":"IF(R69=D69,\"OK\",\"ERRO\")","v":"OK"}]
[{"$f":"IF(A69=\"F\",A69,\"\")","v":""}]
[{"$f":"IF(A70=\"F\",A70,\"\")","v":""},null,null,null,null,0.55000000000000004,null,null,null,0.25,null,null,null,0.2,null,null,null,{"$f":"IFERROR(E69/100,\"\")","v":0},null,{"$f":"IF(E69%=R71,\"OK\",\"ERRADO\")","v":"OK"}]
[{"$f":"IF(D72>0,\"F\",\"\")","v":""},"FORROS",null,{"$f":"Orçamento!V535","v":0},{"$f":"Orçamento!X535","v":0},{"$f":"ROUND(F74*$D$72,2)","v":0},null,null,null,{"$f":"ROUND(J74*$D$72,2)","v":0},null,null,null,{"$f":"ROUND(N74*$D$72,2)","v":0},null,null,null,{"$f":"SUM(F72:Q72)","v":0},null,{"$f":"IF(R72=D72,\"OK\",\"ERRO\")","v":"OK"}]
[{"$f":"IF(A72=\"F\",A72,\"\")","v":""}]
[{"$f":"IF(A73=\"F\",A73,\"\")","v":""},null,null,null,null,null,null,null,null,null,null,null,null,{"$f":"1-F74","v":1},null,null,null,{"$f":"IFERROR(E72/100,\"\")","v":0},null,{"$f":"IF(E72%=R74,\"OK\",\"ERRADO\")","v":"OK"}]
[{"$f":"IF(D75>0,\"F\",\"\")","v":""},"REVESTIMENTO DE PISO",null,{"$f":"Orçamento!V536","v":0},{"$f":"Orçamento!X536","v":0},{"$f":"ROUND(F77*$D$75,2)","v":0},null,null,null,{"$f":"ROUND(J77*$D$75,2)","v":0},null,null,null,{"$f":"ROUND(N77*$D$75,2)","v":0},null,null,null,{"$f":"SUM(F75:Q75)","v":0},null,{"$f":"IF(R75=D75,\"OK\",\"ERRO\")","v":"OK"}]
[{"$f":"IF(A75=\"F\",A75,\"\")","v":""}]
[{"$f":"IF(A76=\"F\",A76,\"\")","v":""},null,null,null,null,0.5,null,null,null,0.3,null,null,null,0.2,null,null,null,{"$f":"IFERROR(E75/100,\"\")","v":0},null,{"$f":"IF(E75%=R77,\"OK\",\"ERRADO\")","v":"OK"}]
[{"$f":"IF(D78>0,\"F\",\"\")","v":""},"FERRAGENS",null,{"$f":"Orçamento!V537","v":0},{"$f":"Orçamento!X537","v":0},{"$f":"ROUND(F80*$D$78,2)","v":0},null,null,null,{"$f":"ROUND(J80*$D$78,2)","v":0},null,null,null,{"$f":"ROUND(N80*$D$78,2)","v":0},null,null,null,{"$f":"SUM(F78:Q78)","v":0},null,{"$f":"IF(R78=D78,\"OK\",\"ERRO\")","v":"OK"}]
[{"$f":"IF(A78=\"F\",A78,\"\")","v":""}]
[{"$f":"IF(A79=\"F\",A79,\"\")","v":""},null,null,null,null,0,null,null,null,null,null,null,null,{"$f":"1-F80","v":1},null,null,null,{"$f":"IFERROR(E78/100,\"\")","v":0},null,{"$f":"IF(E78%=R80,\"OK\",\"ERRADO\")","v":"OK"}]
[{"$f":"IF(D81>0,\"F\",\"\")","v":""},"MARCENARIA",null,{"$f":"Orçamento!V538","v":0},{"$f":"Orçamento!X538","v":0},{"$f":"ROUND(F83*$D$81,2)","v":0},null,null,null,{"$f":"ROUND(J83*$D$81,2)","v":0},null,null,null,{"$f":"ROUND(N83*$D$81,2)","v":0},null,null,null,{"$f":"SUM(F81:Q81)","v":0}]
[{"$f":"IF(A81=\"F\",A81,\"\")","v":""}]
[{"$f":"IF(A82=\"F\",A82,\"\")","v":""},null,null,null,null,null,null,null,null,null,null,null,null,{"$f":"1-F83","v":1},null,null,null,{"$f":"IFERROR(E81/100,\"\")","v":0}]
[{"$f":"IF(D84>0,\"F\",\"\")","v":""},"ADMINISTRAÇÃO - MENSALISTAS",null,{"$f":"Orçamento!V539","v":0},{"$f":"Orçamento!X539","v":0},{"$f":"ROUND(F86*$D$84,2)+0.01","v":0.01},null,null,null,{"$f":"ROUND(J86*$D$84,2)","v":0},null,null,null,{"$f":"ROUND(N86*$D$84,2)","v":0},null,null,null,{"$f":"SUM(F84:Q84)","v":0.01},null,{"$f":"IF(R84=D84,\"OK\",\"ERRO\")","v":"ERRO"},null,1]
[{"$f":"IF(A84=\"F\",A84,\"\")","v":""}]
[{"$f":"IF(A85=\"F\",A85,\"\")","v":""},null,null,null,null,0.34,null,null,null,0.33,null,null,null,0.33,null,null,null,{"$f":"IFERROR(E84/100,\"\")","v":0},null,{"$f":"IF(E84%=R86,\"OK\",\"ERRADO\")","v":"OK"}]
[{"$f":"IF(D87>0,\"F\",\"\")","v":""},"PINTURA",null,{"$f":"Orçamento!V540","v":0},{"$f":"Orçamento!X540","v":0},{"$f":"ROUND(F89*$D$87,2)","v":0},null,null,null,{"$f":"ROUND(J89*$D$87,2)","v":0},null,null,null,{"$f":"ROUND(N89*$D$87,2)","v":0},null,null,null,{"$f":"SUM(F87:Q87)","v":0},null,{"$f":"IF(R87=D87,\"OK\",\"ERRO\")","v":"OK"}]
[{"$f":"IF(A87=\"F\",A87,\"\")","v":""}]
[{"$f":"IF(A88=\"F\",A88,\"\")","v":""},null,null,null,null,0,null,null,null,0.6,null,null,null,0.4,null,null,null,{"$f":"IFERROR(E87/100,\"\")","v":0},null,{"$f":"IF(E87%=R89,\"OK\",\"ERRADO\")","v":"OK"}]
[{"$f":"IF(D90>0,\"F\",\"\")","v":""},"DIVERSOS",null,{"$f":"Orçamento!V541","v":0},{"$f":"Orçamento!X541","v":0},{"$f":"ROUND(F92*$D$90,2)-0.01","v":-0.01},null,null,null,{"$f":"ROUND(J92*$D$90,2)","v":0},null,null,null,{"$f":"ROUND(N92*$D$90,2)","v":0},null,null,null,{"$f":"SUM(F90:Q90)","v":-0.01},null,{"$f":"IF(R90=D90,\"OK\",\"ERRO\")","v":"ERRO"},null,1]
[{"$f":"IF(A90=\"F\",A90,\"\")","v":""}]
[{"$f":"IF(A91=\"F\",A91,\"\")","v":""},null,null,null,null,0.55000000000000004,null,null,null,0.25,null,null,null,0.2,null,null,null,{"$f":"IFERROR(E90/100,\"\")","v":0},null,{"$f":"IF(E90%=R92,\"OK\",\"ERRADO\")","v":"OK"}]
["F","CUSTO DO ORÇAMENTO",null,{"$f":"SUM(D15:D92)","v":0},{"$f":"SUM(E15:E92)","v":0},{"$f":"F15+F18+F21+F24+F27+F30+F33+F36+F39+F42+F45+F48+F51+F54+F57+F60+F63+F66+F69+F72+F75+F78+F81+F84+F87+F90","v":0},null,null,null,{"$f":"J15+J18+J21+J24+J27+J30+J33+J36+J39+J42+J45+J48+J51+J54+J57+J60+J63+J66+J69+J72+J75+J78+J81+J84+J87+J90","v":0},null,null,null,{"$f":"N15+N18+N21+N24+N27+N30+N33+N36+N39+N42+N45+N48+N51+N54+N57+N60+N63+N66+N69+N72+N75+N78+N81+N84+N87+N90","v":-0.02},null,null,null,{"$f":"R15+R18+R21+R24+R27+R30+R33+R36+R39+R42+R45+R48+R51+R54+R57+R60+R63+R66+R69+R72+R75+R78+R81+R84+R87+R90","v":-0.02}]
["F","PERCENTUAIS:",null,null,null,{"$f":"IFERROR(F93/D93,\"\")","v":""},null,null,null,{"$f":"IFERROR(J93/D93,\"\")","v":""},null,null,null,{"$f":"IFERROR(N93/D93,\"\")","v":""},null,null,null,{"$f":"SUM(F94:Q94)","v":0},null,{"$f":"IF(D93=R93,\"CERTO\",\"ERRADO\")","v":"ERRADO"}]
["F","TOTAIS ACUMULADOS:",null,null,null,{"$f":"F93","v":0},null,null,null,{"$f":"F95+J93","v":0},null,null,null,{"$f":"J95+N93","v":-0.02}]
["F","PERCENTUAIS  ACUMULADOS:",null,null,null,{"$f":"F94","v":""},null,null,null,{"$f":"IFERROR(F96+J94,\"\")","v":""},null,null,null,{"$f":"IFERROR(J96+N94,\"\")","v":""}]
["F"]
["F","OBSERVAÇÕES:"]
["F","Os pagamentos somente poderão ser efetuados mediante medição e atesto pelos técnicos da Secretaria da Educação. "]

{"sheet":"Composição BDI","index":4,"n_rows":45,"n_cols":9,"rows_kept":45,"cut":false,"hidden":false,"merged":[[11,0,11,3],[12,0,12,3],[14,0,14,3],[15,0,15,3],[13,0,13,3],[0,0,0,3],[1,0,1,3],[4,0,4,3],[7,0,7,3],[10,0,10,3],[2,0,2,3],[3,0,3,3],[5,0,5,3],[6,0,6,3],[8,0,8,3],[9,0,9,3],[18,5,18,8],[17,0,17,3],[16,0,16,3],[44,0,44,3],[42,0,42,3],[43,0,43,3],[18,0,18,3],[36,0,36,3],[39,0,39,3],[38,0,38,3],[40,0,40,3],[29,0,29,2],[32,0,32,3],[33,0,33,3],[34,0,34,3],[35,0,35,3]]}
[]
[]
["UNIDADE ESCOLAR"]
[{"$f":"Orçamento!$O$4","v":"CENTRO DE ENSINO EM PERÍODO INTEGRAL NOVO HORIZONTE"}]
[]
["OBRA"]
[{"$f":"Orçamento!$O$7","v":"REFORMA E AMPLIAÇÃO"}]
[]
["ENDEREÇO"]
[{"$f":"Orçamento!$R$10","v":"ALAMEDA DAS PALMEIRAS, QD. 51-A S/N, NOVO HORIZONTE, CEP:74363-810"}]
[]
["CIDADE"]
[{"$f":"Orçamento!$V$7","v":"GOIÂNIA"}]
[]
["CRE"]
[{"$f":"Orçamento!$O$10","v":"GOIÂNIA"}]
[]
["DETALHAMENTO DA COMPOSIÇÃO DE BDI"]
["COMPOSIÇÃO BDI PARA OBRAS CIVIS",null,null,null,null,"BDI CONSTRUÇÃO E REFORMA"]
["DESCRIÇÃO","COEF.","TAXA % (a.m)","% no preço de venda",null,"Situação","1º Quartil","Médio","3º Quartil"]
["1) COFINS",1,0.03,{"$f":"C21","v":0.03},null,{"$f":"IF(OR(C21<G21,C21>I21),\"FORA DO INTERVALO\",\"OK\")","v":"OK"},0.03,0.03,0.03]
["2) PIS",1,6.4999999999999997E-3,{"$f":"C22","v":6.4999999999999997E-3},null,{"$f":"IF(OR(C22<G22,C22>I22),\"FORA DO INTERVALO\",\"OK\")","v":"OK"},6.4999999999999997E-3,6.4999999999999997E-3,6.4999999999999997E-3]
["3) ISSQN",1,0.03,{"$f":"C23*B23","v":0.03},null,"OK",0.02,3.5000000000000003E-2,0.05]
["4) CPRB",1,4.4999999999999998E-2,{"$f":"C24","v":4.4999999999999998E-2},null,"OK",4.4999999999999998E-2,4.4999999999999998E-2,4.4999999999999998E-2]
["5) Administração Central",1,3.1199999999999999E-2,3.1199999999999999E-2,null,"OK",0.03,0.04,5.5E-2]
["6) Despesas Financeiras",1,5.5999999999999999E-3,5.5999999999999999E-3,null,"FORA DO INTERVALO",5.8999999999999999E-3,1.23E-2,1.3899999999999999E-2]
["7) Seguros + Garantias",1,1.1999999999999999E-3,1.1999999999999999E-3,null,"FORA DO INTERVALO",8.0000000000000002E-3,8.0000000000000002E-3,0.01]
["8) Risco",1,9.7000000000000003E-3,9.7000000000000003E-3,null,"OK",9.7000000000000003E-3,1.2699999999999999E-2,1.2699999999999999E-2]
["9) Lucro",1,7.1999999999999995E-2,7.1999999999999995E-2,null,"OK",6.1600000000000002E-2,7.3999999999999996E-2,8.9599999999999999E-2]
["BDI - FINAL",null,null,{"$f":"(((1+D25+D27+D28)*(1+D26)*(1+D29))/(1-(D21+D22+D23+D24))-1)","v":0.26436368567248203},null,{"$f":"IF(OR(D30<G30,D30>I30),\"FORA DO INTERVALO\",\"OK\")","v":"FORA DO INTERVALO"},0.2034,0.22120000000000001,0.25]
[]
["Notas:"]
["(1) e (2) Alíquota definida por lei."]
["(3) Alíquota e base de cálculo definidas pela legislação municipal."]
["(4) Alíquota definida pelas leis 12.546/11, 12844/13 e 13.161/15 (CPRB – contribuição previdenciária sobre a receita bruta)."]
["(5) Valores definidos a partir dos limites no Acórdão nº 2.622/2013 - TCU – Plenário. Valores entre o 1º e 3º quartis."]
["(6) Valor calculado pela expressão matemática do acórdão 2.369/2011 – TCU – Plenário e disponibilizado pela AGETOP em dezembro de 2018. (Foi utilizado para o cálculo a média da Taxa SELIC no período de 11/2017 a 10/2018)"]
[]
["(7) Valores definidos pela AGETOP a partir dos limites no Acórdão nº 2.622/2013 - TCU – Plenário. Valores médios. \n\nObservação da AGETOP: (Seguros contra erros de execução, incêndio e explosão, danos da natureza (vendaval, destelhamento, alagamento, inundação, desmoronamento, geadas etc.), emprego de material defeituoso ou inadequado, roubo e/ou furto qualificado, quebra de equipamentos, desmoronamento de estrutura, nas modalidades de Obras Civis em Construção (OCC); Instalação e Montagem (IM); e Obras Civis em Construção e Instalação e Montagem (OCC/IM). Bem como coberturas adicionais para ampliação dessas coberturas básicas, como: cobertura de responsabilidade civil geral, cobertura de responsabilidade civil cruzada, cobertura de despesas extraordinárias, cobertura de tumultos, cobertura de desentulho do local, cobertura de riscos do fabricante, dentre outras, incluindo o seguro de vida em grupo regido pela convenção coletiva dos trabalhadores na indústria da construção civil). A partir de 24/02/2015 por intermédio da Portaria 449/2015 a Presidência da AGETOP, na pessoa do Senhor Jayme Eduardo Rincon, determinou a exclusão dos valores referentes aos Seguros de Risco de Engenharia e Responsabilidade Civil do Profissional na composição do cálculo do B.D.I.."]
["(8) Valores definidos a partir dos limites no Acórdão nº 2.622/2013 - TCU – Plenário. Valores entre 1º e 3° quartis."]
["(9) Valores definidos a partir dos limites definidos no Acórdão nº 2.622/2013 - TCU – Plenário. Valores adotados e praticados no mercado ( “ ex ante ” ) ou aqueles entre os 1º e 3º quartis."]
[]
["(*) A fórmula para estipulação da taxa de BDI estimado adotado é a mesma que foi aplicada para a obtenção das tabelas contidas no Acórdão n. 2.622/2013 – TCUPlenário"]
[]
["Obs.: Para obras com valores superiores a R$ 20.000.000,00 sugere-se recalcular o BDI, dimensionando as taxas de administração central e lucro para patamares inferiores ao estipulado acima."]

{"sheet":"Relatório CENTRAL","index":5,"n_rows":40,"n_cols":5,"rows_kept":40,"cut":false,"hidden":false,"merged":[[11,1,11,4],[39,1,39,2],[9,0,11,0],[0,1,0,4],[6,3,6,4],[9,3,9,4],[1,1,1,4],[2,1,2,2],[2,3,2,4],[3,1,3,2],[3,3,3,4],[4,1,4,4],[5,1,5,2],[5,3,5,4],[6,1,6,2],[7,1,7,4],[8,1,8,2],[8,3,8,4],[9,1,9,2],[10,1,10,4]]}
[]
[]
[null,"UNIDADE ESCOLAR",null,"CIDADE"]
[null,{"$f":"Orçamento!$O$4","v":"CENTRO DE ENSINO EM PERÍODO INTEGRAL NOVO HORIZONTE"},null,{"$f":"Orçamento!$V$7","v":"GOIÂNIA"}]
[]
[null,"OBRA",null,"CRE"]
[null,{"$f":"Orçamento!$O$7","v":"REFORMA E AMPLIAÇÃO"},null,{"$f":"Orçamento!$O$10","v":"GOIÂNIA"}]
[]
[null,"ENDEREÇO",null,"DATA"]
["FILTRO",{"$f":"Orçamento!$R$10","v":"ALAMEDA DAS PALMEIRAS, QD. 51-A S/N, NOVO HORIZONTE, CEP:74363-810"},null,{"$f":"Orçamento!$S$7","v":"2020-04-16"}]
[]
[null,"RELATÓRIO CENTRAL"]
["↓","CÓDIGO","ETAPA","PREÇO  (R$) C/ BDI","PARTIC  ( % )"]
[{"$f":"IF(D14>0,\"F\",\"\")","v":""},{"$f":"Orçamento!O516","v":"a."},{"$f":"Orçamento!P516","v":"SERVIÇOS PRELIMINARES"},{"$f":"Orçamento!V516","v":0},{"$f":"Orçamento!X516","v":0}]
[{"$f":"IF(D15>0,\"F\",\"\")","v":""},{"$f":"Orçamento!O517","v":"b."},{"$f":"Orçamento!P517","v":"TRANSPORTES"},{"$f":"Orçamento!V517","v":0},{"$f":"Orçamento!X517","v":0}]
["",{"$f":"Orçamento!O518","v":"c."},{"$f":"Orçamento!P518","v":"SERVIÇO EM TERRA"},{"$f":"Orçamento!V518","v":0},{"$f":"Orçamento!X518","v":0}]
["",{"$f":"Orçamento!O519","v":"d."},{"$f":"Orçamento!P519","v":"FUNDAÇÕES E SONDAGENS"},{"$f":"Orçamento!V519","v":0},{"$f":"Orçamento!X519","v":0}]
["",{"$f":"Orçamento!O520","v":"e."},{"$f":"Orçamento!P520","v":"ESTRUTURA"},{"$f":"Orçamento!V520","v":0},{"$f":"Orçamento!X520","v":0}]
["",{"$f":"Orçamento!O521","v":"f."},{"$f":"Orçamento!P521","v":"INSTALAÇÕES ELÉTRICAS"},{"$f":"Orçamento!V521","v":0},{"$f":"Orçamento!X521","v":0}]
["",{"$f":"Orçamento!O522","v":"g."},{"$f":"Orçamento!P522","v":"INSTALAÇÕES HIDROSSANITÁRIAS"},{"$f":"Orçamento!V522","v":0},{"$f":"Orçamento!X522","v":0}]
["",{"$f":"Orçamento!O523","v":"h"},{"$f":"Orçamento!P523","v":"INSTALAÇÕES ESPECIAIS"},{"$f":"Orçamento!V523","v":0},{"$f":"Orçamento!X523","v":0}]
["",{"$f":"Orçamento!O524","v":"i."},{"$f":"Orçamento!P524","v":"ALVENARIAS E DIVISÓRIAS"},{"$f":"Orçamento!V524","v":0},{"$f":"Orçamento!X524","v":0}]
["",{"$f":"Orçamento!O525","v":"j."},{"$f":"Orçamento!P525","v":"ALVENARIA AUTO-PORTANTE"},{"$f":"Orçamento!V525","v":0},{"$f":"Orçamento!X525","v":0}]
["",{"$f":"Orçamento!O526","v":"k."},{"$f":"Orçamento!P526","v":"IMPERMEABILIZAÇÃO"},{"$f":"Orçamento!V526","v":0},{"$f":"Orçamento!X526","v":0}]
["",{"$f":"Orçamento!O527","v":"l."},{"$f":"Orçamento!P527","v":"ISOLAMENTO TÉRMICO E ACÚSTICO"},{"$f":"Orçamento!V527","v":0},{"$f":"Orçamento!X527","v":0}]
["",{"$f":"Orçamento!O528","v":"m."},{"$f":"Orçamento!P528","v":"ESTRUTURA DE MADEIRA"},{"$f":"Orçamento!V528","v":0},{"$f":"Orçamento!X528","v":0}]
["",{"$f":"Orçamento!O529","v":"n."},{"$f":"Orçamento!P529","v":"ESTRUTURAS METÁLICAS"},{"$f":"Orçamento!V529","v":0},{"$f":"Orçamento!X529","v":0}]
["",{"$f":"Orçamento!O530","v":"o."},{"$f":"Orçamento!P530","v":"COBERTURAS"},{"$f":"Orçamento!V530","v":0},{"$f":"Orçamento!X530","v":0}]
["",{"$f":"Orçamento!O531","v":"p."},{"$f":"Orçamento!P531","v":"ESQUADRIAS DE MADEIRA"},{"$f":"Orçamento!V531","v":0},{"$f":"Orçamento!X531","v":0}]
["",{"$f":"Orçamento!O532","v":"q."},{"$f":"Orçamento!P532","v":"ESQUADRIAS METÁLICAS"},{"$f":"Orçamento!V532","v":0},{"$f":"Orçamento!X532","v":0}]
["",{"$f":"Orçamento!O533","v":"r."},{"$f":"Orçamento!P533","v":"VIDROS"},{"$f":"Orçamento!V533","v":0},{"$f":"Orçamento!X533","v":0}]
["",{"$f":"Orçamento!O534","v":"s."},{"$f":"Orçamento!P534","v":"REVESTIMENTO DE PAREDE"},{"$f":"Orçamento!V534","v":0},{"$f":"Orçamento!X534","v":0}]
["",{"$f":"Orçamento!O535","v":"t."},{"$f":"Orçamento!P535","v":"FORROS"},{"$f":"Orçamento!V535","v":0},{"$f":"Orçamento!X535","v":0}]
["",{"$f":"Orçamento!O536","v":"u."},{"$f":"Orçamento!P536","v":"REVESTIMENTO DE PISO"},{"$f":"Orçamento!V536","v":0},{"$f":"Orçamento!X536","v":0}]
["",{"$f":"Orçamento!O537","v":"v."},{"$f":"Orçamento!P537","v":"FERRAGENS"},{"$f":"Orçamento!V537","v":0},{"$f":"Orçamento!X537","v":0}]
["",{"$f":"Orçamento!O538","v":"w."},{"$f":"Orçamento!P538","v":"MARCENARIA"},{"$f":"Orçamento!V538","v":0},{"$f":"Orçamento!X538","v":0}]
["",{"$f":"Orçamento!O539","v":"x."},{"$f":"Orçamento!P539","v":"ADMINISTRAÇÃO"},{"$f":"Orçamento!V539","v":0},{"$f":"Orçamento!X539","v":0}]
["",{"$f":"Orçamento!O540","v":"y."},{"$f":"Orçamento!P540","v":"PINTURA"},{"$f":"Orçamento!V540","v":0},{"$f":"Orçamento!X540","v":0}]
["",{"$f":"Orçamento!O541","v":"z."},{"$f":"Orçamento!P541","v":"DIVERSOS"},{"$f":"Orçamento!V541","v":0},{"$f":"Orçamento!X541","v":0}]
["F","TOTAL GERAL DO ORÇAMENTO (R$) C/BDI",null,{"$f":"SUM(D14:D39)","v":0},{"$f":"SUM(E14:E39)","v":0}]

{"sheet":"Parc Maior Relev","index":6,"n_rows":21,"n_cols":8,"rows_kept":21,"cut":false,"hidden":false,"merged":[[0,1,0,6],[11,1,11,6],[1,1,1,6],[2,1,2,3],[2,4,2,6],[3,1,3,3],[3,4,3,6],[4,1,4,6],[5,1,5,3],[5,4,5,6],[9,1,9,3],[9,4,9,6],[10,1,10,6],[6,1,6,3],[6,4,6,6],[7,1,7,6],[10,0,12,0],[8,1,8,3],[8,4,8,6],[21,3,21,7],[19,1,19,6],[14,1,14,6]]}
[]
[]
[null,"UNIDADE ESCOLAR",null,null,"CÓDIGO INEP"]
[null,{"$f":"Orçamento!$O$4","v":"CENTRO DE ENSINO EM PERÍODO INTEGRAL NOVO HORIZONTE"},null,null,{"$f":"Orçamento!$V$4","v":52033945}]
[]
[null,"OBRA",null,null,"CIDADE"]
[null,{"$f":"Orçamento!$O$7","v":"REFORMA E AMPLIAÇÃO"},null,null,{"$f":"Orçamento!$V$7","v":"GOIÂNIA"}]
[]
[null,"CRE",null,null,"ÁREA TOTAL CONSTRUÍDA (M²)"]
[null,{"$f":"Orçamento!$O$10","v":"GOIÂNIA"},null,null,{"$f":"Orçamento!$S$13","v":2682.79}]
["FILTRO"]
[null,"PARCELA DE MAIOR RELEVÂNCIA"]
[null,"CÓDIGO","SERVIÇO","DESCRIÇÃO","UNID","QUANT","PARC. MAIOR RELEV (100%)"]
[null,70000,"INSTALAÇÕES ELÉTRICAS",{"$f":"Orçamento!R226","v":"SUBESTAÇÃO 112,5 KVA"},"KVA",1,1,1]
[]
[null,"CÓDIGO","SERVIÇO","DESCRIÇÃO","UNID","QUANT","PARC. MAIOR RELEV (50%)"]
[null,160000,"COBERTURAS","ESTRUTURA-TELHA CERÂMICA","M2",{"$f":"Orçamento!T163","v":830.82},{"$f":"F17*0.5","v":415.41}]
[null,160000,"COBERTURAS","TELHAMENTO COM TELHA CERÂMICA","M2",{"$f":"Orçamento!T167","v":883.44},{"$f":"F18*0.5","v":441.72}]
["F"]
["F","(*) Para os fins do inciso I dp § 1º do Art. 30 da Lei Federal 8.666/93, são consideradas parcelas de maior relevância técnica as execuções apresentadas"]
["F"]

{"sheet":"Composições","index":7,"n_rows":437,"n_cols":10,"rows_kept":437,"cut":false,"hidden":false,"merged":[[15,0,15,9],[13,0,13,2],[13,3,13,6],[1,0,1,9],[3,7,3,9],[4,7,4,9],[6,7,6,9],[7,7,7,9],[6,0,6,6],[10,8,10,9],[13,8,13,9],[14,0,14,9],[8,0,8,9],[5,0,5,9],[2,0,2,9],[0,0,0,8],[10,0,10,2],[10,3,10,6],[11,0,11,9],[12,0,12,2],[12,3,12,6],[12,7,12,8],[7,0,7,6],[9,0,9,2],[9,3,9,6],[9,7,9,8],[3,0,3,6],[4,0,4,6],[16,5,17,5],[16,6,16,7],[16,8,16,9],[22,1,22,7],[26,1,26,7],[16,0,17,0],[16,1,17,1],[16,2,17,2],[16,3,17,3],[16,4,17,4],[28,5,29,5],[28,6,28,7],[28,8,28,9],[34,1,34,7],[38,1,38,7],[28,0,29,0],[28,1,29,1],[28,2,29,2],[28,3,29,3],[28,4,29,4],[40,5,41,5],[40,6,40,7],[40,8,40,9],[46,1,46,7],[50,1,50,7],[40,0,41,0],[40,1,41,1],[40,2,41,2],[40,3,41,3],[40,4,41,4],[52,5,53,5],[52,6,52,7],[52,8,52,9],[58,1,58,7],[62,1,62,7],[52,0,53,0],[52,1,53,1],[52,2,53,2],[52,3,53,3],[52,4,53,4],[64,5,65,5],[64,6,64,7],[64,8,64,9],[70,1,70,7],[74,1,74,7],[64,0,65,0],[64,1,65,1],[64,2,65,2],[64,3,65,3],[64,4,65,4],[76,5,77,5],[76,6,76,7],[76,8,76,9],[82,1,82,7],[86,1,86,7],[76,0,77,0],[76,1,77,1],[76,2,77,2],[76,3,77,3],[76,4,77,4],[88,5,89,5],[88,6,88,7],[88,8,88,9],[94,1,94,7],[98,1,98,7],[88,0,89,0],[88,1,89,1],[88,2,89,2],[88,3,89,3],[88,4,89,4],[100,5,101,5],[100,6,100,7],[100,8,100,9],[106,1,106,7],[110,1,110,7],[100,0,101,0],[100,1,101,1],[100,2,101,2],[100,3,101,3],[100,4,101,4],[112,5,113,5],[112,6,112,7],[112,8,112,9],[118,1,118,7],[122,1,122,7],[112,0,113,0],[112,1,113,1],[112,2,113,2],[112,3,113,3],[112,4,113,4],[124,5,125,5],[124,6,124,7],[124,8,124,9],[130,1,130,7],[134,1,134,7],[124,0,125,0],[124,1,125,1],[124,2,125,2],[124,3,125,3],[124,4,125,4],[136,5,137,5],[136,6,136,7],[136,8,136,9],[142,1,142,7],[146,1,146,7],[136,0,137,0],[136,1,137,1],[136,2,137,2],[136,3,137,3],[136,4,137,4],[148,5,149,5],[148,6,148,7],[148,8,148,9],[154,1,154,7],[158,1,158,7],[148,0,149,0],[148,1,149,1],[148,2,149,2],[148,3,149,3],[148,4,149,4],[160,5,161,5],[160,6,160,7],[160,8,160,9],[165,1,165,7],[177,1,177,7],[160,0,161,0],[160,1,161,1],[160,2,161,2],[160,3,161,3],[160,4,161,4],[179,5,180,5],[179,6,179,7],[179,8,179,9],[185,1,185,7],[189,1,189,7],[179,0,180,0],[179,1,180,1],[179,2,180,2],[179,3,180,3],[179,4,180,4],[191,5,192,5],[191,6,191,7],[191,8,191,9],[197,1,197,7],[201,1,201,7],[191,0,192,0],[191,1,192,1],[191,2,192,2],[191,3,192,3],[191,4,192,4],[203,5,204,5],[203,6,203,7],[203,8,203,9],[209,1,209,7],[213,1,213,7],[203,0,204,0],[203,1,204,1],[203,2,204,2],[203,3,204,3],[203,4,204,4],[215,5,216,5],[215,6,215,7],[215,8,215,9],[221,1,221,7],[225,1,225,7],[215,0,216,0],[215,1,216,1],[215,2,216,2],[215,3,216,3],[215,4,216,4],[227,5,228,5],[227,6,227,7],[227,8,227,9],[233,1,233,7],[237,1,237,7],[227,0,228,0],[227,1,228,1],[227,2,228,2],[227,3,228,3],[227,4,228,4],[239,5,240,5],[239,6,239,7],[239,8,239,9],[245,1,245,7],[249,1,249,7],[239,0,240,0],[239,1,240,1],[239,2,240,2],[239,3,240,3],[239,4,240,4],[251,5,252,5],[251,6,251,7],[251,8,251,9],[257,1,257,7],[261,1,261,7],[251,0,252,0],[251,1,252,1],[251,2,252,2],[251,3,252,3],[251,4,252,4],[263,5,264,5],[263,6,263,7],[263,8,263,9],[268,1,268,7],[271,1,271,7],[263,0,264,0],[263,1,264,1],[263,2,264,2],[263,3,264,3],[263,4,264,4],[273,5,274,5],[273,6,273,7],[273,8,273,9],[278,1,278,7],[281,1,281,7],[273,0,274,0],[273,1,274,1],[273,2,274,2],[273,3,274,3],[273,4,274,4],[283,5,284,5],[283,6,283,7],[283,8,283,9],[288,1,288,7],[291,1,291,7],[283,0,284,0],[283,1,284,1],[283,2,284,2],[283,3,284,3],[283,4,284,4],[293,5,294,5],[293,6,293,7],[293,8,293,9],[299,1,299,7],[303,1,303,7],[293,0,294,0],[293,1,294,1],[293,2,294,2],[293,3,294,3],[293,4,294,4],[305,5,306,5],[305,6,305,7],[305,8,305,9],[311,1,311,7],[315,1,315,7],[305,0,306,0],[305,1,306,1],[305,2,306,2],[305,3,306,3],[305,4,306,4],[317,5,318,5],[317,6,317,7],[317,8,317,9],[323,1,323,7],[327,1,327,7],[317,0,318,0],[317,1,318,1],[317,2,318,2],[317,3,318,3],[317,4,318,4],[329,5,330,5],[329,6,329,7],[329,8,329,9],[335,1,335,7],[339,1,339,7],[329,0,330,0],[329,1,330,1],[329,2,330,2],[329,3,330,3],[329,4,330,4],[341,5,342,5],[341,6,341,7],[341,8,341,9],[347,1,347,7],[351,1,351,7],[341,0,342,0],[341,1,342,1],[341,2,342,2],[341,3,342,3],[341,4,342,4],[353,5,354,5],[353,6,353,7],[353,8,353,9],[357,1,357,7],[361,1,361,7],[353,0,354,0],[353,1,354,1],[353,2,354,2],[353,3,354,3],[353,4,354,4],[363,5,364,5],[363,6,363,7],[363,8,363,9],[369,1,369,7],[376,1,376,7],[363,0,364,0],[363,1,364,1],[363,2,364,2],[363,3,364,3],[363,4,364,4],[378,5,379,5],[378,6,378,7],[378,8,378,9],[384,1,384,7],[388,1,388,7],[378,0,379,0],[378,1,379,1],[378,2,379,2],[378,3,379,3],[378,4,379,4],[390,5,391,5],[390,6,390,7],[390,8,390,9],[396,1,396,7],[400,1,400,7],[390,0,391,0],[390,1,391,1],[390,2,391,2],[390,3,391,3],[390,4,391,4],[402,5,403,5],[402,6,402,7],[402,8,402,9],[408,1,408,7],[412,1,412,7],[402,0,403,0],[402,1,403,1],[402,2,403,2],[402,3,403,3],[402,4,403,4],[414,5,415,5],[414,6,414,7],[414,8,414,9],[420,1,420,7],[424,1,424,7],[414,0,415,0],[414,1,415,1],[414,2,415,2],[414,3,415,3],[414,4,415,4],[426,5,427,5],[426,6,426,7],[426,8,426,9],[432,1,432,7],[436,1,436,7],[426,0,427,0],[426,1,427,1],[426,2,427,2],[426,3,427,3],[426,4,427,4]]}
[]
[]
[]
["UNIDADE ESCOLAR",null,null,null,null,null,null,"CÓDIGO INEP"]
[{"$f":"Orçamento!$O$4","v":"CENTRO DE ENSINO EM PERÍODO INTEGRAL NOVO HORIZONTE"},null,null,null,null,null,null,{"$f":"Orçamento!$V$4","v":52033945}]
[]
["OBRA",null,null,null,null,null,null,"CIDADE"]
[{"$f":"Orçamento!$O$7","v":"REFORMA E AMPLIAÇÃO"},null,null,null,null,null,null,{"$f":"Orçamento!$V$7","v":"GOIÂNIA"}]
[]
["CRE",null,null,"ENDEREÇO",null,null,null,"REFERÊNCIA AGETOP"]
[{"$f":"Orçamento!$O$10","v":"GOIÂNIA"},null,null,{"$f":"Orçamento!$R$10","v":"ALAMEDA DAS PALMEIRAS, QD. 51-A S/N, NOVO HORIZONTE, CEP:74363-810"},null,null,null,{"$f":"Orçamento!$V$10","v":"DEZ/18"},{"$f":"Orçamento!$W$10","v":"DESONERADA"}]
[]
["DATA",null,null,"ÁREA TOTAL CONSTRUÍDA (M²)",null,null,null,"REFERÊNCIA SINAPI"]
[{"$f":"Orçamento!$S$7","v":"2020-04-16"},null,null,{"$f":"Orçamento!$S$13","v":2682.79},null,null,null,{"$f":"Orçamento!$V$13","v":"JUL/19"},{"$f":"Orçamento!$W$13","v":"DESONERADA"}]
[]
["COMPOSIÇÕES DE CUSTOS UNITÁRIOS - SEE-GO"]
[428,"FONTE","CÓDIGO","DESCRIÇÃO","UNIDADE","COEFIC.","CUSTO UNITÁRIO",null,"CUSTO  TOTAL (A) + (B) + (C) + (D) + (E)"]
[null,null,null,null,null,null,"DESONERADO","NÃO DESONER.","DESONERADO","NÃO DESONER."]
[null,"COMPOSIÇÃO","COMP 428_SEE","DEMOLIÇÃO DE ALAMBRADO COM TUBO GALVANIZADO C/ TR. ATE CB. E CARGA ","M",null,null,null,9.84,11.41]
[null,"AGETOP_I",5,"SERVENTE","h     ",1.2,8.1999999999999993,9.51,9.84,11.41]
[null,null,null,"","",null,0,0,0,0]
[null,null,null,"","",null,0,0,0,0]
[null,"MÃO DE OBRA (B) - TOTAL",null,null,null,null,null,null,9.84,11.41]
[null,null,null,"","",null,0,0,0,0]
[null,null,null,"","",null,0,0,0,0]
[null,null,null,"","",null,0,0,0,0]
[null,"MATERIAL (C) - TOTAL",null,null,null,null,null,null,0,0]
[]
[382,"FONTE","CÓDIGO","DESCRIÇÃO","UNIDADE","COEFIC.","CUSTO UNITÁRIO",null,"CUSTO  TOTAL (A) + (B) + (C) + (D) + (E)"]
[null,null,null,null,null,null,"DESONERADO","NÃO DESONER.","DESONERADO","NÃO DESONER."]
[null,"COMPOSIÇÃO","COMP 382_SEE","TE DE REDUCAO DE FERRO GALVANIZADO, COM ROSCA BSP, DE 3/4\" X 1/2\"","UN ",null,null,null,22.42,24.51]
[null,"AGETOP_I",8,"AJUDANTE","h     ",0.6,8.1999999999999993,9.51,4.92,5.71]
[null,"AGETOP_I",11,"ENCANADOR","h     ",0.61050000000000004,13.4,15.53,8.18,9.48]
[null,null,null,"","",null,0,0,0,0]
[null,"MÃO DE OBRA (B) - TOTAL",null,null,null,null,null,null,13.1,15.190000000000001]
[null,"SINAPI_I",3146,"FITA VEDA ROSCA EM ROLOS DE 18 MM X 10 M (L X C)","UN    ",0.12075471698113208,3.5,3.5,0.42,0.42]
[null,"SINAPI_I",6302,"TE DE REDUCAO DE FERRO GALVANIZADO, COM ROSCA BSP, DE 3/4\" X 1/2\"","UN    ",1,8.9,8.9,8.9,8.9]
[null,null,null,"","",null,0,0,0,0]
[null,"MATERIAL (C) - TOTAL",null,null,null,null,null,null,9.32,9.32]
[]
[383,"FONTE","CÓDIGO","DESCRIÇÃO","UNIDADE","COEFIC.","CUSTO UNITÁRIO",null,"CUSTO  TOTAL (A) + (B) + (C) + (D) + (E)"]
[null,null,null,null,null,null,"DESONERADO","NÃO DESONER.","DESONERADO","NÃO DESONER."]
[null,"COMPOSIÇÃO","COMP 383_SEE","BUCHA DE REDUCAO DE FERRO GALVANIZADO, COM ROSCA BSP, DE 1/2\" X 1/4\"","UN ",null,null,null,7.07,7.6199999999999992]
[null,"AGETOP_I",8,"AJUDANTE","h     ",0.16,8.1999999999999993,9.51,1.31,1.52]
[null,"AGETOP_I",11,"ENCANADOR","h     ",0.16,13.4,15.53,2.14,2.48]
[null,null,null,"","",null,0,0,0,0]
[null,"MÃO DE OBRA (B) - TOTAL",null,null,null,null,null,null,3.45,4]
[null,"AGETOP_I","H689","FITA VEDAROSCA 12 MM","m",1.2,0.28000000000000003,0.28000000000000003,0.34,0.34]
[null,"SINAPI_I",770,"BUCHA DE REDUCAO DE FERRO GALVANIZADO, COM ROSCA BSP, DE 1/2\" X 1/4\"","UN    ",1,3.28,3.28,3.28,3.28]
[null,null,null,"","",null,0,0,0,0]
[null,"MATERIAL (C) - TOTAL",null,null,null,null,null,null,3.6199999999999997,3.6199999999999997]
[]
[212,"FONTE","CÓDIGO","DESCRIÇÃO","UNIDADE","COEFIC.","CUSTO UNITÁRIO",null,"CUSTO  TOTAL (A) + (B) + (C) + (D) + (E)"]
[null,null,null,null,null,null,"DESONERADO","NÃO DESONER.","DESONERADO","NÃO DESONER."]
[null,"COMPOSIÇÃO","COMP 212_SEE","NIPLE DE REDUÇÃO 1/2\" X 1/4\" BSP","UN ",null,null,null,9.5,10.050000000000001]
[null,"AGETOP_I",8,"AJUDANTE","h     ",0.16,8.1999999999999993,9.51,1.31,1.52]
[null,"AGETOP_I",11,"ENCANADOR","h     ",0.16,13.4,15.53,2.14,2.48]
[null,null,null,"","",null,0,0,0,0]
[null,"MÃO DE OBRA (B) - TOTAL",null,null,null,null,null,null,3.45,4]
[null,"COTAÇÃO","COT 103_SEE","NIPLE DE REDUÇÃO 1/2\" X 1/4\" BSP","UN",1,6.0533333333333337,6.0533333333333337,6.05,6.05]
[null,null,null,"","",null,0,0,0,0]
[null,null,null,"","",null,0,0,0,0]
[null,"MATERIAL (C) - TOTAL",null,null,null,null,null,null,6.05,6.05]
[]
[213,"FONTE","CÓDIGO","DESCRIÇÃO","UNIDADE","COEFIC.","CUSTO UNITÁRIO",null,"CUSTO  TOTAL (A) + (B) + (C) + (D) + (E)"]
[null,null,null,null,null,null,"DESONERADO","NÃO DESONER.","DESONERADO","NÃO DESONER."]
[null,"COMPOSIÇÃO","COMP 213_SEE","NIPLE DE REDUÇÃO 3/4\" X 1/2\" BSP","UN ",null,null,null,13.16,13.71]
[null,"AGETOP_I",8,"AJUDANTE","h     ",0.16,8.1999999999999993,9.51,1.31,1.52]
[null,"AGETOP_I",11,"ENCANADOR","h     ",0.16,13.4,15.53,2.14,2.48]
[null,null,null,"","",null,0,0,0,0]
[null,"MÃO DE OBRA (B) - TOTAL",null,null,null,null,null,null,3.45,4]
[null,"COTAÇÃO","COT 104_SEE","NIPLE DE REDUÇÃO 3/4\" X 1/2\" BSP","UN",1,9.7099999999999991,9.7099999999999991,9.7100000000000009,9.7100000000000009]
[null,null,null,"","",null,0,0,0,0]
[null,null,null,"","",null,0,0,0,0]
[null,"MATERIAL (C) - TOTAL",null,null,null,null,null,null,9.7100000000000009,9.7100000000000009]
[]
[237,"FONTE","CÓDIGO","DESCRIÇÃO","UNIDADE","COEFIC.","CUSTO UNITÁRIO",null,"CUSTO  TOTAL (A) + (B) + (C) + (D) + (E)"]
[null,null,null,null,null,null,"DESONERADO","NÃO DESONER.","DESONERADO","NÃO DESONER."]
[null,"COMPOSIÇÃO","COMP 237_SEE","FITA ANTICORROSIVA","M",null,null,null,11.14,11.83]
[null,"AGETOP_I",8,"AJUDANTE","h     ",0.2,8.1999999999999993,9.51,1.64,1.9]
[null,"AGETOP_I",12,"ELETRICISTA","h     ",0.2,13.4,15.53,2.68,3.11]
[null,null,null,"","",null,0,0,0,0]
[null,"MÃO DE OBRA (B) - TOTAL",null,null,null,null,null,null,4.32,5.01]
[null,"SINAPI_I",39634,"FITA ADESIVA ANTICORROSIVA DE PVC FLEXIVEL, COR PRETA, PARA PROTECAO TUBULACAO, 50 MM X 30 M (L X C), E= *0,25* MM","M     ",1,6.82,6.82,6.82,6.82]
[null,null,null,"","",null,0,0,0,0]
[null,null,null,"","",null,0,0,0,0]
[null,"MATERIAL (C) - TOTAL",null,null,null,null,null,null,6.82,6.82]
[]
[542,"FONTE","CÓDIGO","DESCRIÇÃO","UNIDADE","COEFIC.","CUSTO UNITÁRIO",null,"CUSTO  TOTAL (A) + (B) + (C) + (D) + (E)"]
[null,null,null,null,null,null,"DESONERADO","NÃO DESONER.","DESONERADO","NÃO DESONER."]
[null,"COMPOSIÇÃO","COMP 542_SEE","VÁLVULA UGV 3/4\" (S) LATÃO","UN ",null,null,null,25.17,26.66]
[null,"AGETOP_I",8,"AJUDANTE","h     ",0.432,8.1999999999999993,9.51,3.54,4.1100000000000003]
[null,"AGETOP_I",11,"ENCANADOR","h     ",0.432,13.4,15.53,5.79,6.71]
[null,null,null,"","",null,0,0,0,0]
[null,"MÃO DE OBRA (B) - TOTAL",null,null,null,null,null,null,9.33,10.82]
[null,"COTAÇÃO","COT 281_SEE","VÁLVULA UGV 3/4\" (S) LATÃO","UN ",1,15.836666666666666,15.836666666666666,15.84,15.84]
[null,null,null,"","",null,0,0,0,0]
[null,null,null,"","",null,0,0,0,0]
[null,"MATERIAL (C) - TOTAL",null,null,null,null,null,null,15.84,15.84]
[]
[543,"FONTE","CÓDIGO","DESCRIÇÃO","UNIDADE","COEFIC.","CUSTO UNITÁRIO",null,"CUSTO  TOTAL (A) + (B) + (C) + (D) + (E)"]
[null,null,null,null,null,null,"DESONERADO","NÃO DESONER.","DESONERADO","NÃO DESONER."]
[null,"COMPOSIÇÃO","COMP 543_SEE","VÁLVULA UGV 1/2\" (S) LATÃO","UN ",null,null,null,24.5,25.990000000000002]
[null,"AGETOP_I",8,"AJUDANTE","h     ",0.432,8.1999999999999993,9.51,3.54,4.1100000000000003]
[null,"AGETOP_I",11,"ENCANADOR","h     ",0.432,13.4,15.53,5.79,6.71]
[null,null,null,"","",null,0,0,0,0]
[null,"MÃO DE OBRA (B) - TOTAL",null,null,null,null,null,null,9.33,10.82]
[null,"COTAÇÃO","COT 282_SEE","VÁLVULA UGV 1/2\" (S) LATÃO","UN ",1,15.166666666666666,15.166666666666666,15.17,15.17]
[null,null,null,"","",null,0,0,0,0]
[null,null,null,"","",null,0,0,0,0]
[null,"MATERIAL (C) - TOTAL",null,null,null,null,null,null,15.17,15.17]
[]
[211,"FONTE","CÓDIGO","DESCRIÇÃO","UNIDADE","COEFIC.","CUSTO UNITÁRIO",null,"CUSTO  TOTAL (A) + (B) + (C) + (D) + (E)"]
[null,null,null,null,null,null,"DESONERADO","NÃO DESONER.","DESONERADO","NÃO DESONER."]
[null,"COMPOSIÇÃO","COMP 211_SEE","REGULADOR DE 2º ESTÁGIO 5KG/H","UN ",null,null,null,85.46,89.419999999999987]
[null,"AGETOP_I",8,"AJUDANTE","h     ",1.1499999999999999,8.1999999999999993,9.51,9.43,10.94]
[null,"AGETOP_I",11,"ENCANADOR","h     ",1.1499999999999999,13.4,15.53,15.41,17.86]
[null,null,null,"","",null,0,0,0,0]
[null,"MÃO DE OBRA (B) - TOTAL",null,null,null,null,null,null,24.84,28.799999999999997]
[null,"COTAÇÃO","COT 102_SEE","REGULADOR DE 2º ESTÁGIO 5KG/H","UN",1,59.833333333333336,59.833333333333336,59.83,59.83]
[null,"AGETOP_I","H689","FITA VEDAROSCA 12 MM","m",2.82,0.28000000000000003,0.28000000000000003,0.79,0.79]
[null,null,null,"","",null,0,0,0,0]
[null,"MATERIAL (C) - TOTAL",null,null,null,null,null,null,60.62,60.62]
[]
[210,"FONTE","CÓDIGO","DESCRIÇÃO","UNIDADE","COEFIC.","CUSTO UNITÁRIO",null,"CUSTO  TOTAL (A) + (B) + (C) + (D) + (E)"]
[null,null,null,null,null,null,"DESONERADO","NÃO DESONER.","DESONERADO","NÃO DESONER."]
[null,"COMPOSIÇÃO","COMP 210_SEE","REGULADOR DE 1º ESTÁGIO 60KG/H MODELO AP-40  COM MANÔMETRO","UN ",null,null,null,231.21,235.17000000000002]
[null,"AGETOP_I",8,"AJUDANTE","h     ",1.1499999999999999,8.1999999999999993,9.51,9.43,10.94]
[null,"AGETOP_I",11,"ENCANADOR","h     ",1.1499999999999999,13.4,15.53,15.41,17.86]
[null,null,null,"","",null,0,0,0,0]
[null,"MÃO DE OBRA (B) - TOTAL",null,null,null,null,null,null,24.84,28.799999999999997]
[null,"COTAÇÃO","COT 101_SEE","REGULADOR DE 1º ESTÁGIO 60KG/H MODELO AP-40  COM MANÔMETRO","UN",1,205.57666666666668,205.57666666666668,205.58,205.58]
[null,"AGETOP_I","H689","FITA VEDAROSCA 12 MM","m",2.82,0.28000000000000003,0.28000000000000003,0.79,0.79]
[null,null,null,"","",null,0,0,0,0]
[null,"MATERIAL (C) - TOTAL",null,null,null,null,null,null,206.37,206.37]
[]
[235,"FONTE","CÓDIGO","DESCRIÇÃO","UNIDADE","COEFIC.","CUSTO UNITÁRIO",null,"CUSTO  TOTAL (A) + (B) + (C) + (D) + (E)"]
[null,null,null,null,null,null,"DESONERADO","NÃO DESONER.","DESONERADO","NÃO DESONER."]
[null,"COMPOSIÇÃO","COMP 235_SEE","PLACA DE SINALIZAÇÃO EM PVC COD 01 - (300X300) PROIBIDO FUMAR","UN ",null,null,null,24.109999999999996,24.229999999999997]
[null,"AGETOP_I",5,"SERVENTE","h     ",0.09,8.1999999999999993,9.51,0.74,0.86]
[null,null,null,"","",null,0,0,0,0]
[null,null,null,"","",null,0,0,0,0]
[null,"MÃO DE OBRA (B) - TOTAL",null,null,null,null,null,null,0.74,0.86]
[null,"AGETOP_I",3070,"BUCHA DE NYLON S-6","un",2,0.04,0.04,0.08,0.08]
[null,"AGETOP_I",3393,"PARAFUSO P/BUCHA S-6","un",2,0.08,0.08,0.16,0.16]
[null,"SINAPI_I",37556,"PLACA DE SINALIZACAO DE SEGURANCA CONTRA INCENDIO, FOTOLUMINESCENTE, QUADRADA, *20 X 20* CM, EM PVC *2* MM ANTI-CHAMAS (SIMBOLOS, CORES E PICTOGRAMAS CONFORME NBR 13434)","UN    ",1,23.13,23.13,23.13,23.13]
[null,"MATERIAL (C) - TOTAL",null,null,null,null,null,null,23.369999999999997,23.369999999999997]
[]
[236,"FONTE","CÓDIGO","DESCRIÇÃO","UNIDADE","COEFIC.","CUSTO UNITÁRIO",null,"CUSTO  TOTAL (A) + (B) + (C) + (D) + (E)"]
[null,null,null,null,null,null,"DESONERADO","NÃO DESONER.","DESONERADO","NÃO DESONER."]
[null,"COMPOSIÇÃO","COMP 236_SEE","PLACA DE SINALIZAÇÃO EM PVC COD 06 - (300X300) PERIGO INFLAMÁVEL","UN ",null,null,null,24.109999999999996,24.229999999999997]
[null,"AGETOP_I",5,"SERVENTE","h     ",0.09,8.1999999999999993,9.51,0.74,0.86]
[null,null,null,"","",null,0,0,0,0]
[null,null,null,"","",null,0,0,0,0]
[null,"MÃO DE OBRA (B) - TOTAL",null,null,null,null,null,null,0.74,0.86]
[null,"AGETOP_I",3070,"BUCHA DE NYLON S-6","un",2,0.04,0.04,0.08,0.08]
[null,"AGETOP_I",3393,"PARAFUSO P/BUCHA S-6","un",2,0.08,0.08,0.16,0.16]
[null,"SINAPI_I",37556,"PLACA DE SINALIZACAO DE SEGURANCA CONTRA INCENDIO, FOTOLUMINESCENTE, QUADRADA, *20 X 20* CM, EM PVC *2* MM ANTI-CHAMAS (SIMBOLOS, CORES E PICTOGRAMAS CONFORME NBR 13434)","UN    ",1,23.13,23.13,23.13,23.13]
[null,"MATERIAL (C) - TOTAL",null,null,null,null,null,null,23.369999999999997,23.369999999999997]
[]
[196,"FONTE","CÓDIGO","DESCRIÇÃO","UNIDADE","COEFIC.","CUSTO UNITÁRIO",null,"CUSTO  TOTAL (A) + (B) + (C) + (D) + (E)"]
[null,null,null,null,null,null,"DESONERADO","NÃO DESONER.","DESONERADO","NÃO DESONER."]
[null,"COMPOSIÇÃO","COMP 196_SEE","COMPL. DE MURO DE ALV. DE TIJ. FURADO - 1/2 VEZ - C/ CHP. PEDRISCO - H=0,50 M","M",null,null,null,28.800000000000004,31.1]
[null,"AGETOP_I",5,"SERVENTE","h     ",0.61899999999999999,8.1999999999999993,9.51,5.08,5.89]
[null,"AGETOP_I",4,"PEDREIRO","h     ",0.53580000000000005,13.4,15.53,7.18,8.32]
[null,"MÃO DE OBRA (B) - TOTAL",null,null,null,null,null,null,12.26,14.21]
[null,"AGETOP",60192,"FORMA DE TABUA CINTA/PILAR SOBRE/ENTRE ALVENARIA U=8 VEZES","m2    ",0.1,13.48,14.53,1.35,1.45]
[null,"AGETOP",60303,"ACO CA-50-A - 6,3 MM (1/4\") - (OBRAS CIVIS)","Kg    ",0.25,6.58,6.85,1.65,1.71]
[null,"AGETOP",60304,"ACO CA-50 A - 8,0 MM (5/16\") - (OBRAS CIVIS)","Kg    ",0.3,6.38,6.65,1.91,2]
[null,"AGETOP",60314,"ACO CA - 60 - 5,0 MM - (OBRAS CIVIS)","Kg    ",0.15,6.55,6.8,0.98,1.02]
[null,"AGETOP",60505,"PREPARO COM BETONEIRA E TRANSPORTE MANUAL DE CONCRETO FCK-15 - (O.C.)","m3    ",5.000000000000001E-3,305.72000000000003,313.49,1.53,1.57]
[null,"AGETOP",60800,"LANÇAMENTO/APLICAÇÃO/ADENSAMENTO DE CONCRETO USINADO BOMBEADO EM ESTRUTURA - (O.C.)","m3    ",5.000000000000001E-3,31.28,36.24,0.16,0.18]
[null,"AGETOP_I",2034,"TIJOLO FURADO 19x19x9","un",13.5,0.48,0.48,6.48,6.48]
[null,"AGETOP_I",1215,"CIMENTO PORTLAND C.P. 32","Kg",1.4249999999999998,0.39,0.39,0.56000000000000005,0.56000000000000005]
[null,"AGETOP_I",104,"AREIA MEDIA ","m3",9.0000000000000011E-3,82.85,82.85,0.75,0.75]
[null,"AGETOP_I",2388,"PEDRISCO (DIAM. BRITA 0)","m3",7.0000000000000001E-3,90.36,90.36,0.63,0.63]
[null,"AGETOP_I",1221,"CAL HIDRATADA","Kg",1.0015000000000001,0.54,0.54,0.54,0.54]
[null,"MATERIAL (C) - TOTAL",null,null,null,null,null,null,16.540000000000003,16.89]
[]
[46,"FONTE","CÓDIGO","DESCRIÇÃO","UNIDADE","COEFIC.","CUSTO UNITÁRIO",null,"CUSTO  TOTAL (A) + (B) + (C) + (D) + (E)"]
[null,null,null,null,null,null,"DESONERADO","NÃO DESONER.","DESONERADO","NÃO DESONER."]
[null,"COMPOSIÇÃO","COMP 046_SEE","CAPUZ PARA PROTEÇÃO DOS PARA RAIOS","UN ",null,null,null,16.53,16.650000000000002]
[null,"AGETOP_I",8,"AJUDANTE","h     ",3.3300000000000003E-2,8.1999999999999993,9.51,0.27,0.32]
[null,"AGETOP_I",12,"ELETRICISTA","h     ",3.3300000000000003E-2,13.4,15.53,0.45,0.52]
[null,null,null,"","",null,0,0,0,0]
[null,"MÃO DE OBRA (B) - TOTAL",null,null,null,null,null,null,0.72,0.84000000000000008]
[null,"COTAÇÃO","COT 010_SEE","CAPUZ PARA PROTEÇÃO DOS PARA RAIOS","UN ",1,15.81,15.81,15.81,15.81]
[null,null,null,"","",null,0,0,0,0]
[null,null,null,"","",null,0,0,0,0]
[null,"MATERIAL (C) - TOTAL",null,null,null,null,null,null,15.81,15.81]
[]
[47,"FONTE","CÓDIGO","DESCRIÇÃO","UNIDADE","COEFIC.","CUSTO UNITÁRIO",null,"CUSTO  TOTAL (A) + (B) + (C) + (D) + (E)"]
[null,null,null,null,null,null,"DESONERADO","NÃO DESONER.","DESONERADO","NÃO DESONER."]
[null,"COMPOSIÇÃO","COMP 047_SEE","CAPUZ DE PROTEÇÃO PARA BUCHA DE TRANSFORMADOR","UN ",null,null,null,16.53,16.650000000000002]
[null,"AGETOP_I",8,"AJUDANTE","h     ",3.3300000000000003E-2,8.1999999999999993,9.51,0.27,0.32]
[null,"AGETOP_I",12,"ELETRICISTA","h     ",3.3300000000000003E-2,13.4,15.53,0.45,0.52]
[null,null,null,"","",null,0,0,0,0]
[null,"MÃO DE OBRA (B) - TOTAL",null,null,null,null,null,null,0.72,0.84000000000000008]
[null,"COTAÇÃO","COT 011_SEE","CAPUZ DE PROTEÇÃO PARA BUCHA DE TRANSFORMADOR","UN ",1,15.81,15.81,15.81,15.81]
[null,null,null,"","",null,0,0,0,0]
[null,null,null,"","",null,0,0,0,0]
[null,"MATERIAL (C) - TOTAL",null,null,null,null,null,null,15.81,15.81]
[]
[48,"FONTE","CÓDIGO","DESCRIÇÃO","UNIDADE","COEFIC.","CUSTO UNITÁRIO",null,"CUSTO  TOTAL (A) + (B) + (C) + (D) + (E)"]
[null,null,null,null,null,null,"DESONERADO","NÃO DESONER.","DESONERADO","NÃO DESONER."]
[null,"COMPOSIÇÃO","COMP 048_SEE","HASTE ROSQUEADA \"TIRANTE\" 3/8\"","M",null,null,null,14.02,15.39]
[null,"AGETOP_I",8,"AJUDANTE","h     ",0.4,8.1999999999999993,9.51,3.28,3.8]
[null,"AGETOP_I",12,"ELETRICISTA","h     ",0.4,13.4,15.53,5.36,6.21]
[null,null,null,"","",null,0,0,0,0]
[null,"MÃO DE OBRA (B) - TOTAL",null,null,null,null,null,null,8.64,10.01]
[null,"COTAÇÃO","COT 012_SEE","HASTE ROSQUEADA \"TIRANTE\" 3/8\"","M",1,5.3833333333333329,5.3833333333333329,5.38,5.38]
[null,null,null,"","",null,0,0,0,0]
[null,null,null,"","",null,0,0,0,0]
[null,"MATERIAL (C) - TOTAL",null,null,null,null,null,null,5.38,5.38]
[]
[49,"FONTE","CÓDIGO","DESCRIÇÃO","UNIDADE","COEFIC.","CUSTO UNITÁRIO",null,"CUSTO  TOTAL (A) + (B) + (C) + (D) + (E)"]
[null,null,null,null,null,null,"DESONERADO","NÃO DESONER.","DESONERADO","NÃO DESONER."]
[null,"COMPOSIÇÃO","COMP 049_SEE","PORCA SEXTAVADA 3/8\"","UN ",null,null,null,0.2,0.22]
[null,"AGETOP_I",8,"AJUDANTE","h     ",8.9999999999999993E-3,8.1999999999999993,9.51,7.0000000000000007E-2,0.09]
[null,null,null,"","",null,0,0,0,0]
[null,null,null,"","",null,0,0,0,0]
[null,"MÃO DE OBRA (B) - TOTAL",null,null,null,null,null,null,7.0000000000000007E-2,0.09]
[null,"COTAÇÃO","COT 013_SEE","PORCA SEXTAVADA 3/8\"","UN ",1,0.13,0.13,0.13,0.13]
[null,null,null,"","",null,0,0,0,0]
[null,null,null,"","",null,0,0,0,0]
[null,"MATERIAL (C) - TOTAL",null,null,null,null,null,null,0.13,0.13]
[]
[17,"FONTE","CÓDIGO","DESCRIÇÃO","UNIDADE","COEFIC.","CUSTO UNITÁRIO",null,"CUSTO  TOTAL (A) + (B) + (C) + (D) + (E)"]
[null,null,null,null,null,null,"DESONERADO","NÃO DESONER.","DESONERADO","NÃO DESONER."]
[null,"COMPOSIÇÃO","COMP 017_SEE","REDUCAO GIRATÓRIA TIPO STORZ LATAO P/ INST. PREDIAL COMBATE A INCENDIO ENGATE RAPIDO 2.1/2\" X 1.1/2\"","UN ",null,"-","-",99.14,99.69]
[null,"AGETOP_I",8,"AJUDANTE","h     ",0.16,8.1999999999999993,9.51,1.31,1.52]
[null,"AGETOP_I",11,"ENCANADOR","h     ",0.16,13.4,15.53,2.14,2.48]
[null,null,null,"","",null,0,0,0,0]
[null,"MÃO DE OBRA (B) - TOTAL",null,null,null,null,null,null,3.45,4]
[null,"SINAPI_I",20972,"REDUCAO FIXA TIPO STORZ, ENGATE RAPIDO 2.1/2\" X 1.1/2\", EM LATAO, PARA INSTALACAO PREDIAL COMBATE A INCENDIO PREDIAL","UN    ",1,95.69,95.69,95.69,95.69]
[null,null,null,"","",null,0,0,0,0]
[null,null,null,"","",null,0,0,0,0]
[null,"MATERIAL (C) - TOTAL",null,null,null,null,null,null,95.69,95.69]
[]
[18,"FONTE","CÓDIGO","DESCRIÇÃO","UNIDADE","COEFIC.","CUSTO UNITÁRIO",null,"CUSTO  TOTAL (A) + (B) + (C) + (D) + (E)"]
[null,null,null,null,null,null,"DESONERADO","NÃO DESONER.","DESONERADO","NÃO DESONER."]
[null,"COMPOSIÇÃO","COMP 018_SEE","CHAVE DUPLA P/ CONEXÕES TIPO STORZ EM LATÃO ENGATE RÁPIDO 1 1/2\" X 2 1/2\"","UN ",null,"-","-",14.76,15.08]
[null,"AGETOP_I",11,"ENCANADOR","h     ",0.15,13.4,15.53,2.0099999999999998,2.33]
[null,null,null,"","",null,0,0,0,0]
[null,null,null,"","",null,0,0,0,0]
[null,"MÃO DE OBRA (B) - TOTAL",null,null,null,null,null,null,2.0099999999999998,2.33]
[null,"SINAPI_I",20971,"CHAVE DUPLA PARA CONEXOES TIPO STORZ, ENGATE RAPIDO 1 1/2\" X 2 1/2\", EM LATAO, PARA INSTALACAO PREDIAL COMBATE A INCENDIO","UN    ",1,12.75,12.75,12.75,12.75]
[null,null,null,"","",null,0,0,0,0]
[null,null,null,"","",null,0,0,0,0]
[null,"MATERIAL (C) - TOTAL",null,null,null,null,null,null,12.75,12.75]
[]
[87,"FONTE","CÓDIGO","DESCRIÇÃO","UNIDADE","COEFIC.","CUSTO UNITÁRIO",null,"CUSTO  TOTAL (A) + (B) + (C) + (D) + (E)"]
[null,null,null,null,null,null,"DESONERADO","NÃO DESONER.","DESONERADO","NÃO DESONER."]
[null,"COMPOSIÇÃO","COMP 087_SEE","REGISTRO DE GAVETA COM HASTE ASCENDENTE DE BRONZE 2 1/2\"","UN ",null,null,null,257.29999999999995,261.26]
[null,"AGETOP_I",8,"AJUDANTE","h     ",1.1499999999999999,8.1999999999999993,9.51,9.43,10.94]
[null,"AGETOP_I",11,"ENCANADOR","h     ",1.1499999999999999,13.4,15.53,15.41,17.86]
[null,null,null,"","",null,0,0,0,0]
[null,"MÃO DE OBRA (B) - TOTAL",null,null,null,null,null,null,24.84,28.799999999999997]
[null,"AGETOP_I","H689","FITA VEDAROSCA 12 MM","m",2.82,0.28000000000000003,0.28000000000000003,0.79,0.79]
[null,"COTAÇÃO","COT 017_SEE","REGISTRO DE GAVETA COM HASTE ASCENDENTE DE BRONZE 2 1/2\"","UN ",1,231.66666666666666,231.66666666666666,231.67,231.67]
[null,null,null,"","",null,0,0,0,0]
[null,"MATERIAL (C) - TOTAL",null,null,null,null,null,null,232.45999999999998,232.45999999999998]
[]
[30,"FONTE","CÓDIGO","DESCRIÇÃO","UNIDADE","COEFIC.","CUSTO UNITÁRIO",null,"CUSTO  TOTAL (A) + (B) + (C) + (D) + (E)"]
[null,null,null,null,null,null,"DESONERADO","NÃO DESONER.","DESONERADO","NÃO DESONER."]
[null,"COMPOSIÇÃO","COMP 030_SEE","COTOVELO DE FERRO GALV. 90° X 2 1/2\"","UN ",null,null,null,72.34,75.509999999999991]
[null,"AGETOP_I",8,"AJUDANTE","h     ",0.92,8.1999999999999993,9.51,7.54,8.75]
[null,"AGETOP_I",11,"ENCANADOR","h     ",0.92,13.4,15.53,12.33,14.29]
[null,"MÃO DE OBRA (B) - TOTAL",null,null,null,null,null,null,19.87,23.04]
[null,"SINAPI_I",3470,"COTOVELO 90 GRAUS DE FERRO GALVANIZADO, COM ROSCA BSP, DE 2 1/2\"","UN    ",1,51.91,51.91,51.91,51.91]
[null,"AGETOP_I","H689","FITA VEDAROSCA 12 MM","m",2,0.28000000000000003,0.28000000000000003,0.56000000000000005,0.56000000000000005]
[null,"MATERIAL (C) - TOTAL",null,null,null,null,null,null,52.47,52.47]
[]
[77,"FONTE","CÓDIGO","DESCRIÇÃO","UNIDADE","COEFIC.","CUSTO UNITÁRIO",null,"CUSTO  TOTAL (A) + (B) + (C) + (D) + (E)"]
[null,null,null,null,null,null,"DESONERADO","NÃO DESONER.","DESONERADO","NÃO DESONER."]
[null,"COMPOSIÇÃO","COMP 077_SEE","UNIAO FERRO GALV C/ASSENTO CONICO BRONZE 2 1/2\"","UN ",null,null,null,157.36000000000001,158.72999999999999]
[null,"AGETOP_I",8,"AJUDANTE","h     ",0.4,8.1999999999999993,9.51,3.28,3.8]
[null,"AGETOP_I",11,"ENCANADOR","h     ",0.4,13.4,15.53,5.36,6.21]
[null,"MÃO DE OBRA (B) - TOTAL",null,null,null,null,null,null,8.64,10.01]
[null,"AGETOP_I","H689","FITA VEDAROSCA 12 MM","m",2.4,0.28000000000000003,0.28000000000000003,0.67,0.67]
[null,"SINAPI_I",12427,"UNIAO COM ASSENTO CONICO DE BRONZE, DIAMETRO 2 1/2\"","UN    ",1,148.05000000000001,148.05000000000001,148.05000000000001,148.05000000000001]
[null,"MATERIAL (C) - TOTAL",null,null,null,null,null,null,148.72,148.72]
[]
[76,"FONTE","CÓDIGO","DESCRIÇÃO","UNIDADE","COEFIC.","CUSTO UNITÁRIO",null,"CUSTO  TOTAL (A) + (B) + (C) + (D) + (E)"]
[null,null,null,null,null,null,"DESONERADO","NÃO DESONER.","DESONERADO","NÃO DESONER."]
[null,"COMPOSIÇÃO","COMP 076_SEE","CURVA FERRO GALVANIZADO 45G ROSCA MACHO/FEMEA REF. 2 1/2\"","UN ",null,null,null,122.92,126.09]
[null,"AGETOP_I",8,"AJUDANTE","h     ",0.92,8.1999999999999993,9.51,7.54,8.75]
[null,"AGETOP_I",11,"ENCANADOR","h     ",0.92,13.4,15.53,12.33,14.29]
[null,"MÃO DE OBRA (B) - TOTAL",null,null,null,null,null,null,19.87,23.04]
[null,"SINAPI_I",3148,"FITA VEDA ROSCA EM ROLOS DE 18 MM X 50 M (L X C)","UN    ",4.9099999999999998E-2,12.9,12.9,0.63,0.63]
[null,"SINAPI_I",1784,"CURVA 45 GRAUS DE FERRO GALVANIZADO, COM ROSCA BSP MACHO/FEMEA, DE 2 1/2\"","UN    ",1,102.42,102.42,102.42,102.42]
[null,"MATERIAL (C) - TOTAL",null,null,null,null,null,null,103.05,103.05]
[]
[22,"FONTE","CÓDIGO","DESCRIÇÃO","UNIDADE","COEFIC.","CUSTO UNITÁRIO",null,"CUSTO  TOTAL (A) + (B) + (C) + (D) + (E)"]
[null,null,null,null,null,null,"DESONERADO","NÃO DESONER.","DESONERADO","NÃO DESONER."]
[null,"COMPOSIÇÃO","COMP 022_SEE","TAMPÃO FOFO 40X50CM C/INSCRIÇÃO ","UN ",null,"-","-",199.82999999999998,200.15]
[null,"AGETOP_I",11,"ENCANADOR","h     ",0.15,13.4,15.53,2.0099999999999998,2.33]
[null,null,null,"","",null,0,0,0,0]
[null,null,null,"","",null,0,0,0,0]
[null,"MÃO DE OBRA (B) - TOTAL",null,null,null,null,null,null,2.0099999999999998,2.33]
[null,"SINAPI_I",11293,"TAMPAO FOFO SIMPLES COM BASE, CLASSE A15 CARGA MAX 1,5 T, 400 X 500 MM, COM INSCRICAO INCENDIO","UN    ",1,197.82,197.82,197.82,197.82]
[null,null,null,"","",null,0,0,0,0]
[null,null,null,"","",null,0,0,0,0]
[null,"MATERIAL (C) - TOTAL",null,null,null,null,null,null,197.82,197.82]
[]
[24,"FONTE","CÓDIGO","DESCRIÇÃO","UNIDADE","COEFIC.","CUSTO UNITÁRIO",null,"CUSTO  TOTAL (A) + (B) + (C) + (D) + (E)"]
[null,null,null,null,null,null,"DESONERADO","NÃO DESONER.","DESONERADO","NÃO DESONER."]
[null,"COMPOSIÇÃO","COMP 024_SEE","SINALIZADOR FOTOLUMINESCENTE PARA EXTINTOR","UN ",null,"-","-",24.109999999999996,24.229999999999997]
[null,"AGETOP_I",5,"SERVENTE","h     ",0.09,8.1999999999999993,9.51,0.74,0.86]
[null,null,null,"","",null,0,0,0,0]
[null,null,null,"","",null,0,0,0,0]
[null,"MÃO DE OBRA (B) - TOTAL",null,null,null,null,null,null,0.74,0.86]
[null,"AGETOP_I",3070,"BUCHA DE NYLON S-6","un",2,0.04,0.04,0.08,0.08]
[null,"AGETOP_I",3393,"PARAFUSO P/BUCHA S-6","un",2,0.08,0.08,0.16,0.16]
[null,"SINAPI_I",37556,"PLACA DE SINALIZACAO DE SEGURANCA CONTRA INCENDIO, FOTOLUMINESCENTE, QUADRADA, *20 X 20* CM, EM PVC *2* MM ANTI-CHAMAS (SIMBOLOS, CORES E PICTOGRAMAS CONFORME NBR 13434)","UN    ",1,23.13,23.13,23.13,23.13]
[null,"MATERIAL (C) - TOTAL",null,null,null,null,null,null,23.369999999999997,23.369999999999997]
[]
[186,"FONTE","CÓDIGO","DESCRIÇÃO","UNIDADE","COEFIC.","CUSTO UNITÁRIO",null,"CUSTO  TOTAL (A) + (B) + (C) + (D) + (E)"]
[null,null,null,null,null,null,"DESONERADO","NÃO DESONER.","DESONERADO","NÃO DESONER."]
[null,"COMPOSIÇÃO","COMP 186_SEE","BOTOEIRA BOMBA DE INCÊNDIO C/ MARTELO CONVENCIONAL/ ANALÓGICA","UN ",null,null,null,85.1,88.539999999999992]
[null,"AGETOP_I",8,"AJUDANTE","h     ",1,8.1999999999999993,9.51,8.1999999999999993,9.51]
[null,"AGETOP_I",12,"ELETRICISTA","h     ",1,13.4,15.53,13.4,15.53]
[null,null,null,"","",null,0,0,0,0]
[null,"MÃO DE OBRA (B) - TOTAL",null,null,null,null,null,null,21.6,25.04]
[null,"COTAÇÃO","COT 088_SEE","BOTOEIRA BOMBA DE INCÊNDIO C/ MARTELO CONVENCIONAL/ ANALÓGICA","UN",1,63.5,63.5,63.5,63.5]
[null,null,null,"","",null,0,0,0,0]
[null,null,null,"","",null,0,0,0,0]
[null,"MATERIAL (C) - TOTAL",null,null,null,null,null,null,63.5,63.5]
[]
[188,"FONTE","CÓDIGO","DESCRIÇÃO","UNIDADE","COEFIC.","CUSTO UNITÁRIO",null,"CUSTO  TOTAL (A) + (B) + (C) + (D) + (E)"]
[null,null,null,null,null,null,"DESONERADO","NÃO DESONER.","DESONERADO","NÃO DESONER."]
[null,"COMPOSIÇÃO","COMP 188_SEE","ACIONADOR MANUAL DE ALARME","UN ",null,null,null,100.61,103.36]
[null,"AGETOP_I",8,"AJUDANTE","h     ",0.8,8.1999999999999993,9.51,6.56,7.61]
[null,"AGETOP_I",12,"ELETRICISTA","h     ",0.8,13.4,15.53,10.72,12.42]
[null,null,null,"","",null,0,0,0,0]
[null,"MÃO DE OBRA (B) - TOTAL",null,null,null,null,null,null,17.28,20.03]
[null,"COTAÇÃO","COT 090_SEE","ACIONADOR MANUAL DE ALARME","UN",1,83.333333333333329,83.333333333333329,83.33,83.33]
[null,null,null,"","",null,0,0,0,0]
[null,null,null,"","",null,0,0,0,0]
[null,"MATERIAL (C) - TOTAL",null,null,null,null,null,null,83.33,83.33]
[]
[190,"FONTE","CÓDIGO","DESCRIÇÃO","UNIDADE","COEFIC.","CUSTO UNITÁRIO",null,"CUSTO  TOTAL (A) + (B) + (C) + (D) + (E)"]
[null,null,null,null,null,null,"DESONERADO","NÃO DESONER.","DESONERADO","NÃO DESONER."]
[null,"COMPOSIÇÃO","COMP 190_SEE","CENTRAL DE DETECÇÃO E ALARME DE 40 SETORES COM BATERIA","UN ",null,null,null,1136.1300000000001,1163.6500000000001]
[null,"AGETOP_I",8,"AJUDANTE","h     ",8,8.1999999999999993,9.51,65.599999999999994,76.08]
[null,"AGETOP_I",12,"ELETRICISTA","h     ",8,13.4,15.53,107.2,124.24]
[null,null,null,"","",null,0,0,0,0]
[null,"MÃO DE OBRA (B) - TOTAL",null,null,null,null,null,null,172.8,200.32]
[null,"COTAÇÃO","COT 092_SEE","CENTRAL DE DETECÇÃO E ALARME DE 40 SETORES COM BATERIA (PREÇO MÉDIO)","UN",1,963.33333333333337,963.33333333333337,963.33,963.33]
[null,null,null,"","",null,0,0,0,0]
[null,null,null,"","",null,0,0,0,0]
[null,"MATERIAL (C) - TOTAL",null,null,null,null,null,null,963.33,963.33]
[]
[25,"FONTE","CÓDIGO","DESCRIÇÃO","UNIDADE","COEFIC.","CUSTO UNITÁRIO",null,"CUSTO  TOTAL (A) + (B) + (C) + (D) + (E)"]
[null,null,null,null,null,null,"DESONERADO","NÃO DESONER.","DESONERADO","NÃO DESONER."]
[null,"COMPOSIÇÃO","COMP 025_SEE","SINALIZADOR FOTOLUMINESCENTE DE EMERGÊNCIA","UN ",null,"-","-",24.109999999999996,24.229999999999997]
[null,"AGETOP_I",5,"SERVENTE","h     ",0.09,8.1999999999999993,9.51,0.74,0.86]
[null,"MÃO DE OBRA (B) - TOTAL",null,null,null,null,null,null,0.74,0.86]
[null,"AGETOP_I",3070,"BUCHA DE NYLON S-6","un",2,0.04,0.04,0.08,0.08]
[null,"AGETOP_I",3393,"PARAFUSO P/BUCHA S-6","un",2,0.08,0.08,0.16,0.16]
[null,"SINAPI_I",37556,"PLACA DE SINALIZACAO DE SEGURANCA CONTRA INCENDIO, FOTOLUMINESCENTE, QUADRADA, *20 X 20* CM, EM PVC *2* MM ANTI-CHAMAS (SIMBOLOS, CORES E PICTOGRAMAS CONFORME NBR 13434)","UN    ",1,23.13,23.13,23.13,23.13]
[null,"MATERIAL (C) - TOTAL",null,null,null,null,null,null,23.369999999999997,23.369999999999997]
[]
[277,"FONTE","CÓDIGO","DESCRIÇÃO","UNIDADE","COEFIC.","CUSTO UNITÁRIO",null,"CUSTO  TOTAL (A) + (B) + (C) + (D) + (E)"]
[null,null,null,null,null,null,"DESONERADO","NÃO DESONER.","DESONERADO","NÃO DESONER."]
[null,"COMPOSIÇÃO","COMP 277_SEE","MARCAÇÃO NO PISO - 1X1 M PARA EXTINTOR","M2",null,null,null,28.63,28.7]
[null,"AGETOP_I",5,"SERVENTE","h     ",3.3300000000000003E-2,8.1999999999999993,9.51,0.27,0.32]
[null,null,null,"","",null,0,0,0,0]
[null,null,null,"","",null,0,0,0,0]
[null,"MÃO DE OBRA (B) - TOTAL",null,null,null,null,null,null,0.27,0.32]
[null,"SINAPI_I",5318,"SOLVENTE DILUENTE A BASE DE AGUARRAS","L     ",0.13,11.98,11.98,1.56,1.56]
[null,"SINAPI",5824,"CAMINHÃO TOCO, PBT 16.000 KG, CARGA ÚTIL MÁX. 10.685 KG, DIST. ENTRE EIXOS 4,8 M, POTÊNCIA 189 CV, INCLUSIVE CARROCERIA FIXA ABERTA DE MADEIRA P/ TRANSPORTE GERAL DE CARGA SECA, DIMEN. APROX. 2,5 X 7,00 X 0,50 M - CHP DIURNO. AF_06/2014","CHP",3.3E-3,137.26,140.47,0.45,0.46]
[null,"SINAPI_I",7343,"TINTA A BASE DE RESINA ACRILICA, PARA SINALIZACAO HORIZONTAL VIARIA (NBR 11862)","L     ",0.6,11.05,11.05,6.63,6.63]
[null,"SINAPI_I",7348,"TINTA ACRILICA PREMIUM PARA PISO","L     ",0.03,12,12,0.36,0.36]
[null,"SINAPI_I",25972,"MICROESFERAS DE VIDRO PARA SINALIZACAO HORIZONTAL VIARIA, TIPO I-B (PREMIX) - NBR 16184","KG    ",2.14,8.8800000000000008,8.8800000000000008,19,19]
[null,"SINAPI",95133,"MÁQUINA DEMARCADORA DE FAIXA DE TRÁFEGO À FRIO, AUTOPROPELIDA, POTÊNCIA 38 HP - CHP DIURNO. AF_07/2016","CHP",3.3E-3,109.96,113.54,0.36,0.37]
[null,"MATERIAL (C) - TOTAL",null,null,null,null,null,null,28.36,28.38]
[]
[40,"FONTE","CÓDIGO","DESCRIÇÃO","UNIDADE","COEFIC.","CUSTO UNITÁRIO",null,"CUSTO  TOTAL (A) + (B) + (C) + (D) + (E)"]
[null,null,null,null,null,null,"DESONERADO","NÃO DESONER.","DESONERADO","NÃO DESONER."]
[null,"COMPOSIÇÃO","COMP 040_SEE","CONJUNTO MOTOR-BOMBA ELÉTRICA TRIFÁSICO 380/220 V PARA VZ= 24,33 M³/H, HM= 46,24 M POTÊNCIA= 7,5 CV","UN ",null,null,null,3965.4700000000003,3992.9900000000002]
[null,"AGETOP_I",8,"AJUDANTE","h     ",8,8.1999999999999993,9.51,65.599999999999994,76.08]
[null,"AGETOP_I",11,"ENCANADOR","h     ",8,13.4,15.53,107.2,124.24]
[null,null,null,"","",null,0,0,0,0]
[null,"MÃO DE OBRA (B) - TOTAL",null,null,null,null,null,null,172.8,200.32]
[null,"COTAÇÃO","COT 008_SEE","CONJUNTO MOTOR-BOMBA ELÉTRICA TRIFÁSICO 380/220 V PARA VZ= 24,33 M³/H, HM= 46,24 M POTÊNCIA= 7,5 CV","UN ",1,3792.6666666666665,3792.6666666666665,3792.67,3792.67]
[null,null,null,"","",null,0,0,0,0]
[null,null,null,"","",null,0,0,0,0]
[null,"MATERIAL (C) - TOTAL",null,null,null,null,null,null,3792.67,3792.67]
[]
[546,"FONTE","CÓDIGO","DESCRIÇÃO","UNID ","COEFIC.","CUSTO UNITÁRIO",null,"CUSTO  TOTAL (A) + (B) + (C) + (D) + (E)"]
[null,null,null,null,null,null,"DESONERADO","NÃO DESONER.","DESONERADO","NÃO DESONER."]
[null,"COMPOSIÇÃO","COMP 546_SEE","BUJÃO DE REBORDO 2.1/2\"","UN ","-","-","-",16.509999999999998,16.760000000000002]
[null,"AGETOP_I",8,"AJUDANTE","h     ",7.0000000000000007E-2,8.1999999999999993,9.51,0.56999999999999995,0.67]
[null,"AGETOP_I",11,"ENCANADOR","h     ",7.0000000000000007E-2,13.4,15.53,0.94,1.0900000000000001]
[null,null,null,"","",null,0,0,0,0]
[null,"MÃO DE OBRA (B) - TOTAL",null,null,null,null,null,null,1.5099999999999998,1.7600000000000002]
[null,"COTAÇÃO","COT 286_SEE","BUJÃO DE REBORDO 2.1/2\"","UN ",1,15,15,15,15]
[null,null,null,"","",null,0,0,0,0]
[null,null,null,"","",null,0,0,0,0]
[null,"MATERIAL (C) - TOTAL",null,null,null,null,null,null,15,15]
[]
[548,"FONTE","CÓDIGO","DESCRIÇÃO","UNID ","COEFIC.","CUSTO UNITÁRIO",null,"CUSTO  TOTAL (A) + (B) + (C) + (D) + (E)"]
[null,null,null,null,null,null,"DESONERADO","NÃO DESONER.","DESONERADO","NÃO DESONER."]
[null,"COMPOSIÇÃO","COMP 548_SEE","VÁLVULA DE ESFERA BRUTA, METAL, ROSCÁVEL, 2.1/2\" - FORNECIMENTO E INSTALAÇÃO","UN ","-","-","-",309.75,312.53999999999996]
[null,"SINAPI",88248,"AUXILIAR DE ENCANADOR OU BOMBEIRO HIDRÁULICO COM ENCARGOS COMPLEMENTARES","H",0.77449999999999997,13.58,15.08,10.52,11.68]
[null,"SINAPI",88267,"ENCANADOR OU BOMBEIRO HIDRÁULICO COM ENCARGOS COMPLEMENTARES","H",0.77449999999999997,17.53,19.64,13.58,15.21]
[null,null,null,"","",null,0,0,0,0]
[null,"MÃO DE OBRA (B) - TOTAL",null,null,null,null,null,null,24.1,26.89]
[null,"SINAPI_I",3148,"FITA VEDA ROSCA EM ROLOS DE 18 MM X 50 M (L X C)","UN    ",9.4999999999999998E-3,12.9,12.9,0.12,0.12]
[null,"COTAÇÃO","COT 290_SEE","VÁLVULA DE ESFERA BRUTA EM METAL, BITOLA 2.1/2\"","UN ",1,285.52600000000001,285.52600000000001,285.52999999999997,285.52999999999997]
[null,null,null,"","",null,0,0,0,0]
[null,"MATERIAL (C) - TOTAL",null,null,null,null,null,null,285.64999999999998,285.64999999999998]
[]
[347,"FONTE","CÓDIGO","DESCRIÇÃO","UNIDADE","COEFIC.","CUSTO UNITÁRIO",null,"CUSTO  TOTAL (A) + (B) + (C) + (D) + (E)"]
[null,null,null,null,null,null,"DESONERADO","NÃO DESONER.","DESONERADO","NÃO DESONER."]
[null,"COMPOSIÇÃO","COMP 347_SEE","ADAPTADOR PVC SOLDAVEL, COM FLANGES LIVRES, 75 MM X 2 1/2\", PARA CAIXA D' AGUA","UN ",null,null,null,120.16,120.63]
[null,"AGETOP_I",11,"ENCANADOR","h     ",0.14000000000000001,13.4,15.53,1.88,2.17]
[null,"AGETOP_I",8,"AJUDANTE","h     ",0.14000000000000001,8.1999999999999993,9.51,1.1499999999999999,1.33]
[null,null,null,"","",null,0,0,0,0]
[null,"MÃO DE OBRA (B) - TOTAL",null,null,null,null,null,null,3.03,3.5]
[null,"SINAPI_I",83,"ADAPTADOR PVC SOLDAVEL, COM FLANGES LIVRES, 75 MM X 2  1/2\", PARA CAIXA D' AGUA","UN    ",1,116.6,116.6,116.6,116.6]
[null,"AGETOP_I","H689","FITA VEDAROSCA 12 MM","m",1.88,0.28000000000000003,0.28000000000000003,0.53,0.53]
[null,null,null,"","",null,0,0,0,0]
[null,"MATERIAL (C) - TOTAL",null,null,null,null,null,null,117.13,117.13]
[]
[387,"FONTE","CÓDIGO","DESCRIÇÃO","UNIDADE","COEFIC.","CUSTO UNITÁRIO",null,"CUSTO  TOTAL (A) + (B) + (C) + (D) + (E)"]
[null,null,null,null,null,null,"DESONERADO","NÃO DESONER.","DESONERADO","NÃO DESONER."]
[null,"COMPOSIÇÃO","COMP 387_SEE","LÂMPADA LED TUBULAR 18W ","UN ",null,null,null,22.28,22.330000000000002]
[null,"AGETOP_I",8,"AJUDANTE","h     ",1.4999999999999999E-2,8.1999999999999993,9.51,0.12,0.14000000000000001]
[null,"AGETOP_I",12,"ELETRICISTA","h     ",1.4999999999999999E-2,13.4,15.53,0.2,0.23]
[null,null,null,"","",null,0,0,0,0]
[null,"MÃO DE OBRA (B) - TOTAL",null,null,null,null,null,null,0.32,0.37]
[null,"COTAÇÃO","COT 195_SEE","LÂMPADA LED TUBULAR 18W ","UN",1,21.959999999999997,21.959999999999997,21.96,21.96]
[null,null,null,"","",null,0,0,0,0]
[null,null,null,"","",null,0,0,0,0]
[null,"MATERIAL (C) - TOTAL",null,null,null,null,null,null,21.96,21.96]