{"text_format":"1","workbook":"xlsx","n_sheets":9,"sheets":["Orçamento","Resumo ","Somatório","Cronog_60_Dias","Composição BDI","Relatório CENTRAL","Parc Maior Relev","Composições","Cotações"],"not_rendered":{"charts":0,"images":3,"macros":1,"external_links":0,"defined_names":81,"comments":3,"pivot_tables":0},"unopened":[],"bounds":{"document_bytes":16777216,"sheet_cells":100000,"rows_first":2000,"rows_last":500,"rows_between":2000,"halvings":0,"cell_chars":16384,"cell_head_chars":4096},"cells_cut":0,"cells_raw":0,"read":"whole","date_system":"1900"}

{"sheet":"Orçamento","index":0,"n_rows":724,"n_cols":34,"rows_kept":724,"cut":false,"hidden":false,"merged":[[705,18,705,20],[705,21,705,22],[706,15,706,17],[706,18,706,20],[706,21,706,22],[707,15,707,17],[707,18,707,20],[707,21,707,22],[702,15,702,17],[702,18,702,20],[702,21,702,22],[703,15,703,17],[703,18,703,20],[703,21,703,22],[704,15,704,17],[704,18,704,20],[704,21,704,22],[716,18,716,20],[716,21,716,22],[711,15,711,17],[711,18,711,20],[711,21,711,22],[712,15,712,17],[712,18,712,20],[712,21,712,22],[713,15,713,17],[713,18,713,20],[713,21,713,22],[18,32,18,33],[692,14,692,17],[699,15,699,17],[665,15,665,17],[720,18,720,20],[720,21,720,22],[708,15,708,17],[708,18,708,20],[708,21,708,22],[709,15,709,17],[709,18,709,20],[709,21,709,22],[710,15,710,17],[710,18,710,20],[710,21,710,22],[714,15,714,17],[714,18,714,20],[714,21,714,22],[715,15,715,17],[715,18,715,20],[715,21,715,22],[716,15,716,17],[705,15,705,17],[660,16,660,22],[723,18,723,20],[723,21,723,22],[720,14,720,17],[717,15,717,17],[717,18,717,20],[717,21,717,22],[718,15,718,17],[718,18,718,20],[718,21,718,22],[719,15,719,17],[719,18,719,20],[719,21,719,22],[722,18,722,20],[722,21,722,22],[721,18,721,20],[721,21,721,22],[698,14,698,23],[699,18,699,20],[699,21,699,22],[700,15,700,17],[700,18,700,20],[700,21,700,22],[701,15,701,17],[701,18,701,20],[701,21,701,22],[656,16,656,22],[657,16,657,22],[658,16,658,22],[3,21,3,22],[2,21,2,22],[5,21,5,22],[10,14,10,23],[13,14,13,23],[6,21,6,22],[9,17,9,20],[2,14,2,20],[3,14,3,20],[5,18,5,20],[6,18,6,20],[11,18,11,20],[12,18,12,20],[6,14,6,17],[5,14,5,17],[678,15,678,17],[679,15,679,17],[680,15,680,17],[681,15,681,17],[682,15,682,17],[683,15,683,17],[684,15,684,17],[685,15,685,17],[686,15,686,17],[666,15,666,17],[667,15,667,17],[668,15,668,17],[669,15,669,17],[670,15,670,17],[671,15,671,17],[672,15,672,17],[673,15,673,17],[674,15,674,17],[687,15,687,17],[688,15,688,17],[689,15,689,17],[690,15,690,17],[691,15,691,17],[664,14,664,23],[653,20,653,21],[652,20,652,21],[648,17,653,17],[648,20,648,21],[665,18,665,20],[665,21,665,22],[666,18,666,20],[666,21,666,22],[654,20,654,21],[674,18,674,20],[674,21,674,22],[675,18,675,20],[675,21,675,22],[676,18,676,20],[676,21,676,22],[677,18,677,20],[677,21,677,22],[689,18,689,20],[692,18,692,20],[692,21,692,22],[689,21,689,22],[690,18,690,20],[690,21,690,22],[691,18,691,20],[691,21,691,22],[681,18,681,20],[681,21,681,22],[688,18,688,20],[688,21,688,22],[683,21,683,22],[684,18,684,20],[684,21,684,22],[686,18,686,20],[682,18,682,20],[682,21,682,22],[683,18,683,20],[693,18,693,20],[693,21,693,22],[680,18,680,20],[680,21,680,22],[673,18,673,20],[673,21,673,22],[695,18,695,20],[695,21,695,22],[649,20,649,21],[671,18,671,20],[671,21,671,22],[672,18,672,20],[672,21,672,22],[670,18,670,20],[670,21,670,22],[679,18,679,20],[650,20,650,21],[661,18,661,22],[667,18,667,20],[667,21,667,22],[668,18,668,20],[668,21,668,22],[669,18,669,20],[669,21,669,22],[659,16,659,22],[8,12,9,12],[694,18,694,20],[694,21,694,22],[0,14,0,22],[8,14,8,16],[9,14,9,16],[11,14,11,16],[12,14,12,16],[14,14,14,22],[1,14,1,22],[4,14,4,22],[7,14,7,22],[678,18,678,20],[678,21,678,22],[686,21,686,22],[675,15,675,17],[676,15,676,17],[677,15,677,17],[679,21,679,22],[687,18,687,20],[687,21,687,22],[685,18,685,20],[685,21,685,22]]}
[]
[]
[null,null,null,null,null,null,null,null,null,null,null,null,null,null,"UNIDADE ESCOLAR",null,null,null,null,null,null,"CÓDIGO INEP"]
[null,null,null,null,null,null,null,null,null,null,null,null,null,null,"CENTRO DE ENSINO EM PERÍODO INTEGRAL JOAQUIM EDSON DE CAMARGO",null,null,null,null,null,null,52035182]
[]
["Nmax",null,null,null,null,null,null,null,null,null,null,null,"Ajustar altura?",null,"OBRA",null,null,null,"DATA",null,null,"CIDADE"]
[{"$f":"MAX($C$18:$C$648)","v":4},null,null,null,null,null,null,null,null,null,null,null,"NÃO",null,"REFORMA E AMPLIAÇÃO",null,null,null,"2020-04-08",null,null,"GOIÂNIA"]
[]
[null,null,null,null,null,null,null,null,null,null,null,null,"",null,"CRE",null,null,"ENDEREÇO",null,null,null,"REFERÊNCIA AGETOP"]
[null,null,null,null,null,null,null,null,null,null,null,null,null,null,"GOIÂNIA",null,null,"RUA SANTIAGO QD. 232 S/N PCA JARDIM DA INFÂNC, JD NOVO MUNDO, CEP:74705-060",null,null,null,"DEZ/18","NÃO DESONERADA"]
[]
[null,null,null,null,null,null,null,null,null,null,null,null,null,null,"ÁREA EXISTENTE (M²)",null,null,"ÁREA A CONSTRUIR (M²)","ÁREA TOTAL CONSTRUÍDA (M²)",null,null,"REFERÊNCIA SINAPI"]
[null,null,null,null,null,null,null,null,null,null,null,null,null,null,1884.9,null,null,197.09,2081.9900000000002,null,null,"FEV/19","NÃO DESONERADA"]
[]
[null,null,null,null,null,null,null,null,null,null,null,"FILTRO",null,null,"PLANILHA ORÇAMENTÁRIA"]
{"$rows_left_out":710}
{"sheet":"Resumo ","index":1,"n_rows":39,"n_cols":9,"rows_kept":39,"cut":false,"hidden":false,"merged":[[13,0,14,0],[34,2,34,3],[35,2,35,3],[31,2,31,3],[32,2,32,3],[33,2,33,3],[28,2,28,3],[29,2,29,3],[30,2,30,3],[0,1,0,8],[36,1,36,5],[2,1,2,5],[3,1,3,5],[5,1,5,5],[6,1,6,5],[8,1,8,5],[9,1,9,5],[11,3,11,5],[12,3,12,5],[10,1,10,8],[11,6,11,8],[12,6,12,8],[25,2,25,3],[21,2,21,3],[22,2,22,3],[6,6,6,8],[7,1,7,8],[8,6,8,8],[9,6,9,8],[13,1,13,8],[1,1,1,8],[2,6,2,8],[3,6,3,8],[4,1,4,8],[5,6,5,8],[42,3,42,7],[11,1,11,2],[12,1,12,2],[15,2,15,3],[16,2,16,3],[14,1,14,8],[17,2,17,3],[23,2,23,3],[18,2,18,3],[19,2,19,3],[20,2,20,3],[41,3,41,7],[24,2,24,3],[26,2,26,3],[27,2,27,3],[38,1,38,8]]}
[]
[]
[null,"UNIDADE ESCOLAR",null,null,null,null,"CÓDIGO INEP"]
[null,{"$f":"Orçamento!$O$4","v":"CENTRO DE ENSINO EM PERÍODO INTEGRAL JOAQUIM EDSON DE CAMARGO"},null,null,null,null,{"$f":"Orçamento!V4","v":52035182}]
[]
[null,"OBRA",null,null,null,null,"CIDADE"]
[null,{"$f":"Orçamento!$O$7","v":"REFORMA E AMPLIAÇÃO"},null,null,null,null,{"$f":"Orçamento!$V$7","v":"GOIÂNIA"}]
[]
[null,"ENDEREÇO",null,null,null,null,"CRE"]
[null,{"$f":"Orçamento!$R$10","v":"RUA SANTIAGO QD. 232 S/N PCA JARDIM DA INFÂNC, JD NOVO MUNDO, CEP:74705-060"},null,null,null,null,{"$f":"Orçamento!$O$10","v":"GOIÂNIA"}]
[]
[null,"REFERÊNCIA",null,"DATA",null,null,"ÁREA TOTAL CONSTRUÍDA (M²)"]
[null,{"$f":"CONCATENATE(\"AGETOP E SINAPI - \",Orçamento!$W$10)","v":"AGETOP E SINAPI - NÃO DESONERADA"},null,{"$f":"Orçamento!$S$7","v":"2020-04-08"},null,null,{"$f":"Orçamento!$S$13","v":2081.9900000000002}]
["FILTRO"]
[null,"RESUMO GERAL DO ORÇAMENTO"]
{"$rows_left_out":25}
{"sheet":"Somatório","index":2,"n_rows":45,"n_cols":6,"rows_kept":45,"cut":false,"hidden":false,"merged":[[13,0,14,0],[42,1,42,2],[44,1,44,5],[47,3,47,5],[48,3,48,5],[13,1,13,5],[9,1,9,3],[9,4,9,5],[11,1,11,2],[11,4,11,5],[12,1,12,2],[12,4,12,5],[0,1,0,5],[14,1,14,5],[2,1,2,3],[2,4,2,5],[3,1,3,3],[3,4,3,5],[5,1,5,3],[5,4,5,5],[6,1,6,3],[6,4,6,5],[8,1,8,3],[8,4,8,5],[1,1,1,5],[4,1,4,5],[7,1,7,5],[10,1,10,5]]}
[]
[]
[null,"UNIDADE ESCOLAR",null,null,"CÓDIGO INEP"]
[null,{"$f":"Orçamento!$O$4","v":"CENTRO DE ENSINO EM PERÍODO INTEGRAL JOAQUIM EDSON DE CAMARGO"},null,null,{"$f":"Orçamento!V4","v":52035182}]
[]
[null,"OBRA",null,null,"CIDADE"]
[null,{"$f":"Orçamento!$O$7","v":"REFORMA E AMPLIAÇÃO"},null,null,{"$f":"Orçamento!$V$7","v":"GOIÂNIA"}]
[]
[null,"ENDEREÇO",null,null,"CRE"]
[null,{"$f":"Orçamento!$R$10","v":"RUA SANTIAGO QD. 232 S/N PCA JARDIM DA INFÂNC, JD NOVO MUNDO, CEP:74705-060"},null,null,{"$f":"Orçamento!$O$10","v":"GOIÂNIA"}]
[]
[null,"REFERÊNCIA",null,"DATA","ÁREA TOTAL CONSTRUÍDA (M²)"]
[null,{"$f":"CONCATENATE(\"AGETOP E SINAPI - \",Orçamento!$W$10)","v":"AGETOP E SINAPI - NÃO DESONERADA"},null,{"$f":"Orçamento!$S$7","v":"2020-04-08"},{"$f":"Orçamento!$S$13","v":2081.9900000000002}]
["FILTRO"]
[null,"SOMATÓRIO DE SERVIÇOS"]
{"$rows_left_out":31}
{"sheet":"Cronog_60_Dias","index":3,"n_rows":99,"n_cols":14,"rows_kept":99,"cut":false,"hidden":false,"merged":[[2,1,2,7],[5,1,5,7],[6,1,6,7],[8,1,8,7],[9,1,9,7],[4,1,4,13],[7,1,7,13],[0,1,0,13],[1,1,1,13],[2,8,2,13],[12,0,13,0],[9,0,11,0],[11,1,11,13],[92,1,92,2],[92,5,92,8],[92,9,92,12],[93,1,93,2],[93,5,93,8],[93,9,93,12],[74,9,74,12],[74,5,74,8],[68,9,68,12],[70,5,70,8],[70,9,70,12],[59,5,59,8],[71,1,73,2],[71,4,73,4],[71,5,71,8],[71,9,71,12],[73,5,73,8],[73,9,73,12],[59,9,59,12],[61,5,61,8],[61,9,61,12],[94,1,94,2],[94,5,94,8],[94,9,94,12],[76,5,76,8],[76,9,76,12],[77,5,77,8],[77,9,77,12],[79,5,79,8],[79,9,79,12],[80,5,80,8],[80,9,80,12],[82,5,82,8],[82,9,82,12],[77,3,79,3],[80,3,82,3],[86,1,88,2],[80,4,82,4],[95,1,95,2],[95,5,95,8],[95,9,95,12],[97,1,97,4],[98,1,98,13],[86,9,86,12],[88,5,88,8],[88,9,88,12],[85,5,85,8],[85,9,85,12],[89,1,91,2],[89,4,91,4],[89,5,89,8],[89,9,89,12],[91,5,91,8],[91,9,91,12],[89,3,91,3],[86,4,88,4],[86,5,86,8],[86,3,88,3],[83,1,85,2],[83,4,85,4],[83,5,83,8],[83,9,83,12],[68,5,68,8],[65,5,65,8],[65,9,65,12],[67,5,67,8],[67,9,67,12],[65,3,67,3],[62,9,62,12],[64,5,64,8],[64,9,64,12],[62,5,62,8],[53,9,53,12],[55,5,55,8],[55,9,55,12],[50,5,50,8],[50,9,50,12],[52,5,52,8],[52,9,52,12],[56,9,56,12],[58,5,58,8],[58,9,58,12],[53,5,53,8],[56,5,56,8],[44,9,44,12],[46,5,46,8],[46,9,46,12],[47,1,49,2],[47,4,49,4],[47,5,47,8],[47,9,47,12],[49,5,49,8],[49,9,49,12],[44,5,44,8],[47,3,49,3],[35,9,35,12],[37,5,37,8],[37,9,37,12],[35,3,37,3],[40,9,40,12],[38,3,40,3],[38,9,38,12],[41,1,43,2],[41,4,43,4],[41,5,41,8],[41,9,41,12],[43,5,43,8],[43,9,43,12],[41,3,43,3],[35,5,35,8],[38,5,38,8],[40,5,40,8],[29,9,29,12],[31,5,31,8],[31,9,31,12],[32,1,34,2],[32,4,34,4],[32,5,32,8],[32,9,32,12],[34,5,34,8],[34,9,34,12],[32,3,34,3],[29,5,29,8],[29,1,31,2],[29,4,31,4],[26,1,28,2],[26,4,28,4],[26,5,26,8],[26,9,26,12],[28,5,28,8],[28,9,28,12],[23,3,25,3],[23,1,25,2],[23,4,25,4],[23,5,23,8],[26,3,28,3],[14,3,16,3],[17,3,19,3],[14,4,16,4],[14,5,14,8],[14,9,14,12],[16,5,16,8],[16,9,16,12],[23,9,23,12],[25,5,25,8],[25,9,25,12],[17,9,17,12],[19,5,19,8],[19,9,19,12],[20,1,22,2],[20,4,22,4],[20,5,20,8],[20,9,20,12],[22,5,22,8],[22,9,22,12],[20,3,22,3],[83,3,85,3],[53,4,55,4],[59,1,61,2],[59,4,61,4],[74,1,76,2],[77,1,79,2],[77,4,79,4],[80,1,82,2],[65,1,67,2],[68,3,70,3],[62,3,64,3],[68,1,70,2],[56,3,58,3],[65,4,67,4],[71,3,73,3],[74,3,76,3],[74,4,76,4],[56,1,58,2],[68,4,70,4],[44,3,46,3],[62,1,64,2],[62,4,64,4],[38,1,40,2],[38,4,40,4],[59,3,61,3],[44,1,46,2],[44,4,46,4],[53,1,55,2],[50,1,52,2],[50,4,52,4],[10,1,10,13],[9,8,9,13],[8,8,8,13],[3,8,3,13],[6,8,6,13],[5,8,5,13],[3,1,3,7],[56,4,58,4],[29,3,31,3],[35,1,37,2],[35,4,37,4],[50,3,52,3],[53,3,55,3],[12,13,13,13],[13,1,13,2],[13,5,13,8],[13,9,13,12],[12,3,13,3],[12,9,12,12],[14,1,16,2],[12,5,12,8],[17,1,19,2],[17,4,19,4],[17,5,17,8]]}
[]
[]
[null,"UNIDADE ESCOLAR",null,null,null,null,null,null,"PRAZO"]
[null,{"$f":"Orçamento!$O$4","v":"CENTRO DE ENSINO EM PERÍODO INTEGRAL JOAQUIM EDSON DE CAMARGO"},null,null,null,null,null,null,"60 DIAS CORRIDOS"]
[]
[null,"OBRA",null,null,null,null,null,null,"DATA"]
[null,{"$f":"Orçamento!$O$7","v":"REFORMA E AMPLIAÇÃO"},null,null,null,null,null,null,{"$f":"Orçamento!$S$7","v":"2020-04-08"}]
[]
[null,"LOCAL",null,null,null,null,null,null,"ÁREA TOTAL CONSTRUÍDA (M²)"]
["FILTRO",{"$f":"Orçamento!$V$7","v":"GOIÂNIA"},null,null,null,null,null,null,{"$f":"Orçamento!$S$13","v":2081.9900000000002}]
[]
[null,"CRONOGRAMA - FÍSICO FINANCEIRO"]
["↓","CUSTO TOTAL:",{"$f":"D93","v":0},"VALOR","Dias:",30,null,null,null,60,null,null,null,"TOTAL"]
[null,"DESCRIÇÃO DOS SERVIÇOS",null,null,"%","1ª PARCELA",null,null,null,"2ª PARCELA"]
[{"$f":"IF(D15>0,\"F\",\"\")","v":""},"SERVIÇOS PRELIMINARES",null,{"$f":"Orçamento!V667","v":0},{"$f":"Orçamento!X667","v":0},{"$f":"ROUND(F17*$D$15,2)","v":0},null,null,null,{"$f":"ROUND(J17*$D$15,2)","v":0},null,null,null,{"$f":"SUM(F15:M15)","v":0}]
{"$rows_left_out":85}
{"sheet":"Composição BDI","index":4,"n_rows":45,"n_cols":9,"rows_kept":45,"cut":false,"hidden":false,"merged":[[11,0,11,3],[12,0,12,3],[14,0,14,3],[15,0,15,3],[13,0,13,3],[0,0,0,3],[1,0,1,3],[4,0,4,3],[7,0,7,3],[10,0,10,3],[2,0,2,3],[3,0,3,3],[5,0,5,3],[6,0,6,3],[8,0,8,3],[9,0,9,3],[18,5,18,8],[17,0,17,3],[16,0,16,3],[44,0,44,3],[42,0,42,3],[43,0,43,3],[18,0,18,3],[36,0,36,3],[39,0,39,3],[38,0,38,3],[40,0,40,3],[29,0,29,2],[32,0,32,3],[33,0,33,3],[34,0,34,3],[35,0,35,3]]}
[]
[]
["UNIDADE ESCOLAR"]
[{"$f":"Orçamento!$O$4","v":"CENTRO DE ENSINO EM PERÍODO INTEGRAL JOAQUIM EDSON DE CAMARGO"}]
[]
["OBRA"]
[{"$f":"Orçamento!$O$7","v":"REFORMA E AMPLIAÇÃO"}]
[]
["ENDEREÇO"]
[{"$f":"Orçamento!$R$10","v":"RUA SANTIAGO QD. 232 S/N PCA JARDIM DA INFÂNC, JD NOVO MUNDO, CEP:74705-060"}]
[]
["CIDADE"]
[{"$f":"Orçamento!$V$7","v":"GOIÂNIA"}]
[]
["CRE"]
{"$rows_left_out":31}
{"sheet":"Relatório CENTRAL","index":5,"n_rows":40,"n_cols":5,"rows_kept":40,"cut":false,"hidden":false,"merged":[[9,0,11,0],[0,1,0,4],[6,3,6,4],[9,3,9,4],[1,1,1,4],[2,1,2,2],[2,3,2,4],[3,1,3,2],[3,3,3,4],[4,1,4,4],[5,1,5,2],[5,3,5,4],[6,1,6,2],[7,1,7,4],[8,1,8,2],[8,3,8,4],[9,1,9,2],[10,1,10,4],[11,1,11,4],[39,1,39,2]]}
[]
[]
[null,"UNIDADE ESCOLAR",null,"CIDADE"]
[null,{"$f":"Orçamento!$O$4","v":"CENTRO DE ENSINO EM PERÍODO INTEGRAL JOAQUIM EDSON DE CAMARGO"},null,{"$f":"Orçamento!$V$7","v":"GOIÂNIA"}]
[]
[null,"OBRA",null,"CRE"]
[null,{"$f":"Orçamento!$O$7","v":"REFORMA E AMPLIAÇÃO"},null,{"$f":"Orçamento!$O$10","v":"GOIÂNIA"}]
[]
[null,"ENDEREÇO",null,"DATA"]
["FILTRO",{"$f":"Orçamento!$R$10","v":"RUA SANTIAGO QD. 232 S/N PCA JARDIM DA INFÂNC, JD NOVO MUNDO, CEP:74705-060"},null,{"$f":"Orçamento!$S$7","v":"2020-04-08"}]
[]
[null,"RELATÓRIO CENTRAL"]
["↓","CÓDIGO","ETAPA","PREÇO  (R$) C/ BDI","PARTIC  ( % )"]
[{"$f":"IF(D14>0,\"F\",\"\")","v":""},{"$f":"Orçamento!O667","v":"a."},{"$f":"Orçamento!P667","v":"SERVIÇOS PRELIMINARES"},{"$f":"Orçamento!V667","v":0},{"$f":"Orçamento!X667","v":0}]
[{"$f":"IF(D15>0,\"F\",\"\")","v":""},{"$f":"Orçamento!O668","v":"b."},{"$f":"Orçamento!P668","v":"TRANSPORTES"},{"$f":"Orçamento!V668","v":0},{"$f":"Orçamento!X668","v":0}]
{"$rows_left_out":26}
{"sheet":"Parc Maior Relev","index":6,"n_rows":21,"n_cols":7,"rows_kept":21,"cut":false,"hidden":false,"merged":[[0,1,0,6],[11,1,11,6],[1,1,1,6],[2,1,2,3],[2,4,2,6],[3,1,3,3],[3,4,3,6],[4,1,4,6],[5,1,5,3],[5,4,5,6],[9,1,9,3],[9,4,9,6],[10,1,10,6],[6,1,6,3],[6,4,6,6],[7,1,7,6],[10,0,12,0],[8,1,8,3],[8,4,8,6],[21,3,21,7],[19,1,19,6]]}
[]
[]
[null,"UNIDADE ESCOLAR",null,null,"CÓDIGO INEP"]
[null,{"$f":"Orçamento!$O$4","v":"CENTRO DE ENSINO EM PERÍODO INTEGRAL JOAQUIM EDSON DE CAMARGO"},null,null,{"$f":"Orçamento!$V$4","v":52035182}]
[]
[null,"OBRA",null,null,"CIDADE"]
[null,{"$f":"Orçamento!$O$7","v":"REFORMA E AMPLIAÇÃO"},null,null,{"$f":"Orçamento!$V$7","v":"GOIÂNIA"}]
[]
[null,"CRE",null,null,"ÁREA TOTAL CONSTRUÍDA (M²)"]
[null,{"$f":"Orçamento!$O$10","v":"GOIÂNIA"},null,null,{"$f":"Orçamento!$S$13","v":2081.9900000000002}]
["FILTRO"]
[null,"PARCELA DE MAIOR RELEVÂNCIA"]
[null,"CÓDIGO","SERVIÇO","DESCRIÇÃO","UNID","QUANT","PARC. MAIOR RELEVÂNCIA"]
[{"$f":"IF(F14>0,\"F\",\"\")","v":"F"},{"$f":"Somatório!B37","v":"u."},{"$f":"IFERROR(VLOOKUP(B14,Orçamento!$O$667:$P$692,2,FALSE),\"(inserir código ao lado)\")","v":"REVESTIMENTO DE PISO"},"PISO DE CONCRETO","M2",548.33000000000004,{"$f":"F14*0.5","v":274.16500000000002}]
[{"$f":"IF(F15>0,\"F\",\"\")","v":"F"},{"$f":"Somatório!B22","v":"f."},{"$f":"IFERROR(VLOOKUP(B15,Orçamento!$O$667:$P$692,2,FALSE),\"(inserir código ao lado)\")","v":"INSTALAÇÕES ELÉTRICAS"},"INSTALAÇOES ELETRICAS","KVA",85.3,{"$f":"F15*1","v":85.3}]
{"$rows_left_out":7}
{"sheet":"Composições","index":7,"n_rows":268,"n_cols":10,"rows_kept":268,"cut":false,"hidden":false,"merged":[[15,0,15,9],[13,0,13,2],[13,3,13,6],[1,0,1,9],[3,7,3,9],[4,7,4,9],[6,7,6,9],[7,7,7,9],[6,0,6,6],[10,8,10,9],[13,8,13,9],[14,0,14,9],[8,0,8,9],[5,0,5,9],[2,0,2,9],[0,0,0,8],[10,0,10,2],[10,3,10,6],[11,0,11,9],[12,0,12,2],[12,3,12,6],[12,7,12,8],[7,0,7,6],[9,0,9,2],[9,3,9,6],[9,7,9,8],[3,0,3,6],[4,0,4,6],[16,5,17,5],[16,6,16,7],[16,8,16,9],[22,1,22,7],[26,1,26,7],[16,0,17,0],[16,1,17,1],[16,2,17,2],[16,3,17,3],[16,4,17,4],[28,5,29,5],[28,6,28,7],[28,8,28,9],[34,1,34,7],[38,1,38,7],[28,0,29,0],[28,1,29,1],[28,2,29,2],[28,3,29,3],[28,4,29,4],[40,5,41,5],[40,6,40,7],[40,8,40,9],[46,1,46,7],[50,1,50,7],[40,0,41,0],[40,1,41,1],[40,2,41,2],[40,3,41,3],[40,4,41,4],[52,5,53,5],[52,6,52,7],[52,8,52,9],[58,1,58,7],[62,1,62,7],[52,0,53,0],[52,1,53,1],[52,2,53,2],[52,3,53,3],[52,4,53,4],[64,5,65,5],[64,6,64,7],[64,8,64,9],[70,1,70,7],[74,1,74,7],[64,0,65,0],[64,1,65,1],[64,2,65,2],[64,3,65,3],[64,4,65,4],[76,5,77,5],[76,6,76,7],[76,8,76,9],[80,1,80,7],[84,1,84,7],[76,0,77,0],[76,1,77,1],[76,2,77,2],[76,3,77,3],[76,4,77,4],[86,5,87,5],[86,6,86,7],[86,8,86,9],[92,1,92,7],[99,1,99,7],[86,0,87,0],[86,1,87,1],[86,2,87,2],[86,3,87,3],[86,4,87,4],[101,5,102,5],[101,6,101,7],[101,8,101,9],[107,1,107,7],[111,1,111,7],[101,0,102,0],[101,1,102,1],[101,2,102,2],[101,3,102,3],[101,4,102,4],[113,5,114,5],[113,6,113,7],[113,8,113,9],[119,1,119,7],[123,1,123,7],[113,0,114,0],[113,1,114,1],[113,2,114,2],[113,3,114,3],[113,4,114,4],[125,5,126,5],[125,6,125,7],[125,8,125,9],[131,1,131,7],[135,1,135,7],[125,0,126,0],[125,1,126,1],[125,2,126,2],[125,3,126,3],[125,4,126,4],[137,5,138,5],[137,6,137,7],[137,8,137,9],[143,1,143,7],[147,1,147,7],[137,0,138,0],[137,1,138,1],[137,2,138,2],[137,3,138,3],[137,4,138,4],[149,5,150,5],[149,6,149,7],[149,8,149,9],[155,1,155,7],[159,1,159,7],[149,0,150,0],[149,1,150,1],[149,2,150,2],[149,3,150,3],[149,4,150,4],[161,5,162,5],[161,6,161,7],[161,8,161,9],[167,1,167,7],[171,1,171,7],[161,0,162,0],[161,1,162,1],[161,2,162,2],[161,3,162,3],[161,4,162,4],[173,5,174,5],[173,6,173,7],[173,8,173,9],[179,1,179,7],[183,1,183,7],[173,0,174,0],[173,1,174,1],[173,2,174,2],[173,3,174,3],[173,4,174,4],[185,5,186,5],[185,6,185,7],[185,8,185,9],[191,1,191,7],[195,1,195,7],[185,0,186,0],[185,1,186,1],[185,2,186,2],[185,3,186,3],[185,4,186,4],[197,5,198,5],[197,6,197,7],[197,8,197,9],[203,1,203,7],[207,1,207,7],[197,0,198,0],[197,1,198,1],[197,2,198,2],[197,3,198,3],[197,4,198,4],[209,5,210,5],[209,6,209,7],[209,8,209,9],[215,1,215,7],[219,1,219,7],[209,0,210,0],[209,1,210,1],[209,2,210,2],[209,3,210,3],[209,4,210,4],[221,5,222,5],[221,6,221,7],[221,8,221,9],[227,1,227,7],[231,1,231,7],[221,0,222,0],[221,1,222,1],[221,2,222,2],[221,3,222,3],[221,4,222,4],[233,5,234,5],[233,6,233,7],[233,8,233,9],[239,1,239,7],[243,1,243,7],[233,0,234,0],[233,1,234,1],[233,2,234,2],[233,3,234,3],[233,4,234,4],[245,5,246,5],[245,6,245,7],[245,8,245,9],[250,1,250,7],[253,1,253,7],[245,0,246,0],[245,1,246,1],[245,2,246,2],[245,3,246,3],[245,4,246,4],[255,5,256,5],[255,6,255,7],[255,8,255,9],[261,1,261,7],[267,1,267,7],[255,0,256,0],[255,1,256,1],[255,2,256,2],[255,3,256,3],[255,4,256,4]]}
[]
[]
[]
["UNIDADE ESCOLAR",null,null,null,null,null,null,"CÓDIGO INEP"]
[{"$f":"Orçamento!$O$4","v":"CENTRO DE ENSINO EM PERÍODO INTEGRAL JOAQUIM EDSON DE CAMARGO"},null,null,null,null,null,null,{"$f":"Orçamento!$V$4","v":52035182}]
[]
["OBRA",null,null,null,null,null,null,"CIDADE"]
[{"$f":"Orçamento!$O$7","v":"REFORMA E AMPLIAÇÃO"},null,null,null,null,null,null,{"$f":"Orçamento!$V$7","v":"GOIÂNIA"}]
[]
["CRE",null,null,"ENDEREÇO",null,null,null,"REFERÊNCIA AGETOP"]
[{"$f":"Orçamento!$O$10","v":"GOIÂNIA"},null,null,{"$f":"Orçamento!$R$10","v":"RUA SANTIAGO QD. 232 S/N PCA JARDIM DA INFÂNC, JD NOVO MUNDO, CEP:74705-060"},null,null,null,{"$f":"Orçamento!$V$10","v":"DEZ/18"},{"$f":"Orçamento!$W$10","v":"NÃO DESONERADA"}]
[]
["DATA",null,null,"ÁREA TOTAL CONSTRUÍDA (M²)",null,null,null,"REFERÊNCIA SINAPI"]
[{"$f":"Orçamento!$S$7","v":"2020-04-08"},null,null,{"$f":"Orçamento!$S$13","v":2081.9900000000002},null,null,null,{"$f":"Orçamento!$V$13","v":"FEV/19"},{"$f":"Orçamento!$W$13","v":"NÃO DESONERADA"}]
[]
{"$rows_left_out":254}
{"sheet":"Cotações","index":8,"n_rows":136,"n_cols":9,"rows_kept":136,"cut":false,"hidden":false,"merged":[[9,0,9,2],[9,3,9,6],[9,7,9,8],[10,0,10,2],[10,3,10,6],[10,8,10,9],[14,0,14,8],[15,0,15,9],[11,0,11,9],[12,0,12,2],[12,3,12,6],[12,7,12,8],[13,0,13,2],[13,3,13,6],[13,8,13,9],[8,0,8,8],[0,0,0,8],[1,0,1,9],[2,0,2,8],[3,0,3,6],[3,7,3,9],[4,0,4,6],[4,7,4,9],[5,0,5,8],[6,0,6,6],[6,7,6,9],[7,0,7,6],[7,7,7,9],[16,7,17,8],[18,7,18,8],[19,3,19,4],[19,5,19,6],[19,7,19,8],[16,1,17,1],[16,2,17,2],[16,3,17,3],[16,4,17,4],[16,5,16,6],[23,3,23,4],[23,7,23,8],[24,3,24,4],[24,7,24,8],[25,3,25,8],[20,3,20,4],[20,7,20,8],[21,3,21,4],[21,7,21,8],[22,3,22,4],[22,7,22,8],[27,7,28,8],[29,7,29,8],[30,3,30,4],[30,5,30,6],[30,7,30,8],[27,1,28,1],[27,2,28,2],[27,3,28,3],[27,4,28,4],[27,5,27,6],[34,3,34,4],[34,7,34,8],[35,3,35,4],[35,7,35,8],[36,3,36,8],[31,3,31,4],[31,7,31,8],[32,3,32,4],[32,7,32,8],[33,3,33,4],[33,7,33,8],[38,7,39,8],[40,7,40,8],[41,3,41,4],[41,5,41,6],[41,7,41,8],[38,1,39,1],[38,2,39,2],[38,3,39,3],[38,4,39,4],[38,5,38,6],[45,3,45,4],[45,7,45,8],[46,3,46,4],[46,7,46,8],[47,3,47,8],[42,3,42,4],[42,7,42,8],[43,3,43,4],[43,7,43,8],[44,3,44,4],[44,7,44,8],[49,7,50,8],[51,7,51,8],[52,3,52,4],[52,5,52,6],[52,7,52,8],[49,1,50,1],[49,2,50,2],[49,3,50,3],[49,4,50,4],[49,5,49,6],[56,3,56,4],[56,7,56,8],[57,3,57,4],[57,7,57,8],[58,3,58,8],[53,3,53,4],[53,7,53,8],[54,3,54,4],[54,7,54,8],[55,3,55,4],[55,7,55,8],[60,7,61,8],[62,7,62,8],[63,3,63,4],[63,5,63,6],[63,7,63,8],[60,1,61,1],[60,2,61,2],[60,3,61,3],[60,4,61,4],[60,5,60,6],[67,3,67,4],[67,7,67,8],[68,3,68,4],[68,7,68,8],[69,3,69,8],[64,3,64,4],[64,7,64,8],[65,3,65,4],[65,7,65,8],[66,3,66,4],[66,7,66,8],[71,7,72,8],[73,7,73,8],[74,3,74,4],[74,5,74,6],[74,7,74,8],[71,1,72,1],[71,2,72,2],[71,3,72,3],[71,4,72,4],[71,5,71,6],[78,3,78,4],[78,7,78,8],[79,3,79,4],[79,7,79,8],[80,3,80,8],[75,3,75,4],[75,7,75,8],[76,3,76,4],[76,7,76,8],[77,3,77,4],[77,7,77,8],[82,7,83,8],[84,7,84,8],[85,3,85,4],[85,5,85,6],[85,7,85,8],[82,1,83,1],[82,2,83,2],[82,3,83,3],[82,4,83,4],[82,5,82,6],[89,3,89,4],[89,7,89,8],[90,3,90,4],[90,7,90,8],[91,3,91,8],[86,3,86,4],[86,7,86,8],[87,3,87,4],[87,7,87,8],[88,3,88,4],[88,7,88,8],[93,7,94,8],[95,7,95,8],[96,3,96,4],[96,5,96,6],[96,7,96,8],[93,1,94,1],[93,2,94,2],[93,3,94,3],[93,4,94,4],[93,5,93,6],[100,3,100,4],[100,7,100,8],[101,3,101,4],[101,7,101,8],[102,3,102,8],[97,3,97,4],[97,7,97,8],[98,3,98,4],[98,7,98,8],[99,3,99,4],[99,7,99,8],[104,7,105,8],[106,7,106,8],[107,3,107,4],[107,5,107,6],[107,7,107,8],[104,1,105,1],[104,2,105,2],[104,3,105,3],[104,4,105,4],[104,5,104,6],[111,3,111,4],[111,7,111,8],[112,3,112,4],[112,7,112,8],[113,3,113,8],[108,3,108,4],[108,7,108,8],[109,3,109,4],[109,7,109,8],[110,3,110,4],[110,7,110,8],[115,7,116,8],[117,7,117,8],[118,3,118,4],[118,5,118,6],[118,7,118,8],[115,1,116,1],[115,2,116,2],[115,3,116,3],[115,4,116,4],[115,5,115,6],[122,3,122,4],[122,7,122,8],[123,3,123,4],[123,7,123,8],[124,3,124,8],[119,3,119,4],[119,7,119,8],[120,3,120,4],[120,7,120,8],[121,3,121,4],[121,7,121,8],[126,7,127,8],[128,7,128,8],[129,3,129,4],[129,5,129,6],[129,7,129,8],[126,1,127,1],[126,2,127,2],[126,3,127,3],[126,4,127,4],[126,5,126,6],[133,3,133,4],[133,7,133,8],[134,3,134,4],[134,7,134,8],[135,3,135,8],[130,3,130,4],[130,7,130,8],[131,3,131,4],[131,7,131,8],[132,3,132,4],[132,7,132,8]]}
[]
[]
[]
["UNIDADE ESCOLAR",null,null,null,null,null,null,"CÓDIGO INEP"]
[{"$f":"Orçamento!$O$4","v":"CENTRO DE ENSINO EM PERÍODO INTEGRAL JOAQUIM EDSON DE CAMARGO"},null,null,null,null,null,null,{"$f":"Orçamento!$V$4","v":52035182}]
[]
["OBRA",null,null,null,null,null,null,"CIDADE"]
[{"$f":"Orçamento!$O$7","v":"REFORMA E AMPLIAÇÃO"},null,null,null,null,null,null,{"$f":"Orçamento!$V$7","v":"GOIÂNIA"}]
[]
["CRE",null,null,"ENDEREÇO",null,null,null,"REFERÊNCIA AGETOP"]
[{"$f":"Orçamento!$O$10","v":"GOIÂNIA"},null,null,{"$f":"Orçamento!$R$10","v":"RUA SANTIAGO QD. 232 S/N PCA JARDIM DA INFÂNC, JD NOVO MUNDO, CEP:74705-060"},null,null,null,{"$f":"Orçamento!$V$10","v":"DEZ/18"},{"$f":"Orçamento!$W$10","v":"NÃO DESONERADA"}]
[]
["DATA",null,null,"ÁREA TOTAL CONSTRUÍDA (M²)",null,null,null,"REFERÊNCIA SINAPI"]
[{"$f":"Orçamento!$S$7","v":"2020-04-08"},null,null,{"$f":"Orçamento!$S$13","v":2081.9900000000002},null,null,null,{"$f":"Orçamento!$V$13","v":"FEV/19"},{"$f":"Orçamento!$W$13","v":"NÃO DESONERADA"}]
[]
{"$rows_left_out":121}