{"text_format":"1","workbook":"xlsx","n_sheets":9,"sheets":["Orçamento","Resumo ","Somatório","Cronog_60_Dias","Composição BDI","Relatório CENTRAL","Parc Maior Relev","Composições","Cotações"],"not_rendered":{"charts":0,"images":3,"macros":1,"external_links":0,"defined_names":81,"comments":3,"pivot_tables":0},"unopened":[],"bounds":{"document_bytes":16777216,"sheet_cells":100000,"rows_first":2000,"rows_last":500,"rows_between":2000,"halvings":0,"cell_chars":16384,"cell_head_chars":4096},"cells_cut":0,"cells_raw":0,"read":"whole","date_system":"1900"}

{"sheet":"Orçamento","index":0,"n_rows":724,"n_cols":34,"rows_kept":724,"cut":false,"hidden":false,"merged":[[705,18,705,20],[705,21,705,22],[706,15,706,17],[706,18,706,20],[706,21,706,22],[707,15,707,17],[707,18,707,20],[707,21,707,22],[702,15,702,17],[702,18,702,20],[702,21,702,22],[703,15,703,17],[703,18,703,20],[703,21,703,22],[704,15,704,17],[704,18,704,20],[704,21,704,22],[716,18,716,20],[716,21,716,22],[711,15,711,17],[711,18,711,20],[711,21,711,22],[712,15,712,17],[712,18,712,20],[712,21,712,22],[713,15,713,17],[713,18,713,20],[713,21,713,22],[18,32,18,33],[692,14,692,17],[699,15,699,17],[665,15,665,17],[720,18,720,20],[720,21,720,22],[708,15,708,17],[708,18,708,20],[708,21,708,22],[709,15,709,17],[709,18,709,20],[709,21,709,22],[710,15,710,17],[710,18,710,20],[710,21,710,22],[714,15,714,17],[714,18,714,20],[714,21,714,22],[715,15,715,17],[715,18,715,20],[715,21,715,22],[716,15,716,17],[705,15,705,17],[660,16,660,22],[723,18,723,20],[723,21,723,22],[720,14,720,17],[717,15,717,17],[717,18,717,20],[717,21,717,22],[718,15,718,17],[718,18,718,20],[718,21,718,22],[719,15,719,17],[719,18,719,20],[719,21,719,22],[722,18,722,20],[722,21,722,22],[721,18,721,20],[721,21,721,22],[698,14,698,23],[699,18,699,20],[699,21,699,22],[700,15,700,17],[700,18,700,20],[700,21,700,22],[701,15,701,17],[701,18,701,20],[701,21,701,22],[656,16,656,22],[657,16,657,22],[658,16,658,22],[3,21,3,22],[2,21,2,22],[5,21,5,22],[10,14,10,23],[13,14,13,23],[6,21,6,22],[9,17,9,20],[2,14,2,20],[3,14,3,20],[5,18,5,20],[6,18,6,20],[11,18,11,20],[12,18,12,20],[6,14,6,17],[5,14,5,17],[678,15,678,17],[679,15,679,17],[680,15,680,17],[681,15,681,17],[682,15,682,17],[683,15,683,17],[684,15,684,17],[685,15,685,17],[686,15,686,17],[666,15,666,17],[667,15,667,17],[668,15,668,17],[669,15,669,17],[670,15,670,17],[671,15,671,17],[672,15,672,17],[673,15,673,17],[674,15,674,17],[687,15,687,17],[688,15,688,17],[689,15,689,17],[690,15,690,17],[691,15,691,17],[664,14,664,23],[653,20,653,21],[652,20,652,21],[648,17,653,17],[648,20,648,21],[665,18,665,20],[665,21,665,22],[666,18,666,20],[666,21,666,22],[654,20,654,21],[674,18,674,20],[674,21,674,22],[675,18,675,20],[675,21,675,22],[676,18,676,20],[676,21,676,22],[677,18,677,20],[677,21,677,22],[689,18,689,20],[692,18,692,20],[692,21,692,22],[689,21,689,22],[690,18,690,20],[690,21,690,22],[691,18,691,20],[691,21,691,22],[681,18,681,20],[681,21,681,22],[688,18,688,20],[688,21,688,22],[683,21,683,22],[684,18,684,20],[684,21,684,22],[686,18,686,20],[682,18,682,20],[682,21,682,22],[683,18,683,20],[693,18,693,20],[693,21,693,22],[680,18,680,20],[680,21,680,22],[673,18,673,20],[673,21,673,22],[695,18,695,20],[695,21,695,22],[649,20,649,21],[671,18,671,20],[671,21,671,22],[672,18,672,20],[672,21,672,22],[670,18,670,20],[670,21,670,22],[679,18,679,20],[650,20,650,21],[661,18,661,22],[667,18,667,20],[667,21,667,22],[668,18,668,20],[668,21,668,22],[669,18,669,20],[669,21,669,22],[659,16,659,22],[8,12,9,12],[694,18,694,20],[694,21,694,22],[0,14,0,22],[8,14,8,16],[9,14,9,16],[11,14,11,16],[12,14,12,16],[14,14,14,22],[1,14,1,22],[4,14,4,22],[7,14,7,22],[678,18,678,20],[678,21,678,22],[686,21,686,22],[675,15,675,17],[676,15,676,17],[677,15,677,17],[679,21,679,22],[687,18,687,20],[687,21,687,22],[685,18,685,20],[685,21,685,22]]}
[]
[]
[null,null,null,null,null,null,null,null,null,null,null,null,null,null,"UNIDADE ESCOLAR",null,null,null,null,null,null,"CÓDIGO INEP"]
[null,null,null,null,null,null,null,null,null,null,null,null,null,null,"CENTRO DE ENSINO EM PERÍODO INTEGRAL JOAQUIM EDSON DE CAMARGO",null,null,null,null,null,null,52035182]
[]
["Nmax",null,null,null,null,null,null,null,null,null,null,null,"Ajustar altura?",null,"OBRA",null,null,null,"DATA",null,null,"CIDADE"]
[{"$f":"MAX($C$18:$C$648)","v":4},null,null,null,null,null,null,null,null,null,null,null,"NÃO",null,"REFORMA E AMPLIAÇÃO",null,null,null,"2020-04-08",null,null,"GOIÂNIA"]
[]
[null,null,null,null,null,null,null,null,null,null,null,null,"",null,"CRE",null,null,"ENDEREÇO",null,null,null,"REFERÊNCIA AGETOP"]
[null,null,null,null,null,null,null,null,null,null,null,null,null,null,"GOIÂNIA",null,null,"RUA SANTIAGO QD. 232 S/N PCA JARDIM DA INFÂNC, JD NOVO MUNDO, CEP:74705-060",null,null,null,"DEZ/18","NÃO DESONERADA"]
[]
[null,null,null,null,null,null,null,null,null,null,null,null,null,null,"ÁREA EXISTENTE (M²)",null,null,"ÁREA A CONSTRUIR (M²)","ÁREA TOTAL CONSTRUÍDA (M²)",null,null,"REFERÊNCIA SINAPI"]
[null,null,null,null,null,null,null,null,null,null,null,null,null,null,1884.9,null,null,197.09,2081.9900000000002,null,null,"FEV/19","NÃO DESONERADA"]
[]
[null,null,null,null,null,null,null,null,null,null,null,"FILTRO",null,null,"PLANILHA ORÇAMENTÁRIA"]
["Nível E","Save Nivel","Nível C","Altura","n1","n2","n3","n4","n5","Czero","Cnível","↓","Nível","Nível Corrigido","ITEM","TABELA","CODIGO","DESCRIÇÃO DOS SERVIÇOS","UNID","QUANT","MAT","MO","T.SERVIÇO","OBSERVAÇÕES¹","TROCAR PREÇO?","FONTE","CÓDIGO","DESCRIÇÃO DO SERVIÇO","UNID","MAT","MO"]
[{"$f":"CHOOSE(1+LOG(1+2*(ORÇAMENTO.Nivel=\"Nível 1\")+4*(ORÇAMENTO.Nivel=\"Nível 2\")+8*(ORÇAMENTO.Nivel=\"Nível 3\")+16*(ORÇAMENTO.Nivel=\"Nível 4\")+32*(ORÇAMENTO.Nivel=\"Serviço\"),2),0,1,2,3,4,\"S\")","v":"S"},{"$f":"IF(OR(C17=\"s\",C17=0),OFFSET(B17,-1,0),C17)","v":"Save Nivel"},{"$f":"IF(OFFSET(C17,-1,0)=\"L\",1,IF(OFFSET(C17,-1,0)=1,2,IF(OR(A17=\"s\",A17=0),\"S\",IF(AND(OFFSET(C17,-1,0)=2,A17=4),3,IF(AND(OR(OFFSET(C17,-1,0)=\"s\",OFFSET(C17,-1,0)=0),A17<>\"s\",A17>OFFSET(B17,-1,0)),OFFSET(B17,-1,0),A17)))))","v":"S"},{"$f":"IF(OR(C17=\"S\",C17=0),0,IF(ISERROR(K17),J17,SMALL(J17:K17,1)))","v":0},{"$f":"IF($C17=1,OFFSET(E17,-1,0)+1,OFFSET(E17,-1,0))","v":"n1"},{"$f":"IF($C17=1,0,IF($C17=2,OFFSET(F17,-1,0)+1,OFFSET(F17,-1,0)))","v":"n2"},{"$f":"IF(AND($C17<=2,$C17<>0),0,IF($C17=3,OFFSET(G17,-1,0)+1,OFFSET(G17,-1,0)))","v":"n3"},{"$f":"IF(AND($C17<=3,$C17<>0),0,IF($C17=4,OFFSET(H17,-1,0)+1,OFFSET(H17,-1,0)))","v":"n4"},{"$f":"IF(AND($C17<=4,$C17<>0),0,IF(AND($C17=\"S\",$W17>0),OFFSET(I17,-1,0)+1,OFFSET(I17,-1,0)))","v":"n5"},{"$f":"IF(OR($C17=\"S\",$C17=0),0,MATCH(0,OFFSET($D17,1,$C17,ROW($C$648)-ROW($C17)),0))","v":0},{"$f":"IF(OR($C17=\"S\",$C17=0),0,MATCH(OFFSET($D17,0,$C17)+1,OFFSET($D17,1,$C17,ROW($C$648)-ROW($C17)),0))","v":0},"","Serviço","Serviço","-","SINAPI",null,"(sem código)","-",null,0,0,0,"",null,null,null,{"$f":"IFERROR(IF(OR($C17=0,$C17=1,$C17=2,$C17=3,$C17=4),R17,VLOOKUP($AA17,INDIRECT($Z17),2,FALSE)),\"(sem código)\")","v":"(sem código)"},{"$f":"IFERROR(VLOOKUP(AA17,INDIRECT(Z17),3,FALSE()),\"-\")","v":"-"},{"$f":"IFERROR(VLOOKUP($AA17,INDIRECT($Z17),IF($W$10=\"DESONERADA\",4,7),FALSE()),0)","v":0},{"$f":"IFERROR(VLOOKUP($AA17,INDIRECT($Z17),IF($W$10=\"DESONERADA\",5,8),FALSE()),0)","v":0}]
[0,null,"L",{"$f":"COUNTA(OFFSET(D18,1,0):D$648)","v":629},{"$f":"LEFT(O19,1)-1","v":0},null,null,null,null,null,null,"F","LOTE","LOTE","REFORMA E AMPLIAÇÃO - CENTRO DE ENSINO EM PERÍODO INTEGRAL JOAQUIM EDSON DE CAMARGO",null,null,null,null,null,null,null,0,null,{"$f":"O18","v":"REFORMA E AMPLIAÇÃO - CENTRO DE ENSINO EM PERÍODO INTEGRAL JOAQUIM EDSON DE CAMARGO"}]
[1,{"$f":"IF(OR(C19=\"s\",C19=0),OFFSET(B19,-1,0),C19)","v":1},{"$f":"IF(OFFSET(C19,-1,0)=\"L\",1,IF(OFFSET(C19,-1,0)=1,2,IF(OR(A19=\"s\",A19=0),\"S\",IF(AND(OFFSET(C19,-1,0)=2,A19=4),3,IF(AND(OR(OFFSET(C19,-1,0)=\"s\",OFFSET(C19,-1,0)=0),A19<>\"s\",A19>OFFSET(B19,-1,0)),OFFSET(B19,-1,0),A19)))))","v":1},{"$f":"IF(OR(C19=\"S\",C19=0),0,IF(ISERROR(K19),J19,SMALL(J19:K19,1)))","v":263},{"$f":"IF($C19=1,OFFSET(E19,-1,0)+1,OFFSET(E19,-1,0))","v":1},{"$f":"IF($C19=1,0,IF($C19=2,OFFSET(F19,-1,0)+1,OFFSET(F19,-1,0)))","v":0},{"$f":"IF(AND($C19<=2,$C19<>0),0,IF($C19=3,OFFSET(G19,-1,0)+1,OFFSET(G19,-1,0)))","v":0},{"$f":"IF(AND($C19<=3,$C19<>0),0,IF($C19=4,OFFSET(H19,-1,0)+1,OFFSET(H19,-1,0)))","v":0},0,{"$f":"IF(OR($C19=\"S\",$C19=0),0,MATCH(0,OFFSET($D19,1,$C19,ROW($C$648)-ROW($C19)),0))","v":629},{"$f":"IF(OR($C19=\"S\",$C19=0),0,MATCH(OFFSET($D19,0,$C19)+1,OFFSET($D19,1,$C19,ROW($C$648)-ROW($C19)),0))","v":263},"F","Nível 1","Nível 1","1.","AGETOP",null,"REFORMA",null,null,null,null,0,null,null,null,null,{"$f":"IFERROR(IF(OR($C19=0,$C19=1,$C19=2,$C19=3,$C19=4),R19,VLOOKUP($AA19,INDIRECT($Z19),2,FALSE)),\"(sem código)\")","v":"REFORMA"},{"$f":"IFERROR(VLOOKUP(AA19,INDIRECT(Z19),3,FALSE()),\"-\")","v":"-"},{"$f":"IFERROR(VLOOKUP($AA19,INDIRECT($Z19),IF($W$10=\"DESONERADA\",4,7),FALSE()),0)","v":0},{"$f":"IFERROR(VLOOKUP($AA19,INDIRECT($Z19),IF($W$10=\"DESONERADA\",5,8),FALSE()),0)","v":0},null,"RESPOSTA"]
[2,{"$f":"IF(OR(C20=\"s\",C20=0),OFFSET(B20,-1,0),C20)","v":2},{"$f":"IF(OFFSET(C20,-1,0)=\"L\",1,IF(OFFSET(C20,-1,0)=1,2,IF(OR(A20=\"s\",A20=0),\"S\",IF(AND(OFFSET(C20,-1,0)=2,A20=4),3,IF(AND(OR(OFFSET(C20,-1,0)=\"s\",OFFSET(C20,-1,0)=0),A20<>\"s\",A20>OFFSET(B20,-1,0)),OFFSET(B20,-1,0),A20)))))","v":2},{"$f":"IF(OR(C20=\"S\",C20=0),0,IF(ISERROR(K20),J20,SMALL(J20:K20,1)))","v":13},{"$f":"IF($C20=1,OFFSET(E20,-1,0)+1,OFFSET(E20,-1,0))","v":1},{"$f":"IF($C20=1,0,IF($C20=2,OFFSET(F20,-1,0)+1,OFFSET(F20,-1,0)))","v":1},{"$f":"IF(AND($C20<=2,$C20<>0),0,IF($C20=3,OFFSET(G20,-1,0)+1,OFFSET(G20,-1,0)))","v":0},{"$f":"IF(AND($C20<=3,$C20<>0),0,IF($C20=4,OFFSET(H20,-1,0)+1,OFFSET(H20,-1,0)))","v":0},0,262,13,"","Nível 2","Nível 2","-","AGETOP",null,"SERVIÇOS PRELIMINARES",null,null,null,null,0,null,null,null,null,{"$f":"IFERROR(IF(OR($C20=0,$C20=1,$C20=2,$C20=3,$C20=4),R20,VLOOKUP($AA20,INDIRECT($Z20),2,FALSE)),\"(sem código)\")","v":"SERVIÇOS PRELIMINARES"},{"$f":"IFERROR(VLOOKUP(AA20,INDIRECT(Z20),3,FALSE()),\"-\")","v":"-"},0,0,null,"SIM","NÃO"]
[3,3,3,2,1,1,1,0,0,12,2,"","Nível 3","Nível 3","-","SINAPI",null,"ELETRICO","-",null,null,null,0,"",null,null,null,"ELETRICO",{"$f":"IFERROR(VLOOKUP(AA21,INDIRECT(Z21),3,FALSE()),\"-\")","v":"-"},0,0]
["S",3,"S",0,1,1,1,0,0,0,0,"","Serviço","Serviço","-","SINAPI",97661,"REMOÇÃO DE CABOS ELÉTRICOS, DE FORMA MANUAL, SEM REAPROVEITAMENTO. AF_12/2017","M",300,null,null,0,"","NÃO","AGETOP",20148,"(sem código)","-",0,0]
[3,{"$f":"IF(OR(C23=\"s\",C23=0),OFFSET(B23,-1,0),C23)","v":3},{"$f":"IF(OFFSET(C23,-1,0)=\"L\",1,IF(OFFSET(C23,-1,0)=1,2,IF(OR(A23=\"s\",A23=0),\"S\",IF(AND(OFFSET(C23,-1,0)=2,A23=4),3,IF(AND(OR(OFFSET(C23,-1,0)=\"s\",OFFSET(C23,-1,0)=0),A23<>\"s\",A23>OFFSET(B23,-1,0)),OFFSET(B23,-1,0),A23)))))","v":3},{"$f":"IF(OR(C23=\"S\",C23=0),0,IF(ISERROR(K23),J23,SMALL(J23:K23,1)))","v":10},1,1,2,0,0,10,25,"","Nível 3","Nível 3","-","SINAPI",null,"OUTROS","-",null,null,null,0,"",null,null,null,"OUTROS","-",0,0]
["S",3,"S",0,1,1,2,0,0,0,0,"","Serviço","Serviço","-","AGETOP",20102,"DEMOLICAO-COBERTURA TELHA FIBROCIMENTO/FIBRA DE VIDRO/SIMILARES C/ TRANSP. ATÉ CB. E CARGA","m2    ",41.47,null,null,0,"",null,null,null,{"$f":"IFERROR(IF(OR($C24=0,$C24=1,$C24=2,$C24=3,$C24=4),R24,VLOOKUP($AA24,INDIRECT($Z24),2,FALSE)),\"(sem código)\")","v":"(sem código)"},{"$f":"IFERROR(VLOOKUP(AA24,INDIRECT(Z24),3,FALSE()),\"-\")","v":"-"},{"$f":"IFERROR(VLOOKUP($AA24,INDIRECT($Z24),IF($W$10=\"DESONERADA\",4,7),FALSE()),0)","v":0},{"$f":"IFERROR(VLOOKUP($AA24,INDIRECT($Z24),IF($W$10=\"DESONERADA\",5,8),FALSE()),0)","v":0}]
["S",3,"S",0,1,1,2,0,0,0,0,"","Serviço","Serviço","-","AGETOP",20103,"DEMOLIÇÃO ESTRUTURA EM MADEIRA TELHADO C/ TRANSP. ATÉ CB. E CARGA","m2    ",41.47,null,null,0,"",null,null,null,{"$f":"IFERROR(IF(OR($C25=0,$C25=1,$C25=2,$C25=3,$C25=4),R25,VLOOKUP($AA25,INDIRECT($Z25),2,FALSE)),\"(sem código)\")","v":"(sem código)"},"-",{"$f":"IFERROR(VLOOKUP($AA25,INDIRECT($Z25),IF($W$10=\"DESONERADA\",4,7),FALSE()),0)","v":0},{"$f":"IFERROR(VLOOKUP($AA25,INDIRECT($Z25),IF($W$10=\"DESONERADA\",5,8),FALSE()),0)","v":0}]
["S",3,"S",0,1,1,2,0,0,0,0,"","Serviço","Serviço","-","SINAPI",97644,"REMOÇÃO DE PORTAS, DE FORMA MANUAL, SEM REAPROVEITAMENTO. AF_12/2017","M2",1.6800000000000002,null,null,0,"Referência: AGETOP - 20106","SIM","AGETOP",20106,"(sem código)","-",{"$f":"IFERROR(VLOOKUP($AA26,INDIRECT($Z26),IF($W$10=\"DESONERADA\",4,7),FALSE()),0)","v":0},{"$f":"IFERROR(VLOOKUP($AA26,INDIRECT($Z26),IF($W$10=\"DESONERADA\",5,8),FALSE()),0)","v":0}]
["S",3,"S",0,1,1,2,0,0,0,0,"","Serviço","Serviço","-","AGETOP",20109,"DEM.PISO CIMENT.SOBRE LASTRO CONC.C/TR.ATE CB. E CARGA","m2    ",41.47,null,null,0,"",null,null,null,"(sem código)","-",0,0]
["S",3,"S",0,1,1,2,0,0,0,0,"","Serviço","Serviço","-","AGETOP",20121,"DEM. MANUAL EM CONCR.SIMPLES C/TR.ATE CB.E CARGA (O.C.)","m3    ",37.146000000000001,null,null,0,"",null,null,null,"(sem código)",{"$f":"IFERROR(VLOOKUP(AA28,INDIRECT(Z28),3,FALSE()),\"-\")","v":"-"},0,0]
["S",3,"S",0,1,1,2,0,0,0,0,"","Serviço","Serviço","-","SINAPI",97622,"DEMOLIÇÃO DE ALVENARIA DE BLOCO FURADO, DE FORMA MANUAL, SEM REAPROVEITAMENTO. AF_12/2017","M3",0.31049999999999994,null,null,0,"Referência: AGETOP - 20118","SIM","AGETOP",20118,"(sem código)","-",0,0]
["S",3,"S",0,1,1,2,0,0,0,0,"","Serviço","Serviço","-","AGETOP",20107,"CORTE/DESTOC./RETIRADA/REATERRO (MANUAIS) DE ÁRVORE GRANDE PORTE ( H = 8 A 10 M / DIÂMETRO TRONCO 60 A 70CM E COPA DE 10 A 13M ) C/TRANSP.ATE C.B.E CARGA ","Un    ",1,null,null,0,"",null,null,null,"(sem código)","-",0,0]
["S",3,"S",0,1,1,2,0,0,0,0,"","Serviço","Serviço","-","SINAPI","73948/16","LIMPEZA MANUAL DO TERRENO (C/ RASPAGEM SUPERFICIAL)","M2",650.14,null,null,0,"Referência: AGETOP - 20202","SIM","AGETOP",20202,"(sem código)","-",{"$f":"IFERROR(VLOOKUP($AA31,INDIRECT($Z31),IF($W$10=\"DESONERADA\",4,7),FALSE()),0)","v":0},{"$f":"IFERROR(VLOOKUP($AA31,INDIRECT($Z31),IF($W$10=\"DESONERADA\",5,8),FALSE()),0)","v":0}]
["S",3,"S",0,1,1,2,0,0,0,0,"","Serviço","Serviço","-","SINAPI","74209/1","PLACA DE OBRA EM CHAPA DE ACO GALVANIZADO","M2",4.5,null,null,0,"Referência: AGETOP - 21301","SIM","AGETOP",21301,"(sem código)","-",0,0]
[2,2,2,3,1,2,0,0,0,249,3,"","Nível 2","Nível 2","-","AGETOP",null,"TRANSPORTES","-",null,null,null,0,"",null,null,null,"TRANSPORTES","-",0,0]
["S",2,"S",0,1,2,0,0,0,0,0,"","Serviço","Serviço","-","SINAPI",72900,"TRANSPORTE DE ENTULHO COM CAMINHAO BASCULANTE 6 M3, RODOVIA PAVIMENTADA, DMT 0,5 A 1,0 KM","M3",40,null,null,0,"","NÃO","AGETOP",30101,"(sem código)","-",{"$f":"IFERROR(VLOOKUP($AA34,INDIRECT($Z34),IF($W$10=\"DESONERADA\",4,7),FALSE()),0)","v":0},{"$f":"IFERROR(VLOOKUP($AA34,INDIRECT($Z34),IF($W$10=\"DESONERADA\",5,8),FALSE()),0)","v":0}]
["S",2,"S",0,1,2,0,0,0,0,0,"","Serviço","Serviço","-","SINAPI",72897,"CARGA MANUAL DE ENTULHO EM CAMINHAO BASCULANTE 6 M3","M3",40,null,null,0,"","NÃO","AGETOP",30101,"(sem código)","-",0,0]
[2,2,2,18,1,3,0,0,0,246,18,"","Nível 2","Nível 2","-","AGETOP",null,"SERVIÇO EM TERRA","-",null,null,null,0,"",null,null,null,"SERVIÇO EM TERRA","-",0,0]
[3,3,3,6,1,3,1,0,0,17,6,"","Nível 3","Nível 3","-",null,null,"AQUISIÇÃO DE TERRA (SOMENTE ATERRO)","-",null,null,null,0,"",null,null,null,"AQUISIÇÃO DE TERRA (SOMENTE ATERRO)","-",0,0]
["S",3,"S",0,1,3,1,0,0,0,0,"","Serviço","Serviço","-","SINAPI",79480,"ESCAVACAO MECANICA CAMPO ABERTO EM SOLO EXCETO ROCHA ATE 2,00M PROFUNDIDADE","M3",246.36250000000001,null,null,0,"Referência: AGETOP - 41004","SIM","AGETOP",41004,{"$f":"IFERROR(IF(OR($C38=0,$C38=1,$C38=2,$C38=3,$C38=4),R38,VLOOKUP($AA38,INDIRECT($Z38),2,FALSE)),\"(sem código)\")","v":"(sem código)"},{"$f":"IFERROR(VLOOKUP(AA38,INDIRECT(Z38),3,FALSE()),\"-\")","v":"-"},{"$f":"IFERROR(VLOOKUP($AA38,INDIRECT($Z38),IF($W$10=\"DESONERADA\",4,7),FALSE()),0)","v":0},{"$f":"IFERROR(VLOOKUP($AA38,INDIRECT($Z38),IF($W$10=\"DESONERADA\",5,8),FALSE()),0)","v":0}]
["S",3,"S",0,1,3,1,0,0,0,0,"","Serviço","Serviço","-","SINAPI",72898,"CARGA E DESCARGA MECANIZADAS DE ENTULHO EM CAMINHAO BASCULANTE 6 M3","M3",246.36250000000001,null,null,0,"Referência: AGETOP - 41005","SIM","AGETOP",41005,"(sem código)","-",0,0]
["S",3,"S",0,1,3,1,0,0,0,0,"","Serviço","Serviço","-","AGETOP",41012,"INDENIZAÇÃO DE JAZIDA","m3    ",246.36250000000001,null,null,0,"",null,null,null,"(sem código)","-",0,0]
["S",3,"S",0,1,3,1,0,0,0,0,"","Serviço","Serviço","-","AGETOP",41006,"TRANSPORTE DE MATERIAL ESCAVADO M3.KM","m3km  ",2463.625,null,null,0,"",null,null,null,"(sem código)","-",0,0]
["S",3,"S",0,1,3,1,0,0,0,0,"","Serviço","Serviço","-","SINAPI","74005/2","COMPACTACAO MECANICA C/ CONTROLE DO GC>=95% DO PN (AREAS) (C/MONIVELADORA 140 HP E ROLO COMPRESSOR VIBRATORIO 80 HP)","M3",197.09,null,null,0,"Referência: AGETOP - 41008","SIM","AGETOP",41008,"COMPACTAÇÃO MECÂNICA COM CONTROLE DA UMIDADE (95% PN)","m3    ",2.74,0]
[3,3,3,5,1,3,2,0,0,11,5,"","Nível 3","Nível 3","-",null,null,"RAMPA E ESCADA","-",null,null,null,0,"",null,null,null,"RAMPA E ESCADA","-",{"$f":"IFERROR(VLOOKUP($AA43,INDIRECT($Z43),IF($W$10=\"DESONERADA\",4,7),FALSE()),0)","v":0},{"$f":"IFERROR(VLOOKUP($AA43,INDIRECT($Z43),IF($W$10=\"DESONERADA\",5,8),FALSE()),0)","v":0}]
["S",3,"S",0,1,3,2,0,0,0,0,"","Serviço","Serviço","-","SINAPI",79480,"ESCAVACAO MECANICA CAMPO ABERTO EM SOLO EXCETO ROCHA ATE 2,00M PROFUNDIDADE","M3",7.6624999999999996,null,null,0,"Referência: AGETOP - 41004","SIM","AGETOP",41004,"(sem código)","-",0,0]
["S",3,"S",0,1,3,2,0,0,0,0,"","Serviço","Serviço","-","SINAPI",72898,"CARGA E DESCARGA MECANIZADAS DE ENTULHO EM CAMINHAO BASCULANTE 6 M3","M3",7.6624999999999996,null,null,0,"Referência: AGETOP - 41005","SIM","AGETOP",41005,"(sem código)","-",0,0]
["S",3,"S",0,1,3,2,0,0,0,0,"","Serviço","Serviço","-","AGETOP",41012,"INDENIZAÇÃO DE JAZIDA","m3    ",7.6624999999999996,null,null,0,"",null,null,null,"(sem código)","-",0,0]
["S",3,"S",0,1,3,2,0,0,0,0,"","Serviço","Serviço","-","SINAPI","74005/2","COMPACTACAO MECANICA C/ CONTROLE DO GC>=95% DO PN (AREAS) (C/MONIVELADORA 140 HP E ROLO COMPRESSOR VIBRATORIO 80 HP)","M3",6.13,null,null,0,"",null,null,null,{"$f":"IFERROR(IF(OR($C47=0,$C47=1,$C47=2,$C47=3,$C47=4),R47,VLOOKUP($AA47,INDIRECT($Z47),2,FALSE)),\"(sem código)\")","v":"(sem código)"},{"$f":"IFERROR(VLOOKUP(AA47,INDIRECT(Z47),3,FALSE()),\"-\")","v":"-"},0,0]
[3,3,3,3,1,3,3,0,0,6,3,"","Nível 3","Nível 3","-",null,null,"ELETRICO","-",null,null,null,0,"",null,null,null,"ELETRICO","-",0,0]
[{"$f":"CHOOSE(1+LOG(1+2*(ORÇAMENTO.Nivel=\"Nível 1\")+4*(ORÇAMENTO.Nivel=\"Nível 2\")+8*(ORÇAMENTO.Nivel=\"Nível 3\")+16*(ORÇAMENTO.Nivel=\"Nível 4\")+32*(ORÇAMENTO.Nivel=\"Serviço\"),2),0,1,2,3,4,\"S\")","v":"S"},3,"S",0,1,3,3,0,{"$f":"IF(AND($C49<=4,$C49<>0),0,IF(AND($C49=\"S\",$W49>0),OFFSET(I49,-1,0)+1,OFFSET(I49,-1,0)))","v":0},0,0,"","Serviço","Serviço","-","SINAPI",93358,"ESCAVAÇÃO MANUAL DE VALA COM PROFUNDIDADE MENOR OU IGUAL A 1,30 M. AF_03/2016","M3",66,null,null,0,"Referência: AGETOP - 40101","SIM","AGETOP",40101,"(sem código)",{"$f":"IFERROR(VLOOKUP(AA49,INDIRECT(Z49),3,FALSE()),\"-\")","v":"-"},{"$f":"IFERROR(VLOOKUP($AA49,INDIRECT($Z49),IF($W$10=\"DESONERADA\",4,7),FALSE()),0)","v":0},{"$f":"IFERROR(VLOOKUP($AA49,INDIRECT($Z49),IF($W$10=\"DESONERADA\",5,8),FALSE()),0)","v":0}]
["S",3,"S",0,1,3,3,0,0,0,0,"","Serviço","Serviço","-","SINAPI",96995,"REATERRO MANUAL APILOADO COM SOQUETE. AF_10/2017","M3",66,null,null,0,"Referência: AGETOP - 40902","SIM","AGETOP",40902,"(sem código)","-",0,0]
[3,3,3,3,{"$f":"IF($C51=1,OFFSET(E51,-1,0)+1,OFFSET(E51,-1,0))","v":1},{"$f":"IF($C51=1,0,IF($C51=2,OFFSET(F51,-1,0)+1,OFFSET(F51,-1,0)))","v":3},{"$f":"IF(AND($C51<=2,$C51<>0),0,IF($C51=3,OFFSET(G51,-1,0)+1,OFFSET(G51,-1,0)))","v":4},{"$f":"IF(AND($C51<=3,$C51<>0),0,IF($C51=4,OFFSET(H51,-1,0)+1,OFFSET(H51,-1,0)))","v":0},0,3,172,"","Nível 3","Nível 3","-","SINAPI",93382,"CENTRAL DE GAS","M3",null,null,null,0,"Referência: AGETOP - 40904","SIM","AGETOP",40904,"CENTRAL DE GAS","-",0,0]
["S",3,"S",0,1,3,4,0,0,0,0,"","Serviço","Serviço","-","SINAPI",93358,"ESCAVAÇÃO MANUAL DE VALA COM PROFUNDIDADE MENOR OU IGUAL A 1,30 M. AF_03/2016","M3",1.4903999999999999,null,null,0,"Referência: AGETOP - 40101","SIM","AGETOP",40101,"(sem código)","-",0,0]
["S",3,"S",0,1,3,4,0,0,0,0,"","Serviço","Serviço","-","SINAPI",96995,"REATERRO MANUAL APILOADO COM SOQUETE. AF_10/2017","M3",1.19232,null,null,0,"Referência: AGETOP - 40902","SIM","AGETOP",40902,"(sem código)","-",0,0]
[{"$f":"CHOOSE(1+LOG(1+2*(ORÇAMENTO.Nivel=\"Nível 1\")+4*(ORÇAMENTO.Nivel=\"Nível 2\")+8*(ORÇAMENTO.Nivel=\"Nível 3\")+16*(ORÇAMENTO.Nivel=\"Nível 4\")+32*(ORÇAMENTO.Nivel=\"Serviço\"),2),0,1,2,3,4,\"S\")","v":2},{"$f":"IF(OR(C54=\"s\",C54=0),OFFSET(B54,-1,0),C54)","v":2},{"$f":"IF(OFFSET(C54,-1,0)=\"L\",1,IF(OFFSET(C54,-1,0)=1,2,IF(OR(A54=\"s\",A54=0),\"S\",IF(AND(OFFSET(C54,-1,0)=2,A54=4),3,IF(AND(OR(OFFSET(C54,-1,0)=\"s\",OFFSET(C54,-1,0)=0),A54<>\"s\",A54>OFFSET(B54,-1,0)),OFFSET(B54,-1,0),A54)))))","v":2},{"$f":"IF(OR(C54=\"S\",C54=0),0,IF(ISERROR(K54),J54,SMALL(J54:K54,1)))","v":111},{"$f":"IF($C54=1,OFFSET(E54,-1,0)+1,OFFSET(E54,-1,0))","v":1},{"$f":"IF($C54=1,0,IF($C54=2,OFFSET(F54,-1,0)+1,OFFSET(F54,-1,0)))","v":4},{"$f":"IF(AND($C54<=2,$C54<>0),0,IF($C54=3,OFFSET(G54,-1,0)+1,OFFSET(G54,-1,0)))","v":0},{"$f":"IF(AND($C54<=3,$C54<>0),0,IF($C54=4,OFFSET(H54,-1,0)+1,OFFSET(H54,-1,0)))","v":0},{"$f":"IF(AND($C54<=4,$C54<>0),0,IF(AND($C54=\"S\",$W54>0),OFFSET(I54,-1,0)+1,OFFSET(I54,-1,0)))","v":0},228,111,"","Nível 2","Nível 2","-",null,null,"INSTALAÇÕES ELÉTRICAS","-",null,null,null,0,"",null,null,null,{"$f":"IFERROR(IF(OR($C54=0,$C54=1,$C54=2,$C54=3,$C54=4),R54,VLOOKUP($AA54,INDIRECT($Z54),2,FALSE)),\"(sem código)\")","v":"INSTALAÇÕES ELÉTRICAS"},{"$f":"IFERROR(VLOOKUP(AA54,INDIRECT(Z54),3,FALSE()),\"-\")","v":"-"},0,0]
[3,3,3,64,1,4,1,0,0,110,64,"","Nível 3","Nível 3","-","SINAPI",null,"SUBESTAÇAO","-",null,null,null,0,"",null,null,null,{"$f":"IFERROR(IF(OR($C55=0,$C55=1,$C55=2,$C55=3,$C55=4),R55,VLOOKUP($AA55,INDIRECT($Z55),2,FALSE)),\"(sem código)\")","v":"SUBESTAÇAO"},{"$f":"IFERROR(VLOOKUP(AA55,INDIRECT(Z55),3,FALSE()),\"-\")","v":"-"},{"$f":"IFERROR(VLOOKUP($AA55,INDIRECT($Z55),IF($W$10=\"DESONERADA\",4,7),FALSE()),0)","v":0},{"$f":"IFERROR(VLOOKUP($AA55,INDIRECT($Z55),IF($W$10=\"DESONERADA\",5,8),FALSE()),0)","v":0}]
["S",3,"S",0,1,4,1,0,0,0,0,"","Serviço","Serviço","-","SINAPI","73767/2","ALCA PRE-FORMADA DISTRIBUIÇÃO EM  ACO RECOBERTO COM ALUMINIO PARA CABO 25MM2, ENCAPADO. FORNECIMENTO E INSTALAÇÃO.","UN",1,null,null,0,"",null,null,null,"(sem código)","-",0,0]
["S",3,"S",0,1,4,1,0,0,0,0,"","Serviço","Serviço","-","AGETOP",70252,"ARRUELA LISA D=5/16\"","Un    ",8,null,null,0,"",null,null,null,"(sem código)","-",0,0]
["S",3,"S",0,1,4,1,0,0,0,0,"","Serviço","Serviço","-","AGETOP",70268,"BARRA DE COBRE 2\" X 3/16\"  (2,0865 KG/M)","m     ",1.5,null,null,0,"",null,null,null,"(sem código)","-",0,0]
["S",3,"S",0,1,4,1,0,0,0,0,"","Serviço","Serviço","-","SINAPI",91175,"FIXAÇÃO DE TUBOS VERTICAIS DE PPR DIÂMETROS MAIORES QUE 75 MM COM ABRAÇADEIRA METÁLICA RÍGIDA TIPO D 3\", FIXADA EM PERFILADO EM ALVENARIA. AF_05/2015","M",6,null,null,0,"",null,null,null,"(sem código)","-",{"$f":"IFERROR(VLOOKUP($AA59,INDIRECT($Z59),IF($W$10=\"DESONERADA\",4,7),FALSE()),0)","v":0},{"$f":"IFERROR(VLOOKUP($AA59,INDIRECT($Z59),IF($W$10=\"DESONERADA\",5,8),FALSE()),0)","v":0}]
["S",3,"S",0,1,4,1,0,0,0,0,"","Serviço","Serviço","-","AGETOP",70386,"BRAÇO C AÇO GALVANIZADO , CONFORME NTD-17","un    ",1,null,null,0,"",null,null,null,"(sem código)","-",0,0]
["S",3,"S",0,1,4,1,0,0,0,0,"","Serviço","Serviço","-","AGETOP",70422,"BUCHA E ARRUELA METALICA DIAM. 1\"","PR    ",2,null,null,0,"",null,null,null,"(sem código)","-",0,0]
["S",3,"S",0,1,4,1,0,0,0,0,"","Serviço","Serviço","-","AGETOP",70426,"BUCHA E ARRUELA METALICA DIAM. 2.1/2\"","PR    ",1,null,null,0,"",null,null,null,"(sem código)","-",0,0]
["S",3,"S",0,1,4,1,0,0,0,0,"","Serviço","Serviço","-","SINAPI",92980,"CABO DE COBRE FLEXÍVEL ISOLADO, 10 MM², ANTI-CHAMA 0,6/1,0 KV, PARA DISTRIBUIÇÃO - FORNECIMENTO E INSTALAÇÃO. AF_12/2015","M",5,null,null,0,"",null,null,null,"(sem código)","-",0,0]
["S",3,"S",0,1,4,1,0,0,0,0,"","Serviço","Serviço","-","SINAPI",92986,"CABO DE COBRE FLEXÍVEL ISOLADO, 35 MM², ANTI-CHAMA 0,6/1,0 KV, PARA DISTRIBUIÇÃO - FORNECIMENTO E INSTALAÇÃO. AF_12/2015","M",15,null,null,0,"",null,null,null,"(sem código)","-",0,0]
["S",3,"S",0,1,4,1,0,0,0,0,"","Serviço","Serviço","-","SINAPI",92990,"CABO DE COBRE FLEXÍVEL ISOLADO, 70 MM², ANTI-CHAMA 0,6/1,0 KV, PARA DISTRIBUIÇÃO - FORNECIMENTO E INSTALAÇÃO. AF_12/2015","M",60,null,null,0,"",null,null,null,"(sem código)","-",0,0]
["S",3,"S",0,1,4,1,0,0,0,0,"","Serviço","Serviço","-","AGETOP",70543,"CABO DE COBRE NÚ No. 35 MM2","M     ",3,null,null,0,"",null,null,70509,"(sem código)","-",0,0]
["S",3,"S",0,1,4,1,0,0,0,0,"","Serviço","Serviço","-","SINAPI",96977,"CORDOALHA DE COBRE NU 50 MM², ENTERRADA, SEM ISOLADOR - FORNECIMENTO E INSTALAÇÃO. AF_12/2017","M",45,null,null,0,"",null,null,70510,"(sem código)","-",0,0]
["S",3,"S",0,1,4,1,0,0,0,0,"","Serviço","Serviço","-","AGETOP",70696,"CAIXA METÁLICA PARA PROTEÇÃO GERAL 820X750X266MM DE 250A A 350A","Un    ",1,null,null,0,"",null,null,70511,"(sem código)","-",0,0]
["S",3,"S",0,1,4,1,0,0,0,0,"","Serviço","Serviço","-","AGETOP",70697,"CAIXA METÁLICA PARA T.C. 820X750X266MM - 250 A 350A","Un    ",1,null,null,0,"",null,null,70512,"(sem código)","-",0,0]
[{"$f":"CHOOSE(1+LOG(1+2*(ORÇAMENTO.Nivel=\"Nível 1\")+4*(ORÇAMENTO.Nivel=\"Nível 2\")+8*(ORÇAMENTO.Nivel=\"Nível 3\")+16*(ORÇAMENTO.Nivel=\"Nível 4\")+32*(ORÇAMENTO.Nivel=\"Serviço\"),2),0,1,2,3,4,\"S\")","v":"S"},3,"S",0,1,4,1,0,{"$f":"IF(AND($C70<=4,$C70<>0),0,IF(AND($C70=\"S\",$W70>0),OFFSET(I70,-1,0)+1,OFFSET(I70,-1,0)))","v":0},0,0,"","Serviço","Serviço","-","SINAPI",97893,"CAIXA ENTERRADA ELÉTRICA RETANGULAR, EM ALVENARIA COM BLOCOS DE CONCRETO, FUNDO COM BRITA, DIMENSÕES INTERNAS: 0,8X0,8X0,6 M. AF_05/2018","UN",1,null,null,0,"",null,null,70541,"(sem código)","-",0,0]
["S",3,"S",0,1,4,1,0,0,0,0,"","Serviço","Serviço","-","AGETOP",70771,"CANTONEIRA AUXILIAR PARA BRAÇO TIPO C","un    ",1,null,null,0,"",null,null,70561,"(sem código)","-",0,0]
["S",3,"S",0,1,4,1,0,0,0,0,"","Serviço","Serviço","-","AGETOP",70920,"CINTA DE ACO GALVANIZADO DIAM.190 MM","Un    ",1,null,null,0,"",null,null,70581,"(sem código)","-",0,0]
["S",3,"S",0,{"$f":"IF($C73=1,OFFSET(E73,-1,0)+1,OFFSET(E73,-1,0))","v":1},{"$f":"IF($C73=1,0,IF($C73=2,OFFSET(F73,-1,0)+1,OFFSET(F73,-1,0)))","v":4},{"$f":"IF(AND($C73<=2,$C73<>0),0,IF($C73=3,OFFSET(G73,-1,0)+1,OFFSET(G73,-1,0)))","v":1},{"$f":"IF(AND($C73<=3,$C73<>0),0,IF($C73=4,OFFSET(H73,-1,0)+1,OFFSET(H73,-1,0)))","v":0},0,0,0,"","Serviço","Serviço","-","AGETOP",70921,"CINTA DE ACO GALVANIZADO DIAM.220 MM","Un    ",2,null,null,0,"",null,null,70582,"(sem código)","-",0,0]
["S",3,"S",0,1,4,1,0,0,0,0,"","Serviço","Serviço","-","AGETOP",70922,"CINTA DE ACO GALVANIZADO DIAM.230MM","Un    ",2,null,null,0,"",null,null,70583,"(sem código)","-",0,0]
["S",3,"S",0,1,4,1,0,0,0,0,"","Serviço","Serviço","-","AGETOP",71016,"CONECTOR DE COMPRESSÃO FORMATO H PARA CABO 25 A 70 MM2","un    ",4,null,null,0,"",null,null,70584,"(sem código)","-",0,0]
["S",3,"S",0,1,4,1,0,0,0,0,"","Serviço","Serviço","-","AGETOP",71020,"CONECTOR PARAL. ALUM.EXTRUD.CA-CU-10,0D.10-2-1 PARAF.","Un    ",6,null,null,0,"",null,null,70585,"(sem código)","-",0,0]
["S",3,"S",0,1,4,1,0,0,0,0,"","Serviço","Serviço","-","SINAPI",72272,"CONECTOR PARAFUSO FENDIDO \u0094SPLIT-BOLT\u0094 - PARA CABO DE 35MM2 - FORNECIMENTO E INSTALACAO","UN",1,null,null,0,"",null,null,70645,"(sem código)","-",0,0]
["S",3,"S",0,1,4,1,0,0,0,0,"","Serviço","Serviço","-","AGETOP",71037,"CONECTOR TIPO PARAFUSO FENDIDO 70 MM2","Un    ",4,null,null,0,"",null,null,70680,"(sem código)","-",0,0]
["S",{"$f":"IF(OR(C79=\"s\",C79=0),OFFSET(B79,-1,0),C79)","v":3},{"$f":"IF(OFFSET(C79,-1,0)=\"L\",1,IF(OFFSET(C79,-1,0)=1,2,IF(OR(A79=\"s\",A79=0),\"S\",IF(AND(OFFSET(C79,-1,0)=2,A79=4),3,IF(AND(OR(OFFSET(C79,-1,0)=\"s\",OFFSET(C79,-1,0)=0),A79<>\"s\",A79>OFFSET(B79,-1,0)),OFFSET(B79,-1,0),A79)))))","v":"S"},{"$f":"IF(OR(C79=\"S\",C79=0),0,IF(ISERROR(K79),J79,SMALL(J79:K79,1)))","v":0},1,4,1,0,0,0,0,"","Serviço","Serviço","-","AGETOP",71142,"CURVA DE 90 GRAUS DE PVC RIGIDO DIAM. 1\"","Un    ",1,null,null,0,"",null,null,70682,"(sem código)","-",0,0]
["S",3,"S",0,1,4,1,0,0,0,0,"","Serviço","Serviço","-","SINAPI",93022,"CURVA 90 GRAUS PARA ELETRODUTO, PVC, ROSCÁVEL, DN 75 MM (2 1/2\") - FORNECIMENTO E INSTALAÇÃO. AF_12/2015","UN",1,null,null,0,"",null,null,70691,"(sem código)","-",0,0]
["S",3,"S",0,1,4,1,0,0,0,0,"","Serviço","Serviço","-","AGETOP",71184,"DISPOSITIVO DE PROTEÇÃO CONTRA SURTOS (D.P.S.) 275V DE 8 A 40KA","Un    ",3,null,null,0,"",null,null,70692,"(sem código)","-",0,0]
["S",3,"S",0,1,4,1,0,0,0,0,"","Serviço","Serviço","-","SINAPI","74130/10","DISJUNTOR TERMOMAGNETICO TRIPOLAR EM CAIXA MOLDADA 175 A 225A 240V, FORNECIMENTO E INSTALACAO","UN",1,null,null,0,"",null,null,70708,"(sem código)","-",0,0]
["S",3,"S",0,1,4,1,0,0,{"$f":"IF(OR($C83=\"S\",$C83=0),0,MATCH(0,OFFSET($D83,1,$C83,ROW($C$648)-ROW($C83)),0))","v":0},{"$f":"IF(OR($C83=\"S\",$C83=0),0,MATCH(OFFSET($D83,0,$C83)+1,OFFSET($D83,1,$C83,ROW($C$648)-ROW($C83)),0))","v":0},"","Serviço","Serviço","-","AGETOP",71202,"ELETRODUTO DE PVC RIGIDO DIAMETRO 1\"","M     ",3,null,null,0,"",null,null,70716,"(sem código)","-",0,0]
["S",3,"S",0,1,4,1,0,0,0,0,"","Serviço","Serviço","-","SINAPI",93010,"ELETRODUTO RÍGIDO ROSCÁVEL, PVC, DN 75 MM (2 1/2\") - FORNECIMENTO E INSTALAÇÃO. AF_12/2015","M",3,null,null,0,"",null,null,70720,"(sem código)","-",0,0]
["S",3,"S",0,1,4,1,0,0,0,0,"","Serviço","Serviço","-","AGETOP",71216,"ELETRODUTO EM AÇO GALVANIZADO A FOGO DIÂMETRO 2 1/2\" - PESADO ","M     ",7,null,null,0,"",null,null,70929,"(sem código)","-",0,0]
["S",3,"S",0,1,4,1,0,0,0,0,"","Serviço","Serviço","-","AGETOP",71268,"ELO FUSÍVEL 6 K","Un    ",1,null,null,0,"",null,null,70930,"(sem código)","-",0,0]
["S",3,"S",0,1,4,1,0,0,0,0,"","Serviço","Serviço","-","AGETOP",71321,"FITA DE AUTO FUSAO, ROLO E 10,00 MM","Un    ",5,null,null,0,"",null,null,71141,"(sem código)","-",0,0]
["S",3,"S",0,1,4,1,0,0,0,0,"","Serviço","Serviço","-","AGETOP",71365,"GRAMPO DE ANCORAGEM POLIMÉRICO","un    ",3,null,null,0,"",null,null,71142,"(sem código)","-",0,0]
["S",3,"S",0,1,4,1,0,0,0,0,"","Serviço","Serviço","-","AGETOP",71381,"HASTE REV.COBRE(COPPERWELD)  5/8\" X 3,00 M C/CONECTOR","Un    ",4,null,null,0,"",null,null,71151,"(sem código)","-",0,0]
["S",3,"S",0,1,4,1,0,0,0,0,"","Serviço","Serviço","-","AGETOP",71463,"ISOLADOR EPOXI 50X40 (BUJAO)","Un    ",2,null,null,0,"",null,null,71152,"(sem código)","-",0,0]
["S",3,"S",0,1,4,1,0,0,0,0,"","Serviço","Serviço","-","AGETOP",71476,"ISOLADOR DE ANCORAGEM POLIMÉRICO 15KV","un    ",1,null,null,0,"",null,null,71171,"(sem código)","-",0,0]
["S",3,"S",0,1,4,1,0,0,0,0,"","Serviço","Serviço","-","AGETOP",71510,"LACO PREFORMADO DE DISTRIBUICAO","Un    ",1,null,null,0,"",null,null,71171,"(sem código)","-",0,0]
["S",3,"S",0,1,4,1,0,0,0,0,"","Serviço","Serviço","-","AGETOP",71742,"LUVA PVC ROSQUEAVEL DIAMETRO 1\"","Un    ",1,null,null,0,"",null,null,71171,"(sem código)","-",0,0]
["S",3,"S",0,1,4,1,0,0,0,0,"","Serviço","Serviço","-","SINAPI",93015,"LUVA PARA ELETRODUTO, PVC, ROSCÁVEL, DN 75 MM (2 1/2\") - FORNECIMENTO E INSTALAÇÃO. AF_12/2015","UN",1,null,null,0,"",null,null,71173,"(sem código)","-",0,0]
["S",3,"S",0,1,4,1,0,0,0,0,"","Serviço","Serviço","-","AGETOP",71706,"LUVA  EM AÇO GALVANIZADO DIÂMETRO 2.1/2\"","Un    ",2,null,null,0,"",null,null,71174,"(sem código)","-",0,0]
["S",3,"S",0,1,4,1,0,0,0,0,"","Serviço","Serviço","-","AGETOP",71750,"MANILHA-SAPATILHA EM AÇO GALVANIZADO","un    ",1,null,null,0,"",null,null,71175,"(sem código)","-",0,0]
["S",3,"S",0,1,4,1,0,0,0,0,"","Serviço","Serviço","-","AGETOP",71761,"MURETA MEDIÇÃO ALVEN. 1 1/2 V.(35CM) REBOC.C/PINTURA ACRÍL. E LAJE CONC. 20MPA MALHA 8.0MM CADA 10CM REVEST.C/ARGAMASSA 1:3 C/ IMPERMEABILIZANTE","m2    ",4,null,null,0,"",null,null,71184,"(sem código)","-",0,0]
["S",3,"S",0,1,4,1,0,0,0,0,"","Serviço","Serviço","-","AGETOP",71773,"NIPLE METALICO Fo.Zo. DIAMETRO 1\"","Un    ",1,null,null,0,"",null,null,71194,"(sem código)","-",0,0]
["S",3,"S",0,1,4,1,0,0,0,0,"","Serviço","Serviço","-","AGETOP",71776,"NIPLE METALICO Fo.Zo. DIAMETRO 2.1/2\"","Un    ",2,null,null,0,"",null,null,71195,"(sem código)","-",0,0]
["S",3,"S",0,1,4,1,0,0,0,0,"","Serviço","Serviço","-","AGETOP",85047,"NIPLE DUPLO FERRO GALVANIZADO 2.1/2\"","Un    ",1,null,null,0,"",null,null,71196,"(sem código)","-",0,0]
["S",3,"S",0,1,4,1,0,0,0,0,"","Serviço","Serviço","-","AGETOP",71795,"OLHAL PARA PARAFUSO","un    ",3,null,null,0,"",null,null,71197,"(sem código)","-",0,0]
["S",3,"S",0,1,4,1,0,0,0,0,"","Serviço","Serviço","-","AGETOP",71835,"PARAFUSO CABEÇA ABAULADA (FRANCES) M16 X 45 MM","Un    ",3,null,null,0,"",null,null,71201,"(sem código)","-",0,0]
["S",3,"S",0,1,4,1,0,0,0,0,"","Serviço","Serviço","-","AGETOP",71841,"PARAFUSO CABEÇA ABAULADA (FRANCES) M16 X 150 MM","Un    ",3,null,null,0,"",null,null,71202,"(sem código)","-",0,0]
["S",3,"S",0,1,4,1,0,0,0,0,"","Serviço","Serviço","-","AGETOP",71833,"PARA RAIOS DISTRIBUIDOR POLIMÉRICO ÓXIDO DE ZINCO S/CENTELHADOR C/ DESLIGAMENTO AUTOMÁTICO 15KV,10KA","Un    ",3,null,null,0,"",null,null,71203,"(sem código)","-",0,0]
["S",3,"S",0,1,4,1,0,0,0,0,"","Serviço","Serviço","-","AGETOP",71997,"POSTE - FUNDAÇÃO EM CONCRETO SIMPLES DA BASE DOS POSTES 11/600 PARA TRAFO ( DIAM. 1000MM)","m     ",0.3,null,null,0,"",null,null,71205,"(sem código)","-",0,0]
["S",3,"S",0,1,4,1,0,0,0,0,"","Serviço","Serviço","-","AGETOP",72061,"POSTE DE CONCRETO SC 11/600 - SEM FUNDAÇÃO/CONCRETO","Un    ",1,null,null,0,"",null,null,71211,"(sem código)","-",0,0]
["S",3,"S",0,1,4,1,0,0,0,0,"","Serviço","Serviço","-","AGETOP",72080,"POSTE/TRAFO - CAMINHÃO MUNCK 12 TON. (MÍNIMO 4H/DIA)","H     ",4,null,null,0,"",null,null,71212,"(sem código)","-",0,0]
["S",3,"S",0,1,4,1,0,0,0,0,"","Serviço","Serviço","-","AGETOP",72329,"SAPATILHA DE AÇO GALVANIZADO PARA POSTE COM TRANSFORMADOR","un    ",3,null,null,0,"",null,null,71214,"(sem código)","-",0,0]
["S",3,"S",0,1,4,1,0,0,0,0,"","Serviço","Serviço","-","SINAPI",73624,"SUPORTE PARA TRANSFORMADOR EM POSTE DE CONCRETO CIRCULAR","UN",2,null,null,0,"",null,null,71215,"(sem código)","-",0,0]
["S",3,"S",0,1,4,1,0,0,0,0,"","Serviço","Serviço","-","AGETOP",72518,"TERMINAL DE PRESSAO 10 MM2","Un    ",1,null,null,0,"",null,null,71321,"(sem código)","-",0,0]
["S",3,"S",0,1,4,1,0,0,0,0,"","Serviço","Serviço","-","AGETOP",72528,"TERMINAL DE PRESSAO 35 MM2","Un    ",5,null,null,0,"",null,null,71331,"(sem código)","-",0,0]
["S",3,"S",0,1,4,1,0,0,0,0,"","Serviço","Serviço","-","AGETOP",72535,"TERMINAL DE PRESSAO 70 MMM2","Un    ",2,null,null,0,"",null,null,71381,"(sem código)","-",0,0]
["S",3,"S",0,1,4,1,0,0,0,0,"","Serviço","Serviço","-","SINAPI","73857/2","TRANSFORMADOR DISTRIBUICAO  112,5KVA TRIFASICO 60HZ CLASSE 15KV IMERSO EM ÓLEO MINERAL FORNECIMENTO E INSTALACAO","UN",1,null,null,0,"",null,null,71431,"(sem código)","-",0,0]
["S",3,"S",0,1,4,1,0,0,0,0,"","Serviço","Serviço","-","SINAPI",88543,"ARMACAO SECUNDARIA OU REX COMPLETA PARA TRESLINHAS-FORNECIMENTO E INSTALACAO.","UN",1,null,null,0,"",null,null,71440,"(sem código)","-",0,0]
["S",3,"S",0,1,4,1,0,0,0,0,"","Serviço","Serviço","-","COMPOSIÇÃO","COMP 046_SEE","CAPUZ PARA PROTEÇÃO DOS PARA RAIOS","UN ",3,null,null,0,"",null,null,71441,"(sem código)","-",0,0]
["S",3,"S",0,1,4,1,0,0,0,0,"","Serviço","Serviço","-","COMPOSIÇÃO","COMP 047_SEE","CAPUZ DE PROTEÇÃO PARA BUCHA DE TRANSFORMADOR","UN ",3,null,null,0,"",null,null,71450,"(sem código)","-",0,0]
["S",3,"S",0,1,4,1,0,0,0,0,"","Serviço","Serviço","-","COMPOSIÇÃO","COMP 048_SEE","HASTE ROSQUEADA \"TIRANTE\" 3/8\"","M",0.5,null,null,0,"",null,null,71527,"(sem código)","-",0,0]
["S",3,"S",0,1,4,1,0,0,0,0,"","Serviço","Serviço","-","COMPOSIÇÃO","COMP 049_SEE","PORCA SEXTAVADA 3/8\"","UN ",8,null,null,0,"",null,null,71567,"(sem código)","-",0,0]
[3,3,3,46,1,4,2,0,0,46,61,"","Nível 3","Nível 3","-","SINAPI",null,"AMPLIAÇÃO E REFORMA","-",null,null,null,0,"",null,null,null,{"$f":"IFERROR(IF(OR($C119=0,$C119=1,$C119=2,$C119=3,$C119=4),R119,VLOOKUP($AA119,INDIRECT($Z119),2,FALSE)),\"(sem código)\")","v":"AMPLIAÇÃO E REFORMA"},{"$f":"IFERROR(VLOOKUP(AA119,INDIRECT(Z119),3,FALSE()),\"-\")","v":"-"},0,0]
["S",3,"S",0,1,4,2,0,0,0,0,"","Serviço","Serviço","-","AGETOP",70351,"BRACADEIRA METALICA TIPO \"U\" DIAM. 3/4\"","Un    ",45,null,null,0,"",null,null,71577,"(sem código)","-",0,0]
["S",3,"S",0,1,4,2,0,0,0,0,"","Serviço","Serviço","-","AGETOP",70352,"BRACADEIRA METALICA TIPO \"U\" DIAM. 1\"","Un    ",15,null,null,0,"",null,null,71612,"(sem código)","-",0,0]
["S",3,"S",0,1,4,2,0,0,0,0,"","Serviço","Serviço","-","AGETOP",70355,"BRACADEIRA METALICA TIPO \"U\" DIAM. 2\"","Un    ",20,null,null,0,"",null,null,null,"(sem código)","-",0,0]
["S",3,"S",0,1,4,2,0,0,0,0,"","Serviço","Serviço","-","AGETOP",70376,"BRACADEIRA METALICA TIPO \"D\" DIAM. 2.1/2\"","Un    ",20,null,null,0,"",null,null,71645,"(sem código)","-",0,0]
["S",3,"S",0,1,4,2,0,0,0,0,"","Serviço","Serviço","-","AGETOP",70421,"BUCHA E ARRUELA METALICA DIAM. 3/4\"","PR    ",15,null,null,0,"",null,null,71684,"(sem código)","-",0,0]
["S",3,"S",0,1,4,2,0,0,0,0,"","Serviço","Serviço","-","AGETOP",70422,"BUCHA E ARRUELA METALICA DIAM. 1\"","PR    ",5,null,null,0,"",null,null,71688,"(sem código)","-",0,0]
["S",3,"S",0,1,4,2,0,0,0,0,"","Serviço","Serviço","-","AGETOP",70425,"BUCHA E ARRUELA METALICA DIAM. 2\"","PR    ",8,null,null,0,"",null,null,71701,"(sem código)","-",0,0]
["S",3,"S",0,1,4,2,0,0,0,0,"","Serviço","Serviço","-","AGETOP",70426,"BUCHA E ARRUELA METALICA DIAM. 2.1/2\"","PR    ",8,null,null,0,"",null,null,71702,"(sem código)","-",0,0]
["S",3,"S",0,1,4,2,0,0,0,0,"","Serviço","Serviço","-","SINAPI",91929,"CABO DE COBRE FLEXÍVEL ISOLADO, 4 MM², ANTI-CHAMA 0,6/1,0 KV, PARA CIRCUITOS TERMINAIS - FORNECIMENTO E INSTALAÇÃO. AF_12/2015","M",1000,null,null,0,"",null,null,71704,"(sem código)","-",0,0]
["S",3,"S",0,1,4,2,0,0,0,0,"","Serviço","Serviço","-","SINAPI",92980,"CABO DE COBRE FLEXÍVEL ISOLADO, 10 MM², ANTI-CHAMA 0,6/1,0 KV, PARA DISTRIBUIÇÃO - FORNECIMENTO E INSTALAÇÃO. AF_12/2015","M",5,null,null,0,"",null,null,71705,"(sem código)","-",0,0]
["S",3,"S",0,1,4,2,0,0,0,0,"","Serviço","Serviço","-","SINAPI",92982,"CABO DE COBRE FLEXÍVEL ISOLADO, 16 MM², ANTI-CHAMA 0,6/1,0 KV, PARA DISTRIBUIÇÃO - FORNECIMENTO E INSTALAÇÃO. AF_12/2015","M",500,null,null,0,"",null,null,71741,"(sem código)","-",0,0]
["S",3,"S",0,1,4,2,0,0,0,0,"","Serviço","Serviço","-","SINAPI",92984,"CABO DE COBRE FLEXÍVEL ISOLADO, 25 MM², ANTI-CHAMA 0,6/1,0 KV, PARA DISTRIBUIÇÃO - FORNECIMENTO E INSTALAÇÃO. AF_12/2015","M",5,null,null,0,"",null,null,71742,"(sem código)","-",0,0]
["S",3,"S",0,1,4,2,0,0,0,0,"","Serviço","Serviço","-","SINAPI",92986,"CABO DE COBRE FLEXÍVEL ISOLADO, 35 MM², ANTI-CHAMA 0,6/1,0 KV, PARA DISTRIBUIÇÃO - FORNECIMENTO E INSTALAÇÃO. AF_12/2015","M",12,null,null,0,"",null,null,71744,"(sem código)","-",0,0]
["S",3,"S",0,1,4,2,0,0,0,0,"","Serviço","Serviço","-","SINAPI",92990,"CABO DE COBRE FLEXÍVEL ISOLADO, 70 MM², ANTI-CHAMA 0,6/1,0 KV, PARA DISTRIBUIÇÃO - FORNECIMENTO E INSTALAÇÃO. AF_12/2015","M",48,null,null,0,"",null,null,71745,"(sem código)","-",0,0]
["S",3,"S",0,1,4,2,0,0,0,0,"","Serviço","Serviço","-","SINAPI",83366,"CAIXA DE PASSAGEM PARA TELEFONE 15X15X10CM (SOBREPOR), FORNECIMENTO E INSTALACAO.","UN",3,null,null,0,"",null,null,71820,"(sem código)","-",0,0]
[{"$f":"CHOOSE(1+LOG(1+2*(ORÇAMENTO.Nivel=\"Nível 1\")+4*(ORÇAMENTO.Nivel=\"Nível 2\")+8*(ORÇAMENTO.Nivel=\"Nível 3\")+16*(ORÇAMENTO.Nivel=\"Nível 4\")+32*(ORÇAMENTO.Nivel=\"Serviço\"),2),0,1,2,3,4,\"S\")","v":"S"},3,"S",0,1,4,2,0,{"$f":"IF(AND($C135<=4,$C135<>0),0,IF(AND($C135=\"S\",$W135>0),OFFSET(I135,-1,0)+1,OFFSET(I135,-1,0)))","v":0},0,0,"","Serviço","Serviço","-","SINAPI",92867,"CAIXA RETANGULAR 4\" X 2\" ALTA (2,00 M DO PISO), METÁLICA, INSTALADA EM PAREDE - FORNECIMENTO E INSTALAÇÃO. AF_12/2015","UN",12,null,null,0,"",null,null,71821,"(sem código)","-",0,0]
["S",3,"S",0,1,4,2,0,0,0,0,"","Serviço","Serviço","-","SINAPI",97893,"CAIXA ENTERRADA ELÉTRICA RETANGULAR, EM ALVENARIA COM BLOCOS DE CONCRETO, FUNDO COM BRITA, DIMENSÕES INTERNAS: 0,8X0,8X0,6 M. AF_05/2018","UN",4,null,null,0,"",null,null,71822,"(sem código)","-",0,0]
["S",3,"S",0,1,4,2,0,0,0,0,"","Serviço","Serviço","-","SINAPI",91902,"CURVA 90 GRAUS PARA ELETRODUTO, PVC, ROSCÁVEL, DN 25 MM (3/4\"), PARA CIRCUITOS TERMINAIS, INSTALADA EM LAJE - FORNECIMENTO E INSTALAÇÃO. AF_12/2015","UN",4,null,null,0,"",null,null,71823,"(sem código)","-",0,0]
["S",3,"S",0,{"$f":"IF($C138=1,OFFSET(E138,-1,0)+1,OFFSET(E138,-1,0))","v":1},{"$f":"IF($C138=1,0,IF($C138=2,OFFSET(F138,-1,0)+1,OFFSET(F138,-1,0)))","v":4},{"$f":"IF(AND($C138<=2,$C138<>0),0,IF($C138=3,OFFSET(G138,-1,0)+1,OFFSET(G138,-1,0)))","v":2},{"$f":"IF(AND($C138<=3,$C138<>0),0,IF($C138=4,OFFSET(H138,-1,0)+1,OFFSET(H138,-1,0)))","v":0},0,0,0,"","Serviço","Serviço","-","SINAPI",91905,"CURVA 90 GRAUS PARA ELETRODUTO, PVC, ROSCÁVEL, DN 32 MM (1\"), PARA CIRCUITOS TERMINAIS, INSTALADA EM LAJE - FORNECIMENTO E INSTALAÇÃO. AF_12/2015","UN",4,null,null,0,"",null,null,71824,"(sem código)","-",0,0]
["S",3,"S",0,1,4,2,0,0,0,0,"","Serviço","Serviço","-","SINAPI",93020,"CURVA 90 GRAUS PARA ELETRODUTO, PVC, ROSCÁVEL, DN 60 MM (2\") - FORNECIMENTO E INSTALAÇÃO. AF_12/2015","UN",2,null,null,0,"",null,null,71825,"(sem código)","-",0,0]
["S",3,"S",0,1,4,2,0,0,0,0,"","Serviço","Serviço","-","SINAPI",93022,"CURVA 90 GRAUS PARA ELETRODUTO, PVC, ROSCÁVEL, DN 75 MM (2 1/2\") - FORNECIMENTO E INSTALAÇÃO. AF_12/2015","UN",4,null,null,0,"",null,null,71826,"(sem código)","-",{"$f":"IFERROR(VLOOKUP($AA140,INDIRECT($Z140),IF($W$10=\"DESONERADA\",4,7),FALSE()),0)","v":0},{"$f":"IFERROR(VLOOKUP($AA140,INDIRECT($Z140),IF($W$10=\"DESONERADA\",5,8),FALSE()),0)","v":0}]
["S",3,"S",0,1,4,2,0,0,0,0,"","Serviço","Serviço","-","SINAPI",93656,"DISJUNTOR MONOPOLAR TIPO DIN, CORRENTE NOMINAL DE 25A - FORNECIMENTO E INSTALAÇÃO. AF_04/2016","UN",12,null,null,0,"",null,null,71827,"(sem código)","-",0,0]
["S",3,"S",0,1,4,2,0,0,0,0,"","Serviço","Serviço","-","SINAPI",93670,"DISJUNTOR TRIPOLAR TIPO DIN, CORRENTE NOMINAL DE 25A - FORNECIMENTO E INSTALAÇÃO. AF_04/2016","UN",1,null,null,0,"",null,null,72190,"(sem código)","-",0,0]
["S",3,"S",0,1,4,2,0,0,0,0,"","Serviço","Serviço","-","SINAPI","74130/5","DISJUNTOR TERMOMAGNETICO TRIPOLAR PADRAO NEMA (AMERICANO) 60 A 100A 240V, FORNECIMENTO E INSTALACAO","UN",5,null,null,0,"",null,null,72198,"(sem código)","-",0,0]
["S",{"$f":"IF(OR(C144=\"s\",C144=0),OFFSET(B144,-1,0),C144)","v":3},{"$f":"IF(OFFSET(C144,-1,0)=\"L\",1,IF(OFFSET(C144,-1,0)=1,2,IF(OR(A144=\"s\",A144=0),\"S\",IF(AND(OFFSET(C144,-1,0)=2,A144=4),3,IF(AND(OR(OFFSET(C144,-1,0)=\"s\",OFFSET(C144,-1,0)=0),A144<>\"s\",A144>OFFSET(B144,-1,0)),OFFSET(B144,-1,0),A144)))))","v":"S"},{"$f":"IF(OR(C144=\"S\",C144=0),0,IF(ISERROR(K144),J144,SMALL(J144:K144,1)))","v":0},1,4,2,0,0,0,0,"","Serviço","Serviço","-","AGETOP",71184,"DISPOSITIVO DE PROTEÇÃO CONTRA SURTOS (D.P.S.) 275V DE 8 A 40KA","Un    ",3,null,null,0,"",null,null,null,{"$f":"IFERROR(IF(OR($C144=0,$C144=1,$C144=2,$C144=3,$C144=4),R144,VLOOKUP($AA144,INDIRECT($Z144),2,FALSE)),\"(sem código)\")","v":"(sem código)"},{"$f":"IFERROR(VLOOKUP(AA144,INDIRECT(Z144),3,FALSE()),\"-\")","v":"-"},0,0]
["S",3,"S",0,1,4,2,0,0,0,0,"","Serviço","Serviço","-","SINAPI","74130/10","DISJUNTOR TERMOMAGNETICO TRIPOLAR EM CAIXA MOLDADA 175 A 225A 240V, FORNECIMENTO E INSTALACAO","UN",1,null,null,0,"",null,null,null,"(sem código)","-",0,0]
["S",3,"S",0,1,4,2,0,0,0,0,"","Serviço","Serviço","-","AGETOP",71450,"INTERRUPTOR DIFERENCIAL RESIDUAL (D.R.) BIPOLAR DE 25A-30mA","Un    ",6,null,null,0,"",null,null,null,"(sem código)","-",0,0]
["S",3,"S",0,1,4,2,0,0,{"$f":"IF(OR($C147=\"S\",$C147=0),0,MATCH(0,OFFSET($D147,1,$C147,ROW($C$648)-ROW($C147)),0))","v":0},{"$f":"IF(OR($C147=\"S\",$C147=0),0,MATCH(OFFSET($D147,0,$C147)+1,OFFSET($D147,1,$C147,ROW($C$648)-ROW($C147)),0))","v":0},"","Serviço","Serviço","-","SINAPI",91871,"ELETRODUTO RÍGIDO ROSCÁVEL, PVC, DN 25 MM (3/4\"), PARA CIRCUITOS TERMINAIS, INSTALADO EM PAREDE - FORNECIMENTO E INSTALAÇÃO. AF_12/2015","M",90,null,null,0,"",null,null,null,"(sem código)","-",0,0]
["S",3,"S",0,1,4,2,0,0,0,0,"","Serviço","Serviço","-","SINAPI",91872,"ELETRODUTO RÍGIDO ROSCÁVEL, PVC, DN 32 MM (1\"), PARA CIRCUITOS TERMINAIS, INSTALADO EM PAREDE - FORNECIMENTO E INSTALAÇÃO. AF_12/2015","M",30,null,null,0,"",null,null,null,"(sem código)","-",0,0]
["S",3,"S",0,1,4,2,0,0,0,0,"","Serviço","Serviço","-","SINAPI",93009,"ELETRODUTO RÍGIDO ROSCÁVEL, PVC, DN 60 MM (2\") - FORNECIMENTO E INSTALAÇÃO. AF_12/2015","M",45,null,null,0,"",null,null,null,"(sem código)","-",0,0]
["S",3,"S",0,1,4,2,0,0,0,0,"","Serviço","Serviço","-","SINAPI",93010,"ELETRODUTO RÍGIDO ROSCÁVEL, PVC, DN 75 MM (2 1/2\") - FORNECIMENTO E INSTALAÇÃO. AF_12/2015","M",45,null,null,0,"",null,null,null,"(sem código)","-",0,0]
["S",3,"S",0,1,4,2,0,0,0,0,"","Serviço","Serviço","-","AGETOP",71321,"FITA DE AUTO FUSAO, ROLO E 10,00 MM","Un    ",4,null,null,0,"",null,null,null,"(sem código)","-",0,0]
["S",3,"S",0,1,4,2,0,0,0,0,"","Serviço","Serviço","-","AGETOP",71331,"FITA ISOLANTE, ROLO DE 20,00 M","Un    ",3,null,null,0,"",null,null,null,"(sem código)","-",0,0]
["S",3,"S",0,1,4,2,0,0,0,0,"","Serviço","Serviço","-","AGETOP",71381,"HASTE REV.COBRE(COPPERWELD)  5/8\" X 3,00 M C/CONECTOR","Un    ",3,null,null,0,"",null,null,null,"(sem código)","-",0,0]
["S",3,"S",0,1,4,2,0,0,0,0,"","Serviço","Serviço","-","SINAPI",91884,"LUVA PARA ELETRODUTO, PVC, ROSCÁVEL, DN 25 MM (3/4\"), PARA CIRCUITOS TERMINAIS, INSTALADA EM PAREDE - FORNECIMENTO E INSTALAÇÃO. AF_12/2015","UN",30,null,null,0,"",null,null,null,"(sem código)","-",0,0]
["S",3,"S",0,1,4,2,0,0,0,0,"","Serviço","Serviço","-","SINAPI",91885,"LUVA PARA ELETRODUTO, PVC, ROSCÁVEL, DN 32 MM (1\"), PARA CIRCUITOS TERMINAIS, INSTALADA EM PAREDE - FORNECIMENTO E INSTALAÇÃO. AF_12/2015","UN",10,null,null,0,"",null,null,null,"(sem código)","-",0,0]
["S",3,"S",0,1,4,2,0,0,0,0,"","Serviço","Serviço","-","SINAPI",93014,"LUVA PARA ELETRODUTO, PVC, ROSCÁVEL, DN 60 MM (2\") - FORNECIMENTO E INSTALAÇÃO. AF_12/2015","UN",15,null,null,0,"",null,null,null,"(sem código)","-",0,0]
["S",3,"S",0,1,4,2,0,0,0,0,"","Serviço","Serviço","-","SINAPI",93015,"LUVA PARA ELETRODUTO, PVC, ROSCÁVEL, DN 75 MM (2 1/2\") - FORNECIMENTO E INSTALAÇÃO. AF_12/2015","UN",15,null,null,0,"",null,null,null,"(sem código)","-",0,0]
["S",3,"S",0,1,4,2,0,0,0,0,"","Serviço","Serviço","-","SINAPI","74131/8","QUADRO DE DISTRIBUICAO DE ENERGIA DE EMBUTIR, EM CHAPA METALICA, PARA 50 DISJUNTORES TERMOMAGNETICOS MONOPOLARES, COM BARRAMENTO TRIFASICO E NEUTRO, FORNECIMENTO E INSTALACAO","UN",1,null,null,0,"",null,null,null,"(sem código)","-",0,0]
["S",3,"S",0,1,4,2,0,0,0,0,"","Serviço","Serviço","-","SINAPI","74131/6","QUADRO DE DISTRIBUICAO DE ENERGIA DE EMBUTIR, EM CHAPA METALICA, PARA 32 DISJUNTORES TERMOMAGNETICOS MONOPOLARES, COM BARRAMENTO TRIFASICO E NEUTRO, FORNECIMENTO E INSTALACAO","UN",1,null,null,0,"",null,null,null,"(sem código)","-",0,0]
["S",3,"S",0,1,4,2,0,0,0,0,"","Serviço","Serviço","-","SINAPI","74131/7","QUADRO DE DISTRIBUICAO DE ENERGIA DE EMBUTIR, EM CHAPA METALICA, PARA 40 DISJUNTORES TERMOMAGNETICOS MONOPOLARES, COM BARRAMENTO TRIFASICO E NEUTRO, FORNECIMENTO E INSTALACAO","UN",1,null,null,0,"",null,null,null,"(sem código)","-",0,0]
["S",3,"S",0,1,4,2,0,0,0,0,"","Serviço","Serviço","-","AGETOP",72425,"TAMPA CEGA PLASTICA RETANGULAR 4\"X2\"","Un    ",20,null,null,0,"",null,null,null,"(sem código)","-",0,0]
["S",3,"S",0,1,4,2,0,0,0,0,"","Serviço","Serviço","-","AGETOP",72400,"TAMPA CEGA PLASTICA QUADRADA 4\"X4\"","Un    ",2,null,null,0,"",null,null,null,"(sem código)","-",0,0]
["S",3,"S",0,1,4,2,0,0,0,0,"","Serviço","Serviço","-","AGETOP",72395,"TAMPA CEGA PARA CONDULETE METÁLICO","Un    ",2,null,null,0,"",null,null,null,"(sem código)","-",0,0]
["S",{"$f":"IF(OR(C164=\"s\",C164=0),OFFSET(B164,-1,0),C164)","v":3},{"$f":"IF(OFFSET(C164,-1,0)=\"L\",1,IF(OFFSET(C164,-1,0)=1,2,IF(OR(A164=\"s\",A164=0),\"S\",IF(AND(OFFSET(C164,-1,0)=2,A164=4),3,IF(AND(OR(OFFSET(C164,-1,0)=\"s\",OFFSET(C164,-1,0)=0),A164<>\"s\",A164>OFFSET(B164,-1,0)),OFFSET(B164,-1,0),A164)))))","v":"S"},{"$f":"IF(OR(C164=\"S\",C164=0),0,IF(ISERROR(K164),J164,SMALL(J164:K164,1)))","v":0},1,4,2,0,0,0,0,"","Serviço","Serviço","-","SINAPI",91993,"TOMADA ALTA DE EMBUTIR (1 MÓDULO), 2P+T 20 A, INCLUINDO SUPORTE E PLACA - FORNECIMENTO E INSTALAÇÃO. AF_12/2015","UN",12,null,null,0,"",null,null,null,"(sem código)","-",0,0]
[2,2,2,62,1,5,0,0,0,117,62,"","Nível 2","Nível 2","-","AGETOP",null,"INSTALAÇÕES HIDROSSANITÁRIAS","-",null,null,null,0,"",null,null,null,"INSTALAÇÕES HIDROSSANITÁRIAS","-",0,0]
[3,3,3,8,1,5,1,0,0,61,8,"","Nível 3","Nível 3","-","SINAPI",null,"INCENDIO","-",null,null,null,0,"","NÃO","AGETOP",70634,"INCENDIO","-",0,0]
["S",3,"S",0,1,5,1,0,0,0,0,"","Serviço","Serviço","-","AGETOP",85006,"EXTINTOR MULTI USO EM PO A B C (6 KG) - CAPACIDADE EXTINTORA 3A 20BC","un    ",3,null,null,0,"",null,null,null,"(sem código)","-",{"$f":"IFERROR(VLOOKUP($AA167,INDIRECT($Z167),IF($W$10=\"DESONERADA\",4,7),FALSE()),0)","v":0},{"$f":"IFERROR(VLOOKUP($AA167,INDIRECT($Z167),IF($W$10=\"DESONERADA\",5,8),FALSE()),0)","v":0}]
["S",3,"S",0,1,5,1,0,0,0,0,"","Serviço","Serviço","-","AGETOP",85005,"EXTINTOR AGUA PRESSURIZADA (10 LITROS) - CAPACIDADE EXTINTORA 2A","Un    ",3,null,null,0,"",null,null,null,"(sem código)","-",0,0]
["S",3,"S",0,1,5,1,0,0,0,0,"","Serviço","Serviço","-","AGETOP",85003,"EXTINTOR PO QUIMICO SECO (6 KG) - CAPACIDADE EXTINTORA 20 BC","Un    ",1,null,null,0,"",null,null,null,"(sem código)","-",0,0]
["S",3,"S",0,1,5,1,0,0,0,0,"","Serviço","Serviço","-","COMPOSIÇÃO","COMP 024_SEE","SINALIZADOR FOTOLUMINESCENTE PARA EXTINTOR","UN ",7,null,null,0,"",null,null,null,"(sem código)","-",0,0]
["S",3,"S",0,1,5,1,0,0,0,0,"","Serviço","Serviço","-","COMPOSIÇÃO","COMP 025_SEE","SINALIZADOR FOTOLUMINESCENTE DE EMERGÊNCIA","UN ",12,null,null,0,"",null,null,null,"(sem código)","-",0,0]
["S",3,"S",0,1,5,1,0,0,0,0,"","Serviço","Serviço","-","COMPOSIÇÃO","COMP 277_SEE","MARCAÇÃO NO PISO - 1X1 M PARA EXTINTOR","M2",7,null,null,0,"",null,null,null,{"$f":"IFERROR(IF(OR($C172=0,$C172=1,$C172=2,$C172=3,$C172=4),R172,VLOOKUP($AA172,INDIRECT($Z172),2,FALSE)),\"(sem código)\")","v":"(sem código)"},{"$f":"IFERROR(VLOOKUP(AA172,INDIRECT(Z172),3,FALSE()),\"-\")","v":"-"},0,0]
["S",3,"S",0,1,5,1,0,0,0,0,"","Serviço","Serviço","-","AGETOP",71598,"LUMINÁRIA DE EMERGÊNCIA 30 LEDS","un    ",10,null,null,0,"",null,null,null,"(sem código)","-",0,0]
[3,3,3,6,1,5,2,0,0,53,6,"","Nível 3","Nível 3","-","SINAPI",null,"PEÇAS E ACESSÓRIOS","-",null,null,null,0,"",null,null,null,"PEÇAS E ACESSÓRIOS",{"$f":"IFERROR(VLOOKUP(AA174,INDIRECT(Z174),3,FALSE()),\"-\")","v":"-"},0,0]
[4,4,4,3,1,5,2,1,0,5,3,"","Nível 4","Nível 4","-","SINAPI",null,"CAIXAS E CURVAS","-",null,null,null,0,"",null,null,null,"CAIXAS E CURVAS",{"$f":"IFERROR(VLOOKUP(AA175,INDIRECT(Z175),3,FALSE()),\"-\")","v":"-"},0,0]
["S",4,"S",0,1,5,2,1,0,0,0,"","Serviço","Serviço","-","SINAPI",6171,"TAMPA DE CONCRETO ARMADO 60X60X5CM PARA CAIXA","UN",4,null,null,0,"","NÃO","AGETOP",70634,"(sem código)",{"$f":"IFERROR(VLOOKUP(AA176,INDIRECT(Z176),3,FALSE()),\"-\")","v":"-"},0,0]
["S",4,"S",0,1,5,2,1,0,0,0,"","Serviço","Serviço","-","AGETOP",70715,"CAIXA DE PASSAGEM 60X60X80CM FUNDO DE BRITA SEM TAMPA","Un    ",4,null,null,0,"",null,null,null,"(sem código)","-",0,0]
[4,4,4,2,1,5,2,2,0,2,13,"","Nível 4","Nível 4","-","SINAPI",null,"REGISTROS","-",null,null,null,0,"",null,null,null,"REGISTROS","-",0,0]
["S",4,"S",0,1,5,2,2,0,0,0,"","Serviço","Serviço","-","SINAPI",94499,"REGISTRO DE GAVETA BRUTO, LATÃO, ROSCÁVEL, 2 1/2\u0094, INSTALADO EM RESERVAÇÃO DE ÁGUA DE EDIFICAÇÃO QUE POSSUA RESERVATÓRIO DE FIBRA/FIBROCIMENTO \u0096 FORNECIMENTO E INSTALAÇÃO. AF_06/2016","UN",1,null,null,0,"",null,"AGETOP",80910,"(sem código)","-",0,0]
[{"$f":"CHOOSE(1+LOG(1+2*(ORÇAMENTO.Nivel=\"Nível 1\")+4*(ORÇAMENTO.Nivel=\"Nível 2\")+8*(ORÇAMENTO.Nivel=\"Nível 3\")+16*(ORÇAMENTO.Nivel=\"Nível 4\")+32*(ORÇAMENTO.Nivel=\"Serviço\"),2),0,1,2,3,4,\"S\")","v":3},{"$f":"IF(OR(C180=\"s\",C180=0),OFFSET(B180,-1,0),C180)","v":3},{"$f":"IF(OFFSET(C180,-1,0)=\"L\",1,IF(OFFSET(C180,-1,0)=1,2,IF(OR(A180=\"s\",A180=0),\"S\",IF(AND(OFFSET(C180,-1,0)=2,A180=4),3,IF(AND(OR(OFFSET(C180,-1,0)=\"s\",OFFSET(C180,-1,0)=0),A180<>\"s\",A180>OFFSET(B180,-1,0)),OFFSET(B180,-1,0),A180)))))","v":3},{"$f":"IF(OR(C180=\"S\",C180=0),0,IF(ISERROR(K180),J180,SMALL(J180:K180,1)))","v":38},{"$f":"IF($C180=1,OFFSET(E180,-1,0)+1,OFFSET(E180,-1,0))","v":1},{"$f":"IF($C180=1,0,IF($C180=2,OFFSET(F180,-1,0)+1,OFFSET(F180,-1,0)))","v":5},{"$f":"IF(AND($C180<=2,$C180<>0),0,IF($C180=3,OFFSET(G180,-1,0)+1,OFFSET(G180,-1,0)))","v":3},{"$f":"IF(AND($C180<=3,$C180<>0),0,IF($C180=4,OFFSET(H180,-1,0)+1,OFFSET(H180,-1,0)))","v":0},{"$f":"IF(AND($C180<=4,$C180<>0),0,IF(AND($C180=\"S\",$W180>0),OFFSET(I180,-1,0)+1,OFFSET(I180,-1,0)))","v":0},47,38,"","Nível 3","Nível 3","-","SINAPI",null,"ÁGUA FRIA","-",null,null,null,0,"",null,null,null,"ÁGUA FRIA","-",0,0]
[4,4,4,6,1,5,3,1,0,37,6,"","Nível 4","Nível 4","-","SINAPI",null,"TUBOS DE PVC SOLDÁVEL","-",null,null,null,0,"",null,null,null,"TUBOS DE PVC SOLDÁVEL","-",0,0]
["S",4,"S",0,1,5,3,1,0,0,0,"","Serviço","Serviço","-","SINAPI",89402,"TUBO, PVC, SOLDÁVEL, DN 25MM, INSTALADO EM RAMAL DE DISTRIBUIÇÃO DE ÁGUA - FORNECIMENTO E INSTALAÇÃO. AF_12/2014","M",12,null,null,0,"Referência: AGETOP - 81003","SIM","AGETOP",81003,"(sem código)","-",0,0]
["S",4,"S",0,1,5,3,1,0,0,0,"","Serviço","Serviço","-","SINAPI",89447,"TUBO, PVC, SOLDÁVEL, DN 32MM, INSTALADO EM PRUMADA DE ÁGUA - FORNECIMENTO E INSTALAÇÃO. AF_12/2014","M",42,null,null,0,"","NÃO","AGETOP",81004,"(sem código)","-",0,0]
["S",4,"S",0,1,5,3,1,0,0,0,"","Serviço","Serviço","-","SINAPI",89449,"TUBO, PVC, SOLDÁVEL, DN 50MM, INSTALADO EM PRUMADA DE ÁGUA - FORNECIMENTO E INSTALAÇÃO. AF_12/2014","M",12,null,null,0,"","NÃO","AGETOP",81006,"(sem código)","-",0,0]
["S",4,"S",0,1,5,3,1,0,0,0,"","Serviço","Serviço","-","SINAPI",89450,"TUBO, PVC, SOLDÁVEL, DN 60MM, INSTALADO EM PRUMADA DE ÁGUA - FORNECIMENTO E INSTALAÇÃO. AF_12/2014","M",30,null,null,0,"",null,"AGETOP",81007,"(sem código)","-",0,0]
["S",4,"S",0,1,5,3,1,0,0,0,"","Serviço","Serviço","-","SINAPI",89451,"TUBO, PVC, SOLDÁVEL, DN 75MM, INSTALADO EM PRUMADA DE ÁGUA - FORNECIMENTO E INSTALAÇÃO. AF_12/2014","M",30,null,null,0,"","NÃO","AGETOP",81008,"(sem código)","-",0,0]
[4,4,4,4,1,5,3,2,0,31,4,"","Nível 4","Nível 4","-","SINAPI",null,"ADAPTADORES DE PVC SOLDÁVEL","-",null,null,null,0,"",null,null,null,"ADAPTADORES DE PVC SOLDÁVEL","-",0,0]
["S",4,"S",0,1,5,3,2,0,0,0,"","Serviço","Serviço","-","SINAPI",94709,"ADAPTADOR COM FLANGES LIVRES, PVC, SOLDÁVEL, DN 32 MM X 1 , INSTALADO EM RESERVAÇÃO DE ÁGUA DE EDIFICAÇÃO QUE POSSUA RESERVATÓRIO DE FIBRA/FIBROCIMENTO   FORNECIMENTO E INSTALAÇÃO. AF_06/2016","UN",1,null,null,0,"Referência: AGETOP - 81042","SIM","AGETOP",81042,"(sem código)","-",0,0]
["S",4,"S",0,1,5,3,2,0,0,0,"","Serviço","Serviço","-","SINAPI",94713,"ADAPTADOR COM FLANGES LIVRES, PVC, SOLDÁVEL, DN 75 MM X 2 1/2 , INSTALADO EM RESERVAÇÃO DE ÁGUA DE EDIFICAÇÃO QUE POSSUA RESERVATÓRIO DE FIBRA/FIBROCIMENTO   FORNECIMENTO E INSTALAÇÃO. AF_06/2016","UN",1,null,null,0,"",null,null,null,"(sem código)","-",0,0]
["S",4,"S",0,1,5,3,2,0,0,0,"","Serviço","Serviço","-","SINAPI",89613,"ADAPTADOR CURTO COM BOLSA E ROSCA PARA REGISTRO, PVC, SOLDÁVEL, DN 75MM X 2.1/2\u0094, INSTALADO EM PRUMADA DE ÁGUA - FORNECIMENTO E INSTALAÇÃO. AF_12/2014","UN",2,null,null,0,"",null,null,null,"(sem código)","-",0,0]
[4,4,4,6,1,5,3,3,0,27,6,"","Nível 4","Nível 4","-","SINAPI",null,"LUVAS DE PVC","-",null,null,null,0,"",null,null,null,"LUVAS DE PVC","-",0,0]
["S",4,"S",0,1,5,3,3,0,0,0,"","Serviço","Serviço","-","SINAPI",89528,"LUVA, PVC, SOLDÁVEL, DN 25MM, INSTALADO EM PRUMADA DE ÁGUA - FORNECIMENTO E INSTALAÇÃO. AF_12/2014","UN",2,null,null,0,"","NÃO","AGETOP",81102,"(sem código)","-",0,0]
["S",4,"S",0,1,5,3,3,0,0,0,"","Serviço","Serviço","-","SINAPI",89431,"LUVA, PVC, SOLDÁVEL, DN 32MM, INSTALADO EM RAMAL DE DISTRIBUIÇÃO DE ÁGUA - FORNECIMENTO E INSTALAÇÃO. AF_12/2014","UN",11,null,null,0,"Referência: AGETOP - 81103","SIM","AGETOP",81103,"(sem código)","-",0,0]
["S",4,"S",0,1,5,3,3,0,0,0,"","Serviço","Serviço","-","SINAPI",89575,"LUVA, PVC, SOLDÁVEL, DN 50MM, INSTALADO EM PRUMADA DE ÁGUA - FORNECIMENTO E INSTALAÇÃO. AF_12/2014","UN",3,null,null,0,"Referência: AGETOP - 81105","SIM","AGETOP",81105,"(sem código)","-",0,0]
["S",4,"S",0,1,5,3,3,0,0,0,"","Serviço","Serviço","-","SINAPI",89597,"LUVA, PVC, SOLDÁVEL, DN 60MM, INSTALADO EM PRUMADA DE ÁGUA - FORNECIMENTO E INSTALAÇÃO. AF_12/2014","UN",6,null,null,0,"",null,"AGETOP",81106,"(sem código)","-",0,0]
["S",4,"S",0,1,5,3,3,0,0,0,"","Serviço","Serviço","-","SINAPI",89611,"LUVA, PVC, SOLDÁVEL, DN 75MM, INSTALADO EM PRUMADA DE ÁGUA - FORNECIMENTO E INSTALAÇÃO. AF_12/2014","UN",8,null,null,0,"","NÃO","AGETOP",81107,"(sem código)","-",0,0]
[4,4,4,6,1,5,3,4,0,21,6,"","Nível 4","Nível 4","-","SINAPI",null,"BUCHAS","-",null,null,null,0,"",null,null,null,"BUCHAS","-",0,0]
["S",4,"S",0,1,5,3,4,0,0,0,"","Serviço","Serviço","-","SINAPI",96662,"BUCHA DE REDUÇÃO, PPR, 32 X 25, CLASSE PN 25, INSTALADO EM RAMAL DE DISTRIBUIÇÃO DE ÁGUA \u0096 FORNECIMENTO E INSTALAÇÃO . AF_06/2015","UN",2,null,null,0,"Referência: AGETOP - 81162","SIM","AGETOP",81162,"(sem código)","-",0,0]
["S",4,"S",0,1,5,3,4,0,0,0,"","Serviço","Serviço","-","SINAPI",89605,"LUVA DE REDUÇÃO, PVC, SOLDÁVEL, DN 60MM X 50MM, INSTALADO EM PRUMADA DE ÁGUA - FORNECIMENTO E INSTALAÇÃO. AF_12/2014","UN",6,null,null,0,"Referência: AGETOP - 81165","SIM","AGETOP",81165,"(sem código)","-",0,0]
["S",4,"S",0,1,5,3,4,0,0,0,"","Serviço","Serviço","-","SINAPI",89579,"LUVA DE REDUÇÃO, PVC, SOLDÁVEL, DN 50MM X 25MM, INSTALADO EM PRUMADA DE ÁGUA   FORNECIMENTO E INSTALAÇÃO. AF_12/2014","UN",6,null,null,0,"Referência: AGETOP - 81179","SIM","AGETOP",81179,"(sem código)","-",0,0]
["S",4,"S",0,1,5,3,4,0,0,0,"","Serviço","Serviço","-","AGETOP",81180,"BUCHA DE REDUCAO SOLDAVEL LONGA 50 X 32 mm","Un    ",2,null,null,0,"",null,null,null,"(sem código)","-",0,0]
["S",4,"S",0,1,5,3,4,0,0,0,"","Serviço","Serviço","-","AGETOP",81185,"BUCHA DE REDUÇÃO SOLDÁVEL LONGA 75 X 50 MM","un    ",4,null,null,0,"",null,null,null,"(sem código)","-",0,0]
[4,4,4,4,1,5,3,5,0,15,4,"","Nível 4","Nível 4","-","SINAPI",null,"JOELHO","-",2,null,null,0,"",null,null,null,"JOELHO","-",0,0]
["S",4,"S",0,1,5,3,5,0,0,0,"","Serviço","Serviço","-","SINAPI",89501,"JOELHO 90 GRAUS, PVC, SOLDÁVEL, DN 50MM, INSTALADO EM PRUMADA DE ÁGUA - FORNECIMENTO E INSTALAÇÃO. AF_12/2014","UN",4,null,null,0,"Referência: AGETOP - 81322","SIM","AGETOP",81322,{"$f":"IFERROR(IF(OR($C204=0,$C204=1,$C204=2,$C204=3,$C204=4),R204,VLOOKUP($AA204,INDIRECT($Z204),2,FALSE)),\"(sem código)\")","v":"(sem código)"},"-",0,0]
["S",4,"S",0,1,5,3,5,0,0,0,"","Serviço","Serviço","-","SINAPI",89505,"JOELHO 90 GRAUS, PVC, SOLDÁVEL, DN 60MM, INSTALADO EM PRUMADA DE ÁGUA - FORNECIMENTO E INSTALAÇÃO. AF_12/2014","UN",1,null,null,0,"","NÃO","AGETOP",81324,"(sem código)","-",0,0]
["S",4,"S",0,1,5,3,5,0,0,0,"","Serviço","Serviço","-","SINAPI",89513,"JOELHO 90 GRAUS, PVC, SOLDÁVEL, DN 75MM, INSTALADO EM PRUMADA DE ÁGUA - FORNECIMENTO E INSTALAÇÃO. AF_12/2014","UN",2,null,null,0,"",null,null,null,"(sem código)","-",0,0]
[{"$f":"CHOOSE(1+LOG(1+2*(ORÇAMENTO.Nivel=\"Nível 1\")+4*(ORÇAMENTO.Nivel=\"Nível 2\")+8*(ORÇAMENTO.Nivel=\"Nível 3\")+16*(ORÇAMENTO.Nivel=\"Nível 4\")+32*(ORÇAMENTO.Nivel=\"Serviço\"),2),0,1,2,3,4,\"S\")","v":4},4,4,8,{"$f":"IF($C207=1,OFFSET(E207,-1,0)+1,OFFSET(E207,-1,0))","v":1},{"$f":"IF($C207=1,0,IF($C207=2,OFFSET(F207,-1,0)+1,OFFSET(F207,-1,0)))","v":5},{"$f":"IF(AND($C207<=2,$C207<>0),0,IF($C207=3,OFFSET(G207,-1,0)+1,OFFSET(G207,-1,0)))","v":3},{"$f":"IF(AND($C207<=3,$C207<>0),0,IF($C207=4,OFFSET(H207,-1,0)+1,OFFSET(H207,-1,0)))","v":6},{"$f":"IF(AND($C207<=4,$C207<>0),0,IF(AND($C207=\"S\",$W207>0),OFFSET(I207,-1,0)+1,OFFSET(I207,-1,0)))","v":0},11,8,"","Nível 4","Nível 4","-","SINAPI",null,"TÊ","-",4,null,null,0,"Referência: AGETOP - 81326","SIM","AGETOP",81326,"TÊ","-",0,0]
["S",{"$f":"IF(OR(C208=\"s\",C208=0),OFFSET(B208,-1,0),C208)","v":4},{"$f":"IF(OFFSET(C208,-1,0)=\"L\",1,IF(OFFSET(C208,-1,0)=1,2,IF(OR(A208=\"s\",A208=0),\"S\",IF(AND(OFFSET(C208,-1,0)=2,A208=4),3,IF(AND(OR(OFFSET(C208,-1,0)=\"s\",OFFSET(C208,-1,0)=0),A208<>\"s\",A208>OFFSET(B208,-1,0)),OFFSET(B208,-1,0),A208)))))","v":"S"},{"$f":"IF(OR(C208=\"S\",C208=0),0,IF(ISERROR(K208),J208,SMALL(J208:K208,1)))","v":0},1,5,3,6,0,0,0,"","Serviço","Serviço","-","SINAPI",89443,"TE, PVC, SOLDÁVEL, DN 32MM, INSTALADO EM RAMAL DE DISTRIBUIÇÃO DE ÁGUA - FORNECIMENTO E INSTALAÇÃO. AF_12/2014","UN",2,null,null,0,"","NÃO","AGETOP",81402,"(sem código)","-",0,0]
["S",4,"S",0,1,5,3,6,0,0,0,"","Serviço","Serviço","-","SINAPI",89625,"TE, PVC, SOLDÁVEL, DN 50MM, INSTALADO EM PRUMADA DE ÁGUA - FORNECIMENTO E INSTALAÇÃO. AF_12/2014","UN",1,null,null,0,"Referência: AGETOP - 81403","SIM","AGETOP",81403,"(sem código)","-",0,0]
["S",4,"S",0,1,5,3,6,0,0,0,"","Serviço","Serviço","-","SINAPI",89628,"TE, PVC, SOLDÁVEL, DN 60MM, INSTALADO EM PRUMADA DE ÁGUA - FORNECIMENTO E INSTALAÇÃO. AF_12/2014","UN",2,null,null,0,"Referência: AGETOP - 81405","SIM","AGETOP",81405,"(sem código)","-",0,0]
["S",4,"S",0,1,5,3,6,0,{"$f":"IF(OR($C211=\"S\",$C211=0),0,MATCH(0,OFFSET($D211,1,$C211,ROW($C$648)-ROW($C211)),0))","v":0},{"$f":"IF(OR($C211=\"S\",$C211=0),0,MATCH(OFFSET($D211,0,$C211)+1,OFFSET($D211,1,$C211,ROW($C$648)-ROW($C211)),0))","v":0},"","Serviço","Serviço","-","SINAPI",89629,"TE, PVC, SOLDÁVEL, DN 75MM, INSTALADO EM PRUMADA DE ÁGUA - FORNECIMENTO E INSTALAÇÃO. AF_12/2014","UN",5,null,null,0,"",null,null,null,"(sem código)","-",0,0]
["S",4,"S",0,1,5,3,6,0,0,0,"","Serviço","Serviço","-","SINAPI",89627,"TÊ DE REDUÇÃO, PVC, SOLDÁVEL, DN 50MM X 25MM, INSTALADO EM PRUMADA DE ÁGUA - FORNECIMENTO E INSTALAÇÃO. AF_12/2014","UN",2,null,null,0,"Referência: AGETOP - 81407","SIM","AGETOP",81407,"(sem código)","-",0,0]
["S",4,"S",0,1,5,3,6,0,0,0,"","Serviço","Serviço","-","AGETOP",81425,"TE REDUCAO 90 GRAUS SOLDAVEL 50 X 32 mm","Un    ",2,null,null,0,"","NÃO","AGETOP",81424,"(sem código)","-",0,0]
["S",4,"S",0,1,5,3,6,0,0,0,"","Serviço","Serviço","-","SINAPI",94698,"TÊ DE REDUÇÃO, PVC, SOLDÁVEL, DN 75 MM X 50 MM, INSTALADO EM RESERVAÇÃO DE ÁGUA DE EDIFICAÇÃO QUE POSSUA RESERVATÓRIO DE FIBRA/FIBROCIMENTO   FORNECIMENTO E INSTALAÇÃO. AF_06/2016","UN",1,null,null,0,"",null,null,null,"(sem código)","-",0,0]
[4,4,4,3,1,5,3,7,0,3,{"$error":"#N/A"},"","Nível 4","Nível 4","-","SINAPI",null,"ADESIVOS","-",2,null,null,0,"Referência: AGETOP - 81427","SIM","AGETOP",81427,"ADESIVOS","-",0,0]
["S",4,"S",0,1,5,3,7,0,0,0,"","Serviço","Serviço","-","AGETOP",81501,"ADESIVO PLASTICO - FRASCO 850 G","Un    ",null,null,null,0,"",null,null,null,"(sem código)","-",0,0]
["S",4,"S",0,1,5,3,7,0,0,0,"","Serviço","Serviço","-","AGETOP",81504,"SOLUCAO LIMPADORA 1000 CM3","Un    ",3,null,null,0,"",null,null,null,"(sem código)","-",0,0]
[3,3,3,5,1,5,4,0,0,9,5,"","Nível 3","Nível 3","-","SINAPI",null,"ESGOTO SANITÁRIO","-",3,null,null,0,"",null,null,null,"ESGOTO SANITÁRIO","-",0,0]
[4,4,4,2,1,5,4,1,0,4,2,"","Nível 4","Nível 4","-","SINAPI",null,"CORPO DE CAIXA SIFONADA / RALO","-",null,null,null,0,"",null,null,null,"CORPO DE CAIXA SIFONADA / RALO","-",0,0]
["S",4,"S",0,1,5,4,1,0,0,0,"","Serviço","Serviço","-","SINAPI",89778,"LUVA SIMPLES, PVC, SERIE NORMAL, ESGOTO PREDIAL, DN 100 MM, JUNTA ELÁSTICA, FORNECIDO E INSTALADO EM RAMAL DE DESCARGA OU RAMAL DE ESGOTO SANITÁRIO. AF_12/2014","UN",6,null,null,0,"Referência: AGETOP - 82004","SIM","AGETOP",82004,"(sem código)","-",0,0]
[{"$f":"CHOOSE(1+LOG(1+2*(ORÇAMENTO.Nivel=\"Nível 1\")+4*(ORÇAMENTO.Nivel=\"Nível 2\")+8*(ORÇAMENTO.Nivel=\"Nível 3\")+16*(ORÇAMENTO.Nivel=\"Nível 4\")+32*(ORÇAMENTO.Nivel=\"Serviço\"),2),0,1,2,3,4,\"S\")","v":4},{"$f":"IF(OR(C221=\"s\",C221=0),OFFSET(B221,-1,0),C221)","v":4},{"$f":"IF(OFFSET(C221,-1,0)=\"L\",1,IF(OFFSET(C221,-1,0)=1,2,IF(OR(A221=\"s\",A221=0),\"S\",IF(AND(OFFSET(C221,-1,0)=2,A221=4),3,IF(AND(OR(OFFSET(C221,-1,0)=\"s\",OFFSET(C221,-1,0)=0),A221<>\"s\",A221>OFFSET(B221,-1,0)),OFFSET(B221,-1,0),A221)))))","v":4},{"$f":"IF(OR(C221=\"S\",C221=0),0,IF(ISERROR(K221),J221,SMALL(J221:K221,1)))","v":2},{"$f":"IF($C221=1,OFFSET(E221,-1,0)+1,OFFSET(E221,-1,0))","v":1},{"$f":"IF($C221=1,0,IF($C221=2,OFFSET(F221,-1,0)+1,OFFSET(F221,-1,0)))","v":5},{"$f":"IF(AND($C221<=2,$C221<>0),0,IF($C221=3,OFFSET(G221,-1,0)+1,OFFSET(G221,-1,0)))","v":4},{"$f":"IF(AND($C221<=3,$C221<>0),0,IF($C221=4,OFFSET(H221,-1,0)+1,OFFSET(H221,-1,0)))","v":2},{"$f":"IF(AND($C221<=4,$C221<>0),0,IF(AND($C221=\"S\",$W221>0),OFFSET(I221,-1,0)+1,OFFSET(I221,-1,0)))","v":0},2,44,"","Nível 4","Nível 4","-","SINAPI",null,"TUBOS","-",null,null,null,0,"",null,null,null,{"$f":"IFERROR(IF(OR($C221=0,$C221=1,$C221=2,$C221=3,$C221=4),R221,VLOOKUP($AA221,INDIRECT($Z221),2,FALSE)),\"(sem código)\")","v":"TUBOS"},{"$f":"IFERROR(VLOOKUP(AA221,INDIRECT(Z221),3,FALSE()),\"-\")","v":"-"},{"$f":"IFERROR(VLOOKUP($AA221,INDIRECT($Z221),IF($W$10=\"DESONERADA\",4,7),FALSE()),0)","v":0},{"$f":"IFERROR(VLOOKUP($AA221,INDIRECT($Z221),IF($W$10=\"DESONERADA\",5,8),FALSE()),0)","v":0}]
["S",4,"S",0,1,5,4,2,0,0,0,"","Serviço","Serviço","-","SINAPI",89800,"TUBO PVC, SERIE NORMAL, ESGOTO PREDIAL, DN 100 MM, FORNECIDO E INSTALADO EM PRUMADA DE ESGOTO SANITÁRIO OU VENTILAÇÃO. AF_12/2014","M",48,null,null,0,"","NÃO","AGETOP",82304,"(sem código)","-",0,0]
[3,3,3,4,1,5,5,0,0,4,{"$error":"#N/A"},"","Nível 3","Nível 3","-","SINAPI",null,"OUTROS","-",null,null,null,0,"",null,null,null,"OUTROS","-",0,0]
["S",3,"S",0,1,5,5,0,0,0,0,"","Serviço","Serviço","-","AGETOP",80845,"CAIXA DE ALVENARIA 20x20x25 CM (REVESTIMENTO IMPERMEABILIZADO), FUNDO DE BRITA SEM TAMPA - PARA REGISTRO/TORNEIRA JARDIM","Un    ",1,null,null,0,"",null,null,null,"(sem código)","-",0,0]
["S",3,"S",0,1,5,5,0,0,0,0,"","Serviço","Serviço","-","AGETOP",80840,"TAMPA T-5 ARTICULADA 20X20","Un    ",1,null,null,0,"",null,null,null,"(sem código)","-",0,0]
["S",3,"S",0,1,5,5,0,0,0,0,"","Serviço","Serviço","-","AGETOP",81881,"RES.METALICO TAÇA AÇO PATINÁVEL-V=10M3-COL.SEC.H=6M+FUNDAÇÃO+LOGOTIPO","Un    ",1,null,null,0,"",null,null,null,"(sem código)","-",0,0]
[2,2,2,23,1,6,0,0,0,55,23,"","Nível 2","Nível 2","-",null,null,"INSTALAÇÕES ESPECIAIS","-",null,null,null,0,"",null,null,null,"INSTALAÇÕES ESPECIAIS","-",0,0]
["S",2,"S",0,1,6,0,0,0,0,0,"","Serviço","Serviço","-","AGETOP",91007,"CENTRAL DE GÁS PADRÃO AGETOP SEM INSTALAÇÕES (1+1 CILINDRO 45 KG)","Un    ",2,null,null,0,"",null,null,null,"(sem código)","-",0,0]
["S",2,"S",0,1,6,0,0,0,0,0,"","Serviço","Serviço","-","AGETOP",91023,"UNIÃO S/BRONZE PRETA 3/4\" NPT 300 LBS","Un    ",6,null,null,0,"",null,null,null,"(sem código)","-",0,0]
["S",2,"S",0,1,6,0,0,0,0,0,"","Serviço","Serviço","-","COMPOSIÇÃO","COMP 382_SEE","TE DE REDUCAO DE FERRO GALVANIZADO, COM ROSCA BSP, DE 3/4\" X 1/2\"","UN ",6,null,null,0,"",null,null,null,"(sem código)","-",0,0]
["S",2,"S",0,1,6,0,0,0,0,0,"","Serviço","Serviço","-","COMPOSIÇÃO","COMP 383_SEE","BUCHA DE REDUCAO DE FERRO GALVANIZADO, COM ROSCA BSP, DE 1/2\" X 1/4\"","UN ",4,null,null,0,"",null,null,null,"(sem código)","-",0,0]
["S",2,"S",0,1,6,0,0,0,0,0,"","Serviço","Serviço","-","AGETOP",91021,"LUVA GALVANIZADO DE REDUÇÃO 3/4\" X 1/2\" (GÁS)","Un    ",4,null,null,0,"",null,null,null,"(sem código)","-",{"$f":"IFERROR(VLOOKUP($AA232,INDIRECT($Z232),IF($W$10=\"DESONERADA\",4,7),FALSE()),0)","v":0},{"$f":"IFERROR(VLOOKUP($AA232,INDIRECT($Z232),IF($W$10=\"DESONERADA\",5,8),FALSE()),0)","v":0}]
["S",2,"S",0,1,6,0,0,0,0,0,"","Serviço","Serviço","-","SINAPI",92692,"NIPLE, EM FERRO GALVANIZADO, CONEXÃO ROSQUEADA, DN 15 (1/2\"), INSTALADO EM RAMAIS E SUB-RAMAIS DE GÁS - FORNECIMENTO E INSTALAÇÃO. AF_12/2015","UN",15,null,null,0,"",null,null,null,"(sem código)","-",0,0]
["S",2,"S",0,1,6,0,0,0,0,0,"","Serviço","Serviço","-","AGETOP",91031,"NIPLE DUPLO 300 PSI 3/4\"","Un    ",5,null,null,0,"",null,null,null,"(sem código)","-",0,0]
["S",2,"S",0,1,6,0,0,0,0,0,"","Serviço","Serviço","-","COMPOSIÇÃO","COMP 212_SEE","NIPLE DE REDUÇÃO 1/2\" X 1/4\" BSP","UN ",13,null,null,0,"",null,null,null,"(sem código)","-",0,0]
["S",2,"S",0,1,6,0,0,0,0,0,"","Serviço","Serviço","-","COMPOSIÇÃO","COMP 213_SEE","NIPLE DE REDUÇÃO 3/4\" X 1/2\" BSP","UN ",3,null,null,0,"",null,null,null,"(sem código)","-",0,0]
["S",2,"S",0,1,6,0,0,0,0,0,"","Serviço","Serviço","-","SINAPI",92688,"TUBO DE AÇO GALVANIZADO COM COSTURA, CLASSE MÉDIA, CONEXÃO ROSQUEADA, DN 20 (3/4\"), INSTALADO EM RAMAIS E SUB-RAMAIS DE GÁS - FORNECIMENTO E INSTALAÇÃO. AF_12/2015","M",1,null,null,0,"",null,null,null,"(sem código)","-",0,0]
["S",2,"S",0,1,6,0,0,0,0,0,"","Serviço","Serviço","-","SINAPI",92701,"JOELHO 90 GRAUS, EM FERRO GALVANIZADO, CONEXÃO ROSQUEADA, DN 20 (3/4\"), INSTALADO EM RAMAIS E SUB-RAMAIS DE GÁS - FORNECIMENTO E INSTALAÇÃO. AF_12/2015","UN",1,null,null,0,"",null,null,null,"(sem código)","-",{"$f":"IFERROR(VLOOKUP($AA238,INDIRECT($Z238),IF($W$10=\"DESONERADA\",4,7),FALSE()),0)","v":0},{"$f":"IFERROR(VLOOKUP($AA238,INDIRECT($Z238),IF($W$10=\"DESONERADA\",5,8),FALSE()),0)","v":0}]
["S",2,"S",0,1,6,0,0,0,0,0,"","Serviço","Serviço","-","COMPOSIÇÃO","COMP 237_SEE","FITA ANTICORROSIVA","M",1,null,null,0,"",null,null,null,"(sem código)","-",0,0]
["S",2,"S",0,1,6,0,0,0,0,0,"","Serviço","Serviço","-","AGETOP",91025,"VÁLVULA ESFERICA LATÃO 3/4\"","Un    ",1,null,null,0,"",null,null,null,"(sem código)","-",0,0]
["S",2,"S",0,1,6,0,0,0,0,0,"","Serviço","Serviço","-","COMPOSIÇÃO","COMP 542_SEE","VÁLVULA UGV 3/4\" (S) LATÃO","UN ",1,null,null,0,"",null,null,null,"(sem código)","-",0,0]
["S",2,"S",0,1,6,0,0,0,0,0,"","Serviço","Serviço","-","COMPOSIÇÃO","COMP 543_SEE","VÁLVULA UGV 1/2\" (S) LATÃO","UN ",null,null,null,0,"",null,null,null,"(sem código)","-",0,0]
["S",2,"S",0,1,6,0,0,0,0,0,"","Serviço","Serviço","-","AGETOP",91029,"VALVULA DE RETENÇÃO LATÃO 1/2\" X 7/16\" NPT","Un    ",1,null,null,0,"",null,null,null,"(sem código)","-",0,0]
["S",2,"S",0,1,6,0,0,0,0,0,"","Serviço","Serviço","-","COMPOSIÇÃO","COMP 211_SEE","REGULADOR DE 2º ESTÁGIO 5KG/H","UN ",2,null,null,0,"",null,null,null,"(sem código)","-",0,0]
["S",2,"S",0,1,6,0,0,0,0,0,"","Serviço","Serviço","-","COMPOSIÇÃO","COMP 210_SEE","REGULADOR DE 1º ESTÁGIO 60KG/H MODELO AP-40  COM MANÔMETRO","UN ",2,null,null,0,"",null,null,null,"(sem código)","-",0,0]
["S",2,"S",0,1,6,0,0,0,0,0,"","Serviço","Serviço","-",null,null,"(sem código)","-",4,null,null,0,"",null,null,null,"(sem código)","-",0,0]
["S",2,"S",0,1,6,0,0,0,0,0,"","Serviço","Serviço","-","AGETOP",85003,"EXTINTOR PO QUIMICO SECO (6 KG) - CAPACIDADE EXTINTORA 20 BC","Un    ",8,null,null,0,"",null,null,null,"(sem código)","-",0,0]
["S",2,"S",0,1,6,0,0,0,0,0,"","Serviço","Serviço","-","COMPOSIÇÃO","COMP 235_SEE","PLACA DE SINALIZAÇÃO EM PVC COD 01 - (300X300) PROIBIDO FUMAR","UN ",8,null,null,0,"",null,null,null,"(sem código)","-",0,0]
["S",2,"S",0,1,6,0,0,0,0,0,"","Serviço","Serviço","-","COMPOSIÇÃO","COMP 236_SEE","PLACA DE SINALIZAÇÃO EM PVC COD 06 - (300X300) PERIGO INFLAMÁVEL","UN ",2,null,null,0,"",null,null,null,"(sem código)","-",0,0]
[{"$f":"CHOOSE(1+LOG(1+2*(ORÇAMENTO.Nivel=\"Nível 1\")+4*(ORÇAMENTO.Nivel=\"Nível 2\")+8*(ORÇAMENTO.Nivel=\"Nível 3\")+16*(ORÇAMENTO.Nivel=\"Nível 4\")+32*(ORÇAMENTO.Nivel=\"Serviço\"),2),0,1,2,3,4,\"S\")","v":2},2,2,2,1,7,0,0,{"$f":"IF(AND($C250<=4,$C250<>0),0,IF(AND($C250=\"S\",$W250>0),OFFSET(I250,-1,0)+1,OFFSET(I250,-1,0)))","v":0},32,2,"","Nível 2","Nível 2","-","AGETOP",91045,"ALVENARIAS E DIVISÓRIAS","Un    ",null,null,null,0,"",null,null,null,"ALVENARIAS E DIVISÓRIAS","-",0,0]
["S",2,"S",0,{"$f":"IF($C251=1,OFFSET(E251,-1,0)+1,OFFSET(E251,-1,0))","v":1},{"$f":"IF($C251=1,0,IF($C251=2,OFFSET(F251,-1,0)+1,OFFSET(F251,-1,0)))","v":7},{"$f":"IF(AND($C251<=2,$C251<>0),0,IF($C251=3,OFFSET(G251,-1,0)+1,OFFSET(G251,-1,0)))","v":0},{"$f":"IF(AND($C251<=3,$C251<>0),0,IF($C251=4,OFFSET(H251,-1,0)+1,OFFSET(H251,-1,0)))","v":0},0,0,0,"","Serviço","Serviço","-","SINAPI",87489,"ALVENARIA DE VEDAÇÃO DE BLOCOS CERÂMICOS FURADOS NA VERTICAL DE 9X19X39CM (ESPESSURA 9CM) DE PAREDES COM ÁREA LÍQUIDA MAIOR OU IGUAL A 6M² COM VÃOS E ARGAMASSA DE ASSENTAMENTO COM PREPARO EM BETONEIRA. AF_06/2014","M2",4.58,null,null,0,"Referência: AGETOP - 100201","SIM","AGETOP",100201,"(sem código)",{"$f":"IFERROR(VLOOKUP(AA251,INDIRECT(Z251),3,FALSE()),\"-\")","v":"-"},{"$f":"IFERROR(VLOOKUP($AA251,INDIRECT($Z251),IF($W$10=\"DESONERADA\",4,7),FALSE()),0)","v":0},{"$f":"IFERROR(VLOOKUP($AA251,INDIRECT($Z251),IF($W$10=\"DESONERADA\",5,8),FALSE()),0)","v":0}]
[2,{"$f":"IF(OR(C252=\"s\",C252=0),OFFSET(B252,-1,0),C252)","v":2},{"$f":"IF(OFFSET(C252,-1,0)=\"L\",1,IF(OFFSET(C252,-1,0)=1,2,IF(OR(A252=\"s\",A252=0),\"S\",IF(AND(OFFSET(C252,-1,0)=2,A252=4),3,IF(AND(OR(OFFSET(C252,-1,0)=\"s\",OFFSET(C252,-1,0)=0),A252<>\"s\",A252>OFFSET(B252,-1,0)),OFFSET(B252,-1,0),A252)))))","v":2},{"$f":"IF(OR(C252=\"S\",C252=0),0,IF(ISERROR(K252),J252,SMALL(J252:K252,1)))","v":3},1,8,0,0,0,30,3,"","Nível 2","Nível 2","-",null,null,"COBERTURAS","-",null,null,null,0,"",null,null,null,"COBERTURAS","-",0,0]
[3,3,3,2,1,8,1,0,0,2,14,"","Nível 3","Nível 3","-",null,null,"CALHA E RUFO","-",null,null,null,0,"",null,null,null,{"$f":"IFERROR(IF(OR($C253=0,$C253=1,$C253=2,$C253=3,$C253=4),R253,VLOOKUP($AA253,INDIRECT($Z253),2,FALSE)),\"(sem código)\")","v":"CALHA E RUFO"},{"$f":"IFERROR(VLOOKUP(AA253,INDIRECT(Z253),3,FALSE()),\"-\")","v":"-"},{"$f":"IFERROR(VLOOKUP($AA253,INDIRECT($Z253),IF($W$10=\"DESONERADA\",4,7),FALSE()),0)","v":0},{"$f":"IFERROR(VLOOKUP($AA253,INDIRECT($Z253),IF($W$10=\"DESONERADA\",5,8),FALSE()),0)","v":0}]
["S",3,"S",0,1,8,1,0,0,0,0,"","Serviço","Serviço","-","SINAPI",94228,"CALHA EM CHAPA DE AÇO GALVANIZADO NÚMERO 24, DESENVOLVIMENTO DE 50 CM, INCLUSO TRANSPORTE VERTICAL. AF_06/2016","M",10,null,null,0,"Referência: AGETOP - 160601","SIM","AGETOP",160601,"(sem código)","-",0,0]
[2,2,2,4,1,9,0,0,0,27,4,"","Nível 2","Nível 2","-",null,null,"REVESTIMENTO DE PAREDE","-",null,null,null,0,"",null,null,null,"REVESTIMENTO DE PAREDE","-",0,0]
[{"$f":"CHOOSE(1+LOG(1+2*(ORÇAMENTO.Nivel=\"Nível 1\")+4*(ORÇAMENTO.Nivel=\"Nível 2\")+8*(ORÇAMENTO.Nivel=\"Nível 3\")+16*(ORÇAMENTO.Nivel=\"Nível 4\")+32*(ORÇAMENTO.Nivel=\"Serviço\"),2),0,1,2,3,4,\"S\")","v":"S"},2,"S",0,1,9,0,0,{"$f":"IF(AND($C256<=4,$C256<>0),0,IF(AND($C256=\"S\",$W256>0),OFFSET(I256,-1,0)+1,OFFSET(I256,-1,0)))","v":0},0,0,"","Serviço","Serviço","-","AGETOP",180316,"CORRIMÃO/TUBO INDUSTRIAL C-1","m     ",3,null,null,0,"",null,null,null,"(sem código)","-",0,0]
["S",2,"S",0,1,9,0,0,0,0,0,"","Serviço","Serviço","-","SINAPI",87904,"CHAPISCO APLICADO EM ALVENARIA (COM PRESENÇA DE VÃOS) E ESTRUTURAS DE CONCRETO DE FACHADA, COM COLHER DE PEDREIRO.  ARGAMASSA TRAÇO 1:3 COM PREPARO MANUAL. AF_06/2014","M2",1.5,null,null,0,"Referência: AGETOP - 200101","SIM","AGETOP",200101,"(sem código)","-",{"$f":"IFERROR(VLOOKUP($AA257,INDIRECT($Z257),IF($W$10=\"DESONERADA\",4,7),FALSE()),0)","v":0},{"$f":"IFERROR(VLOOKUP($AA257,INDIRECT($Z257),IF($W$10=\"DESONERADA\",5,8),FALSE()),0)","v":0}]
["S",2,"S",0,{"$f":"IF($C258=1,OFFSET(E258,-1,0)+1,OFFSET(E258,-1,0))","v":1},{"$f":"IF($C258=1,0,IF($C258=2,OFFSET(F258,-1,0)+1,OFFSET(F258,-1,0)))","v":9},{"$f":"IF(AND($C258<=2,$C258<>0),0,IF($C258=3,OFFSET(G258,-1,0)+1,OFFSET(G258,-1,0)))","v":0},{"$f":"IF(AND($C258<=3,$C258<>0),0,IF($C258=4,OFFSET(H258,-1,0)+1,OFFSET(H258,-1,0)))","v":0},0,0,0,"","Serviço","Serviço","-","SINAPI",87547,"MASSA ÚNICA, PARA RECEBIMENTO DE PINTURA, EM ARGAMASSA TRAÇO 1:2:8, PREPARO MECÂNICO COM BETONEIRA 400L, APLICADA MANUALMENTE EM FACES INTERNAS DE PAREDES, ESPESSURA DE 10MM, COM EXECUÇÃO DE TALISCAS. AF_06/2014","M2",1.5,null,null,0,"","NÃO","AGETOP",200500,"(sem código)","-",0,0]
[2,{"$f":"IF(OR(C259=\"s\",C259=0),OFFSET(B259,-1,0),C259)","v":2},{"$f":"IF(OFFSET(C259,-1,0)=\"L\",1,IF(OFFSET(C259,-1,0)=1,2,IF(OR(A259=\"s\",A259=0),\"S\",IF(AND(OFFSET(C259,-1,0)=2,A259=4),3,IF(AND(OR(OFFSET(C259,-1,0)=\"s\",OFFSET(C259,-1,0)=0),A259<>\"s\",A259>OFFSET(B259,-1,0)),OFFSET(B259,-1,0),A259)))))","v":2},{"$f":"IF(OR(C259=\"S\",C259=0),0,IF(ISERROR(K259),J259,SMALL(J259:K259,1)))","v":10},1,10,0,0,0,23,10,"","Nível 2","Nível 2","-",null,null,"REVESTIMENTO DE PISO","-",null,null,null,0,"",null,null,null,"REVESTIMENTO DE PISO","-",0,0]
[3,3,3,7,1,10,1,0,0,9,7,"","Nível 3","Nível 3","-",null,null,"CONCRETO","-",null,null,null,0,"",null,null,null,"CONCRETO","-",{"$f":"IFERROR(VLOOKUP($AA260,INDIRECT($Z260),IF($W$10=\"DESONERADA\",4,7),FALSE()),0)","v":0},{"$f":"IFERROR(VLOOKUP($AA260,INDIRECT($Z260),IF($W$10=\"DESONERADA\",5,8),FALSE()),0)","v":0}]
[4,4,4,2,1,10,1,1,0,6,2,"","Nível 4","Nível 4","-","SINAPI",null,"OUTROS","-",null,null,null,0,"",null,null,null,"OUTROS",{"$f":"IFERROR(VLOOKUP(AA261,INDIRECT(Z261),3,FALSE()),\"-\")","v":"-"},0,0]
["S",4,"S",0,1,10,1,1,0,0,0,"","Serviço","Serviço","-","SINAPI",94992,"EXECUÇÃO DE PASSEIO (CALÇADA) OU PISO DE CONCRETO COM CONCRETO MOLDADO IN LOCO, FEITO EM OBRA, ACABAMENTO CONVENCIONAL, ESPESSURA 6 CM, ARMADO. AF_07/2016","M2",548.33000000000004,null,null,0,"Referência: AGETOP - 220104","SIM","AGETOP",220104,"(sem código)","-",0,0]
[4,4,4,2,1,10,1,2,0,4,2,"","Nível 4","Nível 4","-","SINAPI",null,"CENTRAL DE GAS","-",null,null,null,0,"",null,null,null,"CENTRAL DE GAS",{"$f":"IFERROR(VLOOKUP(AA263,INDIRECT(Z263),3,FALSE()),\"-\")","v":"-"},0,0]
["S",4,"S",0,1,10,1,2,0,0,0,"","Serviço","Serviço","-","SINAPI",94992,"EXECUÇÃO DE PASSEIO (CALÇADA) OU PISO DE CONCRETO COM CONCRETO MOLDADO IN LOCO, FEITO EM OBRA, ACABAMENTO CONVENCIONAL, ESPESSURA 6 CM, ARMADO. AF_07/2016","M2",4.968,null,null,0,"",null,null,null,"(sem código)",{"$f":"IFERROR(VLOOKUP(AA264,INDIRECT(Z264),3,FALSE()),\"-\")","v":"-"},0,0]
[4,4,4,2,1,10,1,3,0,2,{"$error":"#N/A"},"","Nível 4","Nível 4","-",null,null,"RAMPA E ESCADA","-",null,null,null,0,"",null,null,null,"RAMPA E ESCADA",{"$f":"IFERROR(VLOOKUP(AA265,INDIRECT(Z265),3,FALSE()),\"-\")","v":"-"},0,0]
["S",4,"S",0,1,10,1,3,0,0,0,"","Serviço","Serviço","-","SINAPI",94992,"EXECUÇÃO DE PASSEIO (CALÇADA) OU PISO DE CONCRETO COM CONCRETO MOLDADO IN LOCO, FEITO EM OBRA, ACABAMENTO CONVENCIONAL, ESPESSURA 6 CM, ARMADO. AF_07/2016","M2",7.18,null,null,0,"",null,null,null,"(sem código)","-",0,0]
[3,3,3,2,1,10,2,0,0,2,41,"","Nível 3","Nível 3","-",null,null,"PODOTÁTIL","-",null,null,null,0,"",null,null,null,"PODOTÁTIL",{"$f":"IFERROR(VLOOKUP(AA267,INDIRECT(Z267),3,FALSE()),\"-\")","v":"-"},{"$f":"IFERROR(VLOOKUP($AA267,INDIRECT($Z267),IF($W$10=\"DESONERADA\",4,7),FALSE()),0)","v":0},{"$f":"IFERROR(VLOOKUP($AA267,INDIRECT($Z267),IF($W$10=\"DESONERADA\",5,8),FALSE()),0)","v":0}]
["S",3,"S",0,1,10,2,0,0,0,0,"","Serviço","Serviço","-","AGETOP",221126,"PISO DE LADRILHO HIDRÁULICO COLORIDO MODELO TÁTIL ( ALERTA OU DIRECIONAL) SEM LASTRO","m2    ",82.71,null,null,0,"",null,null,null,"(sem código)","-",0,0]
[2,2,2,6,1,11,0,0,0,13,6,"","Nível 2","Nível 2","-",null,null,"ADMINISTRAÇÃO","-",null,null,null,0,"",null,null,null,{"$f":"IFERROR(IF(OR($C269=0,$C269=1,$C269=2,$C269=3,$C269=4),R269,VLOOKUP($AA269,INDIRECT($Z269),2,FALSE)),\"(sem código)\")","v":"ADMINISTRAÇÃO"},{"$f":"IFERROR(VLOOKUP(AA269,INDIRECT(Z269),3,FALSE()),\"-\")","v":"-"},0,0]
[3,3,3,3,1,11,1,0,0,5,3,"","Nível 3","Nível 3","-",null,null,"MENSALISTAS","-",null,null,null,0,"",null,null,null,"MENSALISTAS","-",0,0]
["S",3,"S",0,1,11,1,0,0,0,0,"","Serviço","Serviço","-","SINAPI",90778,"ENGENHEIRO CIVIL DE OBRA PLENO COM ENCARGOS COMPLEMENTARES","H",20,null,null,0,"Referência: AGETOP - 250101","SIM","AGETOP",250101,"(sem código)","-",0,0]
["S",3,"S",0,1,11,1,0,0,0,0,"","Serviço","Serviço","-","SINAPI",90776,"ENCARREGADO GERAL COM ENCARGOS COMPLEMENTARES","H",440,null,null,0,"Referência: AGETOP - 250103","SIM","AGETOP",250103,"(sem código)","-",{"$f":"IFERROR(VLOOKUP($AA272,INDIRECT($Z272),IF($W$10=\"DESONERADA\",4,7),FALSE()),0)","v":0},{"$f":"IFERROR(VLOOKUP($AA272,INDIRECT($Z272),IF($W$10=\"DESONERADA\",5,8),FALSE()),0)","v":0}]
[3,3,3,2,1,11,2,0,0,2,35,"","Nível 3","Nível 3","-",null,null,"LAUDO DE ESTANQUEIDADE","-",null,null,null,0,"",null,null,null,"LAUDO DE ESTANQUEIDADE","-",{"$f":"IFERROR(VLOOKUP($AA273,INDIRECT($Z273),IF($W$10=\"DESONERADA\",4,7),FALSE()),0)","v":0},{"$f":"IFERROR(VLOOKUP($AA273,INDIRECT($Z273),IF($W$10=\"DESONERADA\",5,8),FALSE()),0)","v":0}]
["S",3,"S",0,1,11,2,0,0,0,0,"","Serviço","Serviço","-","SINAPI",90778,"ENGENHEIRO CIVIL DE OBRA PLENO COM ENCARGOS COMPLEMENTARES","H",16,null,null,0,"Referência: AGETOP - 250101","SIM","AGETOP",250101,"(sem código)","-",0,0]
[2,2,2,5,1,12,0,0,0,{"$f":"IF(OR($C275=\"S\",$C275=0),0,MATCH(0,OFFSET($D275,1,$C275,ROW($C$648)-ROW($C275)),0))","v":7},{"$f":"IF(OR($C275=\"S\",$C275=0),0,MATCH(OFFSET($D275,0,$C275)+1,OFFSET($D275,1,$C275,ROW($C$648)-ROW($C275)),0))","v":5},"","Nível 2","Nível 2","-",null,null,"PINTURA","-",null,null,null,0,"",null,null,null,"PINTURA","-",0,0]
["S",2,"S",0,1,12,0,0,0,0,0,"","Serviço","Serviço","-","SINAPI",88497,"APLICAÇÃO E LIXAMENTO DE MASSA LÁTEX EM PAREDES, DUAS DEMÃOS. AF_06/2014","M2",5.76,null,null,0,"Referência: AGETOP - 261300","SIM","AGETOP",261300,"(sem código)","-",0,0]
[{"$f":"CHOOSE(1+LOG(1+2*(ORÇAMENTO.Nivel=\"Nível 1\")+4*(ORÇAMENTO.Nivel=\"Nível 2\")+8*(ORÇAMENTO.Nivel=\"Nível 3\")+16*(ORÇAMENTO.Nivel=\"Nível 4\")+32*(ORÇAMENTO.Nivel=\"Serviço\"),2),0,1,2,3,4,\"S\")","v":"S"},{"$f":"IF(OR(C277=\"s\",C277=0),OFFSET(B277,-1,0),C277)","v":2},{"$f":"IF(OFFSET(C277,-1,0)=\"L\",1,IF(OFFSET(C277,-1,0)=1,2,IF(OR(A277=\"s\",A277=0),\"S\",IF(AND(OFFSET(C277,-1,0)=2,A277=4),3,IF(AND(OR(OFFSET(C277,-1,0)=\"s\",OFFSET(C277,-1,0)=0),A277<>\"s\",A277>OFFSET(B277,-1,0)),OFFSET(B277,-1,0),A277)))))","v":"S"},{"$f":"IF(OR(C277=\"S\",C277=0),0,IF(ISERROR(K277),J277,SMALL(J277:K277,1)))","v":0},{"$f":"IF($C277=1,OFFSET(E277,-1,0)+1,OFFSET(E277,-1,0))","v":1},{"$f":"IF($C277=1,0,IF($C277=2,OFFSET(F277,-1,0)+1,OFFSET(F277,-1,0)))","v":12},{"$f":"IF(AND($C277<=2,$C277<>0),0,IF($C277=3,OFFSET(G277,-1,0)+1,OFFSET(G277,-1,0)))","v":0},{"$f":"IF(AND($C277<=3,$C277<>0),0,IF($C277=4,OFFSET(H277,-1,0)+1,OFFSET(H277,-1,0)))","v":0},{"$f":"IF(AND($C277<=4,$C277<>0),0,IF(AND($C277=\"S\",$W277>0),OFFSET(I277,-1,0)+1,OFFSET(I277,-1,0)))","v":0},0,0,"","Serviço","Serviço","-","SINAPI","73924/3","PINTURA ESMALTE FOSCO, DUAS DEMAOS, SOBRE SUPERFICIE METALICA","M2",26.4,null,null,0,"Referência: AGETOP - 261503","SIM","AGETOP",261503,"(sem código)","-",0,0]
["S",2,"S",0,1,12,0,0,0,0,0,"","Serviço","Serviço","-","SINAPI",88489,"APLICAÇÃO MANUAL DE PINTURA COM TINTA LÁTEX ACRÍLICA EM PAREDES, DUAS DEMÃOS. AF_06/2014","M2",1253.96,null,null,0,"Referência: AGETOP - 261001","SIM","AGETOP",261001,"(sem código)","-",{"$f":"IFERROR(VLOOKUP($AA278,INDIRECT($Z278),IF($W$10=\"DESONERADA\",4,7),FALSE()),0)","v":0},{"$f":"IFERROR(VLOOKUP($AA278,INDIRECT($Z278),IF($W$10=\"DESONERADA\",5,8),FALSE()),0)","v":0}]
["S",2,"S",0,1,12,0,0,0,0,0,"","Serviço","Serviço","-","AGETOP",261620,"LETREIRO MÉDIO A GRANDE PORTE EM PAREDE FEITO A PINCEL","m2    ",7.2,null,null,0,"",null,null,null,"(sem código)","-",0,0]
[2,2,2,2,1,13,0,0,0,2,160,"","Nível 2","Nível 2","-",null,null,"DIVERSOS","-",null,null,null,0,"",null,null,null,"DIVERSOS","-",0,0]
["S",2,"S",0,1,13,0,0,0,0,0,"","Serviço","Serviço","-","AGETOP",270501,"LIMPEZA FINAL DE OBRA - (OBRAS CIVIS)","m2    ",2081.9900000000002,null,null,0,"",null,null,null,"(sem código)","-",0,0]
[1,1,1,185,2,0,0,0,0,366,185,"F","Nível 1","Nível 1","2.","SINAPI",null,"BLOCO PADRAO COZINHA / REFEITÓRIO","-",null,null,null,0,"",null,null,null,"BLOCO PADRAO COZINHA / REFEITÓRIO","-",{"$f":"IFERROR(VLOOKUP($AA282,INDIRECT($Z282),IF($W$10=\"DESONERADA\",4,7),FALSE()),0)","v":0},{"$f":"IFERROR(VLOOKUP($AA282,INDIRECT($Z282),IF($W$10=\"DESONERADA\",5,8),FALSE()),0)","v":0}]
[2,2,2,2,2,1,0,0,0,184,2,"","Nível 2","Nível 2","-","SINAPI",null,"SERVIÇOS PRELIMINARES","-",null,null,null,0,"",null,null,null,"SERVIÇOS PRELIMINARES","-",0,0]
["S",2,"S",0,2,1,0,0,0,0,0,"","Serviço","Serviço","-","AGETOP",20701,"LOCAÇÃO DA OBRA, EXECUÇÃO DE GABARITO SEM REAPROVEITAMENTO, INCLUSO PINTURA (FACE INTERNA DO RIPÃO 15CM) E PIQUETE COM TESTEMUNHA","m2    ",139.75,null,null,0,"",null,null,null,"(sem código)","-",0,0]
[2,2,2,3,2,2,0,0,0,182,3,"","Nível 2","Nível 2","-","SINAPI",null,"TRANSPORTES","-",null,null,null,0,"",null,null,null,"TRANSPORTES","-",0,0]
["S",2,"S",0,2,2,0,0,0,0,0,"","Serviço","Serviço","-","SINAPI",72900,"TRANSPORTE DE ENTULHO COM CAMINHAO BASCULANTE 6 M3, RODOVIA PAVIMENTADA, DMT 0,5 A 1,0 KM","M3",10,null,null,0,"","NÃO","AGETOP",30101,{"$f":"IFERROR(IF(OR($C286=0,$C286=1,$C286=2,$C286=3,$C286=4),R286,VLOOKUP($AA286,INDIRECT($Z286),2,FALSE)),\"(sem código)\")","v":"(sem código)"},{"$f":"IFERROR(VLOOKUP(AA286,INDIRECT(Z286),3,FALSE()),\"-\")","v":"-"},0,0]
["S",2,"S",0,2,2,0,0,0,0,0,"","Serviço","Serviço","-","SINAPI",72897,"CARGA MANUAL DE ENTULHO EM CAMINHAO BASCULANTE 6 M3","M3",10,null,null,0,"","NÃO","AGETOP",30101,"(sem código)","-",0,0]
[2,2,2,2,2,3,0,0,0,179,2,"","Nível 2","Nível 2","-","SINAPI",null,"SERVIÇO EM TERRA","-",null,null,null,0,"",null,null,null,"SERVIÇO EM TERRA","-",0,0]
["S",2,"S",0,2,3,0,0,0,0,0,"","Serviço","Serviço","-","AGETOP",41002,"APILOAMENTO","m2    ",139.75,null,null,0,"",null,null,null,"(sem código)","-",0,0]
[2,2,2,20,2,4,0,0,0,177,20,"","Nível 2","Nível 2","-","SINAPI",null,"FUNDAÇÕES E SONDAGENS","-",null,null,null,0,"",null,null,null,"FUNDAÇÕES E SONDAGENS","-",0,0]
[3,3,3,9,2,4,1,0,0,19,9,"","Nível 3","Nível 3","-","SINAPI",null,"ESTACAS E BLOCOS","-",null,null,null,0,"",null,null,null,"ESTACAS E BLOCOS","-",0,0]
["S",3,"S",0,2,4,1,0,0,0,0,"","Serviço","Serviço","-","SINAPI",98230,"ESTACA BROCA DE CONCRETO, DIÂMETRO DE 30 CM, PROFUNDIDADE DE ATÉ 3 M, ESCAVAÇÃO MANUAL COM TRADO CONCHA, NÃO ARMADA. AF_03/2018","M",101.5,null,null,0,"Referência: AGETOP - 50302","SIM","AGETOP",50302,"(sem código)","-",0,0]
["S",3,"S",0,2,4,1,0,0,0,0,"","Serviço","Serviço","-","SINAPI",96522,"ESCAVAÇÃO MANUAL PARA BLOCO DE COROAMENTO OU SAPATA, SEM PREVISÃO DE FÔRMA. AF_06/2017","M3",5.19,null,null,0,"Referência: AGETOP - 50901","SIM","AGETOP",50901,"(sem código)","-",0,0]
["S",3,"S",0,2,4,1,0,0,0,0,"","Serviço","Serviço","-","SINAPI",94963,"CONCRETO FCK = 15MPA, TRAÇO 1:3,4:3,5 (CIMENTO/ AREIA MÉDIA/ BRITA 1)  - PREPARO MECÂNICO COM BETONEIRA 400 L. AF_07/2016","M3",3.4,null,null,0,"","NÃO","AGETOP",51015,"(sem código)","-",0,0]
["S",3,"S",0,2,4,1,0,0,0,0,"","Serviço","Serviço","-","SINAPI","74157/4","LANCAMENTO/APLICACAO MANUAL DE CONCRETO EM FUNDACOES","M3",3.4,null,null,0,"Referência: AGETOP - 51055","SIM","AGETOP",51055,"(sem código)","-",0,0]
["S",3,"S",0,2,4,1,0,0,0,0,"","Serviço","Serviço","-","AGETOP",60191,"FORMA DE TABUA CINTA BALDRAME U=8 VEZES","m2    ",23.7,null,null,0,"",null,null,null,"(sem código)","-",0,0]
["S",3,"S",0,2,4,1,0,0,0,0,"","Serviço","Serviço","-","SINAPI",96543,"ARMAÇÃO DE BLOCO, VIGA BALDRAME E SAPATA UTILIZANDO AÇO CA-60 DE 5 MM - MONTAGEM. AF_06/2017","KG",98.2,null,null,0,"Referência: AGETOP - 52014","SIM","AGETOP",52014,"(sem código)","-",0,0]
["S",3,"S",0,2,4,1,0,0,0,0,"","Serviço","Serviço","-","SINAPI",96546,"ARMAÇÃO DE BLOCO, VIGA BALDRAME OU SAPATA UTILIZANDO AÇO CA-50 DE 10 MM - MONTAGEM. AF_06/2017","KG",226.54,null,null,0,"Referência: AGETOP - 52005","SIM","AGETOP",52005,"(sem código)","-",0,0]
["S",3,"S",0,2,4,1,0,0,0,0,"","Serviço","Serviço","-","SINAPI",96547,"ARMAÇÃO DE BLOCO, VIGA BALDRAME OU SAPATA UTILIZANDO AÇO CA-50 DE 12,5 MM - MONTAGEM. AF_06/2017","KG",240,null,null,0,"Referência: AGETOP - 52006","SIM","AGETOP",52006,"(sem código)","-",0,0]
[3,3,3,8,2,4,2,0,0,10,8,"","Nível 3","Nível 3","-","SINAPI",null,"VIGAS BALDRAMES","-",null,null,null,0,"",null,null,null,"VIGAS BALDRAMES","-",0,0]
["S",3,"S",0,2,4,2,0,0,0,0,"","Serviço","Serviço","-","AGETOP",60191,"FORMA DE TABUA CINTA BALDRAME U=8 VEZES","m2    ",41.5,null,null,0,"",null,null,null,"(sem código)","-",0,0]
[{"$f":"CHOOSE(1+LOG(1+2*(ORÇAMENTO.Nivel=\"Nível 1\")+4*(ORÇAMENTO.Nivel=\"Nível 2\")+8*(ORÇAMENTO.Nivel=\"Nível 3\")+16*(ORÇAMENTO.Nivel=\"Nível 4\")+32*(ORÇAMENTO.Nivel=\"Serviço\"),2),0,1,2,3,4,\"S\")","v":"S"},3,"S",0,2,4,2,0,{"$f":"IF(AND($C302<=4,$C302<>0),0,IF(AND($C302=\"S\",$W302>0),OFFSET(I302,-1,0)+1,OFFSET(I302,-1,0)))","v":0},0,0,"","Serviço","Serviço","-","SINAPI",94964,"CONCRETO FCK = 20MPA, TRAÇO 1:2,7:3 (CIMENTO/ AREIA MÉDIA/ BRITA 1)  - PREPARO MECÂNICO COM BETONEIRA 400 L. AF_07/2016","M3",2.4,null,null,0,"","NÃO","AGETOP",51017,"(sem código)","-",0,0]
["S",3,"S",0,2,4,2,0,0,0,0,"","Serviço","Serviço","-","SINAPI","74157/4","LANCAMENTO/APLICACAO MANUAL DE CONCRETO EM FUNDACOES","M3",2.4,null,null,0,"Referência: AGETOP - 51055","SIM","AGETOP",51055,"(sem código)","-",0,0]
["S",3,"S",0,2,4,2,0,0,0,0,"","Serviço","Serviço","-","SINAPI",96544,"ARMAÇÃO DE BLOCO, VIGA BALDRAME OU SAPATA UTILIZANDO AÇO CA-50 DE 6,3 MM - MONTAGEM. AF_06/2017","KG",47,null,null,0,"Referência: AGETOP - 52003","SIM","AGETOP",52003,"(sem código)","-",0,0]
["S",3,"S",0,{"$f":"IF($C305=1,OFFSET(E305,-1,0)+1,OFFSET(E305,-1,0))","v":2},{"$f":"IF($C305=1,0,IF($C305=2,OFFSET(F305,-1,0)+1,OFFSET(F305,-1,0)))","v":4},{"$f":"IF(AND($C305<=2,$C305<>0),0,IF($C305=3,OFFSET(G305,-1,0)+1,OFFSET(G305,-1,0)))","v":2},{"$f":"IF(AND($C305<=3,$C305<>0),0,IF($C305=4,OFFSET(H305,-1,0)+1,OFFSET(H305,-1,0)))","v":0},0,0,0,"","Serviço","Serviço","-","SINAPI",96545,"ARMAÇÃO DE BLOCO, VIGA BALDRAME OU SAPATA UTILIZANDO AÇO CA-50 DE 8 MM - MONTAGEM. AF_06/2017","KG",49,null,null,0,"Referência: AGETOP - 52004","SIM","AGETOP",52004,"(sem código)","-",0,0]
["S",3,"S",0,2,4,2,0,0,0,0,"","Serviço","Serviço","-","SINAPI",96546,"ARMAÇÃO DE BLOCO, VIGA BALDRAME OU SAPATA UTILIZANDO AÇO CA-50 DE 10 MM - MONTAGEM. AF_06/2017","KG",38,null,null,0,"Referência: AGETOP - 52005","SIM","AGETOP",52005,"(sem código)","-",0,0]
["S",3,"S",0,2,4,2,0,0,0,0,"","Serviço","Serviço","-","SINAPI",96543,"ARMAÇÃO DE BLOCO, VIGA BALDRAME E SAPATA UTILIZANDO AÇO CA-60 DE 5 MM - MONTAGEM. AF_06/2017","KG",72,null,null,0,"Referência: AGETOP - 52014","SIM","AGETOP",52014,"(sem código)","-",0,0]
[3,3,3,2,2,4,3,0,0,2,{"$error":"#N/A"},"","Nível 3","Nível 3","-","SINAPI",null,"OUTROS","-",null,null,null,0,"",null,null,null,"OUTROS","-",0,0]
["S",3,"S",0,2,4,3,0,0,0,0,"","Serviço","Serviço","-","AGETOP",50101,"SONDAGENS P/INTERIOR - (OBRAS CIVIS)","m     ",28,null,null,0,"",null,null,null,"(sem código)","-",0,0]
[2,2,2,20,2,5,0,0,0,157,20,"","Nível 2","Nível 2","-","SINAPI",null,"ESTRUTURA","-",null,null,null,0,"",null,null,null,"ESTRUTURA","-",0,0]
[3,{"$f":"IF(OR(C311=\"s\",C311=0),OFFSET(B311,-1,0),C311)","v":3},{"$f":"IF(OFFSET(C311,-1,0)=\"L\",1,IF(OFFSET(C311,-1,0)=1,2,IF(OR(A311=\"s\",A311=0),\"S\",IF(AND(OFFSET(C311,-1,0)=2,A311=4),3,IF(AND(OR(OFFSET(C311,-1,0)=\"s\",OFFSET(C311,-1,0)=0),A311<>\"s\",A311>OFFSET(B311,-1,0)),OFFSET(B311,-1,0),A311)))))","v":3},{"$f":"IF(OR(C311=\"S\",C311=0),0,IF(ISERROR(K311),J311,SMALL(J311:K311,1)))","v":8},2,5,1,0,0,19,8,"","Nível 3","Nível 3","-","SINAPI",null,"PILARES","-",null,null,null,0,"",null,null,null,"PILARES","-",0,0]
["S",3,"S",0,2,5,1,0,0,0,0,"","Serviço","Serviço","-","SINAPI",92426,"MONTAGEM E DESMONTAGEM DE FÔRMA DE PILARES RETANGULARES E ESTRUTURAS SIMILARES COM ÁREA MÉDIA DAS SEÇÕES MENOR OU IGUAL A 0,25 M², PÉ-DIREITO SIMPLES, EM CHAPA DE MADEIRA COMPENSADA RESINADA, 8 UTILIZAÇÕES. AF_12/2015","M2",59.6,null,null,0,"","NÃO","AGETOP",60204,"(sem código)","-",0,0]
["S",3,"S",0,2,5,1,0,0,0,0,"","Serviço","Serviço","-","SINAPI",94964,"CONCRETO FCK = 20MPA, TRAÇO 1:2,7:3 (CIMENTO/ AREIA MÉDIA/ BRITA 1)  - PREPARO MECÂNICO COM BETONEIRA 400 L. AF_07/2016","M3",2.5,null,null,0,"","NÃO","AGETOP",51017,"(sem código)","-",0,0]
["S",3,"S",0,2,5,1,0,0,0,0,"","Serviço","Serviço","-","SINAPI",92873,"LANÇAMENTO COM USO DE BALDES, ADENSAMENTO E ACABAMENTO DE CONCRETO EM ESTRUTURAS. AF_12/2015","M3",2.5,null,null,0,"Referência: AGETOP - 51055","SIM","AGETOP",51055,"(sem código)","-",0,0]
["S",3,"S",0,2,5,1,0,0,0,0,"","Serviço","Serviço","-","SINAPI",92776,"ARMAÇÃO DE PILAR OU VIGA DE UMA ESTRUTURA CONVENCIONAL DE CONCRETO ARMADO EM UMA EDIFICAÇÃO TÉRREA OU SOBRADO UTILIZANDO AÇO CA-50 DE 6,3 MM - MONTAGEM. AF_12/2015","KG",42,null,null,0,"Referência: AGETOP - 60303","SIM","AGETOP",60303,"(sem código)","-",0,0]
["S",3,"S",0,2,5,1,0,0,0,0,"","Serviço","Serviço","-","SINAPI",92777,"ARMAÇÃO DE PILAR OU VIGA DE UMA ESTRUTURA CONVENCIONAL DE CONCRETO ARMADO EM UMA EDIFICAÇÃO TÉRREA OU SOBRADO UTILIZANDO AÇO CA-50 DE 8,0 MM - MONTAGEM. AF_12/2015","KG",64,null,null,0,"Referência: AGETOP - 60304","SIM","AGETOP",60304,"(sem código)","-",0,0]
["S",3,"S",0,2,5,1,0,0,0,0,"","Serviço","Serviço","-","SINAPI",92778,"ARMAÇÃO DE PILAR OU VIGA DE UMA ESTRUTURA CONVENCIONAL DE CONCRETO ARMADO EM UMA EDIFICAÇÃO TÉRREA OU SOBRADO UTILIZANDO AÇO CA-50 DE 10,0 MM - MONTAGEM. AF_12/2015","KG",165.46,null,null,0,"Referência: AGETOP - 60305","SIM","AGETOP",60305,"(sem código)","-",0,0]
["S",3,"S",0,2,5,1,0,0,0,0,"","Serviço","Serviço","-","SINAPI",92775,"ARMAÇÃO DE PILAR OU VIGA DE UMA ESTRUTURA CONVENCIONAL DE CONCRETO ARMADO EM UMA EDIFICAÇÃO TÉRREA OU SOBRADO UTILIZANDO AÇO CA-60 DE 5,0 MM - MONTAGEM. AF_12/2015","KG",22.8,null,null,0,"Referência: AGETOP - 60314","SIM","AGETOP",60314,"(sem código)","-",0,0]
[3,3,3,9,2,5,2,0,0,11,9,"","Nível 3","Nível 3","-","SINAPI",null,"VIGA DE COBERTURA","-",null,null,null,0,"",null,null,null,"VIGA DE COBERTURA","-",0,0]
["S",3,"S",0,2,5,2,0,0,0,0,"","Serviço","Serviço","-","SINAPI",92464,"MONTAGEM E DESMONTAGEM DE FÔRMA DE VIGA, ESCORAMENTO METÁLICO, PÉ-DIREITO SIMPLES, EM CHAPA DE MADEIRA RESINADA, 8 UTILIZAÇÕES. AF_12/2015","M2",40.9,null,null,0,"Referência: AGETOP - 60204","SIM","AGETOP",60204,"(sem código)","-",0,0]
["S",3,"S",0,2,5,2,0,0,0,0,"","Serviço","Serviço","-","SINAPI",94964,"CONCRETO FCK = 20MPA, TRAÇO 1:2,7:3 (CIMENTO/ AREIA MÉDIA/ BRITA 1)  - PREPARO MECÂNICO COM BETONEIRA 400 L. AF_07/2016","M3",2.4,null,null,0,"","NÃO","AGETOP",51017,"(sem código)","-",0,0]
["S",3,"S",0,2,5,2,0,0,0,0,"","Serviço","Serviço","-","SINAPI",92873,"LANÇAMENTO COM USO DE BALDES, ADENSAMENTO E ACABAMENTO DE CONCRETO EM ESTRUTURAS. AF_12/2015","M3",2.4,null,null,0,"Referência: AGETOP - 51055","SIM","AGETOP",51055,"(sem código)","-",0,0]
["S",3,"S",0,2,5,2,0,0,0,0,"","Serviço","Serviço","-","SINAPI",92776,"ARMAÇÃO DE PILAR OU VIGA DE UMA ESTRUTURA CONVENCIONAL DE CONCRETO ARMADO EM UMA EDIFICAÇÃO TÉRREA OU SOBRADO UTILIZANDO AÇO CA-50 DE 6,3 MM - MONTAGEM. AF_12/2015","KG",18,null,null,0,"Referência: AGETOP - 60303","SIM","AGETOP",60303,"(sem código)","-",0,0]
["S",3,"S",0,2,5,2,0,0,0,0,"","Serviço","Serviço","-","SINAPI",92777,"ARMAÇÃO DE PILAR OU VIGA DE UMA ESTRUTURA CONVENCIONAL DE CONCRETO ARMADO EM UMA EDIFICAÇÃO TÉRREA OU SOBRADO UTILIZANDO AÇO CA-50 DE 8,0 MM - MONTAGEM. AF_12/2015","KG",35,null,null,0,"Referência: AGETOP - 60304","SIM","AGETOP",60304,"(sem código)","-",0,0]
["S",3,"S",0,2,5,2,0,0,0,0,"","Serviço","Serviço","-","SINAPI",92778,"ARMAÇÃO DE PILAR OU VIGA DE UMA ESTRUTURA CONVENCIONAL DE CONCRETO ARMADO EM UMA EDIFICAÇÃO TÉRREA OU SOBRADO UTILIZANDO AÇO CA-50 DE 10,0 MM - MONTAGEM. AF_12/2015","KG",89,null,null,0,"Referência: AGETOP - 60305","SIM","AGETOP",60305,"(sem código)","-",0,0]
["S",3,"S",0,2,5,2,0,0,0,0,"","Serviço","Serviço","-","SINAPI",92779,"ARMAÇÃO DE PILAR OU VIGA DE UMA ESTRUTURA CONVENCIONAL DE CONCRETO ARMADO EM UMA EDIFICAÇÃO TÉRREA OU SOBRADO UTILIZANDO AÇO CA-50 DE 12,5 MM - MONTAGEM. AF_12/2015","KG",24,null,null,0,"Referência: AGETOP - 60306","SIM","AGETOP",60306,"(sem código)","-",0,0]
["S",3,"S",0,2,5,2,0,0,0,0,"","Serviço","Serviço","-","SINAPI",92775,"ARMAÇÃO DE PILAR OU VIGA DE UMA ESTRUTURA CONVENCIONAL DE CONCRETO ARMADO EM UMA EDIFICAÇÃO TÉRREA OU SOBRADO UTILIZANDO AÇO CA-60 DE 5,0 MM - MONTAGEM. AF_12/2015","KG",57,null,null,0,"Referência: AGETOP - 60314","SIM","AGETOP",60314,"(sem código)","-",0,0]
[3,3,3,2,2,5,3,0,0,2,{"$error":"#N/A"},"","Nível 3","Nível 3","-","SINAPI",null,"LAJE","-",null,null,null,0,"",null,null,null,"LAJE","-",0,0]
["S",3,"S",0,2,5,3,0,0,0,0,"","Serviço","Serviço","-","SINAPI","74202/1","LAJE PRE-MOLDADA P/FORRO, SOBRECARGA 100KG/M2, VAOS ATE 3,50M/E=8CM, C/LAJOTAS E CAP.C/CONC FCK=20MPA, 3CM, INTER-EIXO 38CM, C/ESCORAMENTO (REAPR.3X) E FERRAGEM NEGATIVA","M2",40.75,null,null,0,"","NÃO","AGETOP",61101,"(sem código)","-",0,0]
[2,2,2,28,2,6,0,0,0,137,28,"","Nível 2","Nível 2","-","SINAPI",null,"INSTALAÇÕES ELÉTRICAS","-",null,null,null,0,"",null,null,null,"INSTALAÇÕES ELÉTRICAS","-",0,0]
["S",2,"S",0,2,6,0,0,0,0,0,"","Serviço","Serviço","-","AGETOP",70421,"BUCHA E ARRUELA METALICA DIAM. 3/4\"","PR    ",3,null,null,0,"",null,null,null,"(sem código)","-",0,0]
["S",2,"S",0,2,6,0,0,0,0,0,"","Serviço","Serviço","-","SINAPI",92868,"CAIXA RETANGULAR 4\" X 2\" MÉDIA (1,30 M DO PISO), METÁLICA, INSTALADA EM PAREDE - FORNECIMENTO E INSTALAÇÃO. AF_12/2015","UN",26,null,null,0,"Referência: AGETOP - 70691","SIM","AGETOP",70691,"(sem código)","-",0,0]
["S",2,"S",0,2,6,0,0,0,0,0,"","Serviço","Serviço","-","SINAPI",92866,"CAIXA SEXTAVADA 3\" X 3\", METÁLICA, INSTALADA EM LAJE - FORNECIMENTO E INSTALAÇÃO. AF_12/2015","UN",10,null,null,0,"Referência: AGETOP - 70680","SIM","AGETOP",70680,"(sem código)","-",0,0]
["S",2,"S",0,2,6,0,0,0,0,0,"","Serviço","Serviço","-","SINAPI",91902,"CURVA 90 GRAUS PARA ELETRODUTO, PVC, ROSCÁVEL, DN 25 MM (3/4\"), PARA CIRCUITOS TERMINAIS, INSTALADA EM LAJE - FORNECIMENTO E INSTALAÇÃO. AF_12/2015","UN",6,null,null,0,"Referência: AGETOP - 71141","SIM","AGETOP",71141,"(sem código)","-",0,0]
["S",2,"S",0,2,6,0,0,0,0,0,"","Serviço","Serviço","-","SINAPI",97585,"LUMINÁRIA TIPO CALHA, DE SOBREPOR, COM 2 LÂMPADAS TUBULARES DE 18 W - FORNECIMENTO E INSTALAÇÃO. AF_11/2017","UN",2,null,null,0,"",null,null,null,"(sem código)","-",0,0]
["S",2,"S",0,2,6,0,0,0,0,0,"","Serviço","Serviço","-","SINAPI",97586,"LUMINÁRIA TIPO CALHA, DE SOBREPOR, COM 2 LÂMPADAS TUBULARES DE 36 W - FORNECIMENTO E INSTALAÇÃO. AF_11/2017","UN",14,null,null,0,"",null,null,null,"(sem código)","-",0,0]
["S",2,"S",0,2,6,0,0,0,0,0,"","Serviço","Serviço","-","SINAPI",97584,"LUMINÁRIA TIPO CALHA, DE SOBREPOR, COM 1 LÂMPADA TUBULAR DE 36 W - FORNECIMENTO E INSTALAÇÃO. AF_11/2017","UN",2,null,null,0,"",null,null,null,"(sem código)","-",0,0]
["S",2,"S",0,2,6,0,0,0,0,0,"","Serviço","Serviço","-","SINAPI",91884,"LUVA PARA ELETRODUTO, PVC, ROSCÁVEL, DN 25 MM (3/4\"), PARA CIRCUITOS TERMINAIS, INSTALADA EM PAREDE - FORNECIMENTO E INSTALAÇÃO. AF_12/2015","UN",3,null,null,0,"Referência: AGETOP - 71741","SIM","AGETOP",71741,"(sem código)","-",0,0]
["S",2,"S",0,2,6,0,0,0,{"$f":"IF(OR($C339=\"S\",$C339=0),0,MATCH(0,OFFSET($D339,1,$C339,ROW($C$648)-ROW($C339)),0))","v":0},{"$f":"IF(OR($C339=\"S\",$C339=0),0,MATCH(OFFSET($D339,0,$C339)+1,OFFSET($D339,1,$C339,ROW($C$648)-ROW($C339)),0))","v":0},"","Serviço","Serviço","-","SINAPI",91927,"CABO DE COBRE FLEXÍVEL ISOLADO, 2,5 MM², ANTI-CHAMA 0,6/1,0 KV, PARA CIRCUITOS TERMINAIS - FORNECIMENTO E INSTALAÇÃO. AF_12/2015","M",723.31000000000006,null,null,0,"Referência: AGETOP - 70581","SIM","AGETOP",70581,"(sem código)","-",0,0]
["S",2,"S",0,2,6,0,0,0,0,0,"","Serviço","Serviço","-","SINAPI",91931,"CABO DE COBRE FLEXÍVEL ISOLADO, 6 MM², ANTI-CHAMA 0,6/1,0 KV, PARA CIRCUITOS TERMINAIS - FORNECIMENTO E INSTALAÇÃO. AF_12/2015","M",60.8,null,null,0,"Referência: AGETOP - 70583","SIM","AGETOP",70583,"(sem código)","-",0,0]
["S",2,"S",0,2,6,0,0,0,0,0,"","Serviço","Serviço","-","SINAPI",93654,"DISJUNTOR MONOPOLAR TIPO DIN, CORRENTE NOMINAL DE 16A - FORNECIMENTO E INSTALAÇÃO. AF_04/2016","UN",11,null,null,0,"","NÃO","AGETOP",71171,"(sem código)","-",0,0]
["S",2,"S",0,2,6,0,0,0,0,0,"","Serviço","Serviço","-","SINAPI",93656,"DISJUNTOR MONOPOLAR TIPO DIN, CORRENTE NOMINAL DE 25A - FORNECIMENTO E INSTALAÇÃO. AF_04/2016","UN",1,null,null,0,"","NÃO","AGETOP",71171,"(sem código)","-",0,0]
["S",2,"S",0,2,6,0,0,0,0,0,"","Serviço","Serviço","-","SINAPI",93673,"DISJUNTOR TRIPOLAR TIPO DIN, CORRENTE NOMINAL DE 50A - FORNECIMENTO E INSTALAÇÃO. AF_04/2016","UN",1,null,null,0,"Referência: AGETOP - 71172","SIM","AGETOP",71172,"(sem código)","-",0,0]
["S",2,"S",0,2,6,0,0,0,0,0,"","Serviço","Serviço","-","AGETOP",71456,"INTERRUPTOR DIFERENCIAL RESIDUAL (D.R.) TETRAPOLAR DE 40A-30mA","Un    ",1,null,null,0,"Referência: AGETOP - 71450","SIM","AGETOP",71450,"(sem código)","-",0,0]
["S",2,"S",0,2,6,0,0,0,0,0,"","Serviço","Serviço","-","SINAPI",91844,"ELETRODUTO FLEXÍVEL CORRUGADO, PVC, DN 25 MM (3/4\"), PARA CIRCUITOS TERMINAIS, INSTALADO EM LAJE - FORNECIMENTO E INSTALAÇÃO. AF_12/2015","M",96.82,null,null,0,"","NÃO","AGETOP",71194,"(sem código)","-",0,0]
["S",2,"S",0,2,6,0,0,0,0,0,"","Serviço","Serviço","-","SINAPI",91846,"ELETRODUTO FLEXÍVEL CORRUGADO, PVC, DN 32 MM (1\"), PARA CIRCUITOS TERMINAIS, INSTALADO EM LAJE - FORNECIMENTO E INSTALAÇÃO. AF_12/2015","M",10.1,null,null,0,"","NÃO","AGETOP",71195,"(sem código)","-",0,0]
["S",2,"S",0,2,6,0,0,0,0,0,"","Serviço","Serviço","-","SINAPI","73798/1","DUTO ESPIRAL FLEXIVEL SINGELO PEAD D=50MM(2\") REVESTIDO COM PVC COM FIO GUIA DE ACO GALVANIZADO, LANCADO DIRETO NO SOLO, INCL CONEXOES","M",31.1,null,null,0,"Referência: AGETOP - 71197","SIM","AGETOP",71197,"(sem código)","-",0,0]
["S",2,"S",0,2,6,0,0,0,0,0,"","Serviço","Serviço","-","COMPOSIÇÃO","COMP 387_SEE","LÂMPADA LED TUBULAR 18W ","UN ",29,null,null,0,"",null,null,null,"(sem código)","-",0,0]
["S",2,"S",0,2,6,0,0,0,0,0,"","Serviço","Serviço","-","SINAPI",97611,"LÂMPADA COMPACTA FLUORESCENTE DE 15 W, BASE E27 - FORNECIMENTO E INSTALAÇÃO. AF_11/2017","UN",2,null,null,0,"Referência: AGETOP - 71567","SIM","AGETOP",71567,"(sem código)","-",0,0]
["S",2,"S",0,2,6,0,0,0,0,0,"","Serviço","Serviço","-","SINAPI",92000,"TOMADA BAIXA DE EMBUTIR (1 MÓDULO), 2P+T 10 A, INCLUINDO SUPORTE E PLACA - FORNECIMENTO E INSTALAÇÃO. AF_12/2015","UN",3,null,null,0,"Referência: AGETOP - 72578","SIM","AGETOP",72578,"(sem código)","-",0,0]
["S",2,"S",0,2,6,0,0,0,0,0,"","Serviço","Serviço","-","SINAPI",91996,"TOMADA MÉDIA DE EMBUTIR (1 MÓDULO), 2P+T 10 A, INCLUINDO SUPORTE E PLACA - FORNECIMENTO E INSTALAÇÃO. AF_12/2015","UN",14,null,null,0,"Referência: AGETOP - 72578","SIM","AGETOP",72578,"(sem código)","-",0,0]
["S",2,"S",0,2,6,0,0,0,0,0,"","Serviço","Serviço","-","SINAPI",91992,"TOMADA ALTA DE EMBUTIR (1 MÓDULO), 2P+T 10 A, INCLUINDO SUPORTE E PLACA - FORNECIMENTO E INSTALAÇÃO. AF_12/2015","UN",1,null,null,0,"Referência: AGETOP - 72578","SIM","AGETOP",72578,"(sem código)","-",0,0]
["S",2,"S",0,2,6,0,0,0,0,0,"","Serviço","Serviço","-","SINAPI",91955,"INTERRUPTOR PARALELO (1 MÓDULO), 10A/250V, INCLUINDO SUPORTE E PLACA - FORNECIMENTO E INSTALAÇÃO. AF_12/2015","UN",4,null,null,0,"Referência: AGETOP - 71431","SIM","AGETOP",71431,"(sem código)","-",0,0]
["S",2,"S",0,2,6,0,0,0,0,0,"","Serviço","Serviço","-","SINAPI",91953,"INTERRUPTOR SIMPLES (1 MÓDULO), 10A/250V, INCLUINDO SUPORTE E PLACA - FORNECIMENTO E INSTALAÇÃO. AF_12/2015","UN",5,null,null,0,"Referência: AGETOP - 71440","SIM","AGETOP",71440,"(sem código)","-",0,0]
["S",2,"S",0,2,6,0,0,0,0,0,"","Serviço","Serviço","-","SINAPI",91959,"INTERRUPTOR SIMPLES (2 MÓDULOS), 10A/250V, INCLUINDO SUPORTE E PLACA - FORNECIMENTO E INSTALAÇÃO. AF_12/2015","UN",1,null,null,0,"Referência: AGETOP - 71441","SIM","AGETOP",71441,"(sem código)","-",0,0]
["S",2,"S",0,2,6,0,0,0,0,0,"","Serviço","Serviço","-","SINAPI",96986,"HASTE DE ATERRAMENTO 3/4  PARA SPDA - FORNECIMENTO E INSTALAÇÃO. AF_12/2017","UN",3,null,null,0,"Referência: AGETOP - 71380","SIM","AGETOP",71380,"(sem código)","-",0,0]
["S",2,"S",0,2,6,0,0,0,0,0,"","Serviço","Serviço","-","SINAPI","74131/4","QUADRO DE DISTRIBUICAO DE ENERGIA DE EMBUTIR, EM CHAPA METALICA, PARA 18 DISJUNTORES TERMOMAGNETICOS MONOPOLARES, COM BARRAMENTO TRIFASICO E NEUTRO, FORNECIMENTO E INSTALACAO","UN",1,null,null,0,"",null,null,null,"(sem código)","-",0,0]
[2,2,2,60,2,7,0,0,0,109,60,"","Nível 2","Nível 2","-","SINAPI",null,"INSTALAÇÕES HIDROSSANITÁRIAS","-",null,null,null,0,"",null,null,null,"INSTALAÇÕES HIDROSSANITÁRIAS","-",0,0]
["S",2,"S",0,2,7,0,0,0,0,0,"","Serviço","Serviço","-","AGETOP",80502,"VASO SANITARIO","Un    ",1,null,null,0,"",null,null,null,"(sem código)","-",0,0]
["S",2,"S",0,2,7,0,0,0,0,0,"","Serviço","Serviço","-","AGETOP",80510,"ANEL DE VEDAÇÃO PARA VASO SANITÁRIO","Un    ",1,null,null,0,"",null,null,null,"(sem código)","-",0,0]
["S",2,"S",0,2,7,0,0,0,0,0,"","Serviço","Serviço","-","AGETOP",80513,"TUBO PARA VÁLVULA DE DESCARGA ( CURTO 1.1/4\" )","Un    ",1,null,null,0,"",null,null,null,"(sem código)","-",0,0]
["S",2,"S",0,2,7,0,0,0,0,0,"","Serviço","Serviço","-","AGETOP",80514,"TUBO DE LIGACAO PVC CROMADO 1.1/2\" / ESPUDE  - (ENTRADA)","Un    ",1,null,null,0,"",null,null,null,"(sem código)","-",0,0]
["S",2,"S",0,2,7,0,0,0,0,0,"","Serviço","Serviço","-","AGETOP",80517,"VÁLVULA DE DESCARGA DUPLO ACIONAMENTO COM ACABAMENTO CROMADO ANTIVANDALISMO","Un    ",1,null,null,0,"",null,null,null,"(sem código)","-",0,0]
["S",2,"S",0,2,7,0,0,0,0,0,"","Serviço","Serviço","-","AGETOP",80520,"CONJUNTO DE FIXACAO P/VASO SANITARIO (PAR)","CJ    ",1,null,null,0,"",null,null,null,"(sem código)","-",0,0]
["S",2,"S",0,2,7,0,0,0,0,0,"","Serviço","Serviço","-","AGETOP",80526,"ASSENTO EM POLIPROPILENO COM SISTEMA DE FECHAMENTO SUAVE PARA VASO SANITÁRIO","Un    ",1,null,null,0,"",null,null,null,"(sem código)","-",0,0]
["S",2,"S",0,2,7,0,0,0,0,0,"","Serviço","Serviço","-","SINAPI",95544,"PAPELEIRA DE PAREDE EM METAL CROMADO SEM TAMPA, INCLUSO FIXAÇÃO. AF_10/2016","UN",1,null,null,0,"Referência: AGETOP - 80532","SIM","AGETOP",80532,"(sem código)","-",0,0]
["S",2,"S",0,2,7,0,0,0,0,0,"","Serviço","Serviço","-","COMPOSIÇÃO","COMP 209_SEE","TOALHEIRO PLÁSTICO TIPO DISPENSER PARA PAPEL TOALHA INTERFOLHADO","UN ",1,null,null,0,"",null,null,null,"(sem código)","-",0,0]
["S",2,"S",0,2,7,0,0,0,0,0,"","Serviço","Serviço","-","AGETOP",80542,"LAVATÓRIO MÉDIO SEM COLUNA","Un    ",2,null,null,0,"",null,null,null,"(sem código)","-",0,0]
["S",2,"S",0,2,7,0,0,0,0,0,"","Serviço","Serviço","-","AGETOP",80550,"FIXACAO P/LAVATORIO (PAR)","PAR   ",2,null,null,0,"",null,null,null,"(sem código)","-",0,0]
["S",2,"S",0,2,7,0,0,0,0,0,"","Serviço","Serviço","-","SINAPI",86885,"ENGATE FLEXÍVEL EM PLÁSTICO BRANCO, 1/2\" X 40CM - FORNECIMENTO E INSTALAÇÃO. AF_12/2013","UN",2,null,null,0,"","NÃO","AGETOP",80556,"(sem código)","-",0,0]
["S",2,"S",0,2,7,0,0,0,0,0,"","Serviço","Serviço","-","SINAPI",86883,"SIFÃO DO TIPO FLEXÍVEL EM PVC 1\u0094 X 1.1/2\u0094 - FORNECIMENTO E INSTALAÇÃO. AF_12/2013","UN",2,null,null,0,"","NÃO","AGETOP",80561,"(sem código)","-",0,0]
["S",2,"S",0,2,7,0,0,0,0,0,"","Serviço","Serviço","-","SINAPI",86906,"TORNEIRA CROMADA DE MESA, 1/2\" OU 3/4\", PARA LAVATÓRIO, PADRÃO POPULAR - FORNECIMENTO E INSTALAÇÃO. AF_12/2013","UN",2,null,null,0,"Referência: AGETOP - 80570","SIM","AGETOP",80570,"(sem código)","-",0,0]
["S",2,"S",0,2,7,0,0,0,0,0,"","Serviço","Serviço","-","AGETOP",80580,"VALVULA P/LAVATORIO OU BEBEDOURO METALICO DIAMETRO 1\"","Un    ",2,null,null,0,"",null,null,null,"(sem código)","-",0,0]
["S",2,"S",0,2,7,0,0,0,0,0,"","Serviço","Serviço","-","SINAPI",86911,"TORNEIRA CROMADA LONGA, DE PAREDE, 1/2\" OU 3/4\", PARA PIA DE COZINHA, PADRÃO POPULAR - FORNECIMENTO E INSTALAÇÃO. AF_12/2013","UN",5,null,null,0,"","NÃO","AGETOP",80660,"(sem código)","-",0,0]
["S",2,"S",0,2,7,0,0,0,0,0,"","Serviço","Serviço","-","AGETOP",80671,"SIFAO PVC P/PIA 1.1/2\" X 2\"","Un    ",5,null,null,0,"",null,null,null,"(sem código)","-",0,0]
["S",2,"S",0,2,7,0,0,0,0,0,"","Serviço","Serviço","-","SINAPI",86878,"VÁLVULA EM METAL CROMADO TIPO AMERICANA 3.1/2\" X 1.1/2\" PARA PIA - FORNECIMENTO E INSTALAÇÃO. AF_12/2013","UN",5,null,null,0,"","NÃO","AGETOP",80680,"(sem código)","-",0,0]
["S",2,"S",0,2,7,0,0,0,0,0,"","Serviço","Serviço","-","AGETOP",80687,"CUBA INOX 35X40X15CM E=0,6MM-AÇO 304 (CUBA Nº 3)","Un    ",4,null,null,0,"",null,null,null,"(sem código)","-",0,0]
["S",2,"S",0,2,7,0,0,0,0,0,"","Serviço","Serviço","-","AGETOP",80693,"TANQUE (PANELAO) INOX 60 X 70 X 40 CM CH.18","Un    ",1,null,null,0,"",null,null,null,"(sem código)","-",0,0]
["S",2,"S",0,2,7,0,0,0,0,0,"","Serviço","Serviço","-","AGETOP",80819,"SIFÃO METÁLICO PARA TANQUE DE 1 1/4\" X 1 1/2\"","un    ",1,null,null,0,"",null,null,null,"(sem código)","-",0,0]
["S",2,"S",0,2,7,0,0,0,0,0,"","Serviço","Serviço","-","AGETOP",80830,"VALVULA P/TANQUE METALICA DIAM.1\" S/LADRAO","Un    ",1,null,null,0,"",null,null,null,"(sem código)","-",0,0]
["S",2,"S",0,2,7,0,0,0,0,0,"","Serviço","Serviço","-","AGETOP",81846,"CAIXA DE GORDURA E INSPEÇÃO EM PVC/ABS 19 LITROS COM TAMPA E PORTA TAMPA E CESTO DE LIMPEZA REMOVÍVEL","un    ",1,null,null,0,"",null,null,null,"(sem código)","-",0,0]
["S",2,"S",0,2,7,0,0,0,0,0,"","Serviço","Serviço","-","SINAPI",94495,"REGISTRO DE GAVETA BRUTO, LATÃO, ROSCÁVEL, 1\u0094, INSTALADO EM RESERVAÇÃO DE ÁGUA DE EDIFICAÇÃO QUE POSSUA RESERVATÓRIO DE FIBRA/FIBROCIMENTO \u0096 FORNECIMENTO E INSTALAÇÃO. AF_06/2016","UN",1,null,null,0,"Referência: AGETOP - 80903","SIM","AGETOP",80903,"(sem código)","-",0,0]
["S",2,"S",0,2,7,0,0,0,0,0,"","Serviço","Serviço","-","SINAPI",89353,"REGISTRO DE GAVETA BRUTO, LATÃO, ROSCÁVEL, 3/4\", FORNECIDO E INSTALADO EM RAMAL DE ÁGUA. AF_12/2014","UN",4,null,null,0,"Referência: AGETOP - 80902","SIM","AGETOP",80902,"(sem código)","-",0,0]
["S",2,"S",0,2,7,0,0,0,0,0,"","Serviço","Serviço","-","SINAPI",95141,"ADAPTADOR COM FLANGES LIVRES, PVC, SOLDÁVEL LONGO, DN  25 MM X 3/4 , INSTALADO EM RESERVAÇÃO DE ÁGUA DE EDIFICAÇÃO QUE POSSUA RESERVATÓRIO DE FIBRA/FIBROCIMENTO    FORNECIMENTO E INSTALAÇÃO. AF_06/2016","UN",14,null,null,0,"Referência: AGETOP - 81041","SIM","AGETOP",81041,"(sem código)","-",0,0]
["S",2,"S",0,2,7,0,0,0,0,0,"","Serviço","Serviço","-","SINAPI",94785,"ADAPTADOR COM FLANGES LIVRES, PVC, SOLDÁVEL LONGO, DN 32 MM X 1 , INSTALADO EM RESERVAÇÃO DE ÁGUA DE EDIFICAÇÃO QUE POSSUA RESERVATÓRIO DE FIBRA/FIBROCIMENTO   FORNECIMENTO E INSTALAÇÃO. AF_06/2016","UN",2,null,null,0,"Referência: AGETOP - 81042","SIM","AGETOP",81042,"(sem código)","-",0,0]
["S",2,"S",0,2,7,0,0,0,0,0,"","Serviço","Serviço","-","AGETOP",81504,"SOLUCAO LIMPADORA 1000 CM3","Un    ",5,null,null,0,"",null,null,null,"(sem código)","-",0,0]
["S",2,"S",0,2,7,0,0,0,0,0,"","Serviço","Serviço","-","AGETOP",81663,"CORPO CX. SIFONADA DIAM. 150 X 150 X 50","Un    ",2,null,null,0,"",null,null,null,"(sem código)","-",0,0]
["S",2,"S",0,2,7,0,0,0,0,0,"","Serviço","Serviço","-","SINAPI",89708,"CAIXA SIFONADA, PVC, DN 150 X 185 X 75 MM, JUNTA ELÁSTICA, FORNECIDA E INSTALADA EM RAMAL DE DESCARGA OU EM RAMAL DE ESGOTO SANITÁRIO. AF_12/2014","UN",2,null,null,0,"Referência: AGETOP - 81664","SIM","AGETOP",81664,"(sem código)","-",0,0]
["S",2,"S",0,2,7,0,0,0,0,0,"","Serviço","Serviço","-","AGETOP",81771,"GRELHA QUADRADA BRANCA DIAM. 150 MM","Un    ",2,null,null,0,"",null,null,null,"(sem código)","-",0,0]
["S",2,"S",0,2,7,0,0,0,0,0,"","Serviço","Serviço","-","AGETOP",81885,"TERMINAL DE VENTILACAO DIAMETRO 50 MM","Un    ",1,null,null,0,"",null,null,null,"(sem código)","-",0,0]
["S",2,"S",0,2,7,0,0,0,0,0,"","Serviço","Serviço","-","AGETOP",81831,"CAIXA DE INSPEÇÃO - ALVENARIA DE 1/2 VEZ COM REVESTIMENTO INTERNO EM REBOCO PAULISTA A-14 (COM ADIÇÃO DE IMPERMEABILIZANTE)","m2    ",3,null,null,0,"",null,null,null,"(sem código)","-",0,0]
["S",2,"S",0,2,7,0,0,0,0,0,"","Serviço","Serviço","-","AGETOP",81825,"CAIXA DE PASSAGEM 60 X 60 CM SEM TAMPA","Un    ",5,null,null,0,"",null,null,null,"(sem código)","-",0,0]
["S",2,"S",0,2,7,0,0,0,0,0,"","Serviço","Serviço","-","AGETOP",81826,"TAMPA EM CONCRETO ARMADO 25 MPA E=5CM PARA A CAIXA DE PASSAGEM 60X60CM","Un    ",5,null,null,0,"",null,null,null,"(sem código)","-",0,0]
["S",2,"S",0,2,7,0,0,0,0,0,"","Serviço","Serviço","-","SINAPI",89402,"TUBO, PVC, SOLDÁVEL, DN 25MM, INSTALADO EM RAMAL DE DISTRIBUIÇÃO DE ÁGUA - FORNECIMENTO E INSTALAÇÃO. AF_12/2014","M",25,null,null,0,"Referência: AGETOP - 81003","SIM","AGETOP",81003,"(sem código)","-",0,0]
["S",2,"S",0,2,7,0,0,0,0,0,"","Serviço","Serviço","-","SINAPI",89403,"TUBO, PVC, SOLDÁVEL, DN 32MM, INSTALADO EM RAMAL DE DISTRIBUIÇÃO DE ÁGUA - FORNECIMENTO E INSTALAÇÃO. AF_12/2014","M",20,null,null,0,"Referência: AGETOP - 81004","SIM","AGETOP",81004,"(sem código)","-",0,0]
["S",2,"S",0,2,7,0,0,0,0,0,"","Serviço","Serviço","-","SINAPI",89617,"TE, PVC, SOLDÁVEL, DN 25MM, INSTALADO EM PRUMADA DE ÁGUA - FORNECIMENTO E INSTALAÇÃO. AF_12/2014","UN",3,null,null,0,"","NÃO","AGETOP",81402,"(sem código)","-",0,0]
["S",2,"S",0,2,7,0,0,0,0,0,"","Serviço","Serviço","-","SINAPI",89620,"TE, PVC, SOLDÁVEL, DN 32MM, INSTALADO EM PRUMADA DE ÁGUA - FORNECIMENTO E INSTALAÇÃO. AF_12/2014","UN",3,null,null,0,"Referência: AGETOP - 81403","SIM","AGETOP",81403,"(sem código)","-",0,0]
["S",2,"S",0,2,7,0,0,0,0,0,"","Serviço","Serviço","-","SINAPI",89622,"TÊ DE REDUÇÃO, PVC, SOLDÁVEL, DN 32MM X 25MM, INSTALADO EM PRUMADA DE ÁGUA - FORNECIMENTO E INSTALAÇÃO. AF_12/2014","UN",2,null,null,0,"Referência: AGETOP - 81421","SIM","AGETOP",81421,"(sem código)","-",0,0]
["S",2,"S",0,2,7,0,0,0,0,0,"","Serviço","Serviço","-","SINAPI",89802,"JOELHO 45 GRAUS, PVC, SERIE NORMAL, ESGOTO PREDIAL, DN 50 MM, JUNTA ELÁSTICA, FORNECIDO E INSTALADO EM PRUMADA DE ESGOTO SANITÁRIO OU VENTILAÇÃO. AF_12/2014","UN",7,null,null,0,"","NÃO","AGETOP",81922,"(sem código)","-",0,0]
["S",2,"S",0,2,7,0,0,0,0,0,"","Serviço","Serviço","-","SINAPI",89724,"JOELHO 90 GRAUS, PVC, SERIE NORMAL, ESGOTO PREDIAL, DN 40 MM, JUNTA SOLDÁVEL, FORNECIDO E INSTALADO EM RAMAL DE DESCARGA OU RAMAL DE ESGOTO SANITÁRIO. AF_12/2014","UN",12,null,null,0,"","NÃO","AGETOP",81935,"(sem código)","-",0,0]
["S",2,"S",0,2,7,0,0,0,0,0,"","Serviço","Serviço","-","SINAPI",89731,"JOELHO 90 GRAUS, PVC, SERIE NORMAL, ESGOTO PREDIAL, DN 50 MM, JUNTA ELÁSTICA, FORNECIDO E INSTALADO EM RAMAL DE DESCARGA OU RAMAL DE ESGOTO SANITÁRIO. AF_12/2014","UN",3,null,null,0,"","NÃO","AGETOP",81936,"(sem código)","-",0,0]
["S",2,"S",0,2,7,0,0,0,0,0,"","Serviço","Serviço","-","AGETOP",81973,"JUNCAO SIMPLES DIAM. 100 X 50 MM","Un    ",1,null,null,0,"",null,null,null,"(sem código)","-",0,0]
["S",2,"S",0,2,7,0,0,0,{"$f":"IF(OR($C403=\"S\",$C403=0),0,MATCH(0,OFFSET($D403,1,$C403,ROW($C$648)-ROW($C403)),0))","v":0},{"$f":"IF(OR($C403=\"S\",$C403=0),0,MATCH(OFFSET($D403,0,$C403)+1,OFFSET($D403,1,$C403,ROW($C$648)-ROW($C403)),0))","v":0},"","Serviço","Serviço","-","SINAPI",89834,"JUNÇÃO SIMPLES, PVC, SERIE NORMAL, ESGOTO PREDIAL, DN 100 X 100 MM, JUNTA ELÁSTICA, FORNECIDO E INSTALADO EM PRUMADA DE ESGOTO SANITÁRIO OU VENTILAÇÃO. AF_12/2014","UN",1,null,null,0,"","NÃO","AGETOP",81975,"(sem código)","-",0,0]
["S",2,"S",0,2,7,0,0,0,0,0,"","Serviço","Serviço","-","AGETOP",81981,"JUNÇÃO DUPLA DIAMETRO 75 MM","Un    ",1,null,null,0,"",null,null,null,"(sem código)","-",0,0]
["S",2,"S",0,2,7,0,0,0,0,0,"","Serviço","Serviço","-","SINAPI",89753,"LUVA SIMPLES, PVC, SERIE NORMAL, ESGOTO PREDIAL, DN 50 MM, JUNTA ELÁSTICA, FORNECIDO E INSTALADO EM RAMAL DE DESCARGA OU RAMAL DE ESGOTO SANITÁRIO. AF_12/2014","UN",8,null,null,0,"Referência: AGETOP - 82002","SIM","AGETOP",82002,"(sem código)","-",0,0]
["S",2,"S",0,2,7,0,0,0,0,0,"","Serviço","Serviço","-","SINAPI",89778,"LUVA SIMPLES, PVC, SERIE NORMAL, ESGOTO PREDIAL, DN 100 MM, JUNTA ELÁSTICA, FORNECIDO E INSTALADO EM RAMAL DE DESCARGA OU RAMAL DE ESGOTO SANITÁRIO. AF_12/2014","UN",2,null,null,0,"Referência: AGETOP - 82004","SIM","AGETOP",82004,"(sem código)","-",0,0]
["S",2,"S",0,2,7,0,0,0,0,0,"","Serviço","Serviço","-","AGETOP",82051,"PORTA GRELHA QUADRADA BRANCO DIAM. 150 MM","Un    ",2,null,null,0,"",null,null,null,"(sem código)","-",0,0]
["S",2,"S",0,2,7,0,0,0,0,0,"","Serviço","Serviço","-","AGETOP",82103,"REDUCAO EXCENTRICA 100 X 50 MM","Un    ",1,null,null,0,"",null,null,null,"(sem código)","-",0,0]
["S",2,"S",0,2,7,0,0,0,0,0,"","Serviço","Serviço","-","AGETOP",82233,"TE SANITARIO DIAMETRO 100 X 50 MM","Un    ",1,null,null,0,"",null,null,null,"(sem código)","-",0,0]
["S",2,"S",0,2,7,0,0,0,0,0,"","Serviço","Serviço","-","SINAPI",89711,"TUBO PVC, SERIE NORMAL, ESGOTO PREDIAL, DN 40 MM, FORNECIDO E INSTALADO EM RAMAL DE DESCARGA OU RAMAL DE ESGOTO SANITÁRIO. AF_12/2014","M",14,null,null,0,"Referência: AGETOP - 82301","SIM","AGETOP",82301,"(sem código)","-",0,0]
["S",2,"S",0,2,7,0,0,0,0,0,"","Serviço","Serviço","-","SINAPI",89712,"TUBO PVC, SERIE NORMAL, ESGOTO PREDIAL, DN 50 MM, FORNECIDO E INSTALADO EM RAMAL DE DESCARGA OU RAMAL DE ESGOTO SANITÁRIO. AF_12/2014","M",26,null,null,0,"Referência: AGETOP - 82302","SIM","AGETOP",82302,"(sem código)","-",0,0]
["S",2,"S",0,2,7,0,0,0,0,0,"","Serviço","Serviço","-","AGETOP",82374,"TUBO FERRO GALVANIZADO DIAM.3/4\"","m     ",10,null,null,0,"",null,null,null,"(sem código)","-",0,0]
["S",2,"S",0,2,7,0,0,0,0,0,"","Serviço","Serviço","-","SINAPI",83635,"EXTINTOR INCENDIO TP PO QUIMICO 6KG - FORNECIMENTO E INSTALACAO","UN",1,null,null,0,"Referência: AGETOP - 85003","SIM","AGETOP",85003,"(sem código)","-",0,0]
["S",2,"S",0,2,7,0,0,0,0,0,"","Serviço","Serviço","-","SINAPI",96702,"BUCHA DE REDUÇÃO, PPR, 32 X 25, CLASSE PN 25, INSTALADO EM PRUMADA DE ÁGUA \u0096 FORNECIMENTO E INSTALAÇÃO . AF_06/2015","UN",25,null,null,0,"Referência: AGETOP - 81162","SIM","AGETOP",81162,"(sem código)","-",0,0]
["S",2,"S",0,2,7,0,0,0,0,0,"","Serviço","Serviço","-","SINAPI",94672,"JOELHO 90 GRAUS COM BUCHA DE LATÃO, PVC, SOLDÁVEL, DN  25 MM, X 3/4\u0094 INSTALADO EM RESERVAÇÃO DE ÁGUA DE EDIFICAÇÃO QUE POSSUA RESERVATÓRIO DE FIBRA/FIBROCIMENTO   FORNECIMENTO E INSTALAÇÃO. AF_06/2016","UN",6,null,null,0,"","NÃO","AGETOP",81369,"(sem código)","-",0,0]
["S",2,"S",0,2,7,0,0,0,0,0,"","Serviço","Serviço","-","SINAPI",89362,"JOELHO 90 GRAUS, PVC, SOLDÁVEL, DN 25MM, INSTALADO EM RAMAL OU SUB-RAMAL DE ÁGUA - FORNECIMENTO E INSTALAÇÃO. AF_12/2014","UN",6,null,null,0,"Referência: AGETOP - 81321","SIM","AGETOP",81321,"(sem código)","-",0,0]
["S",2,"S",0,2,7,0,0,0,0,0,"","Serviço","Serviço","-","SINAPI",89546,"BUCHA DE REDUÇÃO LONGA, PVC, SERIE R, ÁGUA PLUVIAL, DN 50 X 40 MM, JUNTA ELÁSTICA, FORNECIDO E INSTALADO EM RAMAL DE ENCAMINHAMENTO. AF_12/2014","UN",6,null,null,0,"Referência: AGETOP - 81602","SIM","AGETOP",81602,"(sem código)","-",0,0]
[2,2,2,5,2,8,0,0,0,49,5,"","Nível 2","Nível 2","-","SINAPI",null,"ALVENARIAS E DIVISÓRIAS","-",null,null,null,0,"",null,null,null,"ALVENARIAS E DIVISÓRIAS","-",0,0]
["S",2,"S",0,2,8,0,0,0,0,0,"","Serviço","Serviço","-","SINAPI","73937/1","COBOGO DE CONCRETO (ELEMENTO VAZADO), 7X50X50CM, ASSENTADO COM ARGAMASSA TRACO 1:4 (CIMENTO E AREIA)","M2",16.3,null,null,0,"Referência: AGETOP - 100501","SIM","AGETOP",100501,"(sem código)","-",0,0]
["S",2,"S",0,2,8,0,0,0,0,0,"","Serviço","Serviço","-","SINAPI",72132,"ALVENARIA EM TIJOLO CERAMICO MACICO 5X10X20CM 1/2 VEZ (ESPESSURA 10CM), ASSENTADO COM ARGAMASSA TRACO 1:2:8 (CIMENTO, CAL E AREIA)","M2",17.11,null,null,0,"","NÃO","AGETOP",100102,"(sem código)","-",0,0]
["S",2,"S",0,2,8,0,0,0,0,0,"","Serviço","Serviço","-","SINAPI",87489,"ALVENARIA DE VEDAÇÃO DE BLOCOS CERÂMICOS FURADOS NA VERTICAL DE 9X19X39CM (ESPESSURA 9CM) DE PAREDES COM ÁREA LÍQUIDA MAIOR OU IGUAL A 6M² COM VÃOS E ARGAMASSA DE ASSENTAMENTO COM PREPARO EM BETONEIRA. AF_06/2014","M2",142.08000000000001,null,null,0,"Referência: AGETOP - 100201","SIM","AGETOP",100201,"(sem código)","-",0,0]
["S",2,"S",0,2,8,0,0,0,0,0,"","Serviço","Serviço","-","SINAPI",93202,"FIXAÇÃO (ENCUNHAMENTO) DE ALVENARIA DE VEDAÇÃO COM TIJOLO MACIÇO. AF_03/2016","M",27,null,null,0,"Referência: AGETOP - 100204","SIM","AGETOP",100204,"(sem código)","-",0,0]
[2,2,2,2,2,9,0,0,0,44,2,"","Nível 2","Nível 2","-","SINAPI",null,"IMPERMEABILIZAÇÃO","-",null,null,null,0,"",null,null,null,"IMPERMEABILIZAÇÃO","-",0,0]
["S",2,"S",0,2,9,0,0,0,0,0,"","Serviço","Serviço","-","SINAPI",98562,"IMPERMEABILIZAÇÃO DE FLOREIRA OU VIGA BALDRAME COM ARGAMASSA DE CIMENTO E AREIA, COM ADITIVO IMPERMEABILIZANTE, E = 2 CM. AF_06/2018","M2",43.03,null,null,0,"Referência: AGETOP - 120902","SIM","AGETOP",120902,"(sem código)","-",0,0]
[2,2,2,2,2,10,0,0,0,42,2,"","Nível 2","Nível 2","-","SINAPI",null,"ESTRUTURAS METÁLICAS","-",null,null,null,0,"",null,null,null,"ESTRUTURAS METÁLICAS","-",0,0]
["S",2,"S",0,2,10,0,0,0,0,0,"","Serviço","Serviço","-","AGETOP",150103,"ESTRUTURA METÁLICA CONVENCIONAL EM AÇO DO TIPO USI SAC-300 COM FUNDO ANTICORROSIVO","Kg    ",1956.5,null,null,0,"",null,null,null,"(sem código)","-",0,0]
[2,2,2,6,2,11,0,0,0,40,6,"","Nível 2","Nível 2","-","SINAPI",null,"COBERTURAS","-",null,null,null,0,"",null,null,null,"COBERTURAS","-",0,0]
[3,3,3,5,2,11,1,0,0,5,22,"","Nível 3","Nível 3","-","SINAPI",null,"CERAMICA","-",null,null,null,0,"",null,null,null,"CERAMICA","-",0,0]
["S",3,"S",0,2,11,1,0,0,0,0,"","Serviço","Serviço","-","SINAPI",94445,"TELHAMENTO COM TELHA CERÂMICA CAPA-CANAL, TIPO PLAN, COM ATÉ 2 ÁGUAS, INCLUSO TRANSPORTE VERTICAL. AF_06/2016","M2",182.07,null,null,0,"Referência: AGETOP - 160401","SIM","AGETOP",160401,"(sem código)","-",0,0]
["S",3,"S",0,2,11,1,0,0,0,0,"","Serviço","Serviço","-","SINAPI",94221,"CUMEEIRA PARA TELHA CERÂMICA EMBOÇADA COM ARGAMASSA TRAÇO 1:2:9 (CIMENTO, CAL E AREIA) PARA TELHADOS COM ATÉ 2 ÁGUAS, INCLUSO TRANSPORTE VERTICAL. AF_06/2016","M",17.68,null,null,0,"","NÃO","AGETOP",160402,"(sem código)","-",0,0]
["S",3,"S",0,2,11,1,0,0,0,0,"","Serviço","Serviço","-","SINAPI",94224,"EMBOÇAMENTO COM ARGAMASSA TRAÇO 1:2:9 (CIMENTO, CAL E AREIA). AF_06/2016","M",20.399999999999999,null,null,0,"Referência: AGETOP - 160403","SIM","AGETOP",160403,"(sem código)","-",0,0]
["S",3,"S",0,2,11,1,0,0,0,0,"","Serviço","Serviço","-","SINAPI",94224,"EMBOÇAMENTO COM ARGAMASSA TRAÇO 1:2:9 (CIMENTO, CAL E AREIA). AF_06/2016","M",35.36,null,null,0,"Referência: AGETOP - 160404","SIM","AGETOP",160404,"(sem código)","-",0,0]
[2,2,2,5,2,12,0,0,0,34,5,"","Nível 2","Nível 2","-","SINAPI",null,"ESQUADRIAS METÁLICAS","-",null,null,null,0,"",null,null,null,"ESQUADRIAS METÁLICAS","-",0,0]
["S",2,"S",0,2,12,0,0,0,0,0,"","Serviço","Serviço","-","SINAPI",94570,"JANELA DE ALUMÍNIO DE CORRER, 2 FOLHAS, FIXAÇÃO COM PARAFUSO SOBRE CONTRAMARCO (EXCLUSIVE CONTRAMARCO), COM VIDROS PADRONIZADA. AF_07/2016","M2",5.52,null,null,0,"Referência: AGETOP - 180381","SIM","AGETOP",180381,"(sem código)","-",0,0]
["S",2,"S",0,2,12,0,0,0,0,0,"","Serviço","Serviço","-","SINAPI","74136/3","PORTA DE ACO CHAPA 24, DE ENROLAR, RAIADA, LARGA COM ACABAMENTO GALVANIZADO NATURAL","M2",5.74,null,null,0,"Referência: AGETOP - 180303","SIM","AGETOP",180303,"(sem código)","-",0,0]
["S",2,"S",0,2,12,0,0,0,0,0,"","Serviço","Serviço","-","SINAPI","73933/4","PORTA DE FERRO DE ABRIR TIPO BARRA CHATA, COM REQUADRO E GUARNICAO COMPLETA","M2",8.64,null,null,0,"Referência: AGETOP - 180501","SIM","AGETOP",180501,"(sem código)","-",0,0]
["S",2,"S",0,2,12,0,0,0,0,0,"","Serviço","Serviço","-","AGETOP",180307,"PORTAO /CHAPA TRAPEZ / TUBO DE ACO PT-5 C/FERRAGEM","m2    ",4,null,null,0,"",null,null,null,"(sem código)","-",0,0]
[2,2,2,2,2,13,0,0,0,29,2,"","Nível 2","Nível 2","-","SINAPI",null,"VIDROS","-",null,null,null,0,"",null,null,null,"VIDROS","-",0,0]
["S",2,"S",0,2,13,0,0,0,0,0,"","Serviço","Serviço","-","SINAPI",72117,"VIDRO LISO COMUM TRANSPARENTE, ESPESSURA 4MM","M2",5.52,null,null,0,"","NÃO","AGETOP",190102,"(sem código)","-",0,0]
[2,2,2,4,2,14,0,0,0,27,4,"","Nível 2","Nível 2","-","SINAPI",null,"REVESTIMENTO DE PAREDE","-",null,null,null,0,"",null,null,null,"REVESTIMENTO DE PAREDE","-",0,0]
["S",2,"S",0,2,14,0,0,0,0,0,"","Serviço","Serviço","-","SINAPI",87553,"EMBOÇO, PARA RECEBIMENTO DE CERÂMICA, EM ARGAMASSA TRAÇO 1:2:8, PREPARO MECÂNICO COM BETONEIRA 400L, APLICADO MANUALMENTE EM FACES INTERNAS DE PAREDES, PARA AMBIENTE COM ÁREA MAIOR QUE 10M2, ESPESSURA DE 10MM, COM EXECUÇÃO DE TALISCAS. AF_06/2014","M2",186.65,null,null,0,"","NÃO","AGETOP",200201,"(sem código)","-",0,0]
["S",2,"S",0,2,14,0,0,0,0,0,"","Serviço","Serviço","-","SINAPI",87904,"CHAPISCO APLICADO EM ALVENARIA (COM PRESENÇA DE VÃOS) E ESTRUTURAS DE CONCRETO DE FACHADA, COM COLHER DE PEDREIRO.  ARGAMASSA TRAÇO 1:3 COM PREPARO MANUAL. AF_06/2014","M2",284.16000000000003,null,null,0,"Referência: AGETOP - 200101","SIM","AGETOP",200101,"(sem código)","-",0,0]
["S",2,"S",0,2,14,0,0,0,0,0,"","Serviço","Serviço","-","SINAPI",87273,"REVESTIMENTO CERÂMICO PARA PAREDES INTERNAS COM PLACAS TIPO ESMALTADA EXTRA DE DIMENSÕES 33X45 CM APLICADAS EM AMBIENTES DE ÁREA MAIOR QUE 5 M² NA ALTURA INTEIRA DAS PAREDES. AF_06/2014","M2",127.56500000000001,null,null,0,"","NÃO","AGETOP",201302,"(sem código)","-",0,0]
[2,2,2,3,2,15,0,0,0,23,3,"","Nível 2","Nível 2","-","SINAPI",null,"FORROS","-",null,null,null,0,"",null,null,null,"FORROS","-",0,0]
["S",2,"S",0,2,15,0,0,0,0,0,"","Serviço","Serviço","-","SINAPI",87884,"CHAPISCO APLICADO NO TETO, COM ROLO PARA TEXTURA ACRÍLICA. ARGAMASSA INDUSTRIALIZADA COM PREPARO MANUAL. AF_06/2014","M2",40.75,null,null,0,"Referência: AGETOP - 210102","SIM","AGETOP",210102,"(sem código)","-",0,0]
["S",2,"S",0,2,15,0,0,0,0,0,"","Serviço","Serviço","-","SINAPI",90408,"MASSA ÚNICA, PARA RECEBIMENTO DE PINTURA, EM ARGAMASSA TRAÇO 1:2:8, PREPARO MECÂNICO COM BETONEIRA 400L, APLICADA MANUALMENTE EM TETO, ESPESSURA DE 10MM, COM EXECUÇÃO DE TALISCAS. AF_03/2015","M2",40.75,null,null,0,"Referência: AGETOP - 210401","SIM","AGETOP",210401,"(sem código)","-",0,0]
[2,2,2,8,2,16,0,0,0,20,8,"","Nível 2","Nível 2","-","SINAPI",null,"REVESTIMENTO DE PISO","-",null,null,null,0,"",null,null,null,"REVESTIMENTO DE PISO","-",0,0]
[3,3,3,2,2,16,1,0,0,7,2,"","Nível 3","Nível 3","-","SINAPI",null,"LASTRO","-",null,null,null,0,"",null,null,null,"LASTRO","-",0,0]
["S",3,"S",0,2,16,1,0,0,0,0,"","Serviço","Serviço","-","AGETOP",220101,"LASTRO DE CONCRETO REGULARIZADO IMPERMEABILIZADO 1:3:6 ESP=5CM (BASE)","m2    ",139.75,null,null,0,"",null,null,null,"(sem código)","-",0,0]
[3,3,3,3,2,16,2,0,0,5,3,"","Nível 3","Nível 3","-",null,null,"GRANITINA","-",null,null,null,0,"",null,null,null,"GRANITINA","-",0,0]
["S",3,"S",0,2,16,2,0,0,0,0,"","Serviço","Serviço","-","SINAPI",84191,"PISO EM GRANILITE, MARMORITE OU GRANITINA ESPESSURA 8 MM, INCLUSO JUNTAS DE DILATACAO PLASTICAS","M2",144.74029999999999,null,null,0,"Referência: AGETOP - 221101","SIM","AGETOP",221101,"(sem código)","-",0,0]
["S",3,"S",0,2,16,2,0,0,0,0,"","Serviço","Serviço","-","AGETOP",221104,"RASPAGEM E APLICAÇÃO RESINA ACRÍLICA DUAS DEMÃOS","m2    ",144.74029999999999,null,null,0,"",null,null,null,"(sem código)","-",0,0]
[3,3,3,2,2,16,3,0,0,2,{"$error":"#N/A"},"","Nível 3","Nível 3","-",null,null,"PASSEIO (CALÇADA)","-",null,null,null,0,"",null,null,null,"PASSEIO (CALÇADA)","-",0,0]
["S",3,"S",0,2,16,3,0,0,0,0,"","Serviço","Serviço","-","AGETOP",220100,"PASSEIO PROTECAO EM CONC.DESEMPEN.5 CM 1:2,5:3,5 ( INCLUSO ESPELHO DE 30CM/ESCAVAÇÃO/REATERRO/APILOAMENTO/ATERRO INTERNO)","m2    ",35.04,null,null,0,"",null,null,null,"(sem código)","-",0,0]
[2,2,2,2,2,17,0,0,0,12,2,"","Nível 2","Nível 2","-",null,null,"MARCENARIA","-",null,null,null,0,"",null,null,null,"MARCENARIA","-",0,0]
["S",2,"S",0,2,17,0,0,0,0,0,"","Serviço","Serviço","-","AGETOP",240209,"PRATELEIRA EST.CAIBRO 4+1 TABUAS APARELHADAS E ENVERNIZADAS","m     ",3.2,null,null,0,"",null,null,null,"(sem código)","-",0,0]
[2,2,2,7,2,18,0,0,0,10,7,"","Nível 2","Nível 2","-",null,null,"PINTURA","-",null,null,null,0,"",null,null,null,"PINTURA","-",0,0]
["S",2,"S",0,2,18,0,0,0,0,0,"","Serviço","Serviço","-","SINAPI",88497,"APLICAÇÃO E LIXAMENTO DE MASSA LÁTEX EM PAREDES, DUAS DEMÃOS. AF_06/2014","M2",128,null,null,0,"Referência: AGETOP - 261300","SIM","AGETOP",261300,"(sem código)","-",0,0]
["S",2,"S",0,2,18,0,0,0,0,0,"","Serviço","Serviço","-","SINAPI",88486,"APLICAÇÃO MANUAL DE PINTURA COM TINTA LÁTEX PVA EM TETO, DUAS DEMÃOS. AF_06/2014","M2",40.75,null,null,0,"Referência: AGETOP - 261307","SIM","AGETOP",261307,"(sem código)","-",0,0]
["S",2,"S",0,2,18,0,0,0,0,0,"","Serviço","Serviço","-","AGETOP",261550,"PINT.ESMALTE SINT.PAREDES - 2 DEM.C/SELADOR","m2    ",87.25,null,null,0,"",null,null,null,"(sem código)","-",0,0]
["S",2,"S",0,2,18,0,0,0,0,0,"","Serviço","Serviço","-","SINAPI",88489,"APLICAÇÃO MANUAL DE PINTURA COM TINTA LÁTEX ACRÍLICA EM PAREDES, DUAS DEMÃOS. AF_06/2014","M2",87.25,null,null,0,"Referência: AGETOP - 261000","SIM","AGETOP",261000,"(sem código)","-",0,0]
["S",2,"S",0,2,18,0,0,0,0,0,"","Serviço","Serviço","-","SINAPI","74145/1","PINTURA ESMALTE FOSCO, DUAS DEMAOS, SOBRE SUPERFICIE METALICA, INCLUSO UMA DEMAO DE FUNDO ANTICORROSIVO. UTILIZACAO DE REVOLVER ( AR-COMPRIMIDO).","M2",87.25,null,null,0,"Referência: AGETOP - 261602","SIM","AGETOP",261602,"(sem código)","-",0,0]
["S",2,"S",0,2,18,0,0,0,0,0,"","Serviço","Serviço","-","SINAPI","74145/1","PINTURA ESMALTE FOSCO, DUAS DEMAOS, SOBRE SUPERFICIE METALICA, INCLUSO UMA DEMAO DE FUNDO ANTICORROSIVO. UTILIZACAO DE REVOLVER ( AR-COMPRIMIDO).","M2",364.14,null,null,0,"Referência: AGETOP - 261609","SIM","AGETOP",261609,"(sem código)","-",0,0]
[2,2,2,3,2,19,0,0,0,3,{"$error":"#N/A"},"","Nível 2","Nível 2","-",null,null,"DIVERSOS","-",null,null,null,0,"",null,null,null,"DIVERSOS","-",0,0]
["S",2,"S",0,2,19,0,0,0,0,0,"","Serviço","Serviço","-","AGETOP",270501,"LIMPEZA FINAL DE OBRA - (OBRAS CIVIS)","m2    ",139.75,null,null,0,"",null,null,null,"(sem código)","-",0,0]
["S",2,"S",0,2,19,0,0,0,0,0,"","Serviço","Serviço","-","AGETOP",271608,"BANCADA DE GRANITO C/ESPELHO","m2    ",6.8250000000000002,null,null,0,"",null,null,null,"(sem código)","-",0,0]
[1,1,1,181,3,0,0,0,0,{"$f":"IF(OR($C467=\"S\",$C467=0),0,MATCH(0,OFFSET($D467,1,$C467,ROW($C$648)-ROW($C467)),0))","v":181},{"$f":"IF(OR($C467=\"S\",$C467=0),0,MATCH(OFFSET($D467,0,$C467)+1,OFFSET($D467,1,$C467,ROW($C$648)-ROW($C467)),0))","v":{"$error":"#N/A"}},"F","Nível 1","Nível 1","3.","SINAPI",null,"BLOCO SANITÁRIO PADRÃO SEDUC 2013","-",null,null,null,0,"",null,null,null,"BLOCO SANITÁRIO PADRÃO SEDUC 2013","-",0,0]
[2,2,2,2,3,1,0,0,0,180,2,"","Nível 2","Nível 2","-","SINAPI",null,"SERVIÇOS PRELIMINARES","-",null,null,null,0,"",null,null,null,"SERVIÇOS PRELIMINARES","-",0,0]
["S",2,"S",0,3,1,0,0,0,0,0,"","Serviço","Serviço","-","AGETOP",20701,"LOCAÇÃO DA OBRA, EXECUÇÃO DE GABARITO SEM REAPROVEITAMENTO, INCLUSO PINTURA (FACE INTERNA DO RIPÃO 15CM) E PIQUETE COM TESTEMUNHA","m2    ",55.42,null,null,0,"",null,null,null,"(sem código)","-",0,0]
[2,2,2,3,3,2,0,0,0,178,3,"","Nível 2","Nível 2","-","SINAPI",null,"TRANSPORTES","-",null,null,null,0,"",null,null,null,"TRANSPORTES","-",0,0]
["S",2,"S",0,3,2,0,0,0,0,0,"","Serviço","Serviço","-","SINAPI",72900,"TRANSPORTE DE ENTULHO COM CAMINHAO BASCULANTE 6 M3, RODOVIA PAVIMENTADA, DMT 0,5 A 1,0 KM","M3",3.88,null,null,0,"",null,null,null,"(sem código)","-",0,0]
["S",2,"S",0,3,2,0,0,0,0,0,"","Serviço","Serviço","-","SINAPI",72897,"CARGA MANUAL DE ENTULHO EM CAMINHAO BASCULANTE 6 M3","M3",3.88,null,null,0,"",null,null,null,"(sem código)","-",0,0]
[2,2,2,22,3,3,0,0,0,175,22,"","Nível 2","Nível 2","-","SINAPI",null,"SERVIÇO EM TERRA","-",null,null,null,0,"",null,null,null,"SERVIÇO EM TERRA","-",0,0]
[3,3,3,10,3,3,1,0,0,21,10,"","Nível 3","Nível 3","-","SINAPI",null,"ESTACAS E BLOCOS","-",null,null,null,0,"",null,null,null,"ESTACAS E BLOCOS","-",0,0]
["S",3,"S",0,3,3,1,0,0,0,0,"","Serviço","Serviço","-","SINAPI",98230,"ESTACA BROCA DE CONCRETO, DIÂMETRO DE 30 CM, PROFUNDIDADE DE ATÉ 3 M, ESCAVAÇÃO MANUAL COM TRADO CONCHA, NÃO ARMADA. AF_03/2018","M",69.5,null,null,0,"Referência: AGETOP - 50302","SIM","AGETOP",50302,"(sem código)","-",0,0]
["S",3,"S",0,3,3,1,0,0,0,0,"","Serviço","Serviço","-","SINAPI",96522,"ESCAVAÇÃO MANUAL PARA BLOCO DE COROAMENTO OU SAPATA, SEM PREVISÃO DE FÔRMA. AF_06/2017","M3",4.08,null,null,0,"Referência: AGETOP - 50901","SIM","AGETOP",50901,"(sem código)","-",0,0]
["S",3,"S",0,3,3,1,0,0,0,0,"","Serviço","Serviço","-","SINAPI",93382,"REATERRO MANUAL DE VALAS COM COMPACTAÇÃO MECANIZADA. AF_04/2016","M3",1.98,null,null,0,"Referência: AGETOP - 50905","SIM","AGETOP",50905,"(sem código)","-",0,0]
["S",3,"S",0,3,3,1,0,0,0,0,"","Serviço","Serviço","-","SINAPI",94964,"CONCRETO FCK = 20MPA, TRAÇO 1:2,7:3 (CIMENTO/ AREIA MÉDIA/ BRITA 1)  - PREPARO MECÂNICO COM BETONEIRA 400 L. AF_07/2016","M3",2.1,null,null,0,"","NÃO","AGETOP",60507,"(sem código)","-",0,0]
["S",3,"S",0,3,3,1,0,0,0,0,"","Serviço","Serviço","-","SINAPI","74157/4","LANCAMENTO/APLICACAO MANUAL DE CONCRETO EM FUNDACOES","M3",2.1,null,null,0,"Referência: AGETOP - 51060","SIM","AGETOP",51060,"(sem código)","-",0,0]
["S",3,"S",0,3,3,1,0,0,0,0,"","Serviço","Serviço","-","SINAPI",94103,"LASTRO DE VALA COM PREPARO DE FUNDO, LARGURA MENOR QUE 1,5 M, COM CAMADA DE BRITA, LANÇAMENTO MANUAL, EM LOCAL COM NÍVEL BAIXO DE INTERFERÊNCIA. AF_06/2016","M3",3.5,null,null,0,"Referência: AGETOP - 51027","SIM","AGETOP",51027,"(sem código)","-",0,0]
["S",3,"S",0,3,3,1,0,0,0,0,"","Serviço","Serviço","-","SINAPI",96545,"ARMAÇÃO DE BLOCO, VIGA BALDRAME OU SAPATA UTILIZANDO AÇO CA-50 DE 8 MM - MONTAGEM. AF_06/2017","KG",43.51,null,null,0,"Referência: AGETOP - 52004","SIM","AGETOP",52004,"(sem código)","-",0,0]
["S",3,"S",0,3,3,1,0,0,0,0,"","Serviço","Serviço","-","SINAPI",96546,"ARMAÇÃO DE BLOCO, VIGA BALDRAME OU SAPATA UTILIZANDO AÇO CA-50 DE 10 MM - MONTAGEM. AF_06/2017","KG",24.99,null,null,0,"Referência: AGETOP - 52005","SIM","AGETOP",52005,"(sem código)","-",0,0]
["S",3,"S",0,3,3,1,0,0,0,0,"","Serviço","Serviço","-","SINAPI",96543,"ARMAÇÃO DE BLOCO, VIGA BALDRAME E SAPATA UTILIZANDO AÇO CA-60 DE 5 MM - MONTAGEM. AF_06/2017","KG",36.79,null,null,0,"Referência: AGETOP - 52014","SIM","AGETOP",52014,"(sem código)","-",0,0]
[3,3,3,11,3,3,2,0,0,11,28,"","Nível 3","Nível 3","-","SINAPI",null,"VIGAS BALDRAMES","-",null,null,null,0,"",null,null,null,"VIGAS BALDRAMES","-",0,0]
["S",3,"S",0,3,3,2,0,0,0,0,"","Serviço","Serviço","-","SINAPI",96527,"ESCAVAÇÃO MANUAL DE VALA PARA VIGA BALDRAME, COM PREVISÃO DE FÔRMA. AF_06/2017","M3",5.6750400000000019,null,null,0,"Referência: AGETOP - 40101","SIM","AGETOP",40101,"(sem código)","-",0,0]
["S",3,"S",0,3,3,2,0,0,0,0,"","Serviço","Serviço","-","SINAPI",94103,"LASTRO DE VALA COM PREPARO DE FUNDO, LARGURA MENOR QUE 1,5 M, COM CAMADA DE BRITA, LANÇAMENTO MANUAL, EM LOCAL COM NÍVEL BAIXO DE INTERFERÊNCIA. AF_06/2016","M3",0.40536000000000005,null,null,0,"Referência: AGETOP - 51027","SIM","AGETOP",51027,"(sem código)","-",0,0]
["S",3,"S",0,3,3,2,0,0,0,0,"","Serviço","Serviço","-","SINAPI",96995,"REATERRO MANUAL APILOADO COM SOQUETE. AF_10/2017","M3",4.0536000000000021,null,null,0,"Referência: AGETOP - 50903","SIM","AGETOP",50903,"(sem código)","-",0,0]
["S",3,"S",0,3,3,2,0,0,0,0,"","Serviço","Serviço","-","AGETOP",60191,"FORMA DE TABUA CINTA BALDRAME U=8 VEZES","m2    ",27.024000000000001,null,null,0,"",null,null,null,"(sem código)","-",0,0]
["S",3,"S",0,3,3,2,0,0,0,0,"","Serviço","Serviço","-","SINAPI",94964,"CONCRETO FCK = 20MPA, TRAÇO 1:2,7:3 (CIMENTO/ AREIA MÉDIA/ BRITA 1)  - PREPARO MECÂNICO COM BETONEIRA 400 L. AF_07/2016","M3",1.62144,null,null,0,"","NÃO","AGETOP",60512,"(sem código)","-",0,0]
["S",3,"S",0,3,3,2,0,0,{"$f":"IF(OR($C490=\"S\",$C490=0),0,MATCH(0,OFFSET($D490,1,$C490,ROW($C$648)-ROW($C490)),0))","v":0},{"$f":"IF(OR($C490=\"S\",$C490=0),0,MATCH(OFFSET($D490,0,$C490)+1,OFFSET($D490,1,$C490,ROW($C$648)-ROW($C490)),0))","v":0},"","Serviço","Serviço","-","SINAPI",92873,"LANÇAMENTO COM USO DE BALDES, ADENSAMENTO E ACABAMENTO DE CONCRETO EM ESTRUTURAS. AF_12/2015","M3",1.62144,null,null,0,"Referência: AGETOP - 51055","SIM","AGETOP",51055,"(sem código)","-",0,0]
["S",3,"S",0,3,3,2,0,0,0,0,"","Serviço","Serviço","-","SINAPI",96544,"ARMAÇÃO DE BLOCO, VIGA BALDRAME OU SAPATA UTILIZANDO AÇO CA-50 DE 6,3 MM - MONTAGEM. AF_06/2017","KG",49.29,null,null,0,"Referência: AGETOP - 52003","SIM","AGETOP",52003,"(sem código)","-",0,0]
["S",3,"S",0,3,3,2,0,0,0,0,"","Serviço","Serviço","-","SINAPI",96545,"ARMAÇÃO DE BLOCO, VIGA BALDRAME OU SAPATA UTILIZANDO AÇO CA-50 DE 8 MM - MONTAGEM. AF_06/2017","KG",30.49,null,null,0,"Referência: AGETOP - 52004","SIM","AGETOP",52004,"(sem código)","-",0,0]
["S",3,"S",0,3,3,2,0,0,0,0,"","Serviço","Serviço","-","SINAPI",96546,"ARMAÇÃO DE BLOCO, VIGA BALDRAME OU SAPATA UTILIZANDO AÇO CA-50 DE 10 MM - MONTAGEM. AF_06/2017","KG",12.15,null,null,0,"Referência: AGETOP - 52005","SIM","AGETOP",52005,"(sem código)","-",0,0]
["S",3,"S",0,3,3,2,0,0,0,0,"","Serviço","Serviço","-","SINAPI",96543,"ARMAÇÃO DE BLOCO, VIGA BALDRAME E SAPATA UTILIZANDO AÇO CA-60 DE 5 MM - MONTAGEM. AF_06/2017","KG",55.9,null,null,0,"Referência: AGETOP - 52014","SIM","AGETOP",52014,"(sem código)","-",0,0]
[2,2,2,19,3,4,0,0,0,153,19,"","Nível 2","Nível 2","-","SINAPI",null,"ESTRUTURA","-",null,null,null,0,"",null,null,null,"ESTRUTURA","-",0,0]
[3,3,3,7,3,4,1,0,0,18,7,"","Nível 3","Nível 3","-","SINAPI",null,"PILARES","-",null,null,null,0,"",null,null,null,"PILARES","-",0,0]
["S",3,"S",0,3,4,1,0,0,0,0,"","Serviço","Serviço","-","SINAPI",92418,"MONTAGEM E DESMONTAGEM DE FÔRMA DE PILARES RETANGULARES E ESTRUTURAS SIMILARES COM ÁREA MÉDIA DAS SEÇÕES MENOR OU IGUAL A 0,25 M², PÉ-DIREITO SIMPLES, EM CHAPA DE MADEIRA COMPENSADA RESINADA, 4 UTILIZAÇÕES. AF_12/2015","M2",18.143999999999998,null,null,0,"Referência: AGETOP - 60209","SIM","AGETOP",60209,"(sem código)","-",0,0]
["S",3,"S",0,3,4,1,0,0,0,0,"","Serviço","Serviço","-","SINAPI",94964,"CONCRETO FCK = 20MPA, TRAÇO 1:2,7:3 (CIMENTO/ AREIA MÉDIA/ BRITA 1)  - PREPARO MECÂNICO COM BETONEIRA 400 L. AF_07/2016","M3",0.72575999999999996,null,null,0,"","NÃO","AGETOP",60512,"(sem código)","-",0,0]
["S",3,"S",0,3,4,1,0,0,0,0,"","Serviço","Serviço","-","SINAPI",92873,"LANÇAMENTO COM USO DE BALDES, ADENSAMENTO E ACABAMENTO DE CONCRETO EM ESTRUTURAS. AF_12/2015","M3",0.72575999999999996,null,null,0,"Referência: AGETOP - 51055","SIM","AGETOP",51055,"(sem código)","-",0,0]
["S",3,"S",0,3,4,1,0,0,0,0,"","Serviço","Serviço","-","SINAPI",92777,"ARMAÇÃO DE PILAR OU VIGA DE UMA ESTRUTURA CONVENCIONAL DE CONCRETO ARMADO EM UMA EDIFICAÇÃO TÉRREA OU SOBRADO UTILIZANDO AÇO CA-50 DE 8,0 MM - MONTAGEM. AF_12/2015","KG",24.49,null,null,0,"Referência: AGETOP - 52004","SIM","AGETOP",52004,"(sem código)","-",0,0]
["S",3,"S",0,3,4,1,0,0,0,0,"","Serviço","Serviço","-","SINAPI",92778,"ARMAÇÃO DE PILAR OU VIGA DE UMA ESTRUTURA CONVENCIONAL DE CONCRETO ARMADO EM UMA EDIFICAÇÃO TÉRREA OU SOBRADO UTILIZANDO AÇO CA-50 DE 10,0 MM - MONTAGEM. AF_12/2015","KG",87.29,null,null,0,"Referência: AGETOP - 52005","SIM","AGETOP",52005,"(sem código)","-",0,0]
["S",3,"S",0,3,4,1,0,0,0,0,"","Serviço","Serviço","-","SINAPI",92775,"ARMAÇÃO DE PILAR OU VIGA DE UMA ESTRUTURA CONVENCIONAL DE CONCRETO ARMADO EM UMA EDIFICAÇÃO TÉRREA OU SOBRADO UTILIZANDO AÇO CA-60 DE 5,0 MM - MONTAGEM. AF_12/2015","KG",30.95,null,null,0,"Referência: AGETOP - 52014","SIM","AGETOP",52014,"(sem código)","-",0,0]
[3,3,3,9,3,4,2,0,0,11,9,"","Nível 3","Nível 3","-","SINAPI",null,"VIGAS DE COBERTURA","-",null,null,null,0,"",null,null,null,"VIGAS DE COBERTURA","-",0,0]
["S",3,"S",0,3,4,2,0,0,0,0,"","Serviço","Serviço","-","SINAPI",92475,"MONTAGEM E DESMONTAGEM DE FÔRMA DE VIGA, ESCORAMENTO COM GARFO DE MADEIRA, PÉ-DIREITO SIMPLES, EM CHAPA DE MADEIRA PLASTIFICADA, 14 UTILIZAÇÕES. AF_12/2015","M2",35.1312,null,null,0,"Referência: AGETOP - 60209","SIM","AGETOP",60209,"(sem código)","-",0,0]
["S",3,"S",0,3,4,2,0,0,0,0,"","Serviço","Serviço","-","SINAPI",94964,"CONCRETO FCK = 20MPA, TRAÇO 1:2,7:3 (CIMENTO/ AREIA MÉDIA/ BRITA 1)  - PREPARO MECÂNICO COM BETONEIRA 400 L. AF_07/2016","M3",1.62144,null,null,0,"","NÃO","AGETOP",60512,"(sem código)","-",0,0]
["S",3,"S",0,3,4,2,0,0,0,0,"","Serviço","Serviço","-","SINAPI",92873,"LANÇAMENTO COM USO DE BALDES, ADENSAMENTO E ACABAMENTO DE CONCRETO EM ESTRUTURAS. AF_12/2015","M3",1.62144,null,null,0,"Referência: AGETOP - 51055","SIM","AGETOP",51055,"(sem código)","-",0,0]
["S",3,"S",0,3,4,2,0,0,0,0,"","Serviço","Serviço","-","SINAPI",92776,"ARMAÇÃO DE PILAR OU VIGA DE UMA ESTRUTURA CONVENCIONAL DE CONCRETO ARMADO EM UMA EDIFICAÇÃO TÉRREA OU SOBRADO UTILIZANDO AÇO CA-50 DE 6,3 MM - MONTAGEM. AF_12/2015","KG",30.09,null,null,0,"Referência: AGETOP - 52003","SIM","AGETOP",52003,"(sem código)","-",0,0]
["S",3,"S",0,3,4,2,0,0,0,0,"","Serviço","Serviço","-","SINAPI",92777,"ARMAÇÃO DE PILAR OU VIGA DE UMA ESTRUTURA CONVENCIONAL DE CONCRETO ARMADO EM UMA EDIFICAÇÃO TÉRREA OU SOBRADO UTILIZANDO AÇO CA-50 DE 8,0 MM - MONTAGEM. AF_12/2015","KG",4.49,null,null,0,"Referência: AGETOP - 52004","SIM","AGETOP",52004,"(sem código)","-",0,0]
["S",3,"S",0,3,4,2,0,0,0,0,"","Serviço","Serviço","-","SINAPI",92778,"ARMAÇÃO DE PILAR OU VIGA DE UMA ESTRUTURA CONVENCIONAL DE CONCRETO ARMADO EM UMA EDIFICAÇÃO TÉRREA OU SOBRADO UTILIZANDO AÇO CA-50 DE 10,0 MM - MONTAGEM. AF_12/2015","KG",51.33,null,null,0,"Referência: AGETOP - 52005","SIM","AGETOP",52005,"(sem código)","-",0,0]
["S",3,"S",0,3,4,2,0,0,0,0,"","Serviço","Serviço","-","SINAPI",92779,"ARMAÇÃO DE PILAR OU VIGA DE UMA ESTRUTURA CONVENCIONAL DE CONCRETO ARMADO EM UMA EDIFICAÇÃO TÉRREA OU SOBRADO UTILIZANDO AÇO CA-50 DE 12,5 MM - MONTAGEM. AF_12/2015","KG",36.590000000000003,null,null,0,"Referência: AGETOP - 52006","SIM","AGETOP",52006,"(sem código)","-",0,0]
["S",3,"S",0,3,4,2,0,0,0,0,"","Serviço","Serviço","-","SINAPI",92775,"ARMAÇÃO DE PILAR OU VIGA DE UMA ESTRUTURA CONVENCIONAL DE CONCRETO ARMADO EM UMA EDIFICAÇÃO TÉRREA OU SOBRADO UTILIZANDO AÇO CA-60 DE 5,0 MM - MONTAGEM. AF_12/2015","KG",43.37,null,null,0,"Referência: AGETOP - 52014","SIM","AGETOP",52014,"(sem código)","-",0,0]
[3,3,3,2,3,4,3,0,0,2,{"$error":"#N/A"},"","Nível 3","Nível 3","-","SINAPI",null,"LAJE","-",null,null,null,0,"",null,null,null,"LAJE","-",0,0]
["S",3,"S",0,3,4,3,0,0,0,0,"","Serviço","Serviço","-","SINAPI","74202/1","LAJE PRE-MOLDADA P/FORRO, SOBRECARGA 100KG/M2, VAOS ATE 3,50M/E=8CM, C/LAJOTAS E CAP.C/CONC FCK=20MPA, 3CM, INTER-EIXO 38CM, C/ESCORAMENTO (REAPR.3X) E FERRAGEM NEGATIVA","M2",55.42,null,null,0,"","NÃO","AGETOP",61101,"(sem código)","-",0,0]
[2,2,2,25,3,5,0,0,0,134,25,"","Nível 2","Nível 2","-","SINAPI",null,"INSTALAÇÕES ELÉTRICAS","-",null,null,null,0,"",null,null,null,"INSTALAÇÕES ELÉTRICAS","-",0,0]
["S",2,"S",0,3,5,0,0,0,0,0,"","Serviço","Serviço","-","SINAPI",91173,"FIXAÇÃO DE TUBOS VERTICAIS DE PPR DIÂMETROS MENORES OU IGUAIS A 40 MM COM ABRAÇADEIRA METÁLICA RÍGIDA TIPO D 1/2\", FIXADA EM PERFILADO EM ALVENARIA. AF_05/2015","M",30,null,null,0,"",null,null,null,"(sem código)","-",0,0]
["S",2,"S",0,3,5,0,0,0,0,0,"","Serviço","Serviço","-","SINAPI",91168,"FIXAÇÃO DE TUBOS HORIZONTAIS DE PPR DIÂMETROS MAIORES QUE 40 MM E MENORES OU IGUAIS A 75 MM COM ABRAÇADEIRA METÁLICA RÍGIDA TIPO D 1 1/2\", FIXADA EM PERFILADO EM LAJE. AF_05/2015","M",18,null,null,0,"",null,null,null,"(sem código)","-",0,0]
["S",2,"S",0,3,5,0,0,0,0,0,"","Serviço","Serviço","-","SINAPI",91872,"ELETRODUTO RÍGIDO ROSCÁVEL, PVC, DN 32 MM (1\"), PARA CIRCUITOS TERMINAIS, INSTALADO EM PAREDE - FORNECIMENTO E INSTALAÇÃO. AF_12/2015","M",30,null,null,0,"Referência: AGETOP - 71202","SIM","AGETOP",71202,"(sem código)","-",0,0]
["S",2,"S",0,3,5,0,0,0,0,0,"","Serviço","Serviço","-","SINAPI",91885,"LUVA PARA ELETRODUTO, PVC, ROSCÁVEL, DN 32 MM (1\"), PARA CIRCUITOS TERMINAIS, INSTALADA EM PAREDE - FORNECIMENTO E INSTALAÇÃO. AF_12/2015","UN",10,null,null,0,"Referência: AGETOP - 71742","SIM","AGETOP",71742,"(sem código)","-",0,0]
["S",2,"S",0,3,5,0,0,0,0,0,"","Serviço","Serviço","-","SINAPI",93009,"ELETRODUTO RÍGIDO ROSCÁVEL, PVC, DN 60 MM (2\") - FORNECIMENTO E INSTALAÇÃO. AF_12/2015","M",20,null,null,0,"","NÃO","AGETOP",71205,"(sem código)","-",0,0]
["S",2,"S",0,3,5,0,0,0,0,0,"","Serviço","Serviço","-","SINAPI",93014,"LUVA PARA ELETRODUTO, PVC, ROSCÁVEL, DN 60 MM (2\") - FORNECIMENTO E INSTALAÇÃO. AF_12/2015","UN",6,null,null,0,"Referência: AGETOP - 71745","SIM","AGETOP",71745,"(sem código)","-",0,0]
[{"$f":"CHOOSE(1+LOG(1+2*(ORÇAMENTO.Nivel=\"Nível 1\")+4*(ORÇAMENTO.Nivel=\"Nível 2\")+8*(ORÇAMENTO.Nivel=\"Nível 3\")+16*(ORÇAMENTO.Nivel=\"Nível 4\")+32*(ORÇAMENTO.Nivel=\"Serviço\"),2),0,1,2,3,4,\"S\")","v":"S"},{"$f":"IF(OR(C521=\"s\",C521=0),OFFSET(B521,-1,0),C521)","v":2},{"$f":"IF(OFFSET(C521,-1,0)=\"L\",1,IF(OFFSET(C521,-1,0)=1,2,IF(OR(A521=\"s\",A521=0),\"S\",IF(AND(OFFSET(C521,-1,0)=2,A521=4),3,IF(AND(OR(OFFSET(C521,-1,0)=\"s\",OFFSET(C521,-1,0)=0),A521<>\"s\",A521>OFFSET(B521,-1,0)),OFFSET(B521,-1,0),A521)))))","v":"S"},{"$f":"IF(OR(C521=\"S\",C521=0),0,IF(ISERROR(K521),J521,SMALL(J521:K521,1)))","v":0},{"$f":"IF($C521=1,OFFSET(E521,-1,0)+1,OFFSET(E521,-1,0))","v":3},{"$f":"IF($C521=1,0,IF($C521=2,OFFSET(F521,-1,0)+1,OFFSET(F521,-1,0)))","v":5},{"$f":"IF(AND($C521<=2,$C521<>0),0,IF($C521=3,OFFSET(G521,-1,0)+1,OFFSET(G521,-1,0)))","v":0},{"$f":"IF(AND($C521<=3,$C521<>0),0,IF($C521=4,OFFSET(H521,-1,0)+1,OFFSET(H521,-1,0)))","v":0},{"$f":"IF(AND($C521<=4,$C521<>0),0,IF(AND($C521=\"S\",$W521>0),OFFSET(I521,-1,0)+1,OFFSET(I521,-1,0)))","v":0},0,0,"","Serviço","Serviço","-","SINAPI",91905,"CURVA 90 GRAUS PARA ELETRODUTO, PVC, ROSCÁVEL, DN 32 MM (1\"), PARA CIRCUITOS TERMINAIS, INSTALADA EM LAJE - FORNECIMENTO E INSTALAÇÃO. AF_12/2015","UN",2,null,null,0,"Referência: AGETOP - 71142","SIM","AGETOP",71142,{"$f":"IFERROR(IF(OR($C521=0,$C521=1,$C521=2,$C521=3,$C521=4),R521,VLOOKUP($AA521,INDIRECT($Z521),2,FALSE)),\"(sem código)\")","v":"(sem código)"},{"$f":"IFERROR(VLOOKUP(AA521,INDIRECT(Z521),3,FALSE()),\"-\")","v":"-"},{"$f":"IFERROR(VLOOKUP($AA521,INDIRECT($Z521),IF($W$10=\"DESONERADA\",4,7),FALSE()),0)","v":0},{"$f":"IFERROR(VLOOKUP($AA521,INDIRECT($Z521),IF($W$10=\"DESONERADA\",5,8),FALSE()),0)","v":0}]
["S",2,"S",0,3,5,0,0,0,0,0,"","Serviço","Serviço","-","SINAPI",93020,"CURVA 90 GRAUS PARA ELETRODUTO, PVC, ROSCÁVEL, DN 60 MM (2\") - FORNECIMENTO E INSTALAÇÃO. AF_12/2015","UN",2,null,null,0,"",null,null,null,"(sem código)","-",0,0]
["S",2,"S",0,3,5,0,0,0,0,0,"","Serviço","Serviço","-","SINAPI",91927,"CABO DE COBRE FLEXÍVEL ISOLADO, 2,5 MM², ANTI-CHAMA 0,6/1,0 KV, PARA CIRCUITOS TERMINAIS - FORNECIMENTO E INSTALAÇÃO. AF_12/2015","M",150,null,null,0,"Referência: AGETOP - 70581","SIM","AGETOP",70581,"(sem código)","-",0,0]
["S",2,"S",0,3,5,0,0,0,0,0,"","Serviço","Serviço","-","SINAPI",91931,"CABO DE COBRE FLEXÍVEL ISOLADO, 6 MM², ANTI-CHAMA 0,6/1,0 KV, PARA CIRCUITOS TERMINAIS - FORNECIMENTO E INSTALAÇÃO. AF_12/2015","M",200,null,null,0,"Referência: AGETOP - 70583","SIM","AGETOP",70583,"(sem código)","-",0,0]
["S",2,"S",0,3,5,0,0,0,0,0,"","Serviço","Serviço","-","SINAPI",97591,"LUMINÁRIA TIPO PLAFON REDONDO COM VIDRO FOSCO, DE SOBREPOR, COM 2 LÂMPADAS DE 15 W - FORNECIMENTO E INSTALAÇÃO. AF_11/2017","UN",8,null,null,0,"","NÃO","AGETOP",71645,"(sem código)","-",0,0]
["S",2,"S",0,3,5,0,0,0,0,0,"","Serviço","Serviço","-","SINAPI",91940,"CAIXA RETANGULAR 4\" X 2\" MÉDIA (1,30 M DO PISO), PVC, INSTALADA EM PAREDE - FORNECIMENTO E INSTALAÇÃO. AF_12/2015","UN",12,null,null,0,"",null,null,null,"(sem código)","-",0,0]
["S",2,"S",0,3,5,0,0,0,0,0,"","Serviço","Serviço","-","SINAPI",83446,"CAIXA DE PASSAGEM 30X30X40 COM TAMPA E DRENO BRITA","UN",1,null,null,0,"",null,null,null,"(sem código)","-",0,0]
["S",2,"S",0,3,5,0,0,0,0,0,"","Serviço","Serviço","-","SINAPI",93654,"DISJUNTOR MONOPOLAR TIPO DIN, CORRENTE NOMINAL DE 16A - FORNECIMENTO E INSTALAÇÃO. AF_04/2016","UN",1,null,null,0,"","NÃO","AGETOP",71171,"(sem código)","-",0,0]
["S",2,"S",0,3,5,0,0,0,0,0,"","Serviço","Serviço","-","SINAPI",93670,"DISJUNTOR TRIPOLAR TIPO DIN, CORRENTE NOMINAL DE 25A - FORNECIMENTO E INSTALAÇÃO. AF_04/2016","UN",8,null,null,0,"",null,null,null,"(sem código)","-",0,0]
["S",2,"S",0,3,5,0,0,0,0,0,"","Serviço","Serviço","-","SINAPI",93672,"DISJUNTOR TRIPOLAR TIPO DIN, CORRENTE NOMINAL DE 40A - FORNECIMENTO E INSTALAÇÃO. AF_04/2016","UN",1,null,null,0,"",null,null,null,"(sem código)","-",0,0]
["S",2,"S",0,3,5,0,0,0,0,0,"","Serviço","Serviço","-","AGETOP",71331,"FITA ISOLANTE, ROLO DE 20,00 M","Un    ",1,null,null,0,"",null,null,null,"(sem código)","-",0,0]
["S",2,"S",0,3,5,0,0,0,0,0,"","Serviço","Serviço","-","AGETOP",71321,"FITA DE AUTO FUSAO, ROLO E 10,00 MM","Un    ",1,null,null,0,"",null,null,null,"(sem código)","-",0,0]
["S",2,"S",0,3,5,0,0,0,0,0,"","Serviço","Serviço","-","SINAPI",93043,"LÂMPADA LED 10 W BIVOLT BRANCA, FORMATO TRADICIONAL (BASE E27) - FORNECIMENTO E INSTALAÇÃO","UN",16,null,null,0,"",null,null,null,"(sem código)","-",0,0]
["S",2,"S",0,3,5,0,0,0,0,0,"","Serviço","Serviço","-","AGETOP",71450,"INTERRUPTOR DIFERENCIAL RESIDUAL (D.R.) BIPOLAR DE 25A-30mA","Un    ",8,null,null,0,"",null,null,null,"(sem código)","-",0,0]
["S",2,"S",0,3,5,0,0,0,0,0,"","Serviço","Serviço","-","SINAPI","74131/4","QUADRO DE DISTRIBUICAO DE ENERGIA DE EMBUTIR, EM CHAPA METALICA, PARA 18 DISJUNTORES TERMOMAGNETICOS MONOPOLARES, COM BARRAMENTO TRIFASICO E NEUTRO, FORNECIMENTO E INSTALACAO","UN",1,null,null,0,"","NÃO","AGETOP",72190,"(sem código)","-",0,0]
["S",2,"S",0,3,5,0,0,0,0,0,"","Serviço","Serviço","-","SINAPI",91996,"TOMADA MÉDIA DE EMBUTIR (1 MÓDULO), 2P+T 10 A, INCLUINDO SUPORTE E PLACA - FORNECIMENTO E INSTALAÇÃO. AF_12/2015","UN",4,null,null,0,"Referência: AGETOP - 72578","SIM","AGETOP",72578,"(sem código)","-",0,0]
["S",2,"S",0,3,5,0,0,0,0,0,"","Serviço","Serviço","-","SINAPI",91991,"TOMADA ALTA DE EMBUTIR (1 MÓDULO), 2P+T 20 A, SEM SUPORTE E SEM PLACA - FORNECIMENTO E INSTALAÇÃO. AF_12/2015","UN",8,null,null,0,"",null,null,null,"(sem código)","-",0,0]
["S",2,"S",0,3,5,0,0,0,0,0,"","Serviço","Serviço","-","SINAPI",97599,"LUMINÁRIA DE EMERGÊNCIA - FORNECIMENTO E INSTALAÇÃO. AF_11/2017","UN",2,null,null,0,"",null,null,null,"(sem código)","-",0,0]
[2,2,2,68,3,6,0,0,0,109,68,"","Nível 2","Nível 2","-","SINAPI",null,"INSTALAÇÕES HIDROSSANITÁRIAS","-",null,null,null,0,"",null,null,null,"INSTALAÇÕES HIDROSSANITÁRIAS","-",0,0]
[3,3,3,67,3,6,1,0,0,67,{"$error":"#N/A"},"","Nível 3","Nível 3","-","SINAPI",null,"PEÇAS E ACESSÓRIOS","-",null,null,null,0,"",null,null,null,"PEÇAS E ACESSÓRIOS","-",0,0]
["S",3,"S",0,3,6,1,0,0,0,0,"","Serviço","Serviço","-","SINAPI",95470,"VASO SANITARIO SIFONADO CONVENCIONAL COM LOUÇA BRANCA, INCLUSO CONJUNTO DE LIGAÇÃO PARA BACIA SANITÁRIA AJUSTÁVEL - FORNECIMENTO E INSTALAÇÃO. AF_10/2016","UN",4,null,null,0,"",null,null,null,"(sem código)","-",0,0]
["S",3,"S",0,3,6,1,0,0,0,0,"","Serviço","Serviço","-","SINAPI",99635,"VÁLVULA DE DESCARGA METÁLICA, BASE 1 1/2 \", ACABAMENTO METALICO CROMADO - FORNECIMENTO E INSTALAÇÃO. AF_01/2019","UN",4,null,null,0,"Referência: AGETOP - 80515","SIM","AGETOP",80515,"(sem código)","-",0,0]
["S",3,"S",0,3,6,1,0,0,0,0,"","Serviço","Serviço","-","AGETOP",80526,"ASSENTO EM POLIPROPILENO COM SISTEMA DE FECHAMENTO SUAVE PARA VASO SANITÁRIO","Un    ",4,null,null,0,"Referência: AGETOP - 80526","SIM","AGETOP",80526,"(sem código)","-",0,0]
["S",3,"S",0,3,6,1,0,0,0,0,"","Serviço","Serviço","-","SINAPI",95544,"PAPELEIRA DE PAREDE EM METAL CROMADO SEM TAMPA, INCLUSO FIXAÇÃO. AF_10/2016","UN",4,null,null,0,"","NÃO","AGETOP",80530,"(sem código)","-",0,0]
["S",3,"S",0,3,6,1,0,0,0,0,"","Serviço","Serviço","-","SINAPI",86884,"ENGATE FLEXÍVEL EM PLÁSTICO BRANCO, 1/2\" X 30CM - FORNECIMENTO E INSTALAÇÃO. AF_12/2013","UN",8,null,null,0,"",null,null,null,"(sem código)","-",0,0]
["S",3,"S",0,3,6,1,0,0,0,0,"","Serviço","Serviço","-","SINAPI",86903,"LAVATÓRIO LOUÇA BRANCA COM COLUNA, 45 X 55CM OU EQUIVALENTE, PADRÃO MÉDIO - FORNECIMENTO E INSTALAÇÃO. AF_12/2013","UN",6,null,null,0,"Referência: AGETOP - 80541","SIM","AGETOP",80541,"(sem código)","-",0,0]
["S",3,"S",0,3,6,1,0,0,0,0,"","Serviço","Serviço","-","AGETOP",80550,"FIXACAO P/LAVATORIO (PAR)","PAR   ",6,null,null,0,"",null,null,null,"(sem código)","-",0,0]
["S",3,"S",0,3,6,1,0,0,0,0,"","Serviço","Serviço","-","SINAPI",86906,"TORNEIRA CROMADA DE MESA, 1/2\" OU 3/4\", PARA LAVATÓRIO, PADRÃO POPULAR - FORNECIMENTO E INSTALAÇÃO. AF_12/2013","UN",8,null,null,0,"",null,null,null,"(sem código)","-",0,0]
["S",3,"S",0,3,6,1,0,0,0,0,"","Serviço","Serviço","-","SINAPI",86883,"SIFÃO DO TIPO FLEXÍVEL EM PVC 1\u0094 X 1.1/2\u0094 - FORNECIMENTO E INSTALAÇÃO. AF_12/2013","UN",8,null,null,0,"","NÃO","AGETOP",80561,"(sem código)","-",0,0]
["S",3,"S",0,3,6,1,0,0,0,0,"","Serviço","Serviço","-","SINAPI",86877,"VÁLVULA EM METAL CROMADO 1.1/2\" X 1.1/2\" PARA TANQUE OU LAVATÓRIO, COM OU SEM LADRÃO - FORNECIMENTO E INSTALAÇÃO. AF_12/2013","UN",8,null,null,0,"Referência: AGETOP - 80830","SIM","AGETOP",80830,"(sem código)","-",0,0]
["S",3,"S",0,3,6,1,0,0,0,0,"","Serviço","Serviço","-","SINAPI",86901,"CUBA DE EMBUTIR OVAL EM LOUÇA BRANCA, 35 X 50CM OU EQUIVALENTE - FORNECIMENTO E INSTALAÇÃO. AF_12/2013","UN",2,null,null,0,"Referência: AGETOP - 80587","SIM","AGETOP",80587,"(sem código)","-",0,0]
["S",3,"S",0,3,6,1,0,0,0,0,"","Serviço","Serviço","-","SINAPI","74234/1","MICTORIO SIFONADO DE LOUCA BRANCA COM PERTENCES, COM REGISTRO DE PRESSAO 1/2\" COM CANOPLA CROMADA ACABAMENTO SIMPLES E CONJUNTO PARA FIXACAO  - FORNECIMENTO E INSTALACAO","UN",2,null,null,0,"Referência: AGETOP - 80601","SIM","AGETOP",80601,"(sem código)","-",0,0]
["S",3,"S",0,3,6,1,0,0,0,0,"","Serviço","Serviço","-","AGETOP",81501,"ADESIVO PLASTICO - FRASCO 850 G","Un    ",8,null,null,0,"",null,null,null,"(sem código)","-",0,0]
["S",3,"S",0,3,6,1,0,0,{"$f":"IF(OR($C554=\"S\",$C554=0),0,MATCH(0,OFFSET($D554,1,$C554,ROW($C$648)-ROW($C554)),0))","v":0},{"$f":"IF(OR($C554=\"S\",$C554=0),0,MATCH(OFFSET($D554,0,$C554)+1,OFFSET($D554,1,$C554,ROW($C$648)-ROW($C554)),0))","v":0},"","Serviço","Serviço","-","AGETOP",80730,"CABIDE TIPO GANCHO EM LOUÇA","Un    ",8,null,null,0,"",null,null,null,"(sem código)","-",0,0]
["S",3,"S",0,3,6,1,0,0,0,0,"","Serviço","Serviço","-","SINAPI",95547,"SABONETEIRA PLASTICA TIPO DISPENSER PARA SABONETE LIQUIDO COM RESERVATORIO 800 A 1500 ML, INCLUSO FIXAÇÃO. AF_10/2016","UN",8,null,null,0,"",null,null,null,"(sem código)","-",0,0]
["S",3,"S",0,3,6,1,0,0,0,0,"","Serviço","Serviço","-","SINAPI",89353,"REGISTRO DE GAVETA BRUTO, LATÃO, ROSCÁVEL, 3/4\", FORNECIDO E INSTALADO EM RAMAL DE ÁGUA. AF_12/2014","UN",9,null,null,0,"Referência: AGETOP - 80902","SIM","AGETOP",80902,"(sem código)","-",0,0]
["S",3,"S",0,3,6,1,0,0,0,0,"","Serviço","Serviço","-","AGETOP",80927,"REGISTRO DE GAVETA C/CANOPLA DIAMETRO 1\"","Un    ",2,null,null,0,"",null,null,null,"(sem código)","-",0,0]
["S",3,"S",0,3,6,1,0,0,0,0,"","Serviço","Serviço","-","SINAPI",89351,"REGISTRO DE PRESSÃO BRUTO, LATÃO,  ROSCÁVEL, 3/4\u0094, FORNECIDO E INSTALADO EM RAMAL DE ÁGUA. AF_12/2014","UN",8,null,null,0,"",null,null,null,"(sem código)","-",0,0]
["S",3,"S",0,3,6,1,0,0,0,0,"","Serviço","Serviço","-","SINAPI",89446,"TUBO, PVC, SOLDÁVEL, DN 25MM, INSTALADO EM PRUMADA DE ÁGUA - FORNECIMENTO E INSTALAÇÃO. AF_12/2014","M",42,null,null,0,"",null,null,null,"(sem código)","-",0,0]
["S",3,"S",0,3,6,1,0,0,0,0,"","Serviço","Serviço","-","SINAPI",89447,"TUBO, PVC, SOLDÁVEL, DN 32MM, INSTALADO EM PRUMADA DE ÁGUA - FORNECIMENTO E INSTALAÇÃO. AF_12/2014","M",15,null,null,0,"","NÃO","AGETOP",81004,"(sem código)","-",0,0]
["S",3,"S",0,3,6,1,0,0,0,0,"","Serviço","Serviço","-","SINAPI",89449,"TUBO, PVC, SOLDÁVEL, DN 50MM, INSTALADO EM PRUMADA DE ÁGUA - FORNECIMENTO E INSTALAÇÃO. AF_12/2014","M",15,null,null,0,"","NÃO","AGETOP",81006,"(sem código)","-",0,0]
["S",3,"S",0,3,6,1,0,0,0,0,"","Serviço","Serviço","-","SINAPI",89450,"TUBO, PVC, SOLDÁVEL, DN 60MM, INSTALADO EM PRUMADA DE ÁGUA - FORNECIMENTO E INSTALAÇÃO. AF_12/2014","M",72,null,null,0,"",null,null,null,"(sem código)","-",0,0]
["S",3,"S",0,3,6,1,0,0,0,0,"","Serviço","Serviço","-","SINAPI",94656,"ADAPTADOR CURTO COM BOLSA E ROSCA PARA REGISTRO, PVC, SOLDÁVEL, DN  25 MM X 3/4 , INSTALADO EM RESERVAÇÃO DE ÁGUA DE EDIFICAÇÃO QUE POSSUA RESERVATÓRIO DE FIBRA/FIBROCIMENTO   FORNECIMENTO E INSTALAÇÃO. AF_06/2016","UN",26,null,null,0,"",null,null,null,"(sem código)","-",0,0]
["S",3,"S",0,3,6,1,0,0,0,0,"","Serviço","Serviço","-","SINAPI",89436,"ADAPTADOR CURTO COM BOLSA E ROSCA PARA REGISTRO, PVC, SOLDÁVEL, DN 32MM X 1\u0094, INSTALADO EM RAMAL DE DISTRIBUIÇÃO DE ÁGUA - FORNECIMENTO E INSTALAÇÃO. AF_12/2014","UN",4,null,null,0,"",null,null,null,"(sem código)","-",0,0]
["S",3,"S",0,3,6,1,0,0,0,0,"","Serviço","Serviço","-","SINAPI",89596,"ADAPTADOR CURTO COM BOLSA E ROSCA PARA REGISTRO, PVC, SOLDÁVEL, DN 50MM X 1.1/2\u0094, INSTALADO EM PRUMADA DE ÁGUA - FORNECIMENTO E INSTALAÇÃO. AF_12/2014","UN",4,null,null,0,"",null,null,null,"(sem código)","-",0,0]
["S",3,"S",0,3,6,1,0,0,0,0,"","Serviço","Serviço","-","SINAPI",94657,"LUVA PVC, SOLDÁVEL, DN  25 MM, INSTALADA EM RESERVAÇÃO DE ÁGUA DE EDIFICAÇÃO QUE POSSUA RESERVATÓRIO DE FIBRA/FIBROCIMENTO   FORNECIMENTO E INSTALAÇÃO. AF_06/2016","UN",4,null,null,0,"",null,null,null,"(sem código)","-",0,0]
["S",3,"S",0,3,6,1,0,0,0,0,"","Serviço","Serviço","-","AGETOP",81162,"BUCHA DE REDUCAO SOLD.CURTA 32 X 25 MM","Un    ",3,null,null,0,"",null,null,null,"(sem código)","-",0,0]
["S",3,"S",0,3,6,1,0,0,0,0,"","Serviço","Serviço","-","AGETOP",81165,"BUCHA DE REDUCAO SOLD. CURTA 60 X 50 mm","Un    ",4,null,null,0,"",null,null,null,"(sem código)","-",0,0]
["S",3,"S",0,3,6,1,0,0,0,0,"","Serviço","Serviço","-","AGETOP",81179,"BUCHA DE REDUCAO SOLDAVEL LONGA 50 X 25 mm","Un    ",4,null,null,0,"",null,null,null,"(sem código)","-",0,0]
["S",3,"S",0,3,6,1,0,0,0,0,"","Serviço","Serviço","-","AGETOP",81180,"BUCHA DE REDUCAO SOLDAVEL LONGA 50 X 32 mm","Un    ",3,null,null,0,"",null,null,null,"(sem código)","-",0,0]
["S",3,"S",0,3,6,1,0,0,0,0,"","Serviço","Serviço","-","SINAPI",89362,"JOELHO 90 GRAUS, PVC, SOLDÁVEL, DN 25MM, INSTALADO EM RAMAL OU SUB-RAMAL DE ÁGUA - FORNECIMENTO E INSTALAÇÃO. AF_12/2014","UN",28,null,null,0,"",null,null,null,"(sem código)","-",0,0]
["S",3,"S",0,3,6,1,0,0,0,0,"","Serviço","Serviço","-","SINAPI",89367,"JOELHO 90 GRAUS, PVC, SOLDÁVEL, DN 32MM, INSTALADO EM RAMAL OU SUB-RAMAL DE ÁGUA - FORNECIMENTO E INSTALAÇÃO. AF_12/2014","UN",6,null,null,0,"",null,null,null,"(sem código)","-",0,0]
["S",3,"S",0,3,6,1,0,0,0,0,"","Serviço","Serviço","-","SINAPI",89501,"JOELHO 90 GRAUS, PVC, SOLDÁVEL, DN 50MM, INSTALADO EM PRUMADA DE ÁGUA - FORNECIMENTO E INSTALAÇÃO. AF_12/2014","UN",9,null,null,0,"","NÃO","AGETOP",81324,"(sem código)","-",0,0]
["S",3,"S",0,3,6,1,0,0,0,0,"","Serviço","Serviço","-","SINAPI",89505,"JOELHO 90 GRAUS, PVC, SOLDÁVEL, DN 60MM, INSTALADO EM PRUMADA DE ÁGUA - FORNECIMENTO E INSTALAÇÃO. AF_12/2014","UN",2,null,null,0,"",null,null,null,"(sem código)","-",0,0]
["S",3,"S",0,3,6,1,0,0,0,0,"","Serviço","Serviço","-","AGETOP",81360,"JOELHO RED.90 GRAUS SOLD.C/BUCHA LATAO 25X1/2\"","Un    ",16,null,null,0,"",null,null,null,"(sem código)","-",0,0]
["S",3,"S",0,3,6,1,0,0,0,0,"","Serviço","Serviço","-","SINAPI",89395,"TE, PVC, SOLDÁVEL, DN 25MM, INSTALADO EM RAMAL OU SUB-RAMAL DE ÁGUA - FORNECIMENTO E INSTALAÇÃO. AF_12/2014","UN",1,null,null,0,"",null,null,null,"(sem código)","-",0,0]
["S",3,"S",0,3,6,1,0,0,0,0,"","Serviço","Serviço","-","SINAPI",89398,"TE, PVC, SOLDÁVEL, DN 32MM, INSTALADO EM RAMAL OU SUB-RAMAL DE ÁGUA - FORNECIMENTO E INSTALAÇÃO. AF_12/2014","UN",1,null,null,0,"",null,null,null,"(sem código)","-",0,0]
["S",3,"S",0,3,6,1,0,0,0,0,"","Serviço","Serviço","-","SINAPI",89625,"TE, PVC, SOLDÁVEL, DN 50MM, INSTALADO EM PRUMADA DE ÁGUA - FORNECIMENTO E INSTALAÇÃO. AF_12/2014","UN",4,null,null,0,"Referência: AGETOP - 81405","SIM","AGETOP",81405,"(sem código)","-",0,0]
["S",3,"S",0,3,6,1,0,0,0,0,"","Serviço","Serviço","-","SINAPI",89628,"TE, PVC, SOLDÁVEL, DN 60MM, INSTALADO EM PRUMADA DE ÁGUA - FORNECIMENTO E INSTALAÇÃO. AF_12/2014","UN",5,null,null,0,"",null,null,null,"(sem código)","-",0,0]
["S",3,"S",0,3,6,1,0,0,0,0,"","Serviço","Serviço","-","AGETOP",81445,"TE RED.SOLD.90GR.BUC.LATAO BOLSA CENT.25X25X1/2\"","Un    ",6,null,null,0,"",null,null,null,"(sem código)","-",0,0]
["S",3,"S",0,3,6,1,0,0,0,0,"","Serviço","Serviço","-","AGETOP",81501,"ADESIVO PLASTICO - FRASCO 850 G","Un    ",1,null,null,0,"",null,null,null,"(sem código)","-",0,0]
["S",3,"S",0,3,6,1,0,0,0,0,"","Serviço","Serviço","-","AGETOP",81504,"SOLUCAO LIMPADORA 1000 CM3","Un    ",1,null,null,0,"",null,null,null,"(sem código)","-",0,0]
["S",3,"S",0,3,6,1,0,0,0,0,"","Serviço","Serviço","-","AGETOP",81664,"CORPO CX. SIFONADA DIAM. 150 X 185 X 75","Un    ",4,null,null,0,"",null,null,null,"(sem código)","-",0,0]
["S",3,"S",0,3,6,1,0,0,0,0,"","Serviço","Serviço","-","SINAPI",89710,"RALO SECO, PVC, DN 100 X 40 MM, JUNTA SOLDÁVEL, FORNECIDO E INSTALADO EM RAMAL DE DESCARGA OU EM RAMAL DE ESGOTO SANITÁRIO. AF_12/2014","UN",6,null,null,0,"",null,null,null,"(sem código)","-",0,0]
["S",3,"S",0,3,6,1,0,0,0,0,"","Serviço","Serviço","-","SINAPI",94677,"CURVA 90 GRAUS, PVC, SOLDÁVEL, DN 40 MM, INSTALADO EM RESERVAÇÃO DE ÁGUA DE EDIFICAÇÃO QUE POSSUA RESERVATÓRIO DE FIBRA/FIBROCIMENTO   FORNECIMENTO E INSTALAÇÃO. AF_06/2016","UN",18,null,null,0,"",null,null,null,"(sem código)","-",0,0]
["S",3,"S",0,3,6,1,0,0,0,0,"","Serviço","Serviço","-","SINAPI",95694,"CURVA 90 GRAUS, PVC, SERIE R, ÁGUA PLUVIAL, DN 100 MM, JUNTA ELÁSTICA, FORNECIDO E INSTALADO EM RAMAL DE ENCAMINHAMENTO. AF_12/2014","UN",4,null,null,0,"",null,null,null,"(sem código)","-",0,0]
["S",3,"S",0,3,6,1,0,0,0,0,"","Serviço","Serviço","-","AGETOP",81778,"GRELHA QUADRADA CROMADA DIAM. 150 MM","Un    ",4,null,null,0,"",null,null,null,"(sem código)","-",0,0]
["S",3,"S",0,3,6,1,0,0,0,0,"","Serviço","Serviço","-","AGETOP",81790,"GRELHA REDONDA BRANCA DIAM. 100 MM","Un    ",6,null,null,0,"",null,null,null,"(sem código)","-",0,0]
["S",3,"S",0,3,6,1,0,0,0,0,"","Serviço","Serviço","-","AGETOP",81825,"CAIXA DE PASSAGEM 60 X 60 CM SEM TAMPA","Un    ",2,null,null,0,"",null,null,null,"(sem código)","-",0,0]
["S",3,"S",0,3,6,1,0,0,0,0,"","Serviço","Serviço","-","AGETOP",81825,"CAIXA DE PASSAGEM 60 X 60 CM SEM TAMPA","Un    ",2,null,null,0,"",null,null,null,"(sem código)","-",0,0]
["S",3,"S",0,3,6,1,0,0,0,0,"","Serviço","Serviço","-","AGETOP",81885,"TERMINAL DE VENTILACAO DIAMETRO 50 MM","Un    ",2,null,null,0,"",null,null,null,"(sem código)","-",0,0]
["S",3,"S",0,3,6,1,0,0,0,0,"","Serviço","Serviço","-","SINAPI",94676,"JOELHO 90 GRAUS, PVC, SOLDÁVEL, DN 40 MM INSTALADO EM RESERVAÇÃO DE ÁGUA DE EDIFICAÇÃO QUE POSSUA RESERVATÓRIO DE FIBRA/FIBROCIMENTO   FORNECIMENTO E INSTALAÇÃO. AF_06/2016","UN",20,null,null,0,"",null,null,null,"(sem código)","-",0,0]
["S",3,"S",0,3,6,1,0,0,0,0,"","Serviço","Serviço","-","SINAPI",94676,"JOELHO 90 GRAUS, PVC, SOLDÁVEL, DN 40 MM INSTALADO EM RESERVAÇÃO DE ÁGUA DE EDIFICAÇÃO QUE POSSUA RESERVATÓRIO DE FIBRA/FIBROCIMENTO   FORNECIMENTO E INSTALAÇÃO. AF_06/2016","UN",2,null,null,0,"",null,null,null,"(sem código)","-",0,0]
["S",3,"S",0,3,6,1,0,0,0,0,"","Serviço","Serviço","-","SINAPI",89732,"JOELHO 45 GRAUS, PVC, SERIE NORMAL, ESGOTO PREDIAL, DN 50 MM, JUNTA ELÁSTICA, FORNECIDO E INSTALADO EM RAMAL DE DESCARGA OU RAMAL DE ESGOTO SANITÁRIO. AF_12/2014","UN",2,null,null,0,"",null,null,null,"(sem código)","-",0,0]
["S",3,"S",0,3,6,1,0,0,0,0,"","Serviço","Serviço","-","SINAPI",89726,"JOELHO 45 GRAUS, PVC, SERIE NORMAL, ESGOTO PREDIAL, DN 40 MM, JUNTA SOLDÁVEL, FORNECIDO E INSTALADO EM RAMAL DE DESCARGA OU RAMAL DE ESGOTO SANITÁRIO. AF_12/2014","UN",12,null,null,0,"","NÃO","AGETOP",81921,"(sem código)","-",0,0]
["S",3,"S",0,3,6,1,0,0,0,0,"","Serviço","Serviço","-","SINAPI",89731,"JOELHO 90 GRAUS, PVC, SERIE NORMAL, ESGOTO PREDIAL, DN 50 MM, JUNTA ELÁSTICA, FORNECIDO E INSTALADO EM RAMAL DE DESCARGA OU RAMAL DE ESGOTO SANITÁRIO. AF_12/2014","UN",2,null,null,0,"","NÃO","AGETOP",81936,"(sem código)","-",0,0]
["S",3,"S",0,3,6,1,0,0,0,0,"","Serviço","Serviço","-","SINAPI",89744,"JOELHO 90 GRAUS, PVC, SERIE NORMAL, ESGOTO PREDIAL, DN 100 MM, JUNTA ELÁSTICA, FORNECIDO E INSTALADO EM RAMAL DE DESCARGA OU RAMAL DE ESGOTO SANITÁRIO. AF_12/2014","UN",4,null,null,0,"",null,null,null,"(sem código)","-",0,0]
["S",3,"S",0,3,6,1,0,0,0,0,"","Serviço","Serviço","-","AGETOP",82055,"PORTA GRELHA QUADRADO P/GRELHA RED.CROM.DIAM.100 M","Un    ",6,null,null,0,"",null,null,null,"(sem código)","-",0,0]
["S",3,"S",0,3,6,1,0,0,0,0,"","Serviço","Serviço","-","AGETOP",82052,"PORTA GRELHA QUADRADO CROMADO DIAM.150 MM","Un    ",4,null,null,0,"",null,null,null,"(sem código)","-",0,0]
["S",3,"S",0,3,6,1,0,0,0,0,"","Serviço","Serviço","-","AGETOP",82230,"TE SANITARIO DIAMETRO 50 X 50 MM","Un    ",6,null,null,0,"",null,null,null,"(sem código)","-",0,0]
["S",3,"S",0,3,6,1,0,0,0,0,"","Serviço","Serviço","-","SINAPI",89630,"TE DE REDUÇÃO, PVC, SOLDÁVEL, DN 75MM X 50MM, INSTALADO EM PRUMADA DE ÁGUA - FORNECIMENTO E INSTALAÇÃO. AF_12/2014","UN",4,null,null,0,"",null,null,null,"(sem código)","-",0,0]
["S",3,"S",0,3,6,1,0,0,0,0,"","Serviço","Serviço","-","AGETOP",82233,"TE SANITARIO DIAMETRO 100 X 50 MM","Un    ",4,null,null,0,"",null,null,null,"(sem código)","-",0,0]
["S",3,"S",0,3,6,1,0,0,0,0,"","Serviço","Serviço","-","SINAPI",89508,"TUBO PVC, SÉRIE R, ÁGUA PLUVIAL, DN 40 MM, FORNECIDO E INSTALADO EM RAMAL DE ENCAMINHAMENTO. AF_12/2014","M",31,null,null,0,"",null,null,null,"(sem código)","-",0,0]
["S",3,"S",0,3,6,1,0,0,0,0,"","Serviço","Serviço","-","SINAPI",89509,"TUBO PVC, SÉRIE R, ÁGUA PLUVIAL, DN 50 MM, FORNECIDO E INSTALADO EM RAMAL DE ENCAMINHAMENTO. AF_12/2014","M",18,null,null,0,"",null,null,null,"(sem código)","-",0,0]
["S",3,"S",0,3,6,1,0,0,0,0,"","Serviço","Serviço","-","SINAPI",89511,"TUBO PVC, SÉRIE R, ÁGUA PLUVIAL, DN 75 MM, FORNECIDO E INSTALADO EM RAMAL DE ENCAMINHAMENTO. AF_12/2014","M",18,null,null,0,"",null,null,null,"(sem código)","-",0,0]
["S",3,"S",0,3,6,1,0,0,0,0,"","Serviço","Serviço","-","SINAPI",89512,"TUBO PVC, SÉRIE R, ÁGUA PLUVIAL, DN 100 MM, FORNECIDO E INSTALADO EM RAMAL DE ENCAMINHAMENTO. AF_12/2014","M",38,null,null,0,"",null,null,null,"(sem código)","-",0,0]
[2,2,2,4,3,7,0,0,0,41,4,"","Nível 2","Nível 2","-","SINAPI",null,"ALVENARIAS E DIVISÓRIAS","-",null,null,null,0,"",null,null,null,"ALVENARIAS E DIVISÓRIAS","-",0,0]
["S",2,"S",0,3,7,0,0,0,0,0,"","Serviço","Serviço","-","SINAPI",87511,"ALVENARIA DE VEDAÇÃO DE BLOCOS CERÂMICOS FURADOS NA HORIZONTAL DE 9X19X19CM (ESPESSURA 9CM) DE PAREDES COM ÁREA LÍQUIDA MENOR QUE 6M² COM VÃOS E ARGAMASSA DE ASSENTAMENTO COM PREPARO EM BETONEIRA. AF_06/2014","M2",51.947999999999993,null,null,0,"Referência: AGETOP - 100201","SIM","AGETOP",100201,"(sem código)","-",0,0]
["S",2,"S",0,3,7,0,0,0,0,0,"","Serviço","Serviço","-","AGETOP",100602,"ALVENARIA DE TIJOLO LAMINADO 1/2 VEZ  - ARG. (1CI : 1CH : 5ARML)","m2    ",64.94,null,null,0,"",null,null,null,"(sem código)","-",0,0]
["S",2,"S",0,3,7,0,0,0,0,0,"","Serviço","Serviço","-","SINAPI",79627,"DIVISORIA EM GRANITO BRANCO POLIDO, ESP = 3CM, ASSENTADO COM ARGAMASSA TRACO 1:4, ARREMATE EM CIMENTO BRANCO, EXCLUSIVE FERRAGENS","M2",0.9,null,null,0,"Referência: AGETOP - 100320","SIM","AGETOP",100320,"(sem código)","-",0,0]
[2,2,2,2,3,8,0,0,0,37,2,"","Nível 2","Nível 2","-","SINAPI",null,"IMPERMEABILIZAÇÃO","-",null,null,null,0,"",null,null,null,"IMPERMEABILIZAÇÃO","-",0,0]
["S",2,"S",0,3,8,0,0,0,0,0,"","Serviço","Serviço","-","SINAPI","74106/1","IMPERMEABILIZACAO DE ESTRUTURAS ENTERRADAS, COM TINTA ASFALTICA, DUAS DEMAOS.","M2",48,null,null,0,"Referência: AGETOP - 120902","SIM","AGETOP",120902,"(sem código)","-",0,0]
[2,2,2,2,3,9,0,0,0,35,2,"","Nível 2","Nível 2","-","SINAPI",null,"ESTRUTURA DE MADEIRA","-",null,null,null,0,"",null,null,null,"ESTRUTURA DE MADEIRA","-",0,0]
["S",2,"S",0,3,9,0,0,0,0,0,"","Serviço","Serviço","-","AGETOP",140200,"EST.MAD.TELHA FIBROCIM. COM APOIOS EM LAJES/VIGAS OU PAREDES(SOMENTE TERÇAS) C/FERRAGENS","m2    ",55.42,null,null,0,"",null,null,null,"(sem código)","-",0,0]
[2,2,2,4,3,10,0,0,0,33,4,"","Nível 2","Nível 2","-","SINAPI",null,"COBERTURAS","-",null,null,null,0,"",null,null,null,"COBERTURAS","-",0,0]
["S",2,"S",0,3,10,0,0,0,0,0,"","Serviço","Serviço","-","SINAPI",94210,"TELHAMENTO COM TELHA ONDULADA DE FIBROCIMENTO E = 6 MM, COM RECOBRIMENTO LATERAL DE 1 1/4 DE ONDA PARA TELHADO COM INCLINAÇÃO MÁXIMA DE 10°, COM ATÉ 2 ÁGUAS, INCLUSO IÇAMENTO. AF_06/2016","M2",55.42,null,null,0,"Referência: AGETOP - 160501","SIM","AGETOP",160501,"(sem código)","-",0,0]
["S",2,"S",0,3,10,0,0,0,0,0,"","Serviço","Serviço","-","SINAPI",94228,"CALHA EM CHAPA DE AÇO GALVANIZADO NÚMERO 24, DESENVOLVIMENTO DE 50 CM, INCLUSO TRANSPORTE VERTICAL. AF_06/2016","M",10.039999999999999,null,null,0,"Referência: AGETOP - 160601","SIM","AGETOP",160601,"(sem código)","-",0,0]
["S",2,"S",0,3,10,0,0,0,{"$f":"IF(OR($C618=\"S\",$C618=0),0,MATCH(0,OFFSET($D618,1,$C618,ROW($C$648)-ROW($C618)),0))","v":0},{"$f":"IF(OR($C618=\"S\",$C618=0),0,MATCH(OFFSET($D618,0,$C618)+1,OFFSET($D618,1,$C618,ROW($C$648)-ROW($C618)),0))","v":0},"","Serviço","Serviço","-","SINAPI",94231,"RUFO EM CHAPA DE AÇO GALVANIZADO NÚMERO 24, CORTE DE 25 CM, INCLUSO TRANSPORTE VERTICAL. AF_06/2016","M",29.519999999999996,null,null,0,"Referência: AGETOP - 160602","SIM","AGETOP",160602,"(sem código)","-",0,0]
[2,2,2,4,3,11,0,0,0,29,4,"","Nível 2","Nível 2","-","SINAPI",null,"ESQUADRIAS METÁLICAS","-",null,null,null,0,"",null,null,null,"ESQUADRIAS METÁLICAS","-",0,0]
["S",2,"S",0,3,11,0,0,0,0,0,"","Serviço","Serviço","-","SINAPI",94559,"JANELA DE AÇO BASCULANTE, FIXAÇÃO COM ARGAMASSA, SEM VIDROS, PADRONIZADA. AF_07/2016","M2",6.2799999999999994,null,null,0,"Referência: AGETOP - 180404","SIM","AGETOP",180404,"(sem código)","-",0,0]
["S",2,"S",0,3,11,0,0,0,0,0,"","Serviço","Serviço","-","SINAPI","73933/4","PORTA DE FERRO DE ABRIR TIPO BARRA CHATA, COM REQUADRO E GUARNICAO COMPLETA","M2",3.7800000000000002,null,null,0,"Referência: AGETOP - 180501","SIM","AGETOP",180501,"(sem código)","-",0,0]
["S",2,"S",0,3,11,0,0,0,0,0,"","Serviço","Serviço","-","SINAPI","73933/4","PORTA DE FERRO DE ABRIR TIPO BARRA CHATA, COM REQUADRO E GUARNICAO COMPLETA","M2",10.240000000000002,null,null,0,"Referência: AGETOP - 180509","SIM","AGETOP",180509,"(sem código)","-",0,0]
[2,2,2,2,3,12,0,0,0,25,2,"","Nível 2","Nível 2","-","SINAPI",null,"VIDROS","-",null,null,null,0,"",null,null,null,"VIDROS","-",0,0]
["S",2,"S",0,3,12,0,0,0,0,0,"","Serviço","Serviço","-","SINAPI",72117,"VIDRO LISO COMUM TRANSPARENTE, ESPESSURA 4MM","M2",5.3379999999999992,null,null,0,"Referência: AGETOP - 190102","SIM","AGETOP",190102,"(sem código)","-",0,0]
[2,2,2,5,3,13,0,0,0,23,5,"","Nível 2","Nível 2","-","SINAPI",null,"REVESTIMENTO DE PAREDE","-",null,null,null,0,"",null,null,null,"REVESTIMENTO DE PAREDE","-",0,0]
["S",2,"S",0,3,13,0,0,0,0,0,"","Serviço","Serviço","-","SINAPI",87548,"MASSA ÚNICA, PARA RECEBIMENTO DE PINTURA, EM ARGAMASSA TRAÇO 1:2:8, PREPARO MANUAL, APLICADA MANUALMENTE EM FACES INTERNAS DE PAREDES, ESPESSURA DE 10MM, COM EXECUÇÃO DE TALISCAS. AF_06/2014","M2",54.575999999999965,null,null,0,"Referência: AGETOP - 200403","SIM","AGETOP",200403,"(sem código)","-",0,0]
["S",2,"S",0,3,13,0,0,0,0,0,"","Serviço","Serviço","-","SINAPI",87273,"REVESTIMENTO CERÂMICO PARA PAREDES INTERNAS COM PLACAS TIPO ESMALTADA EXTRA DE DIMENSÕES 33X45 CM APLICADAS EM AMBIENTES DE ÁREA MAIOR QUE 5 M² NA ALTURA INTEIRA DAS PAREDES. AF_06/2014","M2",145.80000000000001,null,null,0,"Referência: AGETOP - 201302","SIM","AGETOP",201302,"(sem código)","-",0,0]
["S",2,"S",0,3,13,0,0,0,0,0,"","Serviço","Serviço","-","SINAPI",87549,"EMBOÇO, PARA RECEBIMENTO DE CERÂMICA, EM ARGAMASSA TRAÇO 1:2:8, PREPARO MECÂNICO COM BETONEIRA 400L, APLICADO MANUALMENTE EM FACES INTERNAS DE PAREDES, PARA AMBIENTE COM ÁREA ENTRE 5M2 E 10M2, ESPESSURA DE 10MM, COM EXECUÇÃO DE TALISCAS. AF_06/2014","M2",145.80000000000001,null,null,0,"Referência: AGETOP - 200201","SIM","AGETOP",200201,"(sem código)","-",0,0]
["S",2,"S",0,3,13,0,0,0,0,0,"","Serviço","Serviço","-","SINAPI",87904,"CHAPISCO APLICADO EM ALVENARIA (COM PRESENÇA DE VÃOS) E ESTRUTURAS DE CONCRETO DE FACHADA, COM COLHER DE PEDREIRO.  ARGAMASSA TRAÇO 1:3 COM PREPARO MANUAL. AF_06/2014","M2",200.37599999999998,null,null,0,"Referência: AGETOP - 200101","SIM","AGETOP",200101,"(sem código)","-",0,0]
[2,2,2,3,3,14,0,0,0,18,3,"","Nível 2","Nível 2","-","SINAPI",null,"FORROS","-",null,null,null,0,"",null,null,null,"FORROS","-",0,0]
["S",2,"S",0,3,14,0,0,0,0,0,"","Serviço","Serviço","-","SINAPI",87414,"APLICAÇÃO MANUAL DE GESSO DESEMPENADO (SEM TALISCAS) EM TETO DE AMBIENTES DE ÁREA MAIOR QUE 10M², ESPESSURA DE 1,0CM. AF_06/2014","M2",55.42,null,null,0,"Referência: AGETOP - 210515","SIM","AGETOP",210515,"(sem código)","-",0,0]
["S",2,"S",0,3,14,0,0,0,0,0,"","Serviço","Serviço","-","SINAPI",87884,"CHAPISCO APLICADO NO TETO, COM ROLO PARA TEXTURA ACRÍLICA. ARGAMASSA INDUSTRIALIZADA COM PREPARO MANUAL. AF_06/2014","M2",55.42,null,null,0,"Referência: AGETOP - 210101","SIM","AGETOP",210101,"(sem código)","-",0,0]
[2,2,2,4,3,15,0,0,0,15,4,"","Nível 2","Nível 2","-","SINAPI",null,"REVESTIMENTO DE PISO","-",null,null,null,0,"",null,null,null,"REVESTIMENTO DE PISO","-",0,0]
["S",2,"S",0,3,15,0,0,0,0,0,"","Serviço","Serviço","-","SINAPI",95241,"LASTRO DE CONCRETO MAGRO, APLICADO EM PISOS OU RADIERS, ESPESSURA DE 5 CM. AF_07/2016","M2",50.8,null,null,0,"Referência: AGETOP - 220050","SIM","AGETOP",220050,"(sem código)","-",0,0]
["S",2,"S",0,3,15,0,0,0,0,0,"","Serviço","Serviço","-","SINAPI",87250,"REVESTIMENTO CERÂMICO PARA PISO COM PLACAS TIPO ESMALTADA EXTRA DE DIMENSÕES 45X45 CM APLICADA EM AMBIENTES DE ÁREA ENTRE 5 M2 E 10 M2. AF_06/2014","M2",50.8,null,null,0,"","NÃO","AGETOP",220309,"(sem código)","-",0,0]
["S",2,"S",0,3,15,0,0,0,0,0,"","Serviço","Serviço","-","SINAPI",94992,"EXECUÇÃO DE PASSEIO (CALÇADA) OU PISO DE CONCRETO COM CONCRETO MOLDADO IN LOCO, FEITO EM OBRA, ACABAMENTO CONVENCIONAL, ESPESSURA 6 CM, ARMADO. AF_07/2016","M2",17.7,null,null,0,"Referência: AGETOP - 220060","SIM","AGETOP",220060,"(sem código)","-",0,0]
[2,2,2,3,3,16,0,0,0,11,3,"","Nível 2","Nível 2","-","AGETOP",null,"FERRAGENS","-",null,null,null,0,"",null,null,null,"FERRAGENS","-",0,0]
["S",2,"S",0,3,16,0,0,0,0,0,"","Serviço","Serviço","-","AGETOP",230176,"BARRA DE APOIO EM AÇO INOX - 80 CM ","un    ",6,null,null,0,"",null,null,null,"(sem código)","-",0,0]
["S",2,"S",0,3,16,0,0,0,0,0,"","Serviço","Serviço","-","AGETOP",230174,"BARRA DE APOIO EM AÇO INOX - 40 CM","un    ",6,null,null,0,"",null,null,null,"(sem código)","-",0,0]
[2,2,2,5,3,17,0,0,0,8,5,"","Nível 2","Nível 2","-","AGETOP",null,"PINTURA","-",null,null,null,0,"",null,null,null,"PINTURA","-",0,0]
["S",2,"S",0,3,17,0,0,0,0,0,"","Serviço","Serviço","-","AGETOP",260801,"PINTURA A BASE DE SILICONE 1 DEMAO","m2    ",74.616,null,null,0,"",null,null,null,"(sem código)","-",0,0]
["S",2,"S",0,3,17,0,0,0,0,0,"","Serviço","Serviço","-","SINAPI",88497,"APLICAÇÃO E LIXAMENTO DE MASSA LÁTEX EM PAREDES, DUAS DEMÃOS. AF_06/2014","M2",54.575999999999965,null,null,0,"Referência: AGETOP - 261300","SIM","AGETOP",261300,"(sem código)","-",0,0]
["S",2,"S",0,3,17,0,0,0,0,0,"","Serviço","Serviço","-","SINAPI",88489,"APLICAÇÃO MANUAL DE PINTURA COM TINTA LÁTEX ACRÍLICA EM PAREDES, DUAS DEMÃOS. AF_06/2014","M2",54.575999999999965,null,null,0,"Referência: AGETOP - 261000","SIM","AGETOP",261000,"(sem código)","-",0,0]
["S",2,"S",0,3,17,0,0,0,0,0,"","Serviço","Serviço","-","SINAPI","74145/1","PINTURA ESMALTE FOSCO, DUAS DEMAOS, SOBRE SUPERFICIE METALICA, INCLUSO UMA DEMAO DE FUNDO ANTICORROSIVO. UTILIZACAO DE REVOLVER ( AR-COMPRIMIDO).","M2",40.6,null,null,0,"Referência: AGETOP - 261602","SIM","AGETOP",261602,"(sem código)","-",0,0]
[2,2,2,3,3,18,0,0,0,3,{"$error":"#N/A"},"","Nível 2","Nível 2","-","AGETOP",null,"DIVERSOS","-",null,null,null,0,"",null,null,null,"DIVERSOS",{"$f":"IFERROR(VLOOKUP(AA645,INDIRECT(Z645),3,FALSE()),\"-\")","v":"-"},0,0]
["S",2,"S",0,3,18,0,0,0,0,0,"","Serviço","Serviço","-","AGETOP",271303,"BANCO DE CONCRETO POLIDO BASE EM ALVENARIA REBOCADA E PINTADA - PADRÃO AGETOP 2015","m     ",7.8,null,null,0,"",null,null,null,"(sem código)","-",0,0]
["S",2,"S",0,3,18,0,0,0,0,0,"","Serviço","Serviço","-","COMPOSIÇÃO","COMP 541_SEE","BANCADA DE GRANITO CINZA POLIDO - FORNECIMENTO E INSTALAÇÃO. ","M2    ",0.41,null,null,0,"",null,null,null,"(sem código)","-",0,0]
[-1,null,-1,null,0,0,0,0,0,null,null,"F"]
[null,null,null,null,null,null,null,null,null,null,null,"F",null,null,null,null,null,"OBS: OS QUANTITATIVOS DE MATERIAIS  DAS INSTALAÇÕES HIDROSSANITÁRIAS, ELÉTRICAS E ESPECIAIS SÃO FORNECIDOS PELOS PROFISSIONAIS RESPONSÁVEIS PELOS RESPECTIVOS PROJETOS.",null,null,"VALOR TOTAL",null,0]
[null,null,null,null,null,null,null,null,null,null,null,"F",null,null,null,null,null,null,null,null,"VALOR BDI (21,36%)",null,0]
[null,null,null,null,null,null,null,null,null,null,null,"F",null,null,null,null,null,null,null,null,"TOTAL ORÇAMENTO",null,0]
[null,null,null,null,null,null,null,null,null,null,null,"F"]
[null,null,null,null,null,null,null,null,null,null,null,"F",null,null,null,null,null,null,null,null,"CUSTO POR M2 ³",null,0]
[null,null,null,null,null,null,null,null,null,null,null,"F",null,null,null,null,null,null,null,null,"MATERIAL S/ BDI",null,0]
[null,null,null,null,null,null,null,null,null,null,null,"F",null,null,null,null,null,null,null,null,"MÃO DE OBRA S/ BDI",null,0]
[null,null,null,null,null,null,null,null,null,null,null,"F"]
[null,null,null,null,null,null,null,null,null,null,null,"F",null,null,null,null,"(1) Conforme previsto pelo DECRETO Nº 7.983, DE 8 DE ABRIL DE 2013, os preços adotados são aqueles constantes dos sistemas de referência indicados. Justifica-se o uso dos preços destas composições de custos unitários devido ao seu valor ser menor à mediana de seus correspondentes na tabela SINAPI;"]
[null,null,null,null,null,null,null,null,null,null,null,"F",null,null,null,null,"(2) Optou-se pelo uso das composições de custos da AGETOP para itens não presentes na SINAPI;"]
[null,null,null,null,null,null,null,null,null,null,null,"F",null,null,null,null,"(3) Para itens da AGETOP, os vidros não estão inclusos nas esquadrias e já foram considerados os custos de contramarco para as esquadrias de alumínio;"]
[null,null,null,null,null,null,null,null,null,null,null,"F",null,null,null,null,"(4) Nos casos em que houver execução de granitina e omissão do item AGETOP 221102, considerou-se que o quantitativo para o rodapé, de altura igual a 7cm, foi incorporado na área de piso;"]
[null,null,null,null,null,null,null,null,null,null,null,"F",null,null,null,null,"(5) O custo unitário aproximado por metro quadrado é calculado dividindo-se o valor total do orçamento pela área total de construção."]
[null,null,null,null,null,null,null,null,null,null,null,"F"]
[null,null,null,null,null,null,null,null,null,null,null,"F"]
[]
[null,null,null,null,null,null,null,null,null,null,null,null,null,null,"SOMATÓRIO DE SERVIÇOS"]
[null,null,null,null,null,null,null,null,null,null,null,null,null,null,"ITEM","DESCRIÇÃO DOS SERVIÇOS",null,null,"PREÇO SEM BDI",null,null,"PREÇO COM BDI",null,"PARTICIPAÇÃO ( % )"]
[null,null,null,null,null,null,null,null,null,null,null,null,null,null,"a.","SERVIÇOS PRELIMINARES",null,null,{"$f":"SUMIF($R$19:$R$648,$P667,$W$19:$W$648)","v":0},null,null,{"$f":"ROUND(S667*(1+BDI.Taxa),2)","v":0},null,{"$f":"IFERROR(ROUND($V667*100/$W$651,2),0)","v":0}]
[null,null,null,null,null,null,null,null,null,null,null,null,null,null,"b.","TRANSPORTES",null,null,0,null,null,0,null,{"$f":"IFERROR(ROUND($V668*100/$W$651,2),0)","v":0}]
[null,null,null,null,null,null,null,null,null,null,null,null,null,null,"c.","SERVIÇO EM TERRA",null,null,0,null,null,0,null,0]
[null,null,null,null,null,null,null,null,null,null,null,null,null,null,"d.","FUNDAÇÕES E SONDAGENS",null,null,0,null,null,0,null,0]
[null,null,null,null,null,null,null,null,null,null,null,null,null,null,"e.","ESTRUTURA",null,null,0,null,null,0,null,0]
[null,null,null,null,null,null,null,null,null,null,null,null,null,null,"f.","INSTALAÇÕES ELÉTRICAS",null,null,0,null,null,0,null,0]
[null,null,null,null,null,null,null,null,null,null,null,null,null,null,"g.","INSTALAÇÕES HIDROSSANITÁRIAS",null,null,0,null,null,0,null,0]
[null,null,null,null,null,null,null,null,null,null,null,null,null,null,"h","INSTALAÇÕES ESPECIAIS",null,null,0,null,null,0,null,0]
[null,null,null,null,null,null,null,null,null,null,null,null,null,null,"i.","ALVENARIAS E DIVISÓRIAS",null,null,0,null,null,0,null,0]
[null,null,null,null,null,null,null,null,null,null,null,null,null,null,"j.","ALVENARIA AUTO-PORTANTE",null,null,0,null,null,0,null,0]
[null,null,null,null,null,null,null,null,null,null,null,null,null,null,"k.","IMPERMEABILIZAÇÃO",null,null,0,null,null,0,null,0]
[null,null,null,null,null,null,null,null,null,null,null,null,null,null,"l.","ISOLAMENTO TÉRMICO E ACÚSTICO",null,null,0,null,null,0,null,0]
[null,null,null,null,null,null,null,null,null,null,null,null,null,null,"m.","ESTRUTURA DE MADEIRA",null,null,0,null,null,0,null,0]
[null,null,null,null,null,null,null,null,null,null,null,null,null,null,"n.","ESTRUTURAS METÁLICAS",null,null,0,null,null,0,null,0]
[null,null,null,null,null,null,null,null,null,null,null,null,null,null,"o.","COBERTURAS",null,null,0,null,null,0,null,0]
[null,null,null,null,null,null,null,null,null,null,null,null,null,null,"p.","ESQUADRIAS DE MADEIRA",null,null,0,null,null,0,null,0]
[null,null,null,null,null,null,null,null,null,null,null,null,null,null,"q.","ESQUADRIAS METÁLICAS",null,null,0,null,null,{"$f":"ROUND(S683*(1+BDI.Taxa),2)","v":0},null,0]
[null,null,null,null,null,null,null,null,null,null,null,null,null,null,"r.","VIDROS",null,null,0,null,null,0,null,0]
[null,null,null,null,null,null,null,null,null,null,null,null,null,null,"s.","REVESTIMENTO DE PAREDE",null,null,0,null,null,0,null,0]
[null,null,null,null,null,null,null,null,null,null,null,null,null,null,"t.","FORROS",null,null,0,null,null,0,null,0]
[null,null,null,null,null,null,null,null,null,null,null,null,null,null,"u.","REVESTIMENTO DE PISO",null,null,0,null,null,0,null,0]
[null,null,null,null,null,null,null,null,null,null,null,null,null,null,"v.","FERRAGENS",null,null,0,null,null,0,null,0]
[null,null,null,null,null,null,null,null,null,null,null,null,null,null,"w.","MARCENARIA",null,null,0,null,null,0,null,0]
[null,null,null,null,null,null,null,null,null,null,null,null,null,null,"x.","ADMINISTRAÇÃO",null,null,0,null,null,0,null,0]
[null,null,null,null,null,null,null,null,null,null,null,null,null,null,"y.","PINTURA",null,null,0,null,null,{"$f":"ROUND(S691*(1+BDI.Taxa),2)","v":0},null,0]
[null,null,null,null,null,null,null,null,null,null,null,null,null,null,"z.","DIVERSOS",null,null,0,null,null,{"$f":"IF(S692>0,IF((SUM(V667:W691)+ROUND(S692*(1+BDI.Taxa),2))<>V694,V694-SUM(V667:W691),ROUND(S692*(1+BDI.Taxa),2)),0)","v":0},null,{"$f":"IF(S692>0,IF((SUM(X667:X691)+IFERROR(ROUND($V692*100/$W$651,2),0))<>X694,X694-SUM(X667:X691),IFERROR(ROUND($V692*100/$W$651,2),0)),0)","v":0}]
[null,null,null,null,null,null,null,null,null,null,null,null,null,null,"TOTAL GERAL DO ORÇAMENTO (R$)",null,null,null,{"$f":"SUM(S667:U692)","v":0},null,null,{"$f":"SUM(V667:W692)","v":0},null,{"$f":"SUM(X667:X692)","v":0}]
[null,null,null,null,null,null,null,null,null,null,null,null,null,null,null,null,null,null,{"$f":"$W$649","v":0},null,null,{"$f":"$W$651","v":0},null,100]
[null,null,null,null,null,null,null,null,null,null,null,null,null,null,null,null,null,null,"(TOTAL SEM BDI)",null,null,"(TOTAL COM BDI)",null,"(ARRED porcentagem)"]
[null,null,null,null,null,null,null,null,null,null,null,null,null,null,null,null,null,null,{"$f":"IF(AND(S693=S694,S693>0),\"OK\",\"ERRO\")","v":"ERRO"},null,null,{"$f":"IF(AND(V693=V694,V693>0),\"OK\",\"ERRO\")","v":"ERRO"},null,{"$f":"IF(X693=100,\"OK\",\"ERRO\")","v":"ERRO"}]
[]
[]
[null,null,null,null,null,null,null,null,null,null,null,null,null,null,"RESUMO GERAL DO ORÇAMENTO"]
[null,null,null,null,null,null,null,null,null,null,null,null,null,null,"ITEM","DESCRIÇÃO DOS SERVIÇOS",null,null,"PREÇO SEM BDI",null,null,"PREÇO COM BDI",null,"PARTICIPAÇÃO ( % )"]
[null,null,null,null,null,null,null,null,null,null,null,null,null,null,"1.",{"$f":"IFERROR(VLOOKUP(O701,$O$19:$W$648,4,FALSE),\"\")","v":"REFORMA"},null,null,{"$f":"IF(P702=\"\",$S$722-SUM(OFFSET($S$700:S700,0,0,COUNTA($S$700:S700),1)),SUMIF($R$19:$R$648,$P701,$W$19:$W$648))","v":0},null,null,{"$f":"IF(P702=\"\",$V$722-SUM(OFFSET($V$700:V700,0,0,COUNTA($V$700:V700),1)),ROUND(S701*(1+BDI.Taxa),2))","v":0},null,{"$f":"IF(P702=\"\",$X$722-SUM(OFFSET($X$700:X700,0,0,COUNTA($X$700:X700),1)),ROUND(V701*100/ORÇAMENTO.TotalOrçamento,2))","v":{"$error":"#DIV/0!"}}]
[null,null,null,null,null,null,null,null,null,null,null,null,null,null,"2.","BLOCO PADRAO COZINHA / REFEITÓRIO",null,null,{"$f":"IF(P703=\"\",$S$722-SUM(OFFSET($S$700:S701,0,0,COUNTA($S$700:S701),1)),SUMIF($R$19:$R$648,$P702,$W$19:$W$648))","v":0},null,null,{"$f":"IF(P703=\"\",$V$722-SUM(OFFSET($V$700:V701,0,0,COUNTA($V$700:V701),1)),ROUND(S702*(1+BDI.Taxa),2))","v":0},null,{"$f":"IF(P703=\"\",$X$722-SUM(OFFSET($X$700:X701,0,0,COUNTA($X$700:X701),1)),ROUND(V702*100/ORÇAMENTO.TotalOrçamento,2))","v":{"$error":"#DIV/0!"}}]
[null,null,null,null,null,null,null,null,null,null,null,null,null,null,"3.","BLOCO SANITÁRIO PADRÃO SEDUC 2013",null,null,{"$f":"IF(P704=\"\",$S$722-SUM(OFFSET($S$700:S702,0,0,COUNTA($S$700:S702),1)),SUMIF($R$19:$R$648,$P703,$W$19:$W$648))","v":0},null,null,{"$f":"IF(P704=\"\",$V$722-SUM(OFFSET($V$700:V702,0,0,COUNTA($V$700:V702),1)),ROUND(S703*(1+BDI.Taxa),2))","v":0},null,{"$f":"IF(P704=\"\",$X$722-SUM(OFFSET($X$700:X702,0,0,COUNTA($X$700:X702),1)),ROUND(V703*100/ORÇAMENTO.TotalOrçamento,2))","v":{"$error":"#DIV/0!"}}]
[null,null,null,null,null,null,null,null,null,null,null,null,null,null,"4.","",null,null,{"$f":"IF(P705=\"\",$S$722-SUM(OFFSET($S$700:S703,0,0,COUNTA($S$700:S703),1)),SUMIF($R$19:$R$648,$P704,$W$19:$W$648))","v":0},null,null,{"$f":"IF(P705=\"\",$V$722-SUM(OFFSET($V$700:V703,0,0,COUNTA($V$700:V703),1)),ROUND(S704*(1+BDI.Taxa),2))","v":0},null,{"$f":"IF(P705=\"\",$X$722-SUM(OFFSET($X$700:X703,0,0,COUNTA($X$700:X703),1)),ROUND(V704*100/ORÇAMENTO.TotalOrçamento,2))","v":{"$error":"#DIV/0!"}}]
[null,null,null,null,null,null,null,null,null,null,null,null,null,null,"5.","",null,null,{"$f":"IF(P706=\"\",$S$722-SUM(OFFSET($S$700:S704,0,0,COUNTA($S$700:S704),1)),SUMIF($R$19:$R$648,$P705,$W$19:$W$648))","v":0},null,null,{"$f":"IF(P706=\"\",$V$722-SUM(OFFSET($V$700:V704,0,0,COUNTA($V$700:V704),1)),ROUND(S705*(1+BDI.Taxa),2))","v":0},null,{"$f":"IF(P706=\"\",$X$722-SUM(OFFSET($X$700:X704,0,0,COUNTA($X$700:X704),1)),ROUND(V705*100/ORÇAMENTO.TotalOrçamento,2))","v":{"$error":"#DIV/0!"}}]
[null,null,null,null,null,null,null,null,null,null,null,null,null,null,"6.","",null,null,{"$f":"IF(P707=\"\",$S$722-SUM(OFFSET($S$700:S705,0,0,COUNTA($S$700:S705),1)),SUMIF($R$19:$R$648,$P706,$W$19:$W$648))","v":0},null,null,{"$f":"IF(P707=\"\",$V$722-SUM(OFFSET($V$700:V705,0,0,COUNTA($V$700:V705),1)),ROUND(S706*(1+BDI.Taxa),2))","v":0},null,{"$f":"IF(P707=\"\",$X$722-SUM(OFFSET($X$700:X705,0,0,COUNTA($X$700:X705),1)),ROUND(V706*100/ORÇAMENTO.TotalOrçamento,2))","v":{"$error":"#DIV/0!"}}]
[null,null,null,null,null,null,null,null,null,null,null,null,null,null,"7.","",null,null,{"$f":"IF(P708=\"\",$S$722-SUM(OFFSET($S$700:S706,0,0,COUNTA($S$700:S706),1)),SUMIF($R$19:$R$648,$P707,$W$19:$W$648))","v":0},null,null,{"$f":"IF(P708=\"\",$V$722-SUM(OFFSET($V$700:V706,0,0,COUNTA($V$700:V706),1)),ROUND(S707*(1+BDI.Taxa),2))","v":0},null,{"$f":"IF(P708=\"\",$X$722-SUM(OFFSET($X$700:X706,0,0,COUNTA($X$700:X706),1)),ROUND(V707*100/ORÇAMENTO.TotalOrçamento,2))","v":{"$error":"#DIV/0!"}}]
[null,null,null,null,null,null,null,null,null,null,null,null,null,null,"8.","",null,null,{"$f":"IF(P709=\"\",$S$722-SUM(OFFSET($S$700:S707,0,0,COUNTA($S$700:S707),1)),SUMIF($R$19:$R$648,$P708,$W$19:$W$648))","v":0},null,null,{"$f":"IF(P709=\"\",$V$722-SUM(OFFSET($V$700:V707,0,0,COUNTA($V$700:V707),1)),ROUND(S708*(1+BDI.Taxa),2))","v":0},null,{"$f":"IF(P709=\"\",$X$722-SUM(OFFSET($X$700:X707,0,0,COUNTA($X$700:X707),1)),ROUND(V708*100/ORÇAMENTO.TotalOrçamento,2))","v":{"$error":"#DIV/0!"}}]
[null,null,null,null,null,null,null,null,null,null,null,null,null,null,"9.","",null,null,{"$f":"IF(P710=\"\",$S$722-SUM(OFFSET($S$700:S708,0,0,COUNTA($S$700:S708),1)),SUMIF($R$19:$R$648,$P709,$W$19:$W$648))","v":0},null,null,{"$f":"IF(P710=\"\",$V$722-SUM(OFFSET($V$700:V708,0,0,COUNTA($V$700:V708),1)),ROUND(S709*(1+BDI.Taxa),2))","v":0},null,{"$f":"IF(P710=\"\",$X$722-SUM(OFFSET($X$700:X708,0,0,COUNTA($X$700:X708),1)),ROUND(V709*100/ORÇAMENTO.TotalOrçamento,2))","v":{"$error":"#DIV/0!"}}]
[null,null,null,null,null,null,null,null,null,null,null,null,null,null,"10.","",null,null,{"$f":"IF(P711=\"\",$S$722-SUM(OFFSET($S$700:S709,0,0,COUNTA($S$700:S709),1)),SUMIF($R$19:$R$648,$P710,$W$19:$W$648))","v":0},null,null,{"$f":"IF(P711=\"\",$V$722-SUM(OFFSET($V$700:V709,0,0,COUNTA($V$700:V709),1)),ROUND(S710*(1+BDI.Taxa),2))","v":0},null,{"$f":"IF(P711=\"\",$X$722-SUM(OFFSET($X$700:X709,0,0,COUNTA($X$700:X709),1)),ROUND(V710*100/ORÇAMENTO.TotalOrçamento,2))","v":{"$error":"#DIV/0!"}}]
[null,null,null,null,null,null,null,null,null,null,null,null,null,null,"11.","",null,null,{"$f":"IF(P712=\"\",$S$722-SUM(OFFSET($S$700:S710,0,0,COUNTA($S$700:S710),1)),SUMIF($R$19:$R$648,$P711,$W$19:$W$648))","v":0},null,null,{"$f":"IF(P712=\"\",$V$722-SUM(OFFSET($V$700:V710,0,0,COUNTA($V$700:V710),1)),ROUND(S711*(1+BDI.Taxa),2))","v":0},null,{"$f":"IF(P712=\"\",$X$722-SUM(OFFSET($X$700:X710,0,0,COUNTA($X$700:X710),1)),ROUND(V711*100/ORÇAMENTO.TotalOrçamento,2))","v":{"$error":"#DIV/0!"}}]
[null,null,null,null,null,null,null,null,null,null,null,null,null,null,"12.","",null,null,{"$f":"IF(P713=\"\",$S$722-SUM(OFFSET($S$700:S711,0,0,COUNTA($S$700:S711),1)),SUMIF($R$19:$R$648,$P712,$W$19:$W$648))","v":0},null,null,{"$f":"IF(P713=\"\",$V$722-SUM(OFFSET($V$700:V711,0,0,COUNTA($V$700:V711),1)),ROUND(S712*(1+BDI.Taxa),2))","v":0},null,{"$f":"IF(P713=\"\",$X$722-SUM(OFFSET($X$700:X711,0,0,COUNTA($X$700:X711),1)),ROUND(V712*100/ORÇAMENTO.TotalOrçamento,2))","v":{"$error":"#DIV/0!"}}]
[null,null,null,null,null,null,null,null,null,null,null,null,null,null,"13.","",null,null,{"$f":"IF(P714=\"\",$S$722-SUM(OFFSET($S$700:S712,0,0,COUNTA($S$700:S712),1)),SUMIF($R$19:$R$648,$P713,$W$19:$W$648))","v":0},null,null,{"$f":"IF(P714=\"\",$V$722-SUM(OFFSET($V$700:V712,0,0,COUNTA($V$700:V712),1)),ROUND(S713*(1+BDI.Taxa),2))","v":0},null,{"$f":"IF(P714=\"\",$X$722-SUM(OFFSET($X$700:X712,0,0,COUNTA($X$700:X712),1)),ROUND(V713*100/ORÇAMENTO.TotalOrçamento,2))","v":{"$error":"#DIV/0!"}}]
[null,null,null,null,null,null,null,null,null,null,null,null,null,null,"14.","",null,null,{"$f":"IF(P715=\"\",$S$722-SUM(OFFSET($S$700:S713,0,0,COUNTA($S$700:S713),1)),SUMIF($R$19:$R$648,$P714,$W$19:$W$648))","v":0},null,null,{"$f":"IF(P715=\"\",$V$722-SUM(OFFSET($V$700:V713,0,0,COUNTA($V$700:V713),1)),ROUND(S714*(1+BDI.Taxa),2))","v":0},null,{"$f":"IF(P715=\"\",$X$722-SUM(OFFSET($X$700:X713,0,0,COUNTA($X$700:X713),1)),ROUND(V714*100/ORÇAMENTO.TotalOrçamento,2))","v":{"$error":"#DIV/0!"}}]
[null,null,null,null,null,null,null,null,null,null,null,null,null,null,"15.","",null,null,{"$f":"IF(P716=\"\",$S$722-SUM(OFFSET($S$700:S714,0,0,COUNTA($S$700:S714),1)),SUMIF($R$19:$R$648,$P715,$W$19:$W$648))","v":0},null,null,{"$f":"IF(P716=\"\",$V$722-SUM(OFFSET($V$700:V714,0,0,COUNTA($V$700:V714),1)),ROUND(S715*(1+BDI.Taxa),2))","v":0},null,{"$f":"IF(P716=\"\",$X$722-SUM(OFFSET($X$700:X714,0,0,COUNTA($X$700:X714),1)),ROUND(V715*100/ORÇAMENTO.TotalOrçamento,2))","v":{"$error":"#DIV/0!"}}]
[null,null,null,null,null,null,null,null,null,null,null,null,null,null,"16.","",null,null,{"$f":"IF(P717=\"\",$S$722-SUM(OFFSET($S$700:S715,0,0,COUNTA($S$700:S715),1)),SUMIF($R$19:$R$648,$P716,$W$19:$W$648))","v":0},null,null,{"$f":"IF(P717=\"\",$V$722-SUM(OFFSET($V$700:V715,0,0,COUNTA($V$700:V715),1)),ROUND(S716*(1+BDI.Taxa),2))","v":0},null,{"$f":"IF(P717=\"\",$X$722-SUM(OFFSET($X$700:X715,0,0,COUNTA($X$700:X715),1)),ROUND(V716*100/ORÇAMENTO.TotalOrçamento,2))","v":{"$error":"#DIV/0!"}}]
[null,null,null,null,null,null,null,null,null,null,null,null,null,null,"17.","",null,null,{"$f":"IF(P718=\"\",$S$722-SUM(OFFSET($S$700:S716,0,0,COUNTA($S$700:S716),1)),SUMIF($R$19:$R$648,$P717,$W$19:$W$648))","v":0},null,null,{"$f":"IF(P718=\"\",$V$722-SUM(OFFSET($V$700:V716,0,0,COUNTA($V$700:V716),1)),ROUND(S717*(1+BDI.Taxa),2))","v":0},null,{"$f":"IF(P718=\"\",$X$722-SUM(OFFSET($X$700:X716,0,0,COUNTA($X$700:X716),1)),ROUND(V717*100/ORÇAMENTO.TotalOrçamento,2))","v":{"$error":"#DIV/0!"}}]
[null,null,null,null,null,null,null,null,null,null,null,null,null,null,"18.","",null,null,{"$f":"IF(P719=\"\",$S$722-SUM(OFFSET($S$700:S717,0,0,COUNTA($S$700:S717),1)),SUMIF($R$19:$R$648,$P718,$W$19:$W$648))","v":0},null,null,{"$f":"IF(P719=\"\",$V$722-SUM(OFFSET($V$700:V717,0,0,COUNTA($V$700:V717),1)),ROUND(S718*(1+BDI.Taxa),2))","v":0},null,{"$f":"IF(P719=\"\",$X$722-SUM(OFFSET($X$700:X717,0,0,COUNTA($X$700:X717),1)),ROUND(V718*100/ORÇAMENTO.TotalOrçamento,2))","v":{"$error":"#DIV/0!"}}]
[null,null,null,null,null,null,null,null,null,null,null,null,null,null,"19.","",null,null,{"$f":"IF(P720=\"\",$S$722-SUM(OFFSET($S$700:S718,0,0,COUNTA($S$700:S718),1)),SUMIF($R$19:$R$648,$P719,$W$19:$W$648))","v":0},null,null,{"$f":"IF(P720=\"\",$V$722-SUM(OFFSET($V$700:V718,0,0,COUNTA($V$700:V718),1)),ROUND(S719*(1+BDI.Taxa),2))","v":0},null,{"$f":"IF(P720=\"\",$X$722-SUM(OFFSET($X$700:X718,0,0,COUNTA($X$700:X718),1)),ROUND(V719*100/ORÇAMENTO.TotalOrçamento,2))","v":{"$error":"#DIV/0!"}}]
[null,null,null,null,null,null,null,null,null,null,null,null,null,null,"20.","",null,null,{"$f":"IF(P721=\"\",$S$722-SUM(OFFSET($S$700:S719,0,0,COUNTA($S$700:S719),1)),SUMIF($R$19:$R$648,$P720,$W$19:$W$648))","v":0},null,null,{"$f":"IF(P721=\"\",$V$722-SUM(OFFSET($V$700:V719,0,0,COUNTA($V$700:V719),1)),ROUND(S720*(1+BDI.Taxa),2))","v":0},null,{"$f":"IF(P721=\"\",$X$722-SUM(OFFSET($X$700:X719,0,0,COUNTA($X$700:X719),1)),ROUND(V720*100/ORÇAMENTO.TotalOrçamento,2))","v":{"$error":"#DIV/0!"}}]
[null,null,null,null,null,null,null,null,null,null,null,null,null,null,"TOTAL GERAL DO ORÇAMENTO (R$)",null,null,null,{"$f":"SUM(S701:U720)","v":0},null,null,{"$f":"SUM(V701:W720)","v":0},null,{"$f":"SUM(X701:X720)","v":{"$error":"#DIV/0!"}}]
[null,null,null,null,null,null,null,null,null,null,null,null,null,null,null,null,null,null,{"$f":"$W$649","v":0},null,null,{"$f":"$W$651","v":0},null,100]
[null,null,null,null,null,null,null,null,null,null,null,null,null,null,null,null,null,null,"(TOTAL SEM BDI)",null,null,"(TOTAL COM BDI)",null,"(ARRED porcentagem)"]
[null,null,null,null,null,null,null,null,null,null,null,null,null,null,null,null,null,null,{"$f":"IF(AND(S721=S722,S721>0),\"OK\",\"ERRO\")","v":"ERRO"},null,null,{"$f":"IF(AND(V721=V722,V721>0),\"OK\",\"ERRO\")","v":"ERRO"},null,{"$f":"IF(AND(X721=100,S701<>0),\"OK\",\"ERRO\")","v":{"$error":"#DIV/0!"}}]

{"sheet":"Resumo ","index":1,"n_rows":39,"n_cols":9,"rows_kept":39,"cut":false,"hidden":false,"merged":[[13,0,14,0],[34,2,34,3],[35,2,35,3],[31,2,31,3],[32,2,32,3],[33,2,33,3],[28,2,28,3],[29,2,29,3],[30,2,30,3],[0,1,0,8],[36,1,36,5],[2,1,2,5],[3,1,3,5],[5,1,5,5],[6,1,6,5],[8,1,8,5],[9,1,9,5],[11,3,11,5],[12,3,12,5],[10,1,10,8],[11,6,11,8],[12,6,12,8],[25,2,25,3],[21,2,21,3],[22,2,22,3],[6,6,6,8],[7,1,7,8],[8,6,8,8],[9,6,9,8],[13,1,13,8],[1,1,1,8],[2,6,2,8],[3,6,3,8],[4,1,4,8],[5,6,5,8],[42,3,42,7],[11,1,11,2],[12,1,12,2],[15,2,15,3],[16,2,16,3],[14,1,14,8],[17,2,17,3],[23,2,23,3],[18,2,18,3],[19,2,19,3],[20,2,20,3],[41,3,41,7],[24,2,24,3],[26,2,26,3],[27,2,27,3],[38,1,38,8]]}
[]
[]
[null,"UNIDADE ESCOLAR",null,null,null,null,"CÓDIGO INEP"]
[null,{"$f":"Orçamento!$O$4","v":"CENTRO DE ENSINO EM PERÍODO INTEGRAL JOAQUIM EDSON DE CAMARGO"},null,null,null,null,{"$f":"Orçamento!V4","v":52035182}]
[]
[null,"OBRA",null,null,null,null,"CIDADE"]
[null,{"$f":"Orçamento!$O$7","v":"REFORMA E AMPLIAÇÃO"},null,null,null,null,{"$f":"Orçamento!$V$7","v":"GOIÂNIA"}]
[]
[null,"ENDEREÇO",null,null,null,null,"CRE"]
[null,{"$f":"Orçamento!$R$10","v":"RUA SANTIAGO QD. 232 S/N PCA JARDIM DA INFÂNC, JD NOVO MUNDO, CEP:74705-060"},null,null,null,null,{"$f":"Orçamento!$O$10","v":"GOIÂNIA"}]
[]
[null,"REFERÊNCIA",null,"DATA",null,null,"ÁREA TOTAL CONSTRUÍDA (M²)"]
[null,{"$f":"CONCATENATE(\"AGETOP E SINAPI - \",Orçamento!$W$10)","v":"AGETOP E SINAPI - NÃO DESONERADA"},null,{"$f":"Orçamento!$S$7","v":"2020-04-08"},null,null,{"$f":"Orçamento!$S$13","v":2081.9900000000002}]
["FILTRO"]
[null,"RESUMO GERAL DO ORÇAMENTO"]
["↓","ITEM","DESCRIÇÃO DOS SERVIÇOS",null,"UNID","QUANT","PREÇO SEM BDI","PREÇO COM BDI","PARTICIP. (%)"]
[{"$f":"IF(E17>0,\"F\",\"\")","v":"F"},"1.",{"$f":"Orçamento!$P701","v":"REFORMA"},null,"UN ",1,{"$f":"IFERROR(Orçamento!S701,\"-\")","v":0},{"$f":"IFERROR(Orçamento!V701,\"\")","v":0},{"$f":"Orçamento!X701","v":{"$error":"#DIV/0!"}}]
[{"$f":"IF(E18>0,\"F\",\"\")","v":"F"},"2.",{"$f":"Orçamento!$P702","v":"BLOCO PADRAO COZINHA / REFEITÓRIO"},null,"UN ",1,{"$f":"IFERROR(Orçamento!S702,\"-\")","v":0},{"$f":"IFERROR(Orçamento!V702,\"\")","v":0},{"$f":"Orçamento!X702","v":{"$error":"#DIV/0!"}}]
["F","3.",{"$f":"Orçamento!$P703","v":"BLOCO SANITÁRIO PADRÃO SEDUC 2013"},null,"UN ",1,{"$f":"IFERROR(Orçamento!S703,\"-\")","v":0},{"$f":"IFERROR(Orçamento!V703,\"\")","v":0},{"$f":"Orçamento!X703","v":{"$error":"#DIV/0!"}}]
["","4.",{"$f":"Orçamento!$P704","v":""},null,null,null,{"$f":"IFERROR(Orçamento!S704,\"-\")","v":0},{"$f":"IFERROR(Orçamento!V704,\"\")","v":0},{"$f":"Orçamento!X704","v":{"$error":"#DIV/0!"}}]
["","5.",{"$f":"Orçamento!$P705","v":""},null,null,null,{"$f":"IFERROR(Orçamento!S705,\"-\")","v":0},{"$f":"IFERROR(Orçamento!V705,\"\")","v":0},{"$f":"Orçamento!X705","v":{"$error":"#DIV/0!"}}]
["","6.",{"$f":"Orçamento!$P706","v":""},null,null,null,{"$f":"IFERROR(Orçamento!S706,\"-\")","v":0},{"$f":"IFERROR(Orçamento!V706,\"\")","v":0},{"$f":"Orçamento!X706","v":{"$error":"#DIV/0!"}}]
["","7.",{"$f":"Orçamento!$P707","v":""},null,null,null,{"$f":"IFERROR(Orçamento!S707,\"-\")","v":0},{"$f":"IFERROR(Orçamento!V707,\"\")","v":0},{"$f":"Orçamento!X707","v":{"$error":"#DIV/0!"}}]
["","8.",{"$f":"Orçamento!$P708","v":""},null,null,null,{"$f":"IFERROR(Orçamento!S708,\"-\")","v":0},{"$f":"IFERROR(Orçamento!V708,\"\")","v":0},{"$f":"Orçamento!X708","v":{"$error":"#DIV/0!"}}]
["","9.",{"$f":"Orçamento!$P709","v":""},null,null,null,{"$f":"IFERROR(Orçamento!S709,\"-\")","v":0},{"$f":"IFERROR(Orçamento!V709,\"\")","v":0},{"$f":"Orçamento!X709","v":{"$error":"#DIV/0!"}}]
["","10.",{"$f":"Orçamento!$P710","v":""},null,null,null,{"$f":"IFERROR(Orçamento!S710,\"-\")","v":0},{"$f":"IFERROR(Orçamento!V710,\"\")","v":0},{"$f":"Orçamento!X710","v":{"$error":"#DIV/0!"}}]
["","11.",{"$f":"Orçamento!$P711","v":""},null,null,null,{"$f":"IFERROR(Orçamento!S711,\"-\")","v":0},{"$f":"IFERROR(Orçamento!V711,\"\")","v":0},{"$f":"Orçamento!X711","v":{"$error":"#DIV/0!"}}]
["","12.",{"$f":"Orçamento!$P712","v":""},null,null,null,{"$f":"IFERROR(Orçamento!S712,\"-\")","v":0},{"$f":"IFERROR(Orçamento!V712,\"\")","v":0},{"$f":"Orçamento!X712","v":{"$error":"#DIV/0!"}}]
["","13.",{"$f":"Orçamento!$P713","v":""},null,null,null,{"$f":"IFERROR(Orçamento!S713,\"-\")","v":0},{"$f":"IFERROR(Orçamento!V713,\"\")","v":0},{"$f":"Orçamento!X713","v":{"$error":"#DIV/0!"}}]
["","14.",{"$f":"Orçamento!$P714","v":""},null,null,null,{"$f":"IFERROR(Orçamento!S714,\"-\")","v":0},{"$f":"IFERROR(Orçamento!V714,\"\")","v":0},{"$f":"Orçamento!X714","v":{"$error":"#DIV/0!"}}]
["","15.",{"$f":"Orçamento!$P715","v":""},null,null,null,{"$f":"IFERROR(Orçamento!S715,\"-\")","v":0},{"$f":"IFERROR(Orçamento!V715,\"\")","v":0},{"$f":"Orçamento!X715","v":{"$error":"#DIV/0!"}}]
["","16.",{"$f":"Orçamento!$P716","v":""},null,null,null,{"$f":"IFERROR(Orçamento!S716,\"-\")","v":0},{"$f":"IFERROR(Orçamento!V716,\"\")","v":0},{"$f":"Orçamento!X716","v":{"$error":"#DIV/0!"}}]
["","17.",{"$f":"Orçamento!$P717","v":""},null,null,null,{"$f":"IFERROR(Orçamento!S717,\"-\")","v":0},{"$f":"IFERROR(Orçamento!V717,\"\")","v":0},{"$f":"Orçamento!X717","v":{"$error":"#DIV/0!"}}]
["","18.",{"$f":"Orçamento!$P718","v":""},null,null,null,{"$f":"IFERROR(Orçamento!S718,\"-\")","v":0},{"$f":"IFERROR(Orçamento!V718,\"\")","v":0},{"$f":"Orçamento!X718","v":{"$error":"#DIV/0!"}}]
["","19.",{"$f":"Orçamento!$P719","v":""},null,null,null,{"$f":"IFERROR(Orçamento!S719,\"-\")","v":0},{"$f":"IFERROR(Orçamento!V719,\"\")","v":0},{"$f":"Orçamento!X719","v":{"$error":"#DIV/0!"}}]
["","20.",{"$f":"Orçamento!$P720","v":""},null,null,null,{"$f":"IFERROR(Orçamento!S720,\"-\")","v":0},{"$f":"IFERROR(Orçamento!V720,\"\")","v":0},{"$f":"Orçamento!X720","v":{"$error":"#DIV/0!"}}]
["F","TOTAL GERAL DO ORÇAMENTO (R$)",null,null,null,null,{"$f":"SUM(G17:G36)","v":0},0,{"$f":"SUM(I17:I36)","v":{"$error":"#DIV/0!"}}]
["F"]
["F"]

{"sheet":"Somatório","index":2,"n_rows":45,"n_cols":6,"rows_kept":45,"cut":false,"hidden":false,"merged":[[13,0,14,0],[42,1,42,2],[44,1,44,5],[47,3,47,5],[48,3,48,5],[13,1,13,5],[9,1,9,3],[9,4,9,5],[11,1,11,2],[11,4,11,5],[12,1,12,2],[12,4,12,5],[0,1,0,5],[14,1,14,5],[2,1,2,3],[2,4,2,5],[3,1,3,3],[3,4,3,5],[5,1,5,3],[5,4,5,5],[6,1,6,3],[6,4,6,5],[8,1,8,3],[8,4,8,5],[1,1,1,5],[4,1,4,5],[7,1,7,5],[10,1,10,5]]}
[]
[]
[null,"UNIDADE ESCOLAR",null,null,"CÓDIGO INEP"]
[null,{"$f":"Orçamento!$O$4","v":"CENTRO DE ENSINO EM PERÍODO INTEGRAL JOAQUIM EDSON DE CAMARGO"},null,null,{"$f":"Orçamento!V4","v":52035182}]
[]
[null,"OBRA",null,null,"CIDADE"]
[null,{"$f":"Orçamento!$O$7","v":"REFORMA E AMPLIAÇÃO"},null,null,{"$f":"Orçamento!$V$7","v":"GOIÂNIA"}]
[]
[null,"ENDEREÇO",null,null,"CRE"]
[null,{"$f":"Orçamento!$R$10","v":"RUA SANTIAGO QD. 232 S/N PCA JARDIM DA INFÂNC, JD NOVO MUNDO, CEP:74705-060"},null,null,{"$f":"Orçamento!$O$10","v":"GOIÂNIA"}]
[]
[null,"REFERÊNCIA",null,"DATA","ÁREA TOTAL CONSTRUÍDA (M²)"]
[null,{"$f":"CONCATENATE(\"AGETOP E SINAPI - \",Orçamento!$W$10)","v":"AGETOP E SINAPI - NÃO DESONERADA"},null,{"$f":"Orçamento!$S$7","v":"2020-04-08"},{"$f":"Orçamento!$S$13","v":2081.9900000000002}]
["FILTRO"]
[null,"SOMATÓRIO DE SERVIÇOS"]
["↓","ITEM","DESCRIÇÃO DOS SERVIÇOS","PREÇO SEM BDI (R$)","PREÇO COM BDI (R$)","PARTIC.  ( % )"]
[{"$f":"IF(D17>0,\"F\",\"\")","v":""},"a.",{"$f":"Orçamento!P667","v":"SERVIÇOS PRELIMINARES"},{"$f":"Orçamento!S667","v":0},{"$f":"Orçamento!V667","v":0},{"$f":"Orçamento!X667","v":0}]
[{"$f":"IF(D18>0,\"F\",\"\")","v":""},"b.",{"$f":"Orçamento!P668","v":"TRANSPORTES"},{"$f":"Orçamento!S668","v":0},{"$f":"Orçamento!V668","v":0},{"$f":"Orçamento!X668","v":0}]
["","c.",{"$f":"Orçamento!P669","v":"SERVIÇO EM TERRA"},{"$f":"Orçamento!S669","v":0},{"$f":"Orçamento!V669","v":0},{"$f":"Orçamento!X669","v":0}]
["","d.",{"$f":"Orçamento!P670","v":"FUNDAÇÕES E SONDAGENS"},{"$f":"Orçamento!S670","v":0},{"$f":"Orçamento!V670","v":0},{"$f":"Orçamento!X670","v":0}]
["","e.",{"$f":"Orçamento!P671","v":"ESTRUTURA"},{"$f":"Orçamento!S671","v":0},{"$f":"Orçamento!V671","v":0},{"$f":"Orçamento!X671","v":0}]
["","f.",{"$f":"Orçamento!P672","v":"INSTALAÇÕES ELÉTRICAS"},{"$f":"Orçamento!S672","v":0},{"$f":"Orçamento!V672","v":0},{"$f":"Orçamento!X672","v":0}]
["","g.",{"$f":"Orçamento!P673","v":"INSTALAÇÕES HIDROSSANITÁRIAS"},{"$f":"Orçamento!S673","v":0},{"$f":"Orçamento!V673","v":0},{"$f":"Orçamento!X673","v":0}]
["","h",{"$f":"Orçamento!P674","v":"INSTALAÇÕES ESPECIAIS"},{"$f":"Orçamento!S674","v":0},{"$f":"Orçamento!V674","v":0},{"$f":"Orçamento!X674","v":0}]
["","i.",{"$f":"Orçamento!P675","v":"ALVENARIAS E DIVISÓRIAS"},{"$f":"Orçamento!S675","v":0},{"$f":"Orçamento!V675","v":0},{"$f":"Orçamento!X675","v":0}]
["","j.",{"$f":"Orçamento!P676","v":"ALVENARIA AUTO-PORTANTE"},{"$f":"Orçamento!S676","v":0},{"$f":"Orçamento!V676","v":0},{"$f":"Orçamento!X676","v":0}]
["","k.",{"$f":"Orçamento!P677","v":"IMPERMEABILIZAÇÃO"},{"$f":"Orçamento!S677","v":0},{"$f":"Orçamento!V677","v":0},{"$f":"Orçamento!X677","v":0}]
["","l.",{"$f":"Orçamento!P678","v":"ISOLAMENTO TÉRMICO E ACÚSTICO"},{"$f":"Orçamento!S678","v":0},{"$f":"Orçamento!V678","v":0},{"$f":"Orçamento!X678","v":0}]
["","m.",{"$f":"Orçamento!P679","v":"ESTRUTURA DE MADEIRA"},{"$f":"Orçamento!S679","v":0},{"$f":"Orçamento!V679","v":0},{"$f":"Orçamento!X679","v":0}]
["","n.",{"$f":"Orçamento!P680","v":"ESTRUTURAS METÁLICAS"},{"$f":"Orçamento!S680","v":0},{"$f":"Orçamento!V680","v":0},{"$f":"Orçamento!X680","v":0}]
["","o.",{"$f":"Orçamento!P681","v":"COBERTURAS"},{"$f":"Orçamento!S681","v":0},{"$f":"Orçamento!V681","v":0},{"$f":"Orçamento!X681","v":0}]
["","p.",{"$f":"Orçamento!P682","v":"ESQUADRIAS DE MADEIRA"},{"$f":"Orçamento!S682","v":0},{"$f":"Orçamento!V682","v":0},{"$f":"Orçamento!X682","v":0}]
["","q.",{"$f":"Orçamento!P683","v":"ESQUADRIAS METÁLICAS"},{"$f":"Orçamento!S683","v":0},{"$f":"Orçamento!V683","v":0},{"$f":"Orçamento!X683","v":0}]
["","r.",{"$f":"Orçamento!P684","v":"VIDROS"},{"$f":"Orçamento!S684","v":0},{"$f":"Orçamento!V684","v":0},{"$f":"Orçamento!X684","v":0}]
["","s.",{"$f":"Orçamento!P685","v":"REVESTIMENTO DE PAREDE"},{"$f":"Orçamento!S685","v":0},{"$f":"Orçamento!V685","v":0},{"$f":"Orçamento!X685","v":0}]
["","t.",{"$f":"Orçamento!P686","v":"FORROS"},{"$f":"Orçamento!S686","v":0},{"$f":"Orçamento!V686","v":0},{"$f":"Orçamento!X686","v":0}]
["","u.",{"$f":"Orçamento!P687","v":"REVESTIMENTO DE PISO"},{"$f":"Orçamento!S687","v":0},{"$f":"Orçamento!V687","v":0},{"$f":"Orçamento!X687","v":0}]
["","v.",{"$f":"Orçamento!P688","v":"FERRAGENS"},{"$f":"Orçamento!S688","v":0},{"$f":"Orçamento!V688","v":0},{"$f":"Orçamento!X688","v":0}]
["","w.",{"$f":"Orçamento!P689","v":"MARCENARIA"},{"$f":"Orçamento!S689","v":0},{"$f":"Orçamento!V689","v":0},{"$f":"Orçamento!X689","v":0}]
["","x.",{"$f":"Orçamento!P690","v":"ADMINISTRAÇÃO"},{"$f":"Orçamento!S690","v":0},{"$f":"Orçamento!V690","v":0},{"$f":"Orçamento!X690","v":0}]
["","y.",{"$f":"Orçamento!P691","v":"PINTURA"},{"$f":"Orçamento!S691","v":0},{"$f":"Orçamento!V691","v":0},{"$f":"Orçamento!X691","v":0}]
["","z.",{"$f":"Orçamento!P692","v":"DIVERSOS"},{"$f":"Orçamento!S692","v":0},{"$f":"Orçamento!V692","v":0},{"$f":"Orçamento!X692","v":0}]
["F","TOTAL GERAL DO ORÇAMENTO",null,{"$f":"SUM(D17:D42)","v":0},{"$f":"SUM(E17:E42)","v":0},{"$f":"SUM(F17:F42)","v":0}]
[]
[null,"(*) Para itens da AGETOP, os vidros não estão inclusos nas esquadrias e já foram considerados os custos de contramarco para as esquadrias de alumínio;"]

{"sheet":"Cronog_60_Dias","index":3,"n_rows":99,"n_cols":14,"rows_kept":99,"cut":false,"hidden":false,"merged":[[2,1,2,7],[5,1,5,7],[6,1,6,7],[8,1,8,7],[9,1,9,7],[4,1,4,13],[7,1,7,13],[0,1,0,13],[1,1,1,13],[2,8,2,13],[12,0,13,0],[9,0,11,0],[11,1,11,13],[92,1,92,2],[92,5,92,8],[92,9,92,12],[93,1,93,2],[93,5,93,8],[93,9,93,12],[74,9,74,12],[74,5,74,8],[68,9,68,12],[70,5,70,8],[70,9,70,12],[59,5,59,8],[71,1,73,2],[71,4,73,4],[71,5,71,8],[71,9,71,12],[73,5,73,8],[73,9,73,12],[59,9,59,12],[61,5,61,8],[61,9,61,12],[94,1,94,2],[94,5,94,8],[94,9,94,12],[76,5,76,8],[76,9,76,12],[77,5,77,8],[77,9,77,12],[79,5,79,8],[79,9,79,12],[80,5,80,8],[80,9,80,12],[82,5,82,8],[82,9,82,12],[77,3,79,3],[80,3,82,3],[86,1,88,2],[80,4,82,4],[95,1,95,2],[95,5,95,8],[95,9,95,12],[97,1,97,4],[98,1,98,13],[86,9,86,12],[88,5,88,8],[88,9,88,12],[85,5,85,8],[85,9,85,12],[89,1,91,2],[89,4,91,4],[89,5,89,8],[89,9,89,12],[91,5,91,8],[91,9,91,12],[89,3,91,3],[86,4,88,4],[86,5,86,8],[86,3,88,3],[83,1,85,2],[83,4,85,4],[83,5,83,8],[83,9,83,12],[68,5,68,8],[65,5,65,8],[65,9,65,12],[67,5,67,8],[67,9,67,12],[65,3,67,3],[62,9,62,12],[64,5,64,8],[64,9,64,12],[62,5,62,8],[53,9,53,12],[55,5,55,8],[55,9,55,12],[50,5,50,8],[50,9,50,12],[52,5,52,8],[52,9,52,12],[56,9,56,12],[58,5,58,8],[58,9,58,12],[53,5,53,8],[56,5,56,8],[44,9,44,12],[46,5,46,8],[46,9,46,12],[47,1,49,2],[47,4,49,4],[47,5,47,8],[47,9,47,12],[49,5,49,8],[49,9,49,12],[44,5,44,8],[47,3,49,3],[35,9,35,12],[37,5,37,8],[37,9,37,12],[35,3,37,3],[40,9,40,12],[38,3,40,3],[38,9,38,12],[41,1,43,2],[41,4,43,4],[41,5,41,8],[41,9,41,12],[43,5,43,8],[43,9,43,12],[41,3,43,3],[35,5,35,8],[38,5,38,8],[40,5,40,8],[29,9,29,12],[31,5,31,8],[31,9,31,12],[32,1,34,2],[32,4,34,4],[32,5,32,8],[32,9,32,12],[34,5,34,8],[34,9,34,12],[32,3,34,3],[29,5,29,8],[29,1,31,2],[29,4,31,4],[26,1,28,2],[26,4,28,4],[26,5,26,8],[26,9,26,12],[28,5,28,8],[28,9,28,12],[23,3,25,3],[23,1,25,2],[23,4,25,4],[23,5,23,8],[26,3,28,3],[14,3,16,3],[17,3,19,3],[14,4,16,4],[14,5,14,8],[14,9,14,12],[16,5,16,8],[16,9,16,12],[23,9,23,12],[25,5,25,8],[25,9,25,12],[17,9,17,12],[19,5,19,8],[19,9,19,12],[20,1,22,2],[20,4,22,4],[20,5,20,8],[20,9,20,12],[22,5,22,8],[22,9,22,12],[20,3,22,3],[83,3,85,3],[53,4,55,4],[59,1,61,2],[59,4,61,4],[74,1,76,2],[77,1,79,2],[77,4,79,4],[80,1,82,2],[65,1,67,2],[68,3,70,3],[62,3,64,3],[68,1,70,2],[56,3,58,3],[65,4,67,4],[71,3,73,3],[74,3,76,3],[74,4,76,4],[56,1,58,2],[68,4,70,4],[44,3,46,3],[62,1,64,2],[62,4,64,4],[38,1,40,2],[38,4,40,4],[59,3,61,3],[44,1,46,2],[44,4,46,4],[53,1,55,2],[50,1,52,2],[50,4,52,4],[10,1,10,13],[9,8,9,13],[8,8,8,13],[3,8,3,13],[6,8,6,13],[5,8,5,13],[3,1,3,7],[56,4,58,4],[29,3,31,3],[35,1,37,2],[35,4,37,4],[50,3,52,3],[53,3,55,3],[12,13,13,13],[13,1,13,2],[13,5,13,8],[13,9,13,12],[12,3,13,3],[12,9,12,12],[14,1,16,2],[12,5,12,8],[17,1,19,2],[17,4,19,4],[17,5,17,8]]}
[]
[]
[null,"UNIDADE ESCOLAR",null,null,null,null,null,null,"PRAZO"]
[null,{"$f":"Orçamento!$O$4","v":"CENTRO DE ENSINO EM PERÍODO INTEGRAL JOAQUIM EDSON DE CAMARGO"},null,null,null,null,null,null,"60 DIAS CORRIDOS"]
[]
[null,"OBRA",null,null,null,null,null,null,"DATA"]
[null,{"$f":"Orçamento!$O$7","v":"REFORMA E AMPLIAÇÃO"},null,null,null,null,null,null,{"$f":"Orçamento!$S$7","v":"2020-04-08"}]
[]
[null,"LOCAL",null,null,null,null,null,null,"ÁREA TOTAL CONSTRUÍDA (M²)"]
["FILTRO",{"$f":"Orçamento!$V$7","v":"GOIÂNIA"},null,null,null,null,null,null,{"$f":"Orçamento!$S$13","v":2081.9900000000002}]
[]
[null,"CRONOGRAMA - FÍSICO FINANCEIRO"]
["↓","CUSTO TOTAL:",{"$f":"D93","v":0},"VALOR","Dias:",30,null,null,null,60,null,null,null,"TOTAL"]
[null,"DESCRIÇÃO DOS SERVIÇOS",null,null,"%","1ª PARCELA",null,null,null,"2ª PARCELA"]
[{"$f":"IF(D15>0,\"F\",\"\")","v":""},"SERVIÇOS PRELIMINARES",null,{"$f":"Orçamento!V667","v":0},{"$f":"Orçamento!X667","v":0},{"$f":"ROUND(F17*$D$15,2)","v":0},null,null,null,{"$f":"ROUND(J17*$D$15,2)","v":0},null,null,null,{"$f":"SUM(F15:M15)","v":0}]
[{"$f":"IF(A15=\"F\",A15,\"\")","v":""}]
[{"$f":"IF(A16=\"F\",A16,\"\")","v":""},null,null,null,null,1,null,null,null,{"$f":"1-F17","v":0},null,null,null,{"$f":"IFERROR(E15/100,\"\")","v":0}]
[{"$f":"IF(D18>0,\"F\",\"\")","v":""},"TRANSPORTES",null,{"$f":"Orçamento!V668","v":0},{"$f":"Orçamento!X668","v":0},{"$f":"ROUND(F20*$D$18,2)","v":0},null,null,null,{"$f":"ROUND(J20*$D$18,2)","v":0},null,null,null,{"$f":"SUM(F18:M18)","v":0}]
[{"$f":"IF(A18=\"F\",A18,\"\")","v":""}]
[{"$f":"IF(A19=\"F\",A19,\"\")","v":""},null,null,null,null,0.48,null,null,null,{"$f":"1-F20","v":0.52},null,null,null,{"$f":"IFERROR(E18/100,\"\")","v":0}]
[{"$f":"IF(D21>0,\"F\",\"\")","v":""},"SERVIÇO EM TERRA",null,{"$f":"Orçamento!V669","v":0},{"$f":"Orçamento!X669","v":0},{"$f":"ROUND(F23*$D$21,2)","v":0},null,null,null,{"$f":"ROUND(J23*$D$21,2)","v":0},null,null,null,{"$f":"SUM(F21:M21)","v":0}]
[{"$f":"IF(A21=\"F\",A21,\"\")","v":""}]
[{"$f":"IF(A22=\"F\",A22,\"\")","v":""},null,null,null,null,1,null,null,null,{"$f":"1-F23","v":0},null,null,null,{"$f":"IFERROR(E21/100,\"\")","v":0}]
[{"$f":"IF(D24>0,\"F\",\"\")","v":""},"FUNDAÇÕES E SONDAGENS",null,{"$f":"Orçamento!V670","v":0},{"$f":"Orçamento!X670","v":0},{"$f":"ROUND(F26*$D$24,2)","v":0},null,null,null,{"$f":"ROUND(J26*$D$24,2)","v":0},null,null,null,{"$f":"SUM(F24:M24)","v":0}]
[{"$f":"IF(A24=\"F\",A24,\"\")","v":""}]
[{"$f":"IF(A25=\"F\",A25,\"\")","v":""},null,null,null,null,1,null,null,null,{"$f":"1-F26","v":0},null,null,null,{"$f":"IFERROR(E24/100,\"\")","v":0}]
[{"$f":"IF(D27>0,\"F\",\"\")","v":""},"ESTRUTURA",null,{"$f":"Orçamento!V671","v":0},{"$f":"Orçamento!X671","v":0},{"$f":"ROUND(F29*$D$27,2)","v":0},null,null,null,{"$f":"ROUND(J29*$D$27,2)","v":0},null,null,null,{"$f":"SUM(F27:M27)","v":0}]
[{"$f":"IF(A27=\"F\",A27,\"\")","v":""}]
[{"$f":"IF(A28=\"F\",A28,\"\")","v":""},null,null,null,null,0.49,null,null,null,{"$f":"1-F29","v":0.51},null,null,null,{"$f":"IFERROR(E27/100,\"\")","v":0}]
[{"$f":"IF(D30>0,\"F\",\"\")","v":""},"INST.ELET/TELEFÔNICA/CABEAMENTO ESTRUTURADO",null,{"$f":"Orçamento!V672","v":0},{"$f":"Orçamento!X672","v":0},{"$f":"ROUND(F32*$D$30,2)","v":0},null,null,null,{"$f":"ROUND(J32*$D$30,2)","v":0},null,null,null,{"$f":"SUM(F30:M30)","v":0}]
[{"$f":"IF(A30=\"F\",A30,\"\")","v":""}]
[{"$f":"IF(A31=\"F\",A31,\"\")","v":""},null,null,null,null,0.4,null,null,null,{"$f":"1-F32","v":0.6},null,null,null,{"$f":"IFERROR(E30/100,\"\")","v":0}]
[{"$f":"IF(D33>0,\"F\",\"\")","v":""},"INSTALAÇÕES HIDROSSANITÁRIAS",null,{"$f":"Orçamento!V673","v":0},{"$f":"Orçamento!X673","v":0},{"$f":"ROUND(F35*$D$33,2)","v":0},null,null,null,{"$f":"ROUND(J35*$D$33,2)","v":0},null,null,null,{"$f":"SUM(F33:M33)","v":0}]
[{"$f":"IF(A33=\"F\",A33,\"\")","v":""}]
[{"$f":"IF(A34=\"F\",A34,\"\")","v":""},null,null,null,null,0.48,null,null,null,{"$f":"1-F35","v":0.52},null,null,null,{"$f":"IFERROR(E33/100,\"\")","v":0}]
[{"$f":"IF(D36>0,\"F\",\"\")","v":""},"INSTALAÇÕES ESPECIAIS",null,{"$f":"Orçamento!V674","v":0},{"$f":"Orçamento!X674","v":0},{"$f":"ROUND(F38*$D$36,2)","v":0},null,null,null,{"$f":"ROUND(J38*$D$36,2)","v":0},null,null,null,{"$f":"SUM(F36:M36)","v":0}]
[{"$f":"IF(A36=\"F\",A36,\"\")","v":""}]
[{"$f":"IF(A37=\"F\",A37,\"\")","v":""},null,null,null,null,1,null,null,null,{"$f":"1-F38","v":0},null,null,null,{"$f":"IFERROR(E36/100,\"\")","v":0}]
[{"$f":"IF(D39>0,\"F\",\"\")","v":""},"ALVENARIA E DIVISÓRIAS",null,{"$f":"Orçamento!V675","v":0},{"$f":"Orçamento!X675","v":0},{"$f":"ROUND(F41*$D$39,2)","v":0},null,null,null,{"$f":"ROUND(J41*$D$39,2)","v":0},null,null,null,{"$f":"SUM(F39:M39)","v":0}]
[{"$f":"IF(A39=\"F\",A39,\"\")","v":""}]
[{"$f":"IF(A40=\"F\",A40,\"\")","v":""},null,null,null,null,1,null,null,null,{"$f":"1-F41","v":0},null,null,null,{"$f":"IFERROR(E39/100,\"\")","v":0}]
[{"$f":"IF(D42>0,\"F\",\"\")","v":""},"ALVENARIA AUTO-PORTANTE",null,{"$f":"Orçamento!V676","v":0},{"$f":"Orçamento!X676","v":0},{"$f":"ROUND(F44*$D$42,2)","v":0},null,null,null,{"$f":"ROUND(J44*$D$42,2)","v":0},null,null,null,{"$f":"SUM(F42:M42)","v":0}]
[{"$f":"IF(A42=\"F\",A42,\"\")","v":""}]
[{"$f":"IF(A43=\"F\",A43,\"\")","v":""},null,null,null,null,1,null,null,null,{"$f":"1-F44","v":0},null,null,null,{"$f":"IFERROR(E42/100,\"\")","v":0}]
[{"$f":"IF(D45>0,\"F\",\"\")","v":""},"IMPERMEABILIZAÇÃO",null,{"$f":"Orçamento!V677","v":0},{"$f":"Orçamento!X677","v":0},{"$f":"ROUND(F47*$D$45,2)","v":0},null,null,null,{"$f":"ROUND(J47*$D$45,2)","v":0},null,null,null,{"$f":"SUM(F45:M45)","v":0}]
[{"$f":"IF(A45=\"F\",A45,\"\")","v":""}]
[{"$f":"IF(A46=\"F\",A46,\"\")","v":""},null,null,null,null,1,null,null,null,{"$f":"1-F47","v":0},null,null,null,{"$f":"IFERROR(E45/100,\"\")","v":0}]
[{"$f":"IF(D48>0,\"F\",\"\")","v":""},"ISOLAMENTO TÉRMICO E ACÚSTICO",null,{"$f":"Orçamento!V678","v":0},{"$f":"Orçamento!X678","v":0},{"$f":"ROUND(F50*$D$48,2)","v":0},null,null,null,{"$f":"ROUND(J50*$D$48,2)","v":0},null,null,null,{"$f":"SUM(F48:M48)","v":0}]
[{"$f":"IF(A48=\"F\",A48,\"\")","v":""}]
[{"$f":"IF(A49=\"F\",A49,\"\")","v":""},null,null,null,null,0.5,null,null,null,{"$f":"1-F50","v":0.5},null,null,null,{"$f":"IFERROR(E48/100,\"\")","v":0}]
[{"$f":"IF(D51>0,\"F\",\"\")","v":""},"ESTRUTURA DE MADEIRA",null,{"$f":"Orçamento!V679","v":0},{"$f":"Orçamento!X679","v":0},{"$f":"ROUND(F53*$D$51,2)","v":0},null,null,null,{"$f":"ROUND(J53*$D$51,2)","v":0},null,null,null,{"$f":"SUM(F51:M51)","v":0}]
[{"$f":"IF(A51=\"F\",A51,\"\")","v":""}]
[{"$f":"IF(A52=\"F\",A52,\"\")","v":""},null,null,null,null,0.4,null,null,null,{"$f":"1-F53","v":0.6},null,null,null,{"$f":"IFERROR(E51/100,\"\")","v":0}]
[{"$f":"IF(D54>0,\"F\",\"\")","v":""},"ESTRUTURA METÁLICA",null,{"$f":"Orçamento!V680","v":0},{"$f":"Orçamento!X680","v":0},{"$f":"ROUND(F56*$D$54,2)","v":0},null,null,null,{"$f":"ROUND(J56*$D$54,2)","v":0},null,null,null,{"$f":"SUM(F54:M54)","v":0}]
[{"$f":"IF(A54=\"F\",A54,\"\")","v":""}]
[{"$f":"IF(A55=\"F\",A55,\"\")","v":""},null,null,null,null,0.35,null,null,null,{"$f":"1-F56","v":0.65},null,null,null,{"$f":"IFERROR(E54/100,\"\")","v":0}]
[{"$f":"IF(D57>0,\"F\",\"\")","v":""},"COBERTURAS",null,{"$f":"Orçamento!V681","v":0},{"$f":"Orçamento!X681","v":0},{"$f":"ROUND(F59*$D$57,2)","v":0},null,null,null,{"$f":"ROUND(J59*$D$57,2)","v":0},null,null,null,{"$f":"SUM(F57:M57)","v":0}]
[{"$f":"IF(A57=\"F\",A57,\"\")","v":""}]
[{"$f":"IF(A58=\"F\",A58,\"\")","v":""},null,null,null,null,0,null,null,null,{"$f":"1-F59","v":1},null,null,null,{"$f":"IFERROR(E57/100,\"\")","v":0}]
[{"$f":"IF(D60>0,\"F\",\"\")","v":""},"ESQUADRIAS DE MADEIRA",null,{"$f":"Orçamento!V682","v":0},{"$f":"Orçamento!X682","v":0},{"$f":"ROUND(F62*$D$60,2)","v":0},null,null,null,{"$f":"ROUND(J62*$D$60,2)","v":0},null,null,null,{"$f":"SUM(F60:M60)","v":0}]
[{"$f":"IF(A60=\"F\",A60,\"\")","v":""}]
[{"$f":"IF(A61=\"F\",A61,\"\")","v":""},null,null,null,null,0.54,null,null,null,{"$f":"1-F62","v":0.45999999999999996},null,null,null,{"$f":"IFERROR(E60/100,\"\")","v":0}]
[{"$f":"IF(D63>0,\"F\",\"\")","v":""},"ESQUADRIAS METÁLICAS",null,{"$f":"Orçamento!V683","v":0},{"$f":"Orçamento!X683","v":0},{"$f":"ROUND(F65*$D$63,2)","v":0},null,null,null,{"$f":"ROUND(J65*$D$63,2)","v":0},null,null,null,{"$f":"SUM(F63:M63)","v":0}]
[{"$f":"IF(A63=\"F\",A63,\"\")","v":""}]
[{"$f":"IF(A64=\"F\",A64,\"\")","v":""},null,null,null,null,0.49,null,null,null,{"$f":"1-F65","v":0.51},null,null,null,{"$f":"IFERROR(E63/100,\"\")","v":0}]
[{"$f":"IF(D66>0,\"F\",\"\")","v":""},"VIDROS",null,{"$f":"Orçamento!V684","v":0},{"$f":"Orçamento!X684","v":0},{"$f":"ROUND(F68*$D$66,2)","v":0},null,null,null,{"$f":"ROUND(J68*$D$66,2)","v":0},null,null,null,{"$f":"SUM(F66:M66)","v":0}]
[{"$f":"IF(A66=\"F\",A66,\"\")","v":""}]
[{"$f":"IF(A67=\"F\",A67,\"\")","v":""},null,null,null,null,0,null,null,null,{"$f":"1-F68","v":1},null,null,null,{"$f":"IFERROR(E66/100,\"\")","v":0}]
[{"$f":"IF(D69>0,\"F\",\"\")","v":""},"REVESTIMENTO DE PAREDE",null,{"$f":"Orçamento!V685","v":0},{"$f":"Orçamento!X685","v":0},{"$f":"ROUND(F71*$D$69,2)","v":0},null,null,null,{"$f":"ROUND(J71*$D$69,2)","v":0},null,null,null,{"$f":"SUM(F69:M69)","v":0}]
[{"$f":"IF(A69=\"F\",A69,\"\")","v":""}]
[{"$f":"IF(A70=\"F\",A70,\"\")","v":""},null,null,null,null,0.32,null,null,null,{"$f":"1-F71","v":0.67999999999999994},null,null,null,{"$f":"IFERROR(E69/100,\"\")","v":0}]
[{"$f":"IF(D72>0,\"F\",\"\")","v":""},"FORROS",null,{"$f":"Orçamento!V686","v":0},{"$f":"Orçamento!X686","v":0},{"$f":"ROUND(F74*$D$72,2)","v":0},null,null,null,{"$f":"ROUND(J74*$D$72,2)","v":0},null,null,null,{"$f":"SUM(F72:M72)","v":0}]
[{"$f":"IF(A72=\"F\",A72,\"\")","v":""}]
[{"$f":"IF(A73=\"F\",A73,\"\")","v":""},null,null,null,null,0.24,null,null,null,{"$f":"1-F74","v":0.76},null,null,null,{"$f":"IFERROR(E72/100,\"\")","v":0}]
[{"$f":"IF(D75>0,\"F\",\"\")","v":""},"REVESTIMENTO DE PISO",null,{"$f":"Orçamento!V687","v":0},{"$f":"Orçamento!X687","v":0},{"$f":"ROUND(F77*$D$75,2)","v":0},null,null,null,{"$f":"ROUND(J77*$D$75,2)","v":0},null,null,null,{"$f":"SUM(F75:M75)","v":0}]
[{"$f":"IF(A75=\"F\",A75,\"\")","v":""}]
[{"$f":"IF(A76=\"F\",A76,\"\")","v":""},null,null,null,null,0.49,null,null,null,{"$f":"1-F77","v":0.51},null,null,null,{"$f":"IFERROR(E75/100,\"\")","v":0}]
[{"$f":"IF(D78>0,\"F\",\"\")","v":""},"FERRAGENS",null,{"$f":"Orçamento!V688","v":0},{"$f":"Orçamento!X688","v":0},{"$f":"ROUND(F80*$D$78,2)","v":0},null,null,null,{"$f":"ROUND(J80*$D$78,2)","v":0},null,null,null,{"$f":"SUM(F78:M78)","v":0}]
[{"$f":"IF(A78=\"F\",A78,\"\")","v":""}]
[{"$f":"IF(A79=\"F\",A79,\"\")","v":""},null,null,null,null,0,null,null,null,{"$f":"1-F80","v":1},null,null,null,{"$f":"IFERROR(E78/100,\"\")","v":0}]
[{"$f":"IF(D81>0,\"F\",\"\")","v":""},"MARCENARIA",null,{"$f":"Orçamento!V689","v":0},{"$f":"Orçamento!X689","v":0},{"$f":"ROUND(F83*$D$81,2)","v":0},null,null,null,{"$f":"ROUND(J83*$D$81,2)","v":0},null,null,null,{"$f":"SUM(F81:M81)","v":0}]
[{"$f":"IF(A81=\"F\",A81,\"\")","v":""}]
[{"$f":"IF(A82=\"F\",A82,\"\")","v":""},null,null,null,null,0.4,null,null,null,{"$f":"1-F83","v":0.6},null,null,null,{"$f":"IFERROR(E81/100,\"\")","v":0}]
[{"$f":"IF(D84>0,\"F\",\"\")","v":""},"ADMINISTRAÇÃO - MENSALISTAS",null,{"$f":"Orçamento!V690","v":0},{"$f":"Orçamento!X690","v":0},{"$f":"ROUND(F86*$D$84,2)","v":0},null,null,null,{"$f":"ROUND(J86*$D$84,2)","v":0},null,null,null,{"$f":"SUM(F84:M84)","v":0}]
[{"$f":"IF(A84=\"F\",A84,\"\")","v":""}]
[{"$f":"IF(A85=\"F\",A85,\"\")","v":""},null,null,null,null,0.49,null,null,null,{"$f":"1-F86","v":0.51},null,null,null,{"$f":"IFERROR(E84/100,\"\")","v":0}]
[{"$f":"IF(D87>0,\"F\",\"\")","v":""},"PINTURA",null,{"$f":"Orçamento!V691","v":0},{"$f":"Orçamento!X691","v":0},{"$f":"ROUND(F89*$D$87,2)","v":0},null,null,null,{"$f":"ROUND(J89*$D$87,2)","v":0},null,null,null,{"$f":"SUM(F87:M87)","v":0}]
[{"$f":"IF(A87=\"F\",A87,\"\")","v":""}]
[{"$f":"IF(A88=\"F\",A88,\"\")","v":""},null,null,null,null,0,null,null,null,{"$f":"1-F89","v":1},null,null,null,{"$f":"IFERROR(E87/100,\"\")","v":0}]
[{"$f":"IF(D90>0,\"F\",\"\")","v":""},"DIVERSOS",null,{"$f":"Orçamento!V692","v":0},{"$f":"Orçamento!X692","v":0},{"$f":"ROUND(F92*$D$90,2)","v":0},null,null,null,{"$f":"ROUND(J92*$D$90,2)","v":0},null,null,null,{"$f":"SUM(F90:M90)","v":0}]
[{"$f":"IF(A90=\"F\",A90,\"\")","v":""}]
[{"$f":"IF(A91=\"F\",A91,\"\")","v":""},null,null,null,null,0.46,null,null,null,{"$f":"1-F92","v":0.54},null,null,null,{"$f":"IFERROR(E90/100,\"\")","v":0}]
["F","CUSTO DO ORÇAMENTO",null,{"$f":"SUM(D15:D92)","v":0},{"$f":"SUM(E15:E92)","v":0},{"$f":"F15+F18+F21+F24+F27+F30+F33+F36+F39+F42+F45+F48+F51+F54+F57+F60+F63+F66+F69+F72+F75+F78+F81+F84+F87+F90","v":0},null,null,null,{"$f":"J15+J18+J21+J24+J27+J30+J33+J36+J39+J42+J45+J48+J51+J54+J57+J60+J63+J66+J69+J72+J75+J78+J81+J84+J87+J90","v":0},null,null,null,{"$f":"N15+N18+N21+N24+N27+N30+N33+N36+N39+N42+N45+N48+N51+N54+N57+N60+N63+N66+N69+N72+N75+N78+N81+N84+N87+N90","v":0}]
["F","PERCENTUAIS:",null,null,null,{"$f":"IFERROR(F93/D93,\"\")","v":""},null,null,null,{"$f":"IFERROR(J93/D93,\"\")","v":""},null,null,null,{"$f":"SUM(F94:M94)","v":0}]
["F","TOTAIS ACUMULADOS:",null,null,null,{"$f":"F93","v":0},null,null,null,{"$f":"F95+J93","v":0}]
["F","PERCENTUAIS  ACUMULADOS:",null,null,null,{"$f":"F94","v":""},null,null,null,{"$f":"IFERROR(F96+J94,\"\")","v":""}]
["F"]
["F","OBSERVAÇÕES:"]
["F","Os pagamentos somente poderão ser efetuados mediante medição e atesto pelos técnicos da Secretaria da Educação. "]

{"sheet":"Composição BDI","index":4,"n_rows":45,"n_cols":9,"rows_kept":45,"cut":false,"hidden":false,"merged":[[11,0,11,3],[12,0,12,3],[14,0,14,3],[15,0,15,3],[13,0,13,3],[0,0,0,3],[1,0,1,3],[4,0,4,3],[7,0,7,3],[10,0,10,3],[2,0,2,3],[3,0,3,3],[5,0,5,3],[6,0,6,3],[8,0,8,3],[9,0,9,3],[18,5,18,8],[17,0,17,3],[16,0,16,3],[44,0,44,3],[42,0,42,3],[43,0,43,3],[18,0,18,3],[36,0,36,3],[39,0,39,3],[38,0,38,3],[40,0,40,3],[29,0,29,2],[32,0,32,3],[33,0,33,3],[34,0,34,3],[35,0,35,3]]}
[]
[]
["UNIDADE ESCOLAR"]
[{"$f":"Orçamento!$O$4","v":"CENTRO DE ENSINO EM PERÍODO INTEGRAL JOAQUIM EDSON DE CAMARGO"}]
[]
["OBRA"]
[{"$f":"Orçamento!$O$7","v":"REFORMA E AMPLIAÇÃO"}]
[]
["ENDEREÇO"]
[{"$f":"Orçamento!$R$10","v":"RUA SANTIAGO QD. 232 S/N PCA JARDIM DA INFÂNC, JD NOVO MUNDO, CEP:74705-060"}]
[]
["CIDADE"]
[{"$f":"Orçamento!$V$7","v":"GOIÂNIA"}]
[]
["CRE"]
[{"$f":"Orçamento!$O$10","v":"GOIÂNIA"}]
[]
["DETALHAMENTO DA COMPOSIÇÃO DE BDI"]
["COMPOSIÇÃO BDI PARA OBRAS CIVIS",null,null,null,null,"BDI CONSTRUÇÃO E REFORMA"]
["DESCRIÇÃO","COEF.","TAXA % (a.m)","% no preço de venda",null,"Situação","1º Quartil","Médio","3º Quartil"]
["1) COFINS",1,0.03,{"$f":"C21","v":0.03},null,{"$f":"IF(OR(C21<G21,C21>I21),\"FORA DO INTERVALO\",\"OK\")","v":"OK"},0.03,0.03,0.03]
["2) PIS",1,6.4999999999999997E-3,{"$f":"C22","v":6.4999999999999997E-3},null,{"$f":"IF(OR(C22<G22,C22>I22),\"FORA DO INTERVALO\",\"OK\")","v":"OK"},6.4999999999999997E-3,6.4999999999999997E-3,6.4999999999999997E-3]
["3) ISSQN",1,0.03,{"$f":"C23*B23","v":0.03},null,"OK",0.02,3.5000000000000003E-2,0.05]
["4) CPRB",1,0,{"$f":"C24","v":0},null,"FORA DO INTERVALO",4.4999999999999998E-2,4.4999999999999998E-2,4.4999999999999998E-2]
["5) Administração Central",1,0.04,0.04,null,"OK",0.03,0.04,5.5E-2]
["6) Despesas Financeiras",1,5.5999999999999999E-3,5.5999999999999999E-3,null,"FORA DO INTERVALO",5.8999999999999999E-3,1.23E-2,1.3899999999999999E-2]
["7) Seguros + Garantias",1,1.1999999999999999E-3,1.1999999999999999E-3,null,"FORA DO INTERVALO",8.0000000000000002E-3,8.0000000000000002E-3,0.01]
["8) Risco",1,9.7000000000000003E-3,9.7000000000000003E-3,null,"OK",9.7000000000000003E-3,1.2699999999999999E-2,1.2699999999999999E-2]
["9) Lucro",1,7.1999999999999995E-2,7.1999999999999995E-2,null,"OK",6.1600000000000002E-2,7.3999999999999996E-2,8.9599999999999999E-2]
["BDI - FINAL",null,null,{"$f":"(((1+D25+D27+D28)*(1+D26)*(1+D29))/(1-(D21+D22+D23+D24))-1)","v":0.21357639301553344},null,"FORA DO INTERVALO",0.2034,0.22120000000000001,0.25]
[]
["Notas:"]
["(1) e (2) Alíquota definida por lei."]
["(3) Alíquota e base de cálculo definidas pela legislação municipal."]
["(4) Alíquota definida pelas leis 12.546/11, 12844/13 e 13.161/15 (CPRB – contribuição previdenciária sobre a receita bruta)."]
["(5) Valores definidos a partir dos limites no Acórdão nº 2.622/2013 - TCU – Plenário. Valores entre o 1º e 3º quartis."]
["(6) Valor calculado pela expressão matemática do acórdão 2.369/2011 – TCU – Plenário e disponibilizado pela AGETOP em dezembro de 2018. (Foi utilizado para o cálculo a média da Taxa SELIC no período de 11/2017 a 10/2018)"]
[]
["(7) Valores definidos pela AGETOP a partir dos limites no Acórdão nº 2.622/2013 - TCU – Plenário. Valores médios. \n\nObservação da AGETOP: (Seguros contra erros de execução, incêndio e explosão, danos da natureza (vendaval, destelhamento, alagamento, inundação, desmoronamento, geadas etc.), emprego de material defeituoso ou inadequado, roubo e/ou furto qualificado, quebra de equipamentos, desmoronamento de estrutura, nas modalidades de Obras Civis em Construção (OCC); Instalação e Montagem (IM); e Obras Civis em Construção e Instalação e Montagem (OCC/IM). Bem como coberturas adicionais para ampliação dessas coberturas básicas, como: cobertura de responsabilidade civil geral, cobertura de responsabilidade civil cruzada, cobertura de despesas extraordinárias, cobertura de tumultos, cobertura de desentulho do local, cobertura de riscos do fabricante, dentre outras, incluindo o seguro de vida em grupo regido pela convenção coletiva dos trabalhadores na indústria da construção civil). A partir de 24/02/2015 por intermédio da Portaria 449/2015 a Presidência da AGETOP, na pessoa do Senhor Jayme Eduardo Rincon, determinou a exclusão dos valores referentes aos Seguros de Risco de Engenharia e Responsabilidade Civil do Profissional na composição do cálculo do B.D.I.."]
["(8) Valores definidos a partir dos limites no Acórdão nº 2.622/2013 - TCU – Plenário. Valores entre 1º e 3° quartis."]
["(9) Valores definidos a partir dos limites definidos no Acórdão nº 2.622/2013 - TCU – Plenário. Valores adotados e praticados no mercado ( “ ex ante ” ) ou aqueles entre os 1º e 3º quartis."]
[]
["(*) A fórmula para estipulação da taxa de BDI estimado adotado é a mesma que foi aplicada para a obtenção das tabelas contidas no Acórdão n. 2.622/2013 – TCUPlenário"]
[]
["Obs.: Para obras com valores superiores a R$ 20.000.000,00 sugere-se recalcular o BDI, dimensionando as taxas de administração central e lucro para patamares inferiores ao estipulado acima."]

{"sheet":"Relatório CENTRAL","index":5,"n_rows":40,"n_cols":5,"rows_kept":40,"cut":false,"hidden":false,"merged":[[9,0,11,0],[0,1,0,4],[6,3,6,4],[9,3,9,4],[1,1,1,4],[2,1,2,2],[2,3,2,4],[3,1,3,2],[3,3,3,4],[4,1,4,4],[5,1,5,2],[5,3,5,4],[6,1,6,2],[7,1,7,4],[8,1,8,2],[8,3,8,4],[9,1,9,2],[10,1,10,4],[11,1,11,4],[39,1,39,2]]}
[]
[]
[null,"UNIDADE ESCOLAR",null,"CIDADE"]
[null,{"$f":"Orçamento!$O$4","v":"CENTRO DE ENSINO EM PERÍODO INTEGRAL JOAQUIM EDSON DE CAMARGO"},null,{"$f":"Orçamento!$V$7","v":"GOIÂNIA"}]
[]
[null,"OBRA",null,"CRE"]
[null,{"$f":"Orçamento!$O$7","v":"REFORMA E AMPLIAÇÃO"},null,{"$f":"Orçamento!$O$10","v":"GOIÂNIA"}]
[]
[null,"ENDEREÇO",null,"DATA"]
["FILTRO",{"$f":"Orçamento!$R$10","v":"RUA SANTIAGO QD. 232 S/N PCA JARDIM DA INFÂNC, JD NOVO MUNDO, CEP:74705-060"},null,{"$f":"Orçamento!$S$7","v":"2020-04-08"}]
[]
[null,"RELATÓRIO CENTRAL"]
["↓","CÓDIGO","ETAPA","PREÇO  (R$) C/ BDI","PARTIC  ( % )"]
[{"$f":"IF(D14>0,\"F\",\"\")","v":""},{"$f":"Orçamento!O667","v":"a."},{"$f":"Orçamento!P667","v":"SERVIÇOS PRELIMINARES"},{"$f":"Orçamento!V667","v":0},{"$f":"Orçamento!X667","v":0}]
[{"$f":"IF(D15>0,\"F\",\"\")","v":""},{"$f":"Orçamento!O668","v":"b."},{"$f":"Orçamento!P668","v":"TRANSPORTES"},{"$f":"Orçamento!V668","v":0},{"$f":"Orçamento!X668","v":0}]
["",{"$f":"Orçamento!O669","v":"c."},{"$f":"Orçamento!P669","v":"SERVIÇO EM TERRA"},{"$f":"Orçamento!V669","v":0},{"$f":"Orçamento!X669","v":0}]
["",{"$f":"Orçamento!O670","v":"d."},{"$f":"Orçamento!P670","v":"FUNDAÇÕES E SONDAGENS"},{"$f":"Orçamento!V670","v":0},{"$f":"Orçamento!X670","v":0}]
["",{"$f":"Orçamento!O671","v":"e."},{"$f":"Orçamento!P671","v":"ESTRUTURA"},{"$f":"Orçamento!V671","v":0},{"$f":"Orçamento!X671","v":0}]
["",{"$f":"Orçamento!O672","v":"f."},{"$f":"Orçamento!P672","v":"INSTALAÇÕES ELÉTRICAS"},{"$f":"Orçamento!V672","v":0},{"$f":"Orçamento!X672","v":0}]
["",{"$f":"Orçamento!O673","v":"g."},{"$f":"Orçamento!P673","v":"INSTALAÇÕES HIDROSSANITÁRIAS"},{"$f":"Orçamento!V673","v":0},{"$f":"Orçamento!X673","v":0}]
["",{"$f":"Orçamento!O674","v":"h"},{"$f":"Orçamento!P674","v":"INSTALAÇÕES ESPECIAIS"},{"$f":"Orçamento!V674","v":0},{"$f":"Orçamento!X674","v":0}]
["",{"$f":"Orçamento!O675","v":"i."},{"$f":"Orçamento!P675","v":"ALVENARIAS E DIVISÓRIAS"},{"$f":"Orçamento!V675","v":0},{"$f":"Orçamento!X675","v":0}]
["",{"$f":"Orçamento!O676","v":"j."},{"$f":"Orçamento!P676","v":"ALVENARIA AUTO-PORTANTE"},{"$f":"Orçamento!V676","v":0},{"$f":"Orçamento!X676","v":0}]
["",{"$f":"Orçamento!O677","v":"k."},{"$f":"Orçamento!P677","v":"IMPERMEABILIZAÇÃO"},{"$f":"Orçamento!V677","v":0},{"$f":"Orçamento!X677","v":0}]
["",{"$f":"Orçamento!O678","v":"l."},{"$f":"Orçamento!P678","v":"ISOLAMENTO TÉRMICO E ACÚSTICO"},{"$f":"Orçamento!V678","v":0},{"$f":"Orçamento!X678","v":0}]
["",{"$f":"Orçamento!O679","v":"m."},{"$f":"Orçamento!P679","v":"ESTRUTURA DE MADEIRA"},{"$f":"Orçamento!V679","v":0},{"$f":"Orçamento!X679","v":0}]
["",{"$f":"Orçamento!O680","v":"n."},{"$f":"Orçamento!P680","v":"ESTRUTURAS METÁLICAS"},{"$f":"Orçamento!V680","v":0},{"$f":"Orçamento!X680","v":0}]
["",{"$f":"Orçamento!O681","v":"o."},{"$f":"Orçamento!P681","v":"COBERTURAS"},{"$f":"Orçamento!V681","v":0},{"$f":"Orçamento!X681","v":0}]
["",{"$f":"Orçamento!O682","v":"p."},{"$f":"Orçamento!P682","v":"ESQUADRIAS DE MADEIRA"},{"$f":"Orçamento!V682","v":0},{"$f":"Orçamento!X682","v":0}]
["",{"$f":"Orçamento!O683","v":"q."},{"$f":"Orçamento!P683","v":"ESQUADRIAS METÁLICAS"},{"$f":"Orçamento!V683","v":0},{"$f":"Orçamento!X683","v":0}]
["",{"$f":"Orçamento!O684","v":"r."},{"$f":"Orçamento!P684","v":"VIDROS"},{"$f":"Orçamento!V684","v":0},{"$f":"Orçamento!X684","v":0}]
["",{"$f":"Orçamento!O685","v":"s."},{"$f":"Orçamento!P685","v":"REVESTIMENTO DE PAREDE"},{"$f":"Orçamento!V685","v":0},{"$f":"Orçamento!X685","v":0}]
["",{"$f":"Orçamento!O686","v":"t."},{"$f":"Orçamento!P686","v":"FORROS"},{"$f":"Orçamento!V686","v":0},{"$f":"Orçamento!X686","v":0}]
["",{"$f":"Orçamento!O687","v":"u."},{"$f":"Orçamento!P687","v":"REVESTIMENTO DE PISO"},{"$f":"Orçamento!V687","v":0},{"$f":"Orçamento!X687","v":0}]
["",{"$f":"Orçamento!O688","v":"v."},{"$f":"Orçamento!P688","v":"FERRAGENS"},{"$f":"Orçamento!V688","v":0},{"$f":"Orçamento!X688","v":0}]
["",{"$f":"Orçamento!O689","v":"w."},{"$f":"Orçamento!P689","v":"MARCENARIA"},{"$f":"Orçamento!V689","v":0},{"$f":"Orçamento!X689","v":0}]
["",{"$f":"Orçamento!O690","v":"x."},{"$f":"Orçamento!P690","v":"ADMINISTRAÇÃO"},{"$f":"Orçamento!V690","v":0},{"$f":"Orçamento!X690","v":0}]
["",{"$f":"Orçamento!O691","v":"y."},{"$f":"Orçamento!P691","v":"PINTURA"},{"$f":"Orçamento!V691","v":0},{"$f":"Orçamento!X691","v":0}]
["",{"$f":"Orçamento!O692","v":"z."},{"$f":"Orçamento!P692","v":"DIVERSOS"},{"$f":"Orçamento!V692","v":0},{"$f":"Orçamento!X692","v":0}]
["F","TOTAL GERAL DO ORÇAMENTO (R$) C/BDI",null,{"$f":"SUM(D14:D39)","v":0},{"$f":"SUM(E14:E39)","v":0}]

{"sheet":"Parc Maior Relev","index":6,"n_rows":21,"n_cols":7,"rows_kept":21,"cut":false,"hidden":false,"merged":[[0,1,0,6],[11,1,11,6],[1,1,1,6],[2,1,2,3],[2,4,2,6],[3,1,3,3],[3,4,3,6],[4,1,4,6],[5,1,5,3],[5,4,5,6],[9,1,9,3],[9,4,9,6],[10,1,10,6],[6,1,6,3],[6,4,6,6],[7,1,7,6],[10,0,12,0],[8,1,8,3],[8,4,8,6],[21,3,21,7],[19,1,19,6]]}
[]
[]
[null,"UNIDADE ESCOLAR",null,null,"CÓDIGO INEP"]
[null,{"$f":"Orçamento!$O$4","v":"CENTRO DE ENSINO EM PERÍODO INTEGRAL JOAQUIM EDSON DE CAMARGO"},null,null,{"$f":"Orçamento!$V$4","v":52035182}]
[]
[null,"OBRA",null,null,"CIDADE"]
[null,{"$f":"Orçamento!$O$7","v":"REFORMA E AMPLIAÇÃO"},null,null,{"$f":"Orçamento!$V$7","v":"GOIÂNIA"}]
[]
[null,"CRE",null,null,"ÁREA TOTAL CONSTRUÍDA (M²)"]
[null,{"$f":"Orçamento!$O$10","v":"GOIÂNIA"},null,null,{"$f":"Orçamento!$S$13","v":2081.9900000000002}]
["FILTRO"]
[null,"PARCELA DE MAIOR RELEVÂNCIA"]
[null,"CÓDIGO","SERVIÇO","DESCRIÇÃO","UNID","QUANT","PARC. MAIOR RELEVÂNCIA"]
[{"$f":"IF(F14>0,\"F\",\"\")","v":"F"},{"$f":"Somatório!B37","v":"u."},{"$f":"IFERROR(VLOOKUP(B14,Orçamento!$O$667:$P$692,2,FALSE),\"(inserir código ao lado)\")","v":"REVESTIMENTO DE PISO"},"PISO DE CONCRETO","M2",548.33000000000004,{"$f":"F14*0.5","v":274.16500000000002}]
[{"$f":"IF(F15>0,\"F\",\"\")","v":"F"},{"$f":"Somatório!B22","v":"f."},{"$f":"IFERROR(VLOOKUP(B15,Orçamento!$O$667:$P$692,2,FALSE),\"(inserir código ao lado)\")","v":"INSTALAÇÕES ELÉTRICAS"},"INSTALAÇOES ELETRICAS","KVA",85.3,{"$f":"F15*1","v":85.3}]
[{"$f":"IF(F16>0,\"F\",\"\")","v":""},null,{"$f":"IFERROR(VLOOKUP(B16,Orçamento!$O$667:$P$692,2,FALSE),\"(inserir código ao lado)\")","v":"(inserir código ao lado)"},null,{"$f":"IFERROR(VLOOKUP($D16,Orçamento!$R$20:$W$648,2,FALSE),\"-\")","v":"-"},{"$f":"SUMIF(Orçamento!$R$20:$R$648,'Parc Maior Relev'!D16,Orçamento!$T$20:$T$648)","v":0},{"$f":"F16*0.5","v":0}]
["",null,{"$f":"IFERROR(VLOOKUP(B17,Orçamento!$O$667:$P$692,2,FALSE),\"(inserir código ao lado)\")","v":"(inserir código ao lado)"},null,{"$f":"IFERROR(VLOOKUP($D17,Orçamento!$R$20:$W$648,2,FALSE),\"-\")","v":"-"},{"$f":"SUMIF(Orçamento!$R$20:$R$648,'Parc Maior Relev'!D17,Orçamento!$T$20:$T$648)","v":0},0]
["",null,{"$f":"IFERROR(VLOOKUP(B18,Orçamento!$O$667:$P$692,2,FALSE),\"(inserir código ao lado)\")","v":"(inserir código ao lado)"},null,{"$f":"IFERROR(VLOOKUP($D18,Orçamento!$R$20:$W$648,2,FALSE),\"-\")","v":"-"},{"$f":"SUMIF(Orçamento!$R$20:$R$648,'Parc Maior Relev'!D18,Orçamento!$T$20:$T$648)","v":0},0]
["F"]
["F","(*) Para os fins do inciso I dp § 1º do Art. 30 da Lei Federal 8.666/93, são consideradas parcelas de maior relevância técnica as execuções apresentadas"]
["F"]

{"sheet":"Composições","index":7,"n_rows":268,"n_cols":10,"rows_kept":268,"cut":false,"hidden":false,"merged":[[15,0,15,9],[13,0,13,2],[13,3,13,6],[1,0,1,9],[3,7,3,9],[4,7,4,9],[6,7,6,9],[7,7,7,9],[6,0,6,6],[10,8,10,9],[13,8,13,9],[14,0,14,9],[8,0,8,9],[5,0,5,9],[2,0,2,9],[0,0,0,8],[10,0,10,2],[10,3,10,6],[11,0,11,9],[12,0,12,2],[12,3,12,6],[12,7,12,8],[7,0,7,6],[9,0,9,2],[9,3,9,6],[9,7,9,8],[3,0,3,6],[4,0,4,6],[16,5,17,5],[16,6,16,7],[16,8,16,9],[22,1,22,7],[26,1,26,7],[16,0,17,0],[16,1,17,1],[16,2,17,2],[16,3,17,3],[16,4,17,4],[28,5,29,5],[28,6,28,7],[28,8,28,9],[34,1,34,7],[38,1,38,7],[28,0,29,0],[28,1,29,1],[28,2,29,2],[28,3,29,3],[28,4,29,4],[40,5,41,5],[40,6,40,7],[40,8,40,9],[46,1,46,7],[50,1,50,7],[40,0,41,0],[40,1,41,1],[40,2,41,2],[40,3,41,3],[40,4,41,4],[52,5,53,5],[52,6,52,7],[52,8,52,9],[58,1,58,7],[62,1,62,7],[52,0,53,0],[52,1,53,1],[52,2,53,2],[52,3,53,3],[52,4,53,4],[64,5,65,5],[64,6,64,7],[64,8,64,9],[70,1,70,7],[74,1,74,7],[64,0,65,0],[64,1,65,1],[64,2,65,2],[64,3,65,3],[64,4,65,4],[76,5,77,5],[76,6,76,7],[76,8,76,9],[80,1,80,7],[84,1,84,7],[76,0,77,0],[76,1,77,1],[76,2,77,2],[76,3,77,3],[76,4,77,4],[86,5,87,5],[86,6,86,7],[86,8,86,9],[92,1,92,7],[99,1,99,7],[86,0,87,0],[86,1,87,1],[86,2,87,2],[86,3,87,3],[86,4,87,4],[101,5,102,5],[101,6,101,7],[101,8,101,9],[107,1,107,7],[111,1,111,7],[101,0,102,0],[101,1,102,1],[101,2,102,2],[101,3,102,3],[101,4,102,4],[113,5,114,5],[113,6,113,7],[113,8,113,9],[119,1,119,7],[123,1,123,7],[113,0,114,0],[113,1,114,1],[113,2,114,2],[113,3,114,3],[113,4,114,4],[125,5,126,5],[125,6,125,7],[125,8,125,9],[131,1,131,7],[135,1,135,7],[125,0,126,0],[125,1,126,1],[125,2,126,2],[125,3,126,3],[125,4,126,4],[137,5,138,5],[137,6,137,7],[137,8,137,9],[143,1,143,7],[147,1,147,7],[137,0,138,0],[137,1,138,1],[137,2,138,2],[137,3,138,3],[137,4,138,4],[149,5,150,5],[149,6,149,7],[149,8,149,9],[155,1,155,7],[159,1,159,7],[149,0,150,0],[149,1,150,1],[149,2,150,2],[149,3,150,3],[149,4,150,4],[161,5,162,5],[161,6,161,7],[161,8,161,9],[167,1,167,7],[171,1,171,7],[161,0,162,0],[161,1,162,1],[161,2,162,2],[161,3,162,3],[161,4,162,4],[173,5,174,5],[173,6,173,7],[173,8,173,9],[179,1,179,7],[183,1,183,7],[173,0,174,0],[173,1,174,1],[173,2,174,2],[173,3,174,3],[173,4,174,4],[185,5,186,5],[185,6,185,7],[185,8,185,9],[191,1,191,7],[195,1,195,7],[185,0,186,0],[185,1,186,1],[185,2,186,2],[185,3,186,3],[185,4,186,4],[197,5,198,5],[197,6,197,7],[197,8,197,9],[203,1,203,7],[207,1,207,7],[197,0,198,0],[197,1,198,1],[197,2,198,2],[197,3,198,3],[197,4,198,4],[209,5,210,5],[209,6,209,7],[209,8,209,9],[215,1,215,7],[219,1,219,7],[209,0,210,0],[209,1,210,1],[209,2,210,2],[209,3,210,3],[209,4,210,4],[221,5,222,5],[221,6,221,7],[221,8,221,9],[227,1,227,7],[231,1,231,7],[221,0,222,0],[221,1,222,1],[221,2,222,2],[221,3,222,3],[221,4,222,4],[233,5,234,5],[233,6,233,7],[233,8,233,9],[239,1,239,7],[243,1,243,7],[233,0,234,0],[233,1,234,1],[233,2,234,2],[233,3,234,3],[233,4,234,4],[245,5,246,5],[245,6,245,7],[245,8,245,9],[250,1,250,7],[253,1,253,7],[245,0,246,0],[245,1,246,1],[245,2,246,2],[245,3,246,3],[245,4,246,4],[255,5,256,5],[255,6,255,7],[255,8,255,9],[261,1,261,7],[267,1,267,7],[255,0,256,0],[255,1,256,1],[255,2,256,2],[255,3,256,3],[255,4,256,4]]}
[]
[]
[]
["UNIDADE ESCOLAR",null,null,null,null,null,null,"CÓDIGO INEP"]
[{"$f":"Orçamento!$O$4","v":"CENTRO DE ENSINO EM PERÍODO INTEGRAL JOAQUIM EDSON DE CAMARGO"},null,null,null,null,null,null,{"$f":"Orçamento!$V$4","v":52035182}]
[]
["OBRA",null,null,null,null,null,null,"CIDADE"]
[{"$f":"Orçamento!$O$7","v":"REFORMA E AMPLIAÇÃO"},null,null,null,null,null,null,{"$f":"Orçamento!$V$7","v":"GOIÂNIA"}]
[]
["CRE",null,null,"ENDEREÇO",null,null,null,"REFERÊNCIA AGETOP"]
[{"$f":"Orçamento!$O$10","v":"GOIÂNIA"},null,null,{"$f":"Orçamento!$R$10","v":"RUA SANTIAGO QD. 232 S/N PCA JARDIM DA INFÂNC, JD NOVO MUNDO, CEP:74705-060"},null,null,null,{"$f":"Orçamento!$V$10","v":"DEZ/18"},{"$f":"Orçamento!$W$10","v":"NÃO DESONERADA"}]
[]
["DATA",null,null,"ÁREA TOTAL CONSTRUÍDA (M²)",null,null,null,"REFERÊNCIA SINAPI"]
[{"$f":"Orçamento!$S$7","v":"2020-04-08"},null,null,{"$f":"Orçamento!$S$13","v":2081.9900000000002},null,null,null,{"$f":"Orçamento!$V$13","v":"FEV/19"},{"$f":"Orçamento!$W$13","v":"NÃO DESONERADA"}]
[]
["COMPOSIÇÕES DE CUSTOS UNITÁRIOS - SEE-GO"]
[46,"FONTE","CÓDIGO","DESCRIÇÃO","UNIDADE","COEFIC.","CUSTO UNITÁRIO",null,"CUSTO  TOTAL (A) + (B) + (C) + (D) + (E)"]
[null,null,null,null,null,null,"DESONERADO","NÃO DESONER.","DESONERADO","NÃO DESONER."]
[null,"COMPOSIÇÃO","COMP 046_SEE","CAPUZ PARA PROTEÇÃO DOS PARA RAIOS","UN ",null,null,null,16.53,16.650000000000002]
[null,"AGETOP_I",8,"AJUDANTE","h     ",3.3300000000000003E-2,8.1999999999999993,9.51,0.27,0.32]
[null,"AGETOP_I",12,"ELETRICISTA","h     ",3.3300000000000003E-2,13.4,15.53,0.45,0.52]
[null,null,null,"","",null,0,0,0,0]
[null,"MÃO DE OBRA (B) - TOTAL",null,null,null,null,null,null,0.72,0.84000000000000008]
[null,"COTAÇÃO","COT 010_SEE","CAPUZ PARA PROTEÇÃO DOS PARA RAIOS","UN ",1,15.81,15.81,15.81,15.81]
[null,null,null,"","",null,0,0,0,0]
[null,null,null,"","",null,0,0,0,0]
[null,"MATERIAL (C) - TOTAL",null,null,null,null,null,null,15.81,15.81]
[]
[47,"FONTE","CÓDIGO","DESCRIÇÃO","UNIDADE","COEFIC.","CUSTO UNITÁRIO",null,"CUSTO  TOTAL (A) + (B) + (C) + (D) + (E)"]
[null,null,null,null,null,null,"DESONERADO","NÃO DESONER.","DESONERADO","NÃO DESONER."]
[null,"COMPOSIÇÃO","COMP 047_SEE","CAPUZ DE PROTEÇÃO PARA BUCHA DE TRANSFORMADOR","UN ",null,null,null,16.53,16.650000000000002]
[null,"AGETOP_I",8,"AJUDANTE","h     ",3.3300000000000003E-2,8.1999999999999993,9.51,0.27,0.32]
[null,"AGETOP_I",12,"ELETRICISTA","h     ",3.3300000000000003E-2,13.4,15.53,0.45,0.52]
[null,null,null,"","",null,0,0,0,0]
[null,"MÃO DE OBRA (B) - TOTAL",null,null,null,null,null,null,0.72,0.84000000000000008]
[null,"COTAÇÃO","COT 011_SEE","CAPUZ DE PROTEÇÃO PARA BUCHA DE TRANSFORMADOR","UN ",1,15.81,15.81,15.81,15.81]
[null,null,null,"","",null,0,0,0,0]
[null,null,null,"","",null,0,0,0,0]
[null,"MATERIAL (C) - TOTAL",null,null,null,null,null,null,15.81,15.81]
[]
[48,"FONTE","CÓDIGO","DESCRIÇÃO","UNIDADE","COEFIC.","CUSTO UNITÁRIO",null,"CUSTO  TOTAL (A) + (B) + (C) + (D) + (E)"]
[null,null,null,null,null,null,"DESONERADO","NÃO DESONER.","DESONERADO","NÃO DESONER."]
[null,"COMPOSIÇÃO","COMP 048_SEE","HASTE ROSQUEADA \"TIRANTE\" 3/8\"","M",null,null,null,14.02,15.39]
[null,"AGETOP_I",8,"AJUDANTE","h     ",0.4,8.1999999999999993,9.51,3.28,3.8]
[null,"AGETOP_I",12,"ELETRICISTA","h     ",0.4,13.4,15.53,5.36,6.21]
[null,null,null,"","",null,0,0,0,0]
[null,"MÃO DE OBRA (B) - TOTAL",null,null,null,null,null,null,8.64,10.01]
[null,"COTAÇÃO","COT 012_SEE","HASTE ROSQUEADA \"TIRANTE\" 3/8\"","M",1,5.3833333333333329,5.3833333333333329,5.38,5.38]
[null,null,null,"","",null,0,0,0,0]
[null,null,null,"","",null,0,0,0,0]
[null,"MATERIAL (C) - TOTAL",null,null,null,null,null,null,5.38,5.38]
[]
[49,"FONTE","CÓDIGO","DESCRIÇÃO","UNIDADE","COEFIC.","CUSTO UNITÁRIO",null,"CUSTO  TOTAL (A) + (B) + (C) + (D) + (E)"]
[null,null,null,null,null,null,"DESONERADO","NÃO DESONER.","DESONERADO","NÃO DESONER."]
[null,"COMPOSIÇÃO","COMP 049_SEE","PORCA SEXTAVADA 3/8\"","UN ",null,null,null,0.2,0.22]
[null,"AGETOP_I",8,"AJUDANTE","h     ",8.9999999999999993E-3,8.1999999999999993,9.51,7.0000000000000007E-2,0.09]
[null,null,null,"","",null,0,0,0,0]
[null,null,null,"","",null,0,0,0,0]
[null,"MÃO DE OBRA (B) - TOTAL",null,null,null,null,null,null,7.0000000000000007E-2,0.09]
[null,"COTAÇÃO","COT 013_SEE","PORCA SEXTAVADA 3/8\"","UN ",1,0.13,0.13,0.13,0.13]
[null,null,null,"","",null,0,0,0,0]
[null,null,null,"","",null,0,0,0,0]
[null,"MATERIAL (C) - TOTAL",null,null,null,null,null,null,0.13,0.13]
[]
[24,"FONTE","CÓDIGO","DESCRIÇÃO","UNIDADE","COEFIC.","CUSTO UNITÁRIO",null,"CUSTO  TOTAL (A) + (B) + (C) + (D) + (E)"]
[null,null,null,null,null,null,"DESONERADO","NÃO DESONER.","DESONERADO","NÃO DESONER."]
[null,"COMPOSIÇÃO","COMP 024_SEE","SINALIZADOR FOTOLUMINESCENTE PARA EXTINTOR","UN ",null,"-","-",25.269999999999996,25.389999999999997]
[null,"AGETOP_I",5,"SERVENTE","h     ",0.09,8.1999999999999993,9.51,0.74,0.86]
[null,null,null,"","",null,0,0,0,0]
[null,null,null,"","",null,0,0,0,0]
[null,"MÃO DE OBRA (B) - TOTAL",null,null,null,null,null,null,0.74,0.86]
[null,"AGETOP_I",3070,"BUCHA DE NYLON S-6","un",2,0.04,0.04,0.08,0.08]
[null,"AGETOP_I",3393,"PARAFUSO P/BUCHA S-6","un",2,0.08,0.08,0.16,0.16]
[null,"SINAPI_I",37556,"PLACA DE SINALIZACAO DE SEGURANCA CONTRA INCENDIO, FOTOLUMINESCENTE, QUADRADA, *20 X 20* CM, EM PVC *2* MM ANTI-CHAMAS (SIMBOLOS, CORES E PICTOGRAMAS CONFORME NBR 13434)","UN    ",1,24.29,24.29,24.29,24.29]
[null,"MATERIAL (C) - TOTAL",null,null,null,null,null,null,24.529999999999998,24.529999999999998]
[]
[25,"FONTE","CÓDIGO","DESCRIÇÃO","UNIDADE","COEFIC.","CUSTO UNITÁRIO",null,"CUSTO  TOTAL (A) + (B) + (C) + (D) + (E)"]
[null,null,null,null,null,null,"DESONERADO","NÃO DESONER.","DESONERADO","NÃO DESONER."]
[null,"COMPOSIÇÃO","COMP 025_SEE","SINALIZADOR FOTOLUMINESCENTE DE EMERGÊNCIA","UN ",null,"-","-",25.269999999999996,25.389999999999997]
[null,"AGETOP_I",5,"SERVENTE","h     ",0.09,8.1999999999999993,9.51,0.74,0.86]
[null,"MÃO DE OBRA (B) - TOTAL",null,null,null,null,null,null,0.74,0.86]
[null,"AGETOP_I",3070,"BUCHA DE NYLON S-6","un",2,0.04,0.04,0.08,0.08]
[null,"AGETOP_I",3393,"PARAFUSO P/BUCHA S-6","un",2,0.08,0.08,0.16,0.16]
[null,"SINAPI_I",37556,"PLACA DE SINALIZACAO DE SEGURANCA CONTRA INCENDIO, FOTOLUMINESCENTE, QUADRADA, *20 X 20* CM, EM PVC *2* MM ANTI-CHAMAS (SIMBOLOS, CORES E PICTOGRAMAS CONFORME NBR 13434)","UN    ",1,24.29,24.29,24.29,24.29]
[null,"MATERIAL (C) - TOTAL",null,null,null,null,null,null,24.529999999999998,24.529999999999998]
[]
[277,"FONTE","CÓDIGO","DESCRIÇÃO","UNIDADE","COEFIC.","CUSTO UNITÁRIO",null,"CUSTO  TOTAL (A) + (B) + (C) + (D) + (E)"]
[null,null,null,null,null,null,"DESONERADO","NÃO DESONER.","DESONERADO","NÃO DESONER."]
[null,"COMPOSIÇÃO","COMP 277_SEE","MARCAÇÃO NO PISO - 1X1 M PARA EXTINTOR","M2",null,null,null,26.499999999999996,26.57]
[null,"AGETOP_I",5,"SERVENTE","h     ",3.3300000000000003E-2,8.1999999999999993,9.51,0.27,0.32]
[null,null,null,"","",null,0,0,0,0]
[null,null,null,"","",null,0,0,0,0]
[null,"MÃO DE OBRA (B) - TOTAL",null,null,null,null,null,null,0.27,0.32]
[null,"SINAPI_I",5318,"SOLVENTE DILUENTE A BASE DE AGUARRAS","L     ",0.13,11.4,11.4,1.48,1.48]
[null,"SINAPI",5824,"CAMINHÃO TOCO, PBT 16.000 KG, CARGA ÚTIL MÁX. 10.685 KG, DIST. ENTRE EIXOS 4,8 M, POTÊNCIA 189 CV, INCLUSIVE CARROCERIA FIXA ABERTA DE MADEIRA P/ TRANSPORTE GERAL DE CARGA SECA, DIMEN. APROX. 2,5 X 7,00 X 0,50 M - CHP DIURNO. AF_06/2014","CHP",3.3E-3,133.51,136.72,0.44,0.45]
[null,"SINAPI_I",7343,"TINTA A BASE DE RESINA ACRILICA, PARA SINALIZACAO HORIZONTAL VIARIA (NBR 11862)","L     ",0.6,11.58,11.58,6.95,6.95]
[null,"SINAPI_I",7348,"TINTA ACRILICA PREMIUM PARA PISO","L     ",0.03,12.39,12.39,0.37,0.37]
[null,"SINAPI_I",25972,"MICROESFERAS DE VIDRO PARA SINALIZACAO HORIZONTAL VIARIA, TIPO I-B (PREMIX) - NBR 16184","KG    ",2.14,7.77,7.77,16.63,16.63]
[null,"SINAPI",95133,"MÁQUINA DEMARCADORA DE FAIXA DE TRÁFEGO À FRIO, AUTOPROPELIDA, POTÊNCIA 38 HP - CHP DIURNO. AF_07/2016","CHP",3.3E-3,109.71,113.29,0.36,0.37]
[null,"MATERIAL (C) - TOTAL",null,null,null,null,null,null,26.229999999999997,26.25]
[]
[382,"FONTE","CÓDIGO","DESCRIÇÃO","UNIDADE","COEFIC.","CUSTO UNITÁRIO",null,"CUSTO  TOTAL (A) + (B) + (C) + (D) + (E)"]
[null,null,null,null,null,null,"DESONERADO","NÃO DESONER.","DESONERADO","NÃO DESONER."]
[null,"COMPOSIÇÃO","COMP 382_SEE","TE DE REDUCAO DE FERRO GALVANIZADO, COM ROSCA BSP, DE 3/4\" X 1/2\"","UN ",null,null,null,21.83,23.92]
[null,"AGETOP_I",8,"AJUDANTE","h     ",0.6,8.1999999999999993,9.51,4.92,5.71]
[null,"AGETOP_I",11,"ENCANADOR","h     ",0.61050000000000004,13.4,15.53,8.18,9.48]
[null,null,null,"","",null,0,0,0,0]
[null,"MÃO DE OBRA (B) - TOTAL",null,null,null,null,null,null,13.1,15.190000000000001]
[null,"SINAPI_I",3146,"FITA VEDA ROSCA EM ROLOS DE 18 MM X 10 M (L X C)","UN    ",0.12075471698113208,3.48,3.48,0.42,0.42]
[null,"SINAPI_I",6302,"TE DE REDUCAO DE FERRO GALVANIZADO, COM ROSCA BSP, DE 3/4\" X 1/2\"","UN    ",1,8.31,8.31,8.31,8.31]
[null,null,null,"","",null,0,0,0,0]
[null,"MATERIAL (C) - TOTAL",null,null,null,null,null,null,8.73,8.73]
[]
[383,"FONTE","CÓDIGO","DESCRIÇÃO","UNIDADE","COEFIC.","CUSTO UNITÁRIO",null,"CUSTO  TOTAL (A) + (B) + (C) + (D) + (E)"]
[null,null,null,null,null,null,"DESONERADO","NÃO DESONER.","DESONERADO","NÃO DESONER."]
[null,"COMPOSIÇÃO","COMP 383_SEE","BUCHA DE REDUCAO DE FERRO GALVANIZADO, COM ROSCA BSP, DE 1/2\" X 1/4\"","UN ",null,null,null,6.85,7.4]
[null,"AGETOP_I",8,"AJUDANTE","h     ",0.16,8.1999999999999993,9.51,1.31,1.52]
[null,"AGETOP_I",11,"ENCANADOR","h     ",0.16,13.4,15.53,2.14,2.48]
[null,null,null,"","",null,0,0,0,0]
[null,"MÃO DE OBRA (B) - TOTAL",null,null,null,null,null,null,3.45,4]
[null,"AGETOP_I","H689","FITA VEDAROSCA 12 MM","m",1.2,0.28000000000000003,0.28000000000000003,0.34,0.34]
[null,"SINAPI_I",770,"BUCHA DE REDUCAO DE FERRO GALVANIZADO, COM ROSCA BSP, DE 1/2\" X 1/4\"","UN    ",1,3.06,3.06,3.06,3.06]
[null,null,null,"","",null,0,0,0,0]
[null,"MATERIAL (C) - TOTAL",null,null,null,null,null,null,3.4,3.4]
[]
[212,"FONTE","CÓDIGO","DESCRIÇÃO","UNIDADE","COEFIC.","CUSTO UNITÁRIO",null,"CUSTO  TOTAL (A) + (B) + (C) + (D) + (E)"]
[null,null,null,null,null,null,"DESONERADO","NÃO DESONER.","DESONERADO","NÃO DESONER."]
[null,"COMPOSIÇÃO","COMP 212_SEE","NIPLE DE REDUÇÃO 1/2\" X 1/4\" BSP","UN ",null,null,null,9.5,10.050000000000001]
[null,"AGETOP_I",8,"AJUDANTE","h     ",0.16,8.1999999999999993,9.51,1.31,1.52]
[null,"AGETOP_I",11,"ENCANADOR","h     ",0.16,13.4,15.53,2.14,2.48]
[null,null,null,"","",null,0,0,0,0]
[null,"MÃO DE OBRA (B) - TOTAL",null,null,null,null,null,null,3.45,4]
[null,"COTAÇÃO","COT 103_SEE","NIPLE DE REDUÇÃO 1/2\" X 1/4\" BSP","UN",1,6.0533333333333337,6.0533333333333337,6.05,6.05]
[null,null,null,"","",null,0,0,0,0]
[null,null,null,"","",null,0,0,0,0]
[null,"MATERIAL (C) - TOTAL",null,null,null,null,null,null,6.05,6.05]
[]
[213,"FONTE","CÓDIGO","DESCRIÇÃO","UNIDADE","COEFIC.","CUSTO UNITÁRIO",null,"CUSTO  TOTAL (A) + (B) + (C) + (D) + (E)"]
[null,null,null,null,null,null,"DESONERADO","NÃO DESONER.","DESONERADO","NÃO DESONER."]
[null,"COMPOSIÇÃO","COMP 213_SEE","NIPLE DE REDUÇÃO 3/4\" X 1/2\" BSP","UN ",null,null,null,13.16,13.71]
[null,"AGETOP_I",8,"AJUDANTE","h     ",0.16,8.1999999999999993,9.51,1.31,1.52]
[null,"AGETOP_I",11,"ENCANADOR","h     ",0.16,13.4,15.53,2.14,2.48]
[null,null,null,"","",null,0,0,0,0]
[null,"MÃO DE OBRA (B) - TOTAL",null,null,null,null,null,null,3.45,4]
[null,"COTAÇÃO","COT 104_SEE","NIPLE DE REDUÇÃO 3/4\" X 1/2\" BSP","UN",1,9.7099999999999991,9.7099999999999991,9.7100000000000009,9.7100000000000009]
[null,null,null,"","",null,0,0,0,0]
[null,null,null,"","",null,0,0,0,0]
[null,"MATERIAL (C) - TOTAL",null,null,null,null,null,null,9.7100000000000009,9.7100000000000009]
[]
[237,"FONTE","CÓDIGO","DESCRIÇÃO","UNIDADE","COEFIC.","CUSTO UNITÁRIO",null,"CUSTO  TOTAL (A) + (B) + (C) + (D) + (E)"]
[null,null,null,null,null,null,"DESONERADO","NÃO DESONER.","DESONERADO","NÃO DESONER."]
[null,"COMPOSIÇÃO","COMP 237_SEE","FITA ANTICORROSIVA","M",null,null,null,11.100000000000001,11.79]
[null,"AGETOP_I",8,"AJUDANTE","h     ",0.2,8.1999999999999993,9.51,1.64,1.9]
[null,"AGETOP_I",12,"ELETRICISTA","h     ",0.2,13.4,15.53,2.68,3.11]
[null,null,null,"","",null,0,0,0,0]
[null,"MÃO DE OBRA (B) - TOTAL",null,null,null,null,null,null,4.32,5.01]
[null,"SINAPI_I",39634,"FITA ADESIVA ANTICORROSIVA DE PVC FLEXIVEL, COR PRETA, PARA PROTECAO TUBULACAO, 50 MM X 30 M (L X C), E= *0,25* MM","M     ",1,6.78,6.78,6.78,6.78]
[null,null,null,"","",null,0,0,0,0]
[null,null,null,"","",null,0,0,0,0]
[null,"MATERIAL (C) - TOTAL",null,null,null,null,null,null,6.78,6.78]
[]
[542,"FONTE","CÓDIGO","DESCRIÇÃO","UNIDADE","COEFIC.","CUSTO UNITÁRIO",null,"CUSTO  TOTAL (A) + (B) + (C) + (D) + (E)"]
[null,null,null,null,null,null,"DESONERADO","NÃO DESONER.","DESONERADO","NÃO DESONER."]
[null,"COMPOSIÇÃO","COMP 542_SEE","VÁLVULA UGV 3/4\" (S) LATÃO","UN ",null,null,null,25.17,26.66]
[null,"AGETOP_I",8,"AJUDANTE","h     ",0.432,8.1999999999999993,9.51,3.54,4.1100000000000003]
[null,"AGETOP_I",11,"ENCANADOR","h     ",0.432,13.4,15.53,5.79,6.71]
[null,null,null,"","",null,0,0,0,0]
[null,"MÃO DE OBRA (B) - TOTAL",null,null,null,null,null,null,9.33,10.82]
[null,"COTAÇÃO","COT 281_SEE","VÁLVULA UGV 3/4\" (S) LATÃO","UN ",1,15.836666666666666,15.836666666666666,15.84,15.84]
[null,null,null,"","",null,0,0,0,0]
[null,null,null,"","",null,0,0,0,0]
[null,"MATERIAL (C) - TOTAL",null,null,null,null,null,null,15.84,15.84]
[]
[543,"FONTE","CÓDIGO","DESCRIÇÃO","UNIDADE","COEFIC.","CUSTO UNITÁRIO",null,"CUSTO  TOTAL (A) + (B) + (C) + (D) + (E)"]
[null,null,null,null,null,null,"DESONERADO","NÃO DESONER.","DESONERADO","NÃO DESONER."]
[null,"COMPOSIÇÃO","COMP 543_SEE","VÁLVULA UGV 1/2\" (S) LATÃO","UN ",null,null,null,24.5,25.990000000000002]
[null,"AGETOP_I",8,"AJUDANTE","h     ",0.432,8.1999999999999993,9.51,3.54,4.1100000000000003]
[null,"AGETOP_I",11,"ENCANADOR","h     ",0.432,13.4,15.53,5.79,6.71]
[null,null,null,"","",null,0,0,0,0]
[null,"MÃO DE OBRA (B) - TOTAL",null,null,null,null,null,null,9.33,10.82]
[null,"COTAÇÃO","COT 282_SEE","VÁLVULA UGV 1/2\" (S) LATÃO","UN ",1,15.166666666666666,15.166666666666666,15.17,15.17]
[null,null,null,"","",null,0,0,0,0]
[null,null,null,"","",null,0,0,0,0]
[null,"MATERIAL (C) - TOTAL",null,null,null,null,null,null,15.17,15.17]
[]
[211,"FONTE","CÓDIGO","DESCRIÇÃO","UNIDADE","COEFIC.","CUSTO UNITÁRIO",null,"CUSTO  TOTAL (A) + (B) + (C) + (D) + (E)"]
[null,null,null,null,null,null,"DESONERADO","NÃO DESONER.","DESONERADO","NÃO DESONER."]
[null,"COMPOSIÇÃO","COMP 211_SEE","REGULADOR DE 2º ESTÁGIO 5KG/H","UN ",null,null,null,85.46,89.419999999999987]
[null,"AGETOP_I",8,"AJUDANTE","h     ",1.1499999999999999,8.1999999999999993,9.51,9.43,10.94]
[null,"AGETOP_I",11,"ENCANADOR","h     ",1.1499999999999999,13.4,15.53,15.41,17.86]
[null,null,null,"","",null,0,0,0,0]
[null,"MÃO DE OBRA (B) - TOTAL",null,null,null,null,null,null,24.84,28.799999999999997]
[null,"COTAÇÃO","COT 102_SEE","REGULADOR DE 2º ESTÁGIO 5KG/H","UN",1,59.833333333333336,59.833333333333336,59.83,59.83]
[null,"AGETOP_I","H689","FITA VEDAROSCA 12 MM","m",2.82,0.28000000000000003,0.28000000000000003,0.79,0.79]
[null,null,null,"","",null,0,0,0,0]
[null,"MATERIAL (C) - TOTAL",null,null,null,null,null,null,60.62,60.62]
[]
[210,"FONTE","CÓDIGO","DESCRIÇÃO","UNIDADE","COEFIC.","CUSTO UNITÁRIO",null,"CUSTO  TOTAL (A) + (B) + (C) + (D) + (E)"]
[null,null,null,null,null,null,"DESONERADO","NÃO DESONER.","DESONERADO","NÃO DESONER."]
[null,"COMPOSIÇÃO","COMP 210_SEE","REGULADOR DE 1º ESTÁGIO 60KG/H MODELO AP-40  COM MANÔMETRO","UN ",null,null,null,231.21,235.17000000000002]
[null,"AGETOP_I",8,"AJUDANTE","h     ",1.1499999999999999,8.1999999999999993,9.51,9.43,10.94]
[null,"AGETOP_I",11,"ENCANADOR","h     ",1.1499999999999999,13.4,15.53,15.41,17.86]
[null,null,null,"","",null,0,0,0,0]
[null,"MÃO DE OBRA (B) - TOTAL",null,null,null,null,null,null,24.84,28.799999999999997]
[null,"COTAÇÃO","COT 101_SEE","REGULADOR DE 1º ESTÁGIO 60KG/H MODELO AP-40  COM MANÔMETRO","UN",1,205.57666666666668,205.57666666666668,205.58,205.58]
[null,"AGETOP_I","H689","FITA VEDAROSCA 12 MM","m",2.82,0.28000000000000003,0.28000000000000003,0.79,0.79]
[null,null,null,"","",null,0,0,0,0]
[null,"MATERIAL (C) - TOTAL",null,null,null,null,null,null,206.37,206.37]
[]
[235,"FONTE","CÓDIGO","DESCRIÇÃO","UNIDADE","COEFIC.","CUSTO UNITÁRIO",null,"CUSTO  TOTAL (A) + (B) + (C) + (D) + (E)"]
[null,null,null,null,null,null,"DESONERADO","NÃO DESONER.","DESONERADO","NÃO DESONER."]
[null,"COMPOSIÇÃO","COMP 235_SEE","PLACA DE SINALIZAÇÃO EM PVC COD 01 - (300X300) PROIBIDO FUMAR","UN ",null,null,null,25.269999999999996,25.389999999999997]
[null,"AGETOP_I",5,"SERVENTE","h     ",0.09,8.1999999999999993,9.51,0.74,0.86]
[null,null,null,"","",null,0,0,0,0]
[null,null,null,"","",null,0,0,0,0]
[null,"MÃO DE OBRA (B) - TOTAL",null,null,null,null,null,null,0.74,0.86]
[null,"AGETOP_I",3070,"BUCHA DE NYLON S-6","un",2,0.04,0.04,0.08,0.08]
[null,"AGETOP_I",3393,"PARAFUSO P/BUCHA S-6","un",2,0.08,0.08,0.16,0.16]
[null,"SINAPI_I",37556,"PLACA DE SINALIZACAO DE SEGURANCA CONTRA INCENDIO, FOTOLUMINESCENTE, QUADRADA, *20 X 20* CM, EM PVC *2* MM ANTI-CHAMAS (SIMBOLOS, CORES E PICTOGRAMAS CONFORME NBR 13434)","UN    ",1,24.29,24.29,24.29,24.29]
[null,"MATERIAL (C) - TOTAL",null,null,null,null,null,null,24.529999999999998,24.529999999999998]
[]
[236,"FONTE","CÓDIGO","DESCRIÇÃO","UNIDADE","COEFIC.","CUSTO UNITÁRIO",null,"CUSTO  TOTAL (A) + (B) + (C) + (D) + (E)"]
[null,null,null,null,null,null,"DESONERADO","NÃO DESONER.","DESONERADO","NÃO DESONER."]
[null,"COMPOSIÇÃO","COMP 236_SEE","PLACA DE SINALIZAÇÃO EM PVC COD 06 - (300X300) PERIGO INFLAMÁVEL","UN ",null,null,null,25.269999999999996,25.389999999999997]
[null,"AGETOP_I",5,"SERVENTE","h     ",0.09,8.1999999999999993,9.51,0.74,0.86]
[null,null,null,"","",null,0,0,0,0]
[null,null,null,"","",null,0,0,0,0]
[null,"MÃO DE OBRA (B) - TOTAL",null,null,null,null,null,null,0.74,0.86]
[null,"AGETOP_I",3070,"BUCHA DE NYLON S-6","un",2,0.04,0.04,0.08,0.08]
[null,"AGETOP_I",3393,"PARAFUSO P/BUCHA S-6","un",2,0.08,0.08,0.16,0.16]
[null,"SINAPI_I",37556,"PLACA DE SINALIZACAO DE SEGURANCA CONTRA INCENDIO, FOTOLUMINESCENTE, QUADRADA, *20 X 20* CM, EM PVC *2* MM ANTI-CHAMAS (SIMBOLOS, CORES E PICTOGRAMAS CONFORME NBR 13434)","UN    ",1,24.29,24.29,24.29,24.29]
[null,"MATERIAL (C) - TOTAL",null,null,null,null,null,null,24.529999999999998,24.529999999999998]
[]
[387,"FONTE","CÓDIGO","DESCRIÇÃO","UNIDADE","COEFIC.","CUSTO UNITÁRIO",null,"CUSTO  TOTAL (A) + (B) + (C) + (D) + (E)"]
[null,null,null,null,null,null,"DESONERADO","NÃO DESONER.","DESONERADO","NÃO DESONER."]
[null,"COMPOSIÇÃO","COMP 387_SEE","LÂMPADA LED TUBULAR 18W ","UN ",null,null,null,22.28,22.330000000000002]
[null,"AGETOP_I",8,"AJUDANTE","h     ",1.4999999999999999E-2,8.1999999999999993,9.51,0.12,0.14000000000000001]
[null,"AGETOP_I",12,"ELETRICISTA","h     ",1.4999999999999999E-2,13.4,15.53,0.2,0.23]
[null,null,null,"","",null,0,0,0,0]
[null,"MÃO DE OBRA (B) - TOTAL",null,null,null,null,null,null,0.32,0.37]
[null,"COTAÇÃO","COT 195_SEE","LÂMPADA LED TUBULAR 18W ","UN",1,21.959999999999997,21.959999999999997,21.96,21.96]
[null,null,null,"","",null,0,0,0,0]
[null,null,null,"","",null,0,0,0,0]
[null,"MATERIAL (C) - TOTAL",null,null,null,null,null,null,21.96,21.96]
[]
[209,"FONTE","CÓDIGO","DESCRIÇÃO","UNIDADE","COEFIC.","CUSTO UNITÁRIO",null,"CUSTO  TOTAL (A) + (B) + (C) + (D) + (E)"]
[null,null,null,null,null,null,"DESONERADO","NÃO DESONER.","DESONERADO","NÃO DESONER."]
[null,"COMPOSIÇÃO","COMP 209_SEE","TOALHEIRO PLÁSTICO TIPO DISPENSER PARA PAPEL TOALHA INTERFOLHADO","UN ",null,null,null,50.44,51.3]
[null,"AGETOP_I",8,"AJUDANTE","h     ",0.25,8.1999999999999993,9.51,2.0499999999999998,2.38]
[null,"AGETOP_I",4,"PEDREIRO","h     ",0.25,13.4,15.53,3.35,3.88]
[null,"MÃO DE OBRA (B) - TOTAL",null,null,null,null,null,null,5.4,6.26]
[null,"SINAPI_I",37401,"TOALHEIRO PLASTICO TIPO DISPENSER PARA PAPEL TOALHA INTERFOLHADO","UN    ",1,44.24,44.24,44.24,44.24]
[null,"AGETOP_I",2221,"PARAFUSO COM BUCHA S-8","un",4,0.2,0.2,0.8,0.8]
[null,"MATERIAL (C) - TOTAL",null,null,null,null,null,null,45.04,45.04]
[]
[541,"FONTE","CÓDIGO","DESCRIÇÃO","UNIDADE","COEFIC.","CUSTO UNITÁRIO",null,"CUSTO  TOTAL (A) + (B) + (C) + (D) + (E)"]
[null,null,null,null,null,null,"DESONERADO","NÃO DESONER.","DESONERADO","NÃO DESONER."]
[null,"COMPOSIÇÃO","COMP 541_SEE","BANCADA DE GRANITO CINZA POLIDO - FORNECIMENTO E INSTALAÇÃO. ","M2    ",null,null,null,459.67,464.54]
[null,"SINAPI",88274,"MARMORISTA/GRANITEIRO COM ENCARGOS COMPLEMENTARES","H",1.6555555555555557,17.38,19.43,28.77,32.17]
[null,"SINAPI",88316,"SERVENTE COM ENCARGOS COMPLEMENTARES","H",1.088888888888889,12.88,14.23,14.02,15.49]
[null,null,null,"","",null,0,0,0,0]
[null,"MÃO DE OBRA (B) - TOTAL",null,null,null,null,null,null,42.79,47.660000000000004]
[null,"SINAPI_I",4823,"MASSA PLASTICA PARA MARMORE/GRANITO","KG    ",0.58088888888888901,28.09,28.09,16.32,16.32]
[null,"SINAPI_I",7568,"BUCHA DE NYLON SEM ABA S10, COM PARAFUSO DE 6,10 X 65 MM EM ACO ZINCADO COM ROSCA SOBERBA, CABECA CHATA E FENDA PHILLIPS","UN    ",6.666666666666667,0.49,0.49,3.27,3.27]
[null,"SINAPI_I",11795,"GRANITO PARA BANCADA, POLIDO, TIPO ANDORINHA/ QUARTZ/ CASTELO/ CORUMBA OU OUTROS EQUIVALENTES DA REGIAO, E=  *2,5* CM","M2    ",1.1166666666666667,286.79000000000002,286.79000000000002,320.25,320.25]
[null,"SINAPI_I",37329,"REJUNTE EPOXI BRANCO","KG    ",3.9E-2,39.869999999999997,39.869999999999997,1.55,1.55]
[null,"SINAPI_I",37591,"SUPORTE MAO-FRANCESA EM ACO, ABAS IGUAIS 40 CM, CAPACIDADE MINIMA 70 KG, BRANCO","UN    ",2.2222222222222223,33.97,33.97,75.489999999999995,75.489999999999995]
[null,"MATERIAL (C) - TOTAL",null,null,null,null,null,null,416.88,416.88]

{"sheet":"Cotações","index":8,"n_rows":136,"n_cols":9,"rows_kept":136,"cut":false,"hidden":false,"merged":[[9,0,9,2],[9,3,9,6],[9,7,9,8],[10,0,10,2],[10,3,10,6],[10,8,10,9],[14,0,14,8],[15,0,15,9],[11,0,11,9],[12,0,12,2],[12,3,12,6],[12,7,12,8],[13,0,13,2],[13,3,13,6],[13,8,13,9],[8,0,8,8],[0,0,0,8],[1,0,1,9],[2,0,2,8],[3,0,3,6],[3,7,3,9],[4,0,4,6],[4,7,4,9],[5,0,5,8],[6,0,6,6],[6,7,6,9],[7,0,7,6],[7,7,7,9],[16,7,17,8],[18,7,18,8],[19,3,19,4],[19,5,19,6],[19,7,19,8],[16,1,17,1],[16,2,17,2],[16,3,17,3],[16,4,17,4],[16,5,16,6],[23,3,23,4],[23,7,23,8],[24,3,24,4],[24,7,24,8],[25,3,25,8],[20,3,20,4],[20,7,20,8],[21,3,21,4],[21,7,21,8],[22,3,22,4],[22,7,22,8],[27,7,28,8],[29,7,29,8],[30,3,30,4],[30,5,30,6],[30,7,30,8],[27,1,28,1],[27,2,28,2],[27,3,28,3],[27,4,28,4],[27,5,27,6],[34,3,34,4],[34,7,34,8],[35,3,35,4],[35,7,35,8],[36,3,36,8],[31,3,31,4],[31,7,31,8],[32,3,32,4],[32,7,32,8],[33,3,33,4],[33,7,33,8],[38,7,39,8],[40,7,40,8],[41,3,41,4],[41,5,41,6],[41,7,41,8],[38,1,39,1],[38,2,39,2],[38,3,39,3],[38,4,39,4],[38,5,38,6],[45,3,45,4],[45,7,45,8],[46,3,46,4],[46,7,46,8],[47,3,47,8],[42,3,42,4],[42,7,42,8],[43,3,43,4],[43,7,43,8],[44,3,44,4],[44,7,44,8],[49,7,50,8],[51,7,51,8],[52,3,52,4],[52,5,52,6],[52,7,52,8],[49,1,50,1],[49,2,50,2],[49,3,50,3],[49,4,50,4],[49,5,49,6],[56,3,56,4],[56,7,56,8],[57,3,57,4],[57,7,57,8],[58,3,58,8],[53,3,53,4],[53,7,53,8],[54,3,54,4],[54,7,54,8],[55,3,55,4],[55,7,55,8],[60,7,61,8],[62,7,62,8],[63,3,63,4],[63,5,63,6],[63,7,63,8],[60,1,61,1],[60,2,61,2],[60,3,61,3],[60,4,61,4],[60,5,60,6],[67,3,67,4],[67,7,67,8],[68,3,68,4],[68,7,68,8],[69,3,69,8],[64,3,64,4],[64,7,64,8],[65,3,65,4],[65,7,65,8],[66,3,66,4],[66,7,66,8],[71,7,72,8],[73,7,73,8],[74,3,74,4],[74,5,74,6],[74,7,74,8],[71,1,72,1],[71,2,72,2],[71,3,72,3],[71,4,72,4],[71,5,71,6],[78,3,78,4],[78,7,78,8],[79,3,79,4],[79,7,79,8],[80,3,80,8],[75,3,75,4],[75,7,75,8],[76,3,76,4],[76,7,76,8],[77,3,77,4],[77,7,77,8],[82,7,83,8],[84,7,84,8],[85,3,85,4],[85,5,85,6],[85,7,85,8],[82,1,83,1],[82,2,83,2],[82,3,83,3],[82,4,83,4],[82,5,82,6],[89,3,89,4],[89,7,89,8],[90,3,90,4],[90,7,90,8],[91,3,91,8],[86,3,86,4],[86,7,86,8],[87,3,87,4],[87,7,87,8],[88,3,88,4],[88,7,88,8],[93,7,94,8],[95,7,95,8],[96,3,96,4],[96,5,96,6],[96,7,96,8],[93,1,94,1],[93,2,94,2],[93,3,94,3],[93,4,94,4],[93,5,93,6],[100,3,100,4],[100,7,100,8],[101,3,101,4],[101,7,101,8],[102,3,102,8],[97,3,97,4],[97,7,97,8],[98,3,98,4],[98,7,98,8],[99,3,99,4],[99,7,99,8],[104,7,105,8],[106,7,106,8],[107,3,107,4],[107,5,107,6],[107,7,107,8],[104,1,105,1],[104,2,105,2],[104,3,105,3],[104,4,105,4],[104,5,104,6],[111,3,111,4],[111,7,111,8],[112,3,112,4],[112,7,112,8],[113,3,113,8],[108,3,108,4],[108,7,108,8],[109,3,109,4],[109,7,109,8],[110,3,110,4],[110,7,110,8],[115,7,116,8],[117,7,117,8],[118,3,118,4],[118,5,118,6],[118,7,118,8],[115,1,116,1],[115,2,116,2],[115,3,116,3],[115,4,116,4],[115,5,115,6],[122,3,122,4],[122,7,122,8],[123,3,123,4],[123,7,123,8],[124,3,124,8],[119,3,119,4],[119,7,119,8],[120,3,120,4],[120,7,120,8],[121,3,121,4],[121,7,121,8],[126,7,127,8],[128,7,128,8],[129,3,129,4],[129,5,129,6],[129,7,129,8],[126,1,127,1],[126,2,127,2],[126,3,127,3],[126,4,127,4],[126,5,126,6],[133,3,133,4],[133,7,133,8],[134,3,134,4],[134,7,134,8],[135,3,135,8],[130,3,130,4],[130,7,130,8],[131,3,131,4],[131,7,131,8],[132,3,132,4],[132,7,132,8]]}
[]
[]
[]
["UNIDADE ESCOLAR",null,null,null,null,null,null,"CÓDIGO INEP"]
[{"$f":"Orçamento!$O$4","v":"CENTRO DE ENSINO EM PERÍODO INTEGRAL JOAQUIM EDSON DE CAMARGO"},null,null,null,null,null,null,{"$f":"Orçamento!$V$4","v":52035182}]
[]
["OBRA",null,null,null,null,null,null,"CIDADE"]
[{"$f":"Orçamento!$O$7","v":"REFORMA E AMPLIAÇÃO"},null,null,null,null,null,null,{"$f":"Orçamento!$V$7","v":"GOIÂNIA"}]
[]
["CRE",null,null,"ENDEREÇO",null,null,null,"REFERÊNCIA AGETOP"]
[{"$f":"Orçamento!$O$10","v":"GOIÂNIA"},null,null,{"$f":"Orçamento!$R$10","v":"RUA SANTIAGO QD. 232 S/N PCA JARDIM DA INFÂNC, JD NOVO MUNDO, CEP:74705-060"},null,null,null,{"$f":"Orçamento!$V$10","v":"DEZ/18"},{"$f":"Orçamento!$W$10","v":"NÃO DESONERADA"}]
[]
["DATA",null,null,"ÁREA TOTAL CONSTRUÍDA (M²)",null,null,null,"REFERÊNCIA SINAPI"]
[{"$f":"Orçamento!$S$7","v":"2020-04-08"},null,null,{"$f":"Orçamento!$S$13","v":2081.9900000000002},null,null,null,{"$f":"Orçamento!$V$13","v":"FEV/19"},{"$f":"Orçamento!$W$13","v":"NÃO DESONERADA"}]
[]
["COTAÇÕES DE PREÇOS - SEE-GO"]
[null,"FONTE","CÓDIGO","DESCRIÇÃO","UNIDADE","MÉDIA",null,"ÍNDICE RETROAÇÃO"]
[null,null,null,null,null,"DESONERADA","ONERADA"]
[10,"COTAÇÃO","COT 010_SEE","CAPUZ PARA PROTEÇÃO DOS PARA RAIOS","UN ",15.81,15.81,""]
[null,null,"EMPRESA","NOME DA EMPRESA",null,"COTAÇÕES",null,"DATA COTAÇÃO"]
[null,null,"E013 - ELETRO...","ELETROTRANSOL",null,15.81,15.81,"06/02/2019"]
[null,null,null,"",null,null,null,""]
[null,null,null,"",null,null,null,""]
[null,null,"","",null,null,null,""]
[null,null,"","",null,null,null,""]
[null,null,"OBSERVAÇÕES:",""]
[]
[null,"FONTE","CÓDIGO","DESCRIÇÃO","UNIDADE","MÉDIA",null,"ÍNDICE RETROAÇÃO"]
[null,null,null,null,null,"DESONERADA","ONERADA"]
[11,"COTAÇÃO","COT 011_SEE","CAPUZ DE PROTEÇÃO PARA BUCHA DE TRANSFORMADOR","UN ",15.81,15.81,""]
[null,null,"EMPRESA","NOME DA EMPRESA",null,"COTAÇÕES",null,"DATA COTAÇÃO"]
[null,null,"E013 - ELETRO...","ELETROTRANSOL",null,15.81,15.81,"06/02/2019"]
[null,null,null,"",null,null,null,""]
[null,null,null,"",null,null,null,""]
[null,null,"","",null,null,null,""]
[null,null,"","",null,null,null,""]
[null,null,"OBSERVAÇÕES:",""]
[]
[null,"FONTE","CÓDIGO","DESCRIÇÃO","UNIDADE","MÉDIA",null,"ÍNDICE RETROAÇÃO"]
[null,null,null,null,null,"DESONERADA","ONERADA"]
[12,"COTAÇÃO","COT 012_SEE","HASTE ROSQUEADA \"TIRANTE\" 3/8\"","M",5.3833333333333329,5.3833333333333329,""]
[null,null,"EMPRESA","NOME DA EMPRESA",null,"COTAÇÕES",null,"DATA COTAÇÃO"]
[null,null,"E013 - ELETRO...","ELETROTRANSOL",null,5.3833333333333329,5.3833333333333329,"06/02/2019"]
[null,null,null,"",null,null,null,""]
[null,null,null,"",null,null,null,""]
[null,null,"","",null,null,null,""]
[null,null,"","",null,null,null,""]
[null,null,"OBSERVAÇÕES:",""]
[]
[null,"FONTE","CÓDIGO","DESCRIÇÃO","UNIDADE","MÉDIA",null,"ÍNDICE RETROAÇÃO"]
[null,null,null,null,null,"DESONERADA","ONERADA"]
[13,"COTAÇÃO","COT 013_SEE","PORCA SEXTAVADA 3/8\"","UN ",0.13,0.13,""]
[null,null,"EMPRESA","NOME DA EMPRESA",null,"COTAÇÕES",null,"DATA COTAÇÃO"]
[null,null,"E013 - ELETRO...","ELETROTRANSOL",null,0.12,0.12,"06/02/2019"]
[null,null,"E055 - SANETA...","SANETAM COMERCIO DE TUBOS E CONEXOES LTDA.",null,0.13,0.13,"06/02/2019"]
[null,null,"E056 - AC COM...","AC COMERCIO DE FERRAMENTAS E PRODUTOS PARA FIXACAO EIRE",null,0.14000000000000001,0.14000000000000001,"06/02/2019"]
[null,null,"","",null,null,null,""]
[null,null,"","",null,null,null,""]
[null,null,"OBSERVAÇÕES:",""]
[]
[null,"FONTE","CÓDIGO","DESCRIÇÃO","UNIDADE","MÉDIA",null,"ÍNDICE RETROAÇÃO"]
[null,null,null,null,null,"DESONERADA","ONERADA"]
[103,"COTAÇÃO","COT 103_SEE","NIPLE DE REDUÇÃO 1/2\" X 1/4\" BSP","UN",6.0533333333333337,6.0533333333333337,""]
[null,null,"EMPRESA","NOME DA EMPRESA",null,"COTAÇÕES",null,"DATA COTAÇÃO"]
[null,null,"E070 - FOCO R...","FOCO REPRESENTAÇÃO E CONSULTORIA LTDA-ME",null,4.46,4.46,"12/02/2019"]
[null,null,"E071 - CASA D...","CASA DAS PEÇAS COM E INDUSTRIA DE FOGOES LTDA",null,3.9,3.9,"11/02/2019"]
[null,null,"E072 - AMIG I...","AMIG INSTALAÇÃO DE REDE DE GÁS E INCÊNDIO",null,9.8000000000000007,9.8000000000000007,"08/02/2019"]
[null,null,"","",null,null,null,""]
[null,null,"","",null,null,null,""]
[null,null,"OBSERVAÇÕES:",""]
[]
[null,"FONTE","CÓDIGO","DESCRIÇÃO","UNIDADE","MÉDIA",null,"ÍNDICE RETROAÇÃO"]
[null,null,null,null,null,"DESONERADA","ONERADA"]
[104,"COTAÇÃO","COT 104_SEE","NIPLE DE REDUÇÃO 3/4\" X 1/2\" BSP","UN",9.7099999999999991,9.7099999999999991,""]
[null,null,"EMPRESA","NOME DA EMPRESA",null,"COTAÇÕES",null,"DATA COTAÇÃO"]
[null,null,"E070 - FOCO R...","FOCO REPRESENTAÇÃO E CONSULTORIA LTDA-ME",null,10.93,10.93,"12/02/2019"]
[null,null,"E071 - CASA D...","CASA DAS PEÇAS COM E INDUSTRIA DE FOGOES LTDA",null,5.5,5.5,"11/02/2019"]
[null,null,"E072 - AMIG I...","AMIG INSTALAÇÃO DE REDE DE GÁS E INCÊNDIO",null,12.7,12.7,"08/02/2019"]
[null,null,"","",null,null,null,""]
[null,null,"","",null,null,null,""]
[null,null,"OBSERVAÇÕES:",""]
[]
[null,"FONTE","CÓDIGO","DESCRIÇÃO","UNIDADE","MÉDIA",null,"ÍNDICE RETROAÇÃO"]
[null,null,null,null,null,"DESONERADA","ONERADA"]
[281,"COTAÇÃO","COT 281_SEE","VÁLVULA UGV 3/4\" (S) LATÃO","UN ",15.836666666666666,15.836666666666666,""]
[null,null,"EMPRESA","NOME DA EMPRESA",null,"COTAÇÕES",null,"DATA COTAÇÃO"]
[null,null,"E070 - FOCO R...","FOCO REPRESENTAÇÃO E CONSULTORIA LTDA-ME",null,12.51,12.51,"12/02/2019"]
[null,null,"E071 - CASA D...","CASA DAS PEÇAS COM E INDUSTRIA DE FOGOES LTDA",null,17.5,17.5,"11/02/2019"]
[null,null,"E072 - AMIG I...","AMIG INSTALAÇÃO DE REDE DE GÁS E INCÊNDIO",null,17.5,17.5,"08/02/2019"]
[null,null,"",""]
[null,null,"","",null,null,null,""]
[null,null,"OBSERVAÇÕES:",""]
[]
[null,"FONTE","CÓDIGO","DESCRIÇÃO","UNIDADE","MÉDIA",null,"ÍNDICE RETROAÇÃO"]
[null,null,null,null,null,"DESONERADA","ONERADA"]
[282,"COTAÇÃO","COT 282_SEE","VÁLVULA UGV 1/2\" (S) LATÃO","UN ",15.166666666666666,15.166666666666666,""]
[null,null,"EMPRESA","NOME DA EMPRESA",null,"COTAÇÕES",null,"DATA COTAÇÃO"]
[null,null,"E070 - FOCO R...","FOCO REPRESENTAÇÃO E CONSULTORIA LTDA-ME",null,11.2,11.2,"12/02/2019"]
[null,null,"E071 - CASA D...","CASA DAS PEÇAS COM E INDUSTRIA DE FOGOES LTDA",null,17.5,17.5,"11/02/2019"]
[null,null,"E072 - AMIG I...","AMIG INSTALAÇÃO DE REDE DE GÁS E INCÊNDIO",null,16.8,16.8,"08/02/2019"]
[null,null,"","",null,null,null,""]
[null,null,"","",null,null,null,""]
[null,null,"OBSERVAÇÕES:",""]
[]
[null,"FONTE","CÓDIGO","DESCRIÇÃO","UNIDADE","MÉDIA",null,"ÍNDICE RETROAÇÃO"]
[null,null,null,null,null,"DESONERADA","ONERADA"]
[102,"COTAÇÃO","COT 102_SEE","REGULADOR DE 2º ESTÁGIO 5KG/H","UN",59.833333333333336,59.833333333333336,""]
[null,null,"EMPRESA","NOME DA EMPRESA",null,"COTAÇÕES",null,"DATA COTAÇÃO"]
[null,null,"E070 - FOCO R...","FOCO REPRESENTAÇÃO E CONSULTORIA LTDA-ME",null,38.9,38.9,"12/02/2019"]
[null,null,"E071 - CASA D...","CASA DAS PEÇAS COM E INDUSTRIA DE FOGOES LTDA",null,55.599999999999994,55.599999999999994,"11/02/2019"]
[null,null,"E072 - AMIG I...","AMIG INSTALAÇÃO DE REDE DE GÁS E INCÊNDIO",null,85,85,"08/02/2019"]
[null,null,"","",null,null,null,""]
[null,null,"","",null,null,null,""]
[null,null,"OBSERVAÇÕES:","AMIG enviou cotação de regulador de 2º estágio de 12kg/h."]
[]
[null,"FONTE","CÓDIGO","DESCRIÇÃO","UNIDADE","MÉDIA",null,"ÍNDICE RETROAÇÃO"]
[null,null,null,null,null,"DESONERADA","ONERADA"]
[101,"COTAÇÃO","COT 101_SEE","REGULADOR DE 1º ESTÁGIO 60KG/H MODELO AP-40  COM MANÔMETRO","UN",205.57666666666668,205.57666666666668,""]
[null,null,"EMPRESA","NOME DA EMPRESA",null,"COTAÇÕES",null,"DATA COTAÇÃO"]
[null,null,"E070 - FOCO R...","FOCO REPRESENTAÇÃO E CONSULTORIA LTDA-ME",null,148.72999999999999,148.72999999999999,"12/02/2019"]
[null,null,"E071 - CASA D...","CASA DAS PEÇAS COM E INDUSTRIA DE FOGOES LTDA",null,198,198,"11/02/2019"]
[null,null,"E072 - AMIG I...","AMIG INSTALAÇÃO DE REDE DE GÁS E INCÊNDIO",null,270,270,"08/02/2019"]
[null,null,"","",null,null,null,""]
[null,null,"","",null,null,null,""]
[null,null,"OBSERVAÇÕES:",""]
[]
[null,"FONTE","CÓDIGO","DESCRIÇÃO","UNIDADE","MÉDIA",null,"ÍNDICE RETROAÇÃO"]
[null,null,null,null,null,"DESONERADA","ONERADA"]
[195,"COTAÇÃO","COT 195_SEE","LÂMPADA LED TUBULAR 18W ","UN",21.959999999999997,21.959999999999997,""]
[null,null,"EMPRESA","NOME DA EMPRESA",null,"COTAÇÕES",null,"DATA COTAÇÃO"]
[null,null,"E030 - AJEL M...","AJEL MATERIAIS ELÉTRICOS",null,19.89,19.89,""]
[null,null,"E013 - ELETRO...","ELETROTRANSOL",null,25.99,25.99,""]
[null,null,"E014 - MAKRO ...","MAKRO SERVICE",null,20,20,""]
[null,null,"","",null,null,null,""]
[null,null,"","",null,null,null,""]
[null,null,"OBSERVAÇÕES:",""]