{"text_format":"1","workbook":"xlsx","n_sheets":8,"sheets":["Orçamento","Resumo ","Somatório","Cronog_60_Dias","Composição BDI","Relatório CENTRAL","Parc Maior Relev","Composições"],"not_rendered":{"charts":0,"images":3,"macros":1,"external_links":0,"defined_names":80,"comments":3,"pivot_tables":0},"unopened":[],"bounds":{"document_bytes":16777216,"sheet_cells":100000,"rows_first":2000,"rows_last":500,"rows_between":2000,"halvings":0,"cell_chars":16384,"cell_head_chars":4096},"cells_cut":0,"cells_raw":0,"read":"whole","date_system":"1900"}

{"sheet":"Orçamento","index":0,"n_rows":597,"n_cols":24,"rows_kept":597,"cut":false,"hidden":false,"merged":[[578,18,578,20],[578,21,578,22],[579,15,579,17],[579,18,579,20],[579,21,579,22],[580,15,580,17],[580,18,580,20],[580,21,580,22],[575,15,575,17],[575,18,575,20],[575,21,575,22],[576,15,576,17],[576,18,576,20],[576,21,576,22],[577,15,577,17],[577,18,577,20],[577,21,577,22],[589,18,589,20],[589,21,589,22],[584,15,584,17],[584,18,584,20],[584,21,584,22],[585,15,585,17],[585,18,585,20],[585,21,585,22],[586,15,586,17],[586,18,586,20],[586,21,586,22],[565,14,565,17],[572,15,572,17],[538,15,538,17],[593,18,593,20],[593,21,593,22],[581,15,581,17],[581,18,581,20],[581,21,581,22],[582,15,582,17],[582,18,582,20],[582,21,582,22],[583,15,583,17],[583,18,583,20],[583,21,583,22],[587,15,587,17],[587,18,587,20],[587,21,587,22],[588,15,588,17],[588,18,588,20],[588,21,588,22],[589,15,589,17],[578,15,578,17],[533,16,533,22],[596,18,596,20],[596,21,596,22],[593,14,593,17],[590,15,590,17],[590,18,590,20],[590,21,590,22],[591,15,591,17],[591,18,591,20],[591,21,591,22],[592,15,592,17],[592,18,592,20],[592,21,592,22],[595,18,595,20],[595,21,595,22],[594,18,594,20],[594,21,594,22],[571,14,571,23],[572,18,572,20],[572,21,572,22],[573,15,573,17],[573,18,573,20],[573,21,573,22],[574,15,574,17],[574,18,574,20],[574,21,574,22],[529,16,529,22],[530,16,530,22],[531,16,531,22],[3,21,3,22],[2,21,2,22],[5,21,5,22],[10,14,10,23],[13,14,13,23],[6,21,6,22],[9,17,9,20],[2,14,2,20],[3,14,3,20],[5,18,5,20],[6,18,6,20],[11,18,11,20],[12,18,12,20],[6,14,6,17],[5,14,5,17],[551,15,551,17],[552,15,552,17],[553,15,553,17],[554,15,554,17],[555,15,555,17],[556,15,556,17],[557,15,557,17],[558,15,558,17],[559,15,559,17],[539,15,539,17],[540,15,540,17],[541,15,541,17],[542,15,542,17],[543,15,543,17],[544,15,544,17],[545,15,545,17],[546,15,546,17],[547,15,547,17],[560,15,560,17],[561,15,561,17],[562,15,562,17],[563,15,563,17],[564,15,564,17],[537,14,537,23],[526,20,526,21],[525,20,525,21],[521,17,526,17],[521,20,521,21],[538,18,538,20],[538,21,538,22],[539,18,539,20],[539,21,539,22],[527,20,527,21],[547,18,547,20],[547,21,547,22],[548,18,548,20],[548,21,548,22],[549,18,549,20],[549,21,549,22],[550,18,550,20],[550,21,550,22],[562,18,562,20],[565,18,565,20],[565,21,565,22],[562,21,562,22],[563,18,563,20],[563,21,563,22],[564,18,564,20],[564,21,564,22],[554,18,554,20],[554,21,554,22],[561,18,561,20],[561,21,561,22],[556,21,556,22],[557,18,557,20],[557,21,557,22],[559,18,559,20],[555,18,555,20],[555,21,555,22],[556,18,556,20],[566,18,566,20],[566,21,566,22],[553,18,553,20],[553,21,553,22],[546,18,546,20],[546,21,546,22],[568,18,568,20],[568,21,568,22],[522,20,522,21],[544,18,544,20],[544,21,544,22],[545,18,545,20],[545,21,545,22],[543,18,543,20],[543,21,543,22],[552,18,552,20],[523,20,523,21],[534,18,534,22],[540,18,540,20],[540,21,540,22],[541,18,541,20],[541,21,541,22],[542,18,542,20],[542,21,542,22],[532,16,532,22],[8,12,9,12],[567,18,567,20],[567,21,567,22],[0,14,0,22],[8,14,8,16],[9,14,9,16],[11,14,11,16],[12,14,12,16],[14,14,14,22],[1,14,1,22],[4,14,4,22],[7,14,7,22],[551,18,551,20],[551,21,551,22],[559,21,559,22],[548,15,548,17],[549,15,549,17],[550,15,550,17],[552,21,552,22],[560,18,560,20],[560,21,560,22],[558,18,558,20],[558,21,558,22]]}
[]
[]
[null,null,null,null,null,null,null,null,null,null,null,null,null,null,"UNIDADE ESCOLAR",null,null,null,null,null,null,"CÓDIGO INEP"]
[null,null,null,null,null,null,null,null,null,null,null,null,null,null,"COLÉGIO ESTADUAL DA POLÍCIA MILITAR DE GOIÁS - GOIANIRA - JOSÉ SILVA OLIVEIRA",null,null,null,null,null,null,52096939]
[]
["Nmax",null,null,null,null,null,null,null,null,null,null,null,"Ajustar altura?",null,"OBRA",null,null,null,"DATA",null,null,"CIDADE"]
[{"$f":"MAX($C$18:$C$521)","v":3},null,null,null,null,null,null,null,null,null,null,null,"SIM",null,"REFORMA E AMPLIAÇÃO",null,null,null,"2019-05-21",null,null,"GOIANIRA"]
[]
[null,null,null,null,null,null,null,null,null,null,null,null,"",null,"CRE",null,null,"ENDEREÇO",null,null,null,"REFERÊNCIA AGETOP"]
[null,null,null,null,null,null,null,null,null,null,null,null,null,null,"INHUMAS",null,null,"Rua 28 c/ Rua 20 S/N, TRIUNFO I, CEP:75370-000",null,null,null,"DEZ/18","ONERADA"]
[]
[null,null,null,null,null,null,null,null,null,null,null,null,null,null,"ÁREA EXISTENTE (M²)",null,null,"ÁREA A CONSTRUIR (M²)","ÁREA TOTAL CONSTRUÍDA (M²)",null,null,"REFERÊNCIA SINAPI"]
[null,null,null,null,null,null,null,null,null,null,null,null,null,null,2811.92,null,null,392.3,3204.2200000000003,null,null,"MAR/19","ONERADA"]
[]
[null,null,null,null,null,null,null,null,null,null,null,"FILTRO",null,null,"PLANILHA ORÇAMENTÁRIA"]
{"$rows_left_out":583}
{"sheet":"Resumo ","index":1,"n_rows":39,"n_cols":9,"rows_kept":39,"cut":false,"hidden":false,"merged":[[13,0,14,0],[34,2,34,3],[35,2,35,3],[31,2,31,3],[32,2,32,3],[33,2,33,3],[28,2,28,3],[29,2,29,3],[30,2,30,3],[0,1,0,8],[36,1,36,5],[2,1,2,5],[3,1,3,5],[5,1,5,5],[6,1,6,5],[8,1,8,5],[9,1,9,5],[11,3,11,5],[12,3,12,5],[10,1,10,8],[11,6,11,8],[12,6,12,8],[25,2,25,3],[21,2,21,3],[22,2,22,3],[6,6,6,8],[7,1,7,8],[8,6,8,8],[9,6,9,8],[13,1,13,8],[1,1,1,8],[2,6,2,8],[3,6,3,8],[4,1,4,8],[5,6,5,8],[42,3,42,7],[11,1,11,2],[12,1,12,2],[15,2,15,3],[16,2,16,3],[14,1,14,8],[17,2,17,3],[23,2,23,3],[18,2,18,3],[19,2,19,3],[20,2,20,3],[41,3,41,7],[24,2,24,3],[26,2,26,3],[27,2,27,3],[38,1,38,8]]}
[]
[]
[null,"UNIDADE ESCOLAR",null,null,null,null,"CÓDIGO INEP"]
[null,{"$f":"Orçamento!$O$4","v":"COLÉGIO ESTADUAL DA POLÍCIA MILITAR DE GOIÁS - GOIANIRA - JOSÉ SILVA OLIVEIRA"},null,null,null,null,{"$f":"Orçamento!V4","v":52096939}]
[]
[null,"OBRA",null,null,null,null,"CIDADE"]
[null,{"$f":"Orçamento!$O$7","v":"REFORMA E AMPLIAÇÃO"},null,null,null,null,{"$f":"Orçamento!$V$7","v":"GOIANIRA"}]
[]
[null,"ENDEREÇO",null,null,null,null,"CRE"]
[null,{"$f":"Orçamento!$R$10","v":"Rua 28 c/ Rua 20 S/N, TRIUNFO I, CEP:75370-000"},null,null,null,null,{"$f":"Orçamento!$O$10","v":"INHUMAS"}]
[]
[null,"REFERÊNCIA",null,"DATA",null,null,"ÁREA TOTAL CONSTRUÍDA (M²)"]
[null,{"$f":"CONCATENATE(\"AGETOP E SINAPI - \",Orçamento!$W$10)","v":"AGETOP E SINAPI - ONERADA"},null,{"$f":"Orçamento!$S$7","v":"2019-05-21"},null,null,{"$f":"Orçamento!$S$13","v":3204.2200000000003}]
["FILTRO"]
[null,"RESUMO GERAL DO ORÇAMENTO"]
{"$rows_left_out":25}
{"sheet":"Somatório","index":2,"n_rows":45,"n_cols":6,"rows_kept":45,"cut":false,"hidden":false,"merged":[[13,0,14,0],[42,1,42,2],[44,1,44,5],[47,3,47,5],[48,3,48,5],[13,1,13,5],[9,1,9,3],[9,4,9,5],[11,1,11,2],[11,4,11,5],[12,1,12,2],[12,4,12,5],[0,1,0,5],[14,1,14,5],[2,1,2,3],[2,4,2,5],[3,1,3,3],[3,4,3,5],[5,1,5,3],[5,4,5,5],[6,1,6,3],[6,4,6,5],[8,1,8,3],[8,4,8,5],[1,1,1,5],[4,1,4,5],[7,1,7,5],[10,1,10,5]]}
[]
[]
[null,"UNIDADE ESCOLAR",null,null,"CÓDIGO INEP"]
[null,{"$f":"Orçamento!$O$4","v":"COLÉGIO ESTADUAL DA POLÍCIA MILITAR DE GOIÁS - GOIANIRA - JOSÉ SILVA OLIVEIRA"},null,null,{"$f":"Orçamento!V4","v":52096939}]
[]
[null,"OBRA",null,null,"CIDADE"]
[null,{"$f":"Orçamento!$O$7","v":"REFORMA E AMPLIAÇÃO"},null,null,{"$f":"Orçamento!$V$7","v":"GOIANIRA"}]
[]
[null,"ENDEREÇO",null,null,"CRE"]
[null,{"$f":"Orçamento!$R$10","v":"Rua 28 c/ Rua 20 S/N, TRIUNFO I, CEP:75370-000"},null,null,{"$f":"Orçamento!$O$10","v":"INHUMAS"}]
[]
[null,"REFERÊNCIA",null,"DATA","ÁREA TOTAL CONSTRUÍDA (M²)"]
[null,{"$f":"CONCATENATE(\"AGETOP E SINAPI - \",Orçamento!$W$10)","v":"AGETOP E SINAPI - ONERADA"},null,{"$f":"Orçamento!$S$7","v":"2019-05-21"},{"$f":"Orçamento!$S$13","v":3204.2200000000003}]
["FILTRO"]
[null,"SOMATÓRIO DE SERVIÇOS"]
{"$rows_left_out":31}
{"sheet":"Cronog_60_Dias","index":3,"n_rows":99,"n_cols":16,"rows_kept":99,"cut":false,"hidden":false,"merged":[[2,1,2,7],[5,1,5,7],[6,1,6,7],[8,1,8,7],[9,1,9,7],[4,1,4,13],[7,1,7,13],[0,1,0,13],[1,1,1,13],[2,8,2,13],[12,0,13,0],[9,0,11,0],[11,1,11,13],[92,1,92,2],[92,5,92,8],[92,9,92,12],[93,1,93,2],[93,5,93,8],[93,9,93,12],[74,9,74,12],[74,5,74,8],[68,9,68,12],[70,5,70,8],[70,9,70,12],[59,5,59,8],[71,1,73,2],[71,4,73,4],[71,5,71,8],[71,9,71,12],[73,5,73,8],[73,9,73,12],[59,9,59,12],[61,5,61,8],[61,9,61,12],[94,1,94,2],[94,5,94,8],[94,9,94,12],[76,5,76,8],[76,9,76,12],[77,5,77,8],[77,9,77,12],[79,5,79,8],[79,9,79,12],[80,5,80,8],[80,9,80,12],[82,5,82,8],[82,9,82,12],[77,3,79,3],[80,3,82,3],[86,1,88,2],[80,4,82,4],[95,1,95,2],[95,5,95,8],[95,9,95,12],[97,1,97,4],[98,1,98,13],[86,9,86,12],[88,5,88,8],[88,9,88,12],[85,5,85,8],[85,9,85,12],[89,1,91,2],[89,4,91,4],[89,5,89,8],[89,9,89,12],[91,5,91,8],[91,9,91,12],[89,3,91,3],[86,4,88,4],[86,5,86,8],[86,3,88,3],[83,1,85,2],[83,4,85,4],[83,5,83,8],[83,9,83,12],[68,5,68,8],[65,5,65,8],[65,9,65,12],[67,5,67,8],[67,9,67,12],[65,3,67,3],[62,9,62,12],[64,5,64,8],[64,9,64,12],[62,5,62,8],[53,9,53,12],[55,5,55,8],[55,9,55,12],[50,5,50,8],[50,9,50,12],[52,5,52,8],[52,9,52,12],[56,9,56,12],[58,5,58,8],[58,9,58,12],[53,5,53,8],[56,5,56,8],[44,9,44,12],[46,5,46,8],[46,9,46,12],[47,1,49,2],[47,4,49,4],[47,5,47,8],[47,9,47,12],[49,5,49,8],[49,9,49,12],[44,5,44,8],[47,3,49,3],[35,9,35,12],[37,5,37,8],[37,9,37,12],[35,3,37,3],[40,9,40,12],[38,3,40,3],[38,9,38,12],[41,1,43,2],[41,4,43,4],[41,5,41,8],[41,9,41,12],[43,5,43,8],[43,9,43,12],[41,3,43,3],[35,5,35,8],[38,5,38,8],[40,5,40,8],[29,9,29,12],[31,5,31,8],[31,9,31,12],[32,1,34,2],[32,4,34,4],[32,5,32,8],[32,9,32,12],[34,5,34,8],[34,9,34,12],[32,3,34,3],[29,5,29,8],[29,1,31,2],[29,4,31,4],[26,1,28,2],[26,4,28,4],[26,5,26,8],[26,9,26,12],[28,5,28,8],[28,9,28,12],[23,3,25,3],[23,1,25,2],[23,4,25,4],[23,5,23,8],[26,3,28,3],[14,3,16,3],[17,3,19,3],[14,4,16,4],[14,5,14,8],[14,9,14,12],[16,5,16,8],[16,9,16,12],[23,9,23,12],[25,5,25,8],[25,9,25,12],[17,9,17,12],[19,5,19,8],[19,9,19,12],[20,1,22,2],[20,4,22,4],[20,5,20,8],[20,9,20,12],[22,5,22,8],[22,9,22,12],[20,3,22,3],[83,3,85,3],[53,4,55,4],[59,1,61,2],[59,4,61,4],[74,1,76,2],[77,1,79,2],[77,4,79,4],[80,1,82,2],[65,1,67,2],[68,3,70,3],[62,3,64,3],[68,1,70,2],[56,3,58,3],[65,4,67,4],[71,3,73,3],[74,3,76,3],[74,4,76,4],[56,1,58,2],[68,4,70,4],[44,3,46,3],[62,1,64,2],[62,4,64,4],[38,1,40,2],[38,4,40,4],[59,3,61,3],[44,1,46,2],[44,4,46,4],[53,1,55,2],[50,1,52,2],[50,4,52,4],[10,1,10,13],[9,8,9,13],[8,8,8,13],[3,8,3,13],[6,8,6,13],[5,8,5,13],[3,1,3,7],[56,4,58,4],[29,3,31,3],[35,1,37,2],[35,4,37,4],[50,3,52,3],[53,3,55,3],[12,13,13,13],[13,1,13,2],[13,5,13,8],[13,9,13,12],[12,3,13,3],[12,9,12,12],[14,1,16,2],[12,5,12,8],[17,1,19,2],[17,4,19,4],[17,5,17,8]]}
[]
[]
[null,"UNIDADE ESCOLAR",null,null,null,null,null,null,"PRAZO"]
[null,{"$f":"Orçamento!$O$4","v":"COLÉGIO ESTADUAL DA POLÍCIA MILITAR DE GOIÁS - GOIANIRA - JOSÉ SILVA OLIVEIRA"},null,null,null,null,null,null,"60 DIAS CORRIDOS"]
[]
[null,"OBRA",null,null,null,null,null,null,"DATA"]
[null,{"$f":"Orçamento!$O$7","v":"REFORMA E AMPLIAÇÃO"},null,null,null,null,null,null,{"$f":"Orçamento!$S$7","v":"2019-05-21"}]
[]
[null,"LOCAL",null,null,null,null,null,null,"ÁREA TOTAL CONSTRUÍDA (M²)"]
["FILTRO",{"$f":"Orçamento!$V$7","v":"GOIANIRA"},null,null,null,null,null,null,{"$f":"Orçamento!$S$13","v":3204.2200000000003}]
[]
[null,"CRONOGRAMA - FÍSICO FINANCEIRO"]
["↓","CUSTO TOTAL:",{"$f":"D93","v":0},"VALOR","Dias:",30,null,null,null,60,null,null,null,"TOTAL"]
[null,"DESCRIÇÃO DOS SERVIÇOS",null,null,"%","1ª PARCELA",null,null,null,"2ª PARCELA"]
[{"$f":"IF(D15>0,\"F\",\"\")","v":""},"SERVIÇOS PRELIMINARES",null,{"$f":"Orçamento!V540","v":0},{"$f":"Orçamento!X540","v":0},{"$f":"ROUND(F17*$D$15,2)","v":0},null,null,null,{"$f":"ROUND(J17*$D$15,2)","v":0},null,null,null,{"$f":"SUM(F15:M15)","v":0},null,{"$f":"IF(N15=D15,\"OK\",\"ERRO\")","v":"OK"}]
{"$rows_left_out":85}
{"sheet":"Composição BDI","index":4,"n_rows":45,"n_cols":9,"rows_kept":45,"cut":false,"hidden":false,"merged":[[11,0,11,3],[12,0,12,3],[14,0,14,3],[15,0,15,3],[13,0,13,3],[0,0,0,3],[1,0,1,3],[4,0,4,3],[7,0,7,3],[10,0,10,3],[2,0,2,3],[3,0,3,3],[5,0,5,3],[6,0,6,3],[8,0,8,3],[9,0,9,3],[18,5,18,8],[17,0,17,3],[16,0,16,3],[44,0,44,3],[42,0,42,3],[43,0,43,3],[18,0,18,3],[36,0,36,3],[39,0,39,3],[38,0,38,3],[40,0,40,3],[29,0,29,2],[32,0,32,3],[33,0,33,3],[34,0,34,3],[35,0,35,3]]}
[]
[]
["UNIDADE ESCOLAR"]
[{"$f":"Orçamento!$O$4","v":"COLÉGIO ESTADUAL DA POLÍCIA MILITAR DE GOIÁS - GOIANIRA - JOSÉ SILVA OLIVEIRA"}]
[]
["OBRA"]
[{"$f":"Orçamento!$O$7","v":"REFORMA E AMPLIAÇÃO"}]
[]
["ENDEREÇO"]
[{"$f":"Orçamento!$R$10","v":"Rua 28 c/ Rua 20 S/N, TRIUNFO I, CEP:75370-000"}]
[]
["CIDADE"]
[{"$f":"Orçamento!$V$7","v":"GOIANIRA"}]
[]
["CRE"]
{"$rows_left_out":31}
{"sheet":"Relatório CENTRAL","index":5,"n_rows":40,"n_cols":5,"rows_kept":40,"cut":false,"hidden":false,"merged":[[10,1,10,4],[11,1,11,4],[39,1,39,2],[9,0,11,0],[0,1,0,4],[6,3,6,4],[9,3,9,4],[1,1,1,4],[2,1,2,2],[2,3,2,4],[3,1,3,2],[3,3,3,4],[4,1,4,4],[5,1,5,2],[5,3,5,4],[6,1,6,2],[7,1,7,4],[8,1,8,2],[8,3,8,4],[9,1,9,2]]}
[]
[]
[null,"UNIDADE ESCOLAR",null,"CIDADE"]
[null,{"$f":"Orçamento!$O$4","v":"COLÉGIO ESTADUAL DA POLÍCIA MILITAR DE GOIÁS - GOIANIRA - JOSÉ SILVA OLIVEIRA"},null,{"$f":"Orçamento!$V$7","v":"GOIANIRA"}]
[]
[null,"OBRA",null,"CRE"]
[null,{"$f":"Orçamento!$O$7","v":"REFORMA E AMPLIAÇÃO"},null,{"$f":"Orçamento!$O$10","v":"INHUMAS"}]
[]
[null,"ENDEREÇO",null,"DATA"]
["FILTRO",{"$f":"Orçamento!$R$10","v":"Rua 28 c/ Rua 20 S/N, TRIUNFO I, CEP:75370-000"},null,{"$f":"Orçamento!$S$7","v":"2019-05-21"}]
[]
[null,"RELATÓRIO CENTRAL"]
["↓","CÓDIGO","ETAPA","PREÇO  (R$) C/ BDI","PARTIC  ( % )"]
[{"$f":"IF(D14>0,\"F\",\"\")","v":""},{"$f":"Orçamento!O540","v":"a."},{"$f":"Orçamento!P540","v":"SERVIÇOS PRELIMINARES"},{"$f":"Orçamento!V540","v":0},{"$f":"Orçamento!X540","v":0}]
[{"$f":"IF(D15>0,\"F\",\"\")","v":""},{"$f":"Orçamento!O541","v":"b."},{"$f":"Orçamento!P541","v":"TRANSPORTES"},{"$f":"Orçamento!V541","v":0},{"$f":"Orçamento!X541","v":0}]
{"$rows_left_out":26}
{"sheet":"Parc Maior Relev","index":6,"n_rows":20,"n_cols":7,"rows_kept":20,"cut":false,"hidden":false,"merged":[[0,1,0,6],[11,1,11,6],[1,1,1,6],[2,1,2,3],[2,4,2,6],[3,1,3,3],[3,4,3,6],[4,1,4,6],[5,1,5,3],[5,4,5,6],[9,1,9,3],[9,4,9,6],[10,1,10,6],[6,1,6,3],[6,4,6,6],[7,1,7,6],[10,0,12,0],[8,1,8,3],[8,4,8,6],[20,3,20,7],[18,1,18,6]]}
[]
[]
[null,"UNIDADE ESCOLAR",null,null,"CÓDIGO INEP"]
[null,{"$f":"Orçamento!$O$4","v":"COLÉGIO ESTADUAL DA POLÍCIA MILITAR DE GOIÁS - GOIANIRA - JOSÉ SILVA OLIVEIRA"},null,null,{"$f":"Orçamento!$V$4","v":52096939}]
[]
[null,"OBRA",null,null,"CIDADE"]
[null,{"$f":"Orçamento!$O$7","v":"REFORMA E AMPLIAÇÃO"},null,null,{"$f":"Orçamento!$V$7","v":"GOIANIRA"}]
[]
[null,"CRE",null,null,"ÁREA TOTAL CONSTRUÍDA (M²)"]
[null,{"$f":"Orçamento!$O$10","v":"INHUMAS"},null,null,{"$f":"Orçamento!$S$13","v":3204.2200000000003}]
["FILTRO"]
[null,"PARCELA DE MAIOR RELEVÂNCIA"]
[null,"CÓDIGO","SERVIÇO","DESCRIÇÃO","UNID","QUANT","PARC. MAIOR RELEV (50%)"]
[{"$f":"IF(F14>0,\"F\",\"\")","v":"F"},"U.",{"$f":"IFERROR(VLOOKUP(B14,Orçamento!$O$540:$P$565,2,FALSE),\"(inserir código ao lado)\")","v":"REVESTIMENTO DE PISO"},"PISO EM GRANITINA","m2    ",434.58000000000004,{"$f":"F14/2","v":217.29000000000002}]
[{"$f":"IF(F15>0,\"F\",\"\")","v":"F"},"O.",{"$f":"IFERROR(VLOOKUP(B15,Orçamento!$O$540:$P$565,2,FALSE),\"(inserir código ao lado)\")","v":"COBERTURAS"},"COBERTURA CERÂMICA","m2    ",560.06999999999994,{"$f":"F15/2","v":280.03499999999997}]
{"$rows_left_out":6}
{"sheet":"Composições","index":7,"n_rows":338,"n_cols":10,"rows_kept":338,"cut":false,"hidden":false,"merged":[[1,0,1,9],[3,7,3,9],[4,7,4,9],[6,7,6,9],[7,7,7,9],[6,0,6,6],[10,8,10,9],[13,8,13,9],[14,0,14,9],[8,0,8,9],[5,0,5,9],[2,0,2,9],[16,5,17,5],[16,6,16,7],[16,8,16,9],[16,0,17,0],[16,1,17,1],[16,2,17,2],[16,3,17,3],[16,4,17,4],[0,0,0,8],[10,0,10,2],[10,3,10,6],[11,0,11,9],[12,0,12,2],[12,3,12,6],[12,7,12,8],[7,0,7,6],[9,0,9,2],[9,3,9,6],[9,7,9,8],[3,0,3,6],[4,0,4,6],[15,0,15,9],[13,0,13,2],[13,3,13,6],[33,8,33,9],[33,0,34,0],[33,1,34,1],[33,2,34,2],[33,3,34,3],[33,4,34,4],[25,5,26,5],[25,6,25,7],[25,8,25,9],[25,0,26,0],[25,1,26,1],[25,2,26,2],[25,3,26,3],[25,4,26,4],[31,1,31,7],[29,1,29,7],[57,8,57,9],[57,0,58,0],[57,1,58,1],[57,2,58,2],[57,3,58,3],[57,4,58,4],[45,5,46,5],[45,6,45,7],[45,8,45,9],[45,0,46,0],[45,1,46,1],[45,2,46,2],[45,3,46,3],[45,4,46,4],[77,8,77,9],[77,0,78,0],[77,1,78,1],[77,2,78,2],[77,3,78,3],[77,4,78,4],[67,5,68,5],[67,6,67,7],[67,8,67,9],[67,0,68,0],[67,1,68,1],[67,2,68,2],[67,3,68,3],[67,4,68,4],[99,8,99,9],[99,0,100,0],[99,1,100,1],[99,2,100,2],[99,3,100,3],[99,4,100,4],[87,5,88,5],[87,6,87,7],[87,8,87,9],[87,0,88,0],[87,1,88,1],[87,2,88,2],[87,3,88,3],[87,4,88,4],[123,8,123,9],[123,0,124,0],[123,1,124,1],[123,2,124,2],[123,3,124,3],[123,4,124,4],[111,5,112,5],[111,6,111,7],[111,8,111,9],[111,0,112,0],[111,1,112,1],[111,2,112,2],[111,3,112,3],[111,4,112,4],[147,8,147,9],[147,0,148,0],[147,1,148,1],[147,2,148,2],[147,3,148,3],[147,4,148,4],[135,5,136,5],[135,6,135,7],[135,8,135,9],[135,0,136,0],[135,1,136,1],[135,2,136,2],[135,3,136,3],[135,4,136,4],[145,1,145,7],[141,1,141,7],[172,8,172,9],[172,0,173,0],[172,1,173,1],[172,2,173,2],[172,3,173,3],[172,4,173,4],[157,5,158,5],[157,6,157,7],[157,8,157,9],[157,0,158,0],[157,1,158,1],[157,2,158,2],[157,3,158,3],[157,4,158,4],[196,8,196,9],[196,0,197,0],[196,1,197,1],[196,2,197,2],[196,3,197,3],[196,4,197,4],[184,5,185,5],[184,6,184,7],[184,8,184,9],[184,0,185,0],[184,1,185,1],[184,2,185,2],[184,3,185,3],[184,4,185,4],[231,8,231,9],[231,0,232,0],[231,1,232,1],[231,2,232,2],[231,3,232,3],[231,4,232,4],[208,5,209,5],[208,6,208,7],[208,8,208,9],[208,0,209,0],[208,1,209,1],[208,2,209,2],[208,3,209,3],[208,4,209,4],[255,8,255,9],[255,0,256,0],[255,1,256,1],[255,2,256,2],[255,3,256,3],[255,4,256,4],[243,5,244,5],[243,6,243,7],[243,8,243,9],[243,0,244,0],[243,1,244,1],[243,2,244,2],[243,3,244,3],[243,4,244,4],[279,8,279,9],[279,0,280,0],[279,1,280,1],[279,2,280,2],[279,3,280,3],[279,4,280,4],[267,5,268,5],[267,6,267,7],[267,8,267,9],[267,0,268,0],[267,1,268,1],[267,2,268,2],[267,3,268,3],[267,4,268,4],[277,1,277,7],[273,1,273,7],[303,8,303,9],[303,0,304,0],[303,1,304,1],[303,2,304,2],[303,3,304,3],[303,4,304,4],[291,5,292,5],[291,6,291,7],[291,8,291,9],[291,0,292,0],[291,1,292,1],[291,2,292,2],[291,3,292,3],[291,4,292,4],[337,1,337,7],[333,1,333,7],[325,1,325,7],[321,1,321,7],[313,1,313,7],[327,5,328,5],[327,6,327,7],[327,8,327,9],[327,0,328,0],[327,1,328,1],[327,2,328,2],[327,3,328,3],[327,4,328,4],[315,5,316,5],[315,6,315,7],[315,8,315,9],[315,0,316,0],[315,1,316,1],[315,2,316,2],[315,3,316,3],[315,4,316,4],[265,1,265,7],[261,1,261,7],[253,1,253,7],[309,1,309,7],[301,1,301,7],[297,1,297,7],[289,1,289,7],[285,1,285,7],[303,5,304,5],[303,6,303,7],[279,5,280,5],[279,6,279,7],[255,5,256,5],[255,6,255,7],[206,1,206,7],[202,1,202,7],[194,1,194,7],[190,1,190,7],[182,1,182,7],[249,1,249,7],[241,1,241,7],[237,1,237,7],[229,1,229,7],[214,1,214,7],[231,5,232,5],[231,6,231,7],[196,5,197,5],[196,6,196,7],[133,1,133,7],[129,1,129,7],[121,1,121,7],[178,1,178,7],[170,1,170,7],[163,1,163,7],[155,1,155,7],[151,1,151,7],[172,5,173,5],[172,6,172,7],[147,5,148,5],[147,6,147,7],[123,5,124,5],[123,6,123,7],[85,1,85,7],[82,1,82,7],[75,1,75,7],[72,1,72,7],[65,1,65,7],[117,1,117,7],[109,1,109,7],[105,1,105,7],[97,1,97,7],[93,1,93,7],[99,5,100,5],[99,6,99,7],[77,5,78,5],[77,6,77,7],[23,1,23,7],[21,1,21,7],[62,1,62,7],[55,1,55,7],[51,1,51,7],[43,1,43,7],[39,1,39,7],[57,5,58,5],[57,6,57,7],[33,5,34,5],[33,6,33,7]]}
[]
[]
[]
["UNIDADE ESCOLAR",null,null,null,null,null,null,"CÓDIGO INEP"]
[{"$f":"Orçamento!$O$4","v":"COLÉGIO ESTADUAL DA POLÍCIA MILITAR DE GOIÁS - GOIANIRA - JOSÉ SILVA OLIVEIRA"},null,null,null,null,null,null,{"$f":"Orçamento!$V$4","v":52096939}]
[]
["OBRA",null,null,null,null,null,null,"CIDADE"]
[{"$f":"Orçamento!$O$7","v":"REFORMA E AMPLIAÇÃO"},null,null,null,null,null,null,{"$f":"Orçamento!$V$7","v":"GOIANIRA"}]
[]
["CRE",null,null,"ENDEREÇO",null,null,null,"REFERÊNCIA AGETOP"]
[{"$f":"Orçamento!$O$10","v":"INHUMAS"},null,null,{"$f":"Orçamento!$R$10","v":"Rua 28 c/ Rua 20 S/N, TRIUNFO I, CEP:75370-000"},null,null,null,{"$f":"Orçamento!$V$10","v":"DEZ/18"},{"$f":"Orçamento!$W$10","v":"ONERADA"}]
[]
["DATA",null,null,"ÁREA TOTAL CONSTRUÍDA (M²)",null,null,null,"REFERÊNCIA SINAPI"]
[{"$f":"Orçamento!$S$7","v":"2019-05-21"},null,null,{"$f":"Orçamento!$S$13","v":3204.2200000000003},null,null,null,{"$f":"Orçamento!$V$13","v":"MAR/19"},{"$f":"Orçamento!$W$13","v":"ONERADA"}]
[]
{"$rows_left_out":323}