{"text_format":"1","workbook":"xlsx","n_sheets":8,"sheets":["Orçamento","Resumo ","Somatório","Cronog_60_Dias","Composição BDI","Relatório CENTRAL","Parc Maior Relev","Composições"],"not_rendered":{"charts":0,"images":3,"macros":1,"external_links":0,"defined_names":80,"comments":3,"pivot_tables":0},"unopened":[],"bounds":{"document_bytes":16777216,"sheet_cells":100000,"rows_first":2000,"rows_last":500,"rows_between":2000,"halvings":0,"cell_chars":16384,"cell_head_chars":4096},"cells_cut":0,"cells_raw":0,"read":"whole","date_system":"1900"}

{"sheet":"Orçamento","index":0,"n_rows":597,"n_cols":24,"rows_kept":597,"cut":false,"hidden":false,"merged":[[578,18,578,20],[578,21,578,22],[579,15,579,17],[579,18,579,20],[579,21,579,22],[580,15,580,17],[580,18,580,20],[580,21,580,22],[575,15,575,17],[575,18,575,20],[575,21,575,22],[576,15,576,17],[576,18,576,20],[576,21,576,22],[577,15,577,17],[577,18,577,20],[577,21,577,22],[589,18,589,20],[589,21,589,22],[584,15,584,17],[584,18,584,20],[584,21,584,22],[585,15,585,17],[585,18,585,20],[585,21,585,22],[586,15,586,17],[586,18,586,20],[586,21,586,22],[565,14,565,17],[572,15,572,17],[538,15,538,17],[593,18,593,20],[593,21,593,22],[581,15,581,17],[581,18,581,20],[581,21,581,22],[582,15,582,17],[582,18,582,20],[582,21,582,22],[583,15,583,17],[583,18,583,20],[583,21,583,22],[587,15,587,17],[587,18,587,20],[587,21,587,22],[588,15,588,17],[588,18,588,20],[588,21,588,22],[589,15,589,17],[578,15,578,17],[533,16,533,22],[596,18,596,20],[596,21,596,22],[593,14,593,17],[590,15,590,17],[590,18,590,20],[590,21,590,22],[591,15,591,17],[591,18,591,20],[591,21,591,22],[592,15,592,17],[592,18,592,20],[592,21,592,22],[595,18,595,20],[595,21,595,22],[594,18,594,20],[594,21,594,22],[571,14,571,23],[572,18,572,20],[572,21,572,22],[573,15,573,17],[573,18,573,20],[573,21,573,22],[574,15,574,17],[574,18,574,20],[574,21,574,22],[529,16,529,22],[530,16,530,22],[531,16,531,22],[3,21,3,22],[2,21,2,22],[5,21,5,22],[10,14,10,23],[13,14,13,23],[6,21,6,22],[9,17,9,20],[2,14,2,20],[3,14,3,20],[5,18,5,20],[6,18,6,20],[11,18,11,20],[12,18,12,20],[6,14,6,17],[5,14,5,17],[551,15,551,17],[552,15,552,17],[553,15,553,17],[554,15,554,17],[555,15,555,17],[556,15,556,17],[557,15,557,17],[558,15,558,17],[559,15,559,17],[539,15,539,17],[540,15,540,17],[541,15,541,17],[542,15,542,17],[543,15,543,17],[544,15,544,17],[545,15,545,17],[546,15,546,17],[547,15,547,17],[560,15,560,17],[561,15,561,17],[562,15,562,17],[563,15,563,17],[564,15,564,17],[537,14,537,23],[526,20,526,21],[525,20,525,21],[521,17,526,17],[521,20,521,21],[538,18,538,20],[538,21,538,22],[539,18,539,20],[539,21,539,22],[527,20,527,21],[547,18,547,20],[547,21,547,22],[548,18,548,20],[548,21,548,22],[549,18,549,20],[549,21,549,22],[550,18,550,20],[550,21,550,22],[562,18,562,20],[565,18,565,20],[565,21,565,22],[562,21,562,22],[563,18,563,20],[563,21,563,22],[564,18,564,20],[564,21,564,22],[554,18,554,20],[554,21,554,22],[561,18,561,20],[561,21,561,22],[556,21,556,22],[557,18,557,20],[557,21,557,22],[559,18,559,20],[555,18,555,20],[555,21,555,22],[556,18,556,20],[566,18,566,20],[566,21,566,22],[553,18,553,20],[553,21,553,22],[546,18,546,20],[546,21,546,22],[568,18,568,20],[568,21,568,22],[522,20,522,21],[544,18,544,20],[544,21,544,22],[545,18,545,20],[545,21,545,22],[543,18,543,20],[543,21,543,22],[552,18,552,20],[523,20,523,21],[534,18,534,22],[540,18,540,20],[540,21,540,22],[541,18,541,20],[541,21,541,22],[542,18,542,20],[542,21,542,22],[532,16,532,22],[8,12,9,12],[567,18,567,20],[567,21,567,22],[0,14,0,22],[8,14,8,16],[9,14,9,16],[11,14,11,16],[12,14,12,16],[14,14,14,22],[1,14,1,22],[4,14,4,22],[7,14,7,22],[551,18,551,20],[551,21,551,22],[559,21,559,22],[548,15,548,17],[549,15,549,17],[550,15,550,17],[552,21,552,22],[560,18,560,20],[560,21,560,22],[558,18,558,20],[558,21,558,22]]}
[]
[]
[null,null,null,null,null,null,null,null,null,null,null,null,null,null,"UNIDADE ESCOLAR",null,null,null,null,null,null,"CÓDIGO INEP"]
[null,null,null,null,null,null,null,null,null,null,null,null,null,null,"COLÉGIO ESTADUAL DA POLÍCIA MILITAR DE GOIÁS - GOIANIRA - JOSÉ SILVA OLIVEIRA",null,null,null,null,null,null,52096939]
[]
["Nmax",null,null,null,null,null,null,null,null,null,null,null,"Ajustar altura?",null,"OBRA",null,null,null,"DATA",null,null,"CIDADE"]
[{"$f":"MAX($C$18:$C$521)","v":3},null,null,null,null,null,null,null,null,null,null,null,"SIM",null,"REFORMA E AMPLIAÇÃO",null,null,null,"2019-05-21",null,null,"GOIANIRA"]
[]
[null,null,null,null,null,null,null,null,null,null,null,null,"",null,"CRE",null,null,"ENDEREÇO",null,null,null,"REFERÊNCIA AGETOP"]
[null,null,null,null,null,null,null,null,null,null,null,null,null,null,"INHUMAS",null,null,"Rua 28 c/ Rua 20 S/N, TRIUNFO I, CEP:75370-000",null,null,null,"DEZ/18","ONERADA"]
[]
[null,null,null,null,null,null,null,null,null,null,null,null,null,null,"ÁREA EXISTENTE (M²)",null,null,"ÁREA A CONSTRUIR (M²)","ÁREA TOTAL CONSTRUÍDA (M²)",null,null,"REFERÊNCIA SINAPI"]
[null,null,null,null,null,null,null,null,null,null,null,null,null,null,2811.92,null,null,392.3,3204.2200000000003,null,null,"MAR/19","ONERADA"]
[]
[null,null,null,null,null,null,null,null,null,null,null,"FILTRO",null,null,"PLANILHA ORÇAMENTÁRIA"]
["Nível E","Save Nivel","Nível C","Altura","n1","n2","n3","n4","n5","Czero","Cnível","↓","Nível","Nível Corrigido","ITEM","TABELA","CODIGO","DESCRIÇÃO DOS SERVIÇOS","UNID","QUANT","MAT","MO","T.SERVIÇO","OBSERVAÇÕES¹"]
[{"$f":"CHOOSE(1+LOG(1+2*(ORÇAMENTO.Nivel=\"Nível 1\")+4*(ORÇAMENTO.Nivel=\"Nível 2\")+8*(ORÇAMENTO.Nivel=\"Nível 3\")+16*(ORÇAMENTO.Nivel=\"Nível 4\")+32*(ORÇAMENTO.Nivel=\"Serviço\"),2),0,1,2,3,4,\"S\")","v":"S"},{"$f":"IF(OR(C17=\"s\",C17=0),OFFSET(B17,-1,0),C17)","v":"Save Nivel"},{"$f":"IF(OFFSET(C17,-1,0)=\"L\",1,IF(OFFSET(C17,-1,0)=1,2,IF(OR(A17=\"s\",A17=0),\"S\",IF(AND(OFFSET(C17,-1,0)=2,A17=4),3,IF(AND(OR(OFFSET(C17,-1,0)=\"s\",OFFSET(C17,-1,0)=0),A17<>\"s\",A17>OFFSET(B17,-1,0)),OFFSET(B17,-1,0),A17)))))","v":"S"},{"$f":"IF(OR(C17=\"S\",C17=0),0,IF(ISERROR(K17),J17,SMALL(J17:K17,1)))","v":0},{"$f":"IF($C17=1,OFFSET(E17,-1,0)+1,OFFSET(E17,-1,0))","v":"n1"},{"$f":"IF($C17=1,0,IF($C17=2,OFFSET(F17,-1,0)+1,OFFSET(F17,-1,0)))","v":"n2"},{"$f":"IF(AND($C17<=2,$C17<>0),0,IF($C17=3,OFFSET(G17,-1,0)+1,OFFSET(G17,-1,0)))","v":"n3"},{"$f":"IF(AND($C17<=3,$C17<>0),0,IF($C17=4,OFFSET(H17,-1,0)+1,OFFSET(H17,-1,0)))","v":"n4"},{"$f":"IF(AND($C17<=4,$C17<>0),0,IF(AND($C17=\"S\",$W17>0),OFFSET(I17,-1,0)+1,OFFSET(I17,-1,0)))","v":"n5"},{"$f":"IF(OR($C17=\"S\",$C17=0),0,MATCH(0,OFFSET($D17,1,$C17,ROW($C$521)-ROW($C17)),0))","v":0},{"$f":"IF(OR($C17=\"S\",$C17=0),0,MATCH(OFFSET($D17,0,$C17)+1,OFFSET($D17,1,$C17,ROW($C$521)-ROW($C17)),0))","v":0},"","Serviço","Serviço","-","SINAPI",null,"(sem código)","-",null,0,0,0,""]
[0,null,"L",{"$f":"COUNTA(OFFSET(D18,1,0):D$521)","v":502},{"$f":"LEFT(O19,1)-1","v":0},null,null,null,null,null,null,"F","LOTE","LOTE","REFORMA E AMPLIAÇÃO - COLÉGIO ESTADUAL DA POLÍCIA MILITAR DE GOIÁS - GOIANIRA - JOSÉ SILVA OLIVEIRA",null,null,null,null,null,null,null,0]
[1,{"$f":"IF(OR(C19=\"s\",C19=0),OFFSET(B19,-1,0),C19)","v":1},{"$f":"IF(OFFSET(C19,-1,0)=\"L\",1,IF(OFFSET(C19,-1,0)=1,2,IF(OR(A19=\"s\",A19=0),\"S\",IF(AND(OFFSET(C19,-1,0)=2,A19=4),3,IF(AND(OR(OFFSET(C19,-1,0)=\"s\",OFFSET(C19,-1,0)=0),A19<>\"s\",A19>OFFSET(B19,-1,0)),OFFSET(B19,-1,0),A19)))))","v":1},{"$f":"IF(OR(C19=\"S\",C19=0),0,IF(ISERROR(K19),J19,SMALL(J19:K19,1)))","v":99},{"$f":"IF($C19=1,OFFSET(E19,-1,0)+1,OFFSET(E19,-1,0))","v":1},{"$f":"IF($C19=1,0,IF($C19=2,OFFSET(F19,-1,0)+1,OFFSET(F19,-1,0)))","v":0},{"$f":"IF(AND($C19<=2,$C19<>0),0,IF($C19=3,OFFSET(G19,-1,0)+1,OFFSET(G19,-1,0)))","v":0},{"$f":"IF(AND($C19<=3,$C19<>0),0,IF($C19=4,OFFSET(H19,-1,0)+1,OFFSET(H19,-1,0)))","v":0},0,{"$f":"IF(OR($C19=\"S\",$C19=0),0,MATCH(0,OFFSET($D19,1,$C19,ROW($C$521)-ROW($C19)),0))","v":502},{"$f":"IF(OR($C19=\"S\",$C19=0),0,MATCH(OFFSET($D19,0,$C19)+1,OFFSET($D19,1,$C19,ROW($C$521)-ROW($C19)),0))","v":99},"F","Nível 1","Nível 1","1.","AGETOP",null,"REFORMA",null,null,null,null,0]
[2,{"$f":"IF(OR(C20=\"s\",C20=0),OFFSET(B20,-1,0),C20)","v":2},{"$f":"IF(OFFSET(C20,-1,0)=\"L\",1,IF(OFFSET(C20,-1,0)=1,2,IF(OR(A20=\"s\",A20=0),\"S\",IF(AND(OFFSET(C20,-1,0)=2,A20=4),3,IF(AND(OR(OFFSET(C20,-1,0)=\"s\",OFFSET(C20,-1,0)=0),A20<>\"s\",A20>OFFSET(B20,-1,0)),OFFSET(B20,-1,0),A20)))))","v":2},{"$f":"IF(OR(C20=\"S\",C20=0),0,IF(ISERROR(K20),J20,SMALL(J20:K20,1)))","v":9},{"$f":"IF($C20=1,OFFSET(E20,-1,0)+1,OFFSET(E20,-1,0))","v":1},{"$f":"IF($C20=1,0,IF($C20=2,OFFSET(F20,-1,0)+1,OFFSET(F20,-1,0)))","v":1},{"$f":"IF(AND($C20<=2,$C20<>0),0,IF($C20=3,OFFSET(G20,-1,0)+1,OFFSET(G20,-1,0)))","v":0},{"$f":"IF(AND($C20<=3,$C20<>0),0,IF($C20=4,OFFSET(H20,-1,0)+1,OFFSET(H20,-1,0)))","v":0},0,98,9,"","Nível 2","Nível 2","-","AGETOP",null,"SERVIÇOS PRELIMINARES",null,null,null,null,0]
["S",{"$f":"IF(OR(C21=\"s\",C21=0),OFFSET(B21,-1,0),C21)","v":2},{"$f":"IF(OFFSET(C21,-1,0)=\"L\",1,IF(OFFSET(C21,-1,0)=1,2,IF(OR(A21=\"s\",A21=0),\"S\",IF(AND(OFFSET(C21,-1,0)=2,A21=4),3,IF(AND(OR(OFFSET(C21,-1,0)=\"s\",OFFSET(C21,-1,0)=0),A21<>\"s\",A21>OFFSET(B21,-1,0)),OFFSET(B21,-1,0),A21)))))","v":"S"},{"$f":"IF(OR(C21=\"S\",C21=0),0,IF(ISERROR(K21),J21,SMALL(J21:K21,1)))","v":0},1,1,0,0,0,0,0,"","Serviço","Serviço","-","SINAPI",97645,"REMOÇÃO DE JANELAS, DE FORMA MANUAL, SEM REAPROVEITAMENTO. AF_12/2017","M2",54.41,null,null,0,"Referência: AGETOP - 20106"]
["S",2,"S",0,1,1,0,0,0,0,0,"","Serviço","Serviço","-","SINAPI",97644,"REMOÇÃO DE PORTAS, DE FORMA MANUAL, SEM REAPROVEITAMENTO. AF_12/2017","M2",2.1,null,null,0,"Referência: AGETOP - 20106"]
["S",2,"S",0,1,1,0,0,0,0,0,"","Serviço","Serviço","-","AGETOP",20121,"DEM. MANUAL EM CONCR.SIMPLES C/TR.ATE CB.E CARGA (O.C.)","m3    ",12.13,null,null,0,""]
["S",2,"S",0,1,1,0,0,0,0,0,"","Serviço","Serviço","-","AGETOP",20118,"DEM.ALVEN.TIJOLO S/REAP. C/TR.ATE CB. E CARGA","m3    ",1.3,null,null,0,""]
["S",2,"S",0,1,1,0,0,0,0,0,"","Serviço","Serviço","-","AGETOP",20163,"DEMOLIÇÃO DAS INSTALAÇÕES HIDROSANITÁRIAS E AFINS C/ TRANSP. ATÉ CB. E CARGA","H     ",2,null,null,0,""]
["S",2,"S",0,1,1,0,0,0,{"$f":"IF(OR($C26=\"S\",$C26=0),0,MATCH(0,OFFSET($D26,1,$C26,ROW($C$521)-ROW($C26)),0))","v":0},{"$f":"IF(OR($C26=\"S\",$C26=0),0,MATCH(OFFSET($D26,0,$C26)+1,OFFSET($D26,1,$C26,ROW($C$521)-ROW($C26)),0))","v":0},"","Serviço","Serviço","-","AGETOP",260104,"REMOCAO DE PINTURA ANTIGA A LATEX","m2    ",4,null,null,0,""]
["S",2,"S",0,1,1,0,0,0,{"$f":"IF(OR($C27=\"S\",$C27=0),0,MATCH(0,OFFSET($D27,1,$C27,ROW($C$521)-ROW($C27)),0))","v":0},{"$f":"IF(OR($C27=\"S\",$C27=0),0,MATCH(OFFSET($D27,0,$C27)+1,OFFSET($D27,1,$C27,ROW($C$521)-ROW($C27)),0))","v":0},"","Serviço","Serviço","-","AGETOP",20162,"DEMOLIÇÃO DAS INSTALAÇÕES ELÉTRICAS E AFINS C/ TRANSP. ATÉ CB. E CARGA","H     ",4,null,null,0,""]
["S",2,"S",0,1,1,0,0,0,0,0,"","Serviço","Serviço","-","SINAPI","74209/1","PLACA DE OBRA EM CHAPA DE ACO GALVANIZADO","M2",4.5,null,null,0,"Referência: AGETOP - 21301"]
[2,2,2,3,1,2,0,0,0,89,3,"","Nível 2","Nível 2","-","AGETOP",null,"TRANSPORTES","-",null,null,null,0,""]
["S",2,"S",0,1,2,0,0,0,0,0,"","Serviço","Serviço","-","SINAPI",72900,"TRANSPORTE DE ENTULHO COM CAMINHAO BASCULANTE 6 M3, RODOVIA PAVIMENTADA, DMT 0,5 A 1,0 KM","M3",25.13,null,null,0,""]
["S",2,"S",0,1,2,0,0,0,0,0,"","Serviço","Serviço","-","SINAPI",72897,"CARGA MANUAL DE ENTULHO EM CAMINHAO BASCULANTE 6 M3","M3",25.13,null,null,0,""]
[2,2,2,5,1,3,0,0,0,86,5,"","Nível 2","Nível 2","-","AGETOP",null,"SERVIÇO EM TERRA","-",null,null,null,0,""]
["S",2,"S",0,1,3,0,0,0,0,0,"","Serviço","Serviço","-","SINAPI",93358,"ESCAVAÇÃO MANUAL DE VALA COM PROFUNDIDADE MENOR OU IGUAL A 1,30 M. AF_03/2016","M3",25,null,null,0,"Referência: AGETOP - 40101"]
["S",2,"S",0,1,3,0,0,0,0,0,"","Serviço","Serviço","-","SINAPI",96995,"REATERRO MANUAL APILOADO COM SOQUETE. AF_10/2017","M3",25,null,null,0,"Referência: AGETOP - 40902"]
[{"$f":"CHOOSE(1+LOG(1+2*(ORÇAMENTO.Nivel=\"Nível 1\")+4*(ORÇAMENTO.Nivel=\"Nível 2\")+8*(ORÇAMENTO.Nivel=\"Nível 3\")+16*(ORÇAMENTO.Nivel=\"Nível 4\")+32*(ORÇAMENTO.Nivel=\"Serviço\"),2),0,1,2,3,4,\"S\")","v":"S"},2,"S",0,{"$f":"IF($C35=1,OFFSET(E35,-1,0)+1,OFFSET(E35,-1,0))","v":1},{"$f":"IF($C35=1,0,IF($C35=2,OFFSET(F35,-1,0)+1,OFFSET(F35,-1,0)))","v":3},{"$f":"IF(AND($C35<=2,$C35<>0),0,IF($C35=3,OFFSET(G35,-1,0)+1,OFFSET(G35,-1,0)))","v":0},{"$f":"IF(AND($C35<=3,$C35<>0),0,IF($C35=4,OFFSET(H35,-1,0)+1,OFFSET(H35,-1,0)))","v":0},{"$f":"IF(AND($C35<=4,$C35<>0),0,IF(AND($C35=\"S\",$W35>0),OFFSET(I35,-1,0)+1,OFFSET(I35,-1,0)))","v":0},0,0,"","Serviço","Serviço","-","SINAPI","74005/1","COMPACTACAO MECANICA, SEM CONTROLE DO GC (C/COMPACTADOR PLACA 400 KG)","M3",78.460000000000008,null,null,0,"Referência: AGETOP - 41009"]
["S",2,"S",0,1,3,0,0,0,0,0,"","Serviço","Serviço","-","AGETOP",41140,"REGULARIZAÇÃO DO TERRENO SEM APILOAMENTO COM TRANSPORTE MANUAL DA TERRA ESCAVADA ","m2    ",392.3,null,null,0,""]
[{"$f":"CHOOSE(1+LOG(1+2*(ORÇAMENTO.Nivel=\"Nível 1\")+4*(ORÇAMENTO.Nivel=\"Nível 2\")+8*(ORÇAMENTO.Nivel=\"Nível 3\")+16*(ORÇAMENTO.Nivel=\"Nível 4\")+32*(ORÇAMENTO.Nivel=\"Serviço\"),2),0,1,2,3,4,\"S\")","v":2},{"$f":"IF(OR(C37=\"s\",C37=0),OFFSET(B37,-1,0),C37)","v":2},{"$f":"IF(OFFSET(C37,-1,0)=\"L\",1,IF(OFFSET(C37,-1,0)=1,2,IF(OR(A37=\"s\",A37=0),\"S\",IF(AND(OFFSET(C37,-1,0)=2,A37=4),3,IF(AND(OR(OFFSET(C37,-1,0)=\"s\",OFFSET(C37,-1,0)=0),A37<>\"s\",A37>OFFSET(B37,-1,0)),OFFSET(B37,-1,0),A37)))))","v":2},{"$f":"IF(OR(C37=\"S\",C37=0),0,IF(ISERROR(K37),J37,SMALL(J37:K37,1)))","v":14},{"$f":"IF($C37=1,OFFSET(E37,-1,0)+1,OFFSET(E37,-1,0))","v":1},{"$f":"IF($C37=1,0,IF($C37=2,OFFSET(F37,-1,0)+1,OFFSET(F37,-1,0)))","v":4},{"$f":"IF(AND($C37<=2,$C37<>0),0,IF($C37=3,OFFSET(G37,-1,0)+1,OFFSET(G37,-1,0)))","v":0},{"$f":"IF(AND($C37<=3,$C37<>0),0,IF($C37=4,OFFSET(H37,-1,0)+1,OFFSET(H37,-1,0)))","v":0},{"$f":"IF(AND($C37<=4,$C37<>0),0,IF(AND($C37=\"S\",$W37>0),OFFSET(I37,-1,0)+1,OFFSET(I37,-1,0)))","v":0},81,14,"","Nível 2","Nível 2","-",null,null,"INSTALAÇÕES ELÉTRICAS","-",null,null,null,0,""]
["S",2,"S",0,1,4,0,0,0,0,0,"","Serviço","Serviço","-","SINAPI",92980,"CABO DE COBRE FLEXÍVEL ISOLADO, 10 MM², ANTI-CHAMA 0,6/1,0 KV, PARA DISTRIBUIÇÃO - FORNECIMENTO E INSTALAÇÃO. AF_12/2015","M",275,null,null,0,""]
["S",2,"S",0,1,4,0,0,0,0,0,"","Serviço","Serviço","-","SINAPI",91931,"CABO DE COBRE FLEXÍVEL ISOLADO, 6 MM², ANTI-CHAMA 0,6/1,0 KV, PARA CIRCUITOS TERMINAIS - FORNECIMENTO E INSTALAÇÃO. AF_12/2015","M",250,null,null,0,"Referência: AGETOP - 70583"]
["S",2,"S",0,1,4,0,0,0,0,0,"","Serviço","Serviço","-","SINAPI",91929,"CABO DE COBRE FLEXÍVEL ISOLADO, 4 MM², ANTI-CHAMA 0,6/1,0 KV, PARA CIRCUITOS TERMINAIS - FORNECIMENTO E INSTALAÇÃO. AF_12/2015","M",225,null,null,0,"Referência: AGETOP - 70582"]
["S",2,"S",0,1,4,0,0,0,0,0,"","Serviço","Serviço","-","SINAPI",97893,"CAIXA ENTERRADA ELÉTRICA RETANGULAR, EM ALVENARIA COM BLOCOS DE CONCRETO, FUNDO COM BRITA, DIMENSÕES INTERNAS: 0,8X0,8X0,6 M. AF_05/2018","UN",6,null,null,0,""]
["S",2,"S",0,1,4,0,0,0,0,0,"","Serviço","Serviço","-","SINAPI",93673,"DISJUNTOR TRIPOLAR TIPO DIN, CORRENTE NOMINAL DE 50A - FORNECIMENTO E INSTALAÇÃO. AF_04/2016","UN",2,null,null,0,"Referência: AGETOP - 71174"]
["S",2,"S",0,1,4,0,0,0,0,0,"","Serviço","Serviço","-","SINAPI",93671,"DISJUNTOR TRIPOLAR TIPO DIN, CORRENTE NOMINAL DE 32A - FORNECIMENTO E INSTALAÇÃO. AF_04/2016","UN",2,null,null,0,"Referência: AGETOP - 71173"]
["S",2,"S",0,1,4,0,0,0,0,0,"","Serviço","Serviço","-","SINAPI",93670,"DISJUNTOR TRIPOLAR TIPO DIN, CORRENTE NOMINAL DE 25A - FORNECIMENTO E INSTALAÇÃO. AF_04/2016","UN",2,null,null,0,""]
["S",2,"S",0,1,4,0,0,0,0,0,"","Serviço","Serviço","-","SINAPI",93008,"ELETRODUTO RÍGIDO ROSCÁVEL, PVC, DN 50 MM (1 1/2\") - FORNECIMENTO E INSTALAÇÃO. AF_12/2015","M",105,null,null,0,""]
["S",2,"S",0,1,4,0,0,0,0,0,"","Serviço","Serviço","-","SINAPI",91872,"ELETRODUTO RÍGIDO ROSCÁVEL, PVC, DN 32 MM (1\"), PARA CIRCUITOS TERMINAIS, INSTALADO EM PAREDE - FORNECIMENTO E INSTALAÇÃO. AF_12/2015","M",45,null,null,0,"Referência: AGETOP - 71202"]
["S",2,"S",0,1,4,0,0,0,0,0,"","Serviço","Serviço","-","AGETOP",71321,"FITA DE AUTO FUSAO, ROLO E 10,00 MM","Un    ",1,null,null,0,""]
["S",2,"S",0,1,4,0,0,0,0,0,"","Serviço","Serviço","-","AGETOP",71331,"FITA ISOLANTE, ROLO DE 20,00 M","Un    ",5,null,null,0,""]
["S",2,"S",0,1,4,0,0,0,0,0,"","Serviço","Serviço","-","SINAPI",83463,"QUADRO DE DISTRIBUICAO DE ENERGIA EM CHAPA DE ACO GALVANIZADO, PARA 12 DISJUNTORES TERMOMAGNETICOS MONOPOLARES, COM BARRAMENTO TRIFASICO E NEUTRO - FORNECIMENTO E INSTALACAO","UN",1,null,null,0,""]
["S",2,"S",0,1,4,0,0,0,0,0,"","Serviço","Serviço","-","SINAPI","74131/4","QUADRO DE DISTRIBUICAO DE ENERGIA DE EMBUTIR, EM CHAPA METALICA, PARA 18 DISJUNTORES TERMOMAGNETICOS MONOPOLARES, COM BARRAMENTO TRIFASICO E NEUTRO, FORNECIMENTO E INSTALACAO","UN",2,null,null,0,""]
[{"$f":"CHOOSE(1+LOG(1+2*(ORÇAMENTO.Nivel=\"Nível 1\")+4*(ORÇAMENTO.Nivel=\"Nível 2\")+8*(ORÇAMENTO.Nivel=\"Nível 3\")+16*(ORÇAMENTO.Nivel=\"Nível 4\")+32*(ORÇAMENTO.Nivel=\"Serviço\"),2),0,1,2,3,4,\"S\")","v":2},{"$f":"IF(OR(C51=\"s\",C51=0),OFFSET(B51,-1,0),C51)","v":2},{"$f":"IF(OFFSET(C51,-1,0)=\"L\",1,IF(OFFSET(C51,-1,0)=1,2,IF(OR(A51=\"s\",A51=0),\"S\",IF(AND(OFFSET(C51,-1,0)=2,A51=4),3,IF(AND(OR(OFFSET(C51,-1,0)=\"s\",OFFSET(C51,-1,0)=0),A51<>\"s\",A51>OFFSET(B51,-1,0)),OFFSET(B51,-1,0),A51)))))","v":2},{"$f":"IF(OR(C51=\"S\",C51=0),0,IF(ISERROR(K51),J51,SMALL(J51:K51,1)))","v":7},{"$f":"IF($C51=1,OFFSET(E51,-1,0)+1,OFFSET(E51,-1,0))","v":1},{"$f":"IF($C51=1,0,IF($C51=2,OFFSET(F51,-1,0)+1,OFFSET(F51,-1,0)))","v":5},{"$f":"IF(AND($C51<=2,$C51<>0),0,IF($C51=3,OFFSET(G51,-1,0)+1,OFFSET(G51,-1,0)))","v":0},{"$f":"IF(AND($C51<=3,$C51<>0),0,IF($C51=4,OFFSET(H51,-1,0)+1,OFFSET(H51,-1,0)))","v":0},{"$f":"IF(AND($C51<=4,$C51<>0),0,IF(AND($C51=\"S\",$W51>0),OFFSET(I51,-1,0)+1,OFFSET(I51,-1,0)))","v":0},67,7,"","Nível 2","Nível 2","-","AGETOP",null,"INSTALAÇÕES HIDROSSANITÁRIAS","-",null,null,null,0,""]
["S",2,"S",0,1,5,0,0,0,0,0,"","Serviço","Serviço","-","AGETOP",81825,"CAIXA DE PASSAGEM 60 X 60 CM SEM TAMPA","Un    ",4,null,null,0,""]
["S",2,"S",0,1,5,0,0,0,{"$f":"IF(OR($C53=\"S\",$C53=0),0,MATCH(0,OFFSET($D53,1,$C53,ROW($C$521)-ROW($C53)),0))","v":0},{"$f":"IF(OR($C53=\"S\",$C53=0),0,MATCH(OFFSET($D53,0,$C53)+1,OFFSET($D53,1,$C53,ROW($C$521)-ROW($C53)),0))","v":0},"","Serviço","Serviço","-","SINAPI",6171,"TAMPA DE CONCRETO ARMADO 60X60X5CM PARA CAIXA","UN",4,null,null,0,""]
["S",2,"S",0,1,5,0,0,0,0,0,"","Serviço","Serviço","-","AGETOP",81501,"ADESIVO PLASTICO - FRASCO 850 G","Un    ",1,null,null,0,""]
["S",2,"S",0,1,5,0,0,0,0,0,"","Serviço","Serviço","-","AGETOP",81504,"SOLUCAO LIMPADORA 1000 CM3","Un    ",1,null,null,0,""]
["S",2,"S",0,1,5,0,0,0,0,0,"","Serviço","Serviço","-","SINAPI",89778,"LUVA SIMPLES, PVC, SERIE NORMAL, ESGOTO PREDIAL, DN 100 MM, JUNTA ELÁSTICA, FORNECIDO E INSTALADO EM RAMAL DE DESCARGA OU RAMAL DE ESGOTO SANITÁRIO. AF_12/2014","UN",6,null,null,0,"Referência: AGETOP - 82004"]
["S",2,"S",0,1,5,0,0,0,0,0,"","Serviço","Serviço","-","SINAPI",89800,"TUBO PVC, SERIE NORMAL, ESGOTO PREDIAL, DN 100 MM, FORNECIDO E INSTALADO EM PRUMADA DE ESGOTO SANITÁRIO OU VENTILAÇÃO. AF_12/2014","M",48,null,null,0,""]
[2,2,2,38,1,6,0,0,0,60,38,"","Nível 2","Nível 2","-","SINAPI",null,"INSTALAÇÕES ESPECIAIS","-",null,null,null,0,""]
["S",2,"S",0,1,6,0,0,0,0,0,"","Serviço","Serviço","-","AGETOP",72338,"SIRENE METALICA ALCANCE 500 M","Un    ",1,null,null,0,""]
["S",2,"S",0,1,6,0,0,0,0,0,"","Serviço","Serviço","-","AGETOP",81882,"RES.METALICO TAÇA AÇO PATINÁVEL-V=15M3-COL.SEC.H=6M+FUNDAÇÃO+LOGOTIPO","Un    ",1,null,null,0,""]
["S",2,"S",0,1,6,0,0,0,0,0,"","Serviço","Serviço","-","AGETOP",80910,"REGISTRO DE GAVETA BRUTO DIAMETRO 2.1/2\"","Un    ",2,null,null,0,""]
["S",2,"S",0,1,6,0,0,0,0,0,"","Serviço","Serviço","-","AGETOP",82379,"TUBO FERRO GALVANIZADO DIAM.2.1/2\"","m     ",280,null,null,0,""]
["S",2,"S",0,1,6,0,0,0,0,0,"","Serviço","Serviço","-","AGETOP",85003,"EXTINTOR PO QUIMICO SECO (6 KG) - CAPACIDADE EXTINTORA 20 BC","Un    ",2,null,null,0,""]
["S",2,"S",0,1,6,0,0,0,0,0,"","Serviço","Serviço","-","AGETOP",85005,"EXTINTOR AGUA PRESSURIZADA (10 LITROS) - CAPACIDADE EXTINTORA 2A","Un    ",4,null,null,0,""]
["S",2,"S",0,1,6,0,0,0,0,0,"","Serviço","Serviço","-","AGETOP",85006,"EXTINTOR MULTI USO EM PO A B C (6 KG) - CAPACIDADE EXTINTORA 3A 20BC","un    ",6,null,null,0,""]
["S",2,"S",0,1,6,0,0,0,0,0,"","Serviço","Serviço","-","AGETOP",85011,"CAIXA DE INCÊNDIO METÁLICA COM SUPORTE PARA MANGUEIRA, TAMPA E MURETA 17X60X90 CM C/PINTURA","Un    ",6,null,null,0,""]
["S",2,"S",0,1,6,0,0,0,0,0,"","Serviço","Serviço","-","AGETOP",85017,"MANGUEIRA DE INCÊNDIO D.I. = 38 MM TIPO 2 COMP. = 15 M","CJ    ",12,null,null,0,""]
["S",2,"S",0,1,6,0,0,0,0,0,"","Serviço","Serviço","-","AGETOP",85025,"ESGUICHO REGULÁVEL 1.1/2\"","Un    ",6,null,null,0,""]
["S",2,"S",0,1,6,0,0,0,0,0,"","Serviço","Serviço","-","AGETOP",85027,"ADAPTADOR P/ENGATE STORZ 2.1/2\" X 1.1/2\"","Un    ",8,null,null,0,""]
["S",2,"S",0,1,6,0,0,0,0,0,"","Serviço","Serviço","-","AGETOP",85031,"REGISTRO GLOBO ANGULAR 2.1/2\"","Un    ",6,null,null,0,""]
["S",2,"S",0,1,6,0,0,0,0,0,"","Serviço","Serviço","-","AGETOP",85035,"TAMPÃO CEGO COM CORRENTE 2.1/2\"","Un    ",1,null,null,0,""]
["S",2,"S",0,1,6,0,0,0,0,0,"","Serviço","Serviço","-","AGETOP",85037,"TANQUE DE PRESSÃO DE 10 L","Un    ",1,null,null,0,""]
["S",2,"S",0,1,6,0,0,0,0,0,"","Serviço","Serviço","-","AGETOP",85039,"PRESSOSTATO 50 A 80 PSI","Un    ",1,null,null,0,""]
["S",2,"S",0,1,6,0,0,0,0,0,"","Serviço","Serviço","-","AGETOP",85041,"MANOMETRO - 0 A 10 KG/CM2","Un    ",1,null,null,0,""]
["S",2,"S",0,1,6,0,0,0,0,0,"","Serviço","Serviço","-","AGETOP",85047,"NIPLE DUPLO FERRO GALVANIZADO 2.1/2\"","Un    ",6,null,null,0,""]
["S",2,"S",0,1,6,0,0,0,0,0,"","Serviço","Serviço","-","AGETOP",85077,"VÁLVULA DE RETENÇÃO HORIZONTAL 2.1/2\"","Un    ",2,null,null,0,""]
["S",2,"S",0,1,6,0,0,0,0,0,"","Serviço","Serviço","-","COMPOSIÇÃO","COMP 017_SEE","REDUCAO GIRATÓRIA TIPO STORZ LATAO P/ INST. PREDIAL COMBATE A INCENDIO ENGATE RAPIDO 2.1/2\" X 1.1/2\"","UN ",6,null,null,0,""]
["S",2,"S",0,1,6,0,0,0,0,0,"","Serviço","Serviço","-","COMPOSIÇÃO","COMP 018_SEE","CHAVE DUPLA P/ CONEXÕES TIPO STORZ EM LATÃO ENGATE RÁPIDO 1 1/2\" X 2 1/2\"","UN ",6,null,null,0,""]
["S",2,"S",0,1,6,0,0,0,0,0,"","Serviço","Serviço","-","COMPOSIÇÃO","COMP 087_SEE","REGISTRO DE GAVETA COM HASTE ASCENDENTE DE BRONZE 2 1/2\"","UN ",1,null,null,0,""]
["S",2,"S",0,1,6,0,0,0,0,0,"","Serviço","Serviço","-","COMPOSIÇÃO","COMP 019_SEE","TAMPÃO LATAO C/ CORRENTE P/ INSTALAÇÃO PREDIAL COMBATE A INCÊNDIO ENGATE RÁPIDO 1 1/2\"","UN ",6,null,null,0,""]
["S",2,"S",0,1,6,0,0,0,0,0,"","Serviço","Serviço","-","AGETOP",80981,"REGISTRO DE ESFERA DIAMETRO 2.1/2\"","Un    ",2,null,null,0,""]
["S",2,"S",0,1,6,0,0,0,0,0,"","Serviço","Serviço","-","AGETOP",85056,"TÊ DE FERRO GALVANIZADO 90º X 2 1/2\"","un    ",9,null,null,0,""]
["S",2,"S",0,1,6,0,0,0,0,0,"","Serviço","Serviço","-","COMPOSIÇÃO","COMP 030_SEE","COTOVELO DE FERRO GALV. 90° X 2 1/2\"","UN ",38,null,null,0,""]
["S",2,"S",0,1,6,0,0,0,0,0,"","Serviço","Serviço","-","COMPOSIÇÃO","COMP 077_SEE","UNIAO FERRO GALV C/ASSENTO CONICO BRONZE 2 1/2\"","UN ",6,null,null,0,""]
["S",2,"S",0,1,6,0,0,0,{"$f":"IF(OR($C85=\"S\",$C85=0),0,MATCH(0,OFFSET($D85,1,$C85,ROW($C$521)-ROW($C85)),0))","v":0},{"$f":"IF(OR($C85=\"S\",$C85=0),0,MATCH(OFFSET($D85,0,$C85)+1,OFFSET($D85,1,$C85,ROW($C$521)-ROW($C85)),0))","v":0},"","Serviço","Serviço","-","COMPOSIÇÃO","COMP 076_SEE","CURVA FERRO GALVANIZADO 45G ROSCA MACHO/FEMEA REF. 2 1/2\"","UN ",3,null,null,0,""]
["S",2,"S",0,1,6,0,0,0,0,0,"","Serviço","Serviço","-","COMPOSIÇÃO","COMP 022_SEE","TAMPÃO FOFO 40X50CM C/INSCRIÇÃO ","UN ",1,null,null,0,""]
["S",2,"S",0,1,6,0,0,0,0,0,"","Serviço","Serviço","-","COMPOSIÇÃO","COMP 024_SEE","SINALIZADOR FOTOLUMINESCENTE PARA EXTINTOR","UN ",12,null,null,0,""]
["S",2,"S",0,1,6,0,0,0,0,0,"","Serviço","Serviço","-","COMPOSIÇÃO","COMP 186_SEE","BOTOEIRA BOMBA DE INCÊNDIO C/ MARTELO CONVENCIONAL/ ANALÓGICA","UN ",1,null,null,0,""]
["S",2,"S",0,1,6,0,0,0,0,0,"","Serviço","Serviço","-","COMPOSIÇÃO","COMP 188_SEE","ACIONADOR MANUAL DE ALARME","UN ",7,null,null,0,""]
["S",2,"S",0,1,6,0,0,0,0,0,"","Serviço","Serviço","-","COMPOSIÇÃO","COMP 190_SEE","CENTRAL DE DETECÇÃO E ALARME DE 40 SETORES COM BATERIA","UN ",1,null,null,0,""]
["S",2,"S",0,1,6,0,0,0,0,0,"","Serviço","Serviço","-","COMPOSIÇÃO","COMP 025_SEE","SINALIZADOR FOTOLUMINESCENTE DE EMERGÊNCIA","UN ",30,null,null,0,""]
["S",2,"S",0,1,6,0,0,0,0,0,"","Serviço","Serviço","-","COMPOSIÇÃO","COMP 277_SEE","MARCAÇÃO NO PISO - 1X1 M PARA EXTINTOR","M2",12,null,null,0,""]
["S",2,"S",0,1,6,0,0,0,0,0,"","Serviço","Serviço","-","COMPOSIÇÃO","COMP 040_SEE","CONJUNTO MOTOR-BOMBA ELÉTRICA TRIFÁSICO 380/220 V PARA VZ= 24,33 M³/H, HM= 46,24 M POTÊNCIA= 7,5 CV","UN ",1,null,null,0,""]
["S",2,"S",0,1,6,0,0,0,0,0,"","Serviço","Serviço","-","COMPOSIÇÃO","COMP 546_SEE","BUJÃO DE REBORDO 2.1/2\"","UN ",1,null,null,0,""]
["S",2,"S",0,1,6,0,0,0,0,0,"","Serviço","Serviço","-","COMPOSIÇÃO","COMP 549_SEE","FLANGE GALVANIZADA 2.1/2\" - FORNECIMENTO E INSTALAÇÃO","UN ",1,null,null,0,""]
[{"$f":"CHOOSE(1+LOG(1+2*(ORÇAMENTO.Nivel=\"Nível 1\")+4*(ORÇAMENTO.Nivel=\"Nível 2\")+8*(ORÇAMENTO.Nivel=\"Nível 3\")+16*(ORÇAMENTO.Nivel=\"Nível 4\")+32*(ORÇAMENTO.Nivel=\"Serviço\"),2),0,1,2,3,4,\"S\")","v":2},{"$f":"IF(OR(C96=\"s\",C96=0),OFFSET(B96,-1,0),C96)","v":2},{"$f":"IF(OFFSET(C96,-1,0)=\"L\",1,IF(OFFSET(C96,-1,0)=1,2,IF(OR(A96=\"s\",A96=0),\"S\",IF(AND(OFFSET(C96,-1,0)=2,A96=4),3,IF(AND(OR(OFFSET(C96,-1,0)=\"s\",OFFSET(C96,-1,0)=0),A96<>\"s\",A96>OFFSET(B96,-1,0)),OFFSET(B96,-1,0),A96)))))","v":2},{"$f":"IF(OR(C96=\"S\",C96=0),0,IF(ISERROR(K96),J96,SMALL(J96:K96,1)))","v":3},{"$f":"IF($C96=1,OFFSET(E96,-1,0)+1,OFFSET(E96,-1,0))","v":1},{"$f":"IF($C96=1,0,IF($C96=2,OFFSET(F96,-1,0)+1,OFFSET(F96,-1,0)))","v":7},{"$f":"IF(AND($C96<=2,$C96<>0),0,IF($C96=3,OFFSET(G96,-1,0)+1,OFFSET(G96,-1,0)))","v":0},{"$f":"IF(AND($C96<=3,$C96<>0),0,IF($C96=4,OFFSET(H96,-1,0)+1,OFFSET(H96,-1,0)))","v":0},{"$f":"IF(AND($C96<=4,$C96<>0),0,IF(AND($C96=\"S\",$W96>0),OFFSET(I96,-1,0)+1,OFFSET(I96,-1,0)))","v":0},22,3,"","Nível 2","Nível 2","-","AGETOP",91045,"ALVENARIAS E DIVISÓRIAS","Un    ",null,null,null,0,""]
["S",2,"S",0,{"$f":"IF($C97=1,OFFSET(E97,-1,0)+1,OFFSET(E97,-1,0))","v":1},{"$f":"IF($C97=1,0,IF($C97=2,OFFSET(F97,-1,0)+1,OFFSET(F97,-1,0)))","v":7},{"$f":"IF(AND($C97<=2,$C97<>0),0,IF($C97=3,OFFSET(G97,-1,0)+1,OFFSET(G97,-1,0)))","v":0},{"$f":"IF(AND($C97<=3,$C97<>0),0,IF($C97=4,OFFSET(H97,-1,0)+1,OFFSET(H97,-1,0)))","v":0},0,0,0,"","Serviço","Serviço","-","SINAPI",87520,"ALVENARIA DE VEDAÇÃO DE BLOCOS CERÂMICOS FURADOS NA HORIZONTAL DE 9X19X19CM (ESPESSURA 9CM) DE PAREDES COM ÁREA LÍQUIDA MAIOR OU IGUAL A 6M² COM VÃOS E ARGAMASSA DE ASSENTAMENTO COM PREPARO MANUAL. AF_06/2014","M2",6.13,null,null,0,"Referência: AGETOP - 100201"]
["S",2,"S",0,1,7,0,0,0,0,0,"","Serviço","Serviço","-","AGETOP",100502,"ELEMENTO VAZADO CERAMICO (6 x 18 x 18)","m2    ",3.02,null,null,0,""]
[2,{"$f":"IF(OR(C99=\"s\",C99=0),OFFSET(B99,-1,0),C99)","v":2},{"$f":"IF(OFFSET(C99,-1,0)=\"L\",1,IF(OFFSET(C99,-1,0)=1,2,IF(OR(A99=\"s\",A99=0),\"S\",IF(AND(OFFSET(C99,-1,0)=2,A99=4),3,IF(AND(OR(OFFSET(C99,-1,0)=\"s\",OFFSET(C99,-1,0)=0),A99<>\"s\",A99>OFFSET(B99,-1,0)),OFFSET(B99,-1,0),A99)))))","v":2},{"$f":"IF(OR(C99=\"S\",C99=0),0,IF(ISERROR(K99),J99,SMALL(J99:K99,1)))","v":2},1,8,0,0,0,19,2,"","Nível 2","Nível 2","-",null,null,"ESQUADRIAS METÁLICAS","-",null,null,null,0,""]
["S",2,"S",0,1,8,0,0,0,0,0,"","Serviço","Serviço","-","SINAPI","74238/2","PORTAO EM TELA ARAME GALVANIZADO N.12 MALHA 2\" E MOLDURA EM TUBOS DE ACO COM DUAS FOLHAS DE ABRIR, INCLUSO FERRAGENS","M2",2.1,null,null,0,"Referência: AGETOP - 180281"]
[2,2,2,3,1,9,0,0,0,17,3,"","Nível 2","Nível 2","-",null,null,"REVESTIMENTO DE PAREDE","-",null,null,null,0,""]
[{"$f":"CHOOSE(1+LOG(1+2*(ORÇAMENTO.Nivel=\"Nível 1\")+4*(ORÇAMENTO.Nivel=\"Nível 2\")+8*(ORÇAMENTO.Nivel=\"Nível 3\")+16*(ORÇAMENTO.Nivel=\"Nível 4\")+32*(ORÇAMENTO.Nivel=\"Serviço\"),2),0,1,2,3,4,\"S\")","v":"S"},2,"S",0,1,9,0,0,{"$f":"IF(AND($C102<=4,$C102<>0),0,IF(AND($C102=\"S\",$W102>0),OFFSET(I102,-1,0)+1,OFFSET(I102,-1,0)))","v":0},0,0,"","Serviço","Serviço","-","SINAPI",87889,"CHAPISCO APLICADO EM ALVENARIA (SEM PRESENÇA DE VÃOS) E ESTRUTURAS DE CONCRETO DE FACHADA, COM ROLO PARA TEXTURA ACRÍLICA.  ARGAMASSA TRAÇO 1:4 E EMULSÃO POLIMÉRICA (ADESIVO) COM PREPARO EM BETONEIRA 400L. AF_06/2014","M2",12.26,null,null,0,"Referência: AGETOP - 210102"]
["S",2,"S",0,{"$f":"IF($C103=1,OFFSET(E103,-1,0)+1,OFFSET(E103,-1,0))","v":1},{"$f":"IF($C103=1,0,IF($C103=2,OFFSET(F103,-1,0)+1,OFFSET(F103,-1,0)))","v":9},{"$f":"IF(AND($C103<=2,$C103<>0),0,IF($C103=3,OFFSET(G103,-1,0)+1,OFFSET(G103,-1,0)))","v":0},{"$f":"IF(AND($C103<=3,$C103<>0),0,IF($C103=4,OFFSET(H103,-1,0)+1,OFFSET(H103,-1,0)))","v":0},0,0,0,"","Serviço","Serviço","-","SINAPI",87547,"MASSA ÚNICA, PARA RECEBIMENTO DE PINTURA, EM ARGAMASSA TRAÇO 1:2:8, PREPARO MECÂNICO COM BETONEIRA 400L, APLICADA MANUALMENTE EM FACES INTERNAS DE PAREDES, ESPESSURA DE 10MM, COM EXECUÇÃO DE TALISCAS. AF_06/2014","M2",12.26,null,null,0,""]
[2,{"$f":"IF(OR(C104=\"s\",C104=0),OFFSET(B104,-1,0),C104)","v":2},{"$f":"IF(OFFSET(C104,-1,0)=\"L\",1,IF(OFFSET(C104,-1,0)=1,2,IF(OR(A104=\"s\",A104=0),\"S\",IF(AND(OFFSET(C104,-1,0)=2,A104=4),3,IF(AND(OR(OFFSET(C104,-1,0)=\"s\",OFFSET(C104,-1,0)=0),A104<>\"s\",A104>OFFSET(B104,-1,0)),OFFSET(B104,-1,0),A104)))))","v":2},{"$f":"IF(OR(C104=\"S\",C104=0),0,IF(ISERROR(K104),J104,SMALL(J104:K104,1)))","v":3},1,10,0,0,0,14,3,"","Nível 2","Nível 2","-",null,null,"REVESTIMENTO DE PISO","-",null,null,null,0,""]
["S",2,"S",0,1,10,0,0,0,0,0,"","Serviço","Serviço","-","AGETOP",221126,"PISO DE LADRILHO HIDRÁULICO COLORIDO MODELO TÁTIL ( ALERTA OU DIRECIONAL) SEM LASTRO","m2    ",110.07,null,null,0,""]
["S",2,"S",0,1,10,0,0,0,{"$f":"IF(OR($C106=\"S\",$C106=0),0,MATCH(0,OFFSET($D106,1,$C106,ROW($C$521)-ROW($C106)),0))","v":0},{"$f":"IF(OR($C106=\"S\",$C106=0),0,MATCH(OFFSET($D106,0,$C106)+1,OFFSET($D106,1,$C106,ROW($C$521)-ROW($C106)),0))","v":0},"","Serviço","Serviço","-","AGETOP",220102,"PISO CONCRETO DESEMPENADO ESPESSURA = 5 CM  1:2,5:3,5","m2    ",1.89,null,null,0,""]
[2,2,2,3,1,11,0,0,0,11,3,"","Nível 2","Nível 2","-",null,null,"ADMINISTRAÇÃO","-",null,null,null,0,""]
["S",2,"S",0,1,11,0,0,0,0,0,"","Serviço","Serviço","-","SINAPI",90778,"ENGENHEIRO CIVIL DE OBRA PLENO COM ENCARGOS COMPLEMENTARES","H",88,null,null,0,"Referência: AGETOP - 250101"]
["S",2,"S",0,1,11,0,0,0,0,0,"","Serviço","Serviço","-","SINAPI",90776,"ENCARREGADO GERAL COM ENCARGOS COMPLEMENTARES","H",440,null,null,0,"Referência: AGETOP - 250103"]
[2,2,2,4,1,12,0,0,0,8,4,"","Nível 2","Nível 2","-",null,null,"PINTURA","-",null,null,null,0,""]
["S",2,"S",0,1,12,0,0,0,{"$f":"IF(OR($C111=\"S\",$C111=0),0,MATCH(0,OFFSET($D111,1,$C111,ROW($C$521)-ROW($C111)),0))","v":0},{"$f":"IF(OR($C111=\"S\",$C111=0),0,MATCH(OFFSET($D111,0,$C111)+1,OFFSET($D111,1,$C111,ROW($C$521)-ROW($C111)),0))","v":0},"","Serviço","Serviço","-","SINAPI",88497,"APLICAÇÃO E LIXAMENTO DE MASSA LÁTEX EM PAREDES, DUAS DEMÃOS. AF_06/2014","M2",12.26,null,null,0,"Referência: AGETOP - 261300"]
[{"$f":"CHOOSE(1+LOG(1+2*(ORÇAMENTO.Nivel=\"Nível 1\")+4*(ORÇAMENTO.Nivel=\"Nível 2\")+8*(ORÇAMENTO.Nivel=\"Nível 3\")+16*(ORÇAMENTO.Nivel=\"Nível 4\")+32*(ORÇAMENTO.Nivel=\"Serviço\"),2),0,1,2,3,4,\"S\")","v":"S"},{"$f":"IF(OR(C112=\"s\",C112=0),OFFSET(B112,-1,0),C112)","v":2},{"$f":"IF(OFFSET(C112,-1,0)=\"L\",1,IF(OFFSET(C112,-1,0)=1,2,IF(OR(A112=\"s\",A112=0),\"S\",IF(AND(OFFSET(C112,-1,0)=2,A112=4),3,IF(AND(OR(OFFSET(C112,-1,0)=\"s\",OFFSET(C112,-1,0)=0),A112<>\"s\",A112>OFFSET(B112,-1,0)),OFFSET(B112,-1,0),A112)))))","v":"S"},{"$f":"IF(OR(C112=\"S\",C112=0),0,IF(ISERROR(K112),J112,SMALL(J112:K112,1)))","v":0},{"$f":"IF($C112=1,OFFSET(E112,-1,0)+1,OFFSET(E112,-1,0))","v":1},{"$f":"IF($C112=1,0,IF($C112=2,OFFSET(F112,-1,0)+1,OFFSET(F112,-1,0)))","v":12},{"$f":"IF(AND($C112<=2,$C112<>0),0,IF($C112=3,OFFSET(G112,-1,0)+1,OFFSET(G112,-1,0)))","v":0},{"$f":"IF(AND($C112<=3,$C112<>0),0,IF($C112=4,OFFSET(H112,-1,0)+1,OFFSET(H112,-1,0)))","v":0},{"$f":"IF(AND($C112<=4,$C112<>0),0,IF(AND($C112=\"S\",$W112>0),OFFSET(I112,-1,0)+1,OFFSET(I112,-1,0)))","v":0},0,0,"","Serviço","Serviço","-","SINAPI",88489,"APLICAÇÃO MANUAL DE PINTURA COM TINTA LÁTEX ACRÍLICA EM PAREDES, DUAS DEMÃOS. AF_06/2014","M2",12.26,null,null,0,"Referência: AGETOP - 261001"]
["S",2,"S",0,1,12,0,0,0,0,0,"","Serviço","Serviço","-","SINAPI","74145/1","PINTURA ESMALTE FOSCO, DUAS DEMAOS, SOBRE SUPERFICIE METALICA, INCLUSO UMA DEMAO DE FUNDO ANTICORROSIVO. UTILIZACAO DE REVOLVER ( AR-COMPRIMIDO).","M2",700.80000000000007,null,null,0,"Referência: AGETOP - 261602"]
[2,2,2,4,1,13,0,0,0,4,145,"","Nível 2","Nível 2","-",null,null,"DIVERSOS","-",null,null,null,0,""]
["S",2,"S",0,1,13,0,0,0,0,0,"","Serviço","Serviço","-","AGETOP",270501,"LIMPEZA FINAL DE OBRA - (OBRAS CIVIS)","m2    ",62,null,null,0,""]
["S",2,"S",0,1,13,0,0,0,0,0,"","Serviço","Serviço","-","AGETOP",270621,"ALAMBRADO EM TUBO INDUSTRIAL 2\"#2,28 E TELA MALHA 4\" FIO 12 (QUADRA ESPORTE EXISTENTE) SEM PINTURA","m2    ",464.4,null,null,0,""]
["S",2,"S",0,1,13,0,0,0,0,0,"","Serviço","Serviço","-","COMPOSIÇÃO","COMP 084_SEE","GUARDA-CORPO COM CORRIMÃO - SEDUC","M",49.46,null,null,0,""]
[1,1,1,38,2,0,0,0,0,403,38,"F","Nível 1","Nível 1","2.","AGETOP",271099,"CENTRAL DE GÁS","CJ    ",null,null,null,0,""]
[2,2,2,2,2,1,0,0,0,{"$f":"IF(OR($C119=\"S\",$C119=0),0,MATCH(0,OFFSET($D119,1,$C119,ROW($C$521)-ROW($C119)),0))","v":37},{"$f":"IF(OR($C119=\"S\",$C119=0),0,MATCH(OFFSET($D119,0,$C119)+1,OFFSET($D119,1,$C119,ROW($C$521)-ROW($C119)),0))","v":2},"","Nível 2","Nível 2","-","AGETOP",271101,"SERVIÇOS PRELIMINARES","CJ    ",null,null,null,0,""]
["S",2,"S",0,2,1,0,0,0,0,0,"","Serviço","Serviço","-","AGETOP",20121,"DEM. MANUAL EM CONCR.SIMPLES C/TR.ATE CB.E CARGA (O.C.)","m3    ",2.2000000000000002,null,null,0,""]
[2,2,2,2,2,2,0,0,0,35,2,"","Nível 2","Nível 2","-","SINAPI",null,"TRANSPORTES","-",null,null,null,0,""]
["S",2,"S",0,2,2,0,0,0,0,0,"","Serviço","Serviço","-","AGETOP",30105,"TRANSPORTE DE ENTULHO EM CAÇAMBA ESTACIONÁRIA  INCLUSO A CARGA MANUAL","m3    ",2.2000000000000002,null,null,0,""]
[2,2,2,3,2,3,0,0,0,33,3,"","Nível 2","Nível 2","-","SINAPI",null,"INSTALAÇÕES ELÉTRICAS","-",null,null,null,0,""]
["S",2,"S",0,2,3,0,0,0,0,0,"","Serviço","Serviço","-","AGETOP",71863,"PARAFUSO P/BUCHA S-10","Un    ",14,null,null,0,""]
["S",2,"S",0,2,3,0,0,0,0,0,"","Serviço","Serviço","-","AGETOP",70393,"BUCHA DE NYLON S-10","Un    ",14,null,null,0,""]
[2,2,2,23,2,4,0,0,0,30,23,"","Nível 2","Nível 2","-","SINAPI",null,"INSTALAÇÕES ESPECIAIS","-",null,null,null,0,""]
["S",2,"S",0,2,4,0,0,0,0,0,"","Serviço","Serviço","-","AGETOP",85003,"EXTINTOR PO QUIMICO SECO (6 KG) - CAPACIDADE EXTINTORA 20 BC","Un    ",1,null,null,0,""]
["S",2,"S",0,2,4,0,0,0,0,0,"","Serviço","Serviço","-","AGETOP",91007,"CENTRAL DE GÁS PADRÃO AGETOP SEM INSTALAÇÕES (1+1 CILINDRO 45 KG)","Un    ",1,null,null,0,""]
["S",2,"S",0,2,4,0,0,0,0,0,"","Serviço","Serviço","-","AGETOP",91023,"UNIÃO S/BRONZE PRETA 3/4\" NPT 300 LBS","Un    ",3,null,null,0,""]
["S",2,"S",0,2,4,0,0,0,0,0,"","Serviço","Serviço","-","COMPOSIÇÃO","COMP 382_SEE","TE DE REDUCAO DE FERRO GALVANIZADO, COM ROSCA BSP, DE 3/4\" X 1/2\"","UN ",1,null,null,0,""]
["S",2,"S",0,2,4,0,0,0,0,0,"","Serviço","Serviço","-","COMPOSIÇÃO","COMP 383_SEE","BUCHA DE REDUCAO DE FERRO GALVANIZADO, COM ROSCA BSP, DE 1/2\" X 1/4\"","UN ",3,null,null,0,""]
["S",2,"S",0,2,4,0,0,0,0,0,"","Serviço","Serviço","-","AGETOP",91021,"LUVA GALVANIZADO DE REDUÇÃO 3/4\" X 1/2\" (GÁS)","Un    ",2,null,null,0,""]
["S",2,"S",0,2,4,0,0,0,0,0,"","Serviço","Serviço","-","SINAPI",92692,"NIPLE, EM FERRO GALVANIZADO, CONEXÃO ROSQUEADA, DN 15 (1/2\"), INSTALADO EM RAMAIS E SUB-RAMAIS DE GÁS - FORNECIMENTO E INSTALAÇÃO. AF_12/2015","UN",3,null,null,0,""]
["S",2,"S",0,2,4,0,0,0,0,0,"","Serviço","Serviço","-","AGETOP",91031,"NIPLE DUPLO 300 PSI 3/4\"","Un    ",6,null,null,0,""]
["S",2,"S",0,2,4,0,0,0,0,0,"","Serviço","Serviço","-","SINAPI",92688,"TUBO DE AÇO GALVANIZADO COM COSTURA, CLASSE MÉDIA, CONEXÃO ROSQUEADA, DN 20 (3/4\"), INSTALADO EM RAMAIS E SUB-RAMAIS DE GÁS - FORNECIMENTO E INSTALAÇÃO. AF_12/2015","M",30,null,null,0,""]
["S",2,"S",0,2,4,0,0,0,0,0,"","Serviço","Serviço","-","SINAPI",92701,"JOELHO 90 GRAUS, EM FERRO GALVANIZADO, CONEXÃO ROSQUEADA, DN 20 (3/4\"), INSTALADO EM RAMAIS E SUB-RAMAIS DE GÁS - FORNECIMENTO E INSTALAÇÃO. AF_12/2015","UN",6,null,null,0,""]
["S",2,"S",0,2,4,0,0,0,0,0,"","Serviço","Serviço","-","COMPOSIÇÃO","COMP 237_SEE","FITA ANTICORROSIVA","M",24,null,null,0,""]
["S",2,"S",0,2,4,0,0,0,0,0,"","Serviço","Serviço","-","AGETOP",91025,"VÁLVULA ESFERICA LATÃO 3/4\"","Un    ",4,null,null,0,""]
["S",2,"S",0,2,4,0,0,0,0,0,"","Serviço","Serviço","-","COMPOSIÇÃO","COMP 210_SEE","REGULADOR DE 1º ESTÁGIO 60KG/H MODELO AP-40  COM MANÔMETRO","UN ",1,null,null,0,""]
["S",2,"S",0,2,4,0,0,0,0,0,"","Serviço","Serviço","-","AGETOP",91019,"TE PRETO 90º 3/4\" NPT 300 LBS","Un    ",1,null,null,0,""]
["S",2,"S",0,2,4,0,0,0,0,0,"","Serviço","Serviço","-","AGETOP",91029,"VALVULA DE RETENÇÃO LATÃO 1/2\" X 7/16\" NPT","Un    ",2,null,null,0,""]
["S",2,"S",0,2,4,0,0,0,0,0,"","Serviço","Serviço","-","COMPOSIÇÃO","COMP 211_SEE","REGULADOR DE 2º ESTÁGIO 5KG/H","UN ",2,null,null,0,""]
["S",2,"S",0,2,4,0,0,0,0,0,"","Serviço","Serviço","-","COMPOSIÇÃO","COMP 212_SEE","NIPLE DE REDUÇÃO 1/2\" X 1/4\" BSP","UN ",2,null,null,0,""]
["S",2,"S",0,2,4,0,0,0,0,0,"","Serviço","Serviço","-","COMPOSIÇÃO","COMP 213_SEE","NIPLE DE REDUÇÃO 3/4\" X 1/2\" BSP","UN ",1,null,null,0,""]
["S",2,"S",0,2,4,0,0,0,0,0,"","Serviço","Serviço","-","COMPOSIÇÃO","COMP 235_SEE","PLACA DE SINALIZAÇÃO EM PVC COD 01 - (300X300) PROIBIDO FUMAR","UN ",2,null,null,0,""]
["S",2,"S",0,2,4,0,0,0,0,0,"","Serviço","Serviço","-","COMPOSIÇÃO","COMP 236_SEE","PLACA DE SINALIZAÇÃO EM PVC COD 06 - (300X300) PERIGO INFLAMÁVEL","UN ",2,null,null,0,""]
["S",2,"S",0,2,4,0,0,0,0,0,"","Serviço","Serviço","-","AGETOP",91043,"BRAÇADEIRA METALICA TIPO \"D\" DIAM. 3/4\"","Un    ",7,null,null,0,""]
["S",2,"S",0,2,4,0,0,0,0,0,"","Serviço","Serviço","-","AGETOP",91045,"SUPORTE PARA COLETOR","Un    ",3,null,null,0,""]
[2,2,2,2,2,5,0,0,0,7,2,"","Nível 2","Nível 2","-","AGETOP",null,"REVESTIMENTO DE PISO","-",null,null,null,0,""]
["S",2,"S",0,2,5,0,0,0,0,0,"","Serviço","Serviço","-","AGETOP",220102,"PISO CONCRETO DESEMPENADO ESPESSURA = 5 CM  1:2,5:3,5","m2    ",4.4000000000000004,null,null,0,""]
[2,2,2,3,2,6,0,0,0,{"$f":"IF(OR($C151=\"S\",$C151=0),0,MATCH(0,OFFSET($D151,1,$C151,ROW($C$521)-ROW($C151)),0))","v":5},{"$f":"IF(OR($C151=\"S\",$C151=0),0,MATCH(OFFSET($D151,0,$C151)+1,OFFSET($D151,1,$C151,ROW($C$521)-ROW($C151)),0))","v":3},"","Nível 2","Nível 2","-","SINAPI",null,"ADMINISTRAÇÃO","-",null,null,null,0,""]
[3,3,3,2,2,6,1,0,0,2,29,"","Nível 3","Nível 3","-","AGETOP",null,"LAUDO DE ESTANQUEIDADE","-",null,null,null,0,""]
["S",3,"S",0,2,6,1,0,0,0,0,"","Serviço","Serviço","-","SINAPI",90778,"ENGENHEIRO CIVIL DE OBRA PLENO COM ENCARGOS COMPLEMENTARES","H",16,null,null,0,"Referência: AGETOP - 250101"]
[2,2,2,2,2,7,0,0,0,2,87,"","Nível 2","Nível 2","-","AGETOP",null,"DIVERSOS","-",null,null,null,0,""]
["S",2,"S",0,2,7,0,0,0,0,0,"","Serviço","Serviço","-","AGETOP",270501,"LIMPEZA FINAL DE OBRA - (OBRAS CIVIS)","m2    ",6,null,null,0,""]
[1,1,1,125,3,0,0,0,0,365,125,"F","Nível 1","Nível 1","3.","SINAPI",null,"BLOCO 1 SALA PADRÃO SEDUC 2017 - LAJE","-",null,null,null,0,""]
[2,2,2,2,3,1,0,0,0,124,2,"","Nível 2","Nível 2","-","SINAPI",null,"SERVIÇOS PRELIMINARES","-",null,null,null,0,""]
["S",2,"S",0,3,1,0,0,0,0,0,"","Serviço","Serviço","-","AGETOP",20701,"LOCAÇÃO DA OBRA, EXECUÇÃO DE GABARITO SEM REAPROVEITAMENTO, INCLUSO PINTURA (FACE INTERNA DO RIPÃO 15CM) E PIQUETE COM TESTEMUNHA","m2    ",64.260000000000005,null,null,0,""]
[2,2,2,3,3,2,0,0,0,122,3,"","Nível 2","Nível 2","-","SINAPI",null,"TRANSPORTES","-",null,null,null,0,""]
["S",2,"S",0,3,2,0,0,0,0,0,"","Serviço","Serviço","-","SINAPI",72897,"CARGA MANUAL DE ENTULHO EM CAMINHAO BASCULANTE 6 M3","M3",6,null,null,0,""]
["S",2,"S",0,3,2,0,0,0,0,0,"","Serviço","Serviço","-","SINAPI",72900,"TRANSPORTE DE ENTULHO COM CAMINHAO BASCULANTE 6 M3, RODOVIA PAVIMENTADA, DMT 0,5 A 1,0 KM","M3",6,null,null,0,""]
[2,2,2,8,3,3,0,0,0,119,8,"","Nível 2","Nível 2","-","SINAPI",null,"SERVIÇO EM TERRA","-",null,null,null,0,""]
["S",2,"S",0,3,3,0,0,0,0,0,"","Serviço","Serviço","-","SINAPI",93358,"ESCAVAÇÃO MANUAL DE VALA COM PROFUNDIDADE MENOR OU IGUAL A 1,30 M. AF_03/2016","M3",3.12,null,null,0,"Referência: AGETOP - 40101"]
["S",2,"S",0,3,3,0,0,0,0,0,"","Serviço","Serviço","-","SINAPI",96995,"REATERRO MANUAL APILOADO COM SOQUETE. AF_10/2017","M3",1.81,null,null,0,"Referência: AGETOP - 40902"]
["S",2,"S",0,3,3,0,0,0,0,0,"","Serviço","Serviço","-","SINAPI",79480,"ESCAVACAO MECANICA CAMPO ABERTO EM SOLO EXCETO ROCHA ATE 2,00M PROFUNDIDADE","M3",12,null,null,0,"Referência: AGETOP - 41004"]
["S",2,"S",0,3,3,0,0,0,0,0,"","Serviço","Serviço","-","SINAPI",72898,"CARGA E DESCARGA MECANIZADAS DE ENTULHO EM CAMINHAO BASCULANTE 6 M3","M3",12,null,null,0,"Referência: AGETOP - 41005"]
["S",2,"S",0,3,3,0,0,0,0,0,"","Serviço","Serviço","-","AGETOP",41012,"INDENIZAÇÃO DE JAZIDA","m3    ",12,null,null,0,""]
["S",2,"S",0,3,3,0,0,0,0,0,"","Serviço","Serviço","-","AGETOP",41006,"TRANSPORTE DE MATERIAL ESCAVADO M3.KM","m3km  ",120,null,null,0,""]
["S",2,"S",0,3,3,0,0,0,0,0,"","Serviço","Serviço","-","SINAPI","74005/2","COMPACTACAO MECANICA C/ CONTROLE DO GC>=95% DO PN (AREAS) (C/MONIVELADORA 140 HP E ROLO COMPRESSOR VIBRATORIO 80 HP)","M3",9.6,null,null,0,"Referência: AGETOP - 41008"]
[2,2,2,20,3,4,0,0,0,111,20,"","Nível 2","Nível 2","-","SINAPI",null,"FUNDAÇÕES E SONDAGENS","-",null,null,null,0,""]
[3,3,3,10,3,4,1,0,0,19,10,"","Nível 3","Nível 3","-","SINAPI",null,"ESTACAS E BLOCOS","-",null,null,null,0,""]
["S",3,"S",0,3,4,1,0,0,0,0,"","Serviço","Serviço","-","SINAPI",98230,"ESTACA BROCA DE CONCRETO, DIÂMETRO DE 30 CM, PROFUNDIDADE DE ATÉ 3 M, ESCAVAÇÃO MANUAL COM TRADO CONCHA, NÃO ARMADA. AF_03/2018","M",41.5,null,null,0,"Referência: AGETOP - 50302"]
["S",3,"S",0,3,4,1,0,0,0,0,"","Serviço","Serviço","-","SINAPI",96522,"ESCAVAÇÃO MANUAL PARA BLOCO DE COROAMENTO OU SAPATA, SEM PREVISÃO DE FÔRMA. AF_06/2017","M3",3.12,null,null,0,"Referência: AGETOP - 50901"]
["S",3,"S",0,3,4,1,0,0,0,0,"","Serviço","Serviço","-","SINAPI",96995,"REATERRO MANUAL APILOADO COM SOQUETE. AF_10/2017","M3",1.75,null,null,0,"Referência: AGETOP - 40902"]
["S",3,"S",0,3,4,1,0,0,0,0,"","Serviço","Serviço","-","SINAPI",94963,"CONCRETO FCK = 15MPA, TRAÇO 1:3,4:3,5 (CIMENTO/ AREIA MÉDIA/ BRITA 1)  - PREPARO MECÂNICO COM BETONEIRA 400 L. AF_07/2016","M3",1.36,null,null,0,""]
["S",3,"S",0,3,4,1,0,0,0,0,"","Serviço","Serviço","-","SINAPI","74157/4","LANCAMENTO/APLICACAO MANUAL DE CONCRETO EM FUNDACOES","M3",1.37,null,null,0,"Referência: AGETOP - 51055"]
["S",3,"S",0,3,4,1,0,0,0,0,"","Serviço","Serviço","-","SINAPI",96544,"ARMAÇÃO DE BLOCO, VIGA BALDRAME OU SAPATA UTILIZANDO AÇO CA-50 DE 6,3 MM - MONTAGEM. AF_06/2017","KG",19.09,null,null,0,"Referência: AGETOP - 52003"]
["S",3,"S",0,3,4,1,0,0,0,0,"","Serviço","Serviço","-","SINAPI",96545,"ARMAÇÃO DE BLOCO, VIGA BALDRAME OU SAPATA UTILIZANDO AÇO CA-50 DE 8 MM - MONTAGEM. AF_06/2017","KG",62.73,null,null,0,"Referência: AGETOP - 52004"]
["S",3,"S",0,3,4,1,0,0,0,0,"","Serviço","Serviço","-","SINAPI",96546,"ARMAÇÃO DE BLOCO, VIGA BALDRAME OU SAPATA UTILIZANDO AÇO CA-50 DE 10 MM - MONTAGEM. AF_06/2017","KG",11.82,null,null,0,"Referência: AGETOP - 52005"]
["S",3,"S",0,3,4,1,0,0,0,0,"","Serviço","Serviço","-","SINAPI",96543,"ARMAÇÃO DE BLOCO, VIGA BALDRAME E SAPATA UTILIZANDO AÇO CA-60 DE 5 MM - MONTAGEM. AF_06/2017","KG",16.36,null,null,0,"Referência: AGETOP - 52014"]
[3,3,3,9,3,4,2,0,0,9,24,"","Nível 3","Nível 3","-","SINAPI",null,"VIGAS BALDRAMES","-",null,null,null,0,""]
["S",3,"S",0,3,4,2,0,0,0,0,"","Serviço","Serviço","-","SINAPI",96527,"ESCAVAÇÃO MANUAL DE VALA PARA VIGA BALDRAME, COM PREVISÃO DE FÔRMA. AF_06/2017","M3",3.9899999999999998,null,null,0,"Referência: AGETOP - 40101"]
["S",3,"S",0,3,4,2,0,0,{"$f":"IF(OR($C183=\"S\",$C183=0),0,MATCH(0,OFFSET($D183,1,$C183,ROW($C$521)-ROW($C183)),0))","v":0},{"$f":"IF(OR($C183=\"S\",$C183=0),0,MATCH(OFFSET($D183,0,$C183)+1,OFFSET($D183,1,$C183,ROW($C$521)-ROW($C183)),0))","v":0},"","Serviço","Serviço","-","SINAPI",96995,"REATERRO MANUAL APILOADO COM SOQUETE. AF_10/2017","M3",2.25,null,null,0,"Referência: AGETOP - 40902"]
["S",3,"S",0,3,4,2,0,0,0,0,"","Serviço","Serviço","-","AGETOP",60191,"FORMA DE TABUA CINTA BALDRAME U=8 VEZES","m2    ",30.65,null,null,0,""]
["S",3,"S",0,3,4,2,0,0,0,0,"","Serviço","Serviço","-","SINAPI",94963,"CONCRETO FCK = 15MPA, TRAÇO 1:3,4:3,5 (CIMENTO/ AREIA MÉDIA/ BRITA 1)  - PREPARO MECÂNICO COM BETONEIRA 400 L. AF_07/2016","M3",1.74,null,null,0,""]
["S",3,"S",0,3,4,2,0,0,0,0,"","Serviço","Serviço","-","SINAPI","74157/4","LANCAMENTO/APLICACAO MANUAL DE CONCRETO EM FUNDACOES","M3",1.74,null,null,0,"Referência: AGETOP - 51055"]
["S",3,"S",0,3,4,2,0,0,0,0,"","Serviço","Serviço","-","SINAPI",96545,"ARMAÇÃO DE BLOCO, VIGA BALDRAME OU SAPATA UTILIZANDO AÇO CA-50 DE 8 MM - MONTAGEM. AF_06/2017","KG",51.82,null,null,0,"Referência: AGETOP - 52004"]
["S",3,"S",0,3,4,2,0,0,0,0,"","Serviço","Serviço","-","SINAPI",96546,"ARMAÇÃO DE BLOCO, VIGA BALDRAME OU SAPATA UTILIZANDO AÇO CA-50 DE 10 MM - MONTAGEM. AF_06/2017","KG",24.54,null,null,0,"Referência: AGETOP - 52005"]
["S",3,"S",0,3,4,2,0,0,0,0,"","Serviço","Serviço","-","SINAPI",96543,"ARMAÇÃO DE BLOCO, VIGA BALDRAME E SAPATA UTILIZANDO AÇO CA-60 DE 5 MM - MONTAGEM. AF_06/2017","KG",40,null,null,0,"Referência: AGETOP - 52014"]
[2,2,2,19,3,5,0,0,0,91,19,"","Nível 2","Nível 2","-","SINAPI",null,"ESTRUTURA","-",null,null,null,0,""]
[3,3,3,6,3,5,1,0,0,18,6,"","Nível 3","Nível 3","-","SINAPI",null,"PILARES","-",null,null,null,0,""]
["S",3,"S",0,3,5,1,0,0,0,0,"","Serviço","Serviço","-","SINAPI",92426,"MONTAGEM E DESMONTAGEM DE FÔRMA DE PILARES RETANGULARES E ESTRUTURAS SIMILARES COM ÁREA MÉDIA DAS SEÇÕES MENOR OU IGUAL A 0,25 M², PÉ-DIREITO SIMPLES, EM CHAPA DE MADEIRA COMPENSADA RESINADA, 8 UTILIZAÇÕES. AF_12/2015","M2",16.37,null,null,0,""]
["S",3,"S",0,3,5,1,0,0,0,0,"","Serviço","Serviço","-","SINAPI",94964,"CONCRETO FCK = 20MPA, TRAÇO 1:2,7:3 (CIMENTO/ AREIA MÉDIA/ BRITA 1)  - PREPARO MECÂNICO COM BETONEIRA 400 L. AF_07/2016","M3",0.79,null,null,0,""]
["S",3,"S",0,3,5,1,0,0,0,0,"","Serviço","Serviço","-","SINAPI",92873,"LANÇAMENTO COM USO DE BALDES, ADENSAMENTO E ACABAMENTO DE CONCRETO EM ESTRUTURAS. AF_12/2015","M3",0.79,null,null,0,"Referência: AGETOP - 60801"]
["S",3,"S",0,3,5,1,0,0,0,0,"","Serviço","Serviço","-","SINAPI",92778,"ARMAÇÃO DE PILAR OU VIGA DE UMA ESTRUTURA CONVENCIONAL DE CONCRETO ARMADO EM UMA EDIFICAÇÃO TÉRREA OU SOBRADO UTILIZANDO AÇO CA-50 DE 10,0 MM - MONTAGEM. AF_12/2015","KG",70,null,null,0,"Referência: AGETOP - 60305"]
["S",3,"S",0,3,5,1,0,0,0,0,"","Serviço","Serviço","-","SINAPI",92775,"ARMAÇÃO DE PILAR OU VIGA DE UMA ESTRUTURA CONVENCIONAL DE CONCRETO ARMADO EM UMA EDIFICAÇÃO TÉRREA OU SOBRADO UTILIZANDO AÇO CA-60 DE 5,0 MM - MONTAGEM. AF_12/2015","KG",24.55,null,null,0,"Referência: AGETOP - 60314"]
[3,3,3,8,3,5,2,0,0,12,8,"","Nível 3","Nível 3","-","SINAPI",null,"VIGAS DE COBERTURA","-",null,null,null,0,""]
["S",3,"S",0,3,5,2,0,0,0,0,"","Serviço","Serviço","-","SINAPI",92464,"MONTAGEM E DESMONTAGEM DE FÔRMA DE VIGA, ESCORAMENTO METÁLICO, PÉ-DIREITO SIMPLES, EM CHAPA DE MADEIRA RESINADA, 8 UTILIZAÇÕES. AF_12/2015","M2",27.32,null,null,0,"Referência: AGETOP - 60209"]
["S",3,"S",0,3,5,2,0,0,0,0,"","Serviço","Serviço","-","SINAPI",94964,"CONCRETO FCK = 20MPA, TRAÇO 1:2,7:3 (CIMENTO/ AREIA MÉDIA/ BRITA 1)  - PREPARO MECÂNICO COM BETONEIRA 400 L. AF_07/2016","M3",1.63,null,null,0,""]
["S",3,"S",0,3,5,2,0,0,0,0,"","Serviço","Serviço","-","SINAPI",92873,"LANÇAMENTO COM USO DE BALDES, ADENSAMENTO E ACABAMENTO DE CONCRETO EM ESTRUTURAS. AF_12/2015","M3",1.63,null,null,0,"Referência: AGETOP - 60801"]
["S",3,"S",0,3,5,2,0,0,0,0,"","Serviço","Serviço","-","SINAPI",92777,"ARMAÇÃO DE PILAR OU VIGA DE UMA ESTRUTURA CONVENCIONAL DE CONCRETO ARMADO EM UMA EDIFICAÇÃO TÉRREA OU SOBRADO UTILIZANDO AÇO CA-50 DE 8,0 MM - MONTAGEM. AF_12/2015","KG",5.45,null,null,0,"Referência: AGETOP - 60304"]
["S",3,"S",0,3,5,2,0,0,0,0,"","Serviço","Serviço","-","SINAPI",92778,"ARMAÇÃO DE PILAR OU VIGA DE UMA ESTRUTURA CONVENCIONAL DE CONCRETO ARMADO EM UMA EDIFICAÇÃO TÉRREA OU SOBRADO UTILIZANDO AÇO CA-50 DE 10,0 MM - MONTAGEM. AF_12/2015","KG",76.36,null,null,0,"Referência: AGETOP - 60305"]
["S",3,"S",0,3,5,2,0,0,0,0,"","Serviço","Serviço","-","SINAPI",92779,"ARMAÇÃO DE PILAR OU VIGA DE UMA ESTRUTURA CONVENCIONAL DE CONCRETO ARMADO EM UMA EDIFICAÇÃO TÉRREA OU SOBRADO UTILIZANDO AÇO CA-50 DE 12,5 MM - MONTAGEM. AF_12/2015","KG",19.09,null,null,0,""]
["S",3,"S",0,3,5,2,0,0,0,0,"","Serviço","Serviço","-","SINAPI",92775,"ARMAÇÃO DE PILAR OU VIGA DE UMA ESTRUTURA CONVENCIONAL DE CONCRETO ARMADO EM UMA EDIFICAÇÃO TÉRREA OU SOBRADO UTILIZANDO AÇO CA-60 DE 5,0 MM - MONTAGEM. AF_12/2015","KG",27.27,null,null,0,"Referência: AGETOP - 60314"]
[3,3,3,2,3,5,3,0,0,4,2,"","Nível 3","Nível 3","-","SINAPI",null,"LAJE","-",null,null,null,0,""]
["S",3,"S",0,3,5,3,0,0,0,0,"","Serviço","Serviço","-","SINAPI","74202/1","LAJE PRE-MOLDADA P/FORRO, SOBRECARGA 100KG/M2, VAOS ATE 3,50M/E=8CM, C/LAJOTAS E CAP.C/CONC FCK=20MPA, 3CM, INTER-EIXO 38CM, C/ESCORAMENTO (REAPR.3X) E FERRAGEM NEGATIVA","M2",52.78,null,null,0,""]
[3,3,3,2,3,5,4,0,0,2,124,"","Nível 3","Nível 3","-","SINAPI",null,"EXTRAS","-",null,null,null,0,""]
["S",3,"S",0,3,5,4,0,0,0,0,"","Serviço","Serviço","-","SINAPI","74022/30","ENSAIO DE RESISTENCIA A COMPRESSAO SIMPLES - CONCRETO","UN",6,null,null,0,"Referência: AGETOP - 50251"]
[2,2,2,29,3,6,0,0,0,72,29,"","Nível 2","Nível 2","-","SINAPI",null,"INSTALAÇÕES ELÉTRICAS","-",null,null,null,0,""]
["S",2,"S",0,3,6,0,0,0,0,0,"","Serviço","Serviço","-","AGETOP",70351,"BRACADEIRA METALICA TIPO \"U\" DIAM. 3/4\"","Un    ",15,null,null,0,""]
["S",2,"S",0,3,6,0,0,0,0,0,"","Serviço","Serviço","-","AGETOP",70352,"BRACADEIRA METALICA TIPO \"U\" DIAM. 1\"","Un    ",5,null,null,0,""]
["S",2,"S",0,3,6,0,0,0,0,0,"","Serviço","Serviço","-","AGETOP",70391,"BUCHA DE NYLON S-6","Un    ",100,null,null,0,""]
["S",2,"S",0,3,6,0,0,0,0,0,"","Serviço","Serviço","-","AGETOP",70421,"BUCHA E ARRUELA METALICA DIAM. 3/4\"","PR    ",15,null,null,0,""]
["S",2,"S",0,3,6,0,0,0,0,0,"","Serviço","Serviço","-","AGETOP",70422,"BUCHA E ARRUELA METALICA DIAM. 1\"","PR    ",5,null,null,0,""]
["S",2,"S",0,3,6,0,0,0,{"$f":"IF(OR($C215=\"S\",$C215=0),0,MATCH(0,OFFSET($D215,1,$C215,ROW($C$521)-ROW($C215)),0))","v":0},{"$f":"IF(OR($C215=\"S\",$C215=0),0,MATCH(OFFSET($D215,0,$C215)+1,OFFSET($D215,1,$C215,ROW($C$521)-ROW($C215)),0))","v":0},"","Serviço","Serviço","-","SINAPI",91927,"CABO DE COBRE FLEXÍVEL ISOLADO, 2,5 MM², ANTI-CHAMA 0,6/1,0 KV, PARA CIRCUITOS TERMINAIS - FORNECIMENTO E INSTALAÇÃO. AF_12/2015","M",220,null,null,0,"Referência: AGETOP - 70581"]
["S",2,"S",0,3,6,0,0,0,0,0,"","Serviço","Serviço","-","SINAPI",91929,"CABO DE COBRE FLEXÍVEL ISOLADO, 4 MM², ANTI-CHAMA 0,6/1,0 KV, PARA CIRCUITOS TERMINAIS - FORNECIMENTO E INSTALAÇÃO. AF_12/2015","M",152,null,null,0,"Referência: AGETOP - 70582"]
["S",2,"S",0,3,6,0,0,0,0,0,"","Serviço","Serviço","-","SINAPI",83446,"CAIXA DE PASSAGEM 30X30X40 COM TAMPA E DRENO BRITA","UN",1,null,null,0,""]
["S",2,"S",0,3,6,0,0,0,0,0,"","Serviço","Serviço","-","SINAPI",91936,"CAIXA OCTOGONAL 4\" X 4\", PVC, INSTALADA EM LAJE - FORNECIMENTO E INSTALAÇÃO. AF_12/2015","UN",6,null,null,0,""]
["S",2,"S",0,3,6,0,0,0,0,0,"","Serviço","Serviço","-","SINAPI",92867,"CAIXA RETANGULAR 4\" X 2\" ALTA (2,00 M DO PISO), METÁLICA, INSTALADA EM PAREDE - FORNECIMENTO E INSTALAÇÃO. AF_12/2015","UN",2,null,null,0,""]
["S",2,"S",0,3,6,0,0,0,0,0,"","Serviço","Serviço","-","SINAPI",92867,"CAIXA RETANGULAR 4\" X 2\" ALTA (2,00 M DO PISO), METÁLICA, INSTALADA EM PAREDE - FORNECIMENTO E INSTALAÇÃO. AF_12/2015","UN",2,null,null,0,""]
["S",2,"S",0,3,6,0,0,0,0,0,"","Serviço","Serviço","-","SINAPI",92869,"CAIXA RETANGULAR 4\" X 2\" BAIXA (0,30 M DO PISO), METÁLICA, INSTALADA EM PAREDE - FORNECIMENTO E INSTALAÇÃO. AF_12/2015","UN",3,null,null,0,""]
["S",2,"S",0,3,6,0,0,0,0,0,"","Serviço","Serviço","-","SINAPI",91914,"CURVA 90 GRAUS PARA ELETRODUTO, PVC, ROSCÁVEL, DN 25 MM (3/4\"), PARA CIRCUITOS TERMINAIS, INSTALADA EM PAREDE - FORNECIMENTO E INSTALAÇÃO. AF_12/2015","UN",3,null,null,0,""]
["S",2,"S",0,3,6,0,0,0,0,0,"","Serviço","Serviço","-","SINAPI",93654,"DISJUNTOR MONOPOLAR TIPO DIN, CORRENTE NOMINAL DE 16A - FORNECIMENTO E INSTALAÇÃO. AF_04/2016","UN",2,null,null,0,""]
["S",2,"S",0,3,6,0,0,0,0,0,"","Serviço","Serviço","-","SINAPI",93656,"DISJUNTOR MONOPOLAR TIPO DIN, CORRENTE NOMINAL DE 25A - FORNECIMENTO E INSTALAÇÃO. AF_04/2016","UN",2,null,null,0,""]
["S",2,"S",0,3,6,0,0,0,0,0,"","Serviço","Serviço","-","SINAPI",93671,"DISJUNTOR TRIPOLAR TIPO DIN, CORRENTE NOMINAL DE 32A - FORNECIMENTO E INSTALAÇÃO. AF_04/2016","UN",1,null,null,0,"Referência: AGETOP - 71173"]
["S",2,"S",0,3,6,0,0,0,0,0,"","Serviço","Serviço","-","SINAPI",91871,"ELETRODUTO RÍGIDO ROSCÁVEL, PVC, DN 25 MM (3/4\"), PARA CIRCUITOS TERMINAIS, INSTALADO EM PAREDE - FORNECIMENTO E INSTALAÇÃO. AF_12/2015","M",45,null,null,0,"Referência: AGETOP - 71201"]
["S",2,"S",0,3,6,0,0,0,0,0,"","Serviço","Serviço","-","SINAPI",91872,"ELETRODUTO RÍGIDO ROSCÁVEL, PVC, DN 32 MM (1\"), PARA CIRCUITOS TERMINAIS, INSTALADO EM PAREDE - FORNECIMENTO E INSTALAÇÃO. AF_12/2015","M",15,null,null,0,"Referência: AGETOP - 71202"]
["S",2,"S",0,3,6,0,0,0,0,0,"","Serviço","Serviço","-","SINAPI",91953,"INTERRUPTOR SIMPLES (1 MÓDULO), 10A/250V, INCLUINDO SUPORTE E PLACA - FORNECIMENTO E INSTALAÇÃO. AF_12/2015","UN",2,null,null,0,"Referência: AGETOP - 71440"]
["S",2,"S",0,3,6,0,0,0,0,0,"","Serviço","Serviço","-","SINAPI",97610,"LÂMPADA COMPACTA DE LED 10 W, BASE E27 - FORNECIMENTO E INSTALAÇÃO. AF_11/2017","UN",15,null,null,0,""]
["S",2,"S",0,3,6,0,0,0,0,0,"","Serviço","Serviço","-","SINAPI",97591,"LUMINÁRIA TIPO PLAFON REDONDO COM VIDRO FOSCO, DE SOBREPOR, COM 2 LÂMPADAS DE 15 W - FORNECIMENTO E INSTALAÇÃO. AF_11/2017","UN",6,null,null,0,""]
["S",2,"S",0,3,6,0,0,0,0,0,"","Serviço","Serviço","-","SINAPI",97593,"LUMINÁRIA TIPO SPOT, DE SOBREPOR, COM 1 LÂMPADA DE 15 W - FORNECIMENTO E INSTALAÇÃO. AF_11/2017","UN",3,null,null,0,"Referência: AGETOP - 71688"]
["S",2,"S",0,3,6,0,0,0,0,0,"","Serviço","Serviço","-","SINAPI",91884,"LUVA PARA ELETRODUTO, PVC, ROSCÁVEL, DN 25 MM (3/4\"), PARA CIRCUITOS TERMINAIS, INSTALADA EM PAREDE - FORNECIMENTO E INSTALAÇÃO. AF_12/2015","UN",15,null,null,0,"Referência: AGETOP - 71741"]
["S",2,"S",0,3,6,0,0,0,0,0,"","Serviço","Serviço","-","SINAPI",91885,"LUVA PARA ELETRODUTO, PVC, ROSCÁVEL, DN 32 MM (1\"), PARA CIRCUITOS TERMINAIS, INSTALADA EM PAREDE - FORNECIMENTO E INSTALAÇÃO. AF_12/2015","UN",5,null,null,0,"Referência: AGETOP - 71742"]
["S",2,"S",0,3,6,0,0,0,0,0,"","Serviço","Serviço","-","AGETOP",71861,"PARAFUSO P/BUCHA S-6","Un    ",100,null,null,0,""]
["S",2,"S",0,3,6,0,0,0,0,0,"","Serviço","Serviço","-","SINAPI",83463,"QUADRO DE DISTRIBUICAO DE ENERGIA EM CHAPA DE ACO GALVANIZADO, PARA 12 DISJUNTORES TERMOMAGNETICOS MONOPOLARES, COM BARRAMENTO TRIFASICO E NEUTRO - FORNECIMENTO E INSTALACAO","UN",1,null,null,0,""]
["S",2,"S",0,3,6,0,0,0,0,0,"","Serviço","Serviço","-","SINAPI",91996,"TOMADA MÉDIA DE EMBUTIR (1 MÓDULO), 2P+T 10 A, INCLUINDO SUPORTE E PLACA - FORNECIMENTO E INSTALAÇÃO. AF_12/2015","UN",3,null,null,0,"Referência: AGETOP - 72578"]
["S",2,"S",0,3,6,0,0,0,0,0,"","Serviço","Serviço","-","SINAPI",91993,"TOMADA ALTA DE EMBUTIR (1 MÓDULO), 2P+T 20 A, INCLUINDO SUPORTE E PLACA - FORNECIMENTO E INSTALAÇÃO. AF_12/2015","UN",2,null,null,0,"Referência: AGETOP - 72585"]
[2,2,2,3,3,7,0,0,0,43,3,"","Nível 2","Nível 2","-","AGETOP",null,"ALVENARIAS E DIVISÓRIAS","-",null,null,null,0,""]
["S",2,"S",0,3,7,0,0,0,0,0,"","Serviço","Serviço","-","SINAPI",87503,"ALVENARIA DE VEDAÇÃO DE BLOCOS CERÂMICOS FURADOS NA HORIZONTAL DE 9X19X19CM (ESPESSURA 9CM) DE PAREDES COM ÁREA LÍQUIDA MAIOR OU IGUAL A 6M² SEM VÃOS E ARGAMASSA DE ASSENTAMENTO COM PREPARO EM BETONEIRA. AF_06/2014","M2",82.06,null,null,0,"Referência: AGETOP - 100201"]
["S",2,"S",0,3,7,0,0,0,0,0,"","Serviço","Serviço","-","SINAPI",93201,"FIXAÇÃO (ENCUNHAMENTO) DE ALVENARIA DE VEDAÇÃO COM ARGAMASSA APLICADA COM COLHER. AF_03/2016","M",27.9,null,null,0,""]
[2,2,2,2,3,8,0,0,0,40,2,"","Nível 2","Nível 2","-",null,null,"IMPERMEABILIZAÇÃO","-",null,null,null,0,""]
["S",2,"S",0,3,8,0,0,0,0,0,"","Serviço","Serviço","-","SINAPI","74106/1","IMPERMEABILIZACAO DE ESTRUTURAS ENTERRADAS, COM TINTA ASFALTICA, DUAS DEMAOS.","M2",22.8,null,null,0,""]
[2,2,2,2,3,9,0,0,0,38,2,"","Nível 2","Nível 2","-",null,null,"ESTRUTURAS METÁLICAS","-",null,null,null,0,""]
["S",2,"S",0,3,9,0,0,0,0,0,"","Serviço","Serviço","-","AGETOP",150103,"ESTRUTURA METÁLICA CONVENCIONAL EM AÇO DO TIPO USI SAC-300 COM FUNDO ANTICORROSIVO","Kg    ",1291.08,null,null,0,""]
[2,2,2,4,3,10,0,0,0,36,4,"","Nível 2","Nível 2","-",null,null,"COBERTURAS","-",null,null,null,0,""]
["S",2,"S",0,3,10,0,0,0,0,0,"","Serviço","Serviço","-","SINAPI",94445,"TELHAMENTO COM TELHA CERÂMICA CAPA-CANAL, TIPO PLAN, COM ATÉ 2 ÁGUAS, INCLUSO TRANSPORTE VERTICAL. AF_06/2016","M2",88.69,null,null,0,"Referência: AGETOP - 160401"]
["S",2,"S",0,3,10,0,0,0,0,0,"","Serviço","Serviço","-","SINAPI",94221,"CUMEEIRA PARA TELHA CERÂMICA EMBOÇADA COM ARGAMASSA TRAÇO 1:2:9 (CIMENTO, CAL E AREIA) PARA TELHADOS COM ATÉ 2 ÁGUAS, INCLUSO TRANSPORTE VERTICAL. AF_06/2016","M",9.0500000000000007,null,null,0,""]
["S",2,"S",0,3,10,0,0,0,0,0,"","Serviço","Serviço","-","SINAPI",94224,"EMBOÇAMENTO COM ARGAMASSA TRAÇO 1:2:9 (CIMENTO, CAL E AREIA). AF_06/2016","M",37.700000000000003,null,null,0,"Referência: AGETOP - 160403"]
[2,2,2,4,3,11,0,0,0,32,4,"","Nível 2","Nível 2","-",null,null,"ESQUADRIAS METÁLICAS","-",null,null,null,0,""]
["S",2,"S",0,3,11,0,0,0,0,0,"","Serviço","Serviço","-","SINAPI",94562,"JANELA DE AÇO DE CORRER, 4 FOLHAS, FIXAÇÃO COM ARGAMASSA, SEM VIDROS, PADRONIZADA. AF_07/2016","M2",4.8,null,null,0,"Referência: AGETOP - 180401"]
["S",2,"S",0,3,11,0,0,0,0,0,"","Serviço","Serviço","-","SINAPI",94559,"JANELA DE AÇO BASCULANTE, FIXAÇÃO COM ARGAMASSA, SEM VIDROS, PADRONIZADA. AF_07/2016","M2",2.4,null,null,0,"Referência: AGETOP - 180404"]
["S",2,"S",0,3,11,0,0,0,0,0,"","Serviço","Serviço","-","SINAPI","73933/4","PORTA DE FERRO DE ABRIR TIPO BARRA CHATA, COM REQUADRO E GUARNICAO COMPLETA","M2",1.6800000000000002,null,null,0,"Referência: AGETOP - 180501"]
[2,2,2,2,3,12,0,0,0,28,2,"","Nível 2","Nível 2","-",null,null,"VIDROS","-",null,null,null,0,""]
["S",2,"S",0,3,12,0,0,0,0,0,"","Serviço","Serviço","-","SINAPI",72117,"VIDRO LISO COMUM TRANSPARENTE, ESPESSURA 4MM","M2",7.1999999999999993,null,null,0,"Referência: AGETOP - 190102"]
[2,2,2,4,3,13,0,0,0,26,4,"","Nível 2","Nível 2","-",null,null,"REVESTIMENTO DE PAREDE","-",null,null,null,0,""]
["S",2,"S",0,3,13,0,0,0,0,0,"","Serviço","Serviço","-","SINAPI",87879,"CHAPISCO APLICADO EM ALVENARIAS E ESTRUTURAS DE CONCRETO INTERNAS, COM COLHER DE PEDREIRO.  ARGAMASSA TRAÇO 1:3 COM PREPARO EM BETONEIRA 400L. AF_06/2014","M2",164.14,null,null,0,""]
["S",2,"S",0,3,13,0,0,0,0,0,"","Serviço","Serviço","-","SINAPI",87548,"MASSA ÚNICA, PARA RECEBIMENTO DE PINTURA, EM ARGAMASSA TRAÇO 1:2:8, PREPARO MANUAL, APLICADA MANUALMENTE EM FACES INTERNAS DE PAREDES, ESPESSURA DE 10MM, COM EXECUÇÃO DE TALISCAS. AF_06/2014","M2",164.14,null,null,0,"Referência: AGETOP - 200500"]
["S",2,"S",0,3,13,0,0,0,0,0,"","Serviço","Serviço","-","SINAPI",84088,"PEITORIL EM MARMORE BRANCO, LARGURA DE 15CM, ASSENTADO COM ARGAMASSA TRACO 1:4 (CIMENTO E AREIA MEDIA), PREPARO MANUAL DA ARGAMASSA","M",8,null,null,0,""]
[2,2,2,2,3,14,0,0,0,22,2,"","Nível 2","Nível 2","-",null,null,"FORROS","-",null,null,null,0,""]
["S",2,"S",0,3,14,0,0,0,0,0,"","Serviço","Serviço","-","SINAPI",87414,"APLICAÇÃO MANUAL DE GESSO DESEMPENADO (SEM TALISCAS) EM TETO DE AMBIENTES DE ÁREA MAIOR QUE 10M², ESPESSURA DE 1,0CM. AF_06/2014","M2",48.51,null,null,0,"Referência: AGETOP - 210515"]
[2,2,2,5,3,15,0,0,0,20,5,"","Nível 2","Nível 2","-","SINAPI",null,"REVESTIMENTO DE PISO","-",null,null,null,0,""]
["S",2,"S",0,3,15,0,0,0,0,0,"","Serviço","Serviço","-","SINAPI",95240,"LASTRO DE CONCRETO MAGRO, APLICADO EM PISOS OU RADIERS, ESPESSURA DE 3 CM. AF_07/2016","M2",84.96,null,null,0,""]
["S",2,"S",0,3,15,0,0,0,0,0,"","Serviço","Serviço","-","SINAPI",94992,"EXECUÇÃO DE PASSEIO (CALÇADA) OU PISO DE CONCRETO COM CONCRETO MOLDADO IN LOCO, FEITO EM OBRA, ACABAMENTO CONVENCIONAL, ESPESSURA 6 CM, ARMADO. AF_07/2016","M2",20.699999999999989,null,null,0,""]
["S",2,"S",0,3,15,0,0,0,0,0,"","Serviço","Serviço","-","SINAPI",84191,"PISO EM GRANILITE, MARMORITE OU GRANITINA ESPESSURA 8 MM, INCLUSO JUNTAS DE DILATACAO PLASTICAS","M2",59.98,null,null,0,"Referência: AGETOP - 221101"]
["S",2,"S",0,3,15,0,0,0,0,0,"","Serviço","Serviço","-","AGETOP",221104,"RASPAGEM E APLICAÇÃO RESINA ACRÍLICA DUAS DEMÃOS","m2    ",62.34,null,null,0,""]
[2,2,2,2,3,16,0,0,0,15,2,"","Nível 2","Nível 2","-","SINAPI",null,"MARCENARIA","-",null,null,null,0,""]
["S",2,"S",0,3,16,0,0,0,0,0,"","Serviço","Serviço","-","AGETOP",240106,"BATE CARTEIRA ENVERNIZADO E ASSENT. 2,5 X 12 CM","M     ",20.32,null,null,0,""]
[2,2,2,10,3,17,0,0,0,13,10,"","Nível 2","Nível 2","-","SINAPI",null,"PINTURA","-",null,null,null,0,""]
["S",2,"S",0,3,17,0,0,0,0,0,"","Serviço","Serviço","-","SINAPI","74145/1","PINTURA ESMALTE FOSCO, DUAS DEMAOS, SOBRE SUPERFICIE METALICA, INCLUSO UMA DEMAO DE FUNDO ANTICORROSIVO. UTILIZACAO DE REVOLVER ( AR-COMPRIMIDO).","M2",177.38,null,null,0,"Referência: AGETOP - 261602"]
["S",2,"S",0,3,17,0,0,0,0,0,"","Serviço","Serviço","-","SINAPI",88423,"APLICAÇÃO MANUAL DE PINTURA COM TINTA TEXTURIZADA ACRÍLICA EM PAREDES EXTERNAS DE CASAS, UMA COR. AF_06/2014","M2",71.59,null,null,0,"Referência: AGETOP - 260601"]
["S",2,"S",0,3,17,0,0,0,0,0,"","Serviço","Serviço","-","SINAPI",88489,"APLICAÇÃO MANUAL DE PINTURA COM TINTA LÁTEX ACRÍLICA EM PAREDES, DUAS DEMÃOS. AF_06/2014","M2",50.55,null,null,0,"Referência: AGETOP - 261001"]
["S",2,"S",0,3,17,0,0,0,0,0,"","Serviço","Serviço","-","SINAPI",88497,"APLICAÇÃO E LIXAMENTO DE MASSA LÁTEX EM PAREDES, DUAS DEMÃOS. AF_06/2014","M2",97.860000000000014,null,null,0,"Referência: AGETOP - 261300"]
["S",2,"S",0,3,17,0,0,0,0,0,"","Serviço","Serviço","-","AGETOP",261550,"PINT.ESMALTE SINT.PAREDES - 2 DEM.C/SELADOR","m2    ",47.31,null,null,0,""]
["S",2,"S",0,3,17,0,0,0,0,0,"","Serviço","Serviço","-","SINAPI",88496,"APLICAÇÃO E LIXAMENTO DE MASSA LÁTEX EM TETO, DUAS DEMÃOS. AF_06/2014","M2",48.51,null,null,0,"Referência: AGETOP - 261300"]
["S",2,"S",0,3,17,0,0,0,0,0,"","Serviço","Serviço","-","SINAPI",88486,"APLICAÇÃO MANUAL DE PINTURA COM TINTA LÁTEX PVA EM TETO, DUAS DEMÃOS. AF_06/2014","M2",48.51,null,null,0,"Referência: AGETOP - 261307"]
["S",2,"S",0,3,17,0,0,0,0,0,"","Serviço","Serviço","-","SINAPI","74145/1","PINTURA ESMALTE FOSCO, DUAS DEMAOS, SOBRE SUPERFICIE METALICA, INCLUSO UMA DEMAO DE FUNDO ANTICORROSIVO. UTILIZACAO DE REVOLVER ( AR-COMPRIMIDO).","M2",17.759999999999998,null,null,0,"Referência: AGETOP - 261602"]
["S",2,"S",0,3,17,0,0,0,0,0,"","Serviço","Serviço","-","AGETOP",261623,"LETREIRO PEQ.PORTE A PINCEL EM PAREDE E PORTAS","m2    ",0.32,null,null,0,""]
[2,2,2,3,3,18,0,0,0,3,{"$error":"#N/A"},"","Nível 2","Nível 2","-","SINAPI",null,"DIVERSOS","-",null,null,null,0,""]
["S",2,"S",0,3,18,0,0,0,{"$f":"IF(OR($C279=\"S\",$C279=0),0,MATCH(0,OFFSET($D279,1,$C279,ROW($C$521)-ROW($C279)),0))","v":0},{"$f":"IF(OR($C279=\"S\",$C279=0),0,MATCH(OFFSET($D279,0,$C279)+1,OFFSET($D279,1,$C279,ROW($C$521)-ROW($C279)),0))","v":0},"","Serviço","Serviço","-","AGETOP",271210,"QUADRO DE GIZ EMBOÇO/PINTURA COMPLETO","m2    ",5.04,null,null,0,""]
["S",2,"S",0,3,18,0,0,0,0,0,"","Serviço","Serviço","-","AGETOP",270501,"LIMPEZA FINAL DE OBRA - (OBRAS CIVIS)","m2    ",64.260000000000005,null,null,0,""]
[1,1,1,120,4,0,0,0,0,240,120,"F","Nível 1","Nível 1","4.","SINAPI",null,"BLOCO 3 SALAS PADRÃO SEDUC 2017 - LAJE","-",null,null,null,0,""]
["S",2,2,2,4,1,0,0,0,119,2,"","Serviço","Nível 2","-","SINAPI",null,"SERVIÇOS PRELIMINARES","-",null,null,null,0,""]
["S",2,"S",0,4,1,0,0,0,0,0,"","Serviço","Serviço","-","AGETOP",20701,"LOCAÇÃO DA OBRA, EXECUÇÃO DE GABARITO SEM REAPROVEITAMENTO, INCLUSO PINTURA (FACE INTERNA DO RIPÃO 15CM) E PIQUETE COM TESTEMUNHA","m2    ",190.26,null,null,0,""]
[2,2,2,3,4,2,0,0,0,117,3,"","Nível 2","Nível 2","-","SINAPI",null,"TRANSPORTES","-",null,null,null,0,""]
["S",2,"S",0,4,2,0,0,0,0,0,"","Serviço","Serviço","-","SINAPI",72897,"CARGA MANUAL DE ENTULHO EM CAMINHAO BASCULANTE 6 M3","M3",12,null,null,0,""]
["S",2,"S",0,4,2,0,0,0,0,0,"","Serviço","Serviço","-","SINAPI",72900,"TRANSPORTE DE ENTULHO COM CAMINHAO BASCULANTE 6 M3, RODOVIA PAVIMENTADA, DMT 0,5 A 1,0 KM","M3",12,null,null,0,""]
[2,2,2,8,4,3,0,0,0,114,8,"","Nível 2","Nível 2","-","SINAPI",null,"SERVIÇO EM TERRA","-",null,null,null,0,""]
["S",2,"S",0,4,3,0,0,0,0,0,"","Serviço","Serviço","-","SINAPI",93358,"ESCAVAÇÃO MANUAL DE VALA COM PROFUNDIDADE MENOR OU IGUAL A 1,30 M. AF_03/2016","M3",9.35,null,null,0,"Referência: AGETOP - 40101"]
["S",2,"S",0,4,3,0,0,0,0,0,"","Serviço","Serviço","-","SINAPI",96995,"REATERRO MANUAL APILOADO COM SOQUETE. AF_10/2017","M3",5.42,null,null,0,"Referência: AGETOP - 40902"]
["S",2,"S",0,4,3,0,0,0,0,0,"","Serviço","Serviço","-","SINAPI",79480,"ESCAVACAO MECANICA CAMPO ABERTO EM SOLO EXCETO ROCHA ATE 2,00M PROFUNDIDADE","M3",40,null,null,0,"Referência: AGETOP - 41004"]
["S",2,"S",0,4,3,0,0,0,0,0,"","Serviço","Serviço","-","SINAPI",72898,"CARGA E DESCARGA MECANIZADAS DE ENTULHO EM CAMINHAO BASCULANTE 6 M3","M3",40,null,null,0,"Referência: AGETOP - 41005"]
["S",2,"S",0,4,3,0,0,0,0,0,"","Serviço","Serviço","-","AGETOP",41012,"INDENIZAÇÃO DE JAZIDA","m3    ",40,null,null,0,""]
["S",2,"S",0,4,3,0,0,0,0,0,"","Serviço","Serviço","-","AGETOP",41006,"TRANSPORTE DE MATERIAL ESCAVADO M3.KM","m3km  ",400,null,null,0,""]
["S",2,"S",0,4,3,0,0,0,0,0,"","Serviço","Serviço","-","SINAPI","74005/2","COMPACTACAO MECANICA C/ CONTROLE DO GC>=95% DO PN (AREAS) (C/MONIVELADORA 140 HP E ROLO COMPRESSOR VIBRATORIO 80 HP)","M3",32,null,null,0,"Referência: AGETOP - 41008"]
[2,2,2,11,4,4,0,0,0,106,11,"","Nível 2","Nível 2","-","SINAPI",null,"FUNDAÇÕES E SONDAGENS","-",null,null,null,0,""]
[3,3,3,10,4,4,1,0,0,10,19,"","Nível 3","Nível 3","-","SINAPI",null,"ESTACAS E BLOCOS","-",null,null,null,0,""]
["S",3,"S",0,4,4,1,0,0,0,0,"","Serviço","Serviço","-","SINAPI",98230,"ESTACA BROCA DE CONCRETO, DIÂMETRO DE 30 CM, PROFUNDIDADE DE ATÉ 3 M, ESCAVAÇÃO MANUAL COM TRADO CONCHA, NÃO ARMADA. AF_03/2018","M",103.5,null,null,0,"Referência: AGETOP - 50302"]
["S",3,"S",0,4,4,1,0,0,0,0,"","Serviço","Serviço","-","SINAPI",96522,"ESCAVAÇÃO MANUAL PARA BLOCO DE COROAMENTO OU SAPATA, SEM PREVISÃO DE FÔRMA. AF_06/2017","M3",7.19,null,null,0,"Referência: AGETOP - 50901"]
["S",3,"S",0,4,4,1,0,0,0,0,"","Serviço","Serviço","-","SINAPI",96995,"REATERRO MANUAL APILOADO COM SOQUETE. AF_10/2017","M3",3.29,null,null,0,"Referência: AGETOP - 40902"]
["S",3,"S",0,4,4,1,0,0,0,0,"","Serviço","Serviço","-","SINAPI",94963,"CONCRETO FCK = 15MPA, TRAÇO 1:3,4:3,5 (CIMENTO/ AREIA MÉDIA/ BRITA 1)  - PREPARO MECÂNICO COM BETONEIRA 400 L. AF_07/2016","M3",3.9000000000000004,null,null,0,""]
["S",3,"S",0,4,4,1,0,0,0,0,"","Serviço","Serviço","-","SINAPI","74157/4","LANCAMENTO/APLICACAO MANUAL DE CONCRETO EM FUNDACOES","M3",3.9000000000000004,null,null,0,"Referência: AGETOP - 51055"]
["S",3,"S",0,4,4,1,0,0,0,0,"","Serviço","Serviço","-","SINAPI",96544,"ARMAÇÃO DE BLOCO, VIGA BALDRAME OU SAPATA UTILIZANDO AÇO CA-50 DE 6,3 MM - MONTAGEM. AF_06/2017","KG",67.27,null,null,0,"Referência: AGETOP - 52003"]
["S",3,"S",0,4,4,1,0,0,0,0,"","Serviço","Serviço","-","SINAPI",96545,"ARMAÇÃO DE BLOCO, VIGA BALDRAME OU SAPATA UTILIZANDO AÇO CA-50 DE 8 MM - MONTAGEM. AF_06/2017","KG",136.36000000000001,null,null,0,"Referência: AGETOP - 52004"]
[{"$f":"CHOOSE(1+LOG(1+2*(ORÇAMENTO.Nivel=\"Nível 1\")+4*(ORÇAMENTO.Nivel=\"Nível 2\")+8*(ORÇAMENTO.Nivel=\"Nível 3\")+16*(ORÇAMENTO.Nivel=\"Nível 4\")+32*(ORÇAMENTO.Nivel=\"Serviço\"),2),0,1,2,3,4,\"S\")","v":"S"},{"$f":"IF(OR(C304=\"s\",C304=0),OFFSET(B304,-1,0),C304)","v":3},{"$f":"IF(OFFSET(C304,-1,0)=\"L\",1,IF(OFFSET(C304,-1,0)=1,2,IF(OR(A304=\"s\",A304=0),\"S\",IF(AND(OFFSET(C304,-1,0)=2,A304=4),3,IF(AND(OR(OFFSET(C304,-1,0)=\"s\",OFFSET(C304,-1,0)=0),A304<>\"s\",A304>OFFSET(B304,-1,0)),OFFSET(B304,-1,0),A304)))))","v":"S"},{"$f":"IF(OR(C304=\"S\",C304=0),0,IF(ISERROR(K304),J304,SMALL(J304:K304,1)))","v":0},{"$f":"IF($C304=1,OFFSET(E304,-1,0)+1,OFFSET(E304,-1,0))","v":4},{"$f":"IF($C304=1,0,IF($C304=2,OFFSET(F304,-1,0)+1,OFFSET(F304,-1,0)))","v":4},{"$f":"IF(AND($C304<=2,$C304<>0),0,IF($C304=3,OFFSET(G304,-1,0)+1,OFFSET(G304,-1,0)))","v":1},{"$f":"IF(AND($C304<=3,$C304<>0),0,IF($C304=4,OFFSET(H304,-1,0)+1,OFFSET(H304,-1,0)))","v":0},{"$f":"IF(AND($C304<=4,$C304<>0),0,IF(AND($C304=\"S\",$W304>0),OFFSET(I304,-1,0)+1,OFFSET(I304,-1,0)))","v":0},0,0,"","Serviço","Serviço","-","SINAPI",96546,"ARMAÇÃO DE BLOCO, VIGA BALDRAME OU SAPATA UTILIZANDO AÇO CA-50 DE 10 MM - MONTAGEM. AF_06/2017","KG",55.45,null,null,0,"Referência: AGETOP - 52005"]
["S",3,"S",0,4,4,1,0,0,0,0,"","Serviço","Serviço","-","SINAPI",96543,"ARMAÇÃO DE BLOCO, VIGA BALDRAME E SAPATA UTILIZANDO AÇO CA-60 DE 5 MM - MONTAGEM. AF_06/2017","KG",38.18,null,null,0,"Referência: AGETOP - 52014"]
[2,2,2,27,4,5,0,0,0,95,27,"","Nível 2","Nível 2","-","SINAPI",null,"ESTRUTURA","-",null,null,null,0,""]
[3,3,3,8,4,5,1,0,0,26,8,"","Nível 3","Nível 3","-","SINAPI",null,"VIGAS BALDRAMES","-",null,null,null,0,""]
["S",3,"S",0,4,5,1,0,0,0,0,"","Serviço","Serviço","-","SINAPI",96527,"ESCAVAÇÃO MANUAL DE VALA PARA VIGA BALDRAME, COM PREVISÃO DE FÔRMA. AF_06/2017","M3",9.94,null,null,0,"Referência: AGETOP - 40101"]
["S",3,"S",0,4,5,1,0,0,0,0,"","Serviço","Serviço","-","SINAPI",96995,"REATERRO MANUAL APILOADO COM SOQUETE. AF_10/2017","M3",5.69,null,null,0,"Referência: AGETOP - 40902"]
["S",3,"S",0,4,5,1,0,0,0,0,"","Serviço","Serviço","-","AGETOP",60191,"FORMA DE TABUA CINTA BALDRAME U=8 VEZES","m2    ",75.67,null,null,0,""]
["S",3,"S",0,4,5,1,0,0,0,0,"","Serviço","Serviço","-","SINAPI",94963,"CONCRETO FCK = 15MPA, TRAÇO 1:3,4:3,5 (CIMENTO/ AREIA MÉDIA/ BRITA 1)  - PREPARO MECÂNICO COM BETONEIRA 400 L. AF_07/2016","M3",4.25,null,null,0,""]
["S",3,"S",0,4,5,1,0,0,0,0,"","Serviço","Serviço","-","SINAPI","74157/4","LANCAMENTO/APLICACAO MANUAL DE CONCRETO EM FUNDACOES","M3",4.25,null,null,0,"Referência: AGETOP - 51055"]
["S",3,"S",0,4,5,1,0,0,0,0,"","Serviço","Serviço","-","SINAPI",96545,"ARMAÇÃO DE BLOCO, VIGA BALDRAME OU SAPATA UTILIZANDO AÇO CA-50 DE 8 MM - MONTAGEM. AF_06/2017","KG",173.64,null,null,0,"Referência: AGETOP - 52004"]
["S",3,"S",0,4,5,1,0,0,0,0,"","Serviço","Serviço","-","SINAPI",96543,"ARMAÇÃO DE BLOCO, VIGA BALDRAME E SAPATA UTILIZANDO AÇO CA-60 DE 5 MM - MONTAGEM. AF_06/2017","KG",97.27,null,null,0,"Referência: AGETOP - 52014"]
[3,3,3,6,4,5,2,0,0,18,6,"","Nível 3","Nível 3","-","SINAPI",null,"PILARES","-",null,null,null,0,""]
["S",3,"S",0,4,5,2,0,0,0,0,"","Serviço","Serviço","-","SINAPI",92426,"MONTAGEM E DESMONTAGEM DE FÔRMA DE PILARES RETANGULARES E ESTRUTURAS SIMILARES COM ÁREA MÉDIA DAS SEÇÕES MENOR OU IGUAL A 0,25 M², PÉ-DIREITO SIMPLES, EM CHAPA DE MADEIRA COMPENSADA RESINADA, 8 UTILIZAÇÕES. AF_12/2015","M2",38.19,null,null,0,""]
["S",3,"S",0,4,5,2,0,0,0,0,"","Serviço","Serviço","-","SINAPI",94964,"CONCRETO FCK = 20MPA, TRAÇO 1:2,7:3 (CIMENTO/ AREIA MÉDIA/ BRITA 1)  - PREPARO MECÂNICO COM BETONEIRA 400 L. AF_07/2016","M3",1.82,null,null,0,""]
["S",3,"S",0,4,5,2,0,0,0,0,"","Serviço","Serviço","-","SINAPI",92873,"LANÇAMENTO COM USO DE BALDES, ADENSAMENTO E ACABAMENTO DE CONCRETO EM ESTRUTURAS. AF_12/2015","M3",1.82,null,null,0,"Referência: AGETOP - 60801"]
["S",3,"S",0,4,5,2,0,0,0,0,"","Serviço","Serviço","-","SINAPI",92778,"ARMAÇÃO DE PILAR OU VIGA DE UMA ESTRUTURA CONVENCIONAL DE CONCRETO ARMADO EM UMA EDIFICAÇÃO TÉRREA OU SOBRADO UTILIZANDO AÇO CA-50 DE 10,0 MM - MONTAGEM. AF_12/2015","KG",161.82,null,null,0,"Referência: AGETOP - 60305"]
["S",3,"S",0,4,5,2,0,0,0,0,"","Serviço","Serviço","-","SINAPI",92775,"ARMAÇÃO DE PILAR OU VIGA DE UMA ESTRUTURA CONVENCIONAL DE CONCRETO ARMADO EM UMA EDIFICAÇÃO TÉRREA OU SOBRADO UTILIZANDO AÇO CA-60 DE 5,0 MM - MONTAGEM. AF_12/2015","KG",55.45,null,null,0,"Referência: AGETOP - 60314"]
[3,3,3,8,4,5,3,0,0,12,8,"","Nível 3","Nível 3","-","SINAPI",null,"VIGAS DE COBERTURA","-",null,null,null,0,""]
["S",3,"S",0,4,5,3,0,0,0,0,"","Serviço","Serviço","-","SINAPI",92464,"MONTAGEM E DESMONTAGEM DE FÔRMA DE VIGA, ESCORAMENTO METÁLICO, PÉ-DIREITO SIMPLES, EM CHAPA DE MADEIRA RESINADA, 8 UTILIZAÇÕES. AF_12/2015","M2",68.47,null,null,0,"Referência: AGETOP - 60209"]
["S",3,"S",0,4,5,3,0,0,0,0,"","Serviço","Serviço","-","SINAPI",94964,"CONCRETO FCK = 20MPA, TRAÇO 1:2,7:3 (CIMENTO/ AREIA MÉDIA/ BRITA 1)  - PREPARO MECÂNICO COM BETONEIRA 400 L. AF_07/2016","M3",4.08,null,null,0,""]
["S",3,"S",0,4,5,3,0,0,0,0,"","Serviço","Serviço","-","SINAPI",92873,"LANÇAMENTO COM USO DE BALDES, ADENSAMENTO E ACABAMENTO DE CONCRETO EM ESTRUTURAS. AF_12/2015","M3",4.08,null,null,0,"Referência: AGETOP - 60801"]
["S",3,"S",0,4,5,3,0,0,0,0,"","Serviço","Serviço","-","SINAPI",92777,"ARMAÇÃO DE PILAR OU VIGA DE UMA ESTRUTURA CONVENCIONAL DE CONCRETO ARMADO EM UMA EDIFICAÇÃO TÉRREA OU SOBRADO UTILIZANDO AÇO CA-50 DE 8,0 MM - MONTAGEM. AF_12/2015","KG",52.73,null,null,0,"Referência: AGETOP - 60304"]
["S",3,"S",0,4,5,3,0,0,0,0,"","Serviço","Serviço","-","SINAPI",92778,"ARMAÇÃO DE PILAR OU VIGA DE UMA ESTRUTURA CONVENCIONAL DE CONCRETO ARMADO EM UMA EDIFICAÇÃO TÉRREA OU SOBRADO UTILIZANDO AÇO CA-50 DE 10,0 MM - MONTAGEM. AF_12/2015","KG",159.09,null,null,0,"Referência: AGETOP - 60305"]
["S",3,"S",0,4,5,3,0,0,0,0,"","Serviço","Serviço","-","SINAPI",92779,"ARMAÇÃO DE PILAR OU VIGA DE UMA ESTRUTURA CONVENCIONAL DE CONCRETO ARMADO EM UMA EDIFICAÇÃO TÉRREA OU SOBRADO UTILIZANDO AÇO CA-50 DE 12,5 MM - MONTAGEM. AF_12/2015","KG",51.82,null,null,0,""]
["S",3,"S",0,4,5,3,0,0,0,0,"","Serviço","Serviço","-","SINAPI",92775,"ARMAÇÃO DE PILAR OU VIGA DE UMA ESTRUTURA CONVENCIONAL DE CONCRETO ARMADO EM UMA EDIFICAÇÃO TÉRREA OU SOBRADO UTILIZANDO AÇO CA-60 DE 5,0 MM - MONTAGEM. AF_12/2015","KG",67.27,null,null,0,"Referência: AGETOP - 60314"]
[3,3,3,2,4,5,4,0,0,4,2,"","Nível 3","Nível 3","-","SINAPI",null,"LAJE","-",null,null,null,0,""]
["S",3,"S",0,4,5,4,0,0,0,0,"","Serviço","Serviço","-","SINAPI","74202/1","LAJE PRE-MOLDADA P/FORRO, SOBRECARGA 100KG/M2, VAOS ATE 3,50M/E=8CM, C/LAJOTAS E CAP.C/CONC FCK=20MPA, 3CM, INTER-EIXO 38CM, C/ESCORAMENTO (REAPR.3X) E FERRAGEM NEGATIVA","M2",156.28,null,null,0,""]
[3,3,3,2,4,5,5,0,0,2,{"$error":"#N/A"},"","Nível 3","Nível 3","-","SINAPI",null,"EXTRAS","-",null,null,null,0,""]
["S",3,"S",0,4,5,5,0,0,0,0,"","Serviço","Serviço","-","SINAPI","74022/30","ENSAIO DE RESISTENCIA A COMPRESSAO SIMPLES - CONCRETO","UN",6,null,null,0,"Referência: AGETOP - 50251"]
[2,2,2,25,4,6,0,0,0,68,25,"","Nível 2","Nível 2","-","SINAPI",null,"INSTALAÇÕES ELÉTRICAS","-",null,null,null,0,""]
["S",2,"S",0,4,6,0,0,0,0,0,"","Serviço","Serviço","-","SINAPI",91927,"CABO DE COBRE FLEXÍVEL ISOLADO, 2,5 MM², ANTI-CHAMA 0,6/1,0 KV, PARA CIRCUITOS TERMINAIS - FORNECIMENTO E INSTALAÇÃO. AF_12/2015","M",900,null,null,0,"Referência: AGETOP - 70581"]
["S",2,"S",0,4,6,0,0,0,0,0,"","Serviço","Serviço","-","SINAPI",91928,"CABO DE COBRE FLEXÍVEL ISOLADO, 4 MM², ANTI-CHAMA 450/750 V, PARA CIRCUITOS TERMINAIS - FORNECIMENTO E INSTALAÇÃO. AF_12/2015","M",500,null,null,0,""]
["S",2,"S",0,4,6,0,0,0,0,0,"","Serviço","Serviço","-","SINAPI",83446,"CAIXA DE PASSAGEM 30X30X40 COM TAMPA E DRENO BRITA","UN",1,null,null,0,""]
["S",2,"S",0,4,6,0,0,0,0,0,"","Serviço","Serviço","-","SINAPI",91936,"CAIXA OCTOGONAL 4\" X 4\", PVC, INSTALADA EM LAJE - FORNECIMENTO E INSTALAÇÃO. AF_12/2015","UN",15,null,null,0,""]
["S",2,"S",0,4,6,0,0,0,0,0,"","Serviço","Serviço","-","SINAPI",92867,"CAIXA RETANGULAR 4\" X 2\" ALTA (2,00 M DO PISO), METÁLICA, INSTALADA EM PAREDE - FORNECIMENTO E INSTALAÇÃO. AF_12/2015","UN",6,null,null,0,""]
["S",2,"S",0,4,6,0,0,0,0,0,"","Serviço","Serviço","-","SINAPI",92867,"CAIXA RETANGULAR 4\" X 2\" ALTA (2,00 M DO PISO), METÁLICA, INSTALADA EM PAREDE - FORNECIMENTO E INSTALAÇÃO. AF_12/2015","UN",4,null,null,0,""]
["S",2,"S",0,4,6,0,0,0,0,0,"","Serviço","Serviço","-","SINAPI",92869,"CAIXA RETANGULAR 4\" X 2\" BAIXA (0,30 M DO PISO), METÁLICA, INSTALADA EM PAREDE - FORNECIMENTO E INSTALAÇÃO. AF_12/2015","UN",9,null,null,0,""]
["S",2,"S",0,4,6,0,0,0,0,0,"","Serviço","Serviço","-","SINAPI",91914,"CURVA 90 GRAUS PARA ELETRODUTO, PVC, ROSCÁVEL, DN 25 MM (3/4\"), PARA CIRCUITOS TERMINAIS, INSTALADA EM PAREDE - FORNECIMENTO E INSTALAÇÃO. AF_12/2015","UN",6,null,null,0,""]
["S",2,"S",0,4,6,0,0,0,0,0,"","Serviço","Serviço","-","SINAPI",93655,"DISJUNTOR MONOPOLAR TIPO DIN, CORRENTE NOMINAL DE 20A - FORNECIMENTO E INSTALAÇÃO. AF_04/2016","UN",2,null,null,0,""]
["S",2,"S",0,4,6,0,0,0,{"$f":"IF(OR($C343=\"S\",$C343=0),0,MATCH(0,OFFSET($D343,1,$C343,ROW($C$521)-ROW($C343)),0))","v":0},{"$f":"IF(OR($C343=\"S\",$C343=0),0,MATCH(OFFSET($D343,0,$C343)+1,OFFSET($D343,1,$C343,ROW($C$521)-ROW($C343)),0))","v":0},"","Serviço","Serviço","-","SINAPI",93656,"DISJUNTOR MONOPOLAR TIPO DIN, CORRENTE NOMINAL DE 25A - FORNECIMENTO E INSTALAÇÃO. AF_04/2016","UN",6,null,null,0,""]
["S",2,"S",0,4,6,0,0,0,0,0,"","Serviço","Serviço","-","SINAPI",93671,"DISJUNTOR TRIPOLAR TIPO DIN, CORRENTE NOMINAL DE 32A - FORNECIMENTO E INSTALAÇÃO. AF_04/2016","UN",1,null,null,0,"Referência: AGETOP - 71173"]
["S",2,"S",0,4,6,0,0,0,0,0,"","Serviço","Serviço","-","SINAPI",91871,"ELETRODUTO RÍGIDO ROSCÁVEL, PVC, DN 25 MM (3/4\"), PARA CIRCUITOS TERMINAIS, INSTALADO EM PAREDE - FORNECIMENTO E INSTALAÇÃO. AF_12/2015","M",135,null,null,0,"Referência: AGETOP - 71201"]
["S",2,"S",0,4,6,0,0,0,0,0,"","Serviço","Serviço","-","SINAPI",91872,"ELETRODUTO RÍGIDO ROSCÁVEL, PVC, DN 32 MM (1\"), PARA CIRCUITOS TERMINAIS, INSTALADO EM PAREDE - FORNECIMENTO E INSTALAÇÃO. AF_12/2015","M",45,null,null,0,"Referência: AGETOP - 71202"]
["S",2,"S",0,4,6,0,0,0,0,0,"","Serviço","Serviço","-","SINAPI",91873,"ELETRODUTO RÍGIDO ROSCÁVEL, PVC, DN 40 MM (1 1/4\"), PARA CIRCUITOS TERMINAIS, INSTALADO EM PAREDE - FORNECIMENTO E INSTALAÇÃO. AF_12/2015","M",9,null,null,0,""]
["S",2,"S",0,4,6,0,0,0,0,0,"","Serviço","Serviço","-","SINAPI",91953,"INTERRUPTOR SIMPLES (1 MÓDULO), 10A/250V, INCLUINDO SUPORTE E PLACA - FORNECIMENTO E INSTALAÇÃO. AF_12/2015","UN",4,null,null,0,"Referência: AGETOP - 71440"]
["S",2,"S",0,4,6,0,0,0,0,0,"","Serviço","Serviço","-","SINAPI",97610,"LÂMPADA COMPACTA DE LED 10 W, BASE E27 - FORNECIMENTO E INSTALAÇÃO. AF_11/2017","UN",45,null,null,0,""]
["S",2,"S",0,4,6,0,0,0,0,0,"","Serviço","Serviço","-","SINAPI",97591,"LUMINÁRIA TIPO PLAFON REDONDO COM VIDRO FOSCO, DE SOBREPOR, COM 2 LÂMPADAS DE 15 W - FORNECIMENTO E INSTALAÇÃO. AF_11/2017","UN",18,null,null,0,""]
["S",2,"S",0,4,6,0,0,0,0,0,"","Serviço","Serviço","-","SINAPI",97593,"LUMINÁRIA TIPO SPOT, DE SOBREPOR, COM 1 LÂMPADA DE 15 W - FORNECIMENTO E INSTALAÇÃO. AF_11/2017","UN",9,null,null,0,"Referência: AGETOP - 71688"]
["S",2,"S",0,4,6,0,0,0,0,0,"","Serviço","Serviço","-","SINAPI",91884,"LUVA PARA ELETRODUTO, PVC, ROSCÁVEL, DN 25 MM (3/4\"), PARA CIRCUITOS TERMINAIS, INSTALADA EM PAREDE - FORNECIMENTO E INSTALAÇÃO. AF_12/2015","UN",45,null,null,0,"Referência: AGETOP - 71741"]
["S",2,"S",0,4,6,0,0,0,0,0,"","Serviço","Serviço","-","SINAPI",91885,"LUVA PARA ELETRODUTO, PVC, ROSCÁVEL, DN 32 MM (1\"), PARA CIRCUITOS TERMINAIS, INSTALADA EM PAREDE - FORNECIMENTO E INSTALAÇÃO. AF_12/2015","UN",15,null,null,0,"Referência: AGETOP - 71742"]
["S",2,"S",0,4,6,0,0,0,0,0,"","Serviço","Serviço","-","SINAPI",91886,"LUVA PARA ELETRODUTO, PVC, ROSCÁVEL, DN 40 MM (1 1/4\"), PARA CIRCUITOS TERMINAIS, INSTALADA EM PAREDE - FORNECIMENTO E INSTALAÇÃO. AF_12/2015","UN",3,null,null,0,""]
["S",2,"S",0,4,6,0,0,0,0,0,"","Serviço","Serviço","-","SINAPI",83463,"QUADRO DE DISTRIBUICAO DE ENERGIA EM CHAPA DE ACO GALVANIZADO, PARA 12 DISJUNTORES TERMOMAGNETICOS MONOPOLARES, COM BARRAMENTO TRIFASICO E NEUTRO - FORNECIMENTO E INSTALACAO","UN",1,null,null,0,""]
["S",2,"S",0,4,6,0,0,0,0,0,"","Serviço","Serviço","-","SINAPI",91998,"TOMADA BAIXA DE EMBUTIR (1 MÓDULO), 2P+T 10 A, SEM SUPORTE E SEM PLACA - FORNECIMENTO E INSTALAÇÃO. AF_12/2015","UN",9,null,null,0,""]
["S",2,"S",0,4,6,0,0,0,0,0,"","Serviço","Serviço","-","SINAPI",91991,"TOMADA ALTA DE EMBUTIR (1 MÓDULO), 2P+T 20 A, SEM SUPORTE E SEM PLACA - FORNECIMENTO E INSTALAÇÃO. AF_12/2015","UN",6,null,null,0,""]
[2,2,2,3,4,7,0,0,0,43,3,"","Nível 2","Nível 2","-","AGETOP",null,"ALVENARIAS E DIVISÓRIAS","-",null,null,null,0,""]
["S",2,"S",0,4,7,0,0,0,0,0,"","Serviço","Serviço","-","SINAPI",87503,"ALVENARIA DE VEDAÇÃO DE BLOCOS CERÂMICOS FURADOS NA HORIZONTAL DE 9X19X19CM (ESPESSURA 9CM) DE PAREDES COM ÁREA LÍQUIDA MAIOR OU IGUAL A 6M² SEM VÃOS E ARGAMASSA DE ASSENTAMENTO COM PREPARO EM BETONEIRA. AF_06/2014","M2",184.73,null,null,0,"Referência: AGETOP - 100201"]
["S",2,"S",0,4,7,0,0,0,0,0,"","Serviço","Serviço","-","SINAPI",93201,"FIXAÇÃO (ENCUNHAMENTO) DE ALVENARIA DE VEDAÇÃO COM ARGAMASSA APLICADA COM COLHER. AF_03/2016","M",72.900000000000006,null,null,0,""]
[2,2,2,2,4,8,0,0,0,40,2,"","Nível 2","Nível 2","-",null,null,"IMPERMEABILIZAÇÃO","-",null,null,null,0,""]
["S",2,"S",0,4,8,0,0,0,0,0,"","Serviço","Serviço","-","SINAPI","74106/1","IMPERMEABILIZACAO DE ESTRUTURAS ENTERRADAS, COM TINTA ASFALTICA, DUAS DEMAOS.","M2",72.900000000000006,null,null,0,""]
[2,2,2,2,4,9,0,0,0,38,2,"","Nível 2","Nível 2","-",null,null,"ESTRUTURAS METÁLICAS","-",null,null,null,0,""]
["S",2,"S",0,4,9,0,0,0,0,0,"","Serviço","Serviço","-","AGETOP",150103,"ESTRUTURA METÁLICA CONVENCIONAL EM AÇO DO TIPO USI SAC-300 COM FUNDO ANTICORROSIVO","Kg    ",3844.01,null,null,0,""]
[2,2,2,4,4,10,0,0,0,36,4,"","Nível 2","Nível 2","-",null,null,"COBERTURAS","-",null,null,null,0,""]
["S",2,"S",0,4,10,0,0,0,0,0,"","Serviço","Serviço","-","SINAPI",94445,"TELHAMENTO COM TELHA CERÂMICA CAPA-CANAL, TIPO PLAN, COM ATÉ 2 ÁGUAS, INCLUSO TRANSPORTE VERTICAL. AF_06/2016","M2",235.69,null,null,0,"Referência: AGETOP - 160401"]
["S",2,"S",0,4,10,0,0,0,0,0,"","Serviço","Serviço","-","SINAPI",94221,"CUMEEIRA PARA TELHA CERÂMICA EMBOÇADA COM ARGAMASSA TRAÇO 1:2:9 (CIMENTO, CAL E AREIA) PARA TELHADOS COM ATÉ 2 ÁGUAS, INCLUSO TRANSPORTE VERTICAL. AF_06/2016","M",24.05,null,null,0,""]
[{"$f":"CHOOSE(1+LOG(1+2*(ORÇAMENTO.Nivel=\"Nível 1\")+4*(ORÇAMENTO.Nivel=\"Nível 2\")+8*(ORÇAMENTO.Nivel=\"Nível 3\")+16*(ORÇAMENTO.Nivel=\"Nível 4\")+32*(ORÇAMENTO.Nivel=\"Serviço\"),2),0,1,2,3,4,\"S\")","v":"S"},{"$f":"IF(OR(C368=\"s\",C368=0),OFFSET(B368,-1,0),C368)","v":2},{"$f":"IF(OFFSET(C368,-1,0)=\"L\",1,IF(OFFSET(C368,-1,0)=1,2,IF(OR(A368=\"s\",A368=0),\"S\",IF(AND(OFFSET(C368,-1,0)=2,A368=4),3,IF(AND(OR(OFFSET(C368,-1,0)=\"s\",OFFSET(C368,-1,0)=0),A368<>\"s\",A368>OFFSET(B368,-1,0)),OFFSET(B368,-1,0),A368)))))","v":"S"},{"$f":"IF(OR(C368=\"S\",C368=0),0,IF(ISERROR(K368),J368,SMALL(J368:K368,1)))","v":0},{"$f":"IF($C368=1,OFFSET(E368,-1,0)+1,OFFSET(E368,-1,0))","v":4},{"$f":"IF($C368=1,0,IF($C368=2,OFFSET(F368,-1,0)+1,OFFSET(F368,-1,0)))","v":10},{"$f":"IF(AND($C368<=2,$C368<>0),0,IF($C368=3,OFFSET(G368,-1,0)+1,OFFSET(G368,-1,0)))","v":0},{"$f":"IF(AND($C368<=3,$C368<>0),0,IF($C368=4,OFFSET(H368,-1,0)+1,OFFSET(H368,-1,0)))","v":0},{"$f":"IF(AND($C368<=4,$C368<>0),0,IF(AND($C368=\"S\",$W368>0),OFFSET(I368,-1,0)+1,OFFSET(I368,-1,0)))","v":0},0,0,"","Serviço","Serviço","-","SINAPI",94224,"EMBOÇAMENTO COM ARGAMASSA TRAÇO 1:2:9 (CIMENTO, CAL E AREIA). AF_06/2016","M",62.1,null,null,0,"Referência: AGETOP - 160403"]
[2,2,2,4,4,11,0,0,0,32,4,"","Nível 2","Nível 2","-",null,null,"ESQUADRIAS METÁLICAS","-",null,null,null,0,""]
["S",2,"S",0,4,11,0,0,0,0,0,"","Serviço","Serviço","-","SINAPI",94562,"JANELA DE AÇO DE CORRER, 4 FOLHAS, FIXAÇÃO COM ARGAMASSA, SEM VIDROS, PADRONIZADA. AF_07/2016","M2",14.4,null,null,0,"Referência: AGETOP - 180401"]
["S",2,"S",0,4,11,0,0,0,0,0,"","Serviço","Serviço","-","SINAPI",94559,"JANELA DE AÇO BASCULANTE, FIXAÇÃO COM ARGAMASSA, SEM VIDROS, PADRONIZADA. AF_07/2016","M2",7.2,null,null,0,"Referência: AGETOP - 180404"]
["S",2,"S",0,4,11,0,0,0,0,0,"","Serviço","Serviço","-","SINAPI","73933/4","PORTA DE FERRO DE ABRIR TIPO BARRA CHATA, COM REQUADRO E GUARNICAO COMPLETA","M2",5.04,null,null,0,"Referência: AGETOP - 180501"]
[2,2,2,2,4,12,0,0,0,28,2,"","Nível 2","Nível 2","-",null,null,"VIDROS","-",null,null,null,0,""]
["S",2,"S",0,4,12,0,0,0,0,0,"","Serviço","Serviço","-","SINAPI",72117,"VIDRO LISO COMUM TRANSPARENTE, ESPESSURA 4MM","M2",21.6,null,null,0,"Referência: AGETOP - 190102"]
[2,2,2,4,4,13,0,0,0,26,4,"","Nível 2","Nível 2","-",null,null,"REVESTIMENTO DE PAREDE","-",null,null,null,0,""]
["S",2,"S",0,4,13,0,0,0,0,0,"","Serviço","Serviço","-","SINAPI",87879,"CHAPISCO APLICADO EM ALVENARIAS E ESTRUTURAS DE CONCRETO INTERNAS, COM COLHER DE PEDREIRO.  ARGAMASSA TRAÇO 1:3 COM PREPARO EM BETONEIRA 400L. AF_06/2014","M2",369.45,null,null,0,""]
["S",2,"S",0,4,13,0,0,0,0,0,"","Serviço","Serviço","-","SINAPI",87548,"MASSA ÚNICA, PARA RECEBIMENTO DE PINTURA, EM ARGAMASSA TRAÇO 1:2:8, PREPARO MANUAL, APLICADA MANUALMENTE EM FACES INTERNAS DE PAREDES, ESPESSURA DE 10MM, COM EXECUÇÃO DE TALISCAS. AF_06/2014","M2",369.45,null,null,0,"Referência: AGETOP - 200500"]
["S",2,"S",0,4,13,0,0,0,0,0,"","Serviço","Serviço","-","SINAPI",84088,"PEITORIL EM MARMORE BRANCO, LARGURA DE 15CM, ASSENTADO COM ARGAMASSA TRACO 1:4 (CIMENTO E AREIA MEDIA), PREPARO MANUAL DA ARGAMASSA","M",24,null,null,0,""]
[2,2,2,2,4,14,0,0,0,22,2,"","Nível 2","Nível 2","-",null,null,"FORROS","-",null,null,null,0,""]
["S",2,"S",0,4,14,0,0,0,0,0,"","Serviço","Serviço","-","SINAPI",87414,"APLICAÇÃO MANUAL DE GESSO DESEMPENADO (SEM TALISCAS) EM TETO DE AMBIENTES DE ÁREA MAIOR QUE 10M², ESPESSURA DE 1,0CM. AF_06/2014","M2",156.28,null,null,0,"Referência: AGETOP - 210515"]
[2,2,2,5,4,15,0,0,0,20,5,"","Nível 2","Nível 2","-","SINAPI",null,"REVESTIMENTO DE PISO","-",null,null,null,0,""]
["S",2,"S",0,4,15,0,0,0,0,0,"","Serviço","Serviço","-","SINAPI",95240,"LASTRO DE CONCRETO MAGRO, APLICADO EM PISOS OU RADIERS, ESPESSURA DE 3 CM. AF_07/2016","M2",228.96,null,null,0,""]
["S",2,"S",0,4,15,0,0,0,0,0,"","Serviço","Serviço","-","SINAPI",94992,"EXECUÇÃO DE PASSEIO (CALÇADA) OU PISO DE CONCRETO COM CONCRETO MOLDADO IN LOCO, FEITO EM OBRA, ACABAMENTO CONVENCIONAL, ESPESSURA 6 CM, ARMADO. AF_07/2016","M2",38.700000000000003,null,null,0,""]
["S",2,"S",0,4,15,0,0,0,0,0,"","Serviço","Serviço","-","SINAPI",84191,"PISO EM GRANILITE, MARMORITE OU GRANITINA ESPESSURA 8 MM, INCLUSO JUNTAS DE DILATACAO PLASTICAS","M2",187.3,null,null,0,"Referência: AGETOP - 221101"]
["S",2,"S",0,4,15,0,0,0,0,0,"","Serviço","Serviço","-","AGETOP",221104,"RASPAGEM E APLICAÇÃO RESINA ACRÍLICA DUAS DEMÃOS","m2    ",187.3,null,null,0,""]
[2,2,2,2,4,16,0,0,0,15,2,"","Nível 2","Nível 2","-","SINAPI",null,"MARCENARIA","-",null,null,null,0,""]
["S",2,"S",0,4,16,0,0,0,0,0,"","Serviço","Serviço","-","AGETOP",240106,"BATE CARTEIRA ENVERNIZADO E ASSENT. 2,5 X 12 CM","M     ",63.9,null,null,0,""]
[2,2,2,10,4,17,0,0,0,13,10,"","Nível 2","Nível 2","-","SINAPI",null,"PINTURA","-",null,null,null,0,""]
["S",2,"S",0,4,17,0,0,0,0,0,"","Serviço","Serviço","-","SINAPI","74145/1","PINTURA ESMALTE FOSCO, DUAS DEMAOS, SOBRE SUPERFICIE METALICA, INCLUSO UMA DEMAO DE FUNDO ANTICORROSIVO. UTILIZACAO DE REVOLVER ( AR-COMPRIMIDO).","M2",235.69,null,null,0,"Referência: AGETOP - 261602"]
["S",2,"S",0,4,17,0,0,0,0,0,"","Serviço","Serviço","-","SINAPI",88423,"APLICAÇÃO MANUAL DE PINTURA COM TINTA TEXTURIZADA ACRÍLICA EM PAREDES EXTERNAS DE CASAS, UMA COR. AF_06/2014","M2",120.24,null,null,0,"Referência: AGETOP - 260601"]
["S",2,"S",0,4,17,0,0,0,0,0,"","Serviço","Serviço","-","SINAPI",88489,"APLICAÇÃO MANUAL DE PINTURA COM TINTA LÁTEX ACRÍLICA EM PAREDES, DUAS DEMÃOS. AF_06/2014","M2",124.94999999999996,null,null,0,"Referência: AGETOP - 261001"]
["S",2,"S",0,4,17,0,0,0,0,0,"","Serviço","Serviço","-","SINAPI",88497,"APLICAÇÃO E LIXAMENTO DE MASSA LÁTEX EM PAREDES, DUAS DEMÃOS. AF_06/2014","M2",258.88,null,null,0,"Referência: AGETOP - 261300"]
["S",2,"S",0,4,17,0,0,0,0,0,"","Serviço","Serviço","-","AGETOP",261550,"PINT.ESMALTE SINT.PAREDES - 2 DEM.C/SELADOR","m2    ",133.93,null,null,0,""]
["S",2,"S",0,4,17,0,0,0,0,0,"","Serviço","Serviço","-","SINAPI",88496,"APLICAÇÃO E LIXAMENTO DE MASSA LÁTEX EM TETO, DUAS DEMÃOS. AF_06/2014","M2",145.53,null,null,0,"Referência: AGETOP - 261300"]
["S",2,"S",0,4,17,0,0,0,0,0,"","Serviço","Serviço","-","SINAPI",88488,"APLICAÇÃO MANUAL DE PINTURA COM TINTA LÁTEX ACRÍLICA EM TETO, DUAS DEMÃOS. AF_06/2014","M2",145.53,null,null,0,""]
["S",2,"S",0,4,17,0,0,0,0,0,"","Serviço","Serviço","-","SINAPI","74145/1","PINTURA ESMALTE FOSCO, DUAS DEMAOS, SOBRE SUPERFICIE METALICA, INCLUSO UMA DEMAO DE FUNDO ANTICORROSIVO. UTILIZACAO DE REVOLVER ( AR-COMPRIMIDO).","M2",53.28,null,null,0,"Referência: AGETOP - 261602"]
["S",2,"S",0,4,17,0,0,0,0,0,"","Serviço","Serviço","-","AGETOP",261623,"LETREIRO PEQ.PORTE A PINCEL EM PAREDE E PORTAS","m2    ",0.95,null,null,0,""]
[2,2,2,3,4,18,0,0,0,3,{"$error":"#N/A"},"","Nível 2","Nível 2","-","SINAPI",null,"DIVERSOS","-",null,null,null,0,""]
["S",2,"S",0,4,18,0,0,0,0,0,"","Serviço","Serviço","-","AGETOP",271210,"QUADRO DE GIZ EMBOÇO/PINTURA COMPLETO","m2    ",15.12,null,null,0,""]
["S",2,"S",0,4,18,0,0,0,0,0,"","Serviço","Serviço","-","AGETOP",270501,"LIMPEZA FINAL DE OBRA - (OBRAS CIVIS)","m2    ",190.26,null,null,0,""]
[{"$f":"CHOOSE(1+LOG(1+2*(ORÇAMENTO.Nivel=\"Nível 1\")+4*(ORÇAMENTO.Nivel=\"Nível 2\")+8*(ORÇAMENTO.Nivel=\"Nível 3\")+16*(ORÇAMENTO.Nivel=\"Nível 4\")+32*(ORÇAMENTO.Nivel=\"Serviço\"),2),0,1,2,3,4,\"S\")","v":1},{"$f":"IF(OR(C401=\"s\",C401=0),OFFSET(B401,-1,0),C401)","v":1},{"$f":"IF(OFFSET(C401,-1,0)=\"L\",1,IF(OFFSET(C401,-1,0)=1,2,IF(OR(A401=\"s\",A401=0),\"S\",IF(AND(OFFSET(C401,-1,0)=2,A401=4),3,IF(AND(OR(OFFSET(C401,-1,0)=\"s\",OFFSET(C401,-1,0)=0),A401<>\"s\",A401>OFFSET(B401,-1,0)),OFFSET(B401,-1,0),A401)))))","v":1},{"$f":"IF(OR(C401=\"S\",C401=0),0,IF(ISERROR(K401),J401,SMALL(J401:K401,1)))","v":120},{"$f":"IF($C401=1,OFFSET(E401,-1,0)+1,OFFSET(E401,-1,0))","v":5},{"$f":"IF($C401=1,0,IF($C401=2,OFFSET(F401,-1,0)+1,OFFSET(F401,-1,0)))","v":0},{"$f":"IF(AND($C401<=2,$C401<>0),0,IF($C401=3,OFFSET(G401,-1,0)+1,OFFSET(G401,-1,0)))","v":0},{"$f":"IF(AND($C401<=3,$C401<>0),0,IF($C401=4,OFFSET(H401,-1,0)+1,OFFSET(H401,-1,0)))","v":0},{"$f":"IF(AND($C401<=4,$C401<>0),0,IF(AND($C401=\"S\",$W401>0),OFFSET(I401,-1,0)+1,OFFSET(I401,-1,0)))","v":0},120,{"$error":"#N/A"},"F","Nível 1","Nível 1","5.","SINAPI",null,"BLOCO 3 SALAS PADRÃO SEDUC 2017 - LAJE.","-",null,null,null,0,""]
["S",2,2,2,5,1,0,0,0,119,2,"","Serviço","Nível 2","-","SINAPI",null,"SERVIÇOS PRELIMINARES","-",null,null,null,0,""]
["S",2,"S",0,5,1,0,0,0,0,0,"","Serviço","Serviço","-","AGETOP",20701,"LOCAÇÃO DA OBRA, EXECUÇÃO DE GABARITO SEM REAPROVEITAMENTO, INCLUSO PINTURA (FACE INTERNA DO RIPÃO 15CM) E PIQUETE COM TESTEMUNHA","m2    ",190.26,null,null,0,""]
[2,2,2,3,5,2,0,0,0,117,3,"","Nível 2","Nível 2","-","SINAPI",null,"TRANSPORTES","-",null,null,null,0,""]
["S",2,"S",0,5,2,0,0,0,0,0,"","Serviço","Serviço","-","SINAPI",72897,"CARGA MANUAL DE ENTULHO EM CAMINHAO BASCULANTE 6 M3","M3",12,null,null,0,""]
["S",2,"S",0,5,2,0,0,0,0,0,"","Serviço","Serviço","-","SINAPI",72900,"TRANSPORTE DE ENTULHO COM CAMINHAO BASCULANTE 6 M3, RODOVIA PAVIMENTADA, DMT 0,5 A 1,0 KM","M3",12,null,null,0,""]
[2,2,2,8,5,3,0,0,0,114,8,"","Nível 2","Nível 2","-","SINAPI",null,"SERVIÇO EM TERRA","-",null,null,null,0,""]
["S",2,"S",0,5,3,0,0,0,0,0,"","Serviço","Serviço","-","SINAPI",93358,"ESCAVAÇÃO MANUAL DE VALA COM PROFUNDIDADE MENOR OU IGUAL A 1,30 M. AF_03/2016","M3",9.35,null,null,0,"Referência: AGETOP - 40101"]
["S",2,"S",0,5,3,0,0,0,0,0,"","Serviço","Serviço","-","SINAPI",96995,"REATERRO MANUAL APILOADO COM SOQUETE. AF_10/2017","M3",5.42,null,null,0,"Referência: AGETOP - 40902"]
["S",2,"S",0,5,3,0,0,0,0,0,"","Serviço","Serviço","-","SINAPI",79480,"ESCAVACAO MECANICA CAMPO ABERTO EM SOLO EXCETO ROCHA ATE 2,00M PROFUNDIDADE","M3",40,null,null,0,"Referência: AGETOP - 41004"]
["S",2,"S",0,5,3,0,0,0,0,0,"","Serviço","Serviço","-","SINAPI",72898,"CARGA E DESCARGA MECANIZADAS DE ENTULHO EM CAMINHAO BASCULANTE 6 M3","M3",40,null,null,0,"Referência: AGETOP - 41005"]
["S",2,"S",0,5,3,0,0,0,0,0,"","Serviço","Serviço","-","AGETOP",41012,"INDENIZAÇÃO DE JAZIDA","m3    ",40,null,null,0,""]
["S",2,"S",0,5,3,0,0,0,0,0,"","Serviço","Serviço","-","AGETOP",41006,"TRANSPORTE DE MATERIAL ESCAVADO M3.KM","m3km  ",400,null,null,0,""]
["S",2,"S",0,5,3,0,0,0,0,0,"","Serviço","Serviço","-","SINAPI","74005/2","COMPACTACAO MECANICA C/ CONTROLE DO GC>=95% DO PN (AREAS) (C/MONIVELADORA 140 HP E ROLO COMPRESSOR VIBRATORIO 80 HP)","M3",32,null,null,0,"Referência: AGETOP - 41008"]
[2,2,2,11,5,4,0,0,0,106,11,"","Nível 2","Nível 2","-","SINAPI",null,"FUNDAÇÕES E SONDAGENS","-",null,null,null,0,""]
[3,3,3,10,5,4,1,0,0,10,19,"","Nível 3","Nível 3","-","SINAPI",null,"ESTACAS E BLOCOS","-",null,null,null,0,""]
["S",3,"S",0,5,4,1,0,0,0,0,"","Serviço","Serviço","-","SINAPI",98230,"ESTACA BROCA DE CONCRETO, DIÂMETRO DE 30 CM, PROFUNDIDADE DE ATÉ 3 M, ESCAVAÇÃO MANUAL COM TRADO CONCHA, NÃO ARMADA. AF_03/2018","M",103.5,null,null,0,"Referência: AGETOP - 50302"]
["S",3,"S",0,5,4,1,0,0,0,0,"","Serviço","Serviço","-","SINAPI",96522,"ESCAVAÇÃO MANUAL PARA BLOCO DE COROAMENTO OU SAPATA, SEM PREVISÃO DE FÔRMA. AF_06/2017","M3",7.19,null,null,0,"Referência: AGETOP - 50901"]
["S",3,"S",0,5,4,1,0,0,0,0,"","Serviço","Serviço","-","SINAPI",96995,"REATERRO MANUAL APILOADO COM SOQUETE. AF_10/2017","M3",3.29,null,null,0,"Referência: AGETOP - 40902"]
["S",3,"S",0,5,4,1,0,0,0,0,"","Serviço","Serviço","-","SINAPI",94963,"CONCRETO FCK = 15MPA, TRAÇO 1:3,4:3,5 (CIMENTO/ AREIA MÉDIA/ BRITA 1)  - PREPARO MECÂNICO COM BETONEIRA 400 L. AF_07/2016","M3",3.9000000000000004,null,null,0,""]
["S",3,"S",0,5,4,1,0,0,0,0,"","Serviço","Serviço","-","SINAPI","74157/4","LANCAMENTO/APLICACAO MANUAL DE CONCRETO EM FUNDACOES","M3",3.9000000000000004,null,null,0,"Referência: AGETOP - 51055"]
["S",3,"S",0,5,4,1,0,0,0,0,"","Serviço","Serviço","-","SINAPI",96544,"ARMAÇÃO DE BLOCO, VIGA BALDRAME OU SAPATA UTILIZANDO AÇO CA-50 DE 6,3 MM - MONTAGEM. AF_06/2017","KG",67.27,null,null,0,"Referência: AGETOP - 52003"]
["S",3,"S",0,5,4,1,0,0,0,0,"","Serviço","Serviço","-","SINAPI",96545,"ARMAÇÃO DE BLOCO, VIGA BALDRAME OU SAPATA UTILIZANDO AÇO CA-50 DE 8 MM - MONTAGEM. AF_06/2017","KG",136.36000000000001,null,null,0,"Referência: AGETOP - 52004"]
["S",3,"S",0,5,4,1,0,0,0,0,"","Serviço","Serviço","-","SINAPI",96546,"ARMAÇÃO DE BLOCO, VIGA BALDRAME OU SAPATA UTILIZANDO AÇO CA-50 DE 10 MM - MONTAGEM. AF_06/2017","KG",55.45,null,null,0,"Referência: AGETOP - 52005"]
["S",3,"S",0,5,4,1,0,0,0,0,"","Serviço","Serviço","-","SINAPI",96543,"ARMAÇÃO DE BLOCO, VIGA BALDRAME E SAPATA UTILIZANDO AÇO CA-60 DE 5 MM - MONTAGEM. AF_06/2017","KG",38.18,null,null,0,"Referência: AGETOP - 52014"]
[2,2,2,27,5,5,0,0,0,95,27,"","Nível 2","Nível 2","-","SINAPI",null,"ESTRUTURA","-",null,null,null,0,""]
[3,3,3,8,5,5,1,0,0,{"$f":"IF(OR($C427=\"S\",$C427=0),0,MATCH(0,OFFSET($D427,1,$C427,ROW($C$521)-ROW($C427)),0))","v":26},{"$f":"IF(OR($C427=\"S\",$C427=0),0,MATCH(OFFSET($D427,0,$C427)+1,OFFSET($D427,1,$C427,ROW($C$521)-ROW($C427)),0))","v":8},"","Nível 3","Nível 3","-","SINAPI",null,"VIGAS BALDRAMES","-",null,null,null,0,""]
["S",3,"S",0,5,5,1,0,0,0,0,"","Serviço","Serviço","-","SINAPI",96527,"ESCAVAÇÃO MANUAL DE VALA PARA VIGA BALDRAME, COM PREVISÃO DE FÔRMA. AF_06/2017","M3",9.94,null,null,0,"Referência: AGETOP - 40101"]
["S",3,"S",0,5,5,1,0,0,0,0,"","Serviço","Serviço","-","SINAPI",96995,"REATERRO MANUAL APILOADO COM SOQUETE. AF_10/2017","M3",5.69,null,null,0,"Referência: AGETOP - 40902"]
["S",3,"S",0,5,5,1,0,0,0,0,"","Serviço","Serviço","-","AGETOP",60191,"FORMA DE TABUA CINTA BALDRAME U=8 VEZES","m2    ",75.67,null,null,0,""]
["S",3,"S",0,5,5,1,0,0,0,0,"","Serviço","Serviço","-","SINAPI",94963,"CONCRETO FCK = 15MPA, TRAÇO 1:3,4:3,5 (CIMENTO/ AREIA MÉDIA/ BRITA 1)  - PREPARO MECÂNICO COM BETONEIRA 400 L. AF_07/2016","M3",4.25,null,null,0,""]
["S",3,"S",0,5,5,1,0,0,0,0,"","Serviço","Serviço","-","SINAPI","74157/4","LANCAMENTO/APLICACAO MANUAL DE CONCRETO EM FUNDACOES","M3",4.25,null,null,0,"Referência: AGETOP - 51055"]
["S",3,"S",0,5,5,1,0,0,0,0,"","Serviço","Serviço","-","SINAPI",96545,"ARMAÇÃO DE BLOCO, VIGA BALDRAME OU SAPATA UTILIZANDO AÇO CA-50 DE 8 MM - MONTAGEM. AF_06/2017","KG",173.64,null,null,0,"Referência: AGETOP - 52004"]
["S",3,"S",0,5,5,1,0,0,0,0,"","Serviço","Serviço","-","SINAPI",96543,"ARMAÇÃO DE BLOCO, VIGA BALDRAME E SAPATA UTILIZANDO AÇO CA-60 DE 5 MM - MONTAGEM. AF_06/2017","KG",97.27,null,null,0,"Referência: AGETOP - 52014"]
[3,3,3,6,5,5,2,0,0,18,6,"","Nível 3","Nível 3","-","SINAPI",null,"PILARES","-",null,null,null,0,""]
["S",3,"S",0,5,5,2,0,0,0,0,"","Serviço","Serviço","-","SINAPI",92426,"MONTAGEM E DESMONTAGEM DE FÔRMA DE PILARES RETANGULARES E ESTRUTURAS SIMILARES COM ÁREA MÉDIA DAS SEÇÕES MENOR OU IGUAL A 0,25 M², PÉ-DIREITO SIMPLES, EM CHAPA DE MADEIRA COMPENSADA RESINADA, 8 UTILIZAÇÕES. AF_12/2015","M2",38.19,null,null,0,""]
["S",3,"S",0,5,5,2,0,0,0,0,"","Serviço","Serviço","-","SINAPI",94964,"CONCRETO FCK = 20MPA, TRAÇO 1:2,7:3 (CIMENTO/ AREIA MÉDIA/ BRITA 1)  - PREPARO MECÂNICO COM BETONEIRA 400 L. AF_07/2016","M3",1.82,null,null,0,""]
["S",3,"S",0,5,5,2,0,0,0,0,"","Serviço","Serviço","-","SINAPI",92873,"LANÇAMENTO COM USO DE BALDES, ADENSAMENTO E ACABAMENTO DE CONCRETO EM ESTRUTURAS. AF_12/2015","M3",1.82,null,null,0,"Referência: AGETOP - 60801"]
["S",3,"S",0,5,5,2,0,0,0,0,"","Serviço","Serviço","-","SINAPI",92778,"ARMAÇÃO DE PILAR OU VIGA DE UMA ESTRUTURA CONVENCIONAL DE CONCRETO ARMADO EM UMA EDIFICAÇÃO TÉRREA OU SOBRADO UTILIZANDO AÇO CA-50 DE 10,0 MM - MONTAGEM. AF_12/2015","KG",161.82,null,null,0,"Referência: AGETOP - 60305"]
["S",3,"S",0,5,5,2,0,0,0,0,"","Serviço","Serviço","-","SINAPI",92775,"ARMAÇÃO DE PILAR OU VIGA DE UMA ESTRUTURA CONVENCIONAL DE CONCRETO ARMADO EM UMA EDIFICAÇÃO TÉRREA OU SOBRADO UTILIZANDO AÇO CA-60 DE 5,0 MM - MONTAGEM. AF_12/2015","KG",55.45,null,null,0,"Referência: AGETOP - 60314"]
[3,3,3,8,5,5,3,0,0,12,8,"","Nível 3","Nível 3","-","SINAPI",null,"VIGAS DE COBERTURA","-",null,null,null,0,""]
["S",3,"S",0,5,5,3,0,0,0,0,"","Serviço","Serviço","-","SINAPI",92464,"MONTAGEM E DESMONTAGEM DE FÔRMA DE VIGA, ESCORAMENTO METÁLICO, PÉ-DIREITO SIMPLES, EM CHAPA DE MADEIRA RESINADA, 8 UTILIZAÇÕES. AF_12/2015","M2",68.47,null,null,0,"Referência: AGETOP - 60209"]
["S",3,"S",0,5,5,3,0,0,0,0,"","Serviço","Serviço","-","SINAPI",94964,"CONCRETO FCK = 20MPA, TRAÇO 1:2,7:3 (CIMENTO/ AREIA MÉDIA/ BRITA 1)  - PREPARO MECÂNICO COM BETONEIRA 400 L. AF_07/2016","M3",4.08,null,null,0,""]
["S",3,"S",0,5,5,3,0,0,0,0,"","Serviço","Serviço","-","SINAPI",92873,"LANÇAMENTO COM USO DE BALDES, ADENSAMENTO E ACABAMENTO DE CONCRETO EM ESTRUTURAS. AF_12/2015","M3",4.08,null,null,0,"Referência: AGETOP - 60801"]
["S",3,"S",0,5,5,3,0,0,0,0,"","Serviço","Serviço","-","SINAPI",92777,"ARMAÇÃO DE PILAR OU VIGA DE UMA ESTRUTURA CONVENCIONAL DE CONCRETO ARMADO EM UMA EDIFICAÇÃO TÉRREA OU SOBRADO UTILIZANDO AÇO CA-50 DE 8,0 MM - MONTAGEM. AF_12/2015","KG",52.73,null,null,0,"Referência: AGETOP - 60304"]
["S",3,"S",0,5,5,3,0,0,0,0,"","Serviço","Serviço","-","SINAPI",92778,"ARMAÇÃO DE PILAR OU VIGA DE UMA ESTRUTURA CONVENCIONAL DE CONCRETO ARMADO EM UMA EDIFICAÇÃO TÉRREA OU SOBRADO UTILIZANDO AÇO CA-50 DE 10,0 MM - MONTAGEM. AF_12/2015","KG",159.09,null,null,0,"Referência: AGETOP - 60305"]
["S",3,"S",0,5,5,3,0,0,0,0,"","Serviço","Serviço","-","SINAPI",92779,"ARMAÇÃO DE PILAR OU VIGA DE UMA ESTRUTURA CONVENCIONAL DE CONCRETO ARMADO EM UMA EDIFICAÇÃO TÉRREA OU SOBRADO UTILIZANDO AÇO CA-50 DE 12,5 MM - MONTAGEM. AF_12/2015","KG",51.82,null,null,0,""]
["S",3,"S",0,5,5,3,0,0,0,0,"","Serviço","Serviço","-","SINAPI",92775,"ARMAÇÃO DE PILAR OU VIGA DE UMA ESTRUTURA CONVENCIONAL DE CONCRETO ARMADO EM UMA EDIFICAÇÃO TÉRREA OU SOBRADO UTILIZANDO AÇO CA-60 DE 5,0 MM - MONTAGEM. AF_12/2015","KG",67.27,null,null,0,"Referência: AGETOP - 60314"]
[3,3,3,2,5,5,4,0,0,4,2,"","Nível 3","Nível 3","-","SINAPI",null,"LAJE","-",null,null,null,0,""]
["S",3,"S",0,5,5,4,0,0,0,0,"","Serviço","Serviço","-","SINAPI","74202/1","LAJE PRE-MOLDADA P/FORRO, SOBRECARGA 100KG/M2, VAOS ATE 3,50M/E=8CM, C/LAJOTAS E CAP.C/CONC FCK=20MPA, 3CM, INTER-EIXO 38CM, C/ESCORAMENTO (REAPR.3X) E FERRAGEM NEGATIVA","M2",156.28,null,null,0,""]
[3,3,3,2,5,5,5,0,0,2,{"$error":"#N/A"},"","Nível 3","Nível 3","-","SINAPI",null,"EXTRAS","-",null,null,null,0,""]
["S",3,"S",0,5,5,5,0,0,0,0,"","Serviço","Serviço","-","SINAPI","74022/30","ENSAIO DE RESISTENCIA A COMPRESSAO SIMPLES - CONCRETO","UN",6,null,null,0,"Referência: AGETOP - 50251"]
[2,2,2,25,5,6,0,0,0,68,25,"","Nível 2","Nível 2","-","SINAPI",null,"INSTALAÇÕES ELÉTRICAS","-",null,null,null,0,""]
["S",2,"S",0,5,6,0,0,0,0,0,"","Serviço","Serviço","-","SINAPI",91927,"CABO DE COBRE FLEXÍVEL ISOLADO, 2,5 MM², ANTI-CHAMA 0,6/1,0 KV, PARA CIRCUITOS TERMINAIS - FORNECIMENTO E INSTALAÇÃO. AF_12/2015","M",900,null,null,0,"Referência: AGETOP - 70581"]
["S",2,"S",0,5,6,0,0,0,0,0,"","Serviço","Serviço","-","SINAPI",91928,"CABO DE COBRE FLEXÍVEL ISOLADO, 4 MM², ANTI-CHAMA 450/750 V, PARA CIRCUITOS TERMINAIS - FORNECIMENTO E INSTALAÇÃO. AF_12/2015","M",500,null,null,0,""]
["S",2,"S",0,5,6,0,0,0,0,0,"","Serviço","Serviço","-","SINAPI",83446,"CAIXA DE PASSAGEM 30X30X40 COM TAMPA E DRENO BRITA","UN",1,null,null,0,""]
["S",2,"S",0,5,6,0,0,0,0,0,"","Serviço","Serviço","-","SINAPI",91936,"CAIXA OCTOGONAL 4\" X 4\", PVC, INSTALADA EM LAJE - FORNECIMENTO E INSTALAÇÃO. AF_12/2015","UN",15,null,null,0,""]
["S",2,"S",0,5,6,0,0,0,0,0,"","Serviço","Serviço","-","SINAPI",92867,"CAIXA RETANGULAR 4\" X 2\" ALTA (2,00 M DO PISO), METÁLICA, INSTALADA EM PAREDE - FORNECIMENTO E INSTALAÇÃO. AF_12/2015","UN",6,null,null,0,""]
["S",2,"S",0,5,6,0,0,0,0,0,"","Serviço","Serviço","-","SINAPI",92867,"CAIXA RETANGULAR 4\" X 2\" ALTA (2,00 M DO PISO), METÁLICA, INSTALADA EM PAREDE - FORNECIMENTO E INSTALAÇÃO. AF_12/2015","UN",4,null,null,0,""]
["S",2,"S",0,5,6,0,0,0,0,0,"","Serviço","Serviço","-","SINAPI",92869,"CAIXA RETANGULAR 4\" X 2\" BAIXA (0,30 M DO PISO), METÁLICA, INSTALADA EM PAREDE - FORNECIMENTO E INSTALAÇÃO. AF_12/2015","UN",9,null,null,0,""]
["S",2,"S",0,5,6,0,0,0,0,0,"","Serviço","Serviço","-","SINAPI",91914,"CURVA 90 GRAUS PARA ELETRODUTO, PVC, ROSCÁVEL, DN 25 MM (3/4\"), PARA CIRCUITOS TERMINAIS, INSTALADA EM PAREDE - FORNECIMENTO E INSTALAÇÃO. AF_12/2015","UN",6,null,null,0,""]
["S",2,"S",0,5,6,0,0,0,0,0,"","Serviço","Serviço","-","SINAPI",93655,"DISJUNTOR MONOPOLAR TIPO DIN, CORRENTE NOMINAL DE 20A - FORNECIMENTO E INSTALAÇÃO. AF_04/2016","UN",2,null,null,0,""]
["S",2,"S",0,5,6,0,0,0,0,0,"","Serviço","Serviço","-","SINAPI",93656,"DISJUNTOR MONOPOLAR TIPO DIN, CORRENTE NOMINAL DE 25A - FORNECIMENTO E INSTALAÇÃO. AF_04/2016","UN",6,null,null,0,""]
["S",2,"S",0,5,6,0,0,0,0,0,"","Serviço","Serviço","-","SINAPI",93671,"DISJUNTOR TRIPOLAR TIPO DIN, CORRENTE NOMINAL DE 32A - FORNECIMENTO E INSTALAÇÃO. AF_04/2016","UN",1,null,null,0,"Referência: AGETOP - 71173"]
["S",2,"S",0,5,6,0,0,0,0,0,"","Serviço","Serviço","-","SINAPI",91871,"ELETRODUTO RÍGIDO ROSCÁVEL, PVC, DN 25 MM (3/4\"), PARA CIRCUITOS TERMINAIS, INSTALADO EM PAREDE - FORNECIMENTO E INSTALAÇÃO. AF_12/2015","M",135,null,null,0,"Referência: AGETOP - 71201"]
["S",2,"S",0,5,6,0,0,0,0,0,"","Serviço","Serviço","-","SINAPI",91872,"ELETRODUTO RÍGIDO ROSCÁVEL, PVC, DN 32 MM (1\"), PARA CIRCUITOS TERMINAIS, INSTALADO EM PAREDE - FORNECIMENTO E INSTALAÇÃO. AF_12/2015","M",45,null,null,0,"Referência: AGETOP - 71202"]
["S",2,"S",0,5,6,0,0,0,0,0,"","Serviço","Serviço","-","SINAPI",91873,"ELETRODUTO RÍGIDO ROSCÁVEL, PVC, DN 40 MM (1 1/4\"), PARA CIRCUITOS TERMINAIS, INSTALADO EM PAREDE - FORNECIMENTO E INSTALAÇÃO. AF_12/2015","M",9,null,null,0,""]
["S",2,"S",0,5,6,0,0,0,0,0,"","Serviço","Serviço","-","SINAPI",91953,"INTERRUPTOR SIMPLES (1 MÓDULO), 10A/250V, INCLUINDO SUPORTE E PLACA - FORNECIMENTO E INSTALAÇÃO. AF_12/2015","UN",4,null,null,0,"Referência: AGETOP - 71440"]
["S",2,"S",0,5,6,0,0,0,0,0,"","Serviço","Serviço","-","SINAPI",97610,"LÂMPADA COMPACTA DE LED 10 W, BASE E27 - FORNECIMENTO E INSTALAÇÃO. AF_11/2017","UN",45,null,null,0,""]
["S",2,"S",0,5,6,0,0,0,0,0,"","Serviço","Serviço","-","SINAPI",97591,"LUMINÁRIA TIPO PLAFON REDONDO COM VIDRO FOSCO, DE SOBREPOR, COM 2 LÂMPADAS DE 15 W - FORNECIMENTO E INSTALAÇÃO. AF_11/2017","UN",18,null,null,0,""]
["S",2,"S",0,5,6,0,0,0,0,0,"","Serviço","Serviço","-","SINAPI",97593,"LUMINÁRIA TIPO SPOT, DE SOBREPOR, COM 1 LÂMPADA DE 15 W - FORNECIMENTO E INSTALAÇÃO. AF_11/2017","UN",9,null,null,0,"Referência: AGETOP - 71688"]
["S",2,"S",0,5,6,0,0,0,0,0,"","Serviço","Serviço","-","SINAPI",91884,"LUVA PARA ELETRODUTO, PVC, ROSCÁVEL, DN 25 MM (3/4\"), PARA CIRCUITOS TERMINAIS, INSTALADA EM PAREDE - FORNECIMENTO E INSTALAÇÃO. AF_12/2015","UN",45,null,null,0,"Referência: AGETOP - 71741"]
["S",2,"S",0,5,6,0,0,0,0,0,"","Serviço","Serviço","-","SINAPI",91885,"LUVA PARA ELETRODUTO, PVC, ROSCÁVEL, DN 32 MM (1\"), PARA CIRCUITOS TERMINAIS, INSTALADA EM PAREDE - FORNECIMENTO E INSTALAÇÃO. AF_12/2015","UN",15,null,null,0,"Referência: AGETOP - 71742"]
["S",2,"S",0,5,6,0,0,0,0,0,"","Serviço","Serviço","-","SINAPI",91886,"LUVA PARA ELETRODUTO, PVC, ROSCÁVEL, DN 40 MM (1 1/4\"), PARA CIRCUITOS TERMINAIS, INSTALADA EM PAREDE - FORNECIMENTO E INSTALAÇÃO. AF_12/2015","UN",3,null,null,0,""]
["S",2,"S",0,5,6,0,0,0,0,0,"","Serviço","Serviço","-","SINAPI",83463,"QUADRO DE DISTRIBUICAO DE ENERGIA EM CHAPA DE ACO GALVANIZADO, PARA 12 DISJUNTORES TERMOMAGNETICOS MONOPOLARES, COM BARRAMENTO TRIFASICO E NEUTRO - FORNECIMENTO E INSTALACAO","UN",1,null,null,0,""]
["S",2,"S",0,5,6,0,0,0,0,0,"","Serviço","Serviço","-","SINAPI",91998,"TOMADA BAIXA DE EMBUTIR (1 MÓDULO), 2P+T 10 A, SEM SUPORTE E SEM PLACA - FORNECIMENTO E INSTALAÇÃO. AF_12/2015","UN",9,null,null,0,""]
["S",2,"S",0,5,6,0,0,0,0,0,"","Serviço","Serviço","-","SINAPI",91991,"TOMADA ALTA DE EMBUTIR (1 MÓDULO), 2P+T 20 A, SEM SUPORTE E SEM PLACA - FORNECIMENTO E INSTALAÇÃO. AF_12/2015","UN",6,null,null,0,""]
[2,2,2,3,5,7,0,0,0,43,3,"","Nível 2","Nível 2","-","AGETOP",null,"ALVENARIAS E DIVISÓRIAS","-",null,null,null,0,""]
["S",2,"S",0,5,7,0,0,0,0,0,"","Serviço","Serviço","-","SINAPI",87503,"ALVENARIA DE VEDAÇÃO DE BLOCOS CERÂMICOS FURADOS NA HORIZONTAL DE 9X19X19CM (ESPESSURA 9CM) DE PAREDES COM ÁREA LÍQUIDA MAIOR OU IGUAL A 6M² SEM VÃOS E ARGAMASSA DE ASSENTAMENTO COM PREPARO EM BETONEIRA. AF_06/2014","M2",184.73,null,null,0,"Referência: AGETOP - 100201"]
["S",2,"S",0,5,7,0,0,0,0,0,"","Serviço","Serviço","-","SINAPI",93201,"FIXAÇÃO (ENCUNHAMENTO) DE ALVENARIA DE VEDAÇÃO COM ARGAMASSA APLICADA COM COLHER. AF_03/2016","M",72.900000000000006,null,null,0,""]
[2,2,2,2,5,8,0,0,0,40,2,"","Nível 2","Nível 2","-",null,null,"IMPERMEABILIZAÇÃO","-",null,null,null,0,""]
["S",2,"S",0,5,8,0,0,0,0,0,"","Serviço","Serviço","-","SINAPI","74106/1","IMPERMEABILIZACAO DE ESTRUTURAS ENTERRADAS, COM TINTA ASFALTICA, DUAS DEMAOS.","M2",72.900000000000006,null,null,0,""]
[2,2,2,2,5,9,0,0,0,38,2,"","Nível 2","Nível 2","-",null,null,"ESTRUTURAS METÁLICAS","-",null,null,null,0,""]
["S",2,"S",0,5,9,0,0,0,0,0,"","Serviço","Serviço","-","AGETOP",150103,"ESTRUTURA METÁLICA CONVENCIONAL EM AÇO DO TIPO USI SAC-300 COM FUNDO ANTICORROSIVO","Kg    ",3844.01,null,null,0,""]
[{"$f":"CHOOSE(1+LOG(1+2*(ORÇAMENTO.Nivel=\"Nível 1\")+4*(ORÇAMENTO.Nivel=\"Nível 2\")+8*(ORÇAMENTO.Nivel=\"Nível 3\")+16*(ORÇAMENTO.Nivel=\"Nível 4\")+32*(ORÇAMENTO.Nivel=\"Serviço\"),2),0,1,2,3,4,\"S\")","v":2},{"$f":"IF(OR(C485=\"s\",C485=0),OFFSET(B485,-1,0),C485)","v":2},{"$f":"IF(OFFSET(C485,-1,0)=\"L\",1,IF(OFFSET(C485,-1,0)=1,2,IF(OR(A485=\"s\",A485=0),\"S\",IF(AND(OFFSET(C485,-1,0)=2,A485=4),3,IF(AND(OR(OFFSET(C485,-1,0)=\"s\",OFFSET(C485,-1,0)=0),A485<>\"s\",A485>OFFSET(B485,-1,0)),OFFSET(B485,-1,0),A485)))))","v":2},{"$f":"IF(OR(C485=\"S\",C485=0),0,IF(ISERROR(K485),J485,SMALL(J485:K485,1)))","v":4},{"$f":"IF($C485=1,OFFSET(E485,-1,0)+1,OFFSET(E485,-1,0))","v":5},{"$f":"IF($C485=1,0,IF($C485=2,OFFSET(F485,-1,0)+1,OFFSET(F485,-1,0)))","v":10},{"$f":"IF(AND($C485<=2,$C485<>0),0,IF($C485=3,OFFSET(G485,-1,0)+1,OFFSET(G485,-1,0)))","v":0},{"$f":"IF(AND($C485<=3,$C485<>0),0,IF($C485=4,OFFSET(H485,-1,0)+1,OFFSET(H485,-1,0)))","v":0},{"$f":"IF(AND($C485<=4,$C485<>0),0,IF(AND($C485=\"S\",$W485>0),OFFSET(I485,-1,0)+1,OFFSET(I485,-1,0)))","v":0},36,4,"","Nível 2","Nível 2","-",null,null,"COBERTURAS","-",null,null,null,0,""]
["S",2,"S",0,5,10,0,0,0,0,0,"","Serviço","Serviço","-","SINAPI",94445,"TELHAMENTO COM TELHA CERÂMICA CAPA-CANAL, TIPO PLAN, COM ATÉ 2 ÁGUAS, INCLUSO TRANSPORTE VERTICAL. AF_06/2016","M2",235.69,null,null,0,"Referência: AGETOP - 160401"]
["S",2,"S",0,5,10,0,0,0,0,0,"","Serviço","Serviço","-","SINAPI",94221,"CUMEEIRA PARA TELHA CERÂMICA EMBOÇADA COM ARGAMASSA TRAÇO 1:2:9 (CIMENTO, CAL E AREIA) PARA TELHADOS COM ATÉ 2 ÁGUAS, INCLUSO TRANSPORTE VERTICAL. AF_06/2016","M",24.05,null,null,0,""]
["S",2,"S",0,5,10,0,0,0,0,0,"","Serviço","Serviço","-","SINAPI",94224,"EMBOÇAMENTO COM ARGAMASSA TRAÇO 1:2:9 (CIMENTO, CAL E AREIA). AF_06/2016","M",62.1,null,null,0,"Referência: AGETOP - 160403"]
[2,2,2,4,5,11,0,0,0,32,4,"","Nível 2","Nível 2","-",null,null,"ESQUADRIAS METÁLICAS","-",null,null,null,0,""]
["S",2,"S",0,5,11,0,0,0,0,0,"","Serviço","Serviço","-","SINAPI",94562,"JANELA DE AÇO DE CORRER, 4 FOLHAS, FIXAÇÃO COM ARGAMASSA, SEM VIDROS, PADRONIZADA. AF_07/2016","M2",14.4,null,null,0,"Referência: AGETOP - 180401"]
["S",2,"S",0,5,11,0,0,0,{"$f":"IF(OR($C491=\"S\",$C491=0),0,MATCH(0,OFFSET($D491,1,$C491,ROW($C$521)-ROW($C491)),0))","v":0},{"$f":"IF(OR($C491=\"S\",$C491=0),0,MATCH(OFFSET($D491,0,$C491)+1,OFFSET($D491,1,$C491,ROW($C$521)-ROW($C491)),0))","v":0},"","Serviço","Serviço","-","SINAPI",94559,"JANELA DE AÇO BASCULANTE, FIXAÇÃO COM ARGAMASSA, SEM VIDROS, PADRONIZADA. AF_07/2016","M2",7.2,null,null,0,"Referência: AGETOP - 180404"]
["S",2,"S",0,5,11,0,0,0,0,0,"","Serviço","Serviço","-","SINAPI","73933/4","PORTA DE FERRO DE ABRIR TIPO BARRA CHATA, COM REQUADRO E GUARNICAO COMPLETA","M2",5.04,null,null,0,"Referência: AGETOP - 180501"]
[2,2,2,2,5,12,0,0,0,28,2,"","Nível 2","Nível 2","-",null,null,"VIDROS","-",null,null,null,0,""]
["S",2,"S",0,5,12,0,0,0,0,0,"","Serviço","Serviço","-","SINAPI",72117,"VIDRO LISO COMUM TRANSPARENTE, ESPESSURA 4MM","M2",21.6,null,null,0,"Referência: AGETOP - 190102"]
[2,2,2,4,5,13,0,0,0,26,4,"","Nível 2","Nível 2","-",null,null,"REVESTIMENTO DE PAREDE","-",null,null,null,0,""]
["S",2,"S",0,5,13,0,0,0,0,0,"","Serviço","Serviço","-","SINAPI",87879,"CHAPISCO APLICADO EM ALVENARIAS E ESTRUTURAS DE CONCRETO INTERNAS, COM COLHER DE PEDREIRO.  ARGAMASSA TRAÇO 1:3 COM PREPARO EM BETONEIRA 400L. AF_06/2014","M2",369.45,null,null,0,""]
["S",2,"S",0,5,13,0,0,0,0,0,"","Serviço","Serviço","-","SINAPI",87548,"MASSA ÚNICA, PARA RECEBIMENTO DE PINTURA, EM ARGAMASSA TRAÇO 1:2:8, PREPARO MANUAL, APLICADA MANUALMENTE EM FACES INTERNAS DE PAREDES, ESPESSURA DE 10MM, COM EXECUÇÃO DE TALISCAS. AF_06/2014","M2",369.45,null,null,0,"Referência: AGETOP - 200500"]
["S",2,"S",0,5,13,0,0,0,0,0,"","Serviço","Serviço","-","SINAPI",84088,"PEITORIL EM MARMORE BRANCO, LARGURA DE 15CM, ASSENTADO COM ARGAMASSA TRACO 1:4 (CIMENTO E AREIA MEDIA), PREPARO MANUAL DA ARGAMASSA","M",24,null,null,0,""]
[2,2,2,2,5,14,0,0,0,22,2,"","Nível 2","Nível 2","-",null,null,"FORROS","-",null,null,null,0,""]
["S",2,"S",0,5,14,0,0,0,0,0,"","Serviço","Serviço","-","SINAPI",87414,"APLICAÇÃO MANUAL DE GESSO DESEMPENADO (SEM TALISCAS) EM TETO DE AMBIENTES DE ÁREA MAIOR QUE 10M², ESPESSURA DE 1,0CM. AF_06/2014","M2",156.28,null,null,0,"Referência: AGETOP - 210515"]
[2,2,2,5,5,15,0,0,0,20,5,"","Nível 2","Nível 2","-","SINAPI",null,"REVESTIMENTO DE PISO","-",null,null,null,0,""]
["S",2,"S",0,5,15,0,0,0,0,0,"","Serviço","Serviço","-","SINAPI",95240,"LASTRO DE CONCRETO MAGRO, APLICADO EM PISOS OU RADIERS, ESPESSURA DE 3 CM. AF_07/2016","M2",228.96,null,null,0,""]
["S",2,"S",0,5,15,0,0,0,0,0,"","Serviço","Serviço","-","SINAPI",94992,"EXECUÇÃO DE PASSEIO (CALÇADA) OU PISO DE CONCRETO COM CONCRETO MOLDADO IN LOCO, FEITO EM OBRA, ACABAMENTO CONVENCIONAL, ESPESSURA 6 CM, ARMADO. AF_07/2016","M2",38.700000000000003,null,null,0,""]
["S",2,"S",0,5,15,0,0,0,0,0,"","Serviço","Serviço","-","SINAPI",84191,"PISO EM GRANILITE, MARMORITE OU GRANITINA ESPESSURA 8 MM, INCLUSO JUNTAS DE DILATACAO PLASTICAS","M2",187.3,null,null,0,"Referência: AGETOP - 221101"]
["S",2,"S",0,5,15,0,0,0,0,0,"","Serviço","Serviço","-","AGETOP",221104,"RASPAGEM E APLICAÇÃO RESINA ACRÍLICA DUAS DEMÃOS","m2    ",187.3,null,null,0,""]
[2,2,2,2,5,16,0,0,0,15,2,"","Nível 2","Nível 2","-","SINAPI",null,"MARCENARIA","-",null,null,null,0,""]
["S",2,"S",0,5,16,0,0,0,0,0,"","Serviço","Serviço","-","AGETOP",240106,"BATE CARTEIRA ENVERNIZADO E ASSENT. 2,5 X 12 CM","M     ",63.9,null,null,0,""]
[2,2,2,10,5,17,0,0,0,13,10,"","Nível 2","Nível 2","-","SINAPI",null,"PINTURA","-",null,null,null,0,""]
["S",2,"S",0,5,17,0,0,0,0,0,"","Serviço","Serviço","-","SINAPI","74145/1","PINTURA ESMALTE FOSCO, DUAS DEMAOS, SOBRE SUPERFICIE METALICA, INCLUSO UMA DEMAO DE FUNDO ANTICORROSIVO. UTILIZACAO DE REVOLVER ( AR-COMPRIMIDO).","M2",235.69,null,null,0,"Referência: AGETOP - 261602"]
["S",2,"S",0,5,17,0,0,0,0,0,"","Serviço","Serviço","-","SINAPI",88423,"APLICAÇÃO MANUAL DE PINTURA COM TINTA TEXTURIZADA ACRÍLICA EM PAREDES EXTERNAS DE CASAS, UMA COR. AF_06/2014","M2",120.24,null,null,0,"Referência: AGETOP - 260601"]
["S",2,"S",0,5,17,0,0,0,0,0,"","Serviço","Serviço","-","SINAPI",88489,"APLICAÇÃO MANUAL DE PINTURA COM TINTA LÁTEX ACRÍLICA EM PAREDES, DUAS DEMÃOS. AF_06/2014","M2",124.94999999999996,null,null,0,"Referência: AGETOP - 261001"]
["S",2,"S",0,5,17,0,0,0,0,0,"","Serviço","Serviço","-","SINAPI",88497,"APLICAÇÃO E LIXAMENTO DE MASSA LÁTEX EM PAREDES, DUAS DEMÃOS. AF_06/2014","M2",258.88,null,null,0,"Referência: AGETOP - 261300"]
["S",2,"S",0,5,17,0,0,0,0,0,"","Serviço","Serviço","-","AGETOP",261550,"PINT.ESMALTE SINT.PAREDES - 2 DEM.C/SELADOR","m2    ",133.93,null,null,0,""]
["S",2,"S",0,5,17,0,0,0,0,0,"","Serviço","Serviço","-","SINAPI",88496,"APLICAÇÃO E LIXAMENTO DE MASSA LÁTEX EM TETO, DUAS DEMÃOS. AF_06/2014","M2",145.53,null,null,0,"Referência: AGETOP - 261300"]
["S",2,"S",0,5,17,0,0,0,0,0,"","Serviço","Serviço","-","SINAPI",88488,"APLICAÇÃO MANUAL DE PINTURA COM TINTA LÁTEX ACRÍLICA EM TETO, DUAS DEMÃOS. AF_06/2014","M2",145.53,null,null,0,""]
["S",2,"S",0,5,17,0,0,0,0,0,"","Serviço","Serviço","-","SINAPI","74145/1","PINTURA ESMALTE FOSCO, DUAS DEMAOS, SOBRE SUPERFICIE METALICA, INCLUSO UMA DEMAO DE FUNDO ANTICORROSIVO. UTILIZACAO DE REVOLVER ( AR-COMPRIMIDO).","M2",53.28,null,null,0,"Referência: AGETOP - 261602"]
["S",2,"S",0,5,17,0,0,0,0,0,"","Serviço","Serviço","-","AGETOP",261623,"LETREIRO PEQ.PORTE A PINCEL EM PAREDE E PORTAS","m2    ",0.95,null,null,0,""]
[2,2,2,3,5,18,0,0,0,3,{"$error":"#N/A"},"","Nível 2","Nível 2","-","SINAPI",null,"DIVERSOS","-",null,null,null,0,""]
["S",2,"S",0,5,18,0,0,0,0,0,"","Serviço","Serviço","-","AGETOP",271210,"QUADRO DE GIZ EMBOÇO/PINTURA COMPLETO","m2    ",15.12,null,null,0,""]
["S",2,"S",0,5,18,0,0,0,{"$f":"IF(OR($C520=\"S\",$C520=0),0,MATCH(0,OFFSET($D520,1,$C520,ROW($C$521)-ROW($C520)),0))","v":0},{"$f":"IF(OR($C520=\"S\",$C520=0),0,MATCH(OFFSET($D520,0,$C520)+1,OFFSET($D520,1,$C520,ROW($C$521)-ROW($C520)),0))","v":0},"","Serviço","Serviço","-","AGETOP",270501,"LIMPEZA FINAL DE OBRA - (OBRAS CIVIS)","m2    ",190.26,null,null,0,""]
[-1,null,-1,null,0,0,0,0,0,null,null,"F"]
[null,null,null,null,null,null,null,null,null,null,null,"F",null,null,null,null,null,"OBS: OS QUANTITATIVOS DE MATERIAIS  DAS INSTALAÇÕES HIDROSSANITÁRIAS, ELÉTRICAS E ESPECIAIS SÃO FORNECIDOS PELOS PROFISSIONAIS RESPONSÁVEIS PELOS RESPECTIVOS PROJETOS.",null,null,"VALOR TOTAL",null,0]
[null,null,null,null,null,null,null,null,null,null,null,"F",null,null,null,null,null,null,null,null,"VALOR BDI (21,64%)",null,0]
[null,null,null,null,null,null,null,null,null,null,null,"F",null,null,null,null,null,null,null,null,"TOTAL ORÇAMENTO",null,0]
[null,null,null,null,null,null,null,null,null,null,null,"F"]
[null,null,null,null,null,null,null,null,null,null,null,"F",null,null,null,null,null,null,null,null,"CUSTO POR M2 ³",null,0]
[null,null,null,null,null,null,null,null,null,null,null,"F",null,null,null,null,null,null,null,null,"MATERIAL S/ BDI",null,0]
[null,null,null,null,null,null,null,null,null,null,null,"F",null,null,null,null,null,null,null,null,"MÃO DE OBRA S/ BDI",null,0]
[null,null,null,null,null,null,null,null,null,null,null,"F"]
[null,null,null,null,null,null,null,null,null,null,null,"F",null,null,null,null,"(1) Conforme previsto pelo DECRETO Nº 7.983, DE 8 DE ABRIL DE 2013, os preços adotados são aqueles constantes dos sistemas de referência indicados. Justifica-se o uso dos preços destas composições de custos unitários devido ao seu valor ser menor à mediana de seus correspondentes na tabela SINAPI;"]
[null,null,null,null,null,null,null,null,null,null,null,"F",null,null,null,null,"(2) Optou-se pelo uso das composições de custos da AGETOP para itens não presentes na SINAPI;"]
[null,null,null,null,null,null,null,null,null,null,null,"F",null,null,null,null,"(3) Para itens da AGETOP, os vidros não estão inclusos nas esquadrias e já foram considerados os custos de contramarco para as esquadrias de alumínio;"]
[null,null,null,null,null,null,null,null,null,null,null,"F",null,null,null,null,"(4) Nos casos em que houver execução de granitina e omissão do item AGETOP 221102, considerou-se que o quantitativo para o rodapé, de altura igual a 7cm, foi incorporado na área de piso;"]
[null,null,null,null,null,null,null,null,null,null,null,"F",null,null,null,null,"(5) O custo unitário aproximado por metro quadrado é calculado dividindo-se o valor total do orçamento pela área total de construção."]
[null,null,null,null,null,null,null,null,null,null,null,"F"]
[null,null,null,null,null,null,null,null,null,null,null,"F"]
[]
[null,null,null,null,null,null,null,null,null,null,null,null,null,null,"SOMATÓRIO DE SERVIÇOS"]
[null,null,null,null,null,null,null,null,null,null,null,null,null,null,"ITEM","DESCRIÇÃO DOS SERVIÇOS",null,null,"PREÇO SEM BDI",null,null,"PREÇO COM BDI",null,"PARTICIPAÇÃO ( % )"]
[null,null,null,null,null,null,null,null,null,null,null,null,null,null,"a.","SERVIÇOS PRELIMINARES",null,null,{"$f":"SUMIF($R$19:$R$521,$P540,$W$19:$W$521)","v":0},null,null,{"$f":"ROUND(S540*(1+BDI.Taxa),2)","v":0},null,{"$f":"IFERROR(ROUND($V540*100/$W$524,2),0)","v":0}]
[null,null,null,null,null,null,null,null,null,null,null,null,null,null,"b.","TRANSPORTES",null,null,0,null,null,0,null,{"$f":"IFERROR(ROUND($V541*100/$W$524,2),0)","v":0}]
[null,null,null,null,null,null,null,null,null,null,null,null,null,null,"c.","SERVIÇO EM TERRA",null,null,0,null,null,0,null,0]
[null,null,null,null,null,null,null,null,null,null,null,null,null,null,"d.","FUNDAÇÕES E SONDAGENS",null,null,0,null,null,0,null,0]
[null,null,null,null,null,null,null,null,null,null,null,null,null,null,"e.","ESTRUTURA",null,null,0,null,null,0,null,0]
[null,null,null,null,null,null,null,null,null,null,null,null,null,null,"f.","INSTALAÇÕES ELÉTRICAS",null,null,0,null,null,0,null,0]
[null,null,null,null,null,null,null,null,null,null,null,null,null,null,"g.","INSTALAÇÕES HIDROSSANITÁRIAS",null,null,0,null,null,0,null,0]
[null,null,null,null,null,null,null,null,null,null,null,null,null,null,"h","INSTALAÇÕES ESPECIAIS",null,null,0,null,null,0,null,0]
[null,null,null,null,null,null,null,null,null,null,null,null,null,null,"i.","ALVENARIAS E DIVISÓRIAS",null,null,0,null,null,0,null,0]
[null,null,null,null,null,null,null,null,null,null,null,null,null,null,"j.","ALVENARIA AUTO-PORTANTE",null,null,0,null,null,0,null,0]
[null,null,null,null,null,null,null,null,null,null,null,null,null,null,"k.","IMPERMEABILIZAÇÃO",null,null,0,null,null,0,null,0]
[null,null,null,null,null,null,null,null,null,null,null,null,null,null,"l.","ISOLAMENTO TÉRMICO E ACÚSTICO",null,null,0,null,null,0,null,0]
[null,null,null,null,null,null,null,null,null,null,null,null,null,null,"m.","ESTRUTURA DE MADEIRA",null,null,0,null,null,0,null,0]
[null,null,null,null,null,null,null,null,null,null,null,null,null,null,"n.","ESTRUTURAS METÁLICAS",null,null,0,null,null,0,null,0]
[null,null,null,null,null,null,null,null,null,null,null,null,null,null,"o.","COBERTURAS",null,null,0,null,null,0,null,0]
[null,null,null,null,null,null,null,null,null,null,null,null,null,null,"p.","ESQUADRIAS DE MADEIRA",null,null,0,null,null,0,null,0]
[null,null,null,null,null,null,null,null,null,null,null,null,null,null,"q.","ESQUADRIAS METÁLICAS",null,null,0,null,null,{"$f":"ROUND(S556*(1+BDI.Taxa),2)","v":0},null,0]
[null,null,null,null,null,null,null,null,null,null,null,null,null,null,"r.","VIDROS",null,null,0,null,null,0,null,0]
[null,null,null,null,null,null,null,null,null,null,null,null,null,null,"s.","REVESTIMENTO DE PAREDE",null,null,0,null,null,0,null,0]
[null,null,null,null,null,null,null,null,null,null,null,null,null,null,"t.","FORROS",null,null,0,null,null,0,null,0]
[null,null,null,null,null,null,null,null,null,null,null,null,null,null,"u.","REVESTIMENTO DE PISO",null,null,0,null,null,0,null,0]
[null,null,null,null,null,null,null,null,null,null,null,null,null,null,"v.","FERRAGENS",null,null,0,null,null,0,null,0]
[null,null,null,null,null,null,null,null,null,null,null,null,null,null,"w.","MARCENARIA",null,null,0,null,null,0,null,0]
[null,null,null,null,null,null,null,null,null,null,null,null,null,null,"x.","ADMINISTRAÇÃO",null,null,0,null,null,0,null,0]
[null,null,null,null,null,null,null,null,null,null,null,null,null,null,"y.","PINTURA",null,null,0,null,null,{"$f":"ROUND(S564*(1+BDI.Taxa),2)","v":0},null,0]
[null,null,null,null,null,null,null,null,null,null,null,null,null,null,"z.","DIVERSOS",null,null,0,null,null,{"$f":"IF(S565>0,IF((SUM(V540:W564)+ROUND(S565*(1+BDI.Taxa),2))<>V567,V567-SUM(V540:W564),ROUND(S565*(1+BDI.Taxa),2)),0)","v":0},null,{"$f":"IF(S565>0,IF((SUM(X540:X564)+IFERROR(ROUND($V565*100/$W$524,2),0))<>X567,X567-SUM(X540:X564),IFERROR(ROUND($V565*100/$W$524,2),0)),0)","v":0}]
[null,null,null,null,null,null,null,null,null,null,null,null,null,null,"TOTAL GERAL DO ORÇAMENTO (R$)",null,null,null,{"$f":"SUM(S540:U565)","v":0},null,null,{"$f":"SUM(V540:W565)","v":0},null,{"$f":"SUM(X540:X565)","v":0}]
[null,null,null,null,null,null,null,null,null,null,null,null,null,null,null,null,null,null,{"$f":"$W$522","v":0},null,null,{"$f":"$W$524","v":0},null,100]
[null,null,null,null,null,null,null,null,null,null,null,null,null,null,null,null,null,null,"(TOTAL SEM BDI)",null,null,"(TOTAL COM BDI)",null,"(ARRED porcentagem)"]
[null,null,null,null,null,null,null,null,null,null,null,null,null,null,null,null,null,null,{"$f":"IF(AND(S566=S567,S566>0),\"OK\",\"ERRO\")","v":"ERRO"},null,null,{"$f":"IF(AND(V566=V567,V566>0),\"OK\",\"ERRO\")","v":"ERRO"},null,{"$f":"IF(X566=100,\"OK\",\"ERRO\")","v":"ERRO"}]
[]
[]
[null,null,null,null,null,null,null,null,null,null,null,null,null,null,"RESUMO GERAL DO ORÇAMENTO"]
[null,null,null,null,null,null,null,null,null,null,null,null,null,null,"ITEM","DESCRIÇÃO DOS SERVIÇOS",null,null,"PREÇO SEM BDI",null,null,"PREÇO COM BDI",null,"PARTICIPAÇÃO ( % )"]
[null,null,null,null,null,null,null,null,null,null,null,null,null,null,"1.",{"$f":"IFERROR(VLOOKUP(O574,$O$19:$W$521,4,FALSE),\"\")","v":"REFORMA"},null,null,{"$f":"IF(P575=\"\",$S$595-SUM(OFFSET($S$573:S573,0,0,COUNTA($S$573:S573),1)),SUMIF($R$19:$R$521,$P574,$W$19:$W$521))","v":0},null,null,{"$f":"IF(P575=\"\",$V$595-SUM(OFFSET($V$573:V573,0,0,COUNTA($V$573:V573),1)),ROUND(S574*(1+BDI.Taxa),2))","v":0},null,{"$f":"IF(P575=\"\",$X$595-SUM(OFFSET($X$573:X573,0,0,COUNTA($X$573:X573),1)),ROUND(V574*100/ORÇAMENTO.TotalOrçamento,2))","v":{"$error":"#DIV/0!"}}]
[null,null,null,null,null,null,null,null,null,null,null,null,null,null,"2.","CENTRAL DE GÁS",null,null,{"$f":"IF(P576=\"\",$S$595-SUM(OFFSET($S$573:S574,0,0,COUNTA($S$573:S574),1)),SUMIF($R$19:$R$521,$P575,$W$19:$W$521))","v":0},null,null,{"$f":"IF(P576=\"\",$V$595-SUM(OFFSET($V$573:V574,0,0,COUNTA($V$573:V574),1)),ROUND(S575*(1+BDI.Taxa),2))","v":0},null,{"$f":"IF(P576=\"\",$X$595-SUM(OFFSET($X$573:X574,0,0,COUNTA($X$573:X574),1)),ROUND(V575*100/ORÇAMENTO.TotalOrçamento,2))","v":{"$error":"#DIV/0!"}}]
[null,null,null,null,null,null,null,null,null,null,null,null,null,null,"3.","BLOCO 1 SALA PADRÃO SEDUC 2017 - LAJE",null,null,{"$f":"IF(P577=\"\",$S$595-SUM(OFFSET($S$573:S575,0,0,COUNTA($S$573:S575),1)),SUMIF($R$19:$R$521,$P576,$W$19:$W$521))","v":0},null,null,{"$f":"IF(P577=\"\",$V$595-SUM(OFFSET($V$573:V575,0,0,COUNTA($V$573:V575),1)),ROUND(S576*(1+BDI.Taxa),2))","v":0},null,{"$f":"IF(P577=\"\",$X$595-SUM(OFFSET($X$573:X575,0,0,COUNTA($X$573:X575),1)),ROUND(V576*100/ORÇAMENTO.TotalOrçamento,2))","v":{"$error":"#DIV/0!"}}]
[null,null,null,null,null,null,null,null,null,null,null,null,null,null,"4.","BLOCO 3 SALAS PADRÃO SEDUC 2017 - LAJE",null,null,{"$f":"IF(P578=\"\",$S$595-SUM(OFFSET($S$573:S576,0,0,COUNTA($S$573:S576),1)),SUMIF($R$19:$R$521,$P577,$W$19:$W$521))","v":0},null,null,{"$f":"IF(P578=\"\",$V$595-SUM(OFFSET($V$573:V576,0,0,COUNTA($V$573:V576),1)),ROUND(S577*(1+BDI.Taxa),2))","v":0},null,{"$f":"IF(P578=\"\",$X$595-SUM(OFFSET($X$573:X576,0,0,COUNTA($X$573:X576),1)),ROUND(V577*100/ORÇAMENTO.TotalOrçamento,2))","v":{"$error":"#DIV/0!"}}]
[null,null,null,null,null,null,null,null,null,null,null,null,null,null,"5.","BLOCO 3 SALAS PADRÃO SEDUC 2017 - LAJE.",null,null,{"$f":"IF(P579=\"\",$S$595-SUM(OFFSET($S$573:S577,0,0,COUNTA($S$573:S577),1)),SUMIF($R$19:$R$521,$P578,$W$19:$W$521))","v":0},null,null,{"$f":"IF(P579=\"\",$V$595-SUM(OFFSET($V$573:V577,0,0,COUNTA($V$573:V577),1)),ROUND(S578*(1+BDI.Taxa),2))","v":0},null,{"$f":"IF(P579=\"\",$X$595-SUM(OFFSET($X$573:X577,0,0,COUNTA($X$573:X577),1)),ROUND(V578*100/ORÇAMENTO.TotalOrçamento,2))","v":{"$error":"#DIV/0!"}}]
[null,null,null,null,null,null,null,null,null,null,null,null,null,null,"6.","",null,null,{"$f":"IF(P580=\"\",$S$595-SUM(OFFSET($S$573:S578,0,0,COUNTA($S$573:S578),1)),SUMIF($R$19:$R$521,$P579,$W$19:$W$521))","v":0},null,null,{"$f":"IF(P580=\"\",$V$595-SUM(OFFSET($V$573:V578,0,0,COUNTA($V$573:V578),1)),ROUND(S579*(1+BDI.Taxa),2))","v":0},null,{"$f":"IF(P580=\"\",$X$595-SUM(OFFSET($X$573:X578,0,0,COUNTA($X$573:X578),1)),ROUND(V579*100/ORÇAMENTO.TotalOrçamento,2))","v":{"$error":"#DIV/0!"}}]
[null,null,null,null,null,null,null,null,null,null,null,null,null,null,"7.","",null,null,{"$f":"IF(P581=\"\",$S$595-SUM(OFFSET($S$573:S579,0,0,COUNTA($S$573:S579),1)),SUMIF($R$19:$R$521,$P580,$W$19:$W$521))","v":0},null,null,{"$f":"IF(P581=\"\",$V$595-SUM(OFFSET($V$573:V579,0,0,COUNTA($V$573:V579),1)),ROUND(S580*(1+BDI.Taxa),2))","v":0},null,{"$f":"IF(P581=\"\",$X$595-SUM(OFFSET($X$573:X579,0,0,COUNTA($X$573:X579),1)),ROUND(V580*100/ORÇAMENTO.TotalOrçamento,2))","v":{"$error":"#DIV/0!"}}]
[null,null,null,null,null,null,null,null,null,null,null,null,null,null,"8.","",null,null,{"$f":"IF(P582=\"\",$S$595-SUM(OFFSET($S$573:S580,0,0,COUNTA($S$573:S580),1)),SUMIF($R$19:$R$521,$P581,$W$19:$W$521))","v":0},null,null,{"$f":"IF(P582=\"\",$V$595-SUM(OFFSET($V$573:V580,0,0,COUNTA($V$573:V580),1)),ROUND(S581*(1+BDI.Taxa),2))","v":0},null,{"$f":"IF(P582=\"\",$X$595-SUM(OFFSET($X$573:X580,0,0,COUNTA($X$573:X580),1)),ROUND(V581*100/ORÇAMENTO.TotalOrçamento,2))","v":{"$error":"#DIV/0!"}}]
[null,null,null,null,null,null,null,null,null,null,null,null,null,null,"9.","",null,null,{"$f":"IF(P583=\"\",$S$595-SUM(OFFSET($S$573:S581,0,0,COUNTA($S$573:S581),1)),SUMIF($R$19:$R$521,$P582,$W$19:$W$521))","v":0},null,null,{"$f":"IF(P583=\"\",$V$595-SUM(OFFSET($V$573:V581,0,0,COUNTA($V$573:V581),1)),ROUND(S582*(1+BDI.Taxa),2))","v":0},null,{"$f":"IF(P583=\"\",$X$595-SUM(OFFSET($X$573:X581,0,0,COUNTA($X$573:X581),1)),ROUND(V582*100/ORÇAMENTO.TotalOrçamento,2))","v":{"$error":"#DIV/0!"}}]
[null,null,null,null,null,null,null,null,null,null,null,null,null,null,"10.","",null,null,{"$f":"IF(P584=\"\",$S$595-SUM(OFFSET($S$573:S582,0,0,COUNTA($S$573:S582),1)),SUMIF($R$19:$R$521,$P583,$W$19:$W$521))","v":0},null,null,{"$f":"IF(P584=\"\",$V$595-SUM(OFFSET($V$573:V582,0,0,COUNTA($V$573:V582),1)),ROUND(S583*(1+BDI.Taxa),2))","v":0},null,{"$f":"IF(P584=\"\",$X$595-SUM(OFFSET($X$573:X582,0,0,COUNTA($X$573:X582),1)),ROUND(V583*100/ORÇAMENTO.TotalOrçamento,2))","v":{"$error":"#DIV/0!"}}]
[null,null,null,null,null,null,null,null,null,null,null,null,null,null,"11.","",null,null,{"$f":"IF(P585=\"\",$S$595-SUM(OFFSET($S$573:S583,0,0,COUNTA($S$573:S583),1)),SUMIF($R$19:$R$521,$P584,$W$19:$W$521))","v":0},null,null,{"$f":"IF(P585=\"\",$V$595-SUM(OFFSET($V$573:V583,0,0,COUNTA($V$573:V583),1)),ROUND(S584*(1+BDI.Taxa),2))","v":0},null,{"$f":"IF(P585=\"\",$X$595-SUM(OFFSET($X$573:X583,0,0,COUNTA($X$573:X583),1)),ROUND(V584*100/ORÇAMENTO.TotalOrçamento,2))","v":{"$error":"#DIV/0!"}}]
[null,null,null,null,null,null,null,null,null,null,null,null,null,null,"12.","",null,null,{"$f":"IF(P586=\"\",$S$595-SUM(OFFSET($S$573:S584,0,0,COUNTA($S$573:S584),1)),SUMIF($R$19:$R$521,$P585,$W$19:$W$521))","v":0},null,null,{"$f":"IF(P586=\"\",$V$595-SUM(OFFSET($V$573:V584,0,0,COUNTA($V$573:V584),1)),ROUND(S585*(1+BDI.Taxa),2))","v":0},null,{"$f":"IF(P586=\"\",$X$595-SUM(OFFSET($X$573:X584,0,0,COUNTA($X$573:X584),1)),ROUND(V585*100/ORÇAMENTO.TotalOrçamento,2))","v":{"$error":"#DIV/0!"}}]
[null,null,null,null,null,null,null,null,null,null,null,null,null,null,"13.","",null,null,{"$f":"IF(P587=\"\",$S$595-SUM(OFFSET($S$573:S585,0,0,COUNTA($S$573:S585),1)),SUMIF($R$19:$R$521,$P586,$W$19:$W$521))","v":0},null,null,{"$f":"IF(P587=\"\",$V$595-SUM(OFFSET($V$573:V585,0,0,COUNTA($V$573:V585),1)),ROUND(S586*(1+BDI.Taxa),2))","v":0},null,{"$f":"IF(P587=\"\",$X$595-SUM(OFFSET($X$573:X585,0,0,COUNTA($X$573:X585),1)),ROUND(V586*100/ORÇAMENTO.TotalOrçamento,2))","v":{"$error":"#DIV/0!"}}]
[null,null,null,null,null,null,null,null,null,null,null,null,null,null,"14.","",null,null,{"$f":"IF(P588=\"\",$S$595-SUM(OFFSET($S$573:S586,0,0,COUNTA($S$573:S586),1)),SUMIF($R$19:$R$521,$P587,$W$19:$W$521))","v":0},null,null,{"$f":"IF(P588=\"\",$V$595-SUM(OFFSET($V$573:V586,0,0,COUNTA($V$573:V586),1)),ROUND(S587*(1+BDI.Taxa),2))","v":0},null,{"$f":"IF(P588=\"\",$X$595-SUM(OFFSET($X$573:X586,0,0,COUNTA($X$573:X586),1)),ROUND(V587*100/ORÇAMENTO.TotalOrçamento,2))","v":{"$error":"#DIV/0!"}}]
[null,null,null,null,null,null,null,null,null,null,null,null,null,null,"15.","",null,null,{"$f":"IF(P589=\"\",$S$595-SUM(OFFSET($S$573:S587,0,0,COUNTA($S$573:S587),1)),SUMIF($R$19:$R$521,$P588,$W$19:$W$521))","v":0},null,null,{"$f":"IF(P589=\"\",$V$595-SUM(OFFSET($V$573:V587,0,0,COUNTA($V$573:V587),1)),ROUND(S588*(1+BDI.Taxa),2))","v":0},null,{"$f":"IF(P589=\"\",$X$595-SUM(OFFSET($X$573:X587,0,0,COUNTA($X$573:X587),1)),ROUND(V588*100/ORÇAMENTO.TotalOrçamento,2))","v":{"$error":"#DIV/0!"}}]
[null,null,null,null,null,null,null,null,null,null,null,null,null,null,"16.","",null,null,{"$f":"IF(P590=\"\",$S$595-SUM(OFFSET($S$573:S588,0,0,COUNTA($S$573:S588),1)),SUMIF($R$19:$R$521,$P589,$W$19:$W$521))","v":0},null,null,{"$f":"IF(P590=\"\",$V$595-SUM(OFFSET($V$573:V588,0,0,COUNTA($V$573:V588),1)),ROUND(S589*(1+BDI.Taxa),2))","v":0},null,{"$f":"IF(P590=\"\",$X$595-SUM(OFFSET($X$573:X588,0,0,COUNTA($X$573:X588),1)),ROUND(V589*100/ORÇAMENTO.TotalOrçamento,2))","v":{"$error":"#DIV/0!"}}]
[null,null,null,null,null,null,null,null,null,null,null,null,null,null,"17.","",null,null,{"$f":"IF(P591=\"\",$S$595-SUM(OFFSET($S$573:S589,0,0,COUNTA($S$573:S589),1)),SUMIF($R$19:$R$521,$P590,$W$19:$W$521))","v":0},null,null,{"$f":"IF(P591=\"\",$V$595-SUM(OFFSET($V$573:V589,0,0,COUNTA($V$573:V589),1)),ROUND(S590*(1+BDI.Taxa),2))","v":0},null,{"$f":"IF(P591=\"\",$X$595-SUM(OFFSET($X$573:X589,0,0,COUNTA($X$573:X589),1)),ROUND(V590*100/ORÇAMENTO.TotalOrçamento,2))","v":{"$error":"#DIV/0!"}}]
[null,null,null,null,null,null,null,null,null,null,null,null,null,null,"18.","",null,null,{"$f":"IF(P592=\"\",$S$595-SUM(OFFSET($S$573:S590,0,0,COUNTA($S$573:S590),1)),SUMIF($R$19:$R$521,$P591,$W$19:$W$521))","v":0},null,null,{"$f":"IF(P592=\"\",$V$595-SUM(OFFSET($V$573:V590,0,0,COUNTA($V$573:V590),1)),ROUND(S591*(1+BDI.Taxa),2))","v":0},null,{"$f":"IF(P592=\"\",$X$595-SUM(OFFSET($X$573:X590,0,0,COUNTA($X$573:X590),1)),ROUND(V591*100/ORÇAMENTO.TotalOrçamento,2))","v":{"$error":"#DIV/0!"}}]
[null,null,null,null,null,null,null,null,null,null,null,null,null,null,"19.","",null,null,{"$f":"IF(P593=\"\",$S$595-SUM(OFFSET($S$573:S591,0,0,COUNTA($S$573:S591),1)),SUMIF($R$19:$R$521,$P592,$W$19:$W$521))","v":0},null,null,{"$f":"IF(P593=\"\",$V$595-SUM(OFFSET($V$573:V591,0,0,COUNTA($V$573:V591),1)),ROUND(S592*(1+BDI.Taxa),2))","v":0},null,{"$f":"IF(P593=\"\",$X$595-SUM(OFFSET($X$573:X591,0,0,COUNTA($X$573:X591),1)),ROUND(V592*100/ORÇAMENTO.TotalOrçamento,2))","v":{"$error":"#DIV/0!"}}]
[null,null,null,null,null,null,null,null,null,null,null,null,null,null,"20.","",null,null,{"$f":"IF(P594=\"\",$S$595-SUM(OFFSET($S$573:S592,0,0,COUNTA($S$573:S592),1)),SUMIF($R$19:$R$521,$P593,$W$19:$W$521))","v":0},null,null,{"$f":"IF(P594=\"\",$V$595-SUM(OFFSET($V$573:V592,0,0,COUNTA($V$573:V592),1)),ROUND(S593*(1+BDI.Taxa),2))","v":0},null,{"$f":"IF(P594=\"\",$X$595-SUM(OFFSET($X$573:X592,0,0,COUNTA($X$573:X592),1)),ROUND(V593*100/ORÇAMENTO.TotalOrçamento,2))","v":{"$error":"#DIV/0!"}}]
[null,null,null,null,null,null,null,null,null,null,null,null,null,null,"TOTAL GERAL DO ORÇAMENTO (R$)",null,null,null,{"$f":"SUM(S574:U593)","v":0},null,null,{"$f":"SUM(V574:W593)","v":0},null,{"$f":"SUM(X574:X593)","v":{"$error":"#DIV/0!"}}]
[null,null,null,null,null,null,null,null,null,null,null,null,null,null,null,null,null,null,{"$f":"$W$522","v":0},null,null,{"$f":"$W$524","v":0},null,100]
[null,null,null,null,null,null,null,null,null,null,null,null,null,null,null,null,null,null,"(TOTAL SEM BDI)",null,null,"(TOTAL COM BDI)",null,"(ARRED porcentagem)"]
[null,null,null,null,null,null,null,null,null,null,null,null,null,null,null,null,null,null,{"$f":"IF(AND(S594=S595,S594>0),\"OK\",\"ERRO\")","v":"ERRO"},null,null,{"$f":"IF(AND(V594=V595,V594>0),\"OK\",\"ERRO\")","v":"ERRO"},null,{"$f":"IF(AND(X594=100,S574<>0),\"OK\",\"ERRO\")","v":{"$error":"#DIV/0!"}}]

{"sheet":"Resumo ","index":1,"n_rows":39,"n_cols":9,"rows_kept":39,"cut":false,"hidden":false,"merged":[[13,0,14,0],[34,2,34,3],[35,2,35,3],[31,2,31,3],[32,2,32,3],[33,2,33,3],[28,2,28,3],[29,2,29,3],[30,2,30,3],[0,1,0,8],[36,1,36,5],[2,1,2,5],[3,1,3,5],[5,1,5,5],[6,1,6,5],[8,1,8,5],[9,1,9,5],[11,3,11,5],[12,3,12,5],[10,1,10,8],[11,6,11,8],[12,6,12,8],[25,2,25,3],[21,2,21,3],[22,2,22,3],[6,6,6,8],[7,1,7,8],[8,6,8,8],[9,6,9,8],[13,1,13,8],[1,1,1,8],[2,6,2,8],[3,6,3,8],[4,1,4,8],[5,6,5,8],[42,3,42,7],[11,1,11,2],[12,1,12,2],[15,2,15,3],[16,2,16,3],[14,1,14,8],[17,2,17,3],[23,2,23,3],[18,2,18,3],[19,2,19,3],[20,2,20,3],[41,3,41,7],[24,2,24,3],[26,2,26,3],[27,2,27,3],[38,1,38,8]]}
[]
[]
[null,"UNIDADE ESCOLAR",null,null,null,null,"CÓDIGO INEP"]
[null,{"$f":"Orçamento!$O$4","v":"COLÉGIO ESTADUAL DA POLÍCIA MILITAR DE GOIÁS - GOIANIRA - JOSÉ SILVA OLIVEIRA"},null,null,null,null,{"$f":"Orçamento!V4","v":52096939}]
[]
[null,"OBRA",null,null,null,null,"CIDADE"]
[null,{"$f":"Orçamento!$O$7","v":"REFORMA E AMPLIAÇÃO"},null,null,null,null,{"$f":"Orçamento!$V$7","v":"GOIANIRA"}]
[]
[null,"ENDEREÇO",null,null,null,null,"CRE"]
[null,{"$f":"Orçamento!$R$10","v":"Rua 28 c/ Rua 20 S/N, TRIUNFO I, CEP:75370-000"},null,null,null,null,{"$f":"Orçamento!$O$10","v":"INHUMAS"}]
[]
[null,"REFERÊNCIA",null,"DATA",null,null,"ÁREA TOTAL CONSTRUÍDA (M²)"]
[null,{"$f":"CONCATENATE(\"AGETOP E SINAPI - \",Orçamento!$W$10)","v":"AGETOP E SINAPI - ONERADA"},null,{"$f":"Orçamento!$S$7","v":"2019-05-21"},null,null,{"$f":"Orçamento!$S$13","v":3204.2200000000003}]
["FILTRO"]
[null,"RESUMO GERAL DO ORÇAMENTO"]
["↓","ITEM","DESCRIÇÃO DOS SERVIÇOS",null,"UNID","QUANT","PREÇO SEM BDI","PREÇO COM BDI","PARTICIP. (%)"]
[{"$f":"IF(E17>0,\"F\",\"\")","v":"F"},"1.",{"$f":"Orçamento!$P574","v":"REFORMA"},null,"UN ",1,{"$f":"IFERROR(Orçamento!S574,\"-\")","v":0},{"$f":"IFERROR(Orçamento!V574,\"\")","v":0},{"$f":"Orçamento!X574","v":{"$error":"#DIV/0!"}}]
[{"$f":"IF(E18>0,\"F\",\"\")","v":"F"},"2.",{"$f":"Orçamento!$P575","v":"CENTRAL DE GÁS"},null,"UN ",1,{"$f":"IFERROR(Orçamento!S575,\"-\")","v":0},{"$f":"IFERROR(Orçamento!V575,\"\")","v":0},{"$f":"Orçamento!X575","v":{"$error":"#DIV/0!"}}]
["F","3.",{"$f":"Orçamento!$P576","v":"BLOCO 1 SALA PADRÃO SEDUC 2017 - LAJE"},null,"UN ",1,{"$f":"IFERROR(Orçamento!S576,\"-\")","v":0},{"$f":"IFERROR(Orçamento!V576,\"\")","v":0},{"$f":"Orçamento!X576","v":{"$error":"#DIV/0!"}}]
["F","4.",{"$f":"Orçamento!$P577","v":"BLOCO 3 SALAS PADRÃO SEDUC 2017 - LAJE"},null,"UN ",1,{"$f":"IFERROR(Orçamento!S577,\"-\")","v":0},{"$f":"IFERROR(Orçamento!V577,\"\")","v":0},{"$f":"Orçamento!X577","v":{"$error":"#DIV/0!"}}]
["F","5.",{"$f":"Orçamento!$P578","v":"BLOCO 3 SALAS PADRÃO SEDUC 2017 - LAJE."},null,"UN ",1,{"$f":"IFERROR(Orçamento!S578,\"-\")","v":0},{"$f":"IFERROR(Orçamento!V578,\"\")","v":0},{"$f":"Orçamento!X578","v":{"$error":"#DIV/0!"}}]
["","6.",{"$f":"Orçamento!$P579","v":""},null,null,null,{"$f":"IFERROR(Orçamento!S579,\"-\")","v":0},{"$f":"IFERROR(Orçamento!V579,\"\")","v":0},{"$f":"Orçamento!X579","v":{"$error":"#DIV/0!"}}]
["","7.",{"$f":"Orçamento!$P580","v":""},null,null,null,{"$f":"IFERROR(Orçamento!S580,\"-\")","v":0},{"$f":"IFERROR(Orçamento!V580,\"\")","v":0},{"$f":"Orçamento!X580","v":{"$error":"#DIV/0!"}}]
["","8.",{"$f":"Orçamento!$P581","v":""},null,null,null,{"$f":"IFERROR(Orçamento!S581,\"-\")","v":0},{"$f":"IFERROR(Orçamento!V581,\"\")","v":0},{"$f":"Orçamento!X581","v":{"$error":"#DIV/0!"}}]
["","9.",{"$f":"Orçamento!$P582","v":""},null,null,null,{"$f":"IFERROR(Orçamento!S582,\"-\")","v":0},{"$f":"IFERROR(Orçamento!V582,\"\")","v":0},{"$f":"Orçamento!X582","v":{"$error":"#DIV/0!"}}]
["","10.",{"$f":"Orçamento!$P583","v":""},null,null,null,{"$f":"IFERROR(Orçamento!S583,\"-\")","v":0},{"$f":"IFERROR(Orçamento!V583,\"\")","v":0},{"$f":"Orçamento!X583","v":{"$error":"#DIV/0!"}}]
["","11.",{"$f":"Orçamento!$P584","v":""},null,null,null,{"$f":"IFERROR(Orçamento!S584,\"-\")","v":0},{"$f":"IFERROR(Orçamento!V584,\"\")","v":0},{"$f":"Orçamento!X584","v":{"$error":"#DIV/0!"}}]
["","12.",{"$f":"Orçamento!$P585","v":""},null,null,null,{"$f":"IFERROR(Orçamento!S585,\"-\")","v":0},{"$f":"IFERROR(Orçamento!V585,\"\")","v":0},{"$f":"Orçamento!X585","v":{"$error":"#DIV/0!"}}]
["","13.",{"$f":"Orçamento!$P586","v":""},null,null,null,{"$f":"IFERROR(Orçamento!S586,\"-\")","v":0},{"$f":"IFERROR(Orçamento!V586,\"\")","v":0},{"$f":"Orçamento!X586","v":{"$error":"#DIV/0!"}}]
["","14.",{"$f":"Orçamento!$P587","v":""},null,null,null,{"$f":"IFERROR(Orçamento!S587,\"-\")","v":0},{"$f":"IFERROR(Orçamento!V587,\"\")","v":0},{"$f":"Orçamento!X587","v":{"$error":"#DIV/0!"}}]
["","15.",{"$f":"Orçamento!$P588","v":""},null,null,null,{"$f":"IFERROR(Orçamento!S588,\"-\")","v":0},{"$f":"IFERROR(Orçamento!V588,\"\")","v":0},{"$f":"Orçamento!X588","v":{"$error":"#DIV/0!"}}]
["","16.",{"$f":"Orçamento!$P589","v":""},null,null,null,{"$f":"IFERROR(Orçamento!S589,\"-\")","v":0},{"$f":"IFERROR(Orçamento!V589,\"\")","v":0},{"$f":"Orçamento!X589","v":{"$error":"#DIV/0!"}}]
["","17.",{"$f":"Orçamento!$P590","v":""},null,null,null,{"$f":"IFERROR(Orçamento!S590,\"-\")","v":0},{"$f":"IFERROR(Orçamento!V590,\"\")","v":0},{"$f":"Orçamento!X590","v":{"$error":"#DIV/0!"}}]
["","18.",{"$f":"Orçamento!$P591","v":""},null,null,null,{"$f":"IFERROR(Orçamento!S591,\"-\")","v":0},{"$f":"IFERROR(Orçamento!V591,\"\")","v":0},{"$f":"Orçamento!X591","v":{"$error":"#DIV/0!"}}]
["","19.",{"$f":"Orçamento!$P592","v":""},null,null,null,{"$f":"IFERROR(Orçamento!S592,\"-\")","v":0},{"$f":"IFERROR(Orçamento!V592,\"\")","v":0},{"$f":"Orçamento!X592","v":{"$error":"#DIV/0!"}}]
["","20.",{"$f":"Orçamento!$P593","v":""},null,null,null,{"$f":"IFERROR(Orçamento!S593,\"-\")","v":0},{"$f":"IFERROR(Orçamento!V593,\"\")","v":0},{"$f":"Orçamento!X593","v":{"$error":"#DIV/0!"}}]
["F","TOTAL GERAL DO ORÇAMENTO (R$)",null,null,null,null,{"$f":"SUM(G17:G36)","v":0},0,{"$f":"SUM(I17:I36)","v":{"$error":"#DIV/0!"}}]
["F"]
["F"]

{"sheet":"Somatório","index":2,"n_rows":45,"n_cols":6,"rows_kept":45,"cut":false,"hidden":false,"merged":[[13,0,14,0],[42,1,42,2],[44,1,44,5],[47,3,47,5],[48,3,48,5],[13,1,13,5],[9,1,9,3],[9,4,9,5],[11,1,11,2],[11,4,11,5],[12,1,12,2],[12,4,12,5],[0,1,0,5],[14,1,14,5],[2,1,2,3],[2,4,2,5],[3,1,3,3],[3,4,3,5],[5,1,5,3],[5,4,5,5],[6,1,6,3],[6,4,6,5],[8,1,8,3],[8,4,8,5],[1,1,1,5],[4,1,4,5],[7,1,7,5],[10,1,10,5]]}
[]
[]
[null,"UNIDADE ESCOLAR",null,null,"CÓDIGO INEP"]
[null,{"$f":"Orçamento!$O$4","v":"COLÉGIO ESTADUAL DA POLÍCIA MILITAR DE GOIÁS - GOIANIRA - JOSÉ SILVA OLIVEIRA"},null,null,{"$f":"Orçamento!V4","v":52096939}]
[]
[null,"OBRA",null,null,"CIDADE"]
[null,{"$f":"Orçamento!$O$7","v":"REFORMA E AMPLIAÇÃO"},null,null,{"$f":"Orçamento!$V$7","v":"GOIANIRA"}]
[]
[null,"ENDEREÇO",null,null,"CRE"]
[null,{"$f":"Orçamento!$R$10","v":"Rua 28 c/ Rua 20 S/N, TRIUNFO I, CEP:75370-000"},null,null,{"$f":"Orçamento!$O$10","v":"INHUMAS"}]
[]
[null,"REFERÊNCIA",null,"DATA","ÁREA TOTAL CONSTRUÍDA (M²)"]
[null,{"$f":"CONCATENATE(\"AGETOP E SINAPI - \",Orçamento!$W$10)","v":"AGETOP E SINAPI - ONERADA"},null,{"$f":"Orçamento!$S$7","v":"2019-05-21"},{"$f":"Orçamento!$S$13","v":3204.2200000000003}]
["FILTRO"]
[null,"SOMATÓRIO DE SERVIÇOS"]
["↓","ITEM","DESCRIÇÃO DOS SERVIÇOS","PREÇO SEM BDI (R$)","PREÇO COM BDI (R$)","PARTIC.  ( % )"]
[{"$f":"IF(D17>0,\"F\",\"\")","v":""},"a.",{"$f":"Orçamento!P540","v":"SERVIÇOS PRELIMINARES"},{"$f":"Orçamento!S540","v":0},{"$f":"Orçamento!V540","v":0},{"$f":"Orçamento!X540","v":0}]
[{"$f":"IF(D18>0,\"F\",\"\")","v":""},"b.",{"$f":"Orçamento!P541","v":"TRANSPORTES"},{"$f":"Orçamento!S541","v":0},{"$f":"Orçamento!V541","v":0},{"$f":"Orçamento!X541","v":0}]
["","c.",{"$f":"Orçamento!P542","v":"SERVIÇO EM TERRA"},{"$f":"Orçamento!S542","v":0},{"$f":"Orçamento!V542","v":0},{"$f":"Orçamento!X542","v":0}]
["","d.",{"$f":"Orçamento!P543","v":"FUNDAÇÕES E SONDAGENS"},{"$f":"Orçamento!S543","v":0},{"$f":"Orçamento!V543","v":0},{"$f":"Orçamento!X543","v":0}]
["","e.",{"$f":"Orçamento!P544","v":"ESTRUTURA"},{"$f":"Orçamento!S544","v":0},{"$f":"Orçamento!V544","v":0},{"$f":"Orçamento!X544","v":0}]
["","f.",{"$f":"Orçamento!P545","v":"INSTALAÇÕES ELÉTRICAS"},{"$f":"Orçamento!S545","v":0},{"$f":"Orçamento!V545","v":0},{"$f":"Orçamento!X545","v":0}]
["","g.",{"$f":"Orçamento!P546","v":"INSTALAÇÕES HIDROSSANITÁRIAS"},{"$f":"Orçamento!S546","v":0},{"$f":"Orçamento!V546","v":0},{"$f":"Orçamento!X546","v":0}]
["","h.",{"$f":"Orçamento!P547","v":"INSTALAÇÕES ESPECIAIS"},{"$f":"Orçamento!S547","v":0},{"$f":"Orçamento!V547","v":0},{"$f":"Orçamento!X547","v":0}]
["","i.",{"$f":"Orçamento!P548","v":"ALVENARIAS E DIVISÓRIAS"},{"$f":"Orçamento!S548","v":0},{"$f":"Orçamento!V548","v":0},{"$f":"Orçamento!X548","v":0}]
["","j.",{"$f":"Orçamento!P549","v":"ALVENARIA AUTO-PORTANTE"},{"$f":"Orçamento!S549","v":0},{"$f":"Orçamento!V549","v":0},{"$f":"Orçamento!X549","v":0}]
["","k.",{"$f":"Orçamento!P550","v":"IMPERMEABILIZAÇÃO"},{"$f":"Orçamento!S550","v":0},{"$f":"Orçamento!V550","v":0},{"$f":"Orçamento!X550","v":0}]
["","l.",{"$f":"Orçamento!P551","v":"ISOLAMENTO TÉRMICO E ACÚSTICO"},{"$f":"Orçamento!S551","v":0},{"$f":"Orçamento!V551","v":0},{"$f":"Orçamento!X551","v":0}]
["","m.",{"$f":"Orçamento!P552","v":"ESTRUTURA DE MADEIRA"},{"$f":"Orçamento!S552","v":0},{"$f":"Orçamento!V552","v":0},{"$f":"Orçamento!X552","v":0}]
["","n.",{"$f":"Orçamento!P553","v":"ESTRUTURAS METÁLICAS"},{"$f":"Orçamento!S553","v":0},{"$f":"Orçamento!V553","v":0},{"$f":"Orçamento!X553","v":0}]
["","o.",{"$f":"Orçamento!P554","v":"COBERTURAS"},{"$f":"Orçamento!S554","v":0},{"$f":"Orçamento!V554","v":0},{"$f":"Orçamento!X554","v":0}]
["","p.",{"$f":"Orçamento!P555","v":"ESQUADRIAS DE MADEIRA"},{"$f":"Orçamento!S555","v":0},{"$f":"Orçamento!V555","v":0},{"$f":"Orçamento!X555","v":0}]
["","q.",{"$f":"Orçamento!P556","v":"ESQUADRIAS METÁLICAS"},{"$f":"Orçamento!S556","v":0},{"$f":"Orçamento!V556","v":0},{"$f":"Orçamento!X556","v":0}]
["","r.",{"$f":"Orçamento!P557","v":"VIDROS"},{"$f":"Orçamento!S557","v":0},{"$f":"Orçamento!V557","v":0},{"$f":"Orçamento!X557","v":0}]
["","s.",{"$f":"Orçamento!P558","v":"REVESTIMENTO DE PAREDE"},{"$f":"Orçamento!S558","v":0},{"$f":"Orçamento!V558","v":0},{"$f":"Orçamento!X558","v":0}]
["","t.",{"$f":"Orçamento!P559","v":"FORROS"},{"$f":"Orçamento!S559","v":0},{"$f":"Orçamento!V559","v":0},{"$f":"Orçamento!X559","v":0}]
["","u.",{"$f":"Orçamento!P560","v":"REVESTIMENTO DE PISO"},{"$f":"Orçamento!S560","v":0},{"$f":"Orçamento!V560","v":0},{"$f":"Orçamento!X560","v":0}]
["","v.",{"$f":"Orçamento!P561","v":"FERRAGENS"},{"$f":"Orçamento!S561","v":0},{"$f":"Orçamento!V561","v":0},{"$f":"Orçamento!X561","v":0}]
["","w.",{"$f":"Orçamento!P562","v":"MARCENARIA"},{"$f":"Orçamento!S562","v":0},{"$f":"Orçamento!V562","v":0},{"$f":"Orçamento!X562","v":0}]
["","x.",{"$f":"Orçamento!P563","v":"ADMINISTRAÇÃO"},{"$f":"Orçamento!S563","v":0},{"$f":"Orçamento!V563","v":0},{"$f":"Orçamento!X563","v":0}]
["","y.",{"$f":"Orçamento!P564","v":"PINTURA"},{"$f":"Orçamento!S564","v":0},{"$f":"Orçamento!V564","v":0},{"$f":"Orçamento!X564","v":0}]
["","z.",{"$f":"Orçamento!P565","v":"DIVERSOS"},{"$f":"Orçamento!S565","v":0},{"$f":"Orçamento!V565","v":0},{"$f":"Orçamento!X565","v":0}]
["F","TOTAL GERAL DO ORÇAMENTO",null,{"$f":"SUM(D17:D42)","v":0},{"$f":"SUM(E17:E42)","v":0},{"$f":"SUM(F17:F42)","v":0}]
[]
[null,"(*) Para itens da AGETOP, os vidros não estão inclusos nas esquadrias e já foram considerados os custos de contramarco para as esquadrias de alumínio;"]

{"sheet":"Cronog_60_Dias","index":3,"n_rows":99,"n_cols":16,"rows_kept":99,"cut":false,"hidden":false,"merged":[[2,1,2,7],[5,1,5,7],[6,1,6,7],[8,1,8,7],[9,1,9,7],[4,1,4,13],[7,1,7,13],[0,1,0,13],[1,1,1,13],[2,8,2,13],[12,0,13,0],[9,0,11,0],[11,1,11,13],[92,1,92,2],[92,5,92,8],[92,9,92,12],[93,1,93,2],[93,5,93,8],[93,9,93,12],[74,9,74,12],[74,5,74,8],[68,9,68,12],[70,5,70,8],[70,9,70,12],[59,5,59,8],[71,1,73,2],[71,4,73,4],[71,5,71,8],[71,9,71,12],[73,5,73,8],[73,9,73,12],[59,9,59,12],[61,5,61,8],[61,9,61,12],[94,1,94,2],[94,5,94,8],[94,9,94,12],[76,5,76,8],[76,9,76,12],[77,5,77,8],[77,9,77,12],[79,5,79,8],[79,9,79,12],[80,5,80,8],[80,9,80,12],[82,5,82,8],[82,9,82,12],[77,3,79,3],[80,3,82,3],[86,1,88,2],[80,4,82,4],[95,1,95,2],[95,5,95,8],[95,9,95,12],[97,1,97,4],[98,1,98,13],[86,9,86,12],[88,5,88,8],[88,9,88,12],[85,5,85,8],[85,9,85,12],[89,1,91,2],[89,4,91,4],[89,5,89,8],[89,9,89,12],[91,5,91,8],[91,9,91,12],[89,3,91,3],[86,4,88,4],[86,5,86,8],[86,3,88,3],[83,1,85,2],[83,4,85,4],[83,5,83,8],[83,9,83,12],[68,5,68,8],[65,5,65,8],[65,9,65,12],[67,5,67,8],[67,9,67,12],[65,3,67,3],[62,9,62,12],[64,5,64,8],[64,9,64,12],[62,5,62,8],[53,9,53,12],[55,5,55,8],[55,9,55,12],[50,5,50,8],[50,9,50,12],[52,5,52,8],[52,9,52,12],[56,9,56,12],[58,5,58,8],[58,9,58,12],[53,5,53,8],[56,5,56,8],[44,9,44,12],[46,5,46,8],[46,9,46,12],[47,1,49,2],[47,4,49,4],[47,5,47,8],[47,9,47,12],[49,5,49,8],[49,9,49,12],[44,5,44,8],[47,3,49,3],[35,9,35,12],[37,5,37,8],[37,9,37,12],[35,3,37,3],[40,9,40,12],[38,3,40,3],[38,9,38,12],[41,1,43,2],[41,4,43,4],[41,5,41,8],[41,9,41,12],[43,5,43,8],[43,9,43,12],[41,3,43,3],[35,5,35,8],[38,5,38,8],[40,5,40,8],[29,9,29,12],[31,5,31,8],[31,9,31,12],[32,1,34,2],[32,4,34,4],[32,5,32,8],[32,9,32,12],[34,5,34,8],[34,9,34,12],[32,3,34,3],[29,5,29,8],[29,1,31,2],[29,4,31,4],[26,1,28,2],[26,4,28,4],[26,5,26,8],[26,9,26,12],[28,5,28,8],[28,9,28,12],[23,3,25,3],[23,1,25,2],[23,4,25,4],[23,5,23,8],[26,3,28,3],[14,3,16,3],[17,3,19,3],[14,4,16,4],[14,5,14,8],[14,9,14,12],[16,5,16,8],[16,9,16,12],[23,9,23,12],[25,5,25,8],[25,9,25,12],[17,9,17,12],[19,5,19,8],[19,9,19,12],[20,1,22,2],[20,4,22,4],[20,5,20,8],[20,9,20,12],[22,5,22,8],[22,9,22,12],[20,3,22,3],[83,3,85,3],[53,4,55,4],[59,1,61,2],[59,4,61,4],[74,1,76,2],[77,1,79,2],[77,4,79,4],[80,1,82,2],[65,1,67,2],[68,3,70,3],[62,3,64,3],[68,1,70,2],[56,3,58,3],[65,4,67,4],[71,3,73,3],[74,3,76,3],[74,4,76,4],[56,1,58,2],[68,4,70,4],[44,3,46,3],[62,1,64,2],[62,4,64,4],[38,1,40,2],[38,4,40,4],[59,3,61,3],[44,1,46,2],[44,4,46,4],[53,1,55,2],[50,1,52,2],[50,4,52,4],[10,1,10,13],[9,8,9,13],[8,8,8,13],[3,8,3,13],[6,8,6,13],[5,8,5,13],[3,1,3,7],[56,4,58,4],[29,3,31,3],[35,1,37,2],[35,4,37,4],[50,3,52,3],[53,3,55,3],[12,13,13,13],[13,1,13,2],[13,5,13,8],[13,9,13,12],[12,3,13,3],[12,9,12,12],[14,1,16,2],[12,5,12,8],[17,1,19,2],[17,4,19,4],[17,5,17,8]]}
[]
[]
[null,"UNIDADE ESCOLAR",null,null,null,null,null,null,"PRAZO"]
[null,{"$f":"Orçamento!$O$4","v":"COLÉGIO ESTADUAL DA POLÍCIA MILITAR DE GOIÁS - GOIANIRA - JOSÉ SILVA OLIVEIRA"},null,null,null,null,null,null,"60 DIAS CORRIDOS"]
[]
[null,"OBRA",null,null,null,null,null,null,"DATA"]
[null,{"$f":"Orçamento!$O$7","v":"REFORMA E AMPLIAÇÃO"},null,null,null,null,null,null,{"$f":"Orçamento!$S$7","v":"2019-05-21"}]
[]
[null,"LOCAL",null,null,null,null,null,null,"ÁREA TOTAL CONSTRUÍDA (M²)"]
["FILTRO",{"$f":"Orçamento!$V$7","v":"GOIANIRA"},null,null,null,null,null,null,{"$f":"Orçamento!$S$13","v":3204.2200000000003}]
[]
[null,"CRONOGRAMA - FÍSICO FINANCEIRO"]
["↓","CUSTO TOTAL:",{"$f":"D93","v":0},"VALOR","Dias:",30,null,null,null,60,null,null,null,"TOTAL"]
[null,"DESCRIÇÃO DOS SERVIÇOS",null,null,"%","1ª PARCELA",null,null,null,"2ª PARCELA"]
[{"$f":"IF(D15>0,\"F\",\"\")","v":""},"SERVIÇOS PRELIMINARES",null,{"$f":"Orçamento!V540","v":0},{"$f":"Orçamento!X540","v":0},{"$f":"ROUND(F17*$D$15,2)","v":0},null,null,null,{"$f":"ROUND(J17*$D$15,2)","v":0},null,null,null,{"$f":"SUM(F15:M15)","v":0},null,{"$f":"IF(N15=D15,\"OK\",\"ERRO\")","v":"OK"}]
[{"$f":"IF(A15=\"F\",A15,\"\")","v":""}]
[{"$f":"IF(A16=\"F\",A16,\"\")","v":""},null,null,null,null,1,null,null,null,{"$f":"1-F17","v":0},null,null,null,{"$f":"IFERROR(E15/100,\"\")","v":0}]
[{"$f":"IF(D18>0,\"F\",\"\")","v":""},"TRANSPORTES",null,{"$f":"Orçamento!V541","v":0},{"$f":"Orçamento!X541","v":0},{"$f":"ROUND(F20*$D$18,2)","v":0},null,null,null,{"$f":"ROUND(J20*$D$18,2)","v":0},null,null,null,{"$f":"SUM(F18:M18)","v":0},null,{"$f":"IF(N18=D18,\"OK\",\"ERRO\")","v":"OK"}]
[{"$f":"IF(A18=\"F\",A18,\"\")","v":""}]
[{"$f":"IF(A19=\"F\",A19,\"\")","v":""},null,null,null,null,0.48,null,null,null,{"$f":"1-F20","v":0.52},null,null,null,{"$f":"IFERROR(E18/100,\"\")","v":0}]
[{"$f":"IF(D21>0,\"F\",\"\")","v":""},"SERVIÇO EM TERRA",null,{"$f":"Orçamento!V542","v":0},{"$f":"Orçamento!X542","v":0},{"$f":"ROUND(F23*$D$21,2)","v":0},null,null,null,{"$f":"ROUND(J23*$D$21,2)","v":0},null,null,null,{"$f":"SUM(F21:M21)","v":0},null,{"$f":"IF(N21=D21,\"OK\",\"ERRO\")","v":"OK"}]
[{"$f":"IF(A21=\"F\",A21,\"\")","v":""}]
[{"$f":"IF(A22=\"F\",A22,\"\")","v":""},null,null,null,null,1,null,null,null,{"$f":"1-F23","v":0},null,null,null,{"$f":"IFERROR(E21/100,\"\")","v":0}]
[{"$f":"IF(D24>0,\"F\",\"\")","v":""},"FUNDAÇÕES E SONDAGENS",null,{"$f":"Orçamento!V543","v":0},{"$f":"Orçamento!X543","v":0},{"$f":"ROUND(F26*$D$24,2)","v":0},null,null,null,{"$f":"ROUND(J26*$D$24,2)","v":0},null,null,null,{"$f":"SUM(F24:M24)","v":0},null,{"$f":"IF(N24=D24,\"OK\",\"ERRO\")","v":"OK"}]
[{"$f":"IF(A24=\"F\",A24,\"\")","v":""}]
[{"$f":"IF(A25=\"F\",A25,\"\")","v":""},null,null,null,null,1,null,null,null,{"$f":"1-F26","v":0},null,null,null,{"$f":"IFERROR(E24/100,\"\")","v":0}]
[{"$f":"IF(D27>0,\"F\",\"\")","v":""},"ESTRUTURA",null,{"$f":"Orçamento!V544","v":0},{"$f":"Orçamento!X544","v":0},{"$f":"ROUND(F29*$D$27,2)","v":0},null,null,null,{"$f":"ROUND(J29*$D$27,2)","v":0},null,null,null,{"$f":"SUM(F27:M27)","v":0},null,{"$f":"IF(N27=D27,\"OK\",\"ERRO\")","v":"OK"}]
[{"$f":"IF(A27=\"F\",A27,\"\")","v":""}]
[{"$f":"IF(A28=\"F\",A28,\"\")","v":""},null,null,null,null,0.49,null,null,null,{"$f":"1-F29","v":0.51},null,null,null,{"$f":"IFERROR(E27/100,\"\")","v":0}]
[{"$f":"IF(D30>0,\"F\",\"\")","v":""},"INST.ELET/TELEFÔNICA/CABEAMENTO ESTRUTURADO",null,{"$f":"Orçamento!V545","v":0},{"$f":"Orçamento!X545","v":0},{"$f":"ROUND(F32*$D$30,2)","v":0},null,null,null,{"$f":"ROUND(J32*$D$30,2)","v":0},null,null,null,{"$f":"SUM(F30:M30)","v":0},null,{"$f":"IF(N30=D30,\"OK\",\"ERRO\")","v":"OK"}]
[{"$f":"IF(A30=\"F\",A30,\"\")","v":""}]
[{"$f":"IF(A31=\"F\",A31,\"\")","v":""},null,null,null,null,0.4,null,null,null,{"$f":"1-F32","v":0.6},null,null,null,{"$f":"IFERROR(E30/100,\"\")","v":0}]
[{"$f":"IF(D33>0,\"F\",\"\")","v":""},"INSTALAÇÕES HIDROSSANITÁRIAS",null,{"$f":"Orçamento!V546","v":0},{"$f":"Orçamento!X546","v":0},{"$f":"ROUND(F35*$D$33,2)","v":0},null,null,null,{"$f":"ROUND(J35*$D$33,2)","v":0},null,null,null,{"$f":"SUM(F33:M33)","v":0},null,{"$f":"IF(N33=D33,\"OK\",\"ERRO\")","v":"OK"}]
[{"$f":"IF(A33=\"F\",A33,\"\")","v":""}]
[{"$f":"IF(A34=\"F\",A34,\"\")","v":""},null,null,null,null,0.48,null,null,null,{"$f":"1-F35","v":0.52},null,null,null,{"$f":"IFERROR(E33/100,\"\")","v":0}]
[{"$f":"IF(D36>0,\"F\",\"\")","v":""},"INSTALAÇÕES ESPECIAIS",null,{"$f":"Orçamento!V547","v":0},{"$f":"Orçamento!X547","v":0},{"$f":"ROUND(F38*$D$36,2)","v":0},null,null,null,{"$f":"ROUND(J38*$D$36,2)","v":0},null,null,null,{"$f":"SUM(F36:M36)","v":0},null,{"$f":"IF(N36=D36,\"OK\",\"ERRO\")","v":"OK"}]
[{"$f":"IF(A36=\"F\",A36,\"\")","v":""}]
[{"$f":"IF(A37=\"F\",A37,\"\")","v":""},null,null,null,null,1,null,null,null,{"$f":"1-F38","v":0},null,null,null,{"$f":"IFERROR(E36/100,\"\")","v":0}]
[{"$f":"IF(D39>0,\"F\",\"\")","v":""},"ALVENARIA E DIVISÓRIAS",null,{"$f":"Orçamento!V548","v":0},{"$f":"Orçamento!X548","v":0},{"$f":"ROUND(F41*$D$39,2)","v":0},null,null,null,{"$f":"ROUND(J41*$D$39,2)","v":0},null,null,null,{"$f":"SUM(F39:M39)","v":0},null,{"$f":"IF(N39=D39,\"OK\",\"ERRO\")","v":"OK"}]
[{"$f":"IF(A39=\"F\",A39,\"\")","v":""}]
[{"$f":"IF(A40=\"F\",A40,\"\")","v":""},null,null,null,null,1,null,null,null,{"$f":"1-F41","v":0},null,null,null,{"$f":"IFERROR(E39/100,\"\")","v":0}]
[{"$f":"IF(D42>0,\"F\",\"\")","v":""},"ALVENARIA AUTO-PORTANTE",null,{"$f":"Orçamento!V549","v":0},{"$f":"Orçamento!X549","v":0},{"$f":"ROUND(F44*$D$42,2)","v":0},null,null,null,{"$f":"ROUND(J44*$D$42,2)","v":0},null,null,null,{"$f":"SUM(F42:M42)","v":0}]
[{"$f":"IF(A42=\"F\",A42,\"\")","v":""}]
[{"$f":"IF(A43=\"F\",A43,\"\")","v":""},null,null,null,null,1,null,null,null,{"$f":"1-F44","v":0},null,null,null,{"$f":"IFERROR(E42/100,\"\")","v":0}]
[{"$f":"IF(D45>0,\"F\",\"\")","v":""},"IMPERMEABILIZAÇÃO",null,{"$f":"Orçamento!V550","v":0},{"$f":"Orçamento!X550","v":0},{"$f":"ROUND(F47*$D$45,2)","v":0},null,null,null,{"$f":"ROUND(J47*$D$45,2)","v":0},null,null,null,{"$f":"SUM(F45:M45)","v":0},null,{"$f":"IF(N45=D45,\"OK\",\"ERRO\")","v":"OK"}]
[{"$f":"IF(A45=\"F\",A45,\"\")","v":""}]
[{"$f":"IF(A46=\"F\",A46,\"\")","v":""},null,null,null,null,1,null,null,null,{"$f":"1-F47","v":0},null,null,null,{"$f":"IFERROR(E45/100,\"\")","v":0}]
[{"$f":"IF(D48>0,\"F\",\"\")","v":""},"ISOLAMENTO TÉRMICO E ACÚSTICO",null,{"$f":"Orçamento!V551","v":0},{"$f":"Orçamento!X551","v":0},{"$f":"ROUND(F50*$D$48,2)","v":0},null,null,null,{"$f":"ROUND(J50*$D$48,2)","v":0},null,null,null,{"$f":"SUM(F48:M48)","v":0}]
[{"$f":"IF(A48=\"F\",A48,\"\")","v":""}]
[{"$f":"IF(A49=\"F\",A49,\"\")","v":""},null,null,null,null,0.5,null,null,null,{"$f":"1-F50","v":0.5},null,null,null,{"$f":"IFERROR(E48/100,\"\")","v":0}]
[{"$f":"IF(D51>0,\"F\",\"\")","v":""},"ESTRUTURA DE MADEIRA",null,{"$f":"Orçamento!V552","v":0},{"$f":"Orçamento!X552","v":0},{"$f":"ROUND(F53*$D$51,2)","v":0},null,null,null,{"$f":"ROUND(J53*$D$51,2)","v":0},null,null,null,{"$f":"SUM(F51:M51)","v":0}]
[{"$f":"IF(A51=\"F\",A51,\"\")","v":""}]
[{"$f":"IF(A52=\"F\",A52,\"\")","v":""},null,null,null,null,0.4,null,null,null,{"$f":"1-F53","v":0.6},null,null,null,{"$f":"IFERROR(E51/100,\"\")","v":0}]
[{"$f":"IF(D54>0,\"F\",\"\")","v":""},"ESTRUTURA METÁLICA",null,{"$f":"Orçamento!V553","v":0},{"$f":"Orçamento!X553","v":0},{"$f":"ROUND(F56*$D$54,2)","v":0},null,null,null,{"$f":"ROUND(J56*$D$54,2)","v":0},null,null,null,{"$f":"SUM(F54:M54)","v":0},null,{"$f":"IF(N54=D54,\"OK\",\"ERRO\")","v":"OK"}]
[{"$f":"IF(A54=\"F\",A54,\"\")","v":""}]
[{"$f":"IF(A55=\"F\",A55,\"\")","v":""},null,null,null,null,0.35,null,null,null,{"$f":"1-F56","v":0.65},null,null,null,{"$f":"IFERROR(E54/100,\"\")","v":0}]
[{"$f":"IF(D57>0,\"F\",\"\")","v":""},"COBERTURAS",null,{"$f":"Orçamento!V554","v":0},{"$f":"Orçamento!X554","v":0},{"$f":"ROUND(F59*$D$57,2)","v":0},null,null,null,{"$f":"ROUND(J59*$D$57,2)","v":0},null,null,null,{"$f":"SUM(F57:M57)","v":0},null,{"$f":"IF(N57=D57,\"OK\",\"ERRO\")","v":"OK"}]
[{"$f":"IF(A57=\"F\",A57,\"\")","v":""}]
[{"$f":"IF(A58=\"F\",A58,\"\")","v":""},null,null,null,null,0,null,null,null,{"$f":"1-F59","v":1},null,null,null,{"$f":"IFERROR(E57/100,\"\")","v":0}]
[{"$f":"IF(D60>0,\"F\",\"\")","v":""},"ESQUADRIAS DE MADEIRA",null,{"$f":"Orçamento!V555","v":0},{"$f":"Orçamento!X555","v":0},{"$f":"ROUND(F62*$D$60,2)","v":0},null,null,null,{"$f":"ROUND(J62*$D$60,2)","v":0},null,null,null,{"$f":"SUM(F60:M60)","v":0}]
[{"$f":"IF(A60=\"F\",A60,\"\")","v":""}]
[{"$f":"IF(A61=\"F\",A61,\"\")","v":""},null,null,null,null,0.54,null,null,null,{"$f":"1-F62","v":0.45999999999999996},null,null,null,{"$f":"IFERROR(E60/100,\"\")","v":0}]
[{"$f":"IF(D63>0,\"F\",\"\")","v":""},"ESQUADRIAS METÁLICAS",null,{"$f":"Orçamento!V556","v":0},{"$f":"Orçamento!X556","v":0},{"$f":"ROUND(F65*$D$63,2)","v":0},null,null,null,{"$f":"ROUND(J65*$D$63,2)","v":0},null,null,null,{"$f":"SUM(F63:M63)","v":0},null,{"$f":"IF(N63=D63,\"OK\",\"ERRO\")","v":"OK"}]
[{"$f":"IF(A63=\"F\",A63,\"\")","v":""}]
[{"$f":"IF(A64=\"F\",A64,\"\")","v":""},null,null,null,null,0.49,null,null,null,{"$f":"1-F65","v":0.51},null,null,null,{"$f":"IFERROR(E63/100,\"\")","v":0}]
[{"$f":"IF(D66>0,\"F\",\"\")","v":""},"VIDROS",null,{"$f":"Orçamento!V557","v":0},{"$f":"Orçamento!X557","v":0},{"$f":"ROUND(F68*$D$66,2)","v":0},null,null,null,{"$f":"ROUND(J68*$D$66,2)","v":0},null,null,null,{"$f":"SUM(F66:M66)","v":0},null,{"$f":"IF(N66=D66,\"OK\",\"ERRO\")","v":"OK"}]
[{"$f":"IF(A66=\"F\",A66,\"\")","v":""}]
[{"$f":"IF(A67=\"F\",A67,\"\")","v":""},null,null,null,null,0,null,null,null,{"$f":"1-F68","v":1},null,null,null,{"$f":"IFERROR(E66/100,\"\")","v":0}]
[{"$f":"IF(D69>0,\"F\",\"\")","v":""},"REVESTIMENTO DE PAREDE",null,{"$f":"Orçamento!V558","v":0},{"$f":"Orçamento!X558","v":0},{"$f":"ROUND(F71*$D$69,2)","v":0},null,null,null,{"$f":"ROUND(J71*$D$69,2)","v":0},null,null,null,{"$f":"SUM(F69:M69)","v":0},null,{"$f":"IF(N69=D69,\"OK\",\"ERRO\")","v":"OK"}]
[{"$f":"IF(A69=\"F\",A69,\"\")","v":""}]
[{"$f":"IF(A70=\"F\",A70,\"\")","v":""},null,null,null,null,0.32,null,null,null,{"$f":"1-F71","v":0.67999999999999994},null,null,null,{"$f":"IFERROR(E69/100,\"\")","v":0}]
[{"$f":"IF(D72>0,\"F\",\"\")","v":""},"FORROS",null,{"$f":"Orçamento!V559","v":0},{"$f":"Orçamento!X559","v":0},{"$f":"ROUND(F74*$D$72,2)","v":0},null,null,null,{"$f":"ROUND(J74*$D$72,2)","v":0},null,null,null,{"$f":"SUM(F72:M72)","v":0},null,{"$f":"IF(N72=D72,\"OK\",\"ERRO\")","v":"OK"}]
[{"$f":"IF(A72=\"F\",A72,\"\")","v":""}]
[{"$f":"IF(A73=\"F\",A73,\"\")","v":""},null,null,null,null,0.24,null,null,null,{"$f":"1-F74","v":0.76},null,null,null,{"$f":"IFERROR(E72/100,\"\")","v":0}]
[{"$f":"IF(D75>0,\"F\",\"\")","v":""},"REVESTIMENTO DE PISO",null,{"$f":"Orçamento!V560","v":0},{"$f":"Orçamento!X560","v":0},{"$f":"ROUND(F77*$D$75,2)","v":0},null,null,null,{"$f":"ROUND(J77*$D$75,2)","v":0},null,null,null,{"$f":"SUM(F75:M75)","v":0},null,{"$f":"IF(N75=D75,\"OK\",\"ERRO\")","v":"OK"}]
[{"$f":"IF(A75=\"F\",A75,\"\")","v":""}]
[{"$f":"IF(A76=\"F\",A76,\"\")","v":""},null,null,null,null,0.49,null,null,null,{"$f":"1-F77","v":0.51},null,null,null,{"$f":"IFERROR(E75/100,\"\")","v":0}]
[{"$f":"IF(D78>0,\"F\",\"\")","v":""},"FERRAGENS",null,{"$f":"Orçamento!V561","v":0},{"$f":"Orçamento!X561","v":0},{"$f":"ROUND(F80*$D$78,2)","v":0},null,null,null,{"$f":"ROUND(J80*$D$78,2)","v":0},null,null,null,{"$f":"SUM(F78:M78)","v":0}]
[{"$f":"IF(A78=\"F\",A78,\"\")","v":""}]
[{"$f":"IF(A79=\"F\",A79,\"\")","v":""},null,null,null,null,0,null,null,null,{"$f":"1-F80","v":1},null,null,null,{"$f":"IFERROR(E78/100,\"\")","v":0}]
[{"$f":"IF(D81>0,\"F\",\"\")","v":""},"MARCENARIA",null,{"$f":"Orçamento!V562","v":0},{"$f":"Orçamento!X562","v":0},{"$f":"ROUND(F83*$D$81,2)","v":0},null,null,null,{"$f":"ROUND(J83*$D$81,2)","v":0},null,null,null,{"$f":"SUM(F81:M81)","v":0},null,{"$f":"IF(N81=D81,\"OK\",\"ERRO\")","v":"OK"}]
[{"$f":"IF(A81=\"F\",A81,\"\")","v":""}]
[{"$f":"IF(A82=\"F\",A82,\"\")","v":""},null,null,null,null,0.4,null,null,null,{"$f":"1-F83","v":0.6},null,null,null,{"$f":"IFERROR(E81/100,\"\")","v":0}]
[{"$f":"IF(D84>0,\"F\",\"\")","v":""},"ADMINISTRAÇÃO - MENSALISTAS",null,{"$f":"Orçamento!V563","v":0},{"$f":"Orçamento!X563","v":0},{"$f":"ROUND(F86*$D$84,2)","v":0},null,null,null,{"$f":"ROUND(J86*$D$84,2)","v":0},null,null,null,{"$f":"SUM(F84:M84)","v":0},null,{"$f":"IF(N84=D84,\"OK\",\"ERRO\")","v":"OK"}]
[{"$f":"IF(A84=\"F\",A84,\"\")","v":""}]
[{"$f":"IF(A85=\"F\",A85,\"\")","v":""},null,null,null,null,0.49,null,null,null,{"$f":"1-F86","v":0.51},null,null,null,{"$f":"IFERROR(E84/100,\"\")","v":0}]
[{"$f":"IF(D87>0,\"F\",\"\")","v":""},"PINTURA",null,{"$f":"Orçamento!V564","v":0},{"$f":"Orçamento!X564","v":0},{"$f":"ROUND(F89*$D$87,2)","v":0},null,null,null,{"$f":"ROUND(J89*$D$87,2)","v":0},null,null,null,{"$f":"SUM(F87:M87)","v":0},null,{"$f":"IF(N87=D87,\"OK\",\"ERRO\")","v":"OK"}]
[{"$f":"IF(A87=\"F\",A87,\"\")","v":""}]
[{"$f":"IF(A88=\"F\",A88,\"\")","v":""},null,null,null,null,0,null,null,null,{"$f":"1-F89","v":1},null,null,null,{"$f":"IFERROR(E87/100,\"\")","v":0}]
[{"$f":"IF(D90>0,\"F\",\"\")","v":""},"DIVERSOS",null,{"$f":"Orçamento!V565","v":0},{"$f":"Orçamento!X565","v":0},{"$f":"ROUND(F92*$D$90,2)","v":0},null,null,null,{"$f":"ROUND(J92*$D$90,2)","v":0},null,null,null,{"$f":"SUM(F90:M90)","v":0},null,{"$f":"IF(N90=D90,\"OK\",\"ERRO\")","v":"OK"}]
[{"$f":"IF(A90=\"F\",A90,\"\")","v":""}]
[{"$f":"IF(A91=\"F\",A91,\"\")","v":""},null,null,null,null,0.46,null,null,null,{"$f":"1-F92","v":0.54},null,null,null,{"$f":"IFERROR(E90/100,\"\")","v":0}]
["F","CUSTO DO ORÇAMENTO",null,{"$f":"SUM(D15:D92)","v":0},{"$f":"SUM(E15:E92)","v":0},{"$f":"F15+F18+F21+F24+F27+F30+F33+F36+F39+F42+F45+F48+F51+F54+F57+F60+F63+F66+F69+F72+F75+F78+F81+F84+F87+F90","v":0},null,null,null,{"$f":"J15+J18+J21+J24+J27+J30+J33+J36+J39+J42+J45+J48+J51+J54+J57+J60+J63+J66+J69+J72+J75+J78+J81+J84+J87+J90","v":0},null,null,null,{"$f":"N15+N18+N21+N24+N27+N30+N33+N36+N39+N42+N45+N48+N51+N54+N57+N60+N63+N66+N69+N72+N75+N78+N81+N84+N87+N90","v":0}]
["F","PERCENTUAIS:",null,null,null,{"$f":"IFERROR(F93/D93,\"\")","v":""},null,null,null,{"$f":"IFERROR(J93/D93,\"\")","v":""},null,null,null,{"$f":"SUM(F94:M94)","v":0}]
["F","TOTAIS ACUMULADOS:",null,null,null,{"$f":"F93","v":0},null,null,null,{"$f":"F95+J93","v":0}]
["F","PERCENTUAIS  ACUMULADOS:",null,null,null,{"$f":"F94","v":""},null,null,null,{"$f":"IFERROR(F96+J94,\"\")","v":""}]
["F"]
["F","OBSERVAÇÕES:"]
["F","Os pagamentos somente poderão ser efetuados mediante medição e atesto pelos técnicos da Secretaria da Educação. "]

{"sheet":"Composição BDI","index":4,"n_rows":45,"n_cols":9,"rows_kept":45,"cut":false,"hidden":false,"merged":[[11,0,11,3],[12,0,12,3],[14,0,14,3],[15,0,15,3],[13,0,13,3],[0,0,0,3],[1,0,1,3],[4,0,4,3],[7,0,7,3],[10,0,10,3],[2,0,2,3],[3,0,3,3],[5,0,5,3],[6,0,6,3],[8,0,8,3],[9,0,9,3],[18,5,18,8],[17,0,17,3],[16,0,16,3],[44,0,44,3],[42,0,42,3],[43,0,43,3],[18,0,18,3],[36,0,36,3],[39,0,39,3],[38,0,38,3],[40,0,40,3],[29,0,29,2],[32,0,32,3],[33,0,33,3],[34,0,34,3],[35,0,35,3]]}
[]
[]
["UNIDADE ESCOLAR"]
[{"$f":"Orçamento!$O$4","v":"COLÉGIO ESTADUAL DA POLÍCIA MILITAR DE GOIÁS - GOIANIRA - JOSÉ SILVA OLIVEIRA"}]
[]
["OBRA"]
[{"$f":"Orçamento!$O$7","v":"REFORMA E AMPLIAÇÃO"}]
[]
["ENDEREÇO"]
[{"$f":"Orçamento!$R$10","v":"Rua 28 c/ Rua 20 S/N, TRIUNFO I, CEP:75370-000"}]
[]
["CIDADE"]
[{"$f":"Orçamento!$V$7","v":"GOIANIRA"}]
[]
["CRE"]
[{"$f":"Orçamento!$O$10","v":"INHUMAS"}]
[]
["DETALHAMENTO DA COMPOSIÇÃO DE BDI"]
["COMPOSIÇÃO BDI PARA OBRAS CIVIS",null,null,null,null,"BDI CONSTRUÇÃO E REFORMA"]
["DESCRIÇÃO","COEF.","TAXA % (a.m)","% no preço de venda",null,"Situação","1º Quartil","Médio","3º Quartil"]
["1) COFINS",1,0.03,{"$f":"C21","v":0.03},null,{"$f":"IF(OR(C21<G21,C21>I21),\"FORA DO INTERVALO\",\"OK\")","v":"OK"},0.03,0.03,0.03]
["2) PIS",1,6.4999999999999997E-3,{"$f":"C22","v":6.4999999999999997E-3},null,{"$f":"IF(OR(C22<G22,C22>I22),\"FORA DO INTERVALO\",\"OK\")","v":"OK"},6.4999999999999997E-3,6.4999999999999997E-3,6.4999999999999997E-3]
["3) ISSQN",1,0.05,{"$f":"C23*B23","v":0.05},null,"OK",0.02,3.5000000000000003E-2,0.05]
["4) CPRB",1,0,{"$f":"C24","v":0},null,"FORA DO INTERVALO",4.4999999999999998E-2,4.4999999999999998E-2,4.4999999999999998E-2]
["5) Administração Central",1,0.03,0.03,null,"OK",0.03,0.04,5.5E-2]
["6) Despesas Financeiras",1,5.5999999999999999E-3,5.5999999999999999E-3,null,"FORA DO INTERVALO",5.8999999999999999E-3,1.23E-2,1.3899999999999999E-2]
["7) Seguros + Garantias",1,1.1999999999999999E-3,1.1999999999999999E-3,null,"FORA DO INTERVALO",8.0000000000000002E-3,8.0000000000000002E-3,0.01]
["8) Risco",1,9.7000000000000003E-3,9.7000000000000003E-3,null,"OK",9.7000000000000003E-3,1.2699999999999999E-2,1.2699999999999999E-2]
["9) Lucro",1,6.1600000000000002E-2,6.1600000000000002E-2,null,"OK",6.1600000000000002E-2,7.3999999999999996E-2,8.9599999999999999E-2]
["BDI - FINAL",null,null,{"$f":"(((1+D25+D27+D28)*(1+D26)*(1+D29))/(1-(D21+D22+D23+D24))-1)","v":0.21642862491954062},null,{"$f":"IF(OR(D30<G30,D30>I30),\"FORA DO INTERVALO\",\"OK\")","v":"OK"},0.2034,0.22120000000000001,0.25]
[]
["Notas:"]
["(1) e (2) Alíquota definida por lei."]
["(3) Alíquota e base de cálculo definidas pela legislação municipal."]
["(4) Alíquota definida pelas leis 12.546/11, 12844/13 e 13.161/15 (CPRB – contribuição previdenciária sobre a receita bruta)."]
["(5) Valores definidos a partir dos limites no Acórdão nº 2.622/2013 - TCU – Plenário. Valores entre o 1º e 3º quartis."]
["(6) Valor calculado pela expressão matemática do acórdão 2.369/2011 – TCU – Plenário e disponibilizado pela AGETOP em dezembro de 2018. (Foi utilizado para o cálculo a média da Taxa SELIC no período de 11/2017 a 10/2018)"]
[]
["(7) Valores definidos pela AGETOP a partir dos limites no Acórdão nº 2.622/2013 - TCU – Plenário. Valores médios. \n\nObservação da AGETOP: (Seguros contra erros de execução, incêndio e explosão, danos da natureza (vendaval, destelhamento, alagamento, inundação, desmoronamento, geadas etc.), emprego de material defeituoso ou inadequado, roubo e/ou furto qualificado, quebra de equipamentos, desmoronamento de estrutura, nas modalidades de Obras Civis em Construção (OCC); Instalação e Montagem (IM); e Obras Civis em Construção e Instalação e Montagem (OCC/IM). Bem como coberturas adicionais para ampliação dessas coberturas básicas, como: cobertura de responsabilidade civil geral, cobertura de responsabilidade civil cruzada, cobertura de despesas extraordinárias, cobertura de tumultos, cobertura de desentulho do local, cobertura de riscos do fabricante, dentre outras, incluindo o seguro de vida em grupo regido pela convenção coletiva dos trabalhadores na indústria da construção civil). A partir de 24/02/2015 por intermédio da Portaria 449/2015 a Presidência da AGETOP, na pessoa do Senhor Jayme Eduardo Rincon, determinou a exclusão dos valores referentes aos Seguros de Risco de Engenharia e Responsabilidade Civil do Profissional na composição do cálculo do B.D.I.."]
["(8) Valores definidos a partir dos limites no Acórdão nº 2.622/2013 - TCU – Plenário. Valores entre 1º e 3° quartis."]
["(9) Valores definidos a partir dos limites definidos no Acórdão nº 2.622/2013 - TCU – Plenário. Valores adotados e praticados no mercado ( “ ex ante ” ) ou aqueles entre os 1º e 3º quartis."]
[]
["(*) A fórmula para estipulação da taxa de BDI estimado adotado é a mesma que foi aplicada para a obtenção das tabelas contidas no Acórdão n. 2.622/2013 – TCUPlenário"]
[]
["Obs.: Para obras com valores superiores a R$ 20.000.000,00 sugere-se recalcular o BDI, dimensionando as taxas de administração central e lucro para patamares inferiores ao estipulado acima."]

{"sheet":"Relatório CENTRAL","index":5,"n_rows":40,"n_cols":5,"rows_kept":40,"cut":false,"hidden":false,"merged":[[10,1,10,4],[11,1,11,4],[39,1,39,2],[9,0,11,0],[0,1,0,4],[6,3,6,4],[9,3,9,4],[1,1,1,4],[2,1,2,2],[2,3,2,4],[3,1,3,2],[3,3,3,4],[4,1,4,4],[5,1,5,2],[5,3,5,4],[6,1,6,2],[7,1,7,4],[8,1,8,2],[8,3,8,4],[9,1,9,2]]}
[]
[]
[null,"UNIDADE ESCOLAR",null,"CIDADE"]
[null,{"$f":"Orçamento!$O$4","v":"COLÉGIO ESTADUAL DA POLÍCIA MILITAR DE GOIÁS - GOIANIRA - JOSÉ SILVA OLIVEIRA"},null,{"$f":"Orçamento!$V$7","v":"GOIANIRA"}]
[]
[null,"OBRA",null,"CRE"]
[null,{"$f":"Orçamento!$O$7","v":"REFORMA E AMPLIAÇÃO"},null,{"$f":"Orçamento!$O$10","v":"INHUMAS"}]
[]
[null,"ENDEREÇO",null,"DATA"]
["FILTRO",{"$f":"Orçamento!$R$10","v":"Rua 28 c/ Rua 20 S/N, TRIUNFO I, CEP:75370-000"},null,{"$f":"Orçamento!$S$7","v":"2019-05-21"}]
[]
[null,"RELATÓRIO CENTRAL"]
["↓","CÓDIGO","ETAPA","PREÇO  (R$) C/ BDI","PARTIC  ( % )"]
[{"$f":"IF(D14>0,\"F\",\"\")","v":""},{"$f":"Orçamento!O540","v":"a."},{"$f":"Orçamento!P540","v":"SERVIÇOS PRELIMINARES"},{"$f":"Orçamento!V540","v":0},{"$f":"Orçamento!X540","v":0}]
[{"$f":"IF(D15>0,\"F\",\"\")","v":""},{"$f":"Orçamento!O541","v":"b."},{"$f":"Orçamento!P541","v":"TRANSPORTES"},{"$f":"Orçamento!V541","v":0},{"$f":"Orçamento!X541","v":0}]
["",{"$f":"Orçamento!O542","v":"c."},{"$f":"Orçamento!P542","v":"SERVIÇO EM TERRA"},{"$f":"Orçamento!V542","v":0},{"$f":"Orçamento!X542","v":0}]
["",{"$f":"Orçamento!O543","v":"d."},{"$f":"Orçamento!P543","v":"FUNDAÇÕES E SONDAGENS"},{"$f":"Orçamento!V543","v":0},{"$f":"Orçamento!X543","v":0}]
["",{"$f":"Orçamento!O544","v":"e."},{"$f":"Orçamento!P544","v":"ESTRUTURA"},{"$f":"Orçamento!V544","v":0},{"$f":"Orçamento!X544","v":0}]
["",{"$f":"Orçamento!O545","v":"f."},{"$f":"Orçamento!P545","v":"INSTALAÇÕES ELÉTRICAS"},{"$f":"Orçamento!V545","v":0},{"$f":"Orçamento!X545","v":0}]
["",{"$f":"Orçamento!O546","v":"g."},{"$f":"Orçamento!P546","v":"INSTALAÇÕES HIDROSSANITÁRIAS"},{"$f":"Orçamento!V546","v":0},{"$f":"Orçamento!X546","v":0}]
["",{"$f":"Orçamento!O547","v":"h"},{"$f":"Orçamento!P547","v":"INSTALAÇÕES ESPECIAIS"},{"$f":"Orçamento!V547","v":0},{"$f":"Orçamento!X547","v":0}]
["",{"$f":"Orçamento!O548","v":"i."},{"$f":"Orçamento!P548","v":"ALVENARIAS E DIVISÓRIAS"},{"$f":"Orçamento!V548","v":0},{"$f":"Orçamento!X548","v":0}]
["",{"$f":"Orçamento!O549","v":"j."},{"$f":"Orçamento!P549","v":"ALVENARIA AUTO-PORTANTE"},{"$f":"Orçamento!V549","v":0},{"$f":"Orçamento!X549","v":0}]
["",{"$f":"Orçamento!O550","v":"k."},{"$f":"Orçamento!P550","v":"IMPERMEABILIZAÇÃO"},{"$f":"Orçamento!V550","v":0},{"$f":"Orçamento!X550","v":0}]
["",{"$f":"Orçamento!O551","v":"l."},{"$f":"Orçamento!P551","v":"ISOLAMENTO TÉRMICO E ACÚSTICO"},{"$f":"Orçamento!V551","v":0},{"$f":"Orçamento!X551","v":0}]
["",{"$f":"Orçamento!O552","v":"m."},{"$f":"Orçamento!P552","v":"ESTRUTURA DE MADEIRA"},{"$f":"Orçamento!V552","v":0},{"$f":"Orçamento!X552","v":0}]
["",{"$f":"Orçamento!O553","v":"n."},{"$f":"Orçamento!P553","v":"ESTRUTURAS METÁLICAS"},{"$f":"Orçamento!V553","v":0},{"$f":"Orçamento!X553","v":0}]
["",{"$f":"Orçamento!O554","v":"o."},{"$f":"Orçamento!P554","v":"COBERTURAS"},{"$f":"Orçamento!V554","v":0},{"$f":"Orçamento!X554","v":0}]
["",{"$f":"Orçamento!O555","v":"p."},{"$f":"Orçamento!P555","v":"ESQUADRIAS DE MADEIRA"},{"$f":"Orçamento!V555","v":0},{"$f":"Orçamento!X555","v":0}]
["",{"$f":"Orçamento!O556","v":"q."},{"$f":"Orçamento!P556","v":"ESQUADRIAS METÁLICAS"},{"$f":"Orçamento!V556","v":0},{"$f":"Orçamento!X556","v":0}]
["",{"$f":"Orçamento!O557","v":"r."},{"$f":"Orçamento!P557","v":"VIDROS"},{"$f":"Orçamento!V557","v":0},{"$f":"Orçamento!X557","v":0}]
["",{"$f":"Orçamento!O558","v":"s."},{"$f":"Orçamento!P558","v":"REVESTIMENTO DE PAREDE"},{"$f":"Orçamento!V558","v":0},{"$f":"Orçamento!X558","v":0}]
["",{"$f":"Orçamento!O559","v":"t."},{"$f":"Orçamento!P559","v":"FORROS"},{"$f":"Orçamento!V559","v":0},{"$f":"Orçamento!X559","v":0}]
["",{"$f":"Orçamento!O560","v":"u."},{"$f":"Orçamento!P560","v":"REVESTIMENTO DE PISO"},{"$f":"Orçamento!V560","v":0},{"$f":"Orçamento!X560","v":0}]
["",{"$f":"Orçamento!O561","v":"v."},{"$f":"Orçamento!P561","v":"FERRAGENS"},{"$f":"Orçamento!V561","v":0},{"$f":"Orçamento!X561","v":0}]
["",{"$f":"Orçamento!O562","v":"w."},{"$f":"Orçamento!P562","v":"MARCENARIA"},{"$f":"Orçamento!V562","v":0},{"$f":"Orçamento!X562","v":0}]
["",{"$f":"Orçamento!O563","v":"x."},{"$f":"Orçamento!P563","v":"ADMINISTRAÇÃO"},{"$f":"Orçamento!V563","v":0},{"$f":"Orçamento!X563","v":0}]
["",{"$f":"Orçamento!O564","v":"y."},{"$f":"Orçamento!P564","v":"PINTURA"},{"$f":"Orçamento!V564","v":0},{"$f":"Orçamento!X564","v":0}]
["",{"$f":"Orçamento!O565","v":"z."},{"$f":"Orçamento!P565","v":"DIVERSOS"},{"$f":"Orçamento!V565","v":0},{"$f":"Orçamento!X565","v":0}]
["F","TOTAL GERAL DO ORÇAMENTO (R$) C/BDI",null,{"$f":"SUM(D14:D39)","v":0},{"$f":"SUM(E14:E39)","v":0}]

{"sheet":"Parc Maior Relev","index":6,"n_rows":20,"n_cols":7,"rows_kept":20,"cut":false,"hidden":false,"merged":[[0,1,0,6],[11,1,11,6],[1,1,1,6],[2,1,2,3],[2,4,2,6],[3,1,3,3],[3,4,3,6],[4,1,4,6],[5,1,5,3],[5,4,5,6],[9,1,9,3],[9,4,9,6],[10,1,10,6],[6,1,6,3],[6,4,6,6],[7,1,7,6],[10,0,12,0],[8,1,8,3],[8,4,8,6],[20,3,20,7],[18,1,18,6]]}
[]
[]
[null,"UNIDADE ESCOLAR",null,null,"CÓDIGO INEP"]
[null,{"$f":"Orçamento!$O$4","v":"COLÉGIO ESTADUAL DA POLÍCIA MILITAR DE GOIÁS - GOIANIRA - JOSÉ SILVA OLIVEIRA"},null,null,{"$f":"Orçamento!$V$4","v":52096939}]
[]
[null,"OBRA",null,null,"CIDADE"]
[null,{"$f":"Orçamento!$O$7","v":"REFORMA E AMPLIAÇÃO"},null,null,{"$f":"Orçamento!$V$7","v":"GOIANIRA"}]
[]
[null,"CRE",null,null,"ÁREA TOTAL CONSTRUÍDA (M²)"]
[null,{"$f":"Orçamento!$O$10","v":"INHUMAS"},null,null,{"$f":"Orçamento!$S$13","v":3204.2200000000003}]
["FILTRO"]
[null,"PARCELA DE MAIOR RELEVÂNCIA"]
[null,"CÓDIGO","SERVIÇO","DESCRIÇÃO","UNID","QUANT","PARC. MAIOR RELEV (50%)"]
[{"$f":"IF(F14>0,\"F\",\"\")","v":"F"},"U.",{"$f":"IFERROR(VLOOKUP(B14,Orçamento!$O$540:$P$565,2,FALSE),\"(inserir código ao lado)\")","v":"REVESTIMENTO DE PISO"},"PISO EM GRANITINA","m2    ",434.58000000000004,{"$f":"F14/2","v":217.29000000000002}]
[{"$f":"IF(F15>0,\"F\",\"\")","v":"F"},"O.",{"$f":"IFERROR(VLOOKUP(B15,Orçamento!$O$540:$P$565,2,FALSE),\"(inserir código ao lado)\")","v":"COBERTURAS"},"COBERTURA CERÂMICA","m2    ",560.06999999999994,{"$f":"F15/2","v":280.03499999999997}]
[{"$f":"IF(F16>0,\"F\",\"\")","v":""},null,{"$f":"IFERROR(VLOOKUP(B16,Orçamento!$O$540:$P$565,2,FALSE),\"(inserir código ao lado)\")","v":"(inserir código ao lado)"},null,{"$f":"IFERROR(VLOOKUP($D16,Orçamento!$R$20:$W$521,2,FALSE),\"-\")","v":"-"},{"$f":"SUMIF(Orçamento!$R$20:$R$521,'Parc Maior Relev'!D16,Orçamento!$T$20:$T$521)","v":0},{"$f":"F16*0.5","v":0}]
["",null,{"$f":"IFERROR(VLOOKUP(B17,Orçamento!$O$540:$P$565,2,FALSE),\"(inserir código ao lado)\")","v":"(inserir código ao lado)"},null,{"$f":"IFERROR(VLOOKUP($D17,Orçamento!$R$20:$W$521,2,FALSE),\"-\")","v":"-"},{"$f":"SUMIF(Orçamento!$R$20:$R$521,'Parc Maior Relev'!D17,Orçamento!$T$20:$T$521)","v":0},{"$f":"F17*0.5","v":0}]
["F"]
["F","(*) Para os fins do inciso I dp § 1º do Art. 30 da Lei Federal 8.666/93, são consideradas parcelas de maior relevância técnica as execuções apresentadas"]
["F"]

{"sheet":"Composições","index":7,"n_rows":338,"n_cols":10,"rows_kept":338,"cut":false,"hidden":false,"merged":[[1,0,1,9],[3,7,3,9],[4,7,4,9],[6,7,6,9],[7,7,7,9],[6,0,6,6],[10,8,10,9],[13,8,13,9],[14,0,14,9],[8,0,8,9],[5,0,5,9],[2,0,2,9],[16,5,17,5],[16,6,16,7],[16,8,16,9],[16,0,17,0],[16,1,17,1],[16,2,17,2],[16,3,17,3],[16,4,17,4],[0,0,0,8],[10,0,10,2],[10,3,10,6],[11,0,11,9],[12,0,12,2],[12,3,12,6],[12,7,12,8],[7,0,7,6],[9,0,9,2],[9,3,9,6],[9,7,9,8],[3,0,3,6],[4,0,4,6],[15,0,15,9],[13,0,13,2],[13,3,13,6],[33,8,33,9],[33,0,34,0],[33,1,34,1],[33,2,34,2],[33,3,34,3],[33,4,34,4],[25,5,26,5],[25,6,25,7],[25,8,25,9],[25,0,26,0],[25,1,26,1],[25,2,26,2],[25,3,26,3],[25,4,26,4],[31,1,31,7],[29,1,29,7],[57,8,57,9],[57,0,58,0],[57,1,58,1],[57,2,58,2],[57,3,58,3],[57,4,58,4],[45,5,46,5],[45,6,45,7],[45,8,45,9],[45,0,46,0],[45,1,46,1],[45,2,46,2],[45,3,46,3],[45,4,46,4],[77,8,77,9],[77,0,78,0],[77,1,78,1],[77,2,78,2],[77,3,78,3],[77,4,78,4],[67,5,68,5],[67,6,67,7],[67,8,67,9],[67,0,68,0],[67,1,68,1],[67,2,68,2],[67,3,68,3],[67,4,68,4],[99,8,99,9],[99,0,100,0],[99,1,100,1],[99,2,100,2],[99,3,100,3],[99,4,100,4],[87,5,88,5],[87,6,87,7],[87,8,87,9],[87,0,88,0],[87,1,88,1],[87,2,88,2],[87,3,88,3],[87,4,88,4],[123,8,123,9],[123,0,124,0],[123,1,124,1],[123,2,124,2],[123,3,124,3],[123,4,124,4],[111,5,112,5],[111,6,111,7],[111,8,111,9],[111,0,112,0],[111,1,112,1],[111,2,112,2],[111,3,112,3],[111,4,112,4],[147,8,147,9],[147,0,148,0],[147,1,148,1],[147,2,148,2],[147,3,148,3],[147,4,148,4],[135,5,136,5],[135,6,135,7],[135,8,135,9],[135,0,136,0],[135,1,136,1],[135,2,136,2],[135,3,136,3],[135,4,136,4],[145,1,145,7],[141,1,141,7],[172,8,172,9],[172,0,173,0],[172,1,173,1],[172,2,173,2],[172,3,173,3],[172,4,173,4],[157,5,158,5],[157,6,157,7],[157,8,157,9],[157,0,158,0],[157,1,158,1],[157,2,158,2],[157,3,158,3],[157,4,158,4],[196,8,196,9],[196,0,197,0],[196,1,197,1],[196,2,197,2],[196,3,197,3],[196,4,197,4],[184,5,185,5],[184,6,184,7],[184,8,184,9],[184,0,185,0],[184,1,185,1],[184,2,185,2],[184,3,185,3],[184,4,185,4],[231,8,231,9],[231,0,232,0],[231,1,232,1],[231,2,232,2],[231,3,232,3],[231,4,232,4],[208,5,209,5],[208,6,208,7],[208,8,208,9],[208,0,209,0],[208,1,209,1],[208,2,209,2],[208,3,209,3],[208,4,209,4],[255,8,255,9],[255,0,256,0],[255,1,256,1],[255,2,256,2],[255,3,256,3],[255,4,256,4],[243,5,244,5],[243,6,243,7],[243,8,243,9],[243,0,244,0],[243,1,244,1],[243,2,244,2],[243,3,244,3],[243,4,244,4],[279,8,279,9],[279,0,280,0],[279,1,280,1],[279,2,280,2],[279,3,280,3],[279,4,280,4],[267,5,268,5],[267,6,267,7],[267,8,267,9],[267,0,268,0],[267,1,268,1],[267,2,268,2],[267,3,268,3],[267,4,268,4],[277,1,277,7],[273,1,273,7],[303,8,303,9],[303,0,304,0],[303,1,304,1],[303,2,304,2],[303,3,304,3],[303,4,304,4],[291,5,292,5],[291,6,291,7],[291,8,291,9],[291,0,292,0],[291,1,292,1],[291,2,292,2],[291,3,292,3],[291,4,292,4],[337,1,337,7],[333,1,333,7],[325,1,325,7],[321,1,321,7],[313,1,313,7],[327,5,328,5],[327,6,327,7],[327,8,327,9],[327,0,328,0],[327,1,328,1],[327,2,328,2],[327,3,328,3],[327,4,328,4],[315,5,316,5],[315,6,315,7],[315,8,315,9],[315,0,316,0],[315,1,316,1],[315,2,316,2],[315,3,316,3],[315,4,316,4],[265,1,265,7],[261,1,261,7],[253,1,253,7],[309,1,309,7],[301,1,301,7],[297,1,297,7],[289,1,289,7],[285,1,285,7],[303,5,304,5],[303,6,303,7],[279,5,280,5],[279,6,279,7],[255,5,256,5],[255,6,255,7],[206,1,206,7],[202,1,202,7],[194,1,194,7],[190,1,190,7],[182,1,182,7],[249,1,249,7],[241,1,241,7],[237,1,237,7],[229,1,229,7],[214,1,214,7],[231,5,232,5],[231,6,231,7],[196,5,197,5],[196,6,196,7],[133,1,133,7],[129,1,129,7],[121,1,121,7],[178,1,178,7],[170,1,170,7],[163,1,163,7],[155,1,155,7],[151,1,151,7],[172,5,173,5],[172,6,172,7],[147,5,148,5],[147,6,147,7],[123,5,124,5],[123,6,123,7],[85,1,85,7],[82,1,82,7],[75,1,75,7],[72,1,72,7],[65,1,65,7],[117,1,117,7],[109,1,109,7],[105,1,105,7],[97,1,97,7],[93,1,93,7],[99,5,100,5],[99,6,99,7],[77,5,78,5],[77,6,77,7],[23,1,23,7],[21,1,21,7],[62,1,62,7],[55,1,55,7],[51,1,51,7],[43,1,43,7],[39,1,39,7],[57,5,58,5],[57,6,57,7],[33,5,34,5],[33,6,33,7]]}
[]
[]
[]
["UNIDADE ESCOLAR",null,null,null,null,null,null,"CÓDIGO INEP"]
[{"$f":"Orçamento!$O$4","v":"COLÉGIO ESTADUAL DA POLÍCIA MILITAR DE GOIÁS - GOIANIRA - JOSÉ SILVA OLIVEIRA"},null,null,null,null,null,null,{"$f":"Orçamento!$V$4","v":52096939}]
[]
["OBRA",null,null,null,null,null,null,"CIDADE"]
[{"$f":"Orçamento!$O$7","v":"REFORMA E AMPLIAÇÃO"},null,null,null,null,null,null,{"$f":"Orçamento!$V$7","v":"GOIANIRA"}]
[]
["CRE",null,null,"ENDEREÇO",null,null,null,"REFERÊNCIA AGETOP"]
[{"$f":"Orçamento!$O$10","v":"INHUMAS"},null,null,{"$f":"Orçamento!$R$10","v":"Rua 28 c/ Rua 20 S/N, TRIUNFO I, CEP:75370-000"},null,null,null,{"$f":"Orçamento!$V$10","v":"DEZ/18"},{"$f":"Orçamento!$W$10","v":"ONERADA"}]
[]
["DATA",null,null,"ÁREA TOTAL CONSTRUÍDA (M²)",null,null,null,"REFERÊNCIA SINAPI"]
[{"$f":"Orçamento!$S$7","v":"2019-05-21"},null,null,{"$f":"Orçamento!$S$13","v":3204.2200000000003},null,null,null,{"$f":"Orçamento!$V$13","v":"MAR/19"},{"$f":"Orçamento!$W$13","v":"ONERADA"}]
[]
["COMPOSIÇÕES DE CUSTOS UNITÁRIOS - SEE-GO"]
[17,"FONTE","CÓDIGO","DESCRIÇÃO","UNIDADE","COEFIC.","CUSTO UNITÁRIO",null,"CUSTO  TOTAL (A) + (B) + (C) + (D) + (E)"]
[null,null,null,null,null,null,"DESONERADO","NÃO DESONER.","DESONERADO","NÃO DESONER."]
[null,"COMPOSIÇÃO","COMP 017_SEE","REDUCAO GIRATÓRIA TIPO STORZ LATAO P/ INST. PREDIAL COMBATE A INCENDIO ENGATE RAPIDO 2.1/2\" X 1.1/2\"","UN ",null,"-","-",94.15,94.7]
[null,"AGETOP_I",8,"AJUDANTE","h     ",0.16,8.1999999999999993,9.51,1.31,1.52]
[null,"AGETOP_I",11,"ENCANADOR","h     ",0.16,13.4,15.53,2.14,2.48]
[null,"MÃO DE OBRA (B) - TOTAL",null,null,null,null,null,null,3.45,4]
[null,"SINAPI_I",20972,"REDUCAO FIXA TIPO STORZ, ENGATE RAPIDO 2.1/2\" X 1.1/2\", EM LATAO, PARA INSTALACAO PREDIAL COMBATE A INCENDIO PREDIAL","UN    ",1,90.7,90.7,90.7,90.7]
[null,"MATERIAL (C) - TOTAL",null,null,null,null,null,null,90.7,90.7]
[]
[18,"FONTE","CÓDIGO","DESCRIÇÃO","UNIDADE","COEFIC.","CUSTO UNITÁRIO",null,"CUSTO  TOTAL (A) + (B) + (C) + (D) + (E)"]
[null,null,null,null,null,null,"DESONERADO","NÃO DESONER.","DESONERADO","NÃO DESONER."]
[null,"COMPOSIÇÃO","COMP 018_SEE","CHAVE DUPLA P/ CONEXÕES TIPO STORZ EM LATÃO ENGATE RÁPIDO 1 1/2\" X 2 1/2\"","UN ",null,"-","-",14.1,14.42]
[null,"AGETOP_I",11,"ENCANADOR","h     ",0.15,13.4,15.53,2.0099999999999998,2.33]
[null,"MÃO DE OBRA (B) - TOTAL",null,null,null,null,null,null,2.0099999999999998,2.33]
[null,"SINAPI_I",20971,"CHAVE DUPLA PARA CONEXOES TIPO STORZ, ENGATE RAPIDO 1 1/2\" X 2 1/2\", EM LATAO, PARA INSTALACAO PREDIAL COMBATE A INCENDIO","UN    ",1,12.09,12.09,12.09,12.09]
[null,"MATERIAL (C) - TOTAL",null,null,null,null,null,null,12.09,12.09]
[]
[87,"FONTE","CÓDIGO","DESCRIÇÃO","UNIDADE","COEFIC.","CUSTO UNITÁRIO",null,"CUSTO  TOTAL (A) + (B) + (C) + (D) + (E)"]
[null,null,null,null,null,null,"DESONERADO","NÃO DESONER.","DESONERADO","NÃO DESONER."]
[null,"COMPOSIÇÃO","COMP 087_SEE","REGISTRO DE GAVETA COM HASTE ASCENDENTE DE BRONZE 2 1/2\"","UN ",null,null,null,257.29999999999995,261.26]
[null,"AGETOP_I",8,"AJUDANTE","h     ",1.1499999999999999,8.1999999999999993,9.51,9.43,10.94]
[null,"AGETOP_I",11,"ENCANADOR","h     ",1.1499999999999999,13.4,15.53,15.41,17.86]
[null,null,null,"","",null,0,0,0,0]
[null,"MÃO DE OBRA (B) - TOTAL",null,null,null,null,null,null,24.84,28.799999999999997]
[null,"AGETOP_I","H689","FITA VEDAROSCA 12 MM","m",2.82,0.28000000000000003,0.28000000000000003,0.79,0.79]
[null,"COTAÇÃO","COT 017_SEE","REGISTRO DE GAVETA COM HASTE ASCENDENTE DE BRONZE 2 1/2\"","UN ",1,231.66666666666666,231.66666666666666,231.67,231.67]
[null,null,null,"","",null,0,0,0,0]
[null,"MATERIAL (C) - TOTAL",null,null,null,null,null,null,232.45999999999998,232.45999999999998]
[]
[19,"FONTE","CÓDIGO","DESCRIÇÃO","UNIDADE","COEFIC.","CUSTO UNITÁRIO",null,"CUSTO  TOTAL (A) + (B) + (C) + (D) + (E)"]
[null,null,null,null,null,null,"DESONERADO","NÃO DESONER.","DESONERADO","NÃO DESONER."]
[null,"COMPOSIÇÃO","COMP 019_SEE","TAMPÃO LATAO C/ CORRENTE P/ INSTALAÇÃO PREDIAL COMBATE A INCÊNDIO ENGATE RÁPIDO 1 1/2\"","UN ",null,"-","-",52.82,53.339999999999996]
[null,"AGETOP_I",11,"ENCANADOR","h     ",0.15,13.4,15.53,2.0099999999999998,2.33]
[null,"AGETOP_I",8,"AJUDANTE","h     ",0.15,8.1999999999999993,9.51,1.23,1.43]
[null,null,null,"","",null,0,0,0,0]
[null,"MÃO DE OBRA (B) - TOTAL",null,null,null,null,null,null,3.2399999999999998,3.76]
[null,"SINAPI_I",20964,"TAMPAO COM CORRENTE, EM LATAO, ENGATE RAPIDO 1 1/2\", PARA INSTALACAO PREDIAL DE COMBATE A INCENDIO","UN    ",1,49.58,49.58,49.58,49.58]
[null,null,null,"","",null,0,0,0,0]
[null,null,null,"","",null,0,0,0,0]
[null,"MATERIAL (C) - TOTAL",null,null,null,null,null,null,49.58,49.58]
[]
[30,"FONTE","CÓDIGO","DESCRIÇÃO","UNIDADE","COEFIC.","CUSTO UNITÁRIO",null,"CUSTO  TOTAL (A) + (B) + (C) + (D) + (E)"]
[null,null,null,null,null,null,"DESONERADO","NÃO DESONER.","DESONERADO","NÃO DESONER."]
[null,"COMPOSIÇÃO","COMP 030_SEE","COTOVELO DE FERRO GALV. 90° X 2 1/2\"","UN ",null,null,null,68.89,72.06]
[null,"AGETOP_I",8,"AJUDANTE","h     ",0.92,8.1999999999999993,9.51,7.54,8.75]
[null,"AGETOP_I",11,"ENCANADOR","h     ",0.92,13.4,15.53,12.33,14.29]
[null,"MÃO DE OBRA (B) - TOTAL",null,null,null,null,null,null,19.87,23.04]
[null,"SINAPI_I",3470,"COTOVELO 90 GRAUS DE FERRO GALVANIZADO, COM ROSCA BSP, DE 2 1/2\"","UN    ",1,48.46,48.46,48.46,48.46]
[null,"AGETOP_I","H689","FITA VEDAROSCA 12 MM","m",2,0.28000000000000003,0.28000000000000003,0.56000000000000005,0.56000000000000005]
[null,"MATERIAL (C) - TOTAL",null,null,null,null,null,null,49.02,49.02]
[]
[77,"FONTE","CÓDIGO","DESCRIÇÃO","UNIDADE","COEFIC.","CUSTO UNITÁRIO",null,"CUSTO  TOTAL (A) + (B) + (C) + (D) + (E)"]
[null,null,null,null,null,null,"DESONERADO","NÃO DESONER.","DESONERADO","NÃO DESONER."]
[null,"COMPOSIÇÃO","COMP 077_SEE","UNIAO FERRO GALV C/ASSENTO CONICO BRONZE 2 1/2\"","UN ",null,null,null,147.51999999999998,148.88999999999999]
[null,"AGETOP_I",8,"AJUDANTE","h     ",0.4,8.1999999999999993,9.51,3.28,3.8]
[null,"AGETOP_I",11,"ENCANADOR","h     ",0.4,13.4,15.53,5.36,6.21]
[null,"MÃO DE OBRA (B) - TOTAL",null,null,null,null,null,null,8.64,10.01]
[null,"AGETOP_I","H689","FITA VEDAROSCA 12 MM","m",2.4,0.28000000000000003,0.28000000000000003,0.67,0.67]
[null,"SINAPI_I",12427,"UNIAO COM ASSENTO CONICO DE BRONZE, DIAMETRO 2 1/2\"","UN    ",1,138.21,138.21,138.21,138.21]
[null,"MATERIAL (C) - TOTAL",null,null,null,null,null,null,138.88,138.88]
[]
[76,"FONTE","CÓDIGO","DESCRIÇÃO","UNIDADE","COEFIC.","CUSTO UNITÁRIO",null,"CUSTO  TOTAL (A) + (B) + (C) + (D) + (E)"]
[null,null,null,null,null,null,"DESONERADO","NÃO DESONER.","DESONERADO","NÃO DESONER."]
[null,"COMPOSIÇÃO","COMP 076_SEE","CURVA FERRO GALVANIZADO 45G ROSCA MACHO/FEMEA REF. 2 1/2\"","UN ",null,null,null,116.11,119.28]
[null,"AGETOP_I",8,"AJUDANTE","h     ",0.92,8.1999999999999993,9.51,7.54,8.75]
[null,"AGETOP_I",11,"ENCANADOR","h     ",0.92,13.4,15.53,12.33,14.29]
[null,"MÃO DE OBRA (B) - TOTAL",null,null,null,null,null,null,19.87,23.04]
[null,"SINAPI_I",3148,"FITA VEDA ROSCA EM ROLOS DE 18 MM X 50 M (L X C)","UN    ",4.9099999999999998E-2,12.9,12.9,0.63,0.63]
[null,"SINAPI_I",1784,"CURVA 45 GRAUS DE FERRO GALVANIZADO, COM ROSCA BSP MACHO/FEMEA, DE 2 1/2\"","UN    ",1,95.61,95.61,95.61,95.61]
[null,"MATERIAL (C) - TOTAL",null,null,null,null,null,null,96.24,96.24]
[]
[22,"FONTE","CÓDIGO","DESCRIÇÃO","UNIDADE","COEFIC.","CUSTO UNITÁRIO",null,"CUSTO  TOTAL (A) + (B) + (C) + (D) + (E)"]
[null,null,null,null,null,null,"DESONERADO","NÃO DESONER.","DESONERADO","NÃO DESONER."]
[null,"COMPOSIÇÃO","COMP 022_SEE","TAMPÃO FOFO 40X50CM C/INSCRIÇÃO ","UN ",null,"-","-",216.53,216.85000000000002]
[null,"AGETOP_I",11,"ENCANADOR","h     ",0.15,13.4,15.53,2.0099999999999998,2.33]
[null,null,null,"","",null,0,0,0,0]
[null,null,null,"","",null,0,0,0,0]
[null,"MÃO DE OBRA (B) - TOTAL",null,null,null,null,null,null,2.0099999999999998,2.33]
[null,"SINAPI_I",11293,"TAMPAO FOFO SIMPLES COM BASE, CLASSE A15 CARGA MAX 1,5 T, 400 X 500 MM, COM INSCRICAO INCENDIO","UN    ",1,214.52,214.52,214.52,214.52]
[null,null,null,"","",null,0,0,0,0]
[null,null,null,"","",null,0,0,0,0]
[null,"MATERIAL (C) - TOTAL",null,null,null,null,null,null,214.52,214.52]
[]
[24,"FONTE","CÓDIGO","DESCRIÇÃO","UNIDADE","COEFIC.","CUSTO UNITÁRIO",null,"CUSTO  TOTAL (A) + (B) + (C) + (D) + (E)"]
[null,null,null,null,null,null,"DESONERADO","NÃO DESONER.","DESONERADO","NÃO DESONER."]
[null,"COMPOSIÇÃO","COMP 024_SEE","SINALIZADOR FOTOLUMINESCENTE PARA EXTINTOR","UN ",null,"-","-",25.269999999999996,25.389999999999997]
[null,"AGETOP_I",5,"SERVENTE","h     ",0.09,8.1999999999999993,9.51,0.74,0.86]
[null,null,null,"","",null,0,0,0,0]
[null,null,null,"","",null,0,0,0,0]
[null,"MÃO DE OBRA (B) - TOTAL",null,null,null,null,null,null,0.74,0.86]
[null,"AGETOP_I",3070,"BUCHA DE NYLON S-6","un",2,0.04,0.04,0.08,0.08]
[null,"AGETOP_I",3393,"PARAFUSO P/BUCHA S-6","un",2,0.08,0.08,0.16,0.16]
[null,"SINAPI_I",37556,"PLACA DE SINALIZACAO DE SEGURANCA CONTRA INCENDIO, FOTOLUMINESCENTE, QUADRADA, *20 X 20* CM, EM PVC *2* MM ANTI-CHAMAS (SIMBOLOS, CORES E PICTOGRAMAS CONFORME NBR 13434)","UN    ",1,24.29,24.29,24.29,24.29]
[null,"MATERIAL (C) - TOTAL",null,null,null,null,null,null,24.529999999999998,24.529999999999998]
[]
[186,"FONTE","CÓDIGO","DESCRIÇÃO","UNIDADE","COEFIC.","CUSTO UNITÁRIO",null,"CUSTO  TOTAL (A) + (B) + (C) + (D) + (E)"]
[null,null,null,null,null,null,"DESONERADO","NÃO DESONER.","DESONERADO","NÃO DESONER."]
[null,"COMPOSIÇÃO","COMP 186_SEE","BOTOEIRA BOMBA DE INCÊNDIO C/ MARTELO CONVENCIONAL/ ANALÓGICA","UN ",null,null,null,85.1,88.539999999999992]
[null,"AGETOP_I",8,"AJUDANTE","h     ",1,8.1999999999999993,9.51,8.1999999999999993,9.51]
[null,"AGETOP_I",12,"ELETRICISTA","h     ",1,13.4,15.53,13.4,15.53]
[null,null,null,"","",null,0,0,0,0]
[null,"MÃO DE OBRA (B) - TOTAL",null,null,null,null,null,null,21.6,25.04]
[null,"COTAÇÃO","COT 088_SEE","BOTOEIRA BOMBA DE INCÊNDIO C/ MARTELO CONVENCIONAL/ ANALÓGICA","UN",1,63.5,63.5,63.5,63.5]
[null,null,null,"","",null,0,0,0,0]
[null,null,null,"","",null,0,0,0,0]
[null,"MATERIAL (C) - TOTAL",null,null,null,null,null,null,63.5,63.5]
[]
[188,"FONTE","CÓDIGO","DESCRIÇÃO","UNIDADE","COEFIC.","CUSTO UNITÁRIO",null,"CUSTO  TOTAL (A) + (B) + (C) + (D) + (E)"]
[null,null,null,null,null,null,"DESONERADO","NÃO DESONER.","DESONERADO","NÃO DESONER."]
[null,"COMPOSIÇÃO","COMP 188_SEE","ACIONADOR MANUAL DE ALARME","UN ",null,null,null,100.61,103.36]
[null,"AGETOP_I",8,"AJUDANTE","h     ",0.8,8.1999999999999993,9.51,6.56,7.61]
[null,"AGETOP_I",12,"ELETRICISTA","h     ",0.8,13.4,15.53,10.72,12.42]
[null,null,null,"","",null,0,0,0,0]
[null,"MÃO DE OBRA (B) - TOTAL",null,null,null,null,null,null,17.28,20.03]
[null,"COTAÇÃO","COT 090_SEE","ACIONADOR MANUAL DE ALARME","UN",1,83.333333333333329,83.333333333333329,83.33,83.33]
[null,null,null,"","",null,0,0,0,0]
[null,null,null,"","",null,0,0,0,0]
[null,"MATERIAL (C) - TOTAL",null,null,null,null,null,null,83.33,83.33]
[]
[190,"FONTE","CÓDIGO","DESCRIÇÃO","UNIDADE","COEFIC.","CUSTO UNITÁRIO",null,"CUSTO  TOTAL (A) + (B) + (C) + (D) + (E)"]
[null,null,null,null,null,null,"DESONERADO","NÃO DESONER.","DESONERADO","NÃO DESONER."]
[null,"COMPOSIÇÃO","COMP 190_SEE","CENTRAL DE DETECÇÃO E ALARME DE 40 SETORES COM BATERIA","UN ",null,null,null,1136.1300000000001,1163.6500000000001]
[null,"AGETOP_I",8,"AJUDANTE","h     ",8,8.1999999999999993,9.51,65.599999999999994,76.08]
[null,"AGETOP_I",12,"ELETRICISTA","h     ",8,13.4,15.53,107.2,124.24]
[null,null,null,"","",null,0,0,0,0]
[null,"MÃO DE OBRA (B) - TOTAL",null,null,null,null,null,null,172.8,200.32]
[null,"COTAÇÃO","COT 092_SEE","CENTRAL DE DETECÇÃO E ALARME DE 40 SETORES COM BATERIA (PREÇO MÉDIO)","UN",1,963.33333333333337,963.33333333333337,963.33,963.33]
[null,null,null,"","",null,0,0,0,0]
[null,null,null,"","",null,0,0,0,0]
[null,"MATERIAL (C) - TOTAL",null,null,null,null,null,null,963.33,963.33]
[]
[25,"FONTE","CÓDIGO","DESCRIÇÃO","UNIDADE","COEFIC.","CUSTO UNITÁRIO",null,"CUSTO  TOTAL (A) + (B) + (C) + (D) + (E)"]
[null,null,null,null,null,null,"DESONERADO","NÃO DESONER.","DESONERADO","NÃO DESONER."]
[null,"COMPOSIÇÃO","COMP 025_SEE","SINALIZADOR FOTOLUMINESCENTE DE EMERGÊNCIA","UN ",null,"-","-",25.269999999999996,25.389999999999997]
[null,"AGETOP_I",5,"SERVENTE","h     ",0.09,8.1999999999999993,9.51,0.74,0.86]
[null,"MÃO DE OBRA (B) - TOTAL",null,null,null,null,null,null,0.74,0.86]
[null,"AGETOP_I",3070,"BUCHA DE NYLON S-6","un",2,0.04,0.04,0.08,0.08]
[null,"AGETOP_I",3393,"PARAFUSO P/BUCHA S-6","un",2,0.08,0.08,0.16,0.16]
[null,"SINAPI_I",37556,"PLACA DE SINALIZACAO DE SEGURANCA CONTRA INCENDIO, FOTOLUMINESCENTE, QUADRADA, *20 X 20* CM, EM PVC *2* MM ANTI-CHAMAS (SIMBOLOS, CORES E PICTOGRAMAS CONFORME NBR 13434)","UN    ",1,24.29,24.29,24.29,24.29]
[null,"MATERIAL (C) - TOTAL",null,null,null,null,null,null,24.529999999999998,24.529999999999998]
[]
[277,"FONTE","CÓDIGO","DESCRIÇÃO","UNIDADE","COEFIC.","CUSTO UNITÁRIO",null,"CUSTO  TOTAL (A) + (B) + (C) + (D) + (E)"]
[null,null,null,null,null,null,"DESONERADO","NÃO DESONER.","DESONERADO","NÃO DESONER."]
[null,"COMPOSIÇÃO","COMP 277_SEE","MARCAÇÃO NO PISO - 1X1 M PARA EXTINTOR","M2",null,null,null,27.719999999999995,27.799999999999997]
[null,"AGETOP_I",5,"SERVENTE","h     ",3.3300000000000003E-2,8.1999999999999993,9.51,0.27,0.32]
[null,null,null,"","",null,0,0,0,0]
[null,null,null,"","",null,0,0,0,0]
[null,"MÃO DE OBRA (B) - TOTAL",null,null,null,null,null,null,0.27,0.32]
[null,"SINAPI_I",5318,"SOLVENTE DILUENTE A BASE DE AGUARRAS","L     ",0.13,10.98,10.98,1.43,1.43]
[null,"SINAPI",5824,"CAMINHÃO TOCO, PBT 16.000 KG, CARGA ÚTIL MÁX. 10.685 KG, DIST. ENTRE EIXOS 4,8 M, POTÊNCIA 189 CV, INCLUSIVE CARROCERIA FIXA ABERTA DE MADEIRA P/ TRANSPORTE GERAL DE CARGA SECA, DIMEN. APROX. 2,5 X 7,00 X 0,50 M - CHP DIURNO. AF_06/2014","CHP",3.3E-3,135.91999999999999,139.13,0.45,0.46]
[null,"SINAPI_I",7343,"TINTA A BASE DE RESINA ACRILICA, PARA SINALIZACAO HORIZONTAL VIARIA (NBR 11862)","L     ",0.6,11.69,11.69,7.01,7.01]
[null,"SINAPI_I",7348,"TINTA ACRILICA PREMIUM PARA PISO","L     ",0.03,12.39,12.39,0.37,0.37]
[null,"SINAPI_I",25972,"MICROESFERAS DE VIDRO PARA SINALIZACAO HORIZONTAL VIARIA, TIPO I-B (PREMIX) - NBR 16184","KG    ",2.14,8.33,8.33,17.829999999999998,17.829999999999998]
[null,"SINAPI",95133,"MÁQUINA DEMARCADORA DE FAIXA DE TRÁFEGO À FRIO, AUTOPROPELIDA, POTÊNCIA 38 HP - CHP DIURNO. AF_07/2016","CHP",3.3E-3,110.07,113.65,0.36,0.38]
[null,"MATERIAL (C) - TOTAL",null,null,null,null,null,null,27.449999999999996,27.479999999999997]
[]
[40,"FONTE","CÓDIGO","DESCRIÇÃO","UNIDADE","COEFIC.","CUSTO UNITÁRIO",null,"CUSTO  TOTAL (A) + (B) + (C) + (D) + (E)"]
[null,null,null,null,null,null,"DESONERADO","NÃO DESONER.","DESONERADO","NÃO DESONER."]
[null,"COMPOSIÇÃO","COMP 040_SEE","CONJUNTO MOTOR-BOMBA ELÉTRICA TRIFÁSICO 380/220 V PARA VZ= 24,33 M³/H, HM= 46,24 M POTÊNCIA= 7,5 CV","UN ",null,null,null,3965.4700000000003,3992.9900000000002]
[null,"AGETOP_I",8,"AJUDANTE","h     ",8,8.1999999999999993,9.51,65.599999999999994,76.08]
[null,"AGETOP_I",11,"ENCANADOR","h     ",8,13.4,15.53,107.2,124.24]
[null,null,null,"","",null,0,0,0,0]
[null,"MÃO DE OBRA (B) - TOTAL",null,null,null,null,null,null,172.8,200.32]
[null,"COTAÇÃO","COT 008_SEE","CONJUNTO MOTOR-BOMBA ELÉTRICA TRIFÁSICO 380/220 V PARA VZ= 24,33 M³/H, HM= 46,24 M POTÊNCIA= 7,5 CV","UN ",1,3792.6666666666665,3792.6666666666665,3792.67,3792.67]
[null,null,null,"","",null,0,0,0,0]
[null,null,null,"","",null,0,0,0,0]
[null,"MATERIAL (C) - TOTAL",null,null,null,null,null,null,3792.67,3792.67]
[]
[546,"FONTE","CÓDIGO","DESCRIÇÃO","UNID ","COEFIC.","CUSTO UNITÁRIO",null,"CUSTO  TOTAL (A) + (B) + (C) + (D) + (E)"]
[null,null,null,null,null,null,"DESONERADO","NÃO DESONER.","DESONERADO","NÃO DESONER."]
[null,"COMPOSIÇÃO","COMP 546_SEE","BUJÃO DE REBORDO 2.1/2\"","UN ","-","-","-",16.509999999999998,16.760000000000002]
[null,"AGETOP_I",8,"AJUDANTE","h     ",7.0000000000000007E-2,8.1999999999999993,9.51,0.56999999999999995,0.67]
[null,"AGETOP_I",11,"ENCANADOR","h     ",7.0000000000000007E-2,13.4,15.53,0.94,1.0900000000000001]
[null,null,null,"","",null,0,0,0,0]
[null,"MÃO DE OBRA (B) - TOTAL",null,null,null,null,null,null,1.5099999999999998,1.7600000000000002]
[null,"COTAÇÃO","COT 286_SEE","BUJÃO DE REBORDO 2.1/2\"","UN ",1,15,15,15,15]
[null,null,null,"","",null,0,0,0,0]
[null,null,null,"","",null,0,0,0,0]
[null,"MATERIAL (C) - TOTAL",null,null,null,null,null,null,15,15]
[]
[549,"FONTE","CÓDIGO","DESCRIÇÃO","UNID ","COEFIC.","CUSTO UNITÁRIO",null,"CUSTO  TOTAL (A) + (B) + (C) + (D) + (E)"]
[null,null,null,null,null,null,"DESONERADO","NÃO DESONER.","DESONERADO","NÃO DESONER."]
[null,"COMPOSIÇÃO","COMP 549_SEE","FLANGE GALVANIZADA 2.1/2\" - FORNECIMENTO E INSTALAÇÃO","UN ","-","-","-",160.33000000000001,161.28]
[null,"SINAPI",88248,"AUXILIAR DE ENCANADOR OU BOMBEIRO HIDRÁULICO COM ENCARGOS COMPLEMENTARES","H",0.26200000000000001,13.72,15.22,3.59,3.99]
[null,"SINAPI",88267,"ENCANADOR OU BOMBEIRO HIDRÁULICO COM ENCARGOS COMPLEMENTARES","H",0.26200000000000001,17.670000000000002,19.78,4.63,5.18]
[null,null,null,"","",null,0,0,0,0]
[null,"MÃO DE OBRA (B) - TOTAL",null,null,null,null,null,null,8.2199999999999989,9.17]
[null,"SINAPI_I",3148,"FITA VEDA ROSCA EM ROLOS DE 18 MM X 50 M (L X C)","UN    ",1.2999999999999999E-2,12.9,12.9,0.17,0.17]
[null,"SINAPI_I",7307,"FUNDO ANTICORROSIVO PARA METAIS FERROSOS (ZARCAO)","L     ",2E-3,21.9,21.9,0.04,0.04]
[null,"COTAÇÃO","COT 291_SEE","FLANGE GALVANIZADA 2.1/2\"","UN ",1,151.89666666666668,151.89666666666668,151.9,151.9]
[null,"MATERIAL (C) - TOTAL",null,null,null,null,null,null,152.11000000000001,152.11000000000001]
[]
[84,"FONTE","CÓDIGO","DESCRIÇÃO","UNIDADE","COEFIC.","CUSTO UNITÁRIO",null,"CUSTO  TOTAL (A) + (B) + (C) + (D) + (E)"]
[null,null,null,null,null,null,"DESONERADO","NÃO DESONER.","DESONERADO","NÃO DESONER."]
[null,"COMPOSIÇÃO","COMP 084_SEE","GUARDA-CORPO COM CORRIMÃO - SEDUC","M",null,null,null,204.60000000000002,209.46]
[null,"AGETOP_I",25,"OFICIAL \"B\"","h     ",1.1000000000000001,13.4,15.53,14.74,17.079999999999998]
[null,"AGETOP_I",8,"AJUDANTE","h     ",1.1000000000000001,8.1999999999999993,9.51,9.02,10.46]
[null,null,null,"","",null,0,0,0,0]
[null,"MÃO DE OBRA (B) - TOTAL",null,null,null,null,null,null,23.759999999999998,27.54]
[null,"AGETOP_I",2376,"TUBO INDUSTRIAL 2\" CHAPA 13 ","Kg",7.7778,5.23,5.23,40.68,40.68]
[null,"AGETOP_I",2504,"TUBO INDUSTRIAL D=25 MM CHAPA 13 ","Kg",4.6319999999999997,5.07,5.07,23.48,23.48]
[null,"AGETOP_I",2377,"TUBO INDUSTRIAL 40X40 CH.13","Kg",6.3419999999999996,5.07,5.07,32.15,32.15]
[null,"AGETOP_I",2421,"TUBO INDUSTRIAL 1.1/2\" CHAPA 13 ","Kg",1.4862,5.07,5.07,7.54,7.54]
[null,"AGETOP_I",2417,"MASSA PLASTICA","Kg",0.2041,10.58,10.58,2.16,2.16]
[null,"AGETOP_I",2246,"ELETRODO 2.5 OK","Kg",0.11459999999999999,8.6999999999999993,8.6999999999999993,1,1]
[null,"AGETOP_I",1672,"LIXA PARA FERRO ( NÚMERO 100 )","un",0.25509999999999999,2.12,2.12,0.54,0.54]
[null,"AGETOP_I",1264,"DISCO DE DESBASTE 7/8\" P/ CONC./FERRO (1/4\" X 7\")","un",5.0999999999999997E-2,7,7,0.36,0.36]
[null,"AGETOP_I",1334,"DISCO DE CORTE DIAM. 5/8\"- 10\"","un",0.373,5.5,5.5,2.0499999999999998,2.0499999999999998]
[null,"AGETOP_I",2902,"FABRICAÇÃO / MONTAGEM","un",1,50.44,50.44,50.44,50.44]
[null,"AGETOP_I",2150,"CHAPA DE FERRO DOBRADA No.13","Kg",0.43519999999999998,5.28,5.28,2.2999999999999998,2.2999999999999998]
[null,"AGETOP_I",2719,"CHAPA PERFILADA 3/16\"","Kg",1.0979999999999999,5.04,5.04,5.53,5.53]
[null,"AGETOP_I",2436,"ACO CA-25 - 6,3 MM (1/4\") - BARRA LISA A-36","Kg",0.38124999999999998,5.13,5.13,1.96,1.96]
[null,"AGETOP",261602,"PINT.ESMALTE/ESQUAD.FERRO C/FUNDO ANTICOR.","m2    ",0.78,13.65,15.04,10.65,11.73]
[null,"MATERIAL (C) - TOTAL",null,null,null,null,null,null,180.84000000000003,181.92000000000002]
[]
[382,"FONTE","CÓDIGO","DESCRIÇÃO","UNIDADE","COEFIC.","CUSTO UNITÁRIO",null,"CUSTO  TOTAL (A) + (B) + (C) + (D) + (E)"]
[null,null,null,null,null,null,"DESONERADO","NÃO DESONER.","DESONERADO","NÃO DESONER."]
[null,"COMPOSIÇÃO","COMP 382_SEE","TE DE REDUCAO DE FERRO GALVANIZADO, COM ROSCA BSP, DE 3/4\" X 1/2\"","UN ",null,null,null,21.83,23.92]
[null,"AGETOP_I",8,"AJUDANTE","h     ",0.6,8.1999999999999993,9.51,4.92,5.71]
[null,"AGETOP_I",11,"ENCANADOR","h     ",0.61050000000000004,13.4,15.53,8.18,9.48]
[null,null,null,"","",null,0,0,0,0]
[null,"MÃO DE OBRA (B) - TOTAL",null,null,null,null,null,null,13.1,15.190000000000001]
[null,"SINAPI_I",3146,"FITA VEDA ROSCA EM ROLOS DE 18 MM X 10 M (L X C)","UN    ",0.12075471698113208,3.5,3.5,0.42,0.42]
[null,"SINAPI_I",6302,"TE DE REDUCAO DE FERRO GALVANIZADO, COM ROSCA BSP, DE 3/4\" X 1/2\"","UN    ",1,8.31,8.31,8.31,8.31]
[null,null,null,"","",null,0,0,0,0]
[null,"MATERIAL (C) - TOTAL",null,null,null,null,null,null,8.73,8.73]
[]
[383,"FONTE","CÓDIGO","DESCRIÇÃO","UNIDADE","COEFIC.","CUSTO UNITÁRIO",null,"CUSTO  TOTAL (A) + (B) + (C) + (D) + (E)"]
[null,null,null,null,null,null,"DESONERADO","NÃO DESONER.","DESONERADO","NÃO DESONER."]
[null,"COMPOSIÇÃO","COMP 383_SEE","BUCHA DE REDUCAO DE FERRO GALVANIZADO, COM ROSCA BSP, DE 1/2\" X 1/4\"","UN ",null,null,null,6.85,7.4]
[null,"AGETOP_I",8,"AJUDANTE","h     ",0.16,8.1999999999999993,9.51,1.31,1.52]
[null,"AGETOP_I",11,"ENCANADOR","h     ",0.16,13.4,15.53,2.14,2.48]
[null,null,null,"","",null,0,0,0,0]
[null,"MÃO DE OBRA (B) - TOTAL",null,null,null,null,null,null,3.45,4]
[null,"AGETOP_I","H689","FITA VEDAROSCA 12 MM","m",1.2,0.28000000000000003,0.28000000000000003,0.34,0.34]
[null,"SINAPI_I",770,"BUCHA DE REDUCAO DE FERRO GALVANIZADO, COM ROSCA BSP, DE 1/2\" X 1/4\"","UN    ",1,3.06,3.06,3.06,3.06]
[null,null,null,"","",null,0,0,0,0]
[null,"MATERIAL (C) - TOTAL",null,null,null,null,null,null,3.4,3.4]
[]
[237,"FONTE","CÓDIGO","DESCRIÇÃO","UNIDADE","COEFIC.","CUSTO UNITÁRIO",null,"CUSTO  TOTAL (A) + (B) + (C) + (D) + (E)"]
[null,null,null,null,null,null,"DESONERADO","NÃO DESONER.","DESONERADO","NÃO DESONER."]
[null,"COMPOSIÇÃO","COMP 237_SEE","FITA ANTICORROSIVA","M",null,null,null,11.14,11.83]
[null,"AGETOP_I",8,"AJUDANTE","h     ",0.2,8.1999999999999993,9.51,1.64,1.9]
[null,"AGETOP_I",12,"ELETRICISTA","h     ",0.2,13.4,15.53,2.68,3.11]
[null,null,null,"","",null,0,0,0,0]
[null,"MÃO DE OBRA (B) - TOTAL",null,null,null,null,null,null,4.32,5.01]
[null,"SINAPI_I",39634,"FITA ADESIVA ANTICORROSIVA DE PVC FLEXIVEL, COR PRETA, PARA PROTECAO TUBULACAO, 50 MM X 30 M (L X C), E= *0,25* MM","M     ",1,6.82,6.82,6.82,6.82]
[null,null,null,"","",null,0,0,0,0]
[null,null,null,"","",null,0,0,0,0]
[null,"MATERIAL (C) - TOTAL",null,null,null,null,null,null,6.82,6.82]
[]
[210,"FONTE","CÓDIGO","DESCRIÇÃO","UNIDADE","COEFIC.","CUSTO UNITÁRIO",null,"CUSTO  TOTAL (A) + (B) + (C) + (D) + (E)"]
[null,null,null,null,null,null,"DESONERADO","NÃO DESONER.","DESONERADO","NÃO DESONER."]
[null,"COMPOSIÇÃO","COMP 210_SEE","REGULADOR DE 1º ESTÁGIO 60KG/H MODELO AP-40  COM MANÔMETRO","UN ",null,null,null,231.21,235.17000000000002]
[null,"AGETOP_I",8,"AJUDANTE","h     ",1.1499999999999999,8.1999999999999993,9.51,9.43,10.94]
[null,"AGETOP_I",11,"ENCANADOR","h     ",1.1499999999999999,13.4,15.53,15.41,17.86]
[null,null,null,"","",null,0,0,0,0]
[null,"MÃO DE OBRA (B) - TOTAL",null,null,null,null,null,null,24.84,28.799999999999997]
[null,"COTAÇÃO","COT 101_SEE","REGULADOR DE 1º ESTÁGIO 60KG/H MODELO AP-40  COM MANÔMETRO","UN",1,205.57666666666668,205.57666666666668,205.58,205.58]
[null,"AGETOP_I","H689","FITA VEDAROSCA 12 MM","m",2.82,0.28000000000000003,0.28000000000000003,0.79,0.79]
[null,null,null,"","",null,0,0,0,0]
[null,"MATERIAL (C) - TOTAL",null,null,null,null,null,null,206.37,206.37]
[]
[211,"FONTE","CÓDIGO","DESCRIÇÃO","UNIDADE","COEFIC.","CUSTO UNITÁRIO",null,"CUSTO  TOTAL (A) + (B) + (C) + (D) + (E)"]
[null,null,null,null,null,null,"DESONERADO","NÃO DESONER.","DESONERADO","NÃO DESONER."]
[null,"COMPOSIÇÃO","COMP 211_SEE","REGULADOR DE 2º ESTÁGIO 5KG/H","UN ",null,null,null,85.46,89.419999999999987]
[null,"AGETOP_I",8,"AJUDANTE","h     ",1.1499999999999999,8.1999999999999993,9.51,9.43,10.94]
[null,"AGETOP_I",11,"ENCANADOR","h     ",1.1499999999999999,13.4,15.53,15.41,17.86]
[null,null,null,"","",null,0,0,0,0]
[null,"MÃO DE OBRA (B) - TOTAL",null,null,null,null,null,null,24.84,28.799999999999997]
[null,"COTAÇÃO","COT 102_SEE","REGULADOR DE 2º ESTÁGIO 5KG/H","UN",1,59.833333333333336,59.833333333333336,59.83,59.83]
[null,"AGETOP_I","H689","FITA VEDAROSCA 12 MM","m",2.82,0.28000000000000003,0.28000000000000003,0.79,0.79]
[null,null,null,"","",null,0,0,0,0]
[null,"MATERIAL (C) - TOTAL",null,null,null,null,null,null,60.62,60.62]
[]
[212,"FONTE","CÓDIGO","DESCRIÇÃO","UNIDADE","COEFIC.","CUSTO UNITÁRIO",null,"CUSTO  TOTAL (A) + (B) + (C) + (D) + (E)"]
[null,null,null,null,null,null,"DESONERADO","NÃO DESONER.","DESONERADO","NÃO DESONER."]
[null,"COMPOSIÇÃO","COMP 212_SEE","NIPLE DE REDUÇÃO 1/2\" X 1/4\" BSP","UN ",null,null,null,9.5,10.050000000000001]
[null,"AGETOP_I",8,"AJUDANTE","h     ",0.16,8.1999999999999993,9.51,1.31,1.52]
[null,"AGETOP_I",11,"ENCANADOR","h     ",0.16,13.4,15.53,2.14,2.48]
[null,null,null,"","",null,0,0,0,0]
[null,"MÃO DE OBRA (B) - TOTAL",null,null,null,null,null,null,3.45,4]
[null,"COTAÇÃO","COT 103_SEE","NIPLE DE REDUÇÃO 1/2\" X 1/4\" BSP","UN",1,6.0533333333333337,6.0533333333333337,6.05,6.05]
[null,null,null,"","",null,0,0,0,0]
[null,null,null,"","",null,0,0,0,0]
[null,"MATERIAL (C) - TOTAL",null,null,null,null,null,null,6.05,6.05]
[]
[213,"FONTE","CÓDIGO","DESCRIÇÃO","UNIDADE","COEFIC.","CUSTO UNITÁRIO",null,"CUSTO  TOTAL (A) + (B) + (C) + (D) + (E)"]
[null,null,null,null,null,null,"DESONERADO","NÃO DESONER.","DESONERADO","NÃO DESONER."]
[null,"COMPOSIÇÃO","COMP 213_SEE","NIPLE DE REDUÇÃO 3/4\" X 1/2\" BSP","UN ",null,null,null,13.16,13.71]
[null,"AGETOP_I",8,"AJUDANTE","h     ",0.16,8.1999999999999993,9.51,1.31,1.52]
[null,"AGETOP_I",11,"ENCANADOR","h     ",0.16,13.4,15.53,2.14,2.48]
[null,null,null,"","",null,0,0,0,0]
[null,"MÃO DE OBRA (B) - TOTAL",null,null,null,null,null,null,3.45,4]
[null,"COTAÇÃO","COT 104_SEE","NIPLE DE REDUÇÃO 3/4\" X 1/2\" BSP","UN",1,9.7099999999999991,9.7099999999999991,9.7100000000000009,9.7100000000000009]
[null,null,null,"","",null,0,0,0,0]
[null,null,null,"","",null,0,0,0,0]
[null,"MATERIAL (C) - TOTAL",null,null,null,null,null,null,9.7100000000000009,9.7100000000000009]
[]
[235,"FONTE","CÓDIGO","DESCRIÇÃO","UNIDADE","COEFIC.","CUSTO UNITÁRIO",null,"CUSTO  TOTAL (A) + (B) + (C) + (D) + (E)"]
[null,null,null,null,null,null,"DESONERADO","NÃO DESONER.","DESONERADO","NÃO DESONER."]
[null,"COMPOSIÇÃO","COMP 235_SEE","PLACA DE SINALIZAÇÃO EM PVC COD 01 - (300X300) PROIBIDO FUMAR","UN ",null,null,null,25.269999999999996,25.389999999999997]
[null,"AGETOP_I",5,"SERVENTE","h     ",0.09,8.1999999999999993,9.51,0.74,0.86]
[null,null,null,"","",null,0,0,0,0]
[null,null,null,"","",null,0,0,0,0]
[null,"MÃO DE OBRA (B) - TOTAL",null,null,null,null,null,null,0.74,0.86]
[null,"AGETOP_I",3070,"BUCHA DE NYLON S-6","un",2,0.04,0.04,0.08,0.08]
[null,"AGETOP_I",3393,"PARAFUSO P/BUCHA S-6","un",2,0.08,0.08,0.16,0.16]
[null,"SINAPI_I",37556,"PLACA DE SINALIZACAO DE SEGURANCA CONTRA INCENDIO, FOTOLUMINESCENTE, QUADRADA, *20 X 20* CM, EM PVC *2* MM ANTI-CHAMAS (SIMBOLOS, CORES E PICTOGRAMAS CONFORME NBR 13434)","UN    ",1,24.29,24.29,24.29,24.29]
[null,"MATERIAL (C) - TOTAL",null,null,null,null,null,null,24.529999999999998,24.529999999999998]
[]
[236,"FONTE","CÓDIGO","DESCRIÇÃO","UNIDADE","COEFIC.","CUSTO UNITÁRIO",null,"CUSTO  TOTAL (A) + (B) + (C) + (D) + (E)"]
[null,null,null,null,null,null,"DESONERADO","NÃO DESONER.","DESONERADO","NÃO DESONER."]
[null,"COMPOSIÇÃO","COMP 236_SEE","PLACA DE SINALIZAÇÃO EM PVC COD 06 - (300X300) PERIGO INFLAMÁVEL","UN ",null,null,null,25.269999999999996,25.389999999999997]
[null,"AGETOP_I",5,"SERVENTE","h     ",0.09,8.1999999999999993,9.51,0.74,0.86]
[null,null,null,"","",null,0,0,0,0]
[null,null,null,"","",null,0,0,0,0]
[null,"MÃO DE OBRA (B) - TOTAL",null,null,null,null,null,null,0.74,0.86]
[null,"AGETOP_I",3070,"BUCHA DE NYLON S-6","un",2,0.04,0.04,0.08,0.08]
[null,"AGETOP_I",3393,"PARAFUSO P/BUCHA S-6","un",2,0.08,0.08,0.16,0.16]
[null,"SINAPI_I",37556,"PLACA DE SINALIZACAO DE SEGURANCA CONTRA INCENDIO, FOTOLUMINESCENTE, QUADRADA, *20 X 20* CM, EM PVC *2* MM ANTI-CHAMAS (SIMBOLOS, CORES E PICTOGRAMAS CONFORME NBR 13434)","UN    ",1,24.29,24.29,24.29,24.29]
[null,"MATERIAL (C) - TOTAL",null,null,null,null,null,null,24.529999999999998,24.529999999999998]