{"text_format":"1","workbook":"xlsx","n_sheets":8,"sheets":["Orçamento","Resumo ","Somatório","Cronog_60_Dias","Composição BDI","Relatório CENTRAL","Parc Maior Relev","Composições"],"not_rendered":{"charts":0,"images":5,"macros":1,"external_links":0,"defined_names":77,"comments":1,"pivot_tables":0},"unopened":[],"bounds":{"document_bytes":16777216,"sheet_cells":100000,"rows_first":2000,"rows_last":500,"rows_between":2000,"halvings":0,"cell_chars":16384,"cell_head_chars":4096},"cells_cut":0,"cells_raw":0,"read":"whole","date_system":"1900"}

{"sheet":"Orçamento","index":0,"n_rows":535,"n_cols":26,"rows_kept":535,"cut":false,"hidden":false,"merged":[[513,15,513,17],[513,18,513,21],[513,22,513,24],[514,15,514,17],[514,18,514,21],[514,22,514,24],[515,15,515,17],[515,18,515,21],[515,22,515,24],[523,15,523,17],[523,18,523,21],[523,22,523,24],[524,15,524,17],[524,18,524,21],[524,22,524,24],[516,18,516,21],[516,22,516,24],[517,15,517,17],[517,18,517,21],[517,22,517,24],[518,15,518,17],[518,18,518,21],[518,22,518,24],[503,14,503,17],[510,15,510,17],[476,15,476,17],[531,18,531,21],[531,22,531,24],[519,15,519,17],[519,18,519,21],[519,22,519,24],[520,15,520,17],[520,18,520,21],[520,22,520,24],[521,15,521,17],[521,18,521,21],[521,22,521,24],[525,15,525,17],[525,18,525,21],[525,22,525,24],[526,15,526,17],[526,18,526,21],[526,22,526,24],[527,15,527,17],[516,15,516,17],[471,16,471,24],[512,15,512,17],[512,18,512,21],[512,22,512,24],[534,18,534,21],[534,22,534,24],[531,14,531,17],[528,15,528,17],[528,18,528,21],[528,22,528,24],[529,15,529,17],[529,18,529,21],[529,22,529,24],[530,15,530,17],[530,18,530,21],[530,22,530,24],[533,18,533,21],[533,22,533,24],[532,18,532,21],[532,22,532,24],[527,18,527,21],[527,22,527,24],[522,15,522,17],[522,18,522,21],[522,22,522,24],[481,15,481,17],[482,15,482,17],[483,15,483,17],[484,15,484,17],[485,15,485,17],[489,15,489,17],[490,15,490,17],[491,15,491,17],[492,15,492,17],[509,14,509,25],[510,18,510,21],[510,22,510,24],[511,15,511,17],[511,18,511,21],[511,22,511,24],[493,15,493,17],[494,15,494,17],[495,15,495,17],[496,15,496,17],[497,15,497,17],[498,15,498,17],[499,15,499,17],[500,15,500,17],[501,15,501,17],[502,15,502,17],[500,18,500,21],[496,18,496,21],[496,22,496,24],[481,18,481,21],[481,22,481,24],[467,16,467,24],[468,16,468,24],[469,16,469,24],[3,22,3,24],[2,22,2,24],[5,22,5,24],[10,14,10,25],[13,14,13,25],[6,22,6,24],[9,17,9,21],[2,14,2,21],[3,14,3,21],[5,18,5,21],[6,18,6,21],[11,18,11,21],[12,18,12,21],[6,14,6,17],[5,14,5,17],[461,21,461,22],[463,21,463,22],[460,23,460,24],[485,18,485,21],[485,22,485,24],[486,18,486,21],[486,22,486,24],[487,18,487,21],[487,22,487,24],[488,18,488,21],[488,22,488,24],[482,18,482,21],[482,22,482,24],[483,18,483,21],[483,22,483,24],[478,18,478,21],[478,22,478,24],[479,18,479,21],[479,22,479,24],[480,18,480,21],[480,22,480,24],[475,14,475,25],[478,15,478,17],[479,15,479,17],[480,15,480,17],[477,22,477,24],[464,21,464,22],[459,17,464,17],[459,21,459,22],[476,18,476,21],[476,22,476,24],[477,18,477,21],[464,23,464,24],[465,23,465,24],[470,16,470,24],[465,21,465,22],[459,23,459,24],[460,21,460,22],[477,15,477,17],[472,18,472,24],[461,23,461,24],[463,23,463,24],[491,22,491,24],[484,18,484,21],[484,22,484,24],[506,18,506,21],[506,22,506,24],[503,18,503,21],[503,22,503,24],[500,22,500,24],[501,18,501,21],[501,22,501,24],[502,18,502,21],[502,22,502,24],[492,18,492,21],[492,22,492,24],[499,18,499,21],[499,22,499,24],[494,22,494,24],[495,18,495,21],[495,22,495,24],[490,18,490,21],[497,18,497,21],[493,18,493,21],[493,22,493,24],[494,18,494,21],[8,12,9,12],[505,18,505,21],[505,22,505,24],[0,14,0,24],[8,14,8,16],[9,14,9,16],[11,14,11,16],[12,14,12,16],[14,14,14,24],[1,14,1,24],[4,14,4,24],[7,14,7,24],[489,18,489,21],[489,22,489,24],[497,22,497,24],[486,15,486,17],[487,15,487,17],[488,15,488,17],[490,22,490,24],[498,18,498,21],[498,22,498,24],[504,18,504,21],[504,22,504,24],[491,18,491,21]]}
[]
[]
[null,null,null,null,null,null,null,null,null,null,null,null,null,null,"UNIDADE ESCOLAR",null,null,null,null,null,null,null,"CÓDIGO INEP"]
[null,null,null,null,null,null,null,null,null,null,null,null,null,null,"COLÉGIO ESTADUAL SÃO GERALDO",null,null,null,null,null,null,null,52038343]
[]
["Nmax",null,null,null,null,null,null,null,null,null,null,null,"Ajustar altura?",null,"OBRA",null,null,null,"DATA",null,null,null,"CIDADE"]
[{"$f":"MAX($C$18:$C$459)","v":3},null,null,null,null,null,null,null,null,null,null,null,"SIM",null,"AMPLIAÇÃO E REFORMA",null,null,null,"2020-04-08",null,null,null,"GOIANIRA"]
[]
[null,null,null,null,null,null,null,null,null,null,null,null,"",null,"CRECE",null,null,"ENDEREÇO",null,null,null,null,"REFERÊNCIA AGETOP"]
[null,null,null,null,null,null,null,null,null,null,null,null,null,null,"INHUMAS",null,null,"RUA 1 S/N, VILA LEO LYNCE, CEP:75370-000",null,null,null,null,"DEZ/18",null,"NÃO DESONERADA"]
[]
[null,null,null,null,null,null,null,null,null,null,null,null,null,null,"ÁREA EXISTENTE (M²)",null,null,"ÁREA A CONSTRUIR (M²)","ÁREA TOTAL CONSTRUÍDA (M²)",null,null,null,"REFERÊNCIA SINAPI"]
[null,null,null,null,null,null,null,null,null,null,null,null,null,null,1885,null,null,619.21,2504.21,null,null,null,"JAN/19",null,"NÃO DESONERADA"]
[]
[null,null,null,null,null,null,null,null,null,null,null,"FILTRO",null,null,"PLANILHA ORÇAMENTÁRIA"]
["Nível E","Save Nivel","Nível C","Altura","n1","n2","n3","n4","n5","Czero","Cnível","↓","Nível","Nível Corrigido","ITEM","TABELA","CODIGO","DESCRIÇÃO DOS SERVIÇOS","UNID","QUANT UNIT","QUANT TOTAL","MAT","MO","VALOR UNIT","VALOR TOTAL","OBSERVAÇÕES¹"]
[{"$f":"CHOOSE(1+LOG(1+2*(ORÇAMENTO.Nivel=\"Nível 1\")+4*(ORÇAMENTO.Nivel=\"Nível 2\")+8*(ORÇAMENTO.Nivel=\"Nível 3\")+16*(ORÇAMENTO.Nivel=\"Nível 4\")+32*(ORÇAMENTO.Nivel=\"Serviço\"),2),0,1,2,3,4,\"S\")","v":"S"},{"$f":"IF(OR(C17=\"s\",C17=0),OFFSET(B17,-1,0),C17)","v":"Save Nivel"},{"$f":"IF(OFFSET(C17,-1,0)=\"L\",1,IF(OFFSET(C17,-1,0)=1,2,IF(OR(A17=\"s\",A17=0),\"S\",IF(AND(OFFSET(C17,-1,0)=2,A17=4),3,IF(AND(OR(OFFSET(C17,-1,0)=\"s\",OFFSET(C17,-1,0)=0),A17<>\"s\",A17>OFFSET(B17,-1,0)),OFFSET(B17,-1,0),A17)))))","v":"S"},{"$f":"IF(OR(C17=\"S\",C17=0),0,IF(ISERROR(K17),J17,SMALL(J17:K17,1)))","v":0},{"$f":"IF($C17=1,OFFSET(E17,-1,0)+1,OFFSET(E17,-1,0))","v":"n1"},{"$f":"IF($C17=1,0,IF($C17=2,OFFSET(F17,-1,0)+1,OFFSET(F17,-1,0)))","v":"n2"},{"$f":"IF(AND($C17<=2,$C17<>0),0,IF($C17=3,OFFSET(G17,-1,0)+1,OFFSET(G17,-1,0)))","v":"n3"},{"$f":"IF(AND($C17<=3,$C17<>0),0,IF($C17=4,OFFSET(H17,-1,0)+1,OFFSET(H17,-1,0)))","v":"n4"},{"$f":"IF(AND($C17<=4,$C17<>0),0,IF(AND($C17=\"S\",$Y17>0),OFFSET(I17,-1,0)+1,OFFSET(I17,-1,0)))","v":"n5"},{"$f":"IF(OR($C17=\"S\",$C17=0),0,MATCH(0,OFFSET($D17,1,$C17,ROW($C$459)-ROW($C17)),0))","v":0},{"$f":"IF(OR($C17=\"S\",$C17=0),0,MATCH(OFFSET($D17,0,$C17)+1,OFFSET($D17,1,$C17,ROW($C$459)-ROW($C17)),0))","v":0},"","Serviço","Serviço","-","SINAPI",null,"(sem código)","-",null,null,0,0,null,0,""]
[0,null,"L",{"$f":"COUNTA(OFFSET(D18,1,0):#REF!)","v":1},{"$f":"LEFT(O19,1)-1","v":0},null,null,null,null,null,null,"F","LOTE","LOTE","AMPLIAÇÃO E REFORMA - COLÉGIO ESTADUAL SÃO GERALDO",null,null,null,null,null,null,null,null,null,0]
[1,{"$f":"IF(OR(C19=\"s\",C19=0),OFFSET(B19,-1,0),C19)","v":1},{"$f":"IF(OFFSET(C19,-1,0)=\"L\",1,IF(OFFSET(C19,-1,0)=1,2,IF(OR(A19=\"s\",A19=0),\"S\",IF(AND(OFFSET(C19,-1,0)=2,A19=4),3,IF(AND(OR(OFFSET(C19,-1,0)=\"s\",OFFSET(C19,-1,0)=0),A19<>\"s\",A19>OFFSET(B19,-1,0)),OFFSET(B19,-1,0),A19)))))","v":1},{"$f":"IF(OR(C19=\"S\",C19=0),0,IF(ISERROR(K19),J19,SMALL(J19:K19,1)))","v":146},{"$f":"IF($C19=1,OFFSET(E19,-1,0)+1,OFFSET(E19,-1,0))","v":1},{"$f":"IF($C19=1,0,IF($C19=2,OFFSET(F19,-1,0)+1,OFFSET(F19,-1,0)))","v":0},{"$f":"IF(AND($C19<=2,$C19<>0),0,IF($C19=3,OFFSET(G19,-1,0)+1,OFFSET(G19,-1,0)))","v":0},{"$f":"IF(AND($C19<=3,$C19<>0),0,IF($C19=4,OFFSET(H19,-1,0)+1,OFFSET(H19,-1,0)))","v":0},0,{"$f":"IF(OR($C19=\"S\",$C19=0),0,MATCH(0,OFFSET($D19,1,$C19,ROW($C$459)-ROW($C19)),0))","v":440},{"$f":"IF(OR($C19=\"S\",$C19=0),0,MATCH(OFFSET($D19,0,$C19)+1,OFFSET($D19,1,$C19,ROW($C$459)-ROW($C19)),0))","v":146},"F","Nível 1","Nível 1","1.",null,null,"REFORMA",null,1,null,null,null,null,0]
[2,{"$f":"IF(OR(C20=\"s\",C20=0),OFFSET(B20,-1,0),C20)","v":2},{"$f":"IF(OFFSET(C20,-1,0)=\"L\",1,IF(OFFSET(C20,-1,0)=1,2,IF(OR(A20=\"s\",A20=0),\"S\",IF(AND(OFFSET(C20,-1,0)=2,A20=4),3,IF(AND(OR(OFFSET(C20,-1,0)=\"s\",OFFSET(C20,-1,0)=0),A20<>\"s\",A20>OFFSET(B20,-1,0)),OFFSET(B20,-1,0),A20)))))","v":2},{"$f":"IF(OR(C20=\"S\",C20=0),0,IF(ISERROR(K20),J20,SMALL(J20:K20,1)))","v":8},{"$f":"IF($C20=1,OFFSET(E20,-1,0)+1,OFFSET(E20,-1,0))","v":1},{"$f":"IF($C20=1,0,IF($C20=2,OFFSET(F20,-1,0)+1,OFFSET(F20,-1,0)))","v":1},{"$f":"IF(AND($C20<=2,$C20<>0),0,IF($C20=3,OFFSET(G20,-1,0)+1,OFFSET(G20,-1,0)))","v":0},{"$f":"IF(AND($C20<=3,$C20<>0),0,IF($C20=4,OFFSET(H20,-1,0)+1,OFFSET(H20,-1,0)))","v":0},0,145,8,"","Nível 2","Nível 2","-",null,null,"SERVIÇOS PRELIMINARES",null,null,null,null,null,null,0]
[{"$f":"CHOOSE(1+LOG(1+2*(ORÇAMENTO.Nivel=\"Nível 1\")+4*(ORÇAMENTO.Nivel=\"Nível 2\")+8*(ORÇAMENTO.Nivel=\"Nível 3\")+16*(ORÇAMENTO.Nivel=\"Nível 4\")+32*(ORÇAMENTO.Nivel=\"Serviço\"),2),0,1,2,3,4,\"S\")","v":"S"},2,"S",0,{"$f":"IF($C21=1,OFFSET(E21,-1,0)+1,OFFSET(E21,-1,0))","v":1},{"$f":"IF($C21=1,0,IF($C21=2,OFFSET(F21,-1,0)+1,OFFSET(F21,-1,0)))","v":1},{"$f":"IF(AND($C21<=2,$C21<>0),0,IF($C21=3,OFFSET(G21,-1,0)+1,OFFSET(G21,-1,0)))","v":0},{"$f":"IF(AND($C21<=3,$C21<>0),0,IF($C21=4,OFFSET(H21,-1,0)+1,OFFSET(H21,-1,0)))","v":0},{"$f":"IF(AND($C21<=4,$C21<>0),0,IF(AND($C21=\"S\",$Y21>0),OFFSET(I21,-1,0)+1,OFFSET(I21,-1,0)))","v":0},0,0,"","Serviço","Serviço","-","SINAPI",98529,"CORTE RASO E RECORTE DE ÁRVORE COM DIÂMETRO DE TRONCO MAIOR OU IGUAL A 0,20 M E MENOR QUE 0,40 M.AF_05/2018","UN",1,1,null,null,0,0,""]
["S",2,"S",0,1,1,0,0,0,0,0,"","Serviço","Serviço","-","SINAPI",98526,"REMOÇÃO DE RAÍZES REMANESCENTES DE TRONCO DE ÁRVORE COM DIÂMETRO MAIOR OU IGUAL A 0,20 M E MENOR QUE 0,40 M.AF_05/2018","UN",1,1,null,null,0,0,""]
["S",2,"S",0,1,1,0,0,0,0,0,"","Serviço","Serviço","-","AGETOP",20105,"DEMOL.FORRO PAULISTA  C/TRANSP.ATE CB.E CARGA","m2    ",49.6,49.6,null,null,0,0,""]
["S",2,"S",0,1,1,0,0,0,0,0,"","Serviço","Serviço","-","AGETOP",20109,"DEM.PISO CIMENT.SOBRE LASTRO CONC.C/TR.ATE CB. E CARGA","m2    ",64.2,64.2,null,null,0,0,""]
["S",2,"S",0,1,1,0,0,0,0,0,"","Serviço","Serviço","-","SINAPI",97622,"DEMOLIÇÃO DE ALVENARIA DE BLOCO FURADO, DE FORMA MANUAL, SEM REAPROVEITAMENTO. AF_12/2017","M3",1,1,null,null,0,0,"Referência: AGETOP - 20118"]
["S",2,"S",0,1,1,0,0,0,0,0,"","Serviço","Serviço","-","SINAPI",97645,"REMOÇÃO DE JANELAS, DE FORMA MANUAL, SEM REAPROVEITAMENTO. AF_12/2017","M2",7.68,7.68,null,null,0,0,"Referência: AGETOP - 20106"]
["S",2,"S",0,1,1,0,0,0,0,0,"","Serviço","Serviço","-","SINAPI","74209/1","PLACA DE OBRA EM CHAPA DE ACO GALVANIZADO","M2",4.5,4.5,null,null,0,0,"Referência: AGETOP - 21301"]
[2,2,2,3,1,2,0,0,0,137,3,"","Nível 2","Nível 2","-","SINAPI",null,"SERVIÇO EM TERRA","-",null,0,null,null,0,0,""]
["S",2,"S",0,1,2,0,0,0,0,0,"","Serviço","Serviço","-","SINAPI",93358,"ESCAVAÇÃO MANUAL DE VALA COM PROFUNDIDADE MENOR OU IGUAL A 1,30 M. AF_03/2016","M3",11.7,11.7,null,null,0,0,"Referência: AGETOP - 40101"]
["S",2,"S",0,1,2,0,0,0,0,0,"","Serviço","Serviço","-","SINAPI",96995,"REATERRO MANUAL APILOADO COM SOQUETE. AF_10/2017","M3",11.7,11.7,null,null,0,0,"Referência: AGETOP - 40902"]
[2,2,2,3,1,3,0,0,0,134,3,"","Nível 2","Nível 2","-","SINAPI",null,"TRANSPORTES","-",null,0,null,null,0,0,""]
["S",2,"S",0,1,3,0,0,0,0,0,"","Serviço","Serviço","-","SINAPI",72900,"TRANSPORTE DE ENTULHO COM CAMINHAO BASCULANTE 6 M3, RODOVIA PAVIMENTADA, DMT 0,5 A 1,0 KM","M3",5.97,5.97,null,null,0,0,""]
["S",2,"S",0,1,3,0,0,0,0,0,"","Serviço","Serviço","-","SINAPI",72897,"CARGA MANUAL DE ENTULHO EM CAMINHAO BASCULANTE 6 M3","M3",5.97,5.97,null,null,0,0,""]
[{"$f":"CHOOSE(1+LOG(1+2*(ORÇAMENTO.Nivel=\"Nível 1\")+4*(ORÇAMENTO.Nivel=\"Nível 2\")+8*(ORÇAMENTO.Nivel=\"Nível 3\")+16*(ORÇAMENTO.Nivel=\"Nível 4\")+32*(ORÇAMENTO.Nivel=\"Serviço\"),2),0,1,2,3,4,\"S\")","v":2},2,2,36,{"$f":"IF($C34=1,OFFSET(E34,-1,0)+1,OFFSET(E34,-1,0))","v":1},{"$f":"IF($C34=1,0,IF($C34=2,OFFSET(F34,-1,0)+1,OFFSET(F34,-1,0)))","v":4},{"$f":"IF(AND($C34<=2,$C34<>0),0,IF($C34=3,OFFSET(G34,-1,0)+1,OFFSET(G34,-1,0)))","v":0},{"$f":"IF(AND($C34<=3,$C34<>0),0,IF($C34=4,OFFSET(H34,-1,0)+1,OFFSET(H34,-1,0)))","v":0},{"$f":"IF(AND($C34<=4,$C34<>0),0,IF(AND($C34=\"S\",$Y34>0),OFFSET(I34,-1,0)+1,OFFSET(I34,-1,0)))","v":0},131,36,"","Nível 2","Nível 2","-",null,null,"INSTALAÇÕES ELÉTRICAS","-",null,0,null,null,0,0,""]
["S",2,"S",0,1,4,0,0,0,0,0,"","Serviço","Serviço","-","SINAPI",91927,"CABO DE COBRE FLEXÍVEL ISOLADO, 2,5 MM², ANTI-CHAMA 0,6/1,0 KV, PARA CIRCUITOS TERMINAIS - FORNECIMENTO E INSTALAÇÃO. AF_12/2015","M",1600,1600,null,null,0,0,"Referência: AGETOP - 70581"]
["S",2,"S",0,1,4,0,0,0,0,0,"","Serviço","Serviço","-","SINAPI",91928,"CABO DE COBRE FLEXÍVEL ISOLADO, 4 MM², ANTI-CHAMA 450/750 V, PARA CIRCUITOS TERMINAIS - FORNECIMENTO E INSTALAÇÃO. AF_12/2015","M",315,315,null,null,0,0,"Referência: AGETOP - 70582"]
["S",2,"S",0,1,4,0,0,0,0,0,"","Serviço","Serviço","-","SINAPI",91931,"CABO DE COBRE FLEXÍVEL ISOLADO, 6 MM², ANTI-CHAMA 0,6/1,0 KV, PARA CIRCUITOS TERMINAIS - FORNECIMENTO E INSTALAÇÃO. AF_12/2015","M",750,750,null,null,0,0,"Referência: AGETOP - 70583"]
["S",2,"S",0,1,4,0,0,0,0,0,"","Serviço","Serviço","-","SINAPI",92980,"CABO DE COBRE FLEXÍVEL ISOLADO, 10 MM², ANTI-CHAMA 0,6/1,0 KV, PARA DISTRIBUIÇÃO - FORNECIMENTO E INSTALAÇÃO. AF_12/2015","M",90,90,null,null,0,0,""]
["S",2,"S",0,1,4,0,0,0,0,0,"","Serviço","Serviço","-","SINAPI",91935,"CABO DE COBRE FLEXÍVEL ISOLADO, 16 MM², ANTI-CHAMA 0,6/1,0 KV, PARA CIRCUITOS TERMINAIS - FORNECIMENTO E INSTALAÇÃO. AF_12/2015","M",240,240,null,null,0,0,"Referência: AGETOP - 70585"]
["S",2,"S",0,1,4,0,0,0,0,0,"","Serviço","Serviço","-","SINAPI",92984,"CABO DE COBRE FLEXÍVEL ISOLADO, 25 MM², ANTI-CHAMA 0,6/1,0 KV, PARA DISTRIBUIÇÃO - FORNECIMENTO E INSTALAÇÃO. AF_12/2015","M",180,180,null,null,0,0,"Referência: AGETOP - 70586"]
["S",2,"S",0,1,4,0,0,0,0,0,"","Serviço","Serviço","-","SINAPI",91936,"CAIXA OCTOGONAL 4\" X 4\", PVC, INSTALADA EM LAJE - FORNECIMENTO E INSTALAÇÃO. AF_12/2015","UN",44,44,null,null,0,0,""]
["S",2,"S",0,1,4,0,0,0,0,0,"","Serviço","Serviço","-","SINAPI",91940,"CAIXA RETANGULAR 4\" X 2\" MÉDIA (1,30 M DO PISO), PVC, INSTALADA EM PAREDE - FORNECIMENTO E INSTALAÇÃO. AF_12/2015","UN",20,20,null,null,0,0,""]
["S",2,"S",0,1,4,0,0,0,0,0,"","Serviço","Serviço","-","SINAPI",97886,"CAIXA ENTERRADA ELÉTRICA RETANGULAR, EM ALVENARIA COM TIJOLOS CERÂMICOS MACIÇOS, FUNDO COM BRITA, DIMENSÕES INTERNAS: 0,3X0,3X0,3 M. AF_05/2018","UN",2,2,null,null,0,0,""]
["S",2,"S",0,1,4,0,0,0,0,0,"","Serviço","Serviço","-","SINAPI",97891,"CAIXA ENTERRADA ELÉTRICA RETANGULAR, EM ALVENARIA COM BLOCOS DE CONCRETO, FUNDO COM BRITA, DIMENSÕES INTERNAS: 0,4X0,4X0,4 M. AF_05/2018","UN",5,5,null,null,0,0,""]
["S",2,"S",0,1,4,0,0,0,0,0,"","Serviço","Serviço","-","SINAPI",83446,"CAIXA DE PASSAGEM 30X30X40 COM TAMPA E DRENO BRITA","UN",1,1,null,null,0,0,""]
["S",2,"S",0,1,4,0,0,0,0,0,"","Serviço","Serviço","-","SINAPI",95817,"CONDULETE DE PVC, TIPO X, PARA ELETRODUTO DE PVC SOLDÁVEL DN 25 MM (3/4''), APARENTE - FORNECIMENTO E INSTALAÇÃO. AF_11/2016","UN",20,20,null,null,0,0,""]
["S",2,"S",0,1,4,0,0,0,0,0,"","Serviço","Serviço","-","SINAPI",91914,"CURVA 90 GRAUS PARA ELETRODUTO, PVC, ROSCÁVEL, DN 25 MM (3/4\"), PARA CIRCUITOS TERMINAIS, INSTALADA EM PAREDE - FORNECIMENTO E INSTALAÇÃO. AF_12/2015","UN",30,30,null,null,0,0,""]
["S",2,"S",0,1,4,0,0,0,0,0,"","Serviço","Serviço","-","SINAPI",93018,"CURVA 90 GRAUS PARA ELETRODUTO, PVC, ROSCÁVEL, DN 50 MM (1 1/2\") - FORNECIMENTO E INSTALAÇÃO. AF_12/2015","UN",6,6,null,null,0,0,""]
["S",2,"S",0,1,4,0,0,0,0,0,"","Serviço","Serviço","-","SINAPI",93654,"DISJUNTOR MONOPOLAR TIPO DIN, CORRENTE NOMINAL DE 16A - FORNECIMENTO E INSTALAÇÃO. AF_04/2016","UN",15,15,null,null,0,0,""]
["S",2,"S",0,1,4,0,0,0,0,0,"","Serviço","Serviço","-","SINAPI",93657,"DISJUNTOR MONOPOLAR TIPO DIN, CORRENTE NOMINAL DE 32A - FORNECIMENTO E INSTALAÇÃO. AF_04/2016","UN",1,1,null,null,0,0,""]
["S",2,"S",0,1,4,0,0,0,0,0,"","Serviço","Serviço","-","SINAPI",93671,"DISJUNTOR TRIPOLAR TIPO DIN, CORRENTE NOMINAL DE 32A - FORNECIMENTO E INSTALAÇÃO. AF_04/2016","UN",5,5,null,null,0,0,""]
["S",2,"S",0,1,4,0,0,0,0,0,"","Serviço","Serviço","-","SINAPI",93673,"DISJUNTOR TRIPOLAR TIPO DIN, CORRENTE NOMINAL DE 50A - FORNECIMENTO E INSTALAÇÃO. AF_04/2016","UN",2,2,null,null,0,0,""]
["S",2,"S",0,1,4,0,0,0,0,0,"","Serviço","Serviço","-","SINAPI","74130/5","DISJUNTOR TERMOMAGNETICO TRIPOLAR PADRAO NEMA (AMERICANO) 60 A 100A 240V, FORNECIMENTO E INSTALACAO","UN",3,3,null,null,0,0,""]
["S",2,"S",0,1,4,0,0,0,0,0,"","Serviço","Serviço","-","SINAPI",91834,"ELETRODUTO FLEXÍVEL CORRUGADO, PVC, DN 25 MM (3/4\"), PARA CIRCUITOS TERMINAIS, INSTALADO EM FORRO - FORNECIMENTO E INSTALAÇÃO. AF_12/2015","M",183,183,null,null,0,0,""]
["S",2,"S",0,1,4,0,0,0,0,0,"","Serviço","Serviço","-","SINAPI",91836,"ELETRODUTO FLEXÍVEL CORRUGADO, PVC, DN 32 MM (1\"), PARA CIRCUITOS TERMINAIS, INSTALADO EM FORRO - FORNECIMENTO E INSTALAÇÃO. AF_12/2015","M",24,24,null,null,0,0,""]
["S",2,"S",0,1,4,0,0,0,0,0,"","Serviço","Serviço","-","SINAPI",93008,"ELETRODUTO RÍGIDO ROSCÁVEL, PVC, DN 50 MM (1 1/2\") - FORNECIMENTO E INSTALAÇÃO. AF_12/2015","M",75,75,null,null,0,0,""]
["S",2,"S",0,1,4,0,0,0,0,0,"","Serviço","Serviço","-","SINAPI",93009,"ELETRODUTO RÍGIDO ROSCÁVEL, PVC, DN 60 MM (2\") - FORNECIMENTO E INSTALAÇÃO. AF_12/2015","M",120,120,null,null,0,0,""]
["S",2,"S",0,1,4,0,0,0,0,0,"","Serviço","Serviço","-","SINAPI",91981,"INTERRUPTOR BIPOLAR (1 MÓDULO), 10A/250V, INCLUINDO SUPORTE E PLACA - FORNECIMENTO E INSTALAÇÃO. AF_09/2017","UN",13,13,null,null,0,0,""]
["S",2,"S",0,1,4,0,0,0,0,0,"","Serviço","Serviço","-","SINAPI",91958,"INTERRUPTOR SIMPLES (2 MÓDULOS), 10A/250V, SEM SUPORTE E SEM PLACA - FORNECIMENTO E INSTALAÇÃO. AF_12/2015","UN",1,1,null,null,0,0,""]
["S",2,"S",0,1,4,0,0,0,0,0,"","Serviço","Serviço","-","SINAPI",97610,"LÂMPADA COMPACTA DE LED 10 W, BASE E27 - FORNECIMENTO E INSTALAÇÃO. AF_11/2017","UN",88,88,null,null,0,0,""]
["S",2,"S",0,1,4,0,0,0,0,0,"","Serviço","Serviço","-","SINAPI",97591,"LUMINÁRIA TIPO PLAFON REDONDO COM VIDRO FOSCO, DE SOBREPOR, COM 2 LÂMPADAS DE 15 W - FORNECIMENTO E INSTALAÇÃO. AF_11/2017","UN",44,44,null,null,0,0,""]
["S",2,"S",0,1,4,0,0,0,0,0,"","Serviço","Serviço","-","SINAPI",91875,"LUVA PARA ELETRODUTO, PVC, ROSCÁVEL, DN 25 MM (3/4\"), PARA CIRCUITOS TERMINAIS, INSTALADA EM FORRO - FORNECIMENTO E INSTALAÇÃO. AF_12/2015","UN",61,61,null,null,0,0,""]
["S",2,"S",0,1,4,0,0,0,0,0,"","Serviço","Serviço","-","SINAPI",91876,"LUVA PARA ELETRODUTO, PVC, ROSCÁVEL, DN 32 MM (1\"), PARA CIRCUITOS TERMINAIS, INSTALADA EM FORRO - FORNECIMENTO E INSTALAÇÃO. AF_12/2015","UN",8,8,null,null,0,0,""]
["S",2,"S",0,1,4,0,0,0,0,0,"","Serviço","Serviço","-","SINAPI","74131/4","QUADRO DE DISTRIBUICAO DE ENERGIA DE EMBUTIR, EM CHAPA METALICA, PARA 18 DISJUNTORES TERMOMAGNETICOS MONOPOLARES, COM BARRAMENTO TRIFASICO E NEUTRO, FORNECIMENTO E INSTALACAO","UN",2,2,null,null,0,0,""]
["S",2,"S",0,1,4,0,0,0,0,0,"","Serviço","Serviço","-","SINAPI","74131/5","QUADRO DE DISTRIBUICAO DE ENERGIA DE EMBUTIR, EM CHAPA METALICA, PARA 24 DISJUNTORES TERMOMAGNETICOS MONOPOLARES, COM BARRAMENTO TRIFASICO E NEUTRO, FORNECIMENTO E INSTALACAO","UN",1,1,null,null,0,0,""]
["S",2,"S",0,1,4,0,0,0,0,0,"","Serviço","Serviço","-","SINAPI",92000,"TOMADA BAIXA DE EMBUTIR (1 MÓDULO), 2P+T 10 A, INCLUINDO SUPORTE E PLACA - FORNECIMENTO E INSTALAÇÃO. AF_12/2015","UN",15,15,null,null,0,0,""]
["S",2,"S",0,1,4,0,0,0,0,0,"","Serviço","Serviço","-","SINAPI",91996,"TOMADA MÉDIA DE EMBUTIR (1 MÓDULO), 2P+T 10 A, INCLUINDO SUPORTE E PLACA - FORNECIMENTO E INSTALAÇÃO. AF_12/2015","UN",5,5,null,null,0,0,""]
["S",2,"S",0,1,4,0,0,0,0,0,"","Serviço","Serviço","-","SINAPI",91997,"TOMADA MÉDIA DE EMBUTIR (1 MÓDULO), 2P+T 20 A, INCLUINDO SUPORTE E PLACA - FORNECIMENTO E INSTALAÇÃO. AF_12/2015","UN",1,1,null,null,0,0,""]
["S",2,"S",0,1,4,0,0,0,0,0,"","Serviço","Serviço","-","SINAPI",91993,"TOMADA ALTA DE EMBUTIR (1 MÓDULO), 2P+T 20 A, INCLUINDO SUPORTE E PLACA - FORNECIMENTO E INSTALAÇÃO. AF_12/2015","UN",2,2,null,null,0,0]
[2,2,2,39,1,5,0,0,0,95,39,"","Nível 2","Nível 2","-",null,null,"INSTALAÇÕES HIDROSSANITÁRIAS","-",null,0,null,null,0,0,""]
[3,3,3,12,1,5,1,0,0,38,12,"","Nível 3","Nível 3","-",null,null,"PEÇAS E ACESSÓRIOS","-",null,0,null,null,0,0,""]
[{"$f":"CHOOSE(1+LOG(1+2*(ORÇAMENTO.Nivel=\"Nível 1\")+4*(ORÇAMENTO.Nivel=\"Nível 2\")+8*(ORÇAMENTO.Nivel=\"Nível 3\")+16*(ORÇAMENTO.Nivel=\"Nível 4\")+32*(ORÇAMENTO.Nivel=\"Serviço\"),2),0,1,2,3,4,\"S\")","v":"S"},3,"S",0,{"$f":"IF($C72=1,OFFSET(E72,-1,0)+1,OFFSET(E72,-1,0))","v":1},{"$f":"IF($C72=1,0,IF($C72=2,OFFSET(F72,-1,0)+1,OFFSET(F72,-1,0)))","v":5},{"$f":"IF(AND($C72<=2,$C72<>0),0,IF($C72=3,OFFSET(G72,-1,0)+1,OFFSET(G72,-1,0)))","v":1},{"$f":"IF(AND($C72<=3,$C72<>0),0,IF($C72=4,OFFSET(H72,-1,0)+1,OFFSET(H72,-1,0)))","v":0},{"$f":"IF(AND($C72<=4,$C72<>0),0,IF(AND($C72=\"S\",$Y72>0),OFFSET(I72,-1,0)+1,OFFSET(I72,-1,0)))","v":0},0,0,"","Serviço","Serviço","-","SINAPI",94500,"REGISTRO DE GAVETA BRUTO, LATÃO, ROSCÁVEL, 3\u0094, INSTALADO EM RESERVAÇÃO DE ÁGUA DE EDIFICAÇÃO QUE POSSUA RESERVATÓRIO DE FIBRA/FIBROCIMENTO \u0096 FORNECIMENTO E INSTALAÇÃO. AF_06/2016","UN",1,1,null,null,0,0,""]
["S",3,"S",0,1,5,1,0,0,0,0,"","Serviço","Serviço","-","SINAPI",94495,"REGISTRO DE GAVETA BRUTO, LATÃO, ROSCÁVEL, 1\u0094, INSTALADO EM RESERVAÇÃO DE ÁGUA DE EDIFICAÇÃO QUE POSSUA RESERVATÓRIO DE FIBRA/FIBROCIMENTO \u0096 FORNECIMENTO E INSTALAÇÃO. AF_06/2016","UN",1,1,null,null,0,0,"Referência: AGETOP - 80903"]
["S",3,"S",0,1,5,1,0,0,0,0,"","Serviço","Serviço","-","SINAPI",89616,"ADAPTADOR CURTO COM BOLSA E ROSCA PARA REGISTRO, PVC, SOLDÁVEL, DN 85MM X 3\u0094, INSTALADO EM PRUMADA DE ÁGUA - FORNECIMENTO E INSTALAÇÃO. AF_12/2014","UN",2,2,null,null,0,0,"Referência: AGETOP - 81072"]
["S",3,"S",0,1,5,1,0,0,0,0,"","Serviço","Serviço","-","SINAPI",89553,"ADAPTADOR CURTO COM BOLSA E ROSCA PARA REGISTRO, PVC, SOLDÁVEL, DN 32MM X 1\u0094, INSTALADO EM PRUMADA DE ÁGUA - FORNECIMENTO E INSTALAÇÃO. AF_12/2014","UN",2,2,null,null,0,0,"Referência: AGETOP - 81067"]
["S",3,"S",0,1,5,1,0,0,0,0,"","Serviço","Serviço","-","SINAPI",94714,"ADAPTADOR COM FLANGES LIVRES, PVC, SOLDÁVEL, DN 85 MM X 3 , INSTALADO EM RESERVAÇÃO DE ÁGUA DE EDIFICAÇÃO QUE POSSUA RESERVATÓRIO DE FIBRA/FIBROCIMENTO   FORNECIMENTO E INSTALAÇÃO. AF_06/2016","UN",1,1,null,null,0,0,"Referência: COMPOSIÇÃO - COMP 028_SEE"]
["S",3,"S",0,1,5,1,0,0,0,0,"","Serviço","Serviço","-","SINAPI",94785,"ADAPTADOR COM FLANGES LIVRES, PVC, SOLDÁVEL LONGO, DN 32 MM X 1 , INSTALADO EM RESERVAÇÃO DE ÁGUA DE EDIFICAÇÃO QUE POSSUA RESERVATÓRIO DE FIBRA/FIBROCIMENTO   FORNECIMENTO E INSTALAÇÃO. AF_06/2016","UN",1,1,null,null,0,0,"Referência: AGETOP - 81042"]
["S",3,"S",0,1,5,1,0,0,0,0,"","Serviço","Serviço","-","AGETOP",80840,"TAMPA T-5 ARTICULADA 20X20","Un    ",1,1,null,null,0,0,""]
["S",3,"S",0,1,5,1,0,0,0,0,"","Serviço","Serviço","-","AGETOP",80845,"CAIXA DE ALVENARIA 20x20x25 CM (REVESTIMENTO IMPERMEABILIZADO), FUNDO DE BRITA SEM TAMPA - PARA REGISTRO/TORNEIRA JARDIM","Un    ",1,1,null,null,0,0,""]
["S",3,"S",0,1,5,1,0,0,0,0,"","Serviço","Serviço","-","AGETOP",81825,"CAIXA DE PASSAGEM 60 X 60 CM SEM TAMPA","Un    ",4,4,null,null,0,0,""]
["S",3,"S",0,1,5,1,0,0,0,0,"","Serviço","Serviço","-","SINAPI",6171,"TAMPA DE CONCRETO ARMADO 60X60X5CM PARA CAIXA","UN",4,4,null,null,0,0,""]
["S",3,"S",0,1,5,1,0,0,0,0,"","Serviço","Serviço","-","AGETOP",81880,"RES.METALICO TAÇA AÇO PATINÁVEL-V=5M3-COL.SEC.H=6M+FUNDAÇÃO+LOGOTIPO","Un    ",1,1,null,null,0,0,""]
[3,3,3,14,1,5,2,0,0,{"$f":"IF(OR($C83=\"S\",$C83=0),0,MATCH(0,OFFSET($D83,1,$C83,ROW($C$459)-ROW($C83)),0))","v":26},{"$f":"IF(OR($C83=\"S\",$C83=0),0,MATCH(OFFSET($D83,0,$C83)+1,OFFSET($D83,1,$C83,ROW($C$459)-ROW($C83)),0))","v":14},"","Nível 3","Nível 3","-",null,null,"ÁGUA FRIA","-",null,0,null,null,0,0,""]
["S",3,"S",0,1,5,2,0,0,0,0,"","Serviço","Serviço","-","SINAPI",89447,"TUBO, PVC, SOLDÁVEL, DN 32MM, INSTALADO EM PRUMADA DE ÁGUA - FORNECIMENTO E INSTALAÇÃO. AF_12/2014","M",90,90,null,null,0,0,""]
["S",3,"S",0,1,5,2,0,0,0,0,"","Serviço","Serviço","-","SINAPI",89451,"TUBO, PVC, SOLDÁVEL, DN 75MM, INSTALADO EM PRUMADA DE ÁGUA - FORNECIMENTO E INSTALAÇÃO. AF_12/2014","M",6,6,null,null,0,0,""]
["S",3,"S",0,1,5,2,0,0,0,0,"","Serviço","Serviço","-","SINAPI",89452,"TUBO, PVC, SOLDÁVEL, DN 85MM, INSTALADO EM PRUMADA DE ÁGUA - FORNECIMENTO E INSTALAÇÃO. AF_12/2014","M",18,18,null,null,0,0,""]
["S",3,"S",0,1,5,2,0,0,0,0,"","Serviço","Serviço","-","SINAPI",89541,"LUVA, PVC, SOLDÁVEL, DN 32MM, INSTALADO EM PRUMADA DE ÁGUA - FORNECIMENTO E INSTALAÇÃO. AF_12/2014","UN",13,13,null,null,0,0,""]
["S",3,"S",0,1,5,2,0,0,0,0,"","Serviço","Serviço","-","SINAPI",89611,"LUVA, PVC, SOLDÁVEL, DN 75MM, INSTALADO EM PRUMADA DE ÁGUA - FORNECIMENTO E INSTALAÇÃO. AF_12/2014","UN",1,1,null,null,0,0,""]
["S",3,"S",0,1,5,2,0,0,0,0,"","Serviço","Serviço","-","SINAPI",89614,"LUVA, PVC, SOLDÁVEL, DN 85MM, INSTALADO EM PRUMADA DE ÁGUA - FORNECIMENTO E INSTALAÇÃO. AF_12/2014","UN",2,2,null,null,0,0,"Referência: AGETOP - 81108"]
["S",{"$f":"IF(OR(C90=\"s\",C90=0),OFFSET(B90,-1,0),C90)","v":3},{"$f":"IF(OFFSET(C90,-1,0)=\"L\",1,IF(OFFSET(C90,-1,0)=1,2,IF(OR(A90=\"s\",A90=0),\"S\",IF(AND(OFFSET(C90,-1,0)=2,A90=4),3,IF(AND(OR(OFFSET(C90,-1,0)=\"s\",OFFSET(C90,-1,0)=0),A90<>\"s\",A90>OFFSET(B90,-1,0)),OFFSET(B90,-1,0),A90)))))","v":"S"},{"$f":"IF(OR(C90=\"S\",C90=0),0,IF(ISERROR(K90),J90,SMALL(J90:K90,1)))","v":0},1,5,2,0,0,0,0,"","Serviço","Serviço","-","SINAPI",89492,"JOELHO 90 GRAUS, PVC, SOLDÁVEL, DN 32MM, INSTALADO EM PRUMADA DE ÁGUA - FORNECIMENTO E INSTALAÇÃO. AF_12/2014","UN",7,7,null,null,0,0,""]
["S",3,"S",0,1,5,2,0,0,0,0,"","Serviço","Serviço","-","SINAPI",89521,"JOELHO 90 GRAUS, PVC, SOLDÁVEL, DN 85MM, INSTALADO EM PRUMADA DE ÁGUA - FORNECIMENTO E INSTALAÇÃO. AF_12/2014","UN",3,3,null,null,0,0,"Referência: AGETOP - 81327"]
["S",{"$f":"IF(OR(C92=\"s\",C92=0),OFFSET(B92,-1,0),C92)","v":3},{"$f":"IF(OFFSET(C92,-1,0)=\"L\",1,IF(OFFSET(C92,-1,0)=1,2,IF(OR(A92=\"s\",A92=0),\"S\",IF(AND(OFFSET(C92,-1,0)=2,A92=4),3,IF(AND(OR(OFFSET(C92,-1,0)=\"s\",OFFSET(C92,-1,0)=0),A92<>\"s\",A92>OFFSET(B92,-1,0)),OFFSET(B92,-1,0),A92)))))","v":"S"},{"$f":"IF(OR(C92=\"S\",C92=0),0,IF(ISERROR(K92),J92,SMALL(J92:K92,1)))","v":0},1,5,2,0,0,0,0,"","Serviço","Serviço","-","AGETOP",81167,"BUCHA DE REDUCAO SOLDAVEL CURTA 85 X 75 mm","Un    ",1,1,null,null,0,0,""]
["S",3,"S",0,1,5,2,0,0,0,0,"","Serviço","Serviço","-","AGETOP",81185,"BUCHA DE REDUÇÃO SOLDÁVEL LONGA 75 X 50 MM","un    ",1,1,null,null,0,0,""]
["S",3,"S",0,{"$f":"IF($C94=1,OFFSET(E94,-1,0)+1,OFFSET(E94,-1,0))","v":1},{"$f":"IF($C94=1,0,IF($C94=2,OFFSET(F94,-1,0)+1,OFFSET(F94,-1,0)))","v":5},{"$f":"IF(AND($C94<=2,$C94<>0),0,IF($C94=3,OFFSET(G94,-1,0)+1,OFFSET(G94,-1,0)))","v":2},{"$f":"IF(AND($C94<=3,$C94<>0),0,IF($C94=4,OFFSET(H94,-1,0)+1,OFFSET(H94,-1,0)))","v":0},0,0,0,"","Serviço","Serviço","-","AGETOP",81166,"BUCHA DE REDUCAO SOLDAVEL CURTA 75 X 60 mm","Un    ",1,1,null,null,0,0,""]
["S",3,"S",0,{"$f":"IF($C95=1,OFFSET(E95,-1,0)+1,OFFSET(E95,-1,0))","v":1},{"$f":"IF($C95=1,0,IF($C95=2,OFFSET(F95,-1,0)+1,OFFSET(F95,-1,0)))","v":5},{"$f":"IF(AND($C95<=2,$C95<>0),0,IF($C95=3,OFFSET(G95,-1,0)+1,OFFSET(G95,-1,0)))","v":2},{"$f":"IF(AND($C95<=3,$C95<>0),0,IF($C95=4,OFFSET(H95,-1,0)+1,OFFSET(H95,-1,0)))","v":0},0,0,0,"","Serviço","Serviço","-","AGETOP",81181,"BUCHA DE REDUCAO SOLDAVEL LONGA 60 X 25 mm","Un    ",2,2,null,null,0,0,""]
["S",3,"S",0,1,5,2,0,0,0,0,"","Serviço","Serviço","-","SINAPI",89628,"TE, PVC, SOLDÁVEL, DN 60MM, INSTALADO EM PRUMADA DE ÁGUA - FORNECIMENTO E INSTALAÇÃO. AF_12/2014","UN",2,2,null,null,0,0,"Referência: AGETOP - 81406"]
[3,3,3,5,1,5,3,0,0,12,5,"","Nível 3","Nível 3","-",null,null,"ESGOTO","-",null,0,null,null,0,0]
["S",3,"S",0,1,5,3,0,0,0,0,"","Serviço","Serviço","-","SINAPI",89810,"JOELHO 45 GRAUS, PVC, SERIE NORMAL, ESGOTO PREDIAL, DN 100 MM, JUNTA ELÁSTICA, FORNECIDO E INSTALADO EM PRUMADA DE ESGOTO SANITÁRIO OU VENTILAÇÃO. AF_12/2014","UN",2,2,null,null,0,0,""]
["S",3,"S",0,1,5,3,0,0,0,0,"","Serviço","Serviço","-","SINAPI",89834,"JUNÇÃO SIMPLES, PVC, SERIE NORMAL, ESGOTO PREDIAL, DN 100 X 100 MM, JUNTA ELÁSTICA, FORNECIDO E INSTALADO EM PRUMADA DE ESGOTO SANITÁRIO OU VENTILAÇÃO. AF_12/2014","UN",1,1,null,null,0,0,""]
["S",3,"S",0,1,5,3,0,0,0,0,"","Serviço","Serviço","-","SINAPI",89821,"LUVA SIMPLES, PVC, SERIE NORMAL, ESGOTO PREDIAL, DN 100 MM, JUNTA ELÁSTICA, FORNECIDO E INSTALADO EM PRUMADA DE ESGOTO SANITÁRIO OU VENTILAÇÃO. AF_12/2014","UN",11,11,null,null,0,0,""]
["S",3,"S",0,1,5,3,0,0,0,0,"","Serviço","Serviço","-","SINAPI",89800,"TUBO PVC, SERIE NORMAL, ESGOTO PREDIAL, DN 100 MM, FORNECIDO E INSTALADO EM PRUMADA DE ESGOTO SANITÁRIO OU VENTILAÇÃO. AF_12/2014","M",78,78,null,null,0,0,""]
[3,3,3,7,1,5,4,0,0,7,122,"","Nível 3","Nível 3","-",null,null,"INCÊNDIO","-",null,0,null,null,0,0,""]
["S",3,"S",0,1,5,4,0,0,0,0,"","Serviço","Serviço","-","SINAPI",83635,"EXTINTOR INCENDIO TP PO QUIMICO 6KG - FORNECIMENTO E INSTALACAO","UN",7,7,null,null,0,0,"Referência: AGETOP - 85003"]
["S",3,"S",0,1,5,4,0,0,0,0,"","Serviço","Serviço","-","SINAPI","73775/2","EXTINTOR INCENDIO AGUA-PRESSURIZADA 10L INCL SUPORTE PAREDE CARGA     COMPLETA FORNECIMENTO E COLOCACAO","UN",2,2,null,null,0,0,"Referência: AGETOP - 85005"]
["S",3,"S",0,1,5,4,0,0,0,0,"","Serviço","Serviço","-","SINAPI",97599,"LUMINÁRIA DE EMERGÊNCIA - FORNECIMENTO E INSTALAÇÃO. AF_11/2017","UN",11,11,null,null,0,0,""]
["S",3,"S",0,1,5,4,0,0,0,0,"","Serviço","Serviço","-","COMPOSIÇÃO","COMP 024_SEE","SINALIZADOR FOTOLUMINESCENTE PARA EXTINTOR","UN ",9,9,null,null,0,0,""]
["S",3,"S",0,1,5,4,0,0,0,0,"","Serviço","Serviço","-","COMPOSIÇÃO","COMP 025_SEE","SINALIZADOR FOTOLUMINESCENTE DE EMERGÊNCIA","UN ",14,14,null,null,0,0,""]
["S",3,"S",0,1,5,4,0,0,0,0,"","Serviço","Serviço","-","COMPOSIÇÃO","COMP 084_SEE","GUARDA-CORPO COM CORRIMÃO - SEDUC","M",56,56,null,null,0,0,""]
[2,2,2,27,1,6,0,0,0,56,27,"","Nível 2","Nível 2","-",null,null,"INSTALAÇÕES ESPECIAIS","-",null,0,null,null,0,0,""]
["S",2,"S",0,{"$f":"IF($C110=1,OFFSET(E110,-1,0)+1,OFFSET(E110,-1,0))","v":1},{"$f":"IF($C110=1,0,IF($C110=2,OFFSET(F110,-1,0)+1,OFFSET(F110,-1,0)))","v":6},{"$f":"IF(AND($C110<=2,$C110<>0),0,IF($C110=3,OFFSET(G110,-1,0)+1,OFFSET(G110,-1,0)))","v":0},{"$f":"IF(AND($C110<=3,$C110<>0),0,IF($C110=4,OFFSET(H110,-1,0)+1,OFFSET(H110,-1,0)))","v":0},0,0,0,"","Serviço","Serviço","-","AGETOP",91007,"CENTRAL DE GÁS PADRÃO AGETOP SEM INSTALAÇÕES (1+1 CILINDRO 45 KG)","Un    ",1,1,null,null,0,0,""]
["S",2,"S",0,{"$f":"IF($C111=1,OFFSET(E111,-1,0)+1,OFFSET(E111,-1,0))","v":1},{"$f":"IF($C111=1,0,IF($C111=2,OFFSET(F111,-1,0)+1,OFFSET(F111,-1,0)))","v":6},{"$f":"IF(AND($C111<=2,$C111<>0),0,IF($C111=3,OFFSET(G111,-1,0)+1,OFFSET(G111,-1,0)))","v":0},{"$f":"IF(AND($C111<=3,$C111<>0),0,IF($C111=4,OFFSET(H111,-1,0)+1,OFFSET(H111,-1,0)))","v":0},0,0,0,"","Serviço","Serviço","-","AGETOP",91023,"UNIÃO S/BRONZE PRETA 3/4\" NPT 300 LBS","Un    ",3,3,null,null,0,0,""]
[{"$f":"CHOOSE(1+LOG(1+2*(ORÇAMENTO.Nivel=\"Nível 1\")+4*(ORÇAMENTO.Nivel=\"Nível 2\")+8*(ORÇAMENTO.Nivel=\"Nível 3\")+16*(ORÇAMENTO.Nivel=\"Nível 4\")+32*(ORÇAMENTO.Nivel=\"Serviço\"),2),0,1,2,3,4,\"S\")","v":"S"},{"$f":"IF(OR(C112=\"s\",C112=0),OFFSET(B112,-1,0),C112)","v":2},{"$f":"IF(OFFSET(C112,-1,0)=\"L\",1,IF(OFFSET(C112,-1,0)=1,2,IF(OR(A112=\"s\",A112=0),\"S\",IF(AND(OFFSET(C112,-1,0)=2,A112=4),3,IF(AND(OR(OFFSET(C112,-1,0)=\"s\",OFFSET(C112,-1,0)=0),A112<>\"s\",A112>OFFSET(B112,-1,0)),OFFSET(B112,-1,0),A112)))))","v":"S"},{"$f":"IF(OR(C112=\"S\",C112=0),0,IF(ISERROR(K112),J112,SMALL(J112:K112,1)))","v":0},1,6,0,0,{"$f":"IF(AND($C112<=4,$C112<>0),0,IF(AND($C112=\"S\",$Y112>0),OFFSET(I112,-1,0)+1,OFFSET(I112,-1,0)))","v":0},0,0,"","Serviço","Serviço","-","COMPOSIÇÃO","COMP 382_SEE","TE DE REDUCAO DE FERRO GALVANIZADO, COM ROSCA BSP, DE 3/4\" X 1/2\"","UN ",1,1,null,null,0,0,""]
["S",2,"S",0,1,6,0,0,0,0,0,"","Serviço","Serviço","-","COMPOSIÇÃO","COMP 383_SEE","BUCHA DE REDUCAO DE FERRO GALVANIZADO, COM ROSCA BSP, DE 1/2\" X 1/4\"","UN ",3,3,null,null,0,0,""]
["S",2,"S",0,1,6,0,0,0,0,0,"","Serviço","Serviço","-","AGETOP",91021,"LUVA GALVANIZADO DE REDUÇÃO 3/4\" X 1/2\" (GÁS)","Un    ",2,2,null,null,0,0,""]
["S",2,"S",0,1,6,0,0,0,0,0,"","Serviço","Serviço","-","SINAPI",92692,"NIPLE, EM FERRO GALVANIZADO, CONEXÃO ROSQUEADA, DN 15 (1/2\"), INSTALADO EM RAMAIS E SUB-RAMAIS DE GÁS - FORNECIMENTO E INSTALAÇÃO. AF_12/2015","UN",6,6,null,null,0,0,""]
["S",2,"S",0,1,6,0,0,0,0,0,"","Serviço","Serviço","-","AGETOP",91031,"NIPLE DUPLO 300 PSI 3/4\"","Un    ",6,6,null,null,0,0,""]
["S",2,"S",0,1,6,0,0,0,0,0,"","Serviço","Serviço","-","COMPOSIÇÃO","COMP 212_SEE","NIPLE DE REDUÇÃO 1/2\" X 1/4\" BSP","UN ",4,4,null,null,0,0,""]
["S",2,"S",0,1,6,0,0,0,0,0,"","Serviço","Serviço","-","COMPOSIÇÃO","COMP 213_SEE","NIPLE DE REDUÇÃO 3/4\" X 1/2\" BSP","UN ",4,4,null,null,0,0,""]
["S",2,"S",0,1,6,0,0,0,0,0,"","Serviço","Serviço","-","SINAPI",92688,"TUBO DE AÇO GALVANIZADO COM COSTURA, CLASSE MÉDIA, CONEXÃO ROSQUEADA, DN 20 (3/4\"), INSTALADO EM RAMAIS E SUB-RAMAIS DE GÁS - FORNECIMENTO E INSTALAÇÃO. AF_12/2015","M",12,12,null,null,0,0,""]
["S",2,"S",0,1,6,0,0,0,0,0,"","Serviço","Serviço","-","SINAPI",92701,"JOELHO 90 GRAUS, EM FERRO GALVANIZADO, CONEXÃO ROSQUEADA, DN 20 (3/4\"), INSTALADO EM RAMAIS E SUB-RAMAIS DE GÁS - FORNECIMENTO E INSTALAÇÃO. AF_12/2015","UN",6,6,null,null,0,0,""]
["S",2,"S",0,1,6,0,0,0,0,0,"","Serviço","Serviço","-","COMPOSIÇÃO","COMP 237_SEE","FITA ANTICORROSIVA","M",5,5,null,null,0,0,""]
["S",2,"S",0,1,6,0,0,0,0,0,"","Serviço","Serviço","-","AGETOP",91025,"VÁLVULA ESFERICA LATÃO 3/4\"","Un    ",3,3,null,null,0,0,""]
["S",2,"S",0,1,6,0,0,0,0,0,"","Serviço","Serviço","-","COMPOSIÇÃO","COMP 542_SEE","VÁLVULA UGV 3/4\" (S) LATÃO","UN ",1,1,null,null,0,0,""]
["S",2,"S",0,1,6,0,0,0,0,0,"","Serviço","Serviço","-","COMPOSIÇÃO","COMP 543_SEE","VÁLVULA UGV 1/2\" (S) LATÃO","UN ",1,1,null,null,0,0,""]
["S",2,"S",0,1,6,0,0,0,0,0,"","Serviço","Serviço","-","AGETOP",91029,"VALVULA DE RETENÇÃO LATÃO 1/2\" X 7/16\" NPT","Un    ",1,1,null,null,0,0,""]
["S",2,"S",0,1,6,0,0,0,0,0,"","Serviço","Serviço","-","COMPOSIÇÃO","COMP 211_SEE","REGULADOR DE 2º ESTÁGIO 5KG/H","UN ",1,1,null,null,0,0,""]
["S",2,"S",0,1,6,0,0,0,0,0,"","Serviço","Serviço","-","COMPOSIÇÃO","COMP 210_SEE","REGULADOR DE 1º ESTÁGIO 60KG/H MODELO AP-40  COM MANÔMETRO","UN ",1,1,null,null,0,0,""]
["S",2,"S",0,1,6,0,0,0,0,0,"","Serviço","Serviço","-","AGETOP",85003,"EXTINTOR PO QUIMICO SECO (6 KG) - CAPACIDADE EXTINTORA 20 BC","Un    ",1,1,null,null,0,0,""]
[{"$f":"CHOOSE(1+LOG(1+2*(ORÇAMENTO.Nivel=\"Nível 1\")+4*(ORÇAMENTO.Nivel=\"Nível 2\")+8*(ORÇAMENTO.Nivel=\"Nível 3\")+16*(ORÇAMENTO.Nivel=\"Nível 4\")+32*(ORÇAMENTO.Nivel=\"Serviço\"),2),0,1,2,3,4,\"S\")","v":"S"},{"$f":"IF(OR(C129=\"s\",C129=0),OFFSET(B129,-1,0),C129)","v":2},{"$f":"IF(OFFSET(C129,-1,0)=\"L\",1,IF(OFFSET(C129,-1,0)=1,2,IF(OR(A129=\"s\",A129=0),\"S\",IF(AND(OFFSET(C129,-1,0)=2,A129=4),3,IF(AND(OR(OFFSET(C129,-1,0)=\"s\",OFFSET(C129,-1,0)=0),A129<>\"s\",A129>OFFSET(B129,-1,0)),OFFSET(B129,-1,0),A129)))))","v":"S"},{"$f":"IF(OR(C129=\"S\",C129=0),0,IF(ISERROR(K129),J129,SMALL(J129:K129,1)))","v":0},1,6,0,0,{"$f":"IF(AND($C129<=4,$C129<>0),0,IF(AND($C129=\"S\",$Y129>0),OFFSET(I129,-1,0)+1,OFFSET(I129,-1,0)))","v":0},0,0,"","Serviço","Serviço","-","COMPOSIÇÃO","COMP 235_SEE","PLACA DE SINALIZAÇÃO EM PVC COD 01 - (300X300) PROIBIDO FUMAR","UN ",2,2,null,null,0,0,""]
["S",2,"S",0,1,6,0,0,0,0,0,"","Serviço","Serviço","-","COMPOSIÇÃO","COMP 236_SEE","PLACA DE SINALIZAÇÃO EM PVC COD 06 - (300X300) PERIGO INFLAMÁVEL","UN ",2,2,null,null,0,0,""]
["S",2,"S",0,1,6,0,0,0,0,0,"","Serviço","Serviço","-","AGETOP",91043,"BRAÇADEIRA METALICA TIPO \"D\" DIAM. 3/4\"","Un    ",6,6,null,null,0,0,""]
["S",2,"S",0,1,6,0,0,0,0,0,"","Serviço","Serviço","-","AGETOP",71863,"PARAFUSO P/BUCHA S-10","Un    ",12,12,null,null,0,0,""]
["S",2,"S",0,1,6,0,0,0,0,0,"","Serviço","Serviço","-","AGETOP",70393,"BUCHA DE NYLON S-10","Un    ",12,12,null,null,0,0,""]
["S",2,"S",0,1,6,0,0,0,0,0,"","Serviço","Serviço","-","AGETOP",91045,"SUPORTE PARA COLETOR","Un    ",2,2,null,null,0,0,""]
["S",2,"S",0,1,6,0,0,0,0,0,"","Serviço","Serviço","-","AGETOP",250101,"ENGENHEIRO - (OBRAS CIVIS) - Laudo de Estanqueidade","H     ",16,16,null,null,0,0,""]
[{"$f":"CHOOSE(1+LOG(1+2*(ORÇAMENTO.Nivel=\"Nível 1\")+4*(ORÇAMENTO.Nivel=\"Nível 2\")+8*(ORÇAMENTO.Nivel=\"Nível 3\")+16*(ORÇAMENTO.Nivel=\"Nível 4\")+32*(ORÇAMENTO.Nivel=\"Serviço\"),2),0,1,2,3,4,\"S\")","v":2},{"$f":"IF(OR(C136=\"s\",C136=0),OFFSET(B136,-1,0),C136)","v":2},{"$f":"IF(OFFSET(C136,-1,0)=\"L\",1,IF(OFFSET(C136,-1,0)=1,2,IF(OR(A136=\"s\",A136=0),\"S\",IF(AND(OFFSET(C136,-1,0)=2,A136=4),3,IF(AND(OR(OFFSET(C136,-1,0)=\"s\",OFFSET(C136,-1,0)=0),A136<>\"s\",A136>OFFSET(B136,-1,0)),OFFSET(B136,-1,0),A136)))))","v":2},{"$f":"IF(OR(C136=\"S\",C136=0),0,IF(ISERROR(K136),J136,SMALL(J136:K136,1)))","v":2},1,7,0,0,{"$f":"IF(AND($C136<=4,$C136<>0),0,IF(AND($C136=\"S\",$Y136>0),OFFSET(I136,-1,0)+1,OFFSET(I136,-1,0)))","v":0},29,2,"","Nível 2","Nível 2","-","SINAPI",null,"ALVENARIAS E DIVISÓRIAS","-",null,0,null,null,0,0,""]
["S",2,"S",0,1,7,0,0,0,0,0,"","Serviço","Serviço","-","SINAPI",87503,"ALVENARIA DE VEDAÇÃO DE BLOCOS CERÂMICOS FURADOS NA HORIZONTAL DE 9X19X19CM (ESPESSURA 9CM) DE PAREDES COM ÁREA LÍQUIDA MAIOR OU IGUAL A 6M² SEM VÃOS E ARGAMASSA DE ASSENTAMENTO COM PREPARO EM BETONEIRA. AF_06/2014","M2",9,9,null,null,0,0,"Referência: AGETOP - 100201"]
[2,2,2,5,1,8,0,0,0,27,5,"","Nível 2","Nível 2","-","SINAPI",null,"ESQUADRIAS METÁLICAS","-",null,0,null,null,0,0,""]
["S",2,"S",0,1,8,0,0,0,0,0,"","Serviço","Serviço","-","SINAPI","73933/4","PORTA DE FERRO DE ABRIR TIPO BARRA CHATA, COM REQUADRO E GUARNICAO COMPLETA","M2",1.6800000000000002,1.6800000000000002,null,null,0,0,"Referência: AGETOP - 180501"]
["S",2,"S",0,1,8,0,0,0,0,0,"","Serviço","Serviço","-","COMPOSIÇÃO","COMP 083_SEE","CORRIMÃO PISO - SEDUC","M",22,22,null,null,0,0,""]
["S",2,"S",0,1,8,0,0,0,0,0,"","Serviço","Serviço","-","AGETOP",180304,"PORTAO DE ABRIR CHAPA 14  PT-4 C/FERRAGENS","m2    ",6,6,null,null,0,0,""]
["S",2,"S",0,1,8,0,0,0,0,0,"","Serviço","Serviço","-","AGETOP",180323,"GRELHA PADRÃO AGETOP DE FERRO CHATO COM BERÇO (ESPAÇAMENTO ENTRE FACES = 1,5CM - NBR 9050 ACESSIBILIDADE)","m2    ",21.82,21.82,null,null,0,0,""]
[2,2,2,3,1,9,0,0,0,22,3,"","Nível 2","Nível 2","-","SINAPI",null,"REVESTIMENTO DE PAREDE","-",null,0,null,null,0,0,""]
["S",2,"S",0,1,9,0,0,0,0,0,"","Serviço","Serviço","-","SINAPI",87894,"CHAPISCO APLICADO EM ALVENARIA (SEM PRESENÇA DE VÃOS) E ESTRUTURAS DE CONCRETO DE FACHADA, COM COLHER DE PEDREIRO.  ARGAMASSA TRAÇO 1:3 COM PREPARO EM BETONEIRA 400L. AF_06/2014","M2",10.7,10.7,null,null,0,0,"Referência: AGETOP - 200101"]
["S",2,"S",0,1,9,0,0,0,0,0,"","Serviço","Serviço","-","SINAPI",87547,"MASSA ÚNICA, PARA RECEBIMENTO DE PINTURA, EM ARGAMASSA TRAÇO 1:2:8, PREPARO MECÂNICO COM BETONEIRA 400L, APLICADA MANUALMENTE EM FACES INTERNAS DE PAREDES, ESPESSURA DE 10MM, COM EXECUÇÃO DE TALISCAS. AF_06/2014","M2",10.7,10.7,null,null,0,0,"Referência: AGETOP - 200403"]
[2,2,2,2,1,10,0,0,0,19,2,"","Nível 2","Nível 2","-","SINAPI",null,"FORROS","-",null,0,null,null,0,0,""]
["S",2,"S",0,1,10,0,0,0,{"$f":"IF(OR($C147=\"S\",$C147=0),0,MATCH(0,OFFSET($D147,1,$C147,ROW($C$459)-ROW($C147)),0))","v":0},{"$f":"IF(OR($C147=\"S\",$C147=0),0,MATCH(OFFSET($D147,0,$C147)+1,OFFSET($D147,1,$C147,ROW($C$459)-ROW($C147)),0))","v":0},"","Serviço","Serviço","-","AGETOP",210460,"FORRO DE PVC COM ESTRUTURA EM METALON PINTADA COM TINTA ALQUÍDICA D.F.","m2    ",49.6,49.6,null,null,0,0,""]
[2,2,2,3,1,11,0,0,0,17,3,"","Nível 2","Nível 2","-","SINAPI",null,"REVESTIMENTO DE PISO","-",null,0,null,null,0,0,""]
["S",2,"S",0,{"$f":"IF($C149=1,OFFSET(E149,-1,0)+1,OFFSET(E149,-1,0))","v":1},{"$f":"IF($C149=1,0,IF($C149=2,OFFSET(F149,-1,0)+1,OFFSET(F149,-1,0)))","v":11},{"$f":"IF(AND($C149<=2,$C149<>0),0,IF($C149=3,OFFSET(G149,-1,0)+1,OFFSET(G149,-1,0)))","v":0},{"$f":"IF(AND($C149<=3,$C149<>0),0,IF($C149=4,OFFSET(H149,-1,0)+1,OFFSET(H149,-1,0)))","v":0},0,0,0,"","Serviço","Serviço","-","SINAPI",94992,"EXECUÇÃO DE PASSEIO (CALÇADA) OU PISO DE CONCRETO COM CONCRETO MOLDADO IN LOCO, FEITO EM OBRA, ACABAMENTO CONVENCIONAL, ESPESSURA 6 CM, ARMADO. AF_07/2016","M2",319.5,319.5,null,null,0,0,"Referência: AGETOP - 220104"]
["S",2,"S",0,1,11,0,0,0,0,0,"","Serviço","Serviço","-","AGETOP",221126,"PISO DE LADRILHO HIDRÁULICO COLORIDO MODELO TÁTIL ( ALERTA OU DIRECIONAL) SEM LASTRO","m2    ",85,85,null,null,0,0,""]
[2,2,2,3,1,12,0,0,0,14,3,"","Nível 2","Nível 2","-","SINAPI",null,"ADMINISTRAÇÃO","-",null,0,null,null,0,0,""]
["S",2,"S",0,1,12,0,0,0,0,0,"","Serviço","Serviço","-","SINAPI",90777,"ENGENHEIRO CIVIL DE OBRA JUNIOR COM ENCARGOS COMPLEMENTARES","H",20,20,null,null,0,0,"Referência: AGETOP - 250101"]
["S",2,"S",0,1,12,0,0,0,0,0,"","Serviço","Serviço","-","SINAPI",90776,"ENCARREGADO GERAL COM ENCARGOS COMPLEMENTARES","H",220,220,null,null,0,0,"Referência: AGETOP - 250103"]
[2,2,2,8,1,13,0,0,0,11,8,"","Nível 2","Nível 2","-","SINAPI",null,"PINTURA","-",null,0,null,null,0,0,""]
["S",2,"S",0,1,13,0,0,0,0,0,"","Serviço","Serviço","-","AGETOP",260104,"REMOCAO DE PINTURA ANTIGA A LATEX","m2    ",45,45,null,null,0,0,""]
["S",2,"S",0,1,13,0,0,0,0,0,"","Serviço","Serviço","-","SINAPI",88489,"APLICAÇÃO MANUAL DE PINTURA COM TINTA LÁTEX ACRÍLICA EM PAREDES, DUAS DEMÃOS. AF_06/2014","M2",1555,1555,null,null,0,0,"Referência: AGETOP - 261001"]
["S",2,"S",0,1,13,0,0,0,0,0,"","Serviço","Serviço","-","SINAPI",88497,"APLICAÇÃO E LIXAMENTO DE MASSA LÁTEX EM PAREDES, DUAS DEMÃOS. AF_06/2014","M2",45,45,null,null,0,0,"Referência: AGETOP - 261300"]
["S",2,"S",0,1,13,0,0,0,0,0,"","Serviço","Serviço","-","SINAPI",88487,"APLICAÇÃO MANUAL DE PINTURA COM TINTA LÁTEX PVA EM PAREDES, DUAS DEMÃOS. AF_06/2014","M2",90,90,null,null,0,0,"Referência: AGETOP - 261307"]
["S",2,"S",0,1,13,0,0,0,0,0,"","Serviço","Serviço","-","SINAPI",95468,"PINTURA ESMALTE BRILHANTE (2 DEMAOS) SOBRE SUPERFICIE METALICA, INCLUSIVE PROTECAO COM ZARCAO (1 DEMAO)","M2",37.299999999999997,37.299999999999997,null,null,0,0,"Referência: AGETOP - 261602"]
["S",2,"S",0,1,13,0,0,0,0,0,"","Serviço","Serviço","-","AGETOP",261620,"LETREIRO MÉDIO A GRANDE PORTE EM PAREDE FEITO A PINCEL","m2    ",7.2,7.2,null,null,0,0,""]
["S",2,"S",0,1,13,0,0,0,0,0,"","Serviço","Serviço","-","AGETOP",261703,"PINT.POLIESPORTIVA - 2 DEM.(PISOS E CIMENTADOS)","m2    ",92,92,null,null,0,0,""]
[2,2,2,3,1,14,0,0,0,3,112,"","Nível 2","Nível 2","-","SINAPI",null,"DIVERSOS","-",null,0,null,null,0,0,""]
["S",2,"S",0,1,14,0,0,0,0,0,"","Serviço","Serviço","-","AGETOP",271201,"QUADRO DE GIZ (5,0X1,20 M C/EMBOÇO PINTURA COMPLETO)","Un    ",1,1,null,null,0,0,""]
["S",2,"S",0,1,14,0,0,0,0,0,"","Serviço","Serviço","-","AGETOP",271417,"CANALETA CONCRETO DESEMPENADO 5 CM PD.AGETOP","m     ",71.45,71.45,null,null,0,0,""]
[1,1,1,9,2,0,0,0,0,294,9,"F","Nível 1","Nível 1","2.","SINAPI",null,"IMPLANTAÇÃO","-",3,3,null,null,0,0,""]
[2,2,2,8,2,1,0,0,0,8,11,"","Nível 2","Nível 2","-","SINAPI",null,"SERVIÇO EM TERRA","-",null,0,null,null,0,0,""]
["S",2,"S",0,2,1,0,0,0,0,0,"","Serviço","Serviço","-","SINAPI",79480,"ESCAVACAO MECANICA CAMPO ABERTO EM SOLO EXCETO ROCHA ATE 2,00M PROFUNDIDADE","M3",17.809999999999999,17.809999999999999,null,null,0,0,"Referência: AGETOP - 41004"]
["S",2,"S",0,2,1,0,0,0,0,0,"","Serviço","Serviço","-","SINAPI",72898,"CARGA E DESCARGA MECANIZADAS DE ENTULHO EM CAMINHAO BASCULANTE 6 M3","M3",8.02,8.02,null,null,0,0,"Referência: AGETOP - 41005"]
["S",2,"S",0,2,1,0,0,0,0,0,"","Serviço","Serviço","-","AGETOP",41012,"INDENIZAÇÃO DE JAZIDA","m3    ",8.02,8.02,null,null,0,0,""]
["S",2,"S",0,2,1,0,0,0,0,0,"","Serviço","Serviço","-","AGETOP",41006,"TRANSPORTE DE MATERIAL ESCAVADO M3.KM","m3km  ",80.23,80.23,null,null,0,0,""]
["S",2,"S",0,2,1,0,0,0,0,0,"","Serviço","Serviço","-","AGETOP",41010,"TRANSPORTE COM LÂMINA ATE 100 M - (OBRAS CIVIS)","m3    ",9.7899999999999991,9.7899999999999991,null,null,0,0,""]
["S",2,"S",0,2,1,0,0,0,0,0,"","Serviço","Serviço","-","SINAPI","74005/2","COMPACTACAO MECANICA C/ CONTROLE DO GC>=95% DO PN (AREAS) (C/MONIVELADORA 140 HP E ROLO COMPRESSOR VIBRATORIO 80 HP)","M3",14.25,14.25,null,null,0,0,"Referência: AGETOP - 41008"]
["S",2,"S",0,2,1,0,0,0,0,0,"","Serviço","Serviço","-","SINAPI",79472,"REGULARIZACAO DE SUPERFICIES EM TERRA COM MOTONIVELADORA","M2",619.20999999999992,619.20999999999992,null,null,0,0,""]
[1,1,1,120,3,0,0,0,0,285,120,"F","Nível 1","Nível 1","3.","SINAPI",null,"BLOCO 3 SALAS SEDUC17","UN",3,null,null,null,0,0,""]
[2,2,2,2,3,1,0,0,0,119,2,"","Nível 2","Nível 2","-","SINAPI",null,"SERVIÇOS PRELIMINARES","-",null,null,null,null,0,0,""]
["S",2,"S",0,3,1,0,0,0,0,0,"","Serviço","Serviço","-","AGETOP",20701,"LOCAÇÃO DA OBRA, EXECUÇÃO DE GABARITO SEM REAPROVEITAMENTO, INCLUSO PINTURA (FACE INTERNA DO RIPÃO 15CM) E PIQUETE COM TESTEMUNHA","m2    ",190.26,570.78,null,null,0,0,""]
[2,2,2,3,3,2,0,0,0,117,3,"","Nível 2","Nível 2","-","SINAPI",null,"TRANSPORTES","-",null,0,null,null,0,0,""]
["S",2,"S",0,3,2,0,0,0,0,0,"","Serviço","Serviço","-","SINAPI",72897,"CARGA MANUAL DE ENTULHO EM CAMINHAO BASCULANTE 6 M3","M3",12,36,null,null,0,0,""]
["S",2,"S",0,3,2,0,0,0,0,0,"","Serviço","Serviço","-","SINAPI",72900,"TRANSPORTE DE ENTULHO COM CAMINHAO BASCULANTE 6 M3, RODOVIA PAVIMENTADA, DMT 0,5 A 1,0 KM","M3",12,36,null,null,0,0,""]
[2,2,2,8,3,3,0,0,0,114,8,"","Nível 2","Nível 2","-","SINAPI",null,"SERVIÇO EM TERRA","-",null,0,null,null,0,0,""]
["S",2,"S",0,3,3,0,0,0,0,0,"","Serviço","Serviço","-","SINAPI",93358,"ESCAVAÇÃO MANUAL DE VALA COM PROFUNDIDADE MENOR OU IGUAL A 1,30 M. AF_03/2016","M3",9.35,28.049999999999997,null,null,0,0,"Referência: AGETOP - 40101"]
["S",2,"S",0,3,3,0,0,0,0,0,"","Serviço","Serviço","-","SINAPI",96995,"REATERRO MANUAL APILOADO COM SOQUETE. AF_10/2017","M3",5.42,16.259999999999998,null,null,0,0,"Referência: AGETOP - 40902"]
["S",2,"S",0,3,3,0,0,0,0,0,"","Serviço","Serviço","-","SINAPI",79480,"ESCAVACAO MECANICA CAMPO ABERTO EM SOLO EXCETO ROCHA ATE 2,00M PROFUNDIDADE","M3",40,120,null,null,0,0,"Referência: AGETOP - 41004"]
["S",2,"S",0,3,3,0,0,0,0,0,"","Serviço","Serviço","-","SINAPI",72898,"CARGA E DESCARGA MECANIZADAS DE ENTULHO EM CAMINHAO BASCULANTE 6 M3","M3",40,120,null,null,0,0,"Referência: AGETOP - 41005"]
["S",2,"S",0,3,3,0,0,0,0,0,"","Serviço","Serviço","-","AGETOP",41012,"INDENIZAÇÃO DE JAZIDA","m3    ",40,120,null,null,0,0,""]
["S",2,"S",0,3,3,0,0,0,0,0,"","Serviço","Serviço","-","AGETOP",41006,"TRANSPORTE DE MATERIAL ESCAVADO M3.KM","m3km  ",40,120,null,null,0,0,""]
["S",2,"S",0,3,3,0,0,0,0,0,"","Serviço","Serviço","-","SINAPI","74005/2","COMPACTACAO MECANICA C/ CONTROLE DO GC>=95% DO PN (AREAS) (C/MONIVELADORA 140 HP E ROLO COMPRESSOR VIBRATORIO 80 HP)","M3",32,96,null,null,0,0,"Referência: AGETOP - 41008"]
[2,2,2,11,3,4,0,0,0,106,11,"","Nível 2","Nível 2","-","SINAPI",null,"FUNDAÇÕES E SONDAGENS","-",null,0,null,null,0,0,""]
[3,3,3,10,3,4,1,0,0,10,19,"","Nível 3","Nível 3","-","SINAPI",null,"ESTACAS E BLOCOS","-",null,0,null,null,0,0,""]
["S",3,"S",0,3,4,1,0,0,0,0,"","Serviço","Serviço","-","SINAPI",98230,"ESTACA BROCA DE CONCRETO, DIÂMETRO DE 30 CM, PROFUNDIDADE DE ATÉ 3 M, ESCAVAÇÃO MANUAL COM TRADO CONCHA, NÃO ARMADA. AF_03/2018","M",99,297,null,null,0,0,"Referência: AGETOP - 50302"]
["S",3,"S",0,3,4,1,0,0,0,0,"","Serviço","Serviço","-","SINAPI",96522,"ESCAVAÇÃO MANUAL PARA BLOCO DE COROAMENTO OU SAPATA, SEM PREVISÃO DE FÔRMA. AF_06/2017","M3",8.26,24.78,null,null,0,0,"Referência: AGETOP - 50901"]
["S",3,"S",0,3,4,1,0,0,0,0,"","Serviço","Serviço","-","SINAPI",96995,"REATERRO MANUAL APILOADO COM SOQUETE. AF_10/2017","M3",4.3600000000000003,13.080000000000002,null,null,0,0,"Referência: AGETOP - 40902"]
["S",3,"S",0,3,4,1,0,0,0,0,"","Serviço","Serviço","-","SINAPI",94963,"CONCRETO FCK = 15MPA, TRAÇO 1:3,4:3,5 (CIMENTO/ AREIA MÉDIA/ BRITA 1)  - PREPARO MECÂNICO COM BETONEIRA 400 L. AF_07/2016","M3",3.9,11.7,null,null,0,0,""]
["S",3,"S",0,3,4,1,0,0,0,0,"","Serviço","Serviço","-","SINAPI","74157/4","LANCAMENTO/APLICACAO MANUAL DE CONCRETO EM FUNDACOES","M3",3.9,11.7,null,null,0,0,"Referência: AGETOP - 51026"]
["S",3,"S",0,3,4,1,0,0,0,0,"","Serviço","Serviço","-","SINAPI",96544,"ARMAÇÃO DE BLOCO, VIGA BALDRAME OU SAPATA UTILIZANDO AÇO CA-50 DE 6,3 MM - MONTAGEM. AF_06/2017","KG",67.27,201.81,null,null,0,0,"Referência: AGETOP - 52003"]
["S",3,"S",0,3,4,1,0,0,0,0,"","Serviço","Serviço","-","SINAPI",96545,"ARMAÇÃO DE BLOCO, VIGA BALDRAME OU SAPATA UTILIZANDO AÇO CA-50 DE 8 MM - MONTAGEM. AF_06/2017","KG",136.36000000000001,409.08000000000004,null,null,0,0,"Referência: AGETOP - 60304"]
["S",3,"S",0,3,4,1,0,0,0,0,"","Serviço","Serviço","-","SINAPI",96546,"ARMAÇÃO DE BLOCO, VIGA BALDRAME OU SAPATA UTILIZANDO AÇO CA-50 DE 10 MM - MONTAGEM. AF_06/2017","KG",55.45,166.35000000000002,null,null,0,0,"Referência: AGETOP - 52005"]
["S",3,"S",0,3,4,1,0,0,0,0,"","Serviço","Serviço","-","SINAPI",96543,"ARMAÇÃO DE BLOCO, VIGA BALDRAME E SAPATA UTILIZANDO AÇO CA-60 DE 5 MM - MONTAGEM. AF_06/2017","KG",38.18,114.53999999999999,null,null,0,0,"Referência: AGETOP - 52014"]
[2,2,2,27,3,5,0,0,0,95,27,"","Nível 2","Nível 2","-","SINAPI",null,"ESTRUTURA","-",null,0,null,null,0,0,""]
[3,3,3,8,3,5,1,0,0,26,8,"","Nível 3","Nível 3","-","SINAPI",null,"VIGAS BALDRAMES","-",null,0,null,null,0,0,""]
["S",3,"S",0,3,5,1,0,0,0,0,"","Serviço","Serviço","-","SINAPI",96527,"ESCAVAÇÃO MANUAL DE VALA PARA VIGA BALDRAME, COM PREVISÃO DE FÔRMA. AF_06/2017","M3",9.94,29.82,null,null,0,0,"Referência: AGETOP - 40101"]
["S",3,"S",0,3,5,1,0,0,0,0,"","Serviço","Serviço","-","SINAPI",96995,"REATERRO MANUAL APILOADO COM SOQUETE. AF_10/2017","M3",5.69,17.07,null,null,0,0,"Referência: AGETOP - 50903"]
["S",3,"S",0,3,5,1,0,0,0,0,"","Serviço","Serviço","-","AGETOP",60191,"FORMA DE TABUA CINTA BALDRAME U=8 VEZES","m2    ",75.67,227.01,null,null,0,0,""]
["S",3,"S",0,3,5,1,0,0,0,0,"","Serviço","Serviço","-","SINAPI",94963,"CONCRETO FCK = 15MPA, TRAÇO 1:3,4:3,5 (CIMENTO/ AREIA MÉDIA/ BRITA 1)  - PREPARO MECÂNICO COM BETONEIRA 400 L. AF_07/2016","M3",4.25,12.75,null,null,0,0,""]
["S",3,"S",0,3,5,1,0,0,0,0,"","Serviço","Serviço","-","SINAPI","74157/4","LANCAMENTO/APLICACAO MANUAL DE CONCRETO EM FUNDACOES","M3",4.25,12.75,null,null,0,0,"Referência: AGETOP - 51055"]
["S",3,"S",0,3,5,1,0,0,0,0,"","Serviço","Serviço","-","SINAPI",96545,"ARMAÇÃO DE BLOCO, VIGA BALDRAME OU SAPATA UTILIZANDO AÇO CA-50 DE 8 MM - MONTAGEM. AF_06/2017","KG",173.64,520.91999999999996,null,null,0,0,"Referência: AGETOP - 52004"]
["S",3,"S",0,3,5,1,0,0,0,0,"","Serviço","Serviço","-","SINAPI",96543,"ARMAÇÃO DE BLOCO, VIGA BALDRAME E SAPATA UTILIZANDO AÇO CA-60 DE 5 MM - MONTAGEM. AF_06/2017","KG",97.27,291.81,null,null,0,0,"Referência: AGETOP - 52014"]
[3,3,3,6,3,5,2,0,0,18,6,"","Nível 3","Nível 3","-",null,null,"PILARES","-",null,0,null,null,0,0,""]
["S",3,"S",0,3,5,2,0,0,0,0,"","Serviço","Serviço","-","SINAPI",92426,"MONTAGEM E DESMONTAGEM DE FÔRMA DE PILARES RETANGULARES E ESTRUTURAS SIMILARES COM ÁREA MÉDIA DAS SEÇÕES MENOR OU IGUAL A 0,25 M², PÉ-DIREITO SIMPLES, EM CHAPA DE MADEIRA COMPENSADA RESINADA, 8 UTILIZAÇÕES. AF_12/2015","M2",38.19,114.57,null,null,0,0,""]
["S",3,"S",0,3,5,2,0,0,0,0,"","Serviço","Serviço","-","SINAPI",94964,"CONCRETO FCK = 20MPA, TRAÇO 1:2,7:3 (CIMENTO/ AREIA MÉDIA/ BRITA 1)  - PREPARO MECÂNICO COM BETONEIRA 400 L. AF_07/2016","M3",1.82,5.46,null,null,0,0,""]
["S",3,"S",0,3,5,2,0,0,{"$f":"IF(OR($C211=\"S\",$C211=0),0,MATCH(0,OFFSET($D211,1,$C211,ROW($C$459)-ROW($C211)),0))","v":0},{"$f":"IF(OR($C211=\"S\",$C211=0),0,MATCH(OFFSET($D211,0,$C211)+1,OFFSET($D211,1,$C211,ROW($C$459)-ROW($C211)),0))","v":0},"","Serviço","Serviço","-","SINAPI",92873,"LANÇAMENTO COM USO DE BALDES, ADENSAMENTO E ACABAMENTO DE CONCRETO EM ESTRUTURAS. AF_12/2015","M3",1.82,5.46,null,null,0,0,"Referência: AGETOP - 51055"]
["S",3,"S",0,3,5,2,0,0,0,0,"","Serviço","Serviço","-","SINAPI",92778,"ARMAÇÃO DE PILAR OU VIGA DE UMA ESTRUTURA CONVENCIONAL DE CONCRETO ARMADO EM UMA EDIFICAÇÃO TÉRREA OU SOBRADO UTILIZANDO AÇO CA-50 DE 10,0 MM - MONTAGEM. AF_12/2015","KG",161.82,485.46,null,null,0,0,"Referência: AGETOP - 60305"]
["S",3,"S",0,3,5,2,0,0,0,0,"","Serviço","Serviço","-","SINAPI",92775,"ARMAÇÃO DE PILAR OU VIGA DE UMA ESTRUTURA CONVENCIONAL DE CONCRETO ARMADO EM UMA EDIFICAÇÃO TÉRREA OU SOBRADO UTILIZANDO AÇO CA-60 DE 5,0 MM - MONTAGEM. AF_12/2015","KG",55.45,166.35000000000002,null,null,0,0,"Referência: AGETOP - 60314"]
[3,3,3,8,3,5,3,0,0,12,8,"","Nível 3","Nível 3","-","SINAPI",null,"VIGAS DE COBERTURA","-",null,0,null,null,0,0,""]
["S",3,"S",0,3,5,3,0,0,0,0,"","Serviço","Serviço","-","SINAPI",92464,"MONTAGEM E DESMONTAGEM DE FÔRMA DE VIGA, ESCORAMENTO METÁLICO, PÉ-DIREITO SIMPLES, EM CHAPA DE MADEIRA RESINADA, 8 UTILIZAÇÕES. AF_12/2015","M2",68.47,205.41,null,null,0,0,"Referência: AGETOP - 60204"]
["S",3,"S",0,3,5,3,0,0,0,0,"","Serviço","Serviço","-","SINAPI",94964,"CONCRETO FCK = 20MPA, TRAÇO 1:2,7:3 (CIMENTO/ AREIA MÉDIA/ BRITA 1)  - PREPARO MECÂNICO COM BETONEIRA 400 L. AF_07/2016","M3",4.08,12.24,null,null,0,0,""]
["S",3,"S",0,3,5,3,0,0,0,0,"","Serviço","Serviço","-","SINAPI",92873,"LANÇAMENTO COM USO DE BALDES, ADENSAMENTO E ACABAMENTO DE CONCRETO EM ESTRUTURAS. AF_12/2015","M3",4.08,12.24,null,null,0,0,"Referência: AGETOP - 51055"]
["S",3,"S",0,3,5,3,0,0,0,0,"","Serviço","Serviço","-","SINAPI",92777,"ARMAÇÃO DE PILAR OU VIGA DE UMA ESTRUTURA CONVENCIONAL DE CONCRETO ARMADO EM UMA EDIFICAÇÃO TÉRREA OU SOBRADO UTILIZANDO AÇO CA-50 DE 8,0 MM - MONTAGEM. AF_12/2015","KG",37.270000000000003,111.81,null,null,0,0,"Referência: AGETOP - 60304"]
["S",3,"S",0,3,5,3,0,0,0,0,"","Serviço","Serviço","-","SINAPI",92778,"ARMAÇÃO DE PILAR OU VIGA DE UMA ESTRUTURA CONVENCIONAL DE CONCRETO ARMADO EM UMA EDIFICAÇÃO TÉRREA OU SOBRADO UTILIZANDO AÇO CA-50 DE 10,0 MM - MONTAGEM. AF_12/2015","KG",159.09,477.27,null,null,0,0,"Referência: AGETOP - 60305"]
["S",3,"S",0,3,5,3,0,0,0,0,"","Serviço","Serviço","-","SINAPI",92779,"ARMAÇÃO DE PILAR OU VIGA DE UMA ESTRUTURA CONVENCIONAL DE CONCRETO ARMADO EM UMA EDIFICAÇÃO TÉRREA OU SOBRADO UTILIZANDO AÇO CA-50 DE 12,5 MM - MONTAGEM. AF_12/2015","KG",51.82,155.46,null,null,0,0,"Referência: AGETOP - 60306"]
["S",3,"S",0,3,5,3,0,0,0,0,"","Serviço","Serviço","-","SINAPI",92775,"ARMAÇÃO DE PILAR OU VIGA DE UMA ESTRUTURA CONVENCIONAL DE CONCRETO ARMADO EM UMA EDIFICAÇÃO TÉRREA OU SOBRADO UTILIZANDO AÇO CA-60 DE 5,0 MM - MONTAGEM. AF_12/2015","KG",67.27,201.81,null,null,0,0,"Referência: AGETOP - 60314"]
[3,3,3,2,3,5,4,0,0,4,2,"","Nível 3","Nível 3","-","SINAPI",null,"LAJE","-",null,0,null,null,0,0,""]
["S",3,"S",0,3,5,4,0,0,0,0,"","Serviço","Serviço","-","SINAPI","74202/1","LAJE PRE-MOLDADA P/FORRO, SOBRECARGA 100KG/M2, VAOS ATE 3,50M/E=8CM, C/LAJOTAS E CAP.C/CONC FCK=20MPA, 3CM, INTER-EIXO 38CM, C/ESCORAMENTO (REAPR.3X) E FERRAGEM NEGATIVA","M2",156.28,468.84000000000003,null,null,0,0,""]
[3,3,3,2,3,5,5,0,0,2,{"$error":"#N/A"},"","Nível 3","Nível 3","-","SINAPI",null,"OUTROS","-",null,0,null,null,0,0,""]
["S",3,"S",0,3,5,5,0,0,0,0,"","Serviço","Serviço","-","SINAPI","74022/30","ENSAIO DE RESISTENCIA A COMPRESSAO SIMPLES - CONCRETO","UN",6,18,null,null,0,0,""]
[2,2,2,25,3,6,0,0,0,68,25,"","Nível 2","Nível 2","-","SINAPI",null,"INSTALAÇÕES ELÉTRICAS","-",null,0,null,null,0,0,""]
["S",2,"S",0,3,6,0,0,0,0,0,"","Serviço","Serviço","-","SINAPI",91927,"CABO DE COBRE FLEXÍVEL ISOLADO, 2,5 MM², ANTI-CHAMA 0,6/1,0 KV, PARA CIRCUITOS TERMINAIS - FORNECIMENTO E INSTALAÇÃO. AF_12/2015","M",900,2700,null,null,0,0,"Referência: AGETOP - 70563"]
["S",2,"S",0,3,6,0,0,0,0,0,"","Serviço","Serviço","-","SINAPI",91928,"CABO DE COBRE FLEXÍVEL ISOLADO, 4 MM², ANTI-CHAMA 450/750 V, PARA CIRCUITOS TERMINAIS - FORNECIMENTO E INSTALAÇÃO. AF_12/2015","M",500,1500,null,null,0,0,"Referência: AGETOP - 70564"]
["S",2,"S",0,3,6,0,0,0,0,0,"","Serviço","Serviço","-","SINAPI",83446,"CAIXA DE PASSAGEM 30X30X40 COM TAMPA E DRENO BRITA","UN",1,3,null,null,0,0,""]
["S",2,"S",0,3,6,0,0,0,0,0,"","Serviço","Serviço","-","SINAPI",91936,"CAIXA OCTOGONAL 4\" X 4\", PVC, INSTALADA EM LAJE - FORNECIMENTO E INSTALAÇÃO. AF_12/2015","UN",15,45,null,null,0,0,""]
["S",2,"S",0,3,6,0,0,0,0,0,"","Serviço","Serviço","-","SINAPI",92867,"CAIXA RETANGULAR 4\" X 2\" ALTA (2,00 M DO PISO), METÁLICA, INSTALADA EM PAREDE - FORNECIMENTO E INSTALAÇÃO. AF_12/2015","UN",6,18,null,null,0,0,""]
["S",2,"S",0,3,6,0,0,0,0,0,"","Serviço","Serviço","-","SINAPI",92867,"CAIXA RETANGULAR 4\" X 2\" ALTA (2,00 M DO PISO), METÁLICA, INSTALADA EM PAREDE - FORNECIMENTO E INSTALAÇÃO. AF_12/2015","UN",4,12,null,null,0,0,""]
["S",2,"S",0,3,6,0,0,0,0,0,"","Serviço","Serviço","-","SINAPI",92869,"CAIXA RETANGULAR 4\" X 2\" BAIXA (0,30 M DO PISO), METÁLICA, INSTALADA EM PAREDE - FORNECIMENTO E INSTALAÇÃO. AF_12/2015","UN",9,27,null,null,0,0,""]
["S",2,"S",0,3,6,0,0,0,0,0,"","Serviço","Serviço","-","SINAPI",91914,"CURVA 90 GRAUS PARA ELETRODUTO, PVC, ROSCÁVEL, DN 25 MM (3/4\"), PARA CIRCUITOS TERMINAIS, INSTALADA EM PAREDE - FORNECIMENTO E INSTALAÇÃO. AF_12/2015","UN",6,18,null,null,0,0,""]
["S",2,"S",0,3,6,0,0,0,0,0,"","Serviço","Serviço","-","SINAPI",93655,"DISJUNTOR MONOPOLAR TIPO DIN, CORRENTE NOMINAL DE 20A - FORNECIMENTO E INSTALAÇÃO. AF_04/2016","UN",2,6,null,null,0,0,""]
["S",2,"S",0,3,6,0,0,0,0,0,"","Serviço","Serviço","-","SINAPI",93656,"DISJUNTOR MONOPOLAR TIPO DIN, CORRENTE NOMINAL DE 25A - FORNECIMENTO E INSTALAÇÃO. AF_04/2016","UN",6,18,null,null,0,0,""]
["S",2,"S",0,3,6,0,0,0,0,0,"","Serviço","Serviço","-","SINAPI",93671,"DISJUNTOR TRIPOLAR TIPO DIN, CORRENTE NOMINAL DE 32A - FORNECIMENTO E INSTALAÇÃO. AF_04/2016","UN",1,3,null,null,0,0,""]
["S",2,"S",0,3,6,0,0,0,0,0,"","Serviço","Serviço","-","SINAPI",91871,"ELETRODUTO RÍGIDO ROSCÁVEL, PVC, DN 25 MM (3/4\"), PARA CIRCUITOS TERMINAIS, INSTALADO EM PAREDE - FORNECIMENTO E INSTALAÇÃO. AF_12/2015","M",135,405,null,null,0,0,"Referência: AGETOP - 71201"]
["S",2,"S",0,3,6,0,0,0,0,0,"","Serviço","Serviço","-","SINAPI",91872,"ELETRODUTO RÍGIDO ROSCÁVEL, PVC, DN 32 MM (1\"), PARA CIRCUITOS TERMINAIS, INSTALADO EM PAREDE - FORNECIMENTO E INSTALAÇÃO. AF_12/2015","M",45,135,null,null,0,0,"Referência: AGETOP - 71202"]
[{"$f":"CHOOSE(1+LOG(1+2*(ORÇAMENTO.Nivel=\"Nível 1\")+4*(ORÇAMENTO.Nivel=\"Nível 2\")+8*(ORÇAMENTO.Nivel=\"Nível 3\")+16*(ORÇAMENTO.Nivel=\"Nível 4\")+32*(ORÇAMENTO.Nivel=\"Serviço\"),2),0,1,2,3,4,\"S\")","v":"S"},2,"S",0,3,6,0,0,{"$f":"IF(AND($C240<=4,$C240<>0),0,IF(AND($C240=\"S\",$Y240>0),OFFSET(I240,-1,0)+1,OFFSET(I240,-1,0)))","v":0},0,0,"","Serviço","Serviço","-","SINAPI",91873,"ELETRODUTO RÍGIDO ROSCÁVEL, PVC, DN 40 MM (1 1/4\"), PARA CIRCUITOS TERMINAIS, INSTALADO EM PAREDE - FORNECIMENTO E INSTALAÇÃO. AF_12/2015","M",9,27,null,null,0,0,""]
["S",2,"S",0,3,6,0,0,0,0,0,"","Serviço","Serviço","-","SINAPI",91953,"INTERRUPTOR SIMPLES (1 MÓDULO), 10A/250V, INCLUINDO SUPORTE E PLACA - FORNECIMENTO E INSTALAÇÃO. AF_12/2015","UN",4,12,null,null,0,0,""]
["S",2,"S",0,3,6,0,0,0,0,0,"","Serviço","Serviço","-","SINAPI",97610,"LÂMPADA COMPACTA DE LED 10 W, BASE E27 - FORNECIMENTO E INSTALAÇÃO. AF_11/2017","UN",45,135,null,null,0,0,""]
["S",2,"S",0,3,6,0,0,0,0,0,"","Serviço","Serviço","-","SINAPI",97591,"LUMINÁRIA TIPO PLAFON REDONDO COM VIDRO FOSCO, DE SOBREPOR, COM 2 LÂMPADAS DE 15 W - FORNECIMENTO E INSTALAÇÃO. AF_11/2017","UN",18,54,null,null,0,0,""]
["S",2,"S",0,3,6,0,0,0,0,0,"","Serviço","Serviço","-","SINAPI",97593,"LUMINÁRIA TIPO SPOT, DE SOBREPOR, COM 1 LÂMPADA DE 15 W - FORNECIMENTO E INSTALAÇÃO. AF_11/2017","UN",9,27,null,null,0,0,""]
["S",2,"S",0,3,6,0,0,0,0,0,"","Serviço","Serviço","-","SINAPI",91884,"LUVA PARA ELETRODUTO, PVC, ROSCÁVEL, DN 25 MM (3/4\"), PARA CIRCUITOS TERMINAIS, INSTALADA EM PAREDE - FORNECIMENTO E INSTALAÇÃO. AF_12/2015","UN",45,135,null,null,0,0,""]
["S",2,"S",0,3,6,0,0,0,0,0,"","Serviço","Serviço","-","SINAPI",91885,"LUVA PARA ELETRODUTO, PVC, ROSCÁVEL, DN 32 MM (1\"), PARA CIRCUITOS TERMINAIS, INSTALADA EM PAREDE - FORNECIMENTO E INSTALAÇÃO. AF_12/2015","UN",15,45,null,null,0,0,""]
["S",2,"S",0,3,6,0,0,0,0,0,"","Serviço","Serviço","-","SINAPI",91886,"LUVA PARA ELETRODUTO, PVC, ROSCÁVEL, DN 40 MM (1 1/4\"), PARA CIRCUITOS TERMINAIS, INSTALADA EM PAREDE - FORNECIMENTO E INSTALAÇÃO. AF_12/2015","UN",3,9,null,null,0,0,""]
["S",2,"S",0,3,6,0,0,0,0,0,"","Serviço","Serviço","-","SINAPI",83463,"QUADRO DE DISTRIBUICAO DE ENERGIA EM CHAPA DE ACO GALVANIZADO, PARA 12 DISJUNTORES TERMOMAGNETICOS MONOPOLARES, COM BARRAMENTO TRIFASICO E NEUTRO - FORNECIMENTO E INSTALACAO","UN",1,3,null,null,0,0,""]
["S",2,"S",0,3,6,0,0,0,0,0,"","Serviço","Serviço","-","SINAPI",91998,"TOMADA BAIXA DE EMBUTIR (1 MÓDULO), 2P+T 10 A, SEM SUPORTE E SEM PLACA - FORNECIMENTO E INSTALAÇÃO. AF_12/2015","UN",9,27,null,null,0,0,""]
["S",2,"S",0,3,6,0,0,0,0,0,"","Serviço","Serviço","-","SINAPI",91991,"TOMADA ALTA DE EMBUTIR (1 MÓDULO), 2P+T 20 A, SEM SUPORTE E SEM PLACA - FORNECIMENTO E INSTALAÇÃO. AF_12/2015","UN",6,18,null,null,0,0,""]
[2,2,2,3,3,7,0,0,0,43,3,"","Nível 2","Nível 2","-","AGETOP",null,"ALVENARIAS E DIVISÓRIAS","-",null,0,null,null,0,0,""]
[{"$f":"CHOOSE(1+LOG(1+2*(ORÇAMENTO.Nivel=\"Nível 1\")+4*(ORÇAMENTO.Nivel=\"Nível 2\")+8*(ORÇAMENTO.Nivel=\"Nível 3\")+16*(ORÇAMENTO.Nivel=\"Nível 4\")+32*(ORÇAMENTO.Nivel=\"Serviço\"),2),0,1,2,3,4,\"S\")","v":"S"},{"$f":"IF(OR(C252=\"s\",C252=0),OFFSET(B252,-1,0),C252)","v":2},{"$f":"IF(OFFSET(C252,-1,0)=\"L\",1,IF(OFFSET(C252,-1,0)=1,2,IF(OR(A252=\"s\",A252=0),\"S\",IF(AND(OFFSET(C252,-1,0)=2,A252=4),3,IF(AND(OR(OFFSET(C252,-1,0)=\"s\",OFFSET(C252,-1,0)=0),A252<>\"s\",A252>OFFSET(B252,-1,0)),OFFSET(B252,-1,0),A252)))))","v":"S"},{"$f":"IF(OR(C252=\"S\",C252=0),0,IF(ISERROR(K252),J252,SMALL(J252:K252,1)))","v":0},{"$f":"IF($C252=1,OFFSET(E252,-1,0)+1,OFFSET(E252,-1,0))","v":3},{"$f":"IF($C252=1,0,IF($C252=2,OFFSET(F252,-1,0)+1,OFFSET(F252,-1,0)))","v":7},{"$f":"IF(AND($C252<=2,$C252<>0),0,IF($C252=3,OFFSET(G252,-1,0)+1,OFFSET(G252,-1,0)))","v":0},{"$f":"IF(AND($C252<=3,$C252<>0),0,IF($C252=4,OFFSET(H252,-1,0)+1,OFFSET(H252,-1,0)))","v":0},{"$f":"IF(AND($C252<=4,$C252<>0),0,IF(AND($C252=\"S\",$Y252>0),OFFSET(I252,-1,0)+1,OFFSET(I252,-1,0)))","v":0},0,0,"","Serviço","Serviço","-","SINAPI",87503,"ALVENARIA DE VEDAÇÃO DE BLOCOS CERÂMICOS FURADOS NA HORIZONTAL DE 9X19X19CM (ESPESSURA 9CM) DE PAREDES COM ÁREA LÍQUIDA MAIOR OU IGUAL A 6M² SEM VÃOS E ARGAMASSA DE ASSENTAMENTO COM PREPARO EM BETONEIRA. AF_06/2014","M2",184.73,554.18999999999994,null,null,0,0,"Referência: AGETOP - 100201"]
["S",2,"S",0,3,7,0,0,0,0,0,"","Serviço","Serviço","-","SINAPI",93201,"FIXAÇÃO (ENCUNHAMENTO) DE ALVENARIA DE VEDAÇÃO COM ARGAMASSA APLICADA COM COLHER. AF_03/2016","M",72.900000000000006,218.70000000000002,null,null,0,0,""]
[2,2,2,2,3,8,0,0,0,40,2,"","Nível 2","Nível 2","-",null,null,"IMPERMEABILIZACAO","-",null,0,null,null,0,0]
[{"$f":"CHOOSE(1+LOG(1+2*(ORÇAMENTO.Nivel=\"Nível 1\")+4*(ORÇAMENTO.Nivel=\"Nível 2\")+8*(ORÇAMENTO.Nivel=\"Nível 3\")+16*(ORÇAMENTO.Nivel=\"Nível 4\")+32*(ORÇAMENTO.Nivel=\"Serviço\"),2),0,1,2,3,4,\"S\")","v":"S"},{"$f":"IF(OR(C255=\"s\",C255=0),OFFSET(B255,-1,0),C255)","v":2},{"$f":"IF(OFFSET(C255,-1,0)=\"L\",1,IF(OFFSET(C255,-1,0)=1,2,IF(OR(A255=\"s\",A255=0),\"S\",IF(AND(OFFSET(C255,-1,0)=2,A255=4),3,IF(AND(OR(OFFSET(C255,-1,0)=\"s\",OFFSET(C255,-1,0)=0),A255<>\"s\",A255>OFFSET(B255,-1,0)),OFFSET(B255,-1,0),A255)))))","v":"S"},{"$f":"IF(OR(C255=\"S\",C255=0),0,IF(ISERROR(K255),J255,SMALL(J255:K255,1)))","v":0},{"$f":"IF($C255=1,OFFSET(E255,-1,0)+1,OFFSET(E255,-1,0))","v":3},{"$f":"IF($C255=1,0,IF($C255=2,OFFSET(F255,-1,0)+1,OFFSET(F255,-1,0)))","v":8},{"$f":"IF(AND($C255<=2,$C255<>0),0,IF($C255=3,OFFSET(G255,-1,0)+1,OFFSET(G255,-1,0)))","v":0},{"$f":"IF(AND($C255<=3,$C255<>0),0,IF($C255=4,OFFSET(H255,-1,0)+1,OFFSET(H255,-1,0)))","v":0},{"$f":"IF(AND($C255<=4,$C255<>0),0,IF(AND($C255=\"S\",$Y255>0),OFFSET(I255,-1,0)+1,OFFSET(I255,-1,0)))","v":0},0,0,"","Serviço","Serviço","-","SINAPI","74106/1","IMPERMEABILIZACAO DE ESTRUTURAS ENTERRADAS, COM TINTA ASFALTICA, DUAS DEMAOS.","M2",72.900000000000006,218.70000000000002,null,null,0,0]
[2,2,2,2,3,9,0,0,0,38,2,"","Nível 2","Nível 2","-",null,null,"ESTRUTURAS METÁLICAS","-",null,0,null,null,0,0]
["S",2,"S",0,3,9,0,0,0,0,0,"","Serviço","Serviço","-","AGETOP",150103,"ESTRUTURA METÁLICA CONVENCIONAL EM AÇO DO TIPO USI SAC-300 COM FUNDO ANTICORROSIVO","Kg    ",3212.3,9636.9000000000015,null,null,0,0]
[2,2,2,4,3,10,0,0,0,36,4,"","Nível 2","Nível 2","-",null,null,"COBERTURAS","-",null,0,null,null,0,0]
["S",2,"S",0,3,10,0,0,0,0,0,"","Serviço","Serviço","-","SINAPI",94445,"TELHAMENTO COM TELHA CERÂMICA CAPA-CANAL, TIPO PLAN, COM ATÉ 2 ÁGUAS, INCLUSO TRANSPORTE VERTICAL. AF_06/2016","M2",235.69,707.06999999999994,null,null,0,0]
["S",2,"S",0,3,10,0,0,0,0,0,"","Serviço","Serviço","-","SINAPI",94221,"CUMEEIRA PARA TELHA CERÂMICA EMBOÇADA COM ARGAMASSA TRAÇO 1:2:9 (CIMENTO, CAL E AREIA) PARA TELHADOS COM ATÉ 2 ÁGUAS, INCLUSO TRANSPORTE VERTICAL. AF_06/2016","M",24.05,72.150000000000006,null,null,0,0]
["S",2,"S",0,3,10,0,0,0,0,0,"","Serviço","Serviço","-","SINAPI",94224,"EMBOÇAMENTO COM ARGAMASSA TRAÇO 1:2:9 (CIMENTO, CAL E AREIA). AF_06/2016","M",62.1,186.3,null,null,0,0]
[2,2,2,4,3,11,0,0,0,32,4,"","Nível 2","Nível 2","-",null,null,"ESQUADRIAS METÁLICAS","-",null,0,null,null,0,0]
["S",2,"S",0,3,11,0,0,0,0,0,"","Serviço","Serviço","-","SINAPI",94562,"JANELA DE AÇO DE CORRER, 4 FOLHAS, FIXAÇÃO COM ARGAMASSA, SEM VIDROS, PADRONIZADA. AF_07/2016","M2",14.4,43.2,null,null,0,0]
["S",2,"S",0,3,11,0,0,0,0,0,"","Serviço","Serviço","-","SINAPI",94559,"JANELA DE AÇO BASCULANTE, FIXAÇÃO COM ARGAMASSA, SEM VIDROS, PADRONIZADA. AF_07/2016","M2",7.2,21.6,null,null,0,0]
["S",2,"S",0,3,11,0,0,0,0,0,"","Serviço","Serviço","-","SINAPI","73933/4","PORTA DE FERRO DE ABRIR TIPO BARRA CHATA, COM REQUADRO E GUARNICAO COMPLETA","M2",5.04,15.120000000000001,null,null,0,0]
[2,2,2,2,3,12,0,0,0,28,2,"","Nível 2","Nível 2","-",null,null,"VIDROS","-",null,0,null,null,0,0]
["S",2,"S",0,3,12,0,0,0,0,0,"","Serviço","Serviço","-","SINAPI",72117,"VIDRO LISO COMUM TRANSPARENTE, ESPESSURA 4MM","M2",21.6,64.800000000000011,null,null,0,0]
[2,2,2,4,3,13,0,0,0,26,4,"","Nível 2","Nível 2","-",null,null,"REVESTIMENTO DE PAREDE","-",null,0,null,null,0,0]
["S",2,"S",0,3,13,0,0,0,0,0,"","Serviço","Serviço","-","SINAPI",87879,"CHAPISCO APLICADO EM ALVENARIAS E ESTRUTURAS DE CONCRETO INTERNAS, COM COLHER DE PEDREIRO.  ARGAMASSA TRAÇO 1:3 COM PREPARO EM BETONEIRA 400L. AF_06/2014","M2",369.45,1108.3499999999999,null,null,0,0,""]
[{"$f":"CHOOSE(1+LOG(1+2*(ORÇAMENTO.Nivel=\"Nível 1\")+4*(ORÇAMENTO.Nivel=\"Nível 2\")+8*(ORÇAMENTO.Nivel=\"Nível 3\")+16*(ORÇAMENTO.Nivel=\"Nível 4\")+32*(ORÇAMENTO.Nivel=\"Serviço\"),2),0,1,2,3,4,\"S\")","v":"S"},2,"S",0,3,13,0,0,{"$f":"IF(AND($C270<=4,$C270<>0),0,IF(AND($C270=\"S\",$Y270>0),OFFSET(I270,-1,0)+1,OFFSET(I270,-1,0)))","v":0},0,0,"","Serviço","Serviço","-","SINAPI",87548,"MASSA ÚNICA, PARA RECEBIMENTO DE PINTURA, EM ARGAMASSA TRAÇO 1:2:8, PREPARO MANUAL, APLICADA MANUALMENTE EM FACES INTERNAS DE PAREDES, ESPESSURA DE 10MM, COM EXECUÇÃO DE TALISCAS. AF_06/2014","M2",369.45,1108.3499999999999,null,null,0,0,"Referência: AGETOP - 200500"]
["S",2,"S",0,3,13,0,0,0,0,0,"","Serviço","Serviço","-","SINAPI",84088,"PEITORIL EM MARMORE BRANCO, LARGURA DE 15CM, ASSENTADO COM ARGAMASSA TRACO 1:4 (CIMENTO E AREIA MEDIA), PREPARO MANUAL DA ARGAMASSA","M",24,72,null,null,0,0,""]
[2,2,2,2,3,14,0,0,0,22,2,"","Nível 2","Nível 2","-",null,null,"FORROS","-",null,0,null,null,0,0,""]
["S",2,"S",0,3,14,0,0,0,0,0,"","Serviço","Serviço","-","SINAPI",87414,"APLICAÇÃO MANUAL DE GESSO DESEMPENADO (SEM TALISCAS) EM TETO DE AMBIENTES DE ÁREA MAIOR QUE 10M², ESPESSURA DE 1,0CM. AF_06/2014","M2",156.28,468.84000000000003,null,null,0,0,"Referência: AGETOP - 210515"]
[2,2,2,5,3,15,0,0,0,20,5,"","Nível 2","Nível 2","-","SINAPI",null,"REVESTIMENTO DE PISO","-",null,0,null,null,0,0,""]
["S",2,"S",0,3,15,0,0,0,{"$f":"IF(OR($C275=\"S\",$C275=0),0,MATCH(0,OFFSET($D275,1,$C275,ROW($C$459)-ROW($C275)),0))","v":0},{"$f":"IF(OR($C275=\"S\",$C275=0),0,MATCH(OFFSET($D275,0,$C275)+1,OFFSET($D275,1,$C275,ROW($C$459)-ROW($C275)),0))","v":0},"","Serviço","Serviço","-","SINAPI",95240,"LASTRO DE CONCRETO MAGRO, APLICADO EM PISOS OU RADIERS, ESPESSURA DE 3 CM. AF_07/2016","M2",228.96,686.88,null,null,0,0,""]
["S",2,"S",0,3,15,0,0,0,0,0,"","Serviço","Serviço","-","SINAPI",94992,"EXECUÇÃO DE PASSEIO (CALÇADA) OU PISO DE CONCRETO COM CONCRETO MOLDADO IN LOCO, FEITO EM OBRA, ACABAMENTO CONVENCIONAL, ESPESSURA 6 CM, ARMADO. AF_07/2016","M2",38.700000000000003,116.10000000000001,null,null,0,0,"Referência: AGETOP - 220104"]
["S",2,"S",0,3,15,0,0,0,0,0,"","Serviço","Serviço","-","SINAPI",84191,"PISO EM GRANILITE, MARMORITE OU GRANITINA ESPESSURA 8 MM, INCLUSO JUNTAS DE DILATACAO PLASTICAS","M2",187.3,561.90000000000009,null,null,0,0,"Referência: AGETOP - 221101"]
["S",2,"S",0,3,15,0,0,0,0,0,"","Serviço","Serviço","-","AGETOP",221104,"RASPAGEM E APLICAÇÃO RESINA ACRÍLICA DUAS DEMÃOS","m2    ",187.3,561.90000000000009,null,null,0,0,""]
[2,{"$f":"IF(OR(C279=\"s\",C279=0),OFFSET(B279,-1,0),C279)","v":2},{"$f":"IF(OFFSET(C279,-1,0)=\"L\",1,IF(OFFSET(C279,-1,0)=1,2,IF(OR(A279=\"s\",A279=0),\"S\",IF(AND(OFFSET(C279,-1,0)=2,A279=4),3,IF(AND(OR(OFFSET(C279,-1,0)=\"s\",OFFSET(C279,-1,0)=0),A279<>\"s\",A279>OFFSET(B279,-1,0)),OFFSET(B279,-1,0),A279)))))","v":2},{"$f":"IF(OR(C279=\"S\",C279=0),0,IF(ISERROR(K279),J279,SMALL(J279:K279,1)))","v":2},3,16,0,0,0,15,2,"","Nível 2","Nível 2","-","SINAPI",null,"MARCENARIA","-",null,0,null,null,0,0,""]
["S",2,"S",0,3,16,0,0,0,0,0,"","Serviço","Serviço","-","AGETOP",240106,"BATE CARTEIRA ENVERNIZADO E ASSENT. 2,5 X 12 CM","M     ",63.9,191.7,null,null,0,0,""]
[2,2,2,10,3,17,0,0,0,13,10,"","Nível 2","Nível 2","-","SINAPI",null,"PINTURA","-",null,0,null,null,0,0,""]
["S",2,"S",0,{"$f":"IF($C282=1,OFFSET(E282,-1,0)+1,OFFSET(E282,-1,0))","v":3},{"$f":"IF($C282=1,0,IF($C282=2,OFFSET(F282,-1,0)+1,OFFSET(F282,-1,0)))","v":17},{"$f":"IF(AND($C282<=2,$C282<>0),0,IF($C282=3,OFFSET(G282,-1,0)+1,OFFSET(G282,-1,0)))","v":0},{"$f":"IF(AND($C282<=3,$C282<>0),0,IF($C282=4,OFFSET(H282,-1,0)+1,OFFSET(H282,-1,0)))","v":0},0,0,0,"","Serviço","Serviço","-","SINAPI","74145/1","PINTURA ESMALTE FOSCO, DUAS DEMAOS, SOBRE SUPERFICIE METALICA, INCLUSO UMA DEMAO DE FUNDO ANTICORROSIVO. UTILIZACAO DE REVOLVER ( AR-COMPRIMIDO).","M2",235.69,707.06999999999994,null,null,0,0,"Referência: AGETOP - 261609"]
["S",2,"S",0,3,17,0,0,0,0,0,"","Serviço","Serviço","-","SINAPI",88423,"APLICAÇÃO MANUAL DE PINTURA COM TINTA TEXTURIZADA ACRÍLICA EM PAREDES EXTERNAS DE CASAS, UMA COR. AF_06/2014","M2",120.24,360.71999999999997,null,null,0,0,"Referência: AGETOP - 260601"]
["S",2,"S",0,3,17,0,0,0,0,0,"","Serviço","Serviço","-","SINAPI",88489,"APLICAÇÃO MANUAL DE PINTURA COM TINTA LÁTEX ACRÍLICA EM PAREDES, DUAS DEMÃOS. AF_06/2014","M2",124.94999999999996,374.84999999999991,null,null,0,0,"Referência: AGETOP - 261001"]
["S",2,"S",0,3,17,0,0,0,0,0,"","Serviço","Serviço","-","SINAPI",88497,"APLICAÇÃO E LIXAMENTO DE MASSA LÁTEX EM PAREDES, DUAS DEMÃOS. AF_06/2014","M2",258.88,776.64,null,null,0,0,"Referência: AGETOP - 261300"]
["S",2,"S",0,3,17,0,0,0,0,0,"","Serviço","Serviço","-","AGETOP",261550,"PINT.ESMALTE SINT.PAREDES - 2 DEM.C/SELADOR","m2    ",133.93,401.79,null,null,0,0,""]
["S",2,"S",0,3,17,0,0,0,0,0,"","Serviço","Serviço","-","SINAPI",88496,"APLICAÇÃO E LIXAMENTO DE MASSA LÁTEX EM TETO, DUAS DEMÃOS. AF_06/2014","M2",145.53,436.59000000000003,null,null,0,0,"Referência: AGETOP - 261300"]
["S",2,"S",0,3,17,0,0,0,0,0,"","Serviço","Serviço","-","SINAPI",88488,"APLICAÇÃO MANUAL DE PINTURA COM TINTA LÁTEX ACRÍLICA EM TETO, DUAS DEMÃOS. AF_06/2014","M2",145.53,436.59000000000003,null,null,0,0,"Referência: AGETOP - 261001"]
["S",2,"S",0,3,17,0,0,0,0,0,"","Serviço","Serviço","-","SINAPI","74145/1","PINTURA ESMALTE FOSCO, DUAS DEMAOS, SOBRE SUPERFICIE METALICA, INCLUSO UMA DEMAO DE FUNDO ANTICORROSIVO. UTILIZACAO DE REVOLVER ( AR-COMPRIMIDO).","M2",53.28,159.84,null,null,0,0,"Referência: AGETOP - 261602"]
["S",2,"S",0,3,17,0,0,0,0,0,"","Serviço","Serviço","-","AGETOP",261623,"LETREIRO PEQ.PORTE A PINCEL EM PAREDE E PORTAS","m2    ",0.95,2.8499999999999996,null,null,0,0,""]
[2,2,2,3,3,18,0,0,0,3,164,"","Nível 2","Nível 2","-","SINAPI",null,"DIVERSOS","-",null,0,null,null,0,0,""]
["S",2,"S",0,3,18,0,0,0,0,0,"","Serviço","Serviço","-","AGETOP",271210,"QUADRO DE GIZ EMBOÇO/PINTURA COMPLETO","m2    ",15.12,45.36,null,null,0,0,""]
[{"$f":"CHOOSE(1+LOG(1+2*(ORÇAMENTO.Nivel=\"Nível 1\")+4*(ORÇAMENTO.Nivel=\"Nível 2\")+8*(ORÇAMENTO.Nivel=\"Nível 3\")+16*(ORÇAMENTO.Nivel=\"Nível 4\")+32*(ORÇAMENTO.Nivel=\"Serviço\"),2),0,1,2,3,4,\"S\")","v":"S"},{"$f":"IF(OR(C293=\"s\",C293=0),OFFSET(B293,-1,0),C293)","v":2},{"$f":"IF(OFFSET(C293,-1,0)=\"L\",1,IF(OFFSET(C293,-1,0)=1,2,IF(OR(A293=\"s\",A293=0),\"S\",IF(AND(OFFSET(C293,-1,0)=2,A293=4),3,IF(AND(OR(OFFSET(C293,-1,0)=\"s\",OFFSET(C293,-1,0)=0),A293<>\"s\",A293>OFFSET(B293,-1,0)),OFFSET(B293,-1,0),A293)))))","v":"S"},{"$f":"IF(OR(C293=\"S\",C293=0),0,IF(ISERROR(K293),J293,SMALL(J293:K293,1)))","v":0},{"$f":"IF($C293=1,OFFSET(E293,-1,0)+1,OFFSET(E293,-1,0))","v":3},{"$f":"IF($C293=1,0,IF($C293=2,OFFSET(F293,-1,0)+1,OFFSET(F293,-1,0)))","v":18},{"$f":"IF(AND($C293<=2,$C293<>0),0,IF($C293=3,OFFSET(G293,-1,0)+1,OFFSET(G293,-1,0)))","v":0},{"$f":"IF(AND($C293<=3,$C293<>0),0,IF($C293=4,OFFSET(H293,-1,0)+1,OFFSET(H293,-1,0)))","v":0},{"$f":"IF(AND($C293<=4,$C293<>0),0,IF(AND($C293=\"S\",$Y293>0),OFFSET(I293,-1,0)+1,OFFSET(I293,-1,0)))","v":0},0,0,"","Serviço","Serviço","-","AGETOP",270501,"LIMPEZA FINAL DE OBRA - (OBRAS CIVIS)","m2    ",190.26,570.78,null,null,0,0,""]
[{"$f":"CHOOSE(1+LOG(1+2*(ORÇAMENTO.Nivel=\"Nível 1\")+4*(ORÇAMENTO.Nivel=\"Nível 2\")+8*(ORÇAMENTO.Nivel=\"Nível 3\")+16*(ORÇAMENTO.Nivel=\"Nível 4\")+32*(ORÇAMENTO.Nivel=\"Serviço\"),2),0,1,2,3,4,\"S\")","v":1},{"$f":"IF(OR(C294=\"s\",C294=0),OFFSET(B294,-1,0),C294)","v":1},{"$f":"IF(OFFSET(C294,-1,0)=\"L\",1,IF(OFFSET(C294,-1,0)=1,2,IF(OR(A294=\"s\",A294=0),\"S\",IF(AND(OFFSET(C294,-1,0)=2,A294=4),3,IF(AND(OR(OFFSET(C294,-1,0)=\"s\",OFFSET(C294,-1,0)=0),A294<>\"s\",A294>OFFSET(B294,-1,0)),OFFSET(B294,-1,0),A294)))))","v":1},{"$f":"IF(OR(C294=\"S\",C294=0),0,IF(ISERROR(K294),J294,SMALL(J294:K294,1)))","v":165},{"$f":"IF($C294=1,OFFSET(E294,-1,0)+1,OFFSET(E294,-1,0))","v":4},{"$f":"IF($C294=1,0,IF($C294=2,OFFSET(F294,-1,0)+1,OFFSET(F294,-1,0)))","v":0},{"$f":"IF(AND($C294<=2,$C294<>0),0,IF($C294=3,OFFSET(G294,-1,0)+1,OFFSET(G294,-1,0)))","v":0},{"$f":"IF(AND($C294<=3,$C294<>0),0,IF($C294=4,OFFSET(H294,-1,0)+1,OFFSET(H294,-1,0)))","v":0},{"$f":"IF(AND($C294<=4,$C294<>0),0,IF(AND($C294=\"S\",$Y294>0),OFFSET(I294,-1,0)+1,OFFSET(I294,-1,0)))","v":0},165,{"$error":"#N/A"},"F","Nível 1","Nível 1","4.",null,null,"BLOCO SANITÁRIO SEDUC13","-",1,3,null,null,0,0,""]
[2,2,2,2,4,1,0,0,0,164,2,"","Nível 2","Nível 2","-",null,null,"SERVIÇOS PRELIMINARES","-",null,null,null,null,0,0,""]
["S",2,"S",0,4,1,0,0,0,0,0,"","Serviço","Serviço","-","SINAPI",99059,"LOCACAO CONVENCIONAL DE OBRA, UTILIZANDO GABARITO DE TÁBUAS CORRIDAS PONTALETADAS A CADA 2,00M -  2 UTILIZAÇÕES. AF_10/2018","M",48.43,48.43,null,null,0,0,""]
[2,2,2,3,4,2,0,0,0,162,3,"","Nível 2","Nível 2","-",null,null,"TRANSPORTES","-",null,0,null,null,0,0,""]
["S",2,"S",0,4,2,0,0,0,0,0,"","Serviço","Serviço","-","SINAPI",72900,"TRANSPORTE DE ENTULHO COM CAMINHAO BASCULANTE 6 M3, RODOVIA PAVIMENTADA, DMT 0,5 A 1,0 KM","M3",18,18,null,null,0,0,""]
["S",2,"S",0,4,2,0,0,0,0,0,"","Serviço","Serviço","-","SINAPI",72897,"CARGA MANUAL DE ENTULHO EM CAMINHAO BASCULANTE 6 M3","M3",18,18,null,null,0,0,""]
[2,2,2,3,4,3,0,0,0,159,3,"","Nível 2","Nível 2","-",null,null,"SERVIÇO EM TERRA","-",null,0,null,null,0,0,""]
["S",2,"S",0,4,3,0,0,0,0,0,"","Serviço","Serviço","-","SINAPI",79472,"REGULARIZACAO DE SUPERFICIES EM TERRA COM MOTONIVELADORA","M2",48.43,48.43,null,null,0,0,""]
["S",2,"S",0,4,3,0,0,0,0,0,"","Serviço","Serviço","-","SINAPI","74005/1","COMPACTACAO MECANICA, SEM CONTROLE DO GC (C/COMPACTADOR PLACA 400 KG)","M3",9.69,9.69,null,null,0,0,"Referência: AGETOP - 41009"]
[2,2,2,10,4,4,0,0,0,156,10,"","Nível 2","Nível 2","-",null,null,"FUNDAÇÕES E SONDAGENS","-",null,0,null,null,0,0,""]
["S",2,"S",0,4,4,0,0,0,0,0,"","Serviço","Serviço","-","SINAPI",98230,"ESTACA BROCA DE CONCRETO, DIÂMETRO DE 30 CM, PROFUNDIDADE DE ATÉ 3 M, ESCAVAÇÃO MANUAL COM TRADO CONCHA, NÃO ARMADA. AF_03/2018","M",18,18,null,null,0,0,"Referência: AGETOP - 50302"]
["S",2,"S",0,4,4,0,0,0,0,0,"","Serviço","Serviço","-","SINAPI",96522,"ESCAVAÇÃO MANUAL PARA BLOCO DE COROAMENTO OU SAPATA, SEM PREVISÃO DE FÔRMA. AF_06/2017","M3",10.16,10.16,null,null,0,0,"Referência: AGETOP - 50901"]
["S",2,"S",0,4,4,0,0,0,0,0,"","Serviço","Serviço","-","SINAPI",93382,"REATERRO MANUAL DE VALAS COM COMPACTAÇÃO MECANIZADA. AF_04/2016","M3",7.44,7.44,null,null,0,0,"Referência: AGETOP - 50905"]
[{"$f":"CHOOSE(1+LOG(1+2*(ORÇAMENTO.Nivel=\"Nível 1\")+4*(ORÇAMENTO.Nivel=\"Nível 2\")+8*(ORÇAMENTO.Nivel=\"Nível 3\")+16*(ORÇAMENTO.Nivel=\"Nível 4\")+32*(ORÇAMENTO.Nivel=\"Serviço\"),2),0,1,2,3,4,\"S\")","v":"S"},2,"S",0,4,4,0,0,{"$f":"IF(AND($C307<=4,$C307<>0),0,IF(AND($C307=\"S\",$Y307>0),OFFSET(I307,-1,0)+1,OFFSET(I307,-1,0)))","v":0},0,0,"","Serviço","Serviço","-","SINAPI",94964,"CONCRETO FCK = 20MPA, TRAÇO 1:2,7:3 (CIMENTO/ AREIA MÉDIA/ BRITA 1)  - PREPARO MECÂNICO COM BETONEIRA 400 L. AF_07/2016","M3",2.7199999999999998,2.7199999999999998,null,null,0,0,""]
["S",2,"S",0,4,4,0,0,0,0,0,"","Serviço","Serviço","-","SINAPI","74157/4","LANCAMENTO/APLICACAO MANUAL DE CONCRETO EM FUNDACOES","M3",2.7199999999999998,2.7199999999999998,null,null,0,0,"Referência: AGETOP - 51060"]
["S",2,"S",0,4,4,0,0,0,0,0,"","Serviço","Serviço","-","SINAPI",94103,"LASTRO DE VALA COM PREPARO DE FUNDO, LARGURA MENOR QUE 1,5 M, COM CAMADA DE BRITA, LANÇAMENTO MANUAL, EM LOCAL COM NÍVEL BAIXO DE INTERFERÊNCIA. AF_06/2016","M3",0.78,0.78,null,null,0,0,"Referência: AGETOP - 51027"]
["S",2,"S",0,4,4,0,0,0,0,0,"","Serviço","Serviço","-","SINAPI",96544,"ARMAÇÃO DE BLOCO, VIGA BALDRAME OU SAPATA UTILIZANDO AÇO CA-50 DE 6,3 MM - MONTAGEM. AF_06/2017","KG",33.549999999999997,33.549999999999997,null,null,0,0,"Referência: AGETOP - 52003"]
["S",2,"S",0,4,4,0,0,0,0,0,"","Serviço","Serviço","-","SINAPI",96545,"ARMAÇÃO DE BLOCO, VIGA BALDRAME OU SAPATA UTILIZANDO AÇO CA-50 DE 8 MM - MONTAGEM. AF_06/2017","KG",21.27,21.27,null,null,0,0,"Referência: AGETOP - 52004"]
["S",2,"S",0,4,4,0,0,0,0,0,"","Serviço","Serviço","-","SINAPI",96543,"ARMAÇÃO DE BLOCO, VIGA BALDRAME E SAPATA UTILIZANDO AÇO CA-60 DE 5 MM - MONTAGEM. AF_06/2017","KG",10.91,10.91,null,null,0,0,"Referência: AGETOP - 52014"]
[2,2,2,23,4,5,0,0,0,146,23,"","Nível 2","Nível 2","-",null,null,"ESTRUTURA","-",null,0,null,null,0,0,""]
[3,3,3,7,4,5,1,0,0,22,7,"","Nível 3","Nível 3","-",null,null,"VIGAS BALDRAMES","-",null,0,null,null,0,0,""]
["S",3,"S",0,4,5,1,0,0,0,0,"","Serviço","Serviço","-","SINAPI",96536,"FABRICAÇÃO, MONTAGEM E DESMONTAGEM DE FÔRMA PARA VIGA BALDRAME, EM MADEIRA SERRADA, E=25 MM, 4 UTILIZAÇÕES. AF_06/2017","M2",36.130000000000003,36.130000000000003,null,null,0,0,"Referência: AGETOP - 60191"]
["S",3,"S",0,4,5,1,0,0,0,0,"","Serviço","Serviço","-","SINAPI",96545,"ARMAÇÃO DE BLOCO, VIGA BALDRAME OU SAPATA UTILIZANDO AÇO CA-50 DE 8 MM - MONTAGEM. AF_06/2017","KG",48.41,48.41,null,null,0,0,"Referência: AGETOP - 52004"]
["S",3,"S",0,4,5,1,0,0,0,0,"","Serviço","Serviço","-","SINAPI",96546,"ARMAÇÃO DE BLOCO, VIGA BALDRAME OU SAPATA UTILIZANDO AÇO CA-50 DE 10 MM - MONTAGEM. AF_06/2017","KG",48.09,48.09,null,null,0,0,"Referência: AGETOP - 52005"]
["S",3,"S",0,4,5,1,0,0,0,0,"","Serviço","Serviço","-","SINAPI",96543,"ARMAÇÃO DE BLOCO, VIGA BALDRAME E SAPATA UTILIZANDO AÇO CA-60 DE 5 MM - MONTAGEM. AF_06/2017","KG",40.700000000000003,40.700000000000003,null,null,0,0,"Referência: AGETOP - 52014"]
["S",3,"S",0,4,5,1,0,0,0,0,"","Serviço","Serviço","-","SINAPI",94964,"CONCRETO FCK = 20MPA, TRAÇO 1:2,7:3 (CIMENTO/ AREIA MÉDIA/ BRITA 1)  - PREPARO MECÂNICO COM BETONEIRA 400 L. AF_07/2016","M3",2.17,2.17,null,null,0,0,""]
["S",3,"S",0,4,5,1,0,0,0,0,"","Serviço","Serviço","-","SINAPI",92873,"LANÇAMENTO COM USO DE BALDES, ADENSAMENTO E ACABAMENTO DE CONCRETO EM ESTRUTURAS. AF_12/2015","M3",2.17,2.17,null,null,0,0,"Referência: AGETOP - 51055"]
[3,3,3,6,4,5,2,0,0,15,6,"","Nível 3","Nível 3","-",null,null,"PILARES","-",null,0,null,null,0,0,""]
["S",3,"S",0,4,5,2,0,0,0,0,"","Serviço","Serviço","-","SINAPI",92418,"MONTAGEM E DESMONTAGEM DE FÔRMA DE PILARES RETANGULARES E ESTRUTURAS SIMILARES COM ÁREA MÉDIA DAS SEÇÕES MENOR OU IGUAL A 0,25 M², PÉ-DIREITO SIMPLES, EM CHAPA DE MADEIRA COMPENSADA RESINADA, 4 UTILIZAÇÕES. AF_12/2015","M2",38.22,38.22,null,null,0,0,"Referência: AGETOP - 60209"]
["S",3,"S",0,4,5,2,0,0,0,0,"","Serviço","Serviço","-","SINAPI",92778,"ARMAÇÃO DE PILAR OU VIGA DE UMA ESTRUTURA CONVENCIONAL DE CONCRETO ARMADO EM UMA EDIFICAÇÃO TÉRREA OU SOBRADO UTILIZANDO AÇO CA-50 DE 10,0 MM - MONTAGEM. AF_12/2015","KG",172.36,172.36,null,null,0,0,"Referência: AGETOP - 52005"]
["S",3,"S",0,4,5,2,0,0,0,0,"","Serviço","Serviço","-","SINAPI",92775,"ARMAÇÃO DE PILAR OU VIGA DE UMA ESTRUTURA CONVENCIONAL DE CONCRETO ARMADO EM UMA EDIFICAÇÃO TÉRREA OU SOBRADO UTILIZANDO AÇO CA-60 DE 5,0 MM - MONTAGEM. AF_12/2015","KG",59.18,59.18,null,null,0,0,"Referência: AGETOP - 52014"]
["S",3,"S",0,4,5,2,0,0,0,0,"","Serviço","Serviço","-","SINAPI",94964,"CONCRETO FCK = 20MPA, TRAÇO 1:2,7:3 (CIMENTO/ AREIA MÉDIA/ BRITA 1)  - PREPARO MECÂNICO COM BETONEIRA 400 L. AF_07/2016","M3",1.91,1.91,null,null,0,0,""]
["S",3,"S",0,4,5,2,0,0,0,0,"","Serviço","Serviço","-","SINAPI",92873,"LANÇAMENTO COM USO DE BALDES, ADENSAMENTO E ACABAMENTO DE CONCRETO EM ESTRUTURAS. AF_12/2015","M3",1.91,1.91,null,null,0,0,"Referência: AGETOP - 51055"]
[3,3,3,7,4,5,3,0,0,9,7,"","Nível 3","Nível 3","-","AGETOP",null,"VIGAS","-",null,0,null,null,0,0,""]
["S",3,"S",0,4,5,3,0,0,0,0,"","Serviço","Serviço","-","SINAPI",92475,"MONTAGEM E DESMONTAGEM DE FÔRMA DE VIGA, ESCORAMENTO COM GARFO DE MADEIRA, PÉ-DIREITO SIMPLES, EM CHAPA DE MADEIRA PLASTIFICADA, 14 UTILIZAÇÕES. AF_12/2015","M2",36.130000000000003,36.130000000000003,null,null,0,0,"Referência: AGETOP - 60209"]
["S",3,"S",0,4,5,3,0,0,0,0,"","Serviço","Serviço","-","SINAPI",92777,"ARMAÇÃO DE PILAR OU VIGA DE UMA ESTRUTURA CONVENCIONAL DE CONCRETO ARMADO EM UMA EDIFICAÇÃO TÉRREA OU SOBRADO UTILIZANDO AÇO CA-50 DE 8,0 MM - MONTAGEM. AF_12/2015","KG",48.41,48.41,null,null,0,0,"Referência: AGETOP - 52004"]
["S",3,"S",0,4,5,3,0,0,0,0,"","Serviço","Serviço","-","SINAPI",92778,"ARMAÇÃO DE PILAR OU VIGA DE UMA ESTRUTURA CONVENCIONAL DE CONCRETO ARMADO EM UMA EDIFICAÇÃO TÉRREA OU SOBRADO UTILIZANDO AÇO CA-50 DE 10,0 MM - MONTAGEM. AF_12/2015","KG",48.09,48.09,null,null,0,0,"Referência: AGETOP - 52005"]
["S",3,"S",0,4,5,3,0,0,0,0,"","Serviço","Serviço","-","SINAPI",92775,"ARMAÇÃO DE PILAR OU VIGA DE UMA ESTRUTURA CONVENCIONAL DE CONCRETO ARMADO EM UMA EDIFICAÇÃO TÉRREA OU SOBRADO UTILIZANDO AÇO CA-60 DE 5,0 MM - MONTAGEM. AF_12/2015","KG",40.700000000000003,40.700000000000003,null,null,0,0,"Referência: AGETOP - 52014"]
["S",3,"S",0,4,5,3,0,0,0,0,"","Serviço","Serviço","-","SINAPI",94964,"CONCRETO FCK = 20MPA, TRAÇO 1:2,7:3 (CIMENTO/ AREIA MÉDIA/ BRITA 1)  - PREPARO MECÂNICO COM BETONEIRA 400 L. AF_07/2016","M3",2.17,2.17,null,null,0,0,""]
["S",3,"S",0,4,5,3,0,0,0,0,"","Serviço","Serviço","-","SINAPI",92873,"LANÇAMENTO COM USO DE BALDES, ADENSAMENTO E ACABAMENTO DE CONCRETO EM ESTRUTURAS. AF_12/2015","M3",2.17,2.17,null,null,0,0,"Referência: AGETOP - 51055"]
[3,3,3,2,4,5,4,0,0,2,{"$error":"#N/A"},"","Nível 3","Nível 3","-",null,null,"LAJE","-",null,0,null,null,0,0,""]
["S",3,"S",0,4,5,4,0,0,0,0,"","Serviço","Serviço","-","SINAPI","74202/1","LAJE PRE-MOLDADA P/FORRO, SOBRECARGA 100KG/M2, VAOS ATE 3,50M/E=8CM, C/LAJOTAS E CAP.C/CONC FCK=20MPA, 3CM, INTER-EIXO 38CM, C/ESCORAMENTO (REAPR.3X) E FERRAGEM NEGATIVA","M2",25.2,25.2,null,null,0,0,""]
[2,2,2,24,4,6,0,0,0,123,24,"","Nível 2","Nível 2","-",null,null,"INSTALAÇÕES ELÉTRICAS","-",null,0,null,null,0,0,""]
["S",2,"S",0,4,6,0,0,0,0,0,"","Serviço","Serviço","-","SINAPI",91182,"FIXAÇÃO DE TUBOS HORIZONTAIS DE PPR DIÂMETROS MENORES OU IGUAIS A 40 MM COM ABRAÇADEIRA METÁLICA FLEXÍVEL 18 MM, FIXADA DIRETAMENTE NA LAJE. AF_05/2015","M",10,10,null,null,0,0,""]
["S",2,"S",0,4,6,0,0,0,0,0,"","Serviço","Serviço","-","SINAPI",95541,"FIXAÇÃO UTILIZANDO PARAFUSO E BUCHA DE NYLON, SOMENTE MÃO DE OBRA. AF_10/2016","UN",24,24,null,null,0,0,""]
["S",2,"S",0,4,6,0,0,0,{"$f":"IF(OR($C339=\"S\",$C339=0),0,MATCH(0,OFFSET($D339,1,$C339,ROW($C$459)-ROW($C339)),0))","v":0},{"$f":"IF(OR($C339=\"S\",$C339=0),0,MATCH(OFFSET($D339,0,$C339)+1,OFFSET($D339,1,$C339,ROW($C$459)-ROW($C339)),0))","v":0},"","Serviço","Serviço","-","SINAPI",91927,"CABO DE COBRE FLEXÍVEL ISOLADO, 2,5 MM², ANTI-CHAMA 0,6/1,0 KV, PARA CIRCUITOS TERMINAIS - FORNECIMENTO E INSTALAÇÃO. AF_12/2015","M",100,100,null,null,0,0,"Referência: AGETOP - 70563"]
["S",2,"S",0,4,6,0,0,0,0,0,"","Serviço","Serviço","-","SINAPI",91931,"CABO DE COBRE FLEXÍVEL ISOLADO, 6 MM², ANTI-CHAMA 0,6/1,0 KV, PARA CIRCUITOS TERMINAIS - FORNECIMENTO E INSTALAÇÃO. AF_12/2015","M",20,20,null,null,0,0,"Referência: AGETOP - 70565"]
["S",2,"S",0,4,6,0,0,0,0,0,"","Serviço","Serviço","-","SINAPI",92868,"CAIXA RETANGULAR 4\" X 2\" MÉDIA (1,30 M DO PISO), METÁLICA, INSTALADA EM PAREDE - FORNECIMENTO E INSTALAÇÃO. AF_12/2015","UN",5,5,null,null,0,0,""]
["S",2,"S",0,4,6,0,0,0,0,0,"","Serviço","Serviço","-","SINAPI",92865,"CAIXA OCTOGONAL 4\" X 4\", METÁLICA, INSTALADA EM LAJE - FORNECIMENTO E INSTALAÇÃO. AF_12/2015","UN",7,7,null,null,0,0,""]
["S",2,"S",0,4,6,0,0,0,0,0,"","Serviço","Serviço","-","SINAPI",83446,"CAIXA DE PASSAGEM 30X30X40 COM TAMPA E DRENO BRITA","UN",1,1,null,null,0,0,""]
["S",2,"S",0,4,6,0,0,0,0,0,"","Serviço","Serviço","-","SINAPI",91914,"CURVA 90 GRAUS PARA ELETRODUTO, PVC, ROSCÁVEL, DN 25 MM (3/4\"), PARA CIRCUITOS TERMINAIS, INSTALADA EM PAREDE - FORNECIMENTO E INSTALAÇÃO. AF_12/2015","UN",7,7,null,null,0,0,""]
["S",2,"S",0,4,6,0,0,0,0,0,"","Serviço","Serviço","-","SINAPI",91917,"CURVA 90 GRAUS PARA ELETRODUTO, PVC, ROSCÁVEL, DN 32 MM (1\"), PARA CIRCUITOS TERMINAIS, INSTALADA EM PAREDE - FORNECIMENTO E INSTALAÇÃO. AF_12/2015","UN",3,3,null,null,0,0,""]
["S",2,"S",0,4,6,0,0,0,0,0,"","Serviço","Serviço","-","SINAPI",93358,"ESCAVAÇÃO MANUAL DE VALA COM PROFUNDIDADE MENOR OU IGUAL A 1,30 M. AF_03/2016","M3",0.51,0.51,null,null,0,0,""]
["S",2,"S",0,4,6,0,0,0,0,0,"","Serviço","Serviço","-","SINAPI",93654,"DISJUNTOR MONOPOLAR TIPO DIN, CORRENTE NOMINAL DE 16A - FORNECIMENTO E INSTALAÇÃO. AF_04/2016","UN",1,1,null,null,0,0,""]
["S",2,"S",0,4,6,0,0,0,0,0,"","Serviço","Serviço","-","SINAPI",93657,"DISJUNTOR MONOPOLAR TIPO DIN, CORRENTE NOMINAL DE 32A - FORNECIMENTO E INSTALAÇÃO. AF_04/2016","UN",1,1,null,null,0,0,""]
["S",2,"S",0,4,6,0,0,0,0,0,"","Serviço","Serviço","-","SINAPI",93671,"DISJUNTOR TRIPOLAR TIPO DIN, CORRENTE NOMINAL DE 32A - FORNECIMENTO E INSTALAÇÃO. AF_04/2016","UN",1,1,null,null,0,0,""]
["S",2,"S",0,4,6,0,0,0,0,0,"","Serviço","Serviço","-","SINAPI",91871,"ELETRODUTO RÍGIDO ROSCÁVEL, PVC, DN 25 MM (3/4\"), PARA CIRCUITOS TERMINAIS, INSTALADO EM PAREDE - FORNECIMENTO E INSTALAÇÃO. AF_12/2015","M",30,30,null,null,0,0,"Referência: AGETOP - 71201"]
["S",2,"S",0,4,6,0,0,0,0,0,"","Serviço","Serviço","-","SINAPI",91872,"ELETRODUTO RÍGIDO ROSCÁVEL, PVC, DN 32 MM (1\"), PARA CIRCUITOS TERMINAIS, INSTALADO EM PAREDE - FORNECIMENTO E INSTALAÇÃO. AF_12/2015","M",6,6,null,null,0,0,"Referência: AGETOP - 71202"]
["S",2,"S",0,4,6,0,0,0,0,0,"","Serviço","Serviço","-","SINAPI",91953,"INTERRUPTOR SIMPLES (1 MÓDULO), 10A/250V, INCLUINDO SUPORTE E PLACA - FORNECIMENTO E INSTALAÇÃO. AF_12/2015","UN",4,4,null,null,0,0,""]
["S",2,"S",0,4,6,0,0,0,0,0,"","Serviço","Serviço","-","AGETOP",71450,"INTERRUPTOR DIFERENCIAL RESIDUAL (D.R.) BIPOLAR DE 25A-30mA","Un    ",1,1,null,null,0,0,""]
["S",2,"S",0,4,6,0,0,0,0,0,"","Serviço","Serviço","-","SINAPI",97585,"LUMINÁRIA TIPO CALHA, DE SOBREPOR, COM 2 LÂMPADAS TUBULARES DE 18 W - FORNECIMENTO E INSTALAÇÃO. AF_11/2017","UN",5,5,null,null,0,0,""]
["S",2,"S",0,4,6,0,0,0,0,0,"","Serviço","Serviço","-","SINAPI",97586,"LUMINÁRIA TIPO CALHA, DE SOBREPOR, COM 2 LÂMPADAS TUBULARES DE 36 W - FORNECIMENTO E INSTALAÇÃO. AF_11/2017","UN",2,2,null,null,0,0,""]
["S",2,"S",0,4,6,0,0,0,0,0,"","Serviço","Serviço","-","SINAPI",91884,"LUVA PARA ELETRODUTO, PVC, ROSCÁVEL, DN 25 MM (3/4\"), PARA CIRCUITOS TERMINAIS, INSTALADA EM PAREDE - FORNECIMENTO E INSTALAÇÃO. AF_12/2015","UN",10,10,null,null,0,0,""]
["S",2,"S",0,4,6,0,0,0,0,0,"","Serviço","Serviço","-","SINAPI",91885,"LUVA PARA ELETRODUTO, PVC, ROSCÁVEL, DN 32 MM (1\"), PARA CIRCUITOS TERMINAIS, INSTALADA EM PAREDE - FORNECIMENTO E INSTALAÇÃO. AF_12/2015","UN",2,2,null,null,0,0,""]
["S",2,"S",0,4,6,0,0,0,0,0,"","Serviço","Serviço","-","SINAPI",83463,"QUADRO DE DISTRIBUICAO DE ENERGIA EM CHAPA DE ACO GALVANIZADO, PARA 12 DISJUNTORES TERMOMAGNETICOS MONOPOLARES, COM BARRAMENTO TRIFASICO E NEUTRO - FORNECIMENTO E INSTALACAO","UN",1,1,null,null,0,0,""]
["S",2,"S",0,4,6,0,0,0,0,0,"","Serviço","Serviço","-","SINAPI",91993,"TOMADA ALTA DE EMBUTIR (1 MÓDULO), 2P+T 20 A, INCLUINDO SUPORTE E PLACA - FORNECIMENTO E INSTALAÇÃO. AF_12/2015","UN",1,1,null,null,0,0,""]
[2,2,2,56,4,7,0,0,0,99,56,"","Nível 2","Nível 2","-",null,null,"INSTALAÇÕES HIDROSSANITÁRIAS","-",null,0,null,null,0,0,""]
[3,3,3,24,4,7,1,0,0,55,24,"","Nível 3","Nível 3","-",null,null,"PEÇAS E ACESSÓRIOS","-",null,0,null,null,0,0,""]
["S",3,"S",0,4,7,1,0,0,0,0,"","Serviço","Serviço","-","SINAPI",95470,"VASO SANITARIO SIFONADO CONVENCIONAL COM LOUÇA BRANCA, INCLUSO CONJUNTO DE LIGAÇÃO PARA BACIA SANITÁRIA AJUSTÁVEL - FORNECIMENTO E INSTALAÇÃO. AF_10/2016","UN",7,7,null,null,0,0,""]
[{"$f":"CHOOSE(1+LOG(1+2*(ORÇAMENTO.Nivel=\"Nível 1\")+4*(ORÇAMENTO.Nivel=\"Nível 2\")+8*(ORÇAMENTO.Nivel=\"Nível 3\")+16*(ORÇAMENTO.Nivel=\"Nível 4\")+32*(ORÇAMENTO.Nivel=\"Serviço\"),2),0,1,2,3,4,\"S\")","v":"S"},3,"S",0,4,7,1,0,{"$f":"IF(AND($C363<=4,$C363<>0),0,IF(AND($C363=\"S\",$Y363>0),OFFSET(I363,-1,0)+1,OFFSET(I363,-1,0)))","v":0},0,0,"","Serviço","Serviço","-","SINAPI",40729,"VALVULA DESCARGA 1.1/2\" COM REGISTRO, ACABAMENTO EM METAL CROMADO - FORNECIMENTO E INSTALACAO","UN",7,7,null,null,0,0,"Referência: AGETOP - 80518"]
["S",3,"S",0,4,7,1,0,0,0,0,"","Serviço","Serviço","-","AGETOP",80526,"ASSENTO EM POLIPROPILENO COM SISTEMA DE FECHAMENTO SUAVE PARA VASO SANITÁRIO","Un    ",7,7,null,null,0,0,""]
["S",3,"S",0,4,7,1,0,0,0,0,"","Serviço","Serviço","-","COMPOSIÇÃO","COMP 209_SEE","TOALHEIRO PLÁSTICO TIPO DISPENSER PARA PAPEL TOALHA INTERFOLHADO","UN ",3,3,null,null,0,0,""]
["S",3,"S",0,4,7,1,0,0,0,0,"","Serviço","Serviço","-","SINAPI",95544,"PAPELEIRA DE PAREDE EM METAL CROMADO SEM TAMPA, INCLUSO FIXAÇÃO. AF_10/2016","UN",7,7,null,null,0,0,"Referência: AGETOP - 80532"]
["S",3,"S",0,4,7,1,0,0,0,0,"","Serviço","Serviço","-","SINAPI",86904,"LAVATÓRIO LOUÇA BRANCA SUSPENSO, 29,5 X 39CM OU EQUIVALENTE, PADRÃO POPULAR - FORNECIMENTO E INSTALAÇÃO. AF_12/2013","UN",1,1,null,null,0,0,"Referência: AGETOP - 80543"]
["S",3,"S",0,4,7,1,0,0,0,0,"","Serviço","Serviço","-","SINAPI",86884,"ENGATE FLEXÍVEL EM PLÁSTICO BRANCO, 1/2\" X 30CM - FORNECIMENTO E INSTALAÇÃO. AF_12/2013","UN",5,5,null,null,0,0,""]
["S",3,"S",0,4,7,1,0,0,0,0,"","Serviço","Serviço","-","SINAPI",86883,"SIFÃO DO TIPO FLEXÍVEL EM PVC 1\u0094 X 1.1/2\u0094 - FORNECIMENTO E INSTALAÇÃO. AF_12/2013","UN",5,5,null,null,0,0,""]
["S",3,"S",0,4,7,1,0,0,0,0,"","Serviço","Serviço","-","SINAPI",86906,"TORNEIRA CROMADA DE MESA, 1/2\" OU 3/4\", PARA LAVATÓRIO, PADRÃO POPULAR - FORNECIMENTO E INSTALAÇÃO. AF_12/2013","UN",5,5,null,null,0,0,"Referência: AGETOP - 80570"]
["S",3,"S",0,4,7,1,0,0,0,0,"","Serviço","Serviço","-","SINAPI",86877,"VÁLVULA EM METAL CROMADO 1.1/2\" X 1.1/2\" PARA TANQUE OU LAVATÓRIO, COM OU SEM LADRÃO - FORNECIMENTO E INSTALAÇÃO. AF_12/2013","UN",5,5,null,null,0,0,""]
["S",3,"S",0,4,7,1,0,0,0,0,"","Serviço","Serviço","-","SINAPI",86901,"CUBA DE EMBUTIR OVAL EM LOUÇA BRANCA, 35 X 50CM OU EQUIVALENTE - FORNECIMENTO E INSTALAÇÃO. AF_12/2013","UN",4,4,null,null,0,0,"Referência: AGETOP - 80590"]
["S",3,"S",0,4,7,1,0,0,0,0,"","Serviço","Serviço","-","SINAPI",9535,"CHUVEIRO ELETRICO COMUM CORPO PLASTICO TIPO DUCHA, FORNECIMENTO E INSTALACAO","UN",1,1,null,null,0,0,""]
["S",3,"S",0,4,7,1,0,0,0,0,"","Serviço","Serviço","-","SINAPI",95543,"PORTA TOALHA BANHO EM METAL CROMADO, TIPO BARRA, INCLUSO FIXAÇÃO. AF_10/2016","UN",1,1,null,null,0,0,""]
["S",3,"S",0,4,7,1,0,0,0,0,"","Serviço","Serviço","-","SINAPI",95545,"SABONETEIRA DE PAREDE EM METAL CROMADO, INCLUSO FIXAÇÃO. AF_10/2016","UN",1,1,null,null,0,0,"Referência: AGETOP - 80741"]
["S",3,"S",0,4,7,1,0,0,0,0,"","Serviço","Serviço","-","SINAPI",86913,"TORNEIRA CROMADA 1/2\" OU 3/4\" PARA TANQUE, PADRÃO POPULAR - FORNECIMENTO E INSTALAÇÃO. AF_12/2013","UN",2,2,null,null,0,0,""]
["S",3,"S",0,4,7,1,0,0,0,0,"","Serviço","Serviço","-","SINAPI",89708,"CAIXA SIFONADA, PVC, DN 150 X 185 X 75 MM, JUNTA ELÁSTICA, FORNECIDA E INSTALADA EM RAMAL DE DESCARGA OU EM RAMAL DE ESGOTO SANITÁRIO. AF_12/2014","UN",3,3,null,null,0,0,"Referência: AGETOP - 81664"]
["S",3,"S",0,4,7,1,0,0,0,0,"","Serviço","Serviço","-","SINAPI",89709,"RALO SIFONADO, PVC, DN 100 X 40 MM, JUNTA SOLDÁVEL, FORNECIDO E INSTALADO EM RAMAL DE DESCARGA OU EM RAMAL DE ESGOTO SANITÁRIO. AF_12/2014","UN",1,1,null,null,0,0,""]
["S",3,"S",0,4,7,1,0,0,0,0,"","Serviço","Serviço","-","AGETOP",82101,"REDUCAO EXCENTRICA 75 X 50 MM","Un    ",3,3,null,null,0,0,""]
["S",3,"S",0,4,7,1,0,0,0,0,"","Serviço","Serviço","-","AGETOP",81695,"PROLONGAMENTO PARA CAIXA SIFONADA 100 MM","M     ",1,1,null,null,0,0,""]
["S",3,"S",0,4,7,1,0,0,0,0,"","Serviço","Serviço","-","AGETOP",81696,"PROLONGAMENTO PARA CAIXA SIFONADA 150 MM","M     ",3,3,null,null,0,0,""]
["S",3,"S",0,4,7,1,0,0,0,0,"","Serviço","Serviço","-","SINAPI",97906,"CAIXA ENTERRADA HIDRÁULICA RETANGULAR, EM ALVENARIA COM BLOCOS DE CONCRETO, DIMENSÕES INTERNAS: 0,6X0,6X0,6 M PARA REDE DE ESGOTO. AF_05/2018","UN",2,2,null,null,0,0,""]
["S",3,"S",0,4,7,1,0,0,0,0,"","Serviço","Serviço","-","SINAPI",6171,"TAMPA DE CONCRETO ARMADO 60X60X5CM PARA CAIXA","UN",2,2,null,null,0,0,""]
["S",3,"S",0,4,7,1,0,0,0,0,"","Serviço","Serviço","-","AGETOP",81885,"TERMINAL DE VENTILACAO DIAMETRO 50 MM","Un    ",2,2,null,null,0,0,""]
[3,3,3,21,4,7,2,0,0,31,21,"","Nível 3","Nível 3","-",null,null,"ÁGUA FRIA","-",null,0,null,null,0,0,""]
["S",3,"S",0,4,7,2,0,0,0,0,"","Serviço","Serviço","-","SINAPI",89985,"REGISTRO DE PRESSÃO BRUTO, LATÃO, ROSCÁVEL, 3/4\", COM ACABAMENTO E CANOPLA CROMADOS. FORNECIDO E INSTALADO EM RAMAL DE ÁGUA. AF_12/2014","UN",1,1,null,null,0,0,"Referência: AGETOP - 80946"]
["S",3,"S",0,4,7,2,0,0,0,0,"","Serviço","Serviço","-","SINAPI",94794,"REGISTRO DE GAVETA BRUTO, LATÃO, ROSCÁVEL, 1 1/2\u0094, COM ACABAMENTO E CANOPLA CROMADOS, INSTALADO EM RESERVAÇÃO DE ÁGUA DE EDIFICAÇÃO QUE POSSUA RESERVATÓRIO DE FIBRA/FIBROCIMENTO \u0096 FORNECIMENTO E INSTALAÇÃO. AF_06/2016","UN",3,3,null,null,0,0,"Referência: AGETOP - 80929"]
["S",3,"S",0,4,7,2,0,0,0,0,"","Serviço","Serviço","-","SINAPI",89987,"REGISTRO DE GAVETA BRUTO, LATÃO, ROSCÁVEL, 3/4\", COM ACABAMENTO E CANOPLA CROMADOS. FORNECIDO E INSTALADO EM RAMAL DE ÁGUA. AF_12/2014","UN",2,2,null,null,0,0,"Referência: AGETOP - 80926"]
["S",3,"S",0,4,7,2,0,0,0,0,"","Serviço","Serviço","-","SINAPI",89402,"TUBO, PVC, SOLDÁVEL, DN 25MM, INSTALADO EM RAMAL DE DISTRIBUIÇÃO DE ÁGUA - FORNECIMENTO E INSTALAÇÃO. AF_12/2014","M",24,24,null,null,0,0,"Referência: AGETOP - 81003"]
["S",3,"S",0,4,7,2,0,0,0,0,"","Serviço","Serviço","-","SINAPI",94651,"TUBO, PVC, SOLDÁVEL, DN 50 MM, INSTALADO EM RESERVAÇÃO DE ÁGUA DE EDIFICAÇÃO QUE POSSUA RESERVATÓRIO DE FIBRA/FIBROCIMENTO   FORNECIMENTO E INSTALAÇÃO. AF_06/2016","M",54,54,null,null,0,0,""]
["S",3,"S",0,4,7,2,0,0,0,0,"","Serviço","Serviço","-","SINAPI",94652,"TUBO, PVC, SOLDÁVEL, DN 60 MM, INSTALADO EM RESERVAÇÃO DE ÁGUA DE EDIFICAÇÃO QUE POSSUA RESERVATÓRIO DE FIBRA/FIBROCIMENTO   FORNECIMENTO E INSTALAÇÃO. AF_06/2016","M",6,6,null,null,0,0,""]
["S",3,"S",0,4,7,2,0,0,0,0,"","Serviço","Serviço","-","SINAPI",89429,"ADAPTADOR CURTO COM BOLSA E ROSCA PARA REGISTRO, PVC, SOLDÁVEL, DN 25MM X 3/4\u0094, INSTALADO EM RAMAL DE DISTRIBUIÇÃO DE ÁGUA - FORNECIMENTO E INSTALAÇÃO. AF_12/2014","UN",6,6,null,null,0,0,""]
["S",3,"S",0,4,7,2,0,0,0,0,"","Serviço","Serviço","-","SINAPI",89596,"ADAPTADOR CURTO COM BOLSA E ROSCA PARA REGISTRO, PVC, SOLDÁVEL, DN 50MM X 1.1/2\u0094, INSTALADO EM PRUMADA DE ÁGUA - FORNECIMENTO E INSTALAÇÃO. AF_12/2014","UN",13,13,null,null,0,0,""]
["S",3,"S",0,4,7,2,0,0,0,0,"","Serviço","Serviço","-","SINAPI",89605,"LUVA DE REDUÇÃO, PVC, SOLDÁVEL, DN 60MM X 50MM, INSTALADO EM PRUMADA DE ÁGUA - FORNECIMENTO E INSTALAÇÃO. AF_12/2014","UN",2,2,null,null,0,0,""]
["S",3,"S",0,4,7,2,0,0,0,0,"","Serviço","Serviço","-","SINAPI",89579,"LUVA DE REDUÇÃO, PVC, SOLDÁVEL, DN 50MM X 25MM, INSTALADO EM PRUMADA DE ÁGUA   FORNECIMENTO E INSTALAÇÃO. AF_12/2014","UN",1,1,null,null,0,0,""]
["S",3,"S",0,4,7,2,0,0,0,0,"","Serviço","Serviço","-","SINAPI",89605,"LUVA DE REDUÇÃO, PVC, SOLDÁVEL, DN 60MM X 50MM, INSTALADO EM PRUMADA DE ÁGUA - FORNECIMENTO E INSTALAÇÃO. AF_12/2014","UN",1,1,null,null,0,0,""]
["S",3,"S",0,4,7,2,0,0,0,0,"","Serviço","Serviço","-","SINAPI",89408,"JOELHO 90 GRAUS, PVC, SOLDÁVEL, DN 25MM, INSTALADO EM RAMAL DE DISTRIBUIÇÃO DE ÁGUA - FORNECIMENTO E INSTALAÇÃO. AF_12/2014","UN",9,9,null,null,0,0,""]
["S",3,"S",0,4,7,2,0,0,0,0,"","Serviço","Serviço","-","SINAPI",94678,"JOELHO 90 GRAUS, PVC, SOLDÁVEL, DN 50 MM INSTALADO EM RESERVAÇÃO DE ÁGUA DE EDIFICAÇÃO QUE POSSUA RESERVATÓRIO DE FIBRA/FIBROCIMENTO   FORNECIMENTO E INSTALAÇÃO. AF_06/2016","UN",12,12,null,null,0,0,""]
["S",3,"S",0,4,7,2,0,0,0,0,"","Serviço","Serviço","-","SINAPI",90373,"JOELHO 90 GRAUS COM BUCHA DE LATÃO, PVC, SOLDÁVEL, DN 25MM, X 1/2\u0094 INSTALADO EM RAMAL OU SUB-RAMAL DE ÁGUA - FORNECIMENTO E INSTALAÇÃO. AF_12/2014","UN",4,4,null,null,0,0,""]
["S",3,"S",0,4,7,2,0,0,0,0,"","Serviço","Serviço","-","SINAPI",94672,"JOELHO 90 GRAUS COM BUCHA DE LATÃO, PVC, SOLDÁVEL, DN  25 MM, X 3/4\u0094 INSTALADO EM RESERVAÇÃO DE ÁGUA DE EDIFICAÇÃO QUE POSSUA RESERVATÓRIO DE FIBRA/FIBROCIMENTO   FORNECIMENTO E INSTALAÇÃO. AF_06/2016","UN",2,2,null,null,0,0,""]
["S",3,"S",0,4,7,2,0,0,0,0,"","Serviço","Serviço","-","SINAPI",89440,"TE, PVC, SOLDÁVEL, DN 25MM, INSTALADO EM RAMAL DE DISTRIBUIÇÃO DE ÁGUA - FORNECIMENTO E INSTALAÇÃO. AF_12/2014","UN",2,2,null,null,0,0,""]
["S",3,"S",0,4,7,2,0,0,0,0,"","Serviço","Serviço","-","SINAPI",94694,"TÊ, PVC, SOLDÁVEL, DN 50 MM INSTALADO EM RESERVAÇÃO DE ÁGUA DE EDIFICAÇÃO QUE POSSUA RESERVATÓRIO DE FIBRA/FIBROCIMENTO   FORNECIMENTO E INSTALAÇÃO. AF_06/2016","UN",5,5,null,null,0,0,""]
["S",3,"S",0,4,7,2,0,0,{"$f":"IF(OR($C403=\"S\",$C403=0),0,MATCH(0,OFFSET($D403,1,$C403,ROW($C$459)-ROW($C403)),0))","v":0},{"$f":"IF(OR($C403=\"S\",$C403=0),0,MATCH(OFFSET($D403,0,$C403)+1,OFFSET($D403,1,$C403,ROW($C$459)-ROW($C403)),0))","v":0},"","Serviço","Serviço","-","SINAPI",89627,"TÊ DE REDUÇÃO, PVC, SOLDÁVEL, DN 50MM X 25MM, INSTALADO EM PRUMADA DE ÁGUA - FORNECIMENTO E INSTALAÇÃO. AF_12/2014","UN",3,3,null,null,0,0,""]
["S",3,"S",0,4,7,2,0,0,0,0,"","Serviço","Serviço","-","SINAPI",94698,"TÊ DE REDUÇÃO, PVC, SOLDÁVEL, DN 75 MM X 50 MM, INSTALADO EM RESERVAÇÃO DE ÁGUA DE EDIFICAÇÃO QUE POSSUA RESERVATÓRIO DE FIBRA/FIBROCIMENTO   FORNECIMENTO E INSTALAÇÃO. AF_06/2016","UN",1,1,null,null,0,0,""]
["S",3,"S",0,4,7,2,0,0,0,0,"","Serviço","Serviço","-","SINAPI",89441,"TÊ COM BUCHA DE LATÃO NA BOLSA CENTRAL, PVC, SOLDÁVEL, DN 25MM X 1/2\u0094, INSTALADO EM RAMAL DE DISTRIBUIÇÃO DE ÁGUA - FORNECIMENTO E INSTALAÇÃO. AF_12/2014","UN",2,2,null,null,0,0,""]
[3,3,3,10,4,7,3,0,0,10,{"$error":"#N/A"},"","Nível 3","Nível 3","-",null,null,"ESGOTO","-",null,0,null,null,0,0,""]
["S",3,"S",0,4,7,3,0,0,0,0,"","Serviço","Serviço","-","SINAPI",89732,"JOELHO 45 GRAUS, PVC, SERIE NORMAL, ESGOTO PREDIAL, DN 50 MM, JUNTA ELÁSTICA, FORNECIDO E INSTALADO EM RAMAL DE DESCARGA OU RAMAL DE ESGOTO SANITÁRIO. AF_12/2014","UN",2,2,null,null,0,0,""]
["S",3,"S",0,4,7,3,0,0,0,0,"","Serviço","Serviço","-","AGETOP",81927,"JOELHO 90 GRAUS C/ANEL 40 mm ","Un    ",5,5,null,null,0,0,""]
["S",3,"S",0,4,7,3,0,0,0,0,"","Serviço","Serviço","-","SINAPI",89724,"JOELHO 90 GRAUS, PVC, SERIE NORMAL, ESGOTO PREDIAL, DN 40 MM, JUNTA SOLDÁVEL, FORNECIDO E INSTALADO EM RAMAL DE DESCARGA OU RAMAL DE ESGOTO SANITÁRIO. AF_12/2014","UN",5,5,null,null,0,0,""]
["S",3,"S",0,4,7,3,0,0,0,0,"","Serviço","Serviço","-","SINAPI",89731,"JOELHO 90 GRAUS, PVC, SERIE NORMAL, ESGOTO PREDIAL, DN 50 MM, JUNTA ELÁSTICA, FORNECIDO E INSTALADO EM RAMAL DE DESCARGA OU RAMAL DE ESGOTO SANITÁRIO. AF_12/2014","UN",6,6,null,null,0,0,""]
["S",3,"S",0,4,7,3,0,0,0,0,"","Serviço","Serviço","-","SINAPI",89744,"JOELHO 90 GRAUS, PVC, SERIE NORMAL, ESGOTO PREDIAL, DN 100 MM, JUNTA ELÁSTICA, FORNECIDO E INSTALADO EM RAMAL DE DESCARGA OU RAMAL DE ESGOTO SANITÁRIO. AF_12/2014","UN",7,7,null,null,0,0,""]
["S",3,"S",0,4,7,3,0,0,0,0,"","Serviço","Serviço","-","SINAPI",89784,"TE, PVC, SERIE NORMAL, ESGOTO PREDIAL, DN 50 X 50 MM, JUNTA ELÁSTICA, FORNECIDO E INSTALADO EM RAMAL DE DESCARGA OU RAMAL DE ESGOTO SANITÁRIO. AF_12/2014","UN",4,4,null,null,0,0,""]
["S",3,"S",0,4,7,3,0,0,0,0,"","Serviço","Serviço","-","SINAPI",89711,"TUBO PVC, SERIE NORMAL, ESGOTO PREDIAL, DN 40 MM, FORNECIDO E INSTALADO EM RAMAL DE DESCARGA OU RAMAL DE ESGOTO SANITÁRIO. AF_12/2014","M",18,18,null,null,0,0,""]
["S",3,"S",0,4,7,3,0,0,0,0,"","Serviço","Serviço","-","SINAPI",89712,"TUBO PVC, SERIE NORMAL, ESGOTO PREDIAL, DN 50 MM, FORNECIDO E INSTALADO EM RAMAL DE DESCARGA OU RAMAL DE ESGOTO SANITÁRIO. AF_12/2014","M",36,36,null,null,0,0,""]
["S",3,"S",0,4,7,3,0,0,0,0,"","Serviço","Serviço","-","SINAPI",89714,"TUBO PVC, SERIE NORMAL, ESGOTO PREDIAL, DN 100 MM, FORNECIDO E INSTALADO EM RAMAL DE DESCARGA OU RAMAL DE ESGOTO SANITÁRIO. AF_12/2014","M",12,12,null,null,0,0,""]
[2,2,2,3,4,8,0,0,0,43,3,"","Nível 2","Nível 2","-","SINAPI",null,"ALVENARIAS E DIVISÓRIAS","-",null,0,null,null,0,0,""]
["S",2,"S",0,4,8,0,0,0,0,0,"","Serviço","Serviço","-","SINAPI",87511,"ALVENARIA DE VEDAÇÃO DE BLOCOS CERÂMICOS FURADOS NA HORIZONTAL DE 9X19X19CM (ESPESSURA 9CM) DE PAREDES COM ÁREA LÍQUIDA MENOR QUE 6M² COM VÃOS E ARGAMASSA DE ASSENTAMENTO COM PREPARO EM BETONEIRA. AF_06/2014","M2",121.72,121.72,null,null,0,0,"Referência: AGETOP - 100201"]
["S",2,"S",0,4,8,0,0,0,0,0,"","Serviço","Serviço","-","SINAPI",79627,"DIVISORIA EM GRANITO BRANCO POLIDO, ESP = 3CM, ASSENTADO COM ARGAMASSA TRACO 1:4, ARREMATE EM CIMENTO BRANCO, EXCLUSIVE FERRAGENS","M2",19.57,19.57,null,null,0,0,"Referência: AGETOP - 100320"]
[2,2,2,2,4,9,0,0,0,40,2,"","Nível 2","Nível 2","-","SINAPI",null,"IMPERMEABILIZACAO","-",null,0,null,null,0,0,""]
["S",2,"S",0,4,9,0,0,0,0,0,"","Serviço","Serviço","-","SINAPI","74106/1","IMPERMEABILIZACAO DE ESTRUTURAS ENTERRADAS, COM TINTA ASFALTICA, DUAS DEMAOS.","M2",48,48,null,null,0,0,"Referência: AGETOP - 120902"]
[2,2,2,2,4,10,0,0,0,38,2,"","Nível 2","Nível 2","-","AGETOP",null,"ESTRUTURA DE MADEIRA","-",null,0,null,null,0,0,""]
["S",2,"S",0,4,10,0,0,0,0,0,"","Serviço","Serviço","-","AGETOP",140102,"ESTRUTURA-TELHA CERAMICA V=7 A 10 M C/FERRAGENS","m2    ",67,67,null,null,0,0,""]
[2,2,2,4,4,11,0,0,0,36,4,"","Nível 2","Nível 2","-","AGETOP",null,"COBERTURAS","-",null,0,null,null,0,0,""]
["S",2,"S",0,4,11,0,0,0,0,0,"","Serviço","Serviço","-","SINAPI",94445,"TELHAMENTO COM TELHA CERÂMICA CAPA-CANAL, TIPO PLAN, COM ATÉ 2 ÁGUAS, INCLUSO TRANSPORTE VERTICAL. AF_06/2016","M2",67,67,null,null,0,0,"Referência: AGETOP - 160401"]
["S",2,"S",0,4,11,0,0,0,0,0,"","Serviço","Serviço","-","SINAPI",94221,"CUMEEIRA PARA TELHA CERÂMICA EMBOÇADA COM ARGAMASSA TRAÇO 1:2:9 (CIMENTO, CAL E AREIA) PARA TELHADOS COM ATÉ 2 ÁGUAS, INCLUSO TRANSPORTE VERTICAL. AF_06/2016","M",7.5,7.5,null,null,0,0,""]
["S",2,"S",0,4,11,0,0,0,0,0,"","Serviço","Serviço","-","SINAPI",94224,"EMBOÇAMENTO COM ARGAMASSA TRAÇO 1:2:9 (CIMENTO, CAL E AREIA). AF_06/2016","M",32.799999999999997,32.799999999999997,null,null,0,0,"Referência: AGETOP - 160403"]
[2,2,2,3,4,12,0,0,0,32,3,"","Nível 2","Nível 2","-","AGETOP",null,"ESQUADRIAS METÁLICAS","-",null,0,null,null,0,0,""]
["S",2,"S",0,4,12,0,0,0,0,0,"","Serviço","Serviço","-","SINAPI","73933/4","PORTA DE FERRO DE ABRIR TIPO BARRA CHATA, COM REQUADRO E GUARNICAO COMPLETA","M2",12.15,12.15,null,null,0,0,"Referência: AGETOP - 180501"]
["S",2,"S",0,4,12,0,0,0,0,0,"","Serviço","Serviço","-","SINAPI",94559,"JANELA DE AÇO BASCULANTE, FIXAÇÃO COM ARGAMASSA, SEM VIDROS, PADRONIZADA. AF_07/2016","M2",3,3,null,null,0,0,"Referência: AGETOP - 180404"]
[2,2,2,2,4,13,0,0,0,29,2,"","Nível 2","Nível 2","-","AGETOP",null,"VIDROS","-",null,0,null,null,0,0,""]
["S",2,"S",0,4,13,0,0,0,0,0,"","Serviço","Serviço","-","SINAPI",72117,"VIDRO LISO COMUM TRANSPARENTE, ESPESSURA 4MM","M2",2.4500000000000002,2.4500000000000002,null,null,0,0,"Referência: AGETOP - 190102"]
[2,2,2,7,4,14,0,0,0,27,7,"","Nível 2","Nível 2","-","AGETOP",null,"REVESTIMENTO DE PAREDE","-",null,0,null,null,0,0,""]
["S",2,"S",0,4,14,0,0,0,0,0,"","Serviço","Serviço","-","SINAPI",87548,"MASSA ÚNICA, PARA RECEBIMENTO DE PINTURA, EM ARGAMASSA TRAÇO 1:2:8, PREPARO MANUAL, APLICADA MANUALMENTE EM FACES INTERNAS DE PAREDES, ESPESSURA DE 10MM, COM EXECUÇÃO DE TALISCAS. AF_06/2014","M2",165.09,165.09,null,null,0,0,"Referência: AGETOP - 200403"]
["S",2,"S",0,4,14,0,0,0,0,0,"","Serviço","Serviço","-","SINAPI",87272,"REVESTIMENTO CERÂMICO PARA PAREDES INTERNAS COM PLACAS TIPO ESMALTADA EXTRA  DE DIMENSÕES 33X45 CM APLICADAS EM AMBIENTES DE ÁREA MENOR QUE 5 M² NA ALTURA INTEIRA DAS PAREDES. AF_06/2014","M2",22.95,22.95,null,null,0,0,"Referência: AGETOP - 201302"]
["S",2,"S",0,4,14,0,0,0,0,0,"","Serviço","Serviço","-","SINAPI",87273,"REVESTIMENTO CERÂMICO PARA PAREDES INTERNAS COM PLACAS TIPO ESMALTADA EXTRA DE DIMENSÕES 33X45 CM APLICADAS EM AMBIENTES DE ÁREA MAIOR QUE 5 M² NA ALTURA INTEIRA DAS PAREDES. AF_06/2014","M2",55.4,55.4,null,null,0,0,"Referência: AGETOP - 201302"]
["S",2,"S",0,4,14,0,0,0,0,0,"","Serviço","Serviço","-","SINAPI",87549,"EMBOÇO, PARA RECEBIMENTO DE CERÂMICA, EM ARGAMASSA TRAÇO 1:2:8, PREPARO MECÂNICO COM BETONEIRA 400L, APLICADO MANUALMENTE EM FACES INTERNAS DE PAREDES, PARA AMBIENTE COM ÁREA ENTRE 5M2 E 10M2, ESPESSURA DE 10MM, COM EXECUÇÃO DE TALISCAS. AF_06/2014","M2",55.4,55.4,null,null,0,0,"Referência: AGETOP - 200201"]
["S",2,"S",0,4,14,0,0,0,0,0,"","Serviço","Serviço","-","SINAPI",87545,"EMBOÇO, PARA RECEBIMENTO DE CERÂMICA, EM ARGAMASSA TRAÇO 1:2:8, PREPARO MECÂNICO COM BETONEIRA 400L, APLICADO MANUALMENTE EM FACES INTERNAS DE PAREDES, PARA AMBIENTE COM ÁREA MENOR QUE 5M2, ESPESSURA DE 10MM, COM EXECUÇÃO DE TALISCAS. AF_06/2014","M2",22.950000000000003,22.950000000000003,null,null,0,0,"Referência: AGETOP - 200201"]
["S",2,"S",0,4,14,0,0,0,0,0,"","Serviço","Serviço","-","SINAPI",87904,"CHAPISCO APLICADO EM ALVENARIA (COM PRESENÇA DE VÃOS) E ESTRUTURAS DE CONCRETO DE FACHADA, COM COLHER DE PEDREIRO.  ARGAMASSA TRAÇO 1:3 COM PREPARO MANUAL. AF_06/2014","M2",243.44,243.44,null,null,0,0,"Referência: AGETOP - 200101"]
[2,2,2,2,4,15,0,0,0,20,2,"","Nível 2","Nível 2","-","AGETOP",null,"FORROS","-",null,0,null,null,0,0,""]
["S",2,"S",0,4,15,0,0,0,0,0,"","Serviço","Serviço","-","SINAPI",96111,"FORRO EM RÉGUAS DE PVC, FRISADO, PARA AMBIENTES RESIDENCIAIS, INCLUSIVE ESTRUTURA DE FIXAÇÃO. AF_05/2017_P","M2",25.2,25.2,null,null,0,0,"Referência: AGETOP - 210460"]
[2,2,2,6,4,16,0,0,0,18,6,"","Nível 2","Nível 2","-","SINAPI",null,"REVESTIMENTO DE PISO","-",null,0,null,null,0,0,""]
["S",2,"S",0,4,16,0,0,0,0,0,"","Serviço","Serviço","-","SINAPI",95241,"LASTRO DE CONCRETO MAGRO, APLICADO EM PISOS OU RADIERS, ESPESSURA DE 5 CM. AF_07/2016","M2",48.43,48.43,null,null,0,0,"Referência: AGETOP - 220050"]
["S",2,"S",0,4,16,0,0,0,0,0,"","Serviço","Serviço","-","AGETOP",221104,"RASPAGEM E APLICAÇÃO RESINA ACRÍLICA DUAS DEMÃOS","m2    ",18.850000000000001,18.850000000000001,null,null,0,0,""]
["S",2,"S",0,4,16,0,0,0,{"$f":"IF(OR($C444=\"S\",$C444=0),0,MATCH(0,OFFSET($D444,1,$C444,ROW($C$459)-ROW($C444)),0))","v":0},{"$f":"IF(OR($C444=\"S\",$C444=0),0,MATCH(OFFSET($D444,0,$C444)+1,OFFSET($D444,1,$C444,ROW($C$459)-ROW($C444)),0))","v":0},"","Serviço","Serviço","-","SINAPI",84191,"PISO EM GRANILITE, MARMORITE OU GRANITINA ESPESSURA 8 MM, INCLUSO JUNTAS DE DILATACAO PLASTICAS","M2",19.559999999999999,19.559999999999999,null,null,0,0,"Referência: AGETOP - 221101"]
["S",2,"S",0,4,16,0,0,0,0,0,"","Serviço","Serviço","-","SINAPI",87247,"REVESTIMENTO CERÂMICO PARA PISO COM PLACAS TIPO ESMALTADA EXTRA DE DIMENSÕES 35X35 CM APLICADA EM AMBIENTES DE ÁREA ENTRE 5 M2 E 10 M2. AF_06/2014","M2",25.2,25.2,null,null,0,0,""]
["S",2,"S",0,4,16,0,0,0,{"$f":"IF(OR($C446=\"S\",$C446=0),0,MATCH(0,OFFSET($D446,1,$C446,ROW($C$459)-ROW($C446)),0))","v":0},{"$f":"IF(OR($C446=\"S\",$C446=0),0,MATCH(OFFSET($D446,0,$C446)+1,OFFSET($D446,1,$C446,ROW($C$459)-ROW($C446)),0))","v":0},"","Serviço","Serviço","-","SINAPI",94992,"EXECUÇÃO DE PASSEIO (CALÇADA) OU PISO DE CONCRETO COM CONCRETO MOLDADO IN LOCO, FEITO EM OBRA, ACABAMENTO CONVENCIONAL, ESPESSURA 6 CM, ARMADO. AF_07/2016","M2",15,15,null,null,0,0,"Referência: AGETOP - 220060"]
[2,2,2,3,4,17,0,0,0,12,3,"","Nível 2","Nível 2","-","AGETOP",null,"FERRAGENS","-",null,0,null,null,0,0,""]
["S",2,"S",0,4,17,0,0,0,0,0,"","Serviço","Serviço","-","AGETOP",230176,"BARRA DE APOIO EM AÇO INOX - 80 CM ","un    ",4,4,null,null,0,0,""]
["S",2,"S",0,4,17,0,0,0,0,0,"","Serviço","Serviço","-","AGETOP",230174,"BARRA DE APOIO EM AÇO INOX - 40 CM","un    ",2,2,null,null,0,0,""]
[2,2,2,5,4,18,0,0,0,9,5,"","Nível 2","Nível 2","-","AGETOP",null,"PINTURA","-",null,0,null,null,0,0,""]
["S",2,"S",0,4,18,0,0,0,0,0,"","Serviço","Serviço","-","SINAPI","74145/1","PINTURA ESMALTE FOSCO, DUAS DEMAOS, SOBRE SUPERFICIE METALICA, INCLUSO UMA DEMAO DE FUNDO ANTICORROSIVO. UTILIZACAO DE REVOLVER ( AR-COMPRIMIDO).","M2",30.3,30.3,null,null,0,0,""]
["S",2,"S",0,4,18,0,0,0,0,0,"","Serviço","Serviço","-","SINAPI",88489,"APLICAÇÃO MANUAL DE PINTURA COM TINTA LÁTEX ACRÍLICA EM PAREDES, DUAS DEMÃOS. AF_06/2014","M2",95.92,95.92,null,null,0,0,"Referência: AGETOP - 261001"]
["S",2,"S",0,4,18,0,0,0,{"$f":"IF(OR($C453=\"S\",$C453=0),0,MATCH(0,OFFSET($D453,1,$C453,ROW($C$459)-ROW($C453)),0))","v":0},{"$f":"IF(OR($C453=\"S\",$C453=0),0,MATCH(OFFSET($D453,0,$C453)+1,OFFSET($D453,1,$C453,ROW($C$459)-ROW($C453)),0))","v":0},"","Serviço","Serviço","-","SINAPI",88487,"APLICAÇÃO MANUAL DE PINTURA COM TINTA LÁTEX PVA EM PAREDES, DUAS DEMÃOS. AF_06/2014","M2",31,31,null,null,0,0,""]
["S",2,"S",0,4,18,0,0,0,0,0,"","Serviço","Serviço","-","SINAPI",88497,"APLICAÇÃO E LIXAMENTO DE MASSA LÁTEX EM PAREDES, DUAS DEMÃOS. AF_06/2014","M2",31,31,null,null,0,0,"Referência: AGETOP - 261304"]
[2,2,2,4,4,19,0,0,0,{"$f":"IF(OR($C455=\"S\",$C455=0),0,MATCH(0,OFFSET($D455,1,$C455,ROW($C$459)-ROW($C455)),0))","v":4},{"$f":"IF(OR($C455=\"S\",$C455=0),0,MATCH(OFFSET($D455,0,$C455)+1,OFFSET($D455,1,$C455,ROW($C$459)-ROW($C455)),0))","v":{"$error":"#N/A"}},"","Nível 2","Nível 2","-","AGETOP",null,"DIVERSOS","-",null,0,null,null,0,0,""]
["S",2,"S",0,4,19,0,0,0,{"$f":"IF(OR($C456=\"S\",$C456=0),0,MATCH(0,OFFSET($D456,1,$C456,ROW($C$459)-ROW($C456)),0))","v":0},{"$f":"IF(OR($C456=\"S\",$C456=0),0,MATCH(OFFSET($D456,0,$C456)+1,OFFSET($D456,1,$C456,ROW($C$459)-ROW($C456)),0))","v":0},"","Serviço","Serviço","-","AGETOP",270501,"LIMPEZA FINAL DE OBRA - (OBRAS CIVIS)","m2    ",48.43,48.43,null,null,0,0,""]
["S",2,"S",0,4,19,0,0,0,{"$f":"IF(OR($C457=\"S\",$C457=0),0,MATCH(0,OFFSET($D457,1,$C457,ROW($C$459)-ROW($C457)),0))","v":0},{"$f":"IF(OR($C457=\"S\",$C457=0),0,MATCH(OFFSET($D457,0,$C457)+1,OFFSET($D457,1,$C457,ROW($C$459)-ROW($C457)),0))","v":0},"","Serviço","Serviço","-","COMPOSIÇÃO","COMP 541_SEE","BANCADA DE GRANITO CINZA POLIDO - FORNECIMENTO E INSTALAÇÃO. ","M2    ",2.42,2.42,null,null,0,0,""]
["S",2,"S",0,4,19,0,0,0,{"$f":"IF(OR($C458=\"S\",$C458=0),0,MATCH(0,OFFSET($D458,1,$C458,ROW($C$459)-ROW($C458)),0))","v":0},{"$f":"IF(OR($C458=\"S\",$C458=0),0,MATCH(OFFSET($D458,0,$C458)+1,OFFSET($D458,1,$C458,ROW($C$459)-ROW($C458)),0))","v":0},"","Serviço","Serviço","-","COMPOSIÇÃO","COMP 206_SEE","BANCO ARTICULADO PARA BANHO, EM ACO INOX POLIDO, 70* CM X 45* CM","UN ",1,1,null,null,0,0,""]
[-1,null,-1,null,0,0,0,0,0,null,null,"F"]
[null,null,null,null,null,null,null,null,null,null,null,"F",null,null,null,null,null,"OBS: OS QUANTITATIVOS DE MATERIAIS  DAS INSTALAÇÕES HIDROSSANITÁRIAS, ELÉTRICAS E ESPECIAIS SÃO FORNECIDOS PELOS PROFISSIONAIS RESPONSÁVEIS PELOS RESPECTIVOS PROJETOS.",null,null,null,"VALOR TOTAL",null,0]
[null,null,null,null,null,null,null,null,null,null,null,"F",null,null,null,null,null,null,null,null,null,"VALOR BDI (21,64%)",null,0]
[null,null,null,null,null,null,null,null,null,null,null,"F",null,null,null,null,null,null,null,null,null,"TOTAL ORÇAMENTO",null,0]
[null,null,null,null,null,null,null,null,null,null,null,"F"]
[null,null,null,null,null,null,null,null,null,null,null,"F",null,null,null,null,null,null,null,null,null,"CUSTO POR M2 ³",null,0]
[null,null,null,null,null,null,null,null,null,null,null,"F",null,null,null,null,null,null,null,null,null,"MATERIAL S/ BDI",null,0]
[null,null,null,null,null,null,null,null,null,null,null,"F",null,null,null,null,null,null,null,null,null,"MÃO DE OBRA S/ BDI",null,0]
[null,null,null,null,null,null,null,null,null,null,null,"F"]
[null,null,null,null,null,null,null,null,null,null,null,"F",null,null,null,null,"(1) Conforme previsto pelo DECRETO Nº 7.983, DE 8 DE ABRIL DE 2013, os preços adotados são aqueles constantes dos sistemas de referência indicados. Justifica-se o uso dos preços destas composições de custos unitários devido ao seu valor ser menor à mediana de seus correspondentes na tabela SINAPI;"]
[null,null,null,null,null,null,null,null,null,null,null,"F",null,null,null,null,"(2) Optou-se pelo uso das composições de custos da AGETOP para itens não presentes na SINAPI;"]
[null,null,null,null,null,null,null,null,null,null,null,"F",null,null,null,null,"(3) Para itens da AGETOP, os vidros não estão inclusos nas esquadrias e já foram considerados os custos de contramarco para as esquadrias de alumínio;"]
[null,null,null,null,null,null,null,null,null,null,null,"F",null,null,null,null,"(4) Nos casos em que houver execução de granitina, considerou-se que o quantitativo para o rodapé, de altura igual a 7cm, foi incorporado na área de piso;"]
[null,null,null,null,null,null,null,null,null,null,null,"F",null,null,null,null,"(5) O custo unitário aproximado por metro quadrado é calculado dividindo-se o valor total do orçamento pela área total de construção."]
[null,null,null,null,null,null,null,null,null,null,null,"F"]
[null,null,null,null,null,null,null,null,null,null,null,"F"]
[]
[null,null,null,null,null,null,null,null,null,null,null,null,null,null,"SOMATÓRIO DE SERVIÇOS"]
[null,null,null,null,null,null,null,null,null,null,null,null,null,null,"ITEM","DESCRIÇÃO DOS SERVIÇOS",null,null,"PREÇO SEM BDI",null,null,null,"PREÇO COM BDI",null,null,"PARTICIPAÇÃO ( % )"]
[null,null,null,null,null,null,null,null,null,null,null,null,null,null,"a.","SERVIÇOS PRELIMINARES",null,null,{"$f":"SUMIF($R$19:$R$459,$P478,$Y$19:$Y$459)","v":0},null,null,null,{"$f":"ROUND(S478*(1+BDI.Taxa),2)","v":0},null,null,{"$f":"IFERROR(ROUND($W478*100/$X$462,2),0)","v":0}]
[null,null,null,null,null,null,null,null,null,null,null,null,null,null,"b.","TRANSPORTES",null,null,0,null,null,null,0,null,null,0]
[null,null,null,null,null,null,null,null,null,null,null,null,null,null,"c.","SERVIÇO EM TERRA",null,null,0,null,null,null,0,null,null,0]
[null,null,null,null,null,null,null,null,null,null,null,null,null,null,"d.","FUNDAÇÕES E SONDAGENS",null,null,0,null,null,null,0,null,null,0]
[null,null,null,null,null,null,null,null,null,null,null,null,null,null,"e.","ESTRUTURA",null,null,0,null,null,null,0,null,null,0]
[null,null,null,null,null,null,null,null,null,null,null,null,null,null,"f.","INSTALAÇÕES ELÉTRICAS",null,null,0,null,null,null,0,null,null,0]
[null,null,null,null,null,null,null,null,null,null,null,null,null,null,"g.","INSTALAÇÕES HIDROSSANITÁRIAS",null,null,0,null,null,null,0,null,null,0]
[null,null,null,null,null,null,null,null,null,null,null,null,null,null,"h","INSTALAÇÕES ESPECIAIS",null,null,0,null,null,null,0,null,null,0]
[null,null,null,null,null,null,null,null,null,null,null,null,null,null,"i.","ALVENARIAS E DIVISÓRIAS",null,null,0,null,null,null,0,null,null,0]
[null,null,null,null,null,null,null,null,null,null,null,null,null,null,"j.","ALVENARIA AUTO-PORTANTE",null,null,0,null,null,null,0,null,null,0]
[null,null,null,null,null,null,null,null,null,null,null,null,null,null,"k.","IMPERMEABILIZACAO",null,null,0,null,null,null,0,null,null,0]
[null,null,null,null,null,null,null,null,null,null,null,null,null,null,"l.","ISOLAMENTO TÉRMICO E ACÚSTICO",null,null,0,null,null,null,0,null,null,0]
[null,null,null,null,null,null,null,null,null,null,null,null,null,null,"m.","ESTRUTURA DE MADEIRA",null,null,0,null,null,null,0,null,null,0]
[null,null,null,null,null,null,null,null,null,null,null,null,null,null,"n.","ESTRUTURAS METÁLICAS",null,null,0,null,null,null,0,null,null,0]
[null,null,null,null,null,null,null,null,null,null,null,null,null,null,"o.","COBERTURAS",null,null,0,null,null,null,0,null,null,0]
[null,null,null,null,null,null,null,null,null,null,null,null,null,null,"p.","ESQUADRIAS DE MADEIRA",null,null,0,null,null,null,0,null,null,0]
[null,null,null,null,null,null,null,null,null,null,null,null,null,null,"q.","ESQUADRIAS METÁLICAS",null,null,0,null,null,null,{"$f":"ROUND(S494*(1+BDI.Taxa),2)","v":0},null,null,0]
[null,null,null,null,null,null,null,null,null,null,null,null,null,null,"r.","VIDROS",null,null,0,null,null,null,0,null,null,0]
[null,null,null,null,null,null,null,null,null,null,null,null,null,null,"s.","REVESTIMENTO DE PAREDE",null,null,0,null,null,null,0,null,null,0]
[null,null,null,null,null,null,null,null,null,null,null,null,null,null,"t.","FORROS",null,null,0,null,null,null,0,null,null,0]
[null,null,null,null,null,null,null,null,null,null,null,null,null,null,"u.","REVESTIMENTO DE PISO",null,null,0,null,null,null,0,null,null,0]
[null,null,null,null,null,null,null,null,null,null,null,null,null,null,"v.","FERRAGENS",null,null,0,null,null,null,0,null,null,0]
[null,null,null,null,null,null,null,null,null,null,null,null,null,null,"w.","MARCENARIA",null,null,0,null,null,null,0,null,null,0]
[null,null,null,null,null,null,null,null,null,null,null,null,null,null,"x.","ADMINISTRAÇÃO",null,null,0,null,null,null,0,null,null,0]
[null,null,null,null,null,null,null,null,null,null,null,null,null,null,"y.","PINTURA",null,null,0,null,null,null,{"$f":"ROUND(S502*(1+BDI.Taxa),2)","v":0},null,null,0]
[null,null,null,null,null,null,null,null,null,null,null,null,null,null,"z.","DIVERSOS",null,null,0,null,null,null,{"$f":"W505-SUM(W478:Y502)","v":0},null,null,{"$f":"IF(S503>0,IF((SUM(Z478:Z502)+IFERROR(ROUND($W503*100/$X$462,2),0))<>Z505,Z505-SUM(Z478:Z502),IFERROR(ROUND($W503*100/$X$462,2),0)),0)","v":0}]
[null,null,null,null,null,null,null,null,null,null,null,null,null,null,"TOTAL GERAL DO ORÇAMENTO (R$)",null,null,null,{"$f":"SUM(S478:V503)","v":0},null,null,null,{"$f":"SUM(W478:Y503)","v":0},null,null,{"$f":"SUM(Z478:Z503)","v":0}]
[null,null,null,null,null,null,null,null,null,null,null,null,null,null,null,null,null,null,{"$f":"$X$460","v":0},null,null,null,{"$f":"$X$462","v":0},null,null,100]
[null,null,null,null,null,null,null,null,null,null,null,null,null,null,null,null,null,null,"(TOTAL SEM BDI)",null,null,null,"(TOTAL COM BDI)",null,null,"(ARRED porcentagem)"]
[null,null,null,null,null,null,null,null,null,null,null,null,null,null,null,null,null,null,{"$f":"IF(AND(S504=S505,S504>0),\"OK\",\"ERRO\")","v":"ERRO"},null,null,null,{"$f":"IF(AND(W504=W505,W504>0),\"OK\",\"ERRO\")","v":"ERRO"},null,null,{"$f":"IF(Z504=100,\"OK\",\"ERRO\")","v":"ERRO"}]
[]
[]
[null,null,null,null,null,null,null,null,null,null,null,null,null,null,"RESUMO GERAL DO ORÇAMENTO"]
[null,null,null,null,null,null,null,null,null,null,null,null,null,null,"ITEM","DESCRIÇÃO DOS SERVIÇOS",null,null,"PREÇO SEM BDI",null,null,null,"PREÇO COM BDI",null,null,"PARTICIPAÇÃO ( % )"]
[null,null,null,null,null,null,null,null,null,null,null,null,null,null,"1.",{"$f":"IFERROR(VLOOKUP(O512,$O$19:$Y$459,4,FALSE),\"\")","v":"REFORMA"},null,null,{"$f":"IF(P513=\"\",$S$533-SUM(OFFSET($S511:S$512,0,0,COUNTA($S511:S$512),1)),SUMIF($R$19:$R$459,$P512,$Y$19:$Y$459))","v":0},null,null,null,{"$f":"IF(P513=\"\",$W$533-SUM(OFFSET($W511:W$512,0,0,COUNTA($W511:W$512),1)),ROUND(S512*(1+BDI.Taxa),2))","v":0},null,null,{"$f":"IF(P513=\"\",$Z$533-SUM(OFFSET($Z$512:Z$512,0,0,COUNTA($Z511:Z$512),1)),ROUND(W512*100/$X$462,2))","v":{"$error":"#DIV/0!"}}]
[null,null,null,null,null,null,null,null,null,null,null,null,null,null,"2.","IMPLANTAÇÃO",null,null,{"$f":"IF(P514=\"\",$S$533-SUM(OFFSET($S512:S$512,0,0,COUNTA($S512:S$512),1)),SUMIF($R$19:$R$459,$P513,$Y$19:$Y$459))","v":0},null,null,null,{"$f":"IF(P514=\"\",$W$533-SUM(OFFSET($W$512:W512,0,0,COUNTA($W$512:W512),1)),ROUND(S513*(1+BDI.Taxa),2))","v":0},null,null,{"$f":"IF(P514=\"\",$Z$533-SUM(OFFSET($Z$512:Z$512,0,0,COUNTA($Z$512:Z512),1)),ROUND(W513*100/$X$462,2))","v":{"$error":"#DIV/0!"}}]
[null,null,null,null,null,null,null,null,null,null,null,null,null,null,"3.","BLOCO 3 SALAS SEDUC17",null,null,{"$f":"IF(P515=\"\",$S$533-SUM(OFFSET($S$512:S513,0,0,COUNTA($S$512:S513),1)),SUMIF($R$19:$R$459,$P514,$Y$19:$Y$459))","v":0},null,null,null,{"$f":"IF(P515=\"\",$W$533-SUM(OFFSET($W$512:W513,0,0,COUNTA($W$512:W513),1)),ROUND(S514*(1+BDI.Taxa),2))","v":0},null,null,{"$f":"IF(P515=\"\",$Z$533-SUM(OFFSET($Z$512:Z$512,0,0,COUNTA($Z$512:Z513),1)),ROUND(W514*100/$X$462,2))","v":{"$error":"#DIV/0!"}}]
[null,null,null,null,null,null,null,null,null,null,null,null,null,null,"4.","BLOCO SANITÁRIO SEDUC13",null,null,{"$f":"IF(P516=\"\",$S$533-SUM(OFFSET($S$512:S514,0,0,COUNTA($S$512:S514),1)),SUMIF($R$19:$R$459,$P515,$Y$19:$Y$459))","v":0},null,null,null,{"$f":"IF(P516=\"\",$W$533-SUM(OFFSET($W$512:W514,0,0,COUNTA($W$512:W514),1)),ROUND(S515*(1+BDI.Taxa),2))","v":0},null,null,{"$f":"IF(P516=\"\",$Z$533-SUM(OFFSET($Z$512:Z$512,0,0,COUNTA($Z$512:Z514),1)),ROUND(W515*100/$X$462,2))","v":{"$error":"#DIV/0!"}}]
[null,null,null,null,null,null,null,null,null,null,null,null,null,null,"5.","",null,null,{"$f":"IF(P517=\"\",$S$533-SUM(OFFSET($S$512:S515,0,0,COUNTA($S$512:S515),1)),SUMIF($R$19:$R$459,$P516,$Y$19:$Y$459))","v":0},null,null,null,{"$f":"IF(P517=\"\",$W$533-SUM(OFFSET($W$512:W515,0,0,COUNTA($W$512:W515),1)),ROUND(S516*(1+BDI.Taxa),2))","v":0},null,null,{"$f":"IF(P517=\"\",$Z$533-SUM(OFFSET($Z$512:Z$512,0,0,COUNTA($Z$512:Z515),1)),ROUND(W516*100/$X$462,2))","v":{"$error":"#DIV/0!"}}]
[null,null,null,null,null,null,null,null,null,null,null,null,null,null,"6.","",null,null,{"$f":"IF(P518=\"\",$S$533-SUM(OFFSET($S$512:S516,0,0,COUNTA($S$512:S516),1)),SUMIF($R$19:$R$459,$P517,$Y$19:$Y$459))","v":0},null,null,null,{"$f":"IF(P518=\"\",$W$533-SUM(OFFSET($W$512:W516,0,0,COUNTA($W$512:W516),1)),ROUND(S517*(1+BDI.Taxa),2))","v":0},null,null,{"$f":"IF(P518=\"\",$Z$533-SUM(OFFSET($Z$512:Z$512,0,0,COUNTA($Z$512:Z516),1)),ROUND(W517*100/$X$462,2))","v":{"$error":"#DIV/0!"}}]
[null,null,null,null,null,null,null,null,null,null,null,null,null,null,"7.","",null,null,{"$f":"IF(P519=\"\",$S$533-SUM(OFFSET($S$512:S517,0,0,COUNTA($S$512:S517),1)),SUMIF($R$19:$R$459,$P518,$Y$19:$Y$459))","v":0},null,null,null,{"$f":"IF(P519=\"\",$W$533-SUM(OFFSET($W$512:W517,0,0,COUNTA($W$512:W517),1)),ROUND(S518*(1+BDI.Taxa),2))","v":0},null,null,{"$f":"IF(P519=\"\",$Z$533-SUM(OFFSET($Z$512:Z$512,0,0,COUNTA($Z$512:Z517),1)),ROUND(W518*100/$X$462,2))","v":{"$error":"#DIV/0!"}}]
[null,null,null,null,null,null,null,null,null,null,null,null,null,null,"8.","",null,null,{"$f":"IF(P520=\"\",$S$533-SUM(OFFSET($S$512:S518,0,0,COUNTA($S$512:S518),1)),SUMIF($R$19:$R$459,$P519,$Y$19:$Y$459))","v":0},null,null,null,{"$f":"IF(P520=\"\",$W$533-SUM(OFFSET($W$512:W518,0,0,COUNTA($W$512:W518),1)),ROUND(S519*(1+BDI.Taxa),2))","v":0},null,null,{"$f":"IF(P520=\"\",$Z$533-SUM(OFFSET($Z$512:Z$512,0,0,COUNTA($Z$512:Z518),1)),ROUND(W519*100/$X$462,2))","v":{"$error":"#DIV/0!"}}]
[null,null,null,null,null,null,null,null,null,null,null,null,null,null,"9.","",null,null,{"$f":"IF(P521=\"\",$S$533-SUM(OFFSET($S$512:S519,0,0,COUNTA($S$512:S519),1)),SUMIF($R$19:$R$459,$P520,$Y$19:$Y$459))","v":0},null,null,null,{"$f":"IF(P521=\"\",$W$533-SUM(OFFSET($W$512:W519,0,0,COUNTA($W$512:W519),1)),ROUND(S520*(1+BDI.Taxa),2))","v":0},null,null,{"$f":"IF(P521=\"\",$Z$533-SUM(OFFSET($Z$512:Z$512,0,0,COUNTA($Z$512:Z519),1)),ROUND(W520*100/$X$462,2))","v":{"$error":"#DIV/0!"}}]
[null,null,null,null,null,null,null,null,null,null,null,null,null,null,"10.","",null,null,{"$f":"IF(P522=\"\",$S$533-SUM(OFFSET($S$512:S520,0,0,COUNTA($S$512:S520),1)),SUMIF($R$19:$R$459,$P521,$Y$19:$Y$459))","v":0},null,null,null,{"$f":"IF(P522=\"\",$W$533-SUM(OFFSET($W$512:W520,0,0,COUNTA($W$512:W520),1)),ROUND(S521*(1+BDI.Taxa),2))","v":0},null,null,{"$f":"IF(P522=\"\",$Z$533-SUM(OFFSET($Z$512:Z$512,0,0,COUNTA($Z$512:Z520),1)),ROUND(W521*100/$X$462,2))","v":{"$error":"#DIV/0!"}}]
[null,null,null,null,null,null,null,null,null,null,null,null,null,null,"11.","",null,null,{"$f":"IF(P523=\"\",$S$533-SUM(OFFSET($S$512:S521,0,0,COUNTA($S$512:S521),1)),SUMIF($R$19:$R$459,$P522,$Y$19:$Y$459))","v":0},null,null,null,{"$f":"IF(P523=\"\",$W$533-SUM(OFFSET($W$512:W521,0,0,COUNTA($W$512:W521),1)),ROUND(S522*(1+BDI.Taxa),2))","v":0},null,null,{"$f":"IF(P523=\"\",$Z$533-SUM(OFFSET($Z$512:Z$512,0,0,COUNTA($Z$512:Z521),1)),ROUND(W522*100/$X$462,2))","v":{"$error":"#DIV/0!"}}]
[null,null,null,null,null,null,null,null,null,null,null,null,null,null,"12.","",null,null,{"$f":"IF(P524=\"\",$S$533-SUM(OFFSET($S$512:S522,0,0,COUNTA($S$512:S522),1)),SUMIF($R$19:$R$459,$P523,$Y$19:$Y$459))","v":0},null,null,null,{"$f":"IF(P524=\"\",$W$533-SUM(OFFSET($W$512:W522,0,0,COUNTA($W$512:W522),1)),ROUND(S523*(1+BDI.Taxa),2))","v":0},null,null,{"$f":"IF(P524=\"\",$Z$533-SUM(OFFSET($Z$512:Z$512,0,0,COUNTA($Z$512:Z522),1)),ROUND(W523*100/$X$462,2))","v":{"$error":"#DIV/0!"}}]
[null,null,null,null,null,null,null,null,null,null,null,null,null,null,"13.","",null,null,{"$f":"IF(P525=\"\",$S$533-SUM(OFFSET($S$512:S523,0,0,COUNTA($S$512:S523),1)),SUMIF($R$19:$R$459,$P524,$Y$19:$Y$459))","v":0},null,null,null,{"$f":"IF(P525=\"\",$W$533-SUM(OFFSET($W$512:W523,0,0,COUNTA($W$512:W523),1)),ROUND(S524*(1+BDI.Taxa),2))","v":0},null,null,{"$f":"IF(P525=\"\",$Z$533-SUM(OFFSET($Z$512:Z$512,0,0,COUNTA($Z$512:Z523),1)),ROUND(W524*100/$X$462,2))","v":{"$error":"#DIV/0!"}}]
[null,null,null,null,null,null,null,null,null,null,null,null,null,null,"14.","",null,null,{"$f":"IF(P526=\"\",$S$533-SUM(OFFSET($S$512:S524,0,0,COUNTA($S$512:S524),1)),SUMIF($R$19:$R$459,$P525,$Y$19:$Y$459))","v":0},null,null,null,{"$f":"IF(P526=\"\",$W$533-SUM(OFFSET($W$512:W524,0,0,COUNTA($W$512:W524),1)),ROUND(S525*(1+BDI.Taxa),2))","v":0},null,null,{"$f":"IF(P526=\"\",$Z$533-SUM(OFFSET($Z$512:Z$512,0,0,COUNTA($Z$512:Z524),1)),ROUND(W525*100/$X$462,2))","v":{"$error":"#DIV/0!"}}]
[null,null,null,null,null,null,null,null,null,null,null,null,null,null,"15.","",null,null,{"$f":"IF(P527=\"\",$S$533-SUM(OFFSET($S$512:S525,0,0,COUNTA($S$512:S525),1)),SUMIF($R$19:$R$459,$P526,$Y$19:$Y$459))","v":0},null,null,null,{"$f":"IF(P527=\"\",$W$533-SUM(OFFSET($W$512:W525,0,0,COUNTA($W$512:W525),1)),ROUND(S526*(1+BDI.Taxa),2))","v":0},null,null,{"$f":"IF(P527=\"\",$Z$533-SUM(OFFSET($Z$512:Z$512,0,0,COUNTA($Z$512:Z525),1)),ROUND(W526*100/$X$462,2))","v":{"$error":"#DIV/0!"}}]
[null,null,null,null,null,null,null,null,null,null,null,null,null,null,"16.","",null,null,{"$f":"IF(P528=\"\",$S$533-SUM(OFFSET($S$512:S526,0,0,COUNTA($S$512:S526),1)),SUMIF($R$19:$R$459,$P527,$Y$19:$Y$459))","v":0},null,null,null,{"$f":"IF(P528=\"\",$W$533-SUM(OFFSET($W$512:W526,0,0,COUNTA($W$512:W526),1)),ROUND(S527*(1+BDI.Taxa),2))","v":0},null,null,{"$f":"IF(P528=\"\",$Z$533-SUM(OFFSET($Z$512:Z$512,0,0,COUNTA($Z$512:Z526),1)),ROUND(W527*100/$X$462,2))","v":{"$error":"#DIV/0!"}}]
[null,null,null,null,null,null,null,null,null,null,null,null,null,null,"17.","",null,null,{"$f":"IF(P529=\"\",$S$533-SUM(OFFSET($S$512:S527,0,0,COUNTA($S$512:S527),1)),SUMIF($R$19:$R$459,$P528,$Y$19:$Y$459))","v":0},null,null,null,{"$f":"IF(P529=\"\",$W$533-SUM(OFFSET($W$512:W527,0,0,COUNTA($W$512:W527),1)),ROUND(S528*(1+BDI.Taxa),2))","v":0},null,null,{"$f":"IF(P529=\"\",$Z$533-SUM(OFFSET($Z$512:Z$512,0,0,COUNTA($Z$512:Z527),1)),ROUND(W528*100/$X$462,2))","v":{"$error":"#DIV/0!"}}]
[null,null,null,null,null,null,null,null,null,null,null,null,null,null,"18.","",null,null,{"$f":"IF(P530=\"\",$S$533-SUM(OFFSET($S$512:S528,0,0,COUNTA($S$512:S528),1)),SUMIF($R$19:$R$459,$P529,$Y$19:$Y$459))","v":0},null,null,null,{"$f":"IF(P530=\"\",$W$533-SUM(OFFSET($W$512:W528,0,0,COUNTA($W$512:W528),1)),ROUND(S529*(1+BDI.Taxa),2))","v":0},null,null,{"$f":"IF(P530=\"\",$Z$533-SUM(OFFSET($Z$512:Z$512,0,0,COUNTA($Z$512:Z528),1)),ROUND(W529*100/$X$462,2))","v":{"$error":"#DIV/0!"}}]
[null,null,null,null,null,null,null,null,null,null,null,null,null,null,"19.","",null,null,{"$f":"IF(P531=\"\",$S$533-SUM(OFFSET($S$512:S529,0,0,COUNTA($S$512:S529),1)),SUMIF($R$19:$R$459,$P530,$Y$19:$Y$459))","v":0},null,null,null,{"$f":"IF(P531=\"\",$W$533-SUM(OFFSET($W$512:W529,0,0,COUNTA($W$512:W529),1)),ROUND(S530*(1+BDI.Taxa),2))","v":0},null,null,{"$f":"IF(P531=\"\",$Z$533-SUM(OFFSET($Z$512:Z$512,0,0,COUNTA($Z$512:Z529),1)),ROUND(W530*100/$X$462,2))","v":{"$error":"#DIV/0!"}}]
[null,null,null,null,null,null,null,null,null,null,null,null,null,null,"20.","",null,null,{"$f":"IF(P532=\"\",$S$533-SUM(OFFSET($S$512:S530,0,0,COUNTA($S$512:S530),1)),SUMIF($R$19:$R$459,$P531,$Y$19:$Y$459))","v":0},null,null,null,{"$f":"IF(P532=\"\",$W$533-SUM(OFFSET($W$512:W530,0,0,COUNTA($W$512:W530),1)),ROUND(S531*(1+BDI.Taxa),2))","v":0},null,null,{"$f":"IF(P532=\"\",$Z$533-SUM(OFFSET($Z$512:Z$512,0,0,COUNTA($Z$512:Z530),1)),ROUND(W531*100/$X$462,2))","v":{"$error":"#DIV/0!"}}]
[null,null,null,null,null,null,null,null,null,null,null,null,null,null,"TOTAL GERAL DO ORÇAMENTO (R$)",null,null,null,{"$f":"SUM(S512:V531)","v":0},null,null,null,{"$f":"SUM(W512:Y531)","v":0},null,null,{"$f":"SUM(Z512:Z531)","v":{"$error":"#DIV/0!"}}]
[null,null,null,null,null,null,null,null,null,null,null,null,null,null,null,null,null,null,{"$f":"$X$460","v":0},null,null,null,{"$f":"$X$462","v":0},null,null,100]
[null,null,null,null,null,null,null,null,null,null,null,null,null,null,null,null,null,null,"(TOTAL SEM BDI)",null,null,null,"(TOTAL COM BDI)",null,null,"(ARRED porcentagem)"]
[null,null,null,null,null,null,null,null,null,null,null,null,null,null,null,null,null,null,{"$f":"IF(AND(S532=S533,S532>0),\"OK\",\"ERRO\")","v":"ERRO"},null,null,null,{"$f":"IF(AND(W532=W533,W532>0),\"OK\",\"ERRO\")","v":"ERRO"},null,null,{"$f":"IF(Z532=100,\"OK\",\"ERRO\")","v":{"$error":"#DIV/0!"}}]

{"sheet":"Resumo ","index":1,"n_rows":37,"n_cols":8,"rows_kept":37,"cut":false,"hidden":false,"merged":[[0,0,0,7],[19,1,19,4],[28,1,28,2],[29,1,29,2],[6,5,6,7],[7,0,7,7],[8,5,8,7],[9,5,9,7],[13,0,13,7],[1,0,1,7],[2,5,2,7],[3,5,3,7],[17,1,17,4],[18,1,18,4],[4,0,4,7],[5,5,5,7],[16,1,16,4],[31,1,31,2],[32,1,32,2],[33,1,33,2],[30,1,30,2],[21,1,21,2],[22,1,22,2],[9,0,9,4],[11,2,11,4],[12,2,12,4],[10,0,10,7],[11,5,11,7],[12,5,12,7],[2,0,2,4],[3,0,3,4],[5,0,5,4],[6,0,6,4],[8,0,8,4],[42,2,42,6],[11,0,11,1],[12,0,12,1],[14,0,14,7],[23,1,23,2],[20,1,20,2],[41,2,41,6],[24,1,24,2],[26,1,26,2],[27,1,27,2],[38,0,38,7],[25,1,25,2],[36,0,36,4],[34,1,34,2],[35,1,35,2],[15,1,15,4]]}
[]
[]
["UNIDADE ESCOLAR",null,null,null,null,"CÓDIGO INEP"]
[{"$f":"Orçamento!$O$4","v":"COLÉGIO ESTADUAL SÃO GERALDO"},null,null,null,null,{"$f":"Orçamento!W4","v":52038343}]
[]
["OBRA",null,null,null,null,"CIDADE"]
[{"$f":"Orçamento!$O$7","v":"AMPLIAÇÃO E REFORMA"},null,null,null,null,{"$f":"Orçamento!$W$7","v":"GOIANIRA"}]
[]
["ENDEREÇO",null,null,null,null,"CRECE"]
[{"$f":"Orçamento!$R$10","v":"RUA 1 S/N, VILA LEO LYNCE, CEP:75370-000"},null,null,null,null,{"$f":"Orçamento!$O$10","v":"INHUMAS"}]
[]
["REFERÊNCIA",null,"DATA",null,null,"ÁREA TOTAL CONSTRUÍDA (M²)"]
[{"$f":"CONCATENATE(\"AGETOP E SINAPI - \",Orçamento!$Y$10)","v":"AGETOP E SINAPI - NÃO DESONERADA"},null,{"$f":"Orçamento!$S$7","v":"2020-04-08"},null,null,{"$f":"Orçamento!$S$13","v":2504.21}]
[]
["RESUMO GERAL DO ORÇAMENTO"]
["ITEM","DESCRIÇÃO DOS SERVIÇOS",null,null,null,"PREÇO SEM BDI","PREÇO COM BDI","PARTICIP. (%)"]
["1.",{"$f":"Orçamento!$P512","v":"REFORMA"},null,null,null,{"$f":"IFERROR(Orçamento!S512,\"-\")","v":0},{"$f":"IFERROR(Orçamento!W512,\"\")","v":0},{"$f":"Orçamento!Z512","v":{"$error":"#DIV/0!"}}]
["2.",{"$f":"Orçamento!$P513","v":"IMPLANTAÇÃO"},null,null,null,{"$f":"IFERROR(Orçamento!S513,\"-\")","v":0},{"$f":"IFERROR(Orçamento!W513,\"\")","v":0},{"$f":"Orçamento!Z513","v":{"$error":"#DIV/0!"}}]
["3.","BLOCO 3 SALAS SEDUC17 (x3)",null,null,null,{"$f":"IFERROR(Orçamento!S514,\"-\")","v":0},{"$f":"IFERROR(Orçamento!W514,\"\")","v":0},{"$f":"Orçamento!Z514","v":{"$error":"#DIV/0!"}}]
["4.",{"$f":"Orçamento!$P515","v":"BLOCO SANITÁRIO SEDUC13"},null,null,null,{"$f":"IFERROR(Orçamento!S515,\"-\")","v":0},{"$f":"IFERROR(Orçamento!W515,\"\")","v":0},{"$f":"Orçamento!Z515","v":{"$error":"#DIV/0!"}}]
["5.",{"$f":"Orçamento!$P516","v":""},null,null,null,{"$f":"IFERROR(Orçamento!S516,\"-\")","v":0},{"$f":"IFERROR(Orçamento!W516,\"\")","v":0},{"$f":"Orçamento!Z516","v":{"$error":"#DIV/0!"}}]
["6.",{"$f":"Orçamento!$P517","v":""},null,null,null,{"$f":"IFERROR(Orçamento!S517,\"-\")","v":0},{"$f":"IFERROR(Orçamento!W517,\"\")","v":0},{"$f":"Orçamento!Z517","v":{"$error":"#DIV/0!"}}]
["7.",{"$f":"Orçamento!$P518","v":""},null,null,null,{"$f":"IFERROR(Orçamento!S518,\"-\")","v":0},{"$f":"IFERROR(Orçamento!W518,\"\")","v":0},{"$f":"Orçamento!Z518","v":{"$error":"#DIV/0!"}}]
["8.",{"$f":"Orçamento!$P519","v":""},null,null,null,{"$f":"IFERROR(Orçamento!S519,\"-\")","v":0},{"$f":"IFERROR(Orçamento!W519,\"\")","v":0},{"$f":"Orçamento!Z519","v":{"$error":"#DIV/0!"}}]
["9.",{"$f":"Orçamento!$P520","v":""},null,null,null,{"$f":"IFERROR(Orçamento!S520,\"-\")","v":0},{"$f":"IFERROR(Orçamento!W520,\"\")","v":0},{"$f":"Orçamento!Z520","v":{"$error":"#DIV/0!"}}]
["10.",{"$f":"Orçamento!$P521","v":""},null,null,null,{"$f":"IFERROR(Orçamento!S521,\"-\")","v":0},{"$f":"IFERROR(Orçamento!W521,\"\")","v":0},{"$f":"Orçamento!Z521","v":{"$error":"#DIV/0!"}}]
["11.",{"$f":"Orçamento!$P522","v":""},null,null,null,{"$f":"IFERROR(Orçamento!S522,\"-\")","v":0},{"$f":"IFERROR(Orçamento!W522,\"\")","v":0},{"$f":"Orçamento!Z522","v":{"$error":"#DIV/0!"}}]
["12.",{"$f":"Orçamento!$P523","v":""},null,null,null,{"$f":"IFERROR(Orçamento!S523,\"-\")","v":0},{"$f":"IFERROR(Orçamento!W523,\"\")","v":0},{"$f":"Orçamento!Z523","v":{"$error":"#DIV/0!"}}]
["13.",{"$f":"Orçamento!$P524","v":""},null,null,null,{"$f":"IFERROR(Orçamento!S524,\"-\")","v":0},{"$f":"IFERROR(Orçamento!W524,\"\")","v":0},{"$f":"Orçamento!Z524","v":{"$error":"#DIV/0!"}}]
["14.",{"$f":"Orçamento!$P525","v":""},null,null,null,{"$f":"IFERROR(Orçamento!S525,\"-\")","v":0},{"$f":"IFERROR(Orçamento!W525,\"\")","v":0},{"$f":"Orçamento!Z525","v":{"$error":"#DIV/0!"}}]
["15.",{"$f":"Orçamento!$P526","v":""},null,null,null,{"$f":"IFERROR(Orçamento!S526,\"-\")","v":0},{"$f":"IFERROR(Orçamento!W526,\"\")","v":0},{"$f":"Orçamento!Z526","v":{"$error":"#DIV/0!"}}]
["16.",{"$f":"Orçamento!$P527","v":""},null,null,null,{"$f":"IFERROR(Orçamento!S527,\"-\")","v":0},{"$f":"IFERROR(Orçamento!W527,\"\")","v":0},{"$f":"Orçamento!Z527","v":{"$error":"#DIV/0!"}}]
["17.",{"$f":"Orçamento!$P528","v":""},null,null,null,{"$f":"IFERROR(Orçamento!S528,\"-\")","v":0},{"$f":"IFERROR(Orçamento!W528,\"\")","v":0},{"$f":"Orçamento!Z528","v":{"$error":"#DIV/0!"}}]
["18.",{"$f":"Orçamento!$P529","v":""},null,null,null,{"$f":"IFERROR(Orçamento!S529,\"-\")","v":0},{"$f":"IFERROR(Orçamento!W529,\"\")","v":0},{"$f":"Orçamento!Z529","v":{"$error":"#DIV/0!"}}]
["19.",{"$f":"Orçamento!$P530","v":""},null,null,null,{"$f":"IFERROR(Orçamento!S530,\"-\")","v":0},{"$f":"IFERROR(Orçamento!W530,\"\")","v":0},{"$f":"Orçamento!Z530","v":{"$error":"#DIV/0!"}}]
["20.",{"$f":"Orçamento!$P531","v":""},null,null,null,{"$f":"IFERROR(Orçamento!S531,\"-\")","v":0},{"$f":"IFERROR(Orçamento!W531,\"\")","v":0},{"$f":"Orçamento!Z531","v":{"$error":"#DIV/0!"}}]
["TOTAL GERAL DO ORÇAMENTO (R$)",null,null,null,null,{"$f":"SUM(F17:F36)","v":0},0,{"$f":"SUM(H17:H36)","v":{"$error":"#DIV/0!"}}]

{"sheet":"Somatório","index":2,"n_rows":45,"n_cols":6,"rows_kept":45,"cut":false,"hidden":false,"merged":[[13,0,14,0],[42,1,42,2],[44,1,44,5],[47,3,47,5],[48,3,48,5],[13,1,13,5],[9,1,9,3],[9,4,9,5],[11,1,11,2],[11,4,11,5],[12,1,12,2],[12,4,12,5],[0,1,0,5],[14,1,14,5],[2,1,2,3],[2,4,2,5],[3,1,3,3],[3,4,3,5],[5,1,5,3],[5,4,5,5],[6,1,6,3],[6,4,6,5],[8,1,8,3],[8,4,8,5],[1,1,1,5],[4,1,4,5],[7,1,7,5],[10,1,10,5]]}
[]
[]
[null,"UNIDADE ESCOLAR",null,null,"CÓDIGO INEP"]
[null,{"$f":"Orçamento!$O$4","v":"COLÉGIO ESTADUAL SÃO GERALDO"},null,null,{"$f":"Orçamento!W4","v":52038343}]
[]
[null,"OBRA",null,null,"CIDADE"]
[null,{"$f":"Orçamento!$O$7","v":"AMPLIAÇÃO E REFORMA"},null,null,{"$f":"Orçamento!$W$7","v":"GOIANIRA"}]
[]
[null,"ENDEREÇO",null,null,"CRECE"]
[null,{"$f":"Orçamento!$R$10","v":"RUA 1 S/N, VILA LEO LYNCE, CEP:75370-000"},null,null,{"$f":"Orçamento!$O$10","v":"INHUMAS"}]
[]
[null,"REFERÊNCIA",null,"DATA","ÁREA TOTAL CONSTRUÍDA (M²)"]
[null,{"$f":"CONCATENATE(\"AGETOP E SINAPI - \",Orçamento!$Y$10)","v":"AGETOP E SINAPI - NÃO DESONERADA"},null,{"$f":"Orçamento!$S$7","v":"2020-04-08"},{"$f":"Orçamento!$S$13","v":2504.21}]
["FILTRO"]
[null,"SOMATÓRIO DE SERVIÇOS"]
["↓","ITEM","DESCRIÇÃO DOS SERVIÇOS","PREÇO SEM BDI (R$)","PREÇO COM BDI (R$)","PARTIC.  ( % )"]
[{"$f":"IF(D17>0,\"F\",\"\")","v":""},"a.",{"$f":"Orçamento!P478","v":"SERVIÇOS PRELIMINARES"},{"$f":"Orçamento!S478","v":0},{"$f":"Orçamento!W478","v":0},{"$f":"Orçamento!Z478","v":0}]
[{"$f":"IF(D18>0,\"F\",\"\")","v":""},"b.",{"$f":"Orçamento!P479","v":"TRANSPORTES"},{"$f":"Orçamento!S479","v":0},{"$f":"Orçamento!W479","v":0},{"$f":"Orçamento!Z479","v":0}]
["","c.",{"$f":"Orçamento!P480","v":"SERVIÇO EM TERRA"},{"$f":"Orçamento!S480","v":0},{"$f":"Orçamento!W480","v":0},{"$f":"Orçamento!Z480","v":0}]
["","d.",{"$f":"Orçamento!P481","v":"FUNDAÇÕES E SONDAGENS"},{"$f":"Orçamento!S481","v":0},{"$f":"Orçamento!W481","v":0},{"$f":"Orçamento!Z481","v":0}]
["","e.",{"$f":"Orçamento!P482","v":"ESTRUTURA"},{"$f":"Orçamento!S482","v":0},{"$f":"Orçamento!W482","v":0},{"$f":"Orçamento!Z482","v":0}]
["","f.",{"$f":"Orçamento!P483","v":"INSTALAÇÕES ELÉTRICAS"},{"$f":"Orçamento!S483","v":0},{"$f":"Orçamento!W483","v":0},{"$f":"Orçamento!Z483","v":0}]
["","g.",{"$f":"Orçamento!P484","v":"INSTALAÇÕES HIDROSSANITÁRIAS"},{"$f":"Orçamento!S484","v":0},{"$f":"Orçamento!W484","v":0},{"$f":"Orçamento!Z484","v":0}]
["","h",{"$f":"Orçamento!P485","v":"INSTALAÇÕES ESPECIAIS"},{"$f":"Orçamento!S485","v":0},{"$f":"Orçamento!W485","v":0},{"$f":"Orçamento!Z485","v":0}]
["","i.",{"$f":"Orçamento!P486","v":"ALVENARIAS E DIVISÓRIAS"},{"$f":"Orçamento!S486","v":0},{"$f":"Orçamento!W486","v":0},{"$f":"Orçamento!Z486","v":0}]
["","j.",{"$f":"Orçamento!P487","v":"ALVENARIA AUTO-PORTANTE"},{"$f":"Orçamento!S487","v":0},{"$f":"Orçamento!W487","v":0},{"$f":"Orçamento!Z487","v":0}]
["","k.",{"$f":"Orçamento!P488","v":"IMPERMEABILIZACAO"},{"$f":"Orçamento!S488","v":0},{"$f":"Orçamento!W488","v":0},{"$f":"Orçamento!Z488","v":0}]
["","l.",{"$f":"Orçamento!P489","v":"ISOLAMENTO TÉRMICO E ACÚSTICO"},{"$f":"Orçamento!S489","v":0},{"$f":"Orçamento!W489","v":0},{"$f":"Orçamento!Z489","v":0}]
["","m.",{"$f":"Orçamento!P490","v":"ESTRUTURA DE MADEIRA"},{"$f":"Orçamento!S490","v":0},{"$f":"Orçamento!W490","v":0},{"$f":"Orçamento!Z490","v":0}]
["","n.",{"$f":"Orçamento!P491","v":"ESTRUTURAS METÁLICAS"},{"$f":"Orçamento!S491","v":0},{"$f":"Orçamento!W491","v":0},{"$f":"Orçamento!Z491","v":0}]
["","o.",{"$f":"Orçamento!P492","v":"COBERTURAS"},{"$f":"Orçamento!S492","v":0},{"$f":"Orçamento!W492","v":0},{"$f":"Orçamento!Z492","v":0}]
["","p.",{"$f":"Orçamento!P493","v":"ESQUADRIAS DE MADEIRA"},{"$f":"Orçamento!S493","v":0},{"$f":"Orçamento!W493","v":0},{"$f":"Orçamento!Z493","v":0}]
["","q.",{"$f":"Orçamento!P494","v":"ESQUADRIAS METÁLICAS"},{"$f":"Orçamento!S494","v":0},{"$f":"Orçamento!W494","v":0},{"$f":"Orçamento!Z494","v":0}]
["","r.",{"$f":"Orçamento!P495","v":"VIDROS"},{"$f":"Orçamento!S495","v":0},{"$f":"Orçamento!W495","v":0},{"$f":"Orçamento!Z495","v":0}]
["","s.",{"$f":"Orçamento!P496","v":"REVESTIMENTO DE PAREDE"},{"$f":"Orçamento!S496","v":0},{"$f":"Orçamento!W496","v":0},{"$f":"Orçamento!Z496","v":0}]
["","t.",{"$f":"Orçamento!P497","v":"FORROS"},{"$f":"Orçamento!S497","v":0},{"$f":"Orçamento!W497","v":0},{"$f":"Orçamento!Z497","v":0}]
["","u.",{"$f":"Orçamento!P498","v":"REVESTIMENTO DE PISO"},{"$f":"Orçamento!S498","v":0},{"$f":"Orçamento!W498","v":0},{"$f":"Orçamento!Z498","v":0}]
["","v.",{"$f":"Orçamento!P499","v":"FERRAGENS"},{"$f":"Orçamento!S499","v":0},{"$f":"Orçamento!W499","v":0},{"$f":"Orçamento!Z499","v":0}]
["","w.",{"$f":"Orçamento!P500","v":"MARCENARIA"},{"$f":"Orçamento!S500","v":0},{"$f":"Orçamento!W500","v":0},{"$f":"Orçamento!Z500","v":0}]
["","x.",{"$f":"Orçamento!P501","v":"ADMINISTRAÇÃO"},{"$f":"Orçamento!S501","v":0},{"$f":"Orçamento!W501","v":0},{"$f":"Orçamento!Z501","v":0}]
["","y.",{"$f":"Orçamento!P502","v":"PINTURA"},{"$f":"Orçamento!S502","v":0},{"$f":"Orçamento!W502","v":0},{"$f":"Orçamento!Z502","v":0}]
["","z.",{"$f":"Orçamento!P503","v":"DIVERSOS"},{"$f":"Orçamento!S503","v":0},{"$f":"Orçamento!W503","v":0},{"$f":"Orçamento!Z503","v":0}]
["F","TOTAL GERAL DO ORÇAMENTO",null,{"$f":"SUM(D17:D42)","v":0},{"$f":"SUM(E17:E42)","v":0},{"$f":"SUM(F17:F42)","v":0}]
[]
[null,"(*) Para itens da AGETOP, os vidros não estão inclusos nas esquadrias e já foram considerados os custos de contramarco para as esquadrias de alumínio;"]

{"sheet":"Cronog_60_Dias","index":3,"n_rows":98,"n_cols":20,"rows_kept":98,"cut":false,"hidden":false,"merged":[[11,0,12,0],[8,0,10,0],[10,1,10,13],[91,1,91,2],[91,5,91,8],[91,9,91,12],[92,1,92,2],[92,5,92,8],[92,9,92,12],[73,9,73,12],[73,5,73,8],[67,9,67,12],[69,5,69,8],[69,9,69,12],[58,5,58,8],[70,1,72,2],[70,4,72,4],[70,5,70,8],[70,9,70,12],[72,5,72,8],[72,9,72,12],[58,9,58,12],[60,5,60,8],[60,9,60,12],[93,1,93,2],[93,5,93,8],[93,9,93,12],[75,5,75,8],[75,9,75,12],[76,5,76,8],[76,9,76,12],[78,5,78,8],[78,9,78,12],[79,5,79,8],[79,9,79,12],[81,5,81,8],[81,9,81,12],[76,3,78,3],[79,3,81,3],[85,1,87,2],[79,4,81,4],[94,1,94,2],[94,5,94,8],[94,9,94,12],[96,1,96,4],[97,1,97,13],[85,9,85,12],[87,5,87,8],[87,9,87,12],[84,5,84,8],[84,9,84,12],[88,1,90,2],[88,4,90,4],[88,5,88,8],[88,9,88,12],[90,5,90,8],[90,9,90,12],[88,3,90,3],[85,4,87,4],[85,5,85,8],[85,3,87,3],[82,1,84,2],[82,4,84,4],[82,5,82,8],[82,9,82,12],[67,5,67,8],[64,5,64,8],[64,9,64,12],[66,5,66,8],[66,9,66,12],[64,3,66,3],[61,9,61,12],[63,5,63,8],[63,9,63,12],[61,5,61,8],[52,9,52,12],[54,5,54,8],[54,9,54,12],[49,5,49,8],[49,9,49,12],[51,5,51,8],[51,9,51,12],[55,9,55,12],[57,5,57,8],[57,9,57,12],[52,5,52,8],[55,5,55,8],[43,9,43,12],[45,5,45,8],[45,9,45,12],[46,1,48,2],[46,4,48,4],[46,5,46,8],[46,9,46,12],[48,5,48,8],[48,9,48,12],[43,5,43,8],[46,3,48,3],[34,9,34,12],[36,5,36,8],[36,9,36,12],[34,3,36,3],[39,9,39,12],[37,3,39,3],[37,9,37,12],[40,1,42,2],[40,4,42,4],[40,5,40,8],[40,9,40,12],[42,5,42,8],[42,9,42,12],[40,3,42,3],[34,5,34,8],[37,5,37,8],[39,5,39,8],[28,9,28,12],[30,5,30,8],[30,9,30,12],[31,1,33,2],[31,4,33,4],[31,5,31,8],[31,9,31,12],[33,5,33,8],[33,9,33,12],[31,3,33,3],[28,5,28,8],[28,1,30,2],[28,4,30,4],[22,9,22,12],[24,5,24,8],[24,9,24,12],[25,1,27,2],[25,4,27,4],[25,5,25,8],[25,9,25,12],[27,5,27,8],[27,9,27,12],[22,3,24,3],[22,1,24,2],[22,4,24,4],[22,5,22,8],[25,3,27,3],[19,1,21,2],[19,4,21,4],[19,5,19,8],[19,9,19,12],[21,5,21,8],[21,9,21,12],[19,3,21,3],[13,3,15,3],[16,3,18,3],[13,4,15,4],[13,5,13,8],[13,9,13,12],[15,5,15,8],[15,9,15,12],[11,13,12,13],[12,1,12,2],[12,5,12,8],[12,9,12,12],[11,3,12,3],[11,9,11,12],[13,1,15,2],[11,5,11,8],[16,1,18,2],[16,4,18,4],[16,5,16,8],[16,9,16,12],[18,5,18,8],[18,9,18,12],[58,3,60,3],[43,1,45,2],[43,4,45,4],[52,1,54,2],[82,3,84,3],[52,4,54,4],[58,1,60,2],[58,4,60,4],[73,1,75,2],[76,1,78,2],[76,4,78,4],[79,1,81,2],[64,1,66,2],[67,3,69,3],[61,3,63,3],[67,1,69,2],[55,3,57,3],[64,4,66,4],[1,3,1,7],[1,8,1,13],[0,1,8,2],[0,3,0,13],[3,3,3,13],[6,3,6,13],[49,1,51,2],[70,3,72,3],[73,3,75,3],[49,4,51,4],[73,4,75,4],[55,1,57,2],[55,4,57,4],[28,3,30,3],[34,1,36,2],[34,4,36,4],[49,3,51,3],[52,3,54,3],[67,4,69,4],[43,3,45,3],[61,1,63,2],[61,4,63,4],[37,1,39,2],[37,4,39,4],[9,1,9,13],[8,8,8,13],[7,8,7,13],[2,8,2,13],[5,8,5,13],[4,8,4,13],[8,3,8,7],[7,3,7,7],[5,3,5,7],[4,3,4,7],[2,3,2,7]]}
[]
[null,null,null,"UNIDADE ESCOLAR",null,null,null,null,"PRAZO"]
[null,null,null,{"$f":"Orçamento!$O$4","v":"COLÉGIO ESTADUAL SÃO GERALDO"},null,null,null,null,"60 DIAS CORRIDOS"]
[]
[null,null,null,"OBRA",null,null,null,null,"DATA"]
[null,null,null,{"$f":"Orçamento!$O$7","v":"AMPLIAÇÃO E REFORMA"},null,null,null,null,{"$f":"Orçamento!$S$7","v":"2020-04-08"}]
[]
[null,null,null,"LOCAL",null,null,null,null,"ÁREA TOTAL CONSTRUÍDA (M²)"]
["FILTRO",null,null,{"$f":"Orçamento!$W$7","v":"GOIANIRA"},null,null,null,null,{"$f":"Orçamento!$S$13","v":2504.21}]
[]
[null,"CRONOGRAMA - FÍSICO FINANCEIRO"]
["↓","CUSTO TOTAL:",{"$f":"D92","v":0},"VALOR","Dias:",30,null,null,null,60,null,null,null,"TOTAL"]
[null,"DESCRIÇÃO DOS SERVIÇOS",null,null,"%","1ª PARCELA",null,null,null,"2ª PARCELA"]
[{"$f":"IF(D14>0,\"F\",\"\")","v":""},"SERVIÇOS PRELIMINARES",null,{"$f":"Orçamento!W478","v":0},{"$f":"Orçamento!Z478","v":0},{"$f":"ROUND(F16*$D$14,2)","v":0},null,null,null,{"$f":"ROUND(J16*$D$14,2)","v":0},null,null,null,{"$f":"SUM(F14:M14)","v":0},null,null,{"$f":"F14","v":0},{"$f":"J14","v":0},{"$f":"Q14+R14","v":0},{"$f":"IF(S14=N14,\"OK\",\"ERRO\")","v":"OK"}]
[{"$f":"IF(A14=\"F\",A14,\"\")","v":""},null,null,null,null,null,null,null,null,null,null,null,null,null,null,null,null,null,{"$f":"Q15+R15","v":0}]
[{"$f":"IF(A15=\"F\",A15,\"\")","v":""},null,null,null,null,1,null,null,null,{"$f":"1-F16","v":0},null,null,null,{"$f":"IFERROR(E14/100,\"\")","v":0},null,null,null,null,0]
[{"$f":"IF(D17>0,\"F\",\"\")","v":""},"TRANSPORTES",null,{"$f":"Orçamento!W479","v":0},{"$f":"Orçamento!Z479","v":0},{"$f":"ROUND(F19*$D$17,2)","v":0},null,null,null,{"$f":"ROUND(J19*$D$17,2)","v":0},null,null,null,{"$f":"SUM(F17:M17)","v":0},null,null,{"$f":"F17","v":0},{"$f":"J17","v":0},0,{"$f":"IF(S17=N17,\"OK\",\"ERRO\")","v":"OK"}]
[{"$f":"IF(A17=\"F\",A17,\"\")","v":""},null,null,null,null,null,null,null,null,null,null,null,null,null,null,null,null,0,0]
[{"$f":"IF(A18=\"F\",A18,\"\")","v":""},null,null,null,null,0.48,null,null,null,{"$f":"1-F19","v":0.52},null,null,null,{"$f":"IFERROR(E17/100,\"\")","v":0},null,null,null,null,0]
[{"$f":"IF(D20>0,\"F\",\"\")","v":""},"SERVIÇO EM TERRA",null,{"$f":"Orçamento!W480","v":0},{"$f":"Orçamento!Z480","v":0},{"$f":"ROUND(F22*$D$20,2)","v":0},null,null,null,{"$f":"ROUND(J22*$D$20,2)","v":0},null,null,null,{"$f":"SUM(F20:M20)","v":0},null,null,0,0,0,{"$f":"IF(S20=N20,\"OK\",\"ERRO\")","v":"OK"}]
[{"$f":"IF(A20=\"F\",A20,\"\")","v":""},null,null,null,null,null,null,null,null,null,null,null,null,null,null,null,null,null,0]
[{"$f":"IF(A21=\"F\",A21,\"\")","v":""},null,null,null,null,1,null,null,null,{"$f":"1-F22","v":0},null,null,null,{"$f":"IFERROR(E20/100,\"\")","v":0},null,null,null,null,0]
[{"$f":"IF(D23>0,\"F\",\"\")","v":""},"FUNDAÇÕES E SONDAGENS",null,{"$f":"Orçamento!W481","v":0},{"$f":"Orçamento!Z481","v":0},{"$f":"ROUND(F25*$D$23,2)","v":0},null,null,null,{"$f":"ROUND(J25*$D$23,2)","v":0},null,null,null,{"$f":"SUM(F23:M23)","v":0},null,null,0,0,0,"OK"]
[{"$f":"IF(A23=\"F\",A23,\"\")","v":""},null,null,null,null,null,null,null,null,null,null,null,null,null,null,null,null,null,0]
[{"$f":"IF(A24=\"F\",A24,\"\")","v":""},null,null,null,null,1,null,null,null,{"$f":"1-F25","v":0},null,null,null,{"$f":"IFERROR(E23/100,\"\")","v":0},null,null,null,null,0]
[{"$f":"IF(D26>0,\"F\",\"\")","v":""},"ESTRUTURA",null,{"$f":"Orçamento!W482","v":0},{"$f":"Orçamento!Z482","v":0},{"$f":"ROUND(F28*$D$26,2)","v":0},null,null,null,{"$f":"ROUND(J28*$D$26,2)","v":0},null,null,null,{"$f":"SUM(F26:M26)","v":0},null,null,0,0,0,{"$f":"IF(S26=N26,\"OK\",\"ERRO\")","v":"OK"}]
[{"$f":"IF(A26=\"F\",A26,\"\")","v":""},null,null,null,null,null,null,null,null,null,null,null,null,null,null,null,null,null,0]
[{"$f":"IF(A27=\"F\",A27,\"\")","v":""},null,null,null,null,0.49,null,null,null,{"$f":"1-F28","v":0.51},null,null,null,{"$f":"IFERROR(E26/100,\"\")","v":0},null,null,null,null,0]
[{"$f":"IF(D29>0,\"F\",\"\")","v":""},"INST.ELET/TELEFÔNICA/CABEAMENTO ESTRUTURADO",null,{"$f":"Orçamento!W483","v":0},{"$f":"Orçamento!Z483","v":0},{"$f":"ROUND(F31*$D$29,2)","v":0},null,null,null,{"$f":"ROUND(J31*$D$29,2)","v":0},null,null,null,{"$f":"SUM(F29:M29)","v":0},null,null,0,0,0,"OK"]
[{"$f":"IF(A29=\"F\",A29,\"\")","v":""},null,null,null,null,null,null,null,null,null,null,null,null,null,null,null,null,null,0]
[{"$f":"IF(A30=\"F\",A30,\"\")","v":""},null,null,null,null,0.4,null,null,null,{"$f":"1-F31","v":0.6},null,null,null,{"$f":"IFERROR(E29/100,\"\")","v":0},null,null,null,null,0]
[{"$f":"IF(D32>0,\"F\",\"\")","v":""},"INSTALAÇÕES HIDROSSANITÁRIAS",null,{"$f":"Orçamento!W484","v":0},{"$f":"Orçamento!Z484","v":0},{"$f":"ROUND(F34*$D$32,2)","v":0},null,null,null,{"$f":"ROUND(J34*$D$32,2)","v":0},null,null,null,{"$f":"SUM(F32:M32)","v":0},null,null,0,0,0,{"$f":"IF(S32=N32,\"OK\",\"ERRO\")","v":"OK"}]
[{"$f":"IF(A32=\"F\",A32,\"\")","v":""},null,null,null,null,null,null,null,null,null,null,null,null,null,null,null,null,null,0]
[{"$f":"IF(A33=\"F\",A33,\"\")","v":""},null,null,null,null,0.48,null,null,null,{"$f":"1-F34","v":0.52},null,null,null,{"$f":"IFERROR(E32/100,\"\")","v":0},null,null,null,null,0]
[{"$f":"IF(D35>0,\"F\",\"\")","v":""},"INSTALAÇÕES ESPECIAIS",null,{"$f":"Orçamento!W485","v":0},{"$f":"Orçamento!Z485","v":0},{"$f":"ROUND(F37*$D$35,2)","v":0},null,null,null,{"$f":"ROUND(J37*$D$35,2)","v":0},null,null,null,{"$f":"SUM(F35:M35)","v":0},null,null,0,0,0,"OK"]
[{"$f":"IF(A35=\"F\",A35,\"\")","v":""},null,null,null,null,null,null,null,null,null,null,null,null,null,null,null,null,null,0]
[{"$f":"IF(A36=\"F\",A36,\"\")","v":""},null,null,null,null,1,null,null,null,{"$f":"1-F37","v":0},null,null,null,{"$f":"IFERROR(E35/100,\"\")","v":0},null,null,null,null,0]
[{"$f":"IF(D38>0,\"F\",\"\")","v":""},"ALVENARIA E DIVISÓRIAS",null,{"$f":"Orçamento!W486","v":0},{"$f":"Orçamento!Z486","v":0},{"$f":"ROUND(F40*$D$38,2)","v":0},null,null,null,{"$f":"ROUND(J40*$D$38,2)","v":0},null,null,null,{"$f":"SUM(F38:M38)","v":0},null,null,0,0,0,{"$f":"IF(S38=N38,\"OK\",\"ERRO\")","v":"OK"}]
[{"$f":"IF(A38=\"F\",A38,\"\")","v":""},null,null,null,null,null,null,null,null,null,null,null,null,null,null,null,null,null,0]
[{"$f":"IF(A39=\"F\",A39,\"\")","v":""},null,null,null,null,1,null,null,null,{"$f":"1-F40","v":0},null,null,null,{"$f":"IFERROR(E38/100,\"\")","v":0},null,null,null,null,0]
[{"$f":"IF(D41>0,\"F\",\"\")","v":""},"ALVENARIA AUTO-PORTANTE",null,{"$f":"Orçamento!W487","v":0},{"$f":"Orçamento!Z487","v":0},{"$f":"ROUND(F43*$D$41,2)","v":0},null,null,null,{"$f":"ROUND(J43*$D$41,2)","v":0},null,null,null,{"$f":"SUM(F41:M41)","v":0},null,null,0,0,0,"OK"]
[{"$f":"IF(A41=\"F\",A41,\"\")","v":""},null,null,null,null,null,null,null,null,null,null,null,null,null,null,null,null,null,0]
[{"$f":"IF(A42=\"F\",A42,\"\")","v":""},null,null,null,null,1,null,null,null,{"$f":"1-F43","v":0},null,null,null,{"$f":"IFERROR(E41/100,\"\")","v":0},null,null,null,null,0]
[{"$f":"IF(D44>0,\"F\",\"\")","v":""},"IMPERMEABILIZAÇÃO",null,{"$f":"Orçamento!W488","v":0},{"$f":"Orçamento!Z488","v":0},{"$f":"ROUND(F46*$D$44,2)","v":0},null,null,null,{"$f":"ROUND(J46*$D$44,2)","v":0},null,null,null,{"$f":"SUM(F44:M44)","v":0},null,null,0,0,0,{"$f":"IF(S44=N44,\"OK\",\"ERRO\")","v":"OK"}]
[{"$f":"IF(A44=\"F\",A44,\"\")","v":""},null,null,null,null,null,null,null,null,null,null,null,null,null,null,null,null,null,0]
[{"$f":"IF(A45=\"F\",A45,\"\")","v":""},null,null,null,null,1,null,null,null,{"$f":"1-F46","v":0},null,null,null,{"$f":"IFERROR(E44/100,\"\")","v":0},null,null,null,null,0]
[{"$f":"IF(D47>0,\"F\",\"\")","v":""},"ISOLAMENTO TÉRMICO E ACÚSTICO",null,{"$f":"Orçamento!W489","v":0},{"$f":"Orçamento!Z489","v":0},{"$f":"ROUND(F49*$D$47,2)","v":0},null,null,null,{"$f":"ROUND(J49*$D$47,2)","v":0},null,null,null,{"$f":"SUM(F47:M47)","v":0},null,null,0,0,0,"OK"]
[{"$f":"IF(A47=\"F\",A47,\"\")","v":""},null,null,null,null,null,null,null,null,null,null,null,null,null,null,null,null,null,0]
[{"$f":"IF(A48=\"F\",A48,\"\")","v":""},null,null,null,null,0.5,null,null,null,{"$f":"1-F49","v":0.5},null,null,null,{"$f":"IFERROR(E47/100,\"\")","v":0},null,null,null,null,0]
[{"$f":"IF(D50>0,\"F\",\"\")","v":""},"ESTRUTURA DE MADEIRA",null,{"$f":"Orçamento!W490","v":0},{"$f":"Orçamento!Z490","v":0},{"$f":"ROUND(F52*$D$50,2)","v":0},null,null,null,{"$f":"ROUND(J52*$D$50,2)","v":0},null,null,null,{"$f":"SUM(F50:M50)","v":0},null,null,0,0,0,{"$f":"IF(S50=N50,\"OK\",\"ERRO\")","v":"OK"}]
[{"$f":"IF(A50=\"F\",A50,\"\")","v":""},null,null,null,null,null,null,null,null,null,null,null,null,null,null,null,null,null,0]
[{"$f":"IF(A51=\"F\",A51,\"\")","v":""},null,null,null,null,0.4,null,null,null,{"$f":"1-F52","v":0.6},null,null,null,{"$f":"IFERROR(E50/100,\"\")","v":0},null,null,null,null,0]
[{"$f":"IF(D53>0,\"F\",\"\")","v":""},"ESTRUTURA METÁLICA",null,{"$f":"Orçamento!W491","v":0},{"$f":"Orçamento!Z491","v":0},{"$f":"ROUND(F55*$D$53,2)","v":0},null,null,null,{"$f":"ROUND(J55*$D$53,2)","v":0},null,null,null,{"$f":"SUM(F53:M53)","v":0},null,null,0,0,0,"OK"]
[{"$f":"IF(A53=\"F\",A53,\"\")","v":""},null,null,null,null,null,null,null,null,null,null,null,null,null,null,null,null,null,0]
[{"$f":"IF(A54=\"F\",A54,\"\")","v":""},null,null,null,null,0.35,null,null,null,{"$f":"1-F55","v":0.65},null,null,null,{"$f":"IFERROR(E53/100,\"\")","v":0},null,null,null,null,0]
[{"$f":"IF(D56>0,\"F\",\"\")","v":""},"COBERTURAS",null,{"$f":"Orçamento!W492","v":0},{"$f":"Orçamento!Z492","v":0},{"$f":"ROUND(F58*$D$56,2)","v":0},null,null,null,{"$f":"ROUND(J58*$D$56,2)","v":0},null,null,null,{"$f":"SUM(F56:M56)","v":0},null,null,0,0,0,{"$f":"IF(S56=N56,\"OK\",\"ERRO\")","v":"OK"}]
[{"$f":"IF(A56=\"F\",A56,\"\")","v":""},null,null,null,null,null,null,null,null,null,null,null,null,null,null,null,null,null,0]
[{"$f":"IF(A57=\"F\",A57,\"\")","v":""},null,null,null,null,0,null,null,null,{"$f":"1-F58","v":1},null,null,null,{"$f":"IFERROR(E56/100,\"\")","v":0},null,null,null,null,0]
[{"$f":"IF(D59>0,\"F\",\"\")","v":""},"ESQUADRIAS DE MADEIRA",null,{"$f":"Orçamento!W493","v":0},{"$f":"Orçamento!Z493","v":0},{"$f":"ROUND(F61*$D$59,2)","v":0},null,null,null,{"$f":"ROUND(J61*$D$59,2)","v":0},null,null,null,{"$f":"SUM(F59:M59)","v":0},null,null,0,0,0,"OK"]
[{"$f":"IF(A59=\"F\",A59,\"\")","v":""},null,null,null,null,null,null,null,null,null,null,null,null,null,null,null,null,null,0]
[{"$f":"IF(A60=\"F\",A60,\"\")","v":""},null,null,null,null,0.54,null,null,null,{"$f":"1-F61","v":0.45999999999999996},null,null,null,{"$f":"IFERROR(E59/100,\"\")","v":0},null,null,null,null,0]
[{"$f":"IF(D62>0,\"F\",\"\")","v":""},"ESQUADRIAS METÁLICAS",null,{"$f":"Orçamento!W494","v":0},{"$f":"Orçamento!Z494","v":0},{"$f":"ROUND(F64*$D$62,2)","v":0},null,null,null,{"$f":"ROUND(J64*$D$62,2)","v":0},null,null,null,{"$f":"SUM(F62:M62)","v":0},null,null,0,0,0,{"$f":"IF(S62=N62,\"OK\",\"ERRO\")","v":"OK"}]
[{"$f":"IF(A62=\"F\",A62,\"\")","v":""},null,null,null,null,null,null,null,null,null,null,null,null,null,null,null,null,null,0]
[{"$f":"IF(A63=\"F\",A63,\"\")","v":""},null,null,null,null,0.49,null,null,null,{"$f":"1-F64","v":0.51},null,null,null,{"$f":"IFERROR(E62/100,\"\")","v":0},null,null,null,null,0]
[{"$f":"IF(D65>0,\"F\",\"\")","v":""},"VIDROS",null,{"$f":"Orçamento!W495","v":0},{"$f":"Orçamento!Z495","v":0},{"$f":"ROUND(F67*$D$65,2)","v":0},null,null,null,{"$f":"ROUND(J67*$D$65,2)","v":0},null,null,null,{"$f":"SUM(F65:M65)","v":0},null,null,0,0,0,"OK"]
[{"$f":"IF(A65=\"F\",A65,\"\")","v":""},null,null,null,null,null,null,null,null,null,null,null,null,null,null,null,null,null,0]
[{"$f":"IF(A66=\"F\",A66,\"\")","v":""},null,null,null,null,0,null,null,null,{"$f":"1-F67","v":1},null,null,null,{"$f":"IFERROR(E65/100,\"\")","v":0},null,null,null,null,0]
[{"$f":"IF(D68>0,\"F\",\"\")","v":""},"REVESTIMENTO DE PAREDE",null,{"$f":"Orçamento!W496","v":0},{"$f":"Orçamento!Z496","v":0},{"$f":"ROUND(F70*$D$68,2)","v":0},null,null,null,{"$f":"ROUND(J70*$D$68,2)","v":0},null,null,null,{"$f":"SUM(F68:M68)","v":0},null,null,0,0,0,{"$f":"IF(S68=N68,\"OK\",\"ERRO\")","v":"OK"}]
[{"$f":"IF(A68=\"F\",A68,\"\")","v":""},null,null,null,null,null,null,null,null,null,null,null,null,null,null,null,null,null,0]
[{"$f":"IF(A69=\"F\",A69,\"\")","v":""},null,null,null,null,0.32,null,null,null,{"$f":"1-F70","v":0.67999999999999994},null,null,null,{"$f":"IFERROR(E68/100,\"\")","v":0},null,null,null,null,0]
[{"$f":"IF(D71>0,\"F\",\"\")","v":""},"FORROS",null,{"$f":"Orçamento!W497","v":0},{"$f":"Orçamento!Z497","v":0},{"$f":"ROUND(F73*$D$71,2)","v":0},null,null,null,{"$f":"ROUND(J73*$D$71,2)","v":0},null,null,null,{"$f":"SUM(F71:M71)","v":0},null,null,0,0,0,"OK"]
[{"$f":"IF(A71=\"F\",A71,\"\")","v":""},null,null,null,null,null,null,null,null,null,null,null,null,null,null,null,null,null,0]
[{"$f":"IF(A72=\"F\",A72,\"\")","v":""},null,null,null,null,0.24,null,null,null,{"$f":"1-F73","v":0.76},null,null,null,{"$f":"IFERROR(E71/100,\"\")","v":0},null,null,null,null,0]
[{"$f":"IF(D74>0,\"F\",\"\")","v":""},"REVESTIMENTO DE PISO",null,{"$f":"Orçamento!W498","v":0},{"$f":"Orçamento!Z498","v":0},{"$f":"ROUND(F76*$D$74,2)","v":0},null,null,null,{"$f":"ROUND(J76*$D$74,2)","v":0},null,null,null,{"$f":"SUM(F74:M74)","v":0},null,null,0,0,0,{"$f":"IF(S74=N74,\"OK\",\"ERRO\")","v":"OK"}]
[{"$f":"IF(A74=\"F\",A74,\"\")","v":""},null,null,null,null,null,null,null,null,null,null,null,null,null,null,null,null,null,0]
[{"$f":"IF(A75=\"F\",A75,\"\")","v":""},null,null,null,null,0.49,null,null,null,{"$f":"1-F76","v":0.51},null,null,null,{"$f":"IFERROR(E74/100,\"\")","v":0},null,null,null,null,0]
[{"$f":"IF(D77>0,\"F\",\"\")","v":""},"FERRAGENS",null,{"$f":"Orçamento!W499","v":0},{"$f":"Orçamento!Z499","v":0},{"$f":"ROUND(F79*$D$77,2)","v":0},null,null,null,{"$f":"ROUND(J79*$D$77,2)","v":0},null,null,null,{"$f":"SUM(F77:M77)","v":0},null,null,0,0,0,"OK"]
[{"$f":"IF(A77=\"F\",A77,\"\")","v":""},null,null,null,null,null,null,null,null,null,null,null,null,null,null,null,null,null,0]
[{"$f":"IF(A78=\"F\",A78,\"\")","v":""},null,null,null,null,0,null,null,null,{"$f":"1-F79","v":1},null,null,null,{"$f":"IFERROR(E77/100,\"\")","v":0},null,null,null,null,{"$f":"Q79+R79","v":0}]
[{"$f":"IF(D80>0,\"F\",\"\")","v":""},"MARCENARIA",null,{"$f":"Orçamento!W500","v":0},{"$f":"Orçamento!Z500","v":0},{"$f":"ROUND(F82*$D$80,2)","v":0},null,null,null,{"$f":"ROUND(J82*$D$80,2)","v":0},null,null,null,{"$f":"SUM(F80:M80)","v":0},null,null,{"$f":"F80","v":0},{"$f":"J80","v":0},0,{"$f":"IF(S80=N80,\"OK\",\"ERRO\")","v":"OK"}]
[{"$f":"IF(A80=\"F\",A80,\"\")","v":""},null,null,null,null,null,null,null,null,null,null,null,null,null,null,null,null,null,0]
[{"$f":"IF(A81=\"F\",A81,\"\")","v":""},null,null,null,null,0.4,null,null,null,{"$f":"1-F82","v":0.6},null,null,null,{"$f":"IFERROR(E80/100,\"\")","v":0},null,null,null,null,0]
[{"$f":"IF(D83>0,\"F\",\"\")","v":""},"ADMINISTRAÇÃO - MENSALISTAS",null,{"$f":"Orçamento!W501","v":0},{"$f":"Orçamento!Z501","v":0},{"$f":"ROUND(F85*$D$83,2)","v":0},null,null,null,{"$f":"ROUND(J85*$D$83,2)","v":0},null,null,null,{"$f":"SUM(F83:M83)","v":0},null,null,0,0,0,{"$f":"IF(S83=N83,\"OK\",\"ERRO\")","v":"OK"}]
[{"$f":"IF(A83=\"F\",A83,\"\")","v":""},null,null,null,null,null,null,null,null,null,null,null,null,null,null,null,null,null,0]
[{"$f":"IF(A84=\"F\",A84,\"\")","v":""},null,null,null,null,0.49,null,null,null,{"$f":"1-F85","v":0.51},null,null,null,{"$f":"IFERROR(E83/100,\"\")","v":0},null,null,null,null,0]
[{"$f":"IF(D86>0,\"F\",\"\")","v":""},"PINTURA",null,{"$f":"Orçamento!W502","v":0},{"$f":"Orçamento!Z502","v":0},{"$f":"ROUND(F88*$D$86,2)","v":0},null,null,null,{"$f":"ROUND(J88*$D$86,2)","v":0},null,null,null,{"$f":"SUM(F86:M86)","v":0},null,null,0,0,0,{"$f":"IF(S86=N86,\"OK\",\"ERRO\")","v":"OK"}]
[{"$f":"IF(A86=\"F\",A86,\"\")","v":""},null,null,null,null,null,null,null,null,null,null,null,null,null,null,null,null,null,0]
[{"$f":"IF(A87=\"F\",A87,\"\")","v":""},null,null,null,null,0,null,null,null,{"$f":"1-F88","v":1},null,null,null,{"$f":"IFERROR(E86/100,\"\")","v":0},null,null,null,null,0]
[{"$f":"IF(D89>0,\"F\",\"\")","v":""},"DIVERSOS",null,{"$f":"Orçamento!W503","v":0},{"$f":"Orçamento!Z503","v":0},{"$f":"ROUND(F91*$D$89,2)","v":0},null,null,null,{"$f":"ROUND(J91*$D$89,2)","v":0},null,null,null,{"$f":"SUM(F89:M89)","v":0},null,null,0,0,0,"OK"]
[{"$f":"IF(A89=\"F\",A89,\"\")","v":""},null,null,null,null,null,null,null,null,null,null,null,null,null,null,null,null,null,0,{"$f":"IF(S90=N90,\"OK\",\"ERRO\")","v":"OK"}]
[{"$f":"IF(A90=\"F\",A90,\"\")","v":""},null,null,null,null,0.46,null,null,null,{"$f":"1-F91","v":0.54},null,null,null,{"$f":"IFERROR(E89/100,\"\")","v":0},null,null,null,null,0]
["F","CUSTO DO ORÇAMENTO",null,{"$f":"SUM(D14:D91)","v":0},{"$f":"SUM(E14:E91)","v":0},{"$f":"F14+F17+F20+F23+F26+F29+F32+F35+F38+F41+F44+F47+F50+F53+F56+F59+F62+F65+F68+F71+F74+F77+F80+F83+F86+F89","v":0},null,null,null,{"$f":"J14+J17+J20+J23+J26+J29+J32+J35+J38+J41+J44+J47+J50+J53+J56+J59+J62+J65+J68+J71+J74+J77+J80+J83+J86+J89","v":0},null,null,null,{"$f":"N14+N17+N20+N23+N26+N29+N32+N35+N38+N41+N44+N47+N50+N53+N56+N59+N62+N65+N68+N71+N74+N77+N80+N83+N86+N89","v":0},null,null,{"$f":"SUM(Q14:Q91)","v":0},{"$f":"SUM(R14:R91)","v":0},{"$f":"SUM(S14:S91)","v":0}]
["F","PERCENTUAIS:",null,null,null,{"$f":"IFERROR(F92/D92,\"\")","v":""},null,null,null,{"$f":"IFERROR(J92/D92,\"\")","v":""},null,null,null,{"$f":"SUM(F93:M93)","v":0},null,null,null,null,{"$f":"R92+Q92","v":0}]
["F","TOTAIS ACUMULADOS:",null,null,null,{"$f":"F92","v":0},null,null,null,{"$f":"F94+J92","v":0},null,null,null,null,null,null,{"$f":"IF(Q92=F92,\"OK\",\"erro\")","v":"OK"},{"$f":"IF(R92=J92,\"OK\",\"erro\")","v":"OK"},{"$f":"IF(S92=N92,\"OK\",\"erro\")","v":"OK"}]
["F","PERCENTUAIS  ACUMULADOS:",null,null,null,{"$f":"F93","v":""},null,null,null,{"$f":"IFERROR(F95+J93,\"\")","v":""}]
["F"]
["F","OBSERVAÇÕES:"]
["F","Os pagamentos somente poderão ser efetuados mediante medição e atesto pelos técnicos da Secretaria da Educação. "]

{"sheet":"Composição BDI","index":4,"n_rows":44,"n_cols":9,"rows_kept":44,"cut":false,"hidden":false,"merged":[[17,5,17,8],[16,0,16,3],[15,0,15,3],[43,0,43,3],[41,0,41,3],[42,0,42,3],[17,0,17,3],[35,0,35,3],[38,0,38,3],[37,0,37,3],[39,0,39,3],[28,0,28,2],[31,0,31,3],[32,0,32,3],[33,0,33,3],[34,0,34,3],[8,2,8,3],[10,2,10,3],[11,2,11,3],[0,0,14,1],[0,2,0,3],[9,2,9,3],[12,2,12,3],[13,2,13,3],[1,2,1,3],[2,2,2,3],[4,2,4,3],[5,2,5,3],[7,2,7,3],[3,2,3,3],[6,2,6,3],[14,2,14,3]]}
[]
[null,null,"UNIDADE ESCOLAR"]
[null,null,{"$f":"Orçamento!$O$4","v":"COLÉGIO ESTADUAL SÃO GERALDO"}]
[]
[null,null,"OBRA"]
[null,null,{"$f":"Orçamento!$O$7","v":"AMPLIAÇÃO E REFORMA"}]
[]
[null,null,"ENDEREÇO"]
[null,null,{"$f":"Orçamento!$R$10","v":"RUA 1 S/N, VILA LEO LYNCE, CEP:75370-000"}]
[]
[null,null,"CIDADE"]
[null,null,{"$f":"Orçamento!$W$7","v":"GOIANIRA"}]
[]
[null,null,"CRECE"]
[null,null,{"$f":"Orçamento!$O$10","v":"INHUMAS"}]
[]
["DETALHAMENTO DA COMPOSIÇÃO DE BDI"]
["COMPOSIÇÃO BDI PARA OBRAS CIVIS",null,null,null,null,"BDI CONSTRUÇÃO E REFORMA"]
["DESCRIÇÃO","COEF.","TAXA % (a.m)","% no preço de venda",null,"Situação","1º Quartil","Médio","3º Quartil"]
["1) COFINS",1,0.03,{"$f":"C20","v":0.03},null,{"$f":"IF(OR(C20<G20,C20>I20),\"FORA DO INTERVALO\",\"OK\")","v":"OK"},0.03,0.03,0.03]
["2) PIS",1,6.4999999999999997E-3,{"$f":"C21","v":6.4999999999999997E-3},null,{"$f":"IF(OR(C21<G21,C21>I21),\"FORA DO INTERVALO\",\"OK\")","v":"OK"},6.4999999999999997E-3,6.4999999999999997E-3,6.4999999999999997E-3]
["3) ISSQN",1,0.05,{"$f":"C22*B22","v":0.05},null,"OK",0.02,3.5000000000000003E-2,0.05]
["4) CPRB",1,0,{"$f":"C23","v":0},null,"FORA DO INTERVALO",4.4999999999999998E-2,4.4999999999999998E-2,4.4999999999999998E-2]
["5) Administração Central",1,0.03,0.03,null,"OK",0.03,0.04,5.5E-2]
["6) Despesas Financeiras",1,5.5999999999999999E-3,5.5999999999999999E-3,null,"FORA DO INTERVALO",5.8999999999999999E-3,1.23E-2,1.3899999999999999E-2]
["7) Seguros + Garantias",1,1.1999999999999999E-3,1.1999999999999999E-3,null,"FORA DO INTERVALO",8.0000000000000002E-3,8.0000000000000002E-3,0.01]
["8) Risco",1,9.7000000000000003E-3,9.7000000000000003E-3,null,"OK",9.7000000000000003E-3,1.2699999999999999E-2,1.2699999999999999E-2]
["9) Lucro",1,6.1600000000000002E-2,6.1600000000000002E-2,null,"OK",6.1600000000000002E-2,7.3999999999999996E-2,8.9599999999999999E-2]
["BDI - FINAL",null,null,{"$f":"(((1+D24+D26+D27)*(1+D25)*(1+D28))/(1-(D20+D21+D22+D23))-1)","v":0.21642862491954062},null,"FORA DO INTERVALO",0.2034,0.22120000000000001,0.25]
[]
["Notas:"]
["(1) e (2) Alíquota definida por lei."]
["(3) Alíquota e base de cálculo definidas pela legislação municipal."]
["(4) Alíquota definida pelas leis 12.546/11, 12844/13 e 13.161/15 (CPRB – contribuição previdenciária sobre a receita bruta)."]
["(5) Valores definidos a partir dos limites no Acórdão nº 2.622/2013 - TCU – Plenário. Valores entre o 1º e 3º quartis."]
["(6) Valor calculado pela expressão matemática do acórdão 2.369/2011 – TCU – Plenário e disponibilizado pela AGETOP em dezembro de 2018. (Foi utilizado para o cálculo a média da Taxa SELIC no período de 11/2017 a 10/2018)"]
[]
["(7) Valores definidos pela AGETOP a partir dos limites no Acórdão nº 2.622/2013 - TCU – Plenário. Valores médios. \n\nObservação da AGETOP: (Seguros contra erros de execução, incêndio e explosão, danos da natureza (vendaval, destelhamento, alagamento, inundação, desmoronamento, geadas etc.), emprego de material defeituoso ou inadequado, roubo e/ou furto qualificado, quebra de equipamentos, desmoronamento de estrutura, nas modalidades de Obras Civis em Construção (OCC); Instalação e Montagem (IM); e Obras Civis em Construção e Instalação e Montagem (OCC/IM). Bem como coberturas adicionais para ampliação dessas coberturas básicas, como: cobertura de responsabilidade civil geral, cobertura de responsabilidade civil cruzada, cobertura de despesas extraordinárias, cobertura de tumultos, cobertura de desentulho do local, cobertura de riscos do fabricante, dentre outras, incluindo o seguro de vida em grupo regido pela convenção coletiva dos trabalhadores na indústria da construção civil). A partir de 24/02/2015 por intermédio da Portaria 449/2015 a Presidência da AGETOP, na pessoa do Senhor Jayme Eduardo Rincon, determinou a exclusão dos valores referentes aos Seguros de Risco de Engenharia e Responsabilidade Civil do Profissional na composição do cálculo do B.D.I.."]
["(8) Valores definidos a partir dos limites no Acórdão nº 2.622/2013 - TCU – Plenário. Valores entre 1º e 3° quartis."]
["(9) Valores definidos a partir dos limites definidos no Acórdão nº 2.622/2013 - TCU – Plenário. Valores adotados e praticados no mercado ( “ ex ante ” ) ou aqueles entre os 1º e 3º quartis."]
[]
["(*) A fórmula para estipulação da taxa de BDI estimado adotado é a mesma que foi aplicada para a obtenção das tabelas contidas no Acórdão n. 2.622/2013 – TCUPlenário"]
[]
["Obs.: Para obras com valores superiores a R$ 20.000.000,00 sugere-se recalcular o BDI, dimensionando as taxas de administração central e lucro para patamares inferiores ao estipulado acima."]

{"sheet":"Relatório CENTRAL","index":5,"n_rows":40,"n_cols":5,"rows_kept":40,"cut":false,"hidden":false,"merged":[[9,1,9,2],[10,1,10,4],[11,1,11,4],[39,1,39,2],[9,0,11,0],[0,1,0,4],[6,3,6,4],[9,3,9,4],[1,1,1,4],[2,1,2,2],[2,3,2,4],[3,1,3,2],[3,3,3,4],[4,1,4,4],[5,1,5,2],[5,3,5,4],[6,1,6,2],[7,1,7,4],[8,1,8,2],[8,3,8,4]]}
[]
[]
[null,"UNIDADE ESCOLAR",null,"CIDADE"]
[null,{"$f":"Orçamento!$O$4","v":"COLÉGIO ESTADUAL SÃO GERALDO"},null,{"$f":"Orçamento!$W$7","v":"GOIANIRA"}]
[]
[null,"OBRA",null,"CRECE"]
[null,{"$f":"Orçamento!$O$7","v":"AMPLIAÇÃO E REFORMA"},null,{"$f":"Orçamento!$O$10","v":"INHUMAS"}]
[]
[null,"ENDEREÇO",null,"DATA"]
["FILTRO",{"$f":"Orçamento!$R$10","v":"RUA 1 S/N, VILA LEO LYNCE, CEP:75370-000"},null,{"$f":"Orçamento!$S$7","v":"2020-04-08"}]
[]
[null,"RELATÓRIO CENTRAL"]
["↓","CÓDIGO","ETAPA","PREÇO  (R$) C/ BDI","PARTIC  ( % )"]
[{"$f":"IF(D14>0,\"F\",\"\")","v":""},{"$f":"Orçamento!O478","v":"a."},{"$f":"Orçamento!P478","v":"SERVIÇOS PRELIMINARES"},{"$f":"Orçamento!W478","v":0},{"$f":"Orçamento!Z478","v":0}]
[{"$f":"IF(D15>0,\"F\",\"\")","v":""},{"$f":"Orçamento!O479","v":"b."},{"$f":"Orçamento!P479","v":"TRANSPORTES"},{"$f":"Orçamento!W479","v":0},{"$f":"Orçamento!Z479","v":0}]
["",{"$f":"Orçamento!O480","v":"c."},{"$f":"Orçamento!P480","v":"SERVIÇO EM TERRA"},{"$f":"Orçamento!W480","v":0},{"$f":"Orçamento!Z480","v":0}]
["",{"$f":"Orçamento!O481","v":"d."},{"$f":"Orçamento!P481","v":"FUNDAÇÕES E SONDAGENS"},{"$f":"Orçamento!W481","v":0},{"$f":"Orçamento!Z481","v":0}]
["",{"$f":"Orçamento!O482","v":"e."},{"$f":"Orçamento!P482","v":"ESTRUTURA"},{"$f":"Orçamento!W482","v":0},{"$f":"Orçamento!Z482","v":0}]
["",{"$f":"Orçamento!O483","v":"f."},{"$f":"Orçamento!P483","v":"INSTALAÇÕES ELÉTRICAS"},{"$f":"Orçamento!W483","v":0},{"$f":"Orçamento!Z483","v":0}]
["",{"$f":"Orçamento!O484","v":"g."},{"$f":"Orçamento!P484","v":"INSTALAÇÕES HIDROSSANITÁRIAS"},{"$f":"Orçamento!W484","v":0},{"$f":"Orçamento!Z484","v":0}]
["",{"$f":"Orçamento!O485","v":"h"},{"$f":"Orçamento!P485","v":"INSTALAÇÕES ESPECIAIS"},{"$f":"Orçamento!W485","v":0},{"$f":"Orçamento!Z485","v":0}]
["",{"$f":"Orçamento!O486","v":"i."},{"$f":"Orçamento!P486","v":"ALVENARIAS E DIVISÓRIAS"},{"$f":"Orçamento!W486","v":0},{"$f":"Orçamento!Z486","v":0}]
["",{"$f":"Orçamento!O487","v":"j."},{"$f":"Orçamento!P487","v":"ALVENARIA AUTO-PORTANTE"},{"$f":"Orçamento!W487","v":0},{"$f":"Orçamento!Z487","v":0}]
["",{"$f":"Orçamento!O488","v":"k."},{"$f":"Orçamento!P488","v":"IMPERMEABILIZACAO"},{"$f":"Orçamento!W488","v":0},{"$f":"Orçamento!Z488","v":0}]
["",{"$f":"Orçamento!O489","v":"l."},{"$f":"Orçamento!P489","v":"ISOLAMENTO TÉRMICO E ACÚSTICO"},{"$f":"Orçamento!W489","v":0},{"$f":"Orçamento!Z489","v":0}]
["",{"$f":"Orçamento!O490","v":"m."},{"$f":"Orçamento!P490","v":"ESTRUTURA DE MADEIRA"},{"$f":"Orçamento!W490","v":0},{"$f":"Orçamento!Z490","v":0}]
["",{"$f":"Orçamento!O491","v":"n."},{"$f":"Orçamento!P491","v":"ESTRUTURAS METÁLICAS"},{"$f":"Orçamento!W491","v":0},{"$f":"Orçamento!Z491","v":0}]
["",{"$f":"Orçamento!O492","v":"o."},{"$f":"Orçamento!P492","v":"COBERTURAS"},{"$f":"Orçamento!W492","v":0},{"$f":"Orçamento!Z492","v":0}]
["",{"$f":"Orçamento!O493","v":"p."},{"$f":"Orçamento!P493","v":"ESQUADRIAS DE MADEIRA"},{"$f":"Orçamento!W493","v":0},{"$f":"Orçamento!Z493","v":0}]
["",{"$f":"Orçamento!O494","v":"q."},{"$f":"Orçamento!P494","v":"ESQUADRIAS METÁLICAS"},{"$f":"Orçamento!W494","v":0},{"$f":"Orçamento!Z494","v":0}]
["",{"$f":"Orçamento!O495","v":"r."},{"$f":"Orçamento!P495","v":"VIDROS"},{"$f":"Orçamento!W495","v":0},{"$f":"Orçamento!Z495","v":0}]
["",{"$f":"Orçamento!O496","v":"s."},{"$f":"Orçamento!P496","v":"REVESTIMENTO DE PAREDE"},{"$f":"Orçamento!W496","v":0},{"$f":"Orçamento!Z496","v":0}]
["",{"$f":"Orçamento!O497","v":"t."},{"$f":"Orçamento!P497","v":"FORROS"},{"$f":"Orçamento!W497","v":0},{"$f":"Orçamento!Z497","v":0}]
["",{"$f":"Orçamento!O498","v":"u."},{"$f":"Orçamento!P498","v":"REVESTIMENTO DE PISO"},{"$f":"Orçamento!W498","v":0},{"$f":"Orçamento!Z498","v":0}]
["",{"$f":"Orçamento!O499","v":"v."},{"$f":"Orçamento!P499","v":"FERRAGENS"},{"$f":"Orçamento!W499","v":0},{"$f":"Orçamento!Z499","v":0}]
["",{"$f":"Orçamento!O500","v":"w."},{"$f":"Orçamento!P500","v":"MARCENARIA"},{"$f":"Orçamento!W500","v":0},{"$f":"Orçamento!Z500","v":0}]
["",{"$f":"Orçamento!O501","v":"x."},{"$f":"Orçamento!P501","v":"ADMINISTRAÇÃO"},{"$f":"Orçamento!W501","v":0},{"$f":"Orçamento!Z501","v":0}]
["",{"$f":"Orçamento!O502","v":"y."},{"$f":"Orçamento!P502","v":"PINTURA"},{"$f":"Orçamento!W502","v":0},{"$f":"Orçamento!Z502","v":0}]
["",{"$f":"Orçamento!O503","v":"z."},{"$f":"Orçamento!P503","v":"DIVERSOS"},{"$f":"Orçamento!W503","v":0},{"$f":"Orçamento!Z503","v":0}]
["F","TOTAL GERAL DO ORÇAMENTO (R$) C/BDI",null,{"$f":"SUM(D14:D39)","v":0},{"$f":"SUM(E14:E39)","v":0}]

{"sheet":"Parc Maior Relev","index":6,"n_rows":21,"n_cols":7,"rows_kept":21,"cut":false,"hidden":false,"merged":[[0,1,0,6],[11,1,11,6],[1,1,1,6],[2,1,2,3],[2,4,2,6],[3,1,3,3],[3,4,3,6],[4,1,4,6],[5,1,5,3],[5,4,5,6],[9,1,9,3],[9,4,9,6],[10,1,10,6],[6,1,6,3],[6,4,6,6],[7,1,7,6],[10,0,12,0],[8,1,8,3],[8,4,8,6],[21,3,21,7],[19,1,19,6]]}
[]
[]
[null,"UNIDADE ESCOLAR",null,null,"CÓDIGO INEP"]
[null,{"$f":"Orçamento!$O$4","v":"COLÉGIO ESTADUAL SÃO GERALDO"},null,null,{"$f":"Orçamento!$W$4","v":52038343}]
[]
[null,"OBRA",null,null,"CIDADE"]
[null,{"$f":"Orçamento!$O$7","v":"AMPLIAÇÃO E REFORMA"},null,null,{"$f":"Orçamento!$W$7","v":"GOIANIRA"}]
[]
[null,"CRECE",null,null,"ÁREA TOTAL CONSTRUÍDA (M²)"]
[null,{"$f":"Orçamento!$O$10","v":"INHUMAS"},null,null,{"$f":"Orçamento!$S$13","v":2504.21}]
["FILTRO"]
[null,"PARCELA DE MAIOR RELEVÂNCIA"]
[null,"CÓDIGO","SERVIÇO","DESCRIÇÃO","UNID","QUANT","PARC. MAIOR RELEVÂNCIA (25%)"]
[{"$f":"IF(F14>0,\"F\",\"\")","v":"F"},"n.",{"$f":"IFERROR(VLOOKUP(B14,Orçamento!$O$478:$P$503,2,FALSE),\"(inserir código ao lado)\")","v":"ESTRUTURAS METÁLICAS"},"ESTRUTURA METÁLICA CONVENCIONAL EM AÇO DO TIPO USI SAC-300 COM FUNDO ANTICORROSIVO",{"$f":"IFERROR(VLOOKUP($D14,Orçamento!$R$20:$Y$459,2,FALSE),\"-\")","v":"Kg    "},9636.9000000000015,{"$f":"F14*0.25","v":2409.2250000000004}]
[{"$f":"IF(F15>0,\"F\",\"\")","v":"F"},"u.",{"$f":"IFERROR(VLOOKUP(B15,Orçamento!$O$478:$P$503,2,FALSE),\"(inserir código ao lado)\")","v":"REVESTIMENTO DE PISO"},{"$f":"Orçamento!R277","v":"PISO EM GRANILITE, MARMORITE OU GRANITINA ESPESSURA 8 MM, INCLUSO JUNTAS DE DILATACAO PLASTICAS"},{"$f":"Orçamento!S277","v":"M2"},{"$f":"Orçamento!U277","v":561.90000000000009},{"$f":"F15*0.25","v":140.47500000000002}]
[{"$f":"IF(F16>0,\"F\",\"\")","v":"F"},{"$f":"Somatório!B21","v":"e."},{"$f":"IFERROR(VLOOKUP(B16,Orçamento!$O$478:$P$503,2,FALSE),\"(inserir código ao lado)\")","v":"ESTRUTURA"},{"$f":"Orçamento!R223","v":"LAJE PRE-MOLDADA P/FORRO, SOBRECARGA 100KG/M2, VAOS ATE 3,50M/E=8CM, C/LAJOTAS E CAP.C/CONC FCK=20MPA, 3CM, INTER-EIXO 38CM, C/ESCORAMENTO (REAPR.3X) E FERRAGEM NEGATIVA"},{"$f":"IFERROR(VLOOKUP($D16,Orçamento!$R$20:$Y$459,2,FALSE),\"-\")","v":"M2"},{"$f":"Orçamento!U223","v":468.84000000000003},117.21000000000001]
["F","o.",{"$f":"IFERROR(VLOOKUP(B17,Orçamento!$O$478:$P$503,2,FALSE),\"(inserir código ao lado)\")","v":"COBERTURAS"},{"$f":"Orçamento!R259","v":"TELHAMENTO COM TELHA CERÂMICA CAPA-CANAL, TIPO PLAN, COM ATÉ 2 ÁGUAS, INCLUSO TRANSPORTE VERTICAL. AF_06/2016"},{"$f":"IFERROR(VLOOKUP($D17,Orçamento!$R$20:$Y$459,2,FALSE),\"-\")","v":"M2"},{"$f":"Orçamento!U259","v":707.06999999999994},176.76749999999998]
["",null,{"$f":"IFERROR(VLOOKUP(B18,Orçamento!$O$478:$P$503,2,FALSE),\"(inserir código ao lado)\")","v":"(inserir código ao lado)"},null,{"$f":"IFERROR(VLOOKUP($D18,Orçamento!$R$20:$Y$459,2,FALSE),\"-\")","v":"-"},{"$f":"SUMIF(Orçamento!$R$20:$R$459,'Parc Maior Relev'!D18,Orçamento!$T$20:$T$459)","v":0},{"$f":"F18*0.5","v":0}]
["F"]
["F","(*) Para os fins do inciso I dp § 1º do Art. 30 da Lei Federal 8.666/93, são consideradas parcelas de maior relevância técnica as execuções apresentadas"]
["F"]

{"sheet":"Composições","index":7,"n_rows":248,"n_cols":10,"rows_kept":248,"cut":false,"hidden":false,"merged":[[237,5,238,5],[237,6,237,7],[237,8,237,9],[243,1,243,7],[247,1,247,7],[237,0,238,0],[237,1,238,1],[237,2,238,2],[237,3,238,3],[237,4,238,4],[223,5,224,5],[223,6,223,7],[223,8,223,9],[229,1,229,7],[235,1,235,7],[223,0,224,0],[223,1,224,1],[223,2,224,2],[223,3,224,3],[223,4,224,4],[213,5,214,5],[213,6,213,7],[213,8,213,9],[218,1,218,7],[221,1,221,7],[213,0,214,0],[213,1,214,1],[213,2,214,2],[213,3,214,3],[213,4,214,4],[193,5,194,5],[193,6,193,7],[193,8,193,9],[198,1,198,7],[211,1,211,7],[193,0,194,0],[193,1,194,1],[193,2,194,2],[193,3,194,3],[193,4,194,4],[181,5,182,5],[181,6,181,7],[181,8,181,9],[187,1,187,7],[191,1,191,7],[181,0,182,0],[181,1,182,1],[181,2,182,2],[181,3,182,3],[181,4,182,4],[169,5,170,5],[169,6,169,7],[169,8,169,9],[175,1,175,7],[179,1,179,7],[169,0,170,0],[169,1,170,1],[169,2,170,2],[169,3,170,3],[169,4,170,4],[157,5,158,5],[157,6,157,7],[157,8,157,9],[163,1,163,7],[167,1,167,7],[157,0,158,0],[157,1,158,1],[157,2,158,2],[157,3,158,3],[157,4,158,4],[145,5,146,5],[145,6,145,7],[145,8,145,9],[151,1,151,7],[155,1,155,7],[145,0,146,0],[145,1,146,1],[145,2,146,2],[145,3,146,3],[145,4,146,4],[133,5,134,5],[133,6,133,7],[133,8,133,9],[139,1,139,7],[143,1,143,7],[133,0,134,0],[133,1,134,1],[133,2,134,2],[133,3,134,3],[133,4,134,4],[121,5,122,5],[121,6,121,7],[121,8,121,9],[127,1,127,7],[131,1,131,7],[121,0,122,0],[121,1,122,1],[121,2,122,2],[121,3,122,3],[121,4,122,4],[109,5,110,5],[109,6,109,7],[109,8,109,9],[115,1,115,7],[119,1,119,7],[109,0,110,0],[109,1,110,1],[109,2,110,2],[109,3,110,3],[109,4,110,4],[97,5,98,5],[97,6,97,7],[97,8,97,9],[103,1,103,7],[107,1,107,7],[97,0,98,0],[97,1,98,1],[97,2,98,2],[97,3,98,3],[97,4,98,4],[85,5,86,5],[85,6,85,7],[85,8,85,9],[91,1,91,7],[95,1,95,7],[85,0,86,0],[85,1,86,1],[85,2,86,2],[85,3,86,3],[85,4,86,4],[73,5,74,5],[73,6,73,7],[73,8,73,9],[79,1,79,7],[83,1,83,7],[73,0,74,0],[73,1,74,1],[73,2,74,2],[73,3,74,3],[73,4,74,4],[61,5,62,5],[61,6,61,7],[61,8,61,9],[67,1,67,7],[71,1,71,7],[61,0,62,0],[61,1,62,1],[61,2,62,2],[61,3,62,3],[61,4,62,4],[38,5,39,5],[38,6,38,7],[38,8,38,9],[44,1,44,7],[59,1,59,7],[38,0,39,0],[38,1,39,1],[38,2,39,2],[38,3,39,3],[38,4,39,4],[28,5,29,5],[28,6,28,7],[28,8,28,9],[32,1,32,7],[36,1,36,7],[28,0,29,0],[28,1,29,1],[28,2,29,2],[28,3,29,3],[28,4,29,4],[16,5,17,5],[16,6,16,7],[16,8,16,9],[22,1,22,7],[26,1,26,7],[16,0,17,0],[16,1,17,1],[16,2,17,2],[16,3,17,3],[16,4,17,4],[15,0,15,9],[13,0,13,2],[13,3,13,6],[1,0,1,9],[3,7,3,9],[4,7,4,9],[6,7,6,9],[7,7,7,9],[6,0,6,6],[10,8,10,9],[13,8,13,9],[14,0,14,9],[8,0,8,9],[5,0,5,9],[2,0,2,9],[0,0,0,8],[10,0,10,2],[10,3,10,6],[11,0,11,9],[12,0,12,2],[12,3,12,6],[12,7,12,8],[7,0,7,6],[9,0,9,2],[9,3,9,6],[9,7,9,8],[3,0,3,6],[4,0,4,6]]}
[]
[]
[]
["UNIDADE ESCOLAR",null,null,null,null,null,null,"CÓDIGO INEP"]
[{"$f":"Orçamento!$O$4","v":"COLÉGIO ESTADUAL SÃO GERALDO"},null,null,null,null,null,null,{"$f":"Orçamento!$W$4","v":52038343}]
[]
["OBRA",null,null,null,null,null,null,"CIDADE"]
[{"$f":"Orçamento!$O$7","v":"AMPLIAÇÃO E REFORMA"},null,null,null,null,null,null,{"$f":"Orçamento!$W$7","v":"GOIANIRA"}]
[]
["CRECE",null,null,"ENDEREÇO",null,null,null,"REFERÊNCIA AGETOP"]
[{"$f":"Orçamento!$O$10","v":"INHUMAS"},null,null,{"$f":"Orçamento!$R$10","v":"RUA 1 S/N, VILA LEO LYNCE, CEP:75370-000"},null,null,null,{"$f":"Orçamento!$W$10","v":"DEZ/18"},{"$f":"Orçamento!$Y$10","v":"NÃO DESONERADA"}]
[]
["DATA",null,null,"ÁREA TOTAL CONSTRUÍDA (M²)",null,null,null,"REFERÊNCIA SINAPI"]
[{"$f":"Orçamento!$S$7","v":"2020-04-08"},null,null,{"$f":"Orçamento!$S$13","v":2504.21},null,null,null,{"$f":"Orçamento!$W$13","v":"JAN/19"},{"$f":"Orçamento!$Y$13","v":"NÃO DESONERADA"}]
[]
["COMPOSIÇÕES DE CUSTOS UNITÁRIOS - SEE-GO"]
[24,"FONTE","CÓDIGO","DESCRIÇÃO","UNIDADE","COEFIC.","CUSTO UNITÁRIO",null,"CUSTO  TOTAL (A) + (B) + (C) + (D) + (E)"]
[null,null,null,null,null,null,"DESONERADO","NÃO DESONER.","DESONERADO","NÃO DESONER."]
[null,"COMPOSIÇÃO","COMP 024_SEE","SINALIZADOR FOTOLUMINESCENTE PARA EXTINTOR","UN ",null,"-","-",25.269999999999996,25.389999999999997]
[null,"AGETOP_I",5,"SERVENTE","h     ",0.09,8.1999999999999993,9.51,0.74,0.86]
[null,null,null,"","",null,0,0,0,0]
[null,null,null,"","",null,0,0,0,0]
[null,"MÃO DE OBRA (B) - TOTAL",null,null,null,null,null,null,0.74,0.86]
[null,"AGETOP_I",3070,"BUCHA DE NYLON S-6","un",2,0.04,0.04,0.08,0.08]
[null,"AGETOP_I",3393,"PARAFUSO P/BUCHA S-6","un",2,0.08,0.08,0.16,0.16]
[null,"SINAPI_I",37556,"PLACA DE SINALIZACAO DE SEGURANCA CONTRA INCENDIO, FOTOLUMINESCENTE, QUADRADA, *20 X 20* CM, EM PVC *2* MM ANTI-CHAMAS (SIMBOLOS, CORES E PICTOGRAMAS CONFORME NBR 13434)","UN    ",1,24.29,24.29,24.29,24.29]
[null,"MATERIAL (C) - TOTAL",null,null,null,null,null,null,24.529999999999998,24.529999999999998]
[]
[25,"FONTE","CÓDIGO","DESCRIÇÃO","UNIDADE","COEFIC.","CUSTO UNITÁRIO",null,"CUSTO  TOTAL (A) + (B) + (C) + (D) + (E)"]
[null,null,null,null,null,null,"DESONERADO","NÃO DESONER.","DESONERADO","NÃO DESONER."]
[null,"COMPOSIÇÃO","COMP 025_SEE","SINALIZADOR FOTOLUMINESCENTE DE EMERGÊNCIA","UN ",null,"-","-",25.269999999999996,25.389999999999997]
[null,"AGETOP_I",5,"SERVENTE","h     ",0.09,8.1999999999999993,9.51,0.74,0.86]
[null,"MÃO DE OBRA (B) - TOTAL",null,null,null,null,null,null,0.74,0.86]
[null,"AGETOP_I",3070,"BUCHA DE NYLON S-6","un",2,0.04,0.04,0.08,0.08]
[null,"AGETOP_I",3393,"PARAFUSO P/BUCHA S-6","un",2,0.08,0.08,0.16,0.16]
[null,"SINAPI_I",37556,"PLACA DE SINALIZACAO DE SEGURANCA CONTRA INCENDIO, FOTOLUMINESCENTE, QUADRADA, *20 X 20* CM, EM PVC *2* MM ANTI-CHAMAS (SIMBOLOS, CORES E PICTOGRAMAS CONFORME NBR 13434)","UN    ",1,24.29,24.29,24.29,24.29]
[null,"MATERIAL (C) - TOTAL",null,null,null,null,null,null,24.529999999999998,24.529999999999998]
[]
[84,"FONTE","CÓDIGO","DESCRIÇÃO","UNIDADE","COEFIC.","CUSTO UNITÁRIO",null,"CUSTO  TOTAL (A) + (B) + (C) + (D) + (E)"]
[null,null,null,null,null,null,"DESONERADO","NÃO DESONER.","DESONERADO","NÃO DESONER."]
[null,"COMPOSIÇÃO","COMP 084_SEE","GUARDA-CORPO COM CORRIMÃO - SEDUC","M",null,null,null,204.60000000000002,209.46]
[null,"AGETOP_I",25,"OFICIAL \"B\"","h     ",1.1000000000000001,13.4,15.53,14.74,17.079999999999998]
[null,"AGETOP_I",8,"AJUDANTE","h     ",1.1000000000000001,8.1999999999999993,9.51,9.02,10.46]
[null,null,null,"","",null,0,0,0,0]
[null,"MÃO DE OBRA (B) - TOTAL",null,null,null,null,null,null,23.759999999999998,27.54]
[null,"AGETOP_I",2376,"TUBO INDUSTRIAL 2\" CHAPA 13 ","Kg",7.7778,5.23,5.23,40.68,40.68]
[null,"AGETOP_I",2504,"TUBO INDUSTRIAL D=25 MM CHAPA 13 ","Kg",4.6319999999999997,5.07,5.07,23.48,23.48]
[null,"AGETOP_I",2377,"TUBO INDUSTRIAL 40X40 CH.13","Kg",6.3419999999999996,5.07,5.07,32.15,32.15]
[null,"AGETOP_I",2421,"TUBO INDUSTRIAL 1.1/2\" CHAPA 13 ","Kg",1.4862,5.07,5.07,7.54,7.54]
[null,"AGETOP_I",2417,"MASSA PLASTICA","Kg",0.2041,10.58,10.58,2.16,2.16]
[null,"AGETOP_I",2246,"ELETRODO 2.5 OK","Kg",0.11459999999999999,8.6999999999999993,8.6999999999999993,1,1]
[null,"AGETOP_I",1672,"LIXA PARA FERRO ( NÚMERO 100 )","un",0.25509999999999999,2.12,2.12,0.54,0.54]
[null,"AGETOP_I",1264,"DISCO DE DESBASTE 7/8\" P/ CONC./FERRO (1/4\" X 7\")","un",5.0999999999999997E-2,7,7,0.36,0.36]
[null,"AGETOP_I",1334,"DISCO DE CORTE DIAM. 5/8\"- 10\"","un",0.373,5.5,5.5,2.0499999999999998,2.0499999999999998]
[null,"AGETOP_I",2902,"FABRICAÇÃO / MONTAGEM","un",1,50.44,50.44,50.44,50.44]
[null,"AGETOP_I",2150,"CHAPA DE FERRO DOBRADA No.13","Kg",0.43519999999999998,5.28,5.28,2.2999999999999998,2.2999999999999998]
[null,"AGETOP_I",2719,"CHAPA PERFILADA 3/16\"","Kg",1.0979999999999999,5.04,5.04,5.53,5.53]
[null,"AGETOP_I",2436,"ACO CA-25 - 6,3 MM (1/4\") - BARRA LISA A-36","Kg",0.38124999999999998,5.13,5.13,1.96,1.96]
[null,"AGETOP",261602,"PINT.ESMALTE/ESQUAD.FERRO C/FUNDO ANTICOR.","m2    ",0.78,13.65,15.04,10.65,11.73]
[null,"MATERIAL (C) - TOTAL",null,null,null,null,null,null,180.84000000000003,181.92000000000002]
[]
[382,"FONTE","CÓDIGO","DESCRIÇÃO","UNIDADE","COEFIC.","CUSTO UNITÁRIO",null,"CUSTO  TOTAL (A) + (B) + (C) + (D) + (E)"]
[null,null,null,null,null,null,"DESONERADO","NÃO DESONER.","DESONERADO","NÃO DESONER."]
[null,"COMPOSIÇÃO","COMP 382_SEE","TE DE REDUCAO DE FERRO GALVANIZADO, COM ROSCA BSP, DE 3/4\" X 1/2\"","UN ",null,null,null,21.549999999999997,23.64]
[null,"AGETOP_I",8,"AJUDANTE","h     ",0.6,8.1999999999999993,9.51,4.92,5.71]
[null,"AGETOP_I",11,"ENCANADOR","h     ",0.61050000000000004,13.4,15.53,8.18,9.48]
[null,null,null,"","",null,0,0,0,0]
[null,"MÃO DE OBRA (B) - TOTAL",null,null,null,null,null,null,13.1,15.190000000000001]
[null,"SINAPI_I",3146,"FITA VEDA ROSCA EM ROLOS DE 18 MM X 10 M (L X C)","UN    ",0.12075471698113208,3.48,3.48,0.42,0.42]
[null,"SINAPI_I",6302,"TE DE REDUCAO DE FERRO GALVANIZADO, COM ROSCA BSP, DE 3/4\" X 1/2\"","UN    ",1,8.0299999999999994,8.0299999999999994,8.0299999999999994,8.0299999999999994]
[null,null,null,"","",null,0,0,0,0]
[null,"MATERIAL (C) - TOTAL",null,null,null,null,null,null,8.4499999999999993,8.4499999999999993]
[]
[383,"FONTE","CÓDIGO","DESCRIÇÃO","UNIDADE","COEFIC.","CUSTO UNITÁRIO",null,"CUSTO  TOTAL (A) + (B) + (C) + (D) + (E)"]
[null,null,null,null,null,null,"DESONERADO","NÃO DESONER.","DESONERADO","NÃO DESONER."]
[null,"COMPOSIÇÃO","COMP 383_SEE","BUCHA DE REDUCAO DE FERRO GALVANIZADO, COM ROSCA BSP, DE 1/2\" X 1/4\"","UN ",null,null,null,6.75,7.3]
[null,"AGETOP_I",8,"AJUDANTE","h     ",0.16,8.1999999999999993,9.51,1.31,1.52]
[null,"AGETOP_I",11,"ENCANADOR","h     ",0.16,13.4,15.53,2.14,2.48]
[null,null,null,"","",null,0,0,0,0]
[null,"MÃO DE OBRA (B) - TOTAL",null,null,null,null,null,null,3.45,4]
[null,"AGETOP_I","H689","FITA VEDAROSCA 12 MM","m",1.2,0.28000000000000003,0.28000000000000003,0.34,0.34]
[null,"SINAPI_I",770,"BUCHA DE REDUCAO DE FERRO GALVANIZADO, COM ROSCA BSP, DE 1/2\" X 1/4\"","UN    ",1,2.96,2.96,2.96,2.96]
[null,null,null,"","",null,0,0,0,0]
[null,"MATERIAL (C) - TOTAL",null,null,null,null,null,null,3.3,3.3]
[]
[212,"FONTE","CÓDIGO","DESCRIÇÃO","UNIDADE","COEFIC.","CUSTO UNITÁRIO",null,"CUSTO  TOTAL (A) + (B) + (C) + (D) + (E)"]
[null,null,null,null,null,null,"DESONERADO","NÃO DESONER.","DESONERADO","NÃO DESONER."]
[null,"COMPOSIÇÃO","COMP 212_SEE","NIPLE DE REDUÇÃO 1/2\" X 1/4\" BSP","UN ",null,null,null,9.5,10.050000000000001]
[null,"AGETOP_I",8,"AJUDANTE","h     ",0.16,8.1999999999999993,9.51,1.31,1.52]
[null,"AGETOP_I",11,"ENCANADOR","h     ",0.16,13.4,15.53,2.14,2.48]
[null,null,null,"","",null,0,0,0,0]
[null,"MÃO DE OBRA (B) - TOTAL",null,null,null,null,null,null,3.45,4]
[null,"COTAÇÃO","COT 103_SEE","NIPLE DE REDUÇÃO 1/2\" X 1/4\" BSP","UN",1,6.0533333333333337,6.0533333333333337,6.05,6.05]
[null,null,null,"","",null,0,0,0,0]
[null,null,null,"","",null,0,0,0,0]
[null,"MATERIAL (C) - TOTAL",null,null,null,null,null,null,6.05,6.05]
[]
[213,"FONTE","CÓDIGO","DESCRIÇÃO","UNIDADE","COEFIC.","CUSTO UNITÁRIO",null,"CUSTO  TOTAL (A) + (B) + (C) + (D) + (E)"]
[null,null,null,null,null,null,"DESONERADO","NÃO DESONER.","DESONERADO","NÃO DESONER."]
[null,"COMPOSIÇÃO","COMP 213_SEE","NIPLE DE REDUÇÃO 3/4\" X 1/2\" BSP","UN ",null,null,null,13.16,13.71]
[null,"AGETOP_I",8,"AJUDANTE","h     ",0.16,8.1999999999999993,9.51,1.31,1.52]
[null,"AGETOP_I",11,"ENCANADOR","h     ",0.16,13.4,15.53,2.14,2.48]
[null,null,null,"","",null,0,0,0,0]
[null,"MÃO DE OBRA (B) - TOTAL",null,null,null,null,null,null,3.45,4]
[null,"COTAÇÃO","COT 104_SEE","NIPLE DE REDUÇÃO 3/4\" X 1/2\" BSP","UN",1,9.7099999999999991,9.7099999999999991,9.7100000000000009,9.7100000000000009]
[null,null,null,"","",null,0,0,0,0]
[null,null,null,"","",null,0,0,0,0]
[null,"MATERIAL (C) - TOTAL",null,null,null,null,null,null,9.7100000000000009,9.7100000000000009]
[]
[237,"FONTE","CÓDIGO","DESCRIÇÃO","UNIDADE","COEFIC.","CUSTO UNITÁRIO",null,"CUSTO  TOTAL (A) + (B) + (C) + (D) + (E)"]
[null,null,null,null,null,null,"DESONERADO","NÃO DESONER.","DESONERADO","NÃO DESONER."]
[null,"COMPOSIÇÃO","COMP 237_SEE","FITA ANTICORROSIVA","M",null,null,null,11.100000000000001,11.79]
[null,"AGETOP_I",8,"AJUDANTE","h     ",0.2,8.1999999999999993,9.51,1.64,1.9]
[null,"AGETOP_I",12,"ELETRICISTA","h     ",0.2,13.4,15.53,2.68,3.11]
[null,null,null,"","",null,0,0,0,0]
[null,"MÃO DE OBRA (B) - TOTAL",null,null,null,null,null,null,4.32,5.01]
[null,"SINAPI_I",39634,"FITA ADESIVA ANTICORROSIVA DE PVC FLEXIVEL, COR PRETA, PARA PROTECAO TUBULACAO, 50 MM X 30 M (L X C), E= *0,25* MM","M     ",1,6.78,6.78,6.78,6.78]
[null,null,null,"","",null,0,0,0,0]
[null,null,null,"","",null,0,0,0,0]
[null,"MATERIAL (C) - TOTAL",null,null,null,null,null,null,6.78,6.78]
[]
[542,"FONTE","CÓDIGO","DESCRIÇÃO","UNIDADE","COEFIC.","CUSTO UNITÁRIO",null,"CUSTO  TOTAL (A) + (B) + (C) + (D) + (E)"]
[null,null,null,null,null,null,"DESONERADO","NÃO DESONER.","DESONERADO","NÃO DESONER."]
[null,"COMPOSIÇÃO","COMP 542_SEE","VÁLVULA UGV 3/4\" (S) LATÃO","UN ",null,null,null,25.17,26.66]
[null,"AGETOP_I",8,"AJUDANTE","h     ",0.432,8.1999999999999993,9.51,3.54,4.1100000000000003]
[null,"AGETOP_I",11,"ENCANADOR","h     ",0.432,13.4,15.53,5.79,6.71]
[null,null,null,"","",null,0,0,0,0]
[null,"MÃO DE OBRA (B) - TOTAL",null,null,null,null,null,null,9.33,10.82]
[null,"COTAÇÃO","COT 281_SEE","VÁLVULA UGV 3/4\" (S) LATÃO","UN ",1,15.836666666666666,15.836666666666666,15.84,15.84]
[null,null,null,"","",null,0,0,0,0]
[null,null,null,"","",null,0,0,0,0]
[null,"MATERIAL (C) - TOTAL",null,null,null,null,null,null,15.84,15.84]
[]
[543,"FONTE","CÓDIGO","DESCRIÇÃO","UNIDADE","COEFIC.","CUSTO UNITÁRIO",null,"CUSTO  TOTAL (A) + (B) + (C) + (D) + (E)"]
[null,null,null,null,null,null,"DESONERADO","NÃO DESONER.","DESONERADO","NÃO DESONER."]
[null,"COMPOSIÇÃO","COMP 543_SEE","VÁLVULA UGV 1/2\" (S) LATÃO","UN ",null,null,null,24.5,25.990000000000002]
[null,"AGETOP_I",8,"AJUDANTE","h     ",0.432,8.1999999999999993,9.51,3.54,4.1100000000000003]
[null,"AGETOP_I",11,"ENCANADOR","h     ",0.432,13.4,15.53,5.79,6.71]
[null,null,null,"","",null,0,0,0,0]
[null,"MÃO DE OBRA (B) - TOTAL",null,null,null,null,null,null,9.33,10.82]
[null,"COTAÇÃO","COT 282_SEE","VÁLVULA UGV 1/2\" (S) LATÃO","UN ",1,15.166666666666666,15.166666666666666,15.17,15.17]
[null,null,null,"","",null,0,0,0,0]
[null,null,null,"","",null,0,0,0,0]
[null,"MATERIAL (C) - TOTAL",null,null,null,null,null,null,15.17,15.17]
[]
[211,"FONTE","CÓDIGO","DESCRIÇÃO","UNIDADE","COEFIC.","CUSTO UNITÁRIO",null,"CUSTO  TOTAL (A) + (B) + (C) + (D) + (E)"]
[null,null,null,null,null,null,"DESONERADO","NÃO DESONER.","DESONERADO","NÃO DESONER."]
[null,"COMPOSIÇÃO","COMP 211_SEE","REGULADOR DE 2º ESTÁGIO 5KG/H","UN ",null,null,null,85.46,89.419999999999987]
[null,"AGETOP_I",8,"AJUDANTE","h     ",1.1499999999999999,8.1999999999999993,9.51,9.43,10.94]
[null,"AGETOP_I",11,"ENCANADOR","h     ",1.1499999999999999,13.4,15.53,15.41,17.86]
[null,null,null,"","",null,0,0,0,0]
[null,"MÃO DE OBRA (B) - TOTAL",null,null,null,null,null,null,24.84,28.799999999999997]
[null,"COTAÇÃO","COT 102_SEE","REGULADOR DE 2º ESTÁGIO 5KG/H","UN",1,59.833333333333336,59.833333333333336,59.83,59.83]
[null,"AGETOP_I","H689","FITA VEDAROSCA 12 MM","m",2.82,0.28000000000000003,0.28000000000000003,0.79,0.79]
[null,null,null,"","",null,0,0,0,0]
[null,"MATERIAL (C) - TOTAL",null,null,null,null,null,null,60.62,60.62]
[]
[210,"FONTE","CÓDIGO","DESCRIÇÃO","UNIDADE","COEFIC.","CUSTO UNITÁRIO",null,"CUSTO  TOTAL (A) + (B) + (C) + (D) + (E)"]
[null,null,null,null,null,null,"DESONERADO","NÃO DESONER.","DESONERADO","NÃO DESONER."]
[null,"COMPOSIÇÃO","COMP 210_SEE","REGULADOR DE 1º ESTÁGIO 60KG/H MODELO AP-40  COM MANÔMETRO","UN ",null,null,null,231.21,235.17000000000002]
[null,"AGETOP_I",8,"AJUDANTE","h     ",1.1499999999999999,8.1999999999999993,9.51,9.43,10.94]
[null,"AGETOP_I",11,"ENCANADOR","h     ",1.1499999999999999,13.4,15.53,15.41,17.86]
[null,null,null,"","",null,0,0,0,0]
[null,"MÃO DE OBRA (B) - TOTAL",null,null,null,null,null,null,24.84,28.799999999999997]
[null,"COTAÇÃO","COT 101_SEE","REGULADOR DE 1º ESTÁGIO 60KG/H MODELO AP-40  COM MANÔMETRO","UN",1,205.57666666666668,205.57666666666668,205.58,205.58]
[null,"AGETOP_I","H689","FITA VEDAROSCA 12 MM","m",2.82,0.28000000000000003,0.28000000000000003,0.79,0.79]
[null,null,null,"","",null,0,0,0,0]
[null,"MATERIAL (C) - TOTAL",null,null,null,null,null,null,206.37,206.37]
[]
[235,"FONTE","CÓDIGO","DESCRIÇÃO","UNIDADE","COEFIC.","CUSTO UNITÁRIO",null,"CUSTO  TOTAL (A) + (B) + (C) + (D) + (E)"]
[null,null,null,null,null,null,"DESONERADO","NÃO DESONER.","DESONERADO","NÃO DESONER."]
[null,"COMPOSIÇÃO","COMP 235_SEE","PLACA DE SINALIZAÇÃO EM PVC COD 01 - (300X300) PROIBIDO FUMAR","UN ",null,null,null,25.269999999999996,25.389999999999997]
[null,"AGETOP_I",5,"SERVENTE","h     ",0.09,8.1999999999999993,9.51,0.74,0.86]
[null,null,null,"","",null,0,0,0,0]
[null,null,null,"","",null,0,0,0,0]
[null,"MÃO DE OBRA (B) - TOTAL",null,null,null,null,null,null,0.74,0.86]
[null,"AGETOP_I",3070,"BUCHA DE NYLON S-6","un",2,0.04,0.04,0.08,0.08]
[null,"AGETOP_I",3393,"PARAFUSO P/BUCHA S-6","un",2,0.08,0.08,0.16,0.16]
[null,"SINAPI_I",37556,"PLACA DE SINALIZACAO DE SEGURANCA CONTRA INCENDIO, FOTOLUMINESCENTE, QUADRADA, *20 X 20* CM, EM PVC *2* MM ANTI-CHAMAS (SIMBOLOS, CORES E PICTOGRAMAS CONFORME NBR 13434)","UN    ",1,24.29,24.29,24.29,24.29]
[null,"MATERIAL (C) - TOTAL",null,null,null,null,null,null,24.529999999999998,24.529999999999998]
[]
[236,"FONTE","CÓDIGO","DESCRIÇÃO","UNIDADE","COEFIC.","CUSTO UNITÁRIO",null,"CUSTO  TOTAL (A) + (B) + (C) + (D) + (E)"]
[null,null,null,null,null,null,"DESONERADO","NÃO DESONER.","DESONERADO","NÃO DESONER."]
[null,"COMPOSIÇÃO","COMP 236_SEE","PLACA DE SINALIZAÇÃO EM PVC COD 06 - (300X300) PERIGO INFLAMÁVEL","UN ",null,null,null,25.269999999999996,25.389999999999997]
[null,"AGETOP_I",5,"SERVENTE","h     ",0.09,8.1999999999999993,9.51,0.74,0.86]
[null,null,null,"","",null,0,0,0,0]
[null,null,null,"","",null,0,0,0,0]
[null,"MÃO DE OBRA (B) - TOTAL",null,null,null,null,null,null,0.74,0.86]
[null,"AGETOP_I",3070,"BUCHA DE NYLON S-6","un",2,0.04,0.04,0.08,0.08]
[null,"AGETOP_I",3393,"PARAFUSO P/BUCHA S-6","un",2,0.08,0.08,0.16,0.16]
[null,"SINAPI_I",37556,"PLACA DE SINALIZACAO DE SEGURANCA CONTRA INCENDIO, FOTOLUMINESCENTE, QUADRADA, *20 X 20* CM, EM PVC *2* MM ANTI-CHAMAS (SIMBOLOS, CORES E PICTOGRAMAS CONFORME NBR 13434)","UN    ",1,24.29,24.29,24.29,24.29]
[null,"MATERIAL (C) - TOTAL",null,null,null,null,null,null,24.529999999999998,24.529999999999998]
[]
[83,"FONTE","CÓDIGO","DESCRIÇÃO","UNIDADE","COEFIC.","CUSTO UNITÁRIO",null,"CUSTO  TOTAL (A) + (B) + (C) + (D) + (E)"]
[null,null,null,null,null,null,"DESONERADO","NÃO DESONER.","DESONERADO","NÃO DESONER."]
[null,"COMPOSIÇÃO","COMP 083_SEE","CORRIMÃO PISO - SEDUC","M",null,null,null,141.9,145.95000000000002]
[null,"AGETOP_I",25,"OFICIAL \"B\"","h     ",1,13.4,15.53,13.4,15.53]
[null,"AGETOP_I",8,"AJUDANTE","h     ",1,8.1999999999999993,9.51,8.1999999999999993,9.51]
[null,"MÃO DE OBRA (B) - TOTAL",null,null,null,null,null,null,21.6,25.04]
[null,"AGETOP_I",2376,"TUBO INDUSTRIAL 2\" CHAPA 13 ","Kg",8.2197499999999994,5.23,5.23,42.99,42.99]
[null,"AGETOP_I",2504,"TUBO INDUSTRIAL D=25 MM CHAPA 13 ","Kg",1.1000000000000001,5.07,5.07,5.58,5.58]
[null,"AGETOP_I",2417,"MASSA PLASTICA","Kg",0.2041,10.58,10.58,2.16,2.16]
[null,"AGETOP_I",2246,"ELETRODO 2.5 OK","Kg",0.11459999999999999,8.6999999999999993,8.6999999999999993,1,1]
[null,"AGETOP_I",1672,"LIXA PARA FERRO ( NÚMERO 100 )","un",0.125,2.12,2.12,0.27,0.27]
[null,"AGETOP_I",1264,"DISCO DE DESBASTE 7/8\" P/ CONC./FERRO (1/4\" X 7\")","un",2.5000000000000001E-2,7,7,0.18,0.18]
[null,"AGETOP_I",1334,"DISCO DE CORTE DIAM. 5/8\"- 10\"","un",0.1865,5.5,5.5,1.03,1.03]
[null,"AGETOP_I",2902,"FABRICAÇÃO / MONTAGEM","un",1,50.44,50.44,50.44,50.44]
[null,"AGETOP_I",2150,"CHAPA DE FERRO DOBRADA No.13","Kg",0.43519999999999998,5.28,5.28,2.2999999999999998,2.2999999999999998]
[null,"AGETOP_I",2719,"CHAPA PERFILADA 3/16\"","Kg",1.1644000000000001,5.04,5.04,5.87,5.87]
[null,"AGETOP_I",2436,"ACO CA-25 - 6,3 MM (1/4\") - BARRA LISA A-36","Kg",0.48150000000000004,5.13,5.13,2.4700000000000002,2.4700000000000002]
[null,"AGETOP",261602,"PINT.ESMALTE/ESQUAD.FERRO C/FUNDO ANTICOR.","m2    ",0.44,13.65,15.04,6.01,6.62]
[null,"MATERIAL (C) - TOTAL",null,null,null,null,null,null,120.30000000000001,120.91000000000001]
[]
[209,"FONTE","CÓDIGO","DESCRIÇÃO","UNIDADE","COEFIC.","CUSTO UNITÁRIO",null,"CUSTO  TOTAL (A) + (B) + (C) + (D) + (E)"]
[null,null,null,null,null,null,"DESONERADO","NÃO DESONER.","DESONERADO","NÃO DESONER."]
[null,"COMPOSIÇÃO","COMP 209_SEE","TOALHEIRO PLÁSTICO TIPO DISPENSER PARA PAPEL TOALHA INTERFOLHADO","UN ",null,null,null,52.15,53.01]
[null,"AGETOP_I",8,"AJUDANTE","h     ",0.25,8.1999999999999993,9.51,2.0499999999999998,2.38]
[null,"AGETOP_I",4,"PEDREIRO","h     ",0.25,13.4,15.53,3.35,3.88]
[null,"MÃO DE OBRA (B) - TOTAL",null,null,null,null,null,null,5.4,6.26]
[null,"SINAPI_I",37401,"TOALHEIRO PLASTICO TIPO DISPENSER PARA PAPEL TOALHA INTERFOLHADO","UN    ",1,45.95,45.95,45.95,45.95]
[null,"AGETOP_I",2221,"PARAFUSO COM BUCHA S-8","un",4,0.2,0.2,0.8,0.8]
[null,"MATERIAL (C) - TOTAL",null,null,null,null,null,null,46.75,46.75]
[]
[541,"FONTE","CÓDIGO","DESCRIÇÃO","UNIDADE","COEFIC.","CUSTO UNITÁRIO",null,"CUSTO  TOTAL (A) + (B) + (C) + (D) + (E)"]
[null,null,null,null,null,null,"DESONERADO","NÃO DESONER.","DESONERADO","NÃO DESONER."]
[null,"COMPOSIÇÃO","COMP 541_SEE","BANCADA DE GRANITO CINZA POLIDO - FORNECIMENTO E INSTALAÇÃO. ","M2    ",null,null,null,464.40999999999997,469.28]
[null,"SINAPI",88274,"MARMORISTA/GRANITEIRO COM ENCARGOS COMPLEMENTARES","H",1.6555555555555557,17.3,19.350000000000001,28.64,32.04]
[null,"SINAPI",88316,"SERVENTE COM ENCARGOS COMPLEMENTARES","H",1.088888888888889,12.8,14.15,13.94,15.41]
[null,null,null,"","",null,0,0,0,0]
[null,"MÃO DE OBRA (B) - TOTAL",null,null,null,null,null,null,42.58,47.45]
[null,"SINAPI_I",4823,"MASSA PLASTICA PARA MARMORE/GRANITO","KG    ",0.58088888888888901,29.37,29.37,17.059999999999999,17.059999999999999]
[null,"SINAPI_I",7568,"BUCHA DE NYLON SEM ABA S10, COM PARAFUSO DE 6,10 X 65 MM EM ACO ZINCADO COM ROSCA SOBERBA, CABECA CHATA E FENDA PHILLIPS","UN    ",6.666666666666667,0.49,0.49,3.27,3.27]
[null,"SINAPI_I",11795,"GRANITO PARA BANCADA, POLIDO, TIPO ANDORINHA/ QUARTZ/ CASTELO/ CORUMBA OU OUTROS EQUIVALENTES DA REGIAO, E=  *2,5* CM","M2    ",1.1166666666666667,290.56,290.56,324.45999999999998,324.45999999999998]
[null,"SINAPI_I",37329,"REJUNTE EPOXI BRANCO","KG    ",3.9E-2,39.869999999999997,39.869999999999997,1.55,1.55]
[null,"SINAPI_I",37591,"SUPORTE MAO-FRANCESA EM ACO, ABAS IGUAIS 40 CM, CAPACIDADE MINIMA 70 KG, BRANCO","UN    ",2.2222222222222223,33.97,33.97,75.489999999999995,75.489999999999995]
[null,"MATERIAL (C) - TOTAL",null,null,null,null,null,null,421.83,421.83]
[]
[206,"FONTE","CÓDIGO","DESCRIÇÃO","UNIDADE","COEFIC.","CUSTO UNITÁRIO",null,"CUSTO  TOTAL (A) + (B) + (C) + (D) + (E)"]
[null,null,null,null,null,null,"DESONERADO","NÃO DESONER.","DESONERADO","NÃO DESONER."]
[null,"COMPOSIÇÃO","COMP 206_SEE","BANCO ARTICULADO PARA BANHO, EM ACO INOX POLIDO, 70* CM X 45* CM","UN ",null,null,null,729.41000000000008,732.85]
[null,"AGETOP_I",8,"AJUDANTE","h     ",1,8.1999999999999993,9.51,8.1999999999999993,9.51]
[null,"AGETOP_I",11,"ENCANADOR","h     ",1,13.4,15.53,13.4,15.53]
[null,null,null,"","",null,0,0,0,0]
[null,"MÃO DE OBRA (B) - TOTAL",null,null,null,null,null,null,21.6,25.04]
[null,"SINAPI_I",36215,"BANCO ARTICULADO PARA BANHO, EM ACO INOX POLIDO, 70* CM X 45* CM","UN    ",1,706.21,706.21,706.21,706.21]
[null,"AGETOP_I",2221,"PARAFUSO COM BUCHA S-8","un",8,0.2,0.2,1.6,1.6]
[null,null,null,"","",null,0,0,0,0]
[null,"MATERIAL (C) - TOTAL",null,null,null,null,null,null,707.81000000000006,707.81000000000006]