{"text_format":"1","workbook":"xlsx","n_sheets":8,"sheets":["Orçamento","Resumo ","Somatório","Cronog_60_Dias","Composição BDI","Relatório CENTRAL","Parc Maior Relev","Composições"],"not_rendered":{"charts":0,"images":5,"macros":1,"external_links":0,"defined_names":77,"comments":1,"pivot_tables":0},"unopened":[],"bounds":{"document_bytes":16777216,"sheet_cells":100000,"rows_first":2000,"rows_last":500,"rows_between":2000,"halvings":0,"cell_chars":16384,"cell_head_chars":4096},"cells_cut":0,"cells_raw":0,"read":"whole","date_system":"1900"}

{"sheet":"Orçamento","index":0,"n_rows":535,"n_cols":26,"rows_kept":535,"cut":false,"hidden":false,"merged":[[513,15,513,17],[513,18,513,21],[513,22,513,24],[514,15,514,17],[514,18,514,21],[514,22,514,24],[515,15,515,17],[515,18,515,21],[515,22,515,24],[523,15,523,17],[523,18,523,21],[523,22,523,24],[524,15,524,17],[524,18,524,21],[524,22,524,24],[516,18,516,21],[516,22,516,24],[517,15,517,17],[517,18,517,21],[517,22,517,24],[518,15,518,17],[518,18,518,21],[518,22,518,24],[503,14,503,17],[510,15,510,17],[476,15,476,17],[531,18,531,21],[531,22,531,24],[519,15,519,17],[519,18,519,21],[519,22,519,24],[520,15,520,17],[520,18,520,21],[520,22,520,24],[521,15,521,17],[521,18,521,21],[521,22,521,24],[525,15,525,17],[525,18,525,21],[525,22,525,24],[526,15,526,17],[526,18,526,21],[526,22,526,24],[527,15,527,17],[516,15,516,17],[471,16,471,24],[512,15,512,17],[512,18,512,21],[512,22,512,24],[534,18,534,21],[534,22,534,24],[531,14,531,17],[528,15,528,17],[528,18,528,21],[528,22,528,24],[529,15,529,17],[529,18,529,21],[529,22,529,24],[530,15,530,17],[530,18,530,21],[530,22,530,24],[533,18,533,21],[533,22,533,24],[532,18,532,21],[532,22,532,24],[527,18,527,21],[527,22,527,24],[522,15,522,17],[522,18,522,21],[522,22,522,24],[481,15,481,17],[482,15,482,17],[483,15,483,17],[484,15,484,17],[485,15,485,17],[489,15,489,17],[490,15,490,17],[491,15,491,17],[492,15,492,17],[509,14,509,25],[510,18,510,21],[510,22,510,24],[511,15,511,17],[511,18,511,21],[511,22,511,24],[493,15,493,17],[494,15,494,17],[495,15,495,17],[496,15,496,17],[497,15,497,17],[498,15,498,17],[499,15,499,17],[500,15,500,17],[501,15,501,17],[502,15,502,17],[500,18,500,21],[496,18,496,21],[496,22,496,24],[481,18,481,21],[481,22,481,24],[467,16,467,24],[468,16,468,24],[469,16,469,24],[3,22,3,24],[2,22,2,24],[5,22,5,24],[10,14,10,25],[13,14,13,25],[6,22,6,24],[9,17,9,21],[2,14,2,21],[3,14,3,21],[5,18,5,21],[6,18,6,21],[11,18,11,21],[12,18,12,21],[6,14,6,17],[5,14,5,17],[461,21,461,22],[463,21,463,22],[460,23,460,24],[485,18,485,21],[485,22,485,24],[486,18,486,21],[486,22,486,24],[487,18,487,21],[487,22,487,24],[488,18,488,21],[488,22,488,24],[482,18,482,21],[482,22,482,24],[483,18,483,21],[483,22,483,24],[478,18,478,21],[478,22,478,24],[479,18,479,21],[479,22,479,24],[480,18,480,21],[480,22,480,24],[475,14,475,25],[478,15,478,17],[479,15,479,17],[480,15,480,17],[477,22,477,24],[464,21,464,22],[459,17,464,17],[459,21,459,22],[476,18,476,21],[476,22,476,24],[477,18,477,21],[464,23,464,24],[465,23,465,24],[470,16,470,24],[465,21,465,22],[459,23,459,24],[460,21,460,22],[477,15,477,17],[472,18,472,24],[461,23,461,24],[463,23,463,24],[491,22,491,24],[484,18,484,21],[484,22,484,24],[506,18,506,21],[506,22,506,24],[503,18,503,21],[503,22,503,24],[500,22,500,24],[501,18,501,21],[501,22,501,24],[502,18,502,21],[502,22,502,24],[492,18,492,21],[492,22,492,24],[499,18,499,21],[499,22,499,24],[494,22,494,24],[495,18,495,21],[495,22,495,24],[490,18,490,21],[497,18,497,21],[493,18,493,21],[493,22,493,24],[494,18,494,21],[8,12,9,12],[505,18,505,21],[505,22,505,24],[0,14,0,24],[8,14,8,16],[9,14,9,16],[11,14,11,16],[12,14,12,16],[14,14,14,24],[1,14,1,24],[4,14,4,24],[7,14,7,24],[489,18,489,21],[489,22,489,24],[497,22,497,24],[486,15,486,17],[487,15,487,17],[488,15,488,17],[490,22,490,24],[498,18,498,21],[498,22,498,24],[504,18,504,21],[504,22,504,24],[491,18,491,21]]}
[]
[]
[null,null,null,null,null,null,null,null,null,null,null,null,null,null,"UNIDADE ESCOLAR",null,null,null,null,null,null,null,"CÓDIGO INEP"]
[null,null,null,null,null,null,null,null,null,null,null,null,null,null,"COLÉGIO ESTADUAL SÃO GERALDO",null,null,null,null,null,null,null,52038343]
[]
["Nmax",null,null,null,null,null,null,null,null,null,null,null,"Ajustar altura?",null,"OBRA",null,null,null,"DATA",null,null,null,"CIDADE"]
[{"$f":"MAX($C$18:$C$459)","v":3},null,null,null,null,null,null,null,null,null,null,null,"SIM",null,"AMPLIAÇÃO E REFORMA",null,null,null,"2020-04-08",null,null,null,"GOIANIRA"]
[]
[null,null,null,null,null,null,null,null,null,null,null,null,"",null,"CRECE",null,null,"ENDEREÇO",null,null,null,null,"REFERÊNCIA AGETOP"]
[null,null,null,null,null,null,null,null,null,null,null,null,null,null,"INHUMAS",null,null,"RUA 1 S/N, VILA LEO LYNCE, CEP:75370-000",null,null,null,null,"DEZ/18",null,"NÃO DESONERADA"]
[]
[null,null,null,null,null,null,null,null,null,null,null,null,null,null,"ÁREA EXISTENTE (M²)",null,null,"ÁREA A CONSTRUIR (M²)","ÁREA TOTAL CONSTRUÍDA (M²)",null,null,null,"REFERÊNCIA SINAPI"]
[null,null,null,null,null,null,null,null,null,null,null,null,null,null,1885,null,null,619.21,2504.21,null,null,null,"JAN/19",null,"NÃO DESONERADA"]
[]
[null,null,null,null,null,null,null,null,null,null,null,"FILTRO",null,null,"PLANILHA ORÇAMENTÁRIA"]
{"$rows_left_out":521}
{"sheet":"Resumo ","index":1,"n_rows":37,"n_cols":8,"rows_kept":37,"cut":false,"hidden":false,"merged":[[0,0,0,7],[19,1,19,4],[28,1,28,2],[29,1,29,2],[6,5,6,7],[7,0,7,7],[8,5,8,7],[9,5,9,7],[13,0,13,7],[1,0,1,7],[2,5,2,7],[3,5,3,7],[17,1,17,4],[18,1,18,4],[4,0,4,7],[5,5,5,7],[16,1,16,4],[31,1,31,2],[32,1,32,2],[33,1,33,2],[30,1,30,2],[21,1,21,2],[22,1,22,2],[9,0,9,4],[11,2,11,4],[12,2,12,4],[10,0,10,7],[11,5,11,7],[12,5,12,7],[2,0,2,4],[3,0,3,4],[5,0,5,4],[6,0,6,4],[8,0,8,4],[42,2,42,6],[11,0,11,1],[12,0,12,1],[14,0,14,7],[23,1,23,2],[20,1,20,2],[41,2,41,6],[24,1,24,2],[26,1,26,2],[27,1,27,2],[38,0,38,7],[25,1,25,2],[36,0,36,4],[34,1,34,2],[35,1,35,2],[15,1,15,4]]}
[]
[]
["UNIDADE ESCOLAR",null,null,null,null,"CÓDIGO INEP"]
[{"$f":"Orçamento!$O$4","v":"COLÉGIO ESTADUAL SÃO GERALDO"},null,null,null,null,{"$f":"Orçamento!W4","v":52038343}]
[]
["OBRA",null,null,null,null,"CIDADE"]
[{"$f":"Orçamento!$O$7","v":"AMPLIAÇÃO E REFORMA"},null,null,null,null,{"$f":"Orçamento!$W$7","v":"GOIANIRA"}]
[]
["ENDEREÇO",null,null,null,null,"CRECE"]
[{"$f":"Orçamento!$R$10","v":"RUA 1 S/N, VILA LEO LYNCE, CEP:75370-000"},null,null,null,null,{"$f":"Orçamento!$O$10","v":"INHUMAS"}]
[]
["REFERÊNCIA",null,"DATA",null,null,"ÁREA TOTAL CONSTRUÍDA (M²)"]
[{"$f":"CONCATENATE(\"AGETOP E SINAPI - \",Orçamento!$Y$10)","v":"AGETOP E SINAPI - NÃO DESONERADA"},null,{"$f":"Orçamento!$S$7","v":"2020-04-08"},null,null,{"$f":"Orçamento!$S$13","v":2504.21}]
[]
["RESUMO GERAL DO ORÇAMENTO"]
{"$rows_left_out":23}
{"sheet":"Somatório","index":2,"n_rows":45,"n_cols":6,"rows_kept":45,"cut":false,"hidden":false,"merged":[[13,0,14,0],[42,1,42,2],[44,1,44,5],[47,3,47,5],[48,3,48,5],[13,1,13,5],[9,1,9,3],[9,4,9,5],[11,1,11,2],[11,4,11,5],[12,1,12,2],[12,4,12,5],[0,1,0,5],[14,1,14,5],[2,1,2,3],[2,4,2,5],[3,1,3,3],[3,4,3,5],[5,1,5,3],[5,4,5,5],[6,1,6,3],[6,4,6,5],[8,1,8,3],[8,4,8,5],[1,1,1,5],[4,1,4,5],[7,1,7,5],[10,1,10,5]]}
[]
[]
[null,"UNIDADE ESCOLAR",null,null,"CÓDIGO INEP"]
[null,{"$f":"Orçamento!$O$4","v":"COLÉGIO ESTADUAL SÃO GERALDO"},null,null,{"$f":"Orçamento!W4","v":52038343}]
[]
[null,"OBRA",null,null,"CIDADE"]
[null,{"$f":"Orçamento!$O$7","v":"AMPLIAÇÃO E REFORMA"},null,null,{"$f":"Orçamento!$W$7","v":"GOIANIRA"}]
[]
[null,"ENDEREÇO",null,null,"CRECE"]
[null,{"$f":"Orçamento!$R$10","v":"RUA 1 S/N, VILA LEO LYNCE, CEP:75370-000"},null,null,{"$f":"Orçamento!$O$10","v":"INHUMAS"}]
[]
[null,"REFERÊNCIA",null,"DATA","ÁREA TOTAL CONSTRUÍDA (M²)"]
[null,{"$f":"CONCATENATE(\"AGETOP E SINAPI - \",Orçamento!$Y$10)","v":"AGETOP E SINAPI - NÃO DESONERADA"},null,{"$f":"Orçamento!$S$7","v":"2020-04-08"},{"$f":"Orçamento!$S$13","v":2504.21}]
["FILTRO"]
[null,"SOMATÓRIO DE SERVIÇOS"]
{"$rows_left_out":31}
{"sheet":"Cronog_60_Dias","index":3,"n_rows":98,"n_cols":20,"rows_kept":98,"cut":false,"hidden":false,"merged":[[11,0,12,0],[8,0,10,0],[10,1,10,13],[91,1,91,2],[91,5,91,8],[91,9,91,12],[92,1,92,2],[92,5,92,8],[92,9,92,12],[73,9,73,12],[73,5,73,8],[67,9,67,12],[69,5,69,8],[69,9,69,12],[58,5,58,8],[70,1,72,2],[70,4,72,4],[70,5,70,8],[70,9,70,12],[72,5,72,8],[72,9,72,12],[58,9,58,12],[60,5,60,8],[60,9,60,12],[93,1,93,2],[93,5,93,8],[93,9,93,12],[75,5,75,8],[75,9,75,12],[76,5,76,8],[76,9,76,12],[78,5,78,8],[78,9,78,12],[79,5,79,8],[79,9,79,12],[81,5,81,8],[81,9,81,12],[76,3,78,3],[79,3,81,3],[85,1,87,2],[79,4,81,4],[94,1,94,2],[94,5,94,8],[94,9,94,12],[96,1,96,4],[97,1,97,13],[85,9,85,12],[87,5,87,8],[87,9,87,12],[84,5,84,8],[84,9,84,12],[88,1,90,2],[88,4,90,4],[88,5,88,8],[88,9,88,12],[90,5,90,8],[90,9,90,12],[88,3,90,3],[85,4,87,4],[85,5,85,8],[85,3,87,3],[82,1,84,2],[82,4,84,4],[82,5,82,8],[82,9,82,12],[67,5,67,8],[64,5,64,8],[64,9,64,12],[66,5,66,8],[66,9,66,12],[64,3,66,3],[61,9,61,12],[63,5,63,8],[63,9,63,12],[61,5,61,8],[52,9,52,12],[54,5,54,8],[54,9,54,12],[49,5,49,8],[49,9,49,12],[51,5,51,8],[51,9,51,12],[55,9,55,12],[57,5,57,8],[57,9,57,12],[52,5,52,8],[55,5,55,8],[43,9,43,12],[45,5,45,8],[45,9,45,12],[46,1,48,2],[46,4,48,4],[46,5,46,8],[46,9,46,12],[48,5,48,8],[48,9,48,12],[43,5,43,8],[46,3,48,3],[34,9,34,12],[36,5,36,8],[36,9,36,12],[34,3,36,3],[39,9,39,12],[37,3,39,3],[37,9,37,12],[40,1,42,2],[40,4,42,4],[40,5,40,8],[40,9,40,12],[42,5,42,8],[42,9,42,12],[40,3,42,3],[34,5,34,8],[37,5,37,8],[39,5,39,8],[28,9,28,12],[30,5,30,8],[30,9,30,12],[31,1,33,2],[31,4,33,4],[31,5,31,8],[31,9,31,12],[33,5,33,8],[33,9,33,12],[31,3,33,3],[28,5,28,8],[28,1,30,2],[28,4,30,4],[22,9,22,12],[24,5,24,8],[24,9,24,12],[25,1,27,2],[25,4,27,4],[25,5,25,8],[25,9,25,12],[27,5,27,8],[27,9,27,12],[22,3,24,3],[22,1,24,2],[22,4,24,4],[22,5,22,8],[25,3,27,3],[19,1,21,2],[19,4,21,4],[19,5,19,8],[19,9,19,12],[21,5,21,8],[21,9,21,12],[19,3,21,3],[13,3,15,3],[16,3,18,3],[13,4,15,4],[13,5,13,8],[13,9,13,12],[15,5,15,8],[15,9,15,12],[11,13,12,13],[12,1,12,2],[12,5,12,8],[12,9,12,12],[11,3,12,3],[11,9,11,12],[13,1,15,2],[11,5,11,8],[16,1,18,2],[16,4,18,4],[16,5,16,8],[16,9,16,12],[18,5,18,8],[18,9,18,12],[58,3,60,3],[43,1,45,2],[43,4,45,4],[52,1,54,2],[82,3,84,3],[52,4,54,4],[58,1,60,2],[58,4,60,4],[73,1,75,2],[76,1,78,2],[76,4,78,4],[79,1,81,2],[64,1,66,2],[67,3,69,3],[61,3,63,3],[67,1,69,2],[55,3,57,3],[64,4,66,4],[1,3,1,7],[1,8,1,13],[0,1,8,2],[0,3,0,13],[3,3,3,13],[6,3,6,13],[49,1,51,2],[70,3,72,3],[73,3,75,3],[49,4,51,4],[73,4,75,4],[55,1,57,2],[55,4,57,4],[28,3,30,3],[34,1,36,2],[34,4,36,4],[49,3,51,3],[52,3,54,3],[67,4,69,4],[43,3,45,3],[61,1,63,2],[61,4,63,4],[37,1,39,2],[37,4,39,4],[9,1,9,13],[8,8,8,13],[7,8,7,13],[2,8,2,13],[5,8,5,13],[4,8,4,13],[8,3,8,7],[7,3,7,7],[5,3,5,7],[4,3,4,7],[2,3,2,7]]}
[]
[null,null,null,"UNIDADE ESCOLAR",null,null,null,null,"PRAZO"]
[null,null,null,{"$f":"Orçamento!$O$4","v":"COLÉGIO ESTADUAL SÃO GERALDO"},null,null,null,null,"60 DIAS CORRIDOS"]
[]
[null,null,null,"OBRA",null,null,null,null,"DATA"]
[null,null,null,{"$f":"Orçamento!$O$7","v":"AMPLIAÇÃO E REFORMA"},null,null,null,null,{"$f":"Orçamento!$S$7","v":"2020-04-08"}]
[]
[null,null,null,"LOCAL",null,null,null,null,"ÁREA TOTAL CONSTRUÍDA (M²)"]
["FILTRO",null,null,{"$f":"Orçamento!$W$7","v":"GOIANIRA"},null,null,null,null,{"$f":"Orçamento!$S$13","v":2504.21}]
[]
[null,"CRONOGRAMA - FÍSICO FINANCEIRO"]
["↓","CUSTO TOTAL:",{"$f":"D92","v":0},"VALOR","Dias:",30,null,null,null,60,null,null,null,"TOTAL"]
[null,"DESCRIÇÃO DOS SERVIÇOS",null,null,"%","1ª PARCELA",null,null,null,"2ª PARCELA"]
[{"$f":"IF(D14>0,\"F\",\"\")","v":""},"SERVIÇOS PRELIMINARES",null,{"$f":"Orçamento!W478","v":0},{"$f":"Orçamento!Z478","v":0},{"$f":"ROUND(F16*$D$14,2)","v":0},null,null,null,{"$f":"ROUND(J16*$D$14,2)","v":0},null,null,null,{"$f":"SUM(F14:M14)","v":0},null,null,{"$f":"F14","v":0},{"$f":"J14","v":0},{"$f":"Q14+R14","v":0},{"$f":"IF(S14=N14,\"OK\",\"ERRO\")","v":"OK"}]
[{"$f":"IF(A14=\"F\",A14,\"\")","v":""},null,null,null,null,null,null,null,null,null,null,null,null,null,null,null,null,null,{"$f":"Q15+R15","v":0}]
{"$rows_left_out":84}
{"sheet":"Composição BDI","index":4,"n_rows":44,"n_cols":9,"rows_kept":44,"cut":false,"hidden":false,"merged":[[17,5,17,8],[16,0,16,3],[15,0,15,3],[43,0,43,3],[41,0,41,3],[42,0,42,3],[17,0,17,3],[35,0,35,3],[38,0,38,3],[37,0,37,3],[39,0,39,3],[28,0,28,2],[31,0,31,3],[32,0,32,3],[33,0,33,3],[34,0,34,3],[8,2,8,3],[10,2,10,3],[11,2,11,3],[0,0,14,1],[0,2,0,3],[9,2,9,3],[12,2,12,3],[13,2,13,3],[1,2,1,3],[2,2,2,3],[4,2,4,3],[5,2,5,3],[7,2,7,3],[3,2,3,3],[6,2,6,3],[14,2,14,3]]}
[]
[null,null,"UNIDADE ESCOLAR"]
[null,null,{"$f":"Orçamento!$O$4","v":"COLÉGIO ESTADUAL SÃO GERALDO"}]
[]
[null,null,"OBRA"]
[null,null,{"$f":"Orçamento!$O$7","v":"AMPLIAÇÃO E REFORMA"}]
[]
[null,null,"ENDEREÇO"]
[null,null,{"$f":"Orçamento!$R$10","v":"RUA 1 S/N, VILA LEO LYNCE, CEP:75370-000"}]
[]
[null,null,"CIDADE"]
[null,null,{"$f":"Orçamento!$W$7","v":"GOIANIRA"}]
[]
[null,null,"CRECE"]
[null,null,{"$f":"Orçamento!$O$10","v":"INHUMAS"}]
{"$rows_left_out":30}
{"sheet":"Relatório CENTRAL","index":5,"n_rows":40,"n_cols":5,"rows_kept":40,"cut":false,"hidden":false,"merged":[[9,1,9,2],[10,1,10,4],[11,1,11,4],[39,1,39,2],[9,0,11,0],[0,1,0,4],[6,3,6,4],[9,3,9,4],[1,1,1,4],[2,1,2,2],[2,3,2,4],[3,1,3,2],[3,3,3,4],[4,1,4,4],[5,1,5,2],[5,3,5,4],[6,1,6,2],[7,1,7,4],[8,1,8,2],[8,3,8,4]]}
[]
[]
[null,"UNIDADE ESCOLAR",null,"CIDADE"]
[null,{"$f":"Orçamento!$O$4","v":"COLÉGIO ESTADUAL SÃO GERALDO"},null,{"$f":"Orçamento!$W$7","v":"GOIANIRA"}]
[]
[null,"OBRA",null,"CRECE"]
[null,{"$f":"Orçamento!$O$7","v":"AMPLIAÇÃO E REFORMA"},null,{"$f":"Orçamento!$O$10","v":"INHUMAS"}]
[]
[null,"ENDEREÇO",null,"DATA"]
["FILTRO",{"$f":"Orçamento!$R$10","v":"RUA 1 S/N, VILA LEO LYNCE, CEP:75370-000"},null,{"$f":"Orçamento!$S$7","v":"2020-04-08"}]
[]
[null,"RELATÓRIO CENTRAL"]
["↓","CÓDIGO","ETAPA","PREÇO  (R$) C/ BDI","PARTIC  ( % )"]
[{"$f":"IF(D14>0,\"F\",\"\")","v":""},{"$f":"Orçamento!O478","v":"a."},{"$f":"Orçamento!P478","v":"SERVIÇOS PRELIMINARES"},{"$f":"Orçamento!W478","v":0},{"$f":"Orçamento!Z478","v":0}]
[{"$f":"IF(D15>0,\"F\",\"\")","v":""},{"$f":"Orçamento!O479","v":"b."},{"$f":"Orçamento!P479","v":"TRANSPORTES"},{"$f":"Orçamento!W479","v":0},{"$f":"Orçamento!Z479","v":0}]
{"$rows_left_out":26}
{"sheet":"Parc Maior Relev","index":6,"n_rows":21,"n_cols":7,"rows_kept":21,"cut":false,"hidden":false,"merged":[[0,1,0,6],[11,1,11,6],[1,1,1,6],[2,1,2,3],[2,4,2,6],[3,1,3,3],[3,4,3,6],[4,1,4,6],[5,1,5,3],[5,4,5,6],[9,1,9,3],[9,4,9,6],[10,1,10,6],[6,1,6,3],[6,4,6,6],[7,1,7,6],[10,0,12,0],[8,1,8,3],[8,4,8,6],[21,3,21,7],[19,1,19,6]]}
[]
[]
[null,"UNIDADE ESCOLAR",null,null,"CÓDIGO INEP"]
[null,{"$f":"Orçamento!$O$4","v":"COLÉGIO ESTADUAL SÃO GERALDO"},null,null,{"$f":"Orçamento!$W$4","v":52038343}]
[]
[null,"OBRA",null,null,"CIDADE"]
[null,{"$f":"Orçamento!$O$7","v":"AMPLIAÇÃO E REFORMA"},null,null,{"$f":"Orçamento!$W$7","v":"GOIANIRA"}]
[]
[null,"CRECE",null,null,"ÁREA TOTAL CONSTRUÍDA (M²)"]
[null,{"$f":"Orçamento!$O$10","v":"INHUMAS"},null,null,{"$f":"Orçamento!$S$13","v":2504.21}]
["FILTRO"]
[null,"PARCELA DE MAIOR RELEVÂNCIA"]
[null,"CÓDIGO","SERVIÇO","DESCRIÇÃO","UNID","QUANT","PARC. MAIOR RELEVÂNCIA (25%)"]
[{"$f":"IF(F14>0,\"F\",\"\")","v":"F"},"n.",{"$f":"IFERROR(VLOOKUP(B14,Orçamento!$O$478:$P$503,2,FALSE),\"(inserir código ao lado)\")","v":"ESTRUTURAS METÁLICAS"},"ESTRUTURA METÁLICA CONVENCIONAL EM AÇO DO TIPO USI SAC-300 COM FUNDO ANTICORROSIVO",{"$f":"IFERROR(VLOOKUP($D14,Orçamento!$R$20:$Y$459,2,FALSE),\"-\")","v":"Kg    "},9636.9000000000015,{"$f":"F14*0.25","v":2409.2250000000004}]
[{"$f":"IF(F15>0,\"F\",\"\")","v":"F"},"u.",{"$f":"IFERROR(VLOOKUP(B15,Orçamento!$O$478:$P$503,2,FALSE),\"(inserir código ao lado)\")","v":"REVESTIMENTO DE PISO"},{"$f":"Orçamento!R277","v":"PISO EM GRANILITE, MARMORITE OU GRANITINA ESPESSURA 8 MM, INCLUSO JUNTAS DE DILATACAO PLASTICAS"},{"$f":"Orçamento!S277","v":"M2"},{"$f":"Orçamento!U277","v":561.90000000000009},{"$f":"F15*0.25","v":140.47500000000002}]
{"$rows_left_out":7}
{"sheet":"Composições","index":7,"n_rows":248,"n_cols":10,"rows_kept":248,"cut":false,"hidden":false,"merged":[[237,5,238,5],[237,6,237,7],[237,8,237,9],[243,1,243,7],[247,1,247,7],[237,0,238,0],[237,1,238,1],[237,2,238,2],[237,3,238,3],[237,4,238,4],[223,5,224,5],[223,6,223,7],[223,8,223,9],[229,1,229,7],[235,1,235,7],[223,0,224,0],[223,1,224,1],[223,2,224,2],[223,3,224,3],[223,4,224,4],[213,5,214,5],[213,6,213,7],[213,8,213,9],[218,1,218,7],[221,1,221,7],[213,0,214,0],[213,1,214,1],[213,2,214,2],[213,3,214,3],[213,4,214,4],[193,5,194,5],[193,6,193,7],[193,8,193,9],[198,1,198,7],[211,1,211,7],[193,0,194,0],[193,1,194,1],[193,2,194,2],[193,3,194,3],[193,4,194,4],[181,5,182,5],[181,6,181,7],[181,8,181,9],[187,1,187,7],[191,1,191,7],[181,0,182,0],[181,1,182,1],[181,2,182,2],[181,3,182,3],[181,4,182,4],[169,5,170,5],[169,6,169,7],[169,8,169,9],[175,1,175,7],[179,1,179,7],[169,0,170,0],[169,1,170,1],[169,2,170,2],[169,3,170,3],[169,4,170,4],[157,5,158,5],[157,6,157,7],[157,8,157,9],[163,1,163,7],[167,1,167,7],[157,0,158,0],[157,1,158,1],[157,2,158,2],[157,3,158,3],[157,4,158,4],[145,5,146,5],[145,6,145,7],[145,8,145,9],[151,1,151,7],[155,1,155,7],[145,0,146,0],[145,1,146,1],[145,2,146,2],[145,3,146,3],[145,4,146,4],[133,5,134,5],[133,6,133,7],[133,8,133,9],[139,1,139,7],[143,1,143,7],[133,0,134,0],[133,1,134,1],[133,2,134,2],[133,3,134,3],[133,4,134,4],[121,5,122,5],[121,6,121,7],[121,8,121,9],[127,1,127,7],[131,1,131,7],[121,0,122,0],[121,1,122,1],[121,2,122,2],[121,3,122,3],[121,4,122,4],[109,5,110,5],[109,6,109,7],[109,8,109,9],[115,1,115,7],[119,1,119,7],[109,0,110,0],[109,1,110,1],[109,2,110,2],[109,3,110,3],[109,4,110,4],[97,5,98,5],[97,6,97,7],[97,8,97,9],[103,1,103,7],[107,1,107,7],[97,0,98,0],[97,1,98,1],[97,2,98,2],[97,3,98,3],[97,4,98,4],[85,5,86,5],[85,6,85,7],[85,8,85,9],[91,1,91,7],[95,1,95,7],[85,0,86,0],[85,1,86,1],[85,2,86,2],[85,3,86,3],[85,4,86,4],[73,5,74,5],[73,6,73,7],[73,8,73,9],[79,1,79,7],[83,1,83,7],[73,0,74,0],[73,1,74,1],[73,2,74,2],[73,3,74,3],[73,4,74,4],[61,5,62,5],[61,6,61,7],[61,8,61,9],[67,1,67,7],[71,1,71,7],[61,0,62,0],[61,1,62,1],[61,2,62,2],[61,3,62,3],[61,4,62,4],[38,5,39,5],[38,6,38,7],[38,8,38,9],[44,1,44,7],[59,1,59,7],[38,0,39,0],[38,1,39,1],[38,2,39,2],[38,3,39,3],[38,4,39,4],[28,5,29,5],[28,6,28,7],[28,8,28,9],[32,1,32,7],[36,1,36,7],[28,0,29,0],[28,1,29,1],[28,2,29,2],[28,3,29,3],[28,4,29,4],[16,5,17,5],[16,6,16,7],[16,8,16,9],[22,1,22,7],[26,1,26,7],[16,0,17,0],[16,1,17,1],[16,2,17,2],[16,3,17,3],[16,4,17,4],[15,0,15,9],[13,0,13,2],[13,3,13,6],[1,0,1,9],[3,7,3,9],[4,7,4,9],[6,7,6,9],[7,7,7,9],[6,0,6,6],[10,8,10,9],[13,8,13,9],[14,0,14,9],[8,0,8,9],[5,0,5,9],[2,0,2,9],[0,0,0,8],[10,0,10,2],[10,3,10,6],[11,0,11,9],[12,0,12,2],[12,3,12,6],[12,7,12,8],[7,0,7,6],[9,0,9,2],[9,3,9,6],[9,7,9,8],[3,0,3,6],[4,0,4,6]]}
[]
[]
[]
["UNIDADE ESCOLAR",null,null,null,null,null,null,"CÓDIGO INEP"]
[{"$f":"Orçamento!$O$4","v":"COLÉGIO ESTADUAL SÃO GERALDO"},null,null,null,null,null,null,{"$f":"Orçamento!$W$4","v":52038343}]
[]
["OBRA",null,null,null,null,null,null,"CIDADE"]
[{"$f":"Orçamento!$O$7","v":"AMPLIAÇÃO E REFORMA"},null,null,null,null,null,null,{"$f":"Orçamento!$W$7","v":"GOIANIRA"}]
[]
["CRECE",null,null,"ENDEREÇO",null,null,null,"REFERÊNCIA AGETOP"]
[{"$f":"Orçamento!$O$10","v":"INHUMAS"},null,null,{"$f":"Orçamento!$R$10","v":"RUA 1 S/N, VILA LEO LYNCE, CEP:75370-000"},null,null,null,{"$f":"Orçamento!$W$10","v":"DEZ/18"},{"$f":"Orçamento!$Y$10","v":"NÃO DESONERADA"}]
[]
["DATA",null,null,"ÁREA TOTAL CONSTRUÍDA (M²)",null,null,null,"REFERÊNCIA SINAPI"]
[{"$f":"Orçamento!$S$7","v":"2020-04-08"},null,null,{"$f":"Orçamento!$S$13","v":2504.21},null,null,null,{"$f":"Orçamento!$W$13","v":"JAN/19"},{"$f":"Orçamento!$Y$13","v":"NÃO DESONERADA"}]
[]
{"$rows_left_out":233}