{"text_format":"1","workbook":"xlsx","n_sheets":9,"sheets":["Orçamento","Resumo ","Somatório","Cronog_150_Dias","Composição BDI","Relatório CENTRAL","Parc Maior Relev","Composições","Cotações"],"not_rendered":{"charts":0,"images":5,"macros":1,"external_links":1,"defined_names":145,"comments":1,"pivot_tables":0},"unopened":[],"bounds":{"document_bytes":16777216,"sheet_cells":100000,"rows_first":2000,"rows_last":500,"rows_between":2000,"halvings":0,"cell_chars":16384,"cell_head_chars":4096},"cells_cut":0,"cells_raw":0,"read":"whole","date_system":"1900"}

{"sheet":"Orçamento","index":0,"n_rows":1123,"n_cols":24,"rows_kept":1123,"cut":false,"hidden":false,"merged":[[1058,16,1058,22],[1093,18,1093,20],[1093,21,1093,22],[0,14,0,22],[8,14,8,16],[9,14,9,16],[11,14,11,16],[12,14,12,16],[14,14,14,22],[1,14,1,22],[4,14,4,22],[7,14,7,22],[1077,18,1077,20],[1077,21,1077,22],[1085,21,1085,22],[1074,15,1074,17],[1075,15,1075,17],[1076,15,1076,17],[1078,21,1078,22],[1086,18,1086,20],[1086,21,1086,22],[1084,18,1084,20],[1084,21,1084,22],[1092,18,1092,20],[1092,21,1092,22],[1079,18,1079,20],[1079,21,1079,22],[1072,18,1072,20],[1072,21,1072,22],[1094,18,1094,20],[1094,21,1094,22],[1048,20,1048,21],[1070,18,1070,20],[1070,21,1070,22],[1071,18,1071,20],[1071,21,1071,22],[1069,18,1069,20],[1069,21,1069,22],[1078,18,1078,20],[1049,20,1049,21],[1060,18,1060,22],[1066,18,1066,20],[1066,21,1066,22],[1067,18,1067,20],[1067,21,1067,22],[1068,18,1068,20],[1068,21,1068,22],[1091,18,1091,20],[1091,21,1091,22],[1088,21,1088,22],[1089,18,1089,20],[1089,21,1089,22],[1090,18,1090,20],[1090,21,1090,22],[1080,18,1080,20],[1080,21,1080,22],[1087,18,1087,20],[1087,21,1087,22],[1082,21,1082,22],[1083,18,1083,20],[1083,21,1083,22],[1085,18,1085,20],[1081,18,1081,20],[1081,21,1081,22],[1082,18,1082,20],[1086,15,1086,17],[1087,15,1087,17],[1088,15,1088,17],[1089,15,1089,17],[1090,15,1090,17],[1063,14,1063,23],[1052,20,1052,21],[1051,20,1051,21],[1047,17,1052,17],[1047,20,1047,21],[1064,18,1064,20],[1064,21,1064,22],[1065,18,1065,20],[1065,21,1065,22],[1053,20,1053,21],[1073,18,1073,20],[1073,21,1073,22],[1074,18,1074,20],[1074,21,1074,22],[1075,18,1075,20],[1075,21,1075,22],[1076,18,1076,20],[1076,21,1076,22],[1088,18,1088,20],[1065,15,1065,17],[1066,15,1066,17],[1067,15,1067,17],[1068,15,1068,17],[1069,15,1069,17],[1070,15,1070,17],[1071,15,1071,17],[1072,15,1072,17],[1073,15,1073,17],[1077,15,1077,17],[1078,15,1078,17],[1079,15,1079,17],[1080,15,1080,17],[1081,15,1081,17],[1082,15,1082,17],[1083,15,1083,17],[1084,15,1084,17],[1085,15,1085,17],[1055,16,1055,22],[1056,16,1056,22],[1057,16,1057,22],[3,21,3,22],[2,21,2,22],[5,21,5,22],[10,14,10,23],[13,14,13,23],[6,21,6,22],[9,17,9,20],[2,14,2,20],[3,14,3,20],[5,18,5,20],[6,18,6,20],[11,18,11,20],[12,18,12,20],[6,14,6,17],[5,14,5,17],[1097,14,1097,23],[1098,18,1098,20],[1098,21,1098,22],[1099,15,1099,17],[1099,18,1099,20],[1099,21,1099,22],[1100,15,1100,17],[1100,18,1100,20],[1100,21,1100,22],[1122,18,1122,20],[1122,21,1122,22],[1119,14,1119,17],[1116,15,1116,17],[1116,18,1116,20],[1116,21,1116,22],[1117,15,1117,17],[1117,18,1117,20],[1117,21,1117,22],[1118,15,1118,17],[1118,18,1118,20],[1118,21,1118,22],[1121,18,1121,20],[1121,21,1121,22],[1120,18,1120,20],[1120,21,1120,22],[1091,14,1091,17],[1098,15,1098,17],[1064,15,1064,17],[1119,18,1119,20],[1119,21,1119,22],[1107,15,1107,17],[1107,18,1107,20],[1107,21,1107,22],[1108,15,1108,17],[1108,18,1108,20],[1108,21,1108,22],[1109,15,1109,17],[1109,18,1109,20],[1109,21,1109,22],[1113,15,1113,17],[1113,18,1113,20],[1113,21,1113,22],[1114,15,1114,17],[1114,18,1114,20],[1114,21,1114,22],[1115,15,1115,17],[1104,15,1104,17],[1059,16,1059,22],[1115,18,1115,20],[1115,21,1115,22],[1110,15,1110,17],[1110,18,1110,20],[1110,21,1110,22],[1111,15,1111,17],[1111,18,1111,20],[1111,21,1111,22],[1112,15,1112,17],[1112,18,1112,20],[1112,21,1112,22],[1104,18,1104,20],[1104,21,1104,22],[1105,15,1105,17],[1105,18,1105,20],[1105,21,1105,22],[1106,15,1106,17],[1106,18,1106,20],[1106,21,1106,22],[1101,15,1101,17],[1101,18,1101,20],[1101,21,1101,22],[1102,15,1102,17],[1102,18,1102,20],[1102,21,1102,22],[1103,15,1103,17],[1103,18,1103,20],[1103,21,1103,22]]}
[]
[]
[null,null,null,null,null,null,null,null,null,null,null,null,null,null,"UNIDADE ESCOLAR",null,null,null,null,null,null,"CÓDIGO INEP"]
[null,null,null,null,null,null,null,null,null,null,null,null,null,null,"COLÉGIO ESTADUAL RUY BRASIL CAVALCANTE",null,null,null,null,null,null,52060993]
[]
["Nmax",null,null,null,null,null,null,null,null,null,null,null,null,null,"OBRA",null,null,null,"DATA",null,null,"CIDADE"]
[{"$f":"MAX($C$18:$C$1047)","v":4},null,null,null,null,null,null,null,null,null,null,null,null,null,"AMPLIAÇÃO E REFORMA",null,null,null,"2020-04-13",null,null,"PIRACANJUBA"]
[]
[null,null,null,null,null,null,null,null,null,null,null,null,null,null,"CRE",null,null,"ENDEREÇO",null,null,null,"REFERÊNCIA AGETOP"]
[null,null,null,null,null,null,null,null,null,null,null,null,null,null,"PIRACANJUBA",null,null,"PRACA DIMAS COSTA 413, CENTRO, CEP:75640-000",null,null,null,"DEZ/18","ONERADA"]
[]
[null,null,null,null,null,null,null,null,null,null,null,null,null,null,"ÁREA EXISTENTE (M²)",null,null,"ÁREA A CONSTRUIR (M²)","ÁREA TOTAL CONSTRUÍDA (M²)",null,null,"REFERÊNCIA SINAPI"]
[null,null,null,null,null,null,null,null,null,null,null,null,null,null,1732.9,null,null,452.97,2185.87,null,null,"AGO/19","ONERADA"]
[]
[null,null,null,null,null,null,null,null,null,null,null,"FILTRO",null,null,"PLANILHA ORÇAMENTÁRIA"]
["Nível E","Save Nivel","Nível C","Altura","n1","n2","n3","n4","n5","Czero","Cnível","↓","Nível","Nível Corrigido","ITEM","TABELA","CODIGO","DESCRIÇÃO DOS SERVIÇOS","UNID","QUANT","MAT","MO","T.SERVIÇO","OBSERVAÇÕES¹"]
[{"$f":"CHOOSE(1+LOG(1+2*(ORÇAMENTO.Nivel=\"Nível 1\")+4*(ORÇAMENTO.Nivel=\"Nível 2\")+8*(ORÇAMENTO.Nivel=\"Nível 3\")+16*(ORÇAMENTO.Nivel=\"Nível 4\")+32*(ORÇAMENTO.Nivel=\"Serviço\"),2),0,1,2,3,4,\"S\")","v":"S"},{"$f":"IF(OR(C17=\"s\",C17=0),OFFSET(B17,-1,0),C17)","v":"Save Nivel"},{"$f":"IF(OFFSET(C17,-1,0)=\"L\",1,IF(OFFSET(C17,-1,0)=1,2,IF(OR(A17=\"s\",A17=0),\"S\",IF(AND(OFFSET(C17,-1,0)=2,A17=4),3,IF(AND(OR(OFFSET(C17,-1,0)=\"s\",OFFSET(C17,-1,0)=0),A17<>\"s\",A17>OFFSET(B17,-1,0)),OFFSET(B17,-1,0),A17)))))","v":"S"},{"$f":"IF(OR(C17=\"S\",C17=0),0,IF(ISERROR(K17),J17,SMALL(J17:K17,1)))","v":0},{"$f":"IF($C17=1,OFFSET(E17,-1,0)+1,OFFSET(E17,-1,0))","v":"n1"},{"$f":"IF($C17=1,0,IF($C17=2,OFFSET(F17,-1,0)+1,OFFSET(F17,-1,0)))","v":"n2"},{"$f":"IF(AND($C17<=2,$C17<>0),0,IF($C17=3,OFFSET(G17,-1,0)+1,OFFSET(G17,-1,0)))","v":"n3"},{"$f":"IF(AND($C17<=3,$C17<>0),0,IF($C17=4,OFFSET(H17,-1,0)+1,OFFSET(H17,-1,0)))","v":"n4"},{"$f":"IF(AND($C17<=4,$C17<>0),0,IF(AND($C17=\"S\",$W17>0),OFFSET(I17,-1,0)+1,OFFSET(I17,-1,0)))","v":"n5"},{"$f":"IF(OR($C17=\"S\",$C17=0),0,MATCH(0,OFFSET($D17,1,$C17,ROW($C$1047)-ROW($C17)),0))","v":0},{"$f":"IF(OR($C17=\"S\",$C17=0),0,MATCH(OFFSET($D17,0,$C17)+1,OFFSET($D17,1,$C17,ROW($C$1047)-ROW($C17)),0))","v":0},"","Serviço","Serviço","-","SINAPI",null,"(sem código)","-",null,0,0,0,""]
[0,null,"L",{"$f":"COUNTA(OFFSET(D18,1,0):D$1047)","v":1028},{"$f":"LEFT(O19,1)-1","v":0},null,null,null,null,null,null,"F","LOTE","LOTE","AMPLIAÇÃO E REFORMA - COLÉGIO ESTADUAL RUY BRASIL CAVALCANTE",null,null,null,null,null,null,null,0]
[1,{"$f":"IF(OR(C19=\"s\",C19=0),OFFSET(B19,-1,0),C19)","v":1},{"$f":"IF(OFFSET(C19,-1,0)=\"L\",1,IF(OFFSET(C19,-1,0)=1,2,IF(OR(A19=\"s\",A19=0),\"S\",IF(AND(OFFSET(C19,-1,0)=2,A19=4),3,IF(AND(OR(OFFSET(C19,-1,0)=\"s\",OFFSET(C19,-1,0)=0),A19<>\"s\",A19>OFFSET(B19,-1,0)),OFFSET(B19,-1,0),A19)))))","v":1},{"$f":"IF(OR(C19=\"S\",C19=0),0,IF(ISERROR(K19),J19,SMALL(J19:K19,1)))","v":572},{"$f":"IF($C19=1,OFFSET(E19,-1,0)+1,OFFSET(E19,-1,0))","v":1},{"$f":"IF($C19=1,0,IF($C19=2,OFFSET(F19,-1,0)+1,OFFSET(F19,-1,0)))","v":0},{"$f":"IF(AND($C19<=2,$C19<>0),0,IF($C19=3,OFFSET(G19,-1,0)+1,OFFSET(G19,-1,0)))","v":0},{"$f":"IF(AND($C19<=3,$C19<>0),0,IF($C19=4,OFFSET(H19,-1,0)+1,OFFSET(H19,-1,0)))","v":0},0,{"$f":"IF(OR($C19=\"S\",$C19=0),0,MATCH(0,OFFSET($D19,1,$C19,ROW($C$1047)-ROW($C19)),0))","v":1028},{"$f":"IF(OR($C19=\"S\",$C19=0),0,MATCH(OFFSET($D19,0,$C19)+1,OFFSET($D19,1,$C19,ROW($C$1047)-ROW($C19)),0))","v":572},"F","Nível 1","Nível 1","1.","AGETOP",null,"REFORMA",null,null,null,null,0]
[2,2,{"$f":"IF(OFFSET(C20,-1,0)=\"L\",1,IF(OFFSET(C20,-1,0)=1,2,IF(OR(A20=\"s\",A20=0),\"S\",IF(AND(OFFSET(C20,-1,0)=2,A20=4),3,IF(AND(OR(OFFSET(C20,-1,0)=\"s\",OFFSET(C20,-1,0)=0),A20<>\"s\",A20>OFFSET(B20,-1,0)),OFFSET(B20,-1,0),A20)))))","v":2},53,{"$f":"IF($C20=1,OFFSET(E20,-1,0)+1,OFFSET(E20,-1,0))","v":1},{"$f":"IF($C20=1,0,IF($C20=2,OFFSET(F20,-1,0)+1,OFFSET(F20,-1,0)))","v":1},{"$f":"IF(AND($C20<=2,$C20<>0),0,IF($C20=3,OFFSET(G20,-1,0)+1,OFFSET(G20,-1,0)))","v":0},{"$f":"IF(AND($C20<=3,$C20<>0),0,IF($C20=4,OFFSET(H20,-1,0)+1,OFFSET(H20,-1,0)))","v":0},0,571,53,"","Nível 2","Nível 2","-","SINAPI",null,"SERVIÇOS PRELIMINARES","-",null,0,0,0,""]
[3,3,3,3,1,1,1,0,0,52,3,"","Nível 3","Nível 3","-","SINAPI",null,"SECRETARIA","-",null,0,0,0,""]
["S",3,"S",0,1,1,1,0,0,0,0,"","Serviço","Serviço","-","SINAPI",97622,"DEMOLIÇÃO DE ALVENARIA DE BLOCO FURADO, DE FORMA MANUAL, SEM REAPROVEITAMENTO. AF_12/2017","M3",0.9,null,null,0,"Referência: AGETOP - 20118"]
["S",3,"S",0,1,1,1,0,0,0,0,"","Serviço","Serviço","-","SINAPI",97644,"REMOÇÃO DE PORTAS, DE FORMA MANUAL, SEM REAPROVEITAMENTO. AF_12/2017","M2",1.68,null,null,0,"Referência: AGETOP - 20106"]
[3,3,3,2,1,1,2,0,0,49,2,"","Nível 3","Nível 3","-","SINAPI",null,"ÁREA DE SERVIÇO","-",null,null,null,0,""]
["S",3,"S",0,1,1,2,0,0,0,0,"","Serviço","Serviço","-","SINAPI",97622,"DEMOLIÇÃO DE ALVENARIA DE BLOCO FURADO, DE FORMA MANUAL, SEM REAPROVEITAMENTO. AF_12/2017","M3",1.7,null,null,0,"Referência: AGETOP - 20118"]
[3,3,3,4,1,1,3,0,0,47,4,"","Nível 3","Nível 3","-","SINAPI",null,"SALA DO PROFESSOR","-",null,null,null,0,""]
["S",{"$f":"IF(OR(C27=\"s\",C27=0),OFFSET(B27,-1,0),C27)","v":3},"S",{"$f":"IF(OR(C27=\"S\",C27=0),0,IF(ISERROR(K27),J27,SMALL(J27:K27,1)))","v":0},1,1,3,0,0,0,0,"","Serviço","Serviço","-","SINAPI",97644,"REMOÇÃO DE PORTAS, DE FORMA MANUAL, SEM REAPROVEITAMENTO. AF_12/2017","M2",1.68,null,null,0,"Referência: AGETOP - 20106"]
["S",3,{"$f":"IF(OFFSET(C28,-1,0)=\"L\",1,IF(OFFSET(C28,-1,0)=1,2,IF(OR(A28=\"s\",A28=0),\"S\",IF(AND(OFFSET(C28,-1,0)=2,A28=4),3,IF(AND(OR(OFFSET(C28,-1,0)=\"s\",OFFSET(C28,-1,0)=0),A28<>\"s\",A28>OFFSET(B28,-1,0)),OFFSET(B28,-1,0),A28)))))","v":"S"},0,{"$f":"IF($C28=1,OFFSET(E28,-1,0)+1,OFFSET(E28,-1,0))","v":1},{"$f":"IF($C28=1,0,IF($C28=2,OFFSET(F28,-1,0)+1,OFFSET(F28,-1,0)))","v":1},{"$f":"IF(AND($C28<=2,$C28<>0),0,IF($C28=3,OFFSET(G28,-1,0)+1,OFFSET(G28,-1,0)))","v":3},{"$f":"IF(AND($C28<=3,$C28<>0),0,IF($C28=4,OFFSET(H28,-1,0)+1,OFFSET(H28,-1,0)))","v":0},0,0,0,"","Serviço","Serviço","-","SINAPI",97622,"DEMOLIÇÃO DE ALVENARIA DE BLOCO FURADO, DE FORMA MANUAL, SEM REAPROVEITAMENTO. AF_12/2017","M3",3.5,null,null,0,"Referência: AGETOP - 20118"]
["S",3,"S",0,1,1,3,0,0,0,0,"","Serviço","Serviço","-","AGETOP",20163,"DEMOLIÇÃO DAS INSTALAÇÕES HIDROSANITÁRIAS E AFINS C/ TRANSP. ATÉ CB. E CARGA","H     ",2,null,null,0,""]
[3,3,3,3,1,1,4,0,0,43,3,"","Nível 3","Nível 3","-","SINAPI",null,"COORDENAÇÃO","-",null,null,null,0,""]
["S",3,"S",0,1,1,4,0,0,0,0,"","Serviço","Serviço","-","SINAPI",97644,"REMOÇÃO DE PORTAS, DE FORMA MANUAL, SEM REAPROVEITAMENTO. AF_12/2017","M2",1.68,null,null,0,"Referência: AGETOP - 20106"]
["S",3,"S",0,1,1,4,0,0,0,0,"","Serviço","Serviço","-","SINAPI",97622,"DEMOLIÇÃO DE ALVENARIA DE BLOCO FURADO, DE FORMA MANUAL, SEM REAPROVEITAMENTO. AF_12/2017","M3",1.05,null,null,0,"Referência: AGETOP - 20118"]
[3,3,3,2,1,1,5,0,0,40,2,"","Nível 3","Nível 3","-","SINAPI",null,"BIBLIOTECA","-",null,null,null,0,""]
["S",3,"S",0,1,1,5,0,0,0,0,"","Serviço","Serviço","-","SINAPI",97622,"DEMOLIÇÃO DE ALVENARIA DE BLOCO FURADO, DE FORMA MANUAL, SEM REAPROVEITAMENTO. AF_12/2017","M3",1,null,null,0,"Referência: AGETOP - 20118"]
[3,3,3,11,1,1,6,0,0,38,11,"","Nível 3","Nível 3","-","SINAPI",null,"S. LEITURA","-",null,null,null,0,""]
["S",3,"S",0,1,1,6,0,0,0,0,"","Serviço","Serviço","-","SINAPI",97622,"DEMOLIÇÃO DE ALVENARIA DE BLOCO FURADO, DE FORMA MANUAL, SEM REAPROVEITAMENTO. AF_12/2017","M3",14.68,null,null,0,"Referência: AGETOP - 20118"]
["S",3,"S",0,1,1,6,0,0,0,0,"","Serviço","Serviço","-","SINAPI",97644,"REMOÇÃO DE PORTAS, DE FORMA MANUAL, SEM REAPROVEITAMENTO. AF_12/2017","M2",12.44,null,null,0,"Referência: AGETOP - 20106"]
["S",3,"S",0,1,1,6,0,0,0,0,"","Serviço","Serviço","-","AGETOP",20139,"DEMOLIÇAO DE BANCADAS C/ TRANSP. ATÉ CB. E CARGA","m2    ",4.53,null,null,0,""]
["S",3,"S",0,1,1,6,0,0,0,0,"","Serviço","Serviço","-","AGETOP",20163,"DEMOLIÇÃO DAS INSTALAÇÕES HIDROSANITÁRIAS E AFINS C/ TRANSP. ATÉ CB. E CARGA","H     ",4,null,null,0,""]
["S",3,"S",0,1,1,6,0,0,0,0,"","Serviço","Serviço","-","AGETOP",20138,"DEMOLIÇAO DE LAVATÓRIO C/ TRANSP. ATÉ CB. E CARGA","Un    ",2,null,null,0,""]
["S",3,"S",0,1,1,6,0,0,0,0,"","Serviço","Serviço","-","AGETOP",20137,"DEMOLIÇAO BACIA SANITARIA C/ TRANSP. ATÉ CB. E CARGA","Un    ",4,null,null,0,""]
["S",3,"S",0,1,1,6,0,0,0,0,"","Serviço","Serviço","-","AGETOP",20141,"DEMOLIÇAO DE CAIXA DESCARGA EXTERNA C/ TRANSP. ATÉ CB. E CARGA","Un    ",4,null,null,0,""]
["S",3,"S",0,1,1,6,0,0,0,0,"","Serviço","Serviço","-","SINAPI",97633,"DEMOLIÇÃO DE REVESTIMENTO CERÂMICO, DE FORMA MANUAL, SEM REAPROVEITAMENTO. AF_12/2017","M2",91.6,null,null,0,"Referência: AGETOP - 20115"]
["S",3,"S",0,1,1,6,0,0,0,0,"","Serviço","Serviço","-","AGETOP",20112,"DEM.PISO CERAM. INCLUS. RETIRADA DE CONTRAPISO SOBRE LASTRO CONC.C/TR.CB.E CARGA","m2    ",65.36,null,null,0,""]
["S",3,"S",0,1,1,6,0,0,0,0,"","Serviço","Serviço","-","AGETOP",20121,"DEM. MANUAL EM CONCR.SIMPLES C/TR.ATE CB.E CARGA (O.C.)","m3    ",2.16,null,null,0,""]
[3,3,3,7,1,1,7,0,0,27,7,"","Nível 3","Nível 3","-","SINAPI",null,"SANIT. FEMININO","-",null,null,null,0,""]
["S",3,"S",0,1,1,7,0,0,0,0,"","Serviço","Serviço","-","AGETOP",20137,"DEMOLIÇAO BACIA SANITARIA C/ TRANSP. ATÉ CB. E CARGA","Un    ",5,null,null,0,""]
["S",3,"S",0,1,1,7,0,0,0,0,"","Serviço","Serviço","-","AGETOP",20141,"DEMOLIÇAO DE CAIXA DESCARGA EXTERNA C/ TRANSP. ATÉ CB. E CARGA","Un    ",5,null,null,0,""]
["S",3,"S",0,1,1,7,0,0,0,0,"","Serviço","Serviço","-","AGETOP",20163,"DEMOLIÇÃO DAS INSTALAÇÕES HIDROSANITÁRIAS E AFINS C/ TRANSP. ATÉ CB. E CARGA","H     ",2,null,null,0,""]
["S",3,"S",0,1,1,7,0,0,0,0,"","Serviço","Serviço","-","SINAPI",97644,"REMOÇÃO DE PORTAS, DE FORMA MANUAL, SEM REAPROVEITAMENTO. AF_12/2017","M2",1.44,null,null,0,"Referência: AGETOP - 20106"]
["S",3,"S",0,1,1,7,0,0,{"$f":"IF(OR($C51=\"S\",$C51=0),0,MATCH(0,OFFSET($D51,1,$C51,ROW($C$1047)-ROW($C51)),0))","v":0},{"$f":"IF(OR($C51=\"S\",$C51=0),0,MATCH(OFFSET($D51,0,$C51)+1,OFFSET($D51,1,$C51,ROW($C$1047)-ROW($C51)),0))","v":0},"","Serviço","Serviço","-","SINAPI",97622,"DEMOLIÇÃO DE ALVENARIA DE BLOCO FURADO, DE FORMA MANUAL, SEM REAPROVEITAMENTO. AF_12/2017","M3",0.24,null,null,0,"Referência: AGETOP - 20118"]
["S",3,"S",0,1,1,7,0,0,0,0,"","Serviço","Serviço","-","SINAPI",97633,"DEMOLIÇÃO DE REVESTIMENTO CERÂMICO, DE FORMA MANUAL, SEM REAPROVEITAMENTO. AF_12/2017","M2",84.7,null,null,0,"Referência: AGETOP - 20115"]
[3,3,3,8,1,1,8,0,0,20,8,"","Nível 3","Nível 3","-","SINAPI",null,"SANIT. MASCULINO","-",null,null,null,0,""]
["S",3,"S",0,1,1,8,0,0,0,0,"","Serviço","Serviço","-","AGETOP",20137,"DEMOLIÇAO BACIA SANITARIA C/ TRANSP. ATÉ CB. E CARGA","Un    ",4,null,null,0,""]
["S",3,"S",0,1,1,8,0,0,0,0,"","Serviço","Serviço","-","AGETOP",20141,"DEMOLIÇAO DE CAIXA DESCARGA EXTERNA C/ TRANSP. ATÉ CB. E CARGA","Un    ",4,null,null,0,""]
["S",3,"S",0,1,1,8,0,0,0,0,"","Serviço","Serviço","-","AGETOP",20163,"DEMOLIÇÃO DAS INSTALAÇÕES HIDROSANITÁRIAS E AFINS C/ TRANSP. ATÉ CB. E CARGA","H     ",2,null,null,0,""]
["S",3,"S",0,1,1,8,0,0,0,0,"","Serviço","Serviço","-","AGETOP",20146,"DEMOLIÇÃO DE MICTÓRIO C/ TRANSP. ATÉ CB. E CARGA","Un    ",2,null,null,0,""]
["S",3,"S",0,1,1,8,0,0,0,0,"","Serviço","Serviço","-","SINAPI",97633,"DEMOLIÇÃO DE REVESTIMENTO CERÂMICO, DE FORMA MANUAL, SEM REAPROVEITAMENTO. AF_12/2017","M2",94.71,null,null,0,"Referência: AGETOP - 20115"]
["S",3,"S",0,1,1,8,0,0,0,0,"","Serviço","Serviço","-","SINAPI",97622,"DEMOLIÇÃO DE ALVENARIA DE BLOCO FURADO, DE FORMA MANUAL, SEM REAPROVEITAMENTO. AF_12/2017","M3",0.56000000000000005,null,null,0,"Referência: AGETOP - 20118"]
["S",3,"S",0,1,1,8,0,0,0,0,"","Serviço","Serviço","-","SINAPI",97644,"REMOÇÃO DE PORTAS, DE FORMA MANUAL, SEM REAPROVEITAMENTO. AF_12/2017","M2",1.44,null,null,0,"Referência: AGETOP - 20106"]
[3,3,3,4,1,1,9,0,0,12,4,"","Nível 3","Nível 3","-","SINAPI",null,"ACESSIBILIDADE","-",null,null,null,0,""]
["S",3,"S",0,1,1,9,0,0,0,0,"","Serviço","Serviço","-","AGETOP",20121,"DEM. MANUAL EM CONCR.SIMPLES C/TR.ATE CB.E CARGA (O.C.)","m3    ",16.78,null,null,0,""]
["S",3,"S",0,1,1,9,0,0,0,0,"","Serviço","Serviço","-","SINAPI",97645,"REMOÇÃO DE JANELAS, DE FORMA MANUAL, SEM REAPROVEITAMENTO. AF_12/2017","M2",61.85,null,null,0,"Referência: AGETOP - 20106"]
["S",3,"S",0,1,1,9,0,0,0,0,"","Serviço","Serviço","-","AGETOP",20107,"CORTE/DESTOC./RETIRADA/REATERRO (MANUAIS) DE ÁRVORE GRANDE PORTE ( H = 8 A 10 M / DIÂMETRO TRONCO 60 A 70CM E COPA DE 10 A 13M ) C/TRANSP.ATE C.B.E CARGA ","Un    ",2,null,null,0,""]
[3,3,3,8,1,1,10,0,0,8,462,"","Nível 3","Nível 3","-","SINAPI",null,"OUTROS","-",null,null,null,0,""]
["S",3,"S",0,1,1,10,0,0,0,0,"","Serviço","Serviço","-","AGETOP",20162,"DEMOLIÇÃO DAS INSTALAÇÕES ELÉTRICAS E AFINS C/ TRANSP. ATÉ CB. E CARGA","H     ",40,null,null,0,""]
[{"$f":"CHOOSE(1+LOG(1+2*(ORÇAMENTO.Nivel=\"Nível 1\")+4*(ORÇAMENTO.Nivel=\"Nível 2\")+8*(ORÇAMENTO.Nivel=\"Nível 3\")+16*(ORÇAMENTO.Nivel=\"Nível 4\")+32*(ORÇAMENTO.Nivel=\"Serviço\"),2),0,1,2,3,4,\"S\")","v":"S"},{"$f":"IF(OR(C67=\"s\",C67=0),OFFSET(B67,-1,0),C67)","v":3},{"$f":"IF(OFFSET(C67,-1,0)=\"L\",1,IF(OFFSET(C67,-1,0)=1,2,IF(OR(A67=\"s\",A67=0),\"S\",IF(AND(OFFSET(C67,-1,0)=2,A67=4),3,IF(AND(OR(OFFSET(C67,-1,0)=\"s\",OFFSET(C67,-1,0)=0),A67<>\"s\",A67>OFFSET(B67,-1,0)),OFFSET(B67,-1,0),A67)))))","v":"S"},{"$f":"IF(OR(C67=\"S\",C67=0),0,IF(ISERROR(K67),J67,SMALL(J67:K67,1)))","v":0},{"$f":"IF($C67=1,OFFSET(E67,-1,0)+1,OFFSET(E67,-1,0))","v":1},{"$f":"IF($C67=1,0,IF($C67=2,OFFSET(F67,-1,0)+1,OFFSET(F67,-1,0)))","v":1},{"$f":"IF(AND($C67<=2,$C67<>0),0,IF($C67=3,OFFSET(G67,-1,0)+1,OFFSET(G67,-1,0)))","v":10},{"$f":"IF(AND($C67<=3,$C67<>0),0,IF($C67=4,OFFSET(H67,-1,0)+1,OFFSET(H67,-1,0)))","v":0},{"$f":"IF(AND($C67<=4,$C67<>0),0,IF(AND($C67=\"S\",$W67>0),OFFSET(I67,-1,0)+1,OFFSET(I67,-1,0)))","v":0},0,0,"","Serviço","Serviço","-","AGETOP",20101,"DEMOLICAO COBERTURA TELHA CERAMICA C/ TRANSP. ATÉ CB. E CARGA","m2    ",546.67000000000007,null,null,0,""]
["S",3,"S",0,1,1,10,0,0,0,0,"","Serviço","Serviço","-","AGETOP",20103,"DEMOLIÇÃO ESTRUTURA EM MADEIRA TELHADO C/ TRANSP. ATÉ CB. E CARGA","m2    ",897.35,null,null,0,""]
["S",3,"S",0,1,1,10,0,0,0,0,"","Serviço","Serviço","-","COMPOSIÇÃO","COMP 430_SEE","DEMOLIÇÃO DE ESTRUTURA METÁLICA","M2",98.5,null,null,0,""]
["S",3,"S",0,1,1,10,0,0,0,0,"","Serviço","Serviço","-","AGETOP",20107,"CORTE/DESTOC./RETIRADA/REATERRO (MANUAIS) DE ÁRVORE GRANDE PORTE ( H = 8 A 10 M / DIÂMETRO TRONCO 60 A 70CM E COPA DE 10 A 13M ) C/TRANSP.ATE C.B.E CARGA ","Un    ",2,null,null,0,""]
["S",3,"S",0,1,1,10,0,0,0,0,"","Serviço","Serviço","-","SINAPI",97622,"DEMOLIÇÃO DE ALVENARIA DE BLOCO FURADO, DE FORMA MANUAL, SEM REAPROVEITAMENTO. AF_12/2017","M3",1.49,null,null,0,"Referência: AGETOP - 20118"]
[{"$f":"CHOOSE(1+LOG(1+2*(ORÇAMENTO.Nivel=\"Nível 1\")+4*(ORÇAMENTO.Nivel=\"Nível 2\")+8*(ORÇAMENTO.Nivel=\"Nível 3\")+16*(ORÇAMENTO.Nivel=\"Nível 4\")+32*(ORÇAMENTO.Nivel=\"Serviço\"),2),0,1,2,3,4,\"S\")","v":"S"},{"$f":"IF(OR(C72=\"s\",C72=0),OFFSET(B72,-1,0),C72)","v":3},{"$f":"IF(OFFSET(C72,-1,0)=\"L\",1,IF(OFFSET(C72,-1,0)=1,2,IF(OR(A72=\"s\",A72=0),\"S\",IF(AND(OFFSET(C72,-1,0)=2,A72=4),3,IF(AND(OR(OFFSET(C72,-1,0)=\"s\",OFFSET(C72,-1,0)=0),A72<>\"s\",A72>OFFSET(B72,-1,0)),OFFSET(B72,-1,0),A72)))))","v":"S"},{"$f":"IF(OR(C72=\"S\",C72=0),0,IF(ISERROR(K72),J72,SMALL(J72:K72,1)))","v":0},{"$f":"IF($C72=1,OFFSET(E72,-1,0)+1,OFFSET(E72,-1,0))","v":1},{"$f":"IF($C72=1,0,IF($C72=2,OFFSET(F72,-1,0)+1,OFFSET(F72,-1,0)))","v":1},{"$f":"IF(AND($C72<=2,$C72<>0),0,IF($C72=3,OFFSET(G72,-1,0)+1,OFFSET(G72,-1,0)))","v":10},{"$f":"IF(AND($C72<=3,$C72<>0),0,IF($C72=4,OFFSET(H72,-1,0)+1,OFFSET(H72,-1,0)))","v":0},{"$f":"IF(AND($C72<=4,$C72<>0),0,IF(AND($C72=\"S\",$W72>0),OFFSET(I72,-1,0)+1,OFFSET(I72,-1,0)))","v":0},0,0,"","Serviço","Serviço","-","SINAPI","74209/1","PLACA DE OBRA EM CHAPA DE ACO GALVANIZADO","M2",7.5,null,null,0,"Referência: AGETOP - 21301"]
[2,2,2,3,1,2,0,0,0,518,3,"","Nível 2","Nível 2","-","AGETOP",null,"TRANSPORTES","-",null,null,null,0,""]
["S",2,"S",0,1,2,0,0,0,0,0,"","Serviço","Serviço","-","SINAPI",72900,"TRANSPORTE DE ENTULHO COM CAMINHAO BASCULANTE 6 M3, RODOVIA PAVIMENTADA, DMT 0,5 A 1,0 KM","M3",137.80000000000001,null,null,0,""]
["S",2,"S",0,1,2,0,0,0,0,0,"","Serviço","Serviço","-","SINAPI",72897,"CARGA MANUAL DE ENTULHO EM CAMINHAO BASCULANTE 6 M3","M3",137.80000000000001,null,null,0,""]
[{"$f":"CHOOSE(1+LOG(1+2*(ORÇAMENTO.Nivel=\"Nível 1\")+4*(ORÇAMENTO.Nivel=\"Nível 2\")+8*(ORÇAMENTO.Nivel=\"Nível 3\")+16*(ORÇAMENTO.Nivel=\"Nível 4\")+32*(ORÇAMENTO.Nivel=\"Serviço\"),2),0,1,2,3,4,\"S\")","v":2},{"$f":"IF(OR(C76=\"s\",C76=0),OFFSET(B76,-1,0),C76)","v":2},{"$f":"IF(OFFSET(C76,-1,0)=\"L\",1,IF(OFFSET(C76,-1,0)=1,2,IF(OR(A76=\"s\",A76=0),\"S\",IF(AND(OFFSET(C76,-1,0)=2,A76=4),3,IF(AND(OR(OFFSET(C76,-1,0)=\"s\",OFFSET(C76,-1,0)=0),A76<>\"s\",A76>OFFSET(B76,-1,0)),OFFSET(B76,-1,0),A76)))))","v":2},{"$f":"IF(OR(C76=\"S\",C76=0),0,IF(ISERROR(K76),J76,SMALL(J76:K76,1)))","v":11},{"$f":"IF($C76=1,OFFSET(E76,-1,0)+1,OFFSET(E76,-1,0))","v":1},{"$f":"IF($C76=1,0,IF($C76=2,OFFSET(F76,-1,0)+1,OFFSET(F76,-1,0)))","v":3},{"$f":"IF(AND($C76<=2,$C76<>0),0,IF($C76=3,OFFSET(G76,-1,0)+1,OFFSET(G76,-1,0)))","v":0},{"$f":"IF(AND($C76<=3,$C76<>0),0,IF($C76=4,OFFSET(H76,-1,0)+1,OFFSET(H76,-1,0)))","v":0},{"$f":"IF(AND($C76<=4,$C76<>0),0,IF(AND($C76=\"S\",$W76>0),OFFSET(I76,-1,0)+1,OFFSET(I76,-1,0)))","v":0},515,11,"","Nível 2","Nível 2","-","SINAPI",null,"SERVIÇO EM TERRA","-",null,null,null,0,""]
[3,3,3,7,1,3,1,0,0,10,7,"","Nível 3","Nível 3","-","SINAPI",null,"ACESSIBILIDADE","-",null,null,null,0,""]
["S",3,"S",0,1,3,1,0,0,0,0,"","Serviço","Serviço","-","SINAPI",79480,"ESCAVACAO MECANICA CAMPO ABERTO EM SOLO EXCETO ROCHA ATE 2,00M PROFUNDIDADE","M3",58.21,null,null,0,"Referência: AGETOP - 41004"]
["S",3,"S",0,1,3,1,0,0,0,0,"","Serviço","Serviço","-","SINAPI",72898,"CARGA E DESCARGA MECANIZADAS DE ENTULHO EM CAMINHAO BASCULANTE 6 M3","M3",33.47,null,null,0,"Referência: AGETOP - 41005"]
["S",3,"S",0,1,3,1,0,0,0,0,"","Serviço","Serviço","-","AGETOP",41012,"INDENIZAÇÃO DE JAZIDA","m3    ",33.47,null,null,0,""]
["S",3,"S",0,1,3,1,0,0,0,0,"","Serviço","Serviço","-","AGETOP",41006,"TRANSPORTE DE MATERIAL ESCAVADO M3.KM","m3km  ",334.7,null,null,0,""]
["S",3,"S",0,1,3,1,0,0,0,0,"","Serviço","Serviço","-","AGETOP",41010,"TRANSPORTE COM LÂMINA ATE 100 M - (OBRAS CIVIS)","m3    ",24.74,null,null,0,""]
["S",3,"S",0,1,3,1,0,0,{"$f":"IF(OR($C83=\"S\",$C83=0),0,MATCH(0,OFFSET($D83,1,$C83,ROW($C$1047)-ROW($C83)),0))","v":0},{"$f":"IF(OR($C83=\"S\",$C83=0),0,MATCH(OFFSET($D83,0,$C83)+1,OFFSET($D83,1,$C83,ROW($C$1047)-ROW($C83)),0))","v":0},"","Serviço","Serviço","-","SINAPI","74005/2","COMPACTACAO MECANICA C/ CONTROLE DO GC>=95% DO PN (AREAS) (C/MONIVELADORA 140 HP E ROLO COMPRESSOR VIBRATORIO 80 HP)","M3",46.57,null,null,0,"Referência: AGETOP - 41008"]
[3,3,3,3,1,3,2,0,0,3,77,"","Nível 3","Nível 3","-","SINAPI",null,"OUTROS","-",null,null,null,0,""]
["S",3,"S",0,1,3,2,0,0,0,0,"","Serviço","Serviço","-","AGETOP",41140,"REGULARIZAÇÃO DO TERRENO SEM APILOAMENTO COM TRANSPORTE MANUAL DA TERRA ESCAVADA ","m2    ",452.97,null,null,0,""]
["S",3,"S",0,1,3,2,0,0,0,0,"","Serviço","Serviço","-","AGETOP",41002,"APILOAMENTO","m2    ",452.97,null,null,0,""]
[2,2,2,113,1,4,0,0,0,504,113,"","Nível 2","Nível 2","-","SINAPI",null,"INSTALAÇÕES ELÉTRICAS","-",null,null,null,0,""]
[{"$f":"CHOOSE(1+LOG(1+2*(ORÇAMENTO.Nivel=\"Nível 1\")+4*(ORÇAMENTO.Nivel=\"Nível 2\")+8*(ORÇAMENTO.Nivel=\"Nível 3\")+16*(ORÇAMENTO.Nivel=\"Nível 4\")+32*(ORÇAMENTO.Nivel=\"Serviço\"),2),0,1,2,3,4,\"S\")","v":3},{"$f":"IF(OR(C88=\"s\",C88=0),OFFSET(B88,-1,0),C88)","v":3},{"$f":"IF(OFFSET(C88,-1,0)=\"L\",1,IF(OFFSET(C88,-1,0)=1,2,IF(OR(A88=\"s\",A88=0),\"S\",IF(AND(OFFSET(C88,-1,0)=2,A88=4),3,IF(AND(OR(OFFSET(C88,-1,0)=\"s\",OFFSET(C88,-1,0)=0),A88<>\"s\",A88>OFFSET(B88,-1,0)),OFFSET(B88,-1,0),A88)))))","v":3},{"$f":"IF(OR(C88=\"S\",C88=0),0,IF(ISERROR(K88),J88,SMALL(J88:K88,1)))","v":58},{"$f":"IF($C88=1,OFFSET(E88,-1,0)+1,OFFSET(E88,-1,0))","v":1},{"$f":"IF($C88=1,0,IF($C88=2,OFFSET(F88,-1,0)+1,OFFSET(F88,-1,0)))","v":4},{"$f":"IF(AND($C88<=2,$C88<>0),0,IF($C88=3,OFFSET(G88,-1,0)+1,OFFSET(G88,-1,0)))","v":1},{"$f":"IF(AND($C88<=3,$C88<>0),0,IF($C88=4,OFFSET(H88,-1,0)+1,OFFSET(H88,-1,0)))","v":0},{"$f":"IF(AND($C88<=4,$C88<>0),0,IF(AND($C88=\"S\",$W88>0),OFFSET(I88,-1,0)+1,OFFSET(I88,-1,0)))","v":0},112,58,"","Nível 3","Nível 3","-","SINAPI",null,"INST. ELÉTRICAS","-",null,null,null,0,""]
["S",3,"S",0,1,4,1,0,0,0,0,"","Serviço","Serviço","-","SINAPI","74131/4","QUADRO DE DISTRIBUICAO DE ENERGIA DE EMBUTIR, EM CHAPA METALICA, PARA 18 DISJUNTORES TERMOMAGNETICOS MONOPOLARES, COM BARRAMENTO TRIFASICO E NEUTRO, FORNECIMENTO E INSTALACAO","UN",2,null,null,0,""]
["S",3,"S",0,1,4,1,0,0,0,0,"","Serviço","Serviço","-","SINAPI","74131/6","QUADRO DE DISTRIBUICAO DE ENERGIA DE EMBUTIR, EM CHAPA METALICA, PARA 32 DISJUNTORES TERMOMAGNETICOS MONOPOLARES, COM BARRAMENTO TRIFASICO E NEUTRO, FORNECIMENTO E INSTALACAO","UN",2,null,null,0,"Referência: AGETOP - 72198"]
["S",3,"S",0,1,4,1,0,0,0,0,"","Serviço","Serviço","-","SINAPI","74131/7","QUADRO DE DISTRIBUICAO DE ENERGIA DE EMBUTIR, EM CHAPA METALICA, PARA 40 DISJUNTORES TERMOMAGNETICOS MONOPOLARES, COM BARRAMENTO TRIFASICO E NEUTRO, FORNECIMENTO E INSTALACAO","UN",1,null,null,0,""]
["S",3,"S",0,1,4,1,0,0,0,0,"","Serviço","Serviço","-","SINAPI",93670,"DISJUNTOR TRIPOLAR TIPO DIN, CORRENTE NOMINAL DE 25A - FORNECIMENTO E INSTALAÇÃO. AF_04/2016","UN",1,null,null,0,"Referência: AGETOP - 71173"]
[{"$f":"CHOOSE(1+LOG(1+2*(ORÇAMENTO.Nivel=\"Nível 1\")+4*(ORÇAMENTO.Nivel=\"Nível 2\")+8*(ORÇAMENTO.Nivel=\"Nível 3\")+16*(ORÇAMENTO.Nivel=\"Nível 4\")+32*(ORÇAMENTO.Nivel=\"Serviço\"),2),0,1,2,3,4,\"S\")","v":"S"},{"$f":"IF(OR(C93=\"s\",C93=0),OFFSET(B93,-1,0),C93)","v":3},{"$f":"IF(OFFSET(C93,-1,0)=\"L\",1,IF(OFFSET(C93,-1,0)=1,2,IF(OR(A93=\"s\",A93=0),\"S\",IF(AND(OFFSET(C93,-1,0)=2,A93=4),3,IF(AND(OR(OFFSET(C93,-1,0)=\"s\",OFFSET(C93,-1,0)=0),A93<>\"s\",A93>OFFSET(B93,-1,0)),OFFSET(B93,-1,0),A93)))))","v":"S"},{"$f":"IF(OR(C93=\"S\",C93=0),0,IF(ISERROR(K93),J93,SMALL(J93:K93,1)))","v":0},{"$f":"IF($C93=1,OFFSET(E93,-1,0)+1,OFFSET(E93,-1,0))","v":1},{"$f":"IF($C93=1,0,IF($C93=2,OFFSET(F93,-1,0)+1,OFFSET(F93,-1,0)))","v":4},{"$f":"IF(AND($C93<=2,$C93<>0),0,IF($C93=3,OFFSET(G93,-1,0)+1,OFFSET(G93,-1,0)))","v":1},{"$f":"IF(AND($C93<=3,$C93<>0),0,IF($C93=4,OFFSET(H93,-1,0)+1,OFFSET(H93,-1,0)))","v":0},{"$f":"IF(AND($C93<=4,$C93<>0),0,IF(AND($C93=\"S\",$W93>0),OFFSET(I93,-1,0)+1,OFFSET(I93,-1,0)))","v":0},0,0,"","Serviço","Serviço","-","SINAPI",93671,"DISJUNTOR TRIPOLAR TIPO DIN, CORRENTE NOMINAL DE 32A - FORNECIMENTO E INSTALAÇÃO. AF_04/2016","UN",1,null,null,0,"Referência: AGETOP - 71173"]
["S",3,"S",0,1,4,1,0,0,0,0,"","Serviço","Serviço","-","SINAPI",93673,"DISJUNTOR TRIPOLAR TIPO DIN, CORRENTE NOMINAL DE 50A - FORNECIMENTO E INSTALAÇÃO. AF_04/2016","UN",1,null,null,0,"Referência: AGETOP - 71174"]
["S",3,"S",0,1,4,1,0,0,0,0,"","Serviço","Serviço","-","AGETOP",71175,"DISJUNTOR TRIPOLAR DE 60 A 100-A","Un    ",2,null,null,0,""]
["S",3,"S",0,1,4,1,0,0,0,0,"","Serviço","Serviço","-","SINAPI","74130/10","DISJUNTOR TERMOMAGNETICO TRIPOLAR EM CAIXA MOLDADA 175 A 225A 240V, FORNECIMENTO E INSTALACAO","UN",2,null,null,0,""]
["S",3,"S",0,1,4,1,0,0,0,0,"","Serviço","Serviço","-","SINAPI",93656,"DISJUNTOR MONOPOLAR TIPO DIN, CORRENTE NOMINAL DE 25A - FORNECIMENTO E INSTALAÇÃO. AF_04/2016","UN",26,null,null,0,""]
["S",3,"S",0,1,4,1,0,0,0,0,"","Serviço","Serviço","-","SINAPI",93654,"DISJUNTOR MONOPOLAR TIPO DIN, CORRENTE NOMINAL DE 16A - FORNECIMENTO E INSTALAÇÃO. AF_04/2016","UN",37,null,null,0,""]
["S",3,"S",0,1,4,1,0,0,0,0,"","Serviço","Serviço","-","SINAPI",93653,"DISJUNTOR MONOPOLAR TIPO DIN, CORRENTE NOMINAL DE 10A - FORNECIMENTO E INSTALAÇÃO. AF_04/2016","UN",32,null,null,0,""]
["S",3,"S",0,1,4,1,0,0,0,0,"","Serviço","Serviço","-","AGETOP",71184,"DISPOSITIVO DE PROTEÇÃO CONTRA SURTOS (D.P.S.) 275V DE 8 A 40KA","Un    ",3,null,null,0,""]
["S",3,"S",0,1,4,1,0,0,0,0,"","Serviço","Serviço","-","AGETOP",71451,"INTERRUPTOR DIFERENCIAL RESIDUAL (D.R.) BIPOLAR DE 40A-30mA","Un    ",5,null,null,0,""]
["S",3,"S",0,1,4,1,0,0,0,0,"","Serviço","Serviço","-","SINAPI",91926,"CABO DE COBRE FLEXÍVEL ISOLADO, 2,5 MM², ANTI-CHAMA 450/750 V, PARA CIRCUITOS TERMINAIS - FORNECIMENTO E INSTALAÇÃO. AF_12/2015","M",3008.4,null,null,0,"Referência: AGETOP - 70563"]
["S",3,"S",0,1,4,1,0,0,0,0,"","Serviço","Serviço","-","SINAPI",91928,"CABO DE COBRE FLEXÍVEL ISOLADO, 4 MM², ANTI-CHAMA 450/750 V, PARA CIRCUITOS TERMINAIS - FORNECIMENTO E INSTALAÇÃO. AF_12/2015","M",2002.05,null,null,0,"Referência: AGETOP - 70564"]
["S",3,"S",0,1,4,1,0,0,0,0,"","Serviço","Serviço","-","SINAPI",91930,"CABO DE COBRE FLEXÍVEL ISOLADO, 6 MM², ANTI-CHAMA 450/750 V, PARA CIRCUITOS TERMINAIS - FORNECIMENTO E INSTALAÇÃO. AF_12/2015","M",914.1,null,null,0,"Referência: AGETOP - 70565"]
["S",3,"S",0,1,4,1,0,0,0,0,"","Serviço","Serviço","-","SINAPI",92979,"CABO DE COBRE FLEXÍVEL ISOLADO, 10 MM², ANTI-CHAMA 450/750 V, PARA DISTRIBUIÇÃO - FORNECIMENTO E INSTALAÇÃO. AF_12/2015","M",15.5,null,null,0,""]
["S",3,"S",0,1,4,1,0,0,0,0,"","Serviço","Serviço","-","SINAPI",92981,"CABO DE COBRE FLEXÍVEL ISOLADO, 16 MM², ANTI-CHAMA 450/750 V, PARA DISTRIBUIÇÃO - FORNECIMENTO E INSTALAÇÃO. AF_12/2015","M",409.2,null,null,0,""]
["S",3,"S",0,1,4,1,0,0,0,0,"","Serviço","Serviço","-","SINAPI",92985,"CABO DE COBRE FLEXÍVEL ISOLADO, 35 MM², ANTI-CHAMA 450/750 V, PARA DISTRIBUIÇÃO - FORNECIMENTO E INSTALAÇÃO. AF_12/2015","M",146.80000000000001,null,null,0,""]
["S",3,"S",0,1,4,1,0,0,0,0,"","Serviço","Serviço","-","SINAPI",92990,"CABO DE COBRE FLEXÍVEL ISOLADO, 70 MM², ANTI-CHAMA 0,6/1,0 KV, PARA DISTRIBUIÇÃO - FORNECIMENTO E INSTALAÇÃO. AF_12/2015","M",85.2,null,null,0,"Referência: AGETOP - 70514"]
["S",3,"S",0,1,4,1,0,0,0,0,"","Serviço","Serviço","-","SINAPI",92986,"CABO DE COBRE FLEXÍVEL ISOLADO, 35 MM², ANTI-CHAMA 0,6/1,0 KV, PARA DISTRIBUIÇÃO - FORNECIMENTO E INSTALAÇÃO. AF_12/2015","M",24,null,null,0,"Referência: AGETOP - 70512"]
["S",3,"S",0,1,4,1,0,0,0,0,"","Serviço","Serviço","-","AGETOP",70541,"CABO DE COBRE NU No. 16 MM2 (6,94 M/KG)","M     ",15,null,null,0,""]
["S",3,"S",0,1,4,1,0,0,0,0,"","Serviço","Serviço","-","AGETOP",70544,"CABO DE COBRE NÚ No. 50 MM2","M     ",15,null,null,0,""]
["S",3,"S",0,1,4,1,0,0,0,0,"","Serviço","Serviço","-","SINAPI",91867,"ELETRODUTO RÍGIDO ROSCÁVEL, PVC, DN 25 MM (3/4\"), PARA CIRCUITOS TERMINAIS, INSTALADO EM LAJE - FORNECIMENTO E INSTALAÇÃO. AF_12/2015","M",280.27999999999997,null,null,0,"Referência: AGETOP - 71201"]
["S",3,"S",0,1,4,1,0,0,0,0,"","Serviço","Serviço","-","SINAPI",91834,"ELETRODUTO FLEXÍVEL CORRUGADO, PVC, DN 25 MM (3/4\"), PARA CIRCUITOS TERMINAIS, INSTALADO EM FORRO - FORNECIMENTO E INSTALAÇÃO. AF_12/2015","M",934.25,null,null,0,"Referência: AGETOP - 71194"]
["S",3,"S",0,1,4,1,0,0,0,0,"","Serviço","Serviço","-","SINAPI",91836,"ELETRODUTO FLEXÍVEL CORRUGADO, PVC, DN 32 MM (1\"), PARA CIRCUITOS TERMINAIS, INSTALADO EM FORRO - FORNECIMENTO E INSTALAÇÃO. AF_12/2015","M",387,null,null,0,"Referência: AGETOP - 71195"]
["S",3,"S",0,1,4,1,0,0,{"$f":"IF(OR($C115=\"S\",$C115=0),0,MATCH(0,OFFSET($D115,1,$C115,ROW($C$1047)-ROW($C115)),0))","v":0},{"$f":"IF(OR($C115=\"S\",$C115=0),0,MATCH(OFFSET($D115,0,$C115)+1,OFFSET($D115,1,$C115,ROW($C$1047)-ROW($C115)),0))","v":0},"","Serviço","Serviço","-","AGETOP",71197,"ELETRODUTO PVC FLEXÍVEL - MANGUEIRA CORRUGADA REFORÇADA - DIAM. 50MM","M     ",158.15,null,null,0,""]
["S",3,"S",0,1,4,1,0,0,0,0,"","Serviço","Serviço","-","SINAPI",91868,"ELETRODUTO RÍGIDO ROSCÁVEL, PVC, DN 32 MM (1\"), PARA CIRCUITOS TERMINAIS, INSTALADO EM LAJE - FORNECIMENTO E INSTALAÇÃO. AF_12/2015","M",116,null,null,0,"Referência: AGETOP - 71202"]
["S",3,"S",0,1,4,1,0,0,0,0,"","Serviço","Serviço","-","SINAPI",93008,"ELETRODUTO RÍGIDO ROSCÁVEL, PVC, DN 50 MM (1 1/2\") - FORNECIMENTO E INSTALAÇÃO. AF_12/2015","M",45,null,null,0,""]
["S",3,"S",0,1,4,1,0,0,0,0,"","Serviço","Serviço","-","SINAPI",93009,"ELETRODUTO RÍGIDO ROSCÁVEL, PVC, DN 60 MM (2\") - FORNECIMENTO E INSTALAÇÃO. AF_12/2015","M",139,null,null,0,""]
["S",3,"S",0,1,4,1,0,0,0,0,"","Serviço","Serviço","-","SINAPI",93010,"ELETRODUTO RÍGIDO ROSCÁVEL, PVC, DN 75 MM (2 1/2\") - FORNECIMENTO E INSTALAÇÃO. AF_12/2015","M",24,null,null,0,""]
["S",3,"S",0,1,4,1,0,0,0,0,"","Serviço","Serviço","-","AGETOP",70351,"BRACADEIRA METALICA TIPO \"U\" DIAM. 3/4\"","Un    ",94,null,null,0,""]
["S",3,"S",0,1,4,1,0,0,0,0,"","Serviço","Serviço","-","AGETOP",70352,"BRACADEIRA METALICA TIPO \"U\" DIAM. 1\"","Un    ",39,null,null,0,""]
["S",3,"S",0,1,4,1,0,0,0,0,"","Serviço","Serviço","-","AGETOP",70354,"BRACADEIRA METALICA TIPO \"U\" DIAM. 1.1/2\"","Un    ",15,null,null,0,""]
["S",3,"S",0,1,4,1,0,0,0,0,"","Serviço","Serviço","-","AGETOP",70355,"BRACADEIRA METALICA TIPO \"U\" DIAM. 2\"","Un    ",47,null,null,0,""]
["S",3,"S",0,1,4,1,0,0,0,0,"","Serviço","Serviço","-","SINAPI",91879,"LUVA PARA ELETRODUTO, PVC, ROSCÁVEL, DN 25 MM (3/4\"), PARA CIRCUITOS TERMINAIS, INSTALADA EM LAJE - FORNECIMENTO E INSTALAÇÃO. AF_12/2015","UN",94,null,null,0,"Referência: AGETOP - 71741"]
["S",3,"S",0,1,4,1,0,0,0,0,"","Serviço","Serviço","-","SINAPI",91880,"LUVA PARA ELETRODUTO, PVC, ROSCÁVEL, DN 32 MM (1\"), PARA CIRCUITOS TERMINAIS, INSTALADA EM LAJE - FORNECIMENTO E INSTALAÇÃO. AF_12/2015","UN",39,null,null,0,"Referência: AGETOP - 71742"]
["S",3,"S",0,1,4,1,0,0,0,0,"","Serviço","Serviço","-","SINAPI",93013,"LUVA PARA ELETRODUTO, PVC, ROSCÁVEL, DN 50 MM (1 1/2\") - FORNECIMENTO E INSTALAÇÃO. AF_12/2015","UN",15,null,null,0,"Referência: AGETOP - 71744"]
["S",3,"S",0,1,4,1,0,0,0,0,"","Serviço","Serviço","-","SINAPI",93014,"LUVA PARA ELETRODUTO, PVC, ROSCÁVEL, DN 60 MM (2\") - FORNECIMENTO E INSTALAÇÃO. AF_12/2015","UN",47,null,null,0,"Referência: AGETOP - 71745"]
["S",3,"S",0,1,4,1,0,0,0,0,"","Serviço","Serviço","-","SINAPI",91939,"CAIXA RETANGULAR 4\" X 2\" ALTA (2,00 M DO PISO), PVC, INSTALADA EM PAREDE - FORNECIMENTO E INSTALAÇÃO. AF_12/2015","UN",146,null,null,0,""]
["S",3,"S",0,1,4,1,0,0,0,0,"","Serviço","Serviço","-","SINAPI",91937,"CAIXA OCTOGONAL 3\" X 3\", PVC, INSTALADA EM LAJE - FORNECIMENTO E INSTALAÇÃO. AF_12/2015","UN",189,null,null,0,""]
["S",3,"S",0,1,4,1,0,0,0,0,"","Serviço","Serviço","-","SINAPI",91993,"TOMADA ALTA DE EMBUTIR (1 MÓDULO), 2P+T 20 A, INCLUINDO SUPORTE E PLACA - FORNECIMENTO E INSTALAÇÃO. AF_12/2015","UN",26,null,null,0,"Referência: AGETOP - 72585"]
["S",3,"S",0,1,4,1,0,0,0,0,"","Serviço","Serviço","-","SINAPI",91992,"TOMADA ALTA DE EMBUTIR (1 MÓDULO), 2P+T 10 A, INCLUINDO SUPORTE E PLACA - FORNECIMENTO E INSTALAÇÃO. AF_12/2015","UN",18,null,null,0,""]
["S",3,"S",0,1,4,1,0,0,0,0,"","Serviço","Serviço","-","SINAPI",92004,"TOMADA MÉDIA DE EMBUTIR (2 MÓDULOS), 2P+T 10 A, INCLUINDO SUPORTE E PLACA - FORNECIMENTO E INSTALAÇÃO. AF_12/2015","UN",15,null,null,0,"Referência: AGETOP - 72578"]
["S",3,"S",0,1,4,1,0,0,0,0,"","Serviço","Serviço","-","SINAPI",92008,"TOMADA BAIXA DE EMBUTIR (2 MÓDULOS), 2P+T 10 A, INCLUINDO SUPORTE E PLACA - FORNECIMENTO E INSTALAÇÃO. AF_12/2015","UN",28,null,null,0,""]
["S",3,"S",0,1,4,1,0,0,0,0,"","Serviço","Serviço","-","SINAPI",92000,"TOMADA BAIXA DE EMBUTIR (1 MÓDULO), 2P+T 10 A, INCLUINDO SUPORTE E PLACA - FORNECIMENTO E INSTALAÇÃO. AF_12/2015","UN",50,null,null,0,"Referência: AGETOP - 72578"]
["S",3,"S",0,1,4,1,0,0,0,0,"","Serviço","Serviço","-","SINAPI",97585,"LUMINÁRIA TIPO CALHA, DE SOBREPOR, COM 2 LÂMPADAS TUBULARES DE 18 W - FORNECIMENTO E INSTALAÇÃO. AF_11/2017","UN",168,null,null,0,""]
["S",3,"S",0,1,4,1,0,0,0,0,"","Serviço","Serviço","-","SINAPI",97593,"LUMINÁRIA TIPO SPOT, DE SOBREPOR, COM 1 LÂMPADA DE 15 W - FORNECIMENTO E INSTALAÇÃO. AF_11/2017","UN",3,null,null,0,"Referência: AGETOP - 71688"]
["S",3,"S",0,1,4,1,0,0,0,0,"","Serviço","Serviço","-","SINAPI",97606,"LUMINÁRIA ARANDELA TIPO MEIA-LUA, PARA 1 LÂMPADA DE 15 W - FORNECIMENTO E INSTALAÇÃO. AF_11/2017","UN",14,null,null,0,""]
["S",3,"S",0,1,4,1,0,0,0,0,"","Serviço","Serviço","-","SINAPI",97610,"LÂMPADA COMPACTA DE LED 10 W, BASE E27 - FORNECIMENTO E INSTALAÇÃO. AF_11/2017","UN",17,null,null,0,""]
["S",3,"S",0,1,4,1,0,0,0,0,"","Serviço","Serviço","-","SINAPI",91953,"INTERRUPTOR SIMPLES (1 MÓDULO), 10A/250V, INCLUINDO SUPORTE E PLACA - FORNECIMENTO E INSTALAÇÃO. AF_12/2015","UN",19,null,null,0,"Referência: AGETOP - 71440"]
["S",3,"S",0,1,4,1,0,0,0,0,"","Serviço","Serviço","-","SINAPI",91959,"INTERRUPTOR SIMPLES (2 MÓDULOS), 10A/250V, INCLUINDO SUPORTE E PLACA - FORNECIMENTO E INSTALAÇÃO. AF_12/2015","UN",14,null,null,0,"Referência: AGETOP - 71441"]
["S",3,"S",0,1,4,1,0,0,0,0,"","Serviço","Serviço","-","SINAPI",97889,"CAIXA ENTERRADA ELÉTRICA RETANGULAR, EM ALVENARIA COM TIJOLOS CERÂMICOS MACIÇOS, FUNDO COM BRITA, DIMENSÕES INTERNAS: 0,8X0,8X0,6 M. AF_05/2018","UN",4,null,null,0,""]
["S",3,"S",0,1,4,1,0,0,0,0,"","Serviço","Serviço","-","SINAPI",6171,"TAMPA DE CONCRETO ARMADO 60X60X5CM PARA CAIXA","UN",7,null,null,0,""]
["S",3,"S",0,1,4,1,0,0,0,0,"","Serviço","Serviço","-","AGETOP",71861,"PARAFUSO P/BUCHA S-6","Un    ",500,null,null,0,""]
["S",3,"S",0,1,4,1,0,0,0,0,"","Serviço","Serviço","-","AGETOP",70647,"CAIXA DE PASSAGEM METÁLICA DE EMBUTIR 30X30X12 CM","Un    ",3,null,null,0,""]
["S",3,"S",0,1,4,1,0,0,0,0,"","Serviço","Serviço","-","AGETOP",70391,"BUCHA DE NYLON S-6","Un    ",500,null,null,0,""]
[3,3,3,15,1,4,2,0,0,54,15,"","Nível 3","Nível 3","-",null,null,"IMPLANTAÇÃO DOS BLOCOS","-",null,null,null,0,""]
["S",3,"S",0,1,4,2,0,0,{"$f":"IF(OR($C147=\"S\",$C147=0),0,MATCH(0,OFFSET($D147,1,$C147,ROW($C$1047)-ROW($C147)),0))","v":0},{"$f":"IF(OR($C147=\"S\",$C147=0),0,MATCH(OFFSET($D147,0,$C147)+1,OFFSET($D147,1,$C147,ROW($C$1047)-ROW($C147)),0))","v":0},"","Serviço","Serviço","-","SINAPI",93671,"DISJUNTOR TRIPOLAR TIPO DIN, CORRENTE NOMINAL DE 32A - FORNECIMENTO E INSTALAÇÃO. AF_04/2016","UN",1,null,null,0,"Referência: AGETOP - 71173"]
["S",3,"S",0,1,4,2,0,0,0,0,"","Serviço","Serviço","-","AGETOP",71175,"DISJUNTOR TRIPOLAR DE 60 A 100-A","Un    ",2,null,null,0,""]
["S",3,"S",0,1,4,2,0,0,0,0,"","Serviço","Serviço","-","SINAPI",91930,"CABO DE COBRE FLEXÍVEL ISOLADO, 6 MM², ANTI-CHAMA 450/750 V, PARA CIRCUITOS TERMINAIS - FORNECIMENTO E INSTALAÇÃO. AF_12/2015","M",638.65,null,null,0,"Referência: AGETOP - 70565"]
["S",3,"S",0,1,4,2,0,0,0,0,"","Serviço","Serviço","-","SINAPI",92981,"CABO DE COBRE FLEXÍVEL ISOLADO, 16 MM², ANTI-CHAMA 450/750 V, PARA DISTRIBUIÇÃO - FORNECIMENTO E INSTALAÇÃO. AF_12/2015","M",1929.76,null,null,0,""]
["S",3,"S",0,1,4,2,0,0,0,0,"","Serviço","Serviço","-","SINAPI",91872,"ELETRODUTO RÍGIDO ROSCÁVEL, PVC, DN 32 MM (1\"), PARA CIRCUITOS TERMINAIS, INSTALADO EM PAREDE - FORNECIMENTO E INSTALAÇÃO. AF_12/2015","M",144.4,null,null,0,"Referência: AGETOP - 71202"]
["S",3,"S",0,1,4,2,0,0,0,0,"","Serviço","Serviço","-","SINAPI",93008,"ELETRODUTO RÍGIDO ROSCÁVEL, PVC, DN 50 MM (1 1/2\") - FORNECIMENTO E INSTALAÇÃO. AF_12/2015","M",112.15,null,null,0,""]
["S",3,"S",0,1,4,2,0,0,0,0,"","Serviço","Serviço","-","AGETOP",70352,"BRACADEIRA METALICA TIPO \"U\" DIAM. 1\"","Un    ",49,null,null,0,""]
["S",3,"S",0,1,4,2,0,0,0,0,"","Serviço","Serviço","-","AGETOP",70354,"BRACADEIRA METALICA TIPO \"U\" DIAM. 1.1/2\"","Un    ",38,null,null,0,""]
["S",3,"S",0,1,4,2,0,0,0,0,"","Serviço","Serviço","-","SINAPI",91880,"LUVA PARA ELETRODUTO, PVC, ROSCÁVEL, DN 32 MM (1\"), PARA CIRCUITOS TERMINAIS, INSTALADA EM LAJE - FORNECIMENTO E INSTALAÇÃO. AF_12/2015","UN",49,null,null,0,"Referência: AGETOP - 71742"]
[{"$f":"CHOOSE(1+LOG(1+2*(ORÇAMENTO.Nivel=\"Nível 1\")+4*(ORÇAMENTO.Nivel=\"Nível 2\")+8*(ORÇAMENTO.Nivel=\"Nível 3\")+16*(ORÇAMENTO.Nivel=\"Nível 4\")+32*(ORÇAMENTO.Nivel=\"Serviço\"),2),0,1,2,3,4,\"S\")","v":"S"},{"$f":"IF(OR(C156=\"s\",C156=0),OFFSET(B156,-1,0),C156)","v":3},{"$f":"IF(OFFSET(C156,-1,0)=\"L\",1,IF(OFFSET(C156,-1,0)=1,2,IF(OR(A156=\"s\",A156=0),\"S\",IF(AND(OFFSET(C156,-1,0)=2,A156=4),3,IF(AND(OR(OFFSET(C156,-1,0)=\"s\",OFFSET(C156,-1,0)=0),A156<>\"s\",A156>OFFSET(B156,-1,0)),OFFSET(B156,-1,0),A156)))))","v":"S"},{"$f":"IF(OR(C156=\"S\",C156=0),0,IF(ISERROR(K156),J156,SMALL(J156:K156,1)))","v":0},{"$f":"IF($C156=1,OFFSET(E156,-1,0)+1,OFFSET(E156,-1,0))","v":1},{"$f":"IF($C156=1,0,IF($C156=2,OFFSET(F156,-1,0)+1,OFFSET(F156,-1,0)))","v":4},{"$f":"IF(AND($C156<=2,$C156<>0),0,IF($C156=3,OFFSET(G156,-1,0)+1,OFFSET(G156,-1,0)))","v":2},{"$f":"IF(AND($C156<=3,$C156<>0),0,IF($C156=4,OFFSET(H156,-1,0)+1,OFFSET(H156,-1,0)))","v":0},{"$f":"IF(AND($C156<=4,$C156<>0),0,IF(AND($C156=\"S\",$W156>0),OFFSET(I156,-1,0)+1,OFFSET(I156,-1,0)))","v":0},0,0,"","Serviço","Serviço","-","SINAPI",93013,"LUVA PARA ELETRODUTO, PVC, ROSCÁVEL, DN 50 MM (1 1/2\") - FORNECIMENTO E INSTALAÇÃO. AF_12/2015","UN",38,null,null,0,"Referência: AGETOP - 71744"]
["S",3,"S",0,1,4,2,0,0,0,0,"","Serviço","Serviço","-","SINAPI",97889,"CAIXA ENTERRADA ELÉTRICA RETANGULAR, EM ALVENARIA COM TIJOLOS CERÂMICOS MACIÇOS, FUNDO COM BRITA, DIMENSÕES INTERNAS: 0,8X0,8X0,6 M. AF_05/2018","UN",3,null,null,0,""]
["S",3,"S",0,1,4,2,0,0,0,0,"","Serviço","Serviço","-","SINAPI",6171,"TAMPA DE CONCRETO ARMADO 60X60X5CM PARA CAIXA","UN",3,null,null,0,""]
["S",3,"S",0,1,4,2,0,0,0,0,"","Serviço","Serviço","-","AGETOP",71861,"PARAFUSO P/BUCHA S-6","Un    ",150,null,null,0,""]
["S",3,"S",0,1,4,2,0,0,0,0,"","Serviço","Serviço","-","AGETOP",70391,"BUCHA DE NYLON S-6","Un    ",150,null,null,0,""]
[3,3,3,39,1,4,3,0,0,39,144,"","Nível 3","Nível 3","-","SINAPI",null,"SUBESTAÇÃO","-",null,null,null,0,""]
["S",3,"S",0,1,4,3,0,0,0,0,"","Serviço","Serviço","-","AGETOP",70386,"BRAÇO C AÇO GALVANIZADO , CONFORME NTD-17","un    ",1,null,null,0,""]
["S",3,"S",0,1,4,3,0,0,0,0,"","Serviço","Serviço","-","SINAPI","73767/2","ALCA PRE-FORMADA DISTRIBUIÇÃO EM  ACO RECOBERTO COM ALUMINIO PARA CABO 25MM2, ENCAPADO. FORNECIMENTO E INSTALAÇÃO.","UN",1,null,null,0,""]
["S",3,"S",0,1,4,3,0,0,0,0,"","Serviço","Serviço","-","SINAPI","73767/1","GRAMPO PARALELO EM ALUMINIO FUNDIDO OU ESTRUDADO DE 2 PARAFUSOS, PARA CABO DE 6 A 50 MM2, PASTA ANTIOXIDANTE. FORNEC E INSTALAÇÃO.","UN",3,null,null,0,""]
["S",3,"S",0,1,4,3,0,0,0,0,"","Serviço","Serviço","-","SINAPI",83377,"CONECTOR DE PARAFUSO FENDIDO EM LIGA DE COBRE COM SEPARADOR DE CABOS PARA CABO 50 MM2 - FORNECIMENTO E INSTALACAO","UN",6,null,null,0,""]
["S",3,"S",0,1,4,3,0,0,0,0,"","Serviço","Serviço","-","SINAPI",72263,"TERMINAL OU CONECTOR DE PRESSAO - PARA CABO 50MM2 - FORNECIMENTO E INSTALACAO","UN",1,null,null,0,""]
["S",3,"S",0,1,4,3,0,0,0,0,"","Serviço","Serviço","-","AGETOP",71833,"PARA RAIOS DISTRIBUIDOR POLIMÉRICO ÓXIDO DE ZINCO S/CENTELHADOR C/ DESLIGAMENTO AUTOMÁTICO 15KV,10KA","Un    ",3,null,null,0,""]
["S",3,"S",0,1,4,3,0,0,0,0,"","Serviço","Serviço","-","SINAPI",88544,"ARMACAO SECUNDARIA OU REX COMPLETA PARA DUAS LINHAS-FORNECIMENTO E INSTALACAO.","UN",1,null,null,0,""]
["S",3,"S",0,1,4,3,0,0,0,0,"","Serviço","Serviço","-","COMPOSIÇÃO","COMP 046_SEE","CAPUZ PARA PROTEÇÃO DOS PARA RAIOS","UN ",3,null,null,0,""]
["S",3,"S",0,1,4,3,0,0,0,0,"","Serviço","Serviço","-","COMPOSIÇÃO","COMP 047_SEE","CAPUZ DE PROTEÇÃO PARA BUCHA DE TRANSFORMADOR","UN ",3,null,null,0,""]
["S",3,"S",0,1,4,3,0,0,0,0,"","Serviço","Serviço","-","COMPOSIÇÃO","COMP 048_SEE","HASTE ROSQUEADA \"TIRANTE\" 3/8\"","M",0.5,null,null,0,""]
["S",3,"S",0,1,4,3,0,0,0,0,"","Serviço","Serviço","-","COMPOSIÇÃO","COMP 049_SEE","PORCA SEXTAVADA 3/8\"","UN ",8,null,null,0,""]
["S",3,"S",0,1,4,3,0,0,0,0,"","Serviço","Serviço","-","SINAPI","73781/2","ISOLADOR DE PINO TP HI-POT CILINDRICO CLASSE 15KV. FORNECIMENTO E INSTALACAO.","UN",3,null,null,0,""]
[{"$f":"CHOOSE(1+LOG(1+2*(ORÇAMENTO.Nivel=\"Nível 1\")+4*(ORÇAMENTO.Nivel=\"Nível 2\")+8*(ORÇAMENTO.Nivel=\"Nível 3\")+16*(ORÇAMENTO.Nivel=\"Nível 4\")+32*(ORÇAMENTO.Nivel=\"Serviço\"),2),0,1,2,3,4,\"S\")","v":"S"},3,"S",0,1,4,3,0,{"$f":"IF(AND($C174<=4,$C174<>0),0,IF(AND($C174=\"S\",$W174>0),OFFSET(I174,-1,0)+1,OFFSET(I174,-1,0)))","v":0},0,0,"","Serviço","Serviço","-","SINAPI","73781/3","ISOLADOR DE SUSPENSAO (DISCO) TP CAVILHA CLASSE 15KV - 6''. FORNECIMENTO E INSTALACAO.","UN",1,null,null,0,""]
["S",3,"S",0,1,4,3,0,0,0,0,"","Serviço","Serviço","-","AGETOP",70252,"ARRUELA LISA D=5/16\"","Un    ",8,null,null,0,""]
["S",3,"S",0,1,4,3,0,0,0,0,"","Serviço","Serviço","-","AGETOP",70720,"CAIXA METÁLICA PARA MEDIDOR POLIFÁSICO PADRÃO ENEL 500X380X166MM","Un    ",1,null,null,0,""]
["S",3,"S",0,1,4,3,0,0,0,0,"","Serviço","Serviço","-","AGETOP",70695,"CAIXA METÁLICA PARA PROTEÇÃO GERAL 580X500X216MM ATÉ 175A","Un    ",1,null,null,0,""]
["S",3,"S",0,1,4,3,0,0,0,0,"","Serviço","Serviço","-","AGETOP",70725,"CAIXA METÁLICA PARA T.C. 580X500X216MM - ATÉ 175A","Un    ",1,null,null,0,""]
["S",3,"S",0,1,4,3,0,0,{"$f":"IF(OR($C179=\"S\",$C179=0),0,MATCH(0,OFFSET($D179,1,$C179,ROW($C$1047)-ROW($C179)),0))","v":0},{"$f":"IF(OR($C179=\"S\",$C179=0),0,MATCH(OFFSET($D179,0,$C179)+1,OFFSET($D179,1,$C179,ROW($C$1047)-ROW($C179)),0))","v":0},"","Serviço","Serviço","-","SINAPI",93205,"CINTA DE AMARRAÇÃO DE ALVENARIA MOLDADA IN LOCO COM UTILIZAÇÃO DE BLOCOS CANALETA. AF_03/2016","M",6,null,null,0,""]
["S",3,"S",0,1,4,3,0,0,0,0,"","Serviço","Serviço","-","AGETOP",71268,"ELO FUSÍVEL 6 K","Un    ",3,null,null,0,""]
["S",3,"S",0,1,4,3,0,0,0,0,"","Serviço","Serviço","-","AGETOP",71186,"DISPOSITIVO DE PROTEÇÃO CONTRA SURTOS (D.P.S.) 275V DE 90KA","Un    ",3,null,null,0,""]
["S",3,"S",0,1,4,3,0,0,0,0,"","Serviço","Serviço","-","AGETOP",71320,"FITA DE AUTO FUSAO, ROLO DE 2,00 M","Un    ",5,null,null,0,""]
["S",3,"S",0,1,4,3,0,0,0,0,"","Serviço","Serviço","-","AGETOP",70771,"CANTONEIRA AUXILIAR PARA BRAÇO TIPO C","un    ",3,null,null,0,""]
["S",3,"S",0,1,4,3,0,0,0,0,"","Serviço","Serviço","-","SINAPI",93022,"CURVA 90 GRAUS PARA ELETRODUTO, PVC, ROSCÁVEL, DN 75 MM (2 1/2\") - FORNECIMENTO E INSTALAÇÃO. AF_12/2015","UN",2,null,null,0,""]
["S",3,"S",0,1,4,3,0,0,0,0,"","Serviço","Serviço","-","AGETOP",72329,"SAPATILHA DE AÇO GALVANIZADO PARA POSTE COM TRANSFORMADOR","un    ",3,null,null,0,""]
["S",3,"S",0,1,4,3,0,0,0,0,"","Serviço","Serviço","-","AGETOP",71795,"OLHAL PARA PARAFUSO","un    ",3,null,null,0,""]
["S",3,"S",0,1,4,3,0,0,0,0,"","Serviço","Serviço","-","AGETOP",71761,"MURETA MEDIÇÃO ALVEN. 1 1/2 V.(35CM) REBOC.C/PINTURA ACRÍL. E LAJE CONC. 20MPA MALHA 8.0MM CADA 10CM REVEST.C/ARGAMASSA 1:3 C/ IMPERMEABILIZANTE","m2    ",1,null,null,0,""]
["S",3,"S",0,1,4,3,0,0,0,0,"","Serviço","Serviço","-","AGETOP",71776,"NIPLE METALICO Fo.Zo. DIAMETRO 2.1/2\"","Un    ",1,null,null,0,""]
["S",3,"S",0,1,4,3,0,0,0,0,"","Serviço","Serviço","-","AGETOP",71791,"NIPLE DUPLO FERRO GALVANIZADO 2\"","Un    ",1,null,null,0,""]
["S",3,"S",0,1,4,3,0,0,0,0,"","Serviço","Serviço","-","SINAPI",73624,"SUPORTE PARA TRANSFORMADOR EM POSTE DE CONCRETO CIRCULAR","UN",2,null,null,0,""]
["S",3,"S",0,1,4,3,0,0,0,0,"","Serviço","Serviço","-","AGETOP",72060,"POSTE DE CONCRETO SC 11/400 - SEM FUNDAÇÃO/CONCRETO","Un    ",1,null,null,0,""]
["S",3,"S",0,1,4,3,0,0,0,0,"","Serviço","Serviço","-","AGETOP",72000,"POSTE - ENGASTAMENTO SIMPLES PARA POSTE DE CONCRETO SEÇÃO CIRCULAR","m3    ",0.5,null,null,0,""]
["S",3,"S",0,1,4,3,0,0,0,0,"","Serviço","Serviço","-","SINAPI",72263,"TERMINAL OU CONECTOR DE PRESSAO - PARA CABO 50MM2 - FORNECIMENTO E INSTALACAO","UN",1,null,null,0,""]
["S",3,"S",0,1,4,3,0,0,0,0,"","Serviço","Serviço","-","AGETOP",72535,"TERMINAL DE PRESSAO 70 MMM2","Un    ",8,null,null,0,""]
["S",3,"S",0,1,4,3,0,0,0,0,"","Serviço","Serviço","-","AGETOP",72528,"TERMINAL DE PRESSAO 35 MM2","Un    ",10,null,null,0,""]
["S",3,"S",0,1,4,3,0,0,0,0,"","Serviço","Serviço","-","AGETOP",72518,"TERMINAL DE PRESSAO 10 MM2","Un    ",10,null,null,0,""]
["S",3,"S",0,1,4,3,0,0,0,0,"","Serviço","Serviço","-","SINAPI","73857/2","TRANSFORMADOR DISTRIBUICAO  112,5KVA TRIFASICO 60HZ CLASSE 15KV IMERSO EM ÓLEO MINERAL FORNECIMENTO E INSTALACAO","UN",1,null,null,0,""]
["S",3,"S",0,1,4,3,0,0,0,0,"","Serviço","Serviço","-","AGETOP",72630,"TRILHO OU SUPORTE P/BORNE TERMINAL","M     ",0.2,null,null,0,""]
["S",3,"S",0,1,4,3,0,0,0,0,"","Serviço","Serviço","-","AGETOP",72080,"POSTE/TRAFO - CAMINHÃO MUNCK 12 TON. (MÍNIMO 4H/DIA)","H     ",8,null,null,0,""]
[2,2,2,149,1,5,0,0,0,391,149,"","Nível 2","Nível 2","-","SINAPI",null,"INSTALAÇÕES HIDROSSANITÁRIAS","-",null,null,null,0,""]
[3,3,3,31,1,5,1,0,0,148,31,"","Nível 3","Nível 3","-","SINAPI",null,"PEÇAS E ACESSÓRIOS","-",null,null,null,0,""]
[4,4,4,7,1,5,1,1,0,30,7,"","Nível 4","Nível 4","-","SINAPI",null,"VASO SANITÁRIO E ACESSÓRIOS","-",null,null,null,0,""]
["S",{"$f":"IF(OR(C203=\"s\",C203=0),OFFSET(B203,-1,0),C203)","v":4},{"$f":"IF(OFFSET(C203,-1,0)=\"L\",1,IF(OFFSET(C203,-1,0)=1,2,IF(OR(A203=\"s\",A203=0),\"S\",IF(AND(OFFSET(C203,-1,0)=2,A203=4),3,IF(AND(OR(OFFSET(C203,-1,0)=\"s\",OFFSET(C203,-1,0)=0),A203<>\"s\",A203>OFFSET(B203,-1,0)),OFFSET(B203,-1,0),A203)))))","v":"S"},{"$f":"IF(OR(C203=\"S\",C203=0),0,IF(ISERROR(K203),J203,SMALL(J203:K203,1)))","v":0},{"$f":"IF($C203=1,OFFSET(E203,-1,0)+1,OFFSET(E203,-1,0))","v":1},{"$f":"IF($C203=1,0,IF($C203=2,OFFSET(F203,-1,0)+1,OFFSET(F203,-1,0)))","v":5},{"$f":"IF(AND($C203<=2,$C203<>0),0,IF($C203=3,OFFSET(G203,-1,0)+1,OFFSET(G203,-1,0)))","v":1},{"$f":"IF(AND($C203<=3,$C203<>0),0,IF($C203=4,OFFSET(H203,-1,0)+1,OFFSET(H203,-1,0)))","v":1},0,0,0,"","Serviço","Serviço","-","SINAPI",95470,"VASO SANITARIO SIFONADO CONVENCIONAL COM LOUÇA BRANCA, INCLUSO CONJUNTO DE LIGAÇÃO PARA BACIA SANITÁRIA AJUSTÁVEL - FORNECIMENTO E INSTALAÇÃO. AF_10/2016","UN",9,null,null,0,""]
["S",4,"S",0,1,5,1,1,0,0,0,"","Serviço","Serviço","-","AGETOP",80517,"VÁLVULA DE DESCARGA DUPLO ACIONAMENTO COM ACABAMENTO CROMADO ANTIVANDALISMO","Un    ",9,null,null,0,""]
["S",4,"S",0,1,5,1,1,0,0,0,"","Serviço","Serviço","-","AGETOP",80520,"CONJUNTO DE FIXACAO P/VASO SANITARIO (PAR)","CJ    ",9,null,null,0,""]
["S",4,"S",0,1,5,1,1,0,0,0,"","Serviço","Serviço","-","AGETOP",80526,"ASSENTO EM POLIPROPILENO COM SISTEMA DE FECHAMENTO SUAVE PARA VASO SANITÁRIO","Un    ",9,null,null,0,""]
["S",4,"S",0,1,5,1,1,0,0,0,"","Serviço","Serviço","-","AGETOP",80510,"ANEL DE VEDAÇÃO PARA VASO SANITÁRIO","Un    ",9,null,null,0,""]
["S",4,"S",0,1,5,1,1,0,0,0,"","Serviço","Serviço","-","AGETOP",80513,"TUBO PARA VÁLVULA DE DESCARGA ( CURTO 1.1/4\" )","Un    ",9,null,null,0,""]
[4,4,4,6,1,5,1,2,0,23,6,"","Nível 4","Nível 4","-","SINAPI",null,"LAVATÓRIO E ACESSÓRIOS","-",null,null,null,0,""]
["S",4,"S",0,1,5,1,2,0,0,0,"","Serviço","Serviço","-","AGETOP",80542,"LAVATÓRIO MÉDIO SEM COLUNA","Un    ",2,null,null,0,""]
["S",4,"S",0,1,5,1,2,0,{"$f":"IF(OR($C211=\"S\",$C211=0),0,MATCH(0,OFFSET($D211,1,$C211,ROW($C$1047)-ROW($C211)),0))","v":0},{"$f":"IF(OR($C211=\"S\",$C211=0),0,MATCH(OFFSET($D211,0,$C211)+1,OFFSET($D211,1,$C211,ROW($C$1047)-ROW($C211)),0))","v":0},"","Serviço","Serviço","-","AGETOP",80555,"LIGAÇÃO FLEXÍVEL METÁLICA DIAM.1/2\"(ENGATE)","Un    ",8,null,null,0,""]
["S",4,"S",0,1,5,1,2,0,0,0,"","Serviço","Serviço","-","SINAPI",86883,"SIFÃO DO TIPO FLEXÍVEL EM PVC 1\u0094 X 1.1/2\u0094 - FORNECIMENTO E INSTALAÇÃO. AF_12/2013","UN",8,null,null,0,""]
["S",4,"S",0,1,5,1,2,0,0,0,"","Serviço","Serviço","-","SINAPI",86915,"TORNEIRA CROMADA DE MESA, 1/2\" OU 3/4\", PARA LAVATÓRIO, PADRÃO MÉDIO - FORNECIMENTO E INSTALAÇÃO. AF_12/2013","UN",8,null,null,0,"Referência: AGETOP - 80570"]
["S",4,"S",0,1,5,1,2,0,0,0,"","Serviço","Serviço","-","SINAPI",86877,"VÁLVULA EM METAL CROMADO 1.1/2\" X 1.1/2\" PARA TANQUE OU LAVATÓRIO, COM OU SEM LADRÃO - FORNECIMENTO E INSTALAÇÃO. AF_12/2013","UN",8,null,null,0,"Referência: AGETOP - 80580"]
[4,4,4,5,1,5,1,3,0,17,5,"","Nível 4","Nível 4","-","SINAPI",null,"PIA E ACESSÓRIOS","-",null,null,null,0,""]
["S",4,"S",0,1,5,1,3,0,0,0,"","Serviço","Serviço","-","SINAPI",86912,"TORNEIRA CROMADA LONGA, DE PAREDE, 1/2\" OU 3/4\", PARA PIA DE COZINHA, PADRÃO MÉDIO - FORNECIMENTO E INSTALAÇÃO. AF_12/2013","UN",1,null,null,0,""]
["S",4,"S",0,1,5,1,3,0,0,0,"","Serviço","Serviço","-","SINAPI",86881,"SIFÃO DO TIPO GARRAFA EM METAL CROMADO 1 X 1.1/2\" - FORNECIMENTO E INSTALAÇÃO. AF_12/2013","UN",1,null,null,0,"Referência: AGETOP - 80670"]
["S",4,"S",0,1,5,1,3,0,0,0,"","Serviço","Serviço","-","SINAPI",86878,"VÁLVULA EM METAL CROMADO TIPO AMERICANA 3.1/2\" X 1.1/2\" PARA PIA - FORNECIMENTO E INSTALAÇÃO. AF_12/2013","UN",1,null,null,0,""]
["S",4,"S",0,1,5,1,3,0,0,0,"","Serviço","Serviço","-","SINAPI",86900,"CUBA DE EMBUTIR DE AÇO INOXIDÁVEL MÉDIA - FORNECIMENTO E INSTALAÇÃO. AF_12/2013","UN",1,null,null,0,""]
[4,4,4,2,1,5,1,4,0,12,2,"","Nível 4","Nível 4","-","SINAPI",null,"FILTRO E CHUVEIROS","-",null,null,null,0,""]
[{"$f":"CHOOSE(1+LOG(1+2*(ORÇAMENTO.Nivel=\"Nível 1\")+4*(ORÇAMENTO.Nivel=\"Nível 2\")+8*(ORÇAMENTO.Nivel=\"Nível 3\")+16*(ORÇAMENTO.Nivel=\"Nível 4\")+32*(ORÇAMENTO.Nivel=\"Serviço\"),2),0,1,2,3,4,\"S\")","v":"S"},4,"S",0,1,5,1,4,{"$f":"IF(AND($C221<=4,$C221<>0),0,IF(AND($C221=\"S\",$W221>0),OFFSET(I221,-1,0)+1,OFFSET(I221,-1,0)))","v":0},0,0,"","Serviço","Serviço","-","SINAPI",9535,"CHUVEIRO ELETRICO COMUM CORPO PLASTICO TIPO DUCHA, FORNECIMENTO E INSTALACAO","UN",4,null,null,0,""]
[4,4,4,5,1,5,1,5,0,10,5,"","Nível 4","Nível 4","-","SINAPI",null,"TANQUES / TORNEIRAS","-",null,null,null,0,""]
["S",4,"S",0,1,5,1,5,0,0,0,"","Serviço","Serviço","-","AGETOP",80802,"TANQUE MARMORE/GRANITO SINTÉTICO C/DUAS CUBAS E 1 BATEDOR","Un    ",1,null,null,0,""]
["S",4,"S",0,1,5,1,5,0,0,0,"","Serviço","Serviço","-","AGETOP",80820,"SIFAO P/TANQUE 1\" X 1.1/2\" - PVC","Un    ",3,null,null,0,""]
["S",4,"S",0,1,5,1,5,0,0,0,"","Serviço","Serviço","-","SINAPI",86877,"VÁLVULA EM METAL CROMADO 1.1/2\" X 1.1/2\" PARA TANQUE OU LAVATÓRIO, COM OU SEM LADRÃO - FORNECIMENTO E INSTALAÇÃO. AF_12/2013","UN",3,null,null,0,"Referência: AGETOP - 80580"]
["S",4,"S",0,1,5,1,5,0,0,0,"","Serviço","Serviço","-","SINAPI",86913,"TORNEIRA CROMADA 1/2\" OU 3/4\" PARA TANQUE, PADRÃO POPULAR - FORNECIMENTO E INSTALAÇÃO. AF_12/2013","UN",2,null,null,0,""]
[4,4,4,5,1,5,1,6,0,5,46,"","Nível 4","Nível 4","-","SINAPI",null,"REGISTROS","-",null,null,null,0,""]
["S",4,"S",0,1,5,1,6,0,0,0,"","Serviço","Serviço","-","SINAPI",89987,"REGISTRO DE GAVETA BRUTO, LATÃO, ROSCÁVEL, 3/4\", COM ACABAMENTO E CANOPLA CROMADOS. FORNECIDO E INSTALADO EM RAMAL DE ÁGUA. AF_12/2014","UN",1,null,null,0,"Referência: AGETOP - 80926"]
["S",4,"S",0,1,5,1,6,0,0,0,"","Serviço","Serviço","-","SINAPI",94498,"REGISTRO DE GAVETA BRUTO, LATÃO, ROSCÁVEL, 2\u0094, INSTALADO EM RESERVAÇÃO DE ÁGUA DE EDIFICAÇÃO QUE POSSUA RESERVATÓRIO DE FIBRA/FIBROCIMENTO \u0096 FORNECIMENTO E INSTALAÇÃO. AF_06/2016","UN",2,null,null,0,"Referência: AGETOP - 80906"]
["S",4,"S",0,1,5,1,6,0,0,0,"","Serviço","Serviço","-","SINAPI",94500,"REGISTRO DE GAVETA BRUTO, LATÃO, ROSCÁVEL, 3\u0094, INSTALADO EM RESERVAÇÃO DE ÁGUA DE EDIFICAÇÃO QUE POSSUA RESERVATÓRIO DE FIBRA/FIBROCIMENTO \u0096 FORNECIMENTO E INSTALAÇÃO. AF_06/2016","UN",1,null,null,0,""]
["S",4,"S",0,1,5,1,6,0,0,0,"","Serviço","Serviço","-","AGETOP",80946,"REGISTRO DE PRESSAO C/CANOPLA CROMADA DIAM.3/4\"","Un    ",4,null,null,0,""]
[3,3,3,52,1,5,2,0,0,117,52,"","Nível 3","Nível 3","-","SINAPI",null,"ÁGUA FRIA","-",null,null,null,0,""]
[4,4,4,7,1,5,2,1,0,51,7,"","Nível 4","Nível 4","-","SINAPI",null,"TUBOS DE PVC SOLDÁVEL","-",null,null,null,0,""]
["S",4,"S",0,1,5,2,1,0,0,0,"","Serviço","Serviço","-","SINAPI",89402,"TUBO, PVC, SOLDÁVEL, DN 25MM, INSTALADO EM RAMAL DE DISTRIBUIÇÃO DE ÁGUA - FORNECIMENTO E INSTALAÇÃO. AF_12/2014","M",36,null,null,0,"Referência: AGETOP - 81003"]
["S",4,"S",0,1,5,2,1,0,0,0,"","Serviço","Serviço","-","SINAPI",89447,"TUBO, PVC, SOLDÁVEL, DN 32MM, INSTALADO EM PRUMADA DE ÁGUA - FORNECIMENTO E INSTALAÇÃO. AF_12/2014","M",66,null,null,0,""]
["S",4,"S",0,1,5,2,1,0,0,0,"","Serviço","Serviço","-","SINAPI",89449,"TUBO, PVC, SOLDÁVEL, DN 50MM, INSTALADO EM PRUMADA DE ÁGUA - FORNECIMENTO E INSTALAÇÃO. AF_12/2014","M",36,null,null,0,""]
["S",4,"S",0,1,5,2,1,0,0,0,"","Serviço","Serviço","-","SINAPI",89450,"TUBO, PVC, SOLDÁVEL, DN 60MM, INSTALADO EM PRUMADA DE ÁGUA - FORNECIMENTO E INSTALAÇÃO. AF_12/2014","M",30,null,null,0,""]
["S",4,"S",0,1,5,2,1,0,0,0,"","Serviço","Serviço","-","SINAPI",89451,"TUBO, PVC, SOLDÁVEL, DN 75MM, INSTALADO EM PRUMADA DE ÁGUA - FORNECIMENTO E INSTALAÇÃO. AF_12/2014","M",96,null,null,0,""]
["S",4,"S",0,1,5,2,1,0,0,0,"","Serviço","Serviço","-","SINAPI",89452,"TUBO, PVC, SOLDÁVEL, DN 85MM, INSTALADO EM PRUMADA DE ÁGUA - FORNECIMENTO E INSTALAÇÃO. AF_12/2014","M",30,null,null,0,""]
[4,4,4,6,1,5,2,2,0,44,6,"","Nível 4","Nível 4","-","SINAPI",null,"ADAPTADORES DE PVC SOLDÁVEL","-",null,null,null,0,""]
["S",4,"S",0,1,5,2,2,0,0,0,"","Serviço","Serviço","-","SINAPI",89538,"ADAPTADOR CURTO COM BOLSA E ROSCA PARA REGISTRO, PVC, SOLDÁVEL, DN 25MM X 3/4\u0094, INSTALADO EM PRUMADA DE ÁGUA - FORNECIMENTO E INSTALAÇÃO. AF_12/2014","UN",6,null,null,0,""]
["S",4,"S",0,1,5,2,2,0,0,0,"","Serviço","Serviço","-","SINAPI",89596,"ADAPTADOR CURTO COM BOLSA E ROSCA PARA REGISTRO, PVC, SOLDÁVEL, DN 50MM X 1.1/2\u0094, INSTALADO EM PRUMADA DE ÁGUA - FORNECIMENTO E INSTALAÇÃO. AF_12/2014","UN",9,null,null,0,"Referência: AGETOP - 81069"]
["S",4,"S",0,1,5,2,2,0,0,0,"","Serviço","Serviço","-","AGETOP",81070,"ADAPTAD.SOLD.CURTO C/BOLSA/ROSCA P/REGIST.60X2\"","Un    ",4,null,null,0,""]
["S",4,"S",0,1,5,2,2,0,0,0,"","Serviço","Serviço","-","SINAPI",89616,"ADAPTADOR CURTO COM BOLSA E ROSCA PARA REGISTRO, PVC, SOLDÁVEL, DN 85MM X 3\u0094, INSTALADO EM PRUMADA DE ÁGUA - FORNECIMENTO E INSTALAÇÃO. AF_12/2014","UN",3,null,null,0,"Referência: AGETOP - 81072"]
["S",4,"S",0,1,5,2,2,0,0,0,"","Serviço","Serviço","-","COMPOSIÇÃO","COMP 028_SEE","ADAPTADOR PVC SOLDAVEL FLANGES LIVRES P/ CAIXA D' AGUA 85 MM X 3\"","UN ",1,null,null,0,""]
[4,4,4,2,1,5,2,3,0,38,2,"","Nível 4","Nível 4","-","SINAPI",null,"LUVAS DE PVC","-",null,null,null,0,""]
["S",4,"S",0,1,5,2,3,0,0,0,"","Serviço","Serviço","-","SINAPI",89534,"LUVA SOLDÁVEL E COM ROSCA, PVC, SOLDÁVEL, DN 25MM X 3/4\u0094, INSTALADO EM PRUMADA DE ÁGUA - FORNECIMENTO E INSTALAÇÃO. AF_12/2014","UN",4,null,null,0,""]
[4,4,4,9,1,5,2,4,0,36,9,"","Nível 4","Nível 4","-","SINAPI",null,"BUCHAS","-",null,null,null,0,""]
["S",4,"S",0,1,5,2,4,0,0,0,"","Serviço","Serviço","-","SINAPI",96662,"BUCHA DE REDUÇÃO, PPR, 32 X 25, CLASSE PN 25, INSTALADO EM RAMAL DE DISTRIBUIÇÃO DE ÁGUA \u0096 FORNECIMENTO E INSTALAÇÃO . AF_06/2015","UN",4,null,null,0,""]
["S",4,"S",0,1,5,2,4,0,0,0,"","Serviço","Serviço","-","SINAPI",89605,"LUVA DE REDUÇÃO, PVC, SOLDÁVEL, DN 60MM X 50MM, INSTALADO EM PRUMADA DE ÁGUA - FORNECIMENTO E INSTALAÇÃO. AF_12/2014","UN",15,null,null,0,""]
["S",4,"S",0,1,5,2,4,0,0,0,"","Serviço","Serviço","-","SINAPI",89579,"LUVA DE REDUÇÃO, PVC, SOLDÁVEL, DN 50MM X 25MM, INSTALADO EM PRUMADA DE ÁGUA   FORNECIMENTO E INSTALAÇÃO. AF_12/2014","UN",2,null,null,0,""]
["S",4,"S",0,1,5,2,4,0,0,0,"","Serviço","Serviço","-","AGETOP",81180,"BUCHA DE REDUCAO SOLDAVEL LONGA 50 X 32 mm","Un    ",7,null,null,0,""]
["S",4,"S",0,1,5,2,4,0,0,0,"","Serviço","Serviço","-","AGETOP",81166,"BUCHA DE REDUCAO SOLDAVEL CURTA 75 X 60 mm","Un    ",3,null,null,0,""]
["S",4,"S",0,1,5,2,4,0,0,0,"","Serviço","Serviço","-","AGETOP",81167,"BUCHA DE REDUCAO SOLDAVEL CURTA 85 X 75 mm","Un    ",3,null,null,0,""]
["S",4,"S",0,1,5,2,4,0,0,0,"","Serviço","Serviço","-","AGETOP",81181,"BUCHA DE REDUCAO SOLDAVEL LONGA 60 X 25 mm","Un    ",3,null,null,0,""]
["S",4,"S",0,1,5,2,4,0,0,0,"","Serviço","Serviço","-","AGETOP",81185,"BUCHA DE REDUÇÃO SOLDÁVEL LONGA 75 X 50 MM","un    ",2,null,null,0,""]
[4,4,4,6,1,5,2,5,0,27,6,"","Nível 4","Nível 4","-","SINAPI",null,"CAP","-",null,null,null,0,""]
["S",4,"S",0,1,5,2,5,0,0,0,"","Serviço","Serviço","-","AGETOP",81232,"CAP PVC ROSCAVEL DIAMETRO 3/4\" (25 mm)","Un    ",8,null,null,0,""]
["S",4,"S",0,1,5,2,5,0,0,0,"","Serviço","Serviço","-","AGETOP",81251,"CAP SOLD. DIAMETRO 25 mm","Un    ",10,null,null,0,""]
["S",4,"S",0,1,5,2,5,0,0,0,"","Serviço","Serviço","-","AGETOP",81253,"CAP PVC SOLDAVEL DIAMETRO 40 mm","Un    ",8,null,null,0,""]
["S",4,"S",0,1,5,2,5,0,0,0,"","Serviço","Serviço","-","SINAPI",72293,"CAP PVC ESGOTO 50MM (TAMPÃO) - FORNECIMENTO E INSTALAÇÃO","UN",10,null,null,0,""]
["S",4,"S",0,1,5,2,5,0,0,0,"","Serviço","Serviço","-","AGETOP",81258,"CAP PVC SOLDAVEL DIAMETRO 110 mm","Un    ",4,null,null,0,""]
[4,4,4,10,1,5,2,6,0,21,10,"","Nível 4","Nível 4","-","SINAPI",null,"JOELHO","-",null,null,null,0,""]
["S",4,"S",0,1,5,2,6,0,0,0,"","Serviço","Serviço","-","SINAPI",89481,"JOELHO 90 GRAUS, PVC, SOLDÁVEL, DN 25MM, INSTALADO EM PRUMADA DE ÁGUA - FORNECIMENTO E INSTALAÇÃO. AF_12/2014","UN",15,null,null,0,""]
["S",4,"S",0,1,5,2,6,0,0,0,"","Serviço","Serviço","-","SINAPI",89413,"JOELHO 90 GRAUS, PVC, SOLDÁVEL, DN 32MM, INSTALADO EM RAMAL DE DISTRIBUIÇÃO DE ÁGUA - FORNECIMENTO E INSTALAÇÃO. AF_12/2014","UN",13,null,null,0,"Referência: AGETOP - 81322"]
["S",4,"S",0,1,5,2,6,0,0,0,"","Serviço","Serviço","-","AGETOP",81340,"JOELHO REDUÇÃO 90º SOLDÁVEL  32 mm X 25 mm","Un    ",4,null,null,0,""]
["S",4,"S",0,1,5,2,6,0,0,0,"","Serviço","Serviço","-","SINAPI",89501,"JOELHO 90 GRAUS, PVC, SOLDÁVEL, DN 50MM, INSTALADO EM PRUMADA DE ÁGUA - FORNECIMENTO E INSTALAÇÃO. AF_12/2014","UN",8,null,null,0,""]
["S",4,"S",0,1,5,2,6,0,0,0,"","Serviço","Serviço","-","SINAPI",89505,"JOELHO 90 GRAUS, PVC, SOLDÁVEL, DN 60MM, INSTALADO EM PRUMADA DE ÁGUA - FORNECIMENTO E INSTALAÇÃO. AF_12/2014","UN",4,null,null,0,"Referência: AGETOP - 81325"]
["S",4,"S",0,1,5,2,6,0,0,0,"","Serviço","Serviço","-","SINAPI",89513,"JOELHO 90 GRAUS, PVC, SOLDÁVEL, DN 75MM, INSTALADO EM PRUMADA DE ÁGUA - FORNECIMENTO E INSTALAÇÃO. AF_12/2014","UN",6,null,null,0,"Referência: AGETOP - 81326"]
["S",4,"S",0,1,5,2,6,0,0,0,"","Serviço","Serviço","-","SINAPI",89521,"JOELHO 90 GRAUS, PVC, SOLDÁVEL, DN 85MM, INSTALADO EM PRUMADA DE ÁGUA - FORNECIMENTO E INSTALAÇÃO. AF_12/2014","UN",5,null,null,0,"Referência: AGETOP - 81327"]
["S",4,"S",0,1,5,2,6,0,0,0,"","Serviço","Serviço","-","AGETOP",81360,"JOELHO RED.90 GRAUS SOLD.C/BUCHA LATAO 25X1/2\"","Un    ",2,null,null,0,""]
["S",4,"S",0,1,5,2,6,0,0,0,"","Serviço","Serviço","-","SINAPI",94672,"JOELHO 90 GRAUS COM BUCHA DE LATÃO, PVC, SOLDÁVEL, DN  25 MM, X 3/4\u0094 INSTALADO EM RESERVAÇÃO DE ÁGUA DE EDIFICAÇÃO QUE POSSUA RESERVATÓRIO DE FIBRA/FIBROCIMENTO   FORNECIMENTO E INSTALAÇÃO. AF_06/2016","UN",7,null,null,0,""]
[4,4,4,8,1,5,2,7,0,11,8,"","Nível 4","Nível 4","-","SINAPI",null,"TÊ","-",null,null,null,0,""]
["S",4,"S",0,1,5,2,7,0,0,0,"","Serviço","Serviço","-","SINAPI",89617,"TE, PVC, SOLDÁVEL, DN 25MM, INSTALADO EM PRUMADA DE ÁGUA - FORNECIMENTO E INSTALAÇÃO. AF_12/2014","UN",5,null,null,0,""]
["S",4,"S",0,1,5,2,7,0,{"$f":"IF(OR($C275=\"S\",$C275=0),0,MATCH(0,OFFSET($D275,1,$C275,ROW($C$1047)-ROW($C275)),0))","v":0},{"$f":"IF(OR($C275=\"S\",$C275=0),0,MATCH(OFFSET($D275,0,$C275)+1,OFFSET($D275,1,$C275,ROW($C$1047)-ROW($C275)),0))","v":0},"","Serviço","Serviço","-","SINAPI",89625,"TE, PVC, SOLDÁVEL, DN 50MM, INSTALADO EM PRUMADA DE ÁGUA - FORNECIMENTO E INSTALAÇÃO. AF_12/2014","UN",10,null,null,0,"Referência: AGETOP - 81405"]
["S",4,"S",0,1,5,2,7,0,0,0,"","Serviço","Serviço","-","SINAPI",89622,"TÊ DE REDUÇÃO, PVC, SOLDÁVEL, DN 32MM X 25MM, INSTALADO EM PRUMADA DE ÁGUA - FORNECIMENTO E INSTALAÇÃO. AF_12/2014","UN",3,null,null,0,"Referência: AGETOP - 81421"]
["S",4,"S",0,1,5,2,7,0,0,0,"","Serviço","Serviço","-","SINAPI",89632,"TE DE REDUÇÃO, PVC, SOLDÁVEL, DN 85MM X 60MM, INSTALADO EM PRUMADA DE ÁGUA - FORNECIMENTO E INSTALAÇÃO. AF_12/2014","UN",3,null,null,0,""]
["S",4,"S",0,1,5,2,7,0,0,0,"","Serviço","Serviço","-","SINAPI",89628,"TE, PVC, SOLDÁVEL, DN 60MM, INSTALADO EM PRUMADA DE ÁGUA - FORNECIMENTO E INSTALAÇÃO. AF_12/2014","UN",15,null,null,0,"Referência: AGETOP - 81406"]
["S",4,"S",0,1,5,2,7,0,0,0,"","Serviço","Serviço","-","AGETOP",81444,"TE 90 GR.SOLD.C/BUC.LATAO NA BOLSA CENT.25X25X3/4\"","Un    ",3,null,null,0,""]
["S",4,"S",0,1,5,2,7,0,0,0,"","Serviço","Serviço","-","AGETOP",81445,"TE RED.SOLD.90GR.BUC.LATAO BOLSA CENT.25X25X1/2\"","Un    ",4,null,null,0,""]
[4,4,4,3,1,5,2,8,0,3,{"$error":"#N/A"},"","Nível 4","Nível 4","-","SINAPI",null,"ADESIVOS","-",null,null,null,0,""]
["S",4,"S",0,1,5,2,8,0,0,0,"","Serviço","Serviço","-","AGETOP",81501,"ADESIVO PLASTICO - FRASCO 850 G","Un    ",2,null,null,0,""]
["S",4,"S",0,1,5,2,8,0,0,0,"","Serviço","Serviço","-","AGETOP",81504,"SOLUCAO LIMPADORA 1000 CM3","Un    ",2,null,null,0,""]
[3,3,3,21,1,5,3,0,0,65,21,"","Nível 3","Nível 3","-","SINAPI",null,"ESGOTO SANITÁRIO","-",null,null,null,0,""]
[{"$f":"CHOOSE(1+LOG(1+2*(ORÇAMENTO.Nivel=\"Nível 1\")+4*(ORÇAMENTO.Nivel=\"Nível 2\")+8*(ORÇAMENTO.Nivel=\"Nível 3\")+16*(ORÇAMENTO.Nivel=\"Nível 4\")+32*(ORÇAMENTO.Nivel=\"Serviço\"),2),0,1,2,3,4,\"S\")","v":4},4,4,3,1,5,3,1,{"$f":"IF(AND($C285<=4,$C285<>0),0,IF(AND($C285=\"S\",$W285>0),OFFSET(I285,-1,0)+1,OFFSET(I285,-1,0)))","v":0},20,3,"","Nível 4","Nível 4","-","SINAPI",null,"CORPO DE CAIXA SIFONADA / RALO","-",null,null,null,0,""]
["S",4,"S",0,1,5,3,1,0,0,0,"","Serviço","Serviço","-","AGETOP",81663,"CORPO CX. SIFONADA DIAM. 150 X 150 X 50","Un    ",5,null,null,0,""]
["S",4,"S",0,1,5,3,1,0,0,0,"","Serviço","Serviço","-","AGETOP",81681,"CORPO RALO SECO CILINDRICO 100 X 40","Un    ",2,null,null,0,""]
[4,4,4,2,1,5,3,2,0,17,2,"","Nível 4","Nível 4","-","SINAPI",null,"CURVAS","-",null,null,null,0,""]
["S",4,"S",0,1,5,3,2,0,0,0,"","Serviço","Serviço","-","AGETOP",81730,"CURVA 90 GRAUS CURTA DIAM. 40 MM","Un    ",6,null,null,0,""]
[4,4,4,6,1,5,3,3,0,15,6,"","Nível 4","Nível 4","-","SINAPI",null,"JOELHOS","-",null,null,null,0,""]
["S",4,"S",0,1,5,3,3,0,0,0,"","Serviço","Serviço","-","SINAPI",89802,"JOELHO 45 GRAUS, PVC, SERIE NORMAL, ESGOTO PREDIAL, DN 50 MM, JUNTA ELÁSTICA, FORNECIDO E INSTALADO EM PRUMADA DE ESGOTO SANITÁRIO OU VENTILAÇÃO. AF_12/2014","UN",8,null,null,0,""]
["S",4,"S",0,1,5,3,3,0,0,0,"","Serviço","Serviço","-","SINAPI",89810,"JOELHO 45 GRAUS, PVC, SERIE NORMAL, ESGOTO PREDIAL, DN 100 MM, JUNTA ELÁSTICA, FORNECIDO E INSTALADO EM PRUMADA DE ESGOTO SANITÁRIO OU VENTILAÇÃO. AF_12/2014","UN",1,null,null,0,""]
["S",4,"S",0,1,5,3,3,0,0,0,"","Serviço","Serviço","-","SINAPI",89724,"JOELHO 90 GRAUS, PVC, SERIE NORMAL, ESGOTO PREDIAL, DN 40 MM, JUNTA SOLDÁVEL, FORNECIDO E INSTALADO EM RAMAL DE DESCARGA OU RAMAL DE ESGOTO SANITÁRIO. AF_12/2014","UN",10,null,null,0,""]
["S",4,"S",0,1,5,3,3,0,0,0,"","Serviço","Serviço","-","SINAPI",89731,"JOELHO 90 GRAUS, PVC, SERIE NORMAL, ESGOTO PREDIAL, DN 50 MM, JUNTA ELÁSTICA, FORNECIDO E INSTALADO EM RAMAL DE DESCARGA OU RAMAL DE ESGOTO SANITÁRIO. AF_12/2014","UN",8,null,null,0,""]
["S",4,"S",0,1,5,3,3,0,0,0,"","Serviço","Serviço","-","SINAPI",89809,"JOELHO 90 GRAUS, PVC, SERIE NORMAL, ESGOTO PREDIAL, DN 100 MM, JUNTA ELÁSTICA, FORNECIDO E INSTALADO EM PRUMADA DE ESGOTO SANITÁRIO OU VENTILAÇÃO. AF_12/2014","UN",9,null,null,0,""]
[4,4,4,3,1,5,3,4,0,9,3,"","Nível 4","Nível 4","-","SINAPI",null,"JUNÇÕES","-",null,null,null,0,""]
["S",4,"S",0,1,5,3,4,0,0,0,"","Serviço","Serviço","-","AGETOP",81973,"JUNCAO SIMPLES DIAM. 100 X 50 MM","Un    ",3,null,null,0,""]
["S",4,"S",0,1,5,3,4,0,0,0,"","Serviço","Serviço","-","SINAPI",89797,"JUNÇÃO SIMPLES, PVC, SERIE NORMAL, ESGOTO PREDIAL, DN 100 X 100 MM, JUNTA ELÁSTICA, FORNECIDO E INSTALADO EM RAMAL DE DESCARGA OU RAMAL DE ESGOTO SANITÁRIO. AF_12/2014","UN",3,null,null,0,"Referência: AGETOP - 81975"]
[4,4,4,2,1,5,3,5,0,6,2,"","Nível 4","Nível 4","-","SINAPI",null,"TÊ","-",null,null,null,0,""]
["S",4,"S",0,1,5,3,5,0,0,0,"","Serviço","Serviço","-","SINAPI",89825,"TE, PVC, SERIE NORMAL, ESGOTO PREDIAL, DN 50 X 50 MM, JUNTA ELÁSTICA, FORNECIDO E INSTALADO EM PRUMADA DE ESGOTO SANITÁRIO OU VENTILAÇÃO. AF_12/2014","UN",6,null,null,0,""]
[4,4,4,4,1,5,3,6,0,4,{"$error":"#N/A"},"","Nível 4","Nível 4","-","SINAPI",null,"TUBOS","-",null,null,null,0,""]
["S",4,"S",0,1,5,3,6,0,0,0,"","Serviço","Serviço","-","SINAPI",89711,"TUBO PVC, SERIE NORMAL, ESGOTO PREDIAL, DN 40 MM, FORNECIDO E INSTALADO EM RAMAL DE DESCARGA OU RAMAL DE ESGOTO SANITÁRIO. AF_12/2014","M",12,null,null,0,"Referência: AGETOP - 82301"]
["S",4,"S",0,1,5,3,6,0,0,0,"","Serviço","Serviço","-","SINAPI",89798,"TUBO PVC, SERIE NORMAL, ESGOTO PREDIAL, DN 50 MM, FORNECIDO E INSTALADO EM PRUMADA DE ESGOTO SANITÁRIO OU VENTILAÇÃO. AF_12/2014","M",42,null,null,0,""]
["S",4,"S",0,1,5,3,6,0,0,0,"","Serviço","Serviço","-","SINAPI",89800,"TUBO PVC, SERIE NORMAL, ESGOTO PREDIAL, DN 100 MM, FORNECIDO E INSTALADO EM PRUMADA DE ESGOTO SANITÁRIO OU VENTILAÇÃO. AF_12/2014","M",102,null,null,0,""]
[3,3,3,5,1,5,4,0,0,44,5,"","Nível 3","Nível 3","-","SINAPI",null,"OUTROS","-",null,null,null,0,""]
["S",3,"S",0,1,5,4,0,0,0,0,"","Serviço","Serviço","-","AGETOP",81825,"CAIXA DE PASSAGEM 60 X 60 CM SEM TAMPA","Un    ",5,null,null,0,""]
["S",3,"S",0,1,5,4,0,0,0,0,"","Serviço","Serviço","-","AGETOP",81826,"TAMPA EM CONCRETO ARMADO 25 MPA E=5CM PARA A CAIXA DE PASSAGEM 60X60CM","Un    ",5,null,null,0,""]
["S",3,"S",0,1,5,4,0,0,0,0,"","Serviço","Serviço","-","AGETOP",81869,"FOSSA SEPTICA 8700 LITROS COM IMPERMEABILIZAÇÃO","Un    ",1,null,null,0,""]
["S",3,"S",0,1,5,4,0,0,0,0,"","Serviço","Serviço","-","AGETOP",81874,"SUMIDOURO COM DIÂMETRO=1,60M E  PROFUNDIDADE=4,50 M","Un    ",2,null,null,0,""]
[3,3,3,39,1,5,5,0,0,39,76,"","Nível 3","Nível 3","-","SINAPI",null,"INCÊNDIO","-",null,null,null,0,""]
["S",3,"S",0,1,5,5,0,0,0,0,"","Serviço","Serviço","-","COMPOSIÇÃO","COMP 557_SEE","BOMBA THSI-18 10,0 CV TRIFÁSICA","UN ",1,null,null,0,""]
["S",3,"S",0,1,5,5,0,0,0,0,"","Serviço","Serviço","-","AGETOP",72338,"SIRENE METALICA ALCANCE 500 M","Un    ",1,null,null,0,""]
["S",3,"S",0,1,5,5,0,0,0,0,"","Serviço","Serviço","-","AGETOP",80910,"REGISTRO DE GAVETA BRUTO DIAMETRO 2.1/2\"","Un    ",2,null,null,0,""]
["S",3,"S",0,1,5,5,0,0,0,0,"","Serviço","Serviço","-","AGETOP",82379,"TUBO FERRO GALVANIZADO DIAM.2.1/2\"","m     ",150,null,null,0,""]
["S",3,"S",0,1,5,5,0,0,0,0,"","Serviço","Serviço","-","AGETOP",85003,"EXTINTOR PO QUIMICO SECO (6 KG) - CAPACIDADE EXTINTORA 20 BC","Un    ",2,null,null,0,""]
["S",3,"S",0,1,5,5,0,0,0,0,"","Serviço","Serviço","-","AGETOP",85006,"EXTINTOR MULTI USO EM PO A B C (6 KG) - CAPACIDADE EXTINTORA 3A 20BC","un    ",6,null,null,0,""]
["S",3,"S",0,1,5,5,0,0,0,0,"","Serviço","Serviço","-","AGETOP",85011,"CAIXA DE INCÊNDIO METÁLICA COM SUPORTE PARA MANGUEIRA, TAMPA E MURETA 17X60X90 CM C/PINTURA","Un    ",4,null,null,0,""]
["S",3,"S",0,1,5,5,0,0,0,0,"","Serviço","Serviço","-","AGETOP",85017,"MANGUEIRA DE INCÊNDIO D.I. = 38 MM TIPO 2 COMP. = 15 M","CJ    ",8,null,null,0,""]
["S",3,"S",0,1,5,5,0,0,0,0,"","Serviço","Serviço","-","AGETOP",85025,"ESGUICHO REGULÁVEL 1.1/2\"","Un    ",4,null,null,0,""]
["S",3,"S",0,1,5,5,0,0,0,0,"","Serviço","Serviço","-","AGETOP",85027,"ADAPTADOR P/ENGATE STORZ 2.1/2\" X 1.1/2\"","Un    ",5,null,null,0,""]
["S",3,"S",0,1,5,5,0,0,0,0,"","Serviço","Serviço","-","AGETOP",85031,"REGISTRO GLOBO ANGULAR 2.1/2\"","Un    ",4,null,null,0,""]
["S",3,"S",0,1,5,5,0,0,0,0,"","Serviço","Serviço","-","COMPOSIÇÃO","COMP 194_SEE","TAMPÃO CEGO COM CORRENTE 1.1/2\"","UN ",4,null,null,0,""]
["S",3,"S",0,1,5,5,0,0,0,0,"","Serviço","Serviço","-","AGETOP",85037,"TANQUE DE PRESSÃO DE 10 L","Un    ",1,null,null,0,""]
["S",3,"S",0,1,5,5,0,0,0,0,"","Serviço","Serviço","-","AGETOP",85039,"PRESSOSTATO 50 A 80 PSI","Un    ",1,null,null,0,""]
["S",3,"S",0,1,5,5,0,0,0,0,"","Serviço","Serviço","-","AGETOP",85041,"MANOMETRO - 0 A 10 KG/CM2","Un    ",1,null,null,0,""]
["S",3,"S",0,1,5,5,0,0,0,0,"","Serviço","Serviço","-","AGETOP",85047,"NIPLE DUPLO FERRO GALVANIZADO 2.1/2\"","Un    ",4,null,null,0,""]
["S",3,"S",0,1,5,5,0,0,0,0,"","Serviço","Serviço","-","AGETOP",85077,"VÁLVULA DE RETENÇÃO HORIZONTAL 2.1/2\"","Un    ",2,null,null,0,""]
["S",3,"S",0,1,5,5,0,0,0,0,"","Serviço","Serviço","-","COMPOSIÇÃO","COMP 017_SEE","REDUCAO GIRATÓRIA TIPO STORZ LATAO P/ INST. PREDIAL COMBATE A INCENDIO ENGATE RAPIDO 2.1/2\" X 1.1/2\"","UN ",4,null,null,0,""]
["S",3,"S",0,1,5,5,0,0,0,0,"","Serviço","Serviço","-","COMPOSIÇÃO","COMP 018_SEE","CHAVE DUPLA P/ CONEXÕES TIPO STORZ EM LATÃO ENGATE RÁPIDO 1 1/2\" X 2 1/2\"","UN ",4,null,null,0,""]
["S",3,"S",0,1,5,5,0,0,0,0,"","Serviço","Serviço","-","AGETOP",80981,"REGISTRO DE ESFERA DIAMETRO 2.1/2\"","Un    ",1,null,null,0,""]
["S",3,"S",0,1,5,5,0,0,0,0,"","Serviço","Serviço","-","COMPOSIÇÃO","COMP 087_SEE","REGISTRO DE GAVETA COM HASTE ASCENDENTE DE BRONZE 2 1/2\"","UN ",1,null,null,0,""]
["S",3,"S",0,1,5,5,0,0,0,0,"","Serviço","Serviço","-","COMPOSIÇÃO","COMP 019_SEE","TAMPÃO LATAO C/ CORRENTE P/ INSTALAÇÃO PREDIAL COMBATE A INCÊNDIO ENGATE RÁPIDO 1 1/2\"","UN ",4,null,null,0,""]
["S",3,"S",0,1,5,5,0,0,0,0,"","Serviço","Serviço","-","AGETOP",85056,"TÊ DE FERRO GALVANIZADO 90º X 2 1/2\"","un    ",10,null,null,0,""]
["S",3,"S",0,1,5,5,0,0,0,0,"","Serviço","Serviço","-","COMPOSIÇÃO","COMP 030_SEE","COTOVELO DE FERRO GALV. 90° X 2 1/2\"","UN ",19,null,null,0,""]
["S",3,"S",0,1,5,5,0,0,0,0,"","Serviço","Serviço","-","AGETOP",85047,"NIPLE DUPLO FERRO GALVANIZADO 2.1/2\"","Un    ",5,null,null,0,""]
["S",3,"S",0,1,5,5,0,0,0,0,"","Serviço","Serviço","-","COMPOSIÇÃO","COMP 076_SEE","CURVA FERRO GALVANIZADO 45G ROSCA MACHO/FEMEA REF. 2 1/2\"","UN ",1,null,null,0,""]
["S",3,"S",0,1,5,5,0,0,0,0,"","Serviço","Serviço","-","COMPOSIÇÃO","COMP 077_SEE","UNIAO FERRO GALV C/ASSENTO CONICO BRONZE 2 1/2\"","UN ",2,null,null,0,""]
["S",3,"S",0,1,5,5,0,0,0,0,"","Serviço","Serviço","-","COMPOSIÇÃO","COMP 347_SEE","ADAPTADOR PVC SOLDAVEL, COM FLANGES LIVRES, 75 MM X 2 1/2\", PARA CAIXA D' AGUA","UN ",1,null,null,0,""]
["S",3,"S",0,1,5,5,0,0,{"$f":"IF(OR($C339=\"S\",$C339=0),0,MATCH(0,OFFSET($D339,1,$C339,ROW($C$1047)-ROW($C339)),0))","v":0},{"$f":"IF(OR($C339=\"S\",$C339=0),0,MATCH(OFFSET($D339,0,$C339)+1,OFFSET($D339,1,$C339,ROW($C$1047)-ROW($C339)),0))","v":0},"","Serviço","Serviço","-","COMPOSIÇÃO","COMP 022_SEE","TAMPÃO FOFO 40X50CM C/INSCRIÇÃO ","UN ",1,null,null,0,""]
["S",3,"S",0,1,5,5,0,0,0,0,"","Serviço","Serviço","-","COMPOSIÇÃO","COMP 546_SEE","BUJÃO DE REBORDO 2.1/2\"","UN ",1,null,null,0,""]
["S",3,"S",0,1,5,5,0,0,0,0,"","Serviço","Serviço","-","COMPOSIÇÃO","COMP 024_SEE","SINALIZADOR FOTOLUMINESCENTE PARA EXTINTOR","UN ",8,null,null,0,""]
["S",3,"S",0,1,5,5,0,0,0,0,"","Serviço","Serviço","-","COMPOSIÇÃO","COMP 186_SEE","BOTOEIRA BOMBA DE INCÊNDIO C/ MARTELO CONVENCIONAL/ ANALÓGICA","UN ",1,null,null,0,""]
["S",3,"S",0,1,5,5,0,0,0,0,"","Serviço","Serviço","-","COMPOSIÇÃO","COMP 188_SEE","ACIONADOR MANUAL DE ALARME","UN ",4,null,null,0,""]
["S",3,"S",0,1,5,5,0,0,0,0,"","Serviço","Serviço","-","COMPOSIÇÃO","COMP 190_SEE","CENTRAL DE DETECÇÃO E ALARME DE 40 SETORES COM BATERIA","UN ",1,null,null,0,""]
["S",3,"S",0,1,5,5,0,0,0,0,"","Serviço","Serviço","-","COMPOSIÇÃO","COMP 025_SEE","SINALIZADOR FOTOLUMINESCENTE DE EMERGÊNCIA","UN ",33,null,null,0,""]
["S",3,"S",0,1,5,5,0,0,0,0,"","Serviço","Serviço","-","COMPOSIÇÃO","COMP 277_SEE","MARCAÇÃO NO PISO - 1X1 M PARA EXTINTOR","M2",8,null,null,0,""]
["S",3,"S",0,1,5,5,0,0,0,0,"","Serviço","Serviço","-","SINAPI",97599,"LUMINÁRIA DE EMERGÊNCIA - FORNECIMENTO E INSTALAÇÃO. AF_11/2017","UN",17,null,null,0,""]
["S",3,"S",0,1,5,5,0,0,0,0,"","Serviço","Serviço","-","AGETOP",81883,"RES.METALICO TAÇA AÇO PATINÁVEL-V=20M3-COL.SEC.H=6M+FUNDAÇÃO+LOGOTIPO","un    ",1,null,null,0,""]
[2,2,2,26,1,6,0,0,0,242,26,"","Nível 2","Nível 2","-","SINAPI",null,"INSTALAÇÕES ESPECIAIS","-",null,null,null,0,""]
["S",2,"S",0,1,6,0,0,0,0,0,"","Serviço","Serviço","-","AGETOP",91007,"CENTRAL DE GÁS PADRÃO AGETOP SEM INSTALAÇÕES (1+1 CILINDRO 45 KG)","Un    ",1,null,null,0,""]
["S",2,"S",0,1,6,0,0,0,0,0,"","Serviço","Serviço","-","AGETOP",91023,"UNIÃO S/BRONZE PRETA 3/4\" NPT 300 LBS","Un    ",3,null,null,0,""]
["S",2,"S",0,1,6,0,0,0,0,0,"","Serviço","Serviço","-","COMPOSIÇÃO","COMP 382_SEE","TE DE REDUCAO DE FERRO GALVANIZADO, COM ROSCA BSP, DE 3/4\" X 1/2\"","UN ",1,null,null,0,""]
["S",2,"S",0,1,6,0,0,0,0,0,"","Serviço","Serviço","-","COMPOSIÇÃO","COMP 383_SEE","BUCHA DE REDUCAO DE FERRO GALVANIZADO, COM ROSCA BSP, DE 1/2\" X 1/4\"","UN ",3,null,null,0,""]
["S",2,"S",0,1,6,0,0,0,0,0,"","Serviço","Serviço","-","AGETOP",91021,"LUVA GALVANIZADO DE REDUÇÃO 3/4\" X 1/2\" (GÁS)","Un    ",2,null,null,0,""]
["S",2,"S",0,1,6,0,0,0,0,0,"","Serviço","Serviço","-","SINAPI",92692,"NIPLE, EM FERRO GALVANIZADO, CONEXÃO ROSQUEADA, DN 15 (1/2\"), INSTALADO EM RAMAIS E SUB-RAMAIS DE GÁS - FORNECIMENTO E INSTALAÇÃO. AF_12/2015","UN",6,null,null,0,""]
["S",2,"S",0,1,6,0,0,0,0,0,"","Serviço","Serviço","-","AGETOP",91031,"NIPLE DUPLO 300 PSI 3/4\"","Un    ",6,null,null,0,""]
["S",2,"S",0,1,6,0,0,0,0,0,"","Serviço","Serviço","-","COMPOSIÇÃO","COMP 212_SEE","NIPLE DE REDUÇÃO 1/2\" X 1/4\" BSP","UN ",4,null,null,0,""]
["S",2,"S",0,1,6,0,0,0,0,0,"","Serviço","Serviço","-","COMPOSIÇÃO","COMP 213_SEE","NIPLE DE REDUÇÃO 3/4\" X 1/2\" BSP","UN ",4,null,null,0,""]
["S",2,"S",0,1,6,0,0,0,0,0,"","Serviço","Serviço","-","SINAPI",92688,"TUBO DE AÇO GALVANIZADO COM COSTURA, CLASSE MÉDIA, CONEXÃO ROSQUEADA, DN 20 (3/4\"), INSTALADO EM RAMAIS E SUB-RAMAIS DE GÁS - FORNECIMENTO E INSTALAÇÃO. AF_12/2015","M",12,null,null,0,""]
["S",2,"S",0,1,6,0,0,0,0,0,"","Serviço","Serviço","-","SINAPI",92701,"JOELHO 90 GRAUS, EM FERRO GALVANIZADO, CONEXÃO ROSQUEADA, DN 20 (3/4\"), INSTALADO EM RAMAIS E SUB-RAMAIS DE GÁS - FORNECIMENTO E INSTALAÇÃO. AF_12/2015","UN",4,null,null,0,""]
["S",2,"S",0,1,6,0,0,0,0,0,"","Serviço","Serviço","-","COMPOSIÇÃO","COMP 237_SEE","FITA ANTICORROSIVA","M",8,null,null,0,""]
["S",2,"S",0,1,6,0,0,0,0,0,"","Serviço","Serviço","-","AGETOP",91025,"VÁLVULA ESFERICA LATÃO 3/4\"","Un    ",3,null,null,0,""]
["S",2,"S",0,1,6,0,0,0,0,0,"","Serviço","Serviço","-","COMPOSIÇÃO","COMP 542_SEE","VÁLVULA UGV 3/4\" (S) LATÃO","UN ",2,null,null,0,""]
["S",2,"S",0,1,6,0,0,0,0,0,"","Serviço","Serviço","-","COMPOSIÇÃO","COMP 543_SEE","VÁLVULA UGV 1/2\" (S) LATÃO","UN ",2,null,null,0,""]
["S",2,"S",0,1,6,0,0,0,0,0,"","Serviço","Serviço","-","AGETOP",91029,"VALVULA DE RETENÇÃO LATÃO 1/2\" X 7/16\" NPT","Un    ",2,null,null,0,""]
["S",2,"S",0,1,6,0,0,0,0,0,"","Serviço","Serviço","-","COMPOSIÇÃO","COMP 211_SEE","REGULADOR DE 2º ESTÁGIO 5KG/H","UN ",2,null,null,0,""]
["S",2,"S",0,1,6,0,0,0,0,0,"","Serviço","Serviço","-","COMPOSIÇÃO","COMP 210_SEE","REGULADOR DE 1º ESTÁGIO 60KG/H MODELO AP-40  COM MANÔMETRO","UN ",1,null,null,0,""]
["S",2,"S",0,1,6,0,0,0,0,0,"","Serviço","Serviço","-","AGETOP",85003,"EXTINTOR PO QUIMICO SECO (6 KG) - CAPACIDADE EXTINTORA 20 BC","Un    ",1,null,null,0,""]
["S",2,"S",0,1,6,0,0,0,0,0,"","Serviço","Serviço","-","COMPOSIÇÃO","COMP 235_SEE","PLACA DE SINALIZAÇÃO EM PVC COD 01 - (300X300) PROIBIDO FUMAR","UN ",2,null,null,0,""]
["S",2,"S",0,1,6,0,0,0,0,0,"","Serviço","Serviço","-","COMPOSIÇÃO","COMP 236_SEE","PLACA DE SINALIZAÇÃO EM PVC COD 06 - (300X300) PERIGO INFLAMÁVEL","UN ",2,null,null,0,""]
["S",2,"S",0,1,6,0,0,0,0,0,"","Serviço","Serviço","-","AGETOP",91043,"BRAÇADEIRA METALICA TIPO \"D\" DIAM. 3/4\"","Un    ",5,null,null,0,""]
["S",2,"S",0,1,6,0,0,0,0,0,"","Serviço","Serviço","-","AGETOP",71863,"PARAFUSO P/BUCHA S-10","Un    ",10,null,null,0,""]
["S",2,"S",0,1,6,0,0,0,0,0,"","Serviço","Serviço","-","AGETOP",70393,"BUCHA DE NYLON S-10","Un    ",10,null,null,0,""]
["S",2,"S",0,1,6,0,0,0,0,0,"","Serviço","Serviço","-","AGETOP",91045,"SUPORTE PARA COLETOR","Un    ",2,null,null,0,""]
[2,{"$f":"IF(OR(C375=\"s\",C375=0),OFFSET(B375,-1,0),C375)","v":2},{"$f":"IF(OFFSET(C375,-1,0)=\"L\",1,IF(OFFSET(C375,-1,0)=1,2,IF(OR(A375=\"s\",A375=0),\"S\",IF(AND(OFFSET(C375,-1,0)=2,A375=4),3,IF(AND(OR(OFFSET(C375,-1,0)=\"s\",OFFSET(C375,-1,0)=0),A375<>\"s\",A375>OFFSET(B375,-1,0)),OFFSET(B375,-1,0),A375)))))","v":2},{"$f":"IF(OR(C375=\"S\",C375=0),0,IF(ISERROR(K375),J375,SMALL(J375:K375,1)))","v":17},{"$f":"IF($C375=1,OFFSET(E375,-1,0)+1,OFFSET(E375,-1,0))","v":1},{"$f":"IF($C375=1,0,IF($C375=2,OFFSET(F375,-1,0)+1,OFFSET(F375,-1,0)))","v":7},{"$f":"IF(AND($C375<=2,$C375<>0),0,IF($C375=3,OFFSET(G375,-1,0)+1,OFFSET(G375,-1,0)))","v":0},{"$f":"IF(AND($C375<=3,$C375<>0),0,IF($C375=4,OFFSET(H375,-1,0)+1,OFFSET(H375,-1,0)))","v":0},0,216,17,"","Nível 2","Nível 2","-","SINAPI",null,"ALVENARIAS E DIVISÓRIAS","-",null,null,null,0,""]
[3,3,3,2,1,7,1,0,0,16,2,"","Nível 3","Nível 3","-","SINAPI",null,"SECRETARIA","-",null,null,null,0,""]
["S",3,"S",0,1,7,1,0,0,0,0,"","Serviço","Serviço","-","SINAPI",87520,"ALVENARIA DE VEDAÇÃO DE BLOCOS CERÂMICOS FURADOS NA HORIZONTAL DE 9X19X19CM (ESPESSURA 9CM) DE PAREDES COM ÁREA LÍQUIDA MAIOR OU IGUAL A 6M² COM VÃOS E ARGAMASSA DE ASSENTAMENTO COM PREPARO MANUAL. AF_06/2014","M2",1.95,null,null,0,"Referência: AGETOP - 100201"]
[3,3,3,2,1,7,2,0,0,14,2,"","Nível 3","Nível 3","-","SINAPI",null,"ÁREA DE SERVIÇO","-",null,null,null,0,""]
["S",3,"S",0,1,7,2,0,0,0,0,"","Serviço","Serviço","-","SINAPI",87520,"ALVENARIA DE VEDAÇÃO DE BLOCOS CERÂMICOS FURADOS NA HORIZONTAL DE 9X19X19CM (ESPESSURA 9CM) DE PAREDES COM ÁREA LÍQUIDA MAIOR OU IGUAL A 6M² COM VÃOS E ARGAMASSA DE ASSENTAMENTO COM PREPARO MANUAL. AF_06/2014","M2",4.2,null,null,0,"Referência: AGETOP - 100201"]
[3,3,3,2,1,7,3,0,0,12,2,"","Nível 3","Nível 3","-","SINAPI",null,"SALA DO PROFESSOR","-",null,null,null,0,""]
["S",3,"S",0,1,7,3,0,0,0,0,"","Serviço","Serviço","-","SINAPI",87520,"ALVENARIA DE VEDAÇÃO DE BLOCOS CERÂMICOS FURADOS NA HORIZONTAL DE 9X19X19CM (ESPESSURA 9CM) DE PAREDES COM ÁREA LÍQUIDA MAIOR OU IGUAL A 6M² COM VÃOS E ARGAMASSA DE ASSENTAMENTO COM PREPARO MANUAL. AF_06/2014","M2",10.38,null,null,0,"Referência: AGETOP - 100201"]
[3,3,3,2,1,7,4,0,0,10,2,"","Nível 3","Nível 3","-","SINAPI",null,"COORDENAÇÃO","-",null,null,null,0,""]
["S",3,"S",0,1,7,4,0,0,0,0,"","Serviço","Serviço","-","SINAPI",87520,"ALVENARIA DE VEDAÇÃO DE BLOCOS CERÂMICOS FURADOS NA HORIZONTAL DE 9X19X19CM (ESPESSURA 9CM) DE PAREDES COM ÁREA LÍQUIDA MAIOR OU IGUAL A 6M² COM VÃOS E ARGAMASSA DE ASSENTAMENTO COM PREPARO MANUAL. AF_06/2014","M2",3.03,null,null,0,"Referência: AGETOP - 100201"]
[3,3,3,2,1,7,5,0,0,8,2,"","Nível 3","Nível 3","-","SINAPI",null,"S. LEITURA","-",null,null,null,0,""]
["S",3,"S",0,1,7,5,0,0,0,0,"","Serviço","Serviço","-","SINAPI",87520,"ALVENARIA DE VEDAÇÃO DE BLOCOS CERÂMICOS FURADOS NA HORIZONTAL DE 9X19X19CM (ESPESSURA 9CM) DE PAREDES COM ÁREA LÍQUIDA MAIOR OU IGUAL A 6M² COM VÃOS E ARGAMASSA DE ASSENTAMENTO COM PREPARO MANUAL. AF_06/2014","M2",9.8000000000000007,null,null,0,"Referência: AGETOP - 100201"]
[3,3,3,2,1,7,6,0,0,6,2,"","Nível 3","Nível 3","-","SINAPI",null,"SANIT. FEMININO","-",null,null,null,0,""]
["S",3,"S",0,1,7,6,0,0,0,0,"","Serviço","Serviço","-","SINAPI",87520,"ALVENARIA DE VEDAÇÃO DE BLOCOS CERÂMICOS FURADOS NA HORIZONTAL DE 9X19X19CM (ESPESSURA 9CM) DE PAREDES COM ÁREA LÍQUIDA MAIOR OU IGUAL A 6M² COM VÃOS E ARGAMASSA DE ASSENTAMENTO COM PREPARO MANUAL. AF_06/2014","M2",8.91,null,null,0,"Referência: AGETOP - 100201"]
[3,3,3,2,1,7,7,0,0,4,2,"","Nível 3","Nível 3","-","SINAPI",null,"SANIT. MASCULINO","-",null,null,null,0,""]
["S",3,"S",0,1,7,7,0,0,0,0,"","Serviço","Serviço","-","SINAPI",87520,"ALVENARIA DE VEDAÇÃO DE BLOCOS CERÂMICOS FURADOS NA HORIZONTAL DE 9X19X19CM (ESPESSURA 9CM) DE PAREDES COM ÁREA LÍQUIDA MAIOR OU IGUAL A 6M² COM VÃOS E ARGAMASSA DE ASSENTAMENTO COM PREPARO MANUAL. AF_06/2014","M2",5.77,null,null,0,"Referência: AGETOP - 100201"]
[3,3,3,2,1,7,8,0,0,2,56,"","Nível 3","Nível 3","-","SINAPI",null,"ACESSIBILIDADE","-",null,null,null,0,""]
["S",3,"S",0,1,7,8,0,0,0,0,"","Serviço","Serviço","-","SINAPI",72132,"ALVENARIA EM TIJOLO CERAMICO MACICO 5X10X20CM 1/2 VEZ (ESPESSURA 10CM), ASSENTADO COM ARGAMASSA TRACO 1:2:8 (CIMENTO, CAL E AREIA)","M2",41.400000000000006,null,null,0,"Referência: AGETOP - 100102"]
[2,2,2,2,1,8,0,0,0,199,2,"","Nível 2","Nível 2","-","SINAPI",null,"ESTRUTURAS METÁLICAS","-",null,null,null,0,""]
["S",2,"S",0,1,8,0,0,0,0,0,"","Serviço","Serviço","-","AGETOP",150103,"ESTRUTURA METÁLICA CONVENCIONAL EM AÇO DO TIPO USI SAC-300 COM FUNDO ANTICORROSIVO","Kg    ",15644.56,null,null,0,""]
[2,2,2,5,1,9,0,0,0,197,5,"","Nível 2","Nível 2","-",null,null,"COBERTURAS","-",null,null,null,0,""]
["S",2,"S",0,1,9,0,0,0,0,0,"","Serviço","Serviço","-","SINAPI",94445,"TELHAMENTO COM TELHA CERÂMICA CAPA-CANAL, TIPO PLAN, COM ATÉ 2 ÁGUAS, INCLUSO TRANSPORTE VERTICAL. AF_07/2019","M2",448.67,null,null,0,"Referência: AGETOP - 160401"]
["S",2,"S",0,1,9,0,0,0,0,0,"","Serviço","Serviço","-","SINAPI",94221,"CUMEEIRA PARA TELHA CERÂMICA EMBOÇADA COM ARGAMASSA TRAÇO 1:2:9 (CIMENTO, CAL E AREIA) PARA TELHADOS COM ATÉ 2 ÁGUAS, INCLUSO TRANSPORTE VERTICAL. AF_07/2019","M",144.94,null,null,0,""]
["S",2,"S",0,1,9,0,0,0,0,0,"","Serviço","Serviço","-","SINAPI",94224,"EMBOÇAMENTO COM ARGAMASSA TRAÇO 1:2:9 (CIMENTO, CAL E AREIA). AF_07/2019","M",185.72,null,null,0,"Referência: AGETOP - 160403"]
["S",2,"S",0,1,9,0,0,0,0,0,"","Serviço","Serviço","-","AGETOP",160421,"MAO DE OBRA PARA COBERTURA C/TELHA COLONIAL PLAN","m2    ",897.34,null,null,0,""]
[2,{"$f":"IF(OR(C399=\"s\",C399=0),OFFSET(B399,-1,0),C399)","v":2},{"$f":"IF(OFFSET(C399,-1,0)=\"L\",1,IF(OFFSET(C399,-1,0)=1,2,IF(OR(A399=\"s\",A399=0),\"S\",IF(AND(OFFSET(C399,-1,0)=2,A399=4),3,IF(AND(OR(OFFSET(C399,-1,0)=\"s\",OFFSET(C399,-1,0)=0),A399<>\"s\",A399>OFFSET(B399,-1,0)),OFFSET(B399,-1,0),A399)))))","v":2},{"$f":"IF(OR(C399=\"S\",C399=0),0,IF(ISERROR(K399),J399,SMALL(J399:K399,1)))","v":17},{"$f":"IF($C399=1,OFFSET(E399,-1,0)+1,OFFSET(E399,-1,0))","v":1},{"$f":"IF($C399=1,0,IF($C399=2,OFFSET(F399,-1,0)+1,OFFSET(F399,-1,0)))","v":10},{"$f":"IF(AND($C399<=2,$C399<>0),0,IF($C399=3,OFFSET(G399,-1,0)+1,OFFSET(G399,-1,0)))","v":0},{"$f":"IF(AND($C399<=3,$C399<>0),0,IF($C399=4,OFFSET(H399,-1,0)+1,OFFSET(H399,-1,0)))","v":0},0,192,17,"","Nível 2","Nível 2","-","SINAPI",null,"ESQUADRIAS METÁLICAS","-",null,null,null,0,""]
[3,3,3,3,1,10,1,0,0,16,3,"","Nível 3","Nível 3","-","SINAPI",null,"SECRETARIA","-",null,null,null,0,""]
["S",3,"S",0,1,10,1,0,0,0,0,"","Serviço","Serviço","-","SINAPI","74136/3","PORTA DE ACO CHAPA 24, DE ENROLAR, RAIADA, LARGA COM ACABAMENTO GALVANIZADO NATURAL","M2",3,null,null,0,"Referência: AGETOP - 180303"]
["S",3,"S",0,1,10,1,0,0,0,0,"","Serviço","Serviço","-","SINAPI","73933/4","PORTA DE FERRO DE ABRIR TIPO BARRA CHATA, COM REQUADRO E GUARNICAO COMPLETA","M2",1.68,null,null,0,"Referência: AGETOP - 180501"]
[3,3,3,2,1,10,2,0,0,{"$f":"IF(OR($C403=\"S\",$C403=0),0,MATCH(0,OFFSET($D403,1,$C403,ROW($C$1047)-ROW($C403)),0))","v":13},{"$f":"IF(OR($C403=\"S\",$C403=0),0,MATCH(OFFSET($D403,0,$C403)+1,OFFSET($D403,1,$C403,ROW($C$1047)-ROW($C403)),0))","v":2},"","Nível 3","Nível 3","-","SINAPI",null,"SALA DO PROFESSOR","-",null,null,null,0,""]
["S",3,"S",0,1,10,2,0,0,0,0,"","Serviço","Serviço","-","SINAPI","73933/4","PORTA DE FERRO DE ABRIR TIPO BARRA CHATA, COM REQUADRO E GUARNICAO COMPLETA","M2",1.68,null,null,0,"Referência: AGETOP - 180501"]
[3,3,3,2,1,10,3,0,0,11,2,"","Nível 3","Nível 3","-","SINAPI",null,"COORDENAÇÃO","-",null,null,null,0,""]
[{"$f":"CHOOSE(1+LOG(1+2*(ORÇAMENTO.Nivel=\"Nível 1\")+4*(ORÇAMENTO.Nivel=\"Nível 2\")+8*(ORÇAMENTO.Nivel=\"Nível 3\")+16*(ORÇAMENTO.Nivel=\"Nível 4\")+32*(ORÇAMENTO.Nivel=\"Serviço\"),2),0,1,2,3,4,\"S\")","v":"S"},3,"S",0,1,10,3,0,{"$f":"IF(AND($C406<=4,$C406<>0),0,IF(AND($C406=\"S\",$W406>0),OFFSET(I406,-1,0)+1,OFFSET(I406,-1,0)))","v":0},0,0,"","Serviço","Serviço","-","SINAPI","73933/4","PORTA DE FERRO DE ABRIR TIPO BARRA CHATA, COM REQUADRO E GUARNICAO COMPLETA","M2",1.68,null,null,0,"Referência: AGETOP - 180501"]
[3,3,3,2,1,10,4,0,0,9,2,"","Nível 3","Nível 3","-","SINAPI",null,"BIBLIOTECA","-",null,null,null,0,""]
["S",3,"S",0,1,10,4,0,0,0,0,"","Serviço","Serviço","-","SINAPI","73933/4","PORTA DE FERRO DE ABRIR TIPO BARRA CHATA, COM REQUADRO E GUARNICAO COMPLETA","M2",4.2,null,null,0,"Referência: AGETOP - 180501"]
[3,3,3,3,1,10,5,0,0,7,3,"","Nível 3","Nível 3","-","SINAPI",null,"S. LEITURA","-",null,null,null,0,""]
["S",3,"S",0,1,10,5,0,0,0,0,"","Serviço","Serviço","-","SINAPI","73933/4","PORTA DE FERRO DE ABRIR TIPO BARRA CHATA, COM REQUADRO E GUARNICAO COMPLETA","M2",1.68,null,null,0,"Referência: AGETOP - 180501"]
["S",3,"S",0,1,10,5,0,0,0,0,"","Serviço","Serviço","-","AGETOP",180507,"PORTA DE CORRER C/BASCULA PF-7/PF-8 C/ FERRAGENS","m2    ",4.2,null,null,0,""]
[3,3,3,2,1,10,6,0,0,4,2,"","Nível 3","Nível 3","-","SINAPI",null,"SANIT. FEMININO","-",null,null,null,0,""]
["S",3,"S",0,1,10,6,0,0,0,0,"","Serviço","Serviço","-","SINAPI","73933/4","PORTA DE FERRO DE ABRIR TIPO BARRA CHATA, COM REQUADRO E GUARNICAO COMPLETA","M2",3.6,null,null,0,"Referência: AGETOP - 180501"]
[3,3,3,2,1,10,7,0,0,2,28,"","Nível 3","Nível 3","-","SINAPI",null,"SANIT. MASCULINO","-",null,null,null,0,""]
["S",3,"S",0,1,10,7,0,0,0,0,"","Serviço","Serviço","-","SINAPI","73933/4","PORTA DE FERRO DE ABRIR TIPO BARRA CHATA, COM REQUADRO E GUARNICAO COMPLETA","M2",3.6,null,null,0,"Referência: AGETOP - 180501"]
[2,2,2,36,1,11,0,0,0,175,36,"","Nível 2","Nível 2","-","SINAPI",null,"REVESTIMENTO DE PAREDE","-",null,null,null,0,""]
[3,{"$f":"IF(OR(C417=\"s\",C417=0),OFFSET(B417,-1,0),C417)","v":3},{"$f":"IF(OFFSET(C417,-1,0)=\"L\",1,IF(OFFSET(C417,-1,0)=1,2,IF(OR(A417=\"s\",A417=0),\"S\",IF(AND(OFFSET(C417,-1,0)=2,A417=4),3,IF(AND(OR(OFFSET(C417,-1,0)=\"s\",OFFSET(C417,-1,0)=0),A417<>\"s\",A417>OFFSET(B417,-1,0)),OFFSET(B417,-1,0),A417)))))","v":3},{"$f":"IF(OR(C417=\"S\",C417=0),0,IF(ISERROR(K417),J417,SMALL(J417:K417,1)))","v":3},{"$f":"IF($C417=1,OFFSET(E417,-1,0)+1,OFFSET(E417,-1,0))","v":1},{"$f":"IF($C417=1,0,IF($C417=2,OFFSET(F417,-1,0)+1,OFFSET(F417,-1,0)))","v":11},{"$f":"IF(AND($C417<=2,$C417<>0),0,IF($C417=3,OFFSET(G417,-1,0)+1,OFFSET(G417,-1,0)))","v":1},{"$f":"IF(AND($C417<=3,$C417<>0),0,IF($C417=4,OFFSET(H417,-1,0)+1,OFFSET(H417,-1,0)))","v":0},0,35,3,"","Nível 3","Nível 3","-","SINAPI",null,"SECRETARIA","-",null,null,null,0,""]
[{"$f":"CHOOSE(1+LOG(1+2*(ORÇAMENTO.Nivel=\"Nível 1\")+4*(ORÇAMENTO.Nivel=\"Nível 2\")+8*(ORÇAMENTO.Nivel=\"Nível 3\")+16*(ORÇAMENTO.Nivel=\"Nível 4\")+32*(ORÇAMENTO.Nivel=\"Serviço\"),2),0,1,2,3,4,\"S\")","v":"S"},3,"S",0,1,11,1,0,{"$f":"IF(AND($C418<=4,$C418<>0),0,IF(AND($C418=\"S\",$W418>0),OFFSET(I418,-1,0)+1,OFFSET(I418,-1,0)))","v":0},0,0,"","Serviço","Serviço","-","SINAPI",87904,"CHAPISCO APLICADO EM ALVENARIA (COM PRESENÇA DE VÃOS) E ESTRUTURAS DE CONCRETO DE FACHADA, COM COLHER DE PEDREIRO.  ARGAMASSA TRAÇO 1:3 COM PREPARO MANUAL. AF_06/2014","M2",1.95,null,null,0,"Referência: AGETOP - 200101"]
["S",3,"S",0,1,11,1,0,0,0,0,"","Serviço","Serviço","-","SINAPI",87547,"MASSA ÚNICA, PARA RECEBIMENTO DE PINTURA, EM ARGAMASSA TRAÇO 1:2:8, PREPARO MECÂNICO COM BETONEIRA 400L, APLICADA MANUALMENTE EM FACES INTERNAS DE PAREDES, ESPESSURA DE 10MM, COM EXECUÇÃO DE TALISCAS. AF_06/2014","M2",1.95,null,null,0,""]
[3,3,3,3,1,11,2,0,0,32,3,"","Nível 3","Nível 3","-","SINAPI",null,"DEPÓSITO 2","-",null,null,null,0,""]
["S",3,"S",0,1,11,2,0,0,0,0,"","Serviço","Serviço","-","SINAPI",87904,"CHAPISCO APLICADO EM ALVENARIA (COM PRESENÇA DE VÃOS) E ESTRUTURAS DE CONCRETO DE FACHADA, COM COLHER DE PEDREIRO.  ARGAMASSA TRAÇO 1:3 COM PREPARO MANUAL. AF_06/2014","M2",4.2,null,null,0,"Referência: AGETOP - 200101"]
["S",3,"S",0,1,11,2,0,0,0,0,"","Serviço","Serviço","-","SINAPI",87547,"MASSA ÚNICA, PARA RECEBIMENTO DE PINTURA, EM ARGAMASSA TRAÇO 1:2:8, PREPARO MECÂNICO COM BETONEIRA 400L, APLICADA MANUALMENTE EM FACES INTERNAS DE PAREDES, ESPESSURA DE 10MM, COM EXECUÇÃO DE TALISCAS. AF_06/2014","M2",4.2,null,null,0,""]
[3,3,3,4,1,11,3,0,0,29,4,"","Nível 3","Nível 3","-","SINAPI",null,"ÁREA DE SERVIÇO","-",null,null,null,0,""]
["S",3,"S",0,1,11,3,0,0,0,0,"","Serviço","Serviço","-","SINAPI",87553,"EMBOÇO, PARA RECEBIMENTO DE CERÂMICA, EM ARGAMASSA TRAÇO 1:2:8, PREPARO MECÂNICO COM BETONEIRA 400L, APLICADO MANUALMENTE EM FACES INTERNAS DE PAREDES, PARA AMBIENTE COM ÁREA MAIOR QUE 10M2, ESPESSURA DE 10MM, COM EXECUÇÃO DE TALISCAS. AF_06/2014","M2",28.55,null,null,0,""]
["S",3,"S",0,1,11,3,0,0,0,0,"","Serviço","Serviço","-","SINAPI",87904,"CHAPISCO APLICADO EM ALVENARIA (COM PRESENÇA DE VÃOS) E ESTRUTURAS DE CONCRETO DE FACHADA, COM COLHER DE PEDREIRO.  ARGAMASSA TRAÇO 1:3 COM PREPARO MANUAL. AF_06/2014","M2",6.15,null,null,0,"Referência: AGETOP - 200101"]
["S",3,"S",0,1,11,3,0,0,0,0,"","Serviço","Serviço","-","SINAPI",87273,"REVESTIMENTO CERÂMICO PARA PAREDES INTERNAS COM PLACAS TIPO ESMALTADA EXTRA DE DIMENSÕES 33X45 CM APLICADAS EM AMBIENTES DE ÁREA MAIOR QUE 5 M² NA ALTURA INTEIRA DAS PAREDES. AF_06/2014","M2",28.55,null,null,0,""]
[3,3,3,5,1,11,4,0,0,25,5,"","Nível 3","Nível 3","-","SINAPI",null,"SALA DO PROFESSOR","-",null,null,null,0,""]
["S",3,"S",0,1,11,4,0,0,0,0,"","Serviço","Serviço","-","SINAPI",87553,"EMBOÇO, PARA RECEBIMENTO DE CERÂMICA, EM ARGAMASSA TRAÇO 1:2:8, PREPARO MECÂNICO COM BETONEIRA 400L, APLICADO MANUALMENTE EM FACES INTERNAS DE PAREDES, PARA AMBIENTE COM ÁREA MAIOR QUE 10M2, ESPESSURA DE 10MM, COM EXECUÇÃO DE TALISCAS. AF_06/2014","M2",13.5,null,null,0,""]
["S",3,"S",0,1,11,4,0,0,0,0,"","Serviço","Serviço","-","SINAPI",87904,"CHAPISCO APLICADO EM ALVENARIA (COM PRESENÇA DE VÃOS) E ESTRUTURAS DE CONCRETO DE FACHADA, COM COLHER DE PEDREIRO.  ARGAMASSA TRAÇO 1:3 COM PREPARO MANUAL. AF_06/2014","M2",10.38,null,null,0,"Referência: AGETOP - 200101"]
["S",3,"S",0,1,11,4,0,0,0,0,"","Serviço","Serviço","-","SINAPI",87547,"MASSA ÚNICA, PARA RECEBIMENTO DE PINTURA, EM ARGAMASSA TRAÇO 1:2:8, PREPARO MECÂNICO COM BETONEIRA 400L, APLICADA MANUALMENTE EM FACES INTERNAS DE PAREDES, ESPESSURA DE 10MM, COM EXECUÇÃO DE TALISCAS. AF_06/2014","M2",10.38,null,null,0,""]
["S",3,"S",0,1,11,4,0,0,0,0,"","Serviço","Serviço","-","SINAPI",87273,"REVESTIMENTO CERÂMICO PARA PAREDES INTERNAS COM PLACAS TIPO ESMALTADA EXTRA DE DIMENSÕES 33X45 CM APLICADAS EM AMBIENTES DE ÁREA MAIOR QUE 5 M² NA ALTURA INTEIRA DAS PAREDES. AF_06/2014","M2",13.5,null,null,0,""]
[3,3,3,3,1,11,5,0,0,20,3,"","Nível 3","Nível 3","-","SINAPI",null,"COORDENAÇÃO","-",null,null,null,0,""]
["S",3,"S",0,1,11,5,0,0,0,0,"","Serviço","Serviço","-","SINAPI",87904,"CHAPISCO APLICADO EM ALVENARIA (COM PRESENÇA DE VÃOS) E ESTRUTURAS DE CONCRETO DE FACHADA, COM COLHER DE PEDREIRO.  ARGAMASSA TRAÇO 1:3 COM PREPARO MANUAL. AF_06/2014","M2",3.03,null,null,0,"Referência: AGETOP - 200101"]
["S",3,"S",0,1,11,5,0,0,0,0,"","Serviço","Serviço","-","SINAPI",87547,"MASSA ÚNICA, PARA RECEBIMENTO DE PINTURA, EM ARGAMASSA TRAÇO 1:2:8, PREPARO MECÂNICO COM BETONEIRA 400L, APLICADA MANUALMENTE EM FACES INTERNAS DE PAREDES, ESPESSURA DE 10MM, COM EXECUÇÃO DE TALISCAS. AF_06/2014","M2",3.03,null,null,0,""]
[3,3,3,3,1,11,6,0,0,17,3,"","Nível 3","Nível 3","-","SINAPI",null,"S. LEITURA","-",null,null,null,0,""]
["S",3,"S",0,1,11,6,0,0,0,0,"","Serviço","Serviço","-","SINAPI",87904,"CHAPISCO APLICADO EM ALVENARIA (COM PRESENÇA DE VÃOS) E ESTRUTURAS DE CONCRETO DE FACHADA, COM COLHER DE PEDREIRO.  ARGAMASSA TRAÇO 1:3 COM PREPARO MANUAL. AF_06/2014","M2",9.8000000000000007,null,null,0,"Referência: AGETOP - 200101"]
["S",3,"S",0,1,11,6,0,0,0,0,"","Serviço","Serviço","-","SINAPI",87547,"MASSA ÚNICA, PARA RECEBIMENTO DE PINTURA, EM ARGAMASSA TRAÇO 1:2:8, PREPARO MECÂNICO COM BETONEIRA 400L, APLICADA MANUALMENTE EM FACES INTERNAS DE PAREDES, ESPESSURA DE 10MM, COM EXECUÇÃO DE TALISCAS. AF_06/2014","M2",9.8000000000000007,null,null,0,""]
[3,3,3,4,1,11,7,0,0,14,4,"","Nível 3","Nível 3","-","SINAPI",null,"SANIT. FEMININO","-",null,null,null,0,""]
["S",3,"S",0,1,11,7,0,0,0,0,"","Serviço","Serviço","-","SINAPI",87904,"CHAPISCO APLICADO EM ALVENARIA (COM PRESENÇA DE VÃOS) E ESTRUTURAS DE CONCRETO DE FACHADA, COM COLHER DE PEDREIRO.  ARGAMASSA TRAÇO 1:3 COM PREPARO MANUAL. AF_06/2014","M2",17.55,null,null,0,"Referência: AGETOP - 200101"]
["S",3,"S",0,1,11,7,0,0,0,0,"","Serviço","Serviço","-","SINAPI",87553,"EMBOÇO, PARA RECEBIMENTO DE CERÂMICA, EM ARGAMASSA TRAÇO 1:2:8, PREPARO MECÂNICO COM BETONEIRA 400L, APLICADO MANUALMENTE EM FACES INTERNAS DE PAREDES, PARA AMBIENTE COM ÁREA MAIOR QUE 10M2, ESPESSURA DE 10MM, COM EXECUÇÃO DE TALISCAS. AF_06/2014","M2",17.55,null,null,0,""]
["S",3,"S",0,1,11,7,0,0,0,0,"","Serviço","Serviço","-","SINAPI",87273,"REVESTIMENTO CERÂMICO PARA PAREDES INTERNAS COM PLACAS TIPO ESMALTADA EXTRA DE DIMENSÕES 33X45 CM APLICADAS EM AMBIENTES DE ÁREA MAIOR QUE 5 M² NA ALTURA INTEIRA DAS PAREDES. AF_06/2014","M2",102.25,null,null,0,""]
[3,3,3,4,1,11,8,0,0,10,4,"","Nível 3","Nível 3","-","SINAPI",null,"SANIT. MASCULINO","-",null,null,null,0,""]
["S",3,"S",0,1,11,8,0,0,0,0,"","Serviço","Serviço","-","SINAPI",87904,"CHAPISCO APLICADO EM ALVENARIA (COM PRESENÇA DE VÃOS) E ESTRUTURAS DE CONCRETO DE FACHADA, COM COLHER DE PEDREIRO.  ARGAMASSA TRAÇO 1:3 COM PREPARO MANUAL. AF_06/2014","M2",11.54,null,null,0,"Referência: AGETOP - 200101"]
["S",3,"S",0,1,11,8,0,0,0,0,"","Serviço","Serviço","-","SINAPI",87553,"EMBOÇO, PARA RECEBIMENTO DE CERÂMICA, EM ARGAMASSA TRAÇO 1:2:8, PREPARO MECÂNICO COM BETONEIRA 400L, APLICADO MANUALMENTE EM FACES INTERNAS DE PAREDES, PARA AMBIENTE COM ÁREA MAIOR QUE 10M2, ESPESSURA DE 10MM, COM EXECUÇÃO DE TALISCAS. AF_06/2014","M2",11.54,null,null,0,""]
["S",3,"S",0,1,11,8,0,0,0,0,"","Serviço","Serviço","-","SINAPI",87273,"REVESTIMENTO CERÂMICO PARA PAREDES INTERNAS COM PLACAS TIPO ESMALTADA EXTRA DE DIMENSÕES 33X45 CM APLICADAS EM AMBIENTES DE ÁREA MAIOR QUE 5 M² NA ALTURA INTEIRA DAS PAREDES. AF_06/2014","M2",106.25,null,null,0,""]
[3,3,3,3,1,11,9,0,0,6,3,"","Nível 3","Nível 3","-","SINAPI",null,"ACESSIBILIDADE","-",null,null,null,0,""]
["S",3,"S",0,1,11,9,0,0,0,0,"","Serviço","Serviço","-","SINAPI",87904,"CHAPISCO APLICADO EM ALVENARIA (COM PRESENÇA DE VÃOS) E ESTRUTURAS DE CONCRETO DE FACHADA, COM COLHER DE PEDREIRO.  ARGAMASSA TRAÇO 1:3 COM PREPARO MANUAL. AF_06/2014","M2",20.700000000000003,null,null,0,"Referência: AGETOP - 200101"]
["S",3,"S",0,1,11,9,0,0,0,0,"","Serviço","Serviço","-","SINAPI",87547,"MASSA ÚNICA, PARA RECEBIMENTO DE PINTURA, EM ARGAMASSA TRAÇO 1:2:8, PREPARO MECÂNICO COM BETONEIRA 400L, APLICADA MANUALMENTE EM FACES INTERNAS DE PAREDES, ESPESSURA DE 10MM, COM EXECUÇÃO DE TALISCAS. AF_06/2014","M2",20.700000000000003,null,null,0,""]
[3,3,3,3,1,11,10,0,0,3,78,"","Nível 3","Nível 3","-","SINAPI",null,"OUTROS","-",null,null,null,0,""]
["S",3,"S",0,1,11,10,0,0,0,0,"","Serviço","Serviço","-","SINAPI",87904,"CHAPISCO APLICADO EM ALVENARIA (COM PRESENÇA DE VÃOS) E ESTRUTURAS DE CONCRETO DE FACHADA, COM COLHER DE PEDREIRO.  ARGAMASSA TRAÇO 1:3 COM PREPARO MANUAL. AF_06/2014","M2",23.68,null,null,0,"Referência: AGETOP - 200101"]
["S",3,"S",0,1,11,10,0,0,0,0,"","Serviço","Serviço","-","SINAPI",87547,"MASSA ÚNICA, PARA RECEBIMENTO DE PINTURA, EM ARGAMASSA TRAÇO 1:2:8, PREPARO MECÂNICO COM BETONEIRA 400L, APLICADA MANUALMENTE EM FACES INTERNAS DE PAREDES, ESPESSURA DE 10MM, COM EXECUÇÃO DE TALISCAS. AF_06/2014","M2",23.68,null,null,0,""]
[2,2,2,8,1,12,0,0,0,139,8,"","Nível 2","Nível 2","-","SINAPI",null,"REVESTIMENTO DE PISO","-",null,null,null,0,""]
[3,3,3,3,1,12,1,0,0,7,3,"","Nível 3","Nível 3","-","SINAPI",null,"S. LEITURA","-",null,null,null,0,""]
["S",3,"S",0,1,12,1,0,0,0,0,"","Serviço","Serviço","-","SINAPI",84191,"PISO EM GRANILITE, MARMORITE OU GRANITINA ESPESSURA 8 MM, INCLUSO JUNTAS DE DILATACAO PLASTICAS","M2",67.72,null,null,0,"Referência: AGETOP - 221101"]
["S",3,"S",0,1,12,1,0,0,0,0,"","Serviço","Serviço","-","AGETOP",221104,"RASPAGEM E APLICAÇÃO RESINA ACRÍLICA DUAS DEMÃOS","m2    ",67.72,null,null,0,""]
[3,3,3,4,1,12,2,0,0,4,29,"","Nível 3","Nível 3","-","SINAPI",null,"ACESSIBILIDADE","-",null,null,null,0,""]
["S",3,"S",0,1,12,2,0,0,0,0,"","Serviço","Serviço","-","AGETOP",220102,"PISO CONCRETO DESEMPENADO ESPESSURA = 5 CM  1:2,5:3,5","m2    ",39.150000000000006,null,null,0,""]
["S",3,"S",0,1,12,2,0,0,0,0,"","Serviço","Serviço","-","SINAPI",72183,"PISO EM CONCRETO 20MPA PREPARO MECANICO, ESPESSURA 7 CM, COM ARMACAO EM TELA SOLDADA","M2",216.97,null,null,0,""]
["S",3,"S",0,1,12,2,0,0,0,0,"","Serviço","Serviço","-","AGETOP",221126,"PISO DE LADRILHO HIDRÁULICO COLORIDO MODELO TÁTIL ( ALERTA OU DIRECIONAL) SEM LASTRO","m2    ",99.11,null,null,0,""]
[2,2,2,7,1,13,0,0,0,131,7,"","Nível 2","Nível 2","-","SINAPI",null,"FERRAGENS","-",null,null,null,0,""]
[3,3,3,3,1,13,1,0,0,6,3,"","Nível 3","Nível 3","-","SINAPI",null,"SANIT. FEMININO","-",null,null,null,0,""]
["S",3,"S",0,1,13,1,0,0,0,0,"","Serviço","Serviço","-","AGETOP",230174,"BARRA DE APOIO EM AÇO INOX - 40 CM","un    ",3,null,null,0,""]
["S",3,"S",0,1,13,1,0,0,0,0,"","Serviço","Serviço","-","AGETOP",230176,"BARRA DE APOIO EM AÇO INOX - 80 CM ","un    ",3,null,null,0,""]
[3,3,3,3,1,13,2,0,0,3,21,"","Nível 3","Nível 3","-","SINAPI",null,"SANIT. MASCULINO","-",null,null,null,0,""]
["S",3,"S",0,1,13,2,0,0,0,0,"","Serviço","Serviço","-","AGETOP",230174,"BARRA DE APOIO EM AÇO INOX - 40 CM","un    ",3,null,null,0,""]
["S",3,"S",0,1,13,2,0,0,0,0,"","Serviço","Serviço","-","AGETOP",230176,"BARRA DE APOIO EM AÇO INOX - 80 CM ","un    ",3,null,null,0,""]
[{"$f":"CHOOSE(1+LOG(1+2*(ORÇAMENTO.Nivel=\"Nível 1\")+4*(ORÇAMENTO.Nivel=\"Nível 2\")+8*(ORÇAMENTO.Nivel=\"Nível 3\")+16*(ORÇAMENTO.Nivel=\"Nível 4\")+32*(ORÇAMENTO.Nivel=\"Serviço\"),2),0,1,2,3,4,\"S\")","v":2},{"$f":"IF(OR(C467=\"s\",C467=0),OFFSET(B467,-1,0),C467)","v":2},{"$f":"IF(OFFSET(C467,-1,0)=\"L\",1,IF(OFFSET(C467,-1,0)=1,2,IF(OR(A467=\"s\",A467=0),\"S\",IF(AND(OFFSET(C467,-1,0)=2,A467=4),3,IF(AND(OR(OFFSET(C467,-1,0)=\"s\",OFFSET(C467,-1,0)=0),A467<>\"s\",A467>OFFSET(B467,-1,0)),OFFSET(B467,-1,0),A467)))))","v":2},{"$f":"IF(OR(C467=\"S\",C467=0),0,IF(ISERROR(K467),J467,SMALL(J467:K467,1)))","v":6},{"$f":"IF($C467=1,OFFSET(E467,-1,0)+1,OFFSET(E467,-1,0))","v":1},{"$f":"IF($C467=1,0,IF($C467=2,OFFSET(F467,-1,0)+1,OFFSET(F467,-1,0)))","v":14},{"$f":"IF(AND($C467<=2,$C467<>0),0,IF($C467=3,OFFSET(G467,-1,0)+1,OFFSET(G467,-1,0)))","v":0},{"$f":"IF(AND($C467<=3,$C467<>0),0,IF($C467=4,OFFSET(H467,-1,0)+1,OFFSET(H467,-1,0)))","v":0},{"$f":"IF(AND($C467<=4,$C467<>0),0,IF(AND($C467=\"S\",$W467>0),OFFSET(I467,-1,0)+1,OFFSET(I467,-1,0)))","v":0},{"$f":"IF(OR($C467=\"S\",$C467=0),0,MATCH(0,OFFSET($D467,1,$C467,ROW($C$1047)-ROW($C467)),0))","v":124},{"$f":"IF(OR($C467=\"S\",$C467=0),0,MATCH(OFFSET($D467,0,$C467)+1,OFFSET($D467,1,$C467,ROW($C$1047)-ROW($C467)),0))","v":6},"","Nível 2","Nível 2","-","SINAPI",null,"ADMINISTRAÇÃO","-",null,null,null,0,""]
[3,3,3,3,1,14,1,0,0,5,3,"","Nível 3","Nível 3","-","SINAPI",null,"MENSALISTAS","-",null,null,null,0,""]
["S",3,"S",0,1,14,1,0,0,0,0,"","Serviço","Serviço","-","SINAPI",90778,"ENGENHEIRO CIVIL DE OBRA PLENO COM ENCARGOS COMPLEMENTARES","H",1100,null,null,0,"Referência: AGETOP - 250101"]
["S",3,"S",0,1,14,1,0,0,0,0,"","Serviço","Serviço","-","SINAPI",90776,"ENCARREGADO GERAL COM ENCARGOS COMPLEMENTARES","H",1100,null,null,0,"Referência: AGETOP - 250103"]
[3,3,3,2,1,14,2,0,0,2,14,"","Nível 3","Nível 3","-",null,null,"LAUDO DE ESTANQUEIDADE","-",null,null,null,0,""]
["S",3,"S",0,1,14,2,0,0,0,0,"","Serviço","Serviço","-","SINAPI",90778,"ENGENHEIRO CIVIL DE OBRA PLENO COM ENCARGOS COMPLEMENTARES","H",16,null,null,0,"Referência: AGETOP - 250101"]
[2,2,2,108,1,15,0,0,0,118,108,"","Nível 2","Nível 2","-","SINAPI",null,"PINTURA","-",null,null,null,0,""]
[3,3,3,6,1,15,1,0,0,107,6,"","Nível 3","Nível 3","-","SINAPI",null,"SECRETARIA","-",null,null,null,0,""]
["S",3,"S",0,1,15,1,0,0,0,0,"","Serviço","Serviço","-","AGETOP",260105,"REMOCAO DE PINTURA ANTIGA A OLEO OU ESMALTE","m2    ",36.99,null,null,0,""]
[{"$f":"CHOOSE(1+LOG(1+2*(ORÇAMENTO.Nivel=\"Nível 1\")+4*(ORÇAMENTO.Nivel=\"Nível 2\")+8*(ORÇAMENTO.Nivel=\"Nível 3\")+16*(ORÇAMENTO.Nivel=\"Nível 4\")+32*(ORÇAMENTO.Nivel=\"Serviço\"),2),0,1,2,3,4,\"S\")","v":"S"},{"$f":"IF(OR(C476=\"s\",C476=0),OFFSET(B476,-1,0),C476)","v":3},{"$f":"IF(OFFSET(C476,-1,0)=\"L\",1,IF(OFFSET(C476,-1,0)=1,2,IF(OR(A476=\"s\",A476=0),\"S\",IF(AND(OFFSET(C476,-1,0)=2,A476=4),3,IF(AND(OR(OFFSET(C476,-1,0)=\"s\",OFFSET(C476,-1,0)=0),A476<>\"s\",A476>OFFSET(B476,-1,0)),OFFSET(B476,-1,0),A476)))))","v":"S"},{"$f":"IF(OR(C476=\"S\",C476=0),0,IF(ISERROR(K476),J476,SMALL(J476:K476,1)))","v":0},{"$f":"IF($C476=1,OFFSET(E476,-1,0)+1,OFFSET(E476,-1,0))","v":1},{"$f":"IF($C476=1,0,IF($C476=2,OFFSET(F476,-1,0)+1,OFFSET(F476,-1,0)))","v":15},{"$f":"IF(AND($C476<=2,$C476<>0),0,IF($C476=3,OFFSET(G476,-1,0)+1,OFFSET(G476,-1,0)))","v":1},{"$f":"IF(AND($C476<=3,$C476<>0),0,IF($C476=4,OFFSET(H476,-1,0)+1,OFFSET(H476,-1,0)))","v":0},{"$f":"IF(AND($C476<=4,$C476<>0),0,IF(AND($C476=\"S\",$W476>0),OFFSET(I476,-1,0)+1,OFFSET(I476,-1,0)))","v":0},0,0,"","Serviço","Serviço","-","SINAPI",88497,"APLICAÇÃO E LIXAMENTO DE MASSA LÁTEX EM PAREDES, DUAS DEMÃOS. AF_06/2014","M2",36.99,null,null,0,"Referência: AGETOP - 261300"]
["S",3,"S",0,1,15,1,0,0,0,0,"","Serviço","Serviço","-","AGETOP",261550,"PINT.ESMALTE SINT.PAREDES - 2 DEM.C/SELADOR","m2    ",36.99,null,null,0,""]
["S",3,"S",0,1,15,1,0,0,0,0,"","Serviço","Serviço","-","SINAPI",88489,"APLICAÇÃO MANUAL DE PINTURA COM TINTA LÁTEX ACRÍLICA EM PAREDES, DUAS DEMÃOS. AF_06/2014","M2",44.83,null,null,0,"Referência: AGETOP - 261001"]
["S",3,"S",0,1,15,1,0,0,0,0,"","Serviço","Serviço","-","SINAPI","74145/1","PINTURA ESMALTE FOSCO, DUAS DEMAOS, SOBRE SUPERFICIE METALICA, INCLUSO UMA DEMAO DE FUNDO ANTICORROSIVO. UTILIZACAO DE REVOLVER ( AR-COMPRIMIDO).","M2",9.36,null,null,0,"Referência: AGETOP - 261602"]
[3,3,3,5,1,15,2,0,0,101,5,"","Nível 3","Nível 3","-","SINAPI",null,"DEPÓSITO 1","-",null,null,null,0,""]
["S",3,"S",0,1,15,2,0,0,0,0,"","Serviço","Serviço","-","AGETOP",260105,"REMOCAO DE PINTURA ANTIGA A OLEO OU ESMALTE","m2    ",11.61,null,null,0,""]
["S",3,"S",0,1,15,2,0,0,0,0,"","Serviço","Serviço","-","SINAPI",88497,"APLICAÇÃO E LIXAMENTO DE MASSA LÁTEX EM PAREDES, DUAS DEMÃOS. AF_06/2014","M2",11.61,null,null,0,"Referência: AGETOP - 261300"]
["S",3,"S",0,1,15,2,0,0,0,0,"","Serviço","Serviço","-","AGETOP",261550,"PINT.ESMALTE SINT.PAREDES - 2 DEM.C/SELADOR","m2    ",11.61,null,null,0,""]
["S",3,"S",0,1,15,2,0,0,0,0,"","Serviço","Serviço","-","SINAPI",88489,"APLICAÇÃO MANUAL DE PINTURA COM TINTA LÁTEX ACRÍLICA EM PAREDES, DUAS DEMÃOS. AF_06/2014","M2",20.13,null,null,0,"Referência: AGETOP - 261001"]
[3,3,3,5,1,15,3,0,0,96,5,"","Nível 3","Nível 3","-","SINAPI",null,"DEPÓSITO 2","-",null,null,null,0,""]
["S",3,"S",0,1,15,3,0,0,0,0,"","Serviço","Serviço","-","AGETOP",260105,"REMOCAO DE PINTURA ANTIGA A OLEO OU ESMALTE","m2    ",4.8600000000000003,null,null,0,""]
["S",3,"S",0,1,15,3,0,0,0,0,"","Serviço","Serviço","-","SINAPI",88497,"APLICAÇÃO E LIXAMENTO DE MASSA LÁTEX EM PAREDES, DUAS DEMÃOS. AF_06/2014","M2",4.8600000000000003,null,null,0,"Referência: AGETOP - 261300"]
["S",3,"S",0,1,15,3,0,0,0,0,"","Serviço","Serviço","-","AGETOP",261550,"PINT.ESMALTE SINT.PAREDES - 2 DEM.C/SELADOR","m2    ",16.2,null,null,0,""]
["S",3,"S",0,1,15,3,0,0,0,0,"","Serviço","Serviço","-","SINAPI",88489,"APLICAÇÃO MANUAL DE PINTURA COM TINTA LÁTEX ACRÍLICA EM PAREDES, DUAS DEMÃOS. AF_06/2014","M2",16.2,null,null,0,"Referência: AGETOP - 261001"]
[3,3,3,5,1,15,4,0,0,91,5,"","Nível 3","Nível 3","-","SINAPI",null,"DEPÓSITO 3","-",null,null,null,0,""]
["S",3,"S",0,1,15,4,0,0,0,0,"","Serviço","Serviço","-","AGETOP",260105,"REMOCAO DE PINTURA ANTIGA A OLEO OU ESMALTE","m2    ",17.809999999999999,null,null,0,""]
["S",3,"S",0,1,15,4,0,0,0,0,"","Serviço","Serviço","-","SINAPI",88497,"APLICAÇÃO E LIXAMENTO DE MASSA LÁTEX EM PAREDES, DUAS DEMÃOS. AF_06/2014","M2",17.809999999999999,null,null,0,"Referência: AGETOP - 261300"]
["S",3,"S",0,1,15,4,0,0,0,0,"","Serviço","Serviço","-","AGETOP",261550,"PINT.ESMALTE SINT.PAREDES - 2 DEM.C/SELADOR","m2    ",17.809999999999999,null,null,0,""]
["S",3,"S",0,1,15,4,0,0,0,0,"","Serviço","Serviço","-","SINAPI",88489,"APLICAÇÃO MANUAL DE PINTURA COM TINTA LÁTEX ACRÍLICA EM PAREDES, DUAS DEMÃOS. AF_06/2014","M2",21.59,null,null,0,"Referência: AGETOP - 261001"]
[3,3,3,5,1,15,5,0,0,86,5,"","Nível 3","Nível 3","-","SINAPI",null,"DEPÓSITO 4","-",null,null,null,0,""]
["S",3,"S",0,1,15,5,0,0,0,0,"","Serviço","Serviço","-","AGETOP",260105,"REMOCAO DE PINTURA ANTIGA A OLEO OU ESMALTE","m2    ",14.54,null,null,0,""]
["S",3,"S",0,1,15,5,0,0,0,0,"","Serviço","Serviço","-","SINAPI",88497,"APLICAÇÃO E LIXAMENTO DE MASSA LÁTEX EM PAREDES, DUAS DEMÃOS. AF_06/2014","M2",14.54,null,null,0,"Referência: AGETOP - 261300"]
["S",3,"S",0,1,15,5,0,0,0,0,"","Serviço","Serviço","-","AGETOP",261550,"PINT.ESMALTE SINT.PAREDES - 2 DEM.C/SELADOR","m2    ",14.54,null,null,0,""]
["S",3,"S",0,1,15,5,0,0,0,0,"","Serviço","Serviço","-","SINAPI",88489,"APLICAÇÃO MANUAL DE PINTURA COM TINTA LÁTEX ACRÍLICA EM PAREDES, DUAS DEMÃOS. AF_06/2014","M2",17.62,null,null,0,"Referência: AGETOP - 261001"]
[3,3,3,5,1,15,6,0,0,81,5,"","Nível 3","Nível 3","-","SINAPI",null,"DEPÓSITO 5","-",null,null,null,0,""]
["S",3,"S",0,1,15,6,0,0,0,0,"","Serviço","Serviço","-","AGETOP",260105,"REMOCAO DE PINTURA ANTIGA A OLEO OU ESMALTE","m2    ",15.1,null,null,0,""]
["S",3,"S",0,1,15,6,0,0,0,0,"","Serviço","Serviço","-","SINAPI",88497,"APLICAÇÃO E LIXAMENTO DE MASSA LÁTEX EM PAREDES, DUAS DEMÃOS. AF_06/2014","M2",15.1,null,null,0,"Referência: AGETOP - 261300"]
["S",3,"S",0,1,15,6,0,0,0,0,"","Serviço","Serviço","-","AGETOP",261550,"PINT.ESMALTE SINT.PAREDES - 2 DEM.C/SELADOR","m2    ",15.1,null,null,0,""]
["S",3,"S",0,1,15,6,0,0,0,0,"","Serviço","Serviço","-","SINAPI",88489,"APLICAÇÃO MANUAL DE PINTURA COM TINTA LÁTEX ACRÍLICA EM PAREDES, DUAS DEMÃOS. AF_06/2014","M2",18.3,null,null,0,"Referência: AGETOP - 261001"]
[3,3,3,5,1,15,7,0,0,76,5,"","Nível 3","Nível 3","-","SINAPI",null,"CAF","-",null,null,null,0,""]
["S",3,"S",0,1,15,7,0,0,0,0,"","Serviço","Serviço","-","AGETOP",260105,"REMOCAO DE PINTURA ANTIGA A OLEO OU ESMALTE","m2    ",15.85,null,null,0,""]
["S",3,"S",0,1,15,7,0,0,0,0,"","Serviço","Serviço","-","SINAPI",88497,"APLICAÇÃO E LIXAMENTO DE MASSA LÁTEX EM PAREDES, DUAS DEMÃOS. AF_06/2014","M2",15.85,null,null,0,"Referência: AGETOP - 261300"]
["S",3,"S",0,1,15,7,0,0,0,0,"","Serviço","Serviço","-","AGETOP",261550,"PINT.ESMALTE SINT.PAREDES - 2 DEM.C/SELADOR","m2    ",15.85,null,null,0,""]
["S",3,"S",0,1,15,7,0,0,0,0,"","Serviço","Serviço","-","SINAPI",88489,"APLICAÇÃO MANUAL DE PINTURA COM TINTA LÁTEX ACRÍLICA EM PAREDES, DUAS DEMÃOS. AF_06/2014","M2",19.21,null,null,0,"Referência: AGETOP - 261001"]
[3,3,3,5,1,15,8,0,0,71,5,"","Nível 3","Nível 3","-","SINAPI",null,"SALA DE AEE","-",null,null,null,0,""]
["S",3,"S",0,1,15,8,0,0,0,0,"","Serviço","Serviço","-","AGETOP",260105,"REMOCAO DE PINTURA ANTIGA A OLEO OU ESMALTE","m2    ",32.909999999999997,null,null,0,""]
["S",3,"S",0,1,15,8,0,0,0,0,"","Serviço","Serviço","-","SINAPI",88497,"APLICAÇÃO E LIXAMENTO DE MASSA LÁTEX EM PAREDES, DUAS DEMÃOS. AF_06/2014","M2",32.909999999999997,null,null,0,"Referência: AGETOP - 261300"]
["S",3,"S",0,1,15,8,0,0,0,0,"","Serviço","Serviço","-","AGETOP",261550,"PINT.ESMALTE SINT.PAREDES - 2 DEM.C/SELADOR","m2    ",32.909999999999997,null,null,0,""]
["S",3,"S",0,1,15,8,0,0,0,0,"","Serviço","Serviço","-","SINAPI",88489,"APLICAÇÃO MANUAL DE PINTURA COM TINTA LÁTEX ACRÍLICA EM PAREDES, DUAS DEMÃOS. AF_06/2014","M2",39.89,null,null,0,"Referência: AGETOP - 261001"]
[3,3,3,6,1,15,9,0,0,66,6,"","Nível 3","Nível 3","-","SINAPI",null,"SALA DO PROFESSOR","-",null,null,null,0,""]
["S",3,"S",0,1,15,9,0,0,0,0,"","Serviço","Serviço","-","AGETOP",260105,"REMOCAO DE PINTURA ANTIGA A OLEO OU ESMALTE","m2    ",37.630000000000003,null,null,0,""]
["S",3,"S",0,1,15,9,0,0,0,0,"","Serviço","Serviço","-","SINAPI",88497,"APLICAÇÃO E LIXAMENTO DE MASSA LÁTEX EM PAREDES, DUAS DEMÃOS. AF_06/2014","M2",37.630000000000003,null,null,0,"Referência: AGETOP - 261300"]
["S",3,"S",0,1,15,9,0,0,0,0,"","Serviço","Serviço","-","AGETOP",261550,"PINT.ESMALTE SINT.PAREDES - 2 DEM.C/SELADOR","m2    ",42.3,null,null,0,""]
["S",3,"S",0,1,15,9,0,0,0,0,"","Serviço","Serviço","-","SINAPI",88489,"APLICAÇÃO MANUAL DE PINTURA COM TINTA LÁTEX ACRÍLICA EM PAREDES, DUAS DEMÃOS. AF_06/2014","M2",42.3,null,null,0,"Referência: AGETOP - 261001"]
["S",3,"S",0,1,15,9,0,0,0,0,"","Serviço","Serviço","-","SINAPI","74145/1","PINTURA ESMALTE FOSCO, DUAS DEMAOS, SOBRE SUPERFICIE METALICA, INCLUSO UMA DEMAO DE FUNDO ANTICORROSIVO. UTILIZACAO DE REVOLVER ( AR-COMPRIMIDO).","M2",3.36,null,null,0,"Referência: AGETOP - 261602"]
[3,3,3,6,1,15,10,0,0,60,6,"","Nível 3","Nível 3","-",null,null,"COORDENAÇÃO","-",null,null,null,0,""]
["S",3,"S",0,1,15,10,0,0,0,0,"","Serviço","Serviço","-","AGETOP",260105,"REMOCAO DE PINTURA ANTIGA A OLEO OU ESMALTE","m2    ",32.159999999999997,null,null,0,""]
["S",3,"S",0,1,15,10,0,0,0,0,"","Serviço","Serviço","-","SINAPI",88497,"APLICAÇÃO E LIXAMENTO DE MASSA LÁTEX EM PAREDES, DUAS DEMÃOS. AF_06/2014","M2",32.159999999999997,null,null,0,"Referência: AGETOP - 261300"]
["S",3,"S",0,1,15,10,0,0,0,0,"","Serviço","Serviço","-","AGETOP",261550,"PINT.ESMALTE SINT.PAREDES - 2 DEM.C/SELADOR","m2    ",32.159999999999997,null,null,0,""]
["S",3,"S",0,1,15,10,0,0,0,0,"","Serviço","Serviço","-","SINAPI",88489,"APLICAÇÃO MANUAL DE PINTURA COM TINTA LÁTEX ACRÍLICA EM PAREDES, DUAS DEMÃOS. AF_06/2014","M2",38.97,null,null,0,"Referência: AGETOP - 261001"]
["S",3,"S",0,1,15,10,0,0,0,0,"","Serviço","Serviço","-","SINAPI","74145/1","PINTURA ESMALTE FOSCO, DUAS DEMAOS, SOBRE SUPERFICIE METALICA, INCLUSO UMA DEMAO DE FUNDO ANTICORROSIVO. UTILIZACAO DE REVOLVER ( AR-COMPRIMIDO).","M2",3.36,null,null,0,"Referência: AGETOP - 261602"]
[3,3,3,5,1,15,11,0,0,54,5,"","Nível 3","Nível 3","-","SINAPI",null,"DIRETORIA","-",null,null,null,0,""]
["S",3,"S",0,1,15,11,0,0,0,0,"","Serviço","Serviço","-","AGETOP",260105,"REMOCAO DE PINTURA ANTIGA A OLEO OU ESMALTE","m2    ",21.14,null,null,0,""]
["S",3,"S",0,1,15,11,0,0,0,0,"","Serviço","Serviço","-","SINAPI",88497,"APLICAÇÃO E LIXAMENTO DE MASSA LÁTEX EM PAREDES, DUAS DEMÃOS. AF_06/2014","M2",21.14,null,null,0,"Referência: AGETOP - 261300"]
["S",3,"S",0,1,15,11,0,0,0,0,"","Serviço","Serviço","-","AGETOP",261550,"PINT.ESMALTE SINT.PAREDES - 2 DEM.C/SELADOR","m2    ",21.14,null,null,0,""]
["S",3,"S",0,1,15,11,0,0,{"$f":"IF(OR($C531=\"S\",$C531=0),0,MATCH(0,OFFSET($D531,1,$C531,ROW($C$1047)-ROW($C531)),0))","v":0},{"$f":"IF(OR($C531=\"S\",$C531=0),0,MATCH(OFFSET($D531,0,$C531)+1,OFFSET($D531,1,$C531,ROW($C$1047)-ROW($C531)),0))","v":0},"","Serviço","Serviço","-","SINAPI",88489,"APLICAÇÃO MANUAL DE PINTURA COM TINTA LÁTEX ACRÍLICA EM PAREDES, DUAS DEMÃOS. AF_06/2014","M2",25.62,null,null,0,"Referência: AGETOP - 261001"]
[3,3,3,5,1,15,12,0,0,49,5,"","Nível 3","Nível 3","-","SINAPI",null,"LAB. CIENCIAS","-",null,null,null,0,""]
["S",3,"S",0,1,15,12,0,0,0,0,"","Serviço","Serviço","-","AGETOP",260105,"REMOCAO DE PINTURA ANTIGA A OLEO OU ESMALTE","m2    ",41.97,null,null,0,""]
["S",3,"S",0,1,15,12,0,0,0,0,"","Serviço","Serviço","-","SINAPI",88497,"APLICAÇÃO E LIXAMENTO DE MASSA LÁTEX EM PAREDES, DUAS DEMÃOS. AF_06/2014","M2",41.97,null,null,0,"Referência: AGETOP - 261300"]
["S",3,"S",0,1,15,12,0,0,0,0,"","Serviço","Serviço","-","AGETOP",261550,"PINT.ESMALTE SINT.PAREDES - 2 DEM.C/SELADOR","m2    ",41.97,null,null,0,""]
["S",3,"S",0,1,15,12,0,0,0,0,"","Serviço","Serviço","-","SINAPI",88489,"APLICAÇÃO MANUAL DE PINTURA COM TINTA LÁTEX ACRÍLICA EM PAREDES, DUAS DEMÃOS. AF_06/2014","M2",50.87,null,null,0,"Referência: AGETOP - 261001"]
[3,3,3,5,1,15,13,0,0,44,5,"","Nível 3","Nível 3","-","SINAPI",null,"LAB. INFORMATICA","-",null,null,null,0,""]
["S",3,"S",0,1,15,13,0,0,0,0,"","Serviço","Serviço","-","AGETOP",260105,"REMOCAO DE PINTURA ANTIGA A OLEO OU ESMALTE","m2    ",41.97,null,null,0,""]
["S",3,"S",0,1,15,13,0,0,0,0,"","Serviço","Serviço","-","SINAPI",88497,"APLICAÇÃO E LIXAMENTO DE MASSA LÁTEX EM PAREDES, DUAS DEMÃOS. AF_06/2014","M2",41.97,null,null,0,"Referência: AGETOP - 261300"]
["S",3,"S",0,1,15,13,0,0,0,0,"","Serviço","Serviço","-","AGETOP",261550,"PINT.ESMALTE SINT.PAREDES - 2 DEM.C/SELADOR","m2    ",41.97,null,null,0,""]
["S",3,"S",0,1,15,13,0,0,0,0,"","Serviço","Serviço","-","SINAPI",88489,"APLICAÇÃO MANUAL DE PINTURA COM TINTA LÁTEX ACRÍLICA EM PAREDES, DUAS DEMÃOS. AF_06/2014","M2",50.87,null,null,0,"Referência: AGETOP - 261001"]
[3,3,3,5,1,15,14,0,0,39,5,"","Nível 3","Nível 3","-","SINAPI",null,"SALAS DE AULA","-",null,null,null,0,""]
["S",3,"S",0,1,15,14,0,0,0,0,"","Serviço","Serviço","-","AGETOP",260105,"REMOCAO DE PINTURA ANTIGA A OLEO OU ESMALTE","m2    ",427.33,null,null,0,""]
["S",3,"S",0,1,15,14,0,0,0,0,"","Serviço","Serviço","-","SINAPI",88497,"APLICAÇÃO E LIXAMENTO DE MASSA LÁTEX EM PAREDES, DUAS DEMÃOS. AF_06/2014","M2",427.33,null,null,0,"Referência: AGETOP - 261300"]
["S",3,"S",0,1,15,14,0,0,0,0,"","Serviço","Serviço","-","AGETOP",261550,"PINT.ESMALTE SINT.PAREDES - 2 DEM.C/SELADOR","m2    ",427.33,null,null,0,""]
["S",3,"S",0,1,15,14,0,0,0,0,"","Serviço","Serviço","-","SINAPI",88489,"APLICAÇÃO MANUAL DE PINTURA COM TINTA LÁTEX ACRÍLICA EM PAREDES, DUAS DEMÃOS. AF_06/2014","M2",517.89,null,null,0,"Referência: AGETOP - 261001"]
[3,3,3,6,1,15,15,0,0,34,6,"","Nível 3","Nível 3","-",null,null,"BIBLIOTECA","-",null,null,null,0,""]
["S",3,"S",0,1,15,15,0,0,0,0,"","Serviço","Serviço","-","AGETOP",260105,"REMOCAO DE PINTURA ANTIGA A OLEO OU ESMALTE","m2    ",41.07,null,null,0,""]
["S",3,"S",0,1,15,15,0,0,0,0,"","Serviço","Serviço","-","SINAPI",88497,"APLICAÇÃO E LIXAMENTO DE MASSA LÁTEX EM PAREDES, DUAS DEMÃOS. AF_06/2014","M2",41.07,null,null,0,"Referência: AGETOP - 261300"]
["S",3,"S",0,1,15,15,0,0,0,0,"","Serviço","Serviço","-","AGETOP",261550,"PINT.ESMALTE SINT.PAREDES - 2 DEM.C/SELADOR","m2    ",41.07,null,null,0,""]
["S",3,"S",0,1,15,15,0,0,0,0,"","Serviço","Serviço","-","SINAPI",88489,"APLICAÇÃO MANUAL DE PINTURA COM TINTA LÁTEX ACRÍLICA EM PAREDES, DUAS DEMÃOS. AF_06/2014","M2",49.77,null,null,0,"Referência: AGETOP - 261001"]
["S",3,"S",0,1,15,15,0,0,0,0,"","Serviço","Serviço","-","SINAPI","74145/1","PINTURA ESMALTE FOSCO, DUAS DEMAOS, SOBRE SUPERFICIE METALICA, INCLUSO UMA DEMAO DE FUNDO ANTICORROSIVO. UTILIZACAO DE REVOLVER ( AR-COMPRIMIDO).","M2",8.4,null,null,0,"Referência: AGETOP - 261602"]
[3,3,3,5,1,15,16,0,0,28,5,"","Nível 3","Nível 3","-","SINAPI",null,"S. LEITURA","-",null,null,null,0,""]
["S",3,"S",0,1,15,16,0,0,0,0,"","Serviço","Serviço","-","SINAPI",88497,"APLICAÇÃO E LIXAMENTO DE MASSA LÁTEX EM PAREDES, DUAS DEMÃOS. AF_06/2014","M2",101.4,null,null,0,"Referência: AGETOP - 261300"]
["S",3,"S",0,1,15,16,0,0,0,0,"","Serviço","Serviço","-","AGETOP",261550,"PINT.ESMALTE SINT.PAREDES - 2 DEM.C/SELADOR","m2    ",50.7,null,null,0,""]
["S",3,"S",0,1,15,16,0,0,0,0,"","Serviço","Serviço","-","SINAPI",88489,"APLICAÇÃO MANUAL DE PINTURA COM TINTA LÁTEX ACRÍLICA EM PAREDES, DUAS DEMÃOS. AF_06/2014","M2",50.7,null,null,0,"Referência: AGETOP - 261001"]
["S",3,"S",0,1,15,16,0,0,0,0,"","Serviço","Serviço","-","SINAPI","74145/1","PINTURA ESMALTE FOSCO, DUAS DEMAOS, SOBRE SUPERFICIE METALICA, INCLUSO UMA DEMAO DE FUNDO ANTICORROSIVO. UTILIZACAO DE REVOLVER ( AR-COMPRIMIDO).","M2",11.76,null,null,0,"Referência: AGETOP - 261602"]
[3,3,3,2,1,15,17,0,0,23,2,"","Nível 3","Nível 3","-","SINAPI",null,"SANIT. FEMININO","-",null,null,null,0,""]
["S",3,"S",0,1,15,17,0,0,0,0,"","Serviço","Serviço","-","SINAPI","74145/1","PINTURA ESMALTE FOSCO, DUAS DEMAOS, SOBRE SUPERFICIE METALICA, INCLUSO UMA DEMAO DE FUNDO ANTICORROSIVO. UTILIZACAO DE REVOLVER ( AR-COMPRIMIDO).","M2",7.2,null,null,0,"Referência: AGETOP - 261602"]
[3,3,3,2,1,15,18,0,0,21,2,"","Nível 3","Nível 3","-","SINAPI",null,"SANIT. MASCULINO","-",null,null,null,0,""]
["S",3,"S",0,1,15,18,0,0,0,0,"","Serviço","Serviço","-","SINAPI","74145/1","PINTURA ESMALTE FOSCO, DUAS DEMAOS, SOBRE SUPERFICIE METALICA, INCLUSO UMA DEMAO DE FUNDO ANTICORROSIVO. UTILIZACAO DE REVOLVER ( AR-COMPRIMIDO).","M2",7.2,null,null,0,"Referência: AGETOP - 261602"]
[3,3,3,5,1,15,19,0,0,19,5,"","Nível 3","Nível 3","-","SINAPI",null,"ALMOXARIFADO","-",null,null,null,0,""]
["S",3,"S",0,1,15,19,0,0,0,0,"","Serviço","Serviço","-","SINAPI",88497,"APLICAÇÃO E LIXAMENTO DE MASSA LÁTEX EM PAREDES, DUAS DEMÃOS. AF_06/2014","M2",21.59,null,null,0,"Referência: AGETOP - 261300"]
["S",3,"S",0,1,15,19,0,0,0,0,"","Serviço","Serviço","-","AGETOP",261550,"PINT.ESMALTE SINT.PAREDES - 2 DEM.C/SELADOR","m2    ",21.59,null,null,0,""]
["S",3,"S",0,1,15,19,0,0,0,0,"","Serviço","Serviço","-","SINAPI",88489,"APLICAÇÃO MANUAL DE PINTURA COM TINTA LÁTEX ACRÍLICA EM PAREDES, DUAS DEMÃOS. AF_06/2014","M2",21.59,null,null,0,"Referência: AGETOP - 261001"]
["S",3,"S",0,1,15,19,0,0,0,0,"","Serviço","Serviço","-","SINAPI","74145/1","PINTURA ESMALTE FOSCO, DUAS DEMAOS, SOBRE SUPERFICIE METALICA, INCLUSO UMA DEMAO DE FUNDO ANTICORROSIVO. UTILIZACAO DE REVOLVER ( AR-COMPRIMIDO).","M2",26.16,null,null,0,"Referência: AGETOP - 261602"]
[3,3,3,5,1,15,20,0,0,14,5,"","Nível 3","Nível 3","-","SINAPI",null,"PROJ. VIDA","-",null,null,null,0,""]
["S",3,"S",0,1,15,20,0,0,0,0,"","Serviço","Serviço","-","SINAPI",88497,"APLICAÇÃO E LIXAMENTO DE MASSA LÁTEX EM PAREDES, DUAS DEMÃOS. AF_06/2014","M2",19.78,null,null,0,"Referência: AGETOP - 261300"]
["S",3,"S",0,1,15,20,0,0,0,0,"","Serviço","Serviço","-","AGETOP",261550,"PINT.ESMALTE SINT.PAREDES - 2 DEM.C/SELADOR","m2    ",19.78,null,null,0,""]
["S",3,"S",0,1,15,20,0,0,0,0,"","Serviço","Serviço","-","SINAPI",88489,"APLICAÇÃO MANUAL DE PINTURA COM TINTA LÁTEX ACRÍLICA EM PAREDES, DUAS DEMÃOS. AF_06/2014","M2",19.78,null,null,0,"Referência: AGETOP - 261001"]
["S",3,"S",0,1,15,20,0,0,0,0,"","Serviço","Serviço","-","SINAPI","74145/1","PINTURA ESMALTE FOSCO, DUAS DEMAOS, SOBRE SUPERFICIE METALICA, INCLUSO UMA DEMAO DE FUNDO ANTICORROSIVO. UTILIZACAO DE REVOLVER ( AR-COMPRIMIDO).","M2",23.97,null,null,0,"Referência: AGETOP - 261602"]
[3,3,3,2,1,15,21,0,0,9,2,"","Nível 3","Nível 3","-","SINAPI",null,"ACESSIBILIDADE","-",null,null,null,0,""]
["S",3,"S",0,1,15,21,0,0,0,0,"","Serviço","Serviço","-","AGETOP",261703,"PINT.POLIESPORTIVA - 2 DEM.(PISOS E CIMENTADOS)","m2    ",20.700000000000003,null,null,0,""]
[3,3,3,7,1,15,22,0,0,7,{"$error":"#N/A"},"","Nível 3","Nível 3","-","SINAPI",null,"OUTROS","-",null,null,null,0,""]
["S",3,"S",0,1,15,22,0,0,0,0,"","Serviço","Serviço","-","SINAPI",88497,"APLICAÇÃO E LIXAMENTO DE MASSA LÁTEX EM PAREDES, DUAS DEMÃOS. AF_06/2014","M2",212.61,null,null,0,"Referência: AGETOP - 261300"]
["S",3,"S",0,1,15,22,0,0,0,0,"","Serviço","Serviço","-","SINAPI",88489,"APLICAÇÃO MANUAL DE PINTURA COM TINTA LÁTEX ACRÍLICA EM PAREDES, DUAS DEMÃOS. AF_06/2014","M2",708.72,null,null,0,"Referência: AGETOP - 261001"]
["S",3,"S",0,1,15,22,0,0,0,0,"","Serviço","Serviço","-","AGETOP",260104,"REMOCAO DE PINTURA ANTIGA A LATEX","m2    ",212.61,null,null,0,""]
["S",3,"S",0,1,15,22,0,0,0,0,"","Serviço","Serviço","-","AGETOP",260105,"REMOCAO DE PINTURA ANTIGA A OLEO OU ESMALTE","m2    ",255.2,null,null,0,""]
[{"$f":"CHOOSE(1+LOG(1+2*(ORÇAMENTO.Nivel=\"Nível 1\")+4*(ORÇAMENTO.Nivel=\"Nível 2\")+8*(ORÇAMENTO.Nivel=\"Nível 3\")+16*(ORÇAMENTO.Nivel=\"Nível 4\")+32*(ORÇAMENTO.Nivel=\"Serviço\"),2),0,1,2,3,4,\"S\")","v":"S"},3,"S",0,1,15,22,0,{"$f":"IF(AND($C579<=4,$C579<>0),0,IF(AND($C579=\"S\",$W579>0),OFFSET(I579,-1,0)+1,OFFSET(I579,-1,0)))","v":0},0,0,"","Serviço","Serviço","-","SINAPI","73924/3","PINTURA ESMALTE FOSCO, DUAS DEMAOS, SOBRE SUPERFICIE METALICA","M2",255.2,null,null,0,"Referência: AGETOP - 261503"]
["S",3,"S",0,1,15,22,0,0,0,0,"","Serviço","Serviço","-","SINAPI","73924/3","PINTURA ESMALTE FOSCO, DUAS DEMAOS, SOBRE SUPERFICIE METALICA","M2",897.35,null,null,0,"Referência: AGETOP - 261503"]
[2,2,2,10,1,16,0,0,0,10,123,"","Nível 2","Nível 2","-","SINAPI",null,"DIVERSOS","-",null,null,null,0,""]
[3,{"$f":"IF(OR(C582=\"s\",C582=0),OFFSET(B582,-1,0),C582)","v":3},{"$f":"IF(OFFSET(C582,-1,0)=\"L\",1,IF(OFFSET(C582,-1,0)=1,2,IF(OR(A582=\"s\",A582=0),\"S\",IF(AND(OFFSET(C582,-1,0)=2,A582=4),3,IF(AND(OR(OFFSET(C582,-1,0)=\"s\",OFFSET(C582,-1,0)=0),A582<>\"s\",A582>OFFSET(B582,-1,0)),OFFSET(B582,-1,0),A582)))))","v":3},{"$f":"IF(OR(C582=\"S\",C582=0),0,IF(ISERROR(K582),J582,SMALL(J582:K582,1)))","v":2},{"$f":"IF($C582=1,OFFSET(E582,-1,0)+1,OFFSET(E582,-1,0))","v":1},{"$f":"IF($C582=1,0,IF($C582=2,OFFSET(F582,-1,0)+1,OFFSET(F582,-1,0)))","v":16},{"$f":"IF(AND($C582<=2,$C582<>0),0,IF($C582=3,OFFSET(G582,-1,0)+1,OFFSET(G582,-1,0)))","v":1},{"$f":"IF(AND($C582<=3,$C582<>0),0,IF($C582=4,OFFSET(H582,-1,0)+1,OFFSET(H582,-1,0)))","v":0},0,9,2,"","Nível 3","Nível 3","-","SINAPI",null,"SECRETARIA","-",null,null,null,0,""]
["S",3,"S",0,1,16,1,0,0,0,0,"","Serviço","Serviço","-","AGETOP",271608,"BANCADA DE GRANITO C/ESPELHO","m2    ",1.7,null,null,0,""]
[3,3,3,2,1,16,2,0,0,7,2,"","Nível 3","Nível 3","-",null,null,"SALA DO PROFESSOR","-",null,null,null,0,""]
["S",3,"S",0,1,16,2,0,0,0,0,"","Serviço","Serviço","-","AGETOP",271608,"BANCADA DE GRANITO C/ESPELHO","m2    ",1.8,null,null,0,""]
[3,3,3,3,1,16,3,0,0,5,3,"","Nível 3","Nível 3","-","SINAPI",null,"ACESSIBILIDADE","-",null,null,null,0,""]
["S",3,"S",0,1,16,3,0,0,0,0,"","Serviço","Serviço","-","COMPOSIÇÃO","COMP 084_SEE","GUARDA-CORPO COM CORRIMÃO - SEDUC","M",192.3,null,null,0,""]
["S",3,"S",0,1,16,3,0,0,0,0,"","Serviço","Serviço","-","COMPOSIÇÃO","COMP 085_SEE","GUARDA-CORPO - SEDUC","M",34.770000000000003,null,null,0,""]
[3,3,3,2,1,16,4,0,0,2,{"$error":"#N/A"},"","Nível 3","Nível 3","-","SINAPI",null,"OUTROS","-",null,null,null,0,""]
["S",3,"S",0,1,16,4,0,0,0,0,"","Serviço","Serviço","-","AGETOP",270501,"LIMPEZA FINAL DE OBRA - (OBRAS CIVIS)","m2    ",400,null,null,0,""]
[{"$f":"CHOOSE(1+LOG(1+2*(ORÇAMENTO.Nivel=\"Nível 1\")+4*(ORÇAMENTO.Nivel=\"Nível 2\")+8*(ORÇAMENTO.Nivel=\"Nível 3\")+16*(ORÇAMENTO.Nivel=\"Nível 4\")+32*(ORÇAMENTO.Nivel=\"Serviço\"),2),0,1,2,3,4,\"S\")","v":1},{"$f":"IF(OR(C591=\"s\",C591=0),OFFSET(B591,-1,0),C591)","v":1},{"$f":"IF(OFFSET(C591,-1,0)=\"L\",1,IF(OFFSET(C591,-1,0)=1,2,IF(OR(A591=\"s\",A591=0),\"S\",IF(AND(OFFSET(C591,-1,0)=2,A591=4),3,IF(AND(OR(OFFSET(C591,-1,0)=\"s\",OFFSET(C591,-1,0)=0),A591<>\"s\",A591>OFFSET(B591,-1,0)),OFFSET(B591,-1,0),A591)))))","v":1},{"$f":"IF(OR(C591=\"S\",C591=0),0,IF(ISERROR(K591),J591,SMALL(J591:K591,1)))","v":126},{"$f":"IF($C591=1,OFFSET(E591,-1,0)+1,OFFSET(E591,-1,0))","v":2},{"$f":"IF($C591=1,0,IF($C591=2,OFFSET(F591,-1,0)+1,OFFSET(F591,-1,0)))","v":0},{"$f":"IF(AND($C591<=2,$C591<>0),0,IF($C591=3,OFFSET(G591,-1,0)+1,OFFSET(G591,-1,0)))","v":0},{"$f":"IF(AND($C591<=3,$C591<>0),0,IF($C591=4,OFFSET(H591,-1,0)+1,OFFSET(H591,-1,0)))","v":0},{"$f":"IF(AND($C591<=4,$C591<>0),0,IF(AND($C591=\"S\",$W591>0),OFFSET(I591,-1,0)+1,OFFSET(I591,-1,0)))","v":0},456,126,"F","Nível 1","Nível 1","2.","SINAPI",null,"BLOCO 02 SALAS PADRÃO SEDUC 2017 - LAJE","-",null,null,null,0,""]
[2,2,2,2,2,1,0,0,0,125,2,"","Nível 2","Nível 2","-","SINAPI",null,"SERVIÇOS PRELIMINARES","-",null,null,null,0,""]
["S",2,"S",0,2,1,0,0,0,0,0,"","Serviço","Serviço","-","AGETOP",20701,"LOCAÇÃO DA OBRA, EXECUÇÃO DE GABARITO SEM REAPROVEITAMENTO, INCLUSO PINTURA (FACE INTERNA DO RIPÃO 15CM) E PIQUETE COM TESTEMUNHA","m2    ",127.26,null,null,0,""]
[2,2,2,3,2,2,0,0,0,123,3,"","Nível 2","Nível 2","-","SINAPI",null,"TRANSPORTES","-",null,null,null,0,""]
["S",2,"S",0,2,2,0,0,0,{"$f":"IF(OR($C595=\"S\",$C595=0),0,MATCH(0,OFFSET($D595,1,$C595,ROW($C$1047)-ROW($C595)),0))","v":0},{"$f":"IF(OR($C595=\"S\",$C595=0),0,MATCH(OFFSET($D595,0,$C595)+1,OFFSET($D595,1,$C595,ROW($C$1047)-ROW($C595)),0))","v":0},"","Serviço","Serviço","-","SINAPI",72897,"CARGA MANUAL DE ENTULHO EM CAMINHAO BASCULANTE 6 M3","M3",12,null,null,0,""]
["S",2,"S",0,2,2,0,0,0,0,0,"","Serviço","Serviço","-","SINAPI",72900,"TRANSPORTE DE ENTULHO COM CAMINHAO BASCULANTE 6 M3, RODOVIA PAVIMENTADA, DMT 0,5 A 1,0 KM","M3",12,null,null,0,""]
[2,2,2,8,2,3,0,0,0,120,8,"","Nível 2","Nível 2","-","SINAPI",null,"SERVIÇO EM TERRA","-",null,null,null,0,""]
["S",2,"S",0,2,3,0,0,0,0,0,"","Serviço","Serviço","-","SINAPI",93358,"ESCAVAÇÃO MANUAL DE VALA COM PROFUNDIDADE MENOR OU IGUAL A 1,30 M. AF_03/2016","M3",6.24,null,null,0,"Referência: AGETOP - 40101"]
["S",2,"S",0,2,3,0,0,0,0,0,"","Serviço","Serviço","-","SINAPI",96995,"REATERRO MANUAL APILOADO COM SOQUETE. AF_10/2017","M3",3.62,null,null,0,"Referência: AGETOP - 40902"]
["S",2,"S",0,2,3,0,0,0,0,0,"","Serviço","Serviço","-","SINAPI",79480,"ESCAVACAO MECANICA CAMPO ABERTO EM SOLO EXCETO ROCHA ATE 2,00M PROFUNDIDADE","M3",24,null,null,0,"Referência: AGETOP - 41004"]
["S",2,"S",0,2,3,0,0,0,0,0,"","Serviço","Serviço","-","SINAPI",72898,"CARGA E DESCARGA MECANIZADAS DE ENTULHO EM CAMINHAO BASCULANTE 6 M3","M3",24,null,null,0,"Referência: AGETOP - 41005"]
["S",2,"S",0,2,3,0,0,0,0,0,"","Serviço","Serviço","-","AGETOP",41012,"INDENIZAÇÃO DE JAZIDA","m3    ",24,null,null,0,""]
["S",2,"S",0,2,3,0,0,0,0,0,"","Serviço","Serviço","-","AGETOP",41006,"TRANSPORTE DE MATERIAL ESCAVADO M3.KM","m3km  ",240,null,null,0,""]
["S",2,"S",0,2,3,0,0,0,0,0,"","Serviço","Serviço","-","SINAPI","74005/2","COMPACTACAO MECANICA C/ CONTROLE DO GC>=95% DO PN (AREAS) (C/MONIVELADORA 140 HP E ROLO COMPRESSOR VIBRATORIO 80 HP)","M3",19.2,null,null,0,"Referência: AGETOP - 41008"]
[2,2,2,19,2,4,0,0,0,112,19,"","Nível 2","Nível 2","-","SINAPI",null,"FUNDAÇÕES E SONDAGENS","-",null,null,null,0,""]
[3,3,3,10,2,4,1,0,0,18,10,"","Nível 3","Nível 3","-","SINAPI",null,"ESTACAS E BLOCOS","-",null,null,null,0,""]
["S",3,"S",0,2,4,1,0,0,0,0,"","Serviço","Serviço","-","SINAPI",98230,"ESTACA BROCA DE CONCRETO, DIÂMETRO DE 30 CM, PROFUNDIDADE DE ATÉ 3 M, ESCAVAÇÃO MANUAL COM TRADO CONCHA, NÃO ARMADA. AF_03/2018","M",77,null,null,0,"Referência: AGETOP - 50302"]
["S",3,"S",0,2,4,1,0,0,0,0,"","Serviço","Serviço","-","SINAPI",96522,"ESCAVAÇÃO MANUAL PARA BLOCO DE COROAMENTO OU SAPATA, SEM PREVISÃO DE FÔRMA. AF_06/2017","M3",6.03,null,null,0,"Referência: AGETOP - 50901"]
["S",3,"S",0,2,4,1,0,0,0,0,"","Serviço","Serviço","-","SINAPI",96995,"REATERRO MANUAL APILOADO COM SOQUETE. AF_10/2017","M3",3.24,null,null,0,"Referência: AGETOP - 40902"]
["S",3,"S",0,2,4,1,0,0,0,0,"","Serviço","Serviço","-","SINAPI",94963,"CONCRETO FCK = 15MPA, TRAÇO 1:3,4:3,5 (CIMENTO/ AREIA MÉDIA/ BRITA 1)  - PREPARO MECÂNICO COM BETONEIRA 400 L. AF_07/2016","M3",2.79,null,null,0,""]
["S",3,"S",0,2,4,1,0,0,{"$f":"IF(OR($C611=\"S\",$C611=0),0,MATCH(0,OFFSET($D611,1,$C611,ROW($C$1047)-ROW($C611)),0))","v":0},{"$f":"IF(OR($C611=\"S\",$C611=0),0,MATCH(OFFSET($D611,0,$C611)+1,OFFSET($D611,1,$C611,ROW($C$1047)-ROW($C611)),0))","v":0},"","Serviço","Serviço","-","SINAPI","74157/4","LANCAMENTO/APLICACAO MANUAL DE CONCRETO EM FUNDACOES","M3",2.8,null,null,0,"Referência: AGETOP - 51026"]
["S",3,"S",0,2,4,1,0,0,0,0,"","Serviço","Serviço","-","SINAPI",96544,"ARMAÇÃO DE BLOCO, VIGA BALDRAME OU SAPATA UTILIZANDO AÇO CA-50 DE 6,3 MM - MONTAGEM. AF_06/2017","KG",42.72,null,null,0,"Referência: AGETOP - 52003"]
["S",3,"S",0,2,4,1,0,0,0,0,"","Serviço","Serviço","-","SINAPI",96545,"ARMAÇÃO DE BLOCO, VIGA BALDRAME OU SAPATA UTILIZANDO AÇO CA-50 DE 8 MM - MONTAGEM. AF_06/2017","KG",97.27,null,null,0,"Referência: AGETOP - 52004"]
["S",3,"S",0,2,4,1,0,0,0,0,"","Serviço","Serviço","-","SINAPI",96546,"ARMAÇÃO DE BLOCO, VIGA BALDRAME OU SAPATA UTILIZANDO AÇO CA-50 DE 10 MM - MONTAGEM. AF_06/2017","KG",33.630000000000003,null,null,0,"Referência: AGETOP - 52005"]
["S",3,"S",0,2,4,1,0,0,0,0,"","Serviço","Serviço","-","SINAPI",96543,"ARMAÇÃO DE BLOCO, VIGA BALDRAME E SAPATA UTILIZANDO AÇO CA-60 DE 5 MM - MONTAGEM. AF_06/2017","KG",26.36,null,null,0,"Referência: AGETOP - 52014"]
[3,3,3,8,2,4,2,0,0,8,23,"","Nível 3","Nível 3","-","SINAPI",null,"VIGAS BALDRAMES","-",null,null,null,0,""]
["S",3,"S",0,2,4,2,0,0,0,0,"","Serviço","Serviço","-","SINAPI",96527,"ESCAVAÇÃO MANUAL DE VALA PARA VIGA BALDRAME, COM PREVISÃO DE FÔRMA. AF_06/2017","M3",7.17,null,null,0,"Referência: AGETOP - 40101"]
["S",3,"S",0,2,4,2,0,0,0,0,"","Serviço","Serviço","-","SINAPI",96995,"REATERRO MANUAL APILOADO COM SOQUETE. AF_10/2017","M3",4.18,null,null,0,"Referência: AGETOP - 40902"]
["S",3,"S",0,2,4,2,0,0,0,0,"","Serviço","Serviço","-","AGETOP",60191,"FORMA DE TABUA CINTA BALDRAME U=8 VEZES","m2    ",52.77,null,null,0,""]
["S",3,"S",0,2,4,2,0,0,0,0,"","Serviço","Serviço","-","SINAPI",94963,"CONCRETO FCK = 15MPA, TRAÇO 1:3,4:3,5 (CIMENTO/ AREIA MÉDIA/ BRITA 1)  - PREPARO MECÂNICO COM BETONEIRA 400 L. AF_07/2016","M3",3,null,null,0,""]
["S",3,"S",0,2,4,2,0,0,0,0,"","Serviço","Serviço","-","SINAPI","74157/4","LANCAMENTO/APLICACAO MANUAL DE CONCRETO EM FUNDACOES","M3",3,null,null,0,"Referência: AGETOP - 51026"]
["S",3,"S",0,2,4,2,0,0,0,0,"","Serviço","Serviço","-","SINAPI",96545,"ARMAÇÃO DE BLOCO, VIGA BALDRAME OU SAPATA UTILIZANDO AÇO CA-50 DE 8 MM - MONTAGEM. AF_06/2017","KG",120.9,null,null,0,"Referência: AGETOP - 52004"]
["S",3,"S",0,2,4,2,0,0,0,0,"","Serviço","Serviço","-","SINAPI",96543,"ARMAÇÃO DE BLOCO, VIGA BALDRAME E SAPATA UTILIZANDO AÇO CA-60 DE 5 MM - MONTAGEM. AF_06/2017","KG",65.45,null,null,0,"Referência: AGETOP - 52014"]
[2,2,2,17,2,5,0,0,0,93,17,"","Nível 2","Nível 2","-","SINAPI",null,"ESTRUTURA","-",null,null,null,0,""]
[3,3,3,6,2,5,1,0,0,16,6,"","Nível 3","Nível 3","-","SINAPI",null,"PILARES","-",null,null,null,0,""]
["S",3,"S",0,2,5,1,0,0,0,0,"","Serviço","Serviço","-","SINAPI",92426,"MONTAGEM E DESMONTAGEM DE FÔRMA DE PILARES RETANGULARES E ESTRUTURAS SIMILARES COM ÁREA MÉDIA DAS SEÇÕES MENOR OU IGUAL A 0,25 M², PÉ-DIREITO SIMPLES, EM CHAPA DE MADEIRA COMPENSADA RESINADA, 8 UTILIZAÇÕES. AF_12/2015","M2",27.3,null,null,0,""]
["S",3,"S",0,2,5,1,0,0,0,0,"","Serviço","Serviço","-","SINAPI",94964,"CONCRETO FCK = 20MPA, TRAÇO 1:2,7:3 (CIMENTO/ AREIA MÉDIA/ BRITA 1)  - PREPARO MECÂNICO COM BETONEIRA 400 L. AF_07/2016","M3",1.3,null,null,0,""]
["S",3,"S",0,2,5,1,0,0,0,0,"","Serviço","Serviço","-","SINAPI",92873,"LANÇAMENTO COM USO DE BALDES, ADENSAMENTO E ACABAMENTO DE CONCRETO EM ESTRUTURAS. AF_12/2015","M3",1.3,null,null,0,"Referência: AGETOP - 60801"]
["S",3,"S",0,2,5,1,0,0,0,0,"","Serviço","Serviço","-","SINAPI",92778,"ARMAÇÃO DE PILAR OU VIGA DE UMA ESTRUTURA CONVENCIONAL DE CONCRETO ARMADO EM UMA EDIFICAÇÃO TÉRREA OU SOBRADO UTILIZANDO AÇO CA-50 DE 10,0 MM - MONTAGEM. AF_12/2015","KG",115.45,null,null,0,"Referência: AGETOP - 60305"]
["S",3,"S",0,2,5,1,0,0,0,0,"","Serviço","Serviço","-","SINAPI",92775,"ARMAÇÃO DE PILAR OU VIGA DE UMA ESTRUTURA CONVENCIONAL DE CONCRETO ARMADO EM UMA EDIFICAÇÃO TÉRREA OU SOBRADO UTILIZANDO AÇO CA-60 DE 5,0 MM - MONTAGEM. AF_12/2015","KG",40,null,null,0,"Referência: AGETOP - 60314"]
[3,3,3,8,2,5,2,0,0,10,8,"","Nível 3","Nível 3","-","SINAPI",null,"VIGAS DE COBERTURA","-",null,null,null,0,""]
["S",3,"S",0,2,5,2,0,0,0,0,"","Serviço","Serviço","-","SINAPI",92464,"MONTAGEM E DESMONTAGEM DE FÔRMA DE VIGA, ESCORAMENTO METÁLICO, PÉ-DIREITO SIMPLES, EM CHAPA DE MADEIRA RESINADA, 8 UTILIZAÇÕES. AF_12/2015","M2",37.729999999999997,null,null,0,"Referência: AGETOP - 60209"]
["S",3,"S",0,2,5,2,0,0,0,0,"","Serviço","Serviço","-","SINAPI",94964,"CONCRETO FCK = 20MPA, TRAÇO 1:2,7:3 (CIMENTO/ AREIA MÉDIA/ BRITA 1)  - PREPARO MECÂNICO COM BETONEIRA 400 L. AF_07/2016","M3",2.14,null,null,0,""]
["S",3,"S",0,2,5,2,0,0,0,0,"","Serviço","Serviço","-","SINAPI",92873,"LANÇAMENTO COM USO DE BALDES, ADENSAMENTO E ACABAMENTO DE CONCRETO EM ESTRUTURAS. AF_12/2015","M3",2.14,null,null,0,"Referência: AGETOP - 60801"]
["S",3,"S",0,2,5,2,0,0,0,0,"","Serviço","Serviço","-","SINAPI",92777,"ARMAÇÃO DE PILAR OU VIGA DE UMA ESTRUTURA CONVENCIONAL DE CONCRETO ARMADO EM UMA EDIFICAÇÃO TÉRREA OU SOBRADO UTILIZANDO AÇO CA-50 DE 8,0 MM - MONTAGEM. AF_12/2015","KG",5.45,null,null,0,"Referência: AGETOP - 60304"]
["S",3,"S",0,2,5,2,0,0,0,0,"","Serviço","Serviço","-","SINAPI",92778,"ARMAÇÃO DE PILAR OU VIGA DE UMA ESTRUTURA CONVENCIONAL DE CONCRETO ARMADO EM UMA EDIFICAÇÃO TÉRREA OU SOBRADO UTILIZANDO AÇO CA-50 DE 10,0 MM - MONTAGEM. AF_12/2015","KG",26.36,null,null,0,"Referência: AGETOP - 60305"]
["S",3,"S",0,2,5,2,0,0,0,0,"","Serviço","Serviço","-","SINAPI",92779,"ARMAÇÃO DE PILAR OU VIGA DE UMA ESTRUTURA CONVENCIONAL DE CONCRETO ARMADO EM UMA EDIFICAÇÃO TÉRREA OU SOBRADO UTILIZANDO AÇO CA-50 DE 12,5 MM - MONTAGEM. AF_12/2015","KG",227.27,null,null,0,""]
["S",3,"S",0,2,5,2,0,0,0,0,"","Serviço","Serviço","-","SINAPI",92775,"ARMAÇÃO DE PILAR OU VIGA DE UMA ESTRUTURA CONVENCIONAL DE CONCRETO ARMADO EM UMA EDIFICAÇÃO TÉRREA OU SOBRADO UTILIZANDO AÇO CA-60 DE 5,0 MM - MONTAGEM. AF_12/2015","KG",55.45,null,null,0,"Referência: AGETOP - 60314"]
[3,3,3,2,2,5,3,0,0,2,{"$error":"#N/A"},"","Nível 3","Nível 3","-","SINAPI",null,"LAJE","-",null,null,null,0,""]
["S",3,"S",0,2,5,3,0,0,0,0,"","Serviço","Serviço","-","SINAPI","74202/1","LAJE PRE-MOLDADA P/FORRO, SOBRECARGA 100KG/M2, VAOS ATE 3,50M/E=8CM, C/LAJOTAS E CAP.C/CONC FCK=20MPA, 3CM, INTER-EIXO 38CM, C/ESCORAMENTO (REAPR.3X) E FERRAGEM NEGATIVA","M2",104.54,null,null,0,""]
[2,2,2,33,2,6,0,0,0,76,33,"","Nível 2","Nível 2","-","SINAPI",null,"INSTALAÇÕES ELÉTRICAS","-",null,null,null,0,""]
["S",2,"S",0,2,6,0,0,0,0,0,"","Serviço","Serviço","-","AGETOP",70351,"BRACADEIRA METALICA TIPO \"U\" DIAM. 3/4\"","Un    ",30,null,null,0,""]
["S",2,"S",0,2,6,0,0,0,0,0,"","Serviço","Serviço","-","AGETOP",70352,"BRACADEIRA METALICA TIPO \"U\" DIAM. 1\"","Un    ",10,null,null,0,""]
["S",2,"S",0,2,6,0,0,0,0,0,"","Serviço","Serviço","-","AGETOP",70353,"BRACADEIRA METALICA TIPO \"U\" DIAM. 1.1/4\"","Un    ",2,null,null,0,""]
["S",2,"S",0,2,6,0,0,0,0,0,"","Serviço","Serviço","-","AGETOP",70391,"BUCHA DE NYLON S-6","Un    ",200,null,null,0,""]
["S",2,"S",0,2,6,0,0,0,0,0,"","Serviço","Serviço","-","AGETOP",70421,"BUCHA E ARRUELA METALICA DIAM. 3/4\"","PR    ",30,null,null,0,""]
["S",2,"S",0,2,6,0,0,0,0,0,"","Serviço","Serviço","-","AGETOP",70422,"BUCHA E ARRUELA METALICA DIAM. 1\"","PR    ",10,null,null,0,""]
["S",2,"S",0,2,6,0,0,0,0,0,"","Serviço","Serviço","-","AGETOP",70423,"BUCHA E ARRUELA METALICA DIAM. 1.1/4\"","PR    ",2,null,null,0,""]
["S",2,"S",0,2,6,0,0,0,0,0,"","Serviço","Serviço","-","SINAPI",91927,"CABO DE COBRE FLEXÍVEL ISOLADO, 2,5 MM², ANTI-CHAMA 0,6/1,0 KV, PARA CIRCUITOS TERMINAIS - FORNECIMENTO E INSTALAÇÃO. AF_12/2015","M",572,null,null,0,"Referência: AGETOP - 70581"]
["S",2,"S",0,2,6,0,0,0,0,0,"","Serviço","Serviço","-","SINAPI",91929,"CABO DE COBRE FLEXÍVEL ISOLADO, 4 MM², ANTI-CHAMA 0,6/1,0 KV, PARA CIRCUITOS TERMINAIS - FORNECIMENTO E INSTALAÇÃO. AF_12/2015","M",304,null,null,0,"Referência: AGETOP - 70582"]
["S",2,"S",0,2,6,0,0,0,0,0,"","Serviço","Serviço","-","SINAPI",83446,"CAIXA DE PASSAGEM 30X30X40 COM TAMPA E DRENO BRITA","UN",1,null,null,0,""]
["S",2,"S",0,2,6,0,0,0,0,0,"","Serviço","Serviço","-","SINAPI",91936,"CAIXA OCTOGONAL 4\" X 4\", PVC, INSTALADA EM LAJE - FORNECIMENTO E INSTALAÇÃO. AF_12/2015","UN",12,null,null,0,""]
["S",2,"S",0,2,6,0,0,0,0,0,"","Serviço","Serviço","-","SINAPI",92867,"CAIXA RETANGULAR 4\" X 2\" ALTA (2,00 M DO PISO), METÁLICA, INSTALADA EM PAREDE - FORNECIMENTO E INSTALAÇÃO. AF_12/2015","UN",4,null,null,0,""]
["S",2,"S",0,2,6,0,0,0,0,0,"","Serviço","Serviço","-","SINAPI",92867,"CAIXA RETANGULAR 4\" X 2\" ALTA (2,00 M DO PISO), METÁLICA, INSTALADA EM PAREDE - FORNECIMENTO E INSTALAÇÃO. AF_12/2015","UN",3,null,null,0,""]
["S",2,"S",0,2,6,0,0,0,0,0,"","Serviço","Serviço","-","SINAPI",92869,"CAIXA RETANGULAR 4\" X 2\" BAIXA (0,30 M DO PISO), METÁLICA, INSTALADA EM PAREDE - FORNECIMENTO E INSTALAÇÃO. AF_12/2015","UN",6,null,null,0,""]
["S",2,"S",0,2,6,0,0,0,0,0,"","Serviço","Serviço","-","SINAPI",91914,"CURVA 90 GRAUS PARA ELETRODUTO, PVC, ROSCÁVEL, DN 25 MM (3/4\"), PARA CIRCUITOS TERMINAIS, INSTALADA EM PAREDE - FORNECIMENTO E INSTALAÇÃO. AF_12/2015","UN",4,null,null,0,""]
["S",2,"S",0,2,6,0,0,0,0,0,"","Serviço","Serviço","-","SINAPI",93655,"DISJUNTOR MONOPOLAR TIPO DIN, CORRENTE NOMINAL DE 20A - FORNECIMENTO E INSTALAÇÃO. AF_04/2016","UN",2,null,null,0,""]
["S",2,"S",0,2,6,0,0,0,0,0,"","Serviço","Serviço","-","SINAPI",93656,"DISJUNTOR MONOPOLAR TIPO DIN, CORRENTE NOMINAL DE 25A - FORNECIMENTO E INSTALAÇÃO. AF_04/2016","UN",4,null,null,0,""]
["S",2,"S",0,2,6,0,0,0,0,0,"","Serviço","Serviço","-","SINAPI",93671,"DISJUNTOR TRIPOLAR TIPO DIN, CORRENTE NOMINAL DE 32A - FORNECIMENTO E INSTALAÇÃO. AF_04/2016","UN",1,null,null,0,"Referência: AGETOP - 71173"]
["S",2,"S",0,2,6,0,0,0,0,0,"","Serviço","Serviço","-","SINAPI",91871,"ELETRODUTO RÍGIDO ROSCÁVEL, PVC, DN 25 MM (3/4\"), PARA CIRCUITOS TERMINAIS, INSTALADO EM PAREDE - FORNECIMENTO E INSTALAÇÃO. AF_12/2015","M",90,null,null,0,"Referência: AGETOP - 71201"]
["S",2,"S",0,2,6,0,0,0,0,0,"","Serviço","Serviço","-","SINAPI",91872,"ELETRODUTO RÍGIDO ROSCÁVEL, PVC, DN 32 MM (1\"), PARA CIRCUITOS TERMINAIS, INSTALADO EM PAREDE - FORNECIMENTO E INSTALAÇÃO. AF_12/2015","M",30,null,null,0,"Referência: AGETOP - 71202"]
["S",2,"S",0,2,6,0,0,0,0,0,"","Serviço","Serviço","-","SINAPI",91873,"ELETRODUTO RÍGIDO ROSCÁVEL, PVC, DN 40 MM (1 1/4\"), PARA CIRCUITOS TERMINAIS, INSTALADO EM PAREDE - FORNECIMENTO E INSTALAÇÃO. AF_12/2015","M",6,null,null,0,""]
["S",2,"S",0,2,6,0,0,0,0,0,"","Serviço","Serviço","-","SINAPI",91953,"INTERRUPTOR SIMPLES (1 MÓDULO), 10A/250V, INCLUINDO SUPORTE E PLACA - FORNECIMENTO E INSTALAÇÃO. AF_12/2015","UN",3,null,null,0,"Referência: AGETOP - 71440"]
["S",2,"S",0,2,6,0,0,0,0,0,"","Serviço","Serviço","-","SINAPI",97611,"LÂMPADA COMPACTA FLUORESCENTE DE 15 W, BASE E27 - FORNECIMENTO E INSTALAÇÃO. AF_11/2017","UN",29,null,null,0,"Referência: AGETOP - 71567"]
["S",2,"S",0,2,6,0,0,0,0,0,"","Serviço","Serviço","-","SINAPI",97591,"LUMINÁRIA TIPO PLAFON REDONDO COM VIDRO FOSCO, DE SOBREPOR, COM 2 LÂMPADAS DE 15 W - FORNECIMENTO E INSTALAÇÃO. AF_11/2017","UN",12,null,null,0,""]
["S",2,"S",0,2,6,0,0,0,0,0,"","Serviço","Serviço","-","SINAPI",97593,"LUMINÁRIA TIPO SPOT, DE SOBREPOR, COM 1 LÂMPADA DE 15 W - FORNECIMENTO E INSTALAÇÃO. AF_11/2017","UN",5,null,null,0,"Referência: AGETOP - 71688"]
["S",2,"S",0,2,6,0,0,0,0,0,"","Serviço","Serviço","-","SINAPI",91884,"LUVA PARA ELETRODUTO, PVC, ROSCÁVEL, DN 25 MM (3/4\"), PARA CIRCUITOS TERMINAIS, INSTALADA EM PAREDE - FORNECIMENTO E INSTALAÇÃO. AF_12/2015","UN",30,null,null,0,"Referência: AGETOP - 71741"]
["S",2,"S",0,2,6,0,0,0,0,0,"","Serviço","Serviço","-","SINAPI",91885,"LUVA PARA ELETRODUTO, PVC, ROSCÁVEL, DN 32 MM (1\"), PARA CIRCUITOS TERMINAIS, INSTALADA EM PAREDE - FORNECIMENTO E INSTALAÇÃO. AF_12/2015","UN",10,null,null,0,"Referência: AGETOP - 71742"]
["S",2,"S",0,2,6,0,0,0,0,0,"","Serviço","Serviço","-","SINAPI",91886,"LUVA PARA ELETRODUTO, PVC, ROSCÁVEL, DN 40 MM (1 1/4\"), PARA CIRCUITOS TERMINAIS, INSTALADA EM PAREDE - FORNECIMENTO E INSTALAÇÃO. AF_12/2015","UN",2,null,null,0,""]
["S",2,"S",0,2,6,0,0,0,0,0,"","Serviço","Serviço","-","AGETOP",71861,"PARAFUSO P/BUCHA S-6","Un    ",200,null,null,0,""]
["S",2,"S",0,2,6,0,0,0,0,0,"","Serviço","Serviço","-","SINAPI",83463,"QUADRO DE DISTRIBUICAO DE ENERGIA EM CHAPA DE ACO GALVANIZADO, PARA 12 DISJUNTORES TERMOMAGNETICOS MONOPOLARES, COM BARRAMENTO TRIFASICO E NEUTRO - FORNECIMENTO E INSTALACAO","UN",1,null,null,0,""]
["S",2,"S",0,2,6,0,0,0,0,0,"","Serviço","Serviço","-","SINAPI",91996,"TOMADA MÉDIA DE EMBUTIR (1 MÓDULO), 2P+T 10 A, INCLUINDO SUPORTE E PLACA - FORNECIMENTO E INSTALAÇÃO. AF_12/2015","UN",6,null,null,0,"Referência: AGETOP - 72578"]
["S",2,"S",0,2,6,0,0,0,0,0,"","Serviço","Serviço","-","SINAPI",91993,"TOMADA ALTA DE EMBUTIR (1 MÓDULO), 2P+T 20 A, INCLUINDO SUPORTE E PLACA - FORNECIMENTO E INSTALAÇÃO. AF_12/2015","UN",4,null,null,0,"Referência: AGETOP - 72585"]
[2,2,2,3,2,7,0,0,0,43,3,"","Nível 2","Nível 2","-",null,null,"ALVENARIAS E DIVISÓRIAS","-",null,null,null,0,""]
["S",2,"S",0,2,7,0,0,0,{"$f":"IF(OR($C675=\"S\",$C675=0),0,MATCH(0,OFFSET($D675,1,$C675,ROW($C$1047)-ROW($C675)),0))","v":0},{"$f":"IF(OR($C675=\"S\",$C675=0),0,MATCH(OFFSET($D675,0,$C675)+1,OFFSET($D675,1,$C675,ROW($C$1047)-ROW($C675)),0))","v":0},"","Serviço","Serviço","-","SINAPI",87503,"ALVENARIA DE VEDAÇÃO DE BLOCOS CERÂMICOS FURADOS NA HORIZONTAL DE 9X19X19CM (ESPESSURA 9CM) DE PAREDES COM ÁREA LÍQUIDA MAIOR OU IGUAL A 6M² SEM VÃOS E ARGAMASSA DE ASSENTAMENTO COM PREPARO EM BETONEIRA. AF_06/2014","M2",137.08000000000001,null,null,0,"Referência: AGETOP - 100201"]
["S",2,"S",0,2,7,0,0,0,0,0,"","Serviço","Serviço","-","SINAPI",93201,"FIXAÇÃO (ENCUNHAMENTO) DE ALVENARIA DE VEDAÇÃO COM ARGAMASSA APLICADA COM COLHER. AF_03/2016","M",49.2,null,null,0,""]
[2,2,2,2,2,8,0,0,0,40,2,"","Nível 2","Nível 2","-",null,null,"IMPERMEABILIZAÇÃO","-",null,null,null,0,""]
["S",2,"S",0,2,8,0,0,0,0,0,"","Serviço","Serviço","-","SINAPI","74106/1","IMPERMEABILIZACAO DE ESTRUTURAS ENTERRADAS, COM TINTA ASFALTICA, DUAS DEMAOS.","M2",41.02,null,null,0,""]
[2,2,2,2,2,9,0,0,0,38,2,"","Nível 2","Nível 2","-",null,null,"ESTRUTURAS METÁLICAS","-",null,null,null,0,""]
["S",2,"S",0,2,9,0,0,0,0,0,"","Serviço","Serviço","-","AGETOP",150103,"ESTRUTURA METÁLICA CONVENCIONAL EM AÇO DO TIPO USI SAC-300 COM FUNDO ANTICORROSIVO","Kg    ",2688.02,null,null,0,""]
[2,2,2,4,2,10,0,0,0,36,4,"","Nível 2","Nível 2","-",null,null,"COBERTURAS","-",null,null,null,0,""]
["S",2,"S",0,2,10,0,0,0,0,0,"","Serviço","Serviço","-","SINAPI",94445,"TELHAMENTO COM TELHA CERÂMICA CAPA-CANAL, TIPO PLAN, COM ATÉ 2 ÁGUAS, INCLUSO TRANSPORTE VERTICAL. AF_07/2019","M2",162.19,null,null,0,"Referência: AGETOP - 160401"]
["S",2,"S",0,2,10,0,0,0,0,0,"","Serviço","Serviço","-","SINAPI",94221,"CUMEEIRA PARA TELHA CERÂMICA EMBOÇADA COM ARGAMASSA TRAÇO 1:2:9 (CIMENTO, CAL E AREIA) PARA TELHADOS COM ATÉ 2 ÁGUAS, INCLUSO TRANSPORTE VERTICAL. AF_07/2019","M",16.55,null,null,0,""]
["S",2,"S",0,2,10,0,0,0,0,0,"","Serviço","Serviço","-","SINAPI",94224,"EMBOÇAMENTO COM ARGAMASSA TRAÇO 1:2:9 (CIMENTO, CAL E AREIA). AF_07/2019","M",52.7,null,null,0,"Referência: AGETOP - 160403"]
[2,2,2,4,2,11,0,0,0,32,4,"","Nível 2","Nível 2","-",null,null,"ESQUADRIAS METÁLICAS","-",null,null,null,0,""]
["S",2,"S",0,2,11,0,0,0,0,0,"","Serviço","Serviço","-","SINAPI",94562,"JANELA DE AÇO DE CORRER, 4 FOLHAS, FIXAÇÃO COM ARGAMASSA, SEM VIDROS, PADRONIZADA. AF_07/2016","M2",9.6,null,null,0,"Referência: AGETOP - 180401"]
["S",2,"S",0,2,11,0,0,0,0,0,"","Serviço","Serviço","-","SINAPI",94559,"JANELA DE AÇO BASCULANTE, FIXAÇÃO COM ARGAMASSA, SEM VIDROS, PADRONIZADA. AF_07/2016","M2",4.8,null,null,0,"Referência: AGETOP - 180404"]
["S",2,"S",0,2,11,0,0,0,0,0,"","Serviço","Serviço","-","SINAPI","73933/4","PORTA DE FERRO DE ABRIR TIPO BARRA CHATA, COM REQUADRO E GUARNICAO COMPLETA","M2",3.36,null,null,0,"Referência: AGETOP - 180501"]
[2,2,2,2,2,12,0,0,0,28,2,"","Nível 2","Nível 2","-",null,null,"VIDROS","-",null,null,null,0,""]
["S",2,"S",0,2,12,0,0,0,0,0,"","Serviço","Serviço","-","SINAPI",72117,"VIDRO LISO COMUM TRANSPARENTE, ESPESSURA 4MM","M2",14.399999999999999,null,null,0,"Referência: AGETOP - 190102"]
[2,2,2,4,2,13,0,0,0,26,4,"","Nível 2","Nível 2","-",null,null,"REVESTIMENTO DE PAREDE","-",null,null,null,0,""]
["S",2,"S",0,2,13,0,0,0,0,0,"","Serviço","Serviço","-","SINAPI",87879,"CHAPISCO APLICADO EM ALVENARIAS E ESTRUTURAS DE CONCRETO INTERNAS, COM COLHER DE PEDREIRO.  ARGAMASSA TRAÇO 1:3 COM PREPARO EM BETONEIRA 400L. AF_06/2014","M2",274.18,null,null,0,""]
["S",2,"S",0,2,13,0,0,0,0,0,"","Serviço","Serviço","-","SINAPI",87548,"MASSA ÚNICA, PARA RECEBIMENTO DE PINTURA, EM ARGAMASSA TRAÇO 1:2:8, PREPARO MANUAL, APLICADA MANUALMENTE EM FACES INTERNAS DE PAREDES, ESPESSURA DE 10MM, COM EXECUÇÃO DE TALISCAS. AF_06/2014","M2",274.18,null,null,0,"Referência: AGETOP - 200500"]
["S",2,"S",0,2,13,0,0,0,0,0,"","Serviço","Serviço","-","SINAPI",84088,"PEITORIL EM MARMORE BRANCO, LARGURA DE 15CM, ASSENTADO COM ARGAMASSA TRACO 1:4 (CIMENTO E AREIA MEDIA), PREPARO MANUAL DA ARGAMASSA","M",16,null,null,0,""]
[2,2,2,2,2,14,0,0,0,22,2,"","Nível 2","Nível 2","-",null,null,"FORROS","-",null,null,null,0,""]
["S",2,"S",0,2,14,0,0,0,0,0,"","Serviço","Serviço","-","SINAPI",87414,"APLICAÇÃO MANUAL DE GESSO DESEMPENADO (SEM TALISCAS) EM TETO DE AMBIENTES DE ÁREA MAIOR QUE 10M², ESPESSURA DE 1,0CM. AF_06/2014","M2",97.02,null,null,0,"Referência: AGETOP - 210515"]
[2,2,2,5,2,15,0,0,0,20,5,"","Nível 2","Nível 2","-","SINAPI",null,"REVESTIMENTO DE PISO","-",null,null,null,0,""]
["S",2,"S",0,2,15,0,0,0,0,0,"","Serviço","Serviço","-","SINAPI",95240,"LASTRO DE CONCRETO MAGRO, APLICADO EM PISOS OU RADIERS, ESPESSURA DE 3 CM. AF_07/2016","M2",127.26,null,null,0,""]
["S",2,"S",0,2,15,0,0,0,0,0,"","Serviço","Serviço","-","SINAPI",94992,"EXECUÇÃO DE PASSEIO (CALÇADA) OU PISO DE CONCRETO COM CONCRETO MOLDADO IN LOCO, FEITO EM OBRA, ACABAMENTO CONVENCIONAL, ESPESSURA 6 CM, ARMADO. AF_07/2016","M2",29.7,null,null,0,""]
["S",2,"S",0,2,15,0,0,0,0,0,"","Serviço","Serviço","-","SINAPI",84191,"PISO EM GRANILITE, MARMORITE OU GRANITINA ESPESSURA 8 MM, INCLUSO JUNTAS DE DILATACAO PLASTICAS","M2",119.74,null,null,0,"Referência: AGETOP - 221101"]
["S",2,"S",0,2,15,0,0,0,0,0,"","Serviço","Serviço","-","AGETOP",221104,"RASPAGEM E APLICAÇÃO RESINA ACRÍLICA DUAS DEMÃOS","m2    ",124.44,null,null,0,""]
[2,2,2,2,2,16,0,0,0,15,2,"","Nível 2","Nível 2","-","SINAPI",null,"MARCENARIA","-",null,null,null,0,""]
["S",2,"S",0,2,16,0,0,0,0,0,"","Serviço","Serviço","-","AGETOP",240106,"BATE CARTEIRA ENVERNIZADO E ASSENT. 2,5 X 12 CM","M     ",40.64,null,null,0,""]
[2,2,2,10,2,17,0,0,0,13,10,"","Nível 2","Nível 2","-","SINAPI",null,"PINTURA","-",null,null,null,0,""]
["S",2,"S",0,2,17,0,0,0,0,0,"","Serviço","Serviço","-","SINAPI","74145/1","PINTURA ESMALTE FOSCO, DUAS DEMAOS, SOBRE SUPERFICIE METALICA, INCLUSO UMA DEMAO DE FUNDO ANTICORROSIVO. UTILIZACAO DE REVOLVER ( AR-COMPRIMIDO).","M2",324.38,null,null,0,"Referência: AGETOP - 261602"]
["S",2,"S",0,2,17,0,0,0,0,0,"","Serviço","Serviço","-","SINAPI",88423,"APLICAÇÃO MANUAL DE PINTURA COM TINTA TEXTURIZADA ACRÍLICA EM PAREDES EXTERNAS DE CASAS, UMA COR. AF_06/2014","M2",94.09,null,null,0,"Referência: AGETOP - 260601"]
["S",2,"S",0,2,17,0,0,0,0,0,"","Serviço","Serviço","-","SINAPI",88489,"APLICAÇÃO MANUAL DE PINTURA COM TINTA LÁTEX ACRÍLICA EM PAREDES, DUAS DEMÃOS. AF_06/2014","M2",90.52,null,null,0,"Referência: AGETOP - 261001"]
["S",2,"S",0,2,17,0,0,0,0,0,"","Serviço","Serviço","-","SINAPI",88497,"APLICAÇÃO E LIXAMENTO DE MASSA LÁTEX EM PAREDES, DUAS DEMÃOS. AF_06/2014","M2",183.44,null,null,0,"Referência: AGETOP - 261300"]
["S",2,"S",0,2,17,0,0,0,0,0,"","Serviço","Serviço","-","AGETOP",261550,"PINT.ESMALTE SINT.PAREDES - 2 DEM.C/SELADOR","m2    ",92.92,null,null,0,""]
["S",2,"S",0,2,17,0,0,0,0,0,"","Serviço","Serviço","-","SINAPI",88496,"APLICAÇÃO E LIXAMENTO DE MASSA LÁTEX EM TETO, DUAS DEMÃOS. AF_06/2014","M2",97.02,null,null,0,"Referência: AGETOP - 261300"]
["S",2,"S",0,2,17,0,0,0,0,0,"","Serviço","Serviço","-","SINAPI",88486,"APLICAÇÃO MANUAL DE PINTURA COM TINTA LÁTEX PVA EM TETO, DUAS DEMÃOS. AF_06/2014","M2",97.02,null,null,0,"Referência: AGETOP - 261307"]
["S",2,"S",0,2,17,0,0,0,0,0,"","Serviço","Serviço","-","SINAPI","74145/1","PINTURA ESMALTE FOSCO, DUAS DEMAOS, SOBRE SUPERFICIE METALICA, INCLUSO UMA DEMAO DE FUNDO ANTICORROSIVO. UTILIZACAO DE REVOLVER ( AR-COMPRIMIDO).","M2",35.520000000000003,null,null,0,"Referência: AGETOP - 261602"]
["S",2,"S",0,2,17,0,0,0,0,0,"","Serviço","Serviço","-","AGETOP",261623,"LETREIRO PEQ.PORTE A PINCEL EM PAREDE E PORTAS","m2    ",0.64,null,null,0,""]
[2,2,2,3,2,18,0,0,0,3,322,"","Nível 2","Nível 2","-","SINAPI",null,"DIVERSOS","-",null,null,null,0,""]
["S",2,"S",0,2,18,0,0,0,0,0,"","Serviço","Serviço","-","AGETOP",271210,"QUADRO DE GIZ EMBOÇO/PINTURA COMPLETO","m2    ",10.08,null,null,0,""]
["S",2,"S",0,2,18,0,0,0,0,0,"","Serviço","Serviço","-","AGETOP",270501,"LIMPEZA FINAL DE OBRA - (OBRAS CIVIS)","m2    ",127.26,null,null,0,""]
[1,1,1,108,3,0,0,0,0,330,108,"F","Nível 1","Nível 1","3.","SINAPI",null,"PÁTIO MULTIUSO - PADRÃO SEDUC - OPÇÃO 03","-",null,null,null,0,""]
[2,2,2,2,3,1,0,0,0,107,2,"","Nível 2","Nível 2","-","SINAPI",null,"SERVIÇOS PRELIMINARES","-",null,null,null,0,""]
["S",2,"S",0,3,1,0,0,0,0,0,"","Serviço","Serviço","-","AGETOP",20701,"LOCAÇÃO DA OBRA, EXECUÇÃO DE GABARITO SEM REAPROVEITAMENTO, INCLUSO PINTURA (FACE INTERNA DO RIPÃO 15CM) E PIQUETE COM TESTEMUNHA","m2    ",133.97999999999999,null,null,0,""]
[2,2,2,3,3,2,0,0,0,105,3,"","Nível 2","Nível 2","-","SINAPI",null,"TRANSPORTES","-",null,null,null,0,""]
["S",2,"S",0,3,2,0,0,0,0,0,"","Serviço","Serviço","-","SINAPI",72897,"CARGA MANUAL DE ENTULHO EM CAMINHAO BASCULANTE 6 M3","M3",9.3699999999999992,null,null,0,""]
["S",2,"S",0,3,2,0,0,0,0,0,"","Serviço","Serviço","-","SINAPI",72900,"TRANSPORTE DE ENTULHO COM CAMINHAO BASCULANTE 6 M3, RODOVIA PAVIMENTADA, DMT 0,5 A 1,0 KM","M3",9.3699999999999992,null,null,0,""]
[2,2,2,3,3,3,0,0,0,102,3,"","Nível 2","Nível 2","-","SINAPI",null,"SERVIÇO EM TERRA","-",null,null,null,0,""]
["S",2,"S",0,3,3,0,0,0,0,0,"","Serviço","Serviço","-","SINAPI",93358,"ESCAVAÇÃO MANUAL DE VALA COM PROFUNDIDADE MENOR OU IGUAL A 1,30 M. AF_03/2016","M3",6.69,null,null,0,"Referência: AGETOP - 40101"]
["S",2,"S",0,3,3,0,0,0,0,0,"","Serviço","Serviço","-","AGETOP",41002,"APILOAMENTO","m2    ",133.97999999999999,null,null,0,""]
[2,2,2,11,3,4,0,0,0,99,11,"","Nível 2","Nível 2","-","SINAPI",null,"FUNDAÇÕES E SONDAGENS","-",null,null,null,0,""]
["S",2,"S",0,3,4,0,0,0,0,0,"","Serviço","Serviço","-","SINAPI",98230,"ESTACA BROCA DE CONCRETO, DIÂMETRO DE 30 CM, PROFUNDIDADE DE ATÉ 3 M, ESCAVAÇÃO MANUAL COM TRADO CONCHA, NÃO ARMADA. AF_03/2018","M",49,null,null,0,"Referência: AGETOP - 50302"]
["S",2,"S",0,3,4,0,0,0,0,0,"","Serviço","Serviço","-","SINAPI",96521,"ESCAVAÇÃO MECANIZADA PARA BLOCO DE COROAMENTO OU SAPATA, COM PREVISÃO DE FÔRMA, COM RETROESCAVADEIRA. AF_06/2017","M3",4.8600000000000003,null,null,0,""]
["S",2,"S",0,3,4,0,0,0,0,0,"","Serviço","Serviço","-","SINAPI",93382,"REATERRO MANUAL DE VALAS COM COMPACTAÇÃO MECANIZADA. AF_04/2016","M3",0.36,null,null,0,"Referência: AGETOP - 40904"]
["S",2,"S",0,3,4,0,0,0,0,0,"","Serviço","Serviço","-","SINAPI",96534,"FABRICAÇÃO, MONTAGEM E DESMONTAGEM DE FÔRMA PARA BLOCO DE COROAMENTO, EM MADEIRA SERRADA, E=25 MM, 4 UTILIZAÇÕES. AF_06/2017","M2",4.5,null,null,0,"Referência: AGETOP - 51009"]
["S",2,"S",0,3,4,0,0,0,0,0,"","Serviço","Serviço","-","SINAPI",94963,"CONCRETO FCK = 15MPA, TRAÇO 1:3,4:3,5 (CIMENTO/ AREIA MÉDIA/ BRITA 1)  - PREPARO MECÂNICO COM BETONEIRA 400 L. AF_07/2016","M3",0.23,null,null,0,""]
["S",2,"S",0,3,4,0,0,0,0,0,"","Serviço","Serviço","-","SINAPI",94964,"CONCRETO FCK = 20MPA, TRAÇO 1:2,7:3 (CIMENTO/ AREIA MÉDIA/ BRITA 1)  - PREPARO MECÂNICO COM BETONEIRA 400 L. AF_07/2016","M3",2.7,null,null,0,""]
["S",2,"S",0,3,4,0,0,0,0,0,"","Serviço","Serviço","-","SINAPI",92874,"LANÇAMENTO COM USO DE BOMBA, ADENSAMENTO E ACABAMENTO DE CONCRETO EM ESTRUTURAS. AF_12/2015","M3",2.93,null,null,0,""]
["S",2,"S",0,3,4,0,0,0,0,0,"","Serviço","Serviço","-","SINAPI",96544,"ARMAÇÃO DE BLOCO, VIGA BALDRAME OU SAPATA UTILIZANDO AÇO CA-50 DE 6,3 MM - MONTAGEM. AF_06/2017","KG",33,null,null,0,"Referência: AGETOP - 52003"]
["S",2,"S",0,3,4,0,0,0,0,0,"","Serviço","Serviço","-","SINAPI",96545,"ARMAÇÃO DE BLOCO, VIGA BALDRAME OU SAPATA UTILIZANDO AÇO CA-50 DE 8 MM - MONTAGEM. AF_06/2017","KG",148,null,null,0,"Referência: AGETOP - 52004"]
["S",2,"S",0,3,4,0,0,0,0,0,"","Serviço","Serviço","-","SINAPI",96543,"ARMAÇÃO DE BLOCO, VIGA BALDRAME E SAPATA UTILIZANDO AÇO CA-60 DE 5 MM - MONTAGEM. AF_06/2017","KG",26,null,null,0,"Referência: AGETOP - 52014"]
[2,2,2,8,3,5,0,0,0,88,8,"","Nível 2","Nível 2","-","SINAPI",null,"ESTRUTURA","-",null,null,null,0,""]
["S",2,"S",0,3,5,0,0,0,0,0,"","Serviço","Serviço","-","SINAPI",92415,"MONTAGEM E DESMONTAGEM DE FÔRMA DE PILARES RETANGULARES E ESTRUTURAS SIMILARES COM ÁREA MÉDIA DAS SEÇÕES MAIOR QUE 0,25 M², PÉ-DIREITO SIMPLES, EM CHAPA DE MADEIRA COMPENSADA RESINADA, 2 UTILIZAÇÕES. AF_12/2015","M2",40.270000000000003,null,null,0,""]
["S",2,"S",0,3,5,0,0,0,{"$f":"IF(OR($C739=\"S\",$C739=0),0,MATCH(0,OFFSET($D739,1,$C739,ROW($C$1047)-ROW($C739)),0))","v":0},{"$f":"IF(OR($C739=\"S\",$C739=0),0,MATCH(OFFSET($D739,0,$C739)+1,OFFSET($D739,1,$C739,ROW($C$1047)-ROW($C739)),0))","v":0},"","Serviço","Serviço","-","AGETOP",60192,"FORMA DE TABUA CINTA/PILAR SOBRE/ENTRE ALVENARIA U=8 VEZES","m2    ",93.44,null,null,0,""]
["S",2,"S",0,3,5,0,0,0,0,0,"","Serviço","Serviço","-","SINAPI",92777,"ARMAÇÃO DE PILAR OU VIGA DE UMA ESTRUTURA CONVENCIONAL DE CONCRETO ARMADO EM UMA EDIFICAÇÃO TÉRREA OU SOBRADO UTILIZANDO AÇO CA-50 DE 8,0 MM - MONTAGEM. AF_12/2015","KG",104,null,null,0,"Referência: AGETOP - 60304"]
["S",2,"S",0,3,5,0,0,0,0,0,"","Serviço","Serviço","-","SINAPI",92778,"ARMAÇÃO DE PILAR OU VIGA DE UMA ESTRUTURA CONVENCIONAL DE CONCRETO ARMADO EM UMA EDIFICAÇÃO TÉRREA OU SOBRADO UTILIZANDO AÇO CA-50 DE 10,0 MM - MONTAGEM. AF_12/2015","KG",295,null,null,0,"Referência: AGETOP - 60305"]
["S",2,"S",0,3,5,0,0,0,0,0,"","Serviço","Serviço","-","SINAPI",92775,"ARMAÇÃO DE PILAR OU VIGA DE UMA ESTRUTURA CONVENCIONAL DE CONCRETO ARMADO EM UMA EDIFICAÇÃO TÉRREA OU SOBRADO UTILIZANDO AÇO CA-60 DE 5,0 MM - MONTAGEM. AF_12/2015","KG",143,null,null,0,"Referência: AGETOP - 60314"]
["S",2,"S",0,3,5,0,0,0,0,0,"","Serviço","Serviço","-","SINAPI",94964,"CONCRETO FCK = 20MPA, TRAÇO 1:2,7:3 (CIMENTO/ AREIA MÉDIA/ BRITA 1)  - PREPARO MECÂNICO COM BETONEIRA 400 L. AF_07/2016","M3",5.08,null,null,0,""]
["S",2,"S",0,3,5,0,0,0,0,0,"","Serviço","Serviço","-","SINAPI",92874,"LANÇAMENTO COM USO DE BOMBA, ADENSAMENTO E ACABAMENTO DE CONCRETO EM ESTRUTURAS. AF_12/2015","M3",5.08,null,null,0,""]
[2,2,2,18,3,6,0,0,0,80,18,"","Nível 2","Nível 2","-","SINAPI",null,"INSTALAÇÕES ELÉTRICAS","-",null,null,null,0,""]
["S",2,"S",0,3,6,0,0,0,0,0,"","Serviço","Serviço","-","AGETOP",70351,"BRACADEIRA METALICA TIPO \"U\" DIAM. 3/4\"","Un    ",30,null,null,0,""]
["S",2,"S",0,3,6,0,0,0,0,0,"","Serviço","Serviço","-","AGETOP",70421,"BUCHA E ARRUELA METALICA DIAM. 3/4\"","PR    ",15,null,null,0,""]
["S",2,"S",0,3,6,0,0,0,0,0,"","Serviço","Serviço","-","SINAPI",91927,"CABO DE COBRE FLEXÍVEL ISOLADO, 2,5 MM², ANTI-CHAMA 0,6/1,0 KV, PARA CIRCUITOS TERMINAIS - FORNECIMENTO E INSTALAÇÃO. AF_12/2015","M",210,null,null,0,"Referência: AGETOP - 70581"]
["S",2,"S",0,3,6,0,0,0,0,0,"","Serviço","Serviço","-","SINAPI",91936,"CAIXA OCTOGONAL 4\" X 4\", PVC, INSTALADA EM LAJE - FORNECIMENTO E INSTALAÇÃO. AF_12/2015","UN",12,null,null,0,""]
["S",2,"S",0,3,6,0,0,0,0,0,"","Serviço","Serviço","-","SINAPI",91940,"CAIXA RETANGULAR 4\" X 2\" MÉDIA (1,30 M DO PISO), PVC, INSTALADA EM PAREDE - FORNECIMENTO E INSTALAÇÃO. AF_12/2015","UN",5,null,null,0,""]
["S",2,"S",0,3,6,0,0,0,0,0,"","Serviço","Serviço","-","SINAPI",95817,"CONDULETE DE PVC, TIPO X, PARA ELETRODUTO DE PVC SOLDÁVEL DN 25 MM (3/4''), APARENTE - FORNECIMENTO E INSTALAÇÃO. AF_11/2016","UN",5,null,null,0,""]
["S",2,"S",0,3,6,0,0,0,0,0,"","Serviço","Serviço","-","SINAPI",91914,"CURVA 90 GRAUS PARA ELETRODUTO, PVC, ROSCÁVEL, DN 25 MM (3/4\"), PARA CIRCUITOS TERMINAIS, INSTALADA EM PAREDE - FORNECIMENTO E INSTALAÇÃO. AF_12/2015","UN",5,null,null,0,""]
["S",2,"S",0,3,6,0,0,0,0,0,"","Serviço","Serviço","-","SINAPI",93654,"DISJUNTOR MONOPOLAR TIPO DIN, CORRENTE NOMINAL DE 16A - FORNECIMENTO E INSTALAÇÃO. AF_04/2016","UN",4,null,null,0,""]
["S",2,"S",0,3,6,0,0,0,0,0,"","Serviço","Serviço","-","SINAPI",93671,"DISJUNTOR TRIPOLAR TIPO DIN, CORRENTE NOMINAL DE 32A - FORNECIMENTO E INSTALAÇÃO. AF_04/2016","UN",1,null,null,0,"Referência: AGETOP - 71173"]
["S",2,"S",0,3,6,0,0,0,0,0,"","Serviço","Serviço","-","SINAPI",91871,"ELETRODUTO RÍGIDO ROSCÁVEL, PVC, DN 25 MM (3/4\"), PARA CIRCUITOS TERMINAIS, INSTALADO EM PAREDE - FORNECIMENTO E INSTALAÇÃO. AF_12/2015","M",45,null,null,0,"Referência: AGETOP - 71201"]
["S",2,"S",0,3,6,0,0,0,0,0,"","Serviço","Serviço","-","SINAPI",91981,"INTERRUPTOR BIPOLAR (1 MÓDULO), 10A/250V, INCLUINDO SUPORTE E PLACA - FORNECIMENTO E INSTALAÇÃO. AF_09/2017","UN",3,null,null,0,""]
["S",2,"S",0,3,6,0,0,0,0,0,"","Serviço","Serviço","-","SINAPI",91967,"INTERRUPTOR SIMPLES (3 MÓDULOS), 10A/250V, INCLUINDO SUPORTE E PLACA - FORNECIMENTO E INSTALAÇÃO. AF_12/2015","UN",1,null,null,0,"Referência: AGETOP - 71442"]
["S",2,"S",0,3,6,0,0,0,0,0,"","Serviço","Serviço","-","SINAPI",97610,"LÂMPADA COMPACTA DE LED 10 W, BASE E27 - FORNECIMENTO E INSTALAÇÃO. AF_11/2017","UN",24,null,null,0,""]
["S",2,"S",0,3,6,0,0,0,0,0,"","Serviço","Serviço","-","SINAPI",97591,"LUMINÁRIA TIPO PLAFON REDONDO COM VIDRO FOSCO, DE SOBREPOR, COM 2 LÂMPADAS DE 15 W - FORNECIMENTO E INSTALAÇÃO. AF_11/2017","UN",12,null,null,0,""]
["S",2,"S",0,3,6,0,0,0,0,0,"","Serviço","Serviço","-","SINAPI",91884,"LUVA PARA ELETRODUTO, PVC, ROSCÁVEL, DN 25 MM (3/4\"), PARA CIRCUITOS TERMINAIS, INSTALADA EM PAREDE - FORNECIMENTO E INSTALAÇÃO. AF_12/2015","UN",15,null,null,0,"Referência: AGETOP - 71741"]
["S",2,"S",0,3,6,0,0,0,0,0,"","Serviço","Serviço","-","SINAPI",91996,"TOMADA MÉDIA DE EMBUTIR (1 MÓDULO), 2P+T 10 A, INCLUINDO SUPORTE E PLACA - FORNECIMENTO E INSTALAÇÃO. AF_12/2015","UN",3,null,null,0,"Referência: AGETOP - 72578"]
["S",2,"S",0,3,6,0,0,0,0,0,"","Serviço","Serviço","-","SINAPI",91997,"TOMADA MÉDIA DE EMBUTIR (1 MÓDULO), 2P+T 20 A, INCLUINDO SUPORTE E PLACA - FORNECIMENTO E INSTALAÇÃO. AF_12/2015","UN",1,null,null,0,""]
[2,2,2,31,3,7,0,0,0,62,31,"","Nível 2","Nível 2","-","SINAPI",null,"INSTALAÇÕES HIDROSSANITÁRIAS","-",null,null,null,0,""]
[3,3,3,10,3,7,1,0,0,30,10,"","Nível 3","Nível 3","-","SINAPI",null,"PEÇAS E ACESSÓRIOS","-",null,null,null,0,""]
["S",3,"S",0,3,7,1,0,0,0,0,"","Serviço","Serviço","-","AGETOP",81501,"ADESIVO PLASTICO - FRASCO 850 G","Un    ",2,null,null,0,""]
["S",3,"S",0,3,7,1,0,0,0,0,"","Serviço","Serviço","-","AGETOP",81504,"SOLUCAO LIMPADORA 1000 CM3","Un    ",2,null,null,0,""]
["S",3,"S",0,3,7,1,0,0,0,0,"","Serviço","Serviço","-","AGETOP",81825,"CAIXA DE PASSAGEM 60 X 60 CM SEM TAMPA","Un    ",1,null,null,0,""]
["S",3,"S",0,3,7,1,0,0,0,0,"","Serviço","Serviço","-","SINAPI",6171,"TAMPA DE CONCRETO ARMADO 60X60X5CM PARA CAIXA","UN",1,null,null,0,""]
["S",3,"S",0,3,7,1,0,0,0,0,"","Serviço","Serviço","-","SINAPI",86901,"CUBA DE EMBUTIR OVAL EM LOUÇA BRANCA, 35 X 50CM OU EQUIVALENTE - FORNECIMENTO E INSTALAÇÃO. AF_12/2013","UN",2,null,null,0,"Referência: AGETOP - 80587"]
["S",3,"S",0,3,7,1,0,0,0,0,"","Serviço","Serviço","-","AGETOP",80556,"LIGAÇÃO FLEXÍVEL PVC DIAM.1/2\" (ENGATE)","Un    ",2,null,null,0,""]
["S",3,"S",0,3,7,1,0,0,0,0,"","Serviço","Serviço","-","AGETOP",80562,"SIFAO FLEXIVEL UNIVERSAL ( SANFONADO) EM PVC PARA LAVATORIO","Un    ",2,null,null,0,""]
["S",3,"S",0,3,7,1,0,0,0,0,"","Serviço","Serviço","-","SINAPI",86877,"VÁLVULA EM METAL CROMADO 1.1/2\" X 1.1/2\" PARA TANQUE OU LAVATÓRIO, COM OU SEM LADRÃO - FORNECIMENTO E INSTALAÇÃO. AF_12/2013","UN",2,null,null,0,"Referência: AGETOP - 80580"]
["S",3,"S",0,3,7,1,0,0,0,0,"","Serviço","Serviço","-","AGETOP",80570,"TORNEIRA DE MESA PARA LAVATÓRIO DIÂMETRO DE 1/2\"","Un    ",2,null,null,0,""]
[3,3,3,12,3,7,2,0,0,20,12,"","Nível 3","Nível 3","-",null,null,"ÁGUA FRIA","-",null,null,null,0,""]
["S",3,"S",0,3,7,2,0,0,0,0,"","Serviço","Serviço","-","AGETOP",80927,"REGISTRO DE GAVETA C/CANOPLA DIAMETRO 1\"","Un    ",1,null,null,0,""]
["S",3,"S",0,3,7,2,0,0,0,0,"","Serviço","Serviço","-","SINAPI",89402,"TUBO, PVC, SOLDÁVEL, DN 25MM, INSTALADO EM RAMAL DE DISTRIBUIÇÃO DE ÁGUA - FORNECIMENTO E INSTALAÇÃO. AF_12/2014","M",3,null,null,0,"Referência: AGETOP - 81003"]
["S",3,"S",0,3,7,2,0,0,0,0,"","Serviço","Serviço","-","SINAPI",89447,"TUBO, PVC, SOLDÁVEL, DN 32MM, INSTALADO EM PRUMADA DE ÁGUA - FORNECIMENTO E INSTALAÇÃO. AF_12/2014","M",6,null,null,0,""]
["S",3,"S",0,3,7,2,0,0,0,0,"","Serviço","Serviço","-","SINAPI",94709,"ADAPTADOR COM FLANGES LIVRES, PVC, SOLDÁVEL, DN 32 MM X 1 , INSTALADO EM RESERVAÇÃO DE ÁGUA DE EDIFICAÇÃO QUE POSSUA RESERVATÓRIO DE FIBRA/FIBROCIMENTO   FORNECIMENTO E INSTALAÇÃO. AF_06/2016","UN",2,null,null,0,"Referência: AGETOP - 81042"]
["S",3,"S",0,3,7,2,0,0,0,0,"","Serviço","Serviço","-","SINAPI",96662,"BUCHA DE REDUÇÃO, PPR, 32 X 25, CLASSE PN 25, INSTALADO EM RAMAL DE DISTRIBUIÇÃO DE ÁGUA \u0096 FORNECIMENTO E INSTALAÇÃO . AF_06/2015","UN",1,null,null,0,""]
["S",3,"S",0,3,7,2,0,0,0,0,"","Serviço","Serviço","-","SINAPI",89481,"JOELHO 90 GRAUS, PVC, SOLDÁVEL, DN 25MM, INSTALADO EM PRUMADA DE ÁGUA - FORNECIMENTO E INSTALAÇÃO. AF_12/2014","UN",1,null,null,0,""]
["S",3,"S",0,3,7,2,0,0,0,0,"","Serviço","Serviço","-","AGETOP",81341,"JOELHO 90 GRAUS ROSCAVEL 1/2\" (MARROM)","Un    ",3,null,null,0,""]
["S",3,"S",0,3,7,2,0,0,0,0,"","Serviço","Serviço","-","AGETOP",81342,"JOELHO 90 GRAUS ROSCAVEL DIAMETRO 3/4\"","Un    ",1,null,null,0,""]
["S",3,"S",0,3,7,2,0,0,0,0,"","Serviço","Serviço","-","AGETOP",81322,"JOELHO 90 GRAUS SOLDAVEL DIAMETRO 32 MM (1\")","Un    ",20,null,null,0,""]
["S",3,"S",0,3,7,2,0,0,0,0,"","Serviço","Serviço","-","AGETOP",81421,"TE REDUCAO 90 GRAUS SOLDAVEL 32 X 25 mm","Un    ",2,null,null,0,""]
["S",3,"S",0,3,7,2,0,0,0,0,"","Serviço","Serviço","-","SINAPI",89617,"TE, PVC, SOLDÁVEL, DN 25MM, INSTALADO EM PRUMADA DE ÁGUA - FORNECIMENTO E INSTALAÇÃO. AF_12/2014","UN",1,null,null,0,""]
[3,3,3,8,3,7,3,0,0,8,{"$error":"#N/A"},"","Nível 3","Nível 3","-",null,null,"ESGOTO SANITÁRIO","-",null,null,null,0,""]
["S",3,"S",0,3,7,3,0,0,0,0,"","Serviço","Serviço","-","AGETOP",81663,"CORPO CX. SIFONADA DIAM. 150 X 150 X 50","Un    ",1,null,null,0,""]
["S",3,"S",0,3,7,3,0,0,0,0,"","Serviço","Serviço","-","AGETOP",81752,"GRELHA QUADRADA ACO INOX ROTATIVO DIAM.150 MM","Un    ",1,null,null,0,""]
["S",3,"S",0,3,7,3,0,0,0,0,"","Serviço","Serviço","-","SINAPI",89726,"JOELHO 45 GRAUS, PVC, SERIE NORMAL, ESGOTO PREDIAL, DN 40 MM, JUNTA SOLDÁVEL, FORNECIDO E INSTALADO EM RAMAL DE DESCARGA OU RAMAL DE ESGOTO SANITÁRIO. AF_12/2014","UN",2,null,null,0,""]
["S",3,"S",0,3,7,3,0,0,0,0,"","Serviço","Serviço","-","SINAPI",89724,"JOELHO 90 GRAUS, PVC, SERIE NORMAL, ESGOTO PREDIAL, DN 40 MM, JUNTA SOLDÁVEL, FORNECIDO E INSTALADO EM RAMAL DE DESCARGA OU RAMAL DE ESGOTO SANITÁRIO. AF_12/2014","UN",3,null,null,0,""]
["S",3,"S",0,3,7,3,0,0,0,0,"","Serviço","Serviço","-","AGETOP",81927,"JOELHO 90 GRAUS C/ANEL 40 mm ","Un    ",3,null,null,0,""]
["S",3,"S",0,3,7,3,0,0,0,0,"","Serviço","Serviço","-","SINAPI",89711,"TUBO PVC, SERIE NORMAL, ESGOTO PREDIAL, DN 40 MM, FORNECIDO E INSTALADO EM RAMAL DE DESCARGA OU RAMAL DE ESGOTO SANITÁRIO. AF_12/2014","M",6,null,null,0,"Referência: AGETOP - 82301"]
["S",3,"S",0,3,7,3,0,0,0,0,"","Serviço","Serviço","-","SINAPI",89798,"TUBO PVC, SERIE NORMAL, ESGOTO PREDIAL, DN 50 MM, FORNECIDO E INSTALADO EM PRUMADA DE ESGOTO SANITÁRIO OU VENTILAÇÃO. AF_12/2014","M",3,null,null,0,""]
[2,2,2,4,3,8,0,0,0,31,4,"","Nível 2","Nível 2","-","SINAPI",null,"ALVENARIAS E DIVISÓRIAS","-",null,null,null,0,""]
[{"$f":"CHOOSE(1+LOG(1+2*(ORÇAMENTO.Nivel=\"Nível 1\")+4*(ORÇAMENTO.Nivel=\"Nível 2\")+8*(ORÇAMENTO.Nivel=\"Nível 3\")+16*(ORÇAMENTO.Nivel=\"Nível 4\")+32*(ORÇAMENTO.Nivel=\"Serviço\"),2),0,1,2,3,4,\"S\")","v":"S"},2,"S",0,3,8,0,0,{"$f":"IF(AND($C795<=4,$C795<>0),0,IF(AND($C795=\"S\",$W795>0),OFFSET(I795,-1,0)+1,OFFSET(I795,-1,0)))","v":0},0,0,"","Serviço","Serviço","-","SINAPI",87471,"ALVENARIA DE VEDAÇÃO DE BLOCOS CERÂMICOS FURADOS NA VERTICAL DE 9X19X39CM (ESPESSURA 9CM) DE PAREDES COM ÁREA LÍQUIDA MENOR QUE 6M² SEM VÃOS E ARGAMASSA DE ASSENTAMENTO COM PREPARO EM BETONEIRA. AF_06/2014","M2",56.3,null,null,0,""]
["S",2,"S",0,3,8,0,0,0,0,0,"","Serviço","Serviço","-","SINAPI",93202,"FIXAÇÃO (ENCUNHAMENTO) DE ALVENARIA DE VEDAÇÃO COM TIJOLO MACIÇO. AF_03/2016","M",5.6,null,null,0,"Referência: AGETOP - 100204"]
["S",2,"S",0,3,8,0,0,0,0,0,"","Serviço","Serviço","-","SINAPI",95465,"COBOGO CERAMICO (ELEMENTO VAZADO), 9X20X20CM, ASSENTADO COM ARGAMASSA TRACO 1:4 DE CIMENTO E AREIA","M2",35.909999999999997,null,null,0,""]
[2,2,2,2,{"$f":"IF($C798=1,OFFSET(E798,-1,0)+1,OFFSET(E798,-1,0))","v":3},{"$f":"IF($C798=1,0,IF($C798=2,OFFSET(F798,-1,0)+1,OFFSET(F798,-1,0)))","v":9},{"$f":"IF(AND($C798<=2,$C798<>0),0,IF($C798=3,OFFSET(G798,-1,0)+1,OFFSET(G798,-1,0)))","v":0},{"$f":"IF(AND($C798<=3,$C798<>0),0,IF($C798=4,OFFSET(H798,-1,0)+1,OFFSET(H798,-1,0)))","v":0},0,27,2,"","Nível 2","Nível 2","-","SINAPI",null,"IMPERMEABILIZAÇÃO","-",null,null,null,0,""]
["S",2,"S",0,3,9,0,0,0,0,0,"","Serviço","Serviço","-","SINAPI",98562,"IMPERMEABILIZAÇÃO DE FLOREIRA OU VIGA BALDRAME COM ARGAMASSA DE CIMENTO E AREIA, COM ADITIVO IMPERMEABILIZANTE, E = 2 CM. AF_06/2018","M2",40.35,null,null,0,"Referência: AGETOP - 120902"]
[2,2,2,2,3,10,0,0,0,25,2,"","Nível 2","Nível 2","-",null,null,"ESTRUTURAS METÁLICAS","-",null,null,null,0,""]
["S",2,"S",0,3,10,0,0,0,0,0,"","Serviço","Serviço","-","AGETOP",150103,"ESTRUTURA METÁLICA CONVENCIONAL EM AÇO DO TIPO USI SAC-300 COM FUNDO ANTICORROSIVO","Kg    ",2414.2600000000002,null,null,0,""]
[2,2,2,4,3,11,0,0,0,23,4,"","Nível 2","Nível 2","-",null,null,"COBERTURAS","-",null,null,null,0,""]
["S",2,"S",0,3,11,0,0,0,{"$f":"IF(OR($C803=\"S\",$C803=0),0,MATCH(0,OFFSET($D803,1,$C803,ROW($C$1047)-ROW($C803)),0))","v":0},{"$f":"IF(OR($C803=\"S\",$C803=0),0,MATCH(OFFSET($D803,0,$C803)+1,OFFSET($D803,1,$C803,ROW($C$1047)-ROW($C803)),0))","v":0},"","Serviço","Serviço","-","SINAPI",94445,"TELHAMENTO COM TELHA CERÂMICA CAPA-CANAL, TIPO PLAN, COM ATÉ 2 ÁGUAS, INCLUSO TRANSPORTE VERTICAL. AF_07/2019","M2",179.17,null,null,0,"Referência: AGETOP - 160401"]
["S",{"$f":"IF(OR(C804=\"s\",C804=0),OFFSET(B804,-1,0),C804)","v":2},{"$f":"IF(OFFSET(C804,-1,0)=\"L\",1,IF(OFFSET(C804,-1,0)=1,2,IF(OR(A804=\"s\",A804=0),\"S\",IF(AND(OFFSET(C804,-1,0)=2,A804=4),3,IF(AND(OR(OFFSET(C804,-1,0)=\"s\",OFFSET(C804,-1,0)=0),A804<>\"s\",A804>OFFSET(B804,-1,0)),OFFSET(B804,-1,0),A804)))))","v":"S"},{"$f":"IF(OR(C804=\"S\",C804=0),0,IF(ISERROR(K804),J804,SMALL(J804:K804,1)))","v":0},3,11,0,0,0,0,0,"","Serviço","Serviço","-","SINAPI",94221,"CUMEEIRA PARA TELHA CERÂMICA EMBOÇADA COM ARGAMASSA TRAÇO 1:2:9 (CIMENTO, CAL E AREIA) PARA TELHADOS COM ATÉ 2 ÁGUAS, INCLUSO TRANSPORTE VERTICAL. AF_07/2019","M",21.85,null,null,0,""]
["S",2,"S",0,3,11,0,0,0,0,0,"","Serviço","Serviço","-","SINAPI",94224,"EMBOÇAMENTO COM ARGAMASSA TRAÇO 1:2:9 (CIMENTO, CAL E AREIA). AF_07/2019","M",60.5,null,null,0,"Referência: AGETOP - 160403"]
[2,2,2,5,3,12,0,0,0,19,5,"","Nível 2","Nível 2","-",null,null,"REVESTIMENTO DE PAREDE","-",null,null,null,0,""]
["S",2,"S",0,3,12,0,0,0,0,0,"","Serviço","Serviço","-","SINAPI",87879,"CHAPISCO APLICADO EM ALVENARIAS E ESTRUTURAS DE CONCRETO INTERNAS, COM COLHER DE PEDREIRO.  ARGAMASSA TRAÇO 1:3 COM PREPARO EM BETONEIRA 400L. AF_06/2014","M2",98.18,null,null,0,""]
["S",2,"S",0,3,12,0,0,0,0,0,"","Serviço","Serviço","-","SINAPI",87286,"ARGAMASSA TRAÇO 1:1:6 (EM VOLUME DE CIMENTO, CAL E AREIA MÉDIA ÚMIDA) PARA EMBOÇO/MASSA ÚNICA/ASSENTAMENTO DE ALVENARIA DE VEDAÇÃO, PREPARO MECÂNICO COM BETONEIRA 400 L. AF_08/2019","M3",3.15,null,null,0,""]
["S",2,"S",0,3,12,0,0,0,0,0,"","Serviço","Serviço","-","SINAPI",87336,"ARGAMASSA TRAÇO 1:2:8 (EM VOLUME DE CIMENTO, CAL E AREIA MÉDIA ÚMIDA) PARA EMBOÇO/MASSA ÚNICA/ASSENTAMENTO DE ALVENARIA DE VEDAÇÃO, PREPARO MECÂNICO COM MISTURADOR DE EIXO HORIZONTAL DE 600 KG. AF_08/2019","M3",2.94,null,null,0,""]
["S",2,"S",0,3,12,0,0,0,0,0,"","Serviço","Serviço","-","SINAPI",87274,"REVESTIMENTO CERÂMICO PARA PAREDES INTERNAS COM PLACAS TIPO ESMALTADA EXTRA DE DIMENSÕES 33X45 CM APLICADAS EM AMBIENTES DE ÁREA MENOR QUE 5 M² A MEIA ALTURA DAS PAREDES. AF_06/2014","M2",3.15,null,null,0,"Referência: AGETOP - 201302"]
[2,2,2,6,3,13,0,0,0,14,6,"","Nível 2","Nível 2","-","SINAPI",null,"REVESTIMENTO DE PISO","-",null,null,null,0,""]
["S",2,"S",0,3,13,0,0,0,0,0,"","Serviço","Serviço","-","SINAPI",95241,"LASTRO DE CONCRETO MAGRO, APLICADO EM PISOS OU RADIERS, ESPESSURA DE 5 CM. AF_07/2016","M2",133.97999999999999,null,null,0,""]
["S",2,"S",0,3,13,0,0,0,0,0,"","Serviço","Serviço","-","SINAPI",84191,"PISO EM GRANILITE, MARMORITE OU GRANITINA ESPESSURA 8 MM, INCLUSO JUNTAS DE DILATACAO PLASTICAS","M2",133.97999999999999,null,null,0,"Referência: AGETOP - 221101"]
["S",2,"S",0,3,13,0,0,0,0,0,"","Serviço","Serviço","-","SINAPI","73850/1","RODAPE EM MARMORITE, ALTURA 10CM","M",24.5,null,null,0,""]
["S",2,"S",0,3,13,0,0,0,0,0,"","Serviço","Serviço","-","AGETOP",221104,"RASPAGEM E APLICAÇÃO RESINA ACRÍLICA DUAS DEMÃOS","m2    ",136.43,null,null,0,""]
["S",2,"S",0,3,13,0,0,0,0,0,"","Serviço","Serviço","-","SINAPI",94992,"EXECUÇÃO DE PASSEIO (CALÇADA) OU PISO DE CONCRETO COM CONCRETO MOLDADO IN LOCO, FEITO EM OBRA, ACABAMENTO CONVENCIONAL, ESPESSURA 6 CM, ARMADO. AF_07/2016","M2",33.72,null,null,0,""]
[2,2,2,4,3,14,0,0,0,8,4,"","Nível 2","Nível 2","-",null,null,"PINTURA","-",null,null,null,0,""]
["S",2,"S",0,3,14,0,0,0,0,0,"","Serviço","Serviço","-","SINAPI","74133/1","EMASSAMENTO COM MASSA A OLEO, UMA DEMAO","M2",21.35,null,null,0,""]
["S",2,"S",0,3,14,0,0,0,0,0,"","Serviço","Serviço","-","SINAPI",88489,"APLICAÇÃO MANUAL DE PINTURA COM TINTA LÁTEX ACRÍLICA EM PAREDES, DUAS DEMÃOS. AF_06/2014","M2",53.7,null,null,0,"Referência: AGETOP - 261001"]
["S",2,"S",0,3,14,0,0,0,0,0,"","Serviço","Serviço","-","SINAPI",79464,"PINTURA A OLEO, 2 DEMAOS","M2",21.35,null,null,0,""]
[2,2,2,4,3,15,0,0,0,4,205,"","Nível 2","Nível 2","-",null,null,"DIVERSOS","-",null,null,null,0,""]
["S",2,"S",0,3,15,0,0,0,0,0,"","Serviço","Serviço","-","AGETOP",270501,"LIMPEZA FINAL DE OBRA - (OBRAS CIVIS)","m2    ",133.97999999999999,null,null,0,""]
["S",2,"S",0,3,15,0,0,0,0,0,"","Serviço","Serviço","-","AGETOP",271608,"BANCADA DE GRANITO C/ESPELHO","m2    ",1,null,null,0,""]
["S",2,"S",0,3,15,0,0,0,0,0,"","Serviço","Serviço","-","AGETOP",271303,"BANCO DE CONCRETO POLIDO BASE EM ALVENARIA REBOCADA E PINTADA - PADRÃO AGETOP 2015","m     ",15.75,null,null,0,""]
[1,1,1,222,4,0,0,0,0,222,{"$error":"#N/A"},"F","Nível 1","Nível 1","4.","SINAPI",null,"COZINHA / PÁTIO / SANITÁRIO SEDUC 2009","-",null,null,null,0,""]
[2,2,2,2,4,1,0,0,0,221,2,"","Nível 2","Nível 2","-","SINAPI",null,"SERVIÇOS PRELIMINARES","-",null,null,null,0,""]
["S",2,"S",0,4,1,0,0,0,0,0,"","Serviço","Serviço","-","AGETOP",20701,"LOCAÇÃO DA OBRA, EXECUÇÃO DE GABARITO SEM REAPROVEITAMENTO, INCLUSO PINTURA (FACE INTERNA DO RIPÃO 15CM) E PIQUETE COM TESTEMUNHA","m2    ",191.73,null,null,0,""]
[2,2,2,3,4,2,0,0,0,219,3,"","Nível 2","Nível 2","-","SINAPI",null,"TRANSPORTES","-",null,null,null,0,""]
["S",2,"S",0,4,2,0,0,0,0,0,"","Serviço","Serviço","-","SINAPI",72897,"CARGA MANUAL DE ENTULHO EM CAMINHAO BASCULANTE 6 M3","M3",13.42,null,null,0,""]
["S",2,"S",0,4,2,0,0,0,0,0,"","Serviço","Serviço","-","SINAPI",72900,"TRANSPORTE DE ENTULHO COM CAMINHAO BASCULANTE 6 M3, RODOVIA PAVIMENTADA, DMT 0,5 A 1,0 KM","M3",13.42,null,null,0,""]
[2,2,2,3,4,3,0,0,0,216,3,"","Nível 2","Nível 2","-","SINAPI",null,"SERVIÇO EM TERRA","-",null,null,null,0,""]
["S",2,"S",0,4,3,0,0,0,0,0,"","Serviço","Serviço","-","SINAPI",93358,"ESCAVAÇÃO MANUAL DE VALA COM PROFUNDIDADE MENOR OU IGUAL A 1,30 M. AF_03/2016","M3",9.58,null,null,0,"Referência: AGETOP - 40101"]
["S",2,"S",0,4,3,0,0,0,0,0,"","Serviço","Serviço","-","AGETOP",41002,"APILOAMENTO","m2    ",191.73,null,null,0,""]
[2,2,2,19,4,4,0,0,0,213,19,"","Nível 2","Nível 2","-",null,null,"FUNDAÇÕES E SONDAGENS","-",null,null,null,0,""]
[3,3,3,8,4,4,1,0,0,18,8,"","Nível 3","Nível 3","-","SINAPI",null,"ESTACAS E BLOCOS","-",null,null,null,0,""]
["S",3,"S",0,4,4,1,0,0,0,0,"","Serviço","Serviço","-","AGETOP",50302,"ESTACA A TRADO DIAM.30 CM SEM FERRO","M     ",133,null,null,0,""]
["S",3,"S",0,4,4,1,0,0,0,0,"","Serviço","Serviço","-","SINAPI",96522,"ESCAVAÇÃO MANUAL PARA BLOCO DE COROAMENTO OU SAPATA, SEM PREVISÃO DE FÔRMA. AF_06/2017","M3",8.48,null,null,0,"Referência: AGETOP - 50901"]
["S",3,"S",0,4,4,1,0,0,0,0,"","Serviço","Serviço","-","SINAPI",94964,"CONCRETO FCK = 20MPA, TRAÇO 1:2,7:3 (CIMENTO/ AREIA MÉDIA/ BRITA 1)  - PREPARO MECÂNICO COM BETONEIRA 400 L. AF_07/2016","M3",13.600000000000001,null,null,0,""]
["S",3,"S",0,4,4,1,0,0,0,0,"","Serviço","Serviço","-","SINAPI",92874,"LANÇAMENTO COM USO DE BOMBA, ADENSAMENTO E ACABAMENTO DE CONCRETO EM ESTRUTURAS. AF_12/2015","M3",13.600000000000001,null,null,0,""]
["S",3,"S",0,4,4,1,0,0,0,0,"","Serviço","Serviço","-","SINAPI",96544,"ARMAÇÃO DE BLOCO, VIGA BALDRAME OU SAPATA UTILIZANDO AÇO CA-50 DE 6,3 MM - MONTAGEM. AF_06/2017","KG",107.82,null,null,0,"Referência: AGETOP - 52003"]
["S",3,"S",0,4,4,1,0,0,0,0,"","Serviço","Serviço","-","SINAPI",96545,"ARMAÇÃO DE BLOCO, VIGA BALDRAME OU SAPATA UTILIZANDO AÇO CA-50 DE 8 MM - MONTAGEM. AF_06/2017","KG",169.38000000000002,null,null,0,"Referência: AGETOP - 52004"]
["S",3,"S",0,4,4,1,0,0,0,0,"","Serviço","Serviço","-","SINAPI",96543,"ARMAÇÃO DE BLOCO, VIGA BALDRAME E SAPATA UTILIZANDO AÇO CA-60 DE 5 MM - MONTAGEM. AF_06/2017","KG",82.44,null,null,0,"Referência: AGETOP - 52014"]
[3,3,3,10,4,4,2,0,0,10,{"$error":"#N/A"},"","Nível 3","Nível 3","-","SINAPI",null,"VIGAS BALDRAMES","-",null,null,null,0,""]
["S",3,"S",0,4,4,2,0,0,0,0,"","Serviço","Serviço","-","SINAPI",96527,"ESCAVAÇÃO MANUAL DE VALA PARA VIGA BALDRAME, COM PREVISÃO DE FÔRMA. AF_06/2017","M3",17.97,null,null,0,"Referência: AGETOP - 40101"]
["S",3,"S",0,4,4,2,0,0,0,0,"","Serviço","Serviço","-","SINAPI",96995,"REATERRO MANUAL APILOADO COM SOQUETE. AF_10/2017","M3",12.899999999999999,null,null,0,"Referência: AGETOP - 40902"]
["S",3,"S",0,4,4,2,0,0,0,0,"","Serviço","Serviço","-","AGETOP",60191,"FORMA DE TABUA CINTA BALDRAME U=8 VEZES","m2    ",84.57,null,null,0,""]
["S",3,"S",0,4,4,2,0,0,0,0,"","Serviço","Serviço","-","SINAPI",94964,"CONCRETO FCK = 20MPA, TRAÇO 1:2,7:3 (CIMENTO/ AREIA MÉDIA/ BRITA 1)  - PREPARO MECÂNICO COM BETONEIRA 400 L. AF_07/2016","M3",5.07,null,null,0,""]
["S",3,"S",0,4,4,2,0,0,0,0,"","Serviço","Serviço","-","SINAPI","74157/4","LANCAMENTO/APLICACAO MANUAL DE CONCRETO EM FUNDACOES","M3",5.07,null,null,0,"Referência: AGETOP - 51026"]
["S",3,"S",0,4,4,2,0,0,0,0,"","Serviço","Serviço","-","SINAPI",96544,"ARMAÇÃO DE BLOCO, VIGA BALDRAME OU SAPATA UTILIZANDO AÇO CA-50 DE 6,3 MM - MONTAGEM. AF_06/2017","KG",2.25,null,null,0,"Referência: AGETOP - 52003"]
["S",3,"S",0,4,4,2,0,0,0,0,"","Serviço","Serviço","-","SINAPI",96545,"ARMAÇÃO DE BLOCO, VIGA BALDRAME OU SAPATA UTILIZANDO AÇO CA-50 DE 8 MM - MONTAGEM. AF_06/2017","KG",116.1,null,null,0,"Referência: AGETOP - 52004"]
["S",3,"S",0,4,4,2,0,0,0,0,"","Serviço","Serviço","-","SINAPI",96546,"ARMAÇÃO DE BLOCO, VIGA BALDRAME OU SAPATA UTILIZANDO AÇO CA-50 DE 10 MM - MONTAGEM. AF_06/2017","KG",100.26,null,null,0,"Referência: AGETOP - 52005"]
["S",3,"S",0,4,4,2,0,0,0,0,"","Serviço","Serviço","-","SINAPI",96543,"ARMAÇÃO DE BLOCO, VIGA BALDRAME E SAPATA UTILIZANDO AÇO CA-60 DE 5 MM - MONTAGEM. AF_06/2017","KG",84.78,null,null,0,"Referência: AGETOP - 52014"]
[2,2,2,18,4,5,0,0,0,194,18,"","Nível 2","Nível 2","-",null,null,"ESTRUTURA","-",null,null,null,0,""]
[3,3,3,7,4,5,1,0,0,17,7,"","Nível 3","Nível 3","-","SINAPI",null,"PILARES","-",null,null,null,0,""]
["S",3,"S",0,4,5,1,0,0,0,0,"","Serviço","Serviço","-","SINAPI",92415,"MONTAGEM E DESMONTAGEM DE FÔRMA DE PILARES RETANGULARES E ESTRUTURAS SIMILARES COM ÁREA MÉDIA DAS SEÇÕES MAIOR QUE 0,25 M², PÉ-DIREITO SIMPLES, EM CHAPA DE MADEIRA COMPENSADA RESINADA, 2 UTILIZAÇÕES. AF_12/2015","M2",94.5,null,null,0,""]
["S",3,"S",0,4,5,1,0,0,0,0,"","Serviço","Serviço","-","SINAPI",92778,"ARMAÇÃO DE PILAR OU VIGA DE UMA ESTRUTURA CONVENCIONAL DE CONCRETO ARMADO EM UMA EDIFICAÇÃO TÉRREA OU SOBRADO UTILIZANDO AÇO CA-50 DE 10,0 MM - MONTAGEM. AF_12/2015","KG",370.62,null,null,0,"Referência: AGETOP - 60305"]
["S",3,"S",0,4,5,1,0,0,0,0,"","Serviço","Serviço","-","SINAPI",92779,"ARMAÇÃO DE PILAR OU VIGA DE UMA ESTRUTURA CONVENCIONAL DE CONCRETO ARMADO EM UMA EDIFICAÇÃO TÉRREA OU SOBRADO UTILIZANDO AÇO CA-50 DE 12,5 MM - MONTAGEM. AF_12/2015","KG",52.11,null,null,0,""]
["S",3,"S",0,4,5,1,0,0,0,0,"","Serviço","Serviço","-","SINAPI",92775,"ARMAÇÃO DE PILAR OU VIGA DE UMA ESTRUTURA CONVENCIONAL DE CONCRETO ARMADO EM UMA EDIFICAÇÃO TÉRREA OU SOBRADO UTILIZANDO AÇO CA-60 DE 5,0 MM - MONTAGEM. AF_12/2015","KG",109.71000000000001,null,null,0,"Referência: AGETOP - 60314"]
["S",3,"S",0,4,5,1,0,0,0,0,"","Serviço","Serviço","-","SINAPI",94964,"CONCRETO FCK = 20MPA, TRAÇO 1:2,7:3 (CIMENTO/ AREIA MÉDIA/ BRITA 1)  - PREPARO MECÂNICO COM BETONEIRA 400 L. AF_07/2016","M3",4.72,null,null,0,""]
["S",3,"S",0,4,5,1,0,0,0,0,"","Serviço","Serviço","-","SINAPI",92874,"LANÇAMENTO COM USO DE BOMBA, ADENSAMENTO E ACABAMENTO DE CONCRETO EM ESTRUTURAS. AF_12/2015","M3",4.72,null,null,0,""]
[3,3,3,10,4,5,2,0,0,10,{"$error":"#N/A"},"","Nível 3","Nível 3","-","SINAPI",null,"VIGAS DE COBERTURA","-",null,null,null,0,""]
["S",3,"S",0,4,5,2,0,0,0,0,"","Serviço","Serviço","-","SINAPI",92464,"MONTAGEM E DESMONTAGEM DE FÔRMA DE VIGA, ESCORAMENTO METÁLICO, PÉ-DIREITO SIMPLES, EM CHAPA DE MADEIRA RESINADA, 8 UTILIZAÇÕES. AF_12/2015","M2",93.43,null,null,0,"Referência: AGETOP - 60209"]
["S",3,"S",0,4,5,2,0,0,0,0,"","Serviço","Serviço","-","SINAPI",94964,"CONCRETO FCK = 20MPA, TRAÇO 1:2,7:3 (CIMENTO/ AREIA MÉDIA/ BRITA 1)  - PREPARO MECÂNICO COM BETONEIRA 400 L. AF_07/2016","M3",5.84,null,null,0,""]
["S",3,"S",0,4,5,2,0,0,0,0,"","Serviço","Serviço","-","SINAPI",92873,"LANÇAMENTO COM USO DE BALDES, ADENSAMENTO E ACABAMENTO DE CONCRETO EM ESTRUTURAS. AF_12/2015","M3",5.84,null,null,0,"Referência: AGETOP - 60801"]
["S",3,"S",0,4,5,2,0,0,0,0,"","Serviço","Serviço","-","SINAPI",92776,"ARMAÇÃO DE PILAR OU VIGA DE UMA ESTRUTURA CONVENCIONAL DE CONCRETO ARMADO EM UMA EDIFICAÇÃO TÉRREA OU SOBRADO UTILIZANDO AÇO CA-50 DE 6,3 MM - MONTAGEM. AF_12/2015","KG",75.960000000000008,null,null,0,"Referência: AGETOP - 60303"]
["S",3,"S",0,4,5,2,0,0,0,0,"","Serviço","Serviço","-","SINAPI",92777,"ARMAÇÃO DE PILAR OU VIGA DE UMA ESTRUTURA CONVENCIONAL DE CONCRETO ARMADO EM UMA EDIFICAÇÃO TÉRREA OU SOBRADO UTILIZANDO AÇO CA-50 DE 8,0 MM - MONTAGEM. AF_12/2015","KG",31.5,null,null,0,"Referência: AGETOP - 60304"]
["S",3,"S",0,4,5,2,0,0,{"$f":"IF(OR($C867=\"S\",$C867=0),0,MATCH(0,OFFSET($D867,1,$C867,ROW($C$1047)-ROW($C867)),0))","v":0},{"$f":"IF(OR($C867=\"S\",$C867=0),0,MATCH(OFFSET($D867,0,$C867)+1,OFFSET($D867,1,$C867,ROW($C$1047)-ROW($C867)),0))","v":0},"","Serviço","Serviço","-","SINAPI",92778,"ARMAÇÃO DE PILAR OU VIGA DE UMA ESTRUTURA CONVENCIONAL DE CONCRETO ARMADO EM UMA EDIFICAÇÃO TÉRREA OU SOBRADO UTILIZANDO AÇO CA-50 DE 10,0 MM - MONTAGEM. AF_12/2015","KG",214.47000000000003,null,null,0,"Referência: AGETOP - 60305"]
["S",3,"S",0,4,5,2,0,0,0,0,"","Serviço","Serviço","-","SINAPI",92779,"ARMAÇÃO DE PILAR OU VIGA DE UMA ESTRUTURA CONVENCIONAL DE CONCRETO ARMADO EM UMA EDIFICAÇÃO TÉRREA OU SOBRADO UTILIZANDO AÇO CA-50 DE 12,5 MM - MONTAGEM. AF_12/2015","KG",33.840000000000003,null,null,0,""]
["S",3,"S",0,4,5,2,0,0,0,0,"","Serviço","Serviço","-","SINAPI",92775,"ARMAÇÃO DE PILAR OU VIGA DE UMA ESTRUTURA CONVENCIONAL DE CONCRETO ARMADO EM UMA EDIFICAÇÃO TÉRREA OU SOBRADO UTILIZANDO AÇO CA-60 DE 5,0 MM - MONTAGEM. AF_12/2015","KG",79.02,null,null,0,"Referência: AGETOP - 60314"]
["S",3,"S",0,4,5,2,0,0,0,0,"","Serviço","Serviço","-","SINAPI","74202/1","LAJE PRE-MOLDADA P/FORRO, SOBRECARGA 100KG/M2, VAOS ATE 3,50M/E=8CM, C/LAJOTAS E CAP.C/CONC FCK=20MPA, 3CM, INTER-EIXO 38CM, C/ESCORAMENTO (REAPR.3X) E FERRAGEM NEGATIVA","M2",91.12,null,null,0,""]
[2,2,2,30,4,6,0,0,0,176,30,"","Nível 2","Nível 2","-","SINAPI",null,"INSTALAÇÕES ELÉTRICAS","-",null,null,null,0,""]
["S",2,"S",0,4,6,0,0,0,0,0,"","Serviço","Serviço","-","AGETOP",71184,"DISPOSITIVO DE PROTEÇÃO CONTRA SURTOS (D.P.S.) 275V DE 8 A 40KA","Un    ",3,null,null,0,""]
["S",2,"S",0,4,6,0,0,0,0,0,"","Serviço","Serviço","-","AGETOP",71450,"INTERRUPTOR DIFERENCIAL RESIDUAL (D.R.) BIPOLAR DE 25A-30mA","Un    ",4,null,null,0,""]
["S",2,"S",0,4,6,0,0,0,0,0,"","Serviço","Serviço","-","AGETOP",70260,"BARRA DE COBRE 1\" X 1/8\" (0,8052 KG/M)","m     ",1,null,null,0,""]
["S",2,"S",0,4,6,0,0,0,0,0,"","Serviço","Serviço","-","AGETOP",70646,"CAIXA DE PASSAGEM METÁLICA DE EMBUTIR 20X20X10 CM","Un    ",1,null,null,0,""]
["S",2,"S",0,4,6,0,0,0,0,0,"","Serviço","Serviço","-","AGETOP",71615,"LUMINÁRIA TIPO ARANDELA DE USO EXTERNO - BASE E-27","un    ",4,null,null,0,""]
["S",2,"S",0,4,6,0,0,0,0,0,"","Serviço","Serviço","-","AGETOP",70540,"CABO DE COBRE NU No. 10 MM2 (11,11M /KG)","M     ",24,null,null,0,""]
["S",2,"S",0,4,6,0,0,0,0,0,"","Serviço","Serviço","-","AGETOP",70581,"CABO PVC (70ºC) 1 KV No. 2,5 MM2","M     ",1200,null,null,0,""]
["S",2,"S",0,4,6,0,0,0,0,0,"","Serviço","Serviço","-","AGETOP",70582,"CABO PVC (70ºC) 1 KV No. 4 MM2","M     ",600,null,null,0,""]
["S",2,"S",0,4,6,0,0,0,0,0,"","Serviço","Serviço","-","AGETOP",70585,"CABO PVC (70ºC) 1 KV No. 16 MM2","M     ",100,null,null,0,""]
["S",2,"S",0,4,6,0,0,0,0,0,"","Serviço","Serviço","-","AGETOP",70682,"CAIXA METALICA OCTOGONAL FUNDO MOVEL,DUPLA 4\"","Un    ",24,null,null,0,""]
["S",2,"S",0,4,6,0,0,0,0,0,"","Serviço","Serviço","-","AGETOP",70691,"CAIXA METALICA RET. 4\" X 2\" X 2\"","Un    ",23,null,null,0,""]
["S",2,"S",0,4,6,0,0,0,0,0,"","Serviço","Serviço","-","AGETOP",70716,"CAIXA DE PASSAGEM 80X80X110 CM FUNDO DE BRITA SEM TAMPA","Un    ",1,null,null,0,""]
["S",2,"S",0,4,6,0,0,0,0,0,"","Serviço","Serviço","-","SINAPI",97586,"LUMINÁRIA TIPO CALHA, DE SOBREPOR, COM 2 LÂMPADAS TUBULARES DE 36 W - FORNECIMENTO E INSTALAÇÃO. AF_11/2017","UN",24,null,null,0,""]
["S",2,"S",0,4,6,0,0,0,0,0,"","Serviço","Serviço","-","AGETOP",71171,"DISJUNTOR MONOPOLAR DE 10 A 32-A","Un    ",6,null,null,0,""]
["S",2,"S",0,4,6,0,0,0,0,0,"","Serviço","Serviço","-","AGETOP",71205,"ELETRODUTO DE PVC RIGIDO DIAMETRO 2\"","M     ",1,null,null,0,""]
["S",2,"S",0,4,6,0,0,0,0,0,"","Serviço","Serviço","-","AGETOP",71194,"ELETRODUTO PVC FLEXÍVEL - MANGUEIRA CORRUGADA LEVE - DIAM. 25MM","M     ",25,null,null,0,""]
["S",2,"S",0,4,6,0,0,0,0,0,"","Serviço","Serviço","-","AGETOP",71195,"ELETRODUTO PVC FLEXÍVEL - MANGUEIRA CORRUGADA LEVE - DIAM. 32MM","M     ",400,null,null,0,""]
["S",2,"S",0,4,6,0,0,0,0,0,"","Serviço","Serviço","-","AGETOP",71321,"FITA DE AUTO FUSAO, ROLO E 10,00 MM","Un    ",10,null,null,0,""]
["S",2,"S",0,4,6,0,0,0,0,0,"","Serviço","Serviço","-","AGETOP",71331,"FITA ISOLANTE, ROLO DE 20,00 M","Un    ",1,null,null,0,""]
["S",2,"S",0,4,6,0,0,0,0,0,"","Serviço","Serviço","-","AGETOP",71381,"HASTE REV.COBRE(COPPERWELD)  5/8\" X 3,00 M C/CONECTOR","Un    ",3,null,null,0,""]
["S",2,"S",0,4,6,0,0,0,0,0,"","Serviço","Serviço","-","AGETOP",71431,"INTERRUPTOR PARALELO SIMPLES (1 SECAO)","Un    ",9,null,null,0,""]
["S",2,"S",0,4,6,0,0,0,0,0,"","Serviço","Serviço","-","AGETOP",71440,"INTERRUPTOR SIMPLES (1 SECAO)","Un    ",9,null,null,0,""]
["S",2,"S",0,4,6,0,0,0,0,0,"","Serviço","Serviço","-","AGETOP",71577,"LAMPADA COMPACTA ELETRÔNICA COM REATOR INTEGRADO  25/26 W","Un    ",2,null,null,0,""]
["S",2,"S",0,4,6,0,0,0,0,0,"","Serviço","Serviço","-","AGETOP",72170,"QUADRO DE DISTRIBUIÇÃO DE EMBUTIR EM PVC CB 12E - 80A","Un    ",1,null,null,0,""]
["S",2,"S",0,4,6,0,0,0,0,0,"","Serviço","Serviço","-","SINAPI",83391,"REATOR PARA LAMPADA FLUORESCENTE 2X40W PARTIDA RAPIDA FORNECIMENTO E INSTALACAO","UN",24,null,null,0,""]
["S",2,"S",0,4,6,0,0,0,0,0,"","Serviço","Serviço","-","AGETOP",72320,"RELE FOTO ELETRICO COM BASE","Un    ",2,null,null,0,""]
["S",2,"S",0,4,6,0,0,0,0,0,"","Serviço","Serviço","-","AGETOP",72341,"SOQUETE ANTIVIBRATORIO P/LAMP.FLUORESCENTE","Un    ",96,null,null,0,""]
["S",2,"S",0,4,6,0,0,0,0,0,"","Serviço","Serviço","-","SINAPI",97593,"LUMINÁRIA TIPO SPOT, DE SOBREPOR, COM 1 LÂMPADA DE 15 W - FORNECIMENTO E INSTALAÇÃO. AF_11/2017","UN",2,null,null,0,"Referência: AGETOP - 71688"]
["S",2,"S",0,4,6,0,0,0,0,0,"","Serviço","Serviço","-","AGETOP",72578,"TOMADA HEXAGONAL 2P + T - 10A - 250V","Un    ",14,null,null,0,""]
[2,2,2,98,4,7,0,0,0,146,98,"","Nível 2","Nível 2","-","SINAPI",null,"INSTALAÇÕES HIDROSSANITÁRIAS","-",null,null,null,0,""]
["S",2,"S",0,4,7,0,0,0,0,0,"","Serviço","Serviço","-","AGETOP",81825,"CAIXA DE PASSAGEM 60 X 60 CM SEM TAMPA","Un    ",11,null,null,0,""]
["S",2,"S",0,4,7,0,0,0,0,0,"","Serviço","Serviço","-","AGETOP",81826,"TAMPA EM CONCRETO ARMADO 25 MPA E=5CM PARA A CAIXA DE PASSAGEM 60X60CM","Un    ",11,null,null,0,""]
["S",2,"S",0,4,7,0,0,0,0,0,"","Serviço","Serviço","-","AGETOP",81846,"CAIXA DE GORDURA E INSPEÇÃO EM PVC/ABS 19 LITROS COM TAMPA E PORTA TAMPA E CESTO DE LIMPEZA REMOVÍVEL","un    ",1,null,null,0,""]
["S",2,"S",0,4,7,0,0,0,0,0,"","Serviço","Serviço","-","AGETOP",80502,"VASO SANITARIO","Un    ",9,null,null,0,""]
["S",2,"S",0,4,7,0,0,0,0,0,"","Serviço","Serviço","-","AGETOP",80510,"ANEL DE VEDAÇÃO PARA VASO SANITÁRIO","Un    ",9,null,null,0,""]
["S",2,"S",0,4,7,0,0,0,0,0,"","Serviço","Serviço","-","AGETOP",80512,"TUBO DE DESCIDA PARA CAIXA DE DESCARGA ( LONGO 1 1/4\" )","Un    ",9,null,null,0,""]
["S",2,"S",0,4,7,0,0,0,0,0,"","Serviço","Serviço","-","AGETOP",80514,"TUBO DE LIGACAO PVC CROMADO 1.1/2\" / ESPUDE  - (ENTRADA)","Un    ",9,null,null,0,""]
["S",2,"S",0,4,7,0,0,0,0,0,"","Serviço","Serviço","-","AGETOP",80517,"VÁLVULA DE DESCARGA DUPLO ACIONAMENTO COM ACABAMENTO CROMADO ANTIVANDALISMO","Un    ",9,null,null,0,""]
["S",2,"S",0,4,7,0,0,0,0,0,"","Serviço","Serviço","-","AGETOP",80520,"CONJUNTO DE FIXACAO P/VASO SANITARIO (PAR)","CJ    ",9,null,null,0,""]
["S",2,"S",0,4,7,0,0,0,0,0,"","Serviço","Serviço","-","AGETOP",80526,"ASSENTO EM POLIPROPILENO COM SISTEMA DE FECHAMENTO SUAVE PARA VASO SANITÁRIO","Un    ",9,null,null,0,""]
["S",2,"S",0,4,7,0,0,0,0,0,"","Serviço","Serviço","-","AGETOP",80530,"PORTA PAPEL HIGIÊNICO EM LOUÇA - EMBUTIR","Un    ",5,null,null,0,""]
["S",2,"S",0,4,7,0,0,0,0,0,"","Serviço","Serviço","-","AGETOP",80532,"PORTA PAPEL HIGIÊNICO EM METAL/ACABAMENTO CROMADO","Un    ",9,null,null,0,""]
["S",2,"S",0,4,7,0,0,0,0,0,"","Serviço","Serviço","-","AGETOP",80542,"LAVATÓRIO MÉDIO SEM COLUNA","Un    ",4,null,null,0,""]
["S",2,"S",0,4,7,0,0,0,0,0,"","Serviço","Serviço","-","AGETOP",80550,"FIXACAO P/LAVATORIO (PAR)","PAR   ",4,null,null,0,""]
["S",2,"S",0,4,7,0,0,0,0,0,"","Serviço","Serviço","-","AGETOP",80556,"LIGAÇÃO FLEXÍVEL PVC DIAM.1/2\" (ENGATE)","Un    ",10,null,null,0,""]
["S",2,"S",0,4,7,0,0,0,0,0,"","Serviço","Serviço","-","AGETOP",80562,"SIFAO FLEXIVEL UNIVERSAL ( SANFONADO) EM PVC PARA LAVATORIO","Un    ",10,null,null,0,""]
["S",2,"S",0,4,7,0,0,0,0,0,"","Serviço","Serviço","-","AGETOP",80570,"TORNEIRA DE MESA PARA LAVATÓRIO DIÂMETRO DE 1/2\"","Un    ",10,null,null,0,""]
["S",2,"S",0,4,7,0,0,0,0,0,"","Serviço","Serviço","-","AGETOP",80580,"VALVULA P/LAVATORIO OU BEBEDOURO METALICO DIAMETRO 1\"","Un    ",10,null,null,0,""]
["S",2,"S",0,4,7,0,0,0,0,0,"","Serviço","Serviço","-","AGETOP",80590,"CUBA DE LOUCA DE EMBUTIR OVAL MÉDIA ","Un    ",6,null,null,0,""]
["S",2,"S",0,4,7,0,0,0,0,0,"","Serviço","Serviço","-","AGETOP",80601,"MICTORIO DE LOUCA C/SIFAO INTEGRADO","Un    ",3,null,null,0,""]
["S",2,"S",0,4,7,0,0,0,0,0,"","Serviço","Serviço","-","AGETOP",80610,"KIT FERR.P/MICT.LOUCA (ESPUDE,CONEXÃO ENTR.PARAFUSOS)","Un    ",3,null,null,0,""]
["S",2,"S",0,4,7,0,0,0,0,0,"","Serviço","Serviço","-","AGETOP",80620,"VÁLVULA PVC DE 1\" P/MICTÓRIO TIPO COCHO","Un    ",3,null,null,0,""]
["S",2,"S",0,4,7,0,0,0,0,0,"","Serviço","Serviço","-","AGETOP",80660,"TORNEIRA DE PAREDE PARA PIA OU BEBEDOURO DIÂMETRO DE 1/2\" E 3/4\" ","Un    ",6,null,null,0,""]
["S",2,"S",0,4,7,0,0,0,0,0,"","Serviço","Serviço","-","AGETOP",80671,"SIFAO PVC P/PIA 1.1/2\" X 2\"","Un    ",6,null,null,0,""]
["S",2,"S",0,4,7,0,0,0,0,0,"","Serviço","Serviço","-","AGETOP",80680,"VALVULA P/PIA TIPO AMERICANA DIAM.3.1/2\" (METAL)","Un    ",6,null,null,0,""]
["S",2,"S",0,4,7,0,0,0,0,0,"","Serviço","Serviço","-","AGETOP",80687,"CUBA INOX 35X40X15CM E=0,6MM-AÇO 304 (CUBA Nº 3)","Un    ",5,null,null,0,""]
["S",2,"S",0,4,7,0,0,0,0,0,"","Serviço","Serviço","-","AGETOP",80693,"TANQUE (PANELAO) INOX 60 X 70 X 40 CM CH.18","Un    ",1,null,null,0,""]
["S",2,"S",0,4,7,0,0,0,0,0,"","Serviço","Serviço","-","AGETOP",80721,"CHUVEIRO ELÉTRICO EM PVC COM BRAÇO METÁLICO","Un    ",7,null,null,0,""]
["S",2,"S",0,4,7,0,0,0,0,0,"","Serviço","Serviço","-","AGETOP",80730,"CABIDE TIPO GANCHO EM LOUÇA","Un    ",7,null,null,0,""]
["S",2,"S",0,4,7,0,0,0,{"$f":"IF(OR($C931=\"S\",$C931=0),0,MATCH(0,OFFSET($D931,1,$C931,ROW($C$1047)-ROW($C931)),0))","v":0},{"$f":"IF(OR($C931=\"S\",$C931=0),0,MATCH(OFFSET($D931,0,$C931)+1,OFFSET($D931,1,$C931,ROW($C$1047)-ROW($C931)),0))","v":0},"","Serviço","Serviço","-","AGETOP",80740,"MEIA SABONETEIRA EM LOUÇA DE EMBUTIR","Un    ",7,null,null,0,""]
["S",2,"S",0,4,7,0,0,0,0,0,"","Serviço","Serviço","-","AGETOP",80803,"TANQUE MARMORE/GRANITO SINTÉTICO  / 1 BATEDOR","Un    ",1,null,null,0,""]
["S",2,"S",0,4,7,0,0,0,0,0,"","Serviço","Serviço","-","AGETOP",80810,"TORNEIRA DE PAREDE PARA TANQUE COM AREJADOR DIÂMETRO DE 1/2\" E 3/4\"","Un    ",1,null,null,0,""]
["S",2,"S",0,4,7,0,0,0,0,0,"","Serviço","Serviço","-","AGETOP",80820,"SIFAO P/TANQUE 1\" X 1.1/2\" - PVC","Un    ",1,null,null,0,""]
["S",2,"S",0,4,7,0,0,0,0,0,"","Serviço","Serviço","-","AGETOP",81324,"JOELHO 90 GRAUS SOLDAVEL 50 mm (MARROM)","Un    ",6,null,null,0,""]
["S",2,"S",0,4,7,0,0,0,0,0,"","Serviço","Serviço","-","AGETOP",81427,"TE DE REDUCAO 90 GRAUS SOLDAVEL 75 X 50 MM","Un    ",6,null,null,0,""]
["S",2,"S",0,4,7,0,0,0,0,0,"","Serviço","Serviço","-","AGETOP",81184,"BUCHA DE REDUCAO SOLDAVEL LONGA 60 X 50 mm","Un    ",1,null,null,0,""]
["S",2,"S",0,4,7,0,0,0,0,0,"","Serviço","Serviço","-","AGETOP",81422,"TE REDUCAO 90 GRAUS SOLDAVEL 40 X 32 mm","Un    ",2,null,null,0,""]
["S",2,"S",0,4,7,0,0,0,0,0,"","Serviço","Serviço","-","AGETOP",81322,"JOELHO 90 GRAUS SOLDAVEL DIAMETRO 32 MM (1\")","Un    ",12,null,null,0,""]
["S",2,"S",0,4,7,0,0,0,0,0,"","Serviço","Serviço","-","AGETOP",81067,"ADAPTAD.SOLD.CURTO C/BOLSA E ROSCA P/REG.32X1\"","Un    ",10,null,null,0,""]
["S",2,"S",0,4,7,0,0,0,0,0,"","Serviço","Serviço","-","AGETOP",80927,"REGISTRO DE GAVETA C/CANOPLA DIAMETRO 1\"","Un    ",5,null,null,0,""]
["S",2,"S",0,4,7,0,0,0,0,0,"","Serviço","Serviço","-","AGETOP",81403,"TE 90 GRAUS SOLDAVEL DIAMETRO 32 mm","Un    ",5,null,null,0,""]
["S",2,"S",0,4,7,0,0,0,0,0,"","Serviço","Serviço","-","AGETOP",81162,"BUCHA DE REDUCAO SOLD.CURTA 32 X 25 MM","Un    ",15,null,null,0,""]
["S",2,"S",0,4,7,0,0,0,0,0,"","Serviço","Serviço","-","AGETOP",81369,"JOELHO 90 GRAUS SOLD. C/BUCHA LATAO 25 X 3/4\"","Un    ",7,null,null,0,""]
["S",2,"S",0,4,7,0,0,0,0,0,"","Serviço","Serviço","-","AGETOP",81163,"BUCHA DE REDUCAO SOLD.CURTA 40 X 32 mm","Un    ",1,null,null,0,""]
["S",2,"S",0,4,7,0,0,0,0,0,"","Serviço","Serviço","-","AGETOP",81421,"TE REDUCAO 90 GRAUS SOLDAVEL 32 X 25 mm","Un    ",7,null,null,0,""]
["S",2,"S",0,4,7,0,0,0,0,0,"","Serviço","Serviço","-","AGETOP",81321,"JOELHO 90 GRAUS SOLDAVEL DIAMETRO 25 MM","Un    ",18,null,null,0,""]
["S",2,"S",0,4,7,0,0,0,0,0,"","Serviço","Serviço","-","AGETOP",81066,"ADAPTAD.SOLD.CURTO C/BOLSA E ROSCA P/REG.25X3/4\"","Un    ",18,null,null,0,""]
["S",2,"S",0,4,7,0,0,0,0,0,"","Serviço","Serviço","-","AGETOP",80926,"REGISTRO DE GAVETA C/CANOPLA DIAMETRO 3/4\"","Un    ",2,null,null,0,""]
["S",2,"S",0,4,7,0,0,0,0,0,"","Serviço","Serviço","-","AGETOP",81360,"JOELHO RED.90 GRAUS SOLD.C/BUCHA LATAO 25X1/2\"","Un    ",18,null,null,0,""]
["S",2,"S",0,4,7,0,0,0,0,0,"","Serviço","Serviço","-","AGETOP",81405,"TE 90 GRAUS SOLDAVEL DIAMETRO 50 mm","Un    ",11,null,null,0,""]
["S",2,"S",0,4,7,0,0,0,0,0,"","Serviço","Serviço","-","AGETOP",81180,"BUCHA DE REDUCAO SOLDAVEL LONGA 50 X 32 mm","Un    ",4,null,null,0,""]
["S",2,"S",0,4,7,0,0,0,0,0,"","Serviço","Serviço","-","AGETOP",81179,"BUCHA DE REDUCAO SOLDAVEL LONGA 50 X 25 mm","Un    ",1,null,null,0,""]
["S",2,"S",0,4,7,0,0,0,0,0,"","Serviço","Serviço","-","AGETOP",81324,"JOELHO 90 GRAUS SOLDAVEL 50 mm (MARROM)","Un    ",6,null,null,0,""]
["S",2,"S",0,4,7,0,0,0,0,0,"","Serviço","Serviço","-","AGETOP",81069,"ADAPTAD.SOLD.CURTO C/BOLSA/ROSCA P/REG.50X11/2\"","Un    ",18,null,null,0,""]
["S",2,"S",0,4,7,0,0,0,0,0,"","Serviço","Serviço","-","AGETOP",80929,"REGISTRO DE GAVETA C/CANOPLA DIAMETRO 1.1/2\"","Un    ",5,null,null,0,""]
["S",2,"S",0,4,7,0,0,0,0,0,"","Serviço","Serviço","-","AGETOP",81424,"TE REDUCAO 90 GRAUS SOLDAVEL 50 X 25 mm","Un    ",2,null,null,0,""]
["S",2,"S",0,4,7,0,0,0,0,0,"","Serviço","Serviço","-","AGETOP",80946,"REGISTRO DE PRESSAO C/CANOPLA CROMADA DIAM.3/4\"","Un    ",7,null,null,0,""]
["S",2,"S",0,4,7,0,0,0,0,0,"","Serviço","Serviço","-","AGETOP",81402,"TE 90 GRAUS SOLDAVEL DIAMETRO 25 mm","Un    ",2,null,null,0,""]
["S",2,"S",0,4,7,0,0,0,0,0,"","Serviço","Serviço","-","AGETOP",81406,"TE 90 GRAUS SOLDAVEL DIMETRO 60 mm","Un    ",1,null,null,0,""]
["S",2,"S",0,4,7,0,0,0,0,0,"","Serviço","Serviço","-","AGETOP",81425,"TE REDUCAO 90 GRAUS SOLDAVEL 50 X 32 mm","Un    ",2,null,null,0,""]
["S",2,"S",0,4,7,0,0,0,{"$f":"IF(OR($C962=\"S\",$C962=0),0,MATCH(0,OFFSET($D962,1,$C962,ROW($C$1047)-ROW($C962)),0))","v":0},{"$f":"IF(OR($C962=\"S\",$C962=0),0,MATCH(OFFSET($D962,0,$C962)+1,OFFSET($D962,1,$C962,ROW($C$1047)-ROW($C962)),0))","v":0},"","Serviço","Serviço","-","AGETOP",81445,"TE RED.SOLD.90GR.BUC.LATAO BOLSA CENT.25X25X1/2\"","Un    ",3,null,null,0,""]
["S",2,"S",0,4,7,0,0,0,0,0,"","Serviço","Serviço","-","AGETOP",81182,"BUCHA DE REDUCAO SOLDAVEL LONGA 60 X 32 mm","Un    ",1,null,null,0,""]
["S",2,"S",0,4,7,0,0,0,0,0,"","Serviço","Serviço","-","AGETOP",81003,"TUBO SOLDAVEL PVC MARROM DIAMETRO 25 mm","M     ",57,null,null,0,""]
["S",2,"S",0,4,7,0,0,0,0,0,"","Serviço","Serviço","-","AGETOP",81004,"TUBO SOLDAVEL PVC MARROM DIAMETRO 32 mm","m     ",36,null,null,0,""]
["S",2,"S",0,4,7,0,0,0,0,0,"","Serviço","Serviço","-","AGETOP",81005,"TUBO SOLDAVEL PVC MARROM DIAM.(40 mm)","m     ",6,null,null,0,""]
["S",2,"S",0,4,7,0,0,0,0,0,"","Serviço","Serviço","-","AGETOP",81006,"TUBO SOLDAVEL PVC MARROM DIAM. 50 mm","m     ",39,null,null,0,""]
["S",2,"S",0,4,7,0,0,0,0,0,"","Serviço","Serviço","-","AGETOP",81007,"TUBO SOLDAVEL PVC MARROM DIAMETRO 60 mm (2\")","m     ",45,null,null,0,""]
["S",2,"S",0,4,7,0,0,0,0,0,"","Serviço","Serviço","-","AGETOP",81961,"JUNCAO 45 GRAUS DIAMETRO 40 MM","Un    ",6,null,null,0,""]
["S",2,"S",0,4,7,0,0,0,0,0,"","Serviço","Serviço","-","AGETOP",82304,"TUBO SOLDAVEL P/ESGOTO DIAM. 100 MM","m     ",90,null,null,0,""]
["S",2,"S",0,4,7,0,0,0,0,0,"","Serviço","Serviço","-","AGETOP",82004,"LUVA SIMPLES DIAM. 100 MM","Un    ",17,null,null,0,""]
["S",2,"S",0,4,7,0,0,0,0,0,"","Serviço","Serviço","-","AGETOP",82002,"LUVA SIMPLES DIAMETRO 50 MM","Un    ",47,null,null,0,""]
["S",2,"S",0,4,7,0,0,0,0,0,"","Serviço","Serviço","-","AGETOP",81936,"JOELHO 90 GRAUS DIAMETRO 50 MM","Un    ",11,null,null,0,""]
[{"$f":"CHOOSE(1+LOG(1+2*(ORÇAMENTO.Nivel=\"Nível 1\")+4*(ORÇAMENTO.Nivel=\"Nível 2\")+8*(ORÇAMENTO.Nivel=\"Nível 3\")+16*(ORÇAMENTO.Nivel=\"Nível 4\")+32*(ORÇAMENTO.Nivel=\"Serviço\"),2),0,1,2,3,4,\"S\")","v":"S"},2,"S",0,4,7,0,0,{"$f":"IF(AND($C974<=4,$C974<>0),0,IF(AND($C974=\"S\",$W974>0),OFFSET(I974,-1,0)+1,OFFSET(I974,-1,0)))","v":0},0,0,"","Serviço","Serviço","-","AGETOP",81679,"CORPO RALO SIFONADO CONICO DIAM. 100 X 40","Un    ",11,null,null,0,""]
["S",2,"S",0,4,7,0,0,0,0,0,"","Serviço","Serviço","-","AGETOP",81927,"JOELHO 90 GRAUS C/ANEL 40 mm ","Un    ",23,null,null,0,""]
["S",2,"S",0,4,7,0,0,0,0,0,"","Serviço","Serviço","-","AGETOP",81663,"CORPO CX. SIFONADA DIAM. 150 X 150 X 50","Un    ",9,null,null,0,""]
["S",2,"S",0,{"$f":"IF($C977=1,OFFSET(E977,-1,0)+1,OFFSET(E977,-1,0))","v":4},{"$f":"IF($C977=1,0,IF($C977=2,OFFSET(F977,-1,0)+1,OFFSET(F977,-1,0)))","v":7},{"$f":"IF(AND($C977<=2,$C977<>0),0,IF($C977=3,OFFSET(G977,-1,0)+1,OFFSET(G977,-1,0)))","v":0},{"$f":"IF(AND($C977<=3,$C977<>0),0,IF($C977=4,OFFSET(H977,-1,0)+1,OFFSET(H977,-1,0)))","v":0},0,0,0,"","Serviço","Serviço","-","AGETOP",81922,"JOELHO 45 GRAUS DIAMETRO 50 MM","Un    ",13,null,null,0,""]
["S",2,"S",0,4,7,0,0,0,0,0,"","Serviço","Serviço","-","AGETOP",81935,"JOELHO 90 GRAUS DIAMETRO 40 MM","Un    ",24,null,null,0,""]
["S",2,"S",0,4,7,0,0,0,0,0,"","Serviço","Serviço","-","AGETOP",82003,"LUVA SIMPLES DIAMETRO 75 MM","Un    ",1,null,null,0,""]
["S",2,"S",0,4,7,0,0,0,0,0,"","Serviço","Serviço","-","AGETOP",81921,"JOELHO 45 GRAUS DIAMETRO 40 MM","Un    ",12,null,null,0,""]
["S",2,"S",0,4,7,0,0,0,0,0,"","Serviço","Serviço","-","AGETOP",81602,"BUCHA DE REDUCAO LONGA DIAM. 50 X 40 MM","Un    ",8,null,null,0,""]
["S",2,"S",0,4,7,0,0,0,0,0,"","Serviço","Serviço","-","AGETOP",82302,"TUBO SOLD. P/ESGOTO DIAM. 50 MM","m     ",132,null,null,0,""]
["S",{"$f":"IF(OR(C983=\"s\",C983=0),OFFSET(B983,-1,0),C983)","v":2},{"$f":"IF(OFFSET(C983,-1,0)=\"L\",1,IF(OFFSET(C983,-1,0)=1,2,IF(OR(A983=\"s\",A983=0),\"S\",IF(AND(OFFSET(C983,-1,0)=2,A983=4),3,IF(AND(OR(OFFSET(C983,-1,0)=\"s\",OFFSET(C983,-1,0)=0),A983<>\"s\",A983>OFFSET(B983,-1,0)),OFFSET(B983,-1,0),A983)))))","v":"S"},{"$f":"IF(OR(C983=\"S\",C983=0),0,IF(ISERROR(K983),J983,SMALL(J983:K983,1)))","v":0},4,7,0,0,0,0,0,"","Serviço","Serviço","-","AGETOP",81923,"JOELHO 45 GRAUS DIAMETRO 75 MM","Un    ",1,null,null,0,""]
["S",2,"S",0,4,7,0,0,0,0,0,"","Serviço","Serviço","-","AGETOP",82301,"TUBO SOLD.P/ESGOTO DIAM. 40 MM","m     ",63,null,null,0,""]
["S",2,"S",0,4,7,0,0,0,0,0,"","Serviço","Serviço","-","AGETOP",82303,"TUBO SOLDAVEL P/ESGOTO DIAM.75 MM","m     ",6,null,null,0,""]
["S",2,"S",0,4,7,0,0,0,0,0,"","Serviço","Serviço","-","AGETOP",81938,"JOELHO 90 GRAUS DIAMETRO 100 MM","Un    ",9,null,null,0,""]
["S",2,"S",0,4,7,0,0,0,0,0,"","Serviço","Serviço","-","AGETOP",81970,"JUNCAO SIMPLES DIAMETRO 50 X 50 MM","Un    ",2,null,null,0,""]
["S",2,"S",0,4,7,0,0,0,0,0,"","Serviço","Serviço","-","AGETOP",82230,"TE SANITARIO DIAMETRO 50 X 50 MM","Un    ",10,null,null,0,""]
["S",2,"S",0,4,7,0,0,0,0,0,"","Serviço","Serviço","-","AGETOP",81975,"JUNCAO SIMPLES DIAM. 100 X 100 MM","Un    ",4,null,null,0,""]
["S",2,"S",0,4,7,0,0,0,0,0,"","Serviço","Serviço","-","AGETOP",82233,"TE SANITARIO DIAMETRO 100 X 50 MM","Un    ",2,null,null,0,""]
["S",2,"S",0,4,7,0,0,0,0,0,"","Serviço","Serviço","-","AGETOP",81664,"CORPO CX. SIFONADA DIAM. 150 X 185 X 75","Un    ",2,null,null,0,""]
["S",2,"S",0,4,7,0,0,0,0,0,"","Serviço","Serviço","-","AGETOP",81924,"JOELHO 45 GRAUS DIAMETRO 100 MM","Un    ",2,null,null,0,""]
["S",2,"S",0,4,7,0,0,0,0,0,"","Serviço","Serviço","-","AGETOP",81885,"TERMINAL DE VENTILACAO DIAMETRO 50 MM","Un    ",9,null,null,0,""]
["S",2,"S",0,4,7,0,0,0,0,0,"","Serviço","Serviço","-","AGETOP",81770,"GRELHA QUADRADA BRANCA DIAM. 100 MM","Un    ",11,null,null,0,""]
["S",2,"S",0,4,7,0,0,0,0,0,"","Serviço","Serviço","-","AGETOP",81771,"GRELHA QUADRADA BRANCA DIAM. 150 MM","Un    ",11,null,null,0,""]
["S",2,"S",0,4,7,0,0,0,0,0,"","Serviço","Serviço","-","AGETOP",82051,"PORTA GRELHA QUADRADA BRANCO DIAM. 150 MM","Un    ",11,null,null,0,""]
["S",2,"S",0,4,7,0,0,0,0,0,"","Serviço","Serviço","-","AGETOP",82053,"PORTA GRELHA QUADRADO P/GREL.QUADRADA DIAM. 100 MM","Un    ",11,null,null,0,""]
["S",2,"S",0,4,7,0,0,0,0,0,"","Serviço","Serviço","-","AGETOP",85003,"EXTINTOR PO QUIMICO SECO (6 KG) - CAPACIDADE EXTINTORA 20 BC","Un    ",1,null,null,0,""]
[2,2,2,5,4,8,0,0,0,48,5,"","Nível 2","Nível 2","-","SINAPI",null,"ALVENARIAS E DIVISÓRIAS","-",null,null,null,0,""]
["S",2,"S",0,4,8,0,0,0,0,0,"","Serviço","Serviço","-","SINAPI",87520,"ALVENARIA DE VEDAÇÃO DE BLOCOS CERÂMICOS FURADOS NA HORIZONTAL DE 9X19X19CM (ESPESSURA 9CM) DE PAREDES COM ÁREA LÍQUIDA MAIOR OU IGUAL A 6M² COM VÃOS E ARGAMASSA DE ASSENTAMENTO COM PREPARO MANUAL. AF_06/2014","M2",289.64,null,null,0,"Referência: AGETOP - 100201"]
["S",2,"S",0,4,8,0,0,0,0,0,"","Serviço","Serviço","-","SINAPI",87489,"ALVENARIA DE VEDAÇÃO DE BLOCOS CERÂMICOS FURADOS NA VERTICAL DE 9X19X39CM (ESPESSURA 9CM) DE PAREDES COM ÁREA LÍQUIDA MAIOR OU IGUAL A 6M² COM VÃOS E ARGAMASSA DE ASSENTAMENTO COM PREPARO EM BETONEIRA. AF_06/2014","M2",17.55,null,null,0,""]
["S",2,"S",0,4,8,0,0,0,0,0,"","Serviço","Serviço","-","SINAPI",79627,"DIVISORIA EM GRANITO BRANCO POLIDO, ESP = 3CM, ASSENTADO COM ARGAMASSA TRACO 1:4, ARREMATE EM CIMENTO BRANCO, EXCLUSIVE FERRAGENS","M2",4.24,null,null,0,"Referência: AGETOP - 100320"]
["S",2,"S",0,4,8,0,0,0,0,0,"","Serviço","Serviço","-","SINAPI","73937/1","COBOGO DE CONCRETO (ELEMENTO VAZADO), 7X50X50CM, ASSENTADO COM ARGAMASSA TRACO 1:4 (CIMENTO E AREIA)","M2",15.8,null,null,0,"Referência: AGETOP - 100501"]
[2,2,2,2,4,9,0,0,0,43,2,"","Nível 2","Nível 2","-","SINAPI",null,"IMPERMEABILIZAÇÃO","-",null,null,null,0,""]
["S",2,"S",0,4,9,0,0,0,0,0,"","Serviço","Serviço","-","SINAPI",98562,"IMPERMEABILIZAÇÃO DE FLOREIRA OU VIGA BALDRAME COM ARGAMASSA DE CIMENTO E AREIA, COM ADITIVO IMPERMEABILIZANTE, E = 2 CM. AF_06/2018","M2",81.680000000000007,null,null,0,"Referência: AGETOP - 120902"]
[2,2,2,2,4,10,0,0,0,41,2,"","Nível 2","Nível 2","-","SINAPI",null,"ESTRUTURAS METÁLICAS","-",null,null,null,0,""]
["S",2,"S",0,4,10,0,0,0,0,0,"","Serviço","Serviço","-","AGETOP",150103,"ESTRUTURA METÁLICA CONVENCIONAL EM AÇO DO TIPO USI SAC-300 COM FUNDO ANTICORROSIVO","Kg    ",2974.53,null,null,0,""]
[2,2,2,4,4,11,0,0,0,39,4,"","Nível 2","Nível 2","-","SINAPI",null,"COBERTURAS","-",null,null,null,0,""]
["S",2,"S",0,4,11,0,0,0,0,0,"","Serviço","Serviço","-","SINAPI",94445,"TELHAMENTO COM TELHA CERÂMICA CAPA-CANAL, TIPO PLAN, COM ATÉ 2 ÁGUAS, INCLUSO TRANSPORTE VERTICAL. AF_07/2019","M2",259.14,null,null,0,"Referência: AGETOP - 160401"]
["S",2,"S",0,4,11,0,0,0,0,0,"","Serviço","Serviço","-","SINAPI",94221,"CUMEEIRA PARA TELHA CERÂMICA EMBOÇADA COM ARGAMASSA TRAÇO 1:2:9 (CIMENTO, CAL E AREIA) PARA TELHADOS COM ATÉ 2 ÁGUAS, INCLUSO TRANSPORTE VERTICAL. AF_07/2019","M",30.85,null,null,0,""]
["S",2,"S",0,4,11,0,0,0,0,0,"","Serviço","Serviço","-","SINAPI",94224,"EMBOÇAMENTO COM ARGAMASSA TRAÇO 1:2:9 (CIMENTO, CAL E AREIA). AF_07/2019","M",16.8,null,null,0,"Referência: AGETOP - 160403"]
[2,2,2,4,4,12,0,0,0,35,4,"","Nível 2","Nível 2","-","SINAPI",null,"ESQUADRIAS METÁLICAS","-",null,null,null,0,""]
["S",2,"S",0,4,12,0,0,0,0,0,"","Serviço","Serviço","-","AGETOP",180381,"ESQ. MAXIMO AR CHAPA/VIDRO J3/J5/J6/J8 C/FERRAGENS","m2    ",14.16,null,null,0,""]
["S",2,"S",0,4,12,0,0,0,0,0,"","Serviço","Serviço","-","SINAPI","73933/4","PORTA DE FERRO DE ABRIR TIPO BARRA CHATA, COM REQUADRO E GUARNICAO COMPLETA","M2",27.600000000000005,null,null,0,"Referência: AGETOP - 180501"]
["S",2,"S",0,4,12,0,0,0,0,0,"","Serviço","Serviço","-","SINAPI","74136/3","PORTA DE ACO CHAPA 24, DE ENROLAR, RAIADA, LARGA COM ACABAMENTO GALVANIZADO NATURAL","M2",5.74,null,null,0,"Referência: AGETOP - 180303"]
[2,2,2,2,4,13,0,0,0,31,2,"","Nível 2","Nível 2","-","SINAPI",null,"VIDROS","-",null,null,null,0,""]
["S",2,"S",0,4,13,0,0,0,0,0,"","Serviço","Serviço","-","SINAPI",72117,"VIDRO LISO COMUM TRANSPARENTE, ESPESSURA 4MM","M2",14.16,null,null,0,"Referência: AGETOP - 190102"]
[2,2,2,5,4,14,0,0,0,29,5,"","Nível 2","Nível 2","-","SINAPI",null,"REVESTIMENTO DE PAREDE","-",null,null,null,0,""]
["S",2,"S",0,4,14,0,0,0,0,0,"","Serviço","Serviço","-","SINAPI",87904,"CHAPISCO APLICADO EM ALVENARIA (COM PRESENÇA DE VÃOS) E ESTRUTURAS DE CONCRETO DE FACHADA, COM COLHER DE PEDREIRO.  ARGAMASSA TRAÇO 1:3 COM PREPARO MANUAL. AF_06/2014","M2",614.38,null,null,0,"Referência: AGETOP - 200101"]
["S",2,"S",0,4,14,0,0,0,0,0,"","Serviço","Serviço","-","SINAPI",87553,"EMBOÇO, PARA RECEBIMENTO DE CERÂMICA, EM ARGAMASSA TRAÇO 1:2:8, PREPARO MECÂNICO COM BETONEIRA 400L, APLICADO MANUALMENTE EM FACES INTERNAS DE PAREDES, PARA AMBIENTE COM ÁREA MAIOR QUE 10M2, ESPESSURA DE 10MM, COM EXECUÇÃO DE TALISCAS. AF_06/2014","M2",266.39999999999998,null,null,0,""]
["S",2,"S",0,4,14,0,0,0,0,0,"","Serviço","Serviço","-","SINAPI",87547,"MASSA ÚNICA, PARA RECEBIMENTO DE PINTURA, EM ARGAMASSA TRAÇO 1:2:8, PREPARO MECÂNICO COM BETONEIRA 400L, APLICADA MANUALMENTE EM FACES INTERNAS DE PAREDES, ESPESSURA DE 10MM, COM EXECUÇÃO DE TALISCAS. AF_06/2014","M2",347.98,null,null,0,""]
["S",2,"S",0,4,14,0,0,0,0,0,"","Serviço","Serviço","-","SINAPI",87273,"REVESTIMENTO CERÂMICO PARA PAREDES INTERNAS COM PLACAS TIPO ESMALTADA EXTRA DE DIMENSÕES 33X45 CM APLICADAS EM AMBIENTES DE ÁREA MAIOR QUE 5 M² NA ALTURA INTEIRA DAS PAREDES. AF_06/2014","M2",266.39999999999998,null,null,0,""]
[2,2,2,3,4,15,0,0,0,24,3,"","Nível 2","Nível 2","-","SINAPI",null,"FORROS","-",null,null,null,0,""]
["S",2,"S",0,4,15,0,0,0,0,0,"","Serviço","Serviço","-","SINAPI",87884,"CHAPISCO APLICADO NO TETO, COM ROLO PARA TEXTURA ACRÍLICA. ARGAMASSA INDUSTRIALIZADA COM PREPARO MANUAL. AF_06/2014","M2",91.12,null,null,0,"Referência: AGETOP - 210102"]
["S",2,"S",0,4,15,0,0,0,0,0,"","Serviço","Serviço","-","SINAPI",90408,"MASSA ÚNICA, PARA RECEBIMENTO DE PINTURA, EM ARGAMASSA TRAÇO 1:2:8, PREPARO MECÂNICO COM BETONEIRA 400L, APLICADA MANUALMENTE EM TETO, ESPESSURA DE 10MM, COM EXECUÇÃO DE TALISCAS. AF_03/2015","M2",91.12,null,null,0,"Referência: AGETOP - 210401"]
[2,2,2,5,4,16,0,0,0,{"$f":"IF(OR($C1026=\"S\",$C1026=0),0,MATCH(0,OFFSET($D1026,1,$C1026,ROW($C$1047)-ROW($C1026)),0))","v":21},{"$f":"IF(OR($C1026=\"S\",$C1026=0),0,MATCH(OFFSET($D1026,0,$C1026)+1,OFFSET($D1026,1,$C1026,ROW($C$1047)-ROW($C1026)),0))","v":5},"","Nível 2","Nível 2","-","SINAPI",null,"REVESTIMENTO DE PISO","-",null,null,null,0,""]
["S",2,"S",0,4,16,0,0,0,0,0,"","Serviço","Serviço","-","AGETOP",220101,"LASTRO DE CONCRETO REGULARIZADO IMPERMEABILIZADO 1:3:6 ESP=5CM (BASE)","m2    ",193.41,null,null,0,""]
["S",2,"S",0,4,16,0,0,0,0,0,"","Serviço","Serviço","-","SINAPI",84191,"PISO EM GRANILITE, MARMORITE OU GRANITINA ESPESSURA 8 MM, INCLUSO JUNTAS DE DILATACAO PLASTICAS","M2",193.41,null,null,0,"Referência: AGETOP - 221101"]
["S",2,"S",0,4,16,0,0,0,0,0,"","Serviço","Serviço","-","AGETOP",221104,"RASPAGEM E APLICAÇÃO RESINA ACRÍLICA DUAS DEMÃOS","m2    ",193.41,null,null,0,""]
["S",2,"S",0,4,16,0,0,0,0,0,"","Serviço","Serviço","-","AGETOP",220100,"PASSEIO PROTECAO EM CONC.DESEMPEN.5 CM 1:2,5:3,5 ( INCLUSO ESPELHO DE 30CM/ESCAVAÇÃO/REATERRO/APILOAMENTO/ATERRO INTERNO)","m2    ",45.88,null,null,0,""]
[2,2,2,3,4,17,0,0,0,16,3,"","Nível 2","Nível 2","-","SINAPI",null,"FERRAGENS","-",null,null,null,0,""]
["S",2,"S",0,4,17,0,0,0,0,0,"","Serviço","Serviço","-","AGETOP",230174,"BARRA DE APOIO EM AÇO INOX - 40 CM","un    ",6,null,null,0,""]
["S",2,"S",0,4,17,0,0,0,0,0,"","Serviço","Serviço","-","AGETOP",230176,"BARRA DE APOIO EM AÇO INOX - 80 CM ","un    ",6,null,null,0,""]
[2,2,2,2,4,18,0,0,0,13,2,"","Nível 2","Nível 2","-","SINAPI",null,"MARCENARIA","-",null,null,null,0,""]
["S",2,"S",0,4,18,0,0,0,0,0,"","Serviço","Serviço","-","AGETOP",240209,"PRATELEIRA EST.CAIBRO 4+1 TABUAS APARELHADAS E ENVERNIZADAS","m     ",3.85,null,null,0,""]
[2,2,2,7,4,19,0,0,0,11,7,"","Nível 2","Nível 2","-","SINAPI",null,"PINTURA","-",null,null,null,0,""]
["S",2,"S",0,4,19,0,0,0,0,0,"","Serviço","Serviço","-","SINAPI",88497,"APLICAÇÃO E LIXAMENTO DE MASSA LÁTEX EM PAREDES, DUAS DEMÃOS. AF_06/2014","M2",140.68,null,null,0,"Referência: AGETOP - 261300"]
["S",2,"S",0,4,19,0,0,0,0,0,"","Serviço","Serviço","-","SINAPI",88489,"APLICAÇÃO MANUAL DE PINTURA COM TINTA LÁTEX ACRÍLICA EM PAREDES, DUAS DEMÃOS. AF_06/2014","M2",140.68,null,null,0,"Referência: AGETOP - 261001"]
["S",2,"S",0,4,19,0,0,0,0,0,"","Serviço","Serviço","-","SINAPI",88496,"APLICAÇÃO E LIXAMENTO DE MASSA LÁTEX EM TETO, DUAS DEMÃOS. AF_06/2014","M2",91.12,null,null,0,"Referência: AGETOP - 261300"]
["S",2,"S",0,4,19,0,0,0,0,0,"","Serviço","Serviço","-","SINAPI",88486,"APLICAÇÃO MANUAL DE PINTURA COM TINTA LÁTEX PVA EM TETO, DUAS DEMÃOS. AF_06/2014","M2",91.12,null,null,0,"Referência: AGETOP - 261307"]
["S",2,"S",0,4,19,0,0,0,0,0,"","Serviço","Serviço","-","SINAPI","74145/1","PINTURA ESMALTE FOSCO, DUAS DEMAOS, SOBRE SUPERFICIE METALICA, INCLUSO UMA DEMAO DE FUNDO ANTICORROSIVO. UTILIZACAO DE REVOLVER ( AR-COMPRIMIDO).","M2",128.34,null,null,0,"Referência: AGETOP - 261602"]
["S",2,"S",0,4,19,0,0,0,0,0,"","Serviço","Serviço","-","SINAPI","74145/1","PINTURA ESMALTE FOSCO, DUAS DEMAOS, SOBRE SUPERFICIE METALICA, INCLUSO UMA DEMAO DE FUNDO ANTICORROSIVO. UTILIZACAO DE REVOLVER ( AR-COMPRIMIDO).","M2",259.14,null,null,0,"Referência: AGETOP - 261602"]
[2,2,2,4,4,20,0,0,0,4,{"$error":"#N/A"},"","Nível 2","Nível 2","-","SINAPI",null,"DIVERSOS","-",null,null,null,0,""]
["S",2,"S",0,4,20,0,0,0,0,0,"","Serviço","Serviço","-","AGETOP",270501,"LIMPEZA FINAL DE OBRA - (OBRAS CIVIS)","m2    ",191.73,null,null,0,""]
["S",2,"S",0,4,20,0,0,0,0,0,"","Serviço","Serviço","-","AGETOP",271608,"BANCADA DE GRANITO C/ESPELHO","m2    ",7.98,null,null,0,""]
["S",2,"S",0,4,20,0,0,0,0,0,"","Serviço","Serviço","-","AGETOP",271303,"BANCO DE CONCRETO POLIDO BASE EM ALVENARIA REBOCADA E PINTADA - PADRÃO AGETOP 2015","m     ",15.2,null,null,0,""]
[-1,null,-1,null,0,0,0,0,0,null,null,"F"]
[null,null,null,null,null,null,null,null,null,null,null,"F",null,null,null,null,null,"OBS: OS QUANTITATIVOS DE MATERIAIS  DAS INSTALAÇÕES HIDROSSANITÁRIAS, ELÉTRICAS E ESPECIAIS SÃO FORNECIDOS PELOS PROFISSIONAIS RESPONSÁVEIS PELOS RESPECTIVOS PROJETOS.",null,null,"VALOR TOTAL",null,0]
[null,null,null,null,null,null,null,null,null,null,null,"F",null,null,null,null,null,null,null,null,"VALOR BDI (20,35%)",null,0]
[null,null,null,null,null,null,null,null,null,null,null,"F",null,null,null,null,null,null,null,null,"TOTAL ORÇAMENTO",null,0]
[null,null,null,null,null,null,null,null,null,null,null,"F"]
[null,null,null,null,null,null,null,null,null,null,null,"F",null,null,null,null,null,null,null,null,"CUSTO POR M2 ³",null,0]
[null,null,null,null,null,null,null,null,null,null,null,"F",null,null,null,null,null,null,null,null,"MATERIAL S/ BDI",null,0]
[null,null,null,null,null,null,null,null,null,null,null,"F",null,null,null,null,null,null,null,null,"MÃO DE OBRA S/ BDI",null,0]
[null,null,null,null,null,null,null,null,null,null,null,"F"]
[null,null,null,null,null,null,null,null,null,null,null,"F",null,null,null,null,"(1) Conforme previsto pelo DECRETO Nº 7.983, DE 8 DE ABRIL DE 2013, os preços adotados são aqueles constantes dos sistemas de referência indicados. Justifica-se o uso dos preços destas composições de custos unitários devido ao seu valor ser menor à mediana de seus correspondentes na tabela SINAPI;"]
[null,null,null,null,null,null,null,null,null,null,null,"F",null,null,null,null,"(2) Optou-se pelo uso das composições de custos da AGETOP para itens não presentes na SINAPI;"]
[null,null,null,null,null,null,null,null,null,null,null,"F",null,null,null,null,"(3) Para itens da AGETOP, os vidros não estão inclusos nas esquadrias e já foram considerados os custos de contramarco para as esquadrias de alumínio;"]
[null,null,null,null,null,null,null,null,null,null,null,"F",null,null,null,null,"(4) Nos casos em que houver execução de granitina e omissão do item AGETOP 221102, considerou-se que o quantitativo para o rodapé, de altura igual a 7cm, foi incorporado na área de piso;"]
[null,null,null,null,null,null,null,null,null,null,null,"F",null,null,null,null,"(5) O custo unitário aproximado por metro quadrado é calculado dividindo-se o valor total do orçamento pela área total de construção."]
[null,null,null,null,null,null,null,null,null,null,null,"F"]
[null,null,null,null,null,null,null,null,null,null,null,"F"]
[]
[null,null,null,null,null,null,null,null,null,null,null,null,null,null,"SOMATÓRIO DE SERVIÇOS"]
[null,null,null,null,null,null,null,null,null,null,null,null,null,null,"ITEM","DESCRIÇÃO DOS SERVIÇOS",null,null,"PREÇO SEM BDI",null,null,"PREÇO COM BDI",null,"PARTICIPAÇÃO ( % )"]
[null,null,null,null,null,null,null,null,null,null,null,null,null,null,"a.","SERVIÇOS PRELIMINARES",null,null,{"$f":"SUMIF($R$19:$R$1047,$P1066,$W$19:$W$1047)","v":0},null,null,{"$f":"ROUND(S1066*(1+BDI.Taxa),2)","v":0},null,{"$f":"IFERROR(ROUND($V1066*100/$W$1050,2),0)","v":0}]
[null,null,null,null,null,null,null,null,null,null,null,null,null,null,"b.","TRANSPORTES",null,null,0,null,null,0,null,{"$f":"IFERROR(ROUND($V1067*100/$W$1050,2),0)","v":0}]
[null,null,null,null,null,null,null,null,null,null,null,null,null,null,"c.","SERVIÇO EM TERRA",null,null,0,null,null,0,null,0]
[null,null,null,null,null,null,null,null,null,null,null,null,null,null,"d.","FUNDAÇÕES E SONDAGENS",null,null,0,null,null,0,null,0]
[null,null,null,null,null,null,null,null,null,null,null,null,null,null,"e.","ESTRUTURA",null,null,0,null,null,0,null,0]
[null,null,null,null,null,null,null,null,null,null,null,null,null,null,"f.","INSTALAÇÕES ELÉTRICAS",null,null,0,null,null,0,null,0]
[null,null,null,null,null,null,null,null,null,null,null,null,null,null,"g.","INSTALAÇÕES HIDROSSANITÁRIAS",null,null,0,null,null,0,null,0]
[null,null,null,null,null,null,null,null,null,null,null,null,null,null,"h","INSTALAÇÕES ESPECIAIS",null,null,0,null,null,0,null,0]
[null,null,null,null,null,null,null,null,null,null,null,null,null,null,"i.","ALVENARIAS E DIVISÓRIAS",null,null,0,null,null,0,null,0]
[null,null,null,null,null,null,null,null,null,null,null,null,null,null,"j.","ALVENARIA AUTO-PORTANTE",null,null,0,null,null,0,null,0]
[null,null,null,null,null,null,null,null,null,null,null,null,null,null,"k.","IMPERMEABILIZAÇÃO",null,null,0,null,null,0,null,0]
[null,null,null,null,null,null,null,null,null,null,null,null,null,null,"l.","ISOLAMENTO TÉRMICO E ACÚSTICO",null,null,0,null,null,0,null,0]
[null,null,null,null,null,null,null,null,null,null,null,null,null,null,"m.","ESTRUTURA DE MADEIRA",null,null,0,null,null,0,null,0]
[null,null,null,null,null,null,null,null,null,null,null,null,null,null,"n.","ESTRUTURAS METÁLICAS",null,null,0,null,null,0,null,0]
[null,null,null,null,null,null,null,null,null,null,null,null,null,null,"o.","COBERTURAS",null,null,0,null,null,0,null,0]
[null,null,null,null,null,null,null,null,null,null,null,null,null,null,"p.","ESQUADRIAS DE MADEIRA",null,null,0,null,null,0,null,0]
[null,null,null,null,null,null,null,null,null,null,null,null,null,null,"q.","ESQUADRIAS METÁLICAS",null,null,0,null,null,{"$f":"ROUND(S1082*(1+BDI.Taxa),2)","v":0},null,0]
[null,null,null,null,null,null,null,null,null,null,null,null,null,null,"r.","VIDROS",null,null,0,null,null,0,null,0]
[null,null,null,null,null,null,null,null,null,null,null,null,null,null,"s.","REVESTIMENTO DE PAREDE",null,null,0,null,null,0,null,0]
[null,null,null,null,null,null,null,null,null,null,null,null,null,null,"t.","FORROS",null,null,0,null,null,0,null,0]
[null,null,null,null,null,null,null,null,null,null,null,null,null,null,"u.","REVESTIMENTO DE PISO",null,null,0,null,null,0,null,0]
[null,null,null,null,null,null,null,null,null,null,null,null,null,null,"v.","FERRAGENS",null,null,0,null,null,0,null,0]
[null,null,null,null,null,null,null,null,null,null,null,null,null,null,"w.","MARCENARIA",null,null,0,null,null,0,null,0]
[null,null,null,null,null,null,null,null,null,null,null,null,null,null,"x.","ADMINISTRAÇÃO",null,null,0,null,null,0,null,0]
[null,null,null,null,null,null,null,null,null,null,null,null,null,null,"y.","PINTURA",null,null,0,null,null,{"$f":"ROUND(S1090*(1+BDI.Taxa),2)","v":0},null,0]
[null,null,null,null,null,null,null,null,null,null,null,null,null,null,"z.","DIVERSOS",null,null,0,null,null,{"$f":"IF(S1091>0,IF((SUM(V1066:W1090)+ROUND(S1091*(1+BDI.Taxa),2))<>V1093,V1093-SUM(V1066:W1090),ROUND(S1091*(1+BDI.Taxa),2)),0)","v":0},null,{"$f":"IF(S1091>0,IF((SUM(X1066:X1090)+IFERROR(ROUND($V1091*100/$W$1050,2),0))<>X1093,X1093-SUM(X1066:X1090),IFERROR(ROUND($V1091*100/$W$1050,2),0)),0)","v":0}]
[null,null,null,null,null,null,null,null,null,null,null,null,null,null,"TOTAL GERAL DO ORÇAMENTO (R$)",null,null,null,{"$f":"SUM(S1066:U1091)","v":0},null,null,{"$f":"SUM(V1066:W1091)","v":0},null,{"$f":"SUM(X1066:X1091)","v":0}]
[null,null,null,null,null,null,null,null,null,null,null,null,null,null,null,null,null,null,{"$f":"$W$1048","v":0},null,null,{"$f":"$W$1050","v":0},null,100]
[null,null,null,null,null,null,null,null,null,null,null,null,null,null,null,null,null,null,"(TOTAL SEM BDI)",null,null,"(TOTAL COM BDI)",null,"(ARRED porcentagem)"]
[null,null,null,null,null,null,null,null,null,null,null,null,null,null,null,null,null,null,{"$f":"IF(AND(S1092=S1093,S1092>0),\"OK\",\"ERRO\")","v":"ERRO"},null,null,{"$f":"IF(AND(V1092=V1093,V1092>0),\"OK\",\"ERRO\")","v":"ERRO"},null,{"$f":"IF(X1092=100,\"OK\",\"ERRO\")","v":"ERRO"}]
[]
[]
[null,null,null,null,null,null,null,null,null,null,null,null,null,null,"RESUMO GERAL DO ORÇAMENTO"]
[null,null,null,null,null,null,null,null,null,null,null,null,null,null,"ITEM","DESCRIÇÃO DOS SERVIÇOS",null,null,"PREÇO SEM BDI",null,null,"PREÇO COM BDI",null,"PARTICIPAÇÃO ( % )"]
[null,null,null,null,null,null,null,null,null,null,null,null,null,null,"1.",{"$f":"IFERROR(VLOOKUP(O1100,$O$19:$W$1047,4,FALSE),\"\")","v":"REFORMA"},null,null,{"$f":"IF(P1101=\"\",$S$1121-SUM(OFFSET($S$1099:S1099,0,0,COUNTA($S$1099:S1099),1)),SUMIF($R$19:$R$1047,$P1100,$W$19:$W$1047))","v":0},null,null,{"$f":"IF(P1101=\"\",$V$1121-SUM(OFFSET($V$1099:V1099,0,0,COUNTA($V$1099:V1099),1)),ROUND(S1100*(1+BDI.Taxa),2))","v":0},null,{"$f":"IF(P1101=\"\",$X$1121-SUM(OFFSET($X$1099:X1099,0,0,COUNTA($X$1099:X1099),1)),ROUND(V1100*100/ORÇAMENTO.TotalOrçamento,2))","v":{"$error":"#DIV/0!"}}]
[null,null,null,null,null,null,null,null,null,null,null,null,null,null,"2.","BLOCO 02 SALAS PADRÃO SEDUC 2017 - LAJE",null,null,{"$f":"IF(P1102=\"\",$S$1121-SUM(OFFSET($S$1099:S1100,0,0,COUNTA($S$1099:S1100),1)),SUMIF($R$19:$R$1047,$P1101,$W$19:$W$1047))","v":0},null,null,{"$f":"IF(P1102=\"\",$V$1121-SUM(OFFSET($V$1099:V1100,0,0,COUNTA($V$1099:V1100),1)),ROUND(S1101*(1+BDI.Taxa),2))","v":0},null,{"$f":"IF(P1102=\"\",$X$1121-SUM(OFFSET($X$1099:X1100,0,0,COUNTA($X$1099:X1100),1)),ROUND(V1101*100/ORÇAMENTO.TotalOrçamento,2))","v":{"$error":"#DIV/0!"}}]
[null,null,null,null,null,null,null,null,null,null,null,null,null,null,"3.","PÁTIO MULTIUSO - PADRÃO SEDUC - OPÇÃO 03",null,null,{"$f":"IF(P1103=\"\",$S$1121-SUM(OFFSET($S$1099:S1101,0,0,COUNTA($S$1099:S1101),1)),SUMIF($R$19:$R$1047,$P1102,$W$19:$W$1047))","v":0},null,null,{"$f":"IF(P1103=\"\",$V$1121-SUM(OFFSET($V$1099:V1101,0,0,COUNTA($V$1099:V1101),1)),ROUND(S1102*(1+BDI.Taxa),2))","v":0},null,{"$f":"IF(P1103=\"\",$X$1121-SUM(OFFSET($X$1099:X1101,0,0,COUNTA($X$1099:X1101),1)),ROUND(V1102*100/ORÇAMENTO.TotalOrçamento,2))","v":{"$error":"#DIV/0!"}}]
[null,null,null,null,null,null,null,null,null,null,null,null,null,null,"4.","COZINHA / PÁTIO / SANITÁRIO SEDUC 2009",null,null,{"$f":"IF(P1104=\"\",$S$1121-SUM(OFFSET($S$1099:S1102,0,0,COUNTA($S$1099:S1102),1)),SUMIF($R$19:$R$1047,$P1103,$W$19:$W$1047))","v":0},null,null,{"$f":"IF(P1104=\"\",$V$1121-SUM(OFFSET($V$1099:V1102,0,0,COUNTA($V$1099:V1102),1)),ROUND(S1103*(1+BDI.Taxa),2))","v":0},null,{"$f":"IF(P1104=\"\",$X$1121-SUM(OFFSET($X$1099:X1102,0,0,COUNTA($X$1099:X1102),1)),ROUND(V1103*100/ORÇAMENTO.TotalOrçamento,2))","v":{"$error":"#DIV/0!"}}]
[null,null,null,null,null,null,null,null,null,null,null,null,null,null,"5.","",null,null,{"$f":"IF(P1105=\"\",$S$1121-SUM(OFFSET($S$1099:S1103,0,0,COUNTA($S$1099:S1103),1)),SUMIF($R$19:$R$1047,$P1104,$W$19:$W$1047))","v":0},null,null,{"$f":"IF(P1105=\"\",$V$1121-SUM(OFFSET($V$1099:V1103,0,0,COUNTA($V$1099:V1103),1)),ROUND(S1104*(1+BDI.Taxa),2))","v":0},null,{"$f":"IF(P1105=\"\",$X$1121-SUM(OFFSET($X$1099:X1103,0,0,COUNTA($X$1099:X1103),1)),ROUND(V1104*100/ORÇAMENTO.TotalOrçamento,2))","v":{"$error":"#DIV/0!"}}]
[null,null,null,null,null,null,null,null,null,null,null,null,null,null,"6.","",null,null,{"$f":"IF(P1106=\"\",$S$1121-SUM(OFFSET($S$1099:S1104,0,0,COUNTA($S$1099:S1104),1)),SUMIF($R$19:$R$1047,$P1105,$W$19:$W$1047))","v":0},null,null,{"$f":"IF(P1106=\"\",$V$1121-SUM(OFFSET($V$1099:V1104,0,0,COUNTA($V$1099:V1104),1)),ROUND(S1105*(1+BDI.Taxa),2))","v":0},null,{"$f":"IF(P1106=\"\",$X$1121-SUM(OFFSET($X$1099:X1104,0,0,COUNTA($X$1099:X1104),1)),ROUND(V1105*100/ORÇAMENTO.TotalOrçamento,2))","v":{"$error":"#DIV/0!"}}]
[null,null,null,null,null,null,null,null,null,null,null,null,null,null,"7.","",null,null,{"$f":"IF(P1107=\"\",$S$1121-SUM(OFFSET($S$1099:S1105,0,0,COUNTA($S$1099:S1105),1)),SUMIF($R$19:$R$1047,$P1106,$W$19:$W$1047))","v":0},null,null,{"$f":"IF(P1107=\"\",$V$1121-SUM(OFFSET($V$1099:V1105,0,0,COUNTA($V$1099:V1105),1)),ROUND(S1106*(1+BDI.Taxa),2))","v":0},null,{"$f":"IF(P1107=\"\",$X$1121-SUM(OFFSET($X$1099:X1105,0,0,COUNTA($X$1099:X1105),1)),ROUND(V1106*100/ORÇAMENTO.TotalOrçamento,2))","v":{"$error":"#DIV/0!"}}]
[null,null,null,null,null,null,null,null,null,null,null,null,null,null,"8.","",null,null,{"$f":"IF(P1108=\"\",$S$1121-SUM(OFFSET($S$1099:S1106,0,0,COUNTA($S$1099:S1106),1)),SUMIF($R$19:$R$1047,$P1107,$W$19:$W$1047))","v":0},null,null,{"$f":"IF(P1108=\"\",$V$1121-SUM(OFFSET($V$1099:V1106,0,0,COUNTA($V$1099:V1106),1)),ROUND(S1107*(1+BDI.Taxa),2))","v":0},null,{"$f":"IF(P1108=\"\",$X$1121-SUM(OFFSET($X$1099:X1106,0,0,COUNTA($X$1099:X1106),1)),ROUND(V1107*100/ORÇAMENTO.TotalOrçamento,2))","v":{"$error":"#DIV/0!"}}]
[null,null,null,null,null,null,null,null,null,null,null,null,null,null,"9.","",null,null,{"$f":"IF(P1109=\"\",$S$1121-SUM(OFFSET($S$1099:S1107,0,0,COUNTA($S$1099:S1107),1)),SUMIF($R$19:$R$1047,$P1108,$W$19:$W$1047))","v":0},null,null,{"$f":"IF(P1109=\"\",$V$1121-SUM(OFFSET($V$1099:V1107,0,0,COUNTA($V$1099:V1107),1)),ROUND(S1108*(1+BDI.Taxa),2))","v":0},null,{"$f":"IF(P1109=\"\",$X$1121-SUM(OFFSET($X$1099:X1107,0,0,COUNTA($X$1099:X1107),1)),ROUND(V1108*100/ORÇAMENTO.TotalOrçamento,2))","v":{"$error":"#DIV/0!"}}]
[null,null,null,null,null,null,null,null,null,null,null,null,null,null,"10.","",null,null,{"$f":"IF(P1110=\"\",$S$1121-SUM(OFFSET($S$1099:S1108,0,0,COUNTA($S$1099:S1108),1)),SUMIF($R$19:$R$1047,$P1109,$W$19:$W$1047))","v":0},null,null,{"$f":"IF(P1110=\"\",$V$1121-SUM(OFFSET($V$1099:V1108,0,0,COUNTA($V$1099:V1108),1)),ROUND(S1109*(1+BDI.Taxa),2))","v":0},null,{"$f":"IF(P1110=\"\",$X$1121-SUM(OFFSET($X$1099:X1108,0,0,COUNTA($X$1099:X1108),1)),ROUND(V1109*100/ORÇAMENTO.TotalOrçamento,2))","v":{"$error":"#DIV/0!"}}]
[null,null,null,null,null,null,null,null,null,null,null,null,null,null,"11.","",null,null,{"$f":"IF(P1111=\"\",$S$1121-SUM(OFFSET($S$1099:S1109,0,0,COUNTA($S$1099:S1109),1)),SUMIF($R$19:$R$1047,$P1110,$W$19:$W$1047))","v":0},null,null,{"$f":"IF(P1111=\"\",$V$1121-SUM(OFFSET($V$1099:V1109,0,0,COUNTA($V$1099:V1109),1)),ROUND(S1110*(1+BDI.Taxa),2))","v":0},null,{"$f":"IF(P1111=\"\",$X$1121-SUM(OFFSET($X$1099:X1109,0,0,COUNTA($X$1099:X1109),1)),ROUND(V1110*100/ORÇAMENTO.TotalOrçamento,2))","v":{"$error":"#DIV/0!"}}]
[null,null,null,null,null,null,null,null,null,null,null,null,null,null,"12.","",null,null,{"$f":"IF(P1112=\"\",$S$1121-SUM(OFFSET($S$1099:S1110,0,0,COUNTA($S$1099:S1110),1)),SUMIF($R$19:$R$1047,$P1111,$W$19:$W$1047))","v":0},null,null,{"$f":"IF(P1112=\"\",$V$1121-SUM(OFFSET($V$1099:V1110,0,0,COUNTA($V$1099:V1110),1)),ROUND(S1111*(1+BDI.Taxa),2))","v":0},null,{"$f":"IF(P1112=\"\",$X$1121-SUM(OFFSET($X$1099:X1110,0,0,COUNTA($X$1099:X1110),1)),ROUND(V1111*100/ORÇAMENTO.TotalOrçamento,2))","v":{"$error":"#DIV/0!"}}]
[null,null,null,null,null,null,null,null,null,null,null,null,null,null,"13.","",null,null,{"$f":"IF(P1113=\"\",$S$1121-SUM(OFFSET($S$1099:S1111,0,0,COUNTA($S$1099:S1111),1)),SUMIF($R$19:$R$1047,$P1112,$W$19:$W$1047))","v":0},null,null,{"$f":"IF(P1113=\"\",$V$1121-SUM(OFFSET($V$1099:V1111,0,0,COUNTA($V$1099:V1111),1)),ROUND(S1112*(1+BDI.Taxa),2))","v":0},null,{"$f":"IF(P1113=\"\",$X$1121-SUM(OFFSET($X$1099:X1111,0,0,COUNTA($X$1099:X1111),1)),ROUND(V1112*100/ORÇAMENTO.TotalOrçamento,2))","v":{"$error":"#DIV/0!"}}]
[null,null,null,null,null,null,null,null,null,null,null,null,null,null,"14.","",null,null,{"$f":"IF(P1114=\"\",$S$1121-SUM(OFFSET($S$1099:S1112,0,0,COUNTA($S$1099:S1112),1)),SUMIF($R$19:$R$1047,$P1113,$W$19:$W$1047))","v":0},null,null,{"$f":"IF(P1114=\"\",$V$1121-SUM(OFFSET($V$1099:V1112,0,0,COUNTA($V$1099:V1112),1)),ROUND(S1113*(1+BDI.Taxa),2))","v":0},null,{"$f":"IF(P1114=\"\",$X$1121-SUM(OFFSET($X$1099:X1112,0,0,COUNTA($X$1099:X1112),1)),ROUND(V1113*100/ORÇAMENTO.TotalOrçamento,2))","v":{"$error":"#DIV/0!"}}]
[null,null,null,null,null,null,null,null,null,null,null,null,null,null,"15.","",null,null,{"$f":"IF(P1115=\"\",$S$1121-SUM(OFFSET($S$1099:S1113,0,0,COUNTA($S$1099:S1113),1)),SUMIF($R$19:$R$1047,$P1114,$W$19:$W$1047))","v":0},null,null,{"$f":"IF(P1115=\"\",$V$1121-SUM(OFFSET($V$1099:V1113,0,0,COUNTA($V$1099:V1113),1)),ROUND(S1114*(1+BDI.Taxa),2))","v":0},null,{"$f":"IF(P1115=\"\",$X$1121-SUM(OFFSET($X$1099:X1113,0,0,COUNTA($X$1099:X1113),1)),ROUND(V1114*100/ORÇAMENTO.TotalOrçamento,2))","v":{"$error":"#DIV/0!"}}]
[null,null,null,null,null,null,null,null,null,null,null,null,null,null,"16.","",null,null,{"$f":"IF(P1116=\"\",$S$1121-SUM(OFFSET($S$1099:S1114,0,0,COUNTA($S$1099:S1114),1)),SUMIF($R$19:$R$1047,$P1115,$W$19:$W$1047))","v":0},null,null,{"$f":"IF(P1116=\"\",$V$1121-SUM(OFFSET($V$1099:V1114,0,0,COUNTA($V$1099:V1114),1)),ROUND(S1115*(1+BDI.Taxa),2))","v":0},null,{"$f":"IF(P1116=\"\",$X$1121-SUM(OFFSET($X$1099:X1114,0,0,COUNTA($X$1099:X1114),1)),ROUND(V1115*100/ORÇAMENTO.TotalOrçamento,2))","v":{"$error":"#DIV/0!"}}]
[null,null,null,null,null,null,null,null,null,null,null,null,null,null,"17.","",null,null,{"$f":"IF(P1117=\"\",$S$1121-SUM(OFFSET($S$1099:S1115,0,0,COUNTA($S$1099:S1115),1)),SUMIF($R$19:$R$1047,$P1116,$W$19:$W$1047))","v":0},null,null,{"$f":"IF(P1117=\"\",$V$1121-SUM(OFFSET($V$1099:V1115,0,0,COUNTA($V$1099:V1115),1)),ROUND(S1116*(1+BDI.Taxa),2))","v":0},null,{"$f":"IF(P1117=\"\",$X$1121-SUM(OFFSET($X$1099:X1115,0,0,COUNTA($X$1099:X1115),1)),ROUND(V1116*100/ORÇAMENTO.TotalOrçamento,2))","v":{"$error":"#DIV/0!"}}]
[null,null,null,null,null,null,null,null,null,null,null,null,null,null,"18.","",null,null,{"$f":"IF(P1118=\"\",$S$1121-SUM(OFFSET($S$1099:S1116,0,0,COUNTA($S$1099:S1116),1)),SUMIF($R$19:$R$1047,$P1117,$W$19:$W$1047))","v":0},null,null,{"$f":"IF(P1118=\"\",$V$1121-SUM(OFFSET($V$1099:V1116,0,0,COUNTA($V$1099:V1116),1)),ROUND(S1117*(1+BDI.Taxa),2))","v":0},null,{"$f":"IF(P1118=\"\",$X$1121-SUM(OFFSET($X$1099:X1116,0,0,COUNTA($X$1099:X1116),1)),ROUND(V1117*100/ORÇAMENTO.TotalOrçamento,2))","v":{"$error":"#DIV/0!"}}]
[null,null,null,null,null,null,null,null,null,null,null,null,null,null,"19.","",null,null,{"$f":"IF(P1119=\"\",$S$1121-SUM(OFFSET($S$1099:S1117,0,0,COUNTA($S$1099:S1117),1)),SUMIF($R$19:$R$1047,$P1118,$W$19:$W$1047))","v":0},null,null,{"$f":"IF(P1119=\"\",$V$1121-SUM(OFFSET($V$1099:V1117,0,0,COUNTA($V$1099:V1117),1)),ROUND(S1118*(1+BDI.Taxa),2))","v":0},null,{"$f":"IF(P1119=\"\",$X$1121-SUM(OFFSET($X$1099:X1117,0,0,COUNTA($X$1099:X1117),1)),ROUND(V1118*100/ORÇAMENTO.TotalOrçamento,2))","v":{"$error":"#DIV/0!"}}]
[null,null,null,null,null,null,null,null,null,null,null,null,null,null,"20.","",null,null,{"$f":"IF(P1120=\"\",$S$1121-SUM(OFFSET($S$1099:S1118,0,0,COUNTA($S$1099:S1118),1)),SUMIF($R$19:$R$1047,$P1119,$W$19:$W$1047))","v":0},null,null,{"$f":"IF(P1120=\"\",$V$1121-SUM(OFFSET($V$1099:V1118,0,0,COUNTA($V$1099:V1118),1)),ROUND(S1119*(1+BDI.Taxa),2))","v":0},null,{"$f":"IF(P1120=\"\",$X$1121-SUM(OFFSET($X$1099:X1118,0,0,COUNTA($X$1099:X1118),1)),ROUND(V1119*100/ORÇAMENTO.TotalOrçamento,2))","v":{"$error":"#DIV/0!"}}]
[null,null,null,null,null,null,null,null,null,null,null,null,null,null,"TOTAL GERAL DO ORÇAMENTO (R$)",null,null,null,{"$f":"SUM(S1100:U1119)","v":0},null,null,{"$f":"SUM(V1100:W1119)","v":0},null,{"$f":"SUM(X1100:X1119)","v":{"$error":"#DIV/0!"}}]
[null,null,null,null,null,null,null,null,null,null,null,null,null,null,null,null,null,null,{"$f":"$W$1048","v":0},null,null,{"$f":"$W$1050","v":0},null,100]
[null,null,null,null,null,null,null,null,null,null,null,null,null,null,null,null,null,null,"(TOTAL SEM BDI)",null,null,"(TOTAL COM BDI)",null,"(ARRED porcentagem)"]
[null,null,null,null,null,null,null,null,null,null,null,null,null,null,null,null,null,null,{"$f":"IF(AND(S1120=S1121,S1120>0),\"OK\",\"ERRO\")","v":"ERRO"},null,null,{"$f":"IF(AND(V1120=V1121,V1120>0),\"OK\",\"ERRO\")","v":"ERRO"},null,{"$f":"IF(AND(X1120=100,S1100<>0),\"OK\",\"ERRO\")","v":{"$error":"#DIV/0!"}}]

{"sheet":"Resumo ","index":1,"n_rows":39,"n_cols":9,"rows_kept":39,"cut":false,"hidden":false,"merged":[[42,3,42,7],[11,1,11,2],[12,1,12,2],[15,2,15,3],[16,2,16,3],[14,1,14,8],[17,2,17,3],[23,2,23,3],[18,2,18,3],[19,2,19,3],[20,2,20,3],[41,3,41,7],[24,2,24,3],[26,2,26,3],[27,2,27,3],[38,1,38,8],[1,1,1,8],[2,6,2,8],[3,6,3,8],[4,1,4,8],[5,6,5,8],[6,6,6,8],[7,1,7,8],[8,6,8,8],[9,6,9,8],[13,1,13,8],[0,1,0,8],[36,1,36,5],[2,1,2,5],[3,1,3,5],[5,1,5,5],[6,1,6,5],[8,1,8,5],[9,1,9,5],[11,3,11,5],[12,3,12,5],[10,1,10,8],[11,6,11,8],[12,6,12,8],[25,2,25,3],[21,2,21,3],[22,2,22,3],[13,0,14,0],[34,2,34,3],[35,2,35,3],[31,2,31,3],[32,2,32,3],[33,2,33,3],[28,2,28,3],[29,2,29,3],[30,2,30,3]]}
[]
[]
[null,"UNIDADE ESCOLAR",null,null,null,null,"CÓDIGO INEP"]
[null,{"$f":"Orçamento!$O$4","v":"COLÉGIO ESTADUAL RUY BRASIL CAVALCANTE"},null,null,null,null,{"$f":"Orçamento!V4","v":52060993}]
[]
[null,"OBRA",null,null,null,null,"CIDADE"]
[null,{"$f":"Orçamento!$O$7","v":"AMPLIAÇÃO E REFORMA"},null,null,null,null,{"$f":"Orçamento!$V$7","v":"PIRACANJUBA"}]
[]
[null,"ENDEREÇO",null,null,null,null,"CRE"]
[null,{"$f":"Orçamento!$R$10","v":"PRACA DIMAS COSTA 413, CENTRO, CEP:75640-000"},null,null,null,null,{"$f":"Orçamento!$O$10","v":"PIRACANJUBA"}]
[]
[null,"REFERÊNCIA",null,"DATA",null,null,"ÁREA TOTAL CONSTRUÍDA (M²)"]
[null,{"$f":"CONCATENATE(\"AGETOP E SINAPI - \",Orçamento!$W$10)","v":"AGETOP E SINAPI - ONERADA"},null,{"$f":"Orçamento!$S$7","v":"2020-04-13"},null,null,{"$f":"Orçamento!$S$13","v":2185.87}]
["FILTRO"]
[null,"RESUMO GERAL DO ORÇAMENTO"]
["↓","ITEM","DESCRIÇÃO DOS SERVIÇOS",null,"UNID","QUANT","PREÇO SEM BDI","PREÇO COM BDI","PARTICIP. (%)"]
[{"$f":"IF(E17>0,\"F\",\"\")","v":"F"},"1.",{"$f":"Orçamento!$P1100","v":"REFORMA"},null,"UN ",1,{"$f":"IFERROR(Orçamento!S1100,\"-\")","v":0},{"$f":"IFERROR(Orçamento!V1100,\"\")","v":0},{"$f":"Orçamento!X1100","v":{"$error":"#DIV/0!"}}]
[{"$f":"IF(E18>0,\"F\",\"\")","v":"F"},"2.",{"$f":"Orçamento!$P1101","v":"BLOCO 02 SALAS PADRÃO SEDUC 2017 - LAJE"},null,"UN ",1,{"$f":"IFERROR(Orçamento!S1101,\"-\")","v":0},{"$f":"IFERROR(Orçamento!V1101,\"\")","v":0},{"$f":"Orçamento!X1101","v":{"$error":"#DIV/0!"}}]
["F","3.",{"$f":"Orçamento!$P1102","v":"PÁTIO MULTIUSO - PADRÃO SEDUC - OPÇÃO 03"},null,"UN ",1,{"$f":"IFERROR(Orçamento!S1102,\"-\")","v":0},{"$f":"IFERROR(Orçamento!V1102,\"\")","v":0},{"$f":"Orçamento!X1102","v":{"$error":"#DIV/0!"}}]
["F","4.",{"$f":"Orçamento!$P1103","v":"COZINHA / PÁTIO / SANITÁRIO SEDUC 2009"},null,"UN ",1,{"$f":"IFERROR(Orçamento!S1103,\"-\")","v":0},{"$f":"IFERROR(Orçamento!V1103,\"\")","v":0},{"$f":"Orçamento!X1103","v":{"$error":"#DIV/0!"}}]
["","5.",{"$f":"Orçamento!$P1104","v":""},null,null,null,{"$f":"IFERROR(Orçamento!S1104,\"-\")","v":0},{"$f":"IFERROR(Orçamento!V1104,\"\")","v":0},{"$f":"Orçamento!X1104","v":{"$error":"#DIV/0!"}}]
["","6.",{"$f":"Orçamento!$P1105","v":""},null,null,null,{"$f":"IFERROR(Orçamento!S1105,\"-\")","v":0},{"$f":"IFERROR(Orçamento!V1105,\"\")","v":0},{"$f":"Orçamento!X1105","v":{"$error":"#DIV/0!"}}]
["","7.",{"$f":"Orçamento!$P1106","v":""},null,null,null,{"$f":"IFERROR(Orçamento!S1106,\"-\")","v":0},{"$f":"IFERROR(Orçamento!V1106,\"\")","v":0},{"$f":"Orçamento!X1106","v":{"$error":"#DIV/0!"}}]
["","8.",{"$f":"Orçamento!$P1107","v":""},null,null,null,{"$f":"IFERROR(Orçamento!S1107,\"-\")","v":0},{"$f":"IFERROR(Orçamento!V1107,\"\")","v":0},{"$f":"Orçamento!X1107","v":{"$error":"#DIV/0!"}}]
["","9.",{"$f":"Orçamento!$P1108","v":""},null,null,null,{"$f":"IFERROR(Orçamento!S1108,\"-\")","v":0},{"$f":"IFERROR(Orçamento!V1108,\"\")","v":0},{"$f":"Orçamento!X1108","v":{"$error":"#DIV/0!"}}]
["","10.",{"$f":"Orçamento!$P1109","v":""},null,null,null,{"$f":"IFERROR(Orçamento!S1109,\"-\")","v":0},{"$f":"IFERROR(Orçamento!V1109,\"\")","v":0},{"$f":"Orçamento!X1109","v":{"$error":"#DIV/0!"}}]
["","11.",{"$f":"Orçamento!$P1110","v":""},null,null,null,{"$f":"IFERROR(Orçamento!S1110,\"-\")","v":0},{"$f":"IFERROR(Orçamento!V1110,\"\")","v":0},{"$f":"Orçamento!X1110","v":{"$error":"#DIV/0!"}}]
["","12.",{"$f":"Orçamento!$P1111","v":""},null,null,null,{"$f":"IFERROR(Orçamento!S1111,\"-\")","v":0},{"$f":"IFERROR(Orçamento!V1111,\"\")","v":0},{"$f":"Orçamento!X1111","v":{"$error":"#DIV/0!"}}]
["","13.",{"$f":"Orçamento!$P1112","v":""},null,null,null,{"$f":"IFERROR(Orçamento!S1112,\"-\")","v":0},{"$f":"IFERROR(Orçamento!V1112,\"\")","v":0},{"$f":"Orçamento!X1112","v":{"$error":"#DIV/0!"}}]
["","14.",{"$f":"Orçamento!$P1113","v":""},null,null,null,{"$f":"IFERROR(Orçamento!S1113,\"-\")","v":0},{"$f":"IFERROR(Orçamento!V1113,\"\")","v":0},{"$f":"Orçamento!X1113","v":{"$error":"#DIV/0!"}}]
["","15.",{"$f":"Orçamento!$P1114","v":""},null,null,null,{"$f":"IFERROR(Orçamento!S1114,\"-\")","v":0},{"$f":"IFERROR(Orçamento!V1114,\"\")","v":0},{"$f":"Orçamento!X1114","v":{"$error":"#DIV/0!"}}]
["","16.",{"$f":"Orçamento!$P1115","v":""},null,null,null,{"$f":"IFERROR(Orçamento!S1115,\"-\")","v":0},{"$f":"IFERROR(Orçamento!V1115,\"\")","v":0},{"$f":"Orçamento!X1115","v":{"$error":"#DIV/0!"}}]
["","17.",{"$f":"Orçamento!$P1116","v":""},null,null,null,{"$f":"IFERROR(Orçamento!S1116,\"-\")","v":0},{"$f":"IFERROR(Orçamento!V1116,\"\")","v":0},{"$f":"Orçamento!X1116","v":{"$error":"#DIV/0!"}}]
["","18.",{"$f":"Orçamento!$P1117","v":""},null,null,null,{"$f":"IFERROR(Orçamento!S1117,\"-\")","v":0},{"$f":"IFERROR(Orçamento!V1117,\"\")","v":0},{"$f":"Orçamento!X1117","v":{"$error":"#DIV/0!"}}]
["","19.",{"$f":"Orçamento!$P1118","v":""},null,null,null,{"$f":"IFERROR(Orçamento!S1118,\"-\")","v":0},{"$f":"IFERROR(Orçamento!V1118,\"\")","v":0},{"$f":"Orçamento!X1118","v":{"$error":"#DIV/0!"}}]
["","20.",{"$f":"Orçamento!$P1119","v":""},null,null,null,{"$f":"IFERROR(Orçamento!S1119,\"-\")","v":0},{"$f":"IFERROR(Orçamento!V1119,\"\")","v":0},{"$f":"Orçamento!X1119","v":{"$error":"#DIV/0!"}}]
["F","TOTAL GERAL DO ORÇAMENTO (R$)",null,null,null,null,{"$f":"SUM(G17:G36)","v":0},0,{"$f":"SUM(I17:I36)","v":{"$error":"#DIV/0!"}}]
["F"]
["F"]

{"sheet":"Somatório","index":2,"n_rows":45,"n_cols":6,"rows_kept":45,"cut":false,"hidden":false,"merged":[[0,1,0,5],[14,1,14,5],[2,1,2,3],[2,4,2,5],[3,1,3,3],[3,4,3,5],[5,1,5,3],[5,4,5,5],[6,1,6,3],[6,4,6,5],[8,1,8,3],[8,4,8,5],[1,1,1,5],[4,1,4,5],[7,1,7,5],[10,1,10,5],[9,1,9,3],[9,4,9,5],[11,1,11,2],[11,4,11,5],[12,1,12,2],[12,4,12,5],[13,0,14,0],[42,1,42,2],[44,1,44,5],[47,3,47,5],[48,3,48,5],[13,1,13,5]]}
[]
[]
[null,"UNIDADE ESCOLAR",null,null,"CÓDIGO INEP"]
[null,{"$f":"Orçamento!$O$4","v":"COLÉGIO ESTADUAL RUY BRASIL CAVALCANTE"},null,null,{"$f":"Orçamento!V4","v":52060993}]
[]
[null,"OBRA",null,null,"CIDADE"]
[null,{"$f":"Orçamento!$O$7","v":"AMPLIAÇÃO E REFORMA"},null,null,{"$f":"Orçamento!$V$7","v":"PIRACANJUBA"}]
[]
[null,"ENDEREÇO",null,null,"CRE"]
[null,{"$f":"Orçamento!$R$10","v":"PRACA DIMAS COSTA 413, CENTRO, CEP:75640-000"},null,null,{"$f":"Orçamento!$O$10","v":"PIRACANJUBA"}]
[]
[null,"REFERÊNCIA",null,"DATA","ÁREA TOTAL CONSTRUÍDA (M²)"]
[null,{"$f":"CONCATENATE(\"AGETOP E SINAPI - \",Orçamento!$W$10)","v":"AGETOP E SINAPI - ONERADA"},null,{"$f":"Orçamento!$S$7","v":"2020-04-13"},{"$f":"Orçamento!$S$13","v":2185.87}]
["FILTRO"]
[null,"SOMATÓRIO DE SERVIÇOS"]
["↓","ITEM","DESCRIÇÃO DOS SERVIÇOS","PREÇO SEM BDI (R$)","PREÇO COM BDI (R$)","PARTIC.  ( % )"]
[{"$f":"IF(D17>0,\"F\",\"\")","v":""},"a.",{"$f":"Orçamento!P1066","v":"SERVIÇOS PRELIMINARES"},{"$f":"Orçamento!S1066","v":0},{"$f":"Orçamento!V1066","v":0},{"$f":"Orçamento!X1066","v":0}]
[{"$f":"IF(D18>0,\"F\",\"\")","v":""},"b.",{"$f":"Orçamento!P1067","v":"TRANSPORTES"},{"$f":"Orçamento!S1067","v":0},{"$f":"Orçamento!V1067","v":0},{"$f":"Orçamento!X1067","v":0}]
["","c.",{"$f":"Orçamento!P1068","v":"SERVIÇO EM TERRA"},{"$f":"Orçamento!S1068","v":0},{"$f":"Orçamento!V1068","v":0},{"$f":"Orçamento!X1068","v":0}]
["","d.",{"$f":"Orçamento!P1069","v":"FUNDAÇÕES E SONDAGENS"},{"$f":"Orçamento!S1069","v":0},{"$f":"Orçamento!V1069","v":0},{"$f":"Orçamento!X1069","v":0}]
["","e.",{"$f":"Orçamento!P1070","v":"ESTRUTURA"},{"$f":"Orçamento!S1070","v":0},{"$f":"Orçamento!V1070","v":0},{"$f":"Orçamento!X1070","v":0}]
["","f.",{"$f":"Orçamento!P1071","v":"INSTALAÇÕES ELÉTRICAS"},{"$f":"Orçamento!S1071","v":0},{"$f":"Orçamento!V1071","v":0},{"$f":"Orçamento!X1071","v":0}]
["","g.",{"$f":"Orçamento!P1072","v":"INSTALAÇÕES HIDROSSANITÁRIAS"},{"$f":"Orçamento!S1072","v":0},{"$f":"Orçamento!V1072","v":0},{"$f":"Orçamento!X1072","v":0}]
["","h.",{"$f":"Orçamento!P1073","v":"INSTALAÇÕES ESPECIAIS"},{"$f":"Orçamento!S1073","v":0},{"$f":"Orçamento!V1073","v":0},{"$f":"Orçamento!X1073","v":0}]
["","i.",{"$f":"Orçamento!P1074","v":"ALVENARIAS E DIVISÓRIAS"},{"$f":"Orçamento!S1074","v":0},{"$f":"Orçamento!V1074","v":0},{"$f":"Orçamento!X1074","v":0}]
["","j.",{"$f":"Orçamento!P1075","v":"ALVENARIA AUTO-PORTANTE"},{"$f":"Orçamento!S1075","v":0},{"$f":"Orçamento!V1075","v":0},{"$f":"Orçamento!X1075","v":0}]
["","k.",{"$f":"Orçamento!P1076","v":"IMPERMEABILIZAÇÃO"},{"$f":"Orçamento!S1076","v":0},{"$f":"Orçamento!V1076","v":0},{"$f":"Orçamento!X1076","v":0}]
["","l.",{"$f":"Orçamento!P1077","v":"ISOLAMENTO TÉRMICO E ACÚSTICO"},{"$f":"Orçamento!S1077","v":0},{"$f":"Orçamento!V1077","v":0},{"$f":"Orçamento!X1077","v":0}]
["","m.",{"$f":"Orçamento!P1078","v":"ESTRUTURA DE MADEIRA"},{"$f":"Orçamento!S1078","v":0},{"$f":"Orçamento!V1078","v":0},{"$f":"Orçamento!X1078","v":0}]
["","n.",{"$f":"Orçamento!P1079","v":"ESTRUTURAS METÁLICAS"},{"$f":"Orçamento!S1079","v":0},{"$f":"Orçamento!V1079","v":0},{"$f":"Orçamento!X1079","v":0}]
["","o.",{"$f":"Orçamento!P1080","v":"COBERTURAS"},{"$f":"Orçamento!S1080","v":0},{"$f":"Orçamento!V1080","v":0},{"$f":"Orçamento!X1080","v":0}]
["","p.",{"$f":"Orçamento!P1081","v":"ESQUADRIAS DE MADEIRA"},{"$f":"Orçamento!S1081","v":0},{"$f":"Orçamento!V1081","v":0},{"$f":"Orçamento!X1081","v":0}]
["","q.",{"$f":"Orçamento!P1082","v":"ESQUADRIAS METÁLICAS"},{"$f":"Orçamento!S1082","v":0},{"$f":"Orçamento!V1082","v":0},{"$f":"Orçamento!X1082","v":0}]
["","r.",{"$f":"Orçamento!P1083","v":"VIDROS"},{"$f":"Orçamento!S1083","v":0},{"$f":"Orçamento!V1083","v":0},{"$f":"Orçamento!X1083","v":0}]
["","s.",{"$f":"Orçamento!P1084","v":"REVESTIMENTO DE PAREDE"},{"$f":"Orçamento!S1084","v":0},{"$f":"Orçamento!V1084","v":0},{"$f":"Orçamento!X1084","v":0}]
["","t.",{"$f":"Orçamento!P1085","v":"FORROS"},{"$f":"Orçamento!S1085","v":0},{"$f":"Orçamento!V1085","v":0},{"$f":"Orçamento!X1085","v":0}]
["","u.",{"$f":"Orçamento!P1086","v":"REVESTIMENTO DE PISO"},{"$f":"Orçamento!S1086","v":0},{"$f":"Orçamento!V1086","v":0},{"$f":"Orçamento!X1086","v":0}]
["","v.",{"$f":"Orçamento!P1087","v":"FERRAGENS"},{"$f":"Orçamento!S1087","v":0},{"$f":"Orçamento!V1087","v":0},{"$f":"Orçamento!X1087","v":0}]
["","w.",{"$f":"Orçamento!P1088","v":"MARCENARIA"},{"$f":"Orçamento!S1088","v":0},{"$f":"Orçamento!V1088","v":0},{"$f":"Orçamento!X1088","v":0}]
["","x.",{"$f":"Orçamento!P1089","v":"ADMINISTRAÇÃO"},{"$f":"Orçamento!S1089","v":0},{"$f":"Orçamento!V1089","v":0},{"$f":"Orçamento!X1089","v":0}]
["","y.",{"$f":"Orçamento!P1090","v":"PINTURA"},{"$f":"Orçamento!S1090","v":0},{"$f":"Orçamento!V1090","v":0},{"$f":"Orçamento!X1090","v":0}]
["","z.",{"$f":"Orçamento!P1091","v":"DIVERSOS"},{"$f":"Orçamento!S1091","v":0},{"$f":"Orçamento!V1091","v":0},{"$f":"Orçamento!X1091","v":0}]
["F","TOTAL GERAL DO ORÇAMENTO",null,{"$f":"SUM(D17:D42)","v":0},{"$f":"SUM(E17:E42)","v":0},{"$f":"SUM(F17:F42)","v":0}]
[]
[null,"(*) Para itens da AGETOP, os vidros não estão inclusos nas esquadrias e já foram considerados os custos de contramarco para as esquadrias de alumínio;"]

{"sheet":"Cronog_150_Dias","index":3,"n_rows":99,"n_cols":26,"rows_kept":99,"cut":false,"hidden":false,"merged":[[95,17,95,20],[95,21,95,24],[97,1,97,4],[98,1,98,25],[94,17,94,20],[94,21,94,24],[95,1,95,2],[95,5,95,8],[95,9,95,12],[95,13,95,16],[94,1,94,2],[94,5,94,8],[94,9,94,12],[94,13,94,16],[92,21,92,24],[93,1,93,2],[93,5,93,8],[93,9,93,12],[93,13,93,16],[93,17,93,20],[93,21,93,24],[91,17,91,20],[91,21,91,24],[92,1,92,2],[92,5,92,8],[92,9,92,12],[92,13,92,16],[92,17,92,20],[89,13,89,16],[89,17,89,20],[89,21,89,24],[91,5,91,8],[91,9,91,12],[91,13,91,16],[88,17,88,20],[88,21,88,24],[89,1,91,2],[89,3,91,3],[89,4,91,4],[89,5,89,8],[89,9,89,12],[86,13,86,16],[86,17,86,20],[86,21,86,24],[88,5,88,8],[88,9,88,12],[88,13,88,16],[86,1,88,2],[86,3,88,3],[86,4,88,4],[86,5,86,8],[86,9,86,12],[83,17,83,20],[83,21,83,24],[85,5,85,8],[85,9,85,12],[85,13,85,16],[85,17,85,20],[85,21,85,24],[82,21,82,24],[83,1,85,2],[83,3,85,3],[83,4,85,4],[83,5,83,8],[83,9,83,12],[83,13,83,16],[80,17,80,20],[80,21,80,24],[82,5,82,8],[82,9,82,12],[82,13,82,16],[82,17,82,20],[79,17,79,20],[79,21,79,24],[80,1,82,2],[80,3,82,3],[80,4,82,4],[80,5,80,8],[80,9,80,12],[80,13,80,16],[77,13,77,16],[77,17,77,20],[77,21,77,24],[79,5,79,8],[79,9,79,12],[79,13,79,16],[76,17,76,20],[76,21,76,24],[77,1,79,2],[77,3,79,3],[77,4,79,4],[77,5,77,8],[77,9,77,12],[74,13,74,16],[74,17,74,20],[74,21,74,24],[76,5,76,8],[76,9,76,12],[76,13,76,16],[74,1,76,2],[74,3,76,3],[74,4,76,4],[74,5,74,8],[74,9,74,12],[71,17,71,20],[71,21,71,24],[73,5,73,8],[73,9,73,12],[73,13,73,16],[73,17,73,20],[73,21,73,24],[70,21,70,24],[71,1,73,2],[71,3,73,3],[71,4,73,4],[71,5,71,8],[71,9,71,12],[71,13,71,16],[68,17,68,20],[68,21,68,24],[70,5,70,8],[70,9,70,12],[70,13,70,16],[70,17,70,20],[67,17,67,20],[67,21,67,24],[68,1,70,2],[68,3,70,3],[68,4,70,4],[68,5,68,8],[68,9,68,12],[68,13,68,16],[65,13,65,16],[65,17,65,20],[65,21,65,24],[67,5,67,8],[67,9,67,12],[67,13,67,16],[64,17,64,20],[64,21,64,24],[65,1,67,2],[65,3,67,3],[65,4,67,4],[65,5,65,8],[65,9,65,12],[62,13,62,16],[62,17,62,20],[62,21,62,24],[64,5,64,8],[64,9,64,12],[64,13,64,16],[62,1,64,2],[62,3,64,3],[62,4,64,4],[62,5,62,8],[62,9,62,12],[59,17,59,20],[59,21,59,24],[61,5,61,8],[61,9,61,12],[61,13,61,16],[61,17,61,20],[61,21,61,24],[58,21,58,24],[59,1,61,2],[59,3,61,3],[59,4,61,4],[59,5,59,8],[59,9,59,12],[59,13,59,16],[56,17,56,20],[56,21,56,24],[58,5,58,8],[58,9,58,12],[58,13,58,16],[58,17,58,20],[55,17,55,20],[55,21,55,24],[56,1,58,2],[56,3,58,3],[56,4,58,4],[56,5,56,8],[56,9,56,12],[56,13,56,16],[53,13,53,16],[53,17,53,20],[53,21,53,24],[55,5,55,8],[55,9,55,12],[55,13,55,16],[52,17,52,20],[52,21,52,24],[53,1,55,2],[53,3,55,3],[53,4,55,4],[53,5,53,8],[53,9,53,12],[50,13,50,16],[50,17,50,20],[50,21,50,24],[52,5,52,8],[52,9,52,12],[52,13,52,16],[50,1,52,2],[50,3,52,3],[50,4,52,4],[50,5,50,8],[50,9,50,12],[47,17,47,20],[47,21,47,24],[49,5,49,8],[49,9,49,12],[49,13,49,16],[49,17,49,20],[49,21,49,24],[46,21,46,24],[47,1,49,2],[47,3,49,3],[47,4,49,4],[47,5,47,8],[47,9,47,12],[47,13,47,16],[44,17,44,20],[44,21,44,24],[46,5,46,8],[46,9,46,12],[46,13,46,16],[46,17,46,20],[43,17,43,20],[43,21,43,24],[44,1,46,2],[44,3,46,3],[44,4,46,4],[44,5,44,8],[44,9,44,12],[44,13,44,16],[41,13,41,16],[41,17,41,20],[41,21,41,24],[43,5,43,8],[43,9,43,12],[43,13,43,16],[40,17,40,20],[40,21,40,24],[41,1,43,2],[41,3,43,3],[41,4,43,4],[41,5,41,8],[41,9,41,12],[38,13,38,16],[38,17,38,20],[38,21,38,24],[40,5,40,8],[40,9,40,12],[40,13,40,16],[38,1,40,2],[38,3,40,3],[38,4,40,4],[38,5,38,8],[38,9,38,12],[35,17,35,20],[35,21,35,24],[37,5,37,8],[37,9,37,12],[37,13,37,16],[37,17,37,20],[37,21,37,24],[34,21,34,24],[35,1,37,2],[35,3,37,3],[35,4,37,4],[35,5,35,8],[35,9,35,12],[35,13,35,16],[32,17,32,20],[32,21,32,24],[34,5,34,8],[34,9,34,12],[34,13,34,16],[34,17,34,20],[31,17,31,20],[31,21,31,24],[32,1,34,2],[32,3,34,3],[32,4,34,4],[32,5,32,8],[32,9,32,12],[32,13,32,16],[29,13,29,16],[29,17,29,20],[29,21,29,24],[31,5,31,8],[31,9,31,12],[31,13,31,16],[28,17,28,20],[28,21,28,24],[29,1,31,2],[29,3,31,3],[29,4,31,4],[29,5,29,8],[29,9,29,12],[26,13,26,16],[26,17,26,20],[26,21,26,24],[28,5,28,8],[28,9,28,12],[28,13,28,16],[26,1,28,2],[26,3,28,3],[26,4,28,4],[26,5,26,8],[26,9,26,12],[23,17,23,20],[23,21,23,24],[25,5,25,8],[25,9,25,12],[25,13,25,16],[25,17,25,20],[25,21,25,24],[22,21,22,24],[23,1,25,2],[23,3,25,3],[23,4,25,4],[23,5,23,8],[23,9,23,12],[23,13,23,16],[22,5,22,8],[22,9,22,12],[22,13,22,16],[22,17,22,20],[20,1,22,2],[20,3,22,3],[20,4,22,4],[20,5,20,8],[20,9,20,12],[20,13,20,16],[19,13,19,16],[17,1,19,2],[17,3,19,3],[17,4,19,4],[20,17,20,20],[20,21,20,24],[17,13,17,16],[17,17,17,20],[17,21,17,24],[17,5,17,8],[17,9,17,12],[19,17,19,20],[19,21,19,24],[0,1,0,25],[1,1,1,25],[2,1,2,7],[2,8,2,25],[3,1,3,7],[3,8,3,25],[8,1,8,7],[8,8,8,25],[13,1,13,2],[13,5,13,8],[13,9,13,12],[14,1,16,2],[14,3,16,3],[14,4,16,4],[4,1,4,25],[5,1,5,7],[5,8,5,25],[6,1,6,7],[19,5,19,8],[19,9,19,12],[6,8,6,25],[7,1,7,25],[12,13,12,16],[12,17,12,20],[12,21,12,24],[12,25,13,25],[14,13,14,16],[14,17,14,20],[14,21,14,24],[13,17,13,20],[13,21,13,24],[9,0,11,0],[9,1,9,7],[9,8,9,25],[10,1,10,25],[11,1,11,25],[16,5,16,8],[16,9,16,12],[16,13,16,16],[14,5,14,8],[14,9,14,12],[12,0,13,0],[12,3,13,3],[12,5,12,8],[12,9,12,12],[13,13,13,16],[16,17,16,20],[16,21,16,24]]}
[]
[]
[null,"UNIDADE ESCOLAR",null,null,null,null,null,null,"PRAZO"]
[null,{"$f":"Orçamento!O4","v":"COLÉGIO ESTADUAL RUY BRASIL CAVALCANTE"},null,null,null,null,null,null,"150 DIAS CORRIDOS"]
[]
[null,"OBRA",null,null,null,null,null,null,"DATA"]
[null,{"$f":"Orçamento!O7","v":"AMPLIAÇÃO E REFORMA"},null,null,null,null,null,null,{"$f":"Orçamento!S7","v":"2020-04-13"}]
[]
[null,"LOCAL",null,null,null,null,null,null,"ÁREA TOTAL CONSTRUÍDA (M²)"]
["FILTRO",{"$f":"Orçamento!V7","v":"PIRACANJUBA"},null,null,null,null,null,null,{"$f":"Orçamento!S13","v":2185.87}]
[]
[null,"CRONOGRAMA - FÍSICO FINANCEIRO"]
["↓","CUSTO TOTAL:",{"$f":"D93","v":0},"VALOR","Dias:",30,null,null,null,60,null,null,null,90,null,null,null,120,null,null,null,150,null,null,null,"TOTAL"]
[null,"DESCRIÇÃO DOS SERVIÇOS",null,null,"%","1ª PARCELA",null,null,null,"2ª PARCELA",null,null,null,"3ª PARCELA",null,null,null,"4ª PARCELA",null,null,null,"5ª PARCELA"]
[{"$f":"IF(D15>0,\"F\",\"\")","v":""},"SERVIÇOS PRELIMINARES",null,{"$f":"Orçamento!V1066","v":0},{"$f":"Orçamento!X1066","v":0},{"$f":"ROUND(F17*$D$15,2)","v":0},null,null,null,{"$f":"ROUND(J17*$D$15,2)","v":0},null,null,null,{"$f":"ROUND(N17*$D$15,2)","v":0},null,null,null,{"$f":"ROUND(R17*$D$15,2)","v":0},null,null,null,{"$f":"ROUND(V17*$D$15,2)","v":0},null,null,null,{"$f":"SUM(F15:Y15)","v":0}]
[{"$f":"IF(A15=\"F\",A15,\"\")","v":""}]
[{"$f":"IF(A16=\"F\",A16,\"\")","v":""},null,null,null,null,1,null,null,null,0,null,null,null,0,null,null,null,0,null,null,null,{"$f":"100%-(SUM(F17:U17))","v":0},null,null,null,{"$f":"IFERROR(E15/100,\"\")","v":0}]
[{"$f":"IF(D18>0,\"F\",\"\")","v":""},"TRANSPORTES",null,{"$f":"Orçamento!V1067","v":0},{"$f":"Orçamento!X1067","v":0},{"$f":"ROUND(F20*$D$18,2)+0.01","v":0.01},null,null,null,{"$f":"ROUND(J20*$D$18,2)","v":0},null,null,null,{"$f":"ROUND(N20*$D$18,2)","v":0},null,null,null,{"$f":"ROUND(R20*$D$18,2)","v":0},null,null,null,{"$f":"ROUND(V20*$D$18,2)","v":0},null,null,null,{"$f":"SUM(F18:Y18)","v":0.01}]
[{"$f":"IF(A18=\"F\",A18,\"\")","v":""}]
[{"$f":"IF(A19=\"F\",A19,\"\")","v":""},null,null,null,null,0.21,null,null,null,0.2,null,null,null,0.2,null,null,null,0.2,null,null,null,{"$f":"100%-(SUM(F20:U20))","v":0.18999999999999995},null,null,null,{"$f":"IFERROR(E18/100,\"\")","v":0}]
[{"$f":"IF(D21>0,\"F\",\"\")","v":""},"SERVIÇO EM TERRA",null,{"$f":"Orçamento!V1068","v":0},{"$f":"Orçamento!X1068","v":0},{"$f":"ROUND(F23*$D$21,2)","v":0},null,null,null,{"$f":"ROUND(J23*$D$21,2)","v":0},null,null,null,{"$f":"ROUND(N23*$D$21,2)","v":0},null,null,null,{"$f":"ROUND(R23*$D$21,2)","v":0},null,null,null,{"$f":"ROUND(V23*$D$21,2)","v":0},null,null,null,{"$f":"SUM(F21:Y21)","v":0}]
[{"$f":"IF(A21=\"F\",A21,\"\")","v":""}]
[{"$f":"IF(A22=\"F\",A22,\"\")","v":""},null,null,null,null,0.79,null,null,null,0.21,null,null,null,0,null,null,null,0,null,null,null,{"$f":"100%-(SUM(F23:U23))","v":0},null,null,null,{"$f":"IFERROR(E21/100,\"\")","v":0}]
[{"$f":"IF(D24>0,\"F\",\"\")","v":""},"FUNDAÇÕES E SONDAGENS",null,{"$f":"Orçamento!V1069","v":0},{"$f":"Orçamento!X1069","v":0},{"$f":"ROUND(F26*$D$24,2)","v":0},null,null,null,{"$f":"ROUND(J26*$D$24,2)","v":0},null,null,null,{"$f":"ROUND(N26*$D$24,2)","v":0},null,null,null,{"$f":"ROUND(R26*$D$24,2)","v":0},null,null,null,{"$f":"ROUND(V26*$D$24,2)","v":0},null,null,null,{"$f":"SUM(F24:Y24)","v":0}]
[{"$f":"IF(A24=\"F\",A24,\"\")","v":""}]
[{"$f":"IF(A25=\"F\",A25,\"\")","v":""},null,null,null,null,0.44,null,null,null,0.56000000000000005,null,null,null,null,null,null,null,null,null,null,null,{"$f":"100%-(SUM(F26:U26))","v":0},null,null,null,{"$f":"IFERROR(E24/100,\"\")","v":0}]
[{"$f":"IF(D27>0,\"F\",\"\")","v":""},"ESTRUTURA",null,{"$f":"Orçamento!V1070","v":0},{"$f":"Orçamento!X1070","v":0},{"$f":"ROUND(F29*$D$27,2)","v":0},null,null,null,{"$f":"ROUND(J29*$D$27,2)","v":0},null,null,null,{"$f":"ROUND(N29*$D$27,2)","v":0},null,null,null,{"$f":"ROUND(R29*$D$27,2)","v":0},null,null,null,{"$f":"ROUND(V29*$D$27,2)","v":0},null,null,null,{"$f":"SUM(F27:Y27)","v":0}]
[{"$f":"IF(A27=\"F\",A27,\"\")","v":""}]
[{"$f":"IF(A28=\"F\",A28,\"\")","v":""},null,null,null,null,null,null,null,null,1,null,null,null,null,null,null,null,0,null,null,null,{"$f":"100%-(SUM(F29:U29))","v":0},null,null,null,{"$f":"IFERROR(E27/100,\"\")","v":0}]
[{"$f":"IF(D30>0,\"F\",\"\")","v":""},"INST.ELET/TELEFÔNICA/CABEAMENTO ESTRUTURADO",null,{"$f":"Orçamento!V1071","v":0},{"$f":"Orçamento!X1071","v":0},{"$f":"ROUND(F32*$D$30,2)","v":0},null,null,null,{"$f":"ROUND(J32*$D$30,2)","v":0},null,null,null,{"$f":"ROUND(N32*$D$30,2)","v":0},null,null,null,{"$f":"ROUND(R32*$D$30,2)","v":0},null,null,null,{"$f":"ROUND(V32*$D$30,2)","v":0},null,null,null,{"$f":"SUM(F30:Y30)","v":0}]
[{"$f":"IF(A30=\"F\",A30,\"\")","v":""}]
[{"$f":"IF(A31=\"F\",A31,\"\")","v":""},null,null,null,null,null,null,null,null,0.38,null,null,null,0.62,null,null,null,0,null,null,null,{"$f":"100%-(SUM(F32:U32))","v":0},null,null,null,{"$f":"IFERROR(E30/100,\"\")","v":0}]
[{"$f":"IF(D33>0,\"F\",\"\")","v":""},"INSTALAÇÕES HIDROSSANITÁRIAS",null,{"$f":"Orçamento!V1072","v":0},{"$f":"Orçamento!X1072","v":0},{"$f":"ROUND(F35*$D$33,2)","v":0},null,null,null,{"$f":"ROUND(J35*$D$33,2)","v":0},null,null,null,{"$f":"ROUND(N35*$D$33,2)","v":0},null,null,null,{"$f":"ROUND(R35*$D$33,2)","v":0},null,null,null,{"$f":"ROUND(V35*$D$33,2)","v":0},null,null,null,{"$f":"SUM(F33:Y33)","v":0}]
[{"$f":"IF(A33=\"F\",A33,\"\")","v":""}]
[{"$f":"IF(A34=\"F\",A34,\"\")","v":""},null,null,null,null,null,null,null,null,0.38,null,null,null,0.62,null,null,null,0,null,null,null,{"$f":"100%-(SUM(F35:U35))","v":0},null,null,null,{"$f":"IFERROR(E33/100,\"\")","v":0}]
[{"$f":"IF(D36>0,\"F\",\"\")","v":""},"INSTALAÇÕES ESPECIAIS",null,{"$f":"Orçamento!V1073","v":0},{"$f":"Orçamento!X1073","v":0},{"$f":"ROUND(F38*$D$36,2)","v":0},null,null,null,{"$f":"ROUND(J38*$D$36,2)","v":0},null,null,null,{"$f":"ROUND(N38*$D$36,2)","v":0},null,null,null,{"$f":"ROUND(R38*$D$36,2)","v":0},null,null,null,{"$f":"ROUND(V38*$D$36,2)","v":0},null,null,null,{"$f":"SUM(F36:Y36)","v":0}]
[{"$f":"IF(A36=\"F\",A36,\"\")","v":""}]
[{"$f":"IF(A37=\"F\",A37,\"\")","v":""},null,null,null,null,null,null,null,null,null,null,null,null,0.7,null,null,null,0.3,null,null,null,{"$f":"100%-(SUM(F38:U38))","v":0},null,null,null,{"$f":"IFERROR(E36/100,\"\")","v":0}]
[{"$f":"IF(D39>0,\"F\",\"\")","v":""},"ALVENARIA E DIVISÓRIAS",null,{"$f":"Orçamento!V1074","v":0},{"$f":"Orçamento!X1074","v":0},{"$f":"ROUND(F41*$D$39,2)","v":0},null,null,null,{"$f":"ROUND(J41*$D$39,2)","v":0},null,null,null,{"$f":"ROUND(N41*$D$39,2)","v":0},null,null,null,{"$f":"ROUND(R41*$D$39,2)","v":0},null,null,null,{"$f":"ROUND(V41*$D$39,2)","v":0},null,null,null,{"$f":"SUM(F39:Y39)","v":0}]
[{"$f":"IF(A39=\"F\",A39,\"\")","v":""}]
[{"$f":"IF(A40=\"F\",A40,\"\")","v":""},null,null,null,null,null,null,null,null,null,null,null,null,1,null,null,null,0,null,null,null,{"$f":"100%-(SUM(F41:U41))","v":0},null,null,null,{"$f":"IFERROR(E39/100,\"\")","v":0}]
[{"$f":"IF(D42>0,\"F\",\"\")","v":""},"ALVENARIA AUTO-PORTANTE",null,{"$f":"Orçamento!V1075","v":0},{"$f":"Orçamento!X1075","v":0},{"$f":"ROUND(F44*$D$42,2)","v":0},null,null,null,{"$f":"ROUND(J44*$D$42,2)","v":0},null,null,null,{"$f":"ROUND(N44*$D$42,2)","v":0},null,null,null,{"$f":"ROUND(R44*$D$42,2)","v":0},null,null,null,{"$f":"ROUND(V44*$D$42,2)","v":0},null,null,null,{"$f":"SUM(F42:Y42)","v":0}]
[{"$f":"IF(A42=\"F\",A42,\"\")","v":""}]
[{"$f":"IF(A43=\"F\",A43,\"\")","v":""},null,null,null,null,null,null,null,null,null,null,null,null,1,null,null,null,0,null,null,null,{"$f":"100%-(SUM(F44:U44))","v":0},null,null,null,{"$f":"IFERROR(E42/100,\"\")","v":0}]
[{"$f":"IF(D45>0,\"F\",\"\")","v":""},"IMPERMEABILIZAÇÃO",null,{"$f":"Orçamento!V1076","v":0},{"$f":"Orçamento!X1076","v":0},{"$f":"ROUND(F47*$D$45,2)","v":0},null,null,null,{"$f":"ROUND(J47*$D$45,2)","v":0},null,null,null,{"$f":"ROUND(N47*$D$45,2)","v":0},null,null,null,{"$f":"ROUND(R47*$D$45,2)","v":0},null,null,null,{"$f":"ROUND(V47*$D$45,2)","v":0},null,null,null,{"$f":"SUM(F45:Y45)","v":0}]
[{"$f":"IF(A45=\"F\",A45,\"\")","v":""}]
[{"$f":"IF(A46=\"F\",A46,\"\")","v":""},null,null,null,null,null,null,null,null,0.86,null,null,null,0.14000000000000001,null,null,null,0,null,null,null,{"$f":"100%-(SUM(F47:U47))","v":0},null,null,null,{"$f":"IFERROR(E45/100,\"\")","v":0}]
[{"$f":"IF(D48>0,\"F\",\"\")","v":""},"ISOLAMENTO TÉRMICO E ACÚSTICO",null,{"$f":"Orçamento!V1077","v":0},{"$f":"Orçamento!X1077","v":0},{"$f":"ROUND(F50*$D$48,2)","v":0},null,null,null,{"$f":"ROUND(J50*$D$48,2)","v":0},null,null,null,{"$f":"ROUND(N50*$D$48,2)","v":0},null,null,null,{"$f":"ROUND(R50*$D$48,2)","v":0},null,null,null,{"$f":"ROUND(V50*$D$48,2)","v":0},null,null,null,{"$f":"SUM(F48:Y48)","v":0}]
[{"$f":"IF(A48=\"F\",A48,\"\")","v":""}]
[{"$f":"IF(A49=\"F\",A49,\"\")","v":""},null,null,null,null,null,null,null,null,null,null,null,null,1,null,null,null,null,null,null,null,{"$f":"100%-(SUM(F50:U50))","v":0},null,null,null,{"$f":"IFERROR(E48/100,\"\")","v":0}]
[{"$f":"IF(D51>0,\"F\",\"\")","v":""},"ESTRUTURA DE MADEIRA",null,{"$f":"Orçamento!V1078","v":0},{"$f":"Orçamento!X1078","v":0},{"$f":"ROUND(F53*$D$51,2)","v":0},null,null,null,{"$f":"ROUND(J53*$D$51,2)","v":0},null,null,null,{"$f":"ROUND(N53*$D$51,2)","v":0},null,null,null,{"$f":"ROUND(R53*$D$51,2)","v":0},null,null,null,{"$f":"ROUND(V53*$D$51,2)","v":0},null,null,null,{"$f":"SUM(F51:Y51)","v":0}]
[{"$f":"IF(A51=\"F\",A51,\"\")","v":""}]
[{"$f":"IF(A52=\"F\",A52,\"\")","v":""},null,null,null,null,null,null,null,null,null,null,null,null,0,null,null,null,1,null,null,null,{"$f":"100%-(SUM(F53:U53))","v":0},null,null,null,{"$f":"IFERROR(E51/100,\"\")","v":0}]
[{"$f":"IF(D54>0,\"F\",\"\")","v":""},"ESTRUTURA METÁLICA",null,{"$f":"Orçamento!V1079","v":0},{"$f":"Orçamento!X1079","v":0},{"$f":"ROUND(F56*$D$54,2)","v":0},null,null,null,{"$f":"ROUND(J56*$D$54,2)","v":0},null,null,null,{"$f":"ROUND(N56*$D$54,2)","v":0},null,null,null,{"$f":"ROUND(R56*$D$54,2)","v":0},null,null,null,{"$f":"ROUND(V56*$D$54,2)","v":0},null,null,null,{"$f":"SUM(F54:Y54)","v":0}]
[{"$f":"IF(A54=\"F\",A54,\"\")","v":""}]
[{"$f":"IF(A55=\"F\",A55,\"\")","v":""},null,null,null,null,null,null,null,null,null,null,null,null,0,null,null,null,1,null,null,null,{"$f":"100%-(SUM(F56:U56))","v":0},null,null,null,{"$f":"IFERROR(E54/100,\"\")","v":0}]
[{"$f":"IF(D57>0,\"F\",\"\")","v":""},"COBERTURAS",null,{"$f":"Orçamento!V1080","v":0},{"$f":"Orçamento!X1080","v":0},{"$f":"ROUND(F59*$D$57,2)","v":0},null,null,null,{"$f":"ROUND(J59*$D$57,2)","v":0},null,null,null,{"$f":"ROUND(N59*$D$57,2)","v":0},null,null,null,{"$f":"ROUND(R59*$D$57,2)","v":0},null,null,null,{"$f":"ROUND(V59*$D$57,2)","v":0},null,null,null,{"$f":"SUM(F57:Y57)","v":0}]
[{"$f":"IF(A57=\"F\",A57,\"\")","v":""}]
[{"$f":"IF(A58=\"F\",A58,\"\")","v":""},null,null,null,null,null,null,null,null,null,null,null,null,0,null,null,null,1,null,null,null,{"$f":"100%-(SUM(F59:U59))","v":0},null,null,null,{"$f":"IFERROR(E57/100,\"\")","v":0}]
[{"$f":"IF(D60>0,\"F\",\"\")","v":""},"ESQUADRIAS DE MADEIRA",null,{"$f":"Orçamento!V1081","v":0},{"$f":"Orçamento!X1081","v":0},{"$f":"ROUND(F62*$D$60,2)","v":0},null,null,null,{"$f":"ROUND(J62*$D$60,2)","v":0},null,null,null,{"$f":"ROUND(N62*$D$60,2)","v":0},null,null,null,{"$f":"ROUND(R62*$D$60,2)","v":0},null,null,null,{"$f":"ROUND(V62*$D$60,2)","v":0},null,null,null,{"$f":"SUM(F60:Y60)","v":0}]
[{"$f":"IF(A60=\"F\",A60,\"\")","v":""}]
[{"$f":"IF(A61=\"F\",A61,\"\")","v":""},null,null,null,null,null,null,null,null,null,null,null,null,null,null,null,null,0.35,null,null,null,{"$f":"100%-(SUM(F62:U62))","v":0.65},null,null,null,{"$f":"IFERROR(E60/100,\"\")","v":0}]
[{"$f":"IF(D63>0,\"F\",\"\")","v":""},"ESQUADRIAS METÁLICAS",null,{"$f":"Orçamento!V1082","v":0},{"$f":"Orçamento!X1082","v":0},{"$f":"ROUND(F65*$D$63,2)","v":0},null,null,null,{"$f":"ROUND(J65*$D$63,2)","v":0},null,null,null,{"$f":"ROUND(N65*$D$63,2)","v":0},null,null,null,{"$f":"ROUND(R65*$D$63,2)","v":0},null,null,null,{"$f":"ROUND(V65*$D$63,2)","v":0},null,null,null,{"$f":"SUM(F63:Y63)","v":0}]
[{"$f":"IF(A63=\"F\",A63,\"\")","v":""}]
[{"$f":"IF(A64=\"F\",A64,\"\")","v":""},null,null,null,null,null,null,null,null,null,null,null,null,null,null,null,null,0.35,null,null,null,{"$f":"100%-(SUM(F65:U65))","v":0.65},null,null,null,{"$f":"IFERROR(E63/100,\"\")","v":0}]
[{"$f":"IF(D66>0,\"F\",\"\")","v":""},"VIDROS",null,{"$f":"Orçamento!V1083","v":0},{"$f":"Orçamento!X1083","v":0},{"$f":"ROUND(F68*$D$66,2)","v":0},null,null,null,{"$f":"ROUND(J68*$D$66,2)","v":0},null,null,null,{"$f":"ROUND(N68*$D$66,2)","v":0},null,null,null,{"$f":"ROUND(R68*$D$66,2)","v":0},null,null,null,{"$f":"ROUND(V68*$D$66,2)","v":0},null,null,null,{"$f":"SUM(F66:Y66)","v":0}]
[{"$f":"IF(A66=\"F\",A66,\"\")","v":""}]
[{"$f":"IF(A67=\"F\",A67,\"\")","v":""},null,null,null,null,null,null,null,null,null,null,null,null,null,null,null,null,0,null,null,null,1,null,null,null,{"$f":"IFERROR(E66/100,\"\")","v":0}]
[{"$f":"IF(D69>0,\"F\",\"\")","v":""},"REVESTIMENTO DE PAREDE",null,{"$f":"Orçamento!V1084","v":0},{"$f":"Orçamento!X1084","v":0},{"$f":"ROUND(F71*$D$69,2)","v":0},null,null,null,{"$f":"ROUND(J71*$D$69,2)","v":0},null,null,null,{"$f":"ROUND(N71*$D$69,2)","v":0},null,null,null,{"$f":"ROUND(R71*$D$69,2)","v":0},null,null,null,{"$f":"ROUND(V71*$D$69,2)","v":0},null,null,null,{"$f":"SUM(F69:Y69)","v":0}]
[{"$f":"IF(A69=\"F\",A69,\"\")","v":""}]
[{"$f":"IF(A70=\"F\",A70,\"\")","v":""},null,null,null,null,null,null,null,null,null,null,null,null,0,null,null,null,1,null,null,null,{"$f":"100%-(SUM(F71:U71))","v":0},null,null,null,{"$f":"IFERROR(E69/100,\"\")","v":0}]
[{"$f":"IF(D72>0,\"F\",\"\")","v":""},"FORROS",null,{"$f":"Orçamento!V1085","v":0},{"$f":"Orçamento!X1085","v":0},{"$f":"ROUND(F74*$D$72,2)","v":0},null,null,null,{"$f":"ROUND(J74*$D$72,2)","v":0},null,null,null,{"$f":"ROUND(N74*$D$72,2)","v":0},null,null,null,{"$f":"ROUND(R74*$D$72,2)","v":0},null,null,null,{"$f":"ROUND(V74*$D$72,2)","v":0},null,null,null,{"$f":"SUM(F72:Y72)","v":0}]
[{"$f":"IF(A72=\"F\",A72,\"\")","v":""}]
[{"$f":"IF(A73=\"F\",A73,\"\")","v":""},null,null,null,null,null,null,null,null,null,null,null,null,0,null,null,null,0.4,null,null,null,{"$f":"100%-(SUM(F74:U74))","v":0.6},null,null,null,{"$f":"IFERROR(E72/100,\"\")","v":0}]
[{"$f":"IF(D75>0,\"F\",\"\")","v":""},"REVESTIMENTO DE PISO",null,{"$f":"Orçamento!V1086","v":0},{"$f":"Orçamento!X1086","v":0},{"$f":"ROUND(F77*$D$75,2)","v":0},null,null,null,{"$f":"ROUND(J77*$D$75,2)","v":0},null,null,null,{"$f":"ROUND(N77*$D$75,2)","v":0},null,null,null,{"$f":"ROUND(R77*$D$75,2)","v":0},null,null,null,{"$f":"ROUND(V77*$D$75,2)","v":0},null,null,null,{"$f":"SUM(F75:Y75)","v":0}]
[{"$f":"IF(A75=\"F\",A75,\"\")","v":""}]
[{"$f":"IF(A76=\"F\",A76,\"\")","v":""},null,null,null,null,null,null,null,null,null,null,null,null,null,null,null,null,0.4,null,null,null,{"$f":"100%-(SUM(F77:U77))","v":0.6},null,null,null,{"$f":"IFERROR(E75/100,\"\")","v":0}]
[{"$f":"IF(D78>0,\"F\",\"\")","v":""},"FERRAGENS",null,{"$f":"Orçamento!V1087","v":0},{"$f":"Orçamento!X1087","v":0},{"$f":"ROUND(F80*$D$78,2)","v":0},null,null,null,{"$f":"ROUND(J80*$D$78,2)","v":0},null,null,null,{"$f":"ROUND(N80*$D$78,2)","v":0},null,null,null,{"$f":"ROUND(R80*$D$78,2)","v":0},null,null,null,{"$f":"ROUND(V80*$D$78,2)","v":0},null,null,null,{"$f":"SUM(F78:Y78)","v":0}]
[{"$f":"IF(A78=\"F\",A78,\"\")","v":""}]
[{"$f":"IF(A79=\"F\",A79,\"\")","v":""},null,null,null,null,null,null,null,null,null,null,null,null,null,null,null,null,null,null,null,null,{"$f":"100%-(SUM(F80:U80))","v":1},null,null,null,{"$f":"IFERROR(E78/100,\"\")","v":0}]
[{"$f":"IF(D81>0,\"F\",\"\")","v":""},"MARCENARIA",null,{"$f":"Orçamento!V1088","v":0},{"$f":"Orçamento!X1088","v":0},{"$f":"ROUND(F83*$D$81,2)","v":0},null,null,null,{"$f":"ROUND(J83*$D$81,2)","v":0},null,null,null,{"$f":"ROUND(N83*$D$81,2)","v":0},null,null,null,{"$f":"ROUND(R83*$D$81,2)","v":0},null,null,null,{"$f":"ROUND(V83*$D$81,2)","v":0},null,null,null,{"$f":"SUM(F81:Y81)","v":0}]
[{"$f":"IF(A81=\"F\",A81,\"\")","v":""}]
[{"$f":"IF(A82=\"F\",A82,\"\")","v":""},null,null,null,null,null,null,null,null,null,null,null,null,null,null,null,null,null,null,null,null,{"$f":"100%-(SUM(F83:U83))","v":1},null,null,null,{"$f":"IFERROR(E81/100,\"\")","v":0}]
[{"$f":"IF(D84>0,\"F\",\"\")","v":""},"ADMINISTRAÇÃO - MENSALISTAS",null,{"$f":"Orçamento!V1089","v":0},{"$f":"Orçamento!X1089","v":0},{"$f":"ROUND(F86*$D$84,2)","v":0},null,null,null,{"$f":"ROUND(J86*$D$84,2)","v":0},null,null,null,{"$f":"ROUND(N86*$D$84,2)","v":0},null,null,null,{"$f":"ROUND(R86*$D$84,2)","v":0},null,null,null,{"$f":"ROUND(V86*$D$84,2)","v":0},null,null,null,{"$f":"SUM(F84:Y84)","v":0}]
[{"$f":"IF(A84=\"F\",A84,\"\")","v":""}]
[{"$f":"IF(A85=\"F\",A85,\"\")","v":""},null,null,null,null,0.23,null,null,null,0.2,null,null,null,0.2,null,null,null,0.2,null,null,null,{"$f":"100%-(SUM(F86:U86))","v":0.16999999999999993},null,null,null,{"$f":"IFERROR(E84/100,\"\")","v":0}]
[{"$f":"IF(D87>0,\"F\",\"\")","v":""},"PINTURA",null,{"$f":"Orçamento!V1090","v":0},{"$f":"Orçamento!X1090","v":0},{"$f":"ROUND(F89*$D$87,2)","v":0},null,null,null,{"$f":"ROUND(J89*$D$87,2)","v":0},null,null,null,{"$f":"ROUND(N89*$D$87,2)","v":0},null,null,null,{"$f":"ROUND(R89*$D$87,2)","v":0},null,null,null,{"$f":"ROUND(V89*$D$87,2)","v":0},null,null,null,{"$f":"SUM(F87:Y87)","v":0}]
[{"$f":"IF(A87=\"F\",A87,\"\")","v":""}]
[{"$f":"IF(A88=\"F\",A88,\"\")","v":""},null,null,null,null,null,null,null,null,null,null,null,null,null,null,null,null,0.36,null,null,null,{"$f":"100%-(SUM(F89:U89))","v":0.64},null,null,null,{"$f":"IFERROR(E87/100,\"\")","v":0}]
[{"$f":"IF(D90>0,\"F\",\"\")","v":""},"DIVERSOS",null,{"$f":"Orçamento!V1091","v":0},{"$f":"Orçamento!X1091","v":0},{"$f":"ROUND(F92*$D$90,2)+0.01","v":0.01},null,null,null,{"$f":"ROUND(J92*$D$90,2)","v":0},null,null,null,{"$f":"ROUND(N92*$D$90,2)","v":0},null,null,null,{"$f":"ROUND(R92*$D$90,2)","v":0},null,null,null,{"$f":"ROUND(V92*$D$90,2)","v":0},null,null,null,{"$f":"SUM(F90:Y90)","v":0.01}]
[{"$f":"IF(A90=\"F\",A90,\"\")","v":""}]
[{"$f":"IF(A91=\"F\",A91,\"\")","v":""},null,null,null,null,0.23,null,null,null,0.2,null,null,null,0.2,null,null,null,0.2,null,null,null,{"$f":"100%-(SUM(F92:U92))","v":0.16999999999999993},null,null,null,{"$f":"IFERROR(E90/100,\"\")","v":0}]
["F","CUSTO DO ORÇAMENTO",null,{"$f":"SUM(D15:D92)","v":0},{"$f":"SUM(E15:E92)","v":0},{"$f":"F15+F18+F21+F24+F27+F30+F33+F36+F39+F42+F45+F48+F51+F54+F57+F60+F63+F66+F69+F72+F75+F78+F81+F84+F87+F90","v":0.02},null,null,null,{"$f":"J15+J18+J21+J24+J27+J30+J33+J36+J39+J42+J45+J48+J51+J54+J57+J60+J63+J66+J69+J72+J75+J78+J81+J84+J87+J90","v":0},null,null,null,{"$f":"N15+N18+N21+N24+N27+N30+N33+N36+N39+N42+N45+N48+N51+N54+N57+N60+N63+N66+N69+N72+N75+N78+N81+N84+N87+N90","v":0},null,null,null,{"$f":"R15+R18+R21+R24+R27+R30+R33+R36+R39+R42+R45+R48+R51+R54+R57+R60+R63+R66+R69+R72+R75+R78+R81+R84+R87+R90","v":0},null,null,null,{"$f":"V15+V18+V21+V24+V27+V30+V33+V36+V39+V42+V45+V48+V51+V54+V57+V60+V63+V66+V69+V72+V75+V78+V81+V84+V87+V90","v":0},null,null,null,{"$f":"Z15+Z18+Z21+Z24+Z27+Z30+Z33+Z36+Z39+Z42+Z45+Z48+Z51+Z54+Z57+Z60+Z63+Z66+Z69+Z72+Z75+Z78+Z81+Z84+Z87+Z90","v":0.02}]
["F","PERCENTUAIS:",null,null,null,{"$f":"IFERROR(F93/$D$93,\"\")","v":""},null,null,null,{"$f":"IFERROR(J93/$D$93,\"\")","v":""},null,null,null,{"$f":"IFERROR(N93/$D$93,\"\")","v":""},null,null,null,{"$f":"IFERROR(R93/$D$93,\"\")","v":""},null,null,null,{"$f":"IFERROR(V93/$D$93,\"\")","v":""},null,null,null,{"$f":"SUM(F94:Y94)","v":0}]
["F","TOTAIS ACUMULADOS:",null,null,null,{"$f":"F93","v":0.02},null,null,null,{"$f":"J93+F95","v":0.02},null,null,null,{"$f":"N93+J95","v":0.02},null,null,null,{"$f":"R93+N95","v":0.02},null,null,null,{"$f":"V93+R95","v":0.02}]
["F","PERCENTUAIS  ACUMULADOS:",null,null,null,{"$f":"F94","v":""},null,null,null,{"$f":"J94+F96","v":{"$error":"#VALUE!"}},null,null,null,{"$f":"N94+J96","v":{"$error":"#VALUE!"}},null,null,null,{"$f":"R94+N96","v":{"$error":"#VALUE!"}},null,null,null,{"$f":"V94+R96","v":{"$error":"#VALUE!"}}]
["F"]
["F","OBSERVAÇÕES:"]
["F","Os pagamentos somente poderão ser efetuados mediante medição e atesto pelos técnicos da Secretaria da Educação. "]

{"sheet":"Composição BDI","index":4,"n_rows":45,"n_cols":9,"rows_kept":45,"cut":false,"hidden":false,"merged":[[18,5,18,8],[17,0,17,3],[16,0,16,3],[44,0,44,3],[42,0,42,3],[43,0,43,3],[18,0,18,3],[36,0,36,3],[39,0,39,3],[38,0,38,3],[40,0,40,3],[29,0,29,2],[32,0,32,3],[33,0,33,3],[34,0,34,3],[35,0,35,3],[0,0,0,3],[1,0,1,3],[4,0,4,3],[7,0,7,3],[10,0,10,3],[2,0,2,3],[3,0,3,3],[5,0,5,3],[6,0,6,3],[8,0,8,3],[9,0,9,3],[11,0,11,3],[12,0,12,3],[14,0,14,3],[15,0,15,3],[13,0,13,3]]}
[]
[]
["UNIDADE ESCOLAR"]
[{"$f":"Orçamento!$O$4","v":"COLÉGIO ESTADUAL RUY BRASIL CAVALCANTE"}]
[]
["OBRA"]
[{"$f":"Orçamento!$O$7","v":"AMPLIAÇÃO E REFORMA"}]
[]
["ENDEREÇO"]
[{"$f":"Orçamento!$R$10","v":"PRACA DIMAS COSTA 413, CENTRO, CEP:75640-000"}]
[]
["CIDADE"]
[{"$f":"Orçamento!$V$7","v":"PIRACANJUBA"}]
[]
["CRE"]
[{"$f":"Orçamento!$O$10","v":"PIRACANJUBA"}]
[]
["DETALHAMENTO DA COMPOSIÇÃO DE BDI"]
["COMPOSIÇÃO BDI PARA OBRAS CIVIS",null,null,null,null,"BDI CONSTRUÇÃO E REFORMA"]
["DESCRIÇÃO","COEF.","TAXA % (a.m)","% no preço de venda",null,"Situação","1º Quartil","Médio","3º Quartil"]
["1) COFINS",1,0.03,{"$f":"C21","v":0.03},null,{"$f":"IF(OR(C21<G21,C21>I21),\"FORA DO INTERVALO\",\"OK\")","v":"OK"},0.03,0.03,0.03]
["2) PIS",1,6.4999999999999997E-3,{"$f":"C22","v":6.4999999999999997E-3},null,{"$f":"IF(OR(C22<G22,C22>I22),\"FORA DO INTERVALO\",\"OK\")","v":"OK"},6.4999999999999997E-3,6.4999999999999997E-3,6.4999999999999997E-3]
["3) ISSQN",1,2.5000000000000001E-2,{"$f":"C23*B23","v":2.5000000000000001E-2},null,"OK",0.02,3.5000000000000003E-2,0.05]
["4) CPRB",1,0,{"$f":"C24","v":0},null,"FORA DO INTERVALO",4.4999999999999998E-2,4.4999999999999998E-2,4.4999999999999998E-2]
["5) Administração Central",1,0.04,0.04,null,"OK",0.03,0.04,5.5E-2]
["6) Despesas Financeiras",1,5.5999999999999999E-3,5.5999999999999999E-3,null,"FORA DO INTERVALO",5.8999999999999999E-3,1.23E-2,1.3899999999999999E-2]
["7) Seguros + Garantias",1,1.1999999999999999E-3,1.1999999999999999E-3,null,"FORA DO INTERVALO",8.0000000000000002E-3,8.0000000000000002E-3,0.01]
["8) Risco",1,9.7000000000000003E-3,9.7000000000000003E-3,null,"OK",9.7000000000000003E-3,1.2699999999999999E-2,1.2699999999999999E-2]
["9) Lucro",1,6.88E-2,6.88E-2,null,"OK",6.1600000000000002E-2,7.3999999999999996E-2,8.9599999999999999E-2]
["BDI - FINAL",null,null,{"$f":"(((1+D25+D27+D28)*(1+D26)*(1+D29))/(1-(D21+D22+D23+D24))-1)","v":0.20350756606499765},null,{"$f":"IF(OR(D30<G30,D30>I30),\"FORA DO INTERVALO\",\"OK\")","v":"OK"},0.2034,0.22120000000000001,0.25]
[]
["Notas:"]
["(1) e (2) Alíquota definida por lei."]
["(3) Alíquota e base de cálculo definidas pela legislação municipal."]
["(4) Alíquota definida pelas leis 12.546/11, 12844/13 e 13.161/15 (CPRB – contribuição previdenciária sobre a receita bruta)."]
["(5) Valores definidos a partir dos limites no Acórdão nº 2.622/2013 - TCU – Plenário. Valores entre o 1º e 3º quartis."]
["(6) Valor calculado pela expressão matemática do acórdão 2.369/2011 – TCU – Plenário e disponibilizado pela AGETOP em dezembro de 2018. (Foi utilizado para o cálculo a média da Taxa SELIC no período de 11/2017 a 10/2018)"]
[]
["(7) Valores definidos pela AGETOP a partir dos limites no Acórdão nº 2.622/2013 - TCU – Plenário. Valores médios. \n\nObservação da AGETOP: (Seguros contra erros de execução, incêndio e explosão, danos da natureza (vendaval, destelhamento, alagamento, inundação, desmoronamento, geadas etc.), emprego de material defeituoso ou inadequado, roubo e/ou furto qualificado, quebra de equipamentos, desmoronamento de estrutura, nas modalidades de Obras Civis em Construção (OCC); Instalação e Montagem (IM); e Obras Civis em Construção e Instalação e Montagem (OCC/IM). Bem como coberturas adicionais para ampliação dessas coberturas básicas, como: cobertura de responsabilidade civil geral, cobertura de responsabilidade civil cruzada, cobertura de despesas extraordinárias, cobertura de tumultos, cobertura de desentulho do local, cobertura de riscos do fabricante, dentre outras, incluindo o seguro de vida em grupo regido pela convenção coletiva dos trabalhadores na indústria da construção civil). A partir de 24/02/2015 por intermédio da Portaria 449/2015 a Presidência da AGETOP, na pessoa do Senhor Jayme Eduardo Rincon, determinou a exclusão dos valores referentes aos Seguros de Risco de Engenharia e Responsabilidade Civil do Profissional na composição do cálculo do B.D.I.."]
["(8) Valores definidos a partir dos limites no Acórdão nº 2.622/2013 - TCU – Plenário. Valores entre 1º e 3° quartis."]
["(9) Valores definidos a partir dos limites definidos no Acórdão nº 2.622/2013 - TCU – Plenário. Valores adotados e praticados no mercado ( “ ex ante ” ) ou aqueles entre os 1º e 3º quartis."]
[]
["(*) A fórmula para estipulação da taxa de BDI estimado adotado é a mesma que foi aplicada para a obtenção das tabelas contidas no Acórdão n. 2.622/2013 – TCUPlenário"]
[]
["Obs.: Para obras com valores superiores a R$ 20.000.000,00 sugere-se recalcular o BDI, dimensionando as taxas de administração central e lucro para patamares inferiores ao estipulado acima."]

{"sheet":"Relatório CENTRAL","index":5,"n_rows":40,"n_cols":5,"rows_kept":40,"cut":false,"hidden":false,"merged":[[9,0,11,0],[0,1,0,4],[6,3,6,4],[9,3,9,4],[1,1,1,4],[2,1,2,2],[2,3,2,4],[3,1,3,2],[3,3,3,4],[4,1,4,4],[5,1,5,2],[5,3,5,4],[6,1,6,2],[7,1,7,4],[8,1,8,2],[8,3,8,4],[9,1,9,2],[10,1,10,4],[11,1,11,4],[39,1,39,2]]}
[]
[]
[null,"UNIDADE ESCOLAR",null,"CIDADE"]
[null,{"$f":"Orçamento!$O$4","v":"COLÉGIO ESTADUAL RUY BRASIL CAVALCANTE"},null,{"$f":"Orçamento!$V$7","v":"PIRACANJUBA"}]
[]
[null,"OBRA",null,"CRE"]
[null,{"$f":"Orçamento!$O$7","v":"AMPLIAÇÃO E REFORMA"},null,{"$f":"Orçamento!$O$10","v":"PIRACANJUBA"}]
[]
[null,"ENDEREÇO",null,"DATA"]
["FILTRO",{"$f":"Orçamento!$R$10","v":"PRACA DIMAS COSTA 413, CENTRO, CEP:75640-000"},null,{"$f":"Orçamento!$S$7","v":"2020-04-13"}]
[]
[null,"RELATÓRIO CENTRAL"]
["↓","CÓDIGO","ETAPA","PREÇO  (R$) C/ BDI","PARTIC  ( % )"]
[{"$f":"IF(D14>0,\"F\",\"\")","v":""},{"$f":"Orçamento!O1066","v":"a."},{"$f":"Orçamento!P1066","v":"SERVIÇOS PRELIMINARES"},{"$f":"Orçamento!V1066","v":0},{"$f":"Orçamento!X1066","v":0}]
[{"$f":"IF(D15>0,\"F\",\"\")","v":""},{"$f":"Orçamento!O1067","v":"b."},{"$f":"Orçamento!P1067","v":"TRANSPORTES"},{"$f":"Orçamento!V1067","v":0},{"$f":"Orçamento!X1067","v":0}]
["",{"$f":"Orçamento!O1068","v":"c."},{"$f":"Orçamento!P1068","v":"SERVIÇO EM TERRA"},{"$f":"Orçamento!V1068","v":0},{"$f":"Orçamento!X1068","v":0}]
["",{"$f":"Orçamento!O1069","v":"d."},{"$f":"Orçamento!P1069","v":"FUNDAÇÕES E SONDAGENS"},{"$f":"Orçamento!V1069","v":0},{"$f":"Orçamento!X1069","v":0}]
["",{"$f":"Orçamento!O1070","v":"e."},{"$f":"Orçamento!P1070","v":"ESTRUTURA"},{"$f":"Orçamento!V1070","v":0},{"$f":"Orçamento!X1070","v":0}]
["",{"$f":"Orçamento!O1071","v":"f."},{"$f":"Orçamento!P1071","v":"INSTALAÇÕES ELÉTRICAS"},{"$f":"Orçamento!V1071","v":0},{"$f":"Orçamento!X1071","v":0}]
["",{"$f":"Orçamento!O1072","v":"g."},{"$f":"Orçamento!P1072","v":"INSTALAÇÕES HIDROSSANITÁRIAS"},{"$f":"Orçamento!V1072","v":0},{"$f":"Orçamento!X1072","v":0}]
["",{"$f":"Orçamento!O1073","v":"h"},{"$f":"Orçamento!P1073","v":"INSTALAÇÕES ESPECIAIS"},{"$f":"Orçamento!V1073","v":0},{"$f":"Orçamento!X1073","v":0}]
["",{"$f":"Orçamento!O1074","v":"i."},{"$f":"Orçamento!P1074","v":"ALVENARIAS E DIVISÓRIAS"},{"$f":"Orçamento!V1074","v":0},{"$f":"Orçamento!X1074","v":0}]
["",{"$f":"Orçamento!O1075","v":"j."},{"$f":"Orçamento!P1075","v":"ALVENARIA AUTO-PORTANTE"},{"$f":"Orçamento!V1075","v":0},{"$f":"Orçamento!X1075","v":0}]
["",{"$f":"Orçamento!O1076","v":"k."},{"$f":"Orçamento!P1076","v":"IMPERMEABILIZAÇÃO"},{"$f":"Orçamento!V1076","v":0},{"$f":"Orçamento!X1076","v":0}]
["",{"$f":"Orçamento!O1077","v":"l."},{"$f":"Orçamento!P1077","v":"ISOLAMENTO TÉRMICO E ACÚSTICO"},{"$f":"Orçamento!V1077","v":0},{"$f":"Orçamento!X1077","v":0}]
["",{"$f":"Orçamento!O1078","v":"m."},{"$f":"Orçamento!P1078","v":"ESTRUTURA DE MADEIRA"},{"$f":"Orçamento!V1078","v":0},{"$f":"Orçamento!X1078","v":0}]
["",{"$f":"Orçamento!O1079","v":"n."},{"$f":"Orçamento!P1079","v":"ESTRUTURAS METÁLICAS"},{"$f":"Orçamento!V1079","v":0},{"$f":"Orçamento!X1079","v":0}]
["",{"$f":"Orçamento!O1080","v":"o."},{"$f":"Orçamento!P1080","v":"COBERTURAS"},{"$f":"Orçamento!V1080","v":0},{"$f":"Orçamento!X1080","v":0}]
["",{"$f":"Orçamento!O1081","v":"p."},{"$f":"Orçamento!P1081","v":"ESQUADRIAS DE MADEIRA"},{"$f":"Orçamento!V1081","v":0},{"$f":"Orçamento!X1081","v":0}]
["",{"$f":"Orçamento!O1082","v":"q."},{"$f":"Orçamento!P1082","v":"ESQUADRIAS METÁLICAS"},{"$f":"Orçamento!V1082","v":0},{"$f":"Orçamento!X1082","v":0}]
["",{"$f":"Orçamento!O1083","v":"r."},{"$f":"Orçamento!P1083","v":"VIDROS"},{"$f":"Orçamento!V1083","v":0},{"$f":"Orçamento!X1083","v":0}]
["",{"$f":"Orçamento!O1084","v":"s."},{"$f":"Orçamento!P1084","v":"REVESTIMENTO DE PAREDE"},{"$f":"Orçamento!V1084","v":0},{"$f":"Orçamento!X1084","v":0}]
["",{"$f":"Orçamento!O1085","v":"t."},{"$f":"Orçamento!P1085","v":"FORROS"},{"$f":"Orçamento!V1085","v":0},{"$f":"Orçamento!X1085","v":0}]
["",{"$f":"Orçamento!O1086","v":"u."},{"$f":"Orçamento!P1086","v":"REVESTIMENTO DE PISO"},{"$f":"Orçamento!V1086","v":0},{"$f":"Orçamento!X1086","v":0}]
["",{"$f":"Orçamento!O1087","v":"v."},{"$f":"Orçamento!P1087","v":"FERRAGENS"},{"$f":"Orçamento!V1087","v":0},{"$f":"Orçamento!X1087","v":0}]
["",{"$f":"Orçamento!O1088","v":"w."},{"$f":"Orçamento!P1088","v":"MARCENARIA"},{"$f":"Orçamento!V1088","v":0},{"$f":"Orçamento!X1088","v":0}]
["",{"$f":"Orçamento!O1089","v":"x."},{"$f":"Orçamento!P1089","v":"ADMINISTRAÇÃO"},{"$f":"Orçamento!V1089","v":0},{"$f":"Orçamento!X1089","v":0}]
["",{"$f":"Orçamento!O1090","v":"y."},{"$f":"Orçamento!P1090","v":"PINTURA"},{"$f":"Orçamento!V1090","v":0},{"$f":"Orçamento!X1090","v":0}]
["",{"$f":"Orçamento!O1091","v":"z."},{"$f":"Orçamento!P1091","v":"DIVERSOS"},{"$f":"Orçamento!V1091","v":0},{"$f":"Orçamento!X1091","v":0}]
["F","TOTAL GERAL DO ORÇAMENTO (R$) C/BDI",null,{"$f":"SUM(D14:D39)","v":0},{"$f":"SUM(E14:E39)","v":0}]

{"sheet":"Parc Maior Relev","index":6,"n_rows":32,"n_cols":7,"rows_kept":32,"cut":false,"hidden":false,"merged":[[10,0,12,0],[8,1,8,3],[8,4,8,6],[32,3,32,7],[30,1,30,6],[0,1,0,6],[11,1,11,6],[1,1,1,6],[2,1,2,3],[2,4,2,6],[3,1,3,3],[3,4,3,6],[4,1,4,6],[5,1,5,3],[5,4,5,6],[9,1,9,3],[9,4,9,6],[10,1,10,6],[6,1,6,3],[6,4,6,6],[7,1,7,6]]}
[]
[]
[null,"UNIDADE ESCOLAR",null,null,"CÓDIGO INEP"]
[null,{"$f":"Orçamento!$O$4","v":"COLÉGIO ESTADUAL RUY BRASIL CAVALCANTE"},null,null,{"$f":"Orçamento!$V$4","v":52060993}]
[]
[null,"OBRA",null,null,"CIDADE"]
[null,{"$f":"Orçamento!$O$7","v":"AMPLIAÇÃO E REFORMA"},null,null,{"$f":"Orçamento!$V$7","v":"PIRACANJUBA"}]
[]
[null,"CRE",null,null,"ÁREA TOTAL CONSTRUÍDA (M²)"]
[null,{"$f":"Orçamento!$O$10","v":"PIRACANJUBA"},null,null,{"$f":"Orçamento!$S$13","v":2185.87}]
["FILTRO"]
[null,"PARCELA DE MAIOR RELEVÂNCIA"]
[null,"CÓDIGO","SERVIÇO","DESCRIÇÃO","UNID","QUANT","PARC. MAIOR RELEV (100%)"]
[null,70000,"INSTALAÇÕES ELÉTRICAS","SUBESTAÇÃO","KVA",112.5,{"$f":"F14","v":112.5}]
[null,"CÓDIGO","SERVIÇO","DESCRIÇÃO","UNID","QUANT","PARC. MAIOR RELEV (50%)"]
[null,70000,"INSTALAÇÕES ELÉTRICAS","INSTALAÇÕES ELÉTRICAS","KVA",{"$f":"SUMIF(Orçamento!$R$591:$R$1047,'Parc Maior Relev'!D16,Orçamento!$T$591:$T$1047)","v":0},{"$f":"F16*0.5","v":0}]
[null,160000,"COBERTURAS","TELHA CERÂMICA","M2",{"$f":"Orçamento!T395+Orçamento!T682+Orçamento!T803+Orçamento!T1009","v":1049.17},{"$f":"F17*0.5","v":524.58500000000004}]
[null,160000,"COBERTURAS","TELHA FIBROCIMENTO","M2",{"$f":"SUMIF(Orçamento!$R$591:$R$1047,'Parc Maior Relev'!D18,Orçamento!$T$591:$T$1047)","v":0},0]
[null,160000,"COBERTURAS","TELHA METÁLICA","M2",{"$f":"SUMIF(Orçamento!$R$591:$R$1047,'Parc Maior Relev'!D19,Orçamento!$T$591:$T$1047)","v":0},0]
[null,200000,"REVESTIMENTO DE PAREDE","REBOCO","M2",{"$f":"SUMIF(Orçamento!$R$591:$R$1047,'Parc Maior Relev'!D20,Orçamento!$T$591:$T$1047)","v":0},{"$f":"F20*0.5","v":0}]
[null,200000,"REVESTIMENTO DE PAREDE","REVESTIMENTO CERÂMICO","M2",{"$f":"SUMIF(Orçamento!$R$591:$R$1047,'Parc Maior Relev'!D21,Orçamento!$T$591:$T$1047)","v":0},0]
[null,210000,"FORROS","FORRO DE GESSO","M2",{"$f":"SUMIF(Orçamento!$R$591:$R$1047,'Parc Maior Relev'!D22,Orçamento!$T$591:$T$1047)","v":0},{"$f":"F22*0.5","v":0}]
[null,210000,"FORROS","FORRO PVC","M2",{"$f":"SUMIF(Orçamento!$R$591:$R$1047,'Parc Maior Relev'!D23,Orçamento!$T$591:$T$1047)","v":0},0]
[null,210000,"FORROS","FORRO ACARTONADO","M2",{"$f":"SUMIF(Orçamento!$R$591:$R$1047,'Parc Maior Relev'!D24,Orçamento!$T$591:$T$1047)","v":0},0]
[null,220000,"REVESTIMENTO DE PISO","PISO GRANITINA","M2",{"$f":"Orçamento!T454+Orçamento!T700+Orçamento!T813+Orçamento!T1028","v":514.84999999999991},257.42499999999995]
[null,220000,"REVESTIMENTO DE PISO","PISO LAMINADO","M2",{"$f":"SUMIF(Orçamento!$R$591:$R$1047,'Parc Maior Relev'!D26,Orçamento!$T$591:$T$1047)","v":0},0]
[null,220000,"REVESTIMENTO DE PISO","PISO CONCRETO DESEMPENADO","M2",{"$f":"SUMIF(Orçamento!$R$591:$R$1047,'Parc Maior Relev'!D27,Orçamento!$T$591:$T$1047)","v":0},0]
[null,220000,"REVESTIMENTO DE PISO","PISO CERÂMICO","M2",{"$f":"SUMIF(Orçamento!$R$591:$R$1047,'Parc Maior Relev'!D28,Orçamento!$T$591:$T$1047)","v":0},{"$f":"F28*0.5","v":0}]
[null,260000,"PINTURA","PINTURA","M2",{"$f":"SUMIF(Orçamento!$R$591:$R$1047,'Parc Maior Relev'!D29,Orçamento!$T$591:$T$1047)","v":0},0]
["F"]
["F","(*) Para os fins do inciso I dp § 1º do Art. 30 da Lei Federal 8.666/93, são consideradas parcelas de maior relevância técnica as execuções apresentadas"]
["F"]

{"sheet":"Composições","index":7,"n_rows":472,"n_cols":10,"rows_kept":472,"cut":false,"hidden":false,"merged":[[452,5,453,5],[452,6,452,7],[452,8,452,9],[457,1,457,7],[471,1,471,7],[452,0,453,0],[452,1,453,1],[452,2,453,2],[452,3,453,3],[452,4,453,4],[429,5,430,5],[429,6,429,7],[429,8,429,9],[435,1,435,7],[450,1,450,7],[429,0,430,0],[429,1,430,1],[429,2,430,2],[429,3,430,3],[429,4,430,4],[417,5,418,5],[417,6,417,7],[417,8,417,9],[423,1,423,7],[427,1,427,7],[417,0,418,0],[417,1,418,1],[417,2,418,2],[417,3,418,3],[417,4,418,4],[405,5,406,5],[405,6,405,7],[405,8,405,9],[411,1,411,7],[415,1,415,7],[405,0,406,0],[405,1,406,1],[405,2,406,2],[405,3,406,3],[405,4,406,4],[393,5,394,5],[393,6,393,7],[393,8,393,9],[399,1,399,7],[403,1,403,7],[393,0,394,0],[393,1,394,1],[393,2,394,2],[393,3,394,3],[393,4,394,4],[381,5,382,5],[381,6,381,7],[381,8,381,9],[387,1,387,7],[391,1,391,7],[381,0,382,0],[381,1,382,1],[381,2,382,2],[381,3,382,3],[381,4,382,4],[369,5,370,5],[369,6,369,7],[369,8,369,9],[375,1,375,7],[379,1,379,7],[369,0,370,0],[369,1,370,1],[369,2,370,2],[369,3,370,3],[369,4,370,4],[357,5,358,5],[357,6,357,7],[357,8,357,9],[363,1,363,7],[367,1,367,7],[357,0,358,0],[357,1,358,1],[357,2,358,2],[357,3,358,3],[357,4,358,4],[345,5,346,5],[345,6,345,7],[345,8,345,9],[351,1,351,7],[355,1,355,7],[345,0,346,0],[345,1,346,1],[345,2,346,2],[345,3,346,3],[345,4,346,4],[333,5,334,5],[333,6,333,7],[333,8,333,9],[339,1,339,7],[343,1,343,7],[333,0,334,0],[333,1,334,1],[333,2,334,2],[333,3,334,3],[333,4,334,4],[321,5,322,5],[321,6,321,7],[321,8,321,9],[327,1,327,7],[331,1,331,7],[321,0,322,0],[321,1,322,1],[321,2,322,2],[321,3,322,3],[321,4,322,4],[309,5,310,5],[309,6,309,7],[309,8,309,9],[315,1,315,7],[319,1,319,7],[309,0,310,0],[309,1,310,1],[309,2,310,2],[309,3,310,3],[309,4,310,4],[297,5,298,5],[297,6,297,7],[297,8,297,9],[303,1,303,7],[307,1,307,7],[297,0,298,0],[297,1,298,1],[297,2,298,2],[297,3,298,3],[297,4,298,4],[282,5,283,5],[282,6,282,7],[282,8,282,9],[288,1,288,7],[295,1,295,7],[282,0,283,0],[282,1,283,1],[282,2,283,2],[282,3,283,3],[282,4,283,4],[272,5,273,5],[272,6,272,7],[272,8,272,9],[276,1,276,7],[280,1,280,7],[272,0,273,0],[272,1,273,1],[272,2,273,2],[272,3,273,3],[272,4,273,4],[260,5,261,5],[260,6,260,7],[260,8,260,9],[266,1,266,7],[270,1,270,7],[260,0,261,0],[260,1,261,1],[260,2,261,2],[260,3,261,3],[260,4,261,4],[248,5,249,5],[248,6,248,7],[248,8,248,9],[254,1,254,7],[258,1,258,7],[248,0,249,0],[248,1,249,1],[248,2,249,2],[248,3,249,3],[248,4,249,4],[236,5,237,5],[236,6,236,7],[236,8,236,9],[242,1,242,7],[246,1,246,7],[236,0,237,0],[236,1,237,1],[236,2,237,2],[236,3,237,3],[236,4,237,4],[224,5,225,5],[224,6,224,7],[224,8,224,9],[230,1,230,7],[234,1,234,7],[224,0,225,0],[224,1,225,1],[224,2,225,2],[224,3,225,3],[224,4,225,4],[212,5,213,5],[212,6,212,7],[212,8,212,9],[218,1,218,7],[222,1,222,7],[212,0,213,0],[212,1,213,1],[212,2,213,2],[212,3,213,3],[212,4,213,4],[200,5,201,5],[200,6,200,7],[200,8,200,9],[206,1,206,7],[210,1,210,7],[200,0,201,0],[200,1,201,1],[200,2,201,2],[200,3,201,3],[200,4,201,4],[188,5,189,5],[188,6,188,7],[188,8,188,9],[194,1,194,7],[198,1,198,7],[188,0,189,0],[188,1,189,1],[188,2,189,2],[188,3,189,3],[188,4,189,4],[178,5,179,5],[178,6,178,7],[178,8,178,9],[183,1,183,7],[186,1,186,7],[178,0,179,0],[178,1,179,1],[178,2,179,2],[178,3,179,3],[178,4,179,4],[168,5,169,5],[168,6,168,7],[168,8,168,9],[173,1,173,7],[176,1,176,7],[168,0,169,0],[168,1,169,1],[168,2,169,2],[168,3,169,3],[168,4,169,4],[158,5,159,5],[158,6,158,7],[158,8,158,9],[163,1,163,7],[166,1,166,7],[158,0,159,0],[158,1,159,1],[158,2,159,2],[158,3,159,3],[158,4,159,4],[146,5,147,5],[146,6,146,7],[146,8,146,9],[152,1,152,7],[156,1,156,7],[146,0,147,0],[146,1,147,1],[146,2,147,2],[146,3,147,3],[146,4,147,4],[134,5,135,5],[134,6,134,7],[134,8,134,9],[140,1,140,7],[144,1,144,7],[134,0,135,0],[134,1,135,1],[134,2,135,2],[134,3,135,3],[134,4,135,4],[122,5,123,5],[122,6,122,7],[122,8,122,9],[128,1,128,7],[132,1,132,7],[122,0,123,0],[122,1,123,1],[122,2,123,2],[122,3,123,3],[122,4,123,4],[110,5,111,5],[110,6,110,7],[110,8,110,9],[116,1,116,7],[120,1,120,7],[110,0,111,0],[110,1,111,1],[110,2,111,2],[110,3,111,3],[110,4,111,4],[98,5,99,5],[98,6,98,7],[98,8,98,9],[104,1,104,7],[108,1,108,7],[98,0,99,0],[98,1,99,1],[98,2,99,2],[98,3,99,3],[98,4,99,4],[86,5,87,5],[86,6,86,7],[86,8,86,9],[92,1,92,7],[96,1,96,7],[86,0,87,0],[86,1,87,1],[86,2,87,2],[86,3,87,3],[86,4,87,4],[76,5,77,5],[76,6,76,7],[76,8,76,9],[81,1,81,7],[84,1,84,7],[76,0,77,0],[76,1,77,1],[76,2,77,2],[76,3,77,3],[76,4,77,4],[64,5,65,5],[64,6,64,7],[64,8,64,9],[70,1,70,7],[74,1,74,7],[64,0,65,0],[64,1,65,1],[64,2,65,2],[64,3,65,3],[64,4,65,4],[52,5,53,5],[52,6,52,7],[52,8,52,9],[58,1,58,7],[62,1,62,7],[52,0,53,0],[52,1,53,1],[52,2,53,2],[52,3,53,3],[52,4,53,4],[40,5,41,5],[40,6,40,7],[40,8,40,9],[46,1,46,7],[50,1,50,7],[40,0,41,0],[40,1,41,1],[40,2,41,2],[40,3,41,3],[40,4,41,4],[28,5,29,5],[28,6,28,7],[28,8,28,9],[34,1,34,7],[38,1,38,7],[28,0,29,0],[28,1,29,1],[28,2,29,2],[28,3,29,3],[28,4,29,4],[16,5,17,5],[16,6,16,7],[16,8,16,9],[22,1,22,7],[26,1,26,7],[16,0,17,0],[16,1,17,1],[16,2,17,2],[16,3,17,3],[16,4,17,4],[0,0,0,8],[10,0,10,2],[10,3,10,6],[11,0,11,9],[12,0,12,2],[12,3,12,6],[12,7,12,8],[7,0,7,6],[9,0,9,2],[9,3,9,6],[9,7,9,8],[3,0,3,6],[4,0,4,6],[15,0,15,9],[13,0,13,2],[13,3,13,6],[1,0,1,9],[3,7,3,9],[4,7,4,9],[6,7,6,9],[7,7,7,9],[6,0,6,6],[10,8,10,9],[13,8,13,9],[14,0,14,9],[8,0,8,9],[5,0,5,9],[2,0,2,9]]}
[]
[]
[]
["UNIDADE ESCOLAR",null,null,null,null,null,null,"CÓDIGO INEP"]
[{"$f":"Orçamento!$O$4","v":"COLÉGIO ESTADUAL RUY BRASIL CAVALCANTE"},null,null,null,null,null,null,{"$f":"Orçamento!$V$4","v":52060993}]
[]
["OBRA",null,null,null,null,null,null,"CIDADE"]
[{"$f":"Orçamento!$O$7","v":"AMPLIAÇÃO E REFORMA"},null,null,null,null,null,null,{"$f":"Orçamento!$V$7","v":"PIRACANJUBA"}]
[]
["CRE",null,null,"ENDEREÇO",null,null,null,"REFERÊNCIA AGETOP"]
[{"$f":"Orçamento!$O$10","v":"PIRACANJUBA"},null,null,{"$f":"Orçamento!$R$10","v":"PRACA DIMAS COSTA 413, CENTRO, CEP:75640-000"},null,null,null,{"$f":"Orçamento!$V$10","v":"DEZ/18"},{"$f":"Orçamento!$W$10","v":"ONERADA"}]
[]
["DATA",null,null,"ÁREA TOTAL CONSTRUÍDA (M²)",null,null,null,"REFERÊNCIA SINAPI"]
[{"$f":"Orçamento!$S$7","v":"2020-04-13"},null,null,{"$f":"Orçamento!$S$13","v":2185.87},null,null,null,{"$f":"Orçamento!$V$13","v":"AGO/19"},{"$f":"Orçamento!$W$13","v":"ONERADA"}]
[]
["COMPOSIÇÕES DE CUSTOS UNITÁRIOS - SEE-GO"]
[430,"FONTE","CÓDIGO","DESCRIÇÃO","UNIDADE","COEFIC.","CUSTO UNITÁRIO",null,"CUSTO  TOTAL (A) + (B) + (C) + (D) + (E)"]
[null,null,null,null,null,null,"DESONERADO","NÃO DESONER.","DESONERADO","NÃO DESONER."]
[null,"COMPOSIÇÃO","COMP 430_SEE","DEMOLIÇÃO DE ESTRUTURA METÁLICA","M2",null,null,null,8.7999999999999989,10.159999999999998]
[null,"AGETOP_I",21,"SERRALHEIRO","h     ",0.33,13.4,15.53,4.42,5.12]
[null,"AGETOP_I",8,"AJUDANTE","h     ",0.5,8.1999999999999993,9.51,4.0999999999999996,4.76]
[null,null,null,"","",null,0,0,0,0]
[null,"MÃO DE OBRA (B) - TOTAL",null,null,null,null,null,null,8.52,9.879999999999999]
[null,"AGETOP_I",1334,"DISCO DE CORTE DIAM. 5/8\"- 10\"","un",0.05,5.5,5.5,0.28000000000000003,0.28000000000000003]
[null,null,null,"","",null,0,0,0,0]
[null,null,null,"","",null,0,0,0,0]
[null,"MATERIAL (C) - TOTAL",null,null,null,null,null,null,0.28000000000000003,0.28000000000000003]
[]
[46,"FONTE","CÓDIGO","DESCRIÇÃO","UNIDADE","COEFIC.","CUSTO UNITÁRIO",null,"CUSTO  TOTAL (A) + (B) + (C) + (D) + (E)"]
[null,null,null,null,null,null,"DESONERADO","NÃO DESONER.","DESONERADO","NÃO DESONER."]
[null,"COMPOSIÇÃO","COMP 046_SEE","CAPUZ PARA PROTEÇÃO DOS PARA RAIOS","UN ",null,null,null,16.53,16.650000000000002]
[null,"AGETOP_I",8,"AJUDANTE","h     ",3.3300000000000003E-2,8.1999999999999993,9.51,0.27,0.32]
[null,"AGETOP_I",12,"ELETRICISTA","h     ",3.3300000000000003E-2,13.4,15.53,0.45,0.52]
[null,null,null,"","",null,0,0,0,0]
[null,"MÃO DE OBRA (B) - TOTAL",null,null,null,null,null,null,0.72,0.84000000000000008]
[null,"COTAÇÃO","COT 010_SEE","CAPUZ PARA PROTEÇÃO DOS PARA RAIOS","UN ",1,15.81,15.81,15.81,15.81]
[null,null,null,"","",null,0,0,0,0]
[null,null,null,"","",null,0,0,0,0]
[null,"MATERIAL (C) - TOTAL",null,null,null,null,null,null,15.81,15.81]
[]
[47,"FONTE","CÓDIGO","DESCRIÇÃO","UNIDADE","COEFIC.","CUSTO UNITÁRIO",null,"CUSTO  TOTAL (A) + (B) + (C) + (D) + (E)"]
[null,null,null,null,null,null,"DESONERADO","NÃO DESONER.","DESONERADO","NÃO DESONER."]
[null,"COMPOSIÇÃO","COMP 047_SEE","CAPUZ DE PROTEÇÃO PARA BUCHA DE TRANSFORMADOR","UN ",null,null,null,16.53,16.650000000000002]
[null,"AGETOP_I",8,"AJUDANTE","h     ",3.3300000000000003E-2,8.1999999999999993,9.51,0.27,0.32]
[null,"AGETOP_I",12,"ELETRICISTA","h     ",3.3300000000000003E-2,13.4,15.53,0.45,0.52]
[null,null,null,"","",null,0,0,0,0]
[null,"MÃO DE OBRA (B) - TOTAL",null,null,null,null,null,null,0.72,0.84000000000000008]
[null,"COTAÇÃO","COT 011_SEE","CAPUZ DE PROTEÇÃO PARA BUCHA DE TRANSFORMADOR","UN ",1,15.81,15.81,15.81,15.81]
[null,null,null,"","",null,0,0,0,0]
[null,null,null,"","",null,0,0,0,0]
[null,"MATERIAL (C) - TOTAL",null,null,null,null,null,null,15.81,15.81]
[]
[48,"FONTE","CÓDIGO","DESCRIÇÃO","UNIDADE","COEFIC.","CUSTO UNITÁRIO",null,"CUSTO  TOTAL (A) + (B) + (C) + (D) + (E)"]
[null,null,null,null,null,null,"DESONERADO","NÃO DESONER.","DESONERADO","NÃO DESONER."]
[null,"COMPOSIÇÃO","COMP 048_SEE","HASTE ROSQUEADA \"TIRANTE\" 3/8\"","M",null,null,null,14.02,15.39]
[null,"AGETOP_I",8,"AJUDANTE","h     ",0.4,8.1999999999999993,9.51,3.28,3.8]
[null,"AGETOP_I",12,"ELETRICISTA","h     ",0.4,13.4,15.53,5.36,6.21]
[null,null,null,"","",null,0,0,0,0]
[null,"MÃO DE OBRA (B) - TOTAL",null,null,null,null,null,null,8.64,10.01]
[null,"COTAÇÃO","COT 012_SEE","HASTE ROSQUEADA \"TIRANTE\" 3/8\"","M",1,5.3833333333333329,5.3833333333333329,5.38,5.38]
[null,null,null,"","",null,0,0,0,0]
[null,null,null,"","",null,0,0,0,0]
[null,"MATERIAL (C) - TOTAL",null,null,null,null,null,null,5.38,5.38]
[]
[49,"FONTE","CÓDIGO","DESCRIÇÃO","UNIDADE","COEFIC.","CUSTO UNITÁRIO",null,"CUSTO  TOTAL (A) + (B) + (C) + (D) + (E)"]
[null,null,null,null,null,null,"DESONERADO","NÃO DESONER.","DESONERADO","NÃO DESONER."]
[null,"COMPOSIÇÃO","COMP 049_SEE","PORCA SEXTAVADA 3/8\"","UN ",null,null,null,0.2,0.22]
[null,"AGETOP_I",8,"AJUDANTE","h     ",8.9999999999999993E-3,8.1999999999999993,9.51,7.0000000000000007E-2,0.09]
[null,null,null,"","",null,0,0,0,0]
[null,null,null,"","",null,0,0,0,0]
[null,"MÃO DE OBRA (B) - TOTAL",null,null,null,null,null,null,7.0000000000000007E-2,0.09]
[null,"COTAÇÃO","COT 013_SEE","PORCA SEXTAVADA 3/8\"","UN ",1,0.13,0.13,0.13,0.13]
[null,null,null,"","",null,0,0,0,0]
[null,null,null,"","",null,0,0,0,0]
[null,"MATERIAL (C) - TOTAL",null,null,null,null,null,null,0.13,0.13]
[]
[28,"FONTE","CÓDIGO","DESCRIÇÃO","UNIDADE","COEFIC.","CUSTO UNITÁRIO",null,"CUSTO  TOTAL (A) + (B) + (C) + (D) + (E)"]
[null,null,null,null,null,null,"DESONERADO","NÃO DESONER.","DESONERADO","NÃO DESONER."]
[null,"COMPOSIÇÃO","COMP 028_SEE","ADAPTADOR PVC SOLDAVEL FLANGES LIVRES P/ CAIXA D' AGUA 85 MM X 3\"","UN ",null,null,null,167.30999999999997,167.61999999999998]
[null,"AGETOP_I",8,"AJUDANTE","h     ",0.09,8.1999999999999993,9.51,0.74,0.86]
[null,"AGETOP_I",11,"ENCANADOR","h     ",0.09,13.4,15.53,1.21,1.4]
[null,"MÃO DE OBRA (B) - TOTAL",null,null,null,null,null,null,1.95,2.2599999999999998]
[null,"AGETOP_I","H689","FITA VEDAROSCA 12 MM","m",4.5,0.28000000000000003,0.28000000000000003,1.26,1.26]
[null,"SINAPI_I",74,"ADAPTADOR PVC SOLDAVEL, COM FLANGES LIVRES, 85 MM X 3\", PARA CAIXA D' AGUA                                                                                                                                                                                                                                                                                                                                                                                                                                ","UN    ",1,164.1,164.1,164.1,164.1]
[null,"MATERIAL (C) - TOTAL",null,null,null,null,null,null,165.35999999999999,165.35999999999999]
[]
[557,"FONTE","CÓDIGO","DESCRIÇÃO","UNID ","COEFIC.","CUSTO UNITÁRIO",null,"CUSTO  TOTAL (A) + (B) + (C) + (D) + (E)"]
[null,null,null,null,null,null,"DESONERADO","NÃO DESONER.","DESONERADO","NÃO DESONER."]
[null,"COMPOSIÇÃO","COMP 557_SEE","BOMBA THSI-18 10,0 CV TRIFÁSICA","UN ","-","-","-",5193.7300000000005,5221.25]
[null,"AGETOP_I",8,"AJUDANTE","h     ",8,8.1999999999999993,9.51,65.599999999999994,76.08]
[null,"AGETOP_I",12,"ELETRICISTA","h     ",8,13.4,15.53,107.2,124.24]
[null,null,null,"","",null,0,0,0,0]
[null,"MÃO DE OBRA (B) - TOTAL",null,null,null,null,null,null,172.8,200.32]
[null,"COTAÇÃO","COT 302_SEE","BOMBA THSI-18 10,0 CV TRIFÁSICA","UN ",1,5020.9250000000002,5020.9250000000002,5020.93,5020.93]
[null,null,null,"","",null,0,0,0,0]
[null,null,null,"","",null,0,0,0,0]
[null,"MATERIAL (C) - TOTAL",null,null,null,null,null,null,5020.93,5020.93]
[]
[194,"FONTE","CÓDIGO","DESCRIÇÃO","UNIDADE","COEFIC.","CUSTO UNITÁRIO",null,"CUSTO  TOTAL (A) + (B) + (C) + (D) + (E)"]
[null,null,null,null,null,null,"DESONERADO","NÃO DESONER.","DESONERADO","NÃO DESONER."]
[null,"COMPOSIÇÃO","COMP 194_SEE","TAMPÃO CEGO COM CORRENTE 1.1/2\"","UN ",null,null,null,54.32,54.64]
[null,"AGETOP_I",11,"ENCANADOR","h     ",0.15,13.4,15.53,2.0099999999999998,2.33]
[null,null,null,"","",null,0,0,0,0]
[null,null,null,"","",null,0,0,0,0]
[null,"MÃO DE OBRA (B) - TOTAL",null,null,null,null,null,null,2.0099999999999998,2.33]
[null,"SINAPI_I",20964,"TAMPAO COM CORRENTE, EM LATAO, ENGATE RAPIDO 1 1/2\", PARA INSTALACAO PREDIAL DE COMBATE A INCENDIO                                                                                                                                                                                                                                                                                                                                                                                                        ","UN    ",1,52.31,52.31,52.31,52.31]
[null,null,null,"","",null,0,0,0,0]
[null,null,null,"","",null,0,0,0,0]
[null,"MATERIAL (C) - TOTAL",null,null,null,null,null,null,52.31,52.31]
[]
[17,"FONTE","CÓDIGO","DESCRIÇÃO","UNIDADE","COEFIC.","CUSTO UNITÁRIO",null,"CUSTO  TOTAL (A) + (B) + (C) + (D) + (E)"]
[null,null,null,null,null,null,"DESONERADO","NÃO DESONER.","DESONERADO","NÃO DESONER."]
[null,"COMPOSIÇÃO","COMP 017_SEE","REDUCAO GIRATÓRIA TIPO STORZ LATAO P/ INST. PREDIAL COMBATE A INCENDIO ENGATE RAPIDO 2.1/2\" X 1.1/2\"","UN ",null,"-","-",99.14,99.69]
[null,"AGETOP_I",8,"AJUDANTE","h     ",0.16,8.1999999999999993,9.51,1.31,1.52]
[null,"AGETOP_I",11,"ENCANADOR","h     ",0.16,13.4,15.53,2.14,2.48]
[null,null,null,"","",null,0,0,0,0]
[null,"MÃO DE OBRA (B) - TOTAL",null,null,null,null,null,null,3.45,4]
[null,"SINAPI_I",20972,"REDUCAO FIXA TIPO STORZ, ENGATE RAPIDO 2.1/2\" X 1.1/2\", EM LATAO, PARA INSTALACAO PREDIAL COMBATE A INCENDIO PREDIAL                                                                                                                                                                                                                                                                                                                                                                                      ","UN    ",1,95.69,95.69,95.69,95.69]
[null,null,null,"","",null,0,0,0,0]
[null,null,null,"","",null,0,0,0,0]
[null,"MATERIAL (C) - TOTAL",null,null,null,null,null,null,95.69,95.69]
[]
[18,"FONTE","CÓDIGO","DESCRIÇÃO","UNIDADE","COEFIC.","CUSTO UNITÁRIO",null,"CUSTO  TOTAL (A) + (B) + (C) + (D) + (E)"]
[null,null,null,null,null,null,"DESONERADO","NÃO DESONER.","DESONERADO","NÃO DESONER."]
[null,"COMPOSIÇÃO","COMP 018_SEE","CHAVE DUPLA P/ CONEXÕES TIPO STORZ EM LATÃO ENGATE RÁPIDO 1 1/2\" X 2 1/2\"","UN ",null,"-","-",14.76,15.08]
[null,"AGETOP_I",11,"ENCANADOR","h     ",0.15,13.4,15.53,2.0099999999999998,2.33]
[null,null,null,"","",null,0,0,0,0]
[null,null,null,"","",null,0,0,0,0]
[null,"MÃO DE OBRA (B) - TOTAL",null,null,null,null,null,null,2.0099999999999998,2.33]
[null,"SINAPI_I",20971,"CHAVE DUPLA PARA CONEXOES TIPO STORZ, ENGATE RAPIDO 1 1/2\" X 2 1/2\", EM LATAO, PARA INSTALACAO PREDIAL COMBATE A INCENDIO                                                                                                                                                                                                                                                                                                                                                                                 ","UN    ",1,12.75,12.75,12.75,12.75]
[null,null,null,"","",null,0,0,0,0]
[null,null,null,"","",null,0,0,0,0]
[null,"MATERIAL (C) - TOTAL",null,null,null,null,null,null,12.75,12.75]
[]
[87,"FONTE","CÓDIGO","DESCRIÇÃO","UNIDADE","COEFIC.","CUSTO UNITÁRIO",null,"CUSTO  TOTAL (A) + (B) + (C) + (D) + (E)"]
[null,null,null,null,null,null,"DESONERADO","NÃO DESONER.","DESONERADO","NÃO DESONER."]
[null,"COMPOSIÇÃO","COMP 087_SEE","REGISTRO DE GAVETA COM HASTE ASCENDENTE DE BRONZE 2 1/2\"","UN ",null,null,null,257.29999999999995,261.26]
[null,"AGETOP_I",8,"AJUDANTE","h     ",1.1499999999999999,8.1999999999999993,9.51,9.43,10.94]
[null,"AGETOP_I",11,"ENCANADOR","h     ",1.1499999999999999,13.4,15.53,15.41,17.86]
[null,null,null,"","",null,0,0,0,0]
[null,"MÃO DE OBRA (B) - TOTAL",null,null,null,null,null,null,24.84,28.799999999999997]
[null,"AGETOP_I","H689","FITA VEDAROSCA 12 MM","m",2.82,0.28000000000000003,0.28000000000000003,0.79,0.79]
[null,"COTAÇÃO","COT 017_SEE","REGISTRO DE GAVETA COM HASTE ASCENDENTE DE BRONZE 2 1/2\"","UN ",1,231.66666666666666,231.66666666666666,231.67,231.67]
[null,null,null,"","",null,0,0,0,0]
[null,"MATERIAL (C) - TOTAL",null,null,null,null,null,null,232.45999999999998,232.45999999999998]
[]
[19,"FONTE","CÓDIGO","DESCRIÇÃO","UNIDADE","COEFIC.","CUSTO UNITÁRIO",null,"CUSTO  TOTAL (A) + (B) + (C) + (D) + (E)"]
[null,null,null,null,null,null,"DESONERADO","NÃO DESONER.","DESONERADO","NÃO DESONER."]
[null,"COMPOSIÇÃO","COMP 019_SEE","TAMPÃO LATAO C/ CORRENTE P/ INSTALAÇÃO PREDIAL COMBATE A INCÊNDIO ENGATE RÁPIDO 1 1/2\"","UN ",null,"-","-",55.550000000000004,56.07]
[null,"AGETOP_I",11,"ENCANADOR","h     ",0.15,13.4,15.53,2.0099999999999998,2.33]
[null,"AGETOP_I",8,"AJUDANTE","h     ",0.15,8.1999999999999993,9.51,1.23,1.43]
[null,null,null,"","",null,0,0,0,0]
[null,"MÃO DE OBRA (B) - TOTAL",null,null,null,null,null,null,3.2399999999999998,3.76]
[null,"SINAPI_I",20964,"TAMPAO COM CORRENTE, EM LATAO, ENGATE RAPIDO 1 1/2\", PARA INSTALACAO PREDIAL DE COMBATE A INCENDIO                                                                                                                                                                                                                                                                                                                                                                                                        ","UN    ",1,52.31,52.31,52.31,52.31]
[null,null,null,"","",null,0,0,0,0]
[null,null,null,"","",null,0,0,0,0]
[null,"MATERIAL (C) - TOTAL",null,null,null,null,null,null,52.31,52.31]
[]
[30,"FONTE","CÓDIGO","DESCRIÇÃO","UNIDADE","COEFIC.","CUSTO UNITÁRIO",null,"CUSTO  TOTAL (A) + (B) + (C) + (D) + (E)"]
[null,null,null,null,null,null,"DESONERADO","NÃO DESONER.","DESONERADO","NÃO DESONER."]
[null,"COMPOSIÇÃO","COMP 030_SEE","COTOVELO DE FERRO GALV. 90° X 2 1/2\"","UN ",null,null,null,69.16,72.33]
[null,"AGETOP_I",8,"AJUDANTE","h     ",0.92,8.1999999999999993,9.51,7.54,8.75]
[null,"AGETOP_I",11,"ENCANADOR","h     ",0.92,13.4,15.53,12.33,14.29]
[null,"MÃO DE OBRA (B) - TOTAL",null,null,null,null,null,null,19.87,23.04]
[null,"SINAPI_I",3470,"COTOVELO 90 GRAUS DE FERRO GALVANIZADO, COM ROSCA BSP, DE 2 1/2\"                                                                                                                                                                                                                                                                                                                                                                                                                                          ","UN    ",1,48.73,48.73,48.73,48.73]
[null,"AGETOP_I","H689","FITA VEDAROSCA 12 MM","m",2,0.28000000000000003,0.28000000000000003,0.56000000000000005,0.56000000000000005]
[null,"MATERIAL (C) - TOTAL",null,null,null,null,null,null,49.29,49.29]
[]
[76,"FONTE","CÓDIGO","DESCRIÇÃO","UNIDADE","COEFIC.","CUSTO UNITÁRIO",null,"CUSTO  TOTAL (A) + (B) + (C) + (D) + (E)"]
[null,null,null,null,null,null,"DESONERADO","NÃO DESONER.","DESONERADO","NÃO DESONER."]
[null,"COMPOSIÇÃO","COMP 076_SEE","CURVA FERRO GALVANIZADO 45G ROSCA MACHO/FEMEA REF. 2 1/2\"","UN ",null,null,null,116.73,119.9]
[null,"AGETOP_I",8,"AJUDANTE","h     ",0.92,8.1999999999999993,9.51,7.54,8.75]
[null,"AGETOP_I",11,"ENCANADOR","h     ",0.92,13.4,15.53,12.33,14.29]
[null,"MÃO DE OBRA (B) - TOTAL",null,null,null,null,null,null,19.87,23.04]
[null,"SINAPI_I",3148,"FITA VEDA ROSCA EM ROLOS DE 18 MM X 50 M (L X C)                                                                                                                                                                                                                                                                                                                                                                                                                                                          ","UN    ",4.9099999999999998E-2,14.38,14.38,0.71,0.71]
[null,"SINAPI_I",1784,"CURVA 45 GRAUS DE FERRO GALVANIZADO, COM ROSCA BSP MACHO/FEMEA, DE 2 1/2\"                                                                                                                                                                                                                                                                                                                                                                                                                                 ","UN    ",1,96.15,96.15,96.15,96.15]
[null,"MATERIAL (C) - TOTAL",null,null,null,null,null,null,96.86,96.86]
[]
[77,"FONTE","CÓDIGO","DESCRIÇÃO","UNIDADE","COEFIC.","CUSTO UNITÁRIO",null,"CUSTO  TOTAL (A) + (B) + (C) + (D) + (E)"]
[null,null,null,null,null,null,"DESONERADO","NÃO DESONER.","DESONERADO","NÃO DESONER."]
[null,"COMPOSIÇÃO","COMP 077_SEE","UNIAO FERRO GALV C/ASSENTO CONICO BRONZE 2 1/2\"","UN ",null,null,null,148.30000000000001,149.66999999999999]
[null,"AGETOP_I",8,"AJUDANTE","h     ",0.4,8.1999999999999993,9.51,3.28,3.8]
[null,"AGETOP_I",11,"ENCANADOR","h     ",0.4,13.4,15.53,5.36,6.21]
[null,"MÃO DE OBRA (B) - TOTAL",null,null,null,null,null,null,8.64,10.01]
[null,"AGETOP_I","H689","FITA VEDAROSCA 12 MM","m",2.4,0.28000000000000003,0.28000000000000003,0.67,0.67]
[null,"SINAPI_I",12427,"UNIAO COM ASSENTO CONICO DE BRONZE, DIAMETRO 2 1/2\"                                                                                                                                                                                                                                                                                                                                                                                                                                                       ","UN    ",1,138.99,138.99,138.99,138.99]
[null,"MATERIAL (C) - TOTAL",null,null,null,null,null,null,139.66,139.66]
[]
[347,"FONTE","CÓDIGO","DESCRIÇÃO","UNIDADE","COEFIC.","CUSTO UNITÁRIO",null,"CUSTO  TOTAL (A) + (B) + (C) + (D) + (E)"]
[null,null,null,null,null,null,"DESONERADO","NÃO DESONER.","DESONERADO","NÃO DESONER."]
[null,"COMPOSIÇÃO","COMP 347_SEE","ADAPTADOR PVC SOLDAVEL, COM FLANGES LIVRES, 75 MM X 2 1/2\", PARA CAIXA D' AGUA","UN ",null,null,null,121.10000000000001,121.57000000000001]
[null,"AGETOP_I",11,"ENCANADOR","h     ",0.14000000000000001,13.4,15.53,1.88,2.17]
[null,"AGETOP_I",8,"AJUDANTE","h     ",0.14000000000000001,8.1999999999999993,9.51,1.1499999999999999,1.33]
[null,null,null,"","",null,0,0,0,0]
[null,"MÃO DE OBRA (B) - TOTAL",null,null,null,null,null,null,3.03,3.5]
[null,"SINAPI_I",83,"ADAPTADOR PVC SOLDAVEL, COM FLANGES LIVRES, 75 MM X 2  1/2\", PARA CAIXA D' AGUA                                                                                                                                                                                                                                                                                                                                                                                                                           ","UN    ",1,117.54,117.54,117.54,117.54]
[null,"AGETOP_I","H689","FITA VEDAROSCA 12 MM","m",1.88,0.28000000000000003,0.28000000000000003,0.53,0.53]
[null,null,null,"","",null,0,0,0,0]
[null,"MATERIAL (C) - TOTAL",null,null,null,null,null,null,118.07000000000001,118.07000000000001]
[]
[22,"FONTE","CÓDIGO","DESCRIÇÃO","UNIDADE","COEFIC.","CUSTO UNITÁRIO",null,"CUSTO  TOTAL (A) + (B) + (C) + (D) + (E)"]
[null,null,null,null,null,null,"DESONERADO","NÃO DESONER.","DESONERADO","NÃO DESONER."]
[null,"COMPOSIÇÃO","COMP 022_SEE","TAMPÃO FOFO 40X50CM C/INSCRIÇÃO ","UN ",null,"-","-",199.82999999999998,200.15]
[null,"AGETOP_I",11,"ENCANADOR","h     ",0.15,13.4,15.53,2.0099999999999998,2.33]
[null,null,null,"","",null,0,0,0,0]
[null,null,null,"","",null,0,0,0,0]
[null,"MÃO DE OBRA (B) - TOTAL",null,null,null,null,null,null,2.0099999999999998,2.33]
[null,"SINAPI_I",11293,"TAMPAO FOFO SIMPLES COM BASE, CLASSE A15 CARGA MAX 1,5 T, 400 X 500 MM, COM INSCRICAO INCENDIO                                                                                                                                                                                                                                                                                                                                                                                                            ","UN    ",1,197.82,197.82,197.82,197.82]
[null,null,null,"","",null,0,0,0,0]
[null,null,null,"","",null,0,0,0,0]
[null,"MATERIAL (C) - TOTAL",null,null,null,null,null,null,197.82,197.82]
[]
[546,"FONTE","CÓDIGO","DESCRIÇÃO","UNID ","COEFIC.","CUSTO UNITÁRIO",null,"CUSTO  TOTAL (A) + (B) + (C) + (D) + (E)"]
[null,null,null,null,null,null,"DESONERADO","NÃO DESONER.","DESONERADO","NÃO DESONER."]
[null,"COMPOSIÇÃO","COMP 546_SEE","BUJÃO DE REBORDO 2.1/2\"","UN ","-","-","-",16.509999999999998,16.760000000000002]
[null,"AGETOP_I",8,"AJUDANTE","h     ",7.0000000000000007E-2,8.1999999999999993,9.51,0.56999999999999995,0.67]
[null,"AGETOP_I",11,"ENCANADOR","h     ",7.0000000000000007E-2,13.4,15.53,0.94,1.0900000000000001]
[null,null,null,"","",null,0,0,0,0]
[null,"MÃO DE OBRA (B) - TOTAL",null,null,null,null,null,null,1.5099999999999998,1.7600000000000002]
[null,"COTAÇÃO","COT 286_SEE","BUJÃO DE REBORDO 2.1/2\"","UN ",1,15,15,15,15]
[null,null,null,"","",null,0,0,0,0]
[null,null,null,"","",null,0,0,0,0]
[null,"MATERIAL (C) - TOTAL",null,null,null,null,null,null,15,15]
[]
[24,"FONTE","CÓDIGO","DESCRIÇÃO","UNIDADE","COEFIC.","CUSTO UNITÁRIO",null,"CUSTO  TOTAL (A) + (B) + (C) + (D) + (E)"]
[null,null,null,null,null,null,"DESONERADO","NÃO DESONER.","DESONERADO","NÃO DESONER."]
[null,"COMPOSIÇÃO","COMP 024_SEE","SINALIZADOR FOTOLUMINESCENTE PARA EXTINTOR","UN ",null,"-","-",24.109999999999996,24.229999999999997]
[null,"AGETOP_I",5,"SERVENTE","h     ",0.09,8.1999999999999993,9.51,0.74,0.86]
[null,null,null,"","",null,0,0,0,0]
[null,null,null,"","",null,0,0,0,0]
[null,"MÃO DE OBRA (B) - TOTAL",null,null,null,null,null,null,0.74,0.86]
[null,"AGETOP_I",3070,"BUCHA DE NYLON S-6","un",2,0.04,0.04,0.08,0.08]
[null,"AGETOP_I",3393,"PARAFUSO P/BUCHA S-6","un",2,0.08,0.08,0.16,0.16]
[null,"SINAPI_I",37556,"PLACA DE SINALIZACAO DE SEGURANCA CONTRA INCENDIO, FOTOLUMINESCENTE, QUADRADA, *20 X 20* CM, EM PVC *2* MM ANTI-CHAMAS (SIMBOLOS, CORES E PICTOGRAMAS CONFORME NBR 13434)                                                                                                                                                                                                                                                                                                                                 ","UN    ",1,23.13,23.13,23.13,23.13]
[null,"MATERIAL (C) - TOTAL",null,null,null,null,null,null,23.369999999999997,23.369999999999997]
[]
[186,"FONTE","CÓDIGO","DESCRIÇÃO","UNIDADE","COEFIC.","CUSTO UNITÁRIO",null,"CUSTO  TOTAL (A) + (B) + (C) + (D) + (E)"]
[null,null,null,null,null,null,"DESONERADO","NÃO DESONER.","DESONERADO","NÃO DESONER."]
[null,"COMPOSIÇÃO","COMP 186_SEE","BOTOEIRA BOMBA DE INCÊNDIO C/ MARTELO CONVENCIONAL/ ANALÓGICA","UN ",null,null,null,85.1,88.539999999999992]
[null,"AGETOP_I",8,"AJUDANTE","h     ",1,8.1999999999999993,9.51,8.1999999999999993,9.51]
[null,"AGETOP_I",12,"ELETRICISTA","h     ",1,13.4,15.53,13.4,15.53]
[null,null,null,"","",null,0,0,0,0]
[null,"MÃO DE OBRA (B) - TOTAL",null,null,null,null,null,null,21.6,25.04]
[null,"COTAÇÃO","COT 088_SEE","BOTOEIRA BOMBA DE INCÊNDIO C/ MARTELO CONVENCIONAL/ ANALÓGICA","UN",1,63.5,63.5,63.5,63.5]
[null,null,null,"","",null,0,0,0,0]
[null,null,null,"","",null,0,0,0,0]
[null,"MATERIAL (C) - TOTAL",null,null,null,null,null,null,63.5,63.5]
[]
[188,"FONTE","CÓDIGO","DESCRIÇÃO","UNIDADE","COEFIC.","CUSTO UNITÁRIO",null,"CUSTO  TOTAL (A) + (B) + (C) + (D) + (E)"]
[null,null,null,null,null,null,"DESONERADO","NÃO DESONER.","DESONERADO","NÃO DESONER."]
[null,"COMPOSIÇÃO","COMP 188_SEE","ACIONADOR MANUAL DE ALARME","UN ",null,null,null,100.61,103.36]
[null,"AGETOP_I",8,"AJUDANTE","h     ",0.8,8.1999999999999993,9.51,6.56,7.61]
[null,"AGETOP_I",12,"ELETRICISTA","h     ",0.8,13.4,15.53,10.72,12.42]
[null,null,null,"","",null,0,0,0,0]
[null,"MÃO DE OBRA (B) - TOTAL",null,null,null,null,null,null,17.28,20.03]
[null,"COTAÇÃO","COT 090_SEE","ACIONADOR MANUAL DE ALARME","UN",1,83.333333333333329,83.333333333333329,83.33,83.33]
[null,null,null,"","",null,0,0,0,0]
[null,null,null,"","",null,0,0,0,0]
[null,"MATERIAL (C) - TOTAL",null,null,null,null,null,null,83.33,83.33]
[]
[190,"FONTE","CÓDIGO","DESCRIÇÃO","UNIDADE","COEFIC.","CUSTO UNITÁRIO",null,"CUSTO  TOTAL (A) + (B) + (C) + (D) + (E)"]
[null,null,null,null,null,null,"DESONERADO","NÃO DESONER.","DESONERADO","NÃO DESONER."]
[null,"COMPOSIÇÃO","COMP 190_SEE","CENTRAL DE DETECÇÃO E ALARME DE 40 SETORES COM BATERIA","UN ",null,null,null,1136.1300000000001,1163.6500000000001]
[null,"AGETOP_I",8,"AJUDANTE","h     ",8,8.1999999999999993,9.51,65.599999999999994,76.08]
[null,"AGETOP_I",12,"ELETRICISTA","h     ",8,13.4,15.53,107.2,124.24]
[null,null,null,"","",null,0,0,0,0]
[null,"MÃO DE OBRA (B) - TOTAL",null,null,null,null,null,null,172.8,200.32]
[null,"COTAÇÃO","COT 092_SEE","CENTRAL DE DETECÇÃO E ALARME DE 40 SETORES COM BATERIA (PREÇO MÉDIO)","UN",1,963.33333333333337,963.33333333333337,963.33,963.33]
[null,null,null,"","",null,0,0,0,0]
[null,null,null,"","",null,0,0,0,0]
[null,"MATERIAL (C) - TOTAL",null,null,null,null,null,null,963.33,963.33]
[]
[25,"FONTE","CÓDIGO","DESCRIÇÃO","UNIDADE","COEFIC.","CUSTO UNITÁRIO",null,"CUSTO  TOTAL (A) + (B) + (C) + (D) + (E)"]
[null,null,null,null,null,null,"DESONERADO","NÃO DESONER.","DESONERADO","NÃO DESONER."]
[null,"COMPOSIÇÃO","COMP 025_SEE","SINALIZADOR FOTOLUMINESCENTE DE EMERGÊNCIA","UN ",null,"-","-",24.109999999999996,24.229999999999997]
[null,"AGETOP_I",5,"SERVENTE","h     ",0.09,8.1999999999999993,9.51,0.74,0.86]
[null,"MÃO DE OBRA (B) - TOTAL",null,null,null,null,null,null,0.74,0.86]
[null,"AGETOP_I",3070,"BUCHA DE NYLON S-6","un",2,0.04,0.04,0.08,0.08]
[null,"AGETOP_I",3393,"PARAFUSO P/BUCHA S-6","un",2,0.08,0.08,0.16,0.16]
[null,"SINAPI_I",37556,"PLACA DE SINALIZACAO DE SEGURANCA CONTRA INCENDIO, FOTOLUMINESCENTE, QUADRADA, *20 X 20* CM, EM PVC *2* MM ANTI-CHAMAS (SIMBOLOS, CORES E PICTOGRAMAS CONFORME NBR 13434)                                                                                                                                                                                                                                                                                                                                 ","UN    ",1,23.13,23.13,23.13,23.13]
[null,"MATERIAL (C) - TOTAL",null,null,null,null,null,null,23.369999999999997,23.369999999999997]
[]
[277,"FONTE","CÓDIGO","DESCRIÇÃO","UNIDADE","COEFIC.","CUSTO UNITÁRIO",null,"CUSTO  TOTAL (A) + (B) + (C) + (D) + (E)"]
[null,null,null,null,null,null,"DESONERADO","NÃO DESONER.","DESONERADO","NÃO DESONER."]
[null,"COMPOSIÇÃO","COMP 277_SEE","MARCAÇÃO NO PISO - 1X1 M PARA EXTINTOR","M2",null,null,null,28.81,28.88]
[null,"AGETOP_I",5,"SERVENTE","h     ",3.3300000000000003E-2,8.1999999999999993,9.51,0.27,0.32]
[null,null,null,"","",null,0,0,0,0]
[null,null,null,"","",null,0,0,0,0]
[null,"MÃO DE OBRA (B) - TOTAL",null,null,null,null,null,null,0.27,0.32]
[null,"SINAPI_I",5318,"SOLVENTE DILUENTE A BASE DE AGUARRAS                                                                                                                                                                                                                                                                                                                                                                                                                                                                      ","L     ",0.13,11.78,11.78,1.53,1.53]
[null,"SINAPI",5824,"CAMINHÃO TOCO, PBT 16.000 KG, CARGA ÚTIL MÁX. 10.685 KG, DIST. ENTRE EIXOS 4,8 M, POTÊNCIA 189 CV, INCLUSIVE CARROCERIA FIXA ABERTA DE MADEIRA P/ TRANSPORTE GERAL DE CARGA SECA, DIMEN. APROX. 2,5 X 7,00 X 0,50 M - CHP DIURNO. AF_06/2014","CHP",3.3E-3,135.91,139.12,0.45,0.46]
[null,"SINAPI_I",7343,"TINTA A BASE DE RESINA ACRILICA, PARA SINALIZACAO HORIZONTAL VIARIA (NBR 11862)                                                                                                                                                                                                                                                                                                                                                                                                                           ","L     ",0.6,11.38,11.38,6.83,6.83]
[null,"SINAPI_I",7348,"TINTA ACRILICA PREMIUM PARA PISO                                                                                                                                                                                                                                                                                                                                                                                                                                                                          ","L     ",0.03,12.4,12.4,0.37,0.37]
[null,"SINAPI_I",25972,"MICROESFERAS DE VIDRO PARA SINALIZACAO HORIZONTAL VIARIA, TIPO I-B (PREMIX) - NBR 16184                                                                                                                                                                                                                                                                                                                                                                                                                   ","KG    ",2.14,8.8800000000000008,8.8800000000000008,19,19]
[null,"SINAPI",95133,"MÁQUINA DEMARCADORA DE FAIXA DE TRÁFEGO À FRIO, AUTOPROPELIDA, POTÊNCIA 38 HP - CHP DIURNO. AF_07/2016","CHP",3.3E-3,109.81,113.39,0.36,0.37]
[null,"MATERIAL (C) - TOTAL",null,null,null,null,null,null,28.54,28.56]
[]
[382,"FONTE","CÓDIGO","DESCRIÇÃO","UNIDADE","COEFIC.","CUSTO UNITÁRIO",null,"CUSTO  TOTAL (A) + (B) + (C) + (D) + (E)"]
[null,null,null,null,null,null,"DESONERADO","NÃO DESONER.","DESONERADO","NÃO DESONER."]
[null,"COMPOSIÇÃO","COMP 382_SEE","TE DE REDUCAO DE FERRO GALVANIZADO, COM ROSCA BSP, DE 3/4\" X 1/2\"","UN ",null,null,null,21.93,24.020000000000003]
[null,"AGETOP_I",8,"AJUDANTE","h     ",0.6,8.1999999999999993,9.51,4.92,5.71]
[null,"AGETOP_I",11,"ENCANADOR","h     ",0.61050000000000004,13.4,15.53,8.18,9.48]
[null,null,null,"","",null,0,0,0,0]
[null,"MÃO DE OBRA (B) - TOTAL",null,null,null,null,null,null,13.1,15.190000000000001]
[null,"SINAPI_I",3146,"FITA VEDA ROSCA EM ROLOS DE 18 MM X 10 M (L X C)                                                                                                                                                                                                                                                                                                                                                                                                                                                          ","UN    ",0.12075471698113208,3.9,3.9,0.47,0.47]
[null,"SINAPI_I",6302,"TE DE REDUCAO DE FERRO GALVANIZADO, COM ROSCA BSP, DE 3/4\" X 1/2\"                                                                                                                                                                                                                                                                                                                                                                                                                                         ","UN    ",1,8.36,8.36,8.36,8.36]
[null,null,null,"","",null,0,0,0,0]
[null,"MATERIAL (C) - TOTAL",null,null,null,null,null,null,8.83,8.83]
[]
[383,"FONTE","CÓDIGO","DESCRIÇÃO","UNIDADE","COEFIC.","CUSTO UNITÁRIO",null,"CUSTO  TOTAL (A) + (B) + (C) + (D) + (E)"]
[null,null,null,null,null,null,"DESONERADO","NÃO DESONER.","DESONERADO","NÃO DESONER."]
[null,"COMPOSIÇÃO","COMP 383_SEE","BUCHA DE REDUCAO DE FERRO GALVANIZADO, COM ROSCA BSP, DE 1/2\" X 1/4\"","UN ",null,null,null,6.87,7.42]
[null,"AGETOP_I",8,"AJUDANTE","h     ",0.16,8.1999999999999993,9.51,1.31,1.52]
[null,"AGETOP_I",11,"ENCANADOR","h     ",0.16,13.4,15.53,2.14,2.48]
[null,null,null,"","",null,0,0,0,0]
[null,"MÃO DE OBRA (B) - TOTAL",null,null,null,null,null,null,3.45,4]
[null,"AGETOP_I","H689","FITA VEDAROSCA 12 MM","m",1.2,0.28000000000000003,0.28000000000000003,0.34,0.34]
[null,"SINAPI_I",770,"BUCHA DE REDUCAO DE FERRO GALVANIZADO, COM ROSCA BSP, DE 1/2\" X 1/4\"                                                                                                                                                                                                                                                                                                                                                                                                                                      ","UN    ",1,3.08,3.08,3.08,3.08]
[null,null,null,"","",null,0,0,0,0]
[null,"MATERIAL (C) - TOTAL",null,null,null,null,null,null,3.42,3.42]
[]
[212,"FONTE","CÓDIGO","DESCRIÇÃO","UNIDADE","COEFIC.","CUSTO UNITÁRIO",null,"CUSTO  TOTAL (A) + (B) + (C) + (D) + (E)"]
[null,null,null,null,null,null,"DESONERADO","NÃO DESONER.","DESONERADO","NÃO DESONER."]
[null,"COMPOSIÇÃO","COMP 212_SEE","NIPLE DE REDUÇÃO 1/2\" X 1/4\" BSP","UN ",null,null,null,9.5,10.050000000000001]
[null,"AGETOP_I",8,"AJUDANTE","h     ",0.16,8.1999999999999993,9.51,1.31,1.52]
[null,"AGETOP_I",11,"ENCANADOR","h     ",0.16,13.4,15.53,2.14,2.48]
[null,null,null,"","",null,0,0,0,0]
[null,"MÃO DE OBRA (B) - TOTAL",null,null,null,null,null,null,3.45,4]
[null,"COTAÇÃO","COT 103_SEE","NIPLE DE REDUÇÃO 1/2\" X 1/4\" BSP","UN",1,6.0533333333333337,6.0533333333333337,6.05,6.05]
[null,null,null,"","",null,0,0,0,0]
[null,null,null,"","",null,0,0,0,0]
[null,"MATERIAL (C) - TOTAL",null,null,null,null,null,null,6.05,6.05]
[]
[213,"FONTE","CÓDIGO","DESCRIÇÃO","UNIDADE","COEFIC.","CUSTO UNITÁRIO",null,"CUSTO  TOTAL (A) + (B) + (C) + (D) + (E)"]
[null,null,null,null,null,null,"DESONERADO","NÃO DESONER.","DESONERADO","NÃO DESONER."]
[null,"COMPOSIÇÃO","COMP 213_SEE","NIPLE DE REDUÇÃO 3/4\" X 1/2\" BSP","UN ",null,null,null,13.16,13.71]
[null,"AGETOP_I",8,"AJUDANTE","h     ",0.16,8.1999999999999993,9.51,1.31,1.52]
[null,"AGETOP_I",11,"ENCANADOR","h     ",0.16,13.4,15.53,2.14,2.48]
[null,null,null,"","",null,0,0,0,0]
[null,"MÃO DE OBRA (B) - TOTAL",null,null,null,null,null,null,3.45,4]
[null,"COTAÇÃO","COT 104_SEE","NIPLE DE REDUÇÃO 3/4\" X 1/2\" BSP","UN",1,9.7099999999999991,9.7099999999999991,9.7100000000000009,9.7100000000000009]
[null,null,null,"","",null,0,0,0,0]
[null,null,null,"","",null,0,0,0,0]
[null,"MATERIAL (C) - TOTAL",null,null,null,null,null,null,9.7100000000000009,9.7100000000000009]
[]
[237,"FONTE","CÓDIGO","DESCRIÇÃO","UNIDADE","COEFIC.","CUSTO UNITÁRIO",null,"CUSTO  TOTAL (A) + (B) + (C) + (D) + (E)"]
[null,null,null,null,null,null,"DESONERADO","NÃO DESONER.","DESONERADO","NÃO DESONER."]
[null,"COMPOSIÇÃO","COMP 237_SEE","FITA ANTICORROSIVA","M",null,null,null,11.92,12.61]
[null,"AGETOP_I",8,"AJUDANTE","h     ",0.2,8.1999999999999993,9.51,1.64,1.9]
[null,"AGETOP_I",12,"ELETRICISTA","h     ",0.2,13.4,15.53,2.68,3.11]
[null,null,null,"","",null,0,0,0,0]
[null,"MÃO DE OBRA (B) - TOTAL",null,null,null,null,null,null,4.32,5.01]
[null,"SINAPI_I",39634,"FITA ADESIVA ANTICORROSIVA DE PVC FLEXIVEL, COR PRETA, PARA PROTECAO TUBULACAO, 50 MM X 30 M (L X C), E= *0,25* MM                                                                                                                                                                                                                                                                                                                                                                                        ","M     ",1,7.6,7.6,7.6,7.6]
[null,null,null,"","",null,0,0,0,0]
[null,null,null,"","",null,0,0,0,0]
[null,"MATERIAL (C) - TOTAL",null,null,null,null,null,null,7.6,7.6]
[]
[542,"FONTE","CÓDIGO","DESCRIÇÃO","UNIDADE","COEFIC.","CUSTO UNITÁRIO",null,"CUSTO  TOTAL (A) + (B) + (C) + (D) + (E)"]
[null,null,null,null,null,null,"DESONERADO","NÃO DESONER.","DESONERADO","NÃO DESONER."]
[null,"COMPOSIÇÃO","COMP 542_SEE","VÁLVULA UGV 3/4\" (S) LATÃO","UN ",null,null,null,25.17,26.66]
[null,"AGETOP_I",8,"AJUDANTE","h     ",0.432,8.1999999999999993,9.51,3.54,4.1100000000000003]
[null,"AGETOP_I",11,"ENCANADOR","h     ",0.432,13.4,15.53,5.79,6.71]
[null,null,null,"","",null,0,0,0,0]
[null,"MÃO DE OBRA (B) - TOTAL",null,null,null,null,null,null,9.33,10.82]
[null,"COTAÇÃO","COT 281_SEE","VÁLVULA UGV 3/4\" (S) LATÃO","UN ",1,15.836666666666666,15.836666666666666,15.84,15.84]
[null,null,null,"","",null,0,0,0,0]
[null,null,null,"","",null,0,0,0,0]
[null,"MATERIAL (C) - TOTAL",null,null,null,null,null,null,15.84,15.84]
[]
[543,"FONTE","CÓDIGO","DESCRIÇÃO","UNIDADE","COEFIC.","CUSTO UNITÁRIO",null,"CUSTO  TOTAL (A) + (B) + (C) + (D) + (E)"]
[null,null,null,null,null,null,"DESONERADO","NÃO DESONER.","DESONERADO","NÃO DESONER."]
[null,"COMPOSIÇÃO","COMP 543_SEE","VÁLVULA UGV 1/2\" (S) LATÃO","UN ",null,null,null,24.5,25.990000000000002]
[null,"AGETOP_I",8,"AJUDANTE","h     ",0.432,8.1999999999999993,9.51,3.54,4.1100000000000003]
[null,"AGETOP_I",11,"ENCANADOR","h     ",0.432,13.4,15.53,5.79,6.71]
[null,null,null,"","",null,0,0,0,0]
[null,"MÃO DE OBRA (B) - TOTAL",null,null,null,null,null,null,9.33,10.82]
[null,"COTAÇÃO","COT 282_SEE","VÁLVULA UGV 1/2\" (S) LATÃO","UN ",1,15.166666666666666,15.166666666666666,15.17,15.17]
[null,null,null,"","",null,0,0,0,0]
[null,null,null,"","",null,0,0,0,0]
[null,"MATERIAL (C) - TOTAL",null,null,null,null,null,null,15.17,15.17]
[]
[211,"FONTE","CÓDIGO","DESCRIÇÃO","UNIDADE","COEFIC.","CUSTO UNITÁRIO",null,"CUSTO  TOTAL (A) + (B) + (C) + (D) + (E)"]
[null,null,null,null,null,null,"DESONERADO","NÃO DESONER.","DESONERADO","NÃO DESONER."]
[null,"COMPOSIÇÃO","COMP 211_SEE","REGULADOR DE 2º ESTÁGIO 5KG/H","UN ",null,null,null,85.46,89.419999999999987]
[null,"AGETOP_I",8,"AJUDANTE","h     ",1.1499999999999999,8.1999999999999993,9.51,9.43,10.94]
[null,"AGETOP_I",11,"ENCANADOR","h     ",1.1499999999999999,13.4,15.53,15.41,17.86]
[null,null,null,"","",null,0,0,0,0]
[null,"MÃO DE OBRA (B) - TOTAL",null,null,null,null,null,null,24.84,28.799999999999997]
[null,"COTAÇÃO","COT 102_SEE","REGULADOR DE 2º ESTÁGIO 5KG/H","UN",1,59.833333333333336,59.833333333333336,59.83,59.83]
[null,"AGETOP_I","H689","FITA VEDAROSCA 12 MM","m",2.82,0.28000000000000003,0.28000000000000003,0.79,0.79]
[null,null,null,"","",null,0,0,0,0]
[null,"MATERIAL (C) - TOTAL",null,null,null,null,null,null,60.62,60.62]
[]
[210,"FONTE","CÓDIGO","DESCRIÇÃO","UNIDADE","COEFIC.","CUSTO UNITÁRIO",null,"CUSTO  TOTAL (A) + (B) + (C) + (D) + (E)"]
[null,null,null,null,null,null,"DESONERADO","NÃO DESONER.","DESONERADO","NÃO DESONER."]
[null,"COMPOSIÇÃO","COMP 210_SEE","REGULADOR DE 1º ESTÁGIO 60KG/H MODELO AP-40  COM MANÔMETRO","UN ",null,null,null,231.21,235.17000000000002]
[null,"AGETOP_I",8,"AJUDANTE","h     ",1.1499999999999999,8.1999999999999993,9.51,9.43,10.94]
[null,"AGETOP_I",11,"ENCANADOR","h     ",1.1499999999999999,13.4,15.53,15.41,17.86]
[null,null,null,"","",null,0,0,0,0]
[null,"MÃO DE OBRA (B) - TOTAL",null,null,null,null,null,null,24.84,28.799999999999997]
[null,"COTAÇÃO","COT 101_SEE","REGULADOR DE 1º ESTÁGIO 60KG/H MODELO AP-40  COM MANÔMETRO","UN",1,205.57666666666668,205.57666666666668,205.58,205.58]
[null,"AGETOP_I","H689","FITA VEDAROSCA 12 MM","m",2.82,0.28000000000000003,0.28000000000000003,0.79,0.79]
[null,null,null,"","",null,0,0,0,0]
[null,"MATERIAL (C) - TOTAL",null,null,null,null,null,null,206.37,206.37]
[]
[235,"FONTE","CÓDIGO","DESCRIÇÃO","UNIDADE","COEFIC.","CUSTO UNITÁRIO",null,"CUSTO  TOTAL (A) + (B) + (C) + (D) + (E)"]
[null,null,null,null,null,null,"DESONERADO","NÃO DESONER.","DESONERADO","NÃO DESONER."]
[null,"COMPOSIÇÃO","COMP 235_SEE","PLACA DE SINALIZAÇÃO EM PVC COD 01 - (300X300) PROIBIDO FUMAR","UN ",null,null,null,24.109999999999996,24.229999999999997]
[null,"AGETOP_I",5,"SERVENTE","h     ",0.09,8.1999999999999993,9.51,0.74,0.86]
[null,null,null,"","",null,0,0,0,0]
[null,null,null,"","",null,0,0,0,0]
[null,"MÃO DE OBRA (B) - TOTAL",null,null,null,null,null,null,0.74,0.86]
[null,"AGETOP_I",3070,"BUCHA DE NYLON S-6","un",2,0.04,0.04,0.08,0.08]
[null,"AGETOP_I",3393,"PARAFUSO P/BUCHA S-6","un",2,0.08,0.08,0.16,0.16]
[null,"SINAPI_I",37556,"PLACA DE SINALIZACAO DE SEGURANCA CONTRA INCENDIO, FOTOLUMINESCENTE, QUADRADA, *20 X 20* CM, EM PVC *2* MM ANTI-CHAMAS (SIMBOLOS, CORES E PICTOGRAMAS CONFORME NBR 13434)                                                                                                                                                                                                                                                                                                                                 ","UN    ",1,23.13,23.13,23.13,23.13]
[null,"MATERIAL (C) - TOTAL",null,null,null,null,null,null,23.369999999999997,23.369999999999997]
[]
[236,"FONTE","CÓDIGO","DESCRIÇÃO","UNIDADE","COEFIC.","CUSTO UNITÁRIO",null,"CUSTO  TOTAL (A) + (B) + (C) + (D) + (E)"]
[null,null,null,null,null,null,"DESONERADO","NÃO DESONER.","DESONERADO","NÃO DESONER."]
[null,"COMPOSIÇÃO","COMP 236_SEE","PLACA DE SINALIZAÇÃO EM PVC COD 06 - (300X300) PERIGO INFLAMÁVEL","UN ",null,null,null,24.109999999999996,24.229999999999997]
[null,"AGETOP_I",5,"SERVENTE","h     ",0.09,8.1999999999999993,9.51,0.74,0.86]
[null,null,null,"","",null,0,0,0,0]
[null,null,null,"","",null,0,0,0,0]
[null,"MÃO DE OBRA (B) - TOTAL",null,null,null,null,null,null,0.74,0.86]
[null,"AGETOP_I",3070,"BUCHA DE NYLON S-6","un",2,0.04,0.04,0.08,0.08]
[null,"AGETOP_I",3393,"PARAFUSO P/BUCHA S-6","un",2,0.08,0.08,0.16,0.16]
[null,"SINAPI_I",37556,"PLACA DE SINALIZACAO DE SEGURANCA CONTRA INCENDIO, FOTOLUMINESCENTE, QUADRADA, *20 X 20* CM, EM PVC *2* MM ANTI-CHAMAS (SIMBOLOS, CORES E PICTOGRAMAS CONFORME NBR 13434)                                                                                                                                                                                                                                                                                                                                 ","UN    ",1,23.13,23.13,23.13,23.13]
[null,"MATERIAL (C) - TOTAL",null,null,null,null,null,null,23.369999999999997,23.369999999999997]
[]
[84,"FONTE","CÓDIGO","DESCRIÇÃO","UNIDADE","COEFIC.","CUSTO UNITÁRIO",null,"CUSTO  TOTAL (A) + (B) + (C) + (D) + (E)"]
[null,null,null,null,null,null,"DESONERADO","NÃO DESONER.","DESONERADO","NÃO DESONER."]
[null,"COMPOSIÇÃO","COMP 084_SEE","GUARDA-CORPO COM CORRIMÃO - SEDUC","M",null,null,null,204.60000000000002,209.46]
[null,"AGETOP_I",25,"OFICIAL \"B\"","h     ",1.1000000000000001,13.4,15.53,14.74,17.079999999999998]
[null,"AGETOP_I",8,"AJUDANTE","h     ",1.1000000000000001,8.1999999999999993,9.51,9.02,10.46]
[null,null,null,"","",null,0,0,0,0]
[null,"MÃO DE OBRA (B) - TOTAL",null,null,null,null,null,null,23.759999999999998,27.54]
[null,"AGETOP_I",2376,"TUBO INDUSTRIAL 2\" CHAPA 13 ","Kg",7.7778,5.23,5.23,40.68,40.68]
[null,"AGETOP_I",2504,"TUBO INDUSTRIAL D=25 MM CHAPA 13 ","Kg",4.6319999999999997,5.07,5.07,23.48,23.48]
[null,"AGETOP_I",2377,"TUBO INDUSTRIAL 40X40 CH.13","Kg",6.3419999999999996,5.07,5.07,32.15,32.15]
[null,"AGETOP_I",2421,"TUBO INDUSTRIAL 1.1/2\" CHAPA 13 ","Kg",1.4862,5.07,5.07,7.54,7.54]
[null,"AGETOP_I",2417,"MASSA PLASTICA","Kg",0.2041,10.58,10.58,2.16,2.16]
[null,"AGETOP_I",2246,"ELETRODO 2.5 OK","Kg",0.11459999999999999,8.6999999999999993,8.6999999999999993,1,1]
[null,"AGETOP_I",1672,"LIXA PARA FERRO ( NÚMERO 100 )","un",0.25509999999999999,2.12,2.12,0.54,0.54]
[null,"AGETOP_I",1264,"DISCO DE DESBASTE 7/8\" P/ CONC./FERRO (1/4\" X 7\")","un",5.0999999999999997E-2,7,7,0.36,0.36]
[null,"AGETOP_I",1334,"DISCO DE CORTE DIAM. 5/8\"- 10\"","un",0.373,5.5,5.5,2.0499999999999998,2.0499999999999998]
[null,"AGETOP_I",2902,"FABRICAÇÃO / MONTAGEM","un",1,50.44,50.44,50.44,50.44]
[null,"AGETOP_I",2150,"CHAPA DE FERRO DOBRADA No.13","Kg",0.43519999999999998,5.28,5.28,2.2999999999999998,2.2999999999999998]
[null,"AGETOP_I",2719,"CHAPA PERFILADA 3/16\"","Kg",1.0979999999999999,5.04,5.04,5.53,5.53]
[null,"AGETOP_I",2436,"ACO CA-25 - 6,3 MM (1/4\") - BARRA LISA A-36","Kg",0.38124999999999998,5.13,5.13,1.96,1.96]
[null,"AGETOP",261602,"PINT.ESMALTE/ESQUAD.FERRO C/FUNDO ANTICOR.","m2    ",0.78,13.65,15.04,10.65,11.73]
[null,"MATERIAL (C) - TOTAL",null,null,null,null,null,null,180.84000000000003,181.92000000000002]
[]
[85,"FONTE","CÓDIGO","DESCRIÇÃO","UNIDADE","COEFIC.","CUSTO UNITÁRIO",null,"CUSTO  TOTAL (A) + (B) + (C) + (D) + (E)"]
[null,null,null,null,null,null,"DESONERADO","NÃO DESONER.","DESONERADO","NÃO DESONER."]
[null,"COMPOSIÇÃO","COMP 085_SEE","GUARDA-CORPO - SEDUC","M",null,null,null,189.04999999999998,193.71999999999997]
[null,"AGETOP_I",25,"OFICIAL \"B\"","h     ",1.1000000000000001,13.4,15.53,14.74,17.079999999999998]
[null,"AGETOP_I",8,"AJUDANTE","h     ",1.1000000000000001,8.1999999999999993,9.51,9.02,10.46]
[null,"MÃO DE OBRA (B) - TOTAL",null,null,null,null,null,null,23.759999999999998,27.54]
[null,"AGETOP_I",2376,"TUBO INDUSTRIAL 2\" CHAPA 13 ","Kg",7.7778,5.23,5.23,40.68,40.68]
[null,"AGETOP_I",2504,"TUBO INDUSTRIAL D=25 MM CHAPA 13 ","Kg",4.6319999999999997,5.07,5.07,23.48,23.48]
[null,"AGETOP_I",2377,"TUBO INDUSTRIAL 40X40 CH.13","Kg",6.3419999999999996,5.07,5.07,32.15,32.15]
[null,"AGETOP_I",2417,"MASSA PLASTICA","Kg",0.2041,10.58,10.58,2.16,2.16]
[null,"AGETOP_I",2246,"ELETRODO 2.5 OK","Kg",0.11459999999999999,8.6999999999999993,8.6999999999999993,1,1]
[null,"AGETOP_I",1672,"LIXA PARA FERRO ( NÚMERO 100 )","un",0.25509999999999999,2.12,2.12,0.54,0.54]
[null,"AGETOP_I",1264,"DISCO DE DESBASTE 7/8\" P/ CONC./FERRO (1/4\" X 7\")","un",5.0999999999999997E-2,7,7,0.36,0.36]
[null,"AGETOP_I",1334,"DISCO DE CORTE DIAM. 5/8\"- 10\"","un",0.2334,5.5,5.5,1.28,1.28]
[null,"AGETOP_I",2902,"FABRICAÇÃO / MONTAGEM","un",1,50.44,50.44,50.44,50.44]
[null,"AGETOP_I",2150,"CHAPA DE FERRO DOBRADA No.13","Kg",0.33909,5.28,5.28,1.79,1.79]
[null,"AGETOP_I",2719,"CHAPA PERFILADA 3/16\"","Kg",0.3463,5.04,5.04,1.75,1.75]
[null,"AGETOP_I",2436,"ACO CA-25 - 6,3 MM (1/4\") - BARRA LISA A-36","Kg",0.18029999999999999,5.13,5.13,0.92,0.92]
[null,"AGETOP",261602,"PINT.ESMALTE/ESQUAD.FERRO C/FUNDO ANTICOR.","m2    ",0.64,13.65,15.04,8.74,9.6300000000000008]
[null,"MATERIAL (C) - TOTAL",null,null,null,null,null,null,165.29,166.17999999999998]

{"sheet":"Cotações","index":8,"n_rows":191,"n_cols":9,"rows_kept":191,"cut":false,"hidden":false,"merged":[[188,3,188,4],[188,7,188,8],[189,3,189,4],[189,7,189,8],[190,3,190,8],[185,3,185,4],[185,7,185,8],[186,3,186,4],[186,7,186,8],[187,3,187,4],[187,7,187,8],[181,7,182,8],[183,7,183,8],[184,3,184,4],[184,5,184,6],[184,7,184,8],[181,1,182,1],[181,2,182,2],[181,3,182,3],[181,4,182,4],[181,5,181,6],[177,3,177,4],[177,7,177,8],[178,3,178,4],[178,7,178,8],[179,3,179,8],[174,3,174,4],[174,7,174,8],[175,3,175,4],[175,7,175,8],[176,3,176,4],[176,7,176,8],[170,7,171,8],[172,7,172,8],[173,3,173,4],[173,5,173,6],[173,7,173,8],[170,1,171,1],[170,2,171,2],[170,3,171,3],[170,4,171,4],[170,5,170,6],[166,3,166,4],[166,7,166,8],[167,3,167,4],[167,7,167,8],[168,3,168,8],[163,3,163,4],[163,7,163,8],[164,3,164,4],[164,7,164,8],[165,3,165,4],[165,7,165,8],[159,7,160,8],[161,7,161,8],[162,3,162,4],[162,5,162,6],[162,7,162,8],[159,1,160,1],[159,2,160,2],[159,3,160,3],[159,4,160,4],[159,5,159,6],[155,3,155,4],[155,7,155,8],[156,3,156,4],[156,7,156,8],[157,3,157,8],[152,3,152,4],[152,7,152,8],[153,3,153,4],[153,7,153,8],[154,3,154,4],[154,7,154,8],[148,7,149,8],[150,7,150,8],[151,3,151,4],[151,5,151,6],[151,7,151,8],[148,1,149,1],[148,2,149,2],[148,3,149,3],[148,4,149,4],[148,5,148,6],[144,3,144,4],[144,7,144,8],[145,3,145,4],[145,7,145,8],[146,3,146,8],[141,3,141,4],[141,7,141,8],[142,3,142,4],[142,7,142,8],[143,3,143,4],[143,7,143,8],[137,7,138,8],[139,7,139,8],[140,3,140,4],[140,5,140,6],[140,7,140,8],[137,1,138,1],[137,2,138,2],[137,3,138,3],[137,4,138,4],[137,5,137,6],[133,3,133,4],[133,7,133,8],[134,3,134,4],[134,7,134,8],[135,3,135,8],[130,3,130,4],[130,7,130,8],[131,3,131,4],[131,7,131,8],[132,3,132,4],[132,7,132,8],[126,7,127,8],[128,7,128,8],[129,3,129,4],[129,5,129,6],[129,7,129,8],[126,1,127,1],[126,2,127,2],[126,3,127,3],[126,4,127,4],[126,5,126,6],[122,3,122,4],[122,7,122,8],[123,3,123,4],[123,7,123,8],[124,3,124,8],[119,3,119,4],[119,7,119,8],[120,3,120,4],[120,7,120,8],[121,3,121,4],[121,7,121,8],[115,7,116,8],[117,7,117,8],[118,3,118,4],[118,5,118,6],[118,7,118,8],[115,1,116,1],[115,2,116,2],[115,3,116,3],[115,4,116,4],[115,5,115,6],[111,3,111,4],[111,7,111,8],[112,3,112,4],[112,7,112,8],[113,3,113,8],[108,3,108,4],[108,7,108,8],[109,3,109,4],[109,7,109,8],[110,3,110,4],[110,7,110,8],[104,7,105,8],[106,7,106,8],[107,3,107,4],[107,5,107,6],[107,7,107,8],[104,1,105,1],[104,2,105,2],[104,3,105,3],[104,4,105,4],[104,5,104,6],[100,3,100,4],[100,7,100,8],[101,3,101,4],[101,7,101,8],[102,3,102,8],[97,3,97,4],[97,7,97,8],[98,3,98,4],[98,7,98,8],[99,3,99,4],[99,7,99,8],[93,7,94,8],[95,7,95,8],[96,3,96,4],[96,5,96,6],[96,7,96,8],[93,1,94,1],[93,2,94,2],[93,3,94,3],[93,4,94,4],[93,5,93,6],[89,3,89,4],[89,7,89,8],[90,3,90,4],[90,7,90,8],[91,3,91,8],[86,3,86,4],[86,7,86,8],[87,3,87,4],[87,7,87,8],[88,3,88,4],[88,7,88,8],[82,7,83,8],[84,7,84,8],[85,3,85,4],[85,5,85,6],[85,7,85,8],[82,1,83,1],[82,2,83,2],[82,3,83,3],[82,4,83,4],[82,5,82,6],[78,3,78,4],[78,7,78,8],[79,3,79,4],[79,7,79,8],[80,3,80,8],[75,3,75,4],[75,7,75,8],[76,3,76,4],[76,7,76,8],[77,3,77,4],[77,7,77,8],[71,7,72,8],[73,7,73,8],[74,3,74,4],[74,5,74,6],[74,7,74,8],[71,1,72,1],[71,2,72,2],[71,3,72,3],[71,4,72,4],[71,5,71,6],[67,3,67,4],[67,7,67,8],[68,3,68,4],[68,7,68,8],[69,3,69,8],[64,3,64,4],[64,7,64,8],[65,3,65,4],[65,7,65,8],[66,3,66,4],[66,7,66,8],[60,7,61,8],[62,7,62,8],[63,3,63,4],[63,5,63,6],[63,7,63,8],[60,1,61,1],[60,2,61,2],[60,3,61,3],[60,4,61,4],[60,5,60,6],[56,3,56,4],[56,7,56,8],[57,3,57,4],[57,7,57,8],[58,3,58,8],[53,3,53,4],[53,7,53,8],[54,3,54,4],[54,7,54,8],[55,3,55,4],[55,7,55,8],[49,7,50,8],[51,7,51,8],[52,3,52,4],[52,5,52,6],[52,7,52,8],[49,1,50,1],[49,2,50,2],[49,3,50,3],[49,4,50,4],[49,5,49,6],[45,3,45,4],[45,7,45,8],[46,3,46,4],[46,7,46,8],[47,3,47,8],[42,3,42,4],[42,7,42,8],[43,3,43,4],[43,7,43,8],[44,3,44,4],[44,7,44,8],[38,7,39,8],[40,7,40,8],[41,3,41,4],[41,5,41,6],[41,7,41,8],[38,1,39,1],[38,2,39,2],[38,3,39,3],[38,4,39,4],[38,5,38,6],[34,3,34,4],[34,7,34,8],[35,3,35,4],[35,7,35,8],[36,3,36,8],[31,3,31,4],[31,7,31,8],[32,3,32,4],[32,7,32,8],[33,3,33,4],[33,7,33,8],[27,7,28,8],[29,7,29,8],[30,3,30,4],[30,5,30,6],[30,7,30,8],[27,1,28,1],[27,2,28,2],[27,3,28,3],[27,4,28,4],[27,5,27,6],[23,3,23,4],[23,7,23,8],[24,3,24,4],[24,7,24,8],[25,3,25,8],[20,3,20,4],[20,7,20,8],[21,3,21,4],[21,7,21,8],[22,3,22,4],[22,7,22,8],[16,7,17,8],[18,7,18,8],[19,3,19,4],[19,5,19,6],[19,7,19,8],[16,1,17,1],[16,2,17,2],[16,3,17,3],[16,4,17,4],[16,5,16,6],[8,0,8,8],[0,0,0,8],[1,0,1,9],[2,0,2,8],[3,0,3,6],[3,7,3,9],[4,0,4,6],[4,7,4,9],[5,0,5,8],[6,0,6,6],[6,7,6,9],[7,0,7,6],[7,7,7,9],[9,0,9,2],[9,3,9,6],[9,7,9,8],[10,0,10,2],[10,3,10,6],[10,8,10,9],[14,0,14,8],[15,0,15,9],[11,0,11,9],[12,0,12,2],[12,3,12,6],[12,7,12,8],[13,0,13,2],[13,3,13,6],[13,8,13,9]]}
[]
[]
[]
["UNIDADE ESCOLAR",null,null,null,null,null,null,"CÓDIGO INEP"]
[{"$f":"Orçamento!$O$4","v":"COLÉGIO ESTADUAL RUY BRASIL CAVALCANTE"},null,null,null,null,null,null,{"$f":"Orçamento!$V$4","v":52060993}]
[]
["OBRA",null,null,null,null,null,null,"CIDADE"]
[{"$f":"Orçamento!$O$7","v":"AMPLIAÇÃO E REFORMA"},null,null,null,null,null,null,{"$f":"Orçamento!$V$7","v":"PIRACANJUBA"}]
[]
["CRE",null,null,"ENDEREÇO",null,null,null,"REFERÊNCIA AGETOP"]
[{"$f":"Orçamento!$O$10","v":"PIRACANJUBA"},null,null,{"$f":"Orçamento!$R$10","v":"PRACA DIMAS COSTA 413, CENTRO, CEP:75640-000"},null,null,null,{"$f":"Orçamento!$V$10","v":"DEZ/18"},{"$f":"Orçamento!$W$10","v":"ONERADA"}]
[]
["DATA",null,null,"ÁREA TOTAL CONSTRUÍDA (M²)",null,null,null,"REFERÊNCIA SINAPI"]
[{"$f":"Orçamento!$S$7","v":"2020-04-13"},null,null,{"$f":"Orçamento!$S$13","v":2185.87},null,null,null,{"$f":"Orçamento!$V$13","v":"AGO/19"},{"$f":"Orçamento!$W$13","v":"ONERADA"}]
[]
["COTAÇÕES DE PREÇOS - SEE-GO"]
[null,"FONTE","CÓDIGO","DESCRIÇÃO","UNIDADE","MÉDIA",null,"ÍNDICE RETROAÇÃO"]
[null,null,null,null,null,"DESONERADA","ONERADA"]
[10,"COTAÇÃO","COT 010_SEE","CAPUZ PARA PROTEÇÃO DOS PARA RAIOS","UN ",15.81,15.81,""]
[null,null,"EMPRESA","NOME DA EMPRESA",null,"COTAÇÕES",null,"DATA COTAÇÃO"]
[null,null,"E013 - ELETRO...","ELETROTRANSOL",null,15.81,15.81,"06/02/2019"]
[null,null,null,"",null,null,null,""]
[null,null,null,"",null,null,null,""]
[null,null,"","",null,null,null,""]
[null,null,"","",null,null,null,""]
[null,null,"OBSERVAÇÕES:",""]
[]
[null,"FONTE","CÓDIGO","DESCRIÇÃO","UNIDADE","MÉDIA",null,"ÍNDICE RETROAÇÃO"]
[null,null,null,null,null,"DESONERADA","ONERADA"]
[11,"COTAÇÃO","COT 011_SEE","CAPUZ DE PROTEÇÃO PARA BUCHA DE TRANSFORMADOR","UN ",15.81,15.81,""]
[null,null,"EMPRESA","NOME DA EMPRESA",null,"COTAÇÕES",null,"DATA COTAÇÃO"]
[null,null,"E013 - ELETRO...","ELETROTRANSOL",null,15.81,15.81,"06/02/2019"]
[null,null,null,"",null,null,null,""]
[null,null,null,"",null,null,null,""]
[null,null,"","",null,null,null,""]
[null,null,"","",null,null,null,""]
[null,null,"OBSERVAÇÕES:",""]
[]
[null,"FONTE","CÓDIGO","DESCRIÇÃO","UNIDADE","MÉDIA",null,"ÍNDICE RETROAÇÃO"]
[null,null,null,null,null,"DESONERADA","ONERADA"]
[12,"COTAÇÃO","COT 012_SEE","HASTE ROSQUEADA \"TIRANTE\" 3/8\"","M",5.3833333333333329,5.3833333333333329,""]
[null,null,"EMPRESA","NOME DA EMPRESA",null,"COTAÇÕES",null,"DATA COTAÇÃO"]
[null,null,"E013 - ELETRO...","ELETROTRANSOL",null,5.3833333333333329,5.3833333333333329,"06/02/2019"]
[null,null,null,"",null,null,null,""]
[null,null,null,"",null,null,null,""]
[null,null,"","",null,null,null,""]
[null,null,"","",null,null,null,""]
[null,null,"OBSERVAÇÕES:",""]
[]
[null,"FONTE","CÓDIGO","DESCRIÇÃO","UNIDADE","MÉDIA",null,"ÍNDICE RETROAÇÃO"]
[null,null,null,null,null,"DESONERADA","ONERADA"]
[13,"COTAÇÃO","COT 013_SEE","PORCA SEXTAVADA 3/8\"","UN ",0.13,0.13,""]
[null,null,"EMPRESA","NOME DA EMPRESA",null,"COTAÇÕES",null,"DATA COTAÇÃO"]
[null,null,"E013 - ELETRO...","ELETROTRANSOL",null,0.12,0.12,"06/02/2019"]
[null,null,"E055 - SANETA...","SANETAM COMERCIO DE TUBOS E CONEXOES LTDA.",null,0.13,0.13,"06/02/2019"]
[null,null,"E056 - AC COM...","AC COMERCIO DE FERRAMENTAS E PRODUTOS PARA FIXACAO EIRE",null,0.14000000000000001,0.14000000000000001,"06/02/2019"]
[null,null,"","",null,null,null,""]
[null,null,"","",null,null,null,""]
[null,null,"OBSERVAÇÕES:",""]
[]
[null,"FONTE","CÓDIGO","DESCRIÇÃO","UNIDADE","MÉDIA",null,"ÍNDICE RETROAÇÃO"]
[null,null,null,null,null,"DESONERADA","ONERADA"]
[302,"COTAÇÃO","COT 302_SEE","BOMBA THSI-18 10,0 CV TRIFÁSICA","UN ",5020.9250000000002,5020.9250000000002,""]
[null,null,"EMPRESA","NOME DA EMPRESA",null,"COTAÇÕES",null,"DATA COTAÇÃO"]
[null,null,"E034 - VALK T...","VALK TUBOS",null,5560,5560,"16/08/2019"]
[null,null,"E085 - CIA DA...","CIA DAS BOMBAS ",null,3850,3850,"16/08/2019"]
[null,null,"E080 - IMPACT...","IMPACTO MOTO BOMBAS",null,5130,5130,"17/08/2019"]
[null,null,"E081 - CASA I...","CASA IRACEMA",null,5543.7,5543.7,"16/08/2019"]
[null,null,"","",null,null,null,""]
[null,null,"OBSERVAÇÕES:",""]
[]
[null,"FONTE","CÓDIGO","DESCRIÇÃO","UNIDADE","MÉDIA",null,"ÍNDICE RETROAÇÃO"]
[null,null,null,null,null,"DESONERADA","ONERADA"]
[17,"COTAÇÃO","COT 017_SEE","REGISTRO DE GAVETA COM HASTE ASCENDENTE DE BRONZE 2 1/2\"","UN ",231.66666666666666,231.66666666666666,""]
[null,null,"EMPRESA","NOME DA EMPRESA",null,"COTAÇÕES",null,"DATA COTAÇÃO"]
[null,null,"E034 - VALK T...","VALK TUBOS",null,220,220,""]
[null,null,"E035 - ACIONA...","ACIONAR SERVIÇOS E EQUIPAMENTOS CONTRA INCÊNDIO",null,250,250,""]
[null,null,"E038 - CENTER...","CENTER FIRE",null,225,225,""]
[null,null,"","",null,null,null,""]
[null,null,"","",null,null,null,""]
[null,null,"OBSERVAÇÕES:",""]
[]
[null,"FONTE","CÓDIGO","DESCRIÇÃO","UNIDADE","MÉDIA",null,"ÍNDICE RETROAÇÃO"]
[null,null,null,null,null,"DESONERADA","ONERADA"]
[286,"COTAÇÃO","COT 286_SEE","BUJÃO DE REBORDO 2.1/2\"","UN ",15,15,""]
[null,null,"EMPRESA","NOME DA EMPRESA",null,"COTAÇÕES",null,"DATA COTAÇÃO"]
[null,null,"E076 - GOIÂNI...","GOIÂNIA TUBOS",null,15,15,"12/04/2019"]
[null,null,null,"",null,null,null,""]
[null,null,null,"",null,null,null,""]
[null,null,"","",null,null,null,""]
[null,null,"","",null,null,null,""]
[null,null,"OBSERVAÇÕES:",""]
[]
[null,"FONTE","CÓDIGO","DESCRIÇÃO","UNIDADE","MÉDIA",null,"ÍNDICE RETROAÇÃO"]
[null,null,null,null,null,"DESONERADA","ONERADA"]
[88,"COTAÇÃO","COT 088_SEE","BOTOEIRA BOMBA DE INCÊNDIO C/ MARTELO CONVENCIONAL/ ANALÓGICA","UN",63.5,63.5,""]
[null,null,"EMPRESA","NOME DA EMPRESA",null,"COTAÇÕES",null,"DATA COTAÇÃO"]
[null,null,"E034 - VALK T...","VALK TUBOS",null,58,58,""]
[null,null,"E035 - ACIONA...","ACIONAR SERVIÇOS E EQUIPAMENTOS CONTRA INCÊNDIO",null,67.5,67.5,""]
[null,null,"E038 - CENTER...","CENTER FIRE",null,65,65,""]
[null,null,"","",null,null,null,""]
[null,null,"","",null,null,null,""]
[null,null,"OBSERVAÇÕES:",""]
[]
[null,"FONTE","CÓDIGO","DESCRIÇÃO","UNIDADE","MÉDIA",null,"ÍNDICE RETROAÇÃO"]
[null,null,null,null,null,"DESONERADA","ONERADA"]
[90,"COTAÇÃO","COT 090_SEE","ACIONADOR MANUAL DE ALARME","UN",83.333333333333329,83.333333333333329,""]
[null,null,"EMPRESA","NOME DA EMPRESA",null,"COTAÇÕES",null,"DATA COTAÇÃO"]
[null,null,"E034 - VALK T...","VALK TUBOS",null,120,120,""]
[null,null,"E035 - ACIONA...","ACIONAR SERVIÇOS E EQUIPAMENTOS CONTRA INCÊNDIO",null,65,65,""]
[null,null,"E038 - CENTER...","CENTER FIRE",null,65,65,""]
[null,null,"","",null,null,null,""]
[null,null,"","",null,null,null,""]
[null,null,"OBSERVAÇÕES:",""]
[]
[null,"FONTE","CÓDIGO","DESCRIÇÃO","UNIDADE","MÉDIA",null,"ÍNDICE RETROAÇÃO"]
[null,null,null,null,null,"DESONERADA","ONERADA"]
[92,"COTAÇÃO","COT 092_SEE","CENTRAL DE DETECÇÃO E ALARME DE 40 SETORES COM BATERIA (PREÇO MÉDIO)","UN",963.33333333333337,963.33333333333337,""]
[null,null,"EMPRESA","NOME DA EMPRESA",null,"COTAÇÕES",null,"DATA COTAÇÃO"]
[null,null,"E034 - VALK T...","VALK TUBOS",null,840,840,""]
[null,null,"E035 - ACIONA...","ACIONAR SERVIÇOS E EQUIPAMENTOS CONTRA INCÊNDIO",null,980,980,""]
[null,null,"E038 - CENTER...","CENTER FIRE",null,1070,1070,""]
[null,null,"","",null,null,null,""]
[null,null,"","",null,null,null,""]
[null,null,"OBSERVAÇÕES:",""]
[]
[null,"FONTE","CÓDIGO","DESCRIÇÃO","UNIDADE","MÉDIA",null,"ÍNDICE RETROAÇÃO"]
[null,null,null,null,null,"DESONERADA","ONERADA"]
[103,"COTAÇÃO","COT 103_SEE","NIPLE DE REDUÇÃO 1/2\" X 1/4\" BSP","UN",6.0533333333333337,6.0533333333333337,""]
[null,null,"EMPRESA","NOME DA EMPRESA",null,"COTAÇÕES",null,"DATA COTAÇÃO"]
[null,null,"E070 - FOCO R...","FOCO REPRESENTAÇÃO E CONSULTORIA LTDA-ME",null,4.46,4.46,"12/02/2019"]
[null,null,"E071 - CASA D...","CASA DAS PEÇAS COM E INDUSTRIA DE FOGOES LTDA",null,3.9,3.9,"11/02/2019"]
[null,null,"E072 - AMIG I...","AMIG INSTALAÇÃO DE REDE DE GÁS E INCÊNDIO",null,9.8000000000000007,9.8000000000000007,"08/02/2019"]
[null,null,"","",null,null,null,""]
[null,null,"","",null,null,null,""]
[null,null,"OBSERVAÇÕES:",""]
[]
[null,"FONTE","CÓDIGO","DESCRIÇÃO","UNIDADE","MÉDIA",null,"ÍNDICE RETROAÇÃO"]
[null,null,null,null,null,"DESONERADA","ONERADA"]
[104,"COTAÇÃO","COT 104_SEE","NIPLE DE REDUÇÃO 3/4\" X 1/2\" BSP","UN",9.7099999999999991,9.7099999999999991,""]
[null,null,"EMPRESA","NOME DA EMPRESA",null,"COTAÇÕES",null,"DATA COTAÇÃO"]
[null,null,"E070 - FOCO R...","FOCO REPRESENTAÇÃO E CONSULTORIA LTDA-ME",null,10.93,10.93,"12/02/2019"]
[null,null,"E071 - CASA D...","CASA DAS PEÇAS COM E INDUSTRIA DE FOGOES LTDA",null,5.5,5.5,"11/02/2019"]
[null,null,"E072 - AMIG I...","AMIG INSTALAÇÃO DE REDE DE GÁS E INCÊNDIO",null,12.7,12.7,"08/02/2019"]
[null,null,"","",null,null,null,""]
[null,null,"","",null,null,null,""]
[null,null,"OBSERVAÇÕES:",""]
[]
[null,"FONTE","CÓDIGO","DESCRIÇÃO","UNIDADE","MÉDIA",null,"ÍNDICE RETROAÇÃO"]
[null,null,null,null,null,"DESONERADA","ONERADA"]
[281,"COTAÇÃO","COT 281_SEE","VÁLVULA UGV 3/4\" (S) LATÃO","UN ",15.836666666666666,15.836666666666666,""]
[null,null,"EMPRESA","NOME DA EMPRESA",null,"COTAÇÕES",null,"DATA COTAÇÃO"]
[null,null,"E070 - FOCO R...","FOCO REPRESENTAÇÃO E CONSULTORIA LTDA-ME",null,12.51,12.51,"12/02/2019"]
[null,null,"E071 - CASA D...","CASA DAS PEÇAS COM E INDUSTRIA DE FOGOES LTDA",null,17.5,17.5,"11/02/2019"]
[null,null,"E072 - AMIG I...","AMIG INSTALAÇÃO DE REDE DE GÁS E INCÊNDIO",null,17.5,17.5,"08/02/2019"]
[null,null,"",""]
[null,null,"","",null,null,null,""]
[null,null,"OBSERVAÇÕES:",""]
[]
[null,"FONTE","CÓDIGO","DESCRIÇÃO","UNIDADE","MÉDIA",null,"ÍNDICE RETROAÇÃO"]
[null,null,null,null,null,"DESONERADA","ONERADA"]
[282,"COTAÇÃO","COT 282_SEE","VÁLVULA UGV 1/2\" (S) LATÃO","UN ",15.166666666666666,15.166666666666666,""]
[null,null,"EMPRESA","NOME DA EMPRESA",null,"COTAÇÕES",null,"DATA COTAÇÃO"]
[null,null,"E070 - FOCO R...","FOCO REPRESENTAÇÃO E CONSULTORIA LTDA-ME",null,11.2,11.2,"12/02/2019"]
[null,null,"E071 - CASA D...","CASA DAS PEÇAS COM E INDUSTRIA DE FOGOES LTDA",null,17.5,17.5,"11/02/2019"]
[null,null,"E072 - AMIG I...","AMIG INSTALAÇÃO DE REDE DE GÁS E INCÊNDIO",null,16.8,16.8,"08/02/2019"]
[null,null,"","",null,null,null,""]
[null,null,"","",null,null,null,""]
[null,null,"OBSERVAÇÕES:",""]
[]
[null,"FONTE","CÓDIGO","DESCRIÇÃO","UNIDADE","MÉDIA",null,"ÍNDICE RETROAÇÃO"]
[null,null,null,null,null,"DESONERADA","ONERADA"]
[102,"COTAÇÃO","COT 102_SEE","REGULADOR DE 2º ESTÁGIO 5KG/H","UN",59.833333333333336,59.833333333333336,""]
[null,null,"EMPRESA","NOME DA EMPRESA",null,"COTAÇÕES",null,"DATA COTAÇÃO"]
[null,null,"E070 - FOCO R...","FOCO REPRESENTAÇÃO E CONSULTORIA LTDA-ME",null,38.9,38.9,"12/02/2019"]
[null,null,"E071 - CASA D...","CASA DAS PEÇAS COM E INDUSTRIA DE FOGOES LTDA",null,55.599999999999994,55.599999999999994,"11/02/2019"]
[null,null,"E072 - AMIG I...","AMIG INSTALAÇÃO DE REDE DE GÁS E INCÊNDIO",null,85,85,"08/02/2019"]
[null,null,"","",null,null,null,""]
[null,null,"","",null,null,null,""]
[null,null,"OBSERVAÇÕES:","AMIG enviou cotação de regulador de 2º estágio de 12kg/h."]
[]
[null,"FONTE","CÓDIGO","DESCRIÇÃO","UNIDADE","MÉDIA",null,"ÍNDICE RETROAÇÃO"]
[null,null,null,null,null,"DESONERADA","ONERADA"]
[101,"COTAÇÃO","COT 101_SEE","REGULADOR DE 1º ESTÁGIO 60KG/H MODELO AP-40  COM MANÔMETRO","UN",205.57666666666668,205.57666666666668,""]
[null,null,"EMPRESA","NOME DA EMPRESA",null,"COTAÇÕES",null,"DATA COTAÇÃO"]
[null,null,"E070 - FOCO R...","FOCO REPRESENTAÇÃO E CONSULTORIA LTDA-ME",null,148.72999999999999,148.72999999999999,"12/02/2019"]
[null,null,"E071 - CASA D...","CASA DAS PEÇAS COM E INDUSTRIA DE FOGOES LTDA",null,198,198,"11/02/2019"]
[null,null,"E072 - AMIG I...","AMIG INSTALAÇÃO DE REDE DE GÁS E INCÊNDIO",null,270,270,"08/02/2019"]
[null,null,"","",null,null,null,""]
[null,null,"","",null,null,null,""]
[null,null,"OBSERVAÇÕES:",""]