{"text_format":"1","workbook":"xlsx","n_sheets":9,"sheets":["Orçamento","Resumo ","Somatório","Cronog_60_Dias","Composição BDI","Relatório CENTRAL","Parc Maior Relev","Composições","Cotações"],"not_rendered":{"charts":0,"images":3,"macros":1,"external_links":1,"defined_names":125,"comments":2,"pivot_tables":0},"unopened":[],"bounds":{"document_bytes":16777216,"sheet_cells":100000,"rows_first":2000,"rows_last":500,"rows_between":2000,"halvings":0,"cell_chars":16384,"cell_head_chars":4096},"cells_cut":0,"cells_raw":0,"read":"whole","date_system":"1900"}

{"sheet":"Orçamento","index":0,"n_rows":281,"n_cols":24,"rows_kept":281,"cut":false,"hidden":false,"merged":[[262,18,262,20],[262,21,262,22],[263,15,263,17],[263,18,263,20],[263,21,263,22],[264,15,264,17],[264,18,264,20],[264,21,264,22],[259,15,259,17],[259,18,259,20],[259,21,259,22],[260,15,260,17],[260,18,260,20],[260,21,260,22],[261,15,261,17],[261,18,261,20],[261,21,261,22],[273,18,273,20],[273,21,273,22],[268,15,268,17],[268,18,268,20],[268,21,268,22],[269,15,269,17],[269,18,269,20],[269,21,269,22],[270,15,270,17],[270,18,270,20],[270,21,270,22],[249,14,249,17],[256,15,256,17],[222,15,222,17],[277,18,277,20],[277,21,277,22],[265,15,265,17],[265,18,265,20],[265,21,265,22],[266,15,266,17],[266,18,266,20],[266,21,266,22],[267,15,267,17],[267,18,267,20],[267,21,267,22],[271,15,271,17],[271,18,271,20],[271,21,271,22],[272,15,272,17],[272,18,272,20],[272,21,272,22],[273,15,273,17],[262,15,262,17],[217,16,217,22],[280,18,280,20],[280,21,280,22],[277,14,277,17],[274,15,274,17],[274,18,274,20],[274,21,274,22],[275,15,275,17],[275,18,275,20],[275,21,275,22],[276,15,276,17],[276,18,276,20],[276,21,276,22],[279,18,279,20],[279,21,279,22],[278,18,278,20],[278,21,278,22],[255,14,255,23],[256,18,256,20],[256,21,256,22],[257,15,257,17],[257,18,257,20],[257,21,257,22],[258,15,258,17],[258,18,258,20],[258,21,258,22],[213,16,213,22],[214,16,214,22],[215,16,215,22],[3,21,3,22],[2,21,2,22],[5,21,5,22],[10,14,10,23],[13,14,13,23],[6,21,6,22],[9,17,9,20],[2,14,2,20],[3,14,3,20],[5,18,5,20],[6,18,6,20],[11,18,11,20],[12,18,12,20],[6,14,6,17],[5,14,5,17],[235,15,235,17],[236,15,236,17],[237,15,237,17],[238,15,238,17],[239,15,239,17],[240,15,240,17],[241,15,241,17],[242,15,242,17],[243,15,243,17],[223,15,223,17],[224,15,224,17],[225,15,225,17],[226,15,226,17],[227,15,227,17],[228,15,228,17],[229,15,229,17],[230,15,230,17],[231,15,231,17],[244,15,244,17],[245,15,245,17],[246,15,246,17],[247,15,247,17],[248,15,248,17],[221,14,221,23],[210,20,210,21],[209,20,209,21],[205,17,210,17],[205,20,205,21],[222,18,222,20],[222,21,222,22],[223,18,223,20],[223,21,223,22],[211,20,211,21],[231,18,231,20],[231,21,231,22],[232,18,232,20],[232,21,232,22],[233,18,233,20],[233,21,233,22],[234,18,234,20],[234,21,234,22],[246,18,246,20],[249,18,249,20],[249,21,249,22],[246,21,246,22],[247,18,247,20],[247,21,247,22],[248,18,248,20],[248,21,248,22],[238,18,238,20],[238,21,238,22],[245,18,245,20],[245,21,245,22],[240,21,240,22],[241,18,241,20],[241,21,241,22],[243,18,243,20],[239,18,239,20],[239,21,239,22],[240,18,240,20],[250,18,250,20],[250,21,250,22],[237,18,237,20],[237,21,237,22],[230,18,230,20],[230,21,230,22],[252,18,252,20],[252,21,252,22],[206,20,206,21],[228,18,228,20],[228,21,228,22],[229,18,229,20],[229,21,229,22],[227,18,227,20],[227,21,227,22],[236,18,236,20],[207,20,207,21],[218,18,218,22],[224,18,224,20],[224,21,224,22],[225,18,225,20],[225,21,225,22],[226,18,226,20],[226,21,226,22],[216,16,216,22],[8,12,9,12],[251,18,251,20],[251,21,251,22],[0,14,0,22],[8,14,8,16],[9,14,9,16],[11,14,11,16],[12,14,12,16],[14,14,14,22],[1,14,1,22],[4,14,4,22],[7,14,7,22],[235,18,235,20],[235,21,235,22],[243,21,243,22],[232,15,232,17],[233,15,233,17],[234,15,234,17],[236,21,236,22],[244,18,244,20],[244,21,244,22],[242,18,242,20],[242,21,242,22]]}
[]
[]
[null,null,null,null,null,null,null,null,null,null,null,null,null,null,"UNIDADE ESCOLAR",null,null,null,null,null,null,"CÓDIGO INEP"]
[null,null,null,null,null,null,null,null,null,null,null,null,null,null,"COLÉGIO ESTADUAL JOÃO BÊNNIO",null,null,null,null,null,null,52035131]
[]
["Nmax",null,null,null,null,null,null,null,null,null,null,null,"Ajustar altura?",null,"OBRA",null,null,null,"DATA",null,null,"CIDADE"]
[{"$f":"MAX($C$18:$C$205)","v":3},null,null,null,null,null,null,null,null,null,null,null,"NÃO",null,"AMPLIAÇÃO E REFORMA",null,null,null,"2020-04-08",null,null,"GOIÂNIA"]
[]
[null,null,null,null,null,null,null,null,null,null,null,null,"",null,"CRE",null,null,"ENDEREÇO",null,null,null,"REFERÊNCIA AGETOP"]
[null,null,null,null,null,null,null,null,null,null,null,null,null,null,"GOIÂNIA",null,null,"RUA JC QUADRA 140 AREA VERDE S/N, JD CURITIBA III, CEP:74481-130",null,null,null,"DEZ/18","ONERADA"]
[]
[null,null,null,null,null,null,null,null,null,null,null,null,null,null,"ÁREA EXISTENTE (M²)",null,null,"ÁREA A CONSTRUIR (M²)","ÁREA TOTAL CONSTRUÍDA (M²)",null,null,"REFERÊNCIA SINAPI"]
[null,null,null,null,null,null,null,null,null,null,null,null,null,null,680,null,null,525,1205,null,null,"AGO/19","ONERADA"]
[]
[null,null,null,null,null,null,null,null,null,null,null,"FILTRO",null,null,"PLANILHA ORÇAMENTÁRIA"]
["Nível E","Save Nivel","Nível C","Altura","n1","n2","n3","n4","n5","Czero","Cnível","↓","Nível","Nível Corrigido","ITEM","TABELA","CODIGO","DESCRIÇÃO DOS SERVIÇOS","UNID","QUANT","MAT","MO","T.SERVIÇO","OBSERVAÇÕES¹"]
[{"$f":"CHOOSE(1+LOG(1+2*(ORÇAMENTO.Nivel=\"Nível 1\")+4*(ORÇAMENTO.Nivel=\"Nível 2\")+8*(ORÇAMENTO.Nivel=\"Nível 3\")+16*(ORÇAMENTO.Nivel=\"Nível 4\")+32*(ORÇAMENTO.Nivel=\"Serviço\"),2),0,1,2,3,4,\"S\")","v":"S"},{"$f":"IF(OR(C17=\"s\",C17=0),OFFSET(B17,-1,0),C17)","v":"Save Nivel"},{"$f":"IF(OFFSET(C17,-1,0)=\"L\",1,IF(OFFSET(C17,-1,0)=1,2,IF(OR(A17=\"s\",A17=0),\"S\",IF(AND(OFFSET(C17,-1,0)=2,A17=4),3,IF(AND(OR(OFFSET(C17,-1,0)=\"s\",OFFSET(C17,-1,0)=0),A17<>\"s\",A17>OFFSET(B17,-1,0)),OFFSET(B17,-1,0),A17)))))","v":"S"},{"$f":"IF(OR(C17=\"S\",C17=0),0,IF(ISERROR(K17),J17,SMALL(J17:K17,1)))","v":0},{"$f":"IF($C17=1,OFFSET(E17,-1,0)+1,OFFSET(E17,-1,0))","v":"n1"},{"$f":"IF($C17=1,0,IF($C17=2,OFFSET(F17,-1,0)+1,OFFSET(F17,-1,0)))","v":"n2"},{"$f":"IF(AND($C17<=2,$C17<>0),0,IF($C17=3,OFFSET(G17,-1,0)+1,OFFSET(G17,-1,0)))","v":"n3"},{"$f":"IF(AND($C17<=3,$C17<>0),0,IF($C17=4,OFFSET(H17,-1,0)+1,OFFSET(H17,-1,0)))","v":"n4"},{"$f":"IF(AND($C17<=4,$C17<>0),0,IF(AND($C17=\"S\",$W17>0),OFFSET(I17,-1,0)+1,OFFSET(I17,-1,0)))","v":"n5"},{"$f":"IF(OR($C17=\"S\",$C17=0),0,MATCH(0,OFFSET($D17,1,$C17,ROW($C$205)-ROW($C17)),0))","v":0},{"$f":"IF(OR($C17=\"S\",$C17=0),0,MATCH(OFFSET($D17,0,$C17)+1,OFFSET($D17,1,$C17,ROW($C$205)-ROW($C17)),0))","v":0},"","Serviço","Serviço","-","SINAPI",null,"(sem código)","-",null,0,0,0,""]
[0,null,"L",{"$f":"COUNTA(OFFSET(D18,1,0):D$205)","v":186},{"$f":"LEFT(O19,1)-1","v":0},null,null,null,null,null,null,"F","LOTE","LOTE","AMPLIAÇÃO E REFORMA - COLÉGIO ESTADUAL JOÃO BÊNNIO",null,null,null,null,null,null,null,0]
[1,{"$f":"IF(OR(C19=\"s\",C19=0),OFFSET(B19,-1,0),C19)","v":1},{"$f":"IF(OFFSET(C19,-1,0)=\"L\",1,IF(OFFSET(C19,-1,0)=1,2,IF(OR(A19=\"s\",A19=0),\"S\",IF(AND(OFFSET(C19,-1,0)=2,A19=4),3,IF(AND(OR(OFFSET(C19,-1,0)=\"s\",OFFSET(C19,-1,0)=0),A19<>\"s\",A19>OFFSET(B19,-1,0)),OFFSET(B19,-1,0),A19)))))","v":1},{"$f":"IF(OR(C19=\"S\",C19=0),0,IF(ISERROR(K19),J19,SMALL(J19:K19,1)))","v":139},{"$f":"IF($C19=1,OFFSET(E19,-1,0)+1,OFFSET(E19,-1,0))","v":1},{"$f":"IF($C19=1,0,IF($C19=2,OFFSET(F19,-1,0)+1,OFFSET(F19,-1,0)))","v":0},{"$f":"IF(AND($C19<=2,$C19<>0),0,IF($C19=3,OFFSET(G19,-1,0)+1,OFFSET(G19,-1,0)))","v":0},{"$f":"IF(AND($C19<=3,$C19<>0),0,IF($C19=4,OFFSET(H19,-1,0)+1,OFFSET(H19,-1,0)))","v":0},0,{"$f":"IF(OR($C19=\"S\",$C19=0),0,MATCH(0,OFFSET($D19,1,$C19,ROW($C$205)-ROW($C19)),0))","v":186},{"$f":"IF(OR($C19=\"S\",$C19=0),0,MATCH(OFFSET($D19,0,$C19)+1,OFFSET($D19,1,$C19,ROW($C$205)-ROW($C19)),0))","v":139},"F","Nível 1","Nível 1","1.","AGETOP",null,"AMPLIAÇÃO E REFORMA",null,null,null,null,0]
[{"$f":"CHOOSE(1+LOG(1+2*(ORÇAMENTO.Nivel=\"Nível 1\")+4*(ORÇAMENTO.Nivel=\"Nível 2\")+8*(ORÇAMENTO.Nivel=\"Nível 3\")+16*(ORÇAMENTO.Nivel=\"Nível 4\")+32*(ORÇAMENTO.Nivel=\"Serviço\"),2),0,1,2,3,4,\"S\")","v":2},2,{"$f":"IF(OFFSET(C20,-1,0)=\"L\",1,IF(OFFSET(C20,-1,0)=1,2,IF(OR(A20=\"s\",A20=0),\"S\",IF(AND(OFFSET(C20,-1,0)=2,A20=4),3,IF(AND(OR(OFFSET(C20,-1,0)=\"s\",OFFSET(C20,-1,0)=0),A20<>\"s\",A20>OFFSET(B20,-1,0)),OFFSET(B20,-1,0),A20)))))","v":2},9,{"$f":"IF($C20=1,OFFSET(E20,-1,0)+1,OFFSET(E20,-1,0))","v":1},{"$f":"IF($C20=1,0,IF($C20=2,OFFSET(F20,-1,0)+1,OFFSET(F20,-1,0)))","v":1},{"$f":"IF(AND($C20<=2,$C20<>0),0,IF($C20=3,OFFSET(G20,-1,0)+1,OFFSET(G20,-1,0)))","v":0},{"$f":"IF(AND($C20<=3,$C20<>0),0,IF($C20=4,OFFSET(H20,-1,0)+1,OFFSET(H20,-1,0)))","v":0},{"$f":"IF(AND($C20<=4,$C20<>0),0,IF(AND($C20=\"S\",$W20>0),OFFSET(I20,-1,0)+1,OFFSET(I20,-1,0)))","v":0},138,9,"","Nível 2","Nível 2","-","SINAPI",null,"SERVIÇOS PRELIMINARES","-",null,null,null,0,""]
[3,3,3,2,1,1,1,0,0,8,2,"","Nível 3","Nível 3","-","SINAPI",null,"FORRO PVC SEM ESTRUTURA","-",null,null,null,0,""]
["S",3,"S",0,1,1,1,0,0,0,0,"","Serviço","Serviço","-","SINAPI",97640,"REMOÇÃO DE FORROS DE DRYWALL, PVC E FIBROMINERAL, DE FORMA MANUAL, SEM REAPROVEITAMENTO. AF_12/2017","M2",545,null,null,0,""]
[3,3,3,2,1,1,2,0,0,6,2,"","Nível 3","Nível 3","-","SINAPI",null,"ACESSIBILIDADE","-",null,null,null,0,""]
["S",3,"S",0,1,1,2,0,0,0,0,"","Serviço","Serviço","-","AGETOP",20109,"DEM.PISO CIMENT.SOBRE LASTRO CONC.C/TR.ATE CB. E CARGA","m2    ",105,null,null,0,""]
[3,3,3,2,1,1,3,0,0,4,2,"","Nível 3","Nível 3","-","SINAPI",null,"REFORMA DA QUADRA","-",null,null,null,0,""]
["S",3,"S",0,1,1,3,0,0,0,0,"","Serviço","Serviço","-","AGETOP",20109,"DEM.PISO CIMENT.SOBRE LASTRO CONC.C/TR.ATE CB. E CARGA","m2    ",550,null,null,0,""]
[3,3,3,2,1,1,4,0,0,2,{"$error":"#N/A"},"","Nível 3","Nível 3","-","SINAPI",null,"OUTROS","-",null,null,null,0,""]
["S",3,"S",0,1,1,4,0,0,0,0,"","Serviço","Serviço","-","SINAPI","74209/1","PLACA DE OBRA EM CHAPA DE ACO GALVANIZADO","M2",7.5,null,null,0,"Referência: AGETOP - 21301"]
[2,2,2,3,1,2,0,0,0,129,3,"","Nível 2","Nível 2","-","SINAPI",null,"TRANSPORTES","-",null,null,null,0,""]
["S",2,"S",0,1,2,0,0,0,0,0,"","Serviço","Serviço","-","SINAPI",72900,"TRANSPORTE DE ENTULHO COM CAMINHAO BASCULANTE 6 M3, RODOVIA PAVIMENTADA, DMT 0,5 A 1,0 KM","M3",36,null,null,0,""]
["S",2,"S",0,1,2,0,0,0,0,0,"","Serviço","Serviço","-","SINAPI",72897,"CARGA MANUAL DE ENTULHO EM CAMINHAO BASCULANTE 6 M3","M3",36,null,null,0,""]
[2,2,2,3,1,3,0,0,0,126,3,"","Nível 2","Nível 2","-","SINAPI",null,"SERVIÇO EM TERRA","-",null,null,null,0,""]
["S",2,"S",0,1,3,0,0,0,0,0,"","Serviço","Serviço","-","AGETOP",41140,"REGULARIZAÇÃO DO TERRENO SEM APILOAMENTO COM TRANSPORTE MANUAL DA TERRA ESCAVADA ","m2    ",550,null,null,0,""]
["S",2,"S",0,1,3,0,0,0,0,0,"","Serviço","Serviço","-","AGETOP",41002,"APILOAMENTO","m2    ",550,null,null,0,""]
[2,2,2,77,1,4,0,0,0,123,77,"","Nível 2","Nível 2","-",null,null,"INSTALAÇÕES ELÉTRICAS","-",null,null,null,0,""]
[3,3,3,64,1,4,1,0,0,76,64,"","Nível 3","Nível 3","-","SINAPI",null,"INST. ELÉTRICAS","-",null,null,null,0,""]
["S",3,"S",0,1,4,1,0,0,0,0,"","Serviço","Serviço","-","SINAPI","74131/4","QUADRO DE DISTRIBUICAO DE ENERGIA DE EMBUTIR, EM CHAPA METALICA, PARA 18 DISJUNTORES TERMOMAGNETICOS MONOPOLARES, COM BARRAMENTO TRIFASICO E NEUTRO, FORNECIMENTO E INSTALACAO","UN",2,null,null,0,""]
["S",3,"S",0,1,4,1,0,0,0,0,"","Serviço","Serviço","-","SINAPI","74131/6","QUADRO DE DISTRIBUICAO DE ENERGIA DE EMBUTIR, EM CHAPA METALICA, PARA 32 DISJUNTORES TERMOMAGNETICOS MONOPOLARES, COM BARRAMENTO TRIFASICO E NEUTRO, FORNECIMENTO E INSTALACAO","UN",1,null,null,0,"Referência: AGETOP - 72198"]
["S",3,"S",0,1,4,1,0,0,0,0,"","Serviço","Serviço","-","SINAPI",93673,"DISJUNTOR TRIPOLAR TIPO DIN, CORRENTE NOMINAL DE 50A - FORNECIMENTO E INSTALAÇÃO. AF_04/2016","UN",2,null,null,0,"Referência: AGETOP - 71174"]
["S",3,"S",0,1,4,1,0,0,0,0,"","Serviço","Serviço","-","AGETOP",71175,"DISJUNTOR TRIPOLAR DE 60 A 100-A","Un    ",4,null,null,0,""]
["S",3,"S",0,1,4,1,0,0,0,0,"","Serviço","Serviço","-","SINAPI",93657,"DISJUNTOR MONOPOLAR TIPO DIN, CORRENTE NOMINAL DE 32A - FORNECIMENTO E INSTALAÇÃO. AF_04/2016","UN",1,null,null,0,""]
["S",3,"S",0,1,4,1,0,0,0,0,"","Serviço","Serviço","-","SINAPI",93656,"DISJUNTOR MONOPOLAR TIPO DIN, CORRENTE NOMINAL DE 25A - FORNECIMENTO E INSTALAÇÃO. AF_04/2016","UN",10,null,null,0,""]
["S",3,"S",0,1,4,1,0,0,0,0,"","Serviço","Serviço","-","SINAPI",93654,"DISJUNTOR MONOPOLAR TIPO DIN, CORRENTE NOMINAL DE 16A - FORNECIMENTO E INSTALAÇÃO. AF_04/2016","UN",10,null,null,0,""]
["S",3,"S",0,1,4,1,0,0,0,0,"","Serviço","Serviço","-","SINAPI",93653,"DISJUNTOR MONOPOLAR TIPO DIN, CORRENTE NOMINAL DE 10A - FORNECIMENTO E INSTALAÇÃO. AF_04/2016","UN",18,null,null,0,""]
["S",3,"S",0,1,4,1,0,0,0,0,"","Serviço","Serviço","-","AGETOP",71184,"DISPOSITIVO DE PROTEÇÃO CONTRA SURTOS (D.P.S.) 275V DE 8 A 40KA","Un    ",3,null,null,0,""]
["S",3,"S",0,1,4,1,0,0,0,0,"","Serviço","Serviço","-","AGETOP",71451,"INTERRUPTOR DIFERENCIAL RESIDUAL (D.R.) BIPOLAR DE 40A-30mA","Un    ",6,null,null,0,""]
["S",3,"S",0,1,4,1,0,0,0,0,"","Serviço","Serviço","-","SINAPI",91926,"CABO DE COBRE FLEXÍVEL ISOLADO, 2,5 MM², ANTI-CHAMA 450/750 V, PARA CIRCUITOS TERMINAIS - FORNECIMENTO E INSTALAÇÃO. AF_12/2015","M",3176,null,null,0,"Referência: AGETOP - 70563"]
["S",3,"S",0,1,4,1,0,0,0,0,"","Serviço","Serviço","-","SINAPI",91928,"CABO DE COBRE FLEXÍVEL ISOLADO, 4 MM², ANTI-CHAMA 450/750 V, PARA CIRCUITOS TERMINAIS - FORNECIMENTO E INSTALAÇÃO. AF_12/2015","M",666.66,null,null,0,"Referência: AGETOP - 70564"]
["S",3,"S",0,1,4,1,0,0,0,0,"","Serviço","Serviço","-","SINAPI",91930,"CABO DE COBRE FLEXÍVEL ISOLADO, 6 MM², ANTI-CHAMA 450/750 V, PARA CIRCUITOS TERMINAIS - FORNECIMENTO E INSTALAÇÃO. AF_12/2015","M",105.84,null,null,0,"Referência: AGETOP - 70565"]
["S",3,"S",0,1,4,1,0,0,0,0,"","Serviço","Serviço","-","SINAPI",92979,"CABO DE COBRE FLEXÍVEL ISOLADO, 10 MM², ANTI-CHAMA 450/750 V, PARA DISTRIBUIÇÃO - FORNECIMENTO E INSTALAÇÃO. AF_12/2015","M",5.54,null,null,0,""]
["S",3,"S",0,1,4,1,0,0,{"$f":"IF(OR($C51=\"S\",$C51=0),0,MATCH(0,OFFSET($D51,1,$C51,ROW($C$205)-ROW($C51)),0))","v":0},{"$f":"IF(OR($C51=\"S\",$C51=0),0,MATCH(OFFSET($D51,0,$C51)+1,OFFSET($D51,1,$C51,ROW($C$205)-ROW($C51)),0))","v":0},"","Serviço","Serviço","-","SINAPI",92986,"CABO DE COBRE FLEXÍVEL ISOLADO, 35 MM², ANTI-CHAMA 0,6/1,0 KV, PARA DISTRIBUIÇÃO - FORNECIMENTO E INSTALAÇÃO. AF_12/2015","M",107.45,null,null,0,"Referência: AGETOP - 70512"]
["S",3,"S",0,1,4,1,0,0,0,0,"","Serviço","Serviço","-","SINAPI",92984,"CABO DE COBRE FLEXÍVEL ISOLADO, 25 MM², ANTI-CHAMA 0,6/1,0 KV, PARA DISTRIBUIÇÃO - FORNECIMENTO E INSTALAÇÃO. AF_12/2015","M",91.85,null,null,0,"Referência: AGETOP - 70511"]
["S",3,"S",0,1,4,1,0,0,0,0,"","Serviço","Serviço","-","AGETOP",70541,"CABO DE COBRE NU No. 16 MM2 (6,94 M/KG)","M     ",20,null,null,0,""]
["S",3,"S",0,1,4,1,0,0,0,0,"","Serviço","Serviço","-","SINAPI",91834,"ELETRODUTO FLEXÍVEL CORRUGADO, PVC, DN 25 MM (3/4\"), PARA CIRCUITOS TERMINAIS, INSTALADO EM FORRO - FORNECIMENTO E INSTALAÇÃO. AF_12/2015","M",712,null,null,0,"Referência: AGETOP - 71194"]
["S",3,"S",0,1,4,1,0,0,0,0,"","Serviço","Serviço","-","SINAPI",91836,"ELETRODUTO FLEXÍVEL CORRUGADO, PVC, DN 32 MM (1\"), PARA CIRCUITOS TERMINAIS, INSTALADO EM FORRO - FORNECIMENTO E INSTALAÇÃO. AF_12/2015","M",82,null,null,0,"Referência: AGETOP - 71195"]
["S",3,"S",0,1,4,1,0,0,0,0,"","Serviço","Serviço","-","AGETOP",71196,"ELETRODUTO PVC FLEXÍVEL - MANGUEIRA CORRUGADA REFORÇADA - DIAM. 40MM","M     ",56,null,null,0,""]
["S",3,"S",0,1,4,1,0,0,0,0,"","Serviço","Serviço","-","AGETOP",71197,"ELETRODUTO PVC FLEXÍVEL - MANGUEIRA CORRUGADA REFORÇADA - DIAM. 50MM","M     ",35,null,null,0,""]
["S",3,"S",0,1,4,1,0,0,0,0,"","Serviço","Serviço","-","SINAPI",91867,"ELETRODUTO RÍGIDO ROSCÁVEL, PVC, DN 25 MM (3/4\"), PARA CIRCUITOS TERMINAIS, INSTALADO EM LAJE - FORNECIMENTO E INSTALAÇÃO. AF_12/2015","M",107,null,null,0,"Referência: AGETOP - 71201"]
["S",3,"S",0,1,4,1,0,0,0,0,"","Serviço","Serviço","-","SINAPI",91868,"ELETRODUTO RÍGIDO ROSCÁVEL, PVC, DN 32 MM (1\"), PARA CIRCUITOS TERMINAIS, INSTALADO EM LAJE - FORNECIMENTO E INSTALAÇÃO. AF_12/2015","M",11,null,null,0,"Referência: AGETOP - 71202"]
["S",3,"S",0,1,4,1,0,0,0,0,"","Serviço","Serviço","-","SINAPI",93008,"ELETRODUTO RÍGIDO ROSCÁVEL, PVC, DN 50 MM (1 1/2\") - FORNECIMENTO E INSTALAÇÃO. AF_12/2015","M",9,null,null,0,""]
["S",3,"S",0,1,4,1,0,0,0,0,"","Serviço","Serviço","-","SINAPI",93009,"ELETRODUTO RÍGIDO ROSCÁVEL, PVC, DN 60 MM (2\") - FORNECIMENTO E INSTALAÇÃO. AF_12/2015","M",6,null,null,0,""]
["S",3,"S",0,1,4,1,0,0,0,0,"","Serviço","Serviço","-","AGETOP",70351,"BRACADEIRA METALICA TIPO \"U\" DIAM. 3/4\"","Un    ",71,null,null,0,""]
["S",3,"S",0,1,4,1,0,0,0,0,"","Serviço","Serviço","-","AGETOP",70352,"BRACADEIRA METALICA TIPO \"U\" DIAM. 1\"","Un    ",4,null,null,0,""]
["S",3,"S",0,1,4,1,0,0,0,0,"","Serviço","Serviço","-","AGETOP",70354,"BRACADEIRA METALICA TIPO \"U\" DIAM. 1.1/2\"","Un    ",3,null,null,0,""]
["S",3,"S",0,1,4,1,0,0,0,0,"","Serviço","Serviço","-","AGETOP",70355,"BRACADEIRA METALICA TIPO \"U\" DIAM. 2\"","Un    ",2,null,null,0,""]
["S",3,"S",0,1,4,1,0,0,0,0,"","Serviço","Serviço","-","SINAPI",91879,"LUVA PARA ELETRODUTO, PVC, ROSCÁVEL, DN 25 MM (3/4\"), PARA CIRCUITOS TERMINAIS, INSTALADA EM LAJE - FORNECIMENTO E INSTALAÇÃO. AF_12/2015","UN",71,null,null,0,"Referência: AGETOP - 71741"]
["S",3,"S",0,1,4,1,0,0,0,0,"","Serviço","Serviço","-","SINAPI",91880,"LUVA PARA ELETRODUTO, PVC, ROSCÁVEL, DN 32 MM (1\"), PARA CIRCUITOS TERMINAIS, INSTALADA EM LAJE - FORNECIMENTO E INSTALAÇÃO. AF_12/2015","UN",4,null,null,0,"Referência: AGETOP - 71742"]
["S",3,"S",0,1,4,1,0,0,0,0,"","Serviço","Serviço","-","SINAPI",93013,"LUVA PARA ELETRODUTO, PVC, ROSCÁVEL, DN 50 MM (1 1/2\") - FORNECIMENTO E INSTALAÇÃO. AF_12/2015","UN",3,null,null,0,"Referência: AGETOP - 71744"]
["S",3,"S",0,1,4,1,0,0,0,0,"","Serviço","Serviço","-","SINAPI",93014,"LUVA PARA ELETRODUTO, PVC, ROSCÁVEL, DN 60 MM (2\") - FORNECIMENTO E INSTALAÇÃO. AF_12/2015","UN",2,null,null,0,"Referência: AGETOP - 71745"]
["S",3,"S",0,1,4,1,0,0,0,0,"","Serviço","Serviço","-","SINAPI",91939,"CAIXA RETANGULAR 4\" X 2\" ALTA (2,00 M DO PISO), PVC, INSTALADA EM PAREDE - FORNECIMENTO E INSTALAÇÃO. AF_12/2015","UN",91,null,null,0,""]
["S",3,"S",0,1,4,1,0,0,0,0,"","Serviço","Serviço","-","SINAPI",91937,"CAIXA OCTOGONAL 3\" X 3\", PVC, INSTALADA EM LAJE - FORNECIMENTO E INSTALAÇÃO. AF_12/2015","UN",12,null,null,0,""]
["S",3,"S",0,1,4,1,0,0,0,0,"","Serviço","Serviço","-","SINAPI",95779,"CONDULETE DE ALUMÍNIO, TIPO E, PARA ELETRODUTO DE AÇO GALVANIZADO DN 20 MM (3/4''), APARENTE - FORNECIMENTO E INSTALAÇÃO. AF_11/2016_P","UN",26,null,null,0,""]
["S",3,"S",0,1,4,1,0,0,0,0,"","Serviço","Serviço","-","SINAPI",95777,"CONDULETE DE ALUMÍNIO, TIPO B, PARA ELETRODUTO DE AÇO GALVANIZADO DN 20 MM (3/4''), APARENTE - FORNECIMENTO E INSTALAÇÃO. AF_11/2016_P","UN",26,null,null,0,""]
["S",3,"S",0,1,4,1,0,0,0,0,"","Serviço","Serviço","-","SINAPI",95778,"CONDULETE DE ALUMÍNIO, TIPO C, PARA ELETRODUTO DE AÇO GALVANIZADO DN 20 MM (3/4''), APARENTE - FORNECIMENTO E INSTALAÇÃO. AF_11/2016_P","UN",8,null,null,0,""]
["S",3,"S",0,1,4,1,0,0,0,0,"","Serviço","Serviço","-","SINAPI",95795,"CONDULETE DE ALUMÍNIO, TIPO T, PARA ELETRODUTO DE AÇO GALVANIZADO DN 20 MM (3/4''), APARENTE - FORNECIMENTO E INSTALAÇÃO. AF_11/2016_P","UN",10,null,null,0,""]
["S",3,"S",0,1,4,1,0,0,0,0,"","Serviço","Serviço","-","SINAPI",95787,"CONDULETE DE ALUMÍNIO, TIPO LR, PARA ELETRODUTO DE AÇO GALVANIZADO DN 20 MM (3/4''), APARENTE - FORNECIMENTO E INSTALAÇÃO. AF_11/2016_P","UN",15,null,null,0,""]
["S",3,"S",0,1,4,1,0,0,0,0,"","Serviço","Serviço","-","SINAPI",95801,"CONDULETE DE ALUMÍNIO, TIPO X, PARA ELETRODUTO DE AÇO GALVANIZADO DN 20 MM (3/4''), APARENTE - FORNECIMENTO E INSTALAÇÃO. AF_11/2016_P","UN",15,null,null,0,"Referência: AGETOP - 70929"]
["S",3,"S",0,1,4,1,0,0,0,0,"","Serviço","Serviço","-","AGETOP",72395,"TAMPA CEGA PARA CONDULETE METÁLICO","Un    ",130,null,null,0,""]
["S",3,"S",0,1,4,1,0,0,0,0,"","Serviço","Serviço","-","SINAPI",91993,"TOMADA ALTA DE EMBUTIR (1 MÓDULO), 2P+T 20 A, INCLUINDO SUPORTE E PLACA - FORNECIMENTO E INSTALAÇÃO. AF_12/2015","UN",11,null,null,0,"Referência: AGETOP - 72585"]
["S",3,"S",0,1,4,1,0,0,0,0,"","Serviço","Serviço","-","SINAPI",91992,"TOMADA ALTA DE EMBUTIR (1 MÓDULO), 2P+T 10 A, INCLUINDO SUPORTE E PLACA - FORNECIMENTO E INSTALAÇÃO. AF_12/2015","UN",26,null,null,0,""]
["S",3,"S",0,1,4,1,0,0,0,0,"","Serviço","Serviço","-","SINAPI",91996,"TOMADA MÉDIA DE EMBUTIR (1 MÓDULO), 2P+T 10 A, INCLUINDO SUPORTE E PLACA - FORNECIMENTO E INSTALAÇÃO. AF_12/2015","UN",3,null,null,0,"Referência: AGETOP - 72578"]
["S",3,"S",0,1,4,1,0,0,0,0,"","Serviço","Serviço","-","SINAPI",92000,"TOMADA BAIXA DE EMBUTIR (1 MÓDULO), 2P+T 10 A, INCLUINDO SUPORTE E PLACA - FORNECIMENTO E INSTALAÇÃO. AF_12/2015","UN",42,null,null,0,"Referência: AGETOP - 72578"]
["S",3,"S",0,1,4,1,0,0,{"$f":"IF(OR($C83=\"S\",$C83=0),0,MATCH(0,OFFSET($D83,1,$C83,ROW($C$205)-ROW($C83)),0))","v":0},{"$f":"IF(OR($C83=\"S\",$C83=0),0,MATCH(OFFSET($D83,0,$C83)+1,OFFSET($D83,1,$C83,ROW($C$205)-ROW($C83)),0))","v":0},"","Serviço","Serviço","-","SINAPI",91961,"INTERRUPTOR PARALELO (2 MÓDULOS), 10A/250V, INCLUINDO SUPORTE E PLACA - FORNECIMENTO E INSTALAÇÃO. AF_12/2015","UN",3,null,null,0,""]
["S",3,"S",0,1,4,1,0,0,0,0,"","Serviço","Serviço","-","SINAPI",91953,"INTERRUPTOR SIMPLES (1 MÓDULO), 10A/250V, INCLUINDO SUPORTE E PLACA - FORNECIMENTO E INSTALAÇÃO. AF_12/2015","UN",7,null,null,0,"Referência: AGETOP - 71440"]
["S",3,"S",0,1,4,1,0,0,0,0,"","Serviço","Serviço","-","SINAPI",97585,"LUMINÁRIA TIPO CALHA, DE SOBREPOR, COM 2 LÂMPADAS TUBULARES DE 18 W - FORNECIMENTO E INSTALAÇÃO. AF_11/2017","UN",120,null,null,0,""]
["S",3,"S",0,1,4,1,0,0,0,0,"","Serviço","Serviço","-","SINAPI",97601,"REFLETOR EM ALUMÍNIO COM SUPORTE E ALÇA, LÂMPADA 250 W - FORNECIMENTO E INSTALAÇÃO. AF_11/2017","UN",9,null,null,0,""]
["S",3,"S",0,1,4,1,0,0,0,0,"","Serviço","Serviço","-","SINAPI","73831/5","LAMPADA MISTA DE 250W - FORNECIMENTO E INSTALACAO","UN",9,null,null,0,""]
["S",3,"S",0,1,4,1,0,0,0,0,"","Serviço","Serviço","-","AGETOP",71627,"LUMINÁRIA PARA JARDIM COM POSTE 2,50 M COM 02 GLOBOS - INCLUSO BASE DE CONCRETO PADRÃO AGETOP E FIXAÇÃO","un    ",7,null,null,0,""]
["S",3,"S",0,1,4,1,0,0,0,0,"","Serviço","Serviço","-","SINAPI","73831/5","LAMPADA MISTA DE 250W - FORNECIMENTO E INSTALACAO","UN",7,null,null,0,""]
["S",3,"S",0,1,4,1,0,0,0,0,"","Serviço","Serviço","-","SINAPI",97889,"CAIXA ENTERRADA ELÉTRICA RETANGULAR, EM ALVENARIA COM TIJOLOS CERÂMICOS MACIÇOS, FUNDO COM BRITA, DIMENSÕES INTERNAS: 0,8X0,8X0,6 M. AF_05/2018","UN",4,null,null,0,""]
["S",3,"S",0,1,4,1,0,0,0,0,"","Serviço","Serviço","-","SINAPI",6171,"TAMPA DE CONCRETO ARMADO 60X60X5CM PARA CAIXA","UN",4,null,null,0,""]
["S",3,"S",0,1,4,1,0,0,0,0,"","Serviço","Serviço","-","AGETOP",71861,"PARAFUSO P/BUCHA S-6","Un    ",320,null,null,0,""]
["S",3,"S",0,1,4,1,0,0,0,0,"","Serviço","Serviço","-","AGETOP",70391,"BUCHA DE NYLON S-6","Un    ",320,null,null,0,""]
["S",3,"S",0,1,4,1,0,0,0,0,"","Serviço","Serviço","-","AGETOP",20162,"DEMOLIÇÃO DAS INSTALAÇÕES ELÉTRICAS E AFINS C/ TRANSP. ATÉ CB. E CARGA","H     ",40,null,null,0,""]
["S",3,"S",0,1,4,1,0,0,0,0,"","Serviço","Serviço","-","AGETOP",71380,"HASTE REV.COBRE(COPPERWELD)  3/4\" X 2,40 M C/CONECTOR","Un    ",3,null,null,0,""]
["S",3,"S",0,1,4,1,0,0,0,0,"","Serviço","Serviço","-","AGETOP",71824,"PADRÃO TRIFASICO 35 MM H=7 METROS","Un    ",1,null,null,0,""]
["S",3,"S",0,1,4,1,0,0,0,0,"","Serviço","Serviço","-","AGETOP",70255,"ATERRAMENTO - SOLDA EXOTÉRMICA - CARTUCHO 90 G","un    ",3,null,null,0,""]
["S",3,"S",0,1,4,1,0,0,0,0,"","Serviço","Serviço","-","AGETOP",71331,"FITA ISOLANTE, ROLO DE 20,00 M","Un    ",5,null,null,0,""]
["S",3,"S",0,1,4,1,0,0,0,0,"","Serviço","Serviço","-","AGETOP",71321,"FITA DE AUTO FUSAO, ROLO E 10,00 MM","Un    ",5,null,null,0,""]
[3,3,3,12,1,4,2,0,0,12,{"$error":"#N/A"},"","Nível 3","Nível 3","-","SINAPI",null,"IMPLANTAÇÃO","-",null,null,null,0,""]
["S",3,"S",0,1,4,2,0,0,0,0,"","Serviço","Serviço","-","SINAPI","74131/4","QUADRO DE DISTRIBUICAO DE ENERGIA DE EMBUTIR, EM CHAPA METALICA, PARA 18 DISJUNTORES TERMOMAGNETICOS MONOPOLARES, COM BARRAMENTO TRIFASICO E NEUTRO, FORNECIMENTO E INSTALACAO","UN",1,null,null,0,""]
["S",3,"S",0,1,4,2,0,0,0,0,"","Serviço","Serviço","-","SINAPI",93670,"DISJUNTOR TRIPOLAR TIPO DIN, CORRENTE NOMINAL DE 25A - FORNECIMENTO E INSTALAÇÃO. AF_04/2016","UN",2,null,null,0,"Referência: AGETOP - 71173"]
["S",3,"S",0,1,4,2,0,0,0,0,"","Serviço","Serviço","-","SINAPI",91930,"CABO DE COBRE FLEXÍVEL ISOLADO, 6 MM², ANTI-CHAMA 450/750 V, PARA CIRCUITOS TERMINAIS - FORNECIMENTO E INSTALAÇÃO. AF_12/2015","M",456.83,null,null,0,"Referência: AGETOP - 70565"]
["S",3,"S",0,1,4,2,0,0,0,0,"","Serviço","Serviço","-","SINAPI",91864,"ELETRODUTO RÍGIDO ROSCÁVEL, PVC, DN 32 MM (1\"), PARA CIRCUITOS TERMINAIS, INSTALADO EM FORRO - FORNECIMENTO E INSTALAÇÃO. AF_12/2015","M",91.37,null,null,0,""]
["S",3,"S",0,1,4,2,0,0,0,0,"","Serviço","Serviço","-","SINAPI",91876,"LUVA PARA ELETRODUTO, PVC, ROSCÁVEL, DN 32 MM (1\"), PARA CIRCUITOS TERMINAIS, INSTALADA EM FORRO - FORNECIMENTO E INSTALAÇÃO. AF_12/2015","UN",31,null,null,0,""]
["S",3,"S",0,1,4,2,0,0,0,0,"","Serviço","Serviço","-","AGETOP",70352,"BRACADEIRA METALICA TIPO \"U\" DIAM. 1\"","Un    ",31,null,null,0,""]
["S",3,"S",0,1,4,2,0,0,0,0,"","Serviço","Serviço","-","SINAPI",97889,"CAIXA ENTERRADA ELÉTRICA RETANGULAR, EM ALVENARIA COM TIJOLOS CERÂMICOS MACIÇOS, FUNDO COM BRITA, DIMENSÕES INTERNAS: 0,8X0,8X0,6 M. AF_05/2018","UN",2,null,null,0,""]
["S",3,"S",0,1,4,2,0,0,0,0,"","Serviço","Serviço","-","SINAPI",6171,"TAMPA DE CONCRETO ARMADO 60X60X5CM PARA CAIXA","UN",2,null,null,0,""]
["S",3,"S",0,1,4,2,0,0,0,0,"","Serviço","Serviço","-","AGETOP",71861,"PARAFUSO P/BUCHA S-6","Un    ",124,null,null,0,""]
["S",3,"S",0,1,4,2,0,0,0,0,"","Serviço","Serviço","-","AGETOP",70391,"BUCHA DE NYLON S-6","Un    ",124,null,null,0,""]
["S",3,"S",0,1,4,2,0,0,0,0,"","Serviço","Serviço","-","AGETOP",71321,"FITA DE AUTO FUSAO, ROLO E 10,00 MM","Un    ",2,null,null,0,""]
[2,2,2,12,1,5,0,0,0,46,12,"","Nível 2","Nível 2","-",null,null,"INSTALAÇÕES ESPECIAIS","-",null,null,null,0,""]
[3,3,3,11,1,5,1,0,0,11,18,"","Nível 3","Nível 3","-","SINAPI",null,"INSTALAÇÕES DE INCENDIO","-",null,null,null,0,""]
["S",3,"S",0,1,5,1,0,0,0,0,"","Serviço","Serviço","-","AGETOP",85003,"EXTINTOR PO QUIMICO SECO (6 KG) - CAPACIDADE EXTINTORA 20 BC","Un    ",2,null,null,0,""]
["S",3,"S",0,1,5,1,0,0,{"$f":"IF(OR($C115=\"S\",$C115=0),0,MATCH(0,OFFSET($D115,1,$C115,ROW($C$205)-ROW($C115)),0))","v":0},{"$f":"IF(OR($C115=\"S\",$C115=0),0,MATCH(OFFSET($D115,0,$C115)+1,OFFSET($D115,1,$C115,ROW($C$205)-ROW($C115)),0))","v":0},"","Serviço","Serviço","-","AGETOP",85006,"EXTINTOR MULTI USO EM PO A B C (6 KG) - CAPACIDADE EXTINTORA 3A 20BC","un    ",6,null,null,0,""]
["S",3,"S",0,1,5,1,0,0,0,0,"","Serviço","Serviço","-","SINAPI",97599,"LUMINÁRIA DE EMERGÊNCIA - FORNECIMENTO E INSTALAÇÃO. AF_11/2017","UN",13,null,null,0,""]
["S",3,"S",0,1,5,1,0,0,0,0,"","Serviço","Serviço","-","COMPOSIÇÃO","COMP 024_SEE","SINALIZADOR FOTOLUMINESCENTE PARA EXTINTOR","UN ",8,null,null,0,""]
["S",3,"S",0,1,5,1,0,0,0,0,"","Serviço","Serviço","-","COMPOSIÇÃO","COMP 025_SEE","SINALIZADOR FOTOLUMINESCENTE DE EMERGÊNCIA","UN ",24,null,null,0,""]
["S",3,"S",0,1,5,1,0,0,0,0,"","Serviço","Serviço","-","COMPOSIÇÃO","COMP 277_SEE","MARCAÇÃO NO PISO - 1X1 M PARA EXTINTOR","M2",8,null,null,0,""]
["S",3,"S",0,1,5,1,0,0,0,0,"","Serviço","Serviço","-","COMPOSIÇÃO","COMP 235_SEE","PLACA DE SINALIZAÇÃO EM PVC COD 01 - (300X300) PROIBIDO FUMAR","UN ",1,null,null,0,""]
["S",3,"S",0,1,5,1,0,0,0,0,"","Serviço","Serviço","-","COMPOSIÇÃO","COMP 236_SEE","PLACA DE SINALIZAÇÃO EM PVC COD 06 - (300X300) PERIGO INFLAMÁVEL","UN ",1,null,null,0,""]
["S",3,"S",0,1,5,1,0,0,0,0,"","Serviço","Serviço","-","COMPOSIÇÃO","COMP 411_SEE","PLACA DE SINALIZAÇÃO EM PVC COD 13 - (316X158) SAÍDA DE EMERGÊNCIA","UN ",7,null,null,0,""]
["S",3,"S",0,1,5,1,0,0,0,0,"","Serviço","Serviço","-","COMPOSIÇÃO","COMP 412_SEE","PLACA DE SINALIZAÇÃO EM PVC COD 17 - (316X158) MENSAGEM \"SAÍDA\"","UN ",2,null,null,0,""]
[2,2,2,2,1,6,0,0,0,34,2,"","Nível 2","Nível 2","-",null,null,"FORROS","-",null,null,null,0,""]
["S",2,"S",0,1,6,0,0,0,0,0,"","Serviço","Serviço","-","AGETOP",210461,"FORRO DE PVC SEM ESTRUTURA DE METALON (COM REPINTURA DA ESTRUTURA COM TINTA ALQUÍDICA D.F.)","m2    ",545,null,null,0,""]
[2,2,2,8,1,7,0,0,0,32,8,"","Nível 2","Nível 2","-",null,null,"REVESTIMENTO DE PISO","-",null,null,null,0,""]
[3,3,3,4,1,7,1,0,0,7,4,"","Nível 3","Nível 3","-","SINAPI",null,"REFORMA DA QUADRA","-",null,null,null,0,""]
["S",3,"S",0,1,7,1,0,0,0,0,"","Serviço","Serviço","-","AGETOP",220101,"LASTRO DE CONCRETO REGULARIZADO IMPERMEABILIZADO 1:3:6 ESP=5CM (BASE)","m2    ",550,null,null,0,""]
["S",3,"S",0,1,7,1,0,0,0,0,"","Serviço","Serviço","-","SINAPI",84191,"PISO EM GRANILITE, MARMORITE OU GRANITINA ESPESSURA 8 MM, INCLUSO JUNTAS DE DILATACAO PLASTICAS","M2",550,null,null,0,"Referência: AGETOP - 221101"]
["S",3,"S",0,1,7,1,0,0,0,0,"","Serviço","Serviço","-","AGETOP",221104,"RASPAGEM E APLICAÇÃO RESINA ACRÍLICA DUAS DEMÃOS","m2    ",550,null,null,0,""]
[3,3,3,3,1,7,2,0,0,3,{"$error":"#N/A"},"","Nível 3","Nível 3","-","SINAPI",null,"ACESSIBILIDADE","-",null,null,null,0,""]
["S",3,"S",0,1,7,2,0,0,0,0,"","Serviço","Serviço","-","AGETOP",221120,"PISO DE BORRACHA COLORIDO MODELO TÁTIL ( ALERTA OU DIRECIONAL) INCLUSO CONTRAPISO (1CI:3ARML) C/ E=2CM E NATA DE CIMENTO","m2    ",10,null,null,0,""]
["S",3,"S",0,1,7,2,0,0,0,0,"","Serviço","Serviço","-","AGETOP",221126,"PISO DE LADRILHO HIDRÁULICO COLORIDO MODELO TÁTIL ( ALERTA OU DIRECIONAL) SEM LASTRO","m2    ",105,null,null,0,""]
[2,2,2,3,1,8,0,0,0,24,3,"","Nível 2","Nível 2","-",null,null,"FERRAGENS","-",null,null,null,0,""]
["S",2,"S",0,1,8,0,0,0,0,0,"","Serviço","Serviço","-","AGETOP",230174,"BARRA DE APOIO EM AÇO INOX - 40 CM","un    ",3,null,null,0,""]
["S",2,"S",0,1,8,0,0,0,0,0,"","Serviço","Serviço","-","AGETOP",230176,"BARRA DE APOIO EM AÇO INOX - 80 CM ","un    ",3,null,null,0,""]
[2,2,2,3,1,9,0,0,0,21,3,"","Nível 2","Nível 2","-",null,null,"ADMINISTRAÇÃO","-",null,null,null,0,""]
["S",2,"S",0,1,9,0,0,0,0,0,"","Serviço","Serviço","-","SINAPI",90778,"ENGENHEIRO CIVIL DE OBRA PLENO COM ENCARGOS COMPLEMENTARES","H",88,null,null,0,"Referência: AGETOP - 250101"]
["S",2,"S",0,1,9,0,0,0,0,0,"","Serviço","Serviço","-","SINAPI",90776,"ENCARREGADO GERAL COM ENCARGOS COMPLEMENTARES","H",440,null,null,0,"Referência: AGETOP - 250103"]
[2,2,2,12,1,10,0,0,0,18,12,"","Nível 2","Nível 2","-",null,null,"PINTURA","-",null,null,null,0,""]
[3,3,3,6,1,10,1,0,0,11,6,"","Nível 3","Nível 3","-","SINAPI",null,"PINTURA GERAL","-",null,null,null,0,""]
["S",3,"S",0,1,10,1,0,0,0,0,"","Serviço","Serviço","-","SINAPI",88497,"APLICAÇÃO E LIXAMENTO DE MASSA LÁTEX EM PAREDES, DUAS DEMÃOS. AF_06/2014","M2",400,null,null,0,"Referência: AGETOP - 261300"]
["S",3,"S",0,1,10,1,0,0,0,0,"","Serviço","Serviço","-","AGETOP",260104,"REMOCAO DE PINTURA ANTIGA A LATEX","m2    ",400,null,null,0,""]
["S",3,"S",0,1,10,1,0,0,0,0,"","Serviço","Serviço","-","SINAPI",88489,"APLICAÇÃO MANUAL DE PINTURA COM TINTA LÁTEX ACRÍLICA EM PAREDES, DUAS DEMÃOS. AF_06/2014","M2",1720,null,null,0,"Referência: AGETOP - 261001"]
["S",3,"S",0,1,10,1,0,0,0,0,"","Serviço","Serviço","-","AGETOP",261548,"PINTURA ESMALTE 1 DEMÃO EM PAREDE SEM SELADOR","m2    ",440,null,null,0,""]
["S",3,"S",0,1,10,1,0,0,0,0,"","Serviço","Serviço","-","AGETOP",261620,"LETREIRO MÉDIO A GRANDE PORTE EM PAREDE FEITO A PINCEL","m2    ",7.2,null,null,0,""]
[3,3,3,5,1,10,2,0,0,{"$f":"IF(OR($C147=\"S\",$C147=0),0,MATCH(0,OFFSET($D147,1,$C147,ROW($C$205)-ROW($C147)),0))","v":5},{"$f":"IF(OR($C147=\"S\",$C147=0),0,MATCH(OFFSET($D147,0,$C147)+1,OFFSET($D147,1,$C147,ROW($C$205)-ROW($C147)),0))","v":{"$error":"#N/A"}},"","Nível 3","Nível 3","-","SINAPI",null,"REFORMA DA QUADRA","-",null,null,null,0,""]
["S",3,"S",0,1,10,2,0,0,0,0,"","Serviço","Serviço","-","AGETOP",260104,"REMOCAO DE PINTURA ANTIGA A LATEX","m2    ",50,null,null,0,""]
["S",3,"S",0,1,10,2,0,0,0,0,"","Serviço","Serviço","-","SINAPI",88497,"APLICAÇÃO E LIXAMENTO DE MASSA LÁTEX EM PAREDES, DUAS DEMÃOS. AF_06/2014","M2",50,null,null,0,"Referência: AGETOP - 261300"]
["S",3,"S",0,1,10,2,0,0,0,0,"","Serviço","Serviço","-","SINAPI",88489,"APLICAÇÃO MANUAL DE PINTURA COM TINTA LÁTEX ACRÍLICA EM PAREDES, DUAS DEMÃOS. AF_06/2014","M2",175,null,null,0,"Referência: AGETOP - 261001"]
["S",3,"S",0,1,10,2,0,0,0,0,"","Serviço","Serviço","-","SINAPI",41595,"PINTURA ACRILICA DE FAIXAS DE DEMARCACAO EM QUADRA POLIESPORTIVA, 5 CM DE LARGURA","M",320,null,null,0,"Referência: AGETOP - 261700"]
[2,2,2,6,1,11,0,0,0,6,{"$error":"#N/A"},"","Nível 2","Nível 2","-",null,null,"DIVERSOS","-",null,null,null,0,""]
["S",2,"S",0,1,11,0,0,0,0,0,"","Serviço","Serviço","-","AGETOP",271099,"TABELA PARA BASQUETE ESTRUTURA METÁLICA E COMPENSADO (ASSENT./PINTADAS) ARO METÁLICO - 2 UNID.","CJ    ",1,null,null,0,""]
["S",2,"S",0,1,11,0,0,0,0,0,"","Serviço","Serviço","-","AGETOP",271101,"TRAVES FERRO GALVANIZADO PARA FUTEBOL DE SALÃO PINTADAS - 3,00 x 2,00M - 2 UNID.","CJ    ",1,null,null,0,""]
["S",2,"S",0,1,11,0,0,0,0,0,"","Serviço","Serviço","-","AGETOP",271103,"CONJUNTO PARA VOLEIBOL EM FERRO GALVANIZADO COM PINTURA (2 SUPORTES)","CJ    ",1,null,null,0,""]
["S",2,"S",0,1,11,0,0,0,0,0,"","Serviço","Serviço","-","AGETOP",270889,"SUPORTE PADRÃO PARA TABELA BASQUETE EM \"U\" ENRIJECIDO- 2 UNID. (ASSENTADOS/PINTADOS)","CJ    ",1,null,null,0,""]
["S",2,"S",0,1,11,0,0,0,0,0,"","Serviço","Serviço","-","AGETOP",270501,"LIMPEZA FINAL DE OBRA - (OBRAS CIVIS)","m2    ",200,null,null,0,""]
[1,1,1,47,2,0,0,0,0,47,{"$error":"#N/A"},"F","Nível 1","Nível 1","2.","AGETOP",null,"COBERTURA DE QUADRA PEQUENA FNDE","-",null,null,null,0,""]
[2,2,2,2,2,1,0,0,0,46,2,"","Nível 2","Nível 2","-","AGETOP",null,"SERVIÇOS PRELIMINARES","-",null,null,null,0,""]
["S",2,"S",0,2,1,0,0,0,0,0,"","Serviço","Serviço","-","AGETOP",20701,"LOCAÇÃO DA OBRA, EXECUÇÃO DE GABARITO SEM REAPROVEITAMENTO, INCLUSO PINTURA (FACE INTERNA DO RIPÃO 15CM) E PIQUETE COM TESTEMUNHA","m2    ",627,null,null,0,""]
[2,2,2,4,2,2,0,0,0,44,4,"","Nível 2","Nível 2","-","AGETOP",null,"SERVIÇO EM TERRA","-",null,null,null,0,""]
["S",2,"S",0,2,2,0,0,0,0,0,"","Serviço","Serviço","-","SINAPI",96522,"ESCAVAÇÃO MANUAL PARA BLOCO DE COROAMENTO OU SAPATA, SEM PREVISÃO DE FÔRMA. AF_06/2017","M3",57.18,null,null,0,"Referência: AGETOP - 50901"]
["S",2,"S",0,2,2,0,0,0,0,0,"","Serviço","Serviço","-","AGETOP",50902,"APILOAMENTO (BLOCOS/SAPATAS)","m2    ",51.28,null,null,0,""]
["S",2,"S",0,2,2,0,0,0,0,0,"","Serviço","Serviço","-","SINAPI",96995,"REATERRO MANUAL APILOADO COM SOQUETE. AF_10/2017","M3",35.299999999999997,null,null,0,"Referência: AGETOP - 40902"]
[2,2,2,4,2,3,0,0,0,40,4,"","Nível 2","Nível 2","-","AGETOP",null,"FUNDAÇÕES E SONDAGENS","-",null,null,null,0,""]
["S",2,"S",0,2,3,0,0,0,0,0,"","Serviço","Serviço","-","AGETOP",51009,"FORMA TABUA PINHO P/FUNDACOES U=3V - (OBRAS CIVIS)","m2    ",106.13,null,null,0,""]
["S",2,"S",0,2,3,0,0,0,0,0,"","Serviço","Serviço","-","SINAPI",95240,"LASTRO DE CONCRETO MAGRO, APLICADO EM PISOS OU RADIERS, ESPESSURA DE 3 CM. AF_07/2016","M2",28.84,null,null,0,""]
["S",2,"S",0,2,3,0,0,0,0,0,"","Serviço","Serviço","-","SINAPI",94964,"CONCRETO FCK = 20MPA, TRAÇO 1:2,7:3 (CIMENTO/ AREIA MÉDIA/ BRITA 1)  - PREPARO MECÂNICO COM BETONEIRA 400 L. AF_07/2016","M3",24.07,null,null,0,""]
[2,2,2,19,2,4,0,0,0,36,19,"","Nível 2","Nível 2","-",null,null,"INSTALAÇÕES ELÉTRICAS","-",null,null,null,0,""]
["S",2,"S",0,2,4,0,0,0,0,0,"","Serviço","Serviço","-","AGETOP",70371,"BRACADEIRA METALICA TIPO \"D\" DIAM. 3/4\"","Un    ",40,null,null,0,""]
["S",2,"S",0,2,4,0,0,0,0,0,"","Serviço","Serviço","-","AGETOP",70372,"BRACADEIRA METALICA TIPO \"D\" DIAM. 1\"","Un    ",4,null,null,0,""]
["S",2,"S",0,2,4,0,0,0,0,0,"","Serviço","Serviço","-","SINAPI",91927,"CABO DE COBRE FLEXÍVEL ISOLADO, 2,5 MM², ANTI-CHAMA 0,6/1,0 KV, PARA CIRCUITOS TERMINAIS - FORNECIMENTO E INSTALAÇÃO. AF_12/2015","M",330,null,null,0,"Referência: AGETOP - 70581"]
["S",2,"S",0,2,4,0,0,0,0,0,"","Serviço","Serviço","-","SINAPI",96973,"CORDOALHA DE COBRE NU 35 MM², NÃO ENTERRADA, COM ISOLADOR - FORNECIMENTO E INSTALAÇÃO. AF_12/2017","M",8,null,null,0,""]
["S",2,"S",0,2,4,0,0,0,0,0,"","Serviço","Serviço","-","AGETOP",71381,"HASTE REV.COBRE(COPPERWELD)  5/8\" X 3,00 M C/CONECTOR","Un    ",4,null,null,0,""]
["S",2,"S",0,2,4,0,0,0,0,0,"","Serviço","Serviço","-","SINAPI",95811,"CONDULETE DE PVC, TIPO LB, PARA ELETRODUTO DE PVC SOLDÁVEL DN 25 MM (3/4''), APARENTE - FORNECIMENTO E INSTALAÇÃO. AF_11/2016","UN",5,null,null,0,""]
["S",2,"S",0,2,4,0,0,0,0,0,"","Serviço","Serviço","-","SINAPI",95795,"CONDULETE DE ALUMÍNIO, TIPO T, PARA ELETRODUTO DE AÇO GALVANIZADO DN 20 MM (3/4''), APARENTE - FORNECIMENTO E INSTALAÇÃO. AF_11/2016_P","UN",4,null,null,0,""]
["S",2,"S",0,2,4,0,0,0,0,0,"","Serviço","Serviço","-","SINAPI",95801,"CONDULETE DE ALUMÍNIO, TIPO X, PARA ELETRODUTO DE AÇO GALVANIZADO DN 20 MM (3/4''), APARENTE - FORNECIMENTO E INSTALAÇÃO. AF_11/2016_P","UN",1,null,null,0,"Referência: AGETOP - 70929"]
["S",2,"S",0,2,4,0,0,0,0,0,"","Serviço","Serviço","-","SINAPI",93660,"DISJUNTOR BIPOLAR TIPO DIN, CORRENTE NOMINAL DE 10A - FORNECIMENTO E INSTALAÇÃO. AF_04/2016","UN",5,null,null,0,""]
["S",2,"S",0,2,4,0,0,0,{"$f":"IF(OR($C179=\"S\",$C179=0),0,MATCH(0,OFFSET($D179,1,$C179,ROW($C$205)-ROW($C179)),0))","v":0},{"$f":"IF(OR($C179=\"S\",$C179=0),0,MATCH(OFFSET($D179,0,$C179)+1,OFFSET($D179,1,$C179,ROW($C$205)-ROW($C179)),0))","v":0},"","Serviço","Serviço","-","SINAPI",93669,"DISJUNTOR TRIPOLAR TIPO DIN, CORRENTE NOMINAL DE 20A - FORNECIMENTO E INSTALAÇÃO. AF_04/2016","UN",1,null,null,0,""]
["S",2,"S",0,2,4,0,0,0,0,0,"","Serviço","Serviço","-","SINAPI",95749,"ELETRODUTO DE AÇO GALVANIZADO, CLASSE LEVE, DN 20 MM (3/4\u0092\u0092), APARENTE, INSTALADO EM PAREDE - FORNECIMENTO E INSTALAÇÃO. AF_11/2016_P","M",70,null,null,0,"Referência: AGETOP - 71211"]
["S",2,"S",0,2,4,0,0,0,0,0,"","Serviço","Serviço","-","SINAPI",95750,"ELETRODUTO DE AÇO GALVANIZADO, CLASSE LEVE, DN 25 MM (1\u0092\u0092), APARENTE, INSTALADO EM PAREDE - FORNECIMENTO E INSTALAÇÃO. AF_11/2016_P","M",10,null,null,0,""]
["S",2,"S",0,2,4,0,0,0,0,0,"","Serviço","Serviço","-","AGETOP",71381,"HASTE REV.COBRE(COPPERWELD)  5/8\" X 3,00 M C/CONECTOR","Un    ",4,null,null,0,""]
["S",2,"S",0,2,4,0,0,0,0,0,"","Serviço","Serviço","-","AGETOP",71609,"LUMINÁRIA BLINDADA PARA TETO COM GRADE ( MÉDIA ) - BASE E-27","Un    ",10,null,null,0,""]
["S",2,"S",0,2,4,0,0,0,0,0,"","Serviço","Serviço","-","SINAPI","73831/6","LAMPADA MISTA DE 500W - FORNECIMENTO E INSTALACAO","UN",10,null,null,0,""]
["S",2,"S",0,2,4,0,0,0,0,0,"","Serviço","Serviço","-","AGETOP",71701,"LUVA EM AÇO GALVANIZADO DIÂMETRO 3/4\"","Un    ",10,null,null,0,""]
["S",2,"S",0,2,4,0,0,0,0,0,"","Serviço","Serviço","-","AGETOP",71702,"LUVA  EM AÇO GALVANIZADO DIÂMETRO 1\"","Un    ",2,null,null,0,""]
["S",2,"S",0,2,4,0,0,0,0,0,"","Serviço","Serviço","-","SINAPI","74131/4","QUADRO DE DISTRIBUICAO DE ENERGIA DE EMBUTIR, EM CHAPA METALICA, PARA 18 DISJUNTORES TERMOMAGNETICOS MONOPOLARES, COM BARRAMENTO TRIFASICO E NEUTRO, FORNECIMENTO E INSTALACAO","UN",1,null,null,0,""]
[2,2,2,6,2,5,0,0,0,17,6,"","Nível 2","Nível 2","-","AGETOP",null,"INSTALAÇÕES HIDROSSANITÁRIAS","-",null,null,null,0,""]
[3,3,3,5,2,5,1,0,0,5,{"$error":"#N/A"},"","Nível 3","Nível 3","-","SINAPI",null,"DRENAGEM PLUVIAL","-",null,null,null,0,""]
["S",3,"S",0,2,5,1,0,0,0,0,"","Serviço","Serviço","-","SINAPI",94228,"CALHA EM CHAPA DE AÇO GALVANIZADO NÚMERO 24, DESENVOLVIMENTO DE 50 CM, INCLUSO TRANSPORTE VERTICAL. AF_07/2019","M",64.319999999999993,null,null,0,"Referência: AGETOP - 160601"]
["S",3,"S",0,2,5,1,0,0,0,0,"","Serviço","Serviço","-","SINAPI",89580,"TUBO PVC, SÉRIE R, ÁGUA PLUVIAL, DN 150 MM, FORNECIDO E INSTALADO EM CONDUTORES VERTICAIS DE ÁGUAS PLUVIAIS. AF_12/2014","M",22,null,null,0,""]
["S",3,"S",0,2,5,1,0,0,0,0,"","Serviço","Serviço","-","SINAPI",89590,"JOELHO 90 GRAUS, PVC, SERIE R, ÁGUA PLUVIAL, DN 150 MM, JUNTA ELÁSTICA, FORNECIDO E INSTALADO EM CONDUTORES VERTICAIS DE ÁGUAS PLUVIAIS. AF_12/2014","UN",12,null,null,0,""]
["S",3,"S",0,2,5,1,0,0,0,0,"","Serviço","Serviço","-","COMPOSIÇÃO","COMP 074_SEE"," RALO SEMI-ESFERICO FoFo TP ABACAXI D = 150MM ","UN ",4,null,null,0,""]
[2,2,2,2,2,6,0,0,0,11,2,"","Nível 2","Nível 2","-","SINAPI",null,"ESTRUTURAS METÁLICAS","-",null,null,null,0,""]
["S",2,"S",0,2,6,0,0,0,0,0,"","Serviço","Serviço","-","AGETOP",150103,"ESTRUTURA METÁLICA CONVENCIONAL EM AÇO DO TIPO USI SAC-300 COM FUNDO ANTICORROSIVO","Kg    ",7740,null,null,0,""]
[2,2,2,5,2,7,0,0,0,9,5,"","Nível 2","Nível 2","-","SINAPI",null,"COBERTURAS","-",null,null,null,0,""]
["S",2,"S",0,2,7,0,0,0,0,0,"","Serviço","Serviço","-","AGETOP",160966,"COBERTURA COM TELHA GALVANIZADA ONDULADA 0,5 MM COM ACESSÓRIOS","m2    ",594.86,null,null,0,""]
["S",2,"S",0,2,7,0,0,0,0,0,"","Serviço","Serviço","-","AGETOP",160970,"FECHAMENTO LATERAL COM TELHA GALVANIZADA TRAPEZOIDAL 0,43 MM COM ACESSÓRIOS","m2    ",248.16,null,null,0,""]
["S",2,"S",0,2,7,0,0,0,0,0,"","Serviço","Serviço","-","SINAPI",94449,"TELHAMENTO COM TELHA ONDULADA DE FIBRA DE VIDRO E = 0,6 MM, PARA TELHADO COM INCLINAÇÃO MAIOR QUE 10°, COM ATÉ 2 ÁGUAS, INCLUSO IÇAMENTO. AF_07/2019","M2",61.2,null,null,0,""]
["S",2,"S",0,2,7,0,0,0,0,0,"","Serviço","Serviço","-","SINAPI",94964,"CONCRETO FCK = 20MPA, TRAÇO 1:2,7:3 (CIMENTO/ AREIA MÉDIA/ BRITA 1)  - PREPARO MECÂNICO COM BETONEIRA 400 L. AF_07/2016","M3",5.4,null,null,0,""]
[2,2,2,2,2,8,0,0,0,4,2,"","Nível 2","Nível 2","-","SINAPI",null,"PINTURA","-",null,null,null,0,""]
["S",2,"S",0,2,8,0,0,0,0,0,"","Serviço","Serviço","-","SINAPI","74145/1","PINTURA ESMALTE FOSCO, DUAS DEMAOS, SOBRE SUPERFICIE METALICA, INCLUSO UMA DEMAO DE FUNDO ANTICORROSIVO. UTILIZACAO DE REVOLVER ( AR-COMPRIMIDO).","M2",594.86,null,null,0,"Referência: AGETOP - 261602"]
[2,2,2,2,2,9,0,0,0,2,{"$error":"#N/A"},"","Nível 2","Nível 2","-",null,null,"DIVERSOS","-",null,null,null,0,""]
["S",2,"S",0,2,9,0,0,0,0,0,"","Serviço","Serviço","-","AGETOP",270501,"LIMPEZA FINAL DE OBRA - (OBRAS CIVIS)","m2    ",627,null,null,0,""]
[-1,null,-1,null,0,0,0,0,0,null,null,"F"]
[null,null,null,null,null,null,null,null,null,null,null,"F",null,null,null,null,null,"OBS: OS QUANTITATIVOS DE MATERIAIS  DAS INSTALAÇÕES HIDROSSANITÁRIAS, ELÉTRICAS E ESPECIAIS SÃO FORNECIDOS PELOS PROFISSIONAIS RESPONSÁVEIS PELOS RESPECTIVOS PROJETOS.",null,null,"VALOR TOTAL",null,0]
[null,null,null,null,null,null,null,null,null,null,null,"F",null,null,null,null,null,null,null,null,"VALOR BDI (20,35%)",null,0]
[null,null,null,null,null,null,null,null,null,null,null,"F",null,null,null,null,null,null,null,null,"TOTAL ORÇAMENTO",null,0]
[null,null,null,null,null,null,null,null,null,null,null,"F"]
[null,null,null,null,null,null,null,null,null,null,null,"F",null,null,null,null,null,null,null,null,"CUSTO POR M2 ³",null,0]
[null,null,null,null,null,null,null,null,null,null,null,"F",null,null,null,null,null,null,null,null,"MATERIAL S/ BDI",null,0]
[null,null,null,null,null,null,null,null,null,null,null,"F",null,null,null,null,null,null,null,null,"MÃO DE OBRA S/ BDI",null,0]
[null,null,null,null,null,null,null,null,null,null,null,"F"]
[null,null,null,null,null,null,null,null,null,null,null,"F",null,null,null,null,"(1) Conforme previsto pelo DECRETO Nº 7.983, DE 8 DE ABRIL DE 2013, os preços adotados são aqueles constantes dos sistemas de referência indicados. Justifica-se o uso dos preços destas composições de custos unitários devido ao seu valor ser menor à mediana de seus correspondentes na tabela SINAPI;"]
[null,null,null,null,null,null,null,null,null,null,null,"F",null,null,null,null,"(2) Optou-se pelo uso das composições de custos da AGETOP para itens não presentes na SINAPI;"]
[null,null,null,null,null,null,null,null,null,null,null,"F",null,null,null,null,"(3) Para itens da AGETOP, os vidros não estão inclusos nas esquadrias e já foram considerados os custos de contramarco para as esquadrias de alumínio;"]
[null,null,null,null,null,null,null,null,null,null,null,"F",null,null,null,null,"(4) Nos casos em que houver execução de granitina e omissão do item AGETOP 221102, considerou-se que o quantitativo para o rodapé, de altura igual a 7cm, foi incorporado na área de piso;"]
[null,null,null,null,null,null,null,null,null,null,null,"F",null,null,null,null,"(5) O custo unitário aproximado por metro quadrado é calculado dividindo-se o valor total do orçamento pela área total de construção."]
[null,null,null,null,null,null,null,null,null,null,null,"F"]
[null,null,null,null,null,null,null,null,null,null,null,"F"]
[]
[null,null,null,null,null,null,null,null,null,null,null,null,null,null,"SOMATÓRIO DE SERVIÇOS"]
[null,null,null,null,null,null,null,null,null,null,null,null,null,null,"ITEM","DESCRIÇÃO DOS SERVIÇOS",null,null,"PREÇO SEM BDI",null,null,"PREÇO COM BDI",null,"PARTICIPAÇÃO ( % )"]
[null,null,null,null,null,null,null,null,null,null,null,null,null,null,"a.","SERVIÇOS PRELIMINARES",null,null,{"$f":"SUMIF($R$19:$R$205,$P224,$W$19:$W$205)","v":0},null,null,{"$f":"ROUND(S224*(1+BDI.Taxa),2)","v":0},null,{"$f":"IFERROR(ROUND($V224*100/$W$208,2),0)","v":0}]
[null,null,null,null,null,null,null,null,null,null,null,null,null,null,"b.","TRANSPORTES",null,null,0,null,null,0,null,{"$f":"IFERROR(ROUND($V225*100/$W$208,2),0)","v":0}]
[null,null,null,null,null,null,null,null,null,null,null,null,null,null,"c.","SERVIÇO EM TERRA",null,null,0,null,null,0,null,0]
[null,null,null,null,null,null,null,null,null,null,null,null,null,null,"d.","FUNDAÇÕES E SONDAGENS",null,null,0,null,null,0,null,0]
[null,null,null,null,null,null,null,null,null,null,null,null,null,null,"e.","ESTRUTURA",null,null,0,null,null,0,null,0]
[null,null,null,null,null,null,null,null,null,null,null,null,null,null,"f.","INSTALAÇÕES ELÉTRICAS",null,null,0,null,null,0,null,0]
[null,null,null,null,null,null,null,null,null,null,null,null,null,null,"g.","INSTALAÇÕES HIDROSSANITÁRIAS",null,null,0,null,null,0,null,0]
[null,null,null,null,null,null,null,null,null,null,null,null,null,null,"h","INSTALAÇÕES ESPECIAIS",null,null,0,null,null,0,null,0]
[null,null,null,null,null,null,null,null,null,null,null,null,null,null,"i.","ALVENARIAS E DIVISÓRIAS",null,null,0,null,null,0,null,0]
[null,null,null,null,null,null,null,null,null,null,null,null,null,null,"j.","ALVENARIA AUTO-PORTANTE",null,null,0,null,null,0,null,0]
[null,null,null,null,null,null,null,null,null,null,null,null,null,null,"k.","IMPERMEABILIZAÇÃO",null,null,0,null,null,0,null,0]
[null,null,null,null,null,null,null,null,null,null,null,null,null,null,"l.","ISOLAMENTO TÉRMICO E ACÚSTICO",null,null,0,null,null,0,null,0]
[null,null,null,null,null,null,null,null,null,null,null,null,null,null,"m.","ESTRUTURA DE MADEIRA",null,null,0,null,null,0,null,0]
[null,null,null,null,null,null,null,null,null,null,null,null,null,null,"n.","ESTRUTURAS METÁLICAS",null,null,0,null,null,0,null,0]
[null,null,null,null,null,null,null,null,null,null,null,null,null,null,"o.","COBERTURAS",null,null,0,null,null,0,null,0]
[null,null,null,null,null,null,null,null,null,null,null,null,null,null,"p.","ESQUADRIAS DE MADEIRA",null,null,0,null,null,0,null,0]
[null,null,null,null,null,null,null,null,null,null,null,null,null,null,"q.","ESQUADRIAS METÁLICAS",null,null,0,null,null,{"$f":"ROUND(S240*(1+BDI.Taxa),2)","v":0},null,0]
[null,null,null,null,null,null,null,null,null,null,null,null,null,null,"r.","VIDROS",null,null,0,null,null,0,null,0]
[null,null,null,null,null,null,null,null,null,null,null,null,null,null,"s.","REVESTIMENTO DE PAREDE",null,null,0,null,null,0,null,0]
[null,null,null,null,null,null,null,null,null,null,null,null,null,null,"t.","FORROS",null,null,0,null,null,0,null,0]
[null,null,null,null,null,null,null,null,null,null,null,null,null,null,"u.","REVESTIMENTO DE PISO",null,null,0,null,null,0,null,0]
[null,null,null,null,null,null,null,null,null,null,null,null,null,null,"v.","FERRAGENS",null,null,0,null,null,0,null,0]
[null,null,null,null,null,null,null,null,null,null,null,null,null,null,"w.","MARCENARIA",null,null,0,null,null,0,null,0]
[null,null,null,null,null,null,null,null,null,null,null,null,null,null,"x.","ADMINISTRAÇÃO",null,null,0,null,null,0,null,0]
[null,null,null,null,null,null,null,null,null,null,null,null,null,null,"y.","PINTURA",null,null,0,null,null,{"$f":"ROUND(S248*(1+BDI.Taxa),2)","v":0},null,0]
[null,null,null,null,null,null,null,null,null,null,null,null,null,null,"z.","DIVERSOS",null,null,0,null,null,{"$f":"IF(S249>0,IF((SUM(V224:W248)+ROUND(S249*(1+BDI.Taxa),2))<>V251,V251-SUM(V224:W248),ROUND(S249*(1+BDI.Taxa),2)),0)","v":0},null,{"$f":"IF(S249>0,IF((SUM(X224:X248)+IFERROR(ROUND($V249*100/$W$208,2),0))<>X251,X251-SUM(X224:X248),IFERROR(ROUND($V249*100/$W$208,2),0)),0)","v":0}]
[null,null,null,null,null,null,null,null,null,null,null,null,null,null,"TOTAL GERAL DO ORÇAMENTO (R$)",null,null,null,{"$f":"SUM(S224:U249)","v":0},null,null,{"$f":"SUM(V224:W249)","v":0},null,{"$f":"SUM(X224:X249)","v":0}]
[null,null,null,null,null,null,null,null,null,null,null,null,null,null,null,null,null,null,{"$f":"$W$206","v":0},null,null,{"$f":"$W$208","v":0},null,100]
[null,null,null,null,null,null,null,null,null,null,null,null,null,null,null,null,null,null,"(TOTAL SEM BDI)",null,null,"(TOTAL COM BDI)",null,"(ARRED porcentagem)"]
[null,null,null,null,null,null,null,null,null,null,null,null,null,null,null,null,null,null,{"$f":"IF(AND(S250=S251,S250>0),\"OK\",\"ERRO\")","v":"ERRO"},null,null,{"$f":"IF(AND(V250=V251,V250>0),\"OK\",\"ERRO\")","v":"ERRO"},null,{"$f":"IF(X250=100,\"OK\",\"ERRO\")","v":"ERRO"}]
[]
[]
[null,null,null,null,null,null,null,null,null,null,null,null,null,null,"RESUMO GERAL DO ORÇAMENTO"]
[null,null,null,null,null,null,null,null,null,null,null,null,null,null,"ITEM","DESCRIÇÃO DOS SERVIÇOS",null,null,"PREÇO SEM BDI",null,null,"PREÇO COM BDI",null,"PARTICIPAÇÃO ( % )"]
[null,null,null,null,null,null,null,null,null,null,null,null,null,null,"1.",{"$f":"IFERROR(VLOOKUP(O258,$O$19:$W$205,4,FALSE),\"\")","v":"AMPLIAÇÃO E REFORMA"},null,null,{"$f":"IF(P259=\"\",$S$279-SUM(OFFSET($S$257:S257,0,0,COUNTA($S$257:S257),1)),SUMIF($R$19:$R$205,$P258,$W$19:$W$205))","v":0},null,null,{"$f":"IF(P259=\"\",$V$279-SUM(OFFSET($V$257:V257,0,0,COUNTA($V$257:V257),1)),ROUND(S258*(1+BDI.Taxa),2))","v":0},null,{"$f":"IF(P259=\"\",$X$279-SUM(OFFSET($X$257:X257,0,0,COUNTA($X$257:X257),1)),ROUND(V258*100/ORÇAMENTO.TotalOrçamento,2))","v":{"$error":"#DIV/0!"}}]
[null,null,null,null,null,null,null,null,null,null,null,null,null,null,"2.","COBERTURA DE QUADRA PEQUENA FNDE",null,null,{"$f":"IF(P260=\"\",$S$279-SUM(OFFSET($S$257:S258,0,0,COUNTA($S$257:S258),1)),SUMIF($R$19:$R$205,$P259,$W$19:$W$205))","v":0},null,null,{"$f":"IF(P260=\"\",$V$279-SUM(OFFSET($V$257:V258,0,0,COUNTA($V$257:V258),1)),ROUND(S259*(1+BDI.Taxa),2))","v":0},null,{"$f":"IF(P260=\"\",$X$279-SUM(OFFSET($X$257:X258,0,0,COUNTA($X$257:X258),1)),ROUND(V259*100/ORÇAMENTO.TotalOrçamento,2))","v":{"$error":"#DIV/0!"}}]
[null,null,null,null,null,null,null,null,null,null,null,null,null,null,"3.","",null,null,{"$f":"IF(P261=\"\",$S$279-SUM(OFFSET($S$257:S259,0,0,COUNTA($S$257:S259),1)),SUMIF($R$19:$R$205,$P260,$W$19:$W$205))","v":0},null,null,{"$f":"IF(P261=\"\",$V$279-SUM(OFFSET($V$257:V259,0,0,COUNTA($V$257:V259),1)),ROUND(S260*(1+BDI.Taxa),2))","v":0},null,{"$f":"IF(P261=\"\",$X$279-SUM(OFFSET($X$257:X259,0,0,COUNTA($X$257:X259),1)),ROUND(V260*100/ORÇAMENTO.TotalOrçamento,2))","v":{"$error":"#DIV/0!"}}]
[null,null,null,null,null,null,null,null,null,null,null,null,null,null,"4.","",null,null,{"$f":"IF(P262=\"\",$S$279-SUM(OFFSET($S$257:S260,0,0,COUNTA($S$257:S260),1)),SUMIF($R$19:$R$205,$P261,$W$19:$W$205))","v":0},null,null,{"$f":"IF(P262=\"\",$V$279-SUM(OFFSET($V$257:V260,0,0,COUNTA($V$257:V260),1)),ROUND(S261*(1+BDI.Taxa),2))","v":0},null,{"$f":"IF(P262=\"\",$X$279-SUM(OFFSET($X$257:X260,0,0,COUNTA($X$257:X260),1)),ROUND(V261*100/ORÇAMENTO.TotalOrçamento,2))","v":{"$error":"#DIV/0!"}}]
[null,null,null,null,null,null,null,null,null,null,null,null,null,null,"5.","",null,null,{"$f":"IF(P263=\"\",$S$279-SUM(OFFSET($S$257:S261,0,0,COUNTA($S$257:S261),1)),SUMIF($R$19:$R$205,$P262,$W$19:$W$205))","v":0},null,null,{"$f":"IF(P263=\"\",$V$279-SUM(OFFSET($V$257:V261,0,0,COUNTA($V$257:V261),1)),ROUND(S262*(1+BDI.Taxa),2))","v":0},null,{"$f":"IF(P263=\"\",$X$279-SUM(OFFSET($X$257:X261,0,0,COUNTA($X$257:X261),1)),ROUND(V262*100/ORÇAMENTO.TotalOrçamento,2))","v":{"$error":"#DIV/0!"}}]
[null,null,null,null,null,null,null,null,null,null,null,null,null,null,"6.","",null,null,{"$f":"IF(P264=\"\",$S$279-SUM(OFFSET($S$257:S262,0,0,COUNTA($S$257:S262),1)),SUMIF($R$19:$R$205,$P263,$W$19:$W$205))","v":0},null,null,{"$f":"IF(P264=\"\",$V$279-SUM(OFFSET($V$257:V262,0,0,COUNTA($V$257:V262),1)),ROUND(S263*(1+BDI.Taxa),2))","v":0},null,{"$f":"IF(P264=\"\",$X$279-SUM(OFFSET($X$257:X262,0,0,COUNTA($X$257:X262),1)),ROUND(V263*100/ORÇAMENTO.TotalOrçamento,2))","v":{"$error":"#DIV/0!"}}]
[null,null,null,null,null,null,null,null,null,null,null,null,null,null,"7.","",null,null,{"$f":"IF(P265=\"\",$S$279-SUM(OFFSET($S$257:S263,0,0,COUNTA($S$257:S263),1)),SUMIF($R$19:$R$205,$P264,$W$19:$W$205))","v":0},null,null,{"$f":"IF(P265=\"\",$V$279-SUM(OFFSET($V$257:V263,0,0,COUNTA($V$257:V263),1)),ROUND(S264*(1+BDI.Taxa),2))","v":0},null,{"$f":"IF(P265=\"\",$X$279-SUM(OFFSET($X$257:X263,0,0,COUNTA($X$257:X263),1)),ROUND(V264*100/ORÇAMENTO.TotalOrçamento,2))","v":{"$error":"#DIV/0!"}}]
[null,null,null,null,null,null,null,null,null,null,null,null,null,null,"8.","",null,null,{"$f":"IF(P266=\"\",$S$279-SUM(OFFSET($S$257:S264,0,0,COUNTA($S$257:S264),1)),SUMIF($R$19:$R$205,$P265,$W$19:$W$205))","v":0},null,null,{"$f":"IF(P266=\"\",$V$279-SUM(OFFSET($V$257:V264,0,0,COUNTA($V$257:V264),1)),ROUND(S265*(1+BDI.Taxa),2))","v":0},null,{"$f":"IF(P266=\"\",$X$279-SUM(OFFSET($X$257:X264,0,0,COUNTA($X$257:X264),1)),ROUND(V265*100/ORÇAMENTO.TotalOrçamento,2))","v":{"$error":"#DIV/0!"}}]
[null,null,null,null,null,null,null,null,null,null,null,null,null,null,"9.","",null,null,{"$f":"IF(P267=\"\",$S$279-SUM(OFFSET($S$257:S265,0,0,COUNTA($S$257:S265),1)),SUMIF($R$19:$R$205,$P266,$W$19:$W$205))","v":0},null,null,{"$f":"IF(P267=\"\",$V$279-SUM(OFFSET($V$257:V265,0,0,COUNTA($V$257:V265),1)),ROUND(S266*(1+BDI.Taxa),2))","v":0},null,{"$f":"IF(P267=\"\",$X$279-SUM(OFFSET($X$257:X265,0,0,COUNTA($X$257:X265),1)),ROUND(V266*100/ORÇAMENTO.TotalOrçamento,2))","v":{"$error":"#DIV/0!"}}]
[null,null,null,null,null,null,null,null,null,null,null,null,null,null,"10.","",null,null,{"$f":"IF(P268=\"\",$S$279-SUM(OFFSET($S$257:S266,0,0,COUNTA($S$257:S266),1)),SUMIF($R$19:$R$205,$P267,$W$19:$W$205))","v":0},null,null,{"$f":"IF(P268=\"\",$V$279-SUM(OFFSET($V$257:V266,0,0,COUNTA($V$257:V266),1)),ROUND(S267*(1+BDI.Taxa),2))","v":0},null,{"$f":"IF(P268=\"\",$X$279-SUM(OFFSET($X$257:X266,0,0,COUNTA($X$257:X266),1)),ROUND(V267*100/ORÇAMENTO.TotalOrçamento,2))","v":{"$error":"#DIV/0!"}}]
[null,null,null,null,null,null,null,null,null,null,null,null,null,null,"11.","",null,null,{"$f":"IF(P269=\"\",$S$279-SUM(OFFSET($S$257:S267,0,0,COUNTA($S$257:S267),1)),SUMIF($R$19:$R$205,$P268,$W$19:$W$205))","v":0},null,null,{"$f":"IF(P269=\"\",$V$279-SUM(OFFSET($V$257:V267,0,0,COUNTA($V$257:V267),1)),ROUND(S268*(1+BDI.Taxa),2))","v":0},null,{"$f":"IF(P269=\"\",$X$279-SUM(OFFSET($X$257:X267,0,0,COUNTA($X$257:X267),1)),ROUND(V268*100/ORÇAMENTO.TotalOrçamento,2))","v":{"$error":"#DIV/0!"}}]
[null,null,null,null,null,null,null,null,null,null,null,null,null,null,"12.","",null,null,{"$f":"IF(P270=\"\",$S$279-SUM(OFFSET($S$257:S268,0,0,COUNTA($S$257:S268),1)),SUMIF($R$19:$R$205,$P269,$W$19:$W$205))","v":0},null,null,{"$f":"IF(P270=\"\",$V$279-SUM(OFFSET($V$257:V268,0,0,COUNTA($V$257:V268),1)),ROUND(S269*(1+BDI.Taxa),2))","v":0},null,{"$f":"IF(P270=\"\",$X$279-SUM(OFFSET($X$257:X268,0,0,COUNTA($X$257:X268),1)),ROUND(V269*100/ORÇAMENTO.TotalOrçamento,2))","v":{"$error":"#DIV/0!"}}]
[null,null,null,null,null,null,null,null,null,null,null,null,null,null,"13.","",null,null,{"$f":"IF(P271=\"\",$S$279-SUM(OFFSET($S$257:S269,0,0,COUNTA($S$257:S269),1)),SUMIF($R$19:$R$205,$P270,$W$19:$W$205))","v":0},null,null,{"$f":"IF(P271=\"\",$V$279-SUM(OFFSET($V$257:V269,0,0,COUNTA($V$257:V269),1)),ROUND(S270*(1+BDI.Taxa),2))","v":0},null,{"$f":"IF(P271=\"\",$X$279-SUM(OFFSET($X$257:X269,0,0,COUNTA($X$257:X269),1)),ROUND(V270*100/ORÇAMENTO.TotalOrçamento,2))","v":{"$error":"#DIV/0!"}}]
[null,null,null,null,null,null,null,null,null,null,null,null,null,null,"14.","",null,null,{"$f":"IF(P272=\"\",$S$279-SUM(OFFSET($S$257:S270,0,0,COUNTA($S$257:S270),1)),SUMIF($R$19:$R$205,$P271,$W$19:$W$205))","v":0},null,null,{"$f":"IF(P272=\"\",$V$279-SUM(OFFSET($V$257:V270,0,0,COUNTA($V$257:V270),1)),ROUND(S271*(1+BDI.Taxa),2))","v":0},null,{"$f":"IF(P272=\"\",$X$279-SUM(OFFSET($X$257:X270,0,0,COUNTA($X$257:X270),1)),ROUND(V271*100/ORÇAMENTO.TotalOrçamento,2))","v":{"$error":"#DIV/0!"}}]
[null,null,null,null,null,null,null,null,null,null,null,null,null,null,"15.","",null,null,{"$f":"IF(P273=\"\",$S$279-SUM(OFFSET($S$257:S271,0,0,COUNTA($S$257:S271),1)),SUMIF($R$19:$R$205,$P272,$W$19:$W$205))","v":0},null,null,{"$f":"IF(P273=\"\",$V$279-SUM(OFFSET($V$257:V271,0,0,COUNTA($V$257:V271),1)),ROUND(S272*(1+BDI.Taxa),2))","v":0},null,{"$f":"IF(P273=\"\",$X$279-SUM(OFFSET($X$257:X271,0,0,COUNTA($X$257:X271),1)),ROUND(V272*100/ORÇAMENTO.TotalOrçamento,2))","v":{"$error":"#DIV/0!"}}]
[null,null,null,null,null,null,null,null,null,null,null,null,null,null,"16.","",null,null,{"$f":"IF(P274=\"\",$S$279-SUM(OFFSET($S$257:S272,0,0,COUNTA($S$257:S272),1)),SUMIF($R$19:$R$205,$P273,$W$19:$W$205))","v":0},null,null,{"$f":"IF(P274=\"\",$V$279-SUM(OFFSET($V$257:V272,0,0,COUNTA($V$257:V272),1)),ROUND(S273*(1+BDI.Taxa),2))","v":0},null,{"$f":"IF(P274=\"\",$X$279-SUM(OFFSET($X$257:X272,0,0,COUNTA($X$257:X272),1)),ROUND(V273*100/ORÇAMENTO.TotalOrçamento,2))","v":{"$error":"#DIV/0!"}}]
[null,null,null,null,null,null,null,null,null,null,null,null,null,null,"17.","",null,null,{"$f":"IF(P275=\"\",$S$279-SUM(OFFSET($S$257:S273,0,0,COUNTA($S$257:S273),1)),SUMIF($R$19:$R$205,$P274,$W$19:$W$205))","v":0},null,null,{"$f":"IF(P275=\"\",$V$279-SUM(OFFSET($V$257:V273,0,0,COUNTA($V$257:V273),1)),ROUND(S274*(1+BDI.Taxa),2))","v":0},null,{"$f":"IF(P275=\"\",$X$279-SUM(OFFSET($X$257:X273,0,0,COUNTA($X$257:X273),1)),ROUND(V274*100/ORÇAMENTO.TotalOrçamento,2))","v":{"$error":"#DIV/0!"}}]
[null,null,null,null,null,null,null,null,null,null,null,null,null,null,"18.","",null,null,{"$f":"IF(P276=\"\",$S$279-SUM(OFFSET($S$257:S274,0,0,COUNTA($S$257:S274),1)),SUMIF($R$19:$R$205,$P275,$W$19:$W$205))","v":0},null,null,{"$f":"IF(P276=\"\",$V$279-SUM(OFFSET($V$257:V274,0,0,COUNTA($V$257:V274),1)),ROUND(S275*(1+BDI.Taxa),2))","v":0},null,{"$f":"IF(P276=\"\",$X$279-SUM(OFFSET($X$257:X274,0,0,COUNTA($X$257:X274),1)),ROUND(V275*100/ORÇAMENTO.TotalOrçamento,2))","v":{"$error":"#DIV/0!"}}]
[null,null,null,null,null,null,null,null,null,null,null,null,null,null,"19.","",null,null,{"$f":"IF(P277=\"\",$S$279-SUM(OFFSET($S$257:S275,0,0,COUNTA($S$257:S275),1)),SUMIF($R$19:$R$205,$P276,$W$19:$W$205))","v":0},null,null,{"$f":"IF(P277=\"\",$V$279-SUM(OFFSET($V$257:V275,0,0,COUNTA($V$257:V275),1)),ROUND(S276*(1+BDI.Taxa),2))","v":0},null,{"$f":"IF(P277=\"\",$X$279-SUM(OFFSET($X$257:X275,0,0,COUNTA($X$257:X275),1)),ROUND(V276*100/ORÇAMENTO.TotalOrçamento,2))","v":{"$error":"#DIV/0!"}}]
[null,null,null,null,null,null,null,null,null,null,null,null,null,null,"20.","",null,null,{"$f":"IF(P278=\"\",$S$279-SUM(OFFSET($S$257:S276,0,0,COUNTA($S$257:S276),1)),SUMIF($R$19:$R$205,$P277,$W$19:$W$205))","v":0},null,null,{"$f":"IF(P278=\"\",$V$279-SUM(OFFSET($V$257:V276,0,0,COUNTA($V$257:V276),1)),ROUND(S277*(1+BDI.Taxa),2))","v":0},null,{"$f":"IF(P278=\"\",$X$279-SUM(OFFSET($X$257:X276,0,0,COUNTA($X$257:X276),1)),ROUND(V277*100/ORÇAMENTO.TotalOrçamento,2))","v":{"$error":"#DIV/0!"}}]
[null,null,null,null,null,null,null,null,null,null,null,null,null,null,"TOTAL GERAL DO ORÇAMENTO (R$)",null,null,null,{"$f":"SUM(S258:U277)","v":0},null,null,{"$f":"SUM(V258:W277)","v":0},null,{"$f":"SUM(X258:X277)","v":{"$error":"#DIV/0!"}}]
[null,null,null,null,null,null,null,null,null,null,null,null,null,null,null,null,null,null,{"$f":"$W$206","v":0},null,null,{"$f":"$W$208","v":0},null,100]
[null,null,null,null,null,null,null,null,null,null,null,null,null,null,null,null,null,null,"(TOTAL SEM BDI)",null,null,"(TOTAL COM BDI)",null,"(ARRED porcentagem)"]
[null,null,null,null,null,null,null,null,null,null,null,null,null,null,null,null,null,null,{"$f":"IF(AND(S278=S279,S278>0),\"OK\",\"ERRO\")","v":"ERRO"},null,null,{"$f":"IF(AND(V278=V279,V278>0),\"OK\",\"ERRO\")","v":"ERRO"},null,{"$f":"IF(AND(X278=100,S258<>0),\"OK\",\"ERRO\")","v":{"$error":"#DIV/0!"}}]

{"sheet":"Resumo ","index":1,"n_rows":39,"n_cols":9,"rows_kept":39,"cut":false,"hidden":false,"merged":[[13,0,14,0],[34,2,34,3],[35,2,35,3],[31,2,31,3],[32,2,32,3],[33,2,33,3],[28,2,28,3],[29,2,29,3],[30,2,30,3],[0,1,0,8],[36,1,36,5],[2,1,2,5],[3,1,3,5],[5,1,5,5],[6,1,6,5],[8,1,8,5],[9,1,9,5],[11,3,11,5],[12,3,12,5],[10,1,10,8],[11,6,11,8],[12,6,12,8],[25,2,25,3],[21,2,21,3],[22,2,22,3],[6,6,6,8],[7,1,7,8],[8,6,8,8],[9,6,9,8],[13,1,13,8],[1,1,1,8],[2,6,2,8],[3,6,3,8],[4,1,4,8],[5,6,5,8],[42,3,42,7],[11,1,11,2],[12,1,12,2],[15,2,15,3],[16,2,16,3],[14,1,14,8],[17,2,17,3],[23,2,23,3],[18,2,18,3],[19,2,19,3],[20,2,20,3],[41,3,41,7],[24,2,24,3],[26,2,26,3],[27,2,27,3],[38,1,38,8]]}
[]
[]
[null,"UNIDADE ESCOLAR",null,null,null,null,"CÓDIGO INEP"]
[null,{"$f":"Orçamento!$O$4","v":"COLÉGIO ESTADUAL JOÃO BÊNNIO"},null,null,null,null,{"$f":"Orçamento!V4","v":52035131}]
[]
[null,"OBRA",null,null,null,null,"CIDADE"]
[null,{"$f":"Orçamento!$O$7","v":"AMPLIAÇÃO E REFORMA"},null,null,null,null,{"$f":"Orçamento!$V$7","v":"GOIÂNIA"}]
[]
[null,"ENDEREÇO",null,null,null,null,"CRE"]
[null,{"$f":"Orçamento!$R$10","v":"RUA JC QUADRA 140 AREA VERDE S/N, JD CURITIBA III, CEP:74481-130"},null,null,null,null,{"$f":"Orçamento!$O$10","v":"GOIÂNIA"}]
[]
[null,"REFERÊNCIA",null,"DATA",null,null,"ÁREA TOTAL CONSTRUÍDA (M²)"]
[null,{"$f":"CONCATENATE(\"AGETOP E SINAPI - \",Orçamento!$W$10)","v":"AGETOP E SINAPI - ONERADA"},null,{"$f":"Orçamento!$S$7","v":"2020-04-08"},null,null,{"$f":"Orçamento!$S$13","v":1205}]
["FILTRO"]
[null,"RESUMO GERAL DO ORÇAMENTO"]
["↓","ITEM","DESCRIÇÃO DOS SERVIÇOS",null,"UNID","QUANT","PREÇO SEM BDI","PREÇO COM BDI","PARTICIP. (%)"]
[{"$f":"IF(E17>0,\"F\",\"\")","v":"F"},"1.",{"$f":"Orçamento!$P258","v":"AMPLIAÇÃO E REFORMA"},null,"UN ",1,{"$f":"IFERROR(Orçamento!S258,\"-\")","v":0},{"$f":"IFERROR(Orçamento!V258,\"\")","v":0},{"$f":"Orçamento!X258","v":{"$error":"#DIV/0!"}}]
[{"$f":"IF(E18>0,\"F\",\"\")","v":"F"},"2.",{"$f":"Orçamento!$P259","v":"COBERTURA DE QUADRA PEQUENA FNDE"},null,"UN ",1,{"$f":"IFERROR(Orçamento!S259,\"-\")","v":0},{"$f":"IFERROR(Orçamento!V259,\"\")","v":0},{"$f":"Orçamento!X259","v":{"$error":"#DIV/0!"}}]
["","3.",{"$f":"Orçamento!$P260","v":""},null,null,null,{"$f":"IFERROR(Orçamento!S260,\"-\")","v":0},{"$f":"IFERROR(Orçamento!V260,\"\")","v":0},{"$f":"Orçamento!X260","v":{"$error":"#DIV/0!"}}]
["","4.",{"$f":"Orçamento!$P261","v":""},null,null,null,{"$f":"IFERROR(Orçamento!S261,\"-\")","v":0},{"$f":"IFERROR(Orçamento!V261,\"\")","v":0},{"$f":"Orçamento!X261","v":{"$error":"#DIV/0!"}}]
["","5.",{"$f":"Orçamento!$P262","v":""},null,null,null,{"$f":"IFERROR(Orçamento!S262,\"-\")","v":0},{"$f":"IFERROR(Orçamento!V262,\"\")","v":0},{"$f":"Orçamento!X262","v":{"$error":"#DIV/0!"}}]
["","6.",{"$f":"Orçamento!$P263","v":""},null,null,null,{"$f":"IFERROR(Orçamento!S263,\"-\")","v":0},{"$f":"IFERROR(Orçamento!V263,\"\")","v":0},{"$f":"Orçamento!X263","v":{"$error":"#DIV/0!"}}]
["","7.",{"$f":"Orçamento!$P264","v":""},null,null,null,{"$f":"IFERROR(Orçamento!S264,\"-\")","v":0},{"$f":"IFERROR(Orçamento!V264,\"\")","v":0},{"$f":"Orçamento!X264","v":{"$error":"#DIV/0!"}}]
["","8.",{"$f":"Orçamento!$P265","v":""},null,null,null,{"$f":"IFERROR(Orçamento!S265,\"-\")","v":0},{"$f":"IFERROR(Orçamento!V265,\"\")","v":0},{"$f":"Orçamento!X265","v":{"$error":"#DIV/0!"}}]
["","9.",{"$f":"Orçamento!$P266","v":""},null,null,null,{"$f":"IFERROR(Orçamento!S266,\"-\")","v":0},{"$f":"IFERROR(Orçamento!V266,\"\")","v":0},{"$f":"Orçamento!X266","v":{"$error":"#DIV/0!"}}]
["","10.",{"$f":"Orçamento!$P267","v":""},null,null,null,{"$f":"IFERROR(Orçamento!S267,\"-\")","v":0},{"$f":"IFERROR(Orçamento!V267,\"\")","v":0},{"$f":"Orçamento!X267","v":{"$error":"#DIV/0!"}}]
["","11.",{"$f":"Orçamento!$P268","v":""},null,null,null,{"$f":"IFERROR(Orçamento!S268,\"-\")","v":0},{"$f":"IFERROR(Orçamento!V268,\"\")","v":0},{"$f":"Orçamento!X268","v":{"$error":"#DIV/0!"}}]
["","12.",{"$f":"Orçamento!$P269","v":""},null,null,null,{"$f":"IFERROR(Orçamento!S269,\"-\")","v":0},{"$f":"IFERROR(Orçamento!V269,\"\")","v":0},{"$f":"Orçamento!X269","v":{"$error":"#DIV/0!"}}]
["","13.",{"$f":"Orçamento!$P270","v":""},null,null,null,{"$f":"IFERROR(Orçamento!S270,\"-\")","v":0},{"$f":"IFERROR(Orçamento!V270,\"\")","v":0},{"$f":"Orçamento!X270","v":{"$error":"#DIV/0!"}}]
["","14.",{"$f":"Orçamento!$P271","v":""},null,null,null,{"$f":"IFERROR(Orçamento!S271,\"-\")","v":0},{"$f":"IFERROR(Orçamento!V271,\"\")","v":0},{"$f":"Orçamento!X271","v":{"$error":"#DIV/0!"}}]
["","15.",{"$f":"Orçamento!$P272","v":""},null,null,null,{"$f":"IFERROR(Orçamento!S272,\"-\")","v":0},{"$f":"IFERROR(Orçamento!V272,\"\")","v":0},{"$f":"Orçamento!X272","v":{"$error":"#DIV/0!"}}]
["","16.",{"$f":"Orçamento!$P273","v":""},null,null,null,{"$f":"IFERROR(Orçamento!S273,\"-\")","v":0},{"$f":"IFERROR(Orçamento!V273,\"\")","v":0},{"$f":"Orçamento!X273","v":{"$error":"#DIV/0!"}}]
["","17.",{"$f":"Orçamento!$P274","v":""},null,null,null,{"$f":"IFERROR(Orçamento!S274,\"-\")","v":0},{"$f":"IFERROR(Orçamento!V274,\"\")","v":0},{"$f":"Orçamento!X274","v":{"$error":"#DIV/0!"}}]
["","18.",{"$f":"Orçamento!$P275","v":""},null,null,null,{"$f":"IFERROR(Orçamento!S275,\"-\")","v":0},{"$f":"IFERROR(Orçamento!V275,\"\")","v":0},{"$f":"Orçamento!X275","v":{"$error":"#DIV/0!"}}]
["","19.",{"$f":"Orçamento!$P276","v":""},null,null,null,{"$f":"IFERROR(Orçamento!S276,\"-\")","v":0},{"$f":"IFERROR(Orçamento!V276,\"\")","v":0},{"$f":"Orçamento!X276","v":{"$error":"#DIV/0!"}}]
["","20.",{"$f":"Orçamento!$P277","v":""},null,null,null,{"$f":"IFERROR(Orçamento!S277,\"-\")","v":0},{"$f":"IFERROR(Orçamento!V277,\"\")","v":0},{"$f":"Orçamento!X277","v":{"$error":"#DIV/0!"}}]
["F","TOTAL GERAL DO ORÇAMENTO (R$)",null,null,null,null,{"$f":"SUM(G17:G36)","v":0},0,{"$f":"SUM(I17:I36)","v":{"$error":"#DIV/0!"}}]
["F"]
["F"]

{"sheet":"Somatório","index":2,"n_rows":45,"n_cols":9,"rows_kept":45,"cut":false,"hidden":false,"merged":[[13,0,14,0],[42,1,42,2],[44,1,44,5],[47,3,47,5],[48,3,48,5],[13,1,13,5],[9,1,9,3],[9,4,9,5],[11,1,11,2],[11,4,11,5],[12,1,12,2],[12,4,12,5],[0,1,0,5],[14,1,14,5],[2,1,2,3],[2,4,2,5],[3,1,3,3],[3,4,3,5],[5,1,5,3],[5,4,5,5],[6,1,6,3],[6,4,6,5],[8,1,8,3],[8,4,8,5],[1,1,1,5],[4,1,4,5],[7,1,7,5],[10,1,10,5]]}
[]
[]
[null,"UNIDADE ESCOLAR",null,null,"CÓDIGO INEP"]
[null,{"$f":"Orçamento!$O$4","v":"COLÉGIO ESTADUAL JOÃO BÊNNIO"},null,null,{"$f":"Orçamento!V4","v":52035131}]
[]
[null,"OBRA",null,null,"CIDADE"]
[null,{"$f":"Orçamento!$O$7","v":"AMPLIAÇÃO E REFORMA"},null,null,{"$f":"Orçamento!$V$7","v":"GOIÂNIA"}]
[]
[null,"ENDEREÇO",null,null,"CRE"]
[null,{"$f":"Orçamento!$R$10","v":"RUA JC QUADRA 140 AREA VERDE S/N, JD CURITIBA III, CEP:74481-130"},null,null,{"$f":"Orçamento!$O$10","v":"GOIÂNIA"}]
[]
[null,"REFERÊNCIA",null,"DATA","ÁREA TOTAL CONSTRUÍDA (M²)"]
[null,{"$f":"CONCATENATE(\"AGETOP E SINAPI - \",Orçamento!$W$10)","v":"AGETOP E SINAPI - ONERADA"},null,{"$f":"Orçamento!$S$7","v":"2020-04-08"},{"$f":"Orçamento!$S$13","v":1205}]
["FILTRO"]
[null,"SOMATÓRIO DE SERVIÇOS"]
["↓","ITEM","DESCRIÇÃO DOS SERVIÇOS","PREÇO SEM BDI (R$)","PREÇO COM BDI (R$)","PARTIC.  ( % )"]
[{"$f":"IF(D17>0,\"F\",\"\")","v":""},"a.",{"$f":"Orçamento!P224","v":"SERVIÇOS PRELIMINARES"},{"$f":"Orçamento!S224","v":0},{"$f":"Orçamento!V224","v":0},{"$f":"Orçamento!X224","v":0},4,1,8]
[{"$f":"IF(D18>0,\"F\",\"\")","v":""},"b.",{"$f":"Orçamento!P225","v":"TRANSPORTES"},{"$f":"Orçamento!S225","v":0},{"$f":"Orçamento!V225","v":0},{"$f":"Orçamento!X225","v":0},0,8,8]
["","c.",{"$f":"Orçamento!P226","v":"SERVIÇO EM TERRA"},{"$f":"Orçamento!S226","v":0},{"$f":"Orçamento!V226","v":0},{"$f":"Orçamento!X226","v":0},4,6,1]
["","d.",{"$f":"Orçamento!P227","v":"FUNDAÇÕES E SONDAGENS"},{"$f":"Orçamento!S227","v":0},{"$f":"Orçamento!V227","v":0},{"$f":"Orçamento!X227","v":0},9,8,5]
["","e.",{"$f":"Orçamento!P228","v":"ESTRUTURA"},{"$f":"Orçamento!S228","v":0},{"$f":"Orçamento!V228","v":0},{"$f":"Orçamento!X228","v":0}]
["","f.",{"$f":"Orçamento!P229","v":"INSTALAÇÕES ELÉTRICAS"},{"$f":"Orçamento!S229","v":0},{"$f":"Orçamento!V229","v":0},{"$f":"Orçamento!X229","v":0},3,8,9]
["","g.",{"$f":"Orçamento!P230","v":"INSTALAÇÕES HIDROSSANITÁRIAS"},{"$f":"Orçamento!S230","v":0},{"$f":"Orçamento!V230","v":0},{"$f":"Orçamento!X230","v":0},7,4,3]
["","h.",{"$f":"Orçamento!P231","v":"INSTALAÇÕES ESPECIAIS"},{"$f":"Orçamento!S231","v":0},{"$f":"Orçamento!V231","v":0},{"$f":"Orçamento!X231","v":0},5,2,5]
["","i.",{"$f":"Orçamento!P232","v":"ALVENARIAS E DIVISÓRIAS"},{"$f":"Orçamento!S232","v":0},{"$f":"Orçamento!V232","v":0},{"$f":"Orçamento!X232","v":0}]
["","j.",{"$f":"Orçamento!P233","v":"ALVENARIA AUTO-PORTANTE"},{"$f":"Orçamento!S233","v":0},{"$f":"Orçamento!V233","v":0},{"$f":"Orçamento!X233","v":0}]
["","k.",{"$f":"Orçamento!P234","v":"IMPERMEABILIZAÇÃO"},{"$f":"Orçamento!S234","v":0},{"$f":"Orçamento!V234","v":0},{"$f":"Orçamento!X234","v":0}]
["","l.",{"$f":"Orçamento!P235","v":"ISOLAMENTO TÉRMICO E ACÚSTICO"},{"$f":"Orçamento!S235","v":0},{"$f":"Orçamento!V235","v":0},{"$f":"Orçamento!X235","v":0}]
["","m.",{"$f":"Orçamento!P236","v":"ESTRUTURA DE MADEIRA"},{"$f":"Orçamento!S236","v":0},{"$f":"Orçamento!V236","v":0},{"$f":"Orçamento!X236","v":0}]
["","n.",{"$f":"Orçamento!P237","v":"ESTRUTURAS METÁLICAS"},{"$f":"Orçamento!S237","v":0},{"$f":"Orçamento!V237","v":0},{"$f":"Orçamento!X237","v":0},0,1,2]
["","o.",{"$f":"Orçamento!P238","v":"COBERTURAS"},{"$f":"Orçamento!S238","v":0},{"$f":"Orçamento!V238","v":0},{"$f":"Orçamento!X238","v":0},5,9,9]
["","p.",{"$f":"Orçamento!P239","v":"ESQUADRIAS DE MADEIRA"},{"$f":"Orçamento!S239","v":0},{"$f":"Orçamento!V239","v":0},{"$f":"Orçamento!X239","v":0}]
["","q.",{"$f":"Orçamento!P240","v":"ESQUADRIAS METÁLICAS"},{"$f":"Orçamento!S240","v":0},{"$f":"Orçamento!V240","v":0},{"$f":"Orçamento!X240","v":0}]
["","r.",{"$f":"Orçamento!P241","v":"VIDROS"},{"$f":"Orçamento!S241","v":0},{"$f":"Orçamento!V241","v":0},{"$f":"Orçamento!X241","v":0}]
["","s.",{"$f":"Orçamento!P242","v":"REVESTIMENTO DE PAREDE"},{"$f":"Orçamento!S242","v":0},{"$f":"Orçamento!V242","v":0},{"$f":"Orçamento!X242","v":0}]
["","t.",{"$f":"Orçamento!P243","v":"FORROS"},{"$f":"Orçamento!S243","v":0},{"$f":"Orçamento!V243","v":0},{"$f":"Orçamento!X243","v":0},5,6,7]
["","u.",{"$f":"Orçamento!P244","v":"REVESTIMENTO DE PISO"},{"$f":"Orçamento!S244","v":0},{"$f":"Orçamento!V244","v":0},{"$f":"Orçamento!X244","v":0},0,7,7]
["","v.",{"$f":"Orçamento!P245","v":"FERRAGENS"},{"$f":"Orçamento!S245","v":0},{"$f":"Orçamento!V245","v":0},{"$f":"Orçamento!X245","v":0},3,2,5]
["","w.",{"$f":"Orçamento!P246","v":"MARCENARIA"},{"$f":"Orçamento!S246","v":0},{"$f":"Orçamento!V246","v":0},{"$f":"Orçamento!X246","v":0}]
["","x.",{"$f":"Orçamento!P247","v":"ADMINISTRAÇÃO"},{"$f":"Orçamento!S247","v":0},{"$f":"Orçamento!V247","v":0},{"$f":"Orçamento!X247","v":0},6,1,2]
["","y.",{"$f":"Orçamento!P248","v":"PINTURA"},{"$f":"Orçamento!S248","v":0},{"$f":"Orçamento!V248","v":0},{"$f":"Orçamento!X248","v":0},7,5,8]
["","z.",{"$f":"Orçamento!P249","v":"DIVERSOS"},{"$f":"Orçamento!S249","v":0},{"$f":"Orçamento!V249","v":0},{"$f":"Orçamento!X249","v":0},2,9,1]
["F","TOTAL GERAL DO ORÇAMENTO",null,{"$f":"SUM(D17:D42)","v":0},0,0,60,77,80]
[]
[null,"(*) Para itens da AGETOP, os vidros não estão inclusos nas esquadrias e já foram considerados os custos de contramarco para as esquadrias de alumínio;"]

{"sheet":"Cronog_60_Dias","index":3,"n_rows":99,"n_cols":14,"rows_kept":99,"cut":false,"hidden":false,"merged":[[2,1,2,7],[5,1,5,7],[6,1,6,7],[8,1,8,7],[9,1,9,7],[4,1,4,13],[7,1,7,13],[0,1,0,13],[1,1,1,13],[2,8,2,13],[12,0,13,0],[9,0,11,0],[11,1,11,13],[92,1,92,2],[92,5,92,8],[92,9,92,12],[93,1,93,2],[93,5,93,8],[93,9,93,12],[74,9,74,12],[74,5,74,8],[68,9,68,12],[70,5,70,8],[70,9,70,12],[59,5,59,8],[71,1,73,2],[71,4,73,4],[71,5,71,8],[71,9,71,12],[73,5,73,8],[73,9,73,12],[59,9,59,12],[61,5,61,8],[61,9,61,12],[94,1,94,2],[94,5,94,8],[94,9,94,12],[76,5,76,8],[76,9,76,12],[77,5,77,8],[77,9,77,12],[79,5,79,8],[79,9,79,12],[80,5,80,8],[80,9,80,12],[82,5,82,8],[82,9,82,12],[77,3,79,3],[80,3,82,3],[86,1,88,2],[80,4,82,4],[95,1,95,2],[95,5,95,8],[95,9,95,12],[97,1,97,4],[98,1,98,13],[86,9,86,12],[88,5,88,8],[88,9,88,12],[85,5,85,8],[85,9,85,12],[89,1,91,2],[89,4,91,4],[89,5,89,8],[89,9,89,12],[91,5,91,8],[91,9,91,12],[89,3,91,3],[86,4,88,4],[86,5,86,8],[86,3,88,3],[83,1,85,2],[83,4,85,4],[83,5,83,8],[83,9,83,12],[68,5,68,8],[65,5,65,8],[65,9,65,12],[67,5,67,8],[67,9,67,12],[65,3,67,3],[62,9,62,12],[64,5,64,8],[64,9,64,12],[62,5,62,8],[53,9,53,12],[55,5,55,8],[55,9,55,12],[50,5,50,8],[50,9,50,12],[52,5,52,8],[52,9,52,12],[56,9,56,12],[58,5,58,8],[58,9,58,12],[53,5,53,8],[56,5,56,8],[44,9,44,12],[46,5,46,8],[46,9,46,12],[47,1,49,2],[47,4,49,4],[47,5,47,8],[47,9,47,12],[49,5,49,8],[49,9,49,12],[44,5,44,8],[47,3,49,3],[35,9,35,12],[37,5,37,8],[37,9,37,12],[35,3,37,3],[40,9,40,12],[38,3,40,3],[38,9,38,12],[41,1,43,2],[41,4,43,4],[41,5,41,8],[41,9,41,12],[43,5,43,8],[43,9,43,12],[41,3,43,3],[35,5,35,8],[38,5,38,8],[40,5,40,8],[29,9,29,12],[31,5,31,8],[31,9,31,12],[32,1,34,2],[32,4,34,4],[32,5,32,8],[32,9,32,12],[34,5,34,8],[34,9,34,12],[32,3,34,3],[29,5,29,8],[29,1,31,2],[29,4,31,4],[26,1,28,2],[26,4,28,4],[26,5,26,8],[26,9,26,12],[28,5,28,8],[28,9,28,12],[23,3,25,3],[23,1,25,2],[23,4,25,4],[23,5,23,8],[26,3,28,3],[14,3,16,3],[17,3,19,3],[14,4,16,4],[14,5,14,8],[14,9,14,12],[16,5,16,8],[16,9,16,12],[23,9,23,12],[25,5,25,8],[25,9,25,12],[17,9,17,12],[19,5,19,8],[19,9,19,12],[20,1,22,2],[20,4,22,4],[20,5,20,8],[20,9,20,12],[22,5,22,8],[22,9,22,12],[20,3,22,3],[83,3,85,3],[53,4,55,4],[59,1,61,2],[59,4,61,4],[74,1,76,2],[77,1,79,2],[77,4,79,4],[80,1,82,2],[65,1,67,2],[68,3,70,3],[62,3,64,3],[68,1,70,2],[56,3,58,3],[65,4,67,4],[71,3,73,3],[74,3,76,3],[74,4,76,4],[56,1,58,2],[68,4,70,4],[44,3,46,3],[62,1,64,2],[62,4,64,4],[38,1,40,2],[38,4,40,4],[59,3,61,3],[44,1,46,2],[44,4,46,4],[53,1,55,2],[50,1,52,2],[50,4,52,4],[10,1,10,13],[9,8,9,13],[8,8,8,13],[3,8,3,13],[6,8,6,13],[5,8,5,13],[3,1,3,7],[56,4,58,4],[29,3,31,3],[35,1,37,2],[35,4,37,4],[50,3,52,3],[53,3,55,3],[12,13,13,13],[13,1,13,2],[13,5,13,8],[13,9,13,12],[12,3,13,3],[12,9,12,12],[14,1,16,2],[12,5,12,8],[17,1,19,2],[17,4,19,4],[17,5,17,8]]}
[]
[]
[null,"UNIDADE ESCOLAR",null,null,null,null,null,null,"PRAZO"]
[null,{"$f":"Orçamento!$O$4","v":"COLÉGIO ESTADUAL JOÃO BÊNNIO"},null,null,null,null,null,null,"60 DIAS CORRIDOS"]
[]
[null,"OBRA",null,null,null,null,null,null,"DATA"]
[null,{"$f":"Orçamento!$O$7","v":"AMPLIAÇÃO E REFORMA"},null,null,null,null,null,null,{"$f":"Orçamento!$S$7","v":"2020-04-08"}]
[]
[null,"LOCAL",null,null,null,null,null,null,"ÁREA TOTAL CONSTRUÍDA (M²)"]
["FILTRO",{"$f":"Orçamento!$V$7","v":"GOIÂNIA"},null,null,null,null,null,null,{"$f":"Orçamento!$S$13","v":1205}]
[]
[null,"CRONOGRAMA - FÍSICO FINANCEIRO"]
["↓","CUSTO TOTAL:",{"$f":"D93","v":0},"VALOR","Dias:",30,null,null,null,60,null,null,null,"TOTAL"]
[null,"DESCRIÇÃO DOS SERVIÇOS",null,null,"%","1ª PARCELA",null,null,null,"2ª PARCELA"]
[{"$f":"IF(D15>0,\"F\",\"\")","v":""},"SERVIÇOS PRELIMINARES",null,{"$f":"Orçamento!V224","v":0},{"$f":"Orçamento!X224","v":0},{"$f":"ROUND(F17*$D$15,2)","v":0},null,null,null,{"$f":"ROUND(J17*$D$15,2)","v":0},null,null,null,{"$f":"SUM(F15:M15)","v":0}]
[{"$f":"IF(A15=\"F\",A15,\"\")","v":""}]
[{"$f":"IF(A16=\"F\",A16,\"\")","v":""},null,null,null,null,1,null,null,null,{"$f":"1-F17","v":0},null,null,null,{"$f":"IFERROR(E15/100,\"\")","v":0}]
[{"$f":"IF(D18>0,\"F\",\"\")","v":""},"TRANSPORTES",null,{"$f":"Orçamento!V225","v":0},{"$f":"Orçamento!X225","v":0},{"$f":"ROUND(F20*$D$18,2)","v":0},null,null,null,{"$f":"ROUND(J20*$D$18,2)","v":0},null,null,null,{"$f":"SUM(F18:M18)","v":0}]
[{"$f":"IF(A18=\"F\",A18,\"\")","v":""}]
[{"$f":"IF(A19=\"F\",A19,\"\")","v":""},null,null,null,null,0.48,null,null,null,{"$f":"1-F20","v":0.52},null,null,null,{"$f":"IFERROR(E18/100,\"\")","v":0}]
[{"$f":"IF(D21>0,\"F\",\"\")","v":""},"SERVIÇO EM TERRA",null,{"$f":"Orçamento!V226","v":0},{"$f":"Orçamento!X226","v":0},{"$f":"ROUND(F23*$D$21,2)","v":0},null,null,null,{"$f":"ROUND(J23*$D$21,2)","v":0},null,null,null,{"$f":"SUM(F21:M21)","v":0}]
[{"$f":"IF(A21=\"F\",A21,\"\")","v":""}]
[{"$f":"IF(A22=\"F\",A22,\"\")","v":""},null,null,null,null,1,null,null,null,{"$f":"1-F23","v":0},null,null,null,{"$f":"IFERROR(E21/100,\"\")","v":0}]
[{"$f":"IF(D24>0,\"F\",\"\")","v":""},"FUNDAÇÕES E SONDAGENS",null,{"$f":"Orçamento!V227","v":0},{"$f":"Orçamento!X227","v":0},{"$f":"ROUND(F26*$D$24,2)","v":0},null,null,null,{"$f":"ROUND(J26*$D$24,2)","v":0},null,null,null,{"$f":"SUM(F24:M24)","v":0}]
[{"$f":"IF(A24=\"F\",A24,\"\")","v":""}]
[{"$f":"IF(A25=\"F\",A25,\"\")","v":""},null,null,null,null,1,null,null,null,{"$f":"1-F26","v":0},null,null,null,{"$f":"IFERROR(E24/100,\"\")","v":0}]
[{"$f":"IF(D27>0,\"F\",\"\")","v":""},"ESTRUTURA",null,{"$f":"Orçamento!V228","v":0},{"$f":"Orçamento!X228","v":0},{"$f":"ROUND(F29*$D$27,2)","v":0},null,null,null,{"$f":"ROUND(J29*$D$27,2)","v":0},null,null,null,{"$f":"SUM(F27:M27)","v":0}]
[{"$f":"IF(A27=\"F\",A27,\"\")","v":""}]
[{"$f":"IF(A28=\"F\",A28,\"\")","v":""},null,null,null,null,0.49,null,null,null,{"$f":"1-F29","v":0.51},null,null,null,{"$f":"IFERROR(E27/100,\"\")","v":0}]
[{"$f":"IF(D30>0,\"F\",\"\")","v":""},"INST.ELET/TELEFÔNICA/CABEAMENTO ESTRUTURADO",null,{"$f":"Orçamento!V229","v":0},{"$f":"Orçamento!X229","v":0},{"$f":"ROUND(F32*$D$30,2)","v":0},null,null,null,{"$f":"ROUND(J32*$D$30,2)","v":0},null,null,null,{"$f":"SUM(F30:M30)","v":0}]
[{"$f":"IF(A30=\"F\",A30,\"\")","v":""}]
[{"$f":"IF(A31=\"F\",A31,\"\")","v":""},null,null,null,null,0.4,null,null,null,{"$f":"1-F32","v":0.6},null,null,null,{"$f":"IFERROR(E30/100,\"\")","v":0}]
[{"$f":"IF(D33>0,\"F\",\"\")","v":""},"INSTALAÇÕES HIDROSSANITÁRIAS",null,{"$f":"Orçamento!V230","v":0},{"$f":"Orçamento!X230","v":0},{"$f":"ROUND(F35*$D$33,2)","v":0},null,null,null,{"$f":"ROUND(J35*$D$33,2)","v":0},null,null,null,{"$f":"SUM(F33:M33)","v":0}]
[{"$f":"IF(A33=\"F\",A33,\"\")","v":""}]
[{"$f":"IF(A34=\"F\",A34,\"\")","v":""},null,null,null,null,0.48,null,null,null,{"$f":"1-F35","v":0.52},null,null,null,{"$f":"IFERROR(E33/100,\"\")","v":0}]
[{"$f":"IF(D36>0,\"F\",\"\")","v":""},"INSTALAÇÕES ESPECIAIS",null,{"$f":"Orçamento!V231","v":0},{"$f":"Orçamento!X231","v":0},{"$f":"ROUND(F38*$D$36,2)","v":0},null,null,null,{"$f":"ROUND(J38*$D$36,2)","v":0},null,null,null,{"$f":"SUM(F36:M36)","v":0}]
[{"$f":"IF(A36=\"F\",A36,\"\")","v":""}]
[{"$f":"IF(A37=\"F\",A37,\"\")","v":""},null,null,null,null,1,null,null,null,{"$f":"1-F38","v":0},null,null,null,{"$f":"IFERROR(E36/100,\"\")","v":0}]
[{"$f":"IF(D39>0,\"F\",\"\")","v":""},"ALVENARIA E DIVISÓRIAS",null,{"$f":"Orçamento!V232","v":0},{"$f":"Orçamento!X232","v":0},{"$f":"ROUND(F41*$D$39,2)","v":0},null,null,null,{"$f":"ROUND(J41*$D$39,2)","v":0},null,null,null,{"$f":"SUM(F39:M39)","v":0}]
[{"$f":"IF(A39=\"F\",A39,\"\")","v":""}]
[{"$f":"IF(A40=\"F\",A40,\"\")","v":""},null,null,null,null,1,null,null,null,{"$f":"1-F41","v":0},null,null,null,{"$f":"IFERROR(E39/100,\"\")","v":0}]
[{"$f":"IF(D42>0,\"F\",\"\")","v":""},"ALVENARIA AUTO-PORTANTE",null,{"$f":"Orçamento!V233","v":0},{"$f":"Orçamento!X233","v":0},{"$f":"ROUND(F44*$D$42,2)","v":0},null,null,null,{"$f":"ROUND(J44*$D$42,2)","v":0},null,null,null,{"$f":"SUM(F42:M42)","v":0}]
[{"$f":"IF(A42=\"F\",A42,\"\")","v":""}]
[{"$f":"IF(A43=\"F\",A43,\"\")","v":""},null,null,null,null,1,null,null,null,{"$f":"1-F44","v":0},null,null,null,{"$f":"IFERROR(E42/100,\"\")","v":0}]
[{"$f":"IF(D45>0,\"F\",\"\")","v":""},"IMPERMEABILIZAÇÃO",null,{"$f":"Orçamento!V234","v":0},{"$f":"Orçamento!X234","v":0},{"$f":"ROUND(F47*$D$45,2)","v":0},null,null,null,{"$f":"ROUND(J47*$D$45,2)","v":0},null,null,null,{"$f":"SUM(F45:M45)","v":0}]
[{"$f":"IF(A45=\"F\",A45,\"\")","v":""}]
[{"$f":"IF(A46=\"F\",A46,\"\")","v":""},null,null,null,null,1,null,null,null,{"$f":"1-F47","v":0},null,null,null,{"$f":"IFERROR(E45/100,\"\")","v":0}]
[{"$f":"IF(D48>0,\"F\",\"\")","v":""},"ISOLAMENTO TÉRMICO E ACÚSTICO",null,{"$f":"Orçamento!V235","v":0},{"$f":"Orçamento!X235","v":0},{"$f":"ROUND(F50*$D$48,2)","v":0},null,null,null,{"$f":"ROUND(J50*$D$48,2)","v":0},null,null,null,{"$f":"SUM(F48:M48)","v":0}]
[{"$f":"IF(A48=\"F\",A48,\"\")","v":""}]
[{"$f":"IF(A49=\"F\",A49,\"\")","v":""},null,null,null,null,0.5,null,null,null,{"$f":"1-F50","v":0.5},null,null,null,{"$f":"IFERROR(E48/100,\"\")","v":0}]
[{"$f":"IF(D51>0,\"F\",\"\")","v":""},"ESTRUTURA DE MADEIRA",null,{"$f":"Orçamento!V236","v":0},{"$f":"Orçamento!X236","v":0},{"$f":"ROUND(F53*$D$51,2)","v":0},null,null,null,{"$f":"ROUND(J53*$D$51,2)","v":0},null,null,null,{"$f":"SUM(F51:M51)","v":0}]
[{"$f":"IF(A51=\"F\",A51,\"\")","v":""}]
[{"$f":"IF(A52=\"F\",A52,\"\")","v":""},null,null,null,null,0.4,null,null,null,{"$f":"1-F53","v":0.6},null,null,null,{"$f":"IFERROR(E51/100,\"\")","v":0}]
[{"$f":"IF(D54>0,\"F\",\"\")","v":""},"ESTRUTURA METÁLICA",null,{"$f":"Orçamento!V237","v":0},{"$f":"Orçamento!X237","v":0},{"$f":"ROUND(F56*$D$54,2)","v":0},null,null,null,{"$f":"ROUND(J56*$D$54,2)","v":0},null,null,null,{"$f":"SUM(F54:M54)","v":0}]
[{"$f":"IF(A54=\"F\",A54,\"\")","v":""}]
[{"$f":"IF(A55=\"F\",A55,\"\")","v":""},null,null,null,null,0.48,null,null,null,{"$f":"1-F56","v":0.52},null,null,null,{"$f":"IFERROR(E54/100,\"\")","v":0}]
[{"$f":"IF(D57>0,\"F\",\"\")","v":""},"COBERTURAS",null,{"$f":"Orçamento!V238","v":0},{"$f":"Orçamento!X238","v":0},{"$f":"ROUND(F59*$D$57,2)","v":0},null,null,null,{"$f":"ROUND(J59*$D$57,2)","v":0},null,null,null,{"$f":"SUM(F57:M57)","v":0}]
[{"$f":"IF(A57=\"F\",A57,\"\")","v":""}]
[{"$f":"IF(A58=\"F\",A58,\"\")","v":""},null,null,null,null,0,null,null,null,{"$f":"1-F59","v":1},null,null,null,{"$f":"IFERROR(E57/100,\"\")","v":0}]
[{"$f":"IF(D60>0,\"F\",\"\")","v":""},"ESQUADRIAS DE MADEIRA",null,{"$f":"Orçamento!V239","v":0},{"$f":"Orçamento!X239","v":0},{"$f":"ROUND(F62*$D$60,2)","v":0},null,null,null,{"$f":"ROUND(J62*$D$60,2)","v":0},null,null,null,{"$f":"SUM(F60:M60)","v":0}]
[{"$f":"IF(A60=\"F\",A60,\"\")","v":""}]
[{"$f":"IF(A61=\"F\",A61,\"\")","v":""},null,null,null,null,0.54,null,null,null,{"$f":"1-F62","v":0.45999999999999996},null,null,null,{"$f":"IFERROR(E60/100,\"\")","v":0}]
[{"$f":"IF(D63>0,\"F\",\"\")","v":""},"ESQUADRIAS METÁLICAS",null,{"$f":"Orçamento!V240","v":0},{"$f":"Orçamento!X240","v":0},{"$f":"ROUND(F65*$D$63,2)","v":0},null,null,null,{"$f":"ROUND(J65*$D$63,2)","v":0},null,null,null,{"$f":"SUM(F63:M63)","v":0}]
[{"$f":"IF(A63=\"F\",A63,\"\")","v":""}]
[{"$f":"IF(A64=\"F\",A64,\"\")","v":""},null,null,null,null,0.49,null,null,null,{"$f":"1-F65","v":0.51},null,null,null,{"$f":"IFERROR(E63/100,\"\")","v":0}]
[{"$f":"IF(D66>0,\"F\",\"\")","v":""},"VIDROS",null,{"$f":"Orçamento!V241","v":0},{"$f":"Orçamento!X241","v":0},{"$f":"ROUND(F68*$D$66,2)","v":0},null,null,null,{"$f":"ROUND(J68*$D$66,2)","v":0},null,null,null,{"$f":"SUM(F66:M66)","v":0}]
[{"$f":"IF(A66=\"F\",A66,\"\")","v":""}]
[{"$f":"IF(A67=\"F\",A67,\"\")","v":""},null,null,null,null,0,null,null,null,{"$f":"1-F68","v":1},null,null,null,{"$f":"IFERROR(E66/100,\"\")","v":0}]
[{"$f":"IF(D69>0,\"F\",\"\")","v":""},"REVESTIMENTO DE PAREDE",null,{"$f":"Orçamento!V242","v":0},{"$f":"Orçamento!X242","v":0},{"$f":"ROUND(F71*$D$69,2)","v":0},null,null,null,{"$f":"ROUND(J71*$D$69,2)","v":0},null,null,null,{"$f":"SUM(F69:M69)","v":0}]
[{"$f":"IF(A69=\"F\",A69,\"\")","v":""}]
[{"$f":"IF(A70=\"F\",A70,\"\")","v":""},null,null,null,null,0.32,null,null,null,{"$f":"1-F71","v":0.67999999999999994},null,null,null,{"$f":"IFERROR(E69/100,\"\")","v":0}]
[{"$f":"IF(D72>0,\"F\",\"\")","v":""},"FORROS",null,{"$f":"Orçamento!V243","v":0},{"$f":"Orçamento!X243","v":0},{"$f":"ROUND(F74*$D$72,2)","v":0},null,null,null,{"$f":"ROUND(J74*$D$72,2)","v":0},null,null,null,{"$f":"SUM(F72:M72)","v":0}]
[{"$f":"IF(A72=\"F\",A72,\"\")","v":""}]
[{"$f":"IF(A73=\"F\",A73,\"\")","v":""},null,null,null,null,0.24,null,null,null,{"$f":"1-F74","v":0.76},null,null,null,{"$f":"IFERROR(E72/100,\"\")","v":0}]
[{"$f":"IF(D75>0,\"F\",\"\")","v":""},"REVESTIMENTO DE PISO",null,{"$f":"Orçamento!V244","v":0},{"$f":"Orçamento!X244","v":0},{"$f":"ROUND(F77*$D$75,2)","v":0},null,null,null,{"$f":"ROUND(J77*$D$75,2)","v":0},null,null,null,{"$f":"SUM(F75:M75)","v":0}]
[{"$f":"IF(A75=\"F\",A75,\"\")","v":""}]
[{"$f":"IF(A76=\"F\",A76,\"\")","v":""},null,null,null,null,0.49,null,null,null,{"$f":"1-F77","v":0.51},null,null,null,{"$f":"IFERROR(E75/100,\"\")","v":0}]
[{"$f":"IF(D78>0,\"F\",\"\")","v":""},"FERRAGENS",null,{"$f":"Orçamento!V245","v":0},{"$f":"Orçamento!X245","v":0},{"$f":"ROUND(F80*$D$78,2)","v":0},null,null,null,{"$f":"ROUND(J80*$D$78,2)","v":0},null,null,null,{"$f":"SUM(F78:M78)","v":0}]
[{"$f":"IF(A78=\"F\",A78,\"\")","v":""}]
[{"$f":"IF(A79=\"F\",A79,\"\")","v":""},null,null,null,null,0,null,null,null,{"$f":"1-F80","v":1},null,null,null,{"$f":"IFERROR(E78/100,\"\")","v":0}]
[{"$f":"IF(D81>0,\"F\",\"\")","v":""},"MARCENARIA",null,{"$f":"Orçamento!V246","v":0},{"$f":"Orçamento!X246","v":0},{"$f":"ROUND(F83*$D$81,2)","v":0},null,null,null,{"$f":"ROUND(J83*$D$81,2)","v":0},null,null,null,{"$f":"SUM(F81:M81)","v":0}]
[{"$f":"IF(A81=\"F\",A81,\"\")","v":""}]
[{"$f":"IF(A82=\"F\",A82,\"\")","v":""},null,null,null,null,0.4,null,null,null,{"$f":"1-F83","v":0.6},null,null,null,{"$f":"IFERROR(E81/100,\"\")","v":0}]
[{"$f":"IF(D84>0,\"F\",\"\")","v":""},"ADMINISTRAÇÃO - MENSALISTAS",null,{"$f":"Orçamento!V247","v":0},{"$f":"Orçamento!X247","v":0},{"$f":"ROUND(F86*$D$84,2)","v":0},null,null,null,{"$f":"ROUND(J86*$D$84,2)","v":0},null,null,null,{"$f":"SUM(F84:M84)","v":0}]
[{"$f":"IF(A84=\"F\",A84,\"\")","v":""}]
[{"$f":"IF(A85=\"F\",A85,\"\")","v":""},null,null,null,null,0.49,null,null,null,{"$f":"1-F86","v":0.51},null,null,null,{"$f":"IFERROR(E84/100,\"\")","v":0}]
[{"$f":"IF(D87>0,\"F\",\"\")","v":""},"PINTURA",null,{"$f":"Orçamento!V248","v":0},{"$f":"Orçamento!X248","v":0},{"$f":"ROUND(F89*$D$87,2)","v":0},null,null,null,{"$f":"ROUND(J89*$D$87,2)","v":0},null,null,null,{"$f":"SUM(F87:M87)","v":0}]
[{"$f":"IF(A87=\"F\",A87,\"\")","v":""}]
[{"$f":"IF(A88=\"F\",A88,\"\")","v":""},null,null,null,null,0,null,null,null,{"$f":"1-F89","v":1},null,null,null,{"$f":"IFERROR(E87/100,\"\")","v":0}]
[{"$f":"IF(D90>0,\"F\",\"\")","v":""},"DIVERSOS",null,{"$f":"Orçamento!V249","v":0},{"$f":"Orçamento!X249","v":0},{"$f":"ROUND(F92*$D$90,2)","v":0},null,null,null,{"$f":"ROUND(J92*$D$90,2)","v":0},null,null,null,{"$f":"SUM(F90:M90)","v":0}]
[{"$f":"IF(A90=\"F\",A90,\"\")","v":""}]
[{"$f":"IF(A91=\"F\",A91,\"\")","v":""},null,null,null,null,0.46,null,null,null,{"$f":"1-F92","v":0.54},null,null,null,{"$f":"IFERROR(E90/100,\"\")","v":0}]
["F","CUSTO DO ORÇAMENTO",null,{"$f":"SUM(D15:D92)","v":0},{"$f":"SUM(E15:E92)","v":0},{"$f":"F15+F18+F21+F24+F27+F30+F33+F36+F39+F42+F45+F48+F51+F54+F57+F60+F63+F66+F69+F72+F75+F78+F81+F84+F87+F90","v":0},null,null,null,{"$f":"J15+J18+J21+J24+J27+J30+J33+J36+J39+J42+J45+J48+J51+J54+J57+J60+J63+J66+J69+J72+J75+J78+J81+J84+J87+J90","v":0},null,null,null,{"$f":"N15+N18+N21+N24+N27+N30+N33+N36+N39+N42+N45+N48+N51+N54+N57+N60+N63+N66+N69+N72+N75+N78+N81+N84+N87+N90","v":0}]
["F","PERCENTUAIS:",null,null,null,{"$f":"IFERROR(F93/D93,\"\")","v":""},null,null,null,{"$f":"IFERROR(J93/D93,\"\")","v":""},null,null,null,{"$f":"SUM(F94:M94)","v":0}]
["F","TOTAIS ACUMULADOS:",null,null,null,{"$f":"F93","v":0},null,null,null,{"$f":"F95+J93","v":0}]
["F","PERCENTUAIS  ACUMULADOS:",null,null,null,{"$f":"F94","v":""},null,null,null,{"$f":"IFERROR(F96+J94,\"\")","v":""}]
["F"]
["F","OBSERVAÇÕES:"]
["F","Os pagamentos somente poderão ser efetuados mediante medição e atesto pelos técnicos da Secretaria da Educação. "]

{"sheet":"Composição BDI","index":4,"n_rows":45,"n_cols":9,"rows_kept":45,"cut":false,"hidden":false,"merged":[[11,0,11,3],[12,0,12,3],[14,0,14,3],[15,0,15,3],[13,0,13,3],[0,0,0,3],[1,0,1,3],[4,0,4,3],[7,0,7,3],[10,0,10,3],[2,0,2,3],[3,0,3,3],[5,0,5,3],[6,0,6,3],[8,0,8,3],[9,0,9,3],[18,5,18,8],[17,0,17,3],[16,0,16,3],[44,0,44,3],[42,0,42,3],[43,0,43,3],[18,0,18,3],[36,0,36,3],[39,0,39,3],[38,0,38,3],[40,0,40,3],[29,0,29,2],[32,0,32,3],[33,0,33,3],[34,0,34,3],[35,0,35,3]]}
[]
[]
["UNIDADE ESCOLAR"]
[{"$f":"Orçamento!$O$4","v":"COLÉGIO ESTADUAL JOÃO BÊNNIO"}]
[]
["OBRA"]
[{"$f":"Orçamento!$O$7","v":"AMPLIAÇÃO E REFORMA"}]
[]
["ENDEREÇO"]
[{"$f":"Orçamento!$R$10","v":"RUA JC QUADRA 140 AREA VERDE S/N, JD CURITIBA III, CEP:74481-130"}]
[]
["CIDADE"]
[{"$f":"Orçamento!$V$7","v":"GOIÂNIA"}]
[]
["CRE"]
[{"$f":"Orçamento!$O$10","v":"GOIÂNIA"}]
[]
["DETALHAMENTO DA COMPOSIÇÃO DE BDI"]
["COMPOSIÇÃO BDI PARA OBRAS CIVIS",null,null,null,null,"BDI CONSTRUÇÃO E REFORMA"]
["DESCRIÇÃO","COEF.","TAXA % (a.m)","% no preço de venda",null,"Situação","1º Quartil","Médio","3º Quartil"]
["1) COFINS",1,0.03,{"$f":"C21","v":0.03},null,{"$f":"IF(OR(C21<G21,C21>I21),\"FORA DO INTERVALO\",\"OK\")","v":"OK"},0.03,0.03,0.03]
["2) PIS",1,6.4999999999999997E-3,{"$f":"C22","v":6.4999999999999997E-3},null,{"$f":"IF(OR(C22<G22,C22>I22),\"FORA DO INTERVALO\",\"OK\")","v":"OK"},6.4999999999999997E-3,6.4999999999999997E-3,6.4999999999999997E-3]
["3) ISSQN",1,0.03,{"$f":"C23*B23","v":0.03},null,"OK",0.02,3.5000000000000003E-2,0.05]
["4) CPRB",1,0,{"$f":"C24","v":0},null,"FORA DO INTERVALO",4.4999999999999998E-2,4.4999999999999998E-2,4.4999999999999998E-2]
["5) Administração Central",1,0.04,0.04,null,"OK",0.03,0.04,5.5E-2]
["6) Despesas Financeiras",1,5.5999999999999999E-3,5.5999999999999999E-3,null,"FORA DO INTERVALO",5.8999999999999999E-3,1.23E-2,1.3899999999999999E-2]
["7) Seguros + Garantias",1,1.1999999999999999E-3,1.1999999999999999E-3,null,"FORA DO INTERVALO",8.0000000000000002E-3,8.0000000000000002E-3,0.01]
["8) Risco",1,9.7000000000000003E-3,9.7000000000000003E-3,null,"OK",9.7000000000000003E-3,1.2699999999999999E-2,1.2699999999999999E-2]
["9) Lucro",1,6.3100000000000003E-2,6.3100000000000003E-2,null,"OK",6.1600000000000002E-2,7.3999999999999996E-2,8.9599999999999999E-2]
["BDI - FINAL",null,null,{"$f":"(((1+D25+D27+D28)*(1+D26)*(1+D29))/(1-(D21+D22+D23+D24))-1)","v":0.20350099199143035},null,{"$f":"IF(OR(D30<G30,D30>I30),\"FORA DO INTERVALO\",\"OK\")","v":"OK"},0.2034,0.22120000000000001,0.25]
[]
["Notas:"]
["(1) e (2) Alíquota definida por lei."]
["(3) Alíquota e base de cálculo definidas pela legislação municipal."]
["(4) Alíquota definida pelas leis 12.546/11, 12844/13 e 13.161/15 (CPRB – contribuição previdenciária sobre a receita bruta)."]
["(5) Valores definidos a partir dos limites no Acórdão nº 2.622/2013 - TCU – Plenário. Valores entre o 1º e 3º quartis."]
["(6) Valor calculado pela expressão matemática do acórdão 2.369/2011 – TCU – Plenário e disponibilizado pela AGETOP em dezembro de 2018. (Foi utilizado para o cálculo a média da Taxa SELIC no período de 11/2017 a 10/2018)"]
[]
["(7) Valores definidos pela AGETOP a partir dos limites no Acórdão nº 2.622/2013 - TCU – Plenário. Valores médios. \n\nObservação da AGETOP: (Seguros contra erros de execução, incêndio e explosão, danos da natureza (vendaval, destelhamento, alagamento, inundação, desmoronamento, geadas etc.), emprego de material defeituoso ou inadequado, roubo e/ou furto qualificado, quebra de equipamentos, desmoronamento de estrutura, nas modalidades de Obras Civis em Construção (OCC); Instalação e Montagem (IM); e Obras Civis em Construção e Instalação e Montagem (OCC/IM). Bem como coberturas adicionais para ampliação dessas coberturas básicas, como: cobertura de responsabilidade civil geral, cobertura de responsabilidade civil cruzada, cobertura de despesas extraordinárias, cobertura de tumultos, cobertura de desentulho do local, cobertura de riscos do fabricante, dentre outras, incluindo o seguro de vida em grupo regido pela convenção coletiva dos trabalhadores na indústria da construção civil). A partir de 24/02/2015 por intermédio da Portaria 449/2015 a Presidência da AGETOP, na pessoa do Senhor Jayme Eduardo Rincon, determinou a exclusão dos valores referentes aos Seguros de Risco de Engenharia e Responsabilidade Civil do Profissional na composição do cálculo do B.D.I.."]
["(8) Valores definidos a partir dos limites no Acórdão nº 2.622/2013 - TCU – Plenário. Valores entre 1º e 3° quartis."]
["(9) Valores definidos a partir dos limites definidos no Acórdão nº 2.622/2013 - TCU – Plenário. Valores adotados e praticados no mercado ( “ ex ante ” ) ou aqueles entre os 1º e 3º quartis."]
[]
["(*) A fórmula para estipulação da taxa de BDI estimado adotado é a mesma que foi aplicada para a obtenção das tabelas contidas no Acórdão n. 2.622/2013 – TCUPlenário"]
[]
["Obs.: Para obras com valores superiores a R$ 20.000.000,00 sugere-se recalcular o BDI, dimensionando as taxas de administração central e lucro para patamares inferiores ao estipulado acima."]

{"sheet":"Relatório CENTRAL","index":5,"n_rows":40,"n_cols":7,"rows_kept":40,"cut":false,"hidden":false,"merged":[[7,1,7,4],[8,1,8,2],[8,3,8,4],[9,1,9,2],[10,1,10,4],[11,1,11,4],[39,1,39,2],[9,0,11,0],[0,1,0,4],[6,3,6,4],[9,3,9,4],[1,1,1,4],[2,1,2,2],[2,3,2,4],[3,1,3,2],[3,3,3,4],[4,1,4,4],[5,1,5,2],[5,3,5,4],[6,1,6,2]]}
[]
[]
[null,"UNIDADE ESCOLAR",null,"CIDADE"]
[null,{"$f":"Orçamento!$O$4","v":"COLÉGIO ESTADUAL JOÃO BÊNNIO"},null,{"$f":"Orçamento!$V$7","v":"GOIÂNIA"}]
[]
[null,"OBRA",null,"CRE"]
[null,{"$f":"Orçamento!$O$7","v":"AMPLIAÇÃO E REFORMA"},null,{"$f":"Orçamento!$O$10","v":"GOIÂNIA"}]
[]
[null,"ENDEREÇO",null,"DATA"]
["FILTRO",{"$f":"Orçamento!$R$10","v":"RUA JC QUADRA 140 AREA VERDE S/N, JD CURITIBA III, CEP:74481-130"},null,{"$f":"Orçamento!$S$7","v":"2020-04-08"}]
[]
[null,"RELATÓRIO CENTRAL"]
["↓","CÓDIGO","ETAPA","PREÇO  (R$) C/ BDI","PARTIC  ( % )"]
[{"$f":"IF(D14>0,\"F\",\"\")","v":""},{"$f":"Orçamento!O224","v":"a."},{"$f":"Orçamento!P224","v":"SERVIÇOS PRELIMINARES"},{"$f":"Orçamento!V224","v":0},{"$f":"Orçamento!X224","v":0},1,8]
[{"$f":"IF(D15>0,\"F\",\"\")","v":""},{"$f":"Orçamento!O225","v":"b."},{"$f":"Orçamento!P225","v":"TRANSPORTES"},{"$f":"Orçamento!V225","v":0},{"$f":"Orçamento!X225","v":0},8,8]
["",{"$f":"Orçamento!O226","v":"c."},{"$f":"Orçamento!P226","v":"SERVIÇO EM TERRA"},{"$f":"Orçamento!V226","v":0},{"$f":"Orçamento!X226","v":0},6,1]
["",{"$f":"Orçamento!O227","v":"d."},{"$f":"Orçamento!P227","v":"FUNDAÇÕES E SONDAGENS"},{"$f":"Orçamento!V227","v":0},{"$f":"Orçamento!X227","v":0},8,5]
["",{"$f":"Orçamento!O228","v":"e."},{"$f":"Orçamento!P228","v":"ESTRUTURA"},{"$f":"Orçamento!V228","v":0},{"$f":"Orçamento!X228","v":0}]
["",{"$f":"Orçamento!O229","v":"f."},{"$f":"Orçamento!P229","v":"INSTALAÇÕES ELÉTRICAS"},{"$f":"Orçamento!V229","v":0},{"$f":"Orçamento!X229","v":0},8,9]
["",{"$f":"Orçamento!O230","v":"g."},{"$f":"Orçamento!P230","v":"INSTALAÇÕES HIDROSSANITÁRIAS"},{"$f":"Orçamento!V230","v":0},{"$f":"Orçamento!X230","v":0},4,3]
["",{"$f":"Orçamento!O231","v":"h"},{"$f":"Orçamento!P231","v":"INSTALAÇÕES ESPECIAIS"},{"$f":"Orçamento!V231","v":0},{"$f":"Orçamento!X231","v":0},2,5]
["",{"$f":"Orçamento!O232","v":"i."},{"$f":"Orçamento!P232","v":"ALVENARIAS E DIVISÓRIAS"},{"$f":"Orçamento!V232","v":0},{"$f":"Orçamento!X232","v":0}]
["",{"$f":"Orçamento!O233","v":"j."},{"$f":"Orçamento!P233","v":"ALVENARIA AUTO-PORTANTE"},{"$f":"Orçamento!V233","v":0},{"$f":"Orçamento!X233","v":0}]
["",{"$f":"Orçamento!O234","v":"k."},{"$f":"Orçamento!P234","v":"IMPERMEABILIZAÇÃO"},{"$f":"Orçamento!V234","v":0},{"$f":"Orçamento!X234","v":0}]
["",{"$f":"Orçamento!O235","v":"l."},{"$f":"Orçamento!P235","v":"ISOLAMENTO TÉRMICO E ACÚSTICO"},{"$f":"Orçamento!V235","v":0},{"$f":"Orçamento!X235","v":0}]
["",{"$f":"Orçamento!O236","v":"m."},{"$f":"Orçamento!P236","v":"ESTRUTURA DE MADEIRA"},{"$f":"Orçamento!V236","v":0},{"$f":"Orçamento!X236","v":0}]
["",{"$f":"Orçamento!O237","v":"n."},{"$f":"Orçamento!P237","v":"ESTRUTURAS METÁLICAS"},{"$f":"Orçamento!V237","v":0},{"$f":"Orçamento!X237","v":0},1,2]
["",{"$f":"Orçamento!O238","v":"o."},{"$f":"Orçamento!P238","v":"COBERTURAS"},{"$f":"Orçamento!V238","v":0},{"$f":"Orçamento!X238","v":0},9,9]
["",{"$f":"Orçamento!O239","v":"p."},{"$f":"Orçamento!P239","v":"ESQUADRIAS DE MADEIRA"},{"$f":"Orçamento!V239","v":0},{"$f":"Orçamento!X239","v":0}]
["",{"$f":"Orçamento!O240","v":"q."},{"$f":"Orçamento!P240","v":"ESQUADRIAS METÁLICAS"},{"$f":"Orçamento!V240","v":0},{"$f":"Orçamento!X240","v":0}]
["",{"$f":"Orçamento!O241","v":"r."},{"$f":"Orçamento!P241","v":"VIDROS"},{"$f":"Orçamento!V241","v":0},{"$f":"Orçamento!X241","v":0}]
["",{"$f":"Orçamento!O242","v":"s."},{"$f":"Orçamento!P242","v":"REVESTIMENTO DE PAREDE"},{"$f":"Orçamento!V242","v":0},{"$f":"Orçamento!X242","v":0}]
["",{"$f":"Orçamento!O243","v":"t."},{"$f":"Orçamento!P243","v":"FORROS"},{"$f":"Orçamento!V243","v":0},{"$f":"Orçamento!X243","v":0},6,7]
["",{"$f":"Orçamento!O244","v":"u."},{"$f":"Orçamento!P244","v":"REVESTIMENTO DE PISO"},{"$f":"Orçamento!V244","v":0},{"$f":"Orçamento!X244","v":0},7,7]
["",{"$f":"Orçamento!O245","v":"v."},{"$f":"Orçamento!P245","v":"FERRAGENS"},{"$f":"Orçamento!V245","v":0},{"$f":"Orçamento!X245","v":0},2,5]
["",{"$f":"Orçamento!O246","v":"w."},{"$f":"Orçamento!P246","v":"MARCENARIA"},{"$f":"Orçamento!V246","v":0},{"$f":"Orçamento!X246","v":0}]
["",{"$f":"Orçamento!O247","v":"x."},{"$f":"Orçamento!P247","v":"ADMINISTRAÇÃO"},{"$f":"Orçamento!V247","v":0},{"$f":"Orçamento!X247","v":0},1,2]
["",{"$f":"Orçamento!O248","v":"y."},{"$f":"Orçamento!P248","v":"PINTURA"},{"$f":"Orçamento!V248","v":0},{"$f":"Orçamento!X248","v":0},5,8]
["",{"$f":"Orçamento!O249","v":"z."},{"$f":"Orçamento!P249","v":"DIVERSOS"},{"$f":"Orçamento!V249","v":0},{"$f":"Orçamento!X249","v":0},9,1]
["F","TOTAL GERAL DO ORÇAMENTO (R$) C/BDI",null,{"$f":"SUM(D14:D39)","v":0},{"$f":"SUM(E14:E39)","v":0},{"$f":"SUM(F14:F39)","v":77},{"$f":"SUM(G14:G39)","v":80}]

{"sheet":"Parc Maior Relev","index":6,"n_rows":32,"n_cols":7,"rows_kept":32,"cut":false,"hidden":false,"merged":[[0,1,0,6],[11,1,11,6],[1,1,1,6],[2,1,2,3],[2,4,2,6],[3,1,3,3],[3,4,3,6],[4,1,4,6],[5,1,5,3],[5,4,5,6],[9,1,9,3],[9,4,9,6],[10,1,10,6],[6,1,6,3],[6,4,6,6],[7,1,7,6],[10,0,12,0],[8,1,8,3],[8,4,8,6],[32,3,32,7],[30,1,30,6]]}
[]
[]
[null,"UNIDADE ESCOLAR",null,null,"CÓDIGO INEP"]
[null,{"$f":"Orçamento!$O$4","v":"COLÉGIO ESTADUAL JOÃO BÊNNIO"},null,null,{"$f":"Orçamento!$V$4","v":52035131}]
[]
[null,"OBRA",null,null,"CIDADE"]
[null,{"$f":"Orçamento!$O$7","v":"AMPLIAÇÃO E REFORMA"},null,null,{"$f":"Orçamento!$V$7","v":"GOIÂNIA"}]
[]
[null,"CRE",null,null,"ÁREA TOTAL CONSTRUÍDA (M²)"]
[null,{"$f":"Orçamento!$O$10","v":"GOIÂNIA"},null,null,{"$f":"Orçamento!$S$13","v":1205}]
["FILTRO"]
[null,"PARCELA DE MAIOR RELEVÂNCIA"]
[null,"CÓDIGO","SERVIÇO","DESCRIÇÃO","UNID","QUANT","PARC. MAIOR RELEV (100%)"]
[null,70000,"INSTALAÇÕES ELÉTRICAS","SUBESTAÇÃO","KVA",{"$f":"SUMIF(Orçamento!$R$205:$R$205,'Parc Maior Relev'!D14,Orçamento!$T$205:$T$205)","v":0},{"$f":"F14","v":0}]
[null,"CÓDIGO","SERVIÇO","DESCRIÇÃO","UNID","QUANT","PARC. MAIOR RELEV (50%)"]
[null,70000,"INSTALAÇÕES ELÉTRICAS","INSTALAÇÕES ELÉTRICAS","KVA",61.66,{"$f":"F16*0.5","v":30.83}]
[null,160000,"COBERTURAS","TELHA CERÂMICA","M2",{"$f":"SUMIF(Orçamento!$R$205:$R$205,'Parc Maior Relev'!D17,Orçamento!$T$205:$T$205)","v":0},{"$f":"F17*0.5","v":0}]
[null,160000,"COBERTURAS","TELHA FIBROCIMENTO","M2",{"$f":"SUMIF(Orçamento!$R$205:$R$205,'Parc Maior Relev'!D18,Orçamento!$T$205:$T$205)","v":0},0]
[null,160000,"COBERTURAS","TELHA METÁLICA","M2",{"$f":"Orçamento!T197","v":594.86},297.43]
[null,200000,"REVESTIMENTO DE PAREDE","REBOCO","M2",{"$f":"SUMIF(Orçamento!$R$205:$R$205,'Parc Maior Relev'!D20,Orçamento!$T$205:$T$205)","v":0},{"$f":"F20*0.5","v":0}]
[null,200000,"REVESTIMENTO DE PAREDE","REVESTIMENTO CERÂMICO","M2",{"$f":"SUMIF(Orçamento!$R$205:$R$205,'Parc Maior Relev'!D21,Orçamento!$T$205:$T$205)","v":0},0]
[null,210000,"FORROS","FORRO DE GESSO","M2",{"$f":"SUMIF(Orçamento!$R$205:$R$205,'Parc Maior Relev'!D22,Orçamento!$T$205:$T$205)","v":0},{"$f":"F22*0.5","v":0}]
[null,210000,"FORROS","FORRO PVC","M2",{"$f":"SUMIF(Orçamento!$R$205:$R$205,'Parc Maior Relev'!D23,Orçamento!$T$205:$T$205)","v":0},0]
[null,210000,"FORROS","FORRO ACARTONADO","M2",{"$f":"SUMIF(Orçamento!$R$205:$R$205,'Parc Maior Relev'!D24,Orçamento!$T$205:$T$205)","v":0},0]
[null,220000,"REVESTIMENTO DE PISO","PISO GRANITINA","M2",{"$f":"Orçamento!T129","v":550},275]
[null,220000,"REVESTIMENTO DE PISO","PISO LAMINADO","M2",{"$f":"SUMIF(Orçamento!$R$205:$R$205,'Parc Maior Relev'!D26,Orçamento!$T$205:$T$205)","v":0},0]
[null,220000,"REVESTIMENTO DE PISO","PISO CONCRETO DESEMPENADO","M2",{"$f":"SUMIF(Orçamento!$R$205:$R$205,'Parc Maior Relev'!D27,Orçamento!$T$205:$T$205)","v":0},0]
[null,220000,"REVESTIMENTO DE PISO","PISO CERÂMICO","M2",{"$f":"SUMIF(Orçamento!$R$205:$R$205,'Parc Maior Relev'!D28,Orçamento!$T$205:$T$205)","v":0},{"$f":"F28*0.5","v":0}]
[null,260000,"PINTURA","PINTURA","M2",{"$f":"SUMIF(Orçamento!$R$205:$R$205,'Parc Maior Relev'!D29,Orçamento!$T$205:$T$205)","v":0},0]
["F"]
["F","(*) Para os fins do inciso I dp § 1º do Art. 30 da Lei Federal 8.666/93, são consideradas parcelas de maior relevância técnica as execuções apresentadas"]
["F"]

{"sheet":"Composições","index":7,"n_rows":109,"n_cols":10,"rows_kept":109,"cut":false,"hidden":false,"merged":[[15,0,15,9],[13,0,13,2],[13,3,13,6],[1,0,1,9],[3,7,3,9],[4,7,4,9],[6,7,6,9],[7,7,7,9],[6,0,6,6],[10,8,10,9],[13,8,13,9],[14,0,14,9],[8,0,8,9],[5,0,5,9],[2,0,2,9],[0,0,0,8],[10,0,10,2],[10,3,10,6],[11,0,11,9],[12,0,12,2],[12,3,12,6],[12,7,12,8],[7,0,7,6],[9,0,9,2],[9,3,9,6],[9,7,9,8],[3,0,3,6],[4,0,4,6],[16,5,17,5],[16,6,16,7],[16,8,16,9],[22,1,22,7],[26,1,26,7],[16,0,17,0],[16,1,17,1],[16,2,17,2],[16,3,17,3],[16,4,17,4],[28,5,29,5],[28,6,28,7],[28,8,28,9],[32,1,32,7],[36,1,36,7],[28,0,29,0],[28,1,29,1],[28,2,29,2],[28,3,29,3],[28,4,29,4],[38,5,39,5],[38,6,38,7],[38,8,38,9],[44,1,44,7],[51,1,51,7],[38,0,39,0],[38,1,39,1],[38,2,39,2],[38,3,39,3],[38,4,39,4],[53,5,54,5],[53,6,53,7],[53,8,53,9],[59,1,59,7],[63,1,63,7],[53,0,54,0],[53,1,54,1],[53,2,54,2],[53,3,54,3],[53,4,54,4],[65,5,66,5],[65,6,65,7],[65,8,65,9],[71,1,71,7],[75,1,75,7],[65,0,66,0],[65,1,66,1],[65,2,66,2],[65,3,66,3],[65,4,66,4],[77,5,78,5],[77,6,77,7],[77,8,77,9],[83,1,83,7],[87,1,87,7],[77,0,78,0],[77,1,78,1],[77,2,78,2],[77,3,78,3],[77,4,78,4],[89,5,90,5],[89,6,89,7],[89,8,89,9],[95,1,95,7],[99,1,99,7],[89,0,90,0],[89,1,90,1],[89,2,90,2],[89,3,90,3],[89,4,90,4],[101,5,102,5],[101,6,101,7],[101,8,101,9],[106,1,106,7],[108,1,108,7],[101,0,102,0],[101,1,102,1],[101,2,102,2],[101,3,102,3],[101,4,102,4]]}
[]
[]
[]
["UNIDADE ESCOLAR",null,null,null,null,null,null,"CÓDIGO INEP"]
[{"$f":"Orçamento!$O$4","v":"COLÉGIO ESTADUAL JOÃO BÊNNIO"},null,null,null,null,null,null,{"$f":"Orçamento!$V$4","v":52035131}]
[]
["OBRA",null,null,null,null,null,null,"CIDADE"]
[{"$f":"Orçamento!$O$7","v":"AMPLIAÇÃO E REFORMA"},null,null,null,null,null,null,{"$f":"Orçamento!$V$7","v":"GOIÂNIA"}]
[]
["CRE",null,null,"ENDEREÇO",null,null,null,"REFERÊNCIA AGETOP"]
[{"$f":"Orçamento!$O$10","v":"GOIÂNIA"},null,null,{"$f":"Orçamento!$R$10","v":"RUA JC QUADRA 140 AREA VERDE S/N, JD CURITIBA III, CEP:74481-130"},null,null,null,{"$f":"Orçamento!$V$10","v":"DEZ/18"},{"$f":"Orçamento!$W$10","v":"ONERADA"}]
[]
["DATA",null,null,"ÁREA TOTAL CONSTRUÍDA (M²)",null,null,null,"REFERÊNCIA SINAPI"]
[{"$f":"Orçamento!$S$7","v":"2020-04-08"},null,null,{"$f":"Orçamento!$S$13","v":1205},null,null,null,{"$f":"Orçamento!$V$13","v":"AGO/19"},{"$f":"Orçamento!$W$13","v":"ONERADA"}]
[]
["COMPOSIÇÕES DE CUSTOS UNITÁRIOS - SEE-GO"]
[24,"FONTE","CÓDIGO","DESCRIÇÃO","UNIDADE","COEFIC.","CUSTO UNITÁRIO",null,"CUSTO  TOTAL (A) + (B) + (C) + (D) + (E)"]
[null,null,null,null,null,null,"DESONERADO","NÃO DESONER.","DESONERADO","NÃO DESONER."]
[null,"COMPOSIÇÃO","COMP 024_SEE","SINALIZADOR FOTOLUMINESCENTE PARA EXTINTOR","UN ",null,"-","-",24.109999999999996,24.229999999999997]
[null,"AGETOP_I",5,"SERVENTE","h     ",0.09,8.1999999999999993,9.51,0.74,0.86]
[null,null,null,"","",null,0,0,0,0]
[null,null,null,"","",null,0,0,0,0]
[null,"MÃO DE OBRA (B) - TOTAL",null,null,null,null,null,null,0.74,0.86]
[null,"AGETOP_I",3070,"BUCHA DE NYLON S-6","un",2,0.04,0.04,0.08,0.08]
[null,"AGETOP_I",3393,"PARAFUSO P/BUCHA S-6","un",2,0.08,0.08,0.16,0.16]
[null,"SINAPI_I",37556,"PLACA DE SINALIZACAO DE SEGURANCA CONTRA INCENDIO, FOTOLUMINESCENTE, QUADRADA, *20 X 20* CM, EM PVC *2* MM ANTI-CHAMAS (SIMBOLOS, CORES E PICTOGRAMAS CONFORME NBR 13434)                                                                                                                                                                                                                                                                                                                                 ","UN    ",1,23.13,23.13,23.13,23.13]
[null,"MATERIAL (C) - TOTAL",null,null,null,null,null,null,23.369999999999997,23.369999999999997]
[]
[25,"FONTE","CÓDIGO","DESCRIÇÃO","UNIDADE","COEFIC.","CUSTO UNITÁRIO",null,"CUSTO  TOTAL (A) + (B) + (C) + (D) + (E)"]
[null,null,null,null,null,null,"DESONERADO","NÃO DESONER.","DESONERADO","NÃO DESONER."]
[null,"COMPOSIÇÃO","COMP 025_SEE","SINALIZADOR FOTOLUMINESCENTE DE EMERGÊNCIA","UN ",null,"-","-",24.109999999999996,24.229999999999997]
[null,"AGETOP_I",5,"SERVENTE","h     ",0.09,8.1999999999999993,9.51,0.74,0.86]
[null,"MÃO DE OBRA (B) - TOTAL",null,null,null,null,null,null,0.74,0.86]
[null,"AGETOP_I",3070,"BUCHA DE NYLON S-6","un",2,0.04,0.04,0.08,0.08]
[null,"AGETOP_I",3393,"PARAFUSO P/BUCHA S-6","un",2,0.08,0.08,0.16,0.16]
[null,"SINAPI_I",37556,"PLACA DE SINALIZACAO DE SEGURANCA CONTRA INCENDIO, FOTOLUMINESCENTE, QUADRADA, *20 X 20* CM, EM PVC *2* MM ANTI-CHAMAS (SIMBOLOS, CORES E PICTOGRAMAS CONFORME NBR 13434)                                                                                                                                                                                                                                                                                                                                 ","UN    ",1,23.13,23.13,23.13,23.13]
[null,"MATERIAL (C) - TOTAL",null,null,null,null,null,null,23.369999999999997,23.369999999999997]
[]
[277,"FONTE","CÓDIGO","DESCRIÇÃO","UNIDADE","COEFIC.","CUSTO UNITÁRIO",null,"CUSTO  TOTAL (A) + (B) + (C) + (D) + (E)"]
[null,null,null,null,null,null,"DESONERADO","NÃO DESONER.","DESONERADO","NÃO DESONER."]
[null,"COMPOSIÇÃO","COMP 277_SEE","MARCAÇÃO NO PISO - 1X1 M PARA EXTINTOR","M2",null,null,null,28.81,28.88]
[null,"AGETOP_I",5,"SERVENTE","h     ",3.3300000000000003E-2,8.1999999999999993,9.51,0.27,0.32]
[null,null,null,"","",null,0,0,0,0]
[null,null,null,"","",null,0,0,0,0]
[null,"MÃO DE OBRA (B) - TOTAL",null,null,null,null,null,null,0.27,0.32]
[null,"SINAPI_I",5318,"SOLVENTE DILUENTE A BASE DE AGUARRAS                                                                                                                                                                                                                                                                                                                                                                                                                                                                      ","L     ",0.13,11.78,11.78,1.53,1.53]
[null,"SINAPI",5824,"CAMINHÃO TOCO, PBT 16.000 KG, CARGA ÚTIL MÁX. 10.685 KG, DIST. ENTRE EIXOS 4,8 M, POTÊNCIA 189 CV, INCLUSIVE CARROCERIA FIXA ABERTA DE MADEIRA P/ TRANSPORTE GERAL DE CARGA SECA, DIMEN. APROX. 2,5 X 7,00 X 0,50 M - CHP DIURNO. AF_06/2014","CHP",3.3E-3,135.91,139.12,0.45,0.46]
[null,"SINAPI_I",7343,"TINTA A BASE DE RESINA ACRILICA, PARA SINALIZACAO HORIZONTAL VIARIA (NBR 11862)                                                                                                                                                                                                                                                                                                                                                                                                                           ","L     ",0.6,11.38,11.38,6.83,6.83]
[null,"SINAPI_I",7348,"TINTA ACRILICA PREMIUM PARA PISO                                                                                                                                                                                                                                                                                                                                                                                                                                                                          ","L     ",0.03,12.4,12.4,0.37,0.37]
[null,"SINAPI_I",25972,"MICROESFERAS DE VIDRO PARA SINALIZACAO HORIZONTAL VIARIA, TIPO I-B (PREMIX) - NBR 16184                                                                                                                                                                                                                                                                                                                                                                                                                   ","KG    ",2.14,8.8800000000000008,8.8800000000000008,19,19]
[null,"SINAPI",95133,"MÁQUINA DEMARCADORA DE FAIXA DE TRÁFEGO À FRIO, AUTOPROPELIDA, POTÊNCIA 38 HP - CHP DIURNO. AF_07/2016","CHP",3.3E-3,109.81,113.39,0.36,0.37]
[null,"MATERIAL (C) - TOTAL",null,null,null,null,null,null,28.54,28.56]
[]
[235,"FONTE","CÓDIGO","DESCRIÇÃO","UNIDADE","COEFIC.","CUSTO UNITÁRIO",null,"CUSTO  TOTAL (A) + (B) + (C) + (D) + (E)"]
[null,null,null,null,null,null,"DESONERADO","NÃO DESONER.","DESONERADO","NÃO DESONER."]
[null,"COMPOSIÇÃO","COMP 235_SEE","PLACA DE SINALIZAÇÃO EM PVC COD 01 - (300X300) PROIBIDO FUMAR","UN ",null,null,null,24.109999999999996,24.229999999999997]
[null,"AGETOP_I",5,"SERVENTE","h     ",0.09,8.1999999999999993,9.51,0.74,0.86]
[null,null,null,"","",null,0,0,0,0]
[null,null,null,"","",null,0,0,0,0]
[null,"MÃO DE OBRA (B) - TOTAL",null,null,null,null,null,null,0.74,0.86]
[null,"AGETOP_I",3070,"BUCHA DE NYLON S-6","un",2,0.04,0.04,0.08,0.08]
[null,"AGETOP_I",3393,"PARAFUSO P/BUCHA S-6","un",2,0.08,0.08,0.16,0.16]
[null,"SINAPI_I",37556,"PLACA DE SINALIZACAO DE SEGURANCA CONTRA INCENDIO, FOTOLUMINESCENTE, QUADRADA, *20 X 20* CM, EM PVC *2* MM ANTI-CHAMAS (SIMBOLOS, CORES E PICTOGRAMAS CONFORME NBR 13434)                                                                                                                                                                                                                                                                                                                                 ","UN    ",1,23.13,23.13,23.13,23.13]
[null,"MATERIAL (C) - TOTAL",null,null,null,null,null,null,23.369999999999997,23.369999999999997]
[]
[236,"FONTE","CÓDIGO","DESCRIÇÃO","UNIDADE","COEFIC.","CUSTO UNITÁRIO",null,"CUSTO  TOTAL (A) + (B) + (C) + (D) + (E)"]
[null,null,null,null,null,null,"DESONERADO","NÃO DESONER.","DESONERADO","NÃO DESONER."]
[null,"COMPOSIÇÃO","COMP 236_SEE","PLACA DE SINALIZAÇÃO EM PVC COD 06 - (300X300) PERIGO INFLAMÁVEL","UN ",null,null,null,24.109999999999996,24.229999999999997]
[null,"AGETOP_I",5,"SERVENTE","h     ",0.09,8.1999999999999993,9.51,0.74,0.86]
[null,null,null,"","",null,0,0,0,0]
[null,null,null,"","",null,0,0,0,0]
[null,"MÃO DE OBRA (B) - TOTAL",null,null,null,null,null,null,0.74,0.86]
[null,"AGETOP_I",3070,"BUCHA DE NYLON S-6","un",2,0.04,0.04,0.08,0.08]
[null,"AGETOP_I",3393,"PARAFUSO P/BUCHA S-6","un",2,0.08,0.08,0.16,0.16]
[null,"SINAPI_I",37556,"PLACA DE SINALIZACAO DE SEGURANCA CONTRA INCENDIO, FOTOLUMINESCENTE, QUADRADA, *20 X 20* CM, EM PVC *2* MM ANTI-CHAMAS (SIMBOLOS, CORES E PICTOGRAMAS CONFORME NBR 13434)                                                                                                                                                                                                                                                                                                                                 ","UN    ",1,23.13,23.13,23.13,23.13]
[null,"MATERIAL (C) - TOTAL",null,null,null,null,null,null,23.369999999999997,23.369999999999997]
[]
[411,"FONTE","CÓDIGO","DESCRIÇÃO","UNIDADE","COEFIC.","CUSTO UNITÁRIO",null,"CUSTO  TOTAL (A) + (B) + (C) + (D) + (E)"]
[null,null,null,null,null,null,"DESONERADO","NÃO DESONER.","DESONERADO","NÃO DESONER."]
[null,"COMPOSIÇÃO","COMP 411_SEE","PLACA DE SINALIZAÇÃO EM PVC COD 13 - (316X158) SAÍDA DE EMERGÊNCIA","UN ",null,null,null,29.349999999999998,29.47]
[null,"AGETOP_I",5,"SERVENTE","h     ",0.09,8.1999999999999993,9.51,0.74,0.86]
[null,null,null,"","",null,0,0,0,0]
[null,null,null,"","",null,0,0,0,0]
[null,"MÃO DE OBRA (B) - TOTAL",null,null,null,null,null,null,0.74,0.86]
[null,"AGETOP_I",3070,"BUCHA DE NYLON S-6","un",2,0.04,0.04,0.08,0.08]
[null,"AGETOP_I",3393,"PARAFUSO P/BUCHA S-6","un",2,0.08,0.08,0.16,0.16]
[null,"SINAPI_I",37559,"PLACA DE SINALIZACAO DE SEGURANCA CONTRA INCENDIO, FOTOLUMINESCENTE, RETANGULAR, *12 X 40* CM, EM PVC *2* MM ANTI-CHAMAS (SIMBOLOS, CORES E PICTOGRAMAS CONFORME NBR 13434)                                                                                                                                                                                                                                                                                                                               ","UN    ",1,28.37,28.37,28.37,28.37]
[null,"MATERIAL (C) - TOTAL",null,null,null,null,null,null,28.61,28.61]
[]
[412,"FONTE","CÓDIGO","DESCRIÇÃO","UNIDADE","COEFIC.","CUSTO UNITÁRIO",null,"CUSTO  TOTAL (A) + (B) + (C) + (D) + (E)"]
[null,null,null,null,null,null,"DESONERADO","NÃO DESONER.","DESONERADO","NÃO DESONER."]
[null,"COMPOSIÇÃO","COMP 412_SEE","PLACA DE SINALIZAÇÃO EM PVC COD 17 - (316X158) MENSAGEM \"SAÍDA\"","UN ",null,null,null,29.349999999999998,29.47]
[null,"AGETOP_I",5,"SERVENTE","h     ",0.09,8.1999999999999993,9.51,0.74,0.86]
[null,null,null,"","",null,0,0,0,0]
[null,null,null,"","",null,0,0,0,0]
[null,"MÃO DE OBRA (B) - TOTAL",null,null,null,null,null,null,0.74,0.86]
[null,"AGETOP_I",3070,"BUCHA DE NYLON S-6","un",2,0.04,0.04,0.08,0.08]
[null,"AGETOP_I",3393,"PARAFUSO P/BUCHA S-6","un",2,0.08,0.08,0.16,0.16]
[null,"SINAPI_I",37559,"PLACA DE SINALIZACAO DE SEGURANCA CONTRA INCENDIO, FOTOLUMINESCENTE, RETANGULAR, *12 X 40* CM, EM PVC *2* MM ANTI-CHAMAS (SIMBOLOS, CORES E PICTOGRAMAS CONFORME NBR 13434)                                                                                                                                                                                                                                                                                                                               ","UN    ",1,28.37,28.37,28.37,28.37]
[null,"MATERIAL (C) - TOTAL",null,null,null,null,null,null,28.61,28.61]
[]
[74,"FONTE","CÓDIGO","DESCRIÇÃO","UNIDADE","COEFIC.","CUSTO UNITÁRIO",null,"CUSTO  TOTAL (A) + (B) + (C) + (D) + (E)"]
[null,null,null,null,null,null,"DESONERADO","NÃO DESONER.","DESONERADO","NÃO DESONER."]
[null,"COMPOSIÇÃO","COMP 074_SEE"," RALO SEMI-ESFERICO FoFo TP ABACAXI D = 150MM ","UN ",null,null,null,48.480000000000004,51.58]
[null,"AGETOP_I",8,"AJUDANTE","h     ",0.9,8.1999999999999993,9.51,7.38,8.56]
[null,"AGETOP_I",11,"ENCANADOR","h     ",0.9,13.4,15.53,12.06,13.98]
[null,"MÃO DE OBRA (B) - TOTAL",null,null,null,null,null,null,19.440000000000001,22.54]
[null,"SINAPI_I",11709,"RALO FOFO SEMIESFERICO, 150 MM, PARA LAJES/ CALHAS                                                                                                                                                                                                                                                                                                                                                                                                                                                        ","UN    ",1,29.04,29.04,29.04,29.04]
[null,"MATERIAL (C) - TOTAL",null,null,null,null,null,null,29.04,29.04]

{"sheet":"Cotações","index":8,"n_rows":16,"n_cols":9,"rows_kept":16,"cut":false,"hidden":false,"merged":[[9,0,9,2],[9,3,9,6],[9,7,9,8],[10,0,10,2],[10,3,10,6],[10,8,10,9],[14,0,14,8],[15,0,15,9],[11,0,11,9],[12,0,12,2],[12,3,12,6],[12,7,12,8],[13,0,13,2],[13,3,13,6],[13,8,13,9],[8,0,8,8],[0,0,0,8],[1,0,1,9],[2,0,2,8],[3,0,3,6],[3,7,3,9],[4,0,4,6],[4,7,4,9],[5,0,5,8],[6,0,6,6],[6,7,6,9],[7,0,7,6],[7,7,7,9]]}
[]
[]
[]
["UNIDADE ESCOLAR",null,null,null,null,null,null,"CÓDIGO INEP"]
[{"$f":"Orçamento!$O$4","v":"COLÉGIO ESTADUAL JOÃO BÊNNIO"},null,null,null,null,null,null,{"$f":"Orçamento!$V$4","v":52035131}]
[]
["OBRA",null,null,null,null,null,null,"CIDADE"]
[{"$f":"Orçamento!$O$7","v":"AMPLIAÇÃO E REFORMA"},null,null,null,null,null,null,{"$f":"Orçamento!$V$7","v":"GOIÂNIA"}]
[]
["CRE",null,null,"ENDEREÇO",null,null,null,"REFERÊNCIA AGETOP"]
[{"$f":"Orçamento!$O$10","v":"GOIÂNIA"},null,null,{"$f":"Orçamento!$R$10","v":"RUA JC QUADRA 140 AREA VERDE S/N, JD CURITIBA III, CEP:74481-130"},null,null,null,{"$f":"Orçamento!$V$10","v":"DEZ/18"},{"$f":"Orçamento!$W$10","v":"ONERADA"}]
[]
["DATA",null,null,"ÁREA TOTAL CONSTRUÍDA (M²)",null,null,null,"REFERÊNCIA SINAPI"]
[{"$f":"Orçamento!$S$7","v":"2020-04-08"},null,null,{"$f":"Orçamento!$S$13","v":1205},null,null,null,{"$f":"Orçamento!$V$13","v":"AGO/19"},{"$f":"Orçamento!$W$13","v":"ONERADA"}]
[]
["COTAÇÕES DE PREÇOS - SEE-GO"]