{"text_format":"1","workbook":"xlsx","n_sheets":8,"sheets":["Orçamento","Resumo ","Somatório","Cronog_60_Dias","Composição BDI","Relatório CENTRAL","Parc Maior Relev","Composições"],"not_rendered":{"charts":0,"images":3,"macros":1,"external_links":0,"defined_names":80,"comments":3,"pivot_tables":0},"unopened":[],"bounds":{"document_bytes":16777216,"sheet_cells":100000,"rows_first":2000,"rows_last":500,"rows_between":2000,"halvings":0,"cell_chars":16384,"cell_head_chars":4096},"cells_cut":0,"cells_raw":0,"read":"whole","date_system":"1900"}

{"sheet":"Orçamento","index":0,"n_rows":355,"n_cols":24,"rows_kept":355,"cut":false,"hidden":false,"merged":[[290,16,290,22],[8,12,9,12],[325,18,325,20],[325,21,325,22],[0,14,0,22],[8,14,8,16],[9,14,9,16],[11,14,11,16],[12,14,12,16],[14,14,14,22],[1,14,1,22],[4,14,4,22],[7,14,7,22],[309,18,309,20],[309,21,309,22],[317,21,317,22],[306,15,306,17],[307,15,307,17],[308,15,308,17],[310,21,310,22],[318,18,318,20],[318,21,318,22],[316,18,316,20],[316,21,316,22],[324,18,324,20],[324,21,324,22],[311,18,311,20],[311,21,311,22],[304,18,304,20],[304,21,304,22],[326,18,326,20],[326,21,326,22],[280,20,280,21],[302,18,302,20],[302,21,302,22],[303,18,303,20],[303,21,303,22],[301,18,301,20],[301,21,301,22],[310,18,310,20],[281,20,281,21],[292,18,292,22],[298,18,298,20],[298,21,298,22],[299,18,299,20],[299,21,299,22],[300,18,300,20],[300,21,300,22],[323,18,323,20],[323,21,323,22],[320,21,320,22],[321,18,321,20],[321,21,321,22],[322,18,322,20],[322,21,322,22],[312,18,312,20],[312,21,312,22],[319,18,319,20],[319,21,319,22],[314,21,314,22],[315,18,315,20],[315,21,315,22],[317,18,317,20],[313,18,313,20],[313,21,313,22],[314,18,314,20],[318,15,318,17],[319,15,319,17],[320,15,320,17],[321,15,321,17],[322,15,322,17],[295,14,295,23],[284,20,284,21],[283,20,283,21],[279,17,284,17],[279,20,279,21],[296,18,296,20],[296,21,296,22],[297,18,297,20],[297,21,297,22],[285,20,285,21],[305,18,305,20],[305,21,305,22],[306,18,306,20],[306,21,306,22],[307,18,307,20],[307,21,307,22],[308,18,308,20],[308,21,308,22],[320,18,320,20],[297,15,297,17],[298,15,298,17],[299,15,299,17],[300,15,300,17],[301,15,301,17],[302,15,302,17],[303,15,303,17],[304,15,304,17],[305,15,305,17],[309,15,309,17],[310,15,310,17],[311,15,311,17],[312,15,312,17],[313,15,313,17],[314,15,314,17],[315,15,315,17],[316,15,316,17],[317,15,317,17],[287,16,287,22],[288,16,288,22],[289,16,289,22],[3,21,3,22],[2,21,2,22],[5,21,5,22],[10,14,10,23],[13,14,13,23],[6,21,6,22],[9,17,9,20],[2,14,2,20],[3,14,3,20],[5,18,5,20],[6,18,6,20],[11,18,11,20],[12,18,12,20],[6,14,6,17],[5,14,5,17],[329,14,329,23],[330,18,330,20],[330,21,330,22],[331,15,331,17],[331,18,331,20],[331,21,331,22],[332,15,332,17],[332,18,332,20],[332,21,332,22],[354,18,354,20],[354,21,354,22],[351,14,351,17],[348,15,348,17],[348,18,348,20],[348,21,348,22],[349,15,349,17],[349,18,349,20],[349,21,349,22],[350,15,350,17],[350,18,350,20],[350,21,350,22],[353,18,353,20],[353,21,353,22],[352,18,352,20],[352,21,352,22],[323,14,323,17],[330,15,330,17],[296,15,296,17],[351,18,351,20],[351,21,351,22],[339,15,339,17],[339,18,339,20],[339,21,339,22],[340,15,340,17],[340,18,340,20],[340,21,340,22],[341,15,341,17],[341,18,341,20],[341,21,341,22],[345,15,345,17],[345,18,345,20],[345,21,345,22],[346,15,346,17],[346,18,346,20],[346,21,346,22],[347,15,347,17],[336,15,336,17],[291,16,291,22],[347,18,347,20],[347,21,347,22],[342,15,342,17],[342,18,342,20],[342,21,342,22],[343,15,343,17],[343,18,343,20],[343,21,343,22],[344,15,344,17],[344,18,344,20],[344,21,344,22],[336,18,336,20],[336,21,336,22],[337,15,337,17],[337,18,337,20],[337,21,337,22],[338,15,338,17],[338,18,338,20],[338,21,338,22],[333,15,333,17],[333,18,333,20],[333,21,333,22],[334,15,334,17],[334,18,334,20],[334,21,334,22],[335,15,335,17],[335,18,335,20],[335,21,335,22]]}
[]
[]
[null,null,null,null,null,null,null,null,null,null,null,null,null,null,"UNIDADE ESCOLAR",null,null,null,null,null,null,"CÓDIGO INEP"]
[null,null,null,null,null,null,null,null,null,null,null,null,null,null,"CENTRO DE ENSINO EM PERÍODO INTEGRAL PROFESSOR PEDRO GOMES",null,null,null,null,null,null,52033597]
[]
["Nmax",null,null,null,null,null,null,null,null,null,null,null,"Ajustar altura?",null,"OBRA",null,null,null,"DATA",null,null,"CIDADE"]
[{"$f":"MAX($C$18:$C$279)","v":3},null,null,null,null,null,null,null,null,null,null,null,"NÃO",null,"REFORMA",null,null,null,"2020-03-25",null,null,"GOIÂNIA"]
[]
[null,null,null,null,null,null,null,null,null,null,null,null,"",null,"CRE",null,null,"ENDEREÇO",null,null,null,"REFERÊNCIA AGETOP"]
[null,null,null,null,null,null,null,null,null,null,null,null,null,null,"GOIÂNIA",null,null,"AV SERGIPE C/ BENJAMIN CONSTANT S/N, SETOR CAMPINAS, CEP:74550-408",null,null,null,"DEZ/18","DESONERADA"]
[]
[null,null,null,null,null,null,null,null,null,null,null,null,null,null,"ÁREA EXISTENTE (M²)",null,null,"ÁREA A CONSTRUIR (M²)","ÁREA TOTAL CONSTRUÍDA (M²)",null,null,"REFERÊNCIA SINAPI"]
[null,null,null,null,null,null,null,null,null,null,null,null,null,null,5317.06,null,null,null,5317.06,null,null,"JUN/19","DESONERADA"]
[]
[null,null,null,null,null,null,null,null,null,null,null,"FILTRO",null,null,"PLANILHA ORÇAMENTÁRIA"]
["Nível E","Save Nivel","Nível C","Altura","n1","n2","n3","n4","n5","Czero","Cnível","↓","Nível","Nível Corrigido","ITEM","TABELA","CODIGO","DESCRIÇÃO DOS SERVIÇOS","UNID","QUANT","MAT","MO","T.SERVIÇO","OBSERVAÇÕES¹"]
[{"$f":"CHOOSE(1+LOG(1+2*(ORÇAMENTO.Nivel=\"Nível 1\")+4*(ORÇAMENTO.Nivel=\"Nível 2\")+8*(ORÇAMENTO.Nivel=\"Nível 3\")+16*(ORÇAMENTO.Nivel=\"Nível 4\")+32*(ORÇAMENTO.Nivel=\"Serviço\"),2),0,1,2,3,4,\"S\")","v":"S"},{"$f":"IF(OR(C17=\"s\",C17=0),OFFSET(B17,-1,0),C17)","v":"Save Nivel"},{"$f":"IF(OFFSET(C17,-1,0)=\"L\",1,IF(OFFSET(C17,-1,0)=1,2,IF(OR(A17=\"s\",A17=0),\"S\",IF(AND(OFFSET(C17,-1,0)=2,A17=4),3,IF(AND(OR(OFFSET(C17,-1,0)=\"s\",OFFSET(C17,-1,0)=0),A17<>\"s\",A17>OFFSET(B17,-1,0)),OFFSET(B17,-1,0),A17)))))","v":"S"},{"$f":"IF(OR(C17=\"S\",C17=0),0,IF(ISERROR(K17),J17,SMALL(J17:K17,1)))","v":0},{"$f":"IF($C17=1,OFFSET(E17,-1,0)+1,OFFSET(E17,-1,0))","v":"n1"},{"$f":"IF($C17=1,0,IF($C17=2,OFFSET(F17,-1,0)+1,OFFSET(F17,-1,0)))","v":"n2"},{"$f":"IF(AND($C17<=2,$C17<>0),0,IF($C17=3,OFFSET(G17,-1,0)+1,OFFSET(G17,-1,0)))","v":"n3"},{"$f":"IF(AND($C17<=3,$C17<>0),0,IF($C17=4,OFFSET(H17,-1,0)+1,OFFSET(H17,-1,0)))","v":"n4"},{"$f":"IF(AND($C17<=4,$C17<>0),0,IF(AND($C17=\"S\",$W17>0),OFFSET(I17,-1,0)+1,OFFSET(I17,-1,0)))","v":"n5"},{"$f":"IF(OR($C17=\"S\",$C17=0),0,MATCH(0,OFFSET($D17,1,$C17,ROW($C$279)-ROW($C17)),0))","v":0},{"$f":"IF(OR($C17=\"S\",$C17=0),0,MATCH(OFFSET($D17,0,$C17)+1,OFFSET($D17,1,$C17,ROW($C$279)-ROW($C17)),0))","v":0},"","Serviço","Serviço","-","SINAPI",null,"(sem código)","-",null,0,0,0,""]
[0,null,"L",{"$f":"COUNTA(OFFSET(D18,1,0):D$279)","v":260},{"$f":"LEFT(O19,1)-1","v":0},null,null,null,null,null,null,"F","LOTE","LOTE","REFORMA - CENTRO DE ENSINO EM PERÍODO INTEGRAL PROFESSOR PEDRO GOMES",null,null,null,null,null,null,null,0]
[1,{"$f":"IF(OR(C19=\"s\",C19=0),OFFSET(B19,-1,0),C19)","v":1},{"$f":"IF(OFFSET(C19,-1,0)=\"L\",1,IF(OFFSET(C19,-1,0)=1,2,IF(OR(A19=\"s\",A19=0),\"S\",IF(AND(OFFSET(C19,-1,0)=2,A19=4),3,IF(AND(OR(OFFSET(C19,-1,0)=\"s\",OFFSET(C19,-1,0)=0),A19<>\"s\",A19>OFFSET(B19,-1,0)),OFFSET(B19,-1,0),A19)))))","v":1},{"$f":"IF(OR(C19=\"S\",C19=0),0,IF(ISERROR(K19),J19,SMALL(J19:K19,1)))","v":260},{"$f":"IF($C19=1,OFFSET(E19,-1,0)+1,OFFSET(E19,-1,0))","v":1},{"$f":"IF($C19=1,0,IF($C19=2,OFFSET(F19,-1,0)+1,OFFSET(F19,-1,0)))","v":0},{"$f":"IF(AND($C19<=2,$C19<>0),0,IF($C19=3,OFFSET(G19,-1,0)+1,OFFSET(G19,-1,0)))","v":0},{"$f":"IF(AND($C19<=3,$C19<>0),0,IF($C19=4,OFFSET(H19,-1,0)+1,OFFSET(H19,-1,0)))","v":0},0,{"$f":"IF(OR($C19=\"S\",$C19=0),0,MATCH(0,OFFSET($D19,1,$C19,ROW($C$279)-ROW($C19)),0))","v":260},{"$f":"IF(OR($C19=\"S\",$C19=0),0,MATCH(OFFSET($D19,0,$C19)+1,OFFSET($D19,1,$C19,ROW($C$279)-ROW($C19)),0))","v":{"$error":"#N/A"}},"F","Nível 1","Nível 1","1.","AGETOP",null,"REFORMA",null,null,null,null,0]
[2,{"$f":"IF(OR(C20=\"s\",C20=0),OFFSET(B20,-1,0),C20)","v":2},{"$f":"IF(OFFSET(C20,-1,0)=\"L\",1,IF(OFFSET(C20,-1,0)=1,2,IF(OR(A20=\"s\",A20=0),\"S\",IF(AND(OFFSET(C20,-1,0)=2,A20=4),3,IF(AND(OR(OFFSET(C20,-1,0)=\"s\",OFFSET(C20,-1,0)=0),A20<>\"s\",A20>OFFSET(B20,-1,0)),OFFSET(B20,-1,0),A20)))))","v":2},{"$f":"IF(OR(C20=\"S\",C20=0),0,IF(ISERROR(K20),J20,SMALL(J20:K20,1)))","v":14},{"$f":"IF($C20=1,OFFSET(E20,-1,0)+1,OFFSET(E20,-1,0))","v":1},{"$f":"IF($C20=1,0,IF($C20=2,OFFSET(F20,-1,0)+1,OFFSET(F20,-1,0)))","v":1},{"$f":"IF(AND($C20<=2,$C20<>0),0,IF($C20=3,OFFSET(G20,-1,0)+1,OFFSET(G20,-1,0)))","v":0},{"$f":"IF(AND($C20<=3,$C20<>0),0,IF($C20=4,OFFSET(H20,-1,0)+1,OFFSET(H20,-1,0)))","v":0},0,259,14,"","Nível 2","Nível 2","-","AGETOP",null,"SERVIÇOS PRELIMINARES",null,null,null,null,0]
["S",{"$f":"IF(OR(C21=\"s\",C21=0),OFFSET(B21,-1,0),C21)","v":2},{"$f":"IF(OFFSET(C21,-1,0)=\"L\",1,IF(OFFSET(C21,-1,0)=1,2,IF(OR(A21=\"s\",A21=0),\"S\",IF(AND(OFFSET(C21,-1,0)=2,A21=4),3,IF(AND(OR(OFFSET(C21,-1,0)=\"s\",OFFSET(C21,-1,0)=0),A21<>\"s\",A21>OFFSET(B21,-1,0)),OFFSET(B21,-1,0),A21)))))","v":"S"},{"$f":"IF(OR(C21=\"S\",C21=0),0,IF(ISERROR(K21),J21,SMALL(J21:K21,1)))","v":0},1,1,0,0,0,0,0,"","Serviço","Serviço","-","AGETOP",20102,"DEMOLICAO-COBERTURA TELHA FIBROCIMENTO/FIBRA DE VIDRO/SIMILARES C/ TRANSP. ATÉ CB. E CARGA","m2    ",2311.13,null,null,0,""]
["S",2,"S",0,1,1,0,0,0,0,0,"","Serviço","Serviço","-","AGETOP",20103,"DEMOLIÇÃO ESTRUTURA EM MADEIRA TELHADO C/ TRANSP. ATÉ CB. E CARGA","m2    ",2311.13,null,null,0,""]
["S",2,"S",0,1,1,0,0,0,0,0,"","Serviço","Serviço","-","AGETOP",20121,"DEM. MANUAL EM CONCR.SIMPLES C/TR.ATE CB.E CARGA (O.C.)","m3    ",55.645499999999998,null,null,0,""]
["S",2,"S",0,1,1,0,0,0,0,0,"","Serviço","Serviço","-","SINAPI",97633,"DEMOLIÇÃO DE REVESTIMENTO CERÂMICO, DE FORMA MANUAL, SEM REAPROVEITAMENTO. AF_12/2017","M2",168.51,null,null,0,"Referência: AGETOP - 20115"]
["S",2,"S",0,1,1,0,0,0,0,0,"","Serviço","Serviço","-","SINAPI",97631,"DEMOLIÇÃO DE ARGAMASSAS, DE FORMA MANUAL, SEM REAPROVEITAMENTO. AF_12/2017","M2",92.21,null,null,0,""]
["S",2,"S",0,1,1,0,0,0,0,0,"","Serviço","Serviço","-","SINAPI",97622,"DEMOLIÇÃO DE ALVENARIA DE BLOCO FURADO, DE FORMA MANUAL, SEM REAPROVEITAMENTO. AF_12/2017","M3",0.1845,null,null,0,"Referência: AGETOP - 20118"]
["S",2,"S",0,1,1,0,0,0,0,0,"","Serviço","Serviço","-","AGETOP",20137,"DEMOLIÇAO BACIA SANITARIA C/ TRANSP. ATÉ CB. E CARGA","Un    ",2,null,null,0,""]
["S",2,"S",0,1,1,0,0,0,0,0,"","Serviço","Serviço","-","AGETOP",20138,"DEMOLIÇAO DE LAVATÓRIO C/ TRANSP. ATÉ CB. E CARGA","Un    ",2,null,null,0,""]
["S",2,"S",0,1,1,0,0,0,0,0,"","Serviço","Serviço","-","AGETOP",20140,"DEMOLIÇAO DE VÁLVULA DE DESCARGA C/ TRANSP. ATÉ CB. E CARGA","Un    ",2,null,null,0,""]
["S",2,"S",0,1,1,0,0,0,0,0,"","Serviço","Serviço","-","AGETOP",20157,"DEMOLIÇÃO CALHAS/ RUFOS EM CHAPA C/TR.AT.C.B.E CARGA","m2    ",872.76,null,null,0,""]
["S",2,"S",0,1,1,0,0,0,0,0,"","Serviço","Serviço","-","AGETOP",20163,"DEMOLIÇÃO DAS INSTALAÇÕES HIDROSANITÁRIAS E AFINS C/ TRANSP. ATÉ CB. E CARGA","H     ",4,null,null,0,""]
["S",2,"S",0,1,1,0,0,0,0,0,"","Serviço","Serviço","-","AGETOP",20139,"DEMOLIÇAO DE BANCADAS C/ TRANSP. ATÉ CB. E CARGA","m2    ",5.93,null,null,0,""]
["S",2,"S",0,1,1,0,0,0,0,0,"","Serviço","Serviço","-","SINAPI","74209/1","PLACA DE OBRA EM CHAPA DE ACO GALVANIZADO","M2",4.5,null,null,0,"Referência: AGETOP - 21301"]
[2,2,2,3,1,2,0,0,0,245,3,"","Nível 2","Nível 2","-","AGETOP",null,"TRANSPORTES","-",null,null,null,0,""]
["S",2,"S",0,1,2,0,0,0,0,0,"","Serviço","Serviço","-","SINAPI",72900,"TRANSPORTE DE ENTULHO COM CAMINHAO BASCULANTE 6 M3, RODOVIA PAVIMENTADA, DMT 0,5 A 1,0 KM","M3",156.0968,null,null,0,""]
["S",2,"S",0,1,2,0,0,0,0,0,"","Serviço","Serviço","-","SINAPI",72897,"CARGA MANUAL DE ENTULHO EM CAMINHAO BASCULANTE 6 M3","M3",156.0968,null,null,0,""]
[2,2,2,4,1,3,0,0,0,242,4,"","Nível 2","Nível 2","-","AGETOP",null,"SERVIÇO EM TERRA","-",null,null,null,0,""]
[{"$f":"CHOOSE(1+LOG(1+2*(ORÇAMENTO.Nivel=\"Nível 1\")+4*(ORÇAMENTO.Nivel=\"Nível 2\")+8*(ORÇAMENTO.Nivel=\"Nível 3\")+16*(ORÇAMENTO.Nivel=\"Nível 4\")+32*(ORÇAMENTO.Nivel=\"Serviço\"),2),0,1,2,3,4,\"S\")","v":"S"},2,"S",0,1,3,0,0,{"$f":"IF(AND($C38<=4,$C38<>0),0,IF(AND($C38=\"S\",$W38>0),OFFSET(I38,-1,0)+1,OFFSET(I38,-1,0)))","v":0},0,0,"","Serviço","Serviço","-","SINAPI",93358,"ESCAVAÇÃO MANUAL DE VALA COM PROFUNDIDADE MENOR OU IGUAL A 1,30 M. AF_03/2016","M3",62,null,null,0,"Referência: AGETOP - 40101"]
["S",2,"S",0,1,3,0,0,0,0,0,"","Serviço","Serviço","-","SINAPI",96995,"REATERRO MANUAL APILOADO COM SOQUETE. AF_10/2017","M3",62,null,null,0,"Referência: AGETOP - 40902"]
["S",2,"S",0,{"$f":"IF($C40=1,OFFSET(E40,-1,0)+1,OFFSET(E40,-1,0))","v":1},{"$f":"IF($C40=1,0,IF($C40=2,OFFSET(F40,-1,0)+1,OFFSET(F40,-1,0)))","v":3},{"$f":"IF(AND($C40<=2,$C40<>0),0,IF($C40=3,OFFSET(G40,-1,0)+1,OFFSET(G40,-1,0)))","v":0},{"$f":"IF(AND($C40<=3,$C40<>0),0,IF($C40=4,OFFSET(H40,-1,0)+1,OFFSET(H40,-1,0)))","v":0},0,0,0,"","Serviço","Serviço","-","AGETOP",41002,"APILOAMENTO","m2    ",1550.38,null,null,0,""]
[2,{"$f":"IF(OR(C41=\"s\",C41=0),OFFSET(B41,-1,0),C41)","v":2},{"$f":"IF(OFFSET(C41,-1,0)=\"L\",1,IF(OFFSET(C41,-1,0)=1,2,IF(OR(A41=\"s\",A41=0),\"S\",IF(AND(OFFSET(C41,-1,0)=2,A41=4),3,IF(AND(OR(OFFSET(C41,-1,0)=\"s\",OFFSET(C41,-1,0)=0),A41<>\"s\",A41>OFFSET(B41,-1,0)),OFFSET(B41,-1,0),A41)))))","v":2},{"$f":"IF(OR(C41=\"S\",C41=0),0,IF(ISERROR(K41),J41,SMALL(J41:K41,1)))","v":13},1,4,0,0,0,238,13,"","Nível 2","Nível 2","-","AGETOP",null,"FUNDAÇÕES E SONDAGENS","-",null,null,null,0,""]
[3,3,3,6,1,4,1,0,0,12,6,"","Nível 3","Nível 3","-","SINAPI",null,"SAPATAS","-",null,null,null,0,""]
["S",3,"S",0,1,4,1,0,0,0,0,"","Serviço","Serviço","-","SINAPI",96523,"ESCAVAÇÃO MANUAL PARA BLOCO DE COROAMENTO OU SAPATA, COM PREVISÃO DE FÔRMA. AF_06/2017","M3",2.85,null,null,0,"Referência: AGETOP - 50901"]
["S",3,"S",0,1,4,1,0,0,0,0,"","Serviço","Serviço","-","SINAPI",94965,"CONCRETO FCK = 25MPA, TRAÇO 1:2,3:2,7 (CIMENTO/ AREIA MÉDIA/ BRITA 1)  - PREPARO MECÂNICO COM BETONEIRA 400 L. AF_07/2016","M3",2.85,null,null,0,"Referência: AGETOP - 51030"]
["S",3,"S",0,1,4,1,0,0,0,0,"","Serviço","Serviço","-","SINAPI","74157/4","LANCAMENTO/APLICACAO MANUAL DE CONCRETO EM FUNDACOES","M3",2.85,null,null,0,"Referência: AGETOP - 51026"]
["S",3,"S",0,1,4,1,0,0,0,0,"","Serviço","Serviço","-","SINAPI",96541,"FABRICAÇÃO, MONTAGEM E DESMONTAGEM DE FÔRMA PARA SAPATA, EM CHAPA DE MADEIRA COMPENSADA RESINADA, E=17 MM, 4 UTILIZAÇÕES. AF_06/2017","M2",13.05,null,null,0,"Referência: AGETOP - 51009"]
["S",3,"S",0,1,4,1,0,0,0,0,"","Serviço","Serviço","-","SINAPI",96544,"ARMAÇÃO DE BLOCO, VIGA BALDRAME OU SAPATA UTILIZANDO AÇO CA-50 DE 6,3 MM - MONTAGEM. AF_06/2017","KG",78.569999999999993,null,null,0,"Referência: AGETOP - 52003"]
[3,3,3,6,1,4,2,0,0,6,87,"","Nível 3","Nível 3","-","SINAPI",null,"VIGAS BALDRAMES","-",null,null,null,0,""]
["S",3,"S",0,1,4,2,0,0,0,0,"","Serviço","Serviço","-","SINAPI",96527,"ESCAVAÇÃO MANUAL DE VALA PARA VIGA BALDRAME, COM PREVISÃO DE FÔRMA. AF_06/2017","M3",65.150000000000006,null,null,0,"Referência: AGETOP - 40101"]
["S",3,"S",0,1,4,2,0,0,0,0,"","Serviço","Serviço","-","SINAPI",94965,"CONCRETO FCK = 25MPA, TRAÇO 1:2,3:2,7 (CIMENTO/ AREIA MÉDIA/ BRITA 1)  - PREPARO MECÂNICO COM BETONEIRA 400 L. AF_07/2016","M3",5.07,null,null,0,"Referência: AGETOP - 51030"]
["S",3,"S",0,1,4,2,0,0,{"$f":"IF(OR($C51=\"S\",$C51=0),0,MATCH(0,OFFSET($D51,1,$C51,ROW($C$279)-ROW($C51)),0))","v":0},{"$f":"IF(OR($C51=\"S\",$C51=0),0,MATCH(OFFSET($D51,0,$C51)+1,OFFSET($D51,1,$C51,ROW($C$279)-ROW($C51)),0))","v":0},"","Serviço","Serviço","-","SINAPI","74157/4","LANCAMENTO/APLICACAO MANUAL DE CONCRETO EM FUNDACOES","M3",5.07,null,null,0,"Referência: AGETOP - 51026"]
["S",3,"S",0,1,4,2,0,0,0,0,"","Serviço","Serviço","-","SINAPI",96545,"ARMAÇÃO DE BLOCO, VIGA BALDRAME OU SAPATA UTILIZANDO AÇO CA-50 DE 8 MM - MONTAGEM. AF_06/2017","KG",114.48,null,null,0,"Referência: AGETOP - 52004"]
["S",3,"S",0,1,4,2,0,0,0,0,"","Serviço","Serviço","-","SINAPI",96543,"ARMAÇÃO DE BLOCO, VIGA BALDRAME E SAPATA UTILIZANDO AÇO CA-60 DE 5 MM - MONTAGEM. AF_06/2017","KG",54.63,null,null,0,"Referência: AGETOP - 52014"]
[2,2,2,14,1,5,0,0,0,225,14,"","Nível 2","Nível 2","-","AGETOP",null,"ESTRUTURA","-",null,null,null,0,""]
[3,3,3,6,1,5,1,0,0,13,6,"","Nível 3","Nível 3","-","AGETOP",null,"PILARES","-",null,null,null,0,""]
["S",3,"S",0,1,5,1,0,0,0,0,"","Serviço","Serviço","-","SINAPI",92426,"MONTAGEM E DESMONTAGEM DE FÔRMA DE PILARES RETANGULARES E ESTRUTURAS SIMILARES COM ÁREA MÉDIA DAS SEÇÕES MENOR OU IGUAL A 0,25 M², PÉ-DIREITO SIMPLES, EM CHAPA DE MADEIRA COMPENSADA RESINADA, 8 UTILIZAÇÕES. AF_12/2015","M2",93.6,null,null,0,""]
["S",3,"S",0,1,5,1,0,0,0,0,"","Serviço","Serviço","-","SINAPI",94965,"CONCRETO FCK = 25MPA, TRAÇO 1:2,3:2,7 (CIMENTO/ AREIA MÉDIA/ BRITA 1)  - PREPARO MECÂNICO COM BETONEIRA 400 L. AF_07/2016","M3",7.02,null,null,0,"Referência: AGETOP - 51030"]
["S",3,"S",0,1,5,1,0,0,0,0,"","Serviço","Serviço","-","SINAPI",92873,"LANÇAMENTO COM USO DE BALDES, ADENSAMENTO E ACABAMENTO DE CONCRETO EM ESTRUTURAS. AF_12/2015","M3",7.02,null,null,0,"Referência: AGETOP - 60801"]
["S",3,"S",0,1,5,1,0,0,0,0,"","Serviço","Serviço","-","SINAPI",92778,"ARMAÇÃO DE PILAR OU VIGA DE UMA ESTRUTURA CONVENCIONAL DE CONCRETO ARMADO EM UMA EDIFICAÇÃO TÉRREA OU SOBRADO UTILIZANDO AÇO CA-50 DE 10,0 MM - MONTAGEM. AF_12/2015","KG",416.79,null,null,0,"Referência: AGETOP - 60305"]
["S",3,"S",0,1,5,1,0,0,0,0,"","Serviço","Serviço","-","SINAPI",92775,"ARMAÇÃO DE PILAR OU VIGA DE UMA ESTRUTURA CONVENCIONAL DE CONCRETO ARMADO EM UMA EDIFICAÇÃO TÉRREA OU SOBRADO UTILIZANDO AÇO CA-60 DE 5,0 MM - MONTAGEM. AF_12/2015","KG",200.34,null,null,0,"Referência: AGETOP - 60314"]
[3,3,3,7,1,5,2,0,0,7,74,"","Nível 3","Nível 3","-",null,null,"VIGAS DE COBERTURA","-",null,null,null,0,""]
["S",3,"S",0,1,5,2,0,0,0,0,"","Serviço","Serviço","-","SINAPI",92464,"MONTAGEM E DESMONTAGEM DE FÔRMA DE VIGA, ESCORAMENTO METÁLICO, PÉ-DIREITO SIMPLES, EM CHAPA DE MADEIRA RESINADA, 8 UTILIZAÇÕES. AF_12/2015","M2",60.7,null,null,0,"Referência: AGETOP - 60209"]
["S",3,"S",0,1,5,2,0,0,0,0,"","Serviço","Serviço","-","SINAPI",94965,"CONCRETO FCK = 25MPA, TRAÇO 1:2,3:2,7 (CIMENTO/ AREIA MÉDIA/ BRITA 1)  - PREPARO MECÂNICO COM BETONEIRA 400 L. AF_07/2016","M3",4.8099999999999996,null,null,0,"Referência: AGETOP - 51030"]
["S",3,"S",0,1,5,2,0,0,0,0,"","Serviço","Serviço","-","SINAPI",92873,"LANÇAMENTO COM USO DE BALDES, ADENSAMENTO E ACABAMENTO DE CONCRETO EM ESTRUTURAS. AF_12/2015","M3",4.8099999999999996,null,null,0,"Referência: AGETOP - 60801"]
[{"$f":"CHOOSE(1+LOG(1+2*(ORÇAMENTO.Nivel=\"Nível 1\")+4*(ORÇAMENTO.Nivel=\"Nível 2\")+8*(ORÇAMENTO.Nivel=\"Nível 3\")+16*(ORÇAMENTO.Nivel=\"Nível 4\")+32*(ORÇAMENTO.Nivel=\"Serviço\"),2),0,1,2,3,4,\"S\")","v":"S"},3,"S",0,1,5,2,0,{"$f":"IF(AND($C65<=4,$C65<>0),0,IF(AND($C65=\"S\",$W65>0),OFFSET(I65,-1,0)+1,OFFSET(I65,-1,0)))","v":0},0,0,"","Serviço","Serviço","-","SINAPI",92777,"ARMAÇÃO DE PILAR OU VIGA DE UMA ESTRUTURA CONVENCIONAL DE CONCRETO ARMADO EM UMA EDIFICAÇÃO TÉRREA OU SOBRADO UTILIZANDO AÇO CA-50 DE 8,0 MM - MONTAGEM. AF_12/2015","KG",107.28,null,null,0,"Referência: AGETOP - 60304"]
["S",3,"S",0,1,5,2,0,0,0,0,"","Serviço","Serviço","-","SINAPI",92778,"ARMAÇÃO DE PILAR OU VIGA DE UMA ESTRUTURA CONVENCIONAL DE CONCRETO ARMADO EM UMA EDIFICAÇÃO TÉRREA OU SOBRADO UTILIZANDO AÇO CA-50 DE 10,0 MM - MONTAGEM. AF_12/2015","KG",19.53,null,null,0,"Referência: AGETOP - 60305"]
["S",3,"S",0,{"$f":"IF($C67=1,OFFSET(E67,-1,0)+1,OFFSET(E67,-1,0))","v":1},{"$f":"IF($C67=1,0,IF($C67=2,OFFSET(F67,-1,0)+1,OFFSET(F67,-1,0)))","v":5},{"$f":"IF(AND($C67<=2,$C67<>0),0,IF($C67=3,OFFSET(G67,-1,0)+1,OFFSET(G67,-1,0)))","v":2},{"$f":"IF(AND($C67<=3,$C67<>0),0,IF($C67=4,OFFSET(H67,-1,0)+1,OFFSET(H67,-1,0)))","v":0},0,0,0,"","Serviço","Serviço","-","SINAPI",92775,"ARMAÇÃO DE PILAR OU VIGA DE UMA ESTRUTURA CONVENCIONAL DE CONCRETO ARMADO EM UMA EDIFICAÇÃO TÉRREA OU SOBRADO UTILIZANDO AÇO CA-60 DE 5,0 MM - MONTAGEM. AF_12/2015","KG",49.769999999999996,null,null,0,"Referência: AGETOP - 60314"]
[2,{"$f":"IF(OR(C68=\"s\",C68=0),OFFSET(B68,-1,0),C68)","v":2},{"$f":"IF(OFFSET(C68,-1,0)=\"L\",1,IF(OFFSET(C68,-1,0)=1,2,IF(OR(A68=\"s\",A68=0),\"S\",IF(AND(OFFSET(C68,-1,0)=2,A68=4),3,IF(AND(OR(OFFSET(C68,-1,0)=\"s\",OFFSET(C68,-1,0)=0),A68<>\"s\",A68>OFFSET(B68,-1,0)),OFFSET(B68,-1,0),A68)))))","v":2},{"$f":"IF(OR(C68=\"S\",C68=0),0,IF(ISERROR(K68),J68,SMALL(J68:K68,1)))","v":90},1,6,0,0,0,211,90,"","Nível 2","Nível 2","-",null,null,"INSTALAÇÕES ELÉTRICAS","-",null,null,null,0,""]
[3,3,3,59,1,6,1,0,0,89,59,"","Nível 3","Nível 3","-","SINAPI",null,"SUBESTAÇÃO - 150 KVA","-",null,null,null,0,""]
["S",3,"S",0,1,6,1,0,0,0,0,"","Serviço","Serviço","-","SINAPI","73767/2","ALCA PRE-FORMADA DISTRIBUIÇÃO EM  ACO RECOBERTO COM ALUMINIO PARA CABO 25MM2, ENCAPADO. FORNECIMENTO E INSTALAÇÃO.","UN",1,null,null,0,""]
["S",3,"S",0,1,6,1,0,0,0,0,"","Serviço","Serviço","-","AGETOP",70252,"ARRUELA LISA D=5/16\"","Un    ",8,null,null,0,""]
["S",3,"S",0,1,6,1,0,0,0,0,"","Serviço","Serviço","-","AGETOP",70268,"BARRA DE COBRE 2\" X 3/16\"  (2,0865 KG/M)","m     ",1.5,null,null,0,""]
["S",3,"S",0,1,6,1,0,0,0,0,"","Serviço","Serviço","-","SINAPI",91178,"FIXAÇÃO DE TUBOS HORIZONTAIS DE PPR DIÂMETROS MAIORES QUE 75 MM COM ABRAÇADEIRA METÁLICA RÍGIDA TIPO  D  3\" , FIXADA DIRETAMENTE NA LAJE. AF_05/2015","M",6,null,null,0,""]
["S",3,"S",0,1,6,1,0,0,0,0,"","Serviço","Serviço","-","AGETOP",70386,"BRAÇO C AÇO GALVANIZADO , CONFORME NTD-17","un    ",1,null,null,0,""]
["S",3,"S",0,1,6,1,0,0,0,0,"","Serviço","Serviço","-","AGETOP",70422,"BUCHA E ARRUELA METALICA DIAM. 1\"","PR    ",2,null,null,0,""]
["S",3,"S",0,1,6,1,0,0,0,0,"","Serviço","Serviço","-","AGETOP",70428,"BUCHA E ARRUELA METALICA DIAM. 4\"","PR    ",1,null,null,0,""]
["S",3,"S",0,1,6,1,0,0,0,0,"","Serviço","Serviço","-","SINAPI",92980,"CABO DE COBRE FLEXÍVEL ISOLADO, 10 MM², ANTI-CHAMA 0,6/1,0 KV, PARA DISTRIBUIÇÃO - FORNECIMENTO E INSTALAÇÃO. AF_12/2015","M",5,null,null,0,"Referência: AGETOP - 70509"]
["S",3,"S",0,1,6,1,0,0,0,0,"","Serviço","Serviço","-","AGETOP",70696,"CAIXA METÁLICA PARA PROTEÇÃO GERAL 820X750X266MM DE 250A A 350A","Un    ",1,null,null,0,""]
["S",3,"S",0,1,6,1,0,0,0,0,"","Serviço","Serviço","-","AGETOP",70697,"CAIXA METÁLICA PARA T.C. 820X750X266MM - 250 A 350A","Un    ",1,null,null,0,""]
["S",3,"S",0,1,6,1,0,0,0,0,"","Serviço","Serviço","-","SINAPI",97893,"CAIXA ENTERRADA ELÉTRICA RETANGULAR, EM ALVENARIA COM BLOCOS DE CONCRETO, FUNDO COM BRITA, DIMENSÕES INTERNAS: 0,8X0,8X0,6 M. AF_05/2018","UN",1,null,null,0,""]
["S",3,"S",0,1,6,1,0,0,0,0,"","Serviço","Serviço","-","AGETOP",70771,"CANTONEIRA AUXILIAR PARA BRAÇO TIPO C","un    ",1,null,null,0,""]
["S",3,"S",0,1,6,1,0,0,0,0,"","Serviço","Serviço","-","AGETOP",70920,"CINTA DE ACO GALVANIZADO DIAM.190 MM","Un    ",1,null,null,0,""]
["S",3,"S",0,1,6,1,0,0,{"$f":"IF(OR($C83=\"S\",$C83=0),0,MATCH(0,OFFSET($D83,1,$C83,ROW($C$279)-ROW($C83)),0))","v":0},{"$f":"IF(OR($C83=\"S\",$C83=0),0,MATCH(OFFSET($D83,0,$C83)+1,OFFSET($D83,1,$C83,ROW($C$279)-ROW($C83)),0))","v":0},"","Serviço","Serviço","-","AGETOP",70921,"CINTA DE ACO GALVANIZADO DIAM.220 MM","Un    ",2,null,null,0,""]
["S",3,"S",0,1,6,1,0,0,0,0,"","Serviço","Serviço","-","AGETOP",70922,"CINTA DE ACO GALVANIZADO DIAM.230MM","Un    ",2,null,null,0,""]
["S",3,"S",0,1,6,1,0,0,0,0,"","Serviço","Serviço","-","AGETOP",71016,"CONECTOR DE COMPRESSÃO FORMATO H PARA CABO 25 A 70 MM2","un    ",4,null,null,0,""]
["S",3,"S",0,1,6,1,0,0,0,0,"","Serviço","Serviço","-","AGETOP",71020,"CONECTOR PARAL. ALUM.EXTRUD.CA-CU-10,0D.10-2-1 PARAF.","Un    ",6,null,null,0,""]
["S",3,"S",0,1,6,1,0,0,0,0,"","Serviço","Serviço","-","SINAPI",72272,"CONECTOR PARAFUSO FENDIDO \u0094SPLIT-BOLT\u0094 - PARA CABO DE 35MM2 - FORNECIMENTO E INSTALACAO","UN",1,null,null,0,""]
["S",3,"S",0,1,6,1,0,0,0,0,"","Serviço","Serviço","-","AGETOP",71040,"CONECTOR TIPO PARAFUSO FENDIDO 150 MM2","Un    ",4,null,null,0,""]
["S",3,"S",0,1,6,1,0,0,0,0,"","Serviço","Serviço","-","AGETOP",71142,"CURVA DE 90 GRAUS DE PVC RIGIDO DIAM. 1\"","Un    ",1,null,null,0,""]
["S",3,"S",0,1,6,1,0,0,0,0,"","Serviço","Serviço","-","SINAPI",93026,"CURVA 90 GRAUS PARA ELETRODUTO, PVC, ROSCÁVEL, DN 110 MM (4\") - FORNECIMENTO E INSTALAÇÃO. AF_12/2015","UN",1,null,null,0,""]
["S",3,"S",0,1,6,1,0,0,0,0,"","Serviço","Serviço","-","AGETOP",71184,"DISPOSITIVO DE PROTEÇÃO CONTRA SURTOS (D.P.S.) 275V DE 8 A 40KA","Un    ",3,null,null,0,""]
["S",3,"S",0,1,6,1,0,0,0,0,"","Serviço","Serviço","-","SINAPI","74130/7","DISJUNTOR TERMOMAGNETICO TRIPOLAR EM CAIXA MOLDADA 250A 600V, FORNECIMENTO E INSTALACAO","UN",1,null,null,0,""]
["S",3,"S",0,1,6,1,0,0,0,0,"","Serviço","Serviço","-","AGETOP",71202,"ELETRODUTO DE PVC RIGIDO DIAMETRO 1\"","M     ",3,null,null,0,""]
["S",3,"S",0,1,6,1,0,0,0,0,"","Serviço","Serviço","-","SINAPI",93012,"ELETRODUTO RÍGIDO ROSCÁVEL, PVC, DN 110 MM (4\") - FORNECIMENTO E INSTALAÇÃO. AF_12/2015","M",3,null,null,0,""]
["S",3,"S",0,1,6,1,0,0,0,0,"","Serviço","Serviço","-","AGETOP",71218,"ELETRODUTO EM AÇO GALVANIZADO A FOGO DIÂMETRO 4\" - PESADO ","M     ",7,null,null,0,""]
["S",3,"S",0,1,6,1,0,0,0,0,"","Serviço","Serviço","-","AGETOP",71270,"ELO FUSIVEL 8 K - 15 KV","Un    ",3,null,null,0,""]
["S",3,"S",0,1,6,1,0,0,0,0,"","Serviço","Serviço","-","AGETOP",71321,"FITA DE AUTO FUSAO, ROLO E 10,00 MM","Un    ",5,null,null,0,""]
["S",3,"S",0,1,6,1,0,0,0,0,"","Serviço","Serviço","-","AGETOP",71365,"GRAMPO DE ANCORAGEM POLIMÉRICO","un    ",3,null,null,0,""]
["S",3,"S",0,1,6,1,0,0,0,0,"","Serviço","Serviço","-","AGETOP",71381,"HASTE REV.COBRE(COPPERWELD)  5/8\" X 3,00 M C/CONECTOR","Un    ",4,null,null,0,""]
["S",3,"S",0,1,6,1,0,0,0,0,"","Serviço","Serviço","-","AGETOP",71463,"ISOLADOR EPOXI 50X40 (BUJAO)","Un    ",2,null,null,0,""]
["S",3,"S",0,1,6,1,0,0,0,0,"","Serviço","Serviço","-","AGETOP",71476,"ISOLADOR DE ANCORAGEM POLIMÉRICO 15KV","un    ",1,null,null,0,""]
["S",3,"S",0,1,6,1,0,0,0,0,"","Serviço","Serviço","-","AGETOP",71510,"LACO PREFORMADO DE DISTRIBUICAO","Un    ",1,null,null,0,""]
["S",3,"S",0,1,6,1,0,0,0,0,"","Serviço","Serviço","-","AGETOP",71742,"LUVA PVC ROSQUEAVEL DIAMETRO 1\"","Un    ",1,null,null,0,""]
["S",3,"S",0,1,6,1,0,0,0,0,"","Serviço","Serviço","-","SINAPI",93017,"LUVA PARA ELETRODUTO, PVC, ROSCÁVEL, DN 110 MM (4\") - FORNECIMENTO E INSTALAÇÃO. AF_12/2015","UN",1,null,null,0,"Referência: AGETOP - 71748"]
["S",3,"S",0,1,6,1,0,0,0,0,"","Serviço","Serviço","-","SINAPI",72619,"LUVA DE ACO GALVANIZADO 4\" - FORNECIMENTO E INSTALACAO","UN",2,null,null,0,""]
["S",3,"S",0,1,6,1,0,0,0,0,"","Serviço","Serviço","-","AGETOP",71750,"MANILHA-SAPATILHA EM AÇO GALVANIZADO","un    ",1,null,null,0,""]
["S",3,"S",0,1,6,1,0,0,0,0,"","Serviço","Serviço","-","AGETOP",71761,"MURETA MEDIÇÃO ALVEN. 1 1/2 V.(35CM) REBOC.C/PINTURA ACRÍL. E LAJE CONC. 20MPA MALHA 8.0MM CADA 10CM REVEST.C/ARGAMASSA 1:3 C/ IMPERMEABILIZANTE","m2    ",4,null,null,0,""]
["S",3,"S",0,1,6,1,0,0,0,0,"","Serviço","Serviço","-","AGETOP",71773,"NIPLE METALICO Fo.Zo. DIAMETRO 1\"","Un    ",1,null,null,0,""]
["S",3,"S",0,1,6,1,0,0,0,0,"","Serviço","Serviço","-","SINAPI",72681,"NIPLE DE ACO GALVANIZADO 4\" - FORNECIMENTO E INSTALACAO","UN",3,null,null,0,""]
["S",3,"S",0,1,6,1,0,0,0,0,"","Serviço","Serviço","-","AGETOP",71795,"OLHAL PARA PARAFUSO","un    ",3,null,null,0,""]
["S",3,"S",0,1,6,1,0,0,0,0,"","Serviço","Serviço","-","AGETOP",71835,"PARAFUSO CABEÇA ABAULADA (FRANCES) M16 X 45 MM","Un    ",3,null,null,0,""]
["S",3,"S",0,1,6,1,0,0,0,0,"","Serviço","Serviço","-","AGETOP",71841,"PARAFUSO CABEÇA ABAULADA (FRANCES) M16 X 150 MM","Un    ",3,null,null,0,""]
["S",3,"S",0,1,6,1,0,0,0,0,"","Serviço","Serviço","-","AGETOP",71833,"PARA RAIOS DISTRIBUIDOR POLIMÉRICO ÓXIDO DE ZINCO S/CENTELHADOR C/ DESLIGAMENTO AUTOMÁTICO 15KV,10KA","Un    ",3,null,null,0,""]
["S",3,"S",0,1,6,1,0,0,0,0,"","Serviço","Serviço","-","AGETOP",71997,"POSTE - FUNDAÇÃO EM CONCRETO SIMPLES DA BASE DOS POSTES 11/600 PARA TRAFO ( DIAM. 1000MM)","m     ",0.3,null,null,0,""]
["S",3,"S",0,1,6,1,0,0,{"$f":"IF(OR($C115=\"S\",$C115=0),0,MATCH(0,OFFSET($D115,1,$C115,ROW($C$279)-ROW($C115)),0))","v":0},{"$f":"IF(OR($C115=\"S\",$C115=0),0,MATCH(OFFSET($D115,0,$C115)+1,OFFSET($D115,1,$C115,ROW($C$279)-ROW($C115)),0))","v":0},"","Serviço","Serviço","-","AGETOP",72061,"POSTE DE CONCRETO SC 11/600 - SEM FUNDAÇÃO/CONCRETO","Un    ",1,null,null,0,""]
["S",3,"S",0,1,6,1,0,0,0,0,"","Serviço","Serviço","-","AGETOP",72080,"POSTE/TRAFO - CAMINHÃO MUNCK 12 TON. (MÍNIMO 4H/DIA)","H     ",4,null,null,0,""]
["S",3,"S",0,1,6,1,0,0,0,0,"","Serviço","Serviço","-","AGETOP",72329,"SAPATILHA DE AÇO GALVANIZADO PARA POSTE COM TRANSFORMADOR","un    ",3,null,null,0,""]
["S",3,"S",0,1,6,1,0,0,0,0,"","Serviço","Serviço","-","SINAPI",73624,"SUPORTE PARA TRANSFORMADOR EM POSTE DE CONCRETO CIRCULAR","UN",2,null,null,0,""]
["S",3,"S",0,1,6,1,0,0,0,0,"","Serviço","Serviço","-","AGETOP",72518,"TERMINAL DE PRESSAO 10 MM2","Un    ",1,null,null,0,""]
["S",3,"S",0,1,6,1,0,0,0,0,"","Serviço","Serviço","-","SINAPI","73782/3","TERMINAL METALICO A PRESSAO PARA 1 CABO DE 95 MM2 - FORNECIMENTO E INSTALACAO","UN",5,null,null,0,""]
["S",3,"S",0,1,6,1,0,0,0,0,"","Serviço","Serviço","-","AGETOP",72550,"TERMINAL DE PRESSAO 150 MM2","Un    ",2,null,null,0,""]
["S",3,"S",0,1,6,1,0,0,0,0,"","Serviço","Serviço","-","SINAPI","73857/3","TRANSFORMADOR DISTRIBUICAO  150KVA TRIFASICO 60HZ CLASSE 15KV IMERSO EM ÓLEO MINERAL FORNECIMENTO E INSTALACAO","UN",1,null,null,0,""]
["S",3,"S",0,1,6,1,0,0,0,0,"","Serviço","Serviço","-","SINAPI",88543,"ARMACAO SECUNDARIA OU REX COMPLETA PARA TRESLINHAS-FORNECIMENTO E INSTALACAO.","UN",1,null,null,0,""]
["S",3,"S",0,1,6,1,0,0,0,0,"","Serviço","Serviço","-","COMPOSIÇÃO","COMP 046_SEE","CAPUZ PARA PROTEÇÃO DOS PARA RAIOS","UN ",3,null,null,0,""]
["S",3,"S",0,1,6,1,0,0,0,0,"","Serviço","Serviço","-","COMPOSIÇÃO","COMP 047_SEE","CAPUZ DE PROTEÇÃO PARA BUCHA DE TRANSFORMADOR","UN ",3,null,null,0,""]
["S",3,"S",0,1,6,1,0,0,0,0,"","Serviço","Serviço","-","COMPOSIÇÃO","COMP 048_SEE","HASTE ROSQUEADA \"TIRANTE\" 3/8\"","M",0.5,null,null,0,""]
["S",3,"S",0,1,6,1,0,0,0,0,"","Serviço","Serviço","-","COMPOSIÇÃO","COMP 049_SEE","PORCA SEXTAVADA 3/8\"","UN ",8,null,null,0,""]
[3,3,3,7,1,6,2,0,0,30,7,"","Nível 3","Nível 3","-",null,null,"IMPLANTAÇÃO SUBESTAÇÃO (ALIMENTAÇÃO QDG)","-",null,null,null,0,""]
["S",3,"S",0,1,6,2,0,0,0,0,"","Serviço","Serviço","-","SINAPI",92996,"CABO DE COBRE FLEXÍVEL ISOLADO, 150 MM², ANTI-CHAMA 0,6/1,0 KV, PARA DISTRIBUIÇÃO - FORNECIMENTO E INSTALAÇÃO. AF_12/2015","M",50,null,null,0,""]
["S",3,"S",0,1,6,2,0,0,0,0,"","Serviço","Serviço","-","SINAPI",92992,"CABO DE COBRE FLEXÍVEL ISOLADO, 95 MM², ANTI-CHAMA 0,6/1,0 KV, PARA DISTRIBUIÇÃO - FORNECIMENTO E INSTALAÇÃO. AF_12/2015","M",10,null,null,0,""]
["S",3,"S",0,1,6,2,0,0,0,0,"","Serviço","Serviço","-","SINAPI","74130/7","DISJUNTOR TERMOMAGNETICO TRIPOLAR EM CAIXA MOLDADA 250A 600V, FORNECIMENTO E INSTALACAO","UN",1,null,null,0,""]
["S",3,"S",0,1,6,2,0,0,0,0,"","Serviço","Serviço","-","SINAPI",93012,"ELETRODUTO RÍGIDO ROSCÁVEL, PVC, DN 110 MM (4\") - FORNECIMENTO E INSTALAÇÃO. AF_12/2015","M",10,null,null,0,""]
["S",3,"S",0,1,6,2,0,0,0,0,"","Serviço","Serviço","-","SINAPI",93026,"CURVA 90 GRAUS PARA ELETRODUTO, PVC, ROSCÁVEL, DN 110 MM (4\") - FORNECIMENTO E INSTALAÇÃO. AF_12/2015","UN",5,null,null,0,""]
["S",3,"S",0,1,6,2,0,0,0,0,"","Serviço","Serviço","-","SINAPI",97888,"CAIXA ENTERRADA ELÉTRICA RETANGULAR, EM ALVENARIA COM TIJOLOS CERÂMICOS MACIÇOS, FUNDO COM BRITA, DIMENSÕES INTERNAS: 0,6X0,6X0,6 M. AF_05/2018","UN",1,null,null,0,""]
[3,3,3,11,1,6,3,0,0,23,11,"","Nível 3","Nível 3","-",null,null,"IMPLANTAÇÃO QUADROS DE DISTRIBUIÇÃO","-",null,null,null,0,""]
["S",3,"S",0,1,6,3,0,0,0,0,"","Serviço","Serviço","-","SINAPI",92986,"CABO DE COBRE FLEXÍVEL ISOLADO, 35 MM², ANTI-CHAMA 0,6/1,0 KV, PARA DISTRIBUIÇÃO - FORNECIMENTO E INSTALAÇÃO. AF_12/2015","M",800,null,null,0,"Referência: AGETOP - 70512"]
["S",3,"S",0,1,6,3,0,0,0,0,"","Serviço","Serviço","-","SINAPI",92984,"CABO DE COBRE FLEXÍVEL ISOLADO, 25 MM², ANTI-CHAMA 0,6/1,0 KV, PARA DISTRIBUIÇÃO - FORNECIMENTO E INSTALAÇÃO. AF_12/2015","M",600,null,null,0,"Referência: AGETOP - 70511"]
["S",3,"S",0,1,6,3,0,0,0,0,"","Serviço","Serviço","-","SINAPI",92982,"CABO DE COBRE FLEXÍVEL ISOLADO, 16 MM², ANTI-CHAMA 0,6/1,0 KV, PARA DISTRIBUIÇÃO - FORNECIMENTO E INSTALAÇÃO. AF_12/2015","M",100,null,null,0,"Referência: AGETOP - 70510"]
["S",3,"S",0,1,6,3,0,0,0,0,"","Serviço","Serviço","-","SINAPI",92979,"CABO DE COBRE FLEXÍVEL ISOLADO, 10 MM², ANTI-CHAMA 450/750 V, PARA DISTRIBUIÇÃO - FORNECIMENTO E INSTALAÇÃO. AF_12/2015","M",25,null,null,0,""]
["S",3,"S",0,1,6,3,0,0,0,0,"","Serviço","Serviço","-","SINAPI","74130/5","DISJUNTOR TERMOMAGNETICO TRIPOLAR PADRAO NEMA (AMERICANO) 60 A 100A 240V, FORNECIMENTO E INSTALACAO","UN",2,null,null,0,""]
["S",3,"S",0,1,6,3,0,0,0,0,"","Serviço","Serviço","-","SINAPI",93009,"ELETRODUTO RÍGIDO ROSCÁVEL, PVC, DN 60 MM (2\") - FORNECIMENTO E INSTALAÇÃO. AF_12/2015","M",110,null,null,0,""]
["S",3,"S",0,1,6,3,0,0,0,0,"","Serviço","Serviço","-","SINAPI",93012,"ELETRODUTO RÍGIDO ROSCÁVEL, PVC, DN 110 MM (4\") - FORNECIMENTO E INSTALAÇÃO. AF_12/2015","M",75,null,null,0,""]
["S",3,"S",0,1,6,3,0,0,0,0,"","Serviço","Serviço","-","SINAPI",93020,"CURVA 90 GRAUS PARA ELETRODUTO, PVC, ROSCÁVEL, DN 60 MM (2\") - FORNECIMENTO E INSTALAÇÃO. AF_12/2015","UN",10,null,null,0,""]
["S",3,"S",0,1,6,3,0,0,0,0,"","Serviço","Serviço","-","SINAPI","74130/5","DISJUNTOR TERMOMAGNETICO TRIPOLAR PADRAO NEMA (AMERICANO) 60 A 100A 240V, FORNECIMENTO E INSTALACAO","UN",6,null,null,0,""]
["S",3,"S",0,1,6,3,0,0,0,0,"","Serviço","Serviço","-","SINAPI",97888,"CAIXA ENTERRADA ELÉTRICA RETANGULAR, EM ALVENARIA COM TIJOLOS CERÂMICOS MACIÇOS, FUNDO COM BRITA, DIMENSÕES INTERNAS: 0,6X0,6X0,6 M. AF_05/2018","UN",7,null,null,0,""]
[3,3,3,6,1,6,4,0,0,12,6,"","Nível 3","Nível 3","-",null,null,"INSTALAÇÕES ELÉTRICAS - INSTALAÇÃO AR CONDICONADOS","-",null,null,null,0,""]
["S",3,"S",0,1,6,4,0,0,{"$f":"IF(OR($C147=\"S\",$C147=0),0,MATCH(0,OFFSET($D147,1,$C147,ROW($C$279)-ROW($C147)),0))","v":0},{"$f":"IF(OR($C147=\"S\",$C147=0),0,MATCH(OFFSET($D147,0,$C147)+1,OFFSET($D147,1,$C147,ROW($C$279)-ROW($C147)),0))","v":0},"","Serviço","Serviço","-","SINAPI",91929,"CABO DE COBRE FLEXÍVEL ISOLADO, 4 MM², ANTI-CHAMA 0,6/1,0 KV, PARA CIRCUITOS TERMINAIS - FORNECIMENTO E INSTALAÇÃO. AF_12/2015","M",1300,null,null,0,"Referência: AGETOP - 70582"]
["S",3,"S",0,1,6,4,0,0,0,0,"","Serviço","Serviço","-","SINAPI",91927,"CABO DE COBRE FLEXÍVEL ISOLADO, 2,5 MM², ANTI-CHAMA 0,6/1,0 KV, PARA CIRCUITOS TERMINAIS - FORNECIMENTO E INSTALAÇÃO. AF_12/2015","M",200,null,null,0,"Referência: AGETOP - 70581"]
["S",3,"S",0,1,6,4,0,0,0,0,"","Serviço","Serviço","-","SINAPI",91872,"ELETRODUTO RÍGIDO ROSCÁVEL, PVC, DN 32 MM (1\"), PARA CIRCUITOS TERMINAIS, INSTALADO EM PAREDE - FORNECIMENTO E INSTALAÇÃO. AF_12/2015","M",400,null,null,0,"Referência: AGETOP - 71202"]
["S",3,"S",0,1,6,4,0,0,0,0,"","Serviço","Serviço","-","SINAPI",91893,"CURVA 90 GRAUS PARA ELETRODUTO, PVC, ROSCÁVEL, DN 32 MM (1\"), PARA CIRCUITOS TERMINAIS, INSTALADA EM FORRO - FORNECIMENTO E INSTALAÇÃO. AF_12/2015","UN",115,null,null,0,""]
["S",3,"S",0,1,6,4,0,0,0,0,"","Serviço","Serviço","-","SINAPI",93656,"DISJUNTOR MONOPOLAR TIPO DIN, CORRENTE NOMINAL DE 25A - FORNECIMENTO E INSTALAÇÃO. AF_04/2016","UN",15,null,null,0,""]
[{"$f":"CHOOSE(1+LOG(1+2*(ORÇAMENTO.Nivel=\"Nível 1\")+4*(ORÇAMENTO.Nivel=\"Nível 2\")+8*(ORÇAMENTO.Nivel=\"Nível 3\")+16*(ORÇAMENTO.Nivel=\"Nível 4\")+32*(ORÇAMENTO.Nivel=\"Serviço\"),2),0,1,2,3,4,\"S\")","v":3},{"$f":"IF(OR(C152=\"s\",C152=0),OFFSET(B152,-1,0),C152)","v":3},{"$f":"IF(OFFSET(C152,-1,0)=\"L\",1,IF(OFFSET(C152,-1,0)=1,2,IF(OR(A152=\"s\",A152=0),\"S\",IF(AND(OFFSET(C152,-1,0)=2,A152=4),3,IF(AND(OR(OFFSET(C152,-1,0)=\"s\",OFFSET(C152,-1,0)=0),A152<>\"s\",A152>OFFSET(B152,-1,0)),OFFSET(B152,-1,0),A152)))))","v":3},{"$f":"IF(OR(C152=\"S\",C152=0),0,IF(ISERROR(K152),J152,SMALL(J152:K152,1)))","v":6},{"$f":"IF($C152=1,OFFSET(E152,-1,0)+1,OFFSET(E152,-1,0))","v":1},{"$f":"IF($C152=1,0,IF($C152=2,OFFSET(F152,-1,0)+1,OFFSET(F152,-1,0)))","v":6},{"$f":"IF(AND($C152<=2,$C152<>0),0,IF($C152=3,OFFSET(G152,-1,0)+1,OFFSET(G152,-1,0)))","v":5},{"$f":"IF(AND($C152<=3,$C152<>0),0,IF($C152=4,OFFSET(H152,-1,0)+1,OFFSET(H152,-1,0)))","v":0},{"$f":"IF(AND($C152<=4,$C152<>0),0,IF(AND($C152=\"S\",$W152>0),OFFSET(I152,-1,0)+1,OFFSET(I152,-1,0)))","v":0},6,117,"","Nível 3","Nível 3","-","SINAPI",null,"ILUMINAÇÃO EMERGÊNCIA - ALARME DE INCÊNDIO","-",null,null,null,0,""]
["S",3,"S",0,1,6,5,0,0,0,0,"","Serviço","Serviço","-","SINAPI",95749,"ELETRODUTO DE AÇO GALVANIZADO, CLASSE LEVE, DN 20 MM (3/4\u0092\u0092), APARENTE, INSTALADO EM PAREDE - FORNECIMENTO E INSTALAÇÃO. AF_11/2016_P","M",620,null,null,0,"Referência: AGETOP - 71211"]
["S",3,"S",0,1,6,5,0,0,0,0,"","Serviço","Serviço","-","AGETOP",71151,"CURVA DE 90 GRAUS AÇO GALVANIZADO DIAM.3/4\"","Un    ",15,null,null,0,""]
["S",3,"S",0,1,6,5,0,0,0,0,"","Serviço","Serviço","-","AGETOP",71201,"ELETRODUTO DE PVC RIGIDO DIAMETRO 3/4\"","M     ",75,null,null,0,""]
["S",3,"S",0,1,6,5,0,0,0,0,"","Serviço","Serviço","-","AGETOP",70561,"CABO ISOLADO PP 3 X 2,5 MM2","M     ",550,null,null,0,""]
["S",3,"S",0,1,6,5,0,0,0,0,"","Serviço","Serviço","-","SINAPI",91927,"CABO DE COBRE FLEXÍVEL ISOLADO, 2,5 MM², ANTI-CHAMA 0,6/1,0 KV, PARA CIRCUITOS TERMINAIS - FORNECIMENTO E INSTALAÇÃO. AF_12/2015","M",900,null,null,0,"Referência: AGETOP - 70581"]
[{"$f":"CHOOSE(1+LOG(1+2*(ORÇAMENTO.Nivel=\"Nível 1\")+4*(ORÇAMENTO.Nivel=\"Nível 2\")+8*(ORÇAMENTO.Nivel=\"Nível 3\")+16*(ORÇAMENTO.Nivel=\"Nível 4\")+32*(ORÇAMENTO.Nivel=\"Serviço\"),2),0,1,2,3,4,\"S\")","v":2},{"$f":"IF(OR(C158=\"s\",C158=0),OFFSET(B158,-1,0),C158)","v":2},{"$f":"IF(OFFSET(C158,-1,0)=\"L\",1,IF(OFFSET(C158,-1,0)=1,2,IF(OR(A158=\"s\",A158=0),\"S\",IF(AND(OFFSET(C158,-1,0)=2,A158=4),3,IF(AND(OR(OFFSET(C158,-1,0)=\"s\",OFFSET(C158,-1,0)=0),A158<>\"s\",A158>OFFSET(B158,-1,0)),OFFSET(B158,-1,0),A158)))))","v":2},{"$f":"IF(OR(C158=\"S\",C158=0),0,IF(ISERROR(K158),J158,SMALL(J158:K158,1)))","v":58},{"$f":"IF($C158=1,OFFSET(E158,-1,0)+1,OFFSET(E158,-1,0))","v":1},{"$f":"IF($C158=1,0,IF($C158=2,OFFSET(F158,-1,0)+1,OFFSET(F158,-1,0)))","v":7},{"$f":"IF(AND($C158<=2,$C158<>0),0,IF($C158=3,OFFSET(G158,-1,0)+1,OFFSET(G158,-1,0)))","v":0},{"$f":"IF(AND($C158<=3,$C158<>0),0,IF($C158=4,OFFSET(H158,-1,0)+1,OFFSET(H158,-1,0)))","v":0},{"$f":"IF(AND($C158<=4,$C158<>0),0,IF(AND($C158=\"S\",$W158>0),OFFSET(I158,-1,0)+1,OFFSET(I158,-1,0)))","v":0},121,58,"","Nível 2","Nível 2","-","AGETOP",null,"INSTALAÇÕES HIDROSSANITÁRIAS","-",null,null,null,0,""]
[3,3,3,5,1,7,1,0,0,57,5,"","Nível 3","Nível 3","-","SINAPI",null,"TANQUES / TORNEIRAS","-",null,null,null,0,""]
["S",3,"S",0,1,7,1,0,0,0,0,"","Serviço","Serviço","-","AGETOP",80693,"TANQUE (PANELAO) INOX 60 X 70 X 40 CM CH.18","Un    ",1,null,null,0,""]
["S",3,"S",0,1,7,1,0,0,0,0,"","Serviço","Serviço","-","AGETOP",80819,"SIFÃO METÁLICO PARA TANQUE DE 1 1/4\" X 1 1/2\"","un    ",1,null,null,0,""]
["S",3,"S",0,1,7,1,0,0,0,0,"","Serviço","Serviço","-","SINAPI",86877,"VÁLVULA EM METAL CROMADO 1.1/2\" X 1.1/2\" PARA TANQUE OU LAVATÓRIO, COM OU SEM LADRÃO - FORNECIMENTO E INSTALAÇÃO. AF_12/2013","UN",1,null,null,0,""]
["S",3,"S",0,1,7,1,0,0,0,0,"","Serviço","Serviço","-","AGETOP",80660,"TORNEIRA DE PAREDE PARA PIA OU BEBEDOURO DIÂMETRO DE 1/2\" E 3/4\" ","Un    ",1,null,null,0,""]
[3,3,3,6,1,7,2,0,0,52,6,"","Nível 3","Nível 3","-","SINAPI",null,"VASO SANITÁRIO","-",null,null,null,0,""]
["S",3,"S",0,1,7,2,0,0,0,0,"","Serviço","Serviço","-","SINAPI",95470,"VASO SANITARIO SIFONADO CONVENCIONAL COM LOUÇA BRANCA, INCLUSO CONJUNTO DE LIGAÇÃO PARA BACIA SANITÁRIA AJUSTÁVEL - FORNECIMENTO E INSTALAÇÃO. AF_10/2016","UN",2,null,null,0,""]
["S",3,"S",0,1,7,2,0,0,0,0,"","Serviço","Serviço","-","AGETOP",80517,"VÁLVULA DE DESCARGA DUPLO ACIONAMENTO COM ACABAMENTO CROMADO ANTIVANDALISMO","Un    ",2,null,null,0,""]
["S",3,"S",0,1,7,2,0,0,0,0,"","Serviço","Serviço","-","AGETOP",80510,"ANEL DE VEDAÇÃO PARA VASO SANITÁRIO","Un    ",2,null,null,0,""]
["S",3,"S",0,1,7,2,0,0,0,0,"","Serviço","Serviço","-","AGETOP",80520,"CONJUNTO DE FIXACAO P/VASO SANITARIO (PAR)","CJ    ",2,null,null,0,""]
["S",3,"S",0,1,7,2,0,0,0,0,"","Serviço","Serviço","-","AGETOP",80526,"ASSENTO EM POLIPROPILENO COM SISTEMA DE FECHAMENTO SUAVE PARA VASO SANITÁRIO","Un    ",2,null,null,0,""]
[3,3,3,7,1,7,3,0,0,46,7,"","Nível 3","Nível 3","-","SINAPI",null,"LAVATÓRIO","-",null,null,null,0,""]
["S",3,"S",0,1,7,3,0,0,0,0,"","Serviço","Serviço","-","SINAPI",86903,"LAVATÓRIO LOUÇA BRANCA COM COLUNA, 45 X 55CM OU EQUIVALENTE, PADRÃO MÉDIO - FORNECIMENTO E INSTALAÇÃO. AF_12/2013","UN",2,null,null,0,"Referência: AGETOP - 80541"]
["S",3,"S",0,1,7,3,0,0,0,0,"","Serviço","Serviço","-","AGETOP",80550,"FIXACAO P/LAVATORIO (PAR)","PAR   ",2,null,null,0,""]
["S",3,"S",0,1,7,3,0,0,0,0,"","Serviço","Serviço","-","AGETOP",80555,"LIGAÇÃO FLEXÍVEL METÁLICA DIAM.1/2\"(ENGATE)","Un    ",2,null,null,0,""]
["S",3,"S",0,1,7,3,0,0,0,0,"","Serviço","Serviço","-","SINAPI",86883,"SIFÃO DO TIPO FLEXÍVEL EM PVC 1\u0094 X 1.1/2\u0094 - FORNECIMENTO E INSTALAÇÃO. AF_12/2013","UN",2,null,null,0,""]
["S",3,"S",0,1,7,3,0,0,0,0,"","Serviço","Serviço","-","SINAPI",86915,"TORNEIRA CROMADA DE MESA, 1/2\" OU 3/4\", PARA LAVATÓRIO, PADRÃO MÉDIO - FORNECIMENTO E INSTALAÇÃO. AF_12/2013","UN",2,null,null,0,"Referência: AGETOP - 80570"]
["S",3,"S",0,1,7,3,0,0,0,0,"","Serviço","Serviço","-","SINAPI",86877,"VÁLVULA EM METAL CROMADO 1.1/2\" X 1.1/2\" PARA TANQUE OU LAVATÓRIO, COM OU SEM LADRÃO - FORNECIMENTO E INSTALAÇÃO. AF_12/2013","UN",2,null,null,0,""]
[3,3,3,39,1,7,4,0,0,39,90,"","Nível 3","Nível 3","-","SINAPI",null,"COMBATE INCÊNDIO","-",null,null,null,0,""]
["S",3,"S",0,1,7,4,0,0,0,0,"","Serviço","Serviço","-","COMPOSIÇÃO","COMP 557_SEE","BOMBA THSI-18 10,0 CV TRIFÁSICA","UN ",1,null,null,0,""]
["S",3,"S",0,1,7,4,0,0,{"$f":"IF(OR($C179=\"S\",$C179=0),0,MATCH(0,OFFSET($D179,1,$C179,ROW($C$279)-ROW($C179)),0))","v":0},{"$f":"IF(OR($C179=\"S\",$C179=0),0,MATCH(OFFSET($D179,0,$C179)+1,OFFSET($D179,1,$C179,ROW($C$279)-ROW($C179)),0))","v":0},"","Serviço","Serviço","-","AGETOP",72338,"SIRENE METALICA ALCANCE 500 M","Un    ",2,null,null,0,""]
["S",3,"S",0,1,7,4,0,0,0,0,"","Serviço","Serviço","-","AGETOP",81883,"RES.METALICO TAÇA AÇO PATINÁVEL-V=20M3-COL.SEC.H=6M+FUNDAÇÃO+LOGOTIPO","un    ",1,null,null,0,""]
["S",3,"S",0,1,7,4,0,0,0,0,"","Serviço","Serviço","-","AGETOP",80910,"REGISTRO DE GAVETA BRUTO DIAMETRO 2.1/2\"","Un    ",2,null,null,0,""]
["S",3,"S",0,1,7,4,0,0,0,0,"","Serviço","Serviço","-","AGETOP",82379,"TUBO FERRO GALVANIZADO DIAM.2.1/2\"","m     ",375,null,null,0,""]
["S",3,"S",0,1,7,4,0,0,0,0,"","Serviço","Serviço","-","AGETOP",85003,"EXTINTOR PO QUIMICO SECO (6 KG) - CAPACIDADE EXTINTORA 20 BC","Un    ",1,null,null,0,""]
["S",3,"S",0,1,7,4,0,0,0,0,"","Serviço","Serviço","-","AGETOP",85006,"EXTINTOR MULTI USO EM PO A B C (6 KG) - CAPACIDADE EXTINTORA 3A 20BC","un    ",17,null,null,0,""]
["S",3,"S",0,1,7,4,0,0,0,0,"","Serviço","Serviço","-","AGETOP",85011,"CAIXA DE INCÊNDIO METÁLICA COM SUPORTE PARA MANGUEIRA, TAMPA E MURETA 17X60X90 CM C/PINTURA","Un    ",12,null,null,0,""]
["S",3,"S",0,1,7,4,0,0,0,0,"","Serviço","Serviço","-","AGETOP",85017,"MANGUEIRA DE INCÊNDIO D.I. = 38 MM TIPO 2 COMP. = 15 M","CJ    ",24,null,null,0,""]
["S",3,"S",0,1,7,4,0,0,0,0,"","Serviço","Serviço","-","AGETOP",85025,"ESGUICHO REGULÁVEL 1.1/2\"","Un    ",12,null,null,0,""]
["S",3,"S",0,1,7,4,0,0,0,0,"","Serviço","Serviço","-","AGETOP",85027,"ADAPTADOR P/ENGATE STORZ 2.1/2\" X 1.1/2\"","Un    ",12,null,null,0,""]
["S",3,"S",0,1,7,4,0,0,0,0,"","Serviço","Serviço","-","AGETOP",85031,"REGISTRO GLOBO ANGULAR 2.1/2\"","Un    ",12,null,null,0,""]
["S",3,"S",0,1,7,4,0,0,0,0,"","Serviço","Serviço","-","AGETOP",85035,"TAMPÃO CEGO COM CORRENTE 2.1/2\"","Un    ",12,null,null,0,""]
["S",3,"S",0,1,7,4,0,0,0,0,"","Serviço","Serviço","-","AGETOP",85037,"TANQUE DE PRESSÃO DE 10 L","Un    ",1,null,null,0,""]
["S",3,"S",0,1,7,4,0,0,0,0,"","Serviço","Serviço","-","AGETOP",85039,"PRESSOSTATO 50 A 80 PSI","Un    ",1,null,null,0,""]
["S",3,"S",0,1,7,4,0,0,0,0,"","Serviço","Serviço","-","AGETOP",85041,"MANOMETRO - 0 A 10 KG/CM2","Un    ",1,null,null,0,""]
["S",3,"S",0,1,7,4,0,0,0,0,"","Serviço","Serviço","-","AGETOP",85047,"NIPLE DUPLO FERRO GALVANIZADO 2.1/2\"","Un    ",16,null,null,0,""]
["S",3,"S",0,1,7,4,0,0,0,0,"","Serviço","Serviço","-","AGETOP",85077,"VÁLVULA DE RETENÇÃO HORIZONTAL 2.1/2\"","Un    ",2,null,null,0,""]
["S",3,"S",0,1,7,4,0,0,0,0,"","Serviço","Serviço","-","COMPOSIÇÃO","COMP 017_SEE","REDUCAO GIRATÓRIA TIPO STORZ LATAO P/ INST. PREDIAL COMBATE A INCENDIO ENGATE RAPIDO 2.1/2\" X 1.1/2\"","UN ",12,null,null,0,""]
["S",3,"S",0,1,7,4,0,0,0,0,"","Serviço","Serviço","-","COMPOSIÇÃO","COMP 018_SEE","CHAVE DUPLA P/ CONEXÕES TIPO STORZ EM LATÃO ENGATE RÁPIDO 1 1/2\" X 2 1/2\"","UN ",12,null,null,0,""]
["S",3,"S",0,1,7,4,0,0,0,0,"","Serviço","Serviço","-","AGETOP",80981,"REGISTRO DE ESFERA DIAMETRO 2.1/2\"","Un    ",1,null,null,0,""]
["S",3,"S",0,1,7,4,0,0,0,0,"","Serviço","Serviço","-","COMPOSIÇÃO","COMP 087_SEE","REGISTRO DE GAVETA COM HASTE ASCENDENTE DE BRONZE 2 1/2\"","UN ",1,null,null,0,""]
["S",3,"S",0,1,7,4,0,0,0,0,"","Serviço","Serviço","-","COMPOSIÇÃO","COMP 019_SEE","TAMPÃO LATAO C/ CORRENTE P/ INSTALAÇÃO PREDIAL COMBATE A INCÊNDIO ENGATE RÁPIDO 1 1/2\"","UN ",12,null,null,0,""]
["S",3,"S",0,1,7,4,0,0,0,0,"","Serviço","Serviço","-","AGETOP",85056,"TÊ DE FERRO GALVANIZADO 90º X 2 1/2\"","un    ",14,null,null,0,""]
["S",3,"S",0,1,7,4,0,0,0,0,"","Serviço","Serviço","-","COMPOSIÇÃO","COMP 030_SEE","COTOVELO DE FERRO GALV. 90° X 2 1/2\"","UN ",70,null,null,0,""]
["S",3,"S",0,1,7,4,0,0,0,0,"","Serviço","Serviço","-","COMPOSIÇÃO","COMP 077_SEE","UNIAO FERRO GALV C/ASSENTO CONICO BRONZE 2 1/2\"","UN ",6,null,null,0,""]
["S",3,"S",0,1,7,4,0,0,0,0,"","Serviço","Serviço","-","COMPOSIÇÃO","COMP 549_SEE","FLANGE GALVANIZADA 2.1/2\" - FORNECIMENTO E INSTALAÇÃO","UN ",1,null,null,0,""]
["S",3,"S",0,1,7,4,0,0,0,0,"","Serviço","Serviço","-","COMPOSIÇÃO","COMP 022_SEE","TAMPÃO FOFO 40X50CM C/INSCRIÇÃO ","UN ",1,null,null,0,""]
["S",3,"S",0,1,7,4,0,0,0,0,"","Serviço","Serviço","-","COMPOSIÇÃO","COMP 546_SEE","BUJÃO DE REBORDO 2.1/2\"","UN ",1,null,null,0,""]
["S",3,"S",0,1,7,4,0,0,0,0,"","Serviço","Serviço","-","COMPOSIÇÃO","COMP 024_SEE","SINALIZADOR FOTOLUMINESCENTE PARA EXTINTOR","UN ",18,null,null,0,""]
["S",3,"S",0,1,7,4,0,0,0,0,"","Serviço","Serviço","-","COMPOSIÇÃO","COMP 186_SEE","BOTOEIRA BOMBA DE INCÊNDIO C/ MARTELO CONVENCIONAL/ ANALÓGICA","UN ",12,null,null,0,""]
["S",3,"S",0,1,7,4,0,0,0,0,"","Serviço","Serviço","-","COMPOSIÇÃO","COMP 188_SEE","ACIONADOR MANUAL DE ALARME","UN ",12,null,null,0,""]
["S",3,"S",0,1,7,4,0,0,0,0,"","Serviço","Serviço","-","COMPOSIÇÃO","COMP 190_SEE","CENTRAL DE DETECÇÃO E ALARME DE 40 SETORES COM BATERIA","UN ",1,null,null,0,""]
["S",3,"S",0,1,7,4,0,0,{"$f":"IF(OR($C211=\"S\",$C211=0),0,MATCH(0,OFFSET($D211,1,$C211,ROW($C$279)-ROW($C211)),0))","v":0},{"$f":"IF(OR($C211=\"S\",$C211=0),0,MATCH(OFFSET($D211,0,$C211)+1,OFFSET($D211,1,$C211,ROW($C$279)-ROW($C211)),0))","v":0},"","Serviço","Serviço","-","COMPOSIÇÃO","COMP 025_SEE","SINALIZADOR FOTOLUMINESCENTE DE EMERGÊNCIA","UN ",42,null,null,0,""]
["S",3,"S",0,1,7,4,0,0,0,0,"","Serviço","Serviço","-","COMPOSIÇÃO","COMP 277_SEE","MARCAÇÃO NO PISO - 1X1 M PARA EXTINTOR","M2",18,null,null,0,""]
["S",3,"S",0,1,7,4,0,0,0,0,"","Serviço","Serviço","-","COMPOSIÇÃO","COMP 077_SEE","UNIAO FERRO GALV C/ASSENTO CONICO BRONZE 2 1/2\"","UN ",6,null,null,0,""]
["S",3,"S",0,1,7,4,0,0,0,0,"","Serviço","Serviço","-","SINAPI",97599,"LUMINÁRIA DE EMERGÊNCIA - FORNECIMENTO E INSTALAÇÃO. AF_11/2017","UN",31,null,null,0,""]
["S",3,"S",0,1,7,4,0,0,0,0,"","Serviço","Serviço","-","COMPOSIÇÃO","COMP 558_SEE","BOMBA DE PRESSURIZAÇÃO JOCKEY 3,0 CV","UN ",1,null,null,0,""]
[{"$f":"CHOOSE(1+LOG(1+2*(ORÇAMENTO.Nivel=\"Nível 1\")+4*(ORÇAMENTO.Nivel=\"Nível 2\")+8*(ORÇAMENTO.Nivel=\"Nível 3\")+16*(ORÇAMENTO.Nivel=\"Nível 4\")+32*(ORÇAMENTO.Nivel=\"Serviço\"),2),0,1,2,3,4,\"S\")","v":2},{"$f":"IF(OR(C216=\"s\",C216=0),OFFSET(B216,-1,0),C216)","v":2},{"$f":"IF(OFFSET(C216,-1,0)=\"L\",1,IF(OFFSET(C216,-1,0)=1,2,IF(OR(A216=\"s\",A216=0),\"S\",IF(AND(OFFSET(C216,-1,0)=2,A216=4),3,IF(AND(OR(OFFSET(C216,-1,0)=\"s\",OFFSET(C216,-1,0)=0),A216<>\"s\",A216>OFFSET(B216,-1,0)),OFFSET(B216,-1,0),A216)))))","v":2},{"$f":"IF(OR(C216=\"S\",C216=0),0,IF(ISERROR(K216),J216,SMALL(J216:K216,1)))","v":3},{"$f":"IF($C216=1,OFFSET(E216,-1,0)+1,OFFSET(E216,-1,0))","v":1},{"$f":"IF($C216=1,0,IF($C216=2,OFFSET(F216,-1,0)+1,OFFSET(F216,-1,0)))","v":8},{"$f":"IF(AND($C216<=2,$C216<>0),0,IF($C216=3,OFFSET(G216,-1,0)+1,OFFSET(G216,-1,0)))","v":0},{"$f":"IF(AND($C216<=3,$C216<>0),0,IF($C216=4,OFFSET(H216,-1,0)+1,OFFSET(H216,-1,0)))","v":0},{"$f":"IF(AND($C216<=4,$C216<>0),0,IF(AND($C216=\"S\",$W216>0),OFFSET(I216,-1,0)+1,OFFSET(I216,-1,0)))","v":0},63,3,"","Nível 2","Nível 2","-",null,null,"ESTRUTURA DE MADEIRA","-",null,null,null,0,""]
["S",2,"S",0,1,8,0,0,0,{"$f":"IF(OR($C217=\"S\",$C217=0),0,MATCH(0,OFFSET($D217,1,$C217,ROW($C$279)-ROW($C217)),0))","v":0},{"$f":"IF(OR($C217=\"S\",$C217=0),0,MATCH(OFFSET($D217,0,$C217)+1,OFFSET($D217,1,$C217,ROW($C$279)-ROW($C217)),0))","v":0},"","Serviço","Serviço","-","AGETOP",140101,"ESTRUTURA-TELHA CERÂMICA V=3 A 7 M. C/FERRAGENS","m2    ",208.48,null,null,0,""]
["S",2,"S",0,1,8,0,0,0,0,0,"","Serviço","Serviço","-","AGETOP",140201,"ESTRUT.-TELHA DE FIBROCIMENTO (C/TESOURA) C/FERRAGENS","m2    ",2311.13,null,null,0,""]
[2,2,2,9,1,9,0,0,0,60,9,"","Nível 2","Nível 2","-",null,null,"COBERTURAS","-",null,null,null,0,""]
[3,3,3,3,1,9,1,0,0,8,3,"","Nível 3","Nível 3","-",null,null,"CERÂMICA","-",null,null,null,0,""]
["S",3,"S",0,1,9,1,0,0,0,0,"","Serviço","Serviço","-","SINAPI",94445,"TELHAMENTO COM TELHA CERÂMICA CAPA-CANAL, TIPO PLAN, COM ATÉ 2 ÁGUAS, INCLUSO TRANSPORTE VERTICAL. AF_06/2016","M2",208.48,null,null,0,"Referência: AGETOP - 160401"]
["S",3,"S",0,1,9,1,0,0,0,0,"","Serviço","Serviço","-","SINAPI",94221,"CUMEEIRA PARA TELHA CERÂMICA EMBOÇADA COM ARGAMASSA TRAÇO 1:2:9 (CIMENTO, CAL E AREIA) PARA TELHADOS COM ATÉ 2 ÁGUAS, INCLUSO TRANSPORTE VERTICAL. AF_06/2016","M",19.600000000000001,null,null,0,""]
[3,3,3,2,1,9,2,0,0,5,2,"","Nível 3","Nível 3","-",null,null,"FIBROCIMENTO","-",null,null,null,0,""]
["S",3,"S",0,1,9,2,0,0,0,0,"","Serviço","Serviço","-","SINAPI",94210,"TELHAMENTO COM TELHA ONDULADA DE FIBROCIMENTO E = 6 MM, COM RECOBRIMENTO LATERAL DE 1 1/4 DE ONDA PARA TELHADO COM INCLINAÇÃO MÁXIMA DE 10°, COM ATÉ 2 ÁGUAS, INCLUSO IÇAMENTO. AF_06/2016","M2",2311.13,null,null,0,"Referência: AGETOP - 160501"]
[3,3,3,3,1,9,3,0,0,3,39,"","Nível 3","Nível 3","-",null,null,"CALHA E RUFO","-",null,null,null,0,""]
["S",3,"S",0,1,9,3,0,0,0,0,"","Serviço","Serviço","-","SINAPI",94228,"CALHA EM CHAPA DE AÇO GALVANIZADO NÚMERO 24, DESENVOLVIMENTO DE 50 CM, INCLUSO TRANSPORTE VERTICAL. AF_06/2016","M",13.248800000000001,null,null,0,"Referência: AGETOP - 160601"]
["S",3,"S",0,1,9,3,0,0,0,0,"","Serviço","Serviço","-","SINAPI",94231,"RUFO EM CHAPA DE AÇO GALVANIZADO NÚMERO 24, CORTE DE 25 CM, INCLUSO TRANSPORTE VERTICAL. AF_06/2016","M",9.7728000000000002,null,null,0,"Referência: AGETOP - 160602"]
[2,2,2,2,1,10,0,0,0,51,2,"","Nível 2","Nível 2","-",null,null,"ESQUADRIAS METÁLICAS","-",null,null,null,0,""]
["S",2,"S",0,1,10,0,0,0,0,0,"","Serviço","Serviço","-","SINAPI","73933/4","PORTA DE FERRO DE ABRIR TIPO BARRA CHATA, COM REQUADRO E GUARNICAO COMPLETA","M2",15.120000000000001,null,null,0,"Referência: AGETOP - 180509"]
[2,2,2,2,1,11,0,0,0,49,2,"","Nível 2","Nível 2","-",null,null,"VIDROS","-",null,null,null,0,""]
["S",2,"S",0,1,11,0,0,0,0,0,"","Serviço","Serviço","-","SINAPI",72117,"VIDRO LISO COMUM TRANSPARENTE, ESPESSURA 4MM","M2",30,null,null,0,"Referência: AGETOP - 190102"]
[2,2,2,4,1,12,0,0,0,47,4,"","Nível 2","Nível 2","-",null,null,"REVESTIMENTO DE PAREDE","-",null,null,null,0,""]
[{"$f":"CHOOSE(1+LOG(1+2*(ORÇAMENTO.Nivel=\"Nível 1\")+4*(ORÇAMENTO.Nivel=\"Nível 2\")+8*(ORÇAMENTO.Nivel=\"Nível 3\")+16*(ORÇAMENTO.Nivel=\"Nível 4\")+32*(ORÇAMENTO.Nivel=\"Serviço\"),2),0,1,2,3,4,\"S\")","v":"S"},2,"S",0,{"$f":"IF($C233=1,OFFSET(E233,-1,0)+1,OFFSET(E233,-1,0))","v":1},{"$f":"IF($C233=1,0,IF($C233=2,OFFSET(F233,-1,0)+1,OFFSET(F233,-1,0)))","v":12},{"$f":"IF(AND($C233<=2,$C233<>0),0,IF($C233=3,OFFSET(G233,-1,0)+1,OFFSET(G233,-1,0)))","v":0},{"$f":"IF(AND($C233<=3,$C233<>0),0,IF($C233=4,OFFSET(H233,-1,0)+1,OFFSET(H233,-1,0)))","v":0},{"$f":"IF(AND($C233<=4,$C233<>0),0,IF(AND($C233=\"S\",$W233>0),OFFSET(I233,-1,0)+1,OFFSET(I233,-1,0)))","v":0},0,0,"","Serviço","Serviço","-","SINAPI",87547,"MASSA ÚNICA, PARA RECEBIMENTO DE PINTURA, EM ARGAMASSA TRAÇO 1:2:8, PREPARO MECÂNICO COM BETONEIRA 400L, APLICADA MANUALMENTE EM FACES INTERNAS DE PAREDES, ESPESSURA DE 10MM, COM EXECUÇÃO DE TALISCAS. AF_06/2014","M2",5.76,null,null,0,"Referência: AGETOP - 200500"]
["S",2,"S",0,1,12,0,0,0,0,0,"","Serviço","Serviço","-","AGETOP",200505,"REB.PAULISTA C/IMPERM.A-15 (1CI:4ARMLC+5% IMPXCI)","m2    ",159.13999999999999,null,null,0,""]
["S",2,"S",0,1,12,0,0,0,0,0,"","Serviço","Serviço","-","SINAPI",87273,"REVESTIMENTO CERÂMICO PARA PAREDES INTERNAS COM PLACAS TIPO ESMALTADA EXTRA DE DIMENSÕES 33X45 CM APLICADAS EM AMBIENTES DE ÁREA MAIOR QUE 5 M² NA ALTURA INTEIRA DAS PAREDES. AF_06/2014","M2",150.6,null,null,0,""]
[2,{"$f":"IF(OR(C236=\"s\",C236=0),OFFSET(B236,-1,0),C236)","v":2},{"$f":"IF(OFFSET(C236,-1,0)=\"L\",1,IF(OFFSET(C236,-1,0)=1,2,IF(OR(A236=\"s\",A236=0),\"S\",IF(AND(OFFSET(C236,-1,0)=2,A236=4),3,IF(AND(OR(OFFSET(C236,-1,0)=\"s\",OFFSET(C236,-1,0)=0),A236<>\"s\",A236>OFFSET(B236,-1,0)),OFFSET(B236,-1,0),A236)))))","v":2},{"$f":"IF(OR(C236=\"S\",C236=0),0,IF(ISERROR(K236),J236,SMALL(J236:K236,1)))","v":8},1,13,0,0,0,43,8,"","Nível 2","Nível 2","-",null,null,"REVESTIMENTO DE PISO","-",null,null,null,0,""]
[3,3,3,3,1,13,1,0,0,7,3,"","Nível 3","Nível 3","-",null,null,"GRANITINA","-",null,null,null,0,""]
["S",3,"S",0,1,13,1,0,0,0,0,"","Serviço","Serviço","-","SINAPI",84191,"PISO EM GRANILITE, MARMORITE OU GRANITINA ESPESSURA 8 MM, INCLUSO JUNTAS DE DILATACAO PLASTICAS","M2",122.3034,null,null,0,"Referência: AGETOP - 221101"]
["S",3,"S",0,1,13,1,0,0,0,0,"","Serviço","Serviço","-","AGETOP",221104,"RASPAGEM E APLICAÇÃO RESINA ACRÍLICA DUAS DEMÃOS","m2    ",175.2234,null,null,0,""]
[3,3,3,2,1,13,2,0,0,4,2,"","Nível 3","Nível 3","-",null,null,"CONCRETO","-",null,null,null,0,""]
["S",3,"S",0,1,13,2,0,0,0,0,"","Serviço","Serviço","-","AGETOP",220102,"PISO CONCRETO DESEMPENADO ESPESSURA = 5 CM  1:2,5:3,5","m2    ",1550.38,null,null,0,""]
[3,3,3,2,1,13,3,0,0,2,22,"","Nível 3","Nível 3","-",null,null,"PODOTÁTIL","-",null,null,null,0,""]
["S",3,"S",0,1,13,3,0,0,0,0,"","Serviço","Serviço","-","AGETOP",221126,"PISO DE LADRILHO HIDRÁULICO COLORIDO MODELO TÁTIL ( ALERTA OU DIRECIONAL) SEM LASTRO","m2    ",82.54,null,null,0,""]
[2,2,2,3,1,14,0,0,0,35,3,"","Nível 2","Nível 2","-",null,null,"FERRAGENS","-",null,null,null,0,""]
["S",2,"S",0,1,14,0,0,0,0,0,"","Serviço","Serviço","-","AGETOP",230174,"BARRA DE APOIO EM AÇO INOX - 40 CM","un    ",8,null,null,0,""]
["S",2,"S",0,1,14,0,0,0,0,0,"","Serviço","Serviço","-","AGETOP",230176,"BARRA DE APOIO EM AÇO INOX - 80 CM ","un    ",4,null,null,0,""]
[2,2,2,4,1,15,0,0,0,32,4,"","Nível 2","Nível 2","-",null,null,"ADMINISTRAÇÃO","-",null,null,null,0,""]
[3,3,3,3,1,15,1,0,0,3,8,"","Nível 3","Nível 3","-",null,null,"MENSALISTAS","-",null,null,null,0,""]
["S",3,"S",0,1,15,1,0,0,0,0,"","Serviço","Serviço","-","SINAPI",90778,"ENGENHEIRO CIVIL DE OBRA PLENO COM ENCARGOS COMPLEMENTARES","H",88,null,null,0,"Referência: AGETOP - 250101"]
["S",3,"S",0,1,15,1,0,0,0,0,"","Serviço","Serviço","-","SINAPI",90776,"ENCARREGADO GERAL COM ENCARGOS COMPLEMENTARES","H",440,null,null,0,"Referência: AGETOP - 250103"]
[2,2,2,23,1,16,0,0,0,28,23,"","Nível 2","Nível 2","-",null,null,"PINTURA","-",null,null,null,0,""]
[3,3,3,4,1,16,1,0,0,22,4,"","Nível 3","Nível 3","-",null,null,"ESMALTE SINTÉTICO","-",null,null,null,0,""]
["S",3,"S",0,1,16,1,0,0,0,0,"","Serviço","Serviço","-","AGETOP",260105,"REMOCAO DE PINTURA ANTIGA A OLEO OU ESMALTE","m2    ",675.85,null,null,0,""]
["S",3,"S",0,1,16,1,0,0,0,0,"","Serviço","Serviço","-","SINAPI",88497,"APLICAÇÃO E LIXAMENTO DE MASSA LÁTEX EM PAREDES, DUAS DEMÃOS. AF_06/2014","M2",337.92,null,null,0,"Referência: AGETOP - 261300"]
[{"$f":"CHOOSE(1+LOG(1+2*(ORÇAMENTO.Nivel=\"Nível 1\")+4*(ORÇAMENTO.Nivel=\"Nível 2\")+8*(ORÇAMENTO.Nivel=\"Nível 3\")+16*(ORÇAMENTO.Nivel=\"Nível 4\")+32*(ORÇAMENTO.Nivel=\"Serviço\"),2),0,1,2,3,4,\"S\")","v":"S"},3,"S",0,1,16,1,0,{"$f":"IF(AND($C255<=4,$C255<>0),0,IF(AND($C255=\"S\",$W255>0),OFFSET(I255,-1,0)+1,OFFSET(I255,-1,0)))","v":0},0,0,"","Serviço","Serviço","-","AGETOP",261550,"PINT.ESMALTE SINT.PAREDES - 2 DEM.C/SELADOR","m2    ",2899.98,null,null,0,""]
[3,3,3,4,1,16,2,0,0,18,4,"","Nível 3","Nível 3","-","AGETOP",null,"LÁTEX ACRÍLICA","-",null,null,null,0,""]
["S",3,"S",0,1,16,2,0,0,0,0,"","Serviço","Serviço","-","AGETOP",260104,"REMOCAO DE PINTURA ANTIGA A LATEX","m2    ",675.84,null,null,0,""]
["S",3,"S",0,1,16,2,0,0,0,0,"","Serviço","Serviço","-","SINAPI",88497,"APLICAÇÃO E LIXAMENTO DE MASSA LÁTEX EM PAREDES, DUAS DEMÃOS. AF_06/2014","M2",343.68,null,null,0,"Referência: AGETOP - 261300"]
["S",3,"S",0,{"$f":"IF($C259=1,OFFSET(E259,-1,0)+1,OFFSET(E259,-1,0))","v":1},{"$f":"IF($C259=1,0,IF($C259=2,OFFSET(F259,-1,0)+1,OFFSET(F259,-1,0)))","v":16},{"$f":"IF(AND($C259<=2,$C259<>0),0,IF($C259=3,OFFSET(G259,-1,0)+1,OFFSET(G259,-1,0)))","v":2},{"$f":"IF(AND($C259<=3,$C259<>0),0,IF($C259=4,OFFSET(H259,-1,0)+1,OFFSET(H259,-1,0)))","v":0},0,0,0,"","Serviço","Serviço","-","SINAPI",88489,"APLICAÇÃO MANUAL DE PINTURA COM TINTA LÁTEX ACRÍLICA EM PAREDES, DUAS DEMÃOS. AF_06/2014","M2",2175.54,null,null,0,"Referência: AGETOP - 261001"]
[3,3,3,4,1,16,3,0,0,14,4,"","Nível 3","Nível 3","-","AGETOP",null,"TETO","-",null,null,null,0,""]
["S",3,"S",0,1,16,3,0,0,0,0,"","Serviço","Serviço","-","AGETOP",260104,"REMOCAO DE PINTURA ANTIGA A LATEX","m2    ",675.84,null,null,0,""]
["S",3,"S",0,1,16,3,0,0,0,0,"","Serviço","Serviço","-","SINAPI",88496,"APLICAÇÃO E LIXAMENTO DE MASSA LÁTEX EM TETO, DUAS DEMÃOS. AF_06/2014","M2",337.92,null,null,0,"Referência: AGETOP - 261300"]
["S",3,"S",0,1,16,3,0,0,0,0,"","Serviço","Serviço","-","SINAPI",88486,"APLICAÇÃO MANUAL DE PINTURA COM TINTA LÁTEX PVA EM TETO, DUAS DEMÃOS. AF_06/2014","M2",2540.23,null,null,0,"Referência: AGETOP - 261307"]
[3,3,3,3,1,16,4,0,0,10,3,"","Nível 3","Nível 3","-","AGETOP",null,"EXTERNA","-",null,null,null,0,""]
["S",{"$f":"IF(OR(C265=\"s\",C265=0),OFFSET(B265,-1,0),C265)","v":3},{"$f":"IF(OFFSET(C265,-1,0)=\"L\",1,IF(OFFSET(C265,-1,0)=1,2,IF(OR(A265=\"s\",A265=0),\"S\",IF(AND(OFFSET(C265,-1,0)=2,A265=4),3,IF(AND(OR(OFFSET(C265,-1,0)=\"s\",OFFSET(C265,-1,0)=0),A265<>\"s\",A265>OFFSET(B265,-1,0)),OFFSET(B265,-1,0),A265)))))","v":"S"},{"$f":"IF(OR(C265=\"S\",C265=0),0,IF(ISERROR(K265),J265,SMALL(J265:K265,1)))","v":0},1,16,4,0,0,0,0,"","Serviço","Serviço","-","SINAPI",88423,"APLICAÇÃO MANUAL DE PINTURA COM TINTA TEXTURIZADA ACRÍLICA EM PAREDES EXTERNAS DE CASAS, UMA COR. AF_06/2014","M2",5184.38,null,null,0,"Referência: AGETOP - 260601"]
["S",3,"S",0,1,16,4,0,0,0,0,"","Serviço","Serviço","-","SINAPI",88489,"APLICAÇÃO MANUAL DE PINTURA COM TINTA LÁTEX ACRÍLICA EM PAREDES, DUAS DEMÃOS. AF_06/2014","M2",872.45,null,null,0,"Referência: AGETOP - 261001"]
[3,3,3,2,1,16,5,0,0,7,2,"","Nível 3","Nível 3","-","AGETOP",null,"ESQUADRIAS NOVAS","-",null,null,null,0,""]
["S",3,"S",0,1,16,5,0,0,0,0,"","Serviço","Serviço","-","SINAPI","74145/1","PINTURA ESMALTE FOSCO, DUAS DEMAOS, SOBRE SUPERFICIE METALICA, INCLUSO UMA DEMAO DE FUNDO ANTICORROSIVO. UTILIZACAO DE REVOLVER ( AR-COMPRIMIDO).","M2",87.29,null,null,0,"Referência: AGETOP - 261602"]
[3,3,3,3,1,16,6,0,0,{"$f":"IF(OR($C269=\"S\",$C269=0),0,MATCH(0,OFFSET($D269,1,$C269,ROW($C$279)-ROW($C269)),0))","v":5},{"$f":"IF(OR($C269=\"S\",$C269=0),0,MATCH(OFFSET($D269,0,$C269)+1,OFFSET($D269,1,$C269,ROW($C$279)-ROW($C269)),0))","v":3},"","Nível 3","Nível 3","-","SINAPI",null,"ESQUADRIAS EXISTENTES","-",null,null,null,0,""]
["S",3,"S",0,1,16,6,0,0,0,0,"","Serviço","Serviço","-","AGETOP",260105,"REMOCAO DE PINTURA ANTIGA A OLEO OU ESMALTE","m2    ",742.34,null,null,0,""]
["S",3,"S",0,1,16,6,0,0,0,0,"","Serviço","Serviço","-","SINAPI","73924/3","PINTURA ESMALTE FOSCO, DUAS DEMAOS, SOBRE SUPERFICIE METALICA","M2",742.34,null,null,0,"Referência: AGETOP - 261503"]
[3,3,3,2,1,16,7,0,0,{"$f":"IF(OR($C272=\"S\",$C272=0),0,MATCH(0,OFFSET($D272,1,$C272,ROW($C$279)-ROW($C272)),0))","v":2},{"$f":"IF(OR($C272=\"S\",$C272=0),0,MATCH(OFFSET($D272,0,$C272)+1,OFFSET($D272,1,$C272,ROW($C$279)-ROW($C272)),0))","v":{"$error":"#N/A"}},"","Nível 3","Nível 3","-","AGETOP",null,"OUTROS","-",null,null,null,0,""]
["S",3,"S",0,1,16,7,0,0,0,0,"","Serviço","Serviço","-","AGETOP",261620,"LETREIRO MÉDIO A GRANDE PORTE EM PAREDE FEITO A PINCEL","m2    ",7.2,null,null,0,""]
[2,2,2,5,1,17,0,0,0,5,{"$error":"#N/A"},"","Nível 2","Nível 2","-",null,null,"DIVERSOS","-",null,null,null,0,""]
["S",2,"S",0,1,17,0,0,0,0,0,"","Serviço","Serviço","-","COMPOSIÇÃO","COMP 082_SEE","CORRIMÃO PAREDE - SEDUC","M",95.64,null,null,0,""]
["S",2,"S",0,1,17,0,0,0,0,0,"","Serviço","Serviço","-","AGETOP",180314,"GUARDA CORPO COM CORRIMÃO/TUBO INDUSTRIAL  GC-1 ","m2    ",7.25,null,null,0,""]
["S",2,"S",0,1,17,0,0,0,0,0,"","Serviço","Serviço","-","AGETOP",270501,"LIMPEZA FINAL DE OBRA - (OBRAS CIVIS)","m2    ",1063.412,null,null,0,""]
["S",2,"S",0,1,17,0,0,0,0,0,"","Serviço","Serviço","-","AGETOP",271608,"BANCADA DE GRANITO C/ESPELHO","m2    ",6.34,null,null,0,""]
[-1,null,-1,null,0,0,0,0,0,null,null,"F"]
[null,null,null,null,null,null,null,null,null,null,null,"F",null,null,null,null,null,"OBS: OS QUANTITATIVOS DE MATERIAIS  DAS INSTALAÇÕES HIDROSSANITÁRIAS, ELÉTRICAS E ESPECIAIS SÃO FORNECIDOS PELOS PROFISSIONAIS RESPONSÁVEIS PELOS RESPECTIVOS PROJETOS.",null,null,"VALOR TOTAL",null,0]
[null,null,null,null,null,null,null,null,null,null,null,"F",null,null,null,null,null,null,null,null,"VALOR BDI (27,50%)",null,0]
[null,null,null,null,null,null,null,null,null,null,null,"F",null,null,null,null,null,null,null,null,"TOTAL ORÇAMENTO",null,0]
[null,null,null,null,null,null,null,null,null,null,null,"F"]
[null,null,null,null,null,null,null,null,null,null,null,"F",null,null,null,null,null,null,null,null,"CUSTO POR M2 ³",null,0]
[null,null,null,null,null,null,null,null,null,null,null,"F",null,null,null,null,null,null,null,null,"MATERIAL S/ BDI",null,0]
[null,null,null,null,null,null,null,null,null,null,null,"F",null,null,null,null,null,null,null,null,"MÃO DE OBRA S/ BDI",null,0]
[null,null,null,null,null,null,null,null,null,null,null,"F"]
[null,null,null,null,null,null,null,null,null,null,null,"F",null,null,null,null,"(1) Conforme previsto pelo DECRETO Nº 7.983, DE 8 DE ABRIL DE 2013, os preços adotados são aqueles constantes dos sistemas de referência indicados. Justifica-se o uso dos preços destas composições de custos unitários devido ao seu valor ser menor à mediana de seus correspondentes na tabela SINAPI;"]
[null,null,null,null,null,null,null,null,null,null,null,"F",null,null,null,null,"(2) Optou-se pelo uso das composições de custos da AGETOP para itens não presentes na SINAPI;"]
[null,null,null,null,null,null,null,null,null,null,null,"F",null,null,null,null,"(3) Para itens da AGETOP, os vidros não estão inclusos nas esquadrias e já foram considerados os custos de contramarco para as esquadrias de alumínio;"]
[null,null,null,null,null,null,null,null,null,null,null,"F",null,null,null,null,"(4) Nos casos em que houver execução de granitina e omissão do item AGETOP 221102, considerou-se que o quantitativo para o rodapé, de altura igual a 7cm, foi incorporado na área de piso;"]
[null,null,null,null,null,null,null,null,null,null,null,"F",null,null,null,null,"(5) O custo unitário aproximado por metro quadrado é calculado dividindo-se o valor total do orçamento pela área total de construção."]
[null,null,null,null,null,null,null,null,null,null,null,"F"]
[null,null,null,null,null,null,null,null,null,null,null,"F"]
[]
[null,null,null,null,null,null,null,null,null,null,null,null,null,null,"SOMATÓRIO DE SERVIÇOS"]
[null,null,null,null,null,null,null,null,null,null,null,null,null,null,"ITEM","DESCRIÇÃO DOS SERVIÇOS",null,null,"PREÇO SEM BDI",null,null,"PREÇO COM BDI",null,"PARTICIPAÇÃO ( % )"]
[null,null,null,null,null,null,null,null,null,null,null,null,null,null,"a.","SERVIÇOS PRELIMINARES",null,null,{"$f":"SUMIF($R$19:$R$279,$P298,$W$19:$W$279)","v":0},null,null,{"$f":"ROUND(S298*(1+BDI.Taxa),2)","v":0},null,{"$f":"IFERROR(ROUND($V298*100/$W$282,2),0)","v":0}]
[null,null,null,null,null,null,null,null,null,null,null,null,null,null,"b.","TRANSPORTES",null,null,0,null,null,0,null,{"$f":"IFERROR(ROUND($V299*100/$W$282,2),0)","v":0}]
[null,null,null,null,null,null,null,null,null,null,null,null,null,null,"c.","SERVIÇO EM TERRA",null,null,0,null,null,0,null,0]
[null,null,null,null,null,null,null,null,null,null,null,null,null,null,"d.","FUNDAÇÕES E SONDAGENS",null,null,0,null,null,0,null,0]
[null,null,null,null,null,null,null,null,null,null,null,null,null,null,"e.","ESTRUTURA",null,null,0,null,null,0,null,0]
[null,null,null,null,null,null,null,null,null,null,null,null,null,null,"f.","INSTALAÇÕES ELÉTRICAS",null,null,0,null,null,0,null,0]
[null,null,null,null,null,null,null,null,null,null,null,null,null,null,"g.","INSTALAÇÕES HIDROSSANITÁRIAS",null,null,0,null,null,0,null,0]
[null,null,null,null,null,null,null,null,null,null,null,null,null,null,"h","INSTALAÇÕES ESPECIAIS",null,null,0,null,null,0,null,0]
[null,null,null,null,null,null,null,null,null,null,null,null,null,null,"i.","ALVENARIAS E DIVISÓRIAS",null,null,0,null,null,0,null,0]
[null,null,null,null,null,null,null,null,null,null,null,null,null,null,"j.","ALVENARIA AUTO-PORTANTE",null,null,0,null,null,0,null,0]
[null,null,null,null,null,null,null,null,null,null,null,null,null,null,"k.","IMPERMEABILIZAÇÃO",null,null,0,null,null,0,null,0]
[null,null,null,null,null,null,null,null,null,null,null,null,null,null,"l.","ISOLAMENTO TÉRMICO E ACÚSTICO",null,null,0,null,null,0,null,0]
[null,null,null,null,null,null,null,null,null,null,null,null,null,null,"m.","ESTRUTURA DE MADEIRA",null,null,0,null,null,0,null,0]
[null,null,null,null,null,null,null,null,null,null,null,null,null,null,"n.","ESTRUTURAS METÁLICAS",null,null,0,null,null,0,null,0]
[null,null,null,null,null,null,null,null,null,null,null,null,null,null,"o.","COBERTURAS",null,null,0,null,null,0,null,0]
[null,null,null,null,null,null,null,null,null,null,null,null,null,null,"p.","ESQUADRIAS DE MADEIRA",null,null,0,null,null,0,null,0]
[null,null,null,null,null,null,null,null,null,null,null,null,null,null,"q.","ESQUADRIAS METÁLICAS",null,null,0,null,null,{"$f":"ROUND(S314*(1+BDI.Taxa),2)","v":0},null,0]
[null,null,null,null,null,null,null,null,null,null,null,null,null,null,"r.","VIDROS",null,null,0,null,null,0,null,0]
[null,null,null,null,null,null,null,null,null,null,null,null,null,null,"s.","REVESTIMENTO DE PAREDE",null,null,0,null,null,0,null,0]
[null,null,null,null,null,null,null,null,null,null,null,null,null,null,"t.","FORROS",null,null,0,null,null,0,null,0]
[null,null,null,null,null,null,null,null,null,null,null,null,null,null,"u.","REVESTIMENTO DE PISO",null,null,0,null,null,0,null,0]
[null,null,null,null,null,null,null,null,null,null,null,null,null,null,"v.","FERRAGENS",null,null,0,null,null,0,null,0]
[null,null,null,null,null,null,null,null,null,null,null,null,null,null,"w.","MARCENARIA",null,null,0,null,null,0,null,0]
[null,null,null,null,null,null,null,null,null,null,null,null,null,null,"x.","ADMINISTRAÇÃO",null,null,0,null,null,0,null,0]
[null,null,null,null,null,null,null,null,null,null,null,null,null,null,"y.","PINTURA",null,null,0,null,null,{"$f":"ROUND(S322*(1+BDI.Taxa),2)","v":0},null,0]
[null,null,null,null,null,null,null,null,null,null,null,null,null,null,"z.","DIVERSOS",null,null,0,null,null,{"$f":"IF(S323>0,IF((SUM(V298:W322)+ROUND(S323*(1+BDI.Taxa),2))<>V325,V325-SUM(V298:W322),ROUND(S323*(1+BDI.Taxa),2)),0)","v":0},null,{"$f":"IF(S323>0,IF((SUM(X298:X322)+IFERROR(ROUND($V323*100/$W$282,2),0))<>X325,X325-SUM(X298:X322),IFERROR(ROUND($V323*100/$W$282,2),0)),0)","v":0}]
[null,null,null,null,null,null,null,null,null,null,null,null,null,null,"TOTAL GERAL DO ORÇAMENTO (R$)",null,null,null,{"$f":"SUM(S298:U323)","v":0},null,null,{"$f":"SUM(V298:W323)","v":0},null,{"$f":"SUM(X298:X323)","v":0}]
[null,null,null,null,null,null,null,null,null,null,null,null,null,null,null,null,null,null,{"$f":"$W$280","v":0},null,null,{"$f":"$W$282","v":0},null,100]
[null,null,null,null,null,null,null,null,null,null,null,null,null,null,null,null,null,null,"(TOTAL SEM BDI)",null,null,"(TOTAL COM BDI)",null,"(ARRED porcentagem)"]
[null,null,null,null,null,null,null,null,null,null,null,null,null,null,null,null,null,null,{"$f":"IF(AND(S324=S325,S324>0),\"OK\",\"ERRO\")","v":"ERRO"},null,null,{"$f":"IF(AND(V324=V325,V324>0),\"OK\",\"ERRO\")","v":"ERRO"},null,{"$f":"IF(X324=100,\"OK\",\"ERRO\")","v":"ERRO"}]
[]
[]
[null,null,null,null,null,null,null,null,null,null,null,null,null,null,"RESUMO GERAL DO ORÇAMENTO"]
[null,null,null,null,null,null,null,null,null,null,null,null,null,null,"ITEM","DESCRIÇÃO DOS SERVIÇOS",null,null,"PREÇO SEM BDI",null,null,"PREÇO COM BDI",null,"PARTICIPAÇÃO ( % )"]
[null,null,null,null,null,null,null,null,null,null,null,null,null,null,"1.",{"$f":"IFERROR(VLOOKUP(O332,$O$19:$W$279,4,FALSE),\"\")","v":"REFORMA"},null,null,{"$f":"IF(P333=\"\",$S$353-SUM(OFFSET($S$331:S331,0,0,COUNTA($S$331:S331),1)),SUMIF($R$19:$R$279,$P332,$W$19:$W$279))","v":0},null,null,{"$f":"IF(P333=\"\",$V$353-SUM(OFFSET($V$331:V331,0,0,COUNTA($V$331:V331),1)),ROUND(S332*(1+BDI.Taxa),2))","v":0},null,{"$f":"IF(P333=\"\",$X$353-SUM(OFFSET($X$331:X331,0,0,COUNTA($X$331:X331),1)),ROUND(V332*100/ORÇAMENTO.TotalOrçamento,2))","v":100}]
[null,null,null,null,null,null,null,null,null,null,null,null,null,null,"2.","",null,null,{"$f":"IF(P334=\"\",$S$353-SUM(OFFSET($S$331:S332,0,0,COUNTA($S$331:S332),1)),SUMIF($R$19:$R$279,$P333,$W$19:$W$279))","v":0},null,null,{"$f":"IF(P334=\"\",$V$353-SUM(OFFSET($V$331:V332,0,0,COUNTA($V$331:V332),1)),ROUND(S333*(1+BDI.Taxa),2))","v":0},null,{"$f":"IF(P334=\"\",$X$353-SUM(OFFSET($X$331:X332,0,0,COUNTA($X$331:X332),1)),ROUND(V333*100/ORÇAMENTO.TotalOrçamento,2))","v":0}]
[null,null,null,null,null,null,null,null,null,null,null,null,null,null,"3.","",null,null,{"$f":"IF(P335=\"\",$S$353-SUM(OFFSET($S$331:S333,0,0,COUNTA($S$331:S333),1)),SUMIF($R$19:$R$279,$P334,$W$19:$W$279))","v":0},null,null,{"$f":"IF(P335=\"\",$V$353-SUM(OFFSET($V$331:V333,0,0,COUNTA($V$331:V333),1)),ROUND(S334*(1+BDI.Taxa),2))","v":0},null,{"$f":"IF(P335=\"\",$X$353-SUM(OFFSET($X$331:X333,0,0,COUNTA($X$331:X333),1)),ROUND(V334*100/ORÇAMENTO.TotalOrçamento,2))","v":0}]
[null,null,null,null,null,null,null,null,null,null,null,null,null,null,"4.","",null,null,{"$f":"IF(P336=\"\",$S$353-SUM(OFFSET($S$331:S334,0,0,COUNTA($S$331:S334),1)),SUMIF($R$19:$R$279,$P335,$W$19:$W$279))","v":0},null,null,{"$f":"IF(P336=\"\",$V$353-SUM(OFFSET($V$331:V334,0,0,COUNTA($V$331:V334),1)),ROUND(S335*(1+BDI.Taxa),2))","v":0},null,{"$f":"IF(P336=\"\",$X$353-SUM(OFFSET($X$331:X334,0,0,COUNTA($X$331:X334),1)),ROUND(V335*100/ORÇAMENTO.TotalOrçamento,2))","v":0}]
[null,null,null,null,null,null,null,null,null,null,null,null,null,null,"5.","",null,null,{"$f":"IF(P337=\"\",$S$353-SUM(OFFSET($S$331:S335,0,0,COUNTA($S$331:S335),1)),SUMIF($R$19:$R$279,$P336,$W$19:$W$279))","v":0},null,null,{"$f":"IF(P337=\"\",$V$353-SUM(OFFSET($V$331:V335,0,0,COUNTA($V$331:V335),1)),ROUND(S336*(1+BDI.Taxa),2))","v":0},null,{"$f":"IF(P337=\"\",$X$353-SUM(OFFSET($X$331:X335,0,0,COUNTA($X$331:X335),1)),ROUND(V336*100/ORÇAMENTO.TotalOrçamento,2))","v":0}]
[null,null,null,null,null,null,null,null,null,null,null,null,null,null,"6.","",null,null,{"$f":"IF(P338=\"\",$S$353-SUM(OFFSET($S$331:S336,0,0,COUNTA($S$331:S336),1)),SUMIF($R$19:$R$279,$P337,$W$19:$W$279))","v":0},null,null,{"$f":"IF(P338=\"\",$V$353-SUM(OFFSET($V$331:V336,0,0,COUNTA($V$331:V336),1)),ROUND(S337*(1+BDI.Taxa),2))","v":0},null,{"$f":"IF(P338=\"\",$X$353-SUM(OFFSET($X$331:X336,0,0,COUNTA($X$331:X336),1)),ROUND(V337*100/ORÇAMENTO.TotalOrçamento,2))","v":0}]
[null,null,null,null,null,null,null,null,null,null,null,null,null,null,"7.","",null,null,{"$f":"IF(P339=\"\",$S$353-SUM(OFFSET($S$331:S337,0,0,COUNTA($S$331:S337),1)),SUMIF($R$19:$R$279,$P338,$W$19:$W$279))","v":0},null,null,{"$f":"IF(P339=\"\",$V$353-SUM(OFFSET($V$331:V337,0,0,COUNTA($V$331:V337),1)),ROUND(S338*(1+BDI.Taxa),2))","v":0},null,{"$f":"IF(P339=\"\",$X$353-SUM(OFFSET($X$331:X337,0,0,COUNTA($X$331:X337),1)),ROUND(V338*100/ORÇAMENTO.TotalOrçamento,2))","v":0}]
[null,null,null,null,null,null,null,null,null,null,null,null,null,null,"8.","",null,null,{"$f":"IF(P340=\"\",$S$353-SUM(OFFSET($S$331:S338,0,0,COUNTA($S$331:S338),1)),SUMIF($R$19:$R$279,$P339,$W$19:$W$279))","v":0},null,null,{"$f":"IF(P340=\"\",$V$353-SUM(OFFSET($V$331:V338,0,0,COUNTA($V$331:V338),1)),ROUND(S339*(1+BDI.Taxa),2))","v":0},null,{"$f":"IF(P340=\"\",$X$353-SUM(OFFSET($X$331:X338,0,0,COUNTA($X$331:X338),1)),ROUND(V339*100/ORÇAMENTO.TotalOrçamento,2))","v":0}]
[null,null,null,null,null,null,null,null,null,null,null,null,null,null,"9.","",null,null,{"$f":"IF(P341=\"\",$S$353-SUM(OFFSET($S$331:S339,0,0,COUNTA($S$331:S339),1)),SUMIF($R$19:$R$279,$P340,$W$19:$W$279))","v":0},null,null,{"$f":"IF(P341=\"\",$V$353-SUM(OFFSET($V$331:V339,0,0,COUNTA($V$331:V339),1)),ROUND(S340*(1+BDI.Taxa),2))","v":0},null,{"$f":"IF(P341=\"\",$X$353-SUM(OFFSET($X$331:X339,0,0,COUNTA($X$331:X339),1)),ROUND(V340*100/ORÇAMENTO.TotalOrçamento,2))","v":0}]
[null,null,null,null,null,null,null,null,null,null,null,null,null,null,"10.","",null,null,{"$f":"IF(P342=\"\",$S$353-SUM(OFFSET($S$331:S340,0,0,COUNTA($S$331:S340),1)),SUMIF($R$19:$R$279,$P341,$W$19:$W$279))","v":0},null,null,{"$f":"IF(P342=\"\",$V$353-SUM(OFFSET($V$331:V340,0,0,COUNTA($V$331:V340),1)),ROUND(S341*(1+BDI.Taxa),2))","v":0},null,{"$f":"IF(P342=\"\",$X$353-SUM(OFFSET($X$331:X340,0,0,COUNTA($X$331:X340),1)),ROUND(V341*100/ORÇAMENTO.TotalOrçamento,2))","v":0}]
[null,null,null,null,null,null,null,null,null,null,null,null,null,null,"11.","",null,null,{"$f":"IF(P343=\"\",$S$353-SUM(OFFSET($S$331:S341,0,0,COUNTA($S$331:S341),1)),SUMIF($R$19:$R$279,$P342,$W$19:$W$279))","v":0},null,null,{"$f":"IF(P343=\"\",$V$353-SUM(OFFSET($V$331:V341,0,0,COUNTA($V$331:V341),1)),ROUND(S342*(1+BDI.Taxa),2))","v":0},null,{"$f":"IF(P343=\"\",$X$353-SUM(OFFSET($X$331:X341,0,0,COUNTA($X$331:X341),1)),ROUND(V342*100/ORÇAMENTO.TotalOrçamento,2))","v":0}]
[null,null,null,null,null,null,null,null,null,null,null,null,null,null,"12.","",null,null,{"$f":"IF(P344=\"\",$S$353-SUM(OFFSET($S$331:S342,0,0,COUNTA($S$331:S342),1)),SUMIF($R$19:$R$279,$P343,$W$19:$W$279))","v":0},null,null,{"$f":"IF(P344=\"\",$V$353-SUM(OFFSET($V$331:V342,0,0,COUNTA($V$331:V342),1)),ROUND(S343*(1+BDI.Taxa),2))","v":0},null,{"$f":"IF(P344=\"\",$X$353-SUM(OFFSET($X$331:X342,0,0,COUNTA($X$331:X342),1)),ROUND(V343*100/ORÇAMENTO.TotalOrçamento,2))","v":0}]
[null,null,null,null,null,null,null,null,null,null,null,null,null,null,"13.","",null,null,{"$f":"IF(P345=\"\",$S$353-SUM(OFFSET($S$331:S343,0,0,COUNTA($S$331:S343),1)),SUMIF($R$19:$R$279,$P344,$W$19:$W$279))","v":0},null,null,{"$f":"IF(P345=\"\",$V$353-SUM(OFFSET($V$331:V343,0,0,COUNTA($V$331:V343),1)),ROUND(S344*(1+BDI.Taxa),2))","v":0},null,{"$f":"IF(P345=\"\",$X$353-SUM(OFFSET($X$331:X343,0,0,COUNTA($X$331:X343),1)),ROUND(V344*100/ORÇAMENTO.TotalOrçamento,2))","v":0}]
[null,null,null,null,null,null,null,null,null,null,null,null,null,null,"14.","",null,null,{"$f":"IF(P346=\"\",$S$353-SUM(OFFSET($S$331:S344,0,0,COUNTA($S$331:S344),1)),SUMIF($R$19:$R$279,$P345,$W$19:$W$279))","v":0},null,null,{"$f":"IF(P346=\"\",$V$353-SUM(OFFSET($V$331:V344,0,0,COUNTA($V$331:V344),1)),ROUND(S345*(1+BDI.Taxa),2))","v":0},null,{"$f":"IF(P346=\"\",$X$353-SUM(OFFSET($X$331:X344,0,0,COUNTA($X$331:X344),1)),ROUND(V345*100/ORÇAMENTO.TotalOrçamento,2))","v":0}]
[null,null,null,null,null,null,null,null,null,null,null,null,null,null,"15.","",null,null,{"$f":"IF(P347=\"\",$S$353-SUM(OFFSET($S$331:S345,0,0,COUNTA($S$331:S345),1)),SUMIF($R$19:$R$279,$P346,$W$19:$W$279))","v":0},null,null,{"$f":"IF(P347=\"\",$V$353-SUM(OFFSET($V$331:V345,0,0,COUNTA($V$331:V345),1)),ROUND(S346*(1+BDI.Taxa),2))","v":0},null,{"$f":"IF(P347=\"\",$X$353-SUM(OFFSET($X$331:X345,0,0,COUNTA($X$331:X345),1)),ROUND(V346*100/ORÇAMENTO.TotalOrçamento,2))","v":0}]
[null,null,null,null,null,null,null,null,null,null,null,null,null,null,"16.","",null,null,{"$f":"IF(P348=\"\",$S$353-SUM(OFFSET($S$331:S346,0,0,COUNTA($S$331:S346),1)),SUMIF($R$19:$R$279,$P347,$W$19:$W$279))","v":0},null,null,{"$f":"IF(P348=\"\",$V$353-SUM(OFFSET($V$331:V346,0,0,COUNTA($V$331:V346),1)),ROUND(S347*(1+BDI.Taxa),2))","v":0},null,{"$f":"IF(P348=\"\",$X$353-SUM(OFFSET($X$331:X346,0,0,COUNTA($X$331:X346),1)),ROUND(V347*100/ORÇAMENTO.TotalOrçamento,2))","v":0}]
[null,null,null,null,null,null,null,null,null,null,null,null,null,null,"17.","",null,null,{"$f":"IF(P349=\"\",$S$353-SUM(OFFSET($S$331:S347,0,0,COUNTA($S$331:S347),1)),SUMIF($R$19:$R$279,$P348,$W$19:$W$279))","v":0},null,null,{"$f":"IF(P349=\"\",$V$353-SUM(OFFSET($V$331:V347,0,0,COUNTA($V$331:V347),1)),ROUND(S348*(1+BDI.Taxa),2))","v":0},null,{"$f":"IF(P349=\"\",$X$353-SUM(OFFSET($X$331:X347,0,0,COUNTA($X$331:X347),1)),ROUND(V348*100/ORÇAMENTO.TotalOrçamento,2))","v":0}]
[null,null,null,null,null,null,null,null,null,null,null,null,null,null,"18.","",null,null,{"$f":"IF(P350=\"\",$S$353-SUM(OFFSET($S$331:S348,0,0,COUNTA($S$331:S348),1)),SUMIF($R$19:$R$279,$P349,$W$19:$W$279))","v":0},null,null,{"$f":"IF(P350=\"\",$V$353-SUM(OFFSET($V$331:V348,0,0,COUNTA($V$331:V348),1)),ROUND(S349*(1+BDI.Taxa),2))","v":0},null,{"$f":"IF(P350=\"\",$X$353-SUM(OFFSET($X$331:X348,0,0,COUNTA($X$331:X348),1)),ROUND(V349*100/ORÇAMENTO.TotalOrçamento,2))","v":0}]
[null,null,null,null,null,null,null,null,null,null,null,null,null,null,"19.","",null,null,{"$f":"IF(P351=\"\",$S$353-SUM(OFFSET($S$331:S349,0,0,COUNTA($S$331:S349),1)),SUMIF($R$19:$R$279,$P350,$W$19:$W$279))","v":0},null,null,{"$f":"IF(P351=\"\",$V$353-SUM(OFFSET($V$331:V349,0,0,COUNTA($V$331:V349),1)),ROUND(S350*(1+BDI.Taxa),2))","v":0},null,{"$f":"IF(P351=\"\",$X$353-SUM(OFFSET($X$331:X349,0,0,COUNTA($X$331:X349),1)),ROUND(V350*100/ORÇAMENTO.TotalOrçamento,2))","v":0}]
[null,null,null,null,null,null,null,null,null,null,null,null,null,null,"20.","",null,null,{"$f":"IF(P352=\"\",$S$353-SUM(OFFSET($S$331:S350,0,0,COUNTA($S$331:S350),1)),SUMIF($R$19:$R$279,$P351,$W$19:$W$279))","v":0},null,null,{"$f":"IF(P352=\"\",$V$353-SUM(OFFSET($V$331:V350,0,0,COUNTA($V$331:V350),1)),ROUND(S351*(1+BDI.Taxa),2))","v":0},null,{"$f":"IF(P352=\"\",$X$353-SUM(OFFSET($X$331:X350,0,0,COUNTA($X$331:X350),1)),ROUND(V351*100/ORÇAMENTO.TotalOrçamento,2))","v":0}]
[null,null,null,null,null,null,null,null,null,null,null,null,null,null,"TOTAL GERAL DO ORÇAMENTO (R$)",null,null,null,{"$f":"SUM(S332:U351)","v":0},null,null,{"$f":"SUM(V332:W351)","v":0},null,{"$f":"SUM(X332:X351)","v":100}]
[null,null,null,null,null,null,null,null,null,null,null,null,null,null,null,null,null,null,{"$f":"$W$280","v":0},null,null,{"$f":"$W$282","v":0},null,100]
[null,null,null,null,null,null,null,null,null,null,null,null,null,null,null,null,null,null,"(TOTAL SEM BDI)",null,null,"(TOTAL COM BDI)",null,"(ARRED porcentagem)"]
[null,null,null,null,null,null,null,null,null,null,null,null,null,null,null,null,null,null,{"$f":"IF(AND(S352=S353,S352>0),\"OK\",\"ERRO\")","v":"ERRO"},null,null,{"$f":"IF(AND(V352=V353,V352>0),\"OK\",\"ERRO\")","v":"ERRO"},null,{"$f":"IF(AND(X352=100,S332<>0),\"OK\",\"ERRO\")","v":"ERRO"}]

{"sheet":"Resumo ","index":1,"n_rows":39,"n_cols":9,"rows_kept":39,"cut":false,"hidden":false,"merged":[[42,3,42,7],[11,1,11,2],[12,1,12,2],[15,2,15,3],[16,2,16,3],[14,1,14,8],[17,2,17,3],[23,2,23,3],[18,2,18,3],[19,2,19,3],[20,2,20,3],[41,3,41,7],[24,2,24,3],[26,2,26,3],[27,2,27,3],[38,1,38,8],[1,1,1,8],[2,6,2,8],[3,6,3,8],[4,1,4,8],[5,6,5,8],[6,6,6,8],[7,1,7,8],[8,6,8,8],[9,6,9,8],[13,1,13,8],[0,1,0,8],[36,1,36,5],[2,1,2,5],[3,1,3,5],[5,1,5,5],[6,1,6,5],[8,1,8,5],[9,1,9,5],[11,3,11,5],[12,3,12,5],[10,1,10,8],[11,6,11,8],[12,6,12,8],[25,2,25,3],[21,2,21,3],[22,2,22,3],[13,0,14,0],[34,2,34,3],[35,2,35,3],[31,2,31,3],[32,2,32,3],[33,2,33,3],[28,2,28,3],[29,2,29,3],[30,2,30,3]]}
[]
[]
[null,"UNIDADE ESCOLAR",null,null,null,null,"CÓDIGO INEP"]
[null,{"$f":"Orçamento!$O$4","v":"CENTRO DE ENSINO EM PERÍODO INTEGRAL PROFESSOR PEDRO GOMES"},null,null,null,null,{"$f":"Orçamento!V4","v":52033597}]
[]
[null,"OBRA",null,null,null,null,"CIDADE"]
[null,{"$f":"Orçamento!$O$7","v":"REFORMA"},null,null,null,null,{"$f":"Orçamento!$V$7","v":"GOIÂNIA"}]
[]
[null,"ENDEREÇO",null,null,null,null,"CRE"]
[null,{"$f":"Orçamento!$R$10","v":"AV SERGIPE C/ BENJAMIN CONSTANT S/N, SETOR CAMPINAS, CEP:74550-408"},null,null,null,null,{"$f":"Orçamento!$O$10","v":"GOIÂNIA"}]
[]
[null,"REFERÊNCIA",null,"DATA",null,null,"ÁREA TOTAL CONSTRUÍDA (M²)"]
[null,{"$f":"CONCATENATE(\"AGETOP E SINAPI - \",Orçamento!$W$10)","v":"AGETOP E SINAPI - DESONERADA"},null,{"$f":"Orçamento!$S$7","v":"2020-03-25"},null,null,{"$f":"Orçamento!$S$13","v":5317.06}]
["FILTRO"]
[null,"RESUMO GERAL DO ORÇAMENTO"]
["↓","ITEM","DESCRIÇÃO DOS SERVIÇOS",null,"UNID","QUANT","PREÇO SEM BDI","PREÇO COM BDI","PARTICIP. (%)"]
[{"$f":"IF(E17>0,\"F\",\"\")","v":"F"},"1.",{"$f":"Orçamento!$P332","v":"REFORMA"},null,"UN ",1,{"$f":"IFERROR(Orçamento!S332,\"-\")","v":0},{"$f":"IFERROR(Orçamento!V332,\"\")","v":0},{"$f":"Orçamento!X332","v":100}]
[{"$f":"IF(E18>0,\"F\",\"\")","v":""},"2.",{"$f":"Orçamento!$P333","v":""},null,null,null,{"$f":"IFERROR(Orçamento!S333,\"-\")","v":0},{"$f":"IFERROR(Orçamento!V333,\"\")","v":0},{"$f":"Orçamento!X333","v":0}]
["","3.",{"$f":"Orçamento!$P334","v":""},null,null,null,{"$f":"IFERROR(Orçamento!S334,\"-\")","v":0},{"$f":"IFERROR(Orçamento!V334,\"\")","v":0},{"$f":"Orçamento!X334","v":0}]
["","4.",{"$f":"Orçamento!$P335","v":""},null,null,null,{"$f":"IFERROR(Orçamento!S335,\"-\")","v":0},{"$f":"IFERROR(Orçamento!V335,\"\")","v":0},{"$f":"Orçamento!X335","v":0}]
["","5.",{"$f":"Orçamento!$P336","v":""},null,null,null,{"$f":"IFERROR(Orçamento!S336,\"-\")","v":0},{"$f":"IFERROR(Orçamento!V336,\"\")","v":0},{"$f":"Orçamento!X336","v":0}]
["","6.",{"$f":"Orçamento!$P337","v":""},null,null,null,{"$f":"IFERROR(Orçamento!S337,\"-\")","v":0},{"$f":"IFERROR(Orçamento!V337,\"\")","v":0},{"$f":"Orçamento!X337","v":0}]
["","7.",{"$f":"Orçamento!$P338","v":""},null,null,null,{"$f":"IFERROR(Orçamento!S338,\"-\")","v":0},{"$f":"IFERROR(Orçamento!V338,\"\")","v":0},{"$f":"Orçamento!X338","v":0}]
["","8.",{"$f":"Orçamento!$P339","v":""},null,null,null,{"$f":"IFERROR(Orçamento!S339,\"-\")","v":0},{"$f":"IFERROR(Orçamento!V339,\"\")","v":0},{"$f":"Orçamento!X339","v":0}]
["","9.",{"$f":"Orçamento!$P340","v":""},null,null,null,{"$f":"IFERROR(Orçamento!S340,\"-\")","v":0},{"$f":"IFERROR(Orçamento!V340,\"\")","v":0},{"$f":"Orçamento!X340","v":0}]
["","10.",{"$f":"Orçamento!$P341","v":""},null,null,null,{"$f":"IFERROR(Orçamento!S341,\"-\")","v":0},{"$f":"IFERROR(Orçamento!V341,\"\")","v":0},{"$f":"Orçamento!X341","v":0}]
["","11.",{"$f":"Orçamento!$P342","v":""},null,null,null,{"$f":"IFERROR(Orçamento!S342,\"-\")","v":0},{"$f":"IFERROR(Orçamento!V342,\"\")","v":0},{"$f":"Orçamento!X342","v":0}]
["","12.",{"$f":"Orçamento!$P343","v":""},null,null,null,{"$f":"IFERROR(Orçamento!S343,\"-\")","v":0},{"$f":"IFERROR(Orçamento!V343,\"\")","v":0},{"$f":"Orçamento!X343","v":0}]
["","13.",{"$f":"Orçamento!$P344","v":""},null,null,null,{"$f":"IFERROR(Orçamento!S344,\"-\")","v":0},{"$f":"IFERROR(Orçamento!V344,\"\")","v":0},{"$f":"Orçamento!X344","v":0}]
["","14.",{"$f":"Orçamento!$P345","v":""},null,null,null,{"$f":"IFERROR(Orçamento!S345,\"-\")","v":0},{"$f":"IFERROR(Orçamento!V345,\"\")","v":0},{"$f":"Orçamento!X345","v":0}]
["","15.",{"$f":"Orçamento!$P346","v":""},null,null,null,{"$f":"IFERROR(Orçamento!S346,\"-\")","v":0},{"$f":"IFERROR(Orçamento!V346,\"\")","v":0},{"$f":"Orçamento!X346","v":0}]
["","16.",{"$f":"Orçamento!$P347","v":""},null,null,null,{"$f":"IFERROR(Orçamento!S347,\"-\")","v":0},{"$f":"IFERROR(Orçamento!V347,\"\")","v":0},{"$f":"Orçamento!X347","v":0}]
["","17.",{"$f":"Orçamento!$P348","v":""},null,null,null,{"$f":"IFERROR(Orçamento!S348,\"-\")","v":0},{"$f":"IFERROR(Orçamento!V348,\"\")","v":0},{"$f":"Orçamento!X348","v":0}]
["","18.",{"$f":"Orçamento!$P349","v":""},null,null,null,{"$f":"IFERROR(Orçamento!S349,\"-\")","v":0},{"$f":"IFERROR(Orçamento!V349,\"\")","v":0},{"$f":"Orçamento!X349","v":0}]
["","19.",{"$f":"Orçamento!$P350","v":""},null,null,null,{"$f":"IFERROR(Orçamento!S350,\"-\")","v":0},{"$f":"IFERROR(Orçamento!V350,\"\")","v":0},{"$f":"Orçamento!X350","v":0}]
["","20.",{"$f":"Orçamento!$P351","v":""},null,null,null,{"$f":"IFERROR(Orçamento!S351,\"-\")","v":0},{"$f":"IFERROR(Orçamento!V351,\"\")","v":0},{"$f":"Orçamento!X351","v":0}]
["F","TOTAL GERAL DO ORÇAMENTO (R$)",null,null,null,null,{"$f":"SUM(G17:G36)","v":0},0,{"$f":"SUM(I17:I36)","v":100}]
["F"]
["F"]

{"sheet":"Somatório","index":2,"n_rows":45,"n_cols":6,"rows_kept":45,"cut":false,"hidden":false,"merged":[[0,1,0,5],[14,1,14,5],[2,1,2,3],[2,4,2,5],[3,1,3,3],[3,4,3,5],[5,1,5,3],[5,4,5,5],[6,1,6,3],[6,4,6,5],[8,1,8,3],[8,4,8,5],[1,1,1,5],[4,1,4,5],[7,1,7,5],[10,1,10,5],[9,1,9,3],[9,4,9,5],[11,1,11,2],[11,4,11,5],[12,1,12,2],[12,4,12,5],[13,0,14,0],[42,1,42,2],[44,1,44,5],[47,3,47,5],[48,3,48,5],[13,1,13,5]]}
[]
[]
[null,"UNIDADE ESCOLAR",null,null,"CÓDIGO INEP"]
[null,{"$f":"Orçamento!$O$4","v":"CENTRO DE ENSINO EM PERÍODO INTEGRAL PROFESSOR PEDRO GOMES"},null,null,{"$f":"Orçamento!V4","v":52033597}]
[]
[null,"OBRA",null,null,"CIDADE"]
[null,{"$f":"Orçamento!$O$7","v":"REFORMA"},null,null,{"$f":"Orçamento!$V$7","v":"GOIÂNIA"}]
[]
[null,"ENDEREÇO",null,null,"CRE"]
[null,{"$f":"Orçamento!$R$10","v":"AV SERGIPE C/ BENJAMIN CONSTANT S/N, SETOR CAMPINAS, CEP:74550-408"},null,null,{"$f":"Orçamento!$O$10","v":"GOIÂNIA"}]
[]
[null,"REFERÊNCIA",null,"DATA","ÁREA TOTAL CONSTRUÍDA (M²)"]
[null,{"$f":"CONCATENATE(\"AGETOP E SINAPI - \",Orçamento!$W$10)","v":"AGETOP E SINAPI - DESONERADA"},null,{"$f":"Orçamento!$S$7","v":"2020-03-25"},{"$f":"Orçamento!$S$13","v":5317.06}]
["FILTRO"]
[null,"SOMATÓRIO DE SERVIÇOS"]
["↓","ITEM","DESCRIÇÃO DOS SERVIÇOS","PREÇO SEM BDI (R$)","PREÇO COM BDI (R$)","PARTIC.  ( % )"]
[{"$f":"IF(D17>0,\"F\",\"\")","v":""},"a.",{"$f":"Orçamento!P298","v":"SERVIÇOS PRELIMINARES"},{"$f":"Orçamento!S298","v":0},{"$f":"Orçamento!V298","v":0},{"$f":"Orçamento!X298","v":0}]
[{"$f":"IF(D18>0,\"F\",\"\")","v":""},"b.",{"$f":"Orçamento!P299","v":"TRANSPORTES"},{"$f":"Orçamento!S299","v":0},{"$f":"Orçamento!V299","v":0},{"$f":"Orçamento!X299","v":0}]
["","c.",{"$f":"Orçamento!P300","v":"SERVIÇO EM TERRA"},{"$f":"Orçamento!S300","v":0},{"$f":"Orçamento!V300","v":0},{"$f":"Orçamento!X300","v":0}]
["","d.",{"$f":"Orçamento!P301","v":"FUNDAÇÕES E SONDAGENS"},{"$f":"Orçamento!S301","v":0},{"$f":"Orçamento!V301","v":0},{"$f":"Orçamento!X301","v":0}]
["","e.",{"$f":"Orçamento!P302","v":"ESTRUTURA"},{"$f":"Orçamento!S302","v":0},{"$f":"Orçamento!V302","v":0},{"$f":"Orçamento!X302","v":0}]
["","f.",{"$f":"Orçamento!P303","v":"INSTALAÇÕES ELÉTRICAS"},{"$f":"Orçamento!S303","v":0},{"$f":"Orçamento!V303","v":0},{"$f":"Orçamento!X303","v":0}]
["","g.",{"$f":"Orçamento!P304","v":"INSTALAÇÕES HIDROSSANITÁRIAS"},{"$f":"Orçamento!S304","v":0},{"$f":"Orçamento!V304","v":0},{"$f":"Orçamento!X304","v":0}]
["","h.",{"$f":"Orçamento!P305","v":"INSTALAÇÕES ESPECIAIS"},{"$f":"Orçamento!S305","v":0},{"$f":"Orçamento!V305","v":0},{"$f":"Orçamento!X305","v":0}]
["","i.",{"$f":"Orçamento!P306","v":"ALVENARIAS E DIVISÓRIAS"},{"$f":"Orçamento!S306","v":0},{"$f":"Orçamento!V306","v":0},{"$f":"Orçamento!X306","v":0}]
["","j.",{"$f":"Orçamento!P307","v":"ALVENARIA AUTO-PORTANTE"},{"$f":"Orçamento!S307","v":0},{"$f":"Orçamento!V307","v":0},{"$f":"Orçamento!X307","v":0}]
["","k.",{"$f":"Orçamento!P308","v":"IMPERMEABILIZAÇÃO"},{"$f":"Orçamento!S308","v":0},{"$f":"Orçamento!V308","v":0},{"$f":"Orçamento!X308","v":0}]
["","l.",{"$f":"Orçamento!P309","v":"ISOLAMENTO TÉRMICO E ACÚSTICO"},{"$f":"Orçamento!S309","v":0},{"$f":"Orçamento!V309","v":0},{"$f":"Orçamento!X309","v":0}]
["","m.",{"$f":"Orçamento!P310","v":"ESTRUTURA DE MADEIRA"},{"$f":"Orçamento!S310","v":0},{"$f":"Orçamento!V310","v":0},{"$f":"Orçamento!X310","v":0}]
["","n.",{"$f":"Orçamento!P311","v":"ESTRUTURAS METÁLICAS"},{"$f":"Orçamento!S311","v":0},{"$f":"Orçamento!V311","v":0},{"$f":"Orçamento!X311","v":0}]
["","o.",{"$f":"Orçamento!P312","v":"COBERTURAS"},{"$f":"Orçamento!S312","v":0},{"$f":"Orçamento!V312","v":0},{"$f":"Orçamento!X312","v":0}]
["","p.",{"$f":"Orçamento!P313","v":"ESQUADRIAS DE MADEIRA"},{"$f":"Orçamento!S313","v":0},{"$f":"Orçamento!V313","v":0},{"$f":"Orçamento!X313","v":0}]
["","q.",{"$f":"Orçamento!P314","v":"ESQUADRIAS METÁLICAS"},{"$f":"Orçamento!S314","v":0},{"$f":"Orçamento!V314","v":0},{"$f":"Orçamento!X314","v":0}]
["","r.",{"$f":"Orçamento!P315","v":"VIDROS"},{"$f":"Orçamento!S315","v":0},{"$f":"Orçamento!V315","v":0},{"$f":"Orçamento!X315","v":0}]
["","s.",{"$f":"Orçamento!P316","v":"REVESTIMENTO DE PAREDE"},{"$f":"Orçamento!S316","v":0},{"$f":"Orçamento!V316","v":0},{"$f":"Orçamento!X316","v":0}]
["","t.",{"$f":"Orçamento!P317","v":"FORROS"},{"$f":"Orçamento!S317","v":0},{"$f":"Orçamento!V317","v":0},{"$f":"Orçamento!X317","v":0}]
["","u.",{"$f":"Orçamento!P318","v":"REVESTIMENTO DE PISO"},{"$f":"Orçamento!S318","v":0},{"$f":"Orçamento!V318","v":0},{"$f":"Orçamento!X318","v":0}]
["","v.",{"$f":"Orçamento!P319","v":"FERRAGENS"},{"$f":"Orçamento!S319","v":0},{"$f":"Orçamento!V319","v":0},{"$f":"Orçamento!X319","v":0}]
["","w.",{"$f":"Orçamento!P320","v":"MARCENARIA"},{"$f":"Orçamento!S320","v":0},{"$f":"Orçamento!V320","v":0},{"$f":"Orçamento!X320","v":0}]
["","x.",{"$f":"Orçamento!P321","v":"ADMINISTRAÇÃO"},{"$f":"Orçamento!S321","v":0},{"$f":"Orçamento!V321","v":0},{"$f":"Orçamento!X321","v":0}]
["","y.",{"$f":"Orçamento!P322","v":"PINTURA"},{"$f":"Orçamento!S322","v":0},{"$f":"Orçamento!V322","v":0},{"$f":"Orçamento!X322","v":0}]
["","z.",{"$f":"Orçamento!P323","v":"DIVERSOS"},{"$f":"Orçamento!S323","v":0},{"$f":"Orçamento!V323","v":0},{"$f":"Orçamento!X323","v":0}]
["F","TOTAL GERAL DO ORÇAMENTO",null,{"$f":"SUM(D17:D42)","v":0},{"$f":"SUM(E17:E42)","v":0},{"$f":"SUM(F17:F42)","v":0}]
[]
[null,"(*) Para itens da AGETOP, os vidros não estão inclusos nas esquadrias e já foram considerados os custos de contramarco para as esquadrias de alumínio;"]

{"sheet":"Cronog_60_Dias","index":3,"n_rows":99,"n_cols":14,"rows_kept":99,"cut":false,"hidden":false,"merged":[[10,1,10,13],[9,8,9,13],[8,8,8,13],[3,8,3,13],[6,8,6,13],[5,8,5,13],[3,1,3,7],[56,4,58,4],[29,3,31,3],[35,1,37,2],[35,4,37,4],[50,3,52,3],[53,3,55,3],[12,13,13,13],[13,1,13,2],[13,5,13,8],[13,9,13,12],[12,3,13,3],[12,9,12,12],[14,1,16,2],[12,5,12,8],[17,1,19,2],[17,4,19,4],[17,5,17,8],[56,1,58,2],[68,4,70,4],[44,3,46,3],[62,1,64,2],[62,4,64,4],[38,1,40,2],[38,4,40,4],[59,3,61,3],[44,1,46,2],[44,4,46,4],[53,1,55,2],[50,1,52,2],[50,4,52,4],[20,1,22,2],[20,4,22,4],[20,5,20,8],[20,9,20,12],[22,5,22,8],[22,9,22,12],[20,3,22,3],[83,3,85,3],[53,4,55,4],[59,1,61,2],[59,4,61,4],[74,1,76,2],[77,1,79,2],[77,4,79,4],[80,1,82,2],[65,1,67,2],[68,3,70,3],[62,3,64,3],[68,1,70,2],[56,3,58,3],[65,4,67,4],[71,3,73,3],[74,3,76,3],[74,4,76,4],[14,3,16,3],[17,3,19,3],[14,4,16,4],[14,5,14,8],[14,9,14,12],[16,5,16,8],[16,9,16,12],[23,9,23,12],[25,5,25,8],[25,9,25,12],[17,9,17,12],[19,5,19,8],[19,9,19,12],[26,1,28,2],[26,4,28,4],[26,5,26,8],[26,9,26,12],[28,5,28,8],[28,9,28,12],[23,3,25,3],[23,1,25,2],[23,4,25,4],[23,5,23,8],[26,3,28,3],[29,9,29,12],[31,5,31,8],[31,9,31,12],[32,1,34,2],[32,4,34,4],[32,5,32,8],[32,9,32,12],[34,5,34,8],[34,9,34,12],[32,3,34,3],[29,5,29,8],[29,1,31,2],[29,4,31,4],[35,9,35,12],[37,5,37,8],[37,9,37,12],[35,3,37,3],[40,9,40,12],[38,3,40,3],[38,9,38,12],[41,1,43,2],[41,4,43,4],[41,5,41,8],[41,9,41,12],[43,5,43,8],[43,9,43,12],[41,3,43,3],[35,5,35,8],[38,5,38,8],[40,5,40,8],[44,9,44,12],[46,5,46,8],[46,9,46,12],[47,1,49,2],[47,4,49,4],[47,5,47,8],[47,9,47,12],[49,5,49,8],[49,9,49,12],[44,5,44,8],[47,3,49,3],[53,9,53,12],[55,5,55,8],[55,9,55,12],[50,5,50,8],[50,9,50,12],[52,5,52,8],[52,9,52,12],[56,9,56,12],[58,5,58,8],[58,9,58,12],[53,5,53,8],[56,5,56,8],[68,5,68,8],[65,5,65,8],[65,9,65,12],[67,5,67,8],[67,9,67,12],[65,3,67,3],[62,9,62,12],[64,5,64,8],[64,9,64,12],[62,5,62,8],[95,1,95,2],[95,5,95,8],[95,9,95,12],[97,1,97,4],[98,1,98,13],[86,9,86,12],[88,5,88,8],[88,9,88,12],[85,5,85,8],[85,9,85,12],[89,1,91,2],[89,4,91,4],[89,5,89,8],[89,9,89,12],[91,5,91,8],[91,9,91,12],[89,3,91,3],[86,4,88,4],[86,5,86,8],[86,3,88,3],[83,1,85,2],[83,4,85,4],[83,5,83,8],[83,9,83,12],[94,1,94,2],[94,5,94,8],[94,9,94,12],[76,5,76,8],[76,9,76,12],[77,5,77,8],[77,9,77,12],[79,5,79,8],[79,9,79,12],[80,5,80,8],[80,9,80,12],[82,5,82,8],[82,9,82,12],[77,3,79,3],[80,3,82,3],[86,1,88,2],[80,4,82,4],[12,0,13,0],[9,0,11,0],[11,1,11,13],[92,1,92,2],[92,5,92,8],[92,9,92,12],[93,1,93,2],[93,5,93,8],[93,9,93,12],[74,9,74,12],[74,5,74,8],[68,9,68,12],[70,5,70,8],[70,9,70,12],[59,5,59,8],[71,1,73,2],[71,4,73,4],[71,5,71,8],[71,9,71,12],[73,5,73,8],[73,9,73,12],[59,9,59,12],[61,5,61,8],[61,9,61,12],[2,1,2,7],[5,1,5,7],[6,1,6,7],[8,1,8,7],[9,1,9,7],[4,1,4,13],[7,1,7,13],[0,1,0,13],[1,1,1,13],[2,8,2,13]]}
[]
[]
[null,"UNIDADE ESCOLAR",null,null,null,null,null,null,"PRAZO"]
[null,{"$f":"Orçamento!$O$4","v":"CENTRO DE ENSINO EM PERÍODO INTEGRAL PROFESSOR PEDRO GOMES"},null,null,null,null,null,null,"60 DIAS CORRIDOS"]
[]
[null,"OBRA",null,null,null,null,null,null,"DATA"]
[null,{"$f":"Orçamento!$O$7","v":"REFORMA"},null,null,null,null,null,null,{"$f":"Orçamento!$S$7","v":"2020-03-25"}]
[]
[null,"LOCAL",null,null,null,null,null,null,"ÁREA TOTAL CONSTRUÍDA (M²)"]
["FILTRO",{"$f":"Orçamento!$V$7","v":"GOIÂNIA"},null,null,null,null,null,null,{"$f":"Orçamento!$S$13","v":5317.06}]
[]
[null,"CRONOGRAMA - FÍSICO FINANCEIRO"]
["↓","CUSTO TOTAL:",{"$f":"D93","v":0},"VALOR","Dias:",30,null,null,null,60,null,null,null,"TOTAL"]
[null,"DESCRIÇÃO DOS SERVIÇOS",null,null,"%","1ª PARCELA",null,null,null,"2ª PARCELA"]
[{"$f":"IF(D15>0,\"F\",\"\")","v":""},"SERVIÇOS PRELIMINARES",null,{"$f":"Orçamento!V298","v":0},{"$f":"Orçamento!X298","v":0},{"$f":"ROUND(F17*$D$15,2)","v":0},null,null,null,{"$f":"ROUND(J17*$D$15,2)","v":0},null,null,null,{"$f":"SUM(F15:M15)","v":0}]
[{"$f":"IF(A15=\"F\",A15,\"\")","v":""}]
[{"$f":"IF(A16=\"F\",A16,\"\")","v":""},null,null,null,null,1,null,null,null,{"$f":"1-F17","v":0},null,null,null,{"$f":"IFERROR(E15/100,\"\")","v":0}]
[{"$f":"IF(D18>0,\"F\",\"\")","v":""},"TRANSPORTES",null,{"$f":"Orçamento!V299","v":0},{"$f":"Orçamento!X299","v":0},{"$f":"ROUND(F20*$D$18,2)","v":0},null,null,null,{"$f":"ROUND(J20*$D$18,2)","v":0},null,null,null,{"$f":"SUM(F18:M18)","v":0}]
[{"$f":"IF(A18=\"F\",A18,\"\")","v":""}]
[{"$f":"IF(A19=\"F\",A19,\"\")","v":""},null,null,null,null,0.48,null,null,null,{"$f":"1-F20","v":0.52},null,null,null,{"$f":"IFERROR(E18/100,\"\")","v":0}]
[{"$f":"IF(D21>0,\"F\",\"\")","v":""},"SERVIÇO EM TERRA",null,{"$f":"Orçamento!V300","v":0},{"$f":"Orçamento!X300","v":0},{"$f":"ROUND(F23*$D$21,2)","v":0},null,null,null,{"$f":"ROUND(J23*$D$21,2)","v":0},null,null,null,{"$f":"SUM(F21:M21)","v":0}]
[{"$f":"IF(A21=\"F\",A21,\"\")","v":""}]
[{"$f":"IF(A22=\"F\",A22,\"\")","v":""},null,null,null,null,1,null,null,null,{"$f":"1-F23","v":0},null,null,null,{"$f":"IFERROR(E21/100,\"\")","v":0}]
[{"$f":"IF(D24>0,\"F\",\"\")","v":""},"FUNDAÇÕES E SONDAGENS",null,{"$f":"Orçamento!V301","v":0},{"$f":"Orçamento!X301","v":0},{"$f":"ROUND(F26*$D$24,2)","v":0},null,null,null,{"$f":"ROUND(J26*$D$24,2)","v":0},null,null,null,{"$f":"SUM(F24:M24)","v":0}]
[{"$f":"IF(A24=\"F\",A24,\"\")","v":""}]
[{"$f":"IF(A25=\"F\",A25,\"\")","v":""},null,null,null,null,1,null,null,null,{"$f":"1-F26","v":0},null,null,null,{"$f":"IFERROR(E24/100,\"\")","v":0}]
[{"$f":"IF(D27>0,\"F\",\"\")","v":""},"ESTRUTURA",null,{"$f":"Orçamento!V302","v":0},{"$f":"Orçamento!X302","v":0},{"$f":"ROUND(F29*$D$27,2)","v":0},null,null,null,{"$f":"ROUND(J29*$D$27,2)","v":0},null,null,null,{"$f":"SUM(F27:M27)","v":0}]
[{"$f":"IF(A27=\"F\",A27,\"\")","v":""}]
[{"$f":"IF(A28=\"F\",A28,\"\")","v":""},null,null,null,null,0.49,null,null,null,{"$f":"1-F29","v":0.51},null,null,null,{"$f":"IFERROR(E27/100,\"\")","v":0}]
[{"$f":"IF(D30>0,\"F\",\"\")","v":""},"INST.ELET/TELEFÔNICA/CABEAMENTO ESTRUTURADO",null,{"$f":"Orçamento!V303","v":0},{"$f":"Orçamento!X303","v":0},{"$f":"ROUND(F32*$D$30,2)","v":0},null,null,null,{"$f":"ROUND(J32*$D$30,2)","v":0},null,null,null,{"$f":"SUM(F30:M30)","v":0}]
[{"$f":"IF(A30=\"F\",A30,\"\")","v":""}]
[{"$f":"IF(A31=\"F\",A31,\"\")","v":""},null,null,null,null,0.4,null,null,null,{"$f":"1-F32","v":0.6},null,null,null,{"$f":"IFERROR(E30/100,\"\")","v":0}]
[{"$f":"IF(D33>0,\"F\",\"\")","v":""},"INSTALAÇÕES HIDROSSANITÁRIAS",null,{"$f":"Orçamento!V304","v":0},{"$f":"Orçamento!X304","v":0},{"$f":"ROUND(F35*$D$33,2)","v":0},null,null,null,{"$f":"ROUND(J35*$D$33,2)","v":0},null,null,null,{"$f":"SUM(F33:M33)","v":0}]
[{"$f":"IF(A33=\"F\",A33,\"\")","v":""}]
[{"$f":"IF(A34=\"F\",A34,\"\")","v":""},null,null,null,null,0.48,null,null,null,{"$f":"1-F35","v":0.52},null,null,null,{"$f":"IFERROR(E33/100,\"\")","v":0}]
[{"$f":"IF(D36>0,\"F\",\"\")","v":""},"INSTALAÇÕES ESPECIAIS",null,{"$f":"Orçamento!V305","v":0},{"$f":"Orçamento!X305","v":0},{"$f":"ROUND(F38*$D$36,2)","v":0},null,null,null,{"$f":"ROUND(J38*$D$36,2)","v":0},null,null,null,{"$f":"SUM(F36:M36)","v":0}]
[{"$f":"IF(A36=\"F\",A36,\"\")","v":""}]
[{"$f":"IF(A37=\"F\",A37,\"\")","v":""},null,null,null,null,1,null,null,null,{"$f":"1-F38","v":0},null,null,null,{"$f":"IFERROR(E36/100,\"\")","v":0}]
[{"$f":"IF(D39>0,\"F\",\"\")","v":""},"ALVENARIA E DIVISÓRIAS",null,{"$f":"Orçamento!V306","v":0},{"$f":"Orçamento!X306","v":0},{"$f":"ROUND(F41*$D$39,2)","v":0},null,null,null,{"$f":"ROUND(J41*$D$39,2)","v":0},null,null,null,{"$f":"SUM(F39:M39)","v":0}]
[{"$f":"IF(A39=\"F\",A39,\"\")","v":""}]
[{"$f":"IF(A40=\"F\",A40,\"\")","v":""},null,null,null,null,1,null,null,null,{"$f":"1-F41","v":0},null,null,null,{"$f":"IFERROR(E39/100,\"\")","v":0}]
[{"$f":"IF(D42>0,\"F\",\"\")","v":""},"ALVENARIA AUTO-PORTANTE",null,{"$f":"Orçamento!V307","v":0},{"$f":"Orçamento!X307","v":0},{"$f":"ROUND(F44*$D$42,2)","v":0},null,null,null,{"$f":"ROUND(J44*$D$42,2)","v":0},null,null,null,{"$f":"SUM(F42:M42)","v":0}]
[{"$f":"IF(A42=\"F\",A42,\"\")","v":""}]
[{"$f":"IF(A43=\"F\",A43,\"\")","v":""},null,null,null,null,1,null,null,null,{"$f":"1-F44","v":0},null,null,null,{"$f":"IFERROR(E42/100,\"\")","v":0}]
[{"$f":"IF(D45>0,\"F\",\"\")","v":""},"IMPERMEABILIZAÇÃO",null,{"$f":"Orçamento!V308","v":0},{"$f":"Orçamento!X308","v":0},{"$f":"ROUND(F47*$D$45,2)","v":0},null,null,null,{"$f":"ROUND(J47*$D$45,2)","v":0},null,null,null,{"$f":"SUM(F45:M45)","v":0}]
[{"$f":"IF(A45=\"F\",A45,\"\")","v":""}]
[{"$f":"IF(A46=\"F\",A46,\"\")","v":""},null,null,null,null,1,null,null,null,{"$f":"1-F47","v":0},null,null,null,{"$f":"IFERROR(E45/100,\"\")","v":0}]
[{"$f":"IF(D48>0,\"F\",\"\")","v":""},"ISOLAMENTO TÉRMICO E ACÚSTICO",null,{"$f":"Orçamento!V309","v":0},{"$f":"Orçamento!X309","v":0},{"$f":"ROUND(F50*$D$48,2)","v":0},null,null,null,{"$f":"ROUND(J50*$D$48,2)","v":0},null,null,null,{"$f":"SUM(F48:M48)","v":0}]
[{"$f":"IF(A48=\"F\",A48,\"\")","v":""}]
[{"$f":"IF(A49=\"F\",A49,\"\")","v":""},null,null,null,null,0.5,null,null,null,{"$f":"1-F50","v":0.5},null,null,null,{"$f":"IFERROR(E48/100,\"\")","v":0}]
[{"$f":"IF(D51>0,\"F\",\"\")","v":""},"ESTRUTURA DE MADEIRA",null,{"$f":"Orçamento!V310","v":0},{"$f":"Orçamento!X310","v":0},{"$f":"ROUND(F53*$D$51,2)","v":0},null,null,null,{"$f":"ROUND(J53*$D$51,2)","v":0},null,null,null,{"$f":"SUM(F51:M51)","v":0}]
[{"$f":"IF(A51=\"F\",A51,\"\")","v":""}]
[{"$f":"IF(A52=\"F\",A52,\"\")","v":""},null,null,null,null,0.4,null,null,null,{"$f":"1-F53","v":0.6},null,null,null,{"$f":"IFERROR(E51/100,\"\")","v":0}]
[{"$f":"IF(D54>0,\"F\",\"\")","v":""},"ESTRUTURA METÁLICA",null,{"$f":"Orçamento!V311","v":0},{"$f":"Orçamento!X311","v":0},{"$f":"ROUND(F56*$D$54,2)","v":0},null,null,null,{"$f":"ROUND(J56*$D$54,2)","v":0},null,null,null,{"$f":"SUM(F54:M54)","v":0}]
[{"$f":"IF(A54=\"F\",A54,\"\")","v":""}]
[{"$f":"IF(A55=\"F\",A55,\"\")","v":""},null,null,null,null,0.35,null,null,null,{"$f":"1-F56","v":0.65},null,null,null,{"$f":"IFERROR(E54/100,\"\")","v":0}]
[{"$f":"IF(D57>0,\"F\",\"\")","v":""},"COBERTURAS",null,{"$f":"Orçamento!V312","v":0},{"$f":"Orçamento!X312","v":0},{"$f":"ROUND(F59*$D$57,2)","v":0},null,null,null,{"$f":"ROUND(J59*$D$57,2)","v":0},null,null,null,{"$f":"SUM(F57:M57)","v":0}]
[{"$f":"IF(A57=\"F\",A57,\"\")","v":""}]
[{"$f":"IF(A58=\"F\",A58,\"\")","v":""},null,null,null,null,0,null,null,null,{"$f":"1-F59","v":1},null,null,null,{"$f":"IFERROR(E57/100,\"\")","v":0}]
[{"$f":"IF(D60>0,\"F\",\"\")","v":""},"ESQUADRIAS DE MADEIRA",null,{"$f":"Orçamento!V313","v":0},{"$f":"Orçamento!X313","v":0},{"$f":"ROUND(F62*$D$60,2)","v":0},null,null,null,{"$f":"ROUND(J62*$D$60,2)","v":0},null,null,null,{"$f":"SUM(F60:M60)","v":0}]
[{"$f":"IF(A60=\"F\",A60,\"\")","v":""}]
[{"$f":"IF(A61=\"F\",A61,\"\")","v":""},null,null,null,null,0.54,null,null,null,{"$f":"1-F62","v":0.45999999999999996},null,null,null,{"$f":"IFERROR(E60/100,\"\")","v":0}]
[{"$f":"IF(D63>0,\"F\",\"\")","v":""},"ESQUADRIAS METÁLICAS",null,{"$f":"Orçamento!V314","v":0},{"$f":"Orçamento!X314","v":0},{"$f":"ROUND(F65*$D$63,2)","v":0},null,null,null,{"$f":"ROUND(J65*$D$63,2)","v":0},null,null,null,{"$f":"SUM(F63:M63)","v":0}]
[{"$f":"IF(A63=\"F\",A63,\"\")","v":""}]
[{"$f":"IF(A64=\"F\",A64,\"\")","v":""},null,null,null,null,0.49,null,null,null,{"$f":"1-F65","v":0.51},null,null,null,{"$f":"IFERROR(E63/100,\"\")","v":0}]
[{"$f":"IF(D66>0,\"F\",\"\")","v":""},"VIDROS",null,{"$f":"Orçamento!V315","v":0},{"$f":"Orçamento!X315","v":0},{"$f":"ROUND(F68*$D$66,2)","v":0},null,null,null,{"$f":"ROUND(J68*$D$66,2)","v":0},null,null,null,{"$f":"SUM(F66:M66)","v":0}]
[{"$f":"IF(A66=\"F\",A66,\"\")","v":""}]
[{"$f":"IF(A67=\"F\",A67,\"\")","v":""},null,null,null,null,0,null,null,null,{"$f":"1-F68","v":1},null,null,null,{"$f":"IFERROR(E66/100,\"\")","v":0}]
[{"$f":"IF(D69>0,\"F\",\"\")","v":""},"REVESTIMENTO DE PAREDE",null,{"$f":"Orçamento!V316","v":0},{"$f":"Orçamento!X316","v":0},{"$f":"ROUND(F71*$D$69,2)","v":0},null,null,null,{"$f":"ROUND(J71*$D$69,2)","v":0},null,null,null,{"$f":"SUM(F69:M69)","v":0}]
[{"$f":"IF(A69=\"F\",A69,\"\")","v":""}]
[{"$f":"IF(A70=\"F\",A70,\"\")","v":""},null,null,null,null,0.32,null,null,null,{"$f":"1-F71","v":0.67999999999999994},null,null,null,{"$f":"IFERROR(E69/100,\"\")","v":0}]
[{"$f":"IF(D72>0,\"F\",\"\")","v":""},"FORROS",null,{"$f":"Orçamento!V317","v":0},{"$f":"Orçamento!X317","v":0},{"$f":"ROUND(F74*$D$72,2)","v":0},null,null,null,{"$f":"ROUND(J74*$D$72,2)","v":0},null,null,null,{"$f":"SUM(F72:M72)","v":0}]
[{"$f":"IF(A72=\"F\",A72,\"\")","v":""}]
[{"$f":"IF(A73=\"F\",A73,\"\")","v":""},null,null,null,null,0.24,null,null,null,{"$f":"1-F74","v":0.76},null,null,null,{"$f":"IFERROR(E72/100,\"\")","v":0}]
[{"$f":"IF(D75>0,\"F\",\"\")","v":""},"REVESTIMENTO DE PISO",null,{"$f":"Orçamento!V318","v":0},{"$f":"Orçamento!X318","v":0},{"$f":"ROUND(F77*$D$75,2)","v":0},null,null,null,{"$f":"ROUND(J77*$D$75,2)","v":0},null,null,null,{"$f":"SUM(F75:M75)","v":0}]
[{"$f":"IF(A75=\"F\",A75,\"\")","v":""}]
[{"$f":"IF(A76=\"F\",A76,\"\")","v":""},null,null,null,null,0.49,null,null,null,{"$f":"1-F77","v":0.51},null,null,null,{"$f":"IFERROR(E75/100,\"\")","v":0}]
[{"$f":"IF(D78>0,\"F\",\"\")","v":""},"FERRAGENS",null,{"$f":"Orçamento!V319","v":0},{"$f":"Orçamento!X319","v":0},{"$f":"ROUND(F80*$D$78,2)","v":0},null,null,null,{"$f":"ROUND(J80*$D$78,2)","v":0},null,null,null,{"$f":"SUM(F78:M78)","v":0}]
[{"$f":"IF(A78=\"F\",A78,\"\")","v":""}]
[{"$f":"IF(A79=\"F\",A79,\"\")","v":""},null,null,null,null,0,null,null,null,{"$f":"1-F80","v":1},null,null,null,{"$f":"IFERROR(E78/100,\"\")","v":0}]
[{"$f":"IF(D81>0,\"F\",\"\")","v":""},"MARCENARIA",null,{"$f":"Orçamento!V320","v":0},{"$f":"Orçamento!X320","v":0},{"$f":"ROUND(F83*$D$81,2)","v":0},null,null,null,{"$f":"ROUND(J83*$D$81,2)","v":0},null,null,null,{"$f":"SUM(F81:M81)","v":0}]
[{"$f":"IF(A81=\"F\",A81,\"\")","v":""}]
[{"$f":"IF(A82=\"F\",A82,\"\")","v":""},null,null,null,null,0.4,null,null,null,{"$f":"1-F83","v":0.6},null,null,null,{"$f":"IFERROR(E81/100,\"\")","v":0}]
[{"$f":"IF(D84>0,\"F\",\"\")","v":""},"ADMINISTRAÇÃO - MENSALISTAS",null,{"$f":"Orçamento!V321","v":0},{"$f":"Orçamento!X321","v":0},{"$f":"ROUND(F86*$D$84,2)","v":0},null,null,null,{"$f":"ROUND(J86*$D$84,2)","v":0},null,null,null,{"$f":"SUM(F84:M84)","v":0}]
[{"$f":"IF(A84=\"F\",A84,\"\")","v":""}]
[{"$f":"IF(A85=\"F\",A85,\"\")","v":""},null,null,null,null,0.49,null,null,null,{"$f":"1-F86","v":0.51},null,null,null,{"$f":"IFERROR(E84/100,\"\")","v":0}]
[{"$f":"IF(D87>0,\"F\",\"\")","v":""},"PINTURA",null,{"$f":"Orçamento!V322","v":0},{"$f":"Orçamento!X322","v":0},{"$f":"ROUND(F89*$D$87,2)","v":0},null,null,null,{"$f":"ROUND(J89*$D$87,2)","v":0},null,null,null,{"$f":"SUM(F87:M87)","v":0}]
[{"$f":"IF(A87=\"F\",A87,\"\")","v":""}]
[{"$f":"IF(A88=\"F\",A88,\"\")","v":""},null,null,null,null,0,null,null,null,{"$f":"1-F89","v":1},null,null,null,{"$f":"IFERROR(E87/100,\"\")","v":0}]
[{"$f":"IF(D90>0,\"F\",\"\")","v":""},"DIVERSOS",null,{"$f":"Orçamento!V323","v":0},{"$f":"Orçamento!X323","v":0},{"$f":"ROUND(F92*$D$90,2)","v":0},null,null,null,{"$f":"ROUND(J92*$D$90,2)","v":0},null,null,null,{"$f":"SUM(F90:M90)","v":0}]
[{"$f":"IF(A90=\"F\",A90,\"\")","v":""}]
[{"$f":"IF(A91=\"F\",A91,\"\")","v":""},null,null,null,null,0.46,null,null,null,{"$f":"1-F92","v":0.54},null,null,null,{"$f":"IFERROR(E90/100,\"\")","v":0}]
["F","CUSTO DO ORÇAMENTO",null,{"$f":"SUM(D15:D92)","v":0},{"$f":"SUM(E15:E92)","v":0},{"$f":"F15+F18+F21+F24+F27+F30+F33+F36+F39+F42+F45+F48+F51+F54+F57+F60+F63+F66+F69+F72+F75+F78+F81+F84+F87+F90","v":0},null,null,null,{"$f":"J15+J18+J21+J24+J27+J30+J33+J36+J39+J42+J45+J48+J51+J54+J57+J60+J63+J66+J69+J72+J75+J78+J81+J84+J87+J90","v":0},null,null,null,{"$f":"N15+N18+N21+N24+N27+N30+N33+N36+N39+N42+N45+N48+N51+N54+N57+N60+N63+N66+N69+N72+N75+N78+N81+N84+N87+N90","v":0}]
["F","PERCENTUAIS:",null,null,null,{"$f":"IFERROR(F93/D93,\"\")","v":""},null,null,null,{"$f":"IFERROR(J93/D93,\"\")","v":""},null,null,null,{"$f":"SUM(F94:M94)","v":0}]
["F","TOTAIS ACUMULADOS:",null,null,null,{"$f":"F93","v":0},null,null,null,{"$f":"F95+J93","v":0}]
["F","PERCENTUAIS  ACUMULADOS:",null,null,null,{"$f":"F94","v":""},null,null,null,{"$f":"IFERROR(F96+J94,\"\")","v":""}]
["F"]
["F","OBSERVAÇÕES:"]
["F","Os pagamentos somente poderão ser efetuados mediante medição e atesto pelos técnicos da Secretaria da Educação. "]

{"sheet":"Composição BDI","index":4,"n_rows":45,"n_cols":9,"rows_kept":45,"cut":false,"hidden":false,"merged":[[18,5,18,8],[17,0,17,3],[16,0,16,3],[44,0,44,3],[42,0,42,3],[43,0,43,3],[18,0,18,3],[36,0,36,3],[39,0,39,3],[38,0,38,3],[40,0,40,3],[29,0,29,2],[32,0,32,3],[33,0,33,3],[34,0,34,3],[35,0,35,3],[0,0,0,3],[1,0,1,3],[4,0,4,3],[7,0,7,3],[10,0,10,3],[2,0,2,3],[3,0,3,3],[5,0,5,3],[6,0,6,3],[8,0,8,3],[9,0,9,3],[11,0,11,3],[12,0,12,3],[14,0,14,3],[15,0,15,3],[13,0,13,3]]}
[]
[]
["UNIDADE ESCOLAR"]
[{"$f":"Orçamento!$O$4","v":"CENTRO DE ENSINO EM PERÍODO INTEGRAL PROFESSOR PEDRO GOMES"}]
[]
["OBRA"]
[{"$f":"Orçamento!$O$7","v":"REFORMA"}]
[]
["ENDEREÇO"]
[{"$f":"Orçamento!$R$10","v":"AV SERGIPE C/ BENJAMIN CONSTANT S/N, SETOR CAMPINAS, CEP:74550-408"}]
[]
["CIDADE"]
[{"$f":"Orçamento!$V$7","v":"GOIÂNIA"}]
[]
["CRE"]
[{"$f":"Orçamento!$O$10","v":"GOIÂNIA"}]
[]
["DETALHAMENTO DA COMPOSIÇÃO DE BDI"]
["COMPOSIÇÃO BDI PARA OBRAS CIVIS",null,null,null,null,"BDI CONSTRUÇÃO E REFORMA"]
["DESCRIÇÃO","COEF.","TAXA % (a.m)","% no preço de venda",null,"Situação","1º Quartil","Médio","3º Quartil"]
["1) COFINS",1,0.03,{"$f":"C21","v":0.03},null,{"$f":"IF(OR(C21<G21,C21>I21),\"FORA DO INTERVALO\",\"OK\")","v":"OK"},0.03,0.03,0.03]
["2) PIS",1,6.4999999999999997E-3,{"$f":"C22","v":6.4999999999999997E-3},null,{"$f":"IF(OR(C22<G22,C22>I22),\"FORA DO INTERVALO\",\"OK\")","v":"OK"},6.4999999999999997E-3,6.4999999999999997E-3,6.4999999999999997E-3]
["3) ISSQN",1,0.03,{"$f":"C23*B23","v":0.03},null,"OK",0.02,3.5000000000000003E-2,0.05]
["4) CPRB",1,4.4999999999999998E-2,{"$f":"C24","v":4.4999999999999998E-2},null,"OK",4.4999999999999998E-2,4.4999999999999998E-2,4.4999999999999998E-2]
["5) Administração Central",1,0.04,0.04,null,"OK",0.03,0.04,5.5E-2]
["6) Despesas Financeiras",1,5.5999999999999999E-3,5.5999999999999999E-3,null,"FORA DO INTERVALO",5.8999999999999999E-3,1.23E-2,1.3899999999999999E-2]
["7) Seguros + Garantias",1,1.1999999999999999E-3,1.1999999999999999E-3,null,"FORA DO INTERVALO",8.0000000000000002E-3,8.0000000000000002E-3,0.01]
["8) Risco",1,9.7000000000000003E-3,9.7000000000000003E-3,null,"OK",9.7000000000000003E-3,1.2699999999999999E-2,1.2699999999999999E-2]
["9) Lucro",1,7.1999999999999995E-2,7.1999999999999995E-2,null,"OK",6.1600000000000002E-2,7.3999999999999996E-2,8.9599999999999999E-2]
["BDI - FINAL",null,null,{"$f":"(((1+D25+D27+D28)*(1+D26)*(1+D29))/(1-(D21+D22+D23+D24))-1)","v":0.27504058849746826},null,{"$f":"IF(OR(D30<G30,D30>I30),\"FORA DO INTERVALO\",\"OK\")","v":"FORA DO INTERVALO"},0.2034,0.22120000000000001,0.25]
[]
["Notas:"]
["(1) e (2) Alíquota definida por lei."]
["(3) Alíquota e base de cálculo definidas pela legislação municipal."]
["(4) Alíquota definida pelas leis 12.546/11, 12844/13 e 13.161/15 (CPRB – contribuição previdenciária sobre a receita bruta)."]
["(5) Valores definidos a partir dos limites no Acórdão nº 2.622/2013 - TCU – Plenário. Valores entre o 1º e 3º quartis."]
["(6) Valor calculado pela expressão matemática do acórdão 2.369/2011 – TCU – Plenário e disponibilizado pela AGETOP em dezembro de 2018. (Foi utilizado para o cálculo a média da Taxa SELIC no período de 11/2017 a 10/2018)"]
[]
["(7) Valores definidos pela AGETOP a partir dos limites no Acórdão nº 2.622/2013 - TCU – Plenário. Valores médios. \n\nObservação da AGETOP: (Seguros contra erros de execução, incêndio e explosão, danos da natureza (vendaval, destelhamento, alagamento, inundação, desmoronamento, geadas etc.), emprego de material defeituoso ou inadequado, roubo e/ou furto qualificado, quebra de equipamentos, desmoronamento de estrutura, nas modalidades de Obras Civis em Construção (OCC); Instalação e Montagem (IM); e Obras Civis em Construção e Instalação e Montagem (OCC/IM). Bem como coberturas adicionais para ampliação dessas coberturas básicas, como: cobertura de responsabilidade civil geral, cobertura de responsabilidade civil cruzada, cobertura de despesas extraordinárias, cobertura de tumultos, cobertura de desentulho do local, cobertura de riscos do fabricante, dentre outras, incluindo o seguro de vida em grupo regido pela convenção coletiva dos trabalhadores na indústria da construção civil). A partir de 24/02/2015 por intermédio da Portaria 449/2015 a Presidência da AGETOP, na pessoa do Senhor Jayme Eduardo Rincon, determinou a exclusão dos valores referentes aos Seguros de Risco de Engenharia e Responsabilidade Civil do Profissional na composição do cálculo do B.D.I.."]
["(8) Valores definidos a partir dos limites no Acórdão nº 2.622/2013 - TCU – Plenário. Valores entre 1º e 3° quartis."]
["(9) Valores definidos a partir dos limites definidos no Acórdão nº 2.622/2013 - TCU – Plenário. Valores adotados e praticados no mercado ( “ ex ante ” ) ou aqueles entre os 1º e 3º quartis."]
[]
["(*) A fórmula para estipulação da taxa de BDI estimado adotado é a mesma que foi aplicada para a obtenção das tabelas contidas no Acórdão n. 2.622/2013 – TCUPlenário"]
[]
["Obs.: Para obras com valores superiores a R$ 20.000.000,00 sugere-se recalcular o BDI, dimensionando as taxas de administração central e lucro para patamares inferiores ao estipulado acima."]

{"sheet":"Relatório CENTRAL","index":5,"n_rows":40,"n_cols":5,"rows_kept":40,"cut":false,"hidden":false,"merged":[[7,1,7,4],[8,1,8,2],[8,3,8,4],[9,1,9,2],[10,1,10,4],[11,1,11,4],[39,1,39,2],[9,0,11,0],[0,1,0,4],[6,3,6,4],[9,3,9,4],[1,1,1,4],[2,1,2,2],[2,3,2,4],[3,1,3,2],[3,3,3,4],[4,1,4,4],[5,1,5,2],[5,3,5,4],[6,1,6,2]]}
[]
[]
[null,"UNIDADE ESCOLAR",null,"CIDADE"]
[null,{"$f":"Orçamento!$O$4","v":"CENTRO DE ENSINO EM PERÍODO INTEGRAL PROFESSOR PEDRO GOMES"},null,{"$f":"Orçamento!$V$7","v":"GOIÂNIA"}]
[]
[null,"OBRA",null,"CRE"]
[null,{"$f":"Orçamento!$O$7","v":"REFORMA"},null,{"$f":"Orçamento!$O$10","v":"GOIÂNIA"}]
[]
[null,"ENDEREÇO",null,"DATA"]
["FILTRO",{"$f":"Orçamento!$R$10","v":"AV SERGIPE C/ BENJAMIN CONSTANT S/N, SETOR CAMPINAS, CEP:74550-408"},null,{"$f":"Orçamento!$S$7","v":"2020-03-25"}]
[]
[null,"RELATÓRIO CENTRAL"]
["↓","CÓDIGO","ETAPA","PREÇO  (R$) C/ BDI","PARTIC  ( % )"]
[{"$f":"IF(D14>0,\"F\",\"\")","v":""},{"$f":"Orçamento!O298","v":"a."},{"$f":"Orçamento!P298","v":"SERVIÇOS PRELIMINARES"},{"$f":"Orçamento!V298","v":0},{"$f":"Orçamento!X298","v":0}]
[{"$f":"IF(D15>0,\"F\",\"\")","v":""},{"$f":"Orçamento!O299","v":"b."},{"$f":"Orçamento!P299","v":"TRANSPORTES"},{"$f":"Orçamento!V299","v":0},{"$f":"Orçamento!X299","v":0}]
["",{"$f":"Orçamento!O300","v":"c."},{"$f":"Orçamento!P300","v":"SERVIÇO EM TERRA"},{"$f":"Orçamento!V300","v":0},{"$f":"Orçamento!X300","v":0}]
["",{"$f":"Orçamento!O301","v":"d."},{"$f":"Orçamento!P301","v":"FUNDAÇÕES E SONDAGENS"},{"$f":"Orçamento!V301","v":0},{"$f":"Orçamento!X301","v":0}]
["",{"$f":"Orçamento!O302","v":"e."},{"$f":"Orçamento!P302","v":"ESTRUTURA"},{"$f":"Orçamento!V302","v":0},{"$f":"Orçamento!X302","v":0}]
["",{"$f":"Orçamento!O303","v":"f."},{"$f":"Orçamento!P303","v":"INSTALAÇÕES ELÉTRICAS"},{"$f":"Orçamento!V303","v":0},{"$f":"Orçamento!X303","v":0}]
["",{"$f":"Orçamento!O304","v":"g."},{"$f":"Orçamento!P304","v":"INSTALAÇÕES HIDROSSANITÁRIAS"},{"$f":"Orçamento!V304","v":0},{"$f":"Orçamento!X304","v":0}]
["",{"$f":"Orçamento!O305","v":"h"},{"$f":"Orçamento!P305","v":"INSTALAÇÕES ESPECIAIS"},{"$f":"Orçamento!V305","v":0},{"$f":"Orçamento!X305","v":0}]
["",{"$f":"Orçamento!O306","v":"i."},{"$f":"Orçamento!P306","v":"ALVENARIAS E DIVISÓRIAS"},{"$f":"Orçamento!V306","v":0},{"$f":"Orçamento!X306","v":0}]
["",{"$f":"Orçamento!O307","v":"j."},{"$f":"Orçamento!P307","v":"ALVENARIA AUTO-PORTANTE"},{"$f":"Orçamento!V307","v":0},{"$f":"Orçamento!X307","v":0}]
["",{"$f":"Orçamento!O308","v":"k."},{"$f":"Orçamento!P308","v":"IMPERMEABILIZAÇÃO"},{"$f":"Orçamento!V308","v":0},{"$f":"Orçamento!X308","v":0}]
["",{"$f":"Orçamento!O309","v":"l."},{"$f":"Orçamento!P309","v":"ISOLAMENTO TÉRMICO E ACÚSTICO"},{"$f":"Orçamento!V309","v":0},{"$f":"Orçamento!X309","v":0}]
["",{"$f":"Orçamento!O310","v":"m."},{"$f":"Orçamento!P310","v":"ESTRUTURA DE MADEIRA"},{"$f":"Orçamento!V310","v":0},{"$f":"Orçamento!X310","v":0}]
["",{"$f":"Orçamento!O311","v":"n."},{"$f":"Orçamento!P311","v":"ESTRUTURAS METÁLICAS"},{"$f":"Orçamento!V311","v":0},{"$f":"Orçamento!X311","v":0}]
["",{"$f":"Orçamento!O312","v":"o."},{"$f":"Orçamento!P312","v":"COBERTURAS"},{"$f":"Orçamento!V312","v":0},{"$f":"Orçamento!X312","v":0}]
["",{"$f":"Orçamento!O313","v":"p."},{"$f":"Orçamento!P313","v":"ESQUADRIAS DE MADEIRA"},{"$f":"Orçamento!V313","v":0},{"$f":"Orçamento!X313","v":0}]
["",{"$f":"Orçamento!O314","v":"q."},{"$f":"Orçamento!P314","v":"ESQUADRIAS METÁLICAS"},{"$f":"Orçamento!V314","v":0},{"$f":"Orçamento!X314","v":0}]
["",{"$f":"Orçamento!O315","v":"r."},{"$f":"Orçamento!P315","v":"VIDROS"},{"$f":"Orçamento!V315","v":0},{"$f":"Orçamento!X315","v":0}]
["",{"$f":"Orçamento!O316","v":"s."},{"$f":"Orçamento!P316","v":"REVESTIMENTO DE PAREDE"},{"$f":"Orçamento!V316","v":0},{"$f":"Orçamento!X316","v":0}]
["",{"$f":"Orçamento!O317","v":"t."},{"$f":"Orçamento!P317","v":"FORROS"},{"$f":"Orçamento!V317","v":0},{"$f":"Orçamento!X317","v":0}]
["",{"$f":"Orçamento!O318","v":"u."},{"$f":"Orçamento!P318","v":"REVESTIMENTO DE PISO"},{"$f":"Orçamento!V318","v":0},{"$f":"Orçamento!X318","v":0}]
["",{"$f":"Orçamento!O319","v":"v."},{"$f":"Orçamento!P319","v":"FERRAGENS"},{"$f":"Orçamento!V319","v":0},{"$f":"Orçamento!X319","v":0}]
["",{"$f":"Orçamento!O320","v":"w."},{"$f":"Orçamento!P320","v":"MARCENARIA"},{"$f":"Orçamento!V320","v":0},{"$f":"Orçamento!X320","v":0}]
["",{"$f":"Orçamento!O321","v":"x."},{"$f":"Orçamento!P321","v":"ADMINISTRAÇÃO"},{"$f":"Orçamento!V321","v":0},{"$f":"Orçamento!X321","v":0}]
["",{"$f":"Orçamento!O322","v":"y."},{"$f":"Orçamento!P322","v":"PINTURA"},{"$f":"Orçamento!V322","v":0},{"$f":"Orçamento!X322","v":0}]
["",{"$f":"Orçamento!O323","v":"z."},{"$f":"Orçamento!P323","v":"DIVERSOS"},{"$f":"Orçamento!V323","v":0},{"$f":"Orçamento!X323","v":0}]
["F","TOTAL GERAL DO ORÇAMENTO (R$) C/BDI",null,{"$f":"SUM(D14:D39)","v":0},{"$f":"SUM(E14:E39)","v":0}]

{"sheet":"Parc Maior Relev","index":6,"n_rows":33,"n_cols":8,"rows_kept":33,"cut":false,"hidden":false,"merged":[[10,0,12,0],[8,1,8,3],[8,4,8,6],[33,3,33,7],[31,1,31,6],[0,1,0,6],[11,1,11,6],[1,1,1,6],[2,1,2,3],[2,4,2,6],[3,1,3,3],[3,4,3,6],[4,1,4,6],[5,1,5,3],[5,4,5,6],[9,1,9,3],[9,4,9,6],[10,1,10,6],[6,1,6,3],[6,4,6,6],[7,1,7,6]]}
[]
[]
[null,"UNIDADE ESCOLAR",null,null,"CÓDIGO INEP"]
[null,{"$f":"Orçamento!$O$4","v":"CENTRO DE ENSINO EM PERÍODO INTEGRAL PROFESSOR PEDRO GOMES"},null,null,{"$f":"Orçamento!$V$4","v":52033597}]
[]
[null,"OBRA",null,null,"CIDADE"]
[null,{"$f":"Orçamento!$O$7","v":"REFORMA"},null,null,{"$f":"Orçamento!$V$7","v":"GOIÂNIA"}]
[]
[null,"CRE",null,null,"ÁREA TOTAL CONSTRUÍDA (M²)"]
[null,{"$f":"Orçamento!$O$10","v":"GOIÂNIA"},null,null,{"$f":"Orçamento!$S$13","v":5317.06}]
["FILTRO"]
[null,"PARCELA DE MAIOR RELEVÂNCIA"]
[null,"CÓDIGO","SERVIÇO","DESCRIÇÃO","UNID","QUANT","PARC. MAIOR RELEV (100%)"]
[{"$f":"IF(F14>0,\"F\",\"\")","v":""},70000,"INSTALAÇÕES ELÉTRICAS","INSTALAÇÕES ELÉTRICAS","KVA",{"$f":"SUMIF(Orçamento!$R$20:$R$279,'Parc Maior Relev'!D14,Orçamento!$T$20:$T$279)","v":0},{"$f":"F14*0.5","v":0}]
[null,70000,"INSTALAÇÕES ELÉTRICAS","SUBESTAÇÃO","KVA",150,{"$f":"F15","v":150}]
[null,80000,"INSTALAÇÕES HIDROSSANITÁRIAS","RESERVATÓRIO","UNID",{"$f":"SUMIF(Orçamento!$R$20:$R$279,'Parc Maior Relev'!D16,Orçamento!$T$20:$T$279)","v":0},{"$f":"F16*0.5","v":0},1]
[null,"CÓDIGO","SERVIÇO","DESCRIÇÃO","UNID","QUANT","PARC. MAIOR RELEV (50%)"]
[null,160000,"COBERTURAS","TELHA CERÂMICA","M2",{"$f":"Orçamento!T221","v":208.48},{"$f":"F18*0.5","v":104.24}]
[null,160000,"COBERTURAS","TELHA FIBROCIMENTO","M2",{"$f":"Orçamento!T224","v":2311.13},1155.5650000000001]
[null,160000,"COBERTURAS","TELHA METÁLICA","M2",{"$f":"SUMIF(Orçamento!$R$20:$R$279,'Parc Maior Relev'!D20,Orçamento!$T$20:$T$279)","v":0},0]
[null,200000,"REVESTIMENTO DE PAREDE","REBOCO","M2",{"$f":"SUMIF(Orçamento!$R$20:$R$279,'Parc Maior Relev'!D21,Orçamento!$T$20:$T$279)","v":0},{"$f":"F21*0.5","v":0}]
[null,200000,"REVESTIMENTO DE PAREDE","REVESTIMENTO CERÂMICO","M2",{"$f":"SUMIF(Orçamento!$R$20:$R$279,'Parc Maior Relev'!D22,Orçamento!$T$20:$T$279)","v":0},0]
[null,210000,"FORROS","FORRO DE GESSO","M2",{"$f":"SUMIF(Orçamento!$R$20:$R$279,'Parc Maior Relev'!D23,Orçamento!$T$20:$T$279)","v":0},{"$f":"F23*0.5","v":0}]
[null,210000,"FORROS","FORRO PVC","M2",{"$f":"SUMIF(Orçamento!$R$20:$R$279,'Parc Maior Relev'!D24,Orçamento!$T$20:$T$279)","v":0},0]
[null,210000,"FORROS","FORRO ACARTONADO","M2",{"$f":"SUMIF(Orçamento!$R$20:$R$279,'Parc Maior Relev'!D25,Orçamento!$T$20:$T$279)","v":0},0]
[null,220000,"REVESTIMENTO DE PISO","PISO GRANITINA","M2",{"$f":"Orçamento!T238","v":122.3034},61.151699999999998]
[null,220000,"REVESTIMENTO DE PISO","PISO LAMINADO","M2",{"$f":"SUMIF(Orçamento!$R$20:$R$279,'Parc Maior Relev'!D27,Orçamento!$T$20:$T$279)","v":0},0]
[null,220000,"REVESTIMENTO DE PISO","PISO CONCRETO DESEMPENADO","M2",{"$f":"Orçamento!T241","v":1550.38},775.19]
[null,220000,"REVESTIMENTO DE PISO","PISO CERÂMICO","M2",{"$f":"SUMIF(Orçamento!$R$20:$R$279,'Parc Maior Relev'!D29,Orçamento!$T$20:$T$279)","v":0},{"$f":"F29*0.5","v":0}]
[null,260000,"PINTURA","PINTURA","M2",{"$f":"SUMIF(Orçamento!$R$20:$R$279,'Parc Maior Relev'!D30,Orçamento!$T$20:$T$279)","v":0},0]
["F"]
["F","(*) Para os fins do inciso I dp § 1º do Art. 30 da Lei Federal 8.666/93, são consideradas parcelas de maior relevância técnica as execuções apresentadas"]
["F"]

{"sheet":"Composições","index":7,"n_rows":293,"n_cols":10,"rows_kept":293,"cut":false,"hidden":false,"merged":[[275,5,276,5],[275,6,275,7],[275,8,275,9],[280,1,280,7],[292,1,292,7],[275,0,276,0],[275,1,276,1],[275,2,276,2],[275,3,276,3],[275,4,276,4],[263,5,264,5],[263,6,263,7],[263,8,263,9],[269,1,269,7],[273,1,273,7],[263,0,264,0],[263,1,264,1],[263,2,264,2],[263,3,264,3],[263,4,264,4],[253,5,254,5],[253,6,253,7],[253,8,253,9],[258,1,258,7],[261,1,261,7],[253,0,254,0],[253,1,254,1],[253,2,254,2],[253,3,254,3],[253,4,254,4],[238,5,239,5],[238,6,238,7],[238,8,238,9],[244,1,244,7],[251,1,251,7],[238,0,239,0],[238,1,239,1],[238,2,239,2],[238,3,239,3],[238,4,239,4],[228,5,229,5],[228,6,228,7],[228,8,228,9],[232,1,232,7],[236,1,236,7],[228,0,229,0],[228,1,229,1],[228,2,229,2],[228,3,229,3],[228,4,229,4],[216,5,217,5],[216,6,216,7],[216,8,216,9],[222,1,222,7],[226,1,226,7],[216,0,217,0],[216,1,217,1],[216,2,217,2],[216,3,217,3],[216,4,217,4],[204,5,205,5],[204,6,204,7],[204,8,204,9],[210,1,210,7],[214,1,214,7],[204,0,205,0],[204,1,205,1],[204,2,205,2],[204,3,205,3],[204,4,205,4],[192,5,193,5],[192,6,192,7],[192,8,192,9],[198,1,198,7],[202,1,202,7],[192,0,193,0],[192,1,193,1],[192,2,193,2],[192,3,193,3],[192,4,193,4],[180,5,181,5],[180,6,180,7],[180,8,180,9],[186,1,186,7],[190,1,190,7],[180,0,181,0],[180,1,181,1],[180,2,181,2],[180,3,181,3],[180,4,181,4],[168,5,169,5],[168,6,168,7],[168,8,168,9],[174,1,174,7],[178,1,178,7],[168,0,169,0],[168,1,169,1],[168,2,169,2],[168,3,169,3],[168,4,169,4],[156,5,157,5],[156,6,156,7],[156,8,156,9],[162,1,162,7],[166,1,166,7],[156,0,157,0],[156,1,157,1],[156,2,157,2],[156,3,157,3],[156,4,157,4],[144,5,145,5],[144,6,144,7],[144,8,144,9],[150,1,150,7],[154,1,154,7],[144,0,145,0],[144,1,145,1],[144,2,145,2],[144,3,145,3],[144,4,145,4],[134,5,135,5],[134,6,134,7],[134,8,134,9],[139,1,139,7],[142,1,142,7],[134,0,135,0],[134,1,135,1],[134,2,135,2],[134,3,135,3],[134,4,135,4],[124,5,125,5],[124,6,124,7],[124,8,124,9],[129,1,129,7],[132,1,132,7],[124,0,125,0],[124,1,125,1],[124,2,125,2],[124,3,125,3],[124,4,125,4],[112,5,113,5],[112,6,112,7],[112,8,112,9],[118,1,118,7],[122,1,122,7],[112,0,113,0],[112,1,113,1],[112,2,113,2],[112,3,113,3],[112,4,113,4],[100,5,101,5],[100,6,100,7],[100,8,100,9],[106,1,106,7],[110,1,110,7],[100,0,101,0],[100,1,101,1],[100,2,101,2],[100,3,101,3],[100,4,101,4],[88,5,89,5],[88,6,88,7],[88,8,88,9],[94,1,94,7],[98,1,98,7],[88,0,89,0],[88,1,89,1],[88,2,89,2],[88,3,89,3],[88,4,89,4],[76,5,77,5],[76,6,76,7],[76,8,76,9],[82,1,82,7],[86,1,86,7],[76,0,77,0],[76,1,77,1],[76,2,77,2],[76,3,77,3],[76,4,77,4],[64,5,65,5],[64,6,64,7],[64,8,64,9],[70,1,70,7],[74,1,74,7],[64,0,65,0],[64,1,65,1],[64,2,65,2],[64,3,65,3],[64,4,65,4],[52,5,53,5],[52,6,52,7],[52,8,52,9],[58,1,58,7],[62,1,62,7],[52,0,53,0],[52,1,53,1],[52,2,53,2],[52,3,53,3],[52,4,53,4],[40,5,41,5],[40,6,40,7],[40,8,40,9],[46,1,46,7],[50,1,50,7],[40,0,41,0],[40,1,41,1],[40,2,41,2],[40,3,41,3],[40,4,41,4],[28,5,29,5],[28,6,28,7],[28,8,28,9],[34,1,34,7],[38,1,38,7],[28,0,29,0],[28,1,29,1],[28,2,29,2],[28,3,29,3],[28,4,29,4],[16,5,17,5],[16,6,16,7],[16,8,16,9],[22,1,22,7],[26,1,26,7],[16,0,17,0],[16,1,17,1],[16,2,17,2],[16,3,17,3],[16,4,17,4],[0,0,0,8],[10,0,10,2],[10,3,10,6],[11,0,11,9],[12,0,12,2],[12,3,12,6],[12,7,12,8],[7,0,7,6],[9,0,9,2],[9,3,9,6],[9,7,9,8],[3,0,3,6],[4,0,4,6],[15,0,15,9],[13,0,13,2],[13,3,13,6],[1,0,1,9],[3,7,3,9],[4,7,4,9],[6,7,6,9],[7,7,7,9],[6,0,6,6],[10,8,10,9],[13,8,13,9],[14,0,14,9],[8,0,8,9],[5,0,5,9],[2,0,2,9]]}
[]
[]
[]
["UNIDADE ESCOLAR",null,null,null,null,null,null,"CÓDIGO INEP"]
[{"$f":"Orçamento!$O$4","v":"CENTRO DE ENSINO EM PERÍODO INTEGRAL PROFESSOR PEDRO GOMES"},null,null,null,null,null,null,{"$f":"Orçamento!$V$4","v":52033597}]
[]
["OBRA",null,null,null,null,null,null,"CIDADE"]
[{"$f":"Orçamento!$O$7","v":"REFORMA"},null,null,null,null,null,null,{"$f":"Orçamento!$V$7","v":"GOIÂNIA"}]
[]
["CRE",null,null,"ENDEREÇO",null,null,null,"REFERÊNCIA AGETOP"]
[{"$f":"Orçamento!$O$10","v":"GOIÂNIA"},null,null,{"$f":"Orçamento!$R$10","v":"AV SERGIPE C/ BENJAMIN CONSTANT S/N, SETOR CAMPINAS, CEP:74550-408"},null,null,null,{"$f":"Orçamento!$V$10","v":"DEZ/18"},{"$f":"Orçamento!$W$10","v":"DESONERADA"}]
[]
["DATA",null,null,"ÁREA TOTAL CONSTRUÍDA (M²)",null,null,null,"REFERÊNCIA SINAPI"]
[{"$f":"Orçamento!$S$7","v":"2020-03-25"},null,null,{"$f":"Orçamento!$S$13","v":5317.06},null,null,null,{"$f":"Orçamento!$V$13","v":"JUN/19"},{"$f":"Orçamento!$W$13","v":"DESONERADA"}]
[]
["COMPOSIÇÕES DE CUSTOS UNITÁRIOS - SEE-GO"]
[46,"FONTE","CÓDIGO","DESCRIÇÃO","UNIDADE","COEFIC.","CUSTO UNITÁRIO",null,"CUSTO  TOTAL (A) + (B) + (C) + (D) + (E)"]
[null,null,null,null,null,null,"DESONERADO","NÃO DESONER.","DESONERADO","NÃO DESONER."]
[null,"COMPOSIÇÃO","COMP 046_SEE","CAPUZ PARA PROTEÇÃO DOS PARA RAIOS","UN ",null,null,null,16.53,16.650000000000002]
[null,"AGETOP_I",8,"AJUDANTE","h     ",3.3300000000000003E-2,8.1999999999999993,9.51,0.27,0.32]
[null,"AGETOP_I",12,"ELETRICISTA","h     ",3.3300000000000003E-2,13.4,15.53,0.45,0.52]
[null,null,null,"","",null,0,0,0,0]
[null,"MÃO DE OBRA (B) - TOTAL",null,null,null,null,null,null,0.72,0.84000000000000008]
[null,"COTAÇÃO","COT 010_SEE","CAPUZ PARA PROTEÇÃO DOS PARA RAIOS","UN ",1,15.81,15.81,15.81,15.81]
[null,null,null,"","",null,0,0,0,0]
[null,null,null,"","",null,0,0,0,0]
[null,"MATERIAL (C) - TOTAL",null,null,null,null,null,null,15.81,15.81]
[]
[47,"FONTE","CÓDIGO","DESCRIÇÃO","UNIDADE","COEFIC.","CUSTO UNITÁRIO",null,"CUSTO  TOTAL (A) + (B) + (C) + (D) + (E)"]
[null,null,null,null,null,null,"DESONERADO","NÃO DESONER.","DESONERADO","NÃO DESONER."]
[null,"COMPOSIÇÃO","COMP 047_SEE","CAPUZ DE PROTEÇÃO PARA BUCHA DE TRANSFORMADOR","UN ",null,null,null,16.53,16.650000000000002]
[null,"AGETOP_I",8,"AJUDANTE","h     ",3.3300000000000003E-2,8.1999999999999993,9.51,0.27,0.32]
[null,"AGETOP_I",12,"ELETRICISTA","h     ",3.3300000000000003E-2,13.4,15.53,0.45,0.52]
[null,null,null,"","",null,0,0,0,0]
[null,"MÃO DE OBRA (B) - TOTAL",null,null,null,null,null,null,0.72,0.84000000000000008]
[null,"COTAÇÃO","COT 011_SEE","CAPUZ DE PROTEÇÃO PARA BUCHA DE TRANSFORMADOR","UN ",1,15.81,15.81,15.81,15.81]
[null,null,null,"","",null,0,0,0,0]
[null,null,null,"","",null,0,0,0,0]
[null,"MATERIAL (C) - TOTAL",null,null,null,null,null,null,15.81,15.81]
[]
[48,"FONTE","CÓDIGO","DESCRIÇÃO","UNIDADE","COEFIC.","CUSTO UNITÁRIO",null,"CUSTO  TOTAL (A) + (B) + (C) + (D) + (E)"]
[null,null,null,null,null,null,"DESONERADO","NÃO DESONER.","DESONERADO","NÃO DESONER."]
[null,"COMPOSIÇÃO","COMP 048_SEE","HASTE ROSQUEADA \"TIRANTE\" 3/8\"","M",null,null,null,14.02,15.39]
[null,"AGETOP_I",8,"AJUDANTE","h     ",0.4,8.1999999999999993,9.51,3.28,3.8]
[null,"AGETOP_I",12,"ELETRICISTA","h     ",0.4,13.4,15.53,5.36,6.21]
[null,null,null,"","",null,0,0,0,0]
[null,"MÃO DE OBRA (B) - TOTAL",null,null,null,null,null,null,8.64,10.01]
[null,"COTAÇÃO","COT 012_SEE","HASTE ROSQUEADA \"TIRANTE\" 3/8\"","M",1,5.3833333333333329,5.3833333333333329,5.38,5.38]
[null,null,null,"","",null,0,0,0,0]
[null,null,null,"","",null,0,0,0,0]
[null,"MATERIAL (C) - TOTAL",null,null,null,null,null,null,5.38,5.38]
[]
[49,"FONTE","CÓDIGO","DESCRIÇÃO","UNIDADE","COEFIC.","CUSTO UNITÁRIO",null,"CUSTO  TOTAL (A) + (B) + (C) + (D) + (E)"]
[null,null,null,null,null,null,"DESONERADO","NÃO DESONER.","DESONERADO","NÃO DESONER."]
[null,"COMPOSIÇÃO","COMP 049_SEE","PORCA SEXTAVADA 3/8\"","UN ",null,null,null,0.2,0.22]
[null,"AGETOP_I",8,"AJUDANTE","h     ",8.9999999999999993E-3,8.1999999999999993,9.51,7.0000000000000007E-2,0.09]
[null,null,null,"","",null,0,0,0,0]
[null,null,null,"","",null,0,0,0,0]
[null,"MÃO DE OBRA (B) - TOTAL",null,null,null,null,null,null,7.0000000000000007E-2,0.09]
[null,"COTAÇÃO","COT 013_SEE","PORCA SEXTAVADA 3/8\"","UN ",1,0.13,0.13,0.13,0.13]
[null,null,null,"","",null,0,0,0,0]
[null,null,null,"","",null,0,0,0,0]
[null,"MATERIAL (C) - TOTAL",null,null,null,null,null,null,0.13,0.13]
[]
[557,"FONTE","CÓDIGO","DESCRIÇÃO","UNID ","COEFIC.","CUSTO UNITÁRIO",null,"CUSTO  TOTAL (A) + (B) + (C) + (D) + (E)"]
[null,null,null,null,null,null,"DESONERADO","NÃO DESONER.","DESONERADO","NÃO DESONER."]
[null,"COMPOSIÇÃO","COMP 557_SEE","BOMBA THSI-18 10,0 CV TRIFÁSICA","UN ","-","-","-",5193.7300000000005,5221.25]
[null,"AGETOP_I",8,"AJUDANTE","h     ",8,8.1999999999999993,9.51,65.599999999999994,76.08]
[null,"AGETOP_I",12,"ELETRICISTA","h     ",8,13.4,15.53,107.2,124.24]
[null,null,null,"","",null,0,0,0,0]
[null,"MÃO DE OBRA (B) - TOTAL",null,null,null,null,null,null,172.8,200.32]
[null,"COTAÇÃO","COT 302_SEE","BOMBA THSI-18 10,0 CV TRIFÁSICA","UN ",1,5020.9250000000002,5020.9250000000002,5020.93,5020.93]
[null,null,null,"","",null,0,0,0,0]
[null,null,null,"","",null,0,0,0,0]
[null,"MATERIAL (C) - TOTAL",null,null,null,null,null,null,5020.93,5020.93]
[]
[17,"FONTE","CÓDIGO","DESCRIÇÃO","UNIDADE","COEFIC.","CUSTO UNITÁRIO",null,"CUSTO  TOTAL (A) + (B) + (C) + (D) + (E)"]
[null,null,null,null,null,null,"DESONERADO","NÃO DESONER.","DESONERADO","NÃO DESONER."]
[null,"COMPOSIÇÃO","COMP 017_SEE","REDUCAO GIRATÓRIA TIPO STORZ LATAO P/ INST. PREDIAL COMBATE A INCENDIO ENGATE RAPIDO 2.1/2\" X 1.1/2\"","UN ",null,"-","-",108.44,108.99]
[null,"AGETOP_I",8,"AJUDANTE","h     ",0.16,8.1999999999999993,9.51,1.31,1.52]
[null,"AGETOP_I",11,"ENCANADOR","h     ",0.16,13.4,15.53,2.14,2.48]
[null,null,null,"","",null,0,0,0,0]
[null,"MÃO DE OBRA (B) - TOTAL",null,null,null,null,null,null,3.45,4]
[null,"SINAPI_I",20972,"REDUCAO FIXA TIPO STORZ, ENGATE RAPIDO 2.1/2\" X 1.1/2\", EM LATAO, PARA INSTALACAO PREDIAL COMBATE A INCENDIO PREDIAL","UN    ",1,104.99,104.99,104.99,104.99]
[null,null,null,"","",null,0,0,0,0]
[null,null,null,"","",null,0,0,0,0]
[null,"MATERIAL (C) - TOTAL",null,null,null,null,null,null,104.99,104.99]
[]
[18,"FONTE","CÓDIGO","DESCRIÇÃO","UNIDADE","COEFIC.","CUSTO UNITÁRIO",null,"CUSTO  TOTAL (A) + (B) + (C) + (D) + (E)"]
[null,null,null,null,null,null,"DESONERADO","NÃO DESONER.","DESONERADO","NÃO DESONER."]
[null,"COMPOSIÇÃO","COMP 018_SEE","CHAVE DUPLA P/ CONEXÕES TIPO STORZ EM LATÃO ENGATE RÁPIDO 1 1/2\" X 2 1/2\"","UN ",null,"-","-",16,16.32]
[null,"AGETOP_I",11,"ENCANADOR","h     ",0.15,13.4,15.53,2.0099999999999998,2.33]
[null,null,null,"","",null,0,0,0,0]
[null,null,null,"","",null,0,0,0,0]
[null,"MÃO DE OBRA (B) - TOTAL",null,null,null,null,null,null,2.0099999999999998,2.33]
[null,"SINAPI_I",20971,"CHAVE DUPLA PARA CONEXOES TIPO STORZ, ENGATE RAPIDO 1 1/2\" X 2 1/2\", EM LATAO, PARA INSTALACAO PREDIAL COMBATE A INCENDIO","UN    ",1,13.99,13.99,13.99,13.99]
[null,null,null,"","",null,0,0,0,0]
[null,null,null,"","",null,0,0,0,0]
[null,"MATERIAL (C) - TOTAL",null,null,null,null,null,null,13.99,13.99]
[]
[87,"FONTE","CÓDIGO","DESCRIÇÃO","UNIDADE","COEFIC.","CUSTO UNITÁRIO",null,"CUSTO  TOTAL (A) + (B) + (C) + (D) + (E)"]
[null,null,null,null,null,null,"DESONERADO","NÃO DESONER.","DESONERADO","NÃO DESONER."]
[null,"COMPOSIÇÃO","COMP 087_SEE","REGISTRO DE GAVETA COM HASTE ASCENDENTE DE BRONZE 2 1/2\"","UN ",null,null,null,257.29999999999995,261.26]
[null,"AGETOP_I",8,"AJUDANTE","h     ",1.1499999999999999,8.1999999999999993,9.51,9.43,10.94]
[null,"AGETOP_I",11,"ENCANADOR","h     ",1.1499999999999999,13.4,15.53,15.41,17.86]
[null,null,null,"","",null,0,0,0,0]
[null,"MÃO DE OBRA (B) - TOTAL",null,null,null,null,null,null,24.84,28.799999999999997]
[null,"AGETOP_I","H689","FITA VEDAROSCA 12 MM","m",2.82,0.28000000000000003,0.28000000000000003,0.79,0.79]
[null,"COTAÇÃO","COT 017_SEE","REGISTRO DE GAVETA COM HASTE ASCENDENTE DE BRONZE 2 1/2\"","UN ",1,231.66666666666666,231.66666666666666,231.67,231.67]
[null,null,null,"","",null,0,0,0,0]
[null,"MATERIAL (C) - TOTAL",null,null,null,null,null,null,232.45999999999998,232.45999999999998]
[]
[19,"FONTE","CÓDIGO","DESCRIÇÃO","UNIDADE","COEFIC.","CUSTO UNITÁRIO",null,"CUSTO  TOTAL (A) + (B) + (C) + (D) + (E)"]
[null,null,null,null,null,null,"DESONERADO","NÃO DESONER.","DESONERADO","NÃO DESONER."]
[null,"COMPOSIÇÃO","COMP 019_SEE","TAMPÃO LATAO C/ CORRENTE P/ INSTALAÇÃO PREDIAL COMBATE A INCÊNDIO ENGATE RÁPIDO 1 1/2\"","UN ",null,"-","-",60.63,61.15]
[null,"AGETOP_I",11,"ENCANADOR","h     ",0.15,13.4,15.53,2.0099999999999998,2.33]
[null,"AGETOP_I",8,"AJUDANTE","h     ",0.15,8.1999999999999993,9.51,1.23,1.43]
[null,null,null,"","",null,0,0,0,0]
[null,"MÃO DE OBRA (B) - TOTAL",null,null,null,null,null,null,3.2399999999999998,3.76]
[null,"SINAPI_I",20964,"TAMPAO COM CORRENTE, EM LATAO, ENGATE RAPIDO 1 1/2\", PARA INSTALACAO PREDIAL DE COMBATE A INCENDIO","UN    ",1,57.39,57.39,57.39,57.39]
[null,null,null,"","",null,0,0,0,0]
[null,null,null,"","",null,0,0,0,0]
[null,"MATERIAL (C) - TOTAL",null,null,null,null,null,null,57.39,57.39]
[]
[30,"FONTE","CÓDIGO","DESCRIÇÃO","UNIDADE","COEFIC.","CUSTO UNITÁRIO",null,"CUSTO  TOTAL (A) + (B) + (C) + (D) + (E)"]
[null,null,null,null,null,null,"DESONERADO","NÃO DESONER.","DESONERADO","NÃO DESONER."]
[null,"COMPOSIÇÃO","COMP 030_SEE","COTOVELO DE FERRO GALV. 90° X 2 1/2\"","UN ",null,null,null,67.98,71.150000000000006]
[null,"AGETOP_I",8,"AJUDANTE","h     ",0.92,8.1999999999999993,9.51,7.54,8.75]
[null,"AGETOP_I",11,"ENCANADOR","h     ",0.92,13.4,15.53,12.33,14.29]
[null,"MÃO DE OBRA (B) - TOTAL",null,null,null,null,null,null,19.87,23.04]
[null,"SINAPI_I",3470,"COTOVELO 90 GRAUS DE FERRO GALVANIZADO, COM ROSCA BSP, DE 2 1/2\"","UN    ",1,47.55,47.55,47.55,47.55]
[null,"AGETOP_I","H689","FITA VEDAROSCA 12 MM","m",2,0.28000000000000003,0.28000000000000003,0.56000000000000005,0.56000000000000005]
[null,"MATERIAL (C) - TOTAL",null,null,null,null,null,null,48.11,48.11]
[]
[77,"FONTE","CÓDIGO","DESCRIÇÃO","UNIDADE","COEFIC.","CUSTO UNITÁRIO",null,"CUSTO  TOTAL (A) + (B) + (C) + (D) + (E)"]
[null,null,null,null,null,null,"DESONERADO","NÃO DESONER.","DESONERADO","NÃO DESONER."]
[null,"COMPOSIÇÃO","COMP 077_SEE","UNIAO FERRO GALV C/ASSENTO CONICO BRONZE 2 1/2\"","UN ",null,null,null,144.93,146.29999999999998]
[null,"AGETOP_I",8,"AJUDANTE","h     ",0.4,8.1999999999999993,9.51,3.28,3.8]
[null,"AGETOP_I",11,"ENCANADOR","h     ",0.4,13.4,15.53,5.36,6.21]
[null,"MÃO DE OBRA (B) - TOTAL",null,null,null,null,null,null,8.64,10.01]
[null,"AGETOP_I","H689","FITA VEDAROSCA 12 MM","m",2.4,0.28000000000000003,0.28000000000000003,0.67,0.67]
[null,"SINAPI_I",12427,"UNIAO COM ASSENTO CONICO DE BRONZE, DIAMETRO 2 1/2\"","UN    ",1,135.62,135.62,135.62,135.62]
[null,"MATERIAL (C) - TOTAL",null,null,null,null,null,null,136.29,136.29]
[]
[549,"FONTE","CÓDIGO","DESCRIÇÃO","UNID ","COEFIC.","CUSTO UNITÁRIO",null,"CUSTO  TOTAL (A) + (B) + (C) + (D) + (E)"]
[null,null,null,null,null,null,"DESONERADO","NÃO DESONER.","DESONERADO","NÃO DESONER."]
[null,"COMPOSIÇÃO","COMP 549_SEE","FLANGE GALVANIZADA 2.1/2\" - FORNECIMENTO E INSTALAÇÃO","UN ","-","-","-",160.27000000000001,161.22]
[null,"SINAPI",88248,"AUXILIAR DE ENCANADOR OU BOMBEIRO HIDRÁULICO COM ENCARGOS COMPLEMENTARES","H",0.26200000000000001,13.58,15.08,3.56,3.95]
[null,"SINAPI",88267,"ENCANADOR OU BOMBEIRO HIDRÁULICO COM ENCARGOS COMPLEMENTARES","H",0.26200000000000001,17.53,19.64,4.59,5.15]
[null,null,null,"","",null,0,0,0,0]
[null,"MÃO DE OBRA (B) - TOTAL",null,null,null,null,null,null,8.15,9.1000000000000014]
[null,"SINAPI_I",3148,"FITA VEDA ROSCA EM ROLOS DE 18 MM X 50 M (L X C)","UN    ",1.2999999999999999E-2,12.9,12.9,0.17,0.17]
[null,"SINAPI_I",7307,"FUNDO ANTICORROSIVO PARA METAIS FERROSOS (ZARCAO)","L     ",2E-3,23.65,23.65,0.05,0.05]
[null,"COTAÇÃO","COT 291_SEE","FLANGE GALVANIZADA 2.1/2\"","UN ",1,151.89666666666668,151.89666666666668,151.9,151.9]
[null,"MATERIAL (C) - TOTAL",null,null,null,null,null,null,152.12,152.12]
[]
[22,"FONTE","CÓDIGO","DESCRIÇÃO","UNIDADE","COEFIC.","CUSTO UNITÁRIO",null,"CUSTO  TOTAL (A) + (B) + (C) + (D) + (E)"]
[null,null,null,null,null,null,"DESONERADO","NÃO DESONER.","DESONERADO","NÃO DESONER."]
[null,"COMPOSIÇÃO","COMP 022_SEE","TAMPÃO FOFO 40X50CM C/INSCRIÇÃO ","UN ",null,"-","-",199.82999999999998,200.15]
[null,"AGETOP_I",11,"ENCANADOR","h     ",0.15,13.4,15.53,2.0099999999999998,2.33]
[null,null,null,"","",null,0,0,0,0]
[null,null,null,"","",null,0,0,0,0]
[null,"MÃO DE OBRA (B) - TOTAL",null,null,null,null,null,null,2.0099999999999998,2.33]
[null,"SINAPI_I",11293,"TAMPAO FOFO SIMPLES COM BASE, CLASSE A15 CARGA MAX 1,5 T, 400 X 500 MM, COM INSCRICAO INCENDIO","UN    ",1,197.82,197.82,197.82,197.82]
[null,null,null,"","",null,0,0,0,0]
[null,null,null,"","",null,0,0,0,0]
[null,"MATERIAL (C) - TOTAL",null,null,null,null,null,null,197.82,197.82]
[]
[546,"FONTE","CÓDIGO","DESCRIÇÃO","UNID ","COEFIC.","CUSTO UNITÁRIO",null,"CUSTO  TOTAL (A) + (B) + (C) + (D) + (E)"]
[null,null,null,null,null,null,"DESONERADO","NÃO DESONER.","DESONERADO","NÃO DESONER."]
[null,"COMPOSIÇÃO","COMP 546_SEE","BUJÃO DE REBORDO 2.1/2\"","UN ","-","-","-",16.509999999999998,16.760000000000002]
[null,"AGETOP_I",8,"AJUDANTE","h     ",7.0000000000000007E-2,8.1999999999999993,9.51,0.56999999999999995,0.67]
[null,"AGETOP_I",11,"ENCANADOR","h     ",7.0000000000000007E-2,13.4,15.53,0.94,1.0900000000000001]
[null,null,null,"","",null,0,0,0,0]
[null,"MÃO DE OBRA (B) - TOTAL",null,null,null,null,null,null,1.5099999999999998,1.7600000000000002]
[null,"COTAÇÃO","COT 286_SEE","BUJÃO DE REBORDO 2.1/2\"","UN ",1,15,15,15,15]
[null,null,null,"","",null,0,0,0,0]
[null,null,null,"","",null,0,0,0,0]
[null,"MATERIAL (C) - TOTAL",null,null,null,null,null,null,15,15]
[]
[24,"FONTE","CÓDIGO","DESCRIÇÃO","UNIDADE","COEFIC.","CUSTO UNITÁRIO",null,"CUSTO  TOTAL (A) + (B) + (C) + (D) + (E)"]
[null,null,null,null,null,null,"DESONERADO","NÃO DESONER.","DESONERADO","NÃO DESONER."]
[null,"COMPOSIÇÃO","COMP 024_SEE","SINALIZADOR FOTOLUMINESCENTE PARA EXTINTOR","UN ",null,"-","-",25.269999999999996,25.389999999999997]
[null,"AGETOP_I",5,"SERVENTE","h     ",0.09,8.1999999999999993,9.51,0.74,0.86]
[null,null,null,"","",null,0,0,0,0]
[null,null,null,"","",null,0,0,0,0]
[null,"MÃO DE OBRA (B) - TOTAL",null,null,null,null,null,null,0.74,0.86]
[null,"AGETOP_I",3070,"BUCHA DE NYLON S-6","un",2,0.04,0.04,0.08,0.08]
[null,"AGETOP_I",3393,"PARAFUSO P/BUCHA S-6","un",2,0.08,0.08,0.16,0.16]
[null,"SINAPI_I",37556,"PLACA DE SINALIZACAO DE SEGURANCA CONTRA INCENDIO, FOTOLUMINESCENTE, QUADRADA, *20 X 20* CM, EM PVC *2* MM ANTI-CHAMAS (SIMBOLOS, CORES E PICTOGRAMAS CONFORME NBR 13434)","UN    ",1,24.29,24.29,24.29,24.29]
[null,"MATERIAL (C) - TOTAL",null,null,null,null,null,null,24.529999999999998,24.529999999999998]
[]
[186,"FONTE","CÓDIGO","DESCRIÇÃO","UNIDADE","COEFIC.","CUSTO UNITÁRIO",null,"CUSTO  TOTAL (A) + (B) + (C) + (D) + (E)"]
[null,null,null,null,null,null,"DESONERADO","NÃO DESONER.","DESONERADO","NÃO DESONER."]
[null,"COMPOSIÇÃO","COMP 186_SEE","BOTOEIRA BOMBA DE INCÊNDIO C/ MARTELO CONVENCIONAL/ ANALÓGICA","UN ",null,null,null,85.1,88.539999999999992]
[null,"AGETOP_I",8,"AJUDANTE","h     ",1,8.1999999999999993,9.51,8.1999999999999993,9.51]
[null,"AGETOP_I",12,"ELETRICISTA","h     ",1,13.4,15.53,13.4,15.53]
[null,null,null,"","",null,0,0,0,0]
[null,"MÃO DE OBRA (B) - TOTAL",null,null,null,null,null,null,21.6,25.04]
[null,"COTAÇÃO","COT 088_SEE","BOTOEIRA BOMBA DE INCÊNDIO C/ MARTELO CONVENCIONAL/ ANALÓGICA","UN",1,63.5,63.5,63.5,63.5]
[null,null,null,"","",null,0,0,0,0]
[null,null,null,"","",null,0,0,0,0]
[null,"MATERIAL (C) - TOTAL",null,null,null,null,null,null,63.5,63.5]
[]
[188,"FONTE","CÓDIGO","DESCRIÇÃO","UNIDADE","COEFIC.","CUSTO UNITÁRIO",null,"CUSTO  TOTAL (A) + (B) + (C) + (D) + (E)"]
[null,null,null,null,null,null,"DESONERADO","NÃO DESONER.","DESONERADO","NÃO DESONER."]
[null,"COMPOSIÇÃO","COMP 188_SEE","ACIONADOR MANUAL DE ALARME","UN ",null,null,null,100.61,103.36]
[null,"AGETOP_I",8,"AJUDANTE","h     ",0.8,8.1999999999999993,9.51,6.56,7.61]
[null,"AGETOP_I",12,"ELETRICISTA","h     ",0.8,13.4,15.53,10.72,12.42]
[null,null,null,"","",null,0,0,0,0]
[null,"MÃO DE OBRA (B) - TOTAL",null,null,null,null,null,null,17.28,20.03]
[null,"COTAÇÃO","COT 090_SEE","ACIONADOR MANUAL DE ALARME","UN",1,83.333333333333329,83.333333333333329,83.33,83.33]
[null,null,null,"","",null,0,0,0,0]
[null,null,null,"","",null,0,0,0,0]
[null,"MATERIAL (C) - TOTAL",null,null,null,null,null,null,83.33,83.33]
[]
[190,"FONTE","CÓDIGO","DESCRIÇÃO","UNIDADE","COEFIC.","CUSTO UNITÁRIO",null,"CUSTO  TOTAL (A) + (B) + (C) + (D) + (E)"]
[null,null,null,null,null,null,"DESONERADO","NÃO DESONER.","DESONERADO","NÃO DESONER."]
[null,"COMPOSIÇÃO","COMP 190_SEE","CENTRAL DE DETECÇÃO E ALARME DE 40 SETORES COM BATERIA","UN ",null,null,null,1136.1300000000001,1163.6500000000001]
[null,"AGETOP_I",8,"AJUDANTE","h     ",8,8.1999999999999993,9.51,65.599999999999994,76.08]
[null,"AGETOP_I",12,"ELETRICISTA","h     ",8,13.4,15.53,107.2,124.24]
[null,null,null,"","",null,0,0,0,0]
[null,"MÃO DE OBRA (B) - TOTAL",null,null,null,null,null,null,172.8,200.32]
[null,"COTAÇÃO","COT 092_SEE","CENTRAL DE DETECÇÃO E ALARME DE 40 SETORES COM BATERIA (PREÇO MÉDIO)","UN",1,963.33333333333337,963.33333333333337,963.33,963.33]
[null,null,null,"","",null,0,0,0,0]
[null,null,null,"","",null,0,0,0,0]
[null,"MATERIAL (C) - TOTAL",null,null,null,null,null,null,963.33,963.33]
[]
[25,"FONTE","CÓDIGO","DESCRIÇÃO","UNIDADE","COEFIC.","CUSTO UNITÁRIO",null,"CUSTO  TOTAL (A) + (B) + (C) + (D) + (E)"]
[null,null,null,null,null,null,"DESONERADO","NÃO DESONER.","DESONERADO","NÃO DESONER."]
[null,"COMPOSIÇÃO","COMP 025_SEE","SINALIZADOR FOTOLUMINESCENTE DE EMERGÊNCIA","UN ",null,"-","-",25.269999999999996,25.389999999999997]
[null,"AGETOP_I",5,"SERVENTE","h     ",0.09,8.1999999999999993,9.51,0.74,0.86]
[null,"MÃO DE OBRA (B) - TOTAL",null,null,null,null,null,null,0.74,0.86]
[null,"AGETOP_I",3070,"BUCHA DE NYLON S-6","un",2,0.04,0.04,0.08,0.08]
[null,"AGETOP_I",3393,"PARAFUSO P/BUCHA S-6","un",2,0.08,0.08,0.16,0.16]
[null,"SINAPI_I",37556,"PLACA DE SINALIZACAO DE SEGURANCA CONTRA INCENDIO, FOTOLUMINESCENTE, QUADRADA, *20 X 20* CM, EM PVC *2* MM ANTI-CHAMAS (SIMBOLOS, CORES E PICTOGRAMAS CONFORME NBR 13434)","UN    ",1,24.29,24.29,24.29,24.29]
[null,"MATERIAL (C) - TOTAL",null,null,null,null,null,null,24.529999999999998,24.529999999999998]
[]
[277,"FONTE","CÓDIGO","DESCRIÇÃO","UNIDADE","COEFIC.","CUSTO UNITÁRIO",null,"CUSTO  TOTAL (A) + (B) + (C) + (D) + (E)"]
[null,null,null,null,null,null,"DESONERADO","NÃO DESONER.","DESONERADO","NÃO DESONER."]
[null,"COMPOSIÇÃO","COMP 277_SEE","MARCAÇÃO NO PISO - 1X1 M PARA EXTINTOR","M2",null,null,null,28.65,28.73]
[null,"AGETOP_I",5,"SERVENTE","h     ",3.3300000000000003E-2,8.1999999999999993,9.51,0.27,0.32]
[null,null,null,"","",null,0,0,0,0]
[null,null,null,"","",null,0,0,0,0]
[null,"MÃO DE OBRA (B) - TOTAL",null,null,null,null,null,null,0.27,0.32]
[null,"SINAPI_I",5318,"SOLVENTE DILUENTE A BASE DE AGUARRAS","L     ",0.13,11.98,11.98,1.56,1.56]
[null,"SINAPI",5824,"CAMINHÃO TOCO, PBT 16.000 KG, CARGA ÚTIL MÁX. 10.685 KG, DIST. ENTRE EIXOS 4,8 M, POTÊNCIA 189 CV, INCLUSIVE CARROCERIA FIXA ABERTA DE MADEIRA P/ TRANSPORTE GERAL DE CARGA SECA, DIMEN. APROX. 2,5 X 7,00 X 0,50 M - CHP DIURNO. AF_06/2014","CHP",3.3E-3,138.91,142.12,0.46,0.47]
[null,"SINAPI_I",7343,"TINTA A BASE DE RESINA ACRILICA, PARA SINALIZACAO HORIZONTAL VIARIA (NBR 11862)","L     ",0.6,11.06,11.06,6.64,6.64]
[null,"SINAPI_I",7348,"TINTA ACRILICA PREMIUM PARA PISO","L     ",0.03,12,12,0.36,0.36]
[null,"SINAPI_I",25972,"MICROESFERAS DE VIDRO PARA SINALIZACAO HORIZONTAL VIARIA, TIPO I-B (PREMIX) - NBR 16184","KG    ",2.14,8.8800000000000008,8.8800000000000008,19,19]
[null,"SINAPI",95133,"MÁQUINA DEMARCADORA DE FAIXA DE TRÁFEGO À FRIO, AUTOPROPELIDA, POTÊNCIA 38 HP - CHP DIURNO. AF_07/2016","CHP",3.3E-3,110.32,113.9,0.36,0.38]
[null,"MATERIAL (C) - TOTAL",null,null,null,null,null,null,28.38,28.41]
[]
[77,"FONTE","CÓDIGO","DESCRIÇÃO","UNIDADE","COEFIC.","CUSTO UNITÁRIO",null,"CUSTO  TOTAL (A) + (B) + (C) + (D) + (E)"]
[null,null,null,null,null,null,"DESONERADO","NÃO DESONER.","DESONERADO","NÃO DESONER."]
[null,"COMPOSIÇÃO","COMP 077_SEE","UNIAO FERRO GALV C/ASSENTO CONICO BRONZE 2 1/2\"","UN ",null,null,null,144.93,146.29999999999998]
[null,"AGETOP_I",8,"AJUDANTE","h     ",0.4,8.1999999999999993,9.51,3.28,3.8]
[null,"AGETOP_I",11,"ENCANADOR","h     ",0.4,13.4,15.53,5.36,6.21]
[null,"MÃO DE OBRA (B) - TOTAL",null,null,null,null,null,null,8.64,10.01]
[null,"AGETOP_I","H689","FITA VEDAROSCA 12 MM","m",2.4,0.28000000000000003,0.28000000000000003,0.67,0.67]
[null,"SINAPI_I",12427,"UNIAO COM ASSENTO CONICO DE BRONZE, DIAMETRO 2 1/2\"","UN    ",1,135.62,135.62,135.62,135.62]
[null,"MATERIAL (C) - TOTAL",null,null,null,null,null,null,136.29,136.29]
[]
[558,"FONTE","CÓDIGO","DESCRIÇÃO","UNID ","COEFIC.","CUSTO UNITÁRIO",null,"CUSTO  TOTAL (A) + (B) + (C) + (D) + (E)"]
[null,null,null,null,null,null,"DESONERADO","NÃO DESONER.","DESONERADO","NÃO DESONER."]
[null,"COMPOSIÇÃO","COMP 558_SEE","BOMBA DE PRESSURIZAÇÃO JOCKEY 3,0 CV","UN ","-","-","-",2687.07,2714.59]
[null,"AGETOP_I",8,"AJUDANTE","h     ",8,8.1999999999999993,9.51,65.599999999999994,76.08]
[null,"AGETOP_I",12,"ELETRICISTA","h     ",8,13.4,15.53,107.2,124.24]
[null,null,null,"","",null,0,0,0,0]
[null,"MÃO DE OBRA (B) - TOTAL",null,null,null,null,null,null,172.8,200.32]
[null,"COTAÇÃO","COT 303_SEE","BOMBA DE PRESSURIZAÇÃO JOCKEY 3,0 CV","UN ",1,2514.2666666666669,2514.2666666666669,2514.27,2514.27]
[null,null,null,"","",null,0,0,0,0]
[null,null,null,"","",null,0,0,0,0]
[null,"MATERIAL (C) - TOTAL",null,null,null,null,null,null,2514.27,2514.27]
[]
[82,"FONTE","CÓDIGO","DESCRIÇÃO","UNIDADE","COEFIC.","CUSTO UNITÁRIO",null,"CUSTO  TOTAL (A) + (B) + (C) + (D) + (E)"]
[null,null,null,null,null,null,"DESONERADO","NÃO DESONER.","DESONERADO","NÃO DESONER."]
[null,"COMPOSIÇÃO","COMP 082_SEE","CORRIMÃO PAREDE - SEDUC","M",null,null,null,120.16,124.00999999999999]
[null,"AGETOP_I",25,"OFICIAL \"B\"","h     ",1,13.4,15.53,13.4,15.53]
[null,"AGETOP_I",8,"AJUDANTE","h     ",1,8.1999999999999993,9.51,8.1999999999999993,9.51]
[null,"MÃO DE OBRA (B) - TOTAL",null,null,null,null,null,null,21.6,25.04]
[null,"AGETOP_I",2376,"TUBO INDUSTRIAL 2\" CHAPA 13 ","Kg",5.5247999999999999,5.23,5.23,28.89,28.89]
[null,"AGETOP_I",2504,"TUBO INDUSTRIAL D=25 MM CHAPA 13 ","Kg",1.1000000000000001,5.07,5.07,5.58,5.58]
[null,"AGETOP_I",2417,"MASSA PLASTICA","Kg",0.2041,10.58,10.58,2.16,2.16]
[null,"AGETOP_I",2246,"ELETRODO 2.5 OK","Kg",0.11459999999999999,8.6999999999999993,8.6999999999999993,1,1]
[null,"AGETOP_I",1672,"LIXA PARA FERRO ( NÚMERO 100 )","un",0.125,2.12,2.12,0.27,0.27]
[null,"AGETOP_I",1264,"DISCO DE DESBASTE 7/8\" P/ CONC./FERRO (1/4\" X 7\")","un",2.5000000000000001E-2,7,7,0.18,0.18]
[null,"AGETOP_I",1334,"DISCO DE CORTE DIAM. 5/8\"- 10\"","un",0.1865,5.5,5.5,1.03,1.03]
[null,"AGETOP_I",2902,"FABRICAÇÃO / MONTAGEM","un",1,50.44,50.44,50.44,50.44]
[null,"AGETOP_I",2719,"CHAPA PERFILADA 3/16\"","Kg",0.72,5.04,5.04,3.63,3.63]
[null,"AGETOP_I",2436,"ACO CA-25 - 6,3 MM (1/4\") - BARRA LISA A-36","Kg",0.25,5.13,5.13,1.28,1.28]
[null,"AGETOP",261602,"PINT.ESMALTE/ESQUAD.FERRO C/FUNDO ANTICOR.","m2    ",0.3,13.65,15.04,4.0999999999999996,4.51]
[null,"MATERIAL (C) - TOTAL",null,null,null,null,null,null,98.559999999999988,98.97]