{"text_format":"1","workbook":"xlsx","n_sheets":8,"sheets":["Orçamento","Resumo ","Somatório","Cronog_120_Dias","Composição BDI","Relatório CENTRAL","Parc Maior Relev","Composições"],"not_rendered":{"charts":0,"images":4,"macros":1,"external_links":0,"defined_names":80,"comments":3,"pivot_tables":0},"unopened":[],"bounds":{"document_bytes":16777216,"sheet_cells":100000,"rows_first":2000,"rows_last":500,"rows_between":2000,"halvings":0,"cell_chars":16384,"cell_head_chars":4096},"cells_cut":0,"cells_raw":0,"read":"whole","date_system":"1900"}

{"sheet":"Orçamento","index":0,"n_rows":999,"n_cols":27,"rows_kept":999,"cut":false,"hidden":false,"merged":[[991,18,991,22],[986,15,986,17],[986,18,986,22],[987,15,987,17],[987,18,987,22],[988,15,988,17],[988,18,988,22],[12,24,12,25],[11,23,11,25],[980,18,980,22],[981,15,981,17],[981,18,981,22],[982,15,982,17],[982,18,982,22],[977,15,977,17],[977,18,977,22],[978,15,978,17],[978,18,978,22],[979,15,979,17],[979,18,979,22],[973,14,973,26],[974,18,974,22],[975,15,975,17],[975,18,975,22],[992,23,992,25],[993,23,993,25],[994,23,994,25],[995,23,995,25],[996,23,996,25],[997,23,997,25],[998,23,998,25],[967,14,967,17],[974,15,974,17],[940,15,940,17],[995,18,995,22],[983,15,983,17],[983,18,983,22],[984,15,984,17],[984,18,984,22],[985,15,985,17],[985,18,985,22],[989,15,989,17],[989,18,989,22],[990,15,990,17],[990,18,990,22],[991,15,991,17],[980,15,980,17],[998,18,998,22],[995,14,995,17],[992,15,992,17],[992,18,992,22],[993,15,993,17],[993,18,993,22],[994,15,994,17],[994,18,994,22],[997,18,997,22],[996,18,996,22],[976,15,976,17],[976,18,976,22],[931,16,931,24],[932,16,932,24],[933,16,933,24],[10,14,10,26],[13,14,13,26],[9,17,9,22],[2,14,2,22],[3,14,3,22],[5,18,5,22],[6,18,6,22],[11,18,11,22],[12,18,12,22],[6,14,6,17],[5,14,5,17],[3,23,3,25],[2,23,2,25],[5,23,5,25],[6,23,6,25],[935,16,935,24],[8,23,8,25],[9,24,9,25],[953,15,953,17],[954,15,954,17],[955,15,955,17],[956,15,956,17],[957,15,957,17],[958,15,958,17],[959,15,959,17],[960,15,960,17],[934,16,934,24],[924,23,924,24],[925,23,925,24],[940,23,940,25],[965,15,965,17],[966,15,966,17],[939,14,939,26],[923,17,928,17],[940,18,940,22],[941,18,941,22],[949,18,949,22],[950,18,950,22],[951,18,951,22],[952,18,952,22],[964,18,964,22],[961,15,961,17],[941,15,941,17],[942,15,942,17],[943,15,943,17],[944,15,944,17],[945,15,945,17],[946,15,946,17],[947,15,947,17],[948,15,948,17],[949,15,949,17],[970,18,970,22],[946,18,946,22],[947,18,947,22],[945,18,945,22],[954,18,954,22],[936,18,936,24],[942,18,942,22],[943,18,943,22],[944,18,944,22],[967,18,967,22],[965,18,965,22],[966,18,966,22],[956,18,956,22],[963,18,963,22],[959,18,959,22],[961,18,961,22],[957,18,957,22],[958,18,958,22],[967,23,967,25],[961,23,961,25],[962,23,962,25],[963,23,963,25],[964,23,964,25],[965,23,965,25],[8,12,9,12],[969,18,969,22],[0,14,0,24],[8,14,8,16],[9,14,9,16],[11,14,11,16],[12,14,12,16],[14,14,14,24],[1,14,1,24],[4,14,4,24],[7,14,7,24],[953,18,953,22],[950,15,950,17],[951,15,951,17],[952,15,952,17],[962,18,962,22],[960,18,960,22],[923,23,923,24],[968,18,968,22],[955,18,955,22],[948,18,948,22],[962,15,962,17],[963,15,963,17],[964,15,964,17],[974,23,974,25],[975,23,975,25],[976,23,976,25],[977,23,977,25],[978,23,978,25],[979,23,979,25],[980,23,980,25],[981,23,981,25],[982,23,982,25],[983,23,983,25],[984,23,984,25],[985,23,985,25],[986,23,986,25],[987,23,987,25],[988,23,988,25],[989,23,989,25],[990,23,990,25],[991,23,991,25],[968,23,968,25],[969,23,969,25],[970,23,970,25],[966,23,966,25],[941,23,941,25],[942,23,942,25],[943,23,943,25],[944,23,944,25],[945,23,945,25],[946,23,946,25],[947,23,947,25],[948,23,948,25],[949,23,949,25],[950,23,950,25],[951,23,951,25],[952,23,952,25],[953,23,953,25],[954,23,954,25],[955,23,955,25],[956,23,956,25],[957,23,957,25],[958,23,958,25],[959,23,959,25],[960,23,960,25]]}
[]
[]
[null,null,null,null,null,null,null,null,null,null,null,null,null,null,"UNIDADE ESCOLAR",null,null,null,null,null,null,null,null,"CÓDIGO INEP"]
[null,null,null,null,null,null,null,null,null,null,null,null,null,null,"COLÉGIO ESTADUAL MARIA EULÁLIA DE JESUS PORTILHO",null,null,null,null,null,null,null,null,52005720]
[]
["Nmax",null,null,null,null,null,null,null,null,null,null,null,null,null,"OBRA",null,null,null,"DATA",null,null,null,null,"CIDADE"]
[{"$f":"MAX($C$18:$C$923)","v":4},null,null,null,null,null,null,null,null,null,null,null,null,null,null,null,null,null,"2020-03-26",null,null,null,null,"PIRANHAS"]
[]
[null,null,null,null,null,null,null,null,null,null,null,null,"",null,"CRE",null,null,"ENDEREÇO",null,null,null,null,null,"REFERÊNCIA AGETOP"]
[null,null,null,null,null,null,null,null,null,null,null,null,null,null,"PIRANHAS",null,null,"AV BRASIL CENTRAL 1440, CENTRO, CEP:76230-000",null,null,null,null,null,"DEZ/18","ONERADA"]
[]
[null,null,null,null,null,null,null,null,null,null,null,null,null,null,"ÁREA EXISTENTE (M²)",null,null,"ÁREA A CONSTRUIR (M²)","ÁREA TOTAL CONSTRUÍDA (M²)",null,null,null,null,"REFERÊNCIA SINAPI"]
[null,null,null,null,null,null,null,null,null,null,null,null,null,null,2832.84,null,null,356.85,3189.69,null,null,null,null,"AGO/19","ONERADA"]
[]
[null,null,null,null,null,null,null,null,null,null,null,"FILTRO",null,null,"PLANILHA ORÇAMENTÁRIA"]
["Nível E","Save Nivel","Nível C","Altura","n1","n2","n3","n4","n5","Czero","Cnível","↓","Nível","Nível Corrigido","ITEM","TABELA","CODIGO","DESCRIÇÃO DOS SERVIÇOS","UNID","QUANT","REPET","QUANT TOTAL","MAT","MO","VALOR UNIT","VALOR TOTAL","OBSERVAÇÕES¹"]
[{"$f":"CHOOSE(1+LOG(1+2*(ORÇAMENTO.Nivel=\"Nível 1\")+4*(ORÇAMENTO.Nivel=\"Nível 2\")+8*(ORÇAMENTO.Nivel=\"Nível 3\")+16*(ORÇAMENTO.Nivel=\"Nível 4\")+32*(ORÇAMENTO.Nivel=\"Serviço\"),2),0,1,2,3,4,\"S\")","v":"S"},{"$f":"IF(OR(C17=\"s\",C17=0),OFFSET(B17,-1,0),C17)","v":"Save Nivel"},{"$f":"IF(OFFSET(C17,-1,0)=\"L\",1,IF(OFFSET(C17,-1,0)=1,2,IF(OR(A17=\"s\",A17=0),\"S\",IF(AND(OFFSET(C17,-1,0)=2,A17=4),3,IF(AND(OR(OFFSET(C17,-1,0)=\"s\",OFFSET(C17,-1,0)=0),A17<>\"s\",A17>OFFSET(B17,-1,0)),OFFSET(B17,-1,0),A17)))))","v":"S"},{"$f":"IF(OR(C17=\"S\",C17=0),0,IF(ISERROR(K17),J17,SMALL(J17:K17,1)))","v":0},{"$f":"IF($C17=1,OFFSET(E17,-1,0)+1,OFFSET(E17,-1,0))","v":"n1"},{"$f":"IF($C17=1,0,IF($C17=2,OFFSET(F17,-1,0)+1,OFFSET(F17,-1,0)))","v":"n2"},{"$f":"IF(AND($C17<=2,$C17<>0),0,IF($C17=3,OFFSET(G17,-1,0)+1,OFFSET(G17,-1,0)))","v":"n3"},{"$f":"IF(AND($C17<=3,$C17<>0),0,IF($C17=4,OFFSET(H17,-1,0)+1,OFFSET(H17,-1,0)))","v":"n4"},{"$f":"IF(AND($C17<=4,$C17<>0),0,IF(AND($C17=\"S\",$Y17>0),OFFSET(I17,-1,0)+1,OFFSET(I17,-1,0)))","v":"n5"},{"$f":"IF(OR($C17=\"S\",$C17=0),0,MATCH(0,OFFSET($D17,1,$C17,ROW($C$923)-ROW($C17)),0))","v":0},{"$f":"IF(OR($C17=\"S\",$C17=0),0,MATCH(OFFSET($D17,0,$C17)+1,OFFSET($D17,1,$C17,ROW($C$923)-ROW($C17)),0))","v":0},"","Serviço","Serviço","-","SINAPI",null,"(sem código)","-",null,"REPET","-",0,0,0,"-",""]
[0,null,"L",{"$f":"COUNTA(OFFSET(D18,1,0):D$923)","v":904},{"$f":"LEFT(O19,1)-1","v":0},null,null,null,null,null,null,"F","LOTE","LOTE"," - COLÉGIO ESTADUAL MARIA EULÁLIA DE JESUS PORTILHO",null,null,null,null,null,null,null,null,null,null,0]
[1,{"$f":"IF(OR(C19=\"s\",C19=0),OFFSET(B19,-1,0),C19)","v":1},{"$f":"IF(OFFSET(C19,-1,0)=\"L\",1,IF(OFFSET(C19,-1,0)=1,2,IF(OR(A19=\"s\",A19=0),\"S\",IF(AND(OFFSET(C19,-1,0)=2,A19=4),3,IF(AND(OR(OFFSET(C19,-1,0)=\"s\",OFFSET(C19,-1,0)=0),A19<>\"s\",A19>OFFSET(B19,-1,0)),OFFSET(B19,-1,0),A19)))))","v":1},{"$f":"IF(OR(C19=\"S\",C19=0),0,IF(ISERROR(K19),J19,SMALL(J19:K19,1)))","v":432},{"$f":"IF($C19=1,OFFSET(E19,-1,0)+1,OFFSET(E19,-1,0))","v":1},{"$f":"IF($C19=1,0,IF($C19=2,OFFSET(F19,-1,0)+1,OFFSET(F19,-1,0)))","v":0},{"$f":"IF(AND($C19<=2,$C19<>0),0,IF($C19=3,OFFSET(G19,-1,0)+1,OFFSET(G19,-1,0)))","v":0},{"$f":"IF(AND($C19<=3,$C19<>0),0,IF($C19=4,OFFSET(H19,-1,0)+1,OFFSET(H19,-1,0)))","v":0},0,{"$f":"IF(OR($C19=\"S\",$C19=0),0,MATCH(0,OFFSET($D19,1,$C19,ROW($C$923)-ROW($C19)),0))","v":904},{"$f":"IF(OR($C19=\"S\",$C19=0),0,MATCH(OFFSET($D19,0,$C19)+1,OFFSET($D19,1,$C19,ROW($C$923)-ROW($C19)),0))","v":432},"F","Nível 1","Nível 1","1.","AGETOP",null,"REFORMA","UN",1,1,1,null,null,0,0]
[2,{"$f":"IF(OR(C20=\"s\",C20=0),OFFSET(B20,-1,0),C20)","v":2},{"$f":"IF(OFFSET(C20,-1,0)=\"L\",1,IF(OFFSET(C20,-1,0)=1,2,IF(OR(A20=\"s\",A20=0),\"S\",IF(AND(OFFSET(C20,-1,0)=2,A20=4),3,IF(AND(OR(OFFSET(C20,-1,0)=\"s\",OFFSET(C20,-1,0)=0),A20<>\"s\",A20>OFFSET(B20,-1,0)),OFFSET(B20,-1,0),A20)))))","v":2},{"$f":"IF(OR(C20=\"S\",C20=0),0,IF(ISERROR(K20),J20,SMALL(J20:K20,1)))","v":46},{"$f":"IF($C20=1,OFFSET(E20,-1,0)+1,OFFSET(E20,-1,0))","v":1},{"$f":"IF($C20=1,0,IF($C20=2,OFFSET(F20,-1,0)+1,OFFSET(F20,-1,0)))","v":1},{"$f":"IF(AND($C20<=2,$C20<>0),0,IF($C20=3,OFFSET(G20,-1,0)+1,OFFSET(G20,-1,0)))","v":0},{"$f":"IF(AND($C20<=3,$C20<>0),0,IF($C20=4,OFFSET(H20,-1,0)+1,OFFSET(H20,-1,0)))","v":0},0,431,46,"","Nível 2","Nível 2","-","AGETOP",null,"SERVIÇOS PRELIMINARES","-",null,1,"-",null,null,0,0]
[3,3,3,10,1,1,1,0,0,45,10,"","Nível 3","Nível 3","-","SINAPI",null,"BLOCO 4 (CASA DO ZELADOR)","-",null,1,"-",0,0,0,0,""]
["S",3,"S",0,1,1,1,0,0,0,0,"","Serviço","Serviço","-","SINAPI",97622,"DEMOLIÇÃO DE ALVENARIA DE BLOCO FURADO, DE FORMA MANUAL, SEM REAPROVEITAMENTO. AF_12/2017","M3",14.641499999999999,1,14.641499999999999,null,null,0,0,"Referência: AGETOP - 20118"]
["S",3,"S",0,1,1,1,0,0,0,0,"","Serviço","Serviço","-","AGETOP",20103,"DEMOLIÇÃO ESTRUTURA EM MADEIRA TELHADO C/ TRANSP. ATÉ CB. E CARGA","m2    ",118.45,1,118.45,null,null,0,0,""]
["S",3,"S",0,1,1,1,0,0,0,0,"","Serviço","Serviço","-","AGETOP",20136,"DEMOLICAO DE CAIBROS E RIPAS C/ TRANSP. ATÉ CB. E CARGA","m2    ",118.45,1,118.45,null,null,0,0,""]
["S",3,"S",0,1,1,1,0,0,0,0,"","Serviço","Serviço","-","AGETOP",20101,"DEMOLICAO COBERTURA TELHA CERAMICA C/ TRANSP. ATÉ CB. E CARGA","m2    ",118.45,1,118.45,null,null,0,0,""]
["S",3,"S",0,1,1,1,0,0,0,0,"","Serviço","Serviço","-","AGETOP",20109,"DEM.PISO CIMENT.SOBRE LASTRO CONC.C/TR.ATE CB. E CARGA","m2    ",111.77,1,111.77,null,null,0,0,""]
["S",3,"S",0,1,1,1,0,0,0,0,"","Serviço","Serviço","-","SINAPI",97644,"REMOÇÃO DE PORTAS, DE FORMA MANUAL, SEM REAPROVEITAMENTO. AF_12/2017","M2",6.7200000000000006,1,6.7200000000000006,null,null,0,0,"Referência: AGETOP - 20106"]
["S",3,"S",0,1,1,1,0,0,0,0,"","Serviço","Serviço","-","AGETOP",20137,"DEMOLIÇAO BACIA SANITARIA C/ TRANSP. ATÉ CB. E CARGA","Un    ",1,1,1,null,null,0,0,""]
["S",3,"S",0,1,1,1,0,0,0,0,"","Serviço","Serviço","-","AGETOP",20141,"DEMOLIÇAO DE CAIXA DESCARGA EXTERNA C/ TRANSP. ATÉ CB. E CARGA","Un    ",1,1,1,null,null,0,0,""]
["S",3,"S",0,1,1,1,0,0,0,0,"","Serviço","Serviço","-","AGETOP",20163,"DEMOLIÇÃO DAS INSTALAÇÕES HIDROSANITÁRIAS E AFINS C/ TRANSP. ATÉ CB. E CARGA","H     ",2,1,2,null,null,0,0,""]
[3,3,3,3,1,1,2,0,0,35,3,"","Nível 3","Nível 3","-","SINAPI",null,"READEQUAÇÕES DE ALGUNS AMBIENTES","-",null,1,"-",null,null,0,0,""]
["S",3,"S",0,1,1,2,0,0,0,0,"","Serviço","Serviço","-","SINAPI",97622,"DEMOLIÇÃO DE ALVENARIA DE BLOCO FURADO, DE FORMA MANUAL, SEM REAPROVEITAMENTO. AF_12/2017","M3",4.3064999999999998,1,4.3064999999999998,null,null,0,0,"Referência: AGETOP - 20118"]
["S",3,"S",0,1,1,2,0,0,0,0,"","Serviço","Serviço","-","SINAPI",97644,"REMOÇÃO DE PORTAS, DE FORMA MANUAL, SEM REAPROVEITAMENTO. AF_12/2017","M2",10.920000000000002,1,10.920000000000002,null,null,0,0,"Referência: AGETOP - 20106"]
[3,3,3,6,1,1,3,0,0,32,6,"","Nível 3","Nível 3","-","SINAPI",null,"READEQUAÇÕES COZINHA ATUAL PARA SALA DE AULA","-",null,1,"-",null,null,0,0,""]
["S",3,"S",0,1,1,3,0,0,0,0,"","Serviço","Serviço","-","SINAPI",97622,"DEMOLIÇÃO DE ALVENARIA DE BLOCO FURADO, DE FORMA MANUAL, SEM REAPROVEITAMENTO. AF_12/2017","M3",8.0295000000000005,1,8.0295000000000005,null,null,0,0,"Referência: AGETOP - 20118"]
["S",3,"S",0,1,1,3,0,0,0,0,"","Serviço","Serviço","-","AGETOP",20109,"DEM.PISO CIMENT.SOBRE LASTRO CONC.C/TR.ATE CB. E CARGA","m2    ",59.769999999999996,1,59.769999999999996,null,null,0,0,""]
["S",3,"S",0,1,1,3,0,0,0,0,"","Serviço","Serviço","-","AGETOP",20163,"DEMOLIÇÃO DAS INSTALAÇÕES HIDROSANITÁRIAS E AFINS C/ TRANSP. ATÉ CB. E CARGA","H     ",8,1,8,null,null,0,0,""]
["S",3,"S",0,1,1,3,0,0,0,0,"","Serviço","Serviço","-","SINAPI",97633,"DEMOLIÇÃO DE REVESTIMENTO CERÂMICO, DE FORMA MANUAL, SEM REAPROVEITAMENTO. AF_12/2017","M2",66.66,1,66.66,null,null,0,0,"Referência: AGETOP - 20115"]
["S",3,"S",0,1,1,3,0,0,0,0,"","Serviço","Serviço","-","SINAPI",97644,"REMOÇÃO DE PORTAS, DE FORMA MANUAL, SEM REAPROVEITAMENTO. AF_12/2017","M2",5.0400000000000009,1,5.0400000000000009,null,null,0,0,"Referência: AGETOP - 20106"]
[3,3,3,3,1,1,4,0,0,26,3,"","Nível 3","Nível 3","-","SINAPI",null,"REFORMA COBERTURA","-",null,1,"-",null,null,0,0,""]
["S",3,"S",0,1,1,4,0,0,0,0,"","Serviço","Serviço","-","AGETOP",20101,"DEMOLICAO COBERTURA TELHA CERAMICA C/ TRANSP. ATÉ CB. E CARGA","m2    ",543.73,1,543.73,null,null,0,0,""]
["S",3,"S",0,1,1,4,0,0,0,0,"","Serviço","Serviço","-","AGETOP",20104,"DEMOLIÇÃO DE RIPAS C/ TRANSP. ATÉ CB. E CARGA","m2    ",543.73,1,543.73,null,null,0,0,""]
[3,3,3,3,1,1,5,0,0,23,3,"","Nível 3","Nível 3","-","SINAPI",null,"REFORMA DO FORRO","-",null,1,"-",null,null,0,0,""]
["S",3,"S",0,1,1,5,0,0,0,0,"","Serviço","Serviço","-","SINAPI",97640,"REMOÇÃO DE FORROS DE DRYWALL, PVC E FIBROMINERAL, DE FORMA MANUAL, SEM REAPROVEITAMENTO. AF_12/2017","M2",781.98,1,781.98,null,null,0,0,""]
["S",3,"S",0,1,1,5,0,0,0,0,"","Serviço","Serviço","-","SINAPI",97642,"REMOÇÃO DE TRAMA METÁLICA OU DE MADEIRA PARA FORRO, DE FORMA MANUAL, SEM REAPROVEITAMENTO. AF_12/2017","M2",781.89,1,781.89,null,null,0,0,""]
[3,3,3,9,1,1,6,0,0,20,9,"","Nível 3","Nível 3","-","SINAPI",null,"BANHEIROS","-",null,1,"-",null,null,0,0,""]
["S",3,"S",0,1,1,6,0,0,0,0,"","Serviço","Serviço","-","AGETOP",20111,"DEM.PISO CERAM.SOBRE LASTRO CONC.C/TR.CB.E CARGA","m2    ",47.38,1,47.38,null,null,0,0,""]
["S",3,"S",0,1,1,6,0,0,0,0,"","Serviço","Serviço","-","SINAPI",97633,"DEMOLIÇÃO DE REVESTIMENTO CERÂMICO, DE FORMA MANUAL, SEM REAPROVEITAMENTO. AF_12/2017","M2",189.28,1,189.28,null,null,0,0,"Referência: AGETOP - 20115"]
["S",3,"S",0,1,1,6,0,0,0,0,"","Serviço","Serviço","-","AGETOP",20137,"DEMOLIÇAO BACIA SANITARIA C/ TRANSP. ATÉ CB. E CARGA","Un    ",9,1,9,null,null,0,0,""]
["S",3,"S",0,1,1,6,0,0,0,0,"","Serviço","Serviço","-","AGETOP",20140,"DEMOLIÇAO DE VÁLVULA DE DESCARGA C/ TRANSP. ATÉ CB. E CARGA","Un    ",9,1,9,null,null,0,0,""]
["S",3,"S",0,1,1,6,0,0,0,0,"","Serviço","Serviço","-","SINAPI",97644,"REMOÇÃO DE PORTAS, DE FORMA MANUAL, SEM REAPROVEITAMENTO. AF_12/2017","M2",18,1,18,null,null,0,0,"Referência: AGETOP - 20106"]
["S",3,"S",0,1,1,6,0,0,0,0,"","Serviço","Serviço","-","AGETOP",20163,"DEMOLIÇÃO DAS INSTALAÇÕES HIDROSANITÁRIAS E AFINS C/ TRANSP. ATÉ CB. E CARGA","H     ",8,1,8,null,null,0,0,""]
["S",3,"S",0,1,1,6,0,0,0,0,"","Serviço","Serviço","-","SINAPI",97622,"DEMOLIÇÃO DE ALVENARIA DE BLOCO FURADO, DE FORMA MANUAL, SEM REAPROVEITAMENTO. AF_12/2017","M3",1.2135,1,1.2135,null,null,0,0,"Referência: AGETOP - 20118"]
["S",3,"S",0,1,1,6,0,0,0,0,"","Serviço","Serviço","-","AGETOP",20139,"DEMOLIÇAO DE BANCADAS C/ TRANSP. ATÉ CB. E CARGA","m2    ",1.33,1,1.33,null,null,0,0,""]
[3,3,3,3,1,1,7,0,0,11,3,"","Nível 3","Nível 3","-","SINAPI",null,"ESCOVODROMO","-",null,1,"-",null,null,0,0,""]
["S",3,"S",0,1,1,7,0,0,0,0,"","Serviço","Serviço","-","AGETOP",20163,"DEMOLIÇÃO DAS INSTALAÇÕES HIDROSANITÁRIAS E AFINS C/ TRANSP. ATÉ CB. E CARGA","H     ",2,1,2,null,null,0,0,""]
["S",3,"S",0,1,1,7,0,0,0,0,"","Serviço","Serviço","-","SINAPI",97633,"DEMOLIÇÃO DE REVESTIMENTO CERÂMICO, DE FORMA MANUAL, SEM REAPROVEITAMENTO. AF_12/2017","M2",7,1,7,null,null,0,0,"Referência: AGETOP - 20115"]
[3,3,3,3,1,1,8,0,0,8,3,"","Nível 3","Nível 3","-","SINAPI",null,"DEPOSITO PÁTIO","-",null,1,"-",null,null,0,0,""]
["S",3,"S",0,1,1,8,0,0,0,0,"","Serviço","Serviço","-","AGETOP",20111,"DEM.PISO CERAM.SOBRE LASTRO CONC.C/TR.CB.E CARGA","m2    ",6.8,1,6.8,null,null,0,0,""]
["S",3,"S",0,1,1,8,0,0,0,0,"","Serviço","Serviço","-","SINAPI",97633,"DEMOLIÇÃO DE REVESTIMENTO CERÂMICO, DE FORMA MANUAL, SEM REAPROVEITAMENTO. AF_12/2017","M2",45.6,1,45.6,null,null,0,0,"Referência: AGETOP - 20115"]
[3,3,3,2,1,1,9,0,0,5,2,"","Nível 3","Nível 3","-","SINAPI",null,"CALÇADA ACESSÍVEL","-",null,1,"-",null,null,0,0,""]
["S",3,"S",0,1,1,9,0,0,0,0,"","Serviço","Serviço","-","AGETOP",20109,"DEM.PISO CIMENT.SOBRE LASTRO CONC.C/TR.ATE CB. E CARGA","m2    ",309.49,1,309.49,null,null,0,0,""]
[3,{"$f":"IF(OR(C63=\"s\",C63=0),OFFSET(B63,-1,0),C63)","v":3},{"$f":"IF(OFFSET(C63,-1,0)=\"L\",1,IF(OFFSET(C63,-1,0)=1,2,IF(OR(A63=\"s\",A63=0),\"S\",IF(AND(OFFSET(C63,-1,0)=2,A63=4),3,IF(AND(OR(OFFSET(C63,-1,0)=\"s\",OFFSET(C63,-1,0)=0),A63<>\"s\",A63>OFFSET(B63,-1,0)),OFFSET(B63,-1,0),A63)))))","v":3},{"$f":"IF(OR(C63=\"S\",C63=0),0,IF(ISERROR(K63),J63,SMALL(J63:K63,1)))","v":3},1,1,10,0,0,3,{"$error":"#N/A"},"","Nível 3","Nível 3","-","SINAPI",null,"REFORMA GERAL","-",null,1,"-",null,null,0,0,""]
["S",3,"S",0,1,1,10,0,0,0,0,"","Serviço","Serviço","-","AGETOP",20162,"DEMOLIÇÃO DAS INSTALAÇÕES ELÉTRICAS E AFINS C/ TRANSP. ATÉ CB. E CARGA","H     ",24,1,24,null,null,0,0,""]
["S",3,"S",0,1,1,10,0,0,0,0,"","Serviço","Serviço","-","SINAPI","74209/1","PLACA DE OBRA EM CHAPA DE ACO GALVANIZADO","M2",4.5,1,4.5,null,null,0,0,"Referência: AGETOP - 21301"]
[2,2,2,2,1,2,0,0,0,385,2,"","Nível 2","Nível 2","-","AGETOP",null,"TRANSPORTES","-",null,1,"-",null,null,0,0,""]
["S",2,"S",0,1,2,0,0,0,0,0,"","Serviço","Serviço","-","SINAPI",72900,"TRANSPORTE DE ENTULHO COM CAMINHAO BASCULANTE 6 M3, RODOVIA PAVIMENTADA, DMT 0,5 A 1,0 KM","M3",51.767600000000009,1,51.767600000000009,null,null,0,0,""]
[2,2,2,7,1,3,0,0,0,383,7,"","Nível 2","Nível 2","-","AGETOP",null,"SERVIÇO EM TERRA","-",null,1,"-",null,null,0,0,""]
[3,3,3,3,1,3,1,0,0,6,3,"","Nível 3","Nível 3","-",null,null,"CALÇADA ACESSIVEL","-",null,1,"-",null,null,0,0,""]
["S",3,"S",0,1,3,1,0,0,0,0,"","Serviço","Serviço","-","AGETOP",20190,"LIMPEZA MECANICA DE TERRENO","m2    ",449.8,1,449.8,null,null,0,0,"Referência: AGETOP - 41008"]
["S",3,"S",0,1,3,1,0,0,0,0,"","Serviço","Serviço","-","AGETOP",41002,"APILOAMENTO","m2    ",759.29,1,759.29,null,null,0,0,""]
[3,3,3,3,1,3,2,0,0,3,128,"","Nível 3","Nível 3","-",null,null,"REFORMA ELÉTRICA","-",null,1,"-",null,null,0,0,""]
[{"$f":"CHOOSE(1+LOG(1+2*(ORÇAMENTO.Nivel=\"Nível 1\")+4*(ORÇAMENTO.Nivel=\"Nível 2\")+8*(ORÇAMENTO.Nivel=\"Nível 3\")+16*(ORÇAMENTO.Nivel=\"Nível 4\")+32*(ORÇAMENTO.Nivel=\"Serviço\"),2),0,1,2,3,4,\"S\")","v":"S"},3,"S",0,1,3,2,0,{"$f":"IF(AND($C73<=4,$C73<>0),0,IF(AND($C73=\"S\",$Y73>0),OFFSET(I73,-1,0)+1,OFFSET(I73,-1,0)))","v":0},0,0,"","Serviço","Serviço","-","SINAPI",93358,"ESCAVAÇÃO MANUAL DE VALA COM PROFUNDIDADE MENOR OU IGUAL A 1,30 M. AF_03/2016","M3",20,1,20,null,null,0,0,"Referência: AGETOP - 40101"]
["S",3,"S",0,1,3,2,0,0,0,0,"","Serviço","Serviço","-","SINAPI",96995,"REATERRO MANUAL APILOADO COM SOQUETE. AF_10/2017","M3",20,1,20,null,null,0,0,"Referência: AGETOP - 40902"]
[{"$f":"CHOOSE(1+LOG(1+2*(ORÇAMENTO.Nivel=\"Nível 1\")+4*(ORÇAMENTO.Nivel=\"Nível 2\")+8*(ORÇAMENTO.Nivel=\"Nível 3\")+16*(ORÇAMENTO.Nivel=\"Nível 4\")+32*(ORÇAMENTO.Nivel=\"Serviço\"),2),0,1,2,3,4,\"S\")","v":2},{"$f":"IF(OR(C75=\"s\",C75=0),OFFSET(B75,-1,0),C75)","v":2},{"$f":"IF(OFFSET(C75,-1,0)=\"L\",1,IF(OFFSET(C75,-1,0)=1,2,IF(OR(A75=\"s\",A75=0),\"S\",IF(AND(OFFSET(C75,-1,0)=2,A75=4),3,IF(AND(OR(OFFSET(C75,-1,0)=\"s\",OFFSET(C75,-1,0)=0),A75<>\"s\",A75>OFFSET(B75,-1,0)),OFFSET(B75,-1,0),A75)))))","v":2},{"$f":"IF(OR(C75=\"S\",C75=0),0,IF(ISERROR(K75),J75,SMALL(J75:K75,1)))","v":151},{"$f":"IF($C75=1,OFFSET(E75,-1,0)+1,OFFSET(E75,-1,0))","v":1},{"$f":"IF($C75=1,0,IF($C75=2,OFFSET(F75,-1,0)+1,OFFSET(F75,-1,0)))","v":4},{"$f":"IF(AND($C75<=2,$C75<>0),0,IF($C75=3,OFFSET(G75,-1,0)+1,OFFSET(G75,-1,0)))","v":0},{"$f":"IF(AND($C75<=3,$C75<>0),0,IF($C75=4,OFFSET(H75,-1,0)+1,OFFSET(H75,-1,0)))","v":0},{"$f":"IF(AND($C75<=4,$C75<>0),0,IF(AND($C75=\"S\",$Y75>0),OFFSET(I75,-1,0)+1,OFFSET(I75,-1,0)))","v":0},376,151,"","Nível 2","Nível 2","-",null,null,"INSTALAÇÕES ELÉTRICAS","-",null,1,"-",null,null,0,0,""]
[3,3,3,72,1,4,1,0,0,150,72,"","Nível 3","Nível 3","-","SINAPI",null,"SUBESTAÇÃO 75 KVA","-",null,1,"-",null,null,0,0,""]
["S",3,"S",0,1,4,1,0,0,0,0,"","Serviço","Serviço","-","SINAPI","73767/2","ALCA PRE-FORMADA DISTRIBUIÇÃO EM  ACO RECOBERTO COM ALUMINIO PARA CABO 25MM2, ENCAPADO. FORNECIMENTO E INSTALAÇÃO.","UN",1,1,1,null,null,0,0,""]
["S",3,"S",0,1,4,1,0,0,0,0,"","Serviço","Serviço","-","AGETOP",70218,"ARAME DE AÇO GALVANIZADO No. 12 BWG","M     ",3,1,3,null,null,0,0,""]
["S",3,"S",0,1,4,1,0,0,0,0,"","Serviço","Serviço","-","AGETOP",70252,"ARRUELA LISA D=5/16\"","Un    ",8,1,8,null,null,0,0,""]
["S",3,"S",0,1,4,1,0,0,0,0,"","Serviço","Serviço","-","AGETOP",70268,"BARRA DE COBRE 2\" X 3/16\"  (2,0865 KG/M)","m     ",1.5,1,1.5,null,null,0,0,""]
["S",3,"S",0,1,4,1,0,0,0,0,"","Serviço","Serviço","-","AGETOP",72630,"TRILHO OU SUPORTE P/BORNE TERMINAL","M     ",0.2,1,0.2,null,null,0,0,""]
["S",3,"S",0,1,4,1,0,0,0,0,"","Serviço","Serviço","-","SINAPI",91175,"FIXAÇÃO DE TUBOS VERTICAIS DE PPR DIÂMETROS MAIORES QUE 75 MM COM ABRAÇADEIRA METÁLICA RÍGIDA TIPO D 3\", FIXADA EM PERFILADO EM ALVENARIA. AF_05/2015","M",6,1,6,null,null,0,0,""]
["S",3,"S",0,1,4,1,0,0,{"$f":"IF(OR($C83=\"S\",$C83=0),0,MATCH(0,OFFSET($D83,1,$C83,ROW($C$923)-ROW($C83)),0))","v":0},{"$f":"IF(OR($C83=\"S\",$C83=0),0,MATCH(OFFSET($D83,0,$C83)+1,OFFSET($D83,1,$C83,ROW($C$923)-ROW($C83)),0))","v":0},"","Serviço","Serviço","-","AGETOP",70386,"BRAÇO C AÇO GALVANIZADO , CONFORME NTD-17","un    ",1,1,1,null,null,0,0,""]
["S",3,"S",0,1,4,1,0,0,0,0,"","Serviço","Serviço","-","AGETOP",70422,"BUCHA E ARRUELA METALICA DIAM. 1\"","PR    ",2,1,2,null,null,0,0,""]
["S",3,"S",0,1,4,1,0,0,0,0,"","Serviço","Serviço","-","AGETOP",70425,"BUCHA E ARRUELA METALICA DIAM. 2\"","PR    ",2,1,2,null,null,0,0,""]
["S",3,"S",0,1,4,1,0,0,0,0,"","Serviço","Serviço","-","AGETOP",70428,"BUCHA E ARRUELA METALICA DIAM. 4\"","PR    ",4,1,4,null,null,0,0,""]
["S",3,"S",0,1,4,1,0,0,0,0,"","Serviço","Serviço","-","AGETOP",70378,"BRACADEIRA METALICA TIPO \"D\" DIAM. 4\"","Un    ",20,1,20,null,null,0,0,""]
["S",3,"S",0,1,4,1,0,0,0,0,"","Serviço","Serviço","-","SINAPI",92980,"CABO DE COBRE FLEXÍVEL ISOLADO, 10 MM², ANTI-CHAMA 0,6/1,0 KV, PARA DISTRIBUIÇÃO - FORNECIMENTO E INSTALAÇÃO. AF_12/2015","M",5,1,5,null,null,0,0,""]
["S",3,"S",0,1,4,1,0,0,0,0,"","Serviço","Serviço","-","SINAPI",92984,"CABO DE COBRE FLEXÍVEL ISOLADO, 25 MM², ANTI-CHAMA 0,6/1,0 KV, PARA DISTRIBUIÇÃO - FORNECIMENTO E INSTALAÇÃO. AF_12/2015","M",40,1,40,null,null,0,0,"Referência: AGETOP - 70511"]
["S",3,"S",0,1,4,1,0,0,0,0,"","Serviço","Serviço","-","SINAPI",92988,"CABO DE COBRE FLEXÍVEL ISOLADO, 50 MM², ANTI-CHAMA 0,6/1,0 KV, PARA DISTRIBUIÇÃO - FORNECIMENTO E INSTALAÇÃO. AF_12/2015","M",160,1,160,null,null,0,0,""]
[{"$f":"CHOOSE(1+LOG(1+2*(ORÇAMENTO.Nivel=\"Nível 1\")+4*(ORÇAMENTO.Nivel=\"Nível 2\")+8*(ORÇAMENTO.Nivel=\"Nível 3\")+16*(ORÇAMENTO.Nivel=\"Nível 4\")+32*(ORÇAMENTO.Nivel=\"Serviço\"),2),0,1,2,3,4,\"S\")","v":"S"},3,"S",0,1,4,1,0,{"$f":"IF(AND($C91<=4,$C91<>0),0,IF(AND($C91=\"S\",$Y91>0),OFFSET(I91,-1,0)+1,OFFSET(I91,-1,0)))","v":0},0,0,"","Serviço","Serviço","-","AGETOP",70543,"CABO DE COBRE NÚ No. 35 MM2","M     ",15,1,15,null,null,0,0,""]
["S",3,"S",0,1,4,1,0,0,0,0,"","Serviço","Serviço","-","AGETOP",70505,"CABECOTE DE LIGA DE ALUMINIO DIAM. 2.1/2\"","Un    ",1,1,1,null,null,0,0,""]
["S",3,"S",0,1,4,1,0,0,0,0,"","Serviço","Serviço","-","SINAPI",96977,"CORDOALHA DE COBRE NU 50 MM², ENTERRADA, SEM ISOLADOR - FORNECIMENTO E INSTALAÇÃO. AF_12/2017","M",20,1,20,null,null,0,0,""]
["S",3,"S",0,{"$f":"IF($C94=1,OFFSET(E94,-1,0)+1,OFFSET(E94,-1,0))","v":1},{"$f":"IF($C94=1,0,IF($C94=2,OFFSET(F94,-1,0)+1,OFFSET(F94,-1,0)))","v":4},{"$f":"IF(AND($C94<=2,$C94<>0),0,IF($C94=3,OFFSET(G94,-1,0)+1,OFFSET(G94,-1,0)))","v":1},{"$f":"IF(AND($C94<=3,$C94<>0),0,IF($C94=4,OFFSET(H94,-1,0)+1,OFFSET(H94,-1,0)))","v":0},0,0,0,"","Serviço","Serviço","-","AGETOP",70720,"CAIXA METÁLICA PARA MEDIDOR POLIFÁSICO PADRÃO ENEL 500X380X166MM","Un    ",1,1,1,null,null,0,0,""]
["S",3,"S",0,1,4,1,0,0,0,0,"","Serviço","Serviço","-","AGETOP",70695,"CAIXA METÁLICA PARA PROTEÇÃO GERAL 580X500X216MM ATÉ 175A","Un    ",1,1,1,null,null,0,0,""]
["S",3,"S",0,1,4,1,0,0,0,0,"","Serviço","Serviço","-","SINAPI",97893,"CAIXA ENTERRADA ELÉTRICA RETANGULAR, EM ALVENARIA COM BLOCOS DE CONCRETO, FUNDO COM BRITA, DIMENSÕES INTERNAS: 0,8X0,8X0,6 M. AF_05/2018","UN",1,1,1,null,null,0,0,""]
["S",3,"S",0,1,4,1,0,0,0,0,"","Serviço","Serviço","-","AGETOP",70771,"CANTONEIRA AUXILIAR PARA BRAÇO TIPO C","un    ",1,1,1,null,null,0,0,""]
["S",3,"S",0,1,4,1,0,0,0,0,"","Serviço","Serviço","-","AGETOP",70920,"CINTA DE ACO GALVANIZADO DIAM.190 MM","Un    ",1,1,1,null,null,0,0,""]
["S",{"$f":"IF(OR(C99=\"s\",C99=0),OFFSET(B99,-1,0),C99)","v":3},{"$f":"IF(OFFSET(C99,-1,0)=\"L\",1,IF(OFFSET(C99,-1,0)=1,2,IF(OR(A99=\"s\",A99=0),\"S\",IF(AND(OFFSET(C99,-1,0)=2,A99=4),3,IF(AND(OR(OFFSET(C99,-1,0)=\"s\",OFFSET(C99,-1,0)=0),A99<>\"s\",A99>OFFSET(B99,-1,0)),OFFSET(B99,-1,0),A99)))))","v":"S"},{"$f":"IF(OR(C99=\"S\",C99=0),0,IF(ISERROR(K99),J99,SMALL(J99:K99,1)))","v":0},1,4,1,0,0,0,0,"","Serviço","Serviço","-","AGETOP",70921,"CINTA DE ACO GALVANIZADO DIAM.220 MM","Un    ",4,1,4,null,null,0,0,""]
["S",3,"S",0,1,4,1,0,0,0,0,"","Serviço","Serviço","-","AGETOP",70922,"CINTA DE ACO GALVANIZADO DIAM.230MM","Un    ",2,1,2,null,null,0,0,""]
["S",3,"S",0,1,4,1,0,0,0,0,"","Serviço","Serviço","-","AGETOP",71016,"CONECTOR DE COMPRESSÃO FORMATO H PARA CABO 25 A 70 MM2","un    ",4,1,4,null,null,0,0,""]
["S",3,"S",0,1,4,1,0,0,0,0,"","Serviço","Serviço","-","AGETOP",71020,"CONECTOR PARAL. ALUM.EXTRUD.CA-CU-10,0D.10-2-1 PARAF.","Un    ",6,1,6,null,null,0,0,""]
["S",3,"S",0,1,4,1,0,0,0,0,"","Serviço","Serviço","-","SINAPI",72272,"CONECTOR PARAFUSO FENDIDO \u0094SPLIT-BOLT\u0094 - PARA CABO DE 35MM2 - FORNECIMENTO E INSTALACAO","UN",1,1,1,null,null,0,0,""]
["S",3,"S",0,1,4,1,0,0,0,0,"","Serviço","Serviço","-","AGETOP",71036,"CONECTOR TIPO PARAFUSO FENDIDO 50 MM2","Un    ",8,1,8,null,null,0,0,""]
["S",3,"S",0,1,4,1,0,0,0,0,"","Serviço","Serviço","-","AGETOP",71142,"CURVA DE 90 GRAUS DE PVC RIGIDO DIAM. 1\"","Un    ",1,1,1,null,null,0,0,""]
["S",3,"S",0,1,4,1,0,0,0,0,"","Serviço","Serviço","-","SINAPI",93026,"CURVA 90 GRAUS PARA ELETRODUTO, PVC, ROSCÁVEL, DN 110 MM (4\") - FORNECIMENTO E INSTALAÇÃO. AF_12/2015","UN",1,1,1,null,null,0,0,""]
["S",3,"S",0,1,4,1,0,0,0,0,"","Serviço","Serviço","-","AGETOP",71186,"DISPOSITIVO DE PROTEÇÃO CONTRA SURTOS (D.P.S.) 275V DE 90KA","Un    ",3,1,3,null,null,0,0,""]
["S",3,"S",0,1,4,1,0,0,0,0,"","Serviço","Serviço","-","SINAPI","74130/6","DISJUNTOR TERMOMAGNETICO TRIPOLAR PADRAO NEMA (AMERICANO) 125 A 150A 240V, FORNECIMENTO E INSTALACAO","UN",2,1,2,null,null,0,0,""]
["S",3,"S",0,1,4,1,0,0,0,0,"","Serviço","Serviço","-","AGETOP",71202,"ELETRODUTO DE PVC RIGIDO DIAMETRO 1\"","M     ",3,1,3,null,null,0,0,""]
["S",3,"S",0,1,4,1,0,0,0,0,"","Serviço","Serviço","-","SINAPI",93012,"ELETRODUTO RÍGIDO ROSCÁVEL, PVC, DN 110 MM (4\") - FORNECIMENTO E INSTALAÇÃO. AF_12/2015","M",30,1,30,null,null,0,0,""]
["S",3,"S",0,1,4,1,0,0,0,0,"","Serviço","Serviço","-","AGETOP",71218,"ELETRODUTO EM AÇO GALVANIZADO A FOGO DIÂMETRO 4\" - PESADO ","M     ",7,1,7,null,null,0,0,""]
["S",3,"S",0,1,4,1,0,0,0,0,"","Serviço","Serviço","-","AGETOP",71268,"ELO FUSÍVEL 6 K","Un    ",3,1,3,null,null,0,0,""]
["S",3,"S",0,1,4,1,0,0,0,0,"","Serviço","Serviço","-","AGETOP",71321,"FITA DE AUTO FUSAO, ROLO E 10,00 MM","Un    ",5,1,5,null,null,0,0,""]
["S",3,"S",0,1,4,1,0,0,0,0,"","Serviço","Serviço","-","AGETOP",71365,"GRAMPO DE ANCORAGEM POLIMÉRICO","un    ",3,1,3,null,null,0,0,""]
["S",3,"S",0,1,4,1,0,0,0,0,"","Serviço","Serviço","-","AGETOP",71381,"HASTE REV.COBRE(COPPERWELD)  5/8\" X 3,00 M C/CONECTOR","Un    ",4,1,4,null,null,0,0,""]
["S",3,"S",0,1,4,1,0,0,0,0,"","Serviço","Serviço","-","AGETOP",71463,"ISOLADOR EPOXI 50X40 (BUJAO)","Un    ",2,1,2,null,null,0,0,""]
["S",3,"S",0,1,4,1,0,0,0,0,"","Serviço","Serviço","-","AGETOP",71476,"ISOLADOR DE ANCORAGEM POLIMÉRICO 15KV","un    ",1,1,1,null,null,0,0,""]
["S",3,"S",0,1,4,1,0,0,0,0,"","Serviço","Serviço","-","AGETOP",71480,"ISOLADOR ROLDANA PORCELANA 72 X 72","Un    ",3,1,3,null,null,0,0,""]
["S",3,"S",0,1,4,1,0,0,0,0,"","Serviço","Serviço","-","AGETOP",71510,"LACO PREFORMADO DE DISTRIBUICAO","Un    ",1,1,1,null,null,0,0,""]
["S",3,"S",0,1,4,1,0,0,0,0,"","Serviço","Serviço","-","AGETOP",71742,"LUVA PVC ROSQUEAVEL DIAMETRO 1\"","Un    ",2,1,2,null,null,0,0,""]
["S",3,"S",0,1,4,1,0,0,0,0,"","Serviço","Serviço","-","SINAPI",93017,"LUVA PARA ELETRODUTO, PVC, ROSCÁVEL, DN 110 MM (4\") - FORNECIMENTO E INSTALAÇÃO. AF_12/2015","UN",15,1,15,null,null,0,0,"Referência: AGETOP - 71748"]
["S",3,"S",0,1,4,1,0,0,0,0,"","Serviço","Serviço","-","AGETOP",71708,"LUVA EM AÇO GALVANIZADO DIÂMETRO 4\"","Un    ",4,1,4,null,null,0,0,""]
["S",3,"S",0,1,4,1,0,0,0,0,"","Serviço","Serviço","-","AGETOP",71750,"MANILHA-SAPATILHA EM AÇO GALVANIZADO","un    ",3,1,3,null,null,0,0,""]
["S",3,"S",0,1,4,1,0,0,0,0,"","Serviço","Serviço","-","AGETOP",71761,"MURETA MEDIÇÃO ALVEN. 1 1/2 V.(35CM) REBOC.C/PINTURA ACRÍL. E LAJE CONC. 20MPA MALHA 8.0MM CADA 10CM REVEST.C/ARGAMASSA 1:3 C/ IMPERMEABILIZANTE","m2    ",4,1,4,null,null,0,0,""]
["S",3,"S",0,1,4,1,0,0,0,0,"","Serviço","Serviço","-","AGETOP",71773,"NIPLE METALICO Fo.Zo. DIAMETRO 1\"","Un    ",1,1,1,null,null,0,0,""]
["S",3,"S",0,1,4,1,0,0,0,0,"","Serviço","Serviço","-","AGETOP",71780,"NIPLE METALICO Fo.Zo. DIAMETRO 4\"","Un    ",2,1,2,null,null,0,0,""]
["S",3,"S",0,1,4,1,0,0,0,0,"","Serviço","Serviço","-","AGETOP",85047,"NIPLE DUPLO FERRO GALVANIZADO 2.1/2\"","Un    ",1,1,1,null,null,0,0,""]
["S",3,"S",0,1,4,1,0,0,0,0,"","Serviço","Serviço","-","AGETOP",71795,"OLHAL PARA PARAFUSO","un    ",3,1,3,null,null,0,0,""]
["S",3,"S",0,1,4,1,0,0,0,0,"","Serviço","Serviço","-","AGETOP",71835,"PARAFUSO CABEÇA ABAULADA (FRANCES) M16 X 45 MM","Un    ",3,1,3,null,null,0,0,""]
["S",3,"S",0,1,4,1,0,0,0,0,"","Serviço","Serviço","-","AGETOP",71841,"PARAFUSO CABEÇA ABAULADA (FRANCES) M16 X 150 MM","Un    ",3,1,3,null,null,0,0,""]
["S",3,"S",0,1,4,1,0,0,0,0,"","Serviço","Serviço","-","AGETOP",71833,"PARA RAIOS DISTRIBUIDOR POLIMÉRICO ÓXIDO DE ZINCO S/CENTELHADOR C/ DESLIGAMENTO AUTOMÁTICO 15KV,10KA","Un    ",3,1,3,null,null,0,0,""]
["S",3,"S",0,1,4,1,0,0,0,0,"","Serviço","Serviço","-","AGETOP",71997,"POSTE - FUNDAÇÃO EM CONCRETO SIMPLES DA BASE DOS POSTES 11/600 PARA TRAFO ( DIAM. 1000MM)","m     ",0.3,1,0.3,null,null,0,0,""]
["S",3,"S",0,1,4,1,0,0,0,0,"","Serviço","Serviço","-","AGETOP",72061,"POSTE DE CONCRETO SC 11/600 - SEM FUNDAÇÃO/CONCRETO","Un    ",1,1,1,null,null,0,0,""]
["S",3,"S",0,1,4,1,0,0,0,0,"","Serviço","Serviço","-","AGETOP",72080,"POSTE/TRAFO - CAMINHÃO MUNCK 12 TON. (MÍNIMO 4H/DIA)","H     ",4,1,4,null,null,0,0,""]
["S",3,"S",0,1,4,1,0,0,0,0,"","Serviço","Serviço","-","AGETOP",72329,"SAPATILHA DE AÇO GALVANIZADO PARA POSTE COM TRANSFORMADOR","un    ",3,1,3,null,null,0,0,""]
["S",3,"S",0,1,4,1,0,0,0,0,"","Serviço","Serviço","-","SINAPI",73624,"SUPORTE PARA TRANSFORMADOR EM POSTE DE CONCRETO CIRCULAR","UN",3,1,3,null,null,0,0,""]
["S",3,"S",0,1,4,1,0,0,0,0,"","Serviço","Serviço","-","AGETOP",72518,"TERMINAL DE PRESSAO 10 MM2","Un    ",3,1,3,null,null,0,0,""]
["S",3,"S",0,1,4,1,0,0,0,0,"","Serviço","Serviço","-","AGETOP",72523,"TERMINAL DE PRESSAO 25 MM2","Un    ",2,1,2,null,null,0,0,""]
["S",3,"S",0,1,4,1,0,0,0,0,"","Serviço","Serviço","-","AGETOP",72532,"TERMINAL DE PRESSAO 50 MM2","Un    ",10,1,10,null,null,0,0,""]
["S",3,"S",0,1,4,1,0,0,0,0,"","Serviço","Serviço","-","SINAPI","73857/1","TRANSFORMADOR DISTRIBUICAO  75KVA TRIFASICO 60HZ CLASSE 15KV IMERSO EM ÓLEO MINERAL FORNECIMENTO E INSTALACAO","UN",1,1,1,null,null,0,0,""]
["S",3,"S",0,1,4,1,0,0,0,0,"","Serviço","Serviço","-","SINAPI",88543,"ARMACAO SECUNDARIA OU REX COMPLETA PARA TRESLINHAS-FORNECIMENTO E INSTALACAO.","UN",1,1,1,null,null,0,0,""]
["S",3,"S",0,1,4,1,0,0,0,0,"","Serviço","Serviço","-","COMPOSIÇÃO","COMP 046_SEE","CAPUZ PARA PROTEÇÃO DOS PARA RAIOS","UN ",3,1,3,null,null,0,0,""]
["S",3,"S",0,1,4,1,0,0,0,0,"","Serviço","Serviço","-","COMPOSIÇÃO","COMP 047_SEE","CAPUZ DE PROTEÇÃO PARA BUCHA DE TRANSFORMADOR","UN ",3,1,3,null,null,0,0,""]
["S",3,"S",0,1,4,1,0,0,0,0,"","Serviço","Serviço","-","COMPOSIÇÃO","COMP 048_SEE","HASTE ROSQUEADA \"TIRANTE\" 3/8\"","M",0.5,1,0.5,null,null,0,0,""]
["S",3,"S",0,1,4,1,0,0,0,0,"","Serviço","Serviço","-","COMPOSIÇÃO","COMP 037_SEE","CAIXA DE INSPEÇÃO PVC 300X250MM+TP P/CX INSP GALV FOGO 300MM","UN ",1,1,1,null,null,0,0,""]
["S",3,"S",0,1,4,1,0,0,0,0,"","Serviço","Serviço","-","AGETOP",70255,"ATERRAMENTO - SOLDA EXOTÉRMICA - CARTUCHO 90 G","un    ",4,1,4,null,null,0,0,""]
["S",3,"S",0,1,4,1,0,0,{"$f":"IF(OR($C147=\"S\",$C147=0),0,MATCH(0,OFFSET($D147,1,$C147,ROW($C$923)-ROW($C147)),0))","v":0},{"$f":"IF(OR($C147=\"S\",$C147=0),0,MATCH(OFFSET($D147,0,$C147)+1,OFFSET($D147,1,$C147,ROW($C$923)-ROW($C147)),0))","v":0},"","Serviço","Serviço","-","COMPOSIÇÃO","COMP 049_SEE","PORCA SEXTAVADA 3/8\"","UN ",8,1,8,null,null,0,0,""]
[3,3,3,52,1,4,2,0,0,78,52,"","Nível 3","Nível 3","-","SINAPI",null,"REFORMA ELÉTRICA","-",null,1,"-",null,null,0,0,""]
["S",3,"S",0,1,4,2,0,0,0,0,"","Serviço","Serviço","-","SINAPI",91926,"CABO DE COBRE FLEXÍVEL ISOLADO, 2,5 MM², ANTI-CHAMA 450/750 V, PARA CIRCUITOS TERMINAIS - FORNECIMENTO E INSTALAÇÃO. AF_12/2015","M",4400,1,4400,null,null,0,0,"Referência: AGETOP - 70563"]
["S",3,"S",0,1,4,2,0,0,0,0,"","Serviço","Serviço","-","SINAPI",91928,"CABO DE COBRE FLEXÍVEL ISOLADO, 4 MM², ANTI-CHAMA 450/750 V, PARA CIRCUITOS TERMINAIS - FORNECIMENTO E INSTALAÇÃO. AF_12/2015","M",1451,1,1451,null,null,0,0,"Referência: AGETOP - 70564"]
["S",3,"S",0,1,4,2,0,0,0,0,"","Serviço","Serviço","-","SINAPI",91930,"CABO DE COBRE FLEXÍVEL ISOLADO, 6 MM², ANTI-CHAMA 450/750 V, PARA CIRCUITOS TERMINAIS - FORNECIMENTO E INSTALAÇÃO. AF_12/2015","M",1050,1,1050,null,null,0,0,"Referência: AGETOP - 70565"]
["S",3,"S",0,1,4,2,0,0,0,0,"","Serviço","Serviço","-","SINAPI",92982,"CABO DE COBRE FLEXÍVEL ISOLADO, 16 MM², ANTI-CHAMA 0,6/1,0 KV, PARA DISTRIBUIÇÃO - FORNECIMENTO E INSTALAÇÃO. AF_12/2015","M",8,1,8,null,null,0,0,"Referência: AGETOP - 70510"]
["S",3,"S",0,1,4,2,0,0,0,0,"","Serviço","Serviço","-","SINAPI",92984,"CABO DE COBRE FLEXÍVEL ISOLADO, 25 MM², ANTI-CHAMA 0,6/1,0 KV, PARA DISTRIBUIÇÃO - FORNECIMENTO E INSTALAÇÃO. AF_12/2015","M",30,1,30,null,null,0,0,"Referência: AGETOP - 70511"]
["S",3,"S",0,1,4,2,0,{"$f":"IF(AND($C154<=4,$C154<>0),0,IF(AND($C154=\"S\",$Y154>0),OFFSET(I154,-1,0)+1,OFFSET(I154,-1,0)))","v":0},0,0,"","Serviço","Serviço","-","AGETOP",70561,"CABO ISOLADO PP 3 X 2,5 MM2","M     ",100,1,100,null,null,0,0,""]
["S",3,"S",0,1,4,2,0,0,0,0,"","Serviço","Serviço","-","AGETOP",70681,"CAIXA METALICA OCTOGONAL FUNDO MOVEL, SIMPLES 2\"","Un    ",154,1,154,null,null,0,0,""]
["S",3,"S",0,1,4,2,0,0,0,0,"","Serviço","Serviço","-","SINAPI",91941,"CAIXA RETANGULAR 4\" X 2\" BAIXA (0,30 M DO PISO), PVC, INSTALADA EM PAREDE - FORNECIMENTO E INSTALAÇÃO. AF_12/2015","UN",112,1,112,null,null,0,0,""]
["S",3,"S",0,{"$f":"IF($C157=1,OFFSET(E157,-1,0)+1,OFFSET(E157,-1,0))","v":1},{"$f":"IF($C157=1,0,IF($C157=2,OFFSET(F157,-1,0)+1,OFFSET(F157,-1,0)))","v":4},{"$f":"IF(AND($C157<=2,$C157<>0),0,IF($C157=3,OFFSET(G157,-1,0)+1,OFFSET(G157,-1,0)))","v":2},{"$f":"IF(AND($C157<=3,$C157<>0),0,IF($C157=4,OFFSET(H157,-1,0)+1,OFFSET(H157,-1,0)))","v":0},0,0,0,"","Serviço","Serviço","-","SINAPI",91953,"INTERRUPTOR SIMPLES (1 MÓDULO), 10A/250V, INCLUINDO SUPORTE E PLACA - FORNECIMENTO E INSTALAÇÃO. AF_12/2015","UN",25,1,25,null,null,0,0,"Referência: AGETOP - 71440"]
["S",3,"S",0,1,4,2,0,0,0,0,"","Serviço","Serviço","-","SINAPI",91959,"INTERRUPTOR SIMPLES (2 MÓDULOS), 10A/250V, INCLUINDO SUPORTE E PLACA - FORNECIMENTO E INSTALAÇÃO. AF_12/2015","UN",3,1,3,null,null,0,0,"Referência: AGETOP - 71441"]
["S",3,"S",0,1,4,2,0,0,0,0,"","Serviço","Serviço","-","SINAPI",91967,"INTERRUPTOR SIMPLES (3 MÓDULOS), 10A/250V, INCLUINDO SUPORTE E PLACA - FORNECIMENTO E INSTALAÇÃO. AF_12/2015","UN",2,1,2,null,null,0,0,"Referência: AGETOP - 71442"]
["S",3,"S",0,1,4,2,0,0,0,0,"","Serviço","Serviço","-","SINAPI",92000,"TOMADA BAIXA DE EMBUTIR (1 MÓDULO), 2P+T 10 A, INCLUINDO SUPORTE E PLACA - FORNECIMENTO E INSTALAÇÃO. AF_12/2015","UN",74,1,74,null,null,0,0,"Referência: AGETOP - 72578"]
["S",3,"S",0,1,4,2,0,0,0,0,"","Serviço","Serviço","-","SINAPI",91993,"TOMADA ALTA DE EMBUTIR (1 MÓDULO), 2P+T 20 A, INCLUINDO SUPORTE E PLACA - FORNECIMENTO E INSTALAÇÃO. AF_12/2015","UN",20,1,20,null,null,0,0,"Referência: AGETOP - 72585"]
["S",3,"S",0,1,4,2,0,0,0,0,"","Serviço","Serviço","-","SINAPI",92008,"TOMADA BAIXA DE EMBUTIR (2 MÓDULOS), 2P+T 10 A, INCLUINDO SUPORTE E PLACA - FORNECIMENTO E INSTALAÇÃO. AF_12/2015","UN",8,1,8,null,null,0,0,""]
["S",{"$f":"IF(OR(C163=\"s\",C163=0),OFFSET(B163,-1,0),C163)","v":3},{"$f":"IF(OFFSET(C163,-1,0)=\"L\",1,IF(OFFSET(C163,-1,0)=1,2,IF(OR(A163=\"s\",A163=0),\"S\",IF(AND(OFFSET(C163,-1,0)=2,A163=4),3,IF(AND(OR(OFFSET(C163,-1,0)=\"s\",OFFSET(C163,-1,0)=0),A163<>\"s\",A163>OFFSET(B163,-1,0)),OFFSET(B163,-1,0),A163)))))","v":"S"},{"$f":"IF(OR(C163=\"S\",C163=0),0,IF(ISERROR(K163),J163,SMALL(J163:K163,1)))","v":0},1,4,2,0,0,0,0,"","Serviço","Serviço","-","SINAPI",97891,"CAIXA ENTERRADA ELÉTRICA RETANGULAR, EM ALVENARIA COM BLOCOS DE CONCRETO, FUNDO COM BRITA, DIMENSÕES INTERNAS: 0,4X0,4X0,4 M. AF_05/2018","UN",1,1,1,null,null,0,0,""]
["S",3,"S",0,1,4,2,0,0,0,0,"","Serviço","Serviço","-","SINAPI",93654,"DISJUNTOR MONOPOLAR TIPO DIN, CORRENTE NOMINAL DE 16A - FORNECIMENTO E INSTALAÇÃO. AF_04/2016","UN",14,1,14,null,null,0,0,""]
["S",3,"S",0,1,4,2,0,0,0,0,"","Serviço","Serviço","-","SINAPI",93656,"DISJUNTOR MONOPOLAR TIPO DIN, CORRENTE NOMINAL DE 25A - FORNECIMENTO E INSTALAÇÃO. AF_04/2016","UN",20,1,20,null,null,0,0,""]
["S",3,"S",0,1,4,2,0,0,0,0,"","Serviço","Serviço","-","SINAPI",93653,"DISJUNTOR MONOPOLAR TIPO DIN, CORRENTE NOMINAL DE 10A - FORNECIMENTO E INSTALAÇÃO. AF_04/2016","UN",4,1,4,null,null,0,0,""]
["S",3,"S",0,1,4,2,0,0,0,0,"","Serviço","Serviço","-","SINAPI",93669,"DISJUNTOR TRIPOLAR TIPO DIN, CORRENTE NOMINAL DE 20A - FORNECIMENTO E INSTALAÇÃO. AF_04/2016","UN",1,1,1,null,null,0,0,""]
["S",3,"S",0,1,4,2,0,0,0,0,"","Serviço","Serviço","-","SINAPI",93671,"DISJUNTOR TRIPOLAR TIPO DIN, CORRENTE NOMINAL DE 32A - FORNECIMENTO E INSTALAÇÃO. AF_04/2016","UN",3,1,3,null,null,0,0,"Referência: AGETOP - 71173"]
["S",3,"S",0,1,4,2,0,0,0,0,"","Serviço","Serviço","-","SINAPI",93673,"DISJUNTOR TRIPOLAR TIPO DIN, CORRENTE NOMINAL DE 50A - FORNECIMENTO E INSTALAÇÃO. AF_04/2016","UN",1,1,1,null,null,0,0,"Referência: AGETOP - 71174"]
["S",3,"S",0,1,4,2,0,0,0,0,"","Serviço","Serviço","-","SINAPI","74130/5","DISJUNTOR TERMOMAGNETICO TRIPOLAR PADRAO NEMA (AMERICANO) 60 A 100A 240V, FORNECIMENTO E INSTALACAO","UN",2,1,2,null,null,0,0,""]
["S",3,"S",0,1,4,2,0,0,0,0,"","Serviço","Serviço","-","SINAPI",91863,"ELETRODUTO RÍGIDO ROSCÁVEL, PVC, DN 25 MM (3/4\"), PARA CIRCUITOS TERMINAIS, INSTALADO EM FORRO - FORNECIMENTO E INSTALAÇÃO. AF_12/2015","M",1100,1,1100,null,null,0,0,""]
["S",3,"S",0,1,4,2,0,0,0,0,"","Serviço","Serviço","-","SINAPI",91872,"ELETRODUTO RÍGIDO ROSCÁVEL, PVC, DN 32 MM (1\"), PARA CIRCUITOS TERMINAIS, INSTALADO EM PAREDE - FORNECIMENTO E INSTALAÇÃO. AF_12/2015","M",180,1,180,null,null,0,0,"Referência: AGETOP - 71202"]
["S",3,"S",0,1,4,2,0,0,0,0,"","Serviço","Serviço","-","SINAPI",93009,"ELETRODUTO RÍGIDO ROSCÁVEL, PVC, DN 60 MM (2\") - FORNECIMENTO E INSTALAÇÃO. AF_12/2015","M",5,1,5,null,null,0,0,""]
["S",3,"S",0,1,4,2,0,0,0,0,"","Serviço","Serviço","-","SINAPI",97585,"LUMINÁRIA TIPO CALHA, DE SOBREPOR, COM 2 LÂMPADAS TUBULARES DE 18 W - FORNECIMENTO E INSTALAÇÃO. AF_11/2017","UN",150,1,150,null,null,0,0,""]
["S",3,"S",0,1,4,2,0,0,0,0,"","Serviço","Serviço","-","COMPOSIÇÃO","COMP 387_SEE","LÂMPADA LED TUBULAR 18W ","UN ",300,1,300,null,null,0,0,""]
["S",3,"S",0,1,4,2,0,0,0,0,"","Serviço","Serviço","-","SINAPI",97610,"LÂMPADA COMPACTA DE LED 10 W, BASE E27 - FORNECIMENTO E INSTALAÇÃO. AF_11/2017","UN",4,1,4,null,null,0,0,""]
["S",3,"S",0,1,4,2,0,0,0,0,"","Serviço","Serviço","-","AGETOP",71688,"LUMINÁRIA TIPO SPOT DE SOBREPOR PARA 01 LÂMPADA","un    ",4,1,4,null,null,0,0,""]
["S",3,"S",0,1,4,2,0,0,0,0,"","Serviço","Serviço","-","COMPOSIÇÃO","COMP 375_SEE","REFLETOR DE LED HOLOFORTE 50W","UN ",10,1,10,null,null,0,0,""]
["S",3,"S",0,1,4,2,0,0,0,0,"","Serviço","Serviço","-","SINAPI",91884,"LUVA PARA ELETRODUTO, PVC, ROSCÁVEL, DN 25 MM (3/4\"), PARA CIRCUITOS TERMINAIS, INSTALADA EM PAREDE - FORNECIMENTO E INSTALAÇÃO. AF_12/2015","UN",550,1,550,null,null,0,0,"Referência: AGETOP - 71741"]
["S",3,"S",0,1,4,2,0,0,0,0,"","Serviço","Serviço","-","SINAPI",91876,"LUVA PARA ELETRODUTO, PVC, ROSCÁVEL, DN 32 MM (1\"), PARA CIRCUITOS TERMINAIS, INSTALADA EM FORRO - FORNECIMENTO E INSTALAÇÃO. AF_12/2015","UN",90,1,90,null,null,0,0,""]
["S",3,"S",0,1,4,2,0,0,0,0,"","Serviço","Serviço","-","SINAPI",93014,"LUVA PARA ELETRODUTO, PVC, ROSCÁVEL, DN 60 MM (2\") - FORNECIMENTO E INSTALAÇÃO. AF_12/2015","UN",2.5,1,2.5,null,null,0,0,"Referência: AGETOP - 71745"]
["S",3,"S",0,1,4,2,0,0,0,0,"","Serviço","Serviço","-","AGETOP",70351,"BRACADEIRA METALICA TIPO \"U\" DIAM. 3/4\"","Un    ",550,1,550,null,null,0,0,""]
["S",3,"S",0,1,4,2,0,0,0,0,"","Serviço","Serviço","-","AGETOP",70352,"BRACADEIRA METALICA TIPO \"U\" DIAM. 1\"","Un    ",90,1,90,null,null,0,0,""]
["S",3,"S",0,1,4,2,0,0,0,0,"","Serviço","Serviço","-","AGETOP",70355,"BRACADEIRA METALICA TIPO \"U\" DIAM. 2\"","Un    ",2.5,1,2.5,null,null,0,0,""]
["S",3,"S",0,1,4,2,0,0,0,0,"","Serviço","Serviço","-","AGETOP",70421,"BUCHA E ARRUELA METALICA DIAM. 3/4\"","PR    ",20,1,20,null,null,0,0,""]
["S",3,"S",0,1,4,2,0,0,0,0,"","Serviço","Serviço","-","AGETOP",70422,"BUCHA E ARRUELA METALICA DIAM. 1\"","PR    ",10,1,10,null,null,0,0,""]
["S",3,"S",0,1,4,2,0,0,0,0,"","Serviço","Serviço","-","AGETOP",70425,"BUCHA E ARRUELA METALICA DIAM. 2\"","PR    ",4,1,4,null,null,0,0,""]
["S",3,"S",0,1,4,2,0,0,0,0,"","Serviço","Serviço","-","SINAPI",91890,"CURVA 90 GRAUS PARA ELETRODUTO, PVC, ROSCÁVEL, DN 25 MM (3/4\"), PARA CIRCUITOS TERMINAIS, INSTALADA EM FORRO - FORNECIMENTO E INSTALAÇÃO. AF_12/2015","UN",50,1,50,null,null,0,0,""]
["S",3,"S",0,1,4,2,0,0,0,0,"","Serviço","Serviço","-","SINAPI",91893,"CURVA 90 GRAUS PARA ELETRODUTO, PVC, ROSCÁVEL, DN 32 MM (1\"), PARA CIRCUITOS TERMINAIS, INSTALADA EM FORRO - FORNECIMENTO E INSTALAÇÃO. AF_12/2015","UN",40,1,40,null,null,0,0,""]
["S",3,"S",0,1,4,2,0,0,0,0,"","Serviço","Serviço","-","SINAPI",93020,"CURVA 90 GRAUS PARA ELETRODUTO, PVC, ROSCÁVEL, DN 60 MM (2\") - FORNECIMENTO E INSTALAÇÃO. AF_12/2015","UN",2,1,2,null,null,0,0,""]
["S",3,"S",0,1,4,2,0,0,0,0,"","Serviço","Serviço","-","AGETOP",71331,"FITA ISOLANTE, ROLO DE 20,00 M","Un    ",10,1,10,null,null,0,0,""]
["S",3,"S",0,1,4,2,0,0,0,0,"","Serviço","Serviço","-","AGETOP",71321,"FITA DE AUTO FUSAO, ROLO E 10,00 MM","Un    ",5,1,5,null,null,0,0,""]
["S",3,"S",0,1,4,2,0,0,0,0,"","Serviço","Serviço","-","AGETOP",71321,"FITA DE AUTO FUSAO, ROLO E 10,00 MM","Un    ",8,1,8,null,null,0,0,""]
["S",3,"S",0,1,4,2,0,0,0,0,"","Serviço","Serviço","-","AGETOP",71331,"FITA ISOLANTE, ROLO DE 20,00 M","Un    ",5,1,5,null,null,0,0,""]
["S",3,"S",0,1,4,2,0,0,0,0,"","Serviço","Serviço","-","AGETOP",72190,"QUADRO DE DISTRIBUIÇÃO DE EMBUTIR METÁLICO CB-24E - 150A","Un    ",1,1,1,null,null,0,0,""]
["S",3,"S",0,1,4,2,0,0,0,0,"","Serviço","Serviço","-","SINAPI","74131/5","QUADRO DE DISTRIBUICAO DE ENERGIA DE EMBUTIR, EM CHAPA METALICA, PARA 24 DISJUNTORES TERMOMAGNETICOS MONOPOLARES, COM BARRAMENTO TRIFASICO E NEUTRO, FORNECIMENTO E INSTALACAO","UN",2,1,2,null,null,0,0,""]
["S",3,"S",0,1,4,2,0,0,0,0,"","Serviço","Serviço","-","AGETOP",70924,"CONDULETE DE PVC - CAIXA COM 5 ENTRADAS ","un    ",80,1,80,null,null,0,0,""]
["S",3,"S",0,1,4,2,0,0,0,0,"","Serviço","Serviço","-","AGETOP",72385,"TAMPA CEGA PARA CONDULETE DE PVC","Un    ",80,1,80,null,null,0,0,""]
["S",3,"S",0,1,4,2,0,0,0,0,"","Serviço","Serviço","-","SINAPI",90458,"QUEBRA EM ALVENARIA PARA INSTALAÇÃO DE QUADRO DISTRIBUIÇÃO GRANDE (76X40 CM). AF_05/2015","UN",2,1,2,null,null,0,0,""]
[3,3,3,26,1,4,3,0,0,26,94,"","Nível 3","Nível 3","-","SINAPI",null,"IMPLANTAÇÃO BLOCO PADRÃO","-",null,1,"-",null,null,0,0,""]
["S",3,"S",0,1,4,3,0,0,0,0,"","Serviço","Serviço","-","SINAPI",91929,"CABO DE COBRE FLEXÍVEL ISOLADO, 4 MM², ANTI-CHAMA 0,6/1,0 KV, PARA CIRCUITOS TERMINAIS - FORNECIMENTO E INSTALAÇÃO. AF_12/2015","M",710,1,710,null,null,0,0,"Referência: AGETOP - 70582"]
["S",3,"S",0,1,4,3,0,0,0,0,"","Serviço","Serviço","-","SINAPI",92980,"CABO DE COBRE FLEXÍVEL ISOLADO, 10 MM², ANTI-CHAMA 0,6/1,0 KV, PARA DISTRIBUIÇÃO - FORNECIMENTO E INSTALAÇÃO. AF_12/2015","M",710,1,710,null,null,0,0,""]
["S",3,"S",0,1,4,3,0,0,0,0,"","Serviço","Serviço","-","SINAPI",92982,"CABO DE COBRE FLEXÍVEL ISOLADO, 16 MM², ANTI-CHAMA 0,6/1,0 KV, PARA DISTRIBUIÇÃO - FORNECIMENTO E INSTALAÇÃO. AF_12/2015","M",710,1,710,null,null,0,0,"Referência: AGETOP - 70510"]
["S",3,"S",0,1,4,3,0,0,0,0,"","Serviço","Serviço","-","SINAPI",97891,"CAIXA ENTERRADA ELÉTRICA RETANGULAR, EM ALVENARIA COM BLOCOS DE CONCRETO, FUNDO COM BRITA, DIMENSÕES INTERNAS: 0,4X0,4X0,4 M. AF_05/2018","UN",7,1,7,null,null,0,0,""]
["S",3,"S",0,1,4,3,0,0,0,0,"","Serviço","Serviço","-","SINAPI",93671,"DISJUNTOR TRIPOLAR TIPO DIN, CORRENTE NOMINAL DE 32A - FORNECIMENTO E INSTALAÇÃO. AF_04/2016","UN",1,1,1,null,null,0,0,"Referência: AGETOP - 71173"]
["S",3,"S",0,1,4,3,0,0,0,0,"","Serviço","Serviço","-","SINAPI",93673,"DISJUNTOR TRIPOLAR TIPO DIN, CORRENTE NOMINAL DE 50A - FORNECIMENTO E INSTALAÇÃO. AF_04/2016","UN",1,1,1,null,null,0,0,"Referência: AGETOP - 71174"]
["S",3,"S",0,1,4,3,0,0,0,0,"","Serviço","Serviço","-","SINAPI",93669,"DISJUNTOR TRIPOLAR TIPO DIN, CORRENTE NOMINAL DE 20A - FORNECIMENTO E INSTALAÇÃO. AF_04/2016","UN",1,1,1,null,null,0,0,""]
["S",3,"S",0,1,4,3,0,0,0,0,"","Serviço","Serviço","-","SINAPI",91872,"ELETRODUTO RÍGIDO ROSCÁVEL, PVC, DN 32 MM (1\"), PARA CIRCUITOS TERMINAIS, INSTALADO EM PAREDE - FORNECIMENTO E INSTALAÇÃO. AF_12/2015","M",15,1,15,null,null,0,0,"Referência: AGETOP - 71202"]
["S",3,"S",0,1,4,3,0,0,0,0,"","Serviço","Serviço","-","SINAPI",93009,"ELETRODUTO RÍGIDO ROSCÁVEL, PVC, DN 60 MM (2\") - FORNECIMENTO E INSTALAÇÃO. AF_12/2015","M",180,1,180,null,null,0,0,""]
["S",3,"S",0,1,4,3,0,0,0,0,"","Serviço","Serviço","-","SINAPI",91871,"ELETRODUTO RÍGIDO ROSCÁVEL, PVC, DN 25 MM (3/4\"), PARA CIRCUITOS TERMINAIS, INSTALADO EM PAREDE - FORNECIMENTO E INSTALAÇÃO. AF_12/2015","M",15,1,15,null,null,0,0,"Referência: AGETOP - 71201"]
["S",3,"S",0,1,4,3,0,0,{"$f":"IF(OR($C211=\"S\",$C211=0),0,MATCH(0,OFFSET($D211,1,$C211,ROW($C$923)-ROW($C211)),0))","v":0},{"$f":"IF(OR($C211=\"S\",$C211=0),0,MATCH(OFFSET($D211,0,$C211)+1,OFFSET($D211,1,$C211,ROW($C$923)-ROW($C211)),0))","v":0},"","Serviço","Serviço","-","SINAPI",91884,"LUVA PARA ELETRODUTO, PVC, ROSCÁVEL, DN 25 MM (3/4\"), PARA CIRCUITOS TERMINAIS, INSTALADA EM PAREDE - FORNECIMENTO E INSTALAÇÃO. AF_12/2015","UN",7.5,1,7.5,null,null,0,0,"Referência: AGETOP - 71741"]
["S",3,"S",0,1,4,3,0,0,0,0,"","Serviço","Serviço","-","SINAPI",91885,"LUVA PARA ELETRODUTO, PVC, ROSCÁVEL, DN 32 MM (1\"), PARA CIRCUITOS TERMINAIS, INSTALADA EM PAREDE - FORNECIMENTO E INSTALAÇÃO. AF_12/2015","UN",90,1,90,null,null,0,0,"Referência: AGETOP - 71742"]
["S",3,"S",0,1,4,3,0,0,0,0,"","Serviço","Serviço","-","SINAPI",93014,"LUVA PARA ELETRODUTO, PVC, ROSCÁVEL, DN 60 MM (2\") - FORNECIMENTO E INSTALAÇÃO. AF_12/2015","UN",7.5,1,7.5,null,null,0,0,"Referência: AGETOP - 71745"]
["S",3,"S",0,1,4,3,0,0,0,0,"","Serviço","Serviço","-","AGETOP",70351,"BRACADEIRA METALICA TIPO \"U\" DIAM. 3/4\"","Un    ",7.5,1,7.5,null,null,0,0,""]
["S",3,"S",0,1,4,3,0,0,0,0,"","Serviço","Serviço","-","AGETOP",70352,"BRACADEIRA METALICA TIPO \"U\" DIAM. 1\"","Un    ",90,1,90,null,null,0,0,""]
["S",3,"S",0,1,4,3,0,0,0,0,"","Serviço","Serviço","-","AGETOP",70355,"BRACADEIRA METALICA TIPO \"U\" DIAM. 2\"","Un    ",7.5,1,7.5,null,null,0,0,""]
["S",3,"S",0,1,4,3,0,0,0,0,"","Serviço","Serviço","-","AGETOP",70421,"BUCHA E ARRUELA METALICA DIAM. 3/4\"","PR    ",4,1,4,null,null,0,0,""]
["S",3,"S",0,1,4,3,0,{"$f":"IF(AND($C218<=4,$C218<>0),0,IF(AND($C218=\"S\",$Y218>0),OFFSET(I218,-1,0)+1,OFFSET(I218,-1,0)))","v":0},0,0,"","Serviço","Serviço","-","AGETOP",70422,"BUCHA E ARRUELA METALICA DIAM. 1\"","PR    ",4,1,4,null,null,0,0,""]
["S",3,"S",0,1,4,3,0,0,0,0,"","Serviço","Serviço","-","AGETOP",70425,"BUCHA E ARRUELA METALICA DIAM. 2\"","PR    ",4,1,4,null,null,0,0,""]
["S",3,"S",0,1,4,3,0,0,0,0,"","Serviço","Serviço","-","SINAPI",91914,"CURVA 90 GRAUS PARA ELETRODUTO, PVC, ROSCÁVEL, DN 25 MM (3/4\"), PARA CIRCUITOS TERMINAIS, INSTALADA EM PAREDE - FORNECIMENTO E INSTALAÇÃO. AF_12/2015","UN",5,1,5,null,null,0,0,""]
["S",3,"S",0,{"$f":"IF($C221=1,OFFSET(E221,-1,0)+1,OFFSET(E221,-1,0))","v":1},{"$f":"IF($C221=1,0,IF($C221=2,OFFSET(F221,-1,0)+1,OFFSET(F221,-1,0)))","v":4},{"$f":"IF(AND($C221<=2,$C221<>0),0,IF($C221=3,OFFSET(G221,-1,0)+1,OFFSET(G221,-1,0)))","v":3},{"$f":"IF(AND($C221<=3,$C221<>0),0,IF($C221=4,OFFSET(H221,-1,0)+1,OFFSET(H221,-1,0)))","v":0},0,0,0,"","Serviço","Serviço","-","SINAPI",91917,"CURVA 90 GRAUS PARA ELETRODUTO, PVC, ROSCÁVEL, DN 32 MM (1\"), PARA CIRCUITOS TERMINAIS, INSTALADA EM PAREDE - FORNECIMENTO E INSTALAÇÃO. AF_12/2015","UN",5,1,5,null,null,0,0,""]
["S",3,"S",0,1,4,3,0,0,0,0,"","Serviço","Serviço","-","SINAPI",93020,"CURVA 90 GRAUS PARA ELETRODUTO, PVC, ROSCÁVEL, DN 60 MM (2\") - FORNECIMENTO E INSTALAÇÃO. AF_12/2015","UN",3,1,3,null,null,0,0,""]
["S",3,"S",0,1,4,3,0,0,0,0,"","Serviço","Serviço","-","AGETOP",70924,"CONDULETE DE PVC - CAIXA COM 5 ENTRADAS ","un    ",10,1,10,null,null,0,0,""]
["S",3,"S",0,1,4,3,0,0,0,0,"","Serviço","Serviço","-","AGETOP",72385,"TAMPA CEGA PARA CONDULETE DE PVC","Un    ",3,1,3,null,null,0,0,""]
["S",3,"S",0,1,4,3,0,0,0,0,"","Serviço","Serviço","-","AGETOP",71331,"FITA ISOLANTE, ROLO DE 20,00 M","Un    ",2,1,2,null,null,0,0,""]
[{"$f":"CHOOSE(1+LOG(1+2*(ORÇAMENTO.Nivel=\"Nível 1\")+4*(ORÇAMENTO.Nivel=\"Nível 2\")+8*(ORÇAMENTO.Nivel=\"Nível 3\")+16*(ORÇAMENTO.Nivel=\"Nível 4\")+32*(ORÇAMENTO.Nivel=\"Serviço\"),2),0,1,2,3,4,\"S\")","v":2},{"$f":"IF(OR(C226=\"s\",C226=0),OFFSET(B226,-1,0),C226)","v":2},{"$f":"IF(OFFSET(C226,-1,0)=\"L\",1,IF(OFFSET(C226,-1,0)=1,2,IF(OR(A226=\"s\",A226=0),\"S\",IF(AND(OFFSET(C226,-1,0)=2,A226=4),3,IF(AND(OR(OFFSET(C226,-1,0)=\"s\",OFFSET(C226,-1,0)=0),A226<>\"s\",A226>OFFSET(B226,-1,0)),OFFSET(B226,-1,0),A226)))))","v":2},{"$f":"IF(OR(C226=\"S\",C226=0),0,IF(ISERROR(K226),J226,SMALL(J226:K226,1)))","v":119},{"$f":"IF($C226=1,OFFSET(E226,-1,0)+1,OFFSET(E226,-1,0))","v":1},{"$f":"IF($C226=1,0,IF($C226=2,OFFSET(F226,-1,0)+1,OFFSET(F226,-1,0)))","v":5},{"$f":"IF(AND($C226<=2,$C226<>0),0,IF($C226=3,OFFSET(G226,-1,0)+1,OFFSET(G226,-1,0)))","v":0},{"$f":"IF(AND($C226<=3,$C226<>0),0,IF($C226=4,OFFSET(H226,-1,0)+1,OFFSET(H226,-1,0)))","v":0},{"$f":"IF(AND($C226<=4,$C226<>0),0,IF(AND($C226=\"S\",$Y226>0),OFFSET(I226,-1,0)+1,OFFSET(I226,-1,0)))","v":0},225,119,"","Nível 2","Nível 2","-","AGETOP",null,"INSTALAÇÕES HIDROSSANITÁRIAS","-",null,1,"-",null,null,0,0,""]
[3,3,3,21,1,5,1,0,0,118,21,"","Nível 3","Nível 3","-","SINAPI",null,"PEÇAS E ACESSÓRIOS","-",null,1,"-",null,null,0,0,""]
[4,4,4,7,1,5,1,1,0,20,7,"","Nível 4","Nível 4","-","SINAPI",null,"VASO SANITÁRIO / ACESSÓRIOS","-",null,1,"-",null,null,0,0,""]
["S",4,"S",0,1,5,1,1,0,0,0,"","Serviço","Serviço","-","SINAPI",95470,"VASO SANITARIO SIFONADO CONVENCIONAL COM LOUÇA BRANCA, INCLUSO CONJUNTO DE LIGAÇÃO PARA BACIA SANITÁRIA AJUSTÁVEL - FORNECIMENTO E INSTALAÇÃO. AF_10/2016","UN",10,1,10,null,null,0,0,""]
["S",4,"S",0,1,5,1,1,0,0,0,"","Serviço","Serviço","-","AGETOP",80510,"ANEL DE VEDAÇÃO PARA VASO SANITÁRIO","Un    ",10,1,10,null,null,0,0,""]
["S",4,"S",0,1,5,1,1,0,0,0,"","Serviço","Serviço","-","AGETOP",80513,"TUBO PARA VÁLVULA DE DESCARGA ( CURTO 1.1/4\" )","Un    ",10,1,10,null,null,0,0,""]
["S",4,"S",0,1,5,1,1,0,0,0,"","Serviço","Serviço","-","AGETOP",80510,"ANEL DE VEDAÇÃO PARA VASO SANITÁRIO","Un    ",10,1,10,null,null,0,0,""]
["S",4,"S",0,1,5,1,1,0,0,0,"","Serviço","Serviço","-","AGETOP",80514,"TUBO DE LIGACAO PVC CROMADO 1.1/2\" / ESPUDE  - (ENTRADA)","Un    ",10,1,10,null,null,0,0,""]
["S",4,"S",0,1,5,1,1,0,0,0,"","Serviço","Serviço","-","AGETOP",80520,"CONJUNTO DE FIXACAO P/VASO SANITARIO (PAR)","CJ    ",10,1,10,null,null,0,0,""]
[4,4,4,7,1,5,1,2,0,13,7,"","Nível 4","Nível 4","-","SINAPI",null,"LAVATÓRIO / ACESSÓRIOS","-",null,1,"-",null,null,0,0,""]
["S",4,"S",0,1,5,1,2,0,0,0,"","Serviço","Serviço","-","SINAPI",86903,"LAVATÓRIO LOUÇA BRANCA COM COLUNA, 45 X 55CM OU EQUIVALENTE, PADRÃO MÉDIO - FORNECIMENTO E INSTALAÇÃO. AF_12/2013","UN",7,1,7,null,null,0,0,"Referência: AGETOP - 80541"]
["S",4,"S",0,1,5,1,2,0,0,0,"","Serviço","Serviço","-","SINAPI",86883,"SIFÃO DO TIPO FLEXÍVEL EM PVC 1\u0094 X 1.1/2\u0094 - FORNECIMENTO E INSTALAÇÃO. AF_12/2013","UN",7,1,7,null,null,0,0,""]
["S",4,"S",0,1,5,1,2,0,0,0,"","Serviço","Serviço","-","SINAPI",86915,"TORNEIRA CROMADA DE MESA, 1/2\" OU 3/4\", PARA LAVATÓRIO, PADRÃO MÉDIO - FORNECIMENTO E INSTALAÇÃO. AF_12/2013","UN",7,1,7,null,null,0,0,"Referência: AGETOP - 80570"]
["S",4,"S",0,1,5,1,2,0,0,0,"","Serviço","Serviço","-","SINAPI",86877,"VÁLVULA EM METAL CROMADO 1.1/2\" X 1.1/2\" PARA TANQUE OU LAVATÓRIO, COM OU SEM LADRÃO - FORNECIMENTO E INSTALAÇÃO. AF_12/2013","UN",7,1,7,null,null,0,0,"Referência: AGETOP - 80580"]
["S",4,"S",0,1,5,1,2,0,0,0,"","Serviço","Serviço","-","SINAPI",86901,"CUBA DE EMBUTIR OVAL EM LOUÇA BRANCA, 35 X 50CM OU EQUIVALENTE - FORNECIMENTO E INSTALAÇÃO. AF_12/2013","UN",5,1,5,null,null,0,0,"Referência: AGETOP - 80587"]
["S",4,"S",0,1,5,1,2,0,0,0,"","Serviço","Serviço","-","AGETOP",80556,"LIGAÇÃO FLEXÍVEL PVC DIAM.1/2\" (ENGATE)","Un    ",7,1,7,null,null,0,0,""]
[4,4,4,2,1,5,1,3,0,6,2,"","Nível 4","Nível 4","-","SINAPI",null,"FILTRO E CHUVEIROS","-",null,1,"-",null,null,0,0,""]
["S",4,"S",0,1,5,1,3,0,0,0,"","Serviço","Serviço","-","SINAPI",9535,"CHUVEIRO ELETRICO COMUM CORPO PLASTICO TIPO DUCHA, FORNECIMENTO E INSTALACAO","UN",7,1,7,null,null,0,0,""]
[4,4,4,4,1,5,1,4,0,4,24,"","Nível 4","Nível 4","-","SINAPI",null,"REGISTROS","-",null,1,"-",null,null,0,0,""]
["S",4,"S",0,1,5,1,4,0,0,0,"","Serviço","Serviço","-","AGETOP",80902,"REGISTRO DE GAVETA BRUTO DIAMETRO 3/4\"","Un    ",3,1,3,null,null,0,0,""]
["S",4,"S",0,1,5,1,4,0,0,0,"","Serviço","Serviço","-","AGETOP",80910,"REGISTRO DE GAVETA BRUTO DIAMETRO 2.1/2\"","Un    ",1,1,1,null,null,0,0,""]
["S",4,"S",0,1,5,1,4,0,0,0,"","Serviço","Serviço","-","AGETOP",80905,"REGISTRO DE GAVETA BRUTO DIAMETRO 1.1/2\"","Un    ",1,1,1,null,null,0,0,""]
[{"$f":"CHOOSE(1+LOG(1+2*(ORÇAMENTO.Nivel=\"Nível 1\")+4*(ORÇAMENTO.Nivel=\"Nível 2\")+8*(ORÇAMENTO.Nivel=\"Nível 3\")+16*(ORÇAMENTO.Nivel=\"Nível 4\")+32*(ORÇAMENTO.Nivel=\"Serviço\"),2),0,1,2,3,4,\"S\")","v":3},{"$f":"IF(OR(C248=\"s\",C248=0),OFFSET(B248,-1,0),C248)","v":3},{"$f":"IF(OFFSET(C248,-1,0)=\"L\",1,IF(OFFSET(C248,-1,0)=1,2,IF(OR(A248=\"s\",A248=0),\"S\",IF(AND(OFFSET(C248,-1,0)=2,A248=4),3,IF(AND(OR(OFFSET(C248,-1,0)=\"s\",OFFSET(C248,-1,0)=0),A248<>\"s\",A248>OFFSET(B248,-1,0)),OFFSET(B248,-1,0),A248)))))","v":3},{"$f":"IF(OR(C248=\"S\",C248=0),0,IF(ISERROR(K248),J248,SMALL(J248:K248,1)))","v":25},{"$f":"IF($C248=1,OFFSET(E248,-1,0)+1,OFFSET(E248,-1,0))","v":1},{"$f":"IF($C248=1,0,IF($C248=2,OFFSET(F248,-1,0)+1,OFFSET(F248,-1,0)))","v":5},{"$f":"IF(AND($C248<=2,$C248<>0),0,IF($C248=3,OFFSET(G248,-1,0)+1,OFFSET(G248,-1,0)))","v":2},{"$f":"IF(AND($C248<=3,$C248<>0),0,IF($C248=4,OFFSET(H248,-1,0)+1,OFFSET(H248,-1,0)))","v":0},{"$f":"IF(AND($C248<=4,$C248<>0),0,IF(AND($C248=\"S\",$Y248>0),OFFSET(I248,-1,0)+1,OFFSET(I248,-1,0)))","v":0},97,25,"","Nível 3","Nível 3","-","SINAPI",null,"ÁGUA FRIA","-",null,1,"-",null,null,0,0,""]
[4,4,4,5,1,5,2,1,0,24,5,"","Nível 4","Nível 4","-","SINAPI",null,"TUBOS DE PVC SOLDÁVEL","-",null,1,"-",null,null,0,0,""]
["S",4,"S",0,1,5,2,1,0,0,0,"","Serviço","Serviço","-","SINAPI",89446,"TUBO, PVC, SOLDÁVEL, DN 25MM, INSTALADO EM PRUMADA DE ÁGUA - FORNECIMENTO E INSTALAÇÃO. AF_12/2014","M",45,1,45,null,null,0,0,""]
["S",4,"S",0,1,5,2,1,0,0,0,"","Serviço","Serviço","-","SINAPI",89447,"TUBO, PVC, SOLDÁVEL, DN 32MM, INSTALADO EM PRUMADA DE ÁGUA - FORNECIMENTO E INSTALAÇÃO. AF_12/2014","M",3,1,3,null,null,0,0,""]
["S",4,"S",0,1,5,2,1,0,0,0,"","Serviço","Serviço","-","SINAPI",89449,"TUBO, PVC, SOLDÁVEL, DN 50MM, INSTALADO EM PRUMADA DE ÁGUA - FORNECIMENTO E INSTALAÇÃO. AF_12/2014","M",42,1,42,null,null,0,0,""]
["S",4,"S",0,1,5,2,1,0,0,0,"","Serviço","Serviço","-","SINAPI",89450,"TUBO, PVC, SOLDÁVEL, DN 60MM, INSTALADO EM PRUMADA DE ÁGUA - FORNECIMENTO E INSTALAÇÃO. AF_12/2014","M",18,1,18,null,null,0,0,""]
[4,4,4,4,1,5,2,2,0,19,4,"","Nível 4","Nível 4","-","SINAPI",null,"ADAPTADORES DE PVC SOLDÁVEL","-",null,1,"-",null,null,0,0,""]
["S",4,"S",0,1,5,2,2,0,0,0,"","Serviço","Serviço","-","SINAPI",89596,"ADAPTADOR CURTO COM BOLSA E ROSCA PARA REGISTRO, PVC, SOLDÁVEL, DN 50MM X 1.1/2\u0094, INSTALADO EM PRUMADA DE ÁGUA - FORNECIMENTO E INSTALAÇÃO. AF_12/2014","UN",9,1,9,null,null,0,0,"Referência: AGETOP - 81069"]
["S",4,"S",0,1,5,2,2,0,0,0,"","Serviço","Serviço","-","AGETOP",81066,"ADAPTAD.SOLD.CURTO C/BOLSA E ROSCA P/REG.25X3/4\"","Un    ",6,1,6,null,null,0,0,""]
["S",4,"S",0,1,5,2,2,0,0,0,"","Serviço","Serviço","-","AGETOP",81069,"ADAPTAD.SOLD.CURTO C/BOLSA/ROSCA P/REG.50X11/2\"","Un    ",3,1,3,null,null,0,0,""]
[4,4,4,7,1,5,2,3,0,15,7,"","Nível 4","Nível 4","-","SINAPI",null,"BUCHAS","-",null,1,"-",null,null,0,0,""]
["S",4,"S",0,1,5,2,3,0,0,0,"","Serviço","Serviço","-","AGETOP",81165,"BUCHA DE REDUCAO SOLD. CURTA 60 X 50 mm","Un    ",2,1,2,null,null,0,0,""]
["S",4,"S",0,1,5,2,3,0,0,0,"","Serviço","Serviço","-","AGETOP",81180,"BUCHA DE REDUCAO SOLDAVEL LONGA 50 X 32 mm","Un    ",1,1,1,null,null,0,0,""]
["S",4,"S",0,1,5,2,3,0,0,0,"","Serviço","Serviço","-","AGETOP",81321,"JOELHO 90 GRAUS SOLDAVEL DIAMETRO 25 MM","Un    ",2,1,2,null,null,0,0,""]
["S",4,"S",0,1,5,2,3,0,0,0,"","Serviço","Serviço","-","AGETOP",81302,"JOELHO 45 GRAUS SOLDAVEL 25 mm","Un    ",2,1,2,null,null,0,0,""]
["S",4,"S",0,1,5,2,3,0,0,0,"","Serviço","Serviço","-","AGETOP",81325,"JOELHO 90 GRAUS SOLDAVEL DIAMETRO 60 mm","Un    ",2,1,2,null,null,0,0,""]
["S",4,"S",0,1,5,2,3,0,0,0,"","Serviço","Serviço","-","AGETOP",81324,"JOELHO 90 GRAUS SOLDAVEL 50 mm (MARROM)","Un    ",2,1,2,null,null,0,0,""]
[{"$f":"CHOOSE(1+LOG(1+2*(ORÇAMENTO.Nivel=\"Nível 1\")+4*(ORÇAMENTO.Nivel=\"Nível 2\")+8*(ORÇAMENTO.Nivel=\"Nível 3\")+16*(ORÇAMENTO.Nivel=\"Nível 4\")+32*(ORÇAMENTO.Nivel=\"Serviço\"),2),0,1,2,3,4,\"S\")","v":4},4,4,3,{"$f":"IF($C265=1,OFFSET(E265,-1,0)+1,OFFSET(E265,-1,0))","v":1},{"$f":"IF($C265=1,0,IF($C265=2,OFFSET(F265,-1,0)+1,OFFSET(F265,-1,0)))","v":5},{"$f":"IF(AND($C265<=2,$C265<>0),0,IF($C265=3,OFFSET(G265,-1,0)+1,OFFSET(G265,-1,0)))","v":2},{"$f":"IF(AND($C265<=3,$C265<>0),0,IF($C265=4,OFFSET(H265,-1,0)+1,OFFSET(H265,-1,0)))","v":4},{"$f":"IF(AND($C265<=4,$C265<>0),0,IF(AND($C265=\"S\",$Y265>0),OFFSET(I265,-1,0)+1,OFFSET(I265,-1,0)))","v":0},8,3,"","Nível 4","Nível 4","-","SINAPI",null,"TÊ","-",null,1,"-",null,null,0,0,""]
["S",{"$f":"IF(OR(C266=\"s\",C266=0),OFFSET(B266,-1,0),C266)","v":4},{"$f":"IF(OFFSET(C266,-1,0)=\"L\",1,IF(OFFSET(C266,-1,0)=1,2,IF(OR(A266=\"s\",A266=0),\"S\",IF(AND(OFFSET(C266,-1,0)=2,A266=4),3,IF(AND(OR(OFFSET(C266,-1,0)=\"s\",OFFSET(C266,-1,0)=0),A266<>\"s\",A266>OFFSET(B266,-1,0)),OFFSET(B266,-1,0),A266)))))","v":"S"},{"$f":"IF(OR(C266=\"S\",C266=0),0,IF(ISERROR(K266),J266,SMALL(J266:K266,1)))","v":0},1,5,2,4,0,0,0,"","Serviço","Serviço","-","AGETOP",81046,"ADAPTADOR PVC SOLD.LONGO C/FLANGES LIVRES P/CX.DAGUA 110 X 4\"","Un    ",1,1,1,null,null,0,0,""]
["S",4,"S",0,1,5,2,4,0,0,0,"","Serviço","Serviço","-","AGETOP",81445,"TE RED.SOLD.90GR.BUC.LATAO BOLSA CENT.25X25X1/2\"","Un    ",2,1,2,null,null,0,0,""]
[4,4,4,2,1,5,2,5,0,5,2,"","Nível 4","Nível 4","-","SINAPI",null,"TUBOS","-",null,1,"-",null,null,0,0,""]
["S",4,"S",0,1,5,2,5,0,0,0,"","Serviço","Serviço","-","SINAPI",89800,"TUBO PVC, SERIE NORMAL, ESGOTO PREDIAL, DN 100 MM, FORNECIDO E INSTALADO EM PRUMADA DE ESGOTO SANITÁRIO OU VENTILAÇÃO. AF_12/2014","M",15,1,15,null,null,0,0,""]
[4,4,4,3,1,5,2,6,0,3,{"$error":"#N/A"},"","Nível 4","Nível 4","-","SINAPI",null,"ADESIVOS","-",null,1,"-",null,null,0,0,""]
["S",4,"S",0,1,5,2,6,0,0,0,"","Serviço","Serviço","-","AGETOP",81501,"ADESIVO PLASTICO - FRASCO 850 G","Un    ",1,1,1,null,null,0,0,""]
["S",4,"S",0,1,5,2,6,0,0,0,"","Serviço","Serviço","-","AGETOP",81504,"SOLUCAO LIMPADORA 1000 CM3","Un    ",1,1,1,null,null,0,0,""]
[3,3,3,21,1,5,3,0,0,72,21,"","Nível 3","Nível 3","-","SINAPI",null,"ESGOTO SANITÁRIO","-",null,1,"-",null,null,0,0,""]
[4,4,4,4,1,5,3,1,0,20,4,"","Nível 4","Nível 4","-","SINAPI",null,"CORPO DE CAIXA SINFONADA","-",null,1,"-",null,null,0,0,""]
["S",4,"S",0,1,5,3,1,0,{"$f":"IF(OR($C275=\"S\",$C275=0),0,MATCH(0,OFFSET($D275,1,$C275,ROW($C$923)-ROW($C275)),0))","v":0},{"$f":"IF(OR($C275=\"S\",$C275=0),0,MATCH(OFFSET($D275,0,$C275)+1,OFFSET($D275,1,$C275,ROW($C$923)-ROW($C275)),0))","v":0},"","Serviço","Serviço","-","AGETOP",81663,"CORPO CX. SIFONADA DIAM. 150 X 150 X 50","Un    ",3,1,3,null,null,0,0,""]
["S",4,"S",0,1,5,3,1,0,0,0,"","Serviço","Serviço","-","AGETOP",81696,"PROLONGAMENTO PARA CAIXA SIFONADA 150 MM","M     ",3,1,3,null,null,0,0,""]
["S",4,"S",0,1,5,3,1,0,0,0,"","Serviço","Serviço","-","AGETOP",81791,"GRELHA REDONDA BRANCA DIAM. 150 MM","Un    ",3,1,3,null,null,0,0,""]
[4,4,4,6,1,5,3,2,0,16,6,"","Nível 4","Nível 4","-","SINAPI",null,"CURVAS","-",null,1,"-",null,null,0,0,""]
["S",4,"S",0,1,5,3,2,0,0,0,"","Serviço","Serviço","-","AGETOP",81702,"CURVA 45 GRAUS DIAMETRO 100 MM","Un    ",1,1,1,null,null,0,0,""]
["S",4,"S",0,1,5,3,2,0,0,0,"","Serviço","Serviço","-","AGETOP",81550,"CURVA 45º DIAMETRO 50 MM","Un    ",1,1,1,null,null,0,0,""]
["S",4,"S",0,1,5,3,2,0,0,0,"","Serviço","Serviço","-","AGETOP",81701,"CURVA 45 GRAUS DIAMETRO 40 MM","Un    ",2,1,2,null,null,0,0,""]
["S",4,"S",0,1,5,3,2,0,0,0,"","Serviço","Serviço","-","AGETOP",81730,"CURVA 90 GRAUS CURTA DIAM. 40 MM","Un    ",5,1,5,null,null,0,0,""]
["S",4,"S",0,1,5,3,2,0,0,0,"","Serviço","Serviço","-","AGETOP",81737,"CURVA 90 GRAUS LONGA DIAM. 100 MM","Un    ",1,1,1,null,null,0,0,""]
[4,4,4,3,1,5,3,3,0,10,3,"","Nível 4","Nível 4","-","SINAPI",null,"JOELHOS","-",null,1,"-",null,null,0,0,""]
["S",4,"S",0,1,5,3,3,0,0,0,"","Serviço","Serviço","-","AGETOP",81927,"JOELHO 90 GRAUS C/ANEL 40 mm ","Un    ",5,1,5,null,null,0,0,""]
["S",4,"S",0,1,5,3,3,0,0,0,"","Serviço","Serviço","-","AGETOP",81936,"JOELHO 90 GRAUS DIAMETRO 50 MM","Un    ",1,1,1,null,null,0,0,""]
[4,4,4,3,1,5,3,4,0,7,3,"","Nível 4","Nível 4","-","SINAPI",null,"TÊ","-",null,1,"-",null,null,0,0,""]
["S",4,"S",0,1,5,3,4,0,0,0,"","Serviço","Serviço","-","AGETOP",82230,"TE SANITARIO DIAMETRO 50 X 50 MM","Un    ",1,1,1,null,null,0,0,""]
["S",4,"S",0,1,5,3,4,0,0,0,"","Serviço","Serviço","-","AGETOP",82233,"TE SANITARIO DIAMETRO 100 X 50 MM","Un    ",2,1,2,null,null,0,0,""]
[4,4,4,4,1,5,3,5,0,4,{"$error":"#N/A"},"","Nível 4","Nível 4","-","SINAPI",null,"TUBOS","-",null,1,"-",null,null,0,0,""]
["S",4,"S",0,1,5,3,5,0,0,0,"","Serviço","Serviço","-","SINAPI",89711,"TUBO PVC, SERIE NORMAL, ESGOTO PREDIAL, DN 40 MM, FORNECIDO E INSTALADO EM RAMAL DE DESCARGA OU RAMAL DE ESGOTO SANITÁRIO. AF_12/2014","M",6,1,6,null,null,0,0,"Referência: AGETOP - 82301"]
["S",4,"S",0,1,5,3,5,0,0,0,"","Serviço","Serviço","-","SINAPI",89798,"TUBO PVC, SERIE NORMAL, ESGOTO PREDIAL, DN 50 MM, FORNECIDO E INSTALADO EM PRUMADA DE ESGOTO SANITÁRIO OU VENTILAÇÃO. AF_12/2014","M",12,1,12,null,null,0,0,""]
["S",4,"S",0,1,5,3,5,0,0,0,"","Serviço","Serviço","-","SINAPI",89800,"TUBO PVC, SERIE NORMAL, ESGOTO PREDIAL, DN 100 MM, FORNECIDO E INSTALADO EM PRUMADA DE ESGOTO SANITÁRIO OU VENTILAÇÃO. AF_12/2014","M",22,1,22,null,null,0,0,""]
[{"$f":"CHOOSE(1+LOG(1+2*(ORÇAMENTO.Nivel=\"Nível 1\")+4*(ORÇAMENTO.Nivel=\"Nível 2\")+8*(ORÇAMENTO.Nivel=\"Nível 3\")+16*(ORÇAMENTO.Nivel=\"Nível 4\")+32*(ORÇAMENTO.Nivel=\"Serviço\"),2),0,1,2,3,4,\"S\")","v":3},{"$f":"IF(OR(C294=\"s\",C294=0),OFFSET(B294,-1,0),C294)","v":3},{"$f":"IF(OFFSET(C294,-1,0)=\"L\",1,IF(OFFSET(C294,-1,0)=1,2,IF(OR(A294=\"s\",A294=0),\"S\",IF(AND(OFFSET(C294,-1,0)=2,A294=4),3,IF(AND(OR(OFFSET(C294,-1,0)=\"s\",OFFSET(C294,-1,0)=0),A294<>\"s\",A294>OFFSET(B294,-1,0)),OFFSET(B294,-1,0),A294)))))","v":3},{"$f":"IF(OR(C294=\"S\",C294=0),0,IF(ISERROR(K294),J294,SMALL(J294:K294,1)))","v":7},{"$f":"IF($C294=1,OFFSET(E294,-1,0)+1,OFFSET(E294,-1,0))","v":1},{"$f":"IF($C294=1,0,IF($C294=2,OFFSET(F294,-1,0)+1,OFFSET(F294,-1,0)))","v":5},{"$f":"IF(AND($C294<=2,$C294<>0),0,IF($C294=3,OFFSET(G294,-1,0)+1,OFFSET(G294,-1,0)))","v":4},{"$f":"IF(AND($C294<=3,$C294<>0),0,IF($C294=4,OFFSET(H294,-1,0)+1,OFFSET(H294,-1,0)))","v":0},{"$f":"IF(AND($C294<=4,$C294<>0),0,IF(AND($C294=\"S\",$Y294>0),OFFSET(I294,-1,0)+1,OFFSET(I294,-1,0)))","v":0},51,7,"","Nível 3","Nível 3","-","SINAPI",null,"OUTROS","-",null,1,"-",null,null,0,0,""]
["S",3,"S",0,1,5,4,0,0,0,0,"","Serviço","Serviço","-","AGETOP",81825,"CAIXA DE PASSAGEM 60 X 60 CM SEM TAMPA","Un    ",3,1,3,null,null,0,0,""]
["S",3,"S",0,1,5,4,0,0,0,0,"","Serviço","Serviço","-","AGETOP",81826,"TAMPA EM CONCRETO ARMADO 25 MPA E=5CM PARA A CAIXA DE PASSAGEM 60X60CM","Un    ",3,1,3,null,null,0,0,""]
["S",3,"S",0,1,5,4,0,0,0,0,"","Serviço","Serviço","-","AGETOP",81827,"CAIXA DE AREIA 60X60CM FUNDO DE BRITA SEM TAMPA","Un    ",1,1,1,null,null,0,0,""]
["S",3,"S",0,1,5,4,0,0,0,0,"","Serviço","Serviço","-","AGETOP",81881,"RES.METALICO TAÇA AÇO PATINÁVEL-V=10M3-COL.SEC.H=6M+FUNDAÇÃO+LOGOTIPO","Un    ",1,1,1,null,null,0,0,""]
["S",3,"S",0,1,5,4,0,0,0,0,"","Serviço","Serviço","-","AGETOP",81889,"TORNEIRA BOIA DIAMETRO 1\" (25 MM )","Un    ",1,1,1,null,null,0,0,""]
["S",3,"S",0,1,5,4,0,0,0,0,"","Serviço","Serviço","-","AGETOP",81885,"TERMINAL DE VENTILACAO DIAMETRO 50 MM","Un    ",3,1,3,null,null,0,0,""]
[3,3,3,2,1,5,5,0,0,44,2,"","Nível 3","Nível 3","-","SINAPI",null,"ESCOVODROMO","-",null,1,"-",null,null,0,0,""]
["S",3,"S",0,1,5,5,0,0,0,0,"","Serviço","Serviço","-","AGETOP",80660,"TORNEIRA DE PAREDE PARA PIA OU BEBEDOURO DIÂMETRO DE 1/2\" E 3/4\" ","Un    ",8,1,8,null,null,0,0,""]
[3,3,3,42,1,5,6,0,0,42,{"$error":"#N/A"},"","Nível 3","Nível 3","-","SINAPI",null,"INSTALAÇÕES DE INCÊNDIO","-",null,1,"-",null,null,0,0,""]
["S",3,"S",0,1,5,6,0,0,0,0,"","Serviço","Serviço","-","SINAPI",83644,"BOMBA RECALQUE D'AGUA TRIFASICA 10,0 HP","UN",1,1,1,null,null,0,0,""]
["S",3,"S",0,1,5,6,0,0,0,0,"","Serviço","Serviço","-","AGETOP",72338,"SIRENE METALICA ALCANCE 500 M","Un    ",1,1,1,null,null,0,0,""]
["S",3,"S",0,1,5,6,0,0,0,0,"","Serviço","Serviço","-","AGETOP",71156,"CURVA DE 90 GRAUS AÇO GALVANIZADO DIAM. 2.1/2\"","Un    ",1,1,1,null,null,0,0,""]
["S",3,"S",0,1,5,6,0,0,0,0,"","Serviço","Serviço","-","AGETOP",80910,"REGISTRO DE GAVETA BRUTO DIAMETRO 2.1/2\"","Un    ",2,1,2,null,null,0,0,""]
["S",3,"S",0,1,5,6,0,0,0,0,"","Serviço","Serviço","-","AGETOP",82379,"TUBO FERRO GALVANIZADO DIAM.2.1/2\"","m     ",235,1,235,null,null,0,0,""]
["S",3,"S",0,1,5,6,0,0,0,0,"","Serviço","Serviço","-","AGETOP",85003,"EXTINTOR PO QUIMICO SECO (6 KG) - CAPACIDADE EXTINTORA 20 BC","Un    ",2,1,2,null,null,0,0,""]
["S",3,"S",0,1,5,6,0,0,0,0,"","Serviço","Serviço","-","AGETOP",85006,"EXTINTOR MULTI USO EM PO A B C (6 KG) - CAPACIDADE EXTINTORA 3A 20BC","un    ",6,1,6,null,null,0,0,""]
["S",3,"S",0,1,5,6,0,0,0,0,"","Serviço","Serviço","-","AGETOP",85011,"CAIXA DE INCÊNDIO METÁLICA COM SUPORTE PARA MANGUEIRA, TAMPA E MURETA 17X60X90 CM C/PINTURA","Un    ",3,1,3,null,null,0,0,""]
["S",3,"S",0,1,5,6,0,0,0,0,"","Serviço","Serviço","-","AGETOP",85017,"MANGUEIRA DE INCÊNDIO D.I. = 38 MM TIPO 2 COMP. = 15 M","CJ    ",6,1,6,null,null,0,0,""]
["S",3,"S",0,1,5,6,0,0,0,0,"","Serviço","Serviço","-","AGETOP",85025,"ESGUICHO REGULÁVEL 1.1/2\"","Un    ",3,1,3,null,null,0,0,""]
["S",3,"S",0,1,5,6,0,0,0,0,"","Serviço","Serviço","-","AGETOP",85027,"ADAPTADOR P/ENGATE STORZ 2.1/2\" X 1.1/2\"","Un    ",4,1,4,null,null,0,0,""]
["S",3,"S",0,1,5,6,0,0,0,0,"","Serviço","Serviço","-","AGETOP",85031,"REGISTRO GLOBO ANGULAR 2.1/2\"","Un    ",3,1,3,null,null,0,0,""]
["S",3,"S",0,1,5,6,0,0,0,0,"","Serviço","Serviço","-","AGETOP",85035,"TAMPÃO CEGO COM CORRENTE 2.1/2\"","Un    ",1,1,1,null,null,0,0,""]
["S",3,"S",0,1,5,6,0,0,0,0,"","Serviço","Serviço","-","AGETOP",85037,"TANQUE DE PRESSÃO DE 10 L","Un    ",1,1,1,null,null,0,0,""]
["S",3,"S",0,1,5,6,0,0,0,0,"","Serviço","Serviço","-","AGETOP",85039,"PRESSOSTATO 50 A 80 PSI","Un    ",1,1,1,null,null,0,0,""]
["S",3,"S",0,1,5,6,0,0,0,0,"","Serviço","Serviço","-","AGETOP",85041,"MANOMETRO - 0 A 10 KG/CM2","Un    ",1,1,1,null,null,0,0,""]
["S",3,"S",0,1,5,6,0,0,0,0,"","Serviço","Serviço","-","AGETOP",85047,"NIPLE DUPLO FERRO GALVANIZADO 2.1/2\"","Un    ",5,1,5,null,null,0,0,""]
["S",3,"S",0,1,5,6,0,0,0,0,"","Serviço","Serviço","-","SINAPI",92377,"NIPLE, EM FERRO GALVANIZADO, DN 65 (2 1/2\"), CONEXÃO ROSQUEADA, INSTALADO EM REDE DE ALIMENTAÇÃO PARA HIDRANTE - FORNECIMENTO E INSTALAÇÃO. AF_12/2015","UN",3,1,3,null,null,0,0,""]
["S",3,"S",0,1,5,6,0,0,0,0,"","Serviço","Serviço","-","AGETOP",85077,"VÁLVULA DE RETENÇÃO HORIZONTAL 2.1/2\"","Un    ",2,1,2,null,null,0,0,""]
["S",3,"S",0,1,5,6,0,0,0,0,"","Serviço","Serviço","-","COMPOSIÇÃO","COMP 017_SEE","REDUCAO GIRATÓRIA TIPO STORZ LATAO P/ INST. PREDIAL COMBATE A INCENDIO ENGATE RAPIDO 2.1/2\" X 1.1/2\"","UN ",3,1,3,null,null,0,0,""]
["S",3,"S",0,1,5,6,0,0,0,0,"","Serviço","Serviço","-","COMPOSIÇÃO","COMP 018_SEE","CHAVE DUPLA P/ CONEXÕES TIPO STORZ EM LATÃO ENGATE RÁPIDO 1 1/2\" X 2 1/2\"","UN ",3,1,3,null,null,0,0,""]
["S",3,"S",0,1,5,6,0,0,0,0,"","Serviço","Serviço","-","AGETOP",80981,"REGISTRO DE ESFERA DIAMETRO 2.1/2\"","Un    ",1,1,1,null,null,0,0,""]
["S",3,"S",0,1,5,6,0,0,0,0,"","Serviço","Serviço","-","COMPOSIÇÃO","COMP 087_SEE","REGISTRO DE GAVETA COM HASTE ASCENDENTE DE BRONZE 2 1/2\"","UN ",1,1,1,null,null,0,0,""]
["S",3,"S",0,1,5,6,0,0,0,0,"","Serviço","Serviço","-","COMPOSIÇÃO","COMP 019_SEE","TAMPÃO LATAO C/ CORRENTE P/ INSTALAÇÃO PREDIAL COMBATE A INCÊNDIO ENGATE RÁPIDO 1 1/2\"","UN ",3,1,3,null,null,0,0,""]
["S",3,"S",0,1,5,6,0,0,0,0,"","Serviço","Serviço","-","AGETOP",85056,"TÊ DE FERRO GALVANIZADO 90º X 2 1/2\"","un    ",5,1,5,null,null,0,0,""]
["S",3,"S",0,1,5,6,0,0,0,0,"","Serviço","Serviço","-","COMPOSIÇÃO","COMP 030_SEE","COTOVELO DE FERRO GALV. 90° X 2 1/2\"","UN ",18,1,18,null,null,0,0,""]
["S",3,"S",0,1,5,6,0,0,0,0,"","Serviço","Serviço","-","COMPOSIÇÃO","COMP 077_SEE","UNIAO FERRO GALV C/ASSENTO CONICO BRONZE 2 1/2\"","UN ",6,1,6,null,null,0,0,""]
["S",3,"S",0,1,5,6,0,0,0,0,"","Serviço","Serviço","-","COMPOSIÇÃO","COMP 546_SEE","BUJÃO DE REBORDO 2.1/2\"","UN ",1,1,1,null,null,0,0,""]
["S",3,"S",0,1,5,6,0,0,0,0,"","Serviço","Serviço","-","COMPOSIÇÃO","COMP 022_SEE","TAMPÃO FOFO 40X50CM C/INSCRIÇÃO ","UN ",1,1,1,null,null,0,0,""]
["S",3,"S",0,1,5,6,0,0,0,0,"","Serviço","Serviço","-","COMPOSIÇÃO","COMP 559_SEE","ADAPTADOR PARA CAIXA D´ÁGUA 150MM 2.1/2\" ","UN ",1,1,1,null,null,0,0,""]
["S",3,"S",0,1,5,6,0,0,0,0,"","Serviço","Serviço","-","COMPOSIÇÃO","COMP 186_SEE","BOTOEIRA BOMBA DE INCÊNDIO C/ MARTELO CONVENCIONAL/ ANALÓGICA","UN ",1,1,1,null,null,0,0,""]
["S",3,"S",0,1,5,6,0,0,0,0,"","Serviço","Serviço","-","COMPOSIÇÃO","COMP 188_SEE","ACIONADOR MANUAL DE ALARME","UN ",3,1,3,null,null,0,0,""]
["S",3,"S",0,1,5,6,0,0,0,0,"","Serviço","Serviço","-","COMPOSIÇÃO","COMP 190_SEE","CENTRAL DE DETECÇÃO E ALARME DE 40 SETORES COM BATERIA","UN ",1,1,1,null,null,0,0,""]
["S",3,"S",0,1,5,6,0,0,0,0,"","Serviço","Serviço","-","SINAPI",97599,"LUMINÁRIA DE EMERGÊNCIA - FORNECIMENTO E INSTALAÇÃO. AF_11/2017","UN",16,1,16,null,null,0,0,""]
["S",3,"S",0,1,5,6,0,0,0,0,"","Serviço","Serviço","-","COMPOSIÇÃO","COMP 024_SEE","SINALIZADOR FOTOLUMINESCENTE PARA EXTINTOR","UN ",8,1,8,null,null,0,0,""]
["S",3,"S",0,1,5,6,0,0,{"$f":"IF(OR($C339=\"S\",$C339=0),0,MATCH(0,OFFSET($D339,1,$C339,ROW($C$923)-ROW($C339)),0))","v":0},{"$f":"IF(OR($C339=\"S\",$C339=0),0,MATCH(OFFSET($D339,0,$C339)+1,OFFSET($D339,1,$C339,ROW($C$923)-ROW($C339)),0))","v":0},"","Serviço","Serviço","-","COMPOSIÇÃO","COMP 025_SEE","SINALIZADOR FOTOLUMINESCENTE DE EMERGÊNCIA","UN ",19,1,19,null,null,0,0,""]
["S",3,"S",0,1,5,6,0,0,0,0,"","Serviço","Serviço","-","COMPOSIÇÃO","COMP 277_SEE","MARCAÇÃO NO PISO - 1X1 M PARA EXTINTOR","M2",8,1,8,null,null,0,0,""]
["S",3,"S",0,1,5,6,0,0,0,0,"","Serviço","Serviço","-","COMPOSIÇÃO","COMP 235_SEE","PLACA DE SINALIZAÇÃO EM PVC COD 01 - (300X300) PROIBIDO FUMAR","UN ",1,1,1,null,null,0,0,""]
["S",3,"S",0,1,5,6,0,0,0,0,"","Serviço","Serviço","-","COMPOSIÇÃO","COMP 236_SEE","PLACA DE SINALIZAÇÃO EM PVC COD 06 - (300X300) PERIGO INFLAMÁVEL","UN ",1,1,1,null,null,0,0,""]
["S",3,"S",0,1,5,6,0,0,0,0,"","Serviço","Serviço","-","COMPOSIÇÃO","COMP 411_SEE","PLACA DE SINALIZAÇÃO EM PVC COD 13 - (316X158) SAÍDA DE EMERGÊNCIA","UN ",3,1,3,null,null,0,0,""]
["S",3,"S",0,1,5,6,0,0,0,0,"","Serviço","Serviço","-","COMPOSIÇÃO","COMP 412_SEE","PLACA DE SINALIZAÇÃO EM PVC COD 17 - (316X158) MENSAGEM \"SAÍDA\"","UN ",3,1,3,null,null,0,0,""]
[2,2,2,26,1,6,0,0,0,106,26,"","Nível 2","Nível 2","-","COMPOSIÇÃO","COMP 024_SEE","INSTALAÇÕES ESPECIAIS","UN ",null,1,"-",null,null,0,0,""]
["S",2,"S",0,1,6,0,0,0,0,0,"","Serviço","Serviço","-","AGETOP",91007,"CENTRAL DE GÁS PADRÃO AGETOP SEM INSTALAÇÕES (1+1 CILINDRO 45 KG)","Un    ",1,1,1,null,null,0,0,""]
["S",2,"S",0,1,6,0,0,0,0,0,"","Serviço","Serviço","-","AGETOP",91023,"UNIÃO S/BRONZE PRETA 3/4\" NPT 300 LBS","Un    ",3,1,3,null,null,0,0,""]
["S",2,"S",0,1,6,0,0,0,0,0,"","Serviço","Serviço","-","COMPOSIÇÃO","COMP 382_SEE","TE DE REDUCAO DE FERRO GALVANIZADO, COM ROSCA BSP, DE 3/4\" X 1/2\"","UN ",1,1,1,null,null,0,0,""]
["S",2,"S",0,1,6,0,0,0,0,0,"","Serviço","Serviço","-","COMPOSIÇÃO","COMP 383_SEE","BUCHA DE REDUCAO DE FERRO GALVANIZADO, COM ROSCA BSP, DE 1/2\" X 1/4\"","UN ",3,1,3,null,null,0,0,""]
["S",2,"S",0,1,6,0,0,0,0,0,"","Serviço","Serviço","-","AGETOP",91021,"LUVA GALVANIZADO DE REDUÇÃO 3/4\" X 1/2\" (GÁS)","Un    ",2,1,2,null,null,0,0,""]
["S",2,"S",0,1,6,0,0,0,0,0,"","Serviço","Serviço","-","SINAPI",92692,"NIPLE, EM FERRO GALVANIZADO, CONEXÃO ROSQUEADA, DN 15 (1/2\"), INSTALADO EM RAMAIS E SUB-RAMAIS DE GÁS - FORNECIMENTO E INSTALAÇÃO. AF_12/2015","UN",6,1,6,null,null,0,0,""]
["S",2,"S",0,1,6,0,0,0,0,0,"","Serviço","Serviço","-","AGETOP",91031,"NIPLE DUPLO 300 PSI 3/4\"","Un    ",6,1,6,null,null,0,0,""]
["S",2,"S",0,1,6,0,0,0,0,0,"","Serviço","Serviço","-","COMPOSIÇÃO","COMP 212_SEE","NIPLE DE REDUÇÃO 1/2\" X 1/4\" BSP","UN ",4,1,4,null,null,0,0,""]
["S",2,"S",0,1,6,0,0,0,0,0,"","Serviço","Serviço","-","COMPOSIÇÃO","COMP 213_SEE","NIPLE DE REDUÇÃO 3/4\" X 1/2\" BSP","UN ",4,1,4,null,null,0,0,""]
["S",2,"S",0,1,6,0,0,0,0,0,"","Serviço","Serviço","-","SINAPI",92688,"TUBO DE AÇO GALVANIZADO COM COSTURA, CLASSE MÉDIA, CONEXÃO ROSQUEADA, DN 20 (3/4\"), INSTALADO EM RAMAIS E SUB-RAMAIS DE GÁS - FORNECIMENTO E INSTALAÇÃO. AF_12/2015","M",24,1,24,null,null,0,0,""]
["S",2,"S",0,1,6,0,0,0,0,0,"","Serviço","Serviço","-","SINAPI",92701,"JOELHO 90 GRAUS, EM FERRO GALVANIZADO, CONEXÃO ROSQUEADA, DN 20 (3/4\"), INSTALADO EM RAMAIS E SUB-RAMAIS DE GÁS - FORNECIMENTO E INSTALAÇÃO. AF_12/2015","UN",7,1,7,null,null,0,0,""]
["S",2,"S",0,1,6,0,0,0,0,0,"","Serviço","Serviço","-","COMPOSIÇÃO","COMP 237_SEE","FITA ANTICORROSIVA","M",18,1,18,null,null,0,0,""]
["S",2,"S",0,1,6,0,0,0,0,0,"","Serviço","Serviço","-","AGETOP",91025,"VÁLVULA ESFERICA LATÃO 3/4\"","Un    ",3,1,3,null,null,0,0,""]
["S",2,"S",0,1,6,0,0,0,0,0,"","Serviço","Serviço","-","COMPOSIÇÃO","COMP 542_SEE","VÁLVULA UGV 3/4\" (S) LATÃO","UN ",2,1,2,null,null,0,0,""]
["S",2,"S",0,1,6,0,0,0,0,0,"","Serviço","Serviço","-","COMPOSIÇÃO","COMP 543_SEE","VÁLVULA UGV 1/2\" (S) LATÃO","UN ",2,1,2,null,null,0,0,""]
["S",2,"S",0,1,6,0,0,0,0,0,"","Serviço","Serviço","-","AGETOP",91029,"VALVULA DE RETENÇÃO LATÃO 1/2\" X 7/16\" NPT","Un    ",2,1,2,null,null,0,0,""]
["S",2,"S",0,1,6,0,0,0,0,0,"","Serviço","Serviço","-","COMPOSIÇÃO","COMP 211_SEE","REGULADOR DE 2º ESTÁGIO 5KG/H","UN ",2,1,2,null,null,0,0,""]
["S",2,"S",0,1,6,0,0,0,0,0,"","Serviço","Serviço","-","COMPOSIÇÃO","COMP 210_SEE","REGULADOR DE 1º ESTÁGIO 60KG/H MODELO AP-40  COM MANÔMETRO","UN ",1,1,1,null,null,0,0,""]
["S",2,"S",0,1,6,0,0,0,0,0,"","Serviço","Serviço","-","AGETOP",85003,"EXTINTOR PO QUIMICO SECO (6 KG) - CAPACIDADE EXTINTORA 20 BC","Un    ",1,1,1,null,null,0,0,""]
["S",2,"S",0,1,6,0,0,0,0,0,"","Serviço","Serviço","-","COMPOSIÇÃO","COMP 235_SEE","PLACA DE SINALIZAÇÃO EM PVC COD 01 - (300X300) PROIBIDO FUMAR","UN ",2,1,2,null,null,0,0,""]
["S",2,"S",0,1,6,0,0,0,0,0,"","Serviço","Serviço","-","COMPOSIÇÃO","COMP 236_SEE","PLACA DE SINALIZAÇÃO EM PVC COD 06 - (300X300) PERIGO INFLAMÁVEL","UN ",2,1,2,null,null,0,0,""]
["S",2,"S",0,1,6,0,0,0,0,0,"","Serviço","Serviço","-","AGETOP",91043,"BRAÇADEIRA METALICA TIPO \"D\" DIAM. 3/4\"","Un    ",5,1,5,null,null,0,0,""]
["S",2,"S",0,1,6,0,0,0,0,0,"","Serviço","Serviço","-","AGETOP",71863,"PARAFUSO P/BUCHA S-10","Un    ",10,1,10,null,null,0,0,""]
["S",2,"S",0,1,6,0,0,0,0,0,"","Serviço","Serviço","-","AGETOP",70393,"BUCHA DE NYLON S-10","Un    ",10,1,10,null,null,0,0,""]
["S",2,"S",0,1,6,0,0,0,0,0,"","Serviço","Serviço","-","AGETOP",91045,"SUPORTE PARA COLETOR","Un    ",2,1,2,null,null,0,0,""]
[{"$f":"CHOOSE(1+LOG(1+2*(ORÇAMENTO.Nivel=\"Nível 1\")+4*(ORÇAMENTO.Nivel=\"Nível 2\")+8*(ORÇAMENTO.Nivel=\"Nível 3\")+16*(ORÇAMENTO.Nivel=\"Nível 4\")+32*(ORÇAMENTO.Nivel=\"Serviço\"),2),0,1,2,3,4,\"S\")","v":2},2,2,7,1,7,0,0,{"$f":"IF(AND($C371<=4,$C371<>0),0,IF(AND($C371=\"S\",$Y371>0),OFFSET(I371,-1,0)+1,OFFSET(I371,-1,0)))","v":0},80,7,"","Nível 2","Nível 2","-","AGETOP",91045,"ALVENARIAS E DIVISÓRIAS","Un    ",null,1,"-",null,null,0,0,""]
[3,3,3,2,1,7,1,0,0,6,2,"","Nível 3","Nível 3","-","SINAPI",null,"READEQUAÇÕES DE ALGUNS AMBIENTES","-",null,1,"-",null,null,0,0,""]
["S",3,"S",0,1,7,1,0,0,0,0,"","Serviço","Serviço","-","SINAPI",87520,"ALVENARIA DE VEDAÇÃO DE BLOCOS CERÂMICOS FURADOS NA HORIZONTAL DE 9X19X19CM (ESPESSURA 9CM) DE PAREDES COM ÁREA LÍQUIDA MAIOR OU IGUAL A 6M² COM VÃOS E ARGAMASSA DE ASSENTAMENTO COM PREPARO MANUAL. AF_06/2014","M2",4.5,1,4.5,null,null,0,0,"Referência: AGETOP - 100201"]
[3,3,3,2,1,7,2,0,0,4,2,"","Nível 3","Nível 3","-","SINAPI",null,"READEQUAÇÕES COZINHA ATUAL PARA SALA DE AULA","-",null,1,"-",null,null,0,0,""]
["S",3,"S",0,1,7,2,0,0,0,0,"","Serviço","Serviço","-","SINAPI",87520,"ALVENARIA DE VEDAÇÃO DE BLOCOS CERÂMICOS FURADOS NA HORIZONTAL DE 9X19X19CM (ESPESSURA 9CM) DE PAREDES COM ÁREA LÍQUIDA MAIOR OU IGUAL A 6M² COM VÃOS E ARGAMASSA DE ASSENTAMENTO COM PREPARO MANUAL. AF_06/2014","M2",1.86,1,1.86,null,null,0,0,"Referência: AGETOP - 100201"]
[3,{"$f":"IF(OR(C376=\"s\",C376=0),OFFSET(B376,-1,0),C376)","v":3},{"$f":"IF(OFFSET(C376,-1,0)=\"L\",1,IF(OFFSET(C376,-1,0)=1,2,IF(OR(A376=\"s\",A376=0),\"S\",IF(AND(OFFSET(C376,-1,0)=2,A376=4),3,IF(AND(OR(OFFSET(C376,-1,0)=\"s\",OFFSET(C376,-1,0)=0),A376<>\"s\",A376>OFFSET(B376,-1,0)),OFFSET(B376,-1,0),A376)))))","v":3},{"$f":"IF(OR(C376=\"S\",C376=0),0,IF(ISERROR(K376),J376,SMALL(J376:K376,1)))","v":2},{"$f":"IF($C376=1,OFFSET(E376,-1,0)+1,OFFSET(E376,-1,0))","v":1},{"$f":"IF($C376=1,0,IF($C376=2,OFFSET(F376,-1,0)+1,OFFSET(F376,-1,0)))","v":7},{"$f":"IF(AND($C376<=2,$C376<>0),0,IF($C376=3,OFFSET(G376,-1,0)+1,OFFSET(G376,-1,0)))","v":3},{"$f":"IF(AND($C376<=3,$C376<>0),0,IF($C376=4,OFFSET(H376,-1,0)+1,OFFSET(H376,-1,0)))","v":0},0,2,21,"","Nível 3","Nível 3","-","SINAPI",null,"BANHEIROS","-",null,1,"-",null,null,0,0,""]
["S",3,"S",0,1,7,3,0,0,0,0,"","Serviço","Serviço","-","SINAPI",87520,"ALVENARIA DE VEDAÇÃO DE BLOCOS CERÂMICOS FURADOS NA HORIZONTAL DE 9X19X19CM (ESPESSURA 9CM) DE PAREDES COM ÁREA LÍQUIDA MAIOR OU IGUAL A 6M² COM VÃOS E ARGAMASSA DE ASSENTAMENTO COM PREPARO MANUAL. AF_06/2014","M2",4.8,1,4.8,null,null,0,0,"Referência: AGETOP - 100201"]
[2,{"$f":"IF(OR(C378=\"s\",C378=0),OFFSET(B378,-1,0),C378)","v":2},{"$f":"IF(OFFSET(C378,-1,0)=\"L\",1,IF(OFFSET(C378,-1,0)=1,2,IF(OR(A378=\"s\",A378=0),\"S\",IF(AND(OFFSET(C378,-1,0)=2,A378=4),3,IF(AND(OR(OFFSET(C378,-1,0)=\"s\",OFFSET(C378,-1,0)=0),A378<>\"s\",A378>OFFSET(B378,-1,0)),OFFSET(B378,-1,0),A378)))))","v":2},{"$f":"IF(OR(C378=\"S\",C378=0),0,IF(ISERROR(K378),J378,SMALL(J378:K378,1)))","v":4},{"$f":"IF($C378=1,OFFSET(E378,-1,0)+1,OFFSET(E378,-1,0))","v":1},{"$f":"IF($C378=1,0,IF($C378=2,OFFSET(F378,-1,0)+1,OFFSET(F378,-1,0)))","v":8},{"$f":"IF(AND($C378<=2,$C378<>0),0,IF($C378=3,OFFSET(G378,-1,0)+1,OFFSET(G378,-1,0)))","v":0},{"$f":"IF(AND($C378<=3,$C378<>0),0,IF($C378=4,OFFSET(H378,-1,0)+1,OFFSET(H378,-1,0)))","v":0},0,73,4,"","Nível 2","Nível 2","-",null,null,"COBERTURAS","-",null,1,"-",null,null,0,0,""]
[3,3,3,3,1,8,1,0,0,3,13,"","Nível 3","Nível 3","-","SINAPI",null,"REFORMA COBERTURA","-",null,1,"-",null,null,0,0,""]
["S",3,"S",0,1,8,1,0,0,0,0,"","Serviço","Serviço","-","SINAPI",94445,"TELHAMENTO COM TELHA CERÂMICA CAPA-CANAL, TIPO PLAN, COM ATÉ 2 ÁGUAS, INCLUSO TRANSPORTE VERTICAL. AF_07/2019","M2",543.73,1,543.73,null,null,0,0,"Referência: AGETOP - 160401"]
["S",3,"S",0,1,8,1,0,0,0,0,"","Serviço","Serviço","-","AGETOP",140202,"GRADEADO CAIBROS/RIPAS","m2    ",543.73,1,543.73,null,null,0,0,""]
[2,2,2,5,1,9,0,0,0,69,5,"","Nível 2","Nível 2","-",null,null,"ESQUADRIAS METÁLICAS","-",null,1,"-",null,null,0,0,""]
[3,3,3,4,1,9,1,0,0,4,9,"","Nível 3","Nível 3","-","SINAPI",null,"READEQUAÇÕES DE ALGUNS AMBIENTES","-",null,1,"-",null,null,0,0,""]
["S",3,"S",0,1,9,1,0,0,0,0,"","Serviço","Serviço","-","SINAPI","73933/4","PORTA DE FERRO DE ABRIR TIPO BARRA CHATA, COM REQUADRO E GUARNICAO COMPLETA","M2",3.3600000000000003,1,3.3600000000000003,null,null,0,0,"Referência: AGETOP - 180501"]
["S",3,"S",0,1,9,1,0,0,0,0,"","Serviço","Serviço","-","AGETOP",180507,"PORTA DE CORRER C/BASCULA PF-7/PF-8 C/ FERRAGENS","m2    ",11.76,1,11.76,null,null,0,0,""]
["S",3,"S",0,1,9,1,0,0,0,0,"","Serviço","Serviço","-","COMPOSIÇÃO","COMP 007_SEE","GUICHÊ CANTONEIRA/GRADE PARA VIDRO","M²",1.44,1,1.44,null,null,0,0,""]
[2,2,2,16,1,10,0,0,0,64,16,"","Nível 2","Nível 2","-",null,null,"REVESTIMENTO DE PAREDE","-",null,1,"-",null,null,0,0,""]
[3,3,3,4,1,10,1,0,0,15,4,"","Nível 3","Nível 3","-","SINAPI",null,"READEQUAÇÕES DE ALGUNS AMBIENTES","-",null,1,"-",null,null,0,0,""]
["S",3,"S",0,1,10,1,0,0,0,0,"","Serviço","Serviço","-","SINAPI",87904,"CHAPISCO APLICADO EM ALVENARIA (COM PRESENÇA DE VÃOS) E ESTRUTURAS DE CONCRETO DE FACHADA, COM COLHER DE PEDREIRO.  ARGAMASSA TRAÇO 1:3 COM PREPARO MANUAL. AF_06/2014","M2",4.5,1,4.5,null,null,0,0,"Referência: AGETOP - 200101"]
["S",3,"S",0,1,10,1,0,0,0,0,"","Serviço","Serviço","-","SINAPI",87547,"MASSA ÚNICA, PARA RECEBIMENTO DE PINTURA, EM ARGAMASSA TRAÇO 1:2:8, PREPARO MECÂNICO COM BETONEIRA 400L, APLICADA MANUALMENTE EM FACES INTERNAS DE PAREDES, ESPESSURA DE 10MM, COM EXECUÇÃO DE TALISCAS. AF_06/2014","M2",4.5,1,4.5,null,null,0,0,""]
["S",3,"S",0,1,10,1,0,0,0,0,"","Serviço","Serviço","-","SINAPI",87273,"REVESTIMENTO CERÂMICO PARA PAREDES INTERNAS COM PLACAS TIPO ESMALTADA EXTRA DE DIMENSÕES 33X45 CM APLICADAS EM AMBIENTES DE ÁREA MAIOR QUE 5 M² NA ALTURA INTEIRA DAS PAREDES. AF_06/2014","M2",86.04,1,86.04,null,null,0,0,""]
[3,3,3,3,1,10,2,0,0,11,3,"","Nível 3","Nível 3","-","SINAPI",null,"READEQUAÇÕES COZINHA ATUAL PARA SALA DE AULA","-",null,1,"-",null,null,0,0,""]
["S",3,"S",0,1,10,2,0,0,0,0,"","Serviço","Serviço","-","SINAPI",87553,"EMBOÇO, PARA RECEBIMENTO DE CERÂMICA, EM ARGAMASSA TRAÇO 1:2:8, PREPARO MECÂNICO COM BETONEIRA 400L, APLICADO MANUALMENTE EM FACES INTERNAS DE PAREDES, PARA AMBIENTE COM ÁREA MAIOR QUE 10M2, ESPESSURA DE 10MM, COM EXECUÇÃO DE TALISCAS. AF_06/2014","M2",8,1,8,null,null,0,0,""]
["S",3,"S",0,1,10,2,0,0,0,0,"","Serviço","Serviço","-","SINAPI",87547,"MASSA ÚNICA, PARA RECEBIMENTO DE PINTURA, EM ARGAMASSA TRAÇO 1:2:8, PREPARO MECÂNICO COM BETONEIRA 400L, APLICADA MANUALMENTE EM FACES INTERNAS DE PAREDES, ESPESSURA DE 10MM, COM EXECUÇÃO DE TALISCAS. AF_06/2014","M2",1.86,1,1.86,null,null,0,0,""]
[3,3,3,2,1,10,3,0,0,8,2,"","Nível 3","Nível 3","-","SINAPI",null,"BANHEIROS","-",null,1,"-",null,null,0,0,""]
["S",3,"S",0,1,10,3,0,0,0,0,"","Serviço","Serviço","-","SINAPI",87273,"REVESTIMENTO CERÂMICO PARA PAREDES INTERNAS COM PLACAS TIPO ESMALTADA EXTRA DE DIMENSÕES 33X45 CM APLICADAS EM AMBIENTES DE ÁREA MAIOR QUE 5 M² NA ALTURA INTEIRA DAS PAREDES. AF_06/2014","M2",189.28,1,189.28,null,null,0,0,""]
[3,3,3,2,1,10,4,0,0,6,2,"","Nível 3","Nível 3","-","SINAPI",null,"ESCOVODROMO","-",null,1,"-",null,null,0,0,""]
["S",3,"S",0,1,10,4,0,0,0,0,"","Serviço","Serviço","-","SINAPI",87273,"REVESTIMENTO CERÂMICO PARA PAREDES INTERNAS COM PLACAS TIPO ESMALTADA EXTRA DE DIMENSÕES 33X45 CM APLICADAS EM AMBIENTES DE ÁREA MAIOR QUE 5 M² NA ALTURA INTEIRA DAS PAREDES. AF_06/2014","M2",7,1,7,null,null,0,0,""]
[3,3,3,2,1,10,5,0,0,4,2,"","Nível 3","Nível 3","-","SINAPI",null,"DEPOSITO PÁTIO","-",null,1,"-",null,null,0,0,""]
["S",3,"S",0,1,10,5,0,0,0,0,"","Serviço","Serviço","-","SINAPI",87273,"REVESTIMENTO CERÂMICO PARA PAREDES INTERNAS COM PLACAS TIPO ESMALTADA EXTRA DE DIMENSÕES 33X45 CM APLICADAS EM AMBIENTES DE ÁREA MAIOR QUE 5 M² NA ALTURA INTEIRA DAS PAREDES. AF_06/2014","M2",45.6,1,45.6,null,null,0,0,""]
[3,3,3,2,1,10,6,0,0,2,{"$error":"#N/A"},"","Nível 3","Nível 3","-","SINAPI",null,"REBOCO PARA LETREIRO","-",null,1,"-",null,null,0,0,""]
[{"$f":"CHOOSE(1+LOG(1+2*(ORÇAMENTO.Nivel=\"Nível 1\")+4*(ORÇAMENTO.Nivel=\"Nível 2\")+8*(ORÇAMENTO.Nivel=\"Nível 3\")+16*(ORÇAMENTO.Nivel=\"Nível 4\")+32*(ORÇAMENTO.Nivel=\"Serviço\"),2),0,1,2,3,4,\"S\")","v":"S"},3,"S",0,{"$f":"IF($C402=1,OFFSET(E402,-1,0)+1,OFFSET(E402,-1,0))","v":1},{"$f":"IF($C402=1,0,IF($C402=2,OFFSET(F402,-1,0)+1,OFFSET(F402,-1,0)))","v":10},{"$f":"IF(AND($C402<=2,$C402<>0),0,IF($C402=3,OFFSET(G402,-1,0)+1,OFFSET(G402,-1,0)))","v":6},{"$f":"IF(AND($C402<=3,$C402<>0),0,IF($C402=4,OFFSET(H402,-1,0)+1,OFFSET(H402,-1,0)))","v":0},{"$f":"IF(AND($C402<=4,$C402<>0),0,IF(AND($C402=\"S\",$Y402>0),OFFSET(I402,-1,0)+1,OFFSET(I402,-1,0)))","v":0},0,0,"","Serviço","Serviço","-","AGETOP",200500,"REBOCO PAULISTA A-7 (1 CALH,4 ARMLC)","m2    ",5.76,1,5.76,null,null,0,0,""]
[2,2,2,3,1,11,0,0,0,{"$f":"IF(OR($C403=\"S\",$C403=0),0,MATCH(0,OFFSET($D403,1,$C403,ROW($C$923)-ROW($C403)),0))","v":48},{"$f":"IF(OR($C403=\"S\",$C403=0),0,MATCH(OFFSET($D403,0,$C403)+1,OFFSET($D403,1,$C403,ROW($C$923)-ROW($C403)),0))","v":3},"","Nível 2","Nível 2","-",null,null,"FORROS","-",null,1,"-",null,null,0,0,""]
[3,3,3,2,1,11,1,0,0,2,6,"","Nível 3","Nível 3","-","SINAPI",null,"REFORMA DO FORRO","-",null,1,"-",null,null,0,0,""]
["S",{"$f":"IF(OR(C405=\"s\",C405=0),OFFSET(B405,-1,0),C405)","v":3},{"$f":"IF(OFFSET(C405,-1,0)=\"L\",1,IF(OFFSET(C405,-1,0)=1,2,IF(OR(A405=\"s\",A405=0),\"S\",IF(AND(OFFSET(C405,-1,0)=2,A405=4),3,IF(AND(OR(OFFSET(C405,-1,0)=\"s\",OFFSET(C405,-1,0)=0),A405<>\"s\",A405>OFFSET(B405,-1,0)),OFFSET(B405,-1,0),A405)))))","v":"S"},{"$f":"IF(OR(C405=\"S\",C405=0),0,IF(ISERROR(K405),J405,SMALL(J405:K405,1)))","v":0},1,11,1,0,0,0,0,"","Serviço","Serviço","-","SINAPI",96116,"FORRO EM RÉGUAS DE PVC, FRISADO, PARA AMBIENTES COMERCIAIS, INCLUSIVE ESTRUTURA DE FIXAÇÃO. AF_05/2017_P","M2",781.89,1,781.89,null,null,0,0,"Referência: AGETOP - 210460"]
[2,2,2,11,1,12,0,0,0,45,11,"","Nível 2","Nível 2","-",null,null,"REVESTIMENTO DE PISO","-",null,1,"-",null,null,0,0,""]
[3,3,3,3,1,12,1,0,0,10,3,"","Nível 3","Nível 3","-","SINAPI",null,"READEQUAÇÕES COZINHA ATUAL PARA SALA DE AULA","-",null,1,"-",null,null,0,0,""]
["S",3,"S",0,1,12,1,0,0,0,0,"","Serviço","Serviço","-","SINAPI",84191,"PISO EM GRANILITE, MARMORITE OU GRANITINA ESPESSURA 8 MM, INCLUSO JUNTAS DE DILATACAO PLASTICAS","M2",63.312399999999997,1,63.312399999999997,null,null,0,0,"Referência: AGETOP - 221101"]
["S",3,"S",0,1,12,1,0,0,0,0,"","Serviço","Serviço","-","AGETOP",221104,"RASPAGEM E APLICAÇÃO RESINA ACRÍLICA DUAS DEMÃOS","m2    ",63.31,1,63.31,null,null,0,0,""]
[3,3,3,2,1,12,2,0,0,7,2,"","Nível 3","Nível 3","-","SINAPI",null,"BANHEIROS","-",null,1,"-",null,null,0,0,""]
["S",3,"S",0,1,12,2,0,0,0,0,"","Serviço","Serviço","-","SINAPI",87251,"REVESTIMENTO CERÂMICO PARA PISO COM PLACAS TIPO ESMALTADA EXTRA DE DIMENSÕES 45X45 CM APLICADA EM AMBIENTES DE ÁREA MAIOR QUE 10 M2. AF_06/2014","M2",47.38,1,47.38,null,null,0,0,""]
[3,3,3,2,1,12,3,0,0,5,2,"","Nível 3","Nível 3","-","SINAPI",null,"DEPOSITO PÁTIO","-",null,1,"-",null,null,0,0,""]
["S",3,"S",0,1,12,3,0,0,0,0,"","Serviço","Serviço","-","SINAPI",87251,"REVESTIMENTO CERÂMICO PARA PISO COM PLACAS TIPO ESMALTADA EXTRA DE DIMENSÕES 45X45 CM APLICADA EM AMBIENTES DE ÁREA MAIOR QUE 10 M2. AF_06/2014","M2",6.8,1,6.8,null,null,0,0,""]
[3,3,3,3,1,12,4,0,0,3,{"$error":"#N/A"},"","Nível 3","Nível 3","-","SINAPI",null,"CALÇADA ACESSÍVEL","-",null,1,"-",null,null,0,0,""]
["S",3,"S",0,1,12,4,0,0,0,0,"","Serviço","Serviço","-","SINAPI",94992,"EXECUÇÃO DE PASSEIO (CALÇADA) OU PISO DE CONCRETO COM CONCRETO MOLDADO IN LOCO, FEITO EM OBRA, ACABAMENTO CONVENCIONAL, ESPESSURA 6 CM, ARMADO. AF_07/2016","M2",759.29,1,759.29,null,null,0,0,""]
["S",3,"S",0,1,12,4,0,0,0,0,"","Serviço","Serviço","-","AGETOP",221126,"PISO DE LADRILHO HIDRÁULICO COLORIDO MODELO TÁTIL ( ALERTA OU DIRECIONAL) SEM LASTRO","m2    ",105.02,1,105.02,null,null,0,0,""]
[2,2,2,7,1,13,0,0,0,34,7,"","Nível 2","Nível 2","-",null,null,"FERRAGENS","-",null,1,"-",null,null,0,0,""]
[3,3,3,3,1,13,1,0,0,6,3,"","Nível 3","Nível 3","-","SINAPI",null,"ACESSIBILIDADE","-",null,1,"-",null,null,0,0,""]
["S",3,"S",0,1,13,1,0,0,0,0,"","Serviço","Serviço","-","COMPOSIÇÃO","COMP 083_SEE","CORRIMÃO PISO - SEDUC","M",40.68,1,40.68,null,null,0,0,""]
["S",3,"S",0,1,13,1,0,0,0,0,"","Serviço","Serviço","-","AGETOP",180314,"GUARDA CORPO COM CORRIMÃO/TUBO INDUSTRIAL  GC-1 ","m2    ",4.3099999999999996,1,4.3099999999999996,null,null,0,0,""]
[3,3,3,3,1,13,2,0,0,3,28,"","Nível 3","Nível 3","-","SINAPI",null,"BANHEIROS","-",null,1,"-",null,null,0,0,""]
["S",3,"S",0,1,13,2,0,0,0,0,"","Serviço","Serviço","-","AGETOP",230174,"BARRA DE APOIO EM AÇO INOX - 40 CM","un    ",6,1,6,null,null,0,0,""]
["S",3,"S",0,1,13,2,0,0,0,0,"","Serviço","Serviço","-","AGETOP",230176,"BARRA DE APOIO EM AÇO INOX - 80 CM ","un    ",6,1,6,null,null,0,0,""]
[2,2,2,6,1,14,0,0,0,27,6,"","Nível 2","Nível 2","-",null,null,"ADMINISTRAÇÃO","-",null,1,"-",null,null,0,0,""]
[3,3,3,3,1,14,1,0,0,5,3,"","Nível 3","Nível 3","-",null,null,"MENSALISTAS","-",null,1,"-",null,null,0,0,""]
["S",3,"S",0,1,14,1,0,0,0,0,"","Serviço","Serviço","-","SINAPI",90778,"ENGENHEIRO CIVIL DE OBRA PLENO COM ENCARGOS COMPLEMENTARES","H",176,1,176,null,null,0,0,"Referência: AGETOP - 250101"]
["S",3,"S",0,1,14,1,0,0,0,0,"","Serviço","Serviço","-","SINAPI",90776,"ENCARREGADO GERAL COM ENCARGOS COMPLEMENTARES","H",880,1,880,null,null,0,0,"Referência: AGETOP - 250103"]
[3,3,3,2,1,14,2,0,0,2,21,"","Nível 3","Nível 3","-",null,null,"LAUDO DE ESTANQUEIDADE","-",null,1,"-",null,null,0,0,""]
["S",3,"S",0,1,14,2,0,0,0,0,"","Serviço","Serviço","-","SINAPI",90778,"ENGENHEIRO CIVIL DE OBRA PLENO COM ENCARGOS COMPLEMENTARES","H",16,1,16,null,null,0,0,"Referência: AGETOP - 250101"]
[2,2,2,13,1,15,0,0,0,21,13,"","Nível 2","Nível 2","-",null,null,"PINTURA","-",null,1,"-",null,null,0,0,""]
[3,3,3,4,1,15,1,0,0,12,4,"","Nível 3","Nível 3","-","SINAPI",null,"MURO","-",null,1,"-",null,null,0,0,""]
["S",3,"S",0,1,15,1,0,0,0,0,"","Serviço","Serviço","-","AGETOP",261620,"LETREIRO MÉDIO A GRANDE PORTE EM PAREDE FEITO A PINCEL","m2    ",7.2,1,7.2,null,null,0,0,""]
["S",3,"S",0,1,15,1,0,0,0,0,"","Serviço","Serviço","-","AGETOP",261000,"PINTURA LATEX ACRILICA 2 DEMAOS C/SELADOR","m2    ",1600,1,1600,null,null,0,0,""]
["S",3,"S",0,1,15,1,0,0,0,0,"","Serviço","Serviço","-","AGETOP",261304,"EMASSAMENTO ACRILICO 2 DEMAOS","m2    ",5.76,1,5.76,null,null,0,0,""]
[3,3,3,8,1,15,2,0,0,8,14,"","Nível 3","Nível 3","-","SINAPI",null,"PAREDES","-",null,1,"-",null,null,0,0,""]
["S",3,"S",0,1,15,2,0,0,0,0,"","Serviço","Serviço","-","AGETOP",260104,"REMOCAO DE PINTURA ANTIGA A LATEX","m2    ",663.2,1,663.2,null,null,0,0,""]
["S",3,"S",0,1,15,2,0,0,0,0,"","Serviço","Serviço","-","AGETOP",261304,"EMASSAMENTO ACRILICO 2 DEMAOS","m2    ",663.2,1,663.2,null,null,0,0,""]
["S",3,"S",0,1,15,2,0,0,0,0,"","Serviço","Serviço","-","AGETOP",261550,"PINT.ESMALTE SINT.PAREDES - 2 DEM.C/SELADOR","m2    ",1214.5999999999999,1,1214.5999999999999,null,null,0,0,""]
["S",3,"S",0,1,15,2,0,0,0,0,"","Serviço","Serviço","-","AGETOP",261000,"PINTURA LATEX ACRILICA 2 DEMAOS C/SELADOR","m2    ",1126.17,1,1126.17,null,null,0,0,""]
["S",3,"S",0,1,15,2,0,0,0,0,"","Serviço","Serviço","-","AGETOP",260601,"PINTURA TEXTURIZADA C/SELADOR ACRILICO","m2    ",509.7,1,509.7,null,null,0,0,""]
["S",3,"S",0,1,15,2,0,0,0,0,"","Serviço","Serviço","-","AGETOP",260105,"REMOCAO DE PINTURA ANTIGA A OLEO OU ESMALTE","m2    ",380.65,1,380.65,null,null,0,0,""]
["S",3,"S",0,1,15,2,0,0,0,0,"","Serviço","Serviço","-","AGETOP",261602,"PINT.ESMALTE/ESQUAD.FERRO C/FUNDO ANTICOR.","m2    ",421.25,1,421.25,null,null,0,0,""]
[{"$f":"CHOOSE(1+LOG(1+2*(ORÇAMENTO.Nivel=\"Nível 1\")+4*(ORÇAMENTO.Nivel=\"Nível 2\")+8*(ORÇAMENTO.Nivel=\"Nível 3\")+16*(ORÇAMENTO.Nivel=\"Nível 4\")+32*(ORÇAMENTO.Nivel=\"Serviço\"),2),0,1,2,3,4,\"S\")","v":2},{"$f":"IF(OR(C443=\"s\",C443=0),OFFSET(B443,-1,0),C443)","v":2},{"$f":"IF(OFFSET(C443,-1,0)=\"L\",1,IF(OFFSET(C443,-1,0)=1,2,IF(OR(A443=\"s\",A443=0),\"S\",IF(AND(OFFSET(C443,-1,0)=2,A443=4),3,IF(AND(OR(OFFSET(C443,-1,0)=\"s\",OFFSET(C443,-1,0)=0),A443<>\"s\",A443>OFFSET(B443,-1,0)),OFFSET(B443,-1,0),A443)))))","v":2},{"$f":"IF(OR(C443=\"S\",C443=0),0,IF(ISERROR(K443),J443,SMALL(J443:K443,1)))","v":8},{"$f":"IF($C443=1,OFFSET(E443,-1,0)+1,OFFSET(E443,-1,0))","v":1},{"$f":"IF($C443=1,0,IF($C443=2,OFFSET(F443,-1,0)+1,OFFSET(F443,-1,0)))","v":16},{"$f":"IF(AND($C443<=2,$C443<>0),0,IF($C443=3,OFFSET(G443,-1,0)+1,OFFSET(G443,-1,0)))","v":0},{"$f":"IF(AND($C443<=3,$C443<>0),0,IF($C443=4,OFFSET(H443,-1,0)+1,OFFSET(H443,-1,0)))","v":0},{"$f":"IF(AND($C443<=4,$C443<>0),0,IF(AND($C443=\"S\",$Y443>0),OFFSET(I443,-1,0)+1,OFFSET(I443,-1,0)))","v":0},{"$f":"IF(OR($C443=\"S\",$C443=0),0,MATCH(0,OFFSET($D443,1,$C443,ROW($C$923)-ROW($C443)),0))","v":8},{"$f":"IF(OR($C443=\"S\",$C443=0),0,MATCH(OFFSET($D443,0,$C443)+1,OFFSET($D443,1,$C443,ROW($C$923)-ROW($C443)),0))","v":209},"","Nível 2","Nível 2","-",null,null,"DIVERSOS","-",null,1,"-",null,null,0,0,""]
[3,3,3,3,1,16,1,0,0,7,3,"","Nível 3","Nível 3","-","SINAPI",null,"READEQUAÇÕES DE ALGUNS AMBIENTES","-",null,1,"-",null,null,0,0,""]
["S",3,"S",0,1,16,1,0,0,0,0,"","Serviço","Serviço","-","AGETOP",100320,"DIVISORIA DE GRANITO POLIDO","m2    ",28.21,1,28.21,null,null,0,0,""]
["S",3,"S",0,1,16,1,0,0,0,0,"","Serviço","Serviço","-","AGETOP",271608,"BANCADA DE GRANITO C/ESPELHO","m2    ",13,1,13,null,null,0,0,""]
[3,3,3,2,1,16,2,0,0,4,2,"","Nível 3","Nível 3","-","SINAPI",null,"BANHEIROS","-",null,1,"-",null,null,0,0,""]
["S",3,"S",0,1,16,2,0,0,0,0,"","Serviço","Serviço","-","AGETOP",271608,"BANCADA DE GRANITO C/ESPELHO","m2    ",1.32,1,1.32,null,null,0,0,""]
[3,3,3,2,1,16,3,0,0,2,{"$error":"#N/A"},"","Nível 3","Nível 3","-","SINAPI",null,"REFORMA GERAL","-",null,1,"-",null,null,0,0,""]
["S",3,"S",0,1,16,3,0,0,0,0,"","Serviço","Serviço","-","AGETOP",270501,"LIMPEZA FINAL DE OBRA - (OBRAS CIVIS)","m2    ",800,1,800,null,null,0,0,""]
[1,1,1,11,2,0,0,0,0,472,11,"F","Nível 1","Nível 1","2.","SINAPI",null,"IMPLANTAÇÃO BLOCO COZINHA 2009","UN",1,1,1,null,null,0,0,""]
[2,2,2,4,2,1,0,0,0,10,4,"","Nível 2","Nível 2","-","SINAPI",null,"SERVIÇO EM TERRA","-",null,1,"-",null,null,0,0,""]
["S",2,"S",0,2,1,0,0,0,0,0,"","Serviço","Serviço","-","SINAPI",94315,"ATERRO MECANIZADO DE VALA COM RETROESCAVADEIRA (CAPACIDADE DA CAÇAMBA DA RETRO: 0,26 M³ / POTÊNCIA: 88 HP), LARGURA ATÉ 0,8 M, PROFUNDIDADE ATÉ 1,5 M, COM SOLO ARGILO-ARENOSO. AF_05/2016","M3",56.76,1,56.76,null,null,0,0,""]
["S",2,"S",0,2,1,0,0,0,0,0,"","Serviço","Serviço","-","AGETOP",41002,"APILOAMENTO","m2    ",56.76,1,56.76,null,null,0,0,""]
["S",2,"S",0,2,1,0,0,0,0,0,"","Serviço","Serviço","-","AGETOP",20190,"LIMPEZA MECANICA DE TERRENO","m2    ",145.87,1,145.87,null,null,0,0,""]
[2,2,2,2,2,2,0,0,0,6,2,"","Nível 2","Nível 2","-","SINAPI",null,"COBERTURAS","-",null,1,"-",null,null,0,0,""]
["S",2,"S",0,2,2,0,0,0,0,0,"","Serviço","Serviço","-","SINAPI",94228,"CALHA EM CHAPA DE AÇO GALVANIZADO NÚMERO 24, DESENVOLVIMENTO DE 50 CM, INCLUSO TRANSPORTE VERTICAL. AF_07/2019","M",8.1666666666666679,1,8.1666666666666679,null,null,0,0,"Referência: AGETOP - 160601"]
[2,2,2,2,2,3,0,0,0,4,2,"","Nível 2","Nível 2","-","SINAPI",null,"REVESTIMENTO DE PISO","-",null,1,"-",null,null,0,0,""]
["S",2,"S",0,2,3,0,0,0,0,0,"","Serviço","Serviço","-","SINAPI",94992,"EXECUÇÃO DE PASSEIO (CALÇADA) OU PISO DE CONCRETO COM CONCRETO MOLDADO IN LOCO, FEITO EM OBRA, ACABAMENTO CONVENCIONAL, ESPESSURA 6 CM, ARMADO. AF_07/2016","M2",41.99,1,41.99,null,null,0,0,""]
[2,2,2,2,2,4,0,0,0,2,47,"","Nível 2","Nível 2","-","SINAPI",null,"DIVERSOS","-",null,1,"-",null,null,0,0,""]
["S",2,"S",0,2,4,0,0,0,0,0,"","Serviço","Serviço","-","AGETOP",270210,"PLANTIO GRAMA ESMERALDA PLACA C/ M.O. IRRIG., ADUBO,TERRA VEGETAL (O.C.) A<11.000,00M2","m2    ",47.12,1,47.12,null,null,0,0,""]
[1,1,1,5,3,0,0,0,0,461,5,"F","Nível 1","Nível 1","3.","SINAPI",null,"IMPLANTAÇÃO PATIO MULTIUSO 2","UN",1,1,1,null,null,0,0,""]
[2,2,2,4,3,1,0,0,0,4,12,"","Nível 2","Nível 2","-","SINAPI",null,"SERVIÇO EM TERRA","-",null,1,"-",null,null,0,0,""]
["S",2,"S",0,3,1,0,0,0,0,0,"","Serviço","Serviço","-","AGETOP",41002,"APILOAMENTO","m2    ",89.67,1,89.67,null,null,0,0,""]
["S",2,"S",0,3,1,0,0,0,0,0,"","Serviço","Serviço","-","SINAPI",94315,"ATERRO MECANIZADO DE VALA COM RETROESCAVADEIRA (CAPACIDADE DA CAÇAMBA DA RETRO: 0,26 M³ / POTÊNCIA: 88 HP), LARGURA ATÉ 0,8 M, PROFUNDIDADE ATÉ 1,5 M, COM SOLO ARGILO-ARENOSO. AF_05/2016","M3",89.67,1,89.67,null,null,0,0,""]
["S",2,"S",0,3,1,0,0,0,0,0,"","Serviço","Serviço","-","AGETOP",20190,"LIMPEZA MECANICA DE TERRENO","m2    ",89.67,1,89.67,null,null,0,0,""]
[1,1,1,12,4,0,0,0,0,456,12,"F","Nível 1","Nível 1","4.","SINAPI",null,"IMPLANTAÇÃO 3 SALAS DE AULA - LAJE","UN",1,1,1,null,null,0,0,""]
[2,2,2,7,4,1,0,0,0,11,7,"","Nível 2","Nível 2","-","SINAPI",null,"SERVIÇOS PRELIMINARES","-",null,1,"-",null,null,0,0,""]
["S",2,"S",0,4,1,0,0,0,0,0,"","Serviço","Serviço","-","SINAPI",97644,"REMOÇÃO DE PORTAS, DE FORMA MANUAL, SEM REAPROVEITAMENTO. AF_12/2017","M2",1.6800000000000002,1,1.6800000000000002,null,null,0,0,"Referência: AGETOP - 20106"]
["S",2,"S",0,4,1,0,0,0,0,0,"","Serviço","Serviço","-","SINAPI",97622,"DEMOLIÇÃO DE ALVENARIA DE BLOCO FURADO, DE FORMA MANUAL, SEM REAPROVEITAMENTO. AF_12/2017","M3",0.504,1,0.504,null,null,0,0,"Referência: AGETOP - 20118"]
["S",2,"S",0,4,1,0,0,0,0,0,"","Serviço","Serviço","-","SINAPI",97645,"REMOÇÃO DE JANELAS, DE FORMA MANUAL, SEM REAPROVEITAMENTO. AF_12/2017","M2",0.96,1,0.96,null,null,0,0,"Referência: AGETOP - 20106"]
["S",2,"S",0,4,1,0,0,0,{"$f":"IF(OR($C472=\"S\",$C472=0),0,MATCH(0,OFFSET($D472,1,$C472,ROW($C$923)-ROW($C472)),0))","v":0},{"$f":"IF(OR($C472=\"S\",$C472=0),0,MATCH(OFFSET($D472,0,$C472)+1,OFFSET($D472,1,$C472,ROW($C$923)-ROW($C472)),0))","v":0},"","Serviço","Serviço","-","SINAPI",98532,"PODA EM ALTURA DE ÁRVORE COM DIÂMETRO DE TRONCO MENOR QUE 0,20 M.AF_05/2018","UN",5,1,5,null,null,0,0,""]
["S",2,"S",0,4,1,0,0,0,0,0,"","Serviço","Serviço","-","SINAPI",98529,"CORTE RASO E RECORTE DE ÁRVORE COM DIÂMETRO DE TRONCO MAIOR OU IGUAL A 0,20 M E MENOR QUE 0,40 M.AF_05/2018","UN",5,1,5,null,null,0,0,""]
["S",2,"S",0,4,1,0,0,0,{"$f":"IF(OR($C474=\"S\",$C474=0),0,MATCH(0,OFFSET($D474,1,$C474,ROW($C$923)-ROW($C474)),0))","v":0},{"$f":"IF(OR($C474=\"S\",$C474=0),0,MATCH(OFFSET($D474,0,$C474)+1,OFFSET($D474,1,$C474,ROW($C$923)-ROW($C474)),0))","v":0},"","Serviço","Serviço","-","SINAPI",98526,"REMOÇÃO DE RAÍZES REMANESCENTES DE TRONCO DE ÁRVORE COM DIÂMETRO MAIOR OU IGUAL A 0,20 M E MENOR QUE 0,40 M.AF_05/2018","UN",5,1,5,null,null,0,0,""]
[2,2,2,4,4,2,0,0,0,4,10,"","Nível 2","Nível 2","-","SINAPI",null,"SERVIÇO EM TERRA","-",null,1,"-",null,null,0,0,""]
["S",2,"S",0,4,2,0,0,0,0,0,"","Serviço","Serviço","-","AGETOP",20190,"LIMPEZA MECANICA DE TERRENO","m2    ",251.04,1,251.04,null,null,0,0,""]
["S",2,"S",0,4,2,0,0,0,0,0,"","Serviço","Serviço","-","SINAPI",94315,"ATERRO MECANIZADO DE VALA COM RETROESCAVADEIRA (CAPACIDADE DA CAÇAMBA DA RETRO: 0,26 M³ / POTÊNCIA: 88 HP), LARGURA ATÉ 0,8 M, PROFUNDIDADE ATÉ 1,5 M, COM SOLO ARGILO-ARENOSO. AF_05/2016","M3",190.26,1,190.26,null,null,0,0,""]
["S",2,"S",0,4,2,0,0,0,0,0,"","Serviço","Serviço","-","AGETOP",41002,"APILOAMENTO","m2    ",190.26,1,190.26,null,null,0,0,""]
[1,1,1,186,5,0,0,0,0,444,186,"F","Nível 1","Nível 1","5.","SINAPI",null,"COZINHA 2009","UN",1,1,1,null,null,0,0,""]
[2,2,2,2,5,1,0,0,0,185,2,"","Nível 2","Nível 2","-","SINAPI",null,"SERVIÇOS PRELIMINARES","-",null,1,"-",null,null,0,0,""]
["S",2,"S",0,5,1,0,0,0,0,0,"","Serviço","Serviço","-","AGETOP",20701,"LOCAÇÃO DA OBRA, EXECUÇÃO DE GABARITO SEM REAPROVEITAMENTO, INCLUSO PINTURA (FACE INTERNA DO RIPÃO 15CM) E PIQUETE COM TESTEMUNHA","m2    ",139.75,1,139.75,null,null,0,0,""]
[2,2,2,3,5,2,0,0,0,183,3,"","Nível 2","Nível 2","-","AGETOP",null,"TRANSPORTES","-",null,1,"-",null,null,0,0,""]
["S",2,"S",0,5,2,0,0,0,0,0,"","Serviço","Serviço","-","SINAPI",72900,"TRANSPORTE DE ENTULHO COM CAMINHAO BASCULANTE 6 M3, RODOVIA PAVIMENTADA, DMT 0,5 A 1,0 KM","M3",10,1,10,null,null,0,0,""]
["S",2,"S",0,5,2,0,0,0,0,0,"","Serviço","Serviço","-","SINAPI",72897,"CARGA MANUAL DE ENTULHO EM CAMINHAO BASCULANTE 6 M3","M3",10,1,10,null,null,0,0,""]
[2,2,2,2,5,3,0,0,0,180,2,"","Nível 2","Nível 2","-","AGETOP",null,"SERVIÇO EM TERRA","-",null,1,"-",null,null,0,0,""]
["S",2,"S",0,5,3,0,0,0,0,0,"","Serviço","Serviço","-","AGETOP",41002,"APILOAMENTO","m2    ",139.75,1,139.75,null,null,0,0,""]
[2,2,2,20,5,4,0,0,0,178,20,"","Nível 2","Nível 2","-","AGETOP",null,"FUNDAÇÕES E SONDAGENS","-",null,1,"-",null,null,0,0,""]
[3,3,3,9,5,4,1,0,0,19,9,"","Nível 3","Nível 3","-","SINAPI",null,"ESTACAS E BLOCOS","-",null,1,"-",null,null,0,0,""]
["S",3,"S",0,5,4,1,0,0,0,0,"","Serviço","Serviço","-","SINAPI",98230,"ESTACA BROCA DE CONCRETO, DIÂMETRO DE 30 CM, PROFUNDIDADE DE ATÉ 3 M, ESCAVAÇÃO MANUAL COM TRADO CONCHA, NÃO ARMADA. AF_03/2018","M",101.5,1,101.5,null,null,0,0,"Referência: AGETOP - 50302"]
["S",3,"S",0,5,4,1,0,0,0,0,"","Serviço","Serviço","-","SINAPI",96522,"ESCAVAÇÃO MANUAL PARA BLOCO DE COROAMENTO OU SAPATA, SEM PREVISÃO DE FÔRMA. AF_06/2017","M3",5.19,1,5.19,null,null,0,0,"Referência: AGETOP - 50901"]
["S",3,"S",0,5,4,1,0,0,0,0,"","Serviço","Serviço","-","SINAPI",94963,"CONCRETO FCK = 15MPA, TRAÇO 1:3,4:3,5 (CIMENTO/ AREIA MÉDIA/ BRITA 1)  - PREPARO MECÂNICO COM BETONEIRA 400 L. AF_07/2016","M3",3.4,1,3.4,null,null,0,0,""]
["S",3,"S",0,5,4,1,0,0,0,0,"","Serviço","Serviço","-","SINAPI","74157/4","LANCAMENTO/APLICACAO MANUAL DE CONCRETO EM FUNDACOES","M3",3.4,1,3.4,null,null,0,0,"Referência: AGETOP - 51026"]
["S",3,"S",0,5,4,1,0,0,0,0,"","Serviço","Serviço","-","AGETOP",60191,"FORMA DE TABUA CINTA BALDRAME U=8 VEZES","m2    ",23.7,1,23.7,null,null,0,0,""]
["S",3,"S",0,5,4,1,0,0,0,0,"","Serviço","Serviço","-","SINAPI",96543,"ARMAÇÃO DE BLOCO, VIGA BALDRAME E SAPATA UTILIZANDO AÇO CA-60 DE 5 MM - MONTAGEM. AF_06/2017","KG",98.2,1,98.2,null,null,0,0,"Referência: AGETOP - 52014"]
["S",3,"S",0,5,4,1,0,0,0,0,"","Serviço","Serviço","-","SINAPI",96546,"ARMAÇÃO DE BLOCO, VIGA BALDRAME OU SAPATA UTILIZANDO AÇO CA-50 DE 10 MM - MONTAGEM. AF_06/2017","KG",226.54,1,226.54,null,null,0,0,"Referência: AGETOP - 52005"]
["S",3,"S",0,5,4,1,0,0,0,0,"","Serviço","Serviço","-","SINAPI",96547,"ARMAÇÃO DE BLOCO, VIGA BALDRAME OU SAPATA UTILIZANDO AÇO CA-50 DE 12,5 MM - MONTAGEM. AF_06/2017","KG",240,1,240,null,null,0,0,""]
[3,3,3,8,5,4,2,0,0,10,8,"","Nível 3","Nível 3","-","SINAPI",null,"VIGAS BALDRAMES","-",null,1,"-",null,null,0,0,""]
[{"$f":"CHOOSE(1+LOG(1+2*(ORÇAMENTO.Nivel=\"Nível 1\")+4*(ORÇAMENTO.Nivel=\"Nível 2\")+8*(ORÇAMENTO.Nivel=\"Nível 3\")+16*(ORÇAMENTO.Nivel=\"Nível 4\")+32*(ORÇAMENTO.Nivel=\"Serviço\"),2),0,1,2,3,4,\"S\")","v":"S"},3,"S",0,5,4,2,0,{"$f":"IF(AND($C498<=4,$C498<>0),0,IF(AND($C498=\"S\",$Y498>0),OFFSET(I498,-1,0)+1,OFFSET(I498,-1,0)))","v":0},0,0,"","Serviço","Serviço","-","AGETOP",60191,"FORMA DE TABUA CINTA BALDRAME U=8 VEZES","m2    ",41.5,1,41.5,null,null,0,0,""]
["S",3,"S",0,5,4,2,0,0,0,0,"","Serviço","Serviço","-","SINAPI",94964,"CONCRETO FCK = 20MPA, TRAÇO 1:2,7:3 (CIMENTO/ AREIA MÉDIA/ BRITA 1)  - PREPARO MECÂNICO COM BETONEIRA 400 L. AF_07/2016","M3",2.4,1,2.4,null,null,0,0,""]
["S",3,"S",0,5,4,2,0,0,0,0,"","Serviço","Serviço","-","SINAPI","74157/4","LANCAMENTO/APLICACAO MANUAL DE CONCRETO EM FUNDACOES","M3",2.4,1,2.4,null,null,0,0,"Referência: AGETOP - 51026"]
["S",3,"S",0,{"$f":"IF($C501=1,OFFSET(E501,-1,0)+1,OFFSET(E501,-1,0))","v":5},{"$f":"IF($C501=1,0,IF($C501=2,OFFSET(F501,-1,0)+1,OFFSET(F501,-1,0)))","v":4},{"$f":"IF(AND($C501<=2,$C501<>0),0,IF($C501=3,OFFSET(G501,-1,0)+1,OFFSET(G501,-1,0)))","v":2},{"$f":"IF(AND($C501<=3,$C501<>0),0,IF($C501=4,OFFSET(H501,-1,0)+1,OFFSET(H501,-1,0)))","v":0},0,0,0,"","Serviço","Serviço","-","SINAPI",96544,"ARMAÇÃO DE BLOCO, VIGA BALDRAME OU SAPATA UTILIZANDO AÇO CA-50 DE 6,3 MM - MONTAGEM. AF_06/2017","KG",47,1,47,null,null,0,0,"Referência: AGETOP - 52003"]
["S",3,"S",0,5,4,2,0,0,{"$f":"IF(OR($C502=\"S\",$C502=0),0,MATCH(0,OFFSET($D502,1,$C502,ROW($C$923)-ROW($C502)),0))","v":0},{"$f":"IF(OR($C502=\"S\",$C502=0),0,MATCH(OFFSET($D502,0,$C502)+1,OFFSET($D502,1,$C502,ROW($C$923)-ROW($C502)),0))","v":0},"","Serviço","Serviço","-","SINAPI",96545,"ARMAÇÃO DE BLOCO, VIGA BALDRAME OU SAPATA UTILIZANDO AÇO CA-50 DE 8 MM - MONTAGEM. AF_06/2017","KG",49,1,49,null,null,0,0,"Referência: AGETOP - 52004"]
["S",3,"S",0,5,4,2,0,0,0,0,"","Serviço","Serviço","-","SINAPI",96546,"ARMAÇÃO DE BLOCO, VIGA BALDRAME OU SAPATA UTILIZANDO AÇO CA-50 DE 10 MM - MONTAGEM. AF_06/2017","KG",38,1,38,null,null,0,0,"Referência: AGETOP - 52005"]
["S",3,"S",0,5,4,2,0,0,0,0,"","Serviço","Serviço","-","SINAPI",96543,"ARMAÇÃO DE BLOCO, VIGA BALDRAME E SAPATA UTILIZANDO AÇO CA-60 DE 5 MM - MONTAGEM. AF_06/2017","KG",72,1,72,null,null,0,0,"Referência: AGETOP - 52014"]
[3,3,3,2,5,4,3,0,0,2,{"$error":"#N/A"},"","Nível 3","Nível 3","-","SINAPI",null,"OUTROS","-",null,1,"-",null,null,0,0,""]
["S",3,"S",0,5,4,3,0,0,0,0,"","Serviço","Serviço","-","AGETOP",50101,"SONDAGENS P/INTERIOR - (OBRAS CIVIS)","m     ",28,1,28,null,null,0,0,""]
[2,{"$f":"IF(OR(C507=\"s\",C507=0),OFFSET(B507,-1,0),C507)","v":2},{"$f":"IF(OFFSET(C507,-1,0)=\"L\",1,IF(OFFSET(C507,-1,0)=1,2,IF(OR(A507=\"s\",A507=0),\"S\",IF(AND(OFFSET(C507,-1,0)=2,A507=4),3,IF(AND(OR(OFFSET(C507,-1,0)=\"s\",OFFSET(C507,-1,0)=0),A507<>\"s\",A507>OFFSET(B507,-1,0)),OFFSET(B507,-1,0),A507)))))","v":2},{"$f":"IF(OR(C507=\"S\",C507=0),0,IF(ISERROR(K507),J507,SMALL(J507:K507,1)))","v":20},5,5,0,0,0,158,20,"","Nível 2","Nível 2","-","AGETOP",null,"ESTRUTURA","-",null,1,"-",null,null,0,0,""]
[3,3,3,8,5,5,1,0,0,19,8,"","Nível 3","Nível 3","-","AGETOP",null,"PILAR","-",null,1,"-",null,null,0,0,""]
["S",3,"S",0,5,5,1,0,0,0,0,"","Serviço","Serviço","-","SINAPI",92426,"MONTAGEM E DESMONTAGEM DE FÔRMA DE PILARES RETANGULARES E ESTRUTURAS SIMILARES COM ÁREA MÉDIA DAS SEÇÕES MENOR OU IGUAL A 0,25 M², PÉ-DIREITO SIMPLES, EM CHAPA DE MADEIRA COMPENSADA RESINADA, 8 UTILIZAÇÕES. AF_12/2015","M2",59.6,1,59.6,null,null,0,0,""]
["S",3,"S",0,5,5,1,0,0,0,0,"","Serviço","Serviço","-","SINAPI",94964,"CONCRETO FCK = 20MPA, TRAÇO 1:2,7:3 (CIMENTO/ AREIA MÉDIA/ BRITA 1)  - PREPARO MECÂNICO COM BETONEIRA 400 L. AF_07/2016","M3",2.5,1,2.5,null,null,0,0,""]
["S",3,"S",0,5,5,1,0,0,0,0,"","Serviço","Serviço","-","SINAPI",92873,"LANÇAMENTO COM USO DE BALDES, ADENSAMENTO E ACABAMENTO DE CONCRETO EM ESTRUTURAS. AF_12/2015","M3",2.5,1,2.5,null,null,0,0,"Referência: AGETOP - 60801"]
["S",3,"S",0,5,5,1,0,0,0,0,"","Serviço","Serviço","-","SINAPI",92776,"ARMAÇÃO DE PILAR OU VIGA DE UMA ESTRUTURA CONVENCIONAL DE CONCRETO ARMADO EM UMA EDIFICAÇÃO TÉRREA OU SOBRADO UTILIZANDO AÇO CA-50 DE 6,3 MM - MONTAGEM. AF_12/2015","KG",42,1,42,null,null,0,0,"Referência: AGETOP - 60303"]
["S",3,"S",0,5,5,1,0,0,0,0,"","Serviço","Serviço","-","SINAPI",92777,"ARMAÇÃO DE PILAR OU VIGA DE UMA ESTRUTURA CONVENCIONAL DE CONCRETO ARMADO EM UMA EDIFICAÇÃO TÉRREA OU SOBRADO UTILIZANDO AÇO CA-50 DE 8,0 MM - MONTAGEM. AF_12/2015","KG",64,1,64,null,null,0,0,"Referência: AGETOP - 60304"]
["S",3,"S",0,5,5,1,0,0,0,0,"","Serviço","Serviço","-","SINAPI",92778,"ARMAÇÃO DE PILAR OU VIGA DE UMA ESTRUTURA CONVENCIONAL DE CONCRETO ARMADO EM UMA EDIFICAÇÃO TÉRREA OU SOBRADO UTILIZANDO AÇO CA-50 DE 10,0 MM - MONTAGEM. AF_12/2015","KG",165.46,1,165.46,null,null,0,0,"Referência: AGETOP - 60305"]
["S",3,"S",0,5,5,1,0,0,0,0,"","Serviço","Serviço","-","SINAPI",92775,"ARMAÇÃO DE PILAR OU VIGA DE UMA ESTRUTURA CONVENCIONAL DE CONCRETO ARMADO EM UMA EDIFICAÇÃO TÉRREA OU SOBRADO UTILIZANDO AÇO CA-60 DE 5,0 MM - MONTAGEM. AF_12/2015","KG",22.8,1,22.8,null,null,0,0,"Referência: AGETOP - 60314"]
[3,3,3,9,5,5,2,0,0,11,9,"","Nível 3","Nível 3","-",null,null,"VIGA DE COBERTURA","-",null,1,"-",null,null,0,0,""]
["S",3,"S",0,5,5,2,0,0,0,0,"","Serviço","Serviço","-","SINAPI",92464,"MONTAGEM E DESMONTAGEM DE FÔRMA DE VIGA, ESCORAMENTO METÁLICO, PÉ-DIREITO SIMPLES, EM CHAPA DE MADEIRA RESINADA, 8 UTILIZAÇÕES. AF_12/2015","M2",40.9,1,40.9,null,null,0,0,"Referência: AGETOP - 60209"]
["S",3,"S",0,5,5,2,0,0,0,0,"","Serviço","Serviço","-","SINAPI",94964,"CONCRETO FCK = 20MPA, TRAÇO 1:2,7:3 (CIMENTO/ AREIA MÉDIA/ BRITA 1)  - PREPARO MECÂNICO COM BETONEIRA 400 L. AF_07/2016","M3",2.4,1,2.4,null,null,0,0,""]
["S",3,"S",0,5,5,2,0,0,0,0,"","Serviço","Serviço","-","SINAPI",92873,"LANÇAMENTO COM USO DE BALDES, ADENSAMENTO E ACABAMENTO DE CONCRETO EM ESTRUTURAS. AF_12/2015","M3",2.4,1,2.4,null,null,0,0,"Referência: AGETOP - 60801"]
["S",3,"S",0,5,5,2,0,0,0,0,"","Serviço","Serviço","-","SINAPI",92776,"ARMAÇÃO DE PILAR OU VIGA DE UMA ESTRUTURA CONVENCIONAL DE CONCRETO ARMADO EM UMA EDIFICAÇÃO TÉRREA OU SOBRADO UTILIZANDO AÇO CA-50 DE 6,3 MM - MONTAGEM. AF_12/2015","KG",18,1,18,null,null,0,0,"Referência: AGETOP - 60303"]
["S",3,"S",0,5,5,2,0,0,0,0,"","Serviço","Serviço","-","SINAPI",92777,"ARMAÇÃO DE PILAR OU VIGA DE UMA ESTRUTURA CONVENCIONAL DE CONCRETO ARMADO EM UMA EDIFICAÇÃO TÉRREA OU SOBRADO UTILIZANDO AÇO CA-50 DE 8,0 MM - MONTAGEM. AF_12/2015","KG",35,1,35,null,null,0,0,"Referência: AGETOP - 60304"]
["S",3,"S",0,5,5,2,0,0,0,0,"","Serviço","Serviço","-","SINAPI",92778,"ARMAÇÃO DE PILAR OU VIGA DE UMA ESTRUTURA CONVENCIONAL DE CONCRETO ARMADO EM UMA EDIFICAÇÃO TÉRREA OU SOBRADO UTILIZANDO AÇO CA-50 DE 10,0 MM - MONTAGEM. AF_12/2015","KG",89,1,89,null,null,0,0,"Referência: AGETOP - 60305"]
["S",3,"S",0,5,5,2,0,0,0,0,"","Serviço","Serviço","-","SINAPI",92779,"ARMAÇÃO DE PILAR OU VIGA DE UMA ESTRUTURA CONVENCIONAL DE CONCRETO ARMADO EM UMA EDIFICAÇÃO TÉRREA OU SOBRADO UTILIZANDO AÇO CA-50 DE 12,5 MM - MONTAGEM. AF_12/2015","KG",24,1,24,null,null,0,0,""]
["S",3,"S",0,5,5,2,0,0,0,0,"","Serviço","Serviço","-","SINAPI",92775,"ARMAÇÃO DE PILAR OU VIGA DE UMA ESTRUTURA CONVENCIONAL DE CONCRETO ARMADO EM UMA EDIFICAÇÃO TÉRREA OU SOBRADO UTILIZANDO AÇO CA-60 DE 5,0 MM - MONTAGEM. AF_12/2015","KG",57,1,57,null,null,0,0,"Referência: AGETOP - 60314"]
[3,3,3,2,5,5,3,0,0,2,{"$error":"#N/A"},"","Nível 3","Nível 3","-",null,null,"LAJE","-",null,1,"-",null,null,0,0,""]
["S",3,"S",0,5,5,3,0,0,0,0,"","Serviço","Serviço","-","SINAPI","74202/1","LAJE PRE-MOLDADA P/FORRO, SOBRECARGA 100KG/M2, VAOS ATE 3,50M/E=8CM, C/LAJOTAS E CAP.C/CONC FCK=20MPA, 3CM, INTER-EIXO 38CM, C/ESCORAMENTO (REAPR.3X) E FERRAGEM NEGATIVA","M2",40.75,1,40.75,null,null,0,0,""]
[2,2,2,28,5,6,0,0,0,138,28,"","Nível 2","Nível 2","-",null,null,"INSTALAÇÕES ELÉTRICAS","-",null,1,"-",null,null,0,0,""]
["S",2,"S",0,5,6,0,0,0,0,0,"","Serviço","Serviço","-","AGETOP",70421,"BUCHA E ARRUELA METALICA DIAM. 3/4\"","PR    ",3,1,3,null,null,0,0,""]
["S",2,"S",0,5,6,0,0,0,0,0,"","Serviço","Serviço","-","SINAPI",92868,"CAIXA RETANGULAR 4\" X 2\" MÉDIA (1,30 M DO PISO), METÁLICA, INSTALADA EM PAREDE - FORNECIMENTO E INSTALAÇÃO. AF_12/2015","UN",26,1,26,null,null,0,0,"Referência: AGETOP - 70691"]
["S",2,"S",0,5,6,0,0,0,0,0,"","Serviço","Serviço","-","SINAPI",92866,"CAIXA SEXTAVADA 3\" X 3\", METÁLICA, INSTALADA EM LAJE - FORNECIMENTO E INSTALAÇÃO. AF_12/2015","UN",10,1,10,null,null,0,0,"Referência: AGETOP - 70680"]
["S",2,"S",0,5,6,0,0,0,0,0,"","Serviço","Serviço","-","SINAPI",91902,"CURVA 90 GRAUS PARA ELETRODUTO, PVC, ROSCÁVEL, DN 25 MM (3/4\"), PARA CIRCUITOS TERMINAIS, INSTALADA EM LAJE - FORNECIMENTO E INSTALAÇÃO. AF_12/2015","UN",6,1,6,null,null,0,0,"Referência: AGETOP - 71141"]
["S",2,"S",0,5,6,0,0,0,0,0,"","Serviço","Serviço","-","SINAPI",97585,"LUMINÁRIA TIPO CALHA, DE SOBREPOR, COM 2 LÂMPADAS TUBULARES DE 18 W - FORNECIMENTO E INSTALAÇÃO. AF_11/2017","UN",2,1,2,null,null,0,0,""]
["S",2,"S",0,5,6,0,0,0,0,0,"","Serviço","Serviço","-","SINAPI",97586,"LUMINÁRIA TIPO CALHA, DE SOBREPOR, COM 2 LÂMPADAS TUBULARES DE 36 W - FORNECIMENTO E INSTALAÇÃO. AF_11/2017","UN",14,1,14,null,null,0,0,""]
["S",2,"S",0,5,6,0,0,0,0,0,"","Serviço","Serviço","-","SINAPI",97584,"LUMINÁRIA TIPO CALHA, DE SOBREPOR, COM 1 LÂMPADA TUBULAR DE 36 W - FORNECIMENTO E INSTALAÇÃO. AF_11/2017","UN",2,1,2,null,null,0,0,""]
["S",2,"S",0,5,6,0,0,0,0,0,"","Serviço","Serviço","-","SINAPI",91884,"LUVA PARA ELETRODUTO, PVC, ROSCÁVEL, DN 25 MM (3/4\"), PARA CIRCUITOS TERMINAIS, INSTALADA EM PAREDE - FORNECIMENTO E INSTALAÇÃO. AF_12/2015","UN",3,1,3,null,null,0,0,"Referência: AGETOP - 71741"]
["S",2,"S",0,5,6,0,0,0,0,0,"","Serviço","Serviço","-","SINAPI",91927,"CABO DE COBRE FLEXÍVEL ISOLADO, 2,5 MM², ANTI-CHAMA 0,6/1,0 KV, PARA CIRCUITOS TERMINAIS - FORNECIMENTO E INSTALAÇÃO. AF_12/2015","M",723.31000000000006,1,723.31000000000006,null,null,0,0,"Referência: AGETOP - 70581"]
["S",2,"S",0,5,6,0,0,0,0,0,"","Serviço","Serviço","-","SINAPI",91931,"CABO DE COBRE FLEXÍVEL ISOLADO, 6 MM², ANTI-CHAMA 0,6/1,0 KV, PARA CIRCUITOS TERMINAIS - FORNECIMENTO E INSTALAÇÃO. AF_12/2015","M",60.8,1,60.8,null,null,0,0,"Referência: AGETOP - 70583"]
["S",2,"S",0,5,6,0,0,0,0,0,"","Serviço","Serviço","-","SINAPI",93654,"DISJUNTOR MONOPOLAR TIPO DIN, CORRENTE NOMINAL DE 16A - FORNECIMENTO E INSTALAÇÃO. AF_04/2016","UN",11,1,11,null,null,0,0,""]
["S",2,"S",0,5,6,0,0,0,0,0,"","Serviço","Serviço","-","SINAPI",93656,"DISJUNTOR MONOPOLAR TIPO DIN, CORRENTE NOMINAL DE 25A - FORNECIMENTO E INSTALAÇÃO. AF_04/2016","UN",1,1,1,null,null,0,0,""]
["S",2,"S",0,5,6,0,0,0,0,0,"","Serviço","Serviço","-","SINAPI",93673,"DISJUNTOR TRIPOLAR TIPO DIN, CORRENTE NOMINAL DE 50A - FORNECIMENTO E INSTALAÇÃO. AF_04/2016","UN",1,1,1,null,null,0,0,"Referência: AGETOP - 71174"]
["S",2,"S",0,5,6,0,0,0,0,0,"","Serviço","Serviço","-","AGETOP",71456,"INTERRUPTOR DIFERENCIAL RESIDUAL (D.R.) TETRAPOLAR DE 40A-30mA","Un    ",1,1,1,null,null,0,0,""]
["S",2,"S",0,5,6,0,0,0,0,0,"","Serviço","Serviço","-","SINAPI",91844,"ELETRODUTO FLEXÍVEL CORRUGADO, PVC, DN 25 MM (3/4\"), PARA CIRCUITOS TERMINAIS, INSTALADO EM LAJE - FORNECIMENTO E INSTALAÇÃO. AF_12/2015","M",96.82,1,96.82,null,null,0,0,""]
["S",2,"S",0,5,6,0,0,0,0,0,"","Serviço","Serviço","-","SINAPI",91846,"ELETRODUTO FLEXÍVEL CORRUGADO, PVC, DN 32 MM (1\"), PARA CIRCUITOS TERMINAIS, INSTALADO EM LAJE - FORNECIMENTO E INSTALAÇÃO. AF_12/2015","M",10.1,1,10.1,null,null,0,0,""]
["S",2,"S",0,5,6,0,0,0,0,0,"","Serviço","Serviço","-","SINAPI","73798/1","DUTO ESPIRAL FLEXIVEL SINGELO PEAD D=50MM(2\") REVESTIDO COM PVC COM FIO GUIA DE ACO GALVANIZADO, LANCADO DIRETO NO SOLO, INCL CONEXOES","M",31.1,1,31.1,null,null,0,0,"Referência: AGETOP - 71197"]
["S",2,"S",0,5,6,0,0,0,0,0,"","Serviço","Serviço","-","COMPOSIÇÃO","COMP 387_SEE","LÂMPADA LED TUBULAR 18W ","UN ",29,1,29,null,null,0,0,""]
["S",2,"S",0,5,6,0,0,0,0,0,"","Serviço","Serviço","-","SINAPI",97611,"LÂMPADA COMPACTA FLUORESCENTE DE 15 W, BASE E27 - FORNECIMENTO E INSTALAÇÃO. AF_11/2017","UN",2,1,2,null,null,0,0,"Referência: AGETOP - 71567"]
["S",2,"S",0,5,6,0,0,0,0,0,"","Serviço","Serviço","-","SINAPI",92000,"TOMADA BAIXA DE EMBUTIR (1 MÓDULO), 2P+T 10 A, INCLUINDO SUPORTE E PLACA - FORNECIMENTO E INSTALAÇÃO. AF_12/2015","UN",3,1,3,null,null,0,0,"Referência: AGETOP - 72578"]
["S",2,"S",0,5,6,0,0,0,0,0,"","Serviço","Serviço","-","SINAPI",91996,"TOMADA MÉDIA DE EMBUTIR (1 MÓDULO), 2P+T 10 A, INCLUINDO SUPORTE E PLACA - FORNECIMENTO E INSTALAÇÃO. AF_12/2015","UN",14,1,14,null,null,0,0,"Referência: AGETOP - 72578"]
["S",2,"S",0,5,6,0,0,0,0,0,"","Serviço","Serviço","-","SINAPI",91992,"TOMADA ALTA DE EMBUTIR (1 MÓDULO), 2P+T 10 A, INCLUINDO SUPORTE E PLACA - FORNECIMENTO E INSTALAÇÃO. AF_12/2015","UN",1,1,1,null,null,0,0,""]
["S",2,"S",0,5,6,0,0,0,0,0,"","Serviço","Serviço","-","SINAPI",91955,"INTERRUPTOR PARALELO (1 MÓDULO), 10A/250V, INCLUINDO SUPORTE E PLACA - FORNECIMENTO E INSTALAÇÃO. AF_12/2015","UN",4,1,4,null,null,0,0,"Referência: AGETOP - 71431"]
["S",2,"S",0,5,6,0,0,0,0,0,"","Serviço","Serviço","-","SINAPI",91953,"INTERRUPTOR SIMPLES (1 MÓDULO), 10A/250V, INCLUINDO SUPORTE E PLACA - FORNECIMENTO E INSTALAÇÃO. AF_12/2015","UN",5,1,5,null,null,0,0,"Referência: AGETOP - 71440"]
["S",2,"S",0,5,6,0,0,0,0,0,"","Serviço","Serviço","-","SINAPI",91959,"INTERRUPTOR SIMPLES (2 MÓDULOS), 10A/250V, INCLUINDO SUPORTE E PLACA - FORNECIMENTO E INSTALAÇÃO. AF_12/2015","UN",1,1,1,null,null,0,0,"Referência: AGETOP - 71441"]
["S",2,"S",0,5,6,0,0,0,0,0,"","Serviço","Serviço","-","SINAPI",96986,"HASTE DE ATERRAMENTO 3/4  PARA SPDA - FORNECIMENTO E INSTALAÇÃO. AF_12/2017","UN",3,1,3,null,null,0,0,""]
["S",2,"S",0,5,6,0,0,0,0,0,"","Serviço","Serviço","-","SINAPI","74131/4","QUADRO DE DISTRIBUICAO DE ENERGIA DE EMBUTIR, EM CHAPA METALICA, PARA 18 DISJUNTORES TERMOMAGNETICOS MONOPOLARES, COM BARRAMENTO TRIFASICO E NEUTRO, FORNECIMENTO E INSTALACAO","UN",1,1,1,null,null,0,0,""]
[2,2,2,60,5,7,0,0,0,110,60,"","Nível 2","Nível 2","-",null,null,"INSTALAÇÕES HIDROSSANITÁRIAS","-",null,1,"-",null,null,0,0,""]
["S",2,"S",0,5,7,0,0,0,0,0,"","Serviço","Serviço","-","AGETOP",80502,"VASO SANITARIO","Un    ",1,1,1,null,null,0,0,""]
["S",2,"S",0,5,7,0,0,0,0,0,"","Serviço","Serviço","-","AGETOP",80510,"ANEL DE VEDAÇÃO PARA VASO SANITÁRIO","Un    ",1,1,1,null,null,0,0,""]
["S",2,"S",0,5,7,0,0,0,0,0,"","Serviço","Serviço","-","AGETOP",80513,"TUBO PARA VÁLVULA DE DESCARGA ( CURTO 1.1/4\" )","Un    ",1,1,1,null,null,0,0,""]
["S",2,"S",0,5,7,0,0,0,0,0,"","Serviço","Serviço","-","AGETOP",80514,"TUBO DE LIGACAO PVC CROMADO 1.1/2\" / ESPUDE  - (ENTRADA)","Un    ",1,1,1,null,null,0,0,""]
["S",2,"S",0,5,7,0,0,0,0,0,"","Serviço","Serviço","-","AGETOP",80517,"VÁLVULA DE DESCARGA DUPLO ACIONAMENTO COM ACABAMENTO CROMADO ANTIVANDALISMO","Un    ",1,1,1,null,null,0,0,""]
["S",2,"S",0,5,7,0,0,0,0,0,"","Serviço","Serviço","-","AGETOP",80520,"CONJUNTO DE FIXACAO P/VASO SANITARIO (PAR)","CJ    ",1,1,1,null,null,0,0,""]
[{"$f":"CHOOSE(1+LOG(1+2*(ORÇAMENTO.Nivel=\"Nível 1\")+4*(ORÇAMENTO.Nivel=\"Nível 2\")+8*(ORÇAMENTO.Nivel=\"Nível 3\")+16*(ORÇAMENTO.Nivel=\"Nível 4\")+32*(ORÇAMENTO.Nivel=\"Serviço\"),2),0,1,2,3,4,\"S\")","v":"S"},2,"S",0,5,7,0,0,{"$f":"IF(AND($C562<=4,$C562<>0),0,IF(AND($C562=\"S\",$Y562>0),OFFSET(I562,-1,0)+1,OFFSET(I562,-1,0)))","v":0},0,0,"","Serviço","Serviço","-","AGETOP",80526,"ASSENTO EM POLIPROPILENO COM SISTEMA DE FECHAMENTO SUAVE PARA VASO SANITÁRIO","Un    ",1,1,1,null,null,0,0,""]
["S",2,"S",0,5,7,0,0,0,0,0,"","Serviço","Serviço","-","SINAPI",95544,"PAPELEIRA DE PAREDE EM METAL CROMADO SEM TAMPA, INCLUSO FIXAÇÃO. AF_10/2016","UN",1,1,1,null,null,0,0,""]
["S",2,"S",0,5,7,0,0,0,0,0,"","Serviço","Serviço","-","COMPOSIÇÃO","COMP 209_SEE","TOALHEIRO PLÁSTICO TIPO DISPENSER PARA PAPEL TOALHA INTERFOLHADO","UN ",1,1,1,null,null,0,0,""]
["S",2,"S",0,{"$f":"IF($C565=1,OFFSET(E565,-1,0)+1,OFFSET(E565,-1,0))","v":5},{"$f":"IF($C565=1,0,IF($C565=2,OFFSET(F565,-1,0)+1,OFFSET(F565,-1,0)))","v":7},{"$f":"IF(AND($C565<=2,$C565<>0),0,IF($C565=3,OFFSET(G565,-1,0)+1,OFFSET(G565,-1,0)))","v":0},{"$f":"IF(AND($C565<=3,$C565<>0),0,IF($C565=4,OFFSET(H565,-1,0)+1,OFFSET(H565,-1,0)))","v":0},0,0,0,"","Serviço","Serviço","-","AGETOP",80542,"LAVATÓRIO MÉDIO SEM COLUNA","Un    ",2,1,2,null,null,0,0,""]
["S",2,"S",0,5,7,0,0,0,{"$f":"IF(OR($C566=\"S\",$C566=0),0,MATCH(0,OFFSET($D566,1,$C566,ROW($C$923)-ROW($C566)),0))","v":0},{"$f":"IF(OR($C566=\"S\",$C566=0),0,MATCH(OFFSET($D566,0,$C566)+1,OFFSET($D566,1,$C566,ROW($C$923)-ROW($C566)),0))","v":0},"","Serviço","Serviço","-","AGETOP",80550,"FIXACAO P/LAVATORIO (PAR)","PAR   ",2,1,2,null,null,0,0,""]
["S",2,"S",0,5,7,0,0,0,0,0,"","Serviço","Serviço","-","SINAPI",86885,"ENGATE FLEXÍVEL EM PLÁSTICO BRANCO, 1/2\" X 40CM - FORNECIMENTO E INSTALAÇÃO. AF_12/2013","UN",2,1,2,null,null,0,0,""]
["S",2,"S",0,5,7,0,0,0,0,0,"","Serviço","Serviço","-","SINAPI",86883,"SIFÃO DO TIPO FLEXÍVEL EM PVC 1\u0094 X 1.1/2\u0094 - FORNECIMENTO E INSTALAÇÃO. AF_12/2013","UN",2,1,2,null,null,0,0,""]
["S",2,"S",0,5,7,0,0,0,0,0,"","Serviço","Serviço","-","SINAPI",86906,"TORNEIRA CROMADA DE MESA, 1/2\" OU 3/4\", PARA LAVATÓRIO, PADRÃO POPULAR - FORNECIMENTO E INSTALAÇÃO. AF_12/2013","UN",2,1,2,null,null,0,0,""]
["S",2,"S",0,5,7,0,0,0,0,0,"","Serviço","Serviço","-","AGETOP",80580,"VALVULA P/LAVATORIO OU BEBEDOURO METALICO DIAMETRO 1\"","Un    ",2,1,2,null,null,0,0,""]
["S",{"$f":"IF(OR(C571=\"s\",C571=0),OFFSET(B571,-1,0),C571)","v":2},{"$f":"IF(OFFSET(C571,-1,0)=\"L\",1,IF(OFFSET(C571,-1,0)=1,2,IF(OR(A571=\"s\",A571=0),\"S\",IF(AND(OFFSET(C571,-1,0)=2,A571=4),3,IF(AND(OR(OFFSET(C571,-1,0)=\"s\",OFFSET(C571,-1,0)=0),A571<>\"s\",A571>OFFSET(B571,-1,0)),OFFSET(B571,-1,0),A571)))))","v":"S"},{"$f":"IF(OR(C571=\"S\",C571=0),0,IF(ISERROR(K571),J571,SMALL(J571:K571,1)))","v":0},5,7,0,0,0,0,0,"","Serviço","Serviço","-","SINAPI",86911,"TORNEIRA CROMADA LONGA, DE PAREDE, 1/2\" OU 3/4\", PARA PIA DE COZINHA, PADRÃO POPULAR - FORNECIMENTO E INSTALAÇÃO. AF_12/2013","UN",5,1,5,null,null,0,0,""]
["S",2,"S",0,5,7,0,0,0,0,0,"","Serviço","Serviço","-","AGETOP",80671,"SIFAO PVC P/PIA 1.1/2\" X 2\"","Un    ",5,1,5,null,null,0,0,""]
["S",2,"S",0,5,7,0,0,0,0,0,"","Serviço","Serviço","-","SINAPI",86878,"VÁLVULA EM METAL CROMADO TIPO AMERICANA 3.1/2\" X 1.1/2\" PARA PIA - FORNECIMENTO E INSTALAÇÃO. AF_12/2013","UN",5,1,5,null,null,0,0,""]
["S",2,"S",0,5,7,0,0,0,0,0,"","Serviço","Serviço","-","AGETOP",80687,"CUBA INOX 35X40X15CM E=0,6MM-AÇO 304 (CUBA Nº 3)","Un    ",4,1,4,null,null,0,0,""]
["S",2,"S",0,5,7,0,0,0,0,0,"","Serviço","Serviço","-","AGETOP",80693,"TANQUE (PANELAO) INOX 60 X 70 X 40 CM CH.18","Un    ",1,1,1,null,null,0,0,""]
["S",2,"S",0,5,7,0,0,0,0,0,"","Serviço","Serviço","-","AGETOP",80819,"SIFÃO METÁLICO PARA TANQUE DE 1 1/4\" X 1 1/2\"","un    ",1,1,1,null,null,0,0,""]
["S",2,"S",0,5,7,0,0,0,0,0,"","Serviço","Serviço","-","AGETOP",80830,"VALVULA P/TANQUE METALICA DIAM.1\" S/LADRAO","Un    ",1,1,1,null,null,0,0,""]
["S",2,"S",0,5,7,0,0,0,0,0,"","Serviço","Serviço","-","AGETOP",81846,"CAIXA DE GORDURA E INSPEÇÃO EM PVC/ABS 19 LITROS COM TAMPA E PORTA TAMPA E CESTO DE LIMPEZA REMOVÍVEL","un    ",1,1,1,null,null,0,0,""]
["S",2,"S",0,5,7,0,0,0,0,0,"","Serviço","Serviço","-","SINAPI",94495,"REGISTRO DE GAVETA BRUTO, LATÃO, ROSCÁVEL, 1\u0094, INSTALADO EM RESERVAÇÃO DE ÁGUA DE EDIFICAÇÃO QUE POSSUA RESERVATÓRIO DE FIBRA/FIBROCIMENTO \u0096 FORNECIMENTO E INSTALAÇÃO. AF_06/2016","UN",1,1,1,null,null,0,0,"Referência: AGETOP - 80903"]
["S",2,"S",0,5,7,0,0,0,0,0,"","Serviço","Serviço","-","SINAPI",89353,"REGISTRO DE GAVETA BRUTO, LATÃO, ROSCÁVEL, 3/4\", FORNECIDO E INSTALADO EM RAMAL DE ÁGUA. AF_12/2014","UN",4,1,4,null,null,0,0,"Referência: AGETOP - 80902"]
["S",2,"S",0,5,7,0,0,0,0,0,"","Serviço","Serviço","-","SINAPI",95141,"ADAPTADOR COM FLANGES LIVRES, PVC, SOLDÁVEL LONGO, DN  25 MM X 3/4 , INSTALADO EM RESERVAÇÃO DE ÁGUA DE EDIFICAÇÃO QUE POSSUA RESERVATÓRIO DE FIBRA/FIBROCIMENTO    FORNECIMENTO E INSTALAÇÃO. AF_06/2016","UN",14,1,14,null,null,0,0,""]
["S",2,"S",0,5,7,0,0,0,0,0,"","Serviço","Serviço","-","SINAPI",94785,"ADAPTADOR COM FLANGES LIVRES, PVC, SOLDÁVEL LONGO, DN 32 MM X 1 , INSTALADO EM RESERVAÇÃO DE ÁGUA DE EDIFICAÇÃO QUE POSSUA RESERVATÓRIO DE FIBRA/FIBROCIMENTO   FORNECIMENTO E INSTALAÇÃO. AF_06/2016","UN",2,1,2,null,null,0,0,""]
["S",2,"S",0,5,7,0,0,0,0,0,"","Serviço","Serviço","-","AGETOP",81504,"SOLUCAO LIMPADORA 1000 CM3","Un    ",5,1,5,null,null,0,0,""]
["S",2,"S",0,5,7,0,0,0,0,0,"","Serviço","Serviço","-","AGETOP",81663,"CORPO CX. SIFONADA DIAM. 150 X 150 X 50","Un    ",2,1,2,null,null,0,0,""]
["S",2,"S",0,5,7,0,0,0,0,0,"","Serviço","Serviço","-","SINAPI",89708,"CAIXA SIFONADA, PVC, DN 150 X 185 X 75 MM, JUNTA ELÁSTICA, FORNECIDA E INSTALADA EM RAMAL DE DESCARGA OU EM RAMAL DE ESGOTO SANITÁRIO. AF_12/2014","UN",2,1,2,null,null,0,0,""]
["S",2,"S",0,5,7,0,0,0,0,0,"","Serviço","Serviço","-","AGETOP",81771,"GRELHA QUADRADA BRANCA DIAM. 150 MM","Un    ",2,1,2,null,null,0,0,""]
["S",2,"S",0,5,7,0,0,0,0,0,"","Serviço","Serviço","-","AGETOP",81885,"TERMINAL DE VENTILACAO DIAMETRO 50 MM","Un    ",1,1,1,null,null,0,0,""]
["S",2,"S",0,5,7,0,0,0,0,0,"","Serviço","Serviço","-","AGETOP",81831,"CAIXA DE INSPEÇÃO - ALVENARIA DE 1/2 VEZ COM REVESTIMENTO INTERNO EM REBOCO PAULISTA A-14 (COM ADIÇÃO DE IMPERMEABILIZANTE)","m2    ",3,1,3,null,null,0,0,""]
["S",2,"S",0,5,7,0,0,0,0,0,"","Serviço","Serviço","-","AGETOP",81825,"CAIXA DE PASSAGEM 60 X 60 CM SEM TAMPA","Un    ",5,1,5,null,null,0,0,""]
["S",2,"S",0,5,7,0,0,0,0,0,"","Serviço","Serviço","-","AGETOP",81826,"TAMPA EM CONCRETO ARMADO 25 MPA E=5CM PARA A CAIXA DE PASSAGEM 60X60CM","Un    ",5,1,5,null,null,0,0,""]
["S",2,"S",0,5,7,0,0,0,0,0,"","Serviço","Serviço","-","SINAPI",89402,"TUBO, PVC, SOLDÁVEL, DN 25MM, INSTALADO EM RAMAL DE DISTRIBUIÇÃO DE ÁGUA - FORNECIMENTO E INSTALAÇÃO. AF_12/2014","M",25,1,25,null,null,0,0,"Referência: AGETOP - 81003"]
["S",2,"S",0,5,7,0,0,0,0,0,"","Serviço","Serviço","-","SINAPI",89403,"TUBO, PVC, SOLDÁVEL, DN 32MM, INSTALADO EM RAMAL DE DISTRIBUIÇÃO DE ÁGUA - FORNECIMENTO E INSTALAÇÃO. AF_12/2014","M",20,1,20,null,null,0,0,"Referência: AGETOP - 81004"]
["S",2,"S",0,5,7,0,0,0,0,0,"","Serviço","Serviço","-","SINAPI",89617,"TE, PVC, SOLDÁVEL, DN 25MM, INSTALADO EM PRUMADA DE ÁGUA - FORNECIMENTO E INSTALAÇÃO. AF_12/2014","UN",3,1,3,null,null,0,0,""]
["S",2,"S",0,5,7,0,0,0,0,0,"","Serviço","Serviço","-","SINAPI",89620,"TE, PVC, SOLDÁVEL, DN 32MM, INSTALADO EM PRUMADA DE ÁGUA - FORNECIMENTO E INSTALAÇÃO. AF_12/2014","UN",3,1,3,null,null,0,0,"Referência: AGETOP - 81403"]
["S",2,"S",0,5,7,0,0,0,0,0,"","Serviço","Serviço","-","SINAPI",89622,"TÊ DE REDUÇÃO, PVC, SOLDÁVEL, DN 32MM X 25MM, INSTALADO EM PRUMADA DE ÁGUA - FORNECIMENTO E INSTALAÇÃO. AF_12/2014","UN",2,1,2,null,null,0,0,"Referência: AGETOP - 81421"]
["S",2,"S",0,5,7,0,0,0,0,0,"","Serviço","Serviço","-","SINAPI",89802,"JOELHO 45 GRAUS, PVC, SERIE NORMAL, ESGOTO PREDIAL, DN 50 MM, JUNTA ELÁSTICA, FORNECIDO E INSTALADO EM PRUMADA DE ESGOTO SANITÁRIO OU VENTILAÇÃO. AF_12/2014","UN",7,1,7,null,null,0,0,""]
["S",2,"S",0,5,7,0,0,0,0,0,"","Serviço","Serviço","-","SINAPI",89724,"JOELHO 90 GRAUS, PVC, SERIE NORMAL, ESGOTO PREDIAL, DN 40 MM, JUNTA SOLDÁVEL, FORNECIDO E INSTALADO EM RAMAL DE DESCARGA OU RAMAL DE ESGOTO SANITÁRIO. AF_12/2014","UN",12,1,12,null,null,0,0,""]
["S",2,"S",0,5,7,0,0,0,0,0,"","Serviço","Serviço","-","SINAPI",89731,"JOELHO 90 GRAUS, PVC, SERIE NORMAL, ESGOTO PREDIAL, DN 50 MM, JUNTA ELÁSTICA, FORNECIDO E INSTALADO EM RAMAL DE DESCARGA OU RAMAL DE ESGOTO SANITÁRIO. AF_12/2014","UN",3,1,3,null,null,0,0,""]
["S",2,"S",0,5,7,0,0,0,0,0,"","Serviço","Serviço","-","AGETOP",81973,"JUNCAO SIMPLES DIAM. 100 X 50 MM","Un    ",1,1,1,null,null,0,0,""]
["S",2,"S",0,5,7,0,0,0,0,0,"","Serviço","Serviço","-","SINAPI",89834,"JUNÇÃO SIMPLES, PVC, SERIE NORMAL, ESGOTO PREDIAL, DN 100 X 100 MM, JUNTA ELÁSTICA, FORNECIDO E INSTALADO EM PRUMADA DE ESGOTO SANITÁRIO OU VENTILAÇÃO. AF_12/2014","UN",1,1,1,null,null,0,0,"Referência: AGETOP - 81975"]
["S",2,"S",0,5,7,0,0,0,0,0,"","Serviço","Serviço","-","AGETOP",81981,"JUNÇÃO DUPLA DIAMETRO 75 MM","Un    ",1,1,1,null,null,0,0,""]
["S",2,"S",0,5,7,0,0,0,0,0,"","Serviço","Serviço","-","SINAPI",89753,"LUVA SIMPLES, PVC, SERIE NORMAL, ESGOTO PREDIAL, DN 50 MM, JUNTA ELÁSTICA, FORNECIDO E INSTALADO EM RAMAL DE DESCARGA OU RAMAL DE ESGOTO SANITÁRIO. AF_12/2014","UN",8,1,8,null,null,0,0,"Referência: AGETOP - 82002"]
["S",2,"S",0,5,7,0,0,0,0,0,"","Serviço","Serviço","-","SINAPI",89778,"LUVA SIMPLES, PVC, SERIE NORMAL, ESGOTO PREDIAL, DN 100 MM, JUNTA ELÁSTICA, FORNECIDO E INSTALADO EM RAMAL DE DESCARGA OU RAMAL DE ESGOTO SANITÁRIO. AF_12/2014","UN",2,1,2,null,null,0,0,"Referência: AGETOP - 82004"]
["S",2,"S",0,5,7,0,0,0,0,0,"","Serviço","Serviço","-","AGETOP",82051,"PORTA GRELHA QUADRADA BRANCO DIAM. 150 MM","Un    ",2,1,2,null,null,0,0,""]
["S",2,"S",0,5,7,0,0,0,0,0,"","Serviço","Serviço","-","AGETOP",82103,"REDUCAO EXCENTRICA 100 X 50 MM","Un    ",1,1,1,null,null,0,0,""]
["S",2,"S",0,5,7,0,0,0,0,0,"","Serviço","Serviço","-","AGETOP",82233,"TE SANITARIO DIAMETRO 100 X 50 MM","Un    ",1,1,1,null,null,0,0,""]
["S",2,"S",0,5,7,0,0,0,0,0,"","Serviço","Serviço","-","SINAPI",89711,"TUBO PVC, SERIE NORMAL, ESGOTO PREDIAL, DN 40 MM, FORNECIDO E INSTALADO EM RAMAL DE DESCARGA OU RAMAL DE ESGOTO SANITÁRIO. AF_12/2014","M",14,1,14,null,null,0,0,"Referência: AGETOP - 82301"]
["S",2,"S",0,5,7,0,0,0,0,0,"","Serviço","Serviço","-","SINAPI",89712,"TUBO PVC, SERIE NORMAL, ESGOTO PREDIAL, DN 50 MM, FORNECIDO E INSTALADO EM RAMAL DE DESCARGA OU RAMAL DE ESGOTO SANITÁRIO. AF_12/2014","M",26,1,26,null,null,0,0,"Referência: AGETOP - 82302"]
["S",2,"S",0,5,7,0,0,0,0,0,"","Serviço","Serviço","-","AGETOP",82374,"TUBO FERRO GALVANIZADO DIAM.3/4\"","m     ",10,1,10,null,null,0,0,""]
["S",2,"S",0,5,7,0,0,0,0,0,"","Serviço","Serviço","-","SINAPI",83635,"EXTINTOR INCENDIO TP PO QUIMICO 6KG - FORNECIMENTO E INSTALACAO","UN",1,1,1,null,null,0,0,""]
["S",2,"S",0,5,7,0,0,0,0,0,"","Serviço","Serviço","-","SINAPI",96702,"BUCHA DE REDUÇÃO, PPR, 32 X 25, CLASSE PN 25, INSTALADO EM PRUMADA DE ÁGUA \u0096 FORNECIMENTO E INSTALAÇÃO . AF_06/2015","UN",25,1,25,null,null,0,0,""]
["S",2,"S",0,5,7,0,0,0,0,0,"","Serviço","Serviço","-","SINAPI",94672,"JOELHO 90 GRAUS COM BUCHA DE LATÃO, PVC, SOLDÁVEL, DN  25 MM, X 3/4\u0094 INSTALADO EM RESERVAÇÃO DE ÁGUA DE EDIFICAÇÃO QUE POSSUA RESERVATÓRIO DE FIBRA/FIBROCIMENTO   FORNECIMENTO E INSTALAÇÃO. AF_06/2016","UN",6,1,6,null,null,0,0,""]
["S",2,"S",0,5,7,0,0,0,0,0,"","Serviço","Serviço","-","SINAPI",89362,"JOELHO 90 GRAUS, PVC, SOLDÁVEL, DN 25MM, INSTALADO EM RAMAL OU SUB-RAMAL DE ÁGUA - FORNECIMENTO E INSTALAÇÃO. AF_12/2014","UN",6,1,6,null,null,0,0,"Referência: AGETOP - 81321"]
["S",2,"S",0,5,7,0,0,0,0,0,"","Serviço","Serviço","-","SINAPI",89546,"BUCHA DE REDUÇÃO LONGA, PVC, SERIE R, ÁGUA PLUVIAL, DN 50 X 40 MM, JUNTA ELÁSTICA, FORNECIDO E INSTALADO EM RAMAL DE ENCAMINHAMENTO. AF_12/2014","UN",6,1,6,null,null,0,0,""]
[2,2,2,5,5,8,0,0,0,50,5,"","Nível 2","Nível 2","-",null,null,"ALVENARIAS E DIVISÓRIAS","-",null,1,"-",null,null,0,0,""]
["S",2,"S",0,5,8,0,0,0,0,0,"","Serviço","Serviço","-","SINAPI","73937/1","COBOGO DE CONCRETO (ELEMENTO VAZADO), 7X50X50CM, ASSENTADO COM ARGAMASSA TRACO 1:4 (CIMENTO E AREIA)","M2",16.3,1,16.3,null,null,0,0,"Referência: AGETOP - 100501"]
["S",2,"S",0,5,8,0,0,0,0,0,"","Serviço","Serviço","-","SINAPI",72132,"ALVENARIA EM TIJOLO CERAMICO MACICO 5X10X20CM 1/2 VEZ (ESPESSURA 10CM), ASSENTADO COM ARGAMASSA TRACO 1:2:8 (CIMENTO, CAL E AREIA)","M2",17.11,1,17.11,null,null,0,0,"Referência: AGETOP - 100102"]
["S",2,"S",0,5,8,0,0,0,0,0,"","Serviço","Serviço","-","SINAPI",87489,"ALVENARIA DE VEDAÇÃO DE BLOCOS CERÂMICOS FURADOS NA VERTICAL DE 9X19X39CM (ESPESSURA 9CM) DE PAREDES COM ÁREA LÍQUIDA MAIOR OU IGUAL A 6M² COM VÃOS E ARGAMASSA DE ASSENTAMENTO COM PREPARO EM BETONEIRA. AF_06/2014","M2",142.08000000000001,1,142.08000000000001,null,null,0,0,""]
["S",2,"S",0,5,8,0,0,0,0,0,"","Serviço","Serviço","-","SINAPI",93202,"FIXAÇÃO (ENCUNHAMENTO) DE ALVENARIA DE VEDAÇÃO COM TIJOLO MACIÇO. AF_03/2016","M",27,1,27,null,null,0,0,"Referência: AGETOP - 100204"]
[2,2,2,2,5,9,0,0,0,45,2,"","Nível 2","Nível 2","-",null,null,"IMPERMEABILIZAÇÃO","-",null,1,"-",null,null,0,0,""]
["S",2,"S",0,5,9,0,0,0,0,0,"","Serviço","Serviço","-","SINAPI",98562,"IMPERMEABILIZAÇÃO DE FLOREIRA OU VIGA BALDRAME COM ARGAMASSA DE CIMENTO E AREIA, COM ADITIVO IMPERMEABILIZANTE, E = 2 CM. AF_06/2018","M2",43.03,1,43.03,null,null,0,0,"Referência: AGETOP - 120902"]
[2,2,2,2,5,10,0,0,0,43,2,"","Nível 2","Nível 2","-",null,null,"ESTRUTURAS METÁLICAS","-",null,1,"-",null,null,0,0,""]
["S",2,"S",0,5,10,0,0,0,0,0,"","Serviço","Serviço","-","AGETOP",150103,"ESTRUTURA METÁLICA CONVENCIONAL EM AÇO DO TIPO USI SAC-300 COM FUNDO ANTICORROSIVO","Kg    ",1956.5,1,1956.5,null,null,0,0,""]
[2,2,2,6,5,11,0,0,0,41,6,"","Nível 2","Nível 2","-",null,null,"COBERTURAS","-",null,1,"-",null,null,0,0,""]
[3,3,3,5,5,11,1,0,0,5,22,"","Nível 3","Nível 3","-",null,null,"CERÂMICA","-",null,1,"-",null,null,0,0,""]
[{"$f":"CHOOSE(1+LOG(1+2*(ORÇAMENTO.Nivel=\"Nível 1\")+4*(ORÇAMENTO.Nivel=\"Nível 2\")+8*(ORÇAMENTO.Nivel=\"Nível 3\")+16*(ORÇAMENTO.Nivel=\"Nível 4\")+32*(ORÇAMENTO.Nivel=\"Serviço\"),2),0,1,2,3,4,\"S\")","v":"S"},3,"S",0,5,11,1,0,{"$f":"IF(AND($C626<=4,$C626<>0),0,IF(AND($C626=\"S\",$Y626>0),OFFSET(I626,-1,0)+1,OFFSET(I626,-1,0)))","v":0},0,0,"","Serviço","Serviço","-","SINAPI",94445,"TELHAMENTO COM TELHA CERÂMICA CAPA-CANAL, TIPO PLAN, COM ATÉ 2 ÁGUAS, INCLUSO TRANSPORTE VERTICAL. AF_07/2019","M2",182.07,1,182.07,null,null,0,0,"Referência: AGETOP - 160401"]
["S",3,"S",0,5,11,1,0,0,0,0,"","Serviço","Serviço","-","SINAPI",94221,"CUMEEIRA PARA TELHA CERÂMICA EMBOÇADA COM ARGAMASSA TRAÇO 1:2:9 (CIMENTO, CAL E AREIA) PARA TELHADOS COM ATÉ 2 ÁGUAS, INCLUSO TRANSPORTE VERTICAL. AF_07/2019","M",17.68,1,17.68,null,null,0,0,""]
["S",3,"S",0,5,11,1,0,0,0,0,"","Serviço","Serviço","-","SINAPI",94224,"EMBOÇAMENTO COM ARGAMASSA TRAÇO 1:2:9 (CIMENTO, CAL E AREIA). AF_07/2019","M",20.399999999999999,1,20.399999999999999,null,null,0,0,"Referência: AGETOP - 160403"]
["S",3,"S",0,{"$f":"IF($C629=1,OFFSET(E629,-1,0)+1,OFFSET(E629,-1,0))","v":5},{"$f":"IF($C629=1,0,IF($C629=2,OFFSET(F629,-1,0)+1,OFFSET(F629,-1,0)))","v":11},{"$f":"IF(AND($C629<=2,$C629<>0),0,IF($C629=3,OFFSET(G629,-1,0)+1,OFFSET(G629,-1,0)))","v":1},{"$f":"IF(AND($C629<=3,$C629<>0),0,IF($C629=4,OFFSET(H629,-1,0)+1,OFFSET(H629,-1,0)))","v":0},0,0,0,"","Serviço","Serviço","-","SINAPI",94224,"EMBOÇAMENTO COM ARGAMASSA TRAÇO 1:2:9 (CIMENTO, CAL E AREIA). AF_07/2019","M",35.36,1,35.36,null,null,0,0,"Referência: AGETOP - 160403"]
[2,2,2,5,5,12,0,0,0,{"$f":"IF(OR($C630=\"S\",$C630=0),0,MATCH(0,OFFSET($D630,1,$C630,ROW($C$923)-ROW($C630)),0))","v":35},{"$f":"IF(OR($C630=\"S\",$C630=0),0,MATCH(OFFSET($D630,0,$C630)+1,OFFSET($D630,1,$C630,ROW($C$923)-ROW($C630)),0))","v":5},"","Nível 2","Nível 2","-",null,null,"ESTRUTURAS METÁLICAS","-",null,1,"-",null,null,0,0,""]
["S",2,"S",0,5,12,0,0,0,0,0,"","Serviço","Serviço","-","SINAPI",94570,"JANELA DE ALUMÍNIO DE CORRER, 2 FOLHAS, FIXAÇÃO COM PARAFUSO SOBRE CONTRAMARCO (EXCLUSIVE CONTRAMARCO), COM VIDROS PADRONIZADA. AF_07/2016","M2",5.52,1,5.52,null,null,0,0,""]
["S",2,"S",0,5,12,0,0,0,0,0,"","Serviço","Serviço","-","SINAPI","74136/3","PORTA DE ACO CHAPA 24, DE ENROLAR, RAIADA, LARGA COM ACABAMENTO GALVANIZADO NATURAL","M2",5.74,1,5.74,null,null,0,0,"Referência: AGETOP - 180303"]
["S",2,"S",0,5,12,0,0,0,0,0,"","Serviço","Serviço","-","SINAPI","73933/4","PORTA DE FERRO DE ABRIR TIPO BARRA CHATA, COM REQUADRO E GUARNICAO COMPLETA","M2",8.64,1,8.64,null,null,0,0,"Referência: AGETOP - 180501"]
["S",2,"S",0,5,12,0,0,0,0,0,"","Serviço","Serviço","-","AGETOP",180307,"PORTAO /CHAPA TRAPEZ / TUBO DE ACO PT-5 C/FERRAGEM","m2    ",4,1,4,null,null,0,0,""]
[2,{"$f":"IF(OR(C635=\"s\",C635=0),OFFSET(B635,-1,0),C635)","v":2},{"$f":"IF(OFFSET(C635,-1,0)=\"L\",1,IF(OFFSET(C635,-1,0)=1,2,IF(OR(A635=\"s\",A635=0),\"S\",IF(AND(OFFSET(C635,-1,0)=2,A635=4),3,IF(AND(OR(OFFSET(C635,-1,0)=\"s\",OFFSET(C635,-1,0)=0),A635<>\"s\",A635>OFFSET(B635,-1,0)),OFFSET(B635,-1,0),A635)))))","v":2},{"$f":"IF(OR(C635=\"S\",C635=0),0,IF(ISERROR(K635),J635,SMALL(J635:K635,1)))","v":2},5,13,0,0,0,30,2,"","Nível 2","Nível 2","-",null,null,"VIDROS","-",null,1,"-",null,null,0,0,""]
["S",2,"S",0,5,13,0,0,0,0,0,"","Serviço","Serviço","-","SINAPI",72117,"VIDRO LISO COMUM TRANSPARENTE, ESPESSURA 4MM","M2",5.52,1,5.52,null,null,0,0,"Referência: AGETOP - 190102"]
[2,2,2,4,5,14,0,0,0,28,4,"","Nível 2","Nível 2","-",null,null,"REVESTIMENTO DE PAREDE","-",null,1,"-",null,null,0,0,""]
["S",2,"S",0,5,14,0,0,0,0,0,"","Serviço","Serviço","-","SINAPI",87553,"EMBOÇO, PARA RECEBIMENTO DE CERÂMICA, EM ARGAMASSA TRAÇO 1:2:8, PREPARO MECÂNICO COM BETONEIRA 400L, APLICADO MANUALMENTE EM FACES INTERNAS DE PAREDES, PARA AMBIENTE COM ÁREA MAIOR QUE 10M2, ESPESSURA DE 10MM, COM EXECUÇÃO DE TALISCAS. AF_06/2014","M2",186.65,1,186.65,null,null,0,0,""]
["S",2,"S",0,5,14,0,0,0,0,0,"","Serviço","Serviço","-","SINAPI",87904,"CHAPISCO APLICADO EM ALVENARIA (COM PRESENÇA DE VÃOS) E ESTRUTURAS DE CONCRETO DE FACHADA, COM COLHER DE PEDREIRO.  ARGAMASSA TRAÇO 1:3 COM PREPARO MANUAL. AF_06/2014","M2",284.16000000000003,1,284.16000000000003,null,null,0,0,"Referência: AGETOP - 200101"]
["S",2,"S",0,5,14,0,0,0,0,0,"","Serviço","Serviço","-","SINAPI",87273,"REVESTIMENTO CERÂMICO PARA PAREDES INTERNAS COM PLACAS TIPO ESMALTADA EXTRA DE DIMENSÕES 33X45 CM APLICADAS EM AMBIENTES DE ÁREA MAIOR QUE 5 M² NA ALTURA INTEIRA DAS PAREDES. AF_06/2014","M2",127.56500000000001,1,127.56500000000001,null,null,0,0,""]
[2,2,2,3,5,15,0,0,0,24,3,"","Nível 2","Nível 2","-",null,null,"FORROS","-",null,1,"-",null,null,0,0,""]
["S",2,"S",0,5,15,0,0,0,0,0,"","Serviço","Serviço","-","SINAPI",87884,"CHAPISCO APLICADO NO TETO, COM ROLO PARA TEXTURA ACRÍLICA. ARGAMASSA INDUSTRIALIZADA COM PREPARO MANUAL. AF_06/2014","M2",40.75,1,40.75,null,null,0,0,"Referência: AGETOP - 210102"]
["S",2,"S",0,5,15,0,0,0,0,0,"","Serviço","Serviço","-","SINAPI",90408,"MASSA ÚNICA, PARA RECEBIMENTO DE PINTURA, EM ARGAMASSA TRAÇO 1:2:8, PREPARO MECÂNICO COM BETONEIRA 400L, APLICADA MANUALMENTE EM TETO, ESPESSURA DE 10MM, COM EXECUÇÃO DE TALISCAS. AF_03/2015","M2",40.75,1,40.75,null,null,0,0,"Referência: AGETOP - 210401"]
[2,2,2,8,5,16,0,0,0,21,8,"","Nível 2","Nível 2","-",null,null,"REVESTIMENTO DE PISO","-",null,1,"-",null,null,0,0,""]
[3,3,3,2,5,16,1,0,0,7,2,"","Nível 3","Nível 3","-",null,null,"LASTRO","-",null,1,"-",null,null,0,0,""]
["S",3,"S",0,5,16,1,0,0,0,0,"","Serviço","Serviço","-","AGETOP",220101,"LASTRO DE CONCRETO REGULARIZADO IMPERMEABILIZADO 1:3:6 ESP=5CM (BASE)","m2    ",139.75,1,139.75,null,null,0,0,""]
[3,3,3,3,5,16,2,0,0,5,3,"","Nível 3","Nível 3","-",null,null,"PISO GRANITINA","-",null,1,"-",null,null,0,0,""]
["S",3,"S",0,5,16,2,0,0,0,0,"","Serviço","Serviço","-","SINAPI",84191,"PISO EM GRANILITE, MARMORITE OU GRANITINA ESPESSURA 8 MM, INCLUSO JUNTAS DE DILATACAO PLASTICAS","M2",144.74029999999999,1,144.74029999999999,null,null,0,0,"Referência: AGETOP - 221101"]
["S",3,"S",0,5,16,2,0,0,0,0,"","Serviço","Serviço","-","AGETOP",221104,"RASPAGEM E APLICAÇÃO RESINA ACRÍLICA DUAS DEMÃOS","m2    ",144.74029999999999,1,144.74029999999999,null,null,0,0,""]
[3,3,3,2,5,16,3,0,0,2,{"$error":"#N/A"},"","Nível 3","Nível 3","-",null,null,"PASSEIO (CALÇADA)","-",null,1,"-",null,null,0,0,""]
["S",3,"S",0,5,16,3,0,0,0,0,"","Serviço","Serviço","-","AGETOP",220100,"PASSEIO PROTECAO EM CONC.DESEMPEN.5 CM 1:2,5:3,5 ( INCLUSO ESPELHO DE 30CM/ESCAVAÇÃO/REATERRO/APILOAMENTO/ATERRO INTERNO)","m2    ",35.04,1,35.04,null,null,0,0,""]
[2,2,2,2,5,17,0,0,0,13,2,"","Nível 2","Nível 2","-",null,null,"MARCENARIA","-",null,1,"-",null,null,0,0,""]
["S",2,"S",0,5,17,0,0,0,0,0,"","Serviço","Serviço","-","AGETOP",240209,"PRATELEIRA EST.CAIBRO 4+1 TABUAS APARELHADAS E ENVERNIZADAS","m     ",3.2,1,3.2,null,null,0,0,""]
[2,2,2,8,5,18,0,0,0,11,8,"","Nível 2","Nível 2","-",null,null,"PINTURA","-",1,1,1,null,null,0,0,""]
[3,3,3,7,5,18,1,0,0,7,72,"","Nível 3","Nível 3","-",null,null,"ESMALTE SINTÉTICO","-",null,1,"-",null,null,0,0,""]
["S",3,"S",0,5,18,1,0,0,0,0,"","Serviço","Serviço","-","SINAPI",88497,"APLICAÇÃO E LIXAMENTO DE MASSA LÁTEX EM PAREDES, DUAS DEMÃOS. AF_06/2014","M2",128,1,128,null,null,0,0,"Referência: AGETOP - 261300"]
["S",3,"S",0,5,18,1,0,0,0,0,"","Serviço","Serviço","-","SINAPI",88486,"APLICAÇÃO MANUAL DE PINTURA COM TINTA LÁTEX PVA EM TETO, DUAS DEMÃOS. AF_06/2014","M2",40.75,1,40.75,null,null,0,0,"Referência: AGETOP - 261307"]
["S",3,"S",0,5,18,1,0,0,0,0,"","Serviço","Serviço","-","AGETOP",261550,"PINT.ESMALTE SINT.PAREDES - 2 DEM.C/SELADOR","m2    ",87.25,1,87.25,null,null,0,0,""]
["S",3,"S",0,5,18,1,0,0,0,0,"","Serviço","Serviço","-","SINAPI",88489,"APLICAÇÃO MANUAL DE PINTURA COM TINTA LÁTEX ACRÍLICA EM PAREDES, DUAS DEMÃOS. AF_06/2014","M2",87.25,1,87.25,null,null,0,0,"Referência: AGETOP - 261001"]
["S",3,"S",0,5,18,1,0,0,0,0,"","Serviço","Serviço","-","SINAPI","74145/1","PINTURA ESMALTE FOSCO, DUAS DEMAOS, SOBRE SUPERFICIE METALICA, INCLUSO UMA DEMAO DE FUNDO ANTICORROSIVO. UTILIZACAO DE REVOLVER ( AR-COMPRIMIDO).","M2",87.25,1,87.25,null,null,0,0,"Referência: AGETOP - 261602"]
["S",3,"S",0,5,18,1,0,0,0,0,"","Serviço","Serviço","-","SINAPI","74145/1","PINTURA ESMALTE FOSCO, DUAS DEMAOS, SOBRE SUPERFICIE METALICA, INCLUSO UMA DEMAO DE FUNDO ANTICORROSIVO. UTILIZACAO DE REVOLVER ( AR-COMPRIMIDO).","M2",364.14,1,364.14,null,null,0,0,"Referência: AGETOP - 261602"]
[2,2,2,3,5,19,0,0,0,3,{"$error":"#N/A"},"","Nível 2","Nível 2","-",null,null,"DIVERSOS","-",null,1,"-",null,null,0,0,""]
["S",2,"S",0,5,19,0,0,0,0,0,"","Serviço","Serviço","-","AGETOP",270501,"LIMPEZA FINAL DE OBRA - (OBRAS CIVIS)","m2    ",139.75,1,139.75,null,null,0,0,""]
["S",2,"S",0,5,19,0,0,0,0,0,"","Serviço","Serviço","-","AGETOP",271608,"BANCADA DE GRANITO C/ESPELHO","m2    ",6.8250000000000002,1,6.8250000000000002,null,null,0,0,""]
[1,1,1,115,6,0,0,0,0,258,115,"F","Nível 1","Nível 1","6.","SINAPI",null,"PATIO MULTIUSO 2","UN",1,1,1,null,null,0,0,""]
[2,2,2,2,6,1,0,0,0,114,2,"","Nível 2","Nível 2","-","SINAPI",null,"SERVIÇOS PRELIMINARES","-",null,1,"-",null,null,0,0,""]
["S",2,"S",0,6,1,0,0,0,0,0,"","Serviço","Serviço","-","SINAPI",99059,"LOCACAO CONVENCIONAL DE OBRA, UTILIZANDO GABARITO DE TÁBUAS CORRIDAS PONTALETADAS A CADA 2,00M -  2 UTILIZAÇÕES. AF_10/2018","M",89.67,1,89.67,null,null,0,0,""]
[2,2,2,2,6,2,0,0,0,112,2,"","Nível 2","Nível 2","-","SINAPI",null,"TRANSPORTES","-",null,1,"-",null,null,0,0,""]
["S",2,"S",0,6,2,0,0,0,0,0,"","Serviço","Serviço","-","SINAPI",72897,"CARGA MANUAL DE ENTULHO EM CAMINHAO BASCULANTE 6 M3","M3",10,1,10,null,null,0,0,""]
[2,2,2,8,6,3,0,0,0,110,8,"","Nível 2","Nível 2","-","SINAPI",null,"SERVIÇO EM TERRA","-",null,1,"-",null,null,0,0,""]
["S",2,"S",0,6,3,0,0,0,0,0,"","Serviço","Serviço","-","SINAPI",93358,"ESCAVAÇÃO MANUAL DE VALA COM PROFUNDIDADE MENOR OU IGUAL A 1,30 M. AF_03/2016","M3",2.8,1,2.8,null,null,0,0,"Referência: AGETOP - 40101"]
["S",2,"S",0,6,3,0,0,0,0,0,"","Serviço","Serviço","-","SINAPI",96995,"REATERRO MANUAL APILOADO COM SOQUETE. AF_10/2017","M3",1.4,1,1.4,null,null,0,0,"Referência: AGETOP - 40902"]
["S",2,"S",0,6,3,0,0,0,0,0,"","Serviço","Serviço","-","SINAPI",79480,"ESCAVACAO MECANICA CAMPO ABERTO EM SOLO EXCETO ROCHA ATE 2,00M PROFUNDIDADE","M3",22.4375,1,22.4375,null,null,0,0,"Referência: AGETOP - 41004"]
["S",2,"S",0,6,3,0,0,0,0,0,"","Serviço","Serviço","-","SINAPI",72898,"CARGA E DESCARGA MECANIZADAS DE ENTULHO EM CAMINHAO BASCULANTE 6 M3","M3",22.4375,1,22.4375,null,null,0,0,"Referência: AGETOP - 41005"]
["S",2,"S",0,6,3,0,0,0,0,0,"","Serviço","Serviço","-","AGETOP",41012,"INDENIZAÇÃO DE JAZIDA","m3    ",22.4375,1,22.4375,null,null,0,0,""]
["S",2,"S",0,6,3,0,0,0,0,0,"","Serviço","Serviço","-","AGETOP",41006,"TRANSPORTE DE MATERIAL ESCAVADO M3.KM","m3km  ",89.75,1,89.75,null,null,0,0,""]
["S",2,"S",0,6,3,0,0,0,0,0,"","Serviço","Serviço","-","SINAPI","74005/2","COMPACTACAO MECANICA C/ CONTROLE DO GC>=95% DO PN (AREAS) (C/MONIVELADORA 140 HP E ROLO COMPRESSOR VIBRATORIO 80 HP)","M3",17.95,1,17.95,null,null,0,0,"Referência: AGETOP - 41008"]
[2,2,2,11,6,4,0,0,0,102,11,"","Nível 2","Nível 2","-","SINAPI",null,"FUNDAÇÕES E SONDAGENS","-",null,1,"-",null,null,0,0,""]
["S",2,"S",0,6,4,0,0,0,0,0,"","Serviço","Serviço","-","SINAPI",98230,"ESTACA BROCA DE CONCRETO, DIÂMETRO DE 30 CM, PROFUNDIDADE DE ATÉ 3 M, ESCAVAÇÃO MANUAL COM TRADO CONCHA, NÃO ARMADA. AF_03/2018","M",36,1,36,null,null,0,0,"Referência: AGETOP - 50302"]
["S",2,"S",0,6,4,0,0,0,0,0,"","Serviço","Serviço","-","SINAPI",96521,"ESCAVAÇÃO MECANIZADA PARA BLOCO DE COROAMENTO OU SAPATA, COM PREVISÃO DE FÔRMA, COM RETROESCAVADEIRA. AF_06/2017","M3",3.78,1,3.78,null,null,0,0,""]
["S",2,"S",0,6,4,0,0,0,0,0,"","Serviço","Serviço","-","SINAPI",93382,"REATERRO MANUAL DE VALAS COM COMPACTAÇÃO MECANIZADA. AF_04/2016","M3",0.28000000000000003,1,0.28000000000000003,null,null,0,0,"Referência: AGETOP - 40904"]
["S",2,"S",0,6,4,0,0,0,0,0,"","Serviço","Serviço","-","SINAPI",96534,"FABRICAÇÃO, MONTAGEM E DESMONTAGEM DE FÔRMA PARA BLOCO DE COROAMENTO, EM MADEIRA SERRADA, E=25 MM, 4 UTILIZAÇÕES. AF_06/2017","M2",3.5,1,3.5,null,null,0,0,"Referência: AGETOP - 51009"]
["S",2,"S",0,6,4,0,0,0,0,0,"","Serviço","Serviço","-","SINAPI",94963,"CONCRETO FCK = 15MPA, TRAÇO 1:3,4:3,5 (CIMENTO/ AREIA MÉDIA/ BRITA 1)  - PREPARO MECÂNICO COM BETONEIRA 400 L. AF_07/2016","M3",0.18,1,0.18,null,null,0,0,""]
["S",2,"S",0,6,4,0,0,0,0,0,"","Serviço","Serviço","-","SINAPI",94964,"CONCRETO FCK = 20MPA, TRAÇO 1:2,7:3 (CIMENTO/ AREIA MÉDIA/ BRITA 1)  - PREPARO MECÂNICO COM BETONEIRA 400 L. AF_07/2016","M3",null,1,"-",null,null,0,0,""]
["S",2,"S",0,6,4,0,0,0,0,0,"","Serviço","Serviço","-","SINAPI",92874,"LANÇAMENTO COM USO DE BOMBA, ADENSAMENTO E ACABAMENTO DE CONCRETO EM ESTRUTURAS. AF_12/2015","M3",2.2799999999999998,1,2.2799999999999998,null,null,0,0,""]
["S",2,"S",0,6,4,0,0,0,0,0,"","Serviço","Serviço","-","SINAPI",96544,"ARMAÇÃO DE BLOCO, VIGA BALDRAME OU SAPATA UTILIZANDO AÇO CA-50 DE 6,3 MM - MONTAGEM. AF_06/2017","KG",26,1,26,null,null,0,0,"Referência: AGETOP - 52003"]
["S",2,"S",0,6,4,0,0,0,0,0,"","Serviço","Serviço","-","SINAPI",96545,"ARMAÇÃO DE BLOCO, VIGA BALDRAME OU SAPATA UTILIZANDO AÇO CA-50 DE 8 MM - MONTAGEM. AF_06/2017","KG",115,1,115,null,null,0,0,"Referência: AGETOP - 52004"]
["S",2,"S",0,6,4,0,0,0,0,0,"","Serviço","Serviço","-","SINAPI",96543,"ARMAÇÃO DE BLOCO, VIGA BALDRAME E SAPATA UTILIZANDO AÇO CA-60 DE 5 MM - MONTAGEM. AF_06/2017","KG",20,1,20,null,null,0,0,"Referência: AGETOP - 52014"]
[2,2,2,8,6,5,0,0,0,91,8,"","Nível 2","Nível 2","-","SINAPI",null,"ESTRUTURA","-",null,1,"-",null,null,0,0,""]
[{"$f":"CHOOSE(1+LOG(1+2*(ORÇAMENTO.Nivel=\"Nível 1\")+4*(ORÇAMENTO.Nivel=\"Nível 2\")+8*(ORÇAMENTO.Nivel=\"Nível 3\")+16*(ORÇAMENTO.Nivel=\"Nível 4\")+32*(ORÇAMENTO.Nivel=\"Serviço\"),2),0,1,2,3,4,\"S\")","v":"S"},2,"S",0,6,5,0,0,{"$f":"IF(AND($C690<=4,$C690<>0),0,IF(AND($C690=\"S\",$Y690>0),OFFSET(I690,-1,0)+1,OFFSET(I690,-1,0)))","v":0},0,0,"","Serviço","Serviço","-","SINAPI",92415,"MONTAGEM E DESMONTAGEM DE FÔRMA DE PILARES RETANGULARES E ESTRUTURAS SIMILARES COM ÁREA MÉDIA DAS SEÇÕES MAIOR QUE 0,25 M², PÉ-DIREITO SIMPLES, EM CHAPA DE MADEIRA COMPENSADA RESINADA, 2 UTILIZAÇÕES. AF_12/2015","M2",30.22,1,30.22,null,null,0,0,""]
["S",2,"S",0,6,5,0,0,0,0,0,"","Serviço","Serviço","-","AGETOP",60192,"FORMA DE TABUA CINTA/PILAR SOBRE/ENTRE ALVENARIA U=8 VEZES","m2    ",72.240000000000009,1,72.240000000000009,null,null,0,0,""]
["S",2,"S",0,6,5,0,0,0,0,0,"","Serviço","Serviço","-","SINAPI",92777,"ARMAÇÃO DE PILAR OU VIGA DE UMA ESTRUTURA CONVENCIONAL DE CONCRETO ARMADO EM UMA EDIFICAÇÃO TÉRREA OU SOBRADO UTILIZANDO AÇO CA-50 DE 8,0 MM - MONTAGEM. AF_12/2015","KG",155,1,155,null,null,0,0,"Referência: AGETOP - 60304"]
["S",2,"S",0,{"$f":"IF($C693=1,OFFSET(E693,-1,0)+1,OFFSET(E693,-1,0))","v":6},{"$f":"IF($C693=1,0,IF($C693=2,OFFSET(F693,-1,0)+1,OFFSET(F693,-1,0)))","v":5},{"$f":"IF(AND($C693<=2,$C693<>0),0,IF($C693=3,OFFSET(G693,-1,0)+1,OFFSET(G693,-1,0)))","v":0},{"$f":"IF(AND($C693<=3,$C693<>0),0,IF($C693=4,OFFSET(H693,-1,0)+1,OFFSET(H693,-1,0)))","v":0},0,0,0,"","Serviço","Serviço","-","SINAPI",92778,"ARMAÇÃO DE PILAR OU VIGA DE UMA ESTRUTURA CONVENCIONAL DE CONCRETO ARMADO EM UMA EDIFICAÇÃO TÉRREA OU SOBRADO UTILIZANDO AÇO CA-50 DE 10,0 MM - MONTAGEM. AF_12/2015","KG",233,1,233,null,null,0,0,"Referência: AGETOP - 60305"]
["S",2,"S",0,6,5,0,0,0,{"$f":"IF(OR($C694=\"S\",$C694=0),0,MATCH(0,OFFSET($D694,1,$C694,ROW($C$923)-ROW($C694)),0))","v":0},{"$f":"IF(OR($C694=\"S\",$C694=0),0,MATCH(OFFSET($D694,0,$C694)+1,OFFSET($D694,1,$C694,ROW($C$923)-ROW($C694)),0))","v":0},"","Serviço","Serviço","-","SINAPI",92775,"ARMAÇÃO DE PILAR OU VIGA DE UMA ESTRUTURA CONVENCIONAL DE CONCRETO ARMADO EM UMA EDIFICAÇÃO TÉRREA OU SOBRADO UTILIZANDO AÇO CA-60 DE 5,0 MM - MONTAGEM. AF_12/2015","KG",111,1,111,null,null,0,0,"Referência: AGETOP - 60314"]
["S",2,"S",0,6,5,0,0,0,0,0,"","Serviço","Serviço","-","SINAPI",94964,"CONCRETO FCK = 20MPA, TRAÇO 1:2,7:3 (CIMENTO/ AREIA MÉDIA/ BRITA 1)  - PREPARO MECÂNICO COM BETONEIRA 400 L. AF_07/2016","M3",3.91,1,3.91,null,null,0,0,""]
["S",2,"S",0,6,5,0,0,0,0,0,"","Serviço","Serviço","-","SINAPI",92874,"LANÇAMENTO COM USO DE BOMBA, ADENSAMENTO E ACABAMENTO DE CONCRETO EM ESTRUTURAS. AF_12/2015","M3",3.91,1,3.91,null,null,0,0,""]
[2,2,2,19,6,6,0,0,0,83,19,"","Nível 2","Nível 2","-","SINAPI",null,"INSTALAÇÕES ELÉTRICAS","-",null,1,"-",null,null,0,0,""]
["S",2,"S",0,6,6,0,0,0,0,0,"","Serviço","Serviço","-","SINAPI",91927,"CABO DE COBRE FLEXÍVEL ISOLADO, 2,5 MM², ANTI-CHAMA 0,6/1,0 KV, PARA CIRCUITOS TERMINAIS - FORNECIMENTO E INSTALAÇÃO. AF_12/2015","M",197,1,197,null,null,0,0,"Referência: AGETOP - 70581"]
["S",{"$f":"IF(OR(C699=\"s\",C699=0),OFFSET(B699,-1,0),C699)","v":2},{"$f":"IF(OFFSET(C699,-1,0)=\"L\",1,IF(OFFSET(C699,-1,0)=1,2,IF(OR(A699=\"s\",A699=0),\"S\",IF(AND(OFFSET(C699,-1,0)=2,A699=4),3,IF(AND(OR(OFFSET(C699,-1,0)=\"s\",OFFSET(C699,-1,0)=0),A699<>\"s\",A699>OFFSET(B699,-1,0)),OFFSET(B699,-1,0),A699)))))","v":"S"},{"$f":"IF(OR(C699=\"S\",C699=0),0,IF(ISERROR(K699),J699,SMALL(J699:K699,1)))","v":0},6,6,0,0,0,0,0,"","Serviço","Serviço","-","SINAPI",91940,"CAIXA RETANGULAR 4\" X 2\" MÉDIA (1,30 M DO PISO), PVC, INSTALADA EM PAREDE - FORNECIMENTO E INSTALAÇÃO. AF_12/2015","UN",5,1,5,null,null,0,0,""]
["S",2,"S",0,6,6,0,0,0,0,0,"","Serviço","Serviço","-","SINAPI",91914,"CURVA 90 GRAUS PARA ELETRODUTO, PVC, ROSCÁVEL, DN 25 MM (3/4\"), PARA CIRCUITOS TERMINAIS, INSTALADA EM PAREDE - FORNECIMENTO E INSTALAÇÃO. AF_12/2015","UN",15,1,15,null,null,0,0,""]
["S",2,"S",0,6,6,0,0,0,0,0,"","Serviço","Serviço","-","SINAPI",91917,"CURVA 90 GRAUS PARA ELETRODUTO, PVC, ROSCÁVEL, DN 32 MM (1\"), PARA CIRCUITOS TERMINAIS, INSTALADA EM PAREDE - FORNECIMENTO E INSTALAÇÃO. AF_12/2015","UN",7,1,7,null,null,0,0,""]
["S",2,"S",0,6,6,0,0,0,0,0,"","Serviço","Serviço","-","SINAPI",93654,"DISJUNTOR MONOPOLAR TIPO DIN, CORRENTE NOMINAL DE 16A - FORNECIMENTO E INSTALAÇÃO. AF_04/2016","UN",3,1,3,null,null,0,0,""]
["S",2,"S",0,6,6,0,0,0,0,0,"","Serviço","Serviço","-","SINAPI",93671,"DISJUNTOR TRIPOLAR TIPO DIN, CORRENTE NOMINAL DE 32A - FORNECIMENTO E INSTALAÇÃO. AF_04/2016","UN",1,1,1,null,null,0,0,"Referência: AGETOP - 71173"]
["S",2,"S",0,6,6,0,0,0,0,0,"","Serviço","Serviço","-","SINAPI",91871,"ELETRODUTO RÍGIDO ROSCÁVEL, PVC, DN 25 MM (3/4\"), PARA CIRCUITOS TERMINAIS, INSTALADO EM PAREDE - FORNECIMENTO E INSTALAÇÃO. AF_12/2015","M",24,1,24,null,null,0,0,"Referência: AGETOP - 71201"]
["S",2,"S",0,6,6,0,0,0,0,0,"","Serviço","Serviço","-","SINAPI",91856,"ELETRODUTO FLEXÍVEL CORRUGADO, PVC, DN 32 MM (1\"), PARA CIRCUITOS TERMINAIS, INSTALADO EM PAREDE - FORNECIMENTO E INSTALAÇÃO. AF_12/2015","M",13,1,13,null,null,0,0,""]
["S",2,"S",0,6,6,0,0,0,0,0,"","Serviço","Serviço","-","SINAPI",91953,"INTERRUPTOR SIMPLES (1 MÓDULO), 10A/250V, INCLUINDO SUPORTE E PLACA - FORNECIMENTO E INSTALAÇÃO. AF_12/2015","UN",1,1,1,null,null,0,0,"Referência: AGETOP - 71440"]
["S",2,"S",0,6,6,0,0,0,0,0,"","Serviço","Serviço","-","COMPOSIÇÃO","COMP 387_SEE","LÂMPADA LED TUBULAR 18W ","UN ",16,1,16,null,null,0,0,""]
["S",2,"S",0,6,6,0,0,0,0,0,"","Serviço","Serviço","-","SINAPI",97585,"LUMINÁRIA TIPO CALHA, DE SOBREPOR, COM 2 LÂMPADAS TUBULARES DE 18 W - FORNECIMENTO E INSTALAÇÃO. AF_11/2017","UN",8,1,8,null,null,0,0,""]
["S",2,"S",0,6,6,0,0,0,0,0,"","Serviço","Serviço","-","SINAPI",91884,"LUVA PARA ELETRODUTO, PVC, ROSCÁVEL, DN 25 MM (3/4\"), PARA CIRCUITOS TERMINAIS, INSTALADA EM PAREDE - FORNECIMENTO E INSTALAÇÃO. AF_12/2015","UN",15,1,15,null,null,0,0,"Referência: AGETOP - 71741"]
["S",2,"S",0,6,6,0,0,0,0,0,"","Serviço","Serviço","-","SINAPI",91885,"LUVA PARA ELETRODUTO, PVC, ROSCÁVEL, DN 32 MM (1\"), PARA CIRCUITOS TERMINAIS, INSTALADA EM PAREDE - FORNECIMENTO E INSTALAÇÃO. AF_12/2015","UN",7,1,7,null,null,0,0,"Referência: AGETOP - 71742"]
["S",2,"S",0,6,6,0,0,0,0,0,"","Serviço","Serviço","-","SINAPI",91996,"TOMADA MÉDIA DE EMBUTIR (1 MÓDULO), 2P+T 10 A, INCLUINDO SUPORTE E PLACA - FORNECIMENTO E INSTALAÇÃO. AF_12/2015","UN",4,1,4,null,null,0,0,"Referência: AGETOP - 72578"]
["S",2,"S",0,6,6,0,0,0,0,0,"","Serviço","Serviço","-","SINAPI",91997,"TOMADA MÉDIA DE EMBUTIR (1 MÓDULO), 2P+T 20 A, INCLUINDO SUPORTE E PLACA - FORNECIMENTO E INSTALAÇÃO. AF_12/2015","UN",1,1,1,null,null,0,0,""]
["S",2,"S",0,6,6,0,0,0,0,0,"","Serviço","Serviço","-","AGETOP",71450,"INTERRUPTOR DIFERENCIAL RESIDUAL (D.R.) BIPOLAR DE 25A-30mA","Un    ",3,1,3,null,null,0,0,""]
["S",2,"S",0,6,6,0,0,0,0,0,"","Serviço","Serviço","-","AGETOP",71331,"FITA ISOLANTE, ROLO DE 20,00 M","Un    ",2,1,2,null,null,0,0,""]
["S",2,"S",0,6,6,0,0,0,0,0,"","Serviço","Serviço","-","AGETOP",71321,"FITA DE AUTO FUSAO, ROLO E 10,00 MM","Un    ",1,1,1,null,null,0,0,""]
[2,2,2,31,6,7,0,0,0,64,31,"","Nível 2","Nível 2","-","SINAPI",null,"INSTALAÇÕES HIDROSSANITÁRIAS","-",null,1,"-",null,null,0,0,""]
[3,3,3,10,6,7,1,0,0,30,10,"","Nível 3","Nível 3","-","SINAPI",null,"PEÇAS E ACESSÓRIOS","-",null,1,"-",null,null,0,0,""]
["S",3,"S",0,6,7,1,0,0,0,0,"","Serviço","Serviço","-","AGETOP",81501,"ADESIVO PLASTICO - FRASCO 850 G","Un    ",2,1,2,null,null,0,0,""]
["S",3,"S",0,6,7,1,0,0,0,0,"","Serviço","Serviço","-","AGETOP",81504,"SOLUCAO LIMPADORA 1000 CM3","Un    ",2,1,2,null,null,0,0,""]
["S",3,"S",0,6,7,1,0,0,0,0,"","Serviço","Serviço","-","AGETOP",81825,"CAIXA DE PASSAGEM 60 X 60 CM SEM TAMPA","Un    ",1,1,1,null,null,0,0,""]
["S",3,"S",0,6,7,1,0,0,0,0,"","Serviço","Serviço","-","SINAPI",6171,"TAMPA DE CONCRETO ARMADO 60X60X5CM PARA CAIXA","UN",1,1,1,null,null,0,0,""]
["S",3,"S",0,6,7,1,0,0,0,0,"","Serviço","Serviço","-","SINAPI",86901,"CUBA DE EMBUTIR OVAL EM LOUÇA BRANCA, 35 X 50CM OU EQUIVALENTE - FORNECIMENTO E INSTALAÇÃO. AF_12/2013","UN",2,1,2,null,null,0,0,"Referência: AGETOP - 80587"]
["S",3,"S",0,6,7,1,0,0,0,0,"","Serviço","Serviço","-","AGETOP",80556,"LIGAÇÃO FLEXÍVEL PVC DIAM.1/2\" (ENGATE)","Un    ",2,1,2,null,null,0,0,""]
["S",3,"S",0,6,7,1,0,0,0,0,"","Serviço","Serviço","-","AGETOP",80562,"SIFAO FLEXIVEL UNIVERSAL ( SANFONADO) EM PVC PARA LAVATORIO","Un    ",2,1,2,null,null,0,0,""]
["S",3,"S",0,6,7,1,0,0,0,0,"","Serviço","Serviço","-","SINAPI",86877,"VÁLVULA EM METAL CROMADO 1.1/2\" X 1.1/2\" PARA TANQUE OU LAVATÓRIO, COM OU SEM LADRÃO - FORNECIMENTO E INSTALAÇÃO. AF_12/2013","UN",2,1,2,null,null,0,0,"Referência: AGETOP - 80580"]
["S",3,"S",0,6,7,1,0,0,0,0,"","Serviço","Serviço","-","AGETOP",80570,"TORNEIRA DE MESA PARA LAVATÓRIO DIÂMETRO DE 1/2\"","Un    ",2,1,2,null,null,0,0,""]
[3,3,3,12,6,7,2,0,0,20,12,"","Nível 3","Nível 3","-","SINAPI",null,"ÁGUA FRIA","-",null,1,"-",null,null,0,0,""]
["S",3,"S",0,6,7,2,0,0,0,0,"","Serviço","Serviço","-","AGETOP",80927,"REGISTRO DE GAVETA C/CANOPLA DIAMETRO 1\"","Un    ",1,1,1,null,null,0,0,""]
["S",3,"S",0,6,7,2,0,0,0,0,"","Serviço","Serviço","-","SINAPI",89402,"TUBO, PVC, SOLDÁVEL, DN 25MM, INSTALADO EM RAMAL DE DISTRIBUIÇÃO DE ÁGUA - FORNECIMENTO E INSTALAÇÃO. AF_12/2014","M",3,1,3,null,null,0,0,"Referência: AGETOP - 81003"]
["S",3,"S",0,6,7,2,0,0,0,0,"","Serviço","Serviço","-","SINAPI",89447,"TUBO, PVC, SOLDÁVEL, DN 32MM, INSTALADO EM PRUMADA DE ÁGUA - FORNECIMENTO E INSTALAÇÃO. AF_12/2014","M",6,1,6,null,null,0,0,""]
["S",3,"S",0,6,7,2,0,0,0,0,"","Serviço","Serviço","-","SINAPI",94709,"ADAPTADOR COM FLANGES LIVRES, PVC, SOLDÁVEL, DN 32 MM X 1 , INSTALADO EM RESERVAÇÃO DE ÁGUA DE EDIFICAÇÃO QUE POSSUA RESERVATÓRIO DE FIBRA/FIBROCIMENTO   FORNECIMENTO E INSTALAÇÃO. AF_06/2016","UN",2,1,2,null,null,0,0,"Referência: AGETOP - 81042"]
["S",3,"S",0,6,7,2,0,0,0,0,"","Serviço","Serviço","-","SINAPI",96662,"BUCHA DE REDUÇÃO, PPR, 32 X 25, CLASSE PN 25, INSTALADO EM RAMAL DE DISTRIBUIÇÃO DE ÁGUA \u0096 FORNECIMENTO E INSTALAÇÃO . AF_06/2015","UN",1,1,1,null,null,0,0,""]
["S",3,"S",0,6,7,2,0,0,0,0,"","Serviço","Serviço","-","SINAPI",89481,"JOELHO 90 GRAUS, PVC, SOLDÁVEL, DN 25MM, INSTALADO EM PRUMADA DE ÁGUA - FORNECIMENTO E INSTALAÇÃO. AF_12/2014","UN",1,1,1,null,null,0,0,""]
["S",3,"S",0,6,7,2,0,0,0,0,"","Serviço","Serviço","-","AGETOP",81341,"JOELHO 90 GRAUS ROSCAVEL 1/2\" (MARROM)","Un    ",3,1,3,null,null,0,0,""]
["S",3,"S",0,6,7,2,0,0,0,0,"","Serviço","Serviço","-","AGETOP",81342,"JOELHO 90 GRAUS ROSCAVEL DIAMETRO 3/4\"","Un    ",1,1,1,null,null,0,0,""]
["S",3,"S",0,6,7,2,0,0,0,0,"","Serviço","Serviço","-","AGETOP",81322,"JOELHO 90 GRAUS SOLDAVEL DIAMETRO 32 MM (1\")","Un    ",20,1,20,null,null,0,0,""]
["S",3,"S",0,6,7,2,0,0,0,0,"","Serviço","Serviço","-","AGETOP",81421,"TE REDUCAO 90 GRAUS SOLDAVEL 32 X 25 mm","Un    ",2,1,2,null,null,0,0,""]
["S",3,"S",0,6,7,2,0,0,0,0,"","Serviço","Serviço","-","SINAPI",89617,"TE, PVC, SOLDÁVEL, DN 25MM, INSTALADO EM PRUMADA DE ÁGUA - FORNECIMENTO E INSTALAÇÃO. AF_12/2014","UN",1,1,1,null,null,0,0,""]
[3,3,3,8,6,7,3,0,0,8,{"$error":"#N/A"},"","Nível 3","Nível 3","-","SINAPI",null,"ESGOTO","-",null,1,"-",null,null,0,0,""]
["S",3,"S",0,6,7,3,0,0,0,0,"","Serviço","Serviço","-","AGETOP",81663,"CORPO CX. SIFONADA DIAM. 150 X 150 X 50","Un    ",1,1,1,null,null,0,0,""]
["S",3,"S",0,6,7,3,0,0,0,0,"","Serviço","Serviço","-","AGETOP",81752,"GRELHA QUADRADA ACO INOX ROTATIVO DIAM.150 MM","Un    ",1,1,1,null,null,0,0,""]
["S",3,"S",0,6,7,3,0,0,0,0,"","Serviço","Serviço","-","SINAPI",89726,"JOELHO 45 GRAUS, PVC, SERIE NORMAL, ESGOTO PREDIAL, DN 40 MM, JUNTA SOLDÁVEL, FORNECIDO E INSTALADO EM RAMAL DE DESCARGA OU RAMAL DE ESGOTO SANITÁRIO. AF_12/2014","UN",2,1,2,null,null,0,0,""]
["S",3,"S",0,6,7,3,0,0,0,0,"","Serviço","Serviço","-","SINAPI",89724,"JOELHO 90 GRAUS, PVC, SERIE NORMAL, ESGOTO PREDIAL, DN 40 MM, JUNTA SOLDÁVEL, FORNECIDO E INSTALADO EM RAMAL DE DESCARGA OU RAMAL DE ESGOTO SANITÁRIO. AF_12/2014","UN",3,1,3,null,null,0,0,""]
["S",3,"S",0,6,7,3,0,0,0,0,"","Serviço","Serviço","-","AGETOP",81927,"JOELHO 90 GRAUS C/ANEL 40 mm ","Un    ",3,1,3,null,null,0,0,""]
["S",3,"S",0,6,7,3,0,0,0,0,"","Serviço","Serviço","-","SINAPI",89711,"TUBO PVC, SERIE NORMAL, ESGOTO PREDIAL, DN 40 MM, FORNECIDO E INSTALADO EM RAMAL DE DESCARGA OU RAMAL DE ESGOTO SANITÁRIO. AF_12/2014","M",6,1,6,null,null,0,0,"Referência: AGETOP - 82301"]
["S",3,"S",0,6,7,3,0,0,0,0,"","Serviço","Serviço","-","SINAPI",89798,"TUBO PVC, SERIE NORMAL, ESGOTO PREDIAL, DN 50 MM, FORNECIDO E INSTALADO EM PRUMADA DE ESGOTO SANITÁRIO OU VENTILAÇÃO. AF_12/2014","M",3,1,3,null,null,0,0,""]
[2,2,2,4,6,8,0,0,0,33,4,"","Nível 2","Nível 2","-","SINAPI",null,"ALVENARIAS E DIVISÓRIAS","-",null,1,"-",null,null,0,0,""]
["S",2,"S",0,6,8,0,0,0,0,0,"","Serviço","Serviço","-","SINAPI",87471,"ALVENARIA DE VEDAÇÃO DE BLOCOS CERÂMICOS FURADOS NA VERTICAL DE 9X19X39CM (ESPESSURA 9CM) DE PAREDES COM ÁREA LÍQUIDA MENOR QUE 6M² SEM VÃOS E ARGAMASSA DE ASSENTAMENTO COM PREPARO EM BETONEIRA. AF_06/2014","M2",44.92,1,44.92,null,null,0,0,""]
["S",2,"S",0,6,8,0,0,0,0,0,"","Serviço","Serviço","-","SINAPI",93202,"FIXAÇÃO (ENCUNHAMENTO) DE ALVENARIA DE VEDAÇÃO COM TIJOLO MACIÇO. AF_03/2016","M",5.6,1,5.6,null,null,0,0,"Referência: AGETOP - 100204"]
["S",2,"S",0,6,8,0,0,0,0,0,"","Serviço","Serviço","-","SINAPI",95465,"COBOGO CERAMICO (ELEMENTO VAZADO), 9X20X20CM, ASSENTADO COM ARGAMASSA TRACO 1:4 DE CIMENTO E AREIA","M2",23.94,1,23.94,null,null,0,0,""]
[2,2,2,2,6,9,0,0,0,29,2,"","Nível 2","Nível 2","-","SINAPI",null,"IMPERMEABILIZAÇÃO","-",null,1,"-",null,null,0,0,""]
["S",2,"S",0,6,9,0,0,0,0,0,"","Serviço","Serviço","-","SINAPI",98562,"IMPERMEABILIZAÇÃO DE FLOREIRA OU VIGA BALDRAME COM ARGAMASSA DE CIMENTO E AREIA, COM ADITIVO IMPERMEABILIZANTE, E = 2 CM. AF_06/2018","M2",30.3,1,30.3,null,null,0,0,"Referência: AGETOP - 120902"]
[2,2,2,2,6,10,0,0,0,27,2,"","Nível 2","Nível 2","-","SINAPI",null,"ESTRUTURAS METÁLICAS","-",null,1,"-",null,null,0,0,""]
[{"$f":"CHOOSE(1+LOG(1+2*(ORÇAMENTO.Nivel=\"Nível 1\")+4*(ORÇAMENTO.Nivel=\"Nível 2\")+8*(ORÇAMENTO.Nivel=\"Nível 3\")+16*(ORÇAMENTO.Nivel=\"Nível 4\")+32*(ORÇAMENTO.Nivel=\"Serviço\"),2),0,1,2,3,4,\"S\")","v":"S"},2,"S",0,6,10,0,0,{"$f":"IF(AND($C754<=4,$C754<>0),0,IF(AND($C754=\"S\",$Y754>0),OFFSET(I754,-1,0)+1,OFFSET(I754,-1,0)))","v":0},0,0,"","Serviço","Serviço","-","AGETOP",150103,"ESTRUTURA METÁLICA CONVENCIONAL EM AÇO DO TIPO USI SAC-300 COM FUNDO ANTICORROSIVO","Kg    ",1638.68,1,1638.68,null,null,0,0,""]
[2,2,2,4,6,11,0,0,0,25,4,"","Nível 2","Nível 2","-","SINAPI",null,"COBERTURAS","-",null,1,"-",null,null,0,0,""]
["S",2,"S",0,6,11,0,0,0,0,0,"","Serviço","Serviço","-","SINAPI",94445,"TELHAMENTO COM TELHA CERÂMICA CAPA-CANAL, TIPO PLAN, COM ATÉ 2 ÁGUAS, INCLUSO TRANSPORTE VERTICAL. AF_07/2019","M2",124.64,1,124.64,null,null,0,0,"Referência: AGETOP - 160401"]
["S",2,"S",0,{"$f":"IF($C757=1,OFFSET(E757,-1,0)+1,OFFSET(E757,-1,0))","v":6},{"$f":"IF($C757=1,0,IF($C757=2,OFFSET(F757,-1,0)+1,OFFSET(F757,-1,0)))","v":11},{"$f":"IF(AND($C757<=2,$C757<>0),0,IF($C757=3,OFFSET(G757,-1,0)+1,OFFSET(G757,-1,0)))","v":0},{"$f":"IF(AND($C757<=3,$C757<>0),0,IF($C757=4,OFFSET(H757,-1,0)+1,OFFSET(H757,-1,0)))","v":0},0,0,0,"","Serviço","Serviço","-","SINAPI",94221,"CUMEEIRA PARA TELHA CERÂMICA EMBOÇADA COM ARGAMASSA TRAÇO 1:2:9 (CIMENTO, CAL E AREIA) PARA TELHADOS COM ATÉ 2 ÁGUAS, INCLUSO TRANSPORTE VERTICAL. AF_07/2019","M",15.2,1,15.2,null,null,0,0,""]
["S",2,"S",0,6,11,0,0,0,{"$f":"IF(OR($C758=\"S\",$C758=0),0,MATCH(0,OFFSET($D758,1,$C758,ROW($C$923)-ROW($C758)),0))","v":0},{"$f":"IF(OR($C758=\"S\",$C758=0),0,MATCH(OFFSET($D758,0,$C758)+1,OFFSET($D758,1,$C758,ROW($C$923)-ROW($C758)),0))","v":0},"","Serviço","Serviço","-","SINAPI",94224,"EMBOÇAMENTO COM ARGAMASSA TRAÇO 1:2:9 (CIMENTO, CAL E AREIA). AF_07/2019","M",47.2,1,47.2,null,null,0,0,"Referência: AGETOP - 160403"]
[2,2,2,5,6,12,0,0,0,21,5,"","Nível 2","Nível 2","-","SINAPI",null,"REVESTIMENTO DE PAREDE","-",null,1,"-",null,null,0,0,""]
["S",2,"S",0,6,12,0,0,0,0,0,"","Serviço","Serviço","-","SINAPI",87879,"CHAPISCO APLICADO EM ALVENARIAS E ESTRUTURAS DE CONCRETO INTERNAS, COM COLHER DE PEDREIRO.  ARGAMASSA TRAÇO 1:3 COM PREPARO EM BETONEIRA 400L. AF_06/2014","M2",75.52,1,75.52,null,null,0,0,""]
["S",2,"S",0,6,12,0,0,0,0,0,"","Serviço","Serviço","-","SINAPI",87286,"ARGAMASSA TRAÇO 1:1:6 (EM VOLUME DE CIMENTO, CAL E AREIA MÉDIA ÚMIDA) PARA EMBOÇO/MASSA ÚNICA/ASSENTAMENTO DE ALVENARIA DE VEDAÇÃO, PREPARO MECÂNICO COM BETONEIRA 400 L. AF_08/2019","M3",3.15,1,3.15,null,null,0,0,""]
["S",2,"S",0,6,12,0,0,0,0,0,"","Serviço","Serviço","-","SINAPI",87336,"ARGAMASSA TRAÇO 1:2:8 (EM VOLUME DE CIMENTO, CAL E AREIA MÉDIA ÚMIDA) PARA EMBOÇO/MASSA ÚNICA/ASSENTAMENTO DE ALVENARIA DE VEDAÇÃO, PREPARO MECÂNICO COM MISTURADOR DE EIXO HORIZONTAL DE 600 KG. AF_08/2019","M3",2.1711,1,2.1711,null,null,0,0,""]
["S",{"$f":"IF(OR(C763=\"s\",C763=0),OFFSET(B763,-1,0),C763)","v":2},{"$f":"IF(OFFSET(C763,-1,0)=\"L\",1,IF(OFFSET(C763,-1,0)=1,2,IF(OR(A763=\"s\",A763=0),\"S\",IF(AND(OFFSET(C763,-1,0)=2,A763=4),3,IF(AND(OR(OFFSET(C763,-1,0)=\"s\",OFFSET(C763,-1,0)=0),A763<>\"s\",A763>OFFSET(B763,-1,0)),OFFSET(B763,-1,0),A763)))))","v":"S"},{"$f":"IF(OR(C763=\"S\",C763=0),0,IF(ISERROR(K763),J763,SMALL(J763:K763,1)))","v":0},6,12,0,0,0,0,0,"","Serviço","Serviço","-","SINAPI",87274,"REVESTIMENTO CERÂMICO PARA PAREDES INTERNAS COM PLACAS TIPO ESMALTADA EXTRA DE DIMENSÕES 33X45 CM APLICADAS EM AMBIENTES DE ÁREA MENOR QUE 5 M² A MEIA ALTURA DAS PAREDES. AF_06/2014","M2",3.15,1,3.15,null,null,0,0,"Referência: AGETOP - 201302"]
[2,2,2,6,6,13,0,0,0,16,6,"","Nível 2","Nível 2","-","SINAPI",null,"REVESTIMENTO DE PISO","-",null,1,"-",null,null,0,0,""]
["S",2,"S",0,6,13,0,0,0,0,0,"","Serviço","Serviço","-","SINAPI",95241,"LASTRO DE CONCRETO MAGRO, APLICADO EM PISOS OU RADIERS, ESPESSURA DE 5 CM. AF_07/2016","M2",89.67,1,89.67,null,null,0,0,""]
["S",2,"S",0,6,13,0,0,0,0,0,"","Serviço","Serviço","-","SINAPI",84191,"PISO EM GRANILITE, MARMORITE OU GRANITINA ESPESSURA 8 MM, INCLUSO JUNTAS DE DILATACAO PLASTICAS","M2",89.67,1,89.67,null,null,0,0,"Referência: AGETOP - 221101"]
["S",2,"S",0,6,13,0,0,0,0,0,"","Serviço","Serviço","-","SINAPI","73850/1","RODAPE EM MARMORITE, ALTURA 10CM","M",15.05,1,15.05,null,null,0,0,""]
["S",2,"S",0,6,13,0,0,0,0,0,"","Serviço","Serviço","-","AGETOP",221104,"RASPAGEM E APLICAÇÃO RESINA ACRÍLICA DUAS DEMÃOS","m2    ",91.174999999999997,1,91.174999999999997,null,null,0,0,""]
["S",2,"S",0,6,13,0,0,0,0,0,"","Serviço","Serviço","-","SINAPI",94992,"EXECUÇÃO DE PASSEIO (CALÇADA) OU PISO DE CONCRETO COM CONCRETO MOLDADO IN LOCO, FEITO EM OBRA, ACABAMENTO CONVENCIONAL, ESPESSURA 6 CM, ARMADO. AF_07/2016","M2",25.68,1,25.68,null,null,0,0,""]
[2,2,2,4,6,14,0,0,0,10,4,"","Nível 2","Nível 2","-","SINAPI",null,"PINTURA","-",null,1,"-",null,null,0,0,""]
["S",2,"S",0,6,14,0,0,0,0,0,"","Serviço","Serviço","-","SINAPI","74133/1","EMASSAMENTO COM MASSA A OLEO, UMA DEMAO","M2",15.05,1,15.05,null,null,0,0,""]
["S",2,"S",0,6,14,0,0,0,0,0,"","Serviço","Serviço","-","SINAPI",88489,"APLICAÇÃO MANUAL DE PINTURA COM TINTA LÁTEX ACRÍLICA EM PAREDES, DUAS DEMÃOS. AF_06/2014","M2",65.36,1,65.36,null,null,0,0,"Referência: AGETOP - 261001"]
["S",2,"S",0,6,14,0,0,0,0,0,"","Serviço","Serviço","-","SINAPI",79464,"PINTURA A OLEO, 2 DEMAOS","M2",15.05,1,15.05,null,null,0,0,""]
[2,2,2,6,6,15,0,0,0,6,104,"","Nível 2","Nível 2","-","SINAPI",null,"DIVERSOS","-",null,1,"-",null,null,0,0,""]
["S",2,"S",0,6,15,0,0,0,0,0,"","Serviço","Serviço","-","AGETOP",270312,"MURO DE ALVENARIA TIJOLO FURADO 1/2 VEZ ( H=2,50M) COM FUNDAÇÃO - SEM REVESTIMENTOS (PADRÃO AGETOP)","m2    ",1,1,1,null,null,0,0,""]
["S",2,"S",0,6,15,0,0,0,0,0,"","Serviço","Serviço","-","AGETOP",270501,"LIMPEZA FINAL DE OBRA - (OBRAS CIVIS)","m2    ",89.67,1,89.67,null,null,0,0,""]
["S",2,"S",0,6,15,0,0,0,0,0,"","Serviço","Serviço","-","AGETOP",271417,"CANALETA CONCRETO DESEMPENADO 5 CM PD.AGETOP","m     ",9.4499999999999993,1,9.4499999999999993,null,null,0,0,""]
["S",2,"S",0,6,15,0,0,0,0,0,"","Serviço","Serviço","-","AGETOP",271608,"BANCADA DE GRANITO C/ESPELHO","m2    ",2,1,2,null,null,0,0,""]
["S",2,"S",0,6,15,0,0,0,0,0,"","Serviço","Serviço","-","AGETOP",271303,"BANCO DE CONCRETO POLIDO BASE EM ALVENARIA REBOCADA E PINTADA - PADRÃO AGETOP 2015","m     ",12.6,1,12.6,null,null,0,0,""]
[1,1,1,109,7,0,0,0,0,143,109,"F","Nível 1","Nível 1","7.","SINAPI",null,"3 SALAS PADRÃO SEDUC - LAJE","UN",1,1,1,null,null,0,0,""]
[2,2,2,2,7,1,0,0,0,108,2,"","Nível 2","Nível 2","-","SINAPI",null,"SERVIÇOS PRELIMINARES","-",null,1,"-",null,null,0,0,""]
["S",2,"S",0,7,1,0,0,0,0,0,"","Serviço","Serviço","-","AGETOP",20701,"LOCAÇÃO DA OBRA, EXECUÇÃO DE GABARITO SEM REAPROVEITAMENTO, INCLUSO PINTURA (FACE INTERNA DO RIPÃO 15CM) E PIQUETE COM TESTEMUNHA","m2    ",164.02,1,164.02,null,null,0,0,""]
[2,2,2,3,7,2,0,0,0,106,3,"","Nível 2","Nível 2","-","AGETOP",null,"TRANSPORTES","-",null,1,"-",null,null,0,0,""]
["S",2,"S",0,7,2,0,0,0,0,0,"","Serviço","Serviço","-","SINAPI",72900,"TRANSPORTE DE ENTULHO COM CAMINHAO BASCULANTE 6 M3, RODOVIA PAVIMENTADA, DMT 0,5 A 1,0 KM","M3",12,1,12,null,null,0,0,""]
["S",2,"S",0,7,2,0,0,0,0,0,"","Serviço","Serviço","-","SINAPI",72897,"CARGA MANUAL DE ENTULHO EM CAMINHAO BASCULANTE 6 M3","M3",12,1,12,null,null,0,0,""]
[2,2,2,8,7,3,0,0,0,103,8,"","Nível 2","Nível 2","-","AGETOP",null,"SERVIÇO EM TERRA","-",null,1,"-",null,null,0,0,""]
["S",2,"S",0,7,3,0,0,0,0,0,"","Serviço","Serviço","-","SINAPI",93358,"ESCAVAÇÃO MANUAL DE VALA COM PROFUNDIDADE MENOR OU IGUAL A 1,30 M. AF_03/2016","M3",9.35,1,9.35,null,null,0,0,"Referência: AGETOP - 40101"]
["S",2,"S",0,7,3,0,0,0,0,0,"","Serviço","Serviço","-","SINAPI",96995,"REATERRO MANUAL APILOADO COM SOQUETE. AF_10/2017","M3",5.42,1,5.42,null,null,0,0,"Referência: AGETOP - 40902"]
["S",2,"S",0,7,3,0,0,0,0,0,"","Serviço","Serviço","-","SINAPI",79480,"ESCAVACAO MECANICA CAMPO ABERTO EM SOLO EXCETO ROCHA ATE 2,00M PROFUNDIDADE","M3",40,1,40,null,null,0,0,"Referência: AGETOP - 41004"]
["S",2,"S",0,7,3,0,0,0,0,0,"","Serviço","Serviço","-","SINAPI","74010/1","CARGA E DESCARGA MECANICA DE SOLO UTILIZANDO CAMINHAO BASCULANTE 6,0M3/16T E PA CARREGADEIRA SOBRE PNEUS 128 HP, CAPACIDADE DA CAÇAMBA 1,7 A 2,8 M3, PESO OPERACIONAL 11632 KG","M3",40,1,40,null,null,0,0,""]
["S",2,"S",0,7,3,0,0,0,0,0,"","Serviço","Serviço","-","AGETOP",41012,"INDENIZAÇÃO DE JAZIDA","m3    ",40,1,40,null,null,0,0,""]
["S",2,"S",0,7,3,0,0,0,0,0,"","Serviço","Serviço","-","AGETOP",41006,"TRANSPORTE DE MATERIAL ESCAVADO M3.KM","m3km  ",120,1,120,null,null,0,0,""]
["S",2,"S",0,7,3,0,0,0,0,0,"","Serviço","Serviço","-","SINAPI","74005/2","COMPACTACAO MECANICA C/ CONTROLE DO GC>=95% DO PN (AREAS) (C/MONIVELADORA 140 HP E ROLO COMPRESSOR VIBRATORIO 80 HP)","M3",32,1,32,null,null,0,0,"Referência: AGETOP - 41008"]
[2,2,2,12,7,4,0,0,0,95,12,"","Nível 2","Nível 2","-","AGETOP",null,"FUNDAÇÕES E SONDAGENS","-",null,1,"-",null,null,0,0,""]
[3,3,3,11,7,4,1,0,0,11,{"$error":"#N/A"},"","Nível 3","Nível 3","-","SINAPI",null,"ESTACAS E BLOCOS","-",null,1,"-",null,null,0,0,""]
["S",3,"S",0,7,4,1,0,0,0,0,"","Serviço","Serviço","-","AGETOP",50251,"CORPO DE PROVA","Un    ",6,1,6,null,null,0,0,""]
["S",3,"S",0,7,4,1,0,0,0,0,"","Serviço","Serviço","-","SINAPI",98230,"ESTACA BROCA DE CONCRETO, DIÂMETRO DE 30 CM, PROFUNDIDADE DE ATÉ 3 M, ESCAVAÇÃO MANUAL COM TRADO CONCHA, NÃO ARMADA. AF_03/2018","M",99,1,99,null,null,0,0,"Referência: AGETOP - 50302"]
["S",3,"S",0,7,4,1,0,0,0,0,"","Serviço","Serviço","-","SINAPI",96522,"ESCAVAÇÃO MANUAL PARA BLOCO DE COROAMENTO OU SAPATA, SEM PREVISÃO DE FÔRMA. AF_06/2017","M3",8.26,1,8.26,null,null,0,0,"Referência: AGETOP - 50901"]
["S",3,"S",0,7,4,1,0,0,0,0,"","Serviço","Serviço","-","SINAPI",93382,"REATERRO MANUAL DE VALAS COM COMPACTAÇÃO MECANIZADA. AF_04/2016","M3",4.3600000000000003,1,4.3600000000000003,null,null,0,0,"Referência: AGETOP - 40904"]
["S",3,"S",0,7,4,1,0,0,0,0,"","Serviço","Serviço","-","SINAPI",96543,"ARMAÇÃO DE BLOCO, VIGA BALDRAME E SAPATA UTILIZANDO AÇO CA-60 DE 5 MM - MONTAGEM. AF_06/2017","KG",37.799999999999997,1,37.799999999999997,null,null,0,0,"Referência: AGETOP - 52014"]
["S",3,"S",0,7,4,1,0,0,0,0,"","Serviço","Serviço","-","SINAPI",96545,"ARMAÇÃO DE BLOCO, VIGA BALDRAME OU SAPATA UTILIZANDO AÇO CA-50 DE 8 MM - MONTAGEM. AF_06/2017","KG",135,1,135,null,null,0,0,"Referência: AGETOP - 52004"]
["S",3,"S",0,7,4,1,0,0,0,0,"","Serviço","Serviço","-","SINAPI",96546,"ARMAÇÃO DE BLOCO, VIGA BALDRAME OU SAPATA UTILIZANDO AÇO CA-50 DE 10 MM - MONTAGEM. AF_06/2017","KG",54.9,1,54.9,null,null,0,0,"Referência: AGETOP - 52005"]
["S",3,"S",0,7,4,1,0,0,0,0,"","Serviço","Serviço","-","SINAPI",96544,"ARMAÇÃO DE BLOCO, VIGA BALDRAME OU SAPATA UTILIZANDO AÇO CA-50 DE 6,3 MM - MONTAGEM. AF_06/2017","KG",66.599999999999994,1,66.599999999999994,null,null,0,0,"Referência: AGETOP - 52003"]
["S",3,"S",0,7,4,1,0,0,0,0,"","Serviço","Serviço","-","SINAPI",94964,"CONCRETO FCK = 20MPA, TRAÇO 1:2,7:3 (CIMENTO/ AREIA MÉDIA/ BRITA 1)  - PREPARO MECÂNICO COM BETONEIRA 400 L. AF_07/2016","M3",10.89,1,10.89,null,null,0,0,""]
["S",3,"S",0,7,4,1,0,0,0,0,"","Serviço","Serviço","-","SINAPI",92874,"LANÇAMENTO COM USO DE BOMBA, ADENSAMENTO E ACABAMENTO DE CONCRETO EM ESTRUTURAS. AF_12/2015","M3",10.89,1,10.89,null,null,0,0,""]
[2,2,2,10,7,5,0,0,0,83,10,"","Nível 2","Nível 2","-","AGETOP",null,"ESTRUTURA","-",null,1,"-",null,null,0,0,""]
["S",2,"S",0,7,5,0,0,0,0,0,"","Serviço","Serviço","-","AGETOP",60487,"CORPO DE PROVA","Un    ",6,1,6,null,null,0,0,""]
["S",2,"S",0,7,5,0,0,0,0,0,"","Serviço","Serviço","-","SINAPI",92415,"MONTAGEM E DESMONTAGEM DE FÔRMA DE PILARES RETANGULARES E ESTRUTURAS SIMILARES COM ÁREA MÉDIA DAS SEÇÕES MAIOR QUE 0,25 M², PÉ-DIREITO SIMPLES, EM CHAPA DE MADEIRA COMPENSADA RESINADA, 2 UTILIZAÇÕES. AF_12/2015","M2",153.25,1,153.25,null,null,0,0,""]
["S",2,"S",0,7,5,0,0,0,0,0,"","Serviço","Serviço","-","SINAPI",92775,"ARMAÇÃO DE PILAR OU VIGA DE UMA ESTRUTURA CONVENCIONAL DE CONCRETO ARMADO EM UMA EDIFICAÇÃO TÉRREA OU SOBRADO UTILIZANDO AÇO CA-60 DE 5,0 MM - MONTAGEM. AF_12/2015","KG",199.8,1,199.8,null,null,0,0,"Referência: AGETOP - 60314"]
["S",2,"S",0,7,5,0,0,0,0,0,"","Serviço","Serviço","-","SINAPI",92777,"ARMAÇÃO DE PILAR OU VIGA DE UMA ESTRUTURA CONVENCIONAL DE CONCRETO ARMADO EM UMA EDIFICAÇÃO TÉRREA OU SOBRADO UTILIZANDO AÇO CA-50 DE 8,0 MM - MONTAGEM. AF_12/2015","KG",192.6,1,192.6,null,null,0,0,"Referência: AGETOP - 60304"]
["S",2,"S",0,7,5,0,0,0,0,0,"","Serviço","Serviço","-","SINAPI",92778,"ARMAÇÃO DE PILAR OU VIGA DE UMA ESTRUTURA CONVENCIONAL DE CONCRETO ARMADO EM UMA EDIFICAÇÃO TÉRREA OU SOBRADO UTILIZANDO AÇO CA-50 DE 10,0 MM - MONTAGEM. AF_12/2015","KG",320.39999999999998,1,320.39999999999998,null,null,0,0,"Referência: AGETOP - 60305"]
["S",2,"S",0,7,5,0,0,0,0,0,"","Serviço","Serviço","-","SINAPI",92779,"ARMAÇÃO DE PILAR OU VIGA DE UMA ESTRUTURA CONVENCIONAL DE CONCRETO ARMADO EM UMA EDIFICAÇÃO TÉRREA OU SOBRADO UTILIZANDO AÇO CA-50 DE 12,5 MM - MONTAGEM. AF_12/2015","KG",18.899999999999999,1,18.899999999999999,null,null,0,0,""]
["S",2,"S",0,7,5,0,0,0,0,0,"","Serviço","Serviço","-","SINAPI",94964,"CONCRETO FCK = 20MPA, TRAÇO 1:2,7:3 (CIMENTO/ AREIA MÉDIA/ BRITA 1)  - PREPARO MECÂNICO COM BETONEIRA 400 L. AF_07/2016","M3",8.35,1,8.35,null,null,0,0,""]
["S",2,"S",0,7,5,0,0,0,0,0,"","Serviço","Serviço","-","SINAPI",92874,"LANÇAMENTO COM USO DE BOMBA, ADENSAMENTO E ACABAMENTO DE CONCRETO EM ESTRUTURAS. AF_12/2015","M3",8.35,1,8.35,null,null,0,0,""]
["S",2,"S",0,7,5,0,0,0,0,0,"","Serviço","Serviço","-","SINAPI","74202/1","LAJE PRE-MOLDADA P/FORRO, SOBRECARGA 100KG/M2, VAOS ATE 3,50M/E=8CM, C/LAJOTAS E CAP.C/CONC FCK=20MPA, 3CM, INTER-EIXO 38CM, C/ESCORAMENTO (REAPR.3X) E FERRAGEM NEGATIVA","M2",133.38,1,133.38,null,null,0,0,""]
[2,2,2,33,7,6,0,0,0,73,33,"","Nível 2","Nível 2","-",null,null,"INSTALAÇÕES ELÉTRICAS","-",null,1,"-",null,null,0,0,""]
["S",2,"S",0,7,6,0,0,0,0,0,"","Serviço","Serviço","-","AGETOP",70351,"BRACADEIRA METALICA TIPO \"U\" DIAM. 3/4\"","Un    ",45,1,45,null,null,0,0,""]
["S",2,"S",0,7,6,0,0,0,0,0,"","Serviço","Serviço","-","AGETOP",70352,"BRACADEIRA METALICA TIPO \"U\" DIAM. 1\"","Un    ",15,1,15,null,null,0,0,""]
["S",2,"S",0,7,6,0,0,0,0,0,"","Serviço","Serviço","-","AGETOP",70353,"BRACADEIRA METALICA TIPO \"U\" DIAM. 1.1/4\"","Un    ",3,1,3,null,null,0,0,""]
["S",2,"S",0,7,6,0,0,0,0,0,"","Serviço","Serviço","-","AGETOP",70391,"BUCHA DE NYLON S-6","Un    ",300,1,300,null,null,0,0,""]
["S",2,"S",0,7,6,0,0,0,0,0,"","Serviço","Serviço","-","AGETOP",70421,"BUCHA E ARRUELA METALICA DIAM. 3/4\"","PR    ",45,1,45,null,null,0,0,""]
["S",2,"S",0,7,6,0,0,0,{"$f":"IF(OR($C822=\"S\",$C822=0),0,MATCH(0,OFFSET($D822,1,$C822,ROW($C$923)-ROW($C822)),0))","v":0},{"$f":"IF(OR($C822=\"S\",$C822=0),0,MATCH(OFFSET($D822,0,$C822)+1,OFFSET($D822,1,$C822,ROW($C$923)-ROW($C822)),0))","v":0},"","Serviço","Serviço","-","AGETOP",70422,"BUCHA E ARRUELA METALICA DIAM. 1\"","PR    ",15,1,15,null,null,0,0,""]
["S",2,"S",0,7,6,0,0,0,0,0,"","Serviço","Serviço","-","AGETOP",70423,"BUCHA E ARRUELA METALICA DIAM. 1.1/4\"","PR    ",3,1,3,null,null,0,0,""]
["S",2,"S",0,7,6,0,0,0,0,0,"","Serviço","Serviço","-","SINAPI",91927,"CABO DE COBRE FLEXÍVEL ISOLADO, 2,5 MM², ANTI-CHAMA 0,6/1,0 KV, PARA CIRCUITOS TERMINAIS - FORNECIMENTO E INSTALAÇÃO. AF_12/2015","M",900,1,900,null,null,0,0,"Referência: AGETOP - 70581"]
["S",2,"S",0,7,6,0,0,0,0,0,"","Serviço","Serviço","-","SINAPI",91928,"CABO DE COBRE FLEXÍVEL ISOLADO, 4 MM², ANTI-CHAMA 450/750 V, PARA CIRCUITOS TERMINAIS - FORNECIMENTO E INSTALAÇÃO. AF_12/2015","M",500,1,500,null,null,0,0,"Referência: AGETOP - 70564"]
["S",2,"S",0,7,6,0,0,0,0,0,"","Serviço","Serviço","-","SINAPI",83446,"CAIXA DE PASSAGEM 30X30X40 COM TAMPA E DRENO BRITA","UN",1,1,1,null,null,0,0,""]
["S",2,"S",0,7,6,0,0,0,0,0,"","Serviço","Serviço","-","SINAPI",91936,"CAIXA OCTOGONAL 4\" X 4\", PVC, INSTALADA EM LAJE - FORNECIMENTO E INSTALAÇÃO. AF_12/2015","UN",15,1,15,null,null,0,0,""]
["S",2,"S",0,7,6,0,0,0,0,0,"","Serviço","Serviço","-","SINAPI",92867,"CAIXA RETANGULAR 4\" X 2\" ALTA (2,00 M DO PISO), METÁLICA, INSTALADA EM PAREDE - FORNECIMENTO E INSTALAÇÃO. AF_12/2015","UN",6,1,6,null,null,0,0,""]
["S",2,"S",0,7,6,0,0,0,0,0,"","Serviço","Serviço","-","SINAPI",92867,"CAIXA RETANGULAR 4\" X 2\" ALTA (2,00 M DO PISO), METÁLICA, INSTALADA EM PAREDE - FORNECIMENTO E INSTALAÇÃO. AF_12/2015","UN",4,1,4,null,null,0,0,""]
["S",2,"S",0,7,6,0,0,0,0,0,"","Serviço","Serviço","-","SINAPI",92869,"CAIXA RETANGULAR 4\" X 2\" BAIXA (0,30 M DO PISO), METÁLICA, INSTALADA EM PAREDE - FORNECIMENTO E INSTALAÇÃO. AF_12/2015","UN",9,1,9,null,null,0,0,""]
["S",2,"S",0,7,6,0,0,0,0,0,"","Serviço","Serviço","-","SINAPI",91914,"CURVA 90 GRAUS PARA ELETRODUTO, PVC, ROSCÁVEL, DN 25 MM (3/4\"), PARA CIRCUITOS TERMINAIS, INSTALADA EM PAREDE - FORNECIMENTO E INSTALAÇÃO. AF_12/2015","UN",6,1,6,null,null,0,0,""]
["S",2,"S",0,7,6,0,0,0,0,0,"","Serviço","Serviço","-","SINAPI",93655,"DISJUNTOR MONOPOLAR TIPO DIN, CORRENTE NOMINAL DE 20A - FORNECIMENTO E INSTALAÇÃO. AF_04/2016","UN",2,1,2,null,null,0,0,""]
["S",2,"S",0,7,6,0,0,0,0,0,"","Serviço","Serviço","-","SINAPI",93656,"DISJUNTOR MONOPOLAR TIPO DIN, CORRENTE NOMINAL DE 25A - FORNECIMENTO E INSTALAÇÃO. AF_04/2016","UN",6,1,6,null,null,0,0,""]
["S",2,"S",0,7,6,0,0,0,0,0,"","Serviço","Serviço","-","SINAPI",93671,"DISJUNTOR TRIPOLAR TIPO DIN, CORRENTE NOMINAL DE 32A - FORNECIMENTO E INSTALAÇÃO. AF_04/2016","UN",1,1,1,null,null,0,0,"Referência: AGETOP - 71173"]
["S",2,"S",0,7,6,0,0,0,0,0,"","Serviço","Serviço","-","SINAPI",91871,"ELETRODUTO RÍGIDO ROSCÁVEL, PVC, DN 25 MM (3/4\"), PARA CIRCUITOS TERMINAIS, INSTALADO EM PAREDE - FORNECIMENTO E INSTALAÇÃO. AF_12/2015","M",135,1,135,null,null,0,0,"Referência: AGETOP - 71201"]
["S",2,"S",0,7,6,0,0,0,0,0,"","Serviço","Serviço","-","SINAPI",91872,"ELETRODUTO RÍGIDO ROSCÁVEL, PVC, DN 32 MM (1\"), PARA CIRCUITOS TERMINAIS, INSTALADO EM PAREDE - FORNECIMENTO E INSTALAÇÃO. AF_12/2015","M",45,1,45,null,null,0,0,"Referência: AGETOP - 71202"]
["S",2,"S",0,7,6,0,0,0,0,0,"","Serviço","Serviço","-","SINAPI",91873,"ELETRODUTO RÍGIDO ROSCÁVEL, PVC, DN 40 MM (1 1/4\"), PARA CIRCUITOS TERMINAIS, INSTALADO EM PAREDE - FORNECIMENTO E INSTALAÇÃO. AF_12/2015","M",9,1,9,null,null,0,0,""]
["S",2,"S",0,7,6,0,0,0,0,0,"","Serviço","Serviço","-","SINAPI",91953,"INTERRUPTOR SIMPLES (1 MÓDULO), 10A/250V, INCLUINDO SUPORTE E PLACA - FORNECIMENTO E INSTALAÇÃO. AF_12/2015","UN",4,1,4,null,null,0,0,"Referência: AGETOP - 71440"]
["S",2,"S",0,7,6,0,0,0,0,0,"","Serviço","Serviço","-","SINAPI",97610,"LÂMPADA COMPACTA DE LED 10 W, BASE E27 - FORNECIMENTO E INSTALAÇÃO. AF_11/2017","UN",45,1,45,null,null,0,0,""]
["S",2,"S",0,7,6,0,0,0,0,0,"","Serviço","Serviço","-","SINAPI",97591,"LUMINÁRIA TIPO PLAFON REDONDO COM VIDRO FOSCO, DE SOBREPOR, COM 2 LÂMPADAS DE 15 W - FORNECIMENTO E INSTALAÇÃO. AF_11/2017","UN",18,1,18,null,null,0,0,""]
["S",2,"S",0,7,6,0,0,0,0,0,"","Serviço","Serviço","-","SINAPI",97593,"LUMINÁRIA TIPO SPOT, DE SOBREPOR, COM 1 LÂMPADA DE 15 W - FORNECIMENTO E INSTALAÇÃO. AF_11/2017","UN",9,1,9,null,null,0,0,"Referência: AGETOP - 71688"]
["S",2,"S",0,7,6,0,0,0,0,0,"","Serviço","Serviço","-","SINAPI",91884,"LUVA PARA ELETRODUTO, PVC, ROSCÁVEL, DN 25 MM (3/4\"), PARA CIRCUITOS TERMINAIS, INSTALADA EM PAREDE - FORNECIMENTO E INSTALAÇÃO. AF_12/2015","UN",45,1,45,null,null,0,0,"Referência: AGETOP - 71741"]
["S",2,"S",0,7,6,0,0,0,0,0,"","Serviço","Serviço","-","SINAPI",91885,"LUVA PARA ELETRODUTO, PVC, ROSCÁVEL, DN 32 MM (1\"), PARA CIRCUITOS TERMINAIS, INSTALADA EM PAREDE - FORNECIMENTO E INSTALAÇÃO. AF_12/2015","UN",15,1,15,null,null,0,0,"Referência: AGETOP - 71742"]
["S",2,"S",0,7,6,0,0,0,0,0,"","Serviço","Serviço","-","SINAPI",91886,"LUVA PARA ELETRODUTO, PVC, ROSCÁVEL, DN 40 MM (1 1/4\"), PARA CIRCUITOS TERMINAIS, INSTALADA EM PAREDE - FORNECIMENTO E INSTALAÇÃO. AF_12/2015","UN",3,1,3,null,null,0,0,""]
["S",2,"S",0,7,6,0,0,0,0,0,"","Serviço","Serviço","-","AGETOP",71861,"PARAFUSO P/BUCHA S-6","Un    ",200,1,200,null,null,0,0,""]
["S",2,"S",0,7,6,0,0,0,0,0,"","Serviço","Serviço","-","SINAPI",83463,"QUADRO DE DISTRIBUICAO DE ENERGIA EM CHAPA DE ACO GALVANIZADO, PARA 12 DISJUNTORES TERMOMAGNETICOS MONOPOLARES, COM BARRAMENTO TRIFASICO E NEUTRO - FORNECIMENTO E INSTALACAO","UN",1,1,1,null,null,0,0,""]
["S",2,"S",0,7,6,0,0,0,0,0,"","Serviço","Serviço","-","SINAPI",91998,"TOMADA BAIXA DE EMBUTIR (1 MÓDULO), 2P+T 10 A, SEM SUPORTE E SEM PLACA - FORNECIMENTO E INSTALAÇÃO. AF_12/2015","UN",9,1,9,null,null,0,0,""]
["S",2,"S",0,7,6,0,0,0,0,0,"","Serviço","Serviço","-","SINAPI",91991,"TOMADA ALTA DE EMBUTIR (1 MÓDULO), 2P+T 20 A, SEM SUPORTE E SEM PLACA - FORNECIMENTO E INSTALAÇÃO. AF_12/2015","UN",6,1,6,null,null,0,0,""]
[2,2,2,3,7,7,0,0,0,40,3,"","Nível 2","Nível 2","-",null,null,"ALVENARIAS E DIVISÓRIAS","-",null,1,"-",null,null,0,0,""]
["S",2,"S",0,7,7,0,0,0,0,0,"","Serviço","Serviço","-","SINAPI",87519,"ALVENARIA DE VEDAÇÃO DE BLOCOS CERÂMICOS FURADOS NA HORIZONTAL DE 9X19X19CM (ESPESSURA 9CM) DE PAREDES COM ÁREA LÍQUIDA MAIOR OU IGUAL A 6M² COM VÃOS E ARGAMASSA DE ASSENTAMENTO COM PREPARO EM BETONEIRA. AF_06/2014","M2",165.72,1,165.72,null,null,0,0,"Referência: AGETOP - 100201"]
["S",2,"S",0,7,7,0,0,0,0,0,"","Serviço","Serviço","-","SINAPI",72132,"ALVENARIA EM TIJOLO CERAMICO MACICO 5X10X20CM 1/2 VEZ (ESPESSURA 10CM), ASSENTADO COM ARGAMASSA TRACO 1:2:8 (CIMENTO, CAL E AREIA)","M2",7,1,7,null,null,0,0,"Referência: AGETOP - 100102"]
[2,2,2,2,7,8,0,0,0,37,2,"","Nível 2","Nível 2","-",null,null,"IMPERMEABILIZAÇÃO","-",null,1,"-",null,null,0,0,""]
["S",2,"S",0,7,8,0,0,0,0,0,"","Serviço","Serviço","-","SINAPI",98562,"IMPERMEABILIZAÇÃO DE FLOREIRA OU VIGA BALDRAME COM ARGAMASSA DE CIMENTO E AREIA, COM ADITIVO IMPERMEABILIZANTE, E = 2 CM. AF_06/2018","M2",67.84,1,67.84,null,null,0,0,"Referência: AGETOP - 120902"]
[2,2,2,2,7,9,0,0,0,35,2,"","Nível 2","Nível 2","-",null,null,"ESTRUTURAS METÁLICAS","-",null,1,"-",null,null,0,0,""]
["S",2,"S",0,7,9,0,0,0,0,0,"","Serviço","Serviço","-","AGETOP",150103,"ESTRUTURA METÁLICA CONVENCIONAL EM AÇO DO TIPO USI SAC-300 COM FUNDO ANTICORROSIVO","Kg    ",2707.22,1,2707.22,null,null,0,0,""]
[2,2,2,5,7,10,0,0,0,33,5,"","Nível 2","Nível 2","-",null,null,"COBERTURAS","-",null,1,"-",null,null,0,0,""]
[3,3,3,4,7,10,1,0,0,4,{"$error":"#N/A"},"","Nível 3","Nível 3","-",null,null,"CERÂMICA","-",null,1,"-",null,null,0,0,""]
["S",3,"S",0,7,10,1,0,0,0,0,"","Serviço","Serviço","-","SINAPI",94445,"TELHAMENTO COM TELHA CERÂMICA CAPA-CANAL, TIPO PLAN, COM ATÉ 2 ÁGUAS, INCLUSO TRANSPORTE VERTICAL. AF_07/2019","M2",205.67,1,205.67,null,null,0,0,"Referência: AGETOP - 160401"]
["S",3,"S",0,7,10,1,0,0,0,0,"","Serviço","Serviço","-","SINAPI",94221,"CUMEEIRA PARA TELHA CERÂMICA EMBOÇADA COM ARGAMASSA TRAÇO 1:2:9 (CIMENTO, CAL E AREIA) PARA TELHADOS COM ATÉ 2 ÁGUAS, INCLUSO TRANSPORTE VERTICAL. AF_07/2019","M",21.65,1,21.65,null,null,0,0,""]
["S",3,"S",0,7,10,1,0,0,0,0,"","Serviço","Serviço","-","SINAPI",94224,"EMBOÇAMENTO COM ARGAMASSA TRAÇO 1:2:9 (CIMENTO, CAL E AREIA). AF_07/2019","M",19.8,1,19.8,null,null,0,0,"Referência: AGETOP - 160403"]
[2,2,2,4,7,11,0,0,0,28,4,"","Nível 2","Nível 2","-",null,null,"ESQUADRIAS METÁLICAS","-",null,1,"-",null,null,0,0,""]
["S",2,"S",0,7,11,0,0,0,0,0,"","Serviço","Serviço","-","SINAPI",94562,"JANELA DE AÇO DE CORRER, 4 FOLHAS, FIXAÇÃO COM ARGAMASSA, SEM VIDROS, PADRONIZADA. AF_07/2016","M2",14.4,1,14.4,null,null,0,0,"Referência: AGETOP - 180401"]
["S",2,"S",0,7,11,0,0,0,0,0,"","Serviço","Serviço","-","SINAPI",94559,"JANELA DE AÇO BASCULANTE, FIXAÇÃO COM ARGAMASSA, SEM VIDROS, PADRONIZADA. AF_07/2016","M2",7.2,1,7.2,null,null,0,0,"Referência: AGETOP - 180404"]
["S",2,"S",0,7,11,0,0,0,0,0,"","Serviço","Serviço","-","SINAPI","73933/4","PORTA DE FERRO DE ABRIR TIPO BARRA CHATA, COM REQUADRO E GUARNICAO COMPLETA","M2",5.04,1,5.04,null,null,0,0,"Referência: AGETOP - 180501"]
[2,2,2,2,7,12,0,0,0,24,2,"","Nível 2","Nível 2","-",null,null,"VIDROS","-",null,1,"-",null,null,0,0,""]
["S",2,"S",0,7,12,0,0,0,0,0,"","Serviço","Serviço","-","SINAPI",72117,"VIDRO LISO COMUM TRANSPARENTE, ESPESSURA 4MM","M2",21.6,1,21.6,null,null,0,0,"Referência: AGETOP - 190102"]
[2,2,2,4,7,13,0,0,0,22,4,"","Nível 2","Nível 2","-",null,null,"REVESTIMENTO DE PAREDE","-",null,1,"-",null,null,0,0,""]
["S",2,"S",0,7,13,0,0,0,0,0,"","Serviço","Serviço","-","SINAPI",87904,"CHAPISCO APLICADO EM ALVENARIA (COM PRESENÇA DE VÃOS) E ESTRUTURAS DE CONCRETO DE FACHADA, COM COLHER DE PEDREIRO.  ARGAMASSA TRAÇO 1:3 COM PREPARO MANUAL. AF_06/2014","M2",331.44,1,331.44,null,null,0,0,"Referência: AGETOP - 200101"]
["S",2,"S",0,7,13,0,0,0,0,0,"","Serviço","Serviço","-","SINAPI",87548,"MASSA ÚNICA, PARA RECEBIMENTO DE PINTURA, EM ARGAMASSA TRAÇO 1:2:8, PREPARO MANUAL, APLICADA MANUALMENTE EM FACES INTERNAS DE PAREDES, ESPESSURA DE 10MM, COM EXECUÇÃO DE TALISCAS. AF_06/2014","M2",331.44,1,331.44,null,null,0,0,"Referência: AGETOP - 200500"]
["S",2,"S",0,7,13,0,0,0,0,0,"","Serviço","Serviço","-","SINAPI",84088,"PEITORIL EM MARMORE BRANCO, LARGURA DE 15CM, ASSENTADO COM ARGAMASSA TRACO 1:4 (CIMENTO E AREIA MEDIA), PREPARO MANUAL DA ARGAMASSA","M",24,1,24,null,null,0,0,""]
[2,2,2,2,7,14,0,0,0,18,2,"","Nível 2","Nível 2","-",null,null,"FORROS","-",null,1,"-",null,null,0,0,""]
["S",2,"S",0,7,14,0,0,0,0,0,"","Serviço","Serviço","-","SINAPI",87414,"APLICAÇÃO MANUAL DE GESSO DESEMPENADO (SEM TALISCAS) EM TETO DE AMBIENTES DE ÁREA MAIOR QUE 10M², ESPESSURA DE 1,0CM. AF_06/2014","M2",124,1,124,null,null,0,0,"Referência: AGETOP - 210515"]
[2,2,2,5,7,15,0,0,0,16,5,"","Nível 2","Nível 2","-",null,null,"REVESTIMENTO DE PISO","-",null,1,"-",null,null,0,0,""]
["S",2,"S",0,7,15,0,0,0,0,0,"","Serviço","Serviço","-","SINAPI",94992,"EXECUÇÃO DE PASSEIO (CALÇADA) OU PISO DE CONCRETO COM CONCRETO MOLDADO IN LOCO, FEITO EM OBRA, ACABAMENTO CONVENCIONAL, ESPESSURA 6 CM, ARMADO. AF_07/2016","M2",30,1,30,null,null,0,0,""]
["S",2,"S",0,7,15,0,0,0,0,0,"","Serviço","Serviço","-","SINAPI",84191,"PISO EM GRANILITE, MARMORITE OU GRANITINA ESPESSURA 8 MM, INCLUSO JUNTAS DE DILATACAO PLASTICAS","M2",154,1,154,null,null,0,0,"Referência: AGETOP - 221101"]
["S",2,"S",0,7,15,0,0,0,0,0,"","Serviço","Serviço","-","SINAPI","73850/1","RODAPE EM MARMORITE, ALTURA 10CM","M",90,1,90,null,null,0,0,""]
["S",2,"S",0,7,15,0,0,0,0,0,"","Serviço","Serviço","-","AGETOP",221104,"RASPAGEM E APLICAÇÃO RESINA ACRÍLICA DUAS DEMÃOS","m2    ",160.30000000000001,1,160.30000000000001,null,null,0,0,""]
[2,2,2,8,7,16,0,0,0,11,8,"","Nível 2","Nível 2","-",null,null,"PINTURA","-",null,1,"-",null,null,0,0,""]
["S",2,"S",0,7,16,0,0,0,0,0,"","Serviço","Serviço","-","SINAPI","74145/1","PINTURA ESMALTE FOSCO, DUAS DEMAOS, SOBRE SUPERFICIE METALICA, INCLUSO UMA DEMAO DE FUNDO ANTICORROSIVO. UTILIZACAO DE REVOLVER ( AR-COMPRIMIDO).","M2",205.67,1,205.67,null,null,0,0,"Referência: AGETOP - 261602"]
["S",2,"S",0,7,16,0,0,0,0,0,"","Serviço","Serviço","-","SINAPI",88423,"APLICAÇÃO MANUAL DE PINTURA COM TINTA TEXTURIZADA ACRÍLICA EM PAREDES EXTERNAS DE CASAS, UMA COR. AF_06/2014","M2",89.3,1,89.3,null,null,0,0,"Referência: AGETOP - 260601"]
["S",2,"S",0,7,16,0,0,0,0,0,"","Serviço","Serviço","-","SINAPI",88489,"APLICAÇÃO MANUAL DE PINTURA COM TINTA LÁTEX ACRÍLICA EM PAREDES, DUAS DEMÃOS. AF_06/2014","M2",150.41,1,150.41,null,null,0,0,"Referência: AGETOP - 261001"]
["S",2,"S",0,7,16,0,0,0,0,0,"","Serviço","Serviço","-","SINAPI",96135,"APLICAÇÃO MANUAL DE MASSA ACRÍLICA EM PAREDES EXTERNAS DE CASAS, DUAS DEMÃOS. AF_05/2017","M2",242.14,1,242.14,null,null,0,0,""]
["S",2,"S",0,7,16,0,0,0,0,0,"","Serviço","Serviço","-","AGETOP",261550,"PINT.ESMALTE SINT.PAREDES - 2 DEM.C/SELADOR","m2    ",91.73,1,91.73,null,null,0,0,""]
["S",2,"S",0,7,16,0,0,0,0,0,"","Serviço","Serviço","-","SINAPI","74145/1","PINTURA ESMALTE FOSCO, DUAS DEMAOS, SOBRE SUPERFICIE METALICA, INCLUSO UMA DEMAO DE FUNDO ANTICORROSIVO. UTILIZACAO DE REVOLVER ( AR-COMPRIMIDO).","M2",55.8,1,55.8,null,null,0,0,"Referência: AGETOP - 261602"]
["S",2,"S",0,7,16,0,0,0,0,0,"","Serviço","Serviço","-","AGETOP",261623,"LETREIRO PEQ.PORTE A PINCEL EM PAREDE E PORTAS","m2    ",0.95,1,0.95,null,null,0,0,""]
[2,2,2,3,7,17,0,0,0,{"$f":"IF(OR($C886=\"S\",$C886=0),0,MATCH(0,OFFSET($D886,1,$C886,ROW($C$923)-ROW($C886)),0))","v":3},{"$f":"IF(OR($C886=\"S\",$C886=0),0,MATCH(OFFSET($D886,0,$C886)+1,OFFSET($D886,1,$C886,ROW($C$923)-ROW($C886)),0))","v":{"$error":"#N/A"}},"","Nível 2","Nível 2","-",null,null,"DIVERSOS","-",null,1,"-",null,null,0,0,""]
["S",2,"S",0,7,17,0,0,0,0,0,"","Serviço","Serviço","-","AGETOP",271210,"QUADRO DE GIZ EMBOÇO/PINTURA COMPLETO","m2    ",15.12,1,15.12,null,null,0,0,""]
["S",2,"S",0,7,17,0,0,0,0,0,"","Serviço","Serviço","-","AGETOP",270501,"LIMPEZA FINAL DE OBRA - (OBRAS CIVIS)","m2    ",164.02,1,164.02,null,null,0,0,""]
[1,1,1,34,8,0,0,0,0,34,{"$error":"#N/A"},"F","Nível 1","Nível 1","8.","SINAPI",null,"PASSARELA MODELO 02 - PADRÃO XXI 2015","UN",3,3,3,null,null,0,0,""]
[2,2,2,2,8,1,0,0,0,33,2,"","Nível 2","Nível 2","-","SINAPI",null,"SERVIÇOS PRELIMINARES","-",null,3,"-",null,null,0,0,""]
["S",2,"S",0,8,1,0,0,0,0,0,"","Serviço","Serviço","-","AGETOP",20701,"LOCAÇÃO DA OBRA, EXECUÇÃO DE GABARITO SEM REAPROVEITAMENTO, INCLUSO PINTURA (FACE INTERNA DO RIPÃO 15CM) E PIQUETE COM TESTEMUNHA","m2    ",20.16,3,60.480000000000004,null,null,0,0,""]
[2,2,2,3,8,2,0,0,0,31,3,"","Nível 2","Nível 2","-","AGETOP",null,"TRANSPORTES","-",null,3,"-",null,null,0,0,""]
["S",2,"S",0,8,2,0,0,0,0,0,"","Serviço","Serviço","-","SINAPI",72900,"TRANSPORTE DE ENTULHO COM CAMINHAO BASCULANTE 6 M3, RODOVIA PAVIMENTADA, DMT 0,5 A 1,0 KM","M3",6,3,18,null,null,0,0,""]
["S",2,"S",0,8,2,0,0,0,0,0,"","Serviço","Serviço","-","SINAPI",72897,"CARGA MANUAL DE ENTULHO EM CAMINHAO BASCULANTE 6 M3","M3",6,3,18,null,null,0,0,""]
[2,2,2,9,8,3,0,0,0,28,9,"","Nível 2","Nível 2","-","AGETOP",null,"FUNDAÇÕES E SONDAGENS","-",null,3,"-",null,null,0,0,""]
["S",2,"S",0,8,3,0,0,0,0,0,"","Serviço","Serviço","-","SINAPI",96534,"FABRICAÇÃO, MONTAGEM E DESMONTAGEM DE FÔRMA PARA BLOCO DE COROAMENTO, EM MADEIRA SERRADA, E=25 MM, 4 UTILIZAÇÕES. AF_06/2017","M2",5.28,3,15.84,null,null,0,0,"Referência: AGETOP - 51009"]
["S",2,"S",0,8,3,0,0,0,0,0,"","Serviço","Serviço","-","SINAPI",96523,"ESCAVAÇÃO MANUAL PARA BLOCO DE COROAMENTO OU SAPATA, COM PREVISÃO DE FÔRMA. AF_06/2017","M3",1.0289999999999999,3,3.0869999999999997,null,null,0,0,"Referência: AGETOP - 50901"]
["S",2,"S",0,8,3,0,0,0,0,0,"","Serviço","Serviço","-","AGETOP",50902,"APILOAMENTO (BLOCOS/SAPATAS)","m2    ",1,3,3,null,null,0,0,""]
["S",2,"S",0,8,3,0,0,0,0,0,"","Serviço","Serviço","-","SINAPI",96995,"REATERRO MANUAL APILOADO COM SOQUETE. AF_10/2017","M3",0.44899999999999995,3,1.347,null,null,0,0,"Referência: AGETOP - 40902"]
["S",2,"S",0,8,3,0,0,0,0,0,"","Serviço","Serviço","-","SINAPI",94964,"CONCRETO FCK = 20MPA, TRAÇO 1:2,7:3 (CIMENTO/ AREIA MÉDIA/ BRITA 1)  - PREPARO MECÂNICO COM BETONEIRA 400 L. AF_07/2016","M3",0.57999999999999996,3,1.7399999999999998,null,null,0,0,""]
["S",2,"S",0,8,3,0,0,0,0,0,"","Serviço","Serviço","-","SINAPI","74157/4","LANCAMENTO/APLICACAO MANUAL DE CONCRETO EM FUNDACOES","M3",0.57999999999999996,3,1.7399999999999998,null,null,0,0,"Referência: AGETOP - 51026"]
["S",2,"S",0,8,3,0,0,0,0,0,"","Serviço","Serviço","-","SINAPI",96547,"ARMAÇÃO DE BLOCO, VIGA BALDRAME OU SAPATA UTILIZANDO AÇO CA-50 DE 12,5 MM - MONTAGEM. AF_06/2017","KG",13.18181818181818,3,39.54545454545454,null,null,0,0,""]
["S",2,"S",0,8,3,0,0,0,0,0,"","Serviço","Serviço","-","SINAPI",96543,"ARMAÇÃO DE BLOCO, VIGA BALDRAME E SAPATA UTILIZANDO AÇO CA-60 DE 5 MM - MONTAGEM. AF_06/2017","KG",8.7272727272727266,3,26.18181818181818,null,null,0,0,"Referência: AGETOP - 52014"]
[2,2,2,6,8,4,0,0,0,19,6,"","Nível 2","Nível 2","-","AGETOP",null,"ESTRUTURA","-",null,3,"-",null,null,0,0,""]
["S",2,"S",0,8,4,0,0,0,0,0,"","Serviço","Serviço","-","SINAPI",92426,"MONTAGEM E DESMONTAGEM DE FÔRMA DE PILARES RETANGULARES E ESTRUTURAS SIMILARES COM ÁREA MÉDIA DAS SEÇÕES MENOR OU IGUAL A 0,25 M², PÉ-DIREITO SIMPLES, EM CHAPA DE MADEIRA COMPENSADA RESINADA, 8 UTILIZAÇÕES. AF_12/2015","M2",1.29,3,3.87,null,null,0,0,""]
["S",2,"S",0,8,4,0,0,0,0,0,"","Serviço","Serviço","-","SINAPI",94964,"CONCRETO FCK = 20MPA, TRAÇO 1:2,7:3 (CIMENTO/ AREIA MÉDIA/ BRITA 1)  - PREPARO MECÂNICO COM BETONEIRA 400 L. AF_07/2016","M3",0.11,3,0.33,null,null,0,0,""]
["S",2,"S",0,8,4,0,0,0,0,0,"","Serviço","Serviço","-","SINAPI",92873,"LANÇAMENTO COM USO DE BALDES, ADENSAMENTO E ACABAMENTO DE CONCRETO EM ESTRUTURAS. AF_12/2015","M3",0.11,3,0.33,null,null,0,0,"Referência: AGETOP - 60801"]
["S",2,"S",0,8,4,0,0,0,0,0,"","Serviço","Serviço","-","SINAPI",92779,"ARMAÇÃO DE PILAR OU VIGA DE UMA ESTRUTURA CONVENCIONAL DE CONCRETO ARMADO EM UMA EDIFICAÇÃO TÉRREA OU SOBRADO UTILIZANDO AÇO CA-50 DE 12,5 MM - MONTAGEM. AF_12/2015","KG",2.8181818181818179,3,8.4545454545454533,null,null,0,0,""]
["S",2,"S",0,8,4,0,0,0,0,0,"","Serviço","Serviço","-","SINAPI",92775,"ARMAÇÃO DE PILAR OU VIGA DE UMA ESTRUTURA CONVENCIONAL DE CONCRETO ARMADO EM UMA EDIFICAÇÃO TÉRREA OU SOBRADO UTILIZANDO AÇO CA-60 DE 5,0 MM - MONTAGEM. AF_12/2015","KG",1.4545454545454546,3,4.3636363636363633,null,null,0,0,"Referência: AGETOP - 60314"]
[2,2,2,2,8,5,0,0,0,13,2,"","Nível 2","Nível 2","-",null,null,"IMPERMEABILIZAÇÃO","-",null,3,"-",null,null,0,0,""]
["S",2,"S",0,8,5,0,0,0,0,0,"","Serviço","Serviço","-","SINAPI",98562,"IMPERMEABILIZAÇÃO DE FLOREIRA OU VIGA BALDRAME COM ARGAMASSA DE CIMENTO E AREIA, COM ADITIVO IMPERMEABILIZANTE, E = 2 CM. AF_06/2018","M2",3.6,3,10.8,null,null,0,0,"Referência: AGETOP - 120902"]
[2,2,2,2,8,6,0,0,0,11,2,"","Nível 2","Nível 2","-",null,null,"ESTRUTURAS METÁLICAS","-",null,3,"-",null,null,0,0,""]
["S",2,"S",0,8,6,0,0,0,0,0,"","Serviço","Serviço","-","AGETOP",150103,"ESTRUTURA METÁLICA CONVENCIONAL EM AÇO DO TIPO USI SAC-300 COM FUNDO ANTICORROSIVO","Kg    ",270.56000000000006,3,811.68000000000018,null,null,0,0,""]
[2,2,2,3,8,7,0,0,0,9,3,"","Nível 2","Nível 2","-",null,null,"COBERTURAS","-",null,3,"-",null,null,0,0,""]
["S",2,"S",0,8,7,0,0,0,0,0,"","Serviço","Serviço","-","SINAPI",94213,"TELHAMENTO COM TELHA DE AÇO/ALUMÍNIO E = 0,5 MM, COM ATÉ 2 ÁGUAS, INCLUSO IÇAMENTO. AF_07/2019","M2",25.92,3,77.760000000000005,null,null,0,0,"Referência: AGETOP - 160905"]
["S",2,"S",0,8,7,0,0,0,0,0,"","Serviço","Serviço","-","SINAPI",94228,"CALHA EM CHAPA DE AÇO GALVANIZADO NÚMERO 24, DESENVOLVIMENTO DE 50 CM, INCLUSO TRANSPORTE VERTICAL. AF_07/2019","M",7.2,3,21.6,null,null,0,0,"Referência: AGETOP - 160601"]
[2,2,2,4,8,8,0,0,0,6,4,"","Nível 2","Nível 2","-",null,null,"REVESTIMENTO DE PISO","-",null,3,"-",null,null,0,0,""]
[{"$f":"CHOOSE(1+LOG(1+2*(ORÇAMENTO.Nivel=\"Nível 1\")+4*(ORÇAMENTO.Nivel=\"Nível 2\")+8*(ORÇAMENTO.Nivel=\"Nível 3\")+16*(ORÇAMENTO.Nivel=\"Nível 4\")+32*(ORÇAMENTO.Nivel=\"Serviço\"),2),0,1,2,3,4,\"S\")","v":"S"},2,"S",0,8,8,0,0,{"$f":"IF(AND($C918<=4,$C918<>0),0,IF(AND($C918=\"S\",$Y918>0),OFFSET(I918,-1,0)+1,OFFSET(I918,-1,0)))","v":0},0,0,"","Serviço","Serviço","-","SINAPI",95241,"LASTRO DE CONCRETO MAGRO, APLICADO EM PISOS OU RADIERS, ESPESSURA DE 5 CM. AF_07/2016","M2",20.16,3,60.480000000000004,null,null,0,0,""]
["S",2,"S",0,8,8,0,0,0,0,0,"","Serviço","Serviço","-","SINAPI",84191,"PISO EM GRANILITE, MARMORITE OU GRANITINA ESPESSURA 8 MM, INCLUSO JUNTAS DE DILATACAO PLASTICAS","M2",20.16,3,60.480000000000004,null,null,0,0,"Referência: AGETOP - 221101"]
["S",2,"S",0,8,8,0,0,0,0,0,"","Serviço","Serviço","-","AGETOP",221104,"RASPAGEM E APLICAÇÃO RESINA ACRÍLICA DUAS DEMÃOS","m2    ",20.72,3,62.16,null,null,0,0,""]
[2,2,2,2,{"$f":"IF($C921=1,OFFSET(E921,-1,0)+1,OFFSET(E921,-1,0))","v":8},{"$f":"IF($C921=1,0,IF($C921=2,OFFSET(F921,-1,0)+1,OFFSET(F921,-1,0)))","v":9},{"$f":"IF(AND($C921<=2,$C921<>0),0,IF($C921=3,OFFSET(G921,-1,0)+1,OFFSET(G921,-1,0)))","v":0},{"$f":"IF(AND($C921<=3,$C921<>0),0,IF($C921=4,OFFSET(H921,-1,0)+1,OFFSET(H921,-1,0)))","v":0},0,2,{"$error":"#N/A"},"","Nível 2","Nível 2","-",null,null,"PINTURA","-",null,3,"-",null,null,0,0,""]
["S",2,"S",0,8,9,0,0,0,0,0,"","Serviço","Serviço","-","SINAPI","74145/1","PINTURA ESMALTE FOSCO, DUAS DEMAOS, SOBRE SUPERFICIE METALICA, INCLUSO UMA DEMAO DE FUNDO ANTICORROSIVO. UTILIZACAO DE REVOLVER ( AR-COMPRIMIDO).","M2",51.84,3,155.52000000000001,null,null,0,0,"Referência: AGETOP - 261602"]
[-1,null,-1,null,0,0,0,0,0,null,null,"F"]
[null,null,null,null,null,null,null,null,null,null,null,"F",null,null,null,null,null,"OBS: OS QUANTITATIVOS DE MATERIAIS  DAS INSTALAÇÕES HIDROSSANITÁRIAS, ELÉTRICAS E ESPECIAIS SÃO FORNECIDOS PELOS PROFISSIONAIS RESPONSÁVEIS PELOS RESPECTIVOS PROJETOS.",null,null,null,null,null,"VALOR TOTAL",null,0]
[null,null,null,null,null,null,null,null,null,null,null,"F",null,null,null,null,null,null,null,null,null,null,null,"VALOR BDI (20,34%)",null,0]
[null,null,null,null,null,null,null,null,null,null,null,"F",null,null,null,null,null,null,null,null,null,null,null,"TOTAL ORÇAMENTO",null,0]
[null,null,null,null,null,null,null,null,null,null,null,"F"]
[null,null,null,null,null,null,null,null,null,null,null,"F",null,null,null,null,null,null,null,null,null,null,null,"CUSTO POR M2 ³",null,0]
[null,null,null,null,null,null,null,null,null,null,null,"F",null,null,null,null,null,null,null,null,null,null,null,"MATERIAL S/ BDI",null,0]
[null,null,null,null,null,null,null,null,null,null,null,"F",null,null,null,null,null,null,null,null,null,null,null,"MÃO DE OBRA S/ BDI",null,0]
[null,null,null,null,null,null,null,null,null,null,null,"F"]
[null,null,null,null,null,null,null,null,null,null,null,"F",null,null,null,null,"(1) Conforme previsto pelo DECRETO Nº 7.983, DE 8 DE ABRIL DE 2013, os preços adotados são aqueles constantes dos sistemas de referência indicados. Justifica-se o uso dos preços destas composições de custos unitários devido ao seu valor ser menor à mediana de seus correspondentes na tabela SINAPI;"]
[null,null,null,null,null,null,null,null,null,null,null,"F",null,null,null,null,"(2) Optou-se pelo uso das composições de custos da AGETOP para itens não presentes na SINAPI;"]
[null,null,null,null,null,null,null,null,null,null,null,"F",null,null,null,null,"(3) Para itens da AGETOP, os vidros não estão inclusos nas esquadrias e já foram considerados os custos de contramarco para as esquadrias de alumínio;"]
[null,null,null,null,null,null,null,null,null,null,null,"F",null,null,null,null,"(4) Nos casos em que houver execução de granitina e omissão do item AGETOP 221102, considerou-se que o quantitativo para o rodapé, de altura igual a 7cm, foi incorporado na área de piso;"]
[null,null,null,null,null,null,null,null,null,null,null,"F",null,null,null,null,"(5) O custo unitário aproximado por metro quadrado é calculado dividindo-se o valor total do orçamento pela área total de construção."]
[null,null,null,null,null,null,null,null,null,null,null,"F"]
[null,null,null,null,null,null,null,null,null,null,null,"F"]
[]
[null,null,null,null,null,null,null,null,null,null,null,null,null,null,"SOMATÓRIO DE SERVIÇOS"]
[null,null,null,null,null,null,null,null,null,null,null,null,null,null,"ITEM","DESCRIÇÃO DOS SERVIÇOS",null,null,"PREÇO SEM BDI",null,null,null,null,"PREÇO COM BDI",null,null,"PARTICIPAÇÃO ( % )"]
[null,null,null,null,null,null,null,null,null,null,null,null,null,null,"a.","SERVIÇOS PRELIMINARES",null,null,{"$f":"SUMIF($R$19:$R$923,$P942,$Z$19:$Z$923)","v":0},null,null,null,null,{"$f":"ROUND(S942*(1+BDI.Taxa),2)","v":0},null,null,{"$f":"IFERROR(ROUND($X942*100/$Z$926,2),0)","v":0}]
[null,null,null,null,null,null,null,null,null,null,null,null,null,null,"b.","TRANSPORTES",null,null,0,null,null,null,null,0,null,null,0]
[null,null,null,null,null,null,null,null,null,null,null,null,null,null,"c.","SERVIÇO EM TERRA",null,null,0,null,null,null,null,0,null,null,0]
[null,null,null,null,null,null,null,null,null,null,null,null,null,null,"d.","FUNDAÇÕES E SONDAGENS",null,null,0,null,null,null,null,0,null,null,0]
[null,null,null,null,null,null,null,null,null,null,null,null,null,null,"e.","ESTRUTURA",null,null,0,null,null,null,null,0,null,null,0]
[null,null,null,null,null,null,null,null,null,null,null,null,null,null,"f.","INSTALAÇÕES ELÉTRICAS",null,null,0,null,null,null,null,0,null,null,0]
[null,null,null,null,null,null,null,null,null,null,null,null,null,null,"g.","INSTALAÇÕES HIDROSSANITÁRIAS",null,null,0,null,null,null,null,0,null,null,0]
[null,null,null,null,null,null,null,null,null,null,null,null,null,null,"h","INSTALAÇÕES ESPECIAIS",null,null,0,null,null,null,null,0,null,null,0]
[null,null,null,null,null,null,null,null,null,null,null,null,null,null,"i.","ALVENARIAS E DIVISÓRIAS",null,null,0,null,null,null,null,0,null,null,0]
[null,null,null,null,null,null,null,null,null,null,null,null,null,null,"j.","ALVENARIA AUTO-PORTANTE",null,null,0,null,null,null,null,0,null,null,0]
[null,null,null,null,null,null,null,null,null,null,null,null,null,null,"k.","IMPERMEABILIZAÇÃO",null,null,0,null,null,null,null,0,null,null,0]
[null,null,null,null,null,null,null,null,null,null,null,null,null,null,"l.","ISOLAMENTO TÉRMICO E ACÚSTICO",null,null,0,null,null,null,null,0,null,null,0]
[null,null,null,null,null,null,null,null,null,null,null,null,null,null,"m.","ESTRUTURA DE MADEIRA",null,null,0,null,null,null,null,0,null,null,0]
[null,null,null,null,null,null,null,null,null,null,null,null,null,null,"n.","ESTRUTURAS METÁLICAS",null,null,0,null,null,null,null,0,null,null,0]
[null,null,null,null,null,null,null,null,null,null,null,null,null,null,"o.","COBERTURAS",null,null,0,null,null,null,null,0,null,null,0]
[null,null,null,null,null,null,null,null,null,null,null,null,null,null,"p.","ESQUADRIAS DE MADEIRA",null,null,0,null,null,null,null,0,null,null,0]
[null,null,null,null,null,null,null,null,null,null,null,null,null,null,"q.","ESQUADRIAS METÁLICAS",null,null,0,null,null,null,null,{"$f":"ROUND(S958*(1+BDI.Taxa),2)","v":0},null,null,0]
[null,null,null,null,null,null,null,null,null,null,null,null,null,null,"r.","VIDROS",null,null,0,null,null,null,null,0,null,null,0]
[null,null,null,null,null,null,null,null,null,null,null,null,null,null,"s.","REVESTIMENTO DE PAREDE",null,null,0,null,null,null,null,0,null,null,0]
[null,null,null,null,null,null,null,null,null,null,null,null,null,null,"t.","FORROS",null,null,0,null,null,null,null,0,null,null,0]
[null,null,null,null,null,null,null,null,null,null,null,null,null,null,"u.","REVESTIMENTO DE PISO",null,null,0,null,null,null,null,0,null,null,0]
[null,null,null,null,null,null,null,null,null,null,null,null,null,null,"v.","FERRAGENS",null,null,0,null,null,null,null,0,null,null,0]
[null,null,null,null,null,null,null,null,null,null,null,null,null,null,"w.","MARCENARIA",null,null,0,null,null,null,null,0,null,null,0]
[null,null,null,null,null,null,null,null,null,null,null,null,null,null,"x.","ADMINISTRAÇÃO",null,null,0,null,null,null,null,0,null,null,0]
[null,null,null,null,null,null,null,null,null,null,null,null,null,null,"y.","PINTURA",null,null,0,null,null,null,null,{"$f":"ROUND(S966*(1+BDI.Taxa),2)","v":0},null,null,0]
[null,null,null,null,null,null,null,null,null,null,null,null,null,null,"z.","DIVERSOS",null,null,0,null,null,null,null,{"$f":"IF(S967>0,IF((SUM(X942:Y966)+ROUND(S967*(1+BDI.Taxa),2))<>X969,X969-SUM(X942:Y966),ROUND(S967*(1+BDI.Taxa),2)),0)","v":0},null,null,{"$f":"IF(S967>0,IF((SUM(AA942:AA966)+IFERROR(ROUND($X967*100/$Z$926,2),0))<>AA969,AA969-SUM(AA942:AA966),IFERROR(ROUND($X967*100/$Z$926,2),0)),0)","v":0}]
[null,null,null,null,null,null,null,null,null,null,null,null,null,null,"TOTAL GERAL DO ORÇAMENTO (R$)",null,null,null,{"$f":"SUM(S942:W967)","v":0},null,null,null,null,{"$f":"SUM(X942:Y967)","v":0},null,null,{"$f":"SUM(AA942:AA967)","v":0}]
[null,null,null,null,null,null,null,null,null,null,null,null,null,null,null,null,null,null,{"$f":"$Z$924","v":0},null,null,null,null,{"$f":"$Z$926","v":0},null,null,100]
[null,null,null,null,null,null,null,null,null,null,null,null,null,null,null,null,null,null,"(TOTAL SEM BDI)",null,null,null,null,"(TOTAL COM BDI)",null,null,"(ARRED porcentagem)"]
[null,null,null,null,null,null,null,null,null,null,null,null,null,null,null,null,null,null,{"$f":"IF(AND(S968=S969,S968>0),\"OK\",\"ERRO\")","v":"ERRO"},null,null,null,null,{"$f":"IF(AND(X968=X969,X968>0),\"OK\",\"ERRO\")","v":"ERRO"},null,null,{"$f":"IF(AA968=100,\"OK\",\"ERRO\")","v":"ERRO"}]
[]
[]
[null,null,null,null,null,null,null,null,null,null,null,null,null,null,"RESUMO GERAL DO ORÇAMENTO"]
[null,null,null,null,null,null,null,null,null,null,null,null,null,null,"ITEM","DESCRIÇÃO DOS SERVIÇOS",null,null,"PREÇO SEM BDI",null,null,null,null,"PREÇO COM BDI",null,null,"PARTICIPAÇÃO ( % )"]
[null,null,null,null,null,null,null,null,null,null,null,null,null,null,"1.",{"$f":"IFERROR(VLOOKUP(O976,$O$19:$Y$923,4,FALSE),\"\")","v":"REFORMA"},null,null,{"$f":"IF(P977=\"\",$S$997-SUM(OFFSET($S$975:S975,0,0,COUNTA($S$975:S975),1)),SUMIF($R$19:$R$923,$P976,$Z$19:$Z$923))","v":0},null,null,null,null,{"$f":"IF(P977=\"\",$X$997-SUM(OFFSET($X$975:X975,0,0,COUNTA($X$975:X975),1)),ROUND(S976*(1+BDI.Taxa),2))","v":0},null,null,{"$f":"IF(P977=\"\",$AA$997-SUM(OFFSET($AA$975:AA975,0,0,COUNTA($AA$975:AA975),1)),ROUND(X976*100/ORÇAMENTO.TotalOrçamento,2))","v":{"$error":"#DIV/0!"}}]
[null,null,null,null,null,null,null,null,null,null,null,null,null,null,"2.","IMPLANTAÇÃO BLOCO COZINHA 2009",null,null,{"$f":"IF(P978=\"\",$S$997-SUM(OFFSET($S$975:S976,0,0,COUNTA($S$975:S976),1)),SUMIF($R$19:$R$923,$P977,$Z$19:$Z$923))","v":0},null,null,null,null,{"$f":"IF(P978=\"\",$X$997-SUM(OFFSET($X$975:X976,0,0,COUNTA($X$975:X976),1)),ROUND(S977*(1+BDI.Taxa),2))","v":0},null,null,{"$f":"IF(P978=\"\",$AA$997-SUM(OFFSET($AA$975:AA976,0,0,COUNTA($AA$975:AA976),1)),ROUND(X977*100/ORÇAMENTO.TotalOrçamento,2))","v":{"$error":"#DIV/0!"}}]
[null,null,null,null,null,null,null,null,null,null,null,null,null,null,"3.","IMPLANTAÇÃO PATIO MULTIUSO 2",null,null,{"$f":"IF(P979=\"\",$S$997-SUM(OFFSET($S$975:S977,0,0,COUNTA($S$975:S977),1)),SUMIF($R$19:$R$923,$P978,$Z$19:$Z$923))","v":0},null,null,null,null,{"$f":"IF(P979=\"\",$X$997-SUM(OFFSET($X$975:X977,0,0,COUNTA($X$975:X977),1)),ROUND(S978*(1+BDI.Taxa),2))","v":0},null,null,{"$f":"IF(P979=\"\",$AA$997-SUM(OFFSET($AA$975:AA977,0,0,COUNTA($AA$975:AA977),1)),ROUND(X978*100/ORÇAMENTO.TotalOrçamento,2))","v":{"$error":"#DIV/0!"}}]
[null,null,null,null,null,null,null,null,null,null,null,null,null,null,"4.","IMPLANTAÇÃO 3 SALAS DE AULA - LAJE",null,null,{"$f":"IF(P980=\"\",$S$997-SUM(OFFSET($S$975:S978,0,0,COUNTA($S$975:S978),1)),SUMIF($R$19:$R$923,$P979,$Z$19:$Z$923))","v":0},null,null,null,null,{"$f":"IF(P980=\"\",$X$997-SUM(OFFSET($X$975:X978,0,0,COUNTA($X$975:X978),1)),ROUND(S979*(1+BDI.Taxa),2))","v":0},null,null,{"$f":"IF(P980=\"\",$AA$997-SUM(OFFSET($AA$975:AA978,0,0,COUNTA($AA$975:AA978),1)),ROUND(X979*100/ORÇAMENTO.TotalOrçamento,2))","v":{"$error":"#DIV/0!"}}]
[null,null,null,null,null,null,null,null,null,null,null,null,null,null,"5.","COZINHA 2009",null,null,{"$f":"IF(P981=\"\",$S$997-SUM(OFFSET($S$975:S979,0,0,COUNTA($S$975:S979),1)),SUMIF($R$19:$R$923,$P980,$Z$19:$Z$923))","v":0},null,null,null,null,{"$f":"IF(P981=\"\",$X$997-SUM(OFFSET($X$975:X979,0,0,COUNTA($X$975:X979),1)),ROUND(S980*(1+BDI.Taxa),2))","v":0},null,null,{"$f":"IF(P981=\"\",$AA$997-SUM(OFFSET($AA$975:AA979,0,0,COUNTA($AA$975:AA979),1)),ROUND(X980*100/ORÇAMENTO.TotalOrçamento,2))","v":{"$error":"#DIV/0!"}}]
[null,null,null,null,null,null,null,null,null,null,null,null,null,null,"6.","PATIO MULTIUSO 2",null,null,{"$f":"IF(P982=\"\",$S$997-SUM(OFFSET($S$975:S980,0,0,COUNTA($S$975:S980),1)),SUMIF($R$19:$R$923,$P981,$Z$19:$Z$923))","v":0},null,null,null,null,{"$f":"IF(P982=\"\",$X$997-SUM(OFFSET($X$975:X980,0,0,COUNTA($X$975:X980),1)),ROUND(S981*(1+BDI.Taxa),2))","v":0},null,null,{"$f":"IF(P982=\"\",$AA$997-SUM(OFFSET($AA$975:AA980,0,0,COUNTA($AA$975:AA980),1)),ROUND(X981*100/ORÇAMENTO.TotalOrçamento,2))","v":{"$error":"#DIV/0!"}}]
[null,null,null,null,null,null,null,null,null,null,null,null,null,null,"7.","3 SALAS PADRÃO SEDUC - LAJE",null,null,{"$f":"IF(P983=\"\",$S$997-SUM(OFFSET($S$975:S981,0,0,COUNTA($S$975:S981),1)),SUMIF($R$19:$R$923,$P982,$Z$19:$Z$923))","v":0},null,null,null,null,{"$f":"IF(P983=\"\",$X$997-SUM(OFFSET($X$975:X981,0,0,COUNTA($X$975:X981),1)),ROUND(S982*(1+BDI.Taxa),2))","v":0},null,null,{"$f":"IF(P983=\"\",$AA$997-SUM(OFFSET($AA$975:AA981,0,0,COUNTA($AA$975:AA981),1)),ROUND(X982*100/ORÇAMENTO.TotalOrçamento,2))","v":{"$error":"#DIV/0!"}}]
[null,null,null,null,null,null,null,null,null,null,null,null,null,null,"8.","PASSARELA MODELO 02 - PADRÃO XXI 2015",null,null,{"$f":"IF(P984=\"\",$S$997-SUM(OFFSET($S$975:S982,0,0,COUNTA($S$975:S982),1)),SUMIF($R$19:$R$923,$P983,$Z$19:$Z$923))","v":0},null,null,null,null,{"$f":"IF(P984=\"\",$X$997-SUM(OFFSET($X$975:X982,0,0,COUNTA($X$975:X982),1)),ROUND(S983*(1+BDI.Taxa),2))","v":0},null,null,{"$f":"IF(P984=\"\",$AA$997-SUM(OFFSET($AA$975:AA982,0,0,COUNTA($AA$975:AA982),1)),ROUND(X983*100/ORÇAMENTO.TotalOrçamento,2))","v":{"$error":"#DIV/0!"}}]
[null,null,null,null,null,null,null,null,null,null,null,null,null,null,"9.","",null,null,{"$f":"IF(P985=\"\",$S$997-SUM(OFFSET($S$975:S983,0,0,COUNTA($S$975:S983),1)),SUMIF($R$19:$R$923,$P984,$Z$19:$Z$923))","v":0},null,null,null,null,{"$f":"IF(P985=\"\",$X$997-SUM(OFFSET($X$975:X983,0,0,COUNTA($X$975:X983),1)),ROUND(S984*(1+BDI.Taxa),2))","v":0},null,null,{"$f":"IF(P985=\"\",$AA$997-SUM(OFFSET($AA$975:AA983,0,0,COUNTA($AA$975:AA983),1)),ROUND(X984*100/ORÇAMENTO.TotalOrçamento,2))","v":{"$error":"#DIV/0!"}}]
[null,null,null,null,null,null,null,null,null,null,null,null,null,null,"10.","",null,null,{"$f":"IF(P986=\"\",$S$997-SUM(OFFSET($S$975:S984,0,0,COUNTA($S$975:S984),1)),SUMIF($R$19:$R$923,$P985,$Z$19:$Z$923))","v":0},null,null,null,null,{"$f":"IF(P986=\"\",$X$997-SUM(OFFSET($X$975:X984,0,0,COUNTA($X$975:X984),1)),ROUND(S985*(1+BDI.Taxa),2))","v":0},null,null,{"$f":"IF(P986=\"\",$AA$997-SUM(OFFSET($AA$975:AA984,0,0,COUNTA($AA$975:AA984),1)),ROUND(X985*100/ORÇAMENTO.TotalOrçamento,2))","v":{"$error":"#DIV/0!"}}]
[null,null,null,null,null,null,null,null,null,null,null,null,null,null,"11.","",null,null,{"$f":"IF(P987=\"\",$S$997-SUM(OFFSET($S$975:S985,0,0,COUNTA($S$975:S985),1)),SUMIF($R$19:$R$923,$P986,$Z$19:$Z$923))","v":0},null,null,null,null,{"$f":"IF(P987=\"\",$X$997-SUM(OFFSET($X$975:X985,0,0,COUNTA($X$975:X985),1)),ROUND(S986*(1+BDI.Taxa),2))","v":0},null,null,{"$f":"IF(P987=\"\",$AA$997-SUM(OFFSET($AA$975:AA985,0,0,COUNTA($AA$975:AA985),1)),ROUND(X986*100/ORÇAMENTO.TotalOrçamento,2))","v":{"$error":"#DIV/0!"}}]
[null,null,null,null,null,null,null,null,null,null,null,null,null,null,"12.","",null,null,{"$f":"IF(P988=\"\",$S$997-SUM(OFFSET($S$975:S986,0,0,COUNTA($S$975:S986),1)),SUMIF($R$19:$R$923,$P987,$Z$19:$Z$923))","v":0},null,null,null,null,{"$f":"IF(P988=\"\",$X$997-SUM(OFFSET($X$975:X986,0,0,COUNTA($X$975:X986),1)),ROUND(S987*(1+BDI.Taxa),2))","v":0},null,null,{"$f":"IF(P988=\"\",$AA$997-SUM(OFFSET($AA$975:AA986,0,0,COUNTA($AA$975:AA986),1)),ROUND(X987*100/ORÇAMENTO.TotalOrçamento,2))","v":{"$error":"#DIV/0!"}}]
[null,null,null,null,null,null,null,null,null,null,null,null,null,null,"13.","",null,null,{"$f":"IF(P989=\"\",$S$997-SUM(OFFSET($S$975:S987,0,0,COUNTA($S$975:S987),1)),SUMIF($R$19:$R$923,$P988,$Z$19:$Z$923))","v":0},null,null,null,null,{"$f":"IF(P989=\"\",$X$997-SUM(OFFSET($X$975:X987,0,0,COUNTA($X$975:X987),1)),ROUND(S988*(1+BDI.Taxa),2))","v":0},null,null,{"$f":"IF(P989=\"\",$AA$997-SUM(OFFSET($AA$975:AA987,0,0,COUNTA($AA$975:AA987),1)),ROUND(X988*100/ORÇAMENTO.TotalOrçamento,2))","v":{"$error":"#DIV/0!"}}]
[null,null,null,null,null,null,null,null,null,null,null,null,null,null,"14.","",null,null,{"$f":"IF(P990=\"\",$S$997-SUM(OFFSET($S$975:S988,0,0,COUNTA($S$975:S988),1)),SUMIF($R$19:$R$923,$P989,$Z$19:$Z$923))","v":0},null,null,null,null,{"$f":"IF(P990=\"\",$X$997-SUM(OFFSET($X$975:X988,0,0,COUNTA($X$975:X988),1)),ROUND(S989*(1+BDI.Taxa),2))","v":0},null,null,{"$f":"IF(P990=\"\",$AA$997-SUM(OFFSET($AA$975:AA988,0,0,COUNTA($AA$975:AA988),1)),ROUND(X989*100/ORÇAMENTO.TotalOrçamento,2))","v":{"$error":"#DIV/0!"}}]
[null,null,null,null,null,null,null,null,null,null,null,null,null,null,"15.","",null,null,{"$f":"IF(P991=\"\",$S$997-SUM(OFFSET($S$975:S989,0,0,COUNTA($S$975:S989),1)),SUMIF($R$19:$R$923,$P990,$Z$19:$Z$923))","v":0},null,null,null,null,{"$f":"IF(P991=\"\",$X$997-SUM(OFFSET($X$975:X989,0,0,COUNTA($X$975:X989),1)),ROUND(S990*(1+BDI.Taxa),2))","v":0},null,null,{"$f":"IF(P991=\"\",$AA$997-SUM(OFFSET($AA$975:AA989,0,0,COUNTA($AA$975:AA989),1)),ROUND(X990*100/ORÇAMENTO.TotalOrçamento,2))","v":{"$error":"#DIV/0!"}}]
[null,null,null,null,null,null,null,null,null,null,null,null,null,null,"16.","",null,null,{"$f":"IF(P992=\"\",$S$997-SUM(OFFSET($S$975:S990,0,0,COUNTA($S$975:S990),1)),SUMIF($R$19:$R$923,$P991,$Z$19:$Z$923))","v":0},null,null,null,null,{"$f":"IF(P992=\"\",$X$997-SUM(OFFSET($X$975:X990,0,0,COUNTA($X$975:X990),1)),ROUND(S991*(1+BDI.Taxa),2))","v":0},null,null,{"$f":"IF(P992=\"\",$AA$997-SUM(OFFSET($AA$975:AA990,0,0,COUNTA($AA$975:AA990),1)),ROUND(X991*100/ORÇAMENTO.TotalOrçamento,2))","v":{"$error":"#DIV/0!"}}]
[null,null,null,null,null,null,null,null,null,null,null,null,null,null,"17.","",null,null,{"$f":"IF(P993=\"\",$S$997-SUM(OFFSET($S$975:S991,0,0,COUNTA($S$975:S991),1)),SUMIF($R$19:$R$923,$P992,$Z$19:$Z$923))","v":0},null,null,null,null,{"$f":"IF(P993=\"\",$X$997-SUM(OFFSET($X$975:X991,0,0,COUNTA($X$975:X991),1)),ROUND(S992*(1+BDI.Taxa),2))","v":0},null,null,{"$f":"IF(P993=\"\",$AA$997-SUM(OFFSET($AA$975:AA991,0,0,COUNTA($AA$975:AA991),1)),ROUND(X992*100/ORÇAMENTO.TotalOrçamento,2))","v":{"$error":"#DIV/0!"}}]
[null,null,null,null,null,null,null,null,null,null,null,null,null,null,"18.","",null,null,{"$f":"IF(P994=\"\",$S$997-SUM(OFFSET($S$975:S992,0,0,COUNTA($S$975:S992),1)),SUMIF($R$19:$R$923,$P993,$Z$19:$Z$923))","v":0},null,null,null,null,{"$f":"IF(P994=\"\",$X$997-SUM(OFFSET($X$975:X992,0,0,COUNTA($X$975:X992),1)),ROUND(S993*(1+BDI.Taxa),2))","v":0},null,null,{"$f":"IF(P994=\"\",$AA$997-SUM(OFFSET($AA$975:AA992,0,0,COUNTA($AA$975:AA992),1)),ROUND(X993*100/ORÇAMENTO.TotalOrçamento,2))","v":{"$error":"#DIV/0!"}}]
[null,null,null,null,null,null,null,null,null,null,null,null,null,null,"19.","",null,null,{"$f":"IF(P995=\"\",$S$997-SUM(OFFSET($S$975:S993,0,0,COUNTA($S$975:S993),1)),SUMIF($R$19:$R$923,$P994,$Z$19:$Z$923))","v":0},null,null,null,null,{"$f":"IF(P995=\"\",$X$997-SUM(OFFSET($X$975:X993,0,0,COUNTA($X$975:X993),1)),ROUND(S994*(1+BDI.Taxa),2))","v":0},null,null,{"$f":"IF(P995=\"\",$AA$997-SUM(OFFSET($AA$975:AA993,0,0,COUNTA($AA$975:AA993),1)),ROUND(X994*100/ORÇAMENTO.TotalOrçamento,2))","v":{"$error":"#DIV/0!"}}]
[null,null,null,null,null,null,null,null,null,null,null,null,null,null,"20.","",null,null,{"$f":"IF(P996=\"\",$S$997-SUM(OFFSET($S$975:S994,0,0,COUNTA($S$975:S994),1)),SUMIF($R$19:$R$923,$P995,$Z$19:$Z$923))","v":0},null,null,null,null,{"$f":"IF(P996=\"\",$X$997-SUM(OFFSET($X$975:X994,0,0,COUNTA($X$975:X994),1)),ROUND(S995*(1+BDI.Taxa),2))","v":0},null,null,{"$f":"IF(P996=\"\",$AA$997-SUM(OFFSET($AA$975:AA994,0,0,COUNTA($AA$975:AA994),1)),ROUND(X995*100/ORÇAMENTO.TotalOrçamento,2))","v":{"$error":"#DIV/0!"}}]
[null,null,null,null,null,null,null,null,null,null,null,null,null,null,"TOTAL GERAL DO ORÇAMENTO (R$)",null,null,null,{"$f":"SUM(S976:W995)","v":0},null,null,null,null,{"$f":"SUM(X976:Y995)","v":0},null,null,{"$f":"SUM(AA976:AA995)","v":{"$error":"#DIV/0!"}}]
[null,null,null,null,null,null,null,null,null,null,null,null,null,null,null,null,null,null,{"$f":"$Z$924","v":0},null,null,null,null,{"$f":"$Z$926","v":0},null,null,100]
[null,null,null,null,null,null,null,null,null,null,null,null,null,null,null,null,null,null,"(TOTAL SEM BDI)",null,null,null,null,"(TOTAL COM BDI)",null,null,"(ARRED porcentagem)"]
[null,null,null,null,null,null,null,null,null,null,null,null,null,null,null,null,null,null,{"$f":"IF(AND(S996=S997,S996>0),\"OK\",\"ERRO\")","v":"ERRO"},null,null,null,null,{"$f":"IF(AND(X996=X997,X996>0),\"OK\",\"ERRO\")","v":"ERRO"},null,null,{"$f":"IF(AND(AA996=100,S976<>0),\"OK\",\"ERRO\")","v":{"$error":"#DIV/0!"}}]

{"sheet":"Resumo ","index":1,"n_rows":39,"n_cols":9,"rows_kept":39,"cut":false,"hidden":false,"merged":[[13,0,14,0],[15,2,15,5],[16,2,16,5],[17,2,17,5],[18,2,18,5],[14,1,14,8],[0,1,0,8],[36,1,36,5],[2,1,2,5],[3,1,3,5],[5,1,5,5],[6,1,6,5],[8,1,8,5],[9,1,9,5],[11,3,11,5],[12,3,12,5],[10,1,10,8],[11,6,11,8],[12,6,12,8],[19,2,19,5],[20,2,20,5],[21,2,21,5],[31,2,31,5],[1,1,1,8],[2,6,2,8],[3,6,3,8],[4,1,4,8],[5,6,5,8],[6,6,6,8],[7,1,7,8],[8,6,8,8],[9,6,9,8],[13,1,13,8],[11,1,11,2],[12,1,12,2],[42,3,42,7],[41,3,41,7],[38,1,38,8],[22,2,22,5],[23,2,23,5],[24,2,24,5],[25,2,25,5],[26,2,26,5],[32,2,32,5],[33,2,33,5],[34,2,34,5],[35,2,35,5],[27,2,27,5],[28,2,28,5],[29,2,29,5],[30,2,30,5]]}
[]
[]
[null,"UNIDADE ESCOLAR",null,null,null,null,"CÓDIGO INEP"]
[null,{"$f":"Orçamento!$O$4","v":"COLÉGIO ESTADUAL MARIA EULÁLIA DE JESUS PORTILHO"},null,null,null,null,{"$f":"Orçamento!X4","v":52005720}]
[]
[null,"OBRA",null,null,null,null,"CIDADE"]
[null,{"$f":"Orçamento!$O$7","v":0},null,null,null,null,{"$f":"Orçamento!$X$7","v":"PIRANHAS"}]
[]
[null,"ENDEREÇO",null,null,null,null,"CRE"]
[null,{"$f":"Orçamento!$R$10","v":"AV BRASIL CENTRAL 1440, CENTRO, CEP:76230-000"},null,null,null,null,{"$f":"Orçamento!$O$10","v":"PIRANHAS"}]
[]
[null,"REFERÊNCIA",null,"DATA",null,null,"ÁREA TOTAL CONSTRUÍDA (M²)"]
[null,{"$f":"CONCATENATE(\"AGETOP E SINAPI - \",Orçamento!$Y$10)","v":"AGETOP E SINAPI - ONERADA"},null,{"$f":"Orçamento!$S$7","v":"2020-03-26"},null,null,{"$f":"Orçamento!$S$13","v":3189.69}]
["FILTRO"]
[null,"RESUMO GERAL DO ORÇAMENTO"]
["↓","ITEM","DESCRIÇÃO DOS SERVIÇOS",null,null,null,"PREÇO SEM BDI","PREÇO COM BDI","PARTICIP. (%)"]
[{"$f":"IF(G17>0,\"F\",\"\")","v":""},"1.",{"$f":"Orçamento!$P976","v":"REFORMA"},null,null,null,{"$f":"IFERROR(Orçamento!S976,\"-\")","v":0},{"$f":"IFERROR(Orçamento!X976,\"\")","v":0},{"$f":"Orçamento!AA976","v":{"$error":"#DIV/0!"}}]
[{"$f":"IF(G18>0,\"F\",\"\")","v":""},"2.",{"$f":"Orçamento!$P977","v":"IMPLANTAÇÃO BLOCO COZINHA 2009"},null,null,null,{"$f":"IFERROR(Orçamento!S977,\"-\")","v":0},{"$f":"IFERROR(Orçamento!X977,\"\")","v":0},{"$f":"Orçamento!AA977","v":{"$error":"#DIV/0!"}}]
["","3.",{"$f":"Orçamento!$P978","v":"IMPLANTAÇÃO PATIO MULTIUSO 2"},null,null,null,{"$f":"IFERROR(Orçamento!S978,\"-\")","v":0},{"$f":"IFERROR(Orçamento!X978,\"\")","v":0},{"$f":"Orçamento!AA978","v":{"$error":"#DIV/0!"}}]
["","4.",{"$f":"Orçamento!$P979","v":"IMPLANTAÇÃO 3 SALAS DE AULA - LAJE"},null,null,null,{"$f":"IFERROR(Orçamento!S979,\"-\")","v":0},{"$f":"IFERROR(Orçamento!X979,\"\")","v":0},{"$f":"Orçamento!AA979","v":{"$error":"#DIV/0!"}}]
["","5.",{"$f":"Orçamento!$P980","v":"COZINHA 2009"},null,null,null,{"$f":"IFERROR(Orçamento!S980,\"-\")","v":0},{"$f":"IFERROR(Orçamento!X980,\"\")","v":0},{"$f":"Orçamento!AA980","v":{"$error":"#DIV/0!"}}]
["","6.",{"$f":"Orçamento!$P981","v":"PATIO MULTIUSO 2"},null,null,null,{"$f":"IFERROR(Orçamento!S981,\"-\")","v":0},{"$f":"IFERROR(Orçamento!X981,\"\")","v":0},{"$f":"Orçamento!AA981","v":{"$error":"#DIV/0!"}}]
["","7.",{"$f":"Orçamento!$P982","v":"3 SALAS PADRÃO SEDUC - LAJE"},null,null,null,{"$f":"IFERROR(Orçamento!S982,\"-\")","v":0},{"$f":"IFERROR(Orçamento!X982,\"\")","v":0},{"$f":"Orçamento!AA982","v":{"$error":"#DIV/0!"}}]
["","8.",{"$f":"Orçamento!$P983","v":"PASSARELA MODELO 02 - PADRÃO XXI 2015"},null,null,null,{"$f":"IFERROR(Orçamento!S983,\"-\")","v":0},{"$f":"IFERROR(Orçamento!X983,\"\")","v":0},{"$f":"Orçamento!AA983","v":{"$error":"#DIV/0!"}}]
["","9.",{"$f":"Orçamento!$P984","v":""},null,null,null,{"$f":"IFERROR(Orçamento!S984,\"-\")","v":0},{"$f":"IFERROR(Orçamento!X984,\"\")","v":0},{"$f":"Orçamento!AA984","v":{"$error":"#DIV/0!"}}]
["","10.",{"$f":"Orçamento!$P985","v":""},null,null,null,{"$f":"IFERROR(Orçamento!S985,\"-\")","v":0},{"$f":"IFERROR(Orçamento!X985,\"\")","v":0},{"$f":"Orçamento!AA985","v":{"$error":"#DIV/0!"}}]
["","11.",{"$f":"Orçamento!$P986","v":""},null,null,null,{"$f":"IFERROR(Orçamento!S986,\"-\")","v":0},{"$f":"IFERROR(Orçamento!X986,\"\")","v":0},{"$f":"Orçamento!AA986","v":{"$error":"#DIV/0!"}}]
["","12.",{"$f":"Orçamento!$P987","v":""},null,null,null,{"$f":"IFERROR(Orçamento!S987,\"-\")","v":0},{"$f":"IFERROR(Orçamento!X987,\"\")","v":0},{"$f":"Orçamento!AA987","v":{"$error":"#DIV/0!"}}]
["","13.",{"$f":"Orçamento!$P988","v":""},null,null,null,{"$f":"IFERROR(Orçamento!S988,\"-\")","v":0},{"$f":"IFERROR(Orçamento!X988,\"\")","v":0},{"$f":"Orçamento!AA988","v":{"$error":"#DIV/0!"}}]
["","14.",{"$f":"Orçamento!$P989","v":""},null,null,null,{"$f":"IFERROR(Orçamento!S989,\"-\")","v":0},{"$f":"IFERROR(Orçamento!X989,\"\")","v":0},{"$f":"Orçamento!AA989","v":{"$error":"#DIV/0!"}}]
["","15.",{"$f":"Orçamento!$P990","v":""},null,null,null,{"$f":"IFERROR(Orçamento!S990,\"-\")","v":0},{"$f":"IFERROR(Orçamento!X990,\"\")","v":0},{"$f":"Orçamento!AA990","v":{"$error":"#DIV/0!"}}]
["","16.",{"$f":"Orçamento!$P991","v":""},null,null,null,{"$f":"IFERROR(Orçamento!S991,\"-\")","v":0},{"$f":"IFERROR(Orçamento!X991,\"\")","v":0},{"$f":"Orçamento!AA991","v":{"$error":"#DIV/0!"}}]
["","17.",{"$f":"Orçamento!$P992","v":""},null,null,null,{"$f":"IFERROR(Orçamento!S992,\"-\")","v":0},{"$f":"IFERROR(Orçamento!X992,\"\")","v":0},{"$f":"Orçamento!AA992","v":{"$error":"#DIV/0!"}}]
["","18.",{"$f":"Orçamento!$P993","v":""},null,null,null,{"$f":"IFERROR(Orçamento!S993,\"-\")","v":0},{"$f":"IFERROR(Orçamento!X993,\"\")","v":0},{"$f":"Orçamento!AA993","v":{"$error":"#DIV/0!"}}]
["","19.",{"$f":"Orçamento!$P994","v":""},null,null,null,{"$f":"IFERROR(Orçamento!S994,\"-\")","v":0},{"$f":"IFERROR(Orçamento!X994,\"\")","v":0},{"$f":"Orçamento!AA994","v":{"$error":"#DIV/0!"}}]
["","20.",{"$f":"Orçamento!$P995","v":""},null,null,null,{"$f":"IFERROR(Orçamento!S995,\"-\")","v":0},{"$f":"IFERROR(Orçamento!X995,\"\")","v":0},{"$f":"Orçamento!AA995","v":{"$error":"#DIV/0!"}}]
["F","TOTAL GERAL DO ORÇAMENTO (R$)",null,null,null,null,{"$f":"SUM(G17:G36)","v":0},0,{"$f":"SUM(I17:I36)","v":{"$error":"#DIV/0!"}}]
["F"]
["F"]

{"sheet":"Somatório","index":2,"n_rows":45,"n_cols":6,"rows_kept":45,"cut":false,"hidden":false,"merged":[[13,0,14,0],[42,1,42,2],[44,1,44,5],[47,3,47,5],[48,3,48,5],[13,1,13,5],[9,1,9,3],[9,4,9,5],[11,1,11,2],[11,4,11,5],[12,1,12,2],[12,4,12,5],[0,1,0,5],[14,1,14,5],[2,1,2,3],[2,4,2,5],[3,1,3,3],[3,4,3,5],[5,1,5,3],[5,4,5,5],[6,1,6,3],[6,4,6,5],[8,1,8,3],[8,4,8,5],[1,1,1,5],[4,1,4,5],[7,1,7,5],[10,1,10,5]]}
[]
[]
[null,"UNIDADE ESCOLAR",null,null,"CÓDIGO INEP"]
[null,{"$f":"Orçamento!$O$4","v":"COLÉGIO ESTADUAL MARIA EULÁLIA DE JESUS PORTILHO"},null,null,{"$f":"Orçamento!X4","v":52005720}]
[]
[null,"OBRA",null,null,"CIDADE"]
[null,{"$f":"Orçamento!$O$7","v":0},null,null,{"$f":"Orçamento!$X$7","v":"PIRANHAS"}]
[]
[null,"ENDEREÇO",null,null,"CRE"]
[null,{"$f":"Orçamento!$R$10","v":"AV BRASIL CENTRAL 1440, CENTRO, CEP:76230-000"},null,null,{"$f":"Orçamento!$O$10","v":"PIRANHAS"}]
[]
[null,"REFERÊNCIA",null,"DATA","ÁREA TOTAL CONSTRUÍDA (M²)"]
[null,{"$f":"CONCATENATE(\"AGETOP E SINAPI - \",Orçamento!$Y$10)","v":"AGETOP E SINAPI - ONERADA"},null,{"$f":"Orçamento!$S$7","v":"2020-03-26"},{"$f":"Orçamento!$S$13","v":3189.69}]
["FILTRO"]
[null,"SOMATÓRIO DE SERVIÇOS"]
["↓","ITEM","DESCRIÇÃO DOS SERVIÇOS","PREÇO SEM BDI (R$)","PREÇO COM BDI (R$)","PARTIC.  ( % )"]
[{"$f":"IF(D17>0,\"F\",\"\")","v":""},"a.",{"$f":"Orçamento!P942","v":"SERVIÇOS PRELIMINARES"},{"$f":"Orçamento!S942","v":0},{"$f":"Orçamento!X942","v":0},{"$f":"Orçamento!AA942","v":0}]
[{"$f":"IF(D18>0,\"F\",\"\")","v":""},"b.",{"$f":"Orçamento!P943","v":"TRANSPORTES"},{"$f":"Orçamento!S943","v":0},{"$f":"Orçamento!X943","v":0},{"$f":"Orçamento!AA943","v":0}]
["","c.",{"$f":"Orçamento!P944","v":"SERVIÇO EM TERRA"},{"$f":"Orçamento!S944","v":0},{"$f":"Orçamento!X944","v":0},{"$f":"Orçamento!AA944","v":0}]
["","d.",{"$f":"Orçamento!P945","v":"FUNDAÇÕES E SONDAGENS"},{"$f":"Orçamento!S945","v":0},{"$f":"Orçamento!X945","v":0},{"$f":"Orçamento!AA945","v":0}]
["","e.",{"$f":"Orçamento!P946","v":"ESTRUTURA"},{"$f":"Orçamento!S946","v":0},{"$f":"Orçamento!X946","v":0},{"$f":"Orçamento!AA946","v":0}]
["","f.",{"$f":"Orçamento!P947","v":"INSTALAÇÕES ELÉTRICAS"},{"$f":"Orçamento!S947","v":0},{"$f":"Orçamento!X947","v":0},{"$f":"Orçamento!AA947","v":0}]
["","g.",{"$f":"Orçamento!P948","v":"INSTALAÇÕES HIDROSSANITÁRIAS"},{"$f":"Orçamento!S948","v":0},{"$f":"Orçamento!X948","v":0},{"$f":"Orçamento!AA948","v":0}]
["","h",{"$f":"Orçamento!P949","v":"INSTALAÇÕES ESPECIAIS"},{"$f":"Orçamento!S949","v":0},{"$f":"Orçamento!X949","v":0},{"$f":"Orçamento!AA949","v":0}]
["","i.",{"$f":"Orçamento!P950","v":"ALVENARIAS E DIVISÓRIAS"},{"$f":"Orçamento!S950","v":0},{"$f":"Orçamento!X950","v":0},{"$f":"Orçamento!AA950","v":0}]
["","j.",{"$f":"Orçamento!P951","v":"ALVENARIA AUTO-PORTANTE"},{"$f":"Orçamento!S951","v":0},{"$f":"Orçamento!X951","v":0},{"$f":"Orçamento!AA951","v":0}]
["","k.",{"$f":"Orçamento!P952","v":"IMPERMEABILIZAÇÃO"},{"$f":"Orçamento!S952","v":0},{"$f":"Orçamento!X952","v":0},{"$f":"Orçamento!AA952","v":0}]
["","l.",{"$f":"Orçamento!P953","v":"ISOLAMENTO TÉRMICO E ACÚSTICO"},{"$f":"Orçamento!S953","v":0},{"$f":"Orçamento!X953","v":0},{"$f":"Orçamento!AA953","v":0}]
["","m.",{"$f":"Orçamento!P954","v":"ESTRUTURA DE MADEIRA"},{"$f":"Orçamento!S954","v":0},{"$f":"Orçamento!X954","v":0},{"$f":"Orçamento!AA954","v":0}]
["","n.",{"$f":"Orçamento!P955","v":"ESTRUTURAS METÁLICAS"},{"$f":"Orçamento!S955","v":0},{"$f":"Orçamento!X955","v":0},{"$f":"Orçamento!AA955","v":0}]
["","o.",{"$f":"Orçamento!P956","v":"COBERTURAS"},{"$f":"Orçamento!S956","v":0},{"$f":"Orçamento!X956","v":0},{"$f":"Orçamento!AA956","v":0}]
["","p.",{"$f":"Orçamento!P957","v":"ESQUADRIAS DE MADEIRA"},{"$f":"Orçamento!S957","v":0},{"$f":"Orçamento!X957","v":0},{"$f":"Orçamento!AA957","v":0}]
["","q.",{"$f":"Orçamento!P958","v":"ESQUADRIAS METÁLICAS"},{"$f":"Orçamento!S958","v":0},{"$f":"Orçamento!X958","v":0},{"$f":"Orçamento!AA958","v":0}]
["","r.",{"$f":"Orçamento!P959","v":"VIDROS"},{"$f":"Orçamento!S959","v":0},{"$f":"Orçamento!X959","v":0},{"$f":"Orçamento!AA959","v":0}]
["","s.",{"$f":"Orçamento!P960","v":"REVESTIMENTO DE PAREDE"},{"$f":"Orçamento!S960","v":0},{"$f":"Orçamento!X960","v":0},{"$f":"Orçamento!AA960","v":0}]
["","t.",{"$f":"Orçamento!P961","v":"FORROS"},{"$f":"Orçamento!S961","v":0},{"$f":"Orçamento!X961","v":0},{"$f":"Orçamento!AA961","v":0}]
["","u.",{"$f":"Orçamento!P962","v":"REVESTIMENTO DE PISO"},{"$f":"Orçamento!S962","v":0},{"$f":"Orçamento!X962","v":0},{"$f":"Orçamento!AA962","v":0}]
["","v.",{"$f":"Orçamento!P963","v":"FERRAGENS"},{"$f":"Orçamento!S963","v":0},{"$f":"Orçamento!X963","v":0},{"$f":"Orçamento!AA963","v":0}]
["","w.",{"$f":"Orçamento!P964","v":"MARCENARIA"},{"$f":"Orçamento!S964","v":0},{"$f":"Orçamento!X964","v":0},{"$f":"Orçamento!AA964","v":0}]
["","x.",{"$f":"Orçamento!P965","v":"ADMINISTRAÇÃO"},{"$f":"Orçamento!S965","v":0},{"$f":"Orçamento!X965","v":0},{"$f":"Orçamento!AA965","v":0}]
["","y.",{"$f":"Orçamento!P966","v":"PINTURA"},{"$f":"Orçamento!S966","v":0},{"$f":"Orçamento!X966","v":0},{"$f":"Orçamento!AA966","v":0}]
["","z.",{"$f":"Orçamento!P967","v":"DIVERSOS"},{"$f":"Orçamento!S967","v":0},{"$f":"Orçamento!X967","v":0},{"$f":"Orçamento!AA967","v":0}]
["F","TOTAL GERAL DO ORÇAMENTO",null,{"$f":"SUM(D17:D42)","v":0},{"$f":"SUM(E17:E42)","v":0},{"$f":"SUM(F17:F42)","v":0}]
[]
[null,"(*) Para itens da AGETOP, os vidros não estão inclusos nas esquadrias e já foram considerados os custos de contramarco para as esquadrias de alumínio;"]

{"sheet":"Cronog_120_Dias","index":3,"n_rows":99,"n_cols":23,"rows_kept":99,"cut":false,"hidden":false,"merged":[[93,17,93,20],[94,17,94,20],[95,17,95,20],[80,17,80,20],[82,17,82,20],[83,17,83,20],[85,17,85,20],[86,17,86,20],[88,17,88,20],[89,17,89,20],[91,17,91,20],[92,17,92,20],[67,17,67,20],[68,17,68,20],[70,17,70,20],[71,17,71,20],[73,17,73,20],[74,17,74,20],[76,17,76,20],[77,17,77,20],[79,17,79,20],[53,17,53,20],[55,17,55,20],[56,17,56,20],[58,17,58,20],[59,17,59,20],[61,17,61,20],[62,17,62,20],[64,17,64,20],[65,17,65,20],[40,17,40,20],[41,17,41,20],[43,17,43,20],[44,17,44,20],[46,17,46,20],[47,17,47,20],[49,17,49,20],[50,17,50,20],[52,17,52,20],[91,13,91,16],[92,13,92,16],[93,13,93,16],[94,13,94,16],[95,13,95,16],[12,17,12,20],[13,17,13,20],[14,17,14,20],[16,17,16,20],[17,17,17,20],[19,17,19,20],[20,17,20,20],[22,17,22,20],[23,17,23,20],[25,17,25,20],[26,17,26,20],[28,17,28,20],[29,17,29,20],[31,17,31,20],[32,17,32,20],[34,17,34,20],[35,17,35,20],[37,17,37,20],[38,17,38,20],[79,13,79,16],[80,13,80,16],[82,13,82,16],[83,13,83,16],[85,13,85,16],[86,13,86,16],[88,13,88,16],[89,13,89,16],[65,13,65,16],[67,13,67,16],[68,13,68,16],[70,13,70,16],[71,13,71,16],[73,13,73,16],[74,13,74,16],[76,13,76,16],[77,13,77,16],[52,13,52,16],[53,13,53,16],[55,13,55,16],[56,13,56,16],[58,13,58,16],[59,13,59,16],[61,13,61,16],[62,13,62,16],[64,13,64,16],[38,13,38,16],[40,13,40,16],[41,13,41,16],[43,13,43,16],[44,13,44,16],[46,13,46,16],[47,13,47,16],[49,13,49,16],[50,13,50,16],[25,13,25,16],[26,13,26,16],[28,13,28,16],[29,13,29,16],[31,13,31,16],[32,13,32,16],[34,13,34,16],[35,13,35,16],[37,13,37,16],[12,13,12,16],[13,13,13,16],[14,13,14,16],[16,13,16,16],[17,13,17,16],[19,13,19,16],[20,13,20,16],[22,13,22,16],[23,13,23,16],[12,0,13,0],[9,0,11,0],[11,1,11,21],[92,1,92,2],[92,5,92,8],[92,9,92,12],[93,1,93,2],[93,5,93,8],[93,9,93,12],[74,9,74,12],[74,5,74,8],[68,9,68,12],[70,5,70,8],[70,9,70,12],[59,5,59,8],[71,1,73,2],[71,4,73,4],[71,5,71,8],[71,9,71,12],[73,5,73,8],[73,9,73,12],[59,9,59,12],[61,5,61,8],[61,9,61,12],[94,1,94,2],[94,5,94,8],[94,9,94,12],[76,5,76,8],[76,9,76,12],[77,5,77,8],[77,9,77,12],[79,5,79,8],[79,9,79,12],[80,5,80,8],[80,9,80,12],[82,5,82,8],[82,9,82,12],[77,3,79,3],[80,3,82,3],[86,1,88,2],[80,4,82,4],[83,3,85,3],[77,1,79,2],[77,4,79,4],[80,1,82,2],[95,1,95,2],[95,5,95,8],[95,9,95,12],[97,1,97,4],[98,1,98,21],[86,9,86,12],[88,5,88,8],[88,9,88,12],[85,5,85,8],[85,9,85,12],[89,1,91,2],[89,4,91,4],[89,5,89,8],[89,9,89,12],[91,5,91,8],[91,9,91,12],[89,3,91,3],[86,4,88,4],[86,5,86,8],[86,3,88,3],[83,1,85,2],[83,4,85,4],[83,5,83,8],[83,9,83,12],[68,5,68,8],[65,5,65,8],[65,9,65,12],[67,5,67,8],[67,9,67,12],[65,3,67,3],[62,9,62,12],[64,5,64,8],[64,9,64,12],[62,5,62,8],[53,9,53,12],[55,5,55,8],[55,9,55,12],[50,5,50,8],[50,9,50,12],[52,5,52,8],[52,9,52,12],[56,9,56,12],[58,5,58,8],[58,9,58,12],[53,5,53,8],[56,5,56,8],[44,9,44,12],[46,5,46,8],[46,9,46,12],[47,1,49,2],[47,4,49,4],[47,5,47,8],[47,9,47,12],[49,5,49,8],[49,9,49,12],[44,5,44,8],[47,3,49,3],[44,3,46,3],[44,1,46,2],[44,4,46,4],[35,9,35,12],[37,5,37,8],[37,9,37,12],[35,3,37,3],[40,9,40,12],[38,3,40,3],[38,9,38,12],[41,1,43,2],[41,4,43,4],[41,5,41,8],[41,9,41,12],[43,5,43,8],[43,9,43,12],[41,3,43,3],[35,5,35,8],[38,5,38,8],[40,5,40,8],[35,1,37,2],[35,4,37,4],[38,1,40,2],[38,4,40,4],[29,9,29,12],[31,5,31,8],[31,9,31,12],[32,1,34,2],[32,4,34,4],[32,5,32,8],[32,9,32,12],[34,5,34,8],[34,9,34,12],[32,3,34,3],[29,5,29,8],[29,1,31,2],[29,4,31,4],[29,3,31,3],[23,9,23,12],[25,5,25,8],[25,9,25,12],[26,1,28,2],[26,4,28,4],[26,5,26,8],[26,9,26,12],[28,5,28,8],[28,9,28,12],[23,3,25,3],[23,1,25,2],[23,4,25,4],[23,5,23,8],[26,3,28,3],[20,4,22,4],[20,5,20,8],[20,9,20,12],[22,5,22,8],[22,9,22,12],[20,3,22,3],[14,3,16,3],[17,3,19,3],[14,4,16,4],[14,5,14,8],[14,9,14,12],[16,5,16,8],[16,9,16,12],[65,1,67,2],[68,3,70,3],[62,3,64,3],[68,1,70,2],[56,3,58,3],[65,4,67,4],[74,3,76,3],[50,4,52,4],[74,4,76,4],[56,1,58,2],[56,4,58,4],[50,3,52,3],[53,3,55,3],[68,4,70,4],[62,1,64,2],[62,4,64,4],[59,3,61,3],[53,1,55,2],[53,4,55,4],[59,1,61,2],[59,4,61,4],[74,1,76,2],[10,1,10,21],[9,8,9,21],[8,8,8,21],[3,8,3,21],[6,8,6,21],[5,8,5,21],[2,8,2,21],[50,1,52,2],[71,3,73,3],[12,21,13,21],[13,1,13,2],[13,5,13,8],[13,9,13,12],[12,3,13,3],[12,9,12,12],[14,1,16,2],[12,5,12,8],[17,1,19,2],[17,4,19,4],[17,5,17,8],[17,9,17,12],[19,5,19,8],[19,9,19,12],[20,1,22,2],[0,1,0,21],[2,1,2,7],[3,1,3,7],[5,1,5,7],[6,1,6,7],[8,1,8,7],[9,1,9,7],[1,1,1,21],[7,1,7,21],[4,1,4,21]]}
[]
[]
[null,"UNIDADE ESCOLAR",null,null,null,null,null,null,"PRAZO"]
[null,{"$f":"Orçamento!$O$4","v":"COLÉGIO ESTADUAL MARIA EULÁLIA DE JESUS PORTILHO"},null,null,null,null,null,null,"120 DIAS CORRIDOS"]
[]
[null,"OBRA",null,null,null,null,null,null,"DATA"]
[null,{"$f":"Orçamento!$O$7","v":0},null,null,null,null,null,null,{"$f":"Orçamento!$S$7","v":"2020-03-26"}]
[]
[null,"LOCAL",null,null,null,null,null,null,"ÁREA TOTAL CONSTRUÍDA (M²)"]
["FILTRO",{"$f":"Orçamento!$X$7","v":"PIRANHAS"},null,null,null,null,null,null,{"$f":"Orçamento!$S$13","v":3189.69}]
[]
[null,"CRONOGRAMA - FÍSICO FINANCEIRO"]
["↓","CUSTO TOTAL:",{"$f":"D93","v":0},"VALOR","Dias:",30,null,null,null,60,null,null,null,90,null,null,null,120,null,null,null,"TOTAL"]
[null,"DESCRIÇÃO DOS SERVIÇOS",null,null,"%","1ª PARCELA",null,null,null,"2ª PARCELA",null,null,null,"2ª PARCELA",null,null,null,"2ª PARCELA"]
[{"$f":"IF(D15>0,\"F\",\"\")","v":""},"SERVIÇOS PRELIMINARES",null,{"$f":"Orçamento!X942","v":0},{"$f":"Orçamento!AA942","v":0},{"$f":"ROUND(F17*$D$15,2)","v":0},null,null,null,{"$f":"ROUND(J17*$D$15,2)","v":0},null,null,null,{"$f":"ROUND(N17*$D$15,2)","v":0},null,null,null,{"$f":"ROUND(R17*$D$15,2)","v":0},null,null,null,{"$f":"SUM(F15:U15)","v":0},{"$f":"IF(D15=V15,\"OK\",\"ERRO\")","v":"OK"}]
[{"$f":"IF(A15=\"F\",A15,\"\")","v":""}]
[{"$f":"IF(A16=\"F\",A16,\"\")","v":""},null,null,null,null,0.26,null,null,null,{"$f":"F17","v":0.26},null,null,null,{"$f":"J17","v":0.26},null,null,null,{"$f":"1-SUM(F17:Q17)","v":0.21999999999999997},null,null,null,{"$f":"IFERROR(E15/100,\"\")","v":0},{"$f":"IF(SUM(F17:U17)=100%,\"OK\",\"ERRO\")","v":"OK"}]
[{"$f":"IF(D18>0,\"F\",\"\")","v":""},"TRANSPORTES",null,{"$f":"Orçamento!X943","v":0},{"$f":"Orçamento!AA943","v":0},{"$f":"ROUND(F20*$D$18,2)","v":0},null,null,null,{"$f":"ROUND(J20*$D$18,2)","v":0},null,null,null,{"$f":"ROUND(N20*$D$18,2)","v":0},null,null,null,{"$f":"ROUND(R20*$D$18,2)","v":0},null,null,null,{"$f":"SUM(F18:U18)","v":0},{"$f":"IF(D18=V18,\"OK\",\"ERRO\")","v":"OK"}]
[{"$f":"IF(A18=\"F\",A18,\"\")","v":""}]
[{"$f":"IF(A19=\"F\",A19,\"\")","v":""},null,null,null,null,2.69,null,null,null,{"$f":"F20","v":2.69},null,null,null,{"$f":"J20","v":2.69},null,null,null,{"$f":"1-SUM(F20:Q20)","v":-7.07},null,null,null,{"$f":"IFERROR(E18/100,\"\")","v":0},{"$f":"IF(SUM(F20:U20)=100%,\"OK\",\"ERRO\")","v":"OK"}]
[{"$f":"IF(D21>0,\"F\",\"\")","v":""},"SERVIÇO EM TERRA",null,{"$f":"Orçamento!X944","v":0},{"$f":"Orçamento!AA944","v":0},{"$f":"ROUND(F23*$D$21,2)","v":0},null,null,null,{"$f":"ROUND(J23*$D$21,2)","v":0},null,null,null,{"$f":"ROUND(N23*$D$21,2)","v":0},null,null,null,{"$f":"ROUND(R23*$D$21,2)","v":0},null,null,null,{"$f":"SUM(F21:U21)","v":0},{"$f":"IF(D21=V21,\"OK\",\"ERRO\")","v":"OK"}]
[{"$f":"IF(A21=\"F\",A21,\"\")","v":""}]
[{"$f":"IF(A22=\"F\",A22,\"\")","v":""},null,null,null,null,1,null,null,null,{"$f":"1-F23","v":0},null,null,null,null,null,null,null,null,null,null,null,{"$f":"IFERROR(E21/100,\"\")","v":0},{"$f":"IF(SUM(F23:U23)=100%,\"OK\",\"ERRO\")","v":"OK"}]
[{"$f":"IF(D24>0,\"F\",\"\")","v":""},"FUNDAÇÕES E SONDAGENS",null,{"$f":"Orçamento!X945","v":0},{"$f":"Orçamento!AA945","v":0},{"$f":"ROUND(F26*$D$24,2)","v":0},null,null,null,{"$f":"ROUND(J26*$D$24,2)","v":0},null,null,null,{"$f":"ROUND(N26*$D$24,2)","v":0},null,null,null,{"$f":"ROUND(R26*$D$24,2)","v":0},null,null,null,{"$f":"SUM(F24:U24)","v":0},{"$f":"IF(D24=V24,\"OK\",\"ERRO\")","v":"OK"}]
[{"$f":"IF(A24=\"F\",A24,\"\")","v":""}]
[{"$f":"IF(A25=\"F\",A25,\"\")","v":""},null,null,null,null,0.8,null,null,null,0.2,null,null,null,null,null,null,null,null,null,null,null,{"$f":"IFERROR(E24/100,\"\")","v":0},{"$f":"IF(SUM(F26:U26)=100%,\"OK\",\"ERRO\")","v":"OK"}]
[{"$f":"IF(D27>0,\"F\",\"\")","v":""},"ESTRUTURA",null,{"$f":"Orçamento!X946","v":0},{"$f":"Orçamento!AA946","v":0},{"$f":"ROUND(F29*$D$27,2)","v":0},null,null,null,{"$f":"ROUND(J29*$D$27,2)","v":0},null,null,null,{"$f":"ROUND(N29*$D$27,2)","v":0},null,null,null,{"$f":"ROUND(R29*$D$27,2)","v":0},null,null,null,{"$f":"SUM(F27:U27)","v":0},{"$f":"IF(D27=V27,\"OK\",\"ERRO\")","v":"OK"}]
[{"$f":"IF(A27=\"F\",A27,\"\")","v":""}]
[{"$f":"IF(A28=\"F\",A28,\"\")","v":""},null,null,null,null,0.2,null,null,null,0.8,null,null,null,null,null,null,null,null,null,null,null,{"$f":"IFERROR(E27/100,\"\")","v":0},{"$f":"IF(SUM(F29:U29)=100%,\"OK\",\"ERRO\")","v":"OK"}]
[{"$f":"IF(D30>0,\"F\",\"\")","v":""},"INST.ELET/TELEFÔNICA/CABEAMENTO ESTRUTURADO",null,{"$f":"Orçamento!X947","v":0},{"$f":"Orçamento!AA947","v":0},{"$f":"ROUND(F32*$D$30,2)","v":0},null,null,null,{"$f":"ROUND(J32*$D$30,2)","v":0},null,null,null,{"$f":"ROUND(N32*$D$30,2)","v":0},null,null,null,{"$f":"ROUND(R32*$D$30,2)","v":0},null,null,null,{"$f":"SUM(F30:U30)","v":0},{"$f":"IF(D30=V30,\"OK\",\"ERRO\")","v":"OK"}]
[{"$f":"IF(A30=\"F\",A30,\"\")","v":""}]
[{"$f":"IF(A31=\"F\",A31,\"\")","v":""},null,null,null,null,0.22,null,null,null,{"$f":"F32+0.1","v":0.32},null,null,null,{"$f":"J32","v":0.32},null,null,null,{"$f":"1-SUM(F32:Q32)","v":0.1399999999999999},null,null,null,{"$f":"IFERROR(E30/100,\"\")","v":0},{"$f":"IF(SUM(F32:U32)=100%,\"OK\",\"ERRO\")","v":"OK"}]
[{"$f":"IF(D33>0,\"F\",\"\")","v":""},"INSTALAÇÕES HIDROSSANITÁRIAS",null,{"$f":"Orçamento!X948","v":0},{"$f":"Orçamento!AA948","v":0},{"$f":"ROUND(F35*$D$33,2)","v":0},null,null,null,{"$f":"ROUND(J35*$D$33,2)","v":0},null,null,null,{"$f":"ROUND(N35*$D$33,2)","v":0},null,null,null,{"$f":"ROUND(R35*$D$33,2)","v":0},null,null,null,{"$f":"SUM(F33:U33)","v":0},{"$f":"IF(D33=V33,\"OK\",\"ERRO\")","v":"OK"}]
[{"$f":"IF(A33=\"F\",A33,\"\")","v":""}]
[{"$f":"IF(A34=\"F\",A34,\"\")","v":""},null,null,null,null,0.22,null,null,null,{"$f":"F35+0.1","v":0.32},null,null,null,{"$f":"J35","v":0.32},null,null,null,{"$f":"1-SUM(F35:Q35)","v":0.1399999999999999},null,null,null,{"$f":"IFERROR(E33/100,\"\")","v":0},{"$f":"IF(SUM(F35:U35)=100%,\"OK\",\"ERRO\")","v":"OK"}]
[{"$f":"IF(D36>0,\"F\",\"\")","v":""},"INSTALAÇÕES ESPECIAIS",null,{"$f":"Orçamento!X949","v":0},{"$f":"Orçamento!AA949","v":0},{"$f":"ROUND(F38*$D$36,2)","v":0},null,null,null,{"$f":"ROUND(J38*$D$36,2)","v":0},null,null,null,{"$f":"ROUND(N38*$D$36,2)","v":0},null,null,null,{"$f":"ROUND(R38*$D$36,2)","v":0},null,null,null,{"$f":"SUM(F36:U36)","v":0},{"$f":"IF(D36=V36,\"OK\",\"ERRO\")","v":"OK"}]
[{"$f":"IF(A36=\"F\",A36,\"\")","v":""}]
[{"$f":"IF(A37=\"F\",A37,\"\")","v":""},null,null,null,null,null,null,null,null,null,null,null,null,null,null,null,null,{"$f":"1-N38","v":1},null,null,null,{"$f":"IFERROR(E36/100,\"\")","v":0},{"$f":"IF(SUM(F38:U38)=100%,\"OK\",\"ERRO\")","v":"OK"}]
[{"$f":"IF(D39>0,\"F\",\"\")","v":""},"ALVENARIA E DIVISÓRIAS",null,{"$f":"Orçamento!X950","v":0},{"$f":"Orçamento!AA950","v":0},{"$f":"ROUND(F41*$D$39,2)","v":0},null,null,null,{"$f":"ROUND(J41*$D$39,2)","v":0},null,null,null,{"$f":"ROUND(N41*$D$39,2)","v":0},null,null,null,{"$f":"ROUND(R41*$D$39,2)","v":0},null,null,null,{"$f":"SUM(F39:U39)","v":0},{"$f":"IF(D39=V39,\"OK\",\"ERRO\")","v":"OK"}]
[{"$f":"IF(A39=\"F\",A39,\"\")","v":""}]
[{"$f":"IF(A40=\"F\",A40,\"\")","v":""},null,null,null,null,0.21,null,null,null,{"$f":"F41","v":0.21},null,null,null,{"$f":"J41+0.25","v":0.45999999999999996},null,null,null,{"$f":"1-SUM(F41:Q41)","v":0.12000000000000011},null,null,null,{"$f":"IFERROR(E39/100,\"\")","v":0},{"$f":"IF(SUM(F41:U41)=100%,\"OK\",\"ERRO\")","v":"OK"}]
[{"$f":"IF(D42>0,\"F\",\"\")","v":""},"ALVENARIA AUTO-PORTANTE",null,{"$f":"Orçamento!X951","v":0},{"$f":"Orçamento!AA951","v":0},{"$f":"ROUND(F44*$D$42,2)","v":0},null,null,null,{"$f":"ROUND(J44*$D$42,2)","v":0},null,null,null,{"$f":"ROUND(N44*$D$42,2)","v":0},null,null,null,{"$f":"ROUND(R44*$D$42,2)","v":0},null,null,null,{"$f":"SUM(F42:U42)","v":0}]
[{"$f":"IF(A42=\"F\",A42,\"\")","v":""}]
[{"$f":"IF(A43=\"F\",A43,\"\")","v":""},null,null,null,null,1,null,null,null,{"$f":"1-F44","v":0},null,null,null,{"$f":"1-J44","v":1},null,null,null,{"$f":"1-N44","v":0},null,null,null,{"$f":"IFERROR(E42/100,\"\")","v":0}]
[{"$f":"IF(D45>0,\"F\",\"\")","v":""},"IMPERMEABILIZAÇÃO",null,{"$f":"Orçamento!X952","v":0},{"$f":"Orçamento!AA952","v":0},{"$f":"ROUND(F47*$D$45,2)","v":0},null,null,null,{"$f":"ROUND(J47*$D$45,2)","v":0},null,null,null,{"$f":"ROUND(N47*$D$45,2)","v":0},null,null,null,{"$f":"ROUND(R47*$D$45,2)","v":0},null,null,null,{"$f":"SUM(F45:U45)","v":0},{"$f":"IF(D45=V45,\"OK\",\"ERRO\")","v":"OK"}]
[{"$f":"IF(A45=\"F\",A45,\"\")","v":""}]
[{"$f":"IF(A46=\"F\",A46,\"\")","v":""},null,null,null,null,0.8,null,null,null,0.2,null,null,null,null,null,null,null,null,null,null,null,{"$f":"IFERROR(E45/100,\"\")","v":0},{"$f":"IF(SUM(F47:U47)=100%,\"OK\",\"ERRO\")","v":"OK"}]
[{"$f":"IF(D48>0,\"F\",\"\")","v":""},"ISOLAMENTO TÉRMICO E ACÚSTICO",null,{"$f":"Orçamento!X953","v":0},{"$f":"Orçamento!AA953","v":0},{"$f":"ROUND(F50*$D$48,2)","v":0},null,null,null,{"$f":"ROUND(J50*$D$48,2)","v":0},null,null,null,{"$f":"ROUND(N50*$D$48,2)","v":0},null,null,null,{"$f":"ROUND(R50*$D$48,2)","v":0},null,null,null,{"$f":"SUM(F48:U48)","v":0}]
[{"$f":"IF(A48=\"F\",A48,\"\")","v":""}]
[{"$f":"IF(A49=\"F\",A49,\"\")","v":""},null,null,null,null,0.5,null,null,null,{"$f":"1-F50","v":0.5},null,null,null,{"$f":"1-J50","v":0.5},null,null,null,{"$f":"1-N50","v":0.5},null,null,null,{"$f":"IFERROR(E48/100,\"\")","v":0}]
[{"$f":"IF(D51>0,\"F\",\"\")","v":""},"ESTRUTURA DE MADEIRA",null,{"$f":"Orçamento!X954","v":0},{"$f":"Orçamento!AA954","v":0},{"$f":"ROUND(F53*$D$51,2)","v":0},null,null,null,{"$f":"ROUND(J53*$D$51,2)","v":0},null,null,null,{"$f":"ROUND(N53*$D$51,2)","v":0},null,null,null,{"$f":"ROUND(R53*$D$51,2)","v":0},null,null,null,{"$f":"SUM(F51:U51)","v":0}]
[{"$f":"IF(A51=\"F\",A51,\"\")","v":""}]
[{"$f":"IF(A52=\"F\",A52,\"\")","v":""},null,null,null,null,0.4,null,null,null,{"$f":"1-F53","v":0.6},null,null,null,{"$f":"1-J53","v":0.4},null,null,null,{"$f":"1-N53","v":0.6},null,null,null,{"$f":"IFERROR(E51/100,\"\")","v":0}]
[{"$f":"IF(D54>0,\"F\",\"\")","v":""},"ESTRUTURA METÁLICA",null,{"$f":"Orçamento!X955","v":0},{"$f":"Orçamento!AA955","v":0},{"$f":"ROUND(F56*$D$54,2)","v":0},null,null,null,{"$f":"ROUND(J56*$D$54,2)","v":0},null,null,null,{"$f":"ROUND(N56*$D$54,2)","v":0},null,null,null,{"$f":"ROUND(R56*$D$54,2)","v":0},null,null,null,{"$f":"SUM(F54:U54)","v":0},{"$f":"IF(D54=V54,\"OK\",\"ERRO\")","v":"OK"}]
[{"$f":"IF(A54=\"F\",A54,\"\")","v":""}]
[{"$f":"IF(A55=\"F\",A55,\"\")","v":""},null,null,null,null,0.2,null,null,null,0.8,null,null,null,null,null,null,null,null,null,null,null,{"$f":"IFERROR(E54/100,\"\")","v":0},{"$f":"IF(SUM(F56:U56)=100%,\"OK\",\"ERRO\")","v":"OK"}]
[{"$f":"IF(D57>0,\"F\",\"\")","v":""},"COBERTURAS",null,{"$f":"Orçamento!X956","v":0},{"$f":"Orçamento!AA956","v":0},{"$f":"ROUND(F59*$D$57,2)","v":0},null,null,null,{"$f":"ROUND(J59*$D$57,2)","v":0},null,null,null,{"$f":"ROUND(N59*$D$57,2)","v":0},null,null,null,{"$f":"ROUND(R59*$D$57,2)","v":0},null,null,null,{"$f":"SUM(F57:U57)","v":0},{"$f":"IF(D57=V57,\"OK\",\"ERRO\")","v":"OK"}]
[{"$f":"IF(A57=\"F\",A57,\"\")","v":""}]
[{"$f":"IF(A58=\"F\",A58,\"\")","v":""},null,null,null,null,0,null,null,null,null,null,null,null,null,null,null,null,1,null,null,null,{"$f":"IFERROR(E57/100,\"\")","v":0},{"$f":"IF(SUM(F59:U59)=100%,\"OK\",\"ERRO\")","v":"OK"}]
[{"$f":"IF(D60>0,\"F\",\"\")","v":""},"ESQUADRIAS DE MADEIRA",null,{"$f":"Orçamento!X957","v":0},{"$f":"Orçamento!AA957","v":0},{"$f":"ROUND(F62*$D$60,2)","v":0},null,null,null,{"$f":"ROUND(J62*$D$60,2)","v":0},null,null,null,{"$f":"ROUND(N62*$D$60,2)","v":0},null,null,null,{"$f":"ROUND(R62*$D$60,2)","v":0},null,null,null,{"$f":"SUM(F60:U60)","v":0}]
[{"$f":"IF(A60=\"F\",A60,\"\")","v":""}]
[{"$f":"IF(A61=\"F\",A61,\"\")","v":""},null,null,null,null,0.54,null,null,null,{"$f":"1-F62","v":0.45999999999999996},null,null,null,{"$f":"1-J62","v":0.54},null,null,null,{"$f":"1-N62","v":0.45999999999999996},null,null,null,{"$f":"IFERROR(E60/100,\"\")","v":0}]
[{"$f":"IF(D63>0,\"F\",\"\")","v":""},"ESQUADRIAS METÁLICAS",null,{"$f":"Orçamento!X958","v":0},{"$f":"Orçamento!AA958","v":0},{"$f":"ROUND(F65*$D$63,2)","v":0},null,null,null,{"$f":"ROUND(J65*$D$63,2)","v":0},null,null,null,{"$f":"ROUND(N65*$D$63,2)","v":0},null,null,null,{"$f":"ROUND(R65*$D$63,2)","v":0},null,null,null,{"$f":"SUM(F63:U63)","v":0},{"$f":"IF(D63=V63,\"OK\",\"ERRO\")","v":"OK"}]
[{"$f":"IF(A63=\"F\",A63,\"\")","v":""}]
[{"$f":"IF(A64=\"F\",A64,\"\")","v":""},null,null,null,null,null,null,null,null,null,null,null,null,0.2,null,null,null,0.8,null,null,null,{"$f":"IFERROR(E63/100,\"\")","v":0},{"$f":"IF(SUM(F65:U65)=100%,\"OK\",\"ERRO\")","v":"OK"}]
[{"$f":"IF(D66>0,\"F\",\"\")","v":""},"VIDROS",null,{"$f":"Orçamento!X959","v":0},{"$f":"Orçamento!AA959","v":0},{"$f":"ROUND(F68*$D$66,2)","v":0},null,null,null,{"$f":"ROUND(J68*$D$66,2)","v":0},null,null,null,{"$f":"ROUND(N68*$D$66,2)","v":0},null,null,null,{"$f":"ROUND(R68*$D$66,2)","v":0},null,null,null,{"$f":"SUM(F66:U66)","v":0},{"$f":"IF(D66=V66,\"OK\",\"ERRO\")","v":"OK"}]
[{"$f":"IF(A66=\"F\",A66,\"\")","v":""}]
[{"$f":"IF(A67=\"F\",A67,\"\")","v":""},null,null,null,null,0,null,null,null,null,null,null,null,null,null,null,null,{"$f":"1-N68","v":1},null,null,null,{"$f":"IFERROR(E66/100,\"\")","v":0},{"$f":"IF(SUM(F68:U68)=100%,\"OK\",\"ERRO\")","v":"OK"}]
[{"$f":"IF(D69>0,\"F\",\"\")","v":""},"REVESTIMENTO DE PAREDE",null,{"$f":"Orçamento!X960","v":0},{"$f":"Orçamento!AA960","v":0},{"$f":"ROUND(F71*$D$69,2)","v":0},null,null,null,{"$f":"ROUND(J71*$D$69,2)","v":0},null,null,null,{"$f":"D69-F69-J69-R69","v":0},null,null,null,{"$f":"ROUND(R71*$D$69,2)","v":0},null,null,null,{"$f":"SUM(F69:U69)","v":0},{"$f":"IF(D69=V69,\"OK\",\"ERRO\")","v":"OK"}]
[{"$f":"IF(A69=\"F\",A69,\"\")","v":""}]
[{"$f":"IF(A70=\"F\",A70,\"\")","v":""},null,null,null,null,0.19,null,null,null,0.21,null,null,null,0.5,null,null,null,0.1,null,null,null,{"$f":"IFERROR(E69/100,\"\")","v":0},{"$f":"IF(SUM(F71:U71)=100%,\"OK\",\"ERRO\")","v":"OK"}]
[{"$f":"IF(D72>0,\"F\",\"\")","v":""},"FORROS",null,{"$f":"Orçamento!X961","v":0},{"$f":"Orçamento!AA961","v":0},{"$f":"ROUND(F74*$D$72,2)","v":0},null,null,null,{"$f":"ROUND(J74*$D$72,2)","v":0},null,null,null,{"$f":"ROUND(N74*$D$72,2)","v":0},null,null,null,{"$f":"ROUND(R74*$D$72,2)","v":0},null,null,null,{"$f":"SUM(F72:U72)","v":0},{"$f":"IF(D72=V72,\"OK\",\"ERRO\")","v":"OK"}]
[{"$f":"IF(A72=\"F\",A72,\"\")","v":""}]
[{"$f":"IF(A73=\"F\",A73,\"\")","v":""},null,null,null,null,null,null,null,null,null,null,null,null,null,null,null,null,{"$f":"1-N74","v":1},null,null,null,{"$f":"IFERROR(E72/100,\"\")","v":0},{"$f":"IF(SUM(F74:U74)=100%,\"OK\",\"ERRO\")","v":"OK"}]
[{"$f":"IF(D75>0,\"F\",\"\")","v":""},"REVESTIMENTO DE PISO",null,{"$f":"Orçamento!X962","v":0},{"$f":"Orçamento!AA962","v":0},{"$f":"ROUND(F77*$D$75,2)","v":0},null,null,null,{"$f":"ROUND(J77*$D$75,2)","v":0},null,null,null,{"$f":"ROUND(N77*$D$75,2)","v":0},null,null,null,{"$f":"ROUND(R77*$D$75,2)","v":0},null,null,null,{"$f":"SUM(F75:U75)","v":0},{"$f":"IF(D75=V75,\"OK\",\"ERRO\")","v":"OK"}]
[{"$f":"IF(A75=\"F\",A75,\"\")","v":""}]
[{"$f":"IF(A76=\"F\",A76,\"\")","v":""},null,null,null,null,0.11,null,null,null,{"$f":"F77+0.2","v":0.31},null,null,null,{"$f":"J77+0.1","v":0.41000000000000003},null,null,null,{"$f":"1-SUM(F77:Q77)","v":0.16999999999999993},null,null,null,{"$f":"IFERROR(E75/100,\"\")","v":0},{"$f":"IF(SUM(F77:U77)=100%,\"OK\",\"ERRO\")","v":"OK"}]
[{"$f":"IF(D78>0,\"F\",\"\")","v":""},"FERRAGENS",null,{"$f":"Orçamento!X963","v":0},{"$f":"Orçamento!AA963","v":0},{"$f":"ROUND(F80*$D$78,2)","v":0},null,null,null,{"$f":"ROUND(J80*$D$78,2)","v":0},null,null,null,{"$f":"ROUND(N80*$D$78,2)","v":0},null,null,null,{"$f":"ROUND(R80*$D$78,2)","v":0},null,null,null,{"$f":"SUM(F78:U78)","v":0},{"$f":"IF(D78=V78,\"OK\",\"ERRO\")","v":"OK"}]
[{"$f":"IF(A78=\"F\",A78,\"\")","v":""}]
[{"$f":"IF(A79=\"F\",A79,\"\")","v":""},null,null,null,null,0,null,null,null,null,null,null,null,null,null,null,null,{"$f":"1-N80","v":1},null,null,null,{"$f":"IFERROR(E78/100,\"\")","v":0},{"$f":"IF(SUM(F80:U80)=100%,\"OK\",\"ERRO\")","v":"OK"}]
[{"$f":"IF(D81>0,\"F\",\"\")","v":""},"MARCENARIA",null,{"$f":"Orçamento!X964","v":0},{"$f":"Orçamento!AA964","v":0},{"$f":"ROUND(F83*$D$81,2)","v":0},null,null,null,{"$f":"ROUND(J83*$D$81,2)","v":0},null,null,null,{"$f":"ROUND(N83*$D$81,2)","v":0},null,null,null,{"$f":"ROUND(R83*$D$81,2)","v":0},null,null,null,{"$f":"SUM(F81:U81)","v":0},{"$f":"IF(D81=V81,\"OK\",\"ERRO\")","v":"OK"}]
[{"$f":"IF(A81=\"F\",A81,\"\")","v":""}]
[{"$f":"IF(A82=\"F\",A82,\"\")","v":""},null,null,null,null,null,null,null,null,null,null,null,null,0.4,null,null,null,0.6,null,null,null,{"$f":"IFERROR(E81/100,\"\")","v":0},{"$f":"IF(SUM(F83:U83)=100%,\"OK\",\"ERRO\")","v":"OK"}]
[{"$f":"IF(D84>0,\"F\",\"\")","v":""},"ADMINISTRAÇÃO - MENSALISTAS",null,{"$f":"Orçamento!X965","v":0},{"$f":"Orçamento!AA965","v":0},{"$f":"ROUND(F86*$D$84,2)","v":0},null,null,null,{"$f":"ROUND(J86*$D$84,2)","v":0},null,null,null,{"$f":"ROUND(N86*$D$84,2)","v":0},null,null,null,{"$f":"ROUND(R86*$D$84,2)","v":0},null,null,null,{"$f":"SUM(F84:U84)","v":0},{"$f":"IF(D84=V84,\"OK\",\"ERRO\")","v":"OK"}]
[{"$f":"IF(A84=\"F\",A84,\"\")","v":""}]
[{"$f":"IF(A85=\"F\",A85,\"\")","v":""},null,null,null,null,0.25,null,null,null,0.25,null,null,null,0.25,null,null,null,0.25,null,null,null,{"$f":"IFERROR(E84/100,\"\")","v":0},{"$f":"IF(SUM(F86:U86)=100%,\"OK\",\"ERRO\")","v":"OK"}]
[{"$f":"IF(D87>0,\"F\",\"\")","v":""},"PINTURA",null,{"$f":"Orçamento!X966","v":0},{"$f":"Orçamento!AA966","v":0},{"$f":"ROUND(F89*$D$87,2)","v":0},null,null,null,{"$f":"ROUND(J89*$D$87,2)","v":0},null,null,null,{"$f":"ROUND(N89*$D$87,2)","v":0},null,null,null,{"$f":"ROUND(R89*$D$87,2)","v":0},null,null,null,{"$f":"SUM(F87:U87)","v":0},{"$f":"IF(D87=V87,\"OK\",\"ERRO\")","v":"OK"}]
[{"$f":"IF(A87=\"F\",A87,\"\")","v":""}]
[{"$f":"IF(A88=\"F\",A88,\"\")","v":""},null,null,null,null,0,null,null,null,null,null,null,null,0.6,null,null,null,0.4,null,null,null,{"$f":"IFERROR(E87/100,\"\")","v":0},{"$f":"IF(SUM(F89:U89)=100%,\"OK\",\"ERRO\")","v":"OK"}]
[{"$f":"IF(D90>0,\"F\",\"\")","v":""},"DIVERSOS",null,{"$f":"Orçamento!X967","v":0},{"$f":"Orçamento!AA967","v":0},{"$f":"D90-J90-N90-R90","v":0},null,null,null,{"$f":"ROUND(J92*$D$90,2)","v":0},null,null,null,{"$f":"ROUND(N92*$D$90,2)","v":0},null,null,null,{"$f":"ROUND(R92*$D$90,2)","v":0},null,null,null,{"$f":"SUM(F90:U90)","v":0},{"$f":"IF(D90=V90,\"OK\",\"ERRO\")","v":"OK"}]
[{"$f":"IF(A90=\"F\",A90,\"\")","v":""}]
[{"$f":"IF(A91=\"F\",A91,\"\")","v":""},null,null,null,null,0.27,null,null,null,0.23,null,null,null,0.27,null,null,null,0.23,null,null,null,{"$f":"IFERROR(E90/100,\"\")","v":0},{"$f":"IF(SUM(F92:U92)=100%,\"OK\",\"ERRO\")","v":"OK"}]
["F","CUSTO DO ORÇAMENTO",null,{"$f":"SUM(D15:D92)","v":0},{"$f":"SUM(E15:E92)","v":0},{"$f":"F15+F18+F21+F24+F27+F30+F33+F36+F39+F42+F45+F48+F51+F54+F57+F60+F63+F66+F69+F72+F75+F78+F81+F84+F87+F90","v":0},null,null,null,{"$f":"J15+J18+J21+J24+J27+J30+J33+J36+J39+J42+J45+J48+J51+J54+J57+J60+J63+J66+J69+J72+J75+J78+J81+J84+J87+J90","v":0},null,null,null,{"$f":"N15+N18+N21+N24+N27+N30+N33+N36+N39+N42+N45+N48+N51+N54+N57+N60+N63+N66+N69+N72+N75+N78+N81+N84+N87+N90","v":0},null,null,null,{"$f":"R15+R18+R21+R24+R27+R30+R33+R36+R39+R42+R45+R48+R51+R54+R57+R60+R63+R66+R69+R72+R75+R78+R81+R84+R87+R90","v":0},null,null,null,{"$f":"V15+V18+V21+V24+V27+V30+V33+V36+V39+V42+V45+V48+V51+V54+V57+V60+V63+V66+V69+V72+V75+V78+V81+V84+V87+V90","v":0}]
["F","PERCENTUAIS:",null,null,null,{"$f":"IFERROR(F93/D93,\"\")","v":""},null,null,null,{"$f":"IFERROR(J93/D93,\"\")","v":""},null,null,null,{"$f":"IFERROR(N93/D93,\"\")","v":""},null,null,null,{"$f":"IFERROR(R93/D93,\"\")","v":""},null,null,null,{"$f":"SUM(F94:U94)","v":0}]
["F","TOTAIS ACUMULADOS:",null,null,null,{"$f":"F93","v":0},null,null,null,{"$f":"F95+J93","v":0},null,null,null,{"$f":"J95+N93","v":0},null,null,null,{"$f":"N95+R93","v":0}]
["F","PERCENTUAIS  ACUMULADOS:",null,null,null,{"$f":"F94","v":""},null,null,null,{"$f":"IFERROR(F96+J94,\"\")","v":""},null,null,null,{"$f":"IFERROR(J96+N94,\"\")","v":""},null,null,null,{"$f":"IFERROR(N96+R94,\"\")","v":""}]
["F"]
["F","OBSERVAÇÕES:"]
["F","Os pagamentos somente poderão ser efetuados mediante medição e atesto pelos técnicos da Secretaria da Educação. "]

{"sheet":"Composição BDI","index":4,"n_rows":45,"n_cols":9,"rows_kept":45,"cut":false,"hidden":false,"merged":[[18,5,18,8],[17,0,17,3],[16,0,16,3],[44,0,44,3],[42,0,42,3],[43,0,43,3],[18,0,18,3],[36,0,36,3],[39,0,39,3],[38,0,38,3],[40,0,40,3],[29,0,29,2],[32,0,32,3],[33,0,33,3],[34,0,34,3],[35,0,35,3],[0,0,0,3],[2,0,2,3],[3,0,3,3],[1,0,1,3],[5,0,5,3],[4,0,4,3],[12,0,12,3],[13,0,13,3],[14,0,14,3],[15,0,15,3],[6,0,6,3],[8,0,8,3],[7,0,7,3],[9,0,9,3],[11,0,11,3],[10,0,10,3]]}
[]
[]
["UNIDADE ESCOLAR"]
[{"$f":"Orçamento!$O$4","v":"COLÉGIO ESTADUAL MARIA EULÁLIA DE JESUS PORTILHO"}]
[]
["OBRA"]
[{"$f":"Orçamento!$O$7","v":0}]
[]
["ENDEREÇO"]
[{"$f":"Orçamento!$R$10","v":"AV BRASIL CENTRAL 1440, CENTRO, CEP:76230-000"}]
[]
["CIDADE"]
[{"$f":"Orçamento!$X$7","v":"PIRANHAS"}]
[]
["CRE"]
[{"$f":"Orçamento!$O$10","v":"PIRANHAS"}]
[]
["DETALHAMENTO DA COMPOSIÇÃO DE BDI"]
["COMPOSIÇÃO BDI PARA OBRAS CIVIS",null,null,null,null,"BDI CONSTRUÇÃO E REFORMA"]
["DESCRIÇÃO","COEF.","TAXA % (a.m)","% no preço de venda",null,"Situação","1º Quartil","Médio","3º Quartil"]
["1) COFINS",1,0.03,{"$f":"C21","v":0.03},null,{"$f":"IF(OR(C21<G21,C21>I21),\"FORA DO INTERVALO\",\"OK\")","v":"OK"},0.03,0.03,0.03]
["2) PIS",1,6.4999999999999997E-3,{"$f":"C22","v":6.4999999999999997E-3},null,{"$f":"IF(OR(C22<G22,C22>I22),\"FORA DO INTERVALO\",\"OK\")","v":"OK"},6.4999999999999997E-3,6.4999999999999997E-3,6.4999999999999997E-3]
["3) ISSQN",1,2.5000000000000001E-2,{"$f":"C23*B23","v":2.5000000000000001E-2},null,"OK",0.02,3.5000000000000003E-2,0.05]
["4) CPRB",1,0,{"$f":"C24","v":0},null,"FORA DO INTERVALO",4.4999999999999998E-2,4.4999999999999998E-2,4.4999999999999998E-2]
["5) Administração Central",1,0.04,0.04,null,"OK",0.03,0.04,5.5E-2]
["6) Despesas Financeiras",1,5.5999999999999999E-3,5.5999999999999999E-3,null,"FORA DO INTERVALO",5.8999999999999999E-3,1.23E-2,1.3899999999999999E-2]
["7) Seguros + Garantias",1,1.1999999999999999E-3,1.1999999999999999E-3,null,"FORA DO INTERVALO",8.0000000000000002E-3,8.0000000000000002E-3,0.01]
["8) Risco",1,9.7000000000000003E-3,9.7000000000000003E-3,null,"OK",9.7000000000000003E-3,1.2699999999999999E-2,1.2699999999999999E-2]
["9) Lucro",1,6.8699999999999997E-2,6.8699999999999997E-2,null,"OK",6.1600000000000002E-2,7.3999999999999996E-2,8.9599999999999999E-2]
["BDI - FINAL",null,null,{"$f":"(((1+D25+D27+D28)*(1+D26)*(1+D29))/(1-(D21+D22+D23+D24))-1)","v":0.2033949624379332},null,"FORA DO INTERVALO",0.2034,0.22120000000000001,0.25]
[]
["Notas:"]
["(1) e (2) Alíquota definida por lei."]
["(3) Alíquota e base de cálculo definidas pela legislação municipal."]
["(4) Alíquota definida pelas leis 12.546/11, 12844/13 e 13.161/15 (CPRB – contribuição previdenciária sobre a receita bruta)."]
["(5) Valores definidos a partir dos limites no Acórdão nº 2.622/2013 - TCU – Plenário. Valores entre o 1º e 3º quartis."]
["(6) Valor calculado pela expressão matemática do acórdão 2.369/2011 – TCU – Plenário e disponibilizado pela AGETOP em dezembro de 2018. (Foi utilizado para o cálculo a média da Taxa SELIC no período de 11/2017 a 10/2018)"]
[]
["(7) Valores definidos pela AGETOP a partir dos limites no Acórdão nº 2.622/2013 - TCU – Plenário. Valores médios. \n\nObservação da AGETOP: (Seguros contra erros de execução, incêndio e explosão, danos da natureza (vendaval, destelhamento, alagamento, inundação, desmoronamento, geadas etc.), emprego de material defeituoso ou inadequado, roubo e/ou furto qualificado, quebra de equipamentos, desmoronamento de estrutura, nas modalidades de Obras Civis em Construção (OCC); Instalação e Montagem (IM); e Obras Civis em Construção e Instalação e Montagem (OCC/IM). Bem como coberturas adicionais para ampliação dessas coberturas básicas, como: cobertura de responsabilidade civil geral, cobertura de responsabilidade civil cruzada, cobertura de despesas extraordinárias, cobertura de tumultos, cobertura de desentulho do local, cobertura de riscos do fabricante, dentre outras, incluindo o seguro de vida em grupo regido pela convenção coletiva dos trabalhadores na indústria da construção civil). A partir de 24/02/2015 por intermédio da Portaria 449/2015 a Presidência da AGETOP, na pessoa do Senhor Jayme Eduardo Rincon, determinou a exclusão dos valores referentes aos Seguros de Risco de Engenharia e Responsabilidade Civil do Profissional na composição do cálculo do B.D.I.."]
["(8) Valores definidos a partir dos limites no Acórdão nº 2.622/2013 - TCU – Plenário. Valores entre 1º e 3° quartis."]
["(9) Valores definidos a partir dos limites definidos no Acórdão nº 2.622/2013 - TCU – Plenário. Valores adotados e praticados no mercado ( “ ex ante ” ) ou aqueles entre os 1º e 3º quartis."]
[]
["(*) A fórmula para estipulação da taxa de BDI estimado adotado é a mesma que foi aplicada para a obtenção das tabelas contidas no Acórdão n. 2.622/2013 – TCUPlenário"]
[]
["Obs.: Para obras com valores superiores a R$ 20.000.000,00 sugere-se recalcular o BDI, dimensionando as taxas de administração central e lucro para patamares inferiores ao estipulado acima."]

{"sheet":"Relatório CENTRAL","index":5,"n_rows":40,"n_cols":5,"rows_kept":40,"cut":false,"hidden":false,"merged":[[9,0,11,0],[0,1,0,4],[6,3,6,4],[9,3,9,4],[1,1,1,4],[2,1,2,2],[2,3,2,4],[3,1,3,2],[3,3,3,4],[4,1,4,4],[5,1,5,2],[5,3,5,4],[6,1,6,2],[7,1,7,4],[8,1,8,2],[8,3,8,4],[9,1,9,2],[10,1,10,4],[11,1,11,4],[39,1,39,2]]}
[]
[]
[null,"UNIDADE ESCOLAR",null,"CIDADE"]
[null,{"$f":"Orçamento!$O$4","v":"COLÉGIO ESTADUAL MARIA EULÁLIA DE JESUS PORTILHO"},null,{"$f":"Orçamento!$X$7","v":"PIRANHAS"}]
[]
[null,"OBRA",null,"CRE"]
[null,{"$f":"Orçamento!$O$7","v":0},null,{"$f":"Orçamento!$O$10","v":"PIRANHAS"}]
[]
[null,"ENDEREÇO",null,"DATA"]
["FILTRO",{"$f":"Orçamento!$R$10","v":"AV BRASIL CENTRAL 1440, CENTRO, CEP:76230-000"},null,{"$f":"Orçamento!$S$7","v":"2020-03-26"}]
[]
[null,"RELATÓRIO CENTRAL"]
["↓","CÓDIGO","ETAPA","PREÇO  (R$) C/ BDI","PARTIC  ( % )"]
[{"$f":"IF(D14>0,\"F\",\"\")","v":""},{"$f":"Orçamento!O942","v":"a."},{"$f":"Orçamento!P942","v":"SERVIÇOS PRELIMINARES"},{"$f":"Orçamento!X942","v":0},{"$f":"Orçamento!AA942","v":0}]
[{"$f":"IF(D15>0,\"F\",\"\")","v":""},{"$f":"Orçamento!O943","v":"b."},{"$f":"Orçamento!P943","v":"TRANSPORTES"},{"$f":"Orçamento!X943","v":0},{"$f":"Orçamento!AA943","v":0}]
["",{"$f":"Orçamento!O944","v":"c."},{"$f":"Orçamento!P944","v":"SERVIÇO EM TERRA"},{"$f":"Orçamento!X944","v":0},{"$f":"Orçamento!AA944","v":0}]
["",{"$f":"Orçamento!O945","v":"d."},{"$f":"Orçamento!P945","v":"FUNDAÇÕES E SONDAGENS"},{"$f":"Orçamento!X945","v":0},{"$f":"Orçamento!AA945","v":0}]
["",{"$f":"Orçamento!O946","v":"e."},{"$f":"Orçamento!P946","v":"ESTRUTURA"},{"$f":"Orçamento!X946","v":0},{"$f":"Orçamento!AA946","v":0}]
["",{"$f":"Orçamento!O947","v":"f."},{"$f":"Orçamento!P947","v":"INSTALAÇÕES ELÉTRICAS"},{"$f":"Orçamento!X947","v":0},{"$f":"Orçamento!AA947","v":0}]
["",{"$f":"Orçamento!O948","v":"g."},{"$f":"Orçamento!P948","v":"INSTALAÇÕES HIDROSSANITÁRIAS"},{"$f":"Orçamento!X948","v":0},{"$f":"Orçamento!AA948","v":0}]
["",{"$f":"Orçamento!O949","v":"h"},{"$f":"Orçamento!P949","v":"INSTALAÇÕES ESPECIAIS"},{"$f":"Orçamento!X949","v":0},{"$f":"Orçamento!AA949","v":0}]
["",{"$f":"Orçamento!O950","v":"i."},{"$f":"Orçamento!P950","v":"ALVENARIAS E DIVISÓRIAS"},{"$f":"Orçamento!X950","v":0},{"$f":"Orçamento!AA950","v":0}]
["",{"$f":"Orçamento!O951","v":"j."},{"$f":"Orçamento!P951","v":"ALVENARIA AUTO-PORTANTE"},{"$f":"Orçamento!X951","v":0},{"$f":"Orçamento!AA951","v":0}]
["",{"$f":"Orçamento!O952","v":"k."},{"$f":"Orçamento!P952","v":"IMPERMEABILIZAÇÃO"},{"$f":"Orçamento!X952","v":0},{"$f":"Orçamento!AA952","v":0}]
["",{"$f":"Orçamento!O953","v":"l."},{"$f":"Orçamento!P953","v":"ISOLAMENTO TÉRMICO E ACÚSTICO"},{"$f":"Orçamento!X953","v":0},{"$f":"Orçamento!AA953","v":0}]
["",{"$f":"Orçamento!O954","v":"m."},{"$f":"Orçamento!P954","v":"ESTRUTURA DE MADEIRA"},{"$f":"Orçamento!X954","v":0},{"$f":"Orçamento!AA954","v":0}]
["",{"$f":"Orçamento!O955","v":"n."},{"$f":"Orçamento!P955","v":"ESTRUTURAS METÁLICAS"},{"$f":"Orçamento!X955","v":0},{"$f":"Orçamento!AA955","v":0}]
["",{"$f":"Orçamento!O956","v":"o."},{"$f":"Orçamento!P956","v":"COBERTURAS"},{"$f":"Orçamento!X956","v":0},{"$f":"Orçamento!AA956","v":0}]
["",{"$f":"Orçamento!O957","v":"p."},{"$f":"Orçamento!P957","v":"ESQUADRIAS DE MADEIRA"},{"$f":"Orçamento!X957","v":0},{"$f":"Orçamento!AA957","v":0}]
["",{"$f":"Orçamento!O958","v":"q."},{"$f":"Orçamento!P958","v":"ESQUADRIAS METÁLICAS"},{"$f":"Orçamento!X958","v":0},{"$f":"Orçamento!AA958","v":0}]
["",{"$f":"Orçamento!O959","v":"r."},{"$f":"Orçamento!P959","v":"VIDROS"},{"$f":"Orçamento!X959","v":0},{"$f":"Orçamento!AA959","v":0}]
["",{"$f":"Orçamento!O960","v":"s."},{"$f":"Orçamento!P960","v":"REVESTIMENTO DE PAREDE"},{"$f":"Orçamento!X960","v":0},{"$f":"Orçamento!AA960","v":0}]
["",{"$f":"Orçamento!O961","v":"t."},{"$f":"Orçamento!P961","v":"FORROS"},{"$f":"Orçamento!X961","v":0},{"$f":"Orçamento!AA961","v":0}]
["",{"$f":"Orçamento!O962","v":"u."},{"$f":"Orçamento!P962","v":"REVESTIMENTO DE PISO"},{"$f":"Orçamento!X962","v":0},{"$f":"Orçamento!AA962","v":0}]
["",{"$f":"Orçamento!O963","v":"v."},{"$f":"Orçamento!P963","v":"FERRAGENS"},{"$f":"Orçamento!X963","v":0},{"$f":"Orçamento!AA963","v":0}]
["",{"$f":"Orçamento!O964","v":"w."},{"$f":"Orçamento!P964","v":"MARCENARIA"},{"$f":"Orçamento!X964","v":0},{"$f":"Orçamento!AA964","v":0}]
["",{"$f":"Orçamento!O965","v":"x."},{"$f":"Orçamento!P965","v":"ADMINISTRAÇÃO"},{"$f":"Orçamento!X965","v":0},{"$f":"Orçamento!AA965","v":0}]
["",{"$f":"Orçamento!O966","v":"y."},{"$f":"Orçamento!P966","v":"PINTURA"},{"$f":"Orçamento!X966","v":0},{"$f":"Orçamento!AA966","v":0}]
["",{"$f":"Orçamento!O967","v":"z."},{"$f":"Orçamento!P967","v":"DIVERSOS"},{"$f":"Orçamento!X967","v":0},{"$f":"Orçamento!AA967","v":0}]
["F","TOTAL GERAL DO ORÇAMENTO (R$) C/BDI",null,{"$f":"SUM(D14:D39)","v":0},{"$f":"SUM(E14:E39)","v":0}]

{"sheet":"Parc Maior Relev","index":6,"n_rows":18,"n_cols":7,"rows_kept":18,"cut":false,"hidden":false,"merged":[[0,1,0,6],[11,1,11,6],[1,1,1,6],[2,1,2,3],[2,4,2,6],[3,1,3,3],[3,4,3,6],[4,1,4,6],[5,1,5,3],[5,4,5,6],[9,1,9,3],[9,4,9,6],[10,1,10,6],[6,1,6,3],[6,4,6,6],[7,1,7,6],[10,0,12,0],[8,1,8,3],[8,4,8,6],[18,3,18,7],[16,1,16,6]]}
[]
[]
[null,"UNIDADE ESCOLAR",null,null,"CÓDIGO INEP"]
[null,{"$f":"Orçamento!$O$4","v":"COLÉGIO ESTADUAL MARIA EULÁLIA DE JESUS PORTILHO"},null,null,{"$f":"Orçamento!$X$4","v":52005720}]
[]
[null,"OBRA",null,null,"CIDADE"]
[null,{"$f":"Orçamento!$O$7","v":0},null,null,{"$f":"Orçamento!$X$7","v":"PIRANHAS"}]
[]
[null,"CRE",null,null,"ÁREA TOTAL CONSTRUÍDA (M²)"]
[null,{"$f":"Orçamento!$O$10","v":"PIRANHAS"},null,null,{"$f":"Orçamento!$S$13","v":3189.69}]
["FILTRO"]
[null,"PARCELA DE MAIOR RELEVÂNCIA"]
[null,"CÓDIGO","SERVIÇO","DESCRIÇÃO","UNID","QUANT","PARC. MAIOR RELEV (50%)"]
[{"$f":"IF(F14>0,\"F\",\"\")","v":"F"},{"$f":"Somatório!B37","v":"u."},{"$f":"IFERROR(VLOOKUP(B14,Orçamento!$O$942:$P$967,2,FALSE),\"(inserir código ao lado)\")","v":"REVESTIMENTO DE PISO"},"PISO GRANITINA","M²",{"$f":"63.31+144.74+89.67+154+20.16","v":471.88000000000005},{"$f":"F14*0.5","v":235.94000000000003}]
[{"$f":"IF(F15>0,\"F\",\"\")","v":"F"},{"$f":"Somatório!B31","v":"o."},{"$f":"IFERROR(VLOOKUP(B15,Orçamento!$O$942:$P$967,2,FALSE),\"(inserir código ao lado)\")","v":"COBERTURAS"},"COBERTURA CERÂMICA","M²",{"$f":"543.73+182.07+124.64+205.67","v":1056.1099999999999},528.05499999999995]
["F"]
["F","(*) Para os fins do inciso I dp § 1º do Art. 30 da Lei Federal 8.666/93, são consideradas parcelas de maior relevância técnica as execuções apresentadas"]
["F"]

{"sheet":"Composições","index":7,"n_rows":539,"n_cols":10,"rows_kept":539,"cut":false,"hidden":false,"merged":[[15,0,15,9],[13,0,13,2],[13,3,13,6],[1,0,1,9],[3,7,3,9],[4,7,4,9],[6,7,6,9],[7,7,7,9],[6,0,6,6],[10,8,10,9],[13,8,13,9],[14,0,14,9],[8,0,8,9],[5,0,5,9],[2,0,2,9],[0,0,0,8],[10,0,10,2],[10,3,10,6],[11,0,11,9],[12,0,12,2],[12,3,12,6],[12,7,12,8],[7,0,7,6],[9,0,9,2],[9,3,9,6],[9,7,9,8],[3,0,3,6],[4,0,4,6],[16,5,17,5],[16,6,16,7],[16,8,16,9],[22,1,22,7],[26,1,26,7],[16,0,17,0],[16,1,17,1],[16,2,17,2],[16,3,17,3],[16,4,17,4],[28,5,29,5],[28,6,28,7],[28,8,28,9],[34,1,34,7],[38,1,38,7],[28,0,29,0],[28,1,29,1],[28,2,29,2],[28,3,29,3],[28,4,29,4],[40,5,41,5],[40,6,40,7],[40,8,40,9],[46,1,46,7],[50,1,50,7],[40,0,41,0],[40,1,41,1],[40,2,41,2],[40,3,41,3],[40,4,41,4],[52,5,53,5],[52,6,52,7],[52,8,52,9],[58,1,58,7],[62,1,62,7],[52,0,53,0],[52,1,53,1],[52,2,53,2],[52,3,53,3],[52,4,53,4],[64,5,65,5],[64,6,64,7],[64,8,64,9],[70,1,70,7],[74,1,74,7],[64,0,65,0],[64,1,65,1],[64,2,65,2],[64,3,65,3],[64,4,65,4],[76,5,77,5],[76,6,76,7],[76,8,76,9],[82,1,82,7],[86,1,86,7],[76,0,77,0],[76,1,77,1],[76,2,77,2],[76,3,77,3],[76,4,77,4],[88,5,89,5],[88,6,88,7],[88,8,88,9],[94,1,94,7],[98,1,98,7],[88,0,89,0],[88,1,89,1],[88,2,89,2],[88,3,89,3],[88,4,89,4],[100,5,101,5],[100,6,100,7],[100,8,100,9],[106,1,106,7],[110,1,110,7],[100,0,101,0],[100,1,101,1],[100,2,101,2],[100,3,101,3],[100,4,101,4],[112,5,113,5],[112,6,112,7],[112,8,112,9],[118,1,118,7],[122,1,122,7],[112,0,113,0],[112,1,113,1],[112,2,113,2],[112,3,113,3],[112,4,113,4],[124,5,125,5],[124,6,124,7],[124,8,124,9],[130,1,130,7],[134,1,134,7],[124,0,125,0],[124,1,125,1],[124,2,125,2],[124,3,125,3],[124,4,125,4],[136,5,137,5],[136,6,136,7],[136,8,136,9],[142,1,142,7],[146,1,146,7],[136,0,137,0],[136,1,137,1],[136,2,137,2],[136,3,137,3],[136,4,137,4],[148,5,149,5],[148,6,148,7],[148,8,148,9],[153,1,153,7],[156,1,156,7],[148,0,149,0],[148,1,149,1],[148,2,149,2],[148,3,149,3],[148,4,149,4],[158,5,159,5],[158,6,158,7],[158,8,158,9],[163,1,163,7],[166,1,166,7],[158,0,159,0],[158,1,159,1],[158,2,159,2],[158,3,159,3],[158,4,159,4],[168,5,169,5],[168,6,168,7],[168,8,168,9],[174,1,174,7],[178,1,178,7],[168,0,169,0],[168,1,169,1],[168,2,169,2],[168,3,169,3],[168,4,169,4],[180,5,181,5],[180,6,180,7],[180,8,180,9],[186,1,186,7],[190,1,190,7],[180,0,181,0],[180,1,181,1],[180,2,181,2],[180,3,181,3],[180,4,181,4],[192,5,193,5],[192,6,192,7],[192,8,192,9],[198,1,198,7],[202,1,202,7],[192,0,193,0],[192,1,193,1],[192,2,193,2],[192,3,193,3],[192,4,193,4],[204,5,205,5],[204,6,204,7],[204,8,204,9],[210,1,210,7],[214,1,214,7],[204,0,205,0],[204,1,205,1],[204,2,205,2],[204,3,205,3],[204,4,205,4],[216,5,217,5],[216,6,216,7],[216,8,216,9],[222,1,222,7],[226,1,226,7],[216,0,217,0],[216,1,217,1],[216,2,217,2],[216,3,217,3],[216,4,217,4],[228,5,229,5],[228,6,228,7],[228,8,228,9],[234,1,234,7],[238,1,238,7],[228,0,229,0],[228,1,229,1],[228,2,229,2],[228,3,229,3],[228,4,229,4],[240,5,241,5],[240,6,240,7],[240,8,240,9],[246,1,246,7],[250,1,250,7],[240,0,241,0],[240,1,241,1],[240,2,241,2],[240,3,241,3],[240,4,241,4],[252,5,253,5],[252,6,252,7],[252,8,252,9],[256,1,256,7],[260,1,260,7],[252,0,253,0],[252,1,253,1],[252,2,253,2],[252,3,253,3],[252,4,253,4],[262,5,263,5],[262,6,262,7],[262,8,262,9],[268,1,268,7],[275,1,275,7],[262,0,263,0],[262,1,263,1],[262,2,263,2],[262,3,263,3],[262,4,263,4],[277,5,278,5],[277,6,277,7],[277,8,277,9],[283,1,283,7],[287,1,287,7],[277,0,278,0],[277,1,278,1],[277,2,278,2],[277,3,278,3],[277,4,278,4],[289,5,290,5],[289,6,289,7],[289,8,289,9],[295,1,295,7],[299,1,299,7],[289,0,290,0],[289,1,290,1],[289,2,290,2],[289,3,290,3],[289,4,290,4],[301,5,302,5],[301,6,301,7],[301,8,301,9],[307,1,307,7],[311,1,311,7],[301,0,302,0],[301,1,302,1],[301,2,302,2],[301,3,302,3],[301,4,302,4],[313,5,314,5],[313,6,313,7],[313,8,313,9],[319,1,319,7],[323,1,323,7],[313,0,314,0],[313,1,314,1],[313,2,314,2],[313,3,314,3],[313,4,314,4],[325,5,326,5],[325,6,325,7],[325,8,325,9],[331,1,331,7],[335,1,335,7],[325,0,326,0],[325,1,326,1],[325,2,326,2],[325,3,326,3],[325,4,326,4],[337,5,338,5],[337,6,337,7],[337,8,337,9],[343,1,343,7],[347,1,347,7],[337,0,338,0],[337,1,338,1],[337,2,338,2],[337,3,338,3],[337,4,338,4],[349,5,350,5],[349,6,349,7],[349,8,349,9],[355,1,355,7],[359,1,359,7],[349,0,350,0],[349,1,350,1],[349,2,350,2],[349,3,350,3],[349,4,350,4],[361,5,362,5],[361,6,361,7],[361,8,361,9],[367,1,367,7],[371,1,371,7],[361,0,362,0],[361,1,362,1],[361,2,362,2],[361,3,362,3],[361,4,362,4],[373,5,374,5],[373,6,373,7],[373,8,373,9],[379,1,379,7],[383,1,383,7],[373,0,374,0],[373,1,374,1],[373,2,374,2],[373,3,374,3],[373,4,374,4],[385,5,386,5],[385,6,385,7],[385,8,385,9],[391,1,391,7],[395,1,395,7],[385,0,386,0],[385,1,386,1],[385,2,386,2],[385,3,386,3],[385,4,386,4],[397,5,398,5],[397,6,397,7],[397,8,397,9],[403,1,403,7],[407,1,407,7],[397,0,398,0],[397,1,398,1],[397,2,398,2],[397,3,398,3],[397,4,398,4],[409,5,410,5],[409,6,409,7],[409,8,409,9],[415,1,415,7],[419,1,419,7],[409,0,410,0],[409,1,410,1],[409,2,410,2],[409,3,410,3],[409,4,410,4],[421,5,422,5],[421,6,421,7],[421,8,421,9],[427,1,427,7],[431,1,431,7],[421,0,422,0],[421,1,422,1],[421,2,422,2],[421,3,422,3],[421,4,422,4],[433,5,434,5],[433,6,433,7],[433,8,433,9],[439,1,439,7],[443,1,443,7],[433,0,434,0],[433,1,434,1],[433,2,434,2],[433,3,434,3],[433,4,434,4],[445,5,446,5],[445,6,445,7],[445,8,445,9],[451,1,451,7],[455,1,455,7],[445,0,446,0],[445,1,446,1],[445,2,446,2],[445,3,446,3],[445,4,446,4],[457,5,458,5],[457,6,457,7],[457,8,457,9],[463,1,463,7],[467,1,467,7],[457,0,458,0],[457,1,458,1],[457,2,458,2],[457,3,458,3],[457,4,458,4],[469,5,470,5],[469,6,469,7],[469,8,469,9],[474,1,474,7],[484,1,484,7],[469,0,470,0],[469,1,470,1],[469,2,470,2],[469,3,470,3],[469,4,470,4],[486,5,487,5],[486,6,486,7],[486,8,486,9],[491,1,491,7],[504,1,504,7],[486,0,487,0],[486,1,487,1],[486,2,487,2],[486,3,487,3],[486,4,487,4],[506,5,507,5],[506,6,506,7],[506,8,506,9],[512,1,512,7],[516,1,516,7],[506,0,507,0],[506,1,507,1],[506,2,507,2],[506,3,507,3],[506,4,507,4],[518,5,519,5],[518,6,518,7],[518,8,518,9],[523,1,523,7],[526,1,526,7],[518,0,519,0],[518,1,519,1],[518,2,519,2],[518,3,519,3],[518,4,519,4],[528,5,529,5],[528,6,528,7],[528,8,528,9],[534,1,534,7],[538,1,538,7],[528,0,529,0],[528,1,529,1],[528,2,529,2],[528,3,529,3],[528,4,529,4]]}
[]
[]
[]
["UNIDADE ESCOLAR",null,null,null,null,null,null,"CÓDIGO INEP"]
[{"$f":"Orçamento!$O$4","v":"COLÉGIO ESTADUAL MARIA EULÁLIA DE JESUS PORTILHO"},null,null,null,null,null,null,{"$f":"Orçamento!$X$4","v":52005720}]
[]
["OBRA",null,null,null,null,null,null,"CIDADE"]
[{"$f":"Orçamento!$O$7","v":0},null,null,null,null,null,null,{"$f":"Orçamento!$X$7","v":"PIRANHAS"}]
[]
["CRE",null,null,"ENDEREÇO",null,null,null,"REFERÊNCIA AGETOP"]
[{"$f":"Orçamento!$O$10","v":"PIRANHAS"},null,null,{"$f":"Orçamento!$R$10","v":"AV BRASIL CENTRAL 1440, CENTRO, CEP:76230-000"},null,null,null,{"$f":"Orçamento!$X$10","v":"DEZ/18"},{"$f":"Orçamento!$Y$10","v":"ONERADA"}]
[]
["DATA",null,null,"ÁREA TOTAL CONSTRUÍDA (M²)",null,null,null,"REFERÊNCIA SINAPI"]
[{"$f":"Orçamento!$S$7","v":"2020-03-26"},null,null,{"$f":"Orçamento!$S$13","v":3189.69},null,null,null,{"$f":"Orçamento!$X$13","v":"AGO/19"},{"$f":"Orçamento!$Y$13","v":"ONERADA"}]
[]
["COMPOSIÇÕES DE CUSTOS UNITÁRIOS - SEE-GO"]
[46,"FONTE","CÓDIGO","DESCRIÇÃO","UNIDADE","COEFIC.","CUSTO UNITÁRIO",null,"CUSTO  TOTAL (A) + (B) + (C) + (D) + (E)"]
[null,null,null,null,null,null,"DESONERADO","NÃO DESONER.","DESONERADO","NÃO DESONER."]
[null,"COMPOSIÇÃO","COMP 046_SEE","CAPUZ PARA PROTEÇÃO DOS PARA RAIOS","UN ",null,null,null,16.53,16.650000000000002]
[null,"AGETOP_I",8,"AJUDANTE","h     ",3.3300000000000003E-2,8.1999999999999993,9.51,0.27,0.32]
[null,"AGETOP_I",12,"ELETRICISTA","h     ",3.3300000000000003E-2,13.4,15.53,0.45,0.52]
[null,null,null,"","",null,0,0,0,0]
[null,"MÃO DE OBRA (B) - TOTAL",null,null,null,null,null,null,0.72,0.84000000000000008]
[null,"COTAÇÃO","COT 010_SEE","CAPUZ PARA PROTEÇÃO DOS PARA RAIOS","UN ",1,15.81,15.81,15.81,15.81]
[null,null,null,"","",null,0,0,0,0]
[null,null,null,"","",null,0,0,0,0]
[null,"MATERIAL (C) - TOTAL",null,null,null,null,null,null,15.81,15.81]
[]
[47,"FONTE","CÓDIGO","DESCRIÇÃO","UNIDADE","COEFIC.","CUSTO UNITÁRIO",null,"CUSTO  TOTAL (A) + (B) + (C) + (D) + (E)"]
[null,null,null,null,null,null,"DESONERADO","NÃO DESONER.","DESONERADO","NÃO DESONER."]
[null,"COMPOSIÇÃO","COMP 047_SEE","CAPUZ DE PROTEÇÃO PARA BUCHA DE TRANSFORMADOR","UN ",null,null,null,16.53,16.650000000000002]
[null,"AGETOP_I",8,"AJUDANTE","h     ",3.3300000000000003E-2,8.1999999999999993,9.51,0.27,0.32]
[null,"AGETOP_I",12,"ELETRICISTA","h     ",3.3300000000000003E-2,13.4,15.53,0.45,0.52]
[null,null,null,"","",null,0,0,0,0]
[null,"MÃO DE OBRA (B) - TOTAL",null,null,null,null,null,null,0.72,0.84000000000000008]
[null,"COTAÇÃO","COT 011_SEE","CAPUZ DE PROTEÇÃO PARA BUCHA DE TRANSFORMADOR","UN ",1,15.81,15.81,15.81,15.81]
[null,null,null,"","",null,0,0,0,0]
[null,null,null,"","",null,0,0,0,0]
[null,"MATERIAL (C) - TOTAL",null,null,null,null,null,null,15.81,15.81]
[]
[48,"FONTE","CÓDIGO","DESCRIÇÃO","UNIDADE","COEFIC.","CUSTO UNITÁRIO",null,"CUSTO  TOTAL (A) + (B) + (C) + (D) + (E)"]
[null,null,null,null,null,null,"DESONERADO","NÃO DESONER.","DESONERADO","NÃO DESONER."]
[null,"COMPOSIÇÃO","COMP 048_SEE","HASTE ROSQUEADA \"TIRANTE\" 3/8\"","M",null,null,null,14.02,15.39]
[null,"AGETOP_I",8,"AJUDANTE","h     ",0.4,8.1999999999999993,9.51,3.28,3.8]
[null,"AGETOP_I",12,"ELETRICISTA","h     ",0.4,13.4,15.53,5.36,6.21]
[null,null,null,"","",null,0,0,0,0]
[null,"MÃO DE OBRA (B) - TOTAL",null,null,null,null,null,null,8.64,10.01]
[null,"COTAÇÃO","COT 012_SEE","HASTE ROSQUEADA \"TIRANTE\" 3/8\"","M",1,5.3833333333333329,5.3833333333333329,5.38,5.38]
[null,null,null,"","",null,0,0,0,0]
[null,null,null,"","",null,0,0,0,0]
[null,"MATERIAL (C) - TOTAL",null,null,null,null,null,null,5.38,5.38]
[]
[37,"FONTE","CÓDIGO","DESCRIÇÃO","UNIDADE","COEFIC.","CUSTO UNITÁRIO",null,"CUSTO  TOTAL (A) + (B) + (C) + (D) + (E)"]
[null,null,null,null,null,null,"DESONERADO","NÃO DESONER.","DESONERADO","NÃO DESONER."]
[null,"COMPOSIÇÃO","COMP 037_SEE","CAIXA DE INSPEÇÃO PVC 300X250MM+TP P/CX INSP GALV FOGO 300MM","UN ",null,null,null,44.44,47.47]
[null,"AGETOP_I",8,"AJUDANTE","h     ",0.88,8.1999999999999993,9.51,7.22,8.3699999999999992]
[null,"AGETOP_I",12,"ELETRICISTA","h     ",0.88,13.4,15.53,11.79,13.67]
[null,null,null,"","",null,0,0,0,0]
[null,"MÃO DE OBRA (B) - TOTAL",null,null,null,null,null,null,19.009999999999998,22.04]
[null,"COTAÇÃO","COT 005_SEE","CAIXA DE INSPEÇÃO PVC 300x250mm","UN ",1,18.3,18.3,18.3,18.3]
[null,"COTAÇÃO","COT 006_SEE","TAMPA PARA CAIXA DE INSPEÇÃO - GALVANIZADA FOGO 300 mm","UN ",1,7.13,7.13,7.13,7.13]
[null,null,null,"","",null,0,0,0,0]
[null,"MATERIAL (C) - TOTAL",null,null,null,null,null,null,25.43,25.43]
[]
[49,"FONTE","CÓDIGO","DESCRIÇÃO","UNIDADE","COEFIC.","CUSTO UNITÁRIO",null,"CUSTO  TOTAL (A) + (B) + (C) + (D) + (E)"]
[null,null,null,null,null,null,"DESONERADO","NÃO DESONER.","DESONERADO","NÃO DESONER."]
[null,"COMPOSIÇÃO","COMP 049_SEE","PORCA SEXTAVADA 3/8\"","UN ",null,null,null,0.2,0.22]
[null,"AGETOP_I",8,"AJUDANTE","h     ",8.9999999999999993E-3,8.1999999999999993,9.51,7.0000000000000007E-2,0.09]
[null,null,null,"","",null,0,0,0,0]
[null,null,null,"","",null,0,0,0,0]
[null,"MÃO DE OBRA (B) - TOTAL",null,null,null,null,null,null,7.0000000000000007E-2,0.09]
[null,"COTAÇÃO","COT 013_SEE","PORCA SEXTAVADA 3/8\"","UN ",1,0.13,0.13,0.13,0.13]
[null,null,null,"","",null,0,0,0,0]
[null,null,null,"","",null,0,0,0,0]
[null,"MATERIAL (C) - TOTAL",null,null,null,null,null,null,0.13,0.13]
[]
[387,"FONTE","CÓDIGO","DESCRIÇÃO","UNIDADE","COEFIC.","CUSTO UNITÁRIO",null,"CUSTO  TOTAL (A) + (B) + (C) + (D) + (E)"]
[null,null,null,null,null,null,"DESONERADO","NÃO DESONER.","DESONERADO","NÃO DESONER."]
[null,"COMPOSIÇÃO","COMP 387_SEE","LÂMPADA LED TUBULAR 18W ","UN ",null,null,null,22.28,22.330000000000002]
[null,"AGETOP_I",8,"AJUDANTE","h     ",1.4999999999999999E-2,8.1999999999999993,9.51,0.12,0.14000000000000001]
[null,"AGETOP_I",12,"ELETRICISTA","h     ",1.4999999999999999E-2,13.4,15.53,0.2,0.23]
[null,null,null,"","",null,0,0,0,0]
[null,"MÃO DE OBRA (B) - TOTAL",null,null,null,null,null,null,0.32,0.37]
[null,"COTAÇÃO","COT 195_SEE","LÂMPADA LED TUBULAR 18W ","UN",1,21.959999999999997,21.959999999999997,21.96,21.96]
[null,null,null,"","",null,0,0,0,0]
[null,null,null,"","",null,0,0,0,0]
[null,"MATERIAL (C) - TOTAL",null,null,null,null,null,null,21.96,21.96]
[]
[375,"FONTE","CÓDIGO","DESCRIÇÃO","UNIDADE","COEFIC.","CUSTO UNITÁRIO",null,"CUSTO  TOTAL (A) + (B) + (C) + (D) + (E)"]
[null,null,null,null,null,null,"DESONERADO","NÃO DESONER.","DESONERADO","NÃO DESONER."]
[null,"COMPOSIÇÃO","COMP 375_SEE","REFLETOR DE LED HOLOFORTE 50W","UN ",null,null,null,81.83,82.95]
[null,"AGETOP_I",12,"ELETRICISTA","h     ",0.41649999999999998,13.4,15.53,5.58,6.47]
[null,"AGETOP_I",8,"AJUDANTE","h     ",0.17349999999999999,8.1999999999999993,9.51,1.42,1.65]
[null,null,null,"","",null,0,0,0,0]
[null,"MÃO DE OBRA (B) - TOTAL",null,null,null,null,null,null,7,8.1199999999999992]
[null,"COTAÇÃO","COT 190_SEE","REFLETOR DE LED HOLOFORTE 50W","UN",1,74.830000000000013,74.830000000000013,74.83,74.83]
[null,null,null,"","",null,0,0,0,0]
[null,null,null,"","",null,0,0,0,0]
[null,"MATERIAL (C) - TOTAL",null,null,null,null,null,null,74.83,74.83]
[]
[17,"FONTE","CÓDIGO","DESCRIÇÃO","UNIDADE","COEFIC.","CUSTO UNITÁRIO",null,"CUSTO  TOTAL (A) + (B) + (C) + (D) + (E)"]
[null,null,null,null,null,null,"DESONERADO","NÃO DESONER.","DESONERADO","NÃO DESONER."]
[null,"COMPOSIÇÃO","COMP 017_SEE","REDUCAO GIRATÓRIA TIPO STORZ LATAO P/ INST. PREDIAL COMBATE A INCENDIO ENGATE RAPIDO 2.1/2\" X 1.1/2\"","UN ",null,"-","-",99.14,99.69]
[null,"AGETOP_I",8,"AJUDANTE","h     ",0.16,8.1999999999999993,9.51,1.31,1.52]
[null,"AGETOP_I",11,"ENCANADOR","h     ",0.16,13.4,15.53,2.14,2.48]
[null,null,null,"","",null,0,0,0,0]
[null,"MÃO DE OBRA (B) - TOTAL",null,null,null,null,null,null,3.45,4]
[null,"SINAPI_I",20972,"REDUCAO FIXA TIPO STORZ, ENGATE RAPIDO 2.1/2\" X 1.1/2\", EM LATAO, PARA INSTALACAO PREDIAL COMBATE A INCENDIO PREDIAL                                                                                                                                                                                                                                                                                                                                                                                      ","UN    ",1,95.69,95.69,95.69,95.69]
[null,null,null,"","",null,0,0,0,0]
[null,null,null,"","",null,0,0,0,0]
[null,"MATERIAL (C) - TOTAL",null,null,null,null,null,null,95.69,95.69]
[]
[18,"FONTE","CÓDIGO","DESCRIÇÃO","UNIDADE","COEFIC.","CUSTO UNITÁRIO",null,"CUSTO  TOTAL (A) + (B) + (C) + (D) + (E)"]
[null,null,null,null,null,null,"DESONERADO","NÃO DESONER.","DESONERADO","NÃO DESONER."]
[null,"COMPOSIÇÃO","COMP 018_SEE","CHAVE DUPLA P/ CONEXÕES TIPO STORZ EM LATÃO ENGATE RÁPIDO 1 1/2\" X 2 1/2\"","UN ",null,"-","-",14.76,15.08]
[null,"AGETOP_I",11,"ENCANADOR","h     ",0.15,13.4,15.53,2.0099999999999998,2.33]
[null,null,null,"","",null,0,0,0,0]
[null,null,null,"","",null,0,0,0,0]
[null,"MÃO DE OBRA (B) - TOTAL",null,null,null,null,null,null,2.0099999999999998,2.33]
[null,"SINAPI_I",20971,"CHAVE DUPLA PARA CONEXOES TIPO STORZ, ENGATE RAPIDO 1 1/2\" X 2 1/2\", EM LATAO, PARA INSTALACAO PREDIAL COMBATE A INCENDIO                                                                                                                                                                                                                                                                                                                                                                                 ","UN    ",1,12.75,12.75,12.75,12.75]
[null,null,null,"","",null,0,0,0,0]
[null,null,null,"","",null,0,0,0,0]
[null,"MATERIAL (C) - TOTAL",null,null,null,null,null,null,12.75,12.75]
[]
[87,"FONTE","CÓDIGO","DESCRIÇÃO","UNIDADE","COEFIC.","CUSTO UNITÁRIO",null,"CUSTO  TOTAL (A) + (B) + (C) + (D) + (E)"]
[null,null,null,null,null,null,"DESONERADO","NÃO DESONER.","DESONERADO","NÃO DESONER."]
[null,"COMPOSIÇÃO","COMP 087_SEE","REGISTRO DE GAVETA COM HASTE ASCENDENTE DE BRONZE 2 1/2\"","UN ",null,null,null,257.29999999999995,261.26]
[null,"AGETOP_I",8,"AJUDANTE","h     ",1.1499999999999999,8.1999999999999993,9.51,9.43,10.94]
[null,"AGETOP_I",11,"ENCANADOR","h     ",1.1499999999999999,13.4,15.53,15.41,17.86]
[null,null,null,"","",null,0,0,0,0]
[null,"MÃO DE OBRA (B) - TOTAL",null,null,null,null,null,null,24.84,28.799999999999997]
[null,"AGETOP_I","H689","FITA VEDAROSCA 12 MM","m",2.82,0.28000000000000003,0.28000000000000003,0.79,0.79]
[null,"COTAÇÃO","COT 017_SEE","REGISTRO DE GAVETA COM HASTE ASCENDENTE DE BRONZE 2 1/2\"","UN ",1,231.66666666666666,231.66666666666666,231.67,231.67]
[null,null,null,"","",null,0,0,0,0]
[null,"MATERIAL (C) - TOTAL",null,null,null,null,null,null,232.45999999999998,232.45999999999998]
[]
[19,"FONTE","CÓDIGO","DESCRIÇÃO","UNIDADE","COEFIC.","CUSTO UNITÁRIO",null,"CUSTO  TOTAL (A) + (B) + (C) + (D) + (E)"]
[null,null,null,null,null,null,"DESONERADO","NÃO DESONER.","DESONERADO","NÃO DESONER."]
[null,"COMPOSIÇÃO","COMP 019_SEE","TAMPÃO LATAO C/ CORRENTE P/ INSTALAÇÃO PREDIAL COMBATE A INCÊNDIO ENGATE RÁPIDO 1 1/2\"","UN ",null,"-","-",55.550000000000004,56.07]
[null,"AGETOP_I",11,"ENCANADOR","h     ",0.15,13.4,15.53,2.0099999999999998,2.33]
[null,"AGETOP_I",8,"AJUDANTE","h     ",0.15,8.1999999999999993,9.51,1.23,1.43]
[null,null,null,"","",null,0,0,0,0]
[null,"MÃO DE OBRA (B) - TOTAL",null,null,null,null,null,null,3.2399999999999998,3.76]
[null,"SINAPI_I",20964,"TAMPAO COM CORRENTE, EM LATAO, ENGATE RAPIDO 1 1/2\", PARA INSTALACAO PREDIAL DE COMBATE A INCENDIO                                                                                                                                                                                                                                                                                                                                                                                                        ","UN    ",1,52.31,52.31,52.31,52.31]
[null,null,null,"","",null,0,0,0,0]
[null,null,null,"","",null,0,0,0,0]
[null,"MATERIAL (C) - TOTAL",null,null,null,null,null,null,52.31,52.31]
[]
[30,"FONTE","CÓDIGO","DESCRIÇÃO","UNIDADE","COEFIC.","CUSTO UNITÁRIO",null,"CUSTO  TOTAL (A) + (B) + (C) + (D) + (E)"]
[null,null,null,null,null,null,"DESONERADO","NÃO DESONER.","DESONERADO","NÃO DESONER."]
[null,"COMPOSIÇÃO","COMP 030_SEE","COTOVELO DE FERRO GALV. 90° X 2 1/2\"","UN ",null,null,null,69.16,72.33]
[null,"AGETOP_I",8,"AJUDANTE","h     ",0.92,8.1999999999999993,9.51,7.54,8.75]
[null,"AGETOP_I",11,"ENCANADOR","h     ",0.92,13.4,15.53,12.33,14.29]
[null,"MÃO DE OBRA (B) - TOTAL",null,null,null,null,null,null,19.87,23.04]
[null,"SINAPI_I",3470,"COTOVELO 90 GRAUS DE FERRO GALVANIZADO, COM ROSCA BSP, DE 2 1/2\"                                                                                                                                                                                                                                                                                                                                                                                                                                          ","UN    ",1,48.73,48.73,48.73,48.73]
[null,"AGETOP_I","H689","FITA VEDAROSCA 12 MM","m",2,0.28000000000000003,0.28000000000000003,0.56000000000000005,0.56000000000000005]
[null,"MATERIAL (C) - TOTAL",null,null,null,null,null,null,49.29,49.29]
[]
[77,"FONTE","CÓDIGO","DESCRIÇÃO","UNIDADE","COEFIC.","CUSTO UNITÁRIO",null,"CUSTO  TOTAL (A) + (B) + (C) + (D) + (E)"]
[null,null,null,null,null,null,"DESONERADO","NÃO DESONER.","DESONERADO","NÃO DESONER."]
[null,"COMPOSIÇÃO","COMP 077_SEE","UNIAO FERRO GALV C/ASSENTO CONICO BRONZE 2 1/2\"","UN ",null,null,null,148.30000000000001,149.66999999999999]
[null,"AGETOP_I",8,"AJUDANTE","h     ",0.4,8.1999999999999993,9.51,3.28,3.8]
[null,"AGETOP_I",11,"ENCANADOR","h     ",0.4,13.4,15.53,5.36,6.21]
[null,"MÃO DE OBRA (B) - TOTAL",null,null,null,null,null,null,8.64,10.01]
[null,"AGETOP_I","H689","FITA VEDAROSCA 12 MM","m",2.4,0.28000000000000003,0.28000000000000003,0.67,0.67]
[null,"SINAPI_I",12427,"UNIAO COM ASSENTO CONICO DE BRONZE, DIAMETRO 2 1/2\"                                                                                                                                                                                                                                                                                                                                                                                                                                                       ","UN    ",1,138.99,138.99,138.99,138.99]
[null,"MATERIAL (C) - TOTAL",null,null,null,null,null,null,139.66,139.66]
[]
[546,"FONTE","CÓDIGO","DESCRIÇÃO","UNID ","COEFIC.","CUSTO UNITÁRIO",null,"CUSTO  TOTAL (A) + (B) + (C) + (D) + (E)"]
[null,null,null,null,null,null,"DESONERADO","NÃO DESONER.","DESONERADO","NÃO DESONER."]
[null,"COMPOSIÇÃO","COMP 546_SEE","BUJÃO DE REBORDO 2.1/2\"","UN ","-","-","-",16.509999999999998,16.760000000000002]
[null,"AGETOP_I",8,"AJUDANTE","h     ",7.0000000000000007E-2,8.1999999999999993,9.51,0.56999999999999995,0.67]
[null,"AGETOP_I",11,"ENCANADOR","h     ",7.0000000000000007E-2,13.4,15.53,0.94,1.0900000000000001]
[null,null,null,"","",null,0,0,0,0]
[null,"MÃO DE OBRA (B) - TOTAL",null,null,null,null,null,null,1.5099999999999998,1.7600000000000002]
[null,"COTAÇÃO","COT 286_SEE","BUJÃO DE REBORDO 2.1/2\"","UN ",1,15,15,15,15]
[null,null,null,"","",null,0,0,0,0]
[null,null,null,"","",null,0,0,0,0]
[null,"MATERIAL (C) - TOTAL",null,null,null,null,null,null,15,15]
[]
[22,"FONTE","CÓDIGO","DESCRIÇÃO","UNIDADE","COEFIC.","CUSTO UNITÁRIO",null,"CUSTO  TOTAL (A) + (B) + (C) + (D) + (E)"]
[null,null,null,null,null,null,"DESONERADO","NÃO DESONER.","DESONERADO","NÃO DESONER."]
[null,"COMPOSIÇÃO","COMP 022_SEE","TAMPÃO FOFO 40X50CM C/INSCRIÇÃO ","UN ",null,"-","-",199.82999999999998,200.15]
[null,"AGETOP_I",11,"ENCANADOR","h     ",0.15,13.4,15.53,2.0099999999999998,2.33]
[null,null,null,"","",null,0,0,0,0]
[null,null,null,"","",null,0,0,0,0]
[null,"MÃO DE OBRA (B) - TOTAL",null,null,null,null,null,null,2.0099999999999998,2.33]
[null,"SINAPI_I",11293,"TAMPAO FOFO SIMPLES COM BASE, CLASSE A15 CARGA MAX 1,5 T, 400 X 500 MM, COM INSCRICAO INCENDIO                                                                                                                                                                                                                                                                                                                                                                                                            ","UN    ",1,197.82,197.82,197.82,197.82]
[null,null,null,"","",null,0,0,0,0]
[null,null,null,"","",null,0,0,0,0]
[null,"MATERIAL (C) - TOTAL",null,null,null,null,null,null,197.82,197.82]
[]
[559,"FONTE","CÓDIGO","DESCRIÇÃO","UNID ","COEFIC.","CUSTO UNITÁRIO",null,"CUSTO  TOTAL (A) + (B) + (C) + (D) + (E)"]
[null,null,null,null,null,null,"DESONERADO","NÃO DESONER.","DESONERADO","NÃO DESONER."]
[null,"COMPOSIÇÃO","COMP 559_SEE","ADAPTADOR PARA CAIXA D´ÁGUA 150MM 2.1/2\" ","UN ","-","-","-",101.95,102.26]
[null,"AGETOP_I",11,"ENCANADOR","h     ",0.09,13.4,15.53,1.21,1.4]
[null,"AGETOP_I",8,"AJUDANTE","h     ",0.09,8.1999999999999993,9.51,0.74,0.86]
[null,null,null,"","",null,0,0,0,0]
[null,"MÃO DE OBRA (B) - TOTAL",null,null,null,null,null,null,1.95,2.2599999999999998]
[null,"COTAÇÃO","COT 304_SEE","ADAPTADOR PARA CAIXA D´ÁGUA 150MM 2.1/2\" ","UN ",1,100,100,100,100]
[null,null,null,"","",null,0,0,0,0]
[null,null,null,"","",null,0,0,0,0]
[null,"MATERIAL (C) - TOTAL",null,null,null,null,null,null,100,100]
[]
[186,"FONTE","CÓDIGO","DESCRIÇÃO","UNIDADE","COEFIC.","CUSTO UNITÁRIO",null,"CUSTO  TOTAL (A) + (B) + (C) + (D) + (E)"]
[null,null,null,null,null,null,"DESONERADO","NÃO DESONER.","DESONERADO","NÃO DESONER."]
[null,"COMPOSIÇÃO","COMP 186_SEE","BOTOEIRA BOMBA DE INCÊNDIO C/ MARTELO CONVENCIONAL/ ANALÓGICA","UN ",null,null,null,85.1,88.539999999999992]
[null,"AGETOP_I",8,"AJUDANTE","h     ",1,8.1999999999999993,9.51,8.1999999999999993,9.51]
[null,"AGETOP_I",12,"ELETRICISTA","h     ",1,13.4,15.53,13.4,15.53]
[null,null,null,"","",null,0,0,0,0]
[null,"MÃO DE OBRA (B) - TOTAL",null,null,null,null,null,null,21.6,25.04]
[null,"COTAÇÃO","COT 088_SEE","BOTOEIRA BOMBA DE INCÊNDIO C/ MARTELO CONVENCIONAL/ ANALÓGICA","UN",1,63.5,63.5,63.5,63.5]
[null,null,null,"","",null,0,0,0,0]
[null,null,null,"","",null,0,0,0,0]
[null,"MATERIAL (C) - TOTAL",null,null,null,null,null,null,63.5,63.5]
[]
[188,"FONTE","CÓDIGO","DESCRIÇÃO","UNIDADE","COEFIC.","CUSTO UNITÁRIO",null,"CUSTO  TOTAL (A) + (B) + (C) + (D) + (E)"]
[null,null,null,null,null,null,"DESONERADO","NÃO DESONER.","DESONERADO","NÃO DESONER."]
[null,"COMPOSIÇÃO","COMP 188_SEE","ACIONADOR MANUAL DE ALARME","UN ",null,null,null,100.61,103.36]
[null,"AGETOP_I",8,"AJUDANTE","h     ",0.8,8.1999999999999993,9.51,6.56,7.61]
[null,"AGETOP_I",12,"ELETRICISTA","h     ",0.8,13.4,15.53,10.72,12.42]
[null,null,null,"","",null,0,0,0,0]
[null,"MÃO DE OBRA (B) - TOTAL",null,null,null,null,null,null,17.28,20.03]
[null,"COTAÇÃO","COT 090_SEE","ACIONADOR MANUAL DE ALARME","UN",1,83.333333333333329,83.333333333333329,83.33,83.33]
[null,null,null,"","",null,0,0,0,0]
[null,null,null,"","",null,0,0,0,0]
[null,"MATERIAL (C) - TOTAL",null,null,null,null,null,null,83.33,83.33]
[]
[190,"FONTE","CÓDIGO","DESCRIÇÃO","UNIDADE","COEFIC.","CUSTO UNITÁRIO",null,"CUSTO  TOTAL (A) + (B) + (C) + (D) + (E)"]
[null,null,null,null,null,null,"DESONERADO","NÃO DESONER.","DESONERADO","NÃO DESONER."]
[null,"COMPOSIÇÃO","COMP 190_SEE","CENTRAL DE DETECÇÃO E ALARME DE 40 SETORES COM BATERIA","UN ",null,null,null,1136.1300000000001,1163.6500000000001]
[null,"AGETOP_I",8,"AJUDANTE","h     ",8,8.1999999999999993,9.51,65.599999999999994,76.08]
[null,"AGETOP_I",12,"ELETRICISTA","h     ",8,13.4,15.53,107.2,124.24]
[null,null,null,"","",null,0,0,0,0]
[null,"MÃO DE OBRA (B) - TOTAL",null,null,null,null,null,null,172.8,200.32]
[null,"COTAÇÃO","COT 092_SEE","CENTRAL DE DETECÇÃO E ALARME DE 40 SETORES COM BATERIA (PREÇO MÉDIO)","UN",1,963.33333333333337,963.33333333333337,963.33,963.33]
[null,null,null,"","",null,0,0,0,0]
[null,null,null,"","",null,0,0,0,0]
[null,"MATERIAL (C) - TOTAL",null,null,null,null,null,null,963.33,963.33]
[]
[24,"FONTE","CÓDIGO","DESCRIÇÃO","UNIDADE","COEFIC.","CUSTO UNITÁRIO",null,"CUSTO  TOTAL (A) + (B) + (C) + (D) + (E)"]
[null,null,null,null,null,null,"DESONERADO","NÃO DESONER.","DESONERADO","NÃO DESONER."]
[null,"COMPOSIÇÃO","COMP 024_SEE","SINALIZADOR FOTOLUMINESCENTE PARA EXTINTOR","UN ",null,"-","-",24.109999999999996,24.229999999999997]
[null,"AGETOP_I",5,"SERVENTE","h     ",0.09,8.1999999999999993,9.51,0.74,0.86]
[null,null,null,"","",null,0,0,0,0]
[null,null,null,"","",null,0,0,0,0]
[null,"MÃO DE OBRA (B) - TOTAL",null,null,null,null,null,null,0.74,0.86]
[null,"AGETOP_I",3070,"BUCHA DE NYLON S-6","un",2,0.04,0.04,0.08,0.08]
[null,"AGETOP_I",3393,"PARAFUSO P/BUCHA S-6","un",2,0.08,0.08,0.16,0.16]
[null,"SINAPI_I",37556,"PLACA DE SINALIZACAO DE SEGURANCA CONTRA INCENDIO, FOTOLUMINESCENTE, QUADRADA, *20 X 20* CM, EM PVC *2* MM ANTI-CHAMAS (SIMBOLOS, CORES E PICTOGRAMAS CONFORME NBR 13434)                                                                                                                                                                                                                                                                                                                                 ","UN    ",1,23.13,23.13,23.13,23.13]
[null,"MATERIAL (C) - TOTAL",null,null,null,null,null,null,23.369999999999997,23.369999999999997]
[]
[25,"FONTE","CÓDIGO","DESCRIÇÃO","UNIDADE","COEFIC.","CUSTO UNITÁRIO",null,"CUSTO  TOTAL (A) + (B) + (C) + (D) + (E)"]
[null,null,null,null,null,null,"DESONERADO","NÃO DESONER.","DESONERADO","NÃO DESONER."]
[null,"COMPOSIÇÃO","COMP 025_SEE","SINALIZADOR FOTOLUMINESCENTE DE EMERGÊNCIA","UN ",null,"-","-",24.109999999999996,24.229999999999997]
[null,"AGETOP_I",5,"SERVENTE","h     ",0.09,8.1999999999999993,9.51,0.74,0.86]
[null,"MÃO DE OBRA (B) - TOTAL",null,null,null,null,null,null,0.74,0.86]
[null,"AGETOP_I",3070,"BUCHA DE NYLON S-6","un",2,0.04,0.04,0.08,0.08]
[null,"AGETOP_I",3393,"PARAFUSO P/BUCHA S-6","un",2,0.08,0.08,0.16,0.16]
[null,"SINAPI_I",37556,"PLACA DE SINALIZACAO DE SEGURANCA CONTRA INCENDIO, FOTOLUMINESCENTE, QUADRADA, *20 X 20* CM, EM PVC *2* MM ANTI-CHAMAS (SIMBOLOS, CORES E PICTOGRAMAS CONFORME NBR 13434)                                                                                                                                                                                                                                                                                                                                 ","UN    ",1,23.13,23.13,23.13,23.13]
[null,"MATERIAL (C) - TOTAL",null,null,null,null,null,null,23.369999999999997,23.369999999999997]
[]
[277,"FONTE","CÓDIGO","DESCRIÇÃO","UNIDADE","COEFIC.","CUSTO UNITÁRIO",null,"CUSTO  TOTAL (A) + (B) + (C) + (D) + (E)"]
[null,null,null,null,null,null,"DESONERADO","NÃO DESONER.","DESONERADO","NÃO DESONER."]
[null,"COMPOSIÇÃO","COMP 277_SEE","MARCAÇÃO NO PISO - 1X1 M PARA EXTINTOR","M2",null,null,null,28.81,28.88]
[null,"AGETOP_I",5,"SERVENTE","h     ",3.3300000000000003E-2,8.1999999999999993,9.51,0.27,0.32]
[null,null,null,"","",null,0,0,0,0]
[null,null,null,"","",null,0,0,0,0]
[null,"MÃO DE OBRA (B) - TOTAL",null,null,null,null,null,null,0.27,0.32]
[null,"SINAPI_I",5318,"SOLVENTE DILUENTE A BASE DE AGUARRAS                                                                                                                                                                                                                                                                                                                                                                                                                                                                      ","L     ",0.13,11.78,11.78,1.53,1.53]
[null,"SINAPI",5824,"CAMINHÃO TOCO, PBT 16.000 KG, CARGA ÚTIL MÁX. 10.685 KG, DIST. ENTRE EIXOS 4,8 M, POTÊNCIA 189 CV, INCLUSIVE CARROCERIA FIXA ABERTA DE MADEIRA P/ TRANSPORTE GERAL DE CARGA SECA, DIMEN. APROX. 2,5 X 7,00 X 0,50 M - CHP DIURNO. AF_06/2014","CHP",3.3E-3,135.91,139.12,0.45,0.46]
[null,"SINAPI_I",7343,"TINTA A BASE DE RESINA ACRILICA, PARA SINALIZACAO HORIZONTAL VIARIA (NBR 11862)                                                                                                                                                                                                                                                                                                                                                                                                                           ","L     ",0.6,11.38,11.38,6.83,6.83]
[null,"SINAPI_I",7348,"TINTA ACRILICA PREMIUM PARA PISO                                                                                                                                                                                                                                                                                                                                                                                                                                                                          ","L     ",0.03,12.4,12.4,0.37,0.37]
[null,"SINAPI_I",25972,"MICROESFERAS DE VIDRO PARA SINALIZACAO HORIZONTAL VIARIA, TIPO I-B (PREMIX) - NBR 16184                                                                                                                                                                                                                                                                                                                                                                                                                   ","KG    ",2.14,8.8800000000000008,8.8800000000000008,19,19]
[null,"SINAPI",95133,"MÁQUINA DEMARCADORA DE FAIXA DE TRÁFEGO À FRIO, AUTOPROPELIDA, POTÊNCIA 38 HP - CHP DIURNO. AF_07/2016","CHP",3.3E-3,109.81,113.39,0.36,0.37]
[null,"MATERIAL (C) - TOTAL",null,null,null,null,null,null,28.54,28.56]
[]
[235,"FONTE","CÓDIGO","DESCRIÇÃO","UNIDADE","COEFIC.","CUSTO UNITÁRIO",null,"CUSTO  TOTAL (A) + (B) + (C) + (D) + (E)"]
[null,null,null,null,null,null,"DESONERADO","NÃO DESONER.","DESONERADO","NÃO DESONER."]
[null,"COMPOSIÇÃO","COMP 235_SEE","PLACA DE SINALIZAÇÃO EM PVC COD 01 - (300X300) PROIBIDO FUMAR","UN ",null,null,null,24.109999999999996,24.229999999999997]
[null,"AGETOP_I",5,"SERVENTE","h     ",0.09,8.1999999999999993,9.51,0.74,0.86]
[null,null,null,"","",null,0,0,0,0]
[null,null,null,"","",null,0,0,0,0]
[null,"MÃO DE OBRA (B) - TOTAL",null,null,null,null,null,null,0.74,0.86]
[null,"AGETOP_I",3070,"BUCHA DE NYLON S-6","un",2,0.04,0.04,0.08,0.08]
[null,"AGETOP_I",3393,"PARAFUSO P/BUCHA S-6","un",2,0.08,0.08,0.16,0.16]
[null,"SINAPI_I",37556,"PLACA DE SINALIZACAO DE SEGURANCA CONTRA INCENDIO, FOTOLUMINESCENTE, QUADRADA, *20 X 20* CM, EM PVC *2* MM ANTI-CHAMAS (SIMBOLOS, CORES E PICTOGRAMAS CONFORME NBR 13434)                                                                                                                                                                                                                                                                                                                                 ","UN    ",1,23.13,23.13,23.13,23.13]
[null,"MATERIAL (C) - TOTAL",null,null,null,null,null,null,23.369999999999997,23.369999999999997]
[]
[236,"FONTE","CÓDIGO","DESCRIÇÃO","UNIDADE","COEFIC.","CUSTO UNITÁRIO",null,"CUSTO  TOTAL (A) + (B) + (C) + (D) + (E)"]
[null,null,null,null,null,null,"DESONERADO","NÃO DESONER.","DESONERADO","NÃO DESONER."]
[null,"COMPOSIÇÃO","COMP 236_SEE","PLACA DE SINALIZAÇÃO EM PVC COD 06 - (300X300) PERIGO INFLAMÁVEL","UN ",null,null,null,24.109999999999996,24.229999999999997]
[null,"AGETOP_I",5,"SERVENTE","h     ",0.09,8.1999999999999993,9.51,0.74,0.86]
[null,null,null,"","",null,0,0,0,0]
[null,null,null,"","",null,0,0,0,0]
[null,"MÃO DE OBRA (B) - TOTAL",null,null,null,null,null,null,0.74,0.86]
[null,"AGETOP_I",3070,"BUCHA DE NYLON S-6","un",2,0.04,0.04,0.08,0.08]
[null,"AGETOP_I",3393,"PARAFUSO P/BUCHA S-6","un",2,0.08,0.08,0.16,0.16]
[null,"SINAPI_I",37556,"PLACA DE SINALIZACAO DE SEGURANCA CONTRA INCENDIO, FOTOLUMINESCENTE, QUADRADA, *20 X 20* CM, EM PVC *2* MM ANTI-CHAMAS (SIMBOLOS, CORES E PICTOGRAMAS CONFORME NBR 13434)                                                                                                                                                                                                                                                                                                                                 ","UN    ",1,23.13,23.13,23.13,23.13]
[null,"MATERIAL (C) - TOTAL",null,null,null,null,null,null,23.369999999999997,23.369999999999997]
[]
[411,"FONTE","CÓDIGO","DESCRIÇÃO","UNIDADE","COEFIC.","CUSTO UNITÁRIO",null,"CUSTO  TOTAL (A) + (B) + (C) + (D) + (E)"]
[null,null,null,null,null,null,"DESONERADO","NÃO DESONER.","DESONERADO","NÃO DESONER."]
[null,"COMPOSIÇÃO","COMP 411_SEE","PLACA DE SINALIZAÇÃO EM PVC COD 13 - (316X158) SAÍDA DE EMERGÊNCIA","UN ",null,null,null,29.349999999999998,29.47]
[null,"AGETOP_I",5,"SERVENTE","h     ",0.09,8.1999999999999993,9.51,0.74,0.86]
[null,null,null,"","",null,0,0,0,0]
[null,null,null,"","",null,0,0,0,0]
[null,"MÃO DE OBRA (B) - TOTAL",null,null,null,null,null,null,0.74,0.86]
[null,"AGETOP_I",3070,"BUCHA DE NYLON S-6","un",2,0.04,0.04,0.08,0.08]
[null,"AGETOP_I",3393,"PARAFUSO P/BUCHA S-6","un",2,0.08,0.08,0.16,0.16]
[null,"SINAPI_I",37559,"PLACA DE SINALIZACAO DE SEGURANCA CONTRA INCENDIO, FOTOLUMINESCENTE, RETANGULAR, *12 X 40* CM, EM PVC *2* MM ANTI-CHAMAS (SIMBOLOS, CORES E PICTOGRAMAS CONFORME NBR 13434)                                                                                                                                                                                                                                                                                                                               ","UN    ",1,28.37,28.37,28.37,28.37]
[null,"MATERIAL (C) - TOTAL",null,null,null,null,null,null,28.61,28.61]
[]
[412,"FONTE","CÓDIGO","DESCRIÇÃO","UNIDADE","COEFIC.","CUSTO UNITÁRIO",null,"CUSTO  TOTAL (A) + (B) + (C) + (D) + (E)"]
[null,null,null,null,null,null,"DESONERADO","NÃO DESONER.","DESONERADO","NÃO DESONER."]
[null,"COMPOSIÇÃO","COMP 412_SEE","PLACA DE SINALIZAÇÃO EM PVC COD 17 - (316X158) MENSAGEM \"SAÍDA\"","UN ",null,null,null,29.349999999999998,29.47]
[null,"AGETOP_I",5,"SERVENTE","h     ",0.09,8.1999999999999993,9.51,0.74,0.86]
[null,null,null,"","",null,0,0,0,0]
[null,null,null,"","",null,0,0,0,0]
[null,"MÃO DE OBRA (B) - TOTAL",null,null,null,null,null,null,0.74,0.86]
[null,"AGETOP_I",3070,"BUCHA DE NYLON S-6","un",2,0.04,0.04,0.08,0.08]
[null,"AGETOP_I",3393,"PARAFUSO P/BUCHA S-6","un",2,0.08,0.08,0.16,0.16]
[null,"SINAPI_I",37559,"PLACA DE SINALIZACAO DE SEGURANCA CONTRA INCENDIO, FOTOLUMINESCENTE, RETANGULAR, *12 X 40* CM, EM PVC *2* MM ANTI-CHAMAS (SIMBOLOS, CORES E PICTOGRAMAS CONFORME NBR 13434)                                                                                                                                                                                                                                                                                                                               ","UN    ",1,28.37,28.37,28.37,28.37]
[null,"MATERIAL (C) - TOTAL",null,null,null,null,null,null,28.61,28.61]
[]
[24,"FONTE","CÓDIGO","DESCRIÇÃO","UNIDADE","COEFIC.","CUSTO UNITÁRIO",null,"CUSTO  TOTAL (A) + (B) + (C) + (D) + (E)"]
[null,null,null,null,null,null,"DESONERADO","NÃO DESONER.","DESONERADO","NÃO DESONER."]
[null,"COMPOSIÇÃO","COMP 024_SEE","SINALIZADOR FOTOLUMINESCENTE PARA EXTINTOR","UN ",null,"-","-",24.109999999999996,24.229999999999997]
[null,"AGETOP_I",5,"SERVENTE","h     ",0.09,8.1999999999999993,9.51,0.74,0.86]
[null,null,null,"","",null,0,0,0,0]
[null,null,null,"","",null,0,0,0,0]
[null,"MÃO DE OBRA (B) - TOTAL",null,null,null,null,null,null,0.74,0.86]
[null,"AGETOP_I",3070,"BUCHA DE NYLON S-6","un",2,0.04,0.04,0.08,0.08]
[null,"AGETOP_I",3393,"PARAFUSO P/BUCHA S-6","un",2,0.08,0.08,0.16,0.16]
[null,"SINAPI_I",37556,"PLACA DE SINALIZACAO DE SEGURANCA CONTRA INCENDIO, FOTOLUMINESCENTE, QUADRADA, *20 X 20* CM, EM PVC *2* MM ANTI-CHAMAS (SIMBOLOS, CORES E PICTOGRAMAS CONFORME NBR 13434)                                                                                                                                                                                                                                                                                                                                 ","UN    ",1,23.13,23.13,23.13,23.13]
[null,"MATERIAL (C) - TOTAL",null,null,null,null,null,null,23.369999999999997,23.369999999999997]
[]
[382,"FONTE","CÓDIGO","DESCRIÇÃO","UNIDADE","COEFIC.","CUSTO UNITÁRIO",null,"CUSTO  TOTAL (A) + (B) + (C) + (D) + (E)"]
[null,null,null,null,null,null,"DESONERADO","NÃO DESONER.","DESONERADO","NÃO DESONER."]
[null,"COMPOSIÇÃO","COMP 382_SEE","TE DE REDUCAO DE FERRO GALVANIZADO, COM ROSCA BSP, DE 3/4\" X 1/2\"","UN ",null,null,null,21.93,24.020000000000003]
[null,"AGETOP_I",8,"AJUDANTE","h     ",0.6,8.1999999999999993,9.51,4.92,5.71]
[null,"AGETOP_I",11,"ENCANADOR","h     ",0.61050000000000004,13.4,15.53,8.18,9.48]
[null,null,null,"","",null,0,0,0,0]
[null,"MÃO DE OBRA (B) - TOTAL",null,null,null,null,null,null,13.1,15.190000000000001]
[null,"SINAPI_I",3146,"FITA VEDA ROSCA EM ROLOS DE 18 MM X 10 M (L X C)                                                                                                                                                                                                                                                                                                                                                                                                                                                          ","UN    ",0.12075471698113208,3.9,3.9,0.47,0.47]
[null,"SINAPI_I",6302,"TE DE REDUCAO DE FERRO GALVANIZADO, COM ROSCA BSP, DE 3/4\" X 1/2\"                                                                                                                                                                                                                                                                                                                                                                                                                                         ","UN    ",1,8.36,8.36,8.36,8.36]
[null,null,null,"","",null,0,0,0,0]
[null,"MATERIAL (C) - TOTAL",null,null,null,null,null,null,8.83,8.83]
[]
[383,"FONTE","CÓDIGO","DESCRIÇÃO","UNIDADE","COEFIC.","CUSTO UNITÁRIO",null,"CUSTO  TOTAL (A) + (B) + (C) + (D) + (E)"]
[null,null,null,null,null,null,"DESONERADO","NÃO DESONER.","DESONERADO","NÃO DESONER."]
[null,"COMPOSIÇÃO","COMP 383_SEE","BUCHA DE REDUCAO DE FERRO GALVANIZADO, COM ROSCA BSP, DE 1/2\" X 1/4\"","UN ",null,null,null,6.87,7.42]
[null,"AGETOP_I",8,"AJUDANTE","h     ",0.16,8.1999999999999993,9.51,1.31,1.52]
[null,"AGETOP_I",11,"ENCANADOR","h     ",0.16,13.4,15.53,2.14,2.48]
[null,null,null,"","",null,0,0,0,0]
[null,"MÃO DE OBRA (B) - TOTAL",null,null,null,null,null,null,3.45,4]
[null,"AGETOP_I","H689","FITA VEDAROSCA 12 MM","m",1.2,0.28000000000000003,0.28000000000000003,0.34,0.34]
[null,"SINAPI_I",770,"BUCHA DE REDUCAO DE FERRO GALVANIZADO, COM ROSCA BSP, DE 1/2\" X 1/4\"                                                                                                                                                                                                                                                                                                                                                                                                                                      ","UN    ",1,3.08,3.08,3.08,3.08]
[null,null,null,"","",null,0,0,0,0]
[null,"MATERIAL (C) - TOTAL",null,null,null,null,null,null,3.42,3.42]
[]
[212,"FONTE","CÓDIGO","DESCRIÇÃO","UNIDADE","COEFIC.","CUSTO UNITÁRIO",null,"CUSTO  TOTAL (A) + (B) + (C) + (D) + (E)"]
[null,null,null,null,null,null,"DESONERADO","NÃO DESONER.","DESONERADO","NÃO DESONER."]
[null,"COMPOSIÇÃO","COMP 212_SEE","NIPLE DE REDUÇÃO 1/2\" X 1/4\" BSP","UN ",null,null,null,9.5,10.050000000000001]
[null,"AGETOP_I",8,"AJUDANTE","h     ",0.16,8.1999999999999993,9.51,1.31,1.52]
[null,"AGETOP_I",11,"ENCANADOR","h     ",0.16,13.4,15.53,2.14,2.48]
[null,null,null,"","",null,0,0,0,0]
[null,"MÃO DE OBRA (B) - TOTAL",null,null,null,null,null,null,3.45,4]
[null,"COTAÇÃO","COT 103_SEE","NIPLE DE REDUÇÃO 1/2\" X 1/4\" BSP","UN",1,6.0533333333333337,6.0533333333333337,6.05,6.05]
[null,null,null,"","",null,0,0,0,0]
[null,null,null,"","",null,0,0,0,0]
[null,"MATERIAL (C) - TOTAL",null,null,null,null,null,null,6.05,6.05]
[]
[213,"FONTE","CÓDIGO","DESCRIÇÃO","UNIDADE","COEFIC.","CUSTO UNITÁRIO",null,"CUSTO  TOTAL (A) + (B) + (C) + (D) + (E)"]
[null,null,null,null,null,null,"DESONERADO","NÃO DESONER.","DESONERADO","NÃO DESONER."]
[null,"COMPOSIÇÃO","COMP 213_SEE","NIPLE DE REDUÇÃO 3/4\" X 1/2\" BSP","UN ",null,null,null,13.16,13.71]
[null,"AGETOP_I",8,"AJUDANTE","h     ",0.16,8.1999999999999993,9.51,1.31,1.52]
[null,"AGETOP_I",11,"ENCANADOR","h     ",0.16,13.4,15.53,2.14,2.48]
[null,null,null,"","",null,0,0,0,0]
[null,"MÃO DE OBRA (B) - TOTAL",null,null,null,null,null,null,3.45,4]
[null,"COTAÇÃO","COT 104_SEE","NIPLE DE REDUÇÃO 3/4\" X 1/2\" BSP","UN",1,9.7099999999999991,9.7099999999999991,9.7100000000000009,9.7100000000000009]
[null,null,null,"","",null,0,0,0,0]
[null,null,null,"","",null,0,0,0,0]
[null,"MATERIAL (C) - TOTAL",null,null,null,null,null,null,9.7100000000000009,9.7100000000000009]
[]
[237,"FONTE","CÓDIGO","DESCRIÇÃO","UNIDADE","COEFIC.","CUSTO UNITÁRIO",null,"CUSTO  TOTAL (A) + (B) + (C) + (D) + (E)"]
[null,null,null,null,null,null,"DESONERADO","NÃO DESONER.","DESONERADO","NÃO DESONER."]
[null,"COMPOSIÇÃO","COMP 237_SEE","FITA ANTICORROSIVA","M",null,null,null,11.92,12.61]
[null,"AGETOP_I",8,"AJUDANTE","h     ",0.2,8.1999999999999993,9.51,1.64,1.9]
[null,"AGETOP_I",12,"ELETRICISTA","h     ",0.2,13.4,15.53,2.68,3.11]
[null,null,null,"","",null,0,0,0,0]
[null,"MÃO DE OBRA (B) - TOTAL",null,null,null,null,null,null,4.32,5.01]
[null,"SINAPI_I",39634,"FITA ADESIVA ANTICORROSIVA DE PVC FLEXIVEL, COR PRETA, PARA PROTECAO TUBULACAO, 50 MM X 30 M (L X C), E= *0,25* MM                                                                                                                                                                                                                                                                                                                                                                                        ","M     ",1,7.6,7.6,7.6,7.6]
[null,null,null,"","",null,0,0,0,0]
[null,null,null,"","",null,0,0,0,0]
[null,"MATERIAL (C) - TOTAL",null,null,null,null,null,null,7.6,7.6]
[]
[542,"FONTE","CÓDIGO","DESCRIÇÃO","UNIDADE","COEFIC.","CUSTO UNITÁRIO",null,"CUSTO  TOTAL (A) + (B) + (C) + (D) + (E)"]
[null,null,null,null,null,null,"DESONERADO","NÃO DESONER.","DESONERADO","NÃO DESONER."]
[null,"COMPOSIÇÃO","COMP 542_SEE","VÁLVULA UGV 3/4\" (S) LATÃO","UN ",null,null,null,25.17,26.66]
[null,"AGETOP_I",8,"AJUDANTE","h     ",0.432,8.1999999999999993,9.51,3.54,4.1100000000000003]
[null,"AGETOP_I",11,"ENCANADOR","h     ",0.432,13.4,15.53,5.79,6.71]
[null,null,null,"","",null,0,0,0,0]
[null,"MÃO DE OBRA (B) - TOTAL",null,null,null,null,null,null,9.33,10.82]
[null,"COTAÇÃO","COT 281_SEE","VÁLVULA UGV 3/4\" (S) LATÃO","UN ",1,15.836666666666666,15.836666666666666,15.84,15.84]
[null,null,null,"","",null,0,0,0,0]
[null,null,null,"","",null,0,0,0,0]
[null,"MATERIAL (C) - TOTAL",null,null,null,null,null,null,15.84,15.84]
[]
[543,"FONTE","CÓDIGO","DESCRIÇÃO","UNIDADE","COEFIC.","CUSTO UNITÁRIO",null,"CUSTO  TOTAL (A) + (B) + (C) + (D) + (E)"]
[null,null,null,null,null,null,"DESONERADO","NÃO DESONER.","DESONERADO","NÃO DESONER."]
[null,"COMPOSIÇÃO","COMP 543_SEE","VÁLVULA UGV 1/2\" (S) LATÃO","UN ",null,null,null,24.5,25.990000000000002]
[null,"AGETOP_I",8,"AJUDANTE","h     ",0.432,8.1999999999999993,9.51,3.54,4.1100000000000003]
[null,"AGETOP_I",11,"ENCANADOR","h     ",0.432,13.4,15.53,5.79,6.71]
[null,null,null,"","",null,0,0,0,0]
[null,"MÃO DE OBRA (B) - TOTAL",null,null,null,null,null,null,9.33,10.82]
[null,"COTAÇÃO","COT 282_SEE","VÁLVULA UGV 1/2\" (S) LATÃO","UN ",1,15.166666666666666,15.166666666666666,15.17,15.17]
[null,null,null,"","",null,0,0,0,0]
[null,null,null,"","",null,0,0,0,0]
[null,"MATERIAL (C) - TOTAL",null,null,null,null,null,null,15.17,15.17]
[]
[211,"FONTE","CÓDIGO","DESCRIÇÃO","UNIDADE","COEFIC.","CUSTO UNITÁRIO",null,"CUSTO  TOTAL (A) + (B) + (C) + (D) + (E)"]
[null,null,null,null,null,null,"DESONERADO","NÃO DESONER.","DESONERADO","NÃO DESONER."]
[null,"COMPOSIÇÃO","COMP 211_SEE","REGULADOR DE 2º ESTÁGIO 5KG/H","UN ",null,null,null,85.46,89.419999999999987]
[null,"AGETOP_I",8,"AJUDANTE","h     ",1.1499999999999999,8.1999999999999993,9.51,9.43,10.94]
[null,"AGETOP_I",11,"ENCANADOR","h     ",1.1499999999999999,13.4,15.53,15.41,17.86]
[null,null,null,"","",null,0,0,0,0]
[null,"MÃO DE OBRA (B) - TOTAL",null,null,null,null,null,null,24.84,28.799999999999997]
[null,"COTAÇÃO","COT 102_SEE","REGULADOR DE 2º ESTÁGIO 5KG/H","UN",1,59.833333333333336,59.833333333333336,59.83,59.83]
[null,"AGETOP_I","H689","FITA VEDAROSCA 12 MM","m",2.82,0.28000000000000003,0.28000000000000003,0.79,0.79]
[null,null,null,"","",null,0,0,0,0]
[null,"MATERIAL (C) - TOTAL",null,null,null,null,null,null,60.62,60.62]
[]
[210,"FONTE","CÓDIGO","DESCRIÇÃO","UNIDADE","COEFIC.","CUSTO UNITÁRIO",null,"CUSTO  TOTAL (A) + (B) + (C) + (D) + (E)"]
[null,null,null,null,null,null,"DESONERADO","NÃO DESONER.","DESONERADO","NÃO DESONER."]
[null,"COMPOSIÇÃO","COMP 210_SEE","REGULADOR DE 1º ESTÁGIO 60KG/H MODELO AP-40  COM MANÔMETRO","UN ",null,null,null,231.21,235.17000000000002]
[null,"AGETOP_I",8,"AJUDANTE","h     ",1.1499999999999999,8.1999999999999993,9.51,9.43,10.94]
[null,"AGETOP_I",11,"ENCANADOR","h     ",1.1499999999999999,13.4,15.53,15.41,17.86]
[null,null,null,"","",null,0,0,0,0]
[null,"MÃO DE OBRA (B) - TOTAL",null,null,null,null,null,null,24.84,28.799999999999997]
[null,"COTAÇÃO","COT 101_SEE","REGULADOR DE 1º ESTÁGIO 60KG/H MODELO AP-40  COM MANÔMETRO","UN",1,205.57666666666668,205.57666666666668,205.58,205.58]
[null,"AGETOP_I","H689","FITA VEDAROSCA 12 MM","m",2.82,0.28000000000000003,0.28000000000000003,0.79,0.79]
[null,null,null,"","",null,0,0,0,0]
[null,"MATERIAL (C) - TOTAL",null,null,null,null,null,null,206.37,206.37]
[]
[235,"FONTE","CÓDIGO","DESCRIÇÃO","UNIDADE","COEFIC.","CUSTO UNITÁRIO",null,"CUSTO  TOTAL (A) + (B) + (C) + (D) + (E)"]
[null,null,null,null,null,null,"DESONERADO","NÃO DESONER.","DESONERADO","NÃO DESONER."]
[null,"COMPOSIÇÃO","COMP 235_SEE","PLACA DE SINALIZAÇÃO EM PVC COD 01 - (300X300) PROIBIDO FUMAR","UN ",null,null,null,24.109999999999996,24.229999999999997]
[null,"AGETOP_I",5,"SERVENTE","h     ",0.09,8.1999999999999993,9.51,0.74,0.86]
[null,null,null,"","",null,0,0,0,0]
[null,null,null,"","",null,0,0,0,0]
[null,"MÃO DE OBRA (B) - TOTAL",null,null,null,null,null,null,0.74,0.86]
[null,"AGETOP_I",3070,"BUCHA DE NYLON S-6","un",2,0.04,0.04,0.08,0.08]
[null,"AGETOP_I",3393,"PARAFUSO P/BUCHA S-6","un",2,0.08,0.08,0.16,0.16]
[null,"SINAPI_I",37556,"PLACA DE SINALIZACAO DE SEGURANCA CONTRA INCENDIO, FOTOLUMINESCENTE, QUADRADA, *20 X 20* CM, EM PVC *2* MM ANTI-CHAMAS (SIMBOLOS, CORES E PICTOGRAMAS CONFORME NBR 13434)                                                                                                                                                                                                                                                                                                                                 ","UN    ",1,23.13,23.13,23.13,23.13]
[null,"MATERIAL (C) - TOTAL",null,null,null,null,null,null,23.369999999999997,23.369999999999997]
[]
[236,"FONTE","CÓDIGO","DESCRIÇÃO","UNIDADE","COEFIC.","CUSTO UNITÁRIO",null,"CUSTO  TOTAL (A) + (B) + (C) + (D) + (E)"]
[null,null,null,null,null,null,"DESONERADO","NÃO DESONER.","DESONERADO","NÃO DESONER."]
[null,"COMPOSIÇÃO","COMP 236_SEE","PLACA DE SINALIZAÇÃO EM PVC COD 06 - (300X300) PERIGO INFLAMÁVEL","UN ",null,null,null,24.109999999999996,24.229999999999997]
[null,"AGETOP_I",5,"SERVENTE","h     ",0.09,8.1999999999999993,9.51,0.74,0.86]
[null,null,null,"","",null,0,0,0,0]
[null,null,null,"","",null,0,0,0,0]
[null,"MÃO DE OBRA (B) - TOTAL",null,null,null,null,null,null,0.74,0.86]
[null,"AGETOP_I",3070,"BUCHA DE NYLON S-6","un",2,0.04,0.04,0.08,0.08]
[null,"AGETOP_I",3393,"PARAFUSO P/BUCHA S-6","un",2,0.08,0.08,0.16,0.16]
[null,"SINAPI_I",37556,"PLACA DE SINALIZACAO DE SEGURANCA CONTRA INCENDIO, FOTOLUMINESCENTE, QUADRADA, *20 X 20* CM, EM PVC *2* MM ANTI-CHAMAS (SIMBOLOS, CORES E PICTOGRAMAS CONFORME NBR 13434)                                                                                                                                                                                                                                                                                                                                 ","UN    ",1,23.13,23.13,23.13,23.13]
[null,"MATERIAL (C) - TOTAL",null,null,null,null,null,null,23.369999999999997,23.369999999999997]
[]
[7,"FONTE","CÓDIGO","DESCRIÇÃO","UNIDADE","COEFIC.","CUSTO UNITÁRIO",null,"CUSTO  TOTAL (A) + (B) + (C) + (D) + (E)"]
[null,null,null,null,null,null,"DESONERADO","NÃO DESONER.","DESONERADO","NÃO DESONER."]
[null,"COMPOSIÇÃO","COMP 007_SEE","GUICHÊ CANTONEIRA/GRADE PARA VIDRO","M²","-","-","-",227.67000000000002,234.31]
[null,"AGETOP_I",4,"PEDREIRO","h     ",2.5,13.4,15.53,33.5,38.83]
[null,"AGETOP_I",5,"SERVENTE","h     ",1,8.1999999999999993,9.51,8.1999999999999993,9.51]
[null,"MÃO DE OBRA (B) - TOTAL",null,null,null,null,null,null,41.7,48.339999999999996]
[null,"AGETOP_I",104,"AREIA MEDIA ","m3",9.7000000000000003E-3,82.85,82.85,0.8,0.8]
[null,"AGETOP_I",1221,"CAL HIDRATADA","Kg",0.73,0.54,0.54,0.39,0.39]
[null,"AGETOP_I",1215,"CIMENTO PORTLAND C.P. 32","Kg",2.67,0.39,0.39,1.04,1.04]
[null,"AGETOP_I",2470,"FERRO CANTONEIRA 1/8\" X 7/8\"","Kg",3.5478000000000001,4.3899999999999997,4.3899999999999997,15.57,15.57]
[null,"AGETOP_I",2423,"FERRO CANTONEIRA 1/8\" X 3/4\"","Kg",7.9390000000000001,4.87,4.87,38.659999999999997,38.659999999999997]
[null,"AGETOP_I",2372,"CHAPA PERFILADA No. 18","Kg",13.320600000000001,5.42,5.42,72.2,72.2]
[null,"SINAPI_I",11552,"PERFIL U / CANALETA DE ALUMINIO, DE ABAS IGUAIS, 1/2\" (1,27 X 1,27 CM), PARA PORTA OU JANELA DE CORRER                                                                                                                                                                                                                                                                                                                                                                                                    ","M     ",1.306,7.84,7.84,10.24,10.24]
[null,"AGETOP_I",2898,"FABRICAÇÃO / MONTAGEM","un",1,36.729999999999997,36.729999999999997,36.729999999999997,36.729999999999997]
[null,"AGETOP_I",2529,"FECHO FIO REDONDO 4\" ZINCADO C/PARAFUSO DA SOPRANO OU EQUIVALENTE","un",2,5.17,5.17,10.34,10.34]
[null,"MATERIAL (C) - TOTAL",null,null,null,null,null,null,185.97,185.97]
[]
[83,"FONTE","CÓDIGO","DESCRIÇÃO","UNIDADE","COEFIC.","CUSTO UNITÁRIO",null,"CUSTO  TOTAL (A) + (B) + (C) + (D) + (E)"]
[null,null,null,null,null,null,"DESONERADO","NÃO DESONER.","DESONERADO","NÃO DESONER."]
[null,"COMPOSIÇÃO","COMP 083_SEE","CORRIMÃO PISO - SEDUC","M",null,null,null,141.9,145.95000000000002]
[null,"AGETOP_I",25,"OFICIAL \"B\"","h     ",1,13.4,15.53,13.4,15.53]
[null,"AGETOP_I",8,"AJUDANTE","h     ",1,8.1999999999999993,9.51,8.1999999999999993,9.51]
[null,"MÃO DE OBRA (B) - TOTAL",null,null,null,null,null,null,21.6,25.04]
[null,"AGETOP_I",2376,"TUBO INDUSTRIAL 2\" CHAPA 13 ","Kg",8.2197499999999994,5.23,5.23,42.99,42.99]
[null,"AGETOP_I",2504,"TUBO INDUSTRIAL D=25 MM CHAPA 13 ","Kg",1.1000000000000001,5.07,5.07,5.58,5.58]
[null,"AGETOP_I",2417,"MASSA PLASTICA","Kg",0.2041,10.58,10.58,2.16,2.16]
[null,"AGETOP_I",2246,"ELETRODO 2.5 OK","Kg",0.11459999999999999,8.6999999999999993,8.6999999999999993,1,1]
[null,"AGETOP_I",1672,"LIXA PARA FERRO ( NÚMERO 100 )","un",0.125,2.12,2.12,0.27,0.27]
[null,"AGETOP_I",1264,"DISCO DE DESBASTE 7/8\" P/ CONC./FERRO (1/4\" X 7\")","un",2.5000000000000001E-2,7,7,0.18,0.18]
[null,"AGETOP_I",1334,"DISCO DE CORTE DIAM. 5/8\"- 10\"","un",0.1865,5.5,5.5,1.03,1.03]
[null,"AGETOP_I",2902,"FABRICAÇÃO / MONTAGEM","un",1,50.44,50.44,50.44,50.44]
[null,"AGETOP_I",2150,"CHAPA DE FERRO DOBRADA No.13","Kg",0.43519999999999998,5.28,5.28,2.2999999999999998,2.2999999999999998]
[null,"AGETOP_I",2719,"CHAPA PERFILADA 3/16\"","Kg",1.1644000000000001,5.04,5.04,5.87,5.87]
[null,"AGETOP_I",2436,"ACO CA-25 - 6,3 MM (1/4\") - BARRA LISA A-36","Kg",0.48150000000000004,5.13,5.13,2.4700000000000002,2.4700000000000002]
[null,"AGETOP",261602,"PINT.ESMALTE/ESQUAD.FERRO C/FUNDO ANTICOR.","m2    ",0.44,13.65,15.04,6.01,6.62]
[null,"MATERIAL (C) - TOTAL",null,null,null,null,null,null,120.30000000000001,120.91000000000001]
[]
[387,"FONTE","CÓDIGO","DESCRIÇÃO","UNIDADE","COEFIC.","CUSTO UNITÁRIO",null,"CUSTO  TOTAL (A) + (B) + (C) + (D) + (E)"]
[null,null,null,null,null,null,"DESONERADO","NÃO DESONER.","DESONERADO","NÃO DESONER."]
[null,"COMPOSIÇÃO","COMP 387_SEE","LÂMPADA LED TUBULAR 18W ","UN ",null,null,null,22.28,22.330000000000002]
[null,"AGETOP_I",8,"AJUDANTE","h     ",1.4999999999999999E-2,8.1999999999999993,9.51,0.12,0.14000000000000001]
[null,"AGETOP_I",12,"ELETRICISTA","h     ",1.4999999999999999E-2,13.4,15.53,0.2,0.23]
[null,null,null,"","",null,0,0,0,0]
[null,"MÃO DE OBRA (B) - TOTAL",null,null,null,null,null,null,0.32,0.37]
[null,"COTAÇÃO","COT 195_SEE","LÂMPADA LED TUBULAR 18W ","UN",1,21.959999999999997,21.959999999999997,21.96,21.96]
[null,null,null,"","",null,0,0,0,0]
[null,null,null,"","",null,0,0,0,0]
[null,"MATERIAL (C) - TOTAL",null,null,null,null,null,null,21.96,21.96]
[]
[209,"FONTE","CÓDIGO","DESCRIÇÃO","UNIDADE","COEFIC.","CUSTO UNITÁRIO",null,"CUSTO  TOTAL (A) + (B) + (C) + (D) + (E)"]
[null,null,null,null,null,null,"DESONERADO","NÃO DESONER.","DESONERADO","NÃO DESONER."]
[null,"COMPOSIÇÃO","COMP 209_SEE","TOALHEIRO PLÁSTICO TIPO DISPENSER PARA PAPEL TOALHA INTERFOLHADO","UN ",null,null,null,57.109999999999992,57.969999999999992]
[null,"AGETOP_I",8,"AJUDANTE","h     ",0.25,8.1999999999999993,9.51,2.0499999999999998,2.38]
[null,"AGETOP_I",4,"PEDREIRO","h     ",0.25,13.4,15.53,3.35,3.88]
[null,"MÃO DE OBRA (B) - TOTAL",null,null,null,null,null,null,5.4,6.26]
[null,"SINAPI_I",37401,"TOALHEIRO PLASTICO TIPO DISPENSER PARA PAPEL TOALHA INTERFOLHADO                                                                                                                                                                                                                                                                                                                                                                                                                                          ","UN    ",1,50.91,50.91,50.91,50.91]
[null,"AGETOP_I",2221,"PARAFUSO COM BUCHA S-8","un",4,0.2,0.2,0.8,0.8]
[null,"MATERIAL (C) - TOTAL",null,null,null,null,null,null,51.709999999999994,51.709999999999994]
[]
[387,"FONTE","CÓDIGO","DESCRIÇÃO","UNIDADE","COEFIC.","CUSTO UNITÁRIO",null,"CUSTO  TOTAL (A) + (B) + (C) + (D) + (E)"]
[null,null,null,null,null,null,"DESONERADO","NÃO DESONER.","DESONERADO","NÃO DESONER."]
[null,"COMPOSIÇÃO","COMP 387_SEE","LÂMPADA LED TUBULAR 18W ","UN ",null,null,null,22.28,22.330000000000002]
[null,"AGETOP_I",8,"AJUDANTE","h     ",1.4999999999999999E-2,8.1999999999999993,9.51,0.12,0.14000000000000001]
[null,"AGETOP_I",12,"ELETRICISTA","h     ",1.4999999999999999E-2,13.4,15.53,0.2,0.23]
[null,null,null,"","",null,0,0,0,0]
[null,"MÃO DE OBRA (B) - TOTAL",null,null,null,null,null,null,0.32,0.37]
[null,"COTAÇÃO","COT 195_SEE","LÂMPADA LED TUBULAR 18W ","UN",1,21.959999999999997,21.959999999999997,21.96,21.96]
[null,null,null,"","",null,0,0,0,0]
[null,null,null,"","",null,0,0,0,0]
[null,"MATERIAL (C) - TOTAL",null,null,null,null,null,null,21.96,21.96]