{"text_format":"1","workbook":"xlsx","n_sheets":8,"sheets":["Orçamento","Resumo ","Somatório","Cronog_120_Dias","Composição BDI","Relatório CENTRAL","Parc Maior Relev","Composições"],"not_rendered":{"charts":0,"images":4,"macros":1,"external_links":0,"defined_names":80,"comments":3,"pivot_tables":0},"unopened":[],"bounds":{"document_bytes":16777216,"sheet_cells":100000,"rows_first":2000,"rows_last":500,"rows_between":2000,"halvings":0,"cell_chars":16384,"cell_head_chars":4096},"cells_cut":0,"cells_raw":0,"read":"whole","date_system":"1900"}

{"sheet":"Orçamento","index":0,"n_rows":999,"n_cols":27,"rows_kept":999,"cut":false,"hidden":false,"merged":[[991,18,991,22],[986,15,986,17],[986,18,986,22],[987,15,987,17],[987,18,987,22],[988,15,988,17],[988,18,988,22],[12,24,12,25],[11,23,11,25],[980,18,980,22],[981,15,981,17],[981,18,981,22],[982,15,982,17],[982,18,982,22],[977,15,977,17],[977,18,977,22],[978,15,978,17],[978,18,978,22],[979,15,979,17],[979,18,979,22],[973,14,973,26],[974,18,974,22],[975,15,975,17],[975,18,975,22],[992,23,992,25],[993,23,993,25],[994,23,994,25],[995,23,995,25],[996,23,996,25],[997,23,997,25],[998,23,998,25],[967,14,967,17],[974,15,974,17],[940,15,940,17],[995,18,995,22],[983,15,983,17],[983,18,983,22],[984,15,984,17],[984,18,984,22],[985,15,985,17],[985,18,985,22],[989,15,989,17],[989,18,989,22],[990,15,990,17],[990,18,990,22],[991,15,991,17],[980,15,980,17],[998,18,998,22],[995,14,995,17],[992,15,992,17],[992,18,992,22],[993,15,993,17],[993,18,993,22],[994,15,994,17],[994,18,994,22],[997,18,997,22],[996,18,996,22],[976,15,976,17],[976,18,976,22],[931,16,931,24],[932,16,932,24],[933,16,933,24],[10,14,10,26],[13,14,13,26],[9,17,9,22],[2,14,2,22],[3,14,3,22],[5,18,5,22],[6,18,6,22],[11,18,11,22],[12,18,12,22],[6,14,6,17],[5,14,5,17],[3,23,3,25],[2,23,2,25],[5,23,5,25],[6,23,6,25],[935,16,935,24],[8,23,8,25],[9,24,9,25],[953,15,953,17],[954,15,954,17],[955,15,955,17],[956,15,956,17],[957,15,957,17],[958,15,958,17],[959,15,959,17],[960,15,960,17],[934,16,934,24],[924,23,924,24],[925,23,925,24],[940,23,940,25],[965,15,965,17],[966,15,966,17],[939,14,939,26],[923,17,928,17],[940,18,940,22],[941,18,941,22],[949,18,949,22],[950,18,950,22],[951,18,951,22],[952,18,952,22],[964,18,964,22],[961,15,961,17],[941,15,941,17],[942,15,942,17],[943,15,943,17],[944,15,944,17],[945,15,945,17],[946,15,946,17],[947,15,947,17],[948,15,948,17],[949,15,949,17],[970,18,970,22],[946,18,946,22],[947,18,947,22],[945,18,945,22],[954,18,954,22],[936,18,936,24],[942,18,942,22],[943,18,943,22],[944,18,944,22],[967,18,967,22],[965,18,965,22],[966,18,966,22],[956,18,956,22],[963,18,963,22],[959,18,959,22],[961,18,961,22],[957,18,957,22],[958,18,958,22],[967,23,967,25],[961,23,961,25],[962,23,962,25],[963,23,963,25],[964,23,964,25],[965,23,965,25],[8,12,9,12],[969,18,969,22],[0,14,0,24],[8,14,8,16],[9,14,9,16],[11,14,11,16],[12,14,12,16],[14,14,14,24],[1,14,1,24],[4,14,4,24],[7,14,7,24],[953,18,953,22],[950,15,950,17],[951,15,951,17],[952,15,952,17],[962,18,962,22],[960,18,960,22],[923,23,923,24],[968,18,968,22],[955,18,955,22],[948,18,948,22],[962,15,962,17],[963,15,963,17],[964,15,964,17],[974,23,974,25],[975,23,975,25],[976,23,976,25],[977,23,977,25],[978,23,978,25],[979,23,979,25],[980,23,980,25],[981,23,981,25],[982,23,982,25],[983,23,983,25],[984,23,984,25],[985,23,985,25],[986,23,986,25],[987,23,987,25],[988,23,988,25],[989,23,989,25],[990,23,990,25],[991,23,991,25],[968,23,968,25],[969,23,969,25],[970,23,970,25],[966,23,966,25],[941,23,941,25],[942,23,942,25],[943,23,943,25],[944,23,944,25],[945,23,945,25],[946,23,946,25],[947,23,947,25],[948,23,948,25],[949,23,949,25],[950,23,950,25],[951,23,951,25],[952,23,952,25],[953,23,953,25],[954,23,954,25],[955,23,955,25],[956,23,956,25],[957,23,957,25],[958,23,958,25],[959,23,959,25],[960,23,960,25]]}
[]
[]
[null,null,null,null,null,null,null,null,null,null,null,null,null,null,"UNIDADE ESCOLAR",null,null,null,null,null,null,null,null,"CÓDIGO INEP"]
[null,null,null,null,null,null,null,null,null,null,null,null,null,null,"COLÉGIO ESTADUAL MARIA EULÁLIA DE JESUS PORTILHO",null,null,null,null,null,null,null,null,52005720]
[]
["Nmax",null,null,null,null,null,null,null,null,null,null,null,null,null,"OBRA",null,null,null,"DATA",null,null,null,null,"CIDADE"]
[{"$f":"MAX($C$18:$C$923)","v":4},null,null,null,null,null,null,null,null,null,null,null,null,null,null,null,null,null,"2020-03-26",null,null,null,null,"PIRANHAS"]
[]
[null,null,null,null,null,null,null,null,null,null,null,null,"",null,"CRE",null,null,"ENDEREÇO",null,null,null,null,null,"REFERÊNCIA AGETOP"]
[null,null,null,null,null,null,null,null,null,null,null,null,null,null,"PIRANHAS",null,null,"AV BRASIL CENTRAL 1440, CENTRO, CEP:76230-000",null,null,null,null,null,"DEZ/18","ONERADA"]
[]
[null,null,null,null,null,null,null,null,null,null,null,null,null,null,"ÁREA EXISTENTE (M²)",null,null,"ÁREA A CONSTRUIR (M²)","ÁREA TOTAL CONSTRUÍDA (M²)",null,null,null,null,"REFERÊNCIA SINAPI"]
[null,null,null,null,null,null,null,null,null,null,null,null,null,null,2832.84,null,null,356.85,3189.69,null,null,null,null,"AGO/19","ONERADA"]
[]
[null,null,null,null,null,null,null,null,null,null,null,"FILTRO",null,null,"PLANILHA ORÇAMENTÁRIA"]
{"$rows_left_out":985}
{"sheet":"Resumo ","index":1,"n_rows":39,"n_cols":9,"rows_kept":39,"cut":false,"hidden":false,"merged":[[13,0,14,0],[15,2,15,5],[16,2,16,5],[17,2,17,5],[18,2,18,5],[14,1,14,8],[0,1,0,8],[36,1,36,5],[2,1,2,5],[3,1,3,5],[5,1,5,5],[6,1,6,5],[8,1,8,5],[9,1,9,5],[11,3,11,5],[12,3,12,5],[10,1,10,8],[11,6,11,8],[12,6,12,8],[19,2,19,5],[20,2,20,5],[21,2,21,5],[31,2,31,5],[1,1,1,8],[2,6,2,8],[3,6,3,8],[4,1,4,8],[5,6,5,8],[6,6,6,8],[7,1,7,8],[8,6,8,8],[9,6,9,8],[13,1,13,8],[11,1,11,2],[12,1,12,2],[42,3,42,7],[41,3,41,7],[38,1,38,8],[22,2,22,5],[23,2,23,5],[24,2,24,5],[25,2,25,5],[26,2,26,5],[32,2,32,5],[33,2,33,5],[34,2,34,5],[35,2,35,5],[27,2,27,5],[28,2,28,5],[29,2,29,5],[30,2,30,5]]}
[]
[]
[null,"UNIDADE ESCOLAR",null,null,null,null,"CÓDIGO INEP"]
[null,{"$f":"Orçamento!$O$4","v":"COLÉGIO ESTADUAL MARIA EULÁLIA DE JESUS PORTILHO"},null,null,null,null,{"$f":"Orçamento!X4","v":52005720}]
[]
[null,"OBRA",null,null,null,null,"CIDADE"]
[null,{"$f":"Orçamento!$O$7","v":0},null,null,null,null,{"$f":"Orçamento!$X$7","v":"PIRANHAS"}]
[]
[null,"ENDEREÇO",null,null,null,null,"CRE"]
[null,{"$f":"Orçamento!$R$10","v":"AV BRASIL CENTRAL 1440, CENTRO, CEP:76230-000"},null,null,null,null,{"$f":"Orçamento!$O$10","v":"PIRANHAS"}]
[]
[null,"REFERÊNCIA",null,"DATA",null,null,"ÁREA TOTAL CONSTRUÍDA (M²)"]
[null,{"$f":"CONCATENATE(\"AGETOP E SINAPI - \",Orçamento!$Y$10)","v":"AGETOP E SINAPI - ONERADA"},null,{"$f":"Orçamento!$S$7","v":"2020-03-26"},null,null,{"$f":"Orçamento!$S$13","v":3189.69}]
["FILTRO"]
[null,"RESUMO GERAL DO ORÇAMENTO"]
{"$rows_left_out":25}
{"sheet":"Somatório","index":2,"n_rows":45,"n_cols":6,"rows_kept":45,"cut":false,"hidden":false,"merged":[[13,0,14,0],[42,1,42,2],[44,1,44,5],[47,3,47,5],[48,3,48,5],[13,1,13,5],[9,1,9,3],[9,4,9,5],[11,1,11,2],[11,4,11,5],[12,1,12,2],[12,4,12,5],[0,1,0,5],[14,1,14,5],[2,1,2,3],[2,4,2,5],[3,1,3,3],[3,4,3,5],[5,1,5,3],[5,4,5,5],[6,1,6,3],[6,4,6,5],[8,1,8,3],[8,4,8,5],[1,1,1,5],[4,1,4,5],[7,1,7,5],[10,1,10,5]]}
[]
[]
[null,"UNIDADE ESCOLAR",null,null,"CÓDIGO INEP"]
[null,{"$f":"Orçamento!$O$4","v":"COLÉGIO ESTADUAL MARIA EULÁLIA DE JESUS PORTILHO"},null,null,{"$f":"Orçamento!X4","v":52005720}]
[]
[null,"OBRA",null,null,"CIDADE"]
[null,{"$f":"Orçamento!$O$7","v":0},null,null,{"$f":"Orçamento!$X$7","v":"PIRANHAS"}]
[]
[null,"ENDEREÇO",null,null,"CRE"]
[null,{"$f":"Orçamento!$R$10","v":"AV BRASIL CENTRAL 1440, CENTRO, CEP:76230-000"},null,null,{"$f":"Orçamento!$O$10","v":"PIRANHAS"}]
[]
[null,"REFERÊNCIA",null,"DATA","ÁREA TOTAL CONSTRUÍDA (M²)"]
[null,{"$f":"CONCATENATE(\"AGETOP E SINAPI - \",Orçamento!$Y$10)","v":"AGETOP E SINAPI - ONERADA"},null,{"$f":"Orçamento!$S$7","v":"2020-03-26"},{"$f":"Orçamento!$S$13","v":3189.69}]
["FILTRO"]
[null,"SOMATÓRIO DE SERVIÇOS"]
{"$rows_left_out":31}
{"sheet":"Cronog_120_Dias","index":3,"n_rows":99,"n_cols":23,"rows_kept":99,"cut":false,"hidden":false,"merged":[[93,17,93,20],[94,17,94,20],[95,17,95,20],[80,17,80,20],[82,17,82,20],[83,17,83,20],[85,17,85,20],[86,17,86,20],[88,17,88,20],[89,17,89,20],[91,17,91,20],[92,17,92,20],[67,17,67,20],[68,17,68,20],[70,17,70,20],[71,17,71,20],[73,17,73,20],[74,17,74,20],[76,17,76,20],[77,17,77,20],[79,17,79,20],[53,17,53,20],[55,17,55,20],[56,17,56,20],[58,17,58,20],[59,17,59,20],[61,17,61,20],[62,17,62,20],[64,17,64,20],[65,17,65,20],[40,17,40,20],[41,17,41,20],[43,17,43,20],[44,17,44,20],[46,17,46,20],[47,17,47,20],[49,17,49,20],[50,17,50,20],[52,17,52,20],[91,13,91,16],[92,13,92,16],[93,13,93,16],[94,13,94,16],[95,13,95,16],[12,17,12,20],[13,17,13,20],[14,17,14,20],[16,17,16,20],[17,17,17,20],[19,17,19,20],[20,17,20,20],[22,17,22,20],[23,17,23,20],[25,17,25,20],[26,17,26,20],[28,17,28,20],[29,17,29,20],[31,17,31,20],[32,17,32,20],[34,17,34,20],[35,17,35,20],[37,17,37,20],[38,17,38,20],[79,13,79,16],[80,13,80,16],[82,13,82,16],[83,13,83,16],[85,13,85,16],[86,13,86,16],[88,13,88,16],[89,13,89,16],[65,13,65,16],[67,13,67,16],[68,13,68,16],[70,13,70,16],[71,13,71,16],[73,13,73,16],[74,13,74,16],[76,13,76,16],[77,13,77,16],[52,13,52,16],[53,13,53,16],[55,13,55,16],[56,13,56,16],[58,13,58,16],[59,13,59,16],[61,13,61,16],[62,13,62,16],[64,13,64,16],[38,13,38,16],[40,13,40,16],[41,13,41,16],[43,13,43,16],[44,13,44,16],[46,13,46,16],[47,13,47,16],[49,13,49,16],[50,13,50,16],[25,13,25,16],[26,13,26,16],[28,13,28,16],[29,13,29,16],[31,13,31,16],[32,13,32,16],[34,13,34,16],[35,13,35,16],[37,13,37,16],[12,13,12,16],[13,13,13,16],[14,13,14,16],[16,13,16,16],[17,13,17,16],[19,13,19,16],[20,13,20,16],[22,13,22,16],[23,13,23,16],[12,0,13,0],[9,0,11,0],[11,1,11,21],[92,1,92,2],[92,5,92,8],[92,9,92,12],[93,1,93,2],[93,5,93,8],[93,9,93,12],[74,9,74,12],[74,5,74,8],[68,9,68,12],[70,5,70,8],[70,9,70,12],[59,5,59,8],[71,1,73,2],[71,4,73,4],[71,5,71,8],[71,9,71,12],[73,5,73,8],[73,9,73,12],[59,9,59,12],[61,5,61,8],[61,9,61,12],[94,1,94,2],[94,5,94,8],[94,9,94,12],[76,5,76,8],[76,9,76,12],[77,5,77,8],[77,9,77,12],[79,5,79,8],[79,9,79,12],[80,5,80,8],[80,9,80,12],[82,5,82,8],[82,9,82,12],[77,3,79,3],[80,3,82,3],[86,1,88,2],[80,4,82,4],[83,3,85,3],[77,1,79,2],[77,4,79,4],[80,1,82,2],[95,1,95,2],[95,5,95,8],[95,9,95,12],[97,1,97,4],[98,1,98,21],[86,9,86,12],[88,5,88,8],[88,9,88,12],[85,5,85,8],[85,9,85,12],[89,1,91,2],[89,4,91,4],[89,5,89,8],[89,9,89,12],[91,5,91,8],[91,9,91,12],[89,3,91,3],[86,4,88,4],[86,5,86,8],[86,3,88,3],[83,1,85,2],[83,4,85,4],[83,5,83,8],[83,9,83,12],[68,5,68,8],[65,5,65,8],[65,9,65,12],[67,5,67,8],[67,9,67,12],[65,3,67,3],[62,9,62,12],[64,5,64,8],[64,9,64,12],[62,5,62,8],[53,9,53,12],[55,5,55,8],[55,9,55,12],[50,5,50,8],[50,9,50,12],[52,5,52,8],[52,9,52,12],[56,9,56,12],[58,5,58,8],[58,9,58,12],[53,5,53,8],[56,5,56,8],[44,9,44,12],[46,5,46,8],[46,9,46,12],[47,1,49,2],[47,4,49,4],[47,5,47,8],[47,9,47,12],[49,5,49,8],[49,9,49,12],[44,5,44,8],[47,3,49,3],[44,3,46,3],[44,1,46,2],[44,4,46,4],[35,9,35,12],[37,5,37,8],[37,9,37,12],[35,3,37,3],[40,9,40,12],[38,3,40,3],[38,9,38,12],[41,1,43,2],[41,4,43,4],[41,5,41,8],[41,9,41,12],[43,5,43,8],[43,9,43,12],[41,3,43,3],[35,5,35,8],[38,5,38,8],[40,5,40,8],[35,1,37,2],[35,4,37,4],[38,1,40,2],[38,4,40,4],[29,9,29,12],[31,5,31,8],[31,9,31,12],[32,1,34,2],[32,4,34,4],[32,5,32,8],[32,9,32,12],[34,5,34,8],[34,9,34,12],[32,3,34,3],[29,5,29,8],[29,1,31,2],[29,4,31,4],[29,3,31,3],[23,9,23,12],[25,5,25,8],[25,9,25,12],[26,1,28,2],[26,4,28,4],[26,5,26,8],[26,9,26,12],[28,5,28,8],[28,9,28,12],[23,3,25,3],[23,1,25,2],[23,4,25,4],[23,5,23,8],[26,3,28,3],[20,4,22,4],[20,5,20,8],[20,9,20,12],[22,5,22,8],[22,9,22,12],[20,3,22,3],[14,3,16,3],[17,3,19,3],[14,4,16,4],[14,5,14,8],[14,9,14,12],[16,5,16,8],[16,9,16,12],[65,1,67,2],[68,3,70,3],[62,3,64,3],[68,1,70,2],[56,3,58,3],[65,4,67,4],[74,3,76,3],[50,4,52,4],[74,4,76,4],[56,1,58,2],[56,4,58,4],[50,3,52,3],[53,3,55,3],[68,4,70,4],[62,1,64,2],[62,4,64,4],[59,3,61,3],[53,1,55,2],[53,4,55,4],[59,1,61,2],[59,4,61,4],[74,1,76,2],[10,1,10,21],[9,8,9,21],[8,8,8,21],[3,8,3,21],[6,8,6,21],[5,8,5,21],[2,8,2,21],[50,1,52,2],[71,3,73,3],[12,21,13,21],[13,1,13,2],[13,5,13,8],[13,9,13,12],[12,3,13,3],[12,9,12,12],[14,1,16,2],[12,5,12,8],[17,1,19,2],[17,4,19,4],[17,5,17,8],[17,9,17,12],[19,5,19,8],[19,9,19,12],[20,1,22,2],[0,1,0,21],[2,1,2,7],[3,1,3,7],[5,1,5,7],[6,1,6,7],[8,1,8,7],[9,1,9,7],[1,1,1,21],[7,1,7,21],[4,1,4,21]]}
[]
[]
[null,"UNIDADE ESCOLAR",null,null,null,null,null,null,"PRAZO"]
[null,{"$f":"Orçamento!$O$4","v":"COLÉGIO ESTADUAL MARIA EULÁLIA DE JESUS PORTILHO"},null,null,null,null,null,null,"120 DIAS CORRIDOS"]
[]
[null,"OBRA",null,null,null,null,null,null,"DATA"]
[null,{"$f":"Orçamento!$O$7","v":0},null,null,null,null,null,null,{"$f":"Orçamento!$S$7","v":"2020-03-26"}]
[]
[null,"LOCAL",null,null,null,null,null,null,"ÁREA TOTAL CONSTRUÍDA (M²)"]
["FILTRO",{"$f":"Orçamento!$X$7","v":"PIRANHAS"},null,null,null,null,null,null,{"$f":"Orçamento!$S$13","v":3189.69}]
[]
[null,"CRONOGRAMA - FÍSICO FINANCEIRO"]
["↓","CUSTO TOTAL:",{"$f":"D93","v":0},"VALOR","Dias:",30,null,null,null,60,null,null,null,90,null,null,null,120,null,null,null,"TOTAL"]
[null,"DESCRIÇÃO DOS SERVIÇOS",null,null,"%","1ª PARCELA",null,null,null,"2ª PARCELA",null,null,null,"2ª PARCELA",null,null,null,"2ª PARCELA"]
[{"$f":"IF(D15>0,\"F\",\"\")","v":""},"SERVIÇOS PRELIMINARES",null,{"$f":"Orçamento!X942","v":0},{"$f":"Orçamento!AA942","v":0},{"$f":"ROUND(F17*$D$15,2)","v":0},null,null,null,{"$f":"ROUND(J17*$D$15,2)","v":0},null,null,null,{"$f":"ROUND(N17*$D$15,2)","v":0},null,null,null,{"$f":"ROUND(R17*$D$15,2)","v":0},null,null,null,{"$f":"SUM(F15:U15)","v":0},{"$f":"IF(D15=V15,\"OK\",\"ERRO\")","v":"OK"}]
{"$rows_left_out":85}
{"sheet":"Composição BDI","index":4,"n_rows":45,"n_cols":9,"rows_kept":45,"cut":false,"hidden":false,"merged":[[18,5,18,8],[17,0,17,3],[16,0,16,3],[44,0,44,3],[42,0,42,3],[43,0,43,3],[18,0,18,3],[36,0,36,3],[39,0,39,3],[38,0,38,3],[40,0,40,3],[29,0,29,2],[32,0,32,3],[33,0,33,3],[34,0,34,3],[35,0,35,3],[0,0,0,3],[2,0,2,3],[3,0,3,3],[1,0,1,3],[5,0,5,3],[4,0,4,3],[12,0,12,3],[13,0,13,3],[14,0,14,3],[15,0,15,3],[6,0,6,3],[8,0,8,3],[7,0,7,3],[9,0,9,3],[11,0,11,3],[10,0,10,3]]}
[]
[]
["UNIDADE ESCOLAR"]
[{"$f":"Orçamento!$O$4","v":"COLÉGIO ESTADUAL MARIA EULÁLIA DE JESUS PORTILHO"}]
[]
["OBRA"]
[{"$f":"Orçamento!$O$7","v":0}]
[]
["ENDEREÇO"]
[{"$f":"Orçamento!$R$10","v":"AV BRASIL CENTRAL 1440, CENTRO, CEP:76230-000"}]
[]
["CIDADE"]
[{"$f":"Orçamento!$X$7","v":"PIRANHAS"}]
[]
["CRE"]
{"$rows_left_out":31}
{"sheet":"Relatório CENTRAL","index":5,"n_rows":40,"n_cols":5,"rows_kept":40,"cut":false,"hidden":false,"merged":[[9,0,11,0],[0,1,0,4],[6,3,6,4],[9,3,9,4],[1,1,1,4],[2,1,2,2],[2,3,2,4],[3,1,3,2],[3,3,3,4],[4,1,4,4],[5,1,5,2],[5,3,5,4],[6,1,6,2],[7,1,7,4],[8,1,8,2],[8,3,8,4],[9,1,9,2],[10,1,10,4],[11,1,11,4],[39,1,39,2]]}
[]
[]
[null,"UNIDADE ESCOLAR",null,"CIDADE"]
[null,{"$f":"Orçamento!$O$4","v":"COLÉGIO ESTADUAL MARIA EULÁLIA DE JESUS PORTILHO"},null,{"$f":"Orçamento!$X$7","v":"PIRANHAS"}]
[]
[null,"OBRA",null,"CRE"]
[null,{"$f":"Orçamento!$O$7","v":0},null,{"$f":"Orçamento!$O$10","v":"PIRANHAS"}]
[]
[null,"ENDEREÇO",null,"DATA"]
["FILTRO",{"$f":"Orçamento!$R$10","v":"AV BRASIL CENTRAL 1440, CENTRO, CEP:76230-000"},null,{"$f":"Orçamento!$S$7","v":"2020-03-26"}]
[]
[null,"RELATÓRIO CENTRAL"]
["↓","CÓDIGO","ETAPA","PREÇO  (R$) C/ BDI","PARTIC  ( % )"]
[{"$f":"IF(D14>0,\"F\",\"\")","v":""},{"$f":"Orçamento!O942","v":"a."},{"$f":"Orçamento!P942","v":"SERVIÇOS PRELIMINARES"},{"$f":"Orçamento!X942","v":0},{"$f":"Orçamento!AA942","v":0}]
[{"$f":"IF(D15>0,\"F\",\"\")","v":""},{"$f":"Orçamento!O943","v":"b."},{"$f":"Orçamento!P943","v":"TRANSPORTES"},{"$f":"Orçamento!X943","v":0},{"$f":"Orçamento!AA943","v":0}]
{"$rows_left_out":26}
{"sheet":"Parc Maior Relev","index":6,"n_rows":18,"n_cols":7,"rows_kept":18,"cut":false,"hidden":false,"merged":[[0,1,0,6],[11,1,11,6],[1,1,1,6],[2,1,2,3],[2,4,2,6],[3,1,3,3],[3,4,3,6],[4,1,4,6],[5,1,5,3],[5,4,5,6],[9,1,9,3],[9,4,9,6],[10,1,10,6],[6,1,6,3],[6,4,6,6],[7,1,7,6],[10,0,12,0],[8,1,8,3],[8,4,8,6],[18,3,18,7],[16,1,16,6]]}
[]
[]
[null,"UNIDADE ESCOLAR",null,null,"CÓDIGO INEP"]
[null,{"$f":"Orçamento!$O$4","v":"COLÉGIO ESTADUAL MARIA EULÁLIA DE JESUS PORTILHO"},null,null,{"$f":"Orçamento!$X$4","v":52005720}]
[]
[null,"OBRA",null,null,"CIDADE"]
[null,{"$f":"Orçamento!$O$7","v":0},null,null,{"$f":"Orçamento!$X$7","v":"PIRANHAS"}]
[]
[null,"CRE",null,null,"ÁREA TOTAL CONSTRUÍDA (M²)"]
[null,{"$f":"Orçamento!$O$10","v":"PIRANHAS"},null,null,{"$f":"Orçamento!$S$13","v":3189.69}]
["FILTRO"]
[null,"PARCELA DE MAIOR RELEVÂNCIA"]
[null,"CÓDIGO","SERVIÇO","DESCRIÇÃO","UNID","QUANT","PARC. MAIOR RELEV (50%)"]
[{"$f":"IF(F14>0,\"F\",\"\")","v":"F"},{"$f":"Somatório!B37","v":"u."},{"$f":"IFERROR(VLOOKUP(B14,Orçamento!$O$942:$P$967,2,FALSE),\"(inserir código ao lado)\")","v":"REVESTIMENTO DE PISO"},"PISO GRANITINA","M²",{"$f":"63.31+144.74+89.67+154+20.16","v":471.88000000000005},{"$f":"F14*0.5","v":235.94000000000003}]
[{"$f":"IF(F15>0,\"F\",\"\")","v":"F"},{"$f":"Somatório!B31","v":"o."},{"$f":"IFERROR(VLOOKUP(B15,Orçamento!$O$942:$P$967,2,FALSE),\"(inserir código ao lado)\")","v":"COBERTURAS"},"COBERTURA CERÂMICA","M²",{"$f":"543.73+182.07+124.64+205.67","v":1056.1099999999999},528.05499999999995]
{"$rows_left_out":4}
{"sheet":"Composições","index":7,"n_rows":539,"n_cols":10,"rows_kept":539,"cut":false,"hidden":false,"merged":[[15,0,15,9],[13,0,13,2],[13,3,13,6],[1,0,1,9],[3,7,3,9],[4,7,4,9],[6,7,6,9],[7,7,7,9],[6,0,6,6],[10,8,10,9],[13,8,13,9],[14,0,14,9],[8,0,8,9],[5,0,5,9],[2,0,2,9],[0,0,0,8],[10,0,10,2],[10,3,10,6],[11,0,11,9],[12,0,12,2],[12,3,12,6],[12,7,12,8],[7,0,7,6],[9,0,9,2],[9,3,9,6],[9,7,9,8],[3,0,3,6],[4,0,4,6],[16,5,17,5],[16,6,16,7],[16,8,16,9],[22,1,22,7],[26,1,26,7],[16,0,17,0],[16,1,17,1],[16,2,17,2],[16,3,17,3],[16,4,17,4],[28,5,29,5],[28,6,28,7],[28,8,28,9],[34,1,34,7],[38,1,38,7],[28,0,29,0],[28,1,29,1],[28,2,29,2],[28,3,29,3],[28,4,29,4],[40,5,41,5],[40,6,40,7],[40,8,40,9],[46,1,46,7],[50,1,50,7],[40,0,41,0],[40,1,41,1],[40,2,41,2],[40,3,41,3],[40,4,41,4],[52,5,53,5],[52,6,52,7],[52,8,52,9],[58,1,58,7],[62,1,62,7],[52,0,53,0],[52,1,53,1],[52,2,53,2],[52,3,53,3],[52,4,53,4],[64,5,65,5],[64,6,64,7],[64,8,64,9],[70,1,70,7],[74,1,74,7],[64,0,65,0],[64,1,65,1],[64,2,65,2],[64,3,65,3],[64,4,65,4],[76,5,77,5],[76,6,76,7],[76,8,76,9],[82,1,82,7],[86,1,86,7],[76,0,77,0],[76,1,77,1],[76,2,77,2],[76,3,77,3],[76,4,77,4],[88,5,89,5],[88,6,88,7],[88,8,88,9],[94,1,94,7],[98,1,98,7],[88,0,89,0],[88,1,89,1],[88,2,89,2],[88,3,89,3],[88,4,89,4],[100,5,101,5],[100,6,100,7],[100,8,100,9],[106,1,106,7],[110,1,110,7],[100,0,101,0],[100,1,101,1],[100,2,101,2],[100,3,101,3],[100,4,101,4],[112,5,113,5],[112,6,112,7],[112,8,112,9],[118,1,118,7],[122,1,122,7],[112,0,113,0],[112,1,113,1],[112,2,113,2],[112,3,113,3],[112,4,113,4],[124,5,125,5],[124,6,124,7],[124,8,124,9],[130,1,130,7],[134,1,134,7],[124,0,125,0],[124,1,125,1],[124,2,125,2],[124,3,125,3],[124,4,125,4],[136,5,137,5],[136,6,136,7],[136,8,136,9],[142,1,142,7],[146,1,146,7],[136,0,137,0],[136,1,137,1],[136,2,137,2],[136,3,137,3],[136,4,137,4],[148,5,149,5],[148,6,148,7],[148,8,148,9],[153,1,153,7],[156,1,156,7],[148,0,149,0],[148,1,149,1],[148,2,149,2],[148,3,149,3],[148,4,149,4],[158,5,159,5],[158,6,158,7],[158,8,158,9],[163,1,163,7],[166,1,166,7],[158,0,159,0],[158,1,159,1],[158,2,159,2],[158,3,159,3],[158,4,159,4],[168,5,169,5],[168,6,168,7],[168,8,168,9],[174,1,174,7],[178,1,178,7],[168,0,169,0],[168,1,169,1],[168,2,169,2],[168,3,169,3],[168,4,169,4],[180,5,181,5],[180,6,180,7],[180,8,180,9],[186,1,186,7],[190,1,190,7],[180,0,181,0],[180,1,181,1],[180,2,181,2],[180,3,181,3],[180,4,181,4],[192,5,193,5],[192,6,192,7],[192,8,192,9],[198,1,198,7],[202,1,202,7],[192,0,193,0],[192,1,193,1],[192,2,193,2],[192,3,193,3],[192,4,193,4],[204,5,205,5],[204,6,204,7],[204,8,204,9],[210,1,210,7],[214,1,214,7],[204,0,205,0],[204,1,205,1],[204,2,205,2],[204,3,205,3],[204,4,205,4],[216,5,217,5],[216,6,216,7],[216,8,216,9],[222,1,222,7],[226,1,226,7],[216,0,217,0],[216,1,217,1],[216,2,217,2],[216,3,217,3],[216,4,217,4],[228,5,229,5],[228,6,228,7],[228,8,228,9],[234,1,234,7],[238,1,238,7],[228,0,229,0],[228,1,229,1],[228,2,229,2],[228,3,229,3],[228,4,229,4],[240,5,241,5],[240,6,240,7],[240,8,240,9],[246,1,246,7],[250,1,250,7],[240,0,241,0],[240,1,241,1],[240,2,241,2],[240,3,241,3],[240,4,241,4],[252,5,253,5],[252,6,252,7],[252,8,252,9],[256,1,256,7],[260,1,260,7],[252,0,253,0],[252,1,253,1],[252,2,253,2],[252,3,253,3],[252,4,253,4],[262,5,263,5],[262,6,262,7],[262,8,262,9],[268,1,268,7],[275,1,275,7],[262,0,263,0],[262,1,263,1],[262,2,263,2],[262,3,263,3],[262,4,263,4],[277,5,278,5],[277,6,277,7],[277,8,277,9],[283,1,283,7],[287,1,287,7],[277,0,278,0],[277,1,278,1],[277,2,278,2],[277,3,278,3],[277,4,278,4],[289,5,290,5],[289,6,289,7],[289,8,289,9],[295,1,295,7],[299,1,299,7],[289,0,290,0],[289,1,290,1],[289,2,290,2],[289,3,290,3],[289,4,290,4],[301,5,302,5],[301,6,301,7],[301,8,301,9],[307,1,307,7],[311,1,311,7],[301,0,302,0],[301,1,302,1],[301,2,302,2],[301,3,302,3],[301,4,302,4],[313,5,314,5],[313,6,313,7],[313,8,313,9],[319,1,319,7],[323,1,323,7],[313,0,314,0],[313,1,314,1],[313,2,314,2],[313,3,314,3],[313,4,314,4],[325,5,326,5],[325,6,325,7],[325,8,325,9],[331,1,331,7],[335,1,335,7],[325,0,326,0],[325,1,326,1],[325,2,326,2],[325,3,326,3],[325,4,326,4],[337,5,338,5],[337,6,337,7],[337,8,337,9],[343,1,343,7],[347,1,347,7],[337,0,338,0],[337,1,338,1],[337,2,338,2],[337,3,338,3],[337,4,338,4],[349,5,350,5],[349,6,349,7],[349,8,349,9],[355,1,355,7],[359,1,359,7],[349,0,350,0],[349,1,350,1],[349,2,350,2],[349,3,350,3],[349,4,350,4],[361,5,362,5],[361,6,361,7],[361,8,361,9],[367,1,367,7],[371,1,371,7],[361,0,362,0],[361,1,362,1],[361,2,362,2],[361,3,362,3],[361,4,362,4],[373,5,374,5],[373,6,373,7],[373,8,373,9],[379,1,379,7],[383,1,383,7],[373,0,374,0],[373,1,374,1],[373,2,374,2],[373,3,374,3],[373,4,374,4],[385,5,386,5],[385,6,385,7],[385,8,385,9],[391,1,391,7],[395,1,395,7],[385,0,386,0],[385,1,386,1],[385,2,386,2],[385,3,386,3],[385,4,386,4],[397,5,398,5],[397,6,397,7],[397,8,397,9],[403,1,403,7],[407,1,407,7],[397,0,398,0],[397,1,398,1],[397,2,398,2],[397,3,398,3],[397,4,398,4],[409,5,410,5],[409,6,409,7],[409,8,409,9],[415,1,415,7],[419,1,419,7],[409,0,410,0],[409,1,410,1],[409,2,410,2],[409,3,410,3],[409,4,410,4],[421,5,422,5],[421,6,421,7],[421,8,421,9],[427,1,427,7],[431,1,431,7],[421,0,422,0],[421,1,422,1],[421,2,422,2],[421,3,422,3],[421,4,422,4],[433,5,434,5],[433,6,433,7],[433,8,433,9],[439,1,439,7],[443,1,443,7],[433,0,434,0],[433,1,434,1],[433,2,434,2],[433,3,434,3],[433,4,434,4],[445,5,446,5],[445,6,445,7],[445,8,445,9],[451,1,451,7],[455,1,455,7],[445,0,446,0],[445,1,446,1],[445,2,446,2],[445,3,446,3],[445,4,446,4],[457,5,458,5],[457,6,457,7],[457,8,457,9],[463,1,463,7],[467,1,467,7],[457,0,458,0],[457,1,458,1],[457,2,458,2],[457,3,458,3],[457,4,458,4],[469,5,470,5],[469,6,469,7],[469,8,469,9],[474,1,474,7],[484,1,484,7],[469,0,470,0],[469,1,470,1],[469,2,470,2],[469,3,470,3],[469,4,470,4],[486,5,487,5],[486,6,486,7],[486,8,486,9],[491,1,491,7],[504,1,504,7],[486,0,487,0],[486,1,487,1],[486,2,487,2],[486,3,487,3],[486,4,487,4],[506,5,507,5],[506,6,506,7],[506,8,506,9],[512,1,512,7],[516,1,516,7],[506,0,507,0],[506,1,507,1],[506,2,507,2],[506,3,507,3],[506,4,507,4],[518,5,519,5],[518,6,518,7],[518,8,518,9],[523,1,523,7],[526,1,526,7],[518,0,519,0],[518,1,519,1],[518,2,519,2],[518,3,519,3],[518,4,519,4],[528,5,529,5],[528,6,528,7],[528,8,528,9],[534,1,534,7],[538,1,538,7],[528,0,529,0],[528,1,529,1],[528,2,529,2],[528,3,529,3],[528,4,529,4]]}
[]
[]
[]
["UNIDADE ESCOLAR",null,null,null,null,null,null,"CÓDIGO INEP"]
[{"$f":"Orçamento!$O$4","v":"COLÉGIO ESTADUAL MARIA EULÁLIA DE JESUS PORTILHO"},null,null,null,null,null,null,{"$f":"Orçamento!$X$4","v":52005720}]
[]
["OBRA",null,null,null,null,null,null,"CIDADE"]
[{"$f":"Orçamento!$O$7","v":0},null,null,null,null,null,null,{"$f":"Orçamento!$X$7","v":"PIRANHAS"}]
[]
["CRE",null,null,"ENDEREÇO",null,null,null,"REFERÊNCIA AGETOP"]
[{"$f":"Orçamento!$O$10","v":"PIRANHAS"},null,null,{"$f":"Orçamento!$R$10","v":"AV BRASIL CENTRAL 1440, CENTRO, CEP:76230-000"},null,null,null,{"$f":"Orçamento!$X$10","v":"DEZ/18"},{"$f":"Orçamento!$Y$10","v":"ONERADA"}]
[]
["DATA",null,null,"ÁREA TOTAL CONSTRUÍDA (M²)",null,null,null,"REFERÊNCIA SINAPI"]
[{"$f":"Orçamento!$S$7","v":"2020-03-26"},null,null,{"$f":"Orçamento!$S$13","v":3189.69},null,null,null,{"$f":"Orçamento!$X$13","v":"AGO/19"},{"$f":"Orçamento!$Y$13","v":"ONERADA"}]
[]
{"$rows_left_out":524}