{"text_format":"1","workbook":"xlsx","n_sheets":7,"sheets":["Orçamento","Resumo ","Somatório","Cronog_120_Dias","Composição BDI","Relatório CENTRAL","Parc Maior Relev"],"not_rendered":{"charts":0,"images":3,"macros":1,"external_links":0,"defined_names":78,"comments":2,"pivot_tables":0},"unopened":[],"bounds":{"document_bytes":16777216,"sheet_cells":100000,"rows_first":2000,"rows_last":500,"rows_between":2000,"halvings":0,"cell_chars":16384,"cell_head_chars":4096},"cells_cut":0,"cells_raw":0,"read":"whole","date_system":"1900"}

{"sheet":"Orçamento","index":0,"n_rows":661,"n_cols":23,"rows_kept":661,"cut":false,"hidden":false,"merged":[[642,18,642,20],[642,21,642,22],[643,15,643,17],[643,18,643,20],[643,21,643,22],[644,15,644,17],[644,18,644,20],[644,21,644,22],[639,15,639,17],[639,18,639,20],[639,21,639,22],[640,15,640,17],[640,18,640,20],[640,21,640,22],[641,15,641,17],[641,18,641,20],[641,21,641,22],[653,18,653,20],[653,21,653,22],[648,15,648,17],[648,18,648,20],[648,21,648,22],[649,15,649,17],[649,18,649,20],[649,21,649,22],[650,15,650,17],[650,18,650,20],[650,21,650,22],[629,14,629,17],[636,15,636,17],[602,15,602,17],[657,18,657,20],[657,21,657,22],[645,15,645,17],[645,18,645,20],[645,21,645,22],[646,15,646,17],[646,18,646,20],[646,21,646,22],[647,15,647,17],[647,18,647,20],[647,21,647,22],[651,15,651,17],[651,18,651,20],[651,21,651,22],[652,15,652,17],[652,18,652,20],[652,21,652,22],[653,15,653,17],[642,15,642,17],[638,18,638,20],[638,21,638,22],[597,16,597,22],[660,18,660,20],[660,21,660,22],[657,14,657,17],[654,15,654,17],[654,18,654,20],[654,21,654,22],[655,15,655,17],[655,18,655,20],[655,21,655,22],[656,15,656,17],[656,18,656,20],[656,21,656,22],[659,18,659,20],[659,21,659,22],[658,18,658,20],[658,21,658,22],[635,14,635,22],[636,18,636,20],[636,21,636,22],[637,15,637,17],[637,18,637,20],[637,21,637,22],[638,15,638,17],[593,16,593,22],[594,16,594,22],[595,16,595,22],[3,21,3,22],[2,21,2,22],[5,21,5,22],[10,14,10,22],[13,14,13,22],[6,21,6,22],[9,17,9,20],[2,14,2,20],[3,14,3,20],[5,18,5,20],[6,18,6,20],[11,18,11,20],[12,18,12,20],[6,14,6,17],[5,14,5,17],[615,15,615,17],[616,15,616,17],[617,15,617,17],[618,15,618,17],[619,15,619,17],[620,15,620,17],[621,15,621,17],[622,15,622,17],[623,15,623,17],[603,15,603,17],[604,15,604,17],[605,15,605,17],[606,15,606,17],[607,15,607,17],[608,15,608,17],[609,15,609,17],[610,15,610,17],[611,15,611,17],[624,15,624,17],[625,15,625,17],[626,15,626,17],[627,15,627,17],[628,15,628,17],[601,14,601,22],[590,20,590,21],[589,20,589,21],[585,17,590,17],[585,20,585,21],[602,18,602,20],[602,21,602,22],[603,18,603,20],[603,21,603,22],[591,20,591,21],[611,18,611,20],[611,21,611,22],[612,18,612,20],[612,21,612,22],[613,18,613,20],[613,21,613,22],[614,18,614,20],[614,21,614,22],[626,18,626,20],[629,18,629,20],[629,21,629,22],[626,21,626,22],[627,18,627,20],[627,21,627,22],[628,18,628,20],[628,21,628,22],[618,18,618,20],[618,21,618,22],[625,18,625,20],[625,21,625,22],[620,21,620,22],[621,18,621,20],[621,21,621,22],[623,18,623,20],[619,18,619,20],[619,21,619,22],[620,18,620,20],[630,18,630,20],[630,21,630,22],[617,18,617,20],[617,21,617,22],[610,18,610,20],[610,21,610,22],[632,18,632,20],[632,21,632,22],[586,20,586,21],[608,18,608,20],[608,21,608,22],[609,18,609,20],[609,21,609,22],[607,18,607,20],[607,21,607,22],[616,18,616,20],[587,20,587,21],[598,18,598,22],[604,18,604,20],[604,21,604,22],[605,18,605,20],[605,21,605,22],[606,18,606,20],[606,21,606,22],[596,16,596,22],[8,12,9,12],[631,18,631,20],[631,21,631,22],[0,14,0,22],[8,14,8,16],[9,14,9,16],[11,14,11,16],[12,14,12,16],[14,14,14,22],[1,14,1,22],[4,14,4,22],[7,14,7,22],[615,18,615,20],[615,21,615,22],[623,21,623,22],[612,15,612,17],[613,15,613,17],[614,15,614,17],[616,21,616,22],[624,18,624,20],[624,21,624,22],[622,18,622,20],[622,21,622,22]]}
[]
[]
[null,null,null,null,null,null,null,null,null,null,null,null,null,null,"UNIDADE ESCOLAR",null,null,null,null,null,null,"CÓDIGO INEP"]
[null,null,null,null,null,null,null,null,null,null,null,null,null,null,"CENTRO DE ENSINO EM PERÍODO INTEGRAL JOÃO XXIII",null,null,null,null,null,null,52015360]
[]
["Nmax",null,null,null,null,null,null,null,null,null,null,null,"Ajustar altura?",null,"OBRA",null,null,null,"DATA",null,null,"CIDADE"]
[{"$f":"MAX($C$18:$C$585)","v":3},null,null,null,null,null,null,null,null,null,null,null,"SIM",null,"REFORMA E AMPLIAÇÃO",null,null,null,"2020-02-18",null,null,"CERES"]
[]
[null,null,null,null,null,null,null,null,null,null,null,null,{"$f":"IF($M$7=\"MANUAL\",\"DESPROTEJA A PLANILHA PARA FORMATAR\",\"\")","v":""},null,"CRE",null,null,"ENDEREÇO",null,null,null,"REFERÊNCIA AGETOP"]
[null,null,null,null,null,null,null,null,null,null,null,null,null,null,"CERES",null,null,"AV. GOIAS 543, CENTRO, CEP:76300-000",null,null,null,"DEZ/18","DESONERADA"]
[]
[null,null,null,null,null,null,null,null,null,null,null,null,null,null,"ÁREA EXISTENTE (M²)",null,null,"ÁREA A CONSTRUIR (M²)","ÁREA TOTAL CONSTRUÍDA (M²)",null,null,"REFERÊNCIA SINAPI"]
[null,null,null,null,null,null,null,null,null,null,null,null,null,null,3681.83,null,null,288.95999999999998,3970.79,null,null,"JUN/19","DESONERADA"]
[]
[null,null,null,null,null,null,null,null,null,null,null,"FILTRO",null,null,"PLANILHA ORÇAMENTÁRIA"]
["Nível E","Save Nivel","Nível C","Altura","n1","n2","n3","n4","n5","Czero","Cnível","↓","Nível","Nível Corrigido","ITEM","TABELA","CODIGO","DESCRIÇÃO DOS SERVIÇOS","UNID","QUANT","MAT","MO","T.SERVIÇO"]
[{"$f":"CHOOSE(1+LOG(1+2*(ORÇAMENTO.Nivel=\"Nível 1\")+4*(ORÇAMENTO.Nivel=\"Nível 2\")+8*(ORÇAMENTO.Nivel=\"Nível 3\")+16*(ORÇAMENTO.Nivel=\"Nível 4\")+32*(ORÇAMENTO.Nivel=\"Serviço\"),2),0,1,2,3,4,\"S\")","v":"S"},{"$f":"IF(OR(C17=\"s\",C17=0),OFFSET(B17,-1,0),C17)","v":"Save Nivel"},{"$f":"IF(OFFSET(C17,-1,0)=\"L\",1,IF(OFFSET(C17,-1,0)=1,2,IF(OR(A17=\"s\",A17=0),\"S\",IF(AND(OFFSET(C17,-1,0)=2,A17=4),3,IF(AND(OR(OFFSET(C17,-1,0)=\"s\",OFFSET(C17,-1,0)=0),A17<>\"s\",A17>OFFSET(B17,-1,0)),OFFSET(B17,-1,0),A17)))))","v":"S"},{"$f":"IF(OR(C17=\"S\",C17=0),0,IF(ISERROR(K17),J17,SMALL(J17:K17,1)))","v":0},{"$f":"IF($C17=1,OFFSET(E17,-1,0)+1,OFFSET(E17,-1,0))","v":"n1"},{"$f":"IF($C17=1,0,IF($C17=2,OFFSET(F17,-1,0)+1,OFFSET(F17,-1,0)))","v":"n2"},{"$f":"IF(AND($C17<=2,$C17<>0),0,IF($C17=3,OFFSET(G17,-1,0)+1,OFFSET(G17,-1,0)))","v":"n3"},{"$f":"IF(AND($C17<=3,$C17<>0),0,IF($C17=4,OFFSET(H17,-1,0)+1,OFFSET(H17,-1,0)))","v":"n4"},{"$f":"IF(AND($C17<=4,$C17<>0),0,IF(AND($C17=\"S\",$W17>0),OFFSET(I17,-1,0)+1,OFFSET(I17,-1,0)))","v":"n5"},{"$f":"IF(OR($C17=\"S\",$C17=0),0,MATCH(0,OFFSET($D17,1,$C17,ROW($C$585)-ROW($C17)),0))","v":0},{"$f":"IF(OR($C17=\"S\",$C17=0),0,MATCH(OFFSET($D17,0,$C17)+1,OFFSET($D17,1,$C17,ROW($C$585)-ROW($C17)),0))","v":0},{"$f":"IF(OR(W17>0,$C17=1),\"F\",\"\")","v":""},"Serviço",{"$f":"CHOOSE(1+LOG(1+2*(C17=1)+4*(C17=2)+8*(C17=3)+16*(C17=4)+32*(C17=\"S\"),2),\"\",\"Nível 1\",\"Nível 2\",\"Nível 3\",\"Nível 4\",\"Serviço\")","v":"Serviço"},"-","SINAPI",null,"(sem código)","-",null,0,0,0]
[0,null,"L",{"$f":"COUNTA(OFFSET(D18,1,0):D$585)","v":566},{"$f":"LEFT(O19,1)-1","v":0},null,null,null,null,null,null,"F","LOTE","LOTE","REFORMA E AMPLIAÇÃO - CENTRO DE ENSINO EM PERÍODO INTEGRAL JOÃO XXIII",null,null,null,null,null,null,null,490894.03000000009]
[1,{"$f":"IF(OR(C19=\"s\",C19=0),OFFSET(B19,-1,0),C19)","v":1},{"$f":"IF(OFFSET(C19,-1,0)=\"L\",1,IF(OFFSET(C19,-1,0)=1,2,IF(OR(A19=\"s\",A19=0),\"S\",IF(AND(OFFSET(C19,-1,0)=2,A19=4),3,IF(AND(OR(OFFSET(C19,-1,0)=\"s\",OFFSET(C19,-1,0)=0),A19<>\"s\",A19>OFFSET(B19,-1,0)),OFFSET(B19,-1,0),A19)))))","v":1},{"$f":"IF(OR(C19=\"S\",C19=0),0,IF(ISERROR(K19),J19,SMALL(J19:K19,1)))","v":166},{"$f":"IF($C19=1,OFFSET(E19,-1,0)+1,OFFSET(E19,-1,0))","v":1},{"$f":"IF($C19=1,0,IF($C19=2,OFFSET(F19,-1,0)+1,OFFSET(F19,-1,0)))","v":0},{"$f":"IF(AND($C19<=2,$C19<>0),0,IF($C19=3,OFFSET(G19,-1,0)+1,OFFSET(G19,-1,0)))","v":0},{"$f":"IF(AND($C19<=3,$C19<>0),0,IF($C19=4,OFFSET(H19,-1,0)+1,OFFSET(H19,-1,0)))","v":0},0,{"$f":"IF(OR($C19=\"S\",$C19=0),0,MATCH(0,OFFSET($D19,1,$C19,ROW($C$585)-ROW($C19)),0))","v":566},{"$f":"IF(OR($C19=\"S\",$C19=0),0,MATCH(OFFSET($D19,0,$C19)+1,OFFSET($D19,1,$C19,ROW($C$585)-ROW($C19)),0))","v":166},{"$f":"IF(OR(W19>0,$C19=1),\"F\",\"\")","v":"F"},"Nível 1",{"$f":"CHOOSE(1+LOG(1+2*(C19=1)+4*(C19=2)+8*(C19=3)+16*(C19=4)+32*(C19=\"S\"),2),\"\",\"Nível 1\",\"Nível 2\",\"Nível 3\",\"Nível 4\",\"Serviço\")","v":"Nível 1"},"1.","AGETOP",null,"REFORMA"]
[2,{"$f":"IF(OR(C20=\"s\",C20=0),OFFSET(B20,-1,0),C20)","v":2},{"$f":"IF(OFFSET(C20,-1,0)=\"L\",1,IF(OFFSET(C20,-1,0)=1,2,IF(OR(A20=\"s\",A20=0),\"S\",IF(AND(OFFSET(C20,-1,0)=2,A20=4),3,IF(AND(OR(OFFSET(C20,-1,0)=\"s\",OFFSET(C20,-1,0)=0),A20<>\"s\",A20>OFFSET(B20,-1,0)),OFFSET(B20,-1,0),A20)))))","v":2},{"$f":"IF(OR(C20=\"S\",C20=0),0,IF(ISERROR(K20),J20,SMALL(J20:K20,1)))","v":12},{"$f":"IF($C20=1,OFFSET(E20,-1,0)+1,OFFSET(E20,-1,0))","v":1},{"$f":"IF($C20=1,0,IF($C20=2,OFFSET(F20,-1,0)+1,OFFSET(F20,-1,0)))","v":1},{"$f":"IF(AND($C20<=2,$C20<>0),0,IF($C20=3,OFFSET(G20,-1,0)+1,OFFSET(G20,-1,0)))","v":0},{"$f":"IF(AND($C20<=3,$C20<>0),0,IF($C20=4,OFFSET(H20,-1,0)+1,OFFSET(H20,-1,0)))","v":0},0,165,12,"","Nível 2","Nível 2","1.1.","AGETOP",null,"SERVIÇOS PRELIMINARES"]
[3,{"$f":"IF(OR(C21=\"s\",C21=0),OFFSET(B21,-1,0),C21)","v":3},{"$f":"IF(OFFSET(C21,-1,0)=\"L\",1,IF(OFFSET(C21,-1,0)=1,2,IF(OR(A21=\"s\",A21=0),\"S\",IF(AND(OFFSET(C21,-1,0)=2,A21=4),3,IF(AND(OR(OFFSET(C21,-1,0)=\"s\",OFFSET(C21,-1,0)=0),A21<>\"s\",A21>OFFSET(B21,-1,0)),OFFSET(B21,-1,0),A21)))))","v":3},{"$f":"IF(OR(C21=\"S\",C21=0),0,IF(ISERROR(K21),J21,SMALL(J21:K21,1)))","v":11},1,1,1,0,0,11,82,"","Nível 3",{"$f":"CHOOSE(1+LOG(1+2*(C21=1)+4*(C21=2)+8*(C21=3)+16*(C21=4)+32*(C21=\"S\"),2),\"\",\"Nível 1\",\"Nível 2\",\"Nível 3\",\"Nível 4\",\"Serviço\")","v":"Nível 3"},"1.1.1.","SINAPI",null,"DEMOLIÇÃO","-"]
["S",3,"S",0,1,1,1,0,0,0,0,"","Serviço","Serviço","1.1.1.1.","SINAPI",98531,"CORTE RASO E RECORTE DE ÁRVORE COM DIÂMETRO DE TRONCO MAIOR OU IGUAL A 0,60 M.AF_05/2018","UN",1]
["S",3,"S",0,1,1,1,0,0,0,0,"","Serviço","Serviço","1.1.1.2.","SINAPI",98527,"REMOÇÃO DE RAÍZES REMANESCENTES DE TRONCO DE ÁRVORE COM DIÂMETRO MAIOR OU IGUAL A 0,40 M E MENOR QUE 0,60 M.AF_05/2018","UN",1]
["S",3,"S",0,1,1,1,0,0,0,0,"","Serviço","Serviço","1.1.1.3.","AGETOP",20102,"DEMOLICAO-COBERTURA TELHA FIBROCIMENTO/FIBRA DE VIDRO/SIMILARES C/ TRANSP. ATÉ CB. E CARGA","m2    ",157.68]
["S",3,"S",0,1,1,1,0,0,0,0,"","Serviço","Serviço","1.1.1.4.","AGETOP",20155,"DEMOL.MURO/PAREDE PLACA PRÉ-MOLDADA C/TRANSP.C.B.E CARGA","m2    ",7.3]
["S",3,"S",0,1,1,1,0,0,0,0,"","Serviço","Serviço","1.1.1.5.","SINAPI",97644,"REMOÇÃO DE PORTAS, DE FORMA MANUAL, SEM REAPROVEITAMENTO. AF_12/2017","M2",3]
["S",3,"S",0,1,1,1,0,0,0,0,"","Serviço","Serviço","1.1.1.6.","AGETOP",20109,"DEM.PISO CIMENT.SOBRE LASTRO CONC.C/TR.ATE CB. E CARGA","m2    ",970.67200000000003]
["S",3,"S",0,1,1,1,0,0,0,0,"","Serviço","Serviço","1.1.1.7.","AGETOP",20112,"DEM.PISO CERAM. INCLUS. RETIRADA DE CONTRAPISO SOBRE LASTRO CONC.C/TR.CB.E CARGA","m2    ",386.4]
["S",3,"S",0,1,1,1,0,0,0,0,"","Serviço","Serviço","1.1.1.8.","SINAPI",97622,"DEMOLIÇÃO DE ALVENARIA DE BLOCO FURADO, DE FORMA MANUAL, SEM REAPROVEITAMENTO. AF_12/2017","M3",0.32399999999999995]
["S",3,"S",0,1,1,1,0,0,0,0,"","Serviço","Serviço","1.1.1.9.","AGETOP",20162,"DEMOLIÇÃO DAS INSTALAÇÕES ELÉTRICAS E AFINS C/ TRANSP. ATÉ CB. E CARGA","H     ",40]
["S",3,"S",0,1,1,1,0,0,0,0,"","Serviço","Serviço","1.1.1.10.","SINAPI","74209/1","PLACA DE OBRA EM CHAPA DE ACO GALVANIZADO","M2",4.5]
[2,2,2,3,1,2,0,0,0,153,3,"","Nível 2","Nível 2","1.2.","AGETOP",null,"TRANSPORTES","-"]
["S",2,"S",0,1,2,0,0,0,0,0,"","Serviço","Serviço","1.2.0.1.","SINAPI",72900,"TRANSPORTE DE ENTULHO COM CAMINHAO BASCULANTE 6 M3, RODOVIA PAVIMENTADA, DMT 0,5 A 1,0 KM","M3",64.493000000000009]
["S",2,"S",0,1,2,0,0,0,0,0,"","Serviço","Serviço","1.2.0.2.","SINAPI",72897,"CARGA MANUAL DE ENTULHO EM CAMINHAO BASCULANTE 6 M3","M3",64.493000000000009]
[2,2,2,4,1,3,0,0,0,150,4,"","Nível 2","Nível 2","1.3.","SINAPI",null,"SERVIÇO EM TERRA","-"]
[3,3,3,3,1,3,1,0,0,3,67,"","Nível 3","Nível 3","1.3.1.","SINAPI",null,"REGULARIZAÇÃO DA RAMPA","-"]
["S",3,"S",0,1,3,1,0,0,0,0,"","Serviço","Serviço","1.3.1.1.","AGETOP",41140,"REGULARIZAÇÃO DO TERRENO SEM APILOAMENTO COM TRANSPORTE MANUAL DA TERRA ESCAVADA ","m2    ",708.04000000000008]
["S",3,"S",0,1,3,1,0,0,0,0,"","Serviço","Serviço","1.3.1.2.","AGETOP",41002,"APILOAMENTO","m2    ",1361.02]
[2,2,2,60,1,4,0,0,0,146,60,"","Nível 2","Nível 2","1.4.","AGETOP",null,"INSTALAÇÕES ELÉTRICAS","-"]
["S",2,"S",0,1,4,0,0,0,0,0,"","Serviço","Serviço","1.4.0.1.","SINAPI","74131/4","QUADRO DE DISTRIBUICAO DE ENERGIA DE EMBUTIR, EM CHAPA METALICA, PARA 18 DISJUNTORES TERMOMAGNETICOS MONOPOLARES, COM BARRAMENTO TRIFASICO E NEUTRO, FORNECIMENTO E INSTALACAO","UN",6]
["S",2,"S",0,1,4,0,0,0,0,0,"","Serviço","Serviço","1.4.0.2.","SINAPI","74131/5","QUADRO DE DISTRIBUICAO DE ENERGIA DE EMBUTIR, EM CHAPA METALICA, PARA 24 DISJUNTORES TERMOMAGNETICOS MONOPOLARES, COM BARRAMENTO TRIFASICO E NEUTRO, FORNECIMENTO E INSTALACAO","UN",1]
["S",2,"S",0,1,4,0,0,0,0,0,"","Serviço","Serviço","1.4.0.3.","SINAPI",93673,"DISJUNTOR TRIPOLAR TIPO DIN, CORRENTE NOMINAL DE 50A - FORNECIMENTO E INSTALAÇÃO. AF_04/2016","UN",1]
["S",2,"S",0,1,4,0,0,0,0,0,"","Serviço","Serviço","1.4.0.4.","SINAPI",93671,"DISJUNTOR TRIPOLAR TIPO DIN, CORRENTE NOMINAL DE 32A - FORNECIMENTO E INSTALAÇÃO. AF_04/2016","UN",4]
["S",2,"S",0,1,4,0,0,0,0,0,"","Serviço","Serviço","1.4.0.5.","AGETOP",71175,"DISJUNTOR TRIPOLAR DE 60 A 100-A","Un    ",3]
["S",2,"S",0,1,4,0,0,0,0,0,"","Serviço","Serviço","1.4.0.6.","SINAPI","74130/10","DISJUNTOR TERMOMAGNETICO TRIPOLAR EM CAIXA MOLDADA 175 A 225A 240V, FORNECIMENTO E INSTALACAO","UN",2]
["S",2,"S",0,1,4,0,0,0,0,0,"","Serviço","Serviço","1.4.0.7.","SINAPI",93656,"DISJUNTOR MONOPOLAR TIPO DIN, CORRENTE NOMINAL DE 25A - FORNECIMENTO E INSTALAÇÃO. AF_04/2016","UN",31]
["S",2,"S",0,1,4,0,0,0,0,0,"","Serviço","Serviço","1.4.0.8.","SINAPI",93654,"DISJUNTOR MONOPOLAR TIPO DIN, CORRENTE NOMINAL DE 16A - FORNECIMENTO E INSTALAÇÃO. AF_04/2016","UN",31]
["S",2,"S",0,1,4,0,0,0,0,0,"","Serviço","Serviço","1.4.0.9.","SINAPI",93653,"DISJUNTOR MONOPOLAR TIPO DIN, CORRENTE NOMINAL DE 10A - FORNECIMENTO E INSTALAÇÃO. AF_04/2016","UN",8]
["S",2,"S",0,1,4,0,0,0,0,0,"","Serviço","Serviço","1.4.0.10.","AGETOP",71184,"DISPOSITIVO DE PROTEÇÃO CONTRA SURTOS (D.P.S.) 275V DE 8 A 40KA","Un    ",3]
["S",2,"S",0,1,4,0,0,0,0,0,"","Serviço","Serviço","1.4.0.11.","SINAPI",91926,"CABO DE COBRE FLEXÍVEL ISOLADO, 2,5 MM², ANTI-CHAMA 450/750 V, PARA CIRCUITOS TERMINAIS - FORNECIMENTO E INSTALAÇÃO. AF_12/2015","M",4213]
["S",2,"S",0,1,4,0,0,0,0,0,"","Serviço","Serviço","1.4.0.12.","SINAPI",91928,"CABO DE COBRE FLEXÍVEL ISOLADO, 4 MM², ANTI-CHAMA 450/750 V, PARA CIRCUITOS TERMINAIS - FORNECIMENTO E INSTALAÇÃO. AF_12/2015","M",1815]
["S",2,"S",0,1,4,0,0,0,0,0,"","Serviço","Serviço","1.4.0.13.","SINAPI",91930,"CABO DE COBRE FLEXÍVEL ISOLADO, 6 MM², ANTI-CHAMA 450/750 V, PARA CIRCUITOS TERMINAIS - FORNECIMENTO E INSTALAÇÃO. AF_12/2015","M",1000]
["S",2,"S",0,1,4,0,0,0,0,0,"","Serviço","Serviço","1.4.0.14.","SINAPI",92979,"CABO DE COBRE FLEXÍVEL ISOLADO, 10 MM², ANTI-CHAMA 450/750 V, PARA DISTRIBUIÇÃO - FORNECIMENTO E INSTALAÇÃO. AF_12/2015","M",745]
["S",2,"S",0,1,4,0,0,0,0,0,"","Serviço","Serviço","1.4.0.15.","SINAPI",92981,"CABO DE COBRE FLEXÍVEL ISOLADO, 16 MM², ANTI-CHAMA 450/750 V, PARA DISTRIBUIÇÃO - FORNECIMENTO E INSTALAÇÃO. AF_12/2015","M",640]
["S",2,"S",0,1,4,0,0,0,0,0,"","Serviço","Serviço","1.4.0.16.","SINAPI",92990,"CABO DE COBRE FLEXÍVEL ISOLADO, 70 MM², ANTI-CHAMA 0,6/1,0 KV, PARA DISTRIBUIÇÃO - FORNECIMENTO E INSTALAÇÃO. AF_12/2015","M",105]
["S",2,"S",0,1,4,0,0,0,0,0,"","Serviço","Serviço","1.4.0.17.","SINAPI",92986,"CABO DE COBRE FLEXÍVEL ISOLADO, 35 MM², ANTI-CHAMA 0,6/1,0 KV, PARA DISTRIBUIÇÃO - FORNECIMENTO E INSTALAÇÃO. AF_12/2015","M",26]
["S",2,"S",0,1,4,0,0,0,0,0,"","Serviço","Serviço","1.4.0.18.","AGETOP",70541,"CABO DE COBRE NU No. 16 MM2 (6,94 M/KG)","M     ",15]
["S",2,"S",0,1,4,0,0,0,0,0,"","Serviço","Serviço","1.4.0.19.","AGETOP",70544,"CABO DE COBRE NÚ No. 50 MM2","M     ",40]
["S",2,"S",0,1,4,0,0,0,0,0,"","Serviço","Serviço","1.4.0.20.","SINAPI",91867,"ELETRODUTO RÍGIDO ROSCÁVEL, PVC, DN 25 MM (3/4\"), PARA CIRCUITOS TERMINAIS, INSTALADO EM LAJE - FORNECIMENTO E INSTALAÇÃO. AF_12/2015","M",1870]
["S",2,"S",0,1,4,0,0,0,0,0,"","Serviço","Serviço","1.4.0.21.","SINAPI",91868,"ELETRODUTO RÍGIDO ROSCÁVEL, PVC, DN 32 MM (1\"), PARA CIRCUITOS TERMINAIS, INSTALADO EM LAJE - FORNECIMENTO E INSTALAÇÃO. AF_12/2015","M",1000]
["S",2,"S",0,1,4,0,0,0,0,0,"","Serviço","Serviço","1.4.0.22.","SINAPI",93008,"ELETRODUTO RÍGIDO ROSCÁVEL, PVC, DN 50 MM (1 1/2\") - FORNECIMENTO E INSTALAÇÃO. AF_12/2015","M",670]
["S",2,"S",0,1,4,0,0,0,0,0,"","Serviço","Serviço","1.4.0.23.","SINAPI",93010,"ELETRODUTO RÍGIDO ROSCÁVEL, PVC, DN 75 MM (2 1/2\") - FORNECIMENTO E INSTALAÇÃO. AF_12/2015","M",20]
["S",2,"S",0,1,4,0,0,0,0,0,"","Serviço","Serviço","1.4.0.24.","SINAPI",93009,"ELETRODUTO RÍGIDO ROSCÁVEL, PVC, DN 60 MM (2\") - FORNECIMENTO E INSTALAÇÃO. AF_12/2015","M",350]
["S",2,"S",0,1,4,0,0,0,0,0,"","Serviço","Serviço","1.4.0.25.","SINAPI",93012,"ELETRODUTO RÍGIDO ROSCÁVEL, PVC, DN 110 MM (4\") - FORNECIMENTO E INSTALAÇÃO. AF_12/2015","M",50]
["S",2,"S",0,1,4,0,0,0,0,0,"","Serviço","Serviço","1.4.0.26.","AGETOP",70351,"BRACADEIRA METALICA TIPO \"U\" DIAM. 3/4\"","Un    ",600]
["S",2,"S",0,1,4,0,0,0,0,0,"","Serviço","Serviço","1.4.0.27.","AGETOP",70352,"BRACADEIRA METALICA TIPO \"U\" DIAM. 1\"","Un    ",200]
["S",2,"S",0,1,4,0,0,0,0,0,"","Serviço","Serviço","1.4.0.28.","AGETOP",70354,"BRACADEIRA METALICA TIPO \"U\" DIAM. 1.1/2\"","Un    ",120]
["S",2,"S",0,1,4,0,0,0,0,0,"","Serviço","Serviço","1.4.0.29.","AGETOP",70355,"BRACADEIRA METALICA TIPO \"U\" DIAM. 2\"","Un    ",95]
["S",2,"S",0,1,4,0,0,0,0,0,"","Serviço","Serviço","1.4.0.30.","AGETOP",70356,"BRACADEIRA METALICA TIPO \"U\" DIAM. 2.1/2\"","Un    ",7]
["S",2,"S",0,1,4,0,0,0,0,0,"","Serviço","Serviço","1.4.0.31.","AGETOP",70358,"BRACADEIRA METALICA TIPO \"U\" DIAM. 4\"","Un    ",17]
["S",2,"S",0,1,4,0,0,0,0,0,"","Serviço","Serviço","1.4.0.32.","SINAPI",91879,"LUVA PARA ELETRODUTO, PVC, ROSCÁVEL, DN 25 MM (3/4\"), PARA CIRCUITOS TERMINAIS, INSTALADA EM LAJE - FORNECIMENTO E INSTALAÇÃO. AF_12/2015","UN",600]
["S",2,"S",0,1,4,0,0,0,0,0,"","Serviço","Serviço","1.4.0.33.","SINAPI",91880,"LUVA PARA ELETRODUTO, PVC, ROSCÁVEL, DN 32 MM (1\"), PARA CIRCUITOS TERMINAIS, INSTALADA EM LAJE - FORNECIMENTO E INSTALAÇÃO. AF_12/2015","UN",200]
["S",2,"S",0,1,4,0,0,0,0,0,"","Serviço","Serviço","1.4.0.34.","SINAPI",93013,"LUVA PARA ELETRODUTO, PVC, ROSCÁVEL, DN 50 MM (1 1/2\") - FORNECIMENTO E INSTALAÇÃO. AF_12/2015","UN",120]
["S",2,"S",0,1,4,0,0,0,0,0,"","Serviço","Serviço","1.4.0.35.","SINAPI",93014,"LUVA PARA ELETRODUTO, PVC, ROSCÁVEL, DN 60 MM (2\") - FORNECIMENTO E INSTALAÇÃO. AF_12/2015","UN",95]
["S",2,"S",0,1,4,0,0,0,0,0,"","Serviço","Serviço","1.4.0.36.","SINAPI",93015,"LUVA PARA ELETRODUTO, PVC, ROSCÁVEL, DN 75 MM (2 1/2\") - FORNECIMENTO E INSTALAÇÃO. AF_12/2015","UN",7]
["S",2,"S",0,1,4,0,0,0,0,0,"","Serviço","Serviço","1.4.0.37.","SINAPI",93017,"LUVA PARA ELETRODUTO, PVC, ROSCÁVEL, DN 110 MM (4\") - FORNECIMENTO E INSTALAÇÃO. AF_12/2015","UN",17]
["S",2,"S",0,1,4,0,0,0,0,0,"","Serviço","Serviço","1.4.0.38.","SINAPI",95801,"CONDULETE DE ALUMÍNIO, TIPO X, PARA ELETRODUTO DE AÇO GALVANIZADO DN 20 MM (3/4''), APARENTE - FORNECIMENTO E INSTALAÇÃO. AF_11/2016_P","UN",200]
["S",2,"S",0,1,4,0,0,0,0,0,"","Serviço","Serviço","1.4.0.39.","SINAPI",91902,"CURVA 90 GRAUS PARA ELETRODUTO, PVC, ROSCÁVEL, DN 25 MM (3/4\"), PARA CIRCUITOS TERMINAIS, INSTALADA EM LAJE - FORNECIMENTO E INSTALAÇÃO. AF_12/2015","UN",89]
["S",2,"S",0,1,4,0,0,0,0,0,"","Serviço","Serviço","1.4.0.40.","SINAPI",91905,"CURVA 90 GRAUS PARA ELETRODUTO, PVC, ROSCÁVEL, DN 32 MM (1\"), PARA CIRCUITOS TERMINAIS, INSTALADA EM LAJE - FORNECIMENTO E INSTALAÇÃO. AF_12/2015","UN",18]
["S",2,"S",0,1,4,0,0,0,0,0,"","Serviço","Serviço","1.4.0.41.","AGETOP",71124,"CURVA 90 GRAUS AÇO ZINCADO DIÂMETRO 1.1/2\"","Un    ",13]
["S",2,"S",0,1,4,0,0,0,0,0,"","Serviço","Serviço","1.4.0.42.","AGETOP",71125,"CURVA 90 GRAUS AÇO ZINCADO DIÂMETRO 2\"","Un    ",9]
["S",2,"S",0,1,4,0,0,0,0,0,"","Serviço","Serviço","1.4.0.43.","AGETOP",71126,"CURVA 90 GRAUS AÇO ZINCADO DIÂMETRO 2.1/2\"","Un    ",10]
["S",2,"S",0,1,4,0,0,0,{"$f":"IF(OR($C83=\"S\",$C83=0),0,MATCH(0,OFFSET($D83,1,$C83,ROW($C$585)-ROW($C83)),0))","v":0},{"$f":"IF(OR($C83=\"S\",$C83=0),0,MATCH(OFFSET($D83,0,$C83)+1,OFFSET($D83,1,$C83,ROW($C$585)-ROW($C83)),0))","v":0},"","Serviço","Serviço","1.4.0.44.","AGETOP",71128,"CURVA 90 GRAUS AÇO ZINCADO DIÂMETRO 4\"","Un    ",10]
["S",2,"S",0,1,4,0,0,0,0,0,"","Serviço","Serviço","1.4.0.45.","SINAPI",92870,"CAIXA RETANGULAR 4\" X 4\" ALTA (2,00 M DO PISO), METÁLICA, INSTALADA EM PAREDE - FORNECIMENTO E INSTALAÇÃO. AF_12/2015","UN",40]
["S",2,"S",0,1,4,0,0,0,0,0,"","Serviço","Serviço","1.4.0.46.","SINAPI",91953,"INTERRUPTOR SIMPLES (1 MÓDULO), 10A/250V, INCLUINDO SUPORTE E PLACA - FORNECIMENTO E INSTALAÇÃO. AF_12/2015","UN",20]
["S",2,"S",0,1,4,0,0,0,0,0,"","Serviço","Serviço","1.4.0.47.","SINAPI",91959,"INTERRUPTOR SIMPLES (2 MÓDULOS), 10A/250V, INCLUINDO SUPORTE E PLACA - FORNECIMENTO E INSTALAÇÃO. AF_12/2015","UN",10]
["S",2,"S",0,1,4,0,0,0,0,0,"","Serviço","Serviço","1.4.0.48.","SINAPI",92000,"TOMADA BAIXA DE EMBUTIR (1 MÓDULO), 2P+T 10 A, INCLUINDO SUPORTE E PLACA - FORNECIMENTO E INSTALAÇÃO. AF_12/2015","UN",13]
["S",2,"S",0,1,4,0,0,0,0,0,"","Serviço","Serviço","1.4.0.49.","SINAPI",91996,"TOMADA MÉDIA DE EMBUTIR (1 MÓDULO), 2P+T 10 A, INCLUINDO SUPORTE E PLACA - FORNECIMENTO E INSTALAÇÃO. AF_12/2015","UN",5]
["S",2,"S",0,1,4,0,0,0,0,0,"","Serviço","Serviço","1.4.0.50.","SINAPI",91993,"TOMADA ALTA DE EMBUTIR (1 MÓDULO), 2P+T 20 A, INCLUINDO SUPORTE E PLACA - FORNECIMENTO E INSTALAÇÃO. AF_12/2015","UN",31]
["S",2,"S",0,1,4,0,0,0,0,0,"","Serviço","Serviço","1.4.0.51.","SINAPI",97585,"LUMINÁRIA TIPO CALHA, DE SOBREPOR, COM 2 LÂMPADAS TUBULARES DE 18 W - FORNECIMENTO E INSTALAÇÃO. AF_11/2017","UN",124]
["S",2,"S",0,1,4,0,0,0,0,0,"","Serviço","Serviço","1.4.0.52.","SINAPI",97593,"LUMINÁRIA TIPO SPOT, DE SOBREPOR, COM 1 LÂMPADA DE 15 W - FORNECIMENTO E INSTALAÇÃO. AF_11/2017","UN",6]
["S",2,"S",0,1,4,0,0,0,0,0,"","Serviço","Serviço","1.4.0.53.","SINAPI",97610,"LÂMPADA COMPACTA DE LED 10 W, BASE E27 - FORNECIMENTO E INSTALAÇÃO. AF_11/2017","UN",254]
["S",2,"S",0,1,4,0,0,0,0,0,"","Serviço","Serviço","1.4.0.54.","SINAPI","73831/8","LAMPADA DE VAPOR DE SODIO DE 250WX220V - FORNECIMENTO E INSTALACAO","UN",9]
["S",2,"S",0,1,4,0,0,0,0,0,"","Serviço","Serviço","1.4.0.55.","SINAPI",97889,"CAIXA ENTERRADA ELÉTRICA RETANGULAR, EM ALVENARIA COM TIJOLOS CERÂMICOS MACIÇOS, FUNDO COM BRITA, DIMENSÕES INTERNAS: 0,8X0,8X0,6 M. AF_05/2018","UN",5]
["S",2,"S",0,1,4,0,0,0,0,0,"","Serviço","Serviço","1.4.0.56.","SINAPI",6171,"TAMPA DE CONCRETO ARMADO 60X60X5CM PARA CAIXA","UN",5]
["S",2,"S",0,1,4,0,0,0,0,0,"","Serviço","Serviço","1.4.0.57.","AGETOP",71861,"PARAFUSO P/BUCHA S-6","Un    ",500]
["S",2,"S",0,1,4,0,0,0,0,0,"","Serviço","Serviço","1.4.0.58.","AGETOP",70647,"CAIXA DE PASSAGEM METÁLICA DE EMBUTIR 30X30X12 CM","Un    ",2]
["S",2,"S",0,1,4,0,0,0,0,0,"","Serviço","Serviço","1.4.0.59.","AGETOP",70391,"BUCHA DE NYLON S-6","Un    ",500]
[2,2,2,19,1,5,0,0,0,86,19,"","Nível 2","Nível 2","1.5.","SINAPI",null,"INSTALAÇÕES HIDROSSANITÁRIAS","-"]
[3,3,3,3,1,5,1,0,0,18,3,"","Nível 3","Nível 3","1.5.1.","SINAPI",null,"PEÇAS E ACESSÓRIOS ","-"]
["S",3,"S",0,1,5,1,0,0,0,0,"","Serviço","Serviço","1.5.1.1.","AGETOP",81501,"ADESIVO PLASTICO - FRASCO 850 G","Un    ",1]
["S",3,"S",0,1,5,1,0,0,0,0,"","Serviço","Serviço","1.5.1.2.","AGETOP",81504,"SOLUCAO LIMPADORA 1000 CM3","Un    ",1]
[3,3,3,3,1,5,2,0,0,15,3,"","Nível 3","Nível 3","1.5.2.","SINAPI",null,"ÁGUA FRIA","-"]
["S",3,"S",0,1,5,2,0,0,0,0,"","Serviço","Serviço","1.5.2.1.","AGETOP",81004,"TUBO SOLDAVEL PVC MARROM DIAMETRO 32 mm","m     ",13]
["S",3,"S",0,1,5,2,0,0,0,0,"","Serviço","Serviço","1.5.2.2.","AGETOP",81322,"JOELHO 90 GRAUS SOLDAVEL DIAMETRO 32 MM (1\")","Un    ",6]
[3,3,3,2,1,5,3,0,0,12,2,"","Nível 3","Nível 3","1.5.3.","SINAPI",null,"ESGOTO","-"]
["S",3,"S",0,1,5,3,0,0,0,0,"","Serviço","Serviço","1.5.3.1.","AGETOP",82304,"TUBO SOLDAVEL P/ESGOTO DIAM. 100 MM","m     ",17]
[3,3,3,10,1,5,4,0,0,10,72,"","Nível 3","Nível 3","1.5.4.","SINAPI",null,"INSTALAÇÕES DE INCENDIO","-"]
["S",3,"S",0,1,5,4,0,0,0,0,"","Serviço","Serviço","1.5.4.1.","AGETOP",72338,"SIRENE METALICA ALCANCE 500 M","Un    ",1]
["S",3,"S",0,1,5,4,0,0,0,0,"","Serviço","Serviço","1.5.4.2.","COMPOSIÇÃO","COMP 188_SEE","ACIONADOR MANUAL DE ALARME","UN ",7]
["S",3,"S",0,1,5,4,0,0,0,0,"","Serviço","Serviço","1.5.4.3.","COMPOSIÇÃO","COMP 190_SEE","CENTRAL DE DETECÇÃO E ALARME DE 40 SETORES COM BATERIA","UN ",1]
["S",3,"S",0,1,5,4,0,0,0,0,"","Serviço","Serviço","1.5.4.4.","AGETOP",85003,"EXTINTOR PO QUIMICO SECO (6 KG) - CAPACIDADE EXTINTORA 20 BC","Un    ",1]
["S",3,"S",0,1,5,4,0,0,0,0,"","Serviço","Serviço","1.5.4.5.","AGETOP",85006,"EXTINTOR MULTI USO EM PO A B C (6 KG) - CAPACIDADE EXTINTORA 3A 20BC","un    ",9]
["S",3,"S",0,1,5,4,0,0,0,0,"","Serviço","Serviço","1.5.4.6.","COMPOSIÇÃO","COMP 024_SEE","SINALIZADOR FOTOLUMINESCENTE PARA EXTINTOR","UN ",10]
["S",3,"S",0,1,5,4,0,0,0,0,"","Serviço","Serviço","1.5.4.7.","COMPOSIÇÃO","COMP 025_SEE","SINALIZADOR FOTOLUMINESCENTE DE EMERGÊNCIA","UN ",24]
["S",3,"S",0,1,5,4,0,0,0,0,"","Serviço","Serviço","1.5.4.8.","COMPOSIÇÃO","COMP 277_SEE","MARCAÇÃO NO PISO - 1X1 M PARA EXTINTOR","M2",10]
["S",3,"S",0,1,5,4,0,0,0,0,"","Serviço","Serviço","1.5.4.9.","AGETOP",71598,"LUMINÁRIA DE EMERGÊNCIA 30 LEDS","un    ",15]
[2,2,2,27,1,6,0,0,0,67,27,"","Nível 2","Nível 2","1.6.","SINAPI",null,"INSTALAÇÕES ESPECIAIS","-"]
["S",2,"S",0,1,6,0,0,0,0,0,"","Serviço","Serviço","1.6.0.1.","SINAPI",91007,"FORMAS MANUSEÁVEIS PARA PAREDES DE CONCRETO MOLDADAS IN LOCO, DE EDIFICAÇÕES DE PAVIMENTO ÚNICO, EM PANOS DE FACHADA SEM VÃOS. AF_06/2015","M2",1]
["S",2,"S",0,1,6,0,0,0,0,0,"","Serviço","Serviço","1.6.0.2.","AGETOP",91023,"UNIÃO S/BRONZE PRETA 3/4\" NPT 300 LBS","Un    ",3]
["S",2,"S",0,1,6,0,0,0,0,0,"","Serviço","Serviço","1.6.0.3.","COMPOSIÇÃO","COMP 382_SEE","TE DE REDUCAO DE FERRO GALVANIZADO, COM ROSCA BSP, DE 3/4\" X 1/2\"","UN ",1]
["S",2,"S",0,1,6,0,0,0,0,0,"","Serviço","Serviço","1.6.0.4.","COMPOSIÇÃO","COMP 383_SEE","BUCHA DE REDUCAO DE FERRO GALVANIZADO, COM ROSCA BSP, DE 1/2\" X 1/4\"","UN ",3]
["S",2,"S",0,1,6,0,0,0,0,0,"","Serviço","Serviço","1.6.0.5.","SINAPI",91021,"PERFURATRIZ HIDRÁULICA SOBRE CAMINHÃO COM TRADO CURTO ACOPLADO, PROFUNDIDADE MÁXIMA DE 20 M, DIÂMETRO MÁXIMO DE 1500 MM, POTÊNCIA INSTALADA DE 137 HP, MESA ROTATIVA COM TORQUE MÁXIMO DE 30 KNM - IMPOSTOS E SEGUROS. AF_06/2015","H",2]
["S",2,"S",0,1,6,0,0,0,0,0,"","Serviço","Serviço","1.6.0.6.","SINAPI",92692,"NIPLE, EM FERRO GALVANIZADO, CONEXÃO ROSQUEADA, DN 15 (1/2\"), INSTALADO EM RAMAIS E SUB-RAMAIS DE GÁS - FORNECIMENTO E INSTALAÇÃO. AF_12/2015","UN",6]
["S",2,"S",0,1,6,0,0,0,0,0,"","Serviço","Serviço","1.6.0.7.","SINAPI",91031,"CAMINHÃO TRUCADO (C/ TERCEIRO EIXO) ELETRÔNICO - POTÊNCIA 231CV - PBT = 22000KG - DIST. ENTRE EIXOS 5170 MM - INCLUI CARROCERIA FIXA ABERTA DE MADEIRA - CHP DIURNO. AF_06/2015","CHP",6]
["S",2,"S",0,1,6,0,0,0,0,0,"","Serviço","Serviço","1.6.0.8.","COMPOSIÇÃO","COMP 212_SEE","NIPLE DE REDUÇÃO 1/2\" X 1/4\" BSP","UN ",4]
["S",2,"S",0,1,6,0,0,0,0,0,"","Serviço","Serviço","1.6.0.9.","COMPOSIÇÃO","COMP 213_SEE","NIPLE DE REDUÇÃO 3/4\" X 1/2\" BSP","UN ",4]
["S",2,"S",0,1,6,0,0,0,0,0,"","Serviço","Serviço","1.6.0.10.","SINAPI",92688,"TUBO DE AÇO GALVANIZADO COM COSTURA, CLASSE MÉDIA, CONEXÃO ROSQUEADA, DN 20 (3/4\"), INSTALADO EM RAMAIS E SUB-RAMAIS DE GÁS - FORNECIMENTO E INSTALAÇÃO. AF_12/2015","M",32]
["S",2,"S",0,1,6,0,0,0,0,0,"","Serviço","Serviço","1.6.0.11.","SINAPI",92701,"JOELHO 90 GRAUS, EM FERRO GALVANIZADO, CONEXÃO ROSQUEADA, DN 20 (3/4\"), INSTALADO EM RAMAIS E SUB-RAMAIS DE GÁS - FORNECIMENTO E INSTALAÇÃO. AF_12/2015","UN",8]
["S",2,"S",0,1,6,0,0,0,0,0,"","Serviço","Serviço","1.6.0.12.","COMPOSIÇÃO","COMP 237_SEE","FITA ANTICORROSIVA","M",15]
["S",2,"S",0,1,6,0,0,0,0,0,"","Serviço","Serviço","1.6.0.13.","AGETOP",91025,"VÁLVULA ESFERICA LATÃO 3/4\"","Un    ",3]
["S",2,"S",0,1,6,0,0,0,0,0,"","Serviço","Serviço","1.6.0.14.","AGETOP",91019,"TE PRETO 90º 3/4\" NPT 300 LBS","Un    ",5]
["S",2,"S",0,1,6,0,0,0,0,0,"","Serviço","Serviço","1.6.0.15.","COMPOSIÇÃO","COMP 542_SEE","VÁLVULA UGV 3/4\" (S) LATÃO","UN ",6]
["S",2,"S",0,1,6,0,0,0,0,0,"","Serviço","Serviço","1.6.0.16.","COMPOSIÇÃO","COMP 543_SEE","VÁLVULA UGV 1/2\" (S) LATÃO","UN ",6]
["S",2,"S",0,1,6,0,0,0,0,0,"","Serviço","Serviço","1.6.0.17.","SINAPI",91029,"CAMINHÃO TRUCADO (C/ TERCEIRO EIXO) ELETRÔNICO - POTÊNCIA 231CV - PBT = 22000KG - DIST. ENTRE EIXOS 5170 MM - INCLUI CARROCERIA FIXA ABERTA DE MADEIRA - MANUTENÇÃO. AF_06/2015","H",6]
["S",2,"S",0,1,6,0,0,0,0,0,"","Serviço","Serviço","1.6.0.18.","COMPOSIÇÃO","COMP 211_SEE","REGULADOR DE 2º ESTÁGIO 5KG/H","UN ",6]
["S",2,"S",0,1,6,0,0,0,0,0,"","Serviço","Serviço","1.6.0.19.","COMPOSIÇÃO","COMP 210_SEE","REGULADOR DE 1º ESTÁGIO 60KG/H MODELO AP-40  COM MANÔMETRO","UN ",1]
["S",2,"S",0,1,6,0,0,0,0,0,"","Serviço","Serviço","1.6.0.20.","AGETOP",85003,"EXTINTOR PO QUIMICO SECO (6 KG) - CAPACIDADE EXTINTORA 20 BC","Un    ",1]
["S",2,"S",0,1,6,0,0,0,0,0,"","Serviço","Serviço","1.6.0.21.","COMPOSIÇÃO","COMP 235_SEE","PLACA DE SINALIZAÇÃO EM PVC COD 01 - (300X300) PROIBIDO FUMAR","UN ",2]
["S",2,"S",0,1,6,0,0,0,0,0,"","Serviço","Serviço","1.6.0.22.","COMPOSIÇÃO","COMP 236_SEE","PLACA DE SINALIZAÇÃO EM PVC COD 06 - (300X300) PERIGO INFLAMÁVEL","UN ",2]
["S",2,"S",0,1,6,0,0,0,0,0,"","Serviço","Serviço","1.6.0.23.","AGETOP",91043,"BRAÇADEIRA METALICA TIPO \"D\" DIAM. 3/4\"","Un    ",8]
["S",2,"S",0,1,6,0,0,0,0,0,"","Serviço","Serviço","1.6.0.24.","AGETOP",71863,"PARAFUSO P/BUCHA S-10","Un    ",16]
["S",2,"S",0,1,6,0,0,0,0,0,"","Serviço","Serviço","1.6.0.25.","AGETOP",70393,"BUCHA DE NYLON S-10","Un    ",16]
["S",2,"S",0,1,6,0,0,0,0,0,"","Serviço","Serviço","1.6.0.26.","AGETOP",91045,"SUPORTE PARA COLETOR","Un    ",2]
[2,2,2,3,1,7,0,0,0,40,3,"","Nível 2","Nível 2","1.7.","SINAPI",null,"ALVENARIAS E DIVISÓRIAS","-"]
["S",2,"S",0,1,7,0,0,0,0,0,"","Serviço","Serviço","1.7.0.1.","SINAPI",87520,"ALVENARIA DE VEDAÇÃO DE BLOCOS CERÂMICOS FURADOS NA HORIZONTAL DE 9X19X19CM (ESPESSURA 9CM) DE PAREDES COM ÁREA LÍQUIDA MAIOR OU IGUAL A 6M² COM VÃOS E ARGAMASSA DE ASSENTAMENTO COM PREPARO MANUAL. AF_06/2014","M2",1.62]
["S",2,"S",0,1,7,0,0,0,{"$f":"IF(OR($C147=\"S\",$C147=0),0,MATCH(0,OFFSET($D147,1,$C147,ROW($C$585)-ROW($C147)),0))","v":0},{"$f":"IF(OR($C147=\"S\",$C147=0),0,MATCH(OFFSET($D147,0,$C147)+1,OFFSET($D147,1,$C147,ROW($C$585)-ROW($C147)),0))","v":0},"","Serviço","Serviço","1.7.0.2.","COMPOSIÇÃO","COMP 415_SEE","PEITORIL EM GRANITO CINZA, LARGURA VARIÁVEL E PINGADEIRA","M2",0.6]
[2,2,2,3,1,8,0,0,0,37,3,"","Nível 2","Nível 2","1.8.","SINAPI",null,"COBERTURAS","-"]
[3,3,3,2,1,8,1,0,0,2,12,"","Nível 3","Nível 3","1.8.1.","SINAPI",null,"COBERTURA COM TELHA DE FIBROCIMENTO","-"]
["S",3,"S",0,1,8,1,0,0,0,0,"","Serviço","Serviço","1.8.1.1.","SINAPI",94210,"TELHAMENTO COM TELHA ONDULADA DE FIBROCIMENTO E = 6 MM, COM RECOBRIMENTO LATERAL DE 1 1/4 DE ONDA PARA TELHADO COM INCLINAÇÃO MÁXIMA DE 10°, COM ATÉ 2 ÁGUAS, INCLUSO IÇAMENTO. AF_06/2016","M2",157.68]
[2,2,2,4,1,9,0,0,0,34,4,"","Nível 2","Nível 2","1.9.","SINAPI",null,"ESQUADRIAS METÁLICAS","-"]
["S",2,"S",0,1,9,0,0,0,0,0,"","Serviço","Serviço","1.9.0.1.","COMPOSIÇÃO","COMP 084_SEE","GUARDA-CORPO COM CORRIMÃO - SEDUC","M",3.9]
["S",2,"S",0,1,9,0,0,0,0,0,"","Serviço","Serviço","1.9.0.2.","COMPOSIÇÃO","COMP 085_SEE","GUARDA-CORPO - SEDUC","M",17.100000000000001]
["S",2,"S",0,1,9,0,0,0,0,0,"","Serviço","Serviço","1.9.0.3.","AGETOP",180303,"PORTA DE ENROLAR C/FERRAGENS","m2    ",1.56]
[2,2,2,3,1,10,0,0,0,30,3,"","Nível 2","Nível 2","1.10.","SINAPI",null,"REVESTIMENTO DE PAREDE","-"]
["S",2,"S",0,1,10,0,0,0,0,0,"","Serviço","Serviço","1.10.0.1.","SINAPI",87904,"CHAPISCO APLICADO EM ALVENARIA (COM PRESENÇA DE VÃOS) E ESTRUTURAS DE CONCRETO DE FACHADA, COM COLHER DE PEDREIRO.  ARGAMASSA TRAÇO 1:3 COM PREPARO MANUAL. AF_06/2014","M2",1.62]
["S",2,"S",0,1,10,0,0,0,0,0,"","Serviço","Serviço","1.10.0.2.","SINAPI",87547,"MASSA ÚNICA, PARA RECEBIMENTO DE PINTURA, EM ARGAMASSA TRAÇO 1:2:8, PREPARO MECÂNICO COM BETONEIRA 400L, APLICADA MANUALMENTE EM FACES INTERNAS DE PAREDES, ESPESSURA DE 10MM, COM EXECUÇÃO DE TALISCAS. AF_06/2014","M2",1.62]
[2,2,2,10,1,11,0,0,0,27,10,"","Nível 2","Nível 2","1.11.","SINAPI",null,"REVESTIMENTO DE PISO","-"]
[3,3,3,2,1,11,1,0,0,9,2,"","Nível 3","Nível 3","1.11.1.","SINAPI",null,"LASTRO","-"]
["S",3,"S",0,1,11,1,0,0,0,0,"","Serviço","Serviço","1.11.1.1.","AGETOP",220101,"LASTRO DE CONCRETO REGULARIZADO IMPERMEABILIZADO 1:3:6 ESP=5CM (BASE)","m2    ",386.4]
[3,3,3,3,1,11,2,0,0,7,3,"","Nível 3","Nível 3","1.11.2.","SINAPI",null,"GRANITINA","-"]
["S",3,"S",0,1,11,2,0,0,0,0,"","Serviço","Serviço","1.11.2.1.","SINAPI",84191,"PISO EM GRANILITE, MARMORITE OU GRANITINA ESPESSURA 8 MM, INCLUSO JUNTAS DE DILATACAO PLASTICAS","M2",402.13599999999997]
["S",3,"S",0,1,11,2,0,0,0,0,"","Serviço","Serviço","1.11.2.2.","AGETOP",221104,"RASPAGEM E APLICAÇÃO RESINA ACRÍLICA DUAS DEMÃOS","m2    ",402.13599999999997]
[3,3,3,2,1,11,3,0,0,4,2,"","Nível 3","Nível 3","1.11.3.","SINAPI",null,"CONCRETO","-"]
["S",3,"S",0,1,11,3,0,0,0,0,"","Serviço","Serviço","1.11.3.1.","AGETOP",220102,"PISO CONCRETO DESEMPENADO ESPESSURA = 5 CM  1:2,5:3,5","m2    ",658.83]
[3,3,3,2,1,11,4,0,0,2,14,"","Nível 3","Nível 3","1.11.4.","SINAPI",null,"PODOTÁTIL","-"]
["S",3,"S",0,1,11,4,0,0,0,0,"","Serviço","Serviço","1.11.4.1.","AGETOP",221126,"PISO DE LADRILHO HIDRÁULICO COLORIDO MODELO TÁTIL ( ALERTA OU DIRECIONAL) SEM LASTRO","m2    ",132.5]
[2,2,2,17,1,12,0,0,0,17,198,"","Nível 2","Nível 2","1.12.","SINAPI",null,"PINTURA","-"]
[3,3,3,2,1,12,1,0,0,16,2,"","Nível 3","Nível 3","1.12.1.","SINAPI",null,"REMOÇÃO DE PINTURA","-"]
["S",3,"S",0,1,12,1,0,0,0,0,"","Serviço","Serviço","1.12.1.1.","AGETOP",260104,"REMOCAO DE PINTURA ANTIGA A LATEX","m2    ",1181.47]
[3,3,3,3,1,12,2,0,0,14,3,"","Nível 3","Nível 3","1.12.2.","SINAPI",null,"ESMALTE SINTÉTICO","-"]
["S",3,"S",0,1,12,2,0,0,0,0,"","Serviço","Serviço","1.12.2.1.","SINAPI",88497,"APLICAÇÃO E LIXAMENTO DE MASSA LÁTEX EM PAREDES, DUAS DEMÃOS. AF_06/2014","M2",393.82333333333332]
["S",3,"S",0,1,12,2,0,0,0,0,"","Serviço","Serviço","1.12.2.2.","AGETOP",261550,"PINT.ESMALTE SINT.PAREDES - 2 DEM.C/SELADOR","m2    ",1181.47]
[3,3,3,3,1,12,3,0,0,11,3,"","Nível 3","Nível 3","1.12.3.","SINAPI",null,"LÁTEX ACRÍLICA","-"]
["S",3,"S",0,1,12,3,0,0,0,0,"","Serviço","Serviço","1.12.3.1.","SINAPI",88497,"APLICAÇÃO E LIXAMENTO DE MASSA LÁTEX EM PAREDES, DUAS DEMÃOS. AF_06/2014","M2",393.82333333333332]
["S",3,"S",0,1,12,3,0,0,0,0,"","Serviço","Serviço","1.12.3.2.","SINAPI",88489,"APLICAÇÃO MANUAL DE PINTURA COM TINTA LÁTEX ACRÍLICA EM PAREDES, DUAS DEMÃOS. AF_06/2014","M2",1181.47]
[3,3,3,3,1,12,4,0,0,8,3,"","Nível 3","Nível 3","1.12.4.","SINAPI",null,"TETO","-"]
["S",3,"S",0,1,12,4,0,0,0,0,"","Serviço","Serviço","1.12.4.1.","SINAPI",88496,"APLICAÇÃO E LIXAMENTO DE MASSA LÁTEX EM TETO, DUAS DEMÃOS. AF_06/2014","M2",393.82333333333332]
["S",3,"S",0,1,12,4,0,0,0,0,"","Serviço","Serviço","1.12.4.2.","SINAPI",88486,"APLICAÇÃO MANUAL DE PINTURA COM TINTA LÁTEX PVA EM TETO, DUAS DEMÃOS. AF_06/2014","M2",751.97]
[3,3,3,2,1,12,5,0,0,5,2,"","Nível 3","Nível 3","1.12.5.","SINAPI",null,"EXTERNA","-"]
["S",3,"S",0,1,12,5,0,0,0,0,"","Serviço","Serviço","1.12.5.1.","SINAPI",88489,"APLICAÇÃO MANUAL DE PINTURA COM TINTA LÁTEX ACRÍLICA EM PAREDES, DUAS DEMÃOS. AF_06/2014","M2",1413.14]
[3,3,3,3,1,12,6,0,0,3,{"$error":"#N/A"},"","Nível 3","Nível 3","1.12.6.","SINAPI",null,"ESQUADRIAS EXISTENTES","-"]
["S",3,"S",0,1,12,6,0,0,0,0,"","Serviço","Serviço","1.12.6.1.","AGETOP",260105,"REMOCAO DE PINTURA ANTIGA A OLEO OU ESMALTE","m2    ",493.14]
["S",3,"S",0,1,12,6,0,0,0,0,"","Serviço","Serviço","1.12.6.2.","SINAPI","73924/3","PINTURA ESMALTE FOSCO, DUAS DEMAOS, SOBRE SUPERFICIE METALICA","M2",493.14]
[1,1,1,80,2,0,0,0,0,400,80,"F","Nível 1","Nível 1","2.","AGETOP",null,"IMPLANTAÇÃO","-"]
[2,2,2,9,2,1,0,0,0,79,9,"","Nível 2","Nível 2","2.1.",null,null,"SERVIÇO EM TERRA","-"]
[3,3,3,6,2,1,1,0,0,8,6,"","Nível 3","Nível 3","2.1.1.","SINAPI",null,"AQUISIÇÃO DE TERRA (SOMENTE ATERRO)","-"]
["S",3,"S",0,2,1,1,0,0,0,0,"","Serviço","Serviço","2.1.1.1.","SINAPI",79480,"ESCAVACAO MECANICA CAMPO ABERTO EM SOLO EXCETO ROCHA ATE 2,00M PROFUNDIDADE","M3",87.54]
["S",3,"S",0,2,1,1,0,0,0,0,"","Serviço","Serviço","2.1.1.2.","SINAPI",72898,"CARGA E DESCARGA MECANIZADAS DE ENTULHO EM CAMINHAO BASCULANTE 6 M3","M3",87.54]
["S",3,"S",0,2,1,1,0,0,0,0,"","Serviço","Serviço","2.1.1.3.","AGETOP",41012,"INDENIZAÇÃO DE JAZIDA","m3    ",87.54]
["S",3,"S",0,2,1,1,0,0,0,0,"","Serviço","Serviço","2.1.1.4.","AGETOP",41006,"TRANSPORTE DE MATERIAL ESCAVADO M3.KM","m3km  ",875.40000000000009]
["S",3,"S",0,2,1,1,0,0,0,0,"","Serviço","Serviço","2.1.1.5.","SINAPI","74005/2","COMPACTACAO MECANICA C/ CONTROLE DO GC>=95% DO PN (AREAS) (C/MONIVELADORA 140 HP E ROLO COMPRESSOR VIBRATORIO 80 HP)","M3",33.950000000000003]
[3,3,3,2,2,1,2,0,0,2,123,"","Nível 3","Nível 3","2.1.2.",null,null,"OUTROS SERVIÇOS","-"]
[{"$f":"CHOOSE(1+LOG(1+2*(ORÇAMENTO.Nivel=\"Nível 1\")+4*(ORÇAMENTO.Nivel=\"Nível 2\")+8*(ORÇAMENTO.Nivel=\"Nível 3\")+16*(ORÇAMENTO.Nivel=\"Nível 4\")+32*(ORÇAMENTO.Nivel=\"Serviço\"),2),0,1,2,3,4,\"S\")","v":"S"},3,"S",0,{"$f":"IF($C194=1,OFFSET(E194,-1,0)+1,OFFSET(E194,-1,0))","v":2},{"$f":"IF($C194=1,0,IF($C194=2,OFFSET(F194,-1,0)+1,OFFSET(F194,-1,0)))","v":1},{"$f":"IF(AND($C194<=2,$C194<>0),0,IF($C194=3,OFFSET(G194,-1,0)+1,OFFSET(G194,-1,0)))","v":2},{"$f":"IF(AND($C194<=3,$C194<>0),0,IF($C194=4,OFFSET(H194,-1,0)+1,OFFSET(H194,-1,0)))","v":0},{"$f":"IF(AND($C194<=4,$C194<>0),0,IF(AND($C194=\"S\",$W194>0),OFFSET(I194,-1,0)+1,OFFSET(I194,-1,0)))","v":0},0,0,{"$f":"IF(OR(W194>0,$C194=1),\"F\",\"\")","v":""},"Serviço",{"$f":"CHOOSE(1+LOG(1+2*(C194=1)+4*(C194=2)+8*(C194=3)+16*(C194=4)+32*(C194=\"S\"),2),\"\",\"Nível 1\",\"Nível 2\",\"Nível 3\",\"Nível 4\",\"Serviço\")","v":"Serviço"},"2.1.2.1.","AGETOP",41140,"REGULARIZAÇÃO DO TERRENO SEM APILOAMENTO COM TRANSPORTE MANUAL DA TERRA ESCAVADA ","m2    ",247.45000000000002]
[{"$f":"CHOOSE(1+LOG(1+2*(ORÇAMENTO.Nivel=\"Nível 1\")+4*(ORÇAMENTO.Nivel=\"Nível 2\")+8*(ORÇAMENTO.Nivel=\"Nível 3\")+16*(ORÇAMENTO.Nivel=\"Nível 4\")+32*(ORÇAMENTO.Nivel=\"Serviço\"),2),0,1,2,3,4,\"S\")","v":2},{"$f":"IF(OR(C195=\"s\",C195=0),OFFSET(B195,-1,0),C195)","v":2},{"$f":"IF(OFFSET(C195,-1,0)=\"L\",1,IF(OFFSET(C195,-1,0)=1,2,IF(OR(A195=\"s\",A195=0),\"S\",IF(AND(OFFSET(C195,-1,0)=2,A195=4),3,IF(AND(OR(OFFSET(C195,-1,0)=\"s\",OFFSET(C195,-1,0)=0),A195<>\"s\",A195>OFFSET(B195,-1,0)),OFFSET(B195,-1,0),A195)))))","v":2},{"$f":"IF(OR(C195=\"S\",C195=0),0,IF(ISERROR(K195),J195,SMALL(J195:K195,1)))","v":53},{"$f":"IF($C195=1,OFFSET(E195,-1,0)+1,OFFSET(E195,-1,0))","v":2},{"$f":"IF($C195=1,0,IF($C195=2,OFFSET(F195,-1,0)+1,OFFSET(F195,-1,0)))","v":2},{"$f":"IF(AND($C195<=2,$C195<>0),0,IF($C195=3,OFFSET(G195,-1,0)+1,OFFSET(G195,-1,0)))","v":0},{"$f":"IF(AND($C195<=3,$C195<>0),0,IF($C195=4,OFFSET(H195,-1,0)+1,OFFSET(H195,-1,0)))","v":0},{"$f":"IF(AND($C195<=4,$C195<>0),0,IF(AND($C195=\"S\",$W195>0),OFFSET(I195,-1,0)+1,OFFSET(I195,-1,0)))","v":0},70,53,{"$f":"IF(OR(W195>0,$C195=1),\"F\",\"\")","v":""},"Nível 2",{"$f":"CHOOSE(1+LOG(1+2*(C195=1)+4*(C195=2)+8*(C195=3)+16*(C195=4)+32*(C195=\"S\"),2),\"\",\"Nível 1\",\"Nível 2\",\"Nível 3\",\"Nível 4\",\"Serviço\")","v":"Nível 2"},"2.2.",null,null,"INSTALAÇÕES ELÉTRICAS","-"]
[3,3,3,12,2,2,1,0,0,52,12,"","Nível 3","Nível 3","2.2.1.","SINAPI",null,"IMPLANTAÇÃO ","-"]
["S",3,"S",0,2,2,1,0,0,0,0,"","Serviço","Serviço","2.2.1.1.","SINAPI",93671,"DISJUNTOR TRIPOLAR TIPO DIN, CORRENTE NOMINAL DE 32A - FORNECIMENTO E INSTALAÇÃO. AF_04/2016","UN",2]
["S",3,"S",0,2,2,1,0,0,0,0,"","Serviço","Serviço","2.2.1.2.","SINAPI",91930,"CABO DE COBRE FLEXÍVEL ISOLADO, 6 MM², ANTI-CHAMA 450/750 V, PARA CIRCUITOS TERMINAIS - FORNECIMENTO E INSTALAÇÃO. AF_12/2015","M",997.56]
["S",3,"S",0,2,2,1,0,0,0,0,"","Serviço","Serviço","2.2.1.3.","SINAPI",91872,"ELETRODUTO RÍGIDO ROSCÁVEL, PVC, DN 32 MM (1\"), PARA CIRCUITOS TERMINAIS, INSTALADO EM PAREDE - FORNECIMENTO E INSTALAÇÃO. AF_12/2015","M",199.52]
["S",3,"S",0,2,2,1,0,0,0,0,"","Serviço","Serviço","2.2.1.4.","AGETOP",70352,"BRACADEIRA METALICA TIPO \"U\" DIAM. 1\"","Un    ",67]
["S",3,"S",0,2,2,1,0,0,0,0,"","Serviço","Serviço","2.2.1.5.","SINAPI",91880,"LUVA PARA ELETRODUTO, PVC, ROSCÁVEL, DN 32 MM (1\"), PARA CIRCUITOS TERMINAIS, INSTALADA EM LAJE - FORNECIMENTO E INSTALAÇÃO. AF_12/2015","UN",67]
["S",3,"S",0,2,2,1,0,0,0,0,"","Serviço","Serviço","2.2.1.6.","AGETOP",70647,"CAIXA DE PASSAGEM METÁLICA DE EMBUTIR 30X30X12 CM","Un    ",10]
["S",3,"S",0,2,2,1,0,0,0,0,"","Serviço","Serviço","2.2.1.7.","SINAPI",97889,"CAIXA ENTERRADA ELÉTRICA RETANGULAR, EM ALVENARIA COM TIJOLOS CERÂMICOS MACIÇOS, FUNDO COM BRITA, DIMENSÕES INTERNAS: 0,8X0,8X0,6 M. AF_05/2018","UN",5]
["S",3,"S",0,2,2,1,0,0,0,0,"","Serviço","Serviço","2.2.1.8.","SINAPI",6171,"TAMPA DE CONCRETO ARMADO 60X60X5CM PARA CAIXA","UN",5]
["S",3,"S",0,2,2,1,0,0,0,0,"","Serviço","Serviço","2.2.1.9.","SINAPI",92870,"CAIXA RETANGULAR 4\" X 4\" ALTA (2,00 M DO PISO), METÁLICA, INSTALADA EM PAREDE - FORNECIMENTO E INSTALAÇÃO. AF_12/2015","UN",3]
["S",3,"S",0,2,2,1,0,0,0,0,"","Serviço","Serviço","2.2.1.10.","AGETOP",71861,"PARAFUSO P/BUCHA S-6","Un    ",100]
["S",3,"S",0,2,2,1,0,0,0,0,"","Serviço","Serviço","2.2.1.11.","AGETOP",70391,"BUCHA DE NYLON S-6","Un    ",100]
[3,3,3,40,2,2,2,0,0,40,108,"","Nível 3","Nível 3","2.2.2.","AGETOP",null,"SUBESTAÇÃO","-"]
["S",3,"S",0,2,2,2,0,0,0,0,"","Serviço","Serviço","2.2.2.1.","AGETOP",70386,"BRAÇO C AÇO GALVANIZADO , CONFORME NTD-17","un    ",1]
["S",3,"S",0,2,2,2,0,0,0,0,"","Serviço","Serviço","2.2.2.2.","SINAPI","73767/2","ALCA PRE-FORMADA DISTRIBUIÇÃO EM  ACO RECOBERTO COM ALUMINIO PARA CABO 25MM2, ENCAPADO. FORNECIMENTO E INSTALAÇÃO.","UN",1]
["S",3,"S",0,2,2,2,0,0,{"$f":"IF(OR($C211=\"S\",$C211=0),0,MATCH(0,OFFSET($D211,1,$C211,ROW($C$585)-ROW($C211)),0))","v":0},{"$f":"IF(OR($C211=\"S\",$C211=0),0,MATCH(OFFSET($D211,0,$C211)+1,OFFSET($D211,1,$C211,ROW($C$585)-ROW($C211)),0))","v":0},"","Serviço","Serviço","2.2.2.3.","SINAPI","73767/1","GRAMPO PARALELO EM ALUMINIO FUNDIDO OU ESTRUDADO DE 2 PARAFUSOS, PARA CABO DE 6 A 50 MM2, PASTA ANTIOXIDANTE. FORNEC E INSTALAÇÃO.","UN",3]
["S",3,"S",0,2,2,2,0,0,0,0,"","Serviço","Serviço","2.2.2.4.","SINAPI",83377,"CONECTOR DE PARAFUSO FENDIDO EM LIGA DE COBRE COM SEPARADOR DE CABOS PARA CABO 50 MM2 - FORNECIMENTO E INSTALACAO","UN",6]
["S",3,"S",0,2,2,2,0,0,0,0,"","Serviço","Serviço","2.2.2.5.","SINAPI",72263,"TERMINAL OU CONECTOR DE PRESSAO - PARA CABO 50MM2 - FORNECIMENTO E INSTALACAO","UN",1]
["S",3,"S",0,2,2,2,0,0,0,0,"","Serviço","Serviço","2.2.2.6.","AGETOP",71833,"PARA RAIOS DISTRIBUIDOR POLIMÉRICO ÓXIDO DE ZINCO S/CENTELHADOR C/ DESLIGAMENTO AUTOMÁTICO 15KV,10KA","Un    ",3]
["S",3,"S",0,2,2,2,0,0,0,0,"","Serviço","Serviço","2.2.2.7.","SINAPI",88544,"ARMACAO SECUNDARIA OU REX COMPLETA PARA DUAS LINHAS-FORNECIMENTO E INSTALACAO.","UN",1]
["S",3,"S",0,2,2,2,0,0,0,0,"","Serviço","Serviço","2.2.2.8.","COMPOSIÇÃO","COMP 046_SEE","CAPUZ PARA PROTEÇÃO DOS PARA RAIOS","UN ",3]
["S",3,"S",0,2,2,2,0,0,0,0,"","Serviço","Serviço","2.2.2.9.","COMPOSIÇÃO","COMP 047_SEE","CAPUZ DE PROTEÇÃO PARA BUCHA DE TRANSFORMADOR","UN ",3]
["S",3,"S",0,2,2,2,0,0,0,0,"","Serviço","Serviço","2.2.2.10.","COMPOSIÇÃO","COMP 048_SEE","HASTE ROSQUEADA \"TIRANTE\" 3/8\"","M",0.5]
["S",3,"S",0,2,2,2,0,0,0,0,"","Serviço","Serviço","2.2.2.11.","COMPOSIÇÃO","COMP 049_SEE","PORCA SEXTAVADA 3/8\"","UN ",8]
["S",3,"S",0,2,2,2,0,0,0,0,"","Serviço","Serviço","2.2.2.12.","SINAPI","73781/2","ISOLADOR DE PINO TP HI-POT CILINDRICO CLASSE 15KV. FORNECIMENTO E INSTALACAO.","UN",3]
["S",3,"S",0,2,2,2,0,0,0,0,"","Serviço","Serviço","2.2.2.13.","SINAPI","73781/3","ISOLADOR DE SUSPENSAO (DISCO) TP CAVILHA CLASSE 15KV - 6''. FORNECIMENTO E INSTALACAO.","UN",1]
["S",3,"S",0,2,2,2,0,0,0,0,"","Serviço","Serviço","2.2.2.14.","AGETOP",70252,"ARRUELA LISA D=5/16\"","Un    ",8]
["S",3,"S",0,2,2,2,0,0,0,0,"","Serviço","Serviço","2.2.2.15.","AGETOP",70695,"CAIXA METÁLICA PARA PROTEÇÃO GERAL 580X500X216MM ATÉ 175A","Un    ",1]
["S",3,"S",0,2,2,2,0,0,0,0,"","Serviço","Serviço","2.2.2.16.","AGETOP",70695,"CAIXA METÁLICA PARA PROTEÇÃO GERAL 580X500X216MM ATÉ 175A","Un    ",1]
["S",3,"S",0,2,2,2,0,0,0,0,"","Serviço","Serviço","2.2.2.17.","AGETOP",70725,"CAIXA METÁLICA PARA T.C. 580X500X216MM - ATÉ 175A","Un    ",1]
["S",3,"S",0,2,2,2,0,0,0,0,"","Serviço","Serviço","2.2.2.18.","SINAPI",93205,"CINTA DE AMARRAÇÃO DE ALVENARIA MOLDADA IN LOCO COM UTILIZAÇÃO DE BLOCOS CANALETA. AF_03/2016","M",6]
["S",3,"S",0,2,2,2,0,0,0,0,"","Serviço","Serviço","2.2.2.19.","AGETOP",71268,"ELO FUSÍVEL 6 K","Un    ",3]
["S",3,"S",0,2,2,2,0,0,0,0,"","Serviço","Serviço","2.2.2.20.","AGETOP",71186,"DISPOSITIVO DE PROTEÇÃO CONTRA SURTOS (D.P.S.) 275V DE 90KA","Un    ",3]
["S",3,"S",0,2,2,2,0,0,0,0,"","Serviço","Serviço","2.2.2.21.","AGETOP",71320,"FITA DE AUTO FUSAO, ROLO DE 2,00 M","Un    ",5]
["S",3,"S",0,2,2,2,0,0,0,0,"","Serviço","Serviço","2.2.2.22.","AGETOP",70771,"CANTONEIRA AUXILIAR PARA BRAÇO TIPO C","un    ",3]
["S",3,"S",0,2,2,2,0,0,0,0,"","Serviço","Serviço","2.2.2.23.","SINAPI",93022,"CURVA 90 GRAUS PARA ELETRODUTO, PVC, ROSCÁVEL, DN 75 MM (2 1/2\") - FORNECIMENTO E INSTALAÇÃO. AF_12/2015","UN",2]
["S",3,"S",0,2,2,2,0,0,0,0,"","Serviço","Serviço","2.2.2.24.","AGETOP",72329,"SAPATILHA DE AÇO GALVANIZADO PARA POSTE COM TRANSFORMADOR","un    ",3]
["S",3,"S",0,2,2,2,0,0,0,0,"","Serviço","Serviço","2.2.2.25.","AGETOP",71795,"OLHAL PARA PARAFUSO","un    ",3]
["S",3,"S",0,2,2,2,0,0,0,0,"","Serviço","Serviço","2.2.2.26.","AGETOP",71761,"MURETA MEDIÇÃO ALVEN. 1 1/2 V.(35CM) REBOC.C/PINTURA ACRÍL. E LAJE CONC. 20MPA MALHA 8.0MM CADA 10CM REVEST.C/ARGAMASSA 1:3 C/ IMPERMEABILIZANTE","m2    ",1]
["S",3,"S",0,2,2,2,0,0,0,0,"","Serviço","Serviço","2.2.2.27.","AGETOP",71776,"NIPLE METALICO Fo.Zo. DIAMETRO 2.1/2\"","Un    ",2]
["S",3,"S",0,2,2,2,0,0,0,0,"","Serviço","Serviço","2.2.2.28.","AGETOP",71791,"NIPLE DUPLO FERRO GALVANIZADO 2\"","Un    ",1]
["S",3,"S",0,2,2,2,0,0,0,0,"","Serviço","Serviço","2.2.2.29.","SINAPI",73624,"SUPORTE PARA TRANSFORMADOR EM POSTE DE CONCRETO CIRCULAR","UN",2]
["S",3,"S",0,2,2,2,0,0,0,0,"","Serviço","Serviço","2.2.2.30.","AGETOP",72060,"POSTE DE CONCRETO SC 11/400 - SEM FUNDAÇÃO/CONCRETO","Un    ",1]
["S",3,"S",0,2,2,2,0,0,0,0,"","Serviço","Serviço","2.2.2.31.","AGETOP",72000,"POSTE - ENGASTAMENTO SIMPLES PARA POSTE DE CONCRETO SEÇÃO CIRCULAR","m3    ",0.2]
["S",3,"S",0,2,2,2,0,0,0,0,"","Serviço","Serviço","2.2.2.32.","SINAPI",72263,"TERMINAL OU CONECTOR DE PRESSAO - PARA CABO 50MM2 - FORNECIMENTO E INSTALACAO","UN",3]
["S",3,"S",0,2,2,2,0,0,0,0,"","Serviço","Serviço","2.2.2.33.","AGETOP",72535,"TERMINAL DE PRESSAO 70 MMM2","Un    ",2]
["S",3,"S",0,2,2,2,0,0,0,0,"","Serviço","Serviço","2.2.2.34.","AGETOP",72528,"TERMINAL DE PRESSAO 35 MM2","Un    ",5]
["S",3,"S",0,2,2,2,0,0,0,0,"","Serviço","Serviço","2.2.2.35.","AGETOP",72518,"TERMINAL DE PRESSAO 10 MM2","Un    ",1]
["S",3,"S",0,2,2,2,0,0,0,0,"","Serviço","Serviço","2.2.2.36.","AGETOP",72550,"TERMINAL DE PRESSAO 150 MM2","Un    ",10]
["S",3,"S",0,2,2,2,0,0,0,0,"","Serviço","Serviço","2.2.2.37.","SINAPI","73857/2","TRANSFORMADOR DISTRIBUICAO  112,5KVA TRIFASICO 60HZ CLASSE 15KV IMERSO EM ÓLEO MINERAL FORNECIMENTO E INSTALACAO","UN",1]
["S",3,"S",0,2,2,2,0,0,0,0,"","Serviço","Serviço","2.2.2.38.","AGETOP",72630,"TRILHO OU SUPORTE P/BORNE TERMINAL","M     ",0.2]
["S",3,"S",0,2,2,2,0,0,0,0,"","Serviço","Serviço","2.2.2.39.","AGETOP",72080,"POSTE/TRAFO - CAMINHÃO MUNCK 12 TON. (MÍNIMO 4H/DIA)","H     ",8]
[{"$f":"CHOOSE(1+LOG(1+2*(ORÇAMENTO.Nivel=\"Nível 1\")+4*(ORÇAMENTO.Nivel=\"Nível 2\")+8*(ORÇAMENTO.Nivel=\"Nível 3\")+16*(ORÇAMENTO.Nivel=\"Nível 4\")+32*(ORÇAMENTO.Nivel=\"Serviço\"),2),0,1,2,3,4,\"S\")","v":2},{"$f":"IF(OR(C248=\"s\",C248=0),OFFSET(B248,-1,0),C248)","v":2},{"$f":"IF(OFFSET(C248,-1,0)=\"L\",1,IF(OFFSET(C248,-1,0)=1,2,IF(OR(A248=\"s\",A248=0),\"S\",IF(AND(OFFSET(C248,-1,0)=2,A248=4),3,IF(AND(OR(OFFSET(C248,-1,0)=\"s\",OFFSET(C248,-1,0)=0),A248<>\"s\",A248>OFFSET(B248,-1,0)),OFFSET(B248,-1,0),A248)))))","v":2},{"$f":"IF(OR(C248=\"S\",C248=0),0,IF(ISERROR(K248),J248,SMALL(J248:K248,1)))","v":2},{"$f":"IF($C248=1,OFFSET(E248,-1,0)+1,OFFSET(E248,-1,0))","v":2},{"$f":"IF($C248=1,0,IF($C248=2,OFFSET(F248,-1,0)+1,OFFSET(F248,-1,0)))","v":3},{"$f":"IF(AND($C248<=2,$C248<>0),0,IF($C248=3,OFFSET(G248,-1,0)+1,OFFSET(G248,-1,0)))","v":0},{"$f":"IF(AND($C248<=3,$C248<>0),0,IF($C248=4,OFFSET(H248,-1,0)+1,OFFSET(H248,-1,0)))","v":0},{"$f":"IF(AND($C248<=4,$C248<>0),0,IF(AND($C248=\"S\",$W248>0),OFFSET(I248,-1,0)+1,OFFSET(I248,-1,0)))","v":0},17,2,{"$f":"IF(OR(W248>0,$C248=1),\"F\",\"\")","v":""},"Nível 2",{"$f":"CHOOSE(1+LOG(1+2*(C248=1)+4*(C248=2)+8*(C248=3)+16*(C248=4)+32*(C248=\"S\"),2),\"\",\"Nível 1\",\"Nível 2\",\"Nível 3\",\"Nível 4\",\"Serviço\")","v":"Nível 2"},"2.3.",null,null,"ESQUADRIAS METÁLICAS","-"]
["S",2,"S",0,2,3,0,0,0,0,0,"","Serviço","Serviço","2.3.0.1.","AGETOP",180304,"PORTAO DE ABRIR CHAPA 14  PT-4 C/FERRAGENS","m2    ",3.15]
[2,2,2,3,2,4,0,0,0,15,3,"","Nível 2","Nível 2","2.4.",null,null,"REVESTIMENTO DE PAREDE","-"]
[{"$f":"CHOOSE(1+LOG(1+2*(ORÇAMENTO.Nivel=\"Nível 1\")+4*(ORÇAMENTO.Nivel=\"Nível 2\")+8*(ORÇAMENTO.Nivel=\"Nível 3\")+16*(ORÇAMENTO.Nivel=\"Nível 4\")+32*(ORÇAMENTO.Nivel=\"Serviço\"),2),0,1,2,3,4,\"S\")","v":"S"},2,"S",0,2,4,0,0,{"$f":"IF(AND($C251<=4,$C251<>0),0,IF(AND($C251=\"S\",$W251>0),OFFSET(I251,-1,0)+1,OFFSET(I251,-1,0)))","v":0},0,0,{"$f":"IF(OR(W251>0,$C251=1),\"F\",\"\")","v":""},"Serviço","Serviço","2.4.0.1.","SINAPI",87904,"CHAPISCO APLICADO EM ALVENARIA (COM PRESENÇA DE VÃOS) E ESTRUTURAS DE CONCRETO DE FACHADA, COM COLHER DE PEDREIRO.  ARGAMASSA TRAÇO 1:3 COM PREPARO MANUAL. AF_06/2014","M2",49.2]
["S",2,"S",0,{"$f":"IF($C252=1,OFFSET(E252,-1,0)+1,OFFSET(E252,-1,0))","v":2},{"$f":"IF($C252=1,0,IF($C252=2,OFFSET(F252,-1,0)+1,OFFSET(F252,-1,0)))","v":4},{"$f":"IF(AND($C252<=2,$C252<>0),0,IF($C252=3,OFFSET(G252,-1,0)+1,OFFSET(G252,-1,0)))","v":0},{"$f":"IF(AND($C252<=3,$C252<>0),0,IF($C252=4,OFFSET(H252,-1,0)+1,OFFSET(H252,-1,0)))","v":0},0,0,0,"","Serviço","Serviço","2.4.0.2.","SINAPI",87547,"MASSA ÚNICA, PARA RECEBIMENTO DE PINTURA, EM ARGAMASSA TRAÇO 1:2:8, PREPARO MECÂNICO COM BETONEIRA 400L, APLICADA MANUALMENTE EM FACES INTERNAS DE PAREDES, ESPESSURA DE 10MM, COM EXECUÇÃO DE TALISCAS. AF_06/2014","M2",49.2]
[2,{"$f":"IF(OR(C253=\"s\",C253=0),OFFSET(B253,-1,0),C253)","v":2},{"$f":"IF(OFFSET(C253,-1,0)=\"L\",1,IF(OFFSET(C253,-1,0)=1,2,IF(OR(A253=\"s\",A253=0),\"S\",IF(AND(OFFSET(C253,-1,0)=2,A253=4),3,IF(AND(OR(OFFSET(C253,-1,0)=\"s\",OFFSET(C253,-1,0)=0),A253<>\"s\",A253>OFFSET(B253,-1,0)),OFFSET(B253,-1,0),A253)))))","v":2},{"$f":"IF(OR(C253=\"S\",C253=0),0,IF(ISERROR(K253),J253,SMALL(J253:K253,1)))","v":6},2,5,0,0,0,12,6,"","Nível 2",{"$f":"CHOOSE(1+LOG(1+2*(C253=1)+4*(C253=2)+8*(C253=3)+16*(C253=4)+32*(C253=\"S\"),2),\"\",\"Nível 1\",\"Nível 2\",\"Nível 3\",\"Nível 4\",\"Serviço\")","v":"Nível 2"},"2.5.",null,null,"ADMINISTRAÇÃO","-"]
[3,3,3,3,2,5,1,0,0,5,3,"","Nível 3","Nível 3","2.5.1.",null,null,"MENSALISTAS","-"]
["S",3,"S",0,2,5,1,0,0,0,0,"","Serviço","Serviço","2.5.1.1.","SINAPI",90778,"ENGENHEIRO CIVIL DE OBRA PLENO COM ENCARGOS COMPLEMENTARES","H",176]
["S",3,"S",0,2,5,1,0,0,0,0,"","Serviço","Serviço","2.5.1.2.","SINAPI",90776,"ENCARREGADO GERAL COM ENCARGOS COMPLEMENTARES","H",880]
[3,3,3,2,2,5,2,0,0,2,59,"","Nível 3","Nível 3","2.5.2.",null,null,"LAUDO DE ESTANQUEIDADE","-"]
["S",3,"S",0,2,5,2,0,0,0,0,"","Serviço","Serviço","2.5.2.1.","SINAPI",90778,"ENGENHEIRO CIVIL DE OBRA PLENO COM ENCARGOS COMPLEMENTARES","H",16]
[2,2,2,3,2,6,0,0,0,6,3,"","Nível 2","Nível 2","2.6.",null,null,"PINTURA","-"]
[{"$f":"CHOOSE(1+LOG(1+2*(ORÇAMENTO.Nivel=\"Nível 1\")+4*(ORÇAMENTO.Nivel=\"Nível 2\")+8*(ORÇAMENTO.Nivel=\"Nível 3\")+16*(ORÇAMENTO.Nivel=\"Nível 4\")+32*(ORÇAMENTO.Nivel=\"Serviço\"),2),0,1,2,3,4,\"S\")","v":3},{"$f":"IF(OR(C260=\"s\",C260=0),OFFSET(B260,-1,0),C260)","v":3},{"$f":"IF(OFFSET(C260,-1,0)=\"L\",1,IF(OFFSET(C260,-1,0)=1,2,IF(OR(A260=\"s\",A260=0),\"S\",IF(AND(OFFSET(C260,-1,0)=2,A260=4),3,IF(AND(OR(OFFSET(C260,-1,0)=\"s\",OFFSET(C260,-1,0)=0),A260<>\"s\",A260>OFFSET(B260,-1,0)),OFFSET(B260,-1,0),A260)))))","v":3},{"$f":"IF(OR(C260=\"S\",C260=0),0,IF(ISERROR(K260),J260,SMALL(J260:K260,1)))","v":2},{"$f":"IF($C260=1,OFFSET(E260,-1,0)+1,OFFSET(E260,-1,0))","v":2},{"$f":"IF($C260=1,0,IF($C260=2,OFFSET(F260,-1,0)+1,OFFSET(F260,-1,0)))","v":6},{"$f":"IF(AND($C260<=2,$C260<>0),0,IF($C260=3,OFFSET(G260,-1,0)+1,OFFSET(G260,-1,0)))","v":1},{"$f":"IF(AND($C260<=3,$C260<>0),0,IF($C260=4,OFFSET(H260,-1,0)+1,OFFSET(H260,-1,0)))","v":0},{"$f":"IF(AND($C260<=4,$C260<>0),0,IF(AND($C260=\"S\",$W260>0),OFFSET(I260,-1,0)+1,OFFSET(I260,-1,0)))","v":0},2,15,{"$f":"IF(OR(W260>0,$C260=1),\"F\",\"\")","v":""},"Nível 3",{"$f":"CHOOSE(1+LOG(1+2*(C260=1)+4*(C260=2)+8*(C260=3)+16*(C260=4)+32*(C260=\"S\"),2),\"\",\"Nível 1\",\"Nível 2\",\"Nível 3\",\"Nível 4\",\"Serviço\")","v":"Nível 3"},"2.6.1.","AGETOP",null,"ESQUADRIAS NOVAS","-"]
["S",3,"S",0,2,6,1,0,0,0,0,"","Serviço","Serviço","2.6.1.1.","SINAPI","74145/1","PINTURA ESMALTE FOSCO, DUAS DEMAOS, SOBRE SUPERFICIE METALICA, INCLUSO UMA DEMAO DE FUNDO ANTICORROSIVO. UTILIZACAO DE REVOLVER ( AR-COMPRIMIDO).","M2",6.3]
[2,2,2,3,2,7,0,0,0,3,90,"","Nível 2","Nível 2","2.7.",null,null,"DIVERSOS","-"]
["S",2,"S",0,2,7,0,0,0,0,0,"","Serviço","Serviço","2.7.0.1.","AGETOP",270310,"MURO DE ALVENARIA TIJOLO FURADO 1/2 VEZ ( H=2,00M) COM FUNDAÇÃO - SEM REVESTIMENTOS (PADRÃO AGETOP)","m2    ",24.6]
["S",2,"S",0,2,7,0,0,0,0,0,"","Serviço","Serviço","2.7.0.2.","AGETOP",270501,"LIMPEZA FINAL DE OBRA - (OBRAS CIVIS)","m2    ",947.79]
[1,1,1,126,3,0,0,0,0,320,126,"F","Nível 1","Nível 1","3.","SINAPI",null,"BLOCO 01 SALA PADRÃO SEDUC 2017 - LAJE","-"]
[2,2,2,2,3,1,0,0,0,125,2,"","Nível 2","Nível 2","3.1.","SINAPI",null,"SERVIÇOS PRELIMINARES","-"]
["S",2,"S",0,3,1,0,0,0,0,0,"","Serviço","Serviço","3.1.0.1.","AGETOP",20701,"LOCAÇÃO DA OBRA, EXECUÇÃO DE GABARITO SEM REAPROVEITAMENTO, INCLUSO PINTURA (FACE INTERNA DO RIPÃO 15CM) E PIQUETE COM TESTEMUNHA","m2    ",64.260000000000005]
[2,2,2,3,3,2,0,0,0,123,3,"","Nível 2","Nível 2","3.2.","SINAPI",null,"TRANSPORTES","-"]
["S",2,"S",0,3,2,0,0,0,0,0,"","Serviço","Serviço","3.2.0.1.","SINAPI",72897,"CARGA MANUAL DE ENTULHO EM CAMINHAO BASCULANTE 6 M3","M3",6]
["S",2,"S",0,3,2,0,0,0,0,0,"","Serviço","Serviço","3.2.0.2.","SINAPI",72900,"TRANSPORTE DE ENTULHO COM CAMINHAO BASCULANTE 6 M3, RODOVIA PAVIMENTADA, DMT 0,5 A 1,0 KM","M3",6]
[2,2,2,10,3,3,0,0,0,120,10,"","Nível 2","Nível 2","3.3.","SINAPI",null,"SERVIÇO EM TERRA","-"]
[3,3,3,3,3,3,1,0,0,9,3,"","Nível 3","Nível 3","3.3.1.","SINAPI",null,"ESCAVAÇÃO VIGA BALDRAME","-"]
["S",3,"S",0,3,3,1,0,0,0,0,"","Serviço","Serviço","3.3.1.1.","SINAPI",93358,"ESCAVAÇÃO MANUAL DE VALA COM PROFUNDIDADE MENOR OU IGUAL A 1,30 M. AF_03/2016","M3",3.12]
["S",3,"S",0,3,3,1,0,0,0,0,"","Serviço","Serviço","3.3.1.2.","SINAPI",96995,"REATERRO MANUAL APILOADO COM SOQUETE. AF_10/2017","M3",1.81]
[3,3,3,6,3,3,2,0,0,{"$f":"IF(OR($C275=\"S\",$C275=0),0,MATCH(0,OFFSET($D275,1,$C275,ROW($C$585)-ROW($C275)),0))","v":6},{"$f":"IF(OR($C275=\"S\",$C275=0),0,MATCH(OFFSET($D275,0,$C275)+1,OFFSET($D275,1,$C275,ROW($C$585)-ROW($C275)),0))","v":41},"","Nível 3","Nível 3","3.3.2.","SINAPI",null,"ATERRO INTERNO","-"]
["S",3,"S",0,3,3,2,0,0,0,0,"","Serviço","Serviço","3.3.2.1.","SINAPI",79480,"ESCAVACAO MECANICA CAMPO ABERTO EM SOLO EXCETO ROCHA ATE 2,00M PROFUNDIDADE","M3",12]
["S",3,"S",0,3,3,2,0,0,0,0,"","Serviço","Serviço","3.3.2.2.","SINAPI",72898,"CARGA E DESCARGA MECANIZADAS DE ENTULHO EM CAMINHAO BASCULANTE 6 M3","M3",12]
["S",3,"S",0,3,3,2,0,0,0,0,"","Serviço","Serviço","3.3.2.3.","AGETOP",41012,"INDENIZAÇÃO DE JAZIDA","m3    ",12]
["S",3,"S",0,3,3,2,0,0,0,0,"","Serviço","Serviço","3.3.2.4.","AGETOP",41006,"TRANSPORTE DE MATERIAL ESCAVADO M3.KM","m3km  ",120]
["S",3,"S",0,3,3,2,0,0,0,0,"","Serviço","Serviço","3.3.2.5.","SINAPI","74005/2","COMPACTACAO MECANICA C/ CONTROLE DO GC>=95% DO PN (AREAS) (C/MONIVELADORA 140 HP E ROLO COMPRESSOR VIBRATORIO 80 HP)","M3",9.6]
[2,2,2,20,3,4,0,0,0,110,20,"","Nível 2","Nível 2","3.4.","SINAPI",null,"FUNDAÇÕES E SONDAGENS","-"]
[3,3,3,10,3,4,1,0,0,19,10,"","Nível 3","Nível 3","3.4.1.","SINAPI",null,"ESTACAS E BLOCOS","-"]
["S",3,"S",0,3,4,1,0,0,0,0,"","Serviço","Serviço","3.4.1.1.","SINAPI",98230,"ESTACA BROCA DE CONCRETO, DIÂMETRO DE 30 CM, PROFUNDIDADE DE ATÉ 3 M, ESCAVAÇÃO MANUAL COM TRADO CONCHA, NÃO ARMADA. AF_03/2018","M",41.5]
["S",3,"S",0,3,4,1,0,0,0,0,"","Serviço","Serviço","3.4.1.2.","SINAPI",96522,"ESCAVAÇÃO MANUAL PARA BLOCO DE COROAMENTO OU SAPATA, SEM PREVISÃO DE FÔRMA. AF_06/2017","M3",3.12]
["S",3,"S",0,3,4,1,0,0,0,0,"","Serviço","Serviço","3.4.1.3.","SINAPI",96995,"REATERRO MANUAL APILOADO COM SOQUETE. AF_10/2017","M3",1.7549999999999999]
["S",3,"S",0,3,4,1,0,0,0,0,"","Serviço","Serviço","3.4.1.4.","SINAPI",94964,"CONCRETO FCK = 20MPA, TRAÇO 1:2,7:3 (CIMENTO/ AREIA MÉDIA/ BRITA 1)  - PREPARO MECÂNICO COM BETONEIRA 400 L. AF_07/2016","M3",1.3650000000000002]
[{"$f":"CHOOSE(1+LOG(1+2*(ORÇAMENTO.Nivel=\"Nível 1\")+4*(ORÇAMENTO.Nivel=\"Nível 2\")+8*(ORÇAMENTO.Nivel=\"Nível 3\")+16*(ORÇAMENTO.Nivel=\"Nível 4\")+32*(ORÇAMENTO.Nivel=\"Serviço\"),2),0,1,2,3,4,\"S\")","v":"S"},3,"S",0,3,4,1,0,{"$f":"IF(AND($C287<=4,$C287<>0),0,IF(AND($C287=\"S\",$W287>0),OFFSET(I287,-1,0)+1,OFFSET(I287,-1,0)))","v":0},0,0,"","Serviço","Serviço","3.4.1.5.","SINAPI","74157/4","LANCAMENTO/APLICACAO MANUAL DE CONCRETO EM FUNDACOES","M3",1.37]
["S",3,"S",0,3,4,1,0,0,0,0,"","Serviço","Serviço","3.4.1.6.","SINAPI",96544,"ARMAÇÃO DE BLOCO, VIGA BALDRAME OU SAPATA UTILIZANDO AÇO CA-50 DE 6,3 MM - MONTAGEM. AF_06/2017","KG",19.09090909090909]
["S",3,"S",0,3,4,1,0,0,0,0,{"$f":"IF(OR(W289>0,$C289=1),\"F\",\"\")","v":""},"Serviço","Serviço","3.4.1.7.","SINAPI",96545,"ARMAÇÃO DE BLOCO, VIGA BALDRAME OU SAPATA UTILIZANDO AÇO CA-50 DE 8 MM - MONTAGEM. AF_06/2017","KG",62.72727272727272]
["S",3,"S",0,{"$f":"IF($C290=1,OFFSET(E290,-1,0)+1,OFFSET(E290,-1,0))","v":3},{"$f":"IF($C290=1,0,IF($C290=2,OFFSET(F290,-1,0)+1,OFFSET(F290,-1,0)))","v":4},{"$f":"IF(AND($C290<=2,$C290<>0),0,IF($C290=3,OFFSET(G290,-1,0)+1,OFFSET(G290,-1,0)))","v":1},{"$f":"IF(AND($C290<=3,$C290<>0),0,IF($C290=4,OFFSET(H290,-1,0)+1,OFFSET(H290,-1,0)))","v":0},0,0,0,"","Serviço","Serviço","3.4.1.8.","SINAPI",96546,"ARMAÇÃO DE BLOCO, VIGA BALDRAME OU SAPATA UTILIZANDO AÇO CA-50 DE 10 MM - MONTAGEM. AF_06/2017","KG",11.818181818181817]
["S",3,"S",0,3,4,1,0,0,0,0,"","Serviço",{"$f":"CHOOSE(1+LOG(1+2*(C291=1)+4*(C291=2)+8*(C291=3)+16*(C291=4)+32*(C291=\"S\"),2),\"\",\"Nível 1\",\"Nível 2\",\"Nível 3\",\"Nível 4\",\"Serviço\")","v":"Serviço"},"3.4.1.9.","SINAPI",96543,"ARMAÇÃO DE BLOCO, VIGA BALDRAME E SAPATA UTILIZANDO AÇO CA-60 DE 5 MM - MONTAGEM. AF_06/2017","KG",16.363636363636363]
[3,3,3,9,3,4,2,0,0,9,24,"","Nível 3","Nível 3","3.4.2.","SINAPI",null,"VIGAS BALDRAMES","-"]
["S",3,"S",0,3,4,2,0,0,0,0,"","Serviço","Serviço","3.4.2.1.","SINAPI",96527,"ESCAVAÇÃO MANUAL DE VALA PARA VIGA BALDRAME, COM PREVISÃO DE FÔRMA. AF_06/2017","M3",3.9899999999999998]
["S",3,"S",0,3,4,2,0,0,0,0,"","Serviço","Serviço","3.4.2.2.","SINAPI",96995,"REATERRO MANUAL APILOADO COM SOQUETE. AF_10/2017","M3",2.25]
["S",3,"S",0,3,4,2,0,0,0,0,"","Serviço","Serviço","3.4.2.3.","AGETOP",60191,"FORMA DE TABUA CINTA BALDRAME U=8 VEZES","m2    ",30.65]
["S",{"$f":"IF(OR(C296=\"s\",C296=0),OFFSET(B296,-1,0),C296)","v":3},{"$f":"IF(OFFSET(C296,-1,0)=\"L\",1,IF(OFFSET(C296,-1,0)=1,2,IF(OR(A296=\"s\",A296=0),\"S\",IF(AND(OFFSET(C296,-1,0)=2,A296=4),3,IF(AND(OR(OFFSET(C296,-1,0)=\"s\",OFFSET(C296,-1,0)=0),A296<>\"s\",A296>OFFSET(B296,-1,0)),OFFSET(B296,-1,0),A296)))))","v":"S"},{"$f":"IF(OR(C296=\"S\",C296=0),0,IF(ISERROR(K296),J296,SMALL(J296:K296,1)))","v":0},3,4,2,0,0,0,0,"","Serviço","Serviço","3.4.2.4.","SINAPI",94964,"CONCRETO FCK = 20MPA, TRAÇO 1:2,7:3 (CIMENTO/ AREIA MÉDIA/ BRITA 1)  - PREPARO MECÂNICO COM BETONEIRA 400 L. AF_07/2016","M3",1.74]
["S",3,"S",0,3,4,2,0,0,0,0,"","Serviço","Serviço","3.4.2.5.","SINAPI","74157/4","LANCAMENTO/APLICACAO MANUAL DE CONCRETO EM FUNDACOES","M3",1.74]
["S",3,"S",0,3,4,2,0,0,0,0,"","Serviço","Serviço","3.4.2.6.","SINAPI",96545,"ARMAÇÃO DE BLOCO, VIGA BALDRAME OU SAPATA UTILIZANDO AÇO CA-50 DE 8 MM - MONTAGEM. AF_06/2017","KG",51.818181818181813]
["S",3,"S",0,3,4,2,0,0,0,0,"","Serviço","Serviço","3.4.2.7.","SINAPI",96546,"ARMAÇÃO DE BLOCO, VIGA BALDRAME OU SAPATA UTILIZANDO AÇO CA-50 DE 10 MM - MONTAGEM. AF_06/2017","KG",24.545454545454543]
["S",3,"S",0,3,4,2,0,0,0,0,"","Serviço","Serviço","3.4.2.8.","SINAPI",96543,"ARMAÇÃO DE BLOCO, VIGA BALDRAME E SAPATA UTILIZANDO AÇO CA-60 DE 5 MM - MONTAGEM. AF_06/2017","KG",40]
[2,2,2,19,3,5,0,0,0,90,19,"","Nível 2","Nível 2","3.5.","SINAPI",null,"ESTRUTURA","-"]
[3,3,3,6,3,5,1,0,0,18,6,"","Nível 3","Nível 3","3.5.1.","SINAPI",null,"PILARES","-"]
["S",3,"S",0,3,5,1,0,0,0,0,"","Serviço","Serviço","3.5.1.1.","SINAPI",92426,"MONTAGEM E DESMONTAGEM DE FÔRMA DE PILARES RETANGULARES E ESTRUTURAS SIMILARES COM ÁREA MÉDIA DAS SEÇÕES MENOR OU IGUAL A 0,25 M², PÉ-DIREITO SIMPLES, EM CHAPA DE MADEIRA COMPENSADA RESINADA, 8 UTILIZAÇÕES. AF_12/2015","M2",16.37]
["S",3,"S",0,3,5,1,0,0,0,0,"","Serviço","Serviço","3.5.1.2.","SINAPI",94964,"CONCRETO FCK = 20MPA, TRAÇO 1:2,7:3 (CIMENTO/ AREIA MÉDIA/ BRITA 1)  - PREPARO MECÂNICO COM BETONEIRA 400 L. AF_07/2016","M3",0.79]
["S",3,"S",0,3,5,1,0,0,0,0,"","Serviço","Serviço","3.5.1.3.","SINAPI",92873,"LANÇAMENTO COM USO DE BALDES, ADENSAMENTO E ACABAMENTO DE CONCRETO EM ESTRUTURAS. AF_12/2015","M3",0.79]
["S",3,"S",0,3,5,1,0,0,0,0,"","Serviço","Serviço","3.5.1.4.","SINAPI",92778,"ARMAÇÃO DE PILAR OU VIGA DE UMA ESTRUTURA CONVENCIONAL DE CONCRETO ARMADO EM UMA EDIFICAÇÃO TÉRREA OU SOBRADO UTILIZANDO AÇO CA-50 DE 10,0 MM - MONTAGEM. AF_12/2015","KG",70]
["S",3,"S",0,3,5,1,0,0,0,0,"","Serviço","Serviço","3.5.1.5.","SINAPI",92775,"ARMAÇÃO DE PILAR OU VIGA DE UMA ESTRUTURA CONVENCIONAL DE CONCRETO ARMADO EM UMA EDIFICAÇÃO TÉRREA OU SOBRADO UTILIZANDO AÇO CA-60 DE 5,0 MM - MONTAGEM. AF_12/2015","KG",24.545454545454543]
[3,3,3,8,3,5,2,0,0,12,8,"","Nível 3","Nível 3","3.5.2.","SINAPI",null,"VIGAS DA COBERTURA","-"]
["S",3,"S",0,3,5,2,0,0,0,0,"","Serviço","Serviço","3.5.2.1.","SINAPI",92464,"MONTAGEM E DESMONTAGEM DE FÔRMA DE VIGA, ESCORAMENTO METÁLICO, PÉ-DIREITO SIMPLES, EM CHAPA DE MADEIRA RESINADA, 8 UTILIZAÇÕES. AF_12/2015","M2",27.32]
["S",3,"S",0,3,5,2,0,0,0,0,"","Serviço","Serviço","3.5.2.2.","SINAPI",94964,"CONCRETO FCK = 20MPA, TRAÇO 1:2,7:3 (CIMENTO/ AREIA MÉDIA/ BRITA 1)  - PREPARO MECÂNICO COM BETONEIRA 400 L. AF_07/2016","M3",1.63]
["S",3,"S",0,3,5,2,0,0,0,0,"","Serviço","Serviço","3.5.2.3.","SINAPI",92873,"LANÇAMENTO COM USO DE BALDES, ADENSAMENTO E ACABAMENTO DE CONCRETO EM ESTRUTURAS. AF_12/2015","M3",1.63]
["S",3,"S",0,3,5,2,0,0,0,0,"","Serviço","Serviço","3.5.2.4.","SINAPI",92777,"ARMAÇÃO DE PILAR OU VIGA DE UMA ESTRUTURA CONVENCIONAL DE CONCRETO ARMADO EM UMA EDIFICAÇÃO TÉRREA OU SOBRADO UTILIZANDO AÇO CA-50 DE 8,0 MM - MONTAGEM. AF_12/2015","KG",5.4545454545454541]
["S",3,"S",0,3,5,2,0,0,0,0,"","Serviço","Serviço","3.5.2.5.","SINAPI",92778,"ARMAÇÃO DE PILAR OU VIGA DE UMA ESTRUTURA CONVENCIONAL DE CONCRETO ARMADO EM UMA EDIFICAÇÃO TÉRREA OU SOBRADO UTILIZANDO AÇO CA-50 DE 10,0 MM - MONTAGEM. AF_12/2015","KG",76.36363636363636]
["S",3,"S",0,3,5,2,0,0,0,0,"","Serviço","Serviço","3.5.2.6.","SINAPI",92779,"ARMAÇÃO DE PILAR OU VIGA DE UMA ESTRUTURA CONVENCIONAL DE CONCRETO ARMADO EM UMA EDIFICAÇÃO TÉRREA OU SOBRADO UTILIZANDO AÇO CA-50 DE 12,5 MM - MONTAGEM. AF_12/2015","KG",19.09090909090909]
["S",3,"S",0,3,5,2,0,0,0,0,"","Serviço","Serviço","3.5.2.7.","SINAPI",92775,"ARMAÇÃO DE PILAR OU VIGA DE UMA ESTRUTURA CONVENCIONAL DE CONCRETO ARMADO EM UMA EDIFICAÇÃO TÉRREA OU SOBRADO UTILIZANDO AÇO CA-60 DE 5,0 MM - MONTAGEM. AF_12/2015","KG",27.27272727272727]
[3,3,3,2,3,5,3,0,0,4,2,"","Nível 3","Nível 3","3.5.3.","SINAPI",null,"LAJE","-"]
["S",3,"S",0,3,5,3,0,0,0,0,"","Serviço","Serviço","3.5.3.1.","SINAPI","74202/1","LAJE PRE-MOLDADA P/FORRO, SOBRECARGA 100KG/M2, VAOS ATE 3,50M/E=8CM, C/LAJOTAS E CAP.C/CONC FCK=20MPA, 3CM, INTER-EIXO 38CM, C/ESCORAMENTO (REAPR.3X) E FERRAGEM NEGATIVA","M2",52.78]
[3,3,3,2,3,5,4,0,0,2,{"$error":"#N/A"},"","Nível 3","Nível 3","3.5.4.","SINAPI",null,"OUTROS SERVIÇOS","-"]
["S",3,"S",0,3,5,4,0,0,0,0,"","Serviço","Serviço","3.5.4.1.","SINAPI","74022/30","ENSAIO DE RESISTENCIA A COMPRESSAO SIMPLES - CONCRETO","UN",6]
[2,2,2,29,3,6,0,0,0,71,29,"","Nível 2","Nível 2","3.6.","SINAPI",null,"INSTALAÇÕES ELÉTRICAS","-"]
["S",2,"S",0,3,6,0,0,0,0,0,"","Serviço","Serviço","3.6.0.1.","AGETOP",70351,"BRACADEIRA METALICA TIPO \"U\" DIAM. 3/4\"","Un    ",15]
["S",2,"S",0,3,6,0,0,0,0,0,"","Serviço","Serviço","3.6.0.2.","AGETOP",70352,"BRACADEIRA METALICA TIPO \"U\" DIAM. 1\"","Un    ",5]
["S",2,"S",0,3,6,0,0,0,0,0,"","Serviço","Serviço","3.6.0.3.","AGETOP",70391,"BUCHA DE NYLON S-6","Un    ",100]
["S",2,"S",0,3,6,0,0,0,0,0,"","Serviço","Serviço","3.6.0.4.","AGETOP",70421,"BUCHA E ARRUELA METALICA DIAM. 3/4\"","PR    ",15]
["S",2,"S",0,3,6,0,0,0,0,0,"","Serviço","Serviço","3.6.0.5.","AGETOP",70422,"BUCHA E ARRUELA METALICA DIAM. 1\"","PR    ",5]
["S",2,"S",0,3,6,0,0,0,0,0,"","Serviço","Serviço","3.6.0.6.","SINAPI",91927,"CABO DE COBRE FLEXÍVEL ISOLADO, 2,5 MM², ANTI-CHAMA 0,6/1,0 KV, PARA CIRCUITOS TERMINAIS - FORNECIMENTO E INSTALAÇÃO. AF_12/2015","M",220]
["S",2,"S",0,3,6,0,0,0,0,0,"","Serviço","Serviço","3.6.0.7.","SINAPI",91929,"CABO DE COBRE FLEXÍVEL ISOLADO, 4 MM², ANTI-CHAMA 0,6/1,0 KV, PARA CIRCUITOS TERMINAIS - FORNECIMENTO E INSTALAÇÃO. AF_12/2015","M",152]
["S",2,"S",0,3,6,0,0,0,0,0,"","Serviço","Serviço","3.6.0.8.","SINAPI",83446,"CAIXA DE PASSAGEM 30X30X40 COM TAMPA E DRENO BRITA","UN",1]
["S",2,"S",0,3,6,0,0,0,0,0,"","Serviço","Serviço","3.6.0.9.","SINAPI",91936,"CAIXA OCTOGONAL 4\" X 4\", PVC, INSTALADA EM LAJE - FORNECIMENTO E INSTALAÇÃO. AF_12/2015","UN",6]
["S",2,"S",0,3,6,0,0,0,0,0,"","Serviço","Serviço","3.6.0.10.","SINAPI",92867,"CAIXA RETANGULAR 4\" X 2\" ALTA (2,00 M DO PISO), METÁLICA, INSTALADA EM PAREDE - FORNECIMENTO E INSTALAÇÃO. AF_12/2015","UN",2]
["S",2,"S",0,3,6,0,0,0,0,0,"","Serviço","Serviço","3.6.0.11.","SINAPI",92867,"CAIXA RETANGULAR 4\" X 2\" ALTA (2,00 M DO PISO), METÁLICA, INSTALADA EM PAREDE - FORNECIMENTO E INSTALAÇÃO. AF_12/2015","UN",2]
["S",2,"S",0,3,6,0,0,0,0,0,"","Serviço","Serviço","3.6.0.12.","SINAPI",92869,"CAIXA RETANGULAR 4\" X 2\" BAIXA (0,30 M DO PISO), METÁLICA, INSTALADA EM PAREDE - FORNECIMENTO E INSTALAÇÃO. AF_12/2015","UN",3]
["S",2,"S",0,3,6,0,0,0,0,0,"","Serviço","Serviço","3.6.0.13.","SINAPI",91914,"CURVA 90 GRAUS PARA ELETRODUTO, PVC, ROSCÁVEL, DN 25 MM (3/4\"), PARA CIRCUITOS TERMINAIS, INSTALADA EM PAREDE - FORNECIMENTO E INSTALAÇÃO. AF_12/2015","UN",3]
["S",2,"S",0,3,6,0,0,0,0,0,"","Serviço","Serviço","3.6.0.14.","SINAPI",93654,"DISJUNTOR MONOPOLAR TIPO DIN, CORRENTE NOMINAL DE 16A - FORNECIMENTO E INSTALAÇÃO. AF_04/2016","UN",2]
["S",2,"S",0,3,6,0,0,0,0,0,"","Serviço","Serviço","3.6.0.15.","SINAPI",93656,"DISJUNTOR MONOPOLAR TIPO DIN, CORRENTE NOMINAL DE 25A - FORNECIMENTO E INSTALAÇÃO. AF_04/2016","UN",2]
["S",2,"S",0,3,6,0,0,0,0,0,"","Serviço","Serviço","3.6.0.16.","SINAPI",93671,"DISJUNTOR TRIPOLAR TIPO DIN, CORRENTE NOMINAL DE 32A - FORNECIMENTO E INSTALAÇÃO. AF_04/2016","UN",1]
["S",2,"S",0,3,6,0,0,0,0,0,"","Serviço","Serviço","3.6.0.17.","SINAPI",91871,"ELETRODUTO RÍGIDO ROSCÁVEL, PVC, DN 25 MM (3/4\"), PARA CIRCUITOS TERMINAIS, INSTALADO EM PAREDE - FORNECIMENTO E INSTALAÇÃO. AF_12/2015","M",45]
["S",2,"S",0,3,6,0,0,0,0,0,"","Serviço","Serviço","3.6.0.18.","SINAPI",91872,"ELETRODUTO RÍGIDO ROSCÁVEL, PVC, DN 32 MM (1\"), PARA CIRCUITOS TERMINAIS, INSTALADO EM PAREDE - FORNECIMENTO E INSTALAÇÃO. AF_12/2015","M",15]
["S",2,"S",0,3,6,0,0,0,{"$f":"IF(OR($C339=\"S\",$C339=0),0,MATCH(0,OFFSET($D339,1,$C339,ROW($C$585)-ROW($C339)),0))","v":0},{"$f":"IF(OR($C339=\"S\",$C339=0),0,MATCH(OFFSET($D339,0,$C339)+1,OFFSET($D339,1,$C339,ROW($C$585)-ROW($C339)),0))","v":0},"","Serviço","Serviço","3.6.0.19.","SINAPI",91953,"INTERRUPTOR SIMPLES (1 MÓDULO), 10A/250V, INCLUINDO SUPORTE E PLACA - FORNECIMENTO E INSTALAÇÃO. AF_12/2015","UN",2]
["S",2,"S",0,3,6,0,0,0,0,0,"","Serviço","Serviço","3.6.0.20.","SINAPI",97610,"LÂMPADA COMPACTA DE LED 10 W, BASE E27 - FORNECIMENTO E INSTALAÇÃO. AF_11/2017","UN",15]
["S",2,"S",0,3,6,0,0,0,0,0,"","Serviço","Serviço","3.6.0.21.","SINAPI",97591,"LUMINÁRIA TIPO PLAFON REDONDO COM VIDRO FOSCO, DE SOBREPOR, COM 2 LÂMPADAS DE 15 W - FORNECIMENTO E INSTALAÇÃO. AF_11/2017","UN",6]
["S",2,"S",0,3,6,0,0,0,0,0,"","Serviço","Serviço","3.6.0.22.","SINAPI",97593,"LUMINÁRIA TIPO SPOT, DE SOBREPOR, COM 1 LÂMPADA DE 15 W - FORNECIMENTO E INSTALAÇÃO. AF_11/2017","UN",3]
["S",2,"S",0,3,6,0,0,0,0,0,"","Serviço","Serviço","3.6.0.23.","SINAPI",91884,"LUVA PARA ELETRODUTO, PVC, ROSCÁVEL, DN 25 MM (3/4\"), PARA CIRCUITOS TERMINAIS, INSTALADA EM PAREDE - FORNECIMENTO E INSTALAÇÃO. AF_12/2015","UN",15]
["S",2,"S",0,3,6,0,0,0,0,0,"","Serviço","Serviço","3.6.0.24.","SINAPI",91885,"LUVA PARA ELETRODUTO, PVC, ROSCÁVEL, DN 32 MM (1\"), PARA CIRCUITOS TERMINAIS, INSTALADA EM PAREDE - FORNECIMENTO E INSTALAÇÃO. AF_12/2015","UN",5]
["S",2,"S",0,3,6,0,0,0,0,0,"","Serviço","Serviço","3.6.0.25.","AGETOP",71861,"PARAFUSO P/BUCHA S-6","Un    ",100]
["S",2,"S",0,3,6,0,0,0,0,0,"","Serviço","Serviço","3.6.0.26.","SINAPI",83463,"QUADRO DE DISTRIBUICAO DE ENERGIA EM CHAPA DE ACO GALVANIZADO, PARA 12 DISJUNTORES TERMOMAGNETICOS MONOPOLARES, COM BARRAMENTO TRIFASICO E NEUTRO - FORNECIMENTO E INSTALACAO","UN",1]
["S",2,"S",0,3,6,0,0,0,0,0,"","Serviço","Serviço","3.6.0.27.","SINAPI",91996,"TOMADA MÉDIA DE EMBUTIR (1 MÓDULO), 2P+T 10 A, INCLUINDO SUPORTE E PLACA - FORNECIMENTO E INSTALAÇÃO. AF_12/2015","UN",3]
["S",2,"S",0,3,6,0,0,0,0,0,"","Serviço","Serviço","3.6.0.28.","SINAPI",91993,"TOMADA ALTA DE EMBUTIR (1 MÓDULO), 2P+T 20 A, INCLUINDO SUPORTE E PLACA - FORNECIMENTO E INSTALAÇÃO. AF_12/2015","UN",2]
[2,2,2,3,3,7,0,0,0,42,3,"","Nível 2","Nível 2","3.7.","SINAPI",null,"ALVENARIAS E DIVISÓRIAS","-"]
["S",2,"S",0,3,7,0,0,0,0,0,"","Serviço","Serviço","3.7.0.1.","SINAPI",87503,"ALVENARIA DE VEDAÇÃO DE BLOCOS CERÂMICOS FURADOS NA HORIZONTAL DE 9X19X19CM (ESPESSURA 9CM) DE PAREDES COM ÁREA LÍQUIDA MAIOR OU IGUAL A 6M² SEM VÃOS E ARGAMASSA DE ASSENTAMENTO COM PREPARO EM BETONEIRA. AF_06/2014","M2",82.064999999999984]
[{"$f":"CHOOSE(1+LOG(1+2*(ORÇAMENTO.Nivel=\"Nível 1\")+4*(ORÇAMENTO.Nivel=\"Nível 2\")+8*(ORÇAMENTO.Nivel=\"Nível 3\")+16*(ORÇAMENTO.Nivel=\"Nível 4\")+32*(ORÇAMENTO.Nivel=\"Serviço\"),2),0,1,2,3,4,\"S\")","v":"S"},2,"S",0,3,7,0,0,{"$f":"IF(AND($C351<=4,$C351<>0),0,IF(AND($C351=\"S\",$W351>0),OFFSET(I351,-1,0)+1,OFFSET(I351,-1,0)))","v":0},0,0,"","Serviço","Serviço","3.7.0.2.","SINAPI",93201,"FIXAÇÃO (ENCUNHAMENTO) DE ALVENARIA DE VEDAÇÃO COM ARGAMASSA APLICADA COM COLHER. AF_03/2016","M",27.9]
[2,2,2,2,3,8,0,0,0,39,2,"","Nível 2","Nível 2","3.8.","SINAPI",null,"IMPERMEABILIZAÇÃO","-"]
["S",2,"S",0,3,8,0,0,0,0,0,{"$f":"IF(OR(W353>0,$C353=1),\"F\",\"\")","v":""},"Serviço","Serviço","3.8.0.1.","SINAPI","74106/1","IMPERMEABILIZACAO DE ESTRUTURAS ENTERRADAS, COM TINTA ASFALTICA, DUAS DEMAOS.","M2",22.8]
[2,2,2,2,{"$f":"IF($C354=1,OFFSET(E354,-1,0)+1,OFFSET(E354,-1,0))","v":3},{"$f":"IF($C354=1,0,IF($C354=2,OFFSET(F354,-1,0)+1,OFFSET(F354,-1,0)))","v":9},{"$f":"IF(AND($C354<=2,$C354<>0),0,IF($C354=3,OFFSET(G354,-1,0)+1,OFFSET(G354,-1,0)))","v":0},{"$f":"IF(AND($C354<=3,$C354<>0),0,IF($C354=4,OFFSET(H354,-1,0)+1,OFFSET(H354,-1,0)))","v":0},0,37,2,"","Nível 2","Nível 2","3.9.","SINAPI",null,"ESTRUTURAS METÁLICAS","-"]
["S",2,"S",0,3,9,0,0,0,0,0,"","Serviço",{"$f":"CHOOSE(1+LOG(1+2*(C355=1)+4*(C355=2)+8*(C355=3)+16*(C355=4)+32*(C355=\"S\"),2),\"\",\"Nível 1\",\"Nível 2\",\"Nível 3\",\"Nível 4\",\"Serviço\")","v":"Serviço"},"3.9.0.1.","AGETOP",150103,"ESTRUTURA METÁLICA CONVENCIONAL EM AÇO DO TIPO USI SAC-300 COM FUNDO ANTICORROSIVO","Kg    ",1291.08]
[2,2,2,4,3,10,0,0,0,35,4,"","Nível 2","Nível 2","3.10.","SINAPI",null,"COBERTURAS","-"]
["S",2,"S",0,3,10,0,0,0,0,0,"","Serviço","Serviço","3.10.0.1.","SINAPI",94445,"TELHAMENTO COM TELHA CERÂMICA CAPA-CANAL, TIPO PLAN, COM ATÉ 2 ÁGUAS, INCLUSO TRANSPORTE VERTICAL. AF_06/2016","M2",88.69]
["S",2,"S",0,3,10,0,0,0,0,0,"","Serviço","Serviço","3.10.0.2.","SINAPI",94221,"CUMEEIRA PARA TELHA CERÂMICA EMBOÇADA COM ARGAMASSA TRAÇO 1:2:9 (CIMENTO, CAL E AREIA) PARA TELHADOS COM ATÉ 2 ÁGUAS, INCLUSO TRANSPORTE VERTICAL. AF_06/2016","M",9.0500000000000007]
["S",2,"S",0,3,10,0,0,0,0,0,"","Serviço","Serviço","3.10.0.3.","SINAPI",94224,"EMBOÇAMENTO COM ARGAMASSA TRAÇO 1:2:9 (CIMENTO, CAL E AREIA). AF_06/2016","M",37.700000000000003]
[2,{"$f":"IF(OR(C360=\"s\",C360=0),OFFSET(B360,-1,0),C360)","v":2},{"$f":"IF(OFFSET(C360,-1,0)=\"L\",1,IF(OFFSET(C360,-1,0)=1,2,IF(OR(A360=\"s\",A360=0),\"S\",IF(AND(OFFSET(C360,-1,0)=2,A360=4),3,IF(AND(OR(OFFSET(C360,-1,0)=\"s\",OFFSET(C360,-1,0)=0),A360<>\"s\",A360>OFFSET(B360,-1,0)),OFFSET(B360,-1,0),A360)))))","v":2},{"$f":"IF(OR(C360=\"S\",C360=0),0,IF(ISERROR(K360),J360,SMALL(J360:K360,1)))","v":4},3,11,0,0,0,31,4,"","Nível 2","Nível 2","3.11.","SINAPI",null,"ESQUADRIAS METÁLICAS","-"]
["S",2,"S",0,3,11,0,0,0,0,0,"","Serviço","Serviço","3.11.0.1.","SINAPI",94562,"JANELA DE AÇO DE CORRER, 4 FOLHAS, FIXAÇÃO COM ARGAMASSA, SEM VIDROS, PADRONIZADA. AF_07/2016","M2",4.8]
["S",2,"S",0,3,11,0,0,0,0,0,"","Serviço","Serviço","3.11.0.2.","SINAPI",94559,"JANELA DE AÇO BASCULANTE, FIXAÇÃO COM ARGAMASSA, SEM VIDROS, PADRONIZADA. AF_07/2016","M2",2.4]
["S",2,"S",0,3,11,0,0,0,0,0,"","Serviço","Serviço","3.11.0.3.","SINAPI","73933/4","PORTA DE FERRO DE ABRIR TIPO BARRA CHATA, COM REQUADRO E GUARNICAO COMPLETA","M2",1.6800000000000002]
[2,2,2,2,3,12,0,0,0,27,2,"","Nível 2","Nível 2","3.12.","SINAPI",null,"VIDROS","-"]
["S",2,"S",0,3,12,0,0,0,0,0,"","Serviço","Serviço","3.12.0.1.","SINAPI",72117,"VIDRO LISO COMUM TRANSPARENTE, ESPESSURA 4MM","M2",7.2]
[2,2,2,4,3,13,0,0,0,25,4,"","Nível 2","Nível 2","3.13.","SINAPI",null,"REVESTIMENTO DE PAREDE","-"]
["S",2,"S",0,3,13,0,0,0,0,0,"","Serviço","Serviço","3.13.0.1.","SINAPI",87879,"CHAPISCO APLICADO EM ALVENARIAS E ESTRUTURAS DE CONCRETO INTERNAS, COM COLHER DE PEDREIRO.  ARGAMASSA TRAÇO 1:3 COM PREPARO EM BETONEIRA 400L. AF_06/2014","M2",164.14]
["S",2,"S",0,3,13,0,0,0,0,0,"","Serviço","Serviço","3.13.0.2.","SINAPI",87548,"MASSA ÚNICA, PARA RECEBIMENTO DE PINTURA, EM ARGAMASSA TRAÇO 1:2:8, PREPARO MANUAL, APLICADA MANUALMENTE EM FACES INTERNAS DE PAREDES, ESPESSURA DE 10MM, COM EXECUÇÃO DE TALISCAS. AF_06/2014","M2",164.14]
["S",2,"S",0,3,13,0,0,0,0,0,"","Serviço","Serviço","3.13.0.3.","SINAPI",84088,"PEITORIL EM MARMORE BRANCO, LARGURA DE 15CM, ASSENTADO COM ARGAMASSA TRACO 1:4 (CIMENTO E AREIA MEDIA), PREPARO MANUAL DA ARGAMASSA","M",8]
[2,2,2,2,3,14,0,0,0,21,2,"","Nível 2","Nível 2","3.14.","SINAPI",null,"FORROS","-"]
["S",2,"S",0,3,14,0,0,0,0,0,"","Serviço","Serviço","3.14.0.1.","SINAPI",87414,"APLICAÇÃO MANUAL DE GESSO DESEMPENADO (SEM TALISCAS) EM TETO DE AMBIENTES DE ÁREA MAIOR QUE 10M², ESPESSURA DE 1,0CM. AF_06/2014","M2",48.51]
[2,2,2,5,3,15,0,0,0,19,5,"","Nível 2","Nível 2","3.15.","SINAPI",null,"REVESTIMENTO DE PISO","-"]
["S",2,"S",0,3,15,0,0,0,0,0,"","Serviço","Serviço","3.15.0.1.","SINAPI",95240,"LASTRO DE CONCRETO MAGRO, APLICADO EM PISOS OU RADIERS, ESPESSURA DE 3 CM. AF_07/2016","M2",84.96]
["S",2,"S",0,3,15,0,0,0,0,0,"","Serviço","Serviço","3.15.0.2.","SINAPI",94992,"EXECUÇÃO DE PASSEIO (CALÇADA) OU PISO DE CONCRETO COM CONCRETO MOLDADO IN LOCO, FEITO EM OBRA, ACABAMENTO CONVENCIONAL, ESPESSURA 6 CM, ARMADO. AF_07/2016","M2",20.699999999999989]
["S",2,"S",0,3,15,0,0,0,0,0,"","Serviço","Serviço","3.15.0.3.","SINAPI",84191,"PISO EM GRANILITE, MARMORITE OU GRANITINA ESPESSURA 8 MM, INCLUSO JUNTAS DE DILATACAO PLASTICAS","M2",59.98]
["S",2,"S",0,3,15,0,0,0,0,0,"","Serviço","Serviço","3.15.0.4.","AGETOP",221104,"RASPAGEM E APLICAÇÃO RESINA ACRÍLICA DUAS DEMÃOS","m2    ",62.333399999999997]
[2,2,2,2,3,16,0,0,0,14,2,"","Nível 2","Nível 2","3.16.","SINAPI",null,"MARCENARIA","-"]
["S",2,"S",0,3,16,0,0,0,0,0,"","Serviço","Serviço","3.16.0.1.","AGETOP",240106,"BATE CARTEIRA ENVERNIZADO E ASSENT. 2,5 X 12 CM","M     ",20.32]
[2,2,2,10,3,17,0,0,0,12,10,"","Nível 2","Nível 2","3.17.","SINAPI",null,"PINTURA","-"]
["S",2,"S",0,3,17,0,0,0,0,0,"","Serviço","Serviço","3.17.0.1.","SINAPI","74145/1","PINTURA ESMALTE FOSCO, DUAS DEMAOS, SOBRE SUPERFICIE METALICA, INCLUSO UMA DEMAO DE FUNDO ANTICORROSIVO. UTILIZACAO DE REVOLVER ( AR-COMPRIMIDO).","M2",88.69]
["S",2,"S",0,3,17,0,0,0,0,0,"","Serviço","Serviço","3.17.0.2.","SINAPI",88423,"APLICAÇÃO MANUAL DE PINTURA COM TINTA TEXTURIZADA ACRÍLICA EM PAREDES EXTERNAS DE CASAS, UMA COR. AF_06/2014","M2",71.594999999999999]
["S",2,"S",0,3,17,0,0,0,0,0,"","Serviço","Serviço","3.17.0.3.","SINAPI",88489,"APLICAÇÃO MANUAL DE PINTURA COM TINTA LÁTEX ACRÍLICA EM PAREDES, DUAS DEMÃOS. AF_06/2014","M2",50.555000000000007]
["S",2,"S",0,3,17,0,0,0,0,0,"","Serviço","Serviço","3.17.0.4.","SINAPI",88497,"APLICAÇÃO E LIXAMENTO DE MASSA LÁTEX EM PAREDES, DUAS DEMÃOS. AF_06/2014","M2",97.860000000000014]
["S",2,"S",0,3,17,0,0,0,0,0,"","Serviço","Serviço","3.17.0.5.","AGETOP",261550,"PINT.ESMALTE SINT.PAREDES - 2 DEM.C/SELADOR","m2    ",47.305]
["S",2,"S",0,3,17,0,0,0,0,0,"","Serviço","Serviço","3.17.0.6.","SINAPI",88496,"APLICAÇÃO E LIXAMENTO DE MASSA LÁTEX EM TETO, DUAS DEMÃOS. AF_06/2014","M2",48.51]
["S",2,"S",0,3,17,0,0,0,0,0,"","Serviço","Serviço","3.17.0.7.","SINAPI",88486,"APLICAÇÃO MANUAL DE PINTURA COM TINTA LÁTEX PVA EM TETO, DUAS DEMÃOS. AF_06/2014","M2",48.51]
["S",2,"S",0,3,17,0,0,0,0,0,"","Serviço","Serviço","3.17.0.8.","SINAPI","74145/1","PINTURA ESMALTE FOSCO, DUAS DEMAOS, SOBRE SUPERFICIE METALICA, INCLUSO UMA DEMAO DE FUNDO ANTICORROSIVO. UTILIZACAO DE REVOLVER ( AR-COMPRIMIDO).","M2",17.759999999999998]
["S",2,"S",0,3,17,0,0,0,0,0,"","Serviço","Serviço","3.17.0.9.","AGETOP",261623,"LETREIRO PEQ.PORTE A PINCEL EM PAREDE E PORTAS","m2    ",0.36]
[2,2,2,2,3,18,0,0,0,2,{"$error":"#N/A"},"","Nível 2","Nível 2","3.18.","SINAPI",null,"DIVERSOS","-"]
["S",2,"S",0,3,18,0,0,0,0,0,"","Serviço","Serviço","3.18.0.1.","AGETOP",271210,"QUADRO DE GIZ EMBOÇO/PINTURA COMPLETO","m2    ",5.04]
[1,1,1,126,4,0,0,0,0,194,126,"F","Nível 1","Nível 1","4.","SINAPI",null,"PÁTIO MULTIUSO - PADRÃO SEDUC_OPÇÃO 3 - 1 UNIDADE","-"]
[2,2,2,2,4,1,0,0,0,125,2,"","Nível 2","Nível 2","4.1.","SINAPI",null,"SERVIÇOS PRELIMINARES","-"]
["S",2,"S",0,4,1,0,0,0,0,0,"","Serviço","Serviço","4.1.0.1.","SINAPI",99059,"LOCACAO CONVENCIONAL DE OBRA, UTILIZANDO GABARITO DE TÁBUAS CORRIDAS PONTALETADAS A CADA 2,00M -  2 UTILIZAÇÕES. AF_10/2018","M",133.97999999999999]
[2,2,2,3,4,2,0,0,0,123,3,"","Nível 2","Nível 2","4.2.","SINAPI",null,"TRANSPORTES","-"]
["S",2,"S",0,4,2,0,0,0,0,0,"","Serviço","Serviço","4.2.0.1.","SINAPI",72900,"TRANSPORTE DE ENTULHO COM CAMINHAO BASCULANTE 6 M3, RODOVIA PAVIMENTADA, DMT 0,5 A 1,0 KM","M3",6]
["S",2,"S",0,4,2,0,0,0,0,0,"","Serviço","Serviço","4.2.0.2.","SINAPI",72897,"CARGA MANUAL DE ENTULHO EM CAMINHAO BASCULANTE 6 M3","M3",6]
[2,2,2,10,4,3,0,0,0,120,10,"","Nível 2","Nível 2","4.3.","SINAPI",null,"SERVIÇO EM TERRA","-"]
[3,3,3,3,4,3,1,0,0,9,3,"","Nível 3","Nível 3","4.3.1.","SINAPI",null,"ESCAVAÇÃO VIGA BALDRAME","-"]
["S",3,"S",0,4,3,1,0,0,0,0,"","Serviço","Serviço","4.3.1.1.","SINAPI",93358,"ESCAVAÇÃO MANUAL DE VALA COM PROFUNDIDADE MENOR OU IGUAL A 1,30 M. AF_03/2016","M3",3]
["S",3,"S",0,4,3,1,0,0,0,0,"","Serviço","Serviço","4.3.1.2.","SINAPI",96995,"REATERRO MANUAL APILOADO COM SOQUETE. AF_10/2017","M3",1.5]
[3,3,3,6,4,3,2,0,0,6,79,"","Nível 3","Nível 3","4.3.2.","SINAPI",null,"ATERRO INTERNO","-"]
["S",3,"S",0,4,3,2,0,0,0,0,"","Serviço","Serviço","4.3.2.1.","SINAPI",79480,"ESCAVACAO MECANICA CAMPO ABERTO EM SOLO EXCETO ROCHA ATE 2,00M PROFUNDIDADE","M3",33.75]
["S",3,"S",0,4,3,2,0,0,{"$f":"IF(OR($C403=\"S\",$C403=0),0,MATCH(0,OFFSET($D403,1,$C403,ROW($C$585)-ROW($C403)),0))","v":0},{"$f":"IF(OR($C403=\"S\",$C403=0),0,MATCH(OFFSET($D403,0,$C403)+1,OFFSET($D403,1,$C403,ROW($C$585)-ROW($C403)),0))","v":0},"","Serviço","Serviço","4.3.2.2.","SINAPI",72898,"CARGA E DESCARGA MECANIZADAS DE ENTULHO EM CAMINHAO BASCULANTE 6 M3","M3",33.75]
["S",3,"S",0,4,3,2,0,0,0,0,"","Serviço","Serviço","4.3.2.3.","AGETOP",41012,"INDENIZAÇÃO DE JAZIDA","m3    ",33.75]
["S",3,"S",0,4,3,2,0,0,0,0,"","Serviço","Serviço","4.3.2.4.","AGETOP",41006,"TRANSPORTE DE MATERIAL ESCAVADO M3.KM","m3km  ",337.5]
["S",3,"S",0,4,3,2,0,0,0,0,"","Serviço","Serviço","4.3.2.5.","SINAPI","74005/2","COMPACTACAO MECANICA C/ CONTROLE DO GC>=95% DO PN (AREAS) (C/MONIVELADORA 140 HP E ROLO COMPRESSOR VIBRATORIO 80 HP)","M3",27]
[2,2,2,18,4,4,0,0,0,110,18,"","Nível 2","Nível 2","4.4.","SINAPI",null,"FUNDAÇÕES E SONDAGENS","-"]
[3,3,3,9,4,4,1,0,0,17,9,"","Nível 3","Nível 3","4.4.1.","SINAPI",null,"ESTACAS E BLOCOS","-"]
["S",3,"S",0,4,4,1,0,0,0,0,"","Serviço","Serviço","4.4.1.1.","SINAPI",98230,"ESTACA BROCA DE CONCRETO, DIÂMETRO DE 30 CM, PROFUNDIDADE DE ATÉ 3 M, ESCAVAÇÃO MANUAL COM TRADO CONCHA, NÃO ARMADA. AF_03/2018","M",48]
["S",3,"S",0,4,4,1,0,0,0,0,"","Serviço","Serviço","4.4.1.2.","SINAPI",96522,"ESCAVAÇÃO MANUAL PARA BLOCO DE COROAMENTO OU SAPATA, SEM PREVISÃO DE FÔRMA. AF_06/2017","M3",9.702]
["S",3,"S",0,4,4,1,0,0,0,0,"","Serviço","Serviço","4.4.1.3.","SINAPI",96995,"REATERRO MANUAL APILOADO COM SOQUETE. AF_10/2017","M3",3.6820000000000004]
["S",3,"S",0,4,4,1,0,0,0,0,"","Serviço","Serviço","4.4.1.4.","SINAPI",94964,"CONCRETO FCK = 20MPA, TRAÇO 1:2,7:3 (CIMENTO/ AREIA MÉDIA/ BRITA 1)  - PREPARO MECÂNICO COM BETONEIRA 400 L. AF_07/2016","M3",6.02]
["S",3,"S",0,4,4,1,0,0,0,0,"","Serviço","Serviço","4.4.1.5.","SINAPI","74157/4","LANCAMENTO/APLICACAO MANUAL DE CONCRETO EM FUNDACOES","M3",6.02]
["S",3,"S",0,4,4,1,0,0,0,0,"","Serviço","Serviço","4.4.1.6.","SINAPI",96544,"ARMAÇÃO DE BLOCO, VIGA BALDRAME OU SAPATA UTILIZANDO AÇO CA-50 DE 6,3 MM - MONTAGEM. AF_06/2017","KG",133.56]
["S",3,"S",0,4,4,1,0,0,0,0,"","Serviço","Serviço","4.4.1.7.","SINAPI",96545,"ARMAÇÃO DE BLOCO, VIGA BALDRAME OU SAPATA UTILIZANDO AÇO CA-50 DE 8 MM - MONTAGEM. AF_06/2017","KG",177.84]
["S",3,"S",0,4,4,1,0,0,0,0,"","Serviço","Serviço","4.4.1.8.","SINAPI",96543,"ARMAÇÃO DE BLOCO, VIGA BALDRAME E SAPATA UTILIZANDO AÇO CA-60 DE 5 MM - MONTAGEM. AF_06/2017","KG",57.78]
[3,3,3,8,4,4,2,0,0,8,63,"","Nível 3","Nível 3","4.4.2.","SINAPI",null,"VIGA BALDRAME","-"]
["S",3,"S",0,4,4,2,0,0,0,0,"","Serviço","Serviço","4.4.2.1.","SINAPI",96527,"ESCAVAÇÃO MANUAL DE VALA PARA VIGA BALDRAME, COM PREVISÃO DE FÔRMA. AF_06/2017","M3",3.6959999999999997]
["S",3,"S",0,4,4,2,0,0,0,0,"","Serviço","Serviço","4.4.2.2.","SINAPI",96995,"REATERRO MANUAL APILOADO COM SOQUETE. AF_10/2017","M3",2.0659999999999998]
["S",3,"S",0,4,4,2,0,0,0,0,"","Serviço","Serviço","4.4.2.3.","AGETOP",60191,"FORMA DE TABUA CINTA BALDRAME U=8 VEZES","m2    ",26.7]
["S",3,"S",0,4,4,2,0,0,0,0,"","Serviço","Serviço","4.4.2.4.","SINAPI",94964,"CONCRETO FCK = 20MPA, TRAÇO 1:2,7:3 (CIMENTO/ AREIA MÉDIA/ BRITA 1)  - PREPARO MECÂNICO COM BETONEIRA 400 L. AF_07/2016","M3",1.63]
["S",3,"S",0,4,4,2,0,0,0,0,"","Serviço","Serviço","4.4.2.5.","SINAPI","74157/4","LANCAMENTO/APLICACAO MANUAL DE CONCRETO EM FUNDACOES","M3",1.63]
["S",3,"S",0,4,4,2,0,0,0,0,"","Serviço","Serviço","4.4.2.6.","SINAPI",96545,"ARMAÇÃO DE BLOCO, VIGA BALDRAME OU SAPATA UTILIZANDO AÇO CA-50 DE 8 MM - MONTAGEM. AF_06/2017","KG",52.47]
["S",3,"S",0,4,4,2,0,0,0,0,"","Serviço","Serviço","4.4.2.7.","SINAPI",96543,"ARMAÇÃO DE BLOCO, VIGA BALDRAME E SAPATA UTILIZANDO AÇO CA-60 DE 5 MM - MONTAGEM. AF_06/2017","KG",22.59]
[2,2,2,14,4,5,0,0,0,92,14,"","Nível 2","Nível 2","4.5.","SINAPI",null,"ESTRUTURA","-"]
[{"$f":"CHOOSE(1+LOG(1+2*(ORÇAMENTO.Nivel=\"Nível 1\")+4*(ORÇAMENTO.Nivel=\"Nível 2\")+8*(ORÇAMENTO.Nivel=\"Nível 3\")+16*(ORÇAMENTO.Nivel=\"Nível 4\")+32*(ORÇAMENTO.Nivel=\"Serviço\"),2),0,1,2,3,4,\"S\")","v":3},3,3,6,4,5,1,0,{"$f":"IF(AND($C426<=4,$C426<>0),0,IF(AND($C426=\"S\",$W426>0),OFFSET(I426,-1,0)+1,OFFSET(I426,-1,0)))","v":0},13,6,"","Nível 3","Nível 3","4.5.1.","SINAPI",null,"PILARES","-"]
[{"$f":"CHOOSE(1+LOG(1+2*(ORÇAMENTO.Nivel=\"Nível 1\")+4*(ORÇAMENTO.Nivel=\"Nível 2\")+8*(ORÇAMENTO.Nivel=\"Nível 3\")+16*(ORÇAMENTO.Nivel=\"Nível 4\")+32*(ORÇAMENTO.Nivel=\"Serviço\"),2),0,1,2,3,4,\"S\")","v":"S"},3,"S",0,4,5,1,0,{"$f":"IF(AND($C427<=4,$C427<>0),0,IF(AND($C427=\"S\",$W427>0),OFFSET(I427,-1,0)+1,OFFSET(I427,-1,0)))","v":0},0,0,"","Serviço","Serviço","4.5.1.1.","SINAPI",92426,"MONTAGEM E DESMONTAGEM DE FÔRMA DE PILARES RETANGULARES E ESTRUTURAS SIMILARES COM ÁREA MÉDIA DAS SEÇÕES MENOR OU IGUAL A 0,25 M², PÉ-DIREITO SIMPLES, EM CHAPA DE MADEIRA COMPENSADA RESINADA, 8 UTILIZAÇÕES. AF_12/2015","M2",75.48]
["S",3,"S",0,4,5,1,0,0,0,0,"","Serviço","Serviço","4.5.1.2.","SINAPI",94964,"CONCRETO FCK = 20MPA, TRAÇO 1:2,7:3 (CIMENTO/ AREIA MÉDIA/ BRITA 1)  - PREPARO MECÂNICO COM BETONEIRA 400 L. AF_07/2016","M3",4.8129999999999997]
["S",3,"S",0,4,5,1,0,0,0,0,{"$f":"IF(OR(W429>0,$C429=1),\"F\",\"\")","v":""},"Serviço","Serviço","4.5.1.3.","SINAPI",92873,"LANÇAMENTO COM USO DE BALDES, ADENSAMENTO E ACABAMENTO DE CONCRETO EM ESTRUTURAS. AF_12/2015","M3",4.8129999999999997]
["S",3,"S",0,{"$f":"IF($C430=1,OFFSET(E430,-1,0)+1,OFFSET(E430,-1,0))","v":4},{"$f":"IF($C430=1,0,IF($C430=2,OFFSET(F430,-1,0)+1,OFFSET(F430,-1,0)))","v":5},{"$f":"IF(AND($C430<=2,$C430<>0),0,IF($C430=3,OFFSET(G430,-1,0)+1,OFFSET(G430,-1,0)))","v":1},{"$f":"IF(AND($C430<=3,$C430<>0),0,IF($C430=4,OFFSET(H430,-1,0)+1,OFFSET(H430,-1,0)))","v":0},0,0,0,"","Serviço","Serviço","4.5.1.4.","SINAPI",92778,"ARMAÇÃO DE PILAR OU VIGA DE UMA ESTRUTURA CONVENCIONAL DE CONCRETO ARMADO EM UMA EDIFICAÇÃO TÉRREA OU SOBRADO UTILIZANDO AÇO CA-50 DE 10,0 MM - MONTAGEM. AF_12/2015","KG",361.89]
["S",3,"S",0,4,5,1,0,0,0,0,"","Serviço",{"$f":"CHOOSE(1+LOG(1+2*(C431=1)+4*(C431=2)+8*(C431=3)+16*(C431=4)+32*(C431=\"S\"),2),\"\",\"Nível 1\",\"Nível 2\",\"Nível 3\",\"Nível 4\",\"Serviço\")","v":"Serviço"},"4.5.1.5.","SINAPI",92775,"ARMAÇÃO DE PILAR OU VIGA DE UMA ESTRUTURA CONVENCIONAL DE CONCRETO ARMADO EM UMA EDIFICAÇÃO TÉRREA OU SOBRADO UTILIZANDO AÇO CA-60 DE 5,0 MM - MONTAGEM. AF_12/2015","KG",147.24]
[3,3,3,7,4,5,2,0,0,7,48,"","Nível 3","Nível 3","4.5.2.","SINAPI",94964,"VIGAS DE COBERTURA","M3",5.08]
["S",3,"S",0,4,5,2,0,0,0,0,"","Serviço","Serviço","4.5.2.1.","SINAPI",92464,"MONTAGEM E DESMONTAGEM DE FÔRMA DE VIGA, ESCORAMENTO METÁLICO, PÉ-DIREITO SIMPLES, EM CHAPA DE MADEIRA RESINADA, 8 UTILIZAÇÕES. AF_12/2015","M2",40.35]
["S",3,"S",0,4,5,2,0,0,0,0,"","Serviço","Serviço","4.5.2.2.","SINAPI",94964,"CONCRETO FCK = 20MPA, TRAÇO 1:2,7:3 (CIMENTO/ AREIA MÉDIA/ BRITA 1)  - PREPARO MECÂNICO COM BETONEIRA 400 L. AF_07/2016","M3",2.42]
["S",3,"S",0,4,5,2,0,0,0,0,"","Serviço","Serviço","4.5.2.3.","SINAPI",92873,"LANÇAMENTO COM USO DE BALDES, ADENSAMENTO E ACABAMENTO DE CONCRETO EM ESTRUTURAS. AF_12/2015","M3",2.42]
["S",{"$f":"IF(OR(C436=\"s\",C436=0),OFFSET(B436,-1,0),C436)","v":3},{"$f":"IF(OFFSET(C436,-1,0)=\"L\",1,IF(OFFSET(C436,-1,0)=1,2,IF(OR(A436=\"s\",A436=0),\"S\",IF(AND(OFFSET(C436,-1,0)=2,A436=4),3,IF(AND(OR(OFFSET(C436,-1,0)=\"s\",OFFSET(C436,-1,0)=0),A436<>\"s\",A436>OFFSET(B436,-1,0)),OFFSET(B436,-1,0),A436)))))","v":"S"},{"$f":"IF(OR(C436=\"S\",C436=0),0,IF(ISERROR(K436),J436,SMALL(J436:K436,1)))","v":0},4,5,2,0,0,0,0,"","Serviço","Serviço","4.5.2.4.","SINAPI",92777,"ARMAÇÃO DE PILAR OU VIGA DE UMA ESTRUTURA CONVENCIONAL DE CONCRETO ARMADO EM UMA EDIFICAÇÃO TÉRREA OU SOBRADO UTILIZANDO AÇO CA-50 DE 8,0 MM - MONTAGEM. AF_12/2015","KG",53.19]
["S",3,"S",0,4,5,2,0,0,0,0,"","Serviço","Serviço","4.5.2.5.","SINAPI",92778,"ARMAÇÃO DE PILAR OU VIGA DE UMA ESTRUTURA CONVENCIONAL DE CONCRETO ARMADO EM UMA EDIFICAÇÃO TÉRREA OU SOBRADO UTILIZANDO AÇO CA-50 DE 10,0 MM - MONTAGEM. AF_12/2015","KG",51.93]
["S",3,"S",0,4,5,2,0,0,0,0,"","Serviço","Serviço","4.5.2.6.","SINAPI",92775,"ARMAÇÃO DE PILAR OU VIGA DE UMA ESTRUTURA CONVENCIONAL DE CONCRETO ARMADO EM UMA EDIFICAÇÃO TÉRREA OU SOBRADO UTILIZANDO AÇO CA-60 DE 5,0 MM - MONTAGEM. AF_12/2015","KG",40.14]
[2,2,2,18,4,6,0,0,0,78,18,"","Nível 2","Nível 2","4.6.","SINAPI",null,"INSTALAÇÕES ELÉTRICAS","-"]
["S",2,"S",0,4,6,0,0,0,0,0,"","Serviço","Serviço","4.6.0.1.","AGETOP",70351,"BRACADEIRA METALICA TIPO \"U\" DIAM. 3/4\"","Un    ",30]
["S",2,"S",0,4,6,0,0,0,0,0,"","Serviço","Serviço","4.6.0.2.","AGETOP",70421,"BUCHA E ARRUELA METALICA DIAM. 3/4\"","PR    ",15]
["S",2,"S",0,4,6,0,0,0,0,0,"","Serviço","Serviço","4.6.0.3.","SINAPI",91927,"CABO DE COBRE FLEXÍVEL ISOLADO, 2,5 MM², ANTI-CHAMA 0,6/1,0 KV, PARA CIRCUITOS TERMINAIS - FORNECIMENTO E INSTALAÇÃO. AF_12/2015","M",210]
["S",2,"S",0,4,6,0,0,0,0,0,"","Serviço","Serviço","4.6.0.4.","SINAPI",91936,"CAIXA OCTOGONAL 4\" X 4\", PVC, INSTALADA EM LAJE - FORNECIMENTO E INSTALAÇÃO. AF_12/2015","UN",12]
["S",2,"S",0,4,6,0,0,0,0,0,"","Serviço","Serviço","4.6.0.5.","SINAPI",91940,"CAIXA RETANGULAR 4\" X 2\" MÉDIA (1,30 M DO PISO), PVC, INSTALADA EM PAREDE - FORNECIMENTO E INSTALAÇÃO. AF_12/2015","UN",5]
["S",2,"S",0,4,6,0,0,0,0,0,"","Serviço","Serviço","4.6.0.6.","SINAPI",95817,"CONDULETE DE PVC, TIPO X, PARA ELETRODUTO DE PVC SOLDÁVEL DN 25 MM (3/4''), APARENTE - FORNECIMENTO E INSTALAÇÃO. AF_11/2016","UN",5]
["S",2,"S",0,4,6,0,0,0,0,0,"","Serviço","Serviço","4.6.0.7.","SINAPI",91914,"CURVA 90 GRAUS PARA ELETRODUTO, PVC, ROSCÁVEL, DN 25 MM (3/4\"), PARA CIRCUITOS TERMINAIS, INSTALADA EM PAREDE - FORNECIMENTO E INSTALAÇÃO. AF_12/2015","UN",5]
["S",2,"S",0,4,6,0,0,0,0,0,"","Serviço","Serviço","4.6.0.8.","SINAPI",93654,"DISJUNTOR MONOPOLAR TIPO DIN, CORRENTE NOMINAL DE 16A - FORNECIMENTO E INSTALAÇÃO. AF_04/2016","UN",4]
["S",2,"S",0,4,6,0,0,0,0,0,"","Serviço","Serviço","4.6.0.9.","SINAPI",93671,"DISJUNTOR TRIPOLAR TIPO DIN, CORRENTE NOMINAL DE 32A - FORNECIMENTO E INSTALAÇÃO. AF_04/2016","UN",1]
["S",2,"S",0,4,6,0,0,0,0,0,"","Serviço","Serviço","4.6.0.10.","SINAPI",91871,"ELETRODUTO RÍGIDO ROSCÁVEL, PVC, DN 25 MM (3/4\"), PARA CIRCUITOS TERMINAIS, INSTALADO EM PAREDE - FORNECIMENTO E INSTALAÇÃO. AF_12/2015","M",45]
["S",2,"S",0,4,6,0,0,0,0,0,"","Serviço","Serviço","4.6.0.11.","SINAPI",91981,"INTERRUPTOR BIPOLAR (1 MÓDULO), 10A/250V, INCLUINDO SUPORTE E PLACA - FORNECIMENTO E INSTALAÇÃO. AF_09/2017","UN",3]
["S",2,"S",0,4,6,0,0,0,0,0,"","Serviço","Serviço","4.6.0.12.","SINAPI",91967,"INTERRUPTOR SIMPLES (3 MÓDULOS), 10A/250V, INCLUINDO SUPORTE E PLACA - FORNECIMENTO E INSTALAÇÃO. AF_12/2015","UN",1]
["S",2,"S",0,4,6,0,0,0,0,0,"","Serviço","Serviço","4.6.0.13.","SINAPI",97610,"LÂMPADA COMPACTA DE LED 10 W, BASE E27 - FORNECIMENTO E INSTALAÇÃO. AF_11/2017","UN",24]
["S",2,"S",0,4,6,0,0,0,0,0,"","Serviço","Serviço","4.6.0.14.","SINAPI",97591,"LUMINÁRIA TIPO PLAFON REDONDO COM VIDRO FOSCO, DE SOBREPOR, COM 2 LÂMPADAS DE 15 W - FORNECIMENTO E INSTALAÇÃO. AF_11/2017","UN",12]
["S",2,"S",0,4,6,0,0,0,0,0,"","Serviço","Serviço","4.6.0.15.","SINAPI",91884,"LUVA PARA ELETRODUTO, PVC, ROSCÁVEL, DN 25 MM (3/4\"), PARA CIRCUITOS TERMINAIS, INSTALADA EM PAREDE - FORNECIMENTO E INSTALAÇÃO. AF_12/2015","UN",15]
["S",2,"S",0,4,6,0,0,0,0,0,"","Serviço","Serviço","4.6.0.16.","SINAPI",91996,"TOMADA MÉDIA DE EMBUTIR (1 MÓDULO), 2P+T 10 A, INCLUINDO SUPORTE E PLACA - FORNECIMENTO E INSTALAÇÃO. AF_12/2015","UN",3]
["S",2,"S",0,4,6,0,0,0,0,0,"","Serviço","Serviço","4.6.0.17.","SINAPI",91997,"TOMADA MÉDIA DE EMBUTIR (1 MÓDULO), 2P+T 20 A, INCLUINDO SUPORTE E PLACA - FORNECIMENTO E INSTALAÇÃO. AF_12/2015","UN",1]
[2,2,2,31,4,7,0,0,0,60,31,"","Nível 2","Nível 2","4.7.","SINAPI",null,"INSTALAÇÕES HIDROSSANITÁRIAS","-"]
[3,3,3,10,4,7,1,0,0,30,10,"","Nível 3","Nível 3","4.7.1.","SINAPI",null,"PEÇAS E ACESSÓRIOS ","-"]
["S",3,"S",0,4,7,1,0,0,0,0,"","Serviço","Serviço","4.7.1.1.","AGETOP",81501,"ADESIVO PLASTICO - FRASCO 850 G","Un    ",2]
["S",3,"S",0,4,7,1,0,0,0,0,"","Serviço","Serviço","4.7.1.2.","AGETOP",81504,"SOLUCAO LIMPADORA 1000 CM3","Un    ",2]
["S",3,"S",0,4,7,1,0,0,0,0,"","Serviço","Serviço","4.7.1.3.","AGETOP",81825,"CAIXA DE PASSAGEM 60 X 60 CM SEM TAMPA","Un    ",1]
["S",3,"S",0,4,7,1,0,0,0,0,"","Serviço","Serviço","4.7.1.4.","SINAPI",6171,"TAMPA DE CONCRETO ARMADO 60X60X5CM PARA CAIXA","UN",1]
["S",3,"S",0,4,7,1,0,0,0,0,"","Serviço","Serviço","4.7.1.5.","SINAPI",86901,"CUBA DE EMBUTIR OVAL EM LOUÇA BRANCA, 35 X 50CM OU EQUIVALENTE - FORNECIMENTO E INSTALAÇÃO. AF_12/2013","UN",2]
["S",3,"S",0,4,7,1,0,0,0,0,"","Serviço","Serviço","4.7.1.6.","AGETOP",80556,"LIGAÇÃO FLEXÍVEL PVC DIAM.1/2\" (ENGATE)","Un    ",2]
["S",3,"S",0,4,7,1,0,0,0,0,"","Serviço","Serviço","4.7.1.7.","AGETOP",80562,"SIFAO FLEXIVEL UNIVERSAL ( SANFONADO) EM PVC PARA LAVATORIO","Un    ",2]
["S",3,"S",0,4,7,1,0,0,0,0,"","Serviço","Serviço","4.7.1.8.","SINAPI",86877,"VÁLVULA EM METAL CROMADO 1.1/2\" X 1.1/2\" PARA TANQUE OU LAVATÓRIO, COM OU SEM LADRÃO - FORNECIMENTO E INSTALAÇÃO. AF_12/2013","UN",2]
["S",3,"S",0,4,7,1,0,0,{"$f":"IF(OR($C467=\"S\",$C467=0),0,MATCH(0,OFFSET($D467,1,$C467,ROW($C$585)-ROW($C467)),0))","v":0},{"$f":"IF(OR($C467=\"S\",$C467=0),0,MATCH(OFFSET($D467,0,$C467)+1,OFFSET($D467,1,$C467,ROW($C$585)-ROW($C467)),0))","v":0},"","Serviço","Serviço","4.7.1.9.","AGETOP",80570,"TORNEIRA DE MESA PARA LAVATÓRIO DIÂMETRO DE 1/2\"","Un    ",2]
[3,3,3,12,4,7,2,0,0,20,12,"","Nível 3","Nível 3","4.7.2.","SINAPI",null,"ÁGUA FRIA","-"]
["S",3,"S",0,4,7,2,0,0,0,0,"","Serviço","Serviço","4.7.2.1.","AGETOP",80927,"REGISTRO DE GAVETA C/CANOPLA DIAMETRO 1\"","Un    ",1]
["S",3,"S",0,4,7,2,0,0,0,0,"","Serviço","Serviço","4.7.2.2.","SINAPI",89402,"TUBO, PVC, SOLDÁVEL, DN 25MM, INSTALADO EM RAMAL DE DISTRIBUIÇÃO DE ÁGUA - FORNECIMENTO E INSTALAÇÃO. AF_12/2014","M",3]
["S",3,"S",0,4,7,2,0,0,0,0,"","Serviço","Serviço","4.7.2.3.","SINAPI",89447,"TUBO, PVC, SOLDÁVEL, DN 32MM, INSTALADO EM PRUMADA DE ÁGUA - FORNECIMENTO E INSTALAÇÃO. AF_12/2014","M",6]
["S",3,"S",0,4,7,2,0,0,0,0,"","Serviço","Serviço","4.7.2.4.","SINAPI",94709,"ADAPTADOR COM FLANGES LIVRES, PVC, SOLDÁVEL, DN 32 MM X 1 , INSTALADO EM RESERVAÇÃO DE ÁGUA DE EDIFICAÇÃO QUE POSSUA RESERVATÓRIO DE FIBRA/FIBROCIMENTO   FORNECIMENTO E INSTALAÇÃO. AF_06/2016","UN",2]
["S",3,"S",0,4,7,2,0,0,0,0,"","Serviço","Serviço","4.7.2.5.","SINAPI",96662,"BUCHA DE REDUÇÃO, PPR, 32 X 25, CLASSE PN 25, INSTALADO EM RAMAL DE DISTRIBUIÇÃO DE ÁGUA \u0096 FORNECIMENTO E INSTALAÇÃO . AF_06/2015","UN",1]
["S",3,"S",0,4,7,2,0,0,0,0,"","Serviço","Serviço","4.7.2.6.","SINAPI",89481,"JOELHO 90 GRAUS, PVC, SOLDÁVEL, DN 25MM, INSTALADO EM PRUMADA DE ÁGUA - FORNECIMENTO E INSTALAÇÃO. AF_12/2014","UN",1]
["S",3,"S",0,4,7,2,0,0,0,0,"","Serviço","Serviço","4.7.2.7.","AGETOP",81341,"JOELHO 90 GRAUS ROSCAVEL 1/2\" (MARROM)","Un    ",3]
["S",3,"S",0,4,7,2,0,0,0,0,"","Serviço","Serviço","4.7.2.8.","AGETOP",81342,"JOELHO 90 GRAUS ROSCAVEL DIAMETRO 3/4\"","Un    ",1]
["S",3,"S",0,4,7,2,0,0,0,0,"","Serviço","Serviço","4.7.2.9.","AGETOP",81322,"JOELHO 90 GRAUS SOLDAVEL DIAMETRO 32 MM (1\")","Un    ",20]
["S",3,"S",0,4,7,2,0,0,0,0,"","Serviço","Serviço","4.7.2.10.","AGETOP",81421,"TE REDUCAO 90 GRAUS SOLDAVEL 32 X 25 mm","Un    ",2]
["S",3,"S",0,4,7,2,0,0,0,0,"","Serviço","Serviço","4.7.2.11.","SINAPI",89617,"TE, PVC, SOLDÁVEL, DN 25MM, INSTALADO EM PRUMADA DE ÁGUA - FORNECIMENTO E INSTALAÇÃO. AF_12/2014","UN",1]
[3,3,3,8,4,7,3,0,0,8,{"$error":"#N/A"},"","Nível 3","Nível 3","4.7.3.","SINAPI",null,"ESGOTO","-"]
["S",3,"S",0,4,7,3,0,0,0,0,"","Serviço","Serviço","4.7.3.1.","AGETOP",81663,"CORPO CX. SIFONADA DIAM. 150 X 150 X 50","Un    ",1]
["S",3,"S",0,4,7,3,0,0,0,0,"","Serviço","Serviço","-","AGETOP",81752,"GRELHA QUADRADA ACO INOX ROTATIVO DIAM.150 MM","Un    "]
["S",3,"S",0,4,7,3,0,0,0,0,"","Serviço","Serviço","4.7.3.2.","SINAPI",89726,"JOELHO 45 GRAUS, PVC, SERIE NORMAL, ESGOTO PREDIAL, DN 40 MM, JUNTA SOLDÁVEL, FORNECIDO E INSTALADO EM RAMAL DE DESCARGA OU RAMAL DE ESGOTO SANITÁRIO. AF_12/2014","UN",2]
["S",3,"S",0,4,7,3,0,0,0,0,"","Serviço","Serviço","4.7.3.3.","SINAPI",89724,"JOELHO 90 GRAUS, PVC, SERIE NORMAL, ESGOTO PREDIAL, DN 40 MM, JUNTA SOLDÁVEL, FORNECIDO E INSTALADO EM RAMAL DE DESCARGA OU RAMAL DE ESGOTO SANITÁRIO. AF_12/2014","UN",3]
["S",3,"S",0,4,7,3,0,0,0,0,"","Serviço","Serviço","4.7.3.4.","AGETOP",81927,"JOELHO 90 GRAUS C/ANEL 40 mm ","Un    ",3]
["S",3,"S",0,4,7,3,0,0,0,0,"","Serviço","Serviço","4.7.3.5.","SINAPI",89711,"TUBO PVC, SERIE NORMAL, ESGOTO PREDIAL, DN 40 MM, FORNECIDO E INSTALADO EM RAMAL DE DESCARGA OU RAMAL DE ESGOTO SANITÁRIO. AF_12/2014","M",6]
["S",3,"S",0,4,7,3,0,0,0,0,"","Serviço","Serviço","4.7.3.6.","SINAPI",89798,"TUBO PVC, SERIE NORMAL, ESGOTO PREDIAL, DN 50 MM, FORNECIDO E INSTALADO EM PRUMADA DE ESGOTO SANITÁRIO OU VENTILAÇÃO. AF_12/2014","M",3]
[2,2,2,4,4,8,0,0,0,29,4,"","Nível 2","Nível 2","4.8.","SINAPI",null,"ALVENARIAS E DIVISÓRIAS","-"]
["S",2,"S",0,4,8,0,0,0,0,0,"","Serviço","Serviço","4.8.0.1.","SINAPI",87471,"ALVENARIA DE VEDAÇÃO DE BLOCOS CERÂMICOS FURADOS NA VERTICAL DE 9X19X39CM (ESPESSURA 9CM) DE PAREDES COM ÁREA LÍQUIDA MENOR QUE 6M² SEM VÃOS E ARGAMASSA DE ASSENTAMENTO COM PREPARO EM BETONEIRA. AF_06/2014","M2",44.14]
["S",2,"S",0,4,8,0,0,0,0,0,"","Serviço","Serviço","4.8.0.2.","SINAPI",93202,"FIXAÇÃO (ENCUNHAMENTO) DE ALVENARIA DE VEDAÇÃO COM TIJOLO MACIÇO. AF_03/2016","M",5.6]
["S",2,"S",0,4,8,0,0,0,0,0,"","Serviço","Serviço","4.8.0.3.","SINAPI",95465,"COBOGO CERAMICO (ELEMENTO VAZADO), 9X20X20CM, ASSENTADO COM ARGAMASSA TRACO 1:4 DE CIMENTO E AREIA","M2",35.909999999999997]
[2,2,2,2,4,9,0,0,0,25,2,"","Nível 2","Nível 2","4.9.","SINAPI",null,"IMPERMEABILIZAÇÃO","-"]
["S",2,"S",0,4,9,0,0,0,0,0,"","Serviço","Serviço","4.9.0.1.","SINAPI",98562,"IMPERMEABILIZAÇÃO DE FLOREIRA OU VIGA BALDRAME COM ARGAMASSA DE CIMENTO E AREIA, COM ADITIVO IMPERMEABILIZANTE, E = 2 CM. AF_06/2018","M2",26.400000000000002]
[2,2,2,2,4,10,0,0,0,23,2,"","Nível 2","Nível 2","4.10.","SINAPI",null,"ESTRUTURAS METÁLICAS","-"]
["S",2,"S",0,4,10,0,0,0,0,0,"","Serviço","Serviço","4.10.0.1.","AGETOP",150103,"ESTRUTURA METÁLICA CONVENCIONAL EM AÇO DO TIPO USI SAC-300 COM FUNDO ANTICORROSIVO","Kg    ",2414.2600000000002]
[2,2,2,4,4,11,0,0,0,21,4,"","Nível 2","Nível 2","4.11.","SINAPI",null,"COBERTURAS","-"]
["S",2,"S",0,4,11,0,0,0,0,0,"","Serviço","Serviço","4.11.0.1.","SINAPI",94445,"TELHAMENTO COM TELHA CERÂMICA CAPA-CANAL, TIPO PLAN, COM ATÉ 2 ÁGUAS, INCLUSO TRANSPORTE VERTICAL. AF_06/2016","M2",179.17]
["S",2,"S",0,4,11,0,0,0,0,0,"","Serviço","Serviço","4.11.0.2.","SINAPI",94221,"CUMEEIRA PARA TELHA CERÂMICA EMBOÇADA COM ARGAMASSA TRAÇO 1:2:9 (CIMENTO, CAL E AREIA) PARA TELHADOS COM ATÉ 2 ÁGUAS, INCLUSO TRANSPORTE VERTICAL. AF_06/2016","M",21.85]
["S",2,"S",0,4,11,0,0,0,0,0,"","Serviço","Serviço","4.11.0.3.","SINAPI",94224,"EMBOÇAMENTO COM ARGAMASSA TRAÇO 1:2:9 (CIMENTO, CAL E AREIA). AF_06/2016","M",60.5]
[2,2,2,5,4,12,0,0,0,17,5,"","Nível 2","Nível 2","4.12.","SINAPI",null,"REVESTIMENTO DE PAREDE","-"]
["S",2,"S",0,4,12,0,0,0,0,0,"","Serviço","Serviço","4.12.0.1.","SINAPI",87879,"CHAPISCO APLICADO EM ALVENARIAS E ESTRUTURAS DE CONCRETO INTERNAS, COM COLHER DE PEDREIRO.  ARGAMASSA TRAÇO 1:3 COM PREPARO EM BETONEIRA 400L. AF_06/2014","M2",84.75]
["S",2,"S",0,4,12,0,0,0,0,0,"","Serviço","Serviço","4.12.0.2.","SINAPI",87548,"MASSA ÚNICA, PARA RECEBIMENTO DE PINTURA, EM ARGAMASSA TRAÇO 1:2:8, PREPARO MANUAL, APLICADA MANUALMENTE EM FACES INTERNAS DE PAREDES, ESPESSURA DE 10MM, COM EXECUÇÃO DE TALISCAS. AF_06/2014","M2",81.599999999999994]
["S",2,"S",0,4,12,0,0,0,0,0,"","Serviço","Serviço","4.12.0.3.","SINAPI",87336,"ARGAMASSA TRAÇO 1:2:8 (CIMENTO, CAL E AREIA MÉDIA) PARA EMBOÇO/MASSA ÚNICA/ASSENTAMENTO DE ALVENARIA DE VEDAÇÃO, PREPARO MECÂNICO COM MISTURADOR DE EIXO HORIZONTAL DE 600 KG. AF_06/2014","M3",3.15]
["S",2,"S",0,4,12,0,0,0,0,0,"","Serviço","Serviço","4.12.0.4.","SINAPI",87274,"REVESTIMENTO CERÂMICO PARA PAREDES INTERNAS COM PLACAS TIPO ESMALTADA EXTRA DE DIMENSÕES 33X45 CM APLICADAS EM AMBIENTES DE ÁREA MENOR QUE 5 M² A MEIA ALTURA DAS PAREDES. AF_06/2014","M2",3.15]
[2,2,2,5,4,13,0,0,0,12,5,"","Nível 2","Nível 2","4.13.","SINAPI",null,"REVESTIMENTO DE PISO","-"]
["S",2,"S",0,4,13,0,0,0,0,0,"","Serviço","Serviço","4.13.0.1.","SINAPI",95241,"LASTRO DE CONCRETO MAGRO, APLICADO EM PISOS OU RADIERS, ESPESSURA DE 5 CM. AF_07/2016","M2",133.97999999999999]
["S",2,"S",0,4,13,0,0,0,0,0,"","Serviço","Serviço","4.13.0.2.","SINAPI",84191,"PISO EM GRANILITE, MARMORITE OU GRANITINA ESPESSURA 8 MM, INCLUSO JUNTAS DE DILATACAO PLASTICAS","M2",135.69499999999999]
["S",2,"S",0,4,13,0,0,0,0,0,"","Serviço","Serviço","4.13.0.3.","AGETOP",221104,"RASPAGEM E APLICAÇÃO RESINA ACRÍLICA DUAS DEMÃOS","m2    ",135.69499999999999]
["S",2,"S",0,4,13,0,0,0,0,0,"","Serviço","Serviço","4.13.0.4.","SINAPI",94992,"EXECUÇÃO DE PASSEIO (CALÇADA) OU PISO DE CONCRETO COM CONCRETO MOLDADO IN LOCO, FEITO EM OBRA, ACABAMENTO CONVENCIONAL, ESPESSURA 6 CM, ARMADO. AF_07/2016","M2",33.72]
[2,2,2,4,4,14,0,0,0,7,4,"","Nível 2","Nível 2","4.14.","SINAPI",null,"PINTURA","-"]
["S",2,"S",0,4,14,0,0,0,0,0,"","Serviço","Serviço","4.14.0.1.","SINAPI","74145/1","PINTURA ESMALTE FOSCO, DUAS DEMAOS, SOBRE SUPERFICIE METALICA, INCLUSO UMA DEMAO DE FUNDO ANTICORROSIVO. UTILIZACAO DE REVOLVER ( AR-COMPRIMIDO).","M2",179.17]
["S",2,"S",0,4,14,0,0,0,0,0,"","Serviço","Serviço","4.14.0.2.","SINAPI",88489,"APLICAÇÃO MANUAL DE PINTURA COM TINTA LÁTEX ACRÍLICA EM PAREDES, DUAS DEMÃOS. AF_06/2014","M2",81.599999999999994]
["S",2,"S",0,4,14,0,0,0,0,0,"","Serviço","Serviço","4.14.0.3.","SINAPI",88497,"APLICAÇÃO E LIXAMENTO DE MASSA LÁTEX EM PAREDES, DUAS DEMÃOS. AF_06/2014","M2",81.599999999999994]
[2,2,2,3,4,15,0,0,0,3,{"$error":"#N/A"},"","Nível 2","Nível 2","4.15.","SINAPI",null,"DIVERSOS","-"]
["S",2,"S",0,4,15,0,0,0,0,0,"","Serviço","Serviço","4.15.0.1.","AGETOP",271608,"BANCADA DE GRANITO C/ESPELHO","m2    ",1]
["S",2,"S",0,4,15,0,0,0,0,0,"","Serviço","Serviço","4.15.0.2.","AGETOP",271303,"BANCO DE CONCRETO POLIDO BASE EM ALVENARIA REBOCADA E PINTADA - PADRÃO AGETOP 2015","m     ",15.75]
[1,1,1,34,5,0,0,0,0,68,34,"F","Nível 1","Nível 1","5.","SINAPI",null,"PASSARELA PADRÃO SEC. XXI VER. 2015 - MODELO M1","-",1]
[2,2,2,2,5,1,0,0,0,33,2,"","Nível 2","Nível 2","5.1.","SINAPI",null,"SERVIÇOS PRELIMINARES","-"]
["S",2,"S",0,5,1,0,0,0,0,0,"","Serviço","Serviço","5.1.0.1.","SINAPI",99059,"LOCACAO CONVENCIONAL DE OBRA, UTILIZANDO GABARITO DE TÁBUAS CORRIDAS PONTALETADAS A CADA 2,00M -  2 UTILIZAÇÕES. AF_10/2018","M",10.08]
[2,2,2,3,5,2,0,0,0,31,3,"","Nível 2","Nível 2","5.2.","SINAPI",null,"TRANSPORTES","-"]
["S",2,"S",0,5,2,0,0,0,0,0,"","Serviço","Serviço","5.2.0.1.","SINAPI",72900,"TRANSPORTE DE ENTULHO COM CAMINHAO BASCULANTE 6 M3, RODOVIA PAVIMENTADA, DMT 0,5 A 1,0 KM","M3",3]
["S",2,"S",0,5,2,0,0,0,0,0,"","Serviço","Serviço","5.2.0.2.","SINAPI",72897,"CARGA MANUAL DE ENTULHO EM CAMINHAO BASCULANTE 6 M3","M3",3]
[2,2,2,9,5,3,0,0,0,28,9,"","Nível 2","Nível 2","5.3.","SINAPI",null,"FUNDAÇÕES E SONDAGENS","-"]
["S",2,"S",0,5,3,0,0,0,0,0,"","Serviço","Serviço","5.3.0.1.","SINAPI",96534,"FABRICAÇÃO, MONTAGEM E DESMONTAGEM DE FÔRMA PARA BLOCO DE COROAMENTO, EM MADEIRA SERRADA, E=25 MM, 4 UTILIZAÇÕES. AF_06/2017","M2",5.28]
["S",2,"S",0,5,3,0,0,0,0,0,"","Serviço","Serviço","5.3.0.2.","SINAPI",96523,"ESCAVAÇÃO MANUAL PARA BLOCO DE COROAMENTO OU SAPATA, COM PREVISÃO DE FÔRMA. AF_06/2017","M3",1.0289999999999999]
["S",2,"S",0,5,3,0,0,0,0,0,"","Serviço","Serviço","5.3.0.3.","AGETOP",50902,"APILOAMENTO (BLOCOS/SAPATAS)","m2    ",1]
["S",2,"S",0,5,3,0,0,0,0,0,"","Serviço","Serviço","5.3.0.4.","SINAPI",96995,"REATERRO MANUAL APILOADO COM SOQUETE. AF_10/2017","M3",0.44899999999999995]
["S",2,"S",0,5,3,0,0,0,0,0,"","Serviço","Serviço","5.3.0.5.","SINAPI",94964,"CONCRETO FCK = 20MPA, TRAÇO 1:2,7:3 (CIMENTO/ AREIA MÉDIA/ BRITA 1)  - PREPARO MECÂNICO COM BETONEIRA 400 L. AF_07/2016","M3",0.57999999999999996]
["S",2,"S",0,5,3,0,0,0,0,0,"","Serviço","Serviço","5.3.0.6.","SINAPI","74157/4","LANCAMENTO/APLICACAO MANUAL DE CONCRETO EM FUNDACOES","M3",0.57999999999999996]
["S",2,"S",0,5,3,0,0,0,0,0,"","Serviço","Serviço","5.3.0.7.","SINAPI",96547,"ARMAÇÃO DE BLOCO, VIGA BALDRAME OU SAPATA UTILIZANDO AÇO CA-50 DE 12,5 MM - MONTAGEM. AF_06/2017","KG",13.18181818181818]
["S",2,"S",0,5,3,0,0,0,{"$f":"IF(OR($C531=\"S\",$C531=0),0,MATCH(0,OFFSET($D531,1,$C531,ROW($C$585)-ROW($C531)),0))","v":0},{"$f":"IF(OR($C531=\"S\",$C531=0),0,MATCH(OFFSET($D531,0,$C531)+1,OFFSET($D531,1,$C531,ROW($C$585)-ROW($C531)),0))","v":0},"","Serviço","Serviço","5.3.0.8.","SINAPI",96543,"ARMAÇÃO DE BLOCO, VIGA BALDRAME E SAPATA UTILIZANDO AÇO CA-60 DE 5 MM - MONTAGEM. AF_06/2017","KG",8.7272727272727266]
[2,2,2,6,5,4,0,0,0,19,6,"","Nível 2","Nível 2","5.4.","SINAPI",null,"ESTRUTURA","-"]
["S",2,"S",0,5,4,0,0,0,0,0,"","Serviço","Serviço","5.4.0.1.","SINAPI",92426,"MONTAGEM E DESMONTAGEM DE FÔRMA DE PILARES RETANGULARES E ESTRUTURAS SIMILARES COM ÁREA MÉDIA DAS SEÇÕES MENOR OU IGUAL A 0,25 M², PÉ-DIREITO SIMPLES, EM CHAPA DE MADEIRA COMPENSADA RESINADA, 8 UTILIZAÇÕES. AF_12/2015","M2",1.29]
["S",2,"S",0,5,4,0,0,0,0,0,"","Serviço","Serviço","5.4.0.2.","SINAPI",94964,"CONCRETO FCK = 20MPA, TRAÇO 1:2,7:3 (CIMENTO/ AREIA MÉDIA/ BRITA 1)  - PREPARO MECÂNICO COM BETONEIRA 400 L. AF_07/2016","M3",0.11]
["S",2,"S",0,5,4,0,0,0,0,0,"","Serviço","Serviço","5.4.0.3.","SINAPI",92873,"LANÇAMENTO COM USO DE BALDES, ADENSAMENTO E ACABAMENTO DE CONCRETO EM ESTRUTURAS. AF_12/2015","M3",0.11]
["S",2,"S",0,5,4,0,0,0,0,0,"","Serviço","Serviço","5.4.0.4.","SINAPI",92779,"ARMAÇÃO DE PILAR OU VIGA DE UMA ESTRUTURA CONVENCIONAL DE CONCRETO ARMADO EM UMA EDIFICAÇÃO TÉRREA OU SOBRADO UTILIZANDO AÇO CA-50 DE 12,5 MM - MONTAGEM. AF_12/2015","KG",2.8181818181818179]
["S",2,"S",0,5,4,0,0,0,0,0,"","Serviço","Serviço","5.4.0.5.","SINAPI",92775,"ARMAÇÃO DE PILAR OU VIGA DE UMA ESTRUTURA CONVENCIONAL DE CONCRETO ARMADO EM UMA EDIFICAÇÃO TÉRREA OU SOBRADO UTILIZANDO AÇO CA-60 DE 5,0 MM - MONTAGEM. AF_12/2015","KG",1.4545454545454546]
[2,2,2,2,5,5,0,0,0,13,2,"","Nível 2","Nível 2","5.5.","SINAPI",null,"IMPERMEABILIZAÇÃO","-"]
["S",2,"S",0,5,5,0,0,0,0,0,"","Serviço","Serviço","5.5.0.1.","SINAPI",98562,"IMPERMEABILIZAÇÃO DE FLOREIRA OU VIGA BALDRAME COM ARGAMASSA DE CIMENTO E AREIA, COM ADITIVO IMPERMEABILIZANTE, E = 2 CM. AF_06/2018","M2",3.6]
[2,2,2,2,5,6,0,0,0,11,2,"","Nível 2","Nível 2","5.6.","SINAPI",null,"ESTRUTURAS METÁLICAS","-"]
["S",2,"S",0,5,6,0,0,0,0,0,"","Serviço","Serviço","5.6.0.1.","AGETOP",150103,"ESTRUTURA METÁLICA CONVENCIONAL EM AÇO DO TIPO USI SAC-300 COM FUNDO ANTICORROSIVO","Kg    ",161.91200000000003]
[2,2,2,3,5,7,0,0,0,9,3,"","Nível 2","Nível 2","5.7.","SINAPI",null,"COBERTURAS","-"]
["S",2,"S",0,5,7,0,0,0,0,0,"","Serviço","Serviço","5.7.0.1.","SINAPI",94213,"TELHAMENTO COM TELHA DE AÇO/ALUMÍNIO E = 0,5 MM, COM ATÉ 2 ÁGUAS, INCLUSO IÇAMENTO. AF_06/2016","M2",12.96]
["S",2,"S",0,5,7,0,0,0,0,0,"","Serviço","Serviço","5.7.0.2.","SINAPI",94228,"CALHA EM CHAPA DE AÇO GALVANIZADO NÚMERO 24, DESENVOLVIMENTO DE 50 CM, INCLUSO TRANSPORTE VERTICAL. AF_06/2016","M",3.6]
[2,2,2,4,5,8,0,0,0,6,4,"","Nível 2","Nível 2","5.8.","SINAPI",null,"REVESTIMENTO DE PISO","-"]
["S",2,"S",0,5,8,0,0,0,0,0,"","Serviço","Serviço","5.8.0.1.","SINAPI",95241,"LASTRO DE CONCRETO MAGRO, APLICADO EM PISOS OU RADIERS, ESPESSURA DE 5 CM. AF_07/2016","M2",10.08]
["S",2,"S",0,5,8,0,0,0,0,0,"","Serviço","Serviço","5.8.0.2.","SINAPI",84191,"PISO EM GRANILITE, MARMORITE OU GRANITINA ESPESSURA 8 MM, INCLUSO JUNTAS DE DILATACAO PLASTICAS","M2",10.08]
["S",2,"S",0,5,8,0,0,0,0,0,"","Serviço","Serviço","5.8.0.3.","AGETOP",221104,"RASPAGEM E APLICAÇÃO RESINA ACRÍLICA DUAS DEMÃOS","m2    ",10.64]
[2,2,2,2,5,9,0,0,0,2,{"$error":"#N/A"},"","Nível 2","Nível 2","5.9.","SINAPI",null,"PINTURA","-"]
["S",2,"S",0,5,9,0,0,0,0,0,"","Serviço","Serviço","5.9.0.1.","SINAPI","74145/1","PINTURA ESMALTE FOSCO, DUAS DEMAOS, SOBRE SUPERFICIE METALICA, INCLUSO UMA DEMAO DE FUNDO ANTICORROSIVO. UTILIZACAO DE REVOLVER ( AR-COMPRIMIDO).","M2",12.96]
[1,1,1,34,6,0,0,0,0,34,{"$error":"#N/A"},"F","Nível 1","Nível 1","6.","SINAPI",null,"PASSARELA PADRÃO SEC. XXI VER. 2015 - MODELO M2 - 4 UNIDADES","-",4]
[2,2,2,2,6,1,0,0,0,33,2,"","Nível 2","Nível 2","6.1.","SINAPI",null,"SERVIÇOS PRELIMINARES","-"]
["S",2,"S",0,6,1,0,0,0,0,0,"","Serviço","Serviço","6.1.0.1.","AGETOP",20701,"LOCAÇÃO DA OBRA, EXECUÇÃO DE GABARITO SEM REAPROVEITAMENTO, INCLUSO PINTURA (FACE INTERNA DO RIPÃO 15CM) E PIQUETE COM TESTEMUNHA","m2    ",80.64]
[2,2,2,3,6,2,0,0,0,31,3,"","Nível 2","Nível 2","6.2.","SINAPI",null,"TRANSPORTES","-"]
["S",2,"S",0,6,2,0,0,0,0,0,"","Serviço","Serviço","6.2.0.1.","SINAPI",72900,"TRANSPORTE DE ENTULHO COM CAMINHAO BASCULANTE 6 M3, RODOVIA PAVIMENTADA, DMT 0,5 A 1,0 KM","M3",24]
["S",2,"S",0,6,2,0,0,0,0,0,"","Serviço","Serviço","6.2.0.2.","SINAPI",72897,"CARGA MANUAL DE ENTULHO EM CAMINHAO BASCULANTE 6 M3","M3",24]
[2,2,2,9,6,3,0,0,0,28,9,"","Nível 2","Nível 2","6.3.","SINAPI",null,"FUNDAÇÕES E SONDAGENS","-"]
["S",2,"S",0,6,3,0,0,0,0,0,"","Serviço","Serviço","6.3.0.1.","SINAPI",96534,"FABRICAÇÃO, MONTAGEM E DESMONTAGEM DE FÔRMA PARA BLOCO DE COROAMENTO, EM MADEIRA SERRADA, E=25 MM, 4 UTILIZAÇÕES. AF_06/2017","M2",21.12]
["S",2,"S",0,6,3,0,0,0,0,0,"","Serviço","Serviço","6.3.0.2.","SINAPI",96523,"ESCAVAÇÃO MANUAL PARA BLOCO DE COROAMENTO OU SAPATA, COM PREVISÃO DE FÔRMA. AF_06/2017","M3",4.1159999999999997]
["S",2,"S",0,6,3,0,0,0,0,0,"","Serviço","Serviço","6.3.0.3.","AGETOP",50902,"APILOAMENTO (BLOCOS/SAPATAS)","m2    ",4]
["S",2,"S",0,6,3,0,0,0,0,0,"","Serviço","Serviço","6.3.0.4.","SINAPI",96995,"REATERRO MANUAL APILOADO COM SOQUETE. AF_10/2017","M3",1.796]
["S",2,"S",0,6,3,0,0,0,0,0,"","Serviço","Serviço","6.3.0.5.","SINAPI",94964,"CONCRETO FCK = 20MPA, TRAÇO 1:2,7:3 (CIMENTO/ AREIA MÉDIA/ BRITA 1)  - PREPARO MECÂNICO COM BETONEIRA 400 L. AF_07/2016","M3",2.3199999999999998]
["S",2,"S",0,6,3,0,0,0,0,0,"","Serviço","Serviço","6.3.0.6.","SINAPI","74157/4","LANCAMENTO/APLICACAO MANUAL DE CONCRETO EM FUNDACOES","M3",2.3199999999999998]
["S",2,"S",0,6,3,0,0,0,0,0,"","Serviço","Serviço","6.3.0.7.","SINAPI",96547,"ARMAÇÃO DE BLOCO, VIGA BALDRAME OU SAPATA UTILIZANDO AÇO CA-50 DE 12,5 MM - MONTAGEM. AF_06/2017","KG",52.727272727272798]
["S",2,"S",0,6,3,0,0,0,0,0,"","Serviço","Serviço","6.3.0.8.","SINAPI",96543,"ARMAÇÃO DE BLOCO, VIGA BALDRAME E SAPATA UTILIZANDO AÇO CA-60 DE 5 MM - MONTAGEM. AF_06/2017","KG",34.909090909090921]
[2,2,2,6,6,4,0,0,0,19,6,"","Nível 2","Nível 2","6.4.","SINAPI",null,"ESTRUTURA","-"]
["S",2,"S",0,6,4,0,0,0,0,0,"","Serviço","Serviço","6.4.0.1.","SINAPI",92426,"MONTAGEM E DESMONTAGEM DE FÔRMA DE PILARES RETANGULARES E ESTRUTURAS SIMILARES COM ÁREA MÉDIA DAS SEÇÕES MENOR OU IGUAL A 0,25 M², PÉ-DIREITO SIMPLES, EM CHAPA DE MADEIRA COMPENSADA RESINADA, 8 UTILIZAÇÕES. AF_12/2015","M2",5.16]
["S",2,"S",0,6,4,0,0,0,0,0,"","Serviço","Serviço","6.4.0.2.","SINAPI",94964,"CONCRETO FCK = 20MPA, TRAÇO 1:2,7:3 (CIMENTO/ AREIA MÉDIA/ BRITA 1)  - PREPARO MECÂNICO COM BETONEIRA 400 L. AF_07/2016","M3",0.44]
["S",2,"S",0,6,4,0,0,0,0,0,"","Serviço","Serviço","6.4.0.3.","SINAPI",92873,"LANÇAMENTO COM USO DE BALDES, ADENSAMENTO E ACABAMENTO DE CONCRETO EM ESTRUTURAS. AF_12/2015","M3",0.44]
["S",2,"S",0,6,4,0,0,0,0,0,"","Serviço","Serviço","6.4.0.4.","SINAPI",92779,"ARMAÇÃO DE PILAR OU VIGA DE UMA ESTRUTURA CONVENCIONAL DE CONCRETO ARMADO EM UMA EDIFICAÇÃO TÉRREA OU SOBRADO UTILIZANDO AÇO CA-50 DE 12,5 MM - MONTAGEM. AF_12/2015","KG",11.27272727272728]
[{"$f":"CHOOSE(1+LOG(1+2*(ORÇAMENTO.Nivel=\"Nível 1\")+4*(ORÇAMENTO.Nivel=\"Nível 2\")+8*(ORÇAMENTO.Nivel=\"Nível 3\")+16*(ORÇAMENTO.Nivel=\"Nível 4\")+32*(ORÇAMENTO.Nivel=\"Serviço\"),2),0,1,2,3,4,\"S\")","v":"S"},{"$f":"IF(OR(C571=\"s\",C571=0),OFFSET(B571,-1,0),C571)","v":2},{"$f":"IF(OFFSET(C571,-1,0)=\"L\",1,IF(OFFSET(C571,-1,0)=1,2,IF(OR(A571=\"s\",A571=0),\"S\",IF(AND(OFFSET(C571,-1,0)=2,A571=4),3,IF(AND(OR(OFFSET(C571,-1,0)=\"s\",OFFSET(C571,-1,0)=0),A571<>\"s\",A571>OFFSET(B571,-1,0)),OFFSET(B571,-1,0),A571)))))","v":"S"},{"$f":"IF(OR(C571=\"S\",C571=0),0,IF(ISERROR(K571),J571,SMALL(J571:K571,1)))","v":0},{"$f":"IF($C571=1,OFFSET(E571,-1,0)+1,OFFSET(E571,-1,0))","v":6},{"$f":"IF($C571=1,0,IF($C571=2,OFFSET(F571,-1,0)+1,OFFSET(F571,-1,0)))","v":4},{"$f":"IF(AND($C571<=2,$C571<>0),0,IF($C571=3,OFFSET(G571,-1,0)+1,OFFSET(G571,-1,0)))","v":0},{"$f":"IF(AND($C571<=3,$C571<>0),0,IF($C571=4,OFFSET(H571,-1,0)+1,OFFSET(H571,-1,0)))","v":0},{"$f":"IF(AND($C571<=4,$C571<>0),0,IF(AND($C571=\"S\",$W571>0),OFFSET(I571,-1,0)+1,OFFSET(I571,-1,0)))","v":0},0,0,{"$f":"IF(OR(W571>0,$C571=1),\"F\",\"\")","v":""},"Serviço",{"$f":"CHOOSE(1+LOG(1+2*(C571=1)+4*(C571=2)+8*(C571=3)+16*(C571=4)+32*(C571=\"S\"),2),\"\",\"Nível 1\",\"Nível 2\",\"Nível 3\",\"Nível 4\",\"Serviço\")","v":"Serviço"},"6.4.0.5.","SINAPI",92775,"ARMAÇÃO DE PILAR OU VIGA DE UMA ESTRUTURA CONVENCIONAL DE CONCRETO ARMADO EM UMA EDIFICAÇÃO TÉRREA OU SOBRADO UTILIZANDO AÇO CA-60 DE 5,0 MM - MONTAGEM. AF_12/2015","KG",5.8181818181817997]
[2,2,2,2,6,5,0,0,0,13,2,"","Nível 2","Nível 2","6.5.","SINAPI",null,"IMPERMEABILIZAÇÃO","-"]
["S",2,"S",0,6,5,0,0,0,0,0,"","Serviço","Serviço","6.5.0.1.","SINAPI",98562,"IMPERMEABILIZAÇÃO DE FLOREIRA OU VIGA BALDRAME COM ARGAMASSA DE CIMENTO E AREIA, COM ADITIVO IMPERMEABILIZANTE, E = 2 CM. AF_06/2018","M2",14.4]
[2,2,2,2,6,6,0,0,0,11,2,"","Nível 2","Nível 2","6.6.","SINAPI",null,"ESTRUTURAS METÁLICAS","-"]
["S",2,"S",0,6,6,0,0,0,0,0,"","Serviço","Serviço","6.6.0.1.","AGETOP",150103,"ESTRUTURA METÁLICA CONVENCIONAL EM AÇO DO TIPO USI SAC-300 COM FUNDO ANTICORROSIVO","Kg    ",1082.2400000000002]
[2,2,2,3,6,7,0,0,0,9,3,"","Nível 2","Nível 2","6.7.","SINAPI",null,"COBERTURAS","-"]
["S",2,"S",0,6,7,0,0,0,0,0,"","Serviço","Serviço","6.7.0.1.","SINAPI",94213,"TELHAMENTO COM TELHA DE AÇO/ALUMÍNIO E = 0,5 MM, COM ATÉ 2 ÁGUAS, INCLUSO IÇAMENTO. AF_06/2016","M2",103.68]
["S",2,"S",0,6,7,0,0,0,0,0,"","Serviço","Serviço","6.7.0.2.","SINAPI",94228,"CALHA EM CHAPA DE AÇO GALVANIZADO NÚMERO 24, DESENVOLVIMENTO DE 50 CM, INCLUSO TRANSPORTE VERTICAL. AF_06/2016","M",28.8]
[2,2,2,4,6,8,0,0,0,6,4,"","Nível 2","Nível 2","6.8.","SINAPI",null,"REVESTIMENTO DE PISO","-"]
["S",2,"S",0,6,8,0,0,0,0,0,"","Serviço","Serviço","6.8.0.1.","SINAPI",95241,"LASTRO DE CONCRETO MAGRO, APLICADO EM PISOS OU RADIERS, ESPESSURA DE 5 CM. AF_07/2016","M2",80.64]
["S",2,"S",0,6,8,0,0,0,0,0,"","Serviço","Serviço","6.8.0.2.","SINAPI",84191,"PISO EM GRANILITE, MARMORITE OU GRANITINA ESPESSURA 8 MM, INCLUSO JUNTAS DE DILATACAO PLASTICAS","M2",80.64]
["S",2,"S",0,6,8,0,0,0,0,0,"","Serviço","Serviço","6.8.0.3.","AGETOP",221104,"RASPAGEM E APLICAÇÃO RESINA ACRÍLICA DUAS DEMÃOS","m2    ",82.88]
[2,2,2,2,6,9,0,0,0,2,{"$error":"#N/A"},"","Nível 2","Nível 2","6.9.","SINAPI",null,"PINTURA","-"]
["S",2,"S",0,6,9,0,0,0,0,0,"","Serviço","Serviço","6.9.0.1.","SINAPI","74145/1","PINTURA ESMALTE FOSCO, DUAS DEMAOS, SOBRE SUPERFICIE METALICA, INCLUSO UMA DEMAO DE FUNDO ANTICORROSIVO. UTILIZACAO DE REVOLVER ( AR-COMPRIMIDO).","M2",207.36]
[-1,null,-1,null,0,0,0,0,0,null,null,"F"]
[null,null,null,null,null,null,null,null,null,null,null,"F",null,null,null,null,null,"OBS: OS QUANTITATIVOS DE MATERIAIS  DAS INSTALAÇÕES HIDROSSANITÁRIAS, ELÉTRICAS E ESPECIAIS SÃO FORNECIDOS PELOS PROFISSIONAIS RESPONSÁVEIS PELOS RESPECTIVOS PROJETOS.",null,null,"VALOR TOTAL"]
[null,null,null,null,null,null,null,null,null,null,null,"F",null,null,null,null,null,null,null,null,"VALOR BDI (27,95%)"]
[null,null,null,null,null,null,null,null,null,null,null,"F",null,null,null,null,null,null,null,null,"TOTAL ORÇAMENTO"]
[null,null,null,null,null,null,null,null,null,null,null,"F"]
[null,null,null,null,null,null,null,null,null,null,null,"F",null,null,null,null,null,null,null,null,"CUSTO POR M2 ³"]
[null,null,null,null,null,null,null,null,null,null,null,"F",null,null,null,null,null,null,null,null,"MATERIAL S/ BDI"]
[null,null,null,null,null,null,null,null,null,null,null,"F",null,null,null,null,null,null,null,null,"MÃO DE OBRA S/ BDI"]
[null,null,null,null,null,null,null,null,null,null,null,"F"]
[null,null,null,null,null,null,null,null,null,null,null,"F",null,null,null,null,"(1) Conforme previsto pelo DECRETO Nº 7.983, DE 8 DE ABRIL DE 2013, os preços adotados são aqueles constantes dos sistemas de referência indicados. Justifica-se o uso dos preços destas composições de custos unitários devido ao seu valor ser menor à mediana de seus correspondentes na tabela SINAPI;"]
[null,null,null,null,null,null,null,null,null,null,null,"F",null,null,null,null,"(2) Optou-se pelo uso das composições de custos da AGETOP para itens não presentes na SINAPI;"]
[null,null,null,null,null,null,null,null,null,null,null,"F",null,null,null,null,"(3) Para itens da AGETOP, os vidros não estão inclusos nas esquadrias e já foram considerados os custos de contramarco para as esquadrias de alumínio;"]
[null,null,null,null,null,null,null,null,null,null,null,"F",null,null,null,null,"(4) Nos casos em que houver execução de granitina e omissão do item AGETOP 221102, considerou-se que o quantitativo para o rodapé, de altura igual a 7cm, foi incorporado na área de piso;"]
[null,null,null,null,null,null,null,null,null,null,null,"F",null,null,null,null,"(5) O custo unitário aproximado por metro quadrado é calculado dividindo-se o valor total do orçamento pela área total de construção."]
[null,null,null,null,null,null,null,null,null,null,null,"F"]
[null,null,null,null,null,null,null,null,null,null,null,"F"]
[]
[null,null,null,null,null,null,null,null,null,null,null,null,null,null,"SOMATÓRIO DE SERVIÇOS"]
[null,null,null,null,null,null,null,null,null,null,null,null,null,null,"ITEM","DESCRIÇÃO DOS SERVIÇOS",null,null,"PREÇO SEM BDI",null,null,"PREÇO COM BDI"]
[null,null,null,null,null,null,null,null,null,null,null,null,null,null,"a.","SERVIÇOS PRELIMINARES",null,null,{"$f":"SUMIF($R$19:$R$585,$P604,$W$19:$W$585)","v":0},null,null,{"$f":"ROUND(S604*(1+BDI.Taxa),2)","v":0}]
[null,null,null,null,null,null,null,null,null,null,null,null,null,null,"b.","TRANSPORTES",null,null,0,null,null,0]
[null,null,null,null,null,null,null,null,null,null,null,null,null,null,"c.","SERVIÇO EM TERRA",null,null,0,null,null,0]
[null,null,null,null,null,null,null,null,null,null,null,null,null,null,"d.","FUNDAÇÕES E SONDAGENS",null,null,0,null,null,0]
[null,null,null,null,null,null,null,null,null,null,null,null,null,null,"e.","ESTRUTURA",null,null,0,null,null,0]
[null,null,null,null,null,null,null,null,null,null,null,null,null,null,"f.","INSTALAÇÕES ELÉTRICAS",null,null,0,null,null,0]
[null,null,null,null,null,null,null,null,null,null,null,null,null,null,"g.","INSTALAÇÕES HIDROSSANITÁRIAS",null,null,0,null,null,0]
[null,null,null,null,null,null,null,null,null,null,null,null,null,null,"h","INSTALAÇÕES ESPECIAIS",null,null,0,null,null,0]
[null,null,null,null,null,null,null,null,null,null,null,null,null,null,"i.","ALVENARIAS E DIVISÓRIAS",null,null,0,null,null,0]
[null,null,null,null,null,null,null,null,null,null,null,null,null,null,"j.","ALVENARIA AUTO-PORTANTE",null,null,0,null,null,0]
[null,null,null,null,null,null,null,null,null,null,null,null,null,null,"k.","IMPERMEABILIZAÇÃO",null,null,0,null,null,0]
[null,null,null,null,null,null,null,null,null,null,null,null,null,null,"l.","ISOLAMENTO TÉRMICO E ACÚSTICO",null,null,0,null,null,0]
[null,null,null,null,null,null,null,null,null,null,null,null,null,null,"m.","ESTRUTURA DE MADEIRA",null,null,0,null,null,0]
[null,null,null,null,null,null,null,null,null,null,null,null,null,null,"n.","ESTRUTURAS METÁLICAS",null,null,0,null,null,0]
[null,null,null,null,null,null,null,null,null,null,null,null,null,null,"o.","COBERTURAS",null,null,0,null,null,0]
[null,null,null,null,null,null,null,null,null,null,null,null,null,null,"p.","ESQUADRIAS DE MADEIRA",null,null,0,null,null,0]
[null,null,null,null,null,null,null,null,null,null,null,null,null,null,"q.","ESQUADRIAS METÁLICAS",null,null,0,null,null,{"$f":"ROUND(S620*(1+BDI.Taxa),2)","v":0}]
[null,null,null,null,null,null,null,null,null,null,null,null,null,null,"r.","VIDROS",null,null,0,null,null,0]
[null,null,null,null,null,null,null,null,null,null,null,null,null,null,"s.","REVESTIMENTO DE PAREDE",null,null,0,null,null,0]
[null,null,null,null,null,null,null,null,null,null,null,null,null,null,"t.","FORROS",null,null,0,null,null,0]
[null,null,null,null,null,null,null,null,null,null,null,null,null,null,"u.","REVESTIMENTO DE PISO",null,null,0,null,null,0]
[null,null,null,null,null,null,null,null,null,null,null,null,null,null,"v.","FERRAGENS",null,null,0,null,null,0]
[null,null,null,null,null,null,null,null,null,null,null,null,null,null,"w.","MARCENARIA",null,null,0,null,null,0]
[null,null,null,null,null,null,null,null,null,null,null,null,null,null,"x.","ADMINISTRAÇÃO",null,null,0,null,null,0]
[null,null,null,null,null,null,null,null,null,null,null,null,null,null,"y.","PINTURA",null,null,0,null,null,{"$f":"ROUND(S628*(1+BDI.Taxa),2)","v":0}]
[null,null,null,null,null,null,null,null,null,null,null,null,null,null,"z.","DIVERSOS",null,null,0,null,null,{"$f":"IF(S629>0,IF((SUM(V604:W628)+ROUND(S629*(1+BDI.Taxa),2))<>V631,V631-SUM(V604:W628),ROUND(S629*(1+BDI.Taxa),2)),0)","v":0}]
[null,null,null,null,null,null,null,null,null,null,null,null,null,null,"TOTAL GERAL DO ORÇAMENTO (R$)",null,null,null,{"$f":"SUM(S604:U629)","v":0},null,null,{"$f":"SUM(V604:W629)","v":0}]
[null,null,null,null,null,null,null,null,null,null,null,null,null,null,null,null,null,null,{"$f":"$W$586","v":0},null,null,{"$f":"$W$588","v":0}]
[null,null,null,null,null,null,null,null,null,null,null,null,null,null,null,null,null,null,"(TOTAL SEM BDI)",null,null,"(TOTAL COM BDI)"]
[null,null,null,null,null,null,null,null,null,null,null,null,null,null,null,null,null,null,{"$f":"IF(AND(S630=S631,S630>0),\"OK\",\"ERRO\")","v":"ERRO"},null,null,{"$f":"IF(AND(V630=V631,V630>0),\"OK\",\"ERRO\")","v":"ERRO"}]
[]
[]
[null,null,null,null,null,null,null,null,null,null,null,null,null,null,"RESUMO GERAL DO ORÇAMENTO"]
[null,null,null,null,null,null,null,null,null,null,null,null,null,null,"ITEM","DESCRIÇÃO DOS SERVIÇOS",null,null,"PREÇO SEM BDI",null,null,"PREÇO COM BDI"]
[null,null,null,null,null,null,null,null,null,null,null,null,null,null,"1.",{"$f":"IFERROR(VLOOKUP(O638,$O$19:$W$585,4,FALSE),\"\")","v":"REFORMA"},null,null,{"$f":"IF(P639=\"\",$S$659-SUM(OFFSET($S$637:S637,0,0,COUNTA($S$637:S637),1)),SUMIF($R$19:$R$585,$P638,$W$19:$W$585))","v":0},null,null,{"$f":"IF(P639=\"\",$V$659-SUM(OFFSET($V$637:V637,0,0,COUNTA($V$637:V637),1)),ROUND(S638*(1+BDI.Taxa),2))","v":0}]
[null,null,null,null,null,null,null,null,null,null,null,null,null,null,"2.","IMPLANTAÇÃO",null,null,{"$f":"IF(P640=\"\",$S$659-SUM(OFFSET($S$637:S638,0,0,COUNTA($S$637:S638),1)),SUMIF($R$19:$R$585,$P639,$W$19:$W$585))","v":0},null,null,{"$f":"IF(P640=\"\",$V$659-SUM(OFFSET($V$637:V638,0,0,COUNTA($V$637:V638),1)),ROUND(S639*(1+BDI.Taxa),2))","v":0}]
[null,null,null,null,null,null,null,null,null,null,null,null,null,null,"3.","BLOCO 01 SALA PADRÃO SEDUC 2017 - LAJE",null,null,{"$f":"IF(P641=\"\",$S$659-SUM(OFFSET($S$637:S639,0,0,COUNTA($S$637:S639),1)),SUMIF($R$19:$R$585,$P640,$W$19:$W$585))","v":0},null,null,{"$f":"IF(P641=\"\",$V$659-SUM(OFFSET($V$637:V639,0,0,COUNTA($V$637:V639),1)),ROUND(S640*(1+BDI.Taxa),2))","v":0}]
[null,null,null,null,null,null,null,null,null,null,null,null,null,null,"4.","PÁTIO MULTIUSO - PADRÃO SEDUC_OPÇÃO 3 - 1 UNIDADE",null,null,{"$f":"IF(P642=\"\",$S$659-SUM(OFFSET($S$637:S640,0,0,COUNTA($S$637:S640),1)),SUMIF($R$19:$R$585,$P641,$W$19:$W$585))","v":0},null,null,{"$f":"IF(P642=\"\",$V$659-SUM(OFFSET($V$637:V640,0,0,COUNTA($V$637:V640),1)),ROUND(S641*(1+BDI.Taxa),2))","v":0}]
[null,null,null,null,null,null,null,null,null,null,null,null,null,null,"5.","PASSARELA PADRÃO SEC. XXI VER. 2015 - MODELO M1",null,null,{"$f":"IF(P643=\"\",$S$659-SUM(OFFSET($S$637:S641,0,0,COUNTA($S$637:S641),1)),SUMIF($R$19:$R$585,$P642,$W$19:$W$585))","v":0},null,null,{"$f":"IF(P643=\"\",$V$659-SUM(OFFSET($V$637:V641,0,0,COUNTA($V$637:V641),1)),ROUND(S642*(1+BDI.Taxa),2))","v":0}]
[null,null,null,null,null,null,null,null,null,null,null,null,null,null,"6.","PASSARELA PADRÃO SEC. XXI VER. 2015 - MODELO M2 - 4 UNIDADES",null,null,{"$f":"IF(P644=\"\",$S$659-SUM(OFFSET($S$637:S642,0,0,COUNTA($S$637:S642),1)),SUMIF($R$19:$R$585,$P643,$W$19:$W$585))","v":0},null,null,{"$f":"IF(P644=\"\",$V$659-SUM(OFFSET($V$637:V642,0,0,COUNTA($V$637:V642),1)),ROUND(S643*(1+BDI.Taxa),2))","v":0}]
[null,null,null,null,null,null,null,null,null,null,null,null,null,null,"7.","",null,null,{"$f":"IF(P645=\"\",$S$659-SUM(OFFSET($S$637:S643,0,0,COUNTA($S$637:S643),1)),SUMIF($R$19:$R$585,$P644,$W$19:$W$585))","v":0},null,null,{"$f":"IF(P645=\"\",$V$659-SUM(OFFSET($V$637:V643,0,0,COUNTA($V$637:V643),1)),ROUND(S644*(1+BDI.Taxa),2))","v":0}]
[null,null,null,null,null,null,null,null,null,null,null,null,null,null,"8.","",null,null,{"$f":"IF(P646=\"\",$S$659-SUM(OFFSET($S$637:S644,0,0,COUNTA($S$637:S644),1)),SUMIF($R$19:$R$585,$P645,$W$19:$W$585))","v":0},null,null,{"$f":"IF(P646=\"\",$V$659-SUM(OFFSET($V$637:V644,0,0,COUNTA($V$637:V644),1)),ROUND(S645*(1+BDI.Taxa),2))","v":0}]
[null,null,null,null,null,null,null,null,null,null,null,null,null,null,"9.","",null,null,{"$f":"IF(P647=\"\",$S$659-SUM(OFFSET($S$637:S645,0,0,COUNTA($S$637:S645),1)),SUMIF($R$19:$R$585,$P646,$W$19:$W$585))","v":0},null,null,{"$f":"IF(P647=\"\",$V$659-SUM(OFFSET($V$637:V645,0,0,COUNTA($V$637:V645),1)),ROUND(S646*(1+BDI.Taxa),2))","v":0}]
[null,null,null,null,null,null,null,null,null,null,null,null,null,null,"10.","",null,null,{"$f":"IF(P648=\"\",$S$659-SUM(OFFSET($S$637:S646,0,0,COUNTA($S$637:S646),1)),SUMIF($R$19:$R$585,$P647,$W$19:$W$585))","v":0},null,null,{"$f":"IF(P648=\"\",$V$659-SUM(OFFSET($V$637:V646,0,0,COUNTA($V$637:V646),1)),ROUND(S647*(1+BDI.Taxa),2))","v":0}]
[null,null,null,null,null,null,null,null,null,null,null,null,null,null,"11.","",null,null,{"$f":"IF(P649=\"\",$S$659-SUM(OFFSET($S$637:S647,0,0,COUNTA($S$637:S647),1)),SUMIF($R$19:$R$585,$P648,$W$19:$W$585))","v":0},null,null,{"$f":"IF(P649=\"\",$V$659-SUM(OFFSET($V$637:V647,0,0,COUNTA($V$637:V647),1)),ROUND(S648*(1+BDI.Taxa),2))","v":0}]
[null,null,null,null,null,null,null,null,null,null,null,null,null,null,"12.","",null,null,{"$f":"IF(P650=\"\",$S$659-SUM(OFFSET($S$637:S648,0,0,COUNTA($S$637:S648),1)),SUMIF($R$19:$R$585,$P649,$W$19:$W$585))","v":0},null,null,{"$f":"IF(P650=\"\",$V$659-SUM(OFFSET($V$637:V648,0,0,COUNTA($V$637:V648),1)),ROUND(S649*(1+BDI.Taxa),2))","v":0}]
[null,null,null,null,null,null,null,null,null,null,null,null,null,null,"13.","",null,null,{"$f":"IF(P651=\"\",$S$659-SUM(OFFSET($S$637:S649,0,0,COUNTA($S$637:S649),1)),SUMIF($R$19:$R$585,$P650,$W$19:$W$585))","v":0},null,null,{"$f":"IF(P651=\"\",$V$659-SUM(OFFSET($V$637:V649,0,0,COUNTA($V$637:V649),1)),ROUND(S650*(1+BDI.Taxa),2))","v":0}]
[null,null,null,null,null,null,null,null,null,null,null,null,null,null,"14.","",null,null,{"$f":"IF(P652=\"\",$S$659-SUM(OFFSET($S$637:S650,0,0,COUNTA($S$637:S650),1)),SUMIF($R$19:$R$585,$P651,$W$19:$W$585))","v":0},null,null,{"$f":"IF(P652=\"\",$V$659-SUM(OFFSET($V$637:V650,0,0,COUNTA($V$637:V650),1)),ROUND(S651*(1+BDI.Taxa),2))","v":0}]
[null,null,null,null,null,null,null,null,null,null,null,null,null,null,"15.","",null,null,{"$f":"IF(P653=\"\",$S$659-SUM(OFFSET($S$637:S651,0,0,COUNTA($S$637:S651),1)),SUMIF($R$19:$R$585,$P652,$W$19:$W$585))","v":0},null,null,{"$f":"IF(P653=\"\",$V$659-SUM(OFFSET($V$637:V651,0,0,COUNTA($V$637:V651),1)),ROUND(S652*(1+BDI.Taxa),2))","v":0}]
[null,null,null,null,null,null,null,null,null,null,null,null,null,null,"16.","",null,null,{"$f":"IF(P654=\"\",$S$659-SUM(OFFSET($S$637:S652,0,0,COUNTA($S$637:S652),1)),SUMIF($R$19:$R$585,$P653,$W$19:$W$585))","v":0},null,null,{"$f":"IF(P654=\"\",$V$659-SUM(OFFSET($V$637:V652,0,0,COUNTA($V$637:V652),1)),ROUND(S653*(1+BDI.Taxa),2))","v":0}]
[null,null,null,null,null,null,null,null,null,null,null,null,null,null,"17.","",null,null,{"$f":"IF(P655=\"\",$S$659-SUM(OFFSET($S$637:S653,0,0,COUNTA($S$637:S653),1)),SUMIF($R$19:$R$585,$P654,$W$19:$W$585))","v":0},null,null,{"$f":"IF(P655=\"\",$V$659-SUM(OFFSET($V$637:V653,0,0,COUNTA($V$637:V653),1)),ROUND(S654*(1+BDI.Taxa),2))","v":0}]
[null,null,null,null,null,null,null,null,null,null,null,null,null,null,"18.","",null,null,{"$f":"IF(P656=\"\",$S$659-SUM(OFFSET($S$637:S654,0,0,COUNTA($S$637:S654),1)),SUMIF($R$19:$R$585,$P655,$W$19:$W$585))","v":0},null,null,{"$f":"IF(P656=\"\",$V$659-SUM(OFFSET($V$637:V654,0,0,COUNTA($V$637:V654),1)),ROUND(S655*(1+BDI.Taxa),2))","v":0}]
[null,null,null,null,null,null,null,null,null,null,null,null,null,null,"19.","",null,null,{"$f":"IF(P657=\"\",$S$659-SUM(OFFSET($S$637:S655,0,0,COUNTA($S$637:S655),1)),SUMIF($R$19:$R$585,$P656,$W$19:$W$585))","v":0},null,null,{"$f":"IF(P657=\"\",$V$659-SUM(OFFSET($V$637:V655,0,0,COUNTA($V$637:V655),1)),ROUND(S656*(1+BDI.Taxa),2))","v":0}]
[null,null,null,null,null,null,null,null,null,null,null,null,null,null,"20.","",null,null,{"$f":"IF(P658=\"\",$S$659-SUM(OFFSET($S$637:S656,0,0,COUNTA($S$637:S656),1)),SUMIF($R$19:$R$585,$P657,$W$19:$W$585))","v":0},null,null,{"$f":"IF(P658=\"\",$V$659-SUM(OFFSET($V$637:V656,0,0,COUNTA($V$637:V656),1)),ROUND(S657*(1+BDI.Taxa),2))","v":0}]
[null,null,null,null,null,null,null,null,null,null,null,null,null,null,"TOTAL GERAL DO ORÇAMENTO (R$)",null,null,null,{"$f":"SUM(S638:U657)","v":0},null,null,{"$f":"SUM(V638:W657)","v":0}]
[null,null,null,null,null,null,null,null,null,null,null,null,null,null,null,null,null,null,{"$f":"$W$586","v":0},null,null,{"$f":"$W$588","v":0}]
[null,null,null,null,null,null,null,null,null,null,null,null,null,null,null,null,null,null,"(TOTAL SEM BDI)",null,null,"(TOTAL COM BDI)"]
[null,null,null,null,null,null,null,null,null,null,null,null,null,null,null,null,null,null,{"$f":"IF(AND(S658=S659,S658>0),\"OK\",\"ERRO\")","v":"ERRO"},null,null,{"$f":"IF(AND(V658=V659,V658>0),\"OK\",\"ERRO\")","v":"ERRO"}]

{"sheet":"Resumo ","index":1,"n_rows":39,"n_cols":9,"rows_kept":39,"cut":false,"hidden":false,"merged":[[13,0,14,0],[34,2,34,3],[35,2,35,3],[31,2,31,3],[32,2,32,3],[33,2,33,3],[28,2,28,3],[29,2,29,3],[30,2,30,3],[0,1,0,8],[36,1,36,5],[2,1,2,5],[3,1,3,5],[5,1,5,5],[6,1,6,5],[8,1,8,5],[9,1,9,5],[11,3,11,5],[12,3,12,5],[10,1,10,8],[11,6,11,8],[12,6,12,8],[25,2,25,3],[21,2,21,3],[22,2,22,3],[6,6,6,8],[7,1,7,8],[8,6,8,8],[9,6,9,8],[13,1,13,8],[1,1,1,8],[2,6,2,8],[3,6,3,8],[4,1,4,8],[5,6,5,8],[42,3,42,7],[11,1,11,2],[12,1,12,2],[15,2,15,3],[16,2,16,3],[14,1,14,8],[17,2,17,3],[23,2,23,3],[18,2,18,3],[19,2,19,3],[20,2,20,3],[41,3,41,7],[24,2,24,3],[26,2,26,3],[27,2,27,3],[38,1,38,8]]}
[]
[]
[null,"UNIDADE ESCOLAR",null,null,null,null,"CÓDIGO INEP"]
[null,{"$f":"Orçamento!$O$4","v":"CENTRO DE ENSINO EM PERÍODO INTEGRAL JOÃO XXIII"},null,null,null,null,{"$f":"Orçamento!V4","v":52015360}]
[]
[null,"OBRA",null,null,null,null,"CIDADE"]
[null,{"$f":"Orçamento!$O$7","v":"REFORMA E AMPLIAÇÃO"},null,null,null,null,{"$f":"Orçamento!$V$7","v":"CERES"}]
[]
[null,"ENDEREÇO",null,null,null,null,"CRE"]
[null,{"$f":"Orçamento!$R$10","v":"AV. GOIAS 543, CENTRO, CEP:76300-000"},null,null,null,null,{"$f":"Orçamento!$O$10","v":"CERES"}]
[]
[null,"REFERÊNCIA",null,"DATA",null,null,"ÁREA TOTAL CONSTRUÍDA (M²)"]
[null,{"$f":"CONCATENATE(\"AGETOP E SINAPI - \",Orçamento!$W$10)","v":"AGETOP E SINAPI - DESONERADA"},null,{"$f":"Orçamento!$S$7","v":"2020-02-18"},null,null,{"$f":"Orçamento!$S$13","v":3970.79}]
["FILTRO"]
[null,"RESUMO GERAL DO ORÇAMENTO"]
["↓","ITEM","DESCRIÇÃO DOS SERVIÇOS",null,"UNID","QUANT","PREÇO SEM BDI","PREÇO COM BDI","PARTICIP. (%)"]
[{"$f":"IF(E17>0,\"F\",\"\")","v":"F"},"1.",{"$f":"Orçamento!$P638","v":"REFORMA"},null,"UN ",1,{"$f":"IFERROR(Orçamento!S638,\"-\")","v":0},{"$f":"IFERROR(Orçamento!V638,\"\")","v":0},{"$f":"Orçamento!#REF!","v":{"$error":"#REF!"}}]
[{"$f":"IF(E18>0,\"F\",\"\")","v":"F"},"2.",{"$f":"Orçamento!$P639","v":"IMPLANTAÇÃO"},null,"UN ",1,{"$f":"IFERROR(Orçamento!S639,\"-\")","v":0},{"$f":"IFERROR(Orçamento!V639,\"\")","v":0},{"$f":"Orçamento!#REF!","v":{"$error":"#REF!"}}]
["F","3.",{"$f":"Orçamento!$P640","v":"BLOCO 01 SALA PADRÃO SEDUC 2017 - LAJE"},null,"UN ",1,{"$f":"IFERROR(Orçamento!S640,\"-\")","v":0},{"$f":"IFERROR(Orçamento!V640,\"\")","v":0},{"$f":"Orçamento!#REF!","v":{"$error":"#REF!"}}]
["F","4.",{"$f":"Orçamento!$P641","v":"PÁTIO MULTIUSO - PADRÃO SEDUC_OPÇÃO 3 - 1 UNIDADE"},null,"UN ",1,{"$f":"IFERROR(Orçamento!S641,\"-\")","v":0},{"$f":"IFERROR(Orçamento!V641,\"\")","v":0},{"$f":"Orçamento!#REF!","v":{"$error":"#REF!"}}]
["F","5.",{"$f":"Orçamento!$P642","v":"PASSARELA PADRÃO SEC. XXI VER. 2015 - MODELO M1"},null,"UN ",1,{"$f":"IFERROR(Orçamento!S642,\"-\")","v":0},{"$f":"IFERROR(Orçamento!V642,\"\")","v":0},{"$f":"Orçamento!#REF!","v":{"$error":"#REF!"}}]
["F","6.",{"$f":"Orçamento!$P643","v":"PASSARELA PADRÃO SEC. XXI VER. 2015 - MODELO M2 - 4 UNIDADES"},null,"UN ",4,{"$f":"IFERROR(Orçamento!S643,\"-\")","v":0},{"$f":"IFERROR(Orçamento!V643,\"\")","v":0},{"$f":"Orçamento!#REF!","v":{"$error":"#REF!"}}]
["","7.",{"$f":"Orçamento!$P644","v":""},null,null,null,{"$f":"IFERROR(Orçamento!S644,\"-\")","v":0},{"$f":"IFERROR(Orçamento!V644,\"\")","v":0},{"$f":"Orçamento!#REF!","v":{"$error":"#REF!"}}]
["","8.",{"$f":"Orçamento!$P645","v":""},null,null,null,{"$f":"IFERROR(Orçamento!S645,\"-\")","v":0},{"$f":"IFERROR(Orçamento!V645,\"\")","v":0},{"$f":"Orçamento!#REF!","v":{"$error":"#REF!"}}]
["","9.",{"$f":"Orçamento!$P646","v":""},null,null,null,{"$f":"IFERROR(Orçamento!S646,\"-\")","v":0},{"$f":"IFERROR(Orçamento!V646,\"\")","v":0},{"$f":"Orçamento!#REF!","v":{"$error":"#REF!"}}]
["","10.",{"$f":"Orçamento!$P647","v":""},null,null,null,{"$f":"IFERROR(Orçamento!S647,\"-\")","v":0},{"$f":"IFERROR(Orçamento!V647,\"\")","v":0},{"$f":"Orçamento!#REF!","v":{"$error":"#REF!"}}]
["","11.",{"$f":"Orçamento!$P648","v":""},null,null,null,{"$f":"IFERROR(Orçamento!S648,\"-\")","v":0},{"$f":"IFERROR(Orçamento!V648,\"\")","v":0},{"$f":"Orçamento!#REF!","v":{"$error":"#REF!"}}]
["","12.",{"$f":"Orçamento!$P649","v":""},null,null,null,{"$f":"IFERROR(Orçamento!S649,\"-\")","v":0},{"$f":"IFERROR(Orçamento!V649,\"\")","v":0},{"$f":"Orçamento!#REF!","v":{"$error":"#REF!"}}]
["","13.",{"$f":"Orçamento!$P650","v":""},null,null,null,{"$f":"IFERROR(Orçamento!S650,\"-\")","v":0},{"$f":"IFERROR(Orçamento!V650,\"\")","v":0},{"$f":"Orçamento!#REF!","v":{"$error":"#REF!"}}]
["","14.",{"$f":"Orçamento!$P651","v":""},null,null,null,{"$f":"IFERROR(Orçamento!S651,\"-\")","v":0},{"$f":"IFERROR(Orçamento!V651,\"\")","v":0},{"$f":"Orçamento!#REF!","v":{"$error":"#REF!"}}]
["","15.",{"$f":"Orçamento!$P652","v":""},null,null,null,{"$f":"IFERROR(Orçamento!S652,\"-\")","v":0},{"$f":"IFERROR(Orçamento!V652,\"\")","v":0},{"$f":"Orçamento!#REF!","v":{"$error":"#REF!"}}]
["","16.",{"$f":"Orçamento!$P653","v":""},null,null,null,{"$f":"IFERROR(Orçamento!S653,\"-\")","v":0},{"$f":"IFERROR(Orçamento!V653,\"\")","v":0},{"$f":"Orçamento!#REF!","v":{"$error":"#REF!"}}]
["","17.",{"$f":"Orçamento!$P654","v":""},null,null,null,{"$f":"IFERROR(Orçamento!S654,\"-\")","v":0},{"$f":"IFERROR(Orçamento!V654,\"\")","v":0},{"$f":"Orçamento!#REF!","v":{"$error":"#REF!"}}]
["","18.",{"$f":"Orçamento!$P655","v":""},null,null,null,{"$f":"IFERROR(Orçamento!S655,\"-\")","v":0},{"$f":"IFERROR(Orçamento!V655,\"\")","v":0},{"$f":"Orçamento!#REF!","v":{"$error":"#REF!"}}]
["","19.",{"$f":"Orçamento!$P656","v":""},null,null,null,{"$f":"IFERROR(Orçamento!S656,\"-\")","v":0},{"$f":"IFERROR(Orçamento!V656,\"\")","v":0},{"$f":"Orçamento!#REF!","v":{"$error":"#REF!"}}]
["","20.",{"$f":"Orçamento!$P657","v":""},null,null,null,{"$f":"IFERROR(Orçamento!S657,\"-\")","v":0},{"$f":"IFERROR(Orçamento!V657,\"\")","v":0},{"$f":"Orçamento!#REF!","v":{"$error":"#REF!"}}]
["F","TOTAL GERAL DO ORÇAMENTO (R$)",null,null,null,null,{"$f":"SUM(G17:G36)","v":0},0,{"$f":"SUM(I17:I36)","v":{"$error":"#REF!"}}]
["F"]
["F"]

{"sheet":"Somatório","index":2,"n_rows":45,"n_cols":6,"rows_kept":45,"cut":false,"hidden":false,"merged":[[13,0,14,0],[42,1,42,2],[44,1,44,5],[47,3,47,5],[48,3,48,5],[13,1,13,5],[9,1,9,3],[9,4,9,5],[11,1,11,2],[11,4,11,5],[12,1,12,2],[12,4,12,5],[0,1,0,5],[14,1,14,5],[2,1,2,3],[2,4,2,5],[3,1,3,3],[3,4,3,5],[5,1,5,3],[5,4,5,5],[6,1,6,3],[6,4,6,5],[8,1,8,3],[8,4,8,5],[1,1,1,5],[4,1,4,5],[7,1,7,5],[10,1,10,5]]}
[]
[]
[null,"UNIDADE ESCOLAR",null,null,"CÓDIGO INEP"]
[null,{"$f":"Orçamento!$O$4","v":"CENTRO DE ENSINO EM PERÍODO INTEGRAL JOÃO XXIII"},null,null,{"$f":"Orçamento!V4","v":52015360}]
[]
[null,"OBRA",null,null,"CIDADE"]
[null,{"$f":"Orçamento!$O$7","v":"REFORMA E AMPLIAÇÃO"},null,null,{"$f":"Orçamento!$V$7","v":"CERES"}]
[]
[null,"ENDEREÇO",null,null,"CRE"]
[null,{"$f":"Orçamento!$R$10","v":"AV. GOIAS 543, CENTRO, CEP:76300-000"},null,null,{"$f":"Orçamento!$O$10","v":"CERES"}]
[]
[null,"REFERÊNCIA",null,"DATA","ÁREA TOTAL CONSTRUÍDA (M²)"]
[null,{"$f":"CONCATENATE(\"AGETOP E SINAPI - \",Orçamento!$W$10)","v":"AGETOP E SINAPI - DESONERADA"},null,{"$f":"Orçamento!$S$7","v":"2020-02-18"},{"$f":"Orçamento!$S$13","v":3970.79}]
["FILTRO"]
[null,"SOMATÓRIO DE SERVIÇOS"]
["↓","ITEM","DESCRIÇÃO DOS SERVIÇOS","PREÇO SEM BDI (R$)","PREÇO COM BDI (R$)","PARTIC.  ( % )"]
[{"$f":"IF(D17>0,\"F\",\"\")","v":""},"a.",{"$f":"Orçamento!P604","v":"SERVIÇOS PRELIMINARES"},{"$f":"Orçamento!S604","v":0},{"$f":"Orçamento!V604","v":0},{"$f":"Orçamento!#REF!","v":{"$error":"#REF!"}}]
[{"$f":"IF(D18>0,\"F\",\"\")","v":""},"b.",{"$f":"Orçamento!P605","v":"TRANSPORTES"},{"$f":"Orçamento!S605","v":0},{"$f":"Orçamento!V605","v":0},{"$f":"Orçamento!#REF!","v":{"$error":"#REF!"}}]
["","c.",{"$f":"Orçamento!P606","v":"SERVIÇO EM TERRA"},{"$f":"Orçamento!S606","v":0},{"$f":"Orçamento!V606","v":0},{"$f":"Orçamento!#REF!","v":{"$error":"#REF!"}}]
["","d.",{"$f":"Orçamento!P607","v":"FUNDAÇÕES E SONDAGENS"},{"$f":"Orçamento!S607","v":0},{"$f":"Orçamento!V607","v":0},{"$f":"Orçamento!#REF!","v":{"$error":"#REF!"}}]
["","e.",{"$f":"Orçamento!P608","v":"ESTRUTURA"},{"$f":"Orçamento!S608","v":0},{"$f":"Orçamento!V608","v":0},{"$f":"Orçamento!#REF!","v":{"$error":"#REF!"}}]
["","f.",{"$f":"Orçamento!P609","v":"INSTALAÇÕES ELÉTRICAS"},{"$f":"Orçamento!S609","v":0},{"$f":"Orçamento!V609","v":0},{"$f":"Orçamento!#REF!","v":{"$error":"#REF!"}}]
["","g.",{"$f":"Orçamento!P610","v":"INSTALAÇÕES HIDROSSANITÁRIAS"},{"$f":"Orçamento!S610","v":0},{"$f":"Orçamento!V610","v":0},{"$f":"Orçamento!#REF!","v":{"$error":"#REF!"}}]
["","h.",{"$f":"Orçamento!P611","v":"INSTALAÇÕES ESPECIAIS"},{"$f":"Orçamento!S611","v":0},{"$f":"Orçamento!V611","v":0},{"$f":"Orçamento!#REF!","v":{"$error":"#REF!"}}]
["","i.",{"$f":"Orçamento!P612","v":"ALVENARIAS E DIVISÓRIAS"},{"$f":"Orçamento!S612","v":0},{"$f":"Orçamento!V612","v":0},{"$f":"Orçamento!#REF!","v":{"$error":"#REF!"}}]
["","j.",{"$f":"Orçamento!P613","v":"ALVENARIA AUTO-PORTANTE"},{"$f":"Orçamento!S613","v":0},{"$f":"Orçamento!V613","v":0},{"$f":"Orçamento!#REF!","v":{"$error":"#REF!"}}]
["","k.",{"$f":"Orçamento!P614","v":"IMPERMEABILIZAÇÃO"},{"$f":"Orçamento!S614","v":0},{"$f":"Orçamento!V614","v":0},{"$f":"Orçamento!#REF!","v":{"$error":"#REF!"}}]
["","l.",{"$f":"Orçamento!P615","v":"ISOLAMENTO TÉRMICO E ACÚSTICO"},{"$f":"Orçamento!S615","v":0},{"$f":"Orçamento!V615","v":0},{"$f":"Orçamento!#REF!","v":{"$error":"#REF!"}}]
["","m.",{"$f":"Orçamento!P616","v":"ESTRUTURA DE MADEIRA"},{"$f":"Orçamento!S616","v":0},{"$f":"Orçamento!V616","v":0},{"$f":"Orçamento!#REF!","v":{"$error":"#REF!"}}]
["","n.",{"$f":"Orçamento!P617","v":"ESTRUTURAS METÁLICAS"},{"$f":"Orçamento!S617","v":0},{"$f":"Orçamento!V617","v":0},{"$f":"Orçamento!#REF!","v":{"$error":"#REF!"}}]
["","o.",{"$f":"Orçamento!P618","v":"COBERTURAS"},{"$f":"Orçamento!S618","v":0},{"$f":"Orçamento!V618","v":0},{"$f":"Orçamento!#REF!","v":{"$error":"#REF!"}}]
["","p.",{"$f":"Orçamento!P619","v":"ESQUADRIAS DE MADEIRA"},{"$f":"Orçamento!S619","v":0},{"$f":"Orçamento!V619","v":0},{"$f":"Orçamento!#REF!","v":{"$error":"#REF!"}}]
["","q.",{"$f":"Orçamento!P620","v":"ESQUADRIAS METÁLICAS"},{"$f":"Orçamento!S620","v":0},{"$f":"Orçamento!V620","v":0},{"$f":"Orçamento!#REF!","v":{"$error":"#REF!"}}]
["","r.",{"$f":"Orçamento!P621","v":"VIDROS"},{"$f":"Orçamento!S621","v":0},{"$f":"Orçamento!V621","v":0},{"$f":"Orçamento!#REF!","v":{"$error":"#REF!"}}]
["","s.",{"$f":"Orçamento!P622","v":"REVESTIMENTO DE PAREDE"},{"$f":"Orçamento!S622","v":0},{"$f":"Orçamento!V622","v":0},{"$f":"Orçamento!#REF!","v":{"$error":"#REF!"}}]
["","t.",{"$f":"Orçamento!P623","v":"FORROS"},{"$f":"Orçamento!S623","v":0},{"$f":"Orçamento!V623","v":0},{"$f":"Orçamento!#REF!","v":{"$error":"#REF!"}}]
["","u.",{"$f":"Orçamento!P624","v":"REVESTIMENTO DE PISO"},{"$f":"Orçamento!S624","v":0},{"$f":"Orçamento!V624","v":0},{"$f":"Orçamento!#REF!","v":{"$error":"#REF!"}}]
["","v.",{"$f":"Orçamento!P625","v":"FERRAGENS"},{"$f":"Orçamento!S625","v":0},{"$f":"Orçamento!V625","v":0},{"$f":"Orçamento!#REF!","v":{"$error":"#REF!"}}]
["","w.",{"$f":"Orçamento!P626","v":"MARCENARIA"},{"$f":"Orçamento!S626","v":0},{"$f":"Orçamento!V626","v":0},{"$f":"Orçamento!#REF!","v":{"$error":"#REF!"}}]
["","x.",{"$f":"Orçamento!P627","v":"ADMINISTRAÇÃO"},{"$f":"Orçamento!S627","v":0},{"$f":"Orçamento!V627","v":0},{"$f":"Orçamento!#REF!","v":{"$error":"#REF!"}}]
["","y.",{"$f":"Orçamento!P628","v":"PINTURA"},{"$f":"Orçamento!S628","v":0},{"$f":"Orçamento!V628","v":0},{"$f":"Orçamento!#REF!","v":{"$error":"#REF!"}}]
["","z.",{"$f":"Orçamento!P629","v":"DIVERSOS"},{"$f":"Orçamento!S629","v":0},{"$f":"Orçamento!V629","v":0},{"$f":"Orçamento!#REF!","v":{"$error":"#REF!"}}]
["F","TOTAL GERAL DO ORÇAMENTO",null,{"$f":"SUM(D17:D42)","v":0},{"$f":"SUM(E17:E42)","v":0},{"$f":"SUM(F17:F42)","v":{"$error":"#REF!"}}]
[]
[null,"(*) Para itens da AGETOP, os vidros não estão inclusos nas esquadrias e já foram considerados os custos de contramarco para as esquadrias de alumínio;"]

{"sheet":"Cronog_120_Dias","index":3,"n_rows":99,"n_cols":22,"rows_kept":99,"cut":false,"hidden":false,"merged":[[2,1,2,7],[5,1,5,7],[6,1,6,7],[8,1,8,7],[9,1,9,7],[4,1,4,21],[7,1,7,21],[0,1,0,21],[1,1,1,21],[2,8,2,21],[12,0,13,0],[9,0,11,0],[11,1,11,21],[92,1,92,2],[92,5,92,8],[92,17,92,20],[93,1,93,2],[93,5,93,8],[93,17,93,20],[74,17,74,20],[74,5,74,8],[68,17,68,20],[70,5,70,8],[70,17,70,20],[59,5,59,8],[71,1,73,2],[71,4,73,4],[71,5,71,8],[71,17,71,20],[73,5,73,8],[73,17,73,20],[59,17,59,20],[61,5,61,8],[61,17,61,20],[94,1,94,2],[94,5,94,8],[94,17,94,20],[76,5,76,8],[76,17,76,20],[77,5,77,8],[77,17,77,20],[79,5,79,8],[79,17,79,20],[80,5,80,8],[80,17,80,20],[82,5,82,8],[82,17,82,20],[77,3,79,3],[80,3,82,3],[86,1,88,2],[80,4,82,4],[83,9,83,12],[83,13,83,16],[85,9,85,12],[85,13,85,16],[86,9,86,12],[86,13,86,16],[88,9,88,12],[95,1,95,2],[95,5,95,8],[95,17,95,20],[97,1,97,4],[98,1,98,21],[86,17,86,20],[88,5,88,8],[88,17,88,20],[85,5,85,8],[85,17,85,20],[89,1,91,2],[89,4,91,4],[89,5,89,8],[89,17,89,20],[91,5,91,8],[91,17,91,20],[89,3,91,3],[86,4,88,4],[86,5,86,8],[86,3,88,3],[83,1,85,2],[83,4,85,4],[83,5,83,8],[83,17,83,20],[68,5,68,8],[65,5,65,8],[65,17,65,20],[67,5,67,8],[67,17,67,20],[65,3,67,3],[62,17,62,20],[64,5,64,8],[64,17,64,20],[62,5,62,8],[53,17,53,20],[55,5,55,8],[55,17,55,20],[50,5,50,8],[50,17,50,20],[52,5,52,8],[52,17,52,20],[56,17,56,20],[58,5,58,8],[58,17,58,20],[53,5,53,8],[56,5,56,8],[50,9,50,12],[52,9,52,12],[53,9,53,12],[55,9,55,12],[56,9,56,12],[58,9,58,12],[52,13,52,16],[53,13,53,16],[55,13,55,16],[56,13,56,16],[58,13,58,16],[44,17,44,20],[46,5,46,8],[46,17,46,20],[47,1,49,2],[47,4,49,4],[47,5,47,8],[47,17,47,20],[49,5,49,8],[49,17,49,20],[44,5,44,8],[47,3,49,3],[44,9,44,12],[46,9,46,12],[47,9,47,12],[49,9,49,12],[35,17,35,20],[37,5,37,8],[37,17,37,20],[35,3,37,3],[40,17,40,20],[38,3,40,3],[38,17,38,20],[41,1,43,2],[41,4,43,4],[41,5,41,8],[41,17,41,20],[43,5,43,8],[43,17,43,20],[41,3,43,3],[35,5,35,8],[38,5,38,8],[40,5,40,8],[35,9,35,12],[37,9,37,12],[38,9,38,12],[40,9,40,12],[41,9,41,12],[43,9,43,12],[37,13,37,16],[29,17,29,20],[31,5,31,8],[31,17,31,20],[32,1,34,2],[32,4,34,4],[32,5,32,8],[32,17,32,20],[34,5,34,8],[34,17,34,20],[32,3,34,3],[29,5,29,8],[29,1,31,2],[29,4,31,4],[29,9,29,12],[31,9,31,12],[32,9,32,12],[34,9,34,12],[29,13,29,16],[31,13,31,16],[32,13,32,16],[34,13,34,16],[26,1,28,2],[26,4,28,4],[26,5,26,8],[26,17,26,20],[28,5,28,8],[28,17,28,20],[23,3,25,3],[23,1,25,2],[23,4,25,4],[23,5,23,8],[26,3,28,3],[26,9,26,12],[28,9,28,12],[26,13,26,16],[28,13,28,16],[14,3,16,3],[17,3,19,3],[14,4,16,4],[14,5,14,8],[14,17,14,20],[16,5,16,8],[16,17,16,20],[23,17,23,20],[25,5,25,8],[25,17,25,20],[17,17,17,20],[19,5,19,8],[19,17,19,20],[25,9,25,12],[25,13,25,16],[20,1,22,2],[20,4,22,4],[20,5,20,8],[20,17,20,20],[22,5,22,8],[22,17,22,20],[20,3,22,3],[83,3,85,3],[53,4,55,4],[59,1,61,2],[59,4,61,4],[74,1,76,2],[77,1,79,2],[77,4,79,4],[80,1,82,2],[65,1,67,2],[68,3,70,3],[62,3,64,3],[68,1,70,2],[56,3,58,3],[65,4,67,4],[71,3,73,3],[74,3,76,3],[74,4,76,4],[56,1,58,2],[68,4,70,4],[44,3,46,3],[62,1,64,2],[62,4,64,4],[38,1,40,2],[38,4,40,4],[59,3,61,3],[44,1,46,2],[44,4,46,4],[53,1,55,2],[50,1,52,2],[50,4,52,4],[10,1,10,21],[9,8,9,21],[8,8,8,21],[3,8,3,21],[6,8,6,21],[5,8,5,21],[3,1,3,7],[56,4,58,4],[29,3,31,3],[35,1,37,2],[35,4,37,4],[50,3,52,3],[53,3,55,3],[12,21,13,21],[13,1,13,2],[13,5,13,8],[13,17,13,20],[12,3,13,3],[12,17,12,20],[14,1,16,2],[12,5,12,8],[17,1,19,2],[17,4,19,4],[17,5,17,8],[61,9,61,12],[62,9,62,12],[64,9,64,12],[65,9,65,12],[67,9,67,12],[68,9,68,12],[70,9,70,12],[71,9,71,12],[12,9,12,12],[13,9,13,12],[14,9,14,12],[16,9,16,12],[17,9,17,12],[19,9,19,12],[20,9,20,12],[22,9,22,12],[23,9,23,12],[35,13,35,16],[59,9,59,12],[12,13,12,16],[13,13,13,16],[14,13,14,16],[16,13,16,16],[17,13,17,16],[19,13,19,16],[20,13,20,16],[22,13,22,16],[23,13,23,16],[38,13,38,16],[40,13,40,16],[41,13,41,16],[43,13,43,16],[44,13,44,16],[46,13,46,16],[47,13,47,16],[49,13,49,16],[50,13,50,16],[59,13,59,16],[61,13,61,16],[62,13,62,16],[64,13,64,16],[65,13,65,16],[67,13,67,16],[68,13,68,16],[70,13,70,16],[71,13,71,16],[73,13,73,16],[74,13,74,16],[76,13,76,16],[77,13,77,16],[79,13,79,16],[80,13,80,16],[82,9,82,12],[82,13,82,16],[73,9,73,12],[74,9,74,12],[76,9,76,12],[77,9,77,12],[79,9,79,12],[80,9,80,12],[88,13,88,16],[89,9,89,12],[89,13,89,16],[91,9,91,12],[91,13,91,16],[92,9,92,12],[93,9,93,12],[94,9,94,12],[95,9,95,12],[92,13,92,16],[93,13,93,16],[94,13,94,16],[95,13,95,16]]}
[]
[]
[null,"UNIDADE ESCOLAR",null,null,null,null,null,null,"PRAZO"]
[null,{"$f":"Orçamento!$O$4","v":"CENTRO DE ENSINO EM PERÍODO INTEGRAL JOÃO XXIII"},null,null,null,null,null,null,"120 DIAS CORRIDOS"]
[]
[null,"OBRA",null,null,null,null,null,null,"DATA"]
[null,{"$f":"Orçamento!$O$7","v":"REFORMA E AMPLIAÇÃO"},null,null,null,null,null,null,{"$f":"Orçamento!$S$7","v":"2020-02-18"}]
[]
[null,"LOCAL",null,null,null,null,null,null,"ÁREA TOTAL CONSTRUÍDA (M²)"]
["FILTRO",{"$f":"Orçamento!$V$7","v":"CERES"},null,null,null,null,null,null,{"$f":"Orçamento!$S$13","v":3970.79}]
[]
[null,"CRONOGRAMA - FÍSICO FINANCEIRO"]
["↓","CUSTO TOTAL:",{"$f":"D93","v":0},"VALOR","Dias:",30,null,null,null,60,null,null,null,90,null,null,null,120,null,null,null,"TOTAL"]
[null,"DESCRIÇÃO DOS SERVIÇOS",null,null,"%","1ª PARCELA",null,null,null,"2ª PARCELA",null,null,null,"3ª PARCELA",null,null,null,"4ª PARCELA"]
[{"$f":"IF(D15>0,\"F\",\"\")","v":""},"SERVIÇOS PRELIMINARES",null,{"$f":"Orçamento!V604","v":0},{"$f":"Orçamento!#REF!","v":{"$error":"#REF!"}},{"$f":"ROUND(F17*$D$15,2)","v":0},null,null,null,{"$f":"ROUND(J17*$D$15,2)","v":0},null,null,null,{"$f":"ROUND(N17*$D$15,2)","v":0},null,null,null,{"$f":"ROUND(R17*$D$15,2)","v":0},null,null,null,{"$f":"SUM(F15:U15)","v":0}]
[{"$f":"IF(A15=\"F\",A15,\"\")","v":""}]
[{"$f":"IF(A16=\"F\",A16,\"\")","v":""},null,null,null,null,1,null,null,null,null,null,null,null,null,null,null,null,{"$f":"1-(F17+J17+N17)","v":0},null,null,null,{"$f":"IFERROR(E15/100,\"\")","v":""}]
[{"$f":"IF(D18>0,\"F\",\"\")","v":""},"TRANSPORTES",null,{"$f":"Orçamento!V605","v":0},{"$f":"Orçamento!#REF!","v":{"$error":"#REF!"}},{"$f":"ROUND(F20*$D$18,2)","v":0},null,null,null,{"$f":"ROUND(J20*$D$18,2)","v":0},null,null,null,{"$f":"ROUND(N20*$D$18,2)","v":0},null,null,null,{"$f":"ROUND(R20*$D$18,2)","v":0},null,null,null,{"$f":"SUM(F18:U18)","v":0}]
[{"$f":"IF(A18=\"F\",A18,\"\")","v":""}]
[{"$f":"IF(A19=\"F\",A19,\"\")","v":""},null,null,null,null,0.35,null,null,null,0.35,null,null,null,null,null,null,null,{"$f":"1-(F20+J20+N20)","v":0.30000000000000004},null,null,null,{"$f":"IFERROR(E18/100,\"\")","v":""}]
[{"$f":"IF(D21>0,\"F\",\"\")","v":""},"SERVIÇO EM TERRA",null,{"$f":"Orçamento!V606","v":0},{"$f":"Orçamento!#REF!","v":{"$error":"#REF!"}},{"$f":"ROUND(F23*$D$21,2)","v":0},null,null,null,{"$f":"ROUND(J23*$D$21,2)","v":0},null,null,null,{"$f":"ROUND(N23*$D$21,2)","v":0},null,null,null,{"$f":"ROUND(R23*$D$21,2)","v":0},null,null,null,{"$f":"SUM(F21:U21)","v":0}]
[{"$f":"IF(A21=\"F\",A21,\"\")","v":""}]
[{"$f":"IF(A22=\"F\",A22,\"\")","v":""},null,null,null,null,0.8,null,null,null,0.2,null,null,null,null,null,null,null,{"$f":"1-(F23+J23+N23)","v":0},null,null,null,{"$f":"IFERROR(E21/100,\"\")","v":""}]
[{"$f":"IF(D24>0,\"F\",\"\")","v":""},"FUNDAÇÕES E SONDAGENS",null,{"$f":"Orçamento!V607","v":0},{"$f":"Orçamento!#REF!","v":{"$error":"#REF!"}},{"$f":"ROUND(F26*$D$24,2)","v":0},null,null,null,{"$f":"ROUND(J26*$D$24,2)","v":0},null,null,null,{"$f":"ROUND(N26*$D$24,2)","v":0},null,null,null,{"$f":"ROUND(R26*$D$24,2)","v":0},null,null,null,{"$f":"SUM(F24:U24)","v":0}]
[{"$f":"IF(A24=\"F\",A24,\"\")","v":""}]
[{"$f":"IF(A25=\"F\",A25,\"\")","v":""},null,null,null,null,0.7,null,null,null,0.3,null,null,null,null,null,null,null,{"$f":"1-(F26+J26+N26)","v":0},null,null,null,{"$f":"IFERROR(E24/100,\"\")","v":""}]
[{"$f":"IF(D27>0,\"F\",\"\")","v":""},"ESTRUTURA",null,{"$f":"Orçamento!V608","v":0},{"$f":"Orçamento!#REF!","v":{"$error":"#REF!"}},{"$f":"ROUND(F29*$D$27,2)","v":0},null,null,null,{"$f":"ROUND(J29*$D$27,2)","v":0},null,null,null,{"$f":"ROUND(N29*$D$27,2)","v":0},null,null,null,{"$f":"ROUND(R29*$D$27,2)","v":0},null,null,null,{"$f":"SUM(F27:U27)","v":0}]
[{"$f":"IF(A27=\"F\",A27,\"\")","v":""}]
[{"$f":"IF(A28=\"F\",A28,\"\")","v":""},null,null,null,null,null,null,null,null,1,null,null,null,null,null,null,null,{"$f":"1-(F29+J29+N29)","v":0},null,null,null,{"$f":"IFERROR(E27/100,\"\")","v":""}]
[{"$f":"IF(D30>0,\"F\",\"\")","v":""},"INST.ELET/TELEFÔNICA/CABEAMENTO ESTRUTURADO",null,{"$f":"Orçamento!V609","v":0},{"$f":"Orçamento!#REF!","v":{"$error":"#REF!"}},{"$f":"ROUND(F32*$D$30,2)","v":0},null,null,null,{"$f":"ROUND(J32*$D$30,2)","v":0},null,null,null,{"$f":"ROUND(N32*$D$30,2)","v":0},null,null,null,{"$f":"ROUND(R32*$D$30,2)","v":0},null,null,null,{"$f":"SUM(F30:U30)","v":0}]
[{"$f":"IF(A30=\"F\",A30,\"\")","v":""}]
[{"$f":"IF(A31=\"F\",A31,\"\")","v":""},null,null,null,null,0.15,null,null,null,0.35,null,null,null,0.35,null,null,null,{"$f":"1-(F32+J32+N32)","v":0.15000000000000002},null,null,null,{"$f":"IFERROR(E30/100,\"\")","v":""}]
[{"$f":"IF(D33>0,\"F\",\"\")","v":""},"INSTALAÇÕES HIDROSSANITÁRIAS",null,{"$f":"Orçamento!V610","v":0},{"$f":"Orçamento!#REF!","v":{"$error":"#REF!"}},{"$f":"ROUND(F35*$D$33,2)","v":0},null,null,null,{"$f":"ROUND(J35*$D$33,2)","v":0},null,null,null,{"$f":"ROUND(N35*$D$33,2)","v":0},null,null,null,{"$f":"ROUND(R35*$D$33,2)","v":0},null,null,null,{"$f":"SUM(F33:U33)","v":0}]
[{"$f":"IF(A33=\"F\",A33,\"\")","v":""}]
[{"$f":"IF(A34=\"F\",A34,\"\")","v":""},null,null,null,null,null,null,null,null,0.2,null,null,null,0.8,null,null,null,{"$f":"1-(F35+J35+N35)","v":0},null,null,null,{"$f":"IFERROR(E33/100,\"\")","v":""}]
[{"$f":"IF(D36>0,\"F\",\"\")","v":""},"INSTALAÇÕES ESPECIAIS",null,{"$f":"Orçamento!V611","v":0},{"$f":"Orçamento!#REF!","v":{"$error":"#REF!"}},{"$f":"ROUND(F38*$D$36,2)","v":0},null,null,null,{"$f":"ROUND(J38*$D$36,2)","v":0},null,null,null,{"$f":"ROUND(N38*$D$36,2)","v":0},null,null,null,{"$f":"ROUND(R38*$D$36,2)","v":0},null,null,null,{"$f":"SUM(F36:U36)","v":0}]
[{"$f":"IF(A36=\"F\",A36,\"\")","v":""}]
[{"$f":"IF(A37=\"F\",A37,\"\")","v":""},null,null,null,null,null,null,null,null,1,null,null,null,null,null,null,null,{"$f":"1-(F38+J38+N38)","v":0},null,null,null,{"$f":"IFERROR(E36/100,\"\")","v":""}]
[{"$f":"IF(D39>0,\"F\",\"\")","v":""},"ALVENARIA E DIVISÓRIAS",null,{"$f":"Orçamento!V612","v":0},{"$f":"Orçamento!#REF!","v":{"$error":"#REF!"}},{"$f":"ROUND(F41*$D$39,2)","v":0},null,null,null,{"$f":"ROUND(J41*$D$39,2)","v":0},null,null,null,{"$f":"ROUND(N41*$D$39,2)","v":0},null,null,null,{"$f":"ROUND(R41*$D$39,2)","v":0},null,null,null,{"$f":"SUM(F39:U39)","v":0}]
[{"$f":"IF(A39=\"F\",A39,\"\")","v":""}]
[{"$f":"IF(A40=\"F\",A40,\"\")","v":""},null,null,null,null,null,null,null,null,0.7,null,null,null,0.3,null,null,null,{"$f":"1-(F41+J41+N41)","v":0},null,null,null,{"$f":"IFERROR(E39/100,\"\")","v":""}]
[{"$f":"IF(D42>0,\"F\",\"\")","v":""},"ALVENARIA AUTO-PORTANTE",null,{"$f":"Orçamento!V613","v":0},{"$f":"Orçamento!#REF!","v":{"$error":"#REF!"}},{"$f":"ROUND(F44*$D$42,2)","v":0},null,null,null,{"$f":"ROUND(J44*$D$42,2)","v":0},null,null,null,{"$f":"ROUND(N44*$D$42,2)","v":0},null,null,null,{"$f":"ROUND(R44*$D$42,2)","v":0},null,null,null,{"$f":"SUM(F42:U42)","v":0}]
[{"$f":"IF(A42=\"F\",A42,\"\")","v":""}]
[{"$f":"IF(A43=\"F\",A43,\"\")","v":""},null,null,null,null,null,null,null,null,null,null,null,null,null,null,null,null,{"$f":"1-(F44+J44+N44)","v":1},null,null,null,{"$f":"IFERROR(E42/100,\"\")","v":""}]
[{"$f":"IF(D45>0,\"F\",\"\")","v":""},"IMPERMEABILIZAÇÃO",null,{"$f":"Orçamento!V614","v":0},{"$f":"Orçamento!#REF!","v":{"$error":"#REF!"}},{"$f":"ROUND(F47*$D$45,2)","v":0},null,null,null,{"$f":"ROUND(J47*$D$45,2)","v":0},null,null,null,{"$f":"ROUND(N47*$D$45,2)","v":0},null,null,null,{"$f":"ROUND(R47*$D$45,2)","v":0},null,null,null,{"$f":"SUM(F45:U45)","v":0}]
[{"$f":"IF(A45=\"F\",A45,\"\")","v":""}]
[{"$f":"IF(A46=\"F\",A46,\"\")","v":""},null,null,null,null,1,null,null,null,null,null,null,null,null,null,null,null,{"$f":"1-(F47+J47+N47)","v":0},null,null,null,{"$f":"IFERROR(E45/100,\"\")","v":""}]
[{"$f":"IF(D48>0,\"F\",\"\")","v":""},"ISOLAMENTO TÉRMICO E ACÚSTICO",null,{"$f":"Orçamento!V615","v":0},{"$f":"Orçamento!#REF!","v":{"$error":"#REF!"}},{"$f":"ROUND(F50*$D$48,2)","v":0},null,null,null,0,null,null,null,0,null,null,null,{"$f":"ROUND(R50*$D$48,2)","v":0},null,null,null,{"$f":"SUM(F48:U48)","v":0}]
[{"$f":"IF(A48=\"F\",A48,\"\")","v":""}]
[{"$f":"IF(A49=\"F\",A49,\"\")","v":""},null,null,null,null,null,null,null,null,0,null,null,null,0,null,null,null,{"$f":"1-(F50+J50+N50)","v":1},null,null,null,{"$f":"IFERROR(E48/100,\"\")","v":""}]
[{"$f":"IF(D51>0,\"F\",\"\")","v":""},"ESTRUTURA DE MADEIRA",null,{"$f":"Orçamento!V616","v":0},{"$f":"Orçamento!#REF!","v":{"$error":"#REF!"}},{"$f":"ROUND(F53*$D$51,2)","v":0},null,null,null,{"$f":"ROUND(J53*$D$51,2)","v":0},null,null,null,{"$f":"ROUND(N53*$D$51,2)","v":0},null,null,null,{"$f":"ROUND(R53*$D$51,2)","v":0},null,null,null,{"$f":"SUM(F51:U51)","v":0}]
[{"$f":"IF(A51=\"F\",A51,\"\")","v":""}]
[{"$f":"IF(A52=\"F\",A52,\"\")","v":""},null,null,null,null,null,null,null,null,null,null,null,null,null,null,null,null,{"$f":"1-(F53+J53+N53)","v":1},null,null,null,{"$f":"IFERROR(E51/100,\"\")","v":""}]
[{"$f":"IF(D54>0,\"F\",\"\")","v":""},"ESTRUTURA METÁLICA",null,{"$f":"Orçamento!V617","v":0},{"$f":"Orçamento!#REF!","v":{"$error":"#REF!"}},{"$f":"ROUND(F56*$D$54,2)","v":0},null,null,null,{"$f":"ROUND(J56*$D$54,2)","v":0},null,null,null,{"$f":"ROUND(N56*$D$54,2)","v":0},null,null,null,{"$f":"ROUND(R56*$D$54,2)","v":0},null,null,null,{"$f":"SUM(F54:U54)","v":0}]
[{"$f":"IF(A54=\"F\",A54,\"\")","v":""}]
[{"$f":"IF(A55=\"F\",A55,\"\")","v":""},null,null,null,null,null,null,null,null,0.2,null,null,null,0.8,null,null,null,{"$f":"1-(F56+J56+N56)","v":0},null,null,null,{"$f":"IFERROR(E54/100,\"\")","v":""}]
[{"$f":"IF(D57>0,\"F\",\"\")","v":""},"COBERTURAS",null,{"$f":"Orçamento!V618","v":0},{"$f":"Orçamento!#REF!","v":{"$error":"#REF!"}},{"$f":"ROUND(F59*$D$57,2)","v":0},null,null,null,{"$f":"ROUND(J59*$D$57,2)","v":0},null,null,null,{"$f":"ROUND(N59*$D$57,2)","v":0},null,null,null,{"$f":"ROUND(R59*$D$57,2)","v":0},null,null,null,{"$f":"SUM(F57:U57)","v":0}]
[{"$f":"IF(A57=\"F\",A57,\"\")","v":""}]
[{"$f":"IF(A58=\"F\",A58,\"\")","v":""},null,null,null,null,0,null,null,null,null,null,null,null,0.7,null,null,null,{"$f":"1-(F59+J59+N59)","v":0.30000000000000004},null,null,null,{"$f":"IFERROR(E57/100,\"\")","v":""}]
[{"$f":"IF(D60>0,\"F\",\"\")","v":""},"ESQUADRIAS DE MADEIRA",null,{"$f":"Orçamento!V619","v":0},{"$f":"Orçamento!#REF!","v":{"$error":"#REF!"}},{"$f":"ROUND(F62*$D$60,2)","v":0},null,null,null,{"$f":"ROUND(J62*$D$60,2)","v":0},null,null,null,{"$f":"ROUND(N62*$D$60,2)","v":0},null,null,null,{"$f":"ROUND(R62*$D$60,2)","v":0},null,null,null,{"$f":"SUM(F60:U60)","v":0}]
[{"$f":"IF(A60=\"F\",A60,\"\")","v":""}]
[{"$f":"IF(A61=\"F\",A61,\"\")","v":""},null,null,null,null,null,null,null,null,null,null,null,null,null,null,null,null,{"$f":"1-(F62+J62+N62)","v":1},null,null,null,{"$f":"IFERROR(E60/100,\"\")","v":""}]
[{"$f":"IF(D63>0,\"F\",\"\")","v":""},"ESQUADRIAS METÁLICAS",null,{"$f":"Orçamento!V620","v":0},{"$f":"Orçamento!#REF!","v":{"$error":"#REF!"}},{"$f":"ROUND(F65*$D$63,2)","v":0},null,null,null,{"$f":"ROUND(J65*$D$63,2)","v":0},null,null,null,{"$f":"ROUND(N65*$D$63,2)","v":0},null,null,null,{"$f":"ROUND(R65*$D$63,2)","v":0},null,null,null,{"$f":"SUM(F63:U63)","v":0}]
[{"$f":"IF(A63=\"F\",A63,\"\")","v":""}]
[{"$f":"IF(A64=\"F\",A64,\"\")","v":""},null,null,null,null,null,null,null,null,null,null,null,null,null,null,null,null,{"$f":"1-(F65+J65+N65)","v":1},null,null,null,{"$f":"IFERROR(E63/100,\"\")","v":""}]
[{"$f":"IF(D66>0,\"F\",\"\")","v":""},"VIDROS",null,{"$f":"Orçamento!V621","v":0},{"$f":"Orçamento!#REF!","v":{"$error":"#REF!"}},{"$f":"ROUND(F68*$D$66,2)","v":0},null,null,null,{"$f":"ROUND(J68*$D$66,2)","v":0},null,null,null,{"$f":"ROUND(N68*$D$66,2)","v":0},null,null,null,{"$f":"ROUND(R68*$D$66,2)","v":0},null,null,null,{"$f":"SUM(F66:U66)","v":0}]
[{"$f":"IF(A66=\"F\",A66,\"\")","v":""}]
[{"$f":"IF(A67=\"F\",A67,\"\")","v":""},null,null,null,null,0,null,null,null,null,null,null,null,null,null,null,null,{"$f":"1-(F68+J68+N68)","v":1},null,null,null,{"$f":"IFERROR(E66/100,\"\")","v":""}]
[{"$f":"IF(D69>0,\"F\",\"\")","v":""},"REVESTIMENTO DE PAREDE",null,{"$f":"Orçamento!V622","v":0},{"$f":"Orçamento!#REF!","v":{"$error":"#REF!"}},{"$f":"ROUND(F71*$D$69,2)","v":0},null,null,null,{"$f":"ROUND(J71*$D$69,2)","v":0},null,null,null,{"$f":"ROUND(N71*$D$69,2)","v":0},null,null,null,{"$f":"ROUND(R71*$D$69,2)","v":0},null,null,null,{"$f":"SUM(F69:U69)","v":0}]
[{"$f":"IF(A69=\"F\",A69,\"\")","v":""}]
[{"$f":"IF(A70=\"F\",A70,\"\")","v":""},null,null,null,null,null,null,null,null,0.2,null,null,null,0.8,null,null,null,{"$f":"1-(F71+J71+N71)","v":0},null,null,null,{"$f":"IFERROR(E69/100,\"\")","v":""}]
[{"$f":"IF(D72>0,\"F\",\"\")","v":""},"FORROS",null,{"$f":"Orçamento!V623","v":0},{"$f":"Orçamento!#REF!","v":{"$error":"#REF!"}},{"$f":"ROUND(F74*$D$72,2)","v":0},null,null,null,{"$f":"ROUND(J74*$D$72,2)","v":0},null,null,null,{"$f":"ROUND(N74*$D$72,2)","v":0},null,null,null,{"$f":"ROUND(R74*$D$72,2)","v":0},null,null,null,{"$f":"SUM(F72:U72)","v":0}]
[{"$f":"IF(A72=\"F\",A72,\"\")","v":""}]
[{"$f":"IF(A73=\"F\",A73,\"\")","v":""},null,null,null,null,null,null,null,null,0,null,null,null,1,null,null,null,{"$f":"1-(F74+J74+N74)","v":0},null,null,null,{"$f":"IFERROR(E72/100,\"\")","v":""}]
[{"$f":"IF(D75>0,\"F\",\"\")","v":""},"REVESTIMENTO DE PISO",null,{"$f":"Orçamento!V624","v":0},{"$f":"Orçamento!#REF!","v":{"$error":"#REF!"}},{"$f":"ROUND(F77*$D$75,2)","v":0},null,null,null,{"$f":"ROUND(J77*$D$75,2)","v":0},null,null,null,{"$f":"ROUND(N77*$D$75,2)","v":0},null,null,null,{"$f":"ROUND(R77*$D$75,2)","v":0},null,null,null,{"$f":"SUM(F75:U75)","v":0}]
[{"$f":"IF(A75=\"F\",A75,\"\")","v":""}]
[{"$f":"IF(A76=\"F\",A76,\"\")","v":""},null,null,null,null,0.35,null,null,null,0.35,null,null,null,0.3,null,null,null,{"$f":"1-(F77+J77+N77)","v":0},null,null,null,{"$f":"IFERROR(E75/100,\"\")","v":""}]
[{"$f":"IF(D78>0,\"F\",\"\")","v":""},"FERRAGENS",null,{"$f":"Orçamento!V625","v":0},{"$f":"Orçamento!#REF!","v":{"$error":"#REF!"}},{"$f":"ROUND(F80*$D$78,2)","v":0},null,null,null,{"$f":"ROUND(J80*$D$78,2)","v":0},null,null,null,{"$f":"ROUND(N80*$D$78,2)","v":0},null,null,null,{"$f":"ROUND(R80*$D$78,2)","v":0},null,null,null,{"$f":"SUM(F78:U78)","v":0}]
[{"$f":"IF(A78=\"F\",A78,\"\")","v":""}]
[{"$f":"IF(A79=\"F\",A79,\"\")","v":""},null,null,null,null,0,null,null,null,null,null,null,null,null,null,null,null,{"$f":"1-(F80+J80+N80)","v":1},null,null,null,{"$f":"IFERROR(E78/100,\"\")","v":""}]
[{"$f":"IF(D81>0,\"F\",\"\")","v":""},"MARCENARIA",null,{"$f":"Orçamento!V626","v":0},{"$f":"Orçamento!#REF!","v":{"$error":"#REF!"}},{"$f":"ROUND(F83*$D$81,2)","v":0},null,null,null,{"$f":"ROUND(J83*$D$81,2)","v":0},null,null,null,{"$f":"ROUND(N83*$D$81,2)","v":0},null,null,null,{"$f":"ROUND(R83*$D$81,2)","v":0},null,null,null,{"$f":"SUM(F81:U81)","v":0}]
[{"$f":"IF(A81=\"F\",A81,\"\")","v":""}]
[{"$f":"IF(A82=\"F\",A82,\"\")","v":""},null,null,null,null,null,null,null,null,0,null,null,null,0,null,null,null,{"$f":"1-(F83+J83+N83)","v":1},null,null,null,{"$f":"IFERROR(E81/100,\"\")","v":""}]
[{"$f":"IF(D84>0,\"F\",\"\")","v":""},"ADMINISTRAÇÃO - MENSALISTAS",null,{"$f":"Orçamento!V627","v":0},{"$f":"Orçamento!#REF!","v":{"$error":"#REF!"}},{"$f":"ROUND(F86*$D$84,2)","v":0},null,null,null,{"$f":"ROUND(J86*$D$84,2)","v":0},null,null,null,{"$f":"ROUND(N86*$D$84,2)","v":0},null,null,null,{"$f":"ROUND(R86*$D$84,2)","v":0},null,null,null,{"$f":"SUM(F84:U84)","v":0}]
[{"$f":"IF(A84=\"F\",A84,\"\")","v":""}]
[{"$f":"IF(A85=\"F\",A85,\"\")","v":""},null,null,null,null,0.25,null,null,null,0.25,null,null,null,0.25,null,null,null,{"$f":"1-(F86+J86+N86)","v":0.25},null,null,null,{"$f":"IFERROR(E84/100,\"\")","v":""}]
[{"$f":"IF(D87>0,\"F\",\"\")","v":""},"PINTURA",null,{"$f":"Orçamento!V628","v":0},{"$f":"Orçamento!#REF!","v":{"$error":"#REF!"}},{"$f":"ROUND(F89*$D$87,2)","v":0},null,null,null,{"$f":"ROUND(J89*$D$87,2)","v":0},null,null,null,{"$f":"ROUND(N89*$D$87,2)","v":0},null,null,null,{"$f":"ROUND(R89*$D$87,2)","v":0},null,null,null,{"$f":"SUM(F87:U87)","v":0}]
[{"$f":"IF(A87=\"F\",A87,\"\")","v":""}]
[{"$f":"IF(A88=\"F\",A88,\"\")","v":""},null,null,null,null,0,null,null,null,0,null,null,null,0,null,null,null,{"$f":"1-(F89+J89+N89)","v":1},null,null,null,{"$f":"IFERROR(E87/100,\"\")","v":""}]
[{"$f":"IF(D90>0,\"F\",\"\")","v":""},"DIVERSOS",null,{"$f":"Orçamento!V629","v":0},{"$f":"Orçamento!#REF!","v":{"$error":"#REF!"}},{"$f":"ROUND(F92*$D$90,2)","v":0},null,null,null,{"$f":"ROUND(J92*$D$90,2)","v":0},null,null,null,{"$f":"ROUND(N92*$D$90,2)","v":0},null,null,null,{"$f":"ROUND(R92*$D$90,2)","v":0},null,null,null,{"$f":"SUM(F90:U90)","v":0}]
[{"$f":"IF(A90=\"F\",A90,\"\")","v":""}]
[{"$f":"IF(A91=\"F\",A91,\"\")","v":""},null,null,null,null,null,null,null,null,0,null,null,null,0,null,null,null,{"$f":"1-(F92+J92+N92)","v":1},null,null,null,{"$f":"IFERROR(E90/100,\"\")","v":""}]
["F","CUSTO DO ORÇAMENTO",null,{"$f":"SUM(D15:D92)","v":0},{"$f":"SUM(E15:E92)","v":{"$error":"#REF!"}},{"$f":"F15+F18+F21+F24+F27+F30+F33+F36+F39+F42+F45+F48+F51+F54+F57+F60+F63+F66+F69+F72+F75+F78+F81+F84+F87+F90","v":0},null,null,null,{"$f":"J15+J18+J21+J24+J27+J30+J33+J36+J39+J42+J45+J48+J51+J54+J57+J60+J63+J66+J69+J72+J75+J78+J81+J84+J87+J90","v":0},null,null,null,{"$f":"N15+N18+N21+N24+N27+N30+N33+N36+N39+N42+N45+N48+N51+N54+N57+N60+N63+N66+N69+N72+N75+N78+N81+N84+N87+N90","v":0},null,null,null,{"$f":"R15+R18+R21+R24+R27+R30+R33+R36+R39+R42+R45+R48+R51+R54+R57+R60+R63+R66+R69+R72+R75+R78+R81+R84+R87+R90","v":0},null,null,null,{"$f":"V15+V18+V21+V24+V27+V30+V33+V36+V39+V42+V45+V48+V51+V54+V57+V60+V63+V66+V69+V72+V75+V78+V81+V84+V87+V90","v":0}]
["F","PERCENTUAIS:",null,null,null,{"$f":"IFERROR(F93/D93,\"\")","v":""},null,null,null,{"$f":"IFERROR(J93/D93,\"\")","v":""},null,null,null,{"$f":"IFERROR(N93/D93,\"\")","v":""},null,null,null,{"$f":"IFERROR(R93/D93,\"\")","v":""},null,null,null,{"$f":"SUM(F94:U94)","v":0}]
["F","TOTAIS ACUMULADOS:",null,null,null,{"$f":"F93","v":0},null,null,null,{"$f":"F95+J93","v":0},null,null,null,{"$f":"N93+J95","v":0},null,null,null,{"$f":"N95+R93","v":0}]
["F","PERCENTUAIS  ACUMULADOS:",null,null,null,{"$f":"F94","v":""},null,null,null,{"$f":"J94+F96","v":{"$error":"#VALUE!"}},null,null,null,{"$f":"N94+J96","v":{"$error":"#VALUE!"}},null,null,null,{"$f":"IFERROR(N96+R94,\"\")","v":""}]
["F"]
["F","OBSERVAÇÕES:"]
["F","Os pagamentos somente poderão ser efetuados mediante medição e atesto pelos técnicos da Secretaria da Educação. "]

{"sheet":"Composição BDI","index":4,"n_rows":45,"n_cols":4,"rows_kept":45,"cut":false,"hidden":false,"merged":[[11,0,11,3],[12,0,12,3],[14,0,14,3],[15,0,15,3],[13,0,13,3],[0,0,0,3],[1,0,1,3],[4,0,4,3],[7,0,7,3],[10,0,10,3],[2,0,2,3],[3,0,3,3],[5,0,5,3],[6,0,6,3],[8,0,8,3],[9,0,9,3],[17,0,17,3],[16,0,16,3],[44,0,44,3],[42,0,42,3],[43,0,43,3],[18,0,18,3],[36,0,36,3],[39,0,39,3],[38,0,38,3],[40,0,40,3],[29,0,29,2],[32,0,32,3],[33,0,33,3],[34,0,34,3],[35,0,35,3]]}
[]
[]
["UNIDADE ESCOLAR"]
[{"$f":"Orçamento!$O$4","v":"CENTRO DE ENSINO EM PERÍODO INTEGRAL JOÃO XXIII"}]
[]
["OBRA"]
[{"$f":"Orçamento!$O$7","v":"REFORMA E AMPLIAÇÃO"}]
[]
["ENDEREÇO"]
[{"$f":"Orçamento!$R$10","v":"AV. GOIAS 543, CENTRO, CEP:76300-000"}]
[]
["CIDADE"]
[{"$f":"Orçamento!$V$7","v":"CERES"}]
[]
["CRE"]
[{"$f":"Orçamento!$O$10","v":"CERES"}]
[]
["DETALHAMENTO DA COMPOSIÇÃO DE BDI"]
["COMPOSIÇÃO BDI PARA OBRAS CIVIS"]
["DESCRIÇÃO","COEF.","TAXA % (a.m)","% no preço de venda"]
["1) COFINS",1,0.03,0.03]
["2) PIS",1,6.4999999999999997E-3,6.4999999999999997E-3]
["3) ISSQN",1,0.05,0.05]
["4) CPRB",1,4.4999999999999998E-2,4.4999999999999998E-2]
["5) Administração Central",1,0.03,0.03]
["6) Despesas Financeiras",1,5.5999999999999999E-3,5.5999999999999999E-3]
["7) Seguros + Garantias",1,1.1999999999999999E-3,1.1999999999999999E-3]
["8) Risco",1,9.7000000000000003E-3,9.7000000000000003E-3]
["9) Lucro",1,6.1600000000000002E-2,6.1600000000000002E-2]
["BDI - FINAL",null,null,0.27945601481174465]
[]
["Notas:"]
["(1) e (2) Alíquota definida por lei."]
["(3) Alíquota e base de cálculo definidas pela legislação municipal."]
["(4) Alíquota definida pelas leis 12.546/11, 12844/13 e 13.161/15 (CPRB – contribuição previdenciária sobre a receita bruta)."]
["(5) Valores definidos a partir dos limites no Acórdão nº 2.622/2013 - TCU – Plenário. Valores entre o 1º e 3º quartis."]
["(6) Valor calculado pela expressão matemática do acórdão 2.369/2011 – TCU – Plenário e disponibilizado pela AGETOP em dezembro de 2018. (Foi utilizado para o cálculo a média da Taxa SELIC no período de 11/2017 a 10/2018)"]
[]
["(7) Valores definidos pela AGETOP a partir dos limites no Acórdão nº 2.622/2013 - TCU – Plenário. Valores médios. \n\nObservação da AGETOP: (Seguros contra erros de execução, incêndio e explosão, danos da natureza (vendaval, destelhamento, alagamento, inundação, desmoronamento, geadas etc.), emprego de material defeituoso ou inadequado, roubo e/ou furto qualificado, quebra de equipamentos, desmoronamento de estrutura, nas modalidades de Obras Civis em Construção (OCC); Instalação e Montagem (IM); e Obras Civis em Construção e Instalação e Montagem (OCC/IM). Bem como coberturas adicionais para ampliação dessas coberturas básicas, como: cobertura de responsabilidade civil geral, cobertura de responsabilidade civil cruzada, cobertura de despesas extraordinárias, cobertura de tumultos, cobertura de desentulho do local, cobertura de riscos do fabricante, dentre outras, incluindo o seguro de vida em grupo regido pela convenção coletiva dos trabalhadores na indústria da construção civil). A partir de 24/02/2015 por intermédio da Portaria 449/2015 a Presidência da AGETOP, na pessoa do Senhor Jayme Eduardo Rincon, determinou a exclusão dos valores referentes aos Seguros de Risco de Engenharia e Responsabilidade Civil do Profissional na composição do cálculo do B.D.I.."]
["(8) Valores definidos a partir dos limites no Acórdão nº 2.622/2013 - TCU – Plenário. Valores entre 1º e 3° quartis."]
["(9) Valores definidos a partir dos limites definidos no Acórdão nº 2.622/2013 - TCU – Plenário. Valores adotados e praticados no mercado ( “ ex ante ” ) ou aqueles entre os 1º e 3º quartis."]
[]
["(*) A fórmula para estipulação da taxa de BDI estimado adotado é a mesma que foi aplicada para a obtenção das tabelas contidas no Acórdão n. 2.622/2013 – TCUPlenário"]
[]
["Obs.: Para obras com valores superiores a R$ 20.000.000,00 sugere-se recalcular o BDI, dimensionando as taxas de administração central e lucro para patamares inferiores ao estipulado acima."]

{"sheet":"Relatório CENTRAL","index":5,"n_rows":40,"n_cols":5,"rows_kept":40,"cut":false,"hidden":false,"merged":[[9,0,11,0],[0,1,0,4],[6,3,6,4],[9,3,9,4],[1,1,1,4],[2,1,2,2],[2,3,2,4],[3,1,3,2],[3,3,3,4],[4,1,4,4],[5,1,5,2],[5,3,5,4],[6,1,6,2],[7,1,7,4],[8,1,8,2],[8,3,8,4],[9,1,9,2],[10,1,10,4],[11,1,11,4],[39,1,39,2]]}
[]
[]
[null,"UNIDADE ESCOLAR",null,"CIDADE"]
[null,{"$f":"Orçamento!$O$4","v":"CENTRO DE ENSINO EM PERÍODO INTEGRAL JOÃO XXIII"},null,{"$f":"Orçamento!$V$7","v":"CERES"}]
[]
[null,"OBRA",null,"CRE"]
[null,{"$f":"Orçamento!$O$7","v":"REFORMA E AMPLIAÇÃO"},null,{"$f":"Orçamento!$O$10","v":"CERES"}]
[]
[null,"ENDEREÇO",null,"DATA"]
["FILTRO",{"$f":"Orçamento!$R$10","v":"AV. GOIAS 543, CENTRO, CEP:76300-000"},null,{"$f":"Orçamento!$S$7","v":"2020-02-18"}]
[]
[null,"RELATÓRIO CENTRAL"]
["↓","CÓDIGO","ETAPA","PREÇO  (R$) C/ BDI","PARTIC  ( % )"]
[{"$f":"IF(D14>0,\"F\",\"\")","v":""},{"$f":"Orçamento!O604","v":"a."},{"$f":"Orçamento!P604","v":"SERVIÇOS PRELIMINARES"},{"$f":"Orçamento!V604","v":0},{"$f":"Orçamento!#REF!","v":{"$error":"#REF!"}}]
[{"$f":"IF(D15>0,\"F\",\"\")","v":""},{"$f":"Orçamento!O605","v":"b."},{"$f":"Orçamento!P605","v":"TRANSPORTES"},{"$f":"Orçamento!V605","v":0},{"$f":"Orçamento!#REF!","v":{"$error":"#REF!"}}]
["",{"$f":"Orçamento!O606","v":"c."},{"$f":"Orçamento!P606","v":"SERVIÇO EM TERRA"},{"$f":"Orçamento!V606","v":0},{"$f":"Orçamento!#REF!","v":{"$error":"#REF!"}}]
["",{"$f":"Orçamento!O607","v":"d."},{"$f":"Orçamento!P607","v":"FUNDAÇÕES E SONDAGENS"},{"$f":"Orçamento!V607","v":0},{"$f":"Orçamento!#REF!","v":{"$error":"#REF!"}}]
["",{"$f":"Orçamento!O608","v":"e."},{"$f":"Orçamento!P608","v":"ESTRUTURA"},{"$f":"Orçamento!V608","v":0},{"$f":"Orçamento!#REF!","v":{"$error":"#REF!"}}]
["",{"$f":"Orçamento!O609","v":"f."},{"$f":"Orçamento!P609","v":"INSTALAÇÕES ELÉTRICAS"},{"$f":"Orçamento!V609","v":0},{"$f":"Orçamento!#REF!","v":{"$error":"#REF!"}}]
["",{"$f":"Orçamento!O610","v":"g."},{"$f":"Orçamento!P610","v":"INSTALAÇÕES HIDROSSANITÁRIAS"},{"$f":"Orçamento!V610","v":0},{"$f":"Orçamento!#REF!","v":{"$error":"#REF!"}}]
["",{"$f":"Orçamento!O611","v":"h"},{"$f":"Orçamento!P611","v":"INSTALAÇÕES ESPECIAIS"},{"$f":"Orçamento!V611","v":0},{"$f":"Orçamento!#REF!","v":{"$error":"#REF!"}}]
["",{"$f":"Orçamento!O612","v":"i."},{"$f":"Orçamento!P612","v":"ALVENARIAS E DIVISÓRIAS"},{"$f":"Orçamento!V612","v":0},{"$f":"Orçamento!#REF!","v":{"$error":"#REF!"}}]
["",{"$f":"Orçamento!O613","v":"j."},{"$f":"Orçamento!P613","v":"ALVENARIA AUTO-PORTANTE"},{"$f":"Orçamento!V613","v":0},{"$f":"Orçamento!#REF!","v":{"$error":"#REF!"}}]
["",{"$f":"Orçamento!O614","v":"k."},{"$f":"Orçamento!P614","v":"IMPERMEABILIZAÇÃO"},{"$f":"Orçamento!V614","v":0},{"$f":"Orçamento!#REF!","v":{"$error":"#REF!"}}]
["",{"$f":"Orçamento!O615","v":"l."},{"$f":"Orçamento!P615","v":"ISOLAMENTO TÉRMICO E ACÚSTICO"},{"$f":"Orçamento!V615","v":0},{"$f":"Orçamento!#REF!","v":{"$error":"#REF!"}}]
["",{"$f":"Orçamento!O616","v":"m."},{"$f":"Orçamento!P616","v":"ESTRUTURA DE MADEIRA"},{"$f":"Orçamento!V616","v":0},{"$f":"Orçamento!#REF!","v":{"$error":"#REF!"}}]
["",{"$f":"Orçamento!O617","v":"n."},{"$f":"Orçamento!P617","v":"ESTRUTURAS METÁLICAS"},{"$f":"Orçamento!V617","v":0},{"$f":"Orçamento!#REF!","v":{"$error":"#REF!"}}]
["",{"$f":"Orçamento!O618","v":"o."},{"$f":"Orçamento!P618","v":"COBERTURAS"},{"$f":"Orçamento!V618","v":0},{"$f":"Orçamento!#REF!","v":{"$error":"#REF!"}}]
["",{"$f":"Orçamento!O619","v":"p."},{"$f":"Orçamento!P619","v":"ESQUADRIAS DE MADEIRA"},{"$f":"Orçamento!V619","v":0},{"$f":"Orçamento!#REF!","v":{"$error":"#REF!"}}]
["",{"$f":"Orçamento!O620","v":"q."},{"$f":"Orçamento!P620","v":"ESQUADRIAS METÁLICAS"},{"$f":"Orçamento!V620","v":0},{"$f":"Orçamento!#REF!","v":{"$error":"#REF!"}}]
["",{"$f":"Orçamento!O621","v":"r."},{"$f":"Orçamento!P621","v":"VIDROS"},{"$f":"Orçamento!V621","v":0},{"$f":"Orçamento!#REF!","v":{"$error":"#REF!"}}]
["",{"$f":"Orçamento!O622","v":"s."},{"$f":"Orçamento!P622","v":"REVESTIMENTO DE PAREDE"},{"$f":"Orçamento!V622","v":0},{"$f":"Orçamento!#REF!","v":{"$error":"#REF!"}}]
["",{"$f":"Orçamento!O623","v":"t."},{"$f":"Orçamento!P623","v":"FORROS"},{"$f":"Orçamento!V623","v":0},{"$f":"Orçamento!#REF!","v":{"$error":"#REF!"}}]
["",{"$f":"Orçamento!O624","v":"u."},{"$f":"Orçamento!P624","v":"REVESTIMENTO DE PISO"},{"$f":"Orçamento!V624","v":0},{"$f":"Orçamento!#REF!","v":{"$error":"#REF!"}}]
["",{"$f":"Orçamento!O625","v":"v."},{"$f":"Orçamento!P625","v":"FERRAGENS"},{"$f":"Orçamento!V625","v":0},{"$f":"Orçamento!#REF!","v":{"$error":"#REF!"}}]
["",{"$f":"Orçamento!O626","v":"w."},{"$f":"Orçamento!P626","v":"MARCENARIA"},{"$f":"Orçamento!V626","v":0},{"$f":"Orçamento!#REF!","v":{"$error":"#REF!"}}]
["",{"$f":"Orçamento!O627","v":"x."},{"$f":"Orçamento!P627","v":"ADMINISTRAÇÃO"},{"$f":"Orçamento!V627","v":0},{"$f":"Orçamento!#REF!","v":{"$error":"#REF!"}}]
["",{"$f":"Orçamento!O628","v":"y."},{"$f":"Orçamento!P628","v":"PINTURA"},{"$f":"Orçamento!V628","v":0},{"$f":"Orçamento!#REF!","v":{"$error":"#REF!"}}]
["",{"$f":"Orçamento!O629","v":"z."},{"$f":"Orçamento!P629","v":"DIVERSOS"},{"$f":"Orçamento!V629","v":0},{"$f":"Orçamento!#REF!","v":{"$error":"#REF!"}}]
["F","TOTAL GERAL DO ORÇAMENTO (R$) C/BDI",null,{"$f":"SUM(D14:D39)","v":0},{"$f":"SUM(E14:E39)","v":{"$error":"#REF!"}}]

{"sheet":"Parc Maior Relev","index":6,"n_rows":34,"n_cols":8,"rows_kept":34,"cut":false,"hidden":false,"merged":[[0,1,0,6],[11,1,11,6],[1,1,1,6],[2,1,2,3],[2,4,2,6],[3,1,3,3],[3,4,3,6],[4,1,4,6],[5,1,5,3],[5,4,5,6],[9,1,9,3],[9,4,9,6],[10,1,10,6],[6,1,6,3],[6,4,6,6],[7,1,7,6],[10,0,12,0],[8,1,8,3],[8,4,8,6],[34,3,34,7],[32,1,32,6]]}
[]
[]
[null,"UNIDADE ESCOLAR",null,null,"CÓDIGO INEP"]
[null,{"$f":"Orçamento!$O$4","v":"CENTRO DE ENSINO EM PERÍODO INTEGRAL JOÃO XXIII"},null,null,{"$f":"Orçamento!$V$4","v":52015360}]
[]
[null,"OBRA",null,null,"CIDADE"]
[null,{"$f":"Orçamento!$O$7","v":"REFORMA E AMPLIAÇÃO"},null,null,{"$f":"Orçamento!$V$7","v":"CERES"}]
[]
[null,"CRE",null,null,"ÁREA TOTAL CONSTRUÍDA (M²)"]
[null,{"$f":"Orçamento!$O$10","v":"CERES"},null,null,{"$f":"Orçamento!$S$13","v":3970.79}]
["FILTRO"]
[null,"PARCELA DE MAIOR RELEVÂNCIA"]
[null,"CÓDIGO","SERVIÇO","DESCRIÇÃO","UNID","QUANT","PARC. MAIOR RELEV (100%)"]
[{"$f":"IF(F14>0,\"F\",\"\")","v":""},70000,"INSTALAÇÕES ELÉTRICAS","INSTALAÇÕES ELÉTRICAS","KVA",{"$f":"SUMIF(Orçamento!$R$20:$R$585,'Parc Maior Relev'!D14,Orçamento!$T$20:$T$585)","v":0},{"$f":"F14*0.5","v":0}]
[null,70000,"INSTALAÇÕES ELÉTRICAS","SUBESTAÇÃO","KVA",112.5,{"$f":"F15","v":112.5}]
[null,80000,"INSTALAÇÕES HIDROSSANITÁRIAS","RESERVATÓRIO","UNID",{"$f":"SUMIF(Orçamento!$R$20:$R$585,'Parc Maior Relev'!D16,Orçamento!$T$20:$T$585)","v":0},{"$f":"F16*0.5","v":0},1]
[]
[null,"CÓDIGO","SERVIÇO","DESCRIÇÃO","UNID","QUANT","PARC. MAIOR RELEV (50%)"]
[null,160000,"COBERTURAS","TELHA CERÂMICA","M2",267.83,{"$f":"F19*0.5","v":133.91499999999999}]
[null,160000,"COBERTURAS","TELHA FIBROCIMENTO","M2",157.68,78.84]
[null,160000,"COBERTURAS","TELHA METÁLICA","M2",{"$f":"SUMIF(Orçamento!$R$20:$R$585,'Parc Maior Relev'!D21,Orçamento!$T$20:$T$585)","v":0},0]
[null,200000,"REVESTIMENTO DE PAREDE","REBOCO","M2",{"$f":"SUMIF(Orçamento!$R$20:$R$585,'Parc Maior Relev'!D22,Orçamento!$T$20:$T$585)","v":0},{"$f":"F22*0.5","v":0}]
[null,200000,"REVESTIMENTO DE PAREDE","REVESTIMENTO CERÂMICO","M2",{"$f":"SUMIF(Orçamento!$R$20:$R$585,'Parc Maior Relev'!D23,Orçamento!$T$20:$T$585)","v":0},0]
[null,210000,"FORROS","FORRO DE GESSO","M2",{"$f":"SUMIF(Orçamento!$R$20:$R$585,'Parc Maior Relev'!D24,Orçamento!$T$20:$T$585)","v":0},{"$f":"F24*0.5","v":0}]
[null,210000,"FORROS","FORRO PVC","M2",{"$f":"SUMIF(Orçamento!$R$20:$R$585,'Parc Maior Relev'!D25,Orçamento!$T$20:$T$585)","v":0},0]
[null,210000,"FORROS","FORRO ACARTONADO","M2",{"$f":"SUMIF(Orçamento!$R$20:$R$585,'Parc Maior Relev'!D26,Orçamento!$T$20:$T$585)","v":0},0]
[null,220000,"REVESTIMENTO DE PISO","PISO GRANITINA","M2",688.53,344.26499999999999]
[null,220000,"REVESTIMENTO DE PISO","PISO LAMINADO","M2",{"$f":"SUMIF(Orçamento!$R$20:$R$585,'Parc Maior Relev'!D28,Orçamento!$T$20:$T$585)","v":0},0]
[null,220000,"REVESTIMENTO DE PISO","PISO CONCRETO DESEMPENADO","M2",{"$f":"SUMIF(Orçamento!$R$20:$R$585,'Parc Maior Relev'!D29,Orçamento!$T$20:$T$585)","v":0},0]
[null,220000,"REVESTIMENTO DE PISO","PISO CERÂMICO","M2",{"$f":"SUMIF(Orçamento!$R$20:$R$585,'Parc Maior Relev'!D30,Orçamento!$T$20:$T$585)","v":0},{"$f":"F30*0.5","v":0}]
[null,260000,"PINTURA","PINTURA","M2",{"$f":"SUMIF(Orçamento!$R$20:$R$585,'Parc Maior Relev'!D31,Orçamento!$T$20:$T$585)","v":0},0]
["F"]
["F","(*) Para os fins do inciso I dp § 1º do Art. 30 da Lei Federal 8.666/93, são consideradas parcelas de maior relevância técnica as execuções apresentadas"]
["F"]