{"text_format":"1","workbook":"xlsx","n_sheets":7,"sheets":["Orçamento","Resumo ","Somatório","Cronog_60_Dias","Composição BDI","Relatório CENTRAL","Parc Maior Relev"],"not_rendered":{"charts":0,"images":4,"macros":1,"external_links":0,"defined_names":102,"comments":2,"pivot_tables":0},"unopened":[],"bounds":{"document_bytes":16777216,"sheet_cells":100000,"rows_first":2000,"rows_last":500,"rows_between":2000,"halvings":0,"cell_chars":16384,"cell_head_chars":4096},"cells_cut":0,"cells_raw":0,"read":"whole","date_system":"1900"}

{"sheet":"Orçamento","index":0,"n_rows":486,"n_cols":27,"rows_kept":486,"cut":false,"hidden":false,"merged":[[10,24,10,25],[9,23,9,25],[467,18,467,22],[468,15,468,17],[468,18,468,22],[469,15,469,17],[469,18,469,22],[464,15,464,17],[464,18,464,22],[465,15,465,17],[465,18,465,22],[466,15,466,17],[466,18,466,22],[460,14,460,26],[461,18,461,22],[462,15,462,17],[462,18,462,22],[447,15,447,17],[427,15,427,17],[482,18,482,22],[470,15,470,17],[470,18,470,22],[471,15,471,17],[471,18,471,22],[472,15,472,17],[472,18,472,22],[476,15,476,17],[476,18,476,22],[477,15,477,17],[477,18,477,22],[478,15,478,17],[467,15,467,17],[473,15,473,17],[473,18,473,22],[474,15,474,17],[474,18,474,22],[475,15,475,17],[475,18,475,22],[479,23,479,25],[480,23,480,25],[481,23,481,25],[482,23,482,25],[483,23,483,25],[484,23,484,25],[485,23,485,25],[454,14,454,17],[461,15,461,17],[485,18,485,22],[482,14,482,17],[479,15,479,17],[479,18,479,22],[480,15,480,17],[480,18,480,22],[481,15,481,17],[481,18,481,22],[484,18,484,22],[483,18,483,22],[0,14,0,26],[418,16,418,24],[419,16,419,24],[420,16,420,24],[11,14,11,26],[14,14,14,26],[3,14,3,22],[4,14,4,22],[6,18,6,22],[7,18,7,22],[12,18,12,22],[13,18,13,22],[7,14,7,17],[6,14,6,17],[4,23,4,25],[3,23,3,25],[6,23,6,25],[7,23,7,25],[9,18,9,20],[410,17,415,17],[416,22,416,24],[410,22,410,24],[411,22,411,24],[412,22,412,24],[421,16,421,24],[427,23,427,25],[443,23,443,25],[444,23,444,25],[463,15,463,17],[463,18,463,22],[422,16,422,24],[440,15,440,17],[441,15,441,17],[426,14,426,26],[427,18,427,22],[428,18,428,22],[436,18,436,22],[437,18,437,22],[438,18,438,22],[439,18,439,22],[451,18,451,22],[448,15,448,17],[428,15,428,17],[429,15,429,17],[430,15,430,17],[431,15,431,17],[432,15,432,17],[433,15,433,17],[434,15,434,17],[435,15,435,17],[436,15,436,17],[445,23,445,25],[446,23,446,25],[444,15,444,17],[445,15,445,17],[446,15,446,17],[447,23,447,25],[442,15,442,17],[443,15,443,17],[441,23,441,25],[442,23,442,25],[440,23,440,25],[457,18,457,22],[433,18,433,22],[434,18,434,22],[432,18,432,22],[441,18,441,22],[423,18,423,24],[429,18,429,22],[430,18,430,22],[431,18,431,22],[454,18,454,22],[452,18,452,22],[453,18,453,22],[443,18,443,22],[450,18,450,22],[446,18,446,22],[448,18,448,22],[444,18,444,22],[445,18,445,22],[454,23,454,25],[448,23,448,25],[449,23,449,25],[450,23,450,25],[451,23,451,25],[452,23,452,25],[456,18,456,22],[1,14,1,24],[9,14,9,16],[10,14,10,16],[12,14,12,16],[13,14,13,16],[15,14,15,24],[2,14,2,24],[5,14,5,24],[8,14,8,24],[440,18,440,22],[437,15,437,17],[438,15,438,17],[439,15,439,17],[449,18,449,22],[447,18,447,22],[455,18,455,22],[442,18,442,22],[435,18,435,22],[449,15,449,17],[450,15,450,17],[452,15,452,17],[453,15,453,17],[455,23,455,25],[476,23,476,25],[477,23,477,25],[478,23,478,25],[461,23,461,25],[462,23,462,25],[463,23,463,25],[464,23,464,25],[465,23,465,25],[466,23,466,25],[467,23,467,25],[468,23,468,25],[469,23,469,25],[470,23,470,25],[471,23,471,25],[472,23,472,25],[473,23,473,25],[474,23,474,25],[475,23,475,25],[451,15,451,17],[456,23,456,25],[457,23,457,25],[478,18,478,22],[414,22,414,24],[415,22,415,24],[7,12,7,13],[6,12,6,13],[13,23,13,25],[12,23,12,25],[10,19,10,22],[453,23,453,25],[428,23,428,25],[429,23,429,25],[430,23,430,25],[431,23,431,25],[432,23,432,25],[433,23,433,25],[434,23,434,25],[435,23,435,25],[436,23,436,25],[437,23,437,25],[438,23,438,25],[439,23,439,25]]}
[]
[]
[]
[null,null,null,null,null,null,null,null,null,null,null,null,null,null,"UNIDADE ESCOLAR",null,null,null,null,null,null,null,null,"CÓDIGO INEP"]
[null,null,null,null,null,null,null,null,null,null,null,null,"",null,"CRE DE LUZIÂNIA"]
[]
["Nmax",null,null,null,null,null,null,null,null,null,null,null,null,null,"OBRA",null,null,null,"DATA",null,null,null,null,"CIDADE"]
[{"$f":"MAX($C$19:$C$410)","v":4},null,null,null,null,null,null,null,null,null,null,null,null,null,"AMPLIAÇÃO / REFORMA",null,null,null,"2020-06-08",null,null,null,null,"LUZIÂNIA"]
[]
[null,null,null,null,null,null,null,null,null,null,null,null,null,null,"CRE",null,null,"ENDEREÇO","REFERÊNCIA AGETOP",null,null,null,null,"REFERÊNCIA SINAPI"]
[null,null,null,null,null,null,null,null,null,null,null,null,null,null,"LUZIÂNIA",null,null,"RUA PADRE DOMINGOS - Nº13 - SETOR CENTRAL - CEP: 72.800-460","ABR/19","DESONERADA",null,null,null,"ABR/20","DESONERADA"]
[]
[null,null,null,null,null,null,null,null,null,null,null,null,null,null,"ÁREA EXISTENTE (M²)",null,null,"ÁREA A CONSTRUIR (M²)","ÁREA A DEMOLIR (M²)",null,null,null,null,"ÁREA TOTAL CONSTRUÍDA (M²)"]
[null,null,null,null,null,null,null,null,null,null,null,null,null,null,708.62,null,null,6.6,null,null,null,null,null,715.22]
[]
[null,null,null,null,null,null,null,null,null,null,null,"FILTRO",null,null,"PLANILHA ORÇAMENTÁRIA"]
["Nível E","Save Nivel","Nível C","Altura","n1","n2","n3","n4","n5","Czero","Cnível","↓","Nível","Nível Corrigido","ITEM","TABELA","CODIGO","DESCRIÇÃO DOS SERVIÇOS","UNID","QUANT","REPET","QUANT TOTAL","MAT","MO","T.SERVIÇO UNIT","VALOR TOTAL","OBSERVAÇÕES¹"]
[{"$f":"CHOOSE(1+LOG(1+2*(ORÇAMENTO.Nivel=\"Nível 1\")+4*(ORÇAMENTO.Nivel=\"Nível 2\")+8*(ORÇAMENTO.Nivel=\"Nível 3\")+16*(ORÇAMENTO.Nivel=\"Nível 4\")+32*(ORÇAMENTO.Nivel=\"Serviço\"),2),0,1,2,3,4,\"S\")","v":"S"},{"$f":"IF(OR(C18=\"s\",C18=0),OFFSET(B18,-1,0),C18)","v":"Save Nivel"},{"$f":"IF(OFFSET(C18,-1,0)=\"L\",1,IF(OFFSET(C18,-1,0)=1,2,IF(OR(A18=\"s\",A18=0),\"S\",IF(AND(OFFSET(C18,-1,0)=2,A18=4),3,IF(AND(OR(OFFSET(C18,-1,0)=\"s\",OFFSET(C18,-1,0)=0),A18<>\"s\",A18>OFFSET(B18,-1,0)),OFFSET(B18,-1,0),A18)))))","v":"S"},{"$f":"IF(OR(C18=\"S\",C18=0),0,IF(ISERROR(K18),J18,SMALL(J18:K18,1)))","v":0},{"$f":"IF($C18=1,OFFSET(E18,-1,0)+1,OFFSET(E18,-1,0))","v":"n1"},{"$f":"IF($C18=1,0,IF($C18=2,OFFSET(F18,-1,0)+1,OFFSET(F18,-1,0)))","v":"n2"},{"$f":"IF(AND($C18<=2,$C18<>0),0,IF($C18=3,OFFSET(G18,-1,0)+1,OFFSET(G18,-1,0)))","v":"n3"},{"$f":"IF(AND($C18<=3,$C18<>0),0,IF($C18=4,OFFSET(H18,-1,0)+1,OFFSET(H18,-1,0)))","v":"n4"},{"$f":"IF(AND($C18<=4,$C18<>0),0,IF(AND($C18=\"S\",$Y18>0),OFFSET(I18,-1,0)+1,OFFSET(I18,-1,0)))","v":"n5"},{"$f":"IF(OR($C18=\"S\",$C18=0),0,MATCH(0,OFFSET($D18,1,$C18,ROW($C$410)-ROW($C18)),0))","v":0},{"$f":"IF(OR($C18=\"S\",$C18=0),0,MATCH(OFFSET($D18,0,$C18)+1,OFFSET($D18,1,$C18,ROW($C$410)-ROW($C18)),0))","v":0},"","Serviço","Serviço","-","SINAPI",null,"(sem código)","-",null,"REPET","-",0,0,0,"-",""]
[0,null,"L",{"$f":"COUNTA(OFFSET(D19,1,0):D$410)","v":390},{"$f":"LEFT(O20,1)-1","v":0},null,null,null,null,null,null,"F","LOTE","LOTE","AMPLIAÇÃO / REFORMA - CRE DE LUZIÂNIA",null,null,null,null,null,null,null,null,null,null,0]
[{"$f":"CHOOSE(1+LOG(1+2*(ORÇAMENTO.Nivel=\"Nível 1\")+4*(ORÇAMENTO.Nivel=\"Nível 2\")+8*(ORÇAMENTO.Nivel=\"Nível 3\")+16*(ORÇAMENTO.Nivel=\"Nível 4\")+32*(ORÇAMENTO.Nivel=\"Serviço\"),2),0,1,2,3,4,\"S\")","v":1},{"$f":"IF(OR(C20=\"s\",C20=0),OFFSET(B20,-1,0),C20)","v":1},{"$f":"IF(OFFSET(C20,-1,0)=\"L\",1,IF(OFFSET(C20,-1,0)=1,2,IF(OR(A20=\"s\",A20=0),\"S\",IF(AND(OFFSET(C20,-1,0)=2,A20=4),3,IF(AND(OR(OFFSET(C20,-1,0)=\"s\",OFFSET(C20,-1,0)=0),A20<>\"s\",A20>OFFSET(B20,-1,0)),OFFSET(B20,-1,0),A20)))))","v":1},{"$f":"IF(OR(C20=\"S\",C20=0),0,IF(ISERROR(K20),J20,SMALL(J20:K20,1)))","v":12},{"$f":"IF($C20=1,OFFSET(E20,-1,0)+1,OFFSET(E20,-1,0))","v":1},{"$f":"IF($C20=1,0,IF($C20=2,OFFSET(F20,-1,0)+1,OFFSET(F20,-1,0)))","v":0},{"$f":"IF(AND($C20<=2,$C20<>0),0,IF($C20=3,OFFSET(G20,-1,0)+1,OFFSET(G20,-1,0)))","v":0},{"$f":"IF(AND($C20<=3,$C20<>0),0,IF($C20=4,OFFSET(H20,-1,0)+1,OFFSET(H20,-1,0)))","v":0},{"$f":"IF(AND($C20<=4,$C20<>0),0,IF(AND($C20=\"S\",$Y20>0),OFFSET(I20,-1,0)+1,OFFSET(I20,-1,0)))","v":0},{"$f":"IF(OR($C20=\"S\",$C20=0),0,MATCH(0,OFFSET($D20,1,$C20,ROW($C$410)-ROW($C20)),0))","v":390},{"$f":"IF(OR($C20=\"S\",$C20=0),0,MATCH(OFFSET($D20,0,$C20)+1,OFFSET($D20,1,$C20,ROW($C$410)-ROW($C20)),0))","v":12},"F","Nível 1","Nível 1","1.","AGETOP",null,"AMPLIAÇÃO / REFORMA","UN",1,1,1,null,null,0,0]
[2,2,2,2,1,1,0,0,0,11,2,"","Nível 2","Nível 2","-","AGETOP",null,"SERVIÇOS PRELIMINARES","-",null,1,"-",null,null,0,0]
["S",2,"S",0,1,1,0,0,0,0,0,"","Serviço","Serviço","-","AGETOP",21301,"PLACA DE OBRA PLOTADA EM CHAPA METÁLICA 26 , AFIXADA EM CAVALETES DE MADEIRA DE LEI (VIGOTAS 6X12CM) - PADRÃO GOINFRA","m2    ",7.5,1,7.5,null,null,0,0,""]
[2,2,2,3,1,2,0,0,0,9,3,"","Nível 2","Nível 2","-","SINAPI",null,"TRANSPORTES","-",null,1,"-",null,null,0,0,""]
["S",2,"S",0,1,2,0,0,0,0,0,"","Serviço","Serviço","-","SINAPI",72900,"TRANSPORTE DE ENTULHO COM CAMINHAO BASCULANTE 6 M3, RODOVIA PAVIMENTADA, DMT 0,5 A 1,0 KM","M3",49.6,1,49.6,null,null,0,0,""]
["S",2,"S",0,1,2,0,0,0,0,0,"","Serviço","Serviço","-","SINAPI",72897,"CARGA MANUAL DE ENTULHO EM CAMINHAO BASCULANTE 6 M3","M3",49.6,1,49.6,null,null,0,0,""]
[2,2,2,3,1,3,0,0,0,6,3,"","Nível 2","Nível 2","-","SINAPI",null,"ADMINISTRAÇÃO","-",null,1,"-",null,null,0,0,""]
["S",2,"S",0,1,3,0,0,0,0,0,"","Serviço","Serviço","-","SINAPI",90778,"ENGENHEIRO CIVIL DE OBRA PLENO COM ENCARGOS COMPLEMENTARES","H",30,1,30,null,null,0,0,"Referência: AGETOP - 250101"]
["S",2,"S",0,1,3,0,0,0,0,0,"","Serviço","Serviço","-","SINAPI",90776,"ENCARREGADO GERAL COM ENCARGOS COMPLEMENTARES","H",300,1,300,null,null,0,0,"Referência: AGETOP - 250103"]
[2,2,2,3,1,4,0,0,0,3,280,"","Nível 2","Nível 2","-",null,null,"DIVERSOS","-",null,1,"-",null,null,0,0,""]
["S",2,"S",0,1,4,0,0,0,0,0,"","Serviço","Serviço","-","AGETOP",270804,"PLACA DE INAUGURAÇÃO AÇO ESCOVADO 60 X 120 CM","un    ",1,1,1,null,null,0,0,""]
["S",2,"S",0,1,4,0,0,0,0,0,"","Serviço","Serviço","-","AGETOP",270501,"LIMPEZA FINAL DE OBRA - (OBRAS CIVIS)","m2    ",424.11,1,424.11,null,null,0,0,""]
[1,1,1,77,2,0,0,0,0,378,77,"F","Nível 1","Nível 1","2.","SINAPI",null,"PROJETO DE ESTRUTURA E FUNDAÇÕES","UN",1,1,1,null,null,0,0,""]
[2,2,2,44,2,1,0,0,0,76,44,"","Nível 2","Nível 2","-","SINAPI",null,"FUNDAÇÕES E SONDAGENS","-",null,1,"-",null,null,0,0,""]
[3,3,3,9,2,1,1,0,0,43,9,"","Nível 3","Nível 3","-","SINAPI",null,"ESTACAS","-",null,1,"-",null,null,0,0,""]
[4,4,4,4,2,1,1,1,0,8,4,"","Nível 4","Nível 4","-","SINAPI",null,"BANHEIROS PCD","-",null,1,"-",null,null,0,0,""]
["S",4,"S",0,2,1,1,1,0,0,0,"","Serviço","Serviço","-","SINAPI",98230,"ESTACA BROCA DE CONCRETO, DIÂMETRO DE 30 CM, PROFUNDIDADE DE ATÉ 3 M, ESCAVAÇÃO MANUAL COM TRADO CONCHA, NÃO ARMADA. AF_03/2018","M",7.5,1,7.5,null,null,0,0,"Referência: AGETOP - 50302"]
["S",4,"S",0,2,1,1,1,0,0,0,"","Serviço","Serviço","-","AGETOP",52005,"ACO CA-50A - 10,0 MM (3/8\") - (OBRAS CIVIS)","Kg    ",30,1,30,null,null,0,0,""]
["S",4,"S",0,2,1,1,1,0,0,0,"","Serviço","Serviço","-","AGETOP",52014,"ACO CA-60 - 5,0 MM - (OBRAS CIVIS)","Kg    ",8.64,1,8.64,null,null,0,0,""]
[4,4,4,4,2,1,1,2,0,4,156,"","Nível 4","Nível 4","-","SINAPI",null,"COZINHA E AMBIENTES","-",null,1,"-",null,null,0,0,""]
["S",4,"S",0,2,1,1,2,0,0,0,"","Serviço","Serviço","-","SINAPI",98230,"ESTACA BROCA DE CONCRETO, DIÂMETRO DE 30 CM, PROFUNDIDADE DE ATÉ 3 M, ESCAVAÇÃO MANUAL COM TRADO CONCHA, NÃO ARMADA. AF_03/2018","M",7.5,1,7.5,null,null,0,0,"Referência: AGETOP - 50302"]
["S",4,"S",0,2,1,1,2,0,0,0,"","Serviço","Serviço","-","AGETOP",52005,"ACO CA-50A - 10,0 MM (3/8\") - (OBRAS CIVIS)","Kg    ",30,1,30,null,null,0,0,""]
["S",4,"S",0,2,1,1,2,0,0,0,"","Serviço","Serviço","-","AGETOP",52014,"ACO CA-60 - 5,0 MM - (OBRAS CIVIS)","Kg    ",8.64,1,8.64,null,null,0,0,""]
[3,3,3,15,2,1,2,0,0,34,15,"","Nível 3","Nível 3","-","SINAPI",null,"BLOCOS","-",null,1,"-",null,null,0,0,""]
[4,4,4,7,2,1,2,1,0,14,7,"","Nível 4","Nível 4","-","SINAPI",null,"BANHEIROS PCD","-",null,1,"-",null,null,0,0,""]
["S",4,"S",0,2,1,2,1,0,0,0,"","Serviço","Serviço","-","AGETOP",50901,"ESCAVACAO MANUAL DE VALAS (SAPATAS/BLOCOS)","m3    ",0.94,1,0.94,null,null,0,0,""]
["S",4,"S",0,2,1,2,1,0,0,0,"","Serviço","Serviço","-","AGETOP",50902,"APILOAMENTO (BLOCOS/SAPATAS)","m2    ",1.8,1,1.8,null,null,0,0,""]
["S",4,"S",0,2,1,2,1,0,0,0,"","Serviço","Serviço","-","AGETOP",60470,"LASTRO DE BRITA - (OBRAS CIVIS)","m3    ",0.09,1,0.09,null,null,0,0,""]
["S",4,"S",0,2,1,2,1,0,0,0,"","Serviço","Serviço","-","AGETOP",51030,"PREPARO COM BETONEIRA E TRANSPORTE MANUAL DE CONCRETO FCK=25 MPA","m3    ",0.94,1,0.94,null,null,0,0,""]
["S",4,"S",0,2,1,2,1,0,0,0,"","Serviço","Serviço","-","AGETOP",51055,"LANÇAMENTO/APLICAÇÃO/ADENSAMENTO MANUAL DE CONCRETO - (O.C.)","m3    ",0.94,1,0.94,null,null,0,0,""]
["S",4,"S",0,2,1,2,1,0,0,0,"","Serviço","Serviço","-","AGETOP",52014,"ACO CA-60 - 5,0 MM - (OBRAS CIVIS)","Kg    ",11.6,1,11.6,null,null,0,0,""]
[4,4,4,7,2,1,2,2,0,7,144,"","Nível 4","Nível 4","-","SINAPI",null,"COZINHA E AMBIENTES","-",null,1,"-",null,null,0,0,""]
["S",4,"S",0,2,1,2,2,0,0,0,"","Serviço","Serviço","-","AGETOP",50901,"ESCAVACAO MANUAL DE VALAS (SAPATAS/BLOCOS)","m3    ",0.94,1,0.94,null,null,0,0,""]
["S",4,"S",0,2,1,2,2,0,0,0,"","Serviço","Serviço","-","AGETOP",50902,"APILOAMENTO (BLOCOS/SAPATAS)","m2    ",1.8,1,1.8,null,null,0,0,""]
["S",4,"S",0,2,1,2,2,0,0,0,"","Serviço","Serviço","-","AGETOP",60470,"LASTRO DE BRITA - (OBRAS CIVIS)","m3    ",0.09,1,0.09,null,null,0,0,""]
["S",4,"S",0,2,1,2,2,0,0,0,"","Serviço","Serviço","-","AGETOP",51030,"PREPARO COM BETONEIRA E TRANSPORTE MANUAL DE CONCRETO FCK=25 MPA","m3    ",0.94,1,0.94,null,null,0,0,""]
["S",4,"S",0,2,1,2,2,0,0,0,"","Serviço","Serviço","-","AGETOP",51055,"LANÇAMENTO/APLICAÇÃO/ADENSAMENTO MANUAL DE CONCRETO - (O.C.)","m3    ",0.94,1,0.94,null,null,0,0,""]
["S",4,"S",0,2,1,2,2,0,0,0,"","Serviço","Serviço","-","AGETOP",52014,"ACO CA-60 - 5,0 MM - (OBRAS CIVIS)","Kg    ",11.6,1,11.6,null,null,0,0,""]
[3,3,3,19,2,1,3,0,0,19,203,"","Nível 3","Nível 3","-","SINAPI",null,"VIGAS BALDRAMES","-",null,1,"-",null,null,0,0,""]
[4,4,4,9,2,1,3,1,0,18,9,"","Nível 4","Nível 4","-","SINAPI",null,"BANHEIROS PCD","-",null,1,"-",null,null,0,0,""]
["S",4,"S",0,2,1,3,1,0,0,0,"","Serviço","Serviço","-","AGETOP",40101,"ESCAVACAO MANUAL DE VALAS < 1 MTS. (OBRAS CIVIS)","m3    ",1.1200000000000001,1,1.1200000000000001,null,null,0,0,""]
["S",4,"S",0,2,1,3,1,0,0,0,"","Serviço","Serviço","-","AGETOP",50902,"APILOAMENTO (BLOCOS/SAPATAS)","m2    ",1.6,1,1.6,null,null,0,0,""]
["S",4,"S",0,2,1,3,1,0,0,0,"","Serviço","Serviço","-","AGETOP",60191,"FORMA DE TABUA CINTA BALDRAME U=8 VEZES","m2    ",6.34,1,6.34,null,null,0,0,""]
["S",4,"S",0,2,1,3,1,0,0,0,"","Serviço","Serviço","-","AGETOP",51030,"PREPARO COM BETONEIRA E TRANSPORTE MANUAL DE CONCRETO FCK=25 MPA","m3    ",0.48,1,0.48,null,null,0,0,""]
["S",4,"S",0,2,1,3,1,0,0,0,"","Serviço","Serviço","-","AGETOP",51055,"LANÇAMENTO/APLICAÇÃO/ADENSAMENTO MANUAL DE CONCRETO - (O.C.)","m3    ",0.48,1,0.48,null,null,0,0,""]
["S",4,"S",0,2,1,3,1,0,0,0,"","Serviço","Serviço","-","AGETOP",40902,"REATERRO COM APILOAMENTO","m3    ",0.64,1,0.64,null,null,0,0,""]
["S",4,"S",0,2,1,3,1,0,0,0,"","Serviço","Serviço","-","AGETOP",52004,"ACO CA 50-A - 8,0 MM (5/16\") - (OBRAS CIVIS)","Kg    ",17.3,1,17.3,null,null,0,0,""]
["S",4,"S",0,2,1,3,1,0,0,0,"","Serviço","Serviço","-","AGETOP",52014,"ACO CA-60 - 5,0 MM - (OBRAS CIVIS)","Kg    ",8.1999999999999993,1,8.1999999999999993,null,null,0,0,""]
[4,4,4,9,2,1,3,2,0,9,127,"","Nível 4","Nível 4","-","SINAPI",null,"COZINHA E AMBIENTES","-",null,1,"-",null,null,0,0,""]
["S",4,"S",0,2,1,3,2,0,0,0,"","Serviço","Serviço","-","AGETOP",40101,"ESCAVACAO MANUAL DE VALAS < 1 MTS. (OBRAS CIVIS)","m3    ",0.75,1,0.75,null,null,0,0,""]
["S",4,"S",0,2,1,3,2,0,0,0,"","Serviço","Serviço","-","AGETOP",50902,"APILOAMENTO (BLOCOS/SAPATAS)","m2    ",1.07,1,1.07,null,null,0,0,""]
["S",4,"S",0,2,1,3,2,0,0,0,"","Serviço","Serviço","-","AGETOP",60191,"FORMA DE TABUA CINTA BALDRAME U=8 VEZES","m2    ",4.2699999999999996,1,4.2699999999999996,null,null,0,0,""]
["S",4,"S",0,2,1,3,2,0,0,0,"","Serviço","Serviço","-","AGETOP",51030,"PREPARO COM BETONEIRA E TRANSPORTE MANUAL DE CONCRETO FCK=25 MPA","m3    ",0.32,1,0.32,null,null,0,0,""]
["S",4,"S",0,2,1,3,2,0,0,0,"","Serviço","Serviço","-","AGETOP",51055,"LANÇAMENTO/APLICAÇÃO/ADENSAMENTO MANUAL DE CONCRETO - (O.C.)","m3    ",0.32,1,0.32,null,null,0,0,""]
["S",4,"S",0,2,1,3,2,0,0,0,"","Serviço","Serviço","-","AGETOP",40902,"REATERRO COM APILOAMENTO","m3    ",0.43,1,0.43,null,null,0,0,""]
["S",4,"S",0,2,1,3,2,0,0,0,"","Serviço","Serviço","-","AGETOP",52004,"ACO CA 50-A - 8,0 MM (5/16\") - (OBRAS CIVIS)","Kg    ",11.1,1,11.1,null,null,0,0,""]
["S",4,"S",0,2,1,3,2,0,0,0,"","Serviço","Serviço","-","AGETOP",52014,"ACO CA-60 - 5,0 MM - (OBRAS CIVIS)","Kg    ",4.7,1,4.7,null,null,0,0,""]
[2,2,2,27,2,2,0,0,0,32,27,"","Nível 2","Nível 2","-","AGETOP",null,"ESTRUTURA","-",null,1,"-",null,null,0,0,""]
[3,3,3,13,2,2,1,0,0,26,13,"","Nível 3","Nível 3","-","AGETOP",null,"PILARES","-",null,1,"-",null,null,0,0,""]
[4,4,4,6,2,2,1,1,0,12,6,"","Nível 4","Nível 4","-","SINAPI",null,"BANHEIROS PCD","-",null,1,"-",null,null,0,0,""]
["S",4,"S",0,2,2,1,1,0,0,0,"","Serviço","Serviço","-","SINAPI",92426,"MONTAGEM E DESMONTAGEM DE FÔRMA DE PILARES RETANGULARES E ESTRUTURAS SIMILARES COM ÁREA MÉDIA DAS SEÇÕES MENOR OU IGUAL A 0,25 M², PÉ-DIREITO SIMPLES, EM CHAPA DE MADEIRA COMPENSADA RESINADA, 8 UTILIZAÇÕES. AF_12/2015","M2",16.07,1,16.07,null,null,0,0,""]
["S",4,"S",0,2,2,1,1,0,0,0,"","Serviço","Serviço","-","SINAPI",94965,"CONCRETO FCK = 25MPA, TRAÇO 1:2,3:2,7 (CIMENTO/ AREIA MÉDIA/ BRITA 1)  - PREPARO MECÂNICO COM BETONEIRA 400 L. AF_07/2016","M3",0.79,1,0.79,null,null,0,0,"Referência: AGETOP - 51030"]
["S",4,"S",0,2,2,1,1,0,0,0,"","Serviço","Serviço","-","AGETOP",60801,"LANÇAMENTO/APLICAÇÃO/ADENSAMENTO MANUAL DE CONCRETO - (OBRAS CIVIS)","m3    ",0.79,1,0.79,null,null,0,0,""]
["S",4,"S",0,2,2,1,1,0,0,0,"","Serviço","Serviço","-","AGETOP",60305,"ACO CA-50A - 10,0 MM (3/8\") - (OBRAS CIVIS)","Kg    ",54.1,1,54.1,null,null,0,0,""]
["S",4,"S",0,2,2,1,1,0,{"$f":"IF(OR($C84=\"S\",$C84=0),0,MATCH(0,OFFSET($D84,1,$C84,ROW($C$410)-ROW($C84)),0))","v":0},{"$f":"IF(OR($C84=\"S\",$C84=0),0,MATCH(OFFSET($D84,0,$C84)+1,OFFSET($D84,1,$C84,ROW($C$410)-ROW($C84)),0))","v":0},"","Serviço","Serviço","-","AGETOP",60314,"ACO CA - 60 - 5,0 MM - (OBRAS CIVIS)","Kg    ",19.7,1,19.7,null,null,0,0,""]
[4,4,4,6,2,2,1,2,0,6,110,"","Nível 4","Nível 4","-","SINAPI",null,"COZINHA E AMBIENTES","-",null,1,"-",null,null,0,0,""]
["S",4,"S",0,2,2,1,2,0,0,0,"","Serviço","Serviço","-","SINAPI",92426,"MONTAGEM E DESMONTAGEM DE FÔRMA DE PILARES RETANGULARES E ESTRUTURAS SIMILARES COM ÁREA MÉDIA DAS SEÇÕES MENOR OU IGUAL A 0,25 M², PÉ-DIREITO SIMPLES, EM CHAPA DE MADEIRA COMPENSADA RESINADA, 8 UTILIZAÇÕES. AF_12/2015","M2",15.88,1,15.88,null,null,0,0,""]
["S",4,"S",0,2,2,1,2,0,0,0,"","Serviço","Serviço","-","SINAPI",94965,"CONCRETO FCK = 25MPA, TRAÇO 1:2,3:2,7 (CIMENTO/ AREIA MÉDIA/ BRITA 1)  - PREPARO MECÂNICO COM BETONEIRA 400 L. AF_07/2016","M3",0.8,1,0.8,null,null,0,0,"Referência: AGETOP - 51030"]
["S",4,"S",0,2,2,1,2,0,0,0,"","Serviço","Serviço","-","AGETOP",60801,"LANÇAMENTO/APLICAÇÃO/ADENSAMENTO MANUAL DE CONCRETO - (OBRAS CIVIS)","m3    ",0.8,1,0.8,null,null,0,0,""]
["S",4,"S",0,2,2,1,2,0,0,0,"","Serviço","Serviço","-","AGETOP",60305,"ACO CA-50A - 10,0 MM (3/8\") - (OBRAS CIVIS)","Kg    ",52.9,1,52.9,null,null,0,0,""]
["S",4,"S",0,2,2,1,2,0,0,0,"","Serviço","Serviço","-","AGETOP",60314,"ACO CA - 60 - 5,0 MM - (OBRAS CIVIS)","Kg    ",20.100000000000001,1,20.100000000000001,null,null,0,0,""]
[3,3,3,13,2,2,2,0,0,13,147,"","Nível 3","Nível 3","-",null,null,"VIGAS DE COBERTURA","-",null,1,"-",null,null,0,0,""]
[4,4,4,6,2,2,2,1,0,12,6,"","Nível 4","Nível 4","-","SINAPI",null,"BANHEIROS PCD","-",null,1,"-",null,null,0,0,""]
["S",4,"S",0,2,2,2,1,0,0,0,"","Serviço","Serviço","-","AGETOP",60209,"FORMA CH.COMPENSADA 12MM-VIGA/PILAR U=4V - (OBRAS CIVIS","m2    ",6.89,1,6.89,null,null,0,0,""]
["S",4,"S",0,2,2,2,1,0,0,0,"","Serviço","Serviço","-","SINAPI",94965,"CONCRETO FCK = 25MPA, TRAÇO 1:2,3:2,7 (CIMENTO/ AREIA MÉDIA/ BRITA 1)  - PREPARO MECÂNICO COM BETONEIRA 400 L. AF_07/2016","M3",0.4,1,0.4,null,null,0,0,"Referência: AGETOP - 51030"]
["S",{"$f":"IF(OR(C95=\"s\",C95=0),OFFSET(B95,-1,0),C95)","v":4},{"$f":"IF(OFFSET(C95,-1,0)=\"L\",1,IF(OFFSET(C95,-1,0)=1,2,IF(OR(A95=\"s\",A95=0),\"S\",IF(AND(OFFSET(C95,-1,0)=2,A95=4),3,IF(AND(OR(OFFSET(C95,-1,0)=\"s\",OFFSET(C95,-1,0)=0),A95<>\"s\",A95>OFFSET(B95,-1,0)),OFFSET(B95,-1,0),A95)))))","v":"S"},{"$f":"IF(OR(C95=\"S\",C95=0),0,IF(ISERROR(K95),J95,SMALL(J95:K95,1)))","v":0},{"$f":"IF($C95=1,OFFSET(E95,-1,0)+1,OFFSET(E95,-1,0))","v":2},{"$f":"IF($C95=1,0,IF($C95=2,OFFSET(F95,-1,0)+1,OFFSET(F95,-1,0)))","v":2},{"$f":"IF(AND($C95<=2,$C95<>0),0,IF($C95=3,OFFSET(G95,-1,0)+1,OFFSET(G95,-1,0)))","v":2},{"$f":"IF(AND($C95<=3,$C95<>0),0,IF($C95=4,OFFSET(H95,-1,0)+1,OFFSET(H95,-1,0)))","v":1},{"$f":"IF(AND($C95<=4,$C95<>0),0,IF(AND($C95=\"S\",$Y95>0),OFFSET(I95,-1,0)+1,OFFSET(I95,-1,0)))","v":0},0,0,"","Serviço","Serviço","-","AGETOP",60801,"LANÇAMENTO/APLICAÇÃO/ADENSAMENTO MANUAL DE CONCRETO - (OBRAS CIVIS)","m3    ",0.4,1,0.4,null,null,0,0,""]
["S",4,"S",0,2,2,2,1,0,0,0,"","Serviço","Serviço","-","AGETOP",60304,"ACO CA-50 A - 8,0 MM (5/16\") - (OBRAS CIVIS)","Kg    ",17.3,1,17.3,null,null,0,0,""]
["S",4,"S",0,2,2,2,1,0,0,0,"","Serviço","Serviço","-","AGETOP",60314,"ACO CA - 60 - 5,0 MM - (OBRAS CIVIS)","Kg    ",8,1,8,null,null,0,0,""]
[4,4,4,6,2,2,2,2,0,6,97,"","Nível 4","Nível 4","-","SINAPI",null,"COZINHA E AMBIENTES","-",null,1,"-",null,null,0,0,""]
["S",4,"S",0,2,2,2,2,0,0,0,"","Serviço","Serviço","-","AGETOP",60209,"FORMA CH.COMPENSADA 12MM-VIGA/PILAR U=4V - (OBRAS CIVIS","m2    ",4.6500000000000004,1,4.6500000000000004,null,null,0,0,""]
["S",4,"S",0,2,2,2,2,0,0,0,"","Serviço","Serviço","-","SINAPI",94965,"CONCRETO FCK = 25MPA, TRAÇO 1:2,3:2,7 (CIMENTO/ AREIA MÉDIA/ BRITA 1)  - PREPARO MECÂNICO COM BETONEIRA 400 L. AF_07/2016","M3",0.27,1,0.27,null,null,0,0,"Referência: AGETOP - 51030"]
["S",4,"S",0,2,2,2,2,0,0,0,"","Serviço","Serviço","-","AGETOP",60801,"LANÇAMENTO/APLICAÇÃO/ADENSAMENTO MANUAL DE CONCRETO - (OBRAS CIVIS)","m3    ",0.27,1,0.27,null,null,0,0,""]
["S",4,"S",0,2,2,2,2,0,0,0,"","Serviço","Serviço","-","AGETOP",60304,"ACO CA-50 A - 8,0 MM (5/16\") - (OBRAS CIVIS)","Kg    ",11.6,1,11.6,null,null,0,0,""]
["S",4,"S",0,2,2,2,2,0,0,0,"","Serviço","Serviço","-","AGETOP",60314,"ACO CA - 60 - 5,0 MM - (OBRAS CIVIS)","Kg    ",5.2,1,5.2,null,null,0,0,""]
[{"$f":"CHOOSE(1+LOG(1+2*(ORÇAMENTO.Nivel=\"Nível 1\")+4*(ORÇAMENTO.Nivel=\"Nível 2\")+8*(ORÇAMENTO.Nivel=\"Nível 3\")+16*(ORÇAMENTO.Nivel=\"Nível 4\")+32*(ORÇAMENTO.Nivel=\"Serviço\"),2),0,1,2,3,4,\"S\")","v":2},2,2,5,2,3,0,0,0,5,203,"","Nível 2","Nível 2","-","SINAPI",null,"IMPERMEABILIZAÇÃO","-",null,1,"-",null,null,0,0,""]
[3,3,3,2,2,3,1,0,0,4,2,"","Nível 3","Nível 3","-","SINAPI",null,"BANHEIROS PCD","-",null,1,"-",null,null,0,0,""]
["S",3,"S",0,2,3,1,0,0,0,0,"","Serviço","Serviço","-","AGETOP",120902,"IMPERMEABILIZACAO VIGAS BALDRAMES E=2,0 CM","m2    ",7.95,1,7.95,null,null,0,0,""]
[3,3,3,2,2,3,2,0,0,2,131,"","Nível 3","Nível 3","-",null,null,"COZINHA E AMBIENTES","-",null,1,"-",null,null,0,0,""]
["S",3,"S",0,2,3,2,0,0,0,0,"","Serviço","Serviço","-","AGETOP",120902,"IMPERMEABILIZACAO VIGAS BALDRAMES E=2,0 CM","m2    ",5.36,1,5.36,null,null,0,0,""]
[1,1,1,69,3,0,0,0,0,301,69,"F","Nível 1","Nível 1","3.","SINAPI",null,"INST. ELÉTRICAS","UN",1,1,1,null,null,0,0,""]
[2,2,2,68,3,1,0,0,0,68,72,"","Nível 2","Nível 2","-","SINAPI",null,"INSTALAÇÕES ELÉTRICAS","-",null,1,"-",null,null,0,0,""]
[{"$f":"CHOOSE(1+LOG(1+2*(ORÇAMENTO.Nivel=\"Nível 1\")+4*(ORÇAMENTO.Nivel=\"Nível 2\")+8*(ORÇAMENTO.Nivel=\"Nível 3\")+16*(ORÇAMENTO.Nivel=\"Nível 4\")+32*(ORÇAMENTO.Nivel=\"Serviço\"),2),0,1,2,3,4,\"S\")","v":3},{"$f":"IF(OR(C111=\"s\",C111=0),OFFSET(B111,-1,0),C111)","v":3},{"$f":"IF(OFFSET(C111,-1,0)=\"L\",1,IF(OFFSET(C111,-1,0)=1,2,IF(OR(A111=\"s\",A111=0),\"S\",IF(AND(OFFSET(C111,-1,0)=2,A111=4),3,IF(AND(OR(OFFSET(C111,-1,0)=\"s\",OFFSET(C111,-1,0)=0),A111<>\"s\",A111>OFFSET(B111,-1,0)),OFFSET(B111,-1,0),A111)))))","v":3},{"$f":"IF(OR(C111=\"S\",C111=0),0,IF(ISERROR(K111),J111,SMALL(J111:K111,1)))","v":57},{"$f":"IF($C111=1,OFFSET(E111,-1,0)+1,OFFSET(E111,-1,0))","v":3},{"$f":"IF($C111=1,0,IF($C111=2,OFFSET(F111,-1,0)+1,OFFSET(F111,-1,0)))","v":1},{"$f":"IF(AND($C111<=2,$C111<>0),0,IF($C111=3,OFFSET(G111,-1,0)+1,OFFSET(G111,-1,0)))","v":1},{"$f":"IF(AND($C111<=3,$C111<>0),0,IF($C111=4,OFFSET(H111,-1,0)+1,OFFSET(H111,-1,0)))","v":0},{"$f":"IF(AND($C111<=4,$C111<>0),0,IF(AND($C111=\"S\",$Y111>0),OFFSET(I111,-1,0)+1,OFFSET(I111,-1,0)))","v":0},67,57,"","Nível 3","Nível 3","-","SINAPI",null,"REFORMA E AMPLIAÇÃO","-",null,1,"-",null,null,0,0,""]
["S",3,"S",0,3,1,1,0,0,0,0,"","Serviço","Serviço","-","SINAPI","74131/4","QUADRO DE DISTRIBUICAO DE ENERGIA DE EMBUTIR, EM CHAPA METALICA, PARA 18 DISJUNTORES TERMOMAGNETICOS MONOPOLARES, COM BARRAMENTO TRIFASICO E NEUTRO, FORNECIMENTO E INSTALACAO","UN",2,1,2,null,null,0,0,""]
["S",3,"S",0,3,1,1,0,0,0,0,"","Serviço","Serviço","-","SINAPI","74131/5","QUADRO DE DISTRIBUICAO DE ENERGIA DE EMBUTIR, EM CHAPA METALICA, PARA 24 DISJUNTORES TERMOMAGNETICOS MONOPOLARES, COM BARRAMENTO TRIFASICO E NEUTRO, FORNECIMENTO E INSTALACAO","UN",1,1,1,null,null,0,0,""]
["S",3,"S",0,3,1,1,0,0,0,0,"","Serviço","Serviço","-","SINAPI","74131/1","QUADRO DE DISTRIBUICAO DE ENERGIA DE EMBUTIR, EM CHAPA METALICA, PARA 3 DISJUNTORES TERMOMAGNETICOS MONOPOLARES SEM BARRAMENTO FORNECIMENTO E INSTALACAO","UN",1,1,1,null,null,0,0,""]
["S",3,"S",0,3,1,1,0,0,0,0,"","Serviço","Serviço","-","AGETOP",71175,"DISJUNTOR TRIPOLAR DE 60 A 100-A","Un    ",2,1,2,null,null,0,0,""]
["S",3,"S",0,3,1,1,0,0,0,0,"","Serviço","Serviço","-","SINAPI",93670,"DISJUNTOR TRIPOLAR TIPO DIN, CORRENTE NOMINAL DE 25A - FORNECIMENTO E INSTALAÇÃO. AF_04/2016","UN",2,1,2,null,null,0,0,"Referência: AGETOP - 71173"]
["S",3,"S",0,3,1,1,0,0,0,0,"","Serviço","Serviço","-","SINAPI",93672,"DISJUNTOR TRIPOLAR TIPO DIN, CORRENTE NOMINAL DE 40A - FORNECIMENTO E INSTALAÇÃO. AF_04/2016","UN",2,1,2,null,null,0,0,"Referência: AGETOP - 71174"]
["S",3,"S",0,3,1,1,0,0,0,0,"","Serviço","Serviço","-","SINAPI",93673,"DISJUNTOR TRIPOLAR TIPO DIN, CORRENTE NOMINAL DE 50A - FORNECIMENTO E INSTALAÇÃO. AF_04/2016","UN",2,1,2,null,null,0,0,"Referência: AGETOP - 71174"]
["S",3,"S",0,3,1,1,0,0,0,0,"","Serviço","Serviço","-","SINAPI",93656,"DISJUNTOR MONOPOLAR TIPO DIN, CORRENTE NOMINAL DE 25A - FORNECIMENTO E INSTALAÇÃO. AF_04/2016","UN",15,1,15,null,null,0,0,""]
["S",3,"S",0,3,1,1,0,0,0,0,"","Serviço","Serviço","-","SINAPI",93654,"DISJUNTOR MONOPOLAR TIPO DIN, CORRENTE NOMINAL DE 16A - FORNECIMENTO E INSTALAÇÃO. AF_04/2016","UN",10,1,10,null,null,0,0,""]
["S",3,"S",0,3,1,1,0,0,0,0,"","Serviço","Serviço","-","SINAPI",93653,"DISJUNTOR MONOPOLAR TIPO DIN, CORRENTE NOMINAL DE 10A - FORNECIMENTO E INSTALAÇÃO. AF_04/2016","UN",12,1,12,null,null,0,0,""]
["S",3,"S",0,3,1,1,0,0,0,0,"","Serviço","Serviço","-","AGETOP",71184,"DISPOSITIVO DE PROTEÇÃO CONTRA SURTOS (D.P.S.) 275V DE 8 A 40KA","Un    ",3,1,3,null,null,0,0,""]
["S",3,"S",0,3,1,1,0,0,0,0,"","Serviço","Serviço","-","AGETOP",71450,"INTERRUPTOR DIFERENCIAL RESIDUAL (D.R.) BIPOLAR DE 25A-30mA","Un    ",3,1,3,null,null,0,0,""]
["S",3,"S",0,3,1,1,0,0,0,0,"","Serviço","Serviço","-","SINAPI",92984,"CABO DE COBRE FLEXÍVEL ISOLADO, 25 MM², ANTI-CHAMA 0,6/1,0 KV, PARA DISTRIBUIÇÃO - FORNECIMENTO E INSTALAÇÃO. AF_12/2015","M",86,1,86,null,null,0,0,"Referência: AGETOP - 70511"]
["S",3,"S",0,3,1,1,0,0,0,0,"","Serviço","Serviço","-","SINAPI",92982,"CABO DE COBRE FLEXÍVEL ISOLADO, 16 MM², ANTI-CHAMA 0,6/1,0 KV, PARA DISTRIBUIÇÃO - FORNECIMENTO E INSTALAÇÃO. AF_12/2015","M",22,1,22,null,null,0,0,""]
["S",3,"S",0,3,1,1,0,0,0,0,"","Serviço","Serviço","-","SINAPI",91928,"CABO DE COBRE FLEXÍVEL ISOLADO, 4 MM², ANTI-CHAMA 450/750 V, PARA CIRCUITOS TERMINAIS - FORNECIMENTO E INSTALAÇÃO. AF_12/2015","M",1594,1,1594,null,null,0,0,"Referência: AGETOP - 70564"]
["S",3,"S",0,3,1,1,0,0,0,0,"","Serviço","Serviço","-","SINAPI",91926,"CABO DE COBRE FLEXÍVEL ISOLADO, 2,5 MM², ANTI-CHAMA 450/750 V, PARA CIRCUITOS TERMINAIS - FORNECIMENTO E INSTALAÇÃO. AF_12/2015","M",3414,1,3414,null,null,0,0,"Referência: AGETOP - 70563"]
["S",3,"S",0,3,1,1,0,0,0,0,"","Serviço","Serviço","-","SINAPI",92979,"CABO DE COBRE FLEXÍVEL ISOLADO, 10 MM², ANTI-CHAMA 450/750 V, PARA DISTRIBUIÇÃO - FORNECIMENTO E INSTALAÇÃO. AF_12/2015","M",17,1,17,null,null,0,0,""]
["S",3,"S",0,3,1,1,0,0,0,0,"","Serviço","Serviço","-","SINAPI",92981,"CABO DE COBRE FLEXÍVEL ISOLADO, 16 MM², ANTI-CHAMA 450/750 V, PARA DISTRIBUIÇÃO - FORNECIMENTO E INSTALAÇÃO. AF_12/2015","M",22,1,22,null,null,0,0,""]
["S",3,"S",0,3,1,1,0,0,0,0,"","Serviço","Serviço","-","SINAPI",91871,"ELETRODUTO RÍGIDO ROSCÁVEL, PVC, DN 25 MM (3/4\"), PARA CIRCUITOS TERMINAIS, INSTALADO EM PAREDE - FORNECIMENTO E INSTALAÇÃO. AF_12/2015","M",965,1,965,null,null,0,0,"Referência: AGETOP - 71201"]
["S",3,"S",0,3,1,1,0,0,0,0,"","Serviço","Serviço","-","SINAPI",91872,"ELETRODUTO RÍGIDO ROSCÁVEL, PVC, DN 32 MM (1\"), PARA CIRCUITOS TERMINAIS, INSTALADO EM PAREDE - FORNECIMENTO E INSTALAÇÃO. AF_12/2015","M",28,1,28,null,null,0,0,"Referência: AGETOP - 71202"]
["S",3,"S",0,3,1,1,0,0,0,0,"","Serviço","Serviço","-","SINAPI",93008,"ELETRODUTO RÍGIDO ROSCÁVEL, PVC, DN 50 MM (1 1/2\") - FORNECIMENTO E INSTALAÇÃO. AF_12/2015","M",39,1,39,null,null,0,0,""]
["S",3,"S",0,3,1,1,0,0,0,0,"","Serviço","Serviço","-","AGETOP",70351,"BRACADEIRA METALICA TIPO \"U\" DIAM. 3/4\"","Un    ",49,1,49,null,null,0,0,""]
["S",3,"S",0,3,1,1,0,0,0,0,"","Serviço","Serviço","-","AGETOP",70352,"BRACADEIRA METALICA TIPO \"U\" DIAM. 1\"","Un    ",2,1,2,null,null,0,0,""]
["S",3,"S",0,3,1,1,0,0,0,0,"","Serviço","Serviço","-","AGETOP",70354,"BRACADEIRA METALICA TIPO \"U\" DIAM. 1.1/2\"","Un    ",2,1,2,null,null,0,0,""]
["S",3,"S",0,3,1,1,0,0,0,0,"","Serviço","Serviço","-","SINAPI",91879,"LUVA PARA ELETRODUTO, PVC, ROSCÁVEL, DN 25 MM (3/4\"), PARA CIRCUITOS TERMINAIS, INSTALADA EM LAJE - FORNECIMENTO E INSTALAÇÃO. AF_12/2015","UN",49,1,49,null,null,0,0,"Referência: AGETOP - 71741"]
[{"$f":"CHOOSE(1+LOG(1+2*(ORÇAMENTO.Nivel=\"Nível 1\")+4*(ORÇAMENTO.Nivel=\"Nível 2\")+8*(ORÇAMENTO.Nivel=\"Nível 3\")+16*(ORÇAMENTO.Nivel=\"Nível 4\")+32*(ORÇAMENTO.Nivel=\"Serviço\"),2),0,1,2,3,4,\"S\")","v":"S"},3,"S",0,3,1,1,0,0,0,0,"","Serviço","Serviço","-","SINAPI",91880,"LUVA PARA ELETRODUTO, PVC, ROSCÁVEL, DN 32 MM (1\"), PARA CIRCUITOS TERMINAIS, INSTALADA EM LAJE - FORNECIMENTO E INSTALAÇÃO. AF_12/2015","UN",2,1,2,null,null,0,0,"Referência: AGETOP - 71742"]
["S",3,"S",0,3,1,1,0,0,0,0,"","Serviço","Serviço","-","SINAPI",93013,"LUVA PARA ELETRODUTO, PVC, ROSCÁVEL, DN 50 MM (1 1/2\") - FORNECIMENTO E INSTALAÇÃO. AF_12/2015","UN",2,1,2,null,null,0,0,"Referência: AGETOP - 71744"]
["S",3,"S",0,3,1,1,0,0,0,0,"","Serviço","Serviço","-","AGETOP",72395,"TAMPA CEGA PARA CONDULETE METÁLICO","Un    ",289,1,289,null,null,0,0,""]
["S",3,"S",0,3,1,1,0,0,0,0,"","Serviço","Serviço","-","SINAPI",95801,"CONDULETE DE ALUMÍNIO, TIPO X, PARA ELETRODUTO DE AÇO GALVANIZADO DN 20 MM (3/4''), APARENTE - FORNECIMENTO E INSTALAÇÃO. AF_11/2016_P","UN",289,1,289,null,null,0,0,"Referência: AGETOP - 70929"]
["S",3,"S",0,3,1,1,0,0,0,0,"","Serviço","Serviço","-","SINAPI",91902,"CURVA 90 GRAUS PARA ELETRODUTO, PVC, ROSCÁVEL, DN 25 MM (3/4\"), PARA CIRCUITOS TERMINAIS, INSTALADA EM LAJE - FORNECIMENTO E INSTALAÇÃO. AF_12/2015","UN",10,1,10,null,null,0,0,"Referência: AGETOP - 71141"]
["S",3,"S",0,3,1,1,0,0,0,0,"","Serviço","Serviço","-","SINAPI",91905,"CURVA 90 GRAUS PARA ELETRODUTO, PVC, ROSCÁVEL, DN 32 MM (1\"), PARA CIRCUITOS TERMINAIS, INSTALADA EM LAJE - FORNECIMENTO E INSTALAÇÃO. AF_12/2015","UN",5,1,5,null,null,0,0,"Referência: AGETOP - 71142"]
["S",3,"S",0,3,1,1,0,0,0,0,"","Serviço","Serviço","-","AGETOP",71124,"CURVA 90 GRAUS AÇO ZINCADO DIÂMETRO 1.1/2\"","Un    ",2,1,2,null,null,0,0,""]
["S",3,"S",0,3,1,1,0,0,0,0,"","Serviço","Serviço","-","SINAPI",91953,"INTERRUPTOR SIMPLES (1 MÓDULO), 10A/250V, INCLUINDO SUPORTE E PLACA - FORNECIMENTO E INSTALAÇÃO. AF_12/2015","UN",19,1,19,null,null,0,0,"Referência: AGETOP - 71440"]
["S",3,"S",0,3,1,1,0,0,0,0,"","Serviço","Serviço","-","SINAPI",91959,"INTERRUPTOR SIMPLES (2 MÓDULOS), 10A/250V, INCLUINDO SUPORTE E PLACA - FORNECIMENTO E INSTALAÇÃO. AF_12/2015","UN",5,1,5,null,null,0,0,"Referência: AGETOP - 71441"]
["S",3,"S",0,3,1,1,0,0,0,0,"","Serviço","Serviço","-","SINAPI",91955,"INTERRUPTOR PARALELO (1 MÓDULO), 10A/250V, INCLUINDO SUPORTE E PLACA - FORNECIMENTO E INSTALAÇÃO. AF_12/2015","UN",2,1,2,null,null,0,0,"Referência: AGETOP - 71431"]
["S",3,"S",0,3,1,1,0,0,0,0,"","Serviço","Serviço","-","SINAPI",91961,"INTERRUPTOR PARALELO (2 MÓDULOS), 10A/250V, INCLUINDO SUPORTE E PLACA - FORNECIMENTO E INSTALAÇÃO. AF_12/2015","UN",4,1,4,null,null,0,0,""]
["S",3,"S",0,3,1,1,0,0,{"$f":"IF(OR($C148=\"S\",$C148=0),0,MATCH(0,OFFSET($D148,1,$C148,ROW($C$410)-ROW($C148)),0))","v":0},{"$f":"IF(OR($C148=\"S\",$C148=0),0,MATCH(OFFSET($D148,0,$C148)+1,OFFSET($D148,1,$C148,ROW($C$410)-ROW($C148)),0))","v":0},"","Serviço","Serviço","-","SINAPI",91969,"INTERRUPTOR PARALELO (3 MÓDULOS), 10A/250V, INCLUINDO SUPORTE E PLACA - FORNECIMENTO E INSTALAÇÃO. AF_12/2015","UN",4,1,4,null,null,0,0,""]
["S",3,"S",0,3,1,1,0,0,0,0,"","Serviço","Serviço","-","SINAPI",92008,"TOMADA BAIXA DE EMBUTIR (2 MÓDULOS), 2P+T 10 A, INCLUINDO SUPORTE E PLACA - FORNECIMENTO E INSTALAÇÃO. AF_12/2015","UN",96,1,96,null,null,0,0,""]
["S",3,"S",0,3,1,1,0,0,0,0,"","Serviço","Serviço","-","SINAPI",91993,"TOMADA ALTA DE EMBUTIR (1 MÓDULO), 2P+T 20 A, INCLUINDO SUPORTE E PLACA - FORNECIMENTO E INSTALAÇÃO. AF_12/2015","UN",9,1,9,null,null,0,0,"Referência: AGETOP - 72585"]
["S",3,"S",0,3,1,1,0,0,0,0,"","Serviço","Serviço","-","SINAPI",92004,"TOMADA MÉDIA DE EMBUTIR (2 MÓDULOS), 2P+T 10 A, INCLUINDO SUPORTE E PLACA - FORNECIMENTO E INSTALAÇÃO. AF_12/2015","UN",12,1,12,null,null,0,0,"Referência: AGETOP - 72578"]
["S",3,"S",0,3,1,1,0,0,0,0,"","Serviço","Serviço","-","SINAPI",91996,"TOMADA MÉDIA DE EMBUTIR (1 MÓDULO), 2P+T 10 A, INCLUINDO SUPORTE E PLACA - FORNECIMENTO E INSTALAÇÃO. AF_12/2015","UN",9,1,9,null,null,0,0,"Referência: AGETOP - 72578"]
["S",3,"S",0,3,1,1,0,0,0,0,"","Serviço","Serviço","-","SINAPI",97593,"LUMINÁRIA TIPO SPOT, DE SOBREPOR, COM 1 LÂMPADA FLUORESCENTE DE 15 W, SEM REATOR - FORNECIMENTO E INSTALAÇÃO. AF_02/2020","UN",132,1,132,null,null,0,0,"Referência: AGETOP - 71688"]
["S",3,"S",0,3,1,1,0,0,0,0,"","Serviço","Serviço","-","SINAPI",97606,"LUMINÁRIA ARANDELA TIPO MEIA LUA, DE SOBREPOR, COM 1 LÂMPADA FLUORESCENTE DE 15 W, SEM REATOR - FORNECIMENTO E INSTALAÇÃO. AF_02/2020","UN",7,1,7,null,null,0,0,""]
["S",3,"S",0,3,1,1,0,0,0,0,"","Serviço","Serviço","-","SINAPI",97610,"LÂMPADA COMPACTA DE LED 10 W, BASE E27 - FORNECIMENTO E INSTALAÇÃO. AF_02/2020","UN",132,1,132,null,null,0,0,""]
["S",3,"S",0,3,1,1,0,0,0,0,"","Serviço","Serviço","-","AGETOP",71380,"HASTE REV.COBRE(COPPERWELD)  3/4\" X 2,40 M C/CONECTOR","Un    ",4,1,4,null,null,0,0,""]
["S",3,"S",0,3,1,1,0,0,0,0,"","Serviço","Serviço","-","AGETOP",70255,"ATERRAMENTO - SOLDA EXOTÉRMICA - CARTUCHO 90 G","un    ",4,1,4,null,null,0,0,""]
["S",3,"S",0,3,1,1,0,0,0,0,"","Serviço","Serviço","-","AGETOP",70648,"CAIXA DE PASSAGEM METÁLICA DE EMBUTIR  40X40X15 CM","Un    ",8,1,8,null,null,0,0,""]
["S",3,"S",0,3,1,1,0,0,0,0,"","Serviço","Serviço","-","AGETOP",70391,"BUCHA DE NYLON S-6","Un    ",212,1,212,null,null,0,0,""]
["S",3,"S",0,3,1,1,0,0,0,0,"","Serviço","Serviço","-","AGETOP",71861,"PARAFUSO P/BUCHA S-6","Un    ",212,1,212,null,null,0,0,""]
["S",3,"S",0,3,1,1,0,0,0,0,"","Serviço","Serviço","-","AGETOP",70633,"CAIXA DE PASSAGEM - ESCAVAÇÃO MANUAL / REATERRO/ APILOAMENTO DO FUNDO ","m3    ",0.12,1,0.12,null,null,0,0,""]
["S",3,"S",0,3,1,1,0,0,0,0,"","Serviço","Serviço","-","SINAPI",83446,"CAIXA DE PASSAGEM 30X30X40 COM TAMPA E DRENO BRITA","UN",1,1,1,null,null,0,0,""]
["S",3,"S",0,3,1,1,0,0,0,0,"","Serviço","Serviço","-","SINAPI",96995,"REATERRO MANUAL APILOADO COM SOQUETE. AF_10/2017","M3",1.06,1,1.06,null,null,0,0,"Referência: AGETOP - 40902"]
["S",3,"S",0,3,1,1,0,0,0,0,"","Serviço","Serviço","-","SINAPI",93358,"ESCAVAÇÃO MANUAL DE VALA COM PROFUNDIDADE MENOR OU IGUAL A 1,30 M. AF_03/2016","M3",1.7,1,1.7,null,null,0,0,"Referência: AGETOP - 40101"]
["S",3,"S",0,3,1,1,0,0,0,0,"","Serviço","Serviço","-","AGETOP",71321,"FITA DE AUTO FUSAO, ROLO E 10,00 MM","Un    ",5,1,5,null,null,0,0,""]
["S",3,"S",0,3,1,1,0,0,0,0,"","Serviço","Serviço","-","AGETOP",71826,"PADRÃO TRIFASICO 25 MM H=7 METROS","Un    ",1,1,1,null,null,0,0,""]
["S",3,"S",0,3,1,1,0,0,0,0,"","Serviço","Serviço","-","AGETOP",20162,"DEMOLIÇÃO DAS INSTALAÇÕES ELÉTRICAS E AFINS C/ TRANSP. ATÉ CB. E CARGA","H     ",40,1,40,null,null,0,0,""]
[3,3,3,10,3,1,2,0,0,10,70,"","Nível 3","Nível 3","-","SINAPI",null,"INCÊNDIO","-",null,1,"-",null,null,0,0,""]
["S",3,"S",0,3,1,2,0,0,0,0,"","Serviço","Serviço","-","SINAPI",91992,"TOMADA ALTA DE EMBUTIR (1 MÓDULO), 2P+T 10 A, INCLUINDO SUPORTE E PLACA - FORNECIMENTO E INSTALAÇÃO. AF_12/2015","UN",5,1,5,null,null,0,0,""]
["S",3,"S",0,3,1,2,0,0,0,0,"","Serviço","Serviço","-","SINAPI",91926,"CABO DE COBRE FLEXÍVEL ISOLADO, 2,5 MM², ANTI-CHAMA 450/750 V, PARA CIRCUITOS TERMINAIS - FORNECIMENTO E INSTALAÇÃO. AF_12/2015","M",200,1,200,null,null,0,0,"Referência: AGETOP - 70563"]
["S",3,"S",0,3,1,2,0,0,0,0,"","Serviço","Serviço","-","SINAPI",91867,"ELETRODUTO RÍGIDO ROSCÁVEL, PVC, DN 25 MM (3/4\"), PARA CIRCUITOS TERMINAIS, INSTALADO EM LAJE - FORNECIMENTO E INSTALAÇÃO. AF_12/2015","M",57,1,57,null,null,0,0,"Referência: AGETOP - 71201"]
["S",3,"S",0,3,1,2,0,0,0,0,"","Serviço","Serviço","-","SINAPI",91879,"LUVA PARA ELETRODUTO, PVC, ROSCÁVEL, DN 25 MM (3/4\"), PARA CIRCUITOS TERMINAIS, INSTALADA EM LAJE - FORNECIMENTO E INSTALAÇÃO. AF_12/2015","UN",3,1,3,null,null,0,0,"Referência: AGETOP - 71741"]
["S",3,"S",0,3,1,2,0,0,0,0,"","Serviço","Serviço","-","AGETOP",70351,"BRACADEIRA METALICA TIPO \"U\" DIAM. 3/4\"","Un    ",3,1,3,null,null,0,0,""]
["S",3,"S",0,3,1,2,0,0,0,0,"","Serviço","Serviço","-","AGETOP",71862,"PARAFUSO P/BUCHA S-8","Un    ",24,1,24,null,null,0,0,""]
["S",3,"S",0,3,1,2,0,0,0,0,"","Serviço","Serviço","-","AGETOP",70392,"BUCHA DE NYLON S-8","Un    ",24,1,24,null,null,0,0,""]
["S",3,"S",0,3,1,2,0,0,0,0,"","Serviço","Serviço","-","SINAPI",95787,"CONDULETE DE ALUMÍNIO, TIPO LR, PARA ELETRODUTO DE AÇO GALVANIZADO DN 20 MM (3/4''), APARENTE - FORNECIMENTO E INSTALAÇÃO. AF_11/2016_P","UN",6,1,6,null,null,0,0,""]
["S",3,"S",0,3,1,2,0,0,0,0,"","Serviço","Serviço","-","SINAPI",95795,"CONDULETE DE ALUMÍNIO, TIPO T, PARA ELETRODUTO DE AÇO GALVANIZADO DN 20 MM (3/4''), APARENTE - FORNECIMENTO E INSTALAÇÃO. AF_11/2016_P","UN",3,1,3,null,null,0,0,""]
[1,1,1,95,4,0,0,0,0,232,95,"F","Nível 1","Nível 1","4.","SINAPI",null,"INSTALAÇÕES HIDROSSANITÁRIAS E DE INCÊNDIO","UN",1,1,1,null,null,0,0,""]
[2,2,2,3,4,1,0,0,0,94,3,"","Nível 2","Nível 2","-","SINAPI",null,"SERVIÇO EM TERRA","-",null,1,"-",null,null,0,0,""]
["S",2,"S",0,4,1,0,0,0,0,0,"","Serviço","Serviço","-","AGETOP",40101,"ESCAVACAO MANUAL DE VALAS < 1 MTS. (OBRAS CIVIS)","m3    ",16.400000000000002,1,16.400000000000002,null,null,0,0,""]
["S",2,"S",0,4,1,0,0,0,0,0,"","Serviço","Serviço","-","AGETOP",40902,"REATERRO COM APILOAMENTO","m3    ",16.400000000000002,1,16.400000000000002,null,null,0,0,""]
[2,2,2,91,4,2,0,0,0,91,104,"","Nível 2","Nível 2","-","SINAPI",null,"INSTALAÇÕES HIDROSSANITÁRIAS","-",null,1,"-",null,null,0,0,""]
[3,3,3,27,4,2,1,0,0,90,27,"","Nível 3","Nível 3","-","SINAPI",null,"PEÇAS E ACESSÓRIOS","-",null,1,"-",null,null,0,0,""]
[4,4,4,3,4,2,1,1,0,26,3,"","Nível 4","Nível 4","-","SINAPI",null,"VASO SANITÁRIO E ACESSÓRIOS","-",null,1,"-",null,null,0,0,""]
["S",4,"S",0,4,2,1,1,0,0,0,"","Serviço","Serviço","-","SINAPI",86931,"VASO SANITÁRIO SIFONADO COM CAIXA ACOPLADA LOUÇA BRANCA, INCLUSO ENGATE FLEXÍVEL EM PLÁSTICO BRANCO, 1/2  X 40CM - FORNECIMENTO E INSTALAÇÃO. AF_01/2020","UN",4,1,4,null,null,0,0,""]
["S",4,"S",0,4,2,1,1,0,0,0,"","Serviço","Serviço","-","AGETOP",80510,"ANEL DE VEDAÇÃO PARA VASO SANITÁRIO","Un    ",4,1,4,null,null,0,0,""]
[4,4,4,8,4,2,1,2,0,23,8,"","Nível 4","Nível 4","-","SINAPI",null,"LAVATÓRIO E ACESSÓRIOS","-",null,1,"-",null,null,0,0,""]
["S",4,"S",0,4,2,1,2,0,0,0,"","Serviço","Serviço","-","AGETOP",80542,"LAVATÓRIO MÉDIO SEM COLUNA","Un    ",2,1,2,null,null,0,0,""]
[{"$f":"CHOOSE(1+LOG(1+2*(ORÇAMENTO.Nivel=\"Nível 1\")+4*(ORÇAMENTO.Nivel=\"Nível 2\")+8*(ORÇAMENTO.Nivel=\"Nível 3\")+16*(ORÇAMENTO.Nivel=\"Nível 4\")+32*(ORÇAMENTO.Nivel=\"Serviço\"),2),0,1,2,3,4,\"S\")","v":"S"},4,"S",0,4,2,1,2,0,0,0,"","Serviço","Serviço","-","AGETOP",80550,"FIXACAO P/LAVATORIO (PAR)","PAR   ",2,1,2,null,null,0,0,""]
["S",4,"S",0,4,2,1,2,0,0,0,"","Serviço","Serviço","-","AGETOP",80556,"LIGAÇÃO FLEXÍVEL PVC DIAM.1/2\" (ENGATE)","Un    ",4,1,4,null,null,0,0,""]
["S",4,"S",0,4,2,1,2,0,0,0,"","Serviço","Serviço","-","SINAPI",86883,"SIFÃO DO TIPO FLEXÍVEL EM PVC 1  X 1.1/2  - FORNECIMENTO E INSTALAÇÃO. AF_01/2020","UN",4,1,4,null,null,0,0,""]
["S",4,"S",0,4,2,1,2,0,0,0,"","Serviço","Serviço","-","SINAPI",86915,"TORNEIRA CROMADA DE MESA, 1/2\u0094 OU 3/4\u0094, PARA LAVATÓRIO, PADRÃO MÉDIO - FORNECIMENTO E INSTALAÇÃO. AF_01/2020","UN",4,1,4,null,null,0,0,"Referência: AGETOP - 80570"]
["S",4,"S",0,4,2,1,2,0,0,0,"","Serviço","Serviço","-","SINAPI",86877,"VÁLVULA EM METAL CROMADO 1.1/2\u0094 X 1.1/2\u0094 PARA TANQUE OU LAVATÓRIO, COM OU SEM LADRÃO - FORNECIMENTO E INSTALAÇÃO. AF_01/2020","UN",4,1,4,null,null,0,0,"Referência: AGETOP - 80580"]
["S",4,"S",0,4,2,1,2,0,0,0,"","Serviço","Serviço","-","SINAPI",86901,"CUBA DE EMBUTIR OVAL EM LOUÇA BRANCA, 35 X 50CM OU EQUIVALENTE - FORNECIMENTO E INSTALAÇÃO. AF_01/2020","UN",2,1,2,null,null,0,0,"Referência: AGETOP - 80587"]
[4,4,4,5,4,2,1,3,0,15,5,"","Nível 4","Nível 4","-","SINAPI",null,"PIA E ACESSÓRIOS","-",null,1,"-",null,null,0,0,""]
["S",4,"S",0,4,2,1,3,0,0,0,"","Serviço","Serviço","-","AGETOP",80660,"TORNEIRA DE PAREDE PARA PIA OU BEBEDOURO DIÂMETRO DE 1/2\" E 3/4\" ","Un    ",1,1,1,null,null,0,0,""]
["S",4,"S",0,4,2,1,3,0,0,0,"","Serviço","Serviço","-","SINAPI",86881,"SIFÃO DO TIPO GARRAFA EM METAL CROMADO 1 X 1.1/2\u0094 - FORNECIMENTO E INSTALAÇÃO. AF_01/2020","UN",1,1,1,null,null,0,0,"Referência: AGETOP - 80670"]
["S",4,"S",0,4,2,1,3,0,0,0,"","Serviço","Serviço","-","SINAPI",86878,"VÁLVULA EM METAL CROMADO TIPO AMERICANA 3.1/2\u0094 X 1.1/2\u0094 PARA PIA - FORNECIMENTO E INSTALAÇÃO. AF_01/2020","UN",1,1,1,null,null,0,0,""]
["S",4,"S",0,4,2,1,3,0,0,0,"","Serviço","Serviço","-","AGETOP",80687,"CUBA INOX 35X40X15CM E=0,6MM-AÇO 304 (CUBA Nº 3)","Un    ",1,1,1,null,null,0,0,""]
[4,4,4,2,4,2,1,4,0,10,2,"","Nível 4","Nível 4","-","SINAPI",null,"FILTRO E CHUVEIROS","-",null,1,"-",null,null,0,0,""]
["S",4,"S",0,4,2,1,4,0,0,0,"","Serviço","Serviço","-","AGETOP",80721,"CHUVEIRO ELÉTRICO EM PVC COM BRAÇO METÁLICO","Un    ",1,1,1,null,null,0,0,""]
[4,4,4,3,4,2,1,5,0,8,3,"","Nível 4","Nível 4","-","SINAPI",null,"TANQUES / TORNEIRAS","-",null,1,"-",null,null,0,0,""]
["S",4,"S",0,4,2,1,5,0,0,0,"","Serviço","Serviço","-","AGETOP",80840,"TAMPA T-5 ARTICULADA 20X20","Un    ",1,1,1,null,null,0,0,""]
["S",4,"S",0,4,2,1,5,0,0,0,"","Serviço","Serviço","-","AGETOP",80845,"CAIXA DE ALVENARIA 20x20x25 CM (REVESTIMENTO IMPERMEABILIZADO), FUNDO DE BRITA SEM TAMPA - PARA REGISTRO/TORNEIRA JARDIM","Un    ",1,1,1,null,null,0,0,""]
[4,4,4,5,4,2,1,6,0,5,{"$error":"#N/A"},"","Nível 4","Nível 4","-","SINAPI",null,"REGISTROS","-",null,1,"-",null,null,0,0,""]
["S",4,"S",0,4,2,1,6,0,0,0,"","Serviço","Serviço","-","AGETOP",80905,"REGISTRO DE GAVETA BRUTO DIAMETRO 1.1/2\"","Un    ",1,1,1,null,null,0,0,""]
["S",4,"S",0,4,2,1,6,0,0,0,"","Serviço","Serviço","-","SINAPI",89987,"REGISTRO DE GAVETA BRUTO, LATÃO, ROSCÁVEL, 3/4\", COM ACABAMENTO E CANOPLA CROMADOS. FORNECIDO E INSTALADO EM RAMAL DE ÁGUA. AF_12/2014","UN",5,1,5,null,null,0,0,"Referência: AGETOP - 80926"]
["S",4,"S",0,4,2,1,6,0,0,0,"","Serviço","Serviço","-","SINAPI",94794,"REGISTRO DE GAVETA BRUTO, LATÃO, ROSCÁVEL, 1 1/2\u0094, COM ACABAMENTO E CANOPLA CROMADOS, INSTALADO EM RESERVAÇÃO DE ÁGUA DE EDIFICAÇÃO QUE POSSUA RESERVATÓRIO DE FIBRA/FIBROCIMENTO \u0096 FORNECIMENTO E INSTALAÇÃO. AF_06/2016","UN",2,1,2,null,null,0,0,"Referência: AGETOP - 80929"]
["S",4,"S",0,4,2,1,6,0,0,0,"","Serviço","Serviço","-","SINAPI",89984,"REGISTRO DE PRESSÃO BRUTO, LATÃO, ROSCÁVEL, 1/2\", COM ACABAMENTO E CANOPLA CROMADOS. FORNECIDO E INSTALADO EM RAMAL DE ÁGUA. AF_12/2014","UN",2,1,2,null,null,0,0,"Referência: AGETOP - 80925"]
[3,3,3,28,4,2,2,0,0,63,28,"","Nível 3","Nível 3","-","SINAPI",null,"ÁGUA FRIA","-",null,1,"-",null,null,0,0,""]
[4,4,4,5,4,2,2,1,0,27,5,"","Nível 4","Nível 4","-","SINAPI",null,"TUBOS DE PVC SOLDÁVEL","-",null,1,"-",null,null,0,0,""]
["S",4,"S",0,4,2,2,1,0,{"$f":"IF(OR($C212=\"S\",$C212=0),0,MATCH(0,OFFSET($D212,1,$C212,ROW($C$410)-ROW($C212)),0))","v":0},{"$f":"IF(OR($C212=\"S\",$C212=0),0,MATCH(OFFSET($D212,0,$C212)+1,OFFSET($D212,1,$C212,ROW($C$410)-ROW($C212)),0))","v":0},"","Serviço","Serviço","-","SINAPI",89402,"TUBO, PVC, SOLDÁVEL, DN 25MM, INSTALADO EM RAMAL DE DISTRIBUIÇÃO DE ÁGUA - FORNECIMENTO E INSTALAÇÃO. AF_12/2014","M",41,1,41,null,null,0,0,"Referência: AGETOP - 81003"]
["S",4,"S",0,4,2,2,1,0,0,0,"","Serviço","Serviço","-","SINAPI",89447,"TUBO, PVC, SOLDÁVEL, DN 32MM, INSTALADO EM PRUMADA DE ÁGUA - FORNECIMENTO E INSTALAÇÃO. AF_12/2014","M",18,1,18,null,null,0,0,""]
["S",4,"S",0,4,2,2,1,0,0,0,"","Serviço","Serviço","-","SINAPI",89448,"TUBO, PVC, SOLDÁVEL, DN 40MM, INSTALADO EM PRUMADA DE ÁGUA - FORNECIMENTO E INSTALAÇÃO. AF_12/2014","M",48,1,48,null,null,0,0,""]
["S",4,"S",0,4,2,2,1,0,0,0,"","Serviço","Serviço","-","SINAPI",89449,"TUBO, PVC, SOLDÁVEL, DN 50MM, INSTALADO EM PRUMADA DE ÁGUA - FORNECIMENTO E INSTALAÇÃO. AF_12/2014","M",8,1,8,null,null,0,0,""]
[4,4,4,3,4,2,2,2,0,22,3,"","Nível 4","Nível 4","-","SINAPI",null,"ADAPTADORES DE PVC SOLDÁVEL","-",null,1,"-",null,null,0,0,""]
["S",4,"S",0,4,2,2,2,0,0,0,"","Serviço","Serviço","-","SINAPI",89538,"ADAPTADOR CURTO COM BOLSA E ROSCA PARA REGISTRO, PVC, SOLDÁVEL, DN 25MM X 3/4\u0094, INSTALADO EM PRUMADA DE ÁGUA - FORNECIMENTO E INSTALAÇÃO. AF_12/2014","UN",12,1,12,null,null,0,0,""]
["S",4,"S",0,4,2,2,2,0,0,0,"","Serviço","Serviço","-","SINAPI",89596,"ADAPTADOR CURTO COM BOLSA E ROSCA PARA REGISTRO, PVC, SOLDÁVEL, DN 50MM X 1.1/2\u0094, INSTALADO EM PRUMADA DE ÁGUA - FORNECIMENTO E INSTALAÇÃO. AF_12/2014","UN",2,1,2,null,null,0,0,"Referência: AGETOP - 81069"]
[4,4,4,4,4,2,2,3,0,19,4,"","Nível 4","Nível 4","-","SINAPI",null,"BUCHAS","-",null,1,"-",null,null,0,0,""]
["S",4,"S",0,4,2,2,3,0,0,0,"","Serviço","Serviço","-","AGETOP",81162,"BUCHA DE REDUCAO SOLD.CURTA 32 X 25 MM","Un    ",1,1,1,null,null,0,0,""]
[{"$f":"CHOOSE(1+LOG(1+2*(ORÇAMENTO.Nivel=\"Nível 1\")+4*(ORÇAMENTO.Nivel=\"Nível 2\")+8*(ORÇAMENTO.Nivel=\"Nível 3\")+16*(ORÇAMENTO.Nivel=\"Nível 4\")+32*(ORÇAMENTO.Nivel=\"Serviço\"),2),0,1,2,3,4,\"S\")","v":"S"},4,"S",0,4,2,2,3,0,0,0,"","Serviço","Serviço","-","AGETOP",81602,"BUCHA DE REDUCAO LONGA DIAM. 50 X 40 MM","Un    ",1,1,1,null,null,0,0,""]
["S",4,"S",0,4,2,2,3,0,0,0,"","Serviço","Serviço","-","AGETOP",81177,"BUCHA DE REDUCAO SOLD.LONGA 40 X 25","Un    ",1,1,1,null,null,0,0,""]
[4,4,4,7,4,2,2,4,0,15,7,"","Nível 4","Nível 4","-","SINAPI",null,"JOELHO","-",null,1,"-",null,null,0,0,""]
["S",4,"S",0,4,2,2,4,0,0,0,"","Serviço","Serviço","-","SINAPI",89481,"JOELHO 90 GRAUS, PVC, SOLDÁVEL, DN 25MM, INSTALADO EM PRUMADA DE ÁGUA - FORNECIMENTO E INSTALAÇÃO. AF_12/2014","UN",17,1,17,null,null,0,0,""]
["S",4,"S",0,4,2,2,4,0,0,0,"","Serviço","Serviço","-","SINAPI",89413,"JOELHO 90 GRAUS, PVC, SOLDÁVEL, DN 32MM, INSTALADO EM RAMAL DE DISTRIBUIÇÃO DE ÁGUA - FORNECIMENTO E INSTALAÇÃO. AF_12/2014","UN",4,1,4,null,null,0,0,""]
["S",4,"S",0,4,2,2,4,0,0,0,"","Serviço","Serviço","-","SINAPI",89497,"JOELHO 90 GRAUS, PVC, SOLDÁVEL, DN 40MM, INSTALADO EM PRUMADA DE ÁGUA - FORNECIMENTO E INSTALAÇÃO. AF_12/2014","UN",2,1,2,null,null,0,0,""]
["S",4,"S",0,4,2,2,4,0,0,0,"","Serviço","Serviço","-","SINAPI",89501,"JOELHO 90 GRAUS, PVC, SOLDÁVEL, DN 50MM, INSTALADO EM PRUMADA DE ÁGUA - FORNECIMENTO E INSTALAÇÃO. AF_12/2014","UN",1,1,1,null,null,0,0,""]
["S",4,"S",0,4,2,2,4,0,0,0,"","Serviço","Serviço","-","AGETOP",81360,"JOELHO RED.90 GRAUS SOLD.C/BUCHA LATAO 25X1/2\"","Un    ",7,1,7,null,null,0,0,""]
["S",4,"S",0,4,2,2,4,0,0,0,"","Serviço","Serviço","-","SINAPI",94672,"JOELHO 90 GRAUS COM BUCHA DE LATÃO, PVC, SOLDÁVEL, DN  25 MM, X 3/4\u0094 INSTALADO EM RESERVAÇÃO DE ÁGUA DE EDIFICAÇÃO QUE POSSUA RESERVATÓRIO DE FIBRA/FIBROCIMENTO   FORNECIMENTO E INSTALAÇÃO. AF_06/2016","UN",4,1,4,null,null,0,0,""]
[4,4,4,5,4,2,2,5,0,8,5,"","Nível 4","Nível 4","-","SINAPI",null,"TÊ","-",null,1,"-",null,null,0,0,""]
["S",4,"S",0,4,2,2,5,0,0,0,"","Serviço","Serviço","-","SINAPI",89617,"TE, PVC, SOLDÁVEL, DN 25MM, INSTALADO EM PRUMADA DE ÁGUA - FORNECIMENTO E INSTALAÇÃO. AF_12/2014","UN",6,1,6,null,null,0,0,""]
["S",4,"S",0,4,2,2,5,0,0,0,"","Serviço","Serviço","-","SINAPI",89622,"TÊ DE REDUÇÃO, PVC, SOLDÁVEL, DN 32MM X 25MM, INSTALADO EM PRUMADA DE ÁGUA - FORNECIMENTO E INSTALAÇÃO. AF_12/2014","UN",2,1,2,null,null,0,0,"Referência: AGETOP - 81421"]
["S",4,"S",0,4,2,2,5,0,0,0,"","Serviço","Serviço","-","SINAPI",89624,"TÊ DE REDUÇÃO, PVC, SOLDÁVEL, DN 40MM X 32MM, INSTALADO EM PRUMADA DE ÁGUA - FORNECIMENTO E INSTALAÇÃO. AF_12/2014","UN",1,1,1,null,null,0,0,""]
["S",4,"S",0,4,2,2,5,0,0,0,"","Serviço","Serviço","-","SINAPI",89627,"TÊ DE REDUÇÃO, PVC, SOLDÁVEL, DN 50MM X 25MM, INSTALADO EM PRUMADA DE ÁGUA - FORNECIMENTO E INSTALAÇÃO. AF_12/2014","UN",1,1,1,null,null,0,0,""]
[4,4,4,3,4,2,2,6,0,3,{"$error":"#N/A"},"","Nível 4","Nível 4","-","SINAPI",null,"ADESIVOS","-",null,1,"-",null,null,0,0,""]
["S",4,"S",0,4,2,2,6,0,0,0,"","Serviço","Serviço","-","AGETOP",81501,"ADESIVO PLASTICO - FRASCO 850 G","Un    ",3,1,3,null,null,0,0,""]
["S",4,"S",0,4,2,2,6,0,0,0,"","Serviço","Serviço","-","AGETOP",81504,"SOLUCAO LIMPADORA 1000 CM3","Un    ",3,1,3,null,null,0,0,""]
[3,3,3,23,4,2,3,0,0,35,23,"","Nível 3","Nível 3","-","SINAPI",null,"ESGOTO SANITÁRIO","-",null,1,"-",null,null,0,0,""]
[4,4,4,3,4,2,3,1,0,22,3,"","Nível 4","Nível 4","-","SINAPI",null,"CORPO DE CAIXA SIFONADA / RALO","-",null,1,"-",null,null,0,0,""]
["S",4,"S",0,4,2,3,1,0,0,0,"","Serviço","Serviço","-","AGETOP",81663,"CORPO CX. SIFONADA DIAM. 150 X 150 X 50","Un    ",5,1,5,null,null,0,0,""]
["S",4,"S",0,4,2,3,1,0,0,0,"","Serviço","Serviço","-","AGETOP",81679,"CORPO RALO SIFONADO CONICO DIAM. 100 X 40","Un    ",2,1,2,null,null,0,0,""]
[4,4,4,8,4,2,3,2,0,19,8,"","Nível 4","Nível 4","-","SINAPI",null,"JOELHOS","-",null,1,"-",null,null,0,0,""]
["S",4,"S",0,4,2,3,2,0,0,0,"","Serviço","Serviço","-","SINAPI",89726,"JOELHO 45 GRAUS, PVC, SERIE NORMAL, ESGOTO PREDIAL, DN 40 MM, JUNTA SOLDÁVEL, FORNECIDO E INSTALADO EM RAMAL DE DESCARGA OU RAMAL DE ESGOTO SANITÁRIO. AF_12/2014","UN",2,1,2,null,null,0,0,""]
["S",4,"S",0,4,2,3,2,0,0,0,"","Serviço","Serviço","-","SINAPI",89802,"JOELHO 45 GRAUS, PVC, SERIE NORMAL, ESGOTO PREDIAL, DN 50 MM, JUNTA ELÁSTICA, FORNECIDO E INSTALADO EM PRUMADA DE ESGOTO SANITÁRIO OU VENTILAÇÃO. AF_12/2014","UN",9,1,9,null,null,0,0,""]
["S",4,"S",0,4,2,3,2,0,0,0,"","Serviço","Serviço","-","SINAPI",89810,"JOELHO 45 GRAUS, PVC, SERIE NORMAL, ESGOTO PREDIAL, DN 100 MM, JUNTA ELÁSTICA, FORNECIDO E INSTALADO EM PRUMADA DE ESGOTO SANITÁRIO OU VENTILAÇÃO. AF_12/2014","UN",1,1,1,null,null,0,0,""]
["S",4,"S",0,4,2,3,2,0,0,0,"","Serviço","Serviço","-","SINAPI",89724,"JOELHO 90 GRAUS, PVC, SERIE NORMAL, ESGOTO PREDIAL, DN 40 MM, JUNTA SOLDÁVEL, FORNECIDO E INSTALADO EM RAMAL DE DESCARGA OU RAMAL DE ESGOTO SANITÁRIO. AF_12/2014","UN",5,1,5,null,null,0,0,""]
["S",4,"S",0,4,2,3,2,0,0,0,"","Serviço","Serviço","-","SINAPI",89731,"JOELHO 90 GRAUS, PVC, SERIE NORMAL, ESGOTO PREDIAL, DN 50 MM, JUNTA ELÁSTICA, FORNECIDO E INSTALADO EM RAMAL DE DESCARGA OU RAMAL DE ESGOTO SANITÁRIO. AF_12/2014","UN",10,1,10,null,null,0,0,""]
["S",4,"S",0,4,2,3,2,0,0,0,"","Serviço","Serviço","-","SINAPI",89809,"JOELHO 90 GRAUS, PVC, SERIE NORMAL, ESGOTO PREDIAL, DN 100 MM, JUNTA ELÁSTICA, FORNECIDO E INSTALADO EM PRUMADA DE ESGOTO SANITÁRIO OU VENTILAÇÃO. AF_12/2014","UN",4,1,4,null,null,0,0,""]
["S",4,"S",0,4,2,3,2,0,0,0,"","Serviço","Serviço","-","AGETOP",81927,"JOELHO 90 GRAUS C/ANEL 40 mm ","Un    ",5,1,5,null,null,0,0,""]
[4,4,4,3,4,2,3,3,0,11,3,"","Nível 4","Nível 4","-","SINAPI",null,"JUNÇÕES","-",null,1,"-",null,null,0,0,""]
["S",4,"S",0,4,2,3,3,0,0,0,"","Serviço","Serviço","-","AGETOP",81973,"JUNCAO SIMPLES DIAM. 100 X 50 MM","Un    ",3,1,3,null,null,0,0,""]
["S",4,"S",0,4,2,3,3,0,0,0,"","Serviço","Serviço","-","SINAPI",89797,"JUNÇÃO SIMPLES, PVC, SERIE NORMAL, ESGOTO PREDIAL, DN 100 X 100 MM, JUNTA ELÁSTICA, FORNECIDO E INSTALADO EM RAMAL DE DESCARGA OU RAMAL DE ESGOTO SANITÁRIO. AF_12/2014","UN",1,1,1,null,null,0,0,"Referência: AGETOP - 81975"]
[{"$f":"CHOOSE(1+LOG(1+2*(ORÇAMENTO.Nivel=\"Nível 1\")+4*(ORÇAMENTO.Nivel=\"Nível 2\")+8*(ORÇAMENTO.Nivel=\"Nível 3\")+16*(ORÇAMENTO.Nivel=\"Nível 4\")+32*(ORÇAMENTO.Nivel=\"Serviço\"),2),0,1,2,3,4,\"S\")","v":4},4,4,2,4,2,3,4,0,8,2,"","Nível 4","Nível 4","-","SINAPI",null,"REDUÇÕES","-",null,1,"-",null,null,0,0,""]
["S",4,"S",0,4,2,3,4,0,0,0,"","Serviço","Serviço","-","AGETOP",81602,"BUCHA DE REDUCAO LONGA DIAM. 50 X 40 MM","Un    ",1,1,1,null,null,0,0,""]
[4,4,4,2,4,2,3,5,0,6,2,"","Nível 4","Nível 4","-","SINAPI",null,"TÊ","-",null,1,"-",null,null,0,0,""]
["S",4,"S",0,4,2,3,5,0,0,0,"","Serviço","Serviço","-","SINAPI",89825,"TE, PVC, SERIE NORMAL, ESGOTO PREDIAL, DN 50 X 50 MM, JUNTA ELÁSTICA, FORNECIDO E INSTALADO EM PRUMADA DE ESGOTO SANITÁRIO OU VENTILAÇÃO. AF_12/2014","UN",5,1,5,null,null,0,0,""]
[4,4,4,4,4,2,3,6,0,4,{"$error":"#N/A"},"","Nível 4","Nível 4","-","SINAPI",null,"TUBOS","-",null,1,"-",null,null,0,0,""]
["S",4,"S",0,4,2,3,6,0,0,0,"","Serviço","Serviço","-","SINAPI",89711,"TUBO PVC, SERIE NORMAL, ESGOTO PREDIAL, DN 40 MM, FORNECIDO E INSTALADO EM RAMAL DE DESCARGA OU RAMAL DE ESGOTO SANITÁRIO. AF_12/2014","M",9,1,9,null,null,0,0,"Referência: AGETOP - 82301"]
["S",4,"S",0,4,2,3,6,0,0,0,"","Serviço","Serviço","-","SINAPI",89798,"TUBO PVC, SERIE NORMAL, ESGOTO PREDIAL, DN 50 MM, FORNECIDO E INSTALADO EM PRUMADA DE ESGOTO SANITÁRIO OU VENTILAÇÃO. AF_12/2014","M",40,1,40,null,null,0,0,""]
["S",4,"S",0,4,2,3,6,0,0,0,"","Serviço","Serviço","-","SINAPI",89800,"TUBO PVC, SERIE NORMAL, ESGOTO PREDIAL, DN 100 MM, FORNECIDO E INSTALADO EM PRUMADA DE ESGOTO SANITÁRIO OU VENTILAÇÃO. AF_12/2014","M",33,1,33,null,null,0,0,""]
[3,3,3,5,4,2,4,0,0,12,5,"","Nível 3","Nível 3","-","SINAPI",null,"OUTROS","-",null,1,"-",null,null,0,0,""]
["S",3,"S",0,4,2,4,0,0,0,0,"","Serviço","Serviço","-","AGETOP",81825,"CAIXA DE PASSAGEM 60 X 60 CM SEM TAMPA","Un    ",6,1,6,null,null,0,0,""]
["S",3,"S",0,4,2,4,0,0,0,0,"","Serviço","Serviço","-","AGETOP",81823,"TAMPA PARA CAIXA PASSAGEM FERRO FUNDIDO T-33 - TRÁFEGO PESADO","Un    ",6,1,6,null,null,0,0,""]
["S",3,"S",0,4,2,4,0,0,0,0,"","Serviço","Serviço","-","SINAPI",98110,"CAIXA DE GORDURA PEQUENA (CAPACIDADE: 19 L), CIRCULAR, EM PVC, DIÂMETRO INTERNO= 0,3 M. AF_05/2018","UN",1,1,1,null,null,0,0,""]
["S",3,"S",0,4,2,4,0,0,0,0,"","Serviço","Serviço","-","AGETOP",81885,"TERMINAL DE VENTILACAO DIAMETRO 50 MM","Un    ",5,1,5,null,null,0,0,""]
[3,3,3,7,4,2,5,0,0,7,{"$error":"#N/A"},"","Nível 3","Nível 3","-","SINAPI",null,"INSTALAÇÕES DE INCENDIO","-",null,1,"-",null,null,0,0,""]
["S",3,"S",0,4,2,5,0,0,0,0,"","Serviço","Serviço","-","AGETOP",85006,"EXTINTOR MULTI USO EM PO A B C (6 KG) - CAPACIDADE EXTINTORA 3A 20BC","un    ",4,1,4,null,null,0,0,""]
["S",3,"S",0,4,2,5,0,0,0,0,"","Serviço","Serviço","-","AGETOP",85003,"EXTINTOR PO QUIMICO SECO (6 KG) - CAPACIDADE EXTINTORA 20 BC","Un    ",1,1,1,null,null,0,0,""]
["S",3,"S",0,4,2,5,0,0,0,0,"","Serviço","Serviço","-","SINAPI",97599,"LUMINÁRIA DE EMERGÊNCIA, COM 30 LÂMPADAS LED DE 2 W, SEM REATOR - FORNECIMENTO E INSTALAÇÃO. AF_02/2020","UN",5,1,5,null,null,0,0,""]
["S",3,"S",0,4,2,5,0,0,0,0,"","Serviço","Serviço","-","COMPOSIÇÃO","COMP 024_SEE","SINALIZADOR FOTOLUMINESCENTE PARA EXTINTOR","UN ",5,1,5,null,null,0,0,""]
["S",3,"S",0,4,2,5,0,0,0,0,"","Serviço","Serviço","-","COMPOSIÇÃO","COMP 025_SEE","SINALIZADOR FOTOLUMINESCENTE DE EMERGÊNCIA","UN ",15,1,15,null,null,0,0,""]
["S",3,"S",0,4,2,5,0,0,0,0,"","Serviço","Serviço","-","COMPOSIÇÃO","COMP 277_SEE","MARCAÇÃO NO PISO - 1X1 M PARA EXTINTOR","M2",5,1,5,null,null,0,0,""]
[1,1,1,7,5,0,0,0,0,137,7,"F","Nível 1","Nível 1","5.","SINAPI",null,"DESATIVAR FOSSA SÉPTICA","UN",1,1,1,null,null,0,0,""]
[2,2,2,6,5,1,0,0,0,6,10,"","Nível 2","Nível 2","-","SINAPI",null,"SERVIÇO EM TERRA","-",null,1,"-",null,null,0,0,""]
["S",2,"S",0,5,1,0,0,0,0,0,"","Serviço","Serviço","-","AGETOP",41004,"ESCAVACAO MECANICA","m3    ",54.37,1,54.37,null,null,0,0,""]
["S",2,"S",0,5,1,0,0,0,{"$f":"IF(OR($C276=\"S\",$C276=0),0,MATCH(0,OFFSET($D276,1,$C276,ROW($C$410)-ROW($C276)),0))","v":0},{"$f":"IF(OR($C276=\"S\",$C276=0),0,MATCH(OFFSET($D276,0,$C276)+1,OFFSET($D276,1,$C276,ROW($C$410)-ROW($C276)),0))","v":0},"","Serviço","Serviço","-","AGETOP",41005,"CARGA MECANIZADA","m3    ",54.37,1,54.37,null,null,0,0,""]
["S",2,"S",0,5,1,0,0,0,0,0,"","Serviço","Serviço","-","AGETOP",41012,"INDENIZAÇÃO DE JAZIDA","m3    ",54.37,1,54.37,null,null,0,0,""]
["S",2,"S",0,5,1,0,0,0,0,0,"","Serviço","Serviço","-","AGETOP",41006,"TRANSPORTE DE MATERIAL ESCAVADO M3.KM","m3km  ",543.69999999999993,1,543.69999999999993,null,null,0,0,""]
["S",2,"S",0,5,1,0,0,0,0,0,"","Serviço","Serviço","-","AGETOP",41009,"COMPACTAÇÃO MECÂNICA SEM CONTROLE LABORATÓRIO","m3    ",43.5,1,43.5,null,null,0,0,""]
[1,1,1,13,6,0,0,0,0,130,13,"F","Nível 1","Nível 1","6.","SINAPI",null,"TELHADO","UN",1,1,1,null,null,0,0,""]
[2,2,2,3,6,1,0,0,0,12,3,"","Nível 2","Nível 2","-","SINAPI",null,"SERVIÇOS PRELIMINARES","-",null,1,"-",null,null,0,0,""]
["S",2,"S",0,6,1,0,0,0,0,0,"","Serviço","Serviço","-","AGETOP",20102,"DEMOLICAO-COBERTURA TELHA FIBROCIMENTO/FIBRA DE VIDRO/SIMILARES C/ TRANSP. ATÉ CB. E CARGA","m2    ",787.6,1,787.6,null,null,0,0,""]
["S",2,"S",0,6,1,0,0,0,0,0,"","Serviço","Serviço","-","AGETOP",20157,"DEMOLIÇÃO CALHAS/ RUFOS EM CHAPA C/TR.AT.C.B.E CARGA","m2    ",81.849999999999994,1,81.849999999999994,null,null,0,0,""]
[2,2,2,2,6,2,0,0,0,9,2,"","Nível 2","Nível 2","-",null,null,"ESTRUTURA DE MADEIRA","-",null,1,"-",null,null,0,0,""]
["S",2,"S",0,6,2,0,0,0,0,0,"","Serviço","Serviço","-","AGETOP",140101,"ESTRUTURA-TELHA CERÂMICA V=3 A 7 M. C/FERRAGENS","m2    ",10.56,1,10.56,null,null,0,0,""]
[2,2,2,7,6,3,0,0,0,7,21,"","Nível 2","Nível 2","-","SINAPI",null,"COBERTURAS","-",null,1,"-",null,null,0,0,""]
["S",2,"S",0,6,3,0,0,0,0,0,"","Serviço","Serviço","-","AGETOP",160100,"COBERTURA COM TELHA AMERICANA  RESINADA COR VERMELHA","m2    ",798.16,1,798.16,null,null,0,0,""]
["S",2,"S",0,6,3,0,0,0,0,0,"","Serviço","Serviço","-","AGETOP",160101,"CUMEEIRA PARA TELHA AMERICANA RESINADA COR VERMELHA","m     ",39.200000000000003,1,39.200000000000003,null,null,0,0,""]
["S",2,"S",0,6,3,0,0,0,0,0,"","Serviço","Serviço","-","AGETOP",160403,"EMBOCAMENTO LATERAL  (OITOES)","m     ",28.2,1,28.2,null,null,0,0,""]
[{"$f":"CHOOSE(1+LOG(1+2*(ORÇAMENTO.Nivel=\"Nível 1\")+4*(ORÇAMENTO.Nivel=\"Nível 2\")+8*(ORÇAMENTO.Nivel=\"Nível 3\")+16*(ORÇAMENTO.Nivel=\"Nível 4\")+32*(ORÇAMENTO.Nivel=\"Serviço\"),2),0,1,2,3,4,\"S\")","v":"S"},{"$f":"IF(OR(C290=\"s\",C290=0),OFFSET(B290,-1,0),C290)","v":2},{"$f":"IF(OFFSET(C290,-1,0)=\"L\",1,IF(OFFSET(C290,-1,0)=1,2,IF(OR(A290=\"s\",A290=0),\"S\",IF(AND(OFFSET(C290,-1,0)=2,A290=4),3,IF(AND(OR(OFFSET(C290,-1,0)=\"s\",OFFSET(C290,-1,0)=0),A290<>\"s\",A290>OFFSET(B290,-1,0)),OFFSET(B290,-1,0),A290)))))","v":"S"},{"$f":"IF(OR(C290=\"S\",C290=0),0,IF(ISERROR(K290),J290,SMALL(J290:K290,1)))","v":0},{"$f":"IF($C290=1,OFFSET(E290,-1,0)+1,OFFSET(E290,-1,0))","v":6},{"$f":"IF($C290=1,0,IF($C290=2,OFFSET(F290,-1,0)+1,OFFSET(F290,-1,0)))","v":3},{"$f":"IF(AND($C290<=2,$C290<>0),0,IF($C290=3,OFFSET(G290,-1,0)+1,OFFSET(G290,-1,0)))","v":0},{"$f":"IF(AND($C290<=3,$C290<>0),0,IF($C290=4,OFFSET(H290,-1,0)+1,OFFSET(H290,-1,0)))","v":0},{"$f":"IF(AND($C290<=4,$C290<>0),0,IF(AND($C290=\"S\",$Y290>0),OFFSET(I290,-1,0)+1,OFFSET(I290,-1,0)))","v":0},0,0,"","Serviço","Serviço","-","AGETOP",160404,"EMBOCAMENTO DE BEIRAL","M     ",98.4,1,98.4,null,null,0,0,""]
["S",2,"S",0,6,3,0,0,0,0,0,"","Serviço","Serviço","-","AGETOP",160601,"CALHA DE CHAPA GALVANIZADA","m     ",39.6,1,39.6,null,null,0,0,""]
["S",2,"S",0,6,3,0,0,0,0,0,"","Serviço","Serviço","-","AGETOP",160602,"RUFO DE CHAPA GALVANIZADA","m     ",42.25,1,42.25,null,null,0,0,""]
[1,1,1,22,7,0,0,0,0,117,22,"F","Nível 1","Nível 1","7.","SINAPI",null,"BANHEIROS MASCULINO E GABINETE","UN",1,1,1,null,null,0,0,""]
[2,2,2,8,7,1,0,0,0,21,8,"","Nível 2","Nível 2","-","SINAPI",null,"SERVIÇOS PRELIMINARES","-",null,1,"-",null,null,0,0,""]
["S",2,"S",0,7,1,0,0,0,0,0,"","Serviço","Serviço","-","AGETOP",20118,"DEM.ALVEN.TIJOLO S/REAP. C/TR.ATE CB. E CARGA","m3    ",1.64,1,1.64,null,null,0,0,""]
["S",2,"S",0,7,1,0,0,0,0,0,"","Serviço","Serviço","-","AGETOP",20137,"DEMOLIÇAO BACIA SANITARIA C/ TRANSP. ATÉ CB. E CARGA","Un    ",3,1,3,null,null,0,0,""]
["S",2,"S",0,7,1,0,0,0,0,0,"","Serviço","Serviço","-","AGETOP",20138,"DEMOLIÇAO DE LAVATÓRIO C/ TRANSP. ATÉ CB. E CARGA","Un    ",2,1,2,null,null,0,0,""]
["S",2,"S",0,7,1,0,0,0,0,0,"","Serviço","Serviço","-","AGETOP",20163,"DEMOLIÇÃO DAS INSTALAÇÕES HIDROSANITÁRIAS E AFINS C/ TRANSP. ATÉ CB. E CARGA","H     ",1,1,1,null,null,0,0,""]
["S",2,"S",0,7,1,0,0,0,0,0,"","Serviço","Serviço","-","AGETOP",20106,"RETIRADA DE JANELAS OU PORTAIS C/ TRANSP. ATÉ CB. E CARGA","m2    ",2.7600000000000002,1,2.7600000000000002,null,null,0,0,""]
["S",2,"S",0,7,1,0,0,0,0,0,"","Serviço","Serviço","-","AGETOP",20111,"DEM.PISO CERAM.SOBRE LASTRO CONC.C/TR.CB.E CARGA","m2    ",9.5500000000000007,1,9.5500000000000007,null,null,0,0,""]
["S",2,"S",0,7,1,0,0,0,0,0,"","Serviço","Serviço","-","AGETOP",20115,"DEMOLIÇÃO DE REVESTIMENTOS COM AZULEJOS C/TRANSP.ATE CB. E CARGA","m2    ",45.54,1,45.54,null,null,0,0,""]
[2,2,2,3,7,2,0,0,0,13,3,"","Nível 2","Nível 2","-","SINAPI",null,"ESQUADRIAS METÁLICAS","-",null,1,"-",null,null,0,0,""]
["S",2,"S",0,7,2,0,0,0,0,0,"","Serviço","Serviço","-","AGETOP",180380,"ESQ. MAXIMO AR CHAPA/VIDRO J4 C/FERRAGENS","m2    ",0.8,1,0.8,null,null,0,0,""]
[{"$f":"CHOOSE(1+LOG(1+2*(ORÇAMENTO.Nivel=\"Nível 1\")+4*(ORÇAMENTO.Nivel=\"Nível 2\")+8*(ORÇAMENTO.Nivel=\"Nível 3\")+16*(ORÇAMENTO.Nivel=\"Nível 4\")+32*(ORÇAMENTO.Nivel=\"Serviço\"),2),0,1,2,3,4,\"S\")","v":"S"},{"$f":"IF(OR(C304=\"s\",C304=0),OFFSET(B304,-1,0),C304)","v":2},{"$f":"IF(OFFSET(C304,-1,0)=\"L\",1,IF(OFFSET(C304,-1,0)=1,2,IF(OR(A304=\"s\",A304=0),\"S\",IF(AND(OFFSET(C304,-1,0)=2,A304=4),3,IF(AND(OR(OFFSET(C304,-1,0)=\"s\",OFFSET(C304,-1,0)=0),A304<>\"s\",A304>OFFSET(B304,-1,0)),OFFSET(B304,-1,0),A304)))))","v":"S"},{"$f":"IF(OR(C304=\"S\",C304=0),0,IF(ISERROR(K304),J304,SMALL(J304:K304,1)))","v":0},{"$f":"IF($C304=1,OFFSET(E304,-1,0)+1,OFFSET(E304,-1,0))","v":7},{"$f":"IF($C304=1,0,IF($C304=2,OFFSET(F304,-1,0)+1,OFFSET(F304,-1,0)))","v":2},{"$f":"IF(AND($C304<=2,$C304<>0),0,IF($C304=3,OFFSET(G304,-1,0)+1,OFFSET(G304,-1,0)))","v":0},{"$f":"IF(AND($C304<=3,$C304<>0),0,IF($C304=4,OFFSET(H304,-1,0)+1,OFFSET(H304,-1,0)))","v":0},{"$f":"IF(AND($C304<=4,$C304<>0),0,IF(AND($C304=\"S\",$Y304>0),OFFSET(I304,-1,0)+1,OFFSET(I304,-1,0)))","v":0},0,0,"","Serviço","Serviço","-","AGETOP",180506,"PORTA DE CORRER/VIDRO (4) FOLHAS PF-6 C/ FERRAGENS","m2    ",8.08,1,8.08,null,null,0,0,""]
[2,2,2,2,7,3,0,0,0,10,2,"","Nível 2","Nível 2","-","SINAPI",null,"VIDROS","-",null,1,"-",null,null,0,0,""]
["S",2,"S",0,7,3,0,0,0,0,0,"","Serviço","Serviço","-","AGETOP",190109,"VIDRO CANELADO - COLOCADO","m2    ",0.8,1,0.8,null,null,0,0,""]
[2,2,2,2,7,4,0,0,0,8,2,"","Nível 2","Nível 2","-","SINAPI",null,"REVESTIMENTO DE PAREDE","-",null,1,"-",null,null,0,0,""]
["S",2,"S",0,7,4,0,0,0,0,0,"","Serviço","Serviço","-","SINAPI",87273,"REVESTIMENTO CERÂMICO PARA PAREDES INTERNAS COM PLACAS TIPO ESMALTADA EXTRA DE DIMENSÕES 33X45 CM APLICADAS EM AMBIENTES DE ÁREA MAIOR QUE 5 M² NA ALTURA INTEIRA DAS PAREDES. AF_06/2014","M2",45.34,1,45.34,null,null,0,0,""]
[2,2,2,2,7,5,0,0,0,6,2,"","Nível 2","Nível 2","-",null,null,"REVESTIMENTO DE PISO","-",null,1,"-",null,null,0,0,""]
["S",2,"S",0,7,5,0,0,0,0,0,"","Serviço","Serviço","-","SINAPI",87251,"REVESTIMENTO CERÂMICO PARA PISO COM PLACAS TIPO ESMALTADA EXTRA DE DIMENSÕES 45X45 CM APLICADA EM AMBIENTES DE ÁREA MAIOR QUE 10 M2. AF_06/2014","M2",9.5500000000000007,1,9.5500000000000007,null,null,0,0,""]
[2,2,2,2,7,6,0,0,0,4,2,"","Nível 2","Nível 2","-","SINAPI",null,"PINTURA","-",null,1,"-",null,null,0,0,""]
["S",2,"S",0,7,6,0,0,0,0,0,"","Serviço","Serviço","-","AGETOP",261602,"PINT.ESMALTE/ESQUAD.FERRO C/FUNDO ANTICOR.","m2    ",1.6,1,1.6,null,null,0,0,""]
[2,2,2,2,7,7,0,0,0,2,29,"","Nível 2","Nível 2","-","SINAPI",null,"DIVERSOS","-",null,1,"-",null,null,0,0,""]
["S",2,"S",0,7,7,0,0,0,0,0,"","Serviço","Serviço","-","AGETOP",271608,"BANCADA DE GRANITO C/ESPELHO","m2    ",1.17,1,1.17,null,null,0,0,""]
[1,1,1,29,8,0,0,0,0,95,29,"F","Nível 1","Nível 1","8.","SINAPI",null,"COZINHA E DEMAIS AMBIENTES","UN",1,1,1,null,null,0,0,""]
[2,2,2,8,8,1,0,0,0,28,8,"","Nível 2","Nível 2","-","SINAPI",null,"SERVIÇOS PRELIMINARES","-",null,1,"-",null,null,0,0,""]
["S",2,"S",0,8,1,0,0,0,0,0,"","Serviço","Serviço","-","AGETOP",20118,"DEM.ALVEN.TIJOLO S/REAP. C/TR.ATE CB. E CARGA","m3    ",1.86,1,1.86,null,null,0,0,""]
["S",2,"S",0,8,1,0,0,0,0,0,"","Serviço","Serviço","-","AGETOP",20106,"RETIRADA DE JANELAS OU PORTAIS C/ TRANSP. ATÉ CB. E CARGA","m2    ",3.14,1,3.14,null,null,0,0,""]
["S",2,"S",0,8,1,0,0,0,0,0,"","Serviço","Serviço","-","AGETOP",20109,"DEM.PISO CIMENT.SOBRE LASTRO CONC.C/TR.ATE CB. E CARGA","m2    ",25.3,1,25.3,null,null,0,0,""]
["S",2,"S",0,8,1,0,0,0,0,0,"","Serviço","Serviço","-","AGETOP",20111,"DEM.PISO CERAM.SOBRE LASTRO CONC.C/TR.CB.E CARGA","m2    ",22.92,1,22.92,null,null,0,0,""]
["S",2,"S",0,8,1,0,0,0,0,0,"","Serviço","Serviço","-","AGETOP",20115,"DEMOLIÇÃO DE REVESTIMENTOS COM AZULEJOS C/TRANSP.ATE CB. E CARGA","m2    ",76.45,1,76.45,null,null,0,0,""]
["S",2,"S",0,8,1,0,0,0,0,0,"","Serviço","Serviço","-","AGETOP",20139,"DEMOLIÇAO DE BANCADAS C/ TRANSP. ATÉ CB. E CARGA","m2    ",2.74,1,2.74,null,null,0,0,""]
["S",2,"S",0,8,1,0,0,0,0,0,"","Serviço","Serviço","-","AGETOP",20163,"DEMOLIÇÃO DAS INSTALAÇÕES HIDROSANITÁRIAS E AFINS C/ TRANSP. ATÉ CB. E CARGA","H     ",1,1,1,null,null,0,0,""]
[2,2,2,2,8,2,0,0,0,20,2,"","Nível 2","Nível 2","-","SINAPI",null,"ALVENARIAS E DIVISÓRIAS","-",null,1,"-",null,null,0,0,""]
["S",2,"S",0,8,2,0,0,0,0,0,"","Serviço","Serviço","-","AGETOP",100201,"ALVENARIA DE TIJOLO FURADO 1/2 VEZ - 9 x 19 x 19 - ARG. (1CALH:4ARML+100KG DE CI/M3)","m2    ",24.59,1,24.59,null,null,0,0,""]
[2,2,2,2,8,3,0,0,0,18,2,"","Nível 2","Nível 2","-",null,null,"ESQUADRIAS METÁLICAS","-",null,1,"-",null,null,0,0,""]
["S",2,"S",0,8,3,0,0,0,0,0,"","Serviço","Serviço","-","AGETOP",180501,"PORTA DE ABRIR EM CHAPA PF-1 C/FERRAGENS","m2    ",5.37,1,5.37,null,null,0,0,""]
[2,2,2,5,8,4,0,0,0,16,5,"","Nível 2","Nível 2","-","SINAPI",null,"REVESTIMENTO DE PAREDE","-",null,1,"-",null,null,0,0,""]
["S",2,"S",0,8,4,0,0,0,0,0,"","Serviço","Serviço","-","AGETOP",200101,"CHAPISCO COMUM","m2    ",50.68,1,50.68,null,null,0,0,""]
[{"$f":"CHOOSE(1+LOG(1+2*(ORÇAMENTO.Nivel=\"Nível 1\")+4*(ORÇAMENTO.Nivel=\"Nível 2\")+8*(ORÇAMENTO.Nivel=\"Nível 3\")+16*(ORÇAMENTO.Nivel=\"Nível 4\")+32*(ORÇAMENTO.Nivel=\"Serviço\"),2),0,1,2,3,4,\"S\")","v":"S"},{"$f":"IF(OR(C330=\"s\",C330=0),OFFSET(B330,-1,0),C330)","v":2},{"$f":"IF(OFFSET(C330,-1,0)=\"L\",1,IF(OFFSET(C330,-1,0)=1,2,IF(OR(A330=\"s\",A330=0),\"S\",IF(AND(OFFSET(C330,-1,0)=2,A330=4),3,IF(AND(OR(OFFSET(C330,-1,0)=\"s\",OFFSET(C330,-1,0)=0),A330<>\"s\",A330>OFFSET(B330,-1,0)),OFFSET(B330,-1,0),A330)))))","v":"S"},{"$f":"IF(OR(C330=\"S\",C330=0),0,IF(ISERROR(K330),J330,SMALL(J330:K330,1)))","v":0},{"$f":"IF($C330=1,OFFSET(E330,-1,0)+1,OFFSET(E330,-1,0))","v":8},{"$f":"IF($C330=1,0,IF($C330=2,OFFSET(F330,-1,0)+1,OFFSET(F330,-1,0)))","v":4},{"$f":"IF(AND($C330<=2,$C330<>0),0,IF($C330=3,OFFSET(G330,-1,0)+1,OFFSET(G330,-1,0)))","v":0},{"$f":"IF(AND($C330<=3,$C330<>0),0,IF($C330=4,OFFSET(H330,-1,0)+1,OFFSET(H330,-1,0)))","v":0},{"$f":"IF(AND($C330<=4,$C330<>0),0,IF(AND($C330=\"S\",$Y330>0),OFFSET(I330,-1,0)+1,OFFSET(I330,-1,0)))","v":0},{"$f":"IF(OR($C330=\"S\",$C330=0),0,MATCH(0,OFFSET($D330,1,$C330,ROW($C$410)-ROW($C330)),0))","v":0},{"$f":"IF(OR($C330=\"S\",$C330=0),0,MATCH(OFFSET($D330,0,$C330)+1,OFFSET($D330,1,$C330,ROW($C$410)-ROW($C330)),0))","v":0},"","Serviço","Serviço","-","SINAPI",87553,"EMBOÇO, PARA RECEBIMENTO DE CERÂMICA, EM ARGAMASSA TRAÇO 1:2:8, PREPARO MECÂNICO COM BETONEIRA 400L, APLICADO MANUALMENTE EM FACES INTERNAS DE PAREDES, PARA AMBIENTE COM ÁREA MAIOR QUE 10M2, ESPESSURA DE 10MM, COM EXECUÇÃO DE TALISCAS. AF_06/2014","M2",1.5,1,1.5,null,null,0,0,""]
["S",2,"S",0,8,4,0,0,0,0,0,"","Serviço","Serviço","-","SINAPI",87547,"MASSA ÚNICA, PARA RECEBIMENTO DE PINTURA, EM ARGAMASSA TRAÇO 1:2:8, PREPARO MECÂNICO COM BETONEIRA 400L, APLICADA MANUALMENTE EM FACES INTERNAS DE PAREDES, ESPESSURA DE 10MM, COM EXECUÇÃO DE TALISCAS. AF_06/2014","M2",125.63,1,125.63,null,null,0,0,""]
[{"$f":"CHOOSE(1+LOG(1+2*(ORÇAMENTO.Nivel=\"Nível 1\")+4*(ORÇAMENTO.Nivel=\"Nível 2\")+8*(ORÇAMENTO.Nivel=\"Nível 3\")+16*(ORÇAMENTO.Nivel=\"Nível 4\")+32*(ORÇAMENTO.Nivel=\"Serviço\"),2),0,1,2,3,4,\"S\")","v":"S"},{"$f":"IF(OR(C332=\"s\",C332=0),OFFSET(B332,-1,0),C332)","v":2},{"$f":"IF(OFFSET(C332,-1,0)=\"L\",1,IF(OFFSET(C332,-1,0)=1,2,IF(OR(A332=\"s\",A332=0),\"S\",IF(AND(OFFSET(C332,-1,0)=2,A332=4),3,IF(AND(OR(OFFSET(C332,-1,0)=\"s\",OFFSET(C332,-1,0)=0),A332<>\"s\",A332>OFFSET(B332,-1,0)),OFFSET(B332,-1,0),A332)))))","v":"S"},{"$f":"IF(OR(C332=\"S\",C332=0),0,IF(ISERROR(K332),J332,SMALL(J332:K332,1)))","v":0},{"$f":"IF($C332=1,OFFSET(E332,-1,0)+1,OFFSET(E332,-1,0))","v":8},{"$f":"IF($C332=1,0,IF($C332=2,OFFSET(F332,-1,0)+1,OFFSET(F332,-1,0)))","v":4},{"$f":"IF(AND($C332<=2,$C332<>0),0,IF($C332=3,OFFSET(G332,-1,0)+1,OFFSET(G332,-1,0)))","v":0},{"$f":"IF(AND($C332<=3,$C332<>0),0,IF($C332=4,OFFSET(H332,-1,0)+1,OFFSET(H332,-1,0)))","v":0},{"$f":"IF(AND($C332<=4,$C332<>0),0,IF(AND($C332=\"S\",$Y332>0),OFFSET(I332,-1,0)+1,OFFSET(I332,-1,0)))","v":0},{"$f":"IF(OR($C332=\"S\",$C332=0),0,MATCH(0,OFFSET($D332,1,$C332,ROW($C$410)-ROW($C332)),0))","v":0},{"$f":"IF(OR($C332=\"S\",$C332=0),0,MATCH(OFFSET($D332,0,$C332)+1,OFFSET($D332,1,$C332,ROW($C$410)-ROW($C332)),0))","v":0},"","Serviço","Serviço","-","SINAPI",87273,"REVESTIMENTO CERÂMICO PARA PAREDES INTERNAS COM PLACAS TIPO ESMALTADA EXTRA DE DIMENSÕES 33X45 CM APLICADAS EM AMBIENTES DE ÁREA MAIOR QUE 5 M² NA ALTURA INTEIRA DAS PAREDES. AF_06/2014","M2",1.5,1,1.5,null,null,0,0,""]
[2,2,2,2,8,5,0,0,0,11,2,"","Nível 2","Nível 2","-","SINAPI",null,"FORROS","-",null,1,"-",null,null,0,0,""]
["S",2,"S",0,8,5,0,0,0,0,0,"","Serviço","Serviço","-","AGETOP",210460,"FORRO DE PVC COM ESTRUTURA EM METALON PINTADA COM TINTA ALQUÍDICA D.F.","m2    ",15.96,1,15.96,null,null,0,0,""]
[2,2,2,3,8,6,0,0,0,9,3,"","Nível 2","Nível 2","-",null,null,"REVESTIMENTO DE PISO","-",null,1,"-",null,null,0,0,""]
["S",2,"S",0,8,6,0,0,0,0,0,"","Serviço","Serviço","-","SINAPI",87251,"REVESTIMENTO CERÂMICO PARA PISO COM PLACAS TIPO ESMALTADA EXTRA DE DIMENSÕES 45X45 CM APLICADA EM AMBIENTES DE ÁREA MAIOR QUE 10 M2. AF_06/2014","M2",26.59,1,26.59,null,null,0,0,""]
["S",2,"S",0,8,6,0,0,0,0,0,"","Serviço","Serviço","-","AGETOP",220112,"PISO CIMENTADO C/RESINA SINTÉTICA E=1CM (1 CI:3 ARMG))","m2    ",23.3,1,23.3,null,null,0,0,""]
[2,2,2,4,8,7,0,0,0,6,4,"","Nível 2","Nível 2","-","SINAPI",null,"PINTURA","-",null,1,"-",null,null,0,0,""]
["S",2,"S",0,8,7,0,0,0,0,0,"","Serviço","Serviço","-","AGETOP",261300,"EMASSAMENTO COM MASSA PVA DUAS DEMAOS","m2    ",125.63,1,125.63,null,null,0,0,""]
["S",2,"S",0,8,7,0,0,0,0,0,"","Serviço","Serviço","-","AGETOP",261001,"PINTURA LATEX ACRILICO 2 DEMAOS","m2    ",125.63,1,125.63,null,null,0,0,""]
["S",2,"S",0,8,7,0,0,0,0,0,"","Serviço","Serviço","-","AGETOP",261602,"PINT.ESMALTE/ESQUAD.FERRO C/FUNDO ANTICOR.","m2    ",16.11,1,16.11,null,null,0,0,""]
[2,2,2,2,8,8,0,0,0,{"$f":"IF(OR($C342=\"S\",$C342=0),0,MATCH(0,OFFSET($D342,1,$C342,ROW($C$410)-ROW($C342)),0))","v":2},{"$f":"IF(OR($C342=\"S\",$C342=0),0,MATCH(OFFSET($D342,0,$C342)+1,OFFSET($D342,1,$C342,ROW($C$410)-ROW($C342)),0))","v":47},"","Nível 2","Nível 2","-",null,null,"DIVERSOS","-",null,1,"-",null,null,0,0,""]
["S",2,"S",0,8,8,0,0,0,0,0,"","Serviço","Serviço","-","AGETOP",271608,"BANCADA DE GRANITO C/ESPELHO","m2    ",3.06,1,3.06,null,null,0,0,""]
[1,1,1,23,9,0,0,0,0,66,23,"F","Nível 1","Nível 1","9.","SINAPI",null,"ACESSIBILIDADE","UN",1,1,1,null,null,0,0,""]
[2,2,2,3,9,1,0,0,0,22,3,"","Nível 2","Nível 2","-","SINAPI",null,"SERVIÇOS PRELIMINARES","-",null,1,"-",null,null,0,0,""]
["S",2,"S",0,9,1,0,0,0,0,0,"","Serviço","Serviço","-","AGETOP",20109,"DEM.PISO CIMENT.SOBRE LASTRO CONC.C/TR.ATE CB. E CARGA","m2    ",1.37,1,1.37,null,null,0,0,""]
["S",2,"S",0,9,1,0,0,0,0,0,"","Serviço","Serviço","-","AGETOP",20121,"DEM. MANUAL EM CONCR.SIMPLES C/TR.ATE CB.E CARGA (O.C.)","m3    ",0.28000000000000003,1,0.28000000000000003,null,null,0,0,""]
[2,2,2,7,9,2,0,0,0,19,7,"","Nível 2","Nível 2","-","SINAPI",null,"SERVIÇO EM TERRA","-",null,1,"-",null,null,0,0,""]
["S",2,"S",0,9,2,0,0,0,0,0,"","Serviço","Serviço","-","AGETOP",41004,"ESCAVACAO MECANICA","m3    ",4.2,1,4.2,null,null,0,0,""]
["S",2,"S",0,9,2,0,0,0,0,0,"","Serviço","Serviço","-","AGETOP",41005,"CARGA MECANIZADA","m3    ",4.2,1,4.2,null,null,0,0,""]
["S",2,"S",0,9,2,0,0,0,0,0,"","Serviço","Serviço","-","AGETOP",41012,"INDENIZAÇÃO DE JAZIDA","m3    ",4.2,1,4.2,null,null,0,0,""]
["S",2,"S",0,9,2,0,0,0,0,0,"","Serviço","Serviço","-","AGETOP",41006,"TRANSPORTE DE MATERIAL ESCAVADO M3.KM","m3km  ",42,1,42,null,null,0,0,""]
["S",2,"S",0,9,2,0,0,0,0,0,"","Serviço","Serviço","-","AGETOP",41009,"COMPACTAÇÃO MECÂNICA SEM CONTROLE LABORATÓRIO","m3    ",3.36,1,3.36,null,null,0,0,""]
[{"$f":"CHOOSE(1+LOG(1+2*(ORÇAMENTO.Nivel=\"Nível 1\")+4*(ORÇAMENTO.Nivel=\"Nível 2\")+8*(ORÇAMENTO.Nivel=\"Nível 3\")+16*(ORÇAMENTO.Nivel=\"Nível 4\")+32*(ORÇAMENTO.Nivel=\"Serviço\"),2),0,1,2,3,4,\"S\")","v":"S"},{"$f":"IF(OR(C354=\"s\",C354=0),OFFSET(B354,-1,0),C354)","v":2},{"$f":"IF(OFFSET(C354,-1,0)=\"L\",1,IF(OFFSET(C354,-1,0)=1,2,IF(OR(A354=\"s\",A354=0),\"S\",IF(AND(OFFSET(C354,-1,0)=2,A354=4),3,IF(AND(OR(OFFSET(C354,-1,0)=\"s\",OFFSET(C354,-1,0)=0),A354<>\"s\",A354>OFFSET(B354,-1,0)),OFFSET(B354,-1,0),A354)))))","v":"S"},{"$f":"IF(OR(C354=\"S\",C354=0),0,IF(ISERROR(K354),J354,SMALL(J354:K354,1)))","v":0},{"$f":"IF($C354=1,OFFSET(E354,-1,0)+1,OFFSET(E354,-1,0))","v":9},{"$f":"IF($C354=1,0,IF($C354=2,OFFSET(F354,-1,0)+1,OFFSET(F354,-1,0)))","v":2},{"$f":"IF(AND($C354<=2,$C354<>0),0,IF($C354=3,OFFSET(G354,-1,0)+1,OFFSET(G354,-1,0)))","v":0},{"$f":"IF(AND($C354<=3,$C354<>0),0,IF($C354=4,OFFSET(H354,-1,0)+1,OFFSET(H354,-1,0)))","v":0},{"$f":"IF(AND($C354<=4,$C354<>0),0,IF(AND($C354=\"S\",$Y354>0),OFFSET(I354,-1,0)+1,OFFSET(I354,-1,0)))","v":0},0,0,"","Serviço","Serviço","-","AGETOP",40902,"REATERRO COM APILOAMENTO","m3    ",19.25,1,19.25,null,null,0,0,""]
[2,2,2,2,9,3,0,0,0,12,2,"","Nível 2","Nível 2","-","AGETOP",91045,"ALVENARIAS E DIVISÓRIAS","Un    ",null,1,"-",null,null,0,0,""]
["S",2,"S",0,9,3,0,0,0,0,0,"","Serviço","Serviço","-","SINAPI",72132,"ALVENARIA EM TIJOLO CERAMICO MACICO 5X10X20CM 1/2 VEZ (ESPESSURA 10CM), ASSENTADO COM ARGAMASSA TRACO 1:2:8 (CIMENTO, CAL E AREIA)","M2",4.5,1,4.5,null,null,0,0,"Referência: AGETOP - 100102"]
[2,2,2,2,9,4,0,0,0,10,2,"","Nível 2","Nível 2","-","SINAPI",null,"ESQUADRIAS METÁLICAS","-",null,1,"-",null,null,0,0,""]
["S",2,"S",0,9,4,0,0,0,0,0,"","Serviço","Serviço","-","COMPOSIÇÃO","COMP 083_SEE","CORRIMÃO PISO - SEDUC","M",23.7,1,23.7,null,null,0,0,""]
[2,2,2,3,9,5,0,0,0,8,3,"","Nível 2","Nível 2","-","SINAPI",null,"REVESTIMENTO DE PAREDE","-",null,1,"-",null,null,0,0,""]
["S",2,"S",0,9,5,0,0,0,0,0,"","Serviço","Serviço","-","AGETOP",200101,"CHAPISCO COMUM","m2    ",2.33,1,2.33,null,null,0,0,""]
["S",2,"S",0,9,5,0,0,0,0,0,"","Serviço","Serviço","-","SINAPI",87547,"MASSA ÚNICA, PARA RECEBIMENTO DE PINTURA, EM ARGAMASSA TRAÇO 1:2:8, PREPARO MECÂNICO COM BETONEIRA 400L, APLICADA MANUALMENTE EM FACES INTERNAS DE PAREDES, ESPESSURA DE 10MM, COM EXECUÇÃO DE TALISCAS. AF_06/2014","M2",2.33,1,2.33,null,null,0,0,""]
[2,2,2,3,9,6,0,0,0,5,3,"","Nível 2","Nível 2","-","SINAPI",null,"REVESTIMENTO DE PISO","-",null,1,"-",null,null,0,0,""]
["S",2,"S",0,9,6,0,0,0,0,0,"","Serviço","Serviço","-","AGETOP",220102,"PISO CONCRETO DESEMPENADO ESPESSURA = 5 CM  1:2,5:3,5","m2    ",19.25,1,19.25,null,null,0,0,""]
["S",2,"S",0,9,6,0,0,0,0,0,"","Serviço","Serviço","-","AGETOP",221126,"PISO DE LADRILHO HIDRÁULICO COLORIDO MODELO TÁTIL ( ALERTA OU DIRECIONAL) SEM LASTRO","m2    ",19.82,1,19.82,null,null,0,0,""]
[2,2,2,2,9,7,0,0,0,2,21,"","Nível 2","Nível 2","-","AGETOP",null,"PINTURA","-",null,1,"-",null,null,0,0,""]
["S",2,"S",0,9,7,0,0,0,0,0,"","Serviço","Serviço","-","AGETOP",261703,"PINT.POLIESPORTIVA - 2 DEM.(PISOS E CIMENTADOS)","m2    ",21.55,1,21.55,null,null,0,0,""]
[1,1,1,26,10,0,0,0,0,43,26,"F","Nível 1","Nível 1","10.","SINAPI",null,"BANHEIROS PARA PCD","UN",1,1,1,null,null,0,0,""]
[2,2,2,2,10,1,0,0,0,25,2,"","Nível 2","Nível 2","-","SINAPI",null,"SERVIÇOS PRELIMINARES","-",null,1,"-",null,null,0,0,""]
["S",2,"S",0,10,1,0,0,0,0,0,"","Serviço","Serviço","-","AGETOP",20121,"DEM. MANUAL EM CONCR.SIMPLES C/TR.ATE CB.E CARGA (O.C.)","m3    ",0.33,1,0.33,null,null,0,0,""]
[2,2,2,2,10,2,0,0,0,23,2,"","Nível 2","Nível 2","-","SINAPI",null,"ALVENARIAS E DIVISÓRIAS","-",null,1,"-",null,null,0,0,""]
["S",2,"S",0,10,2,0,0,0,0,0,"","Serviço","Serviço","-","AGETOP",100201,"ALVENARIA DE TIJOLO FURADO 1/2 VEZ - 9 x 19 x 19 - ARG. (1CALH:4ARML+100KG DE CI/M3)","m2    ",28.88,1,28.88,null,null,0,0,""]
[2,2,2,3,10,3,0,0,0,21,3,"","Nível 2","Nível 2","-","SINAPI",null,"ESQUADRIAS METÁLICAS","-",null,1,"-",null,null,0,0,""]
["S",2,"S",0,10,3,0,0,0,0,0,"","Serviço","Serviço","-","AGETOP",180501,"PORTA DE ABRIR EM CHAPA PF-1 C/FERRAGENS","m2    ",3.78,1,3.78,null,null,0,0,""]
[{"$f":"CHOOSE(1+LOG(1+2*(ORÇAMENTO.Nivel=\"Nível 1\")+4*(ORÇAMENTO.Nivel=\"Nível 2\")+8*(ORÇAMENTO.Nivel=\"Nível 3\")+16*(ORÇAMENTO.Nivel=\"Nível 4\")+32*(ORÇAMENTO.Nivel=\"Serviço\"),2),0,1,2,3,4,\"S\")","v":"S"},{"$f":"IF(OR(C374=\"s\",C374=0),OFFSET(B374,-1,0),C374)","v":2},{"$f":"IF(OFFSET(C374,-1,0)=\"L\",1,IF(OFFSET(C374,-1,0)=1,2,IF(OR(A374=\"s\",A374=0),\"S\",IF(AND(OFFSET(C374,-1,0)=2,A374=4),3,IF(AND(OR(OFFSET(C374,-1,0)=\"s\",OFFSET(C374,-1,0)=0),A374<>\"s\",A374>OFFSET(B374,-1,0)),OFFSET(B374,-1,0),A374)))))","v":"S"},{"$f":"IF(OR(C374=\"S\",C374=0),0,IF(ISERROR(K374),J374,SMALL(J374:K374,1)))","v":0},{"$f":"IF($C374=1,OFFSET(E374,-1,0)+1,OFFSET(E374,-1,0))","v":10},{"$f":"IF($C374=1,0,IF($C374=2,OFFSET(F374,-1,0)+1,OFFSET(F374,-1,0)))","v":3},{"$f":"IF(AND($C374<=2,$C374<>0),0,IF($C374=3,OFFSET(G374,-1,0)+1,OFFSET(G374,-1,0)))","v":0},{"$f":"IF(AND($C374<=3,$C374<>0),0,IF($C374=4,OFFSET(H374,-1,0)+1,OFFSET(H374,-1,0)))","v":0},{"$f":"IF(AND($C374<=4,$C374<>0),0,IF(AND($C374=\"S\",$Y374>0),OFFSET(I374,-1,0)+1,OFFSET(I374,-1,0)))","v":0},0,0,"","Serviço","Serviço","-","AGETOP",180380,"ESQ. MAXIMO AR CHAPA/VIDRO J4 C/FERRAGENS","m2    ",0.6,1,0.6,null,null,0,0,""]
[{"$f":"CHOOSE(1+LOG(1+2*(ORÇAMENTO.Nivel=\"Nível 1\")+4*(ORÇAMENTO.Nivel=\"Nível 2\")+8*(ORÇAMENTO.Nivel=\"Nível 3\")+16*(ORÇAMENTO.Nivel=\"Nível 4\")+32*(ORÇAMENTO.Nivel=\"Serviço\"),2),0,1,2,3,4,\"S\")","v":2},{"$f":"IF(OR(C375=\"s\",C375=0),OFFSET(B375,-1,0),C375)","v":2},{"$f":"IF(OFFSET(C375,-1,0)=\"L\",1,IF(OFFSET(C375,-1,0)=1,2,IF(OR(A375=\"s\",A375=0),\"S\",IF(AND(OFFSET(C375,-1,0)=2,A375=4),3,IF(AND(OR(OFFSET(C375,-1,0)=\"s\",OFFSET(C375,-1,0)=0),A375<>\"s\",A375>OFFSET(B375,-1,0)),OFFSET(B375,-1,0),A375)))))","v":2},{"$f":"IF(OR(C375=\"S\",C375=0),0,IF(ISERROR(K375),J375,SMALL(J375:K375,1)))","v":2},{"$f":"IF($C375=1,OFFSET(E375,-1,0)+1,OFFSET(E375,-1,0))","v":10},{"$f":"IF($C375=1,0,IF($C375=2,OFFSET(F375,-1,0)+1,OFFSET(F375,-1,0)))","v":4},{"$f":"IF(AND($C375<=2,$C375<>0),0,IF($C375=3,OFFSET(G375,-1,0)+1,OFFSET(G375,-1,0)))","v":0},{"$f":"IF(AND($C375<=3,$C375<>0),0,IF($C375=4,OFFSET(H375,-1,0)+1,OFFSET(H375,-1,0)))","v":0},{"$f":"IF(AND($C375<=4,$C375<>0),0,IF(AND($C375=\"S\",$Y375>0),OFFSET(I375,-1,0)+1,OFFSET(I375,-1,0)))","v":0},18,2,"","Nível 2","Nível 2","-","SINAPI",null,"VIDROS","-",null,1,"-",null,null,0,0,""]
[{"$f":"CHOOSE(1+LOG(1+2*(ORÇAMENTO.Nivel=\"Nível 1\")+4*(ORÇAMENTO.Nivel=\"Nível 2\")+8*(ORÇAMENTO.Nivel=\"Nível 3\")+16*(ORÇAMENTO.Nivel=\"Nível 4\")+32*(ORÇAMENTO.Nivel=\"Serviço\"),2),0,1,2,3,4,\"S\")","v":"S"},2,"S",0,10,4,0,0,0,0,0,"","Serviço","Serviço","-","AGETOP",190109,"VIDRO CANELADO - COLOCADO","m2    ",0.6,1,0.6,null,null,0,0,""]
[2,2,2,5,10,5,0,0,0,16,5,"","Nível 2","Nível 2","-","SINAPI",null,"REVESTIMENTO DE PAREDE","-",null,1,"-",null,null,0,0,""]
["S",2,"S",0,10,5,0,0,0,0,0,"","Serviço","Serviço","-","AGETOP",200101,"CHAPISCO COMUM","m2    ",53.6,1,53.6,null,null,0,0,""]
["S",2,"S",0,10,5,0,0,0,0,0,"","Serviço","Serviço","-","SINAPI",87547,"MASSA ÚNICA, PARA RECEBIMENTO DE PINTURA, EM ARGAMASSA TRAÇO 1:2:8, PREPARO MECÂNICO COM BETONEIRA 400L, APLICADA MANUALMENTE EM FACES INTERNAS DE PAREDES, ESPESSURA DE 10MM, COM EXECUÇÃO DE TALISCAS. AF_06/2014","M2",24.68,1,24.68,null,null,0,0,""]
["S",2,"S",0,10,5,0,0,0,0,0,"","Serviço","Serviço","-","SINAPI",87553,"EMBOÇO, PARA RECEBIMENTO DE CERÂMICA, EM ARGAMASSA TRAÇO 1:2:8, PREPARO MECÂNICO COM BETONEIRA 400L, APLICADO MANUALMENTE EM FACES INTERNAS DE PAREDES, PARA AMBIENTE COM ÁREA MAIOR QUE 10M2, ESPESSURA DE 10MM, COM EXECUÇÃO DE TALISCAS. AF_06/2014","M2",28.92,1,28.92,null,null,0,0,""]
["S",2,"S",0,10,5,0,0,0,0,0,"","Serviço","Serviço","-","SINAPI",87273,"REVESTIMENTO CERÂMICO PARA PAREDES INTERNAS COM PLACAS TIPO ESMALTADA EXTRA DE DIMENSÕES 33X45 CM APLICADAS EM AMBIENTES DE ÁREA MAIOR QUE 5 M² NA ALTURA INTEIRA DAS PAREDES. AF_06/2014","M2",34.020000000000003,1,34.020000000000003,null,null,0,0,""]
[2,2,2,2,10,6,0,0,0,11,2,"","Nível 2","Nível 2","-","SINAPI",null,"FORROS","-",null,1,"-",null,null,0,0,""]
["S",2,"S",0,10,6,0,0,0,0,0,"","Serviço","Serviço","-","AGETOP",210460,"FORRO DE PVC COM ESTRUTURA EM METALON PINTADA COM TINTA ALQUÍDICA D.F.","m2    ",5.0999999999999996,1,5.0999999999999996,null,null,0,0,""]
[2,2,2,2,10,7,0,0,0,9,2,"","Nível 2","Nível 2","-","SINAPI",null,"REVESTIMENTO DE PISO","-",null,1,"-",null,null,0,0,""]
["S",2,"S",0,10,7,0,0,0,0,0,"","Serviço","Serviço","-","SINAPI",87251,"REVESTIMENTO CERÂMICO PARA PISO COM PLACAS TIPO ESMALTADA EXTRA DE DIMENSÕES 45X45 CM APLICADA EM AMBIENTES DE ÁREA MAIOR QUE 10 M2. AF_06/2014","M2",5.3699999999999992,1,5.3699999999999992,null,null,0,0,""]
[2,2,2,3,10,8,0,0,0,7,3,"","Nível 2","Nível 2","-","SINAPI",null,"FERRAGENS","-",null,1,"-",null,null,0,0,""]
["S",2,"S",0,10,8,0,0,0,0,0,"","Serviço","Serviço","-","AGETOP",230176,"BARRA DE APOIO EM AÇO INOX - 80 CM ","un    ",6,1,6,null,null,0,0,""]
["S",2,"S",0,10,8,0,0,0,0,0,"","Serviço","Serviço","-","AGETOP",230174,"BARRA DE APOIO EM AÇO INOX - 40 CM","un    ",6,1,6,null,null,0,0,""]
[2,2,2,4,10,9,0,0,0,4,{"$error":"#N/A"},"","Nível 2","Nível 2","-","SINAPI",null,"PINTURA","-",null,1,"-",null,null,0,0,""]
["S",2,"S",0,10,9,0,0,0,0,0,"","Serviço","Serviço","-","AGETOP",261602,"PINT.ESMALTE/ESQUAD.FERRO C/FUNDO ANTICOR.","m2    ",12.54,1,12.54,null,null,0,0,""]
["S",2,"S",0,10,9,0,0,0,0,0,"","Serviço","Serviço","-","AGETOP",261300,"EMASSAMENTO COM MASSA PVA DUAS DEMAOS","m2    ",24.68,1,24.68,null,null,0,0,""]
["S",2,"S",0,10,9,0,0,0,0,0,"","Serviço","Serviço","-","AGETOP",261001,"PINTURA LATEX ACRILICO 2 DEMAOS","m2    ",24.68,1,24.68,null,null,0,0,""]
[1,1,1,12,11,0,0,0,0,17,12,"F","Nível 1","Nível 1","11.","SINAPI",null,"PINTURA GERAL","UN",1,1,1,null,null,0,0,""]
[2,2,2,11,11,1,0,0,0,11,14,"","Nível 2","Nível 2","-","SINAPI",null,"PINTURA","-",null,1,"-",null,null,0,0,""]
[3,3,3,4,11,1,1,0,0,10,4,"","Nível 3","Nível 3","-","SINAPI",null,"PINTURA ACRÍLICA","-",null,1,"-",null,null,0,0,""]
["S",3,"S",0,11,1,1,0,0,0,0,"","Serviço","Serviço","-","AGETOP",260104,"REMOCAO DE PINTURA ANTIGA A LATEX","m2    ",199.01,1,199.01,null,null,0,0,""]
["S",3,"S",0,11,1,1,0,0,0,0,"","Serviço","Serviço","-","AGETOP",261300,"EMASSAMENTO COM MASSA PVA DUAS DEMAOS","m2    ",199.01,1,199.01,null,null,0,0,""]
["S",3,"S",0,11,1,1,0,0,0,0,"","Serviço","Serviço","-","AGETOP",261001,"PINTURA LATEX ACRILICO 2 DEMAOS","m2    ",995.05,1,995.05,null,null,0,0,""]
[3,3,3,3,11,1,2,0,0,6,3,"","Nível 3","Nível 3","-","AGETOP",null,"ESQUADRIAS EXISTENTES","-",null,1,"-",null,null,0,0,""]
["S",3,"S",0,11,1,2,0,0,0,0,"","Serviço","Serviço","-","AGETOP",260105,"REMOCAO DE PINTURA ANTIGA A OLEO OU ESMALTE","m2    ",160.86000000000001,1,160.86000000000001,null,null,0,0,""]
["S",3,"S",0,11,1,2,0,0,0,0,"","Serviço","Serviço","-","AGETOP",261503,"PINT.ESMALTE 2 DEM. ESQ.FERRO (SEM FUNDO ANTICOR.)","m2    ",160.86000000000001,1,160.86000000000001,null,null,0,0,""]
[3,3,3,3,11,1,3,0,0,3,{"$error":"#N/A"},"","Nível 3","Nível 3","-","SINAPI",null,"EXTERNAS","-",null,1,"-",null,null,0,0,""]
["S",3,"S",0,11,1,3,0,0,0,0,"","Serviço","Serviço","-","AGETOP",260104,"REMOCAO DE PINTURA ANTIGA A LATEX","m2    ",208.43,1,208.43,null,null,0,0,""]
["S",3,"S",0,11,1,3,0,0,0,0,"","Serviço","Serviço","-","AGETOP",261000,"PINTURA LATEX ACRILICA 2 DEMAOS C/SELADOR","m2    ",416.86,1,416.86,null,null,0,0,""]
[1,1,1,5,12,0,0,0,0,5,{"$error":"#N/A"},"F","Nível 1","Nível 1","12.","SINAPI",null,"REINSTALAR PORTA","UN",1,1,1,null,null,0,0,""]
[2,2,2,2,12,1,0,0,0,4,2,"","Nível 2","Nível 2","-","SINAPI",null,"SERVIÇOS PRELIMINARES","-",null,1,"-",null,null,0,0,""]
["S",2,"S",0,12,1,0,0,0,0,0,"","Serviço","Serviço","-","AGETOP",20106,"RETIRADA DE JANELAS OU PORTAIS C/ TRANSP. ATÉ CB. E CARGA","m2    ",3.15,1,3.15,null,null,0,0,""]
[2,2,2,2,12,2,0,0,0,2,{"$error":"#N/A"},"","Nível 2","Nível 2","-","SINAPI",null,"ESQUADRIAS DE MADEIRA","-",null,1,"-",null,null,0,0,""]
["S",2,"S",0,12,2,0,0,0,0,0,"","Serviço","Serviço","-","AGETOP",180501,"PORTA DE ABRIR EM CHAPA PF-1 C/FERRAGENS","m2    ",3.15,1,3.15,null,null,0,0,""]
[-1,null,-1,null,0,0,0,0,0,null,null,"F"]
[null,null,null,null,null,null,null,null,null,null,null,"F",null,null,null,null,null,"OBS: OS QUANTITATIVOS DE MATERIAIS  DAS INSTALAÇÕES HIDROSSANITÁRIAS, ELÉTRICAS E ESPECIAIS SÃO FORNECIDOS PELOS PROFISSIONAIS RESPONSÁVEIS PELOS RESPECTIVOS PROJETOS.",null,null,null,null,"VALOR TOTAL",null,null,0]
[null,null,null,null,null,null,null,null,null,null,null,"F",null,null,null,null,null,null,null,null,null,null,"VALOR BDI (25,07%)",null,null,0]
[null,null,null,null,null,null,null,null,null,null,null,"F",null,null,null,null,null,null,null,null,null,null,"TOTAL ORÇAMENTO",null,null,0]
[null,null,null,null,null,null,null,null,null,null,null,"F"]
[null,null,null,null,null,null,null,null,null,null,null,"F",null,null,null,null,null,null,null,null,null,null,"CUSTO POR M2 ³",null,null,0]
[null,null,null,null,null,null,null,null,null,null,null,"F",null,null,null,null,null,null,null,null,null,null,"MATERIAL S/ BDI",null,null,0]
[null,null,null,null,null,null,null,null,null,null,null,"F",null,null,null,null,null,null,null,null,null,null,"MÃO DE OBRA S/ BDI",null,null,0]
[null,null,null,null,null,null,null,null,null,null,null,"F"]
[null,null,null,null,null,null,null,null,null,null,null,"F",null,null,null,null,"(1) Conforme previsto pelo DECRETO Nº 7.983, DE 8 DE ABRIL DE 2013, os preços adotados são aqueles constantes dos sistemas de referência indicados. Justifica-se o uso dos preços destas composições de custos unitários devido ao seu valor ser menor à mediana de seus correspondentes na tabela SINAPI;"]
[null,null,null,null,null,null,null,null,null,null,null,"F",null,null,null,null,"(2) Optou-se pelo uso das composições de custos da AGETOP para itens não presentes na SINAPI;"]
[null,null,null,null,null,null,null,null,null,null,null,"F",null,null,null,null,"(3) Para itens da AGETOP, os vidros não estão inclusos nas esquadrias e já foram considerados os custos de contramarco para as esquadrias de alumínio;"]
[null,null,null,null,null,null,null,null,null,null,null,"F",null,null,null,null,"(4) Nos casos em que houver execução de granitina e omissão do item AGETOP 221102, considerou-se que o quantitativo para o rodapé, de altura igual a 7cm, foi incorporado na área de piso;"]
[null,null,null,null,null,null,null,null,null,null,null,"F",null,null,null,null,"(5) O custo unitário aproximado por metro quadrado é calculado dividindo-se o valor total do orçamento pela área total de construção."]
[null,null,null,null,null,null,null,null,null,null,null,"F"]
[null,null,null,null,null,null,null,null,null,null,null,"F"]
[]
[null,null,null,null,null,null,null,null,null,null,null,null,null,null,"SOMATÓRIO DE SERVIÇOS"]
[null,null,null,null,null,null,null,null,null,null,null,null,null,null,"ITEM","DESCRIÇÃO DOS SERVIÇOS",null,null,"PREÇO SEM BDI",null,null,null,null,"PREÇO COM BDI",null,null,"PARTICIPAÇÃO ( % )"]
[null,null,null,null,null,null,null,null,null,null,null,null,null,null,"a.","SERVIÇOS PRELIMINARES",null,null,0,null,null,null,null,0,null,null,0]
[null,null,null,null,null,null,null,null,null,null,null,null,null,null,"b.","TRANSPORTES",null,null,0,null,null,null,null,0,null,null,0]
[null,null,null,null,null,null,null,null,null,null,null,null,null,null,"c.","SERVIÇO EM TERRA",null,null,0,null,null,null,null,0,null,null,0]
[null,null,null,null,null,null,null,null,null,null,null,null,null,null,"d.","FUNDAÇÕES E SONDAGENS",null,null,0,null,null,null,null,0,null,null,0]
[null,null,null,null,null,null,null,null,null,null,null,null,null,null,"e.","ESTRUTURA",null,null,0,null,null,null,null,0,null,null,0]
[null,null,null,null,null,null,null,null,null,null,null,null,null,null,"f.","INSTALAÇÕES ELÉTRICAS",null,null,0,null,null,null,null,0,null,null,0]
[null,null,null,null,null,null,null,null,null,null,null,null,null,null,"g.","INSTALAÇÕES HIDROSSANITÁRIAS",null,null,0,null,null,null,null,0,null,null,0]
[null,null,null,null,null,null,null,null,null,null,null,null,null,null,"h","INSTALAÇÕES ESPECIAIS",null,null,0,null,null,null,null,0,null,null,0]
[null,null,null,null,null,null,null,null,null,null,null,null,null,null,"i.","ALVENARIAS E DIVISÓRIAS",null,null,0,null,null,null,null,0,null,null,0]
[null,null,null,null,null,null,null,null,null,null,null,null,null,null,"j.","ALVENARIA AUTO-PORTANTE",null,null,0,null,null,null,null,0,null,null,0]
[null,null,null,null,null,null,null,null,null,null,null,null,null,null,"k.","IMPERMEABILIZAÇÃO",null,null,0,null,null,null,null,0,null,null,0]
[null,null,null,null,null,null,null,null,null,null,null,null,null,null,"l.","ISOLAMENTO TÉRMICO E ACÚSTICO",null,null,0,null,null,null,null,0,null,null,0]
[null,null,null,null,null,null,null,null,null,null,null,null,null,null,"m.","ESTRUTURA DE MADEIRA",null,null,0,null,null,null,null,0,null,null,0]
[null,null,null,null,null,null,null,null,null,null,null,null,null,null,"n.","ESTRUTURAS METÁLICAS",null,null,0,null,null,null,null,0,null,null,0]
[null,null,null,null,null,null,null,null,null,null,null,null,null,null,"o.","COBERTURAS",null,null,0,null,null,null,null,0,null,null,0]
[null,null,null,null,null,null,null,null,null,null,null,null,null,null,"p.","ESQUADRIAS DE MADEIRA",null,null,0,null,null,null,null,0,null,null,0]
[null,null,null,null,null,null,null,null,null,null,null,null,null,null,"q.","ESQUADRIAS METÁLICAS",null,null,0,null,null,null,null,0,null,null,0]
[null,null,null,null,null,null,null,null,null,null,null,null,null,null,"r.","VIDROS",null,null,0,null,null,null,null,0,null,null,0]
[null,null,null,null,null,null,null,null,null,null,null,null,null,null,"s.","REVESTIMENTO DE PAREDE",null,null,0,null,null,null,null,0,null,null,0]
[null,null,null,null,null,null,null,null,null,null,null,null,null,null,"t.","FORROS",null,null,0,null,null,null,null,0,null,null,0]
[null,null,null,null,null,null,null,null,null,null,null,null,null,null,"u.","REVESTIMENTO DE PISO",null,null,0,null,null,null,null,0,null,null,0]
[null,null,null,null,null,null,null,null,null,null,null,null,null,null,"v.","FERRAGENS",null,null,0,null,null,null,null,0,null,null,0]
[null,null,null,null,null,null,null,null,null,null,null,null,null,null,"w.","MARCENARIA",null,null,0,null,null,null,null,0,null,null,0]
[null,null,null,null,null,null,null,null,null,null,null,null,null,null,"x.","ADMINISTRAÇÃO",null,null,0,null,null,null,null,0,null,null,0]
[null,null,null,null,null,null,null,null,null,null,null,null,null,null,"y.","PINTURA",null,null,0,null,null,null,null,0,null,null,0]
[null,null,null,null,null,null,null,null,null,null,null,null,null,null,"z.","DIVERSOS",null,null,0,null,null,null,null,0,null,null,0]
[null,null,null,null,null,null,null,null,null,null,null,null,null,null,"TOTAL GERAL DO ORÇAMENTO (R$)",null,null,null,0,null,null,null,null,0,null,null,0]
[null,null,null,null,null,null,null,null,null,null,null,null,null,null,null,null,null,null,0,null,null,null,null,0,null,null,100]
[null,null,null,null,null,null,null,null,null,null,null,null,null,null,null,null,null,null,"(TOTAL SEM BDI)",null,null,null,null,"(TOTAL COM BDI)",null,null,"(ARRED porcentagem)"]
[null,null,null,null,null,null,null,null,null,null,null,null,null,null,null,null,null,null,"ERRO",null,null,null,null,"ERRO",null,null,"ERRO"]
[]
[]
[null,null,null,null,null,null,null,null,null,null,null,null,null,null,"RESUMO GERAL DO ORÇAMENTO"]
[null,null,null,null,null,null,null,null,null,null,null,null,null,null,"ITEM","DESCRIÇÃO DOS SERVIÇOS",null,null,"PREÇO SEM BDI",null,null,null,null,"PREÇO COM BDI",null,null,"PARTICIPAÇÃO ( % )"]
[null,null,null,null,null,null,null,null,null,null,null,null,null,null,"1.","AMPLIAÇÃO / REFORMA",null,null,0,null,null,null,null,0,null,null,{"$error":"#DIV/0!"}]
[null,null,null,null,null,null,null,null,null,null,null,null,null,null,"2.","PROJETO DE ESTRUTURA E FUNDAÇÕES",null,null,0,null,null,null,null,0,null,null,{"$error":"#DIV/0!"}]
[null,null,null,null,null,null,null,null,null,null,null,null,null,null,"3.","INST. ELÉTRICAS",null,null,0,null,null,null,null,0,null,null,{"$error":"#DIV/0!"}]
[null,null,null,null,null,null,null,null,null,null,null,null,null,null,"4.","INSTALAÇÕES HIDROSSANITÁRIAS E DE INCÊNDIO",null,null,0,null,null,null,null,0,null,null,{"$error":"#DIV/0!"}]
[null,null,null,null,null,null,null,null,null,null,null,null,null,null,"5.","DESATIVAR FOSSA SÉPTICA",null,null,0,null,null,null,null,0,null,null,{"$error":"#DIV/0!"}]
[null,null,null,null,null,null,null,null,null,null,null,null,null,null,"6.","TELHADO",null,null,0,null,null,null,null,0,null,null,{"$error":"#DIV/0!"}]
[null,null,null,null,null,null,null,null,null,null,null,null,null,null,"7.","BANHEIROS MASCULINO E GABINETE",null,null,0,null,null,null,null,0,null,null,{"$error":"#DIV/0!"}]
[null,null,null,null,null,null,null,null,null,null,null,null,null,null,"8.","COZINHA E DEMAIS AMBIENTES",null,null,0,null,null,null,null,0,null,null,{"$error":"#DIV/0!"}]
[null,null,null,null,null,null,null,null,null,null,null,null,null,null,"9.","ACESSIBILIDADE",null,null,0,null,null,null,null,0,null,null,{"$error":"#DIV/0!"}]
[null,null,null,null,null,null,null,null,null,null,null,null,null,null,"10.","BANHEIROS PARA PCD",null,null,0,null,null,null,null,0,null,null,{"$error":"#DIV/0!"}]
[null,null,null,null,null,null,null,null,null,null,null,null,null,null,"11.","PINTURA GERAL",null,null,0,null,null,null,null,0,null,null,{"$error":"#DIV/0!"}]
[null,null,null,null,null,null,null,null,null,null,null,null,null,null,"12.","REINSTALAR PORTA",null,null,0,null,null,null,null,0,null,null,{"$error":"#DIV/0!"}]
[null,null,null,null,null,null,null,null,null,null,null,null,null,null,"13.","",null,null,0,null,null,null,null,0,null,null,{"$error":"#DIV/0!"}]
[null,null,null,null,null,null,null,null,null,null,null,null,null,null,"14.","",null,null,0,null,null,null,null,0,null,null,{"$error":"#DIV/0!"}]
[null,null,null,null,null,null,null,null,null,null,null,null,null,null,"15.","",null,null,0,null,null,null,null,0,null,null,{"$error":"#DIV/0!"}]
[null,null,null,null,null,null,null,null,null,null,null,null,null,null,"16.","",null,null,0,null,null,null,null,0,null,null,{"$error":"#DIV/0!"}]
[null,null,null,null,null,null,null,null,null,null,null,null,null,null,"17.","",null,null,0,null,null,null,null,0,null,null,{"$error":"#DIV/0!"}]
[null,null,null,null,null,null,null,null,null,null,null,null,null,null,"18.","",null,null,0,null,null,null,null,0,null,null,{"$error":"#DIV/0!"}]
[null,null,null,null,null,null,null,null,null,null,null,null,null,null,"19.","",null,null,0,null,null,null,null,0,null,null,{"$error":"#DIV/0!"}]
[null,null,null,null,null,null,null,null,null,null,null,null,null,null,"20.","",null,null,0,null,null,null,null,0,null,null,{"$error":"#DIV/0!"}]
[null,null,null,null,null,null,null,null,null,null,null,null,null,null,"TOTAL GERAL DO ORÇAMENTO (R$)",null,null,null,0,null,null,null,null,0,null,null,{"$error":"#DIV/0!"}]
[null,null,null,null,null,null,null,null,null,null,null,null,null,null,null,null,null,null,0,null,null,null,null,0,null,null,100]
[null,null,null,null,null,null,null,null,null,null,null,null,null,null,null,null,null,null,"(TOTAL SEM BDI)",null,null,null,null,"(TOTAL COM BDI)",null,null,"(ARRED porcentagem)"]
[null,null,null,null,null,null,null,null,null,null,null,null,null,null,null,null,null,null,"ERRO",null,null,null,null,"ERRO",null,null,{"$error":"#DIV/0!"}]

{"sheet":"Resumo ","index":1,"n_rows":39,"n_cols":9,"rows_kept":39,"cut":false,"hidden":false,"merged":[[13,0,14,0],[15,2,15,5],[16,2,16,5],[17,2,17,5],[18,2,18,5],[14,1,14,8],[0,1,0,8],[36,1,36,5],[2,1,2,5],[3,1,3,5],[5,1,5,5],[6,1,6,5],[8,1,8,5],[9,1,9,5],[11,3,11,5],[12,3,12,5],[10,1,10,8],[11,6,11,8],[12,6,12,8],[19,2,19,5],[20,2,20,5],[21,2,21,5],[31,2,31,5],[1,1,1,8],[2,6,2,8],[3,6,3,8],[4,1,4,8],[5,6,5,8],[6,6,6,8],[7,1,7,8],[8,6,8,8],[9,6,9,8],[13,1,13,8],[11,1,11,2],[12,1,12,2],[42,3,42,7],[41,3,41,7],[38,1,38,8],[22,2,22,5],[23,2,23,5],[24,2,24,5],[25,2,25,5],[26,2,26,5],[32,2,32,5],[33,2,33,5],[34,2,34,5],[35,2,35,5],[27,2,27,5],[28,2,28,5],[29,2,29,5],[30,2,30,5]]}
[]
[]
[null,"UNIDADE ESCOLAR",null,null,null,null,"CÓDIGO INEP"]
[null,{"$f":"Orçamento!$O$5","v":"CRE DE LUZIÂNIA"},null,null,null,null,{"$f":"Orçamento!X5","v":0}]
[]
[null,"OBRA",null,null,null,null,"CIDADE"]
[null,{"$f":"Orçamento!$O$8","v":"AMPLIAÇÃO / REFORMA"},null,null,null,null,{"$f":"Orçamento!$X$8","v":"LUZIÂNIA"}]
[]
[null,"ENDEREÇO",null,null,null,null,"CRE"]
[null,{"$f":"Orçamento!$R$11","v":"RUA PADRE DOMINGOS - Nº13 - SETOR CENTRAL - CEP: 72.800-460"},null,null,null,null,{"$f":"Orçamento!$O$11","v":"LUZIÂNIA"}]
[]
[null,"REFERÊNCIA",null,"DATA",null,null,"ÁREA TOTAL CONSTRUÍDA (M²)"]
[null,{"$f":"CONCATENATE(\"AGETOP E SINAPI - \",Orçamento!$T$11)","v":"AGETOP E SINAPI - DESONERADA"},null,{"$f":"Orçamento!$S$8","v":"2020-06-08"},null,null,{"$f":"Orçamento!$X$14","v":715.22}]
["FILTRO"]
[null,"RESUMO GERAL DO ORÇAMENTO"]
["↓","ITEM","DESCRIÇÃO DOS SERVIÇOS",null,null,null,"PREÇO SEM BDI","PREÇO COM BDI","PARTICIP. (%)"]
[{"$f":"IF(G17>0,\"F\",\"\")","v":""},"1.",{"$f":"Orçamento!$P463","v":"AMPLIAÇÃO / REFORMA"},null,null,null,{"$f":"IFERROR(Orçamento!S463,\"-\")","v":0},{"$f":"IFERROR(Orçamento!X463,\"\")","v":0},{"$f":"Orçamento!AA463","v":{"$error":"#DIV/0!"}}]
[{"$f":"IF(G18>0,\"F\",\"\")","v":""},"2.",{"$f":"Orçamento!$P464","v":"PROJETO DE ESTRUTURA E FUNDAÇÕES"},null,null,null,{"$f":"IFERROR(Orçamento!S464,\"-\")","v":0},{"$f":"IFERROR(Orçamento!X464,\"\")","v":0},{"$f":"Orçamento!AA464","v":{"$error":"#DIV/0!"}}]
["","3.",{"$f":"Orçamento!$P465","v":"INST. ELÉTRICAS"},null,null,null,{"$f":"IFERROR(Orçamento!S465,\"-\")","v":0},{"$f":"IFERROR(Orçamento!X465,\"\")","v":0},{"$f":"Orçamento!AA465","v":{"$error":"#DIV/0!"}}]
["","4.",{"$f":"Orçamento!$P466","v":"INSTALAÇÕES HIDROSSANITÁRIAS E DE INCÊNDIO"},null,null,null,{"$f":"IFERROR(Orçamento!S466,\"-\")","v":0},{"$f":"IFERROR(Orçamento!X466,\"\")","v":0},{"$f":"Orçamento!AA466","v":{"$error":"#DIV/0!"}}]
["","5.",{"$f":"Orçamento!$P467","v":"DESATIVAR FOSSA SÉPTICA"},null,null,null,{"$f":"IFERROR(Orçamento!S467,\"-\")","v":0},{"$f":"IFERROR(Orçamento!X467,\"\")","v":0},{"$f":"Orçamento!AA467","v":{"$error":"#DIV/0!"}}]
["","6.",{"$f":"Orçamento!$P468","v":"TELHADO"},null,null,null,{"$f":"IFERROR(Orçamento!S468,\"-\")","v":0},{"$f":"IFERROR(Orçamento!X468,\"\")","v":0},{"$f":"Orçamento!AA468","v":{"$error":"#DIV/0!"}}]
["","7.",{"$f":"Orçamento!$P469","v":"BANHEIROS MASCULINO E GABINETE"},null,null,null,{"$f":"IFERROR(Orçamento!S469,\"-\")","v":0},{"$f":"IFERROR(Orçamento!X469,\"\")","v":0},{"$f":"Orçamento!AA469","v":{"$error":"#DIV/0!"}}]
["","8.",{"$f":"Orçamento!$P470","v":"COZINHA E DEMAIS AMBIENTES"},null,null,null,{"$f":"IFERROR(Orçamento!S470,\"-\")","v":0},{"$f":"IFERROR(Orçamento!X470,\"\")","v":0},{"$f":"Orçamento!AA470","v":{"$error":"#DIV/0!"}}]
["","9.",{"$f":"Orçamento!$P471","v":"ACESSIBILIDADE"},null,null,null,{"$f":"IFERROR(Orçamento!S471,\"-\")","v":0},{"$f":"IFERROR(Orçamento!X471,\"\")","v":0},{"$f":"Orçamento!AA471","v":{"$error":"#DIV/0!"}}]
["","10.",{"$f":"Orçamento!$P472","v":"BANHEIROS PARA PCD"},null,null,null,{"$f":"IFERROR(Orçamento!S472,\"-\")","v":0},{"$f":"IFERROR(Orçamento!X472,\"\")","v":0},{"$f":"Orçamento!AA472","v":{"$error":"#DIV/0!"}}]
["","11.",{"$f":"Orçamento!$P473","v":"PINTURA GERAL"},null,null,null,{"$f":"IFERROR(Orçamento!S473,\"-\")","v":0},{"$f":"IFERROR(Orçamento!X473,\"\")","v":0},{"$f":"Orçamento!AA473","v":{"$error":"#DIV/0!"}}]
["","12.",{"$f":"Orçamento!$P474","v":"REINSTALAR PORTA"},null,null,null,{"$f":"IFERROR(Orçamento!S474,\"-\")","v":0},{"$f":"IFERROR(Orçamento!X474,\"\")","v":0},{"$f":"Orçamento!AA474","v":{"$error":"#DIV/0!"}}]
["","13.",{"$f":"Orçamento!$P475","v":""},null,null,null,{"$f":"IFERROR(Orçamento!S475,\"-\")","v":0},{"$f":"IFERROR(Orçamento!X475,\"\")","v":0},{"$f":"Orçamento!AA475","v":{"$error":"#DIV/0!"}}]
["","14.",{"$f":"Orçamento!$P476","v":""},null,null,null,{"$f":"IFERROR(Orçamento!S476,\"-\")","v":0},{"$f":"IFERROR(Orçamento!X476,\"\")","v":0},{"$f":"Orçamento!AA476","v":{"$error":"#DIV/0!"}}]
["","15.",{"$f":"Orçamento!$P477","v":""},null,null,null,{"$f":"IFERROR(Orçamento!S477,\"-\")","v":0},{"$f":"IFERROR(Orçamento!X477,\"\")","v":0},{"$f":"Orçamento!AA477","v":{"$error":"#DIV/0!"}}]
["","16.",{"$f":"Orçamento!$P478","v":""},null,null,null,{"$f":"IFERROR(Orçamento!S478,\"-\")","v":0},{"$f":"IFERROR(Orçamento!X478,\"\")","v":0},{"$f":"Orçamento!AA478","v":{"$error":"#DIV/0!"}}]
["","17.",{"$f":"Orçamento!$P479","v":""},null,null,null,{"$f":"IFERROR(Orçamento!S479,\"-\")","v":0},{"$f":"IFERROR(Orçamento!X479,\"\")","v":0},{"$f":"Orçamento!AA479","v":{"$error":"#DIV/0!"}}]
["","18.",{"$f":"Orçamento!$P480","v":""},null,null,null,{"$f":"IFERROR(Orçamento!S480,\"-\")","v":0},{"$f":"IFERROR(Orçamento!X480,\"\")","v":0},{"$f":"Orçamento!AA480","v":{"$error":"#DIV/0!"}}]
["","19.",{"$f":"Orçamento!$P481","v":""},null,null,null,{"$f":"IFERROR(Orçamento!S481,\"-\")","v":0},{"$f":"IFERROR(Orçamento!X481,\"\")","v":0},{"$f":"Orçamento!AA481","v":{"$error":"#DIV/0!"}}]
["","20.",{"$f":"Orçamento!$P482","v":""},null,null,null,{"$f":"IFERROR(Orçamento!S482,\"-\")","v":0},{"$f":"IFERROR(Orçamento!X482,\"\")","v":0},{"$f":"Orçamento!AA482","v":{"$error":"#DIV/0!"}}]
["F","TOTAL GERAL DO ORÇAMENTO (R$)",null,null,null,null,{"$f":"SUM(G17:G36)","v":0},{"$f":"SUM(H17:H36)","v":0},{"$f":"SUM(I17:I36)","v":{"$error":"#DIV/0!"}}]
["F"]
["F"]

{"sheet":"Somatório","index":2,"n_rows":45,"n_cols":6,"rows_kept":45,"cut":false,"hidden":false,"merged":[[13,0,14,0],[42,1,42,2],[44,1,44,5],[47,3,47,5],[48,3,48,5],[13,1,13,5],[9,1,9,3],[9,4,9,5],[11,1,11,2],[11,4,11,5],[12,1,12,2],[12,4,12,5],[0,1,0,5],[14,1,14,5],[2,1,2,3],[2,4,2,5],[3,1,3,3],[3,4,3,5],[5,1,5,3],[5,4,5,5],[6,1,6,3],[6,4,6,5],[8,1,8,3],[8,4,8,5],[1,1,1,5],[4,1,4,5],[7,1,7,5],[10,1,10,5]]}
[]
[]
[null,"UNIDADE ESCOLAR",null,null,"CÓDIGO INEP"]
[null,{"$f":"Orçamento!$O$5","v":"CRE DE LUZIÂNIA"},null,null,{"$f":"Orçamento!X5","v":0}]
[]
[null,"OBRA",null,null,"CIDADE"]
[null,{"$f":"Orçamento!$O$8","v":"AMPLIAÇÃO / REFORMA"},null,null,{"$f":"Orçamento!$X$8","v":"LUZIÂNIA"}]
[]
[null,"ENDEREÇO",null,null,"CRE"]
[null,{"$f":"Orçamento!$R$11","v":"RUA PADRE DOMINGOS - Nº13 - SETOR CENTRAL - CEP: 72.800-460"},null,null,{"$f":"Orçamento!$O$11","v":"LUZIÂNIA"}]
[]
[null,"REFERÊNCIA",null,"DATA","ÁREA TOTAL CONSTRUÍDA (M²)"]
[null,{"$f":"CONCATENATE(\"AGETOP E SINAPI - \",Orçamento!$T$11)","v":"AGETOP E SINAPI - DESONERADA"},null,{"$f":"Orçamento!$S$8","v":"2020-06-08"},{"$f":"Orçamento!$X$14","v":715.22}]
["FILTRO"]
[null,"SOMATÓRIO DE SERVIÇOS"]
["↓","ITEM","DESCRIÇÃO DOS SERVIÇOS","PREÇO SEM BDI (R$)","PREÇO COM BDI (R$)","PARTIC.  ( % )"]
[{"$f":"IF(D17>0,\"F\",\"\")","v":""},"a.",{"$f":"Orçamento!P429","v":"SERVIÇOS PRELIMINARES"},{"$f":"Orçamento!S429","v":0},{"$f":"Orçamento!X429","v":0},{"$f":"Orçamento!AA429","v":0}]
[{"$f":"IF(D18>0,\"F\",\"\")","v":""},"b.",{"$f":"Orçamento!P430","v":"TRANSPORTES"},{"$f":"Orçamento!S430","v":0},{"$f":"Orçamento!X430","v":0},{"$f":"Orçamento!AA430","v":0}]
["","c.",{"$f":"Orçamento!P431","v":"SERVIÇO EM TERRA"},{"$f":"Orçamento!S431","v":0},{"$f":"Orçamento!X431","v":0},{"$f":"Orçamento!AA431","v":0}]
["","d.",{"$f":"Orçamento!P432","v":"FUNDAÇÕES E SONDAGENS"},{"$f":"Orçamento!S432","v":0},{"$f":"Orçamento!X432","v":0},{"$f":"Orçamento!AA432","v":0}]
["","e.",{"$f":"Orçamento!P433","v":"ESTRUTURA"},{"$f":"Orçamento!S433","v":0},{"$f":"Orçamento!X433","v":0},{"$f":"Orçamento!AA433","v":0}]
["","f.",{"$f":"Orçamento!P434","v":"INSTALAÇÕES ELÉTRICAS"},{"$f":"Orçamento!S434","v":0},{"$f":"Orçamento!X434","v":0},{"$f":"Orçamento!AA434","v":0}]
["","g.",{"$f":"Orçamento!P435","v":"INSTALAÇÕES HIDROSSANITÁRIAS"},{"$f":"Orçamento!S435","v":0},{"$f":"Orçamento!X435","v":0},{"$f":"Orçamento!AA435","v":0}]
["","h",{"$f":"Orçamento!P436","v":"INSTALAÇÕES ESPECIAIS"},{"$f":"Orçamento!S436","v":0},{"$f":"Orçamento!X436","v":0},{"$f":"Orçamento!AA436","v":0}]
["","i.",{"$f":"Orçamento!P437","v":"ALVENARIAS E DIVISÓRIAS"},{"$f":"Orçamento!S437","v":0},{"$f":"Orçamento!X437","v":0},{"$f":"Orçamento!AA437","v":0}]
["","j.",{"$f":"Orçamento!P438","v":"ALVENARIA AUTO-PORTANTE"},{"$f":"Orçamento!S438","v":0},{"$f":"Orçamento!X438","v":0},{"$f":"Orçamento!AA438","v":0}]
["","k.",{"$f":"Orçamento!P439","v":"IMPERMEABILIZAÇÃO"},{"$f":"Orçamento!S439","v":0},{"$f":"Orçamento!X439","v":0},{"$f":"Orçamento!AA439","v":0}]
["","l.",{"$f":"Orçamento!P440","v":"ISOLAMENTO TÉRMICO E ACÚSTICO"},{"$f":"Orçamento!S440","v":0},{"$f":"Orçamento!X440","v":0},{"$f":"Orçamento!AA440","v":0}]
["","m.",{"$f":"Orçamento!P441","v":"ESTRUTURA DE MADEIRA"},{"$f":"Orçamento!S441","v":0},{"$f":"Orçamento!X441","v":0},{"$f":"Orçamento!AA441","v":0}]
["","n.",{"$f":"Orçamento!P442","v":"ESTRUTURAS METÁLICAS"},{"$f":"Orçamento!S442","v":0},{"$f":"Orçamento!X442","v":0},{"$f":"Orçamento!AA442","v":0}]
["","o.",{"$f":"Orçamento!P443","v":"COBERTURAS"},{"$f":"Orçamento!S443","v":0},{"$f":"Orçamento!X443","v":0},{"$f":"Orçamento!AA443","v":0}]
["","p.",{"$f":"Orçamento!P444","v":"ESQUADRIAS DE MADEIRA"},{"$f":"Orçamento!S444","v":0},{"$f":"Orçamento!X444","v":0},{"$f":"Orçamento!AA444","v":0}]
["","q.",{"$f":"Orçamento!P445","v":"ESQUADRIAS METÁLICAS"},{"$f":"Orçamento!S445","v":0},{"$f":"Orçamento!X445","v":0},{"$f":"Orçamento!AA445","v":0}]
["","r.",{"$f":"Orçamento!P446","v":"VIDROS"},{"$f":"Orçamento!S446","v":0},{"$f":"Orçamento!X446","v":0},{"$f":"Orçamento!AA446","v":0}]
["","s.",{"$f":"Orçamento!P447","v":"REVESTIMENTO DE PAREDE"},{"$f":"Orçamento!S447","v":0},{"$f":"Orçamento!X447","v":0},{"$f":"Orçamento!AA447","v":0}]
["","t.",{"$f":"Orçamento!P448","v":"FORROS"},{"$f":"Orçamento!S448","v":0},{"$f":"Orçamento!X448","v":0},{"$f":"Orçamento!AA448","v":0}]
["","u.",{"$f":"Orçamento!P449","v":"REVESTIMENTO DE PISO"},{"$f":"Orçamento!S449","v":0},{"$f":"Orçamento!X449","v":0},{"$f":"Orçamento!AA449","v":0}]
["","v.",{"$f":"Orçamento!P450","v":"FERRAGENS"},{"$f":"Orçamento!S450","v":0},{"$f":"Orçamento!X450","v":0},{"$f":"Orçamento!AA450","v":0}]
["","w.",{"$f":"Orçamento!P451","v":"MARCENARIA"},{"$f":"Orçamento!S451","v":0},{"$f":"Orçamento!X451","v":0},{"$f":"Orçamento!AA451","v":0}]
["","x.",{"$f":"Orçamento!P452","v":"ADMINISTRAÇÃO"},{"$f":"Orçamento!S452","v":0},{"$f":"Orçamento!X452","v":0},{"$f":"Orçamento!AA452","v":0}]
["","y.",{"$f":"Orçamento!P453","v":"PINTURA"},{"$f":"Orçamento!S453","v":0},{"$f":"Orçamento!X453","v":0},{"$f":"Orçamento!AA453","v":0}]
["","z.",{"$f":"Orçamento!P454","v":"DIVERSOS"},{"$f":"Orçamento!S454","v":0},{"$f":"Orçamento!X454","v":0},{"$f":"Orçamento!AA454","v":0}]
["F","TOTAL GERAL DO ORÇAMENTO",null,{"$f":"SUM(D17:D42)","v":0},{"$f":"SUM(E17:E42)","v":0},{"$f":"SUM(F17:F42)","v":0}]
[]
[null,"(*) Para itens da AGETOP, os vidros não estão inclusos nas esquadrias e já foram considerados os custos de contramarco para as esquadrias de alumínio;"]

{"sheet":"Cronog_60_Dias","index":3,"n_rows":99,"n_cols":14,"rows_kept":99,"cut":false,"hidden":false,"merged":[[12,0,13,0],[9,0,11,0],[11,1,11,13],[92,1,92,2],[92,5,92,8],[92,9,92,12],[93,1,93,2],[93,5,93,8],[93,9,93,12],[74,9,74,12],[74,5,74,8],[68,9,68,12],[70,5,70,8],[70,9,70,12],[59,5,59,8],[71,1,73,2],[71,4,73,4],[71,5,71,8],[71,9,71,12],[73,5,73,8],[73,9,73,12],[59,9,59,12],[61,5,61,8],[61,9,61,12],[94,1,94,2],[94,5,94,8],[94,9,94,12],[76,5,76,8],[76,9,76,12],[77,5,77,8],[77,9,77,12],[79,5,79,8],[79,9,79,12],[80,5,80,8],[80,9,80,12],[82,5,82,8],[82,9,82,12],[77,3,79,3],[80,3,82,3],[86,1,88,2],[80,4,82,4],[83,3,85,3],[77,1,79,2],[77,4,79,4],[80,1,82,2],[95,1,95,2],[95,5,95,8],[95,9,95,12],[97,1,97,4],[98,1,98,13],[86,9,86,12],[88,5,88,8],[88,9,88,12],[85,5,85,8],[85,9,85,12],[89,1,91,2],[89,4,91,4],[89,5,89,8],[89,9,89,12],[91,5,91,8],[91,9,91,12],[89,3,91,3],[86,4,88,4],[86,5,86,8],[86,3,88,3],[83,1,85,2],[83,4,85,4],[83,5,83,8],[83,9,83,12],[68,5,68,8],[65,5,65,8],[65,9,65,12],[67,5,67,8],[67,9,67,12],[65,3,67,3],[62,9,62,12],[64,5,64,8],[64,9,64,12],[62,5,62,8],[53,9,53,12],[55,5,55,8],[55,9,55,12],[50,5,50,8],[50,9,50,12],[52,5,52,8],[52,9,52,12],[56,9,56,12],[58,5,58,8],[58,9,58,12],[53,5,53,8],[56,5,56,8],[44,9,44,12],[46,5,46,8],[46,9,46,12],[47,1,49,2],[47,4,49,4],[47,5,47,8],[47,9,47,12],[49,5,49,8],[49,9,49,12],[44,5,44,8],[47,3,49,3],[44,3,46,3],[44,1,46,2],[44,4,46,4],[35,9,35,12],[37,5,37,8],[37,9,37,12],[35,3,37,3],[40,9,40,12],[38,3,40,3],[38,9,38,12],[41,1,43,2],[41,4,43,4],[41,5,41,8],[41,9,41,12],[43,5,43,8],[43,9,43,12],[41,3,43,3],[35,5,35,8],[38,5,38,8],[40,5,40,8],[35,1,37,2],[35,4,37,4],[38,1,40,2],[38,4,40,4],[29,9,29,12],[31,5,31,8],[31,9,31,12],[32,1,34,2],[32,4,34,4],[32,5,32,8],[32,9,32,12],[34,5,34,8],[34,9,34,12],[32,3,34,3],[29,5,29,8],[29,1,31,2],[29,4,31,4],[29,3,31,3],[23,9,23,12],[25,5,25,8],[25,9,25,12],[26,1,28,2],[26,4,28,4],[26,5,26,8],[26,9,26,12],[28,5,28,8],[28,9,28,12],[23,3,25,3],[23,1,25,2],[23,4,25,4],[23,5,23,8],[26,3,28,3],[20,4,22,4],[20,5,20,8],[20,9,20,12],[22,5,22,8],[22,9,22,12],[20,3,22,3],[14,3,16,3],[17,3,19,3],[14,4,16,4],[14,5,14,8],[14,9,14,12],[16,5,16,8],[16,9,16,12],[65,1,67,2],[68,3,70,3],[62,3,64,3],[68,1,70,2],[56,3,58,3],[65,4,67,4],[74,3,76,3],[50,4,52,4],[74,4,76,4],[56,1,58,2],[56,4,58,4],[50,3,52,3],[53,3,55,3],[68,4,70,4],[62,1,64,2],[62,4,64,4],[59,3,61,3],[53,1,55,2],[53,4,55,4],[59,1,61,2],[59,4,61,4],[74,1,76,2],[10,1,10,13],[9,8,9,13],[8,8,8,13],[3,8,3,13],[6,8,6,13],[5,8,5,13],[2,8,2,13],[50,1,52,2],[71,3,73,3],[12,13,13,13],[13,1,13,2],[13,5,13,8],[13,9,13,12],[12,3,13,3],[12,9,12,12],[14,1,16,2],[12,5,12,8],[17,1,19,2],[17,4,19,4],[17,5,17,8],[17,9,17,12],[19,5,19,8],[19,9,19,12],[20,1,22,2],[0,1,0,13],[2,1,2,7],[3,1,3,7],[5,1,5,7],[6,1,6,7],[8,1,8,7],[9,1,9,7],[1,1,1,13],[7,1,7,13],[4,1,4,13]]}
[]
[]
[null,"UNIDADE ESCOLAR",null,null,null,null,null,null,"PRAZO"]
[null,{"$f":"Orçamento!$O$5","v":"CRE DE LUZIÂNIA"},null,null,null,null,null,null,"60 DIAS CORRIDOS"]
[]
[null,"OBRA",null,null,null,null,null,null,"DATA"]
[null,{"$f":"Orçamento!$O$8","v":"AMPLIAÇÃO / REFORMA"},null,null,null,null,null,null,{"$f":"Orçamento!$S$8","v":"2020-06-08"}]
[]
[null,"LOCAL",null,null,null,null,null,null,"ÁREA TOTAL CONSTRUÍDA (M²)"]
["FILTRO",{"$f":"Orçamento!$X$8","v":"LUZIÂNIA"},null,null,null,null,null,null,{"$f":"Orçamento!$X$14","v":715.22}]
[]
[null,"CRONOGRAMA - FÍSICO FINANCEIRO"]
["↓","CUSTO TOTAL:",{"$f":"D93","v":0},"VALOR","Dias:",30,null,null,null,60,null,null,null,"TOTAL"]
[null,"DESCRIÇÃO DOS SERVIÇOS",null,null,"%","1ª PARCELA",null,null,null,"2ª PARCELA"]
[{"$f":"IF(D15>0,\"F\",\"\")","v":""},"SERVIÇOS PRELIMINARES",null,{"$f":"Orçamento!X429","v":0},{"$f":"Orçamento!AA429","v":0},{"$f":"ROUND(F17*$D$15,2)","v":0},null,null,null,{"$f":"ROUND(J17*$D$15,2)","v":0},null,null,null,{"$f":"SUM(F15:M15)","v":0}]
[{"$f":"IF(A15=\"F\",A15,\"\")","v":""}]
[{"$f":"IF(A16=\"F\",A16,\"\")","v":""},null,null,null,null,1,null,null,null,{"$f":"1-F17","v":0},null,null,null,{"$f":"IFERROR(E15/100,\"\")","v":0}]
[{"$f":"IF(D18>0,\"F\",\"\")","v":""},"TRANSPORTES",null,{"$f":"Orçamento!X430","v":0},{"$f":"Orçamento!AA430","v":0},{"$f":"ROUND(F20*$D$18,2)","v":0},null,null,null,{"$f":"ROUND(J20*$D$18,2)","v":0},null,null,null,{"$f":"SUM(F18:M18)","v":0}]
[{"$f":"IF(A18=\"F\",A18,\"\")","v":""}]
[{"$f":"IF(A19=\"F\",A19,\"\")","v":""},null,null,null,null,0.48,null,null,null,{"$f":"1-F20","v":0.52},null,null,null,{"$f":"IFERROR(E18/100,\"\")","v":0}]
[{"$f":"IF(D21>0,\"F\",\"\")","v":""},"SERVIÇO EM TERRA",null,{"$f":"Orçamento!X431","v":0},{"$f":"Orçamento!AA431","v":0},{"$f":"ROUND(F23*$D$21,2)","v":0},null,null,null,{"$f":"ROUND(J23*$D$21,2)","v":0},null,null,null,{"$f":"SUM(F21:M21)","v":0}]
[{"$f":"IF(A21=\"F\",A21,\"\")","v":""}]
[{"$f":"IF(A22=\"F\",A22,\"\")","v":""},null,null,null,null,1,null,null,null,{"$f":"1-F23","v":0},null,null,null,{"$f":"IFERROR(E21/100,\"\")","v":0}]
[{"$f":"IF(D24>0,\"F\",\"\")","v":""},"FUNDAÇÕES E SONDAGENS",null,{"$f":"Orçamento!X432","v":0},{"$f":"Orçamento!AA432","v":0},{"$f":"ROUND(F26*$D$24,2)","v":0},null,null,null,{"$f":"ROUND(J26*$D$24,2)","v":0},null,null,null,{"$f":"SUM(F24:M24)","v":0}]
[{"$f":"IF(A24=\"F\",A24,\"\")","v":""}]
[{"$f":"IF(A25=\"F\",A25,\"\")","v":""},null,null,null,null,1,null,null,null,{"$f":"1-F26","v":0},null,null,null,{"$f":"IFERROR(E24/100,\"\")","v":0}]
[{"$f":"IF(D27>0,\"F\",\"\")","v":""},"ESTRUTURA",null,{"$f":"Orçamento!X433","v":0},{"$f":"Orçamento!AA433","v":0},{"$f":"ROUND(F29*$D$27,2)","v":0},null,null,null,{"$f":"ROUND(J29*$D$27,2)","v":0},null,null,null,{"$f":"SUM(F27:M27)","v":0}]
[{"$f":"IF(A27=\"F\",A27,\"\")","v":""}]
[{"$f":"IF(A28=\"F\",A28,\"\")","v":""},null,null,null,null,0.49,null,null,null,{"$f":"1-F29","v":0.51},null,null,null,{"$f":"IFERROR(E27/100,\"\")","v":0}]
[{"$f":"IF(D30>0,\"F\",\"\")","v":""},"INST.ELET/TELEFÔNICA/CABEAMENTO ESTRUTURADO",null,{"$f":"Orçamento!X434","v":0},{"$f":"Orçamento!AA434","v":0},{"$f":"ROUND(F32*$D$30,2)","v":0},null,null,null,{"$f":"ROUND(J32*$D$30,2)","v":0},null,null,null,{"$f":"SUM(F30:M30)","v":0}]
[{"$f":"IF(A30=\"F\",A30,\"\")","v":""}]
[{"$f":"IF(A31=\"F\",A31,\"\")","v":""},null,null,null,null,0.4,null,null,null,{"$f":"1-F32","v":0.6},null,null,null,{"$f":"IFERROR(E30/100,\"\")","v":0}]
[{"$f":"IF(D33>0,\"F\",\"\")","v":""},"INSTALAÇÕES HIDROSSANITÁRIAS",null,{"$f":"Orçamento!X435","v":0},{"$f":"Orçamento!AA435","v":0},{"$f":"ROUND(F35*$D$33,2)","v":0},null,null,null,{"$f":"ROUND(J35*$D$33,2)","v":0},null,null,null,{"$f":"SUM(F33:M33)","v":0}]
[{"$f":"IF(A33=\"F\",A33,\"\")","v":""}]
[{"$f":"IF(A34=\"F\",A34,\"\")","v":""},null,null,null,null,0.48,null,null,null,{"$f":"1-F35","v":0.52},null,null,null,{"$f":"IFERROR(E33/100,\"\")","v":0}]
[{"$f":"IF(D36>0,\"F\",\"\")","v":""},"INSTALAÇÕES ESPECIAIS",null,{"$f":"Orçamento!X436","v":0},{"$f":"Orçamento!AA436","v":0},{"$f":"ROUND(F38*$D$36,2)","v":0},null,null,null,{"$f":"ROUND(J38*$D$36,2)","v":0},null,null,null,{"$f":"SUM(F36:M36)","v":0}]
[{"$f":"IF(A36=\"F\",A36,\"\")","v":""}]
[{"$f":"IF(A37=\"F\",A37,\"\")","v":""},null,null,null,null,1,null,null,null,{"$f":"1-F38","v":0},null,null,null,{"$f":"IFERROR(E36/100,\"\")","v":0}]
[{"$f":"IF(D39>0,\"F\",\"\")","v":""},"ALVENARIA E DIVISÓRIAS",null,{"$f":"Orçamento!X437","v":0},{"$f":"Orçamento!AA437","v":0},{"$f":"ROUND(F41*$D$39,2)","v":0},null,null,null,{"$f":"ROUND(J41*$D$39,2)","v":0},null,null,null,{"$f":"SUM(F39:M39)","v":0}]
[{"$f":"IF(A39=\"F\",A39,\"\")","v":""}]
[{"$f":"IF(A40=\"F\",A40,\"\")","v":""},null,null,null,null,1,null,null,null,{"$f":"1-F41","v":0},null,null,null,{"$f":"IFERROR(E39/100,\"\")","v":0}]
[{"$f":"IF(D42>0,\"F\",\"\")","v":""},"ALVENARIA AUTO-PORTANTE",null,{"$f":"Orçamento!X438","v":0},{"$f":"Orçamento!AA438","v":0},{"$f":"ROUND(F44*$D$42,2)","v":0},null,null,null,{"$f":"ROUND(J44*$D$42,2)","v":0},null,null,null,{"$f":"SUM(F42:M42)","v":0}]
[{"$f":"IF(A42=\"F\",A42,\"\")","v":""}]
[{"$f":"IF(A43=\"F\",A43,\"\")","v":""},null,null,null,null,1,null,null,null,{"$f":"1-F44","v":0},null,null,null,{"$f":"IFERROR(E42/100,\"\")","v":0}]
[{"$f":"IF(D45>0,\"F\",\"\")","v":""},"IMPERMEABILIZAÇÃO",null,{"$f":"Orçamento!X439","v":0},{"$f":"Orçamento!AA439","v":0},{"$f":"ROUND(F47*$D$45,2)","v":0},null,null,null,{"$f":"ROUND(J47*$D$45,2)","v":0},null,null,null,{"$f":"SUM(F45:M45)","v":0}]
[{"$f":"IF(A45=\"F\",A45,\"\")","v":""}]
[{"$f":"IF(A46=\"F\",A46,\"\")","v":""},null,null,null,null,1,null,null,null,{"$f":"1-F47","v":0},null,null,null,{"$f":"IFERROR(E45/100,\"\")","v":0}]
[{"$f":"IF(D48>0,\"F\",\"\")","v":""},"ISOLAMENTO TÉRMICO E ACÚSTICO",null,{"$f":"Orçamento!X440","v":0},{"$f":"Orçamento!AA440","v":0},{"$f":"ROUND(F50*$D$48,2)","v":0},null,null,null,{"$f":"ROUND(J50*$D$48,2)","v":0},null,null,null,{"$f":"SUM(F48:M48)","v":0}]
[{"$f":"IF(A48=\"F\",A48,\"\")","v":""}]
[{"$f":"IF(A49=\"F\",A49,\"\")","v":""},null,null,null,null,0.5,null,null,null,{"$f":"1-F50","v":0.5},null,null,null,{"$f":"IFERROR(E48/100,\"\")","v":0}]
[{"$f":"IF(D51>0,\"F\",\"\")","v":""},"ESTRUTURA DE MADEIRA",null,{"$f":"Orçamento!X441","v":0},{"$f":"Orçamento!AA441","v":0},{"$f":"ROUND(F53*$D$51,2)","v":0},null,null,null,{"$f":"ROUND(J53*$D$51,2)","v":0},null,null,null,{"$f":"SUM(F51:M51)","v":0}]
[{"$f":"IF(A51=\"F\",A51,\"\")","v":""}]
[{"$f":"IF(A52=\"F\",A52,\"\")","v":""},null,null,null,null,0.4,null,null,null,{"$f":"1-F53","v":0.6},null,null,null,{"$f":"IFERROR(E51/100,\"\")","v":0}]
[{"$f":"IF(D54>0,\"F\",\"\")","v":""},"ESTRUTURA METÁLICA",null,{"$f":"Orçamento!X442","v":0},{"$f":"Orçamento!AA442","v":0},{"$f":"ROUND(F56*$D$54,2)","v":0},null,null,null,{"$f":"ROUND(J56*$D$54,2)","v":0},null,null,null,{"$f":"SUM(F54:M54)","v":0}]
[{"$f":"IF(A54=\"F\",A54,\"\")","v":""}]
[{"$f":"IF(A55=\"F\",A55,\"\")","v":""},null,null,null,null,0.35,null,null,null,{"$f":"1-F56","v":0.65},null,null,null,{"$f":"IFERROR(E54/100,\"\")","v":0}]
[{"$f":"IF(D57>0,\"F\",\"\")","v":""},"COBERTURAS",null,{"$f":"Orçamento!X443","v":0},{"$f":"Orçamento!AA443","v":0},{"$f":"ROUND(F59*$D$57,2)","v":0},null,null,null,{"$f":"ROUND(J59*$D$57,2)","v":0},null,null,null,{"$f":"SUM(F57:M57)","v":0}]
[{"$f":"IF(A57=\"F\",A57,\"\")","v":""}]
[{"$f":"IF(A58=\"F\",A58,\"\")","v":""},null,null,null,null,0,null,null,null,{"$f":"1-F59","v":1},null,null,null,{"$f":"IFERROR(E57/100,\"\")","v":0}]
[{"$f":"IF(D60>0,\"F\",\"\")","v":""},"ESQUADRIAS DE MADEIRA",null,{"$f":"Orçamento!X444","v":0},{"$f":"Orçamento!AA444","v":0},{"$f":"ROUND(F62*$D$60,2)","v":0},null,null,null,{"$f":"ROUND(J62*$D$60,2)","v":0},null,null,null,{"$f":"SUM(F60:M60)","v":0}]
[{"$f":"IF(A60=\"F\",A60,\"\")","v":""}]
[{"$f":"IF(A61=\"F\",A61,\"\")","v":""},null,null,null,null,0.54,null,null,null,{"$f":"1-F62","v":0.45999999999999996},null,null,null,{"$f":"IFERROR(E60/100,\"\")","v":0}]
[{"$f":"IF(D63>0,\"F\",\"\")","v":""},"ESQUADRIAS METÁLICAS",null,{"$f":"Orçamento!X445","v":0},{"$f":"Orçamento!AA445","v":0},{"$f":"ROUND(F65*$D$63,2)","v":0},null,null,null,{"$f":"ROUND(J65*$D$63,2)","v":0},null,null,null,{"$f":"SUM(F63:M63)","v":0}]
[{"$f":"IF(A63=\"F\",A63,\"\")","v":""}]
[{"$f":"IF(A64=\"F\",A64,\"\")","v":""},null,null,null,null,0.49,null,null,null,{"$f":"1-F65","v":0.51},null,null,null,{"$f":"IFERROR(E63/100,\"\")","v":0}]
[{"$f":"IF(D66>0,\"F\",\"\")","v":""},"VIDROS",null,{"$f":"Orçamento!X446","v":0},{"$f":"Orçamento!AA446","v":0},{"$f":"ROUND(F68*$D$66,2)","v":0},null,null,null,{"$f":"ROUND(J68*$D$66,2)","v":0},null,null,null,{"$f":"SUM(F66:M66)","v":0}]
[{"$f":"IF(A66=\"F\",A66,\"\")","v":""}]
[{"$f":"IF(A67=\"F\",A67,\"\")","v":""},null,null,null,null,0,null,null,null,{"$f":"1-F68","v":1},null,null,null,{"$f":"IFERROR(E66/100,\"\")","v":0}]
[{"$f":"IF(D69>0,\"F\",\"\")","v":""},"REVESTIMENTO DE PAREDE",null,{"$f":"Orçamento!X447","v":0},{"$f":"Orçamento!AA447","v":0},{"$f":"ROUND(F71*$D$69,2)","v":0},null,null,null,{"$f":"ROUND(J71*$D$69,2)","v":0},null,null,null,{"$f":"SUM(F69:M69)","v":0}]
[{"$f":"IF(A69=\"F\",A69,\"\")","v":""}]
[{"$f":"IF(A70=\"F\",A70,\"\")","v":""},null,null,null,null,0.32,null,null,null,{"$f":"1-F71","v":0.67999999999999994},null,null,null,{"$f":"IFERROR(E69/100,\"\")","v":0}]
[{"$f":"IF(D72>0,\"F\",\"\")","v":""},"FORROS",null,{"$f":"Orçamento!X448","v":0},{"$f":"Orçamento!AA448","v":0},{"$f":"ROUND(F74*$D$72,2)","v":0},null,null,null,{"$f":"ROUND(J74*$D$72,2)","v":0},null,null,null,{"$f":"SUM(F72:M72)","v":0}]
[{"$f":"IF(A72=\"F\",A72,\"\")","v":""}]
[{"$f":"IF(A73=\"F\",A73,\"\")","v":""},null,null,null,null,0.24,null,null,null,{"$f":"1-F74","v":0.76},null,null,null,{"$f":"IFERROR(E72/100,\"\")","v":0}]
[{"$f":"IF(D75>0,\"F\",\"\")","v":""},"REVESTIMENTO DE PISO",null,{"$f":"Orçamento!X449","v":0},{"$f":"Orçamento!AA449","v":0},{"$f":"ROUND(F77*$D$75,2)","v":0},null,null,null,{"$f":"ROUND(J77*$D$75,2)","v":0},null,null,null,{"$f":"SUM(F75:M75)","v":0}]
[{"$f":"IF(A75=\"F\",A75,\"\")","v":""}]
[{"$f":"IF(A76=\"F\",A76,\"\")","v":""},null,null,null,null,0.49,null,null,null,{"$f":"1-F77","v":0.51},null,null,null,{"$f":"IFERROR(E75/100,\"\")","v":0}]
[{"$f":"IF(D78>0,\"F\",\"\")","v":""},"FERRAGENS",null,{"$f":"Orçamento!X450","v":0},{"$f":"Orçamento!AA450","v":0},{"$f":"ROUND(F80*$D$78,2)","v":0},null,null,null,{"$f":"ROUND(J80*$D$78,2)","v":0},null,null,null,{"$f":"SUM(F78:M78)","v":0}]
[{"$f":"IF(A78=\"F\",A78,\"\")","v":""}]
[{"$f":"IF(A79=\"F\",A79,\"\")","v":""},null,null,null,null,0,null,null,null,{"$f":"1-F80","v":1},null,null,null,{"$f":"IFERROR(E78/100,\"\")","v":0}]
[{"$f":"IF(D81>0,\"F\",\"\")","v":""},"MARCENARIA",null,{"$f":"Orçamento!X451","v":0},{"$f":"Orçamento!AA451","v":0},{"$f":"ROUND(F83*$D$81,2)","v":0},null,null,null,{"$f":"ROUND(J83*$D$81,2)","v":0},null,null,null,{"$f":"SUM(F81:M81)","v":0}]
[{"$f":"IF(A81=\"F\",A81,\"\")","v":""}]
[{"$f":"IF(A82=\"F\",A82,\"\")","v":""},null,null,null,null,0.4,null,null,null,{"$f":"1-F83","v":0.6},null,null,null,{"$f":"IFERROR(E81/100,\"\")","v":0}]
[{"$f":"IF(D84>0,\"F\",\"\")","v":""},"ADMINISTRAÇÃO - MENSALISTAS",null,{"$f":"Orçamento!X452","v":0},{"$f":"Orçamento!AA452","v":0},{"$f":"ROUND(F86*$D$84,2)","v":0},null,null,null,{"$f":"ROUND(J86*$D$84,2)","v":0},null,null,null,{"$f":"SUM(F84:M84)","v":0}]
[{"$f":"IF(A84=\"F\",A84,\"\")","v":""}]
[{"$f":"IF(A85=\"F\",A85,\"\")","v":""},null,null,null,null,0.49,null,null,null,{"$f":"1-F86","v":0.51},null,null,null,{"$f":"IFERROR(E84/100,\"\")","v":0}]
[{"$f":"IF(D87>0,\"F\",\"\")","v":""},"PINTURA",null,{"$f":"Orçamento!X453","v":0},{"$f":"Orçamento!AA453","v":0},{"$f":"ROUND(F89*$D$87,2)","v":0},null,null,null,{"$f":"ROUND(J89*$D$87,2)","v":0},null,null,null,{"$f":"SUM(F87:M87)","v":0}]
[{"$f":"IF(A87=\"F\",A87,\"\")","v":""}]
[{"$f":"IF(A88=\"F\",A88,\"\")","v":""},null,null,null,null,0,null,null,null,{"$f":"1-F89","v":1},null,null,null,{"$f":"IFERROR(E87/100,\"\")","v":0}]
[{"$f":"IF(D90>0,\"F\",\"\")","v":""},"DIVERSOS",null,{"$f":"Orçamento!X454","v":0},{"$f":"Orçamento!AA454","v":0},{"$f":"ROUND(F92*$D$90,2)","v":0},null,null,null,{"$f":"ROUND(J92*$D$90,2)","v":0},null,null,null,{"$f":"SUM(F90:M90)","v":0}]
[{"$f":"IF(A90=\"F\",A90,\"\")","v":""}]
[{"$f":"IF(A91=\"F\",A91,\"\")","v":""},null,null,null,null,0.46,null,null,null,{"$f":"1-F92","v":0.54},null,null,null,{"$f":"IFERROR(E90/100,\"\")","v":0}]
["F","CUSTO DO ORÇAMENTO",null,{"$f":"SUM(D15:D92)","v":0},{"$f":"SUM(E15:E92)","v":0},{"$f":"F15+F18+F21+F24+F27+F30+F33+F36+F39+F42+F45+F48+F51+F54+F57+F60+F63+F66+F69+F72+F75+F78+F81+F84+F87+F90","v":0},null,null,null,{"$f":"J15+J18+J21+J24+J27+J30+J33+J36+J39+J42+J45+J48+J51+J54+J57+J60+J63+J66+J69+J72+J75+J78+J81+J84+J87+J90","v":0},null,null,null,{"$f":"N15+N18+N21+N24+N27+N30+N33+N36+N39+N42+N45+N48+N51+N54+N57+N60+N63+N66+N69+N72+N75+N78+N81+N84+N87+N90","v":0}]
["F","PERCENTUAIS:",null,null,null,{"$f":"IFERROR(F93/D93,\"\")","v":""},null,null,null,{"$f":"IFERROR(J93/D93,\"\")","v":""},null,null,null,{"$f":"SUM(F94:M94)","v":0}]
["F","TOTAIS ACUMULADOS:",null,null,null,{"$f":"F93","v":0},null,null,null,{"$f":"F95+J93","v":0}]
["F","PERCENTUAIS  ACUMULADOS:",null,null,null,{"$f":"F94","v":""},null,null,null,{"$f":"IFERROR(F96+J94,\"\")","v":""}]
["F"]
["F","OBSERVAÇÕES:"]
["F","Os pagamentos somente poderão ser efetuados mediante medição e atesto pelos técnicos da Secretaria da Educação. "]

{"sheet":"Composição BDI","index":4,"n_rows":45,"n_cols":4,"rows_kept":45,"cut":false,"hidden":false,"merged":[[17,0,17,3],[16,0,16,3],[44,0,44,3],[42,0,42,3],[43,0,43,3],[18,0,18,3],[36,0,36,3],[39,0,39,3],[38,0,38,3],[40,0,40,3],[29,0,29,2],[32,0,32,3],[33,0,33,3],[34,0,34,3],[35,0,35,3],[0,0,0,3],[2,0,2,3],[3,0,3,3],[1,0,1,3],[5,0,5,3],[4,0,4,3],[12,0,12,3],[13,0,13,3],[14,0,14,3],[15,0,15,3],[6,0,6,3],[8,0,8,3],[7,0,7,3],[9,0,9,3],[11,0,11,3],[10,0,10,3]]}
[]
[]
["UNIDADE ESCOLAR"]
["CRE DE LUZIÂNIA"]
[]
["OBRA"]
["AMPLIAÇÃO / REFORMA"]
[]
["ENDEREÇO"]
["RUA PADRE DOMINGOS - Nº13 - SETOR CENTRAL - CEP: 72.800-460"]
[]
["CIDADE"]
["LUZIÂNIA"]
[]
["CRE"]
["LUZIÂNIA"]
[]
["DETALHAMENTO DA COMPOSIÇÃO DE BDI"]
["COMPOSIÇÃO BDI PARA OBRAS CIVIS"]
["DESCRIÇÃO","COEF.","TAXA % (a.m)","% no preço de venda"]
["1) COFINS",1,0.03,0.03]
["2) PIS",1,6.4999999999999997E-3,6.4999999999999997E-3]
["3) ISSQN",1,0.03,0.03]
["4) CPRB",1,4.4999999999999998E-2,4.4999999999999998E-2]
["5) Administração Central",1,0.03,0.03]
["6) Despesas Financeiras",1,5.5999999999999999E-3,5.5999999999999999E-3]
["7) Seguros + Garantias",1,1.1999999999999999E-3,1.1999999999999999E-3]
["8) Risco",1,9.7000000000000003E-3,9.7000000000000003E-3]
["9) Lucro",1,6.1600000000000002E-2,6.1600000000000002E-2]
["BDI - FINAL",null,null,0.25065565432076564]
[]
["Notas:"]
["(1) e (2) Alíquota definida por lei."]
["(3) Alíquota e base de cálculo definidas pela legislação municipal."]
["(4) Alíquota definida pelas leis 12.546/11, 12844/13 e 13.161/15 (CPRB – contribuição previdenciária sobre a receita bruta)."]
["(5) Valores definidos a partir dos limites no Acórdão nº 2.622/2013 - TCU – Plenário. Valores entre o 1º e 3º quartis."]
["(6) Valor calculado pela expressão matemática do acórdão 2.369/2011 – TCU – Plenário e disponibilizado pela AGETOP em dezembro de 2018. (Foi utilizado para o cálculo a média da Taxa SELIC no período de 11/2017 a 10/2018)"]
[]
["(7) Valores definidos pela AGETOP a partir dos limites no Acórdão nº 2.622/2013 - TCU – Plenário. Valores médios. \n\nObservação da AGETOP: (Seguros contra erros de execução, incêndio e explosão, danos da natureza (vendaval, destelhamento, alagamento, inundação, desmoronamento, geadas etc.), emprego de material defeituoso ou inadequado, roubo e/ou furto qualificado, quebra de equipamentos, desmoronamento de estrutura, nas modalidades de Obras Civis em Construção (OCC); Instalação e Montagem (IM); e Obras Civis em Construção e Instalação e Montagem (OCC/IM). Bem como coberturas adicionais para ampliação dessas coberturas básicas, como: cobertura de responsabilidade civil geral, cobertura de responsabilidade civil cruzada, cobertura de despesas extraordinárias, cobertura de tumultos, cobertura de desentulho do local, cobertura de riscos do fabricante, dentre outras, incluindo o seguro de vida em grupo regido pela convenção coletiva dos trabalhadores na indústria da construção civil). A partir de 24/02/2015 por intermédio da Portaria 449/2015 a Presidência da AGETOP, na pessoa do Senhor Jayme Eduardo Rincon, determinou a exclusão dos valores referentes aos Seguros de Risco de Engenharia e Responsabilidade Civil do Profissional na composição do cálculo do B.D.I.."]
["(8) Valores definidos a partir dos limites no Acórdão nº 2.622/2013 - TCU – Plenário. Valores entre 1º e 3° quartis."]
["(9) Valores definidos a partir dos limites definidos no Acórdão nº 2.622/2013 - TCU – Plenário. Valores adotados e praticados no mercado ( “ ex ante ” ) ou aqueles entre os 1º e 3º quartis."]
[]
["(*) A fórmula para estipulação da taxa de BDI estimado adotado é a mesma que foi aplicada para a obtenção das tabelas contidas no Acórdão n. 2.622/2013 – TCUPlenário"]
[]
["Obs.: Para obras com valores superiores a R$ 20.000.000,00 sugere-se recalcular o BDI, dimensionando as taxas de administração central e lucro para patamares inferiores ao estipulado acima."]

{"sheet":"Relatório CENTRAL","index":5,"n_rows":40,"n_cols":5,"rows_kept":40,"cut":false,"hidden":false,"merged":[[0,1,0,4],[6,3,6,4],[9,3,9,4],[1,1,1,4],[2,1,2,2],[2,3,2,4],[3,1,3,2],[3,3,3,4],[4,1,4,4],[5,1,5,2],[5,3,5,4],[6,1,6,2],[7,1,7,4],[8,1,8,2],[8,3,8,4],[9,1,9,2],[10,1,10,4],[11,1,11,4],[39,1,39,2],[9,0,11,0]]}
[]
[]
[null,"UNIDADE ESCOLAR",null,"CIDADE"]
[null,{"$f":"Orçamento!$O$5","v":"CRE DE LUZIÂNIA"},null,{"$f":"Orçamento!$X$8","v":"LUZIÂNIA"}]
[]
[null,"OBRA",null,"CRE"]
[null,{"$f":"Orçamento!$O$8","v":"AMPLIAÇÃO / REFORMA"},null,{"$f":"Orçamento!$O$11","v":"LUZIÂNIA"}]
[]
[null,"ENDEREÇO",null,"DATA"]
["FILTRO",{"$f":"Orçamento!$R$11","v":"RUA PADRE DOMINGOS - Nº13 - SETOR CENTRAL - CEP: 72.800-460"},null,{"$f":"Orçamento!$S$8","v":"2020-06-08"}]
[]
[null,"RELATÓRIO CENTRAL"]
["↓","CÓDIGO","ETAPA","PREÇO  (R$) C/ BDI","PARTIC  ( % )"]
[{"$f":"IF(D14>0,\"F\",\"\")","v":""},{"$f":"Orçamento!O429","v":"a."},{"$f":"Orçamento!P429","v":"SERVIÇOS PRELIMINARES"},{"$f":"Orçamento!X429","v":0},{"$f":"Orçamento!AA429","v":0}]
[{"$f":"IF(D15>0,\"F\",\"\")","v":""},{"$f":"Orçamento!O430","v":"b."},{"$f":"Orçamento!P430","v":"TRANSPORTES"},{"$f":"Orçamento!X430","v":0},{"$f":"Orçamento!AA430","v":0}]
["",{"$f":"Orçamento!O431","v":"c."},{"$f":"Orçamento!P431","v":"SERVIÇO EM TERRA"},{"$f":"Orçamento!X431","v":0},{"$f":"Orçamento!AA431","v":0}]
["",{"$f":"Orçamento!O432","v":"d."},{"$f":"Orçamento!P432","v":"FUNDAÇÕES E SONDAGENS"},{"$f":"Orçamento!X432","v":0},{"$f":"Orçamento!AA432","v":0}]
["",{"$f":"Orçamento!O433","v":"e."},{"$f":"Orçamento!P433","v":"ESTRUTURA"},{"$f":"Orçamento!X433","v":0},{"$f":"Orçamento!AA433","v":0}]
["",{"$f":"Orçamento!O434","v":"f."},{"$f":"Orçamento!P434","v":"INSTALAÇÕES ELÉTRICAS"},{"$f":"Orçamento!X434","v":0},{"$f":"Orçamento!AA434","v":0}]
["",{"$f":"Orçamento!O435","v":"g."},{"$f":"Orçamento!P435","v":"INSTALAÇÕES HIDROSSANITÁRIAS"},{"$f":"Orçamento!X435","v":0},{"$f":"Orçamento!AA435","v":0}]
["",{"$f":"Orçamento!O436","v":"h"},{"$f":"Orçamento!P436","v":"INSTALAÇÕES ESPECIAIS"},{"$f":"Orçamento!X436","v":0},{"$f":"Orçamento!AA436","v":0}]
["",{"$f":"Orçamento!O437","v":"i."},{"$f":"Orçamento!P437","v":"ALVENARIAS E DIVISÓRIAS"},{"$f":"Orçamento!X437","v":0},{"$f":"Orçamento!AA437","v":0}]
["",{"$f":"Orçamento!O438","v":"j."},{"$f":"Orçamento!P438","v":"ALVENARIA AUTO-PORTANTE"},{"$f":"Orçamento!X438","v":0},{"$f":"Orçamento!AA438","v":0}]
["",{"$f":"Orçamento!O439","v":"k."},{"$f":"Orçamento!P439","v":"IMPERMEABILIZAÇÃO"},{"$f":"Orçamento!X439","v":0},{"$f":"Orçamento!AA439","v":0}]
["",{"$f":"Orçamento!O440","v":"l."},{"$f":"Orçamento!P440","v":"ISOLAMENTO TÉRMICO E ACÚSTICO"},{"$f":"Orçamento!X440","v":0},{"$f":"Orçamento!AA440","v":0}]
["",{"$f":"Orçamento!O441","v":"m."},{"$f":"Orçamento!P441","v":"ESTRUTURA DE MADEIRA"},{"$f":"Orçamento!X441","v":0},{"$f":"Orçamento!AA441","v":0}]
["",{"$f":"Orçamento!O442","v":"n."},{"$f":"Orçamento!P442","v":"ESTRUTURAS METÁLICAS"},{"$f":"Orçamento!X442","v":0},{"$f":"Orçamento!AA442","v":0}]
["",{"$f":"Orçamento!O443","v":"o."},{"$f":"Orçamento!P443","v":"COBERTURAS"},{"$f":"Orçamento!X443","v":0},{"$f":"Orçamento!AA443","v":0}]
["",{"$f":"Orçamento!O444","v":"p."},{"$f":"Orçamento!P444","v":"ESQUADRIAS DE MADEIRA"},{"$f":"Orçamento!X444","v":0},{"$f":"Orçamento!AA444","v":0}]
["",{"$f":"Orçamento!O445","v":"q."},{"$f":"Orçamento!P445","v":"ESQUADRIAS METÁLICAS"},{"$f":"Orçamento!X445","v":0},{"$f":"Orçamento!AA445","v":0}]
["",{"$f":"Orçamento!O446","v":"r."},{"$f":"Orçamento!P446","v":"VIDROS"},{"$f":"Orçamento!X446","v":0},{"$f":"Orçamento!AA446","v":0}]
["",{"$f":"Orçamento!O447","v":"s."},{"$f":"Orçamento!P447","v":"REVESTIMENTO DE PAREDE"},{"$f":"Orçamento!X447","v":0},{"$f":"Orçamento!AA447","v":0}]
["",{"$f":"Orçamento!O448","v":"t."},{"$f":"Orçamento!P448","v":"FORROS"},{"$f":"Orçamento!X448","v":0},{"$f":"Orçamento!AA448","v":0}]
["",{"$f":"Orçamento!O449","v":"u."},{"$f":"Orçamento!P449","v":"REVESTIMENTO DE PISO"},{"$f":"Orçamento!X449","v":0},{"$f":"Orçamento!AA449","v":0}]
["",{"$f":"Orçamento!O450","v":"v."},{"$f":"Orçamento!P450","v":"FERRAGENS"},{"$f":"Orçamento!X450","v":0},{"$f":"Orçamento!AA450","v":0}]
["",{"$f":"Orçamento!O451","v":"w."},{"$f":"Orçamento!P451","v":"MARCENARIA"},{"$f":"Orçamento!X451","v":0},{"$f":"Orçamento!AA451","v":0}]
["",{"$f":"Orçamento!O452","v":"x."},{"$f":"Orçamento!P452","v":"ADMINISTRAÇÃO"},{"$f":"Orçamento!X452","v":0},{"$f":"Orçamento!AA452","v":0}]
["",{"$f":"Orçamento!O453","v":"y."},{"$f":"Orçamento!P453","v":"PINTURA"},{"$f":"Orçamento!X453","v":0},{"$f":"Orçamento!AA453","v":0}]
["",{"$f":"Orçamento!O454","v":"z."},{"$f":"Orçamento!P454","v":"DIVERSOS"},{"$f":"Orçamento!X454","v":0},{"$f":"Orçamento!AA454","v":0}]
["F","TOTAL GERAL DO ORÇAMENTO (R$) C/BDI",null,{"$f":"SUM(D14:D39)","v":0},{"$f":"SUM(E14:E39)","v":0}]

{"sheet":"Parc Maior Relev","index":6,"n_rows":33,"n_cols":7,"rows_kept":33,"cut":false,"hidden":false,"merged":[[10,1,10,6],[6,1,6,3],[6,4,6,6],[7,1,7,6],[8,1,8,3],[8,4,8,6],[33,3,33,7],[31,1,31,6],[0,1,0,6],[11,1,11,6],[1,1,1,6],[2,1,2,3],[2,4,2,6],[3,1,3,3],[3,4,3,6],[4,1,4,6],[5,1,5,3],[5,4,5,6],[9,1,9,3],[9,4,9,6]]}
[]
[]
[null,"UNIDADE ESCOLAR",null,null,"CÓDIGO INEP"]
[null,{"$f":"Orçamento!$O$5","v":"CRE DE LUZIÂNIA"},null,null,{"$f":"Orçamento!$X$5","v":0}]
[]
[null,"OBRA",null,null,"CIDADE"]
[null,{"$f":"Orçamento!$O$8","v":"AMPLIAÇÃO / REFORMA"},null,null,{"$f":"Orçamento!$X$8","v":"LUZIÂNIA"}]
[]
[null,"CRE",null,null,"ÁREA TOTAL CONSTRUÍDA (M²)"]
[null,{"$f":"Orçamento!$O$11","v":"LUZIÂNIA"},null,null,{"$f":"Orçamento!$X$14","v":715.22}]
[]
["FILTRO","PARCELA DE MAIOR RELEVÂNCIA"]
[{"$f":"IF(G14>0,\"F\",\"\")","v":""},"CÓDIGO","SERVIÇO","DESCRIÇÃO","UNID","QUANT","PARC. MAIOR RELEV (100%)"]
[{"$f":"IF(G14>0,\"F\",\"\")","v":""},"f.","INSTALAÇÕES ELÉTRICAS","SUBESTAÇÃO","KVA",{"$f":"SUMIF(Orçamento!$R$21:$R$410,'Parc Maior Relev'!D14,Orçamento!$T$21:$T$410)","v":0},{"$f":"F14","v":0}]
[{"$f":"IF(SUM(G16:G30)>0,\"F\",\"\")","v":"F"},"CÓDIGO","SERVIÇO","DESCRIÇÃO","UNID","QUANT","PARC. MAIOR RELEV (50%)"]
[{"$f":"IF(G16>0,\"F\",\"\")","v":""},"e.","ESTRUTURA","CONCRETO","M3",{"$f":"SUMIF(Orçamento!$R$21:$R$410,'Parc Maior Relev'!D16,Orçamento!$T$21:$T$410)","v":0},{"$f":"F16*0.5","v":0}]
[{"$f":"IF(G17>0,\"F\",\"\")","v":"F"},"f.","INSTALAÇÕES ELÉTRICAS","INSTALAÇÕES ELÉTRICAS","KVA",46,{"$f":"F17*0.5","v":23}]
[{"$f":"IF(G18>0,\"F\",\"\")","v":"F"},"o.","COBERTURAS","COBERTURA CERÂMICA","M2",{"$f":"Orçamento!T287","v":798.16},399.08]
["","o.","COBERTURAS","COBERTURA COM TELHA METÁLICA","M2",{"$f":"SUMIF(Orçamento!$R$21:$R$410,'Parc Maior Relev'!D19,Orçamento!$T$21:$T$410)","v":0},0]
["","s.","REVESTIMENTO DE PAREDE","CHAPISCO","M2",{"$f":"SUMIF(Orçamento!$R$21:$R$410,'Parc Maior Relev'!D20,Orçamento!$T$21:$T$410)","v":0},0]
["","s.","REVESTIMENTO DE PAREDE","REBOCO","M2",{"$f":"SUMIF(Orçamento!$R$21:$R$410,'Parc Maior Relev'!D21,Orçamento!$T$21:$T$410)","v":0},0]
["","s.","REVESTIMENTO DE PAREDE","REVESTIMENTO CERÂMICO","M2",{"$f":"SUMIF(Orçamento!$R$21:$R$410,'Parc Maior Relev'!D22,Orçamento!$T$21:$T$410)","v":0},0]
["","t.","FORROS","FORRO DE GESSO","M2",{"$f":"SUMIF(Orçamento!$R$21:$R$410,'Parc Maior Relev'!D23,Orçamento!$T$21:$T$410)","v":0},0]
["","t.","FORROS","FORRO DE PVC","M2",{"$f":"SUMIF(Orçamento!$R$21:$R$410,'Parc Maior Relev'!D24,Orçamento!$T$21:$T$410)","v":0},0]
["","t.","FORROS","FORRO DE GESSO ACARTONADO","M2",{"$f":"SUMIF(Orçamento!$R$21:$R$410,'Parc Maior Relev'!D25,Orçamento!$T$21:$T$410)","v":0},0]
["","u.","REVESTIMENTO DE PISO","PISO DE GRANITINA","M2",{"$f":"SUMIF(Orçamento!$R$21:$R$410,'Parc Maior Relev'!D26,Orçamento!$T$21:$T$410)","v":0},0]
["","u.","REVESTIMENTO DE PISO","PISO LAMINADO","M2",{"$f":"SUMIF(Orçamento!$R$21:$R$410,'Parc Maior Relev'!D27,Orçamento!$T$21:$T$410)","v":0},0]
["","u.","REVESTIMENTO DE PISO","PISO DE CONCRETO DESEMPENADO","M2",{"$f":"SUMIF(Orçamento!$R$21:$R$410,'Parc Maior Relev'!D28,Orçamento!$T$21:$T$410)","v":0},0]
["","u.","REVESTIMENTO DE PISO","PISO CERÂMICO","M2",{"$f":"SUMIF(Orçamento!$R$21:$R$410,'Parc Maior Relev'!D29,Orçamento!$T$21:$T$410)","v":0},0]
["","y.","PINTURA","PINTURA","M2",{"$f":"SUMIF(Orçamento!$R$21:$R$410,'Parc Maior Relev'!D30,Orçamento!$T$21:$T$410)","v":0},0]
["F"]
["F","(*) Para os fins do inciso I dp § 1º do Art. 30 da Lei Federal 8.666/93, são consideradas parcelas de maior relevância técnica as execuções apresentadas"]
["F"]