{"text_format":"1","workbook":"xlsx","n_sheets":8,"sheets":["Orçamento","Resumo ","Somatório","Cronog_30_Dias","Composição BDI","Relatório CENTRAL","Parc Maior Relev","Composições"],"not_rendered":{"charts":0,"images":4,"macros":1,"external_links":0,"defined_names":104,"comments":2,"pivot_tables":0},"unopened":[],"bounds":{"document_bytes":16777216,"sheet_cells":100000,"rows_first":2000,"rows_last":500,"rows_between":2000,"halvings":0,"cell_chars":16384,"cell_head_chars":4096},"cells_cut":0,"cells_raw":0,"read":"whole","date_system":"1900"}

{"sheet":"Orçamento","index":0,"n_rows":456,"n_cols":27,"rows_kept":456,"cut":false,"hidden":false,"merged":[[7,12,7,13],[6,12,6,13],[13,23,13,25],[12,23,12,25],[10,19,10,22],[425,23,425,25],[426,23,426,25],[427,23,427,25],[423,23,423,25],[398,23,398,25],[399,23,399,25],[400,23,400,25],[401,23,401,25],[402,23,402,25],[403,23,403,25],[404,23,404,25],[405,23,405,25],[406,23,406,25],[407,23,407,25],[408,23,408,25],[409,23,409,25],[410,23,410,25],[411,23,411,25],[412,23,412,25],[446,23,446,25],[447,23,447,25],[448,23,448,25],[431,23,431,25],[432,23,432,25],[433,23,433,25],[434,23,434,25],[435,23,435,25],[436,23,436,25],[437,23,437,25],[438,23,438,25],[439,23,439,25],[440,23,440,25],[441,23,441,25],[442,23,442,25],[443,23,443,25],[444,23,444,25],[445,23,445,25],[426,18,426,22],[1,14,1,24],[9,14,9,16],[10,14,10,16],[12,14,12,16],[13,14,13,16],[15,14,15,24],[2,14,2,24],[5,14,5,24],[8,14,8,24],[410,18,410,22],[407,15,407,17],[408,15,408,17],[409,15,409,17],[419,18,419,22],[417,18,417,22],[380,23,380,24],[425,18,425,22],[412,18,412,22],[405,18,405,22],[419,15,419,17],[420,15,420,17],[421,15,421,17],[422,15,422,17],[427,18,427,22],[403,18,403,22],[404,18,404,22],[402,18,402,22],[411,18,411,22],[393,18,393,24],[399,18,399,22],[400,18,400,22],[401,18,401,22],[424,18,424,22],[422,18,422,22],[423,18,423,22],[413,18,413,22],[420,18,420,22],[416,18,416,22],[418,18,418,22],[414,18,414,22],[415,18,415,22],[424,23,424,25],[418,23,418,25],[419,23,419,25],[420,23,420,25],[421,23,421,25],[422,23,422,25],[423,15,423,17],[396,14,396,26],[380,17,385,17],[397,18,397,22],[398,18,398,22],[406,18,406,22],[407,18,407,22],[408,18,408,22],[409,18,409,22],[421,18,421,22],[418,15,418,17],[398,15,398,17],[399,15,399,17],[400,15,400,17],[401,15,401,17],[402,15,402,17],[403,15,403,17],[404,15,404,17],[405,15,405,17],[406,15,406,17],[415,23,415,25],[416,23,416,25],[417,23,417,25],[412,15,412,17],[392,16,392,24],[9,18,9,20],[410,15,410,17],[411,15,411,17],[413,15,413,17],[414,15,414,17],[415,15,415,17],[416,15,416,17],[417,15,417,17],[391,16,391,24],[381,23,381,24],[382,23,382,24],[397,23,397,25],[413,23,413,25],[414,23,414,25],[397,15,397,17],[0,14,0,26],[388,16,388,24],[389,16,389,24],[390,16,390,24],[11,14,11,26],[14,14,14,26],[3,14,3,22],[4,14,4,22],[6,18,6,22],[7,18,7,22],[12,18,12,22],[13,18,13,22],[7,14,7,17],[6,14,6,17],[4,23,4,25],[3,23,3,25],[6,23,6,25],[7,23,7,25],[455,18,455,22],[452,14,452,17],[449,15,449,17],[449,18,449,22],[450,15,450,17],[450,18,450,22],[451,15,451,17],[451,18,451,22],[454,18,454,22],[453,18,453,22],[449,23,449,25],[450,23,450,25],[451,23,451,25],[452,23,452,25],[453,23,453,25],[454,23,454,25],[455,23,455,25],[424,14,424,17],[431,15,431,17],[452,18,452,22],[440,15,440,17],[440,18,440,22],[441,15,441,17],[441,18,441,22],[442,15,442,17],[442,18,442,22],[446,15,446,17],[446,18,446,22],[447,15,447,17],[447,18,447,22],[448,15,448,17],[437,15,437,17],[448,18,448,22],[443,15,443,17],[443,18,443,22],[444,15,444,17],[444,18,444,22],[445,15,445,17],[445,18,445,22],[10,24,10,25],[9,23,9,25],[437,18,437,22],[438,15,438,17],[438,18,438,22],[439,15,439,17],[439,18,439,22],[434,15,434,17],[434,18,434,22],[435,15,435,17],[435,18,435,22],[436,15,436,17],[436,18,436,22],[430,14,430,26],[431,18,431,22],[432,15,432,17],[432,18,432,22],[433,15,433,17],[433,18,433,22]]}
[]
[]
[]
[null,null,null,null,null,null,null,null,null,null,null,null,null,null,"UNIDADE ESCOLAR",null,null,null,null,null,null,null,null,"CÓDIGO INEP"]
[null,null,null,null,null,null,null,null,null,null,null,null,"",null,"COORDENAÇÃO REGIONAL DE EDUCAÇÃO DE JATAÍ",null,null,null,null,null,null,null,null,52052656]
[]
["Nmax",null,null,null,null,null,null,null,null,null,null,null,null,null,"OBRA",null,null,null,"DATA",null,null,null,null,"CIDADE"]
[{"$f":"MAX($C$19:$C$380)","v":4},null,null,null,null,null,null,null,null,null,null,null,null,null,"REFORMA E AMPLIAÇÃO",null,null,null,"2020-05-19",null,null,null,null,"JATAÍ"]
[]
[null,null,null,null,null,null,null,null,null,null,null,null,null,null,"CRE",null,null,"ENDEREÇO","REFERÊNCIA AGETOP",null,null,null,null,"REFERÊNCIA SINAPI"]
[null,null,null,null,null,null,null,null,null,null,null,null,null,null,"CRE-JATAI",null,null,"PRAÇA DOM GERMANO, 42 - CENTRO","ABR/19","DESONERADA",null,null,null,"MAR/20","DESONERADA"]
[]
[null,null,null,null,null,null,null,null,null,null,null,null,null,null,"ÁREA EXISTENTE (M²)",null,null,"ÁREA A CONSTRUIR (M²)","ÁREA A DEMOLIR (M²)",null,null,null,null,"ÁREA TOTAL CONSTRUÍDA (M²)"]
[null,null,null,null,null,null,null,null,null,null,null,null,null,null,450.54,null,null,1.53,null,null,null,null,null,452.07]
[]
[null,null,null,null,null,null,null,null,null,null,null,"FILTRO",null,null,"PLANILHA ORÇAMENTÁRIA"]
["Nível E","Save Nivel","Nível C","Altura","n1","n2","n3","n4","n5","Czero","Cnível","↓","Nível","Nível Corrigido","ITEM","TABELA","CODIGO","DESCRIÇÃO DOS SERVIÇOS","UNID","QUANT","REPET","QUANT TOTAL","MAT","MO","T.SERVIÇO UNIT","VALOR TOTAL","OBSERVAÇÕES¹"]
[{"$f":"CHOOSE(1+LOG(1+2*(ORÇAMENTO.Nivel=\"Nível 1\")+4*(ORÇAMENTO.Nivel=\"Nível 2\")+8*(ORÇAMENTO.Nivel=\"Nível 3\")+16*(ORÇAMENTO.Nivel=\"Nível 4\")+32*(ORÇAMENTO.Nivel=\"Serviço\"),2),0,1,2,3,4,\"S\")","v":"S"},{"$f":"IF(OR(C18=\"s\",C18=0),OFFSET(B18,-1,0),C18)","v":"Save Nivel"},{"$f":"IF(OFFSET(C18,-1,0)=\"L\",1,IF(OFFSET(C18,-1,0)=1,2,IF(OR(A18=\"s\",A18=0),\"S\",IF(AND(OFFSET(C18,-1,0)=2,A18=4),3,IF(AND(OR(OFFSET(C18,-1,0)=\"s\",OFFSET(C18,-1,0)=0),A18<>\"s\",A18>OFFSET(B18,-1,0)),OFFSET(B18,-1,0),A18)))))","v":"S"},{"$f":"IF(OR(C18=\"S\",C18=0),0,IF(ISERROR(K18),J18,SMALL(J18:K18,1)))","v":0},{"$f":"IF($C18=1,OFFSET(E18,-1,0)+1,OFFSET(E18,-1,0))","v":"n1"},{"$f":"IF($C18=1,0,IF($C18=2,OFFSET(F18,-1,0)+1,OFFSET(F18,-1,0)))","v":"n2"},{"$f":"IF(AND($C18<=2,$C18<>0),0,IF($C18=3,OFFSET(G18,-1,0)+1,OFFSET(G18,-1,0)))","v":"n3"},{"$f":"IF(AND($C18<=3,$C18<>0),0,IF($C18=4,OFFSET(H18,-1,0)+1,OFFSET(H18,-1,0)))","v":"n4"},{"$f":"IF(AND($C18<=4,$C18<>0),0,IF(AND($C18=\"S\",$Y18>0),OFFSET(I18,-1,0)+1,OFFSET(I18,-1,0)))","v":"n5"},{"$f":"IF(OR($C18=\"S\",$C18=0),0,MATCH(0,OFFSET($D18,1,$C18,ROW($C$380)-ROW($C18)),0))","v":0},{"$f":"IF(OR($C18=\"S\",$C18=0),0,MATCH(OFFSET($D18,0,$C18)+1,OFFSET($D18,1,$C18,ROW($C$380)-ROW($C18)),0))","v":0},"","Serviço","Serviço","-","SINAPI",null,"(sem código)","-",null,"REPET","-",0,0,0,"-",""]
[0,null,"L",{"$f":"COUNTA(OFFSET(D19,1,0):D$380)","v":360},{"$f":"LEFT(O20,1)-1","v":0},null,null,null,null,null,null,"F","LOTE","LOTE","REFORMA E AMPLIAÇÃO - COORDENAÇÃO REGIONAL DE EDUCAÇÃO DE JATAÍ",null,null,null,null,null,null,null,null,null,null,0]
[1,{"$f":"IF(OR(C20=\"s\",C20=0),OFFSET(B20,-1,0),C20)","v":1},{"$f":"IF(OFFSET(C20,-1,0)=\"L\",1,IF(OFFSET(C20,-1,0)=1,2,IF(OR(A20=\"s\",A20=0),\"S\",IF(AND(OFFSET(C20,-1,0)=2,A20=4),3,IF(AND(OR(OFFSET(C20,-1,0)=\"s\",OFFSET(C20,-1,0)=0),A20<>\"s\",A20>OFFSET(B20,-1,0)),OFFSET(B20,-1,0),A20)))))","v":1},{"$f":"IF(OR(C20=\"S\",C20=0),0,IF(ISERROR(K20),J20,SMALL(J20:K20,1)))","v":360},{"$f":"IF($C20=1,OFFSET(E20,-1,0)+1,OFFSET(E20,-1,0))","v":1},{"$f":"IF($C20=1,0,IF($C20=2,OFFSET(F20,-1,0)+1,OFFSET(F20,-1,0)))","v":0},{"$f":"IF(AND($C20<=2,$C20<>0),0,IF($C20=3,OFFSET(G20,-1,0)+1,OFFSET(G20,-1,0)))","v":0},{"$f":"IF(AND($C20<=3,$C20<>0),0,IF($C20=4,OFFSET(H20,-1,0)+1,OFFSET(H20,-1,0)))","v":0},0,{"$f":"IF(OR($C20=\"S\",$C20=0),0,MATCH(0,OFFSET($D20,1,$C20,ROW($C$380)-ROW($C20)),0))","v":360},{"$f":"IF(OR($C20=\"S\",$C20=0),0,MATCH(OFFSET($D20,0,$C20)+1,OFFSET($D20,1,$C20,ROW($C$380)-ROW($C20)),0))","v":{"$error":"#N/A"}},"F","Nível 1","Nível 1","1.","AGETOP",null,"REFORMA E AMPLIAÇÃO","UN",1,1,1,null,null,0,0]
[2,2,2,39,1,1,0,0,0,359,39,"","Nível 2","Nível 2","-","AGETOP",null,"SERVIÇOS PRELIMINARES","-",null,1,"-",null,null,0,0]
[3,3,3,2,1,1,1,0,0,38,2,"","Nível 3","Nível 3","-","SINAPI",null,"TELHADO BLOCO 1","-",null,1,"-",0,0,0,0,""]
[{"$f":"CHOOSE(1+LOG(1+2*(ORÇAMENTO.Nivel=\"Nível 1\")+4*(ORÇAMENTO.Nivel=\"Nível 2\")+8*(ORÇAMENTO.Nivel=\"Nível 3\")+16*(ORÇAMENTO.Nivel=\"Nível 4\")+32*(ORÇAMENTO.Nivel=\"Serviço\"),2),0,1,2,3,4,\"S\")","v":"S"},3,"S",0,1,1,1,0,0,0,0,"","Serviço","Serviço","-","AGETOP",20100,"DEMOLIÇÃO - COBERTURA TELHA METÁLICA C/ TRANSP. ATÉ CB. E CARGA","m2    ",168.82,1,168.82,null,null,0,0,""]
[{"$f":"CHOOSE(1+LOG(1+2*(ORÇAMENTO.Nivel=\"Nível 1\")+4*(ORÇAMENTO.Nivel=\"Nível 2\")+8*(ORÇAMENTO.Nivel=\"Nível 3\")+16*(ORÇAMENTO.Nivel=\"Nível 4\")+32*(ORÇAMENTO.Nivel=\"Serviço\"),2),0,1,2,3,4,\"S\")","v":3},3,3,2,1,1,2,0,0,36,2,"","Nível 3","Nível 3","-","SINAPI",null,"FORRO  BLOCO 1","-",null,1,"-",null,null,0,0,""]
["S",3,"S",0,1,1,2,0,{"$f":"IF(AND($C25<=4,$C25<>0),0,IF(AND($C25=\"S\",$Y25>0),OFFSET(I25,-1,0)+1,OFFSET(I25,-1,0)))","v":0},0,0,"","Serviço","Serviço","-","AGETOP",20148,"DEMOLIÇÃO DE FORRO PVC ( SOMENTE O FORRO) C/ TRANSP. ATÉ CB. E CARGA","m2    ",159.22999999999999,1,159.22999999999999,null,null,0,0,""]
[3,3,3,2,1,1,3,0,0,34,2,"","Nível 3","Nível 3","-","SINAPI",null,"TELHADO BLOCO 2","-",null,1,"-",null,null,0,0,""]
["S",3,"S",0,1,1,3,0,{"$f":"IF(AND($C27<=4,$C27<>0),0,IF(AND($C27=\"S\",$Y27>0),OFFSET(I27,-1,0)+1,OFFSET(I27,-1,0)))","v":0},0,0,"","Serviço","Serviço","-","AGETOP",20100,"DEMOLIÇÃO - COBERTURA TELHA METÁLICA C/ TRANSP. ATÉ CB. E CARGA","m2    ",114.17,1,114.17,null,null,0,0,""]
[3,3,3,2,1,1,4,0,0,32,2,"","Nível 3","Nível 3","-","SINAPI",null,"FORRO BLOCO 2","-",null,1,"-",null,null,0,0,""]
["S",3,"S",0,1,1,4,0,{"$f":"IF(AND($C29<=4,$C29<>0),0,IF(AND($C29=\"S\",$Y29>0),OFFSET(I29,-1,0)+1,OFFSET(I29,-1,0)))","v":0},0,0,"","Serviço","Serviço","-","AGETOP",20105,"DEMOL.FORRO PAULISTA  C/TRANSP.ATE CB.E CARGA","m2    ",8.8800000000000008,1,8.8800000000000008,null,null,0,0,""]
[3,3,3,9,1,1,5,0,0,30,9,"","Nível 3","Nível 3","-","SINAPI",null,"ADAPTAÇÃO SANITÁRIOS PcD /CIRCULAÇÃO BLOCO 2","-",null,1,"-",null,null,0,0,""]
["S",{"$f":"IF(OR(C31=\"s\",C31=0),OFFSET(B31,-1,0),C31)","v":3},{"$f":"IF(OFFSET(C31,-1,0)=\"L\",1,IF(OFFSET(C31,-1,0)=1,2,IF(OR(A31=\"s\",A31=0),\"S\",IF(AND(OFFSET(C31,-1,0)=2,A31=4),3,IF(AND(OR(OFFSET(C31,-1,0)=\"s\",OFFSET(C31,-1,0)=0),A31<>\"s\",A31>OFFSET(B31,-1,0)),OFFSET(B31,-1,0),A31)))))","v":"S"},{"$f":"IF(OR(C31=\"S\",C31=0),0,IF(ISERROR(K31),J31,SMALL(J31:K31,1)))","v":0},{"$f":"IF($C31=1,OFFSET(E31,-1,0)+1,OFFSET(E31,-1,0))","v":1},{"$f":"IF($C31=1,0,IF($C31=2,OFFSET(F31,-1,0)+1,OFFSET(F31,-1,0)))","v":1},{"$f":"IF(AND($C31<=2,$C31<>0),0,IF($C31=3,OFFSET(G31,-1,0)+1,OFFSET(G31,-1,0)))","v":5},{"$f":"IF(AND($C31<=3,$C31<>0),0,IF($C31=4,OFFSET(H31,-1,0)+1,OFFSET(H31,-1,0)))","v":0},{"$f":"IF(AND($C31<=4,$C31<>0),0,IF(AND($C31=\"S\",$Y31>0),OFFSET(I31,-1,0)+1,OFFSET(I31,-1,0)))","v":0},0,0,"","Serviço","Serviço","-","AGETOP",20137,"DEMOLIÇAO BACIA SANITARIA C/ TRANSP. ATÉ CB. E CARGA","Un    ",3,1,3,null,null,0,0,""]
["S",3,"S",0,1,1,5,0,0,0,0,"","Serviço","Serviço","-","AGETOP",20140,"DEMOLIÇAO DE VÁLVULA DE DESCARGA C/ TRANSP. ATÉ CB. E CARGA","Un    ",2,1,2,null,null,0,0,""]
["S",3,"S",0,1,1,5,0,0,0,0,"","Serviço","Serviço","-","AGETOP",20138,"DEMOLIÇAO DE LAVATÓRIO C/ TRANSP. ATÉ CB. E CARGA","Un    ",2,1,2,null,null,0,0,""]
["S",3,"S",0,1,1,5,0,0,0,0,"","Serviço","Serviço","-","AGETOP",20163,"DEMOLIÇÃO DAS INSTALAÇÕES HIDROSANITÁRIAS E AFINS C/ TRANSP. ATÉ CB. E CARGA","H     ",1.7,1,1.7,null,null,0,0,""]
["S",3,"S",0,1,1,5,0,0,0,0,"","Serviço","Serviço","-","AGETOP",20118,"DEM.ALVEN.TIJOLO S/REAP. C/TR.ATE CB. E CARGA","m3    ",0.8,1,0.8,null,null,0,0,""]
["S",3,"S",0,1,1,5,0,0,0,0,"","Serviço","Serviço","-","AGETOP",20111,"DEM.PISO CERAM.SOBRE LASTRO CONC.C/TR.CB.E CARGA","m2    ",8.8800000000000008,1,8.8800000000000008,null,null,0,0,""]
["S",3,"S",0,1,1,5,0,0,0,0,"","Serviço","Serviço","-","SINAPI",97633,"DEMOLIÇÃO DE REVESTIMENTO CERÂMICO, DE FORMA MANUAL, SEM REAPROVEITAMENTO. AF_12/2017","M2",51.41,1,51.41,null,null,0,0,"Referência: AGETOP - 20115"]
["S",3,"S",0,1,1,5,0,0,0,0,"","Serviço","Serviço","-","SINAPI",97644,"REMOÇÃO DE PORTAS, DE FORMA MANUAL, SEM REAPROVEITAMENTO. AF_12/2017","M2",1.68,1,1.68,null,null,0,0,"Referência: AGETOP - 20106"]
[3,3,3,7,1,1,6,0,0,21,7,"","Nível 3","Nível 3","-","SINAPI",null,"REFORMA SANITÁRIO PAV. SUPERIOR","-",null,1,"-",null,null,0,0,""]
["S",3,"S",0,1,1,6,0,0,0,0,"","Serviço","Serviço","-","AGETOP",20137,"DEMOLIÇAO BACIA SANITARIA C/ TRANSP. ATÉ CB. E CARGA","Un    ",1,1,1,null,null,0,0,""]
["S",3,"S",0,1,1,6,0,0,0,0,"","Serviço","Serviço","-","AGETOP",20140,"DEMOLIÇAO DE VÁLVULA DE DESCARGA C/ TRANSP. ATÉ CB. E CARGA","Un    ",1,1,1,null,null,0,0,""]
["S",3,"S",0,1,1,6,0,0,0,0,"","Serviço","Serviço","-","AGETOP",20138,"DEMOLIÇAO DE LAVATÓRIO C/ TRANSP. ATÉ CB. E CARGA","Un    ",1,1,1,null,null,0,0,""]
["S",3,"S",0,1,1,6,0,0,0,0,"","Serviço","Serviço","-","AGETOP",20163,"DEMOLIÇÃO DAS INSTALAÇÕES HIDROSANITÁRIAS E AFINS C/ TRANSP. ATÉ CB. E CARGA","H     ",1.1000000000000001,1,1.1000000000000001,null,null,0,0,""]
["S",3,"S",0,1,1,6,0,0,0,0,"","Serviço","Serviço","-","AGETOP",20111,"DEM.PISO CERAM.SOBRE LASTRO CONC.C/TR.CB.E CARGA","m2    ",2,1,2,null,null,0,0,""]
["S",3,"S",0,1,1,6,0,0,0,0,"","Serviço","Serviço","-","SINAPI",97633,"DEMOLIÇÃO DE REVESTIMENTO CERÂMICO, DE FORMA MANUAL, SEM REAPROVEITAMENTO. AF_12/2017","M2",4.12,1,4.12,null,null,0,0,"Referência: AGETOP - 20115"]
[3,3,3,3,1,1,7,0,0,14,3,"","Nível 3","Nível 3","-","SINAPI",null,"ADAPTAÇÃO NOVO ALMOXARIFADO","-",null,1,"-",null,null,0,0,""]
["S",3,"S",0,1,1,7,0,0,0,0,"","Serviço","Serviço","-","AGETOP",20139,"DEMOLIÇAO DE BANCADAS C/ TRANSP. ATÉ CB. E CARGA","m2    ",1.88,1,1.88,null,null,0,0,""]
["S",3,"S",0,1,1,7,0,0,0,0,"","Serviço","Serviço","-","AGETOP",20163,"DEMOLIÇÃO DAS INSTALAÇÕES HIDROSANITÁRIAS E AFINS C/ TRANSP. ATÉ CB. E CARGA","H     ",1.1000000000000001,1,1.1000000000000001,null,null,0,0,""]
[3,3,3,3,1,1,8,0,0,11,3,"","Nível 3","Nível 3","-","SINAPI",null,"ADAPTAÇÃO NOVA COZINHA","-",null,1,"-",null,null,0,0,""]
["S",3,"S",0,1,1,8,0,0,0,0,"","Serviço","Serviço","-","AGETOP",20111,"DEM.PISO CERAM.SOBRE LASTRO CONC.C/TR.CB.E CARGA","m2    ",30,1,30,null,null,0,0,""]
["S",3,"S",0,1,1,8,0,0,0,0,"","Serviço","Serviço","-","AGETOP",20147,"DEMOLIÇÃO DE FORRO PVC  INCLUSIVE ESTRUTURA DE SUSTENTAÇÃO C/ TRANSP. ATÉ CB. E CARGA","m2    ",30,1,30,null,null,0,0,""]
[{"$f":"CHOOSE(1+LOG(1+2*(ORÇAMENTO.Nivel=\"Nível 1\")+4*(ORÇAMENTO.Nivel=\"Nível 2\")+8*(ORÇAMENTO.Nivel=\"Nível 3\")+16*(ORÇAMENTO.Nivel=\"Nível 4\")+32*(ORÇAMENTO.Nivel=\"Serviço\"),2),0,1,2,3,4,\"S\")","v":3},3,3,2,1,1,9,0,0,8,2,"","Nível 3","Nível 3","-","SINAPI",null,"CALÇADA EXTERNA E RAMPA","-",null,1,"-",null,null,0,0,""]
["S",3,"S",0,1,1,9,0,0,0,0,"","Serviço","Serviço","-","AGETOP",20109,"DEM.PISO CIMENT.SOBRE LASTRO CONC.C/TR.ATE CB. E CARGA","m2    ",17.100000000000001,1,17.100000000000001,null,null,0,0,""]
[3,{"$f":"IF(OR(C54=\"s\",C54=0),OFFSET(B54,-1,0),C54)","v":3},{"$f":"IF(OFFSET(C54,-1,0)=\"L\",1,IF(OFFSET(C54,-1,0)=1,2,IF(OR(A54=\"s\",A54=0),\"S\",IF(AND(OFFSET(C54,-1,0)=2,A54=4),3,IF(AND(OR(OFFSET(C54,-1,0)=\"s\",OFFSET(C54,-1,0)=0),A54<>\"s\",A54>OFFSET(B54,-1,0)),OFFSET(B54,-1,0),A54)))))","v":3},{"$f":"IF(OR(C54=\"S\",C54=0),0,IF(ISERROR(K54),J54,SMALL(J54:K54,1)))","v":2},{"$f":"IF($C54=1,OFFSET(E54,-1,0)+1,OFFSET(E54,-1,0))","v":1},{"$f":"IF($C54=1,0,IF($C54=2,OFFSET(F54,-1,0)+1,OFFSET(F54,-1,0)))","v":1},{"$f":"IF(AND($C54<=2,$C54<>0),0,IF($C54=3,OFFSET(G54,-1,0)+1,OFFSET(G54,-1,0)))","v":10},{"$f":"IF(AND($C54<=3,$C54<>0),0,IF($C54=4,OFFSET(H54,-1,0)+1,OFFSET(H54,-1,0)))","v":0},0,6,2,"","Nível 3","Nível 3","-","SINAPI",null,"ACESSIBILIDADE","-",null,1,"-",null,null,0,0,""]
["S",3,"S",0,1,1,10,0,0,0,0,"","Serviço","Serviço","-","AGETOP",20109,"DEM.PISO CIMENT.SOBRE LASTRO CONC.C/TR.ATE CB. E CARGA","m2    ",6.79,1,6.79,null,null,0,0,""]
[3,3,3,2,1,1,11,0,0,4,2,"","Nível 3","Nível 3","-","SINAPI",null,"INSTALAÇÕES DE GÁS ","-",null,1,"-",null,null,0,0,""]
["S",3,"S",0,1,1,11,0,0,0,0,"","Serviço","Serviço","-","AGETOP",20121,"DEM. MANUAL EM CONCR.SIMPLES C/TR.ATE CB.E CARGA (O.C.)","m3    ",0.04,1,0.04,null,null,0,0,""]
[3,3,3,2,1,1,12,0,0,2,{"$error":"#N/A"},"","Nível 3","Nível 3","-","SINAPI",null,"PLACA DE OBRA","-",null,1,"-",null,null,0,0,""]
[{"$f":"CHOOSE(1+LOG(1+2*(ORÇAMENTO.Nivel=\"Nível 1\")+4*(ORÇAMENTO.Nivel=\"Nível 2\")+8*(ORÇAMENTO.Nivel=\"Nível 3\")+16*(ORÇAMENTO.Nivel=\"Nível 4\")+32*(ORÇAMENTO.Nivel=\"Serviço\"),2),0,1,2,3,4,\"S\")","v":"S"},3,"S",0,1,1,12,0,0,0,0,"","Serviço","Serviço","-","AGETOP",21301,"PLACA DE OBRA PLOTADA EM CHAPA METÁLICA 26 , AFIXADA EM CAVALETES DE MADEIRA DE LEI (VIGOTAS 6X12CM) - PADRÃO GOINFRA","m2    ",7.5,1,7.5,null,null,0,0,""]
[{"$f":"CHOOSE(1+LOG(1+2*(ORÇAMENTO.Nivel=\"Nível 1\")+4*(ORÇAMENTO.Nivel=\"Nível 2\")+8*(ORÇAMENTO.Nivel=\"Nível 3\")+16*(ORÇAMENTO.Nivel=\"Nível 4\")+32*(ORÇAMENTO.Nivel=\"Serviço\"),2),0,1,2,3,4,\"S\")","v":2},2,2,3,1,2,0,0,0,320,3,"","Nível 2","Nível 2","-","AGETOP",null,"TRANSPORTES","-",null,1,"-",null,null,0,0,""]
[{"$f":"CHOOSE(1+LOG(1+2*(ORÇAMENTO.Nivel=\"Nível 1\")+4*(ORÇAMENTO.Nivel=\"Nível 2\")+8*(ORÇAMENTO.Nivel=\"Nível 3\")+16*(ORÇAMENTO.Nivel=\"Nível 4\")+32*(ORÇAMENTO.Nivel=\"Serviço\"),2),0,1,2,3,4,\"S\")","v":"S"},2,"S",0,1,2,0,0,0,0,0,"","Serviço","Serviço","-","SINAPI",72900,"TRANSPORTE DE ENTULHO COM CAMINHAO BASCULANTE 6 M3, RODOVIA PAVIMENTADA, DMT 0,5 A 1,0 KM","M3",31.08,1,31.08,null,null,0,0,""]
[{"$f":"CHOOSE(1+LOG(1+2*(ORÇAMENTO.Nivel=\"Nível 1\")+4*(ORÇAMENTO.Nivel=\"Nível 2\")+8*(ORÇAMENTO.Nivel=\"Nível 3\")+16*(ORÇAMENTO.Nivel=\"Nível 4\")+32*(ORÇAMENTO.Nivel=\"Serviço\"),2),0,1,2,3,4,\"S\")","v":"S"},2,"S",0,1,2,0,0,0,0,0,"","Serviço","Serviço","-","SINAPI",72897,"CARGA MANUAL DE ENTULHO EM CAMINHAO BASCULANTE 6 M3","M3",31.08,1,31.08,null,null,0,0,""]
[2,2,2,15,1,3,0,0,0,317,15,"","Nível 2","Nível 2","-","SINAPI",null,"SERVIÇO EM TERRA","-",null,1,"-",null,null,0,0,""]
[{"$f":"CHOOSE(1+LOG(1+2*(ORÇAMENTO.Nivel=\"Nível 1\")+4*(ORÇAMENTO.Nivel=\"Nível 2\")+8*(ORÇAMENTO.Nivel=\"Nível 3\")+16*(ORÇAMENTO.Nivel=\"Nível 4\")+32*(ORÇAMENTO.Nivel=\"Serviço\"),2),0,1,2,3,4,\"S\")","v":3},3,3,7,1,3,1,0,0,14,7,"","Nível 3","Nível 3","-","SINAPI",null,"AQUISIÇÃO DE TERRA (SOMENTE ATERRO)","-",null,1,"-",null,null,0,0,""]
[4,{"$f":"IF(OR(C65=\"s\",C65=0),OFFSET(B65,-1,0),C65)","v":4},{"$f":"IF(OFFSET(C65,-1,0)=\"L\",1,IF(OFFSET(C65,-1,0)=1,2,IF(OR(A65=\"s\",A65=0),\"S\",IF(AND(OFFSET(C65,-1,0)=2,A65=4),3,IF(AND(OR(OFFSET(C65,-1,0)=\"s\",OFFSET(C65,-1,0)=0),A65<>\"s\",A65>OFFSET(B65,-1,0)),OFFSET(B65,-1,0),A65)))))","v":4},{"$f":"IF(OR(C65=\"S\",C65=0),0,IF(ISERROR(K65),J65,SMALL(J65:K65,1)))","v":6},{"$f":"IF($C65=1,OFFSET(E65,-1,0)+1,OFFSET(E65,-1,0))","v":1},{"$f":"IF($C65=1,0,IF($C65=2,OFFSET(F65,-1,0)+1,OFFSET(F65,-1,0)))","v":3},{"$f":"IF(AND($C65<=2,$C65<>0),0,IF($C65=3,OFFSET(G65,-1,0)+1,OFFSET(G65,-1,0)))","v":1},{"$f":"IF(AND($C65<=3,$C65<>0),0,IF($C65=4,OFFSET(H65,-1,0)+1,OFFSET(H65,-1,0)))","v":1},0,6,10,"","Nível 4","Nível 4","-","SINAPI",null,"CALÇADA EXTERNA E RAMPA","-",null,1,"-",null,null,0,0,""]
["S",4,"S",0,1,3,1,1,0,0,0,"","Serviço","Serviço","-","SINAPI",79480,"ESCAVACAO MECANICA CAMPO ABERTO EM SOLO EXCETO ROCHA ATE 2,00M PROFUNDIDADE","M3",0.35000000000000003,1,0.35000000000000003,null,null,0,0,"Referência: AGETOP - 41004"]
["S",4,"S",0,1,3,1,1,0,0,0,"","Serviço","Serviço","-","AGETOP",41005,"CARGA MECANIZADA","m3    ",0.35000000000000003,1,0.35000000000000003,null,null,0,0,""]
["S",4,"S",0,1,3,1,1,0,0,0,"","Serviço","Serviço","-","AGETOP",41012,"INDENIZAÇÃO DE JAZIDA","m3    ",0.35000000000000003,1,0.35000000000000003,null,null,0,0,""]
["S",4,"S",0,1,3,1,1,0,0,0,"","Serviço","Serviço","-","AGETOP",41006,"TRANSPORTE DE MATERIAL ESCAVADO M3.KM","m3km  ",3.5000000000000004,1,3.5000000000000004,null,null,0,0,""]
["S",4,"S",0,1,3,1,1,0,0,0,"","Serviço","Serviço","-","AGETOP",41009,"COMPACTAÇÃO MECÂNICA SEM CONTROLE LABORATÓRIO","m3    ",0.28000000000000003,1,0.28000000000000003,null,null,0,0,""]
[3,3,3,7,1,3,2,0,0,7,124,"","Nível 3","Nível 3","-","SINAPI",null,"OUTROS","-",null,1,"-",null,null,0,0,""]
[{"$f":"CHOOSE(1+LOG(1+2*(ORÇAMENTO.Nivel=\"Nível 1\")+4*(ORÇAMENTO.Nivel=\"Nível 2\")+8*(ORÇAMENTO.Nivel=\"Nível 3\")+16*(ORÇAMENTO.Nivel=\"Nível 4\")+32*(ORÇAMENTO.Nivel=\"Serviço\"),2),0,1,2,3,4,\"S\")","v":4},4,4,3,1,3,2,1,0,6,3,"","Nível 4","Nível 4","-","SINAPI",null,"CALÇADA EXTERNA E RAMPA","-",null,1,"-",null,null,0,0,""]
["S",4,"S",0,1,3,2,1,0,0,0,"","Serviço","Serviço","-","AGETOP",41140,"REGULARIZAÇÃO DO TERRENO SEM APILOAMENTO COM TRANSPORTE MANUAL DA TERRA ESCAVADA ","m2    ",2.7,1,2.7,null,null,0,0,""]
["S",4,"S",0,1,3,2,1,0,0,0,"","Serviço","Serviço","-","AGETOP",41002,"APILOAMENTO","m2    ",2.7,1,2.7,null,null,0,0,""]
[4,{"$f":"IF(OR(C75=\"s\",C75=0),OFFSET(B75,-1,0),C75)","v":4},{"$f":"IF(OFFSET(C75,-1,0)=\"L\",1,IF(OFFSET(C75,-1,0)=1,2,IF(OR(A75=\"s\",A75=0),\"S\",IF(AND(OFFSET(C75,-1,0)=2,A75=4),3,IF(AND(OR(OFFSET(C75,-1,0)=\"s\",OFFSET(C75,-1,0)=0),A75<>\"s\",A75>OFFSET(B75,-1,0)),OFFSET(B75,-1,0),A75)))))","v":4},{"$f":"IF(OR(C75=\"S\",C75=0),0,IF(ISERROR(K75),J75,SMALL(J75:K75,1)))","v":3},{"$f":"IF($C75=1,OFFSET(E75,-1,0)+1,OFFSET(E75,-1,0))","v":1},{"$f":"IF($C75=1,0,IF($C75=2,OFFSET(F75,-1,0)+1,OFFSET(F75,-1,0)))","v":3},{"$f":"IF(AND($C75<=2,$C75<>0),0,IF($C75=3,OFFSET(G75,-1,0)+1,OFFSET(G75,-1,0)))","v":2},{"$f":"IF(AND($C75<=3,$C75<>0),0,IF($C75=4,OFFSET(H75,-1,0)+1,OFFSET(H75,-1,0)))","v":2},0,3,77,"","Nível 4","Nível 4","-","SINAPI",null,"INSTALAÇÕES DE GÁS","-",null,1,"-",null,null,0,0,""]
["S",4,"S",0,1,3,2,2,0,0,0,"","Serviço","Serviço","-","SINAPI",93358,"ESCAVAÇÃO MANUAL DE VALA COM PROFUNDIDADE MENOR OU IGUAL A 1,30 M. AF_03/2016","M3",0.21,1,0.21,null,null,0,0,"Referência: AGETOP - 40101"]
["S",4,"S",0,1,3,2,2,0,0,0,"","Serviço","Serviço","-","SINAPI",96995,"REATERRO MANUAL APILOADO COM SOQUETE. AF_10/2017","M3",0.21,1,0.21,null,null,0,0,"Referência: AGETOP - 40902"]
[2,2,2,4,1,4,0,0,0,302,4,"","Nível 2","Nível 2","-","SINAPI",null,"ESTRUTURA","-",null,1,"-",null,null,0,0,""]
[{"$f":"CHOOSE(1+LOG(1+2*(ORÇAMENTO.Nivel=\"Nível 1\")+4*(ORÇAMENTO.Nivel=\"Nível 2\")+8*(ORÇAMENTO.Nivel=\"Nível 3\")+16*(ORÇAMENTO.Nivel=\"Nível 4\")+32*(ORÇAMENTO.Nivel=\"Serviço\"),2),0,1,2,3,4,\"S\")","v":3},3,3,3,1,4,1,0,0,3,92,"","Nível 3","Nível 3","-",null,null,"OUTROS","-",null,1,"-",null,null,0,0,""]
[4,4,4,2,1,4,1,1,0,2,64,"","Nível 4","Nível 4","-","SINAPI",null,"ADAPTAÇÃO SANITÁRIOS PcD/CIRCULAÇÃO BLOCO 2","-",null,1,"-",null,null,0,0,""]
[{"$f":"CHOOSE(1+LOG(1+2*(ORÇAMENTO.Nivel=\"Nível 1\")+4*(ORÇAMENTO.Nivel=\"Nível 2\")+8*(ORÇAMENTO.Nivel=\"Nível 3\")+16*(ORÇAMENTO.Nivel=\"Nível 4\")+32*(ORÇAMENTO.Nivel=\"Serviço\"),2),0,1,2,3,4,\"S\")","v":"S"},4,"S",0,1,4,1,1,0,0,0,"","Serviço","Serviço","-","AGETOP",60010,"VERGA/CONTRAVERGA EM CONCRETO ARMADO FCK = 20 MPA","m3    ",0.05,1,0.05,null,null,0,0,""]
[{"$f":"CHOOSE(1+LOG(1+2*(ORÇAMENTO.Nivel=\"Nível 1\")+4*(ORÇAMENTO.Nivel=\"Nível 2\")+8*(ORÇAMENTO.Nivel=\"Nível 3\")+16*(ORÇAMENTO.Nivel=\"Nível 4\")+32*(ORÇAMENTO.Nivel=\"Serviço\"),2),0,1,2,3,4,\"S\")","v":2},2,2,56,1,5,0,0,0,298,56,"","Nível 2","Nível 2","-",null,null,"INSTALAÇÕES ELÉTRICAS","-",null,1,"-",null,null,0,0,""]
["S",2,"S",0,1,5,0,0,0,0,0,"","Serviço","Serviço","-","SINAPI","74131/5","QUADRO DE DISTRIBUICAO DE ENERGIA DE EMBUTIR, EM CHAPA METALICA, PARA 24 DISJUNTORES TERMOMAGNETICOS MONOPOLARES, COM BARRAMENTO TRIFASICO E NEUTRO, FORNECIMENTO E INSTALACAO","UN",1,1,1,null,null,0,0,""]
["S",2,"S",0,1,5,0,0,0,{"$f":"IF(OR($C84=\"S\",$C84=0),0,MATCH(0,OFFSET($D84,1,$C84,ROW($C$380)-ROW($C84)),0))","v":0},{"$f":"IF(OR($C84=\"S\",$C84=0),0,MATCH(OFFSET($D84,0,$C84)+1,OFFSET($D84,1,$C84,ROW($C$380)-ROW($C84)),0))","v":0},"","Serviço","Serviço","-","SINAPI","74131/4","QUADRO DE DISTRIBUICAO DE ENERGIA DE EMBUTIR, EM CHAPA METALICA, PARA 18 DISJUNTORES TERMOMAGNETICOS MONOPOLARES, COM BARRAMENTO TRIFASICO E NEUTRO, FORNECIMENTO E INSTALACAO","UN",3,1,3,null,null,0,0,""]
["S",2,"S",0,1,5,0,0,0,0,0,"","Serviço","Serviço","-","AGETOP",71175,"DISJUNTOR TRIPOLAR DE 60 A 100-A","Un    ",2,1,2,null,null,0,0,""]
["S",2,"S",0,1,5,0,0,0,0,0,"","Serviço","Serviço","-","SINAPI",93670,"DISJUNTOR TRIPOLAR TIPO DIN, CORRENTE NOMINAL DE 25A - FORNECIMENTO E INSTALAÇÃO. AF_04/2016","UN",2,1,2,null,null,0,0,"Referência: AGETOP - 71173"]
["S",2,"S",0,1,5,0,0,0,0,0,"","Serviço","Serviço","-","SINAPI",93672,"DISJUNTOR TRIPOLAR TIPO DIN, CORRENTE NOMINAL DE 40A - FORNECIMENTO E INSTALAÇÃO. AF_04/2016","UN",2,1,2,null,null,0,0,"Referência: AGETOP - 71174"]
["S",2,"S",0,1,5,0,0,0,0,0,"","Serviço","Serviço","-","SINAPI",93673,"DISJUNTOR TRIPOLAR TIPO DIN, CORRENTE NOMINAL DE 50A - FORNECIMENTO E INSTALAÇÃO. AF_04/2016","UN",2,1,2,null,null,0,0,"Referência: AGETOP - 71174"]
["S",2,"S",0,1,5,0,0,0,0,0,"","Serviço","Serviço","-","SINAPI",93656,"DISJUNTOR MONOPOLAR TIPO DIN, CORRENTE NOMINAL DE 25A - FORNECIMENTO E INSTALAÇÃO. AF_04/2016","UN",17,1,17,null,null,0,0,""]
["S",2,"S",0,1,5,0,0,0,0,0,"","Serviço","Serviço","-","SINAPI",93654,"DISJUNTOR MONOPOLAR TIPO DIN, CORRENTE NOMINAL DE 16A - FORNECIMENTO E INSTALAÇÃO. AF_04/2016","UN",8,1,8,null,null,0,0,""]
["S",2,"S",0,1,5,0,0,0,0,0,"","Serviço","Serviço","-","SINAPI",93653,"DISJUNTOR MONOPOLAR TIPO DIN, CORRENTE NOMINAL DE 10A - FORNECIMENTO E INSTALAÇÃO. AF_04/2016","UN",11,1,11,null,null,0,0,""]
["S",2,"S",0,1,5,0,0,0,0,0,"","Serviço","Serviço","-","AGETOP",71184,"DISPOSITIVO DE PROTEÇÃO CONTRA SURTOS (D.P.S.) 275V DE 8 A 40KA","Un    ",1,1,1,null,null,0,0,""]
["S",2,"S",0,1,5,0,0,0,0,0,"","Serviço","Serviço","-","AGETOP",71450,"INTERRUPTOR DIFERENCIAL RESIDUAL (D.R.) BIPOLAR DE 25A-30mA","Un    ",5,1,5,null,null,0,0,""]
["S",2,"S",0,1,5,0,0,0,0,0,"","Serviço","Serviço","-","SINAPI",92984,"CABO DE COBRE FLEXÍVEL ISOLADO, 25 MM², ANTI-CHAMA 0,6/1,0 KV, PARA DISTRIBUIÇÃO - FORNECIMENTO E INSTALAÇÃO. AF_12/2015","M",10,1,10,null,null,0,0,"Referência: AGETOP - 70511"]
["S",2,"S",0,1,5,0,0,0,0,0,"","Serviço","Serviço","-","SINAPI",92982,"CABO DE COBRE FLEXÍVEL ISOLADO, 16 MM², ANTI-CHAMA 0,6/1,0 KV, PARA DISTRIBUIÇÃO - FORNECIMENTO E INSTALAÇÃO. AF_12/2015","M",3,1,3,null,null,0,0,""]
["S",2,"S",0,1,5,0,0,0,0,0,"","Serviço","Serviço","-","SINAPI",91928,"CABO DE COBRE FLEXÍVEL ISOLADO, 4 MM², ANTI-CHAMA 450/750 V, PARA CIRCUITOS TERMINAIS - FORNECIMENTO E INSTALAÇÃO. AF_12/2015","M",845,1,845,null,null,0,0,"Referência: AGETOP - 70564"]
["S",2,"S",0,1,5,0,0,0,0,0,"","Serviço","Serviço","-","SINAPI",91926,"CABO DE COBRE FLEXÍVEL ISOLADO, 2,5 MM², ANTI-CHAMA 450/750 V, PARA CIRCUITOS TERMINAIS - FORNECIMENTO E INSTALAÇÃO. AF_12/2015","M",2087,1,2087,null,null,0,0,"Referência: AGETOP - 70563"]
["S",2,"S",0,1,5,0,0,0,0,0,"","Serviço","Serviço","-","SINAPI",92979,"CABO DE COBRE FLEXÍVEL ISOLADO, 10 MM², ANTI-CHAMA 450/750 V, PARA DISTRIBUIÇÃO - FORNECIMENTO E INSTALAÇÃO. AF_12/2015","M",485,1,485,null,null,0,0,""]
["S",2,"S",0,1,5,0,0,0,0,0,"","Serviço","Serviço","-","SINAPI",91871,"ELETRODUTO RÍGIDO ROSCÁVEL, PVC, DN 25 MM (3/4\"), PARA CIRCUITOS TERMINAIS, INSTALADO EM PAREDE - FORNECIMENTO E INSTALAÇÃO. AF_12/2015","M",579,1,579,null,null,0,0,"Referência: AGETOP - 71201"]
["S",2,"S",0,1,5,0,0,0,0,0,"","Serviço","Serviço","-","SINAPI",91872,"ELETRODUTO RÍGIDO ROSCÁVEL, PVC, DN 32 MM (1\"), PARA CIRCUITOS TERMINAIS, INSTALADO EM PAREDE - FORNECIMENTO E INSTALAÇÃO. AF_12/2015","M",150,1,150,null,null,0,0,"Referência: AGETOP - 71202"]
["S",{"$f":"IF(OR(C101=\"s\",C101=0),OFFSET(B101,-1,0),C101)","v":2},{"$f":"IF(OFFSET(C101,-1,0)=\"L\",1,IF(OFFSET(C101,-1,0)=1,2,IF(OR(A101=\"s\",A101=0),\"S\",IF(AND(OFFSET(C101,-1,0)=2,A101=4),3,IF(AND(OR(OFFSET(C101,-1,0)=\"s\",OFFSET(C101,-1,0)=0),A101<>\"s\",A101>OFFSET(B101,-1,0)),OFFSET(B101,-1,0),A101)))))","v":"S"},{"$f":"IF(OR(C101=\"S\",C101=0),0,IF(ISERROR(K101),J101,SMALL(J101:K101,1)))","v":0},{"$f":"IF($C101=1,OFFSET(E101,-1,0)+1,OFFSET(E101,-1,0))","v":1},{"$f":"IF($C101=1,0,IF($C101=2,OFFSET(F101,-1,0)+1,OFFSET(F101,-1,0)))","v":5},{"$f":"IF(AND($C101<=2,$C101<>0),0,IF($C101=3,OFFSET(G101,-1,0)+1,OFFSET(G101,-1,0)))","v":0},{"$f":"IF(AND($C101<=3,$C101<>0),0,IF($C101=4,OFFSET(H101,-1,0)+1,OFFSET(H101,-1,0)))","v":0},0,0,0,"","Serviço","Serviço","-","SINAPI",93008,"ELETRODUTO RÍGIDO ROSCÁVEL, PVC, DN 50 MM (1 1/2\") - FORNECIMENTO E INSTALAÇÃO. AF_12/2015","M",106,1,106,null,null,0,0,""]
["S",2,"S",0,1,5,0,0,0,0,0,"","Serviço","Serviço","-","AGETOP",70351,"BRACADEIRA METALICA TIPO \"U\" DIAM. 3/4\"","Un    ",100,1,100,null,null,0,0,""]
["S",2,"S",0,1,5,0,0,0,0,0,"","Serviço","Serviço","-","AGETOP",70352,"BRACADEIRA METALICA TIPO \"U\" DIAM. 1\"","Un    ",50,1,50,null,null,0,0,""]
["S",2,"S",0,1,5,0,0,0,0,0,"","Serviço","Serviço","-","AGETOP",70354,"BRACADEIRA METALICA TIPO \"U\" DIAM. 1.1/2\"","Un    ",36,1,36,null,null,0,0,""]
["S",2,"S",0,1,5,0,0,0,0,0,"","Serviço","Serviço","-","SINAPI",91879,"LUVA PARA ELETRODUTO, PVC, ROSCÁVEL, DN 25 MM (3/4\"), PARA CIRCUITOS TERMINAIS, INSTALADA EM LAJE - FORNECIMENTO E INSTALAÇÃO. AF_12/2015","UN",100,1,100,null,null,0,0,"Referência: AGETOP - 71741"]
["S",2,"S",0,1,5,0,0,0,0,0,"","Serviço","Serviço","-","SINAPI",91880,"LUVA PARA ELETRODUTO, PVC, ROSCÁVEL, DN 32 MM (1\"), PARA CIRCUITOS TERMINAIS, INSTALADA EM LAJE - FORNECIMENTO E INSTALAÇÃO. AF_12/2015","UN",50,1,50,null,null,0,0,"Referência: AGETOP - 71742"]
["S",2,"S",0,1,5,0,0,0,0,0,"","Serviço","Serviço","-","SINAPI",93013,"LUVA PARA ELETRODUTO, PVC, ROSCÁVEL, DN 50 MM (1 1/2\") - FORNECIMENTO E INSTALAÇÃO. AF_12/2015","UN",36,1,36,null,null,0,0,"Referência: AGETOP - 71744"]
["S",2,"S",0,1,5,0,0,0,0,0,"","Serviço","Serviço","-","AGETOP",72395,"TAMPA CEGA PARA CONDULETE METÁLICO","Un    ",25,1,25,null,null,0,0,""]
["S",2,"S",0,1,5,0,0,0,0,0,"","Serviço","Serviço","-","SINAPI",95801,"CONDULETE DE ALUMÍNIO, TIPO X, PARA ELETRODUTO DE AÇO GALVANIZADO DN 20 MM (3/4''), APARENTE - FORNECIMENTO E INSTALAÇÃO. AF_11/2016_P","UN",25,1,25,null,null,0,0,"Referência: AGETOP - 70929"]
["S",2,"S",0,1,5,0,0,0,0,0,"","Serviço","Serviço","-","SINAPI",91902,"CURVA 90 GRAUS PARA ELETRODUTO, PVC, ROSCÁVEL, DN 25 MM (3/4\"), PARA CIRCUITOS TERMINAIS, INSTALADA EM LAJE - FORNECIMENTO E INSTALAÇÃO. AF_12/2015","UN",5,1,5,null,null,0,0,"Referência: AGETOP - 71141"]
["S",2,"S",0,1,5,0,0,0,0,0,"","Serviço","Serviço","-","SINAPI",91905,"CURVA 90 GRAUS PARA ELETRODUTO, PVC, ROSCÁVEL, DN 32 MM (1\"), PARA CIRCUITOS TERMINAIS, INSTALADA EM LAJE - FORNECIMENTO E INSTALAÇÃO. AF_12/2015","UN",5,1,5,null,null,0,0,"Referência: AGETOP - 71142"]
["S",2,"S",0,1,5,0,0,0,0,0,"","Serviço","Serviço","-","AGETOP",71124,"CURVA 90 GRAUS AÇO ZINCADO DIÂMETRO 1.1/2\"","Un    ",5,1,5,null,null,0,0,""]
["S",2,"S",0,1,5,0,0,0,0,0,"","Serviço","Serviço","-","SINAPI",91939,"CAIXA RETANGULAR 4\" X 2\" ALTA (2,00 M DO PISO), PVC, INSTALADA EM PAREDE - FORNECIMENTO E INSTALAÇÃO. AF_12/2015","UN",121,1,121,null,null,0,0,""]
["S",2,"S",0,1,5,0,0,0,0,0,"","Serviço","Serviço","-","SINAPI",91937,"CAIXA OCTOGONAL 3\" X 3\", PVC, INSTALADA EM LAJE - FORNECIMENTO E INSTALAÇÃO. AF_12/2015","UN",74,1,74,null,null,0,0,""]
["S",2,"S",0,1,5,0,0,0,0,0,"","Serviço","Serviço","-","SINAPI",92865,"CAIXA OCTOGONAL 4\" X 4\", METÁLICA, INSTALADA EM LAJE - FORNECIMENTO E INSTALAÇÃO. AF_12/2015","UN",1,1,1,null,null,0,0,"Referência: AGETOP - 70682"]
["S",2,"S",0,1,5,0,0,0,0,0,"","Serviço","Serviço","-","SINAPI",91953,"INTERRUPTOR SIMPLES (1 MÓDULO), 10A/250V, INCLUINDO SUPORTE E PLACA - FORNECIMENTO E INSTALAÇÃO. AF_12/2015","UN",21,1,21,null,null,0,0,"Referência: AGETOP - 71440"]
["S",2,"S",0,1,5,0,0,0,0,0,"","Serviço","Serviço","-","SINAPI",91955,"INTERRUPTOR PARALELO (1 MÓDULO), 10A/250V, INCLUINDO SUPORTE E PLACA - FORNECIMENTO E INSTALAÇÃO. AF_12/2015","UN",6,1,6,null,null,0,0,"Referência: AGETOP - 71431"]
["S",2,"S",0,1,5,0,0,0,0,0,"","Serviço","Serviço","-","SINAPI",91959,"INTERRUPTOR SIMPLES (2 MÓDULOS), 10A/250V, INCLUINDO SUPORTE E PLACA - FORNECIMENTO E INSTALAÇÃO. AF_12/2015","UN",1,1,1,null,null,0,0,"Referência: AGETOP - 71441"]
["S",2,"S",0,1,5,0,0,0,0,0,"","Serviço","Serviço","-","SINAPI",91969,"INTERRUPTOR PARALELO (3 MÓDULOS), 10A/250V, INCLUINDO SUPORTE E PLACA - FORNECIMENTO E INSTALAÇÃO. AF_12/2015","UN",1,1,1,null,null,0,0,""]
["S",2,"S",0,1,5,0,0,0,0,0,"","Serviço","Serviço","-","SINAPI",92000,"TOMADA BAIXA DE EMBUTIR (1 MÓDULO), 2P+T 10 A, INCLUINDO SUPORTE E PLACA - FORNECIMENTO E INSTALAÇÃO. AF_12/2015","UN",43,1,43,null,null,0,0,"Referência: AGETOP - 72578"]
["S",2,"S",0,1,5,0,0,0,0,0,"","Serviço","Serviço","-","SINAPI",91996,"TOMADA MÉDIA DE EMBUTIR (1 MÓDULO), 2P+T 10 A, INCLUINDO SUPORTE E PLACA - FORNECIMENTO E INSTALAÇÃO. AF_12/2015","UN",6,1,6,null,null,0,0,"Referência: AGETOP - 72578"]
[{"$f":"CHOOSE(1+LOG(1+2*(ORÇAMENTO.Nivel=\"Nível 1\")+4*(ORÇAMENTO.Nivel=\"Nível 2\")+8*(ORÇAMENTO.Nivel=\"Nível 3\")+16*(ORÇAMENTO.Nivel=\"Nível 4\")+32*(ORÇAMENTO.Nivel=\"Serviço\"),2),0,1,2,3,4,\"S\")","v":"S"},{"$f":"IF(OR(C122=\"s\",C122=0),OFFSET(B122,-1,0),C122)","v":2},{"$f":"IF(OFFSET(C122,-1,0)=\"L\",1,IF(OFFSET(C122,-1,0)=1,2,IF(OR(A122=\"s\",A122=0),\"S\",IF(AND(OFFSET(C122,-1,0)=2,A122=4),3,IF(AND(OR(OFFSET(C122,-1,0)=\"s\",OFFSET(C122,-1,0)=0),A122<>\"s\",A122>OFFSET(B122,-1,0)),OFFSET(B122,-1,0),A122)))))","v":"S"},{"$f":"IF(OR(C122=\"S\",C122=0),0,IF(ISERROR(K122),J122,SMALL(J122:K122,1)))","v":0},{"$f":"IF($C122=1,OFFSET(E122,-1,0)+1,OFFSET(E122,-1,0))","v":1},{"$f":"IF($C122=1,0,IF($C122=2,OFFSET(F122,-1,0)+1,OFFSET(F122,-1,0)))","v":5},{"$f":"IF(AND($C122<=2,$C122<>0),0,IF($C122=3,OFFSET(G122,-1,0)+1,OFFSET(G122,-1,0)))","v":0},{"$f":"IF(AND($C122<=3,$C122<>0),0,IF($C122=4,OFFSET(H122,-1,0)+1,OFFSET(H122,-1,0)))","v":0},0,0,0,"","Serviço","Serviço","-","SINAPI",92005,"TOMADA MÉDIA DE EMBUTIR (2 MÓDULOS), 2P+T 20 A, INCLUINDO SUPORTE E PLACA - FORNECIMENTO E INSTALAÇÃO. AF_12/2015","UN",0,1,"-",null,null,0,0,""]
["S",2,"S",0,1,5,0,0,0,0,0,"","Serviço","Serviço","-","SINAPI",91993,"TOMADA ALTA DE EMBUTIR (1 MÓDULO), 2P+T 20 A, INCLUINDO SUPORTE E PLACA - FORNECIMENTO E INSTALAÇÃO. AF_12/2015","UN",16,1,16,null,null,0,0,"Referência: AGETOP - 72585"]
["S",2,"S",0,1,5,0,0,0,0,0,"","Serviço","Serviço","-","SINAPI",92004,"TOMADA MÉDIA DE EMBUTIR (2 MÓDULOS), 2P+T 10 A, INCLUINDO SUPORTE E PLACA - FORNECIMENTO E INSTALAÇÃO. AF_12/2015","UN",46,1,46,null,null,0,0,"Referência: AGETOP - 72578"]
["S",2,"S",0,1,5,0,0,0,0,0,"","Serviço","Serviço","-","SINAPI",91992,"TOMADA ALTA DE EMBUTIR (1 MÓDULO), 2P+T 10 A, INCLUINDO SUPORTE E PLACA - FORNECIMENTO E INSTALAÇÃO. AF_12/2015","UN",3,1,3,null,null,0,0,""]
["S",2,"S",0,1,5,0,0,0,0,0,"","Serviço","Serviço","-","SINAPI",97585,"LUMINÁRIA TIPO CALHA, DE SOBREPOR, COM 2 LÂMPADAS TUBULARES FLUORESCENTES DE 18 W, COM REATOR DE PARTIDA RÁPIDA - FORNECIMENTO E INSTALAÇÃO. AF_02/2020","UN",74,1,74,null,null,0,0,""]
["S",2,"S",0,1,5,0,0,0,0,0,"","Serviço","Serviço","-","COMPOSIÇÃO","COMP 387_SEE","LÂMPADA LED TUBULAR 18W ","UN ",148,1,148,null,null,0,0,""]
["S",2,"S",0,1,5,0,0,0,0,0,"","Serviço","Serviço","-","SINAPI",97606,"LUMINÁRIA ARANDELA TIPO MEIA LUA, DE SOBREPOR, COM 1 LÂMPADA FLUORESCENTE DE 15 W, SEM REATOR - FORNECIMENTO E INSTALAÇÃO. AF_02/2020","UN",10,1,10,null,null,0,0,""]
["S",2,"S",0,1,5,0,0,0,0,0,"","Serviço","Serviço","-","SINAPI",97610,"LÂMPADA COMPACTA DE LED 10 W, BASE E27 - FORNECIMENTO E INSTALAÇÃO. AF_02/2020","UN",10,1,10,null,null,0,0,""]
["S",2,"S",0,1,5,0,0,0,0,0,"","Serviço","Serviço","-","AGETOP",71380,"HASTE REV.COBRE(COPPERWELD)  3/4\" X 2,40 M C/CONECTOR","Un    ",3,1,3,null,null,0,0,""]
["S",2,"S",0,1,5,0,0,0,0,0,"","Serviço","Serviço","-","AGETOP",70255,"ATERRAMENTO - SOLDA EXOTÉRMICA - CARTUCHO 90 G","un    ",3,1,3,null,null,0,0,""]
["S",2,"S",0,1,5,0,0,0,0,0,"","Serviço","Serviço","-","AGETOP",70648,"CAIXA DE PASSAGEM METÁLICA DE EMBUTIR  40X40X15 CM","Un    ",2,1,2,null,null,0,0,""]
["S",2,"S",0,1,5,0,0,0,0,0,"","Serviço","Serviço","-","AGETOP",70391,"BUCHA DE NYLON S-6","Un    ",172,1,172,null,null,0,0,""]
["S",{"$f":"IF(OR(C134=\"s\",C134=0),OFFSET(B134,-1,0),C134)","v":2},{"$f":"IF(OFFSET(C134,-1,0)=\"L\",1,IF(OFFSET(C134,-1,0)=1,2,IF(OR(A134=\"s\",A134=0),\"S\",IF(AND(OFFSET(C134,-1,0)=2,A134=4),3,IF(AND(OR(OFFSET(C134,-1,0)=\"s\",OFFSET(C134,-1,0)=0),A134<>\"s\",A134>OFFSET(B134,-1,0)),OFFSET(B134,-1,0),A134)))))","v":"S"},{"$f":"IF(OR(C134=\"S\",C134=0),0,IF(ISERROR(K134),J134,SMALL(J134:K134,1)))","v":0},1,5,0,0,0,0,0,"","Serviço","Serviço","-","AGETOP",71861,"PARAFUSO P/BUCHA S-6","Un    ",172,1,172,null,null,0,0,""]
["S",2,"S",0,1,5,0,0,0,0,0,"","Serviço","Serviço","-","AGETOP",71826,"PADRÃO TRIFASICO 25 MM H=7 METROS","Un    ",1,1,1,null,null,0,0,""]
["S",2,"S",0,1,5,0,0,0,0,0,"","Serviço","Serviço","-","AGETOP",71321,"FITA DE AUTO FUSAO, ROLO E 10,00 MM","Un    ",5,1,5,null,null,0,0,""]
["S",2,"S",0,1,5,0,0,0,0,0,"","Serviço","Serviço","-","AGETOP",20162,"DEMOLIÇÃO DAS INSTALAÇÕES ELÉTRICAS E AFINS C/ TRANSP. ATÉ CB. E CARGA","H     ",40,1,40,null,null,0,0,""]
[{"$f":"CHOOSE(1+LOG(1+2*(ORÇAMENTO.Nivel=\"Nível 1\")+4*(ORÇAMENTO.Nivel=\"Nível 2\")+8*(ORÇAMENTO.Nivel=\"Nível 3\")+16*(ORÇAMENTO.Nivel=\"Nível 4\")+32*(ORÇAMENTO.Nivel=\"Serviço\"),2),0,1,2,3,4,\"S\")","v":2},{"$f":"IF(OR(C138=\"s\",C138=0),OFFSET(B138,-1,0),C138)","v":2},{"$f":"IF(OFFSET(C138,-1,0)=\"L\",1,IF(OFFSET(C138,-1,0)=1,2,IF(OR(A138=\"s\",A138=0),\"S\",IF(AND(OFFSET(C138,-1,0)=2,A138=4),3,IF(AND(OR(OFFSET(C138,-1,0)=\"s\",OFFSET(C138,-1,0)=0),A138<>\"s\",A138>OFFSET(B138,-1,0)),OFFSET(B138,-1,0),A138)))))","v":2},{"$f":"IF(OR(C138=\"S\",C138=0),0,IF(ISERROR(K138),J138,SMALL(J138:K138,1)))","v":83},{"$f":"IF($C138=1,OFFSET(E138,-1,0)+1,OFFSET(E138,-1,0))","v":1},{"$f":"IF($C138=1,0,IF($C138=2,OFFSET(F138,-1,0)+1,OFFSET(F138,-1,0)))","v":6},{"$f":"IF(AND($C138<=2,$C138<>0),0,IF($C138=3,OFFSET(G138,-1,0)+1,OFFSET(G138,-1,0)))","v":0},{"$f":"IF(AND($C138<=3,$C138<>0),0,IF($C138=4,OFFSET(H138,-1,0)+1,OFFSET(H138,-1,0)))","v":0},{"$f":"IF(AND($C138<=4,$C138<>0),0,IF(AND($C138=\"S\",$Y138>0),OFFSET(I138,-1,0)+1,OFFSET(I138,-1,0)))","v":0},242,83,"","Nível 2","Nível 2","-","AGETOP",null,"INSTALAÇÕES HIDROSSANITÁRIAS","-",null,1,"-",null,null,0,0,""]
[3,3,3,32,1,6,1,0,0,82,32,"","Nível 3","Nível 3","-","SINAPI",null,"PEÇAS E ACESSÓRIOS","-",null,1,"-",null,null,0,0,""]
[4,4,4,4,1,6,1,1,0,31,4,"","Nível 4","Nível 4","-","SINAPI",null,"CAIXAS E CURVAS","-",null,1,"-",null,null,0,0,""]
["S",4,"S",0,1,6,1,1,0,0,0,"","Serviço","Serviço","-","SINAPI",6171,"TAMPA DE CONCRETO ARMADO 60X60X5CM PARA CAIXA","UN",5,1,5,null,null,0,0,""]
["S",4,"S",0,1,6,1,1,0,0,0,"","Serviço","Serviço","-","AGETOP",70715,"CAIXA DE PASSAGEM 60X60X80CM FUNDO DE BRITA SEM TAMPA","Un    ",4,1,4,null,null,0,0,""]
[{"$f":"CHOOSE(1+LOG(1+2*(ORÇAMENTO.Nivel=\"Nível 1\")+4*(ORÇAMENTO.Nivel=\"Nível 2\")+8*(ORÇAMENTO.Nivel=\"Nível 3\")+16*(ORÇAMENTO.Nivel=\"Nível 4\")+32*(ORÇAMENTO.Nivel=\"Serviço\"),2),0,1,2,3,4,\"S\")","v":"S"},{"$f":"IF(OR(C143=\"s\",C143=0),OFFSET(B143,-1,0),C143)","v":4},{"$f":"IF(OFFSET(C143,-1,0)=\"L\",1,IF(OFFSET(C143,-1,0)=1,2,IF(OR(A143=\"s\",A143=0),\"S\",IF(AND(OFFSET(C143,-1,0)=2,A143=4),3,IF(AND(OR(OFFSET(C143,-1,0)=\"s\",OFFSET(C143,-1,0)=0),A143<>\"s\",A143>OFFSET(B143,-1,0)),OFFSET(B143,-1,0),A143)))))","v":"S"},{"$f":"IF(OR(C143=\"S\",C143=0),0,IF(ISERROR(K143),J143,SMALL(J143:K143,1)))","v":0},{"$f":"IF($C143=1,OFFSET(E143,-1,0)+1,OFFSET(E143,-1,0))","v":1},{"$f":"IF($C143=1,0,IF($C143=2,OFFSET(F143,-1,0)+1,OFFSET(F143,-1,0)))","v":6},{"$f":"IF(AND($C143<=2,$C143<>0),0,IF($C143=3,OFFSET(G143,-1,0)+1,OFFSET(G143,-1,0)))","v":1},{"$f":"IF(AND($C143<=3,$C143<>0),0,IF($C143=4,OFFSET(H143,-1,0)+1,OFFSET(H143,-1,0)))","v":1},0,0,0,"","Serviço","Serviço","-","AGETOP",81851,"CAIXA DE GORDURA 100 L CONCRETO PADRÃO GOINFRA IMPERMEABILIZADA","Un    ",1,1,1,null,null,0,0,""]
[4,4,4,8,1,6,1,2,0,27,8,"","Nível 4","Nível 4","-","SINAPI",null,"VASO SANITÁRIO E ACESSÓRIOS","-",null,1,"-",null,null,0,0,""]
["S",4,"S",0,1,6,1,2,0,0,0,"","Serviço","Serviço","-","SINAPI",95470,"VASO SANITARIO SIFONADO CONVENCIONAL COM LOUÇA BRANCA, INCLUSO CONJUNTO DE LIGAÇÃO PARA BACIA SANITÁRIA AJUSTÁVEL - FORNECIMENTO E INSTALAÇÃO. AF_10/2016","UN",3,1,3,null,null,0,0,""]
["S",4,"S",0,1,6,1,2,0,0,0,"","Serviço","Serviço","-","AGETOP",80514,"TUBO DE LIGACAO PVC CROMADO 1.1/2\" / ESPUDE  - (ENTRADA)","Un    ",3,1,3,null,null,0,0,""]
["S",4,"S",0,1,6,1,2,0,0,0,"","Serviço","Serviço","-","AGETOP",80513,"TUBO PARA VÁLVULA DE DESCARGA ( CURTO 1.1/4\" )","Un    ",3,1,3,null,null,0,0,""]
["S",4,"S",0,1,6,1,2,0,{"$f":"IF(OR($C148=\"S\",$C148=0),0,MATCH(0,OFFSET($D148,1,$C148,ROW($C$380)-ROW($C148)),0))","v":0},{"$f":"IF(OR($C148=\"S\",$C148=0),0,MATCH(OFFSET($D148,0,$C148)+1,OFFSET($D148,1,$C148,ROW($C$380)-ROW($C148)),0))","v":0},"","Serviço","Serviço","-","SINAPI",99635,"VÁLVULA DE DESCARGA METÁLICA, BASE 1 1/2 \", ACABAMENTO METALICO CROMADO - FORNECIMENTO E INSTALAÇÃO. AF_01/2019","UN",3,1,3,null,null,0,0,"Referência: AGETOP - 80515"]
["S",4,"S",0,1,6,1,2,0,0,0,"","Serviço","Serviço","-","AGETOP",80520,"CONJUNTO DE FIXACAO P/VASO SANITARIO (PAR)","CJ    ",3,1,3,null,null,0,0,""]
["S",4,"S",0,1,6,1,2,0,0,0,"","Serviço","Serviço","-","AGETOP",80510,"ANEL DE VEDAÇÃO PARA VASO SANITÁRIO","Un    ",3,1,3,null,null,0,0,""]
["S",4,"S",0,1,6,1,2,0,0,0,"","Serviço","Serviço","-","AGETOP",80526,"ASSENTO EM POLIPROPILENO COM SISTEMA DE FECHAMENTO SUAVE PARA VASO SANITÁRIO","Un    ",3,1,3,null,null,0,0,""]
[4,4,4,7,1,6,1,3,0,19,7,"","Nível 4","Nível 4","-",null,null,"LAVATÓRIO E ACESSÓRIOS","-",null,1,"-",null,null,0,0,""]
["S",4,"S",0,1,6,1,3,0,0,0,"","Serviço","Serviço","-","AGETOP",80542,"LAVATÓRIO MÉDIO SEM COLUNA","Un    ",3,1,3,null,null,0,0,""]
["S",4,"S",0,1,6,1,3,0,0,0,"","Serviço","Serviço","-","AGETOP",80550,"FIXACAO P/LAVATORIO (PAR)","PAR   ",3,1,3,null,null,0,0,""]
["S",4,"S",0,1,6,1,3,0,0,0,"","Serviço","Serviço","-","AGETOP",80556,"LIGAÇÃO FLEXÍVEL PVC DIAM.1/2\" (ENGATE)","Un    ",3,1,3,null,null,0,0,""]
["S",4,"S",0,1,6,1,3,0,0,0,"","Serviço","Serviço","-","SINAPI",86883,"SIFÃO DO TIPO FLEXÍVEL EM PVC 1  X 1.1/2  - FORNECIMENTO E INSTALAÇÃO. AF_01/2020","UN",3,1,3,null,null,0,0,""]
["S",4,"S",0,1,6,1,3,0,0,0,"","Serviço","Serviço","-","SINAPI",86915,"TORNEIRA CROMADA DE MESA, 1/2\u0094 OU 3/4\u0094, PARA LAVATÓRIO, PADRÃO MÉDIO - FORNECIMENTO E INSTALAÇÃO. AF_01/2020","UN",3,1,3,null,null,0,0,"Referência: AGETOP - 80570"]
["S",4,"S",0,1,6,1,3,0,0,0,"","Serviço","Serviço","-","SINAPI",86877,"VÁLVULA EM METAL CROMADO 1.1/2\u0094 X 1.1/2\u0094 PARA TANQUE OU LAVATÓRIO, COM OU SEM LADRÃO - FORNECIMENTO E INSTALAÇÃO. AF_01/2020","UN",3,1,3,null,null,0,0,"Referência: AGETOP - 80580"]
[{"$f":"CHOOSE(1+LOG(1+2*(ORÇAMENTO.Nivel=\"Nível 1\")+4*(ORÇAMENTO.Nivel=\"Nível 2\")+8*(ORÇAMENTO.Nivel=\"Nível 3\")+16*(ORÇAMENTO.Nivel=\"Nível 4\")+32*(ORÇAMENTO.Nivel=\"Serviço\"),2),0,1,2,3,4,\"S\")","v":4},4,4,5,1,6,1,4,0,12,5,"","Nível 4","Nível 4","-","SINAPI",null,"PIA E ACESSÓRIOS","-",null,1,"-",null,null,0,0,""]
["S",4,"S",0,1,6,1,4,0,0,0,"","Serviço","Serviço","-","AGETOP",80660,"TORNEIRA DE PAREDE PARA PIA OU BEBEDOURO DIÂMETRO DE 1/2\" E 3/4\" ","Un    ",1,1,1,null,null,0,0,""]
["S",4,"S",0,1,6,1,4,0,0,0,"","Serviço","Serviço","-","SINAPI",86881,"SIFÃO DO TIPO GARRAFA EM METAL CROMADO 1 X 1.1/2\u0094 - FORNECIMENTO E INSTALAÇÃO. AF_01/2020","UN",1,1,1,null,null,0,0,"Referência: AGETOP - 80670"]
["S",4,"S",0,1,6,1,4,0,0,0,"","Serviço","Serviço","-","SINAPI",86878,"VÁLVULA EM METAL CROMADO TIPO AMERICANA 3.1/2\u0094 X 1.1/2\u0094 PARA PIA - FORNECIMENTO E INSTALAÇÃO. AF_01/2020","UN",1,1,1,null,null,0,0,""]
["S",4,"S",0,1,6,1,4,0,0,0,"","Serviço","Serviço","-","AGETOP",80686,"CUBA INOX 56X34X17CM E=0,6MM-AÇO 304 (CUBA Nº2)","Un    ",1,1,1,null,null,0,0,""]
[4,{"$f":"IF(OR(C164=\"s\",C164=0),OFFSET(B164,-1,0),C164)","v":4},{"$f":"IF(OFFSET(C164,-1,0)=\"L\",1,IF(OFFSET(C164,-1,0)=1,2,IF(OR(A164=\"s\",A164=0),\"S\",IF(AND(OFFSET(C164,-1,0)=2,A164=4),3,IF(AND(OR(OFFSET(C164,-1,0)=\"s\",OFFSET(C164,-1,0)=0),A164<>\"s\",A164>OFFSET(B164,-1,0)),OFFSET(B164,-1,0),A164)))))","v":4},{"$f":"IF(OR(C164=\"S\",C164=0),0,IF(ISERROR(K164),J164,SMALL(J164:K164,1)))","v":4},{"$f":"IF($C164=1,OFFSET(E164,-1,0)+1,OFFSET(E164,-1,0))","v":1},{"$f":"IF($C164=1,0,IF($C164=2,OFFSET(F164,-1,0)+1,OFFSET(F164,-1,0)))","v":6},{"$f":"IF(AND($C164<=2,$C164<>0),0,IF($C164=3,OFFSET(G164,-1,0)+1,OFFSET(G164,-1,0)))","v":1},{"$f":"IF(AND($C164<=3,$C164<>0),0,IF($C164=4,OFFSET(H164,-1,0)+1,OFFSET(H164,-1,0)))","v":5},0,7,4,"","Nível 4","Nível 4","-","SINAPI",null,"CHUVEIRO","-",null,1,"-",null,null,0,0,""]
["S",{"$f":"IF(OR(C165=\"s\",C165=0),OFFSET(B165,-1,0),C165)","v":4},{"$f":"IF(OFFSET(C165,-1,0)=\"L\",1,IF(OFFSET(C165,-1,0)=1,2,IF(OR(A165=\"s\",A165=0),\"S\",IF(AND(OFFSET(C165,-1,0)=2,A165=4),3,IF(AND(OR(OFFSET(C165,-1,0)=\"s\",OFFSET(C165,-1,0)=0),A165<>\"s\",A165>OFFSET(B165,-1,0)),OFFSET(B165,-1,0),A165)))))","v":"S"},{"$f":"IF(OR(C165=\"S\",C165=0),0,IF(ISERROR(K165),J165,SMALL(J165:K165,1)))","v":0},{"$f":"IF($C165=1,OFFSET(E165,-1,0)+1,OFFSET(E165,-1,0))","v":1},{"$f":"IF($C165=1,0,IF($C165=2,OFFSET(F165,-1,0)+1,OFFSET(F165,-1,0)))","v":6},{"$f":"IF(AND($C165<=2,$C165<>0),0,IF($C165=3,OFFSET(G165,-1,0)+1,OFFSET(G165,-1,0)))","v":1},{"$f":"IF(AND($C165<=3,$C165<>0),0,IF($C165=4,OFFSET(H165,-1,0)+1,OFFSET(H165,-1,0)))","v":5},0,0,0,"","Serviço","Serviço","-","AGETOP",80721,"CHUVEIRO ELÉTRICO EM PVC COM BRAÇO METÁLICO","Un    ",1,1,1,null,null,0,0,""]
[{"$f":"CHOOSE(1+LOG(1+2*(ORÇAMENTO.Nivel=\"Nível 1\")+4*(ORÇAMENTO.Nivel=\"Nível 2\")+8*(ORÇAMENTO.Nivel=\"Nível 3\")+16*(ORÇAMENTO.Nivel=\"Nível 4\")+32*(ORÇAMENTO.Nivel=\"Serviço\"),2),0,1,2,3,4,\"S\")","v":"S"},4,"S",0,1,6,1,5,0,0,0,"","Serviço","Serviço","-","SINAPI",95543,"PORTA TOALHA BANHO EM METAL CROMADO, TIPO BARRA, INCLUSO FIXAÇÃO. AF_01/2020","UN",1,1,1,null,null,0,0,""]
["S",4,"S",0,1,6,1,5,0,0,0,"","Serviço","Serviço","-","AGETOP",80741,"SABONETEIRA EM METAL / ACABAMENTO CROMADO","Un    ",1,1,1,null,null,0,0,""]
[4,4,4,3,1,6,1,6,0,3,24,"","Nível 4","Nível 4","-","SINAPI",null,"REGISTROS","-",null,1,"-",null,null,0,0,""]
["S",4,"S",0,1,6,1,6,0,0,0,"","Serviço","Serviço","-","SINAPI",94794,"REGISTRO DE GAVETA BRUTO, LATÃO, ROSCÁVEL, 1 1/2\u0094, COM ACABAMENTO E CANOPLA CROMADOS, INSTALADO EM RESERVAÇÃO DE ÁGUA DE EDIFICAÇÃO QUE POSSUA RESERVATÓRIO DE FIBRA/FIBROCIMENTO \u0096 FORNECIMENTO E INSTALAÇÃO. AF_06/2016","UN",2,1,2,null,null,0,0,"Referência: AGETOP - 80929"]
[{"$f":"CHOOSE(1+LOG(1+2*(ORÇAMENTO.Nivel=\"Nível 1\")+4*(ORÇAMENTO.Nivel=\"Nível 2\")+8*(ORÇAMENTO.Nivel=\"Nível 3\")+16*(ORÇAMENTO.Nivel=\"Nível 4\")+32*(ORÇAMENTO.Nivel=\"Serviço\"),2),0,1,2,3,4,\"S\")","v":"S"},{"$f":"IF(OR(C170=\"s\",C170=0),OFFSET(B170,-1,0),C170)","v":4},{"$f":"IF(OFFSET(C170,-1,0)=\"L\",1,IF(OFFSET(C170,-1,0)=1,2,IF(OR(A170=\"s\",A170=0),\"S\",IF(AND(OFFSET(C170,-1,0)=2,A170=4),3,IF(AND(OR(OFFSET(C170,-1,0)=\"s\",OFFSET(C170,-1,0)=0),A170<>\"s\",A170>OFFSET(B170,-1,0)),OFFSET(B170,-1,0),A170)))))","v":"S"},{"$f":"IF(OR(C170=\"S\",C170=0),0,IF(ISERROR(K170),J170,SMALL(J170:K170,1)))","v":0},{"$f":"IF($C170=1,OFFSET(E170,-1,0)+1,OFFSET(E170,-1,0))","v":1},{"$f":"IF($C170=1,0,IF($C170=2,OFFSET(F170,-1,0)+1,OFFSET(F170,-1,0)))","v":6},{"$f":"IF(AND($C170<=2,$C170<>0),0,IF($C170=3,OFFSET(G170,-1,0)+1,OFFSET(G170,-1,0)))","v":1},{"$f":"IF(AND($C170<=3,$C170<>0),0,IF($C170=4,OFFSET(H170,-1,0)+1,OFFSET(H170,-1,0)))","v":6},0,0,0,"","Serviço","Serviço","-","SINAPI",89353,"REGISTRO DE GAVETA BRUTO, LATÃO, ROSCÁVEL, 3/4\", FORNECIDO E INSTALADO EM RAMAL DE ÁGUA. AF_12/2014","UN",1,1,1,null,null,0,0,"Referência: AGETOP - 80902"]
[3,3,3,24,1,6,2,0,0,50,24,"","Nível 3","Nível 3","-","SINAPI",null,"ÁGUA FRIA","-",null,1,"-",null,null,0,0,""]
[4,4,4,4,1,6,2,1,0,23,4,"","Nível 4","Nível 4","-","SINAPI",null,"TUBOS DE PVC SOLDÁVEL","-",null,1,"-",null,null,0,0,""]
[{"$f":"CHOOSE(1+LOG(1+2*(ORÇAMENTO.Nivel=\"Nível 1\")+4*(ORÇAMENTO.Nivel=\"Nível 2\")+8*(ORÇAMENTO.Nivel=\"Nível 3\")+16*(ORÇAMENTO.Nivel=\"Nível 4\")+32*(ORÇAMENTO.Nivel=\"Serviço\"),2),0,1,2,3,4,\"S\")","v":"S"},4,"S",0,1,6,2,1,0,0,0,"","Serviço","Serviço","-","SINAPI",89402,"TUBO, PVC, SOLDÁVEL, DN 25MM, INSTALADO EM RAMAL DE DISTRIBUIÇÃO DE ÁGUA - FORNECIMENTO E INSTALAÇÃO. AF_12/2014","M",12,1,12,null,null,0,0,"Referência: AGETOP - 81003"]
["S",4,"S",0,1,6,2,1,0,0,0,"","Serviço","Serviço","-","SINAPI",89448,"TUBO, PVC, SOLDÁVEL, DN 40MM, INSTALADO EM PRUMADA DE ÁGUA - FORNECIMENTO E INSTALAÇÃO. AF_12/2014","M",10,1,10,null,null,0,0,""]
["S",4,"S",0,1,6,2,1,0,0,0,"","Serviço","Serviço","-","SINAPI",89449,"TUBO, PVC, SOLDÁVEL, DN 50MM, INSTALADO EM PRUMADA DE ÁGUA - FORNECIMENTO E INSTALAÇÃO. AF_12/2014","M",10,1,10,null,null,0,0,""]
[4,4,4,3,1,6,2,2,0,19,3,"","Nível 4","Nível 4","-","SINAPI",null,"ADAPTADORES DE PVC SOLDÁVEL","-",null,1,"-",null,null,0,0,""]
["S",4,"S",0,1,6,2,2,0,0,0,"","Serviço","Serviço","-","SINAPI",94711,"ADAPTADOR COM FLANGES LIVRES, PVC, SOLDÁVEL, DN 50 MM X 1 1/2 , INSTALADO EM RESERVAÇÃO DE ÁGUA DE EDIFICAÇÃO QUE POSSUA RESERVATÓRIO DE FIBRA/FIBROCIMENTO   FORNECIMENTO E INSTALAÇÃO. AF_06/2016","UN",6,1,6,null,null,0,0,"Referência: AGETOP - 81043"]
[{"$f":"CHOOSE(1+LOG(1+2*(ORÇAMENTO.Nivel=\"Nível 1\")+4*(ORÇAMENTO.Nivel=\"Nível 2\")+8*(ORÇAMENTO.Nivel=\"Nível 3\")+16*(ORÇAMENTO.Nivel=\"Nível 4\")+32*(ORÇAMENTO.Nivel=\"Serviço\"),2),0,1,2,3,4,\"S\")","v":"S"},4,"S",0,1,6,2,2,0,0,0,"","Serviço","Serviço","-","SINAPI",89429,"ADAPTADOR CURTO COM BOLSA E ROSCA PARA REGISTRO, PVC, SOLDÁVEL, DN 25MM X 3/4\u0094, INSTALADO EM RAMAL DE DISTRIBUIÇÃO DE ÁGUA - FORNECIMENTO E INSTALAÇÃO. AF_12/2014","UN",2,1,2,null,null,0,0,"Referência: AGETOP - 81066"]
[4,4,4,2,1,6,2,3,0,16,2,"","Nível 4","Nível 4","-","SINAPI",null,"BUCHAS","-",null,1,"-",null,null,0,0,""]
["S",4,"S",0,1,6,2,3,0,0,0,"","Serviço","Serviço","-","AGETOP",81177,"BUCHA DE REDUCAO SOLD.LONGA 40 X 25","Un    ",1,1,1,null,null,0,0,""]
[4,4,4,4,1,6,2,4,0,14,4,"","Nível 4","Nível 4","-","SINAPI",null,"LUVAS DE PVC","-",null,1,"-",null,null,0,0,""]
["S",4,"S",0,1,6,2,4,0,0,0,"","Serviço","Serviço","-","SINAPI",89528,"LUVA, PVC, SOLDÁVEL, DN 25MM, INSTALADO EM PRUMADA DE ÁGUA - FORNECIMENTO E INSTALAÇÃO. AF_12/2014","UN",3,1,3,null,null,0,0,""]
["S",4,"S",0,1,6,2,4,0,0,0,"","Serviço","Serviço","-","SINAPI",89575,"LUVA, PVC, SOLDÁVEL, DN 50MM, INSTALADO EM PRUMADA DE ÁGUA - FORNECIMENTO E INSTALAÇÃO. AF_12/2014","UN",3,1,3,null,null,0,0,"Referência: AGETOP - 81105"]
["S",4,"S",0,1,6,2,4,0,0,0,"","Serviço","Serviço","-","SINAPI",89558,"LUVA, PVC, SOLDÁVEL, DN 40MM, INSTALADO EM PRUMADA DE ÁGUA - FORNECIMENTO E INSTALAÇÃO. AF_12/2014","UN",2,1,2,null,null,0,0,""]
[4,4,4,5,1,6,2,5,0,10,5,"","Nível 4","Nível 4","-","SINAPI",null,"JOELHO","-",null,1,"-",null,null,0,0,""]
["S",4,"S",0,1,6,2,5,0,0,0,"","Serviço","Serviço","-","SINAPI",89481,"JOELHO 90 GRAUS, PVC, SOLDÁVEL, DN 25MM, INSTALADO EM PRUMADA DE ÁGUA - FORNECIMENTO E INSTALAÇÃO. AF_12/2014","UN",8,1,8,null,null,0,0,""]
["S",4,"S",0,1,6,2,5,0,0,0,"","Serviço","Serviço","-","SINAPI",89497,"JOELHO 90 GRAUS, PVC, SOLDÁVEL, DN 40MM, INSTALADO EM PRUMADA DE ÁGUA - FORNECIMENTO E INSTALAÇÃO. AF_12/2014","UN",4,1,4,null,null,0,0,""]
["S",4,"S",0,1,6,2,5,0,0,0,"","Serviço","Serviço","-","SINAPI",89501,"JOELHO 90 GRAUS, PVC, SOLDÁVEL, DN 50MM, INSTALADO EM PRUMADA DE ÁGUA - FORNECIMENTO E INSTALAÇÃO. AF_12/2014","UN",5,1,5,null,null,0,0,""]
["S",4,"S",0,1,6,2,5,0,0,0,"","Serviço","Serviço","-","SINAPI",94672,"JOELHO 90 GRAUS COM BUCHA DE LATÃO, PVC, SOLDÁVEL, DN  25 MM, X 3/4\u0094 INSTALADO EM RESERVAÇÃO DE ÁGUA DE EDIFICAÇÃO QUE POSSUA RESERVATÓRIO DE FIBRA/FIBROCIMENTO   FORNECIMENTO E INSTALAÇÃO. AF_06/2016","UN",3,1,3,null,null,0,0,""]
[4,4,4,2,1,6,2,6,0,5,2,"","Nível 4","Nível 4","-","SINAPI",null,"TÊ","-",null,1,"-",null,null,0,0,""]
["S",4,"S",0,1,6,2,6,0,0,0,"","Serviço","Serviço","-","SINAPI",89627,"TÊ DE REDUÇÃO, PVC, SOLDÁVEL, DN 50MM X 25MM, INSTALADO EM PRUMADA DE ÁGUA - FORNECIMENTO E INSTALAÇÃO. AF_12/2014","UN",2,1,2,null,null,0,0,""]
[4,4,4,3,1,6,2,7,0,3,{"$error":"#N/A"},"","Nível 4","Nível 4","-","SINAPI",null,"ADESIVOS","-",null,1,"-",null,null,0,0,""]
["S",4,"S",0,1,6,2,7,0,0,0,"","Serviço","Serviço","-","AGETOP",81501,"ADESIVO PLASTICO - FRASCO 850 G","Un    ",2,1,2,null,null,0,0,""]
["S",4,"S",0,1,6,2,7,0,0,0,"","Serviço","Serviço","-","AGETOP",81504,"SOLUCAO LIMPADORA 1000 CM3","Un    ",2,1,2,null,null,0,0,""]
[3,3,3,24,1,6,3,0,0,26,24,"","Nível 3","Nível 3","-","SINAPI",null,"ESGOTO SANITÁRIO","-",null,1,"-",null,null,0,0,""]
[4,4,4,2,1,6,3,1,0,23,2,"","Nível 4","Nível 4","-","SINAPI",null,"CORPO DE CAIXA SIFONADA / RALO","-",null,1,"-",null,null,0,0,""]
["S",4,"S",0,1,6,3,1,0,0,0,"","Serviço","Serviço","-","AGETOP",81663,"CORPO CX. SIFONADA DIAM. 150 X 150 X 50","Un    ",3,1,3,null,null,0,0,""]
[4,4,4,2,1,6,3,2,0,21,2,"","Nível 4","Nível 4","-","SINAPI",null,"CURVAS","-",null,1,"-",null,null,0,0,""]
["S",4,"S",0,1,6,3,2,0,0,0,"","Serviço","Serviço","-","AGETOP",81730,"CURVA 90 GRAUS CURTA DIAM. 40 MM","Un    ",2,1,2,null,null,0,0,""]
[4,4,4,6,1,6,3,3,0,19,6,"","Nível 4","Nível 4","-","SINAPI",null,"JOELHOS","-",null,1,"-",null,null,0,0,""]
["S",4,"S",0,1,6,3,3,0,0,0,"","Serviço","Serviço","-","SINAPI",89726,"JOELHO 45 GRAUS, PVC, SERIE NORMAL, ESGOTO PREDIAL, DN 40 MM, JUNTA SOLDÁVEL, FORNECIDO E INSTALADO EM RAMAL DE DESCARGA OU RAMAL DE ESGOTO SANITÁRIO. AF_12/2014","UN",1,1,1,null,null,0,0,""]
["S",4,"S",0,1,6,3,3,0,0,0,"","Serviço","Serviço","-","SINAPI",89802,"JOELHO 45 GRAUS, PVC, SERIE NORMAL, ESGOTO PREDIAL, DN 50 MM, JUNTA ELÁSTICA, FORNECIDO E INSTALADO EM PRUMADA DE ESGOTO SANITÁRIO OU VENTILAÇÃO. AF_12/2014","UN",4,1,4,null,null,0,0,""]
["S",4,"S",0,1,6,3,3,0,0,0,"","Serviço","Serviço","-","AGETOP",81938,"JOELHO 90 GRAUS DIAMETRO 100 MM","Un    ",2,1,2,null,null,0,0,""]
["S",4,"S",0,1,6,3,3,0,0,0,"","Serviço","Serviço","-","SINAPI",89731,"JOELHO 90 GRAUS, PVC, SERIE NORMAL, ESGOTO PREDIAL, DN 50 MM, JUNTA ELÁSTICA, FORNECIDO E INSTALADO EM RAMAL DE DESCARGA OU RAMAL DE ESGOTO SANITÁRIO. AF_12/2014","UN",4,1,4,null,null,0,0,""]
["S",4,"S",0,1,6,3,3,0,0,0,"","Serviço","Serviço","-","AGETOP",81927,"JOELHO 90 GRAUS C/ANEL 40 mm ","Un    ",2,1,2,null,null,0,0,""]
[4,4,4,3,1,6,3,4,0,13,3,"","Nível 4","Nível 4","-","SINAPI",null,"JUNÇÕES","-",null,1,"-",null,null,0,0,""]
["S",4,"S",0,1,6,3,4,0,0,0,"","Serviço","Serviço","-","SINAPI",89797,"JUNÇÃO SIMPLES, PVC, SERIE NORMAL, ESGOTO PREDIAL, DN 100 X 100 MM, JUNTA ELÁSTICA, FORNECIDO E INSTALADO EM RAMAL DE DESCARGA OU RAMAL DE ESGOTO SANITÁRIO. AF_12/2014","UN",1,1,1,null,null,0,0,"Referência: AGETOP - 81975"]
["S",4,"S",0,1,6,3,4,0,0,0,"","Serviço","Serviço","-","AGETOP",81973,"JUNCAO SIMPLES DIAM. 100 X 50 MM","Un    ",1,1,1,null,null,0,0,""]
[4,4,4,4,1,6,3,5,0,10,4,"","Nível 4","Nível 4","-","SINAPI",null,"LUVAS","-",null,1,"-",null,null,0,0,""]
["S",4,"S",0,1,6,3,5,0,0,0,"","Serviço","Serviço","-","SINAPI",89752,"LUVA SIMPLES, PVC, SERIE NORMAL, ESGOTO PREDIAL, DN 40 MM, JUNTA SOLDÁVEL, FORNECIDO E INSTALADO EM RAMAL DE DESCARGA OU RAMAL DE ESGOTO SANITÁRIO. AF_12/2014","UN",2,1,2,null,null,0,0,"Referência: AGETOP - 82001"]
["S",4,"S",0,1,6,3,5,0,0,0,"","Serviço","Serviço","-","SINAPI",89753,"LUVA SIMPLES, PVC, SERIE NORMAL, ESGOTO PREDIAL, DN 50 MM, JUNTA ELÁSTICA, FORNECIDO E INSTALADO EM RAMAL DE DESCARGA OU RAMAL DE ESGOTO SANITÁRIO. AF_12/2014","UN",2,1,2,null,null,0,0,"Referência: AGETOP - 82002"]
["S",4,"S",0,1,6,3,5,0,{"$f":"IF(OR($C212=\"S\",$C212=0),0,MATCH(0,OFFSET($D212,1,$C212,ROW($C$380)-ROW($C212)),0))","v":0},{"$f":"IF(OR($C212=\"S\",$C212=0),0,MATCH(OFFSET($D212,0,$C212)+1,OFFSET($D212,1,$C212,ROW($C$380)-ROW($C212)),0))","v":0},"","Serviço","Serviço","-","SINAPI",89778,"LUVA SIMPLES, PVC, SERIE NORMAL, ESGOTO PREDIAL, DN 100 MM, JUNTA ELÁSTICA, FORNECIDO E INSTALADO EM RAMAL DE DESCARGA OU RAMAL DE ESGOTO SANITÁRIO. AF_12/2014","UN",2,1,2,null,null,0,0,"Referência: AGETOP - 82004"]
[4,4,4,2,1,6,3,6,0,6,2,"","Nível 4","Nível 4","-","SINAPI",null,"TÊ","-",null,1,"-",null,null,0,0,""]
["S",4,"S",0,1,6,3,6,0,0,0,"","Serviço","Serviço","-","SINAPI",89825,"TE, PVC, SERIE NORMAL, ESGOTO PREDIAL, DN 50 X 50 MM, JUNTA ELÁSTICA, FORNECIDO E INSTALADO EM PRUMADA DE ESGOTO SANITÁRIO OU VENTILAÇÃO. AF_12/2014","UN",3,1,3,null,null,0,0,""]
[4,4,4,4,1,6,3,7,0,4,{"$error":"#N/A"},"","Nível 4","Nível 4","-","SINAPI",null,"TUBOS","-",null,1,"-",null,null,0,0,""]
["S",4,"S",0,1,6,3,7,0,0,0,"","Serviço","Serviço","-","SINAPI",89711,"TUBO PVC, SERIE NORMAL, ESGOTO PREDIAL, DN 40 MM, FORNECIDO E INSTALADO EM RAMAL DE DESCARGA OU RAMAL DE ESGOTO SANITÁRIO. AF_12/2014","M",4,1,4,null,null,0,0,"Referência: AGETOP - 82301"]
["S",4,"S",0,1,6,3,7,0,0,0,"","Serviço","Serviço","-","SINAPI",89798,"TUBO PVC, SERIE NORMAL, ESGOTO PREDIAL, DN 50 MM, FORNECIDO E INSTALADO EM PRUMADA DE ESGOTO SANITÁRIO OU VENTILAÇÃO. AF_12/2014","M",12,1,12,null,null,0,0,""]
["S",4,"S",0,1,6,3,7,0,0,0,"","Serviço","Serviço","-","SINAPI",89800,"TUBO PVC, SERIE NORMAL, ESGOTO PREDIAL, DN 100 MM, FORNECIDO E INSTALADO EM PRUMADA DE ESGOTO SANITÁRIO OU VENTILAÇÃO. AF_12/2014","M",48,1,48,null,null,0,0,""]
[3,3,3,2,1,6,4,0,0,2,149,"","Nível 3","Nível 3","-","SINAPI",null,"EXTRAS","-",null,1,"-",null,null,0,0,""]
["S",3,"S",0,1,6,4,0,0,0,0,"","Serviço","Serviço","-","AGETOP",81885,"TERMINAL DE VENTILACAO DIAMETRO 50 MM","Un    ",1,1,1,null,null,0,0,""]
[{"$f":"CHOOSE(1+LOG(1+2*(ORÇAMENTO.Nivel=\"Nível 1\")+4*(ORÇAMENTO.Nivel=\"Nível 2\")+8*(ORÇAMENTO.Nivel=\"Nível 3\")+16*(ORÇAMENTO.Nivel=\"Nível 4\")+32*(ORÇAMENTO.Nivel=\"Serviço\"),2),0,1,2,3,4,\"S\")","v":2},{"$f":"IF(OR(C221=\"s\",C221=0),OFFSET(B221,-1,0),C221)","v":2},{"$f":"IF(OFFSET(C221,-1,0)=\"L\",1,IF(OFFSET(C221,-1,0)=1,2,IF(OR(A221=\"s\",A221=0),\"S\",IF(AND(OFFSET(C221,-1,0)=2,A221=4),3,IF(AND(OR(OFFSET(C221,-1,0)=\"s\",OFFSET(C221,-1,0)=0),A221<>\"s\",A221>OFFSET(B221,-1,0)),OFFSET(B221,-1,0),A221)))))","v":2},{"$f":"IF(OR(C221=\"S\",C221=0),0,IF(ISERROR(K221),J221,SMALL(J221:K221,1)))","v":39},{"$f":"IF($C221=1,OFFSET(E221,-1,0)+1,OFFSET(E221,-1,0))","v":1},{"$f":"IF($C221=1,0,IF($C221=2,OFFSET(F221,-1,0)+1,OFFSET(F221,-1,0)))","v":7},{"$f":"IF(AND($C221<=2,$C221<>0),0,IF($C221=3,OFFSET(G221,-1,0)+1,OFFSET(G221,-1,0)))","v":0},{"$f":"IF(AND($C221<=3,$C221<>0),0,IF($C221=4,OFFSET(H221,-1,0)+1,OFFSET(H221,-1,0)))","v":0},{"$f":"IF(AND($C221<=4,$C221<>0),0,IF(AND($C221=\"S\",$Y221>0),OFFSET(I221,-1,0)+1,OFFSET(I221,-1,0)))","v":0},159,39,"","Nível 2","Nível 2","-",null,null,"INSTALAÇÕES ESPECIAIS","-",null,1,"-",null,null,0,0,""]
[3,3,3,9,1,7,1,0,0,38,9,"","Nível 3","Nível 3","-","SINAPI",null,"INSTALAÇÕES DE PREVENÇÃO E COMBATE À INCÊNDIO","-",null,1,"-",null,null,0,0,""]
["S",3,"S",0,1,7,1,0,0,0,0,"","Serviço","Serviço","-","AGETOP",85003,"EXTINTOR PO QUIMICO SECO (6 KG) - CAPACIDADE EXTINTORA 20 BC","Un    ",1,1,1,null,null,0,0,""]
["S",3,"S",0,1,7,1,0,0,0,0,"","Serviço","Serviço","-","AGETOP",85006,"EXTINTOR MULTI USO EM PO A B C (6 KG) - CAPACIDADE EXTINTORA 3A 20BC","un    ",4,1,4,null,null,0,0,""]
["S",3,"S",0,1,7,1,0,0,0,0,"","Serviço","Serviço","-","SINAPI",97599,"LUMINÁRIA DE EMERGÊNCIA, COM 30 LÂMPADAS LED DE 2 W, SEM REATOR - FORNECIMENTO E INSTALAÇÃO. AF_02/2020","UN",14,1,14,null,null,0,0,""]
["S",3,"S",0,1,7,1,0,0,0,0,"","Serviço","Serviço","-","COMPOSIÇÃO","COMP 024_SEE","SINALIZADOR FOTOLUMINESCENTE PARA EXTINTOR","UN ",4,1,4,null,null,0,0,""]
["S",3,"S",0,1,7,1,0,0,0,0,"","Serviço","Serviço","-","COMPOSIÇÃO","COMP 025_SEE","SINALIZADOR FOTOLUMINESCENTE DE EMERGÊNCIA","UN ",30,1,30,null,null,0,0,""]
["S",3,"S",0,1,7,1,0,0,0,0,"","Serviço","Serviço","-","COMPOSIÇÃO","COMP 277_SEE","MARCAÇÃO NO PISO - 1X1 M PARA EXTINTOR","M2",3,1,3,null,null,0,0,""]
["S",3,"S",0,1,7,1,0,0,0,0,"","Serviço","Serviço","-","COMPOSIÇÃO","COMP 235_SEE","PLACA DE SINALIZAÇÃO EM PVC COD 01 - (300X300) PROIBIDO FUMAR","UN ",1,1,1,null,null,0,0,""]
["S",3,"S",0,1,7,1,0,0,0,0,"","Serviço","Serviço","-","COMPOSIÇÃO","COMP 236_SEE","PLACA DE SINALIZAÇÃO EM PVC COD 06 - (300X300) PERIGO INFLAMÁVEL","UN ",1,1,1,null,null,0,0,""]
[3,3,3,29,1,7,2,0,{"$f":"IF(AND($C231<=4,$C231<>0),0,IF(AND($C231=\"S\",$Y231>0),OFFSET(I231,-1,0)+1,OFFSET(I231,-1,0)))","v":0},29,54,"","Nível 3","Nível 3","-","SINAPI",null,"INSTALAÇÕES DE GÁS","-",null,1,"-",null,null,0,0,""]
[4,4,4,28,1,7,2,1,0,28,37,"","Nível 4","Nível 4","-","SINAPI",null,"IMPLANTAÇÃO","-",null,1,"-",null,null,0,0,""]
["S",4,"S",0,1,7,2,1,0,0,0,"","Serviço","Serviço","-","AGETOP",91007,"CENTRAL DE GÁS PADRÃO GOINFRA SEM INSTALAÇÕES (1+1 CILINDRO 45 KG)","Un    ",1,1,1,null,null,0,0,""]
["S",4,"S",0,1,7,2,1,0,0,0,"","Serviço","Serviço","-","AGETOP",91023,"UNIÃO S/BRONZE PRETA 3/4\" NPT 300 LBS","Un    ",3,1,3,null,null,0,0,""]
["S",4,"S",0,1,7,2,1,0,0,0,"","Serviço","Serviço","-","COMPOSIÇÃO","COMP 382_SEE","TE DE REDUCAO DE FERRO GALVANIZADO, COM ROSCA BSP, DE 3/4\" X 1/2\"","UN ",1,1,1,null,null,0,0,""]
["S",4,"S",0,1,7,2,1,0,0,0,"","Serviço","Serviço","-","COMPOSIÇÃO","COMP 383_SEE","BUCHA DE REDUCAO DE FERRO GALVANIZADO, COM ROSCA BSP, DE 1/2\" X 1/4\"","UN ",3,1,3,null,null,0,0,""]
["S",4,"S",0,1,7,2,1,0,0,0,"","Serviço","Serviço","-","AGETOP",91021,"LUVA GALVANIZADO DE REDUÇÃO 3/4\" X 1/2\" (GÁS)","Un    ",2,1,2,null,null,0,0,""]
["S",4,"S",0,1,7,2,1,0,0,0,"","Serviço","Serviço","-","SINAPI",92692,"NIPLE, EM FERRO GALVANIZADO, CONEXÃO ROSQUEADA, DN 15 (1/2\"), INSTALADO EM RAMAIS E SUB-RAMAIS DE GÁS - FORNECIMENTO E INSTALAÇÃO. AF_12/2015","UN",6,1,6,null,null,0,0,""]
["S",4,"S",0,1,7,2,1,0,0,0,"","Serviço","Serviço","-","AGETOP",91031,"NIPLE DUPLO 300 PSI 3/4\"","Un    ",6,1,6,null,null,0,0,""]
["S",4,"S",0,1,7,2,1,0,0,0,"","Serviço","Serviço","-","COMPOSIÇÃO","COMP 212_SEE","NIPLE DE REDUÇÃO 1/2\" X 1/4\" BSP","UN ",4,1,4,null,null,0,0,""]
["S",4,"S",0,1,7,2,1,0,0,0,"","Serviço","Serviço","-","COMPOSIÇÃO","COMP 213_SEE","NIPLE DE REDUÇÃO 3/4\" X 1/2\" BSP","UN ",4,1,4,null,null,0,0,""]
["S",4,"S",0,1,7,2,1,0,0,0,"","Serviço","Serviço","-","SINAPI",92688,"TUBO DE AÇO GALVANIZADO COM COSTURA, CLASSE MÉDIA, CONEXÃO ROSQUEADA, DN 20 (3/4\"), INSTALADO EM RAMAIS E SUB-RAMAIS DE GÁS - FORNECIMENTO E INSTALAÇÃO. AF_12/2015","M",6,1,6,null,null,0,0,""]
["S",4,"S",0,1,7,2,1,0,0,0,"","Serviço","Serviço","-","SINAPI",92701,"JOELHO 90 GRAUS, EM FERRO GALVANIZADO, CONEXÃO ROSQUEADA, DN 20 (3/4\"), INSTALADO EM RAMAIS E SUB-RAMAIS DE GÁS - FORNECIMENTO E INSTALAÇÃO. AF_12/2015","UN",3,1,3,null,null,0,0,""]
["S",4,"S",0,1,7,2,1,0,0,0,"","Serviço","Serviço","-","COMPOSIÇÃO","COMP 237_SEE","FITA ANTICORROSIVA","M",5,1,5,null,null,0,0,""]
["S",4,"S",0,1,7,2,1,0,0,0,"","Serviço","Serviço","-","AGETOP",91025,"VÁLVULA ESFERICA LATÃO 3/4\"","Un    ",3,1,3,null,null,0,0,""]
["S",4,"S",0,1,7,2,1,0,0,0,"","Serviço","Serviço","-","COMPOSIÇÃO","COMP 542_SEE","VÁLVULA UGV 3/4\" (S) LATÃO","UN ",1,1,1,null,null,0,0,""]
["S",4,"S",0,1,7,2,1,0,0,0,"","Serviço","Serviço","-","COMPOSIÇÃO","COMP 543_SEE","VÁLVULA UGV 1/2\" (S) LATÃO","UN ",1,1,1,null,null,0,0,""]
["S",4,"S",0,1,7,2,1,0,0,0,"","Serviço","Serviço","-","AGETOP",91029,"VALVULA DE RETENÇÃO LATÃO 1/2\" X 7/16\" NPT","Un    ",1,1,1,null,null,0,0,""]
["S",4,"S",0,1,7,2,1,0,0,0,"","Serviço","Serviço","-","COMPOSIÇÃO","COMP 211_SEE","REGULADOR DE 2º ESTÁGIO 5KG/H","UN ",1,1,1,null,null,0,0,""]
["S",4,"S",0,1,7,2,1,0,0,0,"","Serviço","Serviço","-","COMPOSIÇÃO","COMP 210_SEE","REGULADOR DE 1º ESTÁGIO 60KG/H MODELO AP-40  COM MANÔMETRO","UN ",1,1,1,null,null,0,0,""]
["S",4,"S",0,1,7,2,1,0,0,0,"","Serviço","Serviço","-","AGETOP",85003,"EXTINTOR PO QUIMICO SECO (6 KG) - CAPACIDADE EXTINTORA 20 BC","Un    ",1,1,1,null,null,0,0,""]
["S",4,"S",0,1,7,2,1,0,0,0,"","Serviço","Serviço","-","COMPOSIÇÃO","COMP 235_SEE","PLACA DE SINALIZAÇÃO EM PVC COD 01 - (300X300) PROIBIDO FUMAR","UN ",2,1,2,null,null,0,0,""]
["S",4,"S",0,1,7,2,1,0,0,0,"","Serviço","Serviço","-","COMPOSIÇÃO","COMP 236_SEE","PLACA DE SINALIZAÇÃO EM PVC COD 06 - (300X300) PERIGO INFLAMÁVEL","UN ",2,1,2,null,null,0,0,""]
["S",4,"S",0,1,7,2,1,0,0,0,"","Serviço","Serviço","-","AGETOP",91043,"BRAÇADEIRA METALICA TIPO \"D\" DIAM. 3/4\"","Un    ",4,1,4,null,null,0,0,""]
["S",4,"S",0,1,7,2,1,0,0,0,"","Serviço","Serviço","-","AGETOP",71863,"PARAFUSO P/BUCHA S-10","Un    ",8,1,8,null,null,0,0,""]
["S",4,"S",0,1,7,2,1,0,0,0,"","Serviço","Serviço","-","AGETOP",70393,"BUCHA DE NYLON S-10","Un    ",8,1,8,null,null,0,0,""]
["S",4,"S",0,1,7,2,1,0,0,0,"","Serviço","Serviço","-","AGETOP",91045,"SUPORTE PARA COLETOR","Un    ",2,1,2,null,null,0,0,""]
["S",4,"S",0,1,7,2,1,0,0,0,"","Serviço","Serviço","-","COMPOSIÇÃO","COMP 045_SEE","LAUDO DE ESTANQUEIDADE","UN ",1,1,1,null,null,0,0,""]
["S",4,"S",0,1,7,2,1,0,0,0,"","Serviço","Serviço","-","COMPOSIÇÃO","COMP 277_SEE","MARCAÇÃO NO PISO - 1X1 M PARA EXTINTOR","M2",1,1,1,null,null,0,0,""]
[2,{"$f":"IF(OR(C260=\"s\",C260=0),OFFSET(B260,-1,0),C260)","v":2},{"$f":"IF(OFFSET(C260,-1,0)=\"L\",1,IF(OFFSET(C260,-1,0)=1,2,IF(OR(A260=\"s\",A260=0),\"S\",IF(AND(OFFSET(C260,-1,0)=2,A260=4),3,IF(AND(OR(OFFSET(C260,-1,0)=\"s\",OFFSET(C260,-1,0)=0),A260<>\"s\",A260>OFFSET(B260,-1,0)),OFFSET(B260,-1,0),A260)))))","v":2},{"$f":"IF(OR(C260=\"S\",C260=0),0,IF(ISERROR(K260),J260,SMALL(J260:K260,1)))","v":5},{"$f":"IF($C260=1,OFFSET(E260,-1,0)+1,OFFSET(E260,-1,0))","v":1},{"$f":"IF($C260=1,0,IF($C260=2,OFFSET(F260,-1,0)+1,OFFSET(F260,-1,0)))","v":8},{"$f":"IF(AND($C260<=2,$C260<>0),0,IF($C260=3,OFFSET(G260,-1,0)+1,OFFSET(G260,-1,0)))","v":0},{"$f":"IF(AND($C260<=3,$C260<>0),0,IF($C260=4,OFFSET(H260,-1,0)+1,OFFSET(H260,-1,0)))","v":0},0,120,5,"","Nível 2","Nível 2","-","AGETOP",91045,"ALVENARIAS E DIVISÓRIAS","Un    ",null,1,"-",null,null,0,0,""]
[3,3,3,2,1,8,1,0,0,4,2,"","Nível 3","Nível 3","-","SINAPI",null,"ADAPTAÇÃO SANITÁRIOS PcD/CIRCULAÇÃO BLOCO 2","-",null,1,"-",null,null,0,0,""]
["S",3,"S",0,1,8,1,0,0,0,0,"","Serviço","Serviço","-","AGETOP",100201,"ALVENARIA DE TIJOLO FURADO 1/2 VEZ - 9 x 19 x 19 - ARG. (1CALH:4ARML+100KG DE CI/M3)","m2    ",2.66,1,2.66,null,null,0,0,""]
[{"$f":"CHOOSE(1+LOG(1+2*(ORÇAMENTO.Nivel=\"Nível 1\")+4*(ORÇAMENTO.Nivel=\"Nível 2\")+8*(ORÇAMENTO.Nivel=\"Nível 3\")+16*(ORÇAMENTO.Nivel=\"Nível 4\")+32*(ORÇAMENTO.Nivel=\"Serviço\"),2),0,1,2,3,4,\"S\")","v":3},3,3,2,1,8,2,0,0,2,22,"","Nível 3","Nível 3","-","SINAPI",null,"CALÇADA EXTERNA E RAMPA","-",null,1,"-",null,null,0,0,""]
["S",3,"S",0,1,8,2,0,0,0,0,"","Serviço","Serviço","-","SINAPI",89462,"ALVENARIA DE BLOCOS DE CONCRETO ESTRUTURAL 14X19X29 CM, (ESPESSURA 14 CM), FBK = 4,5 MPA, PARA PAREDES COM ÁREA LÍQUIDA MENOR QUE 6M², SEM VÃOS, UTILIZANDO PALHETA. AF_12/2014","M2",0.56999999999999995,1,0.56999999999999995,null,null,0,0,""]
[2,2,2,14,1,9,0,0,0,115,14,"","Nível 2","Nível 2","-",null,null,"COBERTURAS","-",null,1,"-",null,null,0,0,""]
[3,{"$f":"IF(OR(C266=\"s\",C266=0),OFFSET(B266,-1,0),C266)","v":3},{"$f":"IF(OFFSET(C266,-1,0)=\"L\",1,IF(OFFSET(C266,-1,0)=1,2,IF(OR(A266=\"s\",A266=0),\"S\",IF(AND(OFFSET(C266,-1,0)=2,A266=4),3,IF(AND(OR(OFFSET(C266,-1,0)=\"s\",OFFSET(C266,-1,0)=0),A266<>\"s\",A266>OFFSET(B266,-1,0)),OFFSET(B266,-1,0),A266)))))","v":3},{"$f":"IF(OR(C266=\"S\",C266=0),0,IF(ISERROR(K266),J266,SMALL(J266:K266,1)))","v":5},{"$f":"IF($C266=1,OFFSET(E266,-1,0)+1,OFFSET(E266,-1,0))","v":1},{"$f":"IF($C266=1,0,IF($C266=2,OFFSET(F266,-1,0)+1,OFFSET(F266,-1,0)))","v":9},{"$f":"IF(AND($C266<=2,$C266<>0),0,IF($C266=3,OFFSET(G266,-1,0)+1,OFFSET(G266,-1,0)))","v":1},{"$f":"IF(AND($C266<=3,$C266<>0),0,IF($C266=4,OFFSET(H266,-1,0)+1,OFFSET(H266,-1,0)))","v":0},{"$f":"IF(AND($C266<=4,$C266<>0),0,IF(AND($C266=\"S\",$Y266>0),OFFSET(I266,-1,0)+1,OFFSET(I266,-1,0)))","v":0},13,5,"","Nível 3","Nível 3","-",null,null,"METÁLICA","-",null,1,"-",null,null,0,0,""]
[4,4,4,2,1,9,1,1,0,4,2,"","Nível 4","Nível 4","-","SINAPI",null,"TELHADO BLOCO 1","-",null,1,"-",null,null,0,0,""]
["S",4,"S",0,1,9,1,1,0,0,0,"","Serviço","Serviço","-","SINAPI",94213,"TELHAMENTO COM TELHA DE AÇO/ALUMÍNIO E = 0,5 MM, COM ATÉ 2 ÁGUAS, INCLUSO IÇAMENTO. AF_07/2019","M2",168.82,1,168.82,null,null,0,0,"Referência: AGETOP - 160905"]
[4,4,4,2,1,9,1,2,0,2,55,"","Nível 4","Nível 4","-","SINAPI",null,"TELHADO BLOCO 2","-",null,1,"-",null,null,0,0,""]
["S",4,"S",0,1,9,1,2,0,0,0,"","Serviço","Serviço","-","SINAPI",94213,"TELHAMENTO COM TELHA DE AÇO/ALUMÍNIO E = 0,5 MM, COM ATÉ 2 ÁGUAS, INCLUSO IÇAMENTO. AF_07/2019","M2",114.17,1,114.17,null,null,0,0,"Referência: AGETOP - 160905"]
[3,3,3,8,1,9,2,0,0,8,14,"","Nível 3","Nível 3","-",null,null,"CALHA E RUFO","-",null,1,"-",null,null,0,0,""]
[4,4,4,3,1,9,2,1,0,7,3,"","Nível 4","Nível 4","-","SINAPI",null,"TELHADO BLOCO 1","-",null,1,"-",null,null,0,0,""]
["S",4,"S",0,1,9,2,1,0,0,0,"","Serviço","Serviço","-","AGETOP",160601,"CALHA DE CHAPA GALVANIZADA","m     ",44.7,1,44.7,null,null,0,0,""]
["S",4,"S",0,1,9,2,1,0,0,0,"","Serviço","Serviço","-","AGETOP",160602,"RUFO DE CHAPA GALVANIZADA","m     ",13.1,1,13.1,null,null,0,0,""]
[4,4,4,4,1,9,2,2,0,4,49,"","Nível 4","Nível 4","-","SINAPI",null,"TELHADO BLOCO 2","-",null,1,"-",null,null,0,0,""]
["S",4,"S",0,1,9,2,2,0,{"$f":"IF(OR($C276=\"S\",$C276=0),0,MATCH(0,OFFSET($D276,1,$C276,ROW($C$380)-ROW($C276)),0))","v":0},{"$f":"IF(OR($C276=\"S\",$C276=0),0,MATCH(OFFSET($D276,0,$C276)+1,OFFSET($D276,1,$C276,ROW($C$380)-ROW($C276)),0))","v":0},"","Serviço","Serviço","-","AGETOP",160601,"CALHA DE CHAPA GALVANIZADA","m     ",35.25,1,35.25,null,null,0,0,""]
["S",4,"S",0,1,9,2,2,0,0,0,"","Serviço","Serviço","-","AGETOP",160602,"RUFO DE CHAPA GALVANIZADA","m     ",12.96,1,12.96,null,null,0,0,""]
["S",4,"S",0,1,9,2,2,0,0,0,"","Serviço","Serviço","-","AGETOP",160965,"CUMEEIRA PARA TELHA GALVANIZADA ONDULADA 0,5 MM","m     ",17.62,1,17.62,null,null,0,0,""]
[2,2,2,8,1,10,0,0,0,101,8,"","Nível 2","Nível 2","-",null,null,"ESQUADRIAS METÁLICAS","-",null,1,"-",null,null,0,0,""]
[3,3,3,3,1,10,1,0,0,7,3,"","Nível 3","Nível 3","-","SINAPI",null,"ADAPTAÇÃO SANITÁRIOS PcD/CIRCULAÇÃO BLOCO 2","-",null,1,"-",null,null,0,0,""]
["S",3,"S",0,1,10,1,0,0,0,0,"","Serviço","Serviço","-","AGETOP",180501,"PORTA DE ABRIR EM CHAPA PF-1 C/FERRAGENS","m2    ",1.68,1,1.68,null,null,0,0,""]
["S",3,"S",0,1,10,1,0,0,0,0,"","Serviço","Serviço","-","AGETOP",180380,"ESQ. MAXIMO AR CHAPA/VIDRO J4 C/FERRAGENS","m2    ",0.36,1,0.36,null,null,0,0,""]
[{"$f":"CHOOSE(1+LOG(1+2*(ORÇAMENTO.Nivel=\"Nível 1\")+4*(ORÇAMENTO.Nivel=\"Nível 2\")+8*(ORÇAMENTO.Nivel=\"Nível 3\")+16*(ORÇAMENTO.Nivel=\"Nível 4\")+32*(ORÇAMENTO.Nivel=\"Serviço\"),2),0,1,2,3,4,\"S\")","v":3},3,3,2,1,10,2,0,0,4,2,"","Nível 3","Nível 3","-","SINAPI",null,"CALÇADA EXTERNA E RAMPA","-",null,1,"-",null,null,0,0,""]
["S",3,"S",0,1,10,2,0,0,0,0,"","Serviço","Serviço","-","COMPOSIÇÃO","COMP 084_SEE","GUARDA-CORPO COM CORRIMÃO - SEDUC","M",1.1299999999999999,1,1.1299999999999999,null,null,0,0,""]
[3,3,3,2,1,10,3,0,0,2,14,"","Nível 3","Nível 3","-","SINAPI",null,"CORRIMÃO","-",null,1,"-",null,null,0,0,""]
["S",3,"S",0,1,10,3,0,0,0,0,"","Serviço","Serviço","-","COMPOSIÇÃO","COMP 082_SEE","CORRIMÃO PAREDE - SEDUC","M",8.64,1,8.64,null,null,0,0,""]
[2,2,2,3,1,11,0,0,0,93,3,"","Nível 2","Nível 2","-","SINAPI",null,"VIDROS","-",null,1,"-",null,null,0,0,""]
[3,3,3,2,1,11,1,0,0,2,7,"","Nível 3","Nível 3","-","SINAPI",null,"ADAPTAÇÃO SANITÁRIOS PcD/CIRCULAÇÃO BLOCO 2","-",null,1,"-",null,null,0,0,""]
["S",3,"S",0,1,11,1,0,0,0,0,"","Serviço","Serviço","-","AGETOP",190102,"VIDRO LISO 4 MM - COLOCADO","m2    ",0.36,1,0.36,null,null,0,0,""]
[2,2,2,12,1,12,0,0,0,90,12,"","Nível 2","Nível 2","-",null,null,"REVESTIMENTO DE PAREDE","-",null,1,"-",null,null,0,0,""]
[3,3,3,4,1,12,1,0,0,11,4,"","Nível 3","Nível 3","-","SINAPI",null,"ADAPTAÇÃO SANITÁRIOS PcD/CIRCULAÇÃO BLOCO 2","-",null,1,"-",null,null,0,0,""]
["S",3,"S",0,1,12,1,0,0,0,0,"","Serviço","Serviço","-","SINAPI",87904,"CHAPISCO APLICADO EM ALVENARIA (COM PRESENÇA DE VÃOS) E ESTRUTURAS DE CONCRETO DE FACHADA, COM COLHER DE PEDREIRO.  ARGAMASSA TRAÇO 1:3 COM PREPARO MANUAL. AF_06/2014","M2",5.85,1,5.85,null,null,0,0,"Referência: AGETOP - 200101"]
["S",3,"S",0,1,12,1,0,0,0,0,"","Serviço","Serviço","-","SINAPI",87553,"EMBOÇO, PARA RECEBIMENTO DE CERÂMICA, EM ARGAMASSA TRAÇO 1:2:8, PREPARO MECÂNICO COM BETONEIRA 400L, APLICADO MANUALMENTE EM FACES INTERNAS DE PAREDES, PARA AMBIENTE COM ÁREA MAIOR QUE 10M2, ESPESSURA DE 10MM, COM EXECUÇÃO DE TALISCAS. AF_06/2014","M2",5.85,1,5.85,null,null,0,0,""]
["S",3,"S",0,1,12,1,0,0,0,0,"","Serviço","Serviço","-","SINAPI",87273,"REVESTIMENTO CERÂMICO PARA PAREDES INTERNAS COM PLACAS TIPO ESMALTADA EXTRA DE DIMENSÕES 33X45 CM APLICADAS EM AMBIENTES DE ÁREA MAIOR QUE 5 M² NA ALTURA INTEIRA DAS PAREDES. AF_06/2014","M2",40.200000000000003,1,40.200000000000003,null,null,0,0,""]
[3,3,3,2,1,12,2,0,0,7,2,"","Nível 3","Nível 3","-","SINAPI",null,"REFORMA SANITÁRIO PAV. SUPERIOR","-",null,1,"-",null,null,0,0,""]
[{"$f":"CHOOSE(1+LOG(1+2*(ORÇAMENTO.Nivel=\"Nível 1\")+4*(ORÇAMENTO.Nivel=\"Nível 2\")+8*(ORÇAMENTO.Nivel=\"Nível 3\")+16*(ORÇAMENTO.Nivel=\"Nível 4\")+32*(ORÇAMENTO.Nivel=\"Serviço\"),2),0,1,2,3,4,\"S\")","v":"S"},3,"S",0,1,12,2,0,0,0,0,"","Serviço","Serviço","-","SINAPI",87273,"REVESTIMENTO CERÂMICO PARA PAREDES INTERNAS COM PLACAS TIPO ESMALTADA EXTRA DE DIMENSÕES 33X45 CM APLICADAS EM AMBIENTES DE ÁREA MAIOR QUE 5 M² NA ALTURA INTEIRA DAS PAREDES. AF_06/2014","M2",4.12,1,4.12,null,null,0,0,""]
[3,3,3,2,1,12,3,0,0,5,2,"","Nível 3","Nível 3","-","SINAPI",null,"ADAPTAÇÃO NOVA COZINHA","-",null,1,"-",null,null,0,0,""]
["S",3,"S",0,1,12,3,0,0,0,0,"","Serviço","Serviço","-","SINAPI",87273,"REVESTIMENTO CERÂMICO PARA PAREDES INTERNAS COM PLACAS TIPO ESMALTADA EXTRA DE DIMENSÕES 33X45 CM APLICADAS EM AMBIENTES DE ÁREA MAIOR QUE 5 M² NA ALTURA INTEIRA DAS PAREDES. AF_06/2014","M2",55,1,55,null,null,0,0,""]
[{"$f":"CHOOSE(1+LOG(1+2*(ORÇAMENTO.Nivel=\"Nível 1\")+4*(ORÇAMENTO.Nivel=\"Nível 2\")+8*(ORÇAMENTO.Nivel=\"Nível 3\")+16*(ORÇAMENTO.Nivel=\"Nível 4\")+32*(ORÇAMENTO.Nivel=\"Serviço\"),2),0,1,2,3,4,\"S\")","v":3},3,3,3,1,12,4,0,0,3,69,"","Nível 3","Nível 3","-","SINAPI",null,"CALÇADA EXTERNA E RAMPA","-",null,1,"-",null,null,0,0,""]
["S",3,"S",0,1,12,4,0,0,0,0,"","Serviço","Serviço","-","SINAPI",87904,"CHAPISCO APLICADO EM ALVENARIA (COM PRESENÇA DE VÃOS) E ESTRUTURAS DE CONCRETO DE FACHADA, COM COLHER DE PEDREIRO.  ARGAMASSA TRAÇO 1:3 COM PREPARO MANUAL. AF_06/2014","M2",0.44,1,0.44,null,null,0,0,"Referência: AGETOP - 200101"]
["S",3,"S",0,1,12,4,0,0,0,0,"","Serviço","Serviço","-","AGETOP",200403,"REBOCO (1 CALH:4 ARFC+100kgCI/M3)","m2    ",0.44,1,0.44,null,null,0,0,""]
[2,2,2,11,1,13,0,0,0,78,11,"","Nível 2","Nível 2","-",null,null,"FORROS","-",null,1,"-",null,null,0,0,""]
[3,3,3,3,1,13,1,0,0,10,3,"","Nível 3","Nível 3","-","SINAPI",null,"PVC SEM ESTRUTURA","-",null,1,"-",null,null,0,0,""]
[4,4,4,2,1,13,1,1,0,2,17,"","Nível 4","Nível 4","-","SINAPI",null,"FORRO BLOCO 1","-",null,1,"-",null,null,0,0,""]
["S",4,"S",0,1,13,1,1,0,0,0,"","Serviço","Serviço","-","AGETOP",210461,"FORRO DE PVC SEM ESTRUTURA DE METALON (COM REPINTURA DA ESTRUTURA COM TINTA ALQUÍDICA D.F.)","m2    ",159.22999999999999,1,159.22999999999999,null,null,0,0,""]
[3,3,3,3,1,13,2,0,0,7,3,"","Nível 3","Nível 3","-","SINAPI",null,"PVC COM ESTRUTURA","-",null,1,"-",null,null,0,0,""]
[4,4,4,2,1,13,2,1,0,2,14,"","Nível 4","Nível 4","-","SINAPI",null,"FORRO BLOCO 2","-",null,1,"-",null,null,0,0,""]
["S",4,"S",0,1,13,2,1,0,0,0,"","Serviço","Serviço","-","SINAPI",96116,"FORRO EM RÉGUAS DE PVC, FRISADO, PARA AMBIENTES COMERCIAIS, INCLUSIVE ESTRUTURA DE FIXAÇÃO. AF_05/2017_P","M2",8.81,1,8.81,null,null,0,0,"Referência: AGETOP - 210460"]
[3,3,3,4,1,13,3,0,0,4,22,"","Nível 3","Nível 3","-","SINAPI",null,"GESSO ACARTONADO","-",null,1,"-",null,null,0,0,""]
[4,4,4,3,1,13,3,1,0,3,11,"","Nível 4","Nível 4","-","SINAPI",null,"ADAPTAÇÃO NOVA COZINHA","-",null,1,"-",null,null,0,0,""]
["S",4,"S",0,1,13,3,1,0,0,0,"","Serviço","Serviço","-","AGETOP",210498,"FORRO DE GESSO ACARTONADO PARA ÁREAS SECAS ESPESSURA DE 12,5MM","m2    ",30,1,30,null,null,0,0,""]
["S",{"$f":"IF(OR(C312=\"s\",C312=0),OFFSET(B312,-1,0),C312)","v":4},{"$f":"IF(OFFSET(C312,-1,0)=\"L\",1,IF(OFFSET(C312,-1,0)=1,2,IF(OR(A312=\"s\",A312=0),\"S\",IF(AND(OFFSET(C312,-1,0)=2,A312=4),3,IF(AND(OR(OFFSET(C312,-1,0)=\"s\",OFFSET(C312,-1,0)=0),A312<>\"s\",A312>OFFSET(B312,-1,0)),OFFSET(B312,-1,0),A312)))))","v":"S"},{"$f":"IF(OR(C312=\"S\",C312=0),0,IF(ISERROR(K312),J312,SMALL(J312:K312,1)))","v":0},{"$f":"IF($C312=1,OFFSET(E312,-1,0)+1,OFFSET(E312,-1,0))","v":1},{"$f":"IF($C312=1,0,IF($C312=2,OFFSET(F312,-1,0)+1,OFFSET(F312,-1,0)))","v":13},{"$f":"IF(AND($C312<=2,$C312<>0),0,IF($C312=3,OFFSET(G312,-1,0)+1,OFFSET(G312,-1,0)))","v":3},{"$f":"IF(AND($C312<=3,$C312<>0),0,IF($C312=4,OFFSET(H312,-1,0)+1,OFFSET(H312,-1,0)))","v":1},0,0,0,"","Serviço","Serviço","-","AGETOP",210506,"TABICA PARA FORRO DE GESSO COMUM","m     ",22,1,22,null,null,0,0,""]
[2,2,2,21,1,14,0,0,0,67,21,"","Nível 2","Nível 2","-",null,null,"REVESTIMENTO DE PISO","-",null,1,"-",null,null,0,0,""]
[{"$f":"CHOOSE(1+LOG(1+2*(ORÇAMENTO.Nivel=\"Nível 1\")+4*(ORÇAMENTO.Nivel=\"Nível 2\")+8*(ORÇAMENTO.Nivel=\"Nível 3\")+16*(ORÇAMENTO.Nivel=\"Nível 4\")+32*(ORÇAMENTO.Nivel=\"Serviço\"),2),0,1,2,3,4,\"S\")","v":3},{"$f":"IF(OR(C314=\"s\",C314=0),OFFSET(B314,-1,0),C314)","v":3},{"$f":"IF(OFFSET(C314,-1,0)=\"L\",1,IF(OFFSET(C314,-1,0)=1,2,IF(OR(A314=\"s\",A314=0),\"S\",IF(AND(OFFSET(C314,-1,0)=2,A314=4),3,IF(AND(OR(OFFSET(C314,-1,0)=\"s\",OFFSET(C314,-1,0)=0),A314<>\"s\",A314>OFFSET(B314,-1,0)),OFFSET(B314,-1,0),A314)))))","v":3},{"$f":"IF(OR(C314=\"S\",C314=0),0,IF(ISERROR(K314),J314,SMALL(J314:K314,1)))","v":3},{"$f":"IF($C314=1,OFFSET(E314,-1,0)+1,OFFSET(E314,-1,0))","v":1},{"$f":"IF($C314=1,0,IF($C314=2,OFFSET(F314,-1,0)+1,OFFSET(F314,-1,0)))","v":14},{"$f":"IF(AND($C314<=2,$C314<>0),0,IF($C314=3,OFFSET(G314,-1,0)+1,OFFSET(G314,-1,0)))","v":1},{"$f":"IF(AND($C314<=3,$C314<>0),0,IF($C314=4,OFFSET(H314,-1,0)+1,OFFSET(H314,-1,0)))","v":0},{"$f":"IF(AND($C314<=4,$C314<>0),0,IF(AND($C314=\"S\",$Y314>0),OFFSET(I314,-1,0)+1,OFFSET(I314,-1,0)))","v":0},20,3,"","Nível 3","Nível 3","-","SINAPI",null,"CONCRETO","-",null,1,"-",null,null,0,0,""]
[4,4,4,2,1,14,1,1,0,2,6,"","Nível 4","Nível 4","-","SINAPI",null,"CALÇADA EXTERNA E RAMPA","-",null,1,"-",null,null,0,0,""]
["S",4,"S",0,1,14,1,1,0,0,0,"","Serviço","Serviço","-","AGETOP",220102,"PISO CONCRETO DESEMPENADO ESPESSURA = 5 CM  1:2,5:3,5","m2    ",17.100000000000001,1,17.100000000000001,null,null,0,0,""]
[3,3,3,10,1,14,2,0,0,17,10,"","Nível 3","Nível 3","-","SINAPI",null,"GRANITINA","-",null,1,"-",null,null,0,0,""]
[4,{"$f":"IF(OR(C318=\"s\",C318=0),OFFSET(B318,-1,0),C318)","v":4},{"$f":"IF(OFFSET(C318,-1,0)=\"L\",1,IF(OFFSET(C318,-1,0)=1,2,IF(OR(A318=\"s\",A318=0),\"S\",IF(AND(OFFSET(C318,-1,0)=2,A318=4),3,IF(AND(OR(OFFSET(C318,-1,0)=\"s\",OFFSET(C318,-1,0)=0),A318<>\"s\",A318>OFFSET(B318,-1,0)),OFFSET(B318,-1,0),A318)))))","v":4},{"$f":"IF(OR(C318=\"S\",C318=0),0,IF(ISERROR(K318),J318,SMALL(J318:K318,1)))","v":3},{"$f":"IF($C318=1,OFFSET(E318,-1,0)+1,OFFSET(E318,-1,0))","v":1},{"$f":"IF($C318=1,0,IF($C318=2,OFFSET(F318,-1,0)+1,OFFSET(F318,-1,0)))","v":14},{"$f":"IF(AND($C318<=2,$C318<>0),0,IF($C318=3,OFFSET(G318,-1,0)+1,OFFSET(G318,-1,0)))","v":2},{"$f":"IF(AND($C318<=3,$C318<>0),0,IF($C318=4,OFFSET(H318,-1,0)+1,OFFSET(H318,-1,0)))","v":1},0,9,3,"","Nível 4","Nível 4","-","SINAPI",null,"ADAPTAÇÃO SANITÁRIOS PcD/CIRCULAÇÃO BLOCO 2","-",null,1,"-",null,null,0,0,""]
["S",4,"S",0,1,14,2,1,0,0,0,"","Serviço","Serviço","-","SINAPI",84191,"PISO EM GRANILITE, MARMORITE OU GRANITINA ESPESSURA 8 MM, INCLUSO JUNTAS DE DILATACAO PLASTICAS","M2",8.81,1,8.81,null,null,0,0,"Referência: AGETOP - 221101"]
["S",{"$f":"IF(OR(C320=\"s\",C320=0),OFFSET(B320,-1,0),C320)","v":4},{"$f":"IF(OFFSET(C320,-1,0)=\"L\",1,IF(OFFSET(C320,-1,0)=1,2,IF(OR(A320=\"s\",A320=0),\"S\",IF(AND(OFFSET(C320,-1,0)=2,A320=4),3,IF(AND(OR(OFFSET(C320,-1,0)=\"s\",OFFSET(C320,-1,0)=0),A320<>\"s\",A320>OFFSET(B320,-1,0)),OFFSET(B320,-1,0),A320)))))","v":"S"},{"$f":"IF(OR(C320=\"S\",C320=0),0,IF(ISERROR(K320),J320,SMALL(J320:K320,1)))","v":0},{"$f":"IF($C320=1,OFFSET(E320,-1,0)+1,OFFSET(E320,-1,0))","v":1},{"$f":"IF($C320=1,0,IF($C320=2,OFFSET(F320,-1,0)+1,OFFSET(F320,-1,0)))","v":14},{"$f":"IF(AND($C320<=2,$C320<>0),0,IF($C320=3,OFFSET(G320,-1,0)+1,OFFSET(G320,-1,0)))","v":2},{"$f":"IF(AND($C320<=3,$C320<>0),0,IF($C320=4,OFFSET(H320,-1,0)+1,OFFSET(H320,-1,0)))","v":1},0,0,0,"","Serviço","Serviço","-","AGETOP",221104,"RASPAGEM E APLICAÇÃO RESINA ACRÍLICA DUAS DEMÃOS","m2    ",8.81,1,8.81,null,null,0,0,""]
[4,{"$f":"IF(OR(C321=\"s\",C321=0),OFFSET(B321,-1,0),C321)","v":4},{"$f":"IF(OFFSET(C321,-1,0)=\"L\",1,IF(OFFSET(C321,-1,0)=1,2,IF(OR(A321=\"s\",A321=0),\"S\",IF(AND(OFFSET(C321,-1,0)=2,A321=4),3,IF(AND(OR(OFFSET(C321,-1,0)=\"s\",OFFSET(C321,-1,0)=0),A321<>\"s\",A321>OFFSET(B321,-1,0)),OFFSET(B321,-1,0),A321)))))","v":4},{"$f":"IF(OR(C321=\"S\",C321=0),0,IF(ISERROR(K321),J321,SMALL(J321:K321,1)))","v":3},{"$f":"IF($C321=1,OFFSET(E321,-1,0)+1,OFFSET(E321,-1,0))","v":1},{"$f":"IF($C321=1,0,IF($C321=2,OFFSET(F321,-1,0)+1,OFFSET(F321,-1,0)))","v":14},{"$f":"IF(AND($C321<=2,$C321<>0),0,IF($C321=3,OFFSET(G321,-1,0)+1,OFFSET(G321,-1,0)))","v":2},{"$f":"IF(AND($C321<=3,$C321<>0),0,IF($C321=4,OFFSET(H321,-1,0)+1,OFFSET(H321,-1,0)))","v":2},0,6,3,"","Nível 4","Nível 4","-","SINAPI",null,"REFORMA SANITÁRIO PAV. SUPERIOR","-",null,1,"-",null,null,0,0,""]
["S",4,"S",0,1,14,2,2,0,0,0,"","Serviço","Serviço","-","SINAPI",84191,"PISO EM GRANILITE, MARMORITE OU GRANITINA ESPESSURA 8 MM, INCLUSO JUNTAS DE DILATACAO PLASTICAS","M2",2,1,2,null,null,0,0,"Referência: AGETOP - 221101"]
["S",4,"S",0,1,14,2,2,0,0,0,"","Serviço","Serviço","-","AGETOP",221104,"RASPAGEM E APLICAÇÃO RESINA ACRÍLICA DUAS DEMÃOS","m2    ",2,1,2,null,null,0,0,""]
[4,4,4,3,1,14,2,3,0,3,{"$error":"#N/A"},"","Nível 4","Nível 4","-","SINAPI",null,"ADAPTAÇÃO NOVA COZINHA","-",null,1,"-",null,null,0,0,""]
["S",4,"S",0,1,14,2,3,0,0,0,"","Serviço","Serviço","-","SINAPI",84191,"PISO EM GRANILITE, MARMORITE OU GRANITINA ESPESSURA 8 MM, INCLUSO JUNTAS DE DILATACAO PLASTICAS","M2",30,1,30,null,null,0,0,"Referência: AGETOP - 221101"]
["S",{"$f":"IF(OR(C326=\"s\",C326=0),OFFSET(B326,-1,0),C326)","v":4},{"$f":"IF(OFFSET(C326,-1,0)=\"L\",1,IF(OFFSET(C326,-1,0)=1,2,IF(OR(A326=\"s\",A326=0),\"S\",IF(AND(OFFSET(C326,-1,0)=2,A326=4),3,IF(AND(OR(OFFSET(C326,-1,0)=\"s\",OFFSET(C326,-1,0)=0),A326<>\"s\",A326>OFFSET(B326,-1,0)),OFFSET(B326,-1,0),A326)))))","v":"S"},{"$f":"IF(OR(C326=\"S\",C326=0),0,IF(ISERROR(K326),J326,SMALL(J326:K326,1)))","v":0},{"$f":"IF($C326=1,OFFSET(E326,-1,0)+1,OFFSET(E326,-1,0))","v":1},{"$f":"IF($C326=1,0,IF($C326=2,OFFSET(F326,-1,0)+1,OFFSET(F326,-1,0)))","v":14},{"$f":"IF(AND($C326<=2,$C326<>0),0,IF($C326=3,OFFSET(G326,-1,0)+1,OFFSET(G326,-1,0)))","v":2},{"$f":"IF(AND($C326<=3,$C326<>0),0,IF($C326=4,OFFSET(H326,-1,0)+1,OFFSET(H326,-1,0)))","v":3},0,0,0,"","Serviço","Serviço","-","AGETOP",221104,"RASPAGEM E APLICAÇÃO RESINA ACRÍLICA DUAS DEMÃOS","m2    ",30,1,30,null,null,0,0,""]
[3,3,3,4,1,14,3,0,0,7,4,"","Nível 3","Nível 3","-","SINAPI",null,"PODOTÁTIL","-",null,1,"-",null,null,0,0,""]
[4,{"$f":"IF(OR(C328=\"s\",C328=0),OFFSET(B328,-1,0),C328)","v":4},{"$f":"IF(OFFSET(C328,-1,0)=\"L\",1,IF(OFFSET(C328,-1,0)=1,2,IF(OR(A328=\"s\",A328=0),\"S\",IF(AND(OFFSET(C328,-1,0)=2,A328=4),3,IF(AND(OR(OFFSET(C328,-1,0)=\"s\",OFFSET(C328,-1,0)=0),A328<>\"s\",A328>OFFSET(B328,-1,0)),OFFSET(B328,-1,0),A328)))))","v":4},{"$f":"IF(OR(C328=\"S\",C328=0),0,IF(ISERROR(K328),J328,SMALL(J328:K328,1)))","v":3},{"$f":"IF($C328=1,OFFSET(E328,-1,0)+1,OFFSET(E328,-1,0))","v":1},{"$f":"IF($C328=1,0,IF($C328=2,OFFSET(F328,-1,0)+1,OFFSET(F328,-1,0)))","v":14},{"$f":"IF(AND($C328<=2,$C328<>0),0,IF($C328=3,OFFSET(G328,-1,0)+1,OFFSET(G328,-1,0)))","v":3},{"$f":"IF(AND($C328<=3,$C328<>0),0,IF($C328=4,OFFSET(H328,-1,0)+1,OFFSET(H328,-1,0)))","v":1},0,3,21,"","Nível 4","Nível 4","-","SINAPI",null,"ACESSIBILIDADE","-",null,1,"-",null,null,0,0,""]
["S",4,"S",0,1,14,3,1,0,0,0,"","Serviço","Serviço","-","AGETOP",221126,"PISO DE LADRILHO HIDRÁULICO COLORIDO MODELO TÁTIL ( ALERTA OU DIRECIONAL) SEM LASTRO","m2    ",6.79,1,6.79,null,null,0,0,""]
[{"$f":"CHOOSE(1+LOG(1+2*(ORÇAMENTO.Nivel=\"Nível 1\")+4*(ORÇAMENTO.Nivel=\"Nível 2\")+8*(ORÇAMENTO.Nivel=\"Nível 3\")+16*(ORÇAMENTO.Nivel=\"Nível 4\")+32*(ORÇAMENTO.Nivel=\"Serviço\"),2),0,1,2,3,4,\"S\")","v":"S"},{"$f":"IF(OR(C330=\"s\",C330=0),OFFSET(B330,-1,0),C330)","v":4},{"$f":"IF(OFFSET(C330,-1,0)=\"L\",1,IF(OFFSET(C330,-1,0)=1,2,IF(OR(A330=\"s\",A330=0),\"S\",IF(AND(OFFSET(C330,-1,0)=2,A330=4),3,IF(AND(OR(OFFSET(C330,-1,0)=\"s\",OFFSET(C330,-1,0)=0),A330<>\"s\",A330>OFFSET(B330,-1,0)),OFFSET(B330,-1,0),A330)))))","v":"S"},{"$f":"IF(OR(C330=\"S\",C330=0),0,IF(ISERROR(K330),J330,SMALL(J330:K330,1)))","v":0},{"$f":"IF($C330=1,OFFSET(E330,-1,0)+1,OFFSET(E330,-1,0))","v":1},{"$f":"IF($C330=1,0,IF($C330=2,OFFSET(F330,-1,0)+1,OFFSET(F330,-1,0)))","v":14},{"$f":"IF(AND($C330<=2,$C330<>0),0,IF($C330=3,OFFSET(G330,-1,0)+1,OFFSET(G330,-1,0)))","v":3},{"$f":"IF(AND($C330<=3,$C330<>0),0,IF($C330=4,OFFSET(H330,-1,0)+1,OFFSET(H330,-1,0)))","v":1},0,0,0,"","Serviço","Serviço","-","AGETOP",221120,"PISO DE BORRACHA COLORIDO MODELO TÁTIL ( ALERTA OU DIRECIONAL) INCLUSO CONTRAPISO (1CI:3ARML) C/ E=2CM E NATA DE CIMENTO","m2    ",1.81,1,1.81,null,null,0,0,""]
[3,3,3,3,1,14,4,0,0,3,37,"","Nível 3","Nível 3","-","SINAPI",null,"CONCRETO","-",null,1,"-",null,null,0,0,""]
[4,4,4,2,1,14,4,1,0,2,17,"","Nível 4","Nível 4","-","SINAPI",null,"INSTALAÇÕES DE GÁS","-",null,1,"-",null,null,0,0,""]
["S",4,"S",0,1,14,4,1,0,0,0,"","Serviço","Serviço","-","AGETOP",220102,"PISO CONCRETO DESEMPENADO ESPESSURA = 5 CM  1:2,5:3,5","m2    ",0.83,1,0.83,null,null,0,0,""]
[2,2,2,4,1,15,0,0,0,46,4,"","Nível 2","Nível 2","-",null,null,"FERRAGENS","-",null,1,"-",null,null,0,0,""]
[3,3,3,3,1,15,1,0,0,3,11,"","Nível 3","Nível 3","-","SINAPI",null,"ADAPTAÇÃO SANITÁRIOS PcD/CIRCULAÇÃO BLOCO 2","-",null,1,"-",null,null,0,0,""]
["S",3,"S",0,1,15,1,0,0,0,0,"","Serviço","Serviço","-","AGETOP",230174,"BARRA DE APOIO EM AÇO INOX - 40 CM","un    ",3,1,3,null,null,0,0,""]
["S",3,"S",0,1,15,1,0,0,0,0,"","Serviço","Serviço","-","AGETOP",230176,"BARRA DE APOIO EM AÇO INOX - 80 CM ","un    ",3,1,3,null,null,0,0,""]
[2,2,2,4,1,16,0,0,0,42,4,"","Nível 2","Nível 2","-",null,null,"ADMINISTRAÇÃO","-",null,1,"-",null,null,0,0,""]
[3,3,3,3,1,16,1,0,0,3,7,"","Nível 3","Nível 3","-",null,null,"MENSALISTAS","-",null,1,"-",null,null,0,0,""]
["S",3,"S",0,1,16,1,0,0,{"$f":"IF(OR($C340=\"S\",$C340=0),0,MATCH(0,OFFSET($D340,1,$C340,ROW($C$380)-ROW($C340)),0))","v":0},{"$f":"IF(OR($C340=\"S\",$C340=0),0,MATCH(OFFSET($D340,0,$C340)+1,OFFSET($D340,1,$C340,ROW($C$380)-ROW($C340)),0))","v":0},"","Serviço","Serviço","-","SINAPI",90778,"ENGENHEIRO CIVIL DE OBRA PLENO COM ENCARGOS COMPLEMENTARES","H",38,1,38,null,null,0,0,"Referência: AGETOP - 250101"]
["S",3,"S",0,1,16,1,0,0,0,0,"","Serviço","Serviço","-","SINAPI",90776,"ENCARREGADO GERAL COM ENCARGOS COMPLEMENTARES","H",220,1,220,null,null,0,0,"Referência: AGETOP - 250103"]
[2,2,2,33,1,17,0,0,0,38,33,"","Nível 2","Nível 2","-",null,null,"PINTURA","-",",",1,{"$error":"#VALUE!"},null,null,0,0,""]
[{"$f":"CHOOSE(1+LOG(1+2*(ORÇAMENTO.Nivel=\"Nível 1\")+4*(ORÇAMENTO.Nivel=\"Nível 2\")+8*(ORÇAMENTO.Nivel=\"Nível 3\")+16*(ORÇAMENTO.Nivel=\"Nível 4\")+32*(ORÇAMENTO.Nivel=\"Serviço\"),2),0,1,2,3,4,\"S\")","v":3},3,3,3,1,17,1,0,0,32,3,"","Nível 3","Nível 3","-","SINAPI",null,"ESMALTE SINTÉTICO","-",null,1,"-",null,null,0,0,""]
[4,4,4,2,1,17,1,1,0,2,5,"","Nível 4","Nível 4","-","SINAPI",null,"PINTURA GERAL","-",null,1,"-",null,null,0,0,""]
["S",4,"S",0,1,17,1,1,0,0,0,"","Serviço","Serviço","-","AGETOP",261550,"PINT.ESMALTE SINT.PAREDES - 2 DEM.C/SELADOR","m2    ",506.13,1,506.13,null,null,0,0,""]
[3,3,3,9,1,17,2,0,0,29,9,"","Nível 3","Nível 3","-","AGETOP",null,"LÁTEX ACRÍLICA","-",null,1,"-",null,null,0,0,""]
[4,4,4,2,1,17,2,1,0,8,2,"","Nível 4","Nível 4","-","SINAPI",null,"ADAPTAÇÃO SANITÁRIOS PcD /CIRCULAÇÃO BLOCO 2","-",null,1,"-",null,null,0,0,""]
["S",4,"S",0,1,17,2,1,0,0,0,"","Serviço","Serviço","-","SINAPI",88497,"APLICAÇÃO E LIXAMENTO DE MASSA LÁTEX EM PAREDES, DUAS DEMÃOS. AF_06/2014","M2",19.760000000000002,1,19.760000000000002,null,null,0,0,"Referência: AGETOP - 261300"]
[{"$f":"CHOOSE(1+LOG(1+2*(ORÇAMENTO.Nivel=\"Nível 1\")+4*(ORÇAMENTO.Nivel=\"Nível 2\")+8*(ORÇAMENTO.Nivel=\"Nível 3\")+16*(ORÇAMENTO.Nivel=\"Nível 4\")+32*(ORÇAMENTO.Nivel=\"Serviço\"),2),0,1,2,3,4,\"S\")","v":4},4,4,2,1,17,2,2,0,6,2,"","Nível 4","Nível 4","-","SINAPI",null,"ADAPTAÇÃO NOVA COZINHA","-",null,1,"-",null,null,0,0,""]
["S",4,"S",0,1,17,2,2,0,0,0,"","Serviço","Serviço","-","AGETOP",260104,"REMOCAO DE PINTURA ANTIGA A LATEX","m2    ",55,1,55,null,null,0,0,""]
[4,{"$f":"IF(OR(C351=\"s\",C351=0),OFFSET(B351,-1,0),C351)","v":4},{"$f":"IF(OFFSET(C351,-1,0)=\"L\",1,IF(OFFSET(C351,-1,0)=1,2,IF(OR(A351=\"s\",A351=0),\"S\",IF(AND(OFFSET(C351,-1,0)=2,A351=4),3,IF(AND(OR(OFFSET(C351,-1,0)=\"s\",OFFSET(C351,-1,0)=0),A351<>\"s\",A351>OFFSET(B351,-1,0)),OFFSET(B351,-1,0),A351)))))","v":4},{"$f":"IF(OR(C351=\"S\",C351=0),0,IF(ISERROR(K351),J351,SMALL(J351:K351,1)))","v":4},{"$f":"IF($C351=1,OFFSET(E351,-1,0)+1,OFFSET(E351,-1,0))","v":1},{"$f":"IF($C351=1,0,IF($C351=2,OFFSET(F351,-1,0)+1,OFFSET(F351,-1,0)))","v":17},{"$f":"IF(AND($C351<=2,$C351<>0),0,IF($C351=3,OFFSET(G351,-1,0)+1,OFFSET(G351,-1,0)))","v":2},{"$f":"IF(AND($C351<=3,$C351<>0),0,IF($C351=4,OFFSET(H351,-1,0)+1,OFFSET(H351,-1,0)))","v":3},0,4,{"$error":"#N/A"},"","Nível 4","Nível 4","-","SINAPI",null,"PINTURA GERAL","-",null,1,"-",null,null,0,0,""]
["S",4,"S",0,1,17,2,3,0,0,0,"","Serviço","Serviço","-","AGETOP",260104,"REMOCAO DE PINTURA ANTIGA A LATEX","m2    ",815.79,1,815.79,null,null,0,0,""]
["S",4,"S",0,1,17,2,3,0,0,0,"","Serviço","Serviço","-","SINAPI",88497,"APLICAÇÃO E LIXAMENTO DE MASSA LÁTEX EM PAREDES, DUAS DEMÃOS. AF_06/2014","M2",815.79,1,815.79,null,null,0,0,"Referência: AGETOP - 261300"]
["S",4,"S",0,1,17,2,3,0,0,0,"","Serviço","Serviço","-","SINAPI",88489,"APLICAÇÃO MANUAL DE PINTURA COM TINTA LÁTEX ACRÍLICA EM PAREDES, DUAS DEMÃOS. AF_06/2014","M2",506.13,1,506.13,null,null,0,0,"Referência: AGETOP - 261001"]
[3,3,3,6,1,17,3,0,0,20,6,"","Nível 3","Nível 3","-","AGETOP",null,"TETO","-",null,1,"-",null,null,0,0,""]
[4,4,4,3,1,17,3,1,0,5,3,"","Nível 4","Nível 4","-","SINAPI",null,"ADAPTAÇÃO NOVA COZINHA","-",null,1,"-",null,null,0,0,""]
["S",4,"S",0,1,17,3,1,0,0,0,"","Serviço","Serviço","-","SINAPI",88497,"APLICAÇÃO E LIXAMENTO DE MASSA LÁTEX EM PAREDES, DUAS DEMÃOS. AF_06/2014","M2",30,1,30,null,null,0,0,"Referência: AGETOP - 261300"]
["S",4,"S",0,1,17,3,1,0,0,0,"","Serviço","Serviço","-","SINAPI",88486,"APLICAÇÃO MANUAL DE PINTURA COM TINTA LÁTEX PVA EM TETO, DUAS DEMÃOS. AF_06/2014","M2",30,1,30,null,null,0,0,"Referência: AGETOP - 261307"]
[4,4,4,2,1,17,3,2,0,2,7,"","Nível 4","Nível 4","-","SINAPI",null,"PINTURA GERAL","-",null,1,"-",null,null,0,0,""]
["S",4,"S",0,1,17,3,2,0,0,0,"","Serviço","Serviço","-","SINAPI",88486,"APLICAÇÃO MANUAL DE PINTURA COM TINTA LÁTEX PVA EM TETO, DUAS DEMÃOS. AF_06/2014","M2",205.08,1,205.08,null,null,0,0,"Referência: AGETOP - 261307"]
[3,3,3,7,1,17,4,0,0,14,7,"","Nível 3","Nível 3","-","AGETOP",null,"EXTERNA","-",null,1,"-",null,null,0,0,""]
[4,4,4,2,1,17,4,1,0,6,2,"","Nível 4","Nível 4","-","SINAPI",null,"PINTURA GERAL","-",null,1,"-",null,null,0,0,""]
["S",4,"S",0,1,17,4,1,0,0,0,"","Serviço","Serviço","-","AGETOP",261000,"PINTURA LATEX ACRILICA 2 DEMAOS C/SELADOR","m2    ",619.32000000000005,1,619.32000000000005,null,null,0,0,""]
[{"$f":"CHOOSE(1+LOG(1+2*(ORÇAMENTO.Nivel=\"Nível 1\")+4*(ORÇAMENTO.Nivel=\"Nível 2\")+8*(ORÇAMENTO.Nivel=\"Nível 3\")+16*(ORÇAMENTO.Nivel=\"Nível 4\")+32*(ORÇAMENTO.Nivel=\"Serviço\"),2),0,1,2,3,4,\"S\")","v":4},4,4,2,1,17,4,2,0,4,2,"","Nível 4","Nível 4","-","SINAPI",null,"CALÇADA EXTERNA E RAMPA","-",null,1,"-",null,null,0,0,""]
["S",4,"S",0,1,17,4,2,0,0,0,"","Serviço","Serviço","-","AGETOP",261000,"PINTURA LATEX ACRILICA 2 DEMAOS C/SELADOR","m2    ",3.14,1,3.14,null,null,0,0,""]
[4,4,4,2,1,17,4,3,0,2,{"$error":"#N/A"},"","Nível 4","Nível 4","-","SINAPI",null,"MURO","-",null,1,"-",null,null,0,0,""]
["S",4,"S",0,1,17,4,3,0,0,0,"","Serviço","Serviço","-","AGETOP",261000,"PINTURA LATEX ACRILICA 2 DEMAOS C/SELADOR","m2    ",109.45,1,109.45,null,null,0,0,""]
[3,3,3,4,1,17,5,0,0,7,4,"","Nível 3","Nível 3","-","AGETOP",null,"ESQUADRIAS EXISTENTES","-",null,1,"-",null,null,0,0,""]
["S",3,"S",0,1,17,5,0,0,0,0,"","Serviço","Serviço","-","AGETOP",260105,"REMOCAO DE PINTURA ANTIGA A OLEO OU ESMALTE","m2    ",196.43,1,196.43,null,null,0,0,""]
["S",3,"S",0,1,17,5,0,0,0,0,"","Serviço","Serviço","-","AGETOP",260901,"PINTURA VERNIZ EM MADEIRA 2 DEMAOS","m2    ",52.47,1,52.47,null,null,0,0,""]
["S",3,"S",0,1,17,5,0,0,0,0,"","Serviço","Serviço","-","AGETOP",261602,"PINT.ESMALTE/ESQUAD.FERRO C/FUNDO ANTICOR.","m2    ",143.96,1,143.96,null,null,0,0,""]
[3,3,3,3,1,17,6,0,0,3,{"$error":"#N/A"},"","Nível 3","Nível 3","-","AGETOP",null,"ESQUADRIAS NOVAS","-",null,1,"-",null,null,0,0,""]
[4,4,4,2,1,17,6,1,0,2,{"$error":"#N/A"},"","Nível 4","Nível 4","-","SINAPI",null,"ADAPTAÇÃO SANITÁRIOS PcD/CIRCULAÇÃO BLOCO 2","-",null,1,"-",null,null,0,0,""]
["S",4,"S",0,1,17,6,1,0,0,0,"","Serviço","Serviço","-","AGETOP",261602,"PINT.ESMALTE/ESQUAD.FERRO C/FUNDO ANTICOR.","m2    ",5.76,1,5.76,null,null,0,0,""]
[2,{"$f":"IF(OR(C375=\"s\",C375=0),OFFSET(B375,-1,0),C375)","v":2},{"$f":"IF(OFFSET(C375,-1,0)=\"L\",1,IF(OFFSET(C375,-1,0)=1,2,IF(OR(A375=\"s\",A375=0),\"S\",IF(AND(OFFSET(C375,-1,0)=2,A375=4),3,IF(AND(OR(OFFSET(C375,-1,0)=\"s\",OFFSET(C375,-1,0)=0),A375<>\"s\",A375>OFFSET(B375,-1,0)),OFFSET(B375,-1,0),A375)))))","v":2},{"$f":"IF(OR(C375=\"S\",C375=0),0,IF(ISERROR(K375),J375,SMALL(J375:K375,1)))","v":5},{"$f":"IF($C375=1,OFFSET(E375,-1,0)+1,OFFSET(E375,-1,0))","v":1},{"$f":"IF($C375=1,0,IF($C375=2,OFFSET(F375,-1,0)+1,OFFSET(F375,-1,0)))","v":18},{"$f":"IF(AND($C375<=2,$C375<>0),0,IF($C375=3,OFFSET(G375,-1,0)+1,OFFSET(G375,-1,0)))","v":0},{"$f":"IF(AND($C375<=3,$C375<>0),0,IF($C375=4,OFFSET(H375,-1,0)+1,OFFSET(H375,-1,0)))","v":0},{"$f":"IF(AND($C375<=4,$C375<>0),0,IF(AND($C375=\"S\",$Y375>0),OFFSET(I375,-1,0)+1,OFFSET(I375,-1,0)))","v":0},5,{"$error":"#N/A"},"","Nível 2","Nível 2","-",null,null,"DIVERSOS","-",null,1,"-",null,null,0,0,""]
[3,{"$f":"IF(OR(C376=\"s\",C376=0),OFFSET(B376,-1,0),C376)","v":3},{"$f":"IF(OFFSET(C376,-1,0)=\"L\",1,IF(OFFSET(C376,-1,0)=1,2,IF(OR(A376=\"s\",A376=0),\"S\",IF(AND(OFFSET(C376,-1,0)=2,A376=4),3,IF(AND(OR(OFFSET(C376,-1,0)=\"s\",OFFSET(C376,-1,0)=0),A376<>\"s\",A376>OFFSET(B376,-1,0)),OFFSET(B376,-1,0),A376)))))","v":3},{"$f":"IF(OR(C376=\"S\",C376=0),0,IF(ISERROR(K376),J376,SMALL(J376:K376,1)))","v":2},{"$f":"IF($C376=1,OFFSET(E376,-1,0)+1,OFFSET(E376,-1,0))","v":1},{"$f":"IF($C376=1,0,IF($C376=2,OFFSET(F376,-1,0)+1,OFFSET(F376,-1,0)))","v":18},{"$f":"IF(AND($C376<=2,$C376<>0),0,IF($C376=3,OFFSET(G376,-1,0)+1,OFFSET(G376,-1,0)))","v":1},{"$f":"IF(AND($C376<=3,$C376<>0),0,IF($C376=4,OFFSET(H376,-1,0)+1,OFFSET(H376,-1,0)))","v":0},{"$f":"IF(AND($C376<=4,$C376<>0),0,IF(AND($C376=\"S\",$Y376>0),OFFSET(I376,-1,0)+1,OFFSET(I376,-1,0)))","v":0},4,2,"","Nível 3","Nível 3","-","SINAPI",null,"ADAPTAÇÃO NOVA COZINHA","-",null,1,"-",null,null,0,0,""]
["S",3,"S",0,1,18,1,0,0,0,0,"","Serviço","Serviço","-","AGETOP",271608,"BANCADA DE GRANITO C/ESPELHO","m2    ",1.92,1,1.92,null,null,0,0,""]
[3,3,3,2,1,18,2,0,0,2,{"$error":"#N/A"},"","Nível 3","Nível 3","-","SINAPI",null,"LIMPEZA","-",null,1,"-",null,null,0,0,""]
["S",{"$f":"IF(OR(C379=\"s\",C379=0),OFFSET(B379,-1,0),C379)","v":3},{"$f":"IF(OFFSET(C379,-1,0)=\"L\",1,IF(OFFSET(C379,-1,0)=1,2,IF(OR(A379=\"s\",A379=0),\"S\",IF(AND(OFFSET(C379,-1,0)=2,A379=4),3,IF(AND(OR(OFFSET(C379,-1,0)=\"s\",OFFSET(C379,-1,0)=0),A379<>\"s\",A379>OFFSET(B379,-1,0)),OFFSET(B379,-1,0),A379)))))","v":"S"},{"$f":"IF(OR(C379=\"S\",C379=0),0,IF(ISERROR(K379),J379,SMALL(J379:K379,1)))","v":0},{"$f":"IF($C379=1,OFFSET(E379,-1,0)+1,OFFSET(E379,-1,0))","v":1},{"$f":"IF($C379=1,0,IF($C379=2,OFFSET(F379,-1,0)+1,OFFSET(F379,-1,0)))","v":18},{"$f":"IF(AND($C379<=2,$C379<>0),0,IF($C379=3,OFFSET(G379,-1,0)+1,OFFSET(G379,-1,0)))","v":2},{"$f":"IF(AND($C379<=3,$C379<>0),0,IF($C379=4,OFFSET(H379,-1,0)+1,OFFSET(H379,-1,0)))","v":0},{"$f":"IF(AND($C379<=4,$C379<>0),0,IF(AND($C379=\"S\",$Y379>0),OFFSET(I379,-1,0)+1,OFFSET(I379,-1,0)))","v":0},0,0,"","Serviço","Serviço","-","AGETOP",270501,"LIMPEZA FINAL DE OBRA - (OBRAS CIVIS)","m2    ",187.12771222932022,1,187.12771222932022,null,null,0,0,""]
[-1,null,-1,null,0,0,0,0,0,null,null,"F"]
[null,null,null,null,null,null,null,null,null,null,null,"F",null,null,null,null,null,"OBS: OS QUANTITATIVOS DE MATERIAIS  DAS INSTALAÇÕES HIDROSSANITÁRIAS, ELÉTRICAS E ESPECIAIS SÃO FORNECIDOS PELOS PROFISSIONAIS RESPONSÁVEIS PELOS RESPECTIVOS PROJETOS.",null,null,null,null,null,"VALOR TOTAL",null,0]
[null,null,null,null,null,null,null,null,null,null,null,"F",null,null,null,null,null,null,null,null,null,null,null,"VALOR BDI (26,40%)",null,0]
[null,null,null,null,null,null,null,null,null,null,null,"F",null,null,null,null,null,null,null,null,null,null,null,"TOTAL ORÇAMENTO",null,0]
[null,null,null,null,null,null,null,null,null,null,null,"F"]
[null,null,null,null,null,null,null,null,null,null,null,"F",null,null,null,null,null,null,null,null,null,null,null,"CUSTO POR M2 ³",null,0]
[null,null,null,null,null,null,null,null,null,null,null,"F",null,null,null,null,null,null,null,null,null,null,null,"MATERIAL S/ BDI",null,0]
[null,null,null,null,null,null,null,null,null,null,null,"F",null,null,null,null,null,null,null,null,null,null,null,"MÃO DE OBRA S/ BDI",null,0]
[null,null,null,null,null,null,null,null,null,null,null,"F"]
[null,null,null,null,null,null,null,null,null,null,null,"F",null,null,null,null,"(1) Conforme previsto pelo DECRETO Nº 7.983, DE 8 DE ABRIL DE 2013, os preços adotados são aqueles constantes dos sistemas de referência indicados. Justifica-se o uso dos preços destas composições de custos unitários devido ao seu valor ser menor à mediana de seus correspondentes na tabela SINAPI;"]
[null,null,null,null,null,null,null,null,null,null,null,"F",null,null,null,null,"(2) Optou-se pelo uso das composições de custos da AGETOP para itens não presentes na SINAPI;"]
[null,null,null,null,null,null,null,null,null,null,null,"F",null,null,null,null,"(3) Para itens da AGETOP, os vidros não estão inclusos nas esquadrias e já foram considerados os custos de contramarco para as esquadrias de alumínio;"]
[null,null,null,null,null,null,null,null,null,null,null,"F",null,null,null,null,"(4) Nos casos em que houver execução de granitina e omissão do item AGETOP 221102, considerou-se que o quantitativo para o rodapé, de altura igual a 7cm, foi incorporado na área de piso;"]
[null,null,null,null,null,null,null,null,null,null,null,"F",null,null,null,null,"(5) O custo unitário aproximado por metro quadrado é calculado dividindo-se o valor total do orçamento pela área total de construção."]
[null,null,null,null,null,null,null,null,null,null,null,"F"]
[null,null,null,null,null,null,null,null,null,null,null,"F"]
[]
[null,null,null,null,null,null,null,null,null,null,null,null,null,null,"SOMATÓRIO DE SERVIÇOS"]
[null,null,null,null,null,null,null,null,null,null,null,null,null,null,"ITEM","DESCRIÇÃO DOS SERVIÇOS",null,null,"PREÇO SEM BDI",null,null,null,null,"PREÇO COM BDI",null,null,"PARTICIPAÇÃO ( % )"]
[null,null,null,null,null,null,null,null,null,null,null,null,null,null,"a.","SERVIÇOS PRELIMINARES",null,null,0,null,null,null,null,0,null,null,0]
[null,null,null,null,null,null,null,null,null,null,null,null,null,null,"b.","TRANSPORTES",null,null,0,null,null,null,null,0,null,null,0]
[null,null,null,null,null,null,null,null,null,null,null,null,null,null,"c.","SERVIÇO EM TERRA",null,null,0,null,null,null,null,0,null,null,0]
[null,null,null,null,null,null,null,null,null,null,null,null,null,null,"d.","FUNDAÇÕES E SONDAGENS",null,null,0,null,null,null,null,0,null,null,0]
[null,null,null,null,null,null,null,null,null,null,null,null,null,null,"e.","ESTRUTURA",null,null,0,null,null,null,null,0,null,null,0]
[null,null,null,null,null,null,null,null,null,null,null,null,null,null,"f.","INSTALAÇÕES ELÉTRICAS",null,null,0,null,null,null,null,0,null,null,0]
[null,null,null,null,null,null,null,null,null,null,null,null,null,null,"g.","INSTALAÇÕES HIDROSSANITÁRIAS",null,null,0,null,null,null,null,0,null,null,0]
[null,null,null,null,null,null,null,null,null,null,null,null,null,null,"h","INSTALAÇÕES ESPECIAIS",null,null,0,null,null,null,null,0,null,null,0]
[null,null,null,null,null,null,null,null,null,null,null,null,null,null,"i.","ALVENARIAS E DIVISÓRIAS",null,null,0,null,null,null,null,0,null,null,0]
[null,null,null,null,null,null,null,null,null,null,null,null,null,null,"j.","ALVENARIA AUTO-PORTANTE",null,null,0,null,null,null,null,0,null,null,0]
[null,null,null,null,null,null,null,null,null,null,null,null,null,null,"k.","IMPERMEABILIZAÇÃO",null,null,0,null,null,null,null,0,null,null,0]
[null,null,null,null,null,null,null,null,null,null,null,null,null,null,"l.","ISOLAMENTO TÉRMICO E ACÚSTICO",null,null,0,null,null,null,null,0,null,null,0]
[null,null,null,null,null,null,null,null,null,null,null,null,null,null,"m.","ESTRUTURA DE MADEIRA",null,null,0,null,null,null,null,0,null,null,0]
[null,null,null,null,null,null,null,null,null,null,null,null,null,null,"n.","ESTRUTURAS METÁLICAS",null,null,0,null,null,null,null,0,null,null,0]
[null,null,null,null,null,null,null,null,null,null,null,null,null,null,"o.","COBERTURAS",null,null,0,null,null,null,null,0,null,null,0]
[null,null,null,null,null,null,null,null,null,null,null,null,null,null,"p.","ESQUADRIAS DE MADEIRA",null,null,0,null,null,null,null,0,null,null,0]
[null,null,null,null,null,null,null,null,null,null,null,null,null,null,"q.","ESQUADRIAS METÁLICAS",null,null,0,null,null,null,null,0,null,null,0]
[null,null,null,null,null,null,null,null,null,null,null,null,null,null,"r.","VIDROS",null,null,0,null,null,null,null,0,null,null,0]
[null,null,null,null,null,null,null,null,null,null,null,null,null,null,"s.","REVESTIMENTO DE PAREDE",null,null,0,null,null,null,null,0,null,null,0]
[null,null,null,null,null,null,null,null,null,null,null,null,null,null,"t.","FORROS",null,null,0,null,null,null,null,0,null,null,0]
[null,null,null,null,null,null,null,null,null,null,null,null,null,null,"u.","REVESTIMENTO DE PISO",null,null,0,null,null,null,null,0,null,null,0]
[null,null,null,null,null,null,null,null,null,null,null,null,null,null,"v.","FERRAGENS",null,null,0,null,null,null,null,0,null,null,0]
[null,null,null,null,null,null,null,null,null,null,null,null,null,null,"w.","MARCENARIA",null,null,0,null,null,null,null,0,null,null,0]
[null,null,null,null,null,null,null,null,null,null,null,null,null,null,"x.","ADMINISTRAÇÃO",null,null,0,null,null,null,null,0,null,null,0]
[null,null,null,null,null,null,null,null,null,null,null,null,null,null,"y.","PINTURA",null,null,0,null,null,null,null,0,null,null,0]
[null,null,null,null,null,null,null,null,null,null,null,null,null,null,"z.","DIVERSOS",null,null,0,null,null,null,null,0,null,null,0]
[null,null,null,null,null,null,null,null,null,null,null,null,null,null,"TOTAL GERAL DO ORÇAMENTO (R$)",null,null,null,0,null,null,null,null,0,null,null,0]
[null,null,null,null,null,null,null,null,null,null,null,null,null,null,null,null,null,null,0,null,null,null,null,0,null,null,100]
[null,null,null,null,null,null,null,null,null,null,null,null,null,null,null,null,null,null,"(TOTAL SEM BDI)",null,null,null,null,"(TOTAL COM BDI)",null,null,"(ARRED porcentagem)"]
[null,null,null,null,null,null,null,null,null,null,null,null,null,null,null,null,null,null,"ERRO",null,null,null,null,"ERRO",null,null,"ERRO"]
[]
[]
[null,null,null,null,null,null,null,null,null,null,null,null,null,null,"RESUMO GERAL DO ORÇAMENTO"]
[null,null,null,null,null,null,null,null,null,null,null,null,null,null,"ITEM","DESCRIÇÃO DOS SERVIÇOS",null,null,"PREÇO SEM BDI",null,null,null,null,"PREÇO COM BDI",null,null,"PARTICIPAÇÃO ( % )"]
[null,null,null,null,null,null,null,null,null,null,null,null,null,null,"1.","REFORMA",null,null,0,null,null,null,null,0,null,null,100]
[null,null,null,null,null,null,null,null,null,null,null,null,null,null,"2.","",null,null,0,null,null,null,null,0,null,null,0]
[null,null,null,null,null,null,null,null,null,null,null,null,null,null,"3.","",null,null,0,null,null,null,null,0,null,null,0]
[null,null,null,null,null,null,null,null,null,null,null,null,null,null,"4.","",null,null,0,null,null,null,null,0,null,null,0]
[null,null,null,null,null,null,null,null,null,null,null,null,null,null,"5.","",null,null,0,null,null,null,null,0,null,null,0]
[null,null,null,null,null,null,null,null,null,null,null,null,null,null,"6.","",null,null,0,null,null,null,null,0,null,null,0]
[null,null,null,null,null,null,null,null,null,null,null,null,null,null,"7.","",null,null,0,null,null,null,null,0,null,null,0]
[null,null,null,null,null,null,null,null,null,null,null,null,null,null,"8.","",null,null,0,null,null,null,null,0,null,null,0]
[null,null,null,null,null,null,null,null,null,null,null,null,null,null,"9.","",null,null,0,null,null,null,null,0,null,null,0]
[null,null,null,null,null,null,null,null,null,null,null,null,null,null,"10.","",null,null,0,null,null,null,null,0,null,null,0]
[null,null,null,null,null,null,null,null,null,null,null,null,null,null,"11.","",null,null,0,null,null,null,null,0,null,null,0]
[null,null,null,null,null,null,null,null,null,null,null,null,null,null,"12.","",null,null,0,null,null,null,null,0,null,null,0]
[null,null,null,null,null,null,null,null,null,null,null,null,null,null,"13.","",null,null,0,null,null,null,null,0,null,null,0]
[null,null,null,null,null,null,null,null,null,null,null,null,null,null,"14.","",null,null,0,null,null,null,null,0,null,null,0]
[null,null,null,null,null,null,null,null,null,null,null,null,null,null,"15.","",null,null,0,null,null,null,null,0,null,null,0]
[null,null,null,null,null,null,null,null,null,null,null,null,null,null,"16.","",null,null,0,null,null,null,null,0,null,null,0]
[null,null,null,null,null,null,null,null,null,null,null,null,null,null,"17.","",null,null,0,null,null,null,null,0,null,null,0]
[null,null,null,null,null,null,null,null,null,null,null,null,null,null,"18.","",null,null,0,null,null,null,null,0,null,null,0]
[null,null,null,null,null,null,null,null,null,null,null,null,null,null,"19.","",null,null,0,null,null,null,null,0,null,null,0]
[null,null,null,null,null,null,null,null,null,null,null,null,null,null,"20.","",null,null,0,null,null,null,null,0,null,null,0]
[null,null,null,null,null,null,null,null,null,null,null,null,null,null,"TOTAL GERAL DO ORÇAMENTO (R$)",null,null,null,0,null,null,null,null,0,null,null,100]
[null,null,null,null,null,null,null,null,null,null,null,null,null,null,null,null,null,null,0,null,null,null,null,0,null,null,100]
[null,null,null,null,null,null,null,null,null,null,null,null,null,null,null,null,null,null,"(TOTAL SEM BDI)",null,null,null,null,"(TOTAL COM BDI)",null,null,"(ARRED porcentagem)"]
[null,null,null,null,null,null,null,null,null,null,null,null,null,null,null,null,null,null,"ERRO",null,null,null,null,"ERRO",null,null,"ERRO"]

{"sheet":"Resumo ","index":1,"n_rows":39,"n_cols":9,"rows_kept":39,"cut":false,"hidden":false,"merged":[[42,3,42,7],[41,3,41,7],[38,1,38,8],[22,2,22,5],[23,2,23,5],[24,2,24,5],[25,2,25,5],[26,2,26,5],[32,2,32,5],[33,2,33,5],[34,2,34,5],[35,2,35,5],[27,2,27,5],[28,2,28,5],[29,2,29,5],[30,2,30,5],[31,2,31,5],[1,1,1,8],[2,6,2,8],[3,6,3,8],[4,1,4,8],[5,6,5,8],[6,6,6,8],[7,1,7,8],[8,6,8,8],[9,6,9,8],[13,1,13,8],[11,1,11,2],[12,1,12,2],[0,1,0,8],[36,1,36,5],[2,1,2,5],[3,1,3,5],[5,1,5,5],[6,1,6,5],[8,1,8,5],[9,1,9,5],[11,3,11,5],[12,3,12,5],[10,1,10,8],[11,6,11,8],[12,6,12,8],[19,2,19,5],[20,2,20,5],[21,2,21,5],[13,0,14,0],[15,2,15,5],[16,2,16,5],[17,2,17,5],[18,2,18,5],[14,1,14,8]]}
[]
[]
[null,"UNIDADE ESCOLAR",null,null,null,null,"CÓDIGO INEP"]
[null,{"$f":"Orçamento!$O$5","v":"COORDENAÇÃO REGIONAL DE EDUCAÇÃO DE JATAÍ"},null,null,null,null,{"$f":"Orçamento!X5","v":52052656}]
[]
[null,"OBRA",null,null,null,null,"CIDADE"]
[null,{"$f":"Orçamento!$O$8","v":"REFORMA E AMPLIAÇÃO"},null,null,null,null,{"$f":"Orçamento!$X$8","v":"JATAÍ"}]
[]
[null,"ENDEREÇO",null,null,null,null,"CRE"]
[null,{"$f":"Orçamento!$R$11","v":"PRAÇA DOM GERMANO, 42 - CENTRO"},null,null,null,null,{"$f":"Orçamento!$O$11","v":"CRE-JATAI"}]
[]
[null,"REFERÊNCIA",null,"DATA",null,null,"ÁREA TOTAL CONSTRUÍDA (M²)"]
[null,{"$f":"CONCATENATE(\"AGETOP E SINAPI - \",Orçamento!$T$11)","v":"AGETOP E SINAPI - DESONERADA"},null,{"$f":"Orçamento!$S$8","v":"2020-05-19"},null,null,{"$f":"Orçamento!$X$14","v":452.07}]
["FILTRO"]
[null,"RESUMO GERAL DO ORÇAMENTO"]
["↓","ITEM","DESCRIÇÃO DOS SERVIÇOS",null,null,null,"PREÇO SEM BDI","PREÇO COM BDI","PARTICIP. (%)"]
[{"$f":"IF(G17>0,\"F\",\"\")","v":""},"1.","REFORMA E AMPLIAÇÃO",null,null,null,{"$f":"IFERROR(Orçamento!S433,\"-\")","v":0},{"$f":"IFERROR(Orçamento!X433,\"\")","v":0},{"$f":"Orçamento!AA433","v":100}]
[{"$f":"IF(G18>0,\"F\",\"\")","v":""},"2.",{"$f":"Orçamento!$P434","v":""},null,null,null,{"$f":"IFERROR(Orçamento!S434,\"-\")","v":0},{"$f":"IFERROR(Orçamento!X434,\"\")","v":0},{"$f":"Orçamento!AA434","v":0}]
["","3.",{"$f":"Orçamento!$P435","v":""},null,null,null,{"$f":"IFERROR(Orçamento!S435,\"-\")","v":0},{"$f":"IFERROR(Orçamento!X435,\"\")","v":0},{"$f":"Orçamento!AA435","v":0}]
["","4.",{"$f":"Orçamento!$P436","v":""},null,null,null,{"$f":"IFERROR(Orçamento!S436,\"-\")","v":0},{"$f":"IFERROR(Orçamento!X436,\"\")","v":0},{"$f":"Orçamento!AA436","v":0}]
["","5.",{"$f":"Orçamento!$P437","v":""},null,null,null,{"$f":"IFERROR(Orçamento!S437,\"-\")","v":0},{"$f":"IFERROR(Orçamento!X437,\"\")","v":0},{"$f":"Orçamento!AA437","v":0}]
["","6.",{"$f":"Orçamento!$P438","v":""},null,null,null,{"$f":"IFERROR(Orçamento!S438,\"-\")","v":0},{"$f":"IFERROR(Orçamento!X438,\"\")","v":0},{"$f":"Orçamento!AA438","v":0}]
["","7.",{"$f":"Orçamento!$P439","v":""},null,null,null,{"$f":"IFERROR(Orçamento!S439,\"-\")","v":0},{"$f":"IFERROR(Orçamento!X439,\"\")","v":0},{"$f":"Orçamento!AA439","v":0}]
["","8.",{"$f":"Orçamento!$P440","v":""},null,null,null,{"$f":"IFERROR(Orçamento!S440,\"-\")","v":0},{"$f":"IFERROR(Orçamento!X440,\"\")","v":0},{"$f":"Orçamento!AA440","v":0}]
["","9.",{"$f":"Orçamento!$P441","v":""},null,null,null,{"$f":"IFERROR(Orçamento!S441,\"-\")","v":0},{"$f":"IFERROR(Orçamento!X441,\"\")","v":0},{"$f":"Orçamento!AA441","v":0}]
["","10.",{"$f":"Orçamento!$P442","v":""},null,null,null,{"$f":"IFERROR(Orçamento!S442,\"-\")","v":0},{"$f":"IFERROR(Orçamento!X442,\"\")","v":0},{"$f":"Orçamento!AA442","v":0}]
["","11.",{"$f":"Orçamento!$P443","v":""},null,null,null,{"$f":"IFERROR(Orçamento!S443,\"-\")","v":0},{"$f":"IFERROR(Orçamento!X443,\"\")","v":0},{"$f":"Orçamento!AA443","v":0}]
["","12.",{"$f":"Orçamento!$P444","v":""},null,null,null,{"$f":"IFERROR(Orçamento!S444,\"-\")","v":0},{"$f":"IFERROR(Orçamento!X444,\"\")","v":0},{"$f":"Orçamento!AA444","v":0}]
["","13.",{"$f":"Orçamento!$P445","v":""},null,null,null,{"$f":"IFERROR(Orçamento!S445,\"-\")","v":0},{"$f":"IFERROR(Orçamento!X445,\"\")","v":0},{"$f":"Orçamento!AA445","v":0}]
["","14.",{"$f":"Orçamento!$P446","v":""},null,null,null,{"$f":"IFERROR(Orçamento!S446,\"-\")","v":0},{"$f":"IFERROR(Orçamento!X446,\"\")","v":0},{"$f":"Orçamento!AA446","v":0}]
["","15.",{"$f":"Orçamento!$P447","v":""},null,null,null,{"$f":"IFERROR(Orçamento!S447,\"-\")","v":0},{"$f":"IFERROR(Orçamento!X447,\"\")","v":0},{"$f":"Orçamento!AA447","v":0}]
["","16.",{"$f":"Orçamento!$P448","v":""},null,null,null,{"$f":"IFERROR(Orçamento!S448,\"-\")","v":0},{"$f":"IFERROR(Orçamento!X448,\"\")","v":0},{"$f":"Orçamento!AA448","v":0}]
["","17.",{"$f":"Orçamento!$P449","v":""},null,null,null,{"$f":"IFERROR(Orçamento!S449,\"-\")","v":0},{"$f":"IFERROR(Orçamento!X449,\"\")","v":0},{"$f":"Orçamento!AA449","v":0}]
["","18.",{"$f":"Orçamento!$P450","v":""},null,null,null,{"$f":"IFERROR(Orçamento!S450,\"-\")","v":0},{"$f":"IFERROR(Orçamento!X450,\"\")","v":0},{"$f":"Orçamento!AA450","v":0}]
["","19.",{"$f":"Orçamento!$P451","v":""},null,null,null,{"$f":"IFERROR(Orçamento!S451,\"-\")","v":0},{"$f":"IFERROR(Orçamento!X451,\"\")","v":0},{"$f":"Orçamento!AA451","v":0}]
["","20.",{"$f":"Orçamento!$P452","v":""},null,null,null,{"$f":"IFERROR(Orçamento!S452,\"-\")","v":0},{"$f":"IFERROR(Orçamento!X452,\"\")","v":0},{"$f":"Orçamento!AA452","v":0}]
["F","TOTAL GERAL DO ORÇAMENTO (R$)",null,null,null,null,{"$f":"SUM(G17:G36)","v":0},{"$f":"SUM(H17:H36)","v":0},{"$f":"SUM(I17:I36)","v":100}]
["F"]
["F"]

{"sheet":"Somatório","index":2,"n_rows":45,"n_cols":6,"rows_kept":45,"cut":false,"hidden":false,"merged":[[0,1,0,5],[14,1,14,5],[2,1,2,3],[2,4,2,5],[3,1,3,3],[3,4,3,5],[5,1,5,3],[5,4,5,5],[6,1,6,3],[6,4,6,5],[8,1,8,3],[8,4,8,5],[1,1,1,5],[4,1,4,5],[7,1,7,5],[10,1,10,5],[9,1,9,3],[9,4,9,5],[11,1,11,2],[11,4,11,5],[12,1,12,2],[12,4,12,5],[13,0,14,0],[42,1,42,2],[44,1,44,5],[47,3,47,5],[48,3,48,5],[13,1,13,5]]}
[]
[]
[null,"UNIDADE ESCOLAR",null,null,"CÓDIGO INEP"]
[null,{"$f":"Orçamento!$O$5","v":"COORDENAÇÃO REGIONAL DE EDUCAÇÃO DE JATAÍ"},null,null,{"$f":"Orçamento!X5","v":52052656}]
[]
[null,"OBRA",null,null,"CIDADE"]
[null,{"$f":"Orçamento!$O$8","v":"REFORMA E AMPLIAÇÃO"},null,null,{"$f":"Orçamento!$X$8","v":"JATAÍ"}]
[]
[null,"ENDEREÇO",null,null,"CRE"]
[null,{"$f":"Orçamento!$R$11","v":"PRAÇA DOM GERMANO, 42 - CENTRO"},null,null,{"$f":"Orçamento!$O$11","v":"CRE-JATAI"}]
[]
[null,"REFERÊNCIA",null,"DATA","ÁREA TOTAL CONSTRUÍDA (M²)"]
[null,{"$f":"CONCATENATE(\"AGETOP E SINAPI - \",Orçamento!$T$11)","v":"AGETOP E SINAPI - DESONERADA"},null,{"$f":"Orçamento!$S$8","v":"2020-05-19"},{"$f":"Orçamento!$X$14","v":452.07}]
["FILTRO"]
[null,"SOMATÓRIO DE SERVIÇOS"]
["↓","ITEM","DESCRIÇÃO DOS SERVIÇOS","PREÇO SEM BDI (R$)","PREÇO COM BDI (R$)","PARTIC.  ( % )"]
[{"$f":"IF(D17>0,\"F\",\"\")","v":""},"a.",{"$f":"Orçamento!P399","v":"SERVIÇOS PRELIMINARES"},{"$f":"Orçamento!S399","v":0},{"$f":"Orçamento!X399","v":0},{"$f":"Orçamento!AA399","v":0}]
[{"$f":"IF(D18>0,\"F\",\"\")","v":""},"b.",{"$f":"Orçamento!P400","v":"TRANSPORTES"},{"$f":"Orçamento!S400","v":0},{"$f":"Orçamento!X400","v":0},{"$f":"Orçamento!AA400","v":0}]
["","c.",{"$f":"Orçamento!P401","v":"SERVIÇO EM TERRA"},{"$f":"Orçamento!S401","v":0},{"$f":"Orçamento!X401","v":0},{"$f":"Orçamento!AA401","v":0}]
["","d.",{"$f":"Orçamento!P402","v":"FUNDAÇÕES E SONDAGENS"},{"$f":"Orçamento!S402","v":0},{"$f":"Orçamento!X402","v":0},{"$f":"Orçamento!AA402","v":0}]
["","e.",{"$f":"Orçamento!P403","v":"ESTRUTURA"},{"$f":"Orçamento!S403","v":0},{"$f":"Orçamento!X403","v":0},{"$f":"Orçamento!AA403","v":0}]
["","f.",{"$f":"Orçamento!P404","v":"INSTALAÇÕES ELÉTRICAS"},{"$f":"Orçamento!S404","v":0},{"$f":"Orçamento!X404","v":0},{"$f":"Orçamento!AA404","v":0}]
["","g.",{"$f":"Orçamento!P405","v":"INSTALAÇÕES HIDROSSANITÁRIAS"},{"$f":"Orçamento!S405","v":0},{"$f":"Orçamento!X405","v":0},{"$f":"Orçamento!AA405","v":0}]
["","h",{"$f":"Orçamento!P406","v":"INSTALAÇÕES ESPECIAIS"},{"$f":"Orçamento!S406","v":0},{"$f":"Orçamento!X406","v":0},{"$f":"Orçamento!AA406","v":0}]
["","i.",{"$f":"Orçamento!P407","v":"ALVENARIAS E DIVISÓRIAS"},{"$f":"Orçamento!S407","v":0},{"$f":"Orçamento!X407","v":0},{"$f":"Orçamento!AA407","v":0}]
["","j.",{"$f":"Orçamento!P408","v":"ALVENARIA AUTO-PORTANTE"},{"$f":"Orçamento!S408","v":0},{"$f":"Orçamento!X408","v":0},{"$f":"Orçamento!AA408","v":0}]
["","k.",{"$f":"Orçamento!P409","v":"IMPERMEABILIZAÇÃO"},{"$f":"Orçamento!S409","v":0},{"$f":"Orçamento!X409","v":0},{"$f":"Orçamento!AA409","v":0}]
["","l.",{"$f":"Orçamento!P410","v":"ISOLAMENTO TÉRMICO E ACÚSTICO"},{"$f":"Orçamento!S410","v":0},{"$f":"Orçamento!X410","v":0},{"$f":"Orçamento!AA410","v":0}]
["","m.",{"$f":"Orçamento!P411","v":"ESTRUTURA DE MADEIRA"},{"$f":"Orçamento!S411","v":0},{"$f":"Orçamento!X411","v":0},{"$f":"Orçamento!AA411","v":0}]
["","n.",{"$f":"Orçamento!P412","v":"ESTRUTURAS METÁLICAS"},{"$f":"Orçamento!S412","v":0},{"$f":"Orçamento!X412","v":0},{"$f":"Orçamento!AA412","v":0}]
["","o.",{"$f":"Orçamento!P413","v":"COBERTURAS"},{"$f":"Orçamento!S413","v":0},{"$f":"Orçamento!X413","v":0},{"$f":"Orçamento!AA413","v":0}]
["","p.",{"$f":"Orçamento!P414","v":"ESQUADRIAS DE MADEIRA"},{"$f":"Orçamento!S414","v":0},{"$f":"Orçamento!X414","v":0},{"$f":"Orçamento!AA414","v":0}]
["","q.",{"$f":"Orçamento!P415","v":"ESQUADRIAS METÁLICAS"},{"$f":"Orçamento!S415","v":0},{"$f":"Orçamento!X415","v":0},{"$f":"Orçamento!AA415","v":0}]
["","r.",{"$f":"Orçamento!P416","v":"VIDROS"},{"$f":"Orçamento!S416","v":0},{"$f":"Orçamento!X416","v":0},{"$f":"Orçamento!AA416","v":0}]
["","s.",{"$f":"Orçamento!P417","v":"REVESTIMENTO DE PAREDE"},{"$f":"Orçamento!S417","v":0},{"$f":"Orçamento!X417","v":0},{"$f":"Orçamento!AA417","v":0}]
["","t.",{"$f":"Orçamento!P418","v":"FORROS"},{"$f":"Orçamento!S418","v":0},{"$f":"Orçamento!X418","v":0},{"$f":"Orçamento!AA418","v":0}]
["","u.",{"$f":"Orçamento!P419","v":"REVESTIMENTO DE PISO"},{"$f":"Orçamento!S419","v":0},{"$f":"Orçamento!X419","v":0},{"$f":"Orçamento!AA419","v":0}]
["","v.",{"$f":"Orçamento!P420","v":"FERRAGENS"},{"$f":"Orçamento!S420","v":0},{"$f":"Orçamento!X420","v":0},{"$f":"Orçamento!AA420","v":0}]
["","w.",{"$f":"Orçamento!P421","v":"MARCENARIA"},{"$f":"Orçamento!S421","v":0},{"$f":"Orçamento!X421","v":0},{"$f":"Orçamento!AA421","v":0}]
["","x.",{"$f":"Orçamento!P422","v":"ADMINISTRAÇÃO"},{"$f":"Orçamento!S422","v":0},{"$f":"Orçamento!X422","v":0},{"$f":"Orçamento!AA422","v":0}]
["","y.",{"$f":"Orçamento!P423","v":"PINTURA"},{"$f":"Orçamento!S423","v":0},{"$f":"Orçamento!X423","v":0},{"$f":"Orçamento!AA423","v":0}]
["","z.",{"$f":"Orçamento!P424","v":"DIVERSOS"},{"$f":"Orçamento!S424","v":0},{"$f":"Orçamento!X424","v":0},{"$f":"Orçamento!AA424","v":0}]
["F","TOTAL GERAL DO ORÇAMENTO",null,{"$f":"SUM(D17:D42)","v":0},{"$f":"SUM(E17:E42)","v":0},{"$f":"SUM(F17:F42)","v":0}]
[]
[null,"(*) Para itens da AGETOP, os vidros não estão inclusos nas esquadrias e já foram considerados os custos de contramarco para as esquadrias de alumínio;"]

{"sheet":"Cronog_30_Dias","index":3,"n_rows":99,"n_cols":14,"rows_kept":99,"cut":false,"hidden":false,"merged":[[0,1,0,13],[2,1,2,7],[3,1,3,7],[5,1,5,7],[6,1,6,7],[8,1,8,7],[9,1,9,7],[1,1,1,13],[7,1,7,13],[4,1,4,13],[10,1,10,13],[9,8,9,13],[8,8,8,13],[3,8,3,13],[6,8,6,13],[5,8,5,13],[2,8,2,13],[50,1,52,2],[71,3,73,3],[12,13,13,13],[13,1,13,2],[13,5,13,8],[13,9,13,12],[12,3,13,3],[12,9,12,12],[14,1,16,2],[12,5,12,8],[17,1,19,2],[17,4,19,4],[17,5,17,8],[17,9,17,12],[19,5,19,8],[19,9,19,12],[20,1,22,2],[65,1,67,2],[68,3,70,3],[62,3,64,3],[68,1,70,2],[56,3,58,3],[65,4,67,4],[74,3,76,3],[50,4,52,4],[74,4,76,4],[56,1,58,2],[56,4,58,4],[50,3,52,3],[53,3,55,3],[68,4,70,4],[62,1,64,2],[62,4,64,4],[59,3,61,3],[53,1,55,2],[53,4,55,4],[59,1,61,2],[59,4,61,4],[74,1,76,2],[20,4,22,4],[20,5,20,8],[20,9,20,12],[22,5,22,8],[22,9,22,12],[20,3,22,3],[14,3,16,3],[17,3,19,3],[14,4,16,4],[14,5,14,8],[14,9,14,12],[16,5,16,8],[16,9,16,12],[23,9,23,12],[25,5,25,8],[25,9,25,12],[26,1,28,2],[26,4,28,4],[26,5,26,8],[26,9,26,12],[28,5,28,8],[28,9,28,12],[23,3,25,3],[23,1,25,2],[23,4,25,4],[23,5,23,8],[26,3,28,3],[29,9,29,12],[31,5,31,8],[31,9,31,12],[32,1,34,2],[32,4,34,4],[32,5,32,8],[32,9,32,12],[34,5,34,8],[34,9,34,12],[32,3,34,3],[29,5,29,8],[29,1,31,2],[29,4,31,4],[29,3,31,3],[35,9,35,12],[37,5,37,8],[37,9,37,12],[35,3,37,3],[40,9,40,12],[38,3,40,3],[38,9,38,12],[41,1,43,2],[41,4,43,4],[41,5,41,8],[41,9,41,12],[43,5,43,8],[43,9,43,12],[41,3,43,3],[35,5,35,8],[38,5,38,8],[40,5,40,8],[35,1,37,2],[35,4,37,4],[38,1,40,2],[38,4,40,4],[44,9,44,12],[46,5,46,8],[46,9,46,12],[47,1,49,2],[47,4,49,4],[47,5,47,8],[47,9,47,12],[49,5,49,8],[49,9,49,12],[44,5,44,8],[47,3,49,3],[44,3,46,3],[44,1,46,2],[44,4,46,4],[53,9,53,12],[55,5,55,8],[55,9,55,12],[50,5,50,8],[50,9,50,12],[52,5,52,8],[52,9,52,12],[56,9,56,12],[58,5,58,8],[58,9,58,12],[53,5,53,8],[56,5,56,8],[68,5,68,8],[65,5,65,8],[65,9,65,12],[67,5,67,8],[67,9,67,12],[65,3,67,3],[62,9,62,12],[64,5,64,8],[64,9,64,12],[62,5,62,8],[95,1,95,2],[95,5,95,8],[95,9,95,12],[97,1,97,4],[98,1,98,13],[86,9,86,12],[88,5,88,8],[88,9,88,12],[85,5,85,8],[85,9,85,12],[89,1,91,2],[89,4,91,4],[89,5,89,8],[89,9,89,12],[91,5,91,8],[91,9,91,12],[89,3,91,3],[86,4,88,4],[86,5,86,8],[86,3,88,3],[83,1,85,2],[83,4,85,4],[83,5,83,8],[83,9,83,12],[94,1,94,2],[94,5,94,8],[94,9,94,12],[76,5,76,8],[76,9,76,12],[77,5,77,8],[77,9,77,12],[79,5,79,8],[79,9,79,12],[80,5,80,8],[80,9,80,12],[82,5,82,8],[82,9,82,12],[77,3,79,3],[80,3,82,3],[86,1,88,2],[80,4,82,4],[83,3,85,3],[77,1,79,2],[77,4,79,4],[80,1,82,2],[12,0,13,0],[9,0,11,0],[11,1,11,13],[92,1,92,2],[92,5,92,8],[92,9,92,12],[93,1,93,2],[93,5,93,8],[93,9,93,12],[74,9,74,12],[74,5,74,8],[68,9,68,12],[70,5,70,8],[70,9,70,12],[59,5,59,8],[71,1,73,2],[71,4,73,4],[71,5,71,8],[71,9,71,12],[73,5,73,8],[73,9,73,12],[59,9,59,12],[61,5,61,8],[61,9,61,12]]}
[]
[]
[null,"UNIDADE ESCOLAR",null,null,null,null,null,null,"PRAZO"]
[null,{"$f":"Orçamento!$O$5","v":"COORDENAÇÃO REGIONAL DE EDUCAÇÃO DE JATAÍ"},null,null,null,null,null,null,"30 DIAS CORRIDOS"]
[]
[null,"OBRA",null,null,null,null,null,null,"DATA"]
[null,{"$f":"Orçamento!$O$8","v":"REFORMA E AMPLIAÇÃO"},null,null,null,null,null,null,{"$f":"Orçamento!$S$8","v":"2020-05-19"}]
[]
[null,"LOCAL",null,null,null,null,null,null,"ÁREA TOTAL CONSTRUÍDA (M²)"]
["FILTRO",{"$f":"Orçamento!$X$8","v":"JATAÍ"},null,null,null,null,null,null,{"$f":"Orçamento!$X$14","v":452.07}]
[]
[null,"CRONOGRAMA - FÍSICO FINANCEIRO"]
["↓","CUSTO TOTAL:",{"$f":"D93","v":0},"VALOR","Dias:",15,null,null,null,30,null,null,null,"TOTAL"]
[null,"DESCRIÇÃO DOS SERVIÇOS",null,null,"%","1ª PARCELA",null,null,null,"2ª PARCELA"]
[{"$f":"IF(D15>0,\"F\",\"\")","v":""},"SERVIÇOS PRELIMINARES",null,{"$f":"Orçamento!X399","v":0},{"$f":"Orçamento!AA399","v":0},{"$f":"ROUND(F17*$D$15,2)","v":0},null,null,null,{"$f":"ROUND(J17*$D$15,2)","v":0},null,null,null,{"$f":"SUM(F15:M15)","v":0}]
[{"$f":"IF(A15=\"F\",A15,\"\")","v":""}]
[{"$f":"IF(A16=\"F\",A16,\"\")","v":""},null,null,null,null,1,null,null,null,{"$f":"1-F17","v":0},null,null,null,{"$f":"IFERROR(E15/100,\"\")","v":0}]
[{"$f":"IF(D18>0,\"F\",\"\")","v":""},"TRANSPORTES",null,{"$f":"Orçamento!X400","v":0},{"$f":"Orçamento!AA400","v":0},{"$f":"ROUND(F20*$D$18,2)","v":0},null,null,null,{"$f":"ROUND(J20*$D$18,2)","v":0},null,null,null,{"$f":"SUM(F18:M18)","v":0}]
[{"$f":"IF(A18=\"F\",A18,\"\")","v":""}]
[{"$f":"IF(A19=\"F\",A19,\"\")","v":""},null,null,null,null,0.48,null,null,null,{"$f":"1-F20","v":0.52},null,null,null,{"$f":"IFERROR(E18/100,\"\")","v":0}]
[{"$f":"IF(D21>0,\"F\",\"\")","v":""},"SERVIÇO EM TERRA",null,{"$f":"Orçamento!X401","v":0},{"$f":"Orçamento!AA401","v":0},{"$f":"ROUND(F23*$D$21,2)","v":0},null,null,null,{"$f":"ROUND(J23*$D$21,2)","v":0},null,null,null,{"$f":"SUM(F21:M21)","v":0}]
[{"$f":"IF(A21=\"F\",A21,\"\")","v":""}]
[{"$f":"IF(A22=\"F\",A22,\"\")","v":""},null,null,null,null,1,null,null,null,{"$f":"1-F23","v":0},null,null,null,{"$f":"IFERROR(E21/100,\"\")","v":0}]
[{"$f":"IF(D24>0,\"F\",\"\")","v":""},"FUNDAÇÕES E SONDAGENS",null,{"$f":"Orçamento!X402","v":0},{"$f":"Orçamento!AA402","v":0},{"$f":"ROUND(F26*$D$24,2)","v":0},null,null,null,{"$f":"ROUND(J26*$D$24,2)","v":0},null,null,null,{"$f":"SUM(F24:M24)","v":0}]
[{"$f":"IF(A24=\"F\",A24,\"\")","v":""}]
[{"$f":"IF(A25=\"F\",A25,\"\")","v":""},null,null,null,null,1,null,null,null,{"$f":"1-F26","v":0},null,null,null,{"$f":"IFERROR(E24/100,\"\")","v":0}]
[{"$f":"IF(D27>0,\"F\",\"\")","v":""},"ESTRUTURA",null,{"$f":"Orçamento!X403","v":0},{"$f":"Orçamento!AA403","v":0},{"$f":"ROUND(F29*$D$27,2)","v":0},null,null,null,{"$f":"ROUND(J29*$D$27,2)","v":0},null,null,null,{"$f":"SUM(F27:M27)","v":0}]
[{"$f":"IF(A27=\"F\",A27,\"\")","v":""}]
[{"$f":"IF(A28=\"F\",A28,\"\")","v":""},null,null,null,null,0.49,null,null,null,{"$f":"1-F29","v":0.51},null,null,null,{"$f":"IFERROR(E27/100,\"\")","v":0}]
[{"$f":"IF(D30>0,\"F\",\"\")","v":""},"INST.ELET/TELEFÔNICA/CABEAMENTO ESTRUTURADO",null,{"$f":"Orçamento!X404","v":0},{"$f":"Orçamento!AA404","v":0},{"$f":"ROUND(F32*$D$30,2)","v":0},null,null,null,{"$f":"ROUND(J32*$D$30,2)","v":0},null,null,null,{"$f":"SUM(F30:M30)","v":0}]
[{"$f":"IF(A30=\"F\",A30,\"\")","v":""}]
[{"$f":"IF(A31=\"F\",A31,\"\")","v":""},null,null,null,null,0.4,null,null,null,{"$f":"1-F32","v":0.6},null,null,null,{"$f":"IFERROR(E30/100,\"\")","v":0}]
[{"$f":"IF(D33>0,\"F\",\"\")","v":""},"INSTALAÇÕES HIDROSSANITÁRIAS",null,{"$f":"Orçamento!X405","v":0},{"$f":"Orçamento!AA405","v":0},{"$f":"ROUND(F35*$D$33,2)","v":0},null,null,null,{"$f":"ROUND(J35*$D$33,2)","v":0},null,null,null,{"$f":"SUM(F33:M33)","v":0}]
[{"$f":"IF(A33=\"F\",A33,\"\")","v":""}]
[{"$f":"IF(A34=\"F\",A34,\"\")","v":""},null,null,null,null,0.48,null,null,null,{"$f":"1-F35","v":0.52},null,null,null,{"$f":"IFERROR(E33/100,\"\")","v":0}]
[{"$f":"IF(D36>0,\"F\",\"\")","v":""},"INSTALAÇÕES ESPECIAIS",null,{"$f":"Orçamento!X406","v":0},{"$f":"Orçamento!AA406","v":0},{"$f":"ROUND(F38*$D$36,2)","v":0},null,null,null,{"$f":"ROUND(J38*$D$36,2)","v":0},null,null,null,{"$f":"SUM(F36:M36)","v":0}]
[{"$f":"IF(A36=\"F\",A36,\"\")","v":""}]
[{"$f":"IF(A37=\"F\",A37,\"\")","v":""},null,null,null,null,1,null,null,null,{"$f":"1-F38","v":0},null,null,null,{"$f":"IFERROR(E36/100,\"\")","v":0}]
[{"$f":"IF(D39>0,\"F\",\"\")","v":""},"ALVENARIA E DIVISÓRIAS",null,{"$f":"Orçamento!X407","v":0},{"$f":"Orçamento!AA407","v":0},{"$f":"ROUND(F41*$D$39,2)","v":0},null,null,null,{"$f":"ROUND(J41*$D$39,2)","v":0},null,null,null,{"$f":"SUM(F39:M39)","v":0}]
[{"$f":"IF(A39=\"F\",A39,\"\")","v":""}]
[{"$f":"IF(A40=\"F\",A40,\"\")","v":""},null,null,null,null,1,null,null,null,{"$f":"1-F41","v":0},null,null,null,{"$f":"IFERROR(E39/100,\"\")","v":0}]
[{"$f":"IF(D42>0,\"F\",\"\")","v":""},"ALVENARIA AUTO-PORTANTE",null,{"$f":"Orçamento!X408","v":0},{"$f":"Orçamento!AA408","v":0},{"$f":"ROUND(F44*$D$42,2)","v":0},null,null,null,{"$f":"ROUND(J44*$D$42,2)","v":0},null,null,null,{"$f":"SUM(F42:M42)","v":0}]
[{"$f":"IF(A42=\"F\",A42,\"\")","v":""}]
[{"$f":"IF(A43=\"F\",A43,\"\")","v":""},null,null,null,null,1,null,null,null,{"$f":"1-F44","v":0},null,null,null,{"$f":"IFERROR(E42/100,\"\")","v":0}]
[{"$f":"IF(D45>0,\"F\",\"\")","v":""},"IMPERMEABILIZAÇÃO",null,{"$f":"Orçamento!X409","v":0},{"$f":"Orçamento!AA409","v":0},{"$f":"ROUND(F47*$D$45,2)","v":0},null,null,null,{"$f":"ROUND(J47*$D$45,2)","v":0},null,null,null,{"$f":"SUM(F45:M45)","v":0}]
[{"$f":"IF(A45=\"F\",A45,\"\")","v":""}]
[{"$f":"IF(A46=\"F\",A46,\"\")","v":""},null,null,null,null,1,null,null,null,{"$f":"1-F47","v":0},null,null,null,{"$f":"IFERROR(E45/100,\"\")","v":0}]
[{"$f":"IF(D48>0,\"F\",\"\")","v":""},"ISOLAMENTO TÉRMICO E ACÚSTICO",null,{"$f":"Orçamento!X410","v":0},{"$f":"Orçamento!AA410","v":0},{"$f":"ROUND(F50*$D$48,2)","v":0},null,null,null,{"$f":"ROUND(J50*$D$48,2)","v":0},null,null,null,{"$f":"SUM(F48:M48)","v":0}]
[{"$f":"IF(A48=\"F\",A48,\"\")","v":""}]
[{"$f":"IF(A49=\"F\",A49,\"\")","v":""},null,null,null,null,0.5,null,null,null,{"$f":"1-F50","v":0.5},null,null,null,{"$f":"IFERROR(E48/100,\"\")","v":0}]
[{"$f":"IF(D51>0,\"F\",\"\")","v":""},"ESTRUTURA DE MADEIRA",null,{"$f":"Orçamento!X411","v":0},{"$f":"Orçamento!AA411","v":0},{"$f":"ROUND(F53*$D$51,2)","v":0},null,null,null,{"$f":"ROUND(J53*$D$51,2)","v":0},null,null,null,{"$f":"SUM(F51:M51)","v":0}]
[{"$f":"IF(A51=\"F\",A51,\"\")","v":""}]
[{"$f":"IF(A52=\"F\",A52,\"\")","v":""},null,null,null,null,0.4,null,null,null,{"$f":"1-F53","v":0.6},null,null,null,{"$f":"IFERROR(E51/100,\"\")","v":0}]
[{"$f":"IF(D54>0,\"F\",\"\")","v":""},"ESTRUTURA METÁLICA",null,{"$f":"Orçamento!X412","v":0},{"$f":"Orçamento!AA412","v":0},{"$f":"ROUND(F56*$D$54,2)","v":0},null,null,null,{"$f":"ROUND(J56*$D$54,2)","v":0},null,null,null,{"$f":"SUM(F54:M54)","v":0}]
[{"$f":"IF(A54=\"F\",A54,\"\")","v":""}]
[{"$f":"IF(A55=\"F\",A55,\"\")","v":""},null,null,null,null,0.35,null,null,null,{"$f":"1-F56","v":0.65},null,null,null,{"$f":"IFERROR(E54/100,\"\")","v":0}]
[{"$f":"IF(D57>0,\"F\",\"\")","v":""},"COBERTURAS",null,{"$f":"Orçamento!X413","v":0},{"$f":"Orçamento!AA413","v":0},{"$f":"ROUND(F59*$D$57,2)","v":0},null,null,null,{"$f":"ROUND(J59*$D$57,2)","v":0},null,null,null,{"$f":"SUM(F57:M57)","v":0}]
[{"$f":"IF(A57=\"F\",A57,\"\")","v":""}]
[{"$f":"IF(A58=\"F\",A58,\"\")","v":""},null,null,null,null,0,null,null,null,{"$f":"1-F59","v":1},null,null,null,{"$f":"IFERROR(E57/100,\"\")","v":0}]
[{"$f":"IF(D60>0,\"F\",\"\")","v":""},"ESQUADRIAS DE MADEIRA",null,{"$f":"Orçamento!X414","v":0},{"$f":"Orçamento!AA414","v":0},{"$f":"ROUND(F62*$D$60,2)","v":0},null,null,null,{"$f":"ROUND(J62*$D$60,2)","v":0},null,null,null,{"$f":"SUM(F60:M60)","v":0}]
[{"$f":"IF(A60=\"F\",A60,\"\")","v":""}]
[{"$f":"IF(A61=\"F\",A61,\"\")","v":""},null,null,null,null,0.54,null,null,null,{"$f":"1-F62","v":0.45999999999999996},null,null,null,{"$f":"IFERROR(E60/100,\"\")","v":0}]
[{"$f":"IF(D63>0,\"F\",\"\")","v":""},"ESQUADRIAS METÁLICAS",null,{"$f":"Orçamento!X415","v":0},{"$f":"Orçamento!AA415","v":0},{"$f":"ROUND(F65*$D$63,2)","v":0},null,null,null,{"$f":"ROUND(J65*$D$63,2)","v":0},null,null,null,{"$f":"SUM(F63:M63)","v":0}]
[{"$f":"IF(A63=\"F\",A63,\"\")","v":""}]
[{"$f":"IF(A64=\"F\",A64,\"\")","v":""},null,null,null,null,0.49,null,null,null,{"$f":"1-F65","v":0.51},null,null,null,{"$f":"IFERROR(E63/100,\"\")","v":0}]
[{"$f":"IF(D66>0,\"F\",\"\")","v":""},"VIDROS",null,{"$f":"Orçamento!X416","v":0},{"$f":"Orçamento!AA416","v":0},{"$f":"ROUND(F68*$D$66,2)","v":0},null,null,null,{"$f":"ROUND(J68*$D$66,2)","v":0},null,null,null,{"$f":"SUM(F66:M66)","v":0}]
[{"$f":"IF(A66=\"F\",A66,\"\")","v":""}]
[{"$f":"IF(A67=\"F\",A67,\"\")","v":""},null,null,null,null,0,null,null,null,{"$f":"1-F68","v":1},null,null,null,{"$f":"IFERROR(E66/100,\"\")","v":0}]
[{"$f":"IF(D69>0,\"F\",\"\")","v":""},"REVESTIMENTO DE PAREDE",null,{"$f":"Orçamento!X417","v":0},{"$f":"Orçamento!AA417","v":0},{"$f":"ROUND(F71*$D$69,2)","v":0},null,null,null,{"$f":"ROUND(J71*$D$69,2)","v":0},null,null,null,{"$f":"SUM(F69:M69)","v":0}]
[{"$f":"IF(A69=\"F\",A69,\"\")","v":""}]
[{"$f":"IF(A70=\"F\",A70,\"\")","v":""},null,null,null,null,0.32,null,null,null,{"$f":"1-F71","v":0.67999999999999994},null,null,null,{"$f":"IFERROR(E69/100,\"\")","v":0}]
[{"$f":"IF(D72>0,\"F\",\"\")","v":""},"FORROS",null,{"$f":"Orçamento!X418","v":0},{"$f":"Orçamento!AA418","v":0},{"$f":"ROUND(F74*$D$72,2)","v":0},null,null,null,{"$f":"ROUND(J74*$D$72,2)","v":0},null,null,null,{"$f":"SUM(F72:M72)","v":0}]
[{"$f":"IF(A72=\"F\",A72,\"\")","v":""}]
[{"$f":"IF(A73=\"F\",A73,\"\")","v":""},null,null,null,null,0.24,null,null,null,{"$f":"1-F74","v":0.76},null,null,null,{"$f":"IFERROR(E72/100,\"\")","v":0}]
[{"$f":"IF(D75>0,\"F\",\"\")","v":""},"REVESTIMENTO DE PISO",null,{"$f":"Orçamento!X419","v":0},{"$f":"Orçamento!AA419","v":0},{"$f":"ROUND(F77*$D$75,2)","v":0},null,null,null,{"$f":"ROUND(J77*$D$75,2)","v":0},null,null,null,{"$f":"SUM(F75:M75)","v":0}]
[{"$f":"IF(A75=\"F\",A75,\"\")","v":""}]
[{"$f":"IF(A76=\"F\",A76,\"\")","v":""},null,null,null,null,0.49,null,null,null,{"$f":"1-F77","v":0.51},null,null,null,{"$f":"IFERROR(E75/100,\"\")","v":0}]
[{"$f":"IF(D78>0,\"F\",\"\")","v":""},"FERRAGENS",null,{"$f":"Orçamento!X420","v":0},{"$f":"Orçamento!AA420","v":0},{"$f":"ROUND(F80*$D$78,2)","v":0},null,null,null,{"$f":"ROUND(J80*$D$78,2)","v":0},null,null,null,{"$f":"SUM(F78:M78)","v":0}]
[{"$f":"IF(A78=\"F\",A78,\"\")","v":""}]
[{"$f":"IF(A79=\"F\",A79,\"\")","v":""},null,null,null,null,0,null,null,null,{"$f":"1-F80","v":1},null,null,null,{"$f":"IFERROR(E78/100,\"\")","v":0}]
[{"$f":"IF(D81>0,\"F\",\"\")","v":""},"MARCENARIA",null,{"$f":"Orçamento!X421","v":0},{"$f":"Orçamento!AA421","v":0},{"$f":"ROUND(F83*$D$81,2)","v":0},null,null,null,{"$f":"ROUND(J83*$D$81,2)","v":0},null,null,null,{"$f":"SUM(F81:M81)","v":0}]
[{"$f":"IF(A81=\"F\",A81,\"\")","v":""}]
[{"$f":"IF(A82=\"F\",A82,\"\")","v":""},null,null,null,null,0.4,null,null,null,{"$f":"1-F83","v":0.6},null,null,null,{"$f":"IFERROR(E81/100,\"\")","v":0}]
[{"$f":"IF(D84>0,\"F\",\"\")","v":""},"ADMINISTRAÇÃO - MENSALISTAS",null,{"$f":"Orçamento!X422","v":0},{"$f":"Orçamento!AA422","v":0},{"$f":"ROUND(F86*$D$84,2)","v":0},null,null,null,{"$f":"ROUND(J86*$D$84,2)","v":0},null,null,null,{"$f":"SUM(F84:M84)","v":0}]
[{"$f":"IF(A84=\"F\",A84,\"\")","v":""}]
[{"$f":"IF(A85=\"F\",A85,\"\")","v":""},null,null,null,null,0.49,null,null,null,{"$f":"1-F86","v":0.51},null,null,null,{"$f":"IFERROR(E84/100,\"\")","v":0}]
[{"$f":"IF(D87>0,\"F\",\"\")","v":""},"PINTURA",null,{"$f":"Orçamento!X423","v":0},{"$f":"Orçamento!AA423","v":0},{"$f":"ROUND(F89*$D$87,2)","v":0},null,null,null,{"$f":"ROUND(J89*$D$87,2)","v":0},null,null,null,{"$f":"SUM(F87:M87)","v":0}]
[{"$f":"IF(A87=\"F\",A87,\"\")","v":""}]
[{"$f":"IF(A88=\"F\",A88,\"\")","v":""},null,null,null,null,0,null,null,null,{"$f":"1-F89","v":1},null,null,null,{"$f":"IFERROR(E87/100,\"\")","v":0}]
[{"$f":"IF(D90>0,\"F\",\"\")","v":""},"DIVERSOS",null,{"$f":"Orçamento!X424","v":0},{"$f":"Orçamento!AA424","v":0},{"$f":"ROUND(F92*$D$90,2)","v":0},null,null,null,{"$f":"ROUND(J92*$D$90,2)","v":0},null,null,null,{"$f":"SUM(F90:M90)","v":0}]
[{"$f":"IF(A90=\"F\",A90,\"\")","v":""}]
[{"$f":"IF(A91=\"F\",A91,\"\")","v":""},null,null,null,null,0.46460000000000001,null,null,null,{"$f":"1-F92","v":0.53539999999999999},null,null,null,{"$f":"IFERROR(E90/100,\"\")","v":0}]
["F","CUSTO DO ORÇAMENTO",null,{"$f":"SUM(D15:D92)","v":0},{"$f":"SUM(E15:E92)","v":0},{"$f":"F15+F18+F21+F24+F27+F30+F33+F36+F39+F42+F45+F48+F51+F54+F57+F60+F63+F66+F69+F72+F75+F78+F81+F84+F87+F90","v":0},null,null,null,{"$f":"J15+J18+J21+J24+J27+J30+J33+J36+J39+J42+J45+J48+J51+J54+J57+J60+J63+J66+J69+J72+J75+J78+J81+J84+J87+J90","v":0},null,null,null,{"$f":"N15+N18+N21+N24+N27+N30+N33+N36+N39+N42+N45+N48+N51+N54+N57+N60+N63+N66+N69+N72+N75+N78+N81+N84+N87+N90","v":0}]
["F","PERCENTUAIS:",null,null,null,{"$f":"IFERROR(F93/D93,\"\")","v":""},null,null,null,{"$f":"IFERROR(J93/D93,\"\")","v":""},null,null,null,{"$f":"SUM(F94:M94)","v":0}]
["F","TOTAIS ACUMULADOS:",null,null,null,{"$f":"F93","v":0},null,null,null,{"$f":"F95+J93","v":0}]
["F","PERCENTUAIS  ACUMULADOS:",null,null,null,{"$f":"F94","v":""},null,null,null,{"$f":"IFERROR(F96+J94,\"\")","v":""}]
["F"]
["F","OBSERVAÇÕES:"]
["F","Os pagamentos somente poderão ser efetuados mediante medição e atesto pelos técnicos da Secretaria da Educação. "]

{"sheet":"Composição BDI","index":4,"n_rows":45,"n_cols":9,"rows_kept":45,"cut":false,"hidden":false,"merged":[[12,0,12,3],[13,0,13,3],[14,0,14,3],[15,0,15,3],[6,0,6,3],[8,0,8,3],[7,0,7,3],[9,0,9,3],[11,0,11,3],[10,0,10,3],[0,0,0,3],[2,0,2,3],[3,0,3,3],[1,0,1,3],[5,0,5,3],[4,0,4,3],[18,5,18,8],[17,0,17,3],[16,0,16,3],[44,0,44,3],[42,0,42,3],[43,0,43,3],[18,0,18,3],[36,0,36,3],[39,0,39,3],[38,0,38,3],[40,0,40,3],[29,0,29,2],[32,0,32,3],[33,0,33,3],[34,0,34,3],[35,0,35,3]]}
[]
[]
["UNIDADE ESCOLAR"]
["COORDENAÇÃO REGIONAL DE EDUCAÇÃO DE JATAÍ"]
[]
["OBRA"]
["REFORMA E AMPLIAÇÃO"]
[]
["ENDEREÇO"]
["PRAÇA DOM GERMANO, 42 - CENTRO"]
[]
["CIDADE"]
["JATAÍ"]
[]
["CRE"]
["CRE-JATAI"]
[]
["DETALHAMENTO DA COMPOSIÇÃO DE BDI"]
["COMPOSIÇÃO BDI PARA OBRAS CIVIS",null,null,null,null,"BDI CONSTRUÇÃO E REFORMA"]
["DESCRIÇÃO","COEF.","TAXA % (a.m)","% no preço de venda",null,"Situação","1º Quartil","Médio","3º Quartil"]
["1) COFINS",1,0.03,0.03,null,"OK",0.03,0.03,0.03]
["2) PIS",1,6.4999999999999997E-3,6.4999999999999997E-3,null,"OK",6.4999999999999997E-3,6.4999999999999997E-3,6.4999999999999997E-3]
["3) ISSQN",1,2.5000000000000001E-2,2.5000000000000001E-2,null,"OK",0.02,3.5000000000000003E-2,0.05]
["4) CPRB",1,4.4999999999999998E-2,4.4999999999999998E-2,null,"OK",4.4999999999999998E-2,4.4999999999999998E-2,4.4999999999999998E-2]
["5) Administração Central",1,0.04,0.04,null,"OK",0.03,0.04,5.5E-2]
["6) Despesas Financeiras",1,5.5999999999999999E-3,5.5999999999999999E-3,null,"FORA DO INTERVALO",5.8999999999999999E-3,1.23E-2,1.3899999999999999E-2]
["7) Seguros + Garantias",1,1.1999999999999999E-3,1.1999999999999999E-3,null,"FORA DO INTERVALO",8.0000000000000002E-3,8.0000000000000002E-3,0.01]
["8) Risco",1,9.7000000000000003E-3,9.7000000000000003E-3,null,"OK",9.7000000000000003E-3,1.2699999999999999E-2,1.2699999999999999E-2]
["9) Lucro",1,6.8709999999999993E-2,6.8709999999999993E-2,null,"OK",6.1600000000000002E-2,7.3999999999999996E-2,8.9599999999999999E-2]
["BDI - FINAL",null,null,0.26401425864398487,null,"FORA DO INTERVALO",0.2034,0.22120000000000001,0.25]
[]
["Notas:"]
["(1) e (2) Alíquota definida por lei."]
["(3) Alíquota e base de cálculo definidas pela legislação municipal."]
["(4) Alíquota definida pelas leis 12.546/11, 12844/13 e 13.161/15 (CPRB – contribuição previdenciária sobre a receita bruta)."]
["(5) Valores definidos a partir dos limites no Acórdão nº 2.622/2013 - TCU – Plenário. Valores entre o 1º e 3º quartis."]
["(6) Valor calculado pela expressão matemática do acórdão 2.369/2011 – TCU – Plenário e disponibilizado pela AGETOP em dezembro de 2018. (Foi utilizado para o cálculo a média da Taxa SELIC no período de 11/2017 a 10/2018)"]
[]
["(7) Valores definidos pela AGETOP a partir dos limites no Acórdão nº 2.622/2013 - TCU – Plenário. Valores médios. \n\nObservação da AGETOP: (Seguros contra erros de execução, incêndio e explosão, danos da natureza (vendaval, destelhamento, alagamento, inundação, desmoronamento, geadas etc.), emprego de material defeituoso ou inadequado, roubo e/ou furto qualificado, quebra de equipamentos, desmoronamento de estrutura, nas modalidades de Obras Civis em Construção (OCC); Instalação e Montagem (IM); e Obras Civis em Construção e Instalação e Montagem (OCC/IM). Bem como coberturas adicionais para ampliação dessas coberturas básicas, como: cobertura de responsabilidade civil geral, cobertura de responsabilidade civil cruzada, cobertura de despesas extraordinárias, cobertura de tumultos, cobertura de desentulho do local, cobertura de riscos do fabricante, dentre outras, incluindo o seguro de vida em grupo regido pela convenção coletiva dos trabalhadores na indústria da construção civil). A partir de 24/02/2015 por intermédio da Portaria 449/2015 a Presidência da AGETOP, na pessoa do Senhor Jayme Eduardo Rincon, determinou a exclusão dos valores referentes aos Seguros de Risco de Engenharia e Responsabilidade Civil do Profissional na composição do cálculo do B.D.I.."]
["(8) Valores definidos a partir dos limites no Acórdão nº 2.622/2013 - TCU – Plenário. Valores entre 1º e 3° quartis."]
["(9) Valores definidos a partir dos limites definidos no Acórdão nº 2.622/2013 - TCU – Plenário. Valores adotados e praticados no mercado ( “ ex ante ” ) ou aqueles entre os 1º e 3º quartis."]
[]
["(*) A fórmula para estipulação da taxa de BDI estimado adotado é a mesma que foi aplicada para a obtenção das tabelas contidas no Acórdão n. 2.622/2013 – TCUPlenário"]
[]
["Obs.: Para obras com valores superiores a R$ 20.000.000,00 sugere-se recalcular o BDI, dimensionando as taxas de administração central e lucro para patamares inferiores ao estipulado acima."]

{"sheet":"Relatório CENTRAL","index":5,"n_rows":40,"n_cols":5,"rows_kept":40,"cut":false,"hidden":false,"merged":[[10,1,10,4],[11,1,11,4],[39,1,39,2],[9,0,11,0],[0,1,0,4],[6,3,6,4],[9,3,9,4],[1,1,1,4],[2,1,2,2],[2,3,2,4],[3,1,3,2],[3,3,3,4],[4,1,4,4],[5,1,5,2],[5,3,5,4],[6,1,6,2],[7,1,7,4],[8,1,8,2],[8,3,8,4],[9,1,9,2]]}
[]
[]
[null,"UNIDADE ESCOLAR",null,"CIDADE"]
[null,{"$f":"Orçamento!$O$5","v":"COORDENAÇÃO REGIONAL DE EDUCAÇÃO DE JATAÍ"},null,{"$f":"Orçamento!$X$8","v":"JATAÍ"}]
[]
[null,"OBRA",null,"CRE"]
[null,{"$f":"Orçamento!$O$8","v":"REFORMA E AMPLIAÇÃO"},null,{"$f":"Orçamento!$O$11","v":"CRE-JATAI"}]
[]
[null,"ENDEREÇO",null,"DATA"]
["FILTRO",{"$f":"Orçamento!$R$11","v":"PRAÇA DOM GERMANO, 42 - CENTRO"},null,{"$f":"Orçamento!$S$8","v":"2020-05-19"}]
[]
[null,"RELATÓRIO CENTRAL"]
["↓","CÓDIGO","ETAPA","PREÇO  (R$) C/ BDI","PARTIC  ( % )"]
[{"$f":"IF(D14>0,\"F\",\"\")","v":""},{"$f":"Orçamento!O399","v":"a."},{"$f":"Orçamento!P399","v":"SERVIÇOS PRELIMINARES"},{"$f":"Orçamento!X399","v":0},{"$f":"Orçamento!AA399","v":0}]
[{"$f":"IF(D15>0,\"F\",\"\")","v":""},{"$f":"Orçamento!O400","v":"b."},{"$f":"Orçamento!P400","v":"TRANSPORTES"},{"$f":"Orçamento!X400","v":0},{"$f":"Orçamento!AA400","v":0}]
["",{"$f":"Orçamento!O401","v":"c."},{"$f":"Orçamento!P401","v":"SERVIÇO EM TERRA"},{"$f":"Orçamento!X401","v":0},{"$f":"Orçamento!AA401","v":0}]
["",{"$f":"Orçamento!O402","v":"d."},{"$f":"Orçamento!P402","v":"FUNDAÇÕES E SONDAGENS"},{"$f":"Orçamento!X402","v":0},{"$f":"Orçamento!AA402","v":0}]
["",{"$f":"Orçamento!O403","v":"e."},{"$f":"Orçamento!P403","v":"ESTRUTURA"},{"$f":"Orçamento!X403","v":0},{"$f":"Orçamento!AA403","v":0}]
["",{"$f":"Orçamento!O404","v":"f."},{"$f":"Orçamento!P404","v":"INSTALAÇÕES ELÉTRICAS"},{"$f":"Orçamento!X404","v":0},{"$f":"Orçamento!AA404","v":0}]
["",{"$f":"Orçamento!O405","v":"g."},{"$f":"Orçamento!P405","v":"INSTALAÇÕES HIDROSSANITÁRIAS"},{"$f":"Orçamento!X405","v":0},{"$f":"Orçamento!AA405","v":0}]
["",{"$f":"Orçamento!O406","v":"h"},{"$f":"Orçamento!P406","v":"INSTALAÇÕES ESPECIAIS"},{"$f":"Orçamento!X406","v":0},{"$f":"Orçamento!AA406","v":0}]
["",{"$f":"Orçamento!O407","v":"i."},{"$f":"Orçamento!P407","v":"ALVENARIAS E DIVISÓRIAS"},{"$f":"Orçamento!X407","v":0},{"$f":"Orçamento!AA407","v":0}]
["",{"$f":"Orçamento!O408","v":"j."},{"$f":"Orçamento!P408","v":"ALVENARIA AUTO-PORTANTE"},{"$f":"Orçamento!X408","v":0},{"$f":"Orçamento!AA408","v":0}]
["",{"$f":"Orçamento!O409","v":"k."},{"$f":"Orçamento!P409","v":"IMPERMEABILIZAÇÃO"},{"$f":"Orçamento!X409","v":0},{"$f":"Orçamento!AA409","v":0}]
["",{"$f":"Orçamento!O410","v":"l."},{"$f":"Orçamento!P410","v":"ISOLAMENTO TÉRMICO E ACÚSTICO"},{"$f":"Orçamento!X410","v":0},{"$f":"Orçamento!AA410","v":0}]
["",{"$f":"Orçamento!O411","v":"m."},{"$f":"Orçamento!P411","v":"ESTRUTURA DE MADEIRA"},{"$f":"Orçamento!X411","v":0},{"$f":"Orçamento!AA411","v":0}]
["",{"$f":"Orçamento!O412","v":"n."},{"$f":"Orçamento!P412","v":"ESTRUTURAS METÁLICAS"},{"$f":"Orçamento!X412","v":0},{"$f":"Orçamento!AA412","v":0}]
["",{"$f":"Orçamento!O413","v":"o."},{"$f":"Orçamento!P413","v":"COBERTURAS"},{"$f":"Orçamento!X413","v":0},{"$f":"Orçamento!AA413","v":0}]
["",{"$f":"Orçamento!O414","v":"p."},{"$f":"Orçamento!P414","v":"ESQUADRIAS DE MADEIRA"},{"$f":"Orçamento!X414","v":0},{"$f":"Orçamento!AA414","v":0}]
["",{"$f":"Orçamento!O415","v":"q."},{"$f":"Orçamento!P415","v":"ESQUADRIAS METÁLICAS"},{"$f":"Orçamento!X415","v":0},{"$f":"Orçamento!AA415","v":0}]
["",{"$f":"Orçamento!O416","v":"r."},{"$f":"Orçamento!P416","v":"VIDROS"},{"$f":"Orçamento!X416","v":0},{"$f":"Orçamento!AA416","v":0}]
["",{"$f":"Orçamento!O417","v":"s."},{"$f":"Orçamento!P417","v":"REVESTIMENTO DE PAREDE"},{"$f":"Orçamento!X417","v":0},{"$f":"Orçamento!AA417","v":0}]
["",{"$f":"Orçamento!O418","v":"t."},{"$f":"Orçamento!P418","v":"FORROS"},{"$f":"Orçamento!X418","v":0},{"$f":"Orçamento!AA418","v":0}]
["",{"$f":"Orçamento!O419","v":"u."},{"$f":"Orçamento!P419","v":"REVESTIMENTO DE PISO"},{"$f":"Orçamento!X419","v":0},{"$f":"Orçamento!AA419","v":0}]
["",{"$f":"Orçamento!O420","v":"v."},{"$f":"Orçamento!P420","v":"FERRAGENS"},{"$f":"Orçamento!X420","v":0},{"$f":"Orçamento!AA420","v":0}]
["",{"$f":"Orçamento!O421","v":"w."},{"$f":"Orçamento!P421","v":"MARCENARIA"},{"$f":"Orçamento!X421","v":0},{"$f":"Orçamento!AA421","v":0}]
["",{"$f":"Orçamento!O422","v":"x."},{"$f":"Orçamento!P422","v":"ADMINISTRAÇÃO"},{"$f":"Orçamento!X422","v":0},{"$f":"Orçamento!AA422","v":0}]
["",{"$f":"Orçamento!O423","v":"y."},{"$f":"Orçamento!P423","v":"PINTURA"},{"$f":"Orçamento!X423","v":0},{"$f":"Orçamento!AA423","v":0}]
["",{"$f":"Orçamento!O424","v":"z."},{"$f":"Orçamento!P424","v":"DIVERSOS"},{"$f":"Orçamento!X424","v":0},{"$f":"Orçamento!AA424","v":0}]
["F","TOTAL GERAL DO ORÇAMENTO (R$) C/BDI",null,{"$f":"SUM(D14:D39)","v":0},{"$f":"SUM(E14:E39)","v":0}]

{"sheet":"Parc Maior Relev","index":6,"n_rows":33,"n_cols":7,"rows_kept":33,"cut":false,"hidden":false,"merged":[[0,1,0,6],[11,1,11,6],[1,1,1,6],[2,1,2,3],[2,4,2,6],[3,1,3,3],[3,4,3,6],[4,1,4,6],[5,1,5,3],[5,4,5,6],[9,1,9,3],[9,4,9,6],[10,1,10,6],[6,1,6,3],[6,4,6,6],[7,1,7,6],[8,1,8,3],[8,4,8,6],[33,3,33,7],[31,1,31,6]]}
[]
[]
[null,"UNIDADE ESCOLAR",null,null,"CÓDIGO INEP"]
[null,{"$f":"Orçamento!$O$5","v":"COORDENAÇÃO REGIONAL DE EDUCAÇÃO DE JATAÍ"},null,null,{"$f":"Orçamento!$X$5","v":52052656}]
[]
[null,"OBRA",null,null,"CIDADE"]
[null,{"$f":"Orçamento!$O$8","v":"REFORMA E AMPLIAÇÃO"},null,null,{"$f":"Orçamento!$X$8","v":"JATAÍ"}]
[]
[null,"CRE",null,null,"ÁREA TOTAL CONSTRUÍDA (M²)"]
[null,{"$f":"Orçamento!$O$11","v":"CRE-JATAI"},null,null,{"$f":"Orçamento!$X$14","v":452.07}]
[]
["FILTRO","PARCELA DE MAIOR RELEVÂNCIA"]
[{"$f":"IF(G14>0,\"F\",\"\")","v":""},"CÓDIGO","SERVIÇO","DESCRIÇÃO","UNID","QUANT","PARC. MAIOR RELEV (100%)"]
[{"$f":"IF(G14>0,\"F\",\"\")","v":""},"f.","INSTALAÇÕES ELÉTRICAS","SUBESTAÇÃO","KVA",{"$f":"SUMIF(Orçamento!$R$21:$R$380,'Parc Maior Relev'!D14,Orçamento!$T$21:$T$380)","v":0},{"$f":"F14","v":0}]
[{"$f":"IF(SUM(G16:G30)>0,\"F\",\"\")","v":"F"},"CÓDIGO","SERVIÇO","DESCRIÇÃO","UNID","QUANT","PARC. MAIOR RELEV (50%)"]
[{"$f":"IF(G16>0,\"F\",\"\")","v":""},"e.","ESTRUTURA","CONCRETO","M3",{"$f":"SUMIF(Orçamento!$R$21:$R$380,'Parc Maior Relev'!D16,Orçamento!$T$21:$T$380)","v":0},{"$f":"F16*0.5","v":0}]
[{"$f":"IF(G17>0,\"F\",\"\")","v":""},"f.","INSTALAÇÕES ELÉTRICAS","INSTALAÇÕES ELÉTRICAS","KVA",{"$f":"SUMIF(Orçamento!$R$21:$R$380,'Parc Maior Relev'!D17,Orçamento!$T$21:$T$380)","v":0},{"$f":"F17*0.5","v":0}]
[{"$f":"IF(G18>0,\"F\",\"\")","v":"F"},"o.","COBERTURAS","TELHAMENTO COM TELHA METÁLICA","m²",282.99,141.495]
["","o.","COBERTURAS","TELHAMENTO COM TELHA METÁLICA","M2",{"$f":"SUMIF(Orçamento!$R$21:$R$380,'Parc Maior Relev'!D19,Orçamento!$T$21:$T$380)","v":0},0]
["","s.","REVESTIMENTO DE PAREDE","CHAPISCO","M2",{"$f":"SUMIF(Orçamento!$R$21:$R$380,'Parc Maior Relev'!D20,Orçamento!$T$21:$T$380)","v":0},0]
["","s.","REVESTIMENTO DE PAREDE","REBOCO","M2",{"$f":"SUMIF(Orçamento!$R$21:$R$380,'Parc Maior Relev'!D21,Orçamento!$T$21:$T$380)","v":0},0]
["","s.","REVESTIMENTO DE PAREDE","REVESTIMENTO CERÂMICO","M2",{"$f":"SUMIF(Orçamento!$R$21:$R$380,'Parc Maior Relev'!D22,Orçamento!$T$21:$T$380)","v":0},0]
["","t.","FORROS","FORRO DE GESSO","M2",{"$f":"SUMIF(Orçamento!$R$21:$R$380,'Parc Maior Relev'!D23,Orçamento!$T$21:$T$380)","v":0},0]
["","t.","FORROS","FORRO DE PVC","M2",{"$f":"SUMIF(Orçamento!$R$21:$R$380,'Parc Maior Relev'!D24,Orçamento!$T$21:$T$380)","v":0},0]
["","t.","FORROS","FORRO DE GESSO ACARTONADO","M2",{"$f":"SUMIF(Orçamento!$R$21:$R$380,'Parc Maior Relev'!D25,Orçamento!$T$21:$T$380)","v":0},0]
["","u.","REVESTIMENTO DE PISO","PISO DE GRANITINA","M2",{"$f":"SUMIF(Orçamento!$R$21:$R$380,'Parc Maior Relev'!D26,Orçamento!$T$21:$T$380)","v":0},0]
["","u.","REVESTIMENTO DE PISO","PISO LAMINADO","M2",{"$f":"SUMIF(Orçamento!$R$21:$R$380,'Parc Maior Relev'!D27,Orçamento!$T$21:$T$380)","v":0},0]
["","u.","REVESTIMENTO DE PISO","PISO DE CONCRETO DESEMPENADO","M2",{"$f":"SUMIF(Orçamento!$R$21:$R$380,'Parc Maior Relev'!D28,Orçamento!$T$21:$T$380)","v":0},0]
["","u.","REVESTIMENTO DE PISO","PISO CERÂMICO","M2",{"$f":"SUMIF(Orçamento!$R$21:$R$380,'Parc Maior Relev'!D29,Orçamento!$T$21:$T$380)","v":0},0]
["","y.","PINTURA","PINTURA","M2",{"$f":"SUMIF(Orçamento!$R$21:$R$380,'Parc Maior Relev'!D30,Orçamento!$T$21:$T$380)","v":0},0]
["F"]
["F","(*) Para os fins do inciso I dp § 1º do Art. 30 da Lei Federal 8.666/93, são consideradas parcelas de maior relevância técnica as execuções apresentadas"]
["F"]

{"sheet":"Composições","index":7,"n_rows":210,"n_cols":10,"rows_kept":210,"cut":false,"hidden":false,"merged":[[0,0,0,8],[10,0,10,2],[10,3,10,6],[11,0,11,9],[12,0,12,2],[12,3,12,6],[12,7,12,8],[7,0,7,6],[9,0,9,2],[9,3,9,6],[9,7,9,8],[3,0,3,6],[4,0,4,6],[15,0,15,9],[13,0,13,2],[13,3,13,6],[1,0,1,9],[3,7,3,9],[4,7,4,9],[6,7,6,9],[7,7,7,9],[6,0,6,6],[10,8,10,9],[13,8,13,9],[14,0,14,9],[8,0,8,9],[5,0,5,9],[2,0,2,9],[16,5,17,5],[16,6,16,7],[16,8,16,9],[21,1,21,7],[23,1,23,7],[16,0,17,0],[16,1,17,1],[16,2,17,2],[16,3,17,3],[16,4,17,4],[25,5,26,5],[25,6,25,7],[25,8,25,9],[29,1,29,7],[33,1,33,7],[25,0,26,0],[25,1,26,1],[25,2,26,2],[25,3,26,3],[25,4,26,4],[35,5,36,5],[35,6,35,7],[35,8,35,9],[39,1,39,7],[43,1,43,7],[35,0,36,0],[35,1,36,1],[35,2,36,2],[35,3,36,3],[35,4,36,4],[45,5,46,5],[45,6,45,7],[45,8,45,9],[49,1,49,7],[56,1,56,7],[45,0,46,0],[45,1,46,1],[45,2,46,2],[45,3,46,3],[45,4,46,4],[58,5,59,5],[58,6,58,7],[58,8,58,9],[62,1,62,7],[66,1,66,7],[58,0,59,0],[58,1,59,1],[58,2,59,2],[58,3,59,3],[58,4,59,4],[68,5,69,5],[68,6,68,7],[68,8,68,9],[72,1,72,7],[76,1,76,7],[68,0,69,0],[68,1,69,1],[68,2,69,2],[68,3,69,3],[68,4,69,4],[78,5,79,5],[78,6,78,7],[78,8,78,9],[83,1,83,7],[86,1,86,7],[78,0,79,0],[78,1,79,1],[78,2,79,2],[78,3,79,3],[78,4,79,4],[88,5,89,5],[88,6,88,7],[88,8,88,9],[93,1,93,7],[96,1,96,7],[88,0,89,0],[88,1,89,1],[88,2,89,2],[88,3,89,3],[88,4,89,4],[98,5,99,5],[98,6,98,7],[98,8,98,9],[103,1,103,7],[105,1,105,7],[98,0,99,0],[98,1,99,1],[98,2,99,2],[98,3,99,3],[98,4,99,4],[107,5,108,5],[107,6,107,7],[107,8,107,9],[112,1,112,7],[114,1,114,7],[107,0,108,0],[107,1,108,1],[107,2,108,2],[107,3,108,3],[107,4,108,4],[116,5,117,5],[116,6,116,7],[116,8,116,9],[121,1,121,7],[123,1,123,7],[116,0,117,0],[116,1,117,1],[116,2,117,2],[116,3,117,3],[116,4,117,4],[125,5,126,5],[125,6,125,7],[125,8,125,9],[130,1,130,7],[132,1,132,7],[125,0,126,0],[125,1,126,1],[125,2,126,2],[125,3,126,3],[125,4,126,4],[134,5,135,5],[134,6,134,7],[134,8,134,9],[139,1,139,7],[141,1,141,7],[134,0,135,0],[134,1,135,1],[134,2,135,2],[134,3,135,3],[134,4,135,4],[143,5,144,5],[143,6,143,7],[143,8,143,9],[148,1,148,7],[151,1,151,7],[143,0,144,0],[143,1,144,1],[143,2,144,2],[143,3,144,3],[143,4,144,4],[153,5,154,5],[153,6,153,7],[153,8,153,9],[158,1,158,7],[161,1,161,7],[153,0,154,0],[153,1,154,1],[153,2,154,2],[153,3,154,3],[153,4,154,4],[163,5,164,5],[163,6,163,7],[163,8,163,9],[167,1,167,7],[168,1,168,7],[163,0,164,0],[163,1,164,1],[163,2,164,2],[163,3,164,3],[163,4,164,4],[192,8,192,9],[170,5,171,5],[170,6,170,7],[170,8,170,9],[175,1,175,7],[170,0,171,0],[170,1,171,1],[170,2,171,2],[170,3,171,3],[170,4,171,4],[197,1,197,7],[209,1,209,7],[190,1,190,7],[192,0,193,0],[192,1,193,1],[192,2,193,2],[192,3,193,3],[192,4,193,4],[192,5,193,5],[192,6,192,7]]}
[]
[]
[]
["UNIDADE ESCOLAR",null,null,null,null,null,null,"CÓDIGO INEP"]
[{"$f":"Orçamento!$O$5","v":"COORDENAÇÃO REGIONAL DE EDUCAÇÃO DE JATAÍ"},null,null,null,null,null,null,{"$f":"Orçamento!$X$5","v":52052656}]
[]
["OBRA",null,null,null,null,null,null,"CIDADE"]
[{"$f":"Orçamento!$O$8","v":"REFORMA E AMPLIAÇÃO"},null,null,null,null,null,null,{"$f":"Orçamento!$X$8","v":"JATAÍ"}]
[]
["CRE",null,null,"ENDEREÇO",null,null,null,"REFERÊNCIA AGETOP"]
[{"$f":"Orçamento!$O$11","v":"CRE-JATAI"},null,null,{"$f":"Orçamento!$R$11","v":"PRAÇA DOM GERMANO, 42 - CENTRO"},null,null,null,{"$f":"Orçamento!$S$11","v":"ABR/19"},{"$f":"Orçamento!$T$11","v":"DESONERADA"}]
[]
["DATA",null,null,"ÁREA TOTAL CONSTRUÍDA (M²)",null,null,null,"REFERÊNCIA SINAPI"]
[{"$f":"Orçamento!$S$8","v":"2020-05-19"},null,null,{"$f":"Orçamento!$X$14","v":452.07},null,null,null,{"$f":"Orçamento!$X$11","v":"MAR/20"},{"$f":"Orçamento!$Y$11","v":"DESONERADA"}]
[]
["COMPOSIÇÕES DE CUSTOS UNITÁRIOS - SEE-GO"]
[387,"FONTE","CÓDIGO","DESCRIÇÃO","UNIDADE","COEFIC.","CUSTO UNITÁRIO",null,"CUSTO  TOTAL (A) + (B) + (C) + (D) + (E)"]
[null,null,null,null,null,null,"DESONERADO","NÃO DESONER.","DESONERADO","NÃO DESONER."]
[null,"COMPOSIÇÃO","COMP 387_SEE","LÂMPADA LED TUBULAR 18W ","UN ",null,null,null,22.3,22.35]
[null,"AGETOP_I",8,"AJUDANTE","h     ",1.4999999999999999E-2,8.75,10.14,0.13,0.15]
[null,"AGETOP_I",12,"ELETRICISTA","h     ",1.4999999999999999E-2,13.95,16.16,0.21,0.24]
[null,"MÃO DE OBRA (B) - TOTAL",null,null,null,null,null,null,0.33999999999999997,0.39]
[null,"COTAÇÃO","COT 195_SEE","LÂMPADA LED TUBULAR 18W ","UN",1,21.959999999999997,21.959999999999997,21.96,21.96]
[null,"MATERIAL (C) - TOTAL",null,null,null,null,null,null,21.96,21.96]
[]
[24,"FONTE","CÓDIGO","DESCRIÇÃO","UNIDADE","COEFIC.","CUSTO UNITÁRIO",null,"CUSTO  TOTAL (A) + (B) + (C) + (D) + (E)"]
[null,null,null,null,null,null,"DESONERADO","NÃO DESONER.","DESONERADO","NÃO DESONER."]
[null,"COMPOSIÇÃO","COMP 024_SEE","SINALIZADOR FOTOLUMINESCENTE PARA EXTINTOR","UN ",null,"-","-",25.319999999999997,25.439999999999998]
[null,"AGETOP_I",5,"SERVENTE","h     ",0.09,8.75,10.14,0.79,0.91]
[null,"MÃO DE OBRA (B) - TOTAL",null,null,null,null,null,null,0.79,0.91]
[null,"AGETOP_I",3070,"BUCHA DE NYLON S-6","un",2,0.04,0.04,0.08,0.08]
[null,"AGETOP_I",3393,"PARAFUSO P/BUCHA S-6","un",2,0.08,0.08,0.16,0.16]
[null,"SINAPI_I",37556,"PLACA DE SINALIZACAO DE SEGURANCA CONTRA INCENDIO, FOTOLUMINESCENTE, QUADRADA, *20 X 20* CM, EM PVC *2* MM ANTI-CHAMAS (SIMBOLOS, CORES E PICTOGRAMAS CONFORME NBR 13434)","UN    ",1,24.29,24.29,24.29,24.29]
[null,"MATERIAL (C) - TOTAL",null,null,null,null,null,null,24.529999999999998,24.529999999999998]
[]
[25,"FONTE","CÓDIGO","DESCRIÇÃO","UNIDADE","COEFIC.","CUSTO UNITÁRIO",null,"CUSTO  TOTAL (A) + (B) + (C) + (D) + (E)"]
[null,null,null,null,null,null,"DESONERADO","NÃO DESONER.","DESONERADO","NÃO DESONER."]
[null,"COMPOSIÇÃO","COMP 025_SEE","SINALIZADOR FOTOLUMINESCENTE DE EMERGÊNCIA","UN ",null,"-","-",25.319999999999997,25.439999999999998]
[null,"AGETOP_I",5,"SERVENTE","h     ",0.09,8.75,10.14,0.79,0.91]
[null,"MÃO DE OBRA (B) - TOTAL",null,null,null,null,null,null,0.79,0.91]
[null,"AGETOP_I",3070,"BUCHA DE NYLON S-6","un",2,0.04,0.04,0.08,0.08]
[null,"AGETOP_I",3393,"PARAFUSO P/BUCHA S-6","un",2,0.08,0.08,0.16,0.16]
[null,"SINAPI_I",37556,"PLACA DE SINALIZACAO DE SEGURANCA CONTRA INCENDIO, FOTOLUMINESCENTE, QUADRADA, *20 X 20* CM, EM PVC *2* MM ANTI-CHAMAS (SIMBOLOS, CORES E PICTOGRAMAS CONFORME NBR 13434)","UN    ",1,24.29,24.29,24.29,24.29]
[null,"MATERIAL (C) - TOTAL",null,null,null,null,null,null,24.529999999999998,24.529999999999998]
[]
[277,"FONTE","CÓDIGO","DESCRIÇÃO","UNIDADE","COEFIC.","CUSTO UNITÁRIO",null,"CUSTO  TOTAL (A) + (B) + (C) + (D) + (E)"]
[null,null,null,null,null,null,"DESONERADO","NÃO DESONER.","DESONERADO","NÃO DESONER."]
[null,"COMPOSIÇÃO","COMP 277_SEE","MARCAÇÃO NO PISO - 1X1 M PARA EXTINTOR","M2",null,null,null,29.67,29.75]
[null,"AGETOP_I",5,"SERVENTE","h     ",3.3300000000000003E-2,8.75,10.14,0.28999999999999998,0.34]
[null,"MÃO DE OBRA (B) - TOTAL",null,null,null,null,null,null,0.28999999999999998,0.34]
[null,"SINAPI_I",5318,"SOLVENTE DILUENTE A BASE DE AGUARRAS","L     ",0.13,11.78,11.78,1.53,1.53]
[null,"SINAPI",5824,"CAMINHÃO TOCO, PBT 16.000 KG, CARGA ÚTIL MÁX. 10.685 KG, DIST. ENTRE EIXOS 4,8 M, POTÊNCIA 189 CV, INCLUSIVE CARROCERIA FIXA ABERTA DE MADEIRA P/ TRANSPORTE GERAL DE CARGA SECA, DIMEN. APROX. 2,5 X 7,00 X 0,50 M - CHP DIURNO. AF_06/2014","CHP",3.3E-3,120.02,123.21,0.4,0.41]
[null,"SINAPI_I",7343,"TINTA A BASE DE RESINA ACRILICA, PARA SINALIZACAO HORIZONTAL VIARIA (NBR 11862)","L     ",0.6,12.82,12.82,7.69,7.69]
[null,"SINAPI_I",7348,"TINTA ACRILICA PREMIUM PARA PISO","L     ",0.03,13.72,13.72,0.41,0.41]
[null,"SINAPI_I",25972,"MICROESFERAS DE VIDRO PARA SINALIZACAO HORIZONTAL VIARIA, TIPO I-B (PREMIX) - NBR 16184","KG    ",2.14,8.8800000000000008,8.8800000000000008,19,19]
[null,"SINAPI",95133,"MÁQUINA DEMARCADORA DE FAIXA DE TRÁFEGO À FRIO, AUTOPROPELIDA, POTÊNCIA 38 HP - CHP DIURNO. AF_07/2016","CHP",3.3E-3,107.44,110.99,0.35,0.37]
[null,"MATERIAL (C) - TOTAL",null,null,null,null,null,null,29.380000000000003,29.41]
[]
[235,"FONTE","CÓDIGO","DESCRIÇÃO","UNIDADE","COEFIC.","CUSTO UNITÁRIO",null,"CUSTO  TOTAL (A) + (B) + (C) + (D) + (E)"]
[null,null,null,null,null,null,"DESONERADO","NÃO DESONER.","DESONERADO","NÃO DESONER."]
[null,"COMPOSIÇÃO","COMP 235_SEE","PLACA DE SINALIZAÇÃO EM PVC COD 01 - (300X300) PROIBIDO FUMAR","UN ",null,null,null,25.319999999999997,25.439999999999998]
[null,"AGETOP_I",5,"SERVENTE","h     ",0.09,8.75,10.14,0.79,0.91]
[null,"MÃO DE OBRA (B) - TOTAL",null,null,null,null,null,null,0.79,0.91]
[null,"AGETOP_I",3070,"BUCHA DE NYLON S-6","un",2,0.04,0.04,0.08,0.08]
[null,"AGETOP_I",3393,"PARAFUSO P/BUCHA S-6","un",2,0.08,0.08,0.16,0.16]
[null,"SINAPI_I",37556,"PLACA DE SINALIZACAO DE SEGURANCA CONTRA INCENDIO, FOTOLUMINESCENTE, QUADRADA, *20 X 20* CM, EM PVC *2* MM ANTI-CHAMAS (SIMBOLOS, CORES E PICTOGRAMAS CONFORME NBR 13434)","UN    ",1,24.29,24.29,24.29,24.29]
[null,"MATERIAL (C) - TOTAL",null,null,null,null,null,null,24.529999999999998,24.529999999999998]
[]
[236,"FONTE","CÓDIGO","DESCRIÇÃO","UNIDADE","COEFIC.","CUSTO UNITÁRIO",null,"CUSTO  TOTAL (A) + (B) + (C) + (D) + (E)"]
[null,null,null,null,null,null,"DESONERADO","NÃO DESONER.","DESONERADO","NÃO DESONER."]
[null,"COMPOSIÇÃO","COMP 236_SEE","PLACA DE SINALIZAÇÃO EM PVC COD 06 - (300X300) PERIGO INFLAMÁVEL","UN ",null,null,null,25.319999999999997,25.439999999999998]
[null,"AGETOP_I",5,"SERVENTE","h     ",0.09,8.75,10.14,0.79,0.91]
[null,"MÃO DE OBRA (B) - TOTAL",null,null,null,null,null,null,0.79,0.91]
[null,"AGETOP_I",3070,"BUCHA DE NYLON S-6","un",2,0.04,0.04,0.08,0.08]
[null,"AGETOP_I",3393,"PARAFUSO P/BUCHA S-6","un",2,0.08,0.08,0.16,0.16]
[null,"SINAPI_I",37556,"PLACA DE SINALIZACAO DE SEGURANCA CONTRA INCENDIO, FOTOLUMINESCENTE, QUADRADA, *20 X 20* CM, EM PVC *2* MM ANTI-CHAMAS (SIMBOLOS, CORES E PICTOGRAMAS CONFORME NBR 13434)","UN    ",1,24.29,24.29,24.29,24.29]
[null,"MATERIAL (C) - TOTAL",null,null,null,null,null,null,24.529999999999998,24.529999999999998]
[]
[382,"FONTE","CÓDIGO","DESCRIÇÃO","UNIDADE","COEFIC.","CUSTO UNITÁRIO",null,"CUSTO  TOTAL (A) + (B) + (C) + (D) + (E)"]
[null,null,null,null,null,null,"DESONERADO","NÃO DESONER.","DESONERADO","NÃO DESONER."]
[null,"COMPOSIÇÃO","COMP 382_SEE","TE DE REDUCAO DE FERRO GALVANIZADO, COM ROSCA BSP, DE 3/4\" X 1/2\"","UN ",null,null,null,24.25,26.43]
[null,"AGETOP_I",8,"AJUDANTE","h     ",0.6,8.75,10.14,5.25,6.08]
[null,"AGETOP_I",11,"ENCANADOR","h     ",0.61050000000000004,13.95,16.16,8.52,9.8699999999999992]
[null,"MÃO DE OBRA (B) - TOTAL",null,null,null,null,null,null,13.77,15.95]
[null,"SINAPI_I",3146,"FITA VEDA ROSCA EM ROLOS DE 18 MM X 10 M (L X C)","UN    ",0.12075471698113208,3.4,3.4,0.41,0.41]
[null,"SINAPI_I",6302,"TE DE REDUCAO DE FERRO GALVANIZADO, COM ROSCA BSP, DE 3/4\" X 1/2\"","UN    ",1,10.07,10.07,10.07,10.07]
[null,"MATERIAL (C) - TOTAL",null,null,null,null,null,null,10.48,10.48]
[]
[383,"FONTE","CÓDIGO","DESCRIÇÃO","UNIDADE","COEFIC.","CUSTO UNITÁRIO",null,"CUSTO  TOTAL (A) + (B) + (C) + (D) + (E)"]
[null,null,null,null,null,null,"DESONERADO","NÃO DESONER.","DESONERADO","NÃO DESONER."]
[null,"COMPOSIÇÃO","COMP 383_SEE","BUCHA DE REDUCAO DE FERRO GALVANIZADO, COM ROSCA BSP, DE 1/2\" X 1/4\"","UN ",null,null,null,7.68,8.26]
[null,"AGETOP_I",8,"AJUDANTE","h     ",0.16,8.75,10.14,1.4,1.62]
[null,"AGETOP_I",11,"ENCANADOR","h     ",0.16,13.95,16.16,2.23,2.59]
[null,"MÃO DE OBRA (B) - TOTAL",null,null,null,null,null,null,3.63,4.21]
[null,"AGETOP_I","H689","FITA VEDAROSCA 12 MM","m",1.2,0.28000000000000003,0.28000000000000003,0.34,0.34]
[null,"SINAPI_I",770,"BUCHA DE REDUCAO DE FERRO GALVANIZADO, COM ROSCA BSP, DE 1/2\" X 1/4\"","UN    ",1,3.71,3.71,3.71,3.71]
[null,"MATERIAL (C) - TOTAL",null,null,null,null,null,null,4.05,4.05]
[]
[212,"FONTE","CÓDIGO","DESCRIÇÃO","UNIDADE","COEFIC.","CUSTO UNITÁRIO",null,"CUSTO  TOTAL (A) + (B) + (C) + (D) + (E)"]
[null,null,null,null,null,null,"DESONERADO","NÃO DESONER.","DESONERADO","NÃO DESONER."]
[null,"COMPOSIÇÃO","COMP 212_SEE","NIPLE DE REDUÇÃO 1/2\" X 1/4\" BSP","UN ",null,null,null,9.68,10.26]
[null,"AGETOP_I",8,"AJUDANTE","h     ",0.16,8.75,10.14,1.4,1.62]
[null,"AGETOP_I",11,"ENCANADOR","h     ",0.16,13.95,16.16,2.23,2.59]
[null,"MÃO DE OBRA (B) - TOTAL",null,null,null,null,null,null,3.63,4.21]
[null,"COTAÇÃO","COT 103_SEE","NIPLE DE REDUÇÃO 1/2\" X 1/4\" BSP","UN",1,6.0533333333333337,6.0533333333333337,6.05,6.05]
[null,"MATERIAL (C) - TOTAL",null,null,null,null,null,null,6.05,6.05]
[]
[213,"FONTE","CÓDIGO","DESCRIÇÃO","UNIDADE","COEFIC.","CUSTO UNITÁRIO",null,"CUSTO  TOTAL (A) + (B) + (C) + (D) + (E)"]
[null,null,null,null,null,null,"DESONERADO","NÃO DESONER.","DESONERADO","NÃO DESONER."]
[null,"COMPOSIÇÃO","COMP 213_SEE","NIPLE DE REDUÇÃO 3/4\" X 1/2\" BSP","UN ",null,null,null,13.34,13.920000000000002]
[null,"AGETOP_I",8,"AJUDANTE","h     ",0.16,8.75,10.14,1.4,1.62]
[null,"AGETOP_I",11,"ENCANADOR","h     ",0.16,13.95,16.16,2.23,2.59]
[null,"MÃO DE OBRA (B) - TOTAL",null,null,null,null,null,null,3.63,4.21]
[null,"COTAÇÃO","COT 104_SEE","NIPLE DE REDUÇÃO 3/4\" X 1/2\" BSP","UN",1,9.7099999999999991,9.7099999999999991,9.7100000000000009,9.7100000000000009]
[null,"MATERIAL (C) - TOTAL",null,null,null,null,null,null,9.7100000000000009,9.7100000000000009]
[]
[237,"FONTE","CÓDIGO","DESCRIÇÃO","UNIDADE","COEFIC.","CUSTO UNITÁRIO",null,"CUSTO  TOTAL (A) + (B) + (C) + (D) + (E)"]
[null,null,null,null,null,null,"DESONERADO","NÃO DESONER.","DESONERADO","NÃO DESONER."]
[null,"COMPOSIÇÃO","COMP 237_SEE","FITA ANTICORROSIVA","M",null,null,null,11.16,11.879999999999999]
[null,"AGETOP_I",8,"AJUDANTE","h     ",0.2,8.75,10.14,1.75,2.0299999999999998]
[null,"AGETOP_I",12,"ELETRICISTA","h     ",0.2,13.95,16.16,2.79,3.23]
[null,"MÃO DE OBRA (B) - TOTAL",null,null,null,null,null,null,4.54,5.26]
[null,"SINAPI_I",39634,"FITA ADESIVA ANTICORROSIVA DE PVC FLEXIVEL, COR PRETA, PARA PROTECAO TUBULACAO, 50 MM X 30 M (L X C), E= *0,25* MM","M     ",1,6.62,6.62,6.62,6.62]
[null,"MATERIAL (C) - TOTAL",null,null,null,null,null,null,6.62,6.62]
[]
[542,"FONTE","CÓDIGO","DESCRIÇÃO","UNIDADE","COEFIC.","CUSTO UNITÁRIO",null,"CUSTO  TOTAL (A) + (B) + (C) + (D) + (E)"]
[null,null,null,null,null,null,"DESONERADO","NÃO DESONER.","DESONERADO","NÃO DESONER."]
[null,"COMPOSIÇÃO","COMP 542_SEE","VÁLVULA UGV 3/4\" (S) LATÃO","UN ",null,null,null,25.65,27.2]
[null,"AGETOP_I",8,"AJUDANTE","h     ",0.432,8.75,10.14,3.78,4.38]
[null,"AGETOP_I",11,"ENCANADOR","h     ",0.432,13.95,16.16,6.03,6.98]
[null,"MÃO DE OBRA (B) - TOTAL",null,null,null,null,null,null,9.81,11.36]
[null,"COTAÇÃO","COT 281_SEE","VÁLVULA UGV 3/4\" (S) LATÃO","UN ",1,15.836666666666666,15.836666666666666,15.84,15.84]
[null,"MATERIAL (C) - TOTAL",null,null,null,null,null,null,15.84,15.84]
[]
[543,"FONTE","CÓDIGO","DESCRIÇÃO","UNIDADE","COEFIC.","CUSTO UNITÁRIO",null,"CUSTO  TOTAL (A) + (B) + (C) + (D) + (E)"]
[null,null,null,null,null,null,"DESONERADO","NÃO DESONER.","DESONERADO","NÃO DESONER."]
[null,"COMPOSIÇÃO","COMP 543_SEE","VÁLVULA UGV 1/2\" (S) LATÃO","UN ",null,null,null,24.98,26.53]
[null,"AGETOP_I",8,"AJUDANTE","h     ",0.432,8.75,10.14,3.78,4.38]
[null,"AGETOP_I",11,"ENCANADOR","h     ",0.432,13.95,16.16,6.03,6.98]
[null,"MÃO DE OBRA (B) - TOTAL",null,null,null,null,null,null,9.81,11.36]
[null,"COTAÇÃO","COT 282_SEE","VÁLVULA UGV 1/2\" (S) LATÃO","UN ",1,15.166666666666666,15.166666666666666,15.17,15.17]
[null,"MATERIAL (C) - TOTAL",null,null,null,null,null,null,15.17,15.17]
[]
[211,"FONTE","CÓDIGO","DESCRIÇÃO","UNIDADE","COEFIC.","CUSTO UNITÁRIO",null,"CUSTO  TOTAL (A) + (B) + (C) + (D) + (E)"]
[null,null,null,null,null,null,"DESONERADO","NÃO DESONER.","DESONERADO","NÃO DESONER."]
[null,"COMPOSIÇÃO","COMP 211_SEE","REGULADOR DE 2º ESTÁGIO 5KG/H","UN ",null,null,null,86.72,90.86]
[null,"AGETOP_I",8,"AJUDANTE","h     ",1.1499999999999999,8.75,10.14,10.06,11.66]
[null,"AGETOP_I",11,"ENCANADOR","h     ",1.1499999999999999,13.95,16.16,16.04,18.579999999999998]
[null,"MÃO DE OBRA (B) - TOTAL",null,null,null,null,null,null,26.1,30.24]
[null,"COTAÇÃO","COT 102_SEE","REGULADOR DE 2º ESTÁGIO 5KG/H","UN",1,59.833333333333336,59.833333333333336,59.83,59.83]
[null,"AGETOP_I","H689","FITA VEDAROSCA 12 MM","m",2.82,0.28000000000000003,0.28000000000000003,0.79,0.79]
[null,"MATERIAL (C) - TOTAL",null,null,null,null,null,null,60.62,60.62]
[]
[210,"FONTE","CÓDIGO","DESCRIÇÃO","UNIDADE","COEFIC.","CUSTO UNITÁRIO",null,"CUSTO  TOTAL (A) + (B) + (C) + (D) + (E)"]
[null,null,null,null,null,null,"DESONERADO","NÃO DESONER.","DESONERADO","NÃO DESONER."]
[null,"COMPOSIÇÃO","COMP 210_SEE","REGULADOR DE 1º ESTÁGIO 60KG/H MODELO AP-40  COM MANÔMETRO","UN ",null,null,null,232.47,236.61]
[null,"AGETOP_I",8,"AJUDANTE","h     ",1.1499999999999999,8.75,10.14,10.06,11.66]
[null,"AGETOP_I",11,"ENCANADOR","h     ",1.1499999999999999,13.95,16.16,16.04,18.579999999999998]
[null,"MÃO DE OBRA (B) - TOTAL",null,null,null,null,null,null,26.1,30.24]
[null,"COTAÇÃO","COT 101_SEE","REGULADOR DE 1º ESTÁGIO 60KG/H MODELO AP-40  COM MANÔMETRO","UN",1,205.57666666666668,205.57666666666668,205.58,205.58]
[null,"AGETOP_I","H689","FITA VEDAROSCA 12 MM","m",2.82,0.28000000000000003,0.28000000000000003,0.79,0.79]
[null,"MATERIAL (C) - TOTAL",null,null,null,null,null,null,206.37,206.37]
[]
[45,"FONTE","CÓDIGO","DESCRIÇÃO","UNIDADE","COEFIC.","CUSTO UNITÁRIO",null,"CUSTO  TOTAL (A) + (B) + (C) + (D) + (E)"]
[null,null,null,null,null,null,"DESONERADO","NÃO DESONER.","DESONERADO","NÃO DESONER."]
[null,"COMPOSIÇÃO","COMP 045_SEE","LAUDO DE ESTANQUEIDADE","UN ",null,null,null,936,1085.1199999999999]
[null,"AGETOP",250101,"ENGENHEIRO - (OBRAS CIVIS)","H     ",16,58.5,67.819999999999993,936,1085.1199999999999]
[null,"MÃO DE OBRA (B) - TOTAL",null,null,null,null,null,null,936,1085.1199999999999]
[null,"MATERIAL (C) - TOTAL",null,null,null,null,null,null,0,0]
[]
[84,"FONTE","CÓDIGO","DESCRIÇÃO","UNIDADE","COEFIC.","CUSTO UNITÁRIO",null,"CUSTO  TOTAL (A) + (B) + (C) + (D) + (E)"]
[null,null,null,null,null,null,"DESONERADO","NÃO DESONER.","DESONERADO","NÃO DESONER."]
[null,"COMPOSIÇÃO","COMP 084_SEE","GUARDA-CORPO COM CORRIMÃO - SEDUC","M",null,null,null,206.14000000000001,211.22000000000003]
[null,"AGETOP_I",25,"OFICIAL \"B\"","h     ",1.1000000000000001,13.95,16.16,15.35,17.78]
[null,"AGETOP_I",8,"AJUDANTE","h     ",1.1000000000000001,8.75,10.14,9.6300000000000008,11.15]
[null,"MÃO DE OBRA (B) - TOTAL",null,null,null,null,null,null,24.98,28.93]
[null,"AGETOP_I",2376,"TUBO INDUSTRIAL 2\" CHAPA 13 ","Kg",7.7778,5.23,5.23,40.68,40.68]
[null,"AGETOP_I",2504,"TUBO INDUSTRIAL D=25 MM CHAPA 13 ","Kg",4.6319999999999997,5.07,5.07,23.48,23.48]
[null,"AGETOP_I",2377,"TUBO INDUSTRIAL 40X40 CH.13","Kg",6.3419999999999996,5.07,5.07,32.15,32.15]
[null,"AGETOP_I",2421,"TUBO INDUSTRIAL 1.1/2\" CHAPA 13 ","Kg",1.4862,5.07,5.07,7.54,7.54]
[null,"AGETOP_I",2417,"MASSA PLASTICA","Kg",0.2041,10.58,10.58,2.16,2.16]
[null,"AGETOP_I",2246,"ELETRODO 2.5 OK","Kg",0.11459999999999999,8.6999999999999993,8.6999999999999993,1,1]
[null,"AGETOP_I",1672,"LIXA PARA FERRO ( NÚMERO 100 )","un",0.25509999999999999,2.12,2.12,0.54,0.54]
[null,"AGETOP_I",1264,"DISCO DE DESBASTE 7/8\" P/ CONC./FERRO (1/4\" X 7\")","un",5.0999999999999997E-2,7,7,0.36,0.36]
[null,"AGETOP_I",1334,"DISCO DE CORTE DIAM. 5/8\"- 10\"","un",0.373,5.5,5.5,2.0499999999999998,2.0499999999999998]
[null,"AGETOP_I",2902,"FABRICAÇÃO / MONTAGEM","un",1,50.44,50.44,50.44,50.44]
[null,"AGETOP_I",2150,"CHAPA DE FERRO DOBRADA No.13","Kg",0.43519999999999998,5.28,5.28,2.2999999999999998,2.2999999999999998]
[null,"AGETOP_I",2719,"CHAPA PERFILADA 3/16\"","Kg",1.0979999999999999,5.04,5.04,5.53,5.53]
[null,"AGETOP_I",2436,"ACO CA-25 - 6,3 MM (1/4\") - BARRA LISA A-36","Kg",0.38124999999999998,5.13,5.13,1.96,1.96]
[null,"AGETOP",261602,"PINT.ESMALTE/ESQUAD.FERRO C/FUNDO ANTICOR.","m2    ",0.78,14.07,15.51,10.97,12.1]
[null,"MATERIAL (C) - TOTAL",null,null,null,null,null,null,181.16000000000003,182.29000000000002]
[]
[82,"FONTE","CÓDIGO","DESCRIÇÃO","UNIDADE","COEFIC.","CUSTO UNITÁRIO",null,"CUSTO  TOTAL (A) + (B) + (C) + (D) + (E)"]
[null,null,null,null,null,null,"DESONERADO","NÃO DESONER.","DESONERADO","NÃO DESONER."]
[null,"COMPOSIÇÃO","COMP 082_SEE","CORRIMÃO PAREDE - SEDUC","M",null,null,null,121.38,125.41]
[null,"AGETOP_I",25,"OFICIAL \"B\"","h     ",1,13.95,16.16,13.95,16.16]
[null,"AGETOP_I",8,"AJUDANTE","h     ",1,8.75,10.14,8.75,10.14]
[null,"MÃO DE OBRA (B) - TOTAL",null,null,null,null,null,null,22.7,26.3]
[null,"AGETOP_I",2376,"TUBO INDUSTRIAL 2\" CHAPA 13 ","Kg",5.5247999999999999,5.23,5.23,28.89,28.89]
[null,"AGETOP_I",2504,"TUBO INDUSTRIAL D=25 MM CHAPA 13 ","Kg",1.1000000000000001,5.07,5.07,5.58,5.58]
[null,"AGETOP_I",2417,"MASSA PLASTICA","Kg",0.2041,10.58,10.58,2.16,2.16]
[null,"AGETOP_I",2246,"ELETRODO 2.5 OK","Kg",0.11459999999999999,8.6999999999999993,8.6999999999999993,1,1]
[null,"AGETOP_I",1672,"LIXA PARA FERRO ( NÚMERO 100 )","un",0.125,2.12,2.12,0.27,0.27]
[null,"AGETOP_I",1264,"DISCO DE DESBASTE 7/8\" P/ CONC./FERRO (1/4\" X 7\")","un",2.5000000000000001E-2,7,7,0.18,0.18]
[null,"AGETOP_I",1334,"DISCO DE CORTE DIAM. 5/8\"- 10\"","un",0.1865,5.5,5.5,1.03,1.03]
[null,"AGETOP_I",2902,"FABRICAÇÃO / MONTAGEM","un",1,50.44,50.44,50.44,50.44]
[null,"AGETOP_I",2719,"CHAPA PERFILADA 3/16\"","Kg",0.72,5.04,5.04,3.63,3.63]
[null,"AGETOP_I",2436,"ACO CA-25 - 6,3 MM (1/4\") - BARRA LISA A-36","Kg",0.25,5.13,5.13,1.28,1.28]
[null,"AGETOP",261602,"PINT.ESMALTE/ESQUAD.FERRO C/FUNDO ANTICOR.","m2    ",0.3,14.07,15.51,4.22,4.6500000000000004]
[null,"MATERIAL (C) - TOTAL",null,null,null,null,null,null,98.679999999999993,99.11]