{"text_format":"1","workbook":"xlsx","n_sheets":8,"sheets":["Orçamento","Resumo ","Somatório","Cronog_90_Dias","Composição BDI","Relatório CENTRAL","Parc Maior Relev","Composições"],"not_rendered":{"charts":0,"images":5,"macros":1,"external_links":2,"defined_names":151,"comments":2,"pivot_tables":0},"unopened":[],"bounds":{"document_bytes":16777216,"sheet_cells":100000,"rows_first":2000,"rows_last":500,"rows_between":2000,"halvings":0,"cell_chars":16384,"cell_head_chars":4096},"cells_cut":0,"cells_raw":0,"read":"whole","date_system":"1900"}

{"sheet":"Orçamento","index":0,"n_rows":329,"n_cols":24,"rows_kept":329,"cut":false,"hidden":false,"merged":[[264,16,264,22],[8,12,9,12],[299,18,299,20],[299,21,299,22],[0,14,0,22],[8,14,8,16],[9,14,9,16],[11,14,11,16],[12,14,12,16],[14,14,14,22],[1,14,1,22],[4,14,4,22],[7,14,7,22],[283,18,283,20],[283,21,283,22],[291,21,291,22],[280,15,280,17],[281,15,281,17],[282,15,282,17],[284,21,284,22],[292,18,292,20],[292,21,292,22],[290,18,290,20],[290,21,290,22],[298,18,298,20],[298,21,298,22],[285,18,285,20],[285,21,285,22],[278,18,278,20],[278,21,278,22],[300,18,300,20],[300,21,300,22],[254,20,254,21],[276,18,276,20],[276,21,276,22],[277,18,277,20],[277,21,277,22],[275,18,275,20],[275,21,275,22],[284,18,284,20],[255,20,255,21],[266,18,266,22],[272,18,272,20],[272,21,272,22],[273,18,273,20],[273,21,273,22],[274,18,274,20],[274,21,274,22],[297,18,297,20],[297,21,297,22],[294,21,294,22],[295,18,295,20],[295,21,295,22],[296,18,296,20],[296,21,296,22],[286,18,286,20],[286,21,286,22],[293,18,293,20],[293,21,293,22],[288,21,288,22],[289,18,289,20],[289,21,289,22],[291,18,291,20],[287,18,287,20],[287,21,287,22],[288,18,288,20],[292,15,292,17],[293,15,293,17],[294,15,294,17],[295,15,295,17],[296,15,296,17],[269,14,269,23],[258,20,258,21],[257,20,257,21],[253,17,258,17],[253,20,253,21],[270,18,270,20],[270,21,270,22],[271,18,271,20],[271,21,271,22],[259,20,259,21],[279,18,279,20],[279,21,279,22],[280,18,280,20],[280,21,280,22],[281,18,281,20],[281,21,281,22],[282,18,282,20],[282,21,282,22],[294,18,294,20],[271,15,271,17],[272,15,272,17],[273,15,273,17],[274,15,274,17],[275,15,275,17],[276,15,276,17],[277,15,277,17],[278,15,278,17],[279,15,279,17],[283,15,283,17],[284,15,284,17],[285,15,285,17],[286,15,286,17],[287,15,287,17],[288,15,288,17],[289,15,289,17],[290,15,290,17],[291,15,291,17],[261,16,261,22],[262,16,262,22],[263,16,263,22],[3,21,3,22],[2,21,2,22],[5,21,5,22],[10,14,10,23],[13,14,13,23],[6,21,6,22],[2,14,2,20],[3,14,3,20],[5,18,5,20],[6,18,6,20],[6,14,6,17],[5,14,5,17],[12,21,12,22],[12,18,12,20],[8,18,8,20],[8,21,8,22],[9,19,9,20],[303,14,303,23],[304,18,304,20],[304,21,304,22],[305,15,305,17],[305,18,305,20],[305,21,305,22],[306,15,306,17],[306,18,306,20],[306,21,306,22],[310,15,310,17],[308,18,308,20],[308,21,308,22],[328,18,328,20],[328,21,328,22],[325,14,325,17],[322,15,322,17],[322,18,322,20],[322,21,322,22],[323,15,323,17],[323,18,323,20],[323,21,323,22],[324,15,324,17],[324,18,324,20],[324,21,324,22],[327,18,327,20],[327,21,327,22],[326,18,326,20],[326,21,326,22],[307,18,307,20],[307,21,307,22],[308,15,308,17],[297,14,297,17],[304,15,304,17],[270,15,270,17],[325,18,325,20],[325,21,325,22],[313,15,313,17],[313,18,313,20],[313,21,313,22],[314,15,314,17],[314,18,314,20],[314,21,314,22],[315,15,315,17],[315,18,315,20],[315,21,315,22],[319,15,319,17],[319,18,319,20],[319,21,319,22],[320,15,320,17],[320,18,320,20],[320,21,320,22],[321,15,321,17],[309,15,309,17],[309,18,309,20],[309,21,309,22],[265,16,265,22],[321,18,321,20],[321,21,321,22],[316,15,316,17],[316,18,316,20],[316,21,316,22],[317,15,317,17],[317,18,317,20],[317,21,317,22],[318,15,318,17],[318,18,318,20],[318,21,318,22],[310,18,310,20],[310,21,310,22],[311,15,311,17],[311,18,311,20],[311,21,311,22],[312,15,312,17],[312,18,312,20],[312,21,312,22],[307,15,307,17]]}
[]
[]
[null,null,null,null,null,null,null,null,null,null,null,null,null,null,"UNIDADE ESCOLAR",null,null,null,null,null,null,"CÓDIGO INEP"]
[null,null,null,null,null,null,null,null,null,null,null,null,null,null,"COLÉGIO ESTADUAL ANA ALGEMIRA DO PRADO",null,null,null,null,null,null,52053970]
[]
["Nmax",null,null,null,null,null,null,null,null,null,null,null,null,null,"OBRA",null,null,null,"DATA",null,null,"CIDADE"]
[{"$f":"MAX($C$18:$C$253)","v":4},null,null,null,null,null,null,null,null,null,null,null,null,null,"REFORMA E AMPLIAÇÃO",null,null,null,"2020-05-07",null,null,"PALESTINA DE GOIÁS"]
[]
[null,null,null,null,null,null,null,null,null,null,null,null,"",null,"CRE",null,null,"ENDEREÇO","REFERÊNCIA AGETOP",null,null,"REFERÊNCIA SINAPI"]
[null,null,null,null,null,null,null,null,null,null,null,null,null,null,"IPORÁ",null,null,"AV RUI BARBOSA S/N QUADRA 21, CENTRO, CEP:75845-000","ABR/19","ONERADA",null,"MAR/20","ONERADA"]
[]
[null,null,null,null,null,null,null,null,null,null,null,null,null,null,"ÁREA EXISTENTE (M²)",null,null,"ÁREA A CONSTRUIR (M²)","ÁREA A DEMOLIR (M²)",null,null,"ÁREA TOTAL CONSTRUÍDA (M²)"]
[null,null,null,null,null,null,null,null,null,null,null,null,null,null,1265.26,null,null,32.200000000000003,0,null,null,1297.46]
[]
[null,null,null,null,null,null,null,null,null,null,null,"FILTRO",null,null,"PLANILHA ORÇAMENTÁRIA"]
["Nível E","Save Nivel","Nível C","Altura","n1","n2","n3","n4","n5","Czero","Cnível","↓","Nível","Nível Corrigido","ITEM","TABELA","CODIGO","DESCRIÇÃO DOS SERVIÇOS","UNID","QUANT","MAT","MO","T.SERVIÇO","OBSERVAÇÕES¹"]
[{"$f":"CHOOSE(1+LOG(1+2*(ORÇAMENTO.Nivel=\"Nível 1\")+4*(ORÇAMENTO.Nivel=\"Nível 2\")+8*(ORÇAMENTO.Nivel=\"Nível 3\")+16*(ORÇAMENTO.Nivel=\"Nível 4\")+32*(ORÇAMENTO.Nivel=\"Serviço\"),2),0,1,2,3,4,\"S\")","v":"S"},{"$f":"IF(OR(C17=\"s\",C17=0),OFFSET(B17,-1,0),C17)","v":"Save Nivel"},{"$f":"IF(OFFSET(C17,-1,0)=\"L\",1,IF(OFFSET(C17,-1,0)=1,2,IF(OR(A17=\"s\",A17=0),\"S\",IF(AND(OFFSET(C17,-1,0)=2,A17=4),3,IF(AND(OR(OFFSET(C17,-1,0)=\"s\",OFFSET(C17,-1,0)=0),A17<>\"s\",A17>OFFSET(B17,-1,0)),OFFSET(B17,-1,0),A17)))))","v":"S"},{"$f":"IF(OR(C17=\"S\",C17=0),0,IF(ISERROR(K17),J17,SMALL(J17:K17,1)))","v":0},{"$f":"IF($C17=1,OFFSET(E17,-1,0)+1,OFFSET(E17,-1,0))","v":"n1"},{"$f":"IF($C17=1,0,IF($C17=2,OFFSET(F17,-1,0)+1,OFFSET(F17,-1,0)))","v":"n2"},{"$f":"IF(AND($C17<=2,$C17<>0),0,IF($C17=3,OFFSET(G17,-1,0)+1,OFFSET(G17,-1,0)))","v":"n3"},{"$f":"IF(AND($C17<=3,$C17<>0),0,IF($C17=4,OFFSET(H17,-1,0)+1,OFFSET(H17,-1,0)))","v":"n4"},{"$f":"IF(AND($C17<=4,$C17<>0),0,IF(AND($C17=\"S\",$W17>0),OFFSET(I17,-1,0)+1,OFFSET(I17,-1,0)))","v":"n5"},{"$f":"IF(OR($C17=\"S\",$C17=0),0,MATCH(0,OFFSET($D17,1,$C17,ROW($C$253)-ROW($C17)),0))","v":0},{"$f":"IF(OR($C17=\"S\",$C17=0),0,MATCH(OFFSET($D17,0,$C17)+1,OFFSET($D17,1,$C17,ROW($C$253)-ROW($C17)),0))","v":0},"","Serviço","Serviço","-","SINAPI",null,"(sem código)","-",null,0,0,0,""]
[0,null,"L",{"$f":"COUNTA(OFFSET(D18,1,0):D$253)","v":234},{"$f":"LEFT(O19,1)-1","v":0},null,null,null,null,null,null,"F","LOTE","LOTE","REFORMA E AMPLIAÇÃO - COLÉGIO ESTADUAL ANA ALGEMIRA DO PRADO",null,null,null,null,null,null,null,273950.11000000004]
[{"$f":"CHOOSE(1+LOG(1+2*(ORÇAMENTO.Nivel=\"Nível 1\")+4*(ORÇAMENTO.Nivel=\"Nível 2\")+8*(ORÇAMENTO.Nivel=\"Nível 3\")+16*(ORÇAMENTO.Nivel=\"Nível 4\")+32*(ORÇAMENTO.Nivel=\"Serviço\"),2),0,1,2,3,4,\"S\")","v":1},{"$f":"IF(OR(C19=\"s\",C19=0),OFFSET(B19,-1,0),C19)","v":1},{"$f":"IF(OFFSET(C19,-1,0)=\"L\",1,IF(OFFSET(C19,-1,0)=1,2,IF(OR(A19=\"s\",A19=0),\"S\",IF(AND(OFFSET(C19,-1,0)=2,A19=4),3,IF(AND(OR(OFFSET(C19,-1,0)=\"s\",OFFSET(C19,-1,0)=0),A19<>\"s\",A19>OFFSET(B19,-1,0)),OFFSET(B19,-1,0),A19)))))","v":1},{"$f":"IF(OR(C19=\"S\",C19=0),0,IF(ISERROR(K19),J19,SMALL(J19:K19,1)))","v":209},{"$f":"IF($C19=1,OFFSET(E19,-1,0)+1,OFFSET(E19,-1,0))","v":1},{"$f":"IF($C19=1,0,IF($C19=2,OFFSET(F19,-1,0)+1,OFFSET(F19,-1,0)))","v":0},{"$f":"IF(AND($C19<=2,$C19<>0),0,IF($C19=3,OFFSET(G19,-1,0)+1,OFFSET(G19,-1,0)))","v":0},{"$f":"IF(AND($C19<=3,$C19<>0),0,IF($C19=4,OFFSET(H19,-1,0)+1,OFFSET(H19,-1,0)))","v":0},{"$f":"IF(AND($C19<=4,$C19<>0),0,IF(AND($C19=\"S\",$W19>0),OFFSET(I19,-1,0)+1,OFFSET(I19,-1,0)))","v":0},{"$f":"IF(OR($C19=\"S\",$C19=0),0,MATCH(0,OFFSET($D19,1,$C19,ROW($C$253)-ROW($C19)),0))","v":234},{"$f":"IF(OR($C19=\"S\",$C19=0),0,MATCH(OFFSET($D19,0,$C19)+1,OFFSET($D19,1,$C19,ROW($C$253)-ROW($C19)),0))","v":209},"F","Nível 1","Nível 1","1.","AGETOP",null,"REFORMA"]
[2,{"$f":"IF(OR(C20=\"s\",C20=0),OFFSET(B20,-1,0),C20)","v":2},{"$f":"IF(OFFSET(C20,-1,0)=\"L\",1,IF(OFFSET(C20,-1,0)=1,2,IF(OR(A20=\"s\",A20=0),\"S\",IF(AND(OFFSET(C20,-1,0)=2,A20=4),3,IF(AND(OR(OFFSET(C20,-1,0)=\"s\",OFFSET(C20,-1,0)=0),A20<>\"s\",A20>OFFSET(B20,-1,0)),OFFSET(B20,-1,0),A20)))))","v":2},{"$f":"IF(OR(C20=\"S\",C20=0),0,IF(ISERROR(K20),J20,SMALL(J20:K20,1)))","v":20},{"$f":"IF($C20=1,OFFSET(E20,-1,0)+1,OFFSET(E20,-1,0))","v":1},{"$f":"IF($C20=1,0,IF($C20=2,OFFSET(F20,-1,0)+1,OFFSET(F20,-1,0)))","v":1},{"$f":"IF(AND($C20<=2,$C20<>0),0,IF($C20=3,OFFSET(G20,-1,0)+1,OFFSET(G20,-1,0)))","v":0},{"$f":"IF(AND($C20<=3,$C20<>0),0,IF($C20=4,OFFSET(H20,-1,0)+1,OFFSET(H20,-1,0)))","v":0},{"$f":"IF(AND($C20<=4,$C20<>0),0,IF(AND($C20=\"S\",$W20>0),OFFSET(I20,-1,0)+1,OFFSET(I20,-1,0)))","v":0},208,20,"F","Nível 2","Nível 2","1.1.","AGETOP",null,"SERVIÇOS PRELIMINARES"]
[3,{"$f":"IF(OR(C21=\"s\",C21=0),OFFSET(B21,-1,0),C21)","v":3},{"$f":"IF(OFFSET(C21,-1,0)=\"L\",1,IF(OFFSET(C21,-1,0)=1,2,IF(OR(A21=\"s\",A21=0),\"S\",IF(AND(OFFSET(C21,-1,0)=2,A21=4),3,IF(AND(OR(OFFSET(C21,-1,0)=\"s\",OFFSET(C21,-1,0)=0),A21<>\"s\",A21>OFFSET(B21,-1,0)),OFFSET(B21,-1,0),A21)))))","v":3},{"$f":"IF(OR(C21=\"S\",C21=0),0,IF(ISERROR(K21),J21,SMALL(J21:K21,1)))","v":2},{"$f":"IF($C21=1,OFFSET(E21,-1,0)+1,OFFSET(E21,-1,0))","v":1},{"$f":"IF($C21=1,0,IF($C21=2,OFFSET(F21,-1,0)+1,OFFSET(F21,-1,0)))","v":1},{"$f":"IF(AND($C21<=2,$C21<>0),0,IF($C21=3,OFFSET(G21,-1,0)+1,OFFSET(G21,-1,0)))","v":1},{"$f":"IF(AND($C21<=3,$C21<>0),0,IF($C21=4,OFFSET(H21,-1,0)+1,OFFSET(H21,-1,0)))","v":0},{"$f":"IF(AND($C21<=4,$C21<>0),0,IF(AND($C21=\"S\",$W21>0),OFFSET(I21,-1,0)+1,OFFSET(I21,-1,0)))","v":0},19,2,"F","Nível 3","Nível 3","1.1.1.","SINAPI",null,"ACESSIBILIDADE","-",null,null,null,null,""]
["S",3,"S",0,1,1,1,0,0,0,0,"F","Serviço","Serviço","1.1.1.0.1.","AGETOP",67010,"ESCARIFICAÇÃO MANUAL, CORTE DE CONCRETO ATÉ 3CM DE PROFUNDIDADE","m3    ",0.47,null,null,null,""]
[3,3,3,5,1,1,2,0,0,17,5,"F","Nível 3","Nível 3","1.1.2.","AGETOP",null,"BLOCO 01","-",null,null,null,null,""]
["S",3,"S",0,1,1,2,0,0,0,0,"F","Serviço","Serviço","1.1.2.0.1.","AGETOP",20101,"DEMOLICAO COBERTURA TELHA CERAMICA C/ TRANSP. ATÉ CB. E CARGA","m2    ",304.2,null,null,null,""]
[{"$f":"CHOOSE(1+LOG(1+2*(ORÇAMENTO.Nivel=\"Nível 1\")+4*(ORÇAMENTO.Nivel=\"Nível 2\")+8*(ORÇAMENTO.Nivel=\"Nível 3\")+16*(ORÇAMENTO.Nivel=\"Nível 4\")+32*(ORÇAMENTO.Nivel=\"Serviço\"),2),0,1,2,3,4,\"S\")","v":"S"},{"$f":"IF(OR(C25=\"s\",C25=0),OFFSET(B25,-1,0),C25)","v":3},{"$f":"IF(OFFSET(C25,-1,0)=\"L\",1,IF(OFFSET(C25,-1,0)=1,2,IF(OR(A25=\"s\",A25=0),\"S\",IF(AND(OFFSET(C25,-1,0)=2,A25=4),3,IF(AND(OR(OFFSET(C25,-1,0)=\"s\",OFFSET(C25,-1,0)=0),A25<>\"s\",A25>OFFSET(B25,-1,0)),OFFSET(B25,-1,0),A25)))))","v":"S"},{"$f":"IF(OR(C25=\"S\",C25=0),0,IF(ISERROR(K25),J25,SMALL(J25:K25,1)))","v":0},{"$f":"IF($C25=1,OFFSET(E25,-1,0)+1,OFFSET(E25,-1,0))","v":1},{"$f":"IF($C25=1,0,IF($C25=2,OFFSET(F25,-1,0)+1,OFFSET(F25,-1,0)))","v":1},{"$f":"IF(AND($C25<=2,$C25<>0),0,IF($C25=3,OFFSET(G25,-1,0)+1,OFFSET(G25,-1,0)))","v":2},{"$f":"IF(AND($C25<=3,$C25<>0),0,IF($C25=4,OFFSET(H25,-1,0)+1,OFFSET(H25,-1,0)))","v":0},{"$f":"IF(AND($C25<=4,$C25<>0),0,IF(AND($C25=\"S\",$W25>0),OFFSET(I25,-1,0)+1,OFFSET(I25,-1,0)))","v":0},0,0,"F","Serviço","Serviço","1.1.2.0.2.","AGETOP",160421,"MAO DE OBRA PARA COBERTURA C/TELHA COLONIAL PLAN","m2    ",304.2,null,null,null,""]
["S",3,"S",0,1,1,2,0,0,0,0,"F","Serviço","Serviço","1.1.2.0.3.","AGETOP",20136,"DEMOLICAO DE CAIBROS E RIPAS C/ TRANSP. ATÉ CB. E CARGA","m2    ",608.4,null,null,null,""]
[{"$f":"CHOOSE(1+LOG(1+2*(ORÇAMENTO.Nivel=\"Nível 1\")+4*(ORÇAMENTO.Nivel=\"Nível 2\")+8*(ORÇAMENTO.Nivel=\"Nível 3\")+16*(ORÇAMENTO.Nivel=\"Nível 4\")+32*(ORÇAMENTO.Nivel=\"Serviço\"),2),0,1,2,3,4,\"S\")","v":"S"},{"$f":"IF(OR(C27=\"s\",C27=0),OFFSET(B27,-1,0),C27)","v":3},{"$f":"IF(OFFSET(C27,-1,0)=\"L\",1,IF(OFFSET(C27,-1,0)=1,2,IF(OR(A27=\"s\",A27=0),\"S\",IF(AND(OFFSET(C27,-1,0)=2,A27=4),3,IF(AND(OR(OFFSET(C27,-1,0)=\"s\",OFFSET(C27,-1,0)=0),A27<>\"s\",A27>OFFSET(B27,-1,0)),OFFSET(B27,-1,0),A27)))))","v":"S"},{"$f":"IF(OR(C27=\"S\",C27=0),0,IF(ISERROR(K27),J27,SMALL(J27:K27,1)))","v":0},{"$f":"IF($C27=1,OFFSET(E27,-1,0)+1,OFFSET(E27,-1,0))","v":1},{"$f":"IF($C27=1,0,IF($C27=2,OFFSET(F27,-1,0)+1,OFFSET(F27,-1,0)))","v":1},{"$f":"IF(AND($C27<=2,$C27<>0),0,IF($C27=3,OFFSET(G27,-1,0)+1,OFFSET(G27,-1,0)))","v":2},{"$f":"IF(AND($C27<=3,$C27<>0),0,IF($C27=4,OFFSET(H27,-1,0)+1,OFFSET(H27,-1,0)))","v":0},{"$f":"IF(AND($C27<=4,$C27<>0),0,IF(AND($C27=\"S\",$W27>0),OFFSET(I27,-1,0)+1,OFFSET(I27,-1,0)))","v":0},0,0,"F","Serviço","Serviço","1.1.2.0.4.","AGETOP",67010,"ESCARIFICAÇÃO MANUAL, CORTE DE CONCRETO ATÉ 3CM DE PROFUNDIDADE","m3    ",0.3,null,null,null,""]
[3,{"$f":"IF(OR(C28=\"s\",C28=0),OFFSET(B28,-1,0),C28)","v":3},{"$f":"IF(OFFSET(C28,-1,0)=\"L\",1,IF(OFFSET(C28,-1,0)=1,2,IF(OR(A28=\"s\",A28=0),\"S\",IF(AND(OFFSET(C28,-1,0)=2,A28=4),3,IF(AND(OR(OFFSET(C28,-1,0)=\"s\",OFFSET(C28,-1,0)=0),A28<>\"s\",A28>OFFSET(B28,-1,0)),OFFSET(B28,-1,0),A28)))))","v":3},{"$f":"IF(OR(C28=\"S\",C28=0),0,IF(ISERROR(K28),J28,SMALL(J28:K28,1)))","v":3},{"$f":"IF($C28=1,OFFSET(E28,-1,0)+1,OFFSET(E28,-1,0))","v":1},{"$f":"IF($C28=1,0,IF($C28=2,OFFSET(F28,-1,0)+1,OFFSET(F28,-1,0)))","v":1},{"$f":"IF(AND($C28<=2,$C28<>0),0,IF($C28=3,OFFSET(G28,-1,0)+1,OFFSET(G28,-1,0)))","v":3},{"$f":"IF(AND($C28<=3,$C28<>0),0,IF($C28=4,OFFSET(H28,-1,0)+1,OFFSET(H28,-1,0)))","v":0},{"$f":"IF(AND($C28<=4,$C28<>0),0,IF(AND($C28=\"S\",$W28>0),OFFSET(I28,-1,0)+1,OFFSET(I28,-1,0)))","v":0},12,3,"F","Nível 3","Nível 3","1.1.3.","AGETOP",null,"BLOCO 02","-",null,null,null,null,""]
["S",3,"S",0,1,1,3,0,0,0,0,"F","Serviço","Serviço","1.1.3.0.1.","AGETOP",20101,"DEMOLICAO COBERTURA TELHA CERAMICA C/ TRANSP. ATÉ CB. E CARGA","m2    ",192,null,null,null,""]
[{"$f":"CHOOSE(1+LOG(1+2*(ORÇAMENTO.Nivel=\"Nível 1\")+4*(ORÇAMENTO.Nivel=\"Nível 2\")+8*(ORÇAMENTO.Nivel=\"Nível 3\")+16*(ORÇAMENTO.Nivel=\"Nível 4\")+32*(ORÇAMENTO.Nivel=\"Serviço\"),2),0,1,2,3,4,\"S\")","v":"S"},{"$f":"IF(OR(C30=\"s\",C30=0),OFFSET(B30,-1,0),C30)","v":3},{"$f":"IF(OFFSET(C30,-1,0)=\"L\",1,IF(OFFSET(C30,-1,0)=1,2,IF(OR(A30=\"s\",A30=0),\"S\",IF(AND(OFFSET(C30,-1,0)=2,A30=4),3,IF(AND(OR(OFFSET(C30,-1,0)=\"s\",OFFSET(C30,-1,0)=0),A30<>\"s\",A30>OFFSET(B30,-1,0)),OFFSET(B30,-1,0),A30)))))","v":"S"},{"$f":"IF(OR(C30=\"S\",C30=0),0,IF(ISERROR(K30),J30,SMALL(J30:K30,1)))","v":0},{"$f":"IF($C30=1,OFFSET(E30,-1,0)+1,OFFSET(E30,-1,0))","v":1},{"$f":"IF($C30=1,0,IF($C30=2,OFFSET(F30,-1,0)+1,OFFSET(F30,-1,0)))","v":1},{"$f":"IF(AND($C30<=2,$C30<>0),0,IF($C30=3,OFFSET(G30,-1,0)+1,OFFSET(G30,-1,0)))","v":3},{"$f":"IF(AND($C30<=3,$C30<>0),0,IF($C30=4,OFFSET(H30,-1,0)+1,OFFSET(H30,-1,0)))","v":0},{"$f":"IF(AND($C30<=4,$C30<>0),0,IF(AND($C30=\"S\",$W30>0),OFFSET(I30,-1,0)+1,OFFSET(I30,-1,0)))","v":0},0,0,"F","Serviço","Serviço","1.1.3.0.2.","AGETOP",160421,"MAO DE OBRA PARA COBERTURA C/TELHA COLONIAL PLAN","m2    ",192,null,null,null,""]
[3,3,3,7,1,1,4,0,0,9,7,"F","Nível 3","Nível 3","1.1.4.","AGETOP",null,"BANHEIRO MASC. E FEM.","-",null,null,null,null,""]
["S",3,"S",0,1,1,4,0,0,0,0,"F","Serviço","Serviço","1.1.4.0.1.","AGETOP",20118,"DEM.ALVEN.TIJOLO S/REAP. C/TR.ATE CB. E CARGA","m3    ",1.88,null,null,null,""]
["S",3,"S",0,1,1,4,0,0,0,0,"F","Serviço","Serviço","1.1.4.0.2.","AGETOP",20115,"DEMOLIÇÃO DE REVESTIMENTOS COM AZULEJOS C/TRANSP.ATE CB. E CARGA","m2    ",25.1,null,null,null,""]
["S",3,"S",0,1,1,4,0,0,0,0,"F","Serviço","Serviço","1.1.4.0.3.","SINAPI",97644,"REMOÇÃO DE PORTAS, DE FORMA MANUAL, SEM REAPROVEITAMENTO. AF_12/2017","M2",15.66,null,null,null,"Referência: AGETOP - 20106"]
["S",3,"S",0,1,1,4,0,0,0,0,"F","Serviço","Serviço","1.1.4.0.4.","AGETOP",20137,"DEMOLIÇAO BACIA SANITARIA C/ TRANSP. ATÉ CB. E CARGA","Un    ",4,null,null,null,""]
["S",3,"S",0,1,1,4,0,0,0,0,"F","Serviço","Serviço","1.1.4.0.5.","AGETOP",20140,"DEMOLIÇAO DE VÁLVULA DE DESCARGA C/ TRANSP. ATÉ CB. E CARGA","Un    ",4,null,null,null,""]
["S",3,"S",0,1,1,4,0,0,0,0,"F","Serviço","Serviço","1.1.4.0.6.","AGETOP",20147,"DEMOLIÇÃO DE FORRO PVC  INCLUSIVE ESTRUTURA DE SUSTENTAÇÃO C/ TRANSP. ATÉ CB. E CARGA","m2    ",49.24,null,null,null,""]
[3,3,3,2,1,1,5,0,0,2,{"$error":"#N/A"},"F","Nível 3","Nível 3","1.1.5.","AGETOP",null,"OUTROS","-",null,null,null,null,""]
["S",3,"S",0,1,1,5,0,0,0,0,"F","Serviço","Serviço","1.1.5.0.1.","AGETOP",21301,"PLACA DE OBRA PLOTADA EM CHAPA METÁLICA 26 , AFIXADA EM CAVALETES DE MADEIRA DE LEI (VIGOTAS 6X12CM) - PADRÃO GOINFRA","m2    ",7.5,null,null,null,""]
[2,2,2,3,1,2,0,0,0,188,3,"F","Nível 2","Nível 2","1.2.","AGETOP",null,"TRANSPORTES","-",null,null,null,null,""]
["S",2,"S",0,1,2,0,0,0,0,0,"F","Serviço","Serviço","1.2.0.0.1.","SINAPI",72897,"CARGA MANUAL DE ENTULHO EM CAMINHAO BASCULANTE 6 M3","M3",36.72,null,null,null,""]
["S",2,"S",0,1,2,0,0,0,0,0,"F","Serviço","Serviço","1.2.0.0.2.","SINAPI",72900,"TRANSPORTE DE ENTULHO COM CAMINHAO BASCULANTE 6 M3, RODOVIA PAVIMENTADA, DMT 0,5 A 1,0 KM","M3",36.72,null,null,null,""]
[2,2,2,9,1,3,0,0,0,185,9,"F","Nível 2","Nível 2","1.3.","SINAPI",null,"ESTRUTURA","-",null,null,null,null,""]
[3,3,3,8,1,3,1,0,0,8,113,"F","Nível 3","Nível 3","1.3.1.","SINAPI",null,"BLOCO 01","-",null,null,null,null,""]
[{"$f":"CHOOSE(1+LOG(1+2*(ORÇAMENTO.Nivel=\"Nível 1\")+4*(ORÇAMENTO.Nivel=\"Nível 2\")+8*(ORÇAMENTO.Nivel=\"Nível 3\")+16*(ORÇAMENTO.Nivel=\"Nível 4\")+32*(ORÇAMENTO.Nivel=\"Serviço\"),2),0,1,2,3,4,\"S\")","v":4},{"$f":"IF(OR(C45=\"s\",C45=0),OFFSET(B45,-1,0),C45)","v":4},{"$f":"IF(OFFSET(C45,-1,0)=\"L\",1,IF(OFFSET(C45,-1,0)=1,2,IF(OR(A45=\"s\",A45=0),\"S\",IF(AND(OFFSET(C45,-1,0)=2,A45=4),3,IF(AND(OR(OFFSET(C45,-1,0)=\"s\",OFFSET(C45,-1,0)=0),A45<>\"s\",A45>OFFSET(B45,-1,0)),OFFSET(B45,-1,0),A45)))))","v":4},{"$f":"IF(OR(C45=\"S\",C45=0),0,IF(ISERROR(K45),J45,SMALL(J45:K45,1)))","v":3},{"$f":"IF($C45=1,OFFSET(E45,-1,0)+1,OFFSET(E45,-1,0))","v":1},{"$f":"IF($C45=1,0,IF($C45=2,OFFSET(F45,-1,0)+1,OFFSET(F45,-1,0)))","v":3},{"$f":"IF(AND($C45<=2,$C45<>0),0,IF($C45=3,OFFSET(G45,-1,0)+1,OFFSET(G45,-1,0)))","v":1},{"$f":"IF(AND($C45<=3,$C45<>0),0,IF($C45=4,OFFSET(H45,-1,0)+1,OFFSET(H45,-1,0)))","v":1},{"$f":"IF(AND($C45<=4,$C45<>0),0,IF(AND($C45=\"S\",$W45>0),OFFSET(I45,-1,0)+1,OFFSET(I45,-1,0)))","v":0},7,3,"F","Nível 4","Nível 4","1.3.1.1.","SINAPI",null,"JUNTA DE DILATAÇÃO","-",null,null,null,null,""]
["S",4,"S",0,1,3,1,1,0,0,0,"F","Serviço","Serviço","1.3.1.1.1.","AGETOP",60160,"EPS 20 MM PARA JUNTA DILATAÇÃO","m2    ",0.18,null,null,null,""]
[{"$f":"CHOOSE(1+LOG(1+2*(ORÇAMENTO.Nivel=\"Nível 1\")+4*(ORÇAMENTO.Nivel=\"Nível 2\")+8*(ORÇAMENTO.Nivel=\"Nível 3\")+16*(ORÇAMENTO.Nivel=\"Nível 4\")+32*(ORÇAMENTO.Nivel=\"Serviço\"),2),0,1,2,3,4,\"S\")","v":"S"},{"$f":"IF(OR(C47=\"s\",C47=0),OFFSET(B47,-1,0),C47)","v":4},{"$f":"IF(OFFSET(C47,-1,0)=\"L\",1,IF(OFFSET(C47,-1,0)=1,2,IF(OR(A47=\"s\",A47=0),\"S\",IF(AND(OFFSET(C47,-1,0)=2,A47=4),3,IF(AND(OR(OFFSET(C47,-1,0)=\"s\",OFFSET(C47,-1,0)=0),A47<>\"s\",A47>OFFSET(B47,-1,0)),OFFSET(B47,-1,0),A47)))))","v":"S"},{"$f":"IF(OR(C47=\"S\",C47=0),0,IF(ISERROR(K47),J47,SMALL(J47:K47,1)))","v":0},{"$f":"IF($C47=1,OFFSET(E47,-1,0)+1,OFFSET(E47,-1,0))","v":1},{"$f":"IF($C47=1,0,IF($C47=2,OFFSET(F47,-1,0)+1,OFFSET(F47,-1,0)))","v":3},{"$f":"IF(AND($C47<=2,$C47<>0),0,IF($C47=3,OFFSET(G47,-1,0)+1,OFFSET(G47,-1,0)))","v":1},{"$f":"IF(AND($C47<=3,$C47<>0),0,IF($C47=4,OFFSET(H47,-1,0)+1,OFFSET(H47,-1,0)))","v":1},{"$f":"IF(AND($C47<=4,$C47<>0),0,IF(AND($C47=\"S\",$W47>0),OFFSET(I47,-1,0)+1,OFFSET(I47,-1,0)))","v":0},0,0,"F","Serviço","Serviço","1.3.1.1.2.","AGETOP",120210,"MASTIQUE A BASE DE POLIURETANO COM PRÉVIO PREPARO E TRATAMENTO DA SUPERFÍCIE","CM3   ",1800,null,null,null,""]
[{"$f":"CHOOSE(1+LOG(1+2*(ORÇAMENTO.Nivel=\"Nível 1\")+4*(ORÇAMENTO.Nivel=\"Nível 2\")+8*(ORÇAMENTO.Nivel=\"Nível 3\")+16*(ORÇAMENTO.Nivel=\"Nível 4\")+32*(ORÇAMENTO.Nivel=\"Serviço\"),2),0,1,2,3,4,\"S\")","v":4},{"$f":"IF(OR(C48=\"s\",C48=0),OFFSET(B48,-1,0),C48)","v":4},{"$f":"IF(OFFSET(C48,-1,0)=\"L\",1,IF(OFFSET(C48,-1,0)=1,2,IF(OR(A48=\"s\",A48=0),\"S\",IF(AND(OFFSET(C48,-1,0)=2,A48=4),3,IF(AND(OR(OFFSET(C48,-1,0)=\"s\",OFFSET(C48,-1,0)=0),A48<>\"s\",A48>OFFSET(B48,-1,0)),OFFSET(B48,-1,0),A48)))))","v":4},{"$f":"IF(OR(C48=\"S\",C48=0),0,IF(ISERROR(K48),J48,SMALL(J48:K48,1)))","v":4},{"$f":"IF($C48=1,OFFSET(E48,-1,0)+1,OFFSET(E48,-1,0))","v":1},{"$f":"IF($C48=1,0,IF($C48=2,OFFSET(F48,-1,0)+1,OFFSET(F48,-1,0)))","v":3},{"$f":"IF(AND($C48<=2,$C48<>0),0,IF($C48=3,OFFSET(G48,-1,0)+1,OFFSET(G48,-1,0)))","v":1},{"$f":"IF(AND($C48<=3,$C48<>0),0,IF($C48=4,OFFSET(H48,-1,0)+1,OFFSET(H48,-1,0)))","v":2},{"$f":"IF(AND($C48<=4,$C48<>0),0,IF(AND($C48=\"S\",$W48>0),OFFSET(I48,-1,0)+1,OFFSET(I48,-1,0)))","v":0},4,{"$error":"#N/A"},"F","Nível 4","Nível 4","1.3.1.2.","SINAPI",null,"REFORÇO ESTRUTURAL","-",null,null,null,null,""]
["S",4,"S",0,1,3,1,2,0,0,0,"F","Serviço","Serviço","1.3.1.2.1.","COMPOSIÇÃO","COMP 416_SEE","ADESIVO ESTRUTURAL A BASE DE RESINA EPOXI, BICOMPONENTE, FLUIDO  1 MM - APLICADO","M2",52.92,null,null,null,""]
["S",4,"S",0,1,3,1,2,0,0,0,"F","Serviço","Serviço","1.3.1.2.2.","AGETOP",60303,"ACO CA-50-A - 6,3 MM (1/4\") - (OBRAS CIVIS)","Kg    ",185.22,null,null,null,""]
["S",4,"S",0,1,3,1,2,0,{"$f":"IF(OR($C51=\"S\",$C51=0),0,MATCH(0,OFFSET($D51,1,$C51,ROW($C$253)-ROW($C51)),0))","v":0},{"$f":"IF(OR($C51=\"S\",$C51=0),0,MATCH(OFFSET($D51,0,$C51)+1,OFFSET($D51,1,$C51,ROW($C$253)-ROW($C51)),0))","v":0},"F","Serviço","Serviço","1.3.1.2.3.","SINAPI",90280,"GRAUTE FGK=25 MPA; TRAÇO 1:0,02:1,2:1,5 (CIMENTO/ CAL/ AREIA GROSSA/ BRITA 0) - PREPARO MECÂNICO COM BETONEIRA 400 L. AF_02/2015","M3",0.47,null,null,null,""]
[2,2,2,58,1,4,0,0,0,176,58,"F","Nível 2","Nível 2","1.4.","AGETOP",null,"INSTALAÇÕES ELÉTRICAS","-",null,null,null,null,""]
["S",2,"S",0,1,4,0,0,0,0,0,"F","Serviço","Serviço","1.4.0.0.1.","SINAPI","74131/5","QUADRO DE DISTRIBUICAO DE ENERGIA DE EMBUTIR, EM CHAPA METALICA, PARA 24 DISJUNTORES TERMOMAGNETICOS MONOPOLARES, COM BARRAMENTO TRIFASICO E NEUTRO, FORNECIMENTO E INSTALACAO","UN",1,null,null,null,""]
["S",2,"S",0,1,4,0,0,0,0,0,"F","Serviço","Serviço","1.4.0.0.2.","SINAPI","74131/4","QUADRO DE DISTRIBUICAO DE ENERGIA DE EMBUTIR, EM CHAPA METALICA, PARA 18 DISJUNTORES TERMOMAGNETICOS MONOPOLARES, COM BARRAMENTO TRIFASICO E NEUTRO, FORNECIMENTO E INSTALACAO","UN",3,null,null,null,""]
["S",2,"S",0,1,4,0,0,0,0,0,"F","Serviço","Serviço","1.4.0.0.3.","SINAPI","74131/6","QUADRO DE DISTRIBUICAO DE ENERGIA DE EMBUTIR, EM CHAPA METALICA, PARA 32 DISJUNTORES TERMOMAGNETICOS MONOPOLARES, COM BARRAMENTO TRIFASICO E NEUTRO, FORNECIMENTO E INSTALACAO","UN",1,null,null,null,""]
["S",2,"S",0,1,4,0,0,0,0,0,"F","Serviço","Serviço","1.4.0.0.4.","AGETOP",71175,"DISJUNTOR TRIPOLAR DE 60 A 100-A","Un    ",2,null,null,null,""]
["S",2,"S",0,1,4,0,0,0,0,0,"F","Serviço","Serviço","1.4.0.0.5.","SINAPI",93670,"DISJUNTOR TRIPOLAR TIPO DIN, CORRENTE NOMINAL DE 25A - FORNECIMENTO E INSTALAÇÃO. AF_04/2016","UN",2,null,null,null,"Referência: AGETOP - 71173"]
["S",2,"S",0,1,4,0,0,0,0,0,"F","Serviço","Serviço","1.4.0.0.6.","SINAPI",93671,"DISJUNTOR TRIPOLAR TIPO DIN, CORRENTE NOMINAL DE 32A - FORNECIMENTO E INSTALAÇÃO. AF_04/2016","UN",4,null,null,null,"Referência: AGETOP - 71173"]
["S",2,"S",0,1,4,0,0,0,0,0,"F","Serviço","Serviço","1.4.0.0.7.","SINAPI",93673,"DISJUNTOR TRIPOLAR TIPO DIN, CORRENTE NOMINAL DE 50A - FORNECIMENTO E INSTALAÇÃO. AF_04/2016","UN",2,null,null,null,"Referência: AGETOP - 71174"]
["S",2,"S",0,1,4,0,0,0,0,0,"F","Serviço","Serviço","1.4.0.0.8.","SINAPI",93656,"DISJUNTOR MONOPOLAR TIPO DIN, CORRENTE NOMINAL DE 25A - FORNECIMENTO E INSTALAÇÃO. AF_04/2016","UN",14,null,null,null,""]
["S",2,"S",0,1,4,0,0,0,0,0,"F","Serviço","Serviço","1.4.0.0.9.","SINAPI",93654,"DISJUNTOR MONOPOLAR TIPO DIN, CORRENTE NOMINAL DE 16A - FORNECIMENTO E INSTALAÇÃO. AF_04/2016","UN",17,null,null,null,""]
["S",2,"S",0,1,4,0,0,0,0,0,"F","Serviço","Serviço","1.4.0.0.10.","SINAPI",93653,"DISJUNTOR MONOPOLAR TIPO DIN, CORRENTE NOMINAL DE 10A - FORNECIMENTO E INSTALAÇÃO. AF_04/2016","UN",20,null,null,null,""]
["S",2,"S",0,1,4,0,0,0,0,0,"F","Serviço","Serviço","1.4.0.0.11.","AGETOP",71184,"DISPOSITIVO DE PROTEÇÃO CONTRA SURTOS (D.P.S.) 275V DE 8 A 40KA","Un    ",1,null,null,null,""]
["S",2,"S",0,1,4,0,0,0,0,0,"F","Serviço","Serviço","1.4.0.0.12.","AGETOP",71450,"INTERRUPTOR DIFERENCIAL RESIDUAL (D.R.) BIPOLAR DE 25A-30mA","Un    ",3,null,null,null,""]
["S",2,"S",0,1,4,0,0,0,0,0,"F","Serviço","Serviço","1.4.0.0.13.","SINAPI",92986,"CABO DE COBRE FLEXÍVEL ISOLADO, 35 MM², ANTI-CHAMA 0,6/1,0 KV, PARA DISTRIBUIÇÃO - FORNECIMENTO E INSTALAÇÃO. AF_12/2015","M",116,null,null,null,"Referência: AGETOP - 70512"]
["S",2,"S",0,1,4,0,0,0,0,0,"F","Serviço","Serviço","1.4.0.0.14.","SINAPI",92982,"CABO DE COBRE FLEXÍVEL ISOLADO, 16 MM², ANTI-CHAMA 0,6/1,0 KV, PARA DISTRIBUIÇÃO - FORNECIMENTO E INSTALAÇÃO. AF_12/2015","M",29,null,null,null,""]
["S",2,"S",0,1,4,0,0,0,0,0,"F","Serviço","Serviço","1.4.0.0.15.","SINAPI",91928,"CABO DE COBRE FLEXÍVEL ISOLADO, 4 MM², ANTI-CHAMA 450/750 V, PARA CIRCUITOS TERMINAIS - FORNECIMENTO E INSTALAÇÃO. AF_12/2015","M",956,null,null,null,"Referência: AGETOP - 70564"]
["S",2,"S",0,1,4,0,0,0,0,0,"F","Serviço","Serviço","1.4.0.0.16.","SINAPI",91926,"CABO DE COBRE FLEXÍVEL ISOLADO, 2,5 MM², ANTI-CHAMA 450/750 V, PARA CIRCUITOS TERMINAIS - FORNECIMENTO E INSTALAÇÃO. AF_12/2015","M",4638,null,null,null,"Referência: AGETOP - 70563"]
["S",2,"S",0,1,4,0,0,0,0,0,"F","Serviço","Serviço","1.4.0.0.17.","SINAPI",92979,"CABO DE COBRE FLEXÍVEL ISOLADO, 10 MM², ANTI-CHAMA 450/750 V, PARA DISTRIBUIÇÃO - FORNECIMENTO E INSTALAÇÃO. AF_12/2015","M",5,null,null,null,""]
["S",2,"S",0,1,4,0,0,0,0,0,"F","Serviço","Serviço","1.4.0.0.18.","SINAPI",91871,"ELETRODUTO RÍGIDO ROSCÁVEL, PVC, DN 25 MM (3/4\"), PARA CIRCUITOS TERMINAIS, INSTALADO EM PAREDE - FORNECIMENTO E INSTALAÇÃO. AF_12/2015","M",1158,null,null,null,"Referência: AGETOP - 71201"]
["S",2,"S",0,1,4,0,0,0,0,0,"F","Serviço","Serviço","1.4.0.0.19.","SINAPI",91872,"ELETRODUTO RÍGIDO ROSCÁVEL, PVC, DN 32 MM (1\"), PARA CIRCUITOS TERMINAIS, INSTALADO EM PAREDE - FORNECIMENTO E INSTALAÇÃO. AF_12/2015","M",958,null,null,null,"Referência: AGETOP - 71202"]
["S",2,"S",0,1,4,0,0,0,0,0,"F","Serviço","Serviço","1.4.0.0.20.","SINAPI",93008,"ELETRODUTO RÍGIDO ROSCÁVEL, PVC, DN 50 MM (1 1/2\") - FORNECIMENTO E INSTALAÇÃO. AF_12/2015","M",50,null,null,null,""]
["S",2,"S",0,1,4,0,0,0,0,0,"F","Serviço","Serviço","1.4.0.0.21.","AGETOP",70351,"BRACADEIRA METALICA TIPO \"U\" DIAM. 3/4\"","Un    ",58,null,null,null,""]
["S",2,"S",0,1,4,0,0,0,0,0,"F","Serviço","Serviço","1.4.0.0.22.","AGETOP",70352,"BRACADEIRA METALICA TIPO \"U\" DIAM. 1\"","Un    ",48,null,null,null,""]
["S",2,"S",0,1,4,0,0,0,0,0,"F","Serviço","Serviço","1.4.0.0.23.","AGETOP",70354,"BRACADEIRA METALICA TIPO \"U\" DIAM. 1.1/2\"","Un    ",3,null,null,null,""]
["S",2,"S",0,1,4,0,0,0,0,0,"F","Serviço","Serviço","1.4.0.0.24.","SINAPI",91879,"LUVA PARA ELETRODUTO, PVC, ROSCÁVEL, DN 25 MM (3/4\"), PARA CIRCUITOS TERMINAIS, INSTALADA EM LAJE - FORNECIMENTO E INSTALAÇÃO. AF_12/2015","UN",58,null,null,null,"Referência: AGETOP - 71741"]
["S",2,"S",0,1,4,0,0,0,0,0,"F","Serviço","Serviço","1.4.0.0.25.","SINAPI",91880,"LUVA PARA ELETRODUTO, PVC, ROSCÁVEL, DN 32 MM (1\"), PARA CIRCUITOS TERMINAIS, INSTALADA EM LAJE - FORNECIMENTO E INSTALAÇÃO. AF_12/2015","UN",48,null,null,null,"Referência: AGETOP - 71742"]
["S",2,"S",0,1,4,0,0,0,0,0,"F","Serviço","Serviço","1.4.0.0.26.","SINAPI",93013,"LUVA PARA ELETRODUTO, PVC, ROSCÁVEL, DN 50 MM (1 1/2\") - FORNECIMENTO E INSTALAÇÃO. AF_12/2015","UN",3,null,null,null,"Referência: AGETOP - 71744"]
["S",2,"S",0,1,4,0,0,0,0,0,"F","Serviço","Serviço","1.4.0.0.27.","AGETOP",72395,"TAMPA CEGA PARA CONDULETE METÁLICO","Un    ",25,null,null,null,""]
["S",2,"S",0,1,4,0,0,0,0,0,"F","Serviço","Serviço","1.4.0.0.28.","SINAPI",95801,"CONDULETE DE ALUMÍNIO, TIPO X, PARA ELETRODUTO DE AÇO GALVANIZADO DN 20 MM (3/4''), APARENTE - FORNECIMENTO E INSTALAÇÃO. AF_11/2016_P","UN",25,null,null,null,"Referência: AGETOP - 70929"]
["S",2,"S",0,1,4,0,0,0,{"$f":"IF(OR($C81=\"S\",$C81=0),0,MATCH(0,OFFSET($D81,1,$C81,ROW($C$253)-ROW($C81)),0))","v":0},{"$f":"IF(OR($C81=\"S\",$C81=0),0,MATCH(OFFSET($D81,0,$C81)+1,OFFSET($D81,1,$C81,ROW($C$253)-ROW($C81)),0))","v":0},"F","Serviço","Serviço","1.4.0.0.29.","SINAPI",91902,"CURVA 90 GRAUS PARA ELETRODUTO, PVC, ROSCÁVEL, DN 25 MM (3/4\"), PARA CIRCUITOS TERMINAIS, INSTALADA EM LAJE - FORNECIMENTO E INSTALAÇÃO. AF_12/2015","UN",20,null,null,null,"Referência: AGETOP - 71141"]
["S",2,"S",0,1,4,0,0,0,0,0,"F","Serviço","Serviço","1.4.0.0.30.","SINAPI",91905,"CURVA 90 GRAUS PARA ELETRODUTO, PVC, ROSCÁVEL, DN 32 MM (1\"), PARA CIRCUITOS TERMINAIS, INSTALADA EM LAJE - FORNECIMENTO E INSTALAÇÃO. AF_12/2015","UN",10,null,null,null,"Referência: AGETOP - 71142"]
["S",2,"S",0,1,4,0,0,0,0,0,"F","Serviço","Serviço","1.4.0.0.31.","AGETOP",71124,"CURVA 90 GRAUS AÇO ZINCADO DIÂMETRO 1.1/2\"","Un    ",5,null,null,null,""]
["S",2,"S",0,1,4,0,0,0,0,0,"F","Serviço","Serviço","1.4.0.0.32.","SINAPI",91939,"CAIXA RETANGULAR 4\" X 2\" ALTA (2,00 M DO PISO), PVC, INSTALADA EM PAREDE - FORNECIMENTO E INSTALAÇÃO. AF_12/2015","UN",125,null,null,null,""]
["S",2,"S",0,1,4,0,0,0,0,0,"F","Serviço","Serviço","1.4.0.0.33.","SINAPI",91937,"CAIXA OCTOGONAL 3\" X 3\", PVC, INSTALADA EM LAJE - FORNECIMENTO E INSTALAÇÃO. AF_12/2015","UN",160,null,null,null,""]
["S",2,"S",0,1,4,0,0,0,0,0,"F","Serviço","Serviço","1.4.0.0.34.","SINAPI",91953,"INTERRUPTOR SIMPLES (1 MÓDULO), 10A/250V, INCLUINDO SUPORTE E PLACA - FORNECIMENTO E INSTALAÇÃO. AF_12/2015","UN",14,null,null,null,"Referência: AGETOP - 71440"]
["S",2,"S",0,1,4,0,0,0,0,0,"F","Serviço","Serviço","1.4.0.0.35.","SINAPI",91959,"INTERRUPTOR SIMPLES (2 MÓDULOS), 10A/250V, INCLUINDO SUPORTE E PLACA - FORNECIMENTO E INSTALAÇÃO. AF_12/2015","UN",1,null,null,null,"Referência: AGETOP - 71441"]
["S",2,"S",0,1,4,0,0,0,0,0,"F","Serviço","Serviço","1.4.0.0.36.","SINAPI",91967,"INTERRUPTOR SIMPLES (3 MÓDULOS), 10A/250V, INCLUINDO SUPORTE E PLACA - FORNECIMENTO E INSTALAÇÃO. AF_12/2015","UN",8,null,null,null,"Referência: AGETOP - 71442"]
["S",2,"S",0,1,4,0,0,0,0,0,"F","Serviço","Serviço","1.4.0.0.37.","SINAPI",92000,"TOMADA BAIXA DE EMBUTIR (1 MÓDULO), 2P+T 10 A, INCLUINDO SUPORTE E PLACA - FORNECIMENTO E INSTALAÇÃO. AF_12/2015","UN",66,null,null,null,"Referência: AGETOP - 72578"]
["S",2,"S",0,1,4,0,0,0,0,0,"F","Serviço","Serviço","1.4.0.0.38.","SINAPI",91996,"TOMADA MÉDIA DE EMBUTIR (1 MÓDULO), 2P+T 10 A, INCLUINDO SUPORTE E PLACA - FORNECIMENTO E INSTALAÇÃO. AF_12/2015","UN",7,null,null,null,"Referência: AGETOP - 72578"]
["S",2,"S",0,1,4,0,0,0,0,0,"F","Serviço","Serviço","1.4.0.0.39.","SINAPI",91993,"TOMADA ALTA DE EMBUTIR (1 MÓDULO), 2P+T 20 A, INCLUINDO SUPORTE E PLACA - FORNECIMENTO E INSTALAÇÃO. AF_12/2015","UN",12,null,null,null,"Referência: AGETOP - 72585"]
["S",2,"S",0,1,4,0,0,0,0,0,"F","Serviço","Serviço","1.4.0.0.40.","SINAPI",92004,"TOMADA MÉDIA DE EMBUTIR (2 MÓDULOS), 2P+T 10 A, INCLUINDO SUPORTE E PLACA - FORNECIMENTO E INSTALAÇÃO. AF_12/2015","UN",6,null,null,null,"Referência: AGETOP - 72578"]
["S",2,"S",0,1,4,0,0,0,0,0,"F","Serviço","Serviço","1.4.0.0.41.","SINAPI",91992,"TOMADA ALTA DE EMBUTIR (1 MÓDULO), 2P+T 10 A, INCLUINDO SUPORTE E PLACA - FORNECIMENTO E INSTALAÇÃO. AF_12/2015","UN",10,null,null,null,""]
["S",2,"S",0,1,4,0,0,0,0,0,"F","Serviço","Serviço","1.4.0.0.42.","SINAPI",97593,"LUMINÁRIA TIPO SPOT, DE SOBREPOR, COM 1 LÂMPADA FLUORESCENTE DE 15 W, SEM REATOR - FORNECIMENTO E INSTALAÇÃO. AF_02/2020","UN",165,null,null,null,"Referência: AGETOP - 71688"]
["S",2,"S",0,1,4,0,0,0,0,0,"F","Serviço","Serviço","1.4.0.0.43.","SINAPI",97610,"LÂMPADA COMPACTA DE LED 10 W, BASE E27 - FORNECIMENTO E INSTALAÇÃO. AF_02/2020","UN",165,null,null,null,""]
["S",2,"S",0,1,4,0,0,0,0,0,"F","Serviço","Serviço","1.4.0.0.44.","SINAPI",97606,"LUMINÁRIA ARANDELA TIPO MEIA LUA, DE SOBREPOR, COM 1 LÂMPADA FLUORESCENTE DE 15 W, SEM REATOR - FORNECIMENTO E INSTALAÇÃO. AF_02/2020","UN",8,null,null,null,""]
["S",2,"S",0,1,4,0,0,0,0,0,"F","Serviço","Serviço","1.4.0.0.45.","AGETOP",71380,"HASTE REV.COBRE(COPPERWELD)  3/4\" X 2,40 M C/CONECTOR","Un    ",3,null,null,null,""]
["S",2,"S",0,1,4,0,0,0,0,0,"F","Serviço","Serviço","1.4.0.0.46.","AGETOP",70255,"ATERRAMENTO - SOLDA EXOTÉRMICA - CARTUCHO 90 G","un    ",3,null,null,null,""]
["S",2,"S",0,1,4,0,0,0,0,0,"F","Serviço","Serviço","1.4.0.0.47.","AGETOP",70648,"CAIXA DE PASSAGEM METÁLICA DE EMBUTIR  40X40X15 CM","Un    ",3,null,null,null,""]
["S",2,"S",0,1,4,0,0,0,0,0,"F","Serviço","Serviço","1.4.0.0.48.","AGETOP",70710,"CAIXA DE PASSAGEM 30X30X40CM COM TAMPA E DRENO BRITA","Un    ",5,null,null,null,""]
["S",2,"S",0,1,4,0,0,0,0,0,"F","Serviço","Serviço","1.4.0.0.49.","AGETOP",70633,"CAIXA DE PASSAGEM - ESCAVAÇÃO MANUAL / REATERRO/ APILOAMENTO DO FUNDO ","m3    ",0.6,null,null,null,""]
["S",2,"S",0,1,4,0,0,0,0,0,"F","Serviço","Serviço","1.4.0.0.50.","AGETOP",70391,"BUCHA DE NYLON S-6","Un    ",444,null,null,null,""]
["S",2,"S",0,1,4,0,0,0,0,0,"F","Serviço","Serviço","1.4.0.0.51.","AGETOP",71861,"PARAFUSO P/BUCHA S-6","Un    ",444,null,null,null,""]
["S",2,"S",0,1,4,0,0,0,0,0,"F","Serviço","Serviço","1.4.0.0.52.","AGETOP",71824,"PADRÃO TRIFASICO 35 MM H=7 METROS","Un    ",1,null,null,null,""]
["S",2,"S",0,1,4,0,0,0,0,0,"F","Serviço","Serviço","1.4.0.0.53.","AGETOP",71321,"FITA DE AUTO FUSAO, ROLO E 10,00 MM","Un    ",5,null,null,null,""]
["S",2,"S",0,1,4,0,0,0,0,0,"F","Serviço","Serviço","1.4.0.0.54.","AGETOP",20162,"DEMOLIÇÃO DAS INSTALAÇÕES ELÉTRICAS E AFINS C/ TRANSP. ATÉ CB. E CARGA","H     ",40,null,null,null,""]
["S",2,"S",0,1,4,0,0,0,0,0,"F","Serviço","Serviço","1.4.0.0.55.","SINAPI",93358,"ESCAVAÇÃO MANUAL DE VALA COM PROFUNDIDADE MENOR OU IGUAL A 1,30 M. AF_03/2016","M3",7.33,null,null,null,"Referência: AGETOP - 40101"]
["S",2,"S",0,1,4,0,0,0,0,0,"F","Serviço","Serviço","1.4.0.0.56.","SINAPI",96995,"REATERRO MANUAL APILOADO COM SOQUETE. AF_10/2017","M3",7.33,null,null,null,"Referência: AGETOP - 40902"]
["S",2,"S",0,1,4,0,0,0,0,0,"F","Serviço","Serviço","1.4.0.0.57.","SINAPI",94992,"EXECUÇÃO DE PASSEIO (CALÇADA) OU PISO DE CONCRETO COM CONCRETO MOLDADO IN LOCO, FEITO EM OBRA, ACABAMENTO CONVENCIONAL, ESPESSURA 6 CM, ARMADO. AF_07/2016","M2",24.45,null,null,null,""]
[2,2,2,18,1,5,0,0,0,118,18,"F","Nível 2","Nível 2","1.5.","AGETOP",null,"INSTALAÇÕES HIDROSSANITÁRIAS","-",null,null,null,null,""]
["S",2,"S",0,1,5,0,0,0,0,0,"F","Serviço","Serviço","1.5.0.0.1.","AGETOP",80601,"MICTORIO DE LOUCA C/SIFAO INTEGRADO","Un    ",3,null,null,null,""]
["S",2,"S",0,1,5,0,0,0,0,0,"F","Serviço","Serviço","1.5.0.0.2.","AGETOP",80610,"KIT FERR.P/MICT.LOUCA (ESPUDE,CONEXÃO ENTR.PARAFUSOS)","Un    ",3,null,null,null,""]
["S",2,"S",0,1,5,0,0,0,0,0,"F","Serviço","Serviço","1.5.0.0.3.","AGETOP",80613,"SIFÃO METÁLICO 1 1/2\" X 2\" P/MICTÓRIO","Un    ",3,null,null,null,""]
["S",2,"S",0,1,5,0,0,0,0,0,"F","Serviço","Serviço","1.5.0.0.4.","AGETOP",80621,"VÁLVULA DE DESCARGA PARA MICTÓRIO DIÂMETRO 1/2\" FECHAMENTO AUTOMÁTICO TEMPORIZADO","Un    ",3,null,null,null,""]
["S",2,"S",0,1,5,0,0,0,0,0,"F","Serviço","Serviço","1.5.0.0.5.","AGETOP",80502,"VASO SANITARIO","Un    ",2,null,null,null,""]
[{"$f":"CHOOSE(1+LOG(1+2*(ORÇAMENTO.Nivel=\"Nível 1\")+4*(ORÇAMENTO.Nivel=\"Nível 2\")+8*(ORÇAMENTO.Nivel=\"Nível 3\")+16*(ORÇAMENTO.Nivel=\"Nível 4\")+32*(ORÇAMENTO.Nivel=\"Serviço\"),2),0,1,2,3,4,\"S\")","v":"S"},{"$f":"IF(OR(C116=\"s\",C116=0),OFFSET(B116,-1,0),C116)","v":2},{"$f":"IF(OFFSET(C116,-1,0)=\"L\",1,IF(OFFSET(C116,-1,0)=1,2,IF(OR(A116=\"s\",A116=0),\"S\",IF(AND(OFFSET(C116,-1,0)=2,A116=4),3,IF(AND(OR(OFFSET(C116,-1,0)=\"s\",OFFSET(C116,-1,0)=0),A116<>\"s\",A116>OFFSET(B116,-1,0)),OFFSET(B116,-1,0),A116)))))","v":"S"},{"$f":"IF(OR(C116=\"S\",C116=0),0,IF(ISERROR(K116),J116,SMALL(J116:K116,1)))","v":0},{"$f":"IF($C116=1,OFFSET(E116,-1,0)+1,OFFSET(E116,-1,0))","v":1},{"$f":"IF($C116=1,0,IF($C116=2,OFFSET(F116,-1,0)+1,OFFSET(F116,-1,0)))","v":5},{"$f":"IF(AND($C116<=2,$C116<>0),0,IF($C116=3,OFFSET(G116,-1,0)+1,OFFSET(G116,-1,0)))","v":0},{"$f":"IF(AND($C116<=3,$C116<>0),0,IF($C116=4,OFFSET(H116,-1,0)+1,OFFSET(H116,-1,0)))","v":0},{"$f":"IF(AND($C116<=4,$C116<>0),0,IF(AND($C116=\"S\",$W116>0),OFFSET(I116,-1,0)+1,OFFSET(I116,-1,0)))","v":0},{"$f":"IF(OR($C116=\"S\",$C116=0),0,MATCH(0,OFFSET($D116,1,$C116,ROW($C$253)-ROW($C116)),0))","v":0},{"$f":"IF(OR($C116=\"S\",$C116=0),0,MATCH(OFFSET($D116,0,$C116)+1,OFFSET($D116,1,$C116,ROW($C$253)-ROW($C116)),0))","v":0},"F","Serviço","Serviço","1.5.0.0.6.","AGETOP",80510,"ANEL DE VEDAÇÃO PARA VASO SANITÁRIO","Un    ",2,null,null,null,""]
["S",2,"S",0,1,5,0,0,0,0,0,"F","Serviço","Serviço","1.5.0.0.7.","AGETOP",80520,"CONJUNTO DE FIXACAO P/VASO SANITARIO (PAR)","CJ    ",2,null,null,null,""]
["S",2,"S",0,1,5,0,0,0,0,0,"F","Serviço","Serviço","1.5.0.0.8.","AGETOP",80514,"TUBO DE LIGACAO PVC CROMADO 1.1/2\" / ESPUDE  - (ENTRADA)","Un    ",2,null,null,null,""]
["S",2,"S",0,1,5,0,0,0,0,0,"F","Serviço","Serviço","1.5.0.0.9.","AGETOP",80519,"VÁLVULA DE DESCARGA PARA P.N.E. COM ACABAMENTO CROMADO ANTIVANDALISMO ","un    ",2,null,null,null,""]
["S",2,"S",0,1,5,0,0,0,0,0,"F","Serviço","Serviço","1.5.0.0.10.","AGETOP",80526,"ASSENTO EM POLIPROPILENO COM SISTEMA DE FECHAMENTO SUAVE PARA VASO SANITÁRIO","Un    ",2,null,null,null,""]
["S",2,"S",0,1,5,0,0,0,0,0,"F","Serviço","Serviço","1.5.0.0.11.","SINAPI",95544,"PAPELEIRA DE PAREDE EM METAL CROMADO SEM TAMPA, INCLUSO FIXAÇÃO. AF_01/2020","UN",2,null,null,null,""]
["S",2,"S",0,1,5,0,0,0,0,0,"F","Serviço","Serviço","1.5.0.0.12.","AGETOP",80542,"LAVATÓRIO MÉDIO SEM COLUNA","Un    ",2,null,null,null,""]
["S",2,"S",0,1,5,0,0,0,0,0,"F","Serviço","Serviço","1.5.0.0.13.","AGETOP",80550,"FIXACAO P/LAVATORIO (PAR)","PAR   ",2,null,null,null,""]
["S",2,"S",0,1,5,0,0,0,0,0,"F","Serviço","Serviço","1.5.0.0.14.","AGETOP",80556,"LIGAÇÃO FLEXÍVEL PVC DIAM.1/2\" (ENGATE)","Un    ",2,null,null,null,""]
["S",2,"S",0,1,5,0,0,0,0,0,"F","Serviço","Serviço","1.5.0.0.15.","AGETOP",80570,"TORNEIRA DE MESA PARA LAVATÓRIO DIÂMETRO DE 1/2\"","Un    ",2,null,null,null,""]
["S",2,"S",0,1,5,0,0,0,0,0,"F","Serviço","Serviço","1.5.0.0.16.","AGETOP",80580,"VALVULA P/LAVATORIO OU BEBEDOURO METALICO DIAMETRO 1\"","Un    ",2,null,null,null,""]
["S",2,"S",0,1,5,0,0,0,0,0,"F","Serviço","Serviço","1.5.0.0.17.","AGETOP",80562,"SIFAO FLEXIVEL UNIVERSAL ( SANFONADO) EM PVC PARA LAVATORIO","Un    ",2,null,null,null,""]
[2,2,2,36,1,6,0,0,0,100,36,"F","Nível 2","Nível 2","1.6.","AGETOP",null,"INSTALAÇÕES ESPECIAIS","-",null,null,null,null,""]
[3,3,3,28,1,6,1,0,0,35,28,"F","Nível 3","Nível 3","1.6.1.","SINAPI",null,"CENTRAL DE GÁS","-",null,null,null,null,""]
["S",3,"S",0,1,6,1,0,0,0,0,"F","Serviço","Serviço","1.6.1.0.1.","AGETOP",91007,"CENTRAL DE GÁS PADRÃO GOINFRA SEM INSTALAÇÕES (1+1 CILINDRO 45 KG)","Un    ",1,null,null,null,""]
["S",3,"S",0,1,6,1,0,0,0,0,"F","Serviço","Serviço","1.6.1.0.2.","AGETOP",91023,"UNIÃO S/BRONZE PRETA 3/4\" NPT 300 LBS","Un    ",3,null,null,null,""]
["S",3,"S",0,1,6,1,0,0,0,0,"F","Serviço","Serviço","1.6.1.0.3.","COMPOSIÇÃO","COMP 382_SEE","TE DE REDUCAO DE FERRO GALVANIZADO, COM ROSCA BSP, DE 3/4\" X 1/2\"","UN ",1,null,null,null,""]
["S",3,"S",0,1,6,1,0,0,0,0,"F","Serviço","Serviço","1.6.1.0.4.","COMPOSIÇÃO","COMP 383_SEE","BUCHA DE REDUCAO DE FERRO GALVANIZADO, COM ROSCA BSP, DE 1/2\" X 1/4\"","UN ",3,null,null,null,""]
["S",3,"S",0,1,6,1,0,0,0,0,"F","Serviço","Serviço","1.6.1.0.5.","AGETOP",91021,"LUVA GALVANIZADO DE REDUÇÃO 3/4\" X 1/2\" (GÁS)","Un    ",2,null,null,null,""]
["S",3,"S",0,1,6,1,0,0,0,0,"F","Serviço","Serviço","1.6.1.0.6.","SINAPI",92692,"NIPLE, EM FERRO GALVANIZADO, CONEXÃO ROSQUEADA, DN 15 (1/2\"), INSTALADO EM RAMAIS E SUB-RAMAIS DE GÁS - FORNECIMENTO E INSTALAÇÃO. AF_12/2015","UN",6,null,null,null,""]
["S",3,"S",0,1,6,1,0,0,0,0,"F","Serviço","Serviço","1.6.1.0.7.","AGETOP",91031,"NIPLE DUPLO 300 PSI 3/4\"","Un    ",6,null,null,null,""]
["S",3,"S",0,1,6,1,0,0,0,0,"F","Serviço","Serviço","1.6.1.0.8.","COMPOSIÇÃO","COMP 212_SEE","NIPLE DE REDUÇÃO 1/2\" X 1/4\" BSP","UN ",4,null,null,null,""]
["S",3,"S",0,1,6,1,0,0,0,0,"F","Serviço","Serviço","1.6.1.0.9.","COMPOSIÇÃO","COMP 213_SEE","NIPLE DE REDUÇÃO 3/4\" X 1/2\" BSP","UN ",4,null,null,null,""]
["S",3,"S",0,1,6,1,0,0,0,0,"F","Serviço","Serviço","1.6.1.0.10.","SINAPI",92688,"TUBO DE AÇO GALVANIZADO COM COSTURA, CLASSE MÉDIA, CONEXÃO ROSQUEADA, DN 20 (3/4\"), INSTALADO EM RAMAIS E SUB-RAMAIS DE GÁS - FORNECIMENTO E INSTALAÇÃO. AF_12/2015","M",18,null,null,null,""]
["S",3,"S",0,1,6,1,0,0,0,0,"F","Serviço","Serviço","1.6.1.0.11.","SINAPI",92701,"JOELHO 90 GRAUS, EM FERRO GALVANIZADO, CONEXÃO ROSQUEADA, DN 20 (3/4\"), INSTALADO EM RAMAIS E SUB-RAMAIS DE GÁS - FORNECIMENTO E INSTALAÇÃO. AF_12/2015","UN",8,null,null,null,""]
["S",3,"S",0,1,6,1,0,0,0,0,"F","Serviço","Serviço","1.6.1.0.12.","AGETOP",91025,"VÁLVULA ESFERICA LATÃO 3/4\"","Un    ",3,null,null,null,""]
["S",3,"S",0,1,6,1,0,0,0,0,"F","Serviço","Serviço","1.6.1.0.13.","AGETOP",91019,"TE PRETO 90º 3/4\" NPT 300 LBS","Un    ",1,null,null,null,""]
["S",3,"S",0,1,6,1,0,0,0,0,"F","Serviço","Serviço","1.6.1.0.14.","COMPOSIÇÃO","COMP 542_SEE","VÁLVULA UGV 3/4\" (S) LATÃO","UN ",4,null,null,null,""]
["S",3,"S",0,1,6,1,0,0,0,0,"F","Serviço","Serviço","1.6.1.0.15.","COMPOSIÇÃO","COMP 543_SEE","VÁLVULA UGV 1/2\" (S) LATÃO","UN ",4,null,null,null,""]
["S",3,"S",0,1,6,1,0,0,0,0,"F","Serviço","Serviço","1.6.1.0.16.","AGETOP",91029,"VALVULA DE RETENÇÃO LATÃO 1/2\" X 7/16\" NPT","Un    ",4,null,null,null,""]
["S",3,"S",0,1,6,1,0,0,{"$f":"IF(OR($C146=\"S\",$C146=0),0,MATCH(0,OFFSET($D146,1,$C146,ROW($C$253)-ROW($C146)),0))","v":0},{"$f":"IF(OR($C146=\"S\",$C146=0),0,MATCH(OFFSET($D146,0,$C146)+1,OFFSET($D146,1,$C146,ROW($C$253)-ROW($C146)),0))","v":0},"F","Serviço","Serviço","1.6.1.0.17.","COMPOSIÇÃO","COMP 211_SEE","REGULADOR DE 2º ESTÁGIO 5KG/H","UN ",4,null,null,null,""]
["S",3,"S",0,1,6,1,0,0,0,0,"F","Serviço","Serviço","1.6.1.0.18.","COMPOSIÇÃO","COMP 210_SEE","REGULADOR DE 1º ESTÁGIO 60KG/H MODELO AP-40  COM MANÔMETRO","UN ",1,null,null,null,""]
["S",3,"S",0,1,6,1,0,0,0,0,"F","Serviço","Serviço","1.6.1.0.19.","AGETOP",85003,"EXTINTOR PO QUIMICO SECO (6 KG) - CAPACIDADE EXTINTORA 20 BC","Un    ",1,null,null,null,""]
["S",3,"S",0,1,6,1,0,0,0,0,"F","Serviço","Serviço","1.6.1.0.20.","COMPOSIÇÃO","COMP 235_SEE","PLACA DE SINALIZAÇÃO EM PVC COD 01 - (300X300) PROIBIDO FUMAR","UN ",2,null,null,null,""]
["S",3,"S",0,1,6,1,0,0,0,0,"F","Serviço","Serviço","1.6.1.0.21.","COMPOSIÇÃO","COMP 236_SEE","PLACA DE SINALIZAÇÃO EM PVC COD 06 - (300X300) PERIGO INFLAMÁVEL","UN ",2,null,null,null,""]
["S",3,"S",0,1,6,1,0,0,0,0,"F","Serviço","Serviço","1.6.1.0.22.","AGETOP",91043,"BRAÇADEIRA METALICA TIPO \"D\" DIAM. 3/4\"","Un    ",5,null,null,null,""]
["S",3,"S",0,1,6,1,0,0,0,0,"F","Serviço","Serviço","1.6.1.0.23.","AGETOP",71863,"PARAFUSO P/BUCHA S-10","Un    ",10,null,null,null,""]
["S",3,"S",0,1,6,1,0,0,0,0,"F","Serviço","Serviço","1.6.1.0.24.","AGETOP",70393,"BUCHA DE NYLON S-10","Un    ",10,null,null,null,""]
["S",3,"S",0,1,6,1,0,0,0,0,"F","Serviço","Serviço","1.6.1.0.25.","AGETOP",91045,"SUPORTE PARA COLETOR","Un    ",2,null,null,null,""]
["S",3,"S",0,1,6,1,0,0,0,0,"F","Serviço","Serviço","1.6.1.0.26.","COMPOSIÇÃO","COMP 045_SEE","LAUDO DE ESTANQUEIDADE","UN ",1,null,null,null,""]
[{"$f":"CHOOSE(1+LOG(1+2*(ORÇAMENTO.Nivel=\"Nível 1\")+4*(ORÇAMENTO.Nivel=\"Nível 2\")+8*(ORÇAMENTO.Nivel=\"Nível 3\")+16*(ORÇAMENTO.Nivel=\"Nível 4\")+32*(ORÇAMENTO.Nivel=\"Serviço\"),2),0,1,2,3,4,\"S\")","v":"S"},{"$f":"IF(OR(C156=\"s\",C156=0),OFFSET(B156,-1,0),C156)","v":3},{"$f":"IF(OFFSET(C156,-1,0)=\"L\",1,IF(OFFSET(C156,-1,0)=1,2,IF(OR(A156=\"s\",A156=0),\"S\",IF(AND(OFFSET(C156,-1,0)=2,A156=4),3,IF(AND(OR(OFFSET(C156,-1,0)=\"s\",OFFSET(C156,-1,0)=0),A156<>\"s\",A156>OFFSET(B156,-1,0)),OFFSET(B156,-1,0),A156)))))","v":"S"},{"$f":"IF(OR(C156=\"S\",C156=0),0,IF(ISERROR(K156),J156,SMALL(J156:K156,1)))","v":0},{"$f":"IF($C156=1,OFFSET(E156,-1,0)+1,OFFSET(E156,-1,0))","v":1},{"$f":"IF($C156=1,0,IF($C156=2,OFFSET(F156,-1,0)+1,OFFSET(F156,-1,0)))","v":6},{"$f":"IF(AND($C156<=2,$C156<>0),0,IF($C156=3,OFFSET(G156,-1,0)+1,OFFSET(G156,-1,0)))","v":1},{"$f":"IF(AND($C156<=3,$C156<>0),0,IF($C156=4,OFFSET(H156,-1,0)+1,OFFSET(H156,-1,0)))","v":0},{"$f":"IF(AND($C156<=4,$C156<>0),0,IF(AND($C156=\"S\",$W156>0),OFFSET(I156,-1,0)+1,OFFSET(I156,-1,0)))","v":0},0,0,"F","Serviço","Serviço","1.6.1.0.27.","COMPOSIÇÃO","COMP 277_SEE","MARCAÇÃO NO PISO - 1X1 M PARA EXTINTOR","M2",1,null,null,null,""]
[3,3,3,7,1,6,2,0,0,7,61,"F","Nível 3","Nível 3","1.6.2.","AGETOP",null,"PREVENÇÃO E COMBATE A INCÊNDIO","-",null,null,null,null,""]
[{"$f":"CHOOSE(1+LOG(1+2*(ORÇAMENTO.Nivel=\"Nível 1\")+4*(ORÇAMENTO.Nivel=\"Nível 2\")+8*(ORÇAMENTO.Nivel=\"Nível 3\")+16*(ORÇAMENTO.Nivel=\"Nível 4\")+32*(ORÇAMENTO.Nivel=\"Serviço\"),2),0,1,2,3,4,\"S\")","v":"S"},{"$f":"IF(OR(C158=\"s\",C158=0),OFFSET(B158,-1,0),C158)","v":3},{"$f":"IF(OFFSET(C158,-1,0)=\"L\",1,IF(OFFSET(C158,-1,0)=1,2,IF(OR(A158=\"s\",A158=0),\"S\",IF(AND(OFFSET(C158,-1,0)=2,A158=4),3,IF(AND(OR(OFFSET(C158,-1,0)=\"s\",OFFSET(C158,-1,0)=0),A158<>\"s\",A158>OFFSET(B158,-1,0)),OFFSET(B158,-1,0),A158)))))","v":"S"},{"$f":"IF(OR(C158=\"S\",C158=0),0,IF(ISERROR(K158),J158,SMALL(J158:K158,1)))","v":0},{"$f":"IF($C158=1,OFFSET(E158,-1,0)+1,OFFSET(E158,-1,0))","v":1},{"$f":"IF($C158=1,0,IF($C158=2,OFFSET(F158,-1,0)+1,OFFSET(F158,-1,0)))","v":6},{"$f":"IF(AND($C158<=2,$C158<>0),0,IF($C158=3,OFFSET(G158,-1,0)+1,OFFSET(G158,-1,0)))","v":2},{"$f":"IF(AND($C158<=3,$C158<>0),0,IF($C158=4,OFFSET(H158,-1,0)+1,OFFSET(H158,-1,0)))","v":0},{"$f":"IF(AND($C158<=4,$C158<>0),0,IF(AND($C158=\"S\",$W158>0),OFFSET(I158,-1,0)+1,OFFSET(I158,-1,0)))","v":0},0,0,"F","Serviço","Serviço","1.6.2.0.1.","AGETOP",85003,"EXTINTOR PO QUIMICO SECO (6 KG) - CAPACIDADE EXTINTORA 20 BC","Un    ",1,null,null,null,""]
[{"$f":"CHOOSE(1+LOG(1+2*(ORÇAMENTO.Nivel=\"Nível 1\")+4*(ORÇAMENTO.Nivel=\"Nível 2\")+8*(ORÇAMENTO.Nivel=\"Nível 3\")+16*(ORÇAMENTO.Nivel=\"Nível 4\")+32*(ORÇAMENTO.Nivel=\"Serviço\"),2),0,1,2,3,4,\"S\")","v":"S"},{"$f":"IF(OR(C159=\"s\",C159=0),OFFSET(B159,-1,0),C159)","v":3},{"$f":"IF(OFFSET(C159,-1,0)=\"L\",1,IF(OFFSET(C159,-1,0)=1,2,IF(OR(A159=\"s\",A159=0),\"S\",IF(AND(OFFSET(C159,-1,0)=2,A159=4),3,IF(AND(OR(OFFSET(C159,-1,0)=\"s\",OFFSET(C159,-1,0)=0),A159<>\"s\",A159>OFFSET(B159,-1,0)),OFFSET(B159,-1,0),A159)))))","v":"S"},{"$f":"IF(OR(C159=\"S\",C159=0),0,IF(ISERROR(K159),J159,SMALL(J159:K159,1)))","v":0},{"$f":"IF($C159=1,OFFSET(E159,-1,0)+1,OFFSET(E159,-1,0))","v":1},{"$f":"IF($C159=1,0,IF($C159=2,OFFSET(F159,-1,0)+1,OFFSET(F159,-1,0)))","v":6},{"$f":"IF(AND($C159<=2,$C159<>0),0,IF($C159=3,OFFSET(G159,-1,0)+1,OFFSET(G159,-1,0)))","v":2},{"$f":"IF(AND($C159<=3,$C159<>0),0,IF($C159=4,OFFSET(H159,-1,0)+1,OFFSET(H159,-1,0)))","v":0},{"$f":"IF(AND($C159<=4,$C159<>0),0,IF(AND($C159=\"S\",$W159>0),OFFSET(I159,-1,0)+1,OFFSET(I159,-1,0)))","v":0},0,0,"F","Serviço","Serviço","1.6.2.0.2.","AGETOP",85006,"EXTINTOR MULTI USO EM PO A B C (6 KG) - CAPACIDADE EXTINTORA 3A 20BC","un    ",3,null,null,null,""]
["S",3,"S",0,1,6,2,0,0,0,0,"F","Serviço","Serviço","1.6.2.0.3.","COMPOSIÇÃO","COMP 024_SEE","SINALIZADOR FOTOLUMINESCENTE PARA EXTINTOR","UN ",4,null,null,null,""]
["S",3,"S",0,1,6,2,0,0,0,0,"F","Serviço","Serviço","1.6.2.0.4.","COMPOSIÇÃO","COMP 025_SEE","SINALIZADOR FOTOLUMINESCENTE DE EMERGÊNCIA","UN ",11,null,null,null,""]
["S",3,"S",0,1,6,2,0,0,0,0,"F","Serviço","Serviço","1.6.2.0.5.","COMPOSIÇÃO","COMP 277_SEE","MARCAÇÃO NO PISO - 1X1 M PARA EXTINTOR","M2",4,null,null,null,""]
["S",3,"S",0,1,6,2,0,0,0,0,"F","Serviço","Serviço","1.6.2.0.6.","SINAPI",97599,"LUMINÁRIA DE EMERGÊNCIA, COM 30 LÂMPADAS LED DE 2 W, SEM REATOR - FORNECIMENTO E INSTALAÇÃO. AF_02/2020","UN",7,null,null,null,""]
[2,2,2,6,1,7,0,0,0,64,6,"F","Nível 2","Nível 2","1.7.","SINAPI",null,"ALVENARIAS E DIVISÓRIAS","-",null,null,null,null,""]
[3,3,3,2,1,7,1,0,0,5,2,"F","Nível 3","Nível 3","1.7.1.","AGETOP",null,"BLOCO 01","-",null,null,null,null,""]
["S",3,"S",0,1,7,1,0,0,0,0,"F","Serviço","Serviço","1.7.1.0.1.","AGETOP",100201,"ALVENARIA DE TIJOLO FURADO 1/2 VEZ - 9 x 19 x 19 - ARG. (1CALH:4ARML+100KG DE CI/M3)","m2    ",12,null,null,null,""]
[3,3,3,3,1,7,2,0,0,3,51,"F","Nível 3","Nível 3","1.7.2.","AGETOP",null,"BANHEIRO MASC. E FEM.","-",null,null,null,null,""]
[{"$f":"CHOOSE(1+LOG(1+2*(ORÇAMENTO.Nivel=\"Nível 1\")+4*(ORÇAMENTO.Nivel=\"Nível 2\")+8*(ORÇAMENTO.Nivel=\"Nível 3\")+16*(ORÇAMENTO.Nivel=\"Nível 4\")+32*(ORÇAMENTO.Nivel=\"Serviço\"),2),0,1,2,3,4,\"S\")","v":"S"},{"$f":"IF(OR(C168=\"s\",C168=0),OFFSET(B168,-1,0),C168)","v":3},{"$f":"IF(OFFSET(C168,-1,0)=\"L\",1,IF(OFFSET(C168,-1,0)=1,2,IF(OR(A168=\"s\",A168=0),\"S\",IF(AND(OFFSET(C168,-1,0)=2,A168=4),3,IF(AND(OR(OFFSET(C168,-1,0)=\"s\",OFFSET(C168,-1,0)=0),A168<>\"s\",A168>OFFSET(B168,-1,0)),OFFSET(B168,-1,0),A168)))))","v":"S"},{"$f":"IF(OR(C168=\"S\",C168=0),0,IF(ISERROR(K168),J168,SMALL(J168:K168,1)))","v":0},{"$f":"IF($C168=1,OFFSET(E168,-1,0)+1,OFFSET(E168,-1,0))","v":1},{"$f":"IF($C168=1,0,IF($C168=2,OFFSET(F168,-1,0)+1,OFFSET(F168,-1,0)))","v":7},{"$f":"IF(AND($C168<=2,$C168<>0),0,IF($C168=3,OFFSET(G168,-1,0)+1,OFFSET(G168,-1,0)))","v":2},{"$f":"IF(AND($C168<=3,$C168<>0),0,IF($C168=4,OFFSET(H168,-1,0)+1,OFFSET(H168,-1,0)))","v":0},{"$f":"IF(AND($C168<=4,$C168<>0),0,IF(AND($C168=\"S\",$W168>0),OFFSET(I168,-1,0)+1,OFFSET(I168,-1,0)))","v":0},0,0,"F","Serviço","Serviço","1.7.2.0.1.","AGETOP",100201,"ALVENARIA DE TIJOLO FURADO 1/2 VEZ - 9 x 19 x 19 - ARG. (1CALH:4ARML+100KG DE CI/M3)","m2    ",2.4,null,null,null,""]
["S",3,"S",0,1,7,2,0,0,0,0,"F","Serviço","Serviço","1.7.2.0.2.","AGETOP",100320,"DIVISORIA DE GRANITO POLIDO","m2    ",3.78,null,null,null,""]
[2,2,2,2,1,8,0,0,0,58,2,"F","Nível 2","Nível 2","1.8.","AGETOP",null,"ESTRUTURAS METÁLICAS","-",null,null,null,null,""]
["S",2,"S",0,1,8,0,0,0,0,0,"F","Serviço","Serviço","1.8.0.0.1.","AGETOP",150204,"ESTRUTURA METÁLICA CONVENCIONAL EM AÇO DO TIPO MR-250 / ASTM A36 COM FUNDO ANTICORROSIVO","Kg    ",10793,null,null,null,""]
[2,2,2,13,1,9,0,0,0,56,13,"F","Nível 2","Nível 2","1.9.","AGETOP",null,"COBERTURAS","-",null,null,null,null,""]
[3,3,3,6,1,9,1,0,0,12,6,"F","Nível 3","Nível 3","1.9.1.","SINAPI",null,"BLOCO 01","-",null,null,null,null,""]
[{"$f":"CHOOSE(1+LOG(1+2*(ORÇAMENTO.Nivel=\"Nível 1\")+4*(ORÇAMENTO.Nivel=\"Nível 2\")+8*(ORÇAMENTO.Nivel=\"Nível 3\")+16*(ORÇAMENTO.Nivel=\"Nível 4\")+32*(ORÇAMENTO.Nivel=\"Serviço\"),2),0,1,2,3,4,\"S\")","v":"S"},{"$f":"IF(OR(C174=\"s\",C174=0),OFFSET(B174,-1,0),C174)","v":3},{"$f":"IF(OFFSET(C174,-1,0)=\"L\",1,IF(OFFSET(C174,-1,0)=1,2,IF(OR(A174=\"s\",A174=0),\"S\",IF(AND(OFFSET(C174,-1,0)=2,A174=4),3,IF(AND(OR(OFFSET(C174,-1,0)=\"s\",OFFSET(C174,-1,0)=0),A174<>\"s\",A174>OFFSET(B174,-1,0)),OFFSET(B174,-1,0),A174)))))","v":"S"},{"$f":"IF(OR(C174=\"S\",C174=0),0,IF(ISERROR(K174),J174,SMALL(J174:K174,1)))","v":0},{"$f":"IF($C174=1,OFFSET(E174,-1,0)+1,OFFSET(E174,-1,0))","v":1},{"$f":"IF($C174=1,0,IF($C174=2,OFFSET(F174,-1,0)+1,OFFSET(F174,-1,0)))","v":9},{"$f":"IF(AND($C174<=2,$C174<>0),0,IF($C174=3,OFFSET(G174,-1,0)+1,OFFSET(G174,-1,0)))","v":1},{"$f":"IF(AND($C174<=3,$C174<>0),0,IF($C174=4,OFFSET(H174,-1,0)+1,OFFSET(H174,-1,0)))","v":0},{"$f":"IF(AND($C174<=4,$C174<>0),0,IF(AND($C174=\"S\",$W174>0),OFFSET(I174,-1,0)+1,OFFSET(I174,-1,0)))","v":0},0,0,"F","Serviço","Serviço","1.9.1.0.1.","SINAPI",94201,"TELHAMENTO COM TELHA CERÂMICA CAPA-CANAL, TIPO COLONIAL, COM ATÉ 2 ÁGUAS, INCLUSO TRANSPORTE VERTICAL. AF_07/2019","M2",304.2,null,null,null,""]
[{"$f":"CHOOSE(1+LOG(1+2*(ORÇAMENTO.Nivel=\"Nível 1\")+4*(ORÇAMENTO.Nivel=\"Nível 2\")+8*(ORÇAMENTO.Nivel=\"Nível 3\")+16*(ORÇAMENTO.Nivel=\"Nível 4\")+32*(ORÇAMENTO.Nivel=\"Serviço\"),2),0,1,2,3,4,\"S\")","v":"S"},{"$f":"IF(OR(C175=\"s\",C175=0),OFFSET(B175,-1,0),C175)","v":3},{"$f":"IF(OFFSET(C175,-1,0)=\"L\",1,IF(OFFSET(C175,-1,0)=1,2,IF(OR(A175=\"s\",A175=0),\"S\",IF(AND(OFFSET(C175,-1,0)=2,A175=4),3,IF(AND(OR(OFFSET(C175,-1,0)=\"s\",OFFSET(C175,-1,0)=0),A175<>\"s\",A175>OFFSET(B175,-1,0)),OFFSET(B175,-1,0),A175)))))","v":"S"},{"$f":"IF(OR(C175=\"S\",C175=0),0,IF(ISERROR(K175),J175,SMALL(J175:K175,1)))","v":0},{"$f":"IF($C175=1,OFFSET(E175,-1,0)+1,OFFSET(E175,-1,0))","v":1},{"$f":"IF($C175=1,0,IF($C175=2,OFFSET(F175,-1,0)+1,OFFSET(F175,-1,0)))","v":9},{"$f":"IF(AND($C175<=2,$C175<>0),0,IF($C175=3,OFFSET(G175,-1,0)+1,OFFSET(G175,-1,0)))","v":1},{"$f":"IF(AND($C175<=3,$C175<>0),0,IF($C175=4,OFFSET(H175,-1,0)+1,OFFSET(H175,-1,0)))","v":0},{"$f":"IF(AND($C175<=4,$C175<>0),0,IF(AND($C175=\"S\",$W175>0),OFFSET(I175,-1,0)+1,OFFSET(I175,-1,0)))","v":0},0,0,"F","Serviço","Serviço","1.9.1.0.2.","AGETOP",160421,"MAO DE OBRA PARA COBERTURA C/TELHA COLONIAL PLAN","m2    ",304.2,null,null,null,""]
["S",3,"S",0,1,9,1,0,0,0,0,"F","Serviço","Serviço","1.9.1.0.3.","SINAPI",94221,"CUMEEIRA PARA TELHA CERÂMICA EMBOÇADA COM ARGAMASSA TRAÇO 1:2:9 (CIMENTO, CAL E AREIA) PARA TELHADOS COM ATÉ 2 ÁGUAS, INCLUSO TRANSPORTE VERTICAL. AF_07/2019","M",60.71,null,null,null,""]
["S",3,"S",0,1,9,1,0,0,0,0,"F","Serviço","Serviço","1.9.1.0.4.","AGETOP",160403,"EMBOCAMENTO LATERAL  (OITOES)","m     ",12.26,null,null,null,""]
["S",3,"S",0,1,9,1,0,0,0,0,"F","Serviço","Serviço","1.9.1.0.5.","AGETOP",160404,"EMBOCAMENTO DE BEIRAL","M     ",121.68,null,null,null,""]
[3,3,3,6,1,9,2,0,0,6,39,"F","Nível 3","Nível 3","1.9.2.","SINAPI",null,"BLOCO 02","-",null,null,null,null,""]
["S",3,"S",0,1,9,2,0,0,0,0,"F","Serviço","Serviço","1.9.2.0.1.","SINAPI",94201,"TELHAMENTO COM TELHA CERÂMICA CAPA-CANAL, TIPO COLONIAL, COM ATÉ 2 ÁGUAS, INCLUSO TRANSPORTE VERTICAL. AF_07/2019","M2",192,null,null,null,""]
[{"$f":"CHOOSE(1+LOG(1+2*(ORÇAMENTO.Nivel=\"Nível 1\")+4*(ORÇAMENTO.Nivel=\"Nível 2\")+8*(ORÇAMENTO.Nivel=\"Nível 3\")+16*(ORÇAMENTO.Nivel=\"Nível 4\")+32*(ORÇAMENTO.Nivel=\"Serviço\"),2),0,1,2,3,4,\"S\")","v":"S"},{"$f":"IF(OR(C181=\"s\",C181=0),OFFSET(B181,-1,0),C181)","v":3},{"$f":"IF(OFFSET(C181,-1,0)=\"L\",1,IF(OFFSET(C181,-1,0)=1,2,IF(OR(A181=\"s\",A181=0),\"S\",IF(AND(OFFSET(C181,-1,0)=2,A181=4),3,IF(AND(OR(OFFSET(C181,-1,0)=\"s\",OFFSET(C181,-1,0)=0),A181<>\"s\",A181>OFFSET(B181,-1,0)),OFFSET(B181,-1,0),A181)))))","v":"S"},{"$f":"IF(OR(C181=\"S\",C181=0),0,IF(ISERROR(K181),J181,SMALL(J181:K181,1)))","v":0},{"$f":"IF($C181=1,OFFSET(E181,-1,0)+1,OFFSET(E181,-1,0))","v":1},{"$f":"IF($C181=1,0,IF($C181=2,OFFSET(F181,-1,0)+1,OFFSET(F181,-1,0)))","v":9},{"$f":"IF(AND($C181<=2,$C181<>0),0,IF($C181=3,OFFSET(G181,-1,0)+1,OFFSET(G181,-1,0)))","v":2},{"$f":"IF(AND($C181<=3,$C181<>0),0,IF($C181=4,OFFSET(H181,-1,0)+1,OFFSET(H181,-1,0)))","v":0},{"$f":"IF(AND($C181<=4,$C181<>0),0,IF(AND($C181=\"S\",$W181>0),OFFSET(I181,-1,0)+1,OFFSET(I181,-1,0)))","v":0},0,0,"F","Serviço","Serviço","1.9.2.0.2.","AGETOP",160421,"MAO DE OBRA PARA COBERTURA C/TELHA COLONIAL PLAN","m2    ",192,null,null,null,""]
["S",3,"S",0,1,9,2,0,0,0,0,"F","Serviço","Serviço","1.9.2.0.3.","SINAPI",94221,"CUMEEIRA PARA TELHA CERÂMICA EMBOÇADA COM ARGAMASSA TRAÇO 1:2:9 (CIMENTO, CAL E AREIA) PARA TELHADOS COM ATÉ 2 ÁGUAS, INCLUSO TRANSPORTE VERTICAL. AF_07/2019","M",41.2,null,null,null,""]
["S",3,"S",0,1,9,2,0,0,0,0,"F","Serviço","Serviço","1.9.2.0.4.","AGETOP",160403,"EMBOCAMENTO LATERAL  (OITOES)","m     ",26.96,null,null,null,""]
["S",3,"S",0,1,9,2,0,0,0,0,"F","Serviço","Serviço","1.9.2.0.5.","AGETOP",160404,"EMBOCAMENTO DE BEIRAL","M     ",82.4,null,null,null,""]
[2,2,2,3,1,10,0,0,0,43,3,"F","Nível 2","Nível 2","1.10.","SINAPI",null,"ESQUADRIAS METÁLICAS","-",null,null,null,null,""]
[3,3,3,2,1,10,1,0,0,2,6,"F","Nível 3","Nível 3","1.10.1.","SINAPI",null,"BANHEIRO MASC. E FEM.","-",null,null,null,null,""]
["S",3,"S",0,1,10,1,0,0,0,0,"F","Serviço","Serviço","1.10.1.0.1.","AGETOP",180501,"PORTA DE ABRIR EM CHAPA PF-1 C/FERRAGENS","m2    ",13.5,null,null,null,""]
[2,2,2,8,1,11,0,0,0,40,8,"F","Nível 2","Nível 2","1.11.","AGETOP",null,"REVESTIMENTO DE PAREDE","-",null,null,null,null,""]
[3,3,3,3,1,11,1,0,0,7,3,"F","Nível 3","Nível 3","1.11.1.","AGETOP",null,"COZINHA","-",null,null,null,null,""]
["S",3,"S",0,1,11,1,0,0,0,0,"F","Serviço","Serviço","1.11.1.0.1.","AGETOP",201302,"REVESTIMENTO COM CERÂMICA ","m2    ",42.06,null,null,null,""]
["S",3,"S",0,1,11,1,0,0,0,0,"F","Serviço","Serviço","1.11.1.0.2.","AGETOP",200201,"EMBOÇO (1CI:4 ARML)","m2    ",42.06,null,null,null,""]
[3,3,3,4,1,11,2,0,0,4,26,"F","Nível 3","Nível 3","1.11.2.","SINAPI",null,"BANHEIRO MASC. E FEM.","-",null,null,null,null,""]
["S",3,"S",0,1,11,2,0,0,0,0,"F","Serviço","Serviço","1.11.2.0.1.","AGETOP",200101,"CHAPISCO COMUM","m2    ",4.8,null,null,null,""]
[{"$f":"CHOOSE(1+LOG(1+2*(ORÇAMENTO.Nivel=\"Nível 1\")+4*(ORÇAMENTO.Nivel=\"Nível 2\")+8*(ORÇAMENTO.Nivel=\"Nível 3\")+16*(ORÇAMENTO.Nivel=\"Nível 4\")+32*(ORÇAMENTO.Nivel=\"Serviço\"),2),0,1,2,3,4,\"S\")","v":"S"},{"$f":"IF(OR(C194=\"s\",C194=0),OFFSET(B194,-1,0),C194)","v":3},{"$f":"IF(OFFSET(C194,-1,0)=\"L\",1,IF(OFFSET(C194,-1,0)=1,2,IF(OR(A194=\"s\",A194=0),\"S\",IF(AND(OFFSET(C194,-1,0)=2,A194=4),3,IF(AND(OR(OFFSET(C194,-1,0)=\"s\",OFFSET(C194,-1,0)=0),A194<>\"s\",A194>OFFSET(B194,-1,0)),OFFSET(B194,-1,0),A194)))))","v":"S"},{"$f":"IF(OR(C194=\"S\",C194=0),0,IF(ISERROR(K194),J194,SMALL(J194:K194,1)))","v":0},{"$f":"IF($C194=1,OFFSET(E194,-1,0)+1,OFFSET(E194,-1,0))","v":1},{"$f":"IF($C194=1,0,IF($C194=2,OFFSET(F194,-1,0)+1,OFFSET(F194,-1,0)))","v":11},{"$f":"IF(AND($C194<=2,$C194<>0),0,IF($C194=3,OFFSET(G194,-1,0)+1,OFFSET(G194,-1,0)))","v":2},{"$f":"IF(AND($C194<=3,$C194<>0),0,IF($C194=4,OFFSET(H194,-1,0)+1,OFFSET(H194,-1,0)))","v":0},{"$f":"IF(AND($C194<=4,$C194<>0),0,IF(AND($C194=\"S\",$W194>0),OFFSET(I194,-1,0)+1,OFFSET(I194,-1,0)))","v":0},0,0,"F","Serviço","Serviço","1.11.2.0.2.","AGETOP",200201,"EMBOÇO (1CI:4 ARML)","m2    ",4.8,null,null,null,""]
["S",3,"S",0,1,11,2,0,0,0,0,"F","Serviço","Serviço","1.11.2.0.3.","AGETOP",201302,"REVESTIMENTO COM CERÂMICA ","m2    ",4.8,null,null,null,""]
[2,2,2,3,1,12,0,0,0,32,3,"F","Nível 2","Nível 2","1.12.","AGETOP",null,"FORROS","-",null,null,null,null,""]
[3,3,3,2,1,12,1,0,0,2,17,"F","Nível 3","Nível 3","1.12.1.","AGETOP",null,"BANHEIRO MASC. E FEM.","-",null,null,null,null,""]
[{"$f":"CHOOSE(1+LOG(1+2*(ORÇAMENTO.Nivel=\"Nível 1\")+4*(ORÇAMENTO.Nivel=\"Nível 2\")+8*(ORÇAMENTO.Nivel=\"Nível 3\")+16*(ORÇAMENTO.Nivel=\"Nível 4\")+32*(ORÇAMENTO.Nivel=\"Serviço\"),2),0,1,2,3,4,\"S\")","v":"S"},3,"S",0,1,12,1,0,0,0,0,"F","Serviço","Serviço","1.12.1.0.1.","AGETOP",210460,"FORRO DE PVC COM ESTRUTURA EM METALON PINTADA COM TINTA ALQUÍDICA D.F.","m2    ",49.24,null,null,null,""]
[2,2,2,5,1,13,0,0,0,29,5,"F","Nível 2","Nível 2","1.13.","AGETOP",null,"REVESTIMENTO DE PISO","-",null,null,null,null,""]
[3,3,3,4,1,13,1,0,0,4,14,"F","Nível 3","Nível 3","1.13.1.","AGETOP",null,"ACESSIBILIDADE","-",null,null,null,null,""]
[{"$f":"CHOOSE(1+LOG(1+2*(ORÇAMENTO.Nivel=\"Nível 1\")+4*(ORÇAMENTO.Nivel=\"Nível 2\")+8*(ORÇAMENTO.Nivel=\"Nível 3\")+16*(ORÇAMENTO.Nivel=\"Nível 4\")+32*(ORÇAMENTO.Nivel=\"Serviço\"),2),0,1,2,3,4,\"S\")","v":"S"},{"$f":"IF(OR(C201=\"s\",C201=0),OFFSET(B201,-1,0),C201)","v":3},{"$f":"IF(OFFSET(C201,-1,0)=\"L\",1,IF(OFFSET(C201,-1,0)=1,2,IF(OR(A201=\"s\",A201=0),\"S\",IF(AND(OFFSET(C201,-1,0)=2,A201=4),3,IF(AND(OR(OFFSET(C201,-1,0)=\"s\",OFFSET(C201,-1,0)=0),A201<>\"s\",A201>OFFSET(B201,-1,0)),OFFSET(B201,-1,0),A201)))))","v":"S"},{"$f":"IF(OR(C201=\"S\",C201=0),0,IF(ISERROR(K201),J201,SMALL(J201:K201,1)))","v":0},{"$f":"IF($C201=1,OFFSET(E201,-1,0)+1,OFFSET(E201,-1,0))","v":1},{"$f":"IF($C201=1,0,IF($C201=2,OFFSET(F201,-1,0)+1,OFFSET(F201,-1,0)))","v":13},{"$f":"IF(AND($C201<=2,$C201<>0),0,IF($C201=3,OFFSET(G201,-1,0)+1,OFFSET(G201,-1,0)))","v":1},{"$f":"IF(AND($C201<=3,$C201<>0),0,IF($C201=4,OFFSET(H201,-1,0)+1,OFFSET(H201,-1,0)))","v":0},{"$f":"IF(AND($C201<=4,$C201<>0),0,IF(AND($C201=\"S\",$W201>0),OFFSET(I201,-1,0)+1,OFFSET(I201,-1,0)))","v":0},0,0,"F","Serviço","Serviço","1.13.1.0.1.","AGETOP",221126,"PISO DE LADRILHO HIDRÁULICO COLORIDO MODELO TÁTIL ( ALERTA OU DIRECIONAL) SEM LASTRO","m2    ",47.669999999999995,null,null,null,""]
["S",3,"S",0,1,13,1,0,0,0,0,"F","Serviço","Serviço","1.13.1.0.2.","AGETOP",221120,"PISO DE BORRACHA COLORIDO MODELO TÁTIL ( ALERTA OU DIRECIONAL) INCLUSO CONTRAPISO (1CI:3ARML) C/ E=2CM E NATA DE CIMENTO","m2    ",6.94,null,null,null,""]
[{"$f":"CHOOSE(1+LOG(1+2*(ORÇAMENTO.Nivel=\"Nível 1\")+4*(ORÇAMENTO.Nivel=\"Nível 2\")+8*(ORÇAMENTO.Nivel=\"Nível 3\")+16*(ORÇAMENTO.Nivel=\"Nível 4\")+32*(ORÇAMENTO.Nivel=\"Serviço\"),2),0,1,2,3,4,\"S\")","v":"S"},{"$f":"IF(OR(C203=\"s\",C203=0),OFFSET(B203,-1,0),C203)","v":3},{"$f":"IF(OFFSET(C203,-1,0)=\"L\",1,IF(OFFSET(C203,-1,0)=1,2,IF(OR(A203=\"s\",A203=0),\"S\",IF(AND(OFFSET(C203,-1,0)=2,A203=4),3,IF(AND(OR(OFFSET(C203,-1,0)=\"s\",OFFSET(C203,-1,0)=0),A203<>\"s\",A203>OFFSET(B203,-1,0)),OFFSET(B203,-1,0),A203)))))","v":"S"},{"$f":"IF(OR(C203=\"S\",C203=0),0,IF(ISERROR(K203),J203,SMALL(J203:K203,1)))","v":0},{"$f":"IF($C203=1,OFFSET(E203,-1,0)+1,OFFSET(E203,-1,0))","v":1},{"$f":"IF($C203=1,0,IF($C203=2,OFFSET(F203,-1,0)+1,OFFSET(F203,-1,0)))","v":13},{"$f":"IF(AND($C203<=2,$C203<>0),0,IF($C203=3,OFFSET(G203,-1,0)+1,OFFSET(G203,-1,0)))","v":1},{"$f":"IF(AND($C203<=3,$C203<>0),0,IF($C203=4,OFFSET(H203,-1,0)+1,OFFSET(H203,-1,0)))","v":0},{"$f":"IF(AND($C203<=4,$C203<>0),0,IF(AND($C203=\"S\",$W203>0),OFFSET(I203,-1,0)+1,OFFSET(I203,-1,0)))","v":0},0,0,"F","Serviço","Serviço","1.13.1.0.3.","AGETOP",220102,"PISO CONCRETO DESEMPENADO ESPESSURA = 5 CM  1:2,5:3,5","m2    ",1.53,null,null,null,""]
[2,2,2,4,1,14,0,0,0,24,4,"F","Nível 2","Nível 2","1.14.","AGETOP",null,"FERRAGENS","-",null,null,null,null,""]
[3,3,3,3,1,14,1,0,0,3,9,"F","Nível 3","Nível 3","1.14.1.","AGETOP",null,"BANHEIRO MASC. E FEM.","-",null,null,null,null,""]
["S",3,"S",0,1,14,1,0,0,0,0,"F","Serviço","Serviço","1.14.1.0.1.","AGETOP",230174,"BARRA DE APOIO EM AÇO INOX - 40 CM","un    ",8,null,null,null,""]
["S",3,"S",0,1,14,1,0,0,0,0,"F","Serviço","Serviço","1.14.1.0.2.","AGETOP",230176,"BARRA DE APOIO EM AÇO INOX - 80 CM ","un    ",6,null,null,null,""]
[2,{"$f":"IF(OR(C208=\"s\",C208=0),OFFSET(B208,-1,0),C208)","v":2},{"$f":"IF(OFFSET(C208,-1,0)=\"L\",1,IF(OFFSET(C208,-1,0)=1,2,IF(OR(A208=\"s\",A208=0),\"S\",IF(AND(OFFSET(C208,-1,0)=2,A208=4),3,IF(AND(OR(OFFSET(C208,-1,0)=\"s\",OFFSET(C208,-1,0)=0),A208<>\"s\",A208>OFFSET(B208,-1,0)),OFFSET(B208,-1,0),A208)))))","v":2},{"$f":"IF(OR(C208=\"S\",C208=0),0,IF(ISERROR(K208),J208,SMALL(J208:K208,1)))","v":3},{"$f":"IF($C208=1,OFFSET(E208,-1,0)+1,OFFSET(E208,-1,0))","v":1},{"$f":"IF($C208=1,0,IF($C208=2,OFFSET(F208,-1,0)+1,OFFSET(F208,-1,0)))","v":15},{"$f":"IF(AND($C208<=2,$C208<>0),0,IF($C208=3,OFFSET(G208,-1,0)+1,OFFSET(G208,-1,0)))","v":0},{"$f":"IF(AND($C208<=3,$C208<>0),0,IF($C208=4,OFFSET(H208,-1,0)+1,OFFSET(H208,-1,0)))","v":0},{"$f":"IF(AND($C208<=4,$C208<>0),0,IF(AND($C208=\"S\",$W208>0),OFFSET(I208,-1,0)+1,OFFSET(I208,-1,0)))","v":0},20,3,"F","Nível 2","Nível 2","1.15.","AGETOP",null,"ADMINISTRAÇÃO","-",null,null,null,null,""]
["S",2,"S",0,1,15,0,0,0,0,0,"F","Serviço","Serviço","1.15.0.0.1.","AGETOP",250101,"ENGENHEIRO - (OBRAS CIVIS)","H     ",36,null,null,null,""]
["S",2,"S",0,1,15,0,0,0,{"$f":"IF(OR($C210=\"S\",$C210=0),0,MATCH(0,OFFSET($D210,1,$C210,ROW($C$253)-ROW($C210)),0))","v":0},{"$f":"IF(OR($C210=\"S\",$C210=0),0,MATCH(OFFSET($D210,0,$C210)+1,OFFSET($D210,1,$C210,ROW($C$253)-ROW($C210)),0))","v":0},"F","Serviço","Serviço","1.15.0.0.2.","AGETOP",250103,"ENCARREGADO - (OBRAS CIVIS)","H     ",660,null,null,null,""]
[2,2,2,9,1,16,0,0,0,17,9,"F","Nível 2","Nível 2","1.16.","AGETOP",null,"PINTURA","-",null,null,null,null,""]
[3,3,3,2,1,16,1,0,0,8,2,"F","Nível 3","Nível 3","1.16.1.","SINAPI",null,"BLOCO 01","-",null,null,null,null,""]
["S",3,"S",0,1,16,1,0,0,0,0,"F","Serviço","Serviço","1.16.1.0.1.","AGETOP",261611,"PINTURA  ALQUÍDICA BRILHANTE DUPLA FUNÇÃO 2 DEMÃOS = 50 MÍCRONS","m2    ",608.4,null,null,null,""]
[3,3,3,4,1,16,2,0,0,6,4,"F","Nível 3","Nível 3","1.16.2.","AGETOP",null,"SALAS DE AULA","-",null,null,null,null,""]
["S",3,"S",0,1,16,2,0,0,0,0,"F","Serviço","Serviço","1.16.2.0.1.","AGETOP",260104,"REMOCAO DE PINTURA ANTIGA A LATEX","m2    ",262.32,null,null,null,""]
["S",3,"S",0,1,16,2,0,0,0,0,"F","Serviço","Serviço","1.16.2.0.2.","AGETOP",261300,"EMASSAMENTO COM MASSA PVA DUAS DEMAOS","m2    ",262.32,null,null,null,""]
["S",3,"S",0,1,16,2,0,0,0,0,"F","Serviço","Serviço","1.16.2.0.3.","AGETOP",261307,"PINTURA PVA LATEX 2 DEMAOS SEM SELADOR","m2    ",262.32,null,null,null,""]
[3,3,3,2,1,16,3,0,0,2,{"$error":"#N/A"},"F","Nível 3","Nível 3","1.16.3.","SINAPI",null,"BANHEIRO MASC. E FEM.","-",null,null,null,null,""]
["S",3,"S",0,1,16,3,0,0,0,0,"F","Serviço","Serviço","1.16.3.0.1.","AGETOP",261602,"PINT.ESMALTE/ESQUAD.FERRO C/FUNDO ANTICOR.","m2    ",40.5,null,null,null,""]
[2,2,2,8,1,17,0,0,0,8,{"$error":"#N/A"},"F","Nível 2","Nível 2","1.17.","AGETOP",null,"DIVERSOS","-",null,null,null,null,""]
[3,3,3,2,1,17,1,0,0,7,2,"F","Nível 3","Nível 3","1.17.1.","AGETOP",null,"ACESSIBILIDADE","-",null,null,null,null,""]
["S",3,"S",0,1,17,1,0,0,0,0,"F","Serviço","Serviço","1.17.1.0.1.","COMPOSIÇÃO","COMP 084_SEE","GUARDA-CORPO COM CORRIMÃO - SEDUC","M",40,null,null,null,""]
[3,3,3,3,1,17,2,0,0,5,3,"F","Nível 3","Nível 3","1.17.2.","AGETOP",null,"COZINHA","-",null,null,null,null,""]
["S",3,"S",0,1,17,2,0,0,0,0,"F","Serviço","Serviço","1.17.2.0.1.","COMPOSIÇÃO","COMP 027_SEE","TELA MOSQUITEIRA EM NYLON COM ESTRUTURA DE ALUMÍNIO, COM FORNECIMENTO DE MÃO DE OBRA E INSTALAÇÃO","M2",3.23,null,null,null,""]
[{"$f":"CHOOSE(1+LOG(1+2*(ORÇAMENTO.Nivel=\"Nível 1\")+4*(ORÇAMENTO.Nivel=\"Nível 2\")+8*(ORÇAMENTO.Nivel=\"Nível 3\")+16*(ORÇAMENTO.Nivel=\"Nível 4\")+32*(ORÇAMENTO.Nivel=\"Serviço\"),2),0,1,2,3,4,\"S\")","v":"S"},{"$f":"IF(OR(C225=\"s\",C225=0),OFFSET(B225,-1,0),C225)","v":3},{"$f":"IF(OFFSET(C225,-1,0)=\"L\",1,IF(OFFSET(C225,-1,0)=1,2,IF(OR(A225=\"s\",A225=0),\"S\",IF(AND(OFFSET(C225,-1,0)=2,A225=4),3,IF(AND(OR(OFFSET(C225,-1,0)=\"s\",OFFSET(C225,-1,0)=0),A225<>\"s\",A225>OFFSET(B225,-1,0)),OFFSET(B225,-1,0),A225)))))","v":"S"},{"$f":"IF(OR(C225=\"S\",C225=0),0,IF(ISERROR(K225),J225,SMALL(J225:K225,1)))","v":0},{"$f":"IF($C225=1,OFFSET(E225,-1,0)+1,OFFSET(E225,-1,0))","v":1},{"$f":"IF($C225=1,0,IF($C225=2,OFFSET(F225,-1,0)+1,OFFSET(F225,-1,0)))","v":17},{"$f":"IF(AND($C225<=2,$C225<>0),0,IF($C225=3,OFFSET(G225,-1,0)+1,OFFSET(G225,-1,0)))","v":2},{"$f":"IF(AND($C225<=3,$C225<>0),0,IF($C225=4,OFFSET(H225,-1,0)+1,OFFSET(H225,-1,0)))","v":0},{"$f":"IF(AND($C225<=4,$C225<>0),0,IF(AND($C225=\"S\",$W225>0),OFFSET(I225,-1,0)+1,OFFSET(I225,-1,0)))","v":0},0,0,"F","Serviço","Serviço","1.17.2.0.2.","COMPOSIÇÃO","COMP 575_SEE","MOLA AEREA FECHA PORTA, PARA PORTAS COM LARGURA ATE 95 CM","UN ",1,null,null,null,""]
[3,3,3,2,1,17,3,0,0,2,{"$error":"#N/A"},"F","Nível 3","Nível 3","1.17.3.","AGETOP",null,"OUTROS","-",null,null,null,null,""]
["S",3,"S",0,1,17,3,0,0,0,0,"F","Serviço","Serviço","1.17.3.0.1.","AGETOP",270501,"LIMPEZA FINAL DE OBRA - (OBRAS CIVIS)","m2    ",561.71,null,null,null,""]
[1,1,1,25,2,0,0,0,0,25,{"$error":"#N/A"},"F","Nível 1","Nível 1","2.","SINAPI",null,"PASSARELA MODELO 03 - PADRÃO SÉC. XXI 2015","-",null,null,null,null,""]
[2,2,2,2,2,1,0,0,0,24,2,"F","Nível 2","Nível 2","2.1.","AGETOP",null,"SERVIÇOS PRELIMINARES","-",null,null,null,null,""]
["S",2,"S",0,2,1,0,0,0,0,0,"F","Serviço","Serviço","2.1.0.0.1.","AGETOP",20701,"LOCAÇÃO DA OBRA, EXECUÇÃO DE GABARITO SEM REAPROVEITAMENTO, INCLUSO PINTURA (FACE INTERNA DO RIPÃO 15CM) E PIQUETE COM TESTEMUNHA","m2    ",30.24,null,null,null,""]
[2,2,2,9,2,2,0,0,0,22,9,"F","Nível 2","Nível 2","2.2.","AGETOP",null,"FUNDAÇÕES E SONDAGENS","-",null,null,null,null,""]
["S",2,"S",0,2,2,0,0,0,0,0,"F","Serviço","Serviço","2.2.0.0.1.","SINAPI",96534,"FABRICAÇÃO, MONTAGEM E DESMONTAGEM DE FÔRMA PARA BLOCO DE COROAMENTO, EM MADEIRA SERRADA, E=25 MM, 4 UTILIZAÇÕES. AF_06/2017","M2",7.95,null,null,null,"Referência: AGETOP - 51009"]
["S",2,"S",0,2,2,0,0,0,0,0,"F","Serviço","Serviço","2.2.0.0.2.","SINAPI",96523,"ESCAVAÇÃO MANUAL PARA BLOCO DE COROAMENTO OU SAPATA, COM PREVISÃO DE FÔRMA. AF_06/2017","M3",1.5434999999999999,null,null,null,"Referência: AGETOP - 50901"]
["S",2,"S",0,2,2,0,0,0,0,0,"F","Serviço","Serviço","2.2.0.0.3.","AGETOP",50902,"APILOAMENTO (BLOCOS/SAPATAS)","m2    ",1.5,null,null,null,""]
["S",2,"S",0,2,2,0,0,0,0,0,"F","Serviço","Serviço","2.2.0.0.4.","SINAPI",96995,"REATERRO MANUAL APILOADO COM SOQUETE. AF_10/2017","M3",0.69349999999999989,null,null,null,"Referência: AGETOP - 40902"]
["S",2,"S",0,2,2,0,0,0,0,0,"F","Serviço","Serviço","2.2.0.0.5.","SINAPI",94964,"CONCRETO FCK = 20MPA, TRAÇO 1:2,7:3 (CIMENTO/ AREIA MÉDIA/ BRITA 1)  - PREPARO MECÂNICO COM BETONEIRA 400 L. AF_07/2016","M3",0.85,null,null,null,""]
["S",2,"S",0,2,2,0,0,0,0,0,"F","Serviço","Serviço","2.2.0.0.6.","AGETOP",51026,"LANÇAMENTO/APLICAÇÃO/ADENSAMENTO DE CONCRETO EM FUNDAÇÃO- (O.C.)","m3    ",0.85,null,null,null,""]
["S",2,"S",0,2,2,0,0,0,0,0,"F","Serviço","Serviço","2.2.0.0.7.","SINAPI",96547,"ARMAÇÃO DE BLOCO, VIGA BALDRAME OU SAPATA UTILIZANDO AÇO CA-50 DE 12,5 MM - MONTAGEM. AF_06/2017","KG",21,null,null,null,""]
["S",2,"S",0,2,2,0,0,0,0,0,"F","Serviço","Serviço","2.2.0.0.8.","SINAPI",96543,"ARMAÇÃO DE BLOCO, VIGA BALDRAME E SAPATA UTILIZANDO AÇO CA-60 DE 5 MM - MONTAGEM. AF_06/2017","KG",13,null,null,null,"Referência: AGETOP - 52014"]
[2,2,2,6,2,3,0,0,0,13,6,"F","Nível 2","Nível 2","2.3.","AGETOP",null,"ESTRUTURA","-",null,null,null,null,""]
["S",2,"S",0,2,3,0,0,0,0,0,"F","Serviço","Serviço","2.3.0.0.1.","SINAPI",92426,"MONTAGEM E DESMONTAGEM DE FÔRMA DE PILARES RETANGULARES E ESTRUTURAS SIMILARES COM ÁREA MÉDIA DAS SEÇÕES MENOR OU IGUAL A 0,25 M², PÉ-DIREITO SIMPLES, EM CHAPA DE MADEIRA COMPENSADA RESINADA, 8 UTILIZAÇÕES. AF_12/2015","M2",1.93,null,null,null,""]
["S",2,"S",0,2,3,0,0,0,0,0,"F","Serviço","Serviço","2.3.0.0.2.","SINAPI",94964,"CONCRETO FCK = 20MPA, TRAÇO 1:2,7:3 (CIMENTO/ AREIA MÉDIA/ BRITA 1)  - PREPARO MECÂNICO COM BETONEIRA 400 L. AF_07/2016","M3",0.17,null,null,null,""]
[{"$f":"CHOOSE(1+LOG(1+2*(ORÇAMENTO.Nivel=\"Nível 1\")+4*(ORÇAMENTO.Nivel=\"Nível 2\")+8*(ORÇAMENTO.Nivel=\"Nível 3\")+16*(ORÇAMENTO.Nivel=\"Nível 4\")+32*(ORÇAMENTO.Nivel=\"Serviço\"),2),0,1,2,3,4,\"S\")","v":"S"},2,"S",0,2,3,0,0,0,0,0,"F","Serviço","Serviço","2.3.0.0.3.","SINAPI",92873,"LANÇAMENTO COM USO DE BALDES, ADENSAMENTO E ACABAMENTO DE CONCRETO EM ESTRUTURAS. AF_12/2015","M3",0.17,null,null,null,"Referência: AGETOP - 60801"]
["S",2,"S",0,2,3,0,0,0,0,0,"F","Serviço","Serviço","2.3.0.0.4.","SINAPI",92779,"ARMAÇÃO DE PILAR OU VIGA DE UMA ESTRUTURA CONVENCIONAL DE CONCRETO ARMADO EM UMA EDIFICAÇÃO TÉRREA OU SOBRADO UTILIZANDO AÇO CA-50 DE 12,5 MM - MONTAGEM. AF_12/2015","KG",4.1818181818181808,null,null,null,""]
["S",2,"S",0,2,3,0,0,0,0,0,"F","Serviço","Serviço","2.3.0.0.5.","SINAPI",92775,"ARMAÇÃO DE PILAR OU VIGA DE UMA ESTRUTURA CONVENCIONAL DE CONCRETO ARMADO EM UMA EDIFICAÇÃO TÉRREA OU SOBRADO UTILIZANDO AÇO CA-60 DE 5,0 MM - MONTAGEM. AF_12/2015","KG",2.1818181818181817,null,null,null,"Referência: AGETOP - 60314"]
[2,2,2,2,2,4,0,0,0,7,2,"F","Nível 2","Nível 2","2.4.",null,null,"IMPERMEABILIZACAO","-",null,null,null,null,""]
["S",2,"S",0,2,4,0,0,0,0,0,"F","Serviço","Serviço","2.4.0.0.1.","SINAPI",98562,"IMPERMEABILIZAÇÃO DE FLOREIRA OU VIGA BALDRAME COM ARGAMASSA DE CIMENTO E AREIA, COM ADITIVO IMPERMEABILIZANTE, E = 2 CM. AF_06/2018","M2",5.4,null,null,null,"Referência: AGETOP - 120902"]
[2,2,2,2,2,5,0,0,0,5,2,"F","Nível 2","Nível 2","2.5.",null,null,"ESTRUTURAS METÁLICAS","-",null,null,null,null,""]
["S",2,"S",0,2,5,0,0,0,0,0,"F","Serviço","Serviço","2.5.0.0.1.","AGETOP",150103,"ESTRUTURA METÁLICA CONVENCIONAL EM AÇO DO TIPO USI SAC-300 COM FUNDO ANTICORROSIVO","Kg    ",393.48840000000007,null,null,null,""]
[2,2,2,3,2,6,0,0,0,3,{"$error":"#N/A"},"F","Nível 2","Nível 2","2.6.",null,null,"COBERTURAS","-",null,null,null,null,""]
["S",2,"S",0,2,6,0,0,0,0,0,"F","Serviço","Serviço","2.6.0.0.1.","SINAPI",94213,"TELHAMENTO COM TELHA DE AÇO/ALUMÍNIO E = 0,5 MM, COM ATÉ 2 ÁGUAS, INCLUSO IÇAMENTO. AF_07/2019","M2",38.880000000000003,null,null,null,"Referência: AGETOP - 160905"]
["S",2,"S",0,2,6,0,0,0,0,0,"F","Serviço","Serviço","2.6.0.0.2.","SINAPI",94228,"CALHA EM CHAPA DE AÇO GALVANIZADO NÚMERO 24, DESENVOLVIMENTO DE 50 CM, INCLUSO TRANSPORTE VERTICAL. AF_07/2019","M",14.4,null,null,null,"Referência: AGETOP - 160601"]
[-1,null,-1,null,0,0,0,0,0,null,null,"F"]
[null,null,null,null,null,null,null,null,null,null,null,"F",null,null,null,null,null,"OBS: OS QUANTITATIVOS DE MATERIAIS  DAS INSTALAÇÕES HIDROSSANITÁRIAS, ELÉTRICAS E ESPECIAIS SÃO FORNECIDOS PELOS PROFISSIONAIS RESPONSÁVEIS PELOS RESPECTIVOS PROJETOS.",null,null,"VALOR TOTAL"]
[null,null,null,null,null,null,null,null,null,null,null,"F",null,null,null,null,null,null,null,null,"VALOR BDI (20,34%)"]
[null,null,null,null,null,null,null,null,null,null,null,"F",null,null,null,null,null,null,null,null,"TOTAL ORÇAMENTO"]
[null,null,null,null,null,null,null,null,null,null,null,"F"]
[null,null,null,null,null,null,null,null,null,null,null,"F",null,null,null,null,null,null,null,null,"CUSTO POR M2 ³"]
[null,null,null,null,null,null,null,null,null,null,null,"F",null,null,null,null,null,null,null,null,"MATERIAL S/ BDI"]
[null,null,null,null,null,null,null,null,null,null,null,"F",null,null,null,null,null,null,null,null,"MÃO DE OBRA S/ BDI"]
[null,null,null,null,null,null,null,null,null,null,null,"F"]
[null,null,null,null,null,null,null,null,null,null,null,"F",null,null,null,null,"(1) Conforme previsto pelo DECRETO Nº 7.983, DE 8 DE ABRIL DE 2013, os preços adotados são aqueles constantes dos sistemas de referência indicados. Justifica-se o uso dos preços destas composições de custos unitários devido ao seu valor ser menor à mediana de seus correspondentes na tabela SINAPI;"]
[null,null,null,null,null,null,null,null,null,null,null,"F",null,null,null,null,"(2) Optou-se pelo uso das composições de custos da AGETOP para itens não presentes na SINAPI;"]
[null,null,null,null,null,null,null,null,null,null,null,"F",null,null,null,null,"(3) Para itens da AGETOP, os vidros não estão inclusos nas esquadrias e já foram considerados os custos de contramarco para as esquadrias de alumínio;"]
[null,null,null,null,null,null,null,null,null,null,null,"F",null,null,null,null,"(4) Nos casos em que houver execução de granitina e omissão do item AGETOP 221102, considerou-se que o quantitativo para o rodapé, de altura igual a 7cm, foi incorporado na área de piso;"]
[null,null,null,null,null,null,null,null,null,null,null,"F",null,null,null,null,"(5) O custo unitário aproximado por metro quadrado é calculado dividindo-se o valor total do orçamento pela área total de construção."]
[null,null,null,null,null,null,null,null,null,null,null,"F"]
[null,null,null,null,null,null,null,null,null,null,null,"F"]
[]
[null,null,null,null,null,null,null,null,null,null,null,null,null,null,"SOMATÓRIO DE SERVIÇOS"]
[null,null,null,null,null,null,null,null,null,null,null,null,null,null,"ITEM","DESCRIÇÃO DOS SERVIÇOS",null,null,"PREÇO SEM BDI",null,null,"PREÇO COM BDI",null,"PARTICIPAÇÃO ( % )"]
[null,null,null,null,null,null,null,null,null,null,null,null,null,null,"a.","SERVIÇOS PRELIMINARES",null,null,{"$f":"SUMIF($R$19:$R$253,$P272,$W$19:$W$253)","v":0},null,null,{"$f":"ROUND(S272*(1+BDI.Taxa),2)","v":0},null,{"$f":"IFERROR(ROUND($V272*100/$W$256,2),0)","v":0}]
[null,null,null,null,null,null,null,null,null,null,null,null,null,null,"b.","TRANSPORTES",null,null,0,null,null,0,null,{"$f":"IFERROR(ROUND($V273*100/$W$256,2),0)","v":0}]
[null,null,null,null,null,null,null,null,null,null,null,null,null,null,"c.","SERVIÇO EM TERRA",null,null,0,null,null,0,null,0]
[null,null,null,null,null,null,null,null,null,null,null,null,null,null,"d.","FUNDAÇÕES E SONDAGENS",null,null,0,null,null,0,null,0]
[null,null,null,null,null,null,null,null,null,null,null,null,null,null,"e.","ESTRUTURA",null,null,0,null,null,0,null,0]
[null,null,null,null,null,null,null,null,null,null,null,null,null,null,"f.","INSTALAÇÕES ELÉTRICAS",null,null,0,null,null,0,null,0]
[null,null,null,null,null,null,null,null,null,null,null,null,null,null,"g.","INSTALAÇÕES HIDROSSANITÁRIAS",null,null,0,null,null,0,null,0]
[null,null,null,null,null,null,null,null,null,null,null,null,null,null,"h","INSTALAÇÕES ESPECIAIS",null,null,0,null,null,0,null,0]
[null,null,null,null,null,null,null,null,null,null,null,null,null,null,"i.","ALVENARIAS E DIVISÓRIAS",null,null,0,null,null,0,null,0]
[null,null,null,null,null,null,null,null,null,null,null,null,null,null,"j.","ALVENARIA AUTO-PORTANTE",null,null,0,null,null,0,null,0]
[null,null,null,null,null,null,null,null,null,null,null,null,null,null,"k.","IMPERMEABILIZAÇÃO",null,null,0,null,null,0,null,0]
[null,null,null,null,null,null,null,null,null,null,null,null,null,null,"l.","ISOLAMENTO TÉRMICO E ACÚSTICO",null,null,0,null,null,0,null,0]
[null,null,null,null,null,null,null,null,null,null,null,null,null,null,"m.","ESTRUTURA DE MADEIRA",null,null,0,null,null,0,null,0]
[null,null,null,null,null,null,null,null,null,null,null,null,null,null,"n.","ESTRUTURAS METÁLICAS",null,null,0,null,null,0,null,0]
[null,null,null,null,null,null,null,null,null,null,null,null,null,null,"o.","COBERTURAS",null,null,0,null,null,0,null,0]
[null,null,null,null,null,null,null,null,null,null,null,null,null,null,"p.","ESQUADRIAS DE MADEIRA",null,null,0,null,null,0,null,0]
[null,null,null,null,null,null,null,null,null,null,null,null,null,null,"q.","ESQUADRIAS METÁLICAS",null,null,0,null,null,{"$f":"ROUND(S288*(1+BDI.Taxa),2)","v":0},null,0]
[null,null,null,null,null,null,null,null,null,null,null,null,null,null,"r.","VIDROS",null,null,0,null,null,0,null,0]
[null,null,null,null,null,null,null,null,null,null,null,null,null,null,"s.","REVESTIMENTO DE PAREDE",null,null,0,null,null,0,null,0]
[null,null,null,null,null,null,null,null,null,null,null,null,null,null,"t.","FORROS",null,null,0,null,null,0,null,0]
[null,null,null,null,null,null,null,null,null,null,null,null,null,null,"u.","REVESTIMENTO DE PISO",null,null,0,null,null,0,null,0]
[null,null,null,null,null,null,null,null,null,null,null,null,null,null,"v.","FERRAGENS",null,null,0,null,null,0,null,0]
[null,null,null,null,null,null,null,null,null,null,null,null,null,null,"w.","MARCENARIA",null,null,0,null,null,0,null,0]
[null,null,null,null,null,null,null,null,null,null,null,null,null,null,"x.","ADMINISTRAÇÃO",null,null,0,null,null,0,null,0]
[null,null,null,null,null,null,null,null,null,null,null,null,null,null,"y.","PINTURA",null,null,0,null,null,{"$f":"ROUND(S296*(1+BDI.Taxa),2)","v":0},null,0]
[null,null,null,null,null,null,null,null,null,null,null,null,null,null,"z.","DIVERSOS",null,null,0,null,null,{"$f":"IF(S297>0,IF((SUM(V272:W296)+ROUND(S297*(1+BDI.Taxa),2))<>V299,V299-SUM(V272:W296),ROUND(S297*(1+BDI.Taxa),2)),0)","v":0},null,{"$f":"IF(S297>0,IF((SUM(X272:X296)+IFERROR(ROUND($V297*100/$W$256,2),0))<>X299,X299-SUM(X272:X296),IFERROR(ROUND($V297*100/$W$256,2),0)),0)","v":0}]
[null,null,null,null,null,null,null,null,null,null,null,null,null,null,"TOTAL GERAL DO ORÇAMENTO (R$)",null,null,null,{"$f":"SUM(S272:U297)","v":0},null,null,{"$f":"SUM(V272:W297)","v":0},null,{"$f":"SUM(X272:X297)","v":0}]
[null,null,null,null,null,null,null,null,null,null,null,null,null,null,null,null,null,null,{"$f":"$W$254","v":0},null,null,{"$f":"$W$256","v":0},null,100]
[null,null,null,null,null,null,null,null,null,null,null,null,null,null,null,null,null,null,"(TOTAL SEM BDI)",null,null,"(TOTAL COM BDI)",null,"(ARRED porcentagem)"]
[null,null,null,null,null,null,null,null,null,null,null,null,null,null,null,null,null,null,{"$f":"IF(AND(S298=S299,S298>0),\"OK\",\"ERRO\")","v":"ERRO"},null,null,{"$f":"IF(AND(V298=V299,V298>0),\"OK\",\"ERRO\")","v":"ERRO"},null,{"$f":"IF(X298=100,\"OK\",\"ERRO\")","v":"ERRO"}]
[]
[]
[null,null,null,null,null,null,null,null,null,null,null,null,null,null,"RESUMO GERAL DO ORÇAMENTO"]
[null,null,null,null,null,null,null,null,null,null,null,null,null,null,"ITEM","DESCRIÇÃO DOS SERVIÇOS",null,null,"PREÇO SEM BDI",null,null,"PREÇO COM BDI",null,"PARTICIPAÇÃO ( % )"]
[null,null,null,null,null,null,null,null,null,null,null,null,null,null,"1.",{"$f":"IFERROR(VLOOKUP(O306,$O$19:$W$253,4,FALSE),\"\")","v":"REFORMA"},null,null,{"$f":"IF(P307=\"\",$S$327-SUM(OFFSET($S$305:S305,0,0,COUNTA($S$305:S305),1)),SUMIF($R$19:$R$253,$P306,$W$19:$W$253))","v":0},null,null,{"$f":"IF(P307=\"\",$V$327-SUM(OFFSET($V$305:V305,0,0,COUNTA($V$305:V305),1)),ROUND(S306*(1+BDI.Taxa),2))","v":0},null,{"$f":"IF(P307=\"\",$X$327-SUM(OFFSET($X$305:X305,0,0,COUNTA($X$305:X305),1)),ROUND(V306*100/ORÇAMENTO.Totalorçamento,2))","v":{"$error":"#DIV/0!"}}]
[null,null,null,null,null,null,null,null,null,null,null,null,null,null,"2.","PASSARELA MODELO 03 - PADRÃO SÉC. XXI 2015",null,null,{"$f":"IF(P308=\"\",$S$327-SUM(OFFSET($S$305:S306,0,0,COUNTA($S$305:S306),1)),SUMIF($R$19:$R$253,$P307,$W$19:$W$253))","v":0},null,null,{"$f":"IF(P308=\"\",$V$327-SUM(OFFSET($V$305:V306,0,0,COUNTA($V$305:V306),1)),ROUND(S307*(1+BDI.Taxa),2))","v":0},null,{"$f":"IF(P308=\"\",$X$327-SUM(OFFSET($X$305:X306,0,0,COUNTA($X$305:X306),1)),ROUND(V307*100/ORÇAMENTO.Totalorçamento,2))","v":{"$error":"#DIV/0!"}}]
[null,null,null,null,null,null,null,null,null,null,null,null,null,null,"3.","",null,null,{"$f":"IF(P309=\"\",$S$327-SUM(OFFSET($S$305:S307,0,0,COUNTA($S$305:S307),1)),SUMIF($R$19:$R$253,$P308,$W$19:$W$253))","v":0},null,null,{"$f":"IF(P309=\"\",$V$327-SUM(OFFSET($V$305:V307,0,0,COUNTA($V$305:V307),1)),ROUND(S308*(1+BDI.Taxa),2))","v":0},null,{"$f":"IF(P309=\"\",$X$327-SUM(OFFSET($X$305:X307,0,0,COUNTA($X$305:X307),1)),ROUND(V308*100/ORÇAMENTO.Totalorçamento,2))","v":{"$error":"#DIV/0!"}}]
[null,null,null,null,null,null,null,null,null,null,null,null,null,null,"4.","",null,null,{"$f":"IF(P310=\"\",$S$327-SUM(OFFSET($S$305:S308,0,0,COUNTA($S$305:S308),1)),SUMIF($R$19:$R$253,$P309,$W$19:$W$253))","v":0},null,null,{"$f":"IF(P310=\"\",$V$327-SUM(OFFSET($V$305:V308,0,0,COUNTA($V$305:V308),1)),ROUND(S309*(1+BDI.Taxa),2))","v":0},null,{"$f":"IF(P310=\"\",$X$327-SUM(OFFSET($X$305:X308,0,0,COUNTA($X$305:X308),1)),ROUND(V309*100/ORÇAMENTO.Totalorçamento,2))","v":{"$error":"#DIV/0!"}}]
[null,null,null,null,null,null,null,null,null,null,null,null,null,null,"5.","",null,null,{"$f":"IF(P311=\"\",$S$327-SUM(OFFSET($S$305:S309,0,0,COUNTA($S$305:S309),1)),SUMIF($R$19:$R$253,$P310,$W$19:$W$253))","v":0},null,null,{"$f":"IF(P311=\"\",$V$327-SUM(OFFSET($V$305:V309,0,0,COUNTA($V$305:V309),1)),ROUND(S310*(1+BDI.Taxa),2))","v":0},null,{"$f":"IF(P311=\"\",$X$327-SUM(OFFSET($X$305:X309,0,0,COUNTA($X$305:X309),1)),ROUND(V310*100/ORÇAMENTO.Totalorçamento,2))","v":{"$error":"#DIV/0!"}}]
[null,null,null,null,null,null,null,null,null,null,null,null,null,null,"6.","",null,null,{"$f":"IF(P312=\"\",$S$327-SUM(OFFSET($S$305:S310,0,0,COUNTA($S$305:S310),1)),SUMIF($R$19:$R$253,$P311,$W$19:$W$253))","v":0},null,null,{"$f":"IF(P312=\"\",$V$327-SUM(OFFSET($V$305:V310,0,0,COUNTA($V$305:V310),1)),ROUND(S311*(1+BDI.Taxa),2))","v":0},null,{"$f":"IF(P312=\"\",$X$327-SUM(OFFSET($X$305:X310,0,0,COUNTA($X$305:X310),1)),ROUND(V311*100/ORÇAMENTO.Totalorçamento,2))","v":{"$error":"#DIV/0!"}}]
[null,null,null,null,null,null,null,null,null,null,null,null,null,null,"7.","",null,null,{"$f":"IF(P313=\"\",$S$327-SUM(OFFSET($S$305:S311,0,0,COUNTA($S$305:S311),1)),SUMIF($R$19:$R$253,$P312,$W$19:$W$253))","v":0},null,null,{"$f":"IF(P313=\"\",$V$327-SUM(OFFSET($V$305:V311,0,0,COUNTA($V$305:V311),1)),ROUND(S312*(1+BDI.Taxa),2))","v":0},null,{"$f":"IF(P313=\"\",$X$327-SUM(OFFSET($X$305:X311,0,0,COUNTA($X$305:X311),1)),ROUND(V312*100/ORÇAMENTO.Totalorçamento,2))","v":{"$error":"#DIV/0!"}}]
[null,null,null,null,null,null,null,null,null,null,null,null,null,null,"8.","",null,null,{"$f":"IF(P314=\"\",$S$327-SUM(OFFSET($S$305:S312,0,0,COUNTA($S$305:S312),1)),SUMIF($R$19:$R$253,$P313,$W$19:$W$253))","v":0},null,null,{"$f":"IF(P314=\"\",$V$327-SUM(OFFSET($V$305:V312,0,0,COUNTA($V$305:V312),1)),ROUND(S313*(1+BDI.Taxa),2))","v":0},null,{"$f":"IF(P314=\"\",$X$327-SUM(OFFSET($X$305:X312,0,0,COUNTA($X$305:X312),1)),ROUND(V313*100/ORÇAMENTO.Totalorçamento,2))","v":{"$error":"#DIV/0!"}}]
[null,null,null,null,null,null,null,null,null,null,null,null,null,null,"9.","",null,null,{"$f":"IF(P315=\"\",$S$327-SUM(OFFSET($S$305:S313,0,0,COUNTA($S$305:S313),1)),SUMIF($R$19:$R$253,$P314,$W$19:$W$253))","v":0},null,null,{"$f":"IF(P315=\"\",$V$327-SUM(OFFSET($V$305:V313,0,0,COUNTA($V$305:V313),1)),ROUND(S314*(1+BDI.Taxa),2))","v":0},null,{"$f":"IF(P315=\"\",$X$327-SUM(OFFSET($X$305:X313,0,0,COUNTA($X$305:X313),1)),ROUND(V314*100/ORÇAMENTO.Totalorçamento,2))","v":{"$error":"#DIV/0!"}}]
[null,null,null,null,null,null,null,null,null,null,null,null,null,null,"10.","",null,null,{"$f":"IF(P316=\"\",$S$327-SUM(OFFSET($S$305:S314,0,0,COUNTA($S$305:S314),1)),SUMIF($R$19:$R$253,$P315,$W$19:$W$253))","v":0},null,null,{"$f":"IF(P316=\"\",$V$327-SUM(OFFSET($V$305:V314,0,0,COUNTA($V$305:V314),1)),ROUND(S315*(1+BDI.Taxa),2))","v":0},null,{"$f":"IF(P316=\"\",$X$327-SUM(OFFSET($X$305:X314,0,0,COUNTA($X$305:X314),1)),ROUND(V315*100/ORÇAMENTO.Totalorçamento,2))","v":{"$error":"#DIV/0!"}}]
[null,null,null,null,null,null,null,null,null,null,null,null,null,null,"11.","",null,null,{"$f":"IF(P317=\"\",$S$327-SUM(OFFSET($S$305:S315,0,0,COUNTA($S$305:S315),1)),SUMIF($R$19:$R$253,$P316,$W$19:$W$253))","v":0},null,null,{"$f":"IF(P317=\"\",$V$327-SUM(OFFSET($V$305:V315,0,0,COUNTA($V$305:V315),1)),ROUND(S316*(1+BDI.Taxa),2))","v":0},null,{"$f":"IF(P317=\"\",$X$327-SUM(OFFSET($X$305:X315,0,0,COUNTA($X$305:X315),1)),ROUND(V316*100/ORÇAMENTO.Totalorçamento,2))","v":{"$error":"#DIV/0!"}}]
[null,null,null,null,null,null,null,null,null,null,null,null,null,null,"12.","",null,null,{"$f":"IF(P318=\"\",$S$327-SUM(OFFSET($S$305:S316,0,0,COUNTA($S$305:S316),1)),SUMIF($R$19:$R$253,$P317,$W$19:$W$253))","v":0},null,null,{"$f":"IF(P318=\"\",$V$327-SUM(OFFSET($V$305:V316,0,0,COUNTA($V$305:V316),1)),ROUND(S317*(1+BDI.Taxa),2))","v":0},null,{"$f":"IF(P318=\"\",$X$327-SUM(OFFSET($X$305:X316,0,0,COUNTA($X$305:X316),1)),ROUND(V317*100/ORÇAMENTO.Totalorçamento,2))","v":{"$error":"#DIV/0!"}}]
[null,null,null,null,null,null,null,null,null,null,null,null,null,null,"13.","",null,null,{"$f":"IF(P319=\"\",$S$327-SUM(OFFSET($S$305:S317,0,0,COUNTA($S$305:S317),1)),SUMIF($R$19:$R$253,$P318,$W$19:$W$253))","v":0},null,null,{"$f":"IF(P319=\"\",$V$327-SUM(OFFSET($V$305:V317,0,0,COUNTA($V$305:V317),1)),ROUND(S318*(1+BDI.Taxa),2))","v":0},null,{"$f":"IF(P319=\"\",$X$327-SUM(OFFSET($X$305:X317,0,0,COUNTA($X$305:X317),1)),ROUND(V318*100/ORÇAMENTO.Totalorçamento,2))","v":{"$error":"#DIV/0!"}}]
[null,null,null,null,null,null,null,null,null,null,null,null,null,null,"14.","",null,null,{"$f":"IF(P320=\"\",$S$327-SUM(OFFSET($S$305:S318,0,0,COUNTA($S$305:S318),1)),SUMIF($R$19:$R$253,$P319,$W$19:$W$253))","v":0},null,null,{"$f":"IF(P320=\"\",$V$327-SUM(OFFSET($V$305:V318,0,0,COUNTA($V$305:V318),1)),ROUND(S319*(1+BDI.Taxa),2))","v":0},null,{"$f":"IF(P320=\"\",$X$327-SUM(OFFSET($X$305:X318,0,0,COUNTA($X$305:X318),1)),ROUND(V319*100/ORÇAMENTO.Totalorçamento,2))","v":{"$error":"#DIV/0!"}}]
[null,null,null,null,null,null,null,null,null,null,null,null,null,null,"15.","",null,null,{"$f":"IF(P321=\"\",$S$327-SUM(OFFSET($S$305:S319,0,0,COUNTA($S$305:S319),1)),SUMIF($R$19:$R$253,$P320,$W$19:$W$253))","v":0},null,null,{"$f":"IF(P321=\"\",$V$327-SUM(OFFSET($V$305:V319,0,0,COUNTA($V$305:V319),1)),ROUND(S320*(1+BDI.Taxa),2))","v":0},null,{"$f":"IF(P321=\"\",$X$327-SUM(OFFSET($X$305:X319,0,0,COUNTA($X$305:X319),1)),ROUND(V320*100/ORÇAMENTO.Totalorçamento,2))","v":{"$error":"#DIV/0!"}}]
[null,null,null,null,null,null,null,null,null,null,null,null,null,null,"16.","",null,null,{"$f":"IF(P322=\"\",$S$327-SUM(OFFSET($S$305:S320,0,0,COUNTA($S$305:S320),1)),SUMIF($R$19:$R$253,$P321,$W$19:$W$253))","v":0},null,null,{"$f":"IF(P322=\"\",$V$327-SUM(OFFSET($V$305:V320,0,0,COUNTA($V$305:V320),1)),ROUND(S321*(1+BDI.Taxa),2))","v":0},null,{"$f":"IF(P322=\"\",$X$327-SUM(OFFSET($X$305:X320,0,0,COUNTA($X$305:X320),1)),ROUND(V321*100/ORÇAMENTO.Totalorçamento,2))","v":{"$error":"#DIV/0!"}}]
[null,null,null,null,null,null,null,null,null,null,null,null,null,null,"17.","",null,null,{"$f":"IF(P323=\"\",$S$327-SUM(OFFSET($S$305:S321,0,0,COUNTA($S$305:S321),1)),SUMIF($R$19:$R$253,$P322,$W$19:$W$253))","v":0},null,null,{"$f":"IF(P323=\"\",$V$327-SUM(OFFSET($V$305:V321,0,0,COUNTA($V$305:V321),1)),ROUND(S322*(1+BDI.Taxa),2))","v":0},null,{"$f":"IF(P323=\"\",$X$327-SUM(OFFSET($X$305:X321,0,0,COUNTA($X$305:X321),1)),ROUND(V322*100/ORÇAMENTO.Totalorçamento,2))","v":{"$error":"#DIV/0!"}}]
[null,null,null,null,null,null,null,null,null,null,null,null,null,null,"18.","",null,null,{"$f":"IF(P324=\"\",$S$327-SUM(OFFSET($S$305:S322,0,0,COUNTA($S$305:S322),1)),SUMIF($R$19:$R$253,$P323,$W$19:$W$253))","v":0},null,null,{"$f":"IF(P324=\"\",$V$327-SUM(OFFSET($V$305:V322,0,0,COUNTA($V$305:V322),1)),ROUND(S323*(1+BDI.Taxa),2))","v":0},null,{"$f":"IF(P324=\"\",$X$327-SUM(OFFSET($X$305:X322,0,0,COUNTA($X$305:X322),1)),ROUND(V323*100/ORÇAMENTO.Totalorçamento,2))","v":{"$error":"#DIV/0!"}}]
[null,null,null,null,null,null,null,null,null,null,null,null,null,null,"19.","",null,null,{"$f":"IF(P325=\"\",$S$327-SUM(OFFSET($S$305:S323,0,0,COUNTA($S$305:S323),1)),SUMIF($R$19:$R$253,$P324,$W$19:$W$253))","v":0},null,null,{"$f":"IF(P325=\"\",$V$327-SUM(OFFSET($V$305:V323,0,0,COUNTA($V$305:V323),1)),ROUND(S324*(1+BDI.Taxa),2))","v":0},null,{"$f":"IF(P325=\"\",$X$327-SUM(OFFSET($X$305:X323,0,0,COUNTA($X$305:X323),1)),ROUND(V324*100/ORÇAMENTO.Totalorçamento,2))","v":{"$error":"#DIV/0!"}}]
[null,null,null,null,null,null,null,null,null,null,null,null,null,null,"20.","",null,null,{"$f":"IF(P326=\"\",$S$327-SUM(OFFSET($S$305:S324,0,0,COUNTA($S$305:S324),1)),SUMIF($R$19:$R$253,$P325,$W$19:$W$253))","v":0},null,null,{"$f":"IF(P326=\"\",$V$327-SUM(OFFSET($V$305:V324,0,0,COUNTA($V$305:V324),1)),ROUND(S325*(1+BDI.Taxa),2))","v":0},null,{"$f":"IF(P326=\"\",$X$327-SUM(OFFSET($X$305:X324,0,0,COUNTA($X$305:X324),1)),ROUND(V325*100/ORÇAMENTO.Totalorçamento,2))","v":{"$error":"#DIV/0!"}}]
[null,null,null,null,null,null,null,null,null,null,null,null,null,null,"TOTAL GERAL DO ORÇAMENTO (R$)",null,null,null,{"$f":"SUM(S306:U325)","v":0},null,null,{"$f":"SUM(V306:W325)","v":0},null,{"$f":"SUM(X306:X325)","v":{"$error":"#DIV/0!"}}]
[null,null,null,null,null,null,null,null,null,null,null,null,null,null,null,null,null,null,{"$f":"$W$254","v":0},null,null,{"$f":"$W$256","v":0},null,100]
[null,null,null,null,null,null,null,null,null,null,null,null,null,null,null,null,null,null,"(TOTAL SEM BDI)",null,null,"(TOTAL COM BDI)",null,"(ARRED porcentagem)"]
[null,null,null,null,null,null,null,null,null,null,null,null,null,null,null,null,null,null,{"$f":"IF(AND(S326=S327,S326>0),\"OK\",\"ERRO\")","v":"ERRO"},null,null,{"$f":"IF(AND(V326=V327,V326>0),\"OK\",\"ERRO\")","v":"ERRO"},null,{"$f":"IF(AND(X326=100,S306<>0),\"OK\",\"ERRO\")","v":{"$error":"#DIV/0!"}}]

{"sheet":"Resumo ","index":1,"n_rows":39,"n_cols":9,"rows_kept":39,"cut":false,"hidden":false,"merged":[[42,3,42,7],[11,1,11,2],[12,1,12,2],[15,2,15,3],[16,2,16,3],[14,1,14,8],[17,2,17,3],[23,2,23,3],[18,2,18,3],[19,2,19,3],[20,2,20,3],[41,3,41,7],[24,2,24,3],[26,2,26,3],[27,2,27,3],[38,1,38,8],[1,1,1,8],[2,6,2,8],[3,6,3,8],[4,1,4,8],[5,6,5,8],[6,6,6,8],[7,1,7,8],[8,6,8,8],[9,6,9,8],[13,1,13,8],[0,1,0,8],[36,1,36,5],[2,1,2,5],[3,1,3,5],[5,1,5,5],[6,1,6,5],[8,1,8,5],[9,1,9,5],[11,3,11,5],[12,3,12,5],[10,1,10,8],[11,6,11,8],[12,6,12,8],[25,2,25,3],[21,2,21,3],[22,2,22,3],[13,0,14,0],[34,2,34,3],[35,2,35,3],[31,2,31,3],[32,2,32,3],[33,2,33,3],[28,2,28,3],[29,2,29,3],[30,2,30,3]]}
[]
[]
[null,"UNIDADE ESCOLAR",null,null,null,null,"CÓDIGO INEP"]
[null,{"$f":"Orçamento!$O$4","v":"COLÉGIO ESTADUAL ANA ALGEMIRA DO PRADO"},null,null,null,null,{"$f":"Orçamento!V4","v":52053970}]
[]
[null,"OBRA",null,null,null,null,"CIDADE"]
[null,{"$f":"Orçamento!$O$7","v":"REFORMA E AMPLIAÇÃO"},null,null,null,null,{"$f":"Orçamento!$V$7","v":"PALESTINA DE GOIÁS"}]
[]
[null,"ENDEREÇO",null,null,null,null,"CRE"]
[null,{"$f":"Orçamento!$R$10","v":"AV RUI BARBOSA S/N QUADRA 21, CENTRO, CEP:75845-000"},null,null,null,null,{"$f":"Orçamento!$O$10","v":"IPORÁ"}]
[]
[null,"REFERÊNCIA",null,"DATA",null,null,"ÁREA TOTAL CONSTRUÍDA (M²)"]
[null,{"$f":"CONCATENATE(\"AGETOP E SINAPI - \",Orçamento!$T$10)","v":"AGETOP E SINAPI - ONERADA"},null,{"$f":"Orçamento!$S$7","v":"2020-05-07"},null,null,{"$f":"Orçamento!$V$13","v":1297.46}]
["FILTRO"]
[null," "]
["↓","ITEM","DESCRIÇÃO DOS SERVIÇOS",null,"UNID","QUANT","PREÇO SEM BDI","PREÇO COM BDI","PARTICIP. (%)"]
[{"$f":"IF(H17>0,\"F\",\"\")","v":""},"1.",{"$f":"Orçamento!$P306","v":"REFORMA"},null,{"$f":"IF(C17<>\"\",\"UN\",\"\")","v":"UN"},{"$f":"IF(C17<>\"\",1,\"\")","v":1},{"$f":"IFERROR(Orçamento!S306,\"-\")","v":0},{"$f":"IFERROR(Orçamento!V306,\"\")","v":0},{"$f":"Orçamento!X306","v":{"$error":"#DIV/0!"}}]
[{"$f":"IF(H18>0,\"F\",\"\")","v":""},"2.",{"$f":"Orçamento!$P307","v":"PASSARELA MODELO 03 - PADRÃO SÉC. XXI 2015"},null,{"$f":"IF(C18<>\"\",\"UN\",\"\")","v":"UN"},{"$f":"IF(C18<>\"\",1,\"\")","v":1},{"$f":"IFERROR(Orçamento!S307,\"-\")","v":0},{"$f":"IFERROR(Orçamento!V307,\"\")","v":0},{"$f":"Orçamento!X307","v":{"$error":"#DIV/0!"}}]
[{"$f":"IF(H19>0,\"F\",\"\")","v":""},"3.",{"$f":"Orçamento!$P308","v":""},null,"","",{"$f":"IFERROR(Orçamento!S308,\"-\")","v":0},{"$f":"IFERROR(Orçamento!V308,\"\")","v":0},{"$f":"Orçamento!X308","v":{"$error":"#DIV/0!"}}]
["","4.",{"$f":"Orçamento!$P309","v":""},null,"","",{"$f":"IFERROR(Orçamento!S309,\"-\")","v":0},{"$f":"IFERROR(Orçamento!V309,\"\")","v":0},{"$f":"Orçamento!X309","v":{"$error":"#DIV/0!"}}]
["","5.",{"$f":"Orçamento!$P310","v":""},null,"","",{"$f":"IFERROR(Orçamento!S310,\"-\")","v":0},{"$f":"IFERROR(Orçamento!V310,\"\")","v":0},{"$f":"Orçamento!X310","v":{"$error":"#DIV/0!"}}]
["","6.",{"$f":"Orçamento!$P311","v":""},null,"","",{"$f":"IFERROR(Orçamento!S311,\"-\")","v":0},{"$f":"IFERROR(Orçamento!V311,\"\")","v":0},{"$f":"Orçamento!X311","v":{"$error":"#DIV/0!"}}]
["","7.",{"$f":"Orçamento!$P312","v":""},null,"","",{"$f":"IFERROR(Orçamento!S312,\"-\")","v":0},{"$f":"IFERROR(Orçamento!V312,\"\")","v":0},{"$f":"Orçamento!X312","v":{"$error":"#DIV/0!"}}]
["","8.",{"$f":"Orçamento!$P313","v":""},null,"","",{"$f":"IFERROR(Orçamento!S313,\"-\")","v":0},{"$f":"IFERROR(Orçamento!V313,\"\")","v":0},{"$f":"Orçamento!X313","v":{"$error":"#DIV/0!"}}]
["","9.",{"$f":"Orçamento!$P314","v":""},null,"","",{"$f":"IFERROR(Orçamento!S314,\"-\")","v":0},{"$f":"IFERROR(Orçamento!V314,\"\")","v":0},{"$f":"Orçamento!X314","v":{"$error":"#DIV/0!"}}]
["","10.",{"$f":"Orçamento!$P315","v":""},null,"","",{"$f":"IFERROR(Orçamento!S315,\"-\")","v":0},{"$f":"IFERROR(Orçamento!V315,\"\")","v":0},{"$f":"Orçamento!X315","v":{"$error":"#DIV/0!"}}]
["","11.",{"$f":"Orçamento!$P316","v":""},null,"","",{"$f":"IFERROR(Orçamento!S316,\"-\")","v":0},{"$f":"IFERROR(Orçamento!V316,\"\")","v":0},{"$f":"Orçamento!X316","v":{"$error":"#DIV/0!"}}]
["","12.",{"$f":"Orçamento!$P317","v":""},null,"","",{"$f":"IFERROR(Orçamento!S317,\"-\")","v":0},{"$f":"IFERROR(Orçamento!V317,\"\")","v":0},{"$f":"Orçamento!X317","v":{"$error":"#DIV/0!"}}]
["","13.",{"$f":"Orçamento!$P318","v":""},null,"","",{"$f":"IFERROR(Orçamento!S318,\"-\")","v":0},{"$f":"IFERROR(Orçamento!V318,\"\")","v":0},{"$f":"Orçamento!X318","v":{"$error":"#DIV/0!"}}]
["","14.",{"$f":"Orçamento!$P319","v":""},null,"","",{"$f":"IFERROR(Orçamento!S319,\"-\")","v":0},{"$f":"IFERROR(Orçamento!V319,\"\")","v":0},{"$f":"Orçamento!X319","v":{"$error":"#DIV/0!"}}]
["","15.",{"$f":"Orçamento!$P320","v":""},null,"","",{"$f":"IFERROR(Orçamento!S320,\"-\")","v":0},{"$f":"IFERROR(Orçamento!V320,\"\")","v":0},{"$f":"Orçamento!X320","v":{"$error":"#DIV/0!"}}]
["","16.",{"$f":"Orçamento!$P321","v":""},null,"","",{"$f":"IFERROR(Orçamento!S321,\"-\")","v":0},{"$f":"IFERROR(Orçamento!V321,\"\")","v":0},{"$f":"Orçamento!X321","v":{"$error":"#DIV/0!"}}]
["","17.",{"$f":"Orçamento!$P322","v":""},null,"","",{"$f":"IFERROR(Orçamento!S322,\"-\")","v":0},{"$f":"IFERROR(Orçamento!V322,\"\")","v":0},{"$f":"Orçamento!X322","v":{"$error":"#DIV/0!"}}]
["","18.",{"$f":"Orçamento!$P323","v":""},null,"","",{"$f":"IFERROR(Orçamento!S323,\"-\")","v":0},{"$f":"IFERROR(Orçamento!V323,\"\")","v":0},{"$f":"Orçamento!X323","v":{"$error":"#DIV/0!"}}]
["","19.",{"$f":"Orçamento!$P324","v":""},null,"","",{"$f":"IFERROR(Orçamento!S324,\"-\")","v":0},{"$f":"IFERROR(Orçamento!V324,\"\")","v":0},{"$f":"Orçamento!X324","v":{"$error":"#DIV/0!"}}]
["","20.",{"$f":"Orçamento!$P325","v":""},null,"","",{"$f":"IFERROR(Orçamento!S325,\"-\")","v":0},{"$f":"IFERROR(Orçamento!V325,\"\")","v":0},{"$f":"Orçamento!X325","v":{"$error":"#DIV/0!"}}]
["F","TOTAL GERAL DO ORÇAMENTO (R$)",null,null,null,null,{"$f":"SUM(G17:G36)","v":0},{"$f":"SUM(H17:H36)","v":0},{"$f":"SUM(I17:I36)","v":{"$error":"#DIV/0!"}}]
["F"]
["F"]

{"sheet":"Somatório","index":2,"n_rows":46,"n_cols":6,"rows_kept":46,"cut":false,"hidden":false,"merged":[[0,1,0,5],[14,1,14,5],[2,1,2,3],[2,4,2,5],[3,1,3,3],[3,4,3,5],[5,1,5,3],[5,4,5,5],[6,1,6,3],[6,4,6,5],[8,1,8,3],[8,4,8,5],[1,1,1,5],[4,1,4,5],[7,1,7,5],[10,1,10,5],[9,1,9,3],[9,4,9,5],[11,1,11,2],[11,4,11,5],[12,1,12,2],[12,4,12,5],[13,0,14,0],[42,1,42,2],[44,1,44,5],[47,3,47,5],[48,3,48,5],[13,1,13,5]]}
[]
[]
[null,"UNIDADE ESCOLAR",null,null,"CÓDIGO INEP"]
[null,{"$f":"Orçamento!$O$4","v":"COLÉGIO ESTADUAL ANA ALGEMIRA DO PRADO"},null,null,{"$f":"Orçamento!V4","v":52053970}]
[]
[null,"OBRA",null,null,"CIDADE"]
[null,{"$f":"Orçamento!$O$7","v":"REFORMA E AMPLIAÇÃO"},null,null,{"$f":"Orçamento!$V$7","v":"PALESTINA DE GOIÁS"}]
[]
[null,"ENDEREÇO",null,null,"CRE"]
[null,{"$f":"Orçamento!$R$10","v":"AV RUI BARBOSA S/N QUADRA 21, CENTRO, CEP:75845-000"},null,null,{"$f":"Orçamento!$O$10","v":"IPORÁ"}]
[]
[null,"REFERÊNCIA",null,"DATA","ÁREA TOTAL CONSTRUÍDA (M²)"]
[null,{"$f":"CONCATENATE(\"AGETOP E SINAPI - \",Orçamento!$T$10)","v":"AGETOP E SINAPI - ONERADA"},null,{"$f":"Orçamento!$S$7","v":"2020-05-07"},{"$f":"Orçamento!$V$13","v":1297.46}]
["FILTRO"]
[null,"SOMATÓRIO DE SERVIÇOS"]
["↓","ITEM","DESCRIÇÃO DOS SERVIÇOS","PREÇO SEM BDI (R$)","PREÇO COM BDI (R$)","PARTIC.  ( % )"]
[{"$f":"IF(D17>0,\"F\",\"\")","v":""},"a.",{"$f":"Orçamento!P272","v":"SERVIÇOS PRELIMINARES"},{"$f":"Orçamento!S272","v":0},{"$f":"Orçamento!V272","v":0},{"$f":"Orçamento!X272","v":0}]
[{"$f":"IF(D18>0,\"F\",\"\")","v":""},"b.",{"$f":"Orçamento!P273","v":"TRANSPORTES"},{"$f":"Orçamento!S273","v":0},{"$f":"Orçamento!V273","v":0},{"$f":"Orçamento!X273","v":0}]
["","c.",{"$f":"Orçamento!P274","v":"SERVIÇO EM TERRA"},{"$f":"Orçamento!S274","v":0},{"$f":"Orçamento!V274","v":0},{"$f":"Orçamento!X274","v":0}]
["","d.",{"$f":"Orçamento!P275","v":"FUNDAÇÕES E SONDAGENS"},{"$f":"Orçamento!S275","v":0},{"$f":"Orçamento!V275","v":0},{"$f":"Orçamento!X275","v":0}]
["","e.",{"$f":"Orçamento!P276","v":"ESTRUTURA"},{"$f":"Orçamento!S276","v":0},{"$f":"Orçamento!V276","v":0},{"$f":"Orçamento!X276","v":0}]
["","f.",{"$f":"Orçamento!P277","v":"INSTALAÇÕES ELÉTRICAS"},{"$f":"Orçamento!S277","v":0},{"$f":"Orçamento!V277","v":0},{"$f":"Orçamento!X277","v":0}]
["","g.",{"$f":"Orçamento!P278","v":"INSTALAÇÕES HIDROSSANITÁRIAS"},{"$f":"Orçamento!S278","v":0},{"$f":"Orçamento!V278","v":0},{"$f":"Orçamento!X278","v":0}]
["","h.",{"$f":"Orçamento!P279","v":"INSTALAÇÕES ESPECIAIS"},{"$f":"Orçamento!S279","v":0},{"$f":"Orçamento!V279","v":0},{"$f":"Orçamento!X279","v":0}]
["","i.",{"$f":"Orçamento!P280","v":"ALVENARIAS E DIVISÓRIAS"},{"$f":"Orçamento!S280","v":0},{"$f":"Orçamento!V280","v":0},{"$f":"Orçamento!X280","v":0}]
["","j.",{"$f":"Orçamento!P281","v":"ALVENARIA AUTO-PORTANTE"},{"$f":"Orçamento!S281","v":0},{"$f":"Orçamento!V281","v":0},{"$f":"Orçamento!X281","v":0}]
["","k.",{"$f":"Orçamento!P282","v":"IMPERMEABILIZAÇÃO"},{"$f":"Orçamento!S282","v":0},{"$f":"Orçamento!V282","v":0},{"$f":"Orçamento!X282","v":0}]
["","l.",{"$f":"Orçamento!P283","v":"ISOLAMENTO TÉRMICO E ACÚSTICO"},{"$f":"Orçamento!S283","v":0},{"$f":"Orçamento!V283","v":0},{"$f":"Orçamento!X283","v":0}]
["","m.",{"$f":"Orçamento!P284","v":"ESTRUTURA DE MADEIRA"},{"$f":"Orçamento!S284","v":0},{"$f":"Orçamento!V284","v":0},{"$f":"Orçamento!X284","v":0}]
["","n.",{"$f":"Orçamento!P285","v":"ESTRUTURAS METÁLICAS"},{"$f":"Orçamento!S285","v":0},{"$f":"Orçamento!V285","v":0},{"$f":"Orçamento!X285","v":0}]
["","o.",{"$f":"Orçamento!P286","v":"COBERTURAS"},{"$f":"Orçamento!S286","v":0},{"$f":"Orçamento!V286","v":0},{"$f":"Orçamento!X286","v":0}]
["","p.",{"$f":"Orçamento!P287","v":"ESQUADRIAS DE MADEIRA"},{"$f":"Orçamento!S287","v":0},{"$f":"Orçamento!V287","v":0},{"$f":"Orçamento!X287","v":0}]
["","q.",{"$f":"Orçamento!P288","v":"ESQUADRIAS METÁLICAS"},{"$f":"Orçamento!S288","v":0},{"$f":"Orçamento!V288","v":0},{"$f":"Orçamento!X288","v":0}]
["","r.",{"$f":"Orçamento!P289","v":"VIDROS"},{"$f":"Orçamento!S289","v":0},{"$f":"Orçamento!V289","v":0},{"$f":"Orçamento!X289","v":0}]
["","s.",{"$f":"Orçamento!P290","v":"REVESTIMENTO DE PAREDE"},{"$f":"Orçamento!S290","v":0},{"$f":"Orçamento!V290","v":0},{"$f":"Orçamento!X290","v":0}]
["","t.",{"$f":"Orçamento!P291","v":"FORROS"},{"$f":"Orçamento!S291","v":0},{"$f":"Orçamento!V291","v":0},{"$f":"Orçamento!X291","v":0}]
["","u.",{"$f":"Orçamento!P292","v":"REVESTIMENTO DE PISO"},{"$f":"Orçamento!S292","v":0},{"$f":"Orçamento!V292","v":0},{"$f":"Orçamento!X292","v":0}]
["","v.",{"$f":"Orçamento!P293","v":"FERRAGENS"},{"$f":"Orçamento!S293","v":0},{"$f":"Orçamento!V293","v":0},{"$f":"Orçamento!X293","v":0}]
["","w.",{"$f":"Orçamento!P294","v":"MARCENARIA"},{"$f":"Orçamento!S294","v":0},{"$f":"Orçamento!V294","v":0},{"$f":"Orçamento!X294","v":0}]
["","x.",{"$f":"Orçamento!P295","v":"ADMINISTRAÇÃO"},{"$f":"Orçamento!S295","v":0},{"$f":"Orçamento!V295","v":0},{"$f":"Orçamento!X295","v":0}]
["","y.",{"$f":"Orçamento!P296","v":"PINTURA"},{"$f":"Orçamento!S296","v":0},{"$f":"Orçamento!V296","v":0},{"$f":"Orçamento!X296","v":0}]
["","z.",{"$f":"Orçamento!P297","v":"DIVERSOS"},{"$f":"Orçamento!S297","v":0},{"$f":"Orçamento!V297","v":0},{"$f":"Orçamento!X297","v":0}]
["F","TOTAL GERAL DO ORÇAMENTO",null,{"$f":"SUM(D17:D42)","v":0},{"$f":"SUM(E17:E42)","v":0},{"$f":"SUM(F17:F42)","v":0}]
[]
[null,"(*) Para itens da AGETOP, os vidros não estão inclusos nas esquadrias e já foram considerados os custos de contramarco para as esquadrias de alumínio;"]
[null,null,null,null,{"$f":"E43-330000","v":-330000}]

{"sheet":"Cronog_90_Dias","index":3,"n_rows":99,"n_cols":20,"rows_kept":99,"cut":false,"hidden":false,"merged":[[97,1,97,4],[98,1,98,17],[94,1,94,2],[94,5,94,8],[94,9,94,12],[94,13,94,16],[95,1,95,2],[95,5,95,8],[95,9,95,12],[95,13,95,16],[92,1,92,2],[92,5,92,8],[92,9,92,12],[92,13,92,16],[93,1,93,2],[93,5,93,8],[93,9,93,12],[93,13,93,16],[89,1,91,2],[89,3,91,3],[89,4,91,4],[89,5,89,8],[89,9,89,12],[89,13,89,16],[91,5,91,8],[91,9,91,12],[91,13,91,16],[86,1,88,2],[86,3,88,3],[86,4,88,4],[86,5,86,8],[86,9,86,12],[86,13,86,16],[88,5,88,8],[88,9,88,12],[88,13,88,16],[83,1,85,2],[83,3,85,3],[83,4,85,4],[83,5,83,8],[83,9,83,12],[83,13,83,16],[85,5,85,8],[85,9,85,12],[85,13,85,16],[80,1,82,2],[80,3,82,3],[80,4,82,4],[80,5,80,8],[80,9,80,12],[80,13,80,16],[82,5,82,8],[82,9,82,12],[82,13,82,16],[77,1,79,2],[77,3,79,3],[77,4,79,4],[77,5,77,8],[77,9,77,12],[77,13,77,16],[79,5,79,8],[79,9,79,12],[79,13,79,16],[74,1,76,2],[74,3,76,3],[74,4,76,4],[74,5,74,8],[74,9,74,12],[74,13,74,16],[76,5,76,8],[76,9,76,12],[76,13,76,16],[71,1,73,2],[71,3,73,3],[71,4,73,4],[71,5,71,8],[71,9,71,12],[71,13,71,16],[73,5,73,8],[73,9,73,12],[73,13,73,16],[68,1,70,2],[68,3,70,3],[68,4,70,4],[68,5,68,8],[68,9,68,12],[68,13,68,16],[70,5,70,8],[70,9,70,12],[70,13,70,16],[65,1,67,2],[65,3,67,3],[65,4,67,4],[65,5,65,8],[65,9,65,12],[65,13,65,16],[67,5,67,8],[67,9,67,12],[67,13,67,16],[62,1,64,2],[62,3,64,3],[62,4,64,4],[62,5,62,8],[62,9,62,12],[62,13,62,16],[64,5,64,8],[64,9,64,12],[64,13,64,16],[59,1,61,2],[59,3,61,3],[59,4,61,4],[59,5,59,8],[59,9,59,12],[59,13,59,16],[61,5,61,8],[61,9,61,12],[61,13,61,16],[56,1,58,2],[56,3,58,3],[56,4,58,4],[56,5,56,8],[56,9,56,12],[56,13,56,16],[58,5,58,8],[58,9,58,12],[58,13,58,16],[53,1,55,2],[53,3,55,3],[53,4,55,4],[53,5,53,8],[53,9,53,12],[53,13,53,16],[55,5,55,8],[55,9,55,12],[55,13,55,16],[50,1,52,2],[50,3,52,3],[50,4,52,4],[50,5,50,8],[50,9,50,12],[50,13,50,16],[52,5,52,8],[52,9,52,12],[52,13,52,16],[47,1,49,2],[47,3,49,3],[47,4,49,4],[47,5,47,8],[47,9,47,12],[47,13,47,16],[49,5,49,8],[49,9,49,12],[49,13,49,16],[44,1,46,2],[44,3,46,3],[44,4,46,4],[44,5,44,8],[44,9,44,12],[44,13,44,16],[46,5,46,8],[46,9,46,12],[46,13,46,16],[41,1,43,2],[41,3,43,3],[41,4,43,4],[41,5,41,8],[41,9,41,12],[41,13,41,16],[43,5,43,8],[43,9,43,12],[43,13,43,16],[38,1,40,2],[38,3,40,3],[38,4,40,4],[38,5,38,8],[38,9,38,12],[38,13,38,16],[40,5,40,8],[40,9,40,12],[40,13,40,16],[35,1,37,2],[35,3,37,3],[35,4,37,4],[35,5,35,8],[35,9,35,12],[35,13,35,16],[37,5,37,8],[37,9,37,12],[37,13,37,16],[32,1,34,2],[32,3,34,3],[32,4,34,4],[32,5,32,8],[32,9,32,12],[32,13,32,16],[34,5,34,8],[34,9,34,12],[34,13,34,16],[29,1,31,2],[29,3,31,3],[29,4,31,4],[29,5,29,8],[29,9,29,12],[29,13,29,16],[31,5,31,8],[31,9,31,12],[31,13,31,16],[26,1,28,2],[26,3,28,3],[26,4,28,4],[26,5,26,8],[26,9,26,12],[26,13,26,16],[28,5,28,8],[28,9,28,12],[28,13,28,16],[23,1,25,2],[23,3,25,3],[23,4,25,4],[23,5,23,8],[23,9,23,12],[23,13,23,16],[25,5,25,8],[25,9,25,12],[25,13,25,16],[20,1,22,2],[20,3,22,3],[20,4,22,4],[20,5,20,8],[20,9,20,12],[20,13,20,16],[22,5,22,8],[22,9,22,12],[22,13,22,16],[17,1,19,2],[17,3,19,3],[17,4,19,4],[17,5,17,8],[17,9,17,12],[17,13,17,16],[19,5,19,8],[19,9,19,12],[19,13,19,16],[14,1,16,2],[14,3,16,3],[14,4,16,4],[14,5,14,8],[14,9,14,12],[14,13,14,16],[16,5,16,8],[16,9,16,12],[16,13,16,16],[12,0,13,0],[12,3,13,3],[12,5,12,8],[12,9,12,12],[12,13,12,16],[12,17,13,17],[13,1,13,2],[13,5,13,8],[13,9,13,12],[13,13,13,16],[0,1,0,17],[1,1,1,17],[2,1,2,7],[2,8,2,17],[3,1,3,7],[3,8,3,17],[8,1,8,7],[8,8,8,17],[9,0,11,0],[9,1,9,7],[9,8,9,17],[10,1,10,17],[11,1,11,17],[4,1,4,17],[5,1,5,7],[5,8,5,17],[6,1,6,7],[6,8,6,17],[7,1,7,17]]}
[]
[]
[null,"UNIDADE ESCOLAR",null,null,null,null,null,null,"PRAZO"]
[null,{"$f":"Orçamento!O4","v":"COLÉGIO ESTADUAL ANA ALGEMIRA DO PRADO"},null,null,null,null,null,null,"90 DIAS CORRIDOS"]
[]
[null,"OBRA",null,null,null,null,null,null,"DATA"]
[null,{"$f":"Orçamento!O7","v":"REFORMA E AMPLIAÇÃO"},null,null,null,null,null,null,{"$f":"Orçamento!S7","v":"2020-05-07"}]
[]
[null,"LOCAL",null,null,null,null,null,null,"ÁREA TOTAL CONSTRUÍDA (M²)"]
["FILTRO",{"$f":"Orçamento!V7","v":"PALESTINA DE GOIÁS"},null,null,null,null,null,null,{"$f":"Orçamento!V13","v":1297.46}]
[]
[null,"CRONOGRAMA - FÍSICO FINANCEIRO"]
["↓","CUSTO TOTAL:",{"$f":"D93","v":0},"VALOR","Dias:",30,null,null,null,60,null,null,null,90,null,null,null,"TOTAL"]
[null,"DESCRIÇÃO DOS SERVIÇOS",null,null,"%","1ª PARCELA",null,null,null,"2ª PARCELA",null,null,null,"3ª PARCELA"]
[{"$f":"IF(D15>0,\"F\",\"\")","v":""},"SERVIÇOS PRELIMINARES",null,{"$f":"Orçamento!V272","v":0},{"$f":"Orçamento!X272","v":0},{"$f":"ROUND(F17*$D$15,2)","v":0},null,null,null,{"$f":"ROUND(J17*$D$15,2)","v":0},null,null,null,{"$f":"ROUND(N17*$D$15,2)","v":0},null,null,null,{"$f":"SUM(F15:Q15)","v":0},null,{"$f":"IF(D15=R15,\"OK\",\"ERRO\")","v":"OK"}]
[{"$f":"IF(A15=\"F\",A15,\"\")","v":""}]
[{"$f":"IF(A16=\"F\",A16,\"\")","v":""},null,null,null,null,1,null,null,null,0,null,null,null,{"$f":"1-F17-J17","v":0},null,null,null,{"$f":"IFERROR(E15/100,\"\")","v":0},null,{"$f":"IF(E15=R17*100,\"OK\",\"ERRO\")","v":"OK"}]
[{"$f":"IF(D18>0,\"F\",\"\")","v":""},"TRANSPORTES",null,{"$f":"Orçamento!V273","v":0},{"$f":"Orçamento!X273","v":0},{"$f":"ROUND(F20*$D$18,2)","v":0},null,null,null,{"$f":"ROUND(J20*$D$18,2)","v":0},null,null,null,{"$f":"ROUND(N20*$D$18,2)","v":0},null,null,null,{"$f":"SUM(F18:Q18)","v":0},null,{"$f":"IF(D18=R18,\"OK\",\"ERRO\")","v":"OK"}]
[{"$f":"IF(A18=\"F\",A18,\"\")","v":""}]
[{"$f":"IF(A19=\"F\",A19,\"\")","v":""},null,null,null,null,0.37,null,null,null,0.3,null,null,null,{"$f":"1-F20-J20","v":0.33},null,null,null,{"$f":"IFERROR(E18/100,\"\")","v":0},null,{"$f":"IF(E18=R20*100,\"OK\",\"ERRO\")","v":"OK"}]
[{"$f":"IF(D21>0,\"F\",\"\")","v":""},"SERVIÇO EM TERRA",null,{"$f":"Orçamento!V274","v":0},{"$f":"Orçamento!X274","v":0},{"$f":"ROUND(F23*$D$21,2)","v":0},null,null,null,{"$f":"ROUND(J23*$D$21,2)","v":0},null,null,null,{"$f":"ROUND(N23*$D$21,2)","v":0},null,null,null,{"$f":"SUM(F21:Q21)","v":0},null,{"$f":"IF(D21=R21,\"OK\",\"ERRO\")","v":"OK"}]
[{"$f":"IF(A21=\"F\",A21,\"\")","v":""}]
[{"$f":"IF(A22=\"F\",A22,\"\")","v":""},null,null,null,null,1,null,null,null,0,null,null,null,{"$f":"1-F23-J23","v":0},null,null,null,{"$f":"IFERROR(E21/100,\"\")","v":0},null,{"$f":"IF(E21=R23*100,\"OK\",\"ERRO\")","v":"OK"}]
[{"$f":"IF(D24>0,\"F\",\"\")","v":""},"FUNDAÇÕES E SONDAGENS",null,{"$f":"Orçamento!V275","v":0},{"$f":"Orçamento!X275","v":0},{"$f":"ROUND(F26*$D$24,2)","v":0},null,null,null,{"$f":"ROUND(J26*$D$24,2)","v":0},null,null,null,{"$f":"ROUND(N26*$D$24,2)","v":0},null,null,null,{"$f":"SUM(F24:Q24)","v":0},null,{"$f":"IF(D24=R24,\"OK\",\"ERRO\")","v":"OK"}]
[{"$f":"IF(A24=\"F\",A24,\"\")","v":""}]
[{"$f":"IF(A25=\"F\",A25,\"\")","v":""},null,null,null,null,1,null,null,null,0,null,null,null,{"$f":"1-F26-J26","v":0},null,null,null,{"$f":"IFERROR(E24/100,\"\")","v":0},null,{"$f":"IF(E24=R26*100,\"OK\",\"ERRO\")","v":"OK"}]
[{"$f":"IF(D27>0,\"F\",\"\")","v":""},"ESTRUTURA",null,{"$f":"Orçamento!V276","v":0},{"$f":"Orçamento!X276","v":0},{"$f":"ROUND(F29*$D$27,2)","v":0},null,null,null,{"$f":"ROUND(J29*$D$27,2)","v":0},null,null,null,{"$f":"ROUND(N29*$D$27,2)","v":0},null,null,null,{"$f":"SUM(F27:Q27)","v":0},null,{"$f":"IF(D27=R27,\"OK\",\"ERRO\")","v":"OK"}]
[{"$f":"IF(A27=\"F\",A27,\"\")","v":""}]
[{"$f":"IF(A28=\"F\",A28,\"\")","v":""},null,null,null,null,0.55000000000000004,null,null,null,{"$f":"1-F29","v":0.44999999999999996},null,null,null,{"$f":"1-F29-J29","v":0},null,null,null,{"$f":"IFERROR(E27/100,\"\")","v":0},null,{"$f":"IF(E27=R29*100,\"OK\",\"ERRO\")","v":"OK"}]
[{"$f":"IF(D30>0,\"F\",\"\")","v":""},"INST.ELET/TELEFÔNICA/CABEAMENTO ESTRUTURADO",null,{"$f":"Orçamento!V277","v":0},{"$f":"Orçamento!X277","v":0},{"$f":"ROUND(F32*$D$30,2)","v":0},null,null,null,{"$f":"ROUND(J32*$D$30,2)","v":0},null,null,null,{"$f":"ROUND(N32*$D$30,2)","v":0},null,null,null,{"$f":"SUM(F30:Q30)","v":0},null,{"$f":"IF(D30=R30,\"OK\",\"ERRO\")","v":"OK"}]
[{"$f":"IF(A30=\"F\",A30,\"\")","v":""}]
[{"$f":"IF(A31=\"F\",A31,\"\")","v":""},null,null,null,null,0,null,null,null,{"$f":"1-B32","v":1},null,null,null,{"$f":"1-F32-J32","v":0},null,null,null,{"$f":"IFERROR(E30/100,\"\")","v":0},null,{"$f":"IF(E30=R32*100,\"OK\",\"ERRO\")","v":"OK"}]
[{"$f":"IF(D33>0,\"F\",\"\")","v":""},"INSTALAÇÕES HIDROSSANITÁRIAS",null,{"$f":"Orçamento!V278","v":0},{"$f":"Orçamento!X278","v":0},{"$f":"ROUND(F35*$D$33,2)","v":0},null,null,null,{"$f":"ROUND(J35*$D$33,2)","v":0},null,null,null,{"$f":"ROUND(N35*$D$33,2)","v":0},null,null,null,{"$f":"SUM(F33:Q33)","v":0},null,{"$f":"IF(D33=R33,\"OK\",\"ERRO\")","v":"OK"}]
[{"$f":"IF(A33=\"F\",A33,\"\")","v":""}]
[{"$f":"IF(A34=\"F\",A34,\"\")","v":""},null,null,null,null,0,null,null,null,{"$f":"1-B35","v":1},null,null,null,{"$f":"1-F35-J35","v":0},null,null,null,{"$f":"IFERROR(E33/100,\"\")","v":0},null,{"$f":"IF(E33=R35*100,\"OK\",\"ERRO\")","v":"OK"}]
[{"$f":"IF(D36>0,\"F\",\"\")","v":""},"INSTALAÇÕES ESPECIAIS",null,{"$f":"Orçamento!V279","v":0},{"$f":"Orçamento!X279","v":0},{"$f":"ROUND(F38*$D$36,2)","v":0},null,null,null,{"$f":"ROUND(J38*$D$36,2)","v":0},null,null,null,{"$f":"ROUND(N38*$D$36,2)","v":0},null,null,null,{"$f":"SUM(F36:Q36)","v":0},null,{"$f":"IF(D36=R36,\"OK\",\"ERRO\")","v":"OK"}]
[{"$f":"IF(A36=\"F\",A36,\"\")","v":""}]
[{"$f":"IF(A37=\"F\",A37,\"\")","v":""},null,null,null,null,0,null,null,null,{"$f":"1-B38","v":1},null,null,null,{"$f":"1-F38-J38","v":0},null,null,null,{"$f":"IFERROR(E36/100,\"\")","v":0},null,{"$f":"IF(E36=R38*100,\"OK\",\"ERRO\")","v":"OK"}]
[{"$f":"IF(D39>0,\"F\",\"\")","v":""},"ALVENARIA E DIVISÓRIAS",null,{"$f":"Orçamento!V280","v":0},{"$f":"Orçamento!X280","v":0},{"$f":"ROUND(F41*$D$39,2)","v":0},null,null,null,{"$f":"ROUND(J41*$D$39,2)","v":0},null,null,null,{"$f":"ROUND(N41*$D$39,2)","v":0},null,null,null,{"$f":"SUM(F39:Q39)","v":0},null,{"$f":"IF(D39=R39,\"OK\",\"ERRO\")","v":"OK"}]
[{"$f":"IF(A39=\"F\",A39,\"\")","v":""}]
[{"$f":"IF(A40=\"F\",A40,\"\")","v":""},null,null,null,null,0,null,null,null,{"$f":"1-B41","v":1},null,null,null,{"$f":"1-F41-J41","v":0},null,null,null,{"$f":"IFERROR(E39/100,\"\")","v":0},null,{"$f":"IF(E39=R41*100,\"OK\",\"ERRO\")","v":"OK"}]
[{"$f":"IF(D42>0,\"F\",\"\")","v":""},"ALVENARIA AUTO-PORTANTE",null,{"$f":"Orçamento!V281","v":0},{"$f":"Orçamento!X281","v":0},{"$f":"ROUND(F44*$D$42,2)","v":0},null,null,null,{"$f":"ROUND(J44*$D$42,2)","v":0},null,null,null,{"$f":"ROUND(N44*$D$42,2)","v":0},null,null,null,{"$f":"SUM(F42:Q42)","v":0},null,{"$f":"IF(D42=R42,\"OK\",\"ERRO\")","v":"OK"}]
[{"$f":"IF(A42=\"F\",A42,\"\")","v":""}]
[{"$f":"IF(A43=\"F\",A43,\"\")","v":""},null,null,null,null,0,null,null,null,{"$f":"1-B44","v":1},null,null,null,{"$f":"1-F44-J44","v":0},null,null,null,{"$f":"IFERROR(E42/100,\"\")","v":0},null,{"$f":"IF(E42=R44*100,\"OK\",\"ERRO\")","v":"OK"}]
[{"$f":"IF(D45>0,\"F\",\"\")","v":""},"IMPERMEABILIZAÇÃO",null,{"$f":"Orçamento!V282","v":0},{"$f":"Orçamento!X282","v":0},{"$f":"ROUND(F47*$D$45,2)","v":0},null,null,null,{"$f":"ROUND(J47*$D$45,2)","v":0},null,null,null,{"$f":"ROUND(N47*$D$45,2)","v":0},null,null,null,{"$f":"SUM(F45:Q45)","v":0},null,{"$f":"IF(D45=R45,\"OK\",\"ERRO\")","v":"OK"}]
[{"$f":"IF(A45=\"F\",A45,\"\")","v":""}]
[{"$f":"IF(A46=\"F\",A46,\"\")","v":""},null,null,null,null,0.85,null,null,null,0.15,null,null,null,{"$f":"1-F47-J47","v":0},null,null,null,{"$f":"IFERROR(E45/100,\"\")","v":0},null,{"$f":"IF(E45=R47*100,\"OK\",\"ERRO\")","v":"OK"}]
[{"$f":"IF(D48>0,\"F\",\"\")","v":""},"ISOLAMENTO TÉRMICO E ACÚSTICO",null,{"$f":"Orçamento!V283","v":0},{"$f":"Orçamento!X283","v":0},{"$f":"ROUND(F50*$D$48,2)","v":0},null,null,null,{"$f":"ROUND(J50*$D$48,2)","v":0},null,null,null,{"$f":"ROUND(N50*$D$48,2)","v":0},null,null,null,{"$f":"SUM(F48:Q48)","v":0},null,{"$f":"IF(D48=R48,\"OK\",\"ERRO\")","v":"OK"}]
[{"$f":"IF(A48=\"F\",A48,\"\")","v":""}]
[{"$f":"IF(A49=\"F\",A49,\"\")","v":""},null,null,null,null,0,null,null,null,{"$f":"1-B50","v":1},null,null,null,{"$f":"1-F50-J50","v":0},null,null,null,{"$f":"IFERROR(E48/100,\"\")","v":0},null,{"$f":"IF(E48=R50*100,\"OK\",\"ERRO\")","v":"OK"}]
[{"$f":"IF(D51>0,\"F\",\"\")","v":""},"ESTRUTURA DE MADEIRA",null,{"$f":"Orçamento!V284","v":0},{"$f":"Orçamento!X284","v":0},{"$f":"ROUND(F53*$D$51,2)","v":0},null,null,null,{"$f":"ROUND(J53*$D$51,2)","v":0},null,null,null,{"$f":"ROUND(N53*$D$51,2)","v":0},null,null,null,{"$f":"SUM(F51:Q51)","v":0},null,{"$f":"IF(D51=R51,\"OK\",\"ERRO\")","v":"OK"}]
[{"$f":"IF(A51=\"F\",A51,\"\")","v":""}]
[{"$f":"IF(A52=\"F\",A52,\"\")","v":""},null,null,null,null,0,null,null,null,0.57999999999999996,null,null,null,{"$f":"1-F53-J53","v":0.42000000000000004},null,null,null,{"$f":"IFERROR(E51/100,\"\")","v":0},null,{"$f":"IF(E51=R53*100,\"OK\",\"ERRO\")","v":"OK"}]
[{"$f":"IF(D54>0,\"F\",\"\")","v":""},"ESTRUTURA METÁLICA",null,{"$f":"Orçamento!V285","v":0},{"$f":"Orçamento!X285","v":0},{"$f":"ROUND(F56*$D$54,2)","v":0},null,null,null,{"$f":"ROUND(J56*$D$54,2)","v":0},null,null,null,{"$f":"ROUND(N56*$D$54,2)","v":0},null,null,null,{"$f":"SUM(F54:Q54)","v":0},null,{"$f":"IF(D54=R54,\"OK\",\"ERRO\")","v":"OK"}]
[{"$f":"IF(A54=\"F\",A54,\"\")","v":""}]
[{"$f":"IF(A55=\"F\",A55,\"\")","v":""},null,null,null,null,0,null,null,null,0.57999999999999996,null,null,null,{"$f":"1-F56-J56","v":0.42000000000000004},null,null,null,{"$f":"IFERROR(E54/100,\"\")","v":0},null,{"$f":"IF(E54=R56*100,\"OK\",\"ERRO\")","v":"OK"}]
[{"$f":"IF(D57>0,\"F\",\"\")","v":""},"COBERTURAS",null,{"$f":"Orçamento!V286","v":0},{"$f":"Orçamento!X286","v":0},{"$f":"ROUND(F59*$D$57,2)","v":0},null,null,null,{"$f":"ROUND(J59*$D$57,2)","v":0},null,null,null,{"$f":"ROUND(N59*$D$57,2)","v":0},null,null,null,{"$f":"SUM(F57:Q57)","v":0},null,{"$f":"IF(D57=R57,\"OK\",\"ERRO\")","v":"OK"}]
[{"$f":"IF(A57=\"F\",A57,\"\")","v":""}]
[{"$f":"IF(A58=\"F\",A58,\"\")","v":""},null,null,null,null,0,null,null,null,0,null,null,null,{"$f":"1-F59-J59","v":1},null,null,null,{"$f":"IFERROR(E57/100,\"\")","v":0},null,{"$f":"IF(E57=R59*100,\"OK\",\"ERRO\")","v":"OK"}]
[{"$f":"IF(D60>0,\"F\",\"\")","v":""},"ESQUADRIAS DE MADEIRA",null,{"$f":"Orçamento!V287","v":0},{"$f":"Orçamento!X287","v":0},{"$f":"ROUND(F62*$D$60,2)","v":0},null,null,null,{"$f":"ROUND(J62*$D$60,2)","v":0},null,null,null,{"$f":"ROUND(N62*$D$60,2)","v":0},null,null,null,{"$f":"SUM(F60:Q60)","v":0},null,{"$f":"IF(D60=R60,\"OK\",\"ERRO\")","v":"OK"}]
[{"$f":"IF(A60=\"F\",A60,\"\")","v":""}]
[{"$f":"IF(A61=\"F\",A61,\"\")","v":""},null,null,null,null,0,null,null,null,0.4,null,null,null,{"$f":"1-F62-J62","v":0.6},null,null,null,{"$f":"IFERROR(E60/100,\"\")","v":0},null,{"$f":"IF(E60=R62*100,\"OK\",\"ERRO\")","v":"OK"}]
[{"$f":"IF(D63>0,\"F\",\"\")","v":""},"ESQUADRIAS METÁLICAS",null,{"$f":"Orçamento!V288","v":0},{"$f":"Orçamento!X288","v":0},{"$f":"ROUND(F65*$D$63,2)","v":0},null,null,null,{"$f":"ROUND(J65*$D$63,2)","v":0},null,null,null,{"$f":"ROUND(N65*$D$63,2)","v":0},null,null,null,{"$f":"SUM(F63:Q63)","v":0},null,{"$f":"IF(D63=R63,\"OK\",\"ERRO\")","v":"OK"}]
[{"$f":"IF(A63=\"F\",A63,\"\")","v":""}]
[{"$f":"IF(A64=\"F\",A64,\"\")","v":""},null,null,null,null,0,null,null,null,0.45,null,null,null,{"$f":"1-F65-J65","v":0.55000000000000004},null,null,null,{"$f":"IFERROR(E63/100,\"\")","v":0},null,{"$f":"IF(E63=R65*100,\"OK\",\"ERRO\")","v":"OK"}]
[{"$f":"IF(D66>0,\"F\",\"\")","v":""},"VIDROS",null,{"$f":"Orçamento!V289","v":0},{"$f":"Orçamento!X289","v":0},{"$f":"ROUND(F68*$D$66,2)","v":0},null,null,null,{"$f":"ROUND(J68*$D$66,2)","v":0},null,null,null,{"$f":"ROUND(N68*$D$66,2)","v":0},null,null,null,{"$f":"SUM(F66:Q66)","v":0},null,{"$f":"IF(D66=R66,\"OK\",\"ERRO\")","v":"OK"}]
[{"$f":"IF(A66=\"F\",A66,\"\")","v":""}]
[{"$f":"IF(A67=\"F\",A67,\"\")","v":""},null,null,null,null,0,null,null,null,0,null,null,null,{"$f":"1-F68-J68","v":1},null,null,null,{"$f":"IFERROR(E66/100,\"\")","v":0},null,{"$f":"IF(E66=R68*100,\"OK\",\"ERRO\")","v":"OK"}]
[{"$f":"IF(D69>0,\"F\",\"\")","v":""},"REVESTIMENTO DE PAREDE",null,{"$f":"Orçamento!V290","v":0},{"$f":"Orçamento!X290","v":0},{"$f":"ROUND(F71*$D$69,2)","v":0},null,null,null,{"$f":"ROUND(J71*$D$69,2)","v":0},null,null,null,{"$f":"ROUND(N71*$D$69,2)","v":0},null,null,null,{"$f":"SUM(F69:Q69)","v":0},null,{"$f":"IF(D69=R69,\"OK\",\"ERRO\")","v":"OK"}]
[{"$f":"IF(A69=\"F\",A69,\"\")","v":""}]
[{"$f":"IF(A70=\"F\",A70,\"\")","v":""},null,null,null,null,0,null,null,null,0.4,null,null,null,{"$f":"1-F71-J71","v":0.6},null,null,null,{"$f":"IFERROR(E69/100,\"\")","v":0},null,{"$f":"IF(E69=R71*100,\"OK\",\"ERRO\")","v":"OK"}]
[{"$f":"IF(D72>0,\"F\",\"\")","v":""},"FORROS",null,{"$f":"Orçamento!V291","v":0},{"$f":"Orçamento!X291","v":0},{"$f":"ROUND(F74*$D$72,2)","v":0},null,null,null,{"$f":"ROUND(J74*$D$72,2)","v":0},null,null,null,{"$f":"ROUND(N74*$D$72,2)","v":0},null,null,null,{"$f":"SUM(F72:Q72)","v":0},null,{"$f":"IF(D72=R72,\"OK\",\"ERRO\")","v":"OK"}]
[{"$f":"IF(A72=\"F\",A72,\"\")","v":""}]
[{"$f":"IF(A73=\"F\",A73,\"\")","v":""},null,null,null,null,0,null,null,null,0.4,null,null,null,{"$f":"1-F74-J74","v":0.6},null,null,null,{"$f":"IFERROR(E72/100,\"\")","v":0},null,{"$f":"IF(E72=R74*100,\"OK\",\"ERRO\")","v":"OK"}]
[{"$f":"IF(D75>0,\"F\",\"\")","v":""},"REVESTIMENTO DE PISO",null,{"$f":"Orçamento!V292","v":0},{"$f":"Orçamento!X292","v":0},{"$f":"ROUND(F77*$D$75,2)","v":0},null,null,null,{"$f":"ROUND(J77*$D$75,2)","v":0},null,null,null,{"$f":"ROUND(N77*$D$75,2)","v":0},null,null,null,{"$f":"SUM(F75:Q75)","v":0},null,{"$f":"IF(D75=R75,\"OK\",\"ERRO\")","v":"OK"}]
[{"$f":"IF(A75=\"F\",A75,\"\")","v":""}]
[{"$f":"IF(A76=\"F\",A76,\"\")","v":""},null,null,null,null,0,null,null,null,0.4,null,null,null,{"$f":"1-F77-J77","v":0.6},null,null,null,{"$f":"IFERROR(E75/100,\"\")","v":0},null,{"$f":"IF(E75=R77*100,\"OK\",\"ERRO\")","v":"OK"}]
[{"$f":"IF(D78>0,\"F\",\"\")","v":""},"FERRAGENS",null,{"$f":"Orçamento!V293","v":0},{"$f":"Orçamento!X293","v":0},{"$f":"ROUND(F80*$D$78,2)","v":0},null,null,null,{"$f":"ROUND(J80*$D$78,2)","v":0},null,null,null,{"$f":"ROUND(N80*$D$78,2)","v":0},null,null,null,{"$f":"SUM(F78:Q78)","v":0},null,{"$f":"IF(D78=R78,\"OK\",\"ERRO\")","v":"OK"}]
[{"$f":"IF(A78=\"F\",A78,\"\")","v":""}]
[{"$f":"IF(A79=\"F\",A79,\"\")","v":""},null,null,null,null,0,null,null,null,0,null,null,null,{"$f":"1-F80-J80","v":1},null,null,null,{"$f":"IFERROR(E78/100,\"\")","v":0},null,{"$f":"IF(E78=R80*100,\"OK\",\"ERRO\")","v":"OK"}]
[{"$f":"IF(D81>0,\"F\",\"\")","v":""},"MARCENARIA",null,{"$f":"Orçamento!V294","v":0},{"$f":"Orçamento!X294","v":0},{"$f":"ROUND(F83*$D$81,2)","v":0},null,null,null,{"$f":"ROUND(J83*$D$81,2)","v":0},null,null,null,{"$f":"ROUND(N83*$D$81,2)","v":0},null,null,null,{"$f":"SUM(F81:Q81)","v":0},null,{"$f":"IF(D81=R81,\"OK\",\"ERRO\")","v":"OK"}]
[{"$f":"IF(A81=\"F\",A81,\"\")","v":""}]
[{"$f":"IF(A82=\"F\",A82,\"\")","v":""},null,null,null,null,0,null,null,null,0,null,null,null,{"$f":"1-F83-J83","v":1},null,null,null,{"$f":"IFERROR(E81/100,\"\")","v":0},null,{"$f":"IF(E81=R83*100,\"OK\",\"ERRO\")","v":"OK"}]
[{"$f":"IF(D84>0,\"F\",\"\")","v":""},"ADMINISTRAÇÃO - MENSALISTAS",null,{"$f":"Orçamento!V295","v":0},{"$f":"Orçamento!X295","v":0},{"$f":"ROUND(F86*$D$84,2)","v":0},null,null,null,{"$f":"ROUND(J86*$D$84,2)","v":0},null,null,null,{"$f":"ROUND(N86*$D$84,2)","v":0},null,null,null,{"$f":"SUM(F84:Q84)","v":0},null,{"$f":"IF(D84=R84,\"OK\",\"ERRO\")","v":"OK"}]
[{"$f":"IF(A84=\"F\",A84,\"\")","v":""}]
[{"$f":"IF(A85=\"F\",A85,\"\")","v":""},null,null,null,null,0.34,null,null,null,0.33,null,null,null,0.33,null,null,null,{"$f":"IFERROR(E84/100,\"\")","v":0},null,{"$f":"IF(E84=R86*100,\"OK\",\"ERRO\")","v":"OK"}]
[{"$f":"IF(D87>0,\"F\",\"\")","v":""},"PINTURA",null,{"$f":"Orçamento!V296","v":0},{"$f":"Orçamento!X296","v":0},{"$f":"ROUND(F89*$D$87,2)","v":0},null,null,null,{"$f":"ROUND(J89*$D$87,2)","v":0},null,null,null,{"$f":"ROUND(N89*$D$87,2)","v":0},null,null,null,{"$f":"SUM(F87:Q87)","v":0},null,{"$f":"IF(D87=R87,\"OK\",\"ERRO\")","v":"OK"}]
[{"$f":"IF(A87=\"F\",A87,\"\")","v":""}]
[{"$f":"IF(A88=\"F\",A88,\"\")","v":""},null,null,null,null,0,null,null,null,0,null,null,null,{"$f":"1-F89-J89","v":1},null,null,null,{"$f":"IFERROR(E87/100,\"\")","v":0},null,{"$f":"IF(E87=R89*100,\"OK\",\"ERRO\")","v":"OK"}]
[{"$f":"IF(D90>0,\"F\",\"\")","v":""},"DIVERSOS",null,{"$f":"Orçamento!V297","v":0},{"$f":"Orçamento!X297","v":0},{"$f":"ROUND(F92*$D$90,2)","v":0},null,null,null,{"$f":"ROUND(J92*$D$90,2)","v":0},null,null,null,{"$f":"ROUND(N92*$D$90,2)","v":0},null,null,null,{"$f":"SUM(F90:Q90)","v":0},null,{"$f":"IF(D90=R90,\"OK\",\"ERRO\")","v":"OK"}]
[{"$f":"IF(A90=\"F\",A90,\"\")","v":""}]
[{"$f":"IF(A91=\"F\",A91,\"\")","v":""},null,null,null,null,0,null,null,null,0,null,null,null,{"$f":"1-F92-J92","v":1},null,null,null,{"$f":"IFERROR(E90/100,\"\")","v":0},null,{"$f":"IF(E90=R92*100,\"OK\",\"ERRO\")","v":"OK"}]
["F","CUSTO DO ORÇAMENTO",null,{"$f":"SUM(D15:D92)","v":0},{"$f":"SUM(E15:E92)","v":0},{"$f":"F15+F18+F21+F24+F27+F30+F33+F36+F39+F42+F45+F48+F51+F54+F57+F60+F63+F66+F69+F72+F75+F78+F81+F84+F87+F90","v":0},null,null,null,{"$f":"J15+J18+J21+J24+J27+J30+J33+J36+J39+J42+J45+J48+J51+J54+J57+J60+J63+J66+J69+J72+J75+J78+J81+J84+J87+J90","v":0},null,null,null,{"$f":"N15+N18+N21+N24+N27+N30+N33+N36+N39+N42+N45+N48+N51+N54+N57+N60+N63+N66+N69+N72+N75+N78+N81+N84+N87+N90","v":0},null,null,null,{"$f":"R15+R18+R21+R24+R27+R30+R33+R36+R39+R42+R45+R48+R51+R54+R57+R60+R63+R66+R69+R72+R75+R78+R81+R84+R87+R90","v":0}]
["F","PERCENTUAIS:",null,null,null,{"$f":"IFERROR(F93/D93,\"\")","v":""},null,null,null,{"$f":"IFERROR(J93/D93,\"\")","v":""},null,null,null,{"$f":"IFERROR(N93/D93,\"\")","v":""},null,null,null,{"$f":"SUM(F94:Q94)","v":0}]
["F","TOTAIS ACUMULADOS:",null,null,null,{"$f":"F93","v":0},null,null,null,{"$f":"F95+J93","v":0},null,null,null,{"$f":"J95+N93","v":0}]
["F","PERCENTUAIS  ACUMULADOS:",null,null,null,{"$f":"F94","v":""},null,null,null,{"$f":"J94+F96","v":{"$error":"#VALUE!"}},null,null,null,{"$f":"IFERROR(J96+N94,\"\")","v":""}]
["F"]
["F","OBSERVAÇÕES:"]
["F","Os pagamentos somente poderão ser efetuados mediante medição e atesto pelos técnicos da Secretaria da Educação. "]

{"sheet":"Composição BDI","index":4,"n_rows":45,"n_cols":9,"rows_kept":45,"cut":false,"hidden":false,"merged":[[18,5,18,8],[17,0,17,3],[16,0,16,3],[44,0,44,3],[42,0,42,3],[43,0,43,3],[18,0,18,3],[36,0,36,3],[39,0,39,3],[38,0,38,3],[40,0,40,3],[29,0,29,2],[32,0,32,3],[33,0,33,3],[34,0,34,3],[35,0,35,3],[0,0,0,3],[1,0,1,3],[4,0,4,3],[7,0,7,3],[10,0,10,3],[2,0,2,3],[3,0,3,3],[5,0,5,3],[6,0,6,3],[8,0,8,3],[9,0,9,3],[11,0,11,3],[12,0,12,3],[14,0,14,3],[15,0,15,3],[13,0,13,3]]}
[]
[]
["UNIDADE ESCOLAR"]
[{"$f":"Orçamento!$O$4","v":"COLÉGIO ESTADUAL ANA ALGEMIRA DO PRADO"}]
[]
["OBRA"]
[{"$f":"Orçamento!$O$7","v":"REFORMA E AMPLIAÇÃO"}]
[]
["ENDEREÇO"]
[{"$f":"Orçamento!$R$10","v":"AV RUI BARBOSA S/N QUADRA 21, CENTRO, CEP:75845-000"}]
[]
["CIDADE"]
[{"$f":"Orçamento!$V$7","v":"PALESTINA DE GOIÁS"}]
[]
["CRE"]
[{"$f":"Orçamento!$O$10","v":"IPORÁ"}]
[]
["DETALHAMENTO DA COMPOSIÇÃO DE BDI"]
["COMPOSIÇÃO BDI PARA OBRAS CIVIS",null,null,null,null,"BDI CONSTRUÇÃO E REFORMA"]
["DESCRIÇÃO","COEF.","TAXA % (a.m)","% no preço de venda",null,"Situação","1º Quartil","Médio","3º Quartil"]
["1) COFINS",1,0.03,{"$f":"C21","v":0.03},null,{"$f":"IF(OR(C21<G21,C21>I21),\"FORA DO INTERVALO\",\"OK\")","v":"OK"},0.03,0.03,0.03]
["2) PIS",1,6.4999999999999997E-3,{"$f":"C22","v":6.4999999999999997E-3},null,{"$f":"IF(OR(C22<G22,C22>I22),\"FORA DO INTERVALO\",\"OK\")","v":"OK"},6.4999999999999997E-3,6.4999999999999997E-3,6.4999999999999997E-3]
["3) ISSQN",1,0.02,{"$f":"C23*B23","v":0.02},null,"OK",0.02,3.5000000000000003E-2,0.05]
["4) CPRB",1,0,{"$f":"C24","v":0},null,"FORA DO INTERVALO",4.4999999999999998E-2,4.4999999999999998E-2,4.4999999999999998E-2]
["5) Administração Central",1,0.04,0.04,null,"OK",0.03,0.04,5.5E-2]
["6) Despesas Financeiras",1,5.5999999999999999E-3,5.5999999999999999E-3,null,"FORA DO INTERVALO",5.8999999999999999E-3,1.23E-2,1.3899999999999999E-2]
["7) Seguros + Garantias",1,1.1999999999999999E-3,1.1999999999999999E-3,null,"FORA DO INTERVALO",8.0000000000000002E-3,8.0000000000000002E-3,0.01]
["8) Risco",1,9.7000000000000003E-3,9.7000000000000003E-3,null,"OK",9.7000000000000003E-3,1.2699999999999999E-2,1.2699999999999999E-2]
["9) Lucro",1,7.4399999999999994E-2,7.4399999999999994E-2,null,"OK",6.1600000000000002E-2,7.3999999999999996E-2,8.9599999999999999E-2]
["BDI - FINAL",null,null,{"$f":"(((1+D25+D27+D28)*(1+D26)*(1+D29))/(1-(D21+D22+D23+D24))-1)","v":0.20340206356756796},null,{"$f":"IF(OR(D30<G30,D30>I30),\"FORA DO INTERVALO\",\"OK\")","v":"OK"},0.2034,0.22120000000000001,0.25]
[]
["Notas:"]
["(1) e (2) Alíquota definida por lei."]
["(3) Alíquota e base de cálculo definidas pela legislação municipal."]
["(4) Alíquota definida pelas leis 12.546/11, 12844/13 e 13.161/15 (CPRB – contribuição previdenciária sobre a receita bruta)."]
["(5) Valores definidos a partir dos limites no Acórdão nº 2.622/2013 - TCU – Plenário. Valores entre o 1º e 3º quartis."]
["(6) Valor calculado pela expressão matemática do acórdão 2.369/2011 – TCU – Plenário e disponibilizado pela AGETOP em dezembro de 2018. (Foi utilizado para o cálculo a média da Taxa SELIC no período de 11/2017 a 10/2018)"]
[]
["(7) Valores definidos pela AGETOP a partir dos limites no Acórdão nº 2.622/2013 - TCU – Plenário. Valores médios. \n\nObservação da AGETOP: (Seguros contra erros de execução, incêndio e explosão, danos da natureza (vendaval, destelhamento, alagamento, inundação, desmoronamento, geadas etc.), emprego de material defeituoso ou inadequado, roubo e/ou furto qualificado, quebra de equipamentos, desmoronamento de estrutura, nas modalidades de Obras Civis em Construção (OCC); Instalação e Montagem (IM); e Obras Civis em Construção e Instalação e Montagem (OCC/IM). Bem como coberturas adicionais para ampliação dessas coberturas básicas, como: cobertura de responsabilidade civil geral, cobertura de responsabilidade civil cruzada, cobertura de despesas extraordinárias, cobertura de tumultos, cobertura de desentulho do local, cobertura de riscos do fabricante, dentre outras, incluindo o seguro de vida em grupo regido pela convenção coletiva dos trabalhadores na indústria da construção civil). A partir de 24/02/2015 por intermédio da Portaria 449/2015 a Presidência da AGETOP, na pessoa do Senhor Jayme Eduardo Rincon, determinou a exclusão dos valores referentes aos Seguros de Risco de Engenharia e Responsabilidade Civil do Profissional na composição do cálculo do B.D.I.."]
["(8) Valores definidos a partir dos limites no Acórdão nº 2.622/2013 - TCU – Plenário. Valores entre 1º e 3° quartis."]
["(9) Valores definidos a partir dos limites definidos no Acórdão nº 2.622/2013 - TCU – Plenário. Valores adotados e praticados no mercado ( “ ex ante ” ) ou aqueles entre os 1º e 3º quartis."]
[]
["(*) A fórmula para estipulação da taxa de BDI estimado adotado é a mesma que foi aplicada para a obtenção das tabelas contidas no Acórdão n. 2.622/2013 – TCUPlenário"]
[]
["Obs.: Para obras com valores superiores a R$ 20.000.000,00 sugere-se recalcular o BDI, dimensionando as taxas de administração central e lucro para patamares inferiores ao estipulado acima."]

{"sheet":"Relatório CENTRAL","index":5,"n_rows":40,"n_cols":5,"rows_kept":40,"cut":false,"hidden":false,"merged":[[10,1,10,4],[11,1,11,4],[39,1,39,2],[9,0,11,0],[0,1,0,4],[6,3,6,4],[9,3,9,4],[1,1,1,4],[2,1,2,2],[2,3,2,4],[3,1,3,2],[3,3,3,4],[4,1,4,4],[5,1,5,2],[5,3,5,4],[6,1,6,2],[7,1,7,4],[8,1,8,2],[8,3,8,4],[9,1,9,2]]}
[]
[]
[null,"UNIDADE ESCOLAR",null,"CIDADE"]
[null,{"$f":"Orçamento!$O$4","v":"COLÉGIO ESTADUAL ANA ALGEMIRA DO PRADO"},null,{"$f":"Orçamento!$V$7","v":"PALESTINA DE GOIÁS"}]
[]
[null,"OBRA",null,"CRE"]
[null,{"$f":"Orçamento!$O$7","v":"REFORMA E AMPLIAÇÃO"},null,{"$f":"Orçamento!$O$10","v":"IPORÁ"}]
[]
[null,"ENDEREÇO",null,"DATA"]
["FILTRO",{"$f":"Orçamento!$R$10","v":"AV RUI BARBOSA S/N QUADRA 21, CENTRO, CEP:75845-000"},null,{"$f":"Orçamento!$S$7","v":"2020-05-07"}]
[]
[null,"RELATÓRIO CENTRAL"]
["↓","CÓDIGO","ETAPA","PREÇO  (R$) C/ BDI","PARTIC  ( % )"]
[{"$f":"IF(D14>0,\"F\",\"\")","v":""},{"$f":"Orçamento!O272","v":"a."},{"$f":"Orçamento!P272","v":"SERVIÇOS PRELIMINARES"},{"$f":"Orçamento!V272","v":0},{"$f":"Orçamento!X272","v":0}]
[{"$f":"IF(D15>0,\"F\",\"\")","v":""},{"$f":"Orçamento!O273","v":"b."},{"$f":"Orçamento!P273","v":"TRANSPORTES"},{"$f":"Orçamento!V273","v":0},{"$f":"Orçamento!X273","v":0}]
["",{"$f":"Orçamento!O274","v":"c."},{"$f":"Orçamento!P274","v":"SERVIÇO EM TERRA"},{"$f":"Orçamento!V274","v":0},{"$f":"Orçamento!X274","v":0}]
["",{"$f":"Orçamento!O275","v":"d."},{"$f":"Orçamento!P275","v":"FUNDAÇÕES E SONDAGENS"},{"$f":"Orçamento!V275","v":0},{"$f":"Orçamento!X275","v":0}]
["",{"$f":"Orçamento!O276","v":"e."},{"$f":"Orçamento!P276","v":"ESTRUTURA"},{"$f":"Orçamento!V276","v":0},{"$f":"Orçamento!X276","v":0}]
["",{"$f":"Orçamento!O277","v":"f."},{"$f":"Orçamento!P277","v":"INSTALAÇÕES ELÉTRICAS"},{"$f":"Orçamento!V277","v":0},{"$f":"Orçamento!X277","v":0}]
["",{"$f":"Orçamento!O278","v":"g."},{"$f":"Orçamento!P278","v":"INSTALAÇÕES HIDROSSANITÁRIAS"},{"$f":"Orçamento!V278","v":0},{"$f":"Orçamento!X278","v":0}]
["",{"$f":"Orçamento!O279","v":"h"},{"$f":"Orçamento!P279","v":"INSTALAÇÕES ESPECIAIS"},{"$f":"Orçamento!V279","v":0},{"$f":"Orçamento!X279","v":0}]
["",{"$f":"Orçamento!O280","v":"i."},{"$f":"Orçamento!P280","v":"ALVENARIAS E DIVISÓRIAS"},{"$f":"Orçamento!V280","v":0},{"$f":"Orçamento!X280","v":0}]
["",{"$f":"Orçamento!O281","v":"j."},{"$f":"Orçamento!P281","v":"ALVENARIA AUTO-PORTANTE"},{"$f":"Orçamento!V281","v":0},{"$f":"Orçamento!X281","v":0}]
["",{"$f":"Orçamento!O282","v":"k."},{"$f":"Orçamento!P282","v":"IMPERMEABILIZAÇÃO"},{"$f":"Orçamento!V282","v":0},{"$f":"Orçamento!X282","v":0}]
["",{"$f":"Orçamento!O283","v":"l."},{"$f":"Orçamento!P283","v":"ISOLAMENTO TÉRMICO E ACÚSTICO"},{"$f":"Orçamento!V283","v":0},{"$f":"Orçamento!X283","v":0}]
["",{"$f":"Orçamento!O284","v":"m."},{"$f":"Orçamento!P284","v":"ESTRUTURA DE MADEIRA"},{"$f":"Orçamento!V284","v":0},{"$f":"Orçamento!X284","v":0}]
["",{"$f":"Orçamento!O285","v":"n."},{"$f":"Orçamento!P285","v":"ESTRUTURAS METÁLICAS"},{"$f":"Orçamento!V285","v":0},{"$f":"Orçamento!X285","v":0}]
["",{"$f":"Orçamento!O286","v":"o."},{"$f":"Orçamento!P286","v":"COBERTURAS"},{"$f":"Orçamento!V286","v":0},{"$f":"Orçamento!X286","v":0}]
["",{"$f":"Orçamento!O287","v":"p."},{"$f":"Orçamento!P287","v":"ESQUADRIAS DE MADEIRA"},{"$f":"Orçamento!V287","v":0},{"$f":"Orçamento!X287","v":0}]
["",{"$f":"Orçamento!O288","v":"q."},{"$f":"Orçamento!P288","v":"ESQUADRIAS METÁLICAS"},{"$f":"Orçamento!V288","v":0},{"$f":"Orçamento!X288","v":0}]
["",{"$f":"Orçamento!O289","v":"r."},{"$f":"Orçamento!P289","v":"VIDROS"},{"$f":"Orçamento!V289","v":0},{"$f":"Orçamento!X289","v":0}]
["",{"$f":"Orçamento!O290","v":"s."},{"$f":"Orçamento!P290","v":"REVESTIMENTO DE PAREDE"},{"$f":"Orçamento!V290","v":0},{"$f":"Orçamento!X290","v":0}]
["",{"$f":"Orçamento!O291","v":"t."},{"$f":"Orçamento!P291","v":"FORROS"},{"$f":"Orçamento!V291","v":0},{"$f":"Orçamento!X291","v":0}]
["",{"$f":"Orçamento!O292","v":"u."},{"$f":"Orçamento!P292","v":"REVESTIMENTO DE PISO"},{"$f":"Orçamento!V292","v":0},{"$f":"Orçamento!X292","v":0}]
["",{"$f":"Orçamento!O293","v":"v."},{"$f":"Orçamento!P293","v":"FERRAGENS"},{"$f":"Orçamento!V293","v":0},{"$f":"Orçamento!X293","v":0}]
["",{"$f":"Orçamento!O294","v":"w."},{"$f":"Orçamento!P294","v":"MARCENARIA"},{"$f":"Orçamento!V294","v":0},{"$f":"Orçamento!X294","v":0}]
["",{"$f":"Orçamento!O295","v":"x."},{"$f":"Orçamento!P295","v":"ADMINISTRAÇÃO"},{"$f":"Orçamento!V295","v":0},{"$f":"Orçamento!X295","v":0}]
["",{"$f":"Orçamento!O296","v":"y."},{"$f":"Orçamento!P296","v":"PINTURA"},{"$f":"Orçamento!V296","v":0},{"$f":"Orçamento!X296","v":0}]
["",{"$f":"Orçamento!O297","v":"z."},{"$f":"Orçamento!P297","v":"DIVERSOS"},{"$f":"Orçamento!V297","v":0},{"$f":"Orçamento!X297","v":0}]
["F","TOTAL GERAL DO ORÇAMENTO (R$) C/BDI",null,{"$f":"SUM(D14:D39)","v":0},{"$f":"SUM(E14:E39)","v":0}]

{"sheet":"Parc Maior Relev","index":6,"n_rows":35,"n_cols":7,"rows_kept":35,"cut":false,"hidden":false,"merged":[[6,4,6,6],[7,1,7,6],[8,1,8,3],[8,4,8,6],[35,3,35,7],[33,1,33,6],[0,1,0,6],[11,1,11,6],[1,1,1,6],[2,1,2,3],[2,4,2,6],[3,1,3,3],[3,4,3,6],[4,1,4,6],[5,1,5,3],[5,4,5,6],[9,1,9,3],[9,4,9,6],[10,1,10,6],[6,1,6,3]]}
[]
[]
[null,"UNIDADE ESCOLAR",null,null,"CÓDIGO INEP"]
[null,{"$f":"Orçamento!$O$4","v":"COLÉGIO ESTADUAL ANA ALGEMIRA DO PRADO"},null,null,{"$f":"Orçamento!$V$4","v":52053970}]
[]
[null,"OBRA",null,null,"CIDADE"]
[null,{"$f":"Orçamento!$O$7","v":"REFORMA E AMPLIAÇÃO"},null,null,{"$f":"Orçamento!$V$7","v":"PALESTINA DE GOIÁS"}]
[]
[null,"CRE",null,null,"ÁREA TOTAL CONSTRUÍDA (M²)"]
[null,{"$f":"Orçamento!$O$10","v":"IPORÁ"},null,null,{"$f":"Orçamento!$V$13","v":1297.46}]
[]
["FILTRO","PARCELA DE MAIOR RELEVÂNCIA"]
[{"$f":"IF(G14>0,\"F\",\"\")","v":""},"CÓDIGO","SERVIÇO","DESCRIÇÃO","UNID","QUANT","PARC. MAIOR RELEV (100%)"]
[{"$f":"IF(G14>0,\"F\",\"\")","v":""},{"$f":"Somatório!B22","v":"f."},"INSTALAÇÕES ELÉTRICAS","SUBESTAÇÃO","KVA",{"$f":"SUMIF(Orçamento!$R$20:$R$253,'Parc Maior Relev'!D14,Orçamento!$T$20:$T$253)","v":0},{"$f":"F14","v":0}]
[{"$f":"IF(SUM(G16:G32)>0,\"F\",\"\")","v":"F"},"CÓDIGO","SERVIÇO","DESCRIÇÃO","UNID","QUANT","PARC. MAIOR RELEV (50%)"]
[{"$f":"IF(G16>0,\"F\",\"\")","v":""},{"$f":"Somatório!B21","v":"e."},"ESTRUTURA","CONCRETO","M3",{"$f":"SUMIF(Orçamento!$R$20:$R$253,'Parc Maior Relev'!D16,Orçamento!$T$20:$T$253)","v":0},{"$f":"F16*0.5","v":0}]
[{"$f":"IF(G17>0,\"F\",\"\")","v":""},"f.","INSTALAÇÕES ELÉTRICAS","INSTALAÇÕES ELÉTRICAS","KVA",{"$f":"SUMIF(Orçamento!$R$20:$R$253,'Parc Maior Relev'!D17,Orçamento!$T$20:$T$253)","v":0},{"$f":"F17","v":0}]
[{"$f":"IF(G18>0,\"F\",\"\")","v":""},{"$f":"Somatório!B25","v":"i."},"ALVENARIA E DIVISÓRIAS","ALVENARIA DE TIJOLOS","M2",{"$f":"SUMIF(Orçamento!$R$20:$R$253,'Parc Maior Relev'!D18,Orçamento!$T$20:$T$253)","v":0},{"$f":"F18*0.5","v":0}]
["",{"$f":"Somatório!B29","v":"m."},"ESTRUTURA DE MADEIRA","ESTRUTURA DE MADEIRA","M2",{"$f":"SUMIF(Orçamento!$R$20:$R$253,'Parc Maior Relev'!D19,Orçamento!$T$20:$T$253)","v":0},0]
["F",{"$f":"Somatório!B31","v":"o."},"COBERTURAS","COBERTURA CERÂMICA","M2",992.4,496.2]
["","o.","COBERTURAS","COBERTURA COM TELHA METÁLICA","M2",{"$f":"SUMIF(Orçamento!$R$20:$R$253,'Parc Maior Relev'!D21,Orçamento!$T$20:$T$253)","v":0},0]
["",{"$f":"Somatório!B35","v":"s."},"REVESTIMENTO DE PAREDE","CHAPISCO","M2",{"$f":"SUMIF(Orçamento!$R$20:$R$253,'Parc Maior Relev'!D22,Orçamento!$T$20:$T$253)","v":0},0]
["","s.","REVESTIMENTO DE PAREDE","REBOCO","M2",{"$f":"SUMIF(Orçamento!$R$20:$R$253,'Parc Maior Relev'!D23,Orçamento!$T$20:$T$253)","v":0},{"$f":"F23*0.5","v":0}]
["","s.","REVESTIMENTO DE PAREDE","REVESTIMENTO CERÂMICO","M2",{"$f":"SUMIF(Orçamento!$R$20:$R$253,'Parc Maior Relev'!D24,Orçamento!$T$20:$T$253)","v":0},{"$f":"F24*0.5","v":0}]
["",{"$f":"Somatório!B36","v":"t."},"FORROS","FORRO DE GESSO","M2",{"$f":"SUMIF(Orçamento!$R$20:$R$253,'Parc Maior Relev'!D25,Orçamento!$T$20:$T$253)","v":0},{"$f":"F25*0.5","v":0}]
["","t.","FORROS","FORRO DE PVC","M2",{"$f":"SUMIF(Orçamento!$R$20:$R$253,'Parc Maior Relev'!D26,Orçamento!$T$20:$T$253)","v":0},{"$f":"F26*0.5","v":0}]
["","t.","FORROS","FORRO DE GESSO ACARTONADO","M2",{"$f":"SUMIF(Orçamento!$R$20:$R$253,'Parc Maior Relev'!D27,Orçamento!$T$20:$T$253)","v":0},{"$f":"F27*0.5","v":0}]
["","u.","REVESTIMENTO DE PISO","PISO DE GRANITINA","M2",{"$f":"SUMIF(Orçamento!$R$20:$R$253,'Parc Maior Relev'!D28,Orçamento!$T$20:$T$253)","v":0},0]
["","u.","REVESTIMENTO DE PISO","PISO LAMINADO","M2",{"$f":"SUMIF(Orçamento!$R$20:$R$253,'Parc Maior Relev'!D29,Orçamento!$T$20:$T$253)","v":0},0]
["","u.","REVESTIMENTO DE PISO","PISO DE CONCRETO DESEMPENADO","M2",{"$f":"SUMIF(Orçamento!$R$20:$R$253,'Parc Maior Relev'!D30,Orçamento!$T$20:$T$253)","v":0},0]
["","u.","REVESTIMENTO DE PISO","PISO CERÂMICO","M2",{"$f":"SUMIF(Orçamento!$R$20:$R$253,'Parc Maior Relev'!D31,Orçamento!$T$20:$T$253)","v":0},{"$f":"F31*0.5","v":0}]
["","y.","PINTURA","PINTURA","M2",{"$f":"SUMIF(Orçamento!$R$20:$R$253,'Parc Maior Relev'!D32,Orçamento!$T$20:$T$253)","v":0},0]
["F"]
["F","(*) Para os fins do inciso I dp § 1º do Art. 30 da Lei Federal 8.666/93, são consideradas parcelas de maior relevância técnica as execuções apresentadas"]
["F"]

{"sheet":"Composições","index":7,"n_rows":211,"n_cols":10,"rows_kept":211,"cut":false,"hidden":false,"merged":[[203,8,203,9],[208,1,208,7],[210,1,210,7],[199,1,199,7],[201,1,201,7],[203,0,204,0],[203,1,204,1],[203,2,204,2],[203,3,204,3],[203,4,204,4],[203,5,204,5],[203,6,203,7],[194,1,194,7],[196,0,197,0],[196,1,197,1],[196,2,197,2],[196,3,197,3],[196,4,197,4],[196,5,197,5],[196,6,196,7],[196,8,196,9],[174,8,174,9],[161,5,162,5],[161,6,161,7],[161,8,161,9],[161,0,162,0],[161,1,162,1],[161,2,162,2],[161,3,162,3],[161,4,162,4],[165,1,165,7],[179,1,179,7],[159,1,159,7],[149,1,149,7],[151,0,152,0],[151,1,152,1],[151,2,152,2],[151,3,152,3],[151,4,152,4],[151,5,152,5],[151,6,151,7],[172,1,172,7],[174,0,175,0],[174,1,175,1],[174,2,175,2],[174,3,175,3],[174,4,175,4],[174,5,175,5],[174,6,174,7],[151,8,151,9],[155,1,155,7],[139,1,139,7],[141,0,142,0],[141,1,142,1],[141,2,142,2],[141,3,142,3],[141,4,142,4],[141,5,142,5],[141,6,141,7],[141,8,141,9],[145,1,145,7],[128,5,129,5],[128,6,128,7],[128,8,128,9],[132,1,132,7],[128,0,129,0],[128,1,129,1],[128,2,129,2],[128,3,129,3],[128,4,129,4],[121,5,122,5],[121,6,121,7],[121,8,121,9],[125,1,125,7],[126,1,126,7],[121,0,122,0],[121,1,122,1],[121,2,122,2],[121,3,122,3],[121,4,122,4],[111,5,112,5],[111,6,111,7],[111,8,111,9],[115,1,115,7],[119,1,119,7],[111,0,112,0],[111,1,112,1],[111,2,112,2],[111,3,112,3],[111,4,112,4],[101,5,102,5],[101,6,101,7],[101,8,101,9],[105,1,105,7],[109,1,109,7],[101,0,102,0],[101,1,102,1],[101,2,102,2],[101,3,102,3],[101,4,102,4],[91,5,92,5],[91,6,91,7],[91,8,91,9],[96,1,96,7],[99,1,99,7],[91,0,92,0],[91,1,92,1],[91,2,92,2],[91,3,92,3],[91,4,92,4],[81,5,82,5],[81,6,81,7],[81,8,81,9],[86,1,86,7],[89,1,89,7],[81,0,82,0],[81,1,82,1],[81,2,82,2],[81,3,82,3],[81,4,82,4],[72,5,73,5],[72,6,72,7],[72,8,72,9],[77,1,77,7],[79,1,79,7],[72,0,73,0],[72,1,73,1],[72,2,73,2],[72,3,73,3],[72,4,73,4],[63,5,64,5],[63,6,63,7],[63,8,63,9],[68,1,68,7],[70,1,70,7],[63,0,64,0],[63,1,64,1],[63,2,64,2],[63,3,64,3],[63,4,64,4],[54,5,55,5],[54,6,54,7],[54,8,54,9],[59,1,59,7],[61,1,61,7],[54,0,55,0],[54,1,55,1],[54,2,55,2],[54,3,55,3],[54,4,55,4],[45,5,46,5],[45,6,45,7],[45,8,45,9],[50,1,50,7],[52,1,52,7],[45,0,46,0],[45,1,46,1],[45,2,46,2],[45,3,46,3],[45,4,46,4],[43,1,43,7],[35,0,36,0],[35,1,36,1],[35,2,36,2],[35,3,36,3],[35,4,36,4],[35,5,36,5],[35,6,35,7],[35,8,35,9],[40,1,40,7],[33,1,33,7],[16,5,17,5],[16,6,16,7],[16,8,16,9],[16,0,17,0],[16,1,17,1],[16,2,17,2],[16,3,17,3],[16,4,17,4],[20,1,20,7],[23,1,23,7],[25,0,26,0],[25,1,26,1],[25,2,26,2],[25,3,26,3],[25,4,26,4],[25,5,26,5],[25,6,25,7],[25,8,25,9],[30,1,30,7],[0,0,0,8],[10,0,10,2],[10,3,10,6],[11,0,11,9],[12,0,12,2],[12,3,12,6],[12,7,12,8],[7,0,7,6],[9,0,9,2],[9,3,9,6],[9,7,9,8],[3,0,3,6],[4,0,4,6],[15,0,15,9],[13,0,13,2],[13,3,13,6],[1,0,1,9],[3,7,3,9],[4,7,4,9],[6,7,6,9],[7,7,7,9],[6,0,6,6],[10,8,10,9],[13,8,13,9],[14,0,14,9],[8,0,8,9],[5,0,5,9],[2,0,2,9]]}
[]
[]
[]
["UNIDADE ESCOLAR",null,null,null,null,null,null,"CÓDIGO INEP"]
[{"$f":"Orçamento!$O$4","v":"COLÉGIO ESTADUAL ANA ALGEMIRA DO PRADO"},null,null,null,null,null,null,{"$f":"Orçamento!$V$4","v":52053970}]
[]
["OBRA",null,null,null,null,null,null,"CIDADE"]
[{"$f":"Orçamento!$O$7","v":"REFORMA E AMPLIAÇÃO"},null,null,null,null,null,null,{"$f":"Orçamento!$V$7","v":"PALESTINA DE GOIÁS"}]
[]
["CRE",null,null,"ENDEREÇO",null,null,null,"REFERÊNCIA AGETOP"]
[{"$f":"Orçamento!$O$10","v":"IPORÁ"},null,null,{"$f":"Orçamento!$R$10","v":"AV RUI BARBOSA S/N QUADRA 21, CENTRO, CEP:75845-000"},null,null,null,{"$f":"Orçamento!$S$10","v":"ABR/19"},{"$f":"Orçamento!$T$10","v":"ONERADA"}]
[]
["DATA",null,null,"ÁREA TOTAL CONSTRUÍDA (M²)",null,null,null,"REFERÊNCIA SINAPI"]
[{"$f":"Orçamento!$S$7","v":"2020-05-07"},null,null,{"$f":"Orçamento!$V$13","v":1297.46},null,null,null,{"$f":"Orçamento!$V$10","v":"MAR/20"},{"$f":"Orçamento!$W$10","v":"ONERADA"}]
[]
["COMPOSIÇÕES DE CUSTOS UNITÁRIOS - SEE-GO"]
[416,"FONTE","CÓDIGO","DESCRIÇÃO","UNIDADE","COEFIC.","CUSTO UNITÁRIO",null,"CUSTO  TOTAL (A) + (B) + (C) + (D) + (E)"]
[null,null,null,null,null,null,"DESONERADO","NÃO DESONER.","DESONERADO","NÃO DESONER."]
[null,"COMPOSIÇÃO","COMP 416_SEE","ADESIVO ESTRUTURAL A BASE DE RESINA EPOXI, BICOMPONENTE, FLUIDO  1 MM - APLICADO","M2",null,null,null,71.84,72.759999999999991]
[null,"SINAPI_I",156,"ADESIVO ESTRUTURAL A BASE DE RESINA EPOXI, BICOMPONENTE, FLUIDO","KG    ",1.7,37.57,37.57,63.87,63.87]
[null,"MÃO DE OBRA (B) - TOTAL",null,null,null,null,null,null,63.87,63.87]
[null,"SINAPI",88309,"PEDREIRO COM ENCARGOS COMPLEMENTARES","H",0.25,18.57,20.81,4.6399999999999997,5.2]
[null,"SINAPI",88316,"SERVENTE COM ENCARGOS COMPLEMENTARES","H",0.25,13.32,14.75,3.33,3.69]
[null,"MATERIAL (C) - TOTAL",null,null,null,null,null,null,7.97,8.89]
[]
[382,"FONTE","CÓDIGO","DESCRIÇÃO","UNIDADE","COEFIC.","CUSTO UNITÁRIO",null,"CUSTO  TOTAL (A) + (B) + (C) + (D) + (E)"]
[null,null,null,null,null,null,"DESONERADO","NÃO DESONER.","DESONERADO","NÃO DESONER."]
[null,"COMPOSIÇÃO","COMP 382_SEE","TE DE REDUCAO DE FERRO GALVANIZADO, COM ROSCA BSP, DE 3/4\" X 1/2\"","UN ",null,null,null,24.25,26.43]
[null,"AGETOP_I",8,"AJUDANTE","h     ",0.6,8.75,10.14,5.25,6.08]
[null,"AGETOP_I",11,"ENCANADOR","h     ",0.61050000000000004,13.95,16.16,8.52,9.8699999999999992]
[null,"MÃO DE OBRA (B) - TOTAL",null,null,null,null,null,null,13.77,15.95]
[null,"SINAPI_I",3146,"FITA VEDA ROSCA EM ROLOS DE 18 MM X 10 M (L X C)","UN    ",0.12075471698113208,3.4,3.4,0.41,0.41]
[null,"SINAPI_I",6302,"TE DE REDUCAO DE FERRO GALVANIZADO, COM ROSCA BSP, DE 3/4\" X 1/2\"","UN    ",1,10.07,10.07,10.07,10.07]
[null,"MATERIAL (C) - TOTAL",null,null,null,null,null,null,10.48,10.48]
[]
[383,"FONTE","CÓDIGO","DESCRIÇÃO","UNIDADE","COEFIC.","CUSTO UNITÁRIO",null,"CUSTO  TOTAL (A) + (B) + (C) + (D) + (E)"]
[null,null,null,null,null,null,"DESONERADO","NÃO DESONER.","DESONERADO","NÃO DESONER."]
[null,"COMPOSIÇÃO","COMP 383_SEE","BUCHA DE REDUCAO DE FERRO GALVANIZADO, COM ROSCA BSP, DE 1/2\" X 1/4\"","UN ",null,null,null,7.68,8.26]
[null,"AGETOP_I",8,"AJUDANTE","h     ",0.16,8.75,10.14,1.4,1.62]
[null,"AGETOP_I",11,"ENCANADOR","h     ",0.16,13.95,16.16,2.23,2.59]
[null,"MÃO DE OBRA (B) - TOTAL",null,null,null,null,null,null,3.63,4.21]
[null,"AGETOP_I","H689","FITA VEDAROSCA 12 MM","m",1.2,0.28000000000000003,0.28000000000000003,0.34,0.34]
[null,"SINAPI_I",770,"BUCHA DE REDUCAO DE FERRO GALVANIZADO, COM ROSCA BSP, DE 1/2\" X 1/4\"","UN    ",1,3.71,3.71,3.71,3.71]
[null,"MATERIAL (C) - TOTAL",null,null,null,null,null,null,4.05,4.05]
[]
[212,"FONTE","CÓDIGO","DESCRIÇÃO","UNIDADE","COEFIC.","CUSTO UNITÁRIO",null,"CUSTO  TOTAL (A) + (B) + (C) + (D) + (E)"]
[null,null,null,null,null,null,"DESONERADO","NÃO DESONER.","DESONERADO","NÃO DESONER."]
[null,"COMPOSIÇÃO","COMP 212_SEE","NIPLE DE REDUÇÃO 1/2\" X 1/4\" BSP","UN ",null,null,null,9.68,10.26]
[null,"AGETOP_I",8,"AJUDANTE","h     ",0.16,8.75,10.14,1.4,1.62]
[null,"AGETOP_I",11,"ENCANADOR","h     ",0.16,13.95,16.16,2.23,2.59]
[null,"MÃO DE OBRA (B) - TOTAL",null,null,null,null,null,null,3.63,4.21]
[null,"COTAÇÃO","COT 103_SEE","NIPLE DE REDUÇÃO 1/2\" X 1/4\" BSP","UN",1,6.0533333333333337,6.0533333333333337,6.05,6.05]
[null,"MATERIAL (C) - TOTAL",null,null,null,null,null,null,6.05,6.05]
[]
[213,"FONTE","CÓDIGO","DESCRIÇÃO","UNIDADE","COEFIC.","CUSTO UNITÁRIO",null,"CUSTO  TOTAL (A) + (B) + (C) + (D) + (E)"]
[null,null,null,null,null,null,"DESONERADO","NÃO DESONER.","DESONERADO","NÃO DESONER."]
[null,"COMPOSIÇÃO","COMP 213_SEE","NIPLE DE REDUÇÃO 3/4\" X 1/2\" BSP","UN ",null,null,null,13.34,13.920000000000002]
[null,"AGETOP_I",8,"AJUDANTE","h     ",0.16,8.75,10.14,1.4,1.62]
[null,"AGETOP_I",11,"ENCANADOR","h     ",0.16,13.95,16.16,2.23,2.59]
[null,"MÃO DE OBRA (B) - TOTAL",null,null,null,null,null,null,3.63,4.21]
[null,"COTAÇÃO","COT 104_SEE","NIPLE DE REDUÇÃO 3/4\" X 1/2\" BSP","UN",1,9.7099999999999991,9.7099999999999991,9.7100000000000009,9.7100000000000009]
[null,"MATERIAL (C) - TOTAL",null,null,null,null,null,null,9.7100000000000009,9.7100000000000009]
[]
[542,"FONTE","CÓDIGO","DESCRIÇÃO","UNIDADE","COEFIC.","CUSTO UNITÁRIO",null,"CUSTO  TOTAL (A) + (B) + (C) + (D) + (E)"]
[null,null,null,null,null,null,"DESONERADO","NÃO DESONER.","DESONERADO","NÃO DESONER."]
[null,"COMPOSIÇÃO","COMP 542_SEE","VÁLVULA UGV 3/4\" (S) LATÃO","UN ",null,null,null,25.65,27.2]
[null,"AGETOP_I",8,"AJUDANTE","h     ",0.432,8.75,10.14,3.78,4.38]
[null,"AGETOP_I",11,"ENCANADOR","h     ",0.432,13.95,16.16,6.03,6.98]
[null,"MÃO DE OBRA (B) - TOTAL",null,null,null,null,null,null,9.81,11.36]
[null,"COTAÇÃO","COT 281_SEE","VÁLVULA UGV 3/4\" (S) LATÃO","UN ",1,15.836666666666666,15.836666666666666,15.84,15.84]
[null,"MATERIAL (C) - TOTAL",null,null,null,null,null,null,15.84,15.84]
[]
[543,"FONTE","CÓDIGO","DESCRIÇÃO","UNIDADE","COEFIC.","CUSTO UNITÁRIO",null,"CUSTO  TOTAL (A) + (B) + (C) + (D) + (E)"]
[null,null,null,null,null,null,"DESONERADO","NÃO DESONER.","DESONERADO","NÃO DESONER."]
[null,"COMPOSIÇÃO","COMP 543_SEE","VÁLVULA UGV 1/2\" (S) LATÃO","UN ",null,null,null,24.98,26.53]
[null,"AGETOP_I",8,"AJUDANTE","h     ",0.432,8.75,10.14,3.78,4.38]
[null,"AGETOP_I",11,"ENCANADOR","h     ",0.432,13.95,16.16,6.03,6.98]
[null,"MÃO DE OBRA (B) - TOTAL",null,null,null,null,null,null,9.81,11.36]
[null,"COTAÇÃO","COT 282_SEE","VÁLVULA UGV 1/2\" (S) LATÃO","UN ",1,15.166666666666666,15.166666666666666,15.17,15.17]
[null,"MATERIAL (C) - TOTAL",null,null,null,null,null,null,15.17,15.17]
[]
[211,"FONTE","CÓDIGO","DESCRIÇÃO","UNIDADE","COEFIC.","CUSTO UNITÁRIO",null,"CUSTO  TOTAL (A) + (B) + (C) + (D) + (E)"]
[null,null,null,null,null,null,"DESONERADO","NÃO DESONER.","DESONERADO","NÃO DESONER."]
[null,"COMPOSIÇÃO","COMP 211_SEE","REGULADOR DE 2º ESTÁGIO 5KG/H","UN ",null,null,null,86.72,90.86]
[null,"AGETOP_I",8,"AJUDANTE","h     ",1.1499999999999999,8.75,10.14,10.06,11.66]
[null,"AGETOP_I",11,"ENCANADOR","h     ",1.1499999999999999,13.95,16.16,16.04,18.579999999999998]
[null,"MÃO DE OBRA (B) - TOTAL",null,null,null,null,null,null,26.1,30.24]
[null,"COTAÇÃO","COT 102_SEE","REGULADOR DE 2º ESTÁGIO 5KG/H","UN",1,59.833333333333336,59.833333333333336,59.83,59.83]
[null,"AGETOP_I","H689","FITA VEDAROSCA 12 MM","m",2.82,0.28000000000000003,0.28000000000000003,0.79,0.79]
[null,"MATERIAL (C) - TOTAL",null,null,null,null,null,null,60.62,60.62]
[]
[210,"FONTE","CÓDIGO","DESCRIÇÃO","UNIDADE","COEFIC.","CUSTO UNITÁRIO",null,"CUSTO  TOTAL (A) + (B) + (C) + (D) + (E)"]
[null,null,null,null,null,null,"DESONERADO","NÃO DESONER.","DESONERADO","NÃO DESONER."]
[null,"COMPOSIÇÃO","COMP 210_SEE","REGULADOR DE 1º ESTÁGIO 60KG/H MODELO AP-40  COM MANÔMETRO","UN ",null,null,null,232.47,236.61]
[null,"AGETOP_I",8,"AJUDANTE","h     ",1.1499999999999999,8.75,10.14,10.06,11.66]
[null,"AGETOP_I",11,"ENCANADOR","h     ",1.1499999999999999,13.95,16.16,16.04,18.579999999999998]
[null,"MÃO DE OBRA (B) - TOTAL",null,null,null,null,null,null,26.1,30.24]
[null,"COTAÇÃO","COT 101_SEE","REGULADOR DE 1º ESTÁGIO 60KG/H MODELO AP-40  COM MANÔMETRO","UN",1,205.57666666666668,205.57666666666668,205.58,205.58]
[null,"AGETOP_I","H689","FITA VEDAROSCA 12 MM","m",2.82,0.28000000000000003,0.28000000000000003,0.79,0.79]
[null,"MATERIAL (C) - TOTAL",null,null,null,null,null,null,206.37,206.37]
[]
[235,"FONTE","CÓDIGO","DESCRIÇÃO","UNIDADE","COEFIC.","CUSTO UNITÁRIO",null,"CUSTO  TOTAL (A) + (B) + (C) + (D) + (E)"]
[null,null,null,null,null,null,"DESONERADO","NÃO DESONER.","DESONERADO","NÃO DESONER."]
[null,"COMPOSIÇÃO","COMP 235_SEE","PLACA DE SINALIZAÇÃO EM PVC COD 01 - (300X300) PROIBIDO FUMAR","UN ",null,null,null,25.319999999999997,25.439999999999998]
[null,"AGETOP_I",5,"SERVENTE","h     ",0.09,8.75,10.14,0.79,0.91]
[null,"MÃO DE OBRA (B) - TOTAL",null,null,null,null,null,null,0.79,0.91]
[null,"AGETOP_I",3070,"BUCHA DE NYLON S-6","un",2,0.04,0.04,0.08,0.08]
[null,"AGETOP_I",3393,"PARAFUSO P/BUCHA S-6","un",2,0.08,0.08,0.16,0.16]
[null,"SINAPI_I",37556,"PLACA DE SINALIZACAO DE SEGURANCA CONTRA INCENDIO, FOTOLUMINESCENTE, QUADRADA, *20 X 20* CM, EM PVC *2* MM ANTI-CHAMAS (SIMBOLOS, CORES E PICTOGRAMAS CONFORME NBR 13434)","UN    ",1,24.29,24.29,24.29,24.29]
[null,"MATERIAL (C) - TOTAL",null,null,null,null,null,null,24.529999999999998,24.529999999999998]
[]
[236,"FONTE","CÓDIGO","DESCRIÇÃO","UNIDADE","COEFIC.","CUSTO UNITÁRIO",null,"CUSTO  TOTAL (A) + (B) + (C) + (D) + (E)"]
[null,null,null,null,null,null,"DESONERADO","NÃO DESONER.","DESONERADO","NÃO DESONER."]
[null,"COMPOSIÇÃO","COMP 236_SEE","PLACA DE SINALIZAÇÃO EM PVC COD 06 - (300X300) PERIGO INFLAMÁVEL","UN ",null,null,null,25.319999999999997,25.439999999999998]
[null,"AGETOP_I",5,"SERVENTE","h     ",0.09,8.75,10.14,0.79,0.91]
[null,"MÃO DE OBRA (B) - TOTAL",null,null,null,null,null,null,0.79,0.91]
[null,"AGETOP_I",3070,"BUCHA DE NYLON S-6","un",2,0.04,0.04,0.08,0.08]
[null,"AGETOP_I",3393,"PARAFUSO P/BUCHA S-6","un",2,0.08,0.08,0.16,0.16]
[null,"SINAPI_I",37556,"PLACA DE SINALIZACAO DE SEGURANCA CONTRA INCENDIO, FOTOLUMINESCENTE, QUADRADA, *20 X 20* CM, EM PVC *2* MM ANTI-CHAMAS (SIMBOLOS, CORES E PICTOGRAMAS CONFORME NBR 13434)","UN    ",1,24.29,24.29,24.29,24.29]
[null,"MATERIAL (C) - TOTAL",null,null,null,null,null,null,24.529999999999998,24.529999999999998]
[]
[45,"FONTE","CÓDIGO","DESCRIÇÃO","UNIDADE","COEFIC.","CUSTO UNITÁRIO",null,"CUSTO  TOTAL (A) + (B) + (C) + (D) + (E)"]
[null,null,null,null,null,null,"DESONERADO","NÃO DESONER.","DESONERADO","NÃO DESONER."]
[null,"COMPOSIÇÃO","COMP 045_SEE","LAUDO DE ESTANQUEIDADE","UN ",null,null,null,936,1085.1199999999999]
[null,"AGETOP",250101,"ENGENHEIRO - (OBRAS CIVIS)","H     ",16,58.5,67.819999999999993,936,1085.1199999999999]
[null,"MÃO DE OBRA (B) - TOTAL",null,null,null,null,null,null,936,1085.1199999999999]
[null,"MATERIAL (C) - TOTAL",null,null,null,null,null,null,0,0]
[]
[277,"FONTE","CÓDIGO","DESCRIÇÃO","UNIDADE","COEFIC.","CUSTO UNITÁRIO",null,"CUSTO  TOTAL (A) + (B) + (C) + (D) + (E)"]
[null,null,null,null,null,null,"DESONERADO","NÃO DESONER.","DESONERADO","NÃO DESONER."]
[null,"COMPOSIÇÃO","COMP 277_SEE","MARCAÇÃO NO PISO - 1X1 M PARA EXTINTOR","M2",null,null,null,29.67,29.75]
[null,"AGETOP_I",5,"SERVENTE","h     ",3.3300000000000003E-2,8.75,10.14,0.28999999999999998,0.34]
[null,"MÃO DE OBRA (B) - TOTAL",null,null,null,null,null,null,0.28999999999999998,0.34]
[null,"SINAPI_I",5318,"SOLVENTE DILUENTE A BASE DE AGUARRAS","L     ",0.13,11.78,11.78,1.53,1.53]
[null,"SINAPI",5824,"CAMINHÃO TOCO, PBT 16.000 KG, CARGA ÚTIL MÁX. 10.685 KG, DIST. ENTRE EIXOS 4,8 M, POTÊNCIA 189 CV, INCLUSIVE CARROCERIA FIXA ABERTA DE MADEIRA P/ TRANSPORTE GERAL DE CARGA SECA, DIMEN. APROX. 2,5 X 7,00 X 0,50 M - CHP DIURNO. AF_06/2014","CHP",3.3E-3,120.02,123.21,0.4,0.41]
[null,"SINAPI_I",7343,"TINTA A BASE DE RESINA ACRILICA, PARA SINALIZACAO HORIZONTAL VIARIA (NBR 11862)","L     ",0.6,12.82,12.82,7.69,7.69]
[null,"SINAPI_I",7348,"TINTA ACRILICA PREMIUM PARA PISO","L     ",0.03,13.72,13.72,0.41,0.41]
[null,"SINAPI_I",25972,"MICROESFERAS DE VIDRO PARA SINALIZACAO HORIZONTAL VIARIA, TIPO I-B (PREMIX) - NBR 16184","KG    ",2.14,8.8800000000000008,8.8800000000000008,19,19]
[null,"SINAPI",95133,"MÁQUINA DEMARCADORA DE FAIXA DE TRÁFEGO À FRIO, AUTOPROPELIDA, POTÊNCIA 38 HP - CHP DIURNO. AF_07/2016","CHP",3.3E-3,107.44,110.99,0.35,0.37]
[null,"MATERIAL (C) - TOTAL",null,null,null,null,null,null,29.380000000000003,29.41]
[]
[24,"FONTE","CÓDIGO","DESCRIÇÃO","UNIDADE","COEFIC.","CUSTO UNITÁRIO",null,"CUSTO  TOTAL (A) + (B) + (C) + (D) + (E)"]
[null,null,null,null,null,null,"DESONERADO","NÃO DESONER.","DESONERADO","NÃO DESONER."]
[null,"COMPOSIÇÃO","COMP 024_SEE","SINALIZADOR FOTOLUMINESCENTE PARA EXTINTOR","UN ",null,"-","-",25.319999999999997,25.439999999999998]
[null,"AGETOP_I",5,"SERVENTE","h     ",0.09,8.75,10.14,0.79,0.91]
[null,"MÃO DE OBRA (B) - TOTAL",null,null,null,null,null,null,0.79,0.91]
[null,"AGETOP_I",3070,"BUCHA DE NYLON S-6","un",2,0.04,0.04,0.08,0.08]
[null,"AGETOP_I",3393,"PARAFUSO P/BUCHA S-6","un",2,0.08,0.08,0.16,0.16]
[null,"SINAPI_I",37556,"PLACA DE SINALIZACAO DE SEGURANCA CONTRA INCENDIO, FOTOLUMINESCENTE, QUADRADA, *20 X 20* CM, EM PVC *2* MM ANTI-CHAMAS (SIMBOLOS, CORES E PICTOGRAMAS CONFORME NBR 13434)","UN    ",1,24.29,24.29,24.29,24.29]
[null,"MATERIAL (C) - TOTAL",null,null,null,null,null,null,24.529999999999998,24.529999999999998]
[]
[25,"FONTE","CÓDIGO","DESCRIÇÃO","UNIDADE","COEFIC.","CUSTO UNITÁRIO",null,"CUSTO  TOTAL (A) + (B) + (C) + (D) + (E)"]
[null,null,null,null,null,null,"DESONERADO","NÃO DESONER.","DESONERADO","NÃO DESONER."]
[null,"COMPOSIÇÃO","COMP 025_SEE","SINALIZADOR FOTOLUMINESCENTE DE EMERGÊNCIA","UN ",null,"-","-",25.319999999999997,25.439999999999998]
[null,"AGETOP_I",5,"SERVENTE","h     ",0.09,8.75,10.14,0.79,0.91]
[null,"MÃO DE OBRA (B) - TOTAL",null,null,null,null,null,null,0.79,0.91]
[null,"AGETOP_I",3070,"BUCHA DE NYLON S-6","un",2,0.04,0.04,0.08,0.08]
[null,"AGETOP_I",3393,"PARAFUSO P/BUCHA S-6","un",2,0.08,0.08,0.16,0.16]
[null,"SINAPI_I",37556,"PLACA DE SINALIZACAO DE SEGURANCA CONTRA INCENDIO, FOTOLUMINESCENTE, QUADRADA, *20 X 20* CM, EM PVC *2* MM ANTI-CHAMAS (SIMBOLOS, CORES E PICTOGRAMAS CONFORME NBR 13434)","UN    ",1,24.29,24.29,24.29,24.29]
[null,"MATERIAL (C) - TOTAL",null,null,null,null,null,null,24.529999999999998,24.529999999999998]
[]
[277,"FONTE","CÓDIGO","DESCRIÇÃO","UNIDADE","COEFIC.","CUSTO UNITÁRIO",null,"CUSTO  TOTAL (A) + (B) + (C) + (D) + (E)"]
[null,null,null,null,null,null,"DESONERADO","NÃO DESONER.","DESONERADO","NÃO DESONER."]
[null,"COMPOSIÇÃO","COMP 277_SEE","MARCAÇÃO NO PISO - 1X1 M PARA EXTINTOR","M2",null,null,null,29.67,29.75]
[null,"AGETOP_I",5,"SERVENTE","h     ",3.3300000000000003E-2,8.75,10.14,0.28999999999999998,0.34]
[null,"MÃO DE OBRA (B) - TOTAL",null,null,null,null,null,null,0.28999999999999998,0.34]
[null,"SINAPI_I",5318,"SOLVENTE DILUENTE A BASE DE AGUARRAS","L     ",0.13,11.78,11.78,1.53,1.53]
[null,"SINAPI",5824,"CAMINHÃO TOCO, PBT 16.000 KG, CARGA ÚTIL MÁX. 10.685 KG, DIST. ENTRE EIXOS 4,8 M, POTÊNCIA 189 CV, INCLUSIVE CARROCERIA FIXA ABERTA DE MADEIRA P/ TRANSPORTE GERAL DE CARGA SECA, DIMEN. APROX. 2,5 X 7,00 X 0,50 M - CHP DIURNO. AF_06/2014","CHP",3.3E-3,120.02,123.21,0.4,0.41]
[null,"SINAPI_I",7343,"TINTA A BASE DE RESINA ACRILICA, PARA SINALIZACAO HORIZONTAL VIARIA (NBR 11862)","L     ",0.6,12.82,12.82,7.69,7.69]
[null,"SINAPI_I",7348,"TINTA ACRILICA PREMIUM PARA PISO","L     ",0.03,13.72,13.72,0.41,0.41]
[null,"SINAPI_I",25972,"MICROESFERAS DE VIDRO PARA SINALIZACAO HORIZONTAL VIARIA, TIPO I-B (PREMIX) - NBR 16184","KG    ",2.14,8.8800000000000008,8.8800000000000008,19,19]
[null,"SINAPI",95133,"MÁQUINA DEMARCADORA DE FAIXA DE TRÁFEGO À FRIO, AUTOPROPELIDA, POTÊNCIA 38 HP - CHP DIURNO. AF_07/2016","CHP",3.3E-3,107.44,110.99,0.35,0.37]
[null,"MATERIAL (C) - TOTAL",null,null,null,null,null,null,29.380000000000003,29.41]
[]
[84,"FONTE","CÓDIGO","DESCRIÇÃO","UNIDADE","COEFIC.","CUSTO UNITÁRIO",null,"CUSTO  TOTAL (A) + (B) + (C) + (D) + (E)"]
[null,null,null,null,null,null,"DESONERADO","NÃO DESONER.","DESONERADO","NÃO DESONER."]
[null,"COMPOSIÇÃO","COMP 084_SEE","GUARDA-CORPO COM CORRIMÃO - SEDUC","M",null,null,null,206.14000000000001,211.22000000000003]
[null,"AGETOP_I",25,"OFICIAL \"B\"","h     ",1.1000000000000001,13.95,16.16,15.35,17.78]
[null,"AGETOP_I",8,"AJUDANTE","h     ",1.1000000000000001,8.75,10.14,9.6300000000000008,11.15]
[null,"MÃO DE OBRA (B) - TOTAL",null,null,null,null,null,null,24.98,28.93]
[null,"AGETOP_I",2376,"TUBO INDUSTRIAL 2\" CHAPA 13 ","Kg",7.7778,5.23,5.23,40.68,40.68]
[null,"AGETOP_I",2504,"TUBO INDUSTRIAL D=25 MM CHAPA 13 ","Kg",4.6319999999999997,5.07,5.07,23.48,23.48]
[null,"AGETOP_I",2377,"TUBO INDUSTRIAL 40X40 CH.13","Kg",6.3419999999999996,5.07,5.07,32.15,32.15]
[null,"AGETOP_I",2421,"TUBO INDUSTRIAL 1.1/2\" CHAPA 13 ","Kg",1.4862,5.07,5.07,7.54,7.54]
[null,"AGETOP_I",2417,"MASSA PLASTICA","Kg",0.2041,10.58,10.58,2.16,2.16]
[null,"AGETOP_I",2246,"ELETRODO 2.5 OK","Kg",0.11459999999999999,8.6999999999999993,8.6999999999999993,1,1]
[null,"AGETOP_I",1672,"LIXA PARA FERRO ( NÚMERO 100 )","un",0.25509999999999999,2.12,2.12,0.54,0.54]
[null,"AGETOP_I",1264,"DISCO DE DESBASTE 7/8\" P/ CONC./FERRO (1/4\" X 7\")","un",5.0999999999999997E-2,7,7,0.36,0.36]
[null,"AGETOP_I",1334,"DISCO DE CORTE DIAM. 5/8\"- 10\"","un",0.373,5.5,5.5,2.0499999999999998,2.0499999999999998]
[null,"AGETOP_I",2902,"FABRICAÇÃO / MONTAGEM","un",1,50.44,50.44,50.44,50.44]
[null,"AGETOP_I",2150,"CHAPA DE FERRO DOBRADA No.13","Kg",0.43519999999999998,5.28,5.28,2.2999999999999998,2.2999999999999998]
[null,"AGETOP_I",2719,"CHAPA PERFILADA 3/16\"","Kg",1.0979999999999999,5.04,5.04,5.53,5.53]
[null,"AGETOP_I",2436,"ACO CA-25 - 6,3 MM (1/4\") - BARRA LISA A-36","Kg",0.38124999999999998,5.13,5.13,1.96,1.96]
[null,"AGETOP",261602,"PINT.ESMALTE/ESQUAD.FERRO C/FUNDO ANTICOR.","m2    ",0.78,14.07,15.51,10.97,12.1]
[null,"MATERIAL (C) - TOTAL",null,null,null,null,null,null,181.16000000000003,182.29000000000002]
[]
[27,"FONTE","CÓDIGO","DESCRIÇÃO","UNIDADE","COEFIC.","CUSTO UNITÁRIO",null,"CUSTO  TOTAL (A) + (B) + (C) + (D) + (E)"]
[null,null,null,null,null,null,"DESONERADO","NÃO DESONER.","DESONERADO","NÃO DESONER."]
[null,"COMPOSIÇÃO","COMP 027_SEE","TELA MOSQUITEIRA EM NYLON COM ESTRUTURA DE ALUMÍNIO, COM FORNECIMENTO DE MÃO DE OBRA E INSTALAÇÃO","M2",null,null,null,123.21,123.21]
[null,"MÃO DE OBRA (B) - TOTAL",null,null,null,null,null,null,0,0]
[null,"COTAÇÃO","COT 002_SEE","TELA MOSQUITEIRA EM NYLON COM ESTRUTURA DE ALUMÍNIO [M²], COM FORNECIMENTO DE MÃO DE OBRA E INSTALAÇÃO","M2",1,123.21333333333332,123.21333333333332,123.21,123.21]
[null,"MATERIAL (C) - TOTAL",null,null,null,null,null,null,123.21,123.21]
[]
[575,"FONTE","CÓDIGO","DESCRIÇÃO","UNID ","COEFIC.","CUSTO UNITÁRIO",null,"CUSTO  TOTAL (A) + (B) + (C) + (D) + (E)"]
[null,null,null,null,null,null,"DESONERADO","NÃO DESONER.","DESONERADO","NÃO DESONER."]
[null,"COMPOSIÇÃO","COMP 575_SEE","MOLA AEREA FECHA PORTA, PARA PORTAS COM LARGURA ATE 95 CM","UN ","-","-","-",121.89,122.76]
[null,"AGETOP_I",5,"SERVENTE","h     ",0.15,8.75,10.14,1.31,1.52]
[null,"AGETOP_I",24,"MARCENEIRO","h     ",0.3,13.95,16.16,4.1900000000000004,4.8499999999999996]
[null,"MÃO DE OBRA (B) - TOTAL",null,null,null,null,null,null,5.5,6.3699999999999992]
[null,"SINAPI_I",11560,"MOLA AEREA FECHA PORTA, PARA PORTAS COM LARGURA ATE 95 CM","UN    ",1,116.39,116.39,116.39,116.39]
[null,"MATERIAL (C) - TOTAL",null,null,null,null,null,null,116.39,116.39]