{"text_format":"1","workbook":"xlsx","n_sheets":8,"sheets":["Orçamento","Resumo ","Somatório","Cronog_120_Dias","Composição BDI","Relatório CENTRAL","Parc Maior Relev","Composições"],"not_rendered":{"charts":0,"images":6,"macros":1,"external_links":0,"defined_names":105,"comments":1,"pivot_tables":0},"unopened":[],"bounds":{"document_bytes":16777216,"sheet_cells":100000,"rows_first":2000,"rows_last":500,"rows_between":2000,"halvings":0,"cell_chars":16384,"cell_head_chars":4096},"cells_cut":0,"cells_raw":0,"read":"whole","date_system":"1900"}

{"sheet":"Orçamento","index":0,"n_rows":606,"n_cols":27,"rows_kept":606,"cut":false,"hidden":false,"merged":[[586,15,586,17],[586,18,586,22],[580,14,580,26],[581,18,581,22],[582,15,582,17],[582,18,582,22],[567,15,567,17],[599,23,599,25],[600,23,600,25],[601,23,601,25],[602,23,602,25],[603,23,603,25],[604,23,604,25],[605,23,605,25],[574,14,574,17],[581,15,581,17],[605,18,605,22],[604,18,604,22],[603,18,603,22],[575,23,575,25],[596,23,596,25],[597,23,597,25],[598,23,598,25],[581,23,581,25],[582,23,582,25],[583,23,583,25],[584,23,584,25],[585,23,585,25],[586,23,586,25],[587,23,587,25],[588,23,588,25],[547,15,547,17],[602,18,602,22],[590,15,590,17],[590,18,590,22],[591,15,591,17],[591,18,591,22],[592,15,592,17],[592,18,592,22],[596,15,596,17],[596,18,596,22],[597,15,597,17],[597,18,597,22],[598,15,598,17],[587,15,587,17],[602,14,602,17],[599,15,599,17],[599,18,599,22],[600,15,600,17],[600,18,600,22],[601,15,601,17],[601,18,601,22],[554,15,554,17],[555,15,555,17],[556,15,556,17],[538,16,538,24],[539,16,539,24],[540,16,540,24],[10,14,10,26],[13,14,13,26],[2,14,2,22],[3,14,3,22],[5,18,5,22],[6,18,6,22],[11,18,11,22],[12,18,12,22],[6,14,6,17],[5,14,5,17],[3,23,3,25],[2,23,2,25],[5,23,5,25],[6,23,6,25],[8,18,8,20],[530,17,535,17],[536,22,536,24],[530,22,530,24],[531,22,531,24],[532,22,532,24],[9,24,9,25],[541,16,541,24],[547,23,547,25],[563,23,563,25],[564,23,564,25],[583,15,583,17],[583,18,583,22],[542,16,542,24],[560,15,560,17],[561,15,561,17],[546,14,546,26],[547,18,547,22],[548,18,548,22],[556,18,556,22],[557,18,557,22],[558,18,558,22],[559,18,559,22],[571,18,571,22],[568,15,568,17],[548,15,548,17],[549,15,549,17],[550,15,550,17],[551,15,551,17],[552,15,552,17],[553,15,553,17],[565,23,565,25],[566,23,566,25],[564,15,564,17],[565,15,565,17],[566,15,566,17],[567,23,567,25],[562,15,562,17],[563,15,563,17],[561,23,561,25],[562,23,562,25],[560,23,560,25],[577,18,577,22],[553,18,553,22],[554,18,554,22],[552,18,552,22],[561,18,561,22],[543,18,543,24],[549,18,549,22],[550,18,550,22],[551,18,551,22],[574,18,574,22],[572,18,572,22],[573,18,573,22],[563,18,563,22],[570,18,570,22],[566,18,566,22],[568,18,568,22],[564,18,564,22],[565,18,565,22],[574,23,574,25],[568,23,568,25],[569,23,569,25],[570,23,570,25],[571,23,571,25],[560,18,560,22],[557,15,557,17],[558,15,558,17],[559,15,559,17],[569,18,569,22],[567,18,567,22],[575,18,575,22],[562,18,562,22],[555,18,555,22],[569,15,569,17],[570,15,570,17],[572,15,572,17],[573,15,573,17],[0,14,0,24],[8,14,8,16],[9,14,9,16],[11,14,11,16],[12,14,12,16],[14,14,14,24],[1,14,1,24],[4,14,4,24],[7,14,7,24],[8,23,8,25],[592,23,592,25],[593,23,593,25],[594,23,594,25],[595,23,595,25],[571,15,571,17],[576,23,576,25],[577,23,577,25],[572,23,572,25],[576,18,576,22],[593,15,593,17],[593,18,593,22],[594,15,594,17],[594,18,594,22],[595,15,595,17],[595,18,595,22],[587,18,587,22],[588,15,588,17],[588,18,588,22],[589,15,589,17],[589,18,589,22],[584,15,584,17],[584,18,584,22],[585,15,585,17],[585,18,585,22],[598,18,598,22],[534,22,534,24],[535,22,535,24],[6,12,6,13],[5,12,5,13],[12,23,12,25],[11,23,11,25],[9,19,9,22],[573,23,573,25],[548,23,548,25],[549,23,549,25],[550,23,550,25],[551,23,551,25],[552,23,552,25],[553,23,553,25],[554,23,554,25],[555,23,555,25],[556,23,556,25],[557,23,557,25],[558,23,558,25],[559,23,559,25],[589,23,589,25],[590,23,590,25],[591,23,591,25]]}
[]
[]
[null,null,null,null,null,null,null,null,null,null,null,null,null,null,"UNIDADE ESCOLAR",null,null,null,null,null,null,null,null,"CÓDIGO INEP"]
[null,null,null,null,null,null,null,null,null,null,null,null,{"$f":"IF($M$7=\"MANUAL\",\"DESPROTEJA A PLANILHA PARA FORMATAR\",\"\")","v":""},null,"COORDENAÇÃO REGIONAL DE EDUCAÇÃO DE TRINDADE"]
[]
["Nmax",null,null,null,null,null,null,null,null,null,null,null,null,null,"OBRA",null,null,null,"DATA",null,null,null,null,"CIDADE"]
[{"$f":"MAX($C$18:$C$530)","v":4},null,null,null,null,null,null,null,null,null,null,null,null,null,"REFORMA E AMPLIAÇÃO",null,null,null,"2020-09-02",null,null,null,null,"TRINDADE"]
[]
[null,null,null,null,null,null,null,null,null,null,null,null,null,null,"CRE",null,null,"ENDEREÇO","REFERÊNCIA AGETOP",null,null,null,null,"REFERÊNCIA SINAPI"]
[null,null,null,null,null,null,null,null,null,null,null,null,null,null,"CRE-TRINDADE",null,null,"AVENIDA MANOEL MONTEIRO, 163 - BAIRRO SANTUÁRIO","ABR/19","ONERADA",null,null,null,"ABR/20","ONERADA"]
[]
[null,null,null,null,null,null,null,null,null,null,null,null,null,null,"ÁREA EXISTENTE (M²)",null,null,"ÁREA A CONSTRUIR (M²)","ÁREA A DEMOLIR (M²)",null,null,null,null,"ÁREA TOTAL CONSTRUÍDA (M²)"]
[null,null,null,null,null,null,null,null,null,null,null,null,null,null,503.98,null,null,281.89,16.7,null,null,null,null,769.17]
[]
[null,null,null,null,null,null,null,null,null,null,null,"FILTRO",null,null,"PLANILHA ORÇAMENTÁRIA"]
["Nível E","Save Nivel","Nível C","Altura","n1","n2","n3","n4","n5","Czero","Cnível","↓","Nível","Nível Corrigido","ITEM","TABELA","CODIGO","DESCRIÇÃO DOS SERVIÇOS","UNID","QUANT","REPET","QUANT TOTAL","MAT","MO","T.SERVIÇO UNIT","VALOR TOTAL","OBSERVAÇÕES¹"]
[{"$f":"CHOOSE(1+LOG(1+2*(ORÇAMENTO.Nivel=\"Nível 1\")+4*(ORÇAMENTO.Nivel=\"Nível 2\")+8*(ORÇAMENTO.Nivel=\"Nível 3\")+16*(ORÇAMENTO.Nivel=\"Nível 4\")+32*(ORÇAMENTO.Nivel=\"Serviço\"),2),0,1,2,3,4,\"S\")","v":"S"},{"$f":"IF(OR(C17=\"s\",C17=0),OFFSET(B17,-1,0),C17)","v":"Save Nivel"},{"$f":"IF(OFFSET(C17,-1,0)=\"L\",1,IF(OFFSET(C17,-1,0)=1,2,IF(OR(A17=\"s\",A17=0),\"S\",IF(AND(OFFSET(C17,-1,0)=2,A17=4),3,IF(AND(OR(OFFSET(C17,-1,0)=\"s\",OFFSET(C17,-1,0)=0),A17<>\"s\",A17>OFFSET(B17,-1,0)),OFFSET(B17,-1,0),A17)))))","v":"S"},{"$f":"IF(OR(C17=\"S\",C17=0),0,IF(ISERROR(K17),J17,SMALL(J17:K17,1)))","v":0},{"$f":"IF($C17=1,OFFSET(E17,-1,0)+1,OFFSET(E17,-1,0))","v":"n1"},{"$f":"IF($C17=1,0,IF($C17=2,OFFSET(F17,-1,0)+1,OFFSET(F17,-1,0)))","v":"n2"},{"$f":"IF(AND($C17<=2,$C17<>0),0,IF($C17=3,OFFSET(G17,-1,0)+1,OFFSET(G17,-1,0)))","v":"n3"},{"$f":"IF(AND($C17<=3,$C17<>0),0,IF($C17=4,OFFSET(H17,-1,0)+1,OFFSET(H17,-1,0)))","v":"n4"},{"$f":"IF(AND($C17<=4,$C17<>0),0,IF(AND($C17=\"S\",$Y17>0),OFFSET(I17,-1,0)+1,OFFSET(I17,-1,0)))","v":"n5"},{"$f":"IF(OR($C17=\"S\",$C17=0),0,MATCH(0,OFFSET($D17,1,$C17,ROW($C$530)-ROW($C17)),0))","v":0},{"$f":"IF(OR($C17=\"S\",$C17=0),0,MATCH(OFFSET($D17,0,$C17)+1,OFFSET($D17,1,$C17,ROW($C$530)-ROW($C17)),0))","v":0},{"$f":"IF(OR(Y17>0,$C17=1),\"F\",\"\")","v":""},"Serviço",{"$f":"CHOOSE(1+LOG(1+2*(C17=1)+4*(C17=2)+8*(C17=3)+16*(C17=4)+32*(C17=\"S\"),2),\"\",\"Nível 1\",\"Nível 2\",\"Nível 3\",\"Nível 4\",\"Serviço\")","v":"Serviço"},"-","SINAPI",null,"(sem código)","-",null,"REPET","-",0,0,0,"-",""]
[0,null,"L",{"$f":"COUNTA(OFFSET(D18,1,0):D$530)","v":511},{"$f":"LEFT(O19,1)-1","v":0},null,null,null,null,null,null,"F","LOTE","LOTE","REFORMA E AMPLIAÇÃO - COORDENAÇÃO REGIONAL DE EDUCAÇÃO DE TRINDADE",null,null,null,null,null,null,null,null,null,null,0]
[{"$f":"CHOOSE(1+LOG(1+2*(ORÇAMENTO.Nivel=\"Nível 1\")+4*(ORÇAMENTO.Nivel=\"Nível 2\")+8*(ORÇAMENTO.Nivel=\"Nível 3\")+16*(ORÇAMENTO.Nivel=\"Nível 4\")+32*(ORÇAMENTO.Nivel=\"Serviço\"),2),0,1,2,3,4,\"S\")","v":1},{"$f":"IF(OR(C19=\"s\",C19=0),OFFSET(B19,-1,0),C19)","v":1},{"$f":"IF(OFFSET(C19,-1,0)=\"L\",1,IF(OFFSET(C19,-1,0)=1,2,IF(OR(A19=\"s\",A19=0),\"S\",IF(AND(OFFSET(C19,-1,0)=2,A19=4),3,IF(AND(OR(OFFSET(C19,-1,0)=\"s\",OFFSET(C19,-1,0)=0),A19<>\"s\",A19>OFFSET(B19,-1,0)),OFFSET(B19,-1,0),A19)))))","v":1},{"$f":"IF(OR(C19=\"S\",C19=0),0,IF(ISERROR(K19),J19,SMALL(J19:K19,1)))","v":27},{"$f":"IF($C19=1,OFFSET(E19,-1,0)+1,OFFSET(E19,-1,0))","v":1},{"$f":"IF($C19=1,0,IF($C19=2,OFFSET(F19,-1,0)+1,OFFSET(F19,-1,0)))","v":0},{"$f":"IF(AND($C19<=2,$C19<>0),0,IF($C19=3,OFFSET(G19,-1,0)+1,OFFSET(G19,-1,0)))","v":0},{"$f":"IF(AND($C19<=3,$C19<>0),0,IF($C19=4,OFFSET(H19,-1,0)+1,OFFSET(H19,-1,0)))","v":0},{"$f":"IF(AND($C19<=4,$C19<>0),0,IF(AND($C19=\"S\",$Y19>0),OFFSET(I19,-1,0)+1,OFFSET(I19,-1,0)))","v":0},{"$f":"IF(OR($C19=\"S\",$C19=0),0,MATCH(0,OFFSET($D19,1,$C19,ROW($C$530)-ROW($C19)),0))","v":511},{"$f":"IF(OR($C19=\"S\",$C19=0),0,MATCH(OFFSET($D19,0,$C19)+1,OFFSET($D19,1,$C19,ROW($C$530)-ROW($C19)),0))","v":27},{"$f":"IF(OR(Y19>0,$C19=1),\"F\",\"\")","v":"F"},"Nível 1",{"$f":"CHOOSE(1+LOG(1+2*(C19=1)+4*(C19=2)+8*(C19=3)+16*(C19=4)+32*(C19=\"S\"),2),\"\",\"Nível 1\",\"Nível 2\",\"Nível 3\",\"Nível 4\",\"Serviço\")","v":"Nível 1"},"1.","AGETOP",null,"1. ADEQUAÇÕES EXTERNAS ACESSIBILIDADE","UN",1,1,1,null,null,0,0]
[2,2,2,4,1,1,0,0,0,26,4,"","Nível 2","Nível 2","-","SINAPI",null,"SERVIÇOS PRELIMINARES","-",null,1,"-",0,0,0,0,""]
["S",2,"S",0,1,1,0,0,0,0,0,"","Serviço","Serviço","-","AGETOP",20121,"DEM. MANUAL EM CONCR.SIMPLES C/TR.ATE CB.E CARGA (O.C.)","m3    ",1.87,1,1.87,null,null,0,0,""]
["S",2,"S",0,1,1,0,0,0,0,0,"","Serviço","Serviço","-","COMPOSIÇÃO","COMP 010_SEE","DEMOLIÇÃO DE GRADE/GRELHA/CORRIMÃO/GUARDA CORPO - METÁLICO","M2",14.3,1,14.3,null,null,0,0,""]
["S",2,"S",0,1,1,0,0,0,0,0,"","Serviço","Serviço","-","SINAPI",97624,"DEMOLIÇÃO DE ALVENARIA DE TIJOLO MACIÇO, DE FORMA MANUAL, SEM REAPROVEITAMENTO. AF_12/2017","M3",0.18,1,0.18,null,null,0,0,""]
[2,2,2,3,1,2,0,0,0,22,3,"","Nível 2","Nível 2","-","AGETOP",null,"TRANSPORTES","-",null,1,"-",null,null,0,0,""]
["S",2,"S",0,1,2,0,0,0,0,0,"","Serviço","Serviço","-","SINAPI",72900,"TRANSPORTE DE ENTULHO COM CAMINHAO BASCULANTE 6 M3, RODOVIA PAVIMENTADA, DMT 0,5 A 1,0 KM","M3",2.76,1,2.76,null,null,0,0,""]
["S",2,"S",0,1,2,0,0,0,0,0,"","Serviço","Serviço","-","SINAPI",72897,"CARGA MANUAL DE ENTULHO EM CAMINHAO BASCULANTE 6 M3","M3",2.76,1,2.76,null,null,0,0,""]
[2,2,2,5,1,3,0,0,0,19,5,"","Nível 2","Nível 2","-","SINAPI",null,"REVESTIMENTO DE PISO","-",null,1,"-",null,null,0,0,""]
[3,3,3,2,1,3,1,0,0,4,2,"","Nível 3","Nível 3","-","SINAPI",null,"CONCRETO","-",null,1,"-",null,null,0,0,""]
["S",3,"S",0,1,3,1,0,0,0,0,"","Serviço","Serviço","-","AGETOP",220104,"PISO EM CONCRETO DESEMPENADO ESPESSURA = 7 CM  1:2,5:3,5","m2    ",23.6,1,23.6,null,null,0,0,""]
[3,3,3,2,1,3,2,0,0,2,81,"","Nível 3","Nível 3","-",null,null,"PODOTÁTIL","-",null,1,"-",null,null,0,0,""]
["S",3,"S",0,1,3,2,0,0,0,0,"","Serviço","Serviço","-","AGETOP",221126,"PISO DE LADRILHO HIDRÁULICO COLORIDO MODELO TÁTIL ( ALERTA OU DIRECIONAL) SEM LASTRO","m2    ",13.81,1,13.81,null,null,0,0,""]
[2,2,2,2,1,4,0,0,0,14,2,"","Nível 2","Nível 2","-","SINAPI",null,"ALVENARIAS E DIVISÓRIAS","-",null,1,"-",null,null,0,0,""]
["S",2,"S",0,1,4,0,0,0,0,0,"","Serviço","Serviço","-","AGETOP",100203,"ALVENARIA DE TIJOLO COMUM 1 VEZ - ARG. (1CI : 2CH : 8ARML)","m2    ",2.38,1,2.38,null,null,0,0,""]
[2,2,2,3,1,5,0,0,0,12,3,"","Nível 2","Nível 2","-","SINAPI",null,"REVESTIMENTO DE PAREDE","-",null,1,"-",null,null,0,0,""]
["S",2,"S",0,1,5,0,0,0,0,0,"","Serviço","Serviço","-","AGETOP",200101,"CHAPISCO COMUM","m2    ",4.76,1,4.76,null,null,0,0,""]
["S",2,"S",0,1,5,0,0,0,0,0,"","Serviço","Serviço","-","AGETOP",200499,"REBOCO PAULISTA A-14 (1CALH:4ARMLC+100kgCI/M3)","m2    ",2.38,1,2.38,null,null,0,0,""]
[2,2,2,2,1,6,0,0,0,9,2,"","Nível 2","Nível 2","-","SINAPI",null,"ESQUADRIAS METÁLICAS","-",null,1,"-",null,null,0,0,""]
["S",2,"S",0,1,6,0,0,0,0,0,"","Serviço","Serviço","-","COMPOSIÇÃO","COMP 084_SEE","GUARDA-CORPO COM CORRIMÃO - SEDUC","M",25.5,1,25.5,null,null,0,0,""]
[2,2,2,7,1,7,0,0,0,7,221,"","Nível 2","Nível 2","-","AGETOP",null,"SERVIÇO EM TERRA","-",null,1,"-",null,null,0,0,""]
[3,3,3,6,1,7,1,0,0,6,13,"","Nível 3","Nível 3","-",null,null,"AQUISIÇÃO DE TERRA (SOMENTE ATERRO)","-",null,1,"-",null,null,0,0,""]
["S",3,"S",0,1,7,1,0,0,0,0,"","Serviço","Serviço","-","AGETOP",41004,"ESCAVACAO MECANICA","m3    ",2.12,1,2.12,null,null,0,0,""]
["S",3,"S",0,1,7,1,0,0,0,0,"","Serviço","Serviço","-","AGETOP",41005,"CARGA MECANIZADA","m3    ",2.12,1,2.12,null,null,0,0,""]
["S",3,"S",0,1,7,1,0,0,0,0,"","Serviço","Serviço","-","AGETOP",41012,"INDENIZAÇÃO DE JAZIDA","m3    ",2.12,1,2.12,null,null,0,0,""]
["S",3,"S",0,1,7,1,0,0,0,0,"","Serviço","Serviço","-","AGETOP",41006,"TRANSPORTE DE MATERIAL ESCAVADO M3.KM","m3km  ",21.25,1,21.25,null,null,0,0,""]
["S",3,"S",0,1,7,1,0,0,0,0,"","Serviço","Serviço","-","AGETOP",41002,"APILOAMENTO","m2    ",3.68,1,3.68,null,null,0,0,""]
[1,1,1,36,2,0,0,0,0,484,36,"F","Nível 1","Nível 1","2.","SINAPI",null,"2. EXECUÇÃO DE NOVA COBERTURA","UN",1,1,1,null,null,0,0,""]
[2,2,2,9,2,1,0,0,0,35,9,"","Nível 2","Nível 2","-","SINAPI",null,"SERVIÇOS PRELIMINARES","-",null,1,"-",null,null,0,0,""]
[{"$f":"CHOOSE(1+LOG(1+2*(ORÇAMENTO.Nivel=\"Nível 1\")+4*(ORÇAMENTO.Nivel=\"Nível 2\")+8*(ORÇAMENTO.Nivel=\"Nível 3\")+16*(ORÇAMENTO.Nivel=\"Nível 4\")+32*(ORÇAMENTO.Nivel=\"Serviço\"),2),0,1,2,3,4,\"S\")","v":3},{"$f":"IF(OR(C48=\"s\",C48=0),OFFSET(B48,-1,0),C48)","v":3},{"$f":"IF(OFFSET(C48,-1,0)=\"L\",1,IF(OFFSET(C48,-1,0)=1,2,IF(OR(A48=\"s\",A48=0),\"S\",IF(AND(OFFSET(C48,-1,0)=2,A48=4),3,IF(AND(OR(OFFSET(C48,-1,0)=\"s\",OFFSET(C48,-1,0)=0),A48<>\"s\",A48>OFFSET(B48,-1,0)),OFFSET(B48,-1,0),A48)))))","v":3},{"$f":"IF(OR(C48=\"S\",C48=0),0,IF(ISERROR(K48),J48,SMALL(J48:K48,1)))","v":5},{"$f":"IF($C48=1,OFFSET(E48,-1,0)+1,OFFSET(E48,-1,0))","v":2},{"$f":"IF($C48=1,0,IF($C48=2,OFFSET(F48,-1,0)+1,OFFSET(F48,-1,0)))","v":1},{"$f":"IF(AND($C48<=2,$C48<>0),0,IF($C48=3,OFFSET(G48,-1,0)+1,OFFSET(G48,-1,0)))","v":1},{"$f":"IF(AND($C48<=3,$C48<>0),0,IF($C48=4,OFFSET(H48,-1,0)+1,OFFSET(H48,-1,0)))","v":0},{"$f":"IF(AND($C48<=4,$C48<>0),0,IF(AND($C48=\"S\",$Y48>0),OFFSET(I48,-1,0)+1,OFFSET(I48,-1,0)))","v":0},8,5,{"$f":"IF(OR(Y48>0,$C48=1),\"F\",\"\")","v":""},"Nível 3",{"$f":"CHOOSE(1+LOG(1+2*(C48=1)+4*(C48=2)+8*(C48=3)+16*(C48=4)+32*(C48=\"S\"),2),\"\",\"Nível 1\",\"Nível 2\",\"Nível 3\",\"Nível 4\",\"Serviço\")","v":"Nível 3"},"-","SINAPI",null,"OUTROS","-",null,1,"-",null,null,0,0,""]
["S",3,"S",0,2,1,1,0,0,0,0,"","Serviço","Serviço","-","AGETOP",20101,"DEMOLICAO COBERTURA TELHA CERAMICA C/ TRANSP. ATÉ CB. E CARGA","m2    ",495.3,1,495.3,null,null,0,0,""]
["S",3,"S",0,2,1,1,0,0,0,0,"","Serviço","Serviço","-","AGETOP",20103,"DEMOLIÇÃO ESTRUTURA EM MADEIRA TELHADO C/ TRANSP. ATÉ CB. E CARGA","m2    ",495.3,1,495.3,null,null,0,0,""]
["S",3,"S",0,2,1,1,0,0,0,0,"","Serviço","Serviço","-","AGETOP",20157,"DEMOLIÇÃO CALHAS/ RUFOS EM CHAPA C/TR.AT.C.B.E CARGA","m2    ",5.2,1,5.2,null,null,0,0,""]
[{"$f":"CHOOSE(1+LOG(1+2*(ORÇAMENTO.Nivel=\"Nível 1\")+4*(ORÇAMENTO.Nivel=\"Nível 2\")+8*(ORÇAMENTO.Nivel=\"Nível 3\")+16*(ORÇAMENTO.Nivel=\"Nível 4\")+32*(ORÇAMENTO.Nivel=\"Serviço\"),2),0,1,2,3,4,\"S\")","v":"S"},{"$f":"IF(OR(C52=\"s\",C52=0),OFFSET(B52,-1,0),C52)","v":3},{"$f":"IF(OFFSET(C52,-1,0)=\"L\",1,IF(OFFSET(C52,-1,0)=1,2,IF(OR(A52=\"s\",A52=0),\"S\",IF(AND(OFFSET(C52,-1,0)=2,A52=4),3,IF(AND(OR(OFFSET(C52,-1,0)=\"s\",OFFSET(C52,-1,0)=0),A52<>\"s\",A52>OFFSET(B52,-1,0)),OFFSET(B52,-1,0),A52)))))","v":"S"},{"$f":"IF(OR(C52=\"S\",C52=0),0,IF(ISERROR(K52),J52,SMALL(J52:K52,1)))","v":0},{"$f":"IF($C52=1,OFFSET(E52,-1,0)+1,OFFSET(E52,-1,0))","v":2},{"$f":"IF($C52=1,0,IF($C52=2,OFFSET(F52,-1,0)+1,OFFSET(F52,-1,0)))","v":1},{"$f":"IF(AND($C52<=2,$C52<>0),0,IF($C52=3,OFFSET(G52,-1,0)+1,OFFSET(G52,-1,0)))","v":1},{"$f":"IF(AND($C52<=3,$C52<>0),0,IF($C52=4,OFFSET(H52,-1,0)+1,OFFSET(H52,-1,0)))","v":0},{"$f":"IF(AND($C52<=4,$C52<>0),0,IF(AND($C52=\"S\",$Y52>0),OFFSET(I52,-1,0)+1,OFFSET(I52,-1,0)))","v":0},0,0,{"$f":"IF(OR(Y52>0,$C52=1),\"F\",\"\")","v":""},"Serviço",{"$f":"CHOOSE(1+LOG(1+2*(C52=1)+4*(C52=2)+8*(C52=3)+16*(C52=4)+32*(C52=\"S\"),2),\"\",\"Nível 1\",\"Nível 2\",\"Nível 3\",\"Nível 4\",\"Serviço\")","v":"Serviço"},"-","SINAPI",97622,"DEMOLIÇÃO DE ALVENARIA DE BLOCO FURADO, DE FORMA MANUAL, SEM REAPROVEITAMENTO. AF_12/2017","M3",2,1,2,null,null,0,0,"Referência: AGETOP - 20118"]
[3,3,3,3,2,1,2,0,0,3,58,"","Nível 3","Nível 3","-","SINAPI",null,"FORRO PVC COM ESTRUTURA","-",null,1,"-",null,null,0,0,""]
["S",3,"S",0,2,1,2,0,0,0,0,"","Serviço","Serviço","-","SINAPI",97640,"REMOÇÃO DE FORROS DE DRYWALL, PVC E FIBROMINERAL, DE FORMA MANUAL, SEM REAPROVEITAMENTO. AF_12/2017","M2",340.42,1,340.42,null,null,0,0,""]
["S",3,"S",0,2,1,2,0,0,0,0,"","Serviço","Serviço","-","SINAPI",97642,"REMOÇÃO DE TRAMA METÁLICA OU DE MADEIRA PARA FORRO, DE FORMA MANUAL, SEM REAPROVEITAMENTO. AF_12/2017","M2",340.42,1,340.42,null,null,0,0,""]
[2,2,2,3,2,2,0,0,0,26,3,"","Nível 2","Nível 2","-","AGETOP",null,"TRANSPORTES","-",null,1,"-",null,null,0,0,""]
["S",2,"S",0,2,2,0,0,0,0,0,"","Serviço","Serviço","-","SINAPI",72900,"TRANSPORTE DE ENTULHO COM CAMINHAO BASCULANTE 6 M3, RODOVIA PAVIMENTADA, DMT 0,5 A 1,0 KM","M3",61.06,1,61.06,null,null,0,0,""]
["S",2,"S",0,2,2,0,0,0,0,0,"","Serviço","Serviço","-","SINAPI",72897,"CARGA MANUAL DE ENTULHO EM CAMINHAO BASCULANTE 6 M3","M3",61.06,1,61.06,null,null,0,0,""]
[2,2,2,4,2,3,0,0,0,23,4,"","Nível 2","Nível 2","-","SINAPI",null,"ALVENARIAS E DIVISÓRIAS","-",null,1,"-",null,null,0,0,""]
["S",2,"S",0,2,3,0,0,0,0,0,"","Serviço","Serviço","-","AGETOP",100201,"ALVENARIA DE TIJOLO FURADO 1/2 VEZ - 9 x 19 x 19 - ARG. (1CALH:4ARML+100KG DE CI/M3)","m2    ",140,1,140,null,null,0,0,""]
["S",2,"S",0,2,3,0,0,0,0,0,"","Serviço","Serviço","-","AGETOP",200101,"CHAPISCO COMUM","m2    ",280,1,280,null,null,0,0,""]
["S",2,"S",0,2,3,0,0,0,0,0,"","Serviço","Serviço","-","AGETOP",200499,"REBOCO PAULISTA A-14 (1CALH:4ARMLC+100kgCI/M3)","m2    ",280,1,280,null,null,0,0,""]
[2,2,2,3,2,4,0,0,0,19,3,"","Nível 2","Nível 2","-","SINAPI",null,"PINTURA","-",null,1,"-",null,null,0,0,""]
[{"$f":"CHOOSE(1+LOG(1+2*(ORÇAMENTO.Nivel=\"Nível 1\")+4*(ORÇAMENTO.Nivel=\"Nível 2\")+8*(ORÇAMENTO.Nivel=\"Nível 3\")+16*(ORÇAMENTO.Nivel=\"Nível 4\")+32*(ORÇAMENTO.Nivel=\"Serviço\"),2),0,1,2,3,4,\"S\")","v":3},{"$f":"IF(OR(C64=\"s\",C64=0),OFFSET(B64,-1,0),C64)","v":3},{"$f":"IF(OFFSET(C64,-1,0)=\"L\",1,IF(OFFSET(C64,-1,0)=1,2,IF(OR(A64=\"s\",A64=0),\"S\",IF(AND(OFFSET(C64,-1,0)=2,A64=4),3,IF(AND(OR(OFFSET(C64,-1,0)=\"s\",OFFSET(C64,-1,0)=0),A64<>\"s\",A64>OFFSET(B64,-1,0)),OFFSET(B64,-1,0),A64)))))","v":3},{"$f":"IF(OR(C64=\"S\",C64=0),0,IF(ISERROR(K64),J64,SMALL(J64:K64,1)))","v":2},{"$f":"IF($C64=1,OFFSET(E64,-1,0)+1,OFFSET(E64,-1,0))","v":2},{"$f":"IF($C64=1,0,IF($C64=2,OFFSET(F64,-1,0)+1,OFFSET(F64,-1,0)))","v":4},{"$f":"IF(AND($C64<=2,$C64<>0),0,IF($C64=3,OFFSET(G64,-1,0)+1,OFFSET(G64,-1,0)))","v":1},{"$f":"IF(AND($C64<=3,$C64<>0),0,IF($C64=4,OFFSET(H64,-1,0)+1,OFFSET(H64,-1,0)))","v":0},{"$f":"IF(AND($C64<=4,$C64<>0),0,IF(AND($C64=\"S\",$Y64>0),OFFSET(I64,-1,0)+1,OFFSET(I64,-1,0)))","v":0},2,9,{"$f":"IF(OR(Y64>0,$C64=1),\"F\",\"\")","v":""},"Nível 3",{"$f":"CHOOSE(1+LOG(1+2*(C64=1)+4*(C64=2)+8*(C64=3)+16*(C64=4)+32*(C64=\"S\"),2),\"\",\"Nível 1\",\"Nível 2\",\"Nível 3\",\"Nível 4\",\"Serviço\")","v":"Nível 3"},"-","SINAPI",null,"ESTRUTURA METÁLICA","-",null,1,"-",null,null,0,0,""]
["S",3,"S",0,2,4,1,0,0,0,0,"","Serviço","Serviço","-","AGETOP",261610,"PINTURA ESMALTE ALQUIDICO EST.METALICA 1 DEMAO","m2    ",465,1,465,null,null,0,0,""]
[2,2,2,3,2,5,0,0,0,16,3,"","Nível 2","Nível 2","-","SINAPI",null,"PINTURA","-",null,1,"-",null,null,0,0,""]
["S",2,"S",0,2,5,0,0,0,0,0,"","Serviço","Serviço","-","AGETOP",261300,"EMASSAMENTO COM MASSA PVA DUAS DEMAOS","m2    ",26.45,1,26.45,null,null,0,0,""]
["S",2,"S",0,2,5,0,0,0,0,0,"","Serviço","Serviço","-","AGETOP",261307,"PINTURA PVA LATEX 2 DEMAOS SEM SELADOR","m2    ",26.45,1,26.45,null,null,0,0,""]
[2,2,2,7,2,6,0,0,0,13,7,"","Nível 2","Nível 2","-","SINAPI",null,"COBERTURAS","-",null,1,"-",null,null,0,0,""]
[{"$f":"CHOOSE(1+LOG(1+2*(ORÇAMENTO.Nivel=\"Nível 1\")+4*(ORÇAMENTO.Nivel=\"Nível 2\")+8*(ORÇAMENTO.Nivel=\"Nível 3\")+16*(ORÇAMENTO.Nivel=\"Nível 4\")+32*(ORÇAMENTO.Nivel=\"Serviço\"),2),0,1,2,3,4,\"S\")","v":3},{"$f":"IF(OR(C70=\"s\",C70=0),OFFSET(B70,-1,0),C70)","v":3},{"$f":"IF(OFFSET(C70,-1,0)=\"L\",1,IF(OFFSET(C70,-1,0)=1,2,IF(OR(A70=\"s\",A70=0),\"S\",IF(AND(OFFSET(C70,-1,0)=2,A70=4),3,IF(AND(OR(OFFSET(C70,-1,0)=\"s\",OFFSET(C70,-1,0)=0),A70<>\"s\",A70>OFFSET(B70,-1,0)),OFFSET(B70,-1,0),A70)))))","v":3},{"$f":"IF(OR(C70=\"S\",C70=0),0,IF(ISERROR(K70),J70,SMALL(J70:K70,1)))","v":3},{"$f":"IF($C70=1,OFFSET(E70,-1,0)+1,OFFSET(E70,-1,0))","v":2},{"$f":"IF($C70=1,0,IF($C70=2,OFFSET(F70,-1,0)+1,OFFSET(F70,-1,0)))","v":6},{"$f":"IF(AND($C70<=2,$C70<>0),0,IF($C70=3,OFFSET(G70,-1,0)+1,OFFSET(G70,-1,0)))","v":1},{"$f":"IF(AND($C70<=3,$C70<>0),0,IF($C70=4,OFFSET(H70,-1,0)+1,OFFSET(H70,-1,0)))","v":0},{"$f":"IF(AND($C70<=4,$C70<>0),0,IF(AND($C70=\"S\",$Y70>0),OFFSET(I70,-1,0)+1,OFFSET(I70,-1,0)))","v":0},6,3,{"$f":"IF(OR(Y70>0,$C70=1),\"F\",\"\")","v":""},"Nível 3",{"$f":"CHOOSE(1+LOG(1+2*(C70=1)+4*(C70=2)+8*(C70=3)+16*(C70=4)+32*(C70=\"S\"),2),\"\",\"Nível 1\",\"Nível 2\",\"Nível 3\",\"Nível 4\",\"Serviço\")","v":"Nível 3"},"-","SINAPI",null,"FIBROCIMENTO","-",null,1,"-",null,null,0,0,""]
["S",3,"S",0,2,6,1,0,0,0,0,"","Serviço","Serviço","-","AGETOP",160501,"COBERTURA COM TELHA ONDULADA OU EQUIV.","m2    ",465,1,465,null,null,0,0,""]
["S",3,"S",0,2,6,1,0,0,0,0,"","Serviço","Serviço","-","AGETOP",160502,"CUMEEIRA PARA TELHA ONDULADA OU EQUIV.","m     ",24.5,1,24.5,null,null,0,0,""]
[{"$f":"CHOOSE(1+LOG(1+2*(ORÇAMENTO.Nivel=\"Nível 1\")+4*(ORÇAMENTO.Nivel=\"Nível 2\")+8*(ORÇAMENTO.Nivel=\"Nível 3\")+16*(ORÇAMENTO.Nivel=\"Nível 4\")+32*(ORÇAMENTO.Nivel=\"Serviço\"),2),0,1,2,3,4,\"S\")","v":3},{"$f":"IF(OR(C73=\"s\",C73=0),OFFSET(B73,-1,0),C73)","v":3},{"$f":"IF(OFFSET(C73,-1,0)=\"L\",1,IF(OFFSET(C73,-1,0)=1,2,IF(OR(A73=\"s\",A73=0),\"S\",IF(AND(OFFSET(C73,-1,0)=2,A73=4),3,IF(AND(OR(OFFSET(C73,-1,0)=\"s\",OFFSET(C73,-1,0)=0),A73<>\"s\",A73>OFFSET(B73,-1,0)),OFFSET(B73,-1,0),A73)))))","v":3},{"$f":"IF(OR(C73=\"S\",C73=0),0,IF(ISERROR(K73),J73,SMALL(J73:K73,1)))","v":3},{"$f":"IF($C73=1,OFFSET(E73,-1,0)+1,OFFSET(E73,-1,0))","v":2},{"$f":"IF($C73=1,0,IF($C73=2,OFFSET(F73,-1,0)+1,OFFSET(F73,-1,0)))","v":6},{"$f":"IF(AND($C73<=2,$C73<>0),0,IF($C73=3,OFFSET(G73,-1,0)+1,OFFSET(G73,-1,0)))","v":2},{"$f":"IF(AND($C73<=3,$C73<>0),0,IF($C73=4,OFFSET(H73,-1,0)+1,OFFSET(H73,-1,0)))","v":0},{"$f":"IF(AND($C73<=4,$C73<>0),0,IF(AND($C73=\"S\",$Y73>0),OFFSET(I73,-1,0)+1,OFFSET(I73,-1,0)))","v":0},3,38,{"$f":"IF(OR(Y73>0,$C73=1),\"F\",\"\")","v":""},"Nível 3",{"$f":"CHOOSE(1+LOG(1+2*(C73=1)+4*(C73=2)+8*(C73=3)+16*(C73=4)+32*(C73=\"S\"),2),\"\",\"Nível 1\",\"Nível 2\",\"Nível 3\",\"Nível 4\",\"Serviço\")","v":"Nível 3"},"-","SINAPI",null,"CALHAS E RUFOS","-",null,1,"-",null,null,0,0,""]
["S",{"$f":"IF(OR(C74=\"s\",C74=0),OFFSET(B74,-1,0),C74)","v":3},{"$f":"IF(OFFSET(C74,-1,0)=\"L\",1,IF(OFFSET(C74,-1,0)=1,2,IF(OR(A74=\"s\",A74=0),\"S\",IF(AND(OFFSET(C74,-1,0)=2,A74=4),3,IF(AND(OR(OFFSET(C74,-1,0)=\"s\",OFFSET(C74,-1,0)=0),A74<>\"s\",A74>OFFSET(B74,-1,0)),OFFSET(B74,-1,0),A74)))))","v":"S"},{"$f":"IF(OR(C74=\"S\",C74=0),0,IF(ISERROR(K74),J74,SMALL(J74:K74,1)))","v":0},{"$f":"IF($C74=1,OFFSET(E74,-1,0)+1,OFFSET(E74,-1,0))","v":2},{"$f":"IF($C74=1,0,IF($C74=2,OFFSET(F74,-1,0)+1,OFFSET(F74,-1,0)))","v":6},{"$f":"IF(AND($C74<=2,$C74<>0),0,IF($C74=3,OFFSET(G74,-1,0)+1,OFFSET(G74,-1,0)))","v":2},{"$f":"IF(AND($C74<=3,$C74<>0),0,IF($C74=4,OFFSET(H74,-1,0)+1,OFFSET(H74,-1,0)))","v":0},{"$f":"IF(AND($C74<=4,$C74<>0),0,IF(AND($C74=\"S\",$Y74>0),OFFSET(I74,-1,0)+1,OFFSET(I74,-1,0)))","v":0},0,0,{"$f":"IF(OR(Y74>0,$C74=1),\"F\",\"\")","v":""},"Serviço",{"$f":"CHOOSE(1+LOG(1+2*(C74=1)+4*(C74=2)+8*(C74=3)+16*(C74=4)+32*(C74=\"S\"),2),\"\",\"Nível 1\",\"Nível 2\",\"Nível 3\",\"Nível 4\",\"Serviço\")","v":"Serviço"},"-","AGETOP",160602,"RUFO DE CHAPA GALVANIZADA","m     ",38.4,1,38.4,null,null,0,0,""]
["S",{"$f":"IF(OR(C75=\"s\",C75=0),OFFSET(B75,-1,0),C75)","v":3},{"$f":"IF(OFFSET(C75,-1,0)=\"L\",1,IF(OFFSET(C75,-1,0)=1,2,IF(OR(A75=\"s\",A75=0),\"S\",IF(AND(OFFSET(C75,-1,0)=2,A75=4),3,IF(AND(OR(OFFSET(C75,-1,0)=\"s\",OFFSET(C75,-1,0)=0),A75<>\"s\",A75>OFFSET(B75,-1,0)),OFFSET(B75,-1,0),A75)))))","v":"S"},{"$f":"IF(OR(C75=\"S\",C75=0),0,IF(ISERROR(K75),J75,SMALL(J75:K75,1)))","v":0},{"$f":"IF($C75=1,OFFSET(E75,-1,0)+1,OFFSET(E75,-1,0))","v":2},{"$f":"IF($C75=1,0,IF($C75=2,OFFSET(F75,-1,0)+1,OFFSET(F75,-1,0)))","v":6},{"$f":"IF(AND($C75<=2,$C75<>0),0,IF($C75=3,OFFSET(G75,-1,0)+1,OFFSET(G75,-1,0)))","v":2},{"$f":"IF(AND($C75<=3,$C75<>0),0,IF($C75=4,OFFSET(H75,-1,0)+1,OFFSET(H75,-1,0)))","v":0},{"$f":"IF(AND($C75<=4,$C75<>0),0,IF(AND($C75=\"S\",$Y75>0),OFFSET(I75,-1,0)+1,OFFSET(I75,-1,0)))","v":0},0,0,{"$f":"IF(OR(Y75>0,$C75=1),\"F\",\"\")","v":""},"Serviço",{"$f":"CHOOSE(1+LOG(1+2*(C75=1)+4*(C75=2)+8*(C75=3)+16*(C75=4)+32*(C75=\"S\"),2),\"\",\"Nível 1\",\"Nível 2\",\"Nível 3\",\"Nível 4\",\"Serviço\")","v":"Serviço"},"-","AGETOP",160601,"CALHA DE CHAPA GALVANIZADA","m     ",48,1,48,null,null,0,0,""]
[2,{"$f":"IF(OR(C76=\"s\",C76=0),OFFSET(B76,-1,0),C76)","v":2},{"$f":"IF(OFFSET(C76,-1,0)=\"L\",1,IF(OFFSET(C76,-1,0)=1,2,IF(OR(A76=\"s\",A76=0),\"S\",IF(AND(OFFSET(C76,-1,0)=2,A76=4),3,IF(AND(OR(OFFSET(C76,-1,0)=\"s\",OFFSET(C76,-1,0)=0),A76<>\"s\",A76>OFFSET(B76,-1,0)),OFFSET(B76,-1,0),A76)))))","v":2},{"$f":"IF(OR(C76=\"S\",C76=0),0,IF(ISERROR(K76),J76,SMALL(J76:K76,1)))","v":6},{"$f":"IF($C76=1,OFFSET(E76,-1,0)+1,OFFSET(E76,-1,0))","v":2},{"$f":"IF($C76=1,0,IF($C76=2,OFFSET(F76,-1,0)+1,OFFSET(F76,-1,0)))","v":7},{"$f":"IF(AND($C76<=2,$C76<>0),0,IF($C76=3,OFFSET(G76,-1,0)+1,OFFSET(G76,-1,0)))","v":0},{"$f":"IF(AND($C76<=3,$C76<>0),0,IF($C76=4,OFFSET(H76,-1,0)+1,OFFSET(H76,-1,0)))","v":0},{"$f":"IF(AND($C76<=4,$C76<>0),0,IF(AND($C76=\"S\",$Y76>0),OFFSET(I76,-1,0)+1,OFFSET(I76,-1,0)))","v":0},6,184,{"$f":"IF(OR(Y76>0,$C76=1),\"F\",\"\")","v":""},"Nível 2",{"$f":"CHOOSE(1+LOG(1+2*(C76=1)+4*(C76=2)+8*(C76=3)+16*(C76=4)+32*(C76=\"S\"),2),\"\",\"Nível 1\",\"Nível 2\",\"Nível 3\",\"Nível 4\",\"Serviço\")","v":"Nível 2"},"-","SINAPI",null,"FORROS","-",null,1,"-",null,null,0,0,""]
[3,3,3,2,2,7,1,0,0,5,2,"","Nível 3","Nível 3","-","SINAPI",null,"PVC COM ESTRUTURA","-",null,1,"-",null,null,0,0,""]
["S",3,"S",0,2,7,1,0,0,0,0,"","Serviço","Serviço","-","AGETOP",210460,"FORRO DE PVC COM ESTRUTURA EM METALON PINTADA COM TINTA ALQUÍDICA D.F.","m2    ",425.55,1,425.55,null,null,0,0,""]
[3,3,3,3,2,7,2,0,0,3,32,"","Nível 3","Nível 3","-","SINAPI",null,"GESSO","-",null,1,"-",null,null,0,0,""]
["S",3,"S",0,2,7,2,0,0,0,0,"","Serviço","Serviço","-","AGETOP",210498,"FORRO DE GESSO ACARTONADO PARA ÁREAS SECAS ESPESSURA DE 12,5MM","m2    ",26.45,1,26.45,null,null,0,0,""]
["S",3,"S",0,2,7,2,0,0,0,0,"","Serviço","Serviço","-","AGETOP",210506,"TABICA PARA FORRO DE GESSO COMUM","m     ",31.3,1,31.3,null,null,0,0,""]
[1,1,1,40,3,0,0,0,0,448,40,"F","Nível 1","Nível 1","3.","SINAPI",null,"3. REFORMA GERAL","UN",1,1,1,null,null,0,0,""]
[2,2,2,8,3,1,0,0,0,{"$f":"IF(OR($C83=\"S\",$C83=0),0,MATCH(0,OFFSET($D83,1,$C83,ROW($C$530)-ROW($C83)),0))","v":39},{"$f":"IF(OR($C83=\"S\",$C83=0),0,MATCH(OFFSET($D83,0,$C83)+1,OFFSET($D83,1,$C83,ROW($C$530)-ROW($C83)),0))","v":8},"","Nível 2","Nível 2","-","SINAPI",null,"SERVIÇOS PRELIMINARES","-",null,1,"-",null,null,0,0,""]
["S",2,"S",0,3,1,0,0,0,0,0,"","Serviço","Serviço","-","SINAPI",97644,"REMOÇÃO DE PORTAS, DE FORMA MANUAL, SEM REAPROVEITAMENTO. AF_12/2017","M2",6.09,1,6.09,null,null,0,0,"Referência: AGETOP - 20106"]
["S",2,"S",0,3,1,0,0,0,0,0,"","Serviço","Serviço","-","AGETOP",20111,"DEM.PISO CERAM.SOBRE LASTRO CONC.C/TR.CB.E CARGA","m2    ",3.86,1,3.86,null,null,0,0,""]
["S",2,"S",0,3,1,0,0,0,0,0,"","Serviço","Serviço","-","SINAPI",97633,"DEMOLIÇÃO DE REVESTIMENTO CERÂMICO, DE FORMA MANUAL, SEM REAPROVEITAMENTO. AF_12/2017","M2",13.8,1,13.8,null,null,0,0,"Referência: AGETOP - 20115"]
["S",2,"S",0,3,1,0,0,0,0,0,"","Serviço","Serviço","-","AGETOP",20137,"DEMOLIÇAO BACIA SANITARIA C/ TRANSP. ATÉ CB. E CARGA","Un    ",1,1,1,null,null,0,0,""]
["S",2,"S",0,3,1,0,0,0,0,0,"","Serviço","Serviço","-","AGETOP",20140,"DEMOLIÇAO DE VÁLVULA DE DESCARGA C/ TRANSP. ATÉ CB. E CARGA","Un    ",1,1,1,null,null,0,0,""]
["S",2,"S",0,3,1,0,0,0,0,0,"","Serviço","Serviço","-","AGETOP",20138,"DEMOLIÇAO DE LAVATÓRIO C/ TRANSP. ATÉ CB. E CARGA","Un    ",3,1,3,null,null,0,0,""]
[{"$f":"CHOOSE(1+LOG(1+2*(ORÇAMENTO.Nivel=\"Nível 1\")+4*(ORÇAMENTO.Nivel=\"Nível 2\")+8*(ORÇAMENTO.Nivel=\"Nível 3\")+16*(ORÇAMENTO.Nivel=\"Nível 4\")+32*(ORÇAMENTO.Nivel=\"Serviço\"),2),0,1,2,3,4,\"S\")","v":"S"},{"$f":"IF(OR(C90=\"s\",C90=0),OFFSET(B90,-1,0),C90)","v":2},{"$f":"IF(OFFSET(C90,-1,0)=\"L\",1,IF(OFFSET(C90,-1,0)=1,2,IF(OR(A90=\"s\",A90=0),\"S\",IF(AND(OFFSET(C90,-1,0)=2,A90=4),3,IF(AND(OR(OFFSET(C90,-1,0)=\"s\",OFFSET(C90,-1,0)=0),A90<>\"s\",A90>OFFSET(B90,-1,0)),OFFSET(B90,-1,0),A90)))))","v":"S"},{"$f":"IF(OR(C90=\"S\",C90=0),0,IF(ISERROR(K90),J90,SMALL(J90:K90,1)))","v":0},{"$f":"IF($C90=1,OFFSET(E90,-1,0)+1,OFFSET(E90,-1,0))","v":3},{"$f":"IF($C90=1,0,IF($C90=2,OFFSET(F90,-1,0)+1,OFFSET(F90,-1,0)))","v":1},{"$f":"IF(AND($C90<=2,$C90<>0),0,IF($C90=3,OFFSET(G90,-1,0)+1,OFFSET(G90,-1,0)))","v":0},{"$f":"IF(AND($C90<=3,$C90<>0),0,IF($C90=4,OFFSET(H90,-1,0)+1,OFFSET(H90,-1,0)))","v":0},{"$f":"IF(AND($C90<=4,$C90<>0),0,IF(AND($C90=\"S\",$Y90>0),OFFSET(I90,-1,0)+1,OFFSET(I90,-1,0)))","v":0},0,0,{"$f":"IF(OR(Y90>0,$C90=1),\"F\",\"\")","v":""},"Serviço",{"$f":"CHOOSE(1+LOG(1+2*(C90=1)+4*(C90=2)+8*(C90=3)+16*(C90=4)+32*(C90=\"S\"),2),\"\",\"Nível 1\",\"Nível 2\",\"Nível 3\",\"Nível 4\",\"Serviço\")","v":"Serviço"},"-","SINAPI",97622,"DEMOLIÇÃO DE ALVENARIA DE BLOCO FURADO, DE FORMA MANUAL, SEM REAPROVEITAMENTO. AF_12/2017","M3",0.25,1,0.25,null,null,0,0,"Referência: AGETOP - 20118"]
[2,2,2,3,3,2,0,0,0,31,3,"","Nível 2","Nível 2","-","AGETOP",null,"TRANSPORTES","-",null,1,"-",null,null,0,0,""]
["S",2,"S",0,3,2,0,0,0,0,0,"","Serviço","Serviço","-","SINAPI",72900,"TRANSPORTE DE ENTULHO COM CAMINHAO BASCULANTE 6 M3, RODOVIA PAVIMENTADA, DMT 0,5 A 1,0 KM","M3",1.68,1,1.68,null,null,0,0,""]
["S",2,"S",0,3,2,0,0,0,0,0,"","Serviço","Serviço","-","SINAPI",72897,"CARGA MANUAL DE ENTULHO EM CAMINHAO BASCULANTE 6 M3","M3",1.68,1,1.68,null,null,0,0,""]
[2,2,2,3,3,3,0,0,0,28,3,"","Nível 2","Nível 2","-","SINAPI",null,"REVESTIMENTO DE PISO","-",null,1,"-",null,null,0,0,""]
[3,3,3,2,3,3,1,0,0,2,12,"","Nível 3","Nível 3","-",null,null,"CERÂMICO","-",null,1,"-",null,null,0,0,""]
["S",3,"S",0,3,3,1,0,0,0,0,"","Serviço","Serviço","-","SINAPI",87251,"REVESTIMENTO CERÂMICO PARA PISO COM PLACAS TIPO ESMALTADA EXTRA DE DIMENSÕES 45X45 CM APLICADA EM AMBIENTES DE ÁREA MAIOR QUE 10 M2. AF_06/2014","M2",3.86,1,3.86,null,null,0,0,""]
[2,2,2,2,3,4,0,0,0,25,2,"","Nível 2","Nível 2","-","SINAPI",null,"REVESTIMENTO DE PAREDE","-",null,1,"-",null,null,0,0,""]
["S",2,"S",0,3,4,0,0,0,0,0,"","Serviço","Serviço","-","SINAPI",87273,"REVESTIMENTO CERÂMICO PARA PAREDES INTERNAS COM PLACAS TIPO ESMALTADA EXTRA DE DIMENSÕES 33X45 CM APLICADAS EM AMBIENTES DE ÁREA MAIOR QUE 5 M² NA ALTURA INTEIRA DAS PAREDES. AF_06/2014","M2",13.8,1,13.8,null,null,0,0,""]
[2,2,2,3,3,5,0,0,0,23,3,"","Nível 2","Nível 2","-","SINAPI",null,"FERRAGENS","-",null,1,"-",null,null,0,0,""]
["S",2,"S",0,3,5,0,0,0,0,0,"","Serviço","Serviço","-","AGETOP",230174,"BARRA DE APOIO EM AÇO INOX - 40 CM","un    ",9,1,9,null,null,0,0,""]
["S",2,"S",0,3,5,0,0,0,0,0,"","Serviço","Serviço","-","AGETOP",230176,"BARRA DE APOIO EM AÇO INOX - 80 CM ","un    ",9,1,9,null,null,0,0,""]
[{"$f":"CHOOSE(1+LOG(1+2*(ORÇAMENTO.Nivel=\"Nível 1\")+4*(ORÇAMENTO.Nivel=\"Nível 2\")+8*(ORÇAMENTO.Nivel=\"Nível 3\")+16*(ORÇAMENTO.Nivel=\"Nível 4\")+32*(ORÇAMENTO.Nivel=\"Serviço\"),2),0,1,2,3,4,\"S\")","v":2},{"$f":"IF(OR(C102=\"s\",C102=0),OFFSET(B102,-1,0),C102)","v":2},{"$f":"IF(OFFSET(C102,-1,0)=\"L\",1,IF(OFFSET(C102,-1,0)=1,2,IF(OR(A102=\"s\",A102=0),\"S\",IF(AND(OFFSET(C102,-1,0)=2,A102=4),3,IF(AND(OR(OFFSET(C102,-1,0)=\"s\",OFFSET(C102,-1,0)=0),A102<>\"s\",A102>OFFSET(B102,-1,0)),OFFSET(B102,-1,0),A102)))))","v":2},{"$f":"IF(OR(C102=\"S\",C102=0),0,IF(ISERROR(K102),J102,SMALL(J102:K102,1)))","v":2},{"$f":"IF($C102=1,OFFSET(E102,-1,0)+1,OFFSET(E102,-1,0))","v":3},{"$f":"IF($C102=1,0,IF($C102=2,OFFSET(F102,-1,0)+1,OFFSET(F102,-1,0)))","v":6},{"$f":"IF(AND($C102<=2,$C102<>0),0,IF($C102=3,OFFSET(G102,-1,0)+1,OFFSET(G102,-1,0)))","v":0},{"$f":"IF(AND($C102<=3,$C102<>0),0,IF($C102=4,OFFSET(H102,-1,0)+1,OFFSET(H102,-1,0)))","v":0},{"$f":"IF(AND($C102<=4,$C102<>0),0,IF(AND($C102=\"S\",$Y102>0),OFFSET(I102,-1,0)+1,OFFSET(I102,-1,0)))","v":0},20,2,{"$f":"IF(OR(Y102>0,$C102=1),\"F\",\"\")","v":""},"Nível 2",{"$f":"CHOOSE(1+LOG(1+2*(C102=1)+4*(C102=2)+8*(C102=3)+16*(C102=4)+32*(C102=\"S\"),2),\"\",\"Nível 1\",\"Nível 2\",\"Nível 3\",\"Nível 4\",\"Serviço\")","v":"Nível 2"},"-","SINAPI",null,"ESQUADRIAS METÁLICAS","-",null,1,"-",null,null,0,0,""]
["S",2,"S",0,3,6,0,0,0,0,0,"","Serviço","Serviço","-","AGETOP",180501,"PORTA DE ABRIR EM CHAPA PF-1 C/FERRAGENS","m2    ",7.35,1,7.35,null,null,0,0,""]
[2,2,2,18,3,7,0,0,0,18,156,"","Nível 2","Nível 2","-",null,null,"PINTURA","-",null,1,"-",null,null,0,0,""]
[3,3,3,2,3,7,1,0,0,17,2,"","Nível 3","Nível 3","-",null,null,"ESMALTE SINTÉTICO","-",null,1,"-",null,null,0,0,""]
["S",3,"S",0,3,7,1,0,0,0,0,"","Serviço","Serviço","-","AGETOP",261550,"PINT.ESMALTE SINT.PAREDES - 2 DEM.C/SELADOR","m2    ",402,1,402,null,null,0,0,""]
[3,3,3,4,3,7,2,0,0,15,4,"","Nível 3","Nível 3","-","AGETOP",null,"LÁTEX ACRÍLICA","-",null,1,"-",null,null,0,0,""]
["S",3,"S",0,3,7,2,0,0,0,0,"","Serviço","Serviço","-","AGETOP",260104,"REMOCAO DE PINTURA ANTIGA A LATEX","m2    ",50,1,50,null,null,0,0,""]
["S",3,"S",0,3,7,2,0,0,0,0,"","Serviço","Serviço","-","AGETOP",261300,"EMASSAMENTO COM MASSA PVA DUAS DEMAOS","m2    ",53.36,1,53.36,null,null,0,0,""]
["S",3,"S",0,3,7,2,0,0,0,0,"","Serviço","Serviço","-","AGETOP",261001,"PINTURA LATEX ACRILICO 2 DEMAOS","m2    ",402,1,402,null,null,0,0,""]
[3,3,3,2,3,7,3,0,0,11,2,"","Nível 3","Nível 3","-","AGETOP",null,"EXTERNA","-",null,1,"-",null,null,0,0,""]
["S",3,"S",0,3,7,3,0,0,0,0,"","Serviço","Serviço","-","AGETOP",261001,"PINTURA LATEX ACRILICO 2 DEMAOS","m2    ",600,1,600,null,null,0,0,""]
[{"$f":"CHOOSE(1+LOG(1+2*(ORÇAMENTO.Nivel=\"Nível 1\")+4*(ORÇAMENTO.Nivel=\"Nível 2\")+8*(ORÇAMENTO.Nivel=\"Nível 3\")+16*(ORÇAMENTO.Nivel=\"Nível 4\")+32*(ORÇAMENTO.Nivel=\"Serviço\"),2),0,1,2,3,4,\"S\")","v":3},{"$f":"IF(OR(C113=\"s\",C113=0),OFFSET(B113,-1,0),C113)","v":3},{"$f":"IF(OFFSET(C113,-1,0)=\"L\",1,IF(OFFSET(C113,-1,0)=1,2,IF(OR(A113=\"s\",A113=0),\"S\",IF(AND(OFFSET(C113,-1,0)=2,A113=4),3,IF(AND(OR(OFFSET(C113,-1,0)=\"s\",OFFSET(C113,-1,0)=0),A113<>\"s\",A113>OFFSET(B113,-1,0)),OFFSET(B113,-1,0),A113)))))","v":3},{"$f":"IF(OR(C113=\"S\",C113=0),0,IF(ISERROR(K113),J113,SMALL(J113:K113,1)))","v":2},{"$f":"IF($C113=1,OFFSET(E113,-1,0)+1,OFFSET(E113,-1,0))","v":3},{"$f":"IF($C113=1,0,IF($C113=2,OFFSET(F113,-1,0)+1,OFFSET(F113,-1,0)))","v":7},{"$f":"IF(AND($C113<=2,$C113<>0),0,IF($C113=3,OFFSET(G113,-1,0)+1,OFFSET(G113,-1,0)))","v":4},{"$f":"IF(AND($C113<=3,$C113<>0),0,IF($C113=4,OFFSET(H113,-1,0)+1,OFFSET(H113,-1,0)))","v":0},{"$f":"IF(AND($C113<=4,$C113<>0),0,IF(AND($C113=\"S\",$Y113>0),OFFSET(I113,-1,0)+1,OFFSET(I113,-1,0)))","v":0},9,2,{"$f":"IF(OR(Y113>0,$C113=1),\"F\",\"\")","v":""},"Nível 3",{"$f":"CHOOSE(1+LOG(1+2*(C113=1)+4*(C113=2)+8*(C113=3)+16*(C113=4)+32*(C113=\"S\"),2),\"\",\"Nível 1\",\"Nível 2\",\"Nível 3\",\"Nível 4\",\"Serviço\")","v":"Nível 3"},"-","SINAPI",null,"MURO","-",null,1,"-",null,null,0,0,""]
[{"$f":"CHOOSE(1+LOG(1+2*(ORÇAMENTO.Nivel=\"Nível 1\")+4*(ORÇAMENTO.Nivel=\"Nível 2\")+8*(ORÇAMENTO.Nivel=\"Nível 3\")+16*(ORÇAMENTO.Nivel=\"Nível 4\")+32*(ORÇAMENTO.Nivel=\"Serviço\"),2),0,1,2,3,4,\"S\")","v":"S"},3,"S",0,3,7,4,0,0,0,0,"","Serviço","Serviço","-","AGETOP",261001,"PINTURA LATEX ACRILICO 2 DEMAOS","m2    ",256.39999999999998,1,256.39999999999998,null,null,0,0,""]
[3,3,3,2,3,7,5,0,0,7,2,"","Nível 3","Nível 3","-","AGETOP",null,"ESQUADRIAS NOVAS","-",null,1,"-",null,null,0,0,""]
["S",3,"S",0,3,7,5,0,0,0,0,"","Serviço","Serviço","-","AGETOP",261503,"PINT.ESMALTE 2 DEM. ESQ.FERRO (SEM FUNDO ANTICOR.)","m2    ",22.05,1,22.05,null,null,0,0,""]
[3,3,3,3,3,7,6,0,0,5,3,"","Nível 3","Nível 3","-","SINAPI",null,"ESQUADRIAS EXISTENTES","-",null,1,"-",null,null,0,0,""]
["S",3,"S",0,3,7,6,0,0,0,0,"","Serviço","Serviço","-","AGETOP",260105,"REMOCAO DE PINTURA ANTIGA A OLEO OU ESMALTE","m2    ",225,1,225,null,null,0,0,""]
["S",3,"S",0,3,7,6,0,0,0,0,"","Serviço","Serviço","-","AGETOP",261503,"PINT.ESMALTE 2 DEM. ESQ.FERRO (SEM FUNDO ANTICOR.)","m2    ",225,1,225,null,null,0,0,""]
[3,3,3,2,3,7,7,0,0,2,{"$error":"#N/A"},"","Nível 3","Nível 3","-","SINAPI",null,"OUTROS","-",null,1,"-",null,null,0,0,""]
["S",3,"S",0,3,7,7,0,0,0,0,"","Serviço","Serviço","-","AGETOP",261620,"LETREIRO MÉDIO A GRANDE PORTE EM PAREDE FEITO A PINCEL","m2    ",7.2,1,7.2,null,null,0,0,""]
[1,1,1,11,4,0,0,0,0,408,11,"F","Nível 1","Nível 1","4.","SINAPI",null,"7 - IMPLANTAÇÃO DE PASSARELA COBERTA","UN",1,1,1,null,null,0,0,""]
[2,2,2,2,4,1,0,0,0,10,2,"","Nível 2","Nível 2","-","SINAPI",null,"SERVIÇOS PRELIMINARES","-",null,1,"-",null,null,0,0,""]
["S",2,"S",0,4,1,0,0,0,0,0,"","Serviço","Serviço","-","AGETOP",20121,"DEM. MANUAL EM CONCR.SIMPLES C/TR.ATE CB.E CARGA (O.C.)","m3    ",5.47,1,5.47,null,null,0,0,""]
[2,2,2,3,4,2,0,0,0,8,3,"","Nível 2","Nível 2","-","AGETOP",null,"TRANSPORTES","-",null,1,"-",null,null,0,0,""]
["S",2,"S",0,4,2,0,0,0,0,0,"","Serviço","Serviço","-","SINAPI",72900,"TRANSPORTE DE ENTULHO COM CAMINHAO BASCULANTE 6 M3, RODOVIA PAVIMENTADA, DMT 0,5 A 1,0 KM","M3",5.47,1,5.47,null,null,0,0,""]
["S",2,"S",0,4,2,0,0,0,0,0,"","Serviço","Serviço","-","SINAPI",72897,"CARGA MANUAL DE ENTULHO EM CAMINHAO BASCULANTE 6 M3","M3",5.47,1,5.47,null,null,0,0,""]
[2,2,2,3,4,3,0,0,0,5,3,"","Nível 2","Nível 2","-","SINAPI",null,"SERVIÇO EM TERRA","-",null,1,"-",null,null,0,0,""]
[{"$f":"CHOOSE(1+LOG(1+2*(ORÇAMENTO.Nivel=\"Nível 1\")+4*(ORÇAMENTO.Nivel=\"Nível 2\")+8*(ORÇAMENTO.Nivel=\"Nível 3\")+16*(ORÇAMENTO.Nivel=\"Nível 4\")+32*(ORÇAMENTO.Nivel=\"Serviço\"),2),0,1,2,3,4,\"S\")","v":"S"},{"$f":"IF(OR(C129=\"s\",C129=0),OFFSET(B129,-1,0),C129)","v":2},{"$f":"IF(OFFSET(C129,-1,0)=\"L\",1,IF(OFFSET(C129,-1,0)=1,2,IF(OR(A129=\"s\",A129=0),\"S\",IF(AND(OFFSET(C129,-1,0)=2,A129=4),3,IF(AND(OR(OFFSET(C129,-1,0)=\"s\",OFFSET(C129,-1,0)=0),A129<>\"s\",A129>OFFSET(B129,-1,0)),OFFSET(B129,-1,0),A129)))))","v":"S"},{"$f":"IF(OR(C129=\"S\",C129=0),0,IF(ISERROR(K129),J129,SMALL(J129:K129,1)))","v":0},{"$f":"IF($C129=1,OFFSET(E129,-1,0)+1,OFFSET(E129,-1,0))","v":4},{"$f":"IF($C129=1,0,IF($C129=2,OFFSET(F129,-1,0)+1,OFFSET(F129,-1,0)))","v":3},{"$f":"IF(AND($C129<=2,$C129<>0),0,IF($C129=3,OFFSET(G129,-1,0)+1,OFFSET(G129,-1,0)))","v":0},{"$f":"IF(AND($C129<=3,$C129<>0),0,IF($C129=4,OFFSET(H129,-1,0)+1,OFFSET(H129,-1,0)))","v":0},{"$f":"IF(AND($C129<=4,$C129<>0),0,IF(AND($C129=\"S\",$Y129>0),OFFSET(I129,-1,0)+1,OFFSET(I129,-1,0)))","v":0},0,0,{"$f":"IF(OR(Y129>0,$C129=1),\"F\",\"\")","v":""},"Serviço",{"$f":"CHOOSE(1+LOG(1+2*(C129=1)+4*(C129=2)+8*(C129=3)+16*(C129=4)+32*(C129=\"S\"),2),\"\",\"Nível 1\",\"Nível 2\",\"Nível 3\",\"Nível 4\",\"Serviço\")","v":"Serviço"},"-","AGETOP",41140,"REGULARIZAÇÃO DO TERRENO SEM APILOAMENTO COM TRANSPORTE MANUAL DA TERRA ESCAVADA ","m2    ",20.16,1,20.16,null,null,0,0,""]
["S",2,"S",0,4,3,0,0,0,0,0,"","Serviço","Serviço","-","AGETOP",41002,"APILOAMENTO","m2    ",20.16,1,20.16,null,null,0,0,""]
[2,2,2,2,4,4,0,0,0,2,14,"","Nível 2","Nível 2","-","SINAPI",null,"DIVERSOS","-",null,1,"-",null,null,0,0,""]
["S",2,"S",0,4,4,0,0,0,0,0,"","Serviço","Serviço","-","AGETOP",60010,"VERGA/CONTRAVERGA EM CONCRETO ARMADO FCK = 20 MPA","m3    ",0.02,1,0.02,null,null,0,0,""]
[{"$f":"CHOOSE(1+LOG(1+2*(ORÇAMENTO.Nivel=\"Nível 1\")+4*(ORÇAMENTO.Nivel=\"Nível 2\")+8*(ORÇAMENTO.Nivel=\"Nível 3\")+16*(ORÇAMENTO.Nivel=\"Nível 4\")+32*(ORÇAMENTO.Nivel=\"Serviço\"),2),0,1,2,3,4,\"S\")","v":1},{"$f":"IF(OR(C133=\"s\",C133=0),OFFSET(B133,-1,0),C133)","v":1},{"$f":"IF(OFFSET(C133,-1,0)=\"L\",1,IF(OFFSET(C133,-1,0)=1,2,IF(OR(A133=\"s\",A133=0),\"S\",IF(AND(OFFSET(C133,-1,0)=2,A133=4),3,IF(AND(OR(OFFSET(C133,-1,0)=\"s\",OFFSET(C133,-1,0)=0),A133<>\"s\",A133>OFFSET(B133,-1,0)),OFFSET(B133,-1,0),A133)))))","v":1},{"$f":"IF(OR(C133=\"S\",C133=0),0,IF(ISERROR(K133),J133,SMALL(J133:K133,1)))","v":14},{"$f":"IF($C133=1,OFFSET(E133,-1,0)+1,OFFSET(E133,-1,0))","v":5},{"$f":"IF($C133=1,0,IF($C133=2,OFFSET(F133,-1,0)+1,OFFSET(F133,-1,0)))","v":0},{"$f":"IF(AND($C133<=2,$C133<>0),0,IF($C133=3,OFFSET(G133,-1,0)+1,OFFSET(G133,-1,0)))","v":0},{"$f":"IF(AND($C133<=3,$C133<>0),0,IF($C133=4,OFFSET(H133,-1,0)+1,OFFSET(H133,-1,0)))","v":0},{"$f":"IF(AND($C133<=4,$C133<>0),0,IF(AND($C133=\"S\",$Y133>0),OFFSET(I133,-1,0)+1,OFFSET(I133,-1,0)))","v":0},397,14,{"$f":"IF(OR(Y133>0,$C133=1),\"F\",\"\")","v":"F"},"Nível 1",{"$f":"CHOOSE(1+LOG(1+2*(C133=1)+4*(C133=2)+8*(C133=3)+16*(C133=4)+32*(C133=\"S\"),2),\"\",\"Nível 1\",\"Nível 2\",\"Nível 3\",\"Nível 4\",\"Serviço\")","v":"Nível 1"},"5.","SINAPI",null,"8 - IMPLANTAÇÃO DE BLOCO PADRÃO SECUC 2017","UN",1,1,1,null,null,0,0,""]
[2,2,2,2,5,1,0,0,0,13,2,"","Nível 2","Nível 2","-","SINAPI",null,"SERVIÇOS PRELIMINARES","-",null,1,"-",null,null,0,0,""]
["S",2,"S",0,5,1,0,0,0,0,0,"","Serviço","Serviço","-","AGETOP",20121,"DEM. MANUAL EM CONCR.SIMPLES C/TR.ATE CB.E CARGA (O.C.)","m3    ",9.5,1,9.5,null,null,0,0,""]
[2,2,2,3,5,2,0,0,0,11,3,"","Nível 2","Nível 2","-","AGETOP",null,"TRANSPORTES","-",null,1,"-",null,null,0,0,""]
["S",2,"S",0,5,2,0,0,0,0,0,"","Serviço","Serviço","-","SINAPI",72900,"TRANSPORTE DE ENTULHO COM CAMINHAO BASCULANTE 6 M3, RODOVIA PAVIMENTADA, DMT 0,5 A 1,0 KM","M3",9.5,1,9.5,null,null,0,0,""]
["S",2,"S",0,5,2,0,0,0,0,0,"","Serviço","Serviço","-","SINAPI",72897,"CARGA MANUAL DE ENTULHO EM CAMINHAO BASCULANTE 6 M3","M3",9.5,1,9.5,null,null,0,0,""]
[2,2,2,3,5,3,0,0,0,8,3,"","Nível 2","Nível 2","-","SINAPI",null,"DIVERSOS","-",null,1,"-",null,null,0,0,""]
["S",2,"S",0,5,3,0,0,0,0,0,"","Serviço","Serviço","-","AGETOP",270312,"MURO DE ALVENARIA TIJOLO FURADO 1/2 VEZ ( H=2,50M) COM FUNDAÇÃO - SEM REVESTIMENTOS (PADRÃO GOINFRA)","m2    ",112.5,1,112.5,null,null,0,0,""]
["S",2,"S",0,5,3,0,0,0,0,0,"","Serviço","Serviço","-","AGETOP",60010,"VERGA/CONTRAVERGA EM CONCRETO ARMADO FCK = 20 MPA","m3    ",0.02,1,0.02,null,null,0,0,""]
[2,2,2,3,5,4,0,0,0,5,3,"","Nível 2","Nível 2","-","SINAPI",null,"SERVIÇO EM TERRA","-",null,1,"-",null,null,0,0,""]
["S",2,"S",0,5,4,0,0,0,0,0,"","Serviço","Serviço","-","AGETOP",41140,"REGULARIZAÇÃO DO TERRENO SEM APILOAMENTO COM TRANSPORTE MANUAL DA TERRA ESCAVADA ","m2    ",60,1,60,null,null,0,0,""]
["S",2,"S",0,5,4,0,0,0,0,0,"","Serviço","Serviço","-","AGETOP",41002,"APILOAMENTO","m2    ",60,1,60,null,null,0,0,""]
[2,2,2,2,5,5,0,0,0,2,59,"","Nível 2","Nível 2","-","SINAPI",null,"PINTURA","-",null,1,"-",null,null,0,0,""]
["S",2,"S",0,5,5,0,0,0,0,0,"","Serviço","Serviço","-","AGETOP",261000,"PINTURA LATEX ACRILICA 2 DEMAOS C/SELADOR","m2    ",225,1,225,null,null,0,0,""]
[1,1,1,157,6,0,0,0,0,{"$f":"IF(OR($C147=\"S\",$C147=0),0,MATCH(0,OFFSET($D147,1,$C147,ROW($C$530)-ROW($C147)),0))","v":383},{"$f":"IF(OR($C147=\"S\",$C147=0),0,MATCH(OFFSET($D147,0,$C147)+1,OFFSET($D147,1,$C147,ROW($C$530)-ROW($C147)),0))","v":157},"F","Nível 1","Nível 1","6.","AGETOP",null,"BLOCO 03 SALAS PADRÃO SEDUC 2019 - LAJE","UN",1,1,1,null,null,0,0,""]
[2,2,2,2,6,1,0,0,0,156,2,"","Nível 2","Nível 2","-","AGETOP",null,"SERVIÇOS PRELIMINARES","-",null,1,"-",null,null,0,0,""]
["S",2,"S",0,6,1,0,0,0,0,0,"","Serviço","Serviço","-","AGETOP",20701,"LOCAÇÃO DA OBRA, EXECUÇÃO DE GABARITO SEM REAPROVEITAMENTO, INCLUSO PINTURA (FACE INTERNA DO RIPÃO 15CM) E PIQUETE COM TESTEMUNHA","m2    ",190.26,1,190.26,null,null,0,0,""]
[2,2,2,3,6,2,0,0,0,154,3,"","Nível 2","Nível 2","-","SINAPI",null,"TRANSPORTES","-",null,1,"-",null,null,0,0,""]
["S",2,"S",0,6,2,0,0,0,0,0,"","Serviço","Serviço","-","SINAPI",72897,"CARGA MANUAL DE ENTULHO EM CAMINHAO BASCULANTE 6 M3","M3",13.31,1,13.31,null,null,0,0,""]
["S",2,"S",0,6,2,0,0,0,0,0,"","Serviço","Serviço","-","SINAPI",72900,"TRANSPORTE DE ENTULHO COM CAMINHAO BASCULANTE 6 M3, RODOVIA PAVIMENTADA, DMT 0,5 A 1,0 KM","M3",13.31,1,13.31,null,null,0,0,""]
[2,2,2,7,6,3,0,0,0,151,7,"","Nível 2","Nível 2","-","SINAPI",null,"SERVIÇO EM TERRA","-",null,1,"-",null,null,0,0,""]
[3,3,3,3,6,3,1,0,0,6,3,"","Nível 3","Nível 3","-","SINAPI",null,"BLOCO PADRÃO","-",null,1,"-",null,null,0,0,""]
["S",3,"S",0,6,3,1,0,0,0,0,"","Serviço","Serviço","-","AGETOP",41140,"REGULARIZAÇÃO DO TERRENO SEM APILOAMENTO COM TRANSPORTE MANUAL DA TERRA ESCAVADA ","m2    ",190.26,1,190.26,null,null,0,0,""]
["S",3,"S",0,6,3,1,0,0,0,0,"","Serviço","Serviço","-","AGETOP",40905,"APILOAMENTO MECÂNICO","m2    ",190.26,1,190.26,null,null,0,0,""]
[3,3,3,3,6,3,2,0,0,3,17,"","Nível 3","Nível 3","-","SINAPI",null,"SPDA","-",null,1,"-",null,null,0,0,""]
["S",3,"S",0,6,3,2,0,0,0,0,"","Serviço","Serviço","-","SINAPI",93358,"ESCAVAÇÃO MANUAL DE VALA COM PROFUNDIDADE MENOR OU IGUAL A 1,30 M. AF_03/2016","M3",7.92,1,7.92,null,null,0,0,"Referência: AGETOP - 40101"]
["S",3,"S",0,6,3,2,0,0,0,0,"","Serviço","Serviço","-","AGETOP",40902,"REATERRO COM APILOAMENTO","m3    ",7.92,1,7.92,null,null,0,0,""]
[2,2,2,17,6,4,0,0,0,144,17,"","Nível 2","Nível 2","-","SINAPI",null,"FUNDAÇÕES E SONDAGENS","-",null,1,"-",null,null,0,0,""]
[3,3,3,4,6,4,1,0,0,16,4,"","Nível 3","Nível 3","-","SINAPI",null,"ESTACAS","-",null,1,"-",null,null,0,0,""]
["S",3,"S",0,6,4,1,0,0,0,0,"","Serviço","Serviço","-","SINAPI",98230,"ESTACA BROCA DE CONCRETO, DIÂMETRO DE 30 CM, PROFUNDIDADE DE ATÉ 3 M, ESCAVAÇÃO MANUAL COM TRADO CONCHA, NÃO ARMADA. AF_03/2018","M",111.5,1,111.5,null,null,0,0,"Referência: AGETOP - 50302"]
["S",3,"S",0,6,4,1,0,0,0,0,"","Serviço","Serviço","-","SINAPI",96543,"ARMAÇÃO DE BLOCO, VIGA BALDRAME E SAPATA UTILIZANDO AÇO CA-60 DE 5 MM - MONTAGEM. AF_06/2017","KG",38.15,1,38.15,null,null,0,0,"Referência: AGETOP - 52014"]
["S",3,"S",0,6,4,1,0,0,0,0,"","Serviço","Serviço","-","SINAPI",96545,"ARMAÇÃO DE BLOCO, VIGA BALDRAME OU SAPATA UTILIZANDO AÇO CA-50 DE 8 MM - MONTAGEM. AF_06/2017","KG",89.6,1,89.6,null,null,0,0,"Referência: AGETOP - 52004"]
[3,3,3,9,6,4,2,0,0,12,9,"","Nível 3","Nível 3","-","SINAPI",null,"BLOCOS","-",null,1,"-",null,null,0,0,""]
["S",3,"S",0,6,4,2,0,0,0,0,"","Serviço","Serviço","-","SINAPI",96522,"ESCAVAÇÃO MANUAL PARA BLOCO DE COROAMENTO OU SAPATA, SEM PREVISÃO DE FÔRMA. AF_06/2017","M3",4.22,1,4.22,null,null,0,0,"Referência: AGETOP - 50901"]
["S",3,"S",0,6,4,2,0,0,0,0,"","Serviço","Serviço","-","SINAPI",96619,"LASTRO DE CONCRETO MAGRO, APLICADO EM BLOCOS DE COROAMENTO OU SAPATAS, ESPESSURA DE 5 CM. AF_08/2017","M2",0.31999999999999984,1,0.31999999999999984,null,null,0,0,""]
["S",3,"S",0,6,4,2,0,0,0,0,"","Serviço","Serviço","-","SINAPI",94963,"CONCRETO FCK = 15MPA, TRAÇO 1:3,4:3,5 (CIMENTO/ AREIA MÉDIA/ BRITA 1)  - PREPARO MECÂNICO COM BETONEIRA 400 L. AF_07/2016","M3",3.9,1,3.9,null,null,0,0,""]
["S",3,"S",0,6,4,2,0,0,0,0,"","Serviço","Serviço","-","AGETOP",51026,"LANÇAMENTO/APLICAÇÃO/ADENSAMENTO DE CONCRETO EM FUNDAÇÃO- (O.C.)","m3    ",3.9,1,3.9,null,null,0,0,""]
["S",3,"S",0,6,4,2,0,0,0,0,"","Serviço","Serviço","-","SINAPI",96544,"ARMAÇÃO DE BLOCO, VIGA BALDRAME OU SAPATA UTILIZANDO AÇO CA-50 DE 6,3 MM - MONTAGEM. AF_06/2017","KG",66.650000000000006,1,66.650000000000006,null,null,0,0,"Referência: AGETOP - 52003"]
["S",3,"S",0,6,4,2,0,0,0,0,"","Serviço","Serviço","-","SINAPI",96545,"ARMAÇÃO DE BLOCO, VIGA BALDRAME OU SAPATA UTILIZANDO AÇO CA-50 DE 8 MM - MONTAGEM. AF_06/2017","KG",46.4,1,46.4,null,null,0,0,"Referência: AGETOP - 52004"]
["S",3,"S",0,6,4,2,0,0,0,0,"","Serviço","Serviço","-","SINAPI",96546,"ARMAÇÃO DE BLOCO, VIGA BALDRAME OU SAPATA UTILIZANDO AÇO CA-50 DE 10 MM - MONTAGEM. AF_06/2017","KG",55.44,1,55.44,null,null,0,0,"Referência: AGETOP - 52005"]
["S",3,"S",0,6,4,2,0,0,0,0,"","Serviço","Serviço","-","SINAPI",96543,"ARMAÇÃO DE BLOCO, VIGA BALDRAME E SAPATA UTILIZANDO AÇO CA-60 DE 5 MM - MONTAGEM. AF_06/2017","KG",38.18181818181818,1,38.18181818181818,null,null,0,0,"Referência: AGETOP - 52014"]
[3,3,3,3,6,4,3,0,0,3,26,"","Nível 3","Nível 3","-",null,null,"ARRANQUE","-",null,1,"-",null,null,0,0,""]
["S",3,"S",0,6,4,3,0,0,0,0,"","Serviço","Serviço","-","SINAPI",96543,"ARMAÇÃO DE BLOCO, VIGA BALDRAME E SAPATA UTILIZANDO AÇO CA-60 DE 5 MM - MONTAGEM. AF_06/2017","KG",5.71,1,5.71,null,null,0,0,"Referência: AGETOP - 52014"]
["S",3,"S",0,6,4,3,0,0,0,0,"","Serviço","Serviço","-","SINAPI",96546,"ARMAÇÃO DE BLOCO, VIGA BALDRAME OU SAPATA UTILIZANDO AÇO CA-50 DE 10 MM - MONTAGEM. AF_06/2017","KG",52.92,1,52.92,null,null,0,0,"Referência: AGETOP - 52005"]
[2,2,2,27,6,5,0,0,0,127,27,"","Nível 2","Nível 2","-","SINAPI",null,"ESTRUTURA","-",null,1,"-",null,null,0,0,""]
[3,3,3,8,6,5,1,0,0,26,8,"","Nível 3","Nível 3","-","SINAPI",null,"VIGAS BALDRAMES","-",null,1,"-",null,null,0,0,""]
["S",3,"S",0,6,5,1,0,0,0,0,"","Serviço","Serviço","-","SINAPI",96527,"ESCAVAÇÃO MANUAL DE VALA PARA VIGA BALDRAME, COM PREVISÃO DE FÔRMA. AF_06/2017","M3",10.32,1,10.32,null,null,0,0,"Referência: AGETOP - 40101"]
["S",3,"S",0,6,5,1,0,0,0,0,"","Serviço","Serviço","-","SINAPI",96995,"REATERRO MANUAL APILOADO COM SOQUETE. AF_10/2017","M3",6.07,1,6.07,null,null,0,0,"Referência: AGETOP - 40902"]
["S",3,"S",0,6,5,1,0,0,0,0,"","Serviço","Serviço","-","AGETOP",60191,"FORMA DE TABUA CINTA BALDRAME U=8 VEZES","m2    ",75.67,1,75.67,null,null,0,0,""]
["S",3,"S",0,6,5,1,0,0,0,0,"","Serviço","Serviço","-","SINAPI",94964,"CONCRETO FCK = 20MPA, TRAÇO 1:2,7:3 (CIMENTO/ AREIA MÉDIA/ BRITA 1)  - PREPARO MECÂNICO COM BETONEIRA 400 L. AF_07/2016","M3",4.25,1,4.25,null,null,0,0,""]
["S",3,"S",0,6,5,1,0,0,0,0,"","Serviço","Serviço","-","SINAPI",92873,"LANÇAMENTO COM USO DE BALDES, ADENSAMENTO E ACABAMENTO DE CONCRETO EM ESTRUTURAS. AF_12/2015","M3",4.25,1,4.25,null,null,0,0,"Referência: AGETOP - 60801"]
["S",3,"S",0,6,5,1,0,0,0,0,"","Serviço","Serviço","-","SINAPI",96545,"ARMAÇÃO DE BLOCO, VIGA BALDRAME OU SAPATA UTILIZANDO AÇO CA-50 DE 8 MM - MONTAGEM. AF_06/2017","KG",176.44,1,176.44,null,null,0,0,"Referência: AGETOP - 52004"]
["S",3,"S",0,6,5,1,0,0,0,0,"","Serviço","Serviço","-","SINAPI",96543,"ARMAÇÃO DE BLOCO, VIGA BALDRAME E SAPATA UTILIZANDO AÇO CA-60 DE 5 MM - MONTAGEM. AF_06/2017","KG",96.56,1,96.56,null,null,0,0,"Referência: AGETOP - 52014"]
[3,3,3,6,6,5,2,0,0,18,6,"","Nível 3","Nível 3","-","SINAPI",null,"PILARES","-",null,1,"-",null,null,0,0,""]
["S",3,"S",0,6,5,2,0,0,0,0,"","Serviço","Serviço","-","SINAPI",92426,"MONTAGEM E DESMONTAGEM DE FÔRMA DE PILARES RETANGULARES E ESTRUTURAS SIMILARES COM ÁREA MÉDIA DAS SEÇÕES MENOR OU IGUAL A 0,25 M², PÉ-DIREITO SIMPLES, EM CHAPA DE MADEIRA COMPENSADA RESINADA, 8 UTILIZAÇÕES. AF_12/2015","M2",38.19,1,38.19,null,null,0,0,""]
["S",3,"S",0,6,5,2,0,0,0,0,"","Serviço","Serviço","-","SINAPI",94964,"CONCRETO FCK = 20MPA, TRAÇO 1:2,7:3 (CIMENTO/ AREIA MÉDIA/ BRITA 1)  - PREPARO MECÂNICO COM BETONEIRA 400 L. AF_07/2016","M3",1.82,1,1.82,null,null,0,0,""]
["S",3,"S",0,6,5,2,0,0,0,0,"","Serviço","Serviço","-","SINAPI",92873,"LANÇAMENTO COM USO DE BALDES, ADENSAMENTO E ACABAMENTO DE CONCRETO EM ESTRUTURAS. AF_12/2015","M3",1.82,1,1.82,null,null,0,0,"Referência: AGETOP - 60801"]
["S",3,"S",0,6,5,2,0,0,0,0,"","Serviço","Serviço","-","SINAPI",92778,"ARMAÇÃO DE PILAR OU VIGA DE UMA ESTRUTURA CONVENCIONAL DE CONCRETO ARMADO EM UMA EDIFICAÇÃO TÉRREA OU SOBRADO UTILIZANDO AÇO CA-50 DE 10,0 MM - MONTAGEM. AF_12/2015","KG",108.66,1,108.66,null,null,0,0,"Referência: AGETOP - 60305"]
["S",3,"S",0,6,5,2,0,0,0,0,"","Serviço","Serviço","-","SINAPI",92775,"ARMAÇÃO DE PILAR OU VIGA DE UMA ESTRUTURA CONVENCIONAL DE CONCRETO ARMADO EM UMA EDIFICAÇÃO TÉRREA OU SOBRADO UTILIZANDO AÇO CA-60 DE 5,0 MM - MONTAGEM. AF_12/2015","KG",49.5,1,49.5,null,null,0,0,"Referência: AGETOP - 60314"]
[3,3,3,8,6,5,3,0,0,12,8,"","Nível 3","Nível 3","-","SINAPI",null,"VIGAS DE COBERTURA","-",null,1,"-",null,null,0,0,""]
["S",3,"S",0,6,5,3,0,0,0,0,"","Serviço","Serviço","-","SINAPI",92464,"MONTAGEM E DESMONTAGEM DE FÔRMA DE VIGA, ESCORAMENTO METÁLICO, PÉ-DIREITO SIMPLES, EM CHAPA DE MADEIRA RESINADA, 8 UTILIZAÇÕES. AF_12/2015","M2",68.47,1,68.47,null,null,0,0,"Referência: AGETOP - 60209"]
["S",3,"S",0,6,5,3,0,0,0,0,"","Serviço","Serviço","-","SINAPI",94964,"CONCRETO FCK = 20MPA, TRAÇO 1:2,7:3 (CIMENTO/ AREIA MÉDIA/ BRITA 1)  - PREPARO MECÂNICO COM BETONEIRA 400 L. AF_07/2016","M3",4.08,1,4.08,null,null,0,0,""]
["S",3,"S",0,6,5,3,0,0,0,0,"","Serviço","Serviço","-","SINAPI",92873,"LANÇAMENTO COM USO DE BALDES, ADENSAMENTO E ACABAMENTO DE CONCRETO EM ESTRUTURAS. AF_12/2015","M3",4.08,1,4.08,null,null,0,0,"Referência: AGETOP - 60801"]
["S",3,"S",0,6,5,3,0,0,0,0,"","Serviço","Serviço","-","SINAPI",92777,"ARMAÇÃO DE PILAR OU VIGA DE UMA ESTRUTURA CONVENCIONAL DE CONCRETO ARMADO EM UMA EDIFICAÇÃO TÉRREA OU SOBRADO UTILIZANDO AÇO CA-50 DE 8,0 MM - MONTAGEM. AF_12/2015","KG",52.8,1,52.8,null,null,0,0,"Referência: AGETOP - 60304"]
["S",3,"S",0,6,5,3,0,0,0,0,"","Serviço","Serviço","-","SINAPI",92778,"ARMAÇÃO DE PILAR OU VIGA DE UMA ESTRUTURA CONVENCIONAL DE CONCRETO ARMADO EM UMA EDIFICAÇÃO TÉRREA OU SOBRADO UTILIZANDO AÇO CA-50 DE 10,0 MM - MONTAGEM. AF_12/2015","KG",159.51,1,159.51,null,null,0,0,"Referência: AGETOP - 60305"]
["S",3,"S",0,6,5,3,0,0,0,0,"","Serviço","Serviço","-","SINAPI",92779,"ARMAÇÃO DE PILAR OU VIGA DE UMA ESTRUTURA CONVENCIONAL DE CONCRETO ARMADO EM UMA EDIFICAÇÃO TÉRREA OU SOBRADO UTILIZANDO AÇO CA-50 DE 12,5 MM - MONTAGEM. AF_12/2015","KG",52.8,1,52.8,null,null,0,0,""]
["S",3,"S",0,6,5,3,0,0,0,0,"","Serviço","Serviço","-","SINAPI",92775,"ARMAÇÃO DE PILAR OU VIGA DE UMA ESTRUTURA CONVENCIONAL DE CONCRETO ARMADO EM UMA EDIFICAÇÃO TÉRREA OU SOBRADO UTILIZANDO AÇO CA-60 DE 5,0 MM - MONTAGEM. AF_12/2015","KG",68.3,1,68.3,null,null,0,0,"Referência: AGETOP - 60314"]
[3,3,3,2,6,5,4,0,0,4,2,"","Nível 3","Nível 3","-","SINAPI",null,"LAJE","-",null,1,"-",null,null,0,0,""]
["S",3,"S",0,6,5,4,0,0,0,0,"","Serviço","Serviço","-","SINAPI","74202/1","LAJE PRE-MOLDADA P/FORRO, SOBRECARGA 100KG/M2, VAOS ATE 3,50M/E=8CM, C/LAJOTAS E CAP.C/CONC FCK=20MPA, 3CM, INTER-EIXO 38CM, C/ESCORAMENTO (REAPR.3X) E FERRAGEM NEGATIVA","M2",151.86000000000001,1,151.86000000000001,null,null,0,0,"Referência: AGETOP - 61101"]
[3,3,3,2,6,5,5,0,0,2,{"$error":"#N/A"},"","Nível 3","Nível 3","-","SINAPI",null,"OUTROS","-",null,1,"-",null,null,0,0,""]
["S",3,"S",0,6,5,5,0,0,0,0,"","Serviço","Serviço","-","AGETOP",50251,"CORPO DE PROVA","Un    ",6,1,6,null,null,0,0,""]
[2,2,2,48,6,6,0,0,0,100,48,"","Nível 2","Nível 2","-","SINAPI",null,"INSTALAÇÕES ELÉTRICAS","-",null,1,"-",null,null,0,0,""]
[3,3,3,32,6,6,1,0,0,47,32,"","Nível 3","Nível 3","-","SINAPI",null,"INST. ELÉTRICAS","-",null,1,"-",null,null,0,0,""]
["S",3,"S",0,6,6,1,0,0,0,0,"","Serviço","Serviço","-","AGETOP",70351,"BRACADEIRA METALICA TIPO \"U\" DIAM. 3/4\"","Un    ",60,1,60,null,null,0,0,""]
["S",3,"S",0,6,6,1,0,0,0,0,"","Serviço","Serviço","-","AGETOP",70352,"BRACADEIRA METALICA TIPO \"U\" DIAM. 1\"","Un    ",25,1,25,null,null,0,0,""]
["S",3,"S",0,6,6,1,0,0,0,0,"","Serviço","Serviço","-","AGETOP",70421,"BUCHA E ARRUELA METALICA DIAM. 3/4\"","PR    ",2,1,2,null,null,0,0,""]
["S",3,"S",0,6,6,1,0,0,0,0,"","Serviço","Serviço","-","AGETOP",70422,"BUCHA E ARRUELA METALICA DIAM. 1\"","PR    ",2,1,2,null,null,0,0,""]
["S",3,"S",0,6,6,1,0,0,0,0,"","Serviço","Serviço","-","SINAPI",92980,"CABO DE COBRE FLEXÍVEL ISOLADO, 10 MM², ANTI-CHAMA 0,6/1,0 KV, PARA DISTRIBUIÇÃO - FORNECIMENTO E INSTALAÇÃO. AF_12/2015","M",1,1,1,null,null,0,0,""]
["S",3,"S",0,6,6,1,0,0,{"$f":"IF(OR($C211=\"S\",$C211=0),0,MATCH(0,OFFSET($D211,1,$C211,ROW($C$530)-ROW($C211)),0))","v":0},{"$f":"IF(OR($C211=\"S\",$C211=0),0,MATCH(OFFSET($D211,0,$C211)+1,OFFSET($D211,1,$C211,ROW($C$530)-ROW($C211)),0))","v":0},"","Serviço","Serviço","-","AGETOP",70561,"CABO ISOLADO PP 3 X 2,5 MM2","M     ",100,1,100,null,null,0,0,""]
["S",3,"S",0,6,6,1,0,0,0,0,"","Serviço","Serviço","-","SINAPI",91926,"CABO DE COBRE FLEXÍVEL ISOLADO, 2,5 MM², ANTI-CHAMA 450/750 V, PARA CIRCUITOS TERMINAIS - FORNECIMENTO E INSTALAÇÃO. AF_12/2015","M",318,1,318,null,null,0,0,"Referência: AGETOP - 70563"]
["S",3,"S",0,6,6,1,0,0,0,0,"","Serviço","Serviço","-","SINAPI",91928,"CABO DE COBRE FLEXÍVEL ISOLADO, 4 MM², ANTI-CHAMA 450/750 V, PARA CIRCUITOS TERMINAIS - FORNECIMENTO E INSTALAÇÃO. AF_12/2015","M",306,1,306,null,null,0,0,"Referência: AGETOP - 70564"]
["S",3,"S",0,6,6,1,0,0,0,0,"","Serviço","Serviço","-","SINAPI",91937,"CAIXA OCTOGONAL 3\" X 3\", PVC, INSTALADA EM LAJE - FORNECIMENTO E INSTALAÇÃO. AF_12/2015","UN",22,1,22,null,null,0,0,""]
["S",3,"S",0,6,6,1,0,0,0,0,"","Serviço","Serviço","-","SINAPI",92868,"CAIXA RETANGULAR 4\" X 2\" MÉDIA (1,30 M DO PISO), METÁLICA, INSTALADA EM PAREDE - FORNECIMENTO E INSTALAÇÃO. AF_12/2015","UN",17,1,17,null,null,0,0,"Referência: AGETOP - 70691"]
["S",3,"S",0,6,6,1,0,0,0,0,"","Serviço","Serviço","-","AGETOP",70924,"CONDULETE DE PVC - CAIXA COM 5 ENTRADAS ","un    ",20,1,20,null,null,0,0,""]
["S",3,"S",0,6,6,1,0,0,0,0,"","Serviço","Serviço","-","SINAPI",91902,"CURVA 90 GRAUS PARA ELETRODUTO, PVC, ROSCÁVEL, DN 25 MM (3/4\"), PARA CIRCUITOS TERMINAIS, INSTALADA EM LAJE - FORNECIMENTO E INSTALAÇÃO. AF_12/2015","UN",4,1,4,null,null,0,0,"Referência: AGETOP - 71141"]
["S",3,"S",0,6,6,1,0,0,0,0,"","Serviço","Serviço","-","SINAPI",91905,"CURVA 90 GRAUS PARA ELETRODUTO, PVC, ROSCÁVEL, DN 32 MM (1\"), PARA CIRCUITOS TERMINAIS, INSTALADA EM LAJE - FORNECIMENTO E INSTALAÇÃO. AF_12/2015","UN",4,1,4,null,null,0,0,"Referência: AGETOP - 71142"]
["S",3,"S",0,6,6,1,0,0,0,0,"","Serviço","Serviço","-","SINAPI",93653,"DISJUNTOR MONOPOLAR TIPO DIN, CORRENTE NOMINAL DE 10A - FORNECIMENTO E INSTALAÇÃO. AF_04/2016","UN",3,1,3,null,null,0,0,""]
["S",3,"S",0,6,6,1,0,0,0,0,"","Serviço","Serviço","-","SINAPI",93654,"DISJUNTOR MONOPOLAR TIPO DIN, CORRENTE NOMINAL DE 16A - FORNECIMENTO E INSTALAÇÃO. AF_04/2016","UN",2,1,2,null,null,0,0,""]
["S",3,"S",0,6,6,1,0,0,0,0,"","Serviço","Serviço","-","SINAPI",93656,"DISJUNTOR MONOPOLAR TIPO DIN, CORRENTE NOMINAL DE 25A - FORNECIMENTO E INSTALAÇÃO. AF_04/2016","UN",6,1,6,null,null,0,0,""]
["S",3,"S",0,6,6,1,0,0,0,0,"","Serviço","Serviço","-","SINAPI",93671,"DISJUNTOR TRIPOLAR TIPO DIN, CORRENTE NOMINAL DE 32A - FORNECIMENTO E INSTALAÇÃO. AF_04/2016","UN",1,1,1,null,null,0,0,"Referência: AGETOP - 71173"]
["S",3,"S",0,6,6,1,0,0,0,0,"","Serviço","Serviço","-","AGETOP",71184,"DISPOSITIVO DE PROTEÇÃO CONTRA SURTOS (D.P.S.) 275V DE 8 A 40KA","Un    ",3,1,3,null,null,0,0,""]
["S",3,"S",0,6,6,1,0,0,0,0,"","Serviço","Serviço","-","SINAPI",91844,"ELETRODUTO FLEXÍVEL CORRUGADO, PVC, DN 25 MM (3/4\"), PARA CIRCUITOS TERMINAIS, INSTALADO EM LAJE - FORNECIMENTO E INSTALAÇÃO. AF_12/2015","M",120,1,120,null,null,0,0,""]
["S",3,"S",0,6,6,1,0,0,0,0,"","Serviço","Serviço","-","SINAPI",91846,"ELETRODUTO FLEXÍVEL CORRUGADO, PVC, DN 32 MM (1\"), PARA CIRCUITOS TERMINAIS, INSTALADO EM LAJE - FORNECIMENTO E INSTALAÇÃO. AF_12/2015","M",20,1,20,null,null,0,0,""]
["S",3,"S",0,6,6,1,0,0,0,0,"","Serviço","Serviço","-","SINAPI",91871,"ELETRODUTO RÍGIDO ROSCÁVEL, PVC, DN 25 MM (3/4\"), PARA CIRCUITOS TERMINAIS, INSTALADO EM PAREDE - FORNECIMENTO E INSTALAÇÃO. AF_12/2015","M",50,1,50,null,null,0,0,"Referência: AGETOP - 71201"]
["S",3,"S",0,6,6,1,0,0,0,0,"","Serviço","Serviço","-","SINAPI",91872,"ELETRODUTO RÍGIDO ROSCÁVEL, PVC, DN 32 MM (1\"), PARA CIRCUITOS TERMINAIS, INSTALADO EM PAREDE - FORNECIMENTO E INSTALAÇÃO. AF_12/2015","M",50,1,50,null,null,0,0,"Referência: AGETOP - 71202"]
["S",3,"S",0,6,6,1,0,0,0,0,"","Serviço","Serviço","-","SINAPI",91953,"INTERRUPTOR SIMPLES (1 MÓDULO), 10A/250V, INCLUINDO SUPORTE E PLACA - FORNECIMENTO E INSTALAÇÃO. AF_12/2015","UN",4,1,4,null,null,0,0,"Referência: AGETOP - 71440"]
["S",3,"S",0,6,6,1,0,0,0,0,"","Serviço","Serviço","-","COMPOSIÇÃO","COMP 387_SEE","LÂMPADA LED TUBULAR 18W ","UN ",44,1,44,null,null,0,0,""]
["S",3,"S",0,6,6,1,0,0,0,0,"","Serviço","Serviço","-","SINAPI",97585,"LUMINÁRIA TIPO CALHA, DE SOBREPOR, COM 2 LÂMPADAS TUBULARES FLUORESCENTES DE 18 W, COM REATOR DE PARTIDA RÁPIDA - FORNECIMENTO E INSTALAÇÃO. AF_02/2020","UN",22,1,22,null,null,0,0,""]
["S",3,"S",0,6,6,1,0,0,0,0,"","Serviço","Serviço","-","SINAPI",91884,"LUVA PARA ELETRODUTO, PVC, ROSCÁVEL, DN 25 MM (3/4\"), PARA CIRCUITOS TERMINAIS, INSTALADA EM PAREDE - FORNECIMENTO E INSTALAÇÃO. AF_12/2015","UN",60,1,60,null,null,0,0,"Referência: AGETOP - 71741"]
["S",3,"S",0,6,6,1,0,0,0,0,"","Serviço","Serviço","-","SINAPI",91885,"LUVA PARA ELETRODUTO, PVC, ROSCÁVEL, DN 32 MM (1\"), PARA CIRCUITOS TERMINAIS, INSTALADA EM PAREDE - FORNECIMENTO E INSTALAÇÃO. AF_12/2015","UN",25,1,25,null,null,0,0,"Referência: AGETOP - 71742"]
["S",3,"S",0,6,6,1,0,0,0,0,"","Serviço","Serviço","-","AGETOP",72170,"QUADRO DE DISTRIBUIÇÃO DE EMBUTIR EM PVC CB 12E - 80A","Un    ",1,1,1,null,null,0,0,""]
["S",3,"S",0,6,6,1,0,0,0,0,"","Serviço","Serviço","-","AGETOP",72385,"TAMPA CEGA PARA CONDULETE DE PVC","Un    ",20,1,20,null,null,0,0,""]
["S",3,"S",0,6,6,1,0,0,0,0,"","Serviço","Serviço","-","SINAPI",92000,"TOMADA BAIXA DE EMBUTIR (1 MÓDULO), 2P+T 10 A, INCLUINDO SUPORTE E PLACA - FORNECIMENTO E INSTALAÇÃO. AF_12/2015","UN",7,1,7,null,null,0,0,"Referência: AGETOP - 72578"]
["S",3,"S",0,6,6,1,0,0,0,0,"","Serviço","Serviço","-","SINAPI",91993,"TOMADA ALTA DE EMBUTIR (1 MÓDULO), 2P+T 20 A, INCLUINDO SUPORTE E PLACA - FORNECIMENTO E INSTALAÇÃO. AF_12/2015","UN",6,1,6,null,null,0,0,"Referência: AGETOP - 72585"]
[3,3,3,15,6,6,2,0,0,15,230,"","Nível 3","Nível 3","-","SINAPI",null,"SPDA","-",null,1,"-",null,null,0,0,""]
["S",3,"S",0,6,6,2,0,0,0,0,"","Serviço","Serviço","-","COMPOSIÇÃO","COMP 034_SEE","TERMINAL AÉREO SPDA 30CM Fo Go DIAM. 5/16\" COM SUPORTE","UN ",13,1,13,null,null,0,0,""]
["S",3,"S",0,6,6,2,0,0,0,0,"","Serviço","Serviço","-","COMPOSIÇÃO","COMP 036_SEE","PRESILHA LATÃO 16/35MM 5MM+PARAF FENDA ","UN ",140,1,140,null,null,0,0,""]
["S",3,"S",0,6,6,2,0,0,0,0,"","Serviço","Serviço","-","SINAPI",93203,"FIXAÇÃO (ENCUNHAMENTO) DE ALVENARIA DE VEDAÇÃO COM ESPUMA DE POLIURETANO EXPANSIVA. AF_03/2016","M",1,1,1,null,null,0,0,""]
["S",3,"S",0,6,6,2,0,0,0,0,"","Serviço","Serviço","-","AGETOP",71035,"CONECTOR TIPO PARAFUSO FENDIDO 35 MM2","Un    ",15,1,15,null,null,0,0,""]
["S",3,"S",0,6,6,2,0,0,0,0,"","Serviço","Serviço","-","AGETOP",70543,"CABO DE COBRE NÚ No. 35 MM2","M     ",118,1,118,null,null,0,0,""]
["S",3,"S",0,6,6,2,0,0,0,0,"","Serviço","Serviço","-","AGETOP",70544,"CABO DE COBRE NÚ No. 50 MM2","M     ",68,1,68,null,null,0,0,""]
["S",3,"S",0,6,6,2,0,0,0,0,"","Serviço","Serviço","-","SINAPI",91872,"ELETRODUTO RÍGIDO ROSCÁVEL, PVC, DN 32 MM (1\"), PARA CIRCUITOS TERMINAIS, INSTALADO EM PAREDE - FORNECIMENTO E INSTALAÇÃO. AF_12/2015","M",15,1,15,null,null,0,0,"Referência: AGETOP - 71202"]
["S",3,"S",0,6,6,2,0,0,0,0,"","Serviço","Serviço","-","AGETOP",70372,"BRACADEIRA METALICA TIPO \"D\" DIAM. 1\"","Un    ",7,1,7,null,null,0,0,""]
["S",3,"S",0,6,6,2,0,0,0,0,"","Serviço","Serviço","-","SINAPI",96985,"HASTE DE ATERRAMENTO 5/8  PARA SPDA - FORNECIMENTO E INSTALAÇÃO. AF_12/2017","UN",8,1,8,null,null,0,0,""]
["S",3,"S",0,6,6,2,0,0,0,0,"","Serviço","Serviço","-","SINAPI",98111,"CAIXA DE INSPEÇÃO PARA ATERRAMENTO, CIRCULAR, EM POLIETILENO, DIÂMETRO INTERNO = 0,3 M. AF_05/2018","UN",1,1,1,null,null,0,0,""]
["S",3,"S",0,6,6,2,0,0,0,0,"","Serviço","Serviço","-","AGETOP",70255,"ATERRAMENTO - SOLDA EXOTÉRMICA - CARTUCHO 90 G","un    ",8,1,8,null,null,0,0,""]
["S",3,"S",0,6,6,2,0,0,0,0,"","Serviço","Serviço","-","COMPOSIÇÃO","COMP 039_SEE","MOLDE GRAF CGT 5/8 50MM C","UN ",3,1,3,null,null,0,0,""]
["S",3,"S",0,6,6,2,0,0,0,0,"","Serviço","Serviço","-","COMPOSIÇÃO","COMP 550_SEE","ALIC P/MOLDE C-84","UN ",1,1,1,null,null,0,0,""]
["S",3,"S",0,6,6,2,0,0,0,0,"","Serviço","Serviço","-","COMPOSIÇÃO","COMP 048_SEE","HASTE ROSQUEADA \"TIRANTE\" 3/8\"","M",8,1,8,null,null,0,0,""]
[2,2,2,8,6,7,0,0,0,52,8,"","Nível 2","Nível 2","-","SINAPI",null,"INSTALAÇÕES ESPECIAIS","-",null,1,"-",null,null,0,0,""]
[3,3,3,7,6,7,1,0,0,7,129,"","Nível 3","Nível 3","-","SINAPI",null,"INSTALAÇÕES DE INCÊNDIO","-",null,1,"-",null,null,0,0,""]
["S",3,"S",0,6,7,1,0,0,0,0,"","Serviço","Serviço","-","AGETOP",85006,"EXTINTOR MULTI USO EM PO A B C (6 KG) - CAPACIDADE EXTINTORA 3A 20BC","un    ",1,1,1,null,null,0,0,""]
["S",3,"S",0,6,7,1,0,0,0,0,"","Serviço","Serviço","-","SINAPI",97599,"LUMINÁRIA DE EMERGÊNCIA, COM 30 LÂMPADAS LED DE 2 W, SEM REATOR - FORNECIMENTO E INSTALAÇÃO. AF_02/2020","UN",3,1,3,null,null,0,0,""]
["S",3,"S",0,6,7,1,0,0,0,0,"","Serviço","Serviço","-","COMPOSIÇÃO","COMP 024_SEE","SINALIZADOR FOTOLUMINESCENTE PARA EXTINTOR","UN ",1,1,1,null,null,0,0,""]
["S",3,"S",0,6,7,1,0,0,0,0,"","Serviço","Serviço","-","COMPOSIÇÃO","COMP 025_SEE","SINALIZADOR FOTOLUMINESCENTE DE EMERGÊNCIA","UN ",4,1,4,null,null,0,0,""]
["S",3,"S",0,6,7,1,0,0,0,0,"","Serviço","Serviço","-","COMPOSIÇÃO","COMP 277_SEE","MARCAÇÃO NO PISO - 1X1 M PARA EXTINTOR","M2",1,1,1,null,null,0,0,""]
["S",3,"S",0,6,7,1,0,0,0,0,"","Serviço","Serviço","-","COMPOSIÇÃO","COMP 412_SEE","PLACA DE SINALIZAÇÃO EM PVC COD 17 - (316X158) MENSAGEM \"SAÍDA\"","UN ",3,1,3,null,null,0,0,""]
[2,2,2,4,6,8,0,0,0,44,4,"","Nível 2","Nível 2","-","AGETOP",null,"ALVENARIAS E DIVISÓRIAS","-",null,1,"-",null,null,0,0,""]
["S",2,"S",0,6,8,0,0,0,0,0,"","Serviço","Serviço","-","SINAPI",87503,"ALVENARIA DE VEDAÇÃO DE BLOCOS CERÂMICOS FURADOS NA HORIZONTAL DE 9X19X19CM (ESPESSURA 9CM) DE PAREDES COM ÁREA LÍQUIDA MAIOR OU IGUAL A 6M² SEM VÃOS E ARGAMASSA DE ASSENTAMENTO COM PREPARO EM BETONEIRA. AF_06/2014","M2",81.16,1,81.16,null,null,0,0,"Referência: AGETOP - 100201"]
["S",2,"S",0,6,8,0,0,0,0,0,"","Serviço","Serviço","-","SINAPI",87519,"ALVENARIA DE VEDAÇÃO DE BLOCOS CERÂMICOS FURADOS NA HORIZONTAL DE 9X19X19CM (ESPESSURA 9CM) DE PAREDES COM ÁREA LÍQUIDA MAIOR OU IGUAL A 6M² COM VÃOS E ARGAMASSA DE ASSENTAMENTO COM PREPARO EM BETONEIRA. AF_06/2014","M2",100.2,1,100.2,null,null,0,0,"Referência: AGETOP - 100201"]
["S",2,"S",0,6,8,0,0,0,0,0,"","Serviço","Serviço","-","SINAPI",93201,"FIXAÇÃO (ENCUNHAMENTO) DE ALVENARIA DE VEDAÇÃO COM ARGAMASSA APLICADA COM COLHER. AF_03/2016","M",71.7,1,71.7,null,null,0,0,""]
[2,2,2,2,6,9,0,0,0,40,2,"","Nível 2","Nível 2","-",null,null,"IMPERMEABILIZAÇÃO","-",null,1,"-",null,null,0,0,""]
["S",2,"S",0,6,9,0,0,0,0,0,"","Serviço","Serviço","-","AGETOP",120902,"IMPERMEABILIZACAO VIGAS BALDRAMES E=2,0 CM","m2    ",74.88,1,74.88,null,null,0,0,""]
[2,2,2,2,6,10,0,0,0,38,2,"","Nível 2","Nível 2","-",null,null,"ESTRUTURAS METÁLICAS","-",null,1,"-",null,null,0,0,""]
["S",2,"S",0,6,10,0,0,0,0,0,"","Serviço","Serviço","-","AGETOP",150103,"ESTRUTURA METÁLICA CONVENCIONAL EM AÇO DO TIPO USI SAC-300 COM FUNDO ANTICORROSIVO","Kg    ",3851.57,1,3851.57,null,null,0,0,""]
[2,2,2,4,6,11,0,0,0,36,4,"","Nível 2","Nível 2","-",null,null,"COBERTURAS","-",null,1,"-",null,null,0,0,""]
["S",2,"S",0,6,11,0,0,0,0,0,"","Serviço","Serviço","-","SINAPI",94445,"TELHAMENTO COM TELHA CERÂMICA CAPA-CANAL, TIPO PLAN, COM ATÉ 2 ÁGUAS, INCLUSO TRANSPORTE VERTICAL. AF_07/2019","M2",235.69,1,235.69,null,null,0,0,"Referência: AGETOP - 160401"]
["S",2,"S",0,6,11,0,0,0,0,0,"","Serviço","Serviço","-","SINAPI",94221,"CUMEEIRA PARA TELHA CERÂMICA EMBOÇADA COM ARGAMASSA TRAÇO 1:2:9 (CIMENTO, CAL E AREIA) PARA TELHADOS COM ATÉ 2 ÁGUAS, INCLUSO TRANSPORTE VERTICAL. AF_07/2019","M",24.05,1,24.05,null,null,0,0,""]
["S",2,"S",0,6,11,0,0,0,0,0,"","Serviço","Serviço","-","SINAPI",94224,"EMBOÇAMENTO COM ARGAMASSA TRAÇO 1:2:9 (CIMENTO, CAL E AREIA). AF_07/2019","M",67.98,1,67.98,null,null,0,0,"Referência: AGETOP - 160403"]
[2,2,2,4,6,12,0,0,0,32,4,"","Nível 2","Nível 2","-",null,null,"ESQUADRIAS METÁLICAS","-",null,1,"-",null,null,0,0,""]
["S",2,"S",0,6,12,0,0,0,0,0,"","Serviço","Serviço","-","SINAPI",94562,"JANELA DE AÇO DE CORRER COM 4 FOLHAS PARA VIDRO, COM BATENTE, FERRAGENS E PINTURA ANTICORROSIVA. EXCLUSIVE VIDROS, ALIZAR E CONTRAMARCO. FORNECIMENTO E INSTALAÇÃO. AF_12/2019","M2",14.4,1,14.4,null,null,0,0,"Referência: AGETOP - 180401"]
["S",2,"S",0,6,12,0,0,0,0,0,"","Serviço","Serviço","-","SINAPI",94559,"JANELA DE AÇO TIPO BASCULANTE PARA VIDROS, COM BATENTE, FERRAGENS E PINTURA ANTICORROSIVA. EXCLUSIVE VIDROS, ACABAMENTO, ALIZAR E CONTRAMARCO. FORNECIMENTO E INSTALAÇÃO. AF_12/2019","M2",7.2,1,7.2,null,null,0,0,"Referência: AGETOP - 180404"]
["S",2,"S",0,6,12,0,0,0,{"$f":"IF(OR($C275=\"S\",$C275=0),0,MATCH(0,OFFSET($D275,1,$C275,ROW($C$530)-ROW($C275)),0))","v":0},{"$f":"IF(OR($C275=\"S\",$C275=0),0,MATCH(OFFSET($D275,0,$C275)+1,OFFSET($D275,1,$C275,ROW($C$530)-ROW($C275)),0))","v":0},"","Serviço","Serviço","-","AGETOP",180501,"PORTA DE ABRIR EM CHAPA PF-1 C/FERRAGENS","m2    ",5.04,1,5.04,null,null,0,0,""]
[2,2,2,2,6,13,0,0,0,28,2,"","Nível 2","Nível 2","-",null,null,"VIDROS","-",null,1,"-",null,null,0,0,""]
["S",2,"S",0,6,13,0,0,0,0,0,"","Serviço","Serviço","-","SINAPI",72117,"VIDRO LISO COMUM TRANSPARENTE, ESPESSURA 4MM","M2",21.6,1,21.6,null,null,0,0,"Referência: AGETOP - 190102"]
[2,2,2,5,6,14,0,0,0,26,5,"","Nível 2","Nível 2","-",null,null,"REVESTIMENTO DE PAREDE","-",null,1,"-",null,null,0,0,""]
["S",2,"S",0,6,14,0,0,0,0,0,"","Serviço","Serviço","-","SINAPI",87879,"CHAPISCO APLICADO EM ALVENARIAS E ESTRUTURAS DE CONCRETO INTERNAS, COM COLHER DE PEDREIRO.  ARGAMASSA TRAÇO 1:3 COM PREPARO EM BETONEIRA 400L. AF_06/2014","M2",388.27,1,388.27,null,null,0,0,""]
["S",2,"S",0,6,14,0,0,0,0,0,"","Serviço","Serviço","-","SINAPI",87775,"EMBOÇO OU MASSA ÚNICA EM ARGAMASSA TRAÇO 1:2:8, PREPARO MECÂNICO COM BETONEIRA 400 L, APLICADA MANUALMENTE EM PANOS DE FACHADA COM PRESENÇA DE VÃOS, ESPESSURA DE 25 MM. AF_06/2014","M2",113.79,1,113.79,null,null,0,0,""]
["S",2,"S",0,6,14,0,0,0,0,0,"","Serviço","Serviço","-","SINAPI",87792,"EMBOÇO OU MASSA ÚNICA EM ARGAMASSA TRAÇO 1:2:8, PREPARO MECÂNICO COM BETONEIRA 400 L, APLICADA MANUALMENTE EM PANOS CEGOS DE FACHADA (SEM PRESENÇA DE VÃOS), ESPESSURA DE 25 MM. AF_06/2014","M2",50.02,1,50.02,null,null,0,0,""]
["S",2,"S",0,6,14,0,0,0,0,0,"","Serviço","Serviço","-","SINAPI",87548,"MASSA ÚNICA, PARA RECEBIMENTO DE PINTURA, EM ARGAMASSA TRAÇO 1:2:8, PREPARO MANUAL, APLICADA MANUALMENTE EM FACES INTERNAS DE PAREDES, ESPESSURA DE 10MM, COM EXECUÇÃO DE TALISCAS. AF_06/2014","M2",224.46,1,224.46,null,null,0,0,""]
[2,2,2,2,6,15,0,0,0,21,2,"","Nível 2","Nível 2","-",null,null,"FORROS","-",null,1,"-",null,null,0,0,""]
["S",2,"S",0,6,15,0,0,0,0,0,"","Serviço","Serviço","-","SINAPI",87414,"APLICAÇÃO MANUAL DE GESSO DESEMPENADO (SEM TALISCAS) EM TETO DE AMBIENTES DE ÁREA MAIOR QUE 10M², ESPESSURA DE 1,0CM. AF_06/2014","M2",145.53,1,145.53,null,null,0,0,"Referência: AGETOP - 210515"]
[2,2,2,5,6,16,0,0,0,19,5,"","Nível 2","Nível 2","-","SINAPI",null,"REVESTIMENTO DE PISO","-",null,1,"-",null,null,0,0,""]
["S",2,"S",0,6,16,0,0,0,0,0,"","Serviço","Serviço","-","SINAPI",95240,"LASTRO DE CONCRETO MAGRO, APLICADO EM PISOS OU RADIERS, ESPESSURA DE 3 CM. AF_07/2016","M2",179.5,1,179.5,null,null,0,0,""]
["S",2,"S",0,6,16,0,0,0,0,0,"","Serviço","Serviço","-","SINAPI",94992,"EXECUÇÃO DE PASSEIO (CALÇADA) OU PISO DE CONCRETO COM CONCRETO MOLDADO IN LOCO, FEITO EM OBRA, ACABAMENTO CONVENCIONAL, ESPESSURA 6 CM, ARMADO. AF_07/2016","M2",45.43,1,45.43,null,null,0,0,""]
["S",2,"S",0,6,16,0,0,0,0,0,"","Serviço","Serviço","-","SINAPI",84191,"PISO EM GRANILITE, MARMORITE OU GRANITINA ESPESSURA 8 MM, INCLUSO JUNTAS DE DILATACAO PLASTICAS","M2",186.6,1,186.6,null,null,0,0,"Referência: AGETOP - 221101"]
["S",2,"S",0,6,16,0,0,0,0,0,"","Serviço","Serviço","-","AGETOP",221104,"RASPAGEM E APLICAÇÃO RESINA ACRÍLICA DUAS DEMÃOS","m2    ",186.6,1,186.6,null,null,0,0,""]
[2,2,2,2,6,17,0,0,0,14,2,"","Nível 2","Nível 2","-","SINAPI",null,"MARCENARIA","-",null,1,"-",null,null,0,0,""]
["S",2,"S",0,6,17,0,0,0,0,0,"","Serviço","Serviço","-","AGETOP",240106,"BATE CARTEIRA ENVERNIZADO E ASSENT. 2,5 X 12 CM","M     ",61.02,1,61.02,null,null,0,0,""]
[2,2,2,9,6,18,0,0,0,12,9,"","Nível 2","Nível 2","-","SINAPI",null,"PINTURA","-",null,1,"-",null,null,0,0,""]
["S",2,"S",0,6,18,0,0,0,0,0,"","Serviço","Serviço","-","AGETOP",261609,"PINTURA ESMALTE ALQUIDICO ESTR.METALICA 2 DEMAOS","m2    ",235.69,1,235.69,null,null,0,0,""]
["S",2,"S",0,6,18,0,0,0,0,0,"","Serviço","Serviço","-","SINAPI",88423,"APLICAÇÃO MANUAL DE PINTURA COM TINTA TEXTURIZADA ACRÍLICA EM PAREDES EXTERNAS DE CASAS, UMA COR. AF_06/2014","M2",50.02,1,50.02,null,null,0,0,"Referência: AGETOP - 260601"]
["S",2,"S",0,6,18,0,0,0,0,0,"","Serviço","Serviço","-","SINAPI",88489,"APLICAÇÃO MANUAL DE PINTURA COM TINTA LÁTEX ACRÍLICA EM PAREDES, DUAS DEMÃOS. AF_06/2014","M2",156.38999999999999,1,156.38999999999999,null,null,0,0,"Referência: AGETOP - 261001"]
["S",2,"S",0,6,18,0,0,0,0,0,"","Serviço","Serviço","-","SINAPI",88497,"APLICAÇÃO E LIXAMENTO DE MASSA LÁTEX EM PAREDES, DUAS DEMÃOS. AF_06/2014","M2",323.13,1,323.13,null,null,0,0,"Referência: AGETOP - 261300"]
["S",2,"S",0,6,18,0,0,0,0,0,"","Serviço","Serviço","-","AGETOP",261550,"PINT.ESMALTE SINT.PAREDES - 2 DEM.C/SELADOR","m2    ",166.74,1,166.74,null,null,0,0,""]
["S",2,"S",0,6,18,0,0,0,0,0,"","Serviço","Serviço","-","SINAPI",88496,"APLICAÇÃO E LIXAMENTO DE MASSA LÁTEX EM TETO, DUAS DEMÃOS. AF_06/2014","M2",145.53,1,145.53,null,null,0,0,"Referência: AGETOP - 261300"]
["S",2,"S",0,6,18,0,0,0,0,0,"","Serviço","Serviço","-","SINAPI",88488,"APLICAÇÃO MANUAL DE PINTURA COM TINTA LÁTEX ACRÍLICA EM TETO, DUAS DEMÃOS. AF_06/2014","M2",145.53,1,145.53,null,null,0,0,""]
["S",2,"S",0,6,18,0,0,0,0,0,"","Serviço","Serviço","-","AGETOP",261602,"PINT.ESMALTE/ESQUAD.FERRO C/FUNDO ANTICOR.","m2    ",58.32,1,58.32,null,null,0,0,""]
[2,2,2,3,6,19,0,0,0,3,{"$error":"#N/A"},"","Nível 2","Nível 2","-","SINAPI",null,"DIVERSOS","-",null,1,"-",null,null,0,0,""]
["S",2,"S",0,6,19,0,0,0,0,0,"","Serviço","Serviço","-","AGETOP",271210,"QUADRO DE GIZ EMBOÇO/PINTURA COMPLETO","m2    ",15.12,1,15.12,null,null,0,0,""]
["S",2,"S",0,6,19,0,0,0,0,0,"","Serviço","Serviço","-","AGETOP",270501,"LIMPEZA FINAL DE OBRA - (OBRAS CIVIS)","m2    ",190.26,1,190.26,null,null,0,0,""]
[{"$f":"CHOOSE(1+LOG(1+2*(ORÇAMENTO.Nivel=\"Nível 1\")+4*(ORÇAMENTO.Nivel=\"Nível 2\")+8*(ORÇAMENTO.Nivel=\"Nível 3\")+16*(ORÇAMENTO.Nivel=\"Nível 4\")+32*(ORÇAMENTO.Nivel=\"Serviço\"),2),0,1,2,3,4,\"S\")","v":1},{"$f":"IF(OR(C304=\"s\",C304=0),OFFSET(B304,-1,0),C304)","v":1},{"$f":"IF(OFFSET(C304,-1,0)=\"L\",1,IF(OFFSET(C304,-1,0)=1,2,IF(OR(A304=\"s\",A304=0),\"S\",IF(AND(OFFSET(C304,-1,0)=2,A304=4),3,IF(AND(OR(OFFSET(C304,-1,0)=\"s\",OFFSET(C304,-1,0)=0),A304<>\"s\",A304>OFFSET(B304,-1,0)),OFFSET(B304,-1,0),A304)))))","v":1},{"$f":"IF(OR(C304=\"S\",C304=0),0,IF(ISERROR(K304),J304,SMALL(J304:K304,1)))","v":36},{"$f":"IF($C304=1,OFFSET(E304,-1,0)+1,OFFSET(E304,-1,0))","v":7},{"$f":"IF($C304=1,0,IF($C304=2,OFFSET(F304,-1,0)+1,OFFSET(F304,-1,0)))","v":0},{"$f":"IF(AND($C304<=2,$C304<>0),0,IF($C304=3,OFFSET(G304,-1,0)+1,OFFSET(G304,-1,0)))","v":0},{"$f":"IF(AND($C304<=3,$C304<>0),0,IF($C304=4,OFFSET(H304,-1,0)+1,OFFSET(H304,-1,0)))","v":0},{"$f":"IF(AND($C304<=4,$C304<>0),0,IF(AND($C304=\"S\",$Y304>0),OFFSET(I304,-1,0)+1,OFFSET(I304,-1,0)))","v":0},226,36,{"$f":"IF(OR(Y304>0,$C304=1),\"F\",\"\")","v":"F"},"Nível 1",{"$f":"CHOOSE(1+LOG(1+2*(C304=1)+4*(C304=2)+8*(C304=3)+16*(C304=4)+32*(C304=\"S\"),2),\"\",\"Nível 1\",\"Nível 2\",\"Nível 3\",\"Nível 4\",\"Serviço\")","v":"Nível 1"},"7.","AGETOP",null,"PASSARELA MODELO 02 - PADRÃO SÉC. XXI 2015","UN",1,1,1,null,null,0,0,""]
[2,2,2,2,7,1,0,0,0,35,2,"","Nível 2","Nível 2","-","AGETOP",null,"SERVIÇOS PRELIMINARES","-",null,1,"-",null,null,0,0,""]
["S",2,"S",0,7,1,0,0,0,0,0,"","Serviço","Serviço","-","AGETOP",20701,"LOCAÇÃO DA OBRA, EXECUÇÃO DE GABARITO SEM REAPROVEITAMENTO, INCLUSO PINTURA (FACE INTERNA DO RIPÃO 15CM) E PIQUETE COM TESTEMUNHA","m2    ",20.16,1,20.16,null,null,0,0,""]
[2,2,2,3,7,2,0,0,0,33,3,"","Nível 2","Nível 2","-","AGETOP",null,"TRANSPORTES","-",null,1,"-",null,null,0,0,""]
["S",2,"S",0,7,2,0,0,0,0,0,"","Serviço","Serviço","-","SINAPI",72900,"TRANSPORTE DE ENTULHO COM CAMINHAO BASCULANTE 6 M3, RODOVIA PAVIMENTADA, DMT 0,5 A 1,0 KM","M3",6,1,6,null,null,0,0,""]
["S",2,"S",0,7,2,0,0,0,0,0,"","Serviço","Serviço","-","SINAPI",72897,"CARGA MANUAL DE ENTULHO EM CAMINHAO BASCULANTE 6 M3","M3",6,1,6,null,null,0,0,""]
[2,2,2,9,7,3,0,0,0,30,9,"","Nível 2","Nível 2","-","AGETOP",null,"FUNDAÇÕES E SONDAGENS","-",null,1,"-",null,null,0,0,""]
["S",2,"S",0,7,3,0,0,0,0,0,"","Serviço","Serviço","-","SINAPI",96534,"FABRICAÇÃO, MONTAGEM E DESMONTAGEM DE FÔRMA PARA BLOCO DE COROAMENTO, EM MADEIRA SERRADA, E=25 MM, 4 UTILIZAÇÕES. AF_06/2017","M2",5.28,1,5.28,null,null,0,0,"Referência: AGETOP - 51009"]
["S",2,"S",0,7,3,0,0,0,0,0,"","Serviço","Serviço","-","SINAPI",96523,"ESCAVAÇÃO MANUAL PARA BLOCO DE COROAMENTO OU SAPATA, COM PREVISÃO DE FÔRMA. AF_06/2017","M3",1.0289999999999999,1,1.0289999999999999,null,null,0,0,"Referência: AGETOP - 50901"]
["S",2,"S",0,7,3,0,0,0,0,0,"","Serviço","Serviço","-","AGETOP",50902,"APILOAMENTO (BLOCOS/SAPATAS)","m2    ",1,1,1,null,null,0,0,""]
["S",2,"S",0,7,3,0,0,0,0,0,"","Serviço","Serviço","-","SINAPI",96995,"REATERRO MANUAL APILOADO COM SOQUETE. AF_10/2017","M3",0.44899999999999995,1,0.44899999999999995,null,null,0,0,"Referência: AGETOP - 40902"]
["S",{"$f":"IF(OR(C315=\"s\",C315=0),OFFSET(B315,-1,0),C315)","v":2},{"$f":"IF(OFFSET(C315,-1,0)=\"L\",1,IF(OFFSET(C315,-1,0)=1,2,IF(OR(A315=\"s\",A315=0),\"S\",IF(AND(OFFSET(C315,-1,0)=2,A315=4),3,IF(AND(OR(OFFSET(C315,-1,0)=\"s\",OFFSET(C315,-1,0)=0),A315<>\"s\",A315>OFFSET(B315,-1,0)),OFFSET(B315,-1,0),A315)))))","v":"S"},{"$f":"IF(OR(C315=\"S\",C315=0),0,IF(ISERROR(K315),J315,SMALL(J315:K315,1)))","v":0},{"$f":"IF($C315=1,OFFSET(E315,-1,0)+1,OFFSET(E315,-1,0))","v":7},{"$f":"IF($C315=1,0,IF($C315=2,OFFSET(F315,-1,0)+1,OFFSET(F315,-1,0)))","v":3},{"$f":"IF(AND($C315<=2,$C315<>0),0,IF($C315=3,OFFSET(G315,-1,0)+1,OFFSET(G315,-1,0)))","v":0},{"$f":"IF(AND($C315<=3,$C315<>0),0,IF($C315=4,OFFSET(H315,-1,0)+1,OFFSET(H315,-1,0)))","v":0},{"$f":"IF(AND($C315<=4,$C315<>0),0,IF(AND($C315=\"S\",$Y315>0),OFFSET(I315,-1,0)+1,OFFSET(I315,-1,0)))","v":0},0,0,{"$f":"IF(OR(Y315>0,$C315=1),\"F\",\"\")","v":""},"Serviço",{"$f":"CHOOSE(1+LOG(1+2*(C315=1)+4*(C315=2)+8*(C315=3)+16*(C315=4)+32*(C315=\"S\"),2),\"\",\"Nível 1\",\"Nível 2\",\"Nível 3\",\"Nível 4\",\"Serviço\")","v":"Serviço"},"-","SINAPI",94964,"CONCRETO FCK = 20MPA, TRAÇO 1:2,7:3 (CIMENTO/ AREIA MÉDIA/ BRITA 1)  - PREPARO MECÂNICO COM BETONEIRA 400 L. AF_07/2016","M3",0.57999999999999996,1,0.57999999999999996,null,null,0,0,""]
[{"$f":"CHOOSE(1+LOG(1+2*(ORÇAMENTO.Nivel=\"Nível 1\")+4*(ORÇAMENTO.Nivel=\"Nível 2\")+8*(ORÇAMENTO.Nivel=\"Nível 3\")+16*(ORÇAMENTO.Nivel=\"Nível 4\")+32*(ORÇAMENTO.Nivel=\"Serviço\"),2),0,1,2,3,4,\"S\")","v":"S"},2,"S",0,7,3,0,0,0,0,0,"","Serviço","Serviço","-","AGETOP",51026,"LANÇAMENTO/APLICAÇÃO/ADENSAMENTO DE CONCRETO EM FUNDAÇÃO- (O.C.)","m3    ",0.57999999999999996,1,0.57999999999999996,null,null,0,0,""]
["S",2,"S",0,7,3,0,0,0,0,0,"","Serviço","Serviço","-","SINAPI",96547,"ARMAÇÃO DE BLOCO, VIGA BALDRAME OU SAPATA UTILIZANDO AÇO CA-50 DE 12,5 MM - MONTAGEM. AF_06/2017","KG",13.18181818181818,1,13.18181818181818,null,null,0,0,""]
["S",2,"S",0,7,3,0,0,0,0,0,"","Serviço","Serviço","-","SINAPI",96543,"ARMAÇÃO DE BLOCO, VIGA BALDRAME E SAPATA UTILIZANDO AÇO CA-60 DE 5 MM - MONTAGEM. AF_06/2017","KG",8.7272727272727266,1,8.7272727272727266,null,null,0,0,"Referência: AGETOP - 52014"]
[2,2,2,6,7,4,0,0,0,21,6,"","Nível 2","Nível 2","-","AGETOP",null,"ESTRUTURA","-",null,1,"-",null,null,0,0,""]
["S",2,"S",0,7,4,0,0,0,0,0,"","Serviço","Serviço","-","SINAPI",92426,"MONTAGEM E DESMONTAGEM DE FÔRMA DE PILARES RETANGULARES E ESTRUTURAS SIMILARES COM ÁREA MÉDIA DAS SEÇÕES MENOR OU IGUAL A 0,25 M², PÉ-DIREITO SIMPLES, EM CHAPA DE MADEIRA COMPENSADA RESINADA, 8 UTILIZAÇÕES. AF_12/2015","M2",1.29,1,1.29,null,null,0,0,""]
["S",2,"S",0,7,4,0,0,0,0,0,"","Serviço","Serviço","-","SINAPI",94964,"CONCRETO FCK = 20MPA, TRAÇO 1:2,7:3 (CIMENTO/ AREIA MÉDIA/ BRITA 1)  - PREPARO MECÂNICO COM BETONEIRA 400 L. AF_07/2016","M3",0.11,1,0.11,null,null,0,0,""]
["S",2,"S",0,7,4,0,0,0,0,0,"","Serviço","Serviço","-","SINAPI",92873,"LANÇAMENTO COM USO DE BALDES, ADENSAMENTO E ACABAMENTO DE CONCRETO EM ESTRUTURAS. AF_12/2015","M3",0.11,1,0.11,null,null,0,0,"Referência: AGETOP - 60801"]
["S",2,"S",0,7,4,0,0,0,0,0,"","Serviço","Serviço","-","SINAPI",92779,"ARMAÇÃO DE PILAR OU VIGA DE UMA ESTRUTURA CONVENCIONAL DE CONCRETO ARMADO EM UMA EDIFICAÇÃO TÉRREA OU SOBRADO UTILIZANDO AÇO CA-50 DE 12,5 MM - MONTAGEM. AF_12/2015","KG",2.8181818181818179,1,2.8181818181818179,null,null,0,0,""]
["S",2,"S",0,7,4,0,0,0,0,0,"","Serviço","Serviço","-","SINAPI",92775,"ARMAÇÃO DE PILAR OU VIGA DE UMA ESTRUTURA CONVENCIONAL DE CONCRETO ARMADO EM UMA EDIFICAÇÃO TÉRREA OU SOBRADO UTILIZANDO AÇO CA-60 DE 5,0 MM - MONTAGEM. AF_12/2015","KG",1.4545454545454546,1,1.4545454545454546,null,null,0,0,"Referência: AGETOP - 60314"]
[2,2,2,2,7,5,0,0,0,15,2,"","Nível 2","Nível 2","-",null,null,"IMPERMEABILIZAÇÃO","-",null,1,"-",null,null,0,0,""]
["S",2,"S",0,7,5,0,0,0,0,0,"","Serviço","Serviço","-","SINAPI",98562,"IMPERMEABILIZAÇÃO DE FLOREIRA OU VIGA BALDRAME COM ARGAMASSA DE CIMENTO E AREIA, COM ADITIVO IMPERMEABILIZANTE, E = 2 CM. AF_06/2018","M2",3.6,1,3.6,null,null,0,0,"Referência: AGETOP - 120902"]
[2,2,2,2,7,6,0,0,0,13,2,"","Nível 2","Nível 2","-",null,null,"ESTRUTURAS METÁLICAS","-",null,1,"-",null,null,0,0,""]
["S",2,"S",0,7,6,0,0,0,0,0,"","Serviço","Serviço","-","AGETOP",150103,"ESTRUTURA METÁLICA CONVENCIONAL EM AÇO DO TIPO USI SAC-300 COM FUNDO ANTICORROSIVO","Kg    ",270.56000000000006,1,270.56000000000006,null,null,0,0,""]
[2,2,2,3,7,7,0,0,0,11,3,"","Nível 2","Nível 2","-",null,null,"COBERTURAS","-",null,1,"-",null,null,0,0,""]
["S",2,"S",0,7,7,0,0,0,0,0,"","Serviço","Serviço","-","SINAPI",94213,"TELHAMENTO COM TELHA DE AÇO/ALUMÍNIO E = 0,5 MM, COM ATÉ 2 ÁGUAS, INCLUSO IÇAMENTO. AF_07/2019","M2",25.92,1,25.92,null,null,0,0,"Referência: AGETOP - 160905"]
["S",2,"S",0,7,7,0,0,0,0,0,"","Serviço","Serviço","-","SINAPI",94228,"CALHA EM CHAPA DE AÇO GALVANIZADO NÚMERO 24, DESENVOLVIMENTO DE 50 CM, INCLUSO TRANSPORTE VERTICAL. AF_07/2019","M",7.2,1,7.2,null,null,0,0,"Referência: AGETOP - 160601"]
[2,2,2,4,7,8,0,0,0,8,4,"","Nível 2","Nível 2","-",null,null,"REVESTIMENTO DE PISO","-",null,1,"-",null,null,0,0,""]
["S",2,"S",0,7,8,0,0,0,0,0,"","Serviço","Serviço","-","SINAPI",95241,"LASTRO DE CONCRETO MAGRO, APLICADO EM PISOS OU RADIERS, ESPESSURA DE 5 CM. AF_07/2016","M2",20.16,1,20.16,null,null,0,0,""]
["S",2,"S",0,7,8,0,0,0,0,0,"","Serviço","Serviço","-","SINAPI",84191,"PISO EM GRANILITE, MARMORITE OU GRANITINA ESPESSURA 8 MM, INCLUSO JUNTAS DE DILATACAO PLASTICAS","M2",20.16,1,20.16,null,null,0,0,"Referência: AGETOP - 221101"]
["S",2,"S",0,7,8,0,0,0,0,0,"","Serviço","Serviço","-","AGETOP",221104,"RASPAGEM E APLICAÇÃO RESINA ACRÍLICA DUAS DEMÃOS","m2    ",20.72,1,20.72,null,null,0,0,""]
[2,2,2,2,7,9,0,0,0,4,2,"","Nível 2","Nível 2","-",null,null,"PINTURA","-",null,1,"-",null,null,0,0,""]
["S",2,"S",0,7,9,0,0,0,0,0,"","Serviço","Serviço","-","AGETOP",261602,"PINT.ESMALTE/ESQUAD.FERRO C/FUNDO ANTICOR.","m2    ",51.84,1,51.84,null,null,0,0,""]
[2,2,2,2,7,10,0,0,0,2,{"$error":"#N/A"},"","Nível 2","Nível 2","-","SINAPI",null,"DIVERSOS","-",null,1,"-",null,null,0,0,""]
["S",2,"S",0,7,10,0,0,0,{"$f":"IF(OR($C339=\"S\",$C339=0),0,MATCH(0,OFFSET($D339,1,$C339,ROW($C$530)-ROW($C339)),0))","v":0},{"$f":"IF(OR($C339=\"S\",$C339=0),0,MATCH(OFFSET($D339,0,$C339)+1,OFFSET($D339,1,$C339,ROW($C$530)-ROW($C339)),0))","v":0},"","Serviço","Serviço","-","AGETOP",270501,"LIMPEZA FINAL DE OBRA - (OBRAS CIVIS)","m2    ",20.16,1,20.16,null,null,0,0,""]
[1,1,1,5,8,0,0,0,0,190,5,"F","Nível 1","Nível 1","8.","SINAPI",null,"ADMINISTRAÇÃO LOCAL","UN",1,1,1,null,null,0,0,""]
[2,2,2,4,8,1,0,0,0,4,14,"","Nível 2","Nível 2","-","SINAPI",null,"ADMINISTRAÇÃO","-",null,1,"-",null,null,0,0,""]
[3,3,3,3,8,1,1,0,0,3,40,"","Nível 3","Nível 3","-",null,null,"MENSALISTAS","-",null,1,"-",null,null,0,0,""]
["S",3,"S",0,8,1,1,0,0,0,0,"","Serviço","Serviço","-","AGETOP",250101,"ENGENHEIRO - (OBRAS CIVIS)","H     ",90,1,90,null,null,0,0,""]
["S",3,"S",0,8,1,1,0,0,0,0,"","Serviço","Serviço","-","AGETOP",250103,"ENCARREGADO - (OBRAS CIVIS)","H     ",880,1,880,null,null,0,0,""]
[1,1,1,5,9,0,0,0,0,185,5,"F","Nível 1","Nível 1","9.","SINAPI",null,"OBRAS","UN",1,1,1,null,null,0,0,""]
[2,2,2,4,9,1,0,0,0,4,9,"","Nível 2","Nível 2","-","SINAPI",null,"DIVERSOS","-",null,1,"-",null,null,0,0,""]
["S",2,"S",0,9,1,0,0,0,0,0,"","Serviço","Serviço","-","AGETOP",270501,"LIMPEZA FINAL DE OBRA - (OBRAS CIVIS)","m2    ",600,1,600,null,null,0,0,""]
["S",2,"S",0,9,1,0,0,0,0,0,"","Serviço","Serviço","-","AGETOP",270804,"PLACA DE INAUGURAÇÃO AÇO ESCOVADO 60 X 120 CM","un    ",1,1,1,null,null,0,0,""]
["S",2,"S",0,9,1,0,0,0,0,0,"","Serviço","Serviço","-","AGETOP",21301,"PLACA DE OBRA PLOTADA EM CHAPA METÁLICA 26 , AFIXADA EM CAVALETES DE MADEIRA DE LEI (VIGOTAS 6X12CM) - PADRÃO GOINFRA","m2    ",7.5,1,7.5,null,null,0,0,""]
[1,1,1,38,10,0,0,0,0,180,38,"F","Nível 1","Nível 1","10.","AGETOP",null,"PROJETO ELÉTRICO","UN",1,1,1,null,null,0,0,""]
[2,2,2,4,10,1,0,0,0,37,4,"","Nível 2","Nível 2","-","AGETOP",null,"SERVIÇOS PRELIMINARES","-",null,1,"-",null,null,0,0,""]
["S",2,"S",0,10,1,0,0,0,0,0,"","Serviço","Serviço","-","SINAPI",97661,"REMOÇÃO DE CABOS ELÉTRICOS, DE FORMA MANUAL, SEM REAPROVEITAMENTO. AF_12/2017","M",100,1,100,null,null,0,0,""]
["S",2,"S",0,10,1,0,0,0,0,0,"","Serviço","Serviço","-","SINAPI",97660,"REMOÇÃO DE INTERRUPTORES/TOMADAS ELÉTRICAS, DE FORMA MANUAL, SEM REAPROVEITAMENTO. AF_12/2017","UN",41,1,41,null,null,0,0,""]
["S",2,"S",0,10,1,0,0,0,0,0,"","Serviço","Serviço","-","SINAPI",97665,"REMOÇÃO DE LUMINÁRIAS, DE FORMA MANUAL, SEM REAPROVEITAMENTO. AF_12/2017","UN",33,1,33,null,null,0,0,""]
[2,2,2,33,10,2,0,0,0,33,65,"","Nível 2","Nível 2","-",null,null,"INSTALAÇÕES ELÉTRICAS","-",null,1,"-",null,null,0,0,""]
[{"$f":"CHOOSE(1+LOG(1+2*(ORÇAMENTO.Nivel=\"Nível 1\")+4*(ORÇAMENTO.Nivel=\"Nível 2\")+8*(ORÇAMENTO.Nivel=\"Nível 3\")+16*(ORÇAMENTO.Nivel=\"Nível 4\")+32*(ORÇAMENTO.Nivel=\"Serviço\"),2),0,1,2,3,4,\"S\")","v":3},{"$f":"IF(OR(C356=\"s\",C356=0),OFFSET(B356,-1,0),C356)","v":3},{"$f":"IF(OFFSET(C356,-1,0)=\"L\",1,IF(OFFSET(C356,-1,0)=1,2,IF(OR(A356=\"s\",A356=0),\"S\",IF(AND(OFFSET(C356,-1,0)=2,A356=4),3,IF(AND(OR(OFFSET(C356,-1,0)=\"s\",OFFSET(C356,-1,0)=0),A356<>\"s\",A356>OFFSET(B356,-1,0)),OFFSET(B356,-1,0),A356)))))","v":3},{"$f":"IF(OR(C356=\"S\",C356=0),0,IF(ISERROR(K356),J356,SMALL(J356:K356,1)))","v":26},{"$f":"IF($C356=1,OFFSET(E356,-1,0)+1,OFFSET(E356,-1,0))","v":10},{"$f":"IF($C356=1,0,IF($C356=2,OFFSET(F356,-1,0)+1,OFFSET(F356,-1,0)))","v":2},{"$f":"IF(AND($C356<=2,$C356<>0),0,IF($C356=3,OFFSET(G356,-1,0)+1,OFFSET(G356,-1,0)))","v":1},{"$f":"IF(AND($C356<=3,$C356<>0),0,IF($C356=4,OFFSET(H356,-1,0)+1,OFFSET(H356,-1,0)))","v":0},{"$f":"IF(AND($C356<=4,$C356<>0),0,IF(AND($C356=\"S\",$Y356>0),OFFSET(I356,-1,0)+1,OFFSET(I356,-1,0)))","v":0},32,26,{"$f":"IF(OR(Y356>0,$C356=1),\"F\",\"\")","v":""},"Nível 3",{"$f":"CHOOSE(1+LOG(1+2*(C356=1)+4*(C356=2)+8*(C356=3)+16*(C356=4)+32*(C356=\"S\"),2),\"\",\"Nível 1\",\"Nível 2\",\"Nível 3\",\"Nível 4\",\"Serviço\")","v":"Nível 3"},"-","SINAPI",null,"GERAL","-",null,1,"-",null,null,0,0,""]
["S",3,"S",0,10,2,1,0,0,0,0,"","Serviço","Serviço","-","AGETOP",70351,"BRACADEIRA METALICA TIPO \"U\" DIAM. 3/4\"","Un    ",93,1,93,null,null,0,0,""]
["S",3,"S",0,10,2,1,0,0,0,0,"","Serviço","Serviço","-","AGETOP",70421,"BUCHA E ARRUELA METALICA DIAM. 3/4\"","PR    ",2,1,2,null,null,0,0,""]
["S",3,"S",0,10,2,1,0,0,0,0,"","Serviço","Serviço","-","SINAPI",91927,"CABO DE COBRE FLEXÍVEL ISOLADO, 2,5 MM², ANTI-CHAMA 0,6/1,0 KV, PARA CIRCUITOS TERMINAIS - FORNECIMENTO E INSTALAÇÃO. AF_12/2015","M",400,1,400,null,null,0,0,"Referência: AGETOP - 70581"]
["S",3,"S",0,10,2,1,0,0,0,0,"","Serviço","Serviço","-","SINAPI",92865,"CAIXA OCTOGONAL 4\" X 4\", METÁLICA, INSTALADA EM LAJE - FORNECIMENTO E INSTALAÇÃO. AF_12/2015","UN",10,1,10,null,null,0,0,"Referência: AGETOP - 70682"]
["S",3,"S",0,10,2,1,0,0,0,0,"","Serviço","Serviço","-","SINAPI",92868,"CAIXA RETANGULAR 4\" X 2\" MÉDIA (1,30 M DO PISO), METÁLICA, INSTALADA EM PAREDE - FORNECIMENTO E INSTALAÇÃO. AF_12/2015","UN",6,1,6,null,null,0,0,"Referência: AGETOP - 70691"]
["S",3,"S",0,10,2,1,0,0,0,0,"","Serviço","Serviço","-","SINAPI",95801,"CONDULETE DE ALUMÍNIO, TIPO X, PARA ELETRODUTO DE AÇO GALVANIZADO DN 20 MM (3/4''), APARENTE - FORNECIMENTO E INSTALAÇÃO. AF_11/2016_P","UN",9,1,9,null,null,0,0,"Referência: AGETOP - 70929"]
["S",3,"S",0,10,2,1,0,0,0,0,"","Serviço","Serviço","-","AGETOP",70930,"CONDULETE METÁLICO - ADAPTADOR DE SAÍDA 3/4\" ","un    ",5,1,5,null,null,0,0,""]
["S",3,"S",0,10,2,1,0,0,0,0,"","Serviço","Serviço","-","SINAPI",93655,"DISJUNTOR MONOPOLAR TIPO DIN, CORRENTE NOMINAL DE 20A - FORNECIMENTO E INSTALAÇÃO. AF_04/2016","UN",1,1,1,null,null,0,0,""]
["S",3,"S",0,10,2,1,0,0,0,0,"","Serviço","Serviço","-","SINAPI",91871,"ELETRODUTO RÍGIDO ROSCÁVEL, PVC, DN 25 MM (3/4\"), PARA CIRCUITOS TERMINAIS, INSTALADO EM PAREDE - FORNECIMENTO E INSTALAÇÃO. AF_12/2015","M",60,1,60,null,null,0,0,"Referência: AGETOP - 71201"]
["S",3,"S",0,10,2,1,0,0,0,0,"","Serviço","Serviço","-","AGETOP",71321,"FITA DE AUTO FUSAO, ROLO E 10,00 MM","Un    ",6,1,6,null,null,0,0,""]
["S",3,"S",0,10,2,1,0,0,0,0,"","Serviço","Serviço","-","AGETOP",71331,"FITA ISOLANTE, ROLO DE 20,00 M","Un    ",4,1,4,null,null,0,0,""]
["S",3,"S",0,10,2,1,0,0,0,0,"","Serviço","Serviço","-","SINAPI",91953,"INTERRUPTOR SIMPLES (1 MÓDULO), 10A/250V, INCLUINDO SUPORTE E PLACA - FORNECIMENTO E INSTALAÇÃO. AF_12/2015","UN",10,1,10,null,null,0,0,"Referência: AGETOP - 71440"]
["S",3,"S",0,10,2,1,0,0,0,0,"","Serviço","Serviço","-","SINAPI",91959,"INTERRUPTOR SIMPLES (2 MÓDULOS), 10A/250V, INCLUINDO SUPORTE E PLACA - FORNECIMENTO E INSTALAÇÃO. AF_12/2015","UN",8,1,8,null,null,0,0,"Referência: AGETOP - 71441"]
["S",3,"S",0,10,2,1,0,0,0,0,"","Serviço","Serviço","-","SINAPI",97611,"LÂMPADA COMPACTA FLUORESCENTE DE 15 W, BASE E27 - FORNECIMENTO E INSTALAÇÃO. AF_02/2020","UN",3,1,3,null,null,0,0,"Referência: AGETOP - 71567"]
["S",3,"S",0,10,2,1,0,0,0,0,"","Serviço","Serviço","-","SINAPI",92029,"INTERRUPTOR PARALELO (1 MÓDULO) COM 1 TOMADA DE EMBUTIR 2P+T 10 A,  INCLUINDO SUPORTE E PLACA - FORNECIMENTO E INSTALAÇÃO. AF_12/2015","UN",2,1,2,null,null,0,0,""]
["S",3,"S",0,10,2,1,0,0,0,0,"","Serviço","Serviço","-","COMPOSIÇÃO","COMP 387_SEE","LÂMPADA LED TUBULAR 18W ","UN ",56,1,56,null,null,0,0,""]
[{"$f":"CHOOSE(1+LOG(1+2*(ORÇAMENTO.Nivel=\"Nível 1\")+4*(ORÇAMENTO.Nivel=\"Nível 2\")+8*(ORÇAMENTO.Nivel=\"Nível 3\")+16*(ORÇAMENTO.Nivel=\"Nível 4\")+32*(ORÇAMENTO.Nivel=\"Serviço\"),2),0,1,2,3,4,\"S\")","v":"S"},{"$f":"IF(OR(C373=\"s\",C373=0),OFFSET(B373,-1,0),C373)","v":3},{"$f":"IF(OFFSET(C373,-1,0)=\"L\",1,IF(OFFSET(C373,-1,0)=1,2,IF(OR(A373=\"s\",A373=0),\"S\",IF(AND(OFFSET(C373,-1,0)=2,A373=4),3,IF(AND(OR(OFFSET(C373,-1,0)=\"s\",OFFSET(C373,-1,0)=0),A373<>\"s\",A373>OFFSET(B373,-1,0)),OFFSET(B373,-1,0),A373)))))","v":"S"},{"$f":"IF(OR(C373=\"S\",C373=0),0,IF(ISERROR(K373),J373,SMALL(J373:K373,1)))","v":0},{"$f":"IF($C373=1,OFFSET(E373,-1,0)+1,OFFSET(E373,-1,0))","v":10},{"$f":"IF($C373=1,0,IF($C373=2,OFFSET(F373,-1,0)+1,OFFSET(F373,-1,0)))","v":2},{"$f":"IF(AND($C373<=2,$C373<>0),0,IF($C373=3,OFFSET(G373,-1,0)+1,OFFSET(G373,-1,0)))","v":1},{"$f":"IF(AND($C373<=3,$C373<>0),0,IF($C373=4,OFFSET(H373,-1,0)+1,OFFSET(H373,-1,0)))","v":0},{"$f":"IF(AND($C373<=4,$C373<>0),0,IF(AND($C373=\"S\",$Y373>0),OFFSET(I373,-1,0)+1,OFFSET(I373,-1,0)))","v":0},0,0,{"$f":"IF(OR(Y373>0,$C373=1),\"F\",\"\")","v":""},"Serviço",{"$f":"CHOOSE(1+LOG(1+2*(C373=1)+4*(C373=2)+8*(C373=3)+16*(C373=4)+32*(C373=\"S\"),2),\"\",\"Nível 1\",\"Nível 2\",\"Nível 3\",\"Nível 4\",\"Serviço\")","v":"Serviço"},"-","SINAPI",97586,"LUMINÁRIA TIPO CALHA, DE SOBREPOR, COM 2 LÂMPADAS TUBULARES FLUORESCENTES DE 36 W, COM REATOR DE PARTIDA RÁPIDA - FORNECIMENTO E INSTALAÇÃO. AF_02/2020","UN",12,1,12,null,null,0,0,""]
["S",3,"S",0,10,2,1,0,0,0,0,"","Serviço","Serviço","-","SINAPI",97593,"LUMINÁRIA TIPO SPOT, DE SOBREPOR, COM 1 LÂMPADA FLUORESCENTE DE 15 W, SEM REATOR - FORNECIMENTO E INSTALAÇÃO. AF_02/2020","UN",2,1,2,null,null,0,0,"Referência: AGETOP - 71688"]
["S",3,"S",0,10,2,1,0,0,0,0,"","Serviço","Serviço","-","SINAPI",95757,"LUVA DE EMENDA PARA ELETRODUTO, AÇO GALVANIZADO, DN 20 MM (3/4''), APARENTE, INSTALADA EM PAREDE - FORNECIMENTO E INSTALAÇÃO. AF_11/2016_P","UN",50,1,50,null,null,0,0,"Referência: AGETOP - 71701"]
["S",3,"S",0,10,2,1,0,0,0,0,"","Serviço","Serviço","-","COMPOSIÇÃO","COMP 375_SEE","REFLETOR DE LED HOLOFORTE 50W","UN ",4,1,4,null,null,0,0,""]
["S",3,"S",0,10,2,1,0,0,0,0,"","Serviço","Serviço","-","AGETOP",72395,"TAMPA CEGA PARA CONDULETE METÁLICO","Un    ",5,1,5,null,null,0,0,""]
["S",3,"S",0,10,2,1,0,0,0,0,"","Serviço","Serviço","-","AGETOP",72425,"TAMPA CEGA PLASTICA RETANGULAR 4\"X2\"","Un    ",48,1,48,null,null,0,0,""]
["S",3,"S",0,10,2,1,0,0,0,0,"","Serviço","Serviço","-","SINAPI",91996,"TOMADA MÉDIA DE EMBUTIR (1 MÓDULO), 2P+T 10 A, INCLUINDO SUPORTE E PLACA - FORNECIMENTO E INSTALAÇÃO. AF_12/2015","UN",6,1,6,null,null,0,0,"Referência: AGETOP - 72578"]
["S",3,"S",0,10,2,1,0,0,0,0,"","Serviço","Serviço","-","SINAPI",92000,"TOMADA BAIXA DE EMBUTIR (1 MÓDULO), 2P+T 10 A, INCLUINDO SUPORTE E PLACA - FORNECIMENTO E INSTALAÇÃO. AF_12/2015","UN",18,1,18,null,null,0,0,"Referência: AGETOP - 72578"]
["S",3,"S",0,10,2,1,0,0,0,0,"","Serviço","Serviço","-","SINAPI",91993,"TOMADA ALTA DE EMBUTIR (1 MÓDULO), 2P+T 20 A, INCLUINDO SUPORTE E PLACA - FORNECIMENTO E INSTALAÇÃO. AF_12/2015","UN",3,1,3,null,null,0,0,"Referência: AGETOP - 72585"]
[3,3,3,6,10,2,2,0,0,6,85,"","Nível 3","Nível 3","-",null,null,"ALIMENTAÇÃO BLOCO 3 SALAS PADRAO SEDUC","-",null,1,"-",null,null,0,0,""]
["S",3,"S",0,10,2,2,0,0,0,0,"","Serviço","Serviço","-","AGETOP",70583,"CABO PVC (70ºC) 1 KV No. 6 MM2","M     ",240,1,240,null,null,0,0,""]
["S",3,"S",0,10,2,2,0,0,0,0,"","Serviço","Serviço","-","AGETOP",71202,"ELETRODUTO DE PVC RIGIDO DIAMETRO 1\"","M     ",48,1,48,null,null,0,0,""]
["S",3,"S",0,10,2,2,0,0,0,0,"","Serviço","Serviço","-","AGETOP",71742,"LUVA PVC ROSQUEAVEL DIAMETRO 1\"","Un    ",16,1,16,null,null,0,0,""]
["S",3,"S",0,10,2,2,0,0,0,0,"","Serviço","Serviço","-","AGETOP",70646,"CAIXA DE PASSAGEM METÁLICA DE EMBUTIR 20X20X10 CM","Un    ",3,1,3,null,null,0,0,""]
["S",3,"S",0,10,2,2,0,0,0,0,"","Serviço","Serviço","-","AGETOP",71173,"DISJUNTOR TRIPOLAR DE 10 A 35-A","Un    ",1,1,1,null,null,0,0,""]
[1,1,1,40,11,0,0,0,0,142,40,"F","Nível 1","Nível 1","11.","AGETOP",null,"PROJETO DE GÁS","UN",1,1,1,null,null,0,0,""]
[2,2,2,29,11,1,0,0,0,39,29,"","Nível 2","Nível 2","-","SINAPI",null,"INSTALAÇÕES ESPECIAIS","-",null,1,"-",null,null,0,0,""]
["S",2,"S",0,11,1,0,0,0,0,0,"","Serviço","Serviço","-","AGETOP",91007,"CENTRAL DE GÁS PADRÃO GOINFRA SEM INSTALAÇÕES (1+1 CILINDRO 45 KG)","Un    ",1,1,1,null,null,0,0,""]
["S",2,"S",0,11,1,0,0,0,0,0,"","Serviço","Serviço","-","AGETOP",91023,"UNIÃO S/BRONZE PRETA 3/4\" NPT 300 LBS","Un    ",3,1,3,null,null,0,0,""]
["S",2,"S",0,11,1,0,0,0,0,0,"","Serviço","Serviço","-","COMPOSIÇÃO","COMP 382_SEE","TE DE REDUCAO DE FERRO GALVANIZADO, COM ROSCA BSP, DE 3/4\" X 1/2\"","UN ",1,1,1,null,null,0,0,""]
["S",2,"S",0,11,1,0,0,0,0,0,"","Serviço","Serviço","-","COMPOSIÇÃO","COMP 383_SEE","BUCHA DE REDUCAO DE FERRO GALVANIZADO, COM ROSCA BSP, DE 1/2\" X 1/4\"","UN ",3,1,3,null,null,0,0,""]
["S",2,"S",0,11,1,0,0,0,0,0,"","Serviço","Serviço","-","AGETOP",91021,"LUVA GALVANIZADO DE REDUÇÃO 3/4\" X 1/2\" (GÁS)","Un    ",2,1,2,null,null,0,0,""]
["S",2,"S",0,11,1,0,0,0,0,0,"","Serviço","Serviço","-","SINAPI",92692,"NIPLE, EM FERRO GALVANIZADO, CONEXÃO ROSQUEADA, DN 15 (1/2\"), INSTALADO EM RAMAIS E SUB-RAMAIS DE GÁS - FORNECIMENTO E INSTALAÇÃO. AF_12/2015","UN",6,1,6,null,null,0,0,""]
["S",2,"S",0,11,1,0,0,0,0,0,"","Serviço","Serviço","-","AGETOP",91031,"NIPLE DUPLO 300 PSI 3/4\"","Un    ",6,1,6,null,null,0,0,""]
["S",2,"S",0,11,1,0,0,0,0,0,"","Serviço","Serviço","-","COMPOSIÇÃO","COMP 212_SEE","NIPLE DE REDUÇÃO 1/2\" X 1/4\" BSP","UN ",4,1,4,null,null,0,0,""]
["S",2,"S",0,11,1,0,0,0,0,0,"","Serviço","Serviço","-","COMPOSIÇÃO","COMP 213_SEE","NIPLE DE REDUÇÃO 3/4\" X 1/2\" BSP","UN ",4,1,4,null,null,0,0,""]
["S",2,"S",0,11,1,0,0,0,0,0,"","Serviço","Serviço","-","SINAPI",92688,"TUBO DE AÇO GALVANIZADO COM COSTURA, CLASSE MÉDIA, CONEXÃO ROSQUEADA, DN 20 (3/4\"), INSTALADO EM RAMAIS E SUB-RAMAIS DE GÁS - FORNECIMENTO E INSTALAÇÃO. AF_12/2015","M",18,1,18,null,null,0,0,""]
["S",2,"S",0,11,1,0,0,0,0,0,"","Serviço","Serviço","-","SINAPI",92701,"JOELHO 90 GRAUS, EM FERRO GALVANIZADO, CONEXÃO ROSQUEADA, DN 20 (3/4\"), INSTALADO EM RAMAIS E SUB-RAMAIS DE GÁS - FORNECIMENTO E INSTALAÇÃO. AF_12/2015","UN",5,1,5,null,null,0,0,""]
["S",2,"S",0,11,1,0,0,0,0,0,"","Serviço","Serviço","-","COMPOSIÇÃO","COMP 237_SEE","FITA ANTICORROSIVA","M",3,1,3,null,null,0,0,""]
["S",2,"S",0,11,1,0,0,0,0,0,"","Serviço","Serviço","-","AGETOP",91025,"VÁLVULA ESFERICA LATÃO 3/4\"","Un    ",3,1,3,null,null,0,0,""]
["S",2,"S",0,11,1,0,0,0,0,0,"","Serviço","Serviço","-","AGETOP",91019,"TE PRETO 90º 3/4\" NPT 300 LBS","Un    ",1,1,1,null,null,0,0,""]
["S",2,"S",0,11,1,0,0,0,0,0,"","Serviço","Serviço","-","COMPOSIÇÃO","COMP 542_SEE","VÁLVULA UGV 3/4\" (S) LATÃO","UN ",2,1,2,null,null,0,0,""]
["S",2,"S",0,11,1,0,0,0,0,0,"","Serviço","Serviço","-","COMPOSIÇÃO","COMP 543_SEE","VÁLVULA UGV 1/2\" (S) LATÃO","UN ",2,1,2,null,null,0,0,""]
["S",2,"S",0,11,1,0,0,0,{"$f":"IF(OR($C406=\"S\",$C406=0),0,MATCH(0,OFFSET($D406,1,$C406,ROW($C$530)-ROW($C406)),0))","v":0},{"$f":"IF(OR($C406=\"S\",$C406=0),0,MATCH(OFFSET($D406,0,$C406)+1,OFFSET($D406,1,$C406,ROW($C$530)-ROW($C406)),0))","v":0},"","Serviço","Serviço","-","AGETOP",91029,"VALVULA DE RETENÇÃO LATÃO 1/2\" X 7/16\" NPT","Un    ",2,1,2,null,null,0,0,""]
["S",2,"S",0,11,1,0,0,0,0,0,"","Serviço","Serviço","-","COMPOSIÇÃO","COMP 211_SEE","REGULADOR DE 2º ESTÁGIO 5KG/H","UN ",2,1,2,null,null,0,0,""]
["S",2,"S",0,11,1,0,0,0,0,0,"","Serviço","Serviço","-","COMPOSIÇÃO","COMP 210_SEE","REGULADOR DE 1º ESTÁGIO 60KG/H MODELO AP-40  COM MANÔMETRO","UN ",1,1,1,null,null,0,0,""]
["S",2,"S",0,11,1,0,0,0,0,0,"","Serviço","Serviço","-","AGETOP",85003,"EXTINTOR PO QUIMICO SECO (6 KG) - CAPACIDADE EXTINTORA 20 BC","Un    ",1,1,1,null,null,0,0,""]
["S",2,"S",0,11,1,0,0,0,0,0,"","Serviço","Serviço","-","COMPOSIÇÃO","COMP 235_SEE","PLACA DE SINALIZAÇÃO EM PVC COD 01 - (300X300) PROIBIDO FUMAR","UN ",2,1,2,null,null,0,0,""]
["S",2,"S",0,11,1,0,0,0,0,0,"","Serviço","Serviço","-","COMPOSIÇÃO","COMP 236_SEE","PLACA DE SINALIZAÇÃO EM PVC COD 06 - (300X300) PERIGO INFLAMÁVEL","UN ",2,1,2,null,null,0,0,""]
["S",2,"S",0,11,1,0,0,0,0,0,"","Serviço","Serviço","-","AGETOP",91043,"BRAÇADEIRA METALICA TIPO \"D\" DIAM. 3/4\"","Un    ",8,1,8,null,null,0,0,""]
["S",2,"S",0,11,1,0,0,0,0,0,"","Serviço","Serviço","-","AGETOP",71863,"PARAFUSO P/BUCHA S-10","Un    ",16,1,16,null,null,0,0,""]
["S",2,"S",0,11,1,0,0,0,0,0,"","Serviço","Serviço","-","AGETOP",70393,"BUCHA DE NYLON S-10","Un    ",16,1,16,null,null,0,0,""]
["S",2,"S",0,11,1,0,0,0,0,0,"","Serviço","Serviço","-","AGETOP",91045,"SUPORTE PARA COLETOR","Un    ",2,1,2,null,null,0,0,""]
["S",2,"S",0,11,1,0,0,0,0,0,"","Serviço","Serviço","-","COMPOSIÇÃO","COMP 045_SEE","LAUDO DE ESTANQUEIDADE","UN ",1,1,1,null,null,0,0,""]
["S",2,"S",0,11,1,0,0,0,0,0,"","Serviço","Serviço","-","COMPOSIÇÃO","COMP 277_SEE","MARCAÇÃO NO PISO - 1X1 M PARA EXTINTOR","M2",1,1,1,null,null,0,0,""]
[2,2,2,2,11,2,0,0,0,10,2,"","Nível 2","Nível 2","-","SINAPI",null,"SERVIÇOS PRELIMINARES","-",null,1,"-",null,null,0,0,""]
["S",2,"S",0,11,2,0,0,0,0,0,"","Serviço","Serviço","-","AGETOP",20121,"DEM. MANUAL EM CONCR.SIMPLES C/TR.ATE CB.E CARGA (O.C.)","m3    ",6.0000000000000001E-3,1,6.0000000000000001E-3,null,null,0,0,""]
[2,2,2,3,11,3,0,0,0,8,3,"","Nível 2","Nível 2","-","AGETOP",null,"TRANSPORTES","-",null,1,"-",null,null,0,0,""]
[{"$f":"CHOOSE(1+LOG(1+2*(ORÇAMENTO.Nivel=\"Nível 1\")+4*(ORÇAMENTO.Nivel=\"Nível 2\")+8*(ORÇAMENTO.Nivel=\"Nível 3\")+16*(ORÇAMENTO.Nivel=\"Nível 4\")+32*(ORÇAMENTO.Nivel=\"Serviço\"),2),0,1,2,3,4,\"S\")","v":"S"},2,"S",0,11,3,0,0,0,0,0,"","Serviço","Serviço","-","SINAPI",72900,"TRANSPORTE DE ENTULHO COM CAMINHAO BASCULANTE 6 M3, RODOVIA PAVIMENTADA, DMT 0,5 A 1,0 KM","M3",6.0000000000000001E-3,1,6.0000000000000001E-3,null,null,0,0,""]
[{"$f":"CHOOSE(1+LOG(1+2*(ORÇAMENTO.Nivel=\"Nível 1\")+4*(ORÇAMENTO.Nivel=\"Nível 2\")+8*(ORÇAMENTO.Nivel=\"Nível 3\")+16*(ORÇAMENTO.Nivel=\"Nível 4\")+32*(ORÇAMENTO.Nivel=\"Serviço\"),2),0,1,2,3,4,\"S\")","v":"S"},2,"S",0,11,3,0,0,0,0,0,"","Serviço","Serviço","-","SINAPI",72897,"CARGA MANUAL DE ENTULHO EM CAMINHAO BASCULANTE 6 M3","M3",6.0000000000000001E-3,1,6.0000000000000001E-3,null,null,0,0,""]
[{"$f":"CHOOSE(1+LOG(1+2*(ORÇAMENTO.Nivel=\"Nível 1\")+4*(ORÇAMENTO.Nivel=\"Nível 2\")+8*(ORÇAMENTO.Nivel=\"Nível 3\")+16*(ORÇAMENTO.Nivel=\"Nível 4\")+32*(ORÇAMENTO.Nivel=\"Serviço\"),2),0,1,2,3,4,\"S\")","v":2},2,2,3,11,4,0,0,0,5,3,"","Nível 2","Nível 2","-","SINAPI",null,"SERVIÇO EM TERRA","-",null,1,"-",null,null,0,0,""]
["S",2,"S",0,11,4,0,0,0,0,0,"","Serviço","Serviço","-","SINAPI",93358,"ESCAVAÇÃO MANUAL DE VALA COM PROFUNDIDADE MENOR OU IGUAL A 1,30 M. AF_03/2016","M3",0.12320000000000003,1,0.12320000000000003,null,null,0,0,"Referência: AGETOP - 40101"]
["S",2,"S",0,11,4,0,0,0,0,0,"","Serviço","Serviço","-","SINAPI",96995,"REATERRO MANUAL APILOADO COM SOQUETE. AF_10/2017","M3",0.12320000000000003,1,0.12320000000000003,null,null,0,0,"Referência: AGETOP - 40902"]
[2,2,2,2,11,5,0,0,0,2,{"$error":"#N/A"},"","Nível 2","Nível 2","-","SINAPI",null,"REVESTIMENTO DE PISO","-",null,1,"-",null,null,0,0,""]
["S",2,"S",0,11,5,0,0,0,0,0,"","Serviço","Serviço","-","AGETOP",220102,"PISO CONCRETO DESEMPENADO ESPESSURA = 5 CM  1:2,5:3,5","m2    ",0.12,1,0.12,null,null,0,0,""]
[1,1,1,7,12,0,0,0,0,102,7,"F","Nível 1","Nível 1","12.","AGETOP",null,"PROJETO DE PREVENÇÃO E COMBATE A INCÊNDIO","UN",1,1,1,null,null,0,0,""]
[2,2,2,6,12,1,0,0,0,6,72,"","Nível 2","Nível 2","-","AGETOP",null,"INSTALAÇÕES ESPECIAIS","-",null,1,"-",null,null,0,0,""]
["S",2,"S",0,12,1,0,0,0,0,0,"","Serviço","Serviço","-","AGETOP",85006,"EXTINTOR MULTI USO EM PO A B C (6 KG) - CAPACIDADE EXTINTORA 3A 20BC","un    ",4,1,4,null,null,0,0,""]
["S",2,"S",0,12,1,0,0,0,0,0,"","Serviço","Serviço","-","SINAPI",97599,"LUMINÁRIA DE EMERGÊNCIA, COM 30 LÂMPADAS LED DE 2 W, SEM REATOR - FORNECIMENTO E INSTALAÇÃO. AF_02/2020","UN",11,1,11,null,null,0,0,""]
["S",2,"S",0,12,1,0,0,0,0,0,"","Serviço","Serviço","-","COMPOSIÇÃO","COMP 024_SEE","SINALIZADOR FOTOLUMINESCENTE PARA EXTINTOR","UN ",4,1,4,null,null,0,0,""]
["S",2,"S",0,12,1,0,0,0,0,0,"","Serviço","Serviço","-","COMPOSIÇÃO","COMP 025_SEE","SINALIZADOR FOTOLUMINESCENTE DE EMERGÊNCIA","UN ",7,1,7,null,null,0,0,""]
["S",2,"S",0,12,1,0,0,0,0,0,"","Serviço","Serviço","-","COMPOSIÇÃO","COMP 277_SEE","MARCAÇÃO NO PISO - 1X1 M PARA EXTINTOR","M2",4,1,4,null,null,0,0,""]
[1,{"$f":"IF(OR(C435=\"s\",C435=0),OFFSET(B435,-1,0),C435)","v":1},{"$f":"IF(OFFSET(C435,-1,0)=\"L\",1,IF(OFFSET(C435,-1,0)=1,2,IF(OR(A435=\"s\",A435=0),\"S\",IF(AND(OFFSET(C435,-1,0)=2,A435=4),3,IF(AND(OR(OFFSET(C435,-1,0)=\"s\",OFFSET(C435,-1,0)=0),A435<>\"s\",A435>OFFSET(B435,-1,0)),OFFSET(B435,-1,0),A435)))))","v":1},{"$f":"IF(OR(C435=\"S\",C435=0),0,IF(ISERROR(K435),J435,SMALL(J435:K435,1)))","v":53},{"$f":"IF($C435=1,OFFSET(E435,-1,0)+1,OFFSET(E435,-1,0))","v":13},{"$f":"IF($C435=1,0,IF($C435=2,OFFSET(F435,-1,0)+1,OFFSET(F435,-1,0)))","v":0},{"$f":"IF(AND($C435<=2,$C435<>0),0,IF($C435=3,OFFSET(G435,-1,0)+1,OFFSET(G435,-1,0)))","v":0},{"$f":"IF(AND($C435<=3,$C435<>0),0,IF($C435=4,OFFSET(H435,-1,0)+1,OFFSET(H435,-1,0)))","v":0},{"$f":"IF(AND($C435<=4,$C435<>0),0,IF(AND($C435=\"S\",$Y435>0),OFFSET(I435,-1,0)+1,OFFSET(I435,-1,0)))","v":0},95,53,{"$f":"IF(OR(Y435>0,$C435=1),\"F\",\"\")","v":"F"},"Nível 1",{"$f":"CHOOSE(1+LOG(1+2*(C435=1)+4*(C435=2)+8*(C435=3)+16*(C435=4)+32*(C435=\"S\"),2),\"\",\"Nível 1\",\"Nível 2\",\"Nível 3\",\"Nível 4\",\"Serviço\")","v":"Nível 1"},"13.","AGETOP",null,"PROJETO HIDROSSANITÁRIO","UN",1,1,1,null,null,0,0,""]
[2,2,2,52,13,1,0,0,0,52,65,"","Nível 2","Nível 2","-","AGETOP",null,"INSTALAÇÕES HIDROSSANITÁRIAS","-",null,1,"-",null,null,0,0,""]
[3,3,3,16,13,1,1,0,0,51,16,"","Nível 3","Nível 3","-","SINAPI",null,"PEÇAS E ACESSÓRIOS","-",null,1,"-",null,null,0,0,""]
[4,4,4,8,13,1,1,1,0,15,8,"","Nível 4","Nível 4","-","SINAPI",null,"VASO SANITÁRIO E ACESSÓRIOS","-",null,1,"-",null,null,0,0,""]
["S",4,"S",0,13,1,1,1,0,0,0,"","Serviço","Serviço","-","AGETOP",80502,"VASO SANITARIO","Un    ",1,1,1,null,null,0,0,""]
["S",4,"S",0,13,1,1,1,0,0,0,"","Serviço","Serviço","-","AGETOP",80517,"VÁLVULA DE DESCARGA DUPLO ACIONAMENTO COM ACABAMENTO CROMADO ANTIVANDALISMO","Un    ",1,1,1,null,null,0,0,""]
["S",4,"S",0,13,1,1,1,0,0,0,"","Serviço","Serviço","-","AGETOP",80520,"CONJUNTO DE FIXACAO P/VASO SANITARIO (PAR)","CJ    ",1,1,1,null,null,0,0,""]
["S",4,"S",0,13,1,1,1,0,0,0,"","Serviço","Serviço","-","AGETOP",80513,"TUBO PARA VÁLVULA DE DESCARGA ( CURTO 1.1/4\" )","Un    ",1,1,1,null,null,0,0,""]
["S",4,"S",0,13,1,1,1,0,0,0,"","Serviço","Serviço","-","AGETOP",80510,"ANEL DE VEDAÇÃO PARA VASO SANITÁRIO","Un    ",1,1,1,null,null,0,0,""]
["S",4,"S",0,13,1,1,1,0,{"$f":"IF(OR($C444=\"S\",$C444=0),0,MATCH(0,OFFSET($D444,1,$C444,ROW($C$530)-ROW($C444)),0))","v":0},{"$f":"IF(OR($C444=\"S\",$C444=0),0,MATCH(OFFSET($D444,0,$C444)+1,OFFSET($D444,1,$C444,ROW($C$530)-ROW($C444)),0))","v":0},"","Serviço","Serviço","-","AGETOP",80526,"ASSENTO EM POLIPROPILENO COM SISTEMA DE FECHAMENTO SUAVE PARA VASO SANITÁRIO","Un    ",1,1,1,null,null,0,0,""]
["S",4,"S",0,13,1,1,1,0,0,0,"","Serviço","Serviço","-","SINAPI",95544,"PAPELEIRA DE PAREDE EM METAL CROMADO SEM TAMPA, INCLUSO FIXAÇÃO. AF_01/2020","UN",1,1,1,null,null,0,0,""]
[4,4,4,7,13,1,1,2,0,7,14,"","Nível 4","Nível 4","-","SINAPI",null,"LAVATÓRIO E ACESSÓRIOS","-",null,1,"-",null,null,0,0,""]
["S",4,"S",0,13,1,1,2,0,0,0,"","Serviço","Serviço","-","AGETOP",80543,"LAVATÓRIO DE CANTO SEM COLUNA ","un    ",3,1,3,null,null,0,0,""]
["S",4,"S",0,13,1,1,2,0,0,0,"","Serviço","Serviço","-","AGETOP",80550,"FIXACAO P/LAVATORIO (PAR)","PAR   ",3,1,3,null,null,0,0,""]
["S",4,"S",0,13,1,1,2,0,0,0,"","Serviço","Serviço","-","AGETOP",80556,"LIGAÇÃO FLEXÍVEL PVC DIAM.1/2\" (ENGATE)","Un    ",3,1,3,null,null,0,0,""]
["S",4,"S",0,13,1,1,2,0,0,0,"","Serviço","Serviço","-","SINAPI",86883,"SIFÃO DO TIPO FLEXÍVEL EM PVC 1  X 1.1/2  - FORNECIMENTO E INSTALAÇÃO. AF_01/2020","UN",3,1,3,null,null,0,0,""]
["S",4,"S",0,13,1,1,2,0,0,0,"","Serviço","Serviço","-","SINAPI",86915,"TORNEIRA CROMADA DE MESA, 1/2\u0094 OU 3/4\u0094, PARA LAVATÓRIO, PADRÃO MÉDIO - FORNECIMENTO E INSTALAÇÃO. AF_01/2020","UN",3,1,3,null,null,0,0,"Referência: AGETOP - 80570"]
["S",4,"S",0,13,1,1,2,0,0,0,"","Serviço","Serviço","-","SINAPI",86879,"VÁLVULA EM PLÁSTICO 1\u0094 PARA PIA, TANQUE OU LAVATÓRIO, COM OU SEM LADRÃO - FORNECIMENTO E INSTALAÇÃO. AF_01/2020","UN",3,1,3,null,null,0,0,""]
[3,3,3,14,13,1,2,0,0,35,14,"","Nível 3","Nível 3","-","SINAPI",null,"ÁGUA FRIA","-",null,1,"-",null,null,0,0,""]
[4,4,4,3,13,1,2,1,0,13,3,"","Nível 4","Nível 4","-","SINAPI",null,"TUBOS DE PVC SOLDÁVEL","-",null,1,"-",null,null,0,0,""]
["S",4,"S",0,13,1,2,1,0,0,0,"","Serviço","Serviço","-","SINAPI",89402,"TUBO, PVC, SOLDÁVEL, DN 25MM, INSTALADO EM RAMAL DE DISTRIBUIÇÃO DE ÁGUA - FORNECIMENTO E INSTALAÇÃO. AF_12/2014","M",6,1,6,null,null,0,0,"Referência: AGETOP - 81003"]
["S",4,"S",0,13,1,2,1,0,0,0,"","Serviço","Serviço","-","SINAPI",89449,"TUBO, PVC, SOLDÁVEL, DN 50MM, INSTALADO EM PRUMADA DE ÁGUA - FORNECIMENTO E INSTALAÇÃO. AF_12/2014","M",3,1,3,null,null,0,0,""]
[4,4,4,3,13,1,2,2,0,10,3,"","Nível 4","Nível 4","-","SINAPI",null,"JOELHO","-",null,1,"-",null,null,0,0,""]
["S",4,"S",0,13,1,2,2,0,0,0,"","Serviço","Serviço","-","SINAPI",89481,"JOELHO 90 GRAUS, PVC, SOLDÁVEL, DN 25MM, INSTALADO EM PRUMADA DE ÁGUA - FORNECIMENTO E INSTALAÇÃO. AF_12/2014","UN",4,1,4,null,null,0,0,""]
["S",4,"S",0,13,1,2,2,0,0,0,"","Serviço","Serviço","-","SINAPI",89501,"JOELHO 90 GRAUS, PVC, SOLDÁVEL, DN 50MM, INSTALADO EM PRUMADA DE ÁGUA - FORNECIMENTO E INSTALAÇÃO. AF_12/2014","UN",2,1,2,null,null,0,0,""]
[{"$f":"CHOOSE(1+LOG(1+2*(ORÇAMENTO.Nivel=\"Nível 1\")+4*(ORÇAMENTO.Nivel=\"Nível 2\")+8*(ORÇAMENTO.Nivel=\"Nível 3\")+16*(ORÇAMENTO.Nivel=\"Nível 4\")+32*(ORÇAMENTO.Nivel=\"Serviço\"),2),0,1,2,3,4,\"S\")","v":4},4,4,3,13,1,2,3,0,7,3,"","Nível 4","Nível 4","-","SINAPI",null,"TÊ","-",null,1,"-",null,null,0,0,""]
["S",4,"S",0,13,1,2,3,0,0,0,"","Serviço","Serviço","-","SINAPI",89625,"TE, PVC, SOLDÁVEL, DN 50MM, INSTALADO EM PRUMADA DE ÁGUA - FORNECIMENTO E INSTALAÇÃO. AF_12/2014","UN",1,1,1,null,null,0,0,""]
["S",4,"S",0,13,1,2,3,0,0,0,"","Serviço","Serviço","-","SINAPI",89627,"TÊ DE REDUÇÃO, PVC, SOLDÁVEL, DN 50MM X 25MM, INSTALADO EM PRUMADA DE ÁGUA - FORNECIMENTO E INSTALAÇÃO. AF_12/2014","UN",1,1,1,null,null,0,0,""]
[4,4,4,2,13,1,2,4,0,4,2,"","Nível 4","Nível 4","-","SINAPI",null,"ADAPTADORES","-",null,1,"-",null,null,0,0,""]
["S",4,"S",0,13,1,2,4,0,0,0,"","Serviço","Serviço","-","SINAPI",89596,"ADAPTADOR CURTO COM BOLSA E ROSCA PARA REGISTRO, PVC, SOLDÁVEL, DN 50MM X 1.1/2\u0094, INSTALADO EM PRUMADA DE ÁGUA - FORNECIMENTO E INSTALAÇÃO. AF_12/2014","UN",2,1,2,null,null,0,0,"Referência: AGETOP - 81069"]
[4,4,4,2,13,1,2,5,0,2,19,"","Nível 4","Nível 4","-","SINAPI",null,"ADESIVOS","-",null,1,"-",null,null,0,0,""]
["S",4,"S",0,13,1,2,5,0,0,0,"","Serviço","Serviço","-","AGETOP",81502,"ADESIVO PLASTICO - BISNAGA 75 G","Un    ",2,1,2,null,null,0,0,""]
[3,3,3,21,13,1,3,0,0,21,54,"","Nível 3","Nível 3","-","SINAPI",null,"ESGOTO SANITÁRIO","-",null,1,"-",null,null,0,0,""]
[4,4,4,3,13,1,3,1,0,20,3,"","Nível 4","Nível 4","-","SINAPI",null,"CORPO DE CAIXA SIFONADA / RALO","-",null,1,"-",null,null,0,0,""]
["S",4,"S",0,13,1,3,1,0,0,0,"","Serviço","Serviço","-","AGETOP",81663,"CORPO CX. SIFONADA DIAM. 150 X 150 X 50","Un    ",1,1,1,null,null,0,0,""]
["S",4,"S",0,13,1,3,1,0,0,0,"","Serviço","Serviço","-","AGETOP",81791,"GRELHA REDONDA BRANCA DIAM. 150 MM","Un    ",1,1,1,null,null,0,0,""]
[4,4,4,7,13,1,3,2,0,17,7,"","Nível 4","Nível 4","-","SINAPI",null,"JOELHOS","-",null,1,"-",null,null,0,0,""]
["S",4,"S",0,13,1,3,2,0,0,0,"","Serviço","Serviço","-","AGETOP",81927,"JOELHO 90 GRAUS C/ANEL 40 mm ","Un    ",1,1,1,null,null,0,0,""]
["S",4,"S",0,13,1,3,2,0,0,0,"","Serviço","Serviço","-","AGETOP",81938,"JOELHO 90 GRAUS DIAMETRO 100 MM","Un    ",1,1,1,null,null,0,0,""]
["S",4,"S",0,13,1,3,2,0,0,0,"","Serviço","Serviço","-","AGETOP",81936,"JOELHO 90 GRAUS DIAMETRO 50 MM","Un    ",1,1,1,null,null,0,0,""]
["S",4,"S",0,13,1,3,2,0,0,0,"","Serviço","Serviço","-","AGETOP",81935,"JOELHO 90 GRAUS DIAMETRO 40 MM","Un    ",1,1,1,null,null,0,0,""]
["S",4,"S",0,13,1,3,2,0,0,0,"","Serviço","Serviço","-","SINAPI",89726,"JOELHO 45 GRAUS, PVC, SERIE NORMAL, ESGOTO PREDIAL, DN 40 MM, JUNTA SOLDÁVEL, FORNECIDO E INSTALADO EM RAMAL DE DESCARGA OU RAMAL DE ESGOTO SANITÁRIO. AF_12/2014","UN",1,1,1,null,null,0,0,""]
["S",4,"S",0,13,1,3,2,0,0,0,"","Serviço","Serviço","-","SINAPI",89802,"JOELHO 45 GRAUS, PVC, SERIE NORMAL, ESGOTO PREDIAL, DN 50 MM, JUNTA ELÁSTICA, FORNECIDO E INSTALADO EM PRUMADA DE ESGOTO SANITÁRIO OU VENTILAÇÃO. AF_12/2014","UN",2,1,2,null,null,0,0,""]
[4,4,4,2,13,1,3,3,0,10,2,"","Nível 4","Nível 4","-","SINAPI",null,"JUNÇÕES","-",null,1,"-",null,null,0,0,""]
["S",4,"S",0,13,1,3,3,0,0,0,"","Serviço","Serviço","-","SINAPI",89797,"JUNÇÃO SIMPLES, PVC, SERIE NORMAL, ESGOTO PREDIAL, DN 100 X 100 MM, JUNTA ELÁSTICA, FORNECIDO E INSTALADO EM RAMAL DE DESCARGA OU RAMAL DE ESGOTO SANITÁRIO. AF_12/2014","UN",1,1,1,null,null,0,0,"Referência: AGETOP - 81975"]
[4,4,4,2,13,1,3,4,0,8,2,"","Nível 4","Nível 4","-","SINAPI",null,"LUVAS","-",null,1,"-",null,null,0,0,""]
["S",4,"S",0,13,1,3,4,0,0,0,"","Serviço","Serviço","-","SINAPI",89778,"LUVA SIMPLES, PVC, SERIE NORMAL, ESGOTO PREDIAL, DN 100 MM, JUNTA ELÁSTICA, FORNECIDO E INSTALADO EM RAMAL DE DESCARGA OU RAMAL DE ESGOTO SANITÁRIO. AF_12/2014","UN",1,1,1,null,null,0,0,"Referência: AGETOP - 82004"]
[4,4,4,2,13,1,3,5,0,6,2,"","Nível 4","Nível 4","-","SINAPI",null,"TÊ","-",null,1,"-",null,null,0,0,""]
["S",4,"S",0,13,1,3,5,0,0,0,"","Serviço","Serviço","-","SINAPI",89825,"TE, PVC, SERIE NORMAL, ESGOTO PREDIAL, DN 50 X 50 MM, JUNTA ELÁSTICA, FORNECIDO E INSTALADO EM PRUMADA DE ESGOTO SANITÁRIO OU VENTILAÇÃO. AF_12/2014","UN",1,1,1,null,null,0,0,""]
[4,4,4,4,13,1,3,6,0,4,{"$error":"#N/A"},"","Nível 4","Nível 4","-","SINAPI",null,"TUBOS","-",null,1,"-",null,null,0,0,""]
["S",4,"S",0,13,1,3,6,0,0,0,"","Serviço","Serviço","-","SINAPI",89711,"TUBO PVC, SERIE NORMAL, ESGOTO PREDIAL, DN 40 MM, FORNECIDO E INSTALADO EM RAMAL DE DESCARGA OU RAMAL DE ESGOTO SANITÁRIO. AF_12/2014","M",3,1,3,null,null,0,0,"Referência: AGETOP - 82301"]
["S",4,"S",0,13,1,3,6,0,0,0,"","Serviço","Serviço","-","SINAPI",89798,"TUBO PVC, SERIE NORMAL, ESGOTO PREDIAL, DN 50 MM, FORNECIDO E INSTALADO EM PRUMADA DE ESGOTO SANITÁRIO OU VENTILAÇÃO. AF_12/2014","M",6,1,6,null,null,0,0,""]
["S",4,"S",0,13,1,3,6,0,0,0,"","Serviço","Serviço","-","SINAPI",89800,"TUBO PVC, SERIE NORMAL, ESGOTO PREDIAL, DN 100 MM, FORNECIDO E INSTALADO EM PRUMADA DE ESGOTO SANITÁRIO OU VENTILAÇÃO. AF_12/2014","M",3,1,3,null,null,0,0,""]
[1,1,1,39,14,0,0,0,0,42,39,"F","Nível 1","Nível 1","14.","AGETOP",null,"PROJETO ESTRUTURAL - COBERTURA","UN",1,1,1,null,null,0,0,""]
[2,2,2,12,14,1,0,0,0,38,12,"","Nível 2","Nível 2","-","AGETOP",null,"FUNDAÇÕES E SONDAGENS","-",null,1,"-",null,null,0,0,""]
[3,3,3,5,14,1,1,0,0,11,5,"","Nível 3","Nível 3","-","SINAPI",null,"ESTACAS","-",null,1,"-",null,null,0,0,""]
["S",3,"S",0,14,1,1,0,0,0,0,"","Serviço","Serviço","-","AGETOP",20702,"LOCAÇÃO DE OBRAS DE PEQUENO PORTE COM CAVALETE, INCLUSO PINTURA ( FACE INTERNA DO SARRAFO 10CM) E PIQUETE COM TESTEMUNHA","m2    ",509.17,1,509.17,null,null,0,0,""]
["S",3,"S",0,14,1,1,0,0,0,0,"","Serviço","Serviço","-","COMPOSIÇÃO","COMP 199_SEE","ESTACA A TRADO DIAM.40 CM S/FERRO","M",145,1,145,null,null,0,0,""]
["S",3,"S",0,14,1,1,0,0,0,0,"","Serviço","Serviço","-","SINAPI",96546,"ARMAÇÃO DE BLOCO, VIGA BALDRAME OU SAPATA UTILIZANDO AÇO CA-50 DE 10 MM - MONTAGEM. AF_06/2017","KG",830.49090909090899,1,830.49090909090899,null,null,0,0,"Referência: AGETOP - 52005"]
["S",3,"S",0,14,1,1,0,0,0,0,"","Serviço","Serviço","-","SINAPI",96543,"ARMAÇÃO DE BLOCO, VIGA BALDRAME E SAPATA UTILIZANDO AÇO CA-60 DE 5 MM - MONTAGEM. AF_06/2017","KG",186.69090909090909,1,186.69090909090909,null,null,0,0,"Referência: AGETOP - 52014"]
[3,3,3,6,14,1,2,0,0,6,21,"","Nível 3","Nível 3","-","SINAPI",null,"BLOCOS","-",null,1,"-",null,null,0,0,""]
["S",3,"S",0,14,1,2,0,0,0,0,"","Serviço","Serviço","-","SINAPI",96545,"ARMAÇÃO DE BLOCO, VIGA BALDRAME OU SAPATA UTILIZANDO AÇO CA-50 DE 8 MM - MONTAGEM. AF_06/2017","KG",318.81818181818176,1,318.81818181818176,null,null,0,0,"Referência: AGETOP - 52004"]
["S",3,"S",0,14,1,2,0,0,0,0,"","Serviço","Serviço","-","SINAPI",96546,"ARMAÇÃO DE BLOCO, VIGA BALDRAME OU SAPATA UTILIZANDO AÇO CA-50 DE 10 MM - MONTAGEM. AF_06/2017","KG",98.36363636363636,1,98.36363636363636,null,null,0,0,"Referência: AGETOP - 52005"]
["S",3,"S",0,14,1,2,0,0,0,0,"","Serviço","Serviço","-","SINAPI",94971,"CONCRETO FCK = 25MPA, TRAÇO 1:2,3:2,7 (CIMENTO/ AREIA MÉDIA/ BRITA 1)  - PREPARO MECÂNICO COM BETONEIRA 600 L. AF_07/2016","M3",12.22,1,12.22,null,null,0,0,""]
["S",{"$f":"IF(OR(C499=\"s\",C499=0),OFFSET(B499,-1,0),C499)","v":3},{"$f":"IF(OFFSET(C499,-1,0)=\"L\",1,IF(OFFSET(C499,-1,0)=1,2,IF(OR(A499=\"s\",A499=0),\"S\",IF(AND(OFFSET(C499,-1,0)=2,A499=4),3,IF(AND(OR(OFFSET(C499,-1,0)=\"s\",OFFSET(C499,-1,0)=0),A499<>\"s\",A499>OFFSET(B499,-1,0)),OFFSET(B499,-1,0),A499)))))","v":"S"},{"$f":"IF(OR(C499=\"S\",C499=0),0,IF(ISERROR(K499),J499,SMALL(J499:K499,1)))","v":0},{"$f":"IF($C499=1,OFFSET(E499,-1,0)+1,OFFSET(E499,-1,0))","v":14},{"$f":"IF($C499=1,0,IF($C499=2,OFFSET(F499,-1,0)+1,OFFSET(F499,-1,0)))","v":1},{"$f":"IF(AND($C499<=2,$C499<>0),0,IF($C499=3,OFFSET(G499,-1,0)+1,OFFSET(G499,-1,0)))","v":2},{"$f":"IF(AND($C499<=3,$C499<>0),0,IF($C499=4,OFFSET(H499,-1,0)+1,OFFSET(H499,-1,0)))","v":0},{"$f":"IF(AND($C499<=4,$C499<>0),0,IF(AND($C499=\"S\",$Y499>0),OFFSET(I499,-1,0)+1,OFFSET(I499,-1,0)))","v":0},0,0,{"$f":"IF(OR(Y499>0,$C499=1),\"F\",\"\")","v":""},"Serviço",{"$f":"CHOOSE(1+LOG(1+2*(C499=1)+4*(C499=2)+8*(C499=3)+16*(C499=4)+32*(C499=\"S\"),2),\"\",\"Nível 1\",\"Nível 2\",\"Nível 3\",\"Nível 4\",\"Serviço\")","v":"Serviço"},"-","SINAPI",96619,"LASTRO DE CONCRETO MAGRO, APLICADO EM BLOCOS DE COROAMENTO OU SAPATAS, ESPESSURA DE 5 CM. AF_08/2017","M2",18.41,1,18.41,null,null,0,0,""]
["S",3,"S",0,14,1,2,0,0,0,0,"","Serviço","Serviço","-","AGETOP",41002,"APILOAMENTO","m2    ",18.41,1,18.41,null,null,0,0,""]
[2,2,2,26,14,2,0,0,0,26,{"$error":"#N/A"},"","Nível 2","Nível 2","-","AGETOP",null,"ESTRUTURA","-",null,1,"-",null,null,0,0,""]
[3,3,3,6,14,2,1,0,0,25,6,"","Nível 3","Nível 3","-","AGETOP",null,"VIGAS BALDRAMES","-",null,1,"-",null,null,0,0,""]
["S",3,"S",0,14,2,1,0,0,0,0,"","Serviço","Serviço","-","AGETOP",40101,"ESCAVACAO MANUAL DE VALAS < 1 MTS. (OBRAS CIVIS)","m3    ",1.794,1,1.794,null,null,0,0,""]
["S",3,"S",0,14,2,1,0,0,0,0,"","Serviço","Serviço","-","SINAPI",94971,"CONCRETO FCK = 25MPA, TRAÇO 1:2,3:2,7 (CIMENTO/ AREIA MÉDIA/ BRITA 1)  - PREPARO MECÂNICO COM BETONEIRA 600 L. AF_07/2016","M3",5.96,1,5.96,null,null,0,0,""]
["S",3,"S",0,14,2,1,0,0,0,0,"","Serviço","Serviço","-","SINAPI",96546,"ARMAÇÃO DE BLOCO, VIGA BALDRAME OU SAPATA UTILIZANDO AÇO CA-50 DE 10 MM - MONTAGEM. AF_06/2017","KG",202.81818181818178,1,202.81818181818178,null,null,0,0,"Referência: AGETOP - 52005"]
["S",3,"S",0,14,2,1,0,0,0,0,"","Serviço","Serviço","-","SINAPI",96543,"ARMAÇÃO DE BLOCO, VIGA BALDRAME E SAPATA UTILIZANDO AÇO CA-60 DE 5 MM - MONTAGEM. AF_06/2017","KG",52.090909090909086,1,52.090909090909086,null,null,0,0,"Referência: AGETOP - 52014"]
["S",3,"S",0,14,2,1,0,0,0,0,"","Serviço","Serviço","-","AGETOP",41002,"APILOAMENTO","m2    ",11.96,1,11.96,null,null,0,0,""]
[3,3,3,8,14,2,2,0,0,19,8,"","Nível 3","Nível 3","-","SINAPI",null,"VIGAS DE COBERTURA NIVEL 1","-",null,1,"-",null,null,0,0,""]
["S",3,"S",0,14,2,2,0,0,{"$f":"IF(OR($C509=\"S\",$C509=0),0,MATCH(0,OFFSET($D509,1,$C509,ROW($C$530)-ROW($C509)),0))","v":0},{"$f":"IF(OR($C509=\"S\",$C509=0),0,MATCH(OFFSET($D509,0,$C509)+1,OFFSET($D509,1,$C509,ROW($C$530)-ROW($C509)),0))","v":0},"","Serviço","Serviço","-","SINAPI",94971,"CONCRETO FCK = 25MPA, TRAÇO 1:2,3:2,7 (CIMENTO/ AREIA MÉDIA/ BRITA 1)  - PREPARO MECÂNICO COM BETONEIRA 600 L. AF_07/2016","M3",7.17,1,7.17,null,null,0,0,""]
["S",3,"S",0,14,2,2,0,0,0,0,"","Serviço","Serviço","-","SINAPI",92779,"ARMAÇÃO DE PILAR OU VIGA DE UMA ESTRUTURA CONVENCIONAL DE CONCRETO ARMADO EM UMA EDIFICAÇÃO TÉRREA OU SOBRADO UTILIZANDO AÇO CA-50 DE 12,5 MM - MONTAGEM. AF_12/2015","KG",15.545454545454545,1,15.545454545454545,null,null,0,0,""]
["S",3,"S",0,14,2,2,0,0,0,0,"","Serviço","Serviço","-","SINAPI",92759,"ARMAÇÃO DE PILAR OU VIGA DE UMA ESTRUTURA CONVENCIONAL DE CONCRETO ARMADO EM UM EDIFÍCIO DE MÚLTIPLOS PAVIMENTOS UTILIZANDO AÇO CA-60 DE 5,0 MM - MONTAGEM. AF_12/2015","KG",64.636363636363626,1,64.636363636363626,null,null,0,0,"Referência: AGETOP - 60314"]
["S",3,"S",0,14,2,2,0,0,0,0,"","Serviço","Serviço","-","SINAPI",92760,"ARMAÇÃO DE PILAR OU VIGA DE UMA ESTRUTURA CONVENCIONAL DE CONCRETO ARMADO EM UM EDIFÍCIO DE MÚLTIPLOS PAVIMENTOS UTILIZANDO AÇO CA-50 DE 6,3 MM - MONTAGEM. AF_12/2015","KG",1.1818181818181817,1,1.1818181818181817,null,null,0,0,"Referência: AGETOP - 60303"]
["S",3,"S",0,14,2,2,0,0,0,0,"","Serviço","Serviço","-","SINAPI",92764,"ARMAÇÃO DE PILAR OU VIGA DE UMA ESTRUTURA CONVENCIONAL DE CONCRETO ARMADO EM UM EDIFÍCIO DE MÚLTIPLOS PAVIMENTOS UTILIZANDO AÇO CA-50 DE 16,0 MM - MONTAGEM. AF_12/2015","KG",89.181818181818173,1,89.181818181818173,null,null,0,0,""]
["S",3,"S",0,14,2,2,0,0,0,0,"","Serviço","Serviço","-","SINAPI",92762,"ARMAÇÃO DE PILAR OU VIGA DE UMA ESTRUTURA CONVENCIONAL DE CONCRETO ARMADO EM UM EDIFÍCIO DE MÚLTIPLOS PAVIMENTOS UTILIZANDO AÇO CA-50 DE 10,0 MM - MONTAGEM. AF_12/2015","KG",175.72727272727272,1,175.72727272727272,null,null,0,0,"Referência: AGETOP - 60305"]
["S",3,"S",0,14,2,2,0,0,0,0,"","Serviço","Serviço","-","SINAPI",92464,"MONTAGEM E DESMONTAGEM DE FÔRMA DE VIGA, ESCORAMENTO METÁLICO, PÉ-DIREITO SIMPLES, EM CHAPA DE MADEIRA RESINADA, 8 UTILIZAÇÕES. AF_12/2015","M2",93.87,1,93.87,null,null,0,0,"Referência: AGETOP - 60209"]
[3,3,3,5,14,2,3,0,0,11,5,"","Nível 3","Nível 3","-","SINAPI",null,"VIGAS DE COBERTURA NIVEL 2","-",null,1,"-",null,null,0,0,""]
["S",3,"S",0,14,2,3,0,0,0,0,"","Serviço","Serviço","-","SINAPI",94971,"CONCRETO FCK = 25MPA, TRAÇO 1:2,3:2,7 (CIMENTO/ AREIA MÉDIA/ BRITA 1)  - PREPARO MECÂNICO COM BETONEIRA 600 L. AF_07/2016","M3",3.58,1,3.58,null,null,0,0,""]
["S",3,"S",0,14,2,3,0,0,0,0,"","Serviço","Serviço","-","SINAPI",92759,"ARMAÇÃO DE PILAR OU VIGA DE UMA ESTRUTURA CONVENCIONAL DE CONCRETO ARMADO EM UM EDIFÍCIO DE MÚLTIPLOS PAVIMENTOS UTILIZANDO AÇO CA-60 DE 5,0 MM - MONTAGEM. AF_12/2015","KG",58.36363636363636,1,58.36363636363636,null,null,0,0,"Referência: AGETOP - 60314"]
["S",3,"S",0,14,2,3,0,0,0,0,"","Serviço","Serviço","-","SINAPI",92762,"ARMAÇÃO DE PILAR OU VIGA DE UMA ESTRUTURA CONVENCIONAL DE CONCRETO ARMADO EM UM EDIFÍCIO DE MÚLTIPLOS PAVIMENTOS UTILIZANDO AÇO CA-50 DE 10,0 MM - MONTAGEM. AF_12/2015","KG",197.63,1,197.63,null,null,0,0,"Referência: AGETOP - 60305"]
["S",3,"S",0,14,2,3,0,0,0,0,"","Serviço","Serviço","-","SINAPI",92464,"MONTAGEM E DESMONTAGEM DE FÔRMA DE VIGA, ESCORAMENTO METÁLICO, PÉ-DIREITO SIMPLES, EM CHAPA DE MADEIRA RESINADA, 8 UTILIZAÇÕES. AF_12/2015","M2",59.64,1,59.64,null,null,0,0,"Referência: AGETOP - 60209"]
[3,3,3,6,14,2,4,0,0,6,{"$error":"#N/A"},"","Nível 3","Nível 3","-","SINAPI",null,"PILARES","-",null,1,"-",null,null,0,0,""]
["S",3,"S",0,14,2,4,0,0,0,0,"","Serviço","Serviço","-","SINAPI",92426,"MONTAGEM E DESMONTAGEM DE FÔRMA DE PILARES RETANGULARES E ESTRUTURAS SIMILARES COM ÁREA MÉDIA DAS SEÇÕES MENOR OU IGUAL A 0,25 M², PÉ-DIREITO SIMPLES, EM CHAPA DE MADEIRA COMPENSADA RESINADA, 8 UTILIZAÇÕES. AF_12/2015","M2",146.5,1,146.5,null,null,0,0,""]
["S",3,"S",0,14,2,4,0,0,0,0,"","Serviço","Serviço","-","SINAPI",92779,"ARMAÇÃO DE PILAR OU VIGA DE UMA ESTRUTURA CONVENCIONAL DE CONCRETO ARMADO EM UMA EDIFICAÇÃO TÉRREA OU SOBRADO UTILIZANDO AÇO CA-50 DE 12,5 MM - MONTAGEM. AF_12/2015","KG",703.27272727272725,1,703.27272727272725,null,null,0,0,""]
[{"$f":"CHOOSE(1+LOG(1+2*(ORÇAMENTO.Nivel=\"Nível 1\")+4*(ORÇAMENTO.Nivel=\"Nível 2\")+8*(ORÇAMENTO.Nivel=\"Nível 3\")+16*(ORÇAMENTO.Nivel=\"Nível 4\")+32*(ORÇAMENTO.Nivel=\"Serviço\"),2),0,1,2,3,4,\"S\")","v":"S"},3,"S",0,14,2,4,0,0,0,0,"","Serviço","Serviço","-","SINAPI",92759,"ARMAÇÃO DE PILAR OU VIGA DE UMA ESTRUTURA CONVENCIONAL DE CONCRETO ARMADO EM UM EDIFÍCIO DE MÚLTIPLOS PAVIMENTOS UTILIZANDO AÇO CA-60 DE 5,0 MM - MONTAGEM. AF_12/2015","KG",275.09090909090907,1,275.09090909090907,null,null,0,0,"Referência: AGETOP - 60314"]
["S",3,"S",0,14,2,4,0,0,0,0,"","Serviço","Serviço","-","AGETOP",60801,"LANÇAMENTO/APLICAÇÃO/ADENSAMENTO MANUAL DE CONCRETO - (OBRAS CIVIS)","m3    ",12.82,1,12.82,null,null,0,0,""]
["S",3,"S",0,14,2,4,0,0,0,0,"","Serviço","Serviço","-","SINAPI",94971,"CONCRETO FCK = 25MPA, TRAÇO 1:2,3:2,7 (CIMENTO/ AREIA MÉDIA/ BRITA 1)  - PREPARO MECÂNICO COM BETONEIRA 600 L. AF_07/2016","M3",12.82,1,12.82,null,null,0,0,""]
[{"$f":"CHOOSE(1+LOG(1+2*(ORÇAMENTO.Nivel=\"Nível 1\")+4*(ORÇAMENTO.Nivel=\"Nível 2\")+8*(ORÇAMENTO.Nivel=\"Nível 3\")+16*(ORÇAMENTO.Nivel=\"Nível 4\")+32*(ORÇAMENTO.Nivel=\"Serviço\"),2),0,1,2,3,4,\"S\")","v":1},{"$f":"IF(OR(C527=\"s\",C527=0),OFFSET(B527,-1,0),C527)","v":1},{"$f":"IF(OFFSET(C527,-1,0)=\"L\",1,IF(OFFSET(C527,-1,0)=1,2,IF(OR(A527=\"s\",A527=0),\"S\",IF(AND(OFFSET(C527,-1,0)=2,A527=4),3,IF(AND(OR(OFFSET(C527,-1,0)=\"s\",OFFSET(C527,-1,0)=0),A527<>\"s\",A527>OFFSET(B527,-1,0)),OFFSET(B527,-1,0),A527)))))","v":1},{"$f":"IF(OR(C527=\"S\",C527=0),0,IF(ISERROR(K527),J527,SMALL(J527:K527,1)))","v":3},{"$f":"IF($C527=1,OFFSET(E527,-1,0)+1,OFFSET(E527,-1,0))","v":15},{"$f":"IF($C527=1,0,IF($C527=2,OFFSET(F527,-1,0)+1,OFFSET(F527,-1,0)))","v":0},{"$f":"IF(AND($C527<=2,$C527<>0),0,IF($C527=3,OFFSET(G527,-1,0)+1,OFFSET(G527,-1,0)))","v":0},{"$f":"IF(AND($C527<=3,$C527<>0),0,IF($C527=4,OFFSET(H527,-1,0)+1,OFFSET(H527,-1,0)))","v":0},{"$f":"IF(AND($C527<=4,$C527<>0),0,IF(AND($C527=\"S\",$Y527>0),OFFSET(I527,-1,0)+1,OFFSET(I527,-1,0)))","v":0},3,{"$error":"#N/A"},{"$f":"IF(OR(Y527>0,$C527=1),\"F\",\"\")","v":"F"},"Nível 1",{"$f":"CHOOSE(1+LOG(1+2*(C527=1)+4*(C527=2)+8*(C527=3)+16*(C527=4)+32*(C527=\"S\"),2),\"\",\"Nível 1\",\"Nível 2\",\"Nível 3\",\"Nível 4\",\"Serviço\")","v":"Nível 1"},"15.","SINAPI",null,"PROJETO ESTRUTURAS METÁLICAS","UN",1,1,1,null,null,0,0,""]
[2,2,2,2,15,1,0,0,0,2,{"$error":"#N/A"},"","Nível 2","Nível 2","-","SINAPI",null,"ESTRUTURAS METÁLICAS","-",null,1,"-",null,null,0,0,""]
["S",2,"S",0,15,1,0,0,0,0,0,"","Serviço","Serviço","-","AGETOP",150204,"ESTRUTURA METÁLICA CONVENCIONAL EM AÇO DO TIPO MR-250 / ASTM A36 COM FUNDO ANTICORROSIVO","Kg    ",6910.6,1,6910.6,null,null,0,0,""]
[-1,null,-1,null,0,0,0,0,0,null,null,"F"]
[null,null,null,null,null,null,null,null,null,null,null,"F",null,null,null,null,null,"OBS: OS QUANTITATIVOS DE MATERIAIS  DAS INSTALAÇÕES HIDROSSANITÁRIAS, ELÉTRICAS E ESPECIAIS SÃO FORNECIDOS PELOS PROFISSIONAIS RESPONSÁVEIS PELOS RESPECTIVOS PROJETOS.",null,null,null,null,"VALOR TOTAL",null,null,0]
[null,null,null,null,null,null,null,null,null,null,null,"F",null,null,null,null,null,null,null,null,null,null,"VALOR BDI (21,64%)",null,null,0]
[null,null,null,null,null,null,null,null,null,null,null,"F",null,null,null,null,null,null,null,null,null,null,"TOTAL ORÇAMENTO",null,null,0]
[null,null,null,null,null,null,null,null,null,null,null,"F"]
[null,null,null,null,null,null,null,null,null,null,null,"F",null,null,null,null,null,null,null,null,null,null,"CUSTO POR M2 ³",null,null,0]
[null,null,null,null,null,null,null,null,null,null,null,"F",null,null,null,null,null,null,null,null,null,null,"MATERIAL S/ BDI",null,null,0]
[null,null,null,null,null,null,null,null,null,null,null,"F",null,null,null,null,null,null,null,null,null,null,"MÃO DE OBRA S/ BDI",null,null,0]
[null,null,null,null,null,null,null,null,null,null,null,"F"]
[null,null,null,null,null,null,null,null,null,null,null,"F",null,null,null,null,"(1) Conforme previsto pelo DECRETO Nº 7.983, DE 8 DE ABRIL DE 2013, os preços adotados são aqueles constantes dos sistemas de referência indicados. Justifica-se o uso dos preços destas composições de custos unitários devido ao seu valor ser menor à mediana de seus correspondentes na tabela SINAPI;"]
[null,null,null,null,null,null,null,null,null,null,null,"F",null,null,null,null,"(2) Optou-se pelo uso das composições de custos da AGETOP para itens não presentes na SINAPI;"]
[null,null,null,null,null,null,null,null,null,null,null,"F",null,null,null,null,"(3) Para itens da AGETOP, os vidros não estão inclusos nas esquadrias e já foram considerados os custos de contramarco para as esquadrias de alumínio;"]
[null,null,null,null,null,null,null,null,null,null,null,"F",null,null,null,null,"(4) Nos casos em que houver execução de granitina e omissão do item AGETOP 221102, considerou-se que o quantitativo para o rodapé, de altura igual a 7cm, foi incorporado na área de piso;"]
[null,null,null,null,null,null,null,null,null,null,null,"F",null,null,null,null,"(5) O custo unitário aproximado por metro quadrado é calculado dividindo-se o valor total do orçamento pela área total de construção."]
[null,null,null,null,null,null,null,null,null,null,null,"F"]
[null,null,null,null,null,null,null,null,null,null,null,"F"]
[]
[null,null,null,null,null,null,null,null,null,null,null,null,null,null,"SOMATÓRIO DE SERVIÇOS"]
[null,null,null,null,null,null,null,null,null,null,null,null,null,null,"ITEM","DESCRIÇÃO DOS SERVIÇOS",null,null,"PREÇO SEM BDI",null,null,null,null,"PREÇO COM BDI",null,null,"PARTICIPAÇÃO ( % )"]
[null,null,null,null,null,null,null,null,null,null,null,null,null,null,"a.","SERVIÇOS PRELIMINARES",null,null,{"$f":"SUMIF($R$19:$R$530,$P549,$Z$19:$Z$530)","v":0},null,null,null,null,{"$f":"ROUND(S549*(1+BDI.Taxa),2)","v":0},null,null,{"$f":"IFERROR(ROUND($X549*100/$Z$533,2),0)","v":0}]
[null,null,null,null,null,null,null,null,null,null,null,null,null,null,"b.","TRANSPORTES",null,null,0,null,null,null,null,0,null,null,0]
[null,null,null,null,null,null,null,null,null,null,null,null,null,null,"c.","SERVIÇO EM TERRA",null,null,0,null,null,null,null,0,null,null,0]
[null,null,null,null,null,null,null,null,null,null,null,null,null,null,"d.","FUNDAÇÕES E SONDAGENS",null,null,0,null,null,null,null,0,null,null,0]
[null,null,null,null,null,null,null,null,null,null,null,null,null,null,"e.","ESTRUTURA",null,null,0,null,null,null,null,0,null,null,0]
[null,null,null,null,null,null,null,null,null,null,null,null,null,null,"f.","INSTALAÇÕES ELÉTRICAS",null,null,0,null,null,null,null,0,null,null,0]
[null,null,null,null,null,null,null,null,null,null,null,null,null,null,"g.","INSTALAÇÕES HIDROSSANITÁRIAS",null,null,0,null,null,null,null,0,null,null,0]
[null,null,null,null,null,null,null,null,null,null,null,null,null,null,"h","INSTALAÇÕES ESPECIAIS",null,null,0,null,null,null,null,0,null,null,0]
[null,null,null,null,null,null,null,null,null,null,null,null,null,null,"i.","ALVENARIAS E DIVISÓRIAS",null,null,0,null,null,null,null,0,null,null,0]
[null,null,null,null,null,null,null,null,null,null,null,null,null,null,"j.","ALVENARIA AUTO-PORTANTE",null,null,0,null,null,null,null,0,null,null,0]
[null,null,null,null,null,null,null,null,null,null,null,null,null,null,"k.","IMPERMEABILIZAÇÃO",null,null,0,null,null,null,null,0,null,null,0]
[null,null,null,null,null,null,null,null,null,null,null,null,null,null,"l.","ISOLAMENTO TÉRMICO E ACÚSTICO",null,null,0,null,null,null,null,0,null,null,0]
[null,null,null,null,null,null,null,null,null,null,null,null,null,null,"m.","ESTRUTURA DE MADEIRA",null,null,0,null,null,null,null,0,null,null,0]
[null,null,null,null,null,null,null,null,null,null,null,null,null,null,"n.","ESTRUTURAS METÁLICAS",null,null,0,null,null,null,null,0,null,null,0]
[null,null,null,null,null,null,null,null,null,null,null,null,null,null,"o.","COBERTURAS",null,null,0,null,null,null,null,0,null,null,0]
[null,null,null,null,null,null,null,null,null,null,null,null,null,null,"p.","ESQUADRIAS DE MADEIRA",null,null,0,null,null,null,null,0,null,null,0]
[null,null,null,null,null,null,null,null,null,null,null,null,null,null,"q.","ESQUADRIAS METÁLICAS",null,null,0,null,null,null,null,{"$f":"ROUND(S565*(1+BDI.Taxa),2)","v":0},null,null,0]
[null,null,null,null,null,null,null,null,null,null,null,null,null,null,"r.","VIDROS",null,null,0,null,null,null,null,0,null,null,0]
[null,null,null,null,null,null,null,null,null,null,null,null,null,null,"s.","REVESTIMENTO DE PAREDE",null,null,0,null,null,null,null,0,null,null,0]
[null,null,null,null,null,null,null,null,null,null,null,null,null,null,"t.","FORROS",null,null,0,null,null,null,null,0,null,null,0]
[null,null,null,null,null,null,null,null,null,null,null,null,null,null,"u.","REVESTIMENTO DE PISO",null,null,0,null,null,null,null,0,null,null,0]
[null,null,null,null,null,null,null,null,null,null,null,null,null,null,"v.","FERRAGENS",null,null,0,null,null,null,null,0,null,null,0]
[null,null,null,null,null,null,null,null,null,null,null,null,null,null,"w.","MARCENARIA",null,null,0,null,null,null,null,0,null,null,0]
[null,null,null,null,null,null,null,null,null,null,null,null,null,null,"x.","ADMINISTRAÇÃO",null,null,0,null,null,null,null,0,null,null,0]
[null,null,null,null,null,null,null,null,null,null,null,null,null,null,"y.","PINTURA",null,null,0,null,null,null,null,{"$f":"ROUND(S573*(1+BDI.Taxa),2)","v":0},null,null,0]
[null,null,null,null,null,null,null,null,null,null,null,null,null,null,"z.","DIVERSOS",null,null,0,null,null,null,null,{"$f":"IF(S574>0,IF((SUM(X549:Y573)+ROUND(S574*(1+BDI.Taxa),2))<>X576,X576-SUM(X549:Y573),ROUND(S574*(1+BDI.Taxa),2)),0)","v":0},null,null,{"$f":"IF(S574>0,IF((SUM(AA549:AA573)+IFERROR(ROUND($X574*100/$Z$533,2),0))<>AA576,AA576-SUM(AA549:AA573),IFERROR(ROUND($X574*100/$Z$533,2),0)),0)","v":0}]
[null,null,null,null,null,null,null,null,null,null,null,null,null,null,"TOTAL GERAL DO ORÇAMENTO (R$)",null,null,null,{"$f":"SUM(S549:W574)","v":0},null,null,null,null,{"$f":"SUM(X549:Y574)","v":0},null,null,{"$f":"SUM(AA549:AA574)","v":0}]
[null,null,null,null,null,null,null,null,null,null,null,null,null,null,null,null,null,null,{"$f":"$Z$531","v":0},null,null,null,null,{"$f":"$Z$533","v":0},null,null,100]
[null,null,null,null,null,null,null,null,null,null,null,null,null,null,null,null,null,null,"(TOTAL SEM BDI)",null,null,null,null,"(TOTAL COM BDI)",null,null,"(ARRED porcentagem)"]
[null,null,null,null,null,null,null,null,null,null,null,null,null,null,null,null,null,null,{"$f":"IF(AND(S575=S576,S575>0),\"OK\",\"ERRO\")","v":"ERRO"},null,null,null,null,{"$f":"IF(AND(X575=X576,X575>0),\"OK\",\"ERRO\")","v":"ERRO"},null,null,{"$f":"IF(AA575=100,\"OK\",\"ERRO\")","v":"ERRO"}]
[]
[]
[null,null,null,null,null,null,null,null,null,null,null,null,null,null,"RESUMO GERAL DO ORÇAMENTO"]
[null,null,null,null,null,null,null,null,null,null,null,null,null,null,"ITEM","DESCRIÇÃO DOS SERVIÇOS",null,null,"PREÇO SEM BDI",null,null,null,null,"PREÇO COM BDI",null,null,"PARTICIPAÇÃO ( % )"]
[null,null,null,null,null,null,null,null,null,null,null,null,null,null,"1.",{"$f":"IFERROR(VLOOKUP(O583,$O$19:$Y$530,4,FALSE),\"\")","v":"1. ADEQUAÇÕES EXTERNAS ACESSIBILIDADE"},null,null,{"$f":"IF(P584=\"\",$S$604-SUM(OFFSET($S$582:S582,0,0,COUNTA($S$582:S582),1)),SUMIF($R$19:$R$530,$P583,$Z$19:$Z$530))","v":0},null,null,null,null,{"$f":"IF(P584=\"\",$X$604-SUM(OFFSET($X$582:X582,0,0,COUNTA($X$582:X582),1)),ROUND(S583*(1+BDI.Taxa),2))","v":0},null,null,{"$f":"IF(P584=\"\",$AA$604-SUM(OFFSET($AA$582:AA582,0,0,COUNTA($AA$582:AA582),1)),ROUND(X583*100/ORÇAMENTO.TotalOrçamento,2))","v":{"$error":"#DIV/0!"}}]
[null,null,null,null,null,null,null,null,null,null,null,null,null,null,"2.","2. EXECUÇÃO DE NOVA COBERTURA",null,null,{"$f":"IF(P585=\"\",$S$604-SUM(OFFSET($S$582:S583,0,0,COUNTA($S$582:S583),1)),SUMIF($R$19:$R$530,$P584,$Z$19:$Z$530))","v":0},null,null,null,null,{"$f":"IF(P585=\"\",$X$604-SUM(OFFSET($X$582:X583,0,0,COUNTA($X$582:X583),1)),ROUND(S584*(1+BDI.Taxa),2))","v":0},null,null,{"$f":"IF(P585=\"\",$AA$604-SUM(OFFSET($AA$582:AA583,0,0,COUNTA($AA$582:AA583),1)),ROUND(X584*100/ORÇAMENTO.TotalOrçamento,2))","v":{"$error":"#DIV/0!"}}]
[null,null,null,null,null,null,null,null,null,null,null,null,null,null,"3.","3. REFORMA GERAL",null,null,{"$f":"IF(P586=\"\",$S$604-SUM(OFFSET($S$582:S584,0,0,COUNTA($S$582:S584),1)),SUMIF($R$19:$R$530,$P585,$Z$19:$Z$530))","v":0},null,null,null,null,{"$f":"IF(P586=\"\",$X$604-SUM(OFFSET($X$582:X584,0,0,COUNTA($X$582:X584),1)),ROUND(S585*(1+BDI.Taxa),2))","v":0},null,null,{"$f":"IF(P586=\"\",$AA$604-SUM(OFFSET($AA$582:AA584,0,0,COUNTA($AA$582:AA584),1)),ROUND(X585*100/ORÇAMENTO.TotalOrçamento,2))","v":{"$error":"#DIV/0!"}}]
[null,null,null,null,null,null,null,null,null,null,null,null,null,null,"4.","7 - IMPLANTAÇÃO DE PASSARELA COBERTA",null,null,{"$f":"IF(P587=\"\",$S$604-SUM(OFFSET($S$582:S585,0,0,COUNTA($S$582:S585),1)),SUMIF($R$19:$R$530,$P586,$Z$19:$Z$530))","v":0},null,null,null,null,{"$f":"IF(P587=\"\",$X$604-SUM(OFFSET($X$582:X585,0,0,COUNTA($X$582:X585),1)),ROUND(S586*(1+BDI.Taxa),2))","v":0},null,null,{"$f":"IF(P587=\"\",$AA$604-SUM(OFFSET($AA$582:AA585,0,0,COUNTA($AA$582:AA585),1)),ROUND(X586*100/ORÇAMENTO.TotalOrçamento,2))","v":{"$error":"#DIV/0!"}}]
[null,null,null,null,null,null,null,null,null,null,null,null,null,null,"5.","8 - IMPLANTAÇÃO DE BLOCO PADRÃO SECUC 2017",null,null,{"$f":"IF(P588=\"\",$S$604-SUM(OFFSET($S$582:S586,0,0,COUNTA($S$582:S586),1)),SUMIF($R$19:$R$530,$P587,$Z$19:$Z$530))","v":0},null,null,null,null,{"$f":"IF(P588=\"\",$X$604-SUM(OFFSET($X$582:X586,0,0,COUNTA($X$582:X586),1)),ROUND(S587*(1+BDI.Taxa),2))","v":0},null,null,{"$f":"IF(P588=\"\",$AA$604-SUM(OFFSET($AA$582:AA586,0,0,COUNTA($AA$582:AA586),1)),ROUND(X587*100/ORÇAMENTO.TotalOrçamento,2))","v":{"$error":"#DIV/0!"}}]
[null,null,null,null,null,null,null,null,null,null,null,null,null,null,"6.","BLOCO 03 SALAS PADRÃO SEDUC 2019 - LAJE",null,null,{"$f":"IF(P589=\"\",$S$604-SUM(OFFSET($S$582:S587,0,0,COUNTA($S$582:S587),1)),SUMIF($R$19:$R$530,$P588,$Z$19:$Z$530))","v":0},null,null,null,null,{"$f":"IF(P589=\"\",$X$604-SUM(OFFSET($X$582:X587,0,0,COUNTA($X$582:X587),1)),ROUND(S588*(1+BDI.Taxa),2))","v":0},null,null,{"$f":"IF(P589=\"\",$AA$604-SUM(OFFSET($AA$582:AA587,0,0,COUNTA($AA$582:AA587),1)),ROUND(X588*100/ORÇAMENTO.TotalOrçamento,2))","v":{"$error":"#DIV/0!"}}]
[null,null,null,null,null,null,null,null,null,null,null,null,null,null,"7.","PASSARELA MODELO 02 - PADRÃO SÉC. XXI 2015",null,null,{"$f":"IF(P590=\"\",$S$604-SUM(OFFSET($S$582:S588,0,0,COUNTA($S$582:S588),1)),SUMIF($R$19:$R$530,$P589,$Z$19:$Z$530))","v":0},null,null,null,null,{"$f":"IF(P590=\"\",$X$604-SUM(OFFSET($X$582:X588,0,0,COUNTA($X$582:X588),1)),ROUND(S589*(1+BDI.Taxa),2))","v":0},null,null,{"$f":"IF(P590=\"\",$AA$604-SUM(OFFSET($AA$582:AA588,0,0,COUNTA($AA$582:AA588),1)),ROUND(X589*100/ORÇAMENTO.TotalOrçamento,2))","v":{"$error":"#DIV/0!"}}]
[null,null,null,null,null,null,null,null,null,null,null,null,null,null,"8.","ADMINISTRAÇÃO LOCAL",null,null,{"$f":"IF(P591=\"\",$S$604-SUM(OFFSET($S$582:S589,0,0,COUNTA($S$582:S589),1)),SUMIF($R$19:$R$530,$P590,$Z$19:$Z$530))","v":0},null,null,null,null,{"$f":"IF(P591=\"\",$X$604-SUM(OFFSET($X$582:X589,0,0,COUNTA($X$582:X589),1)),ROUND(S590*(1+BDI.Taxa),2))","v":0},null,null,{"$f":"IF(P591=\"\",$AA$604-SUM(OFFSET($AA$582:AA589,0,0,COUNTA($AA$582:AA589),1)),ROUND(X590*100/ORÇAMENTO.TotalOrçamento,2))","v":{"$error":"#DIV/0!"}}]
[null,null,null,null,null,null,null,null,null,null,null,null,null,null,"9.","OBRAS",null,null,{"$f":"IF(P592=\"\",$S$604-SUM(OFFSET($S$582:S590,0,0,COUNTA($S$582:S590),1)),SUMIF($R$19:$R$530,$P591,$Z$19:$Z$530))","v":0},null,null,null,null,{"$f":"IF(P592=\"\",$X$604-SUM(OFFSET($X$582:X590,0,0,COUNTA($X$582:X590),1)),ROUND(S591*(1+BDI.Taxa),2))","v":0},null,null,{"$f":"IF(P592=\"\",$AA$604-SUM(OFFSET($AA$582:AA590,0,0,COUNTA($AA$582:AA590),1)),ROUND(X591*100/ORÇAMENTO.TotalOrçamento,2))","v":{"$error":"#DIV/0!"}}]
[null,null,null,null,null,null,null,null,null,null,null,null,null,null,"10.","PROJETO ELÉTRICO",null,null,{"$f":"IF(P593=\"\",$S$604-SUM(OFFSET($S$582:S591,0,0,COUNTA($S$582:S591),1)),SUMIF($R$19:$R$530,$P592,$Z$19:$Z$530))","v":0},null,null,null,null,{"$f":"IF(P593=\"\",$X$604-SUM(OFFSET($X$582:X591,0,0,COUNTA($X$582:X591),1)),ROUND(S592*(1+BDI.Taxa),2))","v":0},null,null,{"$f":"IF(P593=\"\",$AA$604-SUM(OFFSET($AA$582:AA591,0,0,COUNTA($AA$582:AA591),1)),ROUND(X592*100/ORÇAMENTO.TotalOrçamento,2))","v":{"$error":"#DIV/0!"}}]
[null,null,null,null,null,null,null,null,null,null,null,null,null,null,"11.","PROJETO DE GÁS",null,null,{"$f":"IF(P594=\"\",$S$604-SUM(OFFSET($S$582:S592,0,0,COUNTA($S$582:S592),1)),SUMIF($R$19:$R$530,$P593,$Z$19:$Z$530))","v":0},null,null,null,null,{"$f":"IF(P594=\"\",$X$604-SUM(OFFSET($X$582:X592,0,0,COUNTA($X$582:X592),1)),ROUND(S593*(1+BDI.Taxa),2))","v":0},null,null,{"$f":"IF(P594=\"\",$AA$604-SUM(OFFSET($AA$582:AA592,0,0,COUNTA($AA$582:AA592),1)),ROUND(X593*100/ORÇAMENTO.TotalOrçamento,2))","v":{"$error":"#DIV/0!"}}]
[null,null,null,null,null,null,null,null,null,null,null,null,null,null,"12.","PROJETO DE PREVENÇÃO E COMBATE A INCÊNDIO",null,null,{"$f":"IF(P595=\"\",$S$604-SUM(OFFSET($S$582:S593,0,0,COUNTA($S$582:S593),1)),SUMIF($R$19:$R$530,$P594,$Z$19:$Z$530))","v":0},null,null,null,null,{"$f":"IF(P595=\"\",$X$604-SUM(OFFSET($X$582:X593,0,0,COUNTA($X$582:X593),1)),ROUND(S594*(1+BDI.Taxa),2))","v":0},null,null,{"$f":"IF(P595=\"\",$AA$604-SUM(OFFSET($AA$582:AA593,0,0,COUNTA($AA$582:AA593),1)),ROUND(X594*100/ORÇAMENTO.TotalOrçamento,2))","v":{"$error":"#DIV/0!"}}]
[null,null,null,null,null,null,null,null,null,null,null,null,null,null,"13.","PROJETO HIDROSSANITÁRIO",null,null,{"$f":"IF(P596=\"\",$S$604-SUM(OFFSET($S$582:S594,0,0,COUNTA($S$582:S594),1)),SUMIF($R$19:$R$530,$P595,$Z$19:$Z$530))","v":0},null,null,null,null,{"$f":"IF(P596=\"\",$X$604-SUM(OFFSET($X$582:X594,0,0,COUNTA($X$582:X594),1)),ROUND(S595*(1+BDI.Taxa),2))","v":0},null,null,{"$f":"IF(P596=\"\",$AA$604-SUM(OFFSET($AA$582:AA594,0,0,COUNTA($AA$582:AA594),1)),ROUND(X595*100/ORÇAMENTO.TotalOrçamento,2))","v":{"$error":"#DIV/0!"}}]
[null,null,null,null,null,null,null,null,null,null,null,null,null,null,"14.","PROJETO ESTRUTURAL - COBERTURA",null,null,{"$f":"IF(P597=\"\",$S$604-SUM(OFFSET($S$582:S595,0,0,COUNTA($S$582:S595),1)),SUMIF($R$19:$R$530,$P596,$Z$19:$Z$530))","v":0},null,null,null,null,{"$f":"IF(P597=\"\",$X$604-SUM(OFFSET($X$582:X595,0,0,COUNTA($X$582:X595),1)),ROUND(S596*(1+BDI.Taxa),2))","v":0},null,null,{"$f":"IF(P597=\"\",$AA$604-SUM(OFFSET($AA$582:AA595,0,0,COUNTA($AA$582:AA595),1)),ROUND(X596*100/ORÇAMENTO.TotalOrçamento,2))","v":{"$error":"#DIV/0!"}}]
[null,null,null,null,null,null,null,null,null,null,null,null,null,null,"15.","PROJETO ESTRUTURAS METÁLICAS",null,null,{"$f":"IF(P598=\"\",$S$604-SUM(OFFSET($S$582:S596,0,0,COUNTA($S$582:S596),1)),SUMIF($R$19:$R$530,$P597,$Z$19:$Z$530))","v":0},null,null,null,null,{"$f":"IF(P598=\"\",$X$604-SUM(OFFSET($X$582:X596,0,0,COUNTA($X$582:X596),1)),ROUND(S597*(1+BDI.Taxa),2))","v":0},null,null,{"$f":"IF(P598=\"\",$AA$604-SUM(OFFSET($AA$582:AA596,0,0,COUNTA($AA$582:AA596),1)),ROUND(X597*100/ORÇAMENTO.TotalOrçamento,2))","v":{"$error":"#DIV/0!"}}]
[null,null,null,null,null,null,null,null,null,null,null,null,null,null,"16.","",null,null,{"$f":"IF(P599=\"\",$S$604-SUM(OFFSET($S$582:S597,0,0,COUNTA($S$582:S597),1)),SUMIF($R$19:$R$530,$P598,$Z$19:$Z$530))","v":0},null,null,null,null,{"$f":"IF(P599=\"\",$X$604-SUM(OFFSET($X$582:X597,0,0,COUNTA($X$582:X597),1)),ROUND(S598*(1+BDI.Taxa),2))","v":0},null,null,{"$f":"IF(P599=\"\",$AA$604-SUM(OFFSET($AA$582:AA597,0,0,COUNTA($AA$582:AA597),1)),ROUND(X598*100/ORÇAMENTO.TotalOrçamento,2))","v":{"$error":"#DIV/0!"}}]
[null,null,null,null,null,null,null,null,null,null,null,null,null,null,"17.","",null,null,{"$f":"IF(P600=\"\",$S$604-SUM(OFFSET($S$582:S598,0,0,COUNTA($S$582:S598),1)),SUMIF($R$19:$R$530,$P599,$Z$19:$Z$530))","v":0},null,null,null,null,{"$f":"IF(P600=\"\",$X$604-SUM(OFFSET($X$582:X598,0,0,COUNTA($X$582:X598),1)),ROUND(S599*(1+BDI.Taxa),2))","v":0},null,null,{"$f":"IF(P600=\"\",$AA$604-SUM(OFFSET($AA$582:AA598,0,0,COUNTA($AA$582:AA598),1)),ROUND(X599*100/ORÇAMENTO.TotalOrçamento,2))","v":{"$error":"#DIV/0!"}}]
[null,null,null,null,null,null,null,null,null,null,null,null,null,null,"18.","",null,null,{"$f":"IF(P601=\"\",$S$604-SUM(OFFSET($S$582:S599,0,0,COUNTA($S$582:S599),1)),SUMIF($R$19:$R$530,$P600,$Z$19:$Z$530))","v":0},null,null,null,null,{"$f":"IF(P601=\"\",$X$604-SUM(OFFSET($X$582:X599,0,0,COUNTA($X$582:X599),1)),ROUND(S600*(1+BDI.Taxa),2))","v":0},null,null,{"$f":"IF(P601=\"\",$AA$604-SUM(OFFSET($AA$582:AA599,0,0,COUNTA($AA$582:AA599),1)),ROUND(X600*100/ORÇAMENTO.TotalOrçamento,2))","v":{"$error":"#DIV/0!"}}]
[null,null,null,null,null,null,null,null,null,null,null,null,null,null,"19.","",null,null,{"$f":"IF(P602=\"\",$S$604-SUM(OFFSET($S$582:S600,0,0,COUNTA($S$582:S600),1)),SUMIF($R$19:$R$530,$P601,$Z$19:$Z$530))","v":0},null,null,null,null,{"$f":"IF(P602=\"\",$X$604-SUM(OFFSET($X$582:X600,0,0,COUNTA($X$582:X600),1)),ROUND(S601*(1+BDI.Taxa),2))","v":0},null,null,{"$f":"IF(P602=\"\",$AA$604-SUM(OFFSET($AA$582:AA600,0,0,COUNTA($AA$582:AA600),1)),ROUND(X601*100/ORÇAMENTO.TotalOrçamento,2))","v":{"$error":"#DIV/0!"}}]
[null,null,null,null,null,null,null,null,null,null,null,null,null,null,"20.","",null,null,{"$f":"IF(P603=\"\",$S$604-SUM(OFFSET($S$582:S601,0,0,COUNTA($S$582:S601),1)),SUMIF($R$19:$R$530,$P602,$Z$19:$Z$530))","v":0},null,null,null,null,{"$f":"IF(P603=\"\",$X$604-SUM(OFFSET($X$582:X601,0,0,COUNTA($X$582:X601),1)),ROUND(S602*(1+BDI.Taxa),2))","v":0},null,null,{"$f":"IF(P603=\"\",$AA$604-SUM(OFFSET($AA$582:AA601,0,0,COUNTA($AA$582:AA601),1)),ROUND(X602*100/ORÇAMENTO.TotalOrçamento,2))","v":{"$error":"#DIV/0!"}}]
[null,null,null,null,null,null,null,null,null,null,null,null,null,null,"TOTAL GERAL DO ORÇAMENTO (R$)",null,null,null,{"$f":"SUM(S583:W602)","v":0},null,null,null,null,{"$f":"SUM(X583:Y602)","v":0},null,null,{"$f":"SUM(AA583:AA602)","v":{"$error":"#DIV/0!"}}]
[null,null,null,null,null,null,null,null,null,null,null,null,null,null,null,null,null,null,{"$f":"$Z$531","v":0},null,null,null,null,{"$f":"$Z$533","v":0},null,null,100]
[null,null,null,null,null,null,null,null,null,null,null,null,null,null,null,null,null,null,"(TOTAL SEM BDI)",null,null,null,null,"(TOTAL COM BDI)",null,null,"(ARRED porcentagem)"]
[null,null,null,null,null,null,null,null,null,null,null,null,null,null,null,null,null,null,{"$f":"IF(AND(S603=S604,S603>0),\"OK\",\"ERRO\")","v":"ERRO"},null,null,null,null,{"$f":"IF(AND(X603=X604,X603>0),\"OK\",\"ERRO\")","v":"ERRO"},null,null,{"$f":"IF(AND(AA603=100,S583<>0),\"OK\",\"ERRO\")","v":{"$error":"#DIV/0!"}}]

{"sheet":"Resumo ","index":1,"n_rows":39,"n_cols":9,"rows_kept":39,"cut":false,"hidden":false,"merged":[[13,0,14,0],[15,2,15,5],[16,2,16,5],[17,2,17,5],[18,2,18,5],[14,1,14,8],[0,1,0,8],[36,1,36,5],[2,1,2,5],[3,1,3,5],[5,1,5,5],[6,1,6,5],[8,1,8,5],[9,1,9,5],[11,3,11,5],[12,3,12,5],[10,1,10,8],[11,6,11,8],[12,6,12,8],[19,2,19,5],[20,2,20,5],[21,2,21,5],[31,2,31,5],[1,1,1,8],[2,6,2,8],[3,6,3,8],[4,1,4,8],[5,6,5,8],[6,6,6,8],[7,1,7,8],[8,6,8,8],[9,6,9,8],[13,1,13,8],[11,1,11,2],[12,1,12,2],[42,3,42,7],[41,3,41,7],[38,1,38,8],[22,2,22,5],[23,2,23,5],[24,2,24,5],[25,2,25,5],[26,2,26,5],[32,2,32,5],[33,2,33,5],[34,2,34,5],[35,2,35,5],[27,2,27,5],[28,2,28,5],[29,2,29,5],[30,2,30,5]]}
[]
[]
[null,"UNIDADE ESCOLAR",null,null,null,null,"CÓDIGO INEP"]
[null,{"$f":"Orçamento!$O$4","v":"COORDENAÇÃO REGIONAL DE EDUCAÇÃO DE TRINDADE"},null,null,null,null,{"$f":"Orçamento!X4","v":0}]
[]
[null,"OBRA",null,null,null,null,"CIDADE"]
[null,{"$f":"Orçamento!$O$7","v":"REFORMA E AMPLIAÇÃO"},null,null,null,null,{"$f":"Orçamento!$X$7","v":"TRINDADE"}]
[]
[null,"ENDEREÇO",null,null,null,null,"CRE"]
[null,{"$f":"Orçamento!$R$10","v":"AVENIDA MANOEL MONTEIRO, 163 - BAIRRO SANTUÁRIO"},null,null,null,null,{"$f":"Orçamento!$O$10","v":"CRE-TRINDADE"}]
[]
[null,"REFERÊNCIA",null,"DATA",null,null,"ÁREA TOTAL CONSTRUÍDA (M²)"]
[null,{"$f":"CONCATENATE(\"AGETOP E SINAPI - \",Orçamento!$T$10)","v":"AGETOP E SINAPI - ONERADA"},null,{"$f":"Orçamento!$S$7","v":"2020-09-02"},null,null,{"$f":"Orçamento!$X$13","v":769.17}]
["FILTRO"]
[null,"RESUMO GERAL DO ORÇAMENTO"]
["↓","ITEM","DESCRIÇÃO DOS SERVIÇOS",null,null,null,"PREÇO SEM BDI","PREÇO COM BDI","PARTICIP. (%)"]
[{"$f":"IF(G17>0,\"F\",\"\")","v":""},"1.",{"$f":"Orçamento!$P583","v":"1. ADEQUAÇÕES EXTERNAS ACESSIBILIDADE"},null,null,null,{"$f":"IFERROR(Orçamento!S583,\"-\")","v":0},{"$f":"IFERROR(Orçamento!X583,\"\")","v":0},{"$f":"Orçamento!AA583","v":{"$error":"#DIV/0!"}}]
[{"$f":"IF(G18>0,\"F\",\"\")","v":""},"2.",{"$f":"Orçamento!$P584","v":"2. EXECUÇÃO DE NOVA COBERTURA"},null,null,null,{"$f":"IFERROR(Orçamento!S584,\"-\")","v":0},{"$f":"IFERROR(Orçamento!X584,\"\")","v":0},{"$f":"Orçamento!AA584","v":{"$error":"#DIV/0!"}}]
["","3.",{"$f":"Orçamento!$P585","v":"3. REFORMA GERAL"},null,null,null,{"$f":"IFERROR(Orçamento!S585,\"-\")","v":0},{"$f":"IFERROR(Orçamento!X585,\"\")","v":0},{"$f":"Orçamento!AA585","v":{"$error":"#DIV/0!"}}]
["","4.",{"$f":"Orçamento!$P586","v":"7 - IMPLANTAÇÃO DE PASSARELA COBERTA"},null,null,null,{"$f":"IFERROR(Orçamento!S586,\"-\")","v":0},{"$f":"IFERROR(Orçamento!X586,\"\")","v":0},{"$f":"Orçamento!AA586","v":{"$error":"#DIV/0!"}}]
["","5.",{"$f":"Orçamento!$P587","v":"8 - IMPLANTAÇÃO DE BLOCO PADRÃO SECUC 2017"},null,null,null,{"$f":"IFERROR(Orçamento!S587,\"-\")","v":0},{"$f":"IFERROR(Orçamento!X587,\"\")","v":0},{"$f":"Orçamento!AA587","v":{"$error":"#DIV/0!"}}]
["","6.",{"$f":"Orçamento!$P588","v":"BLOCO 03 SALAS PADRÃO SEDUC 2019 - LAJE"},null,null,null,{"$f":"IFERROR(Orçamento!S588,\"-\")","v":0},{"$f":"IFERROR(Orçamento!X588,\"\")","v":0},{"$f":"Orçamento!AA588","v":{"$error":"#DIV/0!"}}]
["","7.",{"$f":"Orçamento!$P589","v":"PASSARELA MODELO 02 - PADRÃO SÉC. XXI 2015"},null,null,null,{"$f":"IFERROR(Orçamento!S589,\"-\")","v":0},{"$f":"IFERROR(Orçamento!X589,\"\")","v":0},{"$f":"Orçamento!AA589","v":{"$error":"#DIV/0!"}}]
["","8.",{"$f":"Orçamento!$P590","v":"ADMINISTRAÇÃO LOCAL"},null,null,null,{"$f":"IFERROR(Orçamento!S590,\"-\")","v":0},{"$f":"IFERROR(Orçamento!X590,\"\")","v":0},{"$f":"Orçamento!AA590","v":{"$error":"#DIV/0!"}}]
["","9.",{"$f":"Orçamento!$P591","v":"OBRAS"},null,null,null,{"$f":"IFERROR(Orçamento!S591,\"-\")","v":0},{"$f":"IFERROR(Orçamento!X591,\"\")","v":0},{"$f":"Orçamento!AA591","v":{"$error":"#DIV/0!"}}]
["","10.",{"$f":"Orçamento!$P592","v":"PROJETO ELÉTRICO"},null,null,null,{"$f":"IFERROR(Orçamento!S592,\"-\")","v":0},{"$f":"IFERROR(Orçamento!X592,\"\")","v":0},{"$f":"Orçamento!AA592","v":{"$error":"#DIV/0!"}}]
["","11.",{"$f":"Orçamento!$P593","v":"PROJETO DE GÁS"},null,null,null,{"$f":"IFERROR(Orçamento!S593,\"-\")","v":0},{"$f":"IFERROR(Orçamento!X593,\"\")","v":0},{"$f":"Orçamento!AA593","v":{"$error":"#DIV/0!"}}]
["","12.",{"$f":"Orçamento!$P594","v":"PROJETO DE PREVENÇÃO E COMBATE A INCÊNDIO"},null,null,null,{"$f":"IFERROR(Orçamento!S594,\"-\")","v":0},{"$f":"IFERROR(Orçamento!X594,\"\")","v":0},{"$f":"Orçamento!AA594","v":{"$error":"#DIV/0!"}}]
["","13.",{"$f":"Orçamento!$P595","v":"PROJETO HIDROSSANITÁRIO"},null,null,null,{"$f":"IFERROR(Orçamento!S595,\"-\")","v":0},{"$f":"IFERROR(Orçamento!X595,\"\")","v":0},{"$f":"Orçamento!AA595","v":{"$error":"#DIV/0!"}}]
["","14.",{"$f":"Orçamento!$P596","v":"PROJETO ESTRUTURAL - COBERTURA"},null,null,null,{"$f":"IFERROR(Orçamento!S596,\"-\")","v":0},{"$f":"IFERROR(Orçamento!X596,\"\")","v":0},{"$f":"Orçamento!AA596","v":{"$error":"#DIV/0!"}}]
["","15.",{"$f":"Orçamento!$P597","v":"PROJETO ESTRUTURAS METÁLICAS"},null,null,null,{"$f":"IFERROR(Orçamento!S597,\"-\")","v":0},{"$f":"IFERROR(Orçamento!X597,\"\")","v":0},{"$f":"Orçamento!AA597","v":{"$error":"#DIV/0!"}}]
["","16.",{"$f":"Orçamento!$P598","v":""},null,null,null,{"$f":"IFERROR(Orçamento!S598,\"-\")","v":0},{"$f":"IFERROR(Orçamento!X598,\"\")","v":0},{"$f":"Orçamento!AA598","v":{"$error":"#DIV/0!"}}]
["","17.",{"$f":"Orçamento!$P599","v":""},null,null,null,{"$f":"IFERROR(Orçamento!S599,\"-\")","v":0},{"$f":"IFERROR(Orçamento!X599,\"\")","v":0},{"$f":"Orçamento!AA599","v":{"$error":"#DIV/0!"}}]
["","18.",{"$f":"Orçamento!$P600","v":""},null,null,null,{"$f":"IFERROR(Orçamento!S600,\"-\")","v":0},{"$f":"IFERROR(Orçamento!X600,\"\")","v":0},{"$f":"Orçamento!AA600","v":{"$error":"#DIV/0!"}}]
["","19.",{"$f":"Orçamento!$P601","v":""},null,null,null,{"$f":"IFERROR(Orçamento!S601,\"-\")","v":0},{"$f":"IFERROR(Orçamento!X601,\"\")","v":0},{"$f":"Orçamento!AA601","v":{"$error":"#DIV/0!"}}]
["","20.",{"$f":"Orçamento!$P602","v":""},null,null,null,{"$f":"IFERROR(Orçamento!S602,\"-\")","v":0},{"$f":"IFERROR(Orçamento!X602,\"\")","v":0},{"$f":"Orçamento!AA602","v":{"$error":"#DIV/0!"}}]
["F","TOTAL GERAL DO ORÇAMENTO (R$)",null,null,null,null,{"$f":"SUM(G17:G36)","v":0},{"$f":"SUM(H17:H36)","v":0},{"$f":"SUM(I17:I36)","v":{"$error":"#DIV/0!"}}]
["F"]
["F"]

{"sheet":"Somatório","index":2,"n_rows":45,"n_cols":6,"rows_kept":45,"cut":false,"hidden":false,"merged":[[13,0,14,0],[42,1,42,2],[44,1,44,5],[47,3,47,5],[48,3,48,5],[13,1,13,5],[9,1,9,3],[9,4,9,5],[11,1,11,2],[11,4,11,5],[12,1,12,2],[12,4,12,5],[0,1,0,5],[14,1,14,5],[2,1,2,3],[2,4,2,5],[3,1,3,3],[3,4,3,5],[5,1,5,3],[5,4,5,5],[6,1,6,3],[6,4,6,5],[8,1,8,3],[8,4,8,5],[1,1,1,5],[4,1,4,5],[7,1,7,5],[10,1,10,5]]}
[]
[]
[null,"UNIDADE ESCOLAR",null,null,"CÓDIGO INEP"]
[null,{"$f":"Orçamento!$O$4","v":"COORDENAÇÃO REGIONAL DE EDUCAÇÃO DE TRINDADE"},null,null,{"$f":"Orçamento!X4","v":0}]
[]
[null,"OBRA",null,null,"CIDADE"]
[null,{"$f":"Orçamento!$O$7","v":"REFORMA E AMPLIAÇÃO"},null,null,{"$f":"Orçamento!$X$7","v":"TRINDADE"}]
[]
[null,"ENDEREÇO",null,null,"CRE"]
[null,{"$f":"Orçamento!$R$10","v":"AVENIDA MANOEL MONTEIRO, 163 - BAIRRO SANTUÁRIO"},null,null,{"$f":"Orçamento!$O$10","v":"CRE-TRINDADE"}]
[]
[null,"REFERÊNCIA",null,"DATA","ÁREA TOTAL CONSTRUÍDA (M²)"]
[null,{"$f":"CONCATENATE(\"AGETOP E SINAPI - \",Orçamento!$T$10)","v":"AGETOP E SINAPI - ONERADA"},null,{"$f":"Orçamento!$S$7","v":"2020-09-02"},{"$f":"Orçamento!$X$13","v":769.17}]
["FILTRO"]
[null,"SOMATÓRIO DE SERVIÇOS"]
["↓","ITEM","DESCRIÇÃO DOS SERVIÇOS","PREÇO SEM BDI (R$)","PREÇO COM BDI (R$)","PARTIC.  ( % )"]
[{"$f":"IF(D17>0,\"F\",\"\")","v":""},"a.",{"$f":"Orçamento!P549","v":"SERVIÇOS PRELIMINARES"},{"$f":"Orçamento!S549","v":0},{"$f":"Orçamento!X549","v":0},{"$f":"Orçamento!AA549","v":0}]
[{"$f":"IF(D18>0,\"F\",\"\")","v":""},"b.",{"$f":"Orçamento!P550","v":"TRANSPORTES"},{"$f":"Orçamento!S550","v":0},{"$f":"Orçamento!X550","v":0},{"$f":"Orçamento!AA550","v":0}]
["","c.",{"$f":"Orçamento!P551","v":"SERVIÇO EM TERRA"},{"$f":"Orçamento!S551","v":0},{"$f":"Orçamento!X551","v":0},{"$f":"Orçamento!AA551","v":0}]
["","d.",{"$f":"Orçamento!P552","v":"FUNDAÇÕES E SONDAGENS"},{"$f":"Orçamento!S552","v":0},{"$f":"Orçamento!X552","v":0},{"$f":"Orçamento!AA552","v":0}]
["","e.",{"$f":"Orçamento!P553","v":"ESTRUTURA"},{"$f":"Orçamento!S553","v":0},{"$f":"Orçamento!X553","v":0},{"$f":"Orçamento!AA553","v":0}]
["","f.",{"$f":"Orçamento!P554","v":"INSTALAÇÕES ELÉTRICAS"},{"$f":"Orçamento!S554","v":0},{"$f":"Orçamento!X554","v":0},{"$f":"Orçamento!AA554","v":0}]
["","g.",{"$f":"Orçamento!P555","v":"INSTALAÇÕES HIDROSSANITÁRIAS"},{"$f":"Orçamento!S555","v":0},{"$f":"Orçamento!X555","v":0},{"$f":"Orçamento!AA555","v":0}]
["","h",{"$f":"Orçamento!P556","v":"INSTALAÇÕES ESPECIAIS"},{"$f":"Orçamento!S556","v":0},{"$f":"Orçamento!X556","v":0},{"$f":"Orçamento!AA556","v":0}]
["","i.",{"$f":"Orçamento!P557","v":"ALVENARIAS E DIVISÓRIAS"},{"$f":"Orçamento!S557","v":0},{"$f":"Orçamento!X557","v":0},{"$f":"Orçamento!AA557","v":0}]
["","j.",{"$f":"Orçamento!P558","v":"ALVENARIA AUTO-PORTANTE"},{"$f":"Orçamento!S558","v":0},{"$f":"Orçamento!X558","v":0},{"$f":"Orçamento!AA558","v":0}]
["","k.",{"$f":"Orçamento!P559","v":"IMPERMEABILIZAÇÃO"},{"$f":"Orçamento!S559","v":0},{"$f":"Orçamento!X559","v":0},{"$f":"Orçamento!AA559","v":0}]
["","l.",{"$f":"Orçamento!P560","v":"ISOLAMENTO TÉRMICO E ACÚSTICO"},{"$f":"Orçamento!S560","v":0},{"$f":"Orçamento!X560","v":0},{"$f":"Orçamento!AA560","v":0}]
["","m.",{"$f":"Orçamento!P561","v":"ESTRUTURA DE MADEIRA"},{"$f":"Orçamento!S561","v":0},{"$f":"Orçamento!X561","v":0},{"$f":"Orçamento!AA561","v":0}]
["","n.",{"$f":"Orçamento!P562","v":"ESTRUTURAS METÁLICAS"},{"$f":"Orçamento!S562","v":0},{"$f":"Orçamento!X562","v":0},{"$f":"Orçamento!AA562","v":0}]
["","o.",{"$f":"Orçamento!P563","v":"COBERTURAS"},{"$f":"Orçamento!S563","v":0},{"$f":"Orçamento!X563","v":0},{"$f":"Orçamento!AA563","v":0}]
["","p.",{"$f":"Orçamento!P564","v":"ESQUADRIAS DE MADEIRA"},{"$f":"Orçamento!S564","v":0},{"$f":"Orçamento!X564","v":0},{"$f":"Orçamento!AA564","v":0}]
["","q.",{"$f":"Orçamento!P565","v":"ESQUADRIAS METÁLICAS"},{"$f":"Orçamento!S565","v":0},{"$f":"Orçamento!X565","v":0},{"$f":"Orçamento!AA565","v":0}]
["","r.",{"$f":"Orçamento!P566","v":"VIDROS"},{"$f":"Orçamento!S566","v":0},{"$f":"Orçamento!X566","v":0},{"$f":"Orçamento!AA566","v":0}]
["","s.",{"$f":"Orçamento!P567","v":"REVESTIMENTO DE PAREDE"},{"$f":"Orçamento!S567","v":0},{"$f":"Orçamento!X567","v":0},{"$f":"Orçamento!AA567","v":0}]
["","t.",{"$f":"Orçamento!P568","v":"FORROS"},{"$f":"Orçamento!S568","v":0},{"$f":"Orçamento!X568","v":0},{"$f":"Orçamento!AA568","v":0}]
["","u.",{"$f":"Orçamento!P569","v":"REVESTIMENTO DE PISO"},{"$f":"Orçamento!S569","v":0},{"$f":"Orçamento!X569","v":0},{"$f":"Orçamento!AA569","v":0}]
["","v.",{"$f":"Orçamento!P570","v":"FERRAGENS"},{"$f":"Orçamento!S570","v":0},{"$f":"Orçamento!X570","v":0},{"$f":"Orçamento!AA570","v":0}]
["","w.",{"$f":"Orçamento!P571","v":"MARCENARIA"},{"$f":"Orçamento!S571","v":0},{"$f":"Orçamento!X571","v":0},{"$f":"Orçamento!AA571","v":0}]
["","x.",{"$f":"Orçamento!P572","v":"ADMINISTRAÇÃO"},{"$f":"Orçamento!S572","v":0},{"$f":"Orçamento!X572","v":0},{"$f":"Orçamento!AA572","v":0}]
["","y.",{"$f":"Orçamento!P573","v":"PINTURA"},{"$f":"Orçamento!S573","v":0},{"$f":"Orçamento!X573","v":0},{"$f":"Orçamento!AA573","v":0}]
["","z.",{"$f":"Orçamento!P574","v":"DIVERSOS"},{"$f":"Orçamento!S574","v":0},{"$f":"Orçamento!X574","v":0},{"$f":"Orçamento!AA574","v":0}]
["F","TOTAL GERAL DO ORÇAMENTO",null,{"$f":"SUM(D17:D42)","v":0},{"$f":"SUM(E17:E42)","v":0},{"$f":"SUM(F17:F42)","v":0}]
[]
[null,"(*) Para itens da AGETOP, os vidros não estão inclusos nas esquadrias e já foram considerados os custos de contramarco para as esquadrias de alumínio;"]

{"sheet":"Cronog_120_Dias","index":3,"n_rows":99,"n_cols":24,"rows_kept":99,"cut":false,"hidden":false,"merged":[[0,1,0,21],[1,1,1,21],[2,1,2,7],[2,8,2,21],[3,1,3,7],[3,8,3,21],[8,1,8,7],[8,8,8,21],[9,0,11,0],[9,1,9,7],[9,8,9,21],[10,1,10,21],[11,1,11,21],[4,1,4,21],[5,1,5,7],[5,8,5,21],[6,1,6,7],[6,8,6,21],[7,1,7,21],[12,21,13,21],[13,1,13,2],[13,5,13,8],[13,9,13,12],[13,13,13,16],[13,17,13,20],[12,0,13,0],[12,3,13,3],[12,5,12,8],[12,9,12,12],[12,13,12,16],[12,17,12,20],[17,1,19,2],[17,3,19,3],[17,4,19,4],[17,5,17,8],[17,9,17,12],[14,1,16,2],[14,3,16,3],[14,4,16,4],[14,5,14,8],[14,9,14,12],[17,13,17,16],[17,17,17,20],[19,5,19,8],[19,9,19,12],[19,13,19,16],[19,17,19,20],[14,17,14,20],[16,5,16,8],[16,9,16,12],[16,13,16,16],[16,17,16,20],[14,13,14,16],[23,1,25,2],[23,3,25,3],[23,4,25,4],[23,5,23,8],[23,9,23,12],[20,1,22,2],[20,3,22,3],[20,4,22,4],[20,5,20,8],[20,9,20,12],[23,13,23,16],[23,17,23,20],[25,5,25,8],[25,9,25,12],[25,13,25,16],[25,17,25,20],[20,17,20,20],[22,5,22,8],[22,9,22,12],[22,13,22,16],[22,17,22,20],[20,13,20,16],[29,1,31,2],[29,3,31,3],[29,4,31,4],[29,5,29,8],[29,9,29,12],[26,1,28,2],[26,3,28,3],[26,4,28,4],[26,5,26,8],[26,9,26,12],[29,13,29,16],[29,17,29,20],[31,5,31,8],[31,9,31,12],[31,13,31,16],[31,17,31,20],[26,17,26,20],[28,5,28,8],[28,9,28,12],[28,13,28,16],[28,17,28,20],[26,13,26,16],[35,1,37,2],[35,3,37,3],[35,4,37,4],[35,5,35,8],[35,9,35,12],[32,1,34,2],[32,3,34,3],[32,4,34,4],[32,5,32,8],[32,9,32,12],[35,13,35,16],[35,17,35,20],[37,5,37,8],[37,9,37,12],[37,13,37,16],[37,17,37,20],[32,17,32,20],[34,5,34,8],[34,9,34,12],[34,13,34,16],[34,17,34,20],[32,13,32,16],[41,1,43,2],[41,3,43,3],[41,4,43,4],[41,5,41,8],[41,9,41,12],[38,1,40,2],[38,3,40,3],[38,4,40,4],[38,5,38,8],[38,9,38,12],[41,13,41,16],[41,17,41,20],[43,5,43,8],[43,9,43,12],[43,13,43,16],[43,17,43,20],[38,17,38,20],[40,5,40,8],[40,9,40,12],[40,13,40,16],[40,17,40,20],[38,13,38,16],[47,1,49,2],[47,3,49,3],[47,4,49,4],[47,5,47,8],[47,9,47,12],[44,1,46,2],[44,3,46,3],[44,4,46,4],[44,5,44,8],[44,9,44,12],[47,13,47,16],[47,17,47,20],[49,5,49,8],[49,9,49,12],[49,13,49,16],[49,17,49,20],[44,17,44,20],[46,5,46,8],[46,9,46,12],[46,13,46,16],[46,17,46,20],[44,13,44,16],[53,1,55,2],[53,3,55,3],[53,4,55,4],[53,5,53,8],[53,9,53,12],[50,1,52,2],[50,3,52,3],[50,4,52,4],[50,5,50,8],[50,9,50,12],[53,13,53,16],[53,17,53,20],[55,5,55,8],[55,9,55,12],[55,13,55,16],[55,17,55,20],[50,17,50,20],[52,5,52,8],[52,9,52,12],[52,13,52,16],[52,17,52,20],[50,13,50,16],[59,1,61,2],[59,3,61,3],[59,4,61,4],[59,5,59,8],[59,9,59,12],[56,1,58,2],[56,3,58,3],[56,4,58,4],[56,5,56,8],[56,9,56,12],[59,13,59,16],[59,17,59,20],[61,5,61,8],[61,9,61,12],[61,13,61,16],[61,17,61,20],[56,17,56,20],[58,5,58,8],[58,9,58,12],[58,13,58,16],[58,17,58,20],[56,13,56,16],[65,1,67,2],[65,3,67,3],[65,4,67,4],[65,5,65,8],[65,9,65,12],[62,1,64,2],[62,3,64,3],[62,4,64,4],[62,5,62,8],[62,9,62,12],[65,13,65,16],[65,17,65,20],[67,5,67,8],[67,9,67,12],[67,13,67,16],[67,17,67,20],[62,17,62,20],[64,5,64,8],[64,9,64,12],[64,13,64,16],[64,17,64,20],[62,13,62,16],[71,1,73,2],[71,3,73,3],[71,4,73,4],[71,5,71,8],[71,9,71,12],[68,1,70,2],[68,3,70,3],[68,4,70,4],[68,5,68,8],[68,9,68,12],[71,13,71,16],[71,17,71,20],[73,5,73,8],[73,9,73,12],[73,13,73,16],[73,17,73,20],[68,17,68,20],[70,5,70,8],[70,9,70,12],[70,13,70,16],[70,17,70,20],[68,13,68,16],[77,1,79,2],[77,3,79,3],[77,4,79,4],[77,5,77,8],[77,9,77,12],[74,1,76,2],[74,3,76,3],[74,4,76,4],[74,5,74,8],[74,9,74,12],[77,13,77,16],[77,17,77,20],[79,5,79,8],[79,9,79,12],[79,13,79,16],[79,17,79,20],[74,17,74,20],[76,5,76,8],[76,9,76,12],[76,13,76,16],[76,17,76,20],[74,13,74,16],[83,1,85,2],[83,3,85,3],[83,4,85,4],[83,5,83,8],[83,9,83,12],[80,1,82,2],[80,3,82,3],[80,4,82,4],[80,5,80,8],[80,9,80,12],[83,13,83,16],[83,17,83,20],[85,5,85,8],[85,9,85,12],[85,13,85,16],[85,17,85,20],[80,17,80,20],[82,5,82,8],[82,9,82,12],[82,13,82,16],[82,17,82,20],[80,13,80,16],[89,1,91,2],[89,3,91,3],[89,4,91,4],[89,5,89,8],[89,9,89,12],[86,1,88,2],[86,3,88,3],[86,4,88,4],[86,5,86,8],[86,9,86,12],[89,13,89,16],[89,17,89,20],[91,5,91,8],[91,9,91,12],[91,13,91,16],[91,17,91,20],[86,17,86,20],[88,5,88,8],[88,9,88,12],[88,13,88,16],[88,17,88,20],[86,13,86,16],[92,1,92,2],[92,5,92,8],[92,9,92,12],[92,13,92,16],[92,17,92,20],[93,1,93,2],[93,5,93,8],[93,9,93,12],[93,13,93,16],[93,17,93,20],[97,1,97,4],[98,1,98,21],[94,1,94,2],[94,5,94,8],[94,9,94,12],[94,13,94,16],[94,17,94,20],[95,1,95,2],[95,5,95,8],[95,9,95,12],[95,13,95,16],[95,17,95,20]]}
[]
[]
[null,"UNIDADE ESCOLAR",null,null,null,null,null,null,"PRAZO"]
[null,{"$f":"Orçamento!O4","v":"COORDENAÇÃO REGIONAL DE EDUCAÇÃO DE TRINDADE"},null,null,null,null,null,null,"120 DIAS CORRIDOS"]
[]
[null,"OBRA",null,null,null,null,null,null,"DATA"]
[null,{"$f":"Orçamento!O7","v":"REFORMA E AMPLIAÇÃO"},null,null,null,null,null,null,{"$f":"Orçamento!S7","v":"2020-09-02"}]
[]
[null,"LOCAL",null,null,null,null,null,null,"ÁREA TOTAL CONSTRUÍDA (M²)"]
["FILTRO",{"$f":"Orçamento!X7","v":"TRINDADE"},null,null,null,null,null,null,{"$f":"Orçamento!X13","v":769.17}]
[]
[null,"CRONOGRAMA - FÍSICO FINANCEIRO"]
["↓","CUSTO TOTAL:",{"$f":"D93","v":0},"VALOR","Dias:",30,null,null,null,60,null,null,null,90,null,null,null,120,null,null,null,"TOTAL"]
[null,"DESCRIÇÃO DOS SERVIÇOS",null,null,"%","1ª PARCELA",null,null,null,"2ª PARCELA",null,null,null,"3ª PARCELA",null,null,null,"4ª PARCELA"]
[{"$f":"IF(D15>0,\"F\",\"\")","v":""},"SERVIÇOS PRELIMINARES",null,{"$f":"Orçamento!X549","v":0},{"$f":"Orçamento!AA549","v":0},{"$f":"ROUND(F17*$D$15,2)","v":0},null,null,null,{"$f":"ROUND(J17*$D$15,2)","v":0},null,null,null,{"$f":"ROUND(N17*$D$15,2)","v":0},null,null,null,{"$f":"ROUND(R17*$D$15,2)","v":0},null,null,null,{"$f":"SUM(F15:U15)","v":0},null,{"$f":"IF(D15=V15,\"OK\",\"ERRO\")","v":"OK"}]
[{"$f":"IF(A15=\"F\",A15,\"\")","v":""}]
[{"$f":"IF(A16=\"F\",A16,\"\")","v":""},null,null,null,null,1,null,null,null,0,null,null,null,0,null,null,null,{"$f":"100%-(SUM(F17:Q17))","v":0},null,null,null,{"$f":"IFERROR(E15/100,\"\")","v":0},null,{"$f":"IF(E15=V17*100,\"OK\",\"ERRO\")","v":"OK"}]
[{"$f":"IF(D18>0,\"F\",\"\")","v":""},"TRANSPORTES",null,{"$f":"Orçamento!X550","v":0},{"$f":"Orçamento!AA550","v":0},{"$f":"ROUND(F20*$D$18,2)","v":0},null,null,null,{"$f":"ROUND(J20*$D$18,2)","v":0},null,null,null,{"$f":"ROUND(N20*$D$18,2)","v":0},null,null,null,{"$f":"ROUND(R20*$D$18,2)","v":0},null,null,null,{"$f":"SUM(F18:U18)","v":0},null,{"$f":"IF(D18=V18,\"OK\",\"ERRO\")","v":"OK"}]
[{"$f":"IF(A18=\"F\",A18,\"\")","v":""}]
[{"$f":"IF(A19=\"F\",A19,\"\")","v":""},null,null,null,null,0.24875188013668972,null,null,null,{"$f":"F20","v":0.24875188013668972},null,null,null,{"$f":"F20","v":0.24875188013668972},null,null,null,{"$f":"100%-(SUM(F20:Q20))","v":0.2537443595899308},null,null,null,{"$f":"IFERROR(E18/100,\"\")","v":0},null,{"$f":"IF(E18=V20*100,\"OK\",\"ERRO\")","v":"OK"}]
[{"$f":"IF(D21>0,\"F\",\"\")","v":""},"SERVIÇO EM TERRA",null,{"$f":"Orçamento!X551","v":0},{"$f":"Orçamento!AA551","v":0},{"$f":"ROUND(F23*$D$21,2)","v":0},null,null,null,{"$f":"ROUND(J23*$D$21,2)","v":0},null,null,null,{"$f":"ROUND(N23*$D$21,2)","v":0},null,null,null,{"$f":"ROUND(R23*$D$21,2)","v":0},null,null,null,{"$f":"SUM(F21:U21)","v":0},null,{"$f":"IF(D21=V21,\"OK\",\"ERRO\")","v":"OK"}]
[{"$f":"IF(A21=\"F\",A21,\"\")","v":""}]
[{"$f":"IF(A22=\"F\",A22,\"\")","v":""},null,null,null,null,1,null,null,null,0,null,null,null,0,null,null,null,{"$f":"100%-(SUM(F23:Q23))","v":0},null,null,null,{"$f":"IFERROR(E21/100,\"\")","v":0},null,{"$f":"IF(E21=V23*100,\"OK\",\"ERRO\")","v":"OK"}]
[{"$f":"IF(D24>0,\"F\",\"\")","v":""},"FUNDAÇÕES E SONDAGENS",null,{"$f":"Orçamento!X552","v":0},{"$f":"Orçamento!AA552","v":0},{"$f":"ROUND(F26*$D$24,2)","v":0},null,null,null,{"$f":"ROUND(J26*$D$24,2)","v":0},null,null,null,{"$f":"ROUND(N26*$D$24,2)","v":0},null,null,null,{"$f":"ROUND(R26*$D$24,2)","v":0},null,null,null,{"$f":"SUM(F24:U24)","v":0},null,{"$f":"IF(D24=V24,\"OK\",\"ERRO\")","v":"OK"}]
[{"$f":"IF(A24=\"F\",A24,\"\")","v":""}]
[{"$f":"IF(A25=\"F\",A25,\"\")","v":""},null,null,null,null,1,null,null,null,0,null,null,null,null,null,null,null,{"$f":"100%-(SUM(F26:Q26))","v":0},null,null,null,{"$f":"IFERROR(E24/100,\"\")","v":0},null,{"$f":"IF(E24=V26*100,\"OK\",\"ERRO\")","v":"OK"}]
[{"$f":"IF(D27>0,\"F\",\"\")","v":""},"ESTRUTURA",null,{"$f":"Orçamento!X553","v":0},{"$f":"Orçamento!AA553","v":0},{"$f":"ROUND(F29*$D$27,2)","v":0},null,null,null,{"$f":"ROUND(J29*$D$27,2)","v":0},null,null,null,{"$f":"ROUND(N29*$D$27,2)","v":0},null,null,null,{"$f":"ROUND(R29*$D$27,2)","v":0},null,null,null,{"$f":"SUM(F27:U27)","v":0},null,{"$f":"IF(D27=V27,\"OK\",\"ERRO\")","v":"OK"}]
[{"$f":"IF(A27=\"F\",A27,\"\")","v":""}]
[{"$f":"IF(A28=\"F\",A28,\"\")","v":""},null,null,null,null,0.43,null,null,null,{"$f":"1-F29","v":0.57000000000000006},null,null,null,0,null,null,null,{"$f":"100%-(SUM(F29:Q29))","v":0},null,null,null,{"$f":"IFERROR(E27/100,\"\")","v":0},null,{"$f":"IF(E27=V29*100,\"OK\",\"ERRO\")","v":"OK"}]
[{"$f":"IF(D30>0,\"F\",\"\")","v":""},"INST.ELET/TELEFÔNICA/CABEAMENTO ESTRUTURADO",null,{"$f":"Orçamento!X554","v":0},{"$f":"Orçamento!AA554","v":0},{"$f":"ROUND(F32*$D$30,2)","v":0},null,null,null,{"$f":"ROUND(J32*$D$30,2)","v":0},null,null,null,{"$f":"ROUND(N32*$D$30,2)","v":0},null,null,null,{"$f":"ROUND(R32*$D$30,2)","v":0},null,null,null,{"$f":"SUM(F30:U30)","v":0},null,{"$f":"IF(D30=V30,\"OK\",\"ERRO\")","v":"OK"}]
[{"$f":"IF(A30=\"F\",A30,\"\")","v":""}]
[{"$f":"IF(A31=\"F\",A31,\"\")","v":""},null,null,null,null,null,null,null,null,0.75,null,null,null,0.25,null,null,null,{"$f":"100%-(SUM(F32:Q32))","v":0},null,null,null,{"$f":"IFERROR(E30/100,\"\")","v":0},null,{"$f":"IF(E30=V32*100,\"OK\",\"ERRO\")","v":"OK"}]
[{"$f":"IF(D33>0,\"F\",\"\")","v":""},"INSTALAÇÕES HIDROSSANITÁRIAS",null,{"$f":"Orçamento!X555","v":0},{"$f":"Orçamento!AA555","v":0},{"$f":"ROUND(F35*$D$33,2)","v":0},null,null,null,{"$f":"ROUND(J35*$D$33,2)","v":0},null,null,null,{"$f":"ROUND(N35*$D$33,2)","v":0},null,null,null,{"$f":"ROUND(R35*$D$33,2)","v":0},null,null,null,{"$f":"SUM(F33:U33)","v":0},null,{"$f":"IF(D33=V33,\"OK\",\"ERRO\")","v":"OK"}]
[{"$f":"IF(A33=\"F\",A33,\"\")","v":""}]
[{"$f":"IF(A34=\"F\",A34,\"\")","v":""},null,null,null,null,null,null,null,null,0.75,null,null,null,0.25,null,null,null,{"$f":"100%-(SUM(F35:Q35))","v":0},null,null,null,{"$f":"IFERROR(E33/100,\"\")","v":0},null,{"$f":"IF(E33=V35*100,\"OK\",\"ERRO\")","v":"OK"}]
[{"$f":"IF(D36>0,\"F\",\"\")","v":""},"INSTALAÇÕES ESPECIAIS",null,{"$f":"Orçamento!X556","v":0},{"$f":"Orçamento!AA556","v":0},{"$f":"ROUND(F38*$D$36,2)","v":0},null,null,null,{"$f":"ROUND(J38*$D$36,2)","v":0},null,null,null,{"$f":"ROUND(N38*$D$36,2)","v":0},null,null,null,{"$f":"ROUND(R38*$D$36,2)","v":0},null,null,null,{"$f":"SUM(F36:U36)","v":0},null,{"$f":"IF(D36=V36,\"OK\",\"ERRO\")","v":"OK"}]
[{"$f":"IF(A36=\"F\",A36,\"\")","v":""}]
[{"$f":"IF(A37=\"F\",A37,\"\")","v":""},null,null,null,null,null,null,null,null,0.63,null,null,null,0.37,null,null,null,{"$f":"100%-(SUM(F38:Q38))","v":0},null,null,null,{"$f":"IFERROR(E36/100,\"\")","v":0},null,{"$f":"IF(E36=V38*100,\"OK\",\"ERRO\")","v":"OK"}]
[{"$f":"IF(D39>0,\"F\",\"\")","v":""},"ALVENARIA E DIVISÓRIAS",null,{"$f":"Orçamento!X557","v":0},{"$f":"Orçamento!AA557","v":0},{"$f":"ROUND(F41*$D$39,2)","v":0},null,null,null,{"$f":"ROUND(J41*$D$39,2)","v":0},null,null,null,{"$f":"ROUND(N41*$D$39,2)","v":0},null,null,null,{"$f":"ROUND(R41*$D$39,2)","v":0},null,null,null,{"$f":"SUM(F39:U39)","v":0},null,{"$f":"IF(D39=V39,\"OK\",\"ERRO\")","v":"OK"}]
[{"$f":"IF(A39=\"F\",A39,\"\")","v":""}]
[{"$f":"IF(A40=\"F\",A40,\"\")","v":""},null,null,null,null,null,null,null,null,0.63,null,null,null,0.37,null,null,null,{"$f":"100%-(SUM(F41:Q41))","v":0},null,null,null,{"$f":"IFERROR(E39/100,\"\")","v":0},null,{"$f":"IF(E39=V41*100,\"OK\",\"ERRO\")","v":"OK"}]
[{"$f":"IF(D42>0,\"F\",\"\")","v":""},"ALVENARIA AUTO-PORTANTE",null,{"$f":"Orçamento!X558","v":0},{"$f":"Orçamento!AA558","v":0},{"$f":"ROUND(F44*$D$42,2)","v":0},null,null,null,{"$f":"ROUND(J44*$D$42,2)","v":0},null,null,null,{"$f":"ROUND(N44*$D$42,2)","v":0},null,null,null,{"$f":"ROUND(R44*$D$42,2)","v":0},null,null,null,{"$f":"SUM(F42:U42)","v":0},null,{"$f":"IF(D42=V42,\"OK\",\"ERRO\")","v":"OK"}]
[{"$f":"IF(A42=\"F\",A42,\"\")","v":""}]
[{"$f":"IF(A43=\"F\",A43,\"\")","v":""},null,null,null,null,null,null,null,null,0.63,null,null,null,0.37,null,null,null,{"$f":"100%-(SUM(F44:Q44))","v":0},null,null,null,{"$f":"IFERROR(E42/100,\"\")","v":0},null,{"$f":"IF(E42=V44*100,\"OK\",\"ERRO\")","v":"OK"}]
[{"$f":"IF(D45>0,\"F\",\"\")","v":""},"IMPERMEABILIZAÇÃO",null,{"$f":"Orçamento!X559","v":0},{"$f":"Orçamento!AA559","v":0},{"$f":"ROUND(F47*$D$45,2)","v":0},null,null,null,{"$f":"ROUND(J47*$D$45,2)","v":0},null,null,null,{"$f":"ROUND(N47*$D$45,2)","v":0},null,null,null,{"$f":"ROUND(R47*$D$45,2)","v":0},null,null,null,{"$f":"SUM(F45:U45)","v":0},null,{"$f":"IF(D45=V45,\"OK\",\"ERRO\")","v":"OK"}]
[{"$f":"IF(A45=\"F\",A45,\"\")","v":""}]
[{"$f":"IF(A46=\"F\",A46,\"\")","v":""},null,null,null,null,0.32619999999999999,null,null,null,{"$f":"F47","v":0.32619999999999999},null,null,null,{"$f":"100%-F47-J47","v":0.34759999999999996},null,null,null,{"$f":"100%-(SUM(F47:Q47))","v":0},null,null,null,{"$f":"IFERROR(E45/100,\"\")","v":0},null,{"$f":"IF(E45=V47*100,\"OK\",\"ERRO\")","v":"OK"}]
[{"$f":"IF(D48>0,\"F\",\"\")","v":""},"ISOLAMENTO TÉRMICO E ACÚSTICO",null,{"$f":"Orçamento!X560","v":0},{"$f":"Orçamento!AA560","v":0},{"$f":"ROUND(F50*$D$48,2)","v":0},null,null,null,{"$f":"ROUND(J50*$D$48,2)","v":0},null,null,null,{"$f":"ROUND(N50*$D$48,2)","v":0},null,null,null,{"$f":"ROUND(R50*$D$48,2)","v":0},null,null,null,{"$f":"SUM(F48:U48)","v":0},null,{"$f":"IF(D48=V48,\"OK\",\"ERRO\")","v":"OK"}]
[{"$f":"IF(A48=\"F\",A48,\"\")","v":""}]
[{"$f":"IF(A49=\"F\",A49,\"\")","v":""},null,null,null,null,null,null,null,null,0.55000000000000004,null,null,null,0.4,null,null,null,{"$f":"100%-(SUM(F50:Q50))","v":4.9999999999999933E-2},null,null,null,{"$f":"IFERROR(E48/100,\"\")","v":0},null,{"$f":"IF(E48=V50*100,\"OK\",\"ERRO\")","v":"OK"}]
[{"$f":"IF(D51>0,\"F\",\"\")","v":""},"ESTRUTURA DE MADEIRA",null,{"$f":"Orçamento!X561","v":0},{"$f":"Orçamento!AA561","v":0},{"$f":"ROUND(F53*$D$51,2)","v":0},null,null,null,{"$f":"ROUND(J53*$D$51,2)","v":0},null,null,null,{"$f":"ROUND(N53*$D$51,2)","v":0},null,null,null,{"$f":"ROUND(R53*$D$51,2)","v":0},null,null,null,{"$f":"SUM(F51:U51)","v":0},null,{"$f":"IF(D51=V51,\"OK\",\"ERRO\")","v":"OK"}]
[{"$f":"IF(A51=\"F\",A51,\"\")","v":""}]
[{"$f":"IF(A52=\"F\",A52,\"\")","v":""},null,null,null,null,null,null,null,null,0.35,null,null,null,0.65,null,null,null,{"$f":"100%-(SUM(F53:Q53))","v":0},null,null,null,{"$f":"IFERROR(E51/100,\"\")","v":0},null,{"$f":"IF(E51=V53*100,\"OK\",\"ERRO\")","v":"OK"}]
[{"$f":"IF(D54>0,\"F\",\"\")","v":""},"ESTRUTURA METÁLICA",null,{"$f":"Orçamento!X562","v":0},{"$f":"Orçamento!AA562","v":0},{"$f":"ROUND(F56*$D$54,2)","v":0},null,null,null,{"$f":"ROUND(J56*$D$54,2)","v":0},null,null,null,{"$f":"ROUND(N56*$D$54,2)","v":0},null,null,null,{"$f":"ROUND(R56*$D$54,2)","v":0},null,null,null,{"$f":"SUM(F54:U54)","v":0},null,{"$f":"IF(D54=V54,\"OK\",\"ERRO\")","v":"OK"}]
[{"$f":"IF(A54=\"F\",A54,\"\")","v":""}]
[{"$f":"IF(A55=\"F\",A55,\"\")","v":""},null,null,null,null,null,null,null,null,0.35,null,null,null,0.65,null,null,null,{"$f":"100%-(SUM(F56:Q56))","v":0},null,null,null,{"$f":"IFERROR(E54/100,\"\")","v":0},null,{"$f":"IF(E54=V56*100,\"OK\",\"ERRO\")","v":"OK"}]
[{"$f":"IF(D57>0,\"F\",\"\")","v":""},"COBERTURAS",null,{"$f":"Orçamento!X563","v":0},{"$f":"Orçamento!AA563","v":0},{"$f":"ROUND(F59*$D$57,2)","v":0},null,null,null,{"$f":"ROUND(J59*$D$57,2)","v":0},null,null,null,{"$f":"ROUND(N59*$D$57,2)","v":0},null,null,null,{"$f":"ROUND(R59*$D$57,2)","v":0},null,null,null,{"$f":"SUM(F57:U57)","v":0},null,{"$f":"IF(D57=V57,\"OK\",\"ERRO\")","v":"OK"}]
[{"$f":"IF(A57=\"F\",A57,\"\")","v":""}]
[{"$f":"IF(A58=\"F\",A58,\"\")","v":""},null,null,null,null,null,null,null,null,null,null,null,null,0.56000000000000005,null,null,null,{"$f":"100%-(SUM(F59:Q59))","v":0.43999999999999995},null,null,null,{"$f":"IFERROR(E57/100,\"\")","v":0},null,{"$f":"IF(E57=V59*100,\"OK\",\"ERRO\")","v":"OK"}]
[{"$f":"IF(D60>0,\"F\",\"\")","v":""},"ESQUADRIAS DE MADEIRA",null,{"$f":"Orçamento!X564","v":0},{"$f":"Orçamento!AA564","v":0},{"$f":"ROUND(F62*$D$60,2)","v":0},null,null,null,{"$f":"ROUND(J62*$D$60,2)","v":0},null,null,null,{"$f":"ROUND(N62*$D$60,2)","v":0},null,null,null,{"$f":"ROUND(R62*$D$60,2)","v":0},null,null,null,{"$f":"SUM(F60:U60)","v":0},null,{"$f":"IF(D60=V60,\"OK\",\"ERRO\")","v":"OK"}]
[{"$f":"IF(A60=\"F\",A60,\"\")","v":""}]
[{"$f":"IF(A61=\"F\",A61,\"\")","v":""},null,null,null,null,null,null,null,null,null,null,null,null,0.55000000000000004,null,null,null,{"$f":"100%-(SUM(F62:Q62))","v":0.44999999999999996},null,null,null,{"$f":"IFERROR(E60/100,\"\")","v":0},null,{"$f":"IF(E60=V62*100,\"OK\",\"ERRO\")","v":"OK"}]
[{"$f":"IF(D63>0,\"F\",\"\")","v":""},"ESQUADRIAS METÁLICAS",null,{"$f":"Orçamento!X565","v":0},{"$f":"Orçamento!AA565","v":0},{"$f":"ROUND(F65*$D$63,2)","v":0},null,null,null,{"$f":"ROUND(J65*$D$63,2)","v":0},null,null,null,{"$f":"ROUND(N65*$D$63,2)","v":0},null,null,null,{"$f":"ROUND(R65*$D$63,2)","v":0},null,null,null,{"$f":"SUM(F63:U63)","v":0},null,{"$f":"IF(D63=V63,\"OK\",\"ERRO\")","v":"OK"}]
[{"$f":"IF(A63=\"F\",A63,\"\")","v":""}]
[{"$f":"IF(A64=\"F\",A64,\"\")","v":""},null,null,null,null,null,null,null,null,null,null,null,null,0.55000000000000004,null,null,null,{"$f":"100%-(SUM(F65:Q65))","v":0.44999999999999996},null,null,null,{"$f":"IFERROR(E63/100,\"\")","v":0},null,{"$f":"IF(E63=V65*100,\"OK\",\"ERRO\")","v":"OK"}]
[{"$f":"IF(D66>0,\"F\",\"\")","v":""},"VIDROS",null,{"$f":"Orçamento!X566","v":0},{"$f":"Orçamento!AA566","v":0},{"$f":"ROUND(F68*$D$66,2)","v":0},null,null,null,{"$f":"ROUND(J68*$D$66,2)","v":0},null,null,null,{"$f":"ROUND(N68*$D$66,2)","v":0},null,null,null,{"$f":"ROUND(R68*$D$66,2)","v":0},null,null,null,{"$f":"SUM(F66:U66)","v":0},null,{"$f":"IF(D66=V66,\"OK\",\"ERRO\")","v":"OK"}]
[{"$f":"IF(A66=\"F\",A66,\"\")","v":""}]
[{"$f":"IF(A67=\"F\",A67,\"\")","v":""},null,null,null,null,null,null,null,null,null,null,null,null,0,null,null,null,1,null,null,null,{"$f":"IFERROR(E66/100,\"\")","v":0},null,{"$f":"IF(E66=V68*100,\"OK\",\"ERRO\")","v":"OK"}]
[{"$f":"IF(D69>0,\"F\",\"\")","v":""},"REVESTIMENTO DE PAREDE",null,{"$f":"Orçamento!X567","v":0},{"$f":"Orçamento!AA567","v":0},{"$f":"ROUND(F71*$D$69,2)","v":0},null,null,null,{"$f":"ROUND(J71*$D$69,2)","v":0},null,null,null,{"$f":"ROUND(N71*$D$69,2)","v":0},null,null,null,{"$f":"ROUND(R71*$D$69,2)","v":0},null,null,null,{"$f":"SUM(F69:U69)","v":0},null,{"$f":"IF(D69=V69,\"OK\",\"ERRO\")","v":"OK"}]
[{"$f":"IF(A69=\"F\",A69,\"\")","v":""}]
[{"$f":"IF(A70=\"F\",A70,\"\")","v":""},null,null,null,null,null,null,null,null,null,null,null,null,1,null,null,null,{"$f":"100%-(SUM(F71:Q71))","v":0},null,null,null,{"$f":"IFERROR(E69/100,\"\")","v":0},null,{"$f":"IF(E69=V71*100,\"OK\",\"ERRO\")","v":"OK"}]
[{"$f":"IF(D72>0,\"F\",\"\")","v":""},"FORROS",null,{"$f":"Orçamento!X568","v":0},{"$f":"Orçamento!AA568","v":0},{"$f":"ROUND(F74*$D$72,2)","v":0},null,null,null,{"$f":"ROUND(J74*$D$72,2)","v":0},null,null,null,{"$f":"ROUND(N74*$D$72,2)","v":0},null,null,null,{"$f":"ROUND(R74*$D$72,2)","v":0},null,null,null,{"$f":"SUM(F72:U72)","v":0},null,{"$f":"IF(D72=V72,\"OK\",\"ERRO\")","v":"OK"}]
[{"$f":"IF(A72=\"F\",A72,\"\")","v":""}]
[{"$f":"IF(A73=\"F\",A73,\"\")","v":""},null,null,null,null,null,null,null,null,null,null,null,null,0.4,null,null,null,{"$f":"100%-(SUM(F74:Q74))","v":0.6},null,null,null,{"$f":"IFERROR(E72/100,\"\")","v":0},null,{"$f":"IF(E72=V74*100,\"OK\",\"ERRO\")","v":"OK"}]
[{"$f":"IF(D75>0,\"F\",\"\")","v":""},"REVESTIMENTO DE PISO",null,{"$f":"Orçamento!X569","v":0},{"$f":"Orçamento!AA569","v":0},{"$f":"ROUND(F77*$D$75,2)","v":0},null,null,null,{"$f":"ROUND(J77*$D$75,2)","v":0},null,null,null,{"$f":"ROUND(N77*$D$75,2)","v":0},null,null,null,{"$f":"ROUND(R77*$D$75,2)","v":0},null,null,null,{"$f":"SUM(F75:U75)","v":0},null,{"$f":"IF(D75=V75,\"OK\",\"ERRO\")","v":"OK"}]
[{"$f":"IF(A75=\"F\",A75,\"\")","v":""}]
[{"$f":"IF(A76=\"F\",A76,\"\")","v":""},null,null,null,null,null,null,null,null,null,null,null,null,0.4,null,null,null,{"$f":"100%-(SUM(F77:Q77))","v":0.6},null,null,null,{"$f":"IFERROR(E75/100,\"\")","v":0},null,{"$f":"IF(E75=V77*100,\"OK\",\"ERRO\")","v":"OK"}]
[{"$f":"IF(D78>0,\"F\",\"\")","v":""},"FERRAGENS",null,{"$f":"Orçamento!X570","v":0},{"$f":"Orçamento!AA570","v":0},{"$f":"ROUND(F80*$D$78,2)","v":0},null,null,null,{"$f":"ROUND(J80*$D$78,2)","v":0},null,null,null,{"$f":"ROUND(N80*$D$78,2)","v":0},null,null,null,{"$f":"ROUND(R80*$D$78,2)","v":0},null,null,null,{"$f":"SUM(F78:U78)","v":0},null,{"$f":"IF(D78=V78,\"OK\",\"ERRO\")","v":"OK"}]
[{"$f":"IF(A78=\"F\",A78,\"\")","v":""}]
[{"$f":"IF(A79=\"F\",A79,\"\")","v":""},null,null,null,null,null,null,null,null,null,null,null,null,null,null,null,null,{"$f":"100%-(SUM(F80:Q80))","v":1},null,null,null,{"$f":"IFERROR(E78/100,\"\")","v":0},null,{"$f":"IF(E78=V80*100,\"OK\",\"ERRO\")","v":"OK"}]
[{"$f":"IF(D81>0,\"F\",\"\")","v":""},"MARCENARIA",null,{"$f":"Orçamento!X571","v":0},{"$f":"Orçamento!AA571","v":0},{"$f":"ROUND(F83*$D$81,2)","v":0},null,null,null,{"$f":"ROUND(J83*$D$81,2)","v":0},null,null,null,{"$f":"ROUND(N83*$D$81,2)","v":0},null,null,null,{"$f":"ROUND(R83*$D$81,2)","v":0},null,null,null,{"$f":"SUM(F81:U81)","v":0},null,{"$f":"IF(D81=V81,\"OK\",\"ERRO\")","v":"OK"}]
[{"$f":"IF(A81=\"F\",A81,\"\")","v":""}]
[{"$f":"IF(A82=\"F\",A82,\"\")","v":""},null,null,null,null,null,null,null,null,null,null,null,null,null,null,null,null,{"$f":"100%-(SUM(F83:Q83))","v":1},null,null,null,{"$f":"IFERROR(E81/100,\"\")","v":0},null,{"$f":"IF(E81=V83*100,\"OK\",\"ERRO\")","v":"OK"}]
[{"$f":"IF(D84>0,\"F\",\"\")","v":""},"ADMINISTRAÇÃO - MENSALISTAS",null,{"$f":"Orçamento!X572","v":0},{"$f":"Orçamento!AA572","v":0},{"$f":"ROUND(F86*$D$84,2)","v":0},null,null,null,{"$f":"ROUND(J86*$D$84,2)","v":0},null,null,null,{"$f":"ROUND(N86*$D$84,2)","v":0},null,null,null,{"$f":"ROUND(R86*$D$84,2)","v":0},null,null,null,{"$f":"SUM(F84:U84)","v":0},null,{"$f":"IF(D84=V84,\"OK\",\"ERRO\")","v":"OK"}]
[{"$f":"IF(A84=\"F\",A84,\"\")","v":""}]
[{"$f":"IF(A85=\"F\",A85,\"\")","v":""},null,null,null,null,0.26,null,null,null,0.26,null,null,null,0.25,null,null,null,{"$f":"100%-(SUM(F86:Q86))","v":0.22999999999999998},null,null,null,{"$f":"IFERROR(E84/100,\"\")","v":0},null,{"$f":"IF(E84=V86*100,\"OK\",\"ERRO\")","v":"OK"}]
[{"$f":"IF(D87>0,\"F\",\"\")","v":""},"PINTURA",null,{"$f":"Orçamento!X573","v":0},{"$f":"Orçamento!AA573","v":0},{"$f":"ROUND(F89*$D$87,2)","v":0},null,null,null,{"$f":"ROUND(J89*$D$87,2)","v":0},null,null,null,{"$f":"ROUND(N89*$D$87,2)","v":0},null,null,null,{"$f":"ROUND(R89*$D$87,2)","v":0},null,null,null,{"$f":"SUM(F87:U87)","v":0},null,{"$f":"IF(D87=V87,\"OK\",\"ERRO\")","v":"OK"}]
[{"$f":"IF(A87=\"F\",A87,\"\")","v":""}]
[{"$f":"IF(A88=\"F\",A88,\"\")","v":""},null,null,null,null,null,null,null,null,null,null,null,null,0.36,null,null,null,{"$f":"100%-(SUM(F89:Q89))","v":0.64},null,null,null,{"$f":"IFERROR(E87/100,\"\")","v":0},null,{"$f":"IF(E87=V89*100,\"OK\",\"ERRO\")","v":"OK"}]
[{"$f":"IF(D90>0,\"F\",\"\")","v":""},"DIVERSOS",null,{"$f":"Orçamento!X574","v":0},{"$f":"Orçamento!AA574","v":0},{"$f":"ROUND(F92*$D$90,2)","v":0},null,null,null,{"$f":"ROUND(J92*$D$90,2)","v":0},null,null,null,{"$f":"ROUND(N92*$D$90,2)","v":0},null,null,null,{"$f":"ROUND(R92*$D$90,2)","v":0},null,null,null,{"$f":"SUM(F90:U90)","v":0},null,{"$f":"IF(D90=V90,\"OK\",\"ERRO\")","v":"OK"}]
[{"$f":"IF(A90=\"F\",A90,\"\")","v":""}]
[{"$f":"IF(A91=\"F\",A91,\"\")","v":""},null,null,null,null,0.25755,null,null,null,0.255,null,null,null,0.255,null,null,null,{"$f":"100%-(SUM(F92:Q92))","v":0.23244999999999993},null,null,null,{"$f":"IFERROR(E90/100,\"\")","v":0},null,{"$f":"IF(E90=V92*100,\"OK\",\"ERRO\")","v":"OK"}]
["F","CUSTO DO ORÇAMENTO",null,{"$f":"SUM(D15:D92)","v":0},{"$f":"SUM(E15:E92)","v":0},{"$f":"F15+F18+F21+F24+F27+F30+F33+F36+F39+F42+F45+F48+F51+F54+F57+F60+F63+F66+F69+F72+F75+F78+F81+F84+F87+F90","v":0},null,null,null,{"$f":"J15+J18+J21+J24+J27+J30+J33+J36+J39+J42+J45+J48+J51+J54+J57+J60+J63+J66+J69+J72+J75+J78+J81+J84+J87+J90","v":0},null,null,null,{"$f":"N15+N18+N21+N24+N27+N30+N33+N36+N39+N42+N45+N48+N51+N54+N57+N60+N63+N66+N69+N72+N75+N78+N81+N84+N87+N90","v":0},null,null,null,{"$f":"R15+R18+R21+R24+R27+R30+R33+R36+R39+R42+R45+R48+R51+R54+R57+R60+R63+R66+R69+R72+R75+R78+R81+R84+R87+R90","v":0},null,null,null,{"$f":"V15+V18+V21+V24+V27+V30+V33+V36+V39+V42+V45+V48+V51+V54+V57+V60+V63+V66+V69+V72+V75+V78+V81+V84+V87+V90","v":0}]
["F","PERCENTUAIS:",null,null,null,{"$f":"IFERROR(F93/$D$93,\"\")","v":""},null,null,null,{"$f":"IFERROR(J93/$D$93,\"\")","v":""},null,null,null,{"$f":"IFERROR(N93/$D$93,\"\")","v":""},null,null,null,{"$f":"IFERROR(R93/$D$93,\"\")","v":""},null,null,null,{"$f":"SUM(F94:U94)","v":0}]
["F","TOTAIS ACUMULADOS:",null,null,null,{"$f":"F93","v":0},null,null,null,{"$f":"J93+F95","v":0},null,null,null,{"$f":"N93+J95","v":0},null,null,null,{"$f":"R93+N95","v":0}]
["F","PERCENTUAIS  ACUMULADOS:",null,null,null,{"$f":"F94","v":""},null,null,null,{"$f":"J94+F96","v":{"$error":"#VALUE!"}},null,null,null,{"$f":"N94+J96","v":{"$error":"#VALUE!"}},null,null,null,{"$f":"R94+N96","v":{"$error":"#VALUE!"}}]
["F"]
["F","OBSERVAÇÕES:"]
["F","Os pagamentos somente poderão ser efetuados mediante medição e atesto pelos técnicos da Secretaria da Educação. "]

{"sheet":"Composição BDI","index":4,"n_rows":45,"n_cols":9,"rows_kept":45,"cut":false,"hidden":false,"merged":[[18,5,18,8],[17,0,17,3],[16,0,16,3],[44,0,44,3],[42,0,42,3],[43,0,43,3],[18,0,18,3],[36,0,36,3],[39,0,39,3],[38,0,38,3],[40,0,40,3],[29,0,29,2],[32,0,32,3],[33,0,33,3],[34,0,34,3],[35,0,35,3],[0,0,0,3],[2,0,2,3],[3,0,3,3],[1,0,1,3],[5,0,5,3],[4,0,4,3],[12,0,12,3],[13,0,13,3],[14,0,14,3],[15,0,15,3],[6,0,6,3],[8,0,8,3],[7,0,7,3],[9,0,9,3],[11,0,11,3],[10,0,10,3]]}
[]
[]
["UNIDADE ESCOLAR"]
[{"$f":"Orçamento!$O$4","v":"COORDENAÇÃO REGIONAL DE EDUCAÇÃO DE TRINDADE"}]
[]
["OBRA"]
[{"$f":"Orçamento!$O$7","v":"REFORMA E AMPLIAÇÃO"}]
[]
["ENDEREÇO"]
[{"$f":"Orçamento!$R$10","v":"AVENIDA MANOEL MONTEIRO, 163 - BAIRRO SANTUÁRIO"}]
[]
["CIDADE"]
[{"$f":"Orçamento!$X$7","v":"TRINDADE"}]
[]
["CRE"]
[{"$f":"Orçamento!$O$10","v":"CRE-TRINDADE"}]
[]
["DETALHAMENTO DA COMPOSIÇÃO DE BDI"]
["COMPOSIÇÃO BDI PARA OBRAS CIVIS",null,null,null,null,"BDI CONSTRUÇÃO E REFORMA"]
["DESCRIÇÃO","COEF.","TAXA % (a.m)","% no preço de venda",null,"Situação","1º Quartil","Médio","3º Quartil"]
["1) COFINS",1,0.03,{"$f":"C21","v":0.03},null,{"$f":"IF(OR(C21<G21,C21>I21),\"FORA DO INTERVALO\",\"OK\")","v":"OK"},0.03,0.03,0.03]
["2) PIS",1,6.4999999999999997E-3,{"$f":"C22","v":6.4999999999999997E-3},null,{"$f":"IF(OR(C22<G22,C22>I22),\"FORA DO INTERVALO\",\"OK\")","v":"OK"},6.4999999999999997E-3,6.4999999999999997E-3,6.4999999999999997E-3]
["3) ISSQN",1,0.05,{"$f":"C23*B23","v":0.05},null,"OK",0.02,3.5000000000000003E-2,0.05]
["4) CPRB",1,0,{"$f":"C24","v":0},null,"FORA DO INTERVALO",4.4999999999999998E-2,4.4999999999999998E-2,4.4999999999999998E-2]
["5) Administração Central",1,0.03,0.03,null,"OK",0.03,0.04,5.5E-2]
["6) Despesas Financeiras",1,5.5999999999999999E-3,5.5999999999999999E-3,null,"FORA DO INTERVALO",5.8999999999999999E-3,1.23E-2,1.3899999999999999E-2]
["7) Seguros + Garantias",1,1.1999999999999999E-3,1.1999999999999999E-3,null,"FORA DO INTERVALO",8.0000000000000002E-3,8.0000000000000002E-3,0.01]
["8) Risco",1,9.7000000000000003E-3,9.7000000000000003E-3,null,"OK",9.7000000000000003E-3,1.2699999999999999E-2,1.2699999999999999E-2]
["9) Lucro",1,6.1600000000000002E-2,6.1600000000000002E-2,null,"OK",6.1600000000000002E-2,7.3999999999999996E-2,8.9599999999999999E-2]
["BDI - FINAL",null,null,{"$f":"(((1+D25+D27+D28)*(1+D26)*(1+D29))/(1-(D21+D22+D23+D24))-1)","v":0.21642862491954062},null,{"$f":"IF(OR(D30<G30,D30>I30),\"FORA DO INTERVALO\",\"OK\")","v":"OK"},0.2034,0.22120000000000001,0.25]
[]
["Notas:"]
["(1) e (2) Alíquota definida por lei."]
["(3) Alíquota e base de cálculo definidas pela legislação municipal."]
["(4) Alíquota definida pelas leis 12.546/11, 12844/13 e 13.161/15 (CPRB – contribuição previdenciária sobre a receita bruta)."]
["(5) Valores definidos a partir dos limites no Acórdão nº 2.622/2013 - TCU – Plenário. Valores entre o 1º e 3º quartis."]
["(6) Valor calculado pela expressão matemática do acórdão 2.369/2011 – TCU – Plenário e disponibilizado pela AGETOP em dezembro de 2018. (Foi utilizado para o cálculo a média da Taxa SELIC no período de 11/2017 a 10/2018)"]
[]
["(7) Valores definidos pela AGETOP a partir dos limites no Acórdão nº 2.622/2013 - TCU – Plenário. Valores médios. \n\nObservação da AGETOP: (Seguros contra erros de execução, incêndio e explosão, danos da natureza (vendaval, destelhamento, alagamento, inundação, desmoronamento, geadas etc.), emprego de material defeituoso ou inadequado, roubo e/ou furto qualificado, quebra de equipamentos, desmoronamento de estrutura, nas modalidades de Obras Civis em Construção (OCC); Instalação e Montagem (IM); e Obras Civis em Construção e Instalação e Montagem (OCC/IM). Bem como coberturas adicionais para ampliação dessas coberturas básicas, como: cobertura de responsabilidade civil geral, cobertura de responsabilidade civil cruzada, cobertura de despesas extraordinárias, cobertura de tumultos, cobertura de desentulho do local, cobertura de riscos do fabricante, dentre outras, incluindo o seguro de vida em grupo regido pela convenção coletiva dos trabalhadores na indústria da construção civil). A partir de 24/02/2015 por intermédio da Portaria 449/2015 a Presidência da AGETOP, na pessoa do Senhor Jayme Eduardo Rincon, determinou a exclusão dos valores referentes aos Seguros de Risco de Engenharia e Responsabilidade Civil do Profissional na composição do cálculo do B.D.I.."]
["(8) Valores definidos a partir dos limites no Acórdão nº 2.622/2013 - TCU – Plenário. Valores entre 1º e 3° quartis."]
["(9) Valores definidos a partir dos limites definidos no Acórdão nº 2.622/2013 - TCU – Plenário. Valores adotados e praticados no mercado ( “ ex ante ” ) ou aqueles entre os 1º e 3º quartis."]
[]
["(*) A fórmula para estipulação da taxa de BDI estimado adotado é a mesma que foi aplicada para a obtenção das tabelas contidas no Acórdão n. 2.622/2013 – TCUPlenário"]
[]
["Obs.: Para obras com valores superiores a R$ 20.000.000,00 sugere-se recalcular o BDI, dimensionando as taxas de administração central e lucro para patamares inferiores ao estipulado acima."]

{"sheet":"Relatório CENTRAL","index":5,"n_rows":40,"n_cols":5,"rows_kept":40,"cut":false,"hidden":false,"merged":[[8,1,8,2],[8,3,8,4],[9,1,9,2],[10,1,10,4],[11,1,11,4],[39,1,39,2],[9,0,11,0],[0,1,0,4],[6,3,6,4],[9,3,9,4],[1,1,1,4],[2,1,2,2],[2,3,2,4],[3,1,3,2],[3,3,3,4],[4,1,4,4],[5,1,5,2],[5,3,5,4],[6,1,6,2],[7,1,7,4]]}
[]
[]
[null,"UNIDADE ESCOLAR",null,"CIDADE"]
[null,{"$f":"Orçamento!$O$4","v":"COORDENAÇÃO REGIONAL DE EDUCAÇÃO DE TRINDADE"},null,{"$f":"Orçamento!$X$7","v":"TRINDADE"}]
[]
[null,"OBRA",null,"CRE"]
[null,{"$f":"Orçamento!$O$7","v":"REFORMA E AMPLIAÇÃO"},null,{"$f":"Orçamento!$O$10","v":"CRE-TRINDADE"}]
[]
[null,"ENDEREÇO",null,"DATA"]
["FILTRO",{"$f":"Orçamento!$R$10","v":"AVENIDA MANOEL MONTEIRO, 163 - BAIRRO SANTUÁRIO"},null,{"$f":"Orçamento!$S$7","v":"2020-09-02"}]
[]
[null,"RELATÓRIO CENTRAL"]
["↓","CÓDIGO","ETAPA","PREÇO  (R$) C/ BDI","PARTIC  ( % )"]
[{"$f":"IF(D14>0,\"F\",\"\")","v":""},{"$f":"Orçamento!O549","v":"a."},{"$f":"Orçamento!P549","v":"SERVIÇOS PRELIMINARES"},{"$f":"Orçamento!X549","v":0},{"$f":"Orçamento!AA549","v":0}]
[{"$f":"IF(D15>0,\"F\",\"\")","v":""},{"$f":"Orçamento!O550","v":"b."},{"$f":"Orçamento!P550","v":"TRANSPORTES"},{"$f":"Orçamento!X550","v":0},{"$f":"Orçamento!AA550","v":0}]
["",{"$f":"Orçamento!O551","v":"c."},{"$f":"Orçamento!P551","v":"SERVIÇO EM TERRA"},{"$f":"Orçamento!X551","v":0},{"$f":"Orçamento!AA551","v":0}]
["",{"$f":"Orçamento!O552","v":"d."},{"$f":"Orçamento!P552","v":"FUNDAÇÕES E SONDAGENS"},{"$f":"Orçamento!X552","v":0},{"$f":"Orçamento!AA552","v":0}]
["",{"$f":"Orçamento!O553","v":"e."},{"$f":"Orçamento!P553","v":"ESTRUTURA"},{"$f":"Orçamento!X553","v":0},{"$f":"Orçamento!AA553","v":0}]
["",{"$f":"Orçamento!O554","v":"f."},{"$f":"Orçamento!P554","v":"INSTALAÇÕES ELÉTRICAS"},{"$f":"Orçamento!X554","v":0},{"$f":"Orçamento!AA554","v":0}]
["",{"$f":"Orçamento!O555","v":"g."},{"$f":"Orçamento!P555","v":"INSTALAÇÕES HIDROSSANITÁRIAS"},{"$f":"Orçamento!X555","v":0},{"$f":"Orçamento!AA555","v":0}]
["",{"$f":"Orçamento!O556","v":"h"},{"$f":"Orçamento!P556","v":"INSTALAÇÕES ESPECIAIS"},{"$f":"Orçamento!X556","v":0},{"$f":"Orçamento!AA556","v":0}]
["",{"$f":"Orçamento!O557","v":"i."},{"$f":"Orçamento!P557","v":"ALVENARIAS E DIVISÓRIAS"},{"$f":"Orçamento!X557","v":0},{"$f":"Orçamento!AA557","v":0}]
["",{"$f":"Orçamento!O558","v":"j."},{"$f":"Orçamento!P558","v":"ALVENARIA AUTO-PORTANTE"},{"$f":"Orçamento!X558","v":0},{"$f":"Orçamento!AA558","v":0}]
["",{"$f":"Orçamento!O559","v":"k."},{"$f":"Orçamento!P559","v":"IMPERMEABILIZAÇÃO"},{"$f":"Orçamento!X559","v":0},{"$f":"Orçamento!AA559","v":0}]
["",{"$f":"Orçamento!O560","v":"l."},{"$f":"Orçamento!P560","v":"ISOLAMENTO TÉRMICO E ACÚSTICO"},{"$f":"Orçamento!X560","v":0},{"$f":"Orçamento!AA560","v":0}]
["",{"$f":"Orçamento!O561","v":"m."},{"$f":"Orçamento!P561","v":"ESTRUTURA DE MADEIRA"},{"$f":"Orçamento!X561","v":0},{"$f":"Orçamento!AA561","v":0}]
["",{"$f":"Orçamento!O562","v":"n."},{"$f":"Orçamento!P562","v":"ESTRUTURAS METÁLICAS"},{"$f":"Orçamento!X562","v":0},{"$f":"Orçamento!AA562","v":0}]
["",{"$f":"Orçamento!O563","v":"o."},{"$f":"Orçamento!P563","v":"COBERTURAS"},{"$f":"Orçamento!X563","v":0},{"$f":"Orçamento!AA563","v":0}]
["",{"$f":"Orçamento!O564","v":"p."},{"$f":"Orçamento!P564","v":"ESQUADRIAS DE MADEIRA"},{"$f":"Orçamento!X564","v":0},{"$f":"Orçamento!AA564","v":0}]
["",{"$f":"Orçamento!O565","v":"q."},{"$f":"Orçamento!P565","v":"ESQUADRIAS METÁLICAS"},{"$f":"Orçamento!X565","v":0},{"$f":"Orçamento!AA565","v":0}]
["",{"$f":"Orçamento!O566","v":"r."},{"$f":"Orçamento!P566","v":"VIDROS"},{"$f":"Orçamento!X566","v":0},{"$f":"Orçamento!AA566","v":0}]
["",{"$f":"Orçamento!O567","v":"s."},{"$f":"Orçamento!P567","v":"REVESTIMENTO DE PAREDE"},{"$f":"Orçamento!X567","v":0},{"$f":"Orçamento!AA567","v":0}]
["",{"$f":"Orçamento!O568","v":"t."},{"$f":"Orçamento!P568","v":"FORROS"},{"$f":"Orçamento!X568","v":0},{"$f":"Orçamento!AA568","v":0}]
["",{"$f":"Orçamento!O569","v":"u."},{"$f":"Orçamento!P569","v":"REVESTIMENTO DE PISO"},{"$f":"Orçamento!X569","v":0},{"$f":"Orçamento!AA569","v":0}]
["",{"$f":"Orçamento!O570","v":"v."},{"$f":"Orçamento!P570","v":"FERRAGENS"},{"$f":"Orçamento!X570","v":0},{"$f":"Orçamento!AA570","v":0}]
["",{"$f":"Orçamento!O571","v":"w."},{"$f":"Orçamento!P571","v":"MARCENARIA"},{"$f":"Orçamento!X571","v":0},{"$f":"Orçamento!AA571","v":0}]
["",{"$f":"Orçamento!O572","v":"x."},{"$f":"Orçamento!P572","v":"ADMINISTRAÇÃO"},{"$f":"Orçamento!X572","v":0},{"$f":"Orçamento!AA572","v":0}]
["",{"$f":"Orçamento!O573","v":"y."},{"$f":"Orçamento!P573","v":"PINTURA"},{"$f":"Orçamento!X573","v":0},{"$f":"Orçamento!AA573","v":0}]
["",{"$f":"Orçamento!O574","v":"z."},{"$f":"Orçamento!P574","v":"DIVERSOS"},{"$f":"Orçamento!X574","v":0},{"$f":"Orçamento!AA574","v":0}]
["F","TOTAL GERAL DO ORÇAMENTO (R$) C/BDI",null,{"$f":"SUM(D14:D39)","v":0},{"$f":"SUM(E14:E39)","v":0}]

{"sheet":"Parc Maior Relev","index":6,"n_rows":33,"n_cols":7,"rows_kept":33,"cut":false,"hidden":false,"merged":[[6,4,6,6],[7,1,7,6],[8,1,8,3],[8,4,8,6],[33,3,33,7],[31,1,31,6],[0,1,0,6],[11,1,11,6],[1,1,1,6],[2,1,2,3],[2,4,2,6],[3,1,3,3],[3,4,3,6],[4,1,4,6],[5,1,5,3],[5,4,5,6],[9,1,9,3],[9,4,9,6],[10,1,10,6],[6,1,6,3]]}
[]
[]
[null,"UNIDADE ESCOLAR",null,null,"CÓDIGO INEP"]
[null,{"$f":"Orçamento!$O$4","v":"COORDENAÇÃO REGIONAL DE EDUCAÇÃO DE TRINDADE"},null,null,{"$f":"Orçamento!$X$4","v":0}]
[]
[null,"OBRA",null,null,"CIDADE"]
[null,{"$f":"Orçamento!$O$7","v":"REFORMA E AMPLIAÇÃO"},null,null,{"$f":"Orçamento!$X$7","v":"TRINDADE"}]
[]
[null,"CRE",null,null,"ÁREA TOTAL CONSTRUÍDA (M²)"]
[null,{"$f":"Orçamento!$O$10","v":"CRE-TRINDADE"},null,null,{"$f":"Orçamento!$X$13","v":769.17}]
[]
["FILTRO","PARCELA DE MAIOR RELEVÂNCIA"]
[{"$f":"IF(G14>0,\"F\",\"\")","v":""},"CÓDIGO","SERVIÇO","DESCRIÇÃO","UNID","QUANT","PARC. MAIOR RELEV (100%)"]
[{"$f":"IF(G14>0,\"F\",\"\")","v":""},"f.","INSTALAÇÕES ELÉTRICAS","SUBESTAÇÃO","KVA",{"$f":"SUMIF(Orçamento!$R$530:$R$530,'Parc Maior Relev'!D14,Orçamento!$T$530:$T$530)","v":0},{"$f":"F14","v":0}]
[{"$f":"IF(SUM(G16:G30)>0,\"F\",\"\")","v":"F"},"CÓDIGO","SERVIÇO","DESCRIÇÃO","UNID","QUANT","PARC. MAIOR RELEV (50%)"]
[{"$f":"IF(G16>0,\"F\",\"\")","v":""},"e.","ESTRUTURA","CONCRETO","M3",{"$f":"SUMIF(Orçamento!$R$530:$R$530,'Parc Maior Relev'!D16,Orçamento!$T$530:$T$530)","v":0},{"$f":"F16*0.5","v":0}]
[{"$f":"IF(G17>0,\"F\",\"\")","v":""},"f.","INSTALAÇÕES ELÉTRICAS","INSTALAÇÕES ELÉTRICAS","KVA",{"$f":"SUMIF(Orçamento!$R$530:$R$530,'Parc Maior Relev'!D17,Orçamento!$T$530:$T$530)","v":0},{"$f":"F17*0.5","v":0}]
[{"$f":"IF(G18>0,\"F\",\"\")","v":""},"o.","COBERTURAS","COBERTURA CERÂMICA","M2",{"$f":"SUMIF(Orçamento!$R$530:$R$530,'Parc Maior Relev'!D18,Orçamento!$T$530:$T$530)","v":0},0]
["F","o.","COBERTURAS","FIBROCIMENTO","M2",465,232.5]
["","s.","REVESTIMENTO DE PAREDE","CHAPISCO","M2",{"$f":"SUMIF(Orçamento!$R$530:$R$530,'Parc Maior Relev'!D20,Orçamento!$T$530:$T$530)","v":0},0]
["","s.","REVESTIMENTO DE PAREDE","REBOCO","M2",{"$f":"SUMIF(Orçamento!$R$530:$R$530,'Parc Maior Relev'!D21,Orçamento!$T$530:$T$530)","v":0},0]
["","s.","REVESTIMENTO DE PAREDE","REVESTIMENTO CERÂMICO","M2",{"$f":"SUMIF(Orçamento!$R$530:$R$530,'Parc Maior Relev'!D22,Orçamento!$T$530:$T$530)","v":0},0]
["","t.","FORROS","FORRO DE GESSO","M2",{"$f":"SUMIF(Orçamento!$R$530:$R$530,'Parc Maior Relev'!D23,Orçamento!$T$530:$T$530)","v":0},0]
["F","t.","FORROS","FORRO DE PVC","M2",425.55,212.77500000000001]
["","t.","FORROS","FORRO DE GESSO ACARTONADO","M2",{"$f":"SUMIF(Orçamento!$R$530:$R$530,'Parc Maior Relev'!D25,Orçamento!$T$530:$T$530)","v":0},0]
["","u.","REVESTIMENTO DE PISO","PISO DE GRANITINA","M2",{"$f":"SUMIF(Orçamento!$R$530:$R$530,'Parc Maior Relev'!D26,Orçamento!$T$530:$T$530)","v":0},0]
["","u.","REVESTIMENTO DE PISO","PISO LAMINADO","M2",{"$f":"SUMIF(Orçamento!$R$530:$R$530,'Parc Maior Relev'!D27,Orçamento!$T$530:$T$530)","v":0},0]
["","u.","REVESTIMENTO DE PISO","PISO DE CONCRETO DESEMPENADO","M2",{"$f":"SUMIF(Orçamento!$R$530:$R$530,'Parc Maior Relev'!D28,Orçamento!$T$530:$T$530)","v":0},0]
["","u.","REVESTIMENTO DE PISO","PISO CERÂMICO","M2",{"$f":"SUMIF(Orçamento!$R$530:$R$530,'Parc Maior Relev'!D29,Orçamento!$T$530:$T$530)","v":0},0]
["","y.","PINTURA","PINTURA","M2",{"$f":"SUMIF(Orçamento!$R$530:$R$530,'Parc Maior Relev'!D30,Orçamento!$T$530:$T$530)","v":0},0]
["F"]
["F","(*) Para os fins do inciso I dp § 1º do Art. 30 da Lei Federal 8.666/93, são consideradas parcelas de maior relevância técnica as execuções apresentadas"]
["F"]

{"sheet":"Composições","index":7,"n_rows":275,"n_cols":10,"rows_kept":275,"cut":false,"hidden":false,"merged":[[263,8,263,9],[269,1,269,7],[274,1,274,7],[260,1,260,7],[261,1,261,7],[263,0,264,0],[263,1,264,1],[263,2,264,2],[263,3,264,3],[263,4,264,4],[263,5,264,5],[263,6,263,7],[246,8,246,9],[250,1,250,7],[254,1,254,7],[256,0,257,0],[256,1,257,1],[256,2,257,2],[256,3,257,3],[256,4,257,4],[256,5,257,5],[256,6,256,7],[256,8,256,9],[240,1,240,7],[244,1,244,7],[246,0,247,0],[246,1,247,1],[246,2,247,2],[246,3,247,3],[246,4,247,4],[246,5,247,5],[246,6,246,7],[226,5,227,5],[226,6,226,7],[226,8,226,9],[231,1,231,7],[234,1,234,7],[236,0,237,0],[236,1,237,1],[236,2,237,2],[236,3,237,3],[236,4,237,4],[236,5,237,5],[236,6,236,7],[236,8,236,9],[189,0,190,0],[189,1,190,1],[189,2,190,2],[189,3,190,3],[189,4,190,4],[189,5,190,5],[189,6,189,7],[189,8,189,9],[194,1,194,7],[169,1,169,7],[171,0,172,0],[171,1,172,1],[171,2,172,2],[171,3,172,3],[171,4,172,4],[171,5,172,5],[171,6,171,7],[171,8,171,9],[151,8,151,9],[156,1,156,7],[159,1,159,7],[161,0,162,0],[161,1,162,1],[161,2,162,2],[161,3,162,3],[161,4,162,4],[161,5,162,5],[161,6,161,7],[161,8,161,9],[147,1,147,7],[149,1,149,7],[151,0,152,0],[151,1,152,1],[151,2,152,2],[151,3,152,3],[151,4,152,4],[151,5,152,5],[151,6,151,7],[119,8,119,9],[123,1,123,7],[130,1,130,7],[132,0,133,0],[132,1,133,1],[132,2,133,2],[132,3,133,3],[132,4,133,4],[132,5,133,5],[132,6,132,7],[132,8,132,9],[113,1,113,7],[117,1,117,7],[119,0,120,0],[119,1,120,1],[119,2,120,2],[119,3,120,3],[119,4,120,4],[119,5,120,5],[119,6,119,7],[103,1,103,7],[109,0,110,0],[109,1,110,1],[109,2,110,2],[109,3,110,3],[109,4,110,4],[109,5,110,5],[109,6,109,7],[109,8,109,9],[90,2,91,2],[90,3,91,3],[90,4,91,4],[90,5,91,5],[90,6,90,7],[90,8,90,9],[99,1,100,1],[99,2,100,2],[99,3,100,3],[99,4,100,4],[99,5,100,5],[99,6,99,7],[99,8,99,9],[216,8,216,9],[70,1,70,7],[72,0,73,0],[72,1,73,1],[72,2,73,2],[72,3,73,3],[72,4,73,4],[72,5,73,5],[72,6,72,7],[72,8,72,9],[77,1,77,7],[79,1,79,7],[81,0,82,0],[81,1,82,1],[81,2,82,2],[81,3,82,3],[81,4,82,4],[81,5,82,5],[81,6,81,7],[81,8,81,9],[86,1,86,7],[88,1,88,7],[90,0,91,0],[90,1,91,1],[224,1,224,7],[226,0,227,0],[226,1,227,1],[212,1,212,7],[214,1,214,7],[205,1,205,7],[207,0,208,0],[207,1,208,1],[207,2,208,2],[207,3,208,3],[207,4,208,4],[207,5,208,5],[207,6,207,7],[221,1,221,7],[216,0,217,0],[216,1,217,1],[216,2,217,2],[216,3,217,3],[216,4,217,4],[216,5,217,5],[216,6,216,7],[226,2,227,2],[226,3,227,3],[226,4,227,4],[207,8,207,9],[196,1,196,7],[198,0,199,0],[198,1,199,1],[198,2,199,2],[198,3,199,3],[198,4,199,4],[198,5,199,5],[198,6,198,7],[198,8,198,9],[203,1,203,7],[185,1,185,7],[178,1,178,7],[180,0,181,0],[180,1,181,1],[180,2,181,2],[180,3,181,3],[180,4,181,4],[180,5,181,5],[180,6,180,7],[180,8,180,9],[187,1,187,7],[176,1,176,7],[166,1,166,7],[136,1,136,7],[63,0,64,0],[63,1,64,1],[63,2,64,2],[63,3,64,3],[63,4,64,4],[63,5,64,5],[63,6,63,7],[63,8,63,9],[68,1,68,7],[97,1,97,7],[107,1,107,7],[95,1,95,7],[99,0,100,0],[140,1,140,7],[142,0,143,0],[142,1,143,1],[142,2,143,2],[142,3,143,3],[142,4,143,4],[54,8,54,9],[45,5,46,5],[45,6,45,7],[45,8,45,9],[50,1,50,7],[45,0,46,0],[45,1,46,1],[45,2,46,2],[45,3,46,3],[45,4,46,4],[23,8,23,9],[28,1,28,7],[43,1,43,7],[23,0,24,0],[23,1,24,1],[23,2,24,2],[23,3,24,3],[23,4,24,4],[52,1,52,7],[19,1,19,7],[21,1,21,7],[16,0,17,0],[16,1,17,1],[16,2,17,2],[16,3,17,3],[16,4,17,4],[59,1,59,7],[61,1,61,7],[23,5,24,5],[23,6,23,7],[54,0,55,0],[54,1,55,1],[54,2,55,2],[54,3,55,3],[54,4,55,4],[54,5,55,5],[54,6,54,7],[6,0,6,6],[10,8,10,9],[13,8,13,9],[14,0,14,9],[8,0,8,9],[5,0,5,9],[2,0,2,9],[16,5,17,5],[16,6,16,7],[16,8,16,9],[142,5,143,5],[142,6,142,7],[142,8,142,9],[0,0,0,8],[10,0,10,2],[10,3,10,6],[11,0,11,9],[12,0,12,2],[12,3,12,6],[12,7,12,8],[7,0,7,6],[9,0,9,2],[9,3,9,6],[9,7,9,8],[3,0,3,6],[4,0,4,6],[15,0,15,9],[13,0,13,2],[13,3,13,6],[1,0,1,9],[3,7,3,9],[4,7,4,9],[6,7,6,9],[7,7,7,9]]}
[]
[]
[]
["UNIDADE ESCOLAR",null,null,null,null,null,null,"CÓDIGO INEP"]
[{"$f":"Orçamento!$O$4","v":"COORDENAÇÃO REGIONAL DE EDUCAÇÃO DE TRINDADE"},null,null,null,null,null,null,{"$f":"Orçamento!$X$4","v":0}]
[]
["OBRA",null,null,null,null,null,null,"CIDADE"]
[{"$f":"Orçamento!$O$7","v":"REFORMA E AMPLIAÇÃO"},null,null,null,null,null,null,{"$f":"Orçamento!$X$7","v":"TRINDADE"}]
[]
["CRE",null,null,"ENDEREÇO",null,null,null,"REFERÊNCIA AGETOP"]
[{"$f":"Orçamento!$O$10","v":"CRE-TRINDADE"},null,null,{"$f":"Orçamento!$R$10","v":"AVENIDA MANOEL MONTEIRO, 163 - BAIRRO SANTUÁRIO"},null,null,null,{"$f":"Orçamento!$S$10","v":"ABR/19"},{"$f":"Orçamento!$T$10","v":"ONERADA"}]
[]
["DATA",null,null,"ÁREA TOTAL CONSTRUÍDA (M²)",null,null,null,"REFERÊNCIA SINAPI"]
[{"$f":"Orçamento!$S$7","v":"2020-09-02"},null,null,{"$f":"Orçamento!$X$13","v":769.17},null,null,null,{"$f":"Orçamento!$X$10","v":"ABR/20"},{"$f":"Orçamento!$Y$10","v":"ONERADA"}]
[]
["COMPOSIÇÕES DE CUSTOS UNITÁRIOS - SEE-GO"]
[10,"FONTE","CÓDIGO","DESCRIÇÃO","UNIDADE","COEFIC.","CUSTO UNITÁRIO",null,"CUSTO  TOTAL (A) + (B) + (C) + (D) + (E)"]
[null,null,null,null,null,null,"DESONERADO","NÃO DESONER.","DESONERADO","NÃO DESONER."]
[null,"COMPOSIÇÃO","COMP 010_SEE","DEMOLIÇÃO DE GRADE/GRELHA/CORRIMÃO/GUARDA CORPO - METÁLICO","M2",null,"-","-",4.0599999999999996,4.71]
[null,"MÃO DE OBRA (B) - TOTAL",null,null,null,null,null,null,0,0]
[null,"AGETOP",20106,"RETIRADA DE JANELAS OU PORTAIS C/ TRANSP. ATÉ CB. E CARGA","m2    ",1,4.0599999999999996,4.71,4.0599999999999996,4.71]
[null,"MATERIAL (C) - TOTAL",null,null,null,null,null,null,4.0599999999999996,4.71]
[]
[84,"FONTE","CÓDIGO","DESCRIÇÃO","UNIDADE","COEFIC.","CUSTO UNITÁRIO",null,"CUSTO  TOTAL (A) + (B) + (C) + (D) + (E)"]
[null,null,null,null,null,null,"DESONERADO","NÃO DESONER.","DESONERADO","NÃO DESONER."]
[null,"COMPOSIÇÃO","COMP 084_SEE","GUARDA-CORPO COM CORRIMÃO - SEDUC","M",null,null,null,206.14000000000001,211.22000000000003]
[null,"AGETOP_I",25,"OFICIAL \"B\"","h     ",1.1000000000000001,13.95,16.16,15.35,17.78]
[null,"AGETOP_I",8,"AJUDANTE","h     ",1.1000000000000001,8.75,10.14,9.6300000000000008,11.15]
[null,"MÃO DE OBRA (B) - TOTAL",null,null,null,null,null,null,24.98,28.93]
[null,"AGETOP_I",2376,"TUBO INDUSTRIAL 2\" CHAPA 13 ","Kg",7.7778,5.23,5.23,40.68,40.68]
[null,"AGETOP_I",2504,"TUBO INDUSTRIAL D=25 MM CHAPA 13 ","Kg",4.6319999999999997,5.07,5.07,23.48,23.48]
[null,"AGETOP_I",2377,"TUBO INDUSTRIAL 40X40 CH.13","Kg",6.3419999999999996,5.07,5.07,32.15,32.15]
[null,"AGETOP_I",2421,"TUBO INDUSTRIAL 1.1/2\" CHAPA 13 ","Kg",1.4862,5.07,5.07,7.54,7.54]
[null,"AGETOP_I",2417,"MASSA PLASTICA","Kg",0.2041,10.58,10.58,2.16,2.16]
[null,"AGETOP_I",2246,"ELETRODO 2.5 OK","Kg",0.11459999999999999,8.6999999999999993,8.6999999999999993,1,1]
[null,"AGETOP_I",1672,"LIXA PARA FERRO ( NÚMERO 100 )","un",0.25509999999999999,2.12,2.12,0.54,0.54]
[null,"AGETOP_I",1264,"DISCO DE DESBASTE 7/8\" P/ CONC./FERRO (1/4\" X 7\")","un",5.0999999999999997E-2,7,7,0.36,0.36]
[null,"AGETOP_I",1334,"DISCO DE CORTE DIAM. 5/8\"- 10\"","un",0.373,5.5,5.5,2.0499999999999998,2.0499999999999998]
[null,"AGETOP_I",2902,"FABRICAÇÃO / MONTAGEM","un",1,50.44,50.44,50.44,50.44]
[null,"AGETOP_I",2150,"CHAPA DE FERRO DOBRADA No.13","Kg",0.43519999999999998,5.28,5.28,2.2999999999999998,2.2999999999999998]
[null,"AGETOP_I",2719,"CHAPA PERFILADA 3/16\"","Kg",1.0979999999999999,5.04,5.04,5.53,5.53]
[null,"AGETOP_I",2436,"ACO CA-25 - 6,3 MM (1/4\") - BARRA LISA A-36","Kg",0.38124999999999998,5.13,5.13,1.96,1.96]
[null,"AGETOP",261602,"PINT.ESMALTE/ESQUAD.FERRO C/FUNDO ANTICOR.","m2    ",0.78,14.07,15.51,10.97,12.1]
[null,"MATERIAL (C) - TOTAL",null,null,null,null,null,null,181.16000000000003,182.29000000000002]
[]
[387,"FONTE","CÓDIGO","DESCRIÇÃO","UNIDADE","COEFIC.","CUSTO UNITÁRIO",null,"CUSTO  TOTAL (A) + (B) + (C) + (D) + (E)"]
[null,null,null,null,null,null,"DESONERADO","NÃO DESONER.","DESONERADO","NÃO DESONER."]
[null,"COMPOSIÇÃO","COMP 387_SEE","LÂMPADA LED TUBULAR 18W ","UN ",null,null,null,22.3,22.35]
[null,"AGETOP_I",8,"AJUDANTE","h     ",1.4999999999999999E-2,8.75,10.14,0.13,0.15]
[null,"AGETOP_I",12,"ELETRICISTA","h     ",1.4999999999999999E-2,13.95,16.16,0.21,0.24]
[null,"MÃO DE OBRA (B) - TOTAL",null,null,null,null,null,null,0.33999999999999997,0.39]
[null,"COTAÇÃO","COT 195_SEE","LÂMPADA LED TUBULAR 18W ","UN",1,21.959999999999997,21.959999999999997,21.96,21.96]
[null,"MATERIAL (C) - TOTAL",null,null,null,null,null,null,21.96,21.96]
[]
[34,"FONTE","CÓDIGO","DESCRIÇÃO","UNIDADE","COEFIC.","CUSTO UNITÁRIO",null,"CUSTO  TOTAL (A) + (B) + (C) + (D) + (E)"]
[null,null,null,null,null,null,"DESONERADO","NÃO DESONER.","DESONERADO","NÃO DESONER."]
[null,"COMPOSIÇÃO","COMP 034_SEE","TERMINAL AÉREO SPDA 30CM Fo Go DIAM. 5/16\" COM SUPORTE","UN ",null,null,null,16.259999999999998,17.329999999999998]
[null,"AGETOP_I",8,"AJUDANTE","h     ",0.3,8.75,10.14,2.63,3.04]
[null,"AGETOP_I",12,"ELETRICISTA","h     ",0.3,13.95,16.16,4.1900000000000004,4.8499999999999996]
[null,"MÃO DE OBRA (B) - TOTAL",null,null,null,null,null,null,6.82,7.89]
[null,"SINAPI_I",7571,"TERMINAL AEREO EM ACO GALVANIZADO DN 5/16\", COMPRIMENTO DE 350MM, COM BASE DE FIXACAO HORIZONTAL","UN    ",1,9.44,9.44,9.44,9.44]
[null,"MATERIAL (C) - TOTAL",null,null,null,null,null,null,9.44,9.44]
[]
[36,"FONTE","CÓDIGO","DESCRIÇÃO","UNIDADE","COEFIC.","CUSTO UNITÁRIO",null,"CUSTO  TOTAL (A) + (B) + (C) + (D) + (E)"]
[null,null,null,null,null,null,"DESONERADO","NÃO DESONER.","DESONERADO","NÃO DESONER."]
[null,"COMPOSIÇÃO","COMP 036_SEE","PRESILHA LATÃO 16/35MM 5MM+PARAF FENDA ","UN ",null,null,null,3.03,3.33]
[null,"AGETOP_I",8,"AJUDANTE","h     ",8.3299999999999999E-2,8.75,10.14,0.73,0.84]
[null,"AGETOP_I",12,"ELETRICISTA","h     ",8.3299999999999999E-2,13.95,16.16,1.1599999999999999,1.35]
[null,"MÃO DE OBRA (B) - TOTAL",null,null,null,null,null,null,1.89,2.19]
[null,"COTAÇÃO","COT 004_SEE","PRESILHA LATÃO 16/35MM 5MM+PARAF FENDA 1/4''X1.1/4''","UN ",1,1.1433333333333333,1.1433333333333333,1.1399999999999999,1.1399999999999999]
[null,"MATERIAL (C) - TOTAL",null,null,null,null,null,null,1.1399999999999999,1.1399999999999999]
[]
[39,"FONTE","CÓDIGO","DESCRIÇÃO","UNIDADE","COEFIC.","CUSTO UNITÁRIO",null,"CUSTO  TOTAL (A) + (B) + (C) + (D) + (E)"]
[null,null,null,null,null,null,"DESONERADO","NÃO DESONER.","DESONERADO","NÃO DESONER."]
[null,"COMPOSIÇÃO","COMP 039_SEE","MOLDE GRAF CGT 5/8 50MM C","UN ",null,null,null,139.47,139.6]
[null,"AGETOP_I",8,"AJUDANTE","h     ",3.3300000000000003E-2,8.75,10.14,0.28999999999999998,0.34]
[null,"AGETOP_I",12,"ELETRICISTA","h     ",3.3300000000000003E-2,13.95,16.16,0.46,0.54]
[null,"MÃO DE OBRA (B) - TOTAL",null,null,null,null,null,null,0.75,0.88000000000000012]
[null,"COTAÇÃO","COT 007_SEE","MOLDE GRAF CGT 5/8 50MM C","UN",1,138.7175,138.7175,138.72,138.72]
[null,"MATERIAL (C) - TOTAL",null,null,null,null,null,null,138.72,138.72]
[]
[550,"FONTE","CÓDIGO","DESCRIÇÃO","UNID ","COEFIC.","CUSTO UNITÁRIO",null,"CUSTO  TOTAL (A) + (B) + (C) + (D) + (E)"]
[null,null,null,null,null,null,"DESONERADO","NÃO DESONER.","DESONERADO","NÃO DESONER."]
[null,"COMPOSIÇÃO","COMP 550_SEE","ALIC P/MOLDE C-84","UN ","-","-","-",88.22,88.35]
[null,"AGETOP_I",8,"AJUDANTE","h     ",3.3300000000000003E-2,8.75,10.14,0.28999999999999998,0.34]
[null,"AGETOP_I",12,"ELETRICISTA","h     ",3.3300000000000003E-2,13.95,16.16,0.46,0.54]
[null,"MÃO DE OBRA (B) - TOTAL",null,null,null,null,null,null,0.75,0.88000000000000012]
[null,"COTAÇÃO","COT 292_SEE","ALIC P/MOLDE C-84","UN ",1,87.465000000000003,87.465000000000003,87.47,87.47]
[null,"MATERIAL (C) - TOTAL",null,null,null,null,null,null,87.47,87.47]
[]
[48,"FONTE","CÓDIGO","DESCRIÇÃO","UNIDADE","COEFIC.","CUSTO UNITÁRIO",null,"CUSTO  TOTAL (A) + (B) + (C) + (D) + (E)"]
[null,null,null,null,null,null,"DESONERADO","NÃO DESONER.","DESONERADO","NÃO DESONER."]
[null,"COMPOSIÇÃO","COMP 048_SEE","HASTE ROSQUEADA \"TIRANTE\" 3/8\"","M",null,null,null,14.46,15.899999999999999]
[null,"AGETOP_I",8,"AJUDANTE","h     ",0.4,8.75,10.14,3.5,4.0599999999999996]
[null,"AGETOP_I",12,"ELETRICISTA","h     ",0.4,13.95,16.16,5.58,6.46]
[null,"MÃO DE OBRA (B) - TOTAL",null,null,null,null,null,null,9.08,10.52]
[null,"COTAÇÃO","COT 012_SEE","HASTE ROSQUEADA \"TIRANTE\" 3/8\"","M",1,5.3833333333333329,5.3833333333333329,5.38,5.38]
[null,"MATERIAL (C) - TOTAL",null,null,null,null,null,null,5.38,5.38]
[]
[24,"FONTE","CÓDIGO","DESCRIÇÃO","UNIDADE","COEFIC.","CUSTO UNITÁRIO",null,"CUSTO  TOTAL (A) + (B) + (C) + (D) + (E)"]
[null,null,null,null,null,null,"DESONERADO","NÃO DESONER.","DESONERADO","NÃO DESONER."]
[null,"COMPOSIÇÃO","COMP 024_SEE","SINALIZADOR FOTOLUMINESCENTE PARA EXTINTOR","UN ",null,"-","-",25.319999999999997,25.439999999999998]
[null,"AGETOP_I",5,"SERVENTE","h     ",0.09,8.75,10.14,0.79,0.91]
[null,"MÃO DE OBRA (B) - TOTAL",null,null,null,null,null,null,0.79,0.91]
[null,"AGETOP_I",3070,"BUCHA DE NYLON S-6","un",2,0.04,0.04,0.08,0.08]
[null,"AGETOP_I",3393,"PARAFUSO P/BUCHA S-6","un",2,0.08,0.08,0.16,0.16]
[null,"SINAPI_I",37556,"PLACA DE SINALIZACAO DE SEGURANCA CONTRA INCENDIO, FOTOLUMINESCENTE, QUADRADA, *20 X 20* CM, EM PVC *2* MM ANTI-CHAMAS (SIMBOLOS, CORES E PICTOGRAMAS CONFORME NBR 13434)","UN    ",1,24.29,24.29,24.29,24.29]
[null,"MATERIAL (C) - TOTAL",null,null,null,null,null,null,24.529999999999998,24.529999999999998]
[]
[25,"FONTE","CÓDIGO","DESCRIÇÃO","UNIDADE","COEFIC.","CUSTO UNITÁRIO",null,"CUSTO  TOTAL (A) + (B) + (C) + (D) + (E)"]
[null,null,null,null,null,null,"DESONERADO","NÃO DESONER.","DESONERADO","NÃO DESONER."]
[null,"COMPOSIÇÃO","COMP 025_SEE","SINALIZADOR FOTOLUMINESCENTE DE EMERGÊNCIA","UN ",null,"-","-",25.319999999999997,25.439999999999998]
[null,"AGETOP_I",5,"SERVENTE","h     ",0.09,8.75,10.14,0.79,0.91]
[null,"MÃO DE OBRA (B) - TOTAL",null,null,null,null,null,null,0.79,0.91]
[null,"AGETOP_I",3070,"BUCHA DE NYLON S-6","un",2,0.04,0.04,0.08,0.08]
[null,"AGETOP_I",3393,"PARAFUSO P/BUCHA S-6","un",2,0.08,0.08,0.16,0.16]
[null,"SINAPI_I",37556,"PLACA DE SINALIZACAO DE SEGURANCA CONTRA INCENDIO, FOTOLUMINESCENTE, QUADRADA, *20 X 20* CM, EM PVC *2* MM ANTI-CHAMAS (SIMBOLOS, CORES E PICTOGRAMAS CONFORME NBR 13434)","UN    ",1,24.29,24.29,24.29,24.29]
[null,"MATERIAL (C) - TOTAL",null,null,null,null,null,null,24.529999999999998,24.529999999999998]
[]
[277,"FONTE","CÓDIGO","DESCRIÇÃO","UNIDADE","COEFIC.","CUSTO UNITÁRIO",null,"CUSTO  TOTAL (A) + (B) + (C) + (D) + (E)"]
[null,null,null,null,null,null,"DESONERADO","NÃO DESONER.","DESONERADO","NÃO DESONER."]
[null,"COMPOSIÇÃO","COMP 277_SEE","MARCAÇÃO NO PISO - 1X1 M PARA EXTINTOR","M2",null,null,null,29.69,29.76]
[null,"AGETOP_I",5,"SERVENTE","h     ",3.3300000000000003E-2,8.75,10.14,0.28999999999999998,0.34]
[null,"MÃO DE OBRA (B) - TOTAL",null,null,null,null,null,null,0.28999999999999998,0.34]
[null,"SINAPI_I",5318,"SOLVENTE DILUENTE A BASE DE AGUARRAS","L     ",0.13,11.98,11.98,1.56,1.56]
[null,"SINAPI",5824,"CAMINHÃO TOCO, PBT 16.000 KG, CARGA ÚTIL MÁX. 10.685 KG, DIST. ENTRE EIXOS 4,8 M, POTÊNCIA 189 CV, INCLUSIVE CARROCERIA FIXA ABERTA DE MADEIRA P/ TRANSPORTE GERAL DE CARGA SECA, DIMEN. APROX. 2,5 X 7,00 X 0,50 M - CHP DIURNO. AF_06/2014","CHP",3.3E-3,115.5,118.69,0.38,0.39]
[null,"SINAPI_I",7343,"TINTA A BASE DE RESINA ACRILICA, PARA SINALIZACAO HORIZONTAL VIARIA (NBR 11862)","L     ",0.6,12.82,12.82,7.69,7.69]
[null,"SINAPI_I",7348,"TINTA ACRILICA PREMIUM PARA PISO","L     ",0.03,13.96,13.96,0.42,0.42]
[null,"SINAPI_I",25972,"MICROESFERAS DE VIDRO PARA SINALIZACAO HORIZONTAL VIARIA, TIPO I-B (PREMIX) - NBR 16184","KG    ",2.14,8.8800000000000008,8.8800000000000008,19,19]
[null,"SINAPI",95133,"MÁQUINA DEMARCADORA DE FAIXA DE TRÁFEGO À FRIO, AUTOPROPELIDA, POTÊNCIA 38 HP - CHP DIURNO. AF_07/2016","CHP",3.3E-3,105.93,109.48,0.35,0.36]
[null,"MATERIAL (C) - TOTAL",null,null,null,null,null,null,29.400000000000002,29.42]
[]
[412,"FONTE","CÓDIGO","DESCRIÇÃO","UNIDADE","COEFIC.","CUSTO UNITÁRIO",null,"CUSTO  TOTAL (A) + (B) + (C) + (D) + (E)"]
[null,null,null,null,null,null,"DESONERADO","NÃO DESONER.","DESONERADO","NÃO DESONER."]
[null,"COMPOSIÇÃO","COMP 412_SEE","PLACA DE SINALIZAÇÃO EM PVC COD 17 - (316X158) MENSAGEM \"SAÍDA\"","UN ",null,null,null,30.819999999999997,30.939999999999998]
[null,"AGETOP_I",5,"SERVENTE","h     ",0.09,8.75,10.14,0.79,0.91]
[null,"MÃO DE OBRA (B) - TOTAL",null,null,null,null,null,null,0.79,0.91]
[null,"AGETOP_I",3070,"BUCHA DE NYLON S-6","un",2,0.04,0.04,0.08,0.08]
[null,"AGETOP_I",3393,"PARAFUSO P/BUCHA S-6","un",2,0.08,0.08,0.16,0.16]
[null,"SINAPI_I",37559,"PLACA DE SINALIZACAO DE SEGURANCA CONTRA INCENDIO, FOTOLUMINESCENTE, RETANGULAR, *12 X 40* CM, EM PVC *2* MM ANTI-CHAMAS (SIMBOLOS, CORES E PICTOGRAMAS CONFORME NBR 13434)","UN    ",1,29.79,29.79,29.79,29.79]
[null,"MATERIAL (C) - TOTAL",null,null,null,null,null,null,30.029999999999998,30.029999999999998]
[]
[375,"FONTE","CÓDIGO","DESCRIÇÃO","UNIDADE","COEFIC.","CUSTO UNITÁRIO",null,"CUSTO  TOTAL (A) + (B) + (C) + (D) + (E)"]
[null,null,null,null,null,null,"DESONERADO","NÃO DESONER.","DESONERADO","NÃO DESONER."]
[null,"COMPOSIÇÃO","COMP 375_SEE","REFLETOR DE LED HOLOFORTE 50W","UN ",null,null,null,82.16,83.32]
[null,"AGETOP_I",12,"ELETRICISTA","h     ",0.41649999999999998,13.95,16.16,5.81,6.73]
[null,"AGETOP_I",8,"AJUDANTE","h     ",0.17349999999999999,8.75,10.14,1.52,1.76]
[null,"MÃO DE OBRA (B) - TOTAL",null,null,null,null,null,null,7.33,8.49]
[null,"COTAÇÃO","COT 190_SEE","REFLETOR DE LED HOLOFORTE 50W","UN",1,74.830000000000013,74.830000000000013,74.83,74.83]
[null,"MATERIAL (C) - TOTAL",null,null,null,null,null,null,74.83,74.83]
[]
[382,"FONTE","CÓDIGO","DESCRIÇÃO","UNIDADE","COEFIC.","CUSTO UNITÁRIO",null,"CUSTO  TOTAL (A) + (B) + (C) + (D) + (E)"]
[null,null,null,null,null,null,"DESONERADO","NÃO DESONER.","DESONERADO","NÃO DESONER."]
[null,"COMPOSIÇÃO","COMP 382_SEE","TE DE REDUCAO DE FERRO GALVANIZADO, COM ROSCA BSP, DE 3/4\" X 1/2\"","UN ",null,null,null,24.25,26.43]
[null,"AGETOP_I",8,"AJUDANTE","h     ",0.6,8.75,10.14,5.25,6.08]
[null,"AGETOP_I",11,"ENCANADOR","h     ",0.61050000000000004,13.95,16.16,8.52,9.8699999999999992]
[null,"MÃO DE OBRA (B) - TOTAL",null,null,null,null,null,null,13.77,15.95]
[null,"SINAPI_I",3146,"FITA VEDA ROSCA EM ROLOS DE 18 MM X 10 M (L X C)","UN    ",0.12075471698113208,3.4,3.4,0.41,0.41]
[null,"SINAPI_I",6302,"TE DE REDUCAO DE FERRO GALVANIZADO, COM ROSCA BSP, DE 3/4\" X 1/2\"","UN    ",1,10.07,10.07,10.07,10.07]
[null,"MATERIAL (C) - TOTAL",null,null,null,null,null,null,10.48,10.48]
[]
[383,"FONTE","CÓDIGO","DESCRIÇÃO","UNIDADE","COEFIC.","CUSTO UNITÁRIO",null,"CUSTO  TOTAL (A) + (B) + (C) + (D) + (E)"]
[null,null,null,null,null,null,"DESONERADO","NÃO DESONER.","DESONERADO","NÃO DESONER."]
[null,"COMPOSIÇÃO","COMP 383_SEE","BUCHA DE REDUCAO DE FERRO GALVANIZADO, COM ROSCA BSP, DE 1/2\" X 1/4\"","UN ",null,null,null,7.68,8.26]
[null,"AGETOP_I",8,"AJUDANTE","h     ",0.16,8.75,10.14,1.4,1.62]
[null,"AGETOP_I",11,"ENCANADOR","h     ",0.16,13.95,16.16,2.23,2.59]
[null,"MÃO DE OBRA (B) - TOTAL",null,null,null,null,null,null,3.63,4.21]
[null,"AGETOP_I","H689","FITA VEDAROSCA 12 MM","m",1.2,0.28000000000000003,0.28000000000000003,0.34,0.34]
[null,"SINAPI_I",770,"BUCHA DE REDUCAO DE FERRO GALVANIZADO, COM ROSCA BSP, DE 1/2\" X 1/4\"","UN    ",1,3.71,3.71,3.71,3.71]
[null,"MATERIAL (C) - TOTAL",null,null,null,null,null,null,4.05,4.05]
[]
[212,"FONTE","CÓDIGO","DESCRIÇÃO","UNIDADE","COEFIC.","CUSTO UNITÁRIO",null,"CUSTO  TOTAL (A) + (B) + (C) + (D) + (E)"]
[null,null,null,null,null,null,"DESONERADO","NÃO DESONER.","DESONERADO","NÃO DESONER."]
[null,"COMPOSIÇÃO","COMP 212_SEE","NIPLE DE REDUÇÃO 1/2\" X 1/4\" BSP","UN ",null,null,null,9.68,10.26]
[null,"AGETOP_I",8,"AJUDANTE","h     ",0.16,8.75,10.14,1.4,1.62]
[null,"AGETOP_I",11,"ENCANADOR","h     ",0.16,13.95,16.16,2.23,2.59]
[null,"MÃO DE OBRA (B) - TOTAL",null,null,null,null,null,null,3.63,4.21]
[null,"COTAÇÃO","COT 103_SEE","NIPLE DE REDUÇÃO 1/2\" X 1/4\" BSP","UN",1,6.0533333333333337,6.0533333333333337,6.05,6.05]
[null,"MATERIAL (C) - TOTAL",null,null,null,null,null,null,6.05,6.05]
[]
[213,"FONTE","CÓDIGO","DESCRIÇÃO","UNIDADE","COEFIC.","CUSTO UNITÁRIO",null,"CUSTO  TOTAL (A) + (B) + (C) + (D) + (E)"]
[null,null,null,null,null,null,"DESONERADO","NÃO DESONER.","DESONERADO","NÃO DESONER."]
[null,"COMPOSIÇÃO","COMP 213_SEE","NIPLE DE REDUÇÃO 3/4\" X 1/2\" BSP","UN ",null,null,null,13.34,13.920000000000002]
[null,"AGETOP_I",8,"AJUDANTE","h     ",0.16,8.75,10.14,1.4,1.62]
[null,"AGETOP_I",11,"ENCANADOR","h     ",0.16,13.95,16.16,2.23,2.59]
[null,"MÃO DE OBRA (B) - TOTAL",null,null,null,null,null,null,3.63,4.21]
[null,"COTAÇÃO","COT 104_SEE","NIPLE DE REDUÇÃO 3/4\" X 1/2\" BSP","UN",1,9.7099999999999991,9.7099999999999991,9.7100000000000009,9.7100000000000009]
[null,"MATERIAL (C) - TOTAL",null,null,null,null,null,null,9.7100000000000009,9.7100000000000009]
[]
[237,"FONTE","CÓDIGO","DESCRIÇÃO","UNIDADE","COEFIC.","CUSTO UNITÁRIO",null,"CUSTO  TOTAL (A) + (B) + (C) + (D) + (E)"]
[null,null,null,null,null,null,"DESONERADO","NÃO DESONER.","DESONERADO","NÃO DESONER."]
[null,"COMPOSIÇÃO","COMP 237_SEE","FITA ANTICORROSIVA","M",null,null,null,11.16,11.879999999999999]
[null,"AGETOP_I",8,"AJUDANTE","h     ",0.2,8.75,10.14,1.75,2.0299999999999998]
[null,"AGETOP_I",12,"ELETRICISTA","h     ",0.2,13.95,16.16,2.79,3.23]
[null,"MÃO DE OBRA (B) - TOTAL",null,null,null,null,null,null,4.54,5.26]
[null,"SINAPI_I",39634,"FITA ADESIVA ANTICORROSIVA DE PVC FLEXIVEL, COR PRETA, PARA PROTECAO TUBULACAO, 50 MM X 30 M (L X C), E= *0,25* MM","M     ",1,6.62,6.62,6.62,6.62]
[null,"MATERIAL (C) - TOTAL",null,null,null,null,null,null,6.62,6.62]
[]
[542,"FONTE","CÓDIGO","DESCRIÇÃO","UNIDADE","COEFIC.","CUSTO UNITÁRIO",null,"CUSTO  TOTAL (A) + (B) + (C) + (D) + (E)"]
[null,null,null,null,null,null,"DESONERADO","NÃO DESONER.","DESONERADO","NÃO DESONER."]
[null,"COMPOSIÇÃO","COMP 542_SEE","VÁLVULA UGV 3/4\" (S) LATÃO","UN ",null,null,null,25.65,27.2]
[null,"AGETOP_I",8,"AJUDANTE","h     ",0.432,8.75,10.14,3.78,4.38]
[null,"AGETOP_I",11,"ENCANADOR","h     ",0.432,13.95,16.16,6.03,6.98]
[null,"MÃO DE OBRA (B) - TOTAL",null,null,null,null,null,null,9.81,11.36]
[null,"COTAÇÃO","COT 281_SEE","VÁLVULA UGV 3/4\" (S) LATÃO","UN ",1,15.836666666666666,15.836666666666666,15.84,15.84]
[null,"MATERIAL (C) - TOTAL",null,null,null,null,null,null,15.84,15.84]
[]
[543,"FONTE","CÓDIGO","DESCRIÇÃO","UNIDADE","COEFIC.","CUSTO UNITÁRIO",null,"CUSTO  TOTAL (A) + (B) + (C) + (D) + (E)"]
[null,null,null,null,null,null,"DESONERADO","NÃO DESONER.","DESONERADO","NÃO DESONER."]
[null,"COMPOSIÇÃO","COMP 543_SEE","VÁLVULA UGV 1/2\" (S) LATÃO","UN ",null,null,null,24.98,26.53]
[null,"AGETOP_I",8,"AJUDANTE","h     ",0.432,8.75,10.14,3.78,4.38]
[null,"AGETOP_I",11,"ENCANADOR","h     ",0.432,13.95,16.16,6.03,6.98]
[null,"MÃO DE OBRA (B) - TOTAL",null,null,null,null,null,null,9.81,11.36]
[null,"COTAÇÃO","COT 282_SEE","VÁLVULA UGV 1/2\" (S) LATÃO","UN ",1,15.166666666666666,15.166666666666666,15.17,15.17]
[null,"MATERIAL (C) - TOTAL",null,null,null,null,null,null,15.17,15.17]
[]
[211,"FONTE","CÓDIGO","DESCRIÇÃO","UNIDADE","COEFIC.","CUSTO UNITÁRIO",null,"CUSTO  TOTAL (A) + (B) + (C) + (D) + (E)"]
[null,null,null,null,null,null,"DESONERADO","NÃO DESONER.","DESONERADO","NÃO DESONER."]
[null,"COMPOSIÇÃO","COMP 211_SEE","REGULADOR DE 2º ESTÁGIO 5KG/H","UN ",null,null,null,86.72,90.86]
[null,"AGETOP_I",8,"AJUDANTE","h     ",1.1499999999999999,8.75,10.14,10.06,11.66]
[null,"AGETOP_I",11,"ENCANADOR","h     ",1.1499999999999999,13.95,16.16,16.04,18.579999999999998]
[null,"MÃO DE OBRA (B) - TOTAL",null,null,null,null,null,null,26.1,30.24]
[null,"COTAÇÃO","COT 102_SEE","REGULADOR DE 2º ESTÁGIO 5KG/H","UN",1,59.833333333333336,59.833333333333336,59.83,59.83]
[null,"AGETOP_I","H689","FITA VEDAROSCA 12 MM","m",2.82,0.28000000000000003,0.28000000000000003,0.79,0.79]
[null,"MATERIAL (C) - TOTAL",null,null,null,null,null,null,60.62,60.62]
[]
[210,"FONTE","CÓDIGO","DESCRIÇÃO","UNIDADE","COEFIC.","CUSTO UNITÁRIO",null,"CUSTO  TOTAL (A) + (B) + (C) + (D) + (E)"]
[null,null,null,null,null,null,"DESONERADO","NÃO DESONER.","DESONERADO","NÃO DESONER."]
[null,"COMPOSIÇÃO","COMP 210_SEE","REGULADOR DE 1º ESTÁGIO 60KG/H MODELO AP-40  COM MANÔMETRO","UN ",null,null,null,232.47,236.61]
[null,"AGETOP_I",8,"AJUDANTE","h     ",1.1499999999999999,8.75,10.14,10.06,11.66]
[null,"AGETOP_I",11,"ENCANADOR","h     ",1.1499999999999999,13.95,16.16,16.04,18.579999999999998]
[null,"MÃO DE OBRA (B) - TOTAL",null,null,null,null,null,null,26.1,30.24]
[null,"COTAÇÃO","COT 101_SEE","REGULADOR DE 1º ESTÁGIO 60KG/H MODELO AP-40  COM MANÔMETRO","UN",1,205.57666666666668,205.57666666666668,205.58,205.58]
[null,"AGETOP_I","H689","FITA VEDAROSCA 12 MM","m",2.82,0.28000000000000003,0.28000000000000003,0.79,0.79]
[null,"MATERIAL (C) - TOTAL",null,null,null,null,null,null,206.37,206.37]
[]
[235,"FONTE","CÓDIGO","DESCRIÇÃO","UNIDADE","COEFIC.","CUSTO UNITÁRIO",null,"CUSTO  TOTAL (A) + (B) + (C) + (D) + (E)"]
[null,null,null,null,null,null,"DESONERADO","NÃO DESONER.","DESONERADO","NÃO DESONER."]
[null,"COMPOSIÇÃO","COMP 235_SEE","PLACA DE SINALIZAÇÃO EM PVC COD 01 - (300X300) PROIBIDO FUMAR","UN ",null,null,null,25.319999999999997,25.439999999999998]
[null,"AGETOP_I",5,"SERVENTE","h     ",0.09,8.75,10.14,0.79,0.91]
[null,"MÃO DE OBRA (B) - TOTAL",null,null,null,null,null,null,0.79,0.91]
[null,"AGETOP_I",3070,"BUCHA DE NYLON S-6","un",2,0.04,0.04,0.08,0.08]
[null,"AGETOP_I",3393,"PARAFUSO P/BUCHA S-6","un",2,0.08,0.08,0.16,0.16]
[null,"SINAPI_I",37556,"PLACA DE SINALIZACAO DE SEGURANCA CONTRA INCENDIO, FOTOLUMINESCENTE, QUADRADA, *20 X 20* CM, EM PVC *2* MM ANTI-CHAMAS (SIMBOLOS, CORES E PICTOGRAMAS CONFORME NBR 13434)","UN    ",1,24.29,24.29,24.29,24.29]
[null,"MATERIAL (C) - TOTAL",null,null,null,null,null,null,24.529999999999998,24.529999999999998]
[]
[236,"FONTE","CÓDIGO","DESCRIÇÃO","UNIDADE","COEFIC.","CUSTO UNITÁRIO",null,"CUSTO  TOTAL (A) + (B) + (C) + (D) + (E)"]
[null,null,null,null,null,null,"DESONERADO","NÃO DESONER.","DESONERADO","NÃO DESONER."]
[null,"COMPOSIÇÃO","COMP 236_SEE","PLACA DE SINALIZAÇÃO EM PVC COD 06 - (300X300) PERIGO INFLAMÁVEL","UN ",null,null,null,25.319999999999997,25.439999999999998]
[null,"AGETOP_I",5,"SERVENTE","h     ",0.09,8.75,10.14,0.79,0.91]
[null,"MÃO DE OBRA (B) - TOTAL",null,null,null,null,null,null,0.79,0.91]
[null,"AGETOP_I",3070,"BUCHA DE NYLON S-6","un",2,0.04,0.04,0.08,0.08]
[null,"AGETOP_I",3393,"PARAFUSO P/BUCHA S-6","un",2,0.08,0.08,0.16,0.16]
[null,"SINAPI_I",37556,"PLACA DE SINALIZACAO DE SEGURANCA CONTRA INCENDIO, FOTOLUMINESCENTE, QUADRADA, *20 X 20* CM, EM PVC *2* MM ANTI-CHAMAS (SIMBOLOS, CORES E PICTOGRAMAS CONFORME NBR 13434)","UN    ",1,24.29,24.29,24.29,24.29]
[null,"MATERIAL (C) - TOTAL",null,null,null,null,null,null,24.529999999999998,24.529999999999998]
[]
[45,"FONTE","CÓDIGO","DESCRIÇÃO","UNIDADE","COEFIC.","CUSTO UNITÁRIO",null,"CUSTO  TOTAL (A) + (B) + (C) + (D) + (E)"]
[null,null,null,null,null,null,"DESONERADO","NÃO DESONER.","DESONERADO","NÃO DESONER."]
[null,"COMPOSIÇÃO","COMP 045_SEE","LAUDO DE ESTANQUEIDADE","UN ",null,null,null,936,1085.1199999999999]
[null,"AGETOP",250101,"ENGENHEIRO - (OBRAS CIVIS)","H     ",16,58.5,67.819999999999993,936,1085.1199999999999]
[null,"MÃO DE OBRA (B) - TOTAL",null,null,null,null,null,null,936,1085.1199999999999]
[null,"MATERIAL (C) - TOTAL",null,null,null,null,null,null,0,0]
[]
[199,"FONTE","CÓDIGO","DESCRIÇÃO","UNIDADE","COEFIC.","CUSTO UNITÁRIO",null,"CUSTO  TOTAL (A) + (B) + (C) + (D) + (E)"]
[null,null,null,null,null,null,"DESONERADO","NÃO DESONER.","DESONERADO","NÃO DESONER."]
[null,"COMPOSIÇÃO","COMP 199_SEE","ESTACA A TRADO DIAM.40 CM S/FERRO","M",null,null,null,53.539999999999992,55.83]
[null,"AGETOP_I",5,"SERVENTE","h     ",0.64790000000000003,8.75,10.14,5.67,6.57]
[null,"AGETOP_I",4,"PEDREIRO","h     ",0.56559999999999999,13.95,16.16,7.89,9.14]
[null,"AGETOP_I",32,"OPERADOR DE BETONEIRA ","h     ",8.09E-2,10.51,12.18,0.85,0.99]
[null,"MÃO DE OBRA (B) - TOTAL",null,null,null,null,null,null,14.409999999999998,16.7]
[null,"AGETOP_I",2804,"AREIA GROSSA","m3",7.2590000000000002E-2,90,90,6.53,6.53]
[null,"AGETOP_I",2386,"BRITA No. 01","m3",8.9419999999999999E-2,85.36,85.36,7.63,7.63]
[null,"AGETOP_I",2497,"BRITA No.02","m3",8.9419999999999999E-2,74.900000000000006,74.900000000000006,6.7,6.7]
[null,"AGETOP_I",1215,"CIMENTO PORTLAND C.P. 32","Kg",46.848799999999997,0.39,0.39,18.27,18.27]
[null,"MATERIAL (C) - TOTAL",null,null,null,null,null,null,39.129999999999995,39.129999999999995]