{"text_format":"1","workbook":"xlsx","n_sheets":8,"sheets":["Orçamento","Resumo ","Somatório","Cronog_60_Dias","Composição BDI","Relatório CENTRAL","Parc Maior Relev","Composições"],"not_rendered":{"charts":0,"images":3,"macros":1,"external_links":0,"defined_names":104,"comments":2,"pivot_tables":0},"unopened":[],"bounds":{"document_bytes":16777216,"sheet_cells":100000,"rows_first":2000,"rows_last":500,"rows_between":2000,"halvings":0,"cell_chars":16384,"cell_head_chars":4096},"cells_cut":0,"cells_raw":0,"read":"whole","date_system":"1900"}

{"sheet":"Orçamento","index":0,"n_rows":343,"n_cols":27,"rows_kept":343,"cut":false,"hidden":false,"merged":[[332,22,332,24],[333,22,333,24],[6,12,6,13],[5,12,5,13],[12,23,12,25],[11,23,11,25],[0,14,0,24],[8,14,8,16],[9,14,9,16],[11,14,11,16],[12,14,12,16],[14,14,14,24],[1,14,1,24],[4,14,4,24],[7,14,7,24],[341,18,341,24],[340,16,340,24],[336,16,336,24],[337,16,337,24],[338,16,338,24],[10,14,10,26],[13,14,13,26],[2,14,2,22],[3,14,3,22],[5,18,5,22],[6,18,6,22],[11,18,11,22],[12,18,12,22],[6,14,6,17],[5,14,5,17],[3,23,3,25],[2,23,2,25],[5,23,5,25],[6,23,6,25],[8,18,8,20],[328,17,333,17],[334,22,334,24],[328,22,328,24],[329,22,329,24],[330,22,330,24],[8,23,8,25],[339,16,339,24]]}
[]
[]
[null,null,null,null,null,null,null,null,null,null,null,null,null,null,"UNIDADE ESCOLAR",null,null,null,null,null,null,null,null,"CÓDIGO INEP"]
[null,null,null,null,null,null,null,null,null,null,null,null,{"$f":"IF($M$7=\"MANUAL\",\"DESPROTEJA A PLANILHA PARA FORMATAR\",\"\")","v":""},null,"CRE DE IPORÁ",null,null,null,null,null,null,null,null,52027163]
[]
["Nmax",null,null,null,null,null,null,null,null,null,null,null,null,null,"OBRA",null,null,null,"DATA",null,null,null,null,"CIDADE"]
[{"$f":"MAX($C$18:$C$328)","v":4},null,null,null,null,null,null,null,null,null,null,null,null,null,"REFORMA E AMPLIAÇÃO",null,null,null,"2020-06-10",null,null,null,null,"IPORÁ"]
[]
[null,null,null,null,null,null,null,null,null,null,null,null,null,null,"CRE",null,null,"ENDEREÇO","REFERÊNCIA AGETOP",null,null,null,null,"REFERÊNCIA SINAPI"]
[null,null,null,null,null,null,null,null,null,null,null,null,null,null,"CRE DE IPORÁ",null,null,"Rua D - Vila Padre Cícero - S/N - CEP:76.200-000","ABR/19","DESONERADA",null,null,null,"ABR/20","DESONERADA","DESONERADA"]
[]
[null,null,null,null,null,null,null,null,null,null,null,null,null,null,"ÁREA EXISTENTE (M²)",null,null,"ÁREA A CONSTRUIR (M²)","ÁREA A DEMOLIR (M²)",null,null,null,null,"ÁREA TOTAL CONSTRUÍDA (M²)"]
[null,null,null,null,null,null,null,null,null,null,null,null,null,null,773,null,null,1.52,null,null,null,null,null,774.52]
[]
[null,null,null,null,null,null,null,null,null,null,null,"FILTRO",null,null,"PLANILHA ORÇAMENTÁRIA"]
["Nível E","Save Nivel","Nível C","Altura","n1","n2","n3","n4","n5","Czero","Cnível","↓","Nível","Nível Corrigido","ITEM","TABELA","CODIGO","DESCRIÇÃO DOS SERVIÇOS","UNID","QUANT","REPET","QUANT TOTAL","MAT","MO","T.SERVIÇO UNIT","VALOR TOTAL","OBSERVAÇÕES¹"]
[{"$f":"CHOOSE(1+LOG(1+2*(ORÇAMENTO.Nivel=\"Nível 1\")+4*(ORÇAMENTO.Nivel=\"Nível 2\")+8*(ORÇAMENTO.Nivel=\"Nível 3\")+16*(ORÇAMENTO.Nivel=\"Nível 4\")+32*(ORÇAMENTO.Nivel=\"Serviço\"),2),0,1,2,3,4,\"S\")","v":"S"},{"$f":"IF(OR(C17=\"s\",C17=0),OFFSET(B17,-1,0),C17)","v":"Save Nivel"},{"$f":"IF(OFFSET(C17,-1,0)=\"L\",1,IF(OFFSET(C17,-1,0)=1,2,IF(OR(A17=\"s\",A17=0),\"S\",IF(AND(OFFSET(C17,-1,0)=2,A17=4),3,IF(AND(OR(OFFSET(C17,-1,0)=\"s\",OFFSET(C17,-1,0)=0),A17<>\"s\",A17>OFFSET(B17,-1,0)),OFFSET(B17,-1,0),A17)))))","v":"S"},{"$f":"IF(OR(C17=\"S\",C17=0),0,IF(ISERROR(K17),J17,SMALL(J17:K17,1)))","v":0},{"$f":"IF($C17=1,OFFSET(E17,-1,0)+1,OFFSET(E17,-1,0))","v":"n1"},{"$f":"IF($C17=1,0,IF($C17=2,OFFSET(F17,-1,0)+1,OFFSET(F17,-1,0)))","v":"n2"},{"$f":"IF(AND($C17<=2,$C17<>0),0,IF($C17=3,OFFSET(G17,-1,0)+1,OFFSET(G17,-1,0)))","v":"n3"},{"$f":"IF(AND($C17<=3,$C17<>0),0,IF($C17=4,OFFSET(H17,-1,0)+1,OFFSET(H17,-1,0)))","v":"n4"},{"$f":"IF(AND($C17<=4,$C17<>0),0,IF(AND($C17=\"S\",$Y17>0),OFFSET(I17,-1,0)+1,OFFSET(I17,-1,0)))","v":"n5"},{"$f":"IF(OR($C17=\"S\",$C17=0),0,MATCH(0,OFFSET($D17,1,$C17,ROW($C$328)-ROW($C17)),0))","v":0},{"$f":"IF(OR($C17=\"S\",$C17=0),0,MATCH(OFFSET($D17,0,$C17)+1,OFFSET($D17,1,$C17,ROW($C$328)-ROW($C17)),0))","v":0},{"$f":"IF(OR(Y17>0,$C17=1),\"F\",\"\")","v":""},"Serviço",{"$f":"CHOOSE(1+LOG(1+2*(C17=1)+4*(C17=2)+8*(C17=3)+16*(C17=4)+32*(C17=\"S\"),2),\"\",\"Nível 1\",\"Nível 2\",\"Nível 3\",\"Nível 4\",\"Serviço\")","v":"Serviço"},"-","SINAPI",null,"(sem código)","-",null,"REPET","-",0,0,0,"-",""]
[0,null,"L",{"$f":"COUNTA(OFFSET(D18,1,0):D$328)","v":309},{"$f":"LEFT(O19,1)-1","v":0},null,null,null,null,null,null,"F","LOTE","LOTE","REFORMA E AMPLIAÇÃO - CRE DE IPORÁ",null,null,null,null,null,null,null,null,null,null,118659.55000000003]
[{"$f":"CHOOSE(1+LOG(1+2*(ORÇAMENTO.Nivel=\"Nível 1\")+4*(ORÇAMENTO.Nivel=\"Nível 2\")+8*(ORÇAMENTO.Nivel=\"Nível 3\")+16*(ORÇAMENTO.Nivel=\"Nível 4\")+32*(ORÇAMENTO.Nivel=\"Serviço\"),2),0,1,2,3,4,\"S\")","v":1},{"$f":"IF(OR(C19=\"s\",C19=0),OFFSET(B19,-1,0),C19)","v":1},{"$f":"IF(OFFSET(C19,-1,0)=\"L\",1,IF(OFFSET(C19,-1,0)=1,2,IF(OR(A19=\"s\",A19=0),\"S\",IF(AND(OFFSET(C19,-1,0)=2,A19=4),3,IF(AND(OR(OFFSET(C19,-1,0)=\"s\",OFFSET(C19,-1,0)=0),A19<>\"s\",A19>OFFSET(B19,-1,0)),OFFSET(B19,-1,0),A19)))))","v":1},{"$f":"IF(OR(C19=\"S\",C19=0),0,IF(ISERROR(K19),J19,SMALL(J19:K19,1)))","v":11},{"$f":"IF($C19=1,OFFSET(E19,-1,0)+1,OFFSET(E19,-1,0))","v":1},{"$f":"IF($C19=1,0,IF($C19=2,OFFSET(F19,-1,0)+1,OFFSET(F19,-1,0)))","v":0},{"$f":"IF(AND($C19<=2,$C19<>0),0,IF($C19=3,OFFSET(G19,-1,0)+1,OFFSET(G19,-1,0)))","v":0},{"$f":"IF(AND($C19<=3,$C19<>0),0,IF($C19=4,OFFSET(H19,-1,0)+1,OFFSET(H19,-1,0)))","v":0},{"$f":"IF(AND($C19<=4,$C19<>0),0,IF(AND($C19=\"S\",$Y19>0),OFFSET(I19,-1,0)+1,OFFSET(I19,-1,0)))","v":0},{"$f":"IF(OR($C19=\"S\",$C19=0),0,MATCH(0,OFFSET($D19,1,$C19,ROW($C$328)-ROW($C19)),0))","v":309},{"$f":"IF(OR($C19=\"S\",$C19=0),0,MATCH(OFFSET($D19,0,$C19)+1,OFFSET($D19,1,$C19,ROW($C$328)-ROW($C19)),0))","v":11},{"$f":"IF(OR(Y19>0,$C19=1),\"F\",\"\")","v":"F"},"Nível 1",{"$f":"CHOOSE(1+LOG(1+2*(C19=1)+4*(C19=2)+8*(C19=3)+16*(C19=4)+32*(C19=\"S\"),2),\"\",\"Nível 1\",\"Nível 2\",\"Nível 3\",\"Nível 4\",\"Serviço\")","v":"Nível 1"},"1.","AGETOP",null,"ADEQUAÇÕES DE ACESSIBILIDADE (CALÇADAS EXTERNAS)","UN",1,1,1]
[2,2,2,2,1,1,0,0,0,10,2,"","Nível 2","Nível 2","1.1.","AGETOP",null,"SERVIÇOS PRELIMINARES","-",null,1,"-"]
["S",2,"S",0,1,1,0,0,0,0,0,"","Serviço","Serviço","1.1.0.0.1.","AGETOP",20121,"DEM. MANUAL EM CONCR.SIMPLES C/TR.ATE CB.E CARGA (O.C.)","m3    ",2.29,1,2.29,null,null,null,null,""]
[2,2,2,3,1,2,0,0,0,8,3,"","Nível 2","Nível 2","1.2.","AGETOP",null,"TRANSPORTES","-",null,1,"-",null,null,null,null,""]
["S",2,"S",0,1,2,0,0,0,0,0,"","Serviço","Serviço","1.2.0.0.1.","SINAPI",72900,"TRANSPORTE DE ENTULHO COM CAMINHAO BASCULANTE 6 M3, RODOVIA PAVIMENTADA, DMT 0,5 A 1,0 KM","M3",2.29,1,2.29,null,null,null,null,""]
["S",2,"S",0,1,2,0,0,0,0,0,"","Serviço","Serviço","1.2.0.0.2.","SINAPI",72897,"CARGA MANUAL DE ENTULHO EM CAMINHAO BASCULANTE 6 M3","M3",2.29,1,2.29,null,null,null,null,""]
[2,2,2,2,1,3,0,0,0,5,2,"","Nível 2","Nível 2","1.3.",null,null,"ESQUADRIAS METÁLICAS","-",null,1,"-",null,null,null,null,""]
["S",2,"S",0,1,3,0,0,0,0,0,"","Serviço","Serviço","1.3.0.0.1.","COMPOSIÇÃO","COMP 084_SEE","GUARDA-CORPO COM CORRIMÃO - SEDUC","M",11.4,1,11.4,null,null,null,null,""]
[2,2,2,3,1,4,0,0,0,3,23,"","Nível 2","Nível 2","1.4.",null,null,"REVESTIMENTO DE PISO","-",null,1,"-",null,null,null,null,""]
["S",2,"S",0,1,4,0,0,0,0,0,"","Serviço","Serviço","1.4.0.0.1.","AGETOP",220102,"PISO CONCRETO DESEMPENADO ESPESSURA = 5 CM  1:2,5:3,5","m2    ",12.3,1,12.3,null,null,null,null,""]
["S",2,"S",0,1,4,0,0,0,0,0,"","Serviço","Serviço","1.4.0.0.2.","AGETOP",221126,"PISO DE LADRILHO HIDRÁULICO COLORIDO MODELO TÁTIL ( ALERTA OU DIRECIONAL) SEM LASTRO","m2    ",40.1,1,40.1,null,null,null,null,""]
[1,1,1,43,2,0,0,0,0,298,43,"F","Nível 1","Nível 1","2.","SINAPI",null,"REFORMA E ADEQUAÇÃO DOS SANITÁRIOS","UN",1,1,1,null,null,null,null,""]
[2,2,2,11,2,1,0,0,0,42,11,"","Nível 2","Nível 2","2.1.","SINAPI",null,"SERVIÇOS PRELIMINARES","-",null,1,"-",null,null,null,null,""]
["S",2,"S",0,2,1,0,0,0,0,0,"","Serviço","Serviço","2.1.0.0.1.","SINAPI",97640,"REMOÇÃO DE FORROS DE DRYWALL, PVC E FIBROMINERAL, DE FORMA MANUAL, SEM REAPROVEITAMENTO. AF_12/2017","M2",27.47,1,27.47,null,null,null,null,""]
["S",2,"S",0,2,1,0,0,0,0,0,"","Serviço","Serviço","2.1.0.0.2.","SINAPI",97642,"REMOÇÃO DE TRAMA METÁLICA OU DE MADEIRA PARA FORRO, DE FORMA MANUAL, SEM REAPROVEITAMENTO. AF_12/2017","M2",27.47,1,27.47,null,null,null,null,""]
["S",2,"S",0,2,1,0,0,0,0,0,"","Serviço","Serviço","2.1.0.0.3.","AGETOP",20106,"RETIRADA DE JANELAS OU PORTAIS C/ TRANSP. ATÉ CB. E CARGA","m2    ",10.8,1,10.8,null,null,null,null,""]
["S",2,"S",0,2,1,0,0,0,0,0,"","Serviço","Serviço","2.1.0.0.4.","AGETOP",20111,"DEM.PISO CERAM.SOBRE LASTRO CONC.C/TR.CB.E CARGA","m2    ",42.78,1,42.78,null,null,null,null,""]
["S",2,"S",0,2,1,0,0,0,0,0,"","Serviço","Serviço","2.1.0.0.5.","AGETOP",20115,"DEMOLIÇÃO DE REVESTIMENTOS COM AZULEJOS C/TRANSP.ATE CB. E CARGA","m2    ",60.6,1,60.6,null,null,null,null,""]
["S",2,"S",0,2,1,0,0,0,0,0,"","Serviço","Serviço","2.1.0.0.6.","AGETOP",20118,"DEM.ALVEN.TIJOLO S/REAP. C/TR.ATE CB. E CARGA","m3    ",0.56999999999999995,1,0.56999999999999995,null,null,null,null,""]
["S",2,"S",0,2,1,0,0,0,0,0,"","Serviço","Serviço","2.1.0.0.7.","AGETOP",20137,"DEMOLIÇAO BACIA SANITARIA C/ TRANSP. ATÉ CB. E CARGA","Un    ",3,1,3,null,null,null,null,""]
[{"$f":"CHOOSE(1+LOG(1+2*(ORÇAMENTO.Nivel=\"Nível 1\")+4*(ORÇAMENTO.Nivel=\"Nível 2\")+8*(ORÇAMENTO.Nivel=\"Nível 3\")+16*(ORÇAMENTO.Nivel=\"Nível 4\")+32*(ORÇAMENTO.Nivel=\"Serviço\"),2),0,1,2,3,4,\"S\")","v":"S"},{"$f":"IF(OR(C39=\"s\",C39=0),OFFSET(B39,-1,0),C39)","v":2},{"$f":"IF(OFFSET(C39,-1,0)=\"L\",1,IF(OFFSET(C39,-1,0)=1,2,IF(OR(A39=\"s\",A39=0),\"S\",IF(AND(OFFSET(C39,-1,0)=2,A39=4),3,IF(AND(OR(OFFSET(C39,-1,0)=\"s\",OFFSET(C39,-1,0)=0),A39<>\"s\",A39>OFFSET(B39,-1,0)),OFFSET(B39,-1,0),A39)))))","v":"S"},{"$f":"IF(OR(C39=\"S\",C39=0),0,IF(ISERROR(K39),J39,SMALL(J39:K39,1)))","v":0},{"$f":"IF($C39=1,OFFSET(E39,-1,0)+1,OFFSET(E39,-1,0))","v":2},{"$f":"IF($C39=1,0,IF($C39=2,OFFSET(F39,-1,0)+1,OFFSET(F39,-1,0)))","v":1},{"$f":"IF(AND($C39<=2,$C39<>0),0,IF($C39=3,OFFSET(G39,-1,0)+1,OFFSET(G39,-1,0)))","v":0},{"$f":"IF(AND($C39<=3,$C39<>0),0,IF($C39=4,OFFSET(H39,-1,0)+1,OFFSET(H39,-1,0)))","v":0},{"$f":"IF(AND($C39<=4,$C39<>0),0,IF(AND($C39=\"S\",$Y39>0),OFFSET(I39,-1,0)+1,OFFSET(I39,-1,0)))","v":0},0,0,{"$f":"IF(OR(Y39>0,$C39=1),\"F\",\"\")","v":""},"Serviço",{"$f":"CHOOSE(1+LOG(1+2*(C39=1)+4*(C39=2)+8*(C39=3)+16*(C39=4)+32*(C39=\"S\"),2),\"\",\"Nível 1\",\"Nível 2\",\"Nível 3\",\"Nível 4\",\"Serviço\")","v":"Serviço"},"2.1.0.0.8.","AGETOP",20140,"DEMOLIÇAO DE VÁLVULA DE DESCARGA C/ TRANSP. ATÉ CB. E CARGA","Un    ",3,1,3,null,null,null,null,""]
["S",2,"S",0,2,1,0,0,0,0,0,"","Serviço","Serviço","2.1.0.0.9.","AGETOP",20139,"DEMOLIÇAO DE BANCADAS C/ TRANSP. ATÉ CB. E CARGA","m2    ",1,1,1,null,null,null,null,""]
[{"$f":"CHOOSE(1+LOG(1+2*(ORÇAMENTO.Nivel=\"Nível 1\")+4*(ORÇAMENTO.Nivel=\"Nível 2\")+8*(ORÇAMENTO.Nivel=\"Nível 3\")+16*(ORÇAMENTO.Nivel=\"Nível 4\")+32*(ORÇAMENTO.Nivel=\"Serviço\"),2),0,1,2,3,4,\"S\")","v":"S"},{"$f":"IF(OR(C41=\"s\",C41=0),OFFSET(B41,-1,0),C41)","v":2},{"$f":"IF(OFFSET(C41,-1,0)=\"L\",1,IF(OFFSET(C41,-1,0)=1,2,IF(OR(A41=\"s\",A41=0),\"S\",IF(AND(OFFSET(C41,-1,0)=2,A41=4),3,IF(AND(OR(OFFSET(C41,-1,0)=\"s\",OFFSET(C41,-1,0)=0),A41<>\"s\",A41>OFFSET(B41,-1,0)),OFFSET(B41,-1,0),A41)))))","v":"S"},{"$f":"IF(OR(C41=\"S\",C41=0),0,IF(ISERROR(K41),J41,SMALL(J41:K41,1)))","v":0},{"$f":"IF($C41=1,OFFSET(E41,-1,0)+1,OFFSET(E41,-1,0))","v":2},{"$f":"IF($C41=1,0,IF($C41=2,OFFSET(F41,-1,0)+1,OFFSET(F41,-1,0)))","v":1},{"$f":"IF(AND($C41<=2,$C41<>0),0,IF($C41=3,OFFSET(G41,-1,0)+1,OFFSET(G41,-1,0)))","v":0},{"$f":"IF(AND($C41<=3,$C41<>0),0,IF($C41=4,OFFSET(H41,-1,0)+1,OFFSET(H41,-1,0)))","v":0},{"$f":"IF(AND($C41<=4,$C41<>0),0,IF(AND($C41=\"S\",$Y41>0),OFFSET(I41,-1,0)+1,OFFSET(I41,-1,0)))","v":0},{"$f":"IF(OR($C41=\"S\",$C41=0),0,MATCH(0,OFFSET($D41,1,$C41,ROW($C$328)-ROW($C41)),0))","v":0},{"$f":"IF(OR($C41=\"S\",$C41=0),0,MATCH(OFFSET($D41,0,$C41)+1,OFFSET($D41,1,$C41,ROW($C$328)-ROW($C41)),0))","v":0},{"$f":"IF(OR(Y41>0,$C41=1),\"F\",\"\")","v":""},"Serviço",{"$f":"CHOOSE(1+LOG(1+2*(C41=1)+4*(C41=2)+8*(C41=3)+16*(C41=4)+32*(C41=\"S\"),2),\"\",\"Nível 1\",\"Nível 2\",\"Nível 3\",\"Nível 4\",\"Serviço\")","v":"Serviço"},"2.1.0.0.10.","AGETOP",20163,"DEMOLIÇÃO DAS INSTALAÇÕES HIDROSANITÁRIAS E AFINS C/ TRANSP. ATÉ CB. E CARGA","H     ",1,1,1,null,null,null,null,""]
[2,2,2,3,2,2,0,0,0,31,3,"","Nível 2","Nível 2","2.2.","AGETOP",null,"TRANSPORTES","-",null,1,"-",null,null,null,null,""]
["S",2,"S",0,2,2,0,0,0,0,0,"","Serviço","Serviço","2.2.0.0.1.","SINAPI",72900,"TRANSPORTE DE ENTULHO COM CAMINHAO BASCULANTE 6 M3, RODOVIA PAVIMENTADA, DMT 0,5 A 1,0 KM","M3",4.6900000000000004,1,4.6900000000000004,null,null,null,null,""]
["S",2,"S",0,2,2,0,0,0,0,0,"","Serviço","Serviço","2.2.0.0.2.","SINAPI",72897,"CARGA MANUAL DE ENTULHO EM CAMINHAO BASCULANTE 6 M3","M3",4.6900000000000004,1,4.6900000000000004,null,null,null,null,""]
[2,2,2,3,2,3,0,0,0,28,3,"","Nível 2","Nível 2","2.3.","SINAPI",null,"ESTRUTURA","-",null,1,"-",null,null,null,null,""]
["S",2,"S",0,2,3,0,0,0,0,0,"","Serviço","Serviço","2.3.0.0.1.","SINAPI",93204,"CINTA DE AMARRAÇÃO DE ALVENARIA MOLDADA IN LOCO EM CONCRETO. AF_03/2016","M",9.6999999999999993,1,9.6999999999999993,null,null,null,null,""]
[{"$f":"CHOOSE(1+LOG(1+2*(ORÇAMENTO.Nivel=\"Nível 1\")+4*(ORÇAMENTO.Nivel=\"Nível 2\")+8*(ORÇAMENTO.Nivel=\"Nível 3\")+16*(ORÇAMENTO.Nivel=\"Nível 4\")+32*(ORÇAMENTO.Nivel=\"Serviço\"),2),0,1,2,3,4,\"S\")","v":"S"},{"$f":"IF(OR(C47=\"s\",C47=0),OFFSET(B47,-1,0),C47)","v":2},{"$f":"IF(OFFSET(C47,-1,0)=\"L\",1,IF(OFFSET(C47,-1,0)=1,2,IF(OR(A47=\"s\",A47=0),\"S\",IF(AND(OFFSET(C47,-1,0)=2,A47=4),3,IF(AND(OR(OFFSET(C47,-1,0)=\"s\",OFFSET(C47,-1,0)=0),A47<>\"s\",A47>OFFSET(B47,-1,0)),OFFSET(B47,-1,0),A47)))))","v":"S"},{"$f":"IF(OR(C47=\"S\",C47=0),0,IF(ISERROR(K47),J47,SMALL(J47:K47,1)))","v":0},{"$f":"IF($C47=1,OFFSET(E47,-1,0)+1,OFFSET(E47,-1,0))","v":2},{"$f":"IF($C47=1,0,IF($C47=2,OFFSET(F47,-1,0)+1,OFFSET(F47,-1,0)))","v":3},{"$f":"IF(AND($C47<=2,$C47<>0),0,IF($C47=3,OFFSET(G47,-1,0)+1,OFFSET(G47,-1,0)))","v":0},{"$f":"IF(AND($C47<=3,$C47<>0),0,IF($C47=4,OFFSET(H47,-1,0)+1,OFFSET(H47,-1,0)))","v":0},{"$f":"IF(AND($C47<=4,$C47<>0),0,IF(AND($C47=\"S\",$Y47>0),OFFSET(I47,-1,0)+1,OFFSET(I47,-1,0)))","v":0},0,0,{"$f":"IF(OR(Y47>0,$C47=1),\"F\",\"\")","v":""},"Serviço",{"$f":"CHOOSE(1+LOG(1+2*(C47=1)+4*(C47=2)+8*(C47=3)+16*(C47=4)+32*(C47=\"S\"),2),\"\",\"Nível 1\",\"Nível 2\",\"Nível 3\",\"Nível 4\",\"Serviço\")","v":"Serviço"},"2.3.0.0.2.","AGETOP",60010,"VERGA/CONTRAVERGA EM CONCRETO ARMADO FCK = 20 MPA","m3    ",0.05,1,0.05,null,null,null,null,""]
[2,2,2,2,2,4,0,0,0,25,2,"","Nível 2","Nível 2","2.4.",null,null,"ALVENARIAS E DIVISÓRIAS","-",null,1,"-",null,null,null,null,""]
["S",2,"S",0,2,4,0,0,0,0,0,"","Serviço","Serviço","2.4.0.0.1.","AGETOP",100201,"ALVENARIA DE TIJOLO FURADO 1/2 VEZ - 9 x 19 x 19 - ARG. (1CALH:4ARML+100KG DE CI/M3)","m2    ",29.2,1,29.2,null,null,null,null,""]
[2,2,2,4,2,5,0,0,0,23,4,"","Nível 2","Nível 2","2.5.",null,null,"ESQUADRIAS METÁLICAS","-",null,1,"-",null,null,null,null,""]
["S",2,"S",0,2,5,0,0,0,0,0,"","Serviço","Serviço","2.5.0.0.1.","AGETOP",180380,"ESQ. MAXIMO AR CHAPA/VIDRO J4 C/FERRAGENS","m2    ",1,1,1,null,null,null,null,""]
["S",2,"S",0,2,5,0,0,0,{"$f":"IF(OR($C52=\"S\",$C52=0),0,MATCH(0,OFFSET($D52,1,$C52,ROW($C$328)-ROW($C52)),0))","v":0},{"$f":"IF(OR($C52=\"S\",$C52=0),0,MATCH(OFFSET($D52,0,$C52)+1,OFFSET($D52,1,$C52,ROW($C$328)-ROW($C52)),0))","v":0},"","Serviço","Serviço","2.5.0.0.2.","AGETOP",180501,"PORTA DE ABRIR EM CHAPA PF-1 C/FERRAGENS","m2    ",7.14,1,7.14,null,null,null,null,""]
["S",2,"S",0,2,5,0,0,0,0,0,"","Serviço","Serviço","2.5.0.0.3.","AGETOP",180509,"PORTA ABRIR CH.P/WC PF-10 C/FERRAGENS","m2    ",7.56,1,7.56,null,null,null,null,""]
[2,2,2,2,2,6,0,0,0,19,2,"","Nível 2","Nível 2","2.6.",null,null,"VIDROS","-",null,1,"-",null,null,null,null,""]
["S",2,"S",0,2,6,0,0,0,0,0,"","Serviço","Serviço","2.6.0.0.1.","AGETOP",190102,"VIDRO LISO 4 MM - COLOCADO","m2    ",1,1,1,null,null,null,null,""]
[2,2,2,5,2,7,0,0,0,17,5,"","Nível 2","Nível 2","2.7.",null,null,"REVESTIMENTO DE PAREDE","-",null,1,"-",null,null,null,null,""]
["S",2,"S",0,2,7,0,0,0,0,0,"","Serviço","Serviço","2.7.0.0.1.","SINAPI",87553,"EMBOÇO, PARA RECEBIMENTO DE CERÂMICA, EM ARGAMASSA TRAÇO 1:2:8, PREPARO MECÂNICO COM BETONEIRA 400L, APLICADO MANUALMENTE EM FACES INTERNAS DE PAREDES, PARA AMBIENTE COM ÁREA MAIOR QUE 10M2, ESPESSURA DE 10MM, COM EXECUÇÃO DE TALISCAS. AF_06/2014","M2",44.2,1,44.2,null,null,null,null,""]
["S",2,"S",0,2,7,0,0,0,0,0,"","Serviço","Serviço","2.7.0.0.2.","AGETOP",200101,"CHAPISCO COMUM","m2    ",58.4,1,58.4,null,null,null,null,""]
["S",2,"S",0,2,7,0,0,0,0,0,"","Serviço","Serviço","2.7.0.0.3.","SINAPI",87547,"MASSA ÚNICA, PARA RECEBIMENTO DE PINTURA, EM ARGAMASSA TRAÇO 1:2:8, PREPARO MECÂNICO COM BETONEIRA 400L, APLICADA MANUALMENTE EM FACES INTERNAS DE PAREDES, ESPESSURA DE 10MM, COM EXECUÇÃO DE TALISCAS. AF_06/2014","M2",17,1,17,null,null,null,null,""]
["S",2,"S",0,2,7,0,0,0,0,0,"","Serviço","Serviço","2.7.0.0.4.","SINAPI",87273,"REVESTIMENTO CERÂMICO PARA PAREDES INTERNAS COM PLACAS TIPO ESMALTADA EXTRA DE DIMENSÕES 33X45 CM APLICADAS EM AMBIENTES DE ÁREA MAIOR QUE 5 M² NA ALTURA INTEIRA DAS PAREDES. AF_06/2014","M2",104.8,1,104.8,null,null,null,null,""]
[2,2,2,2,2,8,0,0,0,12,2,"","Nível 2","Nível 2","2.8.",null,null,"FORROS","-",null,1,"-",null,null,null,null,""]
["S",2,"S",0,2,8,0,0,0,0,0,"","Serviço","Serviço","2.8.0.0.1.","AGETOP",210460,"FORRO DE PVC COM ESTRUTURA EM METALON PINTADA COM TINTA ALQUÍDICA D.F.","m2    ",27.47,1,27.47,null,null,null,null,""]
[2,2,2,2,2,9,0,0,0,10,2,"","Nível 2","Nível 2","2.9.","SINAPI",null,"REVESTIMENTO DE PISO","-",null,1,"-",null,null,null,null,""]
["S",2,"S",0,2,9,0,0,0,0,0,"","Serviço","Serviço","2.9.0.0.1.","SINAPI",87251,"REVESTIMENTO CERÂMICO PARA PISO COM PLACAS TIPO ESMALTADA EXTRA DE DIMENSÕES 45X45 CM APLICADA EM AMBIENTES DE ÁREA MAIOR QUE 10 M2. AF_06/2014","M2",42.78,1,42.78,null,null,null,null,""]
[2,2,2,3,2,10,0,0,0,8,3,"","Nível 2","Nível 2","2.10.",null,null,"FERRAGENS","-",null,1,"-",null,null,null,null,""]
["S",2,"S",0,2,10,0,0,0,0,0,"","Serviço","Serviço","2.10.0.0.1.","AGETOP",230174,"BARRA DE APOIO EM AÇO INOX - 40 CM","un    ",3,1,3,null,null,null,null,""]
["S",2,"S",0,2,10,0,0,0,0,0,"","Serviço","Serviço","2.10.0.0.2.","AGETOP",230176,"BARRA DE APOIO EM AÇO INOX - 80 CM ","un    ",3,1,3,null,null,null,null,""]
[2,2,2,3,2,11,0,0,0,5,3,"","Nível 2","Nível 2","2.11.",null,null,"PINTURA","-",null,1,"-",null,null,null,null,""]
["S",2,"S",0,2,11,0,0,0,0,0,"","Serviço","Serviço","2.11.0.0.1.","AGETOP",261300,"EMASSAMENTO COM MASSA PVA DUAS DEMAOS","m2    ",17,1,17,null,null,null,null,""]
["S",2,"S",0,2,11,0,0,0,0,0,"","Serviço","Serviço","2.11.0.0.2.","AGETOP",261602,"PINT.ESMALTE/ESQUAD.FERRO C/FUNDO ANTICOR.","m2    ",46.1,1,46.1,null,null,null,null,""]
[2,2,2,2,2,12,0,0,0,2,{"$error":"#N/A"},"","Nível 2","Nível 2","2.12.","SINAPI",null,"DIVERSOS","-",null,1,"-",null,null,null,null,""]
["S",2,"S",0,2,12,0,0,0,0,0,"","Serviço","Serviço","2.12.0.0.1.","AGETOP",271608,"BANCADA DE GRANITO C/ESPELHO","m2    ",2.94,1,2.94,null,null,null,null,""]
[1,1,1,16,3,0,0,0,0,255,16,"F","Nível 1","Nível 1","3.","SINAPI",null,"REFORMA DO GALPÃO UTILIZADO","UN",1,1,1,null,null,null,null,""]
[2,2,2,4,3,1,0,0,0,15,4,"","Nível 2","Nível 2","3.1.","SINAPI",null,"SERVIÇOS PRELIMINARES","-",null,1,"-",null,null,null,null,""]
["S",2,"S",0,3,1,0,0,0,0,0,"","Serviço","Serviço","3.1.0.0.1.","AGETOP",20102,"DEMOLICAO-COBERTURA TELHA FIBROCIMENTO/FIBRA DE VIDRO/SIMILARES C/ TRANSP. ATÉ CB. E CARGA","m2    ",40,1,40,null,null,null,null,""]
["S",2,"S",0,3,1,0,0,0,0,0,"","Serviço","Serviço","3.1.0.0.2.","SINAPI",97631,"DEMOLIÇÃO DE ARGAMASSAS, DE FORMA MANUAL, SEM REAPROVEITAMENTO. AF_12/2017","M2",70,1,70,null,null,null,null,""]
[{"$f":"CHOOSE(1+LOG(1+2*(ORÇAMENTO.Nivel=\"Nível 1\")+4*(ORÇAMENTO.Nivel=\"Nível 2\")+8*(ORÇAMENTO.Nivel=\"Nível 3\")+16*(ORÇAMENTO.Nivel=\"Nível 4\")+32*(ORÇAMENTO.Nivel=\"Serviço\"),2),0,1,2,3,4,\"S\")","v":"S"},{"$f":"IF(OR(C77=\"s\",C77=0),OFFSET(B77,-1,0),C77)","v":2},{"$f":"IF(OFFSET(C77,-1,0)=\"L\",1,IF(OFFSET(C77,-1,0)=1,2,IF(OR(A77=\"s\",A77=0),\"S\",IF(AND(OFFSET(C77,-1,0)=2,A77=4),3,IF(AND(OR(OFFSET(C77,-1,0)=\"s\",OFFSET(C77,-1,0)=0),A77<>\"s\",A77>OFFSET(B77,-1,0)),OFFSET(B77,-1,0),A77)))))","v":"S"},{"$f":"IF(OR(C77=\"S\",C77=0),0,IF(ISERROR(K77),J77,SMALL(J77:K77,1)))","v":0},{"$f":"IF($C77=1,OFFSET(E77,-1,0)+1,OFFSET(E77,-1,0))","v":3},{"$f":"IF($C77=1,0,IF($C77=2,OFFSET(F77,-1,0)+1,OFFSET(F77,-1,0)))","v":1},{"$f":"IF(AND($C77<=2,$C77<>0),0,IF($C77=3,OFFSET(G77,-1,0)+1,OFFSET(G77,-1,0)))","v":0},{"$f":"IF(AND($C77<=3,$C77<>0),0,IF($C77=4,OFFSET(H77,-1,0)+1,OFFSET(H77,-1,0)))","v":0},{"$f":"IF(AND($C77<=4,$C77<>0),0,IF(AND($C77=\"S\",$Y77>0),OFFSET(I77,-1,0)+1,OFFSET(I77,-1,0)))","v":0},0,0,{"$f":"IF(OR(Y77>0,$C77=1),\"F\",\"\")","v":""},"Serviço",{"$f":"CHOOSE(1+LOG(1+2*(C77=1)+4*(C77=2)+8*(C77=3)+16*(C77=4)+32*(C77=\"S\"),2),\"\",\"Nível 1\",\"Nível 2\",\"Nível 3\",\"Nível 4\",\"Serviço\")","v":"Serviço"},"3.1.0.0.3.","SINAPI",97640,"REMOÇÃO DE FORROS DE DRYWALL, PVC E FIBROMINERAL, DE FORMA MANUAL, SEM REAPROVEITAMENTO. AF_12/2017","M2",262.73,1,262.73,null,null,null,null,""]
[2,2,2,3,3,2,0,0,0,11,3,"","Nível 2","Nível 2","3.2.","AGETOP",null,"TRANSPORTES","-",null,1,"-",null,null,null,null,""]
["S",2,"S",0,3,2,0,0,0,0,0,"","Serviço","Serviço","3.2.0.0.1.","SINAPI",72900,"TRANSPORTE DE ENTULHO COM CAMINHAO BASCULANTE 6 M3, RODOVIA PAVIMENTADA, DMT 0,5 A 1,0 KM","M3",3.72,1,3.72,null,null,null,null,""]
["S",2,"S",0,3,2,0,0,0,0,0,"","Serviço","Serviço","3.2.0.0.2.","SINAPI",72897,"CARGA MANUAL DE ENTULHO EM CAMINHAO BASCULANTE 6 M3","M3",3.72,1,3.72,null,null,null,null,""]
[2,2,2,2,3,3,0,0,0,8,2,"","Nível 2","Nível 2","3.3.","SINAPI",null,"COBERTURAS","-",null,1,"-",null,null,null,null,""]
["S",2,"S",0,3,3,0,0,0,0,0,"","Serviço","Serviço","3.3.0.0.1.","AGETOP",160501,"COBERTURA COM TELHA ONDULADA OU EQUIV.","m2    ",40,1,40,null,null,null,null,""]
[2,2,2,2,3,4,0,0,0,6,2,"","Nível 2","Nível 2","3.4.",null,null,"REVESTIMENTO DE PAREDE","-",null,1,"-",null,null,null,null,""]
["S",2,"S",0,3,4,0,0,0,0,0,"","Serviço","Serviço","3.4.0.0.1.","SINAPI",87547,"MASSA ÚNICA, PARA RECEBIMENTO DE PINTURA, EM ARGAMASSA TRAÇO 1:2:8, PREPARO MECÂNICO COM BETONEIRA 400L, APLICADA MANUALMENTE EM FACES INTERNAS DE PAREDES, ESPESSURA DE 10MM, COM EXECUÇÃO DE TALISCAS. AF_06/2014","M2",70,1,70,null,null,null,null,""]
[2,2,2,2,3,5,0,0,0,{"$f":"IF(OR($C85=\"S\",$C85=0),0,MATCH(0,OFFSET($D85,1,$C85,ROW($C$328)-ROW($C85)),0))","v":4},{"$f":"IF(OR($C85=\"S\",$C85=0),0,MATCH(OFFSET($D85,0,$C85)+1,OFFSET($D85,1,$C85,ROW($C$328)-ROW($C85)),0))","v":2},"","Nível 2","Nível 2","3.5.","SINAPI",null,"FORROS","-",null,1,"-",null,null,null,null,""]
["S",2,"S",0,3,5,0,0,0,0,0,"","Serviço","Serviço","3.5.0.0.1.","AGETOP",210461,"FORRO DE PVC SEM ESTRUTURA DE METALON (COM REPINTURA DA ESTRUTURA COM TINTA ALQUÍDICA D.F.)","m2    ",262.73,1,262.73,null,null,null,null,""]
[2,2,2,2,3,6,0,0,0,{"$f":"IF(OR($C87=\"S\",$C87=0),0,MATCH(0,OFFSET($D87,1,$C87,ROW($C$328)-ROW($C87)),0))","v":2},{"$f":"IF(OR($C87=\"S\",$C87=0),0,MATCH(OFFSET($D87,0,$C87)+1,OFFSET($D87,1,$C87,ROW($C$328)-ROW($C87)),0))","v":77},"","Nível 2","Nível 2","3.6.",null,null,"PINTURA","-",20,1,20,null,null,null,null,""]
["S",2,"S",0,3,6,0,0,0,0,0,"","Serviço","Serviço","3.6.0.0.1.","AGETOP",261300,"EMASSAMENTO COM MASSA PVA DUAS DEMAOS","m2    ",70,1,70,null,null,null,null,""]
[1,1,1,18,4,0,0,0,0,239,18,"F","Nível 1","Nível 1","4.","SINAPI",null,"REFORMA DA COZINHA","UN",1,1,1,null,null,null,null,""]
[2,2,2,5,4,1,0,0,0,17,5,"","Nível 2","Nível 2","4.1.","SINAPI",null,"SERVIÇOS PRELIMINARES","-",null,1,"-",null,null,null,null,""]
["S",2,"S",0,4,1,0,0,0,0,0,"","Serviço","Serviço","4.1.0.0.1.","AGETOP",20111,"DEM.PISO CERAM.SOBRE LASTRO CONC.C/TR.CB.E CARGA","m2    ",35.950000000000003,1,35.950000000000003,null,null,null,null,""]
["S",2,"S",0,4,1,0,0,0,0,0,"","Serviço","Serviço","4.1.0.0.2.","AGETOP",20115,"DEMOLIÇÃO DE REVESTIMENTOS COM AZULEJOS C/TRANSP.ATE CB. E CARGA","m2    ",22.65,1,22.65,null,null,null,null,""]
["S",2,"S",0,4,1,0,0,0,0,0,"","Serviço","Serviço","4.1.0.0.3.","AGETOP",20139,"DEMOLIÇAO DE BANCADAS C/ TRANSP. ATÉ CB. E CARGA","m2    ",2.85,1,2.85,null,null,null,null,""]
[{"$f":"CHOOSE(1+LOG(1+2*(ORÇAMENTO.Nivel=\"Nível 1\")+4*(ORÇAMENTO.Nivel=\"Nível 2\")+8*(ORÇAMENTO.Nivel=\"Nível 3\")+16*(ORÇAMENTO.Nivel=\"Nível 4\")+32*(ORÇAMENTO.Nivel=\"Serviço\"),2),0,1,2,3,4,\"S\")","v":"S"},{"$f":"IF(OR(C94=\"s\",C94=0),OFFSET(B94,-1,0),C94)","v":2},{"$f":"IF(OFFSET(C94,-1,0)=\"L\",1,IF(OFFSET(C94,-1,0)=1,2,IF(OR(A94=\"s\",A94=0),\"S\",IF(AND(OFFSET(C94,-1,0)=2,A94=4),3,IF(AND(OR(OFFSET(C94,-1,0)=\"s\",OFFSET(C94,-1,0)=0),A94<>\"s\",A94>OFFSET(B94,-1,0)),OFFSET(B94,-1,0),A94)))))","v":"S"},{"$f":"IF(OR(C94=\"S\",C94=0),0,IF(ISERROR(K94),J94,SMALL(J94:K94,1)))","v":0},{"$f":"IF($C94=1,OFFSET(E94,-1,0)+1,OFFSET(E94,-1,0))","v":4},{"$f":"IF($C94=1,0,IF($C94=2,OFFSET(F94,-1,0)+1,OFFSET(F94,-1,0)))","v":1},{"$f":"IF(AND($C94<=2,$C94<>0),0,IF($C94=3,OFFSET(G94,-1,0)+1,OFFSET(G94,-1,0)))","v":0},{"$f":"IF(AND($C94<=3,$C94<>0),0,IF($C94=4,OFFSET(H94,-1,0)+1,OFFSET(H94,-1,0)))","v":0},{"$f":"IF(AND($C94<=4,$C94<>0),0,IF(AND($C94=\"S\",$Y94>0),OFFSET(I94,-1,0)+1,OFFSET(I94,-1,0)))","v":0},{"$f":"IF(OR($C94=\"S\",$C94=0),0,MATCH(0,OFFSET($D94,1,$C94,ROW($C$328)-ROW($C94)),0))","v":0},{"$f":"IF(OR($C94=\"S\",$C94=0),0,MATCH(OFFSET($D94,0,$C94)+1,OFFSET($D94,1,$C94,ROW($C$328)-ROW($C94)),0))","v":0},{"$f":"IF(OR(Y94>0,$C94=1),\"F\",\"\")","v":""},"Serviço",{"$f":"CHOOSE(1+LOG(1+2*(C94=1)+4*(C94=2)+8*(C94=3)+16*(C94=4)+32*(C94=\"S\"),2),\"\",\"Nível 1\",\"Nível 2\",\"Nível 3\",\"Nível 4\",\"Serviço\")","v":"Serviço"},"4.1.0.0.4.","AGETOP",20163,"DEMOLIÇÃO DAS INSTALAÇÕES HIDROSANITÁRIAS E AFINS C/ TRANSP. ATÉ CB. E CARGA","H     ",2,1,2,null,null,null,null,""]
[2,2,2,3,4,2,0,0,0,12,3,"","Nível 2","Nível 2","4.2.","AGETOP",null,"TRANSPORTES","-",null,1,"-",null,null,null,null,""]
["S",2,"S",0,4,2,0,0,0,0,0,"","Serviço","Serviço","4.2.0.0.1.","SINAPI",72900,"TRANSPORTE DE ENTULHO COM CAMINHAO BASCULANTE 6 M3, RODOVIA PAVIMENTADA, DMT 0,5 A 1,0 KM","M3",1.5,1,1.5,null,null,null,null,""]
["S",2,"S",0,4,2,0,0,0,0,0,"","Serviço","Serviço","4.2.0.0.2.","SINAPI",72897,"CARGA MANUAL DE ENTULHO EM CAMINHAO BASCULANTE 6 M3","M3",1.5,1,1.5,null,null,null,null,""]
[2,2,2,3,4,3,0,0,0,9,3,"","Nível 2","Nível 2","4.3.","SINAPI",null,"ESQUADRIAS METÁLICAS","-",null,1,"-",null,null,null,null,""]
["S",2,"S",0,4,3,0,0,0,0,0,"","Serviço","Serviço","4.3.0.0.1.","COMPOSIÇÃO","COMP 027_SEE","TELA MOSQUITEIRA EM NYLON COM ESTRUTURA DE ALUMÍNIO, COM FORNECIMENTO DE MÃO DE OBRA E INSTALAÇÃO","M2",8.8800000000000008,1,8.8800000000000008,null,null,null,null,""]
["S",2,"S",0,4,3,0,0,0,0,0,"","Serviço","Serviço","4.3.0.0.2.","COMPOSIÇÃO","COMP 575_SEE","MOLA AEREA FECHA PORTA, PARA PORTAS COM LARGURA ATE 95 CM","UN ",2,1,2,null,null,null,null,""]
[2,2,2,2,4,4,0,0,0,6,2,"","Nível 2","Nível 2","4.4.",null,null,"REVESTIMENTO DE PAREDE","-",null,1,"-",null,null,null,null,""]
["S",2,"S",0,4,4,0,0,0,0,0,"","Serviço","Serviço","4.4.0.0.1.","SINAPI",87273,"REVESTIMENTO CERÂMICO PARA PAREDES INTERNAS COM PLACAS TIPO ESMALTADA EXTRA DE DIMENSÕES 33X45 CM APLICADAS EM AMBIENTES DE ÁREA MAIOR QUE 5 M² NA ALTURA INTEIRA DAS PAREDES. AF_06/2014","M2",22.65,1,22.65,null,null,null,null,""]
[2,2,2,2,4,5,0,0,0,4,2,"","Nível 2","Nível 2","4.5.",null,null,"REVESTIMENTO DE PISO","-",null,1,"-",null,null,null,null,""]
["S",2,"S",0,4,5,0,0,0,0,0,"","Serviço","Serviço","4.5.0.0.1.","SINAPI",87251,"REVESTIMENTO CERÂMICO PARA PISO COM PLACAS TIPO ESMALTADA EXTRA DE DIMENSÕES 45X45 CM APLICADA EM AMBIENTES DE ÁREA MAIOR QUE 10 M2. AF_06/2014","M2",35.950000000000003,1,35.950000000000003,null,null,null,null,""]
[2,2,2,2,4,6,0,0,0,2,59,"","Nível 2","Nível 2","4.6.",null,null,"DIVERSOS","-",null,1,"-",null,null,null,null,""]
["S",2,"S",0,4,6,0,0,0,0,0,"","Serviço","Serviço","4.6.0.0.1.","AGETOP",271608,"BANCADA DE GRANITO C/ESPELHO","m2    ",3.92,1,3.92,null,null,null,null,""]
[1,1,1,7,5,0,0,0,0,221,7,"F","Nível 1","Nível 1","5.","SINAPI",null,"EXECUÇÃO DE GRELHA E SISTEMA DE ESCOAMENTO PLUVIAL","UN",1,1,1,null,null,null,null,""]
[2,2,2,2,5,1,0,0,0,6,2,"","Nível 2","Nível 2","5.1.","SINAPI",null,"ESQUADRIAS METÁLICAS","-",null,1,"-",null,null,null,null,""]
["S",2,"S",0,5,1,0,0,0,0,0,"","Serviço","Serviço","5.1.0.0.1.","AGETOP",180323,"GRELHA PADRÃO GOINFRA DE FERRO CHATO COM BERÇO (ESPAÇAMENTO ENTRE FACES = 1,5CM - NBR 9050 ACESSIBILIDADE)","m2    ",1.86,1,1.86,null,null,null,null,""]
[2,2,2,2,5,2,0,0,0,4,2,"","Nível 2","Nível 2","5.2.",null,null,"PINTURA","-",null,1,"-",null,null,null,null,""]
["S",2,"S",0,5,2,0,0,0,0,0,"","Serviço","Serviço","5.2.0.0.1.","AGETOP",261602,"PINT.ESMALTE/ESQUAD.FERRO C/FUNDO ANTICOR.","m2    ",2.79,1,2.79,null,null,null,null,""]
[2,2,2,2,5,3,0,0,0,2,33,"","Nível 2","Nível 2","5.3.","SINAPI",null,"DIVERSOS","-",null,1,"-",null,null,null,null,""]
["S",2,"S",0,5,3,0,0,0,0,0,"","Serviço","Serviço","5.3.0.0.1.","AGETOP",271417,"CANALETA CONCRETO DESEMPENADO 5 CM PD.GOINFRA","m     ",6.2,1,6.2,null,null,null,null,""]
[1,1,1,10,6,0,0,0,0,214,10,"F","Nível 1","Nível 1","6.","SINAPI",null,"PINTURA GERAL DAS EDIFICAÇÕES:","UN",1,1,1,null,null,null,null,""]
[2,2,2,9,6,1,0,0,0,9,15,"","Nível 2","Nível 2","6.1.","SINAPI",null,"PINTURA","-",null,1,"-",null,null,null,null,""]
["S",2,"S",0,6,1,0,0,0,0,0,"","Serviço","Serviço","6.1.0.0.1.","AGETOP",260105,"REMOCAO DE PINTURA ANTIGA A OLEO OU ESMALTE","m2    ",100,1,100,null,null,null,null,""]
["S",2,"S",0,6,1,0,0,0,0,0,"","Serviço","Serviço","6.1.0.0.2.","AGETOP",261300,"EMASSAMENTO COM MASSA PVA DUAS DEMAOS","m2    ",200,1,200,null,null,null,null,""]
["S",2,"S",0,6,1,0,0,0,0,0,"","Serviço","Serviço","6.1.0.0.3.","AGETOP",261548,"PINTURA ESMALTE 1 DEMÃO EM PAREDE SEM SELADOR","m2    ",746,1,746,null,null,null,null,""]
["S",2,"S",0,6,1,0,0,0,0,0,"","Serviço","Serviço","6.1.0.0.4.","AGETOP",260104,"REMOCAO DE PINTURA ANTIGA A LATEX","m2    ",100,1,100,null,null,null,null,""]
["S",2,"S",0,6,1,0,0,0,{"$f":"IF(OR($C120=\"S\",$C120=0),0,MATCH(0,OFFSET($D120,1,$C120,ROW($C$328)-ROW($C120)),0))","v":0},{"$f":"IF(OR($C120=\"S\",$C120=0),0,MATCH(OFFSET($D120,0,$C120)+1,OFFSET($D120,1,$C120,ROW($C$328)-ROW($C120)),0))","v":0},"","Serviço","Serviço","6.1.0.0.5.","AGETOP",261001,"PINTURA LATEX ACRILICO 2 DEMAOS","m2    ",1382,1,1382,null,null,null,null,""]
[{"$f":"CHOOSE(1+LOG(1+2*(ORÇAMENTO.Nivel=\"Nível 1\")+4*(ORÇAMENTO.Nivel=\"Nível 2\")+8*(ORÇAMENTO.Nivel=\"Nível 3\")+16*(ORÇAMENTO.Nivel=\"Nível 4\")+32*(ORÇAMENTO.Nivel=\"Serviço\"),2),0,1,2,3,4,\"S\")","v":"S"},{"$f":"IF(OR(C121=\"s\",C121=0),OFFSET(B121,-1,0),C121)","v":2},{"$f":"IF(OFFSET(C121,-1,0)=\"L\",1,IF(OFFSET(C121,-1,0)=1,2,IF(OR(A121=\"s\",A121=0),\"S\",IF(AND(OFFSET(C121,-1,0)=2,A121=4),3,IF(AND(OR(OFFSET(C121,-1,0)=\"s\",OFFSET(C121,-1,0)=0),A121<>\"s\",A121>OFFSET(B121,-1,0)),OFFSET(B121,-1,0),A121)))))","v":"S"},{"$f":"IF(OR(C121=\"S\",C121=0),0,IF(ISERROR(K121),J121,SMALL(J121:K121,1)))","v":0},{"$f":"IF($C121=1,OFFSET(E121,-1,0)+1,OFFSET(E121,-1,0))","v":6},{"$f":"IF($C121=1,0,IF($C121=2,OFFSET(F121,-1,0)+1,OFFSET(F121,-1,0)))","v":1},{"$f":"IF(AND($C121<=2,$C121<>0),0,IF($C121=3,OFFSET(G121,-1,0)+1,OFFSET(G121,-1,0)))","v":0},{"$f":"IF(AND($C121<=3,$C121<>0),0,IF($C121=4,OFFSET(H121,-1,0)+1,OFFSET(H121,-1,0)))","v":0},{"$f":"IF(AND($C121<=4,$C121<>0),0,IF(AND($C121=\"S\",$Y121>0),OFFSET(I121,-1,0)+1,OFFSET(I121,-1,0)))","v":0},0,0,{"$f":"IF(OR(Y121>0,$C121=1),\"F\",\"\")","v":""},"Serviço",{"$f":"CHOOSE(1+LOG(1+2*(C121=1)+4*(C121=2)+8*(C121=3)+16*(C121=4)+32*(C121=\"S\"),2),\"\",\"Nível 1\",\"Nível 2\",\"Nível 3\",\"Nível 4\",\"Serviço\")","v":"Serviço"},"6.1.0.0.6.","AGETOP",260105,"REMOCAO DE PINTURA ANTIGA A OLEO OU ESMALTE","m2    ",440,1,440,null,null,null,null,""]
["S",2,"S",0,6,1,0,0,0,0,0,"","Serviço","Serviço","6.1.0.0.7.","AGETOP",261602,"PINT.ESMALTE/ESQUAD.FERRO C/FUNDO ANTICOR.","m2    ",440,1,440,null,null,null,null,""]
[{"$f":"CHOOSE(1+LOG(1+2*(ORÇAMENTO.Nivel=\"Nível 1\")+4*(ORÇAMENTO.Nivel=\"Nível 2\")+8*(ORÇAMENTO.Nivel=\"Nível 3\")+16*(ORÇAMENTO.Nivel=\"Nível 4\")+32*(ORÇAMENTO.Nivel=\"Serviço\"),2),0,1,2,3,4,\"S\")","v":"S"},{"$f":"IF(OR(C123=\"s\",C123=0),OFFSET(B123,-1,0),C123)","v":2},{"$f":"IF(OFFSET(C123,-1,0)=\"L\",1,IF(OFFSET(C123,-1,0)=1,2,IF(OR(A123=\"s\",A123=0),\"S\",IF(AND(OFFSET(C123,-1,0)=2,A123=4),3,IF(AND(OR(OFFSET(C123,-1,0)=\"s\",OFFSET(C123,-1,0)=0),A123<>\"s\",A123>OFFSET(B123,-1,0)),OFFSET(B123,-1,0),A123)))))","v":"S"},{"$f":"IF(OR(C123=\"S\",C123=0),0,IF(ISERROR(K123),J123,SMALL(J123:K123,1)))","v":0},{"$f":"IF($C123=1,OFFSET(E123,-1,0)+1,OFFSET(E123,-1,0))","v":6},{"$f":"IF($C123=1,0,IF($C123=2,OFFSET(F123,-1,0)+1,OFFSET(F123,-1,0)))","v":1},{"$f":"IF(AND($C123<=2,$C123<>0),0,IF($C123=3,OFFSET(G123,-1,0)+1,OFFSET(G123,-1,0)))","v":0},{"$f":"IF(AND($C123<=3,$C123<>0),0,IF($C123=4,OFFSET(H123,-1,0)+1,OFFSET(H123,-1,0)))","v":0},{"$f":"IF(AND($C123<=4,$C123<>0),0,IF(AND($C123=\"S\",$Y123>0),OFFSET(I123,-1,0)+1,OFFSET(I123,-1,0)))","v":0},0,0,{"$f":"IF(OR(Y123>0,$C123=1),\"F\",\"\")","v":""},"Serviço",{"$f":"CHOOSE(1+LOG(1+2*(C123=1)+4*(C123=2)+8*(C123=3)+16*(C123=4)+32*(C123=\"S\"),2),\"\",\"Nível 1\",\"Nível 2\",\"Nível 3\",\"Nível 4\",\"Serviço\")","v":"Serviço"},"6.1.0.0.8.","AGETOP",261620,"LETREIRO MÉDIO A GRANDE PORTE EM PAREDE FEITO A PINCEL","m2    ",7.2,1,7.2,null,null,null,null,""]
[1,1,1,9,7,0,0,0,0,204,9,"F","Nível 1","Nível 1","7.","SINAPI",null,"DEMOLIÇÃO DE CAIXA DÁGUA EXISTENTE","UN",1,1,1,null,null,null,null,""]
[2,2,2,5,7,1,0,0,0,8,5,"","Nível 2","Nível 2","7.1.","SINAPI",null,"SERVIÇOS PRELIMINARES","-",null,1,"-",null,null,null,null,""]
["S",2,"S",0,7,1,0,0,0,0,0,"","Serviço","Serviço","7.1.0.0.1.","AGETOP",20106,"RETIRADA DE JANELAS OU PORTAIS C/ TRANSP. ATÉ CB. E CARGA","m2    ",1.47,1,1.47,null,null,null,null,""]
["S",2,"S",0,7,1,0,0,0,0,0,"","Serviço","Serviço","7.1.0.0.2.","AGETOP",20118,"DEM.ALVEN.TIJOLO S/REAP. C/TR.ATE CB. E CARGA","m3    ",5.36,1,5.36,null,null,null,null,""]
["S",2,"S",0,7,1,0,0,0,0,0,"","Serviço","Serviço","7.1.0.0.3.","AGETOP",20121,"DEM. MANUAL EM CONCR.SIMPLES C/TR.ATE CB.E CARGA (O.C.)","m3    ",0.23,1,0.23,null,null,null,null,""]
["S",2,"S",0,7,1,0,0,0,0,0,"","Serviço","Serviço","7.1.0.0.4.","AGETOP",20128,"DEM.PILAR CONC.ARM.MANUAL C/TR.ATE CB.E CARGA(OC)","m3    ",2.68,1,2.68,null,null,null,null,""]
[2,2,2,3,7,2,0,0,0,3,12,"","Nível 2","Nível 2","7.2.","AGETOP",null,"TRANSPORTES","-",null,1,"-",null,null,null,null,""]
["S",2,"S",0,7,2,0,0,0,0,0,"","Serviço","Serviço","7.2.0.0.1.","SINAPI",72900,"TRANSPORTE DE ENTULHO COM CAMINHAO BASCULANTE 6 M3, RODOVIA PAVIMENTADA, DMT 0,5 A 1,0 KM","M3",8.2899999999999991,1,8.2899999999999991,null,null,null,null,""]
["S",2,"S",0,7,2,0,0,0,0,0,"","Serviço","Serviço","7.2.0.0.2.","SINAPI",72897,"CARGA MANUAL DE ENTULHO EM CAMINHAO BASCULANTE 6 M3","M3",8.2899999999999991,1,8.2899999999999991,null,null,null,null,""]
[{"$f":"CHOOSE(1+LOG(1+2*(ORÇAMENTO.Nivel=\"Nível 1\")+4*(ORÇAMENTO.Nivel=\"Nível 2\")+8*(ORÇAMENTO.Nivel=\"Nível 3\")+16*(ORÇAMENTO.Nivel=\"Nível 4\")+32*(ORÇAMENTO.Nivel=\"Serviço\"),2),0,1,2,3,4,\"S\")","v":1},{"$f":"IF(OR(C133=\"s\",C133=0),OFFSET(B133,-1,0),C133)","v":1},{"$f":"IF(OFFSET(C133,-1,0)=\"L\",1,IF(OFFSET(C133,-1,0)=1,2,IF(OR(A133=\"s\",A133=0),\"S\",IF(AND(OFFSET(C133,-1,0)=2,A133=4),3,IF(AND(OR(OFFSET(C133,-1,0)=\"s\",OFFSET(C133,-1,0)=0),A133<>\"s\",A133>OFFSET(B133,-1,0)),OFFSET(B133,-1,0),A133)))))","v":1},{"$f":"IF(OR(C133=\"S\",C133=0),0,IF(ISERROR(K133),J133,SMALL(J133:K133,1)))","v":186},{"$f":"IF($C133=1,OFFSET(E133,-1,0)+1,OFFSET(E133,-1,0))","v":8},{"$f":"IF($C133=1,0,IF($C133=2,OFFSET(F133,-1,0)+1,OFFSET(F133,-1,0)))","v":0},{"$f":"IF(AND($C133<=2,$C133<>0),0,IF($C133=3,OFFSET(G133,-1,0)+1,OFFSET(G133,-1,0)))","v":0},{"$f":"IF(AND($C133<=3,$C133<>0),0,IF($C133=4,OFFSET(H133,-1,0)+1,OFFSET(H133,-1,0)))","v":0},{"$f":"IF(AND($C133<=4,$C133<>0),0,IF(AND($C133=\"S\",$Y133>0),OFFSET(I133,-1,0)+1,OFFSET(I133,-1,0)))","v":0},195,186,{"$f":"IF(OR(Y133>0,$C133=1),\"F\",\"\")","v":"F"},"Nível 1",{"$f":"CHOOSE(1+LOG(1+2*(C133=1)+4*(C133=2)+8*(C133=3)+16*(C133=4)+32*(C133=\"S\"),2),\"\",\"Nível 1\",\"Nível 2\",\"Nível 3\",\"Nível 4\",\"Serviço\")","v":"Nível 1"},"8.","AGETOP",null,"PROJETOS COMPLEMENTÁRES","UN",1,1,1,null,null,null,null,""]
[2,2,2,5,8,1,0,0,0,185,5,"","Nível 2","Nível 2","8.1.","AGETOP",null,"SERVIÇOS PRELIMINARES","-",null,1,"-",null,null,null,null,""]
["S",2,"S",0,8,1,0,0,0,0,0,"","Serviço","Serviço","8.1.0.0.1.","SINAPI",97661,"REMOÇÃO DE CABOS ELÉTRICOS, DE FORMA MANUAL, SEM REAPROVEITAMENTO. AF_12/2017","M",1000,1,1000,null,null,null,null,""]
["S",2,"S",0,8,1,0,0,0,0,0,"","Serviço","Serviço","8.1.0.0.2.","SINAPI",97660,"REMOÇÃO DE INTERRUPTORES/TOMADAS ELÉTRICAS, DE FORMA MANUAL, SEM REAPROVEITAMENTO. AF_12/2017","UN",70,1,70,null,null,null,null,""]
["S",2,"S",0,8,1,0,0,0,0,0,"","Serviço","Serviço","8.1.0.0.3.","SINAPI",97665,"REMOÇÃO DE LUMINÁRIAS, DE FORMA MANUAL, SEM REAPROVEITAMENTO. AF_12/2017","UN",59,1,59,null,null,null,null,""]
["S",2,"S",0,8,1,0,0,0,0,0,"","Serviço","Serviço","8.1.0.0.4.","AGETOP",20121,"DEM. MANUAL EM CONCR.SIMPLES C/TR.ATE CB.E CARGA (O.C.)","m3    ",0.01,1,0.01,null,null,null,null,""]
[2,2,2,3,8,2,0,0,0,180,3,"","Nível 2","Nível 2","8.2.","AGETOP",null,"TRANSPORTES","-",null,1,"-",null,null,null,null,""]
["S",2,"S",0,8,2,0,0,0,0,0,"","Serviço","Serviço","8.2.0.0.1.","SINAPI",72900,"TRANSPORTE DE ENTULHO COM CAMINHAO BASCULANTE 6 M3, RODOVIA PAVIMENTADA, DMT 0,5 A 1,0 KM","M3",6.01,1,6.01,null,null,null,null,""]
["S",2,"S",0,8,2,0,0,0,0,0,"","Serviço","Serviço","8.2.0.0.2.","SINAPI",72897,"CARGA MANUAL DE ENTULHO EM CAMINHAO BASCULANTE 6 M3","M3",6.01,1,6.01,null,null,null,null,""]
[2,2,2,3,8,3,0,0,0,177,3,"","Nível 2","Nível 2","8.3.","AGETOP",null,"SERVIÇO EM TERRA","-",null,1,"-",null,null,null,null,""]
["S",2,"S",0,8,3,0,0,0,0,0,"","Serviço","Serviço","8.3.0.0.1.","SINAPI",93358,"ESCAVAÇÃO MANUAL DE VALA COM PROFUNDIDADE MENOR OU IGUAL A 1,30 M. AF_03/2016","M3",6.29,1,6.29,null,null,null,null,"Referência: AGETOP - 40101"]
["S",2,"S",0,8,3,0,0,0,{"$f":"IF(OR($C144=\"S\",$C144=0),0,MATCH(0,OFFSET($D144,1,$C144,ROW($C$328)-ROW($C144)),0))","v":0},{"$f":"IF(OR($C144=\"S\",$C144=0),0,MATCH(OFFSET($D144,0,$C144)+1,OFFSET($D144,1,$C144,ROW($C$328)-ROW($C144)),0))","v":0},"","Serviço","Serviço","8.3.0.0.2.","SINAPI",96995,"REATERRO MANUAL APILOADO COM SOQUETE. AF_10/2017","M3",6.29,1,6.29,null,null,null,null,"Referência: AGETOP - 40902"]
[2,2,2,2,8,4,0,0,0,174,2,"","Nível 2","Nível 2","8.4.",null,null,"REVESTIMENTO DE PISO","-",null,1,"-",null,null,null,null,""]
["S",2,"S",0,8,4,0,0,0,0,0,"","Serviço","Serviço","8.4.0.0.1.","AGETOP",220102,"PISO CONCRETO DESEMPENADO ESPESSURA = 5 CM  1:2,5:3,5","m2    ",5.2,1,5.2,null,null,null,null,""]
[2,2,2,5,8,5,0,0,0,172,5,"","Nível 2","Nível 2","8.5.","SINAPI",null,"FUNDAÇÕES E SONDAGENS","-",null,1,"-",null,null,null,null,""]
[3,3,3,4,8,5,1,0,0,4,94,"","Nível 3","Nível 3","8.5.1.","SINAPI",null,"ESTACAS","-",null,1,"-",null,null,null,null,""]
["S",3,"S",0,8,5,1,0,0,0,0,"","Serviço","Serviço","8.5.1.0.1.","SINAPI",98228,"ESTACA BROCA DE CONCRETO, DIÃMETRO DE 20 CM, PROFUNDIDADE DE ATÉ 3 M, ESCAVAÇÃO MANUAL COM TRADO CONCHA, NÃO ARMADA. AF_03/2018","M",8.5,1,8.5,null,null,null,null,""]
["S",3,"S",0,8,5,1,0,0,0,0,"","Serviço","Serviço","8.5.1.0.2.","SINAPI",95576,"MONTAGEM DE ARMADURA LONGITUDINAL/TRANSVERSAL DE ESTACAS DE SEÇÃO CIRCULAR, DIÂMETRO = 8,0 MM. AF_11/2016","KG",11.52,1,11.52,null,null,null,null,"Referência: AGETOP - 52004"]
["S",3,"S",0,8,5,1,0,0,0,0,"","Serviço","Serviço","8.5.1.0.3.","SINAPI",95583,"MONTAGEM DE ARMADURA TRANSVERSAL DE ESTACAS DE SEÇÃO CIRCULAR, DIÂMETRO = 5,0 MM. AF_11/2016","KG",2.92,1,2.92,null,null,null,null,"Referência: AGETOP - 52014"]
[2,2,2,12,8,6,0,0,0,167,12,"","Nível 2","Nível 2","8.6.","SINAPI",null,"ESTRUTURA","-",null,1,"-",null,null,null,null,""]
[3,3,3,11,8,6,1,0,0,11,89,"","Nível 3","Nível 3","8.6.1.","SINAPI",null,"VIGAS BALDRAMES","-",null,1,"-",null,null,null,null,""]
["S",3,"S",0,8,6,1,0,0,0,0,"","Serviço","Serviço","8.6.1.0.1.","SINAPI",96527,"ESCAVAÇÃO MANUAL DE VALA PARA VIGA BALDRAME, COM PREVISÃO DE FÔRMA. AF_06/2017","M3",0.98,1,0.98,null,null,null,null,"Referência: AGETOP - 40101"]
["S",3,"S",0,8,6,1,0,0,0,0,"","Serviço","Serviço","8.6.1.0.2.","AGETOP",60191,"FORMA DE TABUA CINTA BALDRAME U=8 VEZES","m2    ",4.8600000000000003,1,4.8600000000000003,null,null,null,null,""]
["S",3,"S",0,8,6,1,0,0,0,0,"","Serviço","Serviço","8.6.1.0.3.","AGETOP",41002,"APILOAMENTO","m2    ",4.8600000000000003,1,4.8600000000000003,null,null,null,null,""]
["S",3,"S",0,8,6,1,0,0,0,0,"","Serviço","Serviço","8.6.1.0.4.","SINAPI",94963,"CONCRETO FCK = 15MPA, TRAÇO 1:3,4:3,5 (CIMENTO/ AREIA MÉDIA/ BRITA 1)  - PREPARO MECÂNICO COM BETONEIRA 400 L. AF_07/2016","M3",0.34,1,0.34,null,null,null,null,""]
["S",3,"S",0,8,6,1,0,0,0,0,"","Serviço","Serviço","8.6.1.0.5.","AGETOP",51055,"LANÇAMENTO/APLICAÇÃO/ADENSAMENTO MANUAL DE CONCRETO - (O.C.)","m3    ",0.34,1,0.34,null,null,null,null,""]
["S",3,"S",0,8,6,1,0,0,0,0,"","Serviço","Serviço","8.6.1.0.6.","SINAPI",96995,"REATERRO MANUAL APILOADO COM SOQUETE. AF_10/2017","M3",0.64,1,0.64,null,null,null,null,"Referência: AGETOP - 40902"]
["S",3,"S",0,8,6,1,0,0,0,0,"","Serviço","Serviço","8.6.1.0.7.","SINAPI",96545,"ARMAÇÃO DE BLOCO, VIGA BALDRAME OU SAPATA UTILIZANDO AÇO CA-50 DE 8 MM - MONTAGEM. AF_06/2017","KG",21.2,1,21.2,null,null,null,null,"Referência: AGETOP - 52004"]
["S",3,"S",0,8,6,1,0,0,0,0,"","Serviço","Serviço","8.6.1.0.8.","SINAPI",96543,"ARMAÇÃO DE BLOCO, VIGA BALDRAME E SAPATA UTILIZANDO AÇO CA-60 DE 5 MM - MONTAGEM. AF_06/2017","KG",12.6,1,12.6,null,null,null,null,"Referência: AGETOP - 52014"]
["S",3,"S",0,8,6,1,0,0,0,0,"","Serviço","Serviço","8.6.1.0.9.","AGETOP",120902,"IMPERMEABILIZACAO VIGAS BALDRAMES E=2,0 CM","m2    ",6.55,1,6.55,null,null,null,null,""]
["S",3,"S",0,8,6,1,0,0,0,0,"","Serviço","Serviço","8.6.1.0.10.","AGETOP",50251,"CORPO DE PROVA","Un    ",12,1,12,null,null,null,null,""]
[2,2,2,52,8,7,0,0,0,155,52,"","Nível 2","Nível 2","8.7.",null,null,"INSTALAÇÕES ELÉTRICAS","-",null,1,"-",null,null,null,null,""]
["S",2,"S",0,8,7,0,0,0,0,0,"","Serviço","Serviço","8.7.0.0.1.","AGETOP",70351,"BRACADEIRA METALICA TIPO \"U\" DIAM. 3/4\"","Un    ",242,1,242,null,null,null,null,""]
["S",2,"S",0,8,7,0,0,0,0,0,"","Serviço","Serviço","8.7.0.0.2.","AGETOP",70352,"BRACADEIRA METALICA TIPO \"U\" DIAM. 1\"","Un    ",15,1,15,null,null,null,null,""]
["S",2,"S",0,8,7,0,0,0,0,0,"","Serviço","Serviço","8.7.0.0.3.","AGETOP",70354,"BRACADEIRA METALICA TIPO \"U\" DIAM. 1.1/2\"","Un    ",36,1,36,null,null,null,null,""]
["S",2,"S",0,8,7,0,0,0,0,0,"","Serviço","Serviço","8.7.0.0.4.","AGETOP",70355,"BRACADEIRA METALICA TIPO \"U\" DIAM. 2\"","Un    ",2,1,2,null,null,null,null,""]
["S",2,"S",0,8,7,0,0,0,0,0,"","Serviço","Serviço","8.7.0.0.5.","AGETOP",70421,"BUCHA E ARRUELA METALICA DIAM. 3/4\"","PR    ",4,1,4,null,null,null,null,""]
["S",2,"S",0,8,7,0,0,0,0,0,"","Serviço","Serviço","8.7.0.0.6.","AGETOP",70422,"BUCHA E ARRUELA METALICA DIAM. 1\"","PR    ",4,1,4,null,null,null,null,""]
["S",2,"S",0,8,7,0,0,0,0,0,"","Serviço","Serviço","8.7.0.0.7.","AGETOP",70424,"BUCHA E ARRUELA METALICA DIAM. 1.1/2\"","PR    ",4,1,4,null,null,null,null,""]
["S",2,"S",0,8,7,0,0,0,0,0,"","Serviço","Serviço","8.7.0.0.8.","AGETOP",70425,"BUCHA E ARRUELA METALICA DIAM. 2\"","PR    ",2,1,2,null,null,null,null,""]
["S",2,"S",0,8,7,0,0,0,0,0,"","Serviço","Serviço","8.7.0.0.9.","AGETOP",70565,"CABO ISOLADO PVC 750 V. No. 6 MM2","m     ",200,1,200,null,null,null,null,""]
["S",2,"S",0,8,7,0,0,0,0,0,"","Serviço","Serviço","8.7.0.0.10.","AGETOP",70584,"CABO PVC (70ºC) 1 KV No. 10 MM2","M     ",200,1,200,null,null,null,null,""]
["S",2,"S",0,8,7,0,0,0,0,0,"","Serviço","Serviço","8.7.0.0.11.","SINAPI",92984,"CABO DE COBRE FLEXÍVEL ISOLADO, 25 MM², ANTI-CHAMA 0,6/1,0 KV, PARA DISTRIBUIÇÃO - FORNECIMENTO E INSTALAÇÃO. AF_12/2015","M",54,1,54,null,null,null,null,"Referência: AGETOP - 70511"]
["S",2,"S",0,8,7,0,0,0,0,0,"","Serviço","Serviço","8.7.0.0.12.","SINAPI",96971,"CORDOALHA DE COBRE NU 16 MM², NÃO ENTERRADA, COM ISOLADOR - FORNECIMENTO E INSTALAÇÃO. AF_12/2017","M",50,1,50,null,null,null,null,"Referência: AGETOP - 70541"]
["S",2,"S",0,8,7,0,0,0,0,0,"","Serviço","Serviço","8.7.0.0.13.","AGETOP",70585,"CABO PVC (70ºC) 1 KV No. 16 MM2","M     ",15,1,15,null,null,null,null,""]
["S",2,"S",0,8,7,0,0,0,0,0,"","Serviço","Serviço","8.7.0.0.14.","SINAPI",91927,"CABO DE COBRE FLEXÍVEL ISOLADO, 2,5 MM², ANTI-CHAMA 0,6/1,0 KV, PARA CIRCUITOS TERMINAIS - FORNECIMENTO E INSTALAÇÃO. AF_12/2015","M",1300,1,1300,null,null,null,null,"Referência: AGETOP - 70581"]
["S",2,"S",0,8,7,0,0,0,0,0,"","Serviço","Serviço","8.7.0.0.15.","SINAPI",91929,"CABO DE COBRE FLEXÍVEL ISOLADO, 4 MM², ANTI-CHAMA 0,6/1,0 KV, PARA CIRCUITOS TERMINAIS - FORNECIMENTO E INSTALAÇÃO. AF_12/2015","M",180,1,180,null,null,null,null,"Referência: AGETOP - 70582"]
["S",2,"S",0,8,7,0,0,0,0,0,"","Serviço","Serviço","8.7.0.0.16.","AGETOP",70720,"CAIXA METÁLICA PARA MEDIDOR POLIFÁSICO PADRÃO ENEL 500X380X166MM","Un    ",1,1,1,null,null,null,null,""]
["S",2,"S",0,8,7,0,0,0,0,0,"","Serviço","Serviço","8.7.0.0.17.","AGETOP",70929,"CONDULETE METÁLICO - CAIXA COM 5 ENTRADAS ","un    ",29,1,29,null,null,null,null,""]
["S",2,"S",0,8,7,0,0,0,0,0,"","Serviço","Serviço","8.7.0.0.18.","AGETOP",70713,"CAIXA DE PASSAGEM 40X40X50CM FUNDO DE BRITA SEM TAMPA","Un    ",2,1,2,null,null,null,null,""]
["S",2,"S",0,8,7,0,0,0,0,0,"","Serviço","Serviço","8.7.0.0.19.","AGETOP",70930,"CONDULETE METÁLICO - ADAPTADOR DE SAÍDA 3/4\" ","un    ",69,1,69,null,null,null,null,""]
["S",2,"S",0,8,7,0,0,0,0,0,"","Serviço","Serviço","8.7.0.0.20.","AGETOP",70634,"CAIXA DE PASSAGEM -  TAMPA EM CONCRETO ARMADO 25 MPA E=5CM","m2    ",0.32,1,0.32,null,null,null,null,""]
["S",2,"S",0,8,7,0,0,0,0,0,"","Serviço","Serviço","8.7.0.0.21.","SINAPI",93653,"DISJUNTOR MONOPOLAR TIPO DIN, CORRENTE NOMINAL DE 10A - FORNECIMENTO E INSTALAÇÃO. AF_04/2016","UN",14,1,14,null,null,null,null,""]
["S",2,"S",0,8,7,0,0,0,0,0,"","Serviço","Serviço","8.7.0.0.22.","SINAPI",93655,"DISJUNTOR MONOPOLAR TIPO DIN, CORRENTE NOMINAL DE 20A - FORNECIMENTO E INSTALAÇÃO. AF_04/2016","UN",15,1,15,null,null,null,null,""]
["S",2,"S",0,8,7,0,0,0,0,0,"","Serviço","Serviço","8.7.0.0.23.","SINAPI",93654,"DISJUNTOR MONOPOLAR TIPO DIN, CORRENTE NOMINAL DE 16A - FORNECIMENTO E INSTALAÇÃO. AF_04/2016","UN",4,1,4,null,null,null,null,""]
["S",2,"S",0,8,7,0,0,0,0,0,"","Serviço","Serviço","8.7.0.0.24.","SINAPI",93656,"DISJUNTOR MONOPOLAR TIPO DIN, CORRENTE NOMINAL DE 25A - FORNECIMENTO E INSTALAÇÃO. AF_04/2016","UN",2,1,2,null,null,null,null,""]
["S",2,"S",0,8,7,0,0,0,0,0,"","Serviço","Serviço","8.7.0.0.25.","SINAPI",93671,"DISJUNTOR TRIPOLAR TIPO DIN, CORRENTE NOMINAL DE 32A - FORNECIMENTO E INSTALAÇÃO. AF_04/2016","UN",4,1,4,null,null,null,null,"Referência: AGETOP - 71173"]
["S",2,"S",0,8,7,0,0,0,0,0,"","Serviço","Serviço","8.7.0.0.26.","AGETOP",71175,"DISJUNTOR TRIPOLAR DE 60 A 100-A","Un    ",2,1,2,null,null,null,null,""]
["S",2,"S",0,8,7,0,0,0,0,0,"","Serviço","Serviço","8.7.0.0.27.","AGETOP",71174,"DISJUNTOR TRIPOLAR 40 A 50A","Un    ",4,1,4,null,null,null,null,""]
["S",2,"S",0,8,7,0,0,0,0,0,"","Serviço","Serviço","8.7.0.0.28.","AGETOP",71184,"DISPOSITIVO DE PROTEÇÃO CONTRA SURTOS (D.P.S.) 275V DE 8 A 40KA","Un    ",4,1,4,null,null,null,null,""]
["S",2,"S",0,8,7,0,0,0,0,0,"","Serviço","Serviço","8.7.0.0.29.","SINAPI",91844,"ELETRODUTO FLEXÍVEL CORRUGADO, PVC, DN 25 MM (3/4\"), PARA CIRCUITOS TERMINAIS, INSTALADO EM LAJE - FORNECIMENTO E INSTALAÇÃO. AF_12/2015","M",360,1,360,null,null,null,null,""]
["S",2,"S",0,8,7,0,0,0,0,0,"","Serviço","Serviço","8.7.0.0.30.","SINAPI",93008,"ELETRODUTO RÍGIDO ROSCÁVEL, PVC, DN 50 MM (1 1/2\") - FORNECIMENTO E INSTALAÇÃO. AF_12/2015","M",42,1,42,null,null,null,null,""]
["S",2,"S",0,8,7,0,0,0,0,0,"","Serviço","Serviço","8.7.0.0.31.","SINAPI",93009,"ELETRODUTO RÍGIDO ROSCÁVEL, PVC, DN 60 MM (2\") - FORNECIMENTO E INSTALAÇÃO. AF_12/2015","M",27,1,27,null,null,null,null,""]
["S",2,"S",0,8,7,0,0,0,0,0,"","Serviço","Serviço","8.7.0.0.32.","AGETOP",71321,"FITA DE AUTO FUSAO, ROLO E 10,00 MM","Un    ",5,1,5,null,null,null,null,""]
["S",2,"S",0,8,7,0,0,0,0,0,"","Serviço","Serviço","8.7.0.0.33.","AGETOP",71331,"FITA ISOLANTE, ROLO DE 20,00 M","Un    ",20,1,20,null,null,null,null,""]
["S",2,"S",0,8,7,0,0,0,0,0,"","Serviço","Serviço","8.7.0.0.34.","AGETOP",71381,"HASTE REV.COBRE(COPPERWELD)  5/8\" X 3,00 M C/CONECTOR","Un    ",3,1,3,null,null,null,null,""]
[{"$f":"CHOOSE(1+LOG(1+2*(ORÇAMENTO.Nivel=\"Nível 1\")+4*(ORÇAMENTO.Nivel=\"Nível 2\")+8*(ORÇAMENTO.Nivel=\"Nível 3\")+16*(ORÇAMENTO.Nivel=\"Nível 4\")+32*(ORÇAMENTO.Nivel=\"Serviço\"),2),0,1,2,3,4,\"S\")","v":"S"},2,"S",0,8,7,0,0,{"$f":"IF(AND($C199<=4,$C199<>0),0,IF(AND($C199=\"S\",$Y199>0),OFFSET(I199,-1,0)+1,OFFSET(I199,-1,0)))","v":0},0,0,"","Serviço","Serviço","8.7.0.0.35.","AGETOP",71450,"INTERRUPTOR DIFERENCIAL RESIDUAL (D.R.) BIPOLAR DE 25A-30mA","Un    ",3,1,3,null,null,null,null,""]
["S",2,"S",0,8,7,0,0,0,0,0,"","Serviço","Serviço","8.7.0.0.36.","SINAPI",91953,"INTERRUPTOR SIMPLES (1 MÓDULO), 10A/250V, INCLUINDO SUPORTE E PLACA - FORNECIMENTO E INSTALAÇÃO. AF_12/2015","UN",33,1,33,null,null,null,null,"Referência: AGETOP - 71440"]
["S",2,"S",0,8,7,0,0,0,0,0,{"$f":"IF(OR(Y201>0,$C201=1),\"F\",\"\")","v":""},"Serviço",{"$f":"CHOOSE(1+LOG(1+2*(C201=1)+4*(C201=2)+8*(C201=3)+16*(C201=4)+32*(C201=\"S\"),2),\"\",\"Nível 1\",\"Nível 2\",\"Nível 3\",\"Nível 4\",\"Serviço\")","v":"Serviço"},"8.7.0.0.37.","SINAPI",97586,"LUMINÁRIA TIPO CALHA, DE SOBREPOR, COM 2 LÂMPADAS TUBULARES FLUORESCENTES DE 36 W, COM REATOR DE PARTIDA RÁPIDA - FORNECIMENTO E INSTALAÇÃO. AF_02/2020","UN",67,1,67,null,null,null,null,""]
["S",{"$f":"IF(OR(C202=\"s\",C202=0),OFFSET(B202,-1,0),C202)","v":2},{"$f":"IF(OFFSET(C202,-1,0)=\"L\",1,IF(OFFSET(C202,-1,0)=1,2,IF(OR(A202=\"s\",A202=0),\"S\",IF(AND(OFFSET(C202,-1,0)=2,A202=4),3,IF(AND(OR(OFFSET(C202,-1,0)=\"s\",OFFSET(C202,-1,0)=0),A202<>\"s\",A202>OFFSET(B202,-1,0)),OFFSET(B202,-1,0),A202)))))","v":"S"},{"$f":"IF(OR(C202=\"S\",C202=0),0,IF(ISERROR(K202),J202,SMALL(J202:K202,1)))","v":0},{"$f":"IF($C202=1,OFFSET(E202,-1,0)+1,OFFSET(E202,-1,0))","v":8},{"$f":"IF($C202=1,0,IF($C202=2,OFFSET(F202,-1,0)+1,OFFSET(F202,-1,0)))","v":7},{"$f":"IF(AND($C202<=2,$C202<>0),0,IF($C202=3,OFFSET(G202,-1,0)+1,OFFSET(G202,-1,0)))","v":0},{"$f":"IF(AND($C202<=3,$C202<>0),0,IF($C202=4,OFFSET(H202,-1,0)+1,OFFSET(H202,-1,0)))","v":0},0,0,0,"","Serviço","Serviço","8.7.0.0.38.","SINAPI",91959,"INTERRUPTOR SIMPLES (2 MÓDULOS), 10A/250V, INCLUINDO SUPORTE E PLACA - FORNECIMENTO E INSTALAÇÃO. AF_12/2015","UN",2,1,2,null,null,null,null,"Referência: AGETOP - 71441"]
["S",2,"S",0,8,7,0,0,0,0,0,"","Serviço","Serviço","8.7.0.0.39.","COMPOSIÇÃO","COMP 387_SEE","LÂMPADA LED TUBULAR 18W ","UN ",134,1,134,null,null,null,null,""]
["S",2,"S",0,8,7,0,0,0,0,0,"","Serviço","Serviço","8.7.0.0.40.","SINAPI",97590,"LUMINÁRIA TIPO PLAFON REDONDO COM VIDRO FOSCO, DE SOBREPOR, COM 1 LÂMPADA FLUORESCENTE DE 15 W, SEM REATOR - FORNECIMENTO E INSTALAÇÃO. AF_02/2020","UN",19,1,19,null,null,null,null,""]
["S",2,"S",0,8,7,0,0,0,0,0,"","Serviço","Serviço","8.7.0.0.41.","SINAPI",91885,"LUVA PARA ELETRODUTO, PVC, ROSCÁVEL, DN 32 MM (1\"), PARA CIRCUITOS TERMINAIS, INSTALADA EM PAREDE - FORNECIMENTO E INSTALAÇÃO. AF_12/2015","UN",16,1,16,null,null,null,null,"Referência: AGETOP - 71742"]
["S",2,"S",0,8,7,0,0,0,0,0,"","Serviço","Serviço","8.7.0.0.42.","SINAPI",93013,"LUVA PARA ELETRODUTO, PVC, ROSCÁVEL, DN 50 MM (1 1/2\") - FORNECIMENTO E INSTALAÇÃO. AF_12/2015","UN",14,1,14,null,null,null,null,"Referência: AGETOP - 71744"]
["S",2,"S",0,8,7,0,0,0,0,0,"","Serviço","Serviço","8.7.0.0.43.","SINAPI",93014,"LUVA PARA ELETRODUTO, PVC, ROSCÁVEL, DN 60 MM (2\") - FORNECIMENTO E INSTALAÇÃO. AF_12/2015","UN",11,1,11,null,null,null,null,"Referência: AGETOP - 71745"]
["S",2,"S",0,8,7,0,0,0,0,0,"","Serviço","Serviço","8.7.0.0.44.","AGETOP",71826,"PADRÃO TRIFASICO 25 MM H=7 METROS","Un    ",1,1,1,null,null,null,null,""]
["S",2,"S",0,8,7,0,0,0,0,0,"","Serviço","Serviço","8.7.0.0.45.","AGETOP",72170,"QUADRO DE DISTRIBUIÇÃO DE EMBUTIR EM PVC CB 12E - 80A","Un    ",2,1,2,null,null,null,null,""]
["S",2,"S",0,8,7,0,0,0,0,0,"","Serviço","Serviço","8.7.0.0.46.","AGETOP",72171,"QUADRO DE DISTRIBUIÇÃO DE EMBUTIR EM PVC CB 24E - 80A","un    ",3,1,3,null,null,null,null,""]
["S",2,"S",0,8,7,0,0,0,0,0,"","Serviço","Serviço","8.7.0.0.47.","AGETOP",72395,"TAMPA CEGA PARA CONDULETE METÁLICO","Un    ",69,1,69,null,null,null,null,""]
["S",2,"S",0,8,7,0,0,0,0,0,"","Serviço","Serviço","8.7.0.0.48.","AGETOP",72425,"TAMPA CEGA PLASTICA RETANGULAR 4\"X2\"","Un    ",17,1,17,null,null,null,null,""]
["S",2,"S",0,8,7,0,0,0,0,0,"","Serviço","Serviço","8.7.0.0.49.","AGETOP",72578,"TOMADA HEXAGONAL 2P + T - 10A - 250V","Un    ",78,1,78,null,null,null,null,""]
["S",2,"S",0,8,7,0,0,0,0,0,"","Serviço","Serviço","8.7.0.0.50.","AGETOP",72579,"TOMADA HEXAGONAL DUPLA 2P + T - 10A - 250V","un    ",56,1,56,null,null,null,null,""]
["S",2,"S",0,8,7,0,0,0,0,0,"","Serviço","Serviço","8.7.0.0.51.","AGETOP",72585,"TOMADA HEXAGONAL 2P + T - 20A - 250V","Un    ",3,1,3,null,null,null,null,""]
[2,2,2,66,8,8,0,0,0,103,66,"","Nível 2","Nível 2","8.8.","AGETOP",null,"INSTALAÇÕES HIDROSSANITÁRIAS","-",null,1,"-",null,null,null,null,""]
[3,3,3,25,8,8,1,0,0,65,25,"","Nível 3","Nível 3","8.8.1.","SINAPI",null,"PEÇAS E ACESSÓRIOS","-",null,1,"-",null,null,null,null,""]
[4,4,4,7,8,8,1,1,0,24,7,"","Nível 4","Nível 4","8.8.1.1.","SINAPI",null,"VASO SANITÁRIO E ACESSÓRIOS","-",null,1,"-",null,null,null,null,""]
["S",4,"S",0,8,8,1,1,0,0,0,"","Serviço","Serviço","8.8.1.1.1.","AGETOP",80502,"VASO SANITARIO","Un    ",6,1,6,null,null,null,null,""]
["S",4,"S",0,8,8,1,1,0,0,0,"","Serviço","Serviço","8.8.1.1.2.","AGETOP",80520,"CONJUNTO DE FIXACAO P/VASO SANITARIO (PAR)","CJ    ",6,1,6,null,null,null,null,""]
["S",4,"S",0,8,8,1,1,0,0,0,"","Serviço","Serviço","8.8.1.1.3.","SINAPI",99635,"VÁLVULA DE DESCARGA METÁLICA, BASE 1 1/2 \", ACABAMENTO METALICO CROMADO - FORNECIMENTO E INSTALAÇÃO. AF_01/2019","UN",6,1,6,null,null,null,null,"Referência: AGETOP - 80515"]
["S",4,"S",0,8,8,1,1,0,0,0,"","Serviço","Serviço","8.8.1.1.4.","AGETOP",80513,"TUBO PARA VÁLVULA DE DESCARGA ( CURTO 1.1/4\" )","Un    ",6,1,6,null,null,null,null,""]
["S",4,"S",0,8,8,1,1,0,0,0,"","Serviço","Serviço","8.8.1.1.5.","AGETOP",80514,"TUBO DE LIGACAO PVC CROMADO 1.1/2\" / ESPUDE  - (ENTRADA)","Un    ",6,1,6,null,null,null,null,""]
["S",4,"S",0,8,8,1,1,0,0,0,"","Serviço","Serviço","8.8.1.1.6.","AGETOP",80510,"ANEL DE VEDAÇÃO PARA VASO SANITÁRIO","Un    ",6,1,6,null,null,null,null,""]
[4,4,4,8,8,8,1,2,0,{"$f":"IF(OR($C225=\"S\",$C225=0),0,MATCH(0,OFFSET($D225,1,$C225,ROW($C$328)-ROW($C225)),0))","v":17},{"$f":"IF(OR($C225=\"S\",$C225=0),0,MATCH(OFFSET($D225,0,$C225)+1,OFFSET($D225,1,$C225,ROW($C$328)-ROW($C225)),0))","v":8},"","Nível 4","Nível 4","8.8.1.2.","SINAPI",null,"LAVATÓRIO E ACESSÓRIOS","-",null,1,"-",null,null,null,null,""]
["S",4,"S",0,8,8,1,2,0,0,0,"","Serviço","Serviço","8.8.1.2.1.","AGETOP",80542,"LAVATÓRIO MÉDIO SEM COLUNA","Un    ",1,1,1,null,null,null,null,""]
["S",4,"S",0,8,8,1,2,0,0,0,"","Serviço","Serviço","8.8.1.2.2.","AGETOP",80550,"FIXACAO P/LAVATORIO (PAR)","PAR   ",1,1,1,null,null,null,null,""]
["S",4,"S",0,8,8,1,2,0,0,0,"","Serviço","Serviço","8.8.1.2.3.","AGETOP",80556,"LIGAÇÃO FLEXÍVEL PVC DIAM.1/2\" (ENGATE)","Un    ",5,1,5,null,null,null,null,""]
["S",4,"S",0,8,8,1,2,0,0,0,"","Serviço","Serviço","8.8.1.2.4.","SINAPI",86883,"SIFÃO DO TIPO FLEXÍVEL EM PVC 1  X 1.1/2  - FORNECIMENTO E INSTALAÇÃO. AF_01/2020","UN",5,1,5,null,null,null,null,""]
["S",4,"S",0,8,8,1,2,0,0,0,"","Serviço","Serviço","8.8.1.2.5.","SINAPI",86915,"TORNEIRA CROMADA DE MESA, 1/2\u0094 OU 3/4\u0094, PARA LAVATÓRIO, PADRÃO MÉDIO - FORNECIMENTO E INSTALAÇÃO. AF_01/2020","UN",5,1,5,null,null,null,null,"Referência: AGETOP - 80570"]
["S",4,"S",0,8,8,1,2,0,0,0,"","Serviço","Serviço","8.8.1.2.6.","SINAPI",86877,"VÁLVULA EM METAL CROMADO 1.1/2\u0094 X 1.1/2\u0094 PARA TANQUE OU LAVATÓRIO, COM OU SEM LADRÃO - FORNECIMENTO E INSTALAÇÃO. AF_01/2020","UN",5,1,5,null,null,null,null,"Referência: AGETOP - 80580"]
["S",4,"S",0,8,8,1,2,0,0,0,"","Serviço","Serviço","8.8.1.2.7.","SINAPI",86901,"CUBA DE EMBUTIR OVAL EM LOUÇA BRANCA, 35 X 50CM OU EQUIVALENTE - FORNECIMENTO E INSTALAÇÃO. AF_01/2020","UN",4,1,4,null,null,null,null,"Referência: AGETOP - 80587"]
[4,4,4,5,8,8,1,3,0,9,5,"","Nível 4","Nível 4","8.8.1.3.","SINAPI",null,"PIAS E ACESSÓRIOS","-",null,1,"-",null,null,null,null,""]
["S",4,"S",0,8,8,1,3,0,0,0,"","Serviço","Serviço","8.8.1.3.1.","AGETOP",80660,"TORNEIRA DE PAREDE PARA PIA OU BEBEDOURO DIÂMETRO DE 1/2\" E 3/4\" ","Un    ",2,1,2,null,null,null,null,""]
["S",4,"S",0,8,8,1,3,0,0,0,"","Serviço","Serviço","8.8.1.3.2.","AGETOP",80670,"SIFAO P/PIA 1.1/2\" X 2\" METAL","Un    ",2,1,2,null,null,null,null,""]
["S",4,"S",0,8,8,1,3,0,0,0,"","Serviço","Serviço","8.8.1.3.3.","SINAPI",86878,"VÁLVULA EM METAL CROMADO TIPO AMERICANA 3.1/2\u0094 X 1.1/2\u0094 PARA PIA - FORNECIMENTO E INSTALAÇÃO. AF_01/2020","UN",2,1,2,null,null,null,null,""]
["S",4,"S",0,8,8,1,3,0,0,0,"","Serviço","Serviço","8.8.1.3.4.","AGETOP",80687,"CUBA INOX 35X40X15CM E=0,6MM-AÇO 304 (CUBA Nº 3)","Un    ",2,1,2,null,null,null,null,""]
[4,4,4,2,8,8,1,4,0,4,2,"","Nível 4","Nível 4","8.8.1.4.","SINAPI",null,"CHUVEIROS","-",null,1,"-",null,null,null,null,""]
["S",4,"S",0,8,8,1,4,0,0,0,"","Serviço","Serviço","8.8.1.4.1.","AGETOP",80721,"CHUVEIRO ELÉTRICO EM PVC COM BRAÇO METÁLICO","Un    ",2,1,2,null,null,null,null,""]
[4,4,4,2,8,8,1,5,0,2,18,"","Nível 4","Nível 4","8.8.1.5.","SINAPI",null,"REGISTROS","-",null,1,"-",null,null,null,null,""]
["S",4,"S",0,8,8,1,5,0,0,0,"","Serviço","Serviço","8.8.1.5.1.","SINAPI",94794,"REGISTRO DE GAVETA BRUTO, LATÃO, ROSCÁVEL, 1 1/2\u0094, COM ACABAMENTO E CANOPLA CROMADOS, INSTALADO EM RESERVAÇÃO DE ÁGUA DE EDIFICAÇÃO QUE POSSUA RESERVATÓRIO DE FIBRA/FIBROCIMENTO \u0096 FORNECIMENTO E INSTALAÇÃO. AF_06/2016","UN",2,1,2,null,null,null,null,"Referência: AGETOP - 80929"]
[3,3,3,19,8,8,2,0,0,40,19,"","Nível 3","Nível 3","8.8.2.","SINAPI",null,"ÁGUA FRIA","-",null,1,"-",null,null,null,null,""]
[4,4,4,3,8,8,2,1,0,18,3,"","Nível 4","Nível 4","8.8.2.1.","SINAPI",null,"TUBOS DE PVC SOLDÁVEL","-",null,1,"-",null,null,null,null,""]
["S",4,"S",0,8,8,2,1,0,0,0,"","Serviço","Serviço","8.8.2.1.1.","SINAPI",89402,"TUBO, PVC, SOLDÁVEL, DN 25MM, INSTALADO EM RAMAL DE DISTRIBUIÇÃO DE ÁGUA - FORNECIMENTO E INSTALAÇÃO. AF_12/2014","M",7,1,7,null,null,null,null,"Referência: AGETOP - 81003"]
["S",4,"S",0,8,8,2,1,0,0,0,"","Serviço","Serviço","8.8.2.1.2.","SINAPI",89449,"TUBO, PVC, SOLDÁVEL, DN 50MM, INSTALADO EM PRUMADA DE ÁGUA - FORNECIMENTO E INSTALAÇÃO. AF_12/2014","M",15,1,15,null,null,null,null,""]
[4,4,4,2,8,8,2,2,0,15,2,"","Nível 4","Nível 4","8.8.2.2.","SINAPI",null,"ADAPTADORES DE PVC SOLDÁVEL","-",null,1,"-",null,null,null,null,""]
["S",4,"S",0,8,8,2,2,0,0,0,"","Serviço","Serviço","8.8.2.2.1.","SINAPI",89596,"ADAPTADOR CURTO COM BOLSA E ROSCA PARA REGISTRO, PVC, SOLDÁVEL, DN 50MM X 1.1/2\u0094, INSTALADO EM PRUMADA DE ÁGUA - FORNECIMENTO E INSTALAÇÃO. AF_12/2014","UN",7,1,7,null,null,null,null,"Referência: AGETOP - 81069"]
[4,4,4,2,8,8,2,3,0,13,2,"","Nível 4","Nível 4","8.8.2.3.","SINAPI",null,"BUCHAS","-",null,1,"-",null,null,null,null,""]
["S",4,"S",0,8,8,2,3,0,0,0,"","Serviço","Serviço","8.8.2.3.1.","AGETOP",81179,"BUCHA DE REDUCAO SOLDAVEL LONGA 50 X 25 mm","Un    ",1,1,1,null,null,null,null,""]
[4,4,4,4,8,8,2,4,0,11,4,"","Nível 4","Nível 4","8.8.2.4.","SINAPI",null,"JOELHO","-",null,1,"-",null,null,null,null,""]
["S",4,"S",0,8,8,2,4,0,0,0,"","Serviço","Serviço","8.8.2.4.1.","SINAPI",89481,"JOELHO 90 GRAUS, PVC, SOLDÁVEL, DN 25MM, INSTALADO EM PRUMADA DE ÁGUA - FORNECIMENTO E INSTALAÇÃO. AF_12/2014","UN",3,1,3,null,null,null,null,""]
["S",4,"S",0,8,8,2,4,0,0,0,"","Serviço","Serviço","8.8.2.4.2.","SINAPI",89501,"JOELHO 90 GRAUS, PVC, SOLDÁVEL, DN 50MM, INSTALADO EM PRUMADA DE ÁGUA - FORNECIMENTO E INSTALAÇÃO. AF_12/2014","UN",4,1,4,null,null,null,null,""]
["S",4,"S",0,8,8,2,4,0,0,0,"","Serviço","Serviço","8.8.2.4.3.","AGETOP",81360,"JOELHO RED.90 GRAUS SOLD.C/BUCHA LATAO 25X1/2\"","Un    ",2,1,2,null,null,null,null,""]
[4,4,4,4,8,8,2,5,0,7,4,"","Nível 4","Nível 4","8.8.2.5.","SINAPI",null,"TÊ","-",null,1,"-",null,null,null,null,""]
["S",4,"S",0,8,8,2,5,0,0,0,"","Serviço","Serviço","8.8.2.5.1.","SINAPI",89618,"TÊ COM BUCHA DE LATÃO NA BOLSA CENTRAL, PVC, SOLDÁVEL, DN 25MM X 1/2\u0094, INSTALADO EM PRUMADA DE ÁGUA - FORNECIMENTO E INSTALAÇÃO. AF_12/2014","UN",1,1,1,null,null,null,null,""]
["S",4,"S",0,8,8,2,5,0,0,0,"","Serviço","Serviço","8.8.2.5.2.","SINAPI",89627,"TÊ DE REDUÇÃO, PVC, SOLDÁVEL, DN 50MM X 25MM, INSTALADO EM PRUMADA DE ÁGUA - FORNECIMENTO E INSTALAÇÃO. AF_12/2014","UN",1,1,1,null,null,null,null,""]
["S",4,"S",0,8,8,2,5,0,0,0,"","Serviço","Serviço","8.8.2.5.3.","SINAPI",89625,"TE, PVC, SOLDÁVEL, DN 50MM, INSTALADO EM PRUMADA DE ÁGUA - FORNECIMENTO E INSTALAÇÃO. AF_12/2014","UN",4,1,4,null,null,null,null,""]
[4,4,4,3,8,8,2,6,0,3,{"$error":"#N/A"},"","Nível 4","Nível 4","8.8.2.6.","SINAPI",null,"ADESIVOS","-",null,1,"-",null,null,null,null,""]
["S",4,"S",0,8,8,2,6,0,0,0,"","Serviço","Serviço","8.8.2.6.1.","AGETOP",81501,"ADESIVO PLASTICO - FRASCO 850 G","Un    ",2,1,2,null,null,null,null,""]
[{"$f":"CHOOSE(1+LOG(1+2*(ORÇAMENTO.Nivel=\"Nível 1\")+4*(ORÇAMENTO.Nivel=\"Nível 2\")+8*(ORÇAMENTO.Nivel=\"Nível 3\")+16*(ORÇAMENTO.Nivel=\"Nível 4\")+32*(ORÇAMENTO.Nivel=\"Serviço\"),2),0,1,2,3,4,\"S\")","v":"S"},4,"S",0,8,8,2,6,{"$f":"IF(AND($C260<=4,$C260<>0),0,IF(AND($C260=\"S\",$Y260>0),OFFSET(I260,-1,0)+1,OFFSET(I260,-1,0)))","v":0},0,0,"","Serviço","Serviço","8.8.2.6.2.","AGETOP",81504,"SOLUCAO LIMPADORA 1000 CM3","Un    ",2,1,2,null,null,null,null,""]
[3,3,3,17,8,8,3,0,0,21,17,"","Nível 3","Nível 3","8.8.3.","SINAPI",null,"ESGOTO SANITÁRIO","-",null,1,"-",null,null,null,null,""]
[4,4,4,2,8,8,3,1,0,16,2,{"$f":"IF(OR(Y262>0,$C262=1),\"F\",\"\")","v":""},"Nível 4",{"$f":"CHOOSE(1+LOG(1+2*(C262=1)+4*(C262=2)+8*(C262=3)+16*(C262=4)+32*(C262=\"S\"),2),\"\",\"Nível 1\",\"Nível 2\",\"Nível 3\",\"Nível 4\",\"Serviço\")","v":"Nível 4"},"8.8.3.1.","SINAPI",null,"CORPO DE CAIXA SIFONADA / RALO","-",null,1,"-",null,null,null,null,""]
["S",{"$f":"IF(OR(C263=\"s\",C263=0),OFFSET(B263,-1,0),C263)","v":4},{"$f":"IF(OFFSET(C263,-1,0)=\"L\",1,IF(OFFSET(C263,-1,0)=1,2,IF(OR(A263=\"s\",A263=0),\"S\",IF(AND(OFFSET(C263,-1,0)=2,A263=4),3,IF(AND(OR(OFFSET(C263,-1,0)=\"s\",OFFSET(C263,-1,0)=0),A263<>\"s\",A263>OFFSET(B263,-1,0)),OFFSET(B263,-1,0),A263)))))","v":"S"},{"$f":"IF(OR(C263=\"S\",C263=0),0,IF(ISERROR(K263),J263,SMALL(J263:K263,1)))","v":0},{"$f":"IF($C263=1,OFFSET(E263,-1,0)+1,OFFSET(E263,-1,0))","v":8},{"$f":"IF($C263=1,0,IF($C263=2,OFFSET(F263,-1,0)+1,OFFSET(F263,-1,0)))","v":8},{"$f":"IF(AND($C263<=2,$C263<>0),0,IF($C263=3,OFFSET(G263,-1,0)+1,OFFSET(G263,-1,0)))","v":3},{"$f":"IF(AND($C263<=3,$C263<>0),0,IF($C263=4,OFFSET(H263,-1,0)+1,OFFSET(H263,-1,0)))","v":1},0,0,0,"","Serviço","Serviço","8.8.3.1.1.","AGETOP",81663,"CORPO CX. SIFONADA DIAM. 150 X 150 X 50","Un    ",2,1,2,null,null,null,null,""]
[4,4,4,6,8,8,3,2,0,14,6,"","Nível 4","Nível 4","8.8.3.2.","SINAPI",null,"JOELHOS","-",null,1,"-",null,null,null,null,""]
["S",4,"S",0,8,8,3,2,0,0,0,"","Serviço","Serviço","8.8.3.2.1.","SINAPI",89802,"JOELHO 45 GRAUS, PVC, SERIE NORMAL, ESGOTO PREDIAL, DN 50 MM, JUNTA ELÁSTICA, FORNECIDO E INSTALADO EM PRUMADA DE ESGOTO SANITÁRIO OU VENTILAÇÃO. AF_12/2014","UN",3,1,3,null,null,null,null,""]
["S",4,"S",0,8,8,3,2,0,0,0,"","Serviço","Serviço","8.8.3.2.2.","SINAPI",89724,"JOELHO 90 GRAUS, PVC, SERIE NORMAL, ESGOTO PREDIAL, DN 40 MM, JUNTA SOLDÁVEL, FORNECIDO E INSTALADO EM RAMAL DE DESCARGA OU RAMAL DE ESGOTO SANITÁRIO. AF_12/2014","UN",3,1,3,null,null,null,null,""]
["S",4,"S",0,8,8,3,2,0,0,0,"","Serviço","Serviço","8.8.3.2.3.","SINAPI",89731,"JOELHO 90 GRAUS, PVC, SERIE NORMAL, ESGOTO PREDIAL, DN 50 MM, JUNTA ELÁSTICA, FORNECIDO E INSTALADO EM RAMAL DE DESCARGA OU RAMAL DE ESGOTO SANITÁRIO. AF_12/2014","UN",4,1,4,null,null,null,null,""]
["S",4,"S",0,8,8,3,2,0,0,0,"","Serviço","Serviço","8.8.3.2.4.","SINAPI",89809,"JOELHO 90 GRAUS, PVC, SERIE NORMAL, ESGOTO PREDIAL, DN 100 MM, JUNTA ELÁSTICA, FORNECIDO E INSTALADO EM PRUMADA DE ESGOTO SANITÁRIO OU VENTILAÇÃO. AF_12/2014","UN",3,1,3,null,null,null,null,""]
["S",4,"S",0,8,8,3,2,0,0,0,"","Serviço","Serviço","8.8.3.2.5.","AGETOP",81927,"JOELHO 90 GRAUS C/ANEL 40 mm ","Un    ",3,1,3,null,null,null,null,""]
[4,4,4,2,8,8,3,3,0,8,2,"","Nível 4","Nível 4","8.8.3.3.","SINAPI",null,"JUNÇÕES","-",null,1,"-",null,null,null,null,""]
["S",4,"S",0,8,8,3,3,0,0,0,"","Serviço","Serviço","8.8.3.3.1.","AGETOP",81973,"JUNCAO SIMPLES DIAM. 100 X 50 MM","Un    ",1,1,1,null,null,null,null,""]
[4,4,4,2,8,8,3,4,0,6,2,"","Nível 4","Nível 4","8.8.3.4.","SINAPI",null,"TÊ","-",null,1,"-",null,null,null,null,""]
["S",4,"S",0,8,8,3,4,0,0,0,"","Serviço","Serviço","8.8.3.4.1.","SINAPI",89825,"TE, PVC, SERIE NORMAL, ESGOTO PREDIAL, DN 50 X 50 MM, JUNTA ELÁSTICA, FORNECIDO E INSTALADO EM PRUMADA DE ESGOTO SANITÁRIO OU VENTILAÇÃO. AF_12/2014","UN",2,1,2,null,null,null,null,""]
[4,4,4,4,8,8,3,5,0,4,{"$error":"#N/A"},"","Nível 4","Nível 4","8.8.3.5.","SINAPI",null,"TUBOS","-",null,1,"-",null,null,null,null,""]
["S",4,"S",0,8,8,3,5,0,0,0,"","Serviço","Serviço","8.8.3.5.1.","SINAPI",89711,"TUBO PVC, SERIE NORMAL, ESGOTO PREDIAL, DN 40 MM, FORNECIDO E INSTALADO EM RAMAL DE DESCARGA OU RAMAL DE ESGOTO SANITÁRIO. AF_12/2014","M",4,1,4,null,null,null,null,"Referência: AGETOP - 82301"]
["S",4,"S",0,8,8,3,5,0,0,0,"","Serviço","Serviço","8.8.3.5.2.","SINAPI",89798,"TUBO PVC, SERIE NORMAL, ESGOTO PREDIAL, DN 50 MM, FORNECIDO E INSTALADO EM PRUMADA DE ESGOTO SANITÁRIO OU VENTILAÇÃO. AF_12/2014","M",13,1,13,null,null,null,null,""]
["S",4,"S",0,8,8,3,5,0,0,0,"","Serviço","Serviço","8.8.3.5.3.","SINAPI",89800,"TUBO PVC, SERIE NORMAL, ESGOTO PREDIAL, DN 100 MM, FORNECIDO E INSTALADO EM PRUMADA DE ESGOTO SANITÁRIO OU VENTILAÇÃO. AF_12/2014","M",19,1,19,null,null,null,null,""]
[3,3,3,4,8,8,4,0,0,4,{"$error":"#N/A"},"","Nível 3","Nível 3","8.8.4.","SINAPI",null,"EXTRAS","-",null,1,"-",null,null,null,null,""]
["S",3,"S",0,8,8,4,0,0,0,0,"","Serviço","Serviço","8.8.4.0.1.","AGETOP",81840,"TAMPA  PARA CAIXA PASSAGEM FERRO FUNDIDO T-33 - TRÁFEGO LEVE","Un    ",1,1,1,null,null,null,null,""]
["S",3,"S",0,8,8,4,0,0,0,0,"","Serviço","Serviço","8.8.4.0.2.","AGETOP",81825,"CAIXA DE PASSAGEM 60 X 60 CM SEM TAMPA","Un    ",1,1,1,null,null,null,null,""]
["S",3,"S",0,8,8,4,0,0,0,0,"","Serviço","Serviço","8.8.4.0.3.","AGETOP",81885,"TERMINAL DE VENTILACAO DIAMETRO 50 MM","Un    ",2,1,2,null,null,null,null,""]
[2,2,2,37,8,9,0,0,0,37,{"$error":"#N/A"},"","Nível 2","Nível 2","8.9.","AGETOP",null,"INSTALAÇÕES ESPECIAIS","-",null,1,"-",null,null,null,null,""]
[3,3,3,7,8,9,1,0,0,36,7,"","Nível 3","Nível 3","8.9.1.","SINAPI",null,"INSTALAÇÕES DE INCENDIO","-",null,1,"-",null,null,null,null,""]
["S",3,"S",0,8,9,1,0,0,0,0,"","Serviço","Serviço","8.9.1.0.1.","AGETOP",85006,"EXTINTOR MULTI USO EM PO A B C (6 KG) - CAPACIDADE EXTINTORA 3A 20BC","un    ",6,1,6,null,null,null,null,""]
["S",3,"S",0,8,9,1,0,0,0,0,"","Serviço","Serviço","8.9.1.0.2.","AGETOP",85003,"EXTINTOR PO QUIMICO SECO (6 KG) - CAPACIDADE EXTINTORA 20 BC","Un    ",1,1,1,null,null,null,null,""]
["S",3,"S",0,8,9,1,0,0,0,0,"","Serviço","Serviço","8.9.1.0.3.","SINAPI",97599,"LUMINÁRIA DE EMERGÊNCIA - FORNECIMENTO E INSTALAÇÃO. AF_11/2017","UN",10,1,10,null,null,null,null,""]
["S",3,"S",0,8,9,1,0,0,0,0,"","Serviço","Serviço","8.9.1.0.4.","COMPOSIÇÃO","COMP 024_SEE","SINALIZADOR FOTOLUMINESCENTE PARA EXTINTOR","UN ",7,1,7,null,null,null,null,""]
["S",3,"S",0,8,9,1,0,0,0,0,"","Serviço","Serviço","8.9.1.0.5.","COMPOSIÇÃO","COMP 025_SEE","SINALIZADOR FOTOLUMINESCENTE DE EMERGÊNCIA","UN ",17,1,17,null,null,null,null,""]
["S",3,"S",0,8,9,1,0,0,{"$f":"IF(OR($C289=\"S\",$C289=0),0,MATCH(0,OFFSET($D289,1,$C289,ROW($C$328)-ROW($C289)),0))","v":0},{"$f":"IF(OR($C289=\"S\",$C289=0),0,MATCH(OFFSET($D289,0,$C289)+1,OFFSET($D289,1,$C289,ROW($C$328)-ROW($C289)),0))","v":0},"","Serviço","Serviço","8.9.1.0.6.","COMPOSIÇÃO","COMP 277_SEE","MARCAÇÃO NO PISO - 1X1 M PARA EXTINTOR","M2",7,1,7,null,null,null,null,""]
[3,3,3,29,8,9,2,0,0,29,{"$error":"#N/A"},"","Nível 3","Nível 3","8.9.2.","SINAPI",null,"INSTALAÇÕES DE GÁS","-",null,1,"-",null,null,null,null,""]
[4,4,4,28,8,9,2,1,0,28,{"$error":"#N/A"},"","Nível 4","Nível 4","8.9.2.1.","SINAPI",null,"PEÇAS E ACESSÓRIOS 2 CILINDROS","-",null,1,"-",null,null,null,null,""]
["S",4,"S",0,8,9,2,1,0,0,0,"","Serviço","Serviço","8.9.2.1.1.","AGETOP",91007,"CENTRAL DE GÁS PADRÃO GOINFRA SEM INSTALAÇÕES (1+1 CILINDRO 45 KG)","Un    ",1,1,1,null,null,null,null,""]
["S",4,"S",0,8,9,2,1,0,0,0,"","Serviço","Serviço","8.9.2.1.2.","AGETOP",91023,"UNIÃO S/BRONZE PRETA 3/4\" NPT 300 LBS","Un    ",3,1,3,null,null,null,null,""]
["S",4,"S",0,8,9,2,1,0,0,0,"","Serviço","Serviço","8.9.2.1.3.","COMPOSIÇÃO","COMP 382_SEE","TE DE REDUCAO DE FERRO GALVANIZADO, COM ROSCA BSP, DE 3/4\" X 1/2\"","UN ",1,1,1,null,null,null,null,""]
["S",4,"S",0,8,9,2,1,0,0,0,"","Serviço","Serviço","8.9.2.1.4.","COMPOSIÇÃO","COMP 383_SEE","BUCHA DE REDUCAO DE FERRO GALVANIZADO, COM ROSCA BSP, DE 1/2\" X 1/4\"","UN ",3,1,3,null,null,null,null,""]
["S",4,"S",0,8,9,2,1,0,0,0,"","Serviço","Serviço","8.9.2.1.5.","AGETOP",91021,"LUVA GALVANIZADO DE REDUÇÃO 3/4\" X 1/2\" (GÁS)","Un    ",2,1,2,null,null,null,null,""]
["S",4,"S",0,8,9,2,1,0,0,0,"","Serviço","Serviço","8.9.2.1.6.","SINAPI",92692,"NIPLE, EM FERRO GALVANIZADO, CONEXÃO ROSQUEADA, DN 15 (1/2\"), INSTALADO EM RAMAIS E SUB-RAMAIS DE GÁS - FORNECIMENTO E INSTALAÇÃO. AF_12/2015","UN",6,1,6,null,null,null,null,""]
["S",4,"S",0,8,9,2,1,0,0,0,"","Serviço","Serviço","8.9.2.1.7.","AGETOP",91031,"NIPLE DUPLO 300 PSI 3/4\"","Un    ",6,1,6,null,null,null,null,""]
["S",4,"S",0,8,9,2,1,0,0,0,"","Serviço","Serviço","8.9.2.1.8.","COMPOSIÇÃO","COMP 212_SEE","NIPLE DE REDUÇÃO 1/2\" X 1/4\" BSP","UN ",4,1,4,null,null,null,null,""]
["S",4,"S",0,8,9,2,1,0,0,0,"","Serviço","Serviço","8.9.2.1.9.","COMPOSIÇÃO","COMP 213_SEE","NIPLE DE REDUÇÃO 3/4\" X 1/2\" BSP","UN ",4,1,4,null,null,null,null,""]
["S",4,"S",0,8,9,2,1,0,0,0,"","Serviço","Serviço","8.9.2.1.10.","SINAPI",92688,"TUBO DE AÇO GALVANIZADO COM COSTURA, CLASSE MÉDIA, CONEXÃO ROSQUEADA, DN 20 (3/4\"), INSTALADO EM RAMAIS E SUB-RAMAIS DE GÁS - FORNECIMENTO E INSTALAÇÃO. AF_12/2015","M",6,1,6,null,null,null,null,""]
["S",4,"S",0,8,9,2,1,0,0,0,"","Serviço","Serviço","8.9.2.1.11.","SINAPI",92701,"JOELHO 90 GRAUS, EM FERRO GALVANIZADO, CONEXÃO ROSQUEADA, DN 20 (3/4\"), INSTALADO EM RAMAIS E SUB-RAMAIS DE GÁS - FORNECIMENTO E INSTALAÇÃO. AF_12/2015","UN",3,1,3,null,null,null,null,""]
["S",4,"S",0,8,9,2,1,0,0,0,"","Serviço","Serviço","8.9.2.1.12.","COMPOSIÇÃO","COMP 237_SEE","FITA ANTICORROSIVA","M",4,1,4,null,null,null,null,""]
["S",4,"S",0,8,9,2,1,0,0,0,"","Serviço","Serviço","8.9.2.1.13.","AGETOP",91025,"VÁLVULA ESFERICA LATÃO 3/4\"","Un    ",3,1,3,null,null,null,null,""]
["S",4,"S",0,8,9,2,1,0,0,0,"","Serviço","Serviço","8.9.2.1.14.","COMPOSIÇÃO","COMP 542_SEE","VÁLVULA UGV 3/4\" (S) LATÃO","UN ",1,1,1,null,null,null,null,""]
["S",4,"S",0,8,9,2,1,0,0,0,"","Serviço","Serviço","8.9.2.1.15.","COMPOSIÇÃO","COMP 543_SEE","VÁLVULA UGV 1/2\" (S) LATÃO","UN ",1,1,1,null,null,null,null,""]
["S",4,"S",0,8,9,2,1,0,0,0,"","Serviço","Serviço","8.9.2.1.16.","AGETOP",91029,"VALVULA DE RETENÇÃO LATÃO 1/2\" X 7/16\" NPT","Un    ",1,1,1,null,null,null,null,""]
["S",4,"S",0,8,9,2,1,0,0,0,"","Serviço","Serviço","8.9.2.1.17.","COMPOSIÇÃO","COMP 211_SEE","REGULADOR DE 2º ESTÁGIO 5KG/H","UN ",1,1,1,null,null,null,null,""]
["S",4,"S",0,8,9,2,1,0,0,0,"","Serviço","Serviço","8.9.2.1.18.","COMPOSIÇÃO","COMP 210_SEE","REGULADOR DE 1º ESTÁGIO 60KG/H MODELO AP-40  COM MANÔMETRO","UN ",1,1,1,null,null,null,null,""]
["S",4,"S",0,8,9,2,1,0,0,0,"","Serviço","Serviço","8.9.2.1.19.","AGETOP",85003,"EXTINTOR PO QUIMICO SECO (6 KG) - CAPACIDADE EXTINTORA 20 BC","Un    ",1,1,1,null,null,null,null,""]
["S",4,"S",0,8,9,2,1,0,0,0,"","Serviço","Serviço","8.9.2.1.20.","COMPOSIÇÃO","COMP 235_SEE","PLACA DE SINALIZAÇÃO EM PVC COD 01 - (300X300) PROIBIDO FUMAR","UN ",2,1,2,null,null,null,null,""]
["S",4,"S",0,8,9,2,1,0,0,0,"","Serviço","Serviço","8.9.2.1.21.","COMPOSIÇÃO","COMP 236_SEE","PLACA DE SINALIZAÇÃO EM PVC COD 06 - (300X300) PERIGO INFLAMÁVEL","UN ",2,1,2,null,null,null,null,""]
["S",4,"S",0,8,9,2,1,0,0,0,"","Serviço","Serviço","8.9.2.1.22.","AGETOP",91043,"BRAÇADEIRA METALICA TIPO \"D\" DIAM. 3/4\"","Un    ",4,1,4,null,null,null,null,""]
["S",4,"S",0,8,9,2,1,0,0,0,"","Serviço","Serviço","8.9.2.1.23.","AGETOP",71863,"PARAFUSO P/BUCHA S-10","Un    ",8,1,8,null,null,null,null,""]
["S",4,"S",0,8,9,2,1,0,0,0,"","Serviço","Serviço","8.9.2.1.24.","AGETOP",70393,"BUCHA DE NYLON S-10","Un    ",8,1,8,null,null,null,null,""]
["S",4,"S",0,8,9,2,1,0,0,0,"","Serviço","Serviço","8.9.2.1.25.","AGETOP",91045,"SUPORTE PARA COLETOR","Un    ",2,1,2,null,null,null,null,""]
["S",4,"S",0,8,9,2,1,0,0,0,"","Serviço","Serviço","8.9.2.1.26.","COMPOSIÇÃO","COMP 045_SEE","LAUDO DE ESTANQUEIDADE","UN ",1,1,1,null,null,null,null,""]
["S",4,"S",0,8,9,2,1,0,0,0,"","Serviço","Serviço","8.9.2.1.27.","COMPOSIÇÃO","COMP 277_SEE","MARCAÇÃO NO PISO - 1X1 M PARA EXTINTOR","M2",1,1,1,null,null,null,null,""]
[1,1,1,9,9,0,0,0,0,9,{"$error":"#N/A"},"F","Nível 1","Nível 1","9.","SINAPI",null,"ADMINISTRAÇÃO E DIVERSOS DA OBRA","UN",1,1,1,null,null,null,null,""]
[2,2,2,4,9,1,0,0,0,8,4,"","Nível 2","Nível 2","9.1.",null,null,"ADMINISTRAÇÃO","-",null,1,"-",null,null,null,null,""]
[3,3,3,3,9,1,1,0,0,3,{"$error":"#N/A"},"","Nível 3","Nível 3","9.1.1.",null,null,"MENSALISTAS","-",null,1,"-",null,null,null,null,""]
[{"$f":"CHOOSE(1+LOG(1+2*(ORÇAMENTO.Nivel=\"Nível 1\")+4*(ORÇAMENTO.Nivel=\"Nível 2\")+8*(ORÇAMENTO.Nivel=\"Nível 3\")+16*(ORÇAMENTO.Nivel=\"Nível 4\")+32*(ORÇAMENTO.Nivel=\"Serviço\"),2),0,1,2,3,4,\"S\")","v":"S"},3,"S",0,9,1,1,0,{"$f":"IF(AND($C322<=4,$C322<>0),0,IF(AND($C322=\"S\",$Y322>0),OFFSET(I322,-1,0)+1,OFFSET(I322,-1,0)))","v":0},0,0,"","Serviço","Serviço","9.1.1.0.1.","AGETOP",250101,"ENGENHEIRO - (OBRAS CIVIS)","H     ",44,1,44,null,null,null,null,""]
["S",3,"S",0,9,1,1,0,0,0,0,"","Serviço","Serviço","9.1.1.0.2.","AGETOP",250103,"ENCARREGADO - (OBRAS CIVIS)","H     ",440,1,440,null,null,null,null,""]
[2,2,2,4,9,2,0,0,0,4,{"$error":"#N/A"},{"$f":"IF(OR(Y324>0,$C324=1),\"F\",\"\")","v":""},"Nível 2",{"$f":"CHOOSE(1+LOG(1+2*(C324=1)+4*(C324=2)+8*(C324=3)+16*(C324=4)+32*(C324=\"S\"),2),\"\",\"Nível 1\",\"Nível 2\",\"Nível 3\",\"Nível 4\",\"Serviço\")","v":"Nível 2"},"9.2.",null,null,"DIVERSOS","-",null,1,"-",null,null,null,null,""]
["S",{"$f":"IF(OR(C325=\"s\",C325=0),OFFSET(B325,-1,0),C325)","v":2},{"$f":"IF(OFFSET(C325,-1,0)=\"L\",1,IF(OFFSET(C325,-1,0)=1,2,IF(OR(A325=\"s\",A325=0),\"S\",IF(AND(OFFSET(C325,-1,0)=2,A325=4),3,IF(AND(OR(OFFSET(C325,-1,0)=\"s\",OFFSET(C325,-1,0)=0),A325<>\"s\",A325>OFFSET(B325,-1,0)),OFFSET(B325,-1,0),A325)))))","v":"S"},{"$f":"IF(OR(C325=\"S\",C325=0),0,IF(ISERROR(K325),J325,SMALL(J325:K325,1)))","v":0},{"$f":"IF($C325=1,OFFSET(E325,-1,0)+1,OFFSET(E325,-1,0))","v":9},{"$f":"IF($C325=1,0,IF($C325=2,OFFSET(F325,-1,0)+1,OFFSET(F325,-1,0)))","v":2},{"$f":"IF(AND($C325<=2,$C325<>0),0,IF($C325=3,OFFSET(G325,-1,0)+1,OFFSET(G325,-1,0)))","v":0},{"$f":"IF(AND($C325<=3,$C325<>0),0,IF($C325=4,OFFSET(H325,-1,0)+1,OFFSET(H325,-1,0)))","v":0},0,0,0,"","Serviço","Serviço","9.2.0.0.1.","AGETOP",21301,"PLACA DE OBRA PLOTADA EM CHAPA METÁLICA 26 , AFIXADA EM CAVALETES DE MADEIRA DE LEI (VIGOTAS 6X12CM) - PADRÃO GOINFRA","m2    ",7.5,1,7.5,null,null,null,null,""]
["S",2,"S",0,9,2,0,0,0,0,0,"","Serviço","Serviço","9.2.0.0.2.","AGETOP",270804,"PLACA DE INAUGURAÇÃO AÇO ESCOVADO 60 X 120 CM","un    ",1,1,1,null,null,null,null,""]
["S",2,"S",0,9,2,0,0,0,0,0,"","Serviço","Serviço","9.2.0.0.3.","AGETOP",270501,"LIMPEZA FINAL DE OBRA - (OBRAS CIVIS)","m2    ",228.69,1,228.69,null,null,null,null,""]
[-1,null,-1,null,0,0,0,0,0,null,null,"F"]
[null,null,null,null,null,null,null,null,null,null,null,"F",null,null,null,null,null,"OBS: OS QUANTITATIVOS DE MATERIAIS  DAS INSTALAÇÕES HIDROSSANITÁRIAS, ELÉTRICAS E ESPECIAIS SÃO FORNECIDOS PELOS PROFISSIONAIS RESPONSÁVEIS PELOS RESPECTIVOS PROJETOS.",null,null,null,null,"VALOR TOTAL"]
[null,null,null,null,null,null,null,null,null,null,null,"F",null,null,null,null,null,null,null,null,null,null,"VALOR BDI (26,41%)"]
[null,null,null,null,null,null,null,null,null,null,null,"F",null,null,null,null,null,null,null,null,null,null,"TOTAL ORÇAMENTO"]
[null,null,null,null,null,null,null,null,null,null,null,"F"]
[null,null,null,null,null,null,null,null,null,null,null,"F",null,null,null,null,null,null,null,null,null,null,"CUSTO POR M2 ³"]
[null,null,null,null,null,null,null,null,null,null,null,"F",null,null,null,null,null,null,null,null,null,null,"MATERIAL S/ BDI"]
[null,null,null,null,null,null,null,null,null,null,null,"F",null,null,null,null,null,null,null,null,null,null,"MÃO DE OBRA S/ BDI"]
[null,null,null,null,null,null,null,null,null,null,null,"F"]
[null,null,null,null,null,null,null,null,null,null,null,"F",null,null,null,null,"(1) Conforme previsto pelo DECRETO Nº 7.983, DE 8 DE ABRIL DE 2013, os preços adotados são aqueles constantes dos sistemas de referência indicados. Justifica-se o uso dos preços destas composições de custos unitários devido ao seu valor ser menor à mediana de seus correspondentes na tabela SINAPI;"]
[null,null,null,null,null,null,null,null,null,null,null,"F",null,null,null,null,"(2) Optou-se pelo uso das composições de custos da AGETOP para itens não presentes na SINAPI;"]
[null,null,null,null,null,null,null,null,null,null,null,"F",null,null,null,null,"(3) Para itens da AGETOP, os vidros não estão inclusos nas esquadrias e já foram considerados os custos de contramarco para as esquadrias de alumínio;"]
[null,null,null,null,null,null,null,null,null,null,null,"F",null,null,null,null,"(4) Nos casos em que houver execução de granitina e omissão do item AGETOP 221102, considerou-se que o quantitativo para o rodapé, de altura igual a 7cm, foi incorporado na área de piso;"]
[null,null,null,null,null,null,null,null,null,null,null,"F",null,null,null,null,"(5) O custo unitário aproximado por metro quadrado é calculado dividindo-se o valor total do orçamento pela área total de construção."]
[null,null,null,null,null,null,null,null,null,null,null,"F"]
[null,null,null,null,null,null,null,null,null,null,null,"F"]

{"sheet":"Resumo ","index":1,"n_rows":39,"n_cols":9,"rows_kept":39,"cut":false,"hidden":false,"merged":[[42,3,42,7],[41,3,41,7],[38,1,38,8],[22,2,22,5],[23,2,23,5],[24,2,24,5],[25,2,25,5],[26,2,26,5],[32,2,32,5],[33,2,33,5],[34,2,34,5],[35,2,35,5],[27,2,27,5],[28,2,28,5],[29,2,29,5],[30,2,30,5],[31,2,31,5],[1,1,1,8],[2,6,2,8],[3,6,3,8],[4,1,4,8],[5,6,5,8],[6,6,6,8],[7,1,7,8],[8,6,8,8],[9,6,9,8],[13,1,13,8],[11,1,11,2],[12,1,12,2],[0,1,0,8],[36,1,36,5],[2,1,2,5],[3,1,3,5],[5,1,5,5],[6,1,6,5],[8,1,8,5],[9,1,9,5],[11,3,11,5],[12,3,12,5],[10,1,10,8],[11,6,11,8],[12,6,12,8],[19,2,19,5],[20,2,20,5],[21,2,21,5],[13,0,14,0],[15,2,15,5],[16,2,16,5],[17,2,17,5],[18,2,18,5],[14,1,14,8]]}
[]
[]
[null,"UNIDADE ESCOLAR",null,null,null,null,"CÓDIGO INEP"]
[null,{"$f":"Orçamento!$O$4","v":"CRE DE IPORÁ"},null,null,null,null,{"$f":"Orçamento!X4","v":52027163}]
[]
[null,"OBRA",null,null,null,null,"CIDADE"]
[null,{"$f":"Orçamento!$O$7","v":"REFORMA E AMPLIAÇÃO"},null,null,null,null,{"$f":"Orçamento!$X$7","v":"IPORÁ"}]
[]
[null,"ENDEREÇO",null,null,null,null,"CRE"]
[null,{"$f":"Orçamento!$R$10","v":"Rua D - Vila Padre Cícero - S/N - CEP:76.200-000"},null,null,null,null,{"$f":"Orçamento!$O$10","v":"CRE DE IPORÁ"}]
[]
[null,"REFERÊNCIA",null,"DATA",null,null,"ÁREA TOTAL CONSTRUÍDA (M²)"]
[null,{"$f":"CONCATENATE(\"AGETOP E SINAPI - \",Orçamento!$T$10)","v":"AGETOP E SINAPI - DESONERADA"},null,{"$f":"Orçamento!$S$7","v":"2020-06-10"},null,null,{"$f":"Orçamento!$X$13","v":774.52}]
["FILTRO"]
[null,"RESUMO GERAL DO ORÇAMENTO"]
["↓","ITEM","DESCRIÇÃO DOS SERVIÇOS",null,null,null,"PREÇO SEM BDI","PREÇO COM BDI","PARTICIP. (%)"]
[{"$f":"IF(G17>0,\"F\",\"\")","v":"F"},"1.",{"$f":"Orçamento!#REF!","v":{"$error":"#REF!"}},null,null,null,{"$f":"IFERROR(Orçamento!#REF!,\"-\")","v":"-"},{"$f":"IFERROR(Orçamento!#REF!,\"\")","v":""},{"$f":"Orçamento!#REF!","v":{"$error":"#REF!"}}]
[{"$f":"IF(G18>0,\"F\",\"\")","v":"F"},"2.",{"$f":"Orçamento!#REF!","v":{"$error":"#REF!"}},null,null,null,{"$f":"IFERROR(Orçamento!#REF!,\"-\")","v":"-"},{"$f":"IFERROR(Orçamento!#REF!,\"\")","v":""},{"$f":"Orçamento!#REF!","v":{"$error":"#REF!"}}]
["F","3.",{"$f":"Orçamento!#REF!","v":{"$error":"#REF!"}},null,null,null,{"$f":"IFERROR(Orçamento!#REF!,\"-\")","v":"-"},{"$f":"IFERROR(Orçamento!#REF!,\"\")","v":""},{"$f":"Orçamento!#REF!","v":{"$error":"#REF!"}}]
["F","4.",{"$f":"Orçamento!#REF!","v":{"$error":"#REF!"}},null,null,null,{"$f":"IFERROR(Orçamento!#REF!,\"-\")","v":"-"},{"$f":"IFERROR(Orçamento!#REF!,\"\")","v":""},{"$f":"Orçamento!#REF!","v":{"$error":"#REF!"}}]
["F","5.",{"$f":"Orçamento!#REF!","v":{"$error":"#REF!"}},null,null,null,{"$f":"IFERROR(Orçamento!#REF!,\"-\")","v":"-"},{"$f":"IFERROR(Orçamento!#REF!,\"\")","v":""},{"$f":"Orçamento!#REF!","v":{"$error":"#REF!"}}]
["F","6.",{"$f":"Orçamento!#REF!","v":{"$error":"#REF!"}},null,null,null,{"$f":"IFERROR(Orçamento!#REF!,\"-\")","v":"-"},{"$f":"IFERROR(Orçamento!#REF!,\"\")","v":""},{"$f":"Orçamento!#REF!","v":{"$error":"#REF!"}}]
["F","7.",{"$f":"Orçamento!#REF!","v":{"$error":"#REF!"}},null,null,null,{"$f":"IFERROR(Orçamento!#REF!,\"-\")","v":"-"},{"$f":"IFERROR(Orçamento!#REF!,\"\")","v":""},{"$f":"Orçamento!#REF!","v":{"$error":"#REF!"}}]
["F","8.",{"$f":"Orçamento!#REF!","v":{"$error":"#REF!"}},null,null,null,{"$f":"IFERROR(Orçamento!#REF!,\"-\")","v":"-"},{"$f":"IFERROR(Orçamento!#REF!,\"\")","v":""},{"$f":"Orçamento!#REF!","v":{"$error":"#REF!"}}]
["F","9.",{"$f":"Orçamento!#REF!","v":{"$error":"#REF!"}},null,null,null,{"$f":"IFERROR(Orçamento!#REF!,\"-\")","v":"-"},{"$f":"IFERROR(Orçamento!#REF!,\"\")","v":""},{"$f":"Orçamento!#REF!","v":{"$error":"#REF!"}}]
["F","10.",{"$f":"Orçamento!#REF!","v":{"$error":"#REF!"}},null,null,null,{"$f":"IFERROR(Orçamento!#REF!,\"-\")","v":"-"},{"$f":"IFERROR(Orçamento!#REF!,\"\")","v":""},{"$f":"Orçamento!#REF!","v":{"$error":"#REF!"}}]
["F","11.",{"$f":"Orçamento!#REF!","v":{"$error":"#REF!"}},null,null,null,{"$f":"IFERROR(Orçamento!#REF!,\"-\")","v":"-"},{"$f":"IFERROR(Orçamento!#REF!,\"\")","v":""},{"$f":"Orçamento!#REF!","v":{"$error":"#REF!"}}]
["F","12.",{"$f":"Orçamento!#REF!","v":{"$error":"#REF!"}},null,null,null,{"$f":"IFERROR(Orçamento!#REF!,\"-\")","v":"-"},{"$f":"IFERROR(Orçamento!#REF!,\"\")","v":""},{"$f":"Orçamento!#REF!","v":{"$error":"#REF!"}}]
["F","13.",{"$f":"Orçamento!#REF!","v":{"$error":"#REF!"}},null,null,null,{"$f":"IFERROR(Orçamento!#REF!,\"-\")","v":"-"},{"$f":"IFERROR(Orçamento!#REF!,\"\")","v":""},{"$f":"Orçamento!#REF!","v":{"$error":"#REF!"}}]
["F","14.",{"$f":"Orçamento!#REF!","v":{"$error":"#REF!"}},null,null,null,{"$f":"IFERROR(Orçamento!#REF!,\"-\")","v":"-"},{"$f":"IFERROR(Orçamento!#REF!,\"\")","v":""},{"$f":"Orçamento!#REF!","v":{"$error":"#REF!"}}]
["F","15.",{"$f":"Orçamento!#REF!","v":{"$error":"#REF!"}},null,null,null,{"$f":"IFERROR(Orçamento!#REF!,\"-\")","v":"-"},{"$f":"IFERROR(Orçamento!#REF!,\"\")","v":""},{"$f":"Orçamento!#REF!","v":{"$error":"#REF!"}}]
["F","16.",{"$f":"Orçamento!#REF!","v":{"$error":"#REF!"}},null,null,null,{"$f":"IFERROR(Orçamento!#REF!,\"-\")","v":"-"},{"$f":"IFERROR(Orçamento!#REF!,\"\")","v":""},{"$f":"Orçamento!#REF!","v":{"$error":"#REF!"}}]
["F","17.",{"$f":"Orçamento!#REF!","v":{"$error":"#REF!"}},null,null,null,{"$f":"IFERROR(Orçamento!#REF!,\"-\")","v":"-"},{"$f":"IFERROR(Orçamento!#REF!,\"\")","v":""},{"$f":"Orçamento!#REF!","v":{"$error":"#REF!"}}]
["F","18.",{"$f":"Orçamento!#REF!","v":{"$error":"#REF!"}},null,null,null,{"$f":"IFERROR(Orçamento!#REF!,\"-\")","v":"-"},{"$f":"IFERROR(Orçamento!#REF!,\"\")","v":""},{"$f":"Orçamento!#REF!","v":{"$error":"#REF!"}}]
["F","19.",{"$f":"Orçamento!#REF!","v":{"$error":"#REF!"}},null,null,null,{"$f":"IFERROR(Orçamento!#REF!,\"-\")","v":"-"},{"$f":"IFERROR(Orçamento!#REF!,\"\")","v":""},{"$f":"Orçamento!#REF!","v":{"$error":"#REF!"}}]
["F","20.",{"$f":"Orçamento!#REF!","v":{"$error":"#REF!"}},null,null,null,{"$f":"IFERROR(Orçamento!#REF!,\"-\")","v":"-"},{"$f":"IFERROR(Orçamento!#REF!,\"\")","v":""},{"$f":"Orçamento!#REF!","v":{"$error":"#REF!"}}]
["F","TOTAL GERAL DO ORÇAMENTO (R$)",null,null,null,null,{"$f":"SUM(G17:G36)","v":0},{"$f":"SUM(H17:H36)","v":0},{"$f":"SUM(I17:I36)","v":{"$error":"#REF!"}}]
["F"]
["F"]

{"sheet":"Somatório","index":2,"n_rows":45,"n_cols":6,"rows_kept":45,"cut":false,"hidden":false,"merged":[[0,1,0,5],[14,1,14,5],[2,1,2,3],[2,4,2,5],[3,1,3,3],[3,4,3,5],[5,1,5,3],[5,4,5,5],[6,1,6,3],[6,4,6,5],[8,1,8,3],[8,4,8,5],[1,1,1,5],[4,1,4,5],[7,1,7,5],[10,1,10,5],[9,1,9,3],[9,4,9,5],[11,1,11,2],[11,4,11,5],[12,1,12,2],[12,4,12,5],[13,0,14,0],[42,1,42,2],[44,1,44,5],[47,3,47,5],[48,3,48,5],[13,1,13,5]]}
[]
[]
[null,"UNIDADE ESCOLAR",null,null,"CÓDIGO INEP"]
[null,{"$f":"Orçamento!$O$4","v":"CRE DE IPORÁ"},null,null,{"$f":"Orçamento!X4","v":52027163}]
[]
[null,"OBRA",null,null,"CIDADE"]
[null,{"$f":"Orçamento!$O$7","v":"REFORMA E AMPLIAÇÃO"},null,null,{"$f":"Orçamento!$X$7","v":"IPORÁ"}]
[]
[null,"ENDEREÇO",null,null,"CRE"]
[null,{"$f":"Orçamento!$R$10","v":"Rua D - Vila Padre Cícero - S/N - CEP:76.200-000"},null,null,{"$f":"Orçamento!$O$10","v":"CRE DE IPORÁ"}]
[]
[null,"REFERÊNCIA",null,"DATA","ÁREA TOTAL CONSTRUÍDA (M²)"]
[null,{"$f":"CONCATENATE(\"AGETOP E SINAPI - \",Orçamento!$T$10)","v":"AGETOP E SINAPI - DESONERADA"},null,{"$f":"Orçamento!$S$7","v":"2020-06-10"},{"$f":"Orçamento!$X$13","v":774.52}]
["FILTRO"]
[null,"SOMATÓRIO DE SERVIÇOS"]
["↓","ITEM","DESCRIÇÃO DOS SERVIÇOS","PREÇO SEM BDI (R$)","PREÇO COM BDI (R$)","PARTIC.  ( % )"]
[{"$f":"IF(D17>0,\"F\",\"\")","v":{"$error":"#REF!"}},"a.",{"$f":"Orçamento!#REF!","v":{"$error":"#REF!"}},{"$f":"Orçamento!#REF!","v":{"$error":"#REF!"}},{"$f":"Orçamento!#REF!","v":{"$error":"#REF!"}},{"$f":"Orçamento!#REF!","v":{"$error":"#REF!"}}]
[{"$f":"IF(D18>0,\"F\",\"\")","v":{"$error":"#REF!"}},"b.",{"$f":"Orçamento!#REF!","v":{"$error":"#REF!"}},{"$f":"Orçamento!#REF!","v":{"$error":"#REF!"}},{"$f":"Orçamento!#REF!","v":{"$error":"#REF!"}},{"$f":"Orçamento!#REF!","v":{"$error":"#REF!"}}]
[{"$error":"#REF!"},"c.",{"$f":"Orçamento!#REF!","v":{"$error":"#REF!"}},{"$f":"Orçamento!#REF!","v":{"$error":"#REF!"}},{"$f":"Orçamento!#REF!","v":{"$error":"#REF!"}},{"$f":"Orçamento!#REF!","v":{"$error":"#REF!"}}]
[{"$error":"#REF!"},"d.",{"$f":"Orçamento!#REF!","v":{"$error":"#REF!"}},{"$f":"Orçamento!#REF!","v":{"$error":"#REF!"}},{"$f":"Orçamento!#REF!","v":{"$error":"#REF!"}},{"$f":"Orçamento!#REF!","v":{"$error":"#REF!"}}]
[{"$error":"#REF!"},"e.",{"$f":"Orçamento!#REF!","v":{"$error":"#REF!"}},{"$f":"Orçamento!#REF!","v":{"$error":"#REF!"}},{"$f":"Orçamento!#REF!","v":{"$error":"#REF!"}},{"$f":"Orçamento!#REF!","v":{"$error":"#REF!"}}]
[{"$error":"#REF!"},"f.",{"$f":"Orçamento!#REF!","v":{"$error":"#REF!"}},{"$f":"Orçamento!#REF!","v":{"$error":"#REF!"}},{"$f":"Orçamento!#REF!","v":{"$error":"#REF!"}},{"$f":"Orçamento!#REF!","v":{"$error":"#REF!"}}]
[{"$error":"#REF!"},"g.",{"$f":"Orçamento!#REF!","v":{"$error":"#REF!"}},{"$f":"Orçamento!#REF!","v":{"$error":"#REF!"}},{"$f":"Orçamento!#REF!","v":{"$error":"#REF!"}},{"$f":"Orçamento!#REF!","v":{"$error":"#REF!"}}]
[{"$error":"#REF!"},"h",{"$f":"Orçamento!#REF!","v":{"$error":"#REF!"}},{"$f":"Orçamento!#REF!","v":{"$error":"#REF!"}},{"$f":"Orçamento!#REF!","v":{"$error":"#REF!"}},{"$f":"Orçamento!#REF!","v":{"$error":"#REF!"}}]
[{"$error":"#REF!"},"i.",{"$f":"Orçamento!#REF!","v":{"$error":"#REF!"}},{"$f":"Orçamento!#REF!","v":{"$error":"#REF!"}},{"$f":"Orçamento!#REF!","v":{"$error":"#REF!"}},{"$f":"Orçamento!#REF!","v":{"$error":"#REF!"}}]
[{"$error":"#REF!"},"j.",{"$f":"Orçamento!#REF!","v":{"$error":"#REF!"}},{"$f":"Orçamento!#REF!","v":{"$error":"#REF!"}},{"$f":"Orçamento!#REF!","v":{"$error":"#REF!"}},{"$f":"Orçamento!#REF!","v":{"$error":"#REF!"}}]
[{"$error":"#REF!"},"k.",{"$f":"Orçamento!#REF!","v":{"$error":"#REF!"}},{"$f":"Orçamento!#REF!","v":{"$error":"#REF!"}},{"$f":"Orçamento!#REF!","v":{"$error":"#REF!"}},{"$f":"Orçamento!#REF!","v":{"$error":"#REF!"}}]
[{"$error":"#REF!"},"l.",{"$f":"Orçamento!#REF!","v":{"$error":"#REF!"}},{"$f":"Orçamento!#REF!","v":{"$error":"#REF!"}},{"$f":"Orçamento!#REF!","v":{"$error":"#REF!"}},{"$f":"Orçamento!#REF!","v":{"$error":"#REF!"}}]
[{"$error":"#REF!"},"m.",{"$f":"Orçamento!#REF!","v":{"$error":"#REF!"}},{"$f":"Orçamento!#REF!","v":{"$error":"#REF!"}},{"$f":"Orçamento!#REF!","v":{"$error":"#REF!"}},{"$f":"Orçamento!#REF!","v":{"$error":"#REF!"}}]
[{"$error":"#REF!"},"n.",{"$f":"Orçamento!#REF!","v":{"$error":"#REF!"}},{"$f":"Orçamento!#REF!","v":{"$error":"#REF!"}},{"$f":"Orçamento!#REF!","v":{"$error":"#REF!"}},{"$f":"Orçamento!#REF!","v":{"$error":"#REF!"}}]
[{"$error":"#REF!"},"o.",{"$f":"Orçamento!#REF!","v":{"$error":"#REF!"}},{"$f":"Orçamento!#REF!","v":{"$error":"#REF!"}},{"$f":"Orçamento!#REF!","v":{"$error":"#REF!"}},{"$f":"Orçamento!#REF!","v":{"$error":"#REF!"}}]
[{"$error":"#REF!"},"p.",{"$f":"Orçamento!#REF!","v":{"$error":"#REF!"}},{"$f":"Orçamento!#REF!","v":{"$error":"#REF!"}},{"$f":"Orçamento!#REF!","v":{"$error":"#REF!"}},{"$f":"Orçamento!#REF!","v":{"$error":"#REF!"}}]
[{"$error":"#REF!"},"q.",{"$f":"Orçamento!#REF!","v":{"$error":"#REF!"}},{"$f":"Orçamento!#REF!","v":{"$error":"#REF!"}},{"$f":"Orçamento!#REF!","v":{"$error":"#REF!"}},{"$f":"Orçamento!#REF!","v":{"$error":"#REF!"}}]
[{"$error":"#REF!"},"r.",{"$f":"Orçamento!#REF!","v":{"$error":"#REF!"}},{"$f":"Orçamento!#REF!","v":{"$error":"#REF!"}},{"$f":"Orçamento!#REF!","v":{"$error":"#REF!"}},{"$f":"Orçamento!#REF!","v":{"$error":"#REF!"}}]
[{"$error":"#REF!"},"s.",{"$f":"Orçamento!#REF!","v":{"$error":"#REF!"}},{"$f":"Orçamento!#REF!","v":{"$error":"#REF!"}},{"$f":"Orçamento!#REF!","v":{"$error":"#REF!"}},{"$f":"Orçamento!#REF!","v":{"$error":"#REF!"}}]
[{"$error":"#REF!"},"t.",{"$f":"Orçamento!#REF!","v":{"$error":"#REF!"}},{"$f":"Orçamento!#REF!","v":{"$error":"#REF!"}},{"$f":"Orçamento!#REF!","v":{"$error":"#REF!"}},{"$f":"Orçamento!#REF!","v":{"$error":"#REF!"}}]
[{"$error":"#REF!"},"u.",{"$f":"Orçamento!#REF!","v":{"$error":"#REF!"}},{"$f":"Orçamento!#REF!","v":{"$error":"#REF!"}},{"$f":"Orçamento!#REF!","v":{"$error":"#REF!"}},{"$f":"Orçamento!#REF!","v":{"$error":"#REF!"}}]
[{"$error":"#REF!"},"v.",{"$f":"Orçamento!#REF!","v":{"$error":"#REF!"}},{"$f":"Orçamento!#REF!","v":{"$error":"#REF!"}},{"$f":"Orçamento!#REF!","v":{"$error":"#REF!"}},{"$f":"Orçamento!#REF!","v":{"$error":"#REF!"}}]
[{"$error":"#REF!"},"w.",{"$f":"Orçamento!#REF!","v":{"$error":"#REF!"}},{"$f":"Orçamento!#REF!","v":{"$error":"#REF!"}},{"$f":"Orçamento!#REF!","v":{"$error":"#REF!"}},{"$f":"Orçamento!#REF!","v":{"$error":"#REF!"}}]
[{"$error":"#REF!"},"x.",{"$f":"Orçamento!#REF!","v":{"$error":"#REF!"}},{"$f":"Orçamento!#REF!","v":{"$error":"#REF!"}},{"$f":"Orçamento!#REF!","v":{"$error":"#REF!"}},{"$f":"Orçamento!#REF!","v":{"$error":"#REF!"}}]
[{"$error":"#REF!"},"y.",{"$f":"Orçamento!#REF!","v":{"$error":"#REF!"}},{"$f":"Orçamento!#REF!","v":{"$error":"#REF!"}},{"$f":"Orçamento!#REF!","v":{"$error":"#REF!"}},{"$f":"Orçamento!#REF!","v":{"$error":"#REF!"}}]
[{"$error":"#REF!"},"z.",{"$f":"Orçamento!#REF!","v":{"$error":"#REF!"}},{"$f":"Orçamento!#REF!","v":{"$error":"#REF!"}},{"$f":"Orçamento!#REF!","v":{"$error":"#REF!"}},{"$f":"Orçamento!#REF!","v":{"$error":"#REF!"}}]
["F","TOTAL GERAL DO ORÇAMENTO",null,{"$f":"SUM(D17:D42)","v":{"$error":"#REF!"}},{"$f":"SUM(E17:E42)","v":{"$error":"#REF!"}},{"$f":"SUM(F17:F42)","v":{"$error":"#REF!"}}]
[]
[null,"(*) Para itens da AGETOP, os vidros não estão inclusos nas esquadrias e já foram considerados os custos de contramarco para as esquadrias de alumínio;"]

{"sheet":"Cronog_60_Dias","index":3,"n_rows":99,"n_cols":17,"rows_kept":99,"cut":false,"hidden":false,"merged":[[0,1,0,13],[2,1,2,7],[3,1,3,7],[5,1,5,7],[6,1,6,7],[8,1,8,7],[9,1,9,7],[1,1,1,13],[7,1,7,13],[4,1,4,13],[10,1,10,13],[9,8,9,13],[8,8,8,13],[3,8,3,13],[6,8,6,13],[5,8,5,13],[2,8,2,13],[50,1,52,2],[71,3,73,3],[12,13,13,13],[13,1,13,2],[13,5,13,8],[13,9,13,12],[12,3,13,3],[12,9,12,12],[14,1,16,2],[12,5,12,8],[17,1,19,2],[17,4,19,4],[17,5,17,8],[17,9,17,12],[19,5,19,8],[19,9,19,12],[20,1,22,2],[65,1,67,2],[68,3,70,3],[62,3,64,3],[68,1,70,2],[56,3,58,3],[65,4,67,4],[74,3,76,3],[50,4,52,4],[74,4,76,4],[56,1,58,2],[56,4,58,4],[50,3,52,3],[53,3,55,3],[68,4,70,4],[62,1,64,2],[62,4,64,4],[59,3,61,3],[53,1,55,2],[53,4,55,4],[59,1,61,2],[59,4,61,4],[74,1,76,2],[20,4,22,4],[20,5,20,8],[20,9,20,12],[22,5,22,8],[22,9,22,12],[20,3,22,3],[14,3,16,3],[17,3,19,3],[14,4,16,4],[14,5,14,8],[14,9,14,12],[16,5,16,8],[16,9,16,12],[23,9,23,12],[25,5,25,8],[25,9,25,12],[26,1,28,2],[26,4,28,4],[26,5,26,8],[26,9,26,12],[28,5,28,8],[28,9,28,12],[23,3,25,3],[23,1,25,2],[23,4,25,4],[23,5,23,8],[26,3,28,3],[29,9,29,12],[31,5,31,8],[31,9,31,12],[32,1,34,2],[32,4,34,4],[32,5,32,8],[32,9,32,12],[34,5,34,8],[34,9,34,12],[32,3,34,3],[29,5,29,8],[29,1,31,2],[29,4,31,4],[29,3,31,3],[35,9,35,12],[37,5,37,8],[37,9,37,12],[35,3,37,3],[40,9,40,12],[38,3,40,3],[38,9,38,12],[41,1,43,2],[41,4,43,4],[41,5,41,8],[41,9,41,12],[43,5,43,8],[43,9,43,12],[41,3,43,3],[35,5,35,8],[38,5,38,8],[40,5,40,8],[35,1,37,2],[35,4,37,4],[38,1,40,2],[38,4,40,4],[44,9,44,12],[46,5,46,8],[46,9,46,12],[47,1,49,2],[47,4,49,4],[47,5,47,8],[47,9,47,12],[49,5,49,8],[49,9,49,12],[44,5,44,8],[47,3,49,3],[44,3,46,3],[44,1,46,2],[44,4,46,4],[53,9,53,12],[55,5,55,8],[55,9,55,12],[50,5,50,8],[50,9,50,12],[52,5,52,8],[52,9,52,12],[56,9,56,12],[58,5,58,8],[58,9,58,12],[53,5,53,8],[56,5,56,8],[68,5,68,8],[65,5,65,8],[65,9,65,12],[67,5,67,8],[67,9,67,12],[65,3,67,3],[62,9,62,12],[64,5,64,8],[64,9,64,12],[62,5,62,8],[95,1,95,2],[95,5,95,8],[95,9,95,12],[97,1,97,4],[98,1,98,13],[86,9,86,12],[88,5,88,8],[88,9,88,12],[85,5,85,8],[85,9,85,12],[89,1,91,2],[89,4,91,4],[89,5,89,8],[89,9,89,12],[91,5,91,8],[91,9,91,12],[89,3,91,3],[86,4,88,4],[86,5,86,8],[86,3,88,3],[83,1,85,2],[83,4,85,4],[83,5,83,8],[83,9,83,12],[94,1,94,2],[94,5,94,8],[94,9,94,12],[76,5,76,8],[76,9,76,12],[77,5,77,8],[77,9,77,12],[79,5,79,8],[79,9,79,12],[80,5,80,8],[80,9,80,12],[82,5,82,8],[82,9,82,12],[77,3,79,3],[80,3,82,3],[86,1,88,2],[80,4,82,4],[83,3,85,3],[77,1,79,2],[77,4,79,4],[80,1,82,2],[12,0,13,0],[9,0,11,0],[11,1,11,13],[92,1,92,2],[92,5,92,8],[92,9,92,12],[93,1,93,2],[93,5,93,8],[93,9,93,12],[74,9,74,12],[74,5,74,8],[68,9,68,12],[70,5,70,8],[70,9,70,12],[59,5,59,8],[71,1,73,2],[71,4,73,4],[71,5,71,8],[71,9,71,12],[73,5,73,8],[73,9,73,12],[59,9,59,12],[61,5,61,8],[61,9,61,12]]}
[]
[]
[null,"UNIDADE ESCOLAR",null,null,null,null,null,null,"PRAZO"]
[null,{"$f":"Orçamento!$O$4","v":"CRE DE IPORÁ"},null,null,null,null,null,null,"60 DIAS CORRIDOS"]
[]
[null,"OBRA",null,null,null,null,null,null,"DATA"]
[null,{"$f":"Orçamento!$O$7","v":"REFORMA E AMPLIAÇÃO"},null,null,null,null,null,null,{"$f":"Orçamento!$S$7","v":"2020-06-10"}]
[]
[null,"LOCAL",null,null,null,null,null,null,"ÁREA TOTAL CONSTRUÍDA (M²)"]
["FILTRO",{"$f":"Orçamento!$X$7","v":"IPORÁ"},null,null,null,null,null,null,{"$f":"Orçamento!$X$13","v":774.52}]
[]
[null,"CRONOGRAMA - FÍSICO FINANCEIRO"]
["↓","CUSTO TOTAL:",{"$f":"D93","v":{"$error":"#REF!"}},"VALOR","Dias:",30,null,null,null,60,null,null,null,"TOTAL"]
[null,"DESCRIÇÃO DOS SERVIÇOS",null,null,"%","1ª PARCELA",null,null,null,"2ª PARCELA"]
[{"$f":"IF(D15>0,\"F\",\"\")","v":{"$error":"#REF!"}},"SERVIÇOS PRELIMINARES",null,{"$f":"Orçamento!#REF!","v":{"$error":"#REF!"}},{"$f":"Orçamento!#REF!","v":{"$error":"#REF!"}},{"$f":"ROUND(F17*$D$15,2)","v":{"$error":"#REF!"}},null,null,null,{"$f":"ROUND(J17*$D$15,2)","v":{"$error":"#REF!"}},null,null,null,{"$f":"SUM(F15:M15)","v":{"$error":"#REF!"}},null,{"$f":"IF(D15=N15,\"OK\",\"ERRO\")","v":{"$error":"#REF!"}}]
[{"$f":"IF(A15=\"F\",A15,\"\")","v":{"$error":"#REF!"}}]
[{"$f":"IF(A16=\"F\",A16,\"\")","v":{"$error":"#REF!"}},null,null,null,null,1,null,null,null,{"$f":"1-F17","v":0},null,null,null,{"$f":"IFERROR(E15/100,\"\")","v":""},null,{"$f":"IF(E15=N17*100,\"OK\",\"ERRO\")","v":{"$error":"#REF!"}}]
[{"$f":"IF(D18>0,\"F\",\"\")","v":{"$error":"#REF!"}},"TRANSPORTES",null,{"$f":"Orçamento!#REF!","v":{"$error":"#REF!"}},{"$f":"Orçamento!#REF!","v":{"$error":"#REF!"}},{"$f":"ROUND(F20*$D$18,2)","v":{"$error":"#REF!"}},null,null,null,{"$f":"ROUND(J20*$D$18,2)","v":{"$error":"#REF!"}},null,null,null,{"$f":"SUM(F18:M18)","v":{"$error":"#REF!"}},null,{"$f":"IF(D18=N18,\"OK\",\"ERRO\")","v":{"$error":"#REF!"}}]
[{"$f":"IF(A18=\"F\",A18,\"\")","v":{"$error":"#REF!"}}]
[{"$f":"IF(A19=\"F\",A19,\"\")","v":{"$error":"#REF!"}},null,null,null,null,0.48,null,null,null,{"$f":"1-F20","v":0.52},null,null,null,{"$f":"IFERROR(E18/100,\"\")","v":""},null,{"$f":"IF(E18=N20*100,\"OK\",\"ERRO\")","v":{"$error":"#REF!"}}]
[{"$f":"IF(D21>0,\"F\",\"\")","v":{"$error":"#REF!"}},"SERVIÇO EM TERRA",null,{"$f":"Orçamento!#REF!","v":{"$error":"#REF!"}},{"$f":"Orçamento!#REF!","v":{"$error":"#REF!"}},{"$f":"ROUND(F23*$D$21,2)","v":{"$error":"#REF!"}},null,null,null,{"$f":"ROUND(J23*$D$21,2)","v":{"$error":"#REF!"}},null,null,null,{"$f":"SUM(F21:M21)","v":{"$error":"#REF!"}},null,{"$f":"IF(D21=N21,\"OK\",\"ERRO\")","v":{"$error":"#REF!"}}]
[{"$f":"IF(A21=\"F\",A21,\"\")","v":{"$error":"#REF!"}}]
[{"$f":"IF(A22=\"F\",A22,\"\")","v":{"$error":"#REF!"}},null,null,null,null,1,null,null,null,{"$f":"1-F23","v":0},null,null,null,{"$f":"IFERROR(E21/100,\"\")","v":""},null,{"$f":"IF(E21=N23*100,\"OK\",\"ERRO\")","v":{"$error":"#REF!"}}]
[{"$f":"IF(D24>0,\"F\",\"\")","v":{"$error":"#REF!"}},"FUNDAÇÕES E SONDAGENS",null,{"$f":"Orçamento!#REF!","v":{"$error":"#REF!"}},{"$f":"Orçamento!#REF!","v":{"$error":"#REF!"}},{"$f":"ROUND(F26*$D$24,2)","v":{"$error":"#REF!"}},null,null,null,{"$f":"ROUND(J26*$D$24,2)","v":{"$error":"#REF!"}},null,null,null,{"$f":"SUM(F24:M24)","v":{"$error":"#REF!"}},null,{"$f":"IF(D24=N24,\"OK\",\"ERRO\")","v":{"$error":"#REF!"}}]
[{"$f":"IF(A24=\"F\",A24,\"\")","v":{"$error":"#REF!"}}]
[{"$f":"IF(A25=\"F\",A25,\"\")","v":{"$error":"#REF!"}},null,null,null,null,1,null,null,null,{"$f":"1-F26","v":0},null,null,null,{"$f":"IFERROR(E24/100,\"\")","v":""},null,{"$f":"IF(E24=N26*100,\"OK\",\"ERRO\")","v":{"$error":"#REF!"}}]
[{"$f":"IF(D27>0,\"F\",\"\")","v":{"$error":"#REF!"}},"ESTRUTURA",null,{"$f":"Orçamento!#REF!","v":{"$error":"#REF!"}},{"$f":"Orçamento!#REF!","v":{"$error":"#REF!"}},{"$f":"ROUND(F29*$D$27,2)","v":{"$error":"#REF!"}},null,null,null,{"$f":"ROUND(J29*$D$27,2)","v":{"$error":"#REF!"}},null,null,null,{"$f":"SUM(F27:M27)","v":{"$error":"#REF!"}},null,{"$f":"IF(D27=N27,\"OK\",\"ERRO\")","v":{"$error":"#REF!"}}]
[{"$f":"IF(A27=\"F\",A27,\"\")","v":{"$error":"#REF!"}}]
[{"$f":"IF(A28=\"F\",A28,\"\")","v":{"$error":"#REF!"}},null,null,null,null,0.49,null,null,null,{"$f":"1-F29","v":0.51},null,null,null,{"$f":"IFERROR(E27/100,\"\")","v":""},null,{"$f":"IF(E27=N29*100,\"OK\",\"ERRO\")","v":{"$error":"#REF!"}}]
[{"$f":"IF(D30>0,\"F\",\"\")","v":{"$error":"#REF!"}},"INST.ELET/TELEFÔNICA/CABEAMENTO ESTRUTURADO",null,{"$f":"Orçamento!#REF!","v":{"$error":"#REF!"}},{"$f":"Orçamento!#REF!","v":{"$error":"#REF!"}},{"$f":"ROUND(F32*$D$30,2)","v":{"$error":"#REF!"}},null,null,null,{"$f":"ROUND(J32*$D$30,2)","v":{"$error":"#REF!"}},null,null,null,{"$f":"SUM(F30:M30)","v":{"$error":"#REF!"}},null,{"$f":"IF(D30=N30,\"OK\",\"ERRO\")","v":{"$error":"#REF!"}}]
[{"$f":"IF(A30=\"F\",A30,\"\")","v":{"$error":"#REF!"}}]
[{"$f":"IF(A31=\"F\",A31,\"\")","v":{"$error":"#REF!"}},null,null,null,null,0.4,null,null,null,{"$f":"1-F32","v":0.6},null,null,null,{"$f":"IFERROR(E30/100,\"\")","v":""},null,{"$f":"IF(E30=N32*100,\"OK\",\"ERRO\")","v":{"$error":"#REF!"}}]
[{"$f":"IF(D33>0,\"F\",\"\")","v":{"$error":"#REF!"}},"INSTALAÇÕES HIDROSSANITÁRIAS",null,{"$f":"Orçamento!#REF!","v":{"$error":"#REF!"}},{"$f":"Orçamento!#REF!","v":{"$error":"#REF!"}},{"$f":"ROUND(F35*$D$33,2)","v":{"$error":"#REF!"}},null,null,null,{"$f":"ROUND(J35*$D$33,2)","v":{"$error":"#REF!"}},null,null,null,{"$f":"SUM(F33:M33)","v":{"$error":"#REF!"}},null,{"$f":"IF(D33=N33,\"OK\",\"ERRO\")","v":{"$error":"#REF!"}}]
[{"$f":"IF(A33=\"F\",A33,\"\")","v":{"$error":"#REF!"}}]
[{"$f":"IF(A34=\"F\",A34,\"\")","v":{"$error":"#REF!"}},null,null,null,null,0.48,null,null,null,{"$f":"1-F35","v":0.52},null,null,null,{"$f":"IFERROR(E33/100,\"\")","v":""},null,{"$f":"IF(E33=N35*100,\"OK\",\"ERRO\")","v":{"$error":"#REF!"}}]
[{"$f":"IF(D36>0,\"F\",\"\")","v":{"$error":"#REF!"}},"INSTALAÇÕES ESPECIAIS",null,{"$f":"Orçamento!#REF!","v":{"$error":"#REF!"}},{"$f":"Orçamento!#REF!","v":{"$error":"#REF!"}},{"$f":"ROUND(F38*$D$36,2)","v":{"$error":"#REF!"}},null,null,null,{"$f":"ROUND(J38*$D$36,2)","v":{"$error":"#REF!"}},null,null,null,{"$f":"SUM(F36:M36)","v":{"$error":"#REF!"}},null,{"$f":"IF(D36=N36,\"OK\",\"ERRO\")","v":{"$error":"#REF!"}}]
[{"$f":"IF(A36=\"F\",A36,\"\")","v":{"$error":"#REF!"}}]
[{"$f":"IF(A37=\"F\",A37,\"\")","v":{"$error":"#REF!"}},null,null,null,null,1,null,null,null,{"$f":"1-F38","v":0},null,null,null,{"$f":"IFERROR(E36/100,\"\")","v":""},null,{"$f":"IF(E36=N38*100,\"OK\",\"ERRO\")","v":{"$error":"#REF!"}}]
[{"$f":"IF(D39>0,\"F\",\"\")","v":{"$error":"#REF!"}},"ALVENARIA E DIVISÓRIAS",null,{"$f":"Orçamento!#REF!","v":{"$error":"#REF!"}},{"$f":"Orçamento!#REF!","v":{"$error":"#REF!"}},{"$f":"ROUND(F41*$D$39,2)","v":{"$error":"#REF!"}},null,null,null,{"$f":"ROUND(J41*$D$39,2)","v":{"$error":"#REF!"}},null,null,null,{"$f":"SUM(F39:M39)","v":{"$error":"#REF!"}},null,{"$f":"IF(D39=N39,\"OK\",\"ERRO\")","v":{"$error":"#REF!"}}]
[{"$f":"IF(A39=\"F\",A39,\"\")","v":{"$error":"#REF!"}}]
[{"$f":"IF(A40=\"F\",A40,\"\")","v":{"$error":"#REF!"}},null,null,null,null,1,null,null,null,{"$f":"1-F41","v":0},null,null,null,{"$f":"IFERROR(E39/100,\"\")","v":""},null,{"$f":"IF(E39=N41*100,\"OK\",\"ERRO\")","v":{"$error":"#REF!"}}]
[{"$f":"IF(D42>0,\"F\",\"\")","v":{"$error":"#REF!"}},"ALVENARIA AUTO-PORTANTE",null,{"$f":"Orçamento!#REF!","v":{"$error":"#REF!"}},{"$f":"Orçamento!#REF!","v":{"$error":"#REF!"}},{"$f":"ROUND(F44*$D$42,2)","v":{"$error":"#REF!"}},null,null,null,{"$f":"ROUND(J44*$D$42,2)","v":{"$error":"#REF!"}},null,null,null,{"$f":"SUM(F42:M42)","v":{"$error":"#REF!"}},null,{"$f":"IF(D42=N42,\"OK\",\"ERRO\")","v":{"$error":"#REF!"}}]
[{"$f":"IF(A42=\"F\",A42,\"\")","v":{"$error":"#REF!"}}]
[{"$f":"IF(A43=\"F\",A43,\"\")","v":{"$error":"#REF!"}},null,null,null,null,1,null,null,null,{"$f":"1-F44","v":0},null,null,null,{"$f":"IFERROR(E42/100,\"\")","v":""},null,{"$f":"IF(E42=N44*100,\"OK\",\"ERRO\")","v":{"$error":"#REF!"}}]
[{"$f":"IF(D45>0,\"F\",\"\")","v":{"$error":"#REF!"}},"IMPERMEABILIZAÇÃO",null,{"$f":"Orçamento!#REF!","v":{"$error":"#REF!"}},{"$f":"Orçamento!#REF!","v":{"$error":"#REF!"}},{"$f":"ROUND(F47*$D$45,2)","v":{"$error":"#REF!"}},null,null,null,{"$f":"ROUND(J47*$D$45,2)","v":{"$error":"#REF!"}},null,null,null,{"$f":"SUM(F45:M45)","v":{"$error":"#REF!"}},null,{"$f":"IF(#REF!=N45,\"OK\",\"ERRO\")","v":{"$error":"#REF!"}}]
[{"$f":"IF(A45=\"F\",A45,\"\")","v":{"$error":"#REF!"}}]
[{"$f":"IF(A46=\"F\",A46,\"\")","v":{"$error":"#REF!"}},null,null,null,null,1,null,null,null,{"$f":"1-F47","v":0},null,null,null,{"$f":"IFERROR(E45/100,\"\")","v":""},null,{"$f":"IF(A45=N47*100,\"OK\",\"ERRO\")","v":{"$error":"#REF!"}}]
[{"$f":"IF(D48>0,\"F\",\"\")","v":{"$error":"#REF!"}},"ISOLAMENTO TÉRMICO E ACÚSTICO",null,{"$f":"Orçamento!#REF!","v":{"$error":"#REF!"}},{"$f":"Orçamento!#REF!","v":{"$error":"#REF!"}},{"$f":"ROUND(F50*$D$48,2)","v":{"$error":"#REF!"}},null,null,null,{"$f":"ROUND(J50*$D$48,2)","v":{"$error":"#REF!"}},null,null,null,{"$f":"SUM(F48:M48)","v":{"$error":"#REF!"}},null,{"$f":"IF(#REF!=N48,\"OK\",\"ERRO\")","v":{"$error":"#REF!"}}]
[{"$f":"IF(A48=\"F\",A48,\"\")","v":{"$error":"#REF!"}}]
[{"$f":"IF(A49=\"F\",A49,\"\")","v":{"$error":"#REF!"}},null,null,null,null,0.5,null,null,null,{"$f":"1-F50","v":0.5},null,null,null,{"$f":"IFERROR(E48/100,\"\")","v":""},null,{"$f":"IF(A48=N50*100,\"OK\",\"ERRO\")","v":{"$error":"#REF!"}}]
[{"$f":"IF(D51>0,\"F\",\"\")","v":{"$error":"#REF!"}},"ESTRUTURA DE MADEIRA",null,{"$f":"Orçamento!#REF!","v":{"$error":"#REF!"}},{"$f":"Orçamento!#REF!","v":{"$error":"#REF!"}},{"$f":"ROUND(F53*$D$51,2)","v":{"$error":"#REF!"}},null,null,null,{"$f":"ROUND(J53*$D$51,2)","v":{"$error":"#REF!"}},null,null,null,{"$f":"SUM(F51:M51)","v":{"$error":"#REF!"}},null,{"$f":"IF(#REF!=N51,\"OK\",\"ERRO\")","v":{"$error":"#REF!"}}]
[{"$f":"IF(A51=\"F\",A51,\"\")","v":{"$error":"#REF!"}}]
[{"$f":"IF(A52=\"F\",A52,\"\")","v":{"$error":"#REF!"}},null,null,null,null,0.4,null,null,null,{"$f":"1-F53","v":0.6},null,null,null,{"$f":"IFERROR(E51/100,\"\")","v":""},null,{"$f":"IF(A51=N53*100,\"OK\",\"ERRO\")","v":{"$error":"#REF!"}}]
[{"$f":"IF(D54>0,\"F\",\"\")","v":{"$error":"#REF!"}},"ESTRUTURA METÁLICA",null,{"$f":"Orçamento!#REF!","v":{"$error":"#REF!"}},{"$f":"Orçamento!#REF!","v":{"$error":"#REF!"}},{"$f":"ROUND(F56*$D$54,2)","v":{"$error":"#REF!"}},null,null,null,{"$f":"ROUND(J56*$D$54,2)","v":{"$error":"#REF!"}},null,null,null,{"$f":"SUM(F54:M54)","v":{"$error":"#REF!"}},null,{"$f":"IF(#REF!=N54,\"OK\",\"ERRO\")","v":{"$error":"#REF!"}}]
[{"$f":"IF(A54=\"F\",A54,\"\")","v":{"$error":"#REF!"}}]
[{"$f":"IF(A55=\"F\",A55,\"\")","v":{"$error":"#REF!"}},null,null,null,null,0.35,null,null,null,{"$f":"1-F56","v":0.65},null,null,null,{"$f":"IFERROR(E54/100,\"\")","v":""},null,{"$f":"IF(A54=N56*100,\"OK\",\"ERRO\")","v":{"$error":"#REF!"}}]
[{"$f":"IF(D57>0,\"F\",\"\")","v":{"$error":"#REF!"}},"COBERTURAS",null,{"$f":"Orçamento!#REF!","v":{"$error":"#REF!"}},{"$f":"Orçamento!#REF!","v":{"$error":"#REF!"}},{"$f":"ROUND(F59*$D$57,2)","v":{"$error":"#REF!"}},null,null,null,{"$f":"ROUND(J59*$D$57,2)","v":{"$error":"#REF!"}},null,null,null,{"$f":"SUM(F57:M57)","v":{"$error":"#REF!"}},null,{"$f":"IF(D57=N57,\"OK\",\"ERRO\")","v":{"$error":"#REF!"}}]
[{"$f":"IF(A57=\"F\",A57,\"\")","v":{"$error":"#REF!"}}]
[{"$f":"IF(A58=\"F\",A58,\"\")","v":{"$error":"#REF!"}},null,null,null,null,0,null,null,null,{"$f":"1-F59","v":1},null,null,null,{"$f":"IFERROR(E57/100,\"\")","v":""},null,{"$f":"IF(E57=N59*100,\"OK\",\"ERRO\")","v":{"$error":"#REF!"}}]
[{"$f":"IF(D60>0,\"F\",\"\")","v":{"$error":"#REF!"}},"ESQUADRIAS DE MADEIRA",null,{"$f":"Orçamento!#REF!","v":{"$error":"#REF!"}},{"$f":"Orçamento!#REF!","v":{"$error":"#REF!"}},{"$f":"ROUND(F62*$D$60,2)","v":{"$error":"#REF!"}},null,null,null,{"$f":"ROUND(J62*$D$60,2)","v":{"$error":"#REF!"}},null,null,null,{"$f":"SUM(F60:M60)","v":{"$error":"#REF!"}},null,{"$f":"IF(D60=N60,\"OK\",\"ERRO\")","v":{"$error":"#REF!"}}]
[{"$f":"IF(A60=\"F\",A60,\"\")","v":{"$error":"#REF!"}}]
[{"$f":"IF(A61=\"F\",A61,\"\")","v":{"$error":"#REF!"}},null,null,null,null,0.54,null,null,null,{"$f":"1-F62","v":0.45999999999999996},null,null,null,{"$f":"IFERROR(E60/100,\"\")","v":""},null,{"$f":"IF(E60=N62*100,\"OK\",\"ERRO\")","v":{"$error":"#REF!"}}]
[{"$f":"IF(D63>0,\"F\",\"\")","v":{"$error":"#REF!"}},"ESQUADRIAS METÁLICAS",null,{"$f":"Orçamento!#REF!","v":{"$error":"#REF!"}},{"$f":"Orçamento!#REF!","v":{"$error":"#REF!"}},{"$f":"ROUND(F65*$D$63,2)","v":{"$error":"#REF!"}},null,null,null,{"$f":"ROUND(J65*$D$63,2)","v":{"$error":"#REF!"}},null,null,null,{"$f":"SUM(F63:M63)","v":{"$error":"#REF!"}},null,{"$f":"IF(D63=N63,\"OK\",\"ERRO\")","v":{"$error":"#REF!"}}]
[{"$f":"IF(A63=\"F\",A63,\"\")","v":{"$error":"#REF!"}}]
[{"$f":"IF(A64=\"F\",A64,\"\")","v":{"$error":"#REF!"}},null,null,null,null,0.49,null,null,null,{"$f":"1-F65","v":0.51},null,null,null,{"$f":"IFERROR(E63/100,\"\")","v":""},null,{"$f":"IF(E63=N65*100,\"OK\",\"ERRO\")","v":{"$error":"#REF!"}}]
[{"$f":"IF(D66>0,\"F\",\"\")","v":{"$error":"#REF!"}},"VIDROS",null,{"$f":"Orçamento!#REF!","v":{"$error":"#REF!"}},{"$f":"Orçamento!#REF!","v":{"$error":"#REF!"}},{"$f":"ROUND(F68*$D$66,2)","v":{"$error":"#REF!"}},null,null,null,{"$f":"ROUND(J68*$D$66,2)","v":{"$error":"#REF!"}},null,null,null,{"$f":"SUM(F66:M66)","v":{"$error":"#REF!"}},null,{"$f":"IF(D66=N66,\"OK\",\"ERRO\")","v":{"$error":"#REF!"}}]
[{"$f":"IF(A66=\"F\",A66,\"\")","v":{"$error":"#REF!"}}]
[{"$f":"IF(A67=\"F\",A67,\"\")","v":{"$error":"#REF!"}},null,null,null,null,0,null,null,null,{"$f":"1-F68","v":1},null,null,null,{"$f":"IFERROR(E66/100,\"\")","v":""},null,{"$f":"IF(E66=N68*100,\"OK\",\"ERRO\")","v":{"$error":"#REF!"}}]
[{"$f":"IF(D69>0,\"F\",\"\")","v":{"$error":"#REF!"}},"REVESTIMENTO DE PAREDE",null,{"$f":"Orçamento!#REF!","v":{"$error":"#REF!"}},{"$f":"Orçamento!#REF!","v":{"$error":"#REF!"}},{"$f":"ROUND(F71*$D$69,2)","v":{"$error":"#REF!"}},null,null,null,{"$f":"ROUND(J71*$D$69,2)","v":{"$error":"#REF!"}},null,null,null,{"$f":"SUM(F69:M69)","v":{"$error":"#REF!"}},null,{"$f":"IF(D69=N69,\"OK\",\"ERRO\")","v":{"$error":"#REF!"}}]
[{"$f":"IF(A69=\"F\",A69,\"\")","v":{"$error":"#REF!"}}]
[{"$f":"IF(A70=\"F\",A70,\"\")","v":{"$error":"#REF!"}},null,null,null,null,0.32,null,null,null,{"$f":"1-F71","v":0.67999999999999994},null,null,null,{"$f":"IFERROR(E69/100,\"\")","v":""},null,{"$f":"IF(E69=N71*100,\"OK\",\"ERRO\")","v":{"$error":"#REF!"}}]
[{"$f":"IF(D72>0,\"F\",\"\")","v":{"$error":"#REF!"}},"FORROS",null,{"$f":"Orçamento!#REF!","v":{"$error":"#REF!"}},{"$f":"Orçamento!#REF!","v":{"$error":"#REF!"}},{"$f":"ROUND(F74*$D$72,2)","v":{"$error":"#REF!"}},null,null,null,{"$f":"ROUND(J74*$D$72,2)","v":{"$error":"#REF!"}},null,null,null,{"$f":"SUM(F72:M72)","v":{"$error":"#REF!"}},null,{"$f":"IF(D72=N72,\"OK\",\"ERRO\")","v":{"$error":"#REF!"}}]
[{"$f":"IF(A72=\"F\",A72,\"\")","v":{"$error":"#REF!"}}]
[{"$f":"IF(A73=\"F\",A73,\"\")","v":{"$error":"#REF!"}},null,null,null,null,0.24,null,null,null,{"$f":"1-F74","v":0.76},null,null,null,{"$f":"IFERROR(E72/100,\"\")","v":""},null,{"$f":"IF(E72=N74*100,\"OK\",\"ERRO\")","v":{"$error":"#REF!"}}]
[{"$f":"IF(D75>0,\"F\",\"\")","v":{"$error":"#REF!"}},"REVESTIMENTO DE PISO",null,{"$f":"Orçamento!#REF!","v":{"$error":"#REF!"}},{"$f":"Orçamento!#REF!","v":{"$error":"#REF!"}},{"$f":"ROUND(F77*$D$75,2)","v":{"$error":"#REF!"}},null,null,null,{"$f":"ROUND(J77*$D$75,2)","v":{"$error":"#REF!"}},null,null,null,{"$f":"SUM(F75:M75)","v":{"$error":"#REF!"}},null,{"$f":"IF(D75=N75,\"OK\",\"ERRO\")","v":{"$error":"#REF!"}}]
[{"$f":"IF(A75=\"F\",A75,\"\")","v":{"$error":"#REF!"}}]
[{"$f":"IF(A76=\"F\",A76,\"\")","v":{"$error":"#REF!"}},null,null,null,null,0.49,null,null,null,{"$f":"1-F77","v":0.51},null,null,null,{"$f":"IFERROR(E75/100,\"\")","v":""},null,{"$f":"IF(E75=N77*100,\"OK\",\"ERRO\")","v":{"$error":"#REF!"}}]
[{"$f":"IF(D78>0,\"F\",\"\")","v":{"$error":"#REF!"}},"FERRAGENS",null,{"$f":"Orçamento!#REF!","v":{"$error":"#REF!"}},{"$f":"Orçamento!#REF!","v":{"$error":"#REF!"}},{"$f":"ROUND(F80*$D$78,2)","v":{"$error":"#REF!"}},null,null,null,{"$f":"ROUND(J80*$D$78,2)","v":{"$error":"#REF!"}},null,null,null,{"$f":"SUM(F78:M78)","v":{"$error":"#REF!"}},null,{"$f":"IF(D78=N78,\"OK\",\"ERRO\")","v":{"$error":"#REF!"}}]
[{"$f":"IF(A78=\"F\",A78,\"\")","v":{"$error":"#REF!"}}]
[{"$f":"IF(A79=\"F\",A79,\"\")","v":{"$error":"#REF!"}},null,null,null,null,0,null,null,null,{"$f":"1-F80","v":1},null,null,null,{"$f":"IFERROR(E78/100,\"\")","v":""},null,{"$f":"IF(E78=N80*100,\"OK\",\"ERRO\")","v":{"$error":"#REF!"}}]
[{"$f":"IF(D81>0,\"F\",\"\")","v":{"$error":"#REF!"}},"MARCENARIA",null,{"$f":"Orçamento!#REF!","v":{"$error":"#REF!"}},{"$f":"Orçamento!#REF!","v":{"$error":"#REF!"}},{"$f":"ROUND(F83*$D$81,2)","v":{"$error":"#REF!"}},null,null,null,{"$f":"ROUND(J83*$D$81,2)","v":{"$error":"#REF!"}},null,null,null,{"$f":"SUM(F81:M81)","v":{"$error":"#REF!"}},null,{"$f":"IF(D81=N81,\"OK\",\"ERRO\")","v":{"$error":"#REF!"}}]
[{"$f":"IF(A81=\"F\",A81,\"\")","v":{"$error":"#REF!"}}]
[{"$f":"IF(A82=\"F\",A82,\"\")","v":{"$error":"#REF!"}},null,null,null,null,0.4,null,null,null,{"$f":"1-F83","v":0.6},null,null,null,{"$f":"IFERROR(E81/100,\"\")","v":""},null,{"$f":"IF(E81=N83*100,\"OK\",\"ERRO\")","v":{"$error":"#REF!"}}]
[{"$f":"IF(D84>0,\"F\",\"\")","v":{"$error":"#REF!"}},"ADMINISTRAÇÃO - MENSALISTAS",null,{"$f":"Orçamento!#REF!","v":{"$error":"#REF!"}},{"$f":"Orçamento!#REF!","v":{"$error":"#REF!"}},{"$f":"ROUND(F86*$D$84,2)","v":{"$error":"#REF!"}},null,null,null,{"$f":"ROUND(J86*$D$84,2)","v":{"$error":"#REF!"}},null,null,null,{"$f":"SUM(F84:M84)","v":{"$error":"#REF!"}},null,{"$f":"IF(D84=N84,\"OK\",\"ERRO\")","v":{"$error":"#REF!"}}]
[{"$f":"IF(A84=\"F\",A84,\"\")","v":{"$error":"#REF!"}}]
[{"$f":"IF(A85=\"F\",A85,\"\")","v":{"$error":"#REF!"}},null,null,null,null,0.49,null,null,null,{"$f":"1-F86","v":0.51},null,null,null,{"$f":"IFERROR(E84/100,\"\")","v":""},null,{"$f":"IF(E84=N86*100,\"OK\",\"ERRO\")","v":{"$error":"#REF!"}}]
[{"$f":"IF(D87>0,\"F\",\"\")","v":{"$error":"#REF!"}},"PINTURA",null,{"$f":"Orçamento!#REF!","v":{"$error":"#REF!"}},{"$f":"Orçamento!#REF!","v":{"$error":"#REF!"}},{"$f":"ROUND(F89*$D$87,2)","v":{"$error":"#REF!"}},null,null,null,{"$f":"ROUND(J89*$D$87,2)","v":{"$error":"#REF!"}},null,null,null,{"$f":"SUM(F87:M87)","v":{"$error":"#REF!"}},null,{"$f":"IF(D87=N87,\"OK\",\"ERRO\")","v":{"$error":"#REF!"}}]
[{"$f":"IF(A87=\"F\",A87,\"\")","v":{"$error":"#REF!"}}]
[{"$f":"IF(A88=\"F\",A88,\"\")","v":{"$error":"#REF!"}},null,null,null,null,0,null,null,null,{"$f":"1-F89","v":1},null,null,null,{"$f":"IFERROR(E87/100,\"\")","v":""},null,{"$f":"IF(E87=N89*100,\"OK\",\"ERRO\")","v":{"$error":"#REF!"}}]
[{"$f":"IF(D90>0,\"F\",\"\")","v":{"$error":"#REF!"}},"DIVERSOS",null,{"$f":"Orçamento!#REF!","v":{"$error":"#REF!"}},{"$f":"Orçamento!#REF!","v":{"$error":"#REF!"}},{"$f":"ROUND(F92*$D$90,2)","v":{"$error":"#REF!"}},null,null,null,{"$f":"ROUND(J92*$D$90,2)","v":{"$error":"#REF!"}},null,null,null,{"$f":"SUM(F90:M90)","v":{"$error":"#REF!"}},null,{"$f":"IF(D90=N90,\"OK\",\"ERRO\")","v":{"$error":"#REF!"}}]
[{"$f":"IF(A90=\"F\",A90,\"\")","v":{"$error":"#REF!"}}]
[{"$f":"IF(A91=\"F\",A91,\"\")","v":{"$error":"#REF!"}},null,null,null,null,0.46,null,null,null,{"$f":"1-F92","v":0.54},null,null,null,{"$f":"IFERROR(E90/100,\"\")","v":""},null,{"$f":"IF(E90=N92*100,\"OK\",\"ERRO\")","v":{"$error":"#REF!"}}]
["F","CUSTO DO ORÇAMENTO",null,{"$f":"SUM(D15:D92)","v":{"$error":"#REF!"}},{"$f":"SUM(E15:E92)","v":{"$error":"#REF!"}},{"$f":"F15+F18+F21+F24+F27+F30+F33+F36+F39+F42+F45+F48+F51+F54+F57+F60+F63+F66+F69+F72+F75+F78+F81+F84+F87+F90","v":{"$error":"#REF!"}},null,null,null,{"$f":"J15+J18+J21+J24+J27+J30+J33+J36+J39+J42+J45+J48+J51+J54+J57+J60+J63+J66+J69+J72+J75+J78+J81+J84+J87+J90","v":{"$error":"#REF!"}},null,null,null,{"$f":"N15+N18+N21+N24+N27+N30+N33+N36+N39+N42+N45+N48+N51+N54+N57+N60+N63+N66+N69+N72+N75+N78+N81+N84+N87+N90","v":{"$error":"#REF!"}},null,{"$f":"IF(D93=N93,\"OK\",\"ERRO\")","v":{"$error":"#REF!"}}]
["F","PERCENTUAIS:",null,null,null,{"$f":"IFERROR(F93/D93,\"\")","v":""},null,null,null,{"$f":"IFERROR(J93/D93,\"\")","v":""},null,null,null,{"$f":"SUM(F94:M94)","v":0}]
["F","TOTAIS ACUMULADOS:",null,null,null,{"$f":"F93","v":{"$error":"#REF!"}},null,null,null,{"$f":"F95+J93","v":{"$error":"#REF!"}}]
["F","PERCENTUAIS  ACUMULADOS:",null,null,null,{"$f":"F94","v":""},null,null,null,{"$f":"IFERROR(F96+J94,\"\")","v":""},null,null,null,null,null,null,{"$f":"3658+6342","v":10000}]
["F"]
["F","OBSERVAÇÕES:"]
["F","Os pagamentos somente poderão ser efetuados mediante medição e atesto pelos técnicos da Secretaria da Educação. "]

{"sheet":"Composição BDI","index":4,"n_rows":45,"n_cols":4,"rows_kept":45,"cut":false,"hidden":false,"merged":[[12,0,12,3],[13,0,13,3],[14,0,14,3],[15,0,15,3],[6,0,6,3],[8,0,8,3],[7,0,7,3],[9,0,9,3],[11,0,11,3],[10,0,10,3],[0,0,0,3],[2,0,2,3],[3,0,3,3],[1,0,1,3],[5,0,5,3],[4,0,4,3],[17,0,17,3],[16,0,16,3],[44,0,44,3],[42,0,42,3],[43,0,43,3],[18,0,18,3],[36,0,36,3],[39,0,39,3],[38,0,38,3],[40,0,40,3],[29,0,29,2],[32,0,32,3],[33,0,33,3],[34,0,34,3],[35,0,35,3]]}
[]
[]
["UNIDADE ESCOLAR"]
[{"$f":"Orçamento!$O$4","v":"CRE DE IPORÁ"}]
[]
["OBRA"]
[{"$f":"Orçamento!$O$7","v":"REFORMA E AMPLIAÇÃO"}]
[]
["ENDEREÇO"]
[{"$f":"Orçamento!$R$10","v":"Rua D - Vila Padre Cícero - S/N - CEP:76.200-000"}]
[]
["CIDADE"]
[{"$f":"Orçamento!$X$7","v":"IPORÁ"}]
[]
["CRE"]
[{"$f":"Orçamento!$O$10","v":"CRE DE IPORÁ"}]
[]
["DETALHAMENTO DA COMPOSIÇÃO DE BDI"]
["COMPOSIÇÃO BDI PARA OBRAS CIVIS"]
["DESCRIÇÃO","COEF.","TAXA % (a.m)","% no preço de venda"]
["1) COFINS",1,0.03,{"$f":"C21","v":0.03}]
["2) PIS",1,6.4999999999999997E-3,{"$f":"C22","v":6.4999999999999997E-3}]
["3) ISSQN",1,{"$f":"IFERROR(VLOOKUP($A$13,#REF!,10,FALSE())/100,0)","v":0},{"$f":"C23*B23","v":0}]
["4) CPRB",1,{"$f":"IF(Orçamento!$T$10=\"DESONERADA\",4.5%,0)","v":4.4999999999999998E-2},{"$f":"C24","v":4.4999999999999998E-2}]
["5) Administração Central",1,0.04,0.04]
["6) Despesas Financeiras",1,5.5999999999999999E-3,5.5999999999999999E-3]
["7) Seguros + Garantias",1,1.1999999999999999E-3,1.1999999999999999E-3]
["8) Risco",1,9.7000000000000003E-3,9.7000000000000003E-3]
["9) Lucro",1,6.88E-2,6.88E-2]
["BDI - FINAL",null,null,{"$f":"(((1+D25+D27+D28)*(1+D26)*(1+D29))/(1-(D21+D22+D23+D24))-1)","v":0.22971350109090927}]
[]
["Notas:"]
["(1) e (2) Alíquota definida por lei."]
["(3) Alíquota e base de cálculo definidas pela legislação municipal."]
["(4) Alíquota definida pelas leis 12.546/11, 12844/13 e 13.161/15 (CPRB – contribuição previdenciária sobre a receita bruta)."]
["(5) Valores definidos a partir dos limites no Acórdão nº 2.622/2013 - TCU – Plenário. Valores entre o 1º e 3º quartis."]
["(6) Valor calculado pela expressão matemática do acórdão 2.369/2011 – TCU – Plenário e disponibilizado pela AGETOP em dezembro de 2018. (Foi utilizado para o cálculo a média da Taxa SELIC no período de 11/2017 a 10/2018)"]
[]
["(7) Valores definidos pela AGETOP a partir dos limites no Acórdão nº 2.622/2013 - TCU – Plenário. Valores médios. \n\nObservação da AGETOP: (Seguros contra erros de execução, incêndio e explosão, danos da natureza (vendaval, destelhamento, alagamento, inundação, desmoronamento, geadas etc.), emprego de material defeituoso ou inadequado, roubo e/ou furto qualificado, quebra de equipamentos, desmoronamento de estrutura, nas modalidades de Obras Civis em Construção (OCC); Instalação e Montagem (IM); e Obras Civis em Construção e Instalação e Montagem (OCC/IM). Bem como coberturas adicionais para ampliação dessas coberturas básicas, como: cobertura de responsabilidade civil geral, cobertura de responsabilidade civil cruzada, cobertura de despesas extraordinárias, cobertura de tumultos, cobertura de desentulho do local, cobertura de riscos do fabricante, dentre outras, incluindo o seguro de vida em grupo regido pela convenção coletiva dos trabalhadores na indústria da construção civil). A partir de 24/02/2015 por intermédio da Portaria 449/2015 a Presidência da AGETOP, na pessoa do Senhor Jayme Eduardo Rincon, determinou a exclusão dos valores referentes aos Seguros de Risco de Engenharia e Responsabilidade Civil do Profissional na composição do cálculo do B.D.I.."]
["(8) Valores definidos a partir dos limites no Acórdão nº 2.622/2013 - TCU – Plenário. Valores entre 1º e 3° quartis."]
["(9) Valores definidos a partir dos limites definidos no Acórdão nº 2.622/2013 - TCU – Plenário. Valores adotados e praticados no mercado ( “ ex ante ” ) ou aqueles entre os 1º e 3º quartis."]
[]
["(*) A fórmula para estipulação da taxa de BDI estimado adotado é a mesma que foi aplicada para a obtenção das tabelas contidas no Acórdão n. 2.622/2013 – TCUPlenário"]
[]
["Obs.: Para obras com valores superiores a R$ 20.000.000,00 sugere-se recalcular o BDI, dimensionando as taxas de administração central e lucro para patamares inferiores ao estipulado acima."]

{"sheet":"Relatório CENTRAL","index":5,"n_rows":40,"n_cols":5,"rows_kept":40,"cut":false,"hidden":false,"merged":[[8,3,8,4],[9,1,9,2],[10,1,10,4],[11,1,11,4],[39,1,39,2],[9,0,11,0],[0,1,0,4],[6,3,6,4],[9,3,9,4],[1,1,1,4],[2,1,2,2],[2,3,2,4],[3,1,3,2],[3,3,3,4],[4,1,4,4],[5,1,5,2],[5,3,5,4],[6,1,6,2],[7,1,7,4],[8,1,8,2]]}
[]
[]
[null,"UNIDADE ESCOLAR",null,"CIDADE"]
[null,{"$f":"Orçamento!$O$4","v":"CRE DE IPORÁ"},null,{"$f":"Orçamento!$X$7","v":"IPORÁ"}]
[]
[null,"OBRA",null,"CRE"]
[null,{"$f":"Orçamento!$O$7","v":"REFORMA E AMPLIAÇÃO"},null,{"$f":"Orçamento!$O$10","v":"CRE DE IPORÁ"}]
[]
[null,"ENDEREÇO",null,"DATA"]
["FILTRO",{"$f":"Orçamento!$R$10","v":"Rua D - Vila Padre Cícero - S/N - CEP:76.200-000"},null,{"$f":"Orçamento!$S$7","v":"2020-06-10"}]
[]
[null,"RELATÓRIO CENTRAL"]
["↓","CÓDIGO","ETAPA","PREÇO  (R$) C/ BDI","PARTIC  ( % )"]
[{"$f":"IF(D14>0,\"F\",\"\")","v":{"$error":"#REF!"}},{"$f":"Orçamento!#REF!","v":{"$error":"#REF!"}},{"$f":"Orçamento!#REF!","v":{"$error":"#REF!"}},{"$f":"Orçamento!#REF!","v":{"$error":"#REF!"}},{"$f":"Orçamento!#REF!","v":{"$error":"#REF!"}}]
[{"$f":"IF(D15>0,\"F\",\"\")","v":{"$error":"#REF!"}},{"$f":"Orçamento!#REF!","v":{"$error":"#REF!"}},{"$f":"Orçamento!#REF!","v":{"$error":"#REF!"}},{"$f":"Orçamento!#REF!","v":{"$error":"#REF!"}},{"$f":"Orçamento!#REF!","v":{"$error":"#REF!"}}]
[{"$error":"#REF!"},{"$f":"Orçamento!#REF!","v":{"$error":"#REF!"}},{"$f":"Orçamento!#REF!","v":{"$error":"#REF!"}},{"$f":"Orçamento!#REF!","v":{"$error":"#REF!"}},{"$f":"Orçamento!#REF!","v":{"$error":"#REF!"}}]
[{"$error":"#REF!"},{"$f":"Orçamento!#REF!","v":{"$error":"#REF!"}},{"$f":"Orçamento!#REF!","v":{"$error":"#REF!"}},{"$f":"Orçamento!#REF!","v":{"$error":"#REF!"}},{"$f":"Orçamento!#REF!","v":{"$error":"#REF!"}}]
[{"$error":"#REF!"},{"$f":"Orçamento!#REF!","v":{"$error":"#REF!"}},{"$f":"Orçamento!#REF!","v":{"$error":"#REF!"}},{"$f":"Orçamento!#REF!","v":{"$error":"#REF!"}},{"$f":"Orçamento!#REF!","v":{"$error":"#REF!"}}]
[{"$error":"#REF!"},{"$f":"Orçamento!#REF!","v":{"$error":"#REF!"}},{"$f":"Orçamento!#REF!","v":{"$error":"#REF!"}},{"$f":"Orçamento!#REF!","v":{"$error":"#REF!"}},{"$f":"Orçamento!#REF!","v":{"$error":"#REF!"}}]
[{"$error":"#REF!"},{"$f":"Orçamento!#REF!","v":{"$error":"#REF!"}},{"$f":"Orçamento!#REF!","v":{"$error":"#REF!"}},{"$f":"Orçamento!#REF!","v":{"$error":"#REF!"}},{"$f":"Orçamento!#REF!","v":{"$error":"#REF!"}}]
[{"$error":"#REF!"},{"$f":"Orçamento!#REF!","v":{"$error":"#REF!"}},{"$f":"Orçamento!#REF!","v":{"$error":"#REF!"}},{"$f":"Orçamento!#REF!","v":{"$error":"#REF!"}},{"$f":"Orçamento!#REF!","v":{"$error":"#REF!"}}]
[{"$error":"#REF!"},{"$f":"Orçamento!#REF!","v":{"$error":"#REF!"}},{"$f":"Orçamento!#REF!","v":{"$error":"#REF!"}},{"$f":"Orçamento!#REF!","v":{"$error":"#REF!"}},{"$f":"Orçamento!#REF!","v":{"$error":"#REF!"}}]
[{"$error":"#REF!"},{"$f":"Orçamento!#REF!","v":{"$error":"#REF!"}},{"$f":"Orçamento!#REF!","v":{"$error":"#REF!"}},{"$f":"Orçamento!#REF!","v":{"$error":"#REF!"}},{"$f":"Orçamento!#REF!","v":{"$error":"#REF!"}}]
[{"$error":"#REF!"},{"$f":"Orçamento!#REF!","v":{"$error":"#REF!"}},{"$f":"Orçamento!#REF!","v":{"$error":"#REF!"}},{"$f":"Orçamento!#REF!","v":{"$error":"#REF!"}},{"$f":"Orçamento!#REF!","v":{"$error":"#REF!"}}]
[{"$error":"#REF!"},{"$f":"Orçamento!#REF!","v":{"$error":"#REF!"}},{"$f":"Orçamento!#REF!","v":{"$error":"#REF!"}},{"$f":"Orçamento!#REF!","v":{"$error":"#REF!"}},{"$f":"Orçamento!#REF!","v":{"$error":"#REF!"}}]
[{"$error":"#REF!"},{"$f":"Orçamento!#REF!","v":{"$error":"#REF!"}},{"$f":"Orçamento!#REF!","v":{"$error":"#REF!"}},{"$f":"Orçamento!#REF!","v":{"$error":"#REF!"}},{"$f":"Orçamento!#REF!","v":{"$error":"#REF!"}}]
[{"$error":"#REF!"},{"$f":"Orçamento!#REF!","v":{"$error":"#REF!"}},{"$f":"Orçamento!#REF!","v":{"$error":"#REF!"}},{"$f":"Orçamento!#REF!","v":{"$error":"#REF!"}},{"$f":"Orçamento!#REF!","v":{"$error":"#REF!"}}]
[{"$error":"#REF!"},{"$f":"Orçamento!#REF!","v":{"$error":"#REF!"}},{"$f":"Orçamento!#REF!","v":{"$error":"#REF!"}},{"$f":"Orçamento!#REF!","v":{"$error":"#REF!"}},{"$f":"Orçamento!#REF!","v":{"$error":"#REF!"}}]
[{"$error":"#REF!"},{"$f":"Orçamento!#REF!","v":{"$error":"#REF!"}},{"$f":"Orçamento!#REF!","v":{"$error":"#REF!"}},{"$f":"Orçamento!#REF!","v":{"$error":"#REF!"}},{"$f":"Orçamento!#REF!","v":{"$error":"#REF!"}}]
[{"$error":"#REF!"},{"$f":"Orçamento!#REF!","v":{"$error":"#REF!"}},{"$f":"Orçamento!#REF!","v":{"$error":"#REF!"}},{"$f":"Orçamento!#REF!","v":{"$error":"#REF!"}},{"$f":"Orçamento!#REF!","v":{"$error":"#REF!"}}]
[{"$error":"#REF!"},{"$f":"Orçamento!#REF!","v":{"$error":"#REF!"}},{"$f":"Orçamento!#REF!","v":{"$error":"#REF!"}},{"$f":"Orçamento!#REF!","v":{"$error":"#REF!"}},{"$f":"Orçamento!#REF!","v":{"$error":"#REF!"}}]
[{"$error":"#REF!"},{"$f":"Orçamento!#REF!","v":{"$error":"#REF!"}},{"$f":"Orçamento!#REF!","v":{"$error":"#REF!"}},{"$f":"Orçamento!#REF!","v":{"$error":"#REF!"}},{"$f":"Orçamento!#REF!","v":{"$error":"#REF!"}}]
[{"$error":"#REF!"},{"$f":"Orçamento!#REF!","v":{"$error":"#REF!"}},{"$f":"Orçamento!#REF!","v":{"$error":"#REF!"}},{"$f":"Orçamento!#REF!","v":{"$error":"#REF!"}},{"$f":"Orçamento!#REF!","v":{"$error":"#REF!"}}]
[{"$error":"#REF!"},{"$f":"Orçamento!#REF!","v":{"$error":"#REF!"}},{"$f":"Orçamento!#REF!","v":{"$error":"#REF!"}},{"$f":"Orçamento!#REF!","v":{"$error":"#REF!"}},{"$f":"Orçamento!#REF!","v":{"$error":"#REF!"}}]
[{"$error":"#REF!"},{"$f":"Orçamento!#REF!","v":{"$error":"#REF!"}},{"$f":"Orçamento!#REF!","v":{"$error":"#REF!"}},{"$f":"Orçamento!#REF!","v":{"$error":"#REF!"}},{"$f":"Orçamento!#REF!","v":{"$error":"#REF!"}}]
[{"$error":"#REF!"},{"$f":"Orçamento!#REF!","v":{"$error":"#REF!"}},{"$f":"Orçamento!#REF!","v":{"$error":"#REF!"}},{"$f":"Orçamento!#REF!","v":{"$error":"#REF!"}},{"$f":"Orçamento!#REF!","v":{"$error":"#REF!"}}]
[{"$error":"#REF!"},{"$f":"Orçamento!#REF!","v":{"$error":"#REF!"}},{"$f":"Orçamento!#REF!","v":{"$error":"#REF!"}},{"$f":"Orçamento!#REF!","v":{"$error":"#REF!"}},{"$f":"Orçamento!#REF!","v":{"$error":"#REF!"}}]
[{"$error":"#REF!"},{"$f":"Orçamento!#REF!","v":{"$error":"#REF!"}},{"$f":"Orçamento!#REF!","v":{"$error":"#REF!"}},{"$f":"Orçamento!#REF!","v":{"$error":"#REF!"}},{"$f":"Orçamento!#REF!","v":{"$error":"#REF!"}}]
[{"$error":"#REF!"},{"$f":"Orçamento!#REF!","v":{"$error":"#REF!"}},{"$f":"Orçamento!#REF!","v":{"$error":"#REF!"}},{"$f":"Orçamento!#REF!","v":{"$error":"#REF!"}},{"$f":"Orçamento!#REF!","v":{"$error":"#REF!"}}]
["F","TOTAL GERAL DO ORÇAMENTO (R$) C/BDI",null,{"$f":"SUM(D14:D39)","v":{"$error":"#REF!"}},{"$f":"SUM(E14:E39)","v":{"$error":"#REF!"}}]

{"sheet":"Parc Maior Relev","index":6,"n_rows":33,"n_cols":7,"rows_kept":33,"cut":false,"hidden":false,"merged":[[6,4,6,6],[7,1,7,6],[8,1,8,3],[8,4,8,6],[33,3,33,7],[31,1,31,6],[0,1,0,6],[11,1,11,6],[1,1,1,6],[2,1,2,3],[2,4,2,6],[3,1,3,3],[3,4,3,6],[4,1,4,6],[5,1,5,3],[5,4,5,6],[9,1,9,3],[9,4,9,6],[10,1,10,6],[6,1,6,3]]}
[]
[]
[null,"UNIDADE ESCOLAR",null,null,"CÓDIGO INEP"]
[null,{"$f":"Orçamento!$O$4","v":"CRE DE IPORÁ"},null,null,{"$f":"Orçamento!$X$4","v":52027163}]
[]
[null,"OBRA",null,null,"CIDADE"]
[null,{"$f":"Orçamento!$O$7","v":"REFORMA E AMPLIAÇÃO"},null,null,{"$f":"Orçamento!$X$7","v":"IPORÁ"}]
[]
[null,"CRE",null,null,"ÁREA TOTAL CONSTRUÍDA (M²)"]
[null,{"$f":"Orçamento!$O$10","v":"CRE DE IPORÁ"},null,null,{"$f":"Orçamento!$X$13","v":774.52}]
[]
["FILTRO","PARCELA DE MAIOR RELEVÂNCIA"]
[{"$f":"IF(G14>0,\"F\",\"\")","v":""},"CÓDIGO","SERVIÇO","DESCRIÇÃO","UNID","QUANT","PARC. MAIOR RELEV (100%)"]
[{"$f":"IF(G14>0,\"F\",\"\")","v":""},"f.","INSTALAÇÕES ELÉTRICAS","SUBESTAÇÃO","KVA",{"$f":"SUMIF(Orçamento!$R$20:$R$328,'Parc Maior Relev'!D14,Orçamento!$T$20:$T$328)","v":0},{"$f":"F14","v":0}]
[{"$f":"IF(SUM(G16:G30)>0,\"F\",\"\")","v":"F"},"CÓDIGO","SERVIÇO","DESCRIÇÃO","UNID","QUANT","PARC. MAIOR RELEV (50%)"]
[{"$f":"IF(G16>0,\"F\",\"\")","v":""},"e.","ESTRUTURA","CONCRETO","M3",{"$f":"SUMIF(Orçamento!$R$20:$R$328,'Parc Maior Relev'!D16,Orçamento!$T$20:$T$328)","v":0},{"$f":"F16*0.5","v":0}]
[{"$f":"IF(G17>0,\"F\",\"\")","v":""},"f.","INSTALAÇÕES ELÉTRICAS","INSTALAÇÕES ELÉTRICAS","KVA",{"$f":"SUMIF(Orçamento!$R$20:$R$328,'Parc Maior Relev'!D17,Orçamento!$T$20:$T$328)","v":0},{"$f":"F17*0.5","v":0}]
[{"$f":"IF(G18>0,\"F\",\"\")","v":""},"o.","COBERTURAS","COBERTURA CERÂMICA","M2",{"$f":"SUMIF(Orçamento!$R$20:$R$328,'Parc Maior Relev'!D18,Orçamento!$T$20:$T$328)","v":0},0]
["","o.","COBERTURAS","COBERTURA COM TELHA METÁLICA","M2",{"$f":"SUMIF(Orçamento!$R$20:$R$328,'Parc Maior Relev'!D19,Orçamento!$T$20:$T$328)","v":0},0]
["","s.","REVESTIMENTO DE PAREDE","CHAPISCO","M2",{"$f":"SUMIF(Orçamento!$R$20:$R$328,'Parc Maior Relev'!D20,Orçamento!$T$20:$T$328)","v":0},0]
["","s.","REVESTIMENTO DE PAREDE","REBOCO","M2",{"$f":"SUMIF(Orçamento!$R$20:$R$328,'Parc Maior Relev'!D21,Orçamento!$T$20:$T$328)","v":0},0]
["","s.","REVESTIMENTO DE PAREDE","REVESTIMENTO CERÂMICO","M2",{"$f":"SUMIF(Orçamento!$R$20:$R$328,'Parc Maior Relev'!D22,Orçamento!$T$20:$T$328)","v":0},0]
["","t.","FORROS","FORRO DE GESSO","M2",{"$f":"SUMIF(Orçamento!$R$20:$R$328,'Parc Maior Relev'!D23,Orçamento!$T$20:$T$328)","v":0},0]
["","t.","FORROS","FORRO DE PVC","M2",{"$f":"SUMIF(Orçamento!$R$20:$R$328,'Parc Maior Relev'!D24,Orçamento!$T$20:$T$328)","v":0},0]
["","t.","FORROS","FORRO DE GESSO ACARTONADO","M2",{"$f":"SUMIF(Orçamento!$R$20:$R$328,'Parc Maior Relev'!D25,Orçamento!$T$20:$T$328)","v":0},0]
["","u.","REVESTIMENTO DE PISO","PISO DE GRANITINA","M2",{"$f":"SUMIF(Orçamento!$R$20:$R$328,'Parc Maior Relev'!D26,Orçamento!$T$20:$T$328)","v":0},0]
["","u.","REVESTIMENTO DE PISO","PISO LAMINADO","M2",{"$f":"SUMIF(Orçamento!$R$20:$R$328,'Parc Maior Relev'!D27,Orçamento!$T$20:$T$328)","v":0},0]
["","u.","REVESTIMENTO DE PISO","PISO DE CONCRETO DESEMPENADO","M2",{"$f":"SUMIF(Orçamento!$R$20:$R$328,'Parc Maior Relev'!D28,Orçamento!$T$20:$T$328)","v":0},0]
["F","u.","REVESTIMENTO DE PISO","PISO CERÂMICO","M2",{"$f":"Orçamento!T104","v":35.950000000000003},17.975000000000001]
["F","y.","PINTURA","PINTURA","M2",{"$f":"Orçamento!T120","v":1382},691]
["F"]
["F","(*) Para os fins do inciso I dp § 1º do Art. 30 da Lei Federal 8.666/93, são consideradas parcelas de maior relevância técnica as execuções apresentadas"]
["F"]

{"sheet":"Composições","index":7,"n_rows":207,"n_cols":10,"rows_kept":207,"cut":false,"hidden":false,"merged":[[201,5,202,5],[201,6,201,7],[201,8,201,9],[205,1,205,7],[206,1,206,7],[201,0,202,0],[201,1,202,1],[201,2,202,2],[201,3,202,3],[201,4,202,4],[191,5,192,5],[191,6,191,7],[191,8,191,9],[195,1,195,7],[199,1,199,7],[191,0,192,0],[191,1,192,1],[191,2,192,2],[191,3,192,3],[191,4,192,4],[181,5,182,5],[181,6,181,7],[181,8,181,9],[185,1,185,7],[189,1,189,7],[181,0,182,0],[181,1,182,1],[181,2,182,2],[181,3,182,3],[181,4,182,4],[171,5,172,5],[171,6,171,7],[171,8,171,9],[176,1,176,7],[179,1,179,7],[171,0,172,0],[171,1,172,1],[171,2,172,2],[171,3,172,3],[171,4,172,4],[161,5,162,5],[161,6,161,7],[161,8,161,9],[166,1,166,7],[169,1,169,7],[161,0,162,0],[161,1,162,1],[161,2,162,2],[161,3,162,3],[161,4,162,4],[152,5,153,5],[152,6,152,7],[152,8,152,9],[157,1,157,7],[159,1,159,7],[152,0,153,0],[152,1,153,1],[152,2,153,2],[152,3,153,3],[152,4,153,4],[143,5,144,5],[143,6,143,7],[143,8,143,9],[148,1,148,7],[150,1,150,7],[143,0,144,0],[143,1,144,1],[143,2,144,2],[143,3,144,3],[143,4,144,4],[134,5,135,5],[134,6,134,7],[134,8,134,9],[139,1,139,7],[141,1,141,7],[134,0,135,0],[134,1,135,1],[134,2,135,2],[134,3,135,3],[134,4,135,4],[125,5,126,5],[125,6,125,7],[125,8,125,9],[130,1,130,7],[132,1,132,7],[125,0,126,0],[125,1,126,1],[125,2,126,2],[125,3,126,3],[125,4,126,4],[116,5,117,5],[116,6,116,7],[116,8,116,9],[121,1,121,7],[123,1,123,7],[116,0,117,0],[116,1,117,1],[116,2,117,2],[116,3,117,3],[116,4,117,4],[106,5,107,5],[106,6,106,7],[106,8,106,9],[111,1,111,7],[114,1,114,7],[106,0,107,0],[106,1,107,1],[106,2,107,2],[106,3,107,3],[106,4,107,4],[96,5,97,5],[96,6,96,7],[96,8,96,9],[101,1,101,7],[104,1,104,7],[96,0,97,0],[96,1,97,1],[96,2,97,2],[96,3,97,3],[96,4,97,4],[83,5,84,5],[83,6,83,7],[83,8,83,9],[87,1,87,7],[94,1,94,7],[83,0,84,0],[83,1,84,1],[83,2,84,2],[83,3,84,3],[83,4,84,4],[73,5,74,5],[73,6,73,7],[73,8,73,9],[77,1,77,7],[81,1,81,7],[73,0,74,0],[73,1,74,1],[73,2,74,2],[73,3,74,3],[73,4,74,4],[63,5,64,5],[63,6,63,7],[63,8,63,9],[67,1,67,7],[71,1,71,7],[63,0,64,0],[63,1,64,1],[63,2,64,2],[63,3,64,3],[63,4,64,4],[54,5,55,5],[54,6,54,7],[54,8,54,9],[59,1,59,7],[61,1,61,7],[54,0,55,0],[54,1,55,1],[54,2,55,2],[54,3,55,3],[54,4,55,4],[45,5,46,5],[45,6,45,7],[45,8,45,9],[50,1,50,7],[52,1,52,7],[45,0,46,0],[45,1,46,1],[45,2,46,2],[45,3,46,3],[45,4,46,4],[38,5,39,5],[38,6,38,7],[38,8,38,9],[41,1,41,7],[43,1,43,7],[38,0,39,0],[38,1,39,1],[38,2,39,2],[38,3,39,3],[38,4,39,4],[16,5,17,5],[16,6,16,7],[16,8,16,9],[21,1,21,7],[36,1,36,7],[16,0,17,0],[16,1,17,1],[16,2,17,2],[16,3,17,3],[16,4,17,4],[0,0,0,8],[10,0,10,2],[10,3,10,6],[11,0,11,9],[12,0,12,2],[12,3,12,6],[12,7,12,8],[7,0,7,6],[9,0,9,2],[9,3,9,6],[9,7,9,8],[3,0,3,6],[4,0,4,6],[15,0,15,9],[13,0,13,2],[13,3,13,6],[1,0,1,9],[3,7,3,9],[4,7,4,9],[6,7,6,9],[7,7,7,9],[6,0,6,6],[10,8,10,9],[13,8,13,9],[14,0,14,9],[8,0,8,9],[5,0,5,9],[2,0,2,9]]}
[]
[]
[]
["UNIDADE ESCOLAR",null,null,null,null,null,null,"CÓDIGO INEP"]
[{"$f":"Orçamento!$O$4","v":"CRE DE IPORÁ"},null,null,null,null,null,null,{"$f":"Orçamento!$X$4","v":52027163}]
[]
["OBRA",null,null,null,null,null,null,"CIDADE"]
[{"$f":"Orçamento!$O$7","v":"REFORMA E AMPLIAÇÃO"},null,null,null,null,null,null,{"$f":"Orçamento!$X$7","v":"IPORÁ"}]
[]
["CRE",null,null,"ENDEREÇO",null,null,null,"REFERÊNCIA AGETOP"]
[{"$f":"Orçamento!$O$10","v":"CRE DE IPORÁ"},null,null,{"$f":"Orçamento!$R$10","v":"Rua D - Vila Padre Cícero - S/N - CEP:76.200-000"},null,null,null,{"$f":"Orçamento!$S$10","v":"ABR/19"},{"$f":"Orçamento!$T$10","v":"DESONERADA"}]
[]
["DATA",null,null,"ÁREA TOTAL CONSTRUÍDA (M²)",null,null,null,"REFERÊNCIA SINAPI"]
[{"$f":"Orçamento!$S$7","v":"2020-06-10"},null,null,{"$f":"Orçamento!$X$13","v":774.52},null,null,null,{"$f":"Orçamento!$X$10","v":"ABR/20"},{"$f":"Orçamento!$Y$10","v":"DESONERADA"}]
[]
["COMPOSIÇÕES DE CUSTOS UNITÁRIOS - SEE-GO"]
[84,"FONTE","CÓDIGO","DESCRIÇÃO","UNIDADE","COEFIC.","CUSTO UNITÁRIO",null,"CUSTO  TOTAL (A) + (B) + (C) + (D) + (E)"]
[null,null,null,null,null,null,"DESONERADO","NÃO DESONER.","DESONERADO","NÃO DESONER."]
[null,"COMPOSIÇÃO","COMP 084_SEE","GUARDA-CORPO COM CORRIMÃO - SEDUC","M",null,null,null,206.14000000000001,211.22000000000003]
[null,"AGETOP_I",25,"OFICIAL \"B\"","h     ",1.1000000000000001,13.95,16.16,15.35,17.78]
[null,"AGETOP_I",8,"AJUDANTE","h     ",1.1000000000000001,8.75,10.14,9.6300000000000008,11.15]
[null,"MÃO DE OBRA (B) - TOTAL",null,null,null,null,null,null,24.98,28.93]
[null,"AGETOP_I",2376,"TUBO INDUSTRIAL 2\" CHAPA 13 ","Kg",7.7778,5.23,5.23,40.68,40.68]
[null,"AGETOP_I",2504,"TUBO INDUSTRIAL D=25 MM CHAPA 13 ","Kg",4.6319999999999997,5.07,5.07,23.48,23.48]
[null,"AGETOP_I",2377,"TUBO INDUSTRIAL 40X40 CH.13","Kg",6.3419999999999996,5.07,5.07,32.15,32.15]
[null,"AGETOP_I",2421,"TUBO INDUSTRIAL 1.1/2\" CHAPA 13 ","Kg",1.4862,5.07,5.07,7.54,7.54]
[null,"AGETOP_I",2417,"MASSA PLASTICA","Kg",0.2041,10.58,10.58,2.16,2.16]
[null,"AGETOP_I",2246,"ELETRODO 2.5 OK","Kg",0.11459999999999999,8.6999999999999993,8.6999999999999993,1,1]
[null,"AGETOP_I",1672,"LIXA PARA FERRO ( NÚMERO 100 )","un",0.25509999999999999,2.12,2.12,0.54,0.54]
[null,"AGETOP_I",1264,"DISCO DE DESBASTE 7/8\" P/ CONC./FERRO (1/4\" X 7\")","un",5.0999999999999997E-2,7,7,0.36,0.36]
[null,"AGETOP_I",1334,"DISCO DE CORTE DIAM. 5/8\"- 10\"","un",0.373,5.5,5.5,2.0499999999999998,2.0499999999999998]
[null,"AGETOP_I",2902,"FABRICAÇÃO / MONTAGEM","un",1,50.44,50.44,50.44,50.44]
[null,"AGETOP_I",2150,"CHAPA DE FERRO DOBRADA No.13","Kg",0.43519999999999998,5.28,5.28,2.2999999999999998,2.2999999999999998]
[null,"AGETOP_I",2719,"CHAPA PERFILADA 3/16\"","Kg",1.0979999999999999,5.04,5.04,5.53,5.53]
[null,"AGETOP_I",2436,"ACO CA-25 - 6,3 MM (1/4\") - BARRA LISA A-36","Kg",0.38124999999999998,5.13,5.13,1.96,1.96]
[null,"AGETOP",261602,"PINT.ESMALTE/ESQUAD.FERRO C/FUNDO ANTICOR.","m2    ",0.78,14.07,15.51,10.97,12.1]
[null,"MATERIAL (C) - TOTAL",null,null,null,null,null,null,181.16000000000003,182.29000000000002]
[]
[27,"FONTE","CÓDIGO","DESCRIÇÃO","UNIDADE","COEFIC.","CUSTO UNITÁRIO",null,"CUSTO  TOTAL (A) + (B) + (C) + (D) + (E)"]
[null,null,null,null,null,null,"DESONERADO","NÃO DESONER.","DESONERADO","NÃO DESONER."]
[null,"COMPOSIÇÃO","COMP 027_SEE","TELA MOSQUITEIRA EM NYLON COM ESTRUTURA DE ALUMÍNIO, COM FORNECIMENTO DE MÃO DE OBRA E INSTALAÇÃO","M2",null,null,null,123.21,123.21]
[null,"MÃO DE OBRA (B) - TOTAL",null,null,null,null,null,null,0,0]
[null,"COTAÇÃO","COT 002_SEE","TELA MOSQUITEIRA EM NYLON COM ESTRUTURA DE ALUMÍNIO [M²], COM FORNECIMENTO DE MÃO DE OBRA E INSTALAÇÃO","M2",1,123.21333333333332,123.21333333333332,123.21,123.21]
[null,"MATERIAL (C) - TOTAL",null,null,null,null,null,null,123.21,123.21]
[]
[575,"FONTE","CÓDIGO","DESCRIÇÃO","UNID ","COEFIC.","CUSTO UNITÁRIO",null,"CUSTO  TOTAL (A) + (B) + (C) + (D) + (E)"]
[null,null,null,null,null,null,"DESONERADO","NÃO DESONER.","DESONERADO","NÃO DESONER."]
[null,"COMPOSIÇÃO","COMP 575_SEE","MOLA AEREA FECHA PORTA, PARA PORTAS COM LARGURA ATE 95 CM","UN ","-","-","-",120.96,121.83]
[null,"AGETOP_I",5,"SERVENTE","h     ",0.15,8.75,10.14,1.31,1.52]
[null,"AGETOP_I",24,"MARCENEIRO","h     ",0.3,13.95,16.16,4.1900000000000004,4.8499999999999996]
[null,"MÃO DE OBRA (B) - TOTAL",null,null,null,null,null,null,5.5,6.3699999999999992]
[null,"SINAPI_I",11560,"MOLA AEREA FECHA PORTA, PARA PORTAS COM LARGURA ATE 95 CM","UN    ",1,115.46,115.46,115.46,115.46]
[null,"MATERIAL (C) - TOTAL",null,null,null,null,null,null,115.46,115.46]
[]
[387,"FONTE","CÓDIGO","DESCRIÇÃO","UNIDADE","COEFIC.","CUSTO UNITÁRIO",null,"CUSTO  TOTAL (A) + (B) + (C) + (D) + (E)"]
[null,null,null,null,null,null,"DESONERADO","NÃO DESONER.","DESONERADO","NÃO DESONER."]
[null,"COMPOSIÇÃO","COMP 387_SEE","LÂMPADA LED TUBULAR 18W ","UN ",null,null,null,22.3,22.35]
[null,"AGETOP_I",8,"AJUDANTE","h     ",1.4999999999999999E-2,8.75,10.14,0.13,0.15]
[null,"AGETOP_I",12,"ELETRICISTA","h     ",1.4999999999999999E-2,13.95,16.16,0.21,0.24]
[null,"MÃO DE OBRA (B) - TOTAL",null,null,null,null,null,null,0.33999999999999997,0.39]
[null,"COTAÇÃO","COT 195_SEE","LÂMPADA LED TUBULAR 18W ","UN",1,21.959999999999997,21.959999999999997,21.96,21.96]
[null,"MATERIAL (C) - TOTAL",null,null,null,null,null,null,21.96,21.96]
[]
[24,"FONTE","CÓDIGO","DESCRIÇÃO","UNIDADE","COEFIC.","CUSTO UNITÁRIO",null,"CUSTO  TOTAL (A) + (B) + (C) + (D) + (E)"]
[null,null,null,null,null,null,"DESONERADO","NÃO DESONER.","DESONERADO","NÃO DESONER."]
[null,"COMPOSIÇÃO","COMP 024_SEE","SINALIZADOR FOTOLUMINESCENTE PARA EXTINTOR","UN ",null,"-","-",25.319999999999997,25.439999999999998]
[null,"AGETOP_I",5,"SERVENTE","h     ",0.09,8.75,10.14,0.79,0.91]
[null,"MÃO DE OBRA (B) - TOTAL",null,null,null,null,null,null,0.79,0.91]
[null,"AGETOP_I",3070,"BUCHA DE NYLON S-6","un",2,0.04,0.04,0.08,0.08]
[null,"AGETOP_I",3393,"PARAFUSO P/BUCHA S-6","un",2,0.08,0.08,0.16,0.16]
[null,"SINAPI_I",37556,"PLACA DE SINALIZACAO DE SEGURANCA CONTRA INCENDIO, FOTOLUMINESCENTE, QUADRADA, *20 X 20* CM, EM PVC *2* MM ANTI-CHAMAS (SIMBOLOS, CORES E PICTOGRAMAS CONFORME NBR 13434)","UN    ",1,24.29,24.29,24.29,24.29]
[null,"MATERIAL (C) - TOTAL",null,null,null,null,null,null,24.529999999999998,24.529999999999998]
[]
[25,"FONTE","CÓDIGO","DESCRIÇÃO","UNIDADE","COEFIC.","CUSTO UNITÁRIO",null,"CUSTO  TOTAL (A) + (B) + (C) + (D) + (E)"]
[null,null,null,null,null,null,"DESONERADO","NÃO DESONER.","DESONERADO","NÃO DESONER."]
[null,"COMPOSIÇÃO","COMP 025_SEE","SINALIZADOR FOTOLUMINESCENTE DE EMERGÊNCIA","UN ",null,"-","-",25.319999999999997,25.439999999999998]
[null,"AGETOP_I",5,"SERVENTE","h     ",0.09,8.75,10.14,0.79,0.91]
[null,"MÃO DE OBRA (B) - TOTAL",null,null,null,null,null,null,0.79,0.91]
[null,"AGETOP_I",3070,"BUCHA DE NYLON S-6","un",2,0.04,0.04,0.08,0.08]
[null,"AGETOP_I",3393,"PARAFUSO P/BUCHA S-6","un",2,0.08,0.08,0.16,0.16]
[null,"SINAPI_I",37556,"PLACA DE SINALIZACAO DE SEGURANCA CONTRA INCENDIO, FOTOLUMINESCENTE, QUADRADA, *20 X 20* CM, EM PVC *2* MM ANTI-CHAMAS (SIMBOLOS, CORES E PICTOGRAMAS CONFORME NBR 13434)","UN    ",1,24.29,24.29,24.29,24.29]
[null,"MATERIAL (C) - TOTAL",null,null,null,null,null,null,24.529999999999998,24.529999999999998]
[]
[277,"FONTE","CÓDIGO","DESCRIÇÃO","UNIDADE","COEFIC.","CUSTO UNITÁRIO",null,"CUSTO  TOTAL (A) + (B) + (C) + (D) + (E)"]
[null,null,null,null,null,null,"DESONERADO","NÃO DESONER.","DESONERADO","NÃO DESONER."]
[null,"COMPOSIÇÃO","COMP 277_SEE","MARCAÇÃO NO PISO - 1X1 M PARA EXTINTOR","M2",null,null,null,29.69,29.76]
[null,"AGETOP_I",5,"SERVENTE","h     ",3.3300000000000003E-2,8.75,10.14,0.28999999999999998,0.34]
[null,"MÃO DE OBRA (B) - TOTAL",null,null,null,null,null,null,0.28999999999999998,0.34]
[null,"SINAPI_I",5318,"SOLVENTE DILUENTE A BASE DE AGUARRAS","L     ",0.13,11.98,11.98,1.56,1.56]
[null,"SINAPI",5824,"CAMINHÃO TOCO, PBT 16.000 KG, CARGA ÚTIL MÁX. 10.685 KG, DIST. ENTRE EIXOS 4,8 M, POTÊNCIA 189 CV, INCLUSIVE CARROCERIA FIXA ABERTA DE MADEIRA P/ TRANSPORTE GERAL DE CARGA SECA, DIMEN. APROX. 2,5 X 7,00 X 0,50 M - CHP DIURNO. AF_06/2014","CHP",3.3E-3,115.5,118.69,0.38,0.39]
[null,"SINAPI_I",7343,"TINTA A BASE DE RESINA ACRILICA, PARA SINALIZACAO HORIZONTAL VIARIA (NBR 11862)","L     ",0.6,12.82,12.82,7.69,7.69]
[null,"SINAPI_I",7348,"TINTA ACRILICA PREMIUM PARA PISO","L     ",0.03,13.96,13.96,0.42,0.42]
[null,"SINAPI_I",25972,"MICROESFERAS DE VIDRO PARA SINALIZACAO HORIZONTAL VIARIA, TIPO I-B (PREMIX) - NBR 16184","KG    ",2.14,8.8800000000000008,8.8800000000000008,19,19]
[null,"SINAPI",95133,"MÁQUINA DEMARCADORA DE FAIXA DE TRÁFEGO À FRIO, AUTOPROPELIDA, POTÊNCIA 38 HP - CHP DIURNO. AF_07/2016","CHP",3.3E-3,105.93,109.48,0.35,0.36]
[null,"MATERIAL (C) - TOTAL",null,null,null,null,null,null,29.400000000000002,29.42]
[]
[382,"FONTE","CÓDIGO","DESCRIÇÃO","UNIDADE","COEFIC.","CUSTO UNITÁRIO",null,"CUSTO  TOTAL (A) + (B) + (C) + (D) + (E)"]
[null,null,null,null,null,null,"DESONERADO","NÃO DESONER.","DESONERADO","NÃO DESONER."]
[null,"COMPOSIÇÃO","COMP 382_SEE","TE DE REDUCAO DE FERRO GALVANIZADO, COM ROSCA BSP, DE 3/4\" X 1/2\"","UN ",null,null,null,24.25,26.43]
[null,"AGETOP_I",8,"AJUDANTE","h     ",0.6,8.75,10.14,5.25,6.08]
[null,"AGETOP_I",11,"ENCANADOR","h     ",0.61050000000000004,13.95,16.16,8.52,9.8699999999999992]
[null,"MÃO DE OBRA (B) - TOTAL",null,null,null,null,null,null,13.77,15.95]
[null,"SINAPI_I",3146,"FITA VEDA ROSCA EM ROLOS DE 18 MM X 10 M (L X C)","UN    ",0.12075471698113208,3.4,3.4,0.41,0.41]
[null,"SINAPI_I",6302,"TE DE REDUCAO DE FERRO GALVANIZADO, COM ROSCA BSP, DE 3/4\" X 1/2\"","UN    ",1,10.07,10.07,10.07,10.07]
[null,"MATERIAL (C) - TOTAL",null,null,null,null,null,null,10.48,10.48]
[]
[383,"FONTE","CÓDIGO","DESCRIÇÃO","UNIDADE","COEFIC.","CUSTO UNITÁRIO",null,"CUSTO  TOTAL (A) + (B) + (C) + (D) + (E)"]
[null,null,null,null,null,null,"DESONERADO","NÃO DESONER.","DESONERADO","NÃO DESONER."]
[null,"COMPOSIÇÃO","COMP 383_SEE","BUCHA DE REDUCAO DE FERRO GALVANIZADO, COM ROSCA BSP, DE 1/2\" X 1/4\"","UN ",null,null,null,7.68,8.26]
[null,"AGETOP_I",8,"AJUDANTE","h     ",0.16,8.75,10.14,1.4,1.62]
[null,"AGETOP_I",11,"ENCANADOR","h     ",0.16,13.95,16.16,2.23,2.59]
[null,"MÃO DE OBRA (B) - TOTAL",null,null,null,null,null,null,3.63,4.21]
[null,"AGETOP_I","H689","FITA VEDAROSCA 12 MM","m",1.2,0.28000000000000003,0.28000000000000003,0.34,0.34]
[null,"SINAPI_I",770,"BUCHA DE REDUCAO DE FERRO GALVANIZADO, COM ROSCA BSP, DE 1/2\" X 1/4\"","UN    ",1,3.71,3.71,3.71,3.71]
[null,"MATERIAL (C) - TOTAL",null,null,null,null,null,null,4.05,4.05]
[]
[212,"FONTE","CÓDIGO","DESCRIÇÃO","UNIDADE","COEFIC.","CUSTO UNITÁRIO",null,"CUSTO  TOTAL (A) + (B) + (C) + (D) + (E)"]
[null,null,null,null,null,null,"DESONERADO","NÃO DESONER.","DESONERADO","NÃO DESONER."]
[null,"COMPOSIÇÃO","COMP 212_SEE","NIPLE DE REDUÇÃO 1/2\" X 1/4\" BSP","UN ",null,null,null,9.68,10.26]
[null,"AGETOP_I",8,"AJUDANTE","h     ",0.16,8.75,10.14,1.4,1.62]
[null,"AGETOP_I",11,"ENCANADOR","h     ",0.16,13.95,16.16,2.23,2.59]
[null,"MÃO DE OBRA (B) - TOTAL",null,null,null,null,null,null,3.63,4.21]
[null,"COTAÇÃO","COT 103_SEE","NIPLE DE REDUÇÃO 1/2\" X 1/4\" BSP","UN",1,6.0533333333333337,6.0533333333333337,6.05,6.05]
[null,"MATERIAL (C) - TOTAL",null,null,null,null,null,null,6.05,6.05]
[]
[213,"FONTE","CÓDIGO","DESCRIÇÃO","UNIDADE","COEFIC.","CUSTO UNITÁRIO",null,"CUSTO  TOTAL (A) + (B) + (C) + (D) + (E)"]
[null,null,null,null,null,null,"DESONERADO","NÃO DESONER.","DESONERADO","NÃO DESONER."]
[null,"COMPOSIÇÃO","COMP 213_SEE","NIPLE DE REDUÇÃO 3/4\" X 1/2\" BSP","UN ",null,null,null,13.34,13.920000000000002]
[null,"AGETOP_I",8,"AJUDANTE","h     ",0.16,8.75,10.14,1.4,1.62]
[null,"AGETOP_I",11,"ENCANADOR","h     ",0.16,13.95,16.16,2.23,2.59]
[null,"MÃO DE OBRA (B) - TOTAL",null,null,null,null,null,null,3.63,4.21]
[null,"COTAÇÃO","COT 104_SEE","NIPLE DE REDUÇÃO 3/4\" X 1/2\" BSP","UN",1,9.7099999999999991,9.7099999999999991,9.7100000000000009,9.7100000000000009]
[null,"MATERIAL (C) - TOTAL",null,null,null,null,null,null,9.7100000000000009,9.7100000000000009]
[]
[237,"FONTE","CÓDIGO","DESCRIÇÃO","UNIDADE","COEFIC.","CUSTO UNITÁRIO",null,"CUSTO  TOTAL (A) + (B) + (C) + (D) + (E)"]
[null,null,null,null,null,null,"DESONERADO","NÃO DESONER.","DESONERADO","NÃO DESONER."]
[null,"COMPOSIÇÃO","COMP 237_SEE","FITA ANTICORROSIVA","M",null,null,null,11.16,11.879999999999999]
[null,"AGETOP_I",8,"AJUDANTE","h     ",0.2,8.75,10.14,1.75,2.0299999999999998]
[null,"AGETOP_I",12,"ELETRICISTA","h     ",0.2,13.95,16.16,2.79,3.23]
[null,"MÃO DE OBRA (B) - TOTAL",null,null,null,null,null,null,4.54,5.26]
[null,"SINAPI_I",39634,"FITA ADESIVA ANTICORROSIVA DE PVC FLEXIVEL, COR PRETA, PARA PROTECAO TUBULACAO, 50 MM X 30 M (L X C), E= *0,25* MM","M     ",1,6.62,6.62,6.62,6.62]
[null,"MATERIAL (C) - TOTAL",null,null,null,null,null,null,6.62,6.62]
[]
[542,"FONTE","CÓDIGO","DESCRIÇÃO","UNIDADE","COEFIC.","CUSTO UNITÁRIO",null,"CUSTO  TOTAL (A) + (B) + (C) + (D) + (E)"]
[null,null,null,null,null,null,"DESONERADO","NÃO DESONER.","DESONERADO","NÃO DESONER."]
[null,"COMPOSIÇÃO","COMP 542_SEE","VÁLVULA UGV 3/4\" (S) LATÃO","UN ",null,null,null,25.65,27.2]
[null,"AGETOP_I",8,"AJUDANTE","h     ",0.432,8.75,10.14,3.78,4.38]
[null,"AGETOP_I",11,"ENCANADOR","h     ",0.432,13.95,16.16,6.03,6.98]
[null,"MÃO DE OBRA (B) - TOTAL",null,null,null,null,null,null,9.81,11.36]
[null,"COTAÇÃO","COT 281_SEE","VÁLVULA UGV 3/4\" (S) LATÃO","UN ",1,15.836666666666666,15.836666666666666,15.84,15.84]
[null,"MATERIAL (C) - TOTAL",null,null,null,null,null,null,15.84,15.84]
[]
[543,"FONTE","CÓDIGO","DESCRIÇÃO","UNIDADE","COEFIC.","CUSTO UNITÁRIO",null,"CUSTO  TOTAL (A) + (B) + (C) + (D) + (E)"]
[null,null,null,null,null,null,"DESONERADO","NÃO DESONER.","DESONERADO","NÃO DESONER."]
[null,"COMPOSIÇÃO","COMP 543_SEE","VÁLVULA UGV 1/2\" (S) LATÃO","UN ",null,null,null,24.98,26.53]
[null,"AGETOP_I",8,"AJUDANTE","h     ",0.432,8.75,10.14,3.78,4.38]
[null,"AGETOP_I",11,"ENCANADOR","h     ",0.432,13.95,16.16,6.03,6.98]
[null,"MÃO DE OBRA (B) - TOTAL",null,null,null,null,null,null,9.81,11.36]
[null,"COTAÇÃO","COT 282_SEE","VÁLVULA UGV 1/2\" (S) LATÃO","UN ",1,15.166666666666666,15.166666666666666,15.17,15.17]
[null,"MATERIAL (C) - TOTAL",null,null,null,null,null,null,15.17,15.17]
[]
[211,"FONTE","CÓDIGO","DESCRIÇÃO","UNIDADE","COEFIC.","CUSTO UNITÁRIO",null,"CUSTO  TOTAL (A) + (B) + (C) + (D) + (E)"]
[null,null,null,null,null,null,"DESONERADO","NÃO DESONER.","DESONERADO","NÃO DESONER."]
[null,"COMPOSIÇÃO","COMP 211_SEE","REGULADOR DE 2º ESTÁGIO 5KG/H","UN ",null,null,null,86.72,90.86]
[null,"AGETOP_I",8,"AJUDANTE","h     ",1.1499999999999999,8.75,10.14,10.06,11.66]
[null,"AGETOP_I",11,"ENCANADOR","h     ",1.1499999999999999,13.95,16.16,16.04,18.579999999999998]
[null,"MÃO DE OBRA (B) - TOTAL",null,null,null,null,null,null,26.1,30.24]
[null,"COTAÇÃO","COT 102_SEE","REGULADOR DE 2º ESTÁGIO 5KG/H","UN",1,59.833333333333336,59.833333333333336,59.83,59.83]
[null,"AGETOP_I","H689","FITA VEDAROSCA 12 MM","m",2.82,0.28000000000000003,0.28000000000000003,0.79,0.79]
[null,"MATERIAL (C) - TOTAL",null,null,null,null,null,null,60.62,60.62]
[]
[210,"FONTE","CÓDIGO","DESCRIÇÃO","UNIDADE","COEFIC.","CUSTO UNITÁRIO",null,"CUSTO  TOTAL (A) + (B) + (C) + (D) + (E)"]
[null,null,null,null,null,null,"DESONERADO","NÃO DESONER.","DESONERADO","NÃO DESONER."]
[null,"COMPOSIÇÃO","COMP 210_SEE","REGULADOR DE 1º ESTÁGIO 60KG/H MODELO AP-40  COM MANÔMETRO","UN ",null,null,null,232.47,236.61]
[null,"AGETOP_I",8,"AJUDANTE","h     ",1.1499999999999999,8.75,10.14,10.06,11.66]
[null,"AGETOP_I",11,"ENCANADOR","h     ",1.1499999999999999,13.95,16.16,16.04,18.579999999999998]
[null,"MÃO DE OBRA (B) - TOTAL",null,null,null,null,null,null,26.1,30.24]
[null,"COTAÇÃO","COT 101_SEE","REGULADOR DE 1º ESTÁGIO 60KG/H MODELO AP-40  COM MANÔMETRO","UN",1,205.57666666666668,205.57666666666668,205.58,205.58]
[null,"AGETOP_I","H689","FITA VEDAROSCA 12 MM","m",2.82,0.28000000000000003,0.28000000000000003,0.79,0.79]
[null,"MATERIAL (C) - TOTAL",null,null,null,null,null,null,206.37,206.37]
[]
[235,"FONTE","CÓDIGO","DESCRIÇÃO","UNIDADE","COEFIC.","CUSTO UNITÁRIO",null,"CUSTO  TOTAL (A) + (B) + (C) + (D) + (E)"]
[null,null,null,null,null,null,"DESONERADO","NÃO DESONER.","DESONERADO","NÃO DESONER."]
[null,"COMPOSIÇÃO","COMP 235_SEE","PLACA DE SINALIZAÇÃO EM PVC COD 01 - (300X300) PROIBIDO FUMAR","UN ",null,null,null,25.319999999999997,25.439999999999998]
[null,"AGETOP_I",5,"SERVENTE","h     ",0.09,8.75,10.14,0.79,0.91]
[null,"MÃO DE OBRA (B) - TOTAL",null,null,null,null,null,null,0.79,0.91]
[null,"AGETOP_I",3070,"BUCHA DE NYLON S-6","un",2,0.04,0.04,0.08,0.08]
[null,"AGETOP_I",3393,"PARAFUSO P/BUCHA S-6","un",2,0.08,0.08,0.16,0.16]
[null,"SINAPI_I",37556,"PLACA DE SINALIZACAO DE SEGURANCA CONTRA INCENDIO, FOTOLUMINESCENTE, QUADRADA, *20 X 20* CM, EM PVC *2* MM ANTI-CHAMAS (SIMBOLOS, CORES E PICTOGRAMAS CONFORME NBR 13434)","UN    ",1,24.29,24.29,24.29,24.29]
[null,"MATERIAL (C) - TOTAL",null,null,null,null,null,null,24.529999999999998,24.529999999999998]
[]
[236,"FONTE","CÓDIGO","DESCRIÇÃO","UNIDADE","COEFIC.","CUSTO UNITÁRIO",null,"CUSTO  TOTAL (A) + (B) + (C) + (D) + (E)"]
[null,null,null,null,null,null,"DESONERADO","NÃO DESONER.","DESONERADO","NÃO DESONER."]
[null,"COMPOSIÇÃO","COMP 236_SEE","PLACA DE SINALIZAÇÃO EM PVC COD 06 - (300X300) PERIGO INFLAMÁVEL","UN ",null,null,null,25.319999999999997,25.439999999999998]
[null,"AGETOP_I",5,"SERVENTE","h     ",0.09,8.75,10.14,0.79,0.91]
[null,"MÃO DE OBRA (B) - TOTAL",null,null,null,null,null,null,0.79,0.91]
[null,"AGETOP_I",3070,"BUCHA DE NYLON S-6","un",2,0.04,0.04,0.08,0.08]
[null,"AGETOP_I",3393,"PARAFUSO P/BUCHA S-6","un",2,0.08,0.08,0.16,0.16]
[null,"SINAPI_I",37556,"PLACA DE SINALIZACAO DE SEGURANCA CONTRA INCENDIO, FOTOLUMINESCENTE, QUADRADA, *20 X 20* CM, EM PVC *2* MM ANTI-CHAMAS (SIMBOLOS, CORES E PICTOGRAMAS CONFORME NBR 13434)","UN    ",1,24.29,24.29,24.29,24.29]
[null,"MATERIAL (C) - TOTAL",null,null,null,null,null,null,24.529999999999998,24.529999999999998]
[]
[45,"FONTE","CÓDIGO","DESCRIÇÃO","UNIDADE","COEFIC.","CUSTO UNITÁRIO",null,"CUSTO  TOTAL (A) + (B) + (C) + (D) + (E)"]
[null,null,null,null,null,null,"DESONERADO","NÃO DESONER.","DESONERADO","NÃO DESONER."]
[null,"COMPOSIÇÃO","COMP 045_SEE","LAUDO DE ESTANQUEIDADE","UN ",null,null,null,936,1085.1199999999999]
[null,"AGETOP",250101,"ENGENHEIRO - (OBRAS CIVIS)","H     ",16,58.5,67.819999999999993,936,1085.1199999999999]
[null,"MÃO DE OBRA (B) - TOTAL",null,null,null,null,null,null,936,1085.1199999999999]
[null,"MATERIAL (C) - TOTAL",null,null,null,null,null,null,0,0]