{"text_format":"1","workbook":"xlsx","n_sheets":8,"sheets":["Orçamento","Resumo ","Somatório","Cronog_45_Dias","Composição BDI","Relatório CENTRAL","Parc Maior Relev","Composições"],"not_rendered":{"charts":0,"images":3,"macros":1,"external_links":0,"defined_names":104,"comments":2,"pivot_tables":0},"unopened":[],"bounds":{"document_bytes":16777216,"sheet_cells":100000,"rows_first":2000,"rows_last":500,"rows_between":2000,"halvings":0,"cell_chars":16384,"cell_head_chars":4096},"cells_cut":0,"cells_raw":0,"read":"whole","date_system":"1900"}

{"sheet":"Orçamento","index":0,"n_rows":360,"n_cols":37,"rows_kept":360,"cut":false,"hidden":false,"merged":[[347,15,347,17],[347,18,347,22],[348,15,348,17],[348,18,348,22],[349,15,349,17],[349,18,349,22],[9,24,9,25],[8,23,8,25],[341,18,341,22],[342,15,342,17],[342,18,342,22],[343,15,343,17],[343,18,343,22],[338,15,338,17],[338,18,338,22],[339,15,339,17],[339,18,339,22],[340,15,340,17],[340,18,340,22],[334,14,334,26],[335,18,335,22],[336,15,336,17],[336,18,336,22],[321,15,321,17],[353,23,353,25],[354,23,354,25],[355,23,355,25],[356,23,356,25],[357,23,357,25],[358,23,358,25],[359,23,359,25],[18,35,18,36],[328,14,328,17],[335,15,335,17],[301,15,301,17],[356,18,356,22],[344,15,344,17],[344,18,344,22],[345,15,345,17],[345,18,345,22],[346,15,346,17],[346,18,346,22],[350,15,350,17],[350,18,350,22],[351,15,351,17],[351,18,351,22],[352,15,352,17],[341,15,341,17],[359,18,359,22],[356,14,356,17],[353,15,353,17],[353,18,353,22],[354,15,354,17],[354,18,354,22],[355,15,355,17],[355,18,355,22],[358,18,358,22],[357,18,357,22],[292,16,292,24],[293,16,293,24],[294,16,294,24],[10,14,10,26],[13,14,13,26],[2,14,2,22],[3,14,3,22],[5,18,5,22],[6,18,6,22],[11,18,11,22],[12,18,12,22],[6,14,6,17],[5,14,5,17],[3,23,3,25],[2,23,2,25],[5,23,5,25],[6,23,6,25],[8,18,8,20],[284,17,289,17],[290,22,290,24],[284,22,284,24],[285,22,285,24],[286,22,286,24],[295,16,295,24],[301,23,301,25],[317,23,317,25],[318,23,318,25],[337,15,337,17],[337,18,337,22],[296,16,296,24],[314,15,314,17],[315,15,315,17],[300,14,300,26],[301,18,301,22],[302,18,302,22],[310,18,310,22],[311,18,311,22],[312,18,312,22],[313,18,313,22],[325,18,325,22],[322,15,322,17],[302,15,302,17],[303,15,303,17],[304,15,304,17],[305,15,305,17],[306,15,306,17],[307,15,307,17],[308,15,308,17],[309,15,309,17],[310,15,310,17],[319,23,319,25],[320,23,320,25],[318,15,318,17],[319,15,319,17],[320,15,320,17],[321,23,321,25],[316,15,316,17],[317,15,317,17],[315,23,315,25],[316,23,316,25],[314,23,314,25],[331,18,331,22],[307,18,307,22],[308,18,308,22],[306,18,306,22],[315,18,315,22],[297,18,297,24],[303,18,303,22],[304,18,304,22],[305,18,305,22],[328,18,328,22],[326,18,326,22],[327,18,327,22],[317,18,317,22],[324,18,324,22],[320,18,320,22],[322,18,322,22],[318,18,318,22],[319,18,319,22],[328,23,328,25],[322,23,322,25],[323,23,323,25],[324,23,324,25],[325,23,325,25],[326,23,326,25],[330,18,330,22],[0,14,0,24],[8,14,8,16],[9,14,9,16],[11,14,11,16],[12,14,12,16],[14,14,14,24],[1,14,1,24],[4,14,4,24],[7,14,7,24],[314,18,314,22],[311,15,311,17],[312,15,312,17],[313,15,313,17],[323,18,323,22],[321,18,321,22],[329,18,329,22],[316,18,316,22],[309,18,309,22],[323,15,323,17],[324,15,324,17],[326,15,326,17],[327,15,327,17],[329,23,329,25],[350,23,350,25],[351,23,351,25],[352,23,352,25],[335,23,335,25],[336,23,336,25],[337,23,337,25],[338,23,338,25],[339,23,339,25],[340,23,340,25],[341,23,341,25],[342,23,342,25],[343,23,343,25],[344,23,344,25],[345,23,345,25],[346,23,346,25],[347,23,347,25],[348,23,348,25],[349,23,349,25],[325,15,325,17],[330,23,330,25],[331,23,331,25],[352,18,352,22],[288,22,288,24],[289,22,289,24],[6,12,6,13],[5,12,5,13],[12,23,12,25],[11,23,11,25],[9,19,9,22],[327,23,327,25],[302,23,302,25],[303,23,303,25],[304,23,304,25],[305,23,305,25],[306,23,306,25],[307,23,307,25],[308,23,308,25],[309,23,309,25],[310,23,310,25],[311,23,311,25],[312,23,312,25],[313,23,313,25]]}
[]
[]
[null,null,null,null,null,null,null,null,null,null,null,null,null,null,"UNIDADE ESCOLAR",null,null,null,null,null,null,null,null,"CÓDIGO INEP"]
[null,null,null,null,null,null,null,null,null,null,null,null,{"$f":"IF($M$7=\"MANUAL\",\"DESPROTEJA A PLANILHA PARA FORMATAR\",\"\")","v":""},null,"COORDENAÇÃO REGIONAL DE EDUCAÇÃO DE ITAPACI"]
[null,null,null,null,null,null,null,null,null,null,null,null,null,null,null,null,null,null,null,null,null,null,null,null,null,null,null,"DESONERADA","ONERADA","Δ%"]
["Nmax",null,null,null,null,null,null,null,null,null,null,null,null,null,"OBRA",null,null,null,"DATA",null,null,null,null,"CIDADE",null,null,null,158681.54,159370.22000000003,{"$f":"IFERROR(IF(AB6>AC6,ABS(AB6-AC6)/AB6,ABS(AC6-AB6)/AC6),\"-\")","v":4.3212590156430858E-3},{"$f":"IF(AD6>5%,\"Atentar quanto ao total para tabelas 'ONERADA' e 'DESONERADA'\",\"\")","v":""}]
[{"$f":"MAX($C$18:$C$284)","v":4},null,null,null,null,null,null,null,null,null,null,null,null,null,"CONSTRUÇÃO",null,null,null,"2020-07-07",null,null,null,null,"ITAPACI"]
[]
[null,null,null,null,null,null,null,null,null,null,null,null,null,null,"CRE",null,null,"ENDEREÇO","REFERÊNCIA AGETOP",null,null,null,null,"REFERÊNCIA SINAPI"]
[null,null,null,null,null,null,null,null,null,null,null,null,null,null,"ITAPACI",null,null,"AVENIDA DONA LÚCIA LOURENÇONI, 156, CENTRO","ABR/19","DESONERADA",null,null,null,"ABR/20","DESONERADA"]
[]
[null,null,null,null,null,null,null,null,null,null,null,null,null,null,"ÁREA EXISTENTE (M²)",null,null,"ÁREA A CONSTRUIR (M²)","ÁREA A DEMOLIR (M²)",null,null,null,null,"ÁREA TOTAL CONSTRUÍDA (M²)"]
[null,null,null,null,null,null,null,null,null,null,null,null,null,null,null,null,null,100.68,null,null,null,null,null,100.68]
[]
[null,null,null,null,null,null,null,null,null,null,null,"FILTRO",null,null,"PLANILHA ORÇAMENTÁRIA"]
["Nível E","Save Nivel","Nível C","Altura","n1","n2","n3","n4","n5","Czero","Cnível","↓","Nível","Nível Corrigido","ITEM","TABELA","CODIGO","DESCRIÇÃO DOS SERVIÇOS","UNID","QUANT","REPET","QUANT TOTAL","MAT","MO","T.SERVIÇO UNIT","VALOR TOTAL","OBSERVAÇÕES¹","TROCAR PREÇO?","FONTE","CÓDIGO","DESCRIÇÃO DO SERVIÇO","UNID","MAT","MO"]
[{"$f":"CHOOSE(1+LOG(1+2*(ORÇAMENTO.Nivel=\"Nível 1\")+4*(ORÇAMENTO.Nivel=\"Nível 2\")+8*(ORÇAMENTO.Nivel=\"Nível 3\")+16*(ORÇAMENTO.Nivel=\"Nível 4\")+32*(ORÇAMENTO.Nivel=\"Serviço\"),2),0,1,2,3,4,\"S\")","v":"S"},{"$f":"IF(OR(C17=\"s\",C17=0),OFFSET(B17,-1,0),C17)","v":"Save Nivel"},{"$f":"IF(OFFSET(C17,-1,0)=\"L\",1,IF(OFFSET(C17,-1,0)=1,2,IF(OR(A17=\"s\",A17=0),\"S\",IF(AND(OFFSET(C17,-1,0)=2,A17=4),3,IF(AND(OR(OFFSET(C17,-1,0)=\"s\",OFFSET(C17,-1,0)=0),A17<>\"s\",A17>OFFSET(B17,-1,0)),OFFSET(B17,-1,0),A17)))))","v":"S"},{"$f":"IF(OR(C17=\"S\",C17=0),0,IF(ISERROR(K17),J17,SMALL(J17:K17,1)))","v":0},{"$f":"IF($C17=1,OFFSET(E17,-1,0)+1,OFFSET(E17,-1,0))","v":"n1"},{"$f":"IF($C17=1,0,IF($C17=2,OFFSET(F17,-1,0)+1,OFFSET(F17,-1,0)))","v":"n2"},{"$f":"IF(AND($C17<=2,$C17<>0),0,IF($C17=3,OFFSET(G17,-1,0)+1,OFFSET(G17,-1,0)))","v":"n3"},{"$f":"IF(AND($C17<=3,$C17<>0),0,IF($C17=4,OFFSET(H17,-1,0)+1,OFFSET(H17,-1,0)))","v":"n4"},{"$f":"IF(AND($C17<=4,$C17<>0),0,IF(AND($C17=\"S\",$Y17>0),OFFSET(I17,-1,0)+1,OFFSET(I17,-1,0)))","v":"n5"},{"$f":"IF(OR($C17=\"S\",$C17=0),0,MATCH(0,OFFSET($D17,1,$C17,ROW($C$284)-ROW($C17)),0))","v":0},{"$f":"IF(OR($C17=\"S\",$C17=0),0,MATCH(OFFSET($D17,0,$C17)+1,OFFSET($D17,1,$C17,ROW($C$284)-ROW($C17)),0))","v":0},{"$f":"IF(OR(Y17>0,$C17=1),\"F\",\"\")","v":""},"Serviço",{"$f":"CHOOSE(1+LOG(1+2*(C17=1)+4*(C17=2)+8*(C17=3)+16*(C17=4)+32*(C17=\"S\"),2),\"\",\"Nível 1\",\"Nível 2\",\"Nível 3\",\"Nível 4\",\"Serviço\")","v":"Serviço"},"-","SINAPI",null,"(sem código)","-",null,"REPET","-",0,0,0,"-","",null,{"$f":"IFERROR(VLOOKUP(Q17,INDIRECT(\"EQUIVALÊNCIAS\"),4,FALSE),\"\")","v":""},{"$f":"IFERROR(VLOOKUP(Q17,INDIRECT(\"EQUIVALÊNCIAS\"),5,FALSE),\"\")","v":""},{"$f":"IFERROR(IF(OR($C17=0,$C17=1,$C17=2,$C17=3,$C17=4),R17,VLOOKUP($AD17,INDIRECT($AC17),2,FALSE)),\"(sem código)\")","v":"(sem código)"},{"$f":"IFERROR(VLOOKUP(AD17,INDIRECT(AC17),3,FALSE()),\"-\")","v":"-"},{"$f":"IFERROR(VLOOKUP($AD17,INDIRECT($AC17),IF($T$10=\"DESONERADA\",4,7),FALSE()),0)","v":0},{"$f":"IFERROR(VLOOKUP($AD17,INDIRECT($AC17),IF($T$10=\"DESONERADA\",5,8),FALSE()),0)","v":0}]
[0,null,"L",{"$f":"COUNTA(OFFSET(D18,1,0):D$284)","v":265},{"$f":"LEFT(O19,1)-1","v":0},null,null,null,null,null,null,"F","LOTE","LOTE","CONSTRUÇÃO - COORDENAÇÃO REGIONAL DE EDUCAÇÃO DE ITAPACI",null,null,null,null,null,null,null,null,null,null,0,null,{"$f":"O18","v":"CONSTRUÇÃO - COORDENAÇÃO REGIONAL DE EDUCAÇÃO DE ITAPACI"}]
[{"$f":"CHOOSE(1+LOG(1+2*(ORÇAMENTO.Nivel=\"Nível 1\")+4*(ORÇAMENTO.Nivel=\"Nível 2\")+8*(ORÇAMENTO.Nivel=\"Nível 3\")+16*(ORÇAMENTO.Nivel=\"Nível 4\")+32*(ORÇAMENTO.Nivel=\"Serviço\"),2),0,1,2,3,4,\"S\")","v":1},{"$f":"IF(OR(C19=\"s\",C19=0),OFFSET(B19,-1,0),C19)","v":1},{"$f":"IF(OFFSET(C19,-1,0)=\"L\",1,IF(OFFSET(C19,-1,0)=1,2,IF(OR(A19=\"s\",A19=0),\"S\",IF(AND(OFFSET(C19,-1,0)=2,A19=4),3,IF(AND(OR(OFFSET(C19,-1,0)=\"s\",OFFSET(C19,-1,0)=0),A19<>\"s\",A19>OFFSET(B19,-1,0)),OFFSET(B19,-1,0),A19)))))","v":1},{"$f":"IF(OR(C19=\"S\",C19=0),0,IF(ISERROR(K19),J19,SMALL(J19:K19,1)))","v":34},{"$f":"IF($C19=1,OFFSET(E19,-1,0)+1,OFFSET(E19,-1,0))","v":1},{"$f":"IF($C19=1,0,IF($C19=2,OFFSET(F19,-1,0)+1,OFFSET(F19,-1,0)))","v":0},{"$f":"IF(AND($C19<=2,$C19<>0),0,IF($C19=3,OFFSET(G19,-1,0)+1,OFFSET(G19,-1,0)))","v":0},{"$f":"IF(AND($C19<=3,$C19<>0),0,IF($C19=4,OFFSET(H19,-1,0)+1,OFFSET(H19,-1,0)))","v":0},{"$f":"IF(AND($C19<=4,$C19<>0),0,IF(AND($C19=\"S\",$Y19>0),OFFSET(I19,-1,0)+1,OFFSET(I19,-1,0)))","v":0},{"$f":"IF(OR($C19=\"S\",$C19=0),0,MATCH(0,OFFSET($D19,1,$C19,ROW($C$284)-ROW($C19)),0))","v":265},{"$f":"IF(OR($C19=\"S\",$C19=0),0,MATCH(OFFSET($D19,0,$C19)+1,OFFSET($D19,1,$C19,ROW($C$284)-ROW($C19)),0))","v":34},{"$f":"IF(OR(Y19>0,$C19=1),\"F\",\"\")","v":"F"},"Nível 1",{"$f":"CHOOSE(1+LOG(1+2*(C19=1)+4*(C19=2)+8*(C19=3)+16*(C19=4)+32*(C19=\"S\"),2),\"\",\"Nível 1\",\"Nível 2\",\"Nível 3\",\"Nível 4\",\"Serviço\")","v":"Nível 1"},"1.","AGETOP",null,"1 - IMPLANTAÇÃO BLOCO ADMINISTRATIVO","UN",1,1,1,null,null,0,0,null,null,null,null,{"$f":"IFERROR(IF(OR($C19=0,$C19=1,$C19=2,$C19=3,$C19=4),R19,VLOOKUP($AD19,INDIRECT($AC19),2,FALSE)),\"(sem código)\")","v":"1 - IMPLANTAÇÃO BLOCO ADMINISTRATIVO"},{"$f":"IFERROR(VLOOKUP(AD19,INDIRECT(AC19),3,FALSE()),\"-\")","v":"-"},{"$f":"IFERROR(VLOOKUP($AD19,INDIRECT($AC19),IF($T$10=\"DESONERADA\",4,7),FALSE()),0)","v":0},{"$f":"IFERROR(VLOOKUP($AD19,INDIRECT($AC19),IF($T$10=\"DESONERADA\",5,8),FALSE()),0)","v":0},null,"RESPOSTA"]
[2,2,2,6,1,1,0,0,0,33,6,"","Nível 2","Nível 2","-","AGETOP",null,"SERVIÇOS PRELIMINARES","-",null,1,"-",null,null,0,0,null,null,{"$f":"IFERROR(VLOOKUP(Q20,INDIRECT(\"EQUIVALÊNCIAS\"),4,FALSE),\"\")","v":""},{"$f":"IFERROR(VLOOKUP(Q20,INDIRECT(\"EQUIVALÊNCIAS\"),5,FALSE),\"\")","v":""},"SERVIÇOS PRELIMINARES","-",0,0,null,"SIM","NÃO"]
["S",2,"S",0,1,1,0,0,0,0,0,"","Serviço","Serviço","-","AGETOP",20121,"DEM. MANUAL EM CONCR.SIMPLES C/TR.ATE CB.E CARGA (O.C.)","m3    ",6.76,1,6.76,null,null,0,0,"",null,"","","(sem código)","-",0,0]
["S",2,"S",0,1,1,0,0,0,0,0,"","Serviço","Serviço","-","SINAPI",97622,"DEMOLIÇÃO DE ALVENARIA DE BLOCO FURADO, DE FORMA MANUAL, SEM REAPROVEITAMENTO. AF_12/2017","M3",4.18,1,4.18,null,null,0,0,"Referência: AGETOP - 20118","SIM","","","(sem código)","-",0,0]
[{"$f":"CHOOSE(1+LOG(1+2*(ORÇAMENTO.Nivel=\"Nível 1\")+4*(ORÇAMENTO.Nivel=\"Nível 2\")+8*(ORÇAMENTO.Nivel=\"Nível 3\")+16*(ORÇAMENTO.Nivel=\"Nível 4\")+32*(ORÇAMENTO.Nivel=\"Serviço\"),2),0,1,2,3,4,\"S\")","v":"S"},{"$f":"IF(OR(C23=\"s\",C23=0),OFFSET(B23,-1,0),C23)","v":2},{"$f":"IF(OFFSET(C23,-1,0)=\"L\",1,IF(OFFSET(C23,-1,0)=1,2,IF(OR(A23=\"s\",A23=0),\"S\",IF(AND(OFFSET(C23,-1,0)=2,A23=4),3,IF(AND(OR(OFFSET(C23,-1,0)=\"s\",OFFSET(C23,-1,0)=0),A23<>\"s\",A23>OFFSET(B23,-1,0)),OFFSET(B23,-1,0),A23)))))","v":"S"},{"$f":"IF(OR(C23=\"S\",C23=0),0,IF(ISERROR(K23),J23,SMALL(J23:K23,1)))","v":0},{"$f":"IF($C23=1,OFFSET(E23,-1,0)+1,OFFSET(E23,-1,0))","v":1},{"$f":"IF($C23=1,0,IF($C23=2,OFFSET(F23,-1,0)+1,OFFSET(F23,-1,0)))","v":1},{"$f":"IF(AND($C23<=2,$C23<>0),0,IF($C23=3,OFFSET(G23,-1,0)+1,OFFSET(G23,-1,0)))","v":0},{"$f":"IF(AND($C23<=3,$C23<>0),0,IF($C23=4,OFFSET(H23,-1,0)+1,OFFSET(H23,-1,0)))","v":0},{"$f":"IF(AND($C23<=4,$C23<>0),0,IF(AND($C23=\"S\",$Y23>0),OFFSET(I23,-1,0)+1,OFFSET(I23,-1,0)))","v":0},{"$f":"IF(OR($C23=\"S\",$C23=0),0,MATCH(0,OFFSET($D23,1,$C23,ROW($C$284)-ROW($C23)),0))","v":0},{"$f":"IF(OR($C23=\"S\",$C23=0),0,MATCH(OFFSET($D23,0,$C23)+1,OFFSET($D23,1,$C23,ROW($C$284)-ROW($C23)),0))","v":0},{"$f":"IF(OR(Y23>0,$C23=1),\"F\",\"\")","v":""},"Serviço",{"$f":"CHOOSE(1+LOG(1+2*(C23=1)+4*(C23=2)+8*(C23=3)+16*(C23=4)+32*(C23=\"S\"),2),\"\",\"Nível 1\",\"Nível 2\",\"Nível 3\",\"Nível 4\",\"Serviço\")","v":"Serviço"},"-","SINAPI",98529,"CORTE RASO E RECORTE DE ÁRVORE COM DIÂMETRO DE TRONCO MAIOR OU IGUAL A 0,20 M E MENOR QUE 0,40 M.AF_05/2018","UN",3,1,3,null,null,0,0,"",null,{"$f":"IFERROR(VLOOKUP(Q23,INDIRECT(\"EQUIVALÊNCIAS\"),4,FALSE),\"\")","v":""},{"$f":"IFERROR(VLOOKUP(Q23,INDIRECT(\"EQUIVALÊNCIAS\"),5,FALSE),\"\")","v":""},{"$f":"IFERROR(IF(OR($C23=0,$C23=1,$C23=2,$C23=3,$C23=4),R23,VLOOKUP($AD23,INDIRECT($AC23),2,FALSE)),\"(sem código)\")","v":"(sem código)"},{"$f":"IFERROR(VLOOKUP(AD23,INDIRECT(AC23),3,FALSE()),\"-\")","v":"-"},{"$f":"IFERROR(VLOOKUP($AD23,INDIRECT($AC23),IF($T$10=\"DESONERADA\",4,7),FALSE()),0)","v":0},{"$f":"IFERROR(VLOOKUP($AD23,INDIRECT($AC23),IF($T$10=\"DESONERADA\",5,8),FALSE()),0)","v":0}]
[{"$f":"CHOOSE(1+LOG(1+2*(ORÇAMENTO.Nivel=\"Nível 1\")+4*(ORÇAMENTO.Nivel=\"Nível 2\")+8*(ORÇAMENTO.Nivel=\"Nível 3\")+16*(ORÇAMENTO.Nivel=\"Nível 4\")+32*(ORÇAMENTO.Nivel=\"Serviço\"),2),0,1,2,3,4,\"S\")","v":"S"},{"$f":"IF(OR(C24=\"s\",C24=0),OFFSET(B24,-1,0),C24)","v":2},{"$f":"IF(OFFSET(C24,-1,0)=\"L\",1,IF(OFFSET(C24,-1,0)=1,2,IF(OR(A24=\"s\",A24=0),\"S\",IF(AND(OFFSET(C24,-1,0)=2,A24=4),3,IF(AND(OR(OFFSET(C24,-1,0)=\"s\",OFFSET(C24,-1,0)=0),A24<>\"s\",A24>OFFSET(B24,-1,0)),OFFSET(B24,-1,0),A24)))))","v":"S"},{"$f":"IF(OR(C24=\"S\",C24=0),0,IF(ISERROR(K24),J24,SMALL(J24:K24,1)))","v":0},{"$f":"IF($C24=1,OFFSET(E24,-1,0)+1,OFFSET(E24,-1,0))","v":1},{"$f":"IF($C24=1,0,IF($C24=2,OFFSET(F24,-1,0)+1,OFFSET(F24,-1,0)))","v":1},{"$f":"IF(AND($C24<=2,$C24<>0),0,IF($C24=3,OFFSET(G24,-1,0)+1,OFFSET(G24,-1,0)))","v":0},{"$f":"IF(AND($C24<=3,$C24<>0),0,IF($C24=4,OFFSET(H24,-1,0)+1,OFFSET(H24,-1,0)))","v":0},{"$f":"IF(AND($C24<=4,$C24<>0),0,IF(AND($C24=\"S\",$Y24>0),OFFSET(I24,-1,0)+1,OFFSET(I24,-1,0)))","v":0},0,0,{"$f":"IF(OR(Y24>0,$C24=1),\"F\",\"\")","v":""},"Serviço",{"$f":"CHOOSE(1+LOG(1+2*(C24=1)+4*(C24=2)+8*(C24=3)+16*(C24=4)+32*(C24=\"S\"),2),\"\",\"Nível 1\",\"Nível 2\",\"Nível 3\",\"Nível 4\",\"Serviço\")","v":"Serviço"},"-","SINAPI",98533,"PODA EM ALTURA DE ÁRVORE COM DIÂMETRO DE TRONCO MAIOR OU IGUAL A 0,20 M E MENOR QUE 0,40 M.AF_05/2018","UN",3,1,3,null,null,0,0,"",null,{"$f":"IFERROR(VLOOKUP(Q24,INDIRECT(\"EQUIVALÊNCIAS\"),4,FALSE),\"\")","v":""},{"$f":"IFERROR(VLOOKUP(Q24,INDIRECT(\"EQUIVALÊNCIAS\"),5,FALSE),\"\")","v":""},{"$f":"IFERROR(IF(OR($C24=0,$C24=1,$C24=2,$C24=3,$C24=4),R24,VLOOKUP($AD24,INDIRECT($AC24),2,FALSE)),\"(sem código)\")","v":"(sem código)"},{"$f":"IFERROR(VLOOKUP(AD24,INDIRECT(AC24),3,FALSE()),\"-\")","v":"-"},{"$f":"IFERROR(VLOOKUP($AD24,INDIRECT($AC24),IF($T$10=\"DESONERADA\",4,7),FALSE()),0)","v":0},{"$f":"IFERROR(VLOOKUP($AD24,INDIRECT($AC24),IF($T$10=\"DESONERADA\",5,8),FALSE()),0)","v":0}]
[{"$f":"CHOOSE(1+LOG(1+2*(ORÇAMENTO.Nivel=\"Nível 1\")+4*(ORÇAMENTO.Nivel=\"Nível 2\")+8*(ORÇAMENTO.Nivel=\"Nível 3\")+16*(ORÇAMENTO.Nivel=\"Nível 4\")+32*(ORÇAMENTO.Nivel=\"Serviço\"),2),0,1,2,3,4,\"S\")","v":"S"},{"$f":"IF(OR(C25=\"s\",C25=0),OFFSET(B25,-1,0),C25)","v":2},{"$f":"IF(OFFSET(C25,-1,0)=\"L\",1,IF(OFFSET(C25,-1,0)=1,2,IF(OR(A25=\"s\",A25=0),\"S\",IF(AND(OFFSET(C25,-1,0)=2,A25=4),3,IF(AND(OR(OFFSET(C25,-1,0)=\"s\",OFFSET(C25,-1,0)=0),A25<>\"s\",A25>OFFSET(B25,-1,0)),OFFSET(B25,-1,0),A25)))))","v":"S"},{"$f":"IF(OR(C25=\"S\",C25=0),0,IF(ISERROR(K25),J25,SMALL(J25:K25,1)))","v":0},{"$f":"IF($C25=1,OFFSET(E25,-1,0)+1,OFFSET(E25,-1,0))","v":1},{"$f":"IF($C25=1,0,IF($C25=2,OFFSET(F25,-1,0)+1,OFFSET(F25,-1,0)))","v":1},{"$f":"IF(AND($C25<=2,$C25<>0),0,IF($C25=3,OFFSET(G25,-1,0)+1,OFFSET(G25,-1,0)))","v":0},{"$f":"IF(AND($C25<=3,$C25<>0),0,IF($C25=4,OFFSET(H25,-1,0)+1,OFFSET(H25,-1,0)))","v":0},{"$f":"IF(AND($C25<=4,$C25<>0),0,IF(AND($C25=\"S\",$Y25>0),OFFSET(I25,-1,0)+1,OFFSET(I25,-1,0)))","v":0},{"$f":"IF(OR($C25=\"S\",$C25=0),0,MATCH(0,OFFSET($D25,1,$C25,ROW($C$284)-ROW($C25)),0))","v":0},{"$f":"IF(OR($C25=\"S\",$C25=0),0,MATCH(OFFSET($D25,0,$C25)+1,OFFSET($D25,1,$C25,ROW($C$284)-ROW($C25)),0))","v":0},{"$f":"IF(OR(Y25>0,$C25=1),\"F\",\"\")","v":""},"Serviço",{"$f":"CHOOSE(1+LOG(1+2*(C25=1)+4*(C25=2)+8*(C25=3)+16*(C25=4)+32*(C25=\"S\"),2),\"\",\"Nível 1\",\"Nível 2\",\"Nível 3\",\"Nível 4\",\"Serviço\")","v":"Serviço"},"-","SINAPI",98526,"REMOÇÃO DE RAÍZES REMANESCENTES DE TRONCO DE ÁRVORE COM DIÂMETRO MAIOR OU IGUAL A 0,20 M E MENOR QUE 0,40 M.AF_05/2018","UN",3,1,3,null,null,0,0,"",null,{"$f":"IFERROR(VLOOKUP(Q25,INDIRECT(\"EQUIVALÊNCIAS\"),4,FALSE),\"\")","v":""},{"$f":"IFERROR(VLOOKUP(Q25,INDIRECT(\"EQUIVALÊNCIAS\"),5,FALSE),\"\")","v":""},{"$f":"IFERROR(IF(OR($C25=0,$C25=1,$C25=2,$C25=3,$C25=4),R25,VLOOKUP($AD25,INDIRECT($AC25),2,FALSE)),\"(sem código)\")","v":"(sem código)"},{"$f":"IFERROR(VLOOKUP(AD25,INDIRECT(AC25),3,FALSE()),\"-\")","v":"-"},{"$f":"IFERROR(VLOOKUP($AD25,INDIRECT($AC25),IF($T$10=\"DESONERADA\",4,7),FALSE()),0)","v":0},{"$f":"IFERROR(VLOOKUP($AD25,INDIRECT($AC25),IF($T$10=\"DESONERADA\",5,8),FALSE()),0)","v":0}]
[2,2,2,3,1,2,0,0,0,27,3,"","Nível 2","Nível 2","-","AGETOP",null,"TRANSPORTES","-",null,1,"-",null,null,0,0,"",null,"","","TRANSPORTES","-",0,0]
["S",2,"S",0,1,2,0,0,0,0,0,"","Serviço","Serviço","-","SINAPI",72900,"TRANSPORTE DE ENTULHO COM CAMINHAO BASCULANTE 6 M3, RODOVIA PAVIMENTADA, DMT 0,5 A 1,0 KM","M3",11.39,1,11.39,null,null,0,0,"","NÃO","","","(sem código)","-",0,0]
["S",2,"S",0,1,2,0,0,0,0,0,"","Serviço","Serviço","-","SINAPI",72897,"CARGA MANUAL DE ENTULHO EM CAMINHAO BASCULANTE 6 M3","M3",11.39,1,11.39,null,null,0,0,"","NÃO","","","(sem código)","-",0,0]
[2,2,2,2,1,3,0,0,0,24,2,"","Nível 2","Nível 2","-","SINAPI",null,"DIVERSOS","-",null,1,"-",null,null,0,0,"",null,"","","DIVERSOS","-",0,0]
["S",2,"S",0,1,3,0,0,0,0,0,"","Serviço","Serviço","-","COMPOSIÇÃO","COMP 405_SEE","SERRALHEIRO","H",2,1,2,null,null,0,0,"",null,"","","(sem código)","-",0,0]
[2,2,2,2,1,4,0,0,0,22,2,"","Nível 2","Nível 2","-","SINAPI",null,"ALVENARIAS E DIVISÓRIAS","-",null,1,"-",null,null,0,0,"",null,"","","ALVENARIAS E DIVISÓRIAS","-",0,0]
["S",2,"S",0,1,4,0,0,0,0,0,"","Serviço","Serviço","-","AGETOP",100201,"ALVENARIA DE TIJOLO FURADO 1/2 VEZ - 9 x 19 x 19 - ARG. (1CALH:4ARML+100KG DE CI/M3)","m2    ",45,1,45,null,null,0,0,"",null,"","","(sem código)","-",0,0]
[2,2,2,3,1,5,0,0,0,20,3,"","Nível 2","Nível 2","-","SINAPI",null,"REVESTIMENTO DE PAREDE","-",null,1,"-",null,null,0,0,"",null,"","","REVESTIMENTO DE PAREDE","-",0,0]
["S",2,"S",0,1,5,0,0,0,0,0,"","Serviço","Serviço","-","AGETOP",200101,"CHAPISCO COMUM","m2    ",90,1,90,null,null,0,0,"",null,"","","(sem código)","-",0,0]
["S",2,"S",0,1,5,0,0,0,0,0,"","Serviço","Serviço","-","AGETOP",200499,"REBOCO PAULISTA A-14 (1CALH:4ARMLC+100kgCI/M3)","m2    ",113.3,1,113.3,null,null,0,0,"",null,"","","(sem código)","-",0,0]
[2,2,2,7,1,6,0,0,0,17,7,"","Nível 2","Nível 2","-","SINAPI",null,"PINTURA","-",null,1,"-",null,null,0,0,"",null,"","","PINTURA","-",0,0]
[3,3,3,2,1,6,1,0,0,6,2,"","Nível 3","Nível 3","-","SINAPI",null,"MURO","-",null,1,"-",null,null,0,0,"",null,"","","MURO","-",0,0]
["S",3,"S",0,1,6,1,0,0,0,0,"","Serviço","Serviço","-","AGETOP",261000,"PINTURA LATEX ACRILICA 2 DEMAOS C/SELADOR","m2    ",289.68,1,289.68,null,null,0,0,"",null,"","","(sem código)","-",0,0]
[3,3,3,2,1,6,2,0,0,4,2,"","Nível 3","Nível 3","-","SINAPI",null,"OUTROS","-",null,1,"-",null,null,0,0,"",null,"","","OUTROS","-",0,0]
["S",3,"S",0,1,6,2,0,0,0,0,"","Serviço","Serviço","-","AGETOP",261620,"LETREIRO MÉDIO A GRANDE PORTE EM PAREDE FEITO A PINCEL","m2    ",7.2,1,7.2,null,null,0,0,"",null,"","","(sem código)","-",0,0]
[3,3,3,2,1,6,3,0,0,2,42,"","Nível 3","Nível 3","-","SINAPI",null,"ESQUADRIAS NOVAS","-",null,1,"-",null,null,0,0,"",null,"","","ESQUADRIAS NOVAS","-",0,0]
["S",3,"S",0,1,6,3,0,0,0,0,"","Serviço","Serviço","-","AGETOP",261602,"PINT.ESMALTE/ESQUAD.FERRO C/FUNDO ANTICOR.","m2    ",6,1,6,null,null,0,0,"",null,"","","(sem código)","-",0,0]
[2,2,2,2,1,7,0,0,0,10,2,"","Nível 2","Nível 2","-","SINAPI",null,"ESQUADRIAS METÁLICAS","-",null,1,"-",null,null,0,0,"",null,"","","ESQUADRIAS METÁLICAS","-",0,0]
["S",2,"S",0,1,7,0,0,0,0,0,"","Serviço","Serviço","-","AGETOP",180307,"PORTAO /CHAPA TRAPEZ / TUBO DE ACO PT-5 C/FERRAGEM","m2    ",2,1,2,null,null,0,0,"",null,"","","(sem código)","-",0,0]
[2,2,2,8,1,8,0,0,0,8,{"$error":"#N/A"},"","Nível 2","Nível 2","-","AGETOP",null,"SERVIÇO EM TERRA","-",null,1,"-",null,null,0,0,"",null,"","","SERVIÇO EM TERRA","-",0,0]
[3,3,3,7,1,8,1,0,0,7,32,"","Nível 3","Nível 3","-",null,null,"AQUISIÇÃO DE TERRA (SOMENTE ATERRO)","-",null,1,"-",null,null,0,0,"",null,"","","AQUISIÇÃO DE TERRA (SOMENTE ATERRO)","-",0,0]
["S",3,"S",0,1,8,1,0,0,0,0,"","Serviço","Serviço","-","AGETOP",41004,"ESCAVACAO MECANICA","m3    ",53.8125,1,53.8125,null,null,0,0,"",null,"","","(sem código)","-",0,0]
["S",3,"S",0,1,8,1,0,0,0,0,"","Serviço","Serviço","-","AGETOP",41005,"CARGA MECANIZADA","m3    ",53.8125,1,53.8125,null,null,0,0,"",null,"","","(sem código)","-",0,0]
["S",3,"S",0,1,8,1,0,0,0,0,"","Serviço","Serviço","-","AGETOP",41012,"INDENIZAÇÃO DE JAZIDA","m3    ",53.8125,1,53.8125,null,null,0,0,"",null,"","","(sem código)","-",0,0]
["S",3,"S",0,1,8,1,0,0,0,0,"","Serviço","Serviço","-","AGETOP",41006,"TRANSPORTE DE MATERIAL ESCAVADO M3.KM","m3km  ",53.8125,1,53.8125,null,null,0,0,"",null,"","","(sem código)","-",0,0]
["S",3,"S",0,1,8,1,0,0,0,0,"","Serviço","Serviço","-","AGETOP",41140,"REGULARIZAÇÃO DO TERRENO SEM APILOAMENTO COM TRANSPORTE MANUAL DA TERRA ESCAVADA ","m2    ",205,1,205,null,null,0,0,"",null,"","","(sem código)","-",0,0]
["S",3,"S",0,1,8,1,0,0,0,0,"","Serviço","Serviço","-","AGETOP",40905,"APILOAMENTO MECÂNICO","m2    ",205,1,205,null,null,0,0,"",null,"","","(sem código)","-",0,0]
[1,1,1,46,2,0,0,0,0,231,46,"F","Nível 1","Nível 1","2.","SINAPI",null,"1.1 - NOVO BLOCO ADMINISTRATIVO","UN",1,1,1,null,null,0,0,"",null,"","","1.1 - NOVO BLOCO ADMINISTRATIVO","-",0,0]
[2,2,2,2,2,1,0,0,0,45,2,"","Nível 2","Nível 2","-","SINAPI",null,"ALVENARIAS E DIVISÓRIAS","-",null,1,"-",null,null,0,0,"",null,"","","ALVENARIAS E DIVISÓRIAS","-",0,0]
["S",2,"S",0,2,1,0,0,0,0,0,"","Serviço","Serviço","-","AGETOP",100201,"ALVENARIA DE TIJOLO FURADO 1/2 VEZ - 9 x 19 x 19 - ARG. (1CALH:4ARML+100KG DE CI/M3)","m2    ",160.25,1,160.25,null,null,0,0,"",null,"","","(sem código)","-",0,0]
[2,2,2,5,2,2,0,0,0,43,5,"","Nível 2","Nível 2","-","SINAPI",null,"REVESTIMENTO DE PAREDE","-",null,1,"-",null,null,0,0,"",null,"","","REVESTIMENTO DE PAREDE","-",0,0]
["S",2,"S",0,2,2,0,0,0,0,0,"","Serviço","Serviço","-","AGETOP",200101,"CHAPISCO COMUM","m2    ",320.5,1,320.5,null,null,0,0,"",null,"","","(sem código)","-",0,0]
["S",2,"S",0,2,2,0,0,0,0,0,"","Serviço","Serviço","-","AGETOP",200499,"REBOCO PAULISTA A-14 (1CALH:4ARMLC+100kgCI/M3)","m2    ",265.98,1,265.98,null,null,0,0,"",null,"","","(sem código)","-",0,0]
["S",2,"S",0,2,2,0,0,0,0,0,"","Serviço","Serviço","-","SINAPI",87553,"EMBOÇO, PARA RECEBIMENTO DE CERÂMICA, EM ARGAMASSA TRAÇO 1:2:8, PREPARO MECÂNICO COM BETONEIRA 400L, APLICADO MANUALMENTE EM FACES INTERNAS DE PAREDES, PARA AMBIENTE COM ÁREA MAIOR QUE 10M2, ESPESSURA DE 10MM, COM EXECUÇÃO DE TALISCAS. AF_06/2014","M2",54.52,1,54.52,null,null,0,0,"","NÃO","","","(sem código)","-",0,0]
["S",2,"S",0,2,2,0,0,0,0,0,"","Serviço","Serviço","-","SINAPI",87273,"REVESTIMENTO CERÂMICO PARA PAREDES INTERNAS COM PLACAS TIPO ESMALTADA EXTRA DE DIMENSÕES 33X45 CM APLICADAS EM AMBIENTES DE ÁREA MAIOR QUE 5 M² NA ALTURA INTEIRA DAS PAREDES. AF_06/2014","M2",54.52,1,54.52,null,null,0,0,"","NÃO","","","(sem código)","-",0,0]
[2,2,2,7,2,3,0,0,0,38,7,"","Nível 2","Nível 2","-","SINAPI",null,"ESQUADRIAS METÁLICAS","-",null,1,"-",null,null,0,0,"",null,"","","ESQUADRIAS METÁLICAS","-",0,0]
["S",2,"S",0,2,3,0,0,0,0,0,"","Serviço","Serviço","-","AGETOP",180501,"PORTA DE ABRIR EM CHAPA PF-1 C/FERRAGENS","m2    ",13.86,1,13.86,null,null,0,0,"",null,"","","(sem código)","-",0,0]
["S",2,"S",0,2,3,0,0,0,0,0,"","Serviço","Serviço","-","AGETOP",180380,"ESQ. MAXIMO AR CHAPA/VIDRO J4 C/FERRAGENS","m2    ",0.5,1,0.5,null,null,0,0,"",null,"","","(sem código)","-",0,0]
["S",2,"S",0,2,3,0,0,0,0,0,"","Serviço","Serviço","-","AGETOP",180401,"ESQ.DE CORRER CHAPA/VIDRO J9/J10/J12/J13 C/FERRAGENS","m2    ",10.08,1,10.08,null,null,0,0,"",null,"","","(sem código)","-",0,0]
["S",2,"S",0,2,3,0,0,0,0,0,"","Serviço","Serviço","-","AGETOP",180208,"GRADE PROTECAO TIPO TIJOLINHO GP-1/GP-2","m2    ",15.75,1,15.75,null,null,0,0,"",null,"","","(sem código)","-",0,0]
[{"$f":"CHOOSE(1+LOG(1+2*(ORÇAMENTO.Nivel=\"Nível 1\")+4*(ORÇAMENTO.Nivel=\"Nível 2\")+8*(ORÇAMENTO.Nivel=\"Nível 3\")+16*(ORÇAMENTO.Nivel=\"Nível 4\")+32*(ORÇAMENTO.Nivel=\"Serviço\"),2),0,1,2,3,4,\"S\")","v":"S"},{"$f":"IF(OR(C66=\"s\",C66=0),OFFSET(B66,-1,0),C66)","v":2},{"$f":"IF(OFFSET(C66,-1,0)=\"L\",1,IF(OFFSET(C66,-1,0)=1,2,IF(OR(A66=\"s\",A66=0),\"S\",IF(AND(OFFSET(C66,-1,0)=2,A66=4),3,IF(AND(OR(OFFSET(C66,-1,0)=\"s\",OFFSET(C66,-1,0)=0),A66<>\"s\",A66>OFFSET(B66,-1,0)),OFFSET(B66,-1,0),A66)))))","v":"S"},{"$f":"IF(OR(C66=\"S\",C66=0),0,IF(ISERROR(K66),J66,SMALL(J66:K66,1)))","v":0},{"$f":"IF($C66=1,OFFSET(E66,-1,0)+1,OFFSET(E66,-1,0))","v":2},{"$f":"IF($C66=1,0,IF($C66=2,OFFSET(F66,-1,0)+1,OFFSET(F66,-1,0)))","v":3},{"$f":"IF(AND($C66<=2,$C66<>0),0,IF($C66=3,OFFSET(G66,-1,0)+1,OFFSET(G66,-1,0)))","v":0},{"$f":"IF(AND($C66<=3,$C66<>0),0,IF($C66=4,OFFSET(H66,-1,0)+1,OFFSET(H66,-1,0)))","v":0},{"$f":"IF(AND($C66<=4,$C66<>0),0,IF(AND($C66=\"S\",$Y66>0),OFFSET(I66,-1,0)+1,OFFSET(I66,-1,0)))","v":0},0,0,{"$f":"IF(OR(Y66>0,$C66=1),\"F\",\"\")","v":""},"Serviço",{"$f":"CHOOSE(1+LOG(1+2*(C66=1)+4*(C66=2)+8*(C66=3)+16*(C66=4)+32*(C66=\"S\"),2),\"\",\"Nível 1\",\"Nível 2\",\"Nível 3\",\"Nível 4\",\"Serviço\")","v":"Serviço"},"-","AGETOP",230174,"BARRA DE APOIO EM AÇO INOX - 40 CM","un    ",4,1,4,null,null,0,0,"",null,{"$f":"IFERROR(VLOOKUP(Q66,INDIRECT(\"EQUIVALÊNCIAS\"),4,FALSE),\"\")","v":""},{"$f":"IFERROR(VLOOKUP(Q66,INDIRECT(\"EQUIVALÊNCIAS\"),5,FALSE),\"\")","v":""},{"$f":"IFERROR(IF(OR($C66=0,$C66=1,$C66=2,$C66=3,$C66=4),R66,VLOOKUP($AD66,INDIRECT($AC66),2,FALSE)),\"(sem código)\")","v":"(sem código)"},{"$f":"IFERROR(VLOOKUP(AD66,INDIRECT(AC66),3,FALSE()),\"-\")","v":"-"},{"$f":"IFERROR(VLOOKUP($AD66,INDIRECT($AC66),IF($T$10=\"DESONERADA\",4,7),FALSE()),0)","v":0},{"$f":"IFERROR(VLOOKUP($AD66,INDIRECT($AC66),IF($T$10=\"DESONERADA\",5,8),FALSE()),0)","v":0}]
[{"$f":"CHOOSE(1+LOG(1+2*(ORÇAMENTO.Nivel=\"Nível 1\")+4*(ORÇAMENTO.Nivel=\"Nível 2\")+8*(ORÇAMENTO.Nivel=\"Nível 3\")+16*(ORÇAMENTO.Nivel=\"Nível 4\")+32*(ORÇAMENTO.Nivel=\"Serviço\"),2),0,1,2,3,4,\"S\")","v":"S"},2,"S",0,2,3,0,0,0,0,0,"","Serviço","Serviço","-","AGETOP",230176,"BARRA DE APOIO EM AÇO INOX - 80 CM ","un    ",3,1,3,null,null,0,0,"",null,"","","(sem código)","-",0,0]
[2,2,2,2,2,4,0,0,0,31,2,"","Nível 2","Nível 2","-","SINAPI",null,"VIDROS","-",null,1,"-",null,null,0,0,"",null,"","","VIDROS","-",0,0]
["S",2,"S",0,2,4,0,0,0,0,0,"","Serviço","Serviço","-","SINAPI",72117,"VIDRO LISO COMUM TRANSPARENTE, ESPESSURA 4MM","M2",10.58,1,10.58,null,null,0,0,"Referência: AGETOP - 190102","SIM","","","(sem código)","-",0,0]
[2,2,2,4,2,5,0,0,0,29,4,"","Nível 2","Nível 2","-","SINAPI",null,"DIVERSOS","-",null,1,"-",null,null,0,0,"",null,"","","DIVERSOS","-",0,0]
["S",2,"S",0,2,5,0,0,0,0,0,"","Serviço","Serviço","-","COMPOSIÇÃO","COMP 415_SEE","PEITORIL EM GRANITO CINZA, LARGURA VARIÁVEL E PINGADEIRA","M2",1.89,1,1.89,null,null,0,0,"",null,"","","(sem código)","-",0,0]
["S",2,"S",0,2,5,0,0,0,0,0,"","Serviço","Serviço","-","AGETOP",60010,"VERGA/CONTRAVERGA EM CONCRETO ARMADO FCK = 20 MPA","m3    ",0.21200000000000002,1,0.21200000000000002,null,null,0,0,"",null,"","","(sem código)","-",0,0]
[{"$f":"CHOOSE(1+LOG(1+2*(ORÇAMENTO.Nivel=\"Nível 1\")+4*(ORÇAMENTO.Nivel=\"Nível 2\")+8*(ORÇAMENTO.Nivel=\"Nível 3\")+16*(ORÇAMENTO.Nivel=\"Nível 4\")+32*(ORÇAMENTO.Nivel=\"Serviço\"),2),0,1,2,3,4,\"S\")","v":"S"},{"$f":"IF(OR(C73=\"s\",C73=0),OFFSET(B73,-1,0),C73)","v":2},{"$f":"IF(OFFSET(C73,-1,0)=\"L\",1,IF(OFFSET(C73,-1,0)=1,2,IF(OR(A73=\"s\",A73=0),\"S\",IF(AND(OFFSET(C73,-1,0)=2,A73=4),3,IF(AND(OR(OFFSET(C73,-1,0)=\"s\",OFFSET(C73,-1,0)=0),A73<>\"s\",A73>OFFSET(B73,-1,0)),OFFSET(B73,-1,0),A73)))))","v":"S"},{"$f":"IF(OR(C73=\"S\",C73=0),0,IF(ISERROR(K73),J73,SMALL(J73:K73,1)))","v":0},{"$f":"IF($C73=1,OFFSET(E73,-1,0)+1,OFFSET(E73,-1,0))","v":2},{"$f":"IF($C73=1,0,IF($C73=2,OFFSET(F73,-1,0)+1,OFFSET(F73,-1,0)))","v":5},{"$f":"IF(AND($C73<=2,$C73<>0),0,IF($C73=3,OFFSET(G73,-1,0)+1,OFFSET(G73,-1,0)))","v":0},{"$f":"IF(AND($C73<=3,$C73<>0),0,IF($C73=4,OFFSET(H73,-1,0)+1,OFFSET(H73,-1,0)))","v":0},{"$f":"IF(AND($C73<=4,$C73<>0),0,IF(AND($C73=\"S\",$Y73>0),OFFSET(I73,-1,0)+1,OFFSET(I73,-1,0)))","v":0},0,0,{"$f":"IF(OR(Y73>0,$C73=1),\"F\",\"\")","v":""},"Serviço",{"$f":"CHOOSE(1+LOG(1+2*(C73=1)+4*(C73=2)+8*(C73=3)+16*(C73=4)+32*(C73=\"S\"),2),\"\",\"Nível 1\",\"Nível 2\",\"Nível 3\",\"Nível 4\",\"Serviço\")","v":"Serviço"},"-","AGETOP",271608,"BANCADA DE GRANITO C/ESPELHO","m2    ",0.72,1,0.72,null,null,0,0,"",null,{"$f":"IFERROR(VLOOKUP(Q73,INDIRECT(\"EQUIVALÊNCIAS\"),4,FALSE),\"\")","v":""},{"$f":"IFERROR(VLOOKUP(Q73,INDIRECT(\"EQUIVALÊNCIAS\"),5,FALSE),\"\")","v":""},{"$f":"IFERROR(IF(OR($C73=0,$C73=1,$C73=2,$C73=3,$C73=4),R73,VLOOKUP($AD73,INDIRECT($AC73),2,FALSE)),\"(sem código)\")","v":"(sem código)"},{"$f":"IFERROR(VLOOKUP(AD73,INDIRECT(AC73),3,FALSE()),\"-\")","v":"-"},{"$f":"IFERROR(VLOOKUP($AD73,INDIRECT($AC73),IF($T$10=\"DESONERADA\",4,7),FALSE()),0)","v":0},{"$f":"IFERROR(VLOOKUP($AD73,INDIRECT($AC73),IF($T$10=\"DESONERADA\",5,8),FALSE()),0)","v":0}]
[2,2,2,13,2,6,0,0,0,25,13,"","Nível 2","Nível 2","-",null,null,"PINTURA","-",null,1,"-",null,null,0,0,"",null,"","","PINTURA","-",0,0]
[3,3,3,3,2,6,1,0,0,12,3,"","Nível 3","Nível 3","-","AGETOP",null,"LÁTEX ACRÍLICA","-",null,1,"-",null,null,0,0,"",null,"","","LÁTEX ACRÍLICA","-",0,0]
["S",3,"S",0,2,6,1,0,0,0,0,"","Serviço","Serviço","-","AGETOP",261300,"EMASSAMENTO COM MASSA PVA DUAS DEMAOS","m2    ",292.41000000000003,1,292.41000000000003,null,null,0,0,"",null,"","","(sem código)","-",0,0]
["S",3,"S",0,2,6,1,0,0,0,0,"","Serviço","Serviço","-","AGETOP",261001,"PINTURA LATEX ACRILICO 2 DEMAOS","m2    ",182.41,1,182.41,null,null,0,0,"",null,"","","(sem código)","-",0,0]
[3,3,3,3,2,6,2,0,0,9,3,"","Nível 3","Nível 3","-","AGETOP",null,"TETO","-",null,1,"-",null,null,0,0,"",null,"","","TETO","-",0,0]
["S",3,"S",0,2,6,2,0,0,0,0,"","Serviço","Serviço","-","AGETOP",261300,"EMASSAMENTO COM MASSA PVA DUAS DEMAOS","m2    ",66.599999999999994,1,66.599999999999994,null,null,0,0,"",null,"","","(sem código)","-",0,0]
["S",3,"S",0,2,6,2,0,0,0,0,"","Serviço","Serviço","-","AGETOP",261307,"PINTURA PVA LATEX 2 DEMAOS SEM SELADOR","m2    ",66.599999999999994,1,66.599999999999994,null,null,0,0,"",null,"","","(sem código)","-",0,0]
[3,3,3,2,2,6,3,0,0,6,2,"","Nível 3","Nível 3","-","AGETOP",null,"EXTERNA","-",null,1,"-",null,null,0,0,"",null,"","","EXTERNA","-",0,0]
["S",3,"S",0,2,6,3,0,0,0,0,"","Serviço","Serviço","-","AGETOP",261000,"PINTURA LATEX ACRILICA 2 DEMAOS C/SELADOR","m2    ",110,1,110,null,null,0,0,"",null,"","","(sem código)","-",0,0]
[3,3,3,2,2,6,4,0,0,4,2,"","Nível 3","Nível 3","-","AGETOP",null,"ESQUADRIAS NOVAS","-",null,1,"-",null,null,0,0,"",null,"","","ESQUADRIAS NOVAS","-",0,0]
["S",3,"S",0,2,6,4,0,0,0,0,"","Serviço","Serviço","-","AGETOP",261602,"PINT.ESMALTE/ESQUAD.FERRO C/FUNDO ANTICOR.","m2    ",86.37,1,86.37,null,null,0,0,"",null,"","","(sem código)","-",0,0]
[3,3,3,2,2,6,5,0,0,{"$f":"IF(OR($C85=\"S\",$C85=0),0,MATCH(0,OFFSET($D85,1,$C85,ROW($C$284)-ROW($C85)),0))","v":2},{"$f":"IF(OR($C85=\"S\",$C85=0),0,MATCH(OFFSET($D85,0,$C85)+1,OFFSET($D85,1,$C85,ROW($C$284)-ROW($C85)),0))","v":{"$error":"#N/A"}},"","Nível 3","Nível 3","-","SINAPI",null,"ESTRUTURA METÁLICA","-",null,1,"-",null,null,0,0,"",null,"","","ESTRUTURA METÁLICA","-",0,0]
["S",3,"S",0,2,6,5,0,0,0,0,"","Serviço","Serviço","-","AGETOP",261609,"PINTURA ESMALTE ALQUIDICO ESTR.METALICA 2 DEMAOS","m2    ",135.21,1,135.21,null,null,0,0,"",null,"","","(sem código)","-",0,0]
[2,2,2,7,2,7,0,0,0,12,7,"","Nível 2","Nível 2","-","SINAPI",null,"REVESTIMENTO DE PISO","-",null,1,"-",null,null,0,0,"",null,"","","REVESTIMENTO DE PISO","-",0,0]
[3,3,3,4,2,7,1,0,0,6,4,"","Nível 3","Nível 3","-",null,null,"GRANITINA","-",null,1,"-",null,null,0,0,"",null,"","","GRANITINA","-",0,0]
["S",3,"S",0,2,7,1,0,0,0,0,"","Serviço","Serviço","-","AGETOP",221101,"GRANITINA 8MM FUNDIDA COM CONTRAPISO (1CI:3ARML) E=2CM E JUNTA PLASTICA 27MM","m2    ",90.8,1,90.8,null,null,0,0,"",null,"","","(sem código)","-",0,0]
["S",3,"S",0,2,7,1,0,0,0,0,"","Serviço","Serviço","-","AGETOP",221104,"RASPAGEM E APLICAÇÃO RESINA ACRÍLICA DUAS DEMÃOS","m2    ",96.1,1,96.1,null,null,0,0,"",null,"","","(sem código)","-",0,0]
["S",3,"S",0,2,7,1,0,0,0,0,"","Serviço","Serviço","-","AGETOP",221102,"RODAPÉ FUNDIDO DE GRANITINA 7CM","m     ",75.709999999999994,1,75.709999999999994,null,null,0,0,"",null,"","","(sem código)","-",0,0]
[3,3,3,2,2,7,2,0,0,2,112,"","Nível 3","Nível 3","-","SINAPI",null,"CALÇADA","-",null,1,"-",null,null,0,0,"",null,"","","CALÇADA","-",0,0]
["S",3,"S",0,2,7,2,0,0,0,0,"","Serviço","Serviço","-","SINAPI",94993,"EXECUÇÃO DE PASSEIO (CALÇADA) OU PISO DE CONCRETO COM CONCRETO MOLDADO IN LOCO, USINADO, ACABAMENTO CONVENCIONAL, ESPESSURA 6 CM, ARMADO. AF_07/2016","M2",34.65,1,34.65,null,null,0,0,"",null,"","","(sem código)","-",0,0]
[2,2,2,5,2,8,0,0,0,5,{"$error":"#N/A"},"","Nível 2","Nível 2","-","SINAPI",null,"COBERTURAS","-",null,1,"-",null,null,0,0,"",null,"","","COBERTURAS","-",0,0]
["S",2,"S",0,2,8,0,0,0,0,0,"","Serviço","Serviço","-","AGETOP",160100,"COBERTURA COM TELHA AMERICANA  RESINADA COR VERMELHA","m2    ",135.21,1,135.21,null,null,0,0,"",null,"","","(sem código)","-",0,0]
["S",2,"S",0,2,8,0,0,0,0,0,"","Serviço","Serviço","-","AGETOP",160403,"EMBOCAMENTO LATERAL  (OITOES)","m     ",19.8,1,19.8,null,null,0,0,"",null,"","","(sem código)","-",0,0]
["S",2,"S",0,2,8,0,0,0,0,0,"","Serviço","Serviço","-","AGETOP",160404,"EMBOCAMENTO DE BEIRAL","M     ",26.7,1,26.7,null,null,0,0,"",null,"","","(sem código)","-",0,0]
["S",2,"S",0,2,8,0,0,0,0,0,"","Serviço","Serviço","-","AGETOP",160101,"CUMEEIRA PARA TELHA AMERICANA RESINADA COR VERMELHA","m     ",13.35,1,13.35,null,null,0,0,"",null,"","","(sem código)","-",0,0]
[1,1,1,5,3,0,0,0,0,185,5,"F","Nível 1","Nível 1","3.","SINAPI",null,"ADMINISTRAÇÃO LOCAL","UN",1,1,1,null,null,0,0,"",null,"","","ADMINISTRAÇÃO LOCAL","-",0,0]
[2,2,2,4,3,1,0,0,0,4,13,"","Nível 2","Nível 2","-",null,null,"ADMINISTRAÇÃO","-",null,1,"-",null,null,0,0,"",null,"","","ADMINISTRAÇÃO","-",0,0]
[3,3,3,3,3,1,1,0,0,3,74,"","Nível 3","Nível 3","-",null,null,"MENSALISTAS","-",null,1,"-",null,null,0,0,"",null,"","","MENSALISTAS","-",0,0]
["S",3,"S",0,3,1,1,0,0,0,0,"","Serviço","Serviço","-","SINAPI",90778,"ENGENHEIRO CIVIL DE OBRA PLENO COM ENCARGOS COMPLEMENTARES","H",20,1,20,null,null,0,0,"Referência: AGETOP - 250101","SIM","","","(sem código)","-",0,0]
["S",3,"S",0,3,1,1,0,0,0,0,"","Serviço","Serviço","-","SINAPI",90776,"ENCARREGADO GERAL COM ENCARGOS COMPLEMENTARES","H",330,1,330,null,null,0,0,"Referência: AGETOP - 250103","SIM","","","(sem código)","-",0,0]
[1,1,1,5,4,0,0,0,0,180,5,"F","Nível 1","Nível 1","4.","SINAPI",null,"OBRA","UN",1,1,1,null,null,0,0,"",null,"","","OBRA","-",0,0]
[2,2,2,4,4,1,0,0,0,4,8,"","Nível 2","Nível 2","-","SINAPI",null,"DIVERSOS","-",null,1,"-",null,null,0,0,"",null,"","","DIVERSOS","-",0,0]
["S",2,"S",0,4,1,0,0,0,0,0,"","Serviço","Serviço","-","AGETOP",270501,"LIMPEZA FINAL DE OBRA - (OBRAS CIVIS)","m2    ",100,1,100,null,null,0,0,"",null,"","","(sem código)","-",0,0]
["S",2,"S",0,4,1,0,0,0,0,0,"","Serviço","Serviço","-","AGETOP",21301,"PLACA DE OBRA PLOTADA EM CHAPA METÁLICA 26 , AFIXADA EM CAVALETES DE MADEIRA DE LEI (VIGOTAS 6X12CM) - PADRÃO GOINFRA","m2    ",7.5,1,7.5,null,null,0,0,"",null,"","","(sem código)","-",0,0]
["S",2,"S",0,4,1,0,0,0,0,0,"","Serviço","Serviço","-","AGETOP",270804,"PLACA DE INAUGURAÇÃO AÇO ESCOVADO 60 X 120 CM","un    ",1,1,1,null,null,0,0,"",null,"","","(sem código)","-",0,0]
[1,1,1,36,5,0,0,0,0,175,36,"F","Nível 1","Nível 1","5.","AGETOP",null,"PROJETO ELÉTRICO","UN",1,1,1,null,null,0,0,"",null,"","","PROJETO ELÉTRICO","-",0,0]
[2,2,2,3,5,1,0,0,0,35,3,"","Nível 2","Nível 2","-","AGETOP",null,"SERVIÇO EM TERRA","-",null,1,"-",null,null,0,0,"",null,"","","SERVIÇO EM TERRA","-",0,0]
["S",2,"S",0,5,1,0,0,0,0,0,"","Serviço","Serviço","-","SINAPI",93358,"ESCAVAÇÃO MANUAL DE VALA COM PROFUNDIDADE MENOR OU IGUAL A 1,30 M. AF_03/2016","M3",12.6,1,12.6,null,null,0,0,"Referência: AGETOP - 40101","SIM","","","(sem código)","-",0,0]
["S",2,"S",0,5,1,0,0,0,0,0,"","Serviço","Serviço","-","SINAPI",96995,"REATERRO MANUAL APILOADO COM SOQUETE. AF_10/2017","M3",12.6,1,12.6,null,null,0,0,"Referência: AGETOP - 40902","SIM","","","(sem código)","-",0,0]
[2,2,2,32,5,2,0,0,0,32,130,"","Nível 2","Nível 2","-",null,null,"INSTALAÇÕES ELÉTRICAS","-",null,1,"-",null,null,0,0,"",null,"","","INSTALAÇÕES ELÉTRICAS","-",0,0]
["S",2,"S",0,5,2,0,0,0,0,0,"","Serviço","Serviço","-","AGETOP",70374,"BRACADEIRA METALICA TIPO \"D\" DIAM. 1.1/2\"","Un    ",60,1,60,null,null,0,0,"",null,"","","(sem código)","-",0,0]
["S",2,"S",0,5,2,0,0,0,0,0,"","Serviço","Serviço","-","AGETOP",70424,"BUCHA E ARRUELA METALICA DIAM. 1.1/2\"","PR    ",60,1,60,null,null,0,0,"",null,"","","(sem código)","-",0,0]
["S",2,"S",0,5,2,0,0,0,0,0,"","Serviço","Serviço","-","AGETOP",71254,"ELETRODUTO EM AÇO ZINCADO DIÂMETRO 1.1/2\"","M     ",90,1,90,null,null,0,0,"",null,"","","(sem código)","-",0,0]
["S",2,"S",0,5,2,0,0,0,0,0,"","Serviço","Serviço","-","AGETOP",71724,"LUVA EM AÇO ZINCADO DIÂMETRO 1.1/2\"","Un    ",16,1,16,null,null,0,0,"",null,"","","(sem código)","-",0,0]
["S",2,"S",0,5,2,0,0,0,0,0,"","Serviço","Serviço","-","AGETOP",71124,"CURVA 90 GRAUS AÇO ZINCADO DIÂMETRO 1.1/2\"","Un    ",8,1,8,null,null,0,0,"",null,"","","(sem código)","-",0,0]
["S",2,"S",0,5,2,0,0,0,0,0,"","Serviço","Serviço","-","SINAPI",97667,"ELETRODUTO FLEXÍVEL CORRUGADO, PEAD, DN 50 (1 ½\u0094)  - FORNECIMENTO E INSTALAÇÃO. AF_04/2016","M",35,1,35,null,null,0,0,"",null,"","","(sem código)","-",0,0]
["S",2,"S",0,5,2,0,0,0,0,0,"","Serviço","Serviço","-","SINAPI",91845,"ELETRODUTO FLEXÍVEL CORRUGADO REFORÇADO, PVC, DN 25 MM (3/4\"), PARA CIRCUITOS TERMINAIS, INSTALADO EM LAJE - FORNECIMENTO E INSTALAÇÃO. AF_12/2015","M",145,1,145,null,null,0,0,"",null,"","","(sem código)","-",0,0]
["S",2,"S",0,5,2,0,0,0,0,0,"","Serviço","Serviço","-","SINAPI",91847,"ELETRODUTO FLEXÍVEL CORRUGADO REFORÇADO, PVC, DN 32 MM (1\"), PARA CIRCUITOS TERMINAIS, INSTALADO EM LAJE - FORNECIMENTO E INSTALAÇÃO. AF_12/2015","M",12,1,12,null,null,0,0,"",null,"","","(sem código)","-",0,0]
["S",2,"S",0,5,2,0,0,0,0,0,"","Serviço","Serviço","-","AGETOP",70681,"CAIXA METALICA OCTOGONAL FUNDO MOVEL, SIMPLES 2\"","Un    ",28,1,28,null,null,0,0,"",null,"","","(sem código)","-",0,0]
["S",2,"S",0,5,2,0,0,0,0,0,"","Serviço","Serviço","-","SINAPI",97592,"LUMINÁRIA TIPO PLAFON, DE SOBREPOR, COM 1 LÂMPADA LED DE 12/13 W, SEM REATOR - FORNECIMENTO E INSTALAÇÃO. AF_02/2020","UN",28,1,28,null,null,0,0,"",null,"","","(sem código)","-",0,0]
["S",2,"S",0,5,2,0,0,0,0,0,"","Serviço","Serviço","-","AGETOP",70924,"CONDULETE DE PVC - CAIXA COM 5 ENTRADAS ","un    ",5,1,5,null,null,0,0,"",null,"","","(sem código)","-",0,0]
["S",2,"S",0,5,2,0,0,0,0,0,"","Serviço","Serviço","-","SINAPI",92008,"TOMADA BAIXA DE EMBUTIR (2 MÓDULOS), 2P+T 10 A, INCLUINDO SUPORTE E PLACA - FORNECIMENTO E INSTALAÇÃO. AF_12/2015","UN",19,1,19,null,null,0,0,"",null,"","","(sem código)","-",0,0]
["S",2,"S",0,5,2,0,0,0,0,0,"","Serviço","Serviço","-","SINAPI",92004,"TOMADA MÉDIA DE EMBUTIR (2 MÓDULOS), 2P+T 10 A, INCLUINDO SUPORTE E PLACA - FORNECIMENTO E INSTALAÇÃO. AF_12/2015","UN",3,1,3,null,null,0,0,"Referência: AGETOP - 72578","SIM","","","(sem código)","-",0,0]
["S",2,"S",0,5,2,0,0,0,0,0,"","Serviço","Serviço","-","SINAPI",91992,"TOMADA ALTA DE EMBUTIR (1 MÓDULO), 2P+T 10 A, INCLUINDO SUPORTE E PLACA - FORNECIMENTO E INSTALAÇÃO. AF_12/2015","UN",3,1,3,null,null,0,0,"",null,"","","(sem código)","-",0,0]
["S",2,"S",0,5,2,0,0,0,0,0,"","Serviço","Serviço","-","AGETOP",71440,"INTERRUPTOR SIMPLES (1 SECAO)","Un    ",11,1,11,null,null,0,0,"",null,"","","(sem código)","-",0,0]
["S",2,"S",0,5,2,0,0,0,0,0,"","Serviço","Serviço","-","AGETOP",71043,"CONECTOR TRIPOLAR EM PORCELANA PARA FIOS DE ATÉ 10MM2 (BORNES) 50A-250V (CHUVEIRO)","un    ",4,1,4,null,null,0,0,"",null,"","","(sem código)","-",0,0]
["S",2,"S",0,5,2,0,0,0,0,0,"","Serviço","Serviço","-","AGETOP",72575,"TOMADA HEXAGONAL 2P + T - 20A - 250V (LINHA X OU EQUIVALENTE)","Un    ",4,1,4,null,null,0,0,"",null,"","","(sem código)","-",0,0]
["S",2,"S",0,5,2,0,0,0,0,0,"","Serviço","Serviço","-","SINAPI",91926,"CABO DE COBRE FLEXÍVEL ISOLADO, 2,5 MM², ANTI-CHAMA 450/750 V, PARA CIRCUITOS TERMINAIS - FORNECIMENTO E INSTALAÇÃO. AF_12/2015","M",755,1,755,null,null,0,0,"Referência: AGETOP - 70563","SIM","","","(sem código)","-",0,0]
["S",2,"S",0,5,2,0,0,0,0,0,"","Serviço","Serviço","-","SINAPI",92982,"CABO DE COBRE FLEXÍVEL ISOLADO, 16 MM², ANTI-CHAMA 0,6/1,0 KV, PARA DISTRIBUIÇÃO - FORNECIMENTO E INSTALAÇÃO. AF_12/2015","M",550,1,550,null,null,0,0,"","NÃO","","","(sem código)","-",0,0]
["S",2,"S",0,5,2,0,0,0,0,0,"","Serviço","Serviço","-","AGETOP",70634,"CAIXA DE PASSAGEM -  TAMPA EM CONCRETO ARMADO 25 MPA E=5CM","m2    ",2,1,2,null,null,0,0,"",null,"","","(sem código)","-",0,0]
["S",2,"S",0,5,2,0,0,0,0,0,"","Serviço","Serviço","-","AGETOP",70714,"CAIXA DE PASSAGEM 50X50X80CM FUNDO DE BRITA SEM TAMPA","Un    ",2,1,2,null,null,0,0,"",null,"","","(sem código)","-",0,0]
["S",2,"S",0,5,2,0,0,0,0,0,"","Serviço","Serviço","-","SINAPI","74131/6","QUADRO DE DISTRIBUICAO DE ENERGIA DE EMBUTIR, EM CHAPA METALICA, PARA 32 DISJUNTORES TERMOMAGNETICOS MONOPOLARES, COM BARRAMENTO TRIFASICO E NEUTRO, FORNECIMENTO E INSTALACAO","UN",1,1,1,null,null,0,0,"","NÃO","","","(sem código)","-",0,0]
["S",2,"S",0,5,2,0,0,0,0,0,"","Serviço","Serviço","-","AGETOP",71184,"DISPOSITIVO DE PROTEÇÃO CONTRA SURTOS (D.P.S.) 275V DE 8 A 40KA","Un    ",3,1,3,null,null,0,0,"",null,"","","(sem código)","-",0,0]
["S",2,"S",0,5,2,0,0,0,0,0,"","Serviço","Serviço","-","SINAPI",93655,"DISJUNTOR MONOPOLAR TIPO DIN, CORRENTE NOMINAL DE 20A - FORNECIMENTO E INSTALAÇÃO. AF_04/2016","UN",6,1,6,null,null,0,0,"",null,"","","(sem código)","-",0,0]
["S",2,"S",0,5,2,0,0,0,0,0,"","Serviço","Serviço","-","SINAPI",93654,"DISJUNTOR MONOPOLAR TIPO DIN, CORRENTE NOMINAL DE 16A - FORNECIMENTO E INSTALAÇÃO. AF_04/2016","UN",12,1,12,null,null,0,0,"","NÃO","","","(sem código)","-",0,0]
["S",2,"S",0,5,2,0,0,0,0,0,"","Serviço","Serviço","-","AGETOP",71450,"INTERRUPTOR DIFERENCIAL RESIDUAL (D.R.) BIPOLAR DE 25A-30mA","Un    ",3,1,3,null,null,0,0,"",null,"","","(sem código)","-",0,0]
["S",2,"S",0,5,2,0,0,0,0,0,"","Serviço","Serviço","-","SINAPI",93672,"DISJUNTOR TRIPOLAR TIPO DIN, CORRENTE NOMINAL DE 40A - FORNECIMENTO E INSTALAÇÃO. AF_04/2016","UN",2,1,2,null,null,0,0,"Referência: AGETOP - 71174","SIM","","","(sem código)","-",0,0]
["S",2,"S",0,5,2,0,0,0,0,0,"","Serviço","Serviço","-","AGETOP",70764,"CANALETA COM TAMPA (LINHA X OU EQUIVALENTE) 50X20X2000 MM","M     ",2,1,2,null,null,0,0,"",null,"","","(sem código)","-",0,0]
["S",2,"S",0,5,2,0,0,0,0,0,"","Serviço","Serviço","-","AGETOP",72630,"TRILHO OU SUPORTE P/BORNE TERMINAL","M     ",2,1,2,null,null,0,0,"",null,"","","(sem código)","-",0,0]
["S",2,"S",0,5,2,0,0,0,0,0,"","Serviço","Serviço","-","AGETOP",71331,"FITA ISOLANTE, ROLO DE 20,00 M","Un    ",2,1,2,null,null,0,0,"",null,"","","(sem código)","-",0,0]
["S",2,"S",0,5,2,0,0,0,0,0,"","Serviço","Serviço","-","AGETOP",71321,"FITA DE AUTO FUSAO, ROLO E 10,00 MM","Un    ",4,1,4,null,null,0,0,"",null,"","","(sem código)","-",0,0]
[1,1,1,85,6,0,0,0,0,139,85,"F","Nível 1","Nível 1","6.","AGETOP",null,"PROJETO HIDROSSANITÁRIO","UN",1,1,1,null,null,0,0,"",null,"","","PROJETO HIDROSSANITÁRIO","-",0,0]
[2,2,2,84,6,1,0,0,0,84,94,"","Nível 2","Nível 2","-","AGETOP",null,"INSTALAÇÕES HIDROSSANITÁRIAS","-",null,1,"-",null,null,0,0,"",null,"","","INSTALAÇÕES HIDROSSANITÁRIAS","-",0,0]
[3,3,3,28,6,1,1,0,0,83,28,"","Nível 3","Nível 3","-","SINAPI",null,"PEÇAS E ACESSÓRIOS","-",null,1,"-",null,null,0,0,"",null,"","","PEÇAS E ACESSÓRIOS","-",0,0]
[4,4,4,11,6,1,1,1,0,27,11,"","Nível 4","Nível 4","-","SINAPI",null,"VASO SANITÁRIO E ACESSÓRIOS","-",null,1,"-",null,null,0,0,"",null,"","","VASO SANITÁRIO E ACESSÓRIOS","-",0,0]
["S",4,"S",0,6,1,1,1,0,{"$f":"IF(OR($C149=\"S\",$C149=0),0,MATCH(0,OFFSET($D149,1,$C149,ROW($C$284)-ROW($C149)),0))","v":0},{"$f":"IF(OR($C149=\"S\",$C149=0),0,MATCH(OFFSET($D149,0,$C149)+1,OFFSET($D149,1,$C149,ROW($C$284)-ROW($C149)),0))","v":0},"","Serviço","Serviço","-","SINAPI",95469,"VASO SANITARIO SIFONADO CONVENCIONAL COM  LOUÇA BRANCA - FORNECIMENTO E INSTALAÇÃO. AF_01/2020","UN",1,1,1,null,null,0,0,"",null,"","","(sem código)","-",0,0]
["S",4,"S",0,6,1,1,1,0,0,0,"","Serviço","Serviço","-","AGETOP",80517,"VÁLVULA DE DESCARGA DUPLO ACIONAMENTO COM ACABAMENTO CROMADO ANTIVANDALISMO","Un    ",1,1,1,null,null,0,0,"",null,"","","(sem código)","-",0,0]
["S",4,"S",0,6,1,1,1,0,0,0,"","Serviço","Serviço","-","SINAPI",95471,"VASO SANITARIO SIFONADO CONVENCIONAL PARA PCD SEM FURO FRONTAL COM  LOUÇA BRANCA SEM ASSENTO -  FORNECIMENTO E INSTALAÇÃO. AF_01/2020","UN",1,1,1,null,null,0,0,"",null,"","","(sem código)","-",0,0]
["S",4,"S",0,6,1,1,1,0,0,0,"","Serviço","Serviço","-","AGETOP",80519,"VÁLVULA DE DESCARGA PARA P.N.E. COM ACABAMENTO CROMADO ANTIVANDALISMO ","un    ",1,1,1,null,null,0,0,"",null,"","","(sem código)","-",0,0]
["S",4,"S",0,6,1,1,1,0,0,0,"","Serviço","Serviço","-","AGETOP",80520,"CONJUNTO DE FIXACAO P/VASO SANITARIO (PAR)","CJ    ",2,1,2,null,null,0,0,"",null,"","","(sem código)","-",0,0]
["S",4,"S",0,6,1,1,1,0,0,0,"","Serviço","Serviço","-","AGETOP",80526,"ASSENTO EM POLIPROPILENO COM SISTEMA DE FECHAMENTO SUAVE PARA VASO SANITÁRIO","Un    ",2,1,2,null,null,0,0,"",null,"","","(sem código)","-",0,0]
["S",4,"S",0,6,1,1,1,0,0,0,"","Serviço","Serviço","-","AGETOP",80513,"TUBO PARA VÁLVULA DE DESCARGA ( CURTO 1.1/4\" )","Un    ",2,1,2,null,null,0,0,"",null,"","","(sem código)","-",0,0]
["S",4,"S",0,6,1,1,1,0,0,0,"","Serviço","Serviço","-","AGETOP",80514,"TUBO DE LIGACAO PVC CROMADO 1.1/2\" / ESPUDE  - (ENTRADA)","Un    ",2,1,2,null,null,0,0,"",null,"","","(sem código)","-",0,0]
["S",4,"S",0,6,1,1,1,0,0,0,"","Serviço","Serviço","-","AGETOP",80510,"ANEL DE VEDAÇÃO PARA VASO SANITÁRIO","Un    ",2,1,2,null,null,0,0,"",null,"","","(sem código)","-",0,0]
["S",4,"S",0,6,1,1,1,0,0,0,"","Serviço","Serviço","-","SINAPI",95544,"PAPELEIRA DE PAREDE EM METAL CROMADO SEM TAMPA, INCLUSO FIXAÇÃO. AF_01/2020","UN",2,1,2,null,null,0,0,"","NÃO","","","(sem código)","-",0,0]
[4,4,4,8,6,1,1,2,0,16,8,"","Nível 4","Nível 4","-","SINAPI",null,"LAVATÓRIO E ACESSÓRIOS","-",null,1,"-",null,null,0,0,"",null,"","","LAVATÓRIO E ACESSÓRIOS","-",0,0]
["S",4,"S",0,6,1,1,2,0,0,0,"","Serviço","Serviço","-","AGETOP",80541,"LAVATÓRIO MÉDIO COM COLUNA","Un    ",1,1,1,null,null,0,0,"",null,"","","(sem código)","-",0,0]
["S",4,"S",0,6,1,1,2,0,0,0,"","Serviço","Serviço","-","AGETOP",80542,"LAVATÓRIO MÉDIO SEM COLUNA","Un    ",1,1,1,null,null,0,0,"",null,"","","(sem código)","-",0,0]
["S",4,"S",0,6,1,1,2,0,0,0,"","Serviço","Serviço","-","AGETOP",80550,"FIXACAO P/LAVATORIO (PAR)","PAR   ",2,1,2,null,null,0,0,"",null,"","","(sem código)","-",0,0]
["S",4,"S",0,6,1,1,2,0,0,0,"","Serviço","Serviço","-","AGETOP",80555,"LIGAÇÃO FLEXÍVEL METÁLICA DIAM.1/2\"(ENGATE)","Un    ",2,1,2,null,null,0,0,"",null,"","","(sem código)","-",0,0]
["S",4,"S",0,6,1,1,2,0,0,0,"","Serviço","Serviço","-","SINAPI",86883,"SIFÃO DO TIPO FLEXÍVEL EM PVC 1  X 1.1/2  - FORNECIMENTO E INSTALAÇÃO. AF_01/2020","UN",2,1,2,null,null,0,0,"","NÃO","","","(sem código)","-",0,0]
["S",4,"S",0,6,1,1,2,0,0,0,"","Serviço","Serviço","-","AGETOP",80570,"TORNEIRA DE MESA PARA LAVATÓRIO DIÂMETRO DE 1/2\"","Un    ",2,1,2,null,null,0,0,"",null,"","","(sem código)","-",0,0]
["S",4,"S",0,6,1,1,2,0,0,0,"","Serviço","Serviço","-","AGETOP",80580,"VALVULA P/LAVATORIO OU BEBEDOURO METALICO DIAMETRO 1\"","Un    ",2,1,2,null,null,0,0,"",null,"","","(sem código)","-",0,0]
[4,4,4,5,6,1,1,3,0,8,5,"","Nível 4","Nível 4","-","SINAPI",null,"PIA E ACESSÓRIOS","-",null,1,"-",null,null,0,0,"",null,"","","PIA E ACESSÓRIOS","-",0,0]
["S",4,"S",0,6,1,1,3,0,0,0,"","Serviço","Serviço","-","AGETOP",80660,"TORNEIRA DE PAREDE PARA PIA OU BEBEDOURO DIÂMETRO DE 1/2\" E 3/4\" ","Un    ",1,1,1,null,null,0,0,"",null,"","","(sem código)","-",0,0]
["S",4,"S",0,6,1,1,3,0,0,0,"","Serviço","Serviço","-","AGETOP",80670,"SIFAO P/PIA 1.1/2\" X 2\" METAL","Un    ",1,1,1,null,null,0,0,"",null,"","","(sem código)","-",0,0]
["S",4,"S",0,6,1,1,3,0,0,0,"","Serviço","Serviço","-","SINAPI",86878,"VÁLVULA EM METAL CROMADO TIPO AMERICANA 3.1/2\u0094 X 1.1/2\u0094 PARA PIA - FORNECIMENTO E INSTALAÇÃO. AF_01/2020","UN",1,1,1,null,null,0,0,"","NÃO","","","(sem código)","-",0,0]
[{"$f":"CHOOSE(1+LOG(1+2*(ORÇAMENTO.Nivel=\"Nível 1\")+4*(ORÇAMENTO.Nivel=\"Nível 2\")+8*(ORÇAMENTO.Nivel=\"Nível 3\")+16*(ORÇAMENTO.Nivel=\"Nível 4\")+32*(ORÇAMENTO.Nivel=\"Serviço\"),2),0,1,2,3,4,\"S\")","v":"S"},{"$f":"IF(OR(C171=\"s\",C171=0),OFFSET(B171,-1,0),C171)","v":4},{"$f":"IF(OFFSET(C171,-1,0)=\"L\",1,IF(OFFSET(C171,-1,0)=1,2,IF(OR(A171=\"s\",A171=0),\"S\",IF(AND(OFFSET(C171,-1,0)=2,A171=4),3,IF(AND(OR(OFFSET(C171,-1,0)=\"s\",OFFSET(C171,-1,0)=0),A171<>\"s\",A171>OFFSET(B171,-1,0)),OFFSET(B171,-1,0),A171)))))","v":"S"},{"$f":"IF(OR(C171=\"S\",C171=0),0,IF(ISERROR(K171),J171,SMALL(J171:K171,1)))","v":0},{"$f":"IF($C171=1,OFFSET(E171,-1,0)+1,OFFSET(E171,-1,0))","v":6},{"$f":"IF($C171=1,0,IF($C171=2,OFFSET(F171,-1,0)+1,OFFSET(F171,-1,0)))","v":1},{"$f":"IF(AND($C171<=2,$C171<>0),0,IF($C171=3,OFFSET(G171,-1,0)+1,OFFSET(G171,-1,0)))","v":1},{"$f":"IF(AND($C171<=3,$C171<>0),0,IF($C171=4,OFFSET(H171,-1,0)+1,OFFSET(H171,-1,0)))","v":3},{"$f":"IF(AND($C171<=4,$C171<>0),0,IF(AND($C171=\"S\",$Y171>0),OFFSET(I171,-1,0)+1,OFFSET(I171,-1,0)))","v":0},0,0,{"$f":"IF(OR(Y171>0,$C171=1),\"F\",\"\")","v":""},"Serviço",{"$f":"CHOOSE(1+LOG(1+2*(C171=1)+4*(C171=2)+8*(C171=3)+16*(C171=4)+32*(C171=\"S\"),2),\"\",\"Nível 1\",\"Nível 2\",\"Nível 3\",\"Nível 4\",\"Serviço\")","v":"Serviço"},"-","AGETOP",80689,"CUBA INOX 50X40X20CM E=0,7MM-AÇO 304","Un    ",1,1,1,null,null,0,0,"",null,{"$f":"IFERROR(VLOOKUP(Q171,INDIRECT(\"EQUIVALÊNCIAS\"),4,FALSE),\"\")","v":""},{"$f":"IFERROR(VLOOKUP(Q171,INDIRECT(\"EQUIVALÊNCIAS\"),5,FALSE),\"\")","v":""},{"$f":"IFERROR(IF(OR($C171=0,$C171=1,$C171=2,$C171=3,$C171=4),R171,VLOOKUP($AD171,INDIRECT($AC171),2,FALSE)),\"(sem código)\")","v":"(sem código)"},{"$f":"IFERROR(VLOOKUP(AD171,INDIRECT(AC171),3,FALSE()),\"-\")","v":"-"},{"$f":"IFERROR(VLOOKUP($AD171,INDIRECT($AC171),IF($T$10=\"DESONERADA\",4,7),FALSE()),0)","v":0},{"$f":"IFERROR(VLOOKUP($AD171,INDIRECT($AC171),IF($T$10=\"DESONERADA\",5,8),FALSE()),0)","v":0}]
[4,4,4,3,6,1,1,4,0,3,18,"","Nível 4","Nível 4","-","SINAPI",null,"REGISTROS","-",null,1,"-",null,null,0,0,"",null,"","","REGISTROS","-",0,0]
["S",4,"S",0,6,1,1,4,0,0,0,"","Serviço","Serviço","-","SINAPI",89985,"REGISTRO DE PRESSÃO BRUTO, LATÃO, ROSCÁVEL, 3/4\", COM ACABAMENTO E CANOPLA CROMADOS. FORNECIDO E INSTALADO EM RAMAL DE ÁGUA. AF_12/2014","UN",1,1,1,null,null,0,0,"Referência: AGETOP - 80926","SIM","","","(sem código)","-",0,0]
["S",4,"S",0,6,1,1,4,0,0,0,"","Serviço","Serviço","-","SINAPI",94492,"REGISTRO DE ESFERA, PVC, SOLDÁVEL, DN  50 MM, INSTALADO EM RESERVAÇÃO DE ÁGUA DE EDIFICAÇÃO QUE POSSUA RESERVATÓRIO DE FIBRA/FIBROCIMENTO   FORNECIMENTO E INSTALAÇÃO. AF_06/2016","UN",2,1,2,null,null,0,0,"","NÃO","","","(sem código)","-",0,0]
[3,3,3,29,6,1,2,0,0,55,29,"","Nível 3","Nível 3","-","SINAPI",null,"ÁGUA FRIA","-",null,1,"-",null,null,0,0,"",null,"","","ÁGUA FRIA","-",0,0]
[4,4,4,3,6,1,2,1,0,28,3,"","Nível 4","Nível 4","-","SINAPI",null,"TUBOS DE PVC SOLDÁVEL","-",null,1,"-",null,null,0,0,"",null,"","","TUBOS DE PVC SOLDÁVEL","-",0,0]
["S",4,"S",0,6,1,2,1,0,0,0,"","Serviço","Serviço","-","AGETOP",81003,"TUBO SOLDAVEL PVC MARROM DIAMETRO 25 mm","M     ",36,1,36,null,null,0,0,"",null,"","","(sem código)","-",0,0]
["S",4,"S",0,6,1,2,1,0,0,0,"","Serviço","Serviço","-","SINAPI",89449,"TUBO, PVC, SOLDÁVEL, DN 50MM, INSTALADO EM PRUMADA DE ÁGUA - FORNECIMENTO E INSTALAÇÃO. AF_12/2014","M",24,1,24,null,null,0,0,"","NÃO","","","(sem código)","-",0,0]
[4,4,4,5,6,1,2,2,0,25,5,"","Nível 4","Nível 4","-","SINAPI",null,"ADAPTADORES DE PVC SOLDÁVEL","-",null,1,"-",null,null,0,0,"",null,"","","ADAPTADORES DE PVC SOLDÁVEL","-",0,0]
["S",4,"S",0,6,1,2,2,0,0,0,"","Serviço","Serviço","-","AGETOP",81041,"ADAPTAD.PVC SOLD.LONGO C/FLANGES LIVRES P/CX.DAGUA 25X3/4\"","Un    ",2,1,2,null,null,0,0,"",null,"","","(sem código)","-",0,0]
["S",4,"S",0,6,1,2,2,0,0,0,"","Serviço","Serviço","-","SINAPI",89429,"ADAPTADOR CURTO COM BOLSA E ROSCA PARA REGISTRO, PVC, SOLDÁVEL, DN 25MM X 3/4\u0094, INSTALADO EM RAMAL DE DISTRIBUIÇÃO DE ÁGUA - FORNECIMENTO E INSTALAÇÃO. AF_12/2014","UN",4,1,4,null,null,0,0,"Referência: AGETOP - 81066","SIM","","","(sem código)","-",0,0]
["S",4,"S",0,6,1,2,2,0,0,0,"","Serviço","Serviço","-","AGETOP",81043,"ADAPTAD.PVC SOLD.LONGO C/FLANGES LIVRES P/ CX.DAGUA 50X1.1/2","Un    ",2,1,2,null,null,0,0,"",null,"","","(sem código)","-",0,0]
["S",4,"S",0,6,1,2,2,0,0,0,"","Serviço","Serviço","-","SINAPI",94662,"ADAPTADOR CURTO COM BOLSA E ROSCA PARA REGISTRO, PVC, SOLDÁVEL, DN 50 MM X 1 1/2 , INSTALADO EM RESERVAÇÃO DE ÁGUA DE EDIFICAÇÃO QUE POSSUA RESERVATÓRIO DE FIBRA/FIBROCIMENTO   FORNECIMENTO E INSTALAÇÃO. AF_06/2016","UN",6,1,6,null,null,0,0,"Referência: AGETOP - 81069","SIM","","","(sem código)","-",0,0]
[4,4,4,4,6,1,2,3,0,20,4,"","Nível 4","Nível 4","-","SINAPI",null,"LUVAS DE PVC","-",null,1,"-",null,null,0,0,"",null,"","","LUVAS DE PVC","-",0,0]
["S",4,"S",0,6,1,2,3,0,0,0,"","Serviço","Serviço","-","SINAPI",89528,"LUVA, PVC, SOLDÁVEL, DN 25MM, INSTALADO EM PRUMADA DE ÁGUA - FORNECIMENTO E INSTALAÇÃO. AF_12/2014","UN",2,1,2,null,null,0,0,"","NÃO","","","(sem código)","-",0,0]
["S",4,"S",0,6,1,2,3,0,0,0,"","Serviço","Serviço","-","SINAPI",89558,"LUVA, PVC, SOLDÁVEL, DN 40MM, INSTALADO EM PRUMADA DE ÁGUA - FORNECIMENTO E INSTALAÇÃO. AF_12/2014","UN",3,1,3,null,null,0,0,"","NÃO","","","(sem código)","-",0,0]
["S",4,"S",0,6,1,2,3,0,0,0,"","Serviço","Serviço","-","AGETOP",81105,"LUVA SOLDAVEL DIAMETRO 50 mm","Un    ",3,1,3,null,null,0,0,"",null,"","","(sem código)","-",0,0]
[4,4,4,2,6,1,2,4,0,16,2,"","Nível 4","Nível 4","-","SINAPI",null,"BUCHAS","-",null,1,"-",null,null,0,0,"",null,"","","BUCHAS","-",0,0]
["S",4,"S",0,6,1,2,4,0,0,0,"","Serviço","Serviço","-","SINAPI",89579,"LUVA DE REDUÇÃO, PVC, SOLDÁVEL, DN 50MM X 25MM, INSTALADO EM PRUMADA DE ÁGUA   FORNECIMENTO E INSTALAÇÃO. AF_12/2014","UN",2,1,2,null,null,0,0,"",null,"","","(sem código)","-",0,0]
[4,4,4,4,6,1,2,5,0,14,4,"","Nível 4","Nível 4","-","SINAPI",null,"JOELHO","-",null,1,"-",null,null,0,0,"",null,"","","JOELHO","-",0,0]
["S",4,"S",0,6,1,2,5,0,0,0,"","Serviço","Serviço","-","SINAPI",89481,"JOELHO 90 GRAUS, PVC, SOLDÁVEL, DN 25MM, INSTALADO EM PRUMADA DE ÁGUA - FORNECIMENTO E INSTALAÇÃO. AF_12/2014","UN",20,1,20,null,null,0,0,"","NÃO","","","(sem código)","-",0,0]
["S",4,"S",0,6,1,2,5,0,0,0,"","Serviço","Serviço","-","SINAPI",89501,"JOELHO 90 GRAUS, PVC, SOLDÁVEL, DN 50MM, INSTALADO EM PRUMADA DE ÁGUA - FORNECIMENTO E INSTALAÇÃO. AF_12/2014","UN",6,1,6,null,null,0,0,"","NÃO","","","(sem código)","-",0,0]
["S",4,"S",0,6,1,2,5,0,0,0,"","Serviço","Serviço","-","AGETOP",81380,"JOELHO 90 GRAUS C/ROSCA E BUCHA LATAO DIAM.1/2\"","Un    ",3,1,3,null,null,0,0,"",null,"","","(sem código)","-",0,0]
[4,4,4,4,6,1,2,6,0,10,4,"","Nível 4","Nível 4","-","SINAPI",null,"TÊ","-",null,1,"-",null,null,0,0,"",null,"","","TÊ","-",0,0]
["S",4,"S",0,6,1,2,6,0,0,0,"","Serviço","Serviço","-","SINAPI",89625,"TE, PVC, SOLDÁVEL, DN 50MM, INSTALADO EM PRUMADA DE ÁGUA - FORNECIMENTO E INSTALAÇÃO. AF_12/2014","UN",3,1,3,null,null,0,0,"","NÃO","","","(sem código)","-",0,0]
["S",4,"S",0,6,1,2,6,0,0,0,"","Serviço","Serviço","-","SINAPI",89627,"TÊ DE REDUÇÃO, PVC, SOLDÁVEL, DN 50MM X 25MM, INSTALADO EM PRUMADA DE ÁGUA - FORNECIMENTO E INSTALAÇÃO. AF_12/2014","UN",2,1,2,null,null,0,0,"","NÃO","","","(sem código)","-",0,0]
["S",4,"S",0,6,1,2,6,0,0,0,"","Serviço","Serviço","-","AGETOP",81445,"TE RED.SOLD.90GR.BUC.LATAO BOLSA CENT.25X25X1/2\"","Un    ",3,1,3,null,null,0,0,"",null,"","","(sem código)","-",0,0]
[4,4,4,3,6,1,2,7,0,6,3,"","Nível 4","Nível 4","-","SINAPI",null,"UNIÃO","-",null,1,"-",null,null,0,0,"",null,"","","UNIÃO","-",0,0]
["S",4,"S",0,6,1,2,7,0,0,0,"","Serviço","Serviço","-","AGETOP",81462,"UNIAO SOLDAVEL DIAMETRO 25 mm","Un    ",3,1,3,null,null,0,0,"",null,"","","(sem código)","-",0,0]
["S",4,"S",0,6,1,2,7,0,0,0,"","Serviço","Serviço","-","SINAPI",89594,"UNIÃO, PVC, SOLDÁVEL, DN 50MM, INSTALADO EM PRUMADA DE ÁGUA - FORNECIMENTO E INSTALAÇÃO. AF_12/2014","UN",2,1,2,null,null,0,0,"","NÃO","","","(sem código)","-",0,0]
[4,4,4,3,6,1,2,8,0,3,{"$error":"#N/A"},"","Nível 4","Nível 4","-","SINAPI",null,"ADESIVOS","-",null,1,"-",null,null,0,0,"",null,"","","ADESIVOS","-",0,0]
["S",4,"S",0,6,1,2,8,0,0,0,"","Serviço","Serviço","-","AGETOP",81501,"ADESIVO PLASTICO - FRASCO 850 G","Un    ",2,1,2,null,null,0,0,"",null,"","","(sem código)","-",0,0]
["S",4,"S",0,6,1,2,8,0,0,0,"","Serviço","Serviço","-","AGETOP",81504,"SOLUCAO LIMPADORA 1000 CM3","Un    ",2,1,2,null,null,0,0,"",null,"","","(sem código)","-",0,0]
[3,3,3,19,6,1,3,0,0,26,19,"","Nível 3","Nível 3","-","SINAPI",null,"ESGOTO SANITÁRIO","-",null,1,"-",null,null,0,0,"",null,"","","ESGOTO SANITÁRIO","-",0,0]
[4,4,4,3,6,1,3,1,0,18,3,"","Nível 4","Nível 4","-","SINAPI",null,"CORPO DE CAIXA SIFONADA / RALO","-",null,1,"-",null,null,0,0,"",null,"","","CORPO DE CAIXA SIFONADA / RALO","-",0,0]
["S",4,"S",0,6,1,3,1,0,0,0,"","Serviço","Serviço","-","AGETOP",81663,"CORPO CX. SIFONADA DIAM. 150 X 150 X 50","Un    ",2,1,2,null,null,0,0,"",null,"","","(sem código)","-",0,0]
["S",4,"S",0,6,1,3,1,0,0,0,"","Serviço","Serviço","-","AGETOP",81666,"CORPO CX. SIFONADA DIAM. 250 X 230 X 75","Un    ",1,1,1,null,null,0,0,"",null,"","","(sem código)","-",0,0]
[4,4,4,6,6,1,3,2,0,15,6,"","Nível 4","Nível 4","-","SINAPI",null,"JOELHOS","-",null,1,"-",null,null,0,0,"",null,"","","JOELHOS","-",0,0]
["S",4,"S",0,6,1,3,2,0,0,0,"","Serviço","Serviço","-","SINAPI",89726,"JOELHO 45 GRAUS, PVC, SERIE NORMAL, ESGOTO PREDIAL, DN 40 MM, JUNTA SOLDÁVEL, FORNECIDO E INSTALADO EM RAMAL DE DESCARGA OU RAMAL DE ESGOTO SANITÁRIO. AF_12/2014","UN",2,1,2,null,null,0,0,"","NÃO","","","(sem código)","-",0,0]
["S",4,"S",0,6,1,3,2,0,0,0,"","Serviço","Serviço","-","SINAPI",89802,"JOELHO 45 GRAUS, PVC, SERIE NORMAL, ESGOTO PREDIAL, DN 50 MM, JUNTA ELÁSTICA, FORNECIDO E INSTALADO EM PRUMADA DE ESGOTO SANITÁRIO OU VENTILAÇÃO. AF_12/2014","UN",2,1,2,null,null,0,0,"","NÃO","","","(sem código)","-",0,0]
["S",4,"S",0,6,1,3,2,0,0,0,"","Serviço","Serviço","-","SINAPI",89810,"JOELHO 45 GRAUS, PVC, SERIE NORMAL, ESGOTO PREDIAL, DN 100 MM, JUNTA ELÁSTICA, FORNECIDO E INSTALADO EM PRUMADA DE ESGOTO SANITÁRIO OU VENTILAÇÃO. AF_12/2014","UN",2,1,2,null,null,0,0,"","NÃO","","","(sem código)","-",0,0]
["S",4,"S",0,6,1,3,2,0,0,0,"","Serviço","Serviço","-","SINAPI",89731,"JOELHO 90 GRAUS, PVC, SERIE NORMAL, ESGOTO PREDIAL, DN 50 MM, JUNTA ELÁSTICA, FORNECIDO E INSTALADO EM RAMAL DE DESCARGA OU RAMAL DE ESGOTO SANITÁRIO. AF_12/2014","UN",5,1,5,null,null,0,0,"","NÃO","","","(sem código)","-",0,0]
["S",4,"S",0,6,1,3,2,0,{"$f":"IF(OR($C213=\"S\",$C213=0),0,MATCH(0,OFFSET($D213,1,$C213,ROW($C$284)-ROW($C213)),0))","v":0},{"$f":"IF(OR($C213=\"S\",$C213=0),0,MATCH(OFFSET($D213,0,$C213)+1,OFFSET($D213,1,$C213,ROW($C$284)-ROW($C213)),0))","v":0},"","Serviço","Serviço","-","SINAPI",89584,"JOELHO 90 GRAUS, PVC, SERIE R, ÁGUA PLUVIAL, DN 100 MM, JUNTA ELÁSTICA, FORNECIDO E INSTALADO EM CONDUTORES VERTICAIS DE ÁGUAS PLUVIAIS. AF_12/2014","UN",2,1,2,null,null,0,0,"",null,"","","(sem código)","-",0,0]
[4,4,4,2,6,1,3,3,0,9,2,"","Nível 4","Nível 4","-","SINAPI",null,"JUNÇÕES","-",null,1,"-",null,null,0,0,"",null,"","","JUNÇÕES","-",0,0]
["S",4,"S",0,6,1,3,3,0,0,0,"","Serviço","Serviço","-","AGETOP",81973,"JUNCAO SIMPLES DIAM. 100 X 50 MM","Un    ",3,1,3,null,null,0,0,"",null,"","","(sem código)","-",0,0]
[4,4,4,2,6,1,3,4,0,7,2,"","Nível 4","Nível 4","-","SINAPI",null,"TÊ","-",null,1,"-",null,null,0,0,"",null,"","","TÊ","-",0,0]
["S",4,"S",0,6,1,3,4,0,0,0,"","Serviço","Serviço","-","SINAPI",89825,"TE, PVC, SERIE NORMAL, ESGOTO PREDIAL, DN 50 X 50 MM, JUNTA ELÁSTICA, FORNECIDO E INSTALADO EM PRUMADA DE ESGOTO SANITÁRIO OU VENTILAÇÃO. AF_12/2014","UN",2,1,2,null,null,0,0,"","NÃO","","","(sem código)","-",0,0]
[4,4,4,5,6,1,3,5,0,5,{"$error":"#N/A"},"","Nível 4","Nível 4","-","SINAPI",null,"TUBOS","-",null,1,"-",null,null,0,0,"",null,"","","TUBOS","-",0,0]
["S",4,"S",0,6,1,3,5,0,0,0,"","Serviço","Serviço","-","AGETOP",82301,"TUBO SOLD.P/ESGOTO DIAM. 40 MM","m     ",12,1,12,null,null,0,0,"",null,"","","(sem código)","-",0,0]
["S",4,"S",0,6,1,3,5,0,0,0,"","Serviço","Serviço","-","SINAPI",89798,"TUBO PVC, SERIE NORMAL, ESGOTO PREDIAL, DN 50 MM, FORNECIDO E INSTALADO EM PRUMADA DE ESGOTO SANITÁRIO OU VENTILAÇÃO. AF_12/2014","M",18,1,18,null,null,0,0,"","NÃO","","","(sem código)","-",0,0]
["S",4,"S",0,6,1,3,5,0,0,0,"","Serviço","Serviço","-","SINAPI",89799,"TUBO PVC, SERIE NORMAL, ESGOTO PREDIAL, DN 75 MM, FORNECIDO E INSTALADO EM PRUMADA DE ESGOTO SANITÁRIO OU VENTILAÇÃO. AF_12/2014","M",12,1,12,null,null,0,0,"","NÃO","","","(sem código)","-",0,0]
["S",4,"S",0,6,1,3,5,0,0,0,"","Serviço","Serviço","-","SINAPI",89800,"TUBO PVC, SERIE NORMAL, ESGOTO PREDIAL, DN 100 MM, FORNECIDO E INSTALADO EM PRUMADA DE ESGOTO SANITÁRIO OU VENTILAÇÃO. AF_12/2014","M",18,1,18,null,null,0,0,"","NÃO","","","(sem código)","-",0,0]
[3,3,3,7,6,1,4,0,0,7,{"$error":"#N/A"},"","Nível 3","Nível 3","-","SINAPI",null,"EXTRAS","-",null,1,"-",null,null,0,0,"",null,"","","EXTRAS","-",0,0]
["S",3,"S",0,6,1,4,0,0,0,0,"","Serviço","Serviço","-","AGETOP",81811,"HIDROMETRO DIAM.RAMAL = 25 MM VAZAO =1,5  A 3 M3","Un    ",1,1,1,null,null,0,0,"",null,"","","(sem código)","-",0,0]
["S",3,"S",0,6,1,4,0,0,0,0,"","Serviço","Serviço","-","AGETOP",81815,"KIT CAVALETE D=25MM P/HIDRÔMETRO 1,5-3,0-5,0 M3/MURETA/CAIXA","Un    ",1,1,1,null,null,0,0,"",null,"","","(sem código)","-",0,0]
["S",3,"S",0,6,1,4,0,0,0,0,"","Serviço","Serviço","-","AGETOP",81825,"CAIXA DE PASSAGEM 60 X 60 CM SEM TAMPA","Un    ",1,1,1,null,null,0,0,"",null,"","","(sem código)","-",0,0]
["S",3,"S",0,6,1,4,0,0,0,0,"","Serviço","Serviço","-","AGETOP",81826,"TAMPA EM CONCRETO ARMADO 25 MPA E=5CM PARA A CAIXA DE PASSAGEM 60X60CM","Un    ",1,1,1,null,null,0,0,"",null,"","","(sem código)","-",0,0]
["S",3,"S",0,6,1,4,0,0,0,0,"","Serviço","Serviço","-","AGETOP",81861,"CAIXA DAGUA POLIETILENO 1000 LTS. C/TAMPA","Un    ",1,1,1,null,null,0,0,"",null,"","","(sem código)","-",0,0]
["S",3,"S",0,6,1,4,0,0,0,0,"","Serviço","Serviço","-","SINAPI",94797,"TORNEIRA DE BOIA, ROSCÁVEL, 1\u0094, FORNECIDA E INSTALADA EM RESERVAÇÃO DE ÁGUA. AF_06/2016","UN",1,1,1,null,null,0,0,"","NÃO","","","(sem código)","-",0,0]
[1,1,1,7,7,0,0,0,0,54,7,"F","Nível 1","Nível 1","7.","AGETOP",null,"PROJETO DE PREVENÇÃO E COMBATE A INCÊNDIO","UN",1,1,1,null,null,0,0,"",null,"","","PROJETO DE PREVENÇÃO E COMBATE A INCÊNDIO","-",0,0]
[2,2,2,6,7,1,0,0,0,6,9,"","Nível 2","Nível 2","-","AGETOP",null,"INSTALAÇÕES ESPECIAIS","-",null,1,"-",null,null,0,0,"",null,"","","INSTALAÇÕES ESPECIAIS","-",0,0]
["S",2,"S",0,7,1,0,0,0,0,0,"","Serviço","Serviço","-","AGETOP",85006,"EXTINTOR MULTI USO EM PO A B C (6 KG) - CAPACIDADE EXTINTORA 3A 20BC","un    ",2,1,2,null,null,0,0,"",null,"","","(sem código)","-",0,0]
["S",2,"S",0,7,1,0,0,0,0,0,"","Serviço","Serviço","-","SINAPI",97599,"LUMINÁRIA DE EMERGÊNCIA, COM 30 LÂMPADAS LED DE 2 W, SEM REATOR - FORNECIMENTO E INSTALAÇÃO. AF_02/2020","UN",5,1,5,null,null,0,0,"",null,"","","(sem código)","-",0,0]
["S",2,"S",0,7,1,0,0,0,0,0,"","Serviço","Serviço","-","COMPOSIÇÃO","COMP 024_SEE","SINALIZADOR FOTOLUMINESCENTE PARA EXTINTOR","UN ",2,1,2,null,null,0,0,"",null,"","","(sem código)","-",0,0]
["S",2,"S",0,7,1,0,0,0,0,0,"","Serviço","Serviço","-","COMPOSIÇÃO","COMP 025_SEE","SINALIZADOR FOTOLUMINESCENTE DE EMERGÊNCIA","UN ",7,1,7,null,null,0,0,"",null,"","","(sem código)","-",0,0]
["S",2,"S",0,7,1,0,0,0,0,0,"","Serviço","Serviço","-","COMPOSIÇÃO","COMP 277_SEE","MARCAÇÃO NO PISO - 1X1 M PARA EXTINTOR","M2",2,1,2,null,null,0,0,"",null,"","","(sem código)","-",0,0]
[1,1,1,44,8,0,0,0,0,47,44,"F","Nível 1","Nível 1","8.","AGETOP",null,"PROJETO ESTRUTURAL","UN",1,1,1,null,null,0,0,"",null,"","","PROJETO ESTRUTURAL","-",0,0]
[2,2,2,2,8,1,0,0,0,43,2,"","Nível 2","Nível 2","-","SINAPI",null,"SERVIÇOS PRELIMINARES","-",null,1,"-",null,null,0,0,"",null,"","","SERVIÇOS PRELIMINARES","-",0,0]
["S",2,"S",0,8,1,0,0,0,0,0,"","Serviço","Serviço","-","AGETOP",20701,"LOCAÇÃO DA OBRA, EXECUÇÃO DE GABARITO SEM REAPROVEITAMENTO, INCLUSO PINTURA (FACE INTERNA DO RIPÃO 15CM) E PIQUETE COM TESTEMUNHA","m2    ",100.68,1,100.68,null,null,0,0,"",null,"","","(sem código)","-",0,0]
[2,2,2,3,8,2,0,0,0,41,3,"","Nível 2","Nível 2","-","AGETOP",null,"TRANSPORTES","-",null,1,"-",null,null,0,0,"",null,"","","TRANSPORTES","-",0,0]
["S",2,"S",0,8,2,0,0,0,0,0,"","Serviço","Serviço","-","SINAPI",72900,"TRANSPORTE DE ENTULHO COM CAMINHAO BASCULANTE 6 M3, RODOVIA PAVIMENTADA, DMT 0,5 A 1,0 KM","M3",5.03,1,5.03,null,null,0,0,"","NÃO","","","(sem código)","-",0,0]
["S",2,"S",0,8,2,0,0,0,0,0,"","Serviço","Serviço","-","SINAPI",72897,"CARGA MANUAL DE ENTULHO EM CAMINHAO BASCULANTE 6 M3","M3",5.03,1,5.03,null,null,0,0,"","NÃO","","","(sem código)","-",0,0]
[2,2,2,20,8,3,0,0,0,38,20,"","Nível 2","Nível 2","-","AGETOP",null,"FUNDAÇÕES E SONDAGENS","-",null,1,"-",null,null,0,0,"",null,"","","FUNDAÇÕES E SONDAGENS","-",0,0]
[3,{"$f":"IF(OR(C244=\"s\",C244=0),OFFSET(B244,-1,0),C244)","v":3},{"$f":"IF(OFFSET(C244,-1,0)=\"L\",1,IF(OFFSET(C244,-1,0)=1,2,IF(OR(A244=\"s\",A244=0),\"S\",IF(AND(OFFSET(C244,-1,0)=2,A244=4),3,IF(AND(OR(OFFSET(C244,-1,0)=\"s\",OFFSET(C244,-1,0)=0),A244<>\"s\",A244>OFFSET(B244,-1,0)),OFFSET(B244,-1,0),A244)))))","v":3},{"$f":"IF(OR(C244=\"S\",C244=0),0,IF(ISERROR(K244),J244,SMALL(J244:K244,1)))","v":7},{"$f":"IF($C244=1,OFFSET(E244,-1,0)+1,OFFSET(E244,-1,0))","v":8},{"$f":"IF($C244=1,0,IF($C244=2,OFFSET(F244,-1,0)+1,OFFSET(F244,-1,0)))","v":3},{"$f":"IF(AND($C244<=2,$C244<>0),0,IF($C244=3,OFFSET(G244,-1,0)+1,OFFSET(G244,-1,0)))","v":1},{"$f":"IF(AND($C244<=3,$C244<>0),0,IF($C244=4,OFFSET(H244,-1,0)+1,OFFSET(H244,-1,0)))","v":0},{"$f":"IF(AND($C244<=4,$C244<>0),0,IF(AND($C244=\"S\",$Y244>0),OFFSET(I244,-1,0)+1,OFFSET(I244,-1,0)))","v":0},19,7,{"$f":"IF(OR(Y244>0,$C244=1),\"F\",\"\")","v":""},"Nível 3",{"$f":"CHOOSE(1+LOG(1+2*(C244=1)+4*(C244=2)+8*(C244=3)+16*(C244=4)+32*(C244=\"S\"),2),\"\",\"Nível 1\",\"Nível 2\",\"Nível 3\",\"Nível 4\",\"Serviço\")","v":"Nível 3"},"-","SINAPI",null,"BLOCOS","-",null,1,"-",null,null,0,0,"",null,{"$f":"IFERROR(VLOOKUP(Q244,INDIRECT(\"EQUIVALÊNCIAS\"),4,FALSE),\"\")","v":""},{"$f":"IFERROR(VLOOKUP(Q244,INDIRECT(\"EQUIVALÊNCIAS\"),5,FALSE),\"\")","v":""},{"$f":"IFERROR(IF(OR($C244=0,$C244=1,$C244=2,$C244=3,$C244=4),R244,VLOOKUP($AD244,INDIRECT($AC244),2,FALSE)),\"(sem código)\")","v":"BLOCOS"},{"$f":"IFERROR(VLOOKUP(AD244,INDIRECT(AC244),3,FALSE()),\"-\")","v":"-"},{"$f":"IFERROR(VLOOKUP($AD244,INDIRECT($AC244),IF($T$10=\"DESONERADA\",4,7),FALSE()),0)","v":0},{"$f":"IFERROR(VLOOKUP($AD244,INDIRECT($AC244),IF($T$10=\"DESONERADA\",5,8),FALSE()),0)","v":0}]
["S",3,"S",0,8,3,1,0,0,0,0,"","Serviço","Serviço","-","AGETOP",50901,"ESCAVACAO MANUAL DE VALAS (SAPATAS/BLOCOS)","m3    ",2.13,1,2.13,null,null,0,0,"",null,"","","(sem código)","-",0,0]
["S",3,"S",0,8,3,1,0,0,0,0,"","Serviço","Serviço","-","AGETOP",50902,"APILOAMENTO (BLOCOS/SAPATAS)","m2    ",8,1,8,null,null,0,0,"",null,"","","(sem código)","-",0,0]
["S",3,"S",0,8,3,1,0,0,0,0,"","Serviço","Serviço","-","AGETOP",60470,"LASTRO DE BRITA - (OBRAS CIVIS)","m3    ",0.4,1,0.4,null,null,0,0,"",null,"","","(sem código)","-",0,0]
["S",3,"S",0,8,3,1,0,0,0,0,"","Serviço","Serviço","-","AGETOP",51030,"PREPARO COM BETONEIRA E TRANSPORTE MANUAL DE CONCRETO FCK=25 MPA","m3    ",2.13,1,2.13,null,null,0,0,"",null,"","","(sem código)","-",0,0]
["S",3,"S",0,8,3,1,0,0,0,0,"","Serviço","Serviço","-","AGETOP",51055,"LANÇAMENTO/APLICAÇÃO/ADENSAMENTO MANUAL DE CONCRETO - (O.C.)","m3    ",2.13,1,2.13,null,null,0,0,"",null,"","","(sem código)","-",0,0]
["S",3,"S",0,8,3,1,0,0,0,0,"","Serviço","Serviço","-","AGETOP",52003,"ACO CA-50A - 6,3 MM (1/4\") - (OBRAS CIVIS)","Kg    ",63.6,1,63.6,null,null,0,0,"",null,"","","(sem código)","-",0,0]
[3,3,3,10,8,3,2,0,0,12,10,"","Nível 3","Nível 3","-","SINAPI",null,"VIGAS BALDRAMES","-",null,1,"-",null,null,0,0,"",null,"","","VIGAS BALDRAMES","-",0,0]
["S",3,"S",0,8,3,2,0,0,0,0,"","Serviço","Serviço","-","AGETOP",40101,"ESCAVACAO MANUAL DE VALAS < 1 MTS. (OBRAS CIVIS)","m3    ",7.47,1,7.47,null,null,0,0,"",null,"","","(sem código)","-",0,0]
["S",3,"S",0,8,3,2,0,0,0,0,"","Serviço","Serviço","-","AGETOP",50902,"APILOAMENTO (BLOCOS/SAPATAS)","m2    ",10.67,1,10.67,null,null,0,0,"",null,"","","(sem código)","-",0,0]
["S",3,"S",0,8,3,2,0,0,0,0,"","Serviço","Serviço","-","AGETOP",60470,"LASTRO DE BRITA - (OBRAS CIVIS)","m3    ",0.53349999999999997,1,0.53349999999999997,null,null,0,0,"",null,"","","(sem código)","-",0,0]
["S",3,"S",0,8,3,2,0,0,0,0,"","Serviço","Serviço","-","AGETOP",60191,"FORMA DE TABUA CINTA BALDRAME U=8 VEZES","m2    ",42.67,1,42.67,null,null,0,0,"",null,"","","(sem código)","-",0,0]
["S",3,"S",0,8,3,2,0,0,0,0,"","Serviço","Serviço","-","AGETOP",51030,"PREPARO COM BETONEIRA E TRANSPORTE MANUAL DE CONCRETO FCK=25 MPA","m3    ",3.2,1,3.2,null,null,0,0,"",null,"","","(sem código)","-",0,0]
["S",3,"S",0,8,3,2,0,0,0,0,"","Serviço","Serviço","-","AGETOP",51055,"LANÇAMENTO/APLICAÇÃO/ADENSAMENTO MANUAL DE CONCRETO - (O.C.)","m3    ",3.2,1,3.2,null,null,0,0,"",null,"","","(sem código)","-",0,0]
["S",3,"S",0,8,3,2,0,0,0,0,"","Serviço","Serviço","-","AGETOP",40902,"REATERRO COM APILOAMENTO","m3    ",4.2699999999999996,1,4.2699999999999996,null,null,0,0,"",null,"","","(sem código)","-",0,0]
["S",3,"S",0,8,3,2,0,0,0,0,"","Serviço","Serviço","-","AGETOP",52004,"ACO CA 50-A - 8,0 MM (5/16\") - (OBRAS CIVIS)","Kg    ",113.8,1,113.8,null,null,0,0,"",null,"","","(sem código)","-",0,0]
["S",3,"S",0,8,3,2,0,0,0,0,"","Serviço","Serviço","-","AGETOP",52014,"ACO CA-60 - 5,0 MM - (OBRAS CIVIS)","Kg    ",50.3,1,50.3,null,null,0,0,"",null,"","","(sem código)","-",0,0]
[3,3,3,2,8,3,3,0,0,2,{"$error":"#N/A"},"","Nível 3","Nível 3","-","SINAPI",null,"OUTROS","-",null,1,"-",null,null,0,0,"",null,"","","OUTROS","-",0,0]
["S",3,"S",0,8,3,3,0,0,0,0,"","Serviço","Serviço","-","AGETOP",120902,"IMPERMEABILIZACAO VIGAS BALDRAMES E=2,0 CM","m2    ",53.29,1,53.29,null,null,0,0,"",null,"","","(sem código)","-",0,0]
[2,2,2,18,8,4,0,0,0,18,{"$error":"#N/A"},"","Nível 2","Nível 2","-","AGETOP",null,"ESTRUTURA","-",null,1,"-",null,null,0,0,"",null,"","","ESTRUTURA","-",0,0]
[3,3,3,6,8,4,1,0,0,17,6,"","Nível 3","Nível 3","-","AGETOP",null,"PILARES","-",null,1,"-",null,null,0,0,"",null,"","","PILARES","-",0,0]
["S",3,"S",0,8,4,1,0,0,0,0,"","Serviço","Serviço","-","SINAPI",92426,"MONTAGEM E DESMONTAGEM DE FÔRMA DE PILARES RETANGULARES E ESTRUTURAS SIMILARES COM ÁREA MÉDIA DAS SEÇÕES MENOR OU IGUAL A 0,25 M², PÉ-DIREITO SIMPLES, EM CHAPA DE MADEIRA COMPENSADA RESINADA, 8 UTILIZAÇÕES. AF_12/2015","M2",64.8,1,64.8,null,null,0,0,"","NÃO","","","(sem código)","-",0,0]
["S",3,"S",0,8,4,1,0,0,0,0,"","Serviço","Serviço","-","SINAPI",94965,"CONCRETO FCK = 25MPA, TRAÇO 1:2,3:2,7 (CIMENTO/ AREIA MÉDIA/ BRITA 1)  - PREPARO MECÂNICO COM BETONEIRA 400 L. AF_07/2016","M3",3.24,1,3.24,null,null,0,0,"Referência: AGETOP - 51030","SIM","","","(sem código)","-",0,0]
["S",3,"S",0,8,4,1,0,0,0,0,"","Serviço","Serviço","-","AGETOP",60801,"LANÇAMENTO/APLICAÇÃO/ADENSAMENTO MANUAL DE CONCRETO - (OBRAS CIVIS)","m3    ",3.24,1,3.24,null,null,0,0,"",null,"","","(sem código)","-",0,0]
[{"$f":"CHOOSE(1+LOG(1+2*(ORÇAMENTO.Nivel=\"Nível 1\")+4*(ORÇAMENTO.Nivel=\"Nível 2\")+8*(ORÇAMENTO.Nivel=\"Nível 3\")+16*(ORÇAMENTO.Nivel=\"Nível 4\")+32*(ORÇAMENTO.Nivel=\"Serviço\"),2),0,1,2,3,4,\"S\")","v":"S"},3,"S",0,8,4,1,0,0,0,0,"","Serviço","Serviço","-","AGETOP",60305,"ACO CA-50A - 10,0 MM (3/8\") - (OBRAS CIVIS)","Kg    ",199.3,1,199.3,null,null,0,0,"",null,"","","(sem código)","-",0,0]
["S",3,"S",0,8,4,1,0,0,0,0,"","Serviço","Serviço","-","AGETOP",60314,"ACO CA - 60 - 5,0 MM - (OBRAS CIVIS)","Kg    ",80.5,1,80.5,null,null,0,0,"",null,"","","(sem código)","-",0,0]
[3,3,3,8,8,4,2,0,0,11,8,"","Nível 3","Nível 3","-",null,null,"VIGAS DE COBERTURA","-",null,1,"-",null,null,0,0,"",null,"","","VIGAS DE COBERTURA","-",0,0]
["S",3,"S",0,8,4,2,0,0,0,0,"","Serviço","Serviço","-","AGETOP",60209,"FORMA CH.COMPENSADA 12MM-VIGA/PILAR U=4V - (OBRAS CIVIS","m2    ",64.58,1,64.58,null,null,0,0,"",null,"","","(sem código)","-",0,0]
["S",3,"S",0,8,4,2,0,0,0,0,"","Serviço","Serviço","-","SINAPI",94965,"CONCRETO FCK = 25MPA, TRAÇO 1:2,3:2,7 (CIMENTO/ AREIA MÉDIA/ BRITA 1)  - PREPARO MECÂNICO COM BETONEIRA 400 L. AF_07/2016","M3",3.94,1,3.94,null,null,0,0,"Referência: AGETOP - 51030","SIM","","","(sem código)","-",0,0]
["S",3,"S",0,8,4,2,0,0,0,0,"","Serviço","Serviço","-","AGETOP",60801,"LANÇAMENTO/APLICAÇÃO/ADENSAMENTO MANUAL DE CONCRETO - (OBRAS CIVIS)","m3    ",3.94,1,3.94,null,null,0,0,"",null,"","","(sem código)","-",0,0]
["S",3,"S",0,8,4,2,0,0,0,0,"","Serviço","Serviço","-","AGETOP",60303,"ACO CA-50-A - 6,3 MM (1/4\") - (OBRAS CIVIS)","Kg    ",3.4,1,3.4,null,null,0,0,"",null,"","","(sem código)","-",0,0]
["S",3,"S",0,8,4,2,0,0,0,0,"","Serviço","Serviço","-","AGETOP",60304,"ACO CA-50 A - 8,0 MM (5/16\") - (OBRAS CIVIS)","Kg    ",125.5,1,125.5,null,null,0,0,"",null,"","","(sem código)","-",0,0]
["S",3,"S",0,8,4,2,0,0,0,0,"","Serviço","Serviço","-","AGETOP",60305,"ACO CA-50A - 10,0 MM (3/8\") - (OBRAS CIVIS)","Kg    ",17.2,1,17.2,null,null,0,0,"",null,"","","(sem código)","-",0,0]
["S",3,"S",0,8,4,2,0,0,{"$f":"IF(OR($C277=\"S\",$C277=0),0,MATCH(0,OFFSET($D277,1,$C277,ROW($C$284)-ROW($C277)),0))","v":0},{"$f":"IF(OR($C277=\"S\",$C277=0),0,MATCH(OFFSET($D277,0,$C277)+1,OFFSET($D277,1,$C277,ROW($C$284)-ROW($C277)),0))","v":0},"","Serviço","Serviço","-","AGETOP",60314,"ACO CA - 60 - 5,0 MM - (OBRAS CIVIS)","Kg    ",58.3,1,58.3,null,null,0,0,"",null,"","","(sem código)","-",0,0]
[3,3,3,3,8,4,3,0,0,3,{"$error":"#N/A"},"","Nível 3","Nível 3","-",null,null,"LAJE","-",null,1,"-",null,null,0,0,"",null,"","","LAJE","-",0,0]
[4,4,4,2,8,4,3,1,0,2,{"$error":"#N/A"},"","Nível 4","Nível 4","-","SINAPI",null,"LAJE TRELIÇADA","-",null,1,"-",null,null,0,0,"",null,"","","LAJE TRELIÇADA","-",0,0]
["S",4,"S",0,8,4,3,1,0,0,0,"","Serviço","Serviço","-","AGETOP",61101,"FORRO EM LAJE PRE-MOLDADA INC.CAPEAMENTO/FERR.DISTRIB./ESCORAMENTO E FORMA/DESFORMA","m2    ",82.5,1,82.5,null,null,0,0,"",null,"","","(sem código)","-",0,0]
[1,1,1,3,9,0,0,0,0,3,{"$error":"#N/A"},"F","Nível 1","Nível 1","9.","SINAPI",null,"PROJETO ESTRUTURAS METÁLICAS","UN",1,1,1,null,null,0,0,"",null,"","","PROJETO ESTRUTURAS METÁLICAS","-",0,0]
[2,2,2,2,9,1,0,0,0,2,{"$error":"#N/A"},"","Nível 2","Nível 2","-","SINAPI",null,"ESQUADRIAS METÁLICAS","-",null,1,"-",null,null,0,0,"",null,"","","ESQUADRIAS METÁLICAS","-",0,0]
["S",2,"S",0,9,1,0,0,0,0,0,"","Serviço","Serviço","-","AGETOP",150204,"ESTRUTURA METÁLICA CONVENCIONAL EM AÇO DO TIPO MR-250 / ASTM A36 COM FUNDO ANTICORROSIVO","Kg    ",1663.67,1,1663.67,null,null,0,0,"",null,"","","(sem código)","-",0,0]
[-1,null,-1,null,0,0,0,0,0,null,null,"F"]
[null,null,null,null,null,null,null,null,null,null,null,"F",null,null,null,null,null,"OBS: OS QUANTITATIVOS DE MATERIAIS  DAS INSTALAÇÕES HIDROSSANITÁRIAS, ELÉTRICAS E ESPECIAIS SÃO FORNECIDOS PELOS PROFISSIONAIS RESPONSÁVEIS PELOS RESPECTIVOS PROJETOS.",null,null,null,null,"VALOR TOTAL",null,null,0]
[null,null,null,null,null,null,null,null,null,null,null,"F",null,null,null,null,null,null,null,null,null,null,"VALOR BDI (26,40%)",null,null,0]
[null,null,null,null,null,null,null,null,null,null,null,"F",null,null,null,null,null,null,null,null,null,null,"TOTAL ORÇAMENTO",null,null,0]
[null,null,null,null,null,null,null,null,null,null,null,"F"]
[null,null,null,null,null,null,null,null,null,null,null,"F",null,null,null,null,null,null,null,null,null,null,"CUSTO POR M2 ³",null,null,0]
[null,null,null,null,null,null,null,null,null,null,null,"F",null,null,null,null,null,null,null,null,null,null,"MATERIAL S/ BDI",null,null,0]
[null,null,null,null,null,null,null,null,null,null,null,"F",null,null,null,null,null,null,null,null,null,null,"MÃO DE OBRA S/ BDI",null,null,0]
[null,null,null,null,null,null,null,null,null,null,null,"F"]
[null,null,null,null,null,null,null,null,null,null,null,"F",null,null,null,null,"(1) Conforme previsto pelo DECRETO Nº 7.983, DE 8 DE ABRIL DE 2013, os preços adotados são aqueles constantes dos sistemas de referência indicados. Justifica-se o uso dos preços destas composições de custos unitários devido ao seu valor ser menor à mediana de seus correspondentes na tabela SINAPI;"]
[null,null,null,null,null,null,null,null,null,null,null,"F",null,null,null,null,"(2) Optou-se pelo uso das composições de custos da AGETOP para itens não presentes na SINAPI;"]
[null,null,null,null,null,null,null,null,null,null,null,"F",null,null,null,null,"(3) Para itens da AGETOP, os vidros não estão inclusos nas esquadrias e já foram considerados os custos de contramarco para as esquadrias de alumínio;"]
[null,null,null,null,null,null,null,null,null,null,null,"F",null,null,null,null,"(4) Nos casos em que houver execução de granitina e omissão do item AGETOP 221102, considerou-se que o quantitativo para o rodapé, de altura igual a 7cm, foi incorporado na área de piso;"]
[null,null,null,null,null,null,null,null,null,null,null,"F",null,null,null,null,"(5) O custo unitário aproximado por metro quadrado é calculado dividindo-se o valor total do orçamento pela área total de construção."]
[null,null,null,null,null,null,null,null,null,null,null,"F"]
[null,null,null,null,null,null,null,null,null,null,null,"F"]
[]
[null,null,null,null,null,null,null,null,null,null,null,null,null,null,"SOMATÓRIO DE SERVIÇOS"]
[null,null,null,null,null,null,null,null,null,null,null,null,null,null,"ITEM","DESCRIÇÃO DOS SERVIÇOS",null,null,"PREÇO SEM BDI",null,null,null,null,"PREÇO COM BDI",null,null,"PARTICIPAÇÃO ( % )"]
[null,null,null,null,null,null,null,null,null,null,null,null,null,null,"a.","SERVIÇOS PRELIMINARES",null,null,{"$f":"SUMIF($R$19:$R$284,$P303,$Z$19:$Z$284)","v":0},null,null,null,null,{"$f":"ROUND(S303*(1+BDI.Taxa),2)","v":0},null,null,{"$f":"IFERROR(ROUND($X303*100/$Z$287,2),0)","v":0}]
[null,null,null,null,null,null,null,null,null,null,null,null,null,null,"b.","TRANSPORTES",null,null,0,null,null,null,null,0,null,null,0]
[null,null,null,null,null,null,null,null,null,null,null,null,null,null,"c.","SERVIÇO EM TERRA",null,null,0,null,null,null,null,0,null,null,0]
[null,null,null,null,null,null,null,null,null,null,null,null,null,null,"d.","FUNDAÇÕES E SONDAGENS",null,null,0,null,null,null,null,0,null,null,0]
[null,null,null,null,null,null,null,null,null,null,null,null,null,null,"e.","ESTRUTURA",null,null,0,null,null,null,null,0,null,null,0]
[null,null,null,null,null,null,null,null,null,null,null,null,null,null,"f.","INSTALAÇÕES ELÉTRICAS",null,null,0,null,null,null,null,0,null,null,0]
[null,null,null,null,null,null,null,null,null,null,null,null,null,null,"g.","INSTALAÇÕES HIDROSSANITÁRIAS",null,null,0,null,null,null,null,0,null,null,0]
[null,null,null,null,null,null,null,null,null,null,null,null,null,null,"h","INSTALAÇÕES ESPECIAIS",null,null,0,null,null,null,null,0,null,null,0]
[null,null,null,null,null,null,null,null,null,null,null,null,null,null,"i.","ALVENARIAS E DIVISÓRIAS",null,null,0,null,null,null,null,0,null,null,0]
[null,null,null,null,null,null,null,null,null,null,null,null,null,null,"j.","ALVENARIA AUTO-PORTANTE",null,null,0,null,null,null,null,0,null,null,0]
[null,null,null,null,null,null,null,null,null,null,null,null,null,null,"k.","IMPERMEABILIZAÇÃO",null,null,0,null,null,null,null,0,null,null,0]
[null,null,null,null,null,null,null,null,null,null,null,null,null,null,"l.","ISOLAMENTO TÉRMICO E ACÚSTICO",null,null,0,null,null,null,null,0,null,null,0]
[null,null,null,null,null,null,null,null,null,null,null,null,null,null,"m.","ESTRUTURA DE MADEIRA",null,null,0,null,null,null,null,0,null,null,0]
[null,null,null,null,null,null,null,null,null,null,null,null,null,null,"n.","ESTRUTURAS METÁLICAS",null,null,0,null,null,null,null,0,null,null,0]
[null,null,null,null,null,null,null,null,null,null,null,null,null,null,"o.","COBERTURAS",null,null,0,null,null,null,null,0,null,null,0]
[null,null,null,null,null,null,null,null,null,null,null,null,null,null,"p.","ESQUADRIAS DE MADEIRA",null,null,0,null,null,null,null,0,null,null,0]
[null,null,null,null,null,null,null,null,null,null,null,null,null,null,"q.","ESQUADRIAS METÁLICAS",null,null,0,null,null,null,null,{"$f":"ROUND(S319*(1+BDI.Taxa),2)","v":0},null,null,0]
[null,null,null,null,null,null,null,null,null,null,null,null,null,null,"r.","VIDROS",null,null,0,null,null,null,null,0,null,null,0]
[null,null,null,null,null,null,null,null,null,null,null,null,null,null,"s.","REVESTIMENTO DE PAREDE",null,null,0,null,null,null,null,0,null,null,0]
[null,null,null,null,null,null,null,null,null,null,null,null,null,null,"t.","FORROS",null,null,0,null,null,null,null,0,null,null,0]
[null,null,null,null,null,null,null,null,null,null,null,null,null,null,"u.","REVESTIMENTO DE PISO",null,null,0,null,null,null,null,0,null,null,0]
[null,null,null,null,null,null,null,null,null,null,null,null,null,null,"v.","FERRAGENS",null,null,0,null,null,null,null,0,null,null,0]
[null,null,null,null,null,null,null,null,null,null,null,null,null,null,"w.","MARCENARIA",null,null,0,null,null,null,null,0,null,null,0]
[null,null,null,null,null,null,null,null,null,null,null,null,null,null,"x.","ADMINISTRAÇÃO",null,null,0,null,null,null,null,0,null,null,0]
[null,null,null,null,null,null,null,null,null,null,null,null,null,null,"y.","PINTURA",null,null,0,null,null,null,null,{"$f":"ROUND(S327*(1+BDI.Taxa),2)","v":0},null,null,0]
[null,null,null,null,null,null,null,null,null,null,null,null,null,null,"z.","DIVERSOS",null,null,0,null,null,null,null,{"$f":"IF(S328>0,IF((SUM(X303:Y327)+ROUND(S328*(1+BDI.Taxa),2))<>X330,X330-SUM(X303:Y327),ROUND(S328*(1+BDI.Taxa),2)),0)","v":0},null,null,{"$f":"IF(S328>0,IF((SUM(AA303:AA327)+IFERROR(ROUND($X328*100/$Z$287,2),0))<>AA330,AA330-SUM(AA303:AA327),IFERROR(ROUND($X328*100/$Z$287,2),0)),0)","v":0}]
[null,null,null,null,null,null,null,null,null,null,null,null,null,null,"TOTAL GERAL DO ORÇAMENTO (R$)",null,null,null,{"$f":"SUM(S303:W328)","v":0},null,null,null,null,{"$f":"SUM(X303:Y328)","v":0},null,null,{"$f":"SUM(AA303:AA328)","v":0}]
[null,null,null,null,null,null,null,null,null,null,null,null,null,null,null,null,null,null,{"$f":"$Z$285","v":0},null,null,null,null,{"$f":"$Z$287","v":0},null,null,100]
[null,null,null,null,null,null,null,null,null,null,null,null,null,null,null,null,null,null,"(TOTAL SEM BDI)",null,null,null,null,"(TOTAL COM BDI)",null,null,"(ARRED porcentagem)"]
[null,null,null,null,null,null,null,null,null,null,null,null,null,null,null,null,null,null,{"$f":"IF(AND(S329=S330,S329>0),\"OK\",\"ERRO\")","v":"ERRO"},null,null,null,null,{"$f":"IF(AND(X329=X330,X329>0),\"OK\",\"ERRO\")","v":"ERRO"},null,null,{"$f":"IF(AA329=100,\"OK\",\"ERRO\")","v":"ERRO"}]
[]
[]
[null,null,null,null,null,null,null,null,null,null,null,null,null,null,"RESUMO GERAL DO ORÇAMENTO"]
[null,null,null,null,null,null,null,null,null,null,null,null,null,null,"ITEM","DESCRIÇÃO DOS SERVIÇOS",null,null,"PREÇO SEM BDI",null,null,null,null,"PREÇO COM BDI",null,null,"PARTICIPAÇÃO ( % )"]
[null,null,null,null,null,null,null,null,null,null,null,null,null,null,"1.",{"$f":"IFERROR(VLOOKUP(O337,$O$19:$Y$284,4,FALSE),\"\")","v":"1 - IMPLANTAÇÃO BLOCO ADMINISTRATIVO"},null,null,{"$f":"IF(P338=\"\",$S$358-SUM(OFFSET($S$336:S336,0,0,COUNTA($S$336:S336),1)),SUMIF($R$19:$R$284,$P337,$Z$19:$Z$284))","v":0},null,null,null,null,{"$f":"IF(P338=\"\",$X$358-SUM(OFFSET($X$336:X336,0,0,COUNTA($X$336:X336),1)),ROUND(S337*(1+BDI.Taxa),2))","v":0},null,null,{"$f":"IF(P338=\"\",$AA$358-SUM(OFFSET($AA$336:AA336,0,0,COUNTA($AA$336:AA336),1)),ROUND(X337*100/ORÇAMENTO.TotalOrçamento,2))","v":{"$error":"#DIV/0!"}}]
[null,null,null,null,null,null,null,null,null,null,null,null,null,null,"2.","1.1 - NOVO BLOCO ADMINISTRATIVO",null,null,{"$f":"IF(P339=\"\",$S$358-SUM(OFFSET($S$336:S337,0,0,COUNTA($S$336:S337),1)),SUMIF($R$19:$R$284,$P338,$Z$19:$Z$284))","v":0},null,null,null,null,{"$f":"IF(P339=\"\",$X$358-SUM(OFFSET($X$336:X337,0,0,COUNTA($X$336:X337),1)),ROUND(S338*(1+BDI.Taxa),2))","v":0},null,null,{"$f":"IF(P339=\"\",$AA$358-SUM(OFFSET($AA$336:AA337,0,0,COUNTA($AA$336:AA337),1)),ROUND(X338*100/ORÇAMENTO.TotalOrçamento,2))","v":{"$error":"#DIV/0!"}}]
[null,null,null,null,null,null,null,null,null,null,null,null,null,null,"3.","ADMINISTRAÇÃO LOCAL",null,null,{"$f":"IF(P340=\"\",$S$358-SUM(OFFSET($S$336:S338,0,0,COUNTA($S$336:S338),1)),SUMIF($R$19:$R$284,$P339,$Z$19:$Z$284))","v":0},null,null,null,null,{"$f":"IF(P340=\"\",$X$358-SUM(OFFSET($X$336:X338,0,0,COUNTA($X$336:X338),1)),ROUND(S339*(1+BDI.Taxa),2))","v":0},null,null,{"$f":"IF(P340=\"\",$AA$358-SUM(OFFSET($AA$336:AA338,0,0,COUNTA($AA$336:AA338),1)),ROUND(X339*100/ORÇAMENTO.TotalOrçamento,2))","v":{"$error":"#DIV/0!"}}]
[null,null,null,null,null,null,null,null,null,null,null,null,null,null,"4.","OBRA",null,null,{"$f":"IF(P341=\"\",$S$358-SUM(OFFSET($S$336:S339,0,0,COUNTA($S$336:S339),1)),SUMIF($R$19:$R$284,$P340,$Z$19:$Z$284))","v":0},null,null,null,null,{"$f":"IF(P341=\"\",$X$358-SUM(OFFSET($X$336:X339,0,0,COUNTA($X$336:X339),1)),ROUND(S340*(1+BDI.Taxa),2))","v":0},null,null,{"$f":"IF(P341=\"\",$AA$358-SUM(OFFSET($AA$336:AA339,0,0,COUNTA($AA$336:AA339),1)),ROUND(X340*100/ORÇAMENTO.TotalOrçamento,2))","v":{"$error":"#DIV/0!"}}]
[null,null,null,null,null,null,null,null,null,null,null,null,null,null,"5.","PROJETO ELÉTRICO",null,null,{"$f":"IF(P342=\"\",$S$358-SUM(OFFSET($S$336:S340,0,0,COUNTA($S$336:S340),1)),SUMIF($R$19:$R$284,$P341,$Z$19:$Z$284))","v":0},null,null,null,null,{"$f":"IF(P342=\"\",$X$358-SUM(OFFSET($X$336:X340,0,0,COUNTA($X$336:X340),1)),ROUND(S341*(1+BDI.Taxa),2))","v":0},null,null,{"$f":"IF(P342=\"\",$AA$358-SUM(OFFSET($AA$336:AA340,0,0,COUNTA($AA$336:AA340),1)),ROUND(X341*100/ORÇAMENTO.TotalOrçamento,2))","v":{"$error":"#DIV/0!"}}]
[null,null,null,null,null,null,null,null,null,null,null,null,null,null,"6.","PROJETO HIDROSSANITÁRIO",null,null,{"$f":"IF(P343=\"\",$S$358-SUM(OFFSET($S$336:S341,0,0,COUNTA($S$336:S341),1)),SUMIF($R$19:$R$284,$P342,$Z$19:$Z$284))","v":0},null,null,null,null,{"$f":"IF(P343=\"\",$X$358-SUM(OFFSET($X$336:X341,0,0,COUNTA($X$336:X341),1)),ROUND(S342*(1+BDI.Taxa),2))","v":0},null,null,{"$f":"IF(P343=\"\",$AA$358-SUM(OFFSET($AA$336:AA341,0,0,COUNTA($AA$336:AA341),1)),ROUND(X342*100/ORÇAMENTO.TotalOrçamento,2))","v":{"$error":"#DIV/0!"}}]
[null,null,null,null,null,null,null,null,null,null,null,null,null,null,"7.","PROJETO DE PREVENÇÃO E COMBATE A INCÊNDIO",null,null,{"$f":"IF(P344=\"\",$S$358-SUM(OFFSET($S$336:S342,0,0,COUNTA($S$336:S342),1)),SUMIF($R$19:$R$284,$P343,$Z$19:$Z$284))","v":0},null,null,null,null,{"$f":"IF(P344=\"\",$X$358-SUM(OFFSET($X$336:X342,0,0,COUNTA($X$336:X342),1)),ROUND(S343*(1+BDI.Taxa),2))","v":0},null,null,{"$f":"IF(P344=\"\",$AA$358-SUM(OFFSET($AA$336:AA342,0,0,COUNTA($AA$336:AA342),1)),ROUND(X343*100/ORÇAMENTO.TotalOrçamento,2))","v":{"$error":"#DIV/0!"}}]
[null,null,null,null,null,null,null,null,null,null,null,null,null,null,"8.","PROJETO ESTRUTURAL",null,null,{"$f":"IF(P345=\"\",$S$358-SUM(OFFSET($S$336:S343,0,0,COUNTA($S$336:S343),1)),SUMIF($R$19:$R$284,$P344,$Z$19:$Z$284))","v":0},null,null,null,null,{"$f":"IF(P345=\"\",$X$358-SUM(OFFSET($X$336:X343,0,0,COUNTA($X$336:X343),1)),ROUND(S344*(1+BDI.Taxa),2))","v":0},null,null,{"$f":"IF(P345=\"\",$AA$358-SUM(OFFSET($AA$336:AA343,0,0,COUNTA($AA$336:AA343),1)),ROUND(X344*100/ORÇAMENTO.TotalOrçamento,2))","v":{"$error":"#DIV/0!"}}]
[null,null,null,null,null,null,null,null,null,null,null,null,null,null,"9.","PROJETO ESTRUTURAS METÁLICAS",null,null,{"$f":"IF(P346=\"\",$S$358-SUM(OFFSET($S$336:S344,0,0,COUNTA($S$336:S344),1)),SUMIF($R$19:$R$284,$P345,$Z$19:$Z$284))","v":0},null,null,null,null,{"$f":"IF(P346=\"\",$X$358-SUM(OFFSET($X$336:X344,0,0,COUNTA($X$336:X344),1)),ROUND(S345*(1+BDI.Taxa),2))","v":0},null,null,{"$f":"IF(P346=\"\",$AA$358-SUM(OFFSET($AA$336:AA344,0,0,COUNTA($AA$336:AA344),1)),ROUND(X345*100/ORÇAMENTO.TotalOrçamento,2))","v":{"$error":"#DIV/0!"}}]
[null,null,null,null,null,null,null,null,null,null,null,null,null,null,"10.","",null,null,{"$f":"IF(P347=\"\",$S$358-SUM(OFFSET($S$336:S345,0,0,COUNTA($S$336:S345),1)),SUMIF($R$19:$R$284,$P346,$Z$19:$Z$284))","v":0},null,null,null,null,{"$f":"IF(P347=\"\",$X$358-SUM(OFFSET($X$336:X345,0,0,COUNTA($X$336:X345),1)),ROUND(S346*(1+BDI.Taxa),2))","v":0},null,null,{"$f":"IF(P347=\"\",$AA$358-SUM(OFFSET($AA$336:AA345,0,0,COUNTA($AA$336:AA345),1)),ROUND(X346*100/ORÇAMENTO.TotalOrçamento,2))","v":{"$error":"#DIV/0!"}}]
[null,null,null,null,null,null,null,null,null,null,null,null,null,null,"11.","",null,null,{"$f":"IF(P348=\"\",$S$358-SUM(OFFSET($S$336:S346,0,0,COUNTA($S$336:S346),1)),SUMIF($R$19:$R$284,$P347,$Z$19:$Z$284))","v":0},null,null,null,null,{"$f":"IF(P348=\"\",$X$358-SUM(OFFSET($X$336:X346,0,0,COUNTA($X$336:X346),1)),ROUND(S347*(1+BDI.Taxa),2))","v":0},null,null,{"$f":"IF(P348=\"\",$AA$358-SUM(OFFSET($AA$336:AA346,0,0,COUNTA($AA$336:AA346),1)),ROUND(X347*100/ORÇAMENTO.TotalOrçamento,2))","v":{"$error":"#DIV/0!"}}]
[null,null,null,null,null,null,null,null,null,null,null,null,null,null,"12.","",null,null,{"$f":"IF(P349=\"\",$S$358-SUM(OFFSET($S$336:S347,0,0,COUNTA($S$336:S347),1)),SUMIF($R$19:$R$284,$P348,$Z$19:$Z$284))","v":0},null,null,null,null,{"$f":"IF(P349=\"\",$X$358-SUM(OFFSET($X$336:X347,0,0,COUNTA($X$336:X347),1)),ROUND(S348*(1+BDI.Taxa),2))","v":0},null,null,{"$f":"IF(P349=\"\",$AA$358-SUM(OFFSET($AA$336:AA347,0,0,COUNTA($AA$336:AA347),1)),ROUND(X348*100/ORÇAMENTO.TotalOrçamento,2))","v":{"$error":"#DIV/0!"}}]
[null,null,null,null,null,null,null,null,null,null,null,null,null,null,"13.","",null,null,{"$f":"IF(P350=\"\",$S$358-SUM(OFFSET($S$336:S348,0,0,COUNTA($S$336:S348),1)),SUMIF($R$19:$R$284,$P349,$Z$19:$Z$284))","v":0},null,null,null,null,{"$f":"IF(P350=\"\",$X$358-SUM(OFFSET($X$336:X348,0,0,COUNTA($X$336:X348),1)),ROUND(S349*(1+BDI.Taxa),2))","v":0},null,null,{"$f":"IF(P350=\"\",$AA$358-SUM(OFFSET($AA$336:AA348,0,0,COUNTA($AA$336:AA348),1)),ROUND(X349*100/ORÇAMENTO.TotalOrçamento,2))","v":{"$error":"#DIV/0!"}}]
[null,null,null,null,null,null,null,null,null,null,null,null,null,null,"14.","",null,null,{"$f":"IF(P351=\"\",$S$358-SUM(OFFSET($S$336:S349,0,0,COUNTA($S$336:S349),1)),SUMIF($R$19:$R$284,$P350,$Z$19:$Z$284))","v":0},null,null,null,null,{"$f":"IF(P351=\"\",$X$358-SUM(OFFSET($X$336:X349,0,0,COUNTA($X$336:X349),1)),ROUND(S350*(1+BDI.Taxa),2))","v":0},null,null,{"$f":"IF(P351=\"\",$AA$358-SUM(OFFSET($AA$336:AA349,0,0,COUNTA($AA$336:AA349),1)),ROUND(X350*100/ORÇAMENTO.TotalOrçamento,2))","v":{"$error":"#DIV/0!"}}]
[null,null,null,null,null,null,null,null,null,null,null,null,null,null,"15.","",null,null,{"$f":"IF(P352=\"\",$S$358-SUM(OFFSET($S$336:S350,0,0,COUNTA($S$336:S350),1)),SUMIF($R$19:$R$284,$P351,$Z$19:$Z$284))","v":0},null,null,null,null,{"$f":"IF(P352=\"\",$X$358-SUM(OFFSET($X$336:X350,0,0,COUNTA($X$336:X350),1)),ROUND(S351*(1+BDI.Taxa),2))","v":0},null,null,{"$f":"IF(P352=\"\",$AA$358-SUM(OFFSET($AA$336:AA350,0,0,COUNTA($AA$336:AA350),1)),ROUND(X351*100/ORÇAMENTO.TotalOrçamento,2))","v":{"$error":"#DIV/0!"}}]
[null,null,null,null,null,null,null,null,null,null,null,null,null,null,"16.","",null,null,{"$f":"IF(P353=\"\",$S$358-SUM(OFFSET($S$336:S351,0,0,COUNTA($S$336:S351),1)),SUMIF($R$19:$R$284,$P352,$Z$19:$Z$284))","v":0},null,null,null,null,{"$f":"IF(P353=\"\",$X$358-SUM(OFFSET($X$336:X351,0,0,COUNTA($X$336:X351),1)),ROUND(S352*(1+BDI.Taxa),2))","v":0},null,null,{"$f":"IF(P353=\"\",$AA$358-SUM(OFFSET($AA$336:AA351,0,0,COUNTA($AA$336:AA351),1)),ROUND(X352*100/ORÇAMENTO.TotalOrçamento,2))","v":{"$error":"#DIV/0!"}}]
[null,null,null,null,null,null,null,null,null,null,null,null,null,null,"17.","",null,null,{"$f":"IF(P354=\"\",$S$358-SUM(OFFSET($S$336:S352,0,0,COUNTA($S$336:S352),1)),SUMIF($R$19:$R$284,$P353,$Z$19:$Z$284))","v":0},null,null,null,null,{"$f":"IF(P354=\"\",$X$358-SUM(OFFSET($X$336:X352,0,0,COUNTA($X$336:X352),1)),ROUND(S353*(1+BDI.Taxa),2))","v":0},null,null,{"$f":"IF(P354=\"\",$AA$358-SUM(OFFSET($AA$336:AA352,0,0,COUNTA($AA$336:AA352),1)),ROUND(X353*100/ORÇAMENTO.TotalOrçamento,2))","v":{"$error":"#DIV/0!"}}]
[null,null,null,null,null,null,null,null,null,null,null,null,null,null,"18.","",null,null,{"$f":"IF(P355=\"\",$S$358-SUM(OFFSET($S$336:S353,0,0,COUNTA($S$336:S353),1)),SUMIF($R$19:$R$284,$P354,$Z$19:$Z$284))","v":0},null,null,null,null,{"$f":"IF(P355=\"\",$X$358-SUM(OFFSET($X$336:X353,0,0,COUNTA($X$336:X353),1)),ROUND(S354*(1+BDI.Taxa),2))","v":0},null,null,{"$f":"IF(P355=\"\",$AA$358-SUM(OFFSET($AA$336:AA353,0,0,COUNTA($AA$336:AA353),1)),ROUND(X354*100/ORÇAMENTO.TotalOrçamento,2))","v":{"$error":"#DIV/0!"}}]
[null,null,null,null,null,null,null,null,null,null,null,null,null,null,"19.","",null,null,{"$f":"IF(P356=\"\",$S$358-SUM(OFFSET($S$336:S354,0,0,COUNTA($S$336:S354),1)),SUMIF($R$19:$R$284,$P355,$Z$19:$Z$284))","v":0},null,null,null,null,{"$f":"IF(P356=\"\",$X$358-SUM(OFFSET($X$336:X354,0,0,COUNTA($X$336:X354),1)),ROUND(S355*(1+BDI.Taxa),2))","v":0},null,null,{"$f":"IF(P356=\"\",$AA$358-SUM(OFFSET($AA$336:AA354,0,0,COUNTA($AA$336:AA354),1)),ROUND(X355*100/ORÇAMENTO.TotalOrçamento,2))","v":{"$error":"#DIV/0!"}}]
[null,null,null,null,null,null,null,null,null,null,null,null,null,null,"20.","",null,null,{"$f":"IF(P357=\"\",$S$358-SUM(OFFSET($S$336:S355,0,0,COUNTA($S$336:S355),1)),SUMIF($R$19:$R$284,$P356,$Z$19:$Z$284))","v":0},null,null,null,null,{"$f":"IF(P357=\"\",$X$358-SUM(OFFSET($X$336:X355,0,0,COUNTA($X$336:X355),1)),ROUND(S356*(1+BDI.Taxa),2))","v":0},null,null,{"$f":"IF(P357=\"\",$AA$358-SUM(OFFSET($AA$336:AA355,0,0,COUNTA($AA$336:AA355),1)),ROUND(X356*100/ORÇAMENTO.TotalOrçamento,2))","v":{"$error":"#DIV/0!"}}]
[null,null,null,null,null,null,null,null,null,null,null,null,null,null,"TOTAL GERAL DO ORÇAMENTO (R$)",null,null,null,{"$f":"SUM(S337:W356)","v":0},null,null,null,null,{"$f":"SUM(X337:Y356)","v":0},null,null,{"$f":"SUM(AA337:AA356)","v":{"$error":"#DIV/0!"}}]
[null,null,null,null,null,null,null,null,null,null,null,null,null,null,null,null,null,null,{"$f":"$Z$285","v":0},null,null,null,null,{"$f":"$Z$287","v":0},null,null,100]
[null,null,null,null,null,null,null,null,null,null,null,null,null,null,null,null,null,null,"(TOTAL SEM BDI)",null,null,null,null,"(TOTAL COM BDI)",null,null,"(ARRED porcentagem)"]
[null,null,null,null,null,null,null,null,null,null,null,null,null,null,null,null,null,null,{"$f":"IF(AND(S357=S358,S357>0),\"OK\",\"ERRO\")","v":"ERRO"},null,null,null,null,{"$f":"IF(AND(X357=X358,X357>0),\"OK\",\"ERRO\")","v":"ERRO"},null,null,{"$f":"IF(AND(AA357=100,S337<>0),\"OK\",\"ERRO\")","v":{"$error":"#DIV/0!"}}]

{"sheet":"Resumo ","index":1,"n_rows":39,"n_cols":9,"rows_kept":39,"cut":false,"hidden":false,"merged":[[13,0,14,0],[15,2,15,5],[16,2,16,5],[17,2,17,5],[18,2,18,5],[14,1,14,8],[0,1,0,8],[36,1,36,5],[2,1,2,5],[3,1,3,5],[5,1,5,5],[6,1,6,5],[8,1,8,5],[9,1,9,5],[11,3,11,5],[12,3,12,5],[10,1,10,8],[11,6,11,8],[12,6,12,8],[19,2,19,5],[20,2,20,5],[21,2,21,5],[31,2,31,5],[1,1,1,8],[2,6,2,8],[3,6,3,8],[4,1,4,8],[5,6,5,8],[6,6,6,8],[7,1,7,8],[8,6,8,8],[9,6,9,8],[13,1,13,8],[11,1,11,2],[12,1,12,2],[42,3,42,7],[41,3,41,7],[38,1,38,8],[22,2,22,5],[23,2,23,5],[24,2,24,5],[25,2,25,5],[26,2,26,5],[32,2,32,5],[33,2,33,5],[34,2,34,5],[35,2,35,5],[27,2,27,5],[28,2,28,5],[29,2,29,5],[30,2,30,5]]}
[]
[]
[null,"UNIDADE ESCOLAR",null,null,null,null,"CÓDIGO INEP"]
[null,{"$f":"Orçamento!$O$4","v":"COORDENAÇÃO REGIONAL DE EDUCAÇÃO DE ITAPACI"},null,null,null,null,{"$f":"Orçamento!X4","v":0}]
[]
[null,"OBRA",null,null,null,null,"CIDADE"]
[null,{"$f":"Orçamento!$O$7","v":"CONSTRUÇÃO"},null,null,null,null,{"$f":"Orçamento!$X$7","v":"ITAPACI"}]
[]
[null,"ENDEREÇO",null,null,null,null,"CRE"]
[null,{"$f":"Orçamento!$R$10","v":"AVENIDA DONA LÚCIA LOURENÇONI, 156, CENTRO"},null,null,null,null,{"$f":"Orçamento!$O$10","v":"ITAPACI"}]
[]
[null,"REFERÊNCIA",null,"DATA",null,null,"ÁREA TOTAL CONSTRUÍDA (M²)"]
[null,{"$f":"CONCATENATE(\"AGETOP E SINAPI - \",Orçamento!$T$10)","v":"AGETOP E SINAPI - DESONERADA"},null,{"$f":"Orçamento!$S$7","v":"2020-07-07"},null,null,{"$f":"Orçamento!$X$13","v":100.68}]
["FILTRO"]
[null,"RESUMO GERAL DO ORÇAMENTO"]
["↓","ITEM","DESCRIÇÃO DOS SERVIÇOS",null,null,null,"PREÇO SEM BDI","PREÇO COM BDI","PARTICIP. (%)"]
[{"$f":"IF(G17>0,\"F\",\"\")","v":""},"1.",{"$f":"Orçamento!$P337","v":"1 - IMPLANTAÇÃO BLOCO ADMINISTRATIVO"},null,null,null,{"$f":"IFERROR(Orçamento!S337,\"-\")","v":0},{"$f":"IFERROR(Orçamento!X337,\"\")","v":0},{"$f":"Orçamento!AA337","v":{"$error":"#DIV/0!"}}]
[{"$f":"IF(G18>0,\"F\",\"\")","v":""},"2.",{"$f":"Orçamento!$P338","v":"1.1 - NOVO BLOCO ADMINISTRATIVO"},null,null,null,{"$f":"IFERROR(Orçamento!S338,\"-\")","v":0},{"$f":"IFERROR(Orçamento!X338,\"\")","v":0},{"$f":"Orçamento!AA338","v":{"$error":"#DIV/0!"}}]
["","3.",{"$f":"Orçamento!$P339","v":"ADMINISTRAÇÃO LOCAL"},null,null,null,{"$f":"IFERROR(Orçamento!S339,\"-\")","v":0},{"$f":"IFERROR(Orçamento!X339,\"\")","v":0},{"$f":"Orçamento!AA339","v":{"$error":"#DIV/0!"}}]
["","4.",{"$f":"Orçamento!$P340","v":"OBRA"},null,null,null,{"$f":"IFERROR(Orçamento!S340,\"-\")","v":0},{"$f":"IFERROR(Orçamento!X340,\"\")","v":0},{"$f":"Orçamento!AA340","v":{"$error":"#DIV/0!"}}]
["","5.",{"$f":"Orçamento!$P341","v":"PROJETO ELÉTRICO"},null,null,null,{"$f":"IFERROR(Orçamento!S341,\"-\")","v":0},{"$f":"IFERROR(Orçamento!X341,\"\")","v":0},{"$f":"Orçamento!AA341","v":{"$error":"#DIV/0!"}}]
["","6.",{"$f":"Orçamento!$P342","v":"PROJETO HIDROSSANITÁRIO"},null,null,null,{"$f":"IFERROR(Orçamento!S342,\"-\")","v":0},{"$f":"IFERROR(Orçamento!X342,\"\")","v":0},{"$f":"Orçamento!AA342","v":{"$error":"#DIV/0!"}}]
["","7.",{"$f":"Orçamento!$P343","v":"PROJETO DE PREVENÇÃO E COMBATE A INCÊNDIO"},null,null,null,{"$f":"IFERROR(Orçamento!S343,\"-\")","v":0},{"$f":"IFERROR(Orçamento!X343,\"\")","v":0},{"$f":"Orçamento!AA343","v":{"$error":"#DIV/0!"}}]
["","8.",{"$f":"Orçamento!$P344","v":"PROJETO ESTRUTURAL"},null,null,null,{"$f":"IFERROR(Orçamento!S344,\"-\")","v":0},{"$f":"IFERROR(Orçamento!X344,\"\")","v":0},{"$f":"Orçamento!AA344","v":{"$error":"#DIV/0!"}}]
["","9.",{"$f":"Orçamento!$P345","v":"PROJETO ESTRUTURAS METÁLICAS"},null,null,null,{"$f":"IFERROR(Orçamento!S345,\"-\")","v":0},{"$f":"IFERROR(Orçamento!X345,\"\")","v":0},{"$f":"Orçamento!AA345","v":{"$error":"#DIV/0!"}}]
["","10.",{"$f":"Orçamento!$P346","v":""},null,null,null,{"$f":"IFERROR(Orçamento!S346,\"-\")","v":0},{"$f":"IFERROR(Orçamento!X346,\"\")","v":0},{"$f":"Orçamento!AA346","v":{"$error":"#DIV/0!"}}]
["","11.",{"$f":"Orçamento!$P347","v":""},null,null,null,{"$f":"IFERROR(Orçamento!S347,\"-\")","v":0},{"$f":"IFERROR(Orçamento!X347,\"\")","v":0},{"$f":"Orçamento!AA347","v":{"$error":"#DIV/0!"}}]
["","12.",{"$f":"Orçamento!$P348","v":""},null,null,null,{"$f":"IFERROR(Orçamento!S348,\"-\")","v":0},{"$f":"IFERROR(Orçamento!X348,\"\")","v":0},{"$f":"Orçamento!AA348","v":{"$error":"#DIV/0!"}}]
["","13.",{"$f":"Orçamento!$P349","v":""},null,null,null,{"$f":"IFERROR(Orçamento!S349,\"-\")","v":0},{"$f":"IFERROR(Orçamento!X349,\"\")","v":0},{"$f":"Orçamento!AA349","v":{"$error":"#DIV/0!"}}]
["","14.",{"$f":"Orçamento!$P350","v":""},null,null,null,{"$f":"IFERROR(Orçamento!S350,\"-\")","v":0},{"$f":"IFERROR(Orçamento!X350,\"\")","v":0},{"$f":"Orçamento!AA350","v":{"$error":"#DIV/0!"}}]
["","15.",{"$f":"Orçamento!$P351","v":""},null,null,null,{"$f":"IFERROR(Orçamento!S351,\"-\")","v":0},{"$f":"IFERROR(Orçamento!X351,\"\")","v":0},{"$f":"Orçamento!AA351","v":{"$error":"#DIV/0!"}}]
["","16.",{"$f":"Orçamento!$P352","v":""},null,null,null,{"$f":"IFERROR(Orçamento!S352,\"-\")","v":0},{"$f":"IFERROR(Orçamento!X352,\"\")","v":0},{"$f":"Orçamento!AA352","v":{"$error":"#DIV/0!"}}]
["","17.",{"$f":"Orçamento!$P353","v":""},null,null,null,{"$f":"IFERROR(Orçamento!S353,\"-\")","v":0},{"$f":"IFERROR(Orçamento!X353,\"\")","v":0},{"$f":"Orçamento!AA353","v":{"$error":"#DIV/0!"}}]
["","18.",{"$f":"Orçamento!$P354","v":""},null,null,null,{"$f":"IFERROR(Orçamento!S354,\"-\")","v":0},{"$f":"IFERROR(Orçamento!X354,\"\")","v":0},{"$f":"Orçamento!AA354","v":{"$error":"#DIV/0!"}}]
["","19.",{"$f":"Orçamento!$P355","v":""},null,null,null,{"$f":"IFERROR(Orçamento!S355,\"-\")","v":0},{"$f":"IFERROR(Orçamento!X355,\"\")","v":0},{"$f":"Orçamento!AA355","v":{"$error":"#DIV/0!"}}]
["","20.",{"$f":"Orçamento!$P356","v":""},null,null,null,{"$f":"IFERROR(Orçamento!S356,\"-\")","v":0},{"$f":"IFERROR(Orçamento!X356,\"\")","v":0},{"$f":"Orçamento!AA356","v":{"$error":"#DIV/0!"}}]
["F","TOTAL GERAL DO ORÇAMENTO (R$)",null,null,null,null,{"$f":"SUM(G17:G36)","v":0},{"$f":"SUM(H17:H36)","v":0},{"$f":"SUM(I17:I36)","v":{"$error":"#DIV/0!"}}]
["F"]
["F"]

{"sheet":"Somatório","index":2,"n_rows":45,"n_cols":6,"rows_kept":45,"cut":false,"hidden":false,"merged":[[13,0,14,0],[42,1,42,2],[44,1,44,5],[47,3,47,5],[48,3,48,5],[13,1,13,5],[9,1,9,3],[9,4,9,5],[11,1,11,2],[11,4,11,5],[12,1,12,2],[12,4,12,5],[0,1,0,5],[14,1,14,5],[2,1,2,3],[2,4,2,5],[3,1,3,3],[3,4,3,5],[5,1,5,3],[5,4,5,5],[6,1,6,3],[6,4,6,5],[8,1,8,3],[8,4,8,5],[1,1,1,5],[4,1,4,5],[7,1,7,5],[10,1,10,5]]}
[]
[]
[null,"UNIDADE ESCOLAR",null,null,"CÓDIGO INEP"]
[null,{"$f":"Orçamento!$O$4","v":"COORDENAÇÃO REGIONAL DE EDUCAÇÃO DE ITAPACI"},null,null,{"$f":"Orçamento!X4","v":0}]
[]
[null,"OBRA",null,null,"CIDADE"]
[null,{"$f":"Orçamento!$O$7","v":"CONSTRUÇÃO"},null,null,{"$f":"Orçamento!$X$7","v":"ITAPACI"}]
[]
[null,"ENDEREÇO",null,null,"CRE"]
[null,{"$f":"Orçamento!$R$10","v":"AVENIDA DONA LÚCIA LOURENÇONI, 156, CENTRO"},null,null,{"$f":"Orçamento!$O$10","v":"ITAPACI"}]
[]
[null,"REFERÊNCIA",null,"DATA","ÁREA TOTAL CONSTRUÍDA (M²)"]
[null,{"$f":"CONCATENATE(\"AGETOP E SINAPI - \",Orçamento!$T$10)","v":"AGETOP E SINAPI - DESONERADA"},null,{"$f":"Orçamento!$S$7","v":"2020-07-07"},{"$f":"Orçamento!$X$13","v":100.68}]
["FILTRO"]
[null,"SOMATÓRIO DE SERVIÇOS"]
["↓","ITEM","DESCRIÇÃO DOS SERVIÇOS","PREÇO SEM BDI (R$)","PREÇO COM BDI (R$)","PARTIC.  ( % )"]
[{"$f":"IF(D17>0,\"F\",\"\")","v":""},"a.",{"$f":"Orçamento!P303","v":"SERVIÇOS PRELIMINARES"},{"$f":"Orçamento!S303","v":0},{"$f":"Orçamento!X303","v":0},{"$f":"Orçamento!AA303","v":0}]
[{"$f":"IF(D18>0,\"F\",\"\")","v":""},"b.",{"$f":"Orçamento!P304","v":"TRANSPORTES"},{"$f":"Orçamento!S304","v":0},{"$f":"Orçamento!X304","v":0},{"$f":"Orçamento!AA304","v":0}]
["","c.",{"$f":"Orçamento!P305","v":"SERVIÇO EM TERRA"},{"$f":"Orçamento!S305","v":0},{"$f":"Orçamento!X305","v":0},{"$f":"Orçamento!AA305","v":0}]
["","d.",{"$f":"Orçamento!P306","v":"FUNDAÇÕES E SONDAGENS"},{"$f":"Orçamento!S306","v":0},{"$f":"Orçamento!X306","v":0},{"$f":"Orçamento!AA306","v":0}]
["","e.",{"$f":"Orçamento!P307","v":"ESTRUTURA"},{"$f":"Orçamento!S307","v":0},{"$f":"Orçamento!X307","v":0},{"$f":"Orçamento!AA307","v":0}]
["","f.",{"$f":"Orçamento!P308","v":"INSTALAÇÕES ELÉTRICAS"},{"$f":"Orçamento!S308","v":0},{"$f":"Orçamento!X308","v":0},{"$f":"Orçamento!AA308","v":0}]
["","g.",{"$f":"Orçamento!P309","v":"INSTALAÇÕES HIDROSSANITÁRIAS"},{"$f":"Orçamento!S309","v":0},{"$f":"Orçamento!X309","v":0},{"$f":"Orçamento!AA309","v":0}]
["","h",{"$f":"Orçamento!P310","v":"INSTALAÇÕES ESPECIAIS"},{"$f":"Orçamento!S310","v":0},{"$f":"Orçamento!X310","v":0},{"$f":"Orçamento!AA310","v":0}]
["","i.",{"$f":"Orçamento!P311","v":"ALVENARIAS E DIVISÓRIAS"},{"$f":"Orçamento!S311","v":0},{"$f":"Orçamento!X311","v":0},{"$f":"Orçamento!AA311","v":0}]
["","j.",{"$f":"Orçamento!P312","v":"ALVENARIA AUTO-PORTANTE"},{"$f":"Orçamento!S312","v":0},{"$f":"Orçamento!X312","v":0},{"$f":"Orçamento!AA312","v":0}]
["","k.",{"$f":"Orçamento!P313","v":"IMPERMEABILIZAÇÃO"},{"$f":"Orçamento!S313","v":0},{"$f":"Orçamento!X313","v":0},{"$f":"Orçamento!AA313","v":0}]
["","l.",{"$f":"Orçamento!P314","v":"ISOLAMENTO TÉRMICO E ACÚSTICO"},{"$f":"Orçamento!S314","v":0},{"$f":"Orçamento!X314","v":0},{"$f":"Orçamento!AA314","v":0}]
["","m.",{"$f":"Orçamento!P315","v":"ESTRUTURA DE MADEIRA"},{"$f":"Orçamento!S315","v":0},{"$f":"Orçamento!X315","v":0},{"$f":"Orçamento!AA315","v":0}]
["","n.",{"$f":"Orçamento!P316","v":"ESTRUTURAS METÁLICAS"},{"$f":"Orçamento!S316","v":0},{"$f":"Orçamento!X316","v":0},{"$f":"Orçamento!AA316","v":0}]
["","o.",{"$f":"Orçamento!P317","v":"COBERTURAS"},{"$f":"Orçamento!S317","v":0},{"$f":"Orçamento!X317","v":0},{"$f":"Orçamento!AA317","v":0}]
["","p.",{"$f":"Orçamento!P318","v":"ESQUADRIAS DE MADEIRA"},{"$f":"Orçamento!S318","v":0},{"$f":"Orçamento!X318","v":0},{"$f":"Orçamento!AA318","v":0}]
["","q.",{"$f":"Orçamento!P319","v":"ESQUADRIAS METÁLICAS"},{"$f":"Orçamento!S319","v":0},{"$f":"Orçamento!X319","v":0},{"$f":"Orçamento!AA319","v":0}]
["","r.",{"$f":"Orçamento!P320","v":"VIDROS"},{"$f":"Orçamento!S320","v":0},{"$f":"Orçamento!X320","v":0},{"$f":"Orçamento!AA320","v":0}]
["","s.",{"$f":"Orçamento!P321","v":"REVESTIMENTO DE PAREDE"},{"$f":"Orçamento!S321","v":0},{"$f":"Orçamento!X321","v":0},{"$f":"Orçamento!AA321","v":0}]
["","t.",{"$f":"Orçamento!P322","v":"FORROS"},{"$f":"Orçamento!S322","v":0},{"$f":"Orçamento!X322","v":0},{"$f":"Orçamento!AA322","v":0}]
["","u.",{"$f":"Orçamento!P323","v":"REVESTIMENTO DE PISO"},{"$f":"Orçamento!S323","v":0},{"$f":"Orçamento!X323","v":0},{"$f":"Orçamento!AA323","v":0}]
["","v.",{"$f":"Orçamento!P324","v":"FERRAGENS"},{"$f":"Orçamento!S324","v":0},{"$f":"Orçamento!X324","v":0},{"$f":"Orçamento!AA324","v":0}]
["","w.",{"$f":"Orçamento!P325","v":"MARCENARIA"},{"$f":"Orçamento!S325","v":0},{"$f":"Orçamento!X325","v":0},{"$f":"Orçamento!AA325","v":0}]
["","x.",{"$f":"Orçamento!P326","v":"ADMINISTRAÇÃO"},{"$f":"Orçamento!S326","v":0},{"$f":"Orçamento!X326","v":0},{"$f":"Orçamento!AA326","v":0}]
["","y.",{"$f":"Orçamento!P327","v":"PINTURA"},{"$f":"Orçamento!S327","v":0},{"$f":"Orçamento!X327","v":0},{"$f":"Orçamento!AA327","v":0}]
["","z.",{"$f":"Orçamento!P328","v":"DIVERSOS"},{"$f":"Orçamento!S328","v":0},{"$f":"Orçamento!X328","v":0},{"$f":"Orçamento!AA328","v":0}]
["F","TOTAL GERAL DO ORÇAMENTO",null,{"$f":"SUM(D17:D42)","v":0},{"$f":"SUM(E17:E42)","v":0},{"$f":"SUM(F17:F42)","v":0}]
[]
[null,"(*) Para itens da AGETOP, os vidros não estão inclusos nas esquadrias e já foram considerados os custos de contramarco para as esquadrias de alumínio;"]

{"sheet":"Cronog_45_Dias","index":3,"n_rows":99,"n_cols":14,"rows_kept":99,"cut":false,"hidden":false,"merged":[[12,0,13,0],[9,0,11,0],[11,1,11,13],[92,1,92,2],[92,5,92,8],[92,9,92,12],[93,1,93,2],[93,5,93,8],[93,9,93,12],[74,9,74,12],[74,5,74,8],[68,9,68,12],[70,5,70,8],[70,9,70,12],[59,5,59,8],[71,1,73,2],[71,4,73,4],[71,5,71,8],[71,9,71,12],[73,5,73,8],[73,9,73,12],[59,9,59,12],[61,5,61,8],[61,9,61,12],[94,1,94,2],[94,5,94,8],[94,9,94,12],[76,5,76,8],[76,9,76,12],[77,5,77,8],[77,9,77,12],[79,5,79,8],[79,9,79,12],[80,5,80,8],[80,9,80,12],[82,5,82,8],[82,9,82,12],[77,3,79,3],[80,3,82,3],[86,1,88,2],[80,4,82,4],[83,3,85,3],[77,1,79,2],[77,4,79,4],[80,1,82,2],[95,1,95,2],[95,5,95,8],[95,9,95,12],[97,1,97,4],[98,1,98,13],[86,9,86,12],[88,5,88,8],[88,9,88,12],[85,5,85,8],[85,9,85,12],[89,1,91,2],[89,4,91,4],[89,5,89,8],[89,9,89,12],[91,5,91,8],[91,9,91,12],[89,3,91,3],[86,4,88,4],[86,5,86,8],[86,3,88,3],[83,1,85,2],[83,4,85,4],[83,5,83,8],[83,9,83,12],[68,5,68,8],[65,5,65,8],[65,9,65,12],[67,5,67,8],[67,9,67,12],[65,3,67,3],[62,9,62,12],[64,5,64,8],[64,9,64,12],[62,5,62,8],[53,9,53,12],[55,5,55,8],[55,9,55,12],[50,5,50,8],[50,9,50,12],[52,5,52,8],[52,9,52,12],[56,9,56,12],[58,5,58,8],[58,9,58,12],[53,5,53,8],[56,5,56,8],[44,9,44,12],[46,5,46,8],[46,9,46,12],[47,1,49,2],[47,4,49,4],[47,5,47,8],[47,9,47,12],[49,5,49,8],[49,9,49,12],[44,5,44,8],[47,3,49,3],[44,3,46,3],[44,1,46,2],[44,4,46,4],[35,9,35,12],[37,5,37,8],[37,9,37,12],[35,3,37,3],[40,9,40,12],[38,3,40,3],[38,9,38,12],[41,1,43,2],[41,4,43,4],[41,5,41,8],[41,9,41,12],[43,5,43,8],[43,9,43,12],[41,3,43,3],[35,5,35,8],[38,5,38,8],[40,5,40,8],[35,1,37,2],[35,4,37,4],[38,1,40,2],[38,4,40,4],[29,9,29,12],[31,5,31,8],[31,9,31,12],[32,1,34,2],[32,4,34,4],[32,5,32,8],[32,9,32,12],[34,5,34,8],[34,9,34,12],[32,3,34,3],[29,5,29,8],[29,1,31,2],[29,4,31,4],[29,3,31,3],[23,9,23,12],[25,5,25,8],[25,9,25,12],[26,1,28,2],[26,4,28,4],[26,5,26,8],[26,9,26,12],[28,5,28,8],[28,9,28,12],[23,3,25,3],[23,1,25,2],[23,4,25,4],[23,5,23,8],[26,3,28,3],[20,4,22,4],[20,5,20,8],[20,9,20,12],[22,5,22,8],[22,9,22,12],[20,3,22,3],[14,3,16,3],[17,3,19,3],[14,4,16,4],[14,5,14,8],[14,9,14,12],[16,5,16,8],[16,9,16,12],[65,1,67,2],[68,3,70,3],[62,3,64,3],[68,1,70,2],[56,3,58,3],[65,4,67,4],[74,3,76,3],[50,4,52,4],[74,4,76,4],[56,1,58,2],[56,4,58,4],[50,3,52,3],[53,3,55,3],[68,4,70,4],[62,1,64,2],[62,4,64,4],[59,3,61,3],[53,1,55,2],[53,4,55,4],[59,1,61,2],[59,4,61,4],[74,1,76,2],[10,1,10,13],[9,8,9,13],[8,8,8,13],[3,8,3,13],[6,8,6,13],[5,8,5,13],[2,8,2,13],[50,1,52,2],[71,3,73,3],[12,13,13,13],[13,1,13,2],[13,5,13,8],[13,9,13,12],[12,3,13,3],[12,9,12,12],[14,1,16,2],[12,5,12,8],[17,1,19,2],[17,4,19,4],[17,5,17,8],[17,9,17,12],[19,5,19,8],[19,9,19,12],[20,1,22,2],[0,1,0,13],[2,1,2,7],[3,1,3,7],[5,1,5,7],[6,1,6,7],[8,1,8,7],[9,1,9,7],[1,1,1,13],[7,1,7,13],[4,1,4,13]]}
[]
[]
[null,"UNIDADE ESCOLAR",null,null,null,null,null,null,"PRAZO"]
[null,{"$f":"Orçamento!$O$4","v":"COORDENAÇÃO REGIONAL DE EDUCAÇÃO DE ITAPACI"},null,null,null,null,null,null,"45 DIAS CORRIDOS"]
[]
[null,"OBRA",null,null,null,null,null,null,"DATA"]
[null,{"$f":"Orçamento!$O$7","v":"CONSTRUÇÃO"},null,null,null,null,null,null,{"$f":"Orçamento!$S$7","v":"2020-07-07"}]
[]
[null,"LOCAL",null,null,null,null,null,null,"ÁREA TOTAL CONSTRUÍDA (M²)"]
["FILTRO",{"$f":"Orçamento!$X$7","v":"ITAPACI"},null,null,null,null,null,null,{"$f":"Orçamento!$X$13","v":100.68}]
[]
[null,"CRONOGRAMA - FÍSICO FINANCEIRO"]
["↓","CUSTO TOTAL:",{"$f":"D93","v":0},"VALOR","Dias:",22,null,null,null,45,null,null,null,"TOTAL"]
[null,"DESCRIÇÃO DOS SERVIÇOS",null,null,"%","1ª PARCELA",null,null,null,"2ª PARCELA"]
[{"$f":"IF(D15>0,\"F\",\"\")","v":""},"SERVIÇOS PRELIMINARES",null,{"$f":"Orçamento!X303","v":0},{"$f":"Orçamento!AA303","v":0},{"$f":"ROUND(F17*$D$15,2)","v":0},null,null,null,{"$f":"ROUND(J17*$D$15,2)","v":0},null,null,null,{"$f":"SUM(F15:M15)","v":0}]
[{"$f":"IF(A15=\"F\",A15,\"\")","v":""}]
[{"$f":"IF(A16=\"F\",A16,\"\")","v":""},null,null,null,null,1,null,null,null,{"$f":"1-F17","v":0},null,null,null,{"$f":"IFERROR(E15/100,\"\")","v":0}]
[{"$f":"IF(D18>0,\"F\",\"\")","v":""},"TRANSPORTES",null,{"$f":"Orçamento!X304","v":0},{"$f":"Orçamento!AA304","v":0},{"$f":"ROUND(F20*$D$18,2)","v":0},null,null,null,{"$f":"ROUND(J20*$D$18,2)","v":0},null,null,null,{"$f":"SUM(F18:M18)","v":0}]
[{"$f":"IF(A18=\"F\",A18,\"\")","v":""}]
[{"$f":"IF(A19=\"F\",A19,\"\")","v":""},null,null,null,null,0.48,null,null,null,{"$f":"1-F20","v":0.52},null,null,null,{"$f":"IFERROR(E18/100,\"\")","v":0}]
[{"$f":"IF(D21>0,\"F\",\"\")","v":""},"SERVIÇO EM TERRA",null,{"$f":"Orçamento!X305","v":0},{"$f":"Orçamento!AA305","v":0},{"$f":"ROUND(F23*$D$21,2)","v":0},null,null,null,{"$f":"ROUND(J23*$D$21,2)","v":0},null,null,null,{"$f":"SUM(F21:M21)","v":0}]
[{"$f":"IF(A21=\"F\",A21,\"\")","v":""}]
[{"$f":"IF(A22=\"F\",A22,\"\")","v":""},null,null,null,null,1,null,null,null,{"$f":"1-F23","v":0},null,null,null,{"$f":"IFERROR(E21/100,\"\")","v":0}]
[{"$f":"IF(D24>0,\"F\",\"\")","v":""},"FUNDAÇÕES E SONDAGENS",null,{"$f":"Orçamento!X306","v":0},{"$f":"Orçamento!AA306","v":0},{"$f":"ROUND(F26*$D$24,2)","v":0},null,null,null,{"$f":"ROUND(J26*$D$24,2)","v":0},null,null,null,{"$f":"SUM(F24:M24)","v":0}]
[{"$f":"IF(A24=\"F\",A24,\"\")","v":""}]
[{"$f":"IF(A25=\"F\",A25,\"\")","v":""},null,null,null,null,1,null,null,null,{"$f":"1-F26","v":0},null,null,null,{"$f":"IFERROR(E24/100,\"\")","v":0}]
[{"$f":"IF(D27>0,\"F\",\"\")","v":""},"ESTRUTURA",null,{"$f":"Orçamento!X307","v":0},{"$f":"Orçamento!AA307","v":0},{"$f":"ROUND(F29*$D$27,2)","v":0},null,null,null,{"$f":"ROUND(J29*$D$27,2)","v":0},null,null,null,{"$f":"SUM(F27:M27)","v":0}]
[{"$f":"IF(A27=\"F\",A27,\"\")","v":""}]
[{"$f":"IF(A28=\"F\",A28,\"\")","v":""},null,null,null,null,0.49,null,null,null,{"$f":"1-F29","v":0.51},null,null,null,{"$f":"IFERROR(E27/100,\"\")","v":0}]
[{"$f":"IF(D30>0,\"F\",\"\")","v":""},"INST.ELET/TELEFÔNICA/CABEAMENTO ESTRUTURADO",null,{"$f":"Orçamento!X308","v":0},{"$f":"Orçamento!AA308","v":0},{"$f":"ROUND(F32*$D$30,2)","v":0},null,null,null,{"$f":"ROUND(J32*$D$30,2)","v":0},null,null,null,{"$f":"SUM(F30:M30)","v":0}]
[{"$f":"IF(A30=\"F\",A30,\"\")","v":""}]
[{"$f":"IF(A31=\"F\",A31,\"\")","v":""},null,null,null,null,0.4,null,null,null,{"$f":"1-F32","v":0.6},null,null,null,{"$f":"IFERROR(E30/100,\"\")","v":0}]
[{"$f":"IF(D33>0,\"F\",\"\")","v":""},"INSTALAÇÕES HIDROSSANITÁRIAS",null,{"$f":"Orçamento!X309","v":0},{"$f":"Orçamento!AA309","v":0},{"$f":"ROUND(F35*$D$33,2)","v":0},null,null,null,{"$f":"ROUND(J35*$D$33,2)","v":0},null,null,null,{"$f":"SUM(F33:M33)","v":0}]
[{"$f":"IF(A33=\"F\",A33,\"\")","v":""}]
[{"$f":"IF(A34=\"F\",A34,\"\")","v":""},null,null,null,null,0.48,null,null,null,{"$f":"1-F35","v":0.52},null,null,null,{"$f":"IFERROR(E33/100,\"\")","v":0}]
[{"$f":"IF(D36>0,\"F\",\"\")","v":""},"INSTALAÇÕES ESPECIAIS",null,{"$f":"Orçamento!X310","v":0},{"$f":"Orçamento!AA310","v":0},{"$f":"ROUND(F38*$D$36,2)","v":0},null,null,null,{"$f":"ROUND(J38*$D$36,2)","v":0},null,null,null,{"$f":"SUM(F36:M36)","v":0}]
[{"$f":"IF(A36=\"F\",A36,\"\")","v":""}]
[{"$f":"IF(A37=\"F\",A37,\"\")","v":""},null,null,null,null,1,null,null,null,{"$f":"1-F38","v":0},null,null,null,{"$f":"IFERROR(E36/100,\"\")","v":0}]
[{"$f":"IF(D39>0,\"F\",\"\")","v":""},"ALVENARIA E DIVISÓRIAS",null,{"$f":"Orçamento!X311","v":0},{"$f":"Orçamento!AA311","v":0},{"$f":"ROUND(F41*$D$39,2)","v":0},null,null,null,{"$f":"ROUND(J41*$D$39,2)","v":0},null,null,null,{"$f":"SUM(F39:M39)","v":0}]
[{"$f":"IF(A39=\"F\",A39,\"\")","v":""}]
[{"$f":"IF(A40=\"F\",A40,\"\")","v":""},null,null,null,null,1,null,null,null,{"$f":"1-F41","v":0},null,null,null,{"$f":"IFERROR(E39/100,\"\")","v":0}]
[{"$f":"IF(D42>0,\"F\",\"\")","v":""},"ALVENARIA AUTO-PORTANTE",null,{"$f":"Orçamento!X312","v":0},{"$f":"Orçamento!AA312","v":0},{"$f":"ROUND(F44*$D$42,2)","v":0},null,null,null,{"$f":"ROUND(J44*$D$42,2)","v":0},null,null,null,{"$f":"SUM(F42:M42)","v":0}]
[{"$f":"IF(A42=\"F\",A42,\"\")","v":""}]
[{"$f":"IF(A43=\"F\",A43,\"\")","v":""},null,null,null,null,1,null,null,null,{"$f":"1-F44","v":0},null,null,null,{"$f":"IFERROR(E42/100,\"\")","v":0}]
[{"$f":"IF(D45>0,\"F\",\"\")","v":""},"IMPERMEABILIZAÇÃO",null,{"$f":"Orçamento!X313","v":0},{"$f":"Orçamento!AA313","v":0},{"$f":"ROUND(F47*$D$45,2)","v":0},null,null,null,{"$f":"ROUND(J47*$D$45,2)","v":0},null,null,null,{"$f":"SUM(F45:M45)","v":0}]
[{"$f":"IF(A45=\"F\",A45,\"\")","v":""}]
[{"$f":"IF(A46=\"F\",A46,\"\")","v":""},null,null,null,null,1,null,null,null,{"$f":"1-F47","v":0},null,null,null,{"$f":"IFERROR(E45/100,\"\")","v":0}]
[{"$f":"IF(D48>0,\"F\",\"\")","v":""},"ISOLAMENTO TÉRMICO E ACÚSTICO",null,{"$f":"Orçamento!X314","v":0},{"$f":"Orçamento!AA314","v":0},{"$f":"ROUND(F50*$D$48,2)","v":0},null,null,null,{"$f":"ROUND(J50*$D$48,2)","v":0},null,null,null,{"$f":"SUM(F48:M48)","v":0}]
[{"$f":"IF(A48=\"F\",A48,\"\")","v":""}]
[{"$f":"IF(A49=\"F\",A49,\"\")","v":""},null,null,null,null,0.5,null,null,null,{"$f":"1-F50","v":0.5},null,null,null,{"$f":"IFERROR(E48/100,\"\")","v":0}]
[{"$f":"IF(D51>0,\"F\",\"\")","v":""},"ESTRUTURA DE MADEIRA",null,{"$f":"Orçamento!X315","v":0},{"$f":"Orçamento!AA315","v":0},{"$f":"ROUND(F53*$D$51,2)","v":0},null,null,null,{"$f":"ROUND(J53*$D$51,2)","v":0},null,null,null,{"$f":"SUM(F51:M51)","v":0}]
[{"$f":"IF(A51=\"F\",A51,\"\")","v":""}]
[{"$f":"IF(A52=\"F\",A52,\"\")","v":""},null,null,null,null,0.4,null,null,null,{"$f":"1-F53","v":0.6},null,null,null,{"$f":"IFERROR(E51/100,\"\")","v":0}]
[{"$f":"IF(D54>0,\"F\",\"\")","v":""},"ESTRUTURA METÁLICA",null,{"$f":"Orçamento!X316","v":0},{"$f":"Orçamento!AA316","v":0},{"$f":"ROUND(F56*$D$54,2)","v":0},null,null,null,{"$f":"ROUND(J56*$D$54,2)","v":0},null,null,null,{"$f":"SUM(F54:M54)","v":0}]
[{"$f":"IF(A54=\"F\",A54,\"\")","v":""}]
[{"$f":"IF(A55=\"F\",A55,\"\")","v":""},null,null,null,null,0.35,null,null,null,{"$f":"1-F56","v":0.65},null,null,null,{"$f":"IFERROR(E54/100,\"\")","v":0}]
[{"$f":"IF(D57>0,\"F\",\"\")","v":""},"COBERTURAS",null,{"$f":"Orçamento!X317","v":0},{"$f":"Orçamento!AA317","v":0},{"$f":"ROUND(F59*$D$57,2)","v":0},null,null,null,{"$f":"ROUND(J59*$D$57,2)","v":0},null,null,null,{"$f":"SUM(F57:M57)","v":0}]
[{"$f":"IF(A57=\"F\",A57,\"\")","v":""}]
[{"$f":"IF(A58=\"F\",A58,\"\")","v":""},null,null,null,null,0,null,null,null,{"$f":"1-F59","v":1},null,null,null,{"$f":"IFERROR(E57/100,\"\")","v":0}]
[{"$f":"IF(D60>0,\"F\",\"\")","v":""},"ESQUADRIAS DE MADEIRA",null,{"$f":"Orçamento!X318","v":0},{"$f":"Orçamento!AA318","v":0},{"$f":"ROUND(F62*$D$60,2)","v":0},null,null,null,{"$f":"ROUND(J62*$D$60,2)","v":0},null,null,null,{"$f":"SUM(F60:M60)","v":0}]
[{"$f":"IF(A60=\"F\",A60,\"\")","v":""}]
[{"$f":"IF(A61=\"F\",A61,\"\")","v":""},null,null,null,null,0.54,null,null,null,{"$f":"1-F62","v":0.45999999999999996},null,null,null,{"$f":"IFERROR(E60/100,\"\")","v":0}]
[{"$f":"IF(D63>0,\"F\",\"\")","v":""},"ESQUADRIAS METÁLICAS",null,{"$f":"Orçamento!X319","v":0},{"$f":"Orçamento!AA319","v":0},{"$f":"ROUND(F65*$D$63,2)","v":0},null,null,null,{"$f":"ROUND(J65*$D$63,2)","v":0},null,null,null,{"$f":"SUM(F63:M63)","v":0}]
[{"$f":"IF(A63=\"F\",A63,\"\")","v":""}]
[{"$f":"IF(A64=\"F\",A64,\"\")","v":""},null,null,null,null,0.49,null,null,null,{"$f":"1-F65","v":0.51},null,null,null,{"$f":"IFERROR(E63/100,\"\")","v":0}]
[{"$f":"IF(D66>0,\"F\",\"\")","v":""},"VIDROS",null,{"$f":"Orçamento!X320","v":0},{"$f":"Orçamento!AA320","v":0},{"$f":"ROUND(F68*$D$66,2)","v":0},null,null,null,{"$f":"ROUND(J68*$D$66,2)","v":0},null,null,null,{"$f":"SUM(F66:M66)","v":0}]
[{"$f":"IF(A66=\"F\",A66,\"\")","v":""}]
[{"$f":"IF(A67=\"F\",A67,\"\")","v":""},null,null,null,null,0,null,null,null,{"$f":"1-F68","v":1},null,null,null,{"$f":"IFERROR(E66/100,\"\")","v":0}]
[{"$f":"IF(D69>0,\"F\",\"\")","v":""},"REVESTIMENTO DE PAREDE",null,{"$f":"Orçamento!X321","v":0},{"$f":"Orçamento!AA321","v":0},{"$f":"ROUND(F71*$D$69,2)","v":0},null,null,null,{"$f":"ROUND(J71*$D$69,2)","v":0},null,null,null,{"$f":"SUM(F69:M69)","v":0}]
[{"$f":"IF(A69=\"F\",A69,\"\")","v":""}]
[{"$f":"IF(A70=\"F\",A70,\"\")","v":""},null,null,null,null,0.32,null,null,null,{"$f":"1-F71","v":0.67999999999999994},null,null,null,{"$f":"IFERROR(E69/100,\"\")","v":0}]
[{"$f":"IF(D72>0,\"F\",\"\")","v":""},"FORROS",null,{"$f":"Orçamento!X322","v":0},{"$f":"Orçamento!AA322","v":0},{"$f":"ROUND(F74*$D$72,2)","v":0},null,null,null,{"$f":"ROUND(J74*$D$72,2)","v":0},null,null,null,{"$f":"SUM(F72:M72)","v":0}]
[{"$f":"IF(A72=\"F\",A72,\"\")","v":""}]
[{"$f":"IF(A73=\"F\",A73,\"\")","v":""},null,null,null,null,0.24,null,null,null,{"$f":"1-F74","v":0.76},null,null,null,{"$f":"IFERROR(E72/100,\"\")","v":0}]
[{"$f":"IF(D75>0,\"F\",\"\")","v":""},"REVESTIMENTO DE PISO",null,{"$f":"Orçamento!X323","v":0},{"$f":"Orçamento!AA323","v":0},{"$f":"ROUND(F77*$D$75,2)","v":0},null,null,null,{"$f":"ROUND(J77*$D$75,2)","v":0},null,null,null,{"$f":"SUM(F75:M75)","v":0}]
[{"$f":"IF(A75=\"F\",A75,\"\")","v":""}]
[{"$f":"IF(A76=\"F\",A76,\"\")","v":""},null,null,null,null,0.49,null,null,null,{"$f":"1-F77","v":0.51},null,null,null,{"$f":"IFERROR(E75/100,\"\")","v":0}]
[{"$f":"IF(D78>0,\"F\",\"\")","v":""},"FERRAGENS",null,{"$f":"Orçamento!X324","v":0},{"$f":"Orçamento!AA324","v":0},{"$f":"ROUND(F80*$D$78,2)","v":0},null,null,null,{"$f":"ROUND(J80*$D$78,2)","v":0},null,null,null,{"$f":"SUM(F78:M78)","v":0}]
[{"$f":"IF(A78=\"F\",A78,\"\")","v":""}]
[{"$f":"IF(A79=\"F\",A79,\"\")","v":""},null,null,null,null,0,null,null,null,{"$f":"1-F80","v":1},null,null,null,{"$f":"IFERROR(E78/100,\"\")","v":0}]
[{"$f":"IF(D81>0,\"F\",\"\")","v":""},"MARCENARIA",null,{"$f":"Orçamento!X325","v":0},{"$f":"Orçamento!AA325","v":0},{"$f":"ROUND(F83*$D$81,2)","v":0},null,null,null,{"$f":"ROUND(J83*$D$81,2)","v":0},null,null,null,{"$f":"SUM(F81:M81)","v":0}]
[{"$f":"IF(A81=\"F\",A81,\"\")","v":""}]
[{"$f":"IF(A82=\"F\",A82,\"\")","v":""},null,null,null,null,0.4,null,null,null,{"$f":"1-F83","v":0.6},null,null,null,{"$f":"IFERROR(E81/100,\"\")","v":0}]
[{"$f":"IF(D84>0,\"F\",\"\")","v":""},"ADMINISTRAÇÃO - MENSALISTAS",null,{"$f":"Orçamento!X326","v":0},{"$f":"Orçamento!AA326","v":0},{"$f":"ROUND(F86*$D$84,2)","v":0},null,null,null,{"$f":"ROUND(J86*$D$84,2)","v":0},null,null,null,{"$f":"SUM(F84:M84)","v":0}]
[{"$f":"IF(A84=\"F\",A84,\"\")","v":""}]
[{"$f":"IF(A85=\"F\",A85,\"\")","v":""},null,null,null,null,0.49,null,null,null,{"$f":"1-F86","v":0.51},null,null,null,{"$f":"IFERROR(E84/100,\"\")","v":0}]
[{"$f":"IF(D87>0,\"F\",\"\")","v":""},"PINTURA",null,{"$f":"Orçamento!X327","v":0},{"$f":"Orçamento!AA327","v":0},{"$f":"ROUND(F89*$D$87,2)","v":0},null,null,null,{"$f":"ROUND(J89*$D$87,2)","v":0},null,null,null,{"$f":"SUM(F87:M87)","v":0}]
[{"$f":"IF(A87=\"F\",A87,\"\")","v":""}]
[{"$f":"IF(A88=\"F\",A88,\"\")","v":""},null,null,null,null,0,null,null,null,{"$f":"1-F89","v":1},null,null,null,{"$f":"IFERROR(E87/100,\"\")","v":0}]
[{"$f":"IF(D90>0,\"F\",\"\")","v":""},"DIVERSOS",null,{"$f":"Orçamento!X328","v":0},{"$f":"Orçamento!AA328","v":0},{"$f":"ROUND(F92*$D$90,2)","v":0},null,null,null,{"$f":"ROUND(J92*$D$90,2)","v":0},null,null,null,{"$f":"SUM(F90:M90)","v":0}]
[{"$f":"IF(A90=\"F\",A90,\"\")","v":""}]
[{"$f":"IF(A91=\"F\",A91,\"\")","v":""},null,null,null,null,0.46,null,null,null,{"$f":"1-F92","v":0.54},null,null,null,{"$f":"IFERROR(E90/100,\"\")","v":0}]
["F","CUSTO DO ORÇAMENTO",null,{"$f":"SUM(D15:D92)","v":0},{"$f":"SUM(E15:E92)","v":0},{"$f":"F15+F18+F21+F24+F27+F30+F33+F36+F39+F42+F45+F48+F51+F54+F57+F60+F63+F66+F69+F72+F75+F78+F81+F84+F87+F90","v":0},null,null,null,{"$f":"J15+J18+J21+J24+J27+J30+J33+J36+J39+J42+J45+J48+J51+J54+J57+J60+J63+J66+J69+J72+J75+J78+J81+J84+J87+J90","v":0},null,null,null,{"$f":"N15+N18+N21+N24+N27+N30+N33+N36+N39+N42+N45+N48+N51+N54+N57+N60+N63+N66+N69+N72+N75+N78+N81+N84+N87+N90","v":0}]
["F","PERCENTUAIS:",null,null,null,{"$f":"IFERROR(F93/D93,\"\")","v":""},null,null,null,{"$f":"IFERROR(J93/D93,\"\")","v":""},null,null,null,{"$f":"SUM(F94:M94)","v":0}]
["F","TOTAIS ACUMULADOS:",null,null,null,{"$f":"F93","v":0},null,null,null,{"$f":"F95+J93","v":0}]
["F","PERCENTUAIS  ACUMULADOS:",null,null,null,{"$f":"F94","v":""},null,null,null,{"$f":"IFERROR(F96+J94,\"\")","v":""}]
["F"]
["F","OBSERVAÇÕES:"]
["F","Os pagamentos somente poderão ser efetuados mediante medição e atesto pelos técnicos da Secretaria da Educação. "]

{"sheet":"Composição BDI","index":4,"n_rows":45,"n_cols":9,"rows_kept":45,"cut":false,"hidden":false,"merged":[[18,5,18,8],[17,0,17,3],[16,0,16,3],[44,0,44,3],[42,0,42,3],[43,0,43,3],[18,0,18,3],[36,0,36,3],[39,0,39,3],[38,0,38,3],[40,0,40,3],[29,0,29,2],[32,0,32,3],[33,0,33,3],[34,0,34,3],[35,0,35,3],[0,0,0,3],[2,0,2,3],[3,0,3,3],[1,0,1,3],[5,0,5,3],[4,0,4,3],[12,0,12,3],[13,0,13,3],[14,0,14,3],[15,0,15,3],[6,0,6,3],[8,0,8,3],[7,0,7,3],[9,0,9,3],[11,0,11,3],[10,0,10,3]]}
[]
[]
["UNIDADE ESCOLAR"]
[{"$f":"Orçamento!$O$4","v":"COORDENAÇÃO REGIONAL DE EDUCAÇÃO DE ITAPACI"}]
[]
["OBRA"]
[{"$f":"Orçamento!$O$7","v":"CONSTRUÇÃO"}]
[]
["ENDEREÇO"]
[{"$f":"Orçamento!$R$10","v":"AVENIDA DONA LÚCIA LOURENÇONI, 156, CENTRO"}]
[]
["CIDADE"]
[{"$f":"Orçamento!$X$7","v":"ITAPACI"}]
[]
["CRE"]
[{"$f":"Orçamento!$O$10","v":"ITAPACI"}]
[]
["DETALHAMENTO DA COMPOSIÇÃO DE BDI"]
["COMPOSIÇÃO BDI PARA OBRAS CIVIS",null,null,null,null,"BDI CONSTRUÇÃO E REFORMA"]
["DESCRIÇÃO","COEF.","TAXA % (a.m)","% no preço de venda",null,"Situação","1º Quartil","Médio","3º Quartil"]
["1) COFINS",1,0.03,{"$f":"C21","v":0.03},null,{"$f":"IF(OR(C21<G21,C21>I21),\"FORA DO INTERVALO\",\"OK\")","v":"OK"},0.03,0.03,0.03]
["2) PIS",1,6.4999999999999997E-3,{"$f":"C22","v":6.4999999999999997E-3},null,{"$f":"IF(OR(C22<G22,C22>I22),\"FORA DO INTERVALO\",\"OK\")","v":"OK"},6.4999999999999997E-3,6.4999999999999997E-3,6.4999999999999997E-3]
["3) ISSQN",1,2.5000000000000001E-2,{"$f":"C23*B23","v":2.5000000000000001E-2},null,"OK",0.02,3.5000000000000003E-2,0.05]
["4) CPRB",1,4.4999999999999998E-2,{"$f":"C24","v":4.4999999999999998E-2},null,"OK",4.4999999999999998E-2,4.4999999999999998E-2,4.4999999999999998E-2]
["5) Administração Central",1,0.04,0.04,null,"OK",0.03,0.04,5.5E-2]
["6) Despesas Financeiras",1,5.5999999999999999E-3,5.5999999999999999E-3,null,"FORA DO INTERVALO",5.8999999999999999E-3,1.23E-2,1.3899999999999999E-2]
["7) Seguros + Garantias",1,1.1999999999999999E-3,1.1999999999999999E-3,null,"FORA DO INTERVALO",8.0000000000000002E-3,8.0000000000000002E-3,0.01]
["8) Risco",1,9.7000000000000003E-3,9.7000000000000003E-3,null,"OK",9.7000000000000003E-3,1.2699999999999999E-2,1.2699999999999999E-2]
["9) Lucro",1,6.8699999999999997E-2,6.8699999999999997E-2,null,"OK",6.1600000000000002E-2,7.3999999999999996E-2,8.9599999999999999E-2]
["BDI - FINAL",null,null,{"$f":"(((1+D25+D27+D28)*(1+D26)*(1+D29))/(1-(D21+D22+D23+D24))-1)","v":0.26400243116731992},null,{"$f":"IF(OR(D30<G30,D30>I30),\"FORA DO INTERVALO\",\"OK\")","v":"FORA DO INTERVALO"},0.2034,0.22120000000000001,0.25]
[]
["Notas:"]
["(1) e (2) Alíquota definida por lei."]
["(3) Alíquota e base de cálculo definidas pela legislação municipal."]
["(4) Alíquota definida pelas leis 12.546/11, 12844/13 e 13.161/15 (CPRB – contribuição previdenciária sobre a receita bruta)."]
["(5) Valores definidos a partir dos limites no Acórdão nº 2.622/2013 - TCU – Plenário. Valores entre o 1º e 3º quartis."]
["(6) Valor calculado pela expressão matemática do acórdão 2.369/2011 – TCU – Plenário e disponibilizado pela AGETOP em dezembro de 2018. (Foi utilizado para o cálculo a média da Taxa SELIC no período de 11/2017 a 10/2018)"]
[]
["(7) Valores definidos pela AGETOP a partir dos limites no Acórdão nº 2.622/2013 - TCU – Plenário. Valores médios. \n\nObservação da AGETOP: (Seguros contra erros de execução, incêndio e explosão, danos da natureza (vendaval, destelhamento, alagamento, inundação, desmoronamento, geadas etc.), emprego de material defeituoso ou inadequado, roubo e/ou furto qualificado, quebra de equipamentos, desmoronamento de estrutura, nas modalidades de Obras Civis em Construção (OCC); Instalação e Montagem (IM); e Obras Civis em Construção e Instalação e Montagem (OCC/IM). Bem como coberturas adicionais para ampliação dessas coberturas básicas, como: cobertura de responsabilidade civil geral, cobertura de responsabilidade civil cruzada, cobertura de despesas extraordinárias, cobertura de tumultos, cobertura de desentulho do local, cobertura de riscos do fabricante, dentre outras, incluindo o seguro de vida em grupo regido pela convenção coletiva dos trabalhadores na indústria da construção civil). A partir de 24/02/2015 por intermédio da Portaria 449/2015 a Presidência da AGETOP, na pessoa do Senhor Jayme Eduardo Rincon, determinou a exclusão dos valores referentes aos Seguros de Risco de Engenharia e Responsabilidade Civil do Profissional na composição do cálculo do B.D.I.."]
["(8) Valores definidos a partir dos limites no Acórdão nº 2.622/2013 - TCU – Plenário. Valores entre 1º e 3° quartis."]
["(9) Valores definidos a partir dos limites definidos no Acórdão nº 2.622/2013 - TCU – Plenário. Valores adotados e praticados no mercado ( “ ex ante ” ) ou aqueles entre os 1º e 3º quartis."]
[]
["(*) A fórmula para estipulação da taxa de BDI estimado adotado é a mesma que foi aplicada para a obtenção das tabelas contidas no Acórdão n. 2.622/2013 – TCUPlenário"]
[]
["Obs.: Para obras com valores superiores a R$ 20.000.000,00 sugere-se recalcular o BDI, dimensionando as taxas de administração central e lucro para patamares inferiores ao estipulado acima."]

{"sheet":"Relatório CENTRAL","index":5,"n_rows":40,"n_cols":5,"rows_kept":40,"cut":false,"hidden":false,"merged":[[9,0,11,0],[0,1,0,4],[6,3,6,4],[9,3,9,4],[1,1,1,4],[2,1,2,2],[2,3,2,4],[3,1,3,2],[3,3,3,4],[4,1,4,4],[5,1,5,2],[5,3,5,4],[6,1,6,2],[7,1,7,4],[8,1,8,2],[8,3,8,4],[9,1,9,2],[10,1,10,4],[11,1,11,4],[39,1,39,2]]}
[]
[]
[null,"UNIDADE ESCOLAR",null,"CIDADE"]
[null,{"$f":"Orçamento!$O$4","v":"COORDENAÇÃO REGIONAL DE EDUCAÇÃO DE ITAPACI"},null,{"$f":"Orçamento!$X$7","v":"ITAPACI"}]
[]
[null,"OBRA",null,"CRE"]
[null,{"$f":"Orçamento!$O$7","v":"CONSTRUÇÃO"},null,{"$f":"Orçamento!$O$10","v":"ITAPACI"}]
[]
[null,"ENDEREÇO",null,"DATA"]
["FILTRO",{"$f":"Orçamento!$R$10","v":"AVENIDA DONA LÚCIA LOURENÇONI, 156, CENTRO"},null,{"$f":"Orçamento!$S$7","v":"2020-07-07"}]
[]
[null,"RELATÓRIO CENTRAL"]
["↓","CÓDIGO","ETAPA","PREÇO  (R$) C/ BDI","PARTIC  ( % )"]
[{"$f":"IF(D14>0,\"F\",\"\")","v":""},{"$f":"Orçamento!O303","v":"a."},{"$f":"Orçamento!P303","v":"SERVIÇOS PRELIMINARES"},{"$f":"Orçamento!X303","v":0},{"$f":"Orçamento!AA303","v":0}]
[{"$f":"IF(D15>0,\"F\",\"\")","v":""},{"$f":"Orçamento!O304","v":"b."},{"$f":"Orçamento!P304","v":"TRANSPORTES"},{"$f":"Orçamento!X304","v":0},{"$f":"Orçamento!AA304","v":0}]
["",{"$f":"Orçamento!O305","v":"c."},{"$f":"Orçamento!P305","v":"SERVIÇO EM TERRA"},{"$f":"Orçamento!X305","v":0},{"$f":"Orçamento!AA305","v":0}]
["",{"$f":"Orçamento!O306","v":"d."},{"$f":"Orçamento!P306","v":"FUNDAÇÕES E SONDAGENS"},{"$f":"Orçamento!X306","v":0},{"$f":"Orçamento!AA306","v":0}]
["",{"$f":"Orçamento!O307","v":"e."},{"$f":"Orçamento!P307","v":"ESTRUTURA"},{"$f":"Orçamento!X307","v":0},{"$f":"Orçamento!AA307","v":0}]
["",{"$f":"Orçamento!O308","v":"f."},{"$f":"Orçamento!P308","v":"INSTALAÇÕES ELÉTRICAS"},{"$f":"Orçamento!X308","v":0},{"$f":"Orçamento!AA308","v":0}]
["",{"$f":"Orçamento!O309","v":"g."},{"$f":"Orçamento!P309","v":"INSTALAÇÕES HIDROSSANITÁRIAS"},{"$f":"Orçamento!X309","v":0},{"$f":"Orçamento!AA309","v":0}]
["",{"$f":"Orçamento!O310","v":"h"},{"$f":"Orçamento!P310","v":"INSTALAÇÕES ESPECIAIS"},{"$f":"Orçamento!X310","v":0},{"$f":"Orçamento!AA310","v":0}]
["",{"$f":"Orçamento!O311","v":"i."},{"$f":"Orçamento!P311","v":"ALVENARIAS E DIVISÓRIAS"},{"$f":"Orçamento!X311","v":0},{"$f":"Orçamento!AA311","v":0}]
["",{"$f":"Orçamento!O312","v":"j."},{"$f":"Orçamento!P312","v":"ALVENARIA AUTO-PORTANTE"},{"$f":"Orçamento!X312","v":0},{"$f":"Orçamento!AA312","v":0}]
["",{"$f":"Orçamento!O313","v":"k."},{"$f":"Orçamento!P313","v":"IMPERMEABILIZAÇÃO"},{"$f":"Orçamento!X313","v":0},{"$f":"Orçamento!AA313","v":0}]
["",{"$f":"Orçamento!O314","v":"l."},{"$f":"Orçamento!P314","v":"ISOLAMENTO TÉRMICO E ACÚSTICO"},{"$f":"Orçamento!X314","v":0},{"$f":"Orçamento!AA314","v":0}]
["",{"$f":"Orçamento!O315","v":"m."},{"$f":"Orçamento!P315","v":"ESTRUTURA DE MADEIRA"},{"$f":"Orçamento!X315","v":0},{"$f":"Orçamento!AA315","v":0}]
["",{"$f":"Orçamento!O316","v":"n."},{"$f":"Orçamento!P316","v":"ESTRUTURAS METÁLICAS"},{"$f":"Orçamento!X316","v":0},{"$f":"Orçamento!AA316","v":0}]
["",{"$f":"Orçamento!O317","v":"o."},{"$f":"Orçamento!P317","v":"COBERTURAS"},{"$f":"Orçamento!X317","v":0},{"$f":"Orçamento!AA317","v":0}]
["",{"$f":"Orçamento!O318","v":"p."},{"$f":"Orçamento!P318","v":"ESQUADRIAS DE MADEIRA"},{"$f":"Orçamento!X318","v":0},{"$f":"Orçamento!AA318","v":0}]
["",{"$f":"Orçamento!O319","v":"q."},{"$f":"Orçamento!P319","v":"ESQUADRIAS METÁLICAS"},{"$f":"Orçamento!X319","v":0},{"$f":"Orçamento!AA319","v":0}]
["",{"$f":"Orçamento!O320","v":"r."},{"$f":"Orçamento!P320","v":"VIDROS"},{"$f":"Orçamento!X320","v":0},{"$f":"Orçamento!AA320","v":0}]
["",{"$f":"Orçamento!O321","v":"s."},{"$f":"Orçamento!P321","v":"REVESTIMENTO DE PAREDE"},{"$f":"Orçamento!X321","v":0},{"$f":"Orçamento!AA321","v":0}]
["",{"$f":"Orçamento!O322","v":"t."},{"$f":"Orçamento!P322","v":"FORROS"},{"$f":"Orçamento!X322","v":0},{"$f":"Orçamento!AA322","v":0}]
["",{"$f":"Orçamento!O323","v":"u."},{"$f":"Orçamento!P323","v":"REVESTIMENTO DE PISO"},{"$f":"Orçamento!X323","v":0},{"$f":"Orçamento!AA323","v":0}]
["",{"$f":"Orçamento!O324","v":"v."},{"$f":"Orçamento!P324","v":"FERRAGENS"},{"$f":"Orçamento!X324","v":0},{"$f":"Orçamento!AA324","v":0}]
["",{"$f":"Orçamento!O325","v":"w."},{"$f":"Orçamento!P325","v":"MARCENARIA"},{"$f":"Orçamento!X325","v":0},{"$f":"Orçamento!AA325","v":0}]
["",{"$f":"Orçamento!O326","v":"x."},{"$f":"Orçamento!P326","v":"ADMINISTRAÇÃO"},{"$f":"Orçamento!X326","v":0},{"$f":"Orçamento!AA326","v":0}]
["",{"$f":"Orçamento!O327","v":"y."},{"$f":"Orçamento!P327","v":"PINTURA"},{"$f":"Orçamento!X327","v":0},{"$f":"Orçamento!AA327","v":0}]
["",{"$f":"Orçamento!O328","v":"z."},{"$f":"Orçamento!P328","v":"DIVERSOS"},{"$f":"Orçamento!X328","v":0},{"$f":"Orçamento!AA328","v":0}]
["F","TOTAL GERAL DO ORÇAMENTO (R$) C/BDI",null,{"$f":"SUM(D14:D39)","v":0},{"$f":"SUM(E14:E39)","v":0}]

{"sheet":"Parc Maior Relev","index":6,"n_rows":33,"n_cols":7,"rows_kept":33,"cut":false,"hidden":false,"merged":[[0,1,0,6],[11,1,11,6],[1,1,1,6],[2,1,2,3],[2,4,2,6],[3,1,3,3],[3,4,3,6],[4,1,4,6],[5,1,5,3],[5,4,5,6],[9,1,9,3],[9,4,9,6],[10,1,10,6],[6,1,6,3],[6,4,6,6],[7,1,7,6],[8,1,8,3],[8,4,8,6],[33,3,33,7],[31,1,31,6]]}
[]
[]
[null,"UNIDADE ESCOLAR",null,null,"CÓDIGO INEP"]
[null,{"$f":"Orçamento!$O$4","v":"COORDENAÇÃO REGIONAL DE EDUCAÇÃO DE ITAPACI"},null,null,{"$f":"Orçamento!$X$4","v":0}]
[]
[null,"OBRA",null,null,"CIDADE"]
[null,{"$f":"Orçamento!$O$7","v":"CONSTRUÇÃO"},null,null,{"$f":"Orçamento!$X$7","v":"ITAPACI"}]
[]
[null,"CRE",null,null,"ÁREA TOTAL CONSTRUÍDA (M²)"]
[null,{"$f":"Orçamento!$O$10","v":"ITAPACI"},null,null,{"$f":"Orçamento!$X$13","v":100.68}]
[]
["FILTRO","PARCELA DE MAIOR RELEVÂNCIA"]
[{"$f":"IF(G14>0,\"F\",\"\")","v":""},"CÓDIGO","SERVIÇO","DESCRIÇÃO","UNID","QUANT","PARC. MAIOR RELEV (100%)"]
[{"$f":"IF(G14>0,\"F\",\"\")","v":""},"f.","INSTALAÇÕES ELÉTRICAS","SUBESTAÇÃO","KVA",{"$f":"SUMIF(Orçamento!$R$20:$R$284,'Parc Maior Relev'!D14,Orçamento!$T$20:$T$284)","v":0},{"$f":"F14","v":0}]
[{"$f":"IF(SUM(G16:G30)>0,\"F\",\"\")","v":"F"},"CÓDIGO","SERVIÇO","DESCRIÇÃO","UNID","QUANT","PARC. MAIOR RELEV (50%)"]
[{"$f":"IF(G16>0,\"F\",\"\")","v":""},"e.","ESTRUTURA","CONCRETO","M3",{"$f":"SUMIF(Orçamento!$R$20:$R$284,'Parc Maior Relev'!D16,Orçamento!$T$20:$T$284)","v":0},{"$f":"F16*0.5","v":0}]
[{"$f":"IF(G17>0,\"F\",\"\")","v":""},"f.","INSTALAÇÕES ELÉTRICAS","INSTALAÇÕES ELÉTRICAS","KVA",{"$f":"SUMIF(Orçamento!$R$20:$R$284,'Parc Maior Relev'!D17,Orçamento!$T$20:$T$284)","v":0},{"$f":"F17*0.5","v":0}]
[{"$f":"IF(G18>0,\"F\",\"\")","v":""},"o.","COBERTURAS","COBERTURA CERÂMICA","M2",{"$f":"SUMIF(Orçamento!$R$20:$R$284,'Parc Maior Relev'!D18,Orçamento!$T$20:$T$284)","v":0},0]
["","o.","COBERTURAS","COBERTURA COM TELHA METÁLICA","M2",{"$f":"SUMIF(Orçamento!$R$20:$R$284,'Parc Maior Relev'!D19,Orçamento!$T$20:$T$284)","v":0},0]
["","s.","REVESTIMENTO DE PAREDE","CHAPISCO","M2",{"$f":"SUMIF(Orçamento!$R$20:$R$284,'Parc Maior Relev'!D20,Orçamento!$T$20:$T$284)","v":0},0]
["F","s.","REVESTIMENTO DE PAREDE","REBOCO","M2",379.28,189.64]
["","s.","REVESTIMENTO DE PAREDE","REVESTIMENTO CERÂMICO","M2",{"$f":"SUMIF(Orçamento!$R$20:$R$284,'Parc Maior Relev'!D22,Orçamento!$T$20:$T$284)","v":0},0]
["","t.","FORROS","FORRO DE GESSO","M2",{"$f":"SUMIF(Orçamento!$R$20:$R$284,'Parc Maior Relev'!D23,Orçamento!$T$20:$T$284)","v":0},0]
["","t.","FORROS","FORRO DE PVC","M2",{"$f":"SUMIF(Orçamento!$R$20:$R$284,'Parc Maior Relev'!D24,Orçamento!$T$20:$T$284)","v":0},0]
["","t.","FORROS","FORRO DE GESSO ACARTONADO","M2",{"$f":"SUMIF(Orçamento!$R$20:$R$284,'Parc Maior Relev'!D25,Orçamento!$T$20:$T$284)","v":0},0]
["","u.","REVESTIMENTO DE PISO","PISO DE GRANITINA","M2",{"$f":"SUMIF(Orçamento!$R$20:$R$284,'Parc Maior Relev'!D26,Orçamento!$T$20:$T$284)","v":0},0]
["","u.","REVESTIMENTO DE PISO","PISO LAMINADO","M2",{"$f":"SUMIF(Orçamento!$R$20:$R$284,'Parc Maior Relev'!D27,Orçamento!$T$20:$T$284)","v":0},0]
["","u.","REVESTIMENTO DE PISO","PISO DE CONCRETO DESEMPENADO","M2",{"$f":"SUMIF(Orçamento!$R$20:$R$284,'Parc Maior Relev'!D28,Orçamento!$T$20:$T$284)","v":0},0]
["","u.","REVESTIMENTO DE PISO","PISO CERÂMICO","M2",{"$f":"SUMIF(Orçamento!$R$20:$R$284,'Parc Maior Relev'!D29,Orçamento!$T$20:$T$284)","v":0},0]
["","y.","PINTURA","PINTURA","M2",{"$f":"SUMIF(Orçamento!$R$20:$R$284,'Parc Maior Relev'!D30,Orçamento!$T$20:$T$284)","v":0},0]
["F"]
["F","(*) Para os fins do inciso I dp § 1º do Art. 30 da Lei Federal 8.666/93, são consideradas parcelas de maior relevância técnica as execuções apresentadas"]
["F"]

{"sheet":"Composições","index":7,"n_rows":267,"n_cols":10,"rows_kept":267,"cut":false,"hidden":false,"merged":[[247,5,248,5],[247,6,247,7],[247,8,247,9],[252,1,252,7],[266,1,266,7],[247,0,248,0],[247,1,248,1],[247,2,248,2],[247,3,248,3],[247,4,248,4],[225,5,226,5],[225,6,225,7],[225,8,225,9],[230,1,230,7],[245,1,245,7],[225,0,226,0],[225,1,226,1],[225,2,226,2],[225,3,226,3],[225,4,226,4],[205,5,206,5],[205,6,205,7],[205,8,205,9],[210,1,210,7],[223,1,223,7],[205,0,206,0],[205,1,206,1],[205,2,206,2],[205,3,206,3],[205,4,206,4],[186,5,187,5],[186,6,186,7],[186,8,186,9],[191,1,191,7],[203,1,203,7],[186,0,187,0],[186,1,187,1],[186,2,187,2],[186,3,187,3],[186,4,187,4],[176,5,177,5],[176,6,176,7],[176,8,176,9],[180,1,180,7],[184,1,184,7],[176,0,177,0],[176,1,177,1],[176,2,177,2],[176,3,177,3],[176,4,177,4],[166,5,167,5],[166,6,166,7],[166,8,166,9],[170,1,170,7],[174,1,174,7],[166,0,167,0],[166,1,167,1],[166,2,167,2],[166,3,167,3],[166,4,167,4],[156,5,157,5],[156,6,156,7],[156,8,156,9],[161,1,161,7],[164,1,164,7],[156,0,157,0],[156,1,157,1],[156,2,157,2],[156,3,157,3],[156,4,157,4],[146,5,147,5],[146,6,146,7],[146,8,146,9],[151,1,151,7],[154,1,154,7],[146,0,147,0],[146,1,147,1],[146,2,147,2],[146,3,147,3],[146,4,147,4],[137,5,138,5],[137,6,137,7],[137,8,137,9],[142,1,142,7],[144,1,144,7],[137,0,138,0],[137,1,138,1],[137,2,138,2],[137,3,138,3],[137,4,138,4],[128,5,129,5],[128,6,128,7],[128,8,128,9],[133,1,133,7],[135,1,135,7],[128,0,129,0],[128,1,129,1],[128,2,129,2],[128,3,129,3],[128,4,129,4],[119,5,120,5],[119,6,119,7],[119,8,119,9],[124,1,124,7],[126,1,126,7],[119,0,120,0],[119,1,120,1],[119,2,120,2],[119,3,120,3],[119,4,120,4],[110,5,111,5],[110,6,110,7],[110,8,110,9],[115,1,115,7],[117,1,117,7],[110,0,111,0],[110,1,111,1],[110,2,111,2],[110,3,111,3],[110,4,111,4],[101,5,102,5],[101,6,101,7],[101,8,101,9],[106,1,106,7],[108,1,108,7],[101,0,102,0],[101,1,102,1],[101,2,102,2],[101,3,102,3],[101,4,102,4],[91,5,92,5],[91,6,91,7],[91,8,91,9],[96,1,96,7],[99,1,99,7],[91,0,92,0],[91,1,92,1],[91,2,92,2],[91,3,92,3],[91,4,92,4],[81,5,82,5],[81,6,81,7],[81,8,81,9],[86,1,86,7],[89,1,89,7],[81,0,82,0],[81,1,82,1],[81,2,82,2],[81,3,82,3],[81,4,82,4],[68,5,69,5],[68,6,68,7],[68,8,68,9],[74,1,74,7],[79,1,79,7],[68,0,69,0],[68,1,69,1],[68,2,69,2],[68,3,69,3],[68,4,69,4],[55,5,56,5],[55,6,55,7],[55,8,55,9],[59,1,59,7],[66,1,66,7],[55,0,56,0],[55,1,56,1],[55,2,56,2],[55,3,56,3],[55,4,56,4],[45,5,46,5],[45,6,45,7],[45,8,45,9],[49,1,49,7],[53,1,53,7],[45,0,46,0],[45,1,46,1],[45,2,46,2],[45,3,46,3],[45,4,46,4],[35,5,36,5],[35,6,35,7],[35,8,35,9],[39,1,39,7],[43,1,43,7],[35,0,36,0],[35,1,36,1],[35,2,36,2],[35,3,36,3],[35,4,36,4],[23,5,24,5],[23,6,23,7],[23,8,23,9],[28,1,28,7],[33,1,33,7],[23,0,24,0],[23,1,24,1],[23,2,24,2],[23,3,24,3],[23,4,24,4],[16,5,17,5],[16,6,16,7],[16,8,16,9],[20,1,20,7],[21,1,21,7],[16,0,17,0],[16,1,17,1],[16,2,17,2],[16,3,17,3],[16,4,17,4],[15,0,15,9],[13,0,13,2],[13,3,13,6],[1,0,1,9],[3,7,3,9],[4,7,4,9],[6,7,6,9],[7,7,7,9],[6,0,6,6],[10,8,10,9],[13,8,13,9],[14,0,14,9],[8,0,8,9],[5,0,5,9],[2,0,2,9],[0,0,0,8],[10,0,10,2],[10,3,10,6],[11,0,11,9],[12,0,12,2],[12,3,12,6],[12,7,12,8],[7,0,7,6],[9,0,9,2],[9,3,9,6],[9,7,9,8],[3,0,3,6],[4,0,4,6]]}
[]
[]
[]
["UNIDADE ESCOLAR",null,null,null,null,null,null,"CÓDIGO INEP"]
[{"$f":"Orçamento!$O$4","v":"COORDENAÇÃO REGIONAL DE EDUCAÇÃO DE ITAPACI"},null,null,null,null,null,null,{"$f":"Orçamento!$X$4","v":0}]
[]
["OBRA",null,null,null,null,null,null,"CIDADE"]
[{"$f":"Orçamento!$O$7","v":"CONSTRUÇÃO"},null,null,null,null,null,null,{"$f":"Orçamento!$X$7","v":"ITAPACI"}]
[]
["CRE",null,null,"ENDEREÇO",null,null,null,"REFERÊNCIA AGETOP"]
[{"$f":"Orçamento!$O$10","v":"ITAPACI"},null,null,{"$f":"Orçamento!$R$10","v":"AVENIDA DONA LÚCIA LOURENÇONI, 156, CENTRO"},null,null,null,{"$f":"Orçamento!$S$10","v":"ABR/19"},{"$f":"Orçamento!$T$10","v":"DESONERADA"}]
[]
["DATA",null,null,"ÁREA TOTAL CONSTRUÍDA (M²)",null,null,null,"REFERÊNCIA SINAPI"]
[{"$f":"Orçamento!$S$7","v":"2020-07-07"},null,null,{"$f":"Orçamento!$X$13","v":100.68},null,null,null,{"$f":"Orçamento!$X$10","v":"ABR/20"},{"$f":"Orçamento!$Y$10","v":"DESONERADA"}]
[]
["COMPOSIÇÕES DE CUSTOS UNITÁRIOS - SEE-GO"]
[405,"FONTE","CÓDIGO","DESCRIÇÃO","UNIDADE","COEFIC.","CUSTO UNITÁRIO",null,"CUSTO  TOTAL (A) + (B) + (C) + (D) + (E)"]
[null,null,null,null,null,null,"DESONERADO","NÃO DESONER.","DESONERADO","NÃO DESONER."]
[null,"COMPOSIÇÃO","COMP 405_SEE","SERRALHEIRO","H",null,null,null,13.95,16.16]
[null,"AGETOP_I",21,"SERRALHEIRO","h     ",1,13.95,16.16,13.95,16.16]
[null,"MÃO DE OBRA (B) - TOTAL",null,null,null,null,null,null,13.95,16.16]
[null,"MATERIAL (C) - TOTAL",null,null,null,null,null,null,0,0]
[]
[415,"FONTE","CÓDIGO","DESCRIÇÃO","UNIDADE","COEFIC.","CUSTO UNITÁRIO",null,"CUSTO  TOTAL (A) + (B) + (C) + (D) + (E)"]
[null,null,null,null,null,null,"DESONERADO","NÃO DESONER.","DESONERADO","NÃO DESONER."]
[null,"COMPOSIÇÃO","COMP 415_SEE","PEITORIL EM GRANITO CINZA, LARGURA VARIÁVEL E PINGADEIRA","M2",null,null,null,204.79,207.57999999999998]
[null,"AGETOP_I",28,"AZULEJISTA","h     ",0.66910000000000003,13.95,16.16,9.33,10.81]
[null,"AGETOP_I",5,"SERVENTE","h     ",0.93879999999999997,8.75,10.14,8.2100000000000009,9.52]
[null,"MÃO DE OBRA (B) - TOTAL",null,null,null,null,null,null,17.54,20.329999999999998]
[null,"AGETOP_I",1421,"GRANITO POLIDO P/BANCADA 2 CM","m2",1,180,180,180,180]
[null,"AGETOP_I",1215,"CIMENTO PORTLAND C.P. 32","Kg",10.34,0.39,0.39,4.03,4.03]
[null,"AGETOP_I",2690,"ARGAMASSA DE REJUNTAMENTO","Kg",0.32,3.54,3.54,1.1299999999999999,1.1299999999999999]
[null,"AGETOP_I",104,"AREIA MEDIA ","m3",2.52E-2,82.85,82.85,2.09,2.09]
[null,"MATERIAL (C) - TOTAL",null,null,null,null,null,null,187.25,187.25]
[]
[24,"FONTE","CÓDIGO","DESCRIÇÃO","UNIDADE","COEFIC.","CUSTO UNITÁRIO",null,"CUSTO  TOTAL (A) + (B) + (C) + (D) + (E)"]
[null,null,null,null,null,null,"DESONERADO","NÃO DESONER.","DESONERADO","NÃO DESONER."]
[null,"COMPOSIÇÃO","COMP 024_SEE","SINALIZADOR FOTOLUMINESCENTE PARA EXTINTOR","UN ",null,"-","-",25.319999999999997,25.439999999999998]
[null,"AGETOP_I",5,"SERVENTE","h     ",0.09,8.75,10.14,0.79,0.91]
[null,"MÃO DE OBRA (B) - TOTAL",null,null,null,null,null,null,0.79,0.91]
[null,"AGETOP_I",3070,"BUCHA DE NYLON S-6","un",2,0.04,0.04,0.08,0.08]
[null,"AGETOP_I",3393,"PARAFUSO P/BUCHA S-6","un",2,0.08,0.08,0.16,0.16]
[null,"SINAPI_I",37556,"PLACA DE SINALIZACAO DE SEGURANCA CONTRA INCENDIO, FOTOLUMINESCENTE, QUADRADA, *20 X 20* CM, EM PVC *2* MM ANTI-CHAMAS (SIMBOLOS, CORES E PICTOGRAMAS CONFORME NBR 13434)","UN    ",1,24.29,24.29,24.29,24.29]
[null,"MATERIAL (C) - TOTAL",null,null,null,null,null,null,24.529999999999998,24.529999999999998]
[]
[25,"FONTE","CÓDIGO","DESCRIÇÃO","UNIDADE","COEFIC.","CUSTO UNITÁRIO",null,"CUSTO  TOTAL (A) + (B) + (C) + (D) + (E)"]
[null,null,null,null,null,null,"DESONERADO","NÃO DESONER.","DESONERADO","NÃO DESONER."]
[null,"COMPOSIÇÃO","COMP 025_SEE","SINALIZADOR FOTOLUMINESCENTE DE EMERGÊNCIA","UN ",null,"-","-",25.319999999999997,25.439999999999998]
[null,"AGETOP_I",5,"SERVENTE","h     ",0.09,8.75,10.14,0.79,0.91]
[null,"MÃO DE OBRA (B) - TOTAL",null,null,null,null,null,null,0.79,0.91]
[null,"AGETOP_I",3070,"BUCHA DE NYLON S-6","un",2,0.04,0.04,0.08,0.08]
[null,"AGETOP_I",3393,"PARAFUSO P/BUCHA S-6","un",2,0.08,0.08,0.16,0.16]
[null,"SINAPI_I",37556,"PLACA DE SINALIZACAO DE SEGURANCA CONTRA INCENDIO, FOTOLUMINESCENTE, QUADRADA, *20 X 20* CM, EM PVC *2* MM ANTI-CHAMAS (SIMBOLOS, CORES E PICTOGRAMAS CONFORME NBR 13434)","UN    ",1,24.29,24.29,24.29,24.29]
[null,"MATERIAL (C) - TOTAL",null,null,null,null,null,null,24.529999999999998,24.529999999999998]
[]
[277,"FONTE","CÓDIGO","DESCRIÇÃO","UNIDADE","COEFIC.","CUSTO UNITÁRIO",null,"CUSTO  TOTAL (A) + (B) + (C) + (D) + (E)"]
[null,null,null,null,null,null,"DESONERADO","NÃO DESONER.","DESONERADO","NÃO DESONER."]
[null,"COMPOSIÇÃO","COMP 277_SEE","MARCAÇÃO NO PISO - 1X1 M PARA EXTINTOR","M2",null,null,null,29.69,29.76]
[null,"AGETOP_I",5,"SERVENTE","h     ",3.3300000000000003E-2,8.75,10.14,0.28999999999999998,0.34]
[null,"MÃO DE OBRA (B) - TOTAL",null,null,null,null,null,null,0.28999999999999998,0.34]
[null,"SINAPI_I",5318,"SOLVENTE DILUENTE A BASE DE AGUARRAS","L     ",0.13,11.98,11.98,1.56,1.56]
[null,"SINAPI",5824,"CAMINHÃO TOCO, PBT 16.000 KG, CARGA ÚTIL MÁX. 10.685 KG, DIST. ENTRE EIXOS 4,8 M, POTÊNCIA 189 CV, INCLUSIVE CARROCERIA FIXA ABERTA DE MADEIRA P/ TRANSPORTE GERAL DE CARGA SECA, DIMEN. APROX. 2,5 X 7,00 X 0,50 M - CHP DIURNO. AF_06/2014","CHP",3.3E-3,115.5,118.69,0.38,0.39]
[null,"SINAPI_I",7343,"TINTA A BASE DE RESINA ACRILICA, PARA SINALIZACAO HORIZONTAL VIARIA (NBR 11862)","L     ",0.6,12.82,12.82,7.69,7.69]
[null,"SINAPI_I",7348,"TINTA ACRILICA PREMIUM PARA PISO","L     ",0.03,13.96,13.96,0.42,0.42]
[null,"SINAPI_I",25972,"MICROESFERAS DE VIDRO PARA SINALIZACAO HORIZONTAL VIARIA, TIPO I-B (PREMIX) - NBR 16184","KG    ",2.14,8.8800000000000008,8.8800000000000008,19,19]
[null,"SINAPI",95133,"MÁQUINA DEMARCADORA DE FAIXA DE TRÁFEGO À FRIO, AUTOPROPELIDA, POTÊNCIA 38 HP - CHP DIURNO. AF_07/2016","CHP",3.3E-3,105.93,109.48,0.35,0.36]
[null,"MATERIAL (C) - TOTAL",null,null,null,null,null,null,29.400000000000002,29.42]
[]
[201,"FONTE","CÓDIGO","DESCRIÇÃO","UNIDADE","COEFIC.","CUSTO UNITÁRIO",null,"CUSTO  TOTAL (A) + (B) + (C) + (D) + (E)"]
[null,null,null,null,null,null,"DESONERADO","NÃO DESONER.","DESONERADO","NÃO DESONER."]
[null,"COMPOSIÇÃO","COMP 201_SEE","ESTACA A TRADO DIAM.50 CM S/FERRO","M",null,null,null,59.17,64.55]
[null,"AGETOP_I",5,"SERVENTE","h     ",3.0297999999999998,8.75,10.14,26.51,30.72]
[null,"AGETOP_I",4,"PEDREIRO","h     ",0.39279999999999998,13.95,16.16,5.48,6.35]
[null,"AGETOP_I",32,"OPERADOR DE BETONEIRA ","h     ",0.18,10.51,12.18,1.89,2.19]
[null,"MÃO DE OBRA (B) - TOTAL",null,null,null,null,null,null,33.880000000000003,39.26]
[null,"AGETOP_I",1215,"CIMENTO PORTLAND C.P. 32","Kg",27.692399999999999,0.39,0.39,10.8,10.8]
[null,"AGETOP_I",2497,"BRITA No.02","m3",4.1000000000000002E-2,74.900000000000006,74.900000000000006,3.07,3.07]
[null,"AGETOP_I",2386,"BRITA No. 01","m3",4.1000000000000002E-2,85.36,85.36,3.5,3.5]
[null,"AGETOP_I",2804,"AREIA GROSSA","m3",8.7999999999999995E-2,90,90,7.92,7.92]
[null,"MATERIAL (C) - TOTAL",null,null,null,null,null,null,25.29,25.29]
[]
[382,"FONTE","CÓDIGO","DESCRIÇÃO","UNIDADE","COEFIC.","CUSTO UNITÁRIO",null,"CUSTO  TOTAL (A) + (B) + (C) + (D) + (E)"]
[null,null,null,null,null,null,"DESONERADO","NÃO DESONER.","DESONERADO","NÃO DESONER."]
[null,"COMPOSIÇÃO","COMP 382_SEE","TE DE REDUCAO DE FERRO GALVANIZADO, COM ROSCA BSP, DE 3/4\" X 1/2\"","UN ",null,null,null,24.25,26.43]
[null,"AGETOP_I",8,"AJUDANTE","h     ",0.6,8.75,10.14,5.25,6.08]
[null,"AGETOP_I",11,"ENCANADOR","h     ",0.61050000000000004,13.95,16.16,8.52,9.8699999999999992]
[null,"MÃO DE OBRA (B) - TOTAL",null,null,null,null,null,null,13.77,15.95]
[null,"SINAPI_I",3146,"FITA VEDA ROSCA EM ROLOS DE 18 MM X 10 M (L X C)","UN    ",0.12075471698113208,3.4,3.4,0.41,0.41]
[null,"SINAPI_I",6302,"TE DE REDUCAO DE FERRO GALVANIZADO, COM ROSCA BSP, DE 3/4\" X 1/2\"","UN    ",1,10.07,10.07,10.07,10.07]
[null,"MATERIAL (C) - TOTAL",null,null,null,null,null,null,10.48,10.48]
[]
[383,"FONTE","CÓDIGO","DESCRIÇÃO","UNIDADE","COEFIC.","CUSTO UNITÁRIO",null,"CUSTO  TOTAL (A) + (B) + (C) + (D) + (E)"]
[null,null,null,null,null,null,"DESONERADO","NÃO DESONER.","DESONERADO","NÃO DESONER."]
[null,"COMPOSIÇÃO","COMP 383_SEE","BUCHA DE REDUCAO DE FERRO GALVANIZADO, COM ROSCA BSP, DE 1/2\" X 1/4\"","UN ",null,null,null,7.68,8.26]
[null,"AGETOP_I",8,"AJUDANTE","h     ",0.16,8.75,10.14,1.4,1.62]
[null,"AGETOP_I",11,"ENCANADOR","h     ",0.16,13.95,16.16,2.23,2.59]
[null,"MÃO DE OBRA (B) - TOTAL",null,null,null,null,null,null,3.63,4.21]
[null,"AGETOP_I","H689","FITA VEDAROSCA 12 MM","m",1.2,0.28000000000000003,0.28000000000000003,0.34,0.34]
[null,"SINAPI_I",770,"BUCHA DE REDUCAO DE FERRO GALVANIZADO, COM ROSCA BSP, DE 1/2\" X 1/4\"","UN    ",1,3.71,3.71,3.71,3.71]
[null,"MATERIAL (C) - TOTAL",null,null,null,null,null,null,4.05,4.05]
[]
[212,"FONTE","CÓDIGO","DESCRIÇÃO","UNIDADE","COEFIC.","CUSTO UNITÁRIO",null,"CUSTO  TOTAL (A) + (B) + (C) + (D) + (E)"]
[null,null,null,null,null,null,"DESONERADO","NÃO DESONER.","DESONERADO","NÃO DESONER."]
[null,"COMPOSIÇÃO","COMP 212_SEE","NIPLE DE REDUÇÃO 1/2\" X 1/4\" BSP","UN ",null,null,null,9.68,10.26]
[null,"AGETOP_I",8,"AJUDANTE","h     ",0.16,8.75,10.14,1.4,1.62]
[null,"AGETOP_I",11,"ENCANADOR","h     ",0.16,13.95,16.16,2.23,2.59]
[null,"MÃO DE OBRA (B) - TOTAL",null,null,null,null,null,null,3.63,4.21]
[null,"COTAÇÃO","COT 103_SEE","NIPLE DE REDUÇÃO 1/2\" X 1/4\" BSP","UN",1,6.0533333333333337,6.0533333333333337,6.05,6.05]
[null,"MATERIAL (C) - TOTAL",null,null,null,null,null,null,6.05,6.05]
[]
[213,"FONTE","CÓDIGO","DESCRIÇÃO","UNIDADE","COEFIC.","CUSTO UNITÁRIO",null,"CUSTO  TOTAL (A) + (B) + (C) + (D) + (E)"]
[null,null,null,null,null,null,"DESONERADO","NÃO DESONER.","DESONERADO","NÃO DESONER."]
[null,"COMPOSIÇÃO","COMP 213_SEE","NIPLE DE REDUÇÃO 3/4\" X 1/2\" BSP","UN ",null,null,null,13.34,13.920000000000002]
[null,"AGETOP_I",8,"AJUDANTE","h     ",0.16,8.75,10.14,1.4,1.62]
[null,"AGETOP_I",11,"ENCANADOR","h     ",0.16,13.95,16.16,2.23,2.59]
[null,"MÃO DE OBRA (B) - TOTAL",null,null,null,null,null,null,3.63,4.21]
[null,"COTAÇÃO","COT 104_SEE","NIPLE DE REDUÇÃO 3/4\" X 1/2\" BSP","UN",1,9.7099999999999991,9.7099999999999991,9.7100000000000009,9.7100000000000009]
[null,"MATERIAL (C) - TOTAL",null,null,null,null,null,null,9.7100000000000009,9.7100000000000009]
[]
[237,"FONTE","CÓDIGO","DESCRIÇÃO","UNIDADE","COEFIC.","CUSTO UNITÁRIO",null,"CUSTO  TOTAL (A) + (B) + (C) + (D) + (E)"]
[null,null,null,null,null,null,"DESONERADO","NÃO DESONER.","DESONERADO","NÃO DESONER."]
[null,"COMPOSIÇÃO","COMP 237_SEE","FITA ANTICORROSIVA","M",null,null,null,11.16,11.879999999999999]
[null,"AGETOP_I",8,"AJUDANTE","h     ",0.2,8.75,10.14,1.75,2.0299999999999998]
[null,"AGETOP_I",12,"ELETRICISTA","h     ",0.2,13.95,16.16,2.79,3.23]
[null,"MÃO DE OBRA (B) - TOTAL",null,null,null,null,null,null,4.54,5.26]
[null,"SINAPI_I",39634,"FITA ADESIVA ANTICORROSIVA DE PVC FLEXIVEL, COR PRETA, PARA PROTECAO TUBULACAO, 50 MM X 30 M (L X C), E= *0,25* MM","M     ",1,6.62,6.62,6.62,6.62]
[null,"MATERIAL (C) - TOTAL",null,null,null,null,null,null,6.62,6.62]
[]
[542,"FONTE","CÓDIGO","DESCRIÇÃO","UNIDADE","COEFIC.","CUSTO UNITÁRIO",null,"CUSTO  TOTAL (A) + (B) + (C) + (D) + (E)"]
[null,null,null,null,null,null,"DESONERADO","NÃO DESONER.","DESONERADO","NÃO DESONER."]
[null,"COMPOSIÇÃO","COMP 542_SEE","VÁLVULA UGV 3/4\" (S) LATÃO","UN ",null,null,null,25.65,27.2]
[null,"AGETOP_I",8,"AJUDANTE","h     ",0.432,8.75,10.14,3.78,4.38]
[null,"AGETOP_I",11,"ENCANADOR","h     ",0.432,13.95,16.16,6.03,6.98]
[null,"MÃO DE OBRA (B) - TOTAL",null,null,null,null,null,null,9.81,11.36]
[null,"COTAÇÃO","COT 281_SEE","VÁLVULA UGV 3/4\" (S) LATÃO","UN ",1,15.836666666666666,15.836666666666666,15.84,15.84]
[null,"MATERIAL (C) - TOTAL",null,null,null,null,null,null,15.84,15.84]
[]
[543,"FONTE","CÓDIGO","DESCRIÇÃO","UNIDADE","COEFIC.","CUSTO UNITÁRIO",null,"CUSTO  TOTAL (A) + (B) + (C) + (D) + (E)"]
[null,null,null,null,null,null,"DESONERADO","NÃO DESONER.","DESONERADO","NÃO DESONER."]
[null,"COMPOSIÇÃO","COMP 543_SEE","VÁLVULA UGV 1/2\" (S) LATÃO","UN ",null,null,null,24.98,26.53]
[null,"AGETOP_I",8,"AJUDANTE","h     ",0.432,8.75,10.14,3.78,4.38]
[null,"AGETOP_I",11,"ENCANADOR","h     ",0.432,13.95,16.16,6.03,6.98]
[null,"MÃO DE OBRA (B) - TOTAL",null,null,null,null,null,null,9.81,11.36]
[null,"COTAÇÃO","COT 282_SEE","VÁLVULA UGV 1/2\" (S) LATÃO","UN ",1,15.166666666666666,15.166666666666666,15.17,15.17]
[null,"MATERIAL (C) - TOTAL",null,null,null,null,null,null,15.17,15.17]
[]
[211,"FONTE","CÓDIGO","DESCRIÇÃO","UNIDADE","COEFIC.","CUSTO UNITÁRIO",null,"CUSTO  TOTAL (A) + (B) + (C) + (D) + (E)"]
[null,null,null,null,null,null,"DESONERADO","NÃO DESONER.","DESONERADO","NÃO DESONER."]
[null,"COMPOSIÇÃO","COMP 211_SEE","REGULADOR DE 2º ESTÁGIO 5KG/H","UN ",null,null,null,86.72,90.86]
[null,"AGETOP_I",8,"AJUDANTE","h     ",1.1499999999999999,8.75,10.14,10.06,11.66]
[null,"AGETOP_I",11,"ENCANADOR","h     ",1.1499999999999999,13.95,16.16,16.04,18.579999999999998]
[null,"MÃO DE OBRA (B) - TOTAL",null,null,null,null,null,null,26.1,30.24]
[null,"COTAÇÃO","COT 102_SEE","REGULADOR DE 2º ESTÁGIO 5KG/H","UN",1,59.833333333333336,59.833333333333336,59.83,59.83]
[null,"AGETOP_I","H689","FITA VEDAROSCA 12 MM","m",2.82,0.28000000000000003,0.28000000000000003,0.79,0.79]
[null,"MATERIAL (C) - TOTAL",null,null,null,null,null,null,60.62,60.62]
[]
[210,"FONTE","CÓDIGO","DESCRIÇÃO","UNIDADE","COEFIC.","CUSTO UNITÁRIO",null,"CUSTO  TOTAL (A) + (B) + (C) + (D) + (E)"]
[null,null,null,null,null,null,"DESONERADO","NÃO DESONER.","DESONERADO","NÃO DESONER."]
[null,"COMPOSIÇÃO","COMP 210_SEE","REGULADOR DE 1º ESTÁGIO 60KG/H MODELO AP-40  COM MANÔMETRO","UN ",null,null,null,232.47,236.61]
[null,"AGETOP_I",8,"AJUDANTE","h     ",1.1499999999999999,8.75,10.14,10.06,11.66]
[null,"AGETOP_I",11,"ENCANADOR","h     ",1.1499999999999999,13.95,16.16,16.04,18.579999999999998]
[null,"MÃO DE OBRA (B) - TOTAL",null,null,null,null,null,null,26.1,30.24]
[null,"COTAÇÃO","COT 101_SEE","REGULADOR DE 1º ESTÁGIO 60KG/H MODELO AP-40  COM MANÔMETRO","UN",1,205.57666666666668,205.57666666666668,205.58,205.58]
[null,"AGETOP_I","H689","FITA VEDAROSCA 12 MM","m",2.82,0.28000000000000003,0.28000000000000003,0.79,0.79]
[null,"MATERIAL (C) - TOTAL",null,null,null,null,null,null,206.37,206.37]
[]
[235,"FONTE","CÓDIGO","DESCRIÇÃO","UNIDADE","COEFIC.","CUSTO UNITÁRIO",null,"CUSTO  TOTAL (A) + (B) + (C) + (D) + (E)"]
[null,null,null,null,null,null,"DESONERADO","NÃO DESONER.","DESONERADO","NÃO DESONER."]
[null,"COMPOSIÇÃO","COMP 235_SEE","PLACA DE SINALIZAÇÃO EM PVC COD 01 - (300X300) PROIBIDO FUMAR","UN ",null,null,null,25.319999999999997,25.439999999999998]
[null,"AGETOP_I",5,"SERVENTE","h     ",0.09,8.75,10.14,0.79,0.91]
[null,"MÃO DE OBRA (B) - TOTAL",null,null,null,null,null,null,0.79,0.91]
[null,"AGETOP_I",3070,"BUCHA DE NYLON S-6","un",2,0.04,0.04,0.08,0.08]
[null,"AGETOP_I",3393,"PARAFUSO P/BUCHA S-6","un",2,0.08,0.08,0.16,0.16]
[null,"SINAPI_I",37556,"PLACA DE SINALIZACAO DE SEGURANCA CONTRA INCENDIO, FOTOLUMINESCENTE, QUADRADA, *20 X 20* CM, EM PVC *2* MM ANTI-CHAMAS (SIMBOLOS, CORES E PICTOGRAMAS CONFORME NBR 13434)","UN    ",1,24.29,24.29,24.29,24.29]
[null,"MATERIAL (C) - TOTAL",null,null,null,null,null,null,24.529999999999998,24.529999999999998]
[]
[236,"FONTE","CÓDIGO","DESCRIÇÃO","UNIDADE","COEFIC.","CUSTO UNITÁRIO",null,"CUSTO  TOTAL (A) + (B) + (C) + (D) + (E)"]
[null,null,null,null,null,null,"DESONERADO","NÃO DESONER.","DESONERADO","NÃO DESONER."]
[null,"COMPOSIÇÃO","COMP 236_SEE","PLACA DE SINALIZAÇÃO EM PVC COD 06 - (300X300) PERIGO INFLAMÁVEL","UN ",null,null,null,25.319999999999997,25.439999999999998]
[null,"AGETOP_I",5,"SERVENTE","h     ",0.09,8.75,10.14,0.79,0.91]
[null,"MÃO DE OBRA (B) - TOTAL",null,null,null,null,null,null,0.79,0.91]
[null,"AGETOP_I",3070,"BUCHA DE NYLON S-6","un",2,0.04,0.04,0.08,0.08]
[null,"AGETOP_I",3393,"PARAFUSO P/BUCHA S-6","un",2,0.08,0.08,0.16,0.16]
[null,"SINAPI_I",37556,"PLACA DE SINALIZACAO DE SEGURANCA CONTRA INCENDIO, FOTOLUMINESCENTE, QUADRADA, *20 X 20* CM, EM PVC *2* MM ANTI-CHAMAS (SIMBOLOS, CORES E PICTOGRAMAS CONFORME NBR 13434)","UN    ",1,24.29,24.29,24.29,24.29]
[null,"MATERIAL (C) - TOTAL",null,null,null,null,null,null,24.529999999999998,24.529999999999998]
[]
[82,"FONTE","CÓDIGO","DESCRIÇÃO","UNIDADE","COEFIC.","CUSTO UNITÁRIO",null,"CUSTO  TOTAL (A) + (B) + (C) + (D) + (E)"]
[null,null,null,null,null,null,"DESONERADO","NÃO DESONER.","DESONERADO","NÃO DESONER."]
[null,"COMPOSIÇÃO","COMP 082_SEE","CORRIMÃO PAREDE - SEDUC","M",null,null,null,121.38,125.41]
[null,"AGETOP_I",25,"OFICIAL \"B\"","h     ",1,13.95,16.16,13.95,16.16]
[null,"AGETOP_I",8,"AJUDANTE","h     ",1,8.75,10.14,8.75,10.14]
[null,"MÃO DE OBRA (B) - TOTAL",null,null,null,null,null,null,22.7,26.3]
[null,"AGETOP_I",2376,"TUBO INDUSTRIAL 2\" CHAPA 13 ","Kg",5.5247999999999999,5.23,5.23,28.89,28.89]
[null,"AGETOP_I",2504,"TUBO INDUSTRIAL D=25 MM CHAPA 13 ","Kg",1.1000000000000001,5.07,5.07,5.58,5.58]
[null,"AGETOP_I",2417,"MASSA PLASTICA","Kg",0.2041,10.58,10.58,2.16,2.16]
[null,"AGETOP_I",2246,"ELETRODO 2.5 OK","Kg",0.11459999999999999,8.6999999999999993,8.6999999999999993,1,1]
[null,"AGETOP_I",1672,"LIXA PARA FERRO ( NÚMERO 100 )","un",0.125,2.12,2.12,0.27,0.27]
[null,"AGETOP_I",1264,"DISCO DE DESBASTE 7/8\" P/ CONC./FERRO (1/4\" X 7\")","un",2.5000000000000001E-2,7,7,0.18,0.18]
[null,"AGETOP_I",1334,"DISCO DE CORTE DIAM. 5/8\"- 10\"","un",0.1865,5.5,5.5,1.03,1.03]
[null,"AGETOP_I",2902,"FABRICAÇÃO / MONTAGEM","un",1,50.44,50.44,50.44,50.44]
[null,"AGETOP_I",2719,"CHAPA PERFILADA 3/16\"","Kg",0.72,5.04,5.04,3.63,3.63]
[null,"AGETOP_I",2436,"ACO CA-25 - 6,3 MM (1/4\") - BARRA LISA A-36","Kg",0.25,5.13,5.13,1.28,1.28]
[null,"AGETOP",261602,"PINT.ESMALTE/ESQUAD.FERRO C/FUNDO ANTICOR.","m2    ",0.3,14.07,15.51,4.22,4.6500000000000004]
[null,"MATERIAL (C) - TOTAL",null,null,null,null,null,null,98.679999999999993,99.11]
[]
[83,"FONTE","CÓDIGO","DESCRIÇÃO","UNIDADE","COEFIC.","CUSTO UNITÁRIO",null,"CUSTO  TOTAL (A) + (B) + (C) + (D) + (E)"]
[null,null,null,null,null,null,"DESONERADO","NÃO DESONER.","DESONERADO","NÃO DESONER."]
[null,"COMPOSIÇÃO","COMP 083_SEE","CORRIMÃO PISO - SEDUC","M",null,null,null,143.18,147.41000000000003]
[null,"AGETOP_I",25,"OFICIAL \"B\"","h     ",1,13.95,16.16,13.95,16.16]
[null,"AGETOP_I",8,"AJUDANTE","h     ",1,8.75,10.14,8.75,10.14]
[null,"MÃO DE OBRA (B) - TOTAL",null,null,null,null,null,null,22.7,26.3]
[null,"AGETOP_I",2376,"TUBO INDUSTRIAL 2\" CHAPA 13 ","Kg",8.2197499999999994,5.23,5.23,42.99,42.99]
[null,"AGETOP_I",2504,"TUBO INDUSTRIAL D=25 MM CHAPA 13 ","Kg",1.1000000000000001,5.07,5.07,5.58,5.58]
[null,"AGETOP_I",2417,"MASSA PLASTICA","Kg",0.2041,10.58,10.58,2.16,2.16]
[null,"AGETOP_I",2246,"ELETRODO 2.5 OK","Kg",0.11459999999999999,8.6999999999999993,8.6999999999999993,1,1]
[null,"AGETOP_I",1672,"LIXA PARA FERRO ( NÚMERO 100 )","un",0.125,2.12,2.12,0.27,0.27]
[null,"AGETOP_I",1264,"DISCO DE DESBASTE 7/8\" P/ CONC./FERRO (1/4\" X 7\")","un",2.5000000000000001E-2,7,7,0.18,0.18]
[null,"AGETOP_I",1334,"DISCO DE CORTE DIAM. 5/8\"- 10\"","un",0.1865,5.5,5.5,1.03,1.03]
[null,"AGETOP_I",2902,"FABRICAÇÃO / MONTAGEM","un",1,50.44,50.44,50.44,50.44]
[null,"AGETOP_I",2150,"CHAPA DE FERRO DOBRADA No.13","Kg",0.43519999999999998,5.28,5.28,2.2999999999999998,2.2999999999999998]
[null,"AGETOP_I",2719,"CHAPA PERFILADA 3/16\"","Kg",1.1644000000000001,5.04,5.04,5.87,5.87]
[null,"AGETOP_I",2436,"ACO CA-25 - 6,3 MM (1/4\") - BARRA LISA A-36","Kg",0.48150000000000004,5.13,5.13,2.4700000000000002,2.4700000000000002]
[null,"AGETOP",261602,"PINT.ESMALTE/ESQUAD.FERRO C/FUNDO ANTICOR.","m2    ",0.44,14.07,15.51,6.19,6.82]
[null,"MATERIAL (C) - TOTAL",null,null,null,null,null,null,120.48,121.11000000000001]
[]
[84,"FONTE","CÓDIGO","DESCRIÇÃO","UNIDADE","COEFIC.","CUSTO UNITÁRIO",null,"CUSTO  TOTAL (A) + (B) + (C) + (D) + (E)"]
[null,null,null,null,null,null,"DESONERADO","NÃO DESONER.","DESONERADO","NÃO DESONER."]
[null,"COMPOSIÇÃO","COMP 084_SEE","GUARDA-CORPO COM CORRIMÃO - SEDUC","M",null,null,null,206.14000000000001,211.22000000000003]
[null,"AGETOP_I",25,"OFICIAL \"B\"","h     ",1.1000000000000001,13.95,16.16,15.35,17.78]
[null,"AGETOP_I",8,"AJUDANTE","h     ",1.1000000000000001,8.75,10.14,9.6300000000000008,11.15]
[null,"MÃO DE OBRA (B) - TOTAL",null,null,null,null,null,null,24.98,28.93]
[null,"AGETOP_I",2376,"TUBO INDUSTRIAL 2\" CHAPA 13 ","Kg",7.7778,5.23,5.23,40.68,40.68]
[null,"AGETOP_I",2504,"TUBO INDUSTRIAL D=25 MM CHAPA 13 ","Kg",4.6319999999999997,5.07,5.07,23.48,23.48]
[null,"AGETOP_I",2377,"TUBO INDUSTRIAL 40X40 CH.13","Kg",6.3419999999999996,5.07,5.07,32.15,32.15]
[null,"AGETOP_I",2421,"TUBO INDUSTRIAL 1.1/2\" CHAPA 13 ","Kg",1.4862,5.07,5.07,7.54,7.54]
[null,"AGETOP_I",2417,"MASSA PLASTICA","Kg",0.2041,10.58,10.58,2.16,2.16]
[null,"AGETOP_I",2246,"ELETRODO 2.5 OK","Kg",0.11459999999999999,8.6999999999999993,8.6999999999999993,1,1]
[null,"AGETOP_I",1672,"LIXA PARA FERRO ( NÚMERO 100 )","un",0.25509999999999999,2.12,2.12,0.54,0.54]
[null,"AGETOP_I",1264,"DISCO DE DESBASTE 7/8\" P/ CONC./FERRO (1/4\" X 7\")","un",5.0999999999999997E-2,7,7,0.36,0.36]
[null,"AGETOP_I",1334,"DISCO DE CORTE DIAM. 5/8\"- 10\"","un",0.373,5.5,5.5,2.0499999999999998,2.0499999999999998]
[null,"AGETOP_I",2902,"FABRICAÇÃO / MONTAGEM","un",1,50.44,50.44,50.44,50.44]
[null,"AGETOP_I",2150,"CHAPA DE FERRO DOBRADA No.13","Kg",0.43519999999999998,5.28,5.28,2.2999999999999998,2.2999999999999998]
[null,"AGETOP_I",2719,"CHAPA PERFILADA 3/16\"","Kg",1.0979999999999999,5.04,5.04,5.53,5.53]
[null,"AGETOP_I",2436,"ACO CA-25 - 6,3 MM (1/4\") - BARRA LISA A-36","Kg",0.38124999999999998,5.13,5.13,1.96,1.96]
[null,"AGETOP",261602,"PINT.ESMALTE/ESQUAD.FERRO C/FUNDO ANTICOR.","m2    ",0.78,14.07,15.51,10.97,12.1]
[null,"MATERIAL (C) - TOTAL",null,null,null,null,null,null,181.16000000000003,182.29000000000002]
[]
[85,"FONTE","CÓDIGO","DESCRIÇÃO","UNIDADE","COEFIC.","CUSTO UNITÁRIO",null,"CUSTO  TOTAL (A) + (B) + (C) + (D) + (E)"]
[null,null,null,null,null,null,"DESONERADO","NÃO DESONER.","DESONERADO","NÃO DESONER."]
[null,"COMPOSIÇÃO","COMP 085_SEE","GUARDA-CORPO - SEDUC","M",null,null,null,190.52999999999997,195.41]
[null,"AGETOP_I",25,"OFICIAL \"B\"","h     ",1.1000000000000001,13.95,16.16,15.35,17.78]
[null,"AGETOP_I",8,"AJUDANTE","h     ",1.1000000000000001,8.75,10.14,9.6300000000000008,11.15]
[null,"MÃO DE OBRA (B) - TOTAL",null,null,null,null,null,null,24.98,28.93]
[null,"AGETOP_I",2376,"TUBO INDUSTRIAL 2\" CHAPA 13 ","Kg",7.7778,5.23,5.23,40.68,40.68]
[null,"AGETOP_I",2504,"TUBO INDUSTRIAL D=25 MM CHAPA 13 ","Kg",4.6319999999999997,5.07,5.07,23.48,23.48]
[null,"AGETOP_I",2377,"TUBO INDUSTRIAL 40X40 CH.13","Kg",6.3419999999999996,5.07,5.07,32.15,32.15]
[null,"AGETOP_I",2417,"MASSA PLASTICA","Kg",0.2041,10.58,10.58,2.16,2.16]
[null,"AGETOP_I",2246,"ELETRODO 2.5 OK","Kg",0.11459999999999999,8.6999999999999993,8.6999999999999993,1,1]
[null,"AGETOP_I",1672,"LIXA PARA FERRO ( NÚMERO 100 )","un",0.25509999999999999,2.12,2.12,0.54,0.54]
[null,"AGETOP_I",1264,"DISCO DE DESBASTE 7/8\" P/ CONC./FERRO (1/4\" X 7\")","un",5.0999999999999997E-2,7,7,0.36,0.36]
[null,"AGETOP_I",1334,"DISCO DE CORTE DIAM. 5/8\"- 10\"","un",0.2334,5.5,5.5,1.28,1.28]
[null,"AGETOP_I",2902,"FABRICAÇÃO / MONTAGEM","un",1,50.44,50.44,50.44,50.44]
[null,"AGETOP_I",2150,"CHAPA DE FERRO DOBRADA No.13","Kg",0.33909,5.28,5.28,1.79,1.79]
[null,"AGETOP_I",2719,"CHAPA PERFILADA 3/16\"","Kg",0.3463,5.04,5.04,1.75,1.75]
[null,"AGETOP_I",2436,"ACO CA-25 - 6,3 MM (1/4\") - BARRA LISA A-36","Kg",0.18029999999999999,5.13,5.13,0.92,0.92]
[null,"AGETOP",261602,"PINT.ESMALTE/ESQUAD.FERRO C/FUNDO ANTICOR.","m2    ",0.64,14.07,15.51,9,9.93]
[null,"MATERIAL (C) - TOTAL",null,null,null,null,null,null,165.54999999999998,166.48]