{"text_format":"1","workbook":"xlsx","n_sheets":8,"sheets":["Orçamento","Resumo ","Somatório","Cronog_60_Dias","Composição BDI","Relatório CENTRAL","Parc Maior Relev","Composições"],"not_rendered":{"charts":0,"images":4,"macros":1,"external_links":0,"defined_names":104,"comments":2,"pivot_tables":0},"unopened":[],"bounds":{"document_bytes":16777216,"sheet_cells":100000,"rows_first":2000,"rows_last":500,"rows_between":2000,"halvings":0,"cell_chars":16384,"cell_head_chars":4096},"cells_cut":0,"cells_raw":0,"read":"whole","date_system":"1900"}

{"sheet":"Orçamento","index":0,"n_rows":366,"n_cols":27,"rows_kept":366,"cut":false,"hidden":false,"merged":[[331,15,331,17],[336,23,336,25],[337,23,337,25],[358,18,358,22],[294,22,294,24],[295,22,295,24],[6,12,6,13],[5,12,5,13],[12,23,12,25],[11,23,11,25],[9,19,9,22],[333,23,333,25],[308,23,308,25],[309,23,309,25],[310,23,310,25],[311,23,311,25],[312,23,312,25],[313,23,313,25],[314,23,314,25],[315,23,315,25],[316,23,316,25],[317,23,317,25],[318,23,318,25],[319,23,319,25],[356,23,356,25],[357,23,357,25],[358,23,358,25],[341,23,341,25],[342,23,342,25],[343,23,343,25],[344,23,344,25],[345,23,345,25],[346,23,346,25],[347,23,347,25],[348,23,348,25],[349,23,349,25],[350,23,350,25],[351,23,351,25],[352,23,352,25],[353,23,353,25],[354,23,354,25],[355,23,355,25],[336,18,336,22],[0,14,0,24],[8,14,8,16],[9,14,9,16],[11,14,11,16],[12,14,12,16],[14,14,14,24],[1,14,1,24],[4,14,4,24],[7,14,7,24],[320,18,320,22],[317,15,317,17],[318,15,318,17],[319,15,319,17],[329,18,329,22],[327,18,327,22],[335,18,335,22],[322,18,322,22],[315,18,315,22],[329,15,329,17],[330,15,330,17],[332,15,332,17],[333,15,333,17],[335,23,335,25],[337,18,337,22],[313,18,313,22],[314,18,314,22],[312,18,312,22],[321,18,321,22],[303,18,303,24],[309,18,309,22],[310,18,310,22],[311,18,311,22],[334,18,334,22],[332,18,332,22],[333,18,333,22],[323,18,323,22],[330,18,330,22],[326,18,326,22],[328,18,328,22],[324,18,324,22],[325,18,325,22],[334,23,334,25],[328,23,328,25],[329,23,329,25],[330,23,330,25],[331,23,331,25],[332,23,332,25],[314,15,314,17],[315,15,315,17],[316,15,316,17],[325,23,325,25],[326,23,326,25],[324,15,324,17],[325,15,325,17],[326,15,326,17],[327,23,327,25],[322,15,322,17],[323,15,323,17],[321,23,321,25],[322,23,322,25],[320,23,320,25],[301,16,301,24],[307,23,307,25],[323,23,323,25],[324,23,324,25],[343,15,343,17],[343,18,343,22],[302,16,302,24],[320,15,320,17],[321,15,321,17],[306,14,306,26],[307,18,307,22],[308,18,308,22],[316,18,316,22],[317,18,317,22],[318,18,318,22],[319,18,319,22],[331,18,331,22],[328,15,328,17],[308,15,308,17],[309,15,309,17],[310,15,310,17],[311,15,311,17],[312,15,312,17],[313,15,313,17],[298,16,298,24],[299,16,299,24],[300,16,300,24],[10,14,10,26],[13,14,13,26],[2,14,2,22],[3,14,3,22],[5,18,5,22],[6,18,6,22],[11,18,11,22],[12,18,12,22],[6,14,6,17],[5,14,5,17],[3,23,3,25],[2,23,2,25],[5,23,5,25],[6,23,6,25],[8,18,8,20],[290,17,295,17],[296,22,296,24],[290,22,290,24],[291,22,291,24],[292,22,292,24],[365,18,365,22],[362,14,362,17],[359,15,359,17],[359,18,359,22],[360,15,360,17],[360,18,360,22],[361,15,361,17],[361,18,361,22],[364,18,364,22],[363,18,363,22],[359,23,359,25],[360,23,360,25],[361,23,361,25],[362,23,362,25],[363,23,363,25],[364,23,364,25],[365,23,365,25],[334,14,334,17],[341,15,341,17],[307,15,307,17],[362,18,362,22],[350,15,350,17],[350,18,350,22],[351,15,351,17],[351,18,351,22],[352,15,352,17],[352,18,352,22],[356,15,356,17],[356,18,356,22],[357,15,357,17],[357,18,357,22],[358,15,358,17],[347,15,347,17],[353,15,353,17],[353,18,353,22],[354,15,354,17],[354,18,354,22],[355,15,355,17],[355,18,355,22],[9,24,9,25],[8,23,8,25],[347,18,347,22],[348,15,348,17],[348,18,348,22],[349,15,349,17],[349,18,349,22],[344,15,344,17],[344,18,344,22],[345,15,345,17],[345,18,345,22],[346,15,346,17],[346,18,346,22],[340,14,340,26],[341,18,341,22],[342,15,342,17],[342,18,342,22],[327,15,327,17]]}
[]
[]
[null,null,null,null,null,null,null,null,null,null,null,null,null,null,"UNIDADE ESCOLAR",null,null,null,null,null,null,null,null,"CÓDIGO INEP"]
[null,null,null,null,null,null,null,null,null,null,null,null,{"$f":"IF($M$7=\"MANUAL\",\"DESPROTEJA A PLANILHA PARA FORMATAR\",\"\")","v":""},null,"COORDENAÇÃO REGIONAL DE EDUAÇÃO DE RIO VERDE"]
[]
["Nmax",null,null,null,null,null,null,null,null,null,null,null,null,null,"OBRA",null,null,null,"DATA",null,null,null,null,"CIDADE"]
[{"$f":"MAX($C$18:$C$290)","v":4},null,null,null,null,null,null,null,null,null,null,null,null,null,"IMPLANTAÇÃO",null,null,null,"2020-07-23",null,null,null,null,"RIO VERDE"]
[]
[null,null,null,null,null,null,null,null,null,null,null,null,null,null,"CRE",null,null,"ENDEREÇO","REFERÊNCIA AGETOP",null,null,null,null,"REFERÊNCIA SINAPI"]
[null,null,null,null,null,null,null,null,null,null,null,null,null,null,"RIO VERDE",null,null,"RUA 15-A, BAIRRO POPULAR","ABR/19","DESONERADA",null,null,null,"ABR/20","DESONERADA"]
[]
[null,null,null,null,null,null,null,null,null,null,null,null,null,null,"ÁREA EXISTENTE (M²)",null,null,"ÁREA A CONSTRUIR (M²)","ÁREA A DEMOLIR (M²)",null,null,null,null,"ÁREA TOTAL CONSTRUÍDA (M²)"]
[null,null,null,null,null,null,null,null,null,null,null,null,null,null,null,null,null,100.68,null,null,null,null,null,100.68]
[]
[null,null,null,null,null,null,null,null,null,null,null,"FILTRO",null,null,"PLANILHA ORÇAMENTÁRIA"]
["Nível E","Save Nivel","Nível C","Altura","n1","n2","n3","n4","n5","Czero","Cnível","↓","Nível","Nível Corrigido","ITEM","TABELA","CODIGO","DESCRIÇÃO DOS SERVIÇOS","UNID","QUANT","REPET","QUANT TOTAL","MAT","MO","T.SERVIÇO UNIT","VALOR TOTAL","OBSERVAÇÕES¹"]
[{"$f":"CHOOSE(1+LOG(1+2*(ORÇAMENTO.Nivel=\"Nível 1\")+4*(ORÇAMENTO.Nivel=\"Nível 2\")+8*(ORÇAMENTO.Nivel=\"Nível 3\")+16*(ORÇAMENTO.Nivel=\"Nível 4\")+32*(ORÇAMENTO.Nivel=\"Serviço\"),2),0,1,2,3,4,\"S\")","v":"S"},{"$f":"IF(OR(C17=\"s\",C17=0),OFFSET(B17,-1,0),C17)","v":"Save Nivel"},{"$f":"IF(OFFSET(C17,-1,0)=\"L\",1,IF(OFFSET(C17,-1,0)=1,2,IF(OR(A17=\"s\",A17=0),\"S\",IF(AND(OFFSET(C17,-1,0)=2,A17=4),3,IF(AND(OR(OFFSET(C17,-1,0)=\"s\",OFFSET(C17,-1,0)=0),A17<>\"s\",A17>OFFSET(B17,-1,0)),OFFSET(B17,-1,0),A17)))))","v":"S"},{"$f":"IF(OR(C17=\"S\",C17=0),0,IF(ISERROR(K17),J17,SMALL(J17:K17,1)))","v":0},{"$f":"IF($C17=1,OFFSET(E17,-1,0)+1,OFFSET(E17,-1,0))","v":"n1"},{"$f":"IF($C17=1,0,IF($C17=2,OFFSET(F17,-1,0)+1,OFFSET(F17,-1,0)))","v":"n2"},{"$f":"IF(AND($C17<=2,$C17<>0),0,IF($C17=3,OFFSET(G17,-1,0)+1,OFFSET(G17,-1,0)))","v":"n3"},{"$f":"IF(AND($C17<=3,$C17<>0),0,IF($C17=4,OFFSET(H17,-1,0)+1,OFFSET(H17,-1,0)))","v":"n4"},{"$f":"IF(AND($C17<=4,$C17<>0),0,IF(AND($C17=\"S\",$Y17>0),OFFSET(I17,-1,0)+1,OFFSET(I17,-1,0)))","v":"n5"},{"$f":"IF(OR($C17=\"S\",$C17=0),0,MATCH(0,OFFSET($D17,1,$C17,ROW($C$290)-ROW($C17)),0))","v":0},{"$f":"IF(OR($C17=\"S\",$C17=0),0,MATCH(OFFSET($D17,0,$C17)+1,OFFSET($D17,1,$C17,ROW($C$290)-ROW($C17)),0))","v":0},{"$f":"IF(OR(Y17>0,$C17=1),\"F\",\"\")","v":""},"Serviço",{"$f":"CHOOSE(1+LOG(1+2*(C17=1)+4*(C17=2)+8*(C17=3)+16*(C17=4)+32*(C17=\"S\"),2),\"\",\"Nível 1\",\"Nível 2\",\"Nível 3\",\"Nível 4\",\"Serviço\")","v":"Serviço"},"-","SINAPI",null,"(sem código)","-",null,"REPET","-",0,0,0,"-",""]
[0,null,"L",{"$f":"COUNTA(OFFSET(D18,1,0):D$290)","v":271},{"$f":"LEFT(O19,1)-1","v":0},null,null,null,null,null,null,"F","LOTE","LOTE","IMPLANTAÇÃO - COORDENAÇÃO REGIONAL DE EDUAÇÃO DE RIO VERDE",null,null,null,null,null,null,null,null,null,null,0]
[{"$f":"CHOOSE(1+LOG(1+2*(ORÇAMENTO.Nivel=\"Nível 1\")+4*(ORÇAMENTO.Nivel=\"Nível 2\")+8*(ORÇAMENTO.Nivel=\"Nível 3\")+16*(ORÇAMENTO.Nivel=\"Nível 4\")+32*(ORÇAMENTO.Nivel=\"Serviço\"),2),0,1,2,3,4,\"S\")","v":1},{"$f":"IF(OR(C19=\"s\",C19=0),OFFSET(B19,-1,0),C19)","v":1},{"$f":"IF(OFFSET(C19,-1,0)=\"L\",1,IF(OFFSET(C19,-1,0)=1,2,IF(OR(A19=\"s\",A19=0),\"S\",IF(AND(OFFSET(C19,-1,0)=2,A19=4),3,IF(AND(OR(OFFSET(C19,-1,0)=\"s\",OFFSET(C19,-1,0)=0),A19<>\"s\",A19>OFFSET(B19,-1,0)),OFFSET(B19,-1,0),A19)))))","v":1},{"$f":"IF(OR(C19=\"S\",C19=0),0,IF(ISERROR(K19),J19,SMALL(J19:K19,1)))","v":50},{"$f":"IF($C19=1,OFFSET(E19,-1,0)+1,OFFSET(E19,-1,0))","v":1},{"$f":"IF($C19=1,0,IF($C19=2,OFFSET(F19,-1,0)+1,OFFSET(F19,-1,0)))","v":0},{"$f":"IF(AND($C19<=2,$C19<>0),0,IF($C19=3,OFFSET(G19,-1,0)+1,OFFSET(G19,-1,0)))","v":0},{"$f":"IF(AND($C19<=3,$C19<>0),0,IF($C19=4,OFFSET(H19,-1,0)+1,OFFSET(H19,-1,0)))","v":0},{"$f":"IF(AND($C19<=4,$C19<>0),0,IF(AND($C19=\"S\",$Y19>0),OFFSET(I19,-1,0)+1,OFFSET(I19,-1,0)))","v":0},{"$f":"IF(OR($C19=\"S\",$C19=0),0,MATCH(0,OFFSET($D19,1,$C19,ROW($C$290)-ROW($C19)),0))","v":271},{"$f":"IF(OR($C19=\"S\",$C19=0),0,MATCH(OFFSET($D19,0,$C19)+1,OFFSET($D19,1,$C19,ROW($C$290)-ROW($C19)),0))","v":50},{"$f":"IF(OR(Y19>0,$C19=1),\"F\",\"\")","v":"F"},"Nível 1",{"$f":"CHOOSE(1+LOG(1+2*(C19=1)+4*(C19=2)+8*(C19=3)+16*(C19=4)+32*(C19=\"S\"),2),\"\",\"Nível 1\",\"Nível 2\",\"Nível 3\",\"Nível 4\",\"Serviço\")","v":"Nível 1"},"1.","AGETOP",null,"NOVO BLOCO ADMINISTRATIVO","UN",1,1,1,null,null,0,0]
[2,2,2,2,1,1,0,0,0,49,2,"","Nível 2","Nível 2","-","AGETOP",null,"ALVENARIAS E DIVISÓRIAS","-",null,1,"-",null,null,0,0]
["S",2,"S",0,1,1,0,0,0,0,0,"","Serviço","Serviço","-","AGETOP",100201,"ALVENARIA DE TIJOLO FURADO 1/2 VEZ - 9 x 19 x 19 - ARG. (1CALH:4ARML+100KG DE CI/M3)","m2    ",160.25,1,160.25,null,null,0,0,""]
[2,2,2,4,1,2,0,0,0,47,4,"","Nível 2","Nível 2","-","SINAPI",null,"REVESTIMENTO DE PAREDE","-",null,1,"-",null,null,0,0,""]
["S",2,"S",0,1,2,0,0,0,0,0,"","Serviço","Serviço","-","AGETOP",200101,"CHAPISCO COMUM","m2    ",320.5,1,320.5,null,null,0,0,""]
[{"$f":"CHOOSE(1+LOG(1+2*(ORÇAMENTO.Nivel=\"Nível 1\")+4*(ORÇAMENTO.Nivel=\"Nível 2\")+8*(ORÇAMENTO.Nivel=\"Nível 3\")+16*(ORÇAMENTO.Nivel=\"Nível 4\")+32*(ORÇAMENTO.Nivel=\"Serviço\"),2),0,1,2,3,4,\"S\")","v":"S"},{"$f":"IF(OR(C24=\"s\",C24=0),OFFSET(B24,-1,0),C24)","v":2},{"$f":"IF(OFFSET(C24,-1,0)=\"L\",1,IF(OFFSET(C24,-1,0)=1,2,IF(OR(A24=\"s\",A24=0),\"S\",IF(AND(OFFSET(C24,-1,0)=2,A24=4),3,IF(AND(OR(OFFSET(C24,-1,0)=\"s\",OFFSET(C24,-1,0)=0),A24<>\"s\",A24>OFFSET(B24,-1,0)),OFFSET(B24,-1,0),A24)))))","v":"S"},{"$f":"IF(OR(C24=\"S\",C24=0),0,IF(ISERROR(K24),J24,SMALL(J24:K24,1)))","v":0},{"$f":"IF($C24=1,OFFSET(E24,-1,0)+1,OFFSET(E24,-1,0))","v":1},{"$f":"IF($C24=1,0,IF($C24=2,OFFSET(F24,-1,0)+1,OFFSET(F24,-1,0)))","v":2},{"$f":"IF(AND($C24<=2,$C24<>0),0,IF($C24=3,OFFSET(G24,-1,0)+1,OFFSET(G24,-1,0)))","v":0},{"$f":"IF(AND($C24<=3,$C24<>0),0,IF($C24=4,OFFSET(H24,-1,0)+1,OFFSET(H24,-1,0)))","v":0},{"$f":"IF(AND($C24<=4,$C24<>0),0,IF(AND($C24=\"S\",$Y24>0),OFFSET(I24,-1,0)+1,OFFSET(I24,-1,0)))","v":0},0,0,{"$f":"IF(OR(Y24>0,$C24=1),\"F\",\"\")","v":""},"Serviço",{"$f":"CHOOSE(1+LOG(1+2*(C24=1)+4*(C24=2)+8*(C24=3)+16*(C24=4)+32*(C24=\"S\"),2),\"\",\"Nível 1\",\"Nível 2\",\"Nível 3\",\"Nível 4\",\"Serviço\")","v":"Serviço"},"-","AGETOP",200499,"REBOCO PAULISTA A-14 (1CALH:4ARMLC+100kgCI/M3)","m2    ",265.98,1,265.98,null,null,0,0,""]
["S",2,"S",0,1,2,0,0,0,0,0,"","Serviço","Serviço","-","SINAPI",87553,"EMBOÇO, PARA RECEBIMENTO DE CERÂMICA, EM ARGAMASSA TRAÇO 1:2:8, PREPARO MECÂNICO COM BETONEIRA 400L, APLICADO MANUALMENTE EM FACES INTERNAS DE PAREDES, PARA AMBIENTE COM ÁREA MAIOR QUE 10M2, ESPESSURA DE 10MM, COM EXECUÇÃO DE TALISCAS. AF_06/2014","M2",54.52,1,54.52,null,null,0,0,""]
[2,2,2,5,1,3,0,0,0,43,5,"","Nível 2","Nível 2","-","SINAPI",null,"ESQUADRIAS METÁLICAS","-",null,1,"-",null,null,0,0,""]
["S",2,"S",0,1,3,0,0,0,0,0,"","Serviço","Serviço","-","AGETOP",180501,"PORTA DE ABRIR EM CHAPA PF-1 C/FERRAGENS","m2    ",13.86,1,13.86,null,null,0,0,""]
["S",2,"S",0,1,3,0,0,0,0,0,"","Serviço","Serviço","-","AGETOP",180380,"ESQ. MAXIMO AR CHAPA/VIDRO J4 C/FERRAGENS","m2    ",0.5,1,0.5,null,null,0,0,""]
["S",2,"S",0,1,3,0,0,0,0,0,"","Serviço","Serviço","-","AGETOP",180401,"ESQ.DE CORRER CHAPA/VIDRO J9/J10/J12/J13 C/FERRAGENS","m2    ",10.08,1,10.08,null,null,0,0,""]
["S",2,"S",0,1,3,0,0,0,0,0,"","Serviço","Serviço","-","AGETOP",180208,"GRADE PROTECAO TIPO TIJOLINHO GP-1/GP-2","m2    ",31.5,1,31.5,null,null,0,0,""]
[2,2,2,2,1,4,0,0,0,38,2,"","Nível 2","Nível 2","-","SINAPI",null,"VIDROS","-",null,1,"-",null,null,0,0,""]
["S",2,"S",0,1,4,0,0,0,0,0,"","Serviço","Serviço","-","SINAPI",72117,"VIDRO LISO COMUM TRANSPARENTE, ESPESSURA 4MM","M2",10.58,1,10.58,null,null,0,0,"Referência: AGETOP - 190102"]
[2,2,2,4,1,5,0,0,0,36,4,"","Nível 2","Nível 2","-","SINAPI",null,"DIVERSOS","-",null,1,"-",null,null,0,0,""]
["S",2,"S",0,1,5,0,0,0,0,0,"","Serviço","Serviço","-","COMPOSIÇÃO","COMP 415_SEE","PEITORIL EM GRANITO CINZA, LARGURA VARIÁVEL E PINGADEIRA","M2",1.89,1,1.89,null,null,0,0,""]
["S",2,"S",0,1,5,0,0,0,0,0,"","Serviço","Serviço","-","AGETOP",60010,"VERGA/CONTRAVERGA EM CONCRETO ARMADO FCK = 20 MPA","m3    ",0.32,1,0.32,null,null,0,0,""]
["S",2,"S",0,1,5,0,0,0,0,0,"","Serviço","Serviço","-","AGETOP",271608,"BANCADA DE GRANITO C/ESPELHO","m2    ",0.72,1,0.72,null,null,0,0,""]
[2,2,2,13,1,6,0,0,0,32,13,"","Nível 2","Nível 2","-",null,null,"PINTURA","-",null,1,"-",null,null,0,0,""]
[3,3,3,3,1,6,1,0,0,12,3,"","Nível 3","Nível 3","-","AGETOP",null,"LÁTEX ACRÍLICA","-",null,1,"-",null,null,0,0,""]
["S",3,"S",0,1,6,1,0,0,0,0,"","Serviço","Serviço","-","AGETOP",261300,"EMASSAMENTO COM MASSA PVA DUAS DEMAOS","m2    ",292.41000000000003,1,292.41000000000003,null,null,0,0,""]
["S",3,"S",0,1,6,1,0,0,0,0,"","Serviço","Serviço","-","AGETOP",261001,"PINTURA LATEX ACRILICO 2 DEMAOS","m2    ",182.41,1,182.41,null,null,0,0,""]
[3,3,3,3,1,6,2,0,0,9,3,"","Nível 3","Nível 3","-","AGETOP",null,"TETO","-",null,1,"-",null,null,0,0,""]
["S",3,"S",0,1,6,2,0,0,0,0,"","Serviço","Serviço","-","AGETOP",261300,"EMASSAMENTO COM MASSA PVA DUAS DEMAOS","m2    ",66.569999999999993,1,66.569999999999993,null,null,0,0,""]
["S",3,"S",0,1,6,2,0,0,0,0,"","Serviço","Serviço","-","AGETOP",261307,"PINTURA PVA LATEX 2 DEMAOS SEM SELADOR","m2    ",66.569999999999993,1,66.569999999999993,null,null,0,0,""]
[3,3,3,2,1,6,3,0,0,6,2,"","Nível 3","Nível 3","-","AGETOP",null,"EXTERNA","-",null,1,"-",null,null,0,0,""]
["S",3,"S",0,1,6,3,0,0,0,0,"","Serviço","Serviço","-","AGETOP",261001,"PINTURA LATEX ACRILICO 2 DEMAOS","m2    ",110,1,110,null,null,0,0,""]
[3,3,3,2,1,6,4,0,0,4,2,"","Nível 3","Nível 3","-","AGETOP",null,"ESQUADRIAS NOVAS","-",null,1,"-",null,null,0,0,""]
["S",3,"S",0,1,6,4,0,0,0,0,"","Serviço","Serviço","-","AGETOP",261602,"PINT.ESMALTE/ESQUAD.FERRO C/FUNDO ANTICOR.","m2    ",109.99,1,109.99,null,null,0,0,""]
[3,3,3,2,1,6,5,0,0,2,{"$error":"#N/A"},"","Nível 3","Nível 3","-","AGETOP",null,"ESTRUTURA METÁLICA","-",null,1,"-",null,null,0,0,""]
["S",3,"S",0,1,6,5,0,0,0,0,"","Serviço","Serviço","-","AGETOP",261609,"PINTURA ESMALTE ALQUIDICO ESTR.METALICA 2 DEMAOS","m2    ",125.31,1,125.31,null,null,0,0,""]
[2,2,2,9,1,7,0,0,0,19,9,"","Nível 2","Nível 2","-","SINAPI",null,"REVESTIMENTO DE PISO","-",null,1,"-",null,null,0,0,""]
[3,3,3,2,1,7,1,0,0,{"$f":"IF(OR($C51=\"S\",$C51=0),0,MATCH(0,OFFSET($D51,1,$C51,ROW($C$290)-ROW($C51)),0))","v":8},{"$f":"IF(OR($C51=\"S\",$C51=0),0,MATCH(OFFSET($D51,0,$C51)+1,OFFSET($D51,1,$C51,ROW($C$290)-ROW($C51)),0))","v":2},"","Nível 3","Nível 3","-","SINAPI",null,"LASTRO","-",null,1,"-",null,null,0,0,""]
["S",3,"S",0,1,7,1,0,0,0,0,"","Serviço","Serviço","-","AGETOP",220101,"LASTRO DE CONCRETO REGULARIZADO IMPERMEABILIZADO 1:3:6 ESP=5CM (BASE)","m2    ",90.8,1,90.8,null,null,0,0,""]
[3,3,3,4,1,7,2,0,0,6,4,"","Nível 3","Nível 3","-",null,null,"GRANITINA","-",null,1,"-",null,null,0,0,""]
["S",3,"S",0,1,7,2,0,0,0,0,"","Serviço","Serviço","-","AGETOP",221101,"GRANITINA 8MM FUNDIDA COM CONTRAPISO (1CI:3ARML) E=2CM E JUNTA PLASTICA 27MM","m2    ",90.8,1,90.8,null,null,0,0,""]
["S",3,"S",0,1,7,2,0,0,0,0,"","Serviço","Serviço","-","AGETOP",221104,"RASPAGEM E APLICAÇÃO RESINA ACRÍLICA DUAS DEMÃOS","m2    ",96.1,1,96.1,null,null,0,0,""]
["S",3,"S",0,1,7,2,0,0,0,0,"","Serviço","Serviço","-","AGETOP",221102,"RODAPÉ FUNDIDO DE GRANITINA 7CM","m     ",75.714285714285708,1,75.714285714285708,null,null,0,0,""]
[3,3,3,2,1,7,3,0,0,2,216,"","Nível 3","Nível 3","-","SINAPI",null,"CALÇADA","-",null,1,"-",null,null,0,0,""]
["S",3,"S",0,1,7,3,0,0,0,0,"","Serviço","Serviço","-","AGETOP",220100,"PASSEIO PROTECAO EM CONC.DESEMPEN.5 CM 1:2,5:3,5 ( INCLUSO ESPELHO DE 30CM/ESCAVAÇÃO/REATERRO/APILOAMENTO/ATERRO INTERNO)","m2    ",34.65,1,34.65,null,null,0,0,""]
[2,2,2,2,1,8,0,0,0,10,2,"","Nível 2","Nível 2","-","SINAPI",null,"REVESTIMENTO DE PAREDE","-",null,1,"-",null,null,0,0,""]
["S",2,"S",0,1,8,0,0,0,0,0,"","Serviço","Serviço","-","SINAPI",87273,"REVESTIMENTO CERÂMICO PARA PAREDES INTERNAS COM PLACAS TIPO ESMALTADA EXTRA DE DIMENSÕES 33X45 CM APLICADAS EM AMBIENTES DE ÁREA MAIOR QUE 5 M² NA ALTURA INTEIRA DAS PAREDES. AF_06/2014","M2",54.52,1,54.52,null,null,0,0,""]
[2,2,2,3,1,9,0,0,0,8,3,"","Nível 2","Nível 2","-","SINAPI",null,"FERRAGENS","-",null,1,"-",null,null,0,0,""]
["S",2,"S",0,1,9,0,0,0,0,0,"","Serviço","Serviço","-","AGETOP",230174,"BARRA DE APOIO EM AÇO INOX - 40 CM","un    ",4,1,4,null,null,0,0,""]
["S",2,"S",0,1,9,0,0,0,0,0,"","Serviço","Serviço","-","AGETOP",230176,"BARRA DE APOIO EM AÇO INOX - 80 CM ","un    ",3,1,3,null,null,0,0,""]
[2,2,2,5,1,10,0,0,0,5,{"$error":"#N/A"},"","Nível 2","Nível 2","-","SINAPI",null,"COBERTURAS","-",null,1,"-",null,null,0,0,""]
["S",2,"S",0,1,10,0,0,0,0,0,"","Serviço","Serviço","-","AGETOP",160100,"COBERTURA COM TELHA AMERICANA  RESINADA COR VERMELHA","m2    ",125.31,1,125.31,null,null,0,0,""]
["S",2,"S",0,1,10,0,0,0,0,0,"","Serviço","Serviço","-","AGETOP",160403,"EMBOCAMENTO LATERAL  (OITOES)","m     ",19.8,1,19.8,null,null,0,0,""]
["S",2,"S",0,1,10,0,0,0,0,0,"","Serviço","Serviço","-","AGETOP",160404,"EMBOCAMENTO DE BEIRAL","M     ",26.7,1,26.7,null,null,0,0,""]
["S",2,"S",0,1,10,0,0,0,0,0,"","Serviço","Serviço","-","AGETOP",160101,"CUMEEIRA PARA TELHA AMERICANA RESINADA COR VERMELHA","m     ",13.35,1,13.35,null,null,0,0,""]
[1,1,1,9,2,0,0,0,0,221,9,"F","Nível 1","Nível 1","2.","SINAPI",null,"IMPLANTAÇÃO BLOCO ADMINISTRATIVO","UN",1,1,1,null,null,0,0,""]
[{"$f":"CHOOSE(1+LOG(1+2*(ORÇAMENTO.Nivel=\"Nível 1\")+4*(ORÇAMENTO.Nivel=\"Nível 2\")+8*(ORÇAMENTO.Nivel=\"Nível 3\")+16*(ORÇAMENTO.Nivel=\"Nível 4\")+32*(ORÇAMENTO.Nivel=\"Serviço\"),2),0,1,2,3,4,\"S\")","v":2},{"$f":"IF(OR(C70=\"s\",C70=0),OFFSET(B70,-1,0),C70)","v":2},{"$f":"IF(OFFSET(C70,-1,0)=\"L\",1,IF(OFFSET(C70,-1,0)=1,2,IF(OR(A70=\"s\",A70=0),\"S\",IF(AND(OFFSET(C70,-1,0)=2,A70=4),3,IF(AND(OR(OFFSET(C70,-1,0)=\"s\",OFFSET(C70,-1,0)=0),A70<>\"s\",A70>OFFSET(B70,-1,0)),OFFSET(B70,-1,0),A70)))))","v":2},{"$f":"IF(OR(C70=\"S\",C70=0),0,IF(ISERROR(K70),J70,SMALL(J70:K70,1)))","v":8},{"$f":"IF($C70=1,OFFSET(E70,-1,0)+1,OFFSET(E70,-1,0))","v":2},{"$f":"IF($C70=1,0,IF($C70=2,OFFSET(F70,-1,0)+1,OFFSET(F70,-1,0)))","v":1},{"$f":"IF(AND($C70<=2,$C70<>0),0,IF($C70=3,OFFSET(G70,-1,0)+1,OFFSET(G70,-1,0)))","v":0},{"$f":"IF(AND($C70<=3,$C70<>0),0,IF($C70=4,OFFSET(H70,-1,0)+1,OFFSET(H70,-1,0)))","v":0},{"$f":"IF(AND($C70<=4,$C70<>0),0,IF(AND($C70=\"S\",$Y70>0),OFFSET(I70,-1,0)+1,OFFSET(I70,-1,0)))","v":0},8,11,{"$f":"IF(OR(Y70>0,$C70=1),\"F\",\"\")","v":""},"Nível 2",{"$f":"CHOOSE(1+LOG(1+2*(C70=1)+4*(C70=2)+8*(C70=3)+16*(C70=4)+32*(C70=\"S\"),2),\"\",\"Nível 1\",\"Nível 2\",\"Nível 3\",\"Nível 4\",\"Serviço\")","v":"Nível 2"},"-","SINAPI",null,"SERVIÇO EM TERRA","-",null,1,"-",null,null,0,0,""]
[3,3,3,7,2,1,1,0,0,7,31,"","Nível 3","Nível 3","-",null,null,"AQUISIÇÃO DE TERRA (SOMENTE ATERRO)","-",null,1,"-",null,null,0,0,""]
["S",3,"S",0,2,1,1,0,0,0,0,"","Serviço","Serviço","-","AGETOP",41004,"ESCAVACAO MECANICA","m3    ",48.81,1,48.81,null,null,0,0,""]
["S",3,"S",0,2,1,1,0,0,0,0,"","Serviço","Serviço","-","AGETOP",41005,"CARGA MECANIZADA","m3    ",48.81,1,48.81,null,null,0,0,""]
["S",3,"S",0,2,1,1,0,0,0,0,"","Serviço","Serviço","-","AGETOP",41012,"INDENIZAÇÃO DE JAZIDA","m3    ",48.81,1,48.81,null,null,0,0,""]
["S",3,"S",0,2,1,1,0,0,0,0,"","Serviço","Serviço","-","AGETOP",41006,"TRANSPORTE DE MATERIAL ESCAVADO M3.KM","m3km  ",488.12,1,488.12,null,null,0,0,""]
["S",3,"S",0,2,1,1,0,0,0,0,"","Serviço","Serviço","-","AGETOP",41140,"REGULARIZAÇÃO DO TERRENO SEM APILOAMENTO COM TRANSPORTE MANUAL DA TERRA ESCAVADA ","m2    ",174.36,1,174.36,null,null,0,0,""]
["S",3,"S",0,2,1,1,0,0,0,0,"","Serviço","Serviço","-","AGETOP",41002,"APILOAMENTO","m2    ",174.36,1,174.36,null,null,0,0,""]
[1,1,1,20,3,0,0,0,0,212,20,"F","Nível 1","Nível 1","3.","SINAPI",null,"RAMPA DE ACESSO","UN",1,1,1,null,null,0,0,""]
[2,2,2,2,3,1,0,0,0,19,2,"","Nível 2","Nível 2","-","SINAPI",null,"ALVENARIAS E DIVISÓRIAS","-",null,1,"-",null,null,0,0,""]
["S",2,"S",0,3,1,0,0,0,0,0,"","Serviço","Serviço","-","AGETOP",100102,"ALVENARIA DE TIJOLO COMUM 1/2 VEZ - ARG. (1CI : 2CH : 8ARML)","m2    ",2.12,1,2.12,null,null,0,0,""]
[2,2,2,3,3,2,0,0,0,17,3,"","Nível 2","Nível 2","-","SINAPI",null,"REVESTIMENTO DE PAREDE","-",null,1,"-",null,null,0,0,""]
["S",2,"S",0,3,2,0,0,0,0,0,"","Serviço","Serviço","-","AGETOP",200101,"CHAPISCO COMUM","m2    ",2.12,1,2.12,null,null,0,0,""]
["S",2,"S",0,3,2,0,0,0,{"$f":"IF(OR($C83=\"S\",$C83=0),0,MATCH(0,OFFSET($D83,1,$C83,ROW($C$290)-ROW($C83)),0))","v":0},{"$f":"IF(OR($C83=\"S\",$C83=0),0,MATCH(OFFSET($D83,0,$C83)+1,OFFSET($D83,1,$C83,ROW($C$290)-ROW($C83)),0))","v":0},"","Serviço","Serviço","-","AGETOP",200499,"REBOCO PAULISTA A-14 (1CALH:4ARMLC+100kgCI/M3)","m2    ",2.12,1,2.12,null,null,0,0,""]
[2,2,2,2,3,3,0,0,0,14,2,"","Nível 2","Nível 2","-","SINAPI",null,"PINTURA","-",null,1,"-",null,null,0,0,""]
["S",2,"S",0,3,3,0,0,0,0,0,"","Serviço","Serviço","-","AGETOP",261001,"PINTURA LATEX ACRILICO 2 DEMAOS","m2    ",2.12,1,2.12,null,null,0,0,""]
[2,2,2,8,3,4,0,0,0,12,8,"","Nível 2","Nível 2","-","SINAPI",null,"SERVIÇO EM TERRA","-",null,1,"-",null,null,0,0,""]
[3,3,3,7,3,4,1,0,0,7,15,"","Nível 3","Nível 3","-",null,null,"AQUISIÇÃO DE TERRA (SOMENTE ATERRO)","-",null,1,"-",null,null,0,0,""]
["S",3,"S",0,3,4,1,0,0,0,0,"","Serviço","Serviço","-","AGETOP",41004,"ESCAVACAO MECANICA","m3    ",3.22,1,3.22,null,null,0,0,""]
["S",3,"S",0,3,4,1,0,0,0,0,"","Serviço","Serviço","-","AGETOP",41005,"CARGA MECANIZADA","m3    ",3.22,1,3.22,null,null,0,0,""]
["S",3,"S",0,3,4,1,0,0,0,0,"","Serviço","Serviço","-","AGETOP",41012,"INDENIZAÇÃO DE JAZIDA","m3    ",3.22,1,3.22,null,null,0,0,""]
["S",3,"S",0,3,4,1,0,0,0,0,"","Serviço","Serviço","-","AGETOP",41006,"TRANSPORTE DE MATERIAL ESCAVADO M3.KM","m3km  ",3.22,1,3.22,null,null,0,0,""]
["S",3,"S",0,3,4,1,0,0,0,0,"","Serviço","Serviço","-","AGETOP",41140,"REGULARIZAÇÃO DO TERRENO SEM APILOAMENTO COM TRANSPORTE MANUAL DA TERRA ESCAVADA ","m2    ",14.54,1,14.54,null,null,0,0,""]
["S",3,"S",0,3,4,1,0,0,0,0,"","Serviço","Serviço","-","AGETOP",41002,"APILOAMENTO","m2    ",14.54,1,14.54,null,null,0,0,""]
[2,2,2,2,3,5,0,0,0,4,2,"","Nível 2","Nível 2","-","SINAPI",null,"REVESTIMENTO DE PISO","-",null,1,"-",null,null,0,0,""]
["S",2,"S",0,3,5,0,0,0,0,0,"","Serviço","Serviço","-","AGETOP",220102,"PISO CONCRETO DESEMPENADO ESPESSURA = 5 CM  1:2,5:3,5","m2    ",14.54,1,14.54,null,null,0,0,""]
[2,2,2,2,3,6,0,0,0,2,{"$error":"#N/A"},"","Nível 2","Nível 2","-","SINAPI",null,"ESQUADRIAS METÁLICAS","-",null,1,"-",null,null,0,0,""]
["S",2,"S",0,3,6,0,0,0,0,0,"","Serviço","Serviço","-","COMPOSIÇÃO","COMP 084_SEE","GUARDA-CORPO COM CORRIMÃO - SEDUC","M",11.92,1,11.92,null,null,0,0,""]
[1,1,1,12,4,0,0,0,0,192,12,"F","Nível 1","Nível 1","4.","SINAPI",null,"PORTÃO PEDESTRES","UN",1,1,1,null,null,0,0,""]
[2,2,2,6,4,1,0,0,0,11,6,"","Nível 2","Nível 2","-","SINAPI",null,"SERVIÇOS PRELIMINARES","-",null,1,"-",null,null,0,0,""]
[{"$f":"CHOOSE(1+LOG(1+2*(ORÇAMENTO.Nivel=\"Nível 1\")+4*(ORÇAMENTO.Nivel=\"Nível 2\")+8*(ORÇAMENTO.Nivel=\"Nível 3\")+16*(ORÇAMENTO.Nivel=\"Nível 4\")+32*(ORÇAMENTO.Nivel=\"Serviço\"),2),0,1,2,3,4,\"S\")","v":3},{"$f":"IF(OR(C100=\"s\",C100=0),OFFSET(B100,-1,0),C100)","v":3},{"$f":"IF(OFFSET(C100,-1,0)=\"L\",1,IF(OFFSET(C100,-1,0)=1,2,IF(OR(A100=\"s\",A100=0),\"S\",IF(AND(OFFSET(C100,-1,0)=2,A100=4),3,IF(AND(OR(OFFSET(C100,-1,0)=\"s\",OFFSET(C100,-1,0)=0),A100<>\"s\",A100>OFFSET(B100,-1,0)),OFFSET(B100,-1,0),A100)))))","v":3},{"$f":"IF(OR(C100=\"S\",C100=0),0,IF(ISERROR(K100),J100,SMALL(J100:K100,1)))","v":2},{"$f":"IF($C100=1,OFFSET(E100,-1,0)+1,OFFSET(E100,-1,0))","v":4},{"$f":"IF($C100=1,0,IF($C100=2,OFFSET(F100,-1,0)+1,OFFSET(F100,-1,0)))","v":1},{"$f":"IF(AND($C100<=2,$C100<>0),0,IF($C100=3,OFFSET(G100,-1,0)+1,OFFSET(G100,-1,0)))","v":1},{"$f":"IF(AND($C100<=3,$C100<>0),0,IF($C100=4,OFFSET(H100,-1,0)+1,OFFSET(H100,-1,0)))","v":0},{"$f":"IF(AND($C100<=4,$C100<>0),0,IF(AND($C100=\"S\",$Y100>0),OFFSET(I100,-1,0)+1,OFFSET(I100,-1,0)))","v":0},5,2,{"$f":"IF(OR(Y100>0,$C100=1),\"F\",\"\")","v":""},"Nível 3",{"$f":"CHOOSE(1+LOG(1+2*(C100=1)+4*(C100=2)+8*(C100=3)+16*(C100=4)+32*(C100=\"S\"),2),\"\",\"Nível 1\",\"Nível 2\",\"Nível 3\",\"Nível 4\",\"Serviço\")","v":"Nível 3"},"-","SINAPI",null,"DEMOLIÇÃO","-",null,1,"-",null,null,0,0,""]
["S",3,"S",0,4,1,1,0,0,0,0,"","Serviço","Serviço","-","AGETOP",20160,"DEMOLIÇÃO DE TELA DE ALAMBRADO C/ TRANSP. ATÉ CB. E CARGA","m2    ",3,1,3,null,null,0,0,""]
[{"$f":"CHOOSE(1+LOG(1+2*(ORÇAMENTO.Nivel=\"Nível 1\")+4*(ORÇAMENTO.Nivel=\"Nível 2\")+8*(ORÇAMENTO.Nivel=\"Nível 3\")+16*(ORÇAMENTO.Nivel=\"Nível 4\")+32*(ORÇAMENTO.Nivel=\"Serviço\"),2),0,1,2,3,4,\"S\")","v":3},{"$f":"IF(OR(C102=\"s\",C102=0),OFFSET(B102,-1,0),C102)","v":3},{"$f":"IF(OFFSET(C102,-1,0)=\"L\",1,IF(OFFSET(C102,-1,0)=1,2,IF(OR(A102=\"s\",A102=0),\"S\",IF(AND(OFFSET(C102,-1,0)=2,A102=4),3,IF(AND(OR(OFFSET(C102,-1,0)=\"s\",OFFSET(C102,-1,0)=0),A102<>\"s\",A102>OFFSET(B102,-1,0)),OFFSET(B102,-1,0),A102)))))","v":3},{"$f":"IF(OR(C102=\"S\",C102=0),0,IF(ISERROR(K102),J102,SMALL(J102:K102,1)))","v":3},{"$f":"IF($C102=1,OFFSET(E102,-1,0)+1,OFFSET(E102,-1,0))","v":4},{"$f":"IF($C102=1,0,IF($C102=2,OFFSET(F102,-1,0)+1,OFFSET(F102,-1,0)))","v":1},{"$f":"IF(AND($C102<=2,$C102<>0),0,IF($C102=3,OFFSET(G102,-1,0)+1,OFFSET(G102,-1,0)))","v":2},{"$f":"IF(AND($C102<=3,$C102<>0),0,IF($C102=4,OFFSET(H102,-1,0)+1,OFFSET(H102,-1,0)))","v":0},{"$f":"IF(AND($C102<=4,$C102<>0),0,IF(AND($C102=\"S\",$Y102>0),OFFSET(I102,-1,0)+1,OFFSET(I102,-1,0)))","v":0},3,73,{"$f":"IF(OR(Y102>0,$C102=1),\"F\",\"\")","v":""},"Nível 3",{"$f":"CHOOSE(1+LOG(1+2*(C102=1)+4*(C102=2)+8*(C102=3)+16*(C102=4)+32*(C102=\"S\"),2),\"\",\"Nível 1\",\"Nível 2\",\"Nível 3\",\"Nível 4\",\"Serviço\")","v":"Nível 3"},"-","SINAPI",null,"TRANSPORTE","-",null,1,"-",null,null,0,0,""]
["S",3,"S",0,4,1,2,0,0,0,0,"","Serviço","Serviço","-","SINAPI",72900,"TRANSPORTE DE ENTULHO COM CAMINHAO BASCULANTE 6 M3, RODOVIA PAVIMENTADA, DMT 0,5 A 1,0 KM","M3",0.15000000000000002,1,0.15000000000000002,null,null,0,0,""]
["S",3,"S",0,4,1,2,0,0,0,0,"","Serviço","Serviço","-","SINAPI",72897,"CARGA MANUAL DE ENTULHO EM CAMINHAO BASCULANTE 6 M3","M3",0.15000000000000002,1,0.15000000000000002,null,null,0,0,""]
[2,2,2,2,4,2,0,0,0,5,2,"","Nível 2","Nível 2","-","SINAPI",null,"ESQUADRIAS METÁLICAS","-",null,1,"-",null,null,0,0,""]
["S",2,"S",0,4,2,0,0,0,0,0,"","Serviço","Serviço","-","AGETOP",180281,"PORTAO TELA/TUBO FoGo PT3 C/FERRAGENS","m2    ",3,1,3,null,null,0,0,""]
[2,2,2,3,4,3,0,0,0,3,{"$error":"#N/A"},"","Nível 2","Nível 2","-","SINAPI",null,"PINTURA","-",null,1,"-",null,null,0,0,""]
[3,3,3,2,4,3,1,0,0,2,57,"","Nível 3","Nível 3","-","AGETOP",null,"ESQUADRIAS NOVAS","-",null,1,"-",null,null,0,0,""]
["S",3,"S",0,4,3,1,0,0,0,0,"","Serviço","Serviço","-","AGETOP",261602,"PINT.ESMALTE/ESQUAD.FERRO C/FUNDO ANTICOR.","m2    ",9,1,9,null,null,0,0,""]
[1,1,1,5,5,0,0,0,0,180,5,"F","Nível 1","Nível 1","5.","SINAPI",null,"ADMINISTRAÇÃO LOCAL","UN",1,1,1,null,null,0,0,""]
[2,2,2,4,5,1,0,0,0,4,13,"","Nível 2","Nível 2","-",null,null,"ADMINISTRAÇÃO","-",null,1,"-",null,null,0,0,""]
[3,3,3,3,5,1,1,0,0,3,53,"","Nível 3","Nível 3","-",null,null,"MENSALISTAS","-",null,1,"-",null,null,0,0,""]
["S",3,"S",0,5,1,1,0,0,0,0,"","Serviço","Serviço","-","SINAPI",90778,"ENGENHEIRO CIVIL DE OBRA PLENO COM ENCARGOS COMPLEMENTARES","H",20,1,20,null,null,0,0,"Referência: AGETOP - 250101"]
["S",3,"S",0,5,1,1,0,0,0,0,"","Serviço","Serviço","-","SINAPI",90776,"ENCARREGADO GERAL COM ENCARGOS COMPLEMENTARES","H",440,1,440,null,null,0,0,"Referência: AGETOP - 250103"]
[1,1,1,5,6,0,0,0,0,{"$f":"IF(OR($C115=\"S\",$C115=0),0,MATCH(0,OFFSET($D115,1,$C115,ROW($C$290)-ROW($C115)),0))","v":175},{"$f":"IF(OR($C115=\"S\",$C115=0),0,MATCH(OFFSET($D115,0,$C115)+1,OFFSET($D115,1,$C115,ROW($C$290)-ROW($C115)),0))","v":5},"F","Nível 1","Nível 1","6.","SINAPI",null,"OBRA","UN",1,1,1,null,null,0,0,""]
[2,2,2,4,6,1,0,0,0,4,8,"","Nível 2","Nível 2","-","SINAPI",null,"DIVERSOS","-",null,1,"-",null,null,0,0,""]
["S",2,"S",0,6,1,0,0,0,0,0,"","Serviço","Serviço","-","AGETOP",270501,"LIMPEZA FINAL DE OBRA - (OBRAS CIVIS)","m2    ",100,1,100,null,null,0,0,""]
["S",2,"S",0,6,1,0,0,0,0,0,"","Serviço","Serviço","-","AGETOP",21301,"PLACA DE OBRA PLOTADA EM CHAPA METÁLICA 26 , AFIXADA EM CAVALETES DE MADEIRA DE LEI (VIGOTAS 6X12CM) - PADRÃO GOINFRA","m2    ",7.5,1,7.5,null,null,0,0,""]
["S",2,"S",0,6,1,0,0,0,0,0,"","Serviço","Serviço","-","AGETOP",270804,"PLACA DE INAUGURAÇÃO AÇO ESCOVADO 60 X 120 CM","un    ",1,1,1,null,null,0,0,""]
[1,1,1,36,7,0,0,0,0,170,36,"F","Nível 1","Nível 1","7.","AGETOP",null,"PROJETO ELÉTRICO","UN",1,1,1,null,null,0,0,""]
[2,2,2,3,7,1,0,0,0,35,3,"","Nível 2","Nível 2","-","AGETOP",null,"SERVIÇO EM TERRA","-",null,1,"-",null,null,0,0,""]
["S",2,"S",0,7,1,0,0,0,0,0,"","Serviço","Serviço","-","SINAPI",93358,"ESCAVAÇÃO MANUAL DE VALA COM PROFUNDIDADE MENOR OU IGUAL A 1,30 M. AF_03/2016","M3",12.6,1,12.6,null,null,0,0,"Referência: AGETOP - 40101"]
["S",2,"S",0,7,1,0,0,0,0,0,"","Serviço","Serviço","-","SINAPI",96995,"REATERRO MANUAL APILOADO COM SOQUETE. AF_10/2017","M3",12.6,1,12.6,null,null,0,0,"Referência: AGETOP - 40902"]
[2,2,2,32,7,2,0,0,0,32,{"$error":"#N/A"},"","Nível 2","Nível 2","-",null,null,"INSTALAÇÕES ELÉTRICAS","-",null,1,"-",null,null,0,0,""]
["S",2,"S",0,7,2,0,0,0,0,0,"","Serviço","Serviço","-","AGETOP",70374,"BRACADEIRA METALICA TIPO \"D\" DIAM. 1.1/2\"","Un    ",60,1,60,null,null,0,0,""]
["S",2,"S",0,7,2,0,0,0,0,0,"","Serviço","Serviço","-","AGETOP",70424,"BUCHA E ARRUELA METALICA DIAM. 1.1/2\"","PR    ",60,1,60,null,null,0,0,""]
["S",2,"S",0,7,2,0,0,0,0,0,"","Serviço","Serviço","-","AGETOP",71254,"ELETRODUTO EM AÇO ZINCADO DIÂMETRO 1.1/2\"","M     ",90,1,90,null,null,0,0,""]
["S",2,"S",0,7,2,0,0,0,0,0,"","Serviço","Serviço","-","AGETOP",71724,"LUVA EM AÇO ZINCADO DIÂMETRO 1.1/2\"","Un    ",16,1,16,null,null,0,0,""]
["S",2,"S",0,7,2,0,0,0,0,0,"","Serviço","Serviço","-","AGETOP",71124,"CURVA 90 GRAUS AÇO ZINCADO DIÂMETRO 1.1/2\"","Un    ",8,1,8,null,null,0,0,""]
["S",2,"S",0,7,2,0,0,0,0,0,"","Serviço","Serviço","-","SINAPI",97667,"ELETRODUTO FLEXÍVEL CORRUGADO, PEAD, DN 50 (1 ½\u0094)  - FORNECIMENTO E INSTALAÇÃO. AF_04/2016","M",35,1,35,null,null,0,0,""]
["S",2,"S",0,7,2,0,0,0,0,0,"","Serviço","Serviço","-","SINAPI",91845,"ELETRODUTO FLEXÍVEL CORRUGADO REFORÇADO, PVC, DN 25 MM (3/4\"), PARA CIRCUITOS TERMINAIS, INSTALADO EM LAJE - FORNECIMENTO E INSTALAÇÃO. AF_12/2015","M",145,1,145,null,null,0,0,""]
["S",2,"S",0,7,2,0,0,0,0,0,"","Serviço","Serviço","-","SINAPI",91847,"ELETRODUTO FLEXÍVEL CORRUGADO REFORÇADO, PVC, DN 32 MM (1\"), PARA CIRCUITOS TERMINAIS, INSTALADO EM LAJE - FORNECIMENTO E INSTALAÇÃO. AF_12/2015","M",12,1,12,null,null,0,0,""]
["S",2,"S",0,7,2,0,0,0,0,0,"","Serviço","Serviço","-","AGETOP",70681,"CAIXA METALICA OCTOGONAL FUNDO MOVEL, SIMPLES 2\"","Un    ",28,1,28,null,null,0,0,""]
["S",2,"S",0,7,2,0,0,0,0,0,"","Serviço","Serviço","-","SINAPI",97592,"LUMINÁRIA TIPO PLAFON, DE SOBREPOR, COM 1 LÂMPADA LED DE 12/13 W, SEM REATOR - FORNECIMENTO E INSTALAÇÃO. AF_02/2020","UN",28,1,28,null,null,0,0,""]
["S",2,"S",0,7,2,0,0,0,0,0,"","Serviço","Serviço","-","AGETOP",70924,"CONDULETE DE PVC - CAIXA COM 5 ENTRADAS ","un    ",5,1,5,null,null,0,0,""]
["S",2,"S",0,7,2,0,0,0,0,0,"","Serviço","Serviço","-","SINAPI",92008,"TOMADA BAIXA DE EMBUTIR (2 MÓDULOS), 2P+T 10 A, INCLUINDO SUPORTE E PLACA - FORNECIMENTO E INSTALAÇÃO. AF_12/2015","UN",19,1,19,null,null,0,0,""]
["S",2,"S",0,7,2,0,0,0,0,0,"","Serviço","Serviço","-","SINAPI",92004,"TOMADA MÉDIA DE EMBUTIR (2 MÓDULOS), 2P+T 10 A, INCLUINDO SUPORTE E PLACA - FORNECIMENTO E INSTALAÇÃO. AF_12/2015","UN",3,1,3,null,null,0,0,"Referência: AGETOP - 72578"]
["S",2,"S",0,7,2,0,0,0,0,0,"","Serviço","Serviço","-","SINAPI",91992,"TOMADA ALTA DE EMBUTIR (1 MÓDULO), 2P+T 10 A, INCLUINDO SUPORTE E PLACA - FORNECIMENTO E INSTALAÇÃO. AF_12/2015","UN",3,1,3,null,null,0,0,""]
["S",2,"S",0,7,2,0,0,0,0,0,"","Serviço","Serviço","-","AGETOP",71440,"INTERRUPTOR SIMPLES (1 SECAO)","Un    ",11,1,11,null,null,0,0,""]
["S",2,"S",0,7,2,0,0,0,0,0,"","Serviço","Serviço","-","AGETOP",71043,"CONECTOR TRIPOLAR EM PORCELANA PARA FIOS DE ATÉ 10MM2 (BORNES) 50A-250V (CHUVEIRO)","un    ",4,1,4,null,null,0,0,""]
["S",2,"S",0,7,2,0,0,0,0,0,"","Serviço","Serviço","-","AGETOP",72575,"TOMADA HEXAGONAL 2P + T - 20A - 250V (LINHA X OU EQUIVALENTE)","Un    ",4,1,4,null,null,0,0,""]
["S",2,"S",0,7,2,0,0,0,0,0,"","Serviço","Serviço","-","SINAPI",91926,"CABO DE COBRE FLEXÍVEL ISOLADO, 2,5 MM², ANTI-CHAMA 450/750 V, PARA CIRCUITOS TERMINAIS - FORNECIMENTO E INSTALAÇÃO. AF_12/2015","M",755,1,755,null,null,0,0,"Referência: AGETOP - 70563"]
["S",2,"S",0,7,2,0,0,0,0,0,"","Serviço","Serviço","-","SINAPI",92982,"CABO DE COBRE FLEXÍVEL ISOLADO, 16 MM², ANTI-CHAMA 0,6/1,0 KV, PARA DISTRIBUIÇÃO - FORNECIMENTO E INSTALAÇÃO. AF_12/2015","M",550,1,550,null,null,0,0,""]
["S",2,"S",0,7,2,0,0,0,0,0,"","Serviço","Serviço","-","AGETOP",70634,"CAIXA DE PASSAGEM -  TAMPA EM CONCRETO ARMADO 25 MPA E=5CM","m2    ",2,1,2,null,null,0,0,""]
["S",2,"S",0,7,2,0,0,0,0,0,"","Serviço","Serviço","-","AGETOP",70714,"CAIXA DE PASSAGEM 50X50X80CM FUNDO DE BRITA SEM TAMPA","Un    ",2,1,2,null,null,0,0,""]
["S",2,"S",0,7,2,0,0,0,0,0,"","Serviço","Serviço","-","SINAPI","74131/6","QUADRO DE DISTRIBUICAO DE ENERGIA DE EMBUTIR, EM CHAPA METALICA, PARA 32 DISJUNTORES TERMOMAGNETICOS MONOPOLARES, COM BARRAMENTO TRIFASICO E NEUTRO, FORNECIMENTO E INSTALACAO","UN",1,1,1,null,null,0,0,""]
["S",2,"S",0,7,2,0,0,0,{"$f":"IF(OR($C147=\"S\",$C147=0),0,MATCH(0,OFFSET($D147,1,$C147,ROW($C$290)-ROW($C147)),0))","v":0},{"$f":"IF(OR($C147=\"S\",$C147=0),0,MATCH(OFFSET($D147,0,$C147)+1,OFFSET($D147,1,$C147,ROW($C$290)-ROW($C147)),0))","v":0},"","Serviço","Serviço","-","AGETOP",71184,"DISPOSITIVO DE PROTEÇÃO CONTRA SURTOS (D.P.S.) 275V DE 8 A 40KA","Un    ",3,1,3,null,null,0,0,""]
["S",2,"S",0,7,2,0,0,0,0,0,"","Serviço","Serviço","-","SINAPI",93655,"DISJUNTOR MONOPOLAR TIPO DIN, CORRENTE NOMINAL DE 20A - FORNECIMENTO E INSTALAÇÃO. AF_04/2016","UN",6,1,6,null,null,0,0,""]
["S",2,"S",0,7,2,0,0,0,0,0,"","Serviço","Serviço","-","SINAPI",93654,"DISJUNTOR MONOPOLAR TIPO DIN, CORRENTE NOMINAL DE 16A - FORNECIMENTO E INSTALAÇÃO. AF_04/2016","UN",12,1,12,null,null,0,0,""]
["S",2,"S",0,7,2,0,0,0,0,0,"","Serviço","Serviço","-","AGETOP",71450,"INTERRUPTOR DIFERENCIAL RESIDUAL (D.R.) BIPOLAR DE 25A-30mA","Un    ",3,1,3,null,null,0,0,""]
["S",2,"S",0,7,2,0,0,0,0,0,"","Serviço","Serviço","-","SINAPI",93672,"DISJUNTOR TRIPOLAR TIPO DIN, CORRENTE NOMINAL DE 40A - FORNECIMENTO E INSTALAÇÃO. AF_04/2016","UN",2,1,2,null,null,0,0,"Referência: AGETOP - 71174"]
["S",2,"S",0,7,2,0,0,0,0,0,"","Serviço","Serviço","-","AGETOP",70764,"CANALETA COM TAMPA (LINHA X OU EQUIVALENTE) 50X20X2000 MM","M     ",2,1,2,null,null,0,0,""]
["S",2,"S",0,7,2,0,0,0,0,0,"","Serviço","Serviço","-","AGETOP",72630,"TRILHO OU SUPORTE P/BORNE TERMINAL","M     ",2,1,2,null,null,0,0,""]
["S",2,"S",0,7,2,0,0,0,0,0,"","Serviço","Serviço","-","AGETOP",71331,"FITA ISOLANTE, ROLO DE 20,00 M","Un    ",2,1,2,null,null,0,0,""]
["S",2,"S",0,7,2,0,0,0,0,0,"","Serviço","Serviço","-","AGETOP",71321,"FITA DE AUTO FUSAO, ROLO E 10,00 MM","Un    ",4,1,4,null,null,0,0,""]
[1,1,1,39,8,0,0,0,0,134,39,"F","Nível 1","Nível 1","8.","AGETOP",null,"PROJETO ESTRUTURAL","UN",1,1,1,null,null,0,0,""]
[2,2,2,20,8,1,0,0,0,38,20,"","Nível 2","Nível 2","-","AGETOP",null,"FUNDAÇÕES E SONDAGENS","-",null,1,"-",null,null,0,0,""]
[3,3,3,7,8,1,1,0,0,19,7,"","Nível 3","Nível 3","-","SINAPI",null,"BLOCOS","-",null,1,"-",null,null,0,0,""]
["S",3,"S",0,8,1,1,0,0,0,0,"","Serviço","Serviço","-","AGETOP",50901,"ESCAVACAO MANUAL DE VALAS (SAPATAS/BLOCOS)","m3    ",2.13,1,2.13,null,null,0,0,""]
["S",3,"S",0,8,1,1,0,0,0,0,"","Serviço","Serviço","-","AGETOP",50902,"APILOAMENTO (BLOCOS/SAPATAS)","m2    ",8,1,8,null,null,0,0,""]
["S",3,"S",0,8,1,1,0,0,0,0,"","Serviço","Serviço","-","AGETOP",60470,"LASTRO DE BRITA - (OBRAS CIVIS)","m3    ",0.4,1,0.4,null,null,0,0,""]
["S",3,"S",0,8,1,1,0,0,0,0,"","Serviço","Serviço","-","AGETOP",51030,"PREPARO COM BETONEIRA E TRANSPORTE MANUAL DE CONCRETO FCK=25 MPA","m3    ",2.13,1,2.13,null,null,0,0,""]
["S",3,"S",0,8,1,1,0,0,0,0,"","Serviço","Serviço","-","AGETOP",51055,"LANÇAMENTO/APLICAÇÃO/ADENSAMENTO MANUAL DE CONCRETO - (O.C.)","m3    ",2.13,1,2.13,null,null,0,0,""]
["S",3,"S",0,8,1,1,0,0,0,0,"","Serviço","Serviço","-","AGETOP",52003,"ACO CA-50A - 6,3 MM (1/4\") - (OBRAS CIVIS)","Kg    ",63.6,1,63.6,null,null,0,0,""]
[3,3,3,10,8,1,2,0,0,12,10,"","Nível 3","Nível 3","-","SINAPI",null,"VIGAS BALDRAMES","-",null,1,"-",null,null,0,0,""]
["S",3,"S",0,8,1,2,0,0,0,0,"","Serviço","Serviço","-","AGETOP",40101,"ESCAVACAO MANUAL DE VALAS < 1 MTS. (OBRAS CIVIS)","m3    ",7.47,1,7.47,null,null,0,0,""]
["S",3,"S",0,8,1,2,0,0,0,0,"","Serviço","Serviço","-","AGETOP",50902,"APILOAMENTO (BLOCOS/SAPATAS)","m2    ",10.67,1,10.67,null,null,0,0,""]
["S",3,"S",0,8,1,2,0,0,0,0,"","Serviço","Serviço","-","AGETOP",60470,"LASTRO DE BRITA - (OBRAS CIVIS)","m3    ",0.53349999999999997,1,0.53349999999999997,null,null,0,0,""]
["S",3,"S",0,8,1,2,0,0,0,0,"","Serviço","Serviço","-","AGETOP",60191,"FORMA DE TABUA CINTA BALDRAME U=8 VEZES","m2    ",42.67,1,42.67,null,null,0,0,""]
["S",3,"S",0,8,1,2,0,0,0,0,"","Serviço","Serviço","-","AGETOP",51030,"PREPARO COM BETONEIRA E TRANSPORTE MANUAL DE CONCRETO FCK=25 MPA","m3    ",3.2,1,3.2,null,null,0,0,""]
["S",3,"S",0,8,1,2,0,0,0,0,"","Serviço","Serviço","-","AGETOP",51055,"LANÇAMENTO/APLICAÇÃO/ADENSAMENTO MANUAL DE CONCRETO - (O.C.)","m3    ",3.2,1,3.2,null,null,0,0,""]
["S",3,"S",0,8,1,2,0,0,0,0,"","Serviço","Serviço","-","AGETOP",40902,"REATERRO COM APILOAMENTO","m3    ",4.2699999999999996,1,4.2699999999999996,null,null,0,0,""]
["S",3,"S",0,8,1,2,0,0,0,0,"","Serviço","Serviço","-","AGETOP",52004,"ACO CA 50-A - 8,0 MM (5/16\") - (OBRAS CIVIS)","Kg    ",113.8,1,113.8,null,null,0,0,""]
["S",3,"S",0,8,1,2,0,0,0,0,"","Serviço","Serviço","-","AGETOP",52014,"ACO CA-60 - 5,0 MM - (OBRAS CIVIS)","Kg    ",50.3,1,50.3,null,null,0,0,""]
[3,3,3,2,8,1,3,0,0,2,98,"","Nível 3","Nível 3","-","SINAPI",null,"OUTROS","-",null,1,"-",null,null,0,0,""]
["S",3,"S",0,8,1,3,0,0,0,0,"","Serviço","Serviço","-","AGETOP",120902,"IMPERMEABILIZACAO VIGAS BALDRAMES E=2,0 CM","m2    ",53.29,1,53.29,null,null,0,0,""]
[2,2,2,18,8,2,0,0,0,18,{"$error":"#N/A"},"","Nível 2","Nível 2","-","AGETOP",null,"ESTRUTURA","-",null,1,"-",null,null,0,0,""]
[3,3,3,6,8,2,1,0,0,17,6,"","Nível 3","Nível 3","-","AGETOP",null,"PILARES","-",null,1,"-",null,null,0,0,""]
["S",3,"S",0,8,2,1,0,0,{"$f":"IF(OR($C179=\"S\",$C179=0),0,MATCH(0,OFFSET($D179,1,$C179,ROW($C$290)-ROW($C179)),0))","v":0},{"$f":"IF(OR($C179=\"S\",$C179=0),0,MATCH(OFFSET($D179,0,$C179)+1,OFFSET($D179,1,$C179,ROW($C$290)-ROW($C179)),0))","v":0},"","Serviço","Serviço","-","SINAPI",92426,"MONTAGEM E DESMONTAGEM DE FÔRMA DE PILARES RETANGULARES E ESTRUTURAS SIMILARES COM ÁREA MÉDIA DAS SEÇÕES MENOR OU IGUAL A 0,25 M², PÉ-DIREITO SIMPLES, EM CHAPA DE MADEIRA COMPENSADA RESINADA, 8 UTILIZAÇÕES. AF_12/2015","M2",64.8,1,64.8,null,null,0,0,""]
["S",3,"S",0,8,2,1,0,0,0,0,"","Serviço","Serviço","-","SINAPI",94965,"CONCRETO FCK = 25MPA, TRAÇO 1:2,3:2,7 (CIMENTO/ AREIA MÉDIA/ BRITA 1)  - PREPARO MECÂNICO COM BETONEIRA 400 L. AF_07/2016","M3",3.24,1,3.24,null,null,0,0,"Referência: AGETOP - 51030"]
["S",3,"S",0,8,2,1,0,0,0,0,"","Serviço","Serviço","-","AGETOP",60801,"LANÇAMENTO/APLICAÇÃO/ADENSAMENTO MANUAL DE CONCRETO - (OBRAS CIVIS)","m3    ",3.24,1,3.24,null,null,0,0,""]
["S",3,"S",0,8,2,1,0,0,0,0,"","Serviço","Serviço","-","AGETOP",60305,"ACO CA-50A - 10,0 MM (3/8\") - (OBRAS CIVIS)","Kg    ",199.3,1,199.3,null,null,0,0,""]
["S",3,"S",0,8,2,1,0,0,0,0,"","Serviço","Serviço","-","AGETOP",60314,"ACO CA - 60 - 5,0 MM - (OBRAS CIVIS)","Kg    ",80.5,1,80.5,null,null,0,0,""]
[3,3,3,8,8,2,2,0,0,11,8,"","Nível 3","Nível 3","-",null,null,"VIGAS DE COBERTURA","-",null,1,"-",null,null,0,0,""]
["S",3,"S",0,8,2,2,0,0,0,0,"","Serviço","Serviço","-","AGETOP",60209,"FORMA CH.COMPENSADA 12MM-VIGA/PILAR U=4V - (OBRAS CIVIS","m2    ",64.58,1,64.58,null,null,0,0,""]
["S",3,"S",0,8,2,2,0,0,0,0,"","Serviço","Serviço","-","SINAPI",94965,"CONCRETO FCK = 25MPA, TRAÇO 1:2,3:2,7 (CIMENTO/ AREIA MÉDIA/ BRITA 1)  - PREPARO MECÂNICO COM BETONEIRA 400 L. AF_07/2016","M3",3.94,1,3.94,null,null,0,0,"Referência: AGETOP - 51030"]
["S",3,"S",0,8,2,2,0,0,0,0,"","Serviço","Serviço","-","AGETOP",60801,"LANÇAMENTO/APLICAÇÃO/ADENSAMENTO MANUAL DE CONCRETO - (OBRAS CIVIS)","m3    ",3.94,1,3.94,null,null,0,0,""]
["S",3,"S",0,8,2,2,0,0,0,0,"","Serviço","Serviço","-","AGETOP",60303,"ACO CA-50-A - 6,3 MM (1/4\") - (OBRAS CIVIS)","Kg    ",3.4,1,3.4,null,null,0,0,""]
["S",3,"S",0,8,2,2,0,0,0,0,"","Serviço","Serviço","-","AGETOP",60304,"ACO CA-50 A - 8,0 MM (5/16\") - (OBRAS CIVIS)","Kg    ",125.5,1,125.5,null,null,0,0,""]
["S",3,"S",0,8,2,2,0,0,0,0,"","Serviço","Serviço","-","AGETOP",60305,"ACO CA-50A - 10,0 MM (3/8\") - (OBRAS CIVIS)","Kg    ",17.2,1,17.2,null,null,0,0,""]
["S",3,"S",0,8,2,2,0,0,0,0,"","Serviço","Serviço","-","AGETOP",60314,"ACO CA - 60 - 5,0 MM - (OBRAS CIVIS)","Kg    ",58.3,1,58.3,null,null,0,0,""]
[3,3,3,3,8,2,3,0,0,3,81,"","Nível 3","Nível 3","-",null,null,"LAJE","-",null,1,"-",null,null,0,0,""]
[4,4,4,2,8,2,3,1,0,2,16,"","Nível 4","Nível 4","-","SINAPI",null,"LAJE TRELIÇADA","-",null,1,"-",null,null,0,0,""]
["S",4,"S",0,8,2,3,1,0,0,0,"","Serviço","Serviço","-","AGETOP",61101,"FORRO EM LAJE PRE-MOLDADA INC.CAPEAMENTO/FERR.DISTRIB./ESCORAMENTO E FORMA/DESFORMA","m2    ",82.5,1,82.5,null,null,0,0,""]
[1,1,1,85,9,0,0,0,0,95,85,"F","Nível 1","Nível 1","9.","AGETOP",null,"PROJETO HIDROSSANITÁRIO","UN",1,1,1,null,null,0,0,""]
[2,2,2,84,9,1,0,0,0,84,{"$error":"#N/A"},"","Nível 2","Nível 2","-","AGETOP",null,"INSTALAÇÕES HIDROSSANITÁRIAS","-",null,1,"-",null,null,0,0,""]
[3,3,3,28,9,1,1,0,0,83,28,"","Nível 3","Nível 3","-","SINAPI",null,"PEÇAS E ACESSÓRIOS","-",null,1,"-",null,null,0,0,""]
[4,4,4,11,9,1,1,1,0,27,11,"","Nível 4","Nível 4","-","SINAPI",null,"VASO SANITÁRIO E ACESSÓRIOS","-",null,1,"-",null,null,0,0,""]
["S",4,"S",0,9,1,1,1,0,0,0,"","Serviço","Serviço","-","SINAPI",95469,"VASO SANITARIO SIFONADO CONVENCIONAL COM  LOUÇA BRANCA - FORNECIMENTO E INSTALAÇÃO. AF_01/2020","UN",1,1,1,null,null,0,0,""]
["S",4,"S",0,9,1,1,1,0,0,0,"","Serviço","Serviço","-","AGETOP",80517,"VÁLVULA DE DESCARGA DUPLO ACIONAMENTO COM ACABAMENTO CROMADO ANTIVANDALISMO","Un    ",1,1,1,null,null,0,0,""]
["S",4,"S",0,9,1,1,1,0,0,0,"","Serviço","Serviço","-","SINAPI",95471,"VASO SANITARIO SIFONADO CONVENCIONAL PARA PCD SEM FURO FRONTAL COM  LOUÇA BRANCA SEM ASSENTO -  FORNECIMENTO E INSTALAÇÃO. AF_01/2020","UN",1,1,1,null,null,0,0,""]
["S",4,"S",0,9,1,1,1,0,0,0,"","Serviço","Serviço","-","AGETOP",80519,"VÁLVULA DE DESCARGA PARA P.N.E. COM ACABAMENTO CROMADO ANTIVANDALISMO ","un    ",1,1,1,null,null,0,0,""]
["S",4,"S",0,9,1,1,1,0,0,0,"","Serviço","Serviço","-","AGETOP",80520,"CONJUNTO DE FIXACAO P/VASO SANITARIO (PAR)","CJ    ",2,1,2,null,null,0,0,""]
["S",4,"S",0,9,1,1,1,0,0,0,"","Serviço","Serviço","-","AGETOP",80526,"ASSENTO EM POLIPROPILENO COM SISTEMA DE FECHAMENTO SUAVE PARA VASO SANITÁRIO","Un    ",2,1,2,null,null,0,0,""]
["S",4,"S",0,9,1,1,1,0,0,0,"","Serviço","Serviço","-","AGETOP",80513,"TUBO PARA VÁLVULA DE DESCARGA ( CURTO 1.1/4\" )","Un    ",2,1,2,null,null,0,0,""]
["S",4,"S",0,9,1,1,1,0,0,0,"","Serviço","Serviço","-","AGETOP",80514,"TUBO DE LIGACAO PVC CROMADO 1.1/2\" / ESPUDE  - (ENTRADA)","Un    ",2,1,2,null,null,0,0,""]
["S",4,"S",0,9,1,1,1,0,0,0,"","Serviço","Serviço","-","AGETOP",80510,"ANEL DE VEDAÇÃO PARA VASO SANITÁRIO","Un    ",2,1,2,null,null,0,0,""]
["S",4,"S",0,9,1,1,1,0,0,0,"","Serviço","Serviço","-","SINAPI",95544,"PAPELEIRA DE PAREDE EM METAL CROMADO SEM TAMPA, INCLUSO FIXAÇÃO. AF_01/2020","UN",2,1,2,null,null,0,0,""]
[4,4,4,8,9,1,1,2,0,16,8,"","Nível 4","Nível 4","-","SINAPI",null,"LAVATÓRIO E ACESSÓRIOS","-",null,1,"-",null,null,0,0,""]
["S",4,"S",0,9,1,1,2,0,0,0,"","Serviço","Serviço","-","AGETOP",80541,"LAVATÓRIO MÉDIO COM COLUNA","Un    ",1,1,1,null,null,0,0,""]
["S",4,"S",0,9,1,1,2,0,0,0,"","Serviço","Serviço","-","AGETOP",80542,"LAVATÓRIO MÉDIO SEM COLUNA","Un    ",1,1,1,null,null,0,0,""]
["S",4,"S",0,9,1,1,2,0,{"$f":"IF(OR($C212=\"S\",$C212=0),0,MATCH(0,OFFSET($D212,1,$C212,ROW($C$290)-ROW($C212)),0))","v":0},{"$f":"IF(OR($C212=\"S\",$C212=0),0,MATCH(OFFSET($D212,0,$C212)+1,OFFSET($D212,1,$C212,ROW($C$290)-ROW($C212)),0))","v":0},"","Serviço","Serviço","-","AGETOP",80550,"FIXACAO P/LAVATORIO (PAR)","PAR   ",2,1,2,null,null,0,0,""]
["S",4,"S",0,9,1,1,2,0,0,0,"","Serviço","Serviço","-","AGETOP",80555,"LIGAÇÃO FLEXÍVEL METÁLICA DIAM.1/2\"(ENGATE)","Un    ",2,1,2,null,null,0,0,""]
["S",{"$f":"IF(OR(C214=\"s\",C214=0),OFFSET(B214,-1,0),C214)","v":4},{"$f":"IF(OFFSET(C214,-1,0)=\"L\",1,IF(OFFSET(C214,-1,0)=1,2,IF(OR(A214=\"s\",A214=0),\"S\",IF(AND(OFFSET(C214,-1,0)=2,A214=4),3,IF(AND(OR(OFFSET(C214,-1,0)=\"s\",OFFSET(C214,-1,0)=0),A214<>\"s\",A214>OFFSET(B214,-1,0)),OFFSET(B214,-1,0),A214)))))","v":"S"},{"$f":"IF(OR(C214=\"S\",C214=0),0,IF(ISERROR(K214),J214,SMALL(J214:K214,1)))","v":0},{"$f":"IF($C214=1,OFFSET(E214,-1,0)+1,OFFSET(E214,-1,0))","v":9},{"$f":"IF($C214=1,0,IF($C214=2,OFFSET(F214,-1,0)+1,OFFSET(F214,-1,0)))","v":1},{"$f":"IF(AND($C214<=2,$C214<>0),0,IF($C214=3,OFFSET(G214,-1,0)+1,OFFSET(G214,-1,0)))","v":1},{"$f":"IF(AND($C214<=3,$C214<>0),0,IF($C214=4,OFFSET(H214,-1,0)+1,OFFSET(H214,-1,0)))","v":2},{"$f":"IF(AND($C214<=4,$C214<>0),0,IF(AND($C214=\"S\",$Y214>0),OFFSET(I214,-1,0)+1,OFFSET(I214,-1,0)))","v":0},0,0,{"$f":"IF(OR(Y214>0,$C214=1),\"F\",\"\")","v":""},"Serviço",{"$f":"CHOOSE(1+LOG(1+2*(C214=1)+4*(C214=2)+8*(C214=3)+16*(C214=4)+32*(C214=\"S\"),2),\"\",\"Nível 1\",\"Nível 2\",\"Nível 3\",\"Nível 4\",\"Serviço\")","v":"Serviço"},"-","SINAPI",86883,"SIFÃO DO TIPO FLEXÍVEL EM PVC 1  X 1.1/2  - FORNECIMENTO E INSTALAÇÃO. AF_01/2020","UN",2,1,2,null,null,0,0,""]
["S",4,"S",0,9,1,1,2,0,0,0,"","Serviço","Serviço","-","AGETOP",80570,"TORNEIRA DE MESA PARA LAVATÓRIO DIÂMETRO DE 1/2\"","Un    ",2,1,2,null,null,0,0,""]
["S",4,"S",0,9,1,1,2,0,0,0,"","Serviço","Serviço","-","AGETOP",80580,"VALVULA P/LAVATORIO OU BEBEDOURO METALICO DIAMETRO 1\"","Un    ",2,1,2,null,null,0,0,""]
[4,4,4,5,9,1,1,3,0,8,5,"","Nível 4","Nível 4","-","SINAPI",null,"PIA E ACESSÓRIOS","-",null,1,"-",null,null,0,0,""]
["S",4,"S",0,9,1,1,3,0,0,0,"","Serviço","Serviço","-","AGETOP",80660,"TORNEIRA DE PAREDE PARA PIA OU BEBEDOURO DIÂMETRO DE 1/2\" E 3/4\" ","Un    ",1,1,1,null,null,0,0,""]
["S",4,"S",0,9,1,1,3,0,0,0,"","Serviço","Serviço","-","AGETOP",80670,"SIFAO P/PIA 1.1/2\" X 2\" METAL","Un    ",1,1,1,null,null,0,0,""]
["S",4,"S",0,9,1,1,3,0,0,0,"","Serviço","Serviço","-","SINAPI",86878,"VÁLVULA EM METAL CROMADO TIPO AMERICANA 3.1/2\u0094 X 1.1/2\u0094 PARA PIA - FORNECIMENTO E INSTALAÇÃO. AF_01/2020","UN",1,1,1,null,null,0,0,""]
["S",4,"S",0,9,1,1,3,0,0,0,"","Serviço","Serviço","-","AGETOP",80689,"CUBA INOX 50X40X20CM E=0,7MM-AÇO 304","Un    ",1,1,1,null,null,0,0,""]
[4,4,4,3,9,1,1,4,0,3,18,"","Nível 4","Nível 4","-","SINAPI",null,"REGISTROS","-",null,1,"-",null,null,0,0,""]
["S",4,"S",0,9,1,1,4,0,0,0,"","Serviço","Serviço","-","SINAPI",89985,"REGISTRO DE PRESSÃO BRUTO, LATÃO, ROSCÁVEL, 3/4\", COM ACABAMENTO E CANOPLA CROMADOS. FORNECIDO E INSTALADO EM RAMAL DE ÁGUA. AF_12/2014","UN",1,1,1,null,null,0,0,"Referência: AGETOP - 80926"]
["S",4,"S",0,9,1,1,4,0,0,0,"","Serviço","Serviço","-","SINAPI",94492,"REGISTRO DE ESFERA, PVC, SOLDÁVEL, DN  50 MM, INSTALADO EM RESERVAÇÃO DE ÁGUA DE EDIFICAÇÃO QUE POSSUA RESERVATÓRIO DE FIBRA/FIBROCIMENTO   FORNECIMENTO E INSTALAÇÃO. AF_06/2016","UN",2,1,2,null,null,0,0,""]
[3,3,3,29,9,1,2,0,0,55,29,"","Nível 3","Nível 3","-","SINAPI",null,"ÁGUA FRIA","-",null,1,"-",null,null,0,0,""]
[4,4,4,3,9,1,2,1,0,28,3,"","Nível 4","Nível 4","-","SINAPI",null,"TUBOS DE PVC SOLDÁVEL","-",null,1,"-",null,null,0,0,""]
["S",4,"S",0,9,1,2,1,0,0,0,"","Serviço","Serviço","-","AGETOP",81003,"TUBO SOLDAVEL PVC MARROM DIAMETRO 25 mm","M     ",36,1,36,null,null,0,0,""]
["S",4,"S",0,9,1,2,1,0,0,0,"","Serviço","Serviço","-","SINAPI",89449,"TUBO, PVC, SOLDÁVEL, DN 50MM, INSTALADO EM PRUMADA DE ÁGUA - FORNECIMENTO E INSTALAÇÃO. AF_12/2014","M",24,1,24,null,null,0,0,""]
[4,4,4,5,9,1,2,2,0,25,5,"","Nível 4","Nível 4","-","SINAPI",null,"ADAPTADORES DE PVC SOLDÁVEL","-",null,1,"-",null,null,0,0,""]
["S",4,"S",0,9,1,2,2,0,0,0,"","Serviço","Serviço","-","AGETOP",81041,"ADAPTAD.PVC SOLD.LONGO C/FLANGES LIVRES P/CX.DAGUA 25X3/4\"","Un    ",2,1,2,null,null,0,0,""]
["S",4,"S",0,9,1,2,2,0,0,0,"","Serviço","Serviço","-","SINAPI",89429,"ADAPTADOR CURTO COM BOLSA E ROSCA PARA REGISTRO, PVC, SOLDÁVEL, DN 25MM X 3/4\u0094, INSTALADO EM RAMAL DE DISTRIBUIÇÃO DE ÁGUA - FORNECIMENTO E INSTALAÇÃO. AF_12/2014","UN",4,1,4,null,null,0,0,"Referência: AGETOP - 81066"]
["S",4,"S",0,9,1,2,2,0,0,0,"","Serviço","Serviço","-","AGETOP",81043,"ADAPTAD.PVC SOLD.LONGO C/FLANGES LIVRES P/ CX.DAGUA 50X1.1/2","Un    ",2,1,2,null,null,0,0,""]
["S",4,"S",0,9,1,2,2,0,0,0,"","Serviço","Serviço","-","SINAPI",94662,"ADAPTADOR CURTO COM BOLSA E ROSCA PARA REGISTRO, PVC, SOLDÁVEL, DN 50 MM X 1 1/2 , INSTALADO EM RESERVAÇÃO DE ÁGUA DE EDIFICAÇÃO QUE POSSUA RESERVATÓRIO DE FIBRA/FIBROCIMENTO   FORNECIMENTO E INSTALAÇÃO. AF_06/2016","UN",6,1,6,null,null,0,0,"Referência: AGETOP - 81069"]
[4,4,4,4,9,1,2,3,0,20,4,"","Nível 4","Nível 4","-","SINAPI",null,"LUVAS DE PVC","-",null,1,"-",null,null,0,0,""]
["S",4,"S",0,9,1,2,3,0,0,0,"","Serviço","Serviço","-","SINAPI",89528,"LUVA, PVC, SOLDÁVEL, DN 25MM, INSTALADO EM PRUMADA DE ÁGUA - FORNECIMENTO E INSTALAÇÃO. AF_12/2014","UN",2,1,2,null,null,0,0,""]
["S",4,"S",0,9,1,2,3,0,0,0,"","Serviço","Serviço","-","SINAPI",89558,"LUVA, PVC, SOLDÁVEL, DN 40MM, INSTALADO EM PRUMADA DE ÁGUA - FORNECIMENTO E INSTALAÇÃO. AF_12/2014","UN",3,1,3,null,null,0,0,""]
["S",4,"S",0,9,1,2,3,0,0,0,"","Serviço","Serviço","-","AGETOP",81105,"LUVA SOLDAVEL DIAMETRO 50 mm","Un    ",3,1,3,null,null,0,0,""]
[4,4,4,2,9,1,2,4,0,16,2,"","Nível 4","Nível 4","-","SINAPI",null,"BUCHAS","-",null,1,"-",null,null,0,0,""]
[{"$f":"CHOOSE(1+LOG(1+2*(ORÇAMENTO.Nivel=\"Nível 1\")+4*(ORÇAMENTO.Nivel=\"Nível 2\")+8*(ORÇAMENTO.Nivel=\"Nível 3\")+16*(ORÇAMENTO.Nivel=\"Nível 4\")+32*(ORÇAMENTO.Nivel=\"Serviço\"),2),0,1,2,3,4,\"S\")","v":"S"},4,"S",0,9,1,2,4,0,0,0,"","Serviço","Serviço","-","SINAPI",89579,"LUVA DE REDUÇÃO, PVC, SOLDÁVEL, DN 50MM X 25MM, INSTALADO EM PRUMADA DE ÁGUA   FORNECIMENTO E INSTALAÇÃO. AF_12/2014","UN",2,1,2,null,null,0,0,""]
[4,4,4,4,9,1,2,5,0,14,4,"","Nível 4","Nível 4","-","SINAPI",null,"JOELHO","-",null,1,"-",null,null,0,0,""]
["S",4,"S",0,9,1,2,5,0,0,0,"","Serviço","Serviço","-","SINAPI",89481,"JOELHO 90 GRAUS, PVC, SOLDÁVEL, DN 25MM, INSTALADO EM PRUMADA DE ÁGUA - FORNECIMENTO E INSTALAÇÃO. AF_12/2014","UN",20,1,20,null,null,0,0,""]
["S",4,"S",0,9,1,2,5,0,0,0,"","Serviço","Serviço","-","SINAPI",89501,"JOELHO 90 GRAUS, PVC, SOLDÁVEL, DN 50MM, INSTALADO EM PRUMADA DE ÁGUA - FORNECIMENTO E INSTALAÇÃO. AF_12/2014","UN",6,1,6,null,null,0,0,""]
["S",4,"S",0,9,1,2,5,0,0,0,"","Serviço","Serviço","-","AGETOP",81380,"JOELHO 90 GRAUS C/ROSCA E BUCHA LATAO DIAM.1/2\"","Un    ",3,1,3,null,null,0,0,""]
[4,4,4,4,9,1,2,6,0,10,4,"","Nível 4","Nível 4","-","SINAPI",null,"TÊ","-",null,1,"-",null,null,0,0,""]
["S",4,"S",0,9,1,2,6,0,0,0,"","Serviço","Serviço","-","SINAPI",89625,"TE, PVC, SOLDÁVEL, DN 50MM, INSTALADO EM PRUMADA DE ÁGUA - FORNECIMENTO E INSTALAÇÃO. AF_12/2014","UN",3,1,3,null,null,0,0,""]
["S",4,"S",0,9,1,2,6,0,0,0,"","Serviço","Serviço","-","SINAPI",89627,"TÊ DE REDUÇÃO, PVC, SOLDÁVEL, DN 50MM X 25MM, INSTALADO EM PRUMADA DE ÁGUA - FORNECIMENTO E INSTALAÇÃO. AF_12/2014","UN",2,1,2,null,null,0,0,""]
["S",4,"S",0,9,1,2,6,0,0,0,"","Serviço","Serviço","-","AGETOP",81445,"TE RED.SOLD.90GR.BUC.LATAO BOLSA CENT.25X25X1/2\"","Un    ",3,1,3,null,null,0,0,""]
[4,4,4,3,9,1,2,7,0,6,3,"","Nível 4","Nível 4","-","SINAPI",null,"UNIÃO","-",null,1,"-",null,null,0,0,""]
["S",4,"S",0,9,1,2,7,0,0,0,"","Serviço","Serviço","-","AGETOP",81462,"UNIAO SOLDAVEL DIAMETRO 25 mm","Un    ",3,1,3,null,null,0,0,""]
["S",4,"S",0,9,1,2,7,0,0,0,"","Serviço","Serviço","-","SINAPI",89594,"UNIÃO, PVC, SOLDÁVEL, DN 50MM, INSTALADO EM PRUMADA DE ÁGUA - FORNECIMENTO E INSTALAÇÃO. AF_12/2014","UN",2,1,2,null,null,0,0,""]
[4,4,4,3,9,1,2,8,0,3,{"$error":"#N/A"},"","Nível 4","Nível 4","-","SINAPI",null,"ADESIVOS","-",null,1,"-",null,null,0,0,""]
["S",4,"S",0,9,1,2,8,0,0,0,"","Serviço","Serviço","-","AGETOP",81501,"ADESIVO PLASTICO - FRASCO 850 G","Un    ",2,1,2,null,null,0,0,""]
["S",4,"S",0,9,1,2,8,0,0,0,"","Serviço","Serviço","-","AGETOP",81504,"SOLUCAO LIMPADORA 1000 CM3","Un    ",2,1,2,null,null,0,0,""]
[3,3,3,19,9,1,3,0,0,26,19,"","Nível 3","Nível 3","-","SINAPI",null,"ESGOTO SANITÁRIO","-",null,1,"-",null,null,0,0,""]
[4,4,4,3,9,1,3,1,0,18,3,"","Nível 4","Nível 4","-","SINAPI",null,"CORPO DE CAIXA SIFONADA / RALO","-",null,1,"-",null,null,0,0,""]
["S",4,"S",0,9,1,3,1,0,0,0,"","Serviço","Serviço","-","AGETOP",81663,"CORPO CX. SIFONADA DIAM. 150 X 150 X 50","Un    ",2,1,2,null,null,0,0,""]
["S",4,"S",0,9,1,3,1,0,0,0,"","Serviço","Serviço","-","AGETOP",81666,"CORPO CX. SIFONADA DIAM. 250 X 230 X 75","Un    ",1,1,1,null,null,0,0,""]
[4,4,4,6,9,1,3,2,0,15,6,"","Nível 4","Nível 4","-","SINAPI",null,"JOELHOS","-",null,1,"-",null,null,0,0,""]
["S",4,"S",0,9,1,3,2,0,0,0,"","Serviço","Serviço","-","SINAPI",89726,"JOELHO 45 GRAUS, PVC, SERIE NORMAL, ESGOTO PREDIAL, DN 40 MM, JUNTA SOLDÁVEL, FORNECIDO E INSTALADO EM RAMAL DE DESCARGA OU RAMAL DE ESGOTO SANITÁRIO. AF_12/2014","UN",2,1,2,null,null,0,0,""]
["S",4,"S",0,9,1,3,2,0,0,0,"","Serviço","Serviço","-","SINAPI",89802,"JOELHO 45 GRAUS, PVC, SERIE NORMAL, ESGOTO PREDIAL, DN 50 MM, JUNTA ELÁSTICA, FORNECIDO E INSTALADO EM PRUMADA DE ESGOTO SANITÁRIO OU VENTILAÇÃO. AF_12/2014","UN",2,1,2,null,null,0,0,""]
["S",4,"S",0,9,1,3,2,0,0,0,"","Serviço","Serviço","-","SINAPI",89810,"JOELHO 45 GRAUS, PVC, SERIE NORMAL, ESGOTO PREDIAL, DN 100 MM, JUNTA ELÁSTICA, FORNECIDO E INSTALADO EM PRUMADA DE ESGOTO SANITÁRIO OU VENTILAÇÃO. AF_12/2014","UN",2,1,2,null,null,0,0,""]
["S",4,"S",0,9,1,3,2,0,0,0,"","Serviço","Serviço","-","SINAPI",89731,"JOELHO 90 GRAUS, PVC, SERIE NORMAL, ESGOTO PREDIAL, DN 50 MM, JUNTA ELÁSTICA, FORNECIDO E INSTALADO EM RAMAL DE DESCARGA OU RAMAL DE ESGOTO SANITÁRIO. AF_12/2014","UN",5,1,5,null,null,0,0,""]
["S",4,"S",0,9,1,3,2,0,0,0,"","Serviço","Serviço","-","SINAPI",89584,"JOELHO 90 GRAUS, PVC, SERIE R, ÁGUA PLUVIAL, DN 100 MM, JUNTA ELÁSTICA, FORNECIDO E INSTALADO EM CONDUTORES VERTICAIS DE ÁGUAS PLUVIAIS. AF_12/2014","UN",2,1,2,null,null,0,0,""]
[4,4,4,2,9,1,3,3,0,9,2,"","Nível 4","Nível 4","-","SINAPI",null,"JUNÇÕES","-",null,1,"-",null,null,0,0,""]
["S",4,"S",0,9,1,3,3,0,0,0,"","Serviço","Serviço","-","AGETOP",81973,"JUNCAO SIMPLES DIAM. 100 X 50 MM","Un    ",3,1,3,null,null,0,0,""]
[4,4,4,2,9,1,3,4,0,7,2,"","Nível 4","Nível 4","-","SINAPI",null,"TÊ","-",null,1,"-",null,null,0,0,""]
["S",4,"S",0,9,1,3,4,0,0,0,"","Serviço","Serviço","-","SINAPI",89825,"TE, PVC, SERIE NORMAL, ESGOTO PREDIAL, DN 50 X 50 MM, JUNTA ELÁSTICA, FORNECIDO E INSTALADO EM PRUMADA DE ESGOTO SANITÁRIO OU VENTILAÇÃO. AF_12/2014","UN",2,1,2,null,null,0,0,""]
[4,4,4,5,9,1,3,5,0,5,{"$error":"#N/A"},"","Nível 4","Nível 4","-","SINAPI",null,"TUBOS","-",null,1,"-",null,null,0,0,""]
["S",4,"S",0,9,1,3,5,0,0,0,"","Serviço","Serviço","-","AGETOP",82301,"TUBO SOLD.P/ESGOTO DIAM. 40 MM","m     ",12,1,12,null,null,0,0,""]
["S",4,"S",0,9,1,3,5,0,0,0,"","Serviço","Serviço","-","SINAPI",89798,"TUBO PVC, SERIE NORMAL, ESGOTO PREDIAL, DN 50 MM, FORNECIDO E INSTALADO EM PRUMADA DE ESGOTO SANITÁRIO OU VENTILAÇÃO. AF_12/2014","M",18,1,18,null,null,0,0,""]
[{"$f":"CHOOSE(1+LOG(1+2*(ORÇAMENTO.Nivel=\"Nível 1\")+4*(ORÇAMENTO.Nivel=\"Nível 2\")+8*(ORÇAMENTO.Nivel=\"Nível 3\")+16*(ORÇAMENTO.Nivel=\"Nível 4\")+32*(ORÇAMENTO.Nivel=\"Serviço\"),2),0,1,2,3,4,\"S\")","v":"S"},4,"S",0,9,1,3,5,0,0,0,"","Serviço","Serviço","-","SINAPI",89799,"TUBO PVC, SERIE NORMAL, ESGOTO PREDIAL, DN 75 MM, FORNECIDO E INSTALADO EM PRUMADA DE ESGOTO SANITÁRIO OU VENTILAÇÃO. AF_12/2014","M",12,1,12,null,null,0,0,""]
["S",4,"S",0,9,1,3,5,0,0,0,"","Serviço","Serviço","-","SINAPI",89800,"TUBO PVC, SERIE NORMAL, ESGOTO PREDIAL, DN 100 MM, FORNECIDO E INSTALADO EM PRUMADA DE ESGOTO SANITÁRIO OU VENTILAÇÃO. AF_12/2014","M",18,1,18,null,null,0,0,""]
[3,3,3,7,9,1,4,0,0,7,{"$error":"#N/A"},"","Nível 3","Nível 3","-","SINAPI",null,"EXTRAS","-",null,1,"-",null,null,0,0,""]
["S",3,"S",0,9,1,4,0,0,0,0,"","Serviço","Serviço","-","AGETOP",81811,"HIDROMETRO DIAM.RAMAL = 25 MM VAZAO =1,5  A 3 M3","Un    ",1,1,1,null,null,0,0,""]
["S",3,"S",0,9,1,4,0,0,0,0,"","Serviço","Serviço","-","AGETOP",81815,"KIT CAVALETE D=25MM P/HIDRÔMETRO 1,5-3,0-5,0 M3/MURETA/CAIXA","Un    ",1,1,1,null,null,0,0,""]
["S",3,"S",0,9,1,4,0,0,{"$f":"IF(OR($C276=\"S\",$C276=0),0,MATCH(0,OFFSET($D276,1,$C276,ROW($C$290)-ROW($C276)),0))","v":0},{"$f":"IF(OR($C276=\"S\",$C276=0),0,MATCH(OFFSET($D276,0,$C276)+1,OFFSET($D276,1,$C276,ROW($C$290)-ROW($C276)),0))","v":0},"","Serviço","Serviço","-","AGETOP",81825,"CAIXA DE PASSAGEM 60 X 60 CM SEM TAMPA","Un    ",2,1,2,null,null,0,0,""]
["S",3,"S",0,9,1,4,0,0,0,0,"","Serviço","Serviço","-","AGETOP",81826,"TAMPA EM CONCRETO ARMADO 25 MPA E=5CM PARA A CAIXA DE PASSAGEM 60X60CM","Un    ",2,1,2,null,null,0,0,""]
["S",{"$f":"IF(OR(C278=\"s\",C278=0),OFFSET(B278,-1,0),C278)","v":3},{"$f":"IF(OFFSET(C278,-1,0)=\"L\",1,IF(OFFSET(C278,-1,0)=1,2,IF(OR(A278=\"s\",A278=0),\"S\",IF(AND(OFFSET(C278,-1,0)=2,A278=4),3,IF(AND(OR(OFFSET(C278,-1,0)=\"s\",OFFSET(C278,-1,0)=0),A278<>\"s\",A278>OFFSET(B278,-1,0)),OFFSET(B278,-1,0),A278)))))","v":"S"},{"$f":"IF(OR(C278=\"S\",C278=0),0,IF(ISERROR(K278),J278,SMALL(J278:K278,1)))","v":0},{"$f":"IF($C278=1,OFFSET(E278,-1,0)+1,OFFSET(E278,-1,0))","v":9},{"$f":"IF($C278=1,0,IF($C278=2,OFFSET(F278,-1,0)+1,OFFSET(F278,-1,0)))","v":1},{"$f":"IF(AND($C278<=2,$C278<>0),0,IF($C278=3,OFFSET(G278,-1,0)+1,OFFSET(G278,-1,0)))","v":4},{"$f":"IF(AND($C278<=3,$C278<>0),0,IF($C278=4,OFFSET(H278,-1,0)+1,OFFSET(H278,-1,0)))","v":0},{"$f":"IF(AND($C278<=4,$C278<>0),0,IF(AND($C278=\"S\",$Y278>0),OFFSET(I278,-1,0)+1,OFFSET(I278,-1,0)))","v":0},0,0,{"$f":"IF(OR(Y278>0,$C278=1),\"F\",\"\")","v":""},"Serviço",{"$f":"CHOOSE(1+LOG(1+2*(C278=1)+4*(C278=2)+8*(C278=3)+16*(C278=4)+32*(C278=\"S\"),2),\"\",\"Nível 1\",\"Nível 2\",\"Nível 3\",\"Nível 4\",\"Serviço\")","v":"Serviço"},"-","AGETOP",81861,"CAIXA DAGUA POLIETILENO 1000 LTS. C/TAMPA","Un    ",1,1,1,null,null,0,0,""]
["S",3,"S",0,9,1,4,0,0,0,0,"","Serviço","Serviço","-","SINAPI",94797,"TORNEIRA DE BOIA, ROSCÁVEL, 1\u0094, FORNECIDA E INSTALADA EM RESERVAÇÃO DE ÁGUA. AF_06/2016","UN",1,1,1,null,null,0,0,""]
[1,1,1,7,10,0,0,0,0,10,7,"F","Nível 1","Nível 1","10.","AGETOP",null,"PROJETO DE PREVENÇÃO E COMBATE A INCÊNDIO","UN",1,1,1,null,null,0,0,""]
[2,2,2,6,10,1,0,0,0,6,{"$error":"#N/A"},"","Nível 2","Nível 2","-","AGETOP",null,"INSTALAÇÕES ESPECIAIS","-",null,1,"-",null,null,0,0,""]
["S",2,"S",0,10,1,0,0,0,0,0,"","Serviço","Serviço","-","AGETOP",85006,"EXTINTOR MULTI USO EM PO A B C (6 KG) - CAPACIDADE EXTINTORA 3A 20BC","un    ",2,1,2,null,null,0,0,""]
["S",2,"S",0,10,1,0,0,0,0,0,"","Serviço","Serviço","-","SINAPI",97599,"LUMINÁRIA DE EMERGÊNCIA, COM 30 LÂMPADAS LED DE 2 W, SEM REATOR - FORNECIMENTO E INSTALAÇÃO. AF_02/2020","UN",5,1,5,null,null,0,0,""]
["S",2,"S",0,10,1,0,0,0,0,0,"","Serviço","Serviço","-","COMPOSIÇÃO","COMP 024_SEE","SINALIZADOR FOTOLUMINESCENTE PARA EXTINTOR","UN ",2,1,2,null,null,0,0,""]
["S",2,"S",0,10,1,0,0,0,0,0,"","Serviço","Serviço","-","COMPOSIÇÃO","COMP 025_SEE","SINALIZADOR FOTOLUMINESCENTE DE EMERGÊNCIA","UN ",7,1,7,null,null,0,0,""]
["S",2,"S",0,10,1,0,0,0,0,0,"","Serviço","Serviço","-","COMPOSIÇÃO","COMP 277_SEE","MARCAÇÃO NO PISO - 1X1 M PARA EXTINTOR","M2",2,1,2,null,null,0,0,""]
[1,1,1,3,11,0,0,0,0,3,{"$error":"#N/A"},"F","Nível 1","Nível 1","11.","SINAPI",null,"PROJETO ESTRUTURAS METÁLICAS","UN",1,1,1,null,null,0,0,""]
[2,2,2,2,11,1,0,0,0,2,{"$error":"#N/A"},"","Nível 2","Nível 2","-","SINAPI",null,"ESTRUTURAS METÁLICAS","-",null,1,"-",null,null,0,0,""]
["S",2,"S",0,11,1,0,0,0,0,0,"","Serviço","Serviço","-","AGETOP",150204,"ESTRUTURA METÁLICA CONVENCIONAL EM AÇO DO TIPO MR-250 / ASTM A36 COM FUNDO ANTICORROSIVO","Kg    ",1663.67,1,1663.67,null,null,0,0,""]
[-1,null,-1,null,0,0,0,0,0,null,null,"F"]
[null,null,null,null,null,null,null,null,null,null,null,"F",null,null,null,null,null,"OBS: OS QUANTITATIVOS DE MATERIAIS  DAS INSTALAÇÕES HIDROSSANITÁRIAS, ELÉTRICAS E ESPECIAIS SÃO FORNECIDOS PELOS PROFISSIONAIS RESPONSÁVEIS PELOS RESPECTIVOS PROJETOS.",null,null,null,null,"VALOR TOTAL",null,null,0]
[null,null,null,null,null,null,null,null,null,null,null,"F",null,null,null,null,null,null,null,null,null,null,"VALOR BDI (26,40%)",null,null,0]
[null,null,null,null,null,null,null,null,null,null,null,"F",null,null,null,null,null,null,null,null,null,null,"TOTAL ORÇAMENTO",null,null,0]
[null,null,null,null,null,null,null,null,null,null,null,"F"]
[null,null,null,null,null,null,null,null,null,null,null,"F",null,null,null,null,null,null,null,null,null,null,"CUSTO POR M2 ³",null,null,0]
[null,null,null,null,null,null,null,null,null,null,null,"F",null,null,null,null,null,null,null,null,null,null,"MATERIAL S/ BDI",null,null,0]
[null,null,null,null,null,null,null,null,null,null,null,"F",null,null,null,null,null,null,null,null,null,null,"MÃO DE OBRA S/ BDI",null,null,0]
[null,null,null,null,null,null,null,null,null,null,null,"F"]
[null,null,null,null,null,null,null,null,null,null,null,"F",null,null,null,null,"(1) Conforme previsto pelo DECRETO Nº 7.983, DE 8 DE ABRIL DE 2013, os preços adotados são aqueles constantes dos sistemas de referência indicados. Justifica-se o uso dos preços destas composições de custos unitários devido ao seu valor ser menor à mediana de seus correspondentes na tabela SINAPI;"]
[null,null,null,null,null,null,null,null,null,null,null,"F",null,null,null,null,"(2) Optou-se pelo uso das composições de custos da AGETOP para itens não presentes na SINAPI;"]
[null,null,null,null,null,null,null,null,null,null,null,"F",null,null,null,null,"(3) Para itens da AGETOP, os vidros não estão inclusos nas esquadrias e já foram considerados os custos de contramarco para as esquadrias de alumínio;"]
[null,null,null,null,null,null,null,null,null,null,null,"F",null,null,null,null,"(4) Nos casos em que houver execução de granitina e omissão do item AGETOP 221102, considerou-se que o quantitativo para o rodapé, de altura igual a 7cm, foi incorporado na área de piso;"]
[null,null,null,null,null,null,null,null,null,null,null,"F",null,null,null,null,"(5) O custo unitário aproximado por metro quadrado é calculado dividindo-se o valor total do orçamento pela área total de construção."]
[null,null,null,null,null,null,null,null,null,null,null,"F"]
[null,null,null,null,null,null,null,null,null,null,null,"F"]
[]
[null,null,null,null,null,null,null,null,null,null,null,null,null,null,"SOMATÓRIO DE SERVIÇOS"]
[null,null,null,null,null,null,null,null,null,null,null,null,null,null,"ITEM","DESCRIÇÃO DOS SERVIÇOS",null,null,"PREÇO SEM BDI",null,null,null,null,"PREÇO COM BDI",null,null,"PARTICIPAÇÃO ( % )"]
[null,null,null,null,null,null,null,null,null,null,null,null,null,null,"a.","SERVIÇOS PRELIMINARES",null,null,{"$f":"SUMIF($R$19:$R$290,$P309,$Z$19:$Z$290)","v":0},null,null,null,null,{"$f":"ROUND(S309*(1+BDI.Taxa),2)","v":0},null,null,{"$f":"IFERROR(ROUND($X309*100/$Z$293,2),0)","v":0}]
[null,null,null,null,null,null,null,null,null,null,null,null,null,null,"b.","TRANSPORTES",null,null,0,null,null,null,null,0,null,null,0]
[null,null,null,null,null,null,null,null,null,null,null,null,null,null,"c.","SERVIÇO EM TERRA",null,null,0,null,null,null,null,0,null,null,0]
[null,null,null,null,null,null,null,null,null,null,null,null,null,null,"d.","FUNDAÇÕES E SONDAGENS",null,null,0,null,null,null,null,0,null,null,0]
[null,null,null,null,null,null,null,null,null,null,null,null,null,null,"e.","ESTRUTURA",null,null,0,null,null,null,null,0,null,null,0]
[null,null,null,null,null,null,null,null,null,null,null,null,null,null,"f.","INSTALAÇÕES ELÉTRICAS",null,null,0,null,null,null,null,0,null,null,0]
[null,null,null,null,null,null,null,null,null,null,null,null,null,null,"g.","INSTALAÇÕES HIDROSSANITÁRIAS",null,null,0,null,null,null,null,0,null,null,0]
[null,null,null,null,null,null,null,null,null,null,null,null,null,null,"h","INSTALAÇÕES ESPECIAIS",null,null,0,null,null,null,null,0,null,null,0]
[null,null,null,null,null,null,null,null,null,null,null,null,null,null,"i.","ALVENARIAS E DIVISÓRIAS",null,null,0,null,null,null,null,0,null,null,0]
[null,null,null,null,null,null,null,null,null,null,null,null,null,null,"j.","ALVENARIA AUTO-PORTANTE",null,null,0,null,null,null,null,0,null,null,0]
[null,null,null,null,null,null,null,null,null,null,null,null,null,null,"k.","IMPERMEABILIZAÇÃO",null,null,0,null,null,null,null,0,null,null,0]
[null,null,null,null,null,null,null,null,null,null,null,null,null,null,"l.","ISOLAMENTO TÉRMICO E ACÚSTICO",null,null,0,null,null,null,null,0,null,null,0]
[null,null,null,null,null,null,null,null,null,null,null,null,null,null,"m.","ESTRUTURA DE MADEIRA",null,null,0,null,null,null,null,0,null,null,0]
[null,null,null,null,null,null,null,null,null,null,null,null,null,null,"n.","ESTRUTURAS METÁLICAS",null,null,0,null,null,null,null,0,null,null,0]
[null,null,null,null,null,null,null,null,null,null,null,null,null,null,"o.","COBERTURAS",null,null,0,null,null,null,null,0,null,null,0]
[null,null,null,null,null,null,null,null,null,null,null,null,null,null,"p.","ESQUADRIAS DE MADEIRA",null,null,0,null,null,null,null,0,null,null,0]
[null,null,null,null,null,null,null,null,null,null,null,null,null,null,"q.","ESQUADRIAS METÁLICAS",null,null,0,null,null,null,null,{"$f":"ROUND(S325*(1+BDI.Taxa),2)","v":0},null,null,0]
[null,null,null,null,null,null,null,null,null,null,null,null,null,null,"r.","VIDROS",null,null,0,null,null,null,null,0,null,null,0]
[null,null,null,null,null,null,null,null,null,null,null,null,null,null,"s.","REVESTIMENTO DE PAREDE",null,null,0,null,null,null,null,0,null,null,0]
[null,null,null,null,null,null,null,null,null,null,null,null,null,null,"t.","FORROS",null,null,0,null,null,null,null,0,null,null,0]
[null,null,null,null,null,null,null,null,null,null,null,null,null,null,"u.","REVESTIMENTO DE PISO",null,null,0,null,null,null,null,0,null,null,0]
[null,null,null,null,null,null,null,null,null,null,null,null,null,null,"v.","FERRAGENS",null,null,0,null,null,null,null,0,null,null,0]
[null,null,null,null,null,null,null,null,null,null,null,null,null,null,"w.","MARCENARIA",null,null,0,null,null,null,null,0,null,null,0]
[null,null,null,null,null,null,null,null,null,null,null,null,null,null,"x.","ADMINISTRAÇÃO",null,null,0,null,null,null,null,0,null,null,0]
[null,null,null,null,null,null,null,null,null,null,null,null,null,null,"y.","PINTURA",null,null,0,null,null,null,null,{"$f":"ROUND(S333*(1+BDI.Taxa),2)","v":0},null,null,0]
[null,null,null,null,null,null,null,null,null,null,null,null,null,null,"z.","DIVERSOS",null,null,0,null,null,null,null,{"$f":"IF(S334>0,IF((SUM(X309:Y333)+ROUND(S334*(1+BDI.Taxa),2))<>X336,X336-SUM(X309:Y333),ROUND(S334*(1+BDI.Taxa),2)),0)","v":0},null,null,{"$f":"IF(S334>0,IF((SUM(AA309:AA333)+IFERROR(ROUND($X334*100/$Z$293,2),0))<>AA336,AA336-SUM(AA309:AA333),IFERROR(ROUND($X334*100/$Z$293,2),0)),0)","v":0}]
[null,null,null,null,null,null,null,null,null,null,null,null,null,null,"TOTAL GERAL DO ORÇAMENTO (R$)",null,null,null,{"$f":"SUM(S309:W334)","v":0},null,null,null,null,{"$f":"SUM(X309:Y334)","v":0},null,null,{"$f":"SUM(AA309:AA334)","v":0}]
[null,null,null,null,null,null,null,null,null,null,null,null,null,null,null,null,null,null,{"$f":"$Z$291","v":0},null,null,null,null,{"$f":"$Z$293","v":0},null,null,100]
[null,null,null,null,null,null,null,null,null,null,null,null,null,null,null,null,null,null,"(TOTAL SEM BDI)",null,null,null,null,"(TOTAL COM BDI)",null,null,"(ARRED porcentagem)"]
[null,null,null,null,null,null,null,null,null,null,null,null,null,null,null,null,null,null,{"$f":"IF(AND(S335=S336,S335>0),\"OK\",\"ERRO\")","v":"ERRO"},null,null,null,null,{"$f":"IF(AND(X335=X336,X335>0),\"OK\",\"ERRO\")","v":"ERRO"},null,null,{"$f":"IF(AA335=100,\"OK\",\"ERRO\")","v":"ERRO"}]
[]
[]
[null,null,null,null,null,null,null,null,null,null,null,null,null,null,"RESUMO GERAL DO ORÇAMENTO"]
[null,null,null,null,null,null,null,null,null,null,null,null,null,null,"ITEM","DESCRIÇÃO DOS SERVIÇOS",null,null,"PREÇO SEM BDI",null,null,null,null,"PREÇO COM BDI",null,null,"PARTICIPAÇÃO ( % )"]
[null,null,null,null,null,null,null,null,null,null,null,null,null,null,"1.",{"$f":"IFERROR(VLOOKUP(O343,$O$19:$Y$290,4,FALSE),\"\")","v":"NOVO BLOCO ADMINISTRATIVO"},null,null,{"$f":"IF(P344=\"\",$S$364-SUM(OFFSET($S$342:S342,0,0,COUNTA($S$342:S342),1)),SUMIF($R$19:$R$290,$P343,$Z$19:$Z$290))","v":0},null,null,null,null,{"$f":"IF(P344=\"\",$X$364-SUM(OFFSET($X$342:X342,0,0,COUNTA($X$342:X342),1)),ROUND(S343*(1+BDI.Taxa),2))","v":0},null,null,{"$f":"IF(P344=\"\",$AA$364-SUM(OFFSET($AA$342:AA342,0,0,COUNTA($AA$342:AA342),1)),ROUND(X343*100/ORÇAMENTO.TotalOrçamento,2))","v":{"$error":"#DIV/0!"}}]
[null,null,null,null,null,null,null,null,null,null,null,null,null,null,"2.","IMPLANTAÇÃO BLOCO ADMINISTRATIVO",null,null,{"$f":"IF(P345=\"\",$S$364-SUM(OFFSET($S$342:S343,0,0,COUNTA($S$342:S343),1)),SUMIF($R$19:$R$290,$P344,$Z$19:$Z$290))","v":0},null,null,null,null,{"$f":"IF(P345=\"\",$X$364-SUM(OFFSET($X$342:X343,0,0,COUNTA($X$342:X343),1)),ROUND(S344*(1+BDI.Taxa),2))","v":0},null,null,{"$f":"IF(P345=\"\",$AA$364-SUM(OFFSET($AA$342:AA343,0,0,COUNTA($AA$342:AA343),1)),ROUND(X344*100/ORÇAMENTO.TotalOrçamento,2))","v":{"$error":"#DIV/0!"}}]
[null,null,null,null,null,null,null,null,null,null,null,null,null,null,"3.","RAMPA DE ACESSO",null,null,{"$f":"IF(P346=\"\",$S$364-SUM(OFFSET($S$342:S344,0,0,COUNTA($S$342:S344),1)),SUMIF($R$19:$R$290,$P345,$Z$19:$Z$290))","v":0},null,null,null,null,{"$f":"IF(P346=\"\",$X$364-SUM(OFFSET($X$342:X344,0,0,COUNTA($X$342:X344),1)),ROUND(S345*(1+BDI.Taxa),2))","v":0},null,null,{"$f":"IF(P346=\"\",$AA$364-SUM(OFFSET($AA$342:AA344,0,0,COUNTA($AA$342:AA344),1)),ROUND(X345*100/ORÇAMENTO.TotalOrçamento,2))","v":{"$error":"#DIV/0!"}}]
[null,null,null,null,null,null,null,null,null,null,null,null,null,null,"4.","PORTÃO PEDESTRES",null,null,{"$f":"IF(P347=\"\",$S$364-SUM(OFFSET($S$342:S345,0,0,COUNTA($S$342:S345),1)),SUMIF($R$19:$R$290,$P346,$Z$19:$Z$290))","v":0},null,null,null,null,{"$f":"IF(P347=\"\",$X$364-SUM(OFFSET($X$342:X345,0,0,COUNTA($X$342:X345),1)),ROUND(S346*(1+BDI.Taxa),2))","v":0},null,null,{"$f":"IF(P347=\"\",$AA$364-SUM(OFFSET($AA$342:AA345,0,0,COUNTA($AA$342:AA345),1)),ROUND(X346*100/ORÇAMENTO.TotalOrçamento,2))","v":{"$error":"#DIV/0!"}}]
[null,null,null,null,null,null,null,null,null,null,null,null,null,null,"5.","ADMINISTRAÇÃO LOCAL",null,null,{"$f":"IF(P348=\"\",$S$364-SUM(OFFSET($S$342:S346,0,0,COUNTA($S$342:S346),1)),SUMIF($R$19:$R$290,$P347,$Z$19:$Z$290))","v":0},null,null,null,null,{"$f":"IF(P348=\"\",$X$364-SUM(OFFSET($X$342:X346,0,0,COUNTA($X$342:X346),1)),ROUND(S347*(1+BDI.Taxa),2))","v":0},null,null,{"$f":"IF(P348=\"\",$AA$364-SUM(OFFSET($AA$342:AA346,0,0,COUNTA($AA$342:AA346),1)),ROUND(X347*100/ORÇAMENTO.TotalOrçamento,2))","v":{"$error":"#DIV/0!"}}]
[null,null,null,null,null,null,null,null,null,null,null,null,null,null,"6.","OBRA",null,null,{"$f":"IF(P349=\"\",$S$364-SUM(OFFSET($S$342:S347,0,0,COUNTA($S$342:S347),1)),SUMIF($R$19:$R$290,$P348,$Z$19:$Z$290))","v":0},null,null,null,null,{"$f":"IF(P349=\"\",$X$364-SUM(OFFSET($X$342:X347,0,0,COUNTA($X$342:X347),1)),ROUND(S348*(1+BDI.Taxa),2))","v":0},null,null,{"$f":"IF(P349=\"\",$AA$364-SUM(OFFSET($AA$342:AA347,0,0,COUNTA($AA$342:AA347),1)),ROUND(X348*100/ORÇAMENTO.TotalOrçamento,2))","v":{"$error":"#DIV/0!"}}]
[null,null,null,null,null,null,null,null,null,null,null,null,null,null,"7.","PROJETO ELÉTRICO",null,null,{"$f":"IF(P350=\"\",$S$364-SUM(OFFSET($S$342:S348,0,0,COUNTA($S$342:S348),1)),SUMIF($R$19:$R$290,$P349,$Z$19:$Z$290))","v":0},null,null,null,null,{"$f":"IF(P350=\"\",$X$364-SUM(OFFSET($X$342:X348,0,0,COUNTA($X$342:X348),1)),ROUND(S349*(1+BDI.Taxa),2))","v":0},null,null,{"$f":"IF(P350=\"\",$AA$364-SUM(OFFSET($AA$342:AA348,0,0,COUNTA($AA$342:AA348),1)),ROUND(X349*100/ORÇAMENTO.TotalOrçamento,2))","v":{"$error":"#DIV/0!"}}]
[null,null,null,null,null,null,null,null,null,null,null,null,null,null,"8.","PROJETO ESTRUTURAL",null,null,{"$f":"IF(P351=\"\",$S$364-SUM(OFFSET($S$342:S349,0,0,COUNTA($S$342:S349),1)),SUMIF($R$19:$R$290,$P350,$Z$19:$Z$290))","v":0},null,null,null,null,{"$f":"IF(P351=\"\",$X$364-SUM(OFFSET($X$342:X349,0,0,COUNTA($X$342:X349),1)),ROUND(S350*(1+BDI.Taxa),2))","v":0},null,null,{"$f":"IF(P351=\"\",$AA$364-SUM(OFFSET($AA$342:AA349,0,0,COUNTA($AA$342:AA349),1)),ROUND(X350*100/ORÇAMENTO.TotalOrçamento,2))","v":{"$error":"#DIV/0!"}}]
[null,null,null,null,null,null,null,null,null,null,null,null,null,null,"9.","PROJETO HIDROSSANITÁRIO",null,null,{"$f":"IF(P352=\"\",$S$364-SUM(OFFSET($S$342:S350,0,0,COUNTA($S$342:S350),1)),SUMIF($R$19:$R$290,$P351,$Z$19:$Z$290))","v":0},null,null,null,null,{"$f":"IF(P352=\"\",$X$364-SUM(OFFSET($X$342:X350,0,0,COUNTA($X$342:X350),1)),ROUND(S351*(1+BDI.Taxa),2))","v":0},null,null,{"$f":"IF(P352=\"\",$AA$364-SUM(OFFSET($AA$342:AA350,0,0,COUNTA($AA$342:AA350),1)),ROUND(X351*100/ORÇAMENTO.TotalOrçamento,2))","v":{"$error":"#DIV/0!"}}]
[null,null,null,null,null,null,null,null,null,null,null,null,null,null,"10.","PROJETO DE PREVENÇÃO E COMBATE A INCÊNDIO",null,null,{"$f":"IF(P353=\"\",$S$364-SUM(OFFSET($S$342:S351,0,0,COUNTA($S$342:S351),1)),SUMIF($R$19:$R$290,$P352,$Z$19:$Z$290))","v":0},null,null,null,null,{"$f":"IF(P353=\"\",$X$364-SUM(OFFSET($X$342:X351,0,0,COUNTA($X$342:X351),1)),ROUND(S352*(1+BDI.Taxa),2))","v":0},null,null,{"$f":"IF(P353=\"\",$AA$364-SUM(OFFSET($AA$342:AA351,0,0,COUNTA($AA$342:AA351),1)),ROUND(X352*100/ORÇAMENTO.TotalOrçamento,2))","v":{"$error":"#DIV/0!"}}]
[null,null,null,null,null,null,null,null,null,null,null,null,null,null,"11.","PROJETO ESTRUTURAS METÁLICAS",null,null,{"$f":"IF(P354=\"\",$S$364-SUM(OFFSET($S$342:S352,0,0,COUNTA($S$342:S352),1)),SUMIF($R$19:$R$290,$P353,$Z$19:$Z$290))","v":0},null,null,null,null,{"$f":"IF(P354=\"\",$X$364-SUM(OFFSET($X$342:X352,0,0,COUNTA($X$342:X352),1)),ROUND(S353*(1+BDI.Taxa),2))","v":0},null,null,{"$f":"IF(P354=\"\",$AA$364-SUM(OFFSET($AA$342:AA352,0,0,COUNTA($AA$342:AA352),1)),ROUND(X353*100/ORÇAMENTO.TotalOrçamento,2))","v":{"$error":"#DIV/0!"}}]
[null,null,null,null,null,null,null,null,null,null,null,null,null,null,"12.","",null,null,{"$f":"IF(P355=\"\",$S$364-SUM(OFFSET($S$342:S353,0,0,COUNTA($S$342:S353),1)),SUMIF($R$19:$R$290,$P354,$Z$19:$Z$290))","v":0},null,null,null,null,{"$f":"IF(P355=\"\",$X$364-SUM(OFFSET($X$342:X353,0,0,COUNTA($X$342:X353),1)),ROUND(S354*(1+BDI.Taxa),2))","v":0},null,null,{"$f":"IF(P355=\"\",$AA$364-SUM(OFFSET($AA$342:AA353,0,0,COUNTA($AA$342:AA353),1)),ROUND(X354*100/ORÇAMENTO.TotalOrçamento,2))","v":{"$error":"#DIV/0!"}}]
[null,null,null,null,null,null,null,null,null,null,null,null,null,null,"13.","",null,null,{"$f":"IF(P356=\"\",$S$364-SUM(OFFSET($S$342:S354,0,0,COUNTA($S$342:S354),1)),SUMIF($R$19:$R$290,$P355,$Z$19:$Z$290))","v":0},null,null,null,null,{"$f":"IF(P356=\"\",$X$364-SUM(OFFSET($X$342:X354,0,0,COUNTA($X$342:X354),1)),ROUND(S355*(1+BDI.Taxa),2))","v":0},null,null,{"$f":"IF(P356=\"\",$AA$364-SUM(OFFSET($AA$342:AA354,0,0,COUNTA($AA$342:AA354),1)),ROUND(X355*100/ORÇAMENTO.TotalOrçamento,2))","v":{"$error":"#DIV/0!"}}]
[null,null,null,null,null,null,null,null,null,null,null,null,null,null,"14.","",null,null,{"$f":"IF(P357=\"\",$S$364-SUM(OFFSET($S$342:S355,0,0,COUNTA($S$342:S355),1)),SUMIF($R$19:$R$290,$P356,$Z$19:$Z$290))","v":0},null,null,null,null,{"$f":"IF(P357=\"\",$X$364-SUM(OFFSET($X$342:X355,0,0,COUNTA($X$342:X355),1)),ROUND(S356*(1+BDI.Taxa),2))","v":0},null,null,{"$f":"IF(P357=\"\",$AA$364-SUM(OFFSET($AA$342:AA355,0,0,COUNTA($AA$342:AA355),1)),ROUND(X356*100/ORÇAMENTO.TotalOrçamento,2))","v":{"$error":"#DIV/0!"}}]
[null,null,null,null,null,null,null,null,null,null,null,null,null,null,"15.","",null,null,{"$f":"IF(P358=\"\",$S$364-SUM(OFFSET($S$342:S356,0,0,COUNTA($S$342:S356),1)),SUMIF($R$19:$R$290,$P357,$Z$19:$Z$290))","v":0},null,null,null,null,{"$f":"IF(P358=\"\",$X$364-SUM(OFFSET($X$342:X356,0,0,COUNTA($X$342:X356),1)),ROUND(S357*(1+BDI.Taxa),2))","v":0},null,null,{"$f":"IF(P358=\"\",$AA$364-SUM(OFFSET($AA$342:AA356,0,0,COUNTA($AA$342:AA356),1)),ROUND(X357*100/ORÇAMENTO.TotalOrçamento,2))","v":{"$error":"#DIV/0!"}}]
[null,null,null,null,null,null,null,null,null,null,null,null,null,null,"16.","",null,null,{"$f":"IF(P359=\"\",$S$364-SUM(OFFSET($S$342:S357,0,0,COUNTA($S$342:S357),1)),SUMIF($R$19:$R$290,$P358,$Z$19:$Z$290))","v":0},null,null,null,null,{"$f":"IF(P359=\"\",$X$364-SUM(OFFSET($X$342:X357,0,0,COUNTA($X$342:X357),1)),ROUND(S358*(1+BDI.Taxa),2))","v":0},null,null,{"$f":"IF(P359=\"\",$AA$364-SUM(OFFSET($AA$342:AA357,0,0,COUNTA($AA$342:AA357),1)),ROUND(X358*100/ORÇAMENTO.TotalOrçamento,2))","v":{"$error":"#DIV/0!"}}]
[null,null,null,null,null,null,null,null,null,null,null,null,null,null,"17.","",null,null,{"$f":"IF(P360=\"\",$S$364-SUM(OFFSET($S$342:S358,0,0,COUNTA($S$342:S358),1)),SUMIF($R$19:$R$290,$P359,$Z$19:$Z$290))","v":0},null,null,null,null,{"$f":"IF(P360=\"\",$X$364-SUM(OFFSET($X$342:X358,0,0,COUNTA($X$342:X358),1)),ROUND(S359*(1+BDI.Taxa),2))","v":0},null,null,{"$f":"IF(P360=\"\",$AA$364-SUM(OFFSET($AA$342:AA358,0,0,COUNTA($AA$342:AA358),1)),ROUND(X359*100/ORÇAMENTO.TotalOrçamento,2))","v":{"$error":"#DIV/0!"}}]
[null,null,null,null,null,null,null,null,null,null,null,null,null,null,"18.","",null,null,{"$f":"IF(P361=\"\",$S$364-SUM(OFFSET($S$342:S359,0,0,COUNTA($S$342:S359),1)),SUMIF($R$19:$R$290,$P360,$Z$19:$Z$290))","v":0},null,null,null,null,{"$f":"IF(P361=\"\",$X$364-SUM(OFFSET($X$342:X359,0,0,COUNTA($X$342:X359),1)),ROUND(S360*(1+BDI.Taxa),2))","v":0},null,null,{"$f":"IF(P361=\"\",$AA$364-SUM(OFFSET($AA$342:AA359,0,0,COUNTA($AA$342:AA359),1)),ROUND(X360*100/ORÇAMENTO.TotalOrçamento,2))","v":{"$error":"#DIV/0!"}}]
[null,null,null,null,null,null,null,null,null,null,null,null,null,null,"19.","",null,null,{"$f":"IF(P362=\"\",$S$364-SUM(OFFSET($S$342:S360,0,0,COUNTA($S$342:S360),1)),SUMIF($R$19:$R$290,$P361,$Z$19:$Z$290))","v":0},null,null,null,null,{"$f":"IF(P362=\"\",$X$364-SUM(OFFSET($X$342:X360,0,0,COUNTA($X$342:X360),1)),ROUND(S361*(1+BDI.Taxa),2))","v":0},null,null,{"$f":"IF(P362=\"\",$AA$364-SUM(OFFSET($AA$342:AA360,0,0,COUNTA($AA$342:AA360),1)),ROUND(X361*100/ORÇAMENTO.TotalOrçamento,2))","v":{"$error":"#DIV/0!"}}]
[null,null,null,null,null,null,null,null,null,null,null,null,null,null,"20.","",null,null,{"$f":"IF(P363=\"\",$S$364-SUM(OFFSET($S$342:S361,0,0,COUNTA($S$342:S361),1)),SUMIF($R$19:$R$290,$P362,$Z$19:$Z$290))","v":0},null,null,null,null,{"$f":"IF(P363=\"\",$X$364-SUM(OFFSET($X$342:X361,0,0,COUNTA($X$342:X361),1)),ROUND(S362*(1+BDI.Taxa),2))","v":0},null,null,{"$f":"IF(P363=\"\",$AA$364-SUM(OFFSET($AA$342:AA361,0,0,COUNTA($AA$342:AA361),1)),ROUND(X362*100/ORÇAMENTO.TotalOrçamento,2))","v":{"$error":"#DIV/0!"}}]
[null,null,null,null,null,null,null,null,null,null,null,null,null,null,"TOTAL GERAL DO ORÇAMENTO (R$)",null,null,null,{"$f":"SUM(S343:W362)","v":0},null,null,null,null,{"$f":"SUM(X343:Y362)","v":0},null,null,{"$f":"SUM(AA343:AA362)","v":{"$error":"#DIV/0!"}}]
[null,null,null,null,null,null,null,null,null,null,null,null,null,null,null,null,null,null,{"$f":"$Z$291","v":0},null,null,null,null,{"$f":"$Z$293","v":0},null,null,100]
[null,null,null,null,null,null,null,null,null,null,null,null,null,null,null,null,null,null,"(TOTAL SEM BDI)",null,null,null,null,"(TOTAL COM BDI)",null,null,"(ARRED porcentagem)"]
[null,null,null,null,null,null,null,null,null,null,null,null,null,null,null,null,null,null,{"$f":"IF(AND(S363=S364,S363>0),\"OK\",\"ERRO\")","v":"ERRO"},null,null,null,null,{"$f":"IF(AND(X363=X364,X363>0),\"OK\",\"ERRO\")","v":"ERRO"},null,null,{"$f":"IF(AND(AA363=100,S343<>0),\"OK\",\"ERRO\")","v":{"$error":"#DIV/0!"}}]

{"sheet":"Resumo ","index":1,"n_rows":38,"n_cols":9,"rows_kept":38,"cut":false,"hidden":false,"merged":[[41,3,41,7],[40,3,40,7],[37,1,37,8],[21,2,21,5],[22,2,22,5],[23,2,23,5],[24,2,24,5],[25,2,25,5],[31,2,31,5],[32,2,32,5],[33,2,33,5],[34,2,34,5],[26,2,26,5],[27,2,27,5],[28,2,28,5],[29,2,29,5],[30,2,30,5],[0,1,0,8],[1,6,1,8],[2,6,2,8],[3,1,3,8],[4,6,4,8],[5,6,5,8],[6,1,6,8],[7,6,7,8],[8,6,8,8],[12,1,12,8],[10,1,10,2],[11,1,11,2],[35,1,35,5],[1,1,1,5],[2,1,2,5],[4,1,4,5],[5,1,5,5],[7,1,7,5],[8,1,8,5],[10,3,10,5],[11,3,11,5],[9,1,9,8],[10,6,10,8],[11,6,11,8],[18,2,18,5],[19,2,19,5],[20,2,20,5],[12,0,13,0],[14,2,14,5],[15,2,15,5],[16,2,16,5],[17,2,17,5],[13,1,13,8]]}
[]
[null,"UNIDADE ESCOLAR",null,null,null,null,"CÓDIGO INEP"]
[null,{"$f":"Orçamento!$O$4","v":"COORDENAÇÃO REGIONAL DE EDUAÇÃO DE RIO VERDE"},null,null,null,null,{"$f":"Orçamento!X4","v":0}]
[]
[null,"OBRA",null,null,null,null,"CIDADE"]
[null,{"$f":"Orçamento!$O$7","v":"IMPLANTAÇÃO"},null,null,null,null,{"$f":"Orçamento!$X$7","v":"RIO VERDE"}]
[]
[null,"ENDEREÇO",null,null,null,null,"CRE"]
[null,{"$f":"Orçamento!$R$10","v":"RUA 15-A, BAIRRO POPULAR"},null,null,null,null,{"$f":"Orçamento!$O$10","v":"RIO VERDE"}]
[]
[null,"REFERÊNCIA",null,"DATA",null,null,"ÁREA TOTAL CONSTRUÍDA (M²)"]
[null,{"$f":"CONCATENATE(\"AGETOP E SINAPI - \",Orçamento!$T$10)","v":"AGETOP E SINAPI - DESONERADA"},null,{"$f":"Orçamento!$S$7","v":"2020-07-23"},null,null,{"$f":"Orçamento!$X$13","v":100.68}]
["FILTRO"]
[null,"RESUMO GERAL DO ORÇAMENTO"]
["↓","ITEM","DESCRIÇÃO DOS SERVIÇOS",null,null,null,"PREÇO SEM BDI","PREÇO COM BDI","PARTICIP. (%)"]
[{"$f":"IF(G16>0,\"F\",\"\")","v":""},"1.",{"$f":"Orçamento!$P343","v":"NOVO BLOCO ADMINISTRATIVO"},null,null,null,{"$f":"IFERROR(Orçamento!S343,\"-\")","v":0},{"$f":"IFERROR(Orçamento!X343,\"\")","v":0},{"$f":"Orçamento!AA343","v":{"$error":"#DIV/0!"}}]
[{"$f":"IF(G17>0,\"F\",\"\")","v":""},"2.",{"$f":"Orçamento!$P344","v":"IMPLANTAÇÃO BLOCO ADMINISTRATIVO"},null,null,null,{"$f":"IFERROR(Orçamento!S344,\"-\")","v":0},{"$f":"IFERROR(Orçamento!X344,\"\")","v":0},{"$f":"Orçamento!AA344","v":{"$error":"#DIV/0!"}}]
["","3.",{"$f":"Orçamento!$P345","v":"RAMPA DE ACESSO"},null,null,null,{"$f":"IFERROR(Orçamento!S345,\"-\")","v":0},{"$f":"IFERROR(Orçamento!X345,\"\")","v":0},{"$f":"Orçamento!AA345","v":{"$error":"#DIV/0!"}}]
["","4.",{"$f":"Orçamento!$P346","v":"PORTÃO PEDESTRES"},null,null,null,{"$f":"IFERROR(Orçamento!S346,\"-\")","v":0},{"$f":"IFERROR(Orçamento!X346,\"\")","v":0},{"$f":"Orçamento!AA346","v":{"$error":"#DIV/0!"}}]
["","5.",{"$f":"Orçamento!$P347","v":"ADMINISTRAÇÃO LOCAL"},null,null,null,{"$f":"IFERROR(Orçamento!S347,\"-\")","v":0},{"$f":"IFERROR(Orçamento!X347,\"\")","v":0},{"$f":"Orçamento!AA347","v":{"$error":"#DIV/0!"}}]
["","6.",{"$f":"Orçamento!$P348","v":"OBRA"},null,null,null,{"$f":"IFERROR(Orçamento!S348,\"-\")","v":0},{"$f":"IFERROR(Orçamento!X348,\"\")","v":0},{"$f":"Orçamento!AA348","v":{"$error":"#DIV/0!"}}]
["","7.",{"$f":"Orçamento!$P349","v":"PROJETO ELÉTRICO"},null,null,null,{"$f":"IFERROR(Orçamento!S349,\"-\")","v":0},{"$f":"IFERROR(Orçamento!X349,\"\")","v":0},{"$f":"Orçamento!AA349","v":{"$error":"#DIV/0!"}}]
["","8.",{"$f":"Orçamento!$P350","v":"PROJETO ESTRUTURAL"},null,null,null,{"$f":"IFERROR(Orçamento!S350,\"-\")","v":0},{"$f":"IFERROR(Orçamento!X350,\"\")","v":0},{"$f":"Orçamento!AA350","v":{"$error":"#DIV/0!"}}]
["","9.",{"$f":"Orçamento!$P351","v":"PROJETO HIDROSSANITÁRIO"},null,null,null,{"$f":"IFERROR(Orçamento!S351,\"-\")","v":0},{"$f":"IFERROR(Orçamento!X351,\"\")","v":0},{"$f":"Orçamento!AA351","v":{"$error":"#DIV/0!"}}]
["","10.",{"$f":"Orçamento!$P352","v":"PROJETO DE PREVENÇÃO E COMBATE A INCÊNDIO"},null,null,null,{"$f":"IFERROR(Orçamento!S352,\"-\")","v":0},{"$f":"IFERROR(Orçamento!X352,\"\")","v":0},{"$f":"Orçamento!AA352","v":{"$error":"#DIV/0!"}}]
["","11.",{"$f":"Orçamento!$P353","v":"PROJETO ESTRUTURAS METÁLICAS"},null,null,null,{"$f":"IFERROR(Orçamento!S353,\"-\")","v":0},{"$f":"IFERROR(Orçamento!X353,\"\")","v":0},{"$f":"Orçamento!AA353","v":{"$error":"#DIV/0!"}}]
["","12.",{"$f":"Orçamento!$P354","v":""},null,null,null,{"$f":"IFERROR(Orçamento!S354,\"-\")","v":0},{"$f":"IFERROR(Orçamento!X354,\"\")","v":0},{"$f":"Orçamento!AA354","v":{"$error":"#DIV/0!"}}]
["","13.",{"$f":"Orçamento!$P355","v":""},null,null,null,{"$f":"IFERROR(Orçamento!S355,\"-\")","v":0},{"$f":"IFERROR(Orçamento!X355,\"\")","v":0},{"$f":"Orçamento!AA355","v":{"$error":"#DIV/0!"}}]
["","14.",{"$f":"Orçamento!$P356","v":""},null,null,null,{"$f":"IFERROR(Orçamento!S356,\"-\")","v":0},{"$f":"IFERROR(Orçamento!X356,\"\")","v":0},{"$f":"Orçamento!AA356","v":{"$error":"#DIV/0!"}}]
["","15.",{"$f":"Orçamento!$P357","v":""},null,null,null,{"$f":"IFERROR(Orçamento!S357,\"-\")","v":0},{"$f":"IFERROR(Orçamento!X357,\"\")","v":0},{"$f":"Orçamento!AA357","v":{"$error":"#DIV/0!"}}]
["","16.",{"$f":"Orçamento!$P358","v":""},null,null,null,{"$f":"IFERROR(Orçamento!S358,\"-\")","v":0},{"$f":"IFERROR(Orçamento!X358,\"\")","v":0},{"$f":"Orçamento!AA358","v":{"$error":"#DIV/0!"}}]
["","17.",{"$f":"Orçamento!$P359","v":""},null,null,null,{"$f":"IFERROR(Orçamento!S359,\"-\")","v":0},{"$f":"IFERROR(Orçamento!X359,\"\")","v":0},{"$f":"Orçamento!AA359","v":{"$error":"#DIV/0!"}}]
["","18.",{"$f":"Orçamento!$P360","v":""},null,null,null,{"$f":"IFERROR(Orçamento!S360,\"-\")","v":0},{"$f":"IFERROR(Orçamento!X360,\"\")","v":0},{"$f":"Orçamento!AA360","v":{"$error":"#DIV/0!"}}]
["","19.",{"$f":"Orçamento!$P361","v":""},null,null,null,{"$f":"IFERROR(Orçamento!S361,\"-\")","v":0},{"$f":"IFERROR(Orçamento!X361,\"\")","v":0},{"$f":"Orçamento!AA361","v":{"$error":"#DIV/0!"}}]
["","20.",{"$f":"Orçamento!$P362","v":""},null,null,null,{"$f":"IFERROR(Orçamento!S362,\"-\")","v":0},{"$f":"IFERROR(Orçamento!X362,\"\")","v":0},{"$f":"Orçamento!AA362","v":{"$error":"#DIV/0!"}}]
["F","TOTAL GERAL DO ORÇAMENTO (R$)",null,null,null,null,{"$f":"SUM(G16:G35)","v":0},{"$f":"SUM(H16:H35)","v":0},{"$f":"SUM(I16:I35)","v":{"$error":"#DIV/0!"}}]
["F"]
["F"]

{"sheet":"Somatório","index":2,"n_rows":44,"n_cols":6,"rows_kept":44,"cut":false,"hidden":false,"merged":[[13,1,13,5],[1,1,1,3],[1,4,1,5],[2,1,2,3],[2,4,2,5],[4,1,4,3],[4,4,4,5],[5,1,5,3],[5,4,5,5],[7,1,7,3],[7,4,7,5],[0,1,0,5],[3,1,3,5],[6,1,6,5],[9,1,9,5],[8,1,8,3],[8,4,8,5],[10,1,10,2],[10,4,10,5],[11,1,11,2],[11,4,11,5],[12,0,13,0],[41,1,41,2],[43,1,43,5],[46,3,46,5],[47,3,47,5],[12,1,12,5]]}
[]
[null,"UNIDADE ESCOLAR",null,null,"CÓDIGO INEP"]
[null,{"$f":"Orçamento!$O$4","v":"COORDENAÇÃO REGIONAL DE EDUAÇÃO DE RIO VERDE"},null,null,{"$f":"Orçamento!X4","v":0}]
[]
[null,"OBRA",null,null,"CIDADE"]
[null,{"$f":"Orçamento!$O$7","v":"IMPLANTAÇÃO"},null,null,{"$f":"Orçamento!$X$7","v":"RIO VERDE"}]
[]
[null,"ENDEREÇO",null,null,"CRE"]
[null,{"$f":"Orçamento!$R$10","v":"RUA 15-A, BAIRRO POPULAR"},null,null,{"$f":"Orçamento!$O$10","v":"RIO VERDE"}]
[]
[null,"REFERÊNCIA",null,"DATA","ÁREA TOTAL CONSTRUÍDA (M²)"]
[null,{"$f":"CONCATENATE(\"AGETOP E SINAPI - \",Orçamento!$T$10)","v":"AGETOP E SINAPI - DESONERADA"},null,{"$f":"Orçamento!$S$7","v":"2020-07-23"},{"$f":"Orçamento!$X$13","v":100.68}]
["FILTRO"]
[null,"SOMATÓRIO DE SERVIÇOS"]
["↓","ITEM","DESCRIÇÃO DOS SERVIÇOS","PREÇO SEM BDI (R$)","PREÇO COM BDI (R$)","PARTIC.  ( % )"]
[{"$f":"IF(D16>0,\"F\",\"\")","v":""},"a.",{"$f":"Orçamento!P309","v":"SERVIÇOS PRELIMINARES"},{"$f":"Orçamento!S309","v":0},{"$f":"Orçamento!X309","v":0},{"$f":"Orçamento!AA309","v":0}]
[{"$f":"IF(D17>0,\"F\",\"\")","v":""},"b.",{"$f":"Orçamento!P310","v":"TRANSPORTES"},{"$f":"Orçamento!S310","v":0},{"$f":"Orçamento!X310","v":0},{"$f":"Orçamento!AA310","v":0}]
["","c.",{"$f":"Orçamento!P311","v":"SERVIÇO EM TERRA"},{"$f":"Orçamento!S311","v":0},{"$f":"Orçamento!X311","v":0},{"$f":"Orçamento!AA311","v":0}]
["","d.",{"$f":"Orçamento!P312","v":"FUNDAÇÕES E SONDAGENS"},{"$f":"Orçamento!S312","v":0},{"$f":"Orçamento!X312","v":0},{"$f":"Orçamento!AA312","v":0}]
["","e.",{"$f":"Orçamento!P313","v":"ESTRUTURA"},{"$f":"Orçamento!S313","v":0},{"$f":"Orçamento!X313","v":0},{"$f":"Orçamento!AA313","v":0}]
["","f.",{"$f":"Orçamento!P314","v":"INSTALAÇÕES ELÉTRICAS"},{"$f":"Orçamento!S314","v":0},{"$f":"Orçamento!X314","v":0},{"$f":"Orçamento!AA314","v":0}]
["","g.",{"$f":"Orçamento!P315","v":"INSTALAÇÕES HIDROSSANITÁRIAS"},{"$f":"Orçamento!S315","v":0},{"$f":"Orçamento!X315","v":0},{"$f":"Orçamento!AA315","v":0}]
["","h",{"$f":"Orçamento!P316","v":"INSTALAÇÕES ESPECIAIS"},{"$f":"Orçamento!S316","v":0},{"$f":"Orçamento!X316","v":0},{"$f":"Orçamento!AA316","v":0}]
["","i.",{"$f":"Orçamento!P317","v":"ALVENARIAS E DIVISÓRIAS"},{"$f":"Orçamento!S317","v":0},{"$f":"Orçamento!X317","v":0},{"$f":"Orçamento!AA317","v":0}]
["","j.",{"$f":"Orçamento!P318","v":"ALVENARIA AUTO-PORTANTE"},{"$f":"Orçamento!S318","v":0},{"$f":"Orçamento!X318","v":0},{"$f":"Orçamento!AA318","v":0}]
["","k.",{"$f":"Orçamento!P319","v":"IMPERMEABILIZAÇÃO"},{"$f":"Orçamento!S319","v":0},{"$f":"Orçamento!X319","v":0},{"$f":"Orçamento!AA319","v":0}]
["","l.",{"$f":"Orçamento!P320","v":"ISOLAMENTO TÉRMICO E ACÚSTICO"},{"$f":"Orçamento!S320","v":0},{"$f":"Orçamento!X320","v":0},{"$f":"Orçamento!AA320","v":0}]
["","m.",{"$f":"Orçamento!P321","v":"ESTRUTURA DE MADEIRA"},{"$f":"Orçamento!S321","v":0},{"$f":"Orçamento!X321","v":0},{"$f":"Orçamento!AA321","v":0}]
["","n.",{"$f":"Orçamento!P322","v":"ESTRUTURAS METÁLICAS"},{"$f":"Orçamento!S322","v":0},{"$f":"Orçamento!X322","v":0},{"$f":"Orçamento!AA322","v":0}]
["","o.",{"$f":"Orçamento!P323","v":"COBERTURAS"},{"$f":"Orçamento!S323","v":0},{"$f":"Orçamento!X323","v":0},{"$f":"Orçamento!AA323","v":0}]
["","p.",{"$f":"Orçamento!P324","v":"ESQUADRIAS DE MADEIRA"},{"$f":"Orçamento!S324","v":0},{"$f":"Orçamento!X324","v":0},{"$f":"Orçamento!AA324","v":0}]
["","q.",{"$f":"Orçamento!P325","v":"ESQUADRIAS METÁLICAS"},{"$f":"Orçamento!S325","v":0},{"$f":"Orçamento!X325","v":0},{"$f":"Orçamento!AA325","v":0}]
["","r.",{"$f":"Orçamento!P326","v":"VIDROS"},{"$f":"Orçamento!S326","v":0},{"$f":"Orçamento!X326","v":0},{"$f":"Orçamento!AA326","v":0}]
["","s.",{"$f":"Orçamento!P327","v":"REVESTIMENTO DE PAREDE"},{"$f":"Orçamento!S327","v":0},{"$f":"Orçamento!X327","v":0},{"$f":"Orçamento!AA327","v":0}]
["","t.",{"$f":"Orçamento!P328","v":"FORROS"},{"$f":"Orçamento!S328","v":0},{"$f":"Orçamento!X328","v":0},{"$f":"Orçamento!AA328","v":0}]
["","u.",{"$f":"Orçamento!P329","v":"REVESTIMENTO DE PISO"},{"$f":"Orçamento!S329","v":0},{"$f":"Orçamento!X329","v":0},{"$f":"Orçamento!AA329","v":0}]
["","v.",{"$f":"Orçamento!P330","v":"FERRAGENS"},{"$f":"Orçamento!S330","v":0},{"$f":"Orçamento!X330","v":0},{"$f":"Orçamento!AA330","v":0}]
["","w.",{"$f":"Orçamento!P331","v":"MARCENARIA"},{"$f":"Orçamento!S331","v":0},{"$f":"Orçamento!X331","v":0},{"$f":"Orçamento!AA331","v":0}]
["","x.",{"$f":"Orçamento!P332","v":"ADMINISTRAÇÃO"},{"$f":"Orçamento!S332","v":0},{"$f":"Orçamento!X332","v":0},{"$f":"Orçamento!AA332","v":0}]
["","y.",{"$f":"Orçamento!P333","v":"PINTURA"},{"$f":"Orçamento!S333","v":0},{"$f":"Orçamento!X333","v":0},{"$f":"Orçamento!AA333","v":0}]
["","z.",{"$f":"Orçamento!P334","v":"DIVERSOS"},{"$f":"Orçamento!S334","v":0},{"$f":"Orçamento!X334","v":0},{"$f":"Orçamento!AA334","v":0}]
["F","TOTAL GERAL DO ORÇAMENTO",null,{"$f":"SUM(D16:D41)","v":0},{"$f":"SUM(E16:E41)","v":0},{"$f":"SUM(F16:F41)","v":0}]
[]
[null,"(*) Para itens da AGETOP, os vidros não estão inclusos nas esquadrias e já foram considerados os custos de contramarco para as esquadrias de alumínio;"]

{"sheet":"Cronog_60_Dias","index":3,"n_rows":98,"n_cols":14,"rows_kept":98,"cut":false,"hidden":false,"merged":[[1,1,1,7],[2,1,2,7],[4,1,4,7],[5,1,5,7],[7,1,7,7],[8,1,8,7],[0,1,0,13],[6,1,6,13],[3,1,3,13],[9,1,9,13],[8,8,8,13],[7,8,7,13],[2,8,2,13],[5,8,5,13],[4,8,4,13],[1,8,1,13],[49,1,51,2],[70,3,72,3],[11,13,12,13],[12,1,12,2],[12,5,12,8],[12,9,12,12],[11,3,12,3],[11,9,11,12],[13,1,15,2],[11,5,11,8],[16,1,18,2],[16,4,18,4],[16,5,16,8],[16,9,16,12],[18,5,18,8],[18,9,18,12],[19,1,21,2],[64,1,66,2],[67,3,69,3],[61,3,63,3],[67,1,69,2],[55,3,57,3],[64,4,66,4],[73,3,75,3],[49,4,51,4],[73,4,75,4],[55,1,57,2],[55,4,57,4],[49,3,51,3],[52,3,54,3],[67,4,69,4],[61,1,63,2],[61,4,63,4],[58,3,60,3],[52,1,54,2],[52,4,54,4],[58,1,60,2],[58,4,60,4],[73,1,75,2],[19,4,21,4],[19,5,19,8],[19,9,19,12],[21,5,21,8],[21,9,21,12],[19,3,21,3],[13,3,15,3],[16,3,18,3],[13,4,15,4],[13,5,13,8],[13,9,13,12],[15,5,15,8],[15,9,15,12],[22,9,22,12],[24,5,24,8],[24,9,24,12],[25,1,27,2],[25,4,27,4],[25,5,25,8],[25,9,25,12],[27,5,27,8],[27,9,27,12],[22,3,24,3],[22,1,24,2],[22,4,24,4],[22,5,22,8],[25,3,27,3],[28,9,28,12],[30,5,30,8],[30,9,30,12],[31,1,33,2],[31,4,33,4],[31,5,31,8],[31,9,31,12],[33,5,33,8],[33,9,33,12],[31,3,33,3],[28,5,28,8],[28,1,30,2],[28,4,30,4],[28,3,30,3],[34,9,34,12],[36,5,36,8],[36,9,36,12],[34,3,36,3],[39,9,39,12],[37,3,39,3],[37,9,37,12],[40,1,42,2],[40,4,42,4],[40,5,40,8],[40,9,40,12],[42,5,42,8],[42,9,42,12],[40,3,42,3],[34,5,34,8],[37,5,37,8],[39,5,39,8],[34,1,36,2],[34,4,36,4],[37,1,39,2],[37,4,39,4],[43,9,43,12],[45,5,45,8],[45,9,45,12],[46,1,48,2],[46,4,48,4],[46,5,46,8],[46,9,46,12],[48,5,48,8],[48,9,48,12],[43,5,43,8],[46,3,48,3],[43,3,45,3],[43,1,45,2],[43,4,45,4],[52,9,52,12],[54,5,54,8],[54,9,54,12],[49,5,49,8],[49,9,49,12],[51,5,51,8],[51,9,51,12],[55,9,55,12],[57,5,57,8],[57,9,57,12],[52,5,52,8],[55,5,55,8],[67,5,67,8],[64,5,64,8],[64,9,64,12],[66,5,66,8],[66,9,66,12],[64,3,66,3],[61,9,61,12],[63,5,63,8],[63,9,63,12],[61,5,61,8],[94,1,94,2],[94,5,94,8],[94,9,94,12],[96,1,96,4],[97,1,97,13],[85,9,85,12],[87,5,87,8],[87,9,87,12],[84,5,84,8],[84,9,84,12],[88,1,90,2],[88,4,90,4],[88,5,88,8],[88,9,88,12],[90,5,90,8],[90,9,90,12],[88,3,90,3],[85,4,87,4],[85,5,85,8],[85,3,87,3],[82,1,84,2],[82,4,84,4],[82,5,82,8],[82,9,82,12],[93,1,93,2],[93,5,93,8],[93,9,93,12],[75,5,75,8],[75,9,75,12],[76,5,76,8],[76,9,76,12],[78,5,78,8],[78,9,78,12],[79,5,79,8],[79,9,79,12],[81,5,81,8],[81,9,81,12],[76,3,78,3],[79,3,81,3],[85,1,87,2],[79,4,81,4],[82,3,84,3],[76,1,78,2],[76,4,78,4],[79,1,81,2],[11,0,12,0],[8,0,10,0],[10,1,10,13],[91,1,91,2],[91,5,91,8],[91,9,91,12],[92,1,92,2],[92,5,92,8],[92,9,92,12],[73,9,73,12],[73,5,73,8],[67,9,67,12],[69,5,69,8],[69,9,69,12],[58,5,58,8],[70,1,72,2],[70,4,72,4],[70,5,70,8],[70,9,70,12],[72,5,72,8],[72,9,72,12],[58,9,58,12],[60,5,60,8],[60,9,60,12]]}
[]
[null,"UNIDADE ESCOLAR",null,null,null,null,null,null,"PRAZO"]
[null,{"$f":"Orçamento!$O$4","v":"COORDENAÇÃO REGIONAL DE EDUAÇÃO DE RIO VERDE"},null,null,null,null,null,null,"60 DIAS CORRIDOS"]
[]
[null,"OBRA",null,null,null,null,null,null,"DATA"]
[null,{"$f":"Orçamento!$O$7","v":"IMPLANTAÇÃO"},null,null,null,null,null,null,{"$f":"Orçamento!$S$7","v":"2020-07-23"}]
[]
[null,"LOCAL",null,null,null,null,null,null,"ÁREA TOTAL CONSTRUÍDA (M²)"]
["FILTRO",{"$f":"Orçamento!$X$7","v":"RIO VERDE"},null,null,null,null,null,null,{"$f":"Orçamento!$X$13","v":100.68}]
[]
[null,"CRONOGRAMA - FÍSICO FINANCEIRO"]
["↓","CUSTO TOTAL:",{"$f":"D92","v":0},"VALOR","Dias:",30,null,null,null,60,null,null,null,"TOTAL"]
[null,"DESCRIÇÃO DOS SERVIÇOS",null,null,"%","1ª PARCELA",null,null,null,"2ª PARCELA"]
[{"$f":"IF(D14>0,\"F\",\"\")","v":""},"SERVIÇOS PRELIMINARES",null,{"$f":"Orçamento!X309","v":0},{"$f":"Orçamento!AA309","v":0},{"$f":"ROUND(F16*$D$14,2)","v":0},null,null,null,{"$f":"ROUND(J16*$D$14,2)","v":0},null,null,null,{"$f":"SUM(F14:M14)","v":0}]
[{"$f":"IF(A14=\"F\",A14,\"\")","v":""}]
[{"$f":"IF(A15=\"F\",A15,\"\")","v":""},null,null,null,null,1,null,null,null,{"$f":"1-F16","v":0},null,null,null,{"$f":"IFERROR(E14/100,\"\")","v":0}]
[{"$f":"IF(D17>0,\"F\",\"\")","v":""},"TRANSPORTES",null,{"$f":"Orçamento!X310","v":0},{"$f":"Orçamento!AA310","v":0},{"$f":"ROUND(F19*$D$17,2)","v":0},null,null,null,{"$f":"ROUND(J19*$D$17,2)","v":0},null,null,null,{"$f":"SUM(F17:M17)","v":0}]
[{"$f":"IF(A17=\"F\",A17,\"\")","v":""}]
[{"$f":"IF(A18=\"F\",A18,\"\")","v":""},null,null,null,null,0.48,null,null,null,{"$f":"1-F19","v":0.52},null,null,null,{"$f":"IFERROR(E17/100,\"\")","v":0}]
[{"$f":"IF(D20>0,\"F\",\"\")","v":""},"SERVIÇO EM TERRA",null,{"$f":"Orçamento!X311","v":0},{"$f":"Orçamento!AA311","v":0},{"$f":"ROUND(F22*$D$20,2)","v":0},null,null,null,{"$f":"ROUND(J22*$D$20,2)","v":0},null,null,null,{"$f":"SUM(F20:M20)","v":0}]
[{"$f":"IF(A20=\"F\",A20,\"\")","v":""}]
[{"$f":"IF(A21=\"F\",A21,\"\")","v":""},null,null,null,null,1,null,null,null,{"$f":"1-F22","v":0},null,null,null,{"$f":"IFERROR(E20/100,\"\")","v":0}]
[{"$f":"IF(D23>0,\"F\",\"\")","v":""},"FUNDAÇÕES E SONDAGENS",null,{"$f":"Orçamento!X312","v":0},{"$f":"Orçamento!AA312","v":0},{"$f":"ROUND(F25*$D$23,2)","v":0},null,null,null,{"$f":"ROUND(J25*$D$23,2)","v":0},null,null,null,{"$f":"SUM(F23:M23)","v":0}]
[{"$f":"IF(A23=\"F\",A23,\"\")","v":""}]
[{"$f":"IF(A24=\"F\",A24,\"\")","v":""},null,null,null,null,1,null,null,null,{"$f":"1-F25","v":0},null,null,null,{"$f":"IFERROR(E23/100,\"\")","v":0}]
[{"$f":"IF(D26>0,\"F\",\"\")","v":""},"ESTRUTURA",null,{"$f":"Orçamento!X313","v":0},{"$f":"Orçamento!AA313","v":0},{"$f":"ROUND(F28*$D$26,2)","v":0},null,null,null,{"$f":"ROUND(J28*$D$26,2)","v":0},null,null,null,{"$f":"SUM(F26:M26)","v":0}]
[{"$f":"IF(A26=\"F\",A26,\"\")","v":""}]
[{"$f":"IF(A27=\"F\",A27,\"\")","v":""},null,null,null,null,0.49,null,null,null,{"$f":"1-F28","v":0.51},null,null,null,{"$f":"IFERROR(E26/100,\"\")","v":0}]
[{"$f":"IF(D29>0,\"F\",\"\")","v":""},"INST.ELET/TELEFÔNICA/CABEAMENTO ESTRUTURADO",null,{"$f":"Orçamento!X314","v":0},{"$f":"Orçamento!AA314","v":0},{"$f":"ROUND(F31*$D$29,2)","v":0},null,null,null,{"$f":"ROUND(J31*$D$29,2)","v":0},null,null,null,{"$f":"SUM(F29:M29)","v":0}]
[{"$f":"IF(A29=\"F\",A29,\"\")","v":""}]
[{"$f":"IF(A30=\"F\",A30,\"\")","v":""},null,null,null,null,0.4,null,null,null,{"$f":"1-F31","v":0.6},null,null,null,{"$f":"IFERROR(E29/100,\"\")","v":0}]
[{"$f":"IF(D32>0,\"F\",\"\")","v":""},"INSTALAÇÕES HIDROSSANITÁRIAS",null,{"$f":"Orçamento!X315","v":0},{"$f":"Orçamento!AA315","v":0},{"$f":"ROUND(F34*$D$32,2)","v":0},null,null,null,{"$f":"ROUND(J34*$D$32,2)","v":0},null,null,null,{"$f":"SUM(F32:M32)","v":0}]
[{"$f":"IF(A32=\"F\",A32,\"\")","v":""}]
[{"$f":"IF(A33=\"F\",A33,\"\")","v":""},null,null,null,null,0.48,null,null,null,{"$f":"1-F34","v":0.52},null,null,null,{"$f":"IFERROR(E32/100,\"\")","v":0}]
[{"$f":"IF(D35>0,\"F\",\"\")","v":""},"INSTALAÇÕES ESPECIAIS",null,{"$f":"Orçamento!X316","v":0},{"$f":"Orçamento!AA316","v":0},{"$f":"ROUND(F37*$D$35,2)","v":0},null,null,null,{"$f":"ROUND(J37*$D$35,2)","v":0},null,null,null,{"$f":"SUM(F35:M35)","v":0}]
[{"$f":"IF(A35=\"F\",A35,\"\")","v":""}]
[{"$f":"IF(A36=\"F\",A36,\"\")","v":""},null,null,null,null,1,null,null,null,{"$f":"1-F37","v":0},null,null,null,{"$f":"IFERROR(E35/100,\"\")","v":0}]
[{"$f":"IF(D38>0,\"F\",\"\")","v":""},"ALVENARIA E DIVISÓRIAS",null,{"$f":"Orçamento!X317","v":0},{"$f":"Orçamento!AA317","v":0},{"$f":"ROUND(F40*$D$38,2)","v":0},null,null,null,{"$f":"ROUND(J40*$D$38,2)","v":0},null,null,null,{"$f":"SUM(F38:M38)","v":0}]
[{"$f":"IF(A38=\"F\",A38,\"\")","v":""}]
[{"$f":"IF(A39=\"F\",A39,\"\")","v":""},null,null,null,null,1,null,null,null,{"$f":"1-F40","v":0},null,null,null,{"$f":"IFERROR(E38/100,\"\")","v":0}]
[{"$f":"IF(D41>0,\"F\",\"\")","v":""},"ALVENARIA AUTO-PORTANTE",null,{"$f":"Orçamento!X318","v":0},{"$f":"Orçamento!AA318","v":0},{"$f":"ROUND(F43*$D$41,2)","v":0},null,null,null,{"$f":"ROUND(J43*$D$41,2)","v":0},null,null,null,{"$f":"SUM(F41:M41)","v":0}]
[{"$f":"IF(A41=\"F\",A41,\"\")","v":""}]
[{"$f":"IF(A42=\"F\",A42,\"\")","v":""},null,null,null,null,1,null,null,null,{"$f":"1-F43","v":0},null,null,null,{"$f":"IFERROR(E41/100,\"\")","v":0}]
[{"$f":"IF(D44>0,\"F\",\"\")","v":""},"IMPERMEABILIZAÇÃO",null,{"$f":"Orçamento!X319","v":0},{"$f":"Orçamento!AA319","v":0},{"$f":"ROUND(F46*$D$44,2)","v":0},null,null,null,{"$f":"ROUND(J46*$D$44,2)","v":0},null,null,null,{"$f":"SUM(F44:M44)","v":0}]
[{"$f":"IF(A44=\"F\",A44,\"\")","v":""}]
[{"$f":"IF(A45=\"F\",A45,\"\")","v":""},null,null,null,null,1,null,null,null,{"$f":"1-F46","v":0},null,null,null,{"$f":"IFERROR(E44/100,\"\")","v":0}]
[{"$f":"IF(D47>0,\"F\",\"\")","v":""},"ISOLAMENTO TÉRMICO E ACÚSTICO",null,{"$f":"Orçamento!X320","v":0},{"$f":"Orçamento!AA320","v":0},{"$f":"ROUND(F49*$D$47,2)","v":0},null,null,null,{"$f":"ROUND(J49*$D$47,2)","v":0},null,null,null,{"$f":"SUM(F47:M47)","v":0}]
[{"$f":"IF(A47=\"F\",A47,\"\")","v":""}]
[{"$f":"IF(A48=\"F\",A48,\"\")","v":""},null,null,null,null,0.5,null,null,null,{"$f":"1-F49","v":0.5},null,null,null,{"$f":"IFERROR(E47/100,\"\")","v":0}]
[{"$f":"IF(D50>0,\"F\",\"\")","v":""},"ESTRUTURA DE MADEIRA",null,{"$f":"Orçamento!X321","v":0},{"$f":"Orçamento!AA321","v":0},{"$f":"ROUND(F52*$D$50,2)","v":0},null,null,null,{"$f":"ROUND(J52*$D$50,2)","v":0},null,null,null,{"$f":"SUM(F50:M50)","v":0}]
[{"$f":"IF(A50=\"F\",A50,\"\")","v":""}]
[{"$f":"IF(A51=\"F\",A51,\"\")","v":""},null,null,null,null,0.4,null,null,null,{"$f":"1-F52","v":0.6},null,null,null,{"$f":"IFERROR(E50/100,\"\")","v":0}]
[{"$f":"IF(D53>0,\"F\",\"\")","v":""},"ESTRUTURA METÁLICA",null,{"$f":"Orçamento!X322","v":0},{"$f":"Orçamento!AA322","v":0},{"$f":"ROUND(F55*$D$53,2)","v":0},null,null,null,{"$f":"ROUND(J55*$D$53,2)","v":0},null,null,null,{"$f":"SUM(F53:M53)","v":0}]
[{"$f":"IF(A53=\"F\",A53,\"\")","v":""}]
[{"$f":"IF(A54=\"F\",A54,\"\")","v":""},null,null,null,null,0.35,null,null,null,{"$f":"1-F55","v":0.65},null,null,null,{"$f":"IFERROR(E53/100,\"\")","v":0}]
[{"$f":"IF(D56>0,\"F\",\"\")","v":""},"COBERTURAS",null,{"$f":"Orçamento!X323","v":0},{"$f":"Orçamento!AA323","v":0},{"$f":"ROUND(F58*$D$56,2)","v":0},null,null,null,{"$f":"ROUND(J58*$D$56,2)","v":0},null,null,null,{"$f":"SUM(F56:M56)","v":0}]
[{"$f":"IF(A56=\"F\",A56,\"\")","v":""}]
[{"$f":"IF(A57=\"F\",A57,\"\")","v":""},null,null,null,null,0,null,null,null,{"$f":"1-F58","v":1},null,null,null,{"$f":"IFERROR(E56/100,\"\")","v":0}]
[{"$f":"IF(D59>0,\"F\",\"\")","v":""},"ESQUADRIAS DE MADEIRA",null,{"$f":"Orçamento!X324","v":0},{"$f":"Orçamento!AA324","v":0},{"$f":"ROUND(F61*$D$59,2)","v":0},null,null,null,{"$f":"ROUND(J61*$D$59,2)","v":0},null,null,null,{"$f":"SUM(F59:M59)","v":0}]
[{"$f":"IF(A59=\"F\",A59,\"\")","v":""}]
[{"$f":"IF(A60=\"F\",A60,\"\")","v":""},null,null,null,null,0.54,null,null,null,{"$f":"1-F61","v":0.45999999999999996},null,null,null,{"$f":"IFERROR(E59/100,\"\")","v":0}]
[{"$f":"IF(D62>0,\"F\",\"\")","v":""},"ESQUADRIAS METÁLICAS",null,{"$f":"Orçamento!X325","v":0},{"$f":"Orçamento!AA325","v":0},{"$f":"ROUND(F64*$D$62,2)","v":0},null,null,null,{"$f":"ROUND(J64*$D$62,2)","v":0},null,null,null,{"$f":"SUM(F62:M62)","v":0}]
[{"$f":"IF(A62=\"F\",A62,\"\")","v":""}]
[{"$f":"IF(A63=\"F\",A63,\"\")","v":""},null,null,null,null,0.49,null,null,null,{"$f":"1-F64","v":0.51},null,null,null,{"$f":"IFERROR(E62/100,\"\")","v":0}]
[{"$f":"IF(D65>0,\"F\",\"\")","v":""},"VIDROS",null,{"$f":"Orçamento!X326","v":0},{"$f":"Orçamento!AA326","v":0},{"$f":"ROUND(F67*$D$65,2)","v":0},null,null,null,{"$f":"ROUND(J67*$D$65,2)","v":0},null,null,null,{"$f":"SUM(F65:M65)","v":0}]
[{"$f":"IF(A65=\"F\",A65,\"\")","v":""}]
[{"$f":"IF(A66=\"F\",A66,\"\")","v":""},null,null,null,null,0,null,null,null,{"$f":"1-F67","v":1},null,null,null,{"$f":"IFERROR(E65/100,\"\")","v":0}]
[{"$f":"IF(D68>0,\"F\",\"\")","v":""},"REVESTIMENTO DE PAREDE",null,{"$f":"Orçamento!X327","v":0},{"$f":"Orçamento!AA327","v":0},{"$f":"ROUND(F70*$D$68,2)","v":0},null,null,null,{"$f":"ROUND(J70*$D$68,2)","v":0},null,null,null,{"$f":"SUM(F68:M68)","v":0}]
[{"$f":"IF(A68=\"F\",A68,\"\")","v":""}]
[{"$f":"IF(A69=\"F\",A69,\"\")","v":""},null,null,null,null,0.32,null,null,null,{"$f":"1-F70","v":0.67999999999999994},null,null,null,{"$f":"IFERROR(E68/100,\"\")","v":0}]
[{"$f":"IF(D71>0,\"F\",\"\")","v":""},"FORROS",null,{"$f":"Orçamento!X328","v":0},{"$f":"Orçamento!AA328","v":0},{"$f":"ROUND(F73*$D$71,2)","v":0},null,null,null,{"$f":"ROUND(J73*$D$71,2)","v":0},null,null,null,{"$f":"SUM(F71:M71)","v":0}]
[{"$f":"IF(A71=\"F\",A71,\"\")","v":""}]
[{"$f":"IF(A72=\"F\",A72,\"\")","v":""},null,null,null,null,0.24,null,null,null,{"$f":"1-F73","v":0.76},null,null,null,{"$f":"IFERROR(E71/100,\"\")","v":0}]
[{"$f":"IF(D74>0,\"F\",\"\")","v":""},"REVESTIMENTO DE PISO",null,{"$f":"Orçamento!X329","v":0},{"$f":"Orçamento!AA329","v":0},{"$f":"ROUND(F76*$D$74,2)","v":0},null,null,null,{"$f":"ROUND(J76*$D$74,2)","v":0},null,null,null,{"$f":"SUM(F74:M74)","v":0}]
[{"$f":"IF(A74=\"F\",A74,\"\")","v":""}]
[{"$f":"IF(A75=\"F\",A75,\"\")","v":""},null,null,null,null,0.49,null,null,null,{"$f":"1-F76","v":0.51},null,null,null,{"$f":"IFERROR(E74/100,\"\")","v":0}]
[{"$f":"IF(D77>0,\"F\",\"\")","v":""},"FERRAGENS",null,{"$f":"Orçamento!X330","v":0},{"$f":"Orçamento!AA330","v":0},{"$f":"ROUND(F79*$D$77,2)","v":0},null,null,null,{"$f":"ROUND(J79*$D$77,2)","v":0},null,null,null,{"$f":"SUM(F77:M77)","v":0}]
[{"$f":"IF(A77=\"F\",A77,\"\")","v":""}]
[{"$f":"IF(A78=\"F\",A78,\"\")","v":""},null,null,null,null,0,null,null,null,{"$f":"1-F79","v":1},null,null,null,{"$f":"IFERROR(E77/100,\"\")","v":0}]
[{"$f":"IF(D80>0,\"F\",\"\")","v":""},"MARCENARIA",null,{"$f":"Orçamento!X331","v":0},{"$f":"Orçamento!AA331","v":0},{"$f":"ROUND(F82*$D$80,2)","v":0},null,null,null,{"$f":"ROUND(J82*$D$80,2)","v":0},null,null,null,{"$f":"SUM(F80:M80)","v":0}]
[{"$f":"IF(A80=\"F\",A80,\"\")","v":""}]
[{"$f":"IF(A81=\"F\",A81,\"\")","v":""},null,null,null,null,0.4,null,null,null,{"$f":"1-F82","v":0.6},null,null,null,{"$f":"IFERROR(E80/100,\"\")","v":0}]
[{"$f":"IF(D83>0,\"F\",\"\")","v":""},"ADMINISTRAÇÃO - MENSALISTAS",null,{"$f":"Orçamento!X332","v":0},{"$f":"Orçamento!AA332","v":0},{"$f":"ROUND(F85*$D$83,2)","v":0},null,null,null,{"$f":"ROUND(J85*$D$83,2)","v":0},null,null,null,{"$f":"SUM(F83:M83)","v":0}]
[{"$f":"IF(A83=\"F\",A83,\"\")","v":""}]
[{"$f":"IF(A84=\"F\",A84,\"\")","v":""},null,null,null,null,0.49,null,null,null,{"$f":"1-F85","v":0.51},null,null,null,{"$f":"IFERROR(E83/100,\"\")","v":0}]
[{"$f":"IF(D86>0,\"F\",\"\")","v":""},"PINTURA",null,{"$f":"Orçamento!X333","v":0},{"$f":"Orçamento!AA333","v":0},{"$f":"ROUND(F88*$D$86,2)","v":0},null,null,null,{"$f":"ROUND(J88*$D$86,2)","v":0},null,null,null,{"$f":"SUM(F86:M86)","v":0}]
[{"$f":"IF(A86=\"F\",A86,\"\")","v":""}]
[{"$f":"IF(A87=\"F\",A87,\"\")","v":""},null,null,null,null,0,null,null,null,{"$f":"1-F88","v":1},null,null,null,{"$f":"IFERROR(E86/100,\"\")","v":0}]
[{"$f":"IF(D89>0,\"F\",\"\")","v":""},"DIVERSOS",null,{"$f":"Orçamento!X334","v":0},{"$f":"Orçamento!AA334","v":0},{"$f":"ROUND(F91*$D$89,2)","v":0},null,null,null,{"$f":"ROUND(J91*$D$89,2)","v":0},null,null,null,{"$f":"SUM(F89:M89)","v":0}]
[{"$f":"IF(A89=\"F\",A89,\"\")","v":""}]
[{"$f":"IF(A90=\"F\",A90,\"\")","v":""},null,null,null,null,0.46,null,null,null,{"$f":"1-F91","v":0.54},null,null,null,{"$f":"IFERROR(E89/100,\"\")","v":0}]
["F","CUSTO DO ORÇAMENTO",null,{"$f":"SUM(D14:D91)","v":0},{"$f":"SUM(E14:E91)","v":0},{"$f":"F14+F17+F20+F23+F26+F29+F32+F35+F38+F41+F44+F47+F50+F53+F56+F59+F62+F65+F68+F71+F74+F77+F80+F83+F86+F89","v":0},null,null,null,{"$f":"J14+J17+J20+J23+J26+J29+J32+J35+J38+J41+J44+J47+J50+J53+J56+J59+J62+J65+J68+J71+J74+J77+J80+J83+J86+J89","v":0},null,null,null,{"$f":"N14+N17+N20+N23+N26+N29+N32+N35+N38+N41+N44+N47+N50+N53+N56+N59+N62+N65+N68+N71+N74+N77+N80+N83+N86+N89","v":0}]
["F","PERCENTUAIS:",null,null,null,{"$f":"IFERROR(F92/D92,\"\")","v":""},null,null,null,{"$f":"IFERROR(J92/D92,\"\")","v":""},null,null,null,{"$f":"SUM(F93:M93)","v":0}]
["F","TOTAIS ACUMULADOS:",null,null,null,{"$f":"F92","v":0},null,null,null,{"$f":"F94+J92","v":0}]
["F","PERCENTUAIS  ACUMULADOS:",null,null,null,{"$f":"F93","v":""},null,null,null,{"$f":"IFERROR(F95+J93,\"\")","v":""}]
["F"]
["F","OBSERVAÇÕES:"]
["F","Os pagamentos somente poderão ser efetuados mediante medição e atesto pelos técnicos da Secretaria da Educação. "]

{"sheet":"Composição BDI","index":4,"n_rows":44,"n_cols":9,"rows_kept":44,"cut":false,"hidden":false,"merged":[[11,0,11,3],[12,0,12,3],[13,0,13,3],[14,0,14,3],[5,0,5,3],[7,0,7,3],[6,0,6,3],[8,0,8,3],[10,0,10,3],[9,0,9,3],[1,0,1,3],[2,0,2,3],[0,0,0,3],[4,0,4,3],[3,0,3,3],[17,5,17,8],[16,0,16,3],[15,0,15,3],[43,0,43,3],[41,0,41,3],[42,0,42,3],[17,0,17,3],[35,0,35,3],[38,0,38,3],[37,0,37,3],[39,0,39,3],[28,0,28,2],[31,0,31,3],[32,0,32,3],[33,0,33,3],[34,0,34,3]]}
[]
["UNIDADE ESCOLAR"]
[{"$f":"Orçamento!$O$4","v":"COORDENAÇÃO REGIONAL DE EDUAÇÃO DE RIO VERDE"}]
[]
["OBRA"]
[{"$f":"Orçamento!$O$7","v":"IMPLANTAÇÃO"}]
[]
["ENDEREÇO"]
[{"$f":"Orçamento!$R$10","v":"RUA 15-A, BAIRRO POPULAR"}]
[]
["CIDADE"]
[{"$f":"Orçamento!$X$7","v":"RIO VERDE"}]
[]
["CRE"]
[{"$f":"Orçamento!$O$10","v":"RIO VERDE"}]
[]
["DETALHAMENTO DA COMPOSIÇÃO DE BDI"]
["COMPOSIÇÃO BDI PARA OBRAS CIVIS",null,null,null,null,"BDI CONSTRUÇÃO E REFORMA"]
["DESCRIÇÃO","COEF.","TAXA % (a.m)","% no preço de venda",null,"Situação","1º Quartil","Médio","3º Quartil"]
["1) COFINS",1,0.03,{"$f":"C20","v":0.03},null,{"$f":"IF(OR(C20<G20,C20>I20),\"FORA DO INTERVALO\",\"OK\")","v":"OK"},0.03,0.03,0.03]
["2) PIS",1,6.4999999999999997E-3,{"$f":"C21","v":6.4999999999999997E-3},null,{"$f":"IF(OR(C21<G21,C21>I21),\"FORA DO INTERVALO\",\"OK\")","v":"OK"},6.4999999999999997E-3,6.4999999999999997E-3,6.4999999999999997E-3]
["3) ISSQN",1,2.5000000000000001E-2,{"$f":"C22*B22","v":2.5000000000000001E-2},null,"OK",0.02,3.5000000000000003E-2,0.05]
["4) CPRB",1,4.4999999999999998E-2,{"$f":"C23","v":4.4999999999999998E-2},null,"OK",4.4999999999999998E-2,4.4999999999999998E-2,4.4999999999999998E-2]
["5) Administração Central",1,0.04,0.04,null,"OK",0.03,0.04,5.5E-2]
["6) Despesas Financeiras",1,5.5999999999999999E-3,5.5999999999999999E-3,null,"FORA DO INTERVALO",5.8999999999999999E-3,1.23E-2,1.3899999999999999E-2]
["7) Seguros + Garantias",1,1.1999999999999999E-3,1.1999999999999999E-3,null,"FORA DO INTERVALO",8.0000000000000002E-3,8.0000000000000002E-3,0.01]
["8) Risco",1,9.7000000000000003E-3,9.7000000000000003E-3,null,"OK",9.7000000000000003E-3,1.2699999999999999E-2,1.2699999999999999E-2]
["9) Lucro",1,6.8699999999999997E-2,6.8699999999999997E-2,null,"OK",6.1600000000000002E-2,7.3999999999999996E-2,8.9599999999999999E-2]
["BDI - FINAL",null,null,{"$f":"(((1+D24+D26+D27)*(1+D25)*(1+D28))/(1-(D20+D21+D22+D23))-1)","v":0.26400243116731992},null,{"$f":"IF(OR(D29<G29,D29>I29),\"FORA DO INTERVALO\",\"OK\")","v":"FORA DO INTERVALO"},0.2034,0.22120000000000001,0.25]
[]
["Notas:"]
["(1) e (2) Alíquota definida por lei."]
["(3) Alíquota e base de cálculo definidas pela legislação municipal."]
["(4) Alíquota definida pelas leis 12.546/11, 12844/13 e 13.161/15 (CPRB – contribuição previdenciária sobre a receita bruta)."]
["(5) Valores definidos a partir dos limites no Acórdão nº 2.622/2013 - TCU – Plenário. Valores entre o 1º e 3º quartis."]
["(6) Valor calculado pela expressão matemática do acórdão 2.369/2011 – TCU – Plenário e disponibilizado pela AGETOP em dezembro de 2018. (Foi utilizado para o cálculo a média da Taxa SELIC no período de 11/2017 a 10/2018)"]
[]
["(7) Valores definidos pela AGETOP a partir dos limites no Acórdão nº 2.622/2013 - TCU – Plenário. Valores médios. \n\nObservação da AGETOP: (Seguros contra erros de execução, incêndio e explosão, danos da natureza (vendaval, destelhamento, alagamento, inundação, desmoronamento, geadas etc.), emprego de material defeituoso ou inadequado, roubo e/ou furto qualificado, quebra de equipamentos, desmoronamento de estrutura, nas modalidades de Obras Civis em Construção (OCC); Instalação e Montagem (IM); e Obras Civis em Construção e Instalação e Montagem (OCC/IM). Bem como coberturas adicionais para ampliação dessas coberturas básicas, como: cobertura de responsabilidade civil geral, cobertura de responsabilidade civil cruzada, cobertura de despesas extraordinárias, cobertura de tumultos, cobertura de desentulho do local, cobertura de riscos do fabricante, dentre outras, incluindo o seguro de vida em grupo regido pela convenção coletiva dos trabalhadores na indústria da construção civil). A partir de 24/02/2015 por intermédio da Portaria 449/2015 a Presidência da AGETOP, na pessoa do Senhor Jayme Eduardo Rincon, determinou a exclusão dos valores referentes aos Seguros de Risco de Engenharia e Responsabilidade Civil do Profissional na composição do cálculo do B.D.I.."]
["(8) Valores definidos a partir dos limites no Acórdão nº 2.622/2013 - TCU – Plenário. Valores entre 1º e 3° quartis."]
["(9) Valores definidos a partir dos limites definidos no Acórdão nº 2.622/2013 - TCU – Plenário. Valores adotados e praticados no mercado ( “ ex ante ” ) ou aqueles entre os 1º e 3º quartis."]
[]
["(*) A fórmula para estipulação da taxa de BDI estimado adotado é a mesma que foi aplicada para a obtenção das tabelas contidas no Acórdão n. 2.622/2013 – TCUPlenário"]
[]
["Obs.: Para obras com valores superiores a R$ 20.000.000,00 sugere-se recalcular o BDI, dimensionando as taxas de administração central e lucro para patamares inferiores ao estipulado acima."]

{"sheet":"Relatório CENTRAL","index":5,"n_rows":39,"n_cols":5,"rows_kept":39,"cut":false,"hidden":false,"merged":[[9,1,9,4],[10,1,10,4],[38,1,38,2],[8,0,10,0],[5,3,5,4],[8,3,8,4],[0,1,0,4],[1,1,1,2],[1,3,1,4],[2,1,2,2],[2,3,2,4],[3,1,3,4],[4,1,4,2],[4,3,4,4],[5,1,5,2],[6,1,6,4],[7,1,7,2],[7,3,7,4],[8,1,8,2]]}
[]
[null,"UNIDADE ESCOLAR",null,"CIDADE"]
[null,{"$f":"Orçamento!$O$4","v":"COORDENAÇÃO REGIONAL DE EDUAÇÃO DE RIO VERDE"},null,{"$f":"Orçamento!$X$7","v":"RIO VERDE"}]
[]
[null,"OBRA",null,"CRE"]
[null,{"$f":"Orçamento!$O$7","v":"IMPLANTAÇÃO"},null,{"$f":"Orçamento!$O$10","v":"RIO VERDE"}]
[]
[null,"ENDEREÇO",null,"DATA"]
["FILTRO",{"$f":"Orçamento!$R$10","v":"RUA 15-A, BAIRRO POPULAR"},null,{"$f":"Orçamento!$S$7","v":"2020-07-23"}]
[]
[null,"RELATÓRIO CENTRAL"]
["↓","CÓDIGO","ETAPA","PREÇO  (R$) C/ BDI","PARTIC  ( % )"]
[{"$f":"IF(D13>0,\"F\",\"\")","v":""},{"$f":"Orçamento!O309","v":"a."},{"$f":"Orçamento!P309","v":"SERVIÇOS PRELIMINARES"},{"$f":"Orçamento!X309","v":0},{"$f":"Orçamento!AA309","v":0}]
[{"$f":"IF(D14>0,\"F\",\"\")","v":""},{"$f":"Orçamento!O310","v":"b."},{"$f":"Orçamento!P310","v":"TRANSPORTES"},{"$f":"Orçamento!X310","v":0},{"$f":"Orçamento!AA310","v":0}]
["",{"$f":"Orçamento!O311","v":"c."},{"$f":"Orçamento!P311","v":"SERVIÇO EM TERRA"},{"$f":"Orçamento!X311","v":0},{"$f":"Orçamento!AA311","v":0}]
["",{"$f":"Orçamento!O312","v":"d."},{"$f":"Orçamento!P312","v":"FUNDAÇÕES E SONDAGENS"},{"$f":"Orçamento!X312","v":0},{"$f":"Orçamento!AA312","v":0}]
["",{"$f":"Orçamento!O313","v":"e."},{"$f":"Orçamento!P313","v":"ESTRUTURA"},{"$f":"Orçamento!X313","v":0},{"$f":"Orçamento!AA313","v":0}]
["",{"$f":"Orçamento!O314","v":"f."},{"$f":"Orçamento!P314","v":"INSTALAÇÕES ELÉTRICAS"},{"$f":"Orçamento!X314","v":0},{"$f":"Orçamento!AA314","v":0}]
["",{"$f":"Orçamento!O315","v":"g."},{"$f":"Orçamento!P315","v":"INSTALAÇÕES HIDROSSANITÁRIAS"},{"$f":"Orçamento!X315","v":0},{"$f":"Orçamento!AA315","v":0}]
["",{"$f":"Orçamento!O316","v":"h"},{"$f":"Orçamento!P316","v":"INSTALAÇÕES ESPECIAIS"},{"$f":"Orçamento!X316","v":0},{"$f":"Orçamento!AA316","v":0}]
["",{"$f":"Orçamento!O317","v":"i."},{"$f":"Orçamento!P317","v":"ALVENARIAS E DIVISÓRIAS"},{"$f":"Orçamento!X317","v":0},{"$f":"Orçamento!AA317","v":0}]
["",{"$f":"Orçamento!O318","v":"j."},{"$f":"Orçamento!P318","v":"ALVENARIA AUTO-PORTANTE"},{"$f":"Orçamento!X318","v":0},{"$f":"Orçamento!AA318","v":0}]
["",{"$f":"Orçamento!O319","v":"k."},{"$f":"Orçamento!P319","v":"IMPERMEABILIZAÇÃO"},{"$f":"Orçamento!X319","v":0},{"$f":"Orçamento!AA319","v":0}]
["",{"$f":"Orçamento!O320","v":"l."},{"$f":"Orçamento!P320","v":"ISOLAMENTO TÉRMICO E ACÚSTICO"},{"$f":"Orçamento!X320","v":0},{"$f":"Orçamento!AA320","v":0}]
["",{"$f":"Orçamento!O321","v":"m."},{"$f":"Orçamento!P321","v":"ESTRUTURA DE MADEIRA"},{"$f":"Orçamento!X321","v":0},{"$f":"Orçamento!AA321","v":0}]
["",{"$f":"Orçamento!O322","v":"n."},{"$f":"Orçamento!P322","v":"ESTRUTURAS METÁLICAS"},{"$f":"Orçamento!X322","v":0},{"$f":"Orçamento!AA322","v":0}]
["",{"$f":"Orçamento!O323","v":"o."},{"$f":"Orçamento!P323","v":"COBERTURAS"},{"$f":"Orçamento!X323","v":0},{"$f":"Orçamento!AA323","v":0}]
["",{"$f":"Orçamento!O324","v":"p."},{"$f":"Orçamento!P324","v":"ESQUADRIAS DE MADEIRA"},{"$f":"Orçamento!X324","v":0},{"$f":"Orçamento!AA324","v":0}]
["",{"$f":"Orçamento!O325","v":"q."},{"$f":"Orçamento!P325","v":"ESQUADRIAS METÁLICAS"},{"$f":"Orçamento!X325","v":0},{"$f":"Orçamento!AA325","v":0}]
["",{"$f":"Orçamento!O326","v":"r."},{"$f":"Orçamento!P326","v":"VIDROS"},{"$f":"Orçamento!X326","v":0},{"$f":"Orçamento!AA326","v":0}]
["",{"$f":"Orçamento!O327","v":"s."},{"$f":"Orçamento!P327","v":"REVESTIMENTO DE PAREDE"},{"$f":"Orçamento!X327","v":0},{"$f":"Orçamento!AA327","v":0}]
["",{"$f":"Orçamento!O328","v":"t."},{"$f":"Orçamento!P328","v":"FORROS"},{"$f":"Orçamento!X328","v":0},{"$f":"Orçamento!AA328","v":0}]
["",{"$f":"Orçamento!O329","v":"u."},{"$f":"Orçamento!P329","v":"REVESTIMENTO DE PISO"},{"$f":"Orçamento!X329","v":0},{"$f":"Orçamento!AA329","v":0}]
["",{"$f":"Orçamento!O330","v":"v."},{"$f":"Orçamento!P330","v":"FERRAGENS"},{"$f":"Orçamento!X330","v":0},{"$f":"Orçamento!AA330","v":0}]
["",{"$f":"Orçamento!O331","v":"w."},{"$f":"Orçamento!P331","v":"MARCENARIA"},{"$f":"Orçamento!X331","v":0},{"$f":"Orçamento!AA331","v":0}]
["",{"$f":"Orçamento!O332","v":"x."},{"$f":"Orçamento!P332","v":"ADMINISTRAÇÃO"},{"$f":"Orçamento!X332","v":0},{"$f":"Orçamento!AA332","v":0}]
["",{"$f":"Orçamento!O333","v":"y."},{"$f":"Orçamento!P333","v":"PINTURA"},{"$f":"Orçamento!X333","v":0},{"$f":"Orçamento!AA333","v":0}]
["",{"$f":"Orçamento!O334","v":"z."},{"$f":"Orçamento!P334","v":"DIVERSOS"},{"$f":"Orçamento!X334","v":0},{"$f":"Orçamento!AA334","v":0}]
["F","TOTAL GERAL DO ORÇAMENTO (R$) C/BDI",null,{"$f":"SUM(D13:D38)","v":0},{"$f":"SUM(E13:E38)","v":0}]

{"sheet":"Parc Maior Relev","index":6,"n_rows":32,"n_cols":7,"rows_kept":32,"cut":false,"hidden":false,"merged":[[32,3,32,7],[30,1,30,6],[10,1,10,6],[0,1,0,6],[1,1,1,3],[1,4,1,6],[2,1,2,3],[2,4,2,6],[3,1,3,6],[4,1,4,3],[4,4,4,6],[8,1,8,3],[8,4,8,6],[9,1,9,6],[5,1,5,3],[5,4,5,6],[6,1,6,6],[7,1,7,3],[7,4,7,6]]}
[]
[null,"UNIDADE ESCOLAR",null,null,"CÓDIGO INEP"]
[null,{"$f":"Orçamento!$O$4","v":"COORDENAÇÃO REGIONAL DE EDUAÇÃO DE RIO VERDE"},null,null,{"$f":"Orçamento!$X$4","v":0}]
[]
[null,"OBRA",null,null,"CIDADE"]
[null,{"$f":"Orçamento!$O$7","v":"IMPLANTAÇÃO"},null,null,{"$f":"Orçamento!$X$7","v":"RIO VERDE"}]
[]
[null,"CRE",null,null,"ÁREA TOTAL CONSTRUÍDA (M²)"]
[null,{"$f":"Orçamento!$O$10","v":"RIO VERDE"},null,null,{"$f":"Orçamento!$X$13","v":100.68}]
[]
["FILTRO","PARCELA DE MAIOR RELEVÂNCIA"]
[{"$f":"IF(G13>0,\"F\",\"\")","v":""},"CÓDIGO","SERVIÇO","DESCRIÇÃO","UNID","QUANT","PARC. MAIOR RELEV (100%)"]
[{"$f":"IF(G13>0,\"F\",\"\")","v":""},"f.","INSTALAÇÕES ELÉTRICAS","SUBESTAÇÃO","KVA",{"$f":"SUMIF(Orçamento!$R$20:$R$290,'Parc Maior Relev'!D13,Orçamento!$T$20:$T$290)","v":0},{"$f":"F13","v":0}]
[{"$f":"IF(SUM(G15:G29)>0,\"F\",\"\")","v":"F"},"CÓDIGO","SERVIÇO","DESCRIÇÃO","UNID","QUANT","PARC. MAIOR RELEV (50%)"]
[{"$f":"IF(G15>0,\"F\",\"\")","v":""},"e.","ESTRUTURA","CONCRETO","M3",{"$f":"SUMIF(Orçamento!$R$20:$R$290,'Parc Maior Relev'!D15,Orçamento!$T$20:$T$290)","v":0},{"$f":"F15*0.5","v":0}]
[{"$f":"IF(G16>0,\"F\",\"\")","v":""},"f.","INSTALAÇÕES ELÉTRICAS","INSTALAÇÕES ELÉTRICAS","KVA",{"$f":"SUMIF(Orçamento!$R$20:$R$290,'Parc Maior Relev'!D16,Orçamento!$T$20:$T$290)","v":0},{"$f":"F16*0.5","v":0}]
[{"$f":"IF(G17>0,\"F\",\"\")","v":""},"o.","COBERTURAS","COBERTURA CERÂMICA","M2",{"$f":"SUMIF(Orçamento!$R$20:$R$290,'Parc Maior Relev'!D17,Orçamento!$T$20:$T$290)","v":0},0]
["","o.","COBERTURAS","COBERTURA COM TELHA METÁLICA","M2",{"$f":"SUMIF(Orçamento!$R$20:$R$290,'Parc Maior Relev'!D18,Orçamento!$T$20:$T$290)","v":0},0]
["","s.","REVESTIMENTO DE PAREDE","CHAPISCO","M2",{"$f":"SUMIF(Orçamento!$R$20:$R$290,'Parc Maior Relev'!D19,Orçamento!$T$20:$T$290)","v":0},0]
["F","s.","REVESTIMENTO DE PAREDE","REBOCO","M2",268.10000000000002,134.05000000000001]
["","s.","REVESTIMENTO DE PAREDE","REVESTIMENTO CERÂMICO","M2",{"$f":"SUMIF(Orçamento!$R$20:$R$290,'Parc Maior Relev'!D21,Orçamento!$T$20:$T$290)","v":0},0]
["","t.","FORROS","FORRO DE GESSO","M2",{"$f":"SUMIF(Orçamento!$R$20:$R$290,'Parc Maior Relev'!D22,Orçamento!$T$20:$T$290)","v":0},0]
["","t.","FORROS","FORRO DE PVC","M2",{"$f":"SUMIF(Orçamento!$R$20:$R$290,'Parc Maior Relev'!D23,Orçamento!$T$20:$T$290)","v":0},0]
["","t.","FORROS","FORRO DE GESSO ACARTONADO","M2",{"$f":"SUMIF(Orçamento!$R$20:$R$290,'Parc Maior Relev'!D24,Orçamento!$T$20:$T$290)","v":0},0]
["F","u.","REVESTIMENTO DE PISO","PISO DE GRANITINA","M2",90.8,45.4]
["","u.","REVESTIMENTO DE PISO","PISO LAMINADO","M2",{"$f":"SUMIF(Orçamento!$R$20:$R$290,'Parc Maior Relev'!D26,Orçamento!$T$20:$T$290)","v":0},0]
["","u.","REVESTIMENTO DE PISO","PISO DE CONCRETO DESEMPENADO","M2",{"$f":"SUMIF(Orçamento!$R$20:$R$290,'Parc Maior Relev'!D27,Orçamento!$T$20:$T$290)","v":0},0]
["","u.","REVESTIMENTO DE PISO","PISO CERÂMICO","M2",{"$f":"SUMIF(Orçamento!$R$20:$R$290,'Parc Maior Relev'!D28,Orçamento!$T$20:$T$290)","v":0},0]
["","y.","PINTURA","PINTURA","M2",{"$f":"SUMIF(Orçamento!$R$20:$R$290,'Parc Maior Relev'!D29,Orçamento!$T$20:$T$290)","v":0},0]
["F"]
["F","(*) Para os fins do inciso I dp § 1º do Art. 30 da Lei Federal 8.666/93, são consideradas parcelas de maior relevância técnica as execuções apresentadas"]
["F"]

{"sheet":"Composições","index":7,"n_rows":81,"n_cols":10,"rows_kept":81,"cut":false,"hidden":false,"merged":[[69,5,70,5],[69,6,69,7],[69,8,69,9],[73,1,73,7],[80,1,80,7],[69,0,70,0],[69,1,70,1],[69,2,70,2],[69,3,70,3],[69,4,70,4],[59,5,60,5],[59,6,59,7],[59,8,59,9],[63,1,63,7],[67,1,67,7],[59,0,60,0],[59,1,60,1],[59,2,60,2],[59,3,60,3],[59,4,60,4],[49,5,50,5],[49,6,49,7],[49,8,49,9],[53,1,53,7],[57,1,57,7],[49,0,50,0],[49,1,50,1],[49,2,50,2],[49,3,50,3],[49,4,50,4],[27,5,28,5],[27,6,27,7],[27,8,27,9],[32,1,32,7],[47,1,47,7],[27,0,28,0],[27,1,28,1],[27,2,28,2],[27,3,28,3],[27,4,28,4],[15,5,16,5],[15,6,15,7],[15,8,15,9],[20,1,20,7],[25,1,25,7],[15,0,16,0],[15,1,16,1],[15,2,16,2],[15,3,16,3],[15,4,16,4],[9,0,9,2],[9,3,9,6],[10,0,10,9],[11,0,11,2],[11,3,11,6],[11,7,11,8],[6,0,6,6],[8,0,8,2],[8,3,8,6],[8,7,8,8],[2,0,2,6],[3,0,3,6],[14,0,14,9],[12,0,12,2],[12,3,12,6],[0,0,0,9],[2,7,2,9],[3,7,3,9],[5,7,5,9],[6,7,6,9],[5,0,5,6],[9,8,9,9],[12,8,12,9],[13,0,13,9],[7,0,7,9],[4,0,4,9],[1,0,1,9]]}
[]
[]
["UNIDADE ESCOLAR",null,null,null,null,null,null,"CÓDIGO INEP"]
[{"$f":"Orçamento!$O$4","v":"COORDENAÇÃO REGIONAL DE EDUAÇÃO DE RIO VERDE"},null,null,null,null,null,null,{"$f":"Orçamento!$X$4","v":0}]
[]
["OBRA",null,null,null,null,null,null,"CIDADE"]
[{"$f":"Orçamento!$O$7","v":"IMPLANTAÇÃO"},null,null,null,null,null,null,{"$f":"Orçamento!$X$7","v":"RIO VERDE"}]
[]
["CRE",null,null,"ENDEREÇO",null,null,null,"REFERÊNCIA AGETOP"]
[{"$f":"Orçamento!$O$10","v":"RIO VERDE"},null,null,{"$f":"Orçamento!$R$10","v":"RUA 15-A, BAIRRO POPULAR"},null,null,null,{"$f":"Orçamento!$S$10","v":"ABR/19"},{"$f":"Orçamento!$T$10","v":"DESONERADA"}]
[]
["DATA",null,null,"ÁREA TOTAL CONSTRUÍDA (M²)",null,null,null,"REFERÊNCIA SINAPI"]
[{"$f":"Orçamento!$S$7","v":"2020-07-23"},null,null,{"$f":"Orçamento!$X$13","v":100.68},null,null,null,{"$f":"Orçamento!$X$10","v":"ABR/20"},{"$f":"Orçamento!$Y$10","v":"DESONERADA"}]
[]
["COMPOSIÇÕES DE CUSTOS UNITÁRIOS - SEE-GO"]
[415,"FONTE","CÓDIGO","DESCRIÇÃO","UNIDADE","COEFIC.","CUSTO UNITÁRIO",null,"CUSTO  TOTAL (A) + (B) + (C) + (D) + (E)"]
[null,null,null,null,null,null,"DESONERADO","NÃO DESONER.","DESONERADO","NÃO DESONER."]
[null,"COMPOSIÇÃO","COMP 415_SEE","PEITORIL EM GRANITO CINZA, LARGURA VARIÁVEL E PINGADEIRA","M2",null,null,null,204.79,207.57999999999998]
[null,"AGETOP_I",28,"AZULEJISTA","h     ",0.66910000000000003,13.95,16.16,9.33,10.81]
[null,"AGETOP_I",5,"SERVENTE","h     ",0.93879999999999997,8.75,10.14,8.2100000000000009,9.52]
[null,"MÃO DE OBRA (B) - TOTAL",null,null,null,null,null,null,17.54,20.329999999999998]
[null,"AGETOP_I",1421,"GRANITO POLIDO P/BANCADA 2 CM","m2",1,180,180,180,180]
[null,"AGETOP_I",1215,"CIMENTO PORTLAND C.P. 32","Kg",10.34,0.39,0.39,4.03,4.03]
[null,"AGETOP_I",2690,"ARGAMASSA DE REJUNTAMENTO","Kg",0.32,3.54,3.54,1.1299999999999999,1.1299999999999999]
[null,"AGETOP_I",104,"AREIA MEDIA ","m3",2.52E-2,82.85,82.85,2.09,2.09]
[null,"MATERIAL (C) - TOTAL",null,null,null,null,null,null,187.25,187.25]
[]
[84,"FONTE","CÓDIGO","DESCRIÇÃO","UNIDADE","COEFIC.","CUSTO UNITÁRIO",null,"CUSTO  TOTAL (A) + (B) + (C) + (D) + (E)"]
[null,null,null,null,null,null,"DESONERADO","NÃO DESONER.","DESONERADO","NÃO DESONER."]
[null,"COMPOSIÇÃO","COMP 084_SEE","GUARDA-CORPO COM CORRIMÃO - SEDUC","M",null,null,null,206.14000000000001,211.22000000000003]
[null,"AGETOP_I",25,"OFICIAL \"B\"","h     ",1.1000000000000001,13.95,16.16,15.35,17.78]
[null,"AGETOP_I",8,"AJUDANTE","h     ",1.1000000000000001,8.75,10.14,9.6300000000000008,11.15]
[null,"MÃO DE OBRA (B) - TOTAL",null,null,null,null,null,null,24.98,28.93]
[null,"AGETOP_I",2376,"TUBO INDUSTRIAL 2\" CHAPA 13 ","Kg",7.7778,5.23,5.23,40.68,40.68]
[null,"AGETOP_I",2504,"TUBO INDUSTRIAL D=25 MM CHAPA 13 ","Kg",4.6319999999999997,5.07,5.07,23.48,23.48]
[null,"AGETOP_I",2377,"TUBO INDUSTRIAL 40X40 CH.13","Kg",6.3419999999999996,5.07,5.07,32.15,32.15]
[null,"AGETOP_I",2421,"TUBO INDUSTRIAL 1.1/2\" CHAPA 13 ","Kg",1.4862,5.07,5.07,7.54,7.54]
[null,"AGETOP_I",2417,"MASSA PLASTICA","Kg",0.2041,10.58,10.58,2.16,2.16]
[null,"AGETOP_I",2246,"ELETRODO 2.5 OK","Kg",0.11459999999999999,8.6999999999999993,8.6999999999999993,1,1]
[null,"AGETOP_I",1672,"LIXA PARA FERRO ( NÚMERO 100 )","un",0.25509999999999999,2.12,2.12,0.54,0.54]
[null,"AGETOP_I",1264,"DISCO DE DESBASTE 7/8\" P/ CONC./FERRO (1/4\" X 7\")","un",5.0999999999999997E-2,7,7,0.36,0.36]
[null,"AGETOP_I",1334,"DISCO DE CORTE DIAM. 5/8\"- 10\"","un",0.373,5.5,5.5,2.0499999999999998,2.0499999999999998]
[null,"AGETOP_I",2902,"FABRICAÇÃO / MONTAGEM","un",1,50.44,50.44,50.44,50.44]
[null,"AGETOP_I",2150,"CHAPA DE FERRO DOBRADA No.13","Kg",0.43519999999999998,5.28,5.28,2.2999999999999998,2.2999999999999998]
[null,"AGETOP_I",2719,"CHAPA PERFILADA 3/16\"","Kg",1.0979999999999999,5.04,5.04,5.53,5.53]
[null,"AGETOP_I",2436,"ACO CA-25 - 6,3 MM (1/4\") - BARRA LISA A-36","Kg",0.38124999999999998,5.13,5.13,1.96,1.96]
[null,"AGETOP",261602,"PINT.ESMALTE/ESQUAD.FERRO C/FUNDO ANTICOR.","m2    ",0.78,14.07,15.51,10.97,12.1]
[null,"MATERIAL (C) - TOTAL",null,null,null,null,null,null,181.16000000000003,182.29000000000002]
[]
[24,"FONTE","CÓDIGO","DESCRIÇÃO","UNIDADE","COEFIC.","CUSTO UNITÁRIO",null,"CUSTO  TOTAL (A) + (B) + (C) + (D) + (E)"]
[null,null,null,null,null,null,"DESONERADO","NÃO DESONER.","DESONERADO","NÃO DESONER."]
[null,"COMPOSIÇÃO","COMP 024_SEE","SINALIZADOR FOTOLUMINESCENTE PARA EXTINTOR","UN ",null,"-","-",25.319999999999997,25.439999999999998]
[null,"AGETOP_I",5,"SERVENTE","h     ",0.09,8.75,10.14,0.79,0.91]
[null,"MÃO DE OBRA (B) - TOTAL",null,null,null,null,null,null,0.79,0.91]
[null,"AGETOP_I",3070,"BUCHA DE NYLON S-6","un",2,0.04,0.04,0.08,0.08]
[null,"AGETOP_I",3393,"PARAFUSO P/BUCHA S-6","un",2,0.08,0.08,0.16,0.16]
[null,"SINAPI_I",37556,"PLACA DE SINALIZACAO DE SEGURANCA CONTRA INCENDIO, FOTOLUMINESCENTE, QUADRADA, *20 X 20* CM, EM PVC *2* MM ANTI-CHAMAS (SIMBOLOS, CORES E PICTOGRAMAS CONFORME NBR 13434)","UN    ",1,24.29,24.29,24.29,24.29]
[null,"MATERIAL (C) - TOTAL",null,null,null,null,null,null,24.529999999999998,24.529999999999998]
[]
[25,"FONTE","CÓDIGO","DESCRIÇÃO","UNIDADE","COEFIC.","CUSTO UNITÁRIO",null,"CUSTO  TOTAL (A) + (B) + (C) + (D) + (E)"]
[null,null,null,null,null,null,"DESONERADO","NÃO DESONER.","DESONERADO","NÃO DESONER."]
[null,"COMPOSIÇÃO","COMP 025_SEE","SINALIZADOR FOTOLUMINESCENTE DE EMERGÊNCIA","UN ",null,"-","-",25.319999999999997,25.439999999999998]
[null,"AGETOP_I",5,"SERVENTE","h     ",0.09,8.75,10.14,0.79,0.91]
[null,"MÃO DE OBRA (B) - TOTAL",null,null,null,null,null,null,0.79,0.91]
[null,"AGETOP_I",3070,"BUCHA DE NYLON S-6","un",2,0.04,0.04,0.08,0.08]
[null,"AGETOP_I",3393,"PARAFUSO P/BUCHA S-6","un",2,0.08,0.08,0.16,0.16]
[null,"SINAPI_I",37556,"PLACA DE SINALIZACAO DE SEGURANCA CONTRA INCENDIO, FOTOLUMINESCENTE, QUADRADA, *20 X 20* CM, EM PVC *2* MM ANTI-CHAMAS (SIMBOLOS, CORES E PICTOGRAMAS CONFORME NBR 13434)","UN    ",1,24.29,24.29,24.29,24.29]
[null,"MATERIAL (C) - TOTAL",null,null,null,null,null,null,24.529999999999998,24.529999999999998]
[]
[277,"FONTE","CÓDIGO","DESCRIÇÃO","UNIDADE","COEFIC.","CUSTO UNITÁRIO",null,"CUSTO  TOTAL (A) + (B) + (C) + (D) + (E)"]
[null,null,null,null,null,null,"DESONERADO","NÃO DESONER.","DESONERADO","NÃO DESONER."]
[null,"COMPOSIÇÃO","COMP 277_SEE","MARCAÇÃO NO PISO - 1X1 M PARA EXTINTOR","M2",null,null,null,29.69,29.76]
[null,"AGETOP_I",5,"SERVENTE","h     ",3.3300000000000003E-2,8.75,10.14,0.28999999999999998,0.34]
[null,"MÃO DE OBRA (B) - TOTAL",null,null,null,null,null,null,0.28999999999999998,0.34]
[null,"SINAPI_I",5318,"SOLVENTE DILUENTE A BASE DE AGUARRAS","L     ",0.13,11.98,11.98,1.56,1.56]
[null,"SINAPI",5824,"CAMINHÃO TOCO, PBT 16.000 KG, CARGA ÚTIL MÁX. 10.685 KG, DIST. ENTRE EIXOS 4,8 M, POTÊNCIA 189 CV, INCLUSIVE CARROCERIA FIXA ABERTA DE MADEIRA P/ TRANSPORTE GERAL DE CARGA SECA, DIMEN. APROX. 2,5 X 7,00 X 0,50 M - CHP DIURNO. AF_06/2014","CHP",3.3E-3,115.5,118.69,0.38,0.39]
[null,"SINAPI_I",7343,"TINTA A BASE DE RESINA ACRILICA, PARA SINALIZACAO HORIZONTAL VIARIA (NBR 11862)","L     ",0.6,12.82,12.82,7.69,7.69]
[null,"SINAPI_I",7348,"TINTA ACRILICA PREMIUM PARA PISO","L     ",0.03,13.96,13.96,0.42,0.42]
[null,"SINAPI_I",25972,"MICROESFERAS DE VIDRO PARA SINALIZACAO HORIZONTAL VIARIA, TIPO I-B (PREMIX) - NBR 16184","KG    ",2.14,8.8800000000000008,8.8800000000000008,19,19]
[null,"SINAPI",95133,"MÁQUINA DEMARCADORA DE FAIXA DE TRÁFEGO À FRIO, AUTOPROPELIDA, POTÊNCIA 38 HP - CHP DIURNO. AF_07/2016","CHP",3.3E-3,105.93,109.48,0.35,0.36]
[null,"MATERIAL (C) - TOTAL",null,null,null,null,null,null,29.400000000000002,29.42]