{"text_format":"1","workbook":"xlsx","n_sheets":8,"sheets":["Orçamento","Resumo ","Somatório","Cronog_75_Dias","Composição BDI","Relatório CENTRAL","Parc Maior Relev","Composições"],"not_rendered":{"charts":0,"images":4,"macros":1,"external_links":1,"defined_names":105,"comments":3,"pivot_tables":0},"unopened":[],"bounds":{"document_bytes":16777216,"sheet_cells":100000,"rows_first":2000,"rows_last":500,"rows_between":2000,"halvings":0,"cell_chars":16384,"cell_head_chars":4096},"cells_cut":0,"cells_raw":0,"read":"whole","date_system":"1900"}

{"sheet":"Orçamento","index":0,"n_rows":517,"n_cols":27,"rows_kept":517,"cut":false,"hidden":false,"merged":[[8,23,8,25],[498,18,498,22],[499,15,499,17],[499,18,499,22],[500,15,500,17],[500,18,500,22],[495,15,495,17],[495,18,495,22],[496,15,496,17],[496,18,496,22],[497,15,497,17],[497,18,497,22],[491,14,491,26],[492,18,492,22],[493,15,493,17],[493,18,493,22],[478,15,478,17],[458,15,458,17],[513,18,513,22],[501,15,501,17],[501,18,501,22],[502,15,502,17],[502,18,502,22],[503,15,503,17],[503,18,503,22],[507,15,507,17],[507,18,507,22],[508,15,508,17],[508,18,508,22],[509,15,509,17],[498,15,498,17],[504,15,504,17],[504,18,504,22],[505,15,505,17],[505,18,505,22],[506,15,506,17],[506,18,506,22],[510,23,510,25],[511,23,511,25],[512,23,512,25],[513,23,513,25],[514,23,514,25],[515,23,515,25],[516,23,516,25],[485,14,485,17],[492,15,492,17],[516,18,516,22],[513,14,513,17],[510,15,510,17],[510,18,510,22],[511,15,511,17],[511,18,511,22],[512,15,512,17],[512,18,512,22],[515,18,515,22],[514,18,514,22],[449,16,449,24],[450,16,450,24],[451,16,451,24],[10,14,10,26],[13,14,13,26],[2,14,2,22],[3,14,3,22],[5,18,5,22],[6,18,6,22],[11,18,11,22],[12,18,12,22],[6,14,6,17],[5,14,5,17],[3,23,3,25],[2,23,2,25],[5,23,5,25],[6,23,6,25],[8,18,8,20],[441,17,446,17],[447,22,447,24],[441,22,441,24],[442,22,442,24],[443,22,443,24],[9,24,9,25],[452,16,452,24],[458,23,458,25],[474,23,474,25],[475,23,475,25],[494,15,494,17],[494,18,494,22],[453,16,453,24],[471,15,471,17],[472,15,472,17],[457,14,457,26],[458,18,458,22],[459,18,459,22],[467,18,467,22],[468,18,468,22],[469,18,469,22],[470,18,470,22],[482,18,482,22],[479,15,479,17],[459,15,459,17],[460,15,460,17],[461,15,461,17],[462,15,462,17],[463,15,463,17],[464,15,464,17],[465,15,465,17],[466,15,466,17],[467,15,467,17],[476,23,476,25],[477,23,477,25],[475,15,475,17],[476,15,476,17],[477,15,477,17],[478,23,478,25],[473,15,473,17],[474,15,474,17],[472,23,472,25],[473,23,473,25],[471,23,471,25],[488,18,488,22],[464,18,464,22],[465,18,465,22],[463,18,463,22],[472,18,472,22],[454,18,454,24],[460,18,460,22],[461,18,461,22],[462,18,462,22],[485,18,485,22],[483,18,483,22],[484,18,484,22],[474,18,474,22],[481,18,481,22],[477,18,477,22],[479,18,479,22],[475,18,475,22],[476,18,476,22],[485,23,485,25],[479,23,479,25],[480,23,480,25],[481,23,481,25],[482,23,482,25],[483,23,483,25],[487,18,487,22],[0,14,0,24],[8,14,8,16],[9,14,9,16],[11,14,11,16],[12,14,12,16],[14,14,14,24],[1,14,1,24],[4,14,4,24],[7,14,7,24],[471,18,471,22],[468,15,468,17],[469,15,469,17],[470,15,470,17],[480,18,480,22],[478,18,478,22],[486,18,486,22],[473,18,473,22],[466,18,466,22],[480,15,480,17],[481,15,481,17],[483,15,483,17],[484,15,484,17],[486,23,486,25],[507,23,507,25],[508,23,508,25],[509,23,509,25],[492,23,492,25],[493,23,493,25],[494,23,494,25],[495,23,495,25],[496,23,496,25],[497,23,497,25],[498,23,498,25],[499,23,499,25],[500,23,500,25],[501,23,501,25],[502,23,502,25],[503,23,503,25],[504,23,504,25],[505,23,505,25],[506,23,506,25],[482,15,482,17],[487,23,487,25],[488,23,488,25],[509,18,509,22],[445,22,445,24],[446,22,446,24],[6,12,6,13],[5,12,5,13],[12,23,12,25],[11,23,11,25],[9,19,9,22],[484,23,484,25],[459,23,459,25],[460,23,460,25],[461,23,461,25],[462,23,462,25],[463,23,463,25],[464,23,464,25],[465,23,465,25],[466,23,466,25],[467,23,467,25],[468,23,468,25],[469,23,469,25],[470,23,470,25]]}
[]
[]
[null,null,null,null,null,null,null,null,null,null,null,null,null,null,"UNIDADE ESCOLAR",null,null,null,null,null,null,null,null,"CÓDIGO INEP"]
[null,null,null,null,null,null,null,null,null,null,null,null,{"$f":"IF($M$7=\"MANUAL\",\"DESPROTEJA A PLANILHA PARA FORMATAR\",\"\")","v":""},null,"COLÉGIO ESTADUAL MARIA ASSUNÇÃO DE AZEVEDO",null,null,null,null,null,null,null,null,52015041]
[]
["Nmax",null,null,null,null,null,null,null,null,null,null,null,null,null,"OBRA",null,null,null,"DATA",null,null,null,null,"CIDADE"]
[{"$f":"MAX($C$18:$C$441)","v":4},null,null,null,null,null,null,null,null,null,null,null,null,null,"REFORMA E AMPLIAÇÃO",null,null,null,"2020-07-07",null,null,null,null,"CARMO DO RIO VERDE"]
[]
[null,null,null,null,null,null,null,null,null,null,null,null,null,null,"CRE",null,null,"ENDEREÇO","REFERÊNCIA AGETOP",null,null,null,null,"REFERÊNCIA SINAPI"]
[null,null,null,null,null,null,null,null,null,null,null,null,null,null,"CRE-CERES",null,null," RUA REINALDO JOSE DE SOUZA 400 Nº 400 , CENTRO , CEP:76340-000","ABR/19","DESONERADA",null,null,null,"ABR/20","DESONERADA"]
[]
[null,null,null,null,null,null,null,null,null,null,null,null,null,null,"ÁREA EXISTENTE (M²)",null,null,"ÁREA A CONSTRUIR (M²)","ÁREA A DEMOLIR (M²)",null,null,null,null,"ÁREA TOTAL CONSTRUÍDA (M²)"]
[null,null,null,null,null,null,null,null,null,null,null,null,null,null,2712.76,null,null,58.28,51.59,null,null,null,null,2719.4500000000003]
[]
[null,null,null,null,null,null,null,null,null,null,null,"FILTRO",null,null,"PLANILHA ORÇAMENTÁRIA"]
["Nível E","Save Nivel","Nível C","Altura","n1","n2","n3","n4","n5","Czero","Cnível","↓","Nível","Nível Corrigido","ITEM","TABELA","CODIGO","DESCRIÇÃO DOS SERVIÇOS","UNID","QUANT","REPET","QUANT TOTAL","MAT","MO","T.SERVIÇO UNIT","VALOR TOTAL","OBSERVAÇÕES¹"]
[{"$f":"CHOOSE(1+LOG(1+2*(ORÇAMENTO.Nivel=\"Nível 1\")+4*(ORÇAMENTO.Nivel=\"Nível 2\")+8*(ORÇAMENTO.Nivel=\"Nível 3\")+16*(ORÇAMENTO.Nivel=\"Nível 4\")+32*(ORÇAMENTO.Nivel=\"Serviço\"),2),0,1,2,3,4,\"S\")","v":"S"},{"$f":"IF(OR(C17=\"s\",C17=0),OFFSET(B17,-1,0),C17)","v":"Save Nivel"},{"$f":"IF(OFFSET(C17,-1,0)=\"L\",1,IF(OFFSET(C17,-1,0)=1,2,IF(OR(A17=\"s\",A17=0),\"S\",IF(AND(OFFSET(C17,-1,0)=2,A17=4),3,IF(AND(OR(OFFSET(C17,-1,0)=\"s\",OFFSET(C17,-1,0)=0),A17<>\"s\",A17>OFFSET(B17,-1,0)),OFFSET(B17,-1,0),A17)))))","v":"S"},{"$f":"IF(OR(C17=\"S\",C17=0),0,IF(ISERROR(K17),J17,SMALL(J17:K17,1)))","v":0},{"$f":"IF($C17=1,OFFSET(E17,-1,0)+1,OFFSET(E17,-1,0))","v":"n1"},{"$f":"IF($C17=1,0,IF($C17=2,OFFSET(F17,-1,0)+1,OFFSET(F17,-1,0)))","v":"n2"},{"$f":"IF(AND($C17<=2,$C17<>0),0,IF($C17=3,OFFSET(G17,-1,0)+1,OFFSET(G17,-1,0)))","v":"n3"},{"$f":"IF(AND($C17<=3,$C17<>0),0,IF($C17=4,OFFSET(H17,-1,0)+1,OFFSET(H17,-1,0)))","v":"n4"},{"$f":"IF(AND($C17<=4,$C17<>0),0,IF(AND($C17=\"S\",$Y17>0),OFFSET(I17,-1,0)+1,OFFSET(I17,-1,0)))","v":"n5"},{"$f":"IF(OR($C17=\"S\",$C17=0),0,MATCH(0,OFFSET($D17,1,$C17,ROW($C$441)-ROW($C17)),0))","v":0},{"$f":"IF(OR($C17=\"S\",$C17=0),0,MATCH(OFFSET($D17,0,$C17)+1,OFFSET($D17,1,$C17,ROW($C$441)-ROW($C17)),0))","v":0},{"$f":"IF(OR(Y17>0,$C17=1),\"F\",\"\")","v":""},"Serviço",{"$f":"CHOOSE(1+LOG(1+2*(C17=1)+4*(C17=2)+8*(C17=3)+16*(C17=4)+32*(C17=\"S\"),2),\"\",\"Nível 1\",\"Nível 2\",\"Nível 3\",\"Nível 4\",\"Serviço\")","v":"Serviço"},"-","SINAPI",null,"(sem código)","-",null,"REPET","-",0,0,0,"-",""]
[0,null,"L",{"$f":"COUNTA(OFFSET(D18,1,0):D$441)","v":422},{"$f":"LEFT(O19,1)-1","v":0},null,null,null,null,null,null,"F","LOTE","LOTE","REFORMA E AMPLIAÇÃO - COLÉGIO ESTADUAL MARIA ASSUNÇÃO DE AZEVEDO",null,null,null,null,null,null,null,null,null,null,0]
[{"$f":"CHOOSE(1+LOG(1+2*(ORÇAMENTO.Nivel=\"Nível 1\")+4*(ORÇAMENTO.Nivel=\"Nível 2\")+8*(ORÇAMENTO.Nivel=\"Nível 3\")+16*(ORÇAMENTO.Nivel=\"Nível 4\")+32*(ORÇAMENTO.Nivel=\"Serviço\"),2),0,1,2,3,4,\"S\")","v":1},{"$f":"IF(OR(C19=\"s\",C19=0),OFFSET(B19,-1,0),C19)","v":1},{"$f":"IF(OFFSET(C19,-1,0)=\"L\",1,IF(OFFSET(C19,-1,0)=1,2,IF(OR(A19=\"s\",A19=0),\"S\",IF(AND(OFFSET(C19,-1,0)=2,A19=4),3,IF(AND(OR(OFFSET(C19,-1,0)=\"s\",OFFSET(C19,-1,0)=0),A19<>\"s\",A19>OFFSET(B19,-1,0)),OFFSET(B19,-1,0),A19)))))","v":1},{"$f":"IF(OR(C19=\"S\",C19=0),0,IF(ISERROR(K19),J19,SMALL(J19:K19,1)))","v":19},{"$f":"IF($C19=1,OFFSET(E19,-1,0)+1,OFFSET(E19,-1,0))","v":1},{"$f":"IF($C19=1,0,IF($C19=2,OFFSET(F19,-1,0)+1,OFFSET(F19,-1,0)))","v":0},{"$f":"IF(AND($C19<=2,$C19<>0),0,IF($C19=3,OFFSET(G19,-1,0)+1,OFFSET(G19,-1,0)))","v":0},{"$f":"IF(AND($C19<=3,$C19<>0),0,IF($C19=4,OFFSET(H19,-1,0)+1,OFFSET(H19,-1,0)))","v":0},{"$f":"IF(AND($C19<=4,$C19<>0),0,IF(AND($C19=\"S\",$Y19>0),OFFSET(I19,-1,0)+1,OFFSET(I19,-1,0)))","v":0},{"$f":"IF(OR($C19=\"S\",$C19=0),0,MATCH(0,OFFSET($D19,1,$C19,ROW($C$441)-ROW($C19)),0))","v":422},{"$f":"IF(OR($C19=\"S\",$C19=0),0,MATCH(OFFSET($D19,0,$C19)+1,OFFSET($D19,1,$C19,ROW($C$441)-ROW($C19)),0))","v":19},{"$f":"IF(OR(Y19>0,$C19=1),\"F\",\"\")","v":"F"},"Nível 1",{"$f":"CHOOSE(1+LOG(1+2*(C19=1)+4*(C19=2)+8*(C19=3)+16*(C19=4)+32*(C19=\"S\"),2),\"\",\"Nível 1\",\"Nível 2\",\"Nível 3\",\"Nível 4\",\"Serviço\")","v":"Nível 1"},"1.","AGETOP",null,"BLOCO COZINHA DE PLACA","UN",1,1,1,null,null,0,0]
[2,2,2,15,1,1,0,0,0,18,15,"","Nível 2","Nível 2","-","SINAPI",null,"SERVIÇOS PRELIMINARES","-",null,1,"-",null,null,0,0,""]
[{"$f":"CHOOSE(1+LOG(1+2*(ORÇAMENTO.Nivel=\"Nível 1\")+4*(ORÇAMENTO.Nivel=\"Nível 2\")+8*(ORÇAMENTO.Nivel=\"Nível 3\")+16*(ORÇAMENTO.Nivel=\"Nível 4\")+32*(ORÇAMENTO.Nivel=\"Serviço\"),2),0,1,2,3,4,\"S\")","v":3},{"$f":"IF(OR(C21=\"s\",C21=0),OFFSET(B21,-1,0),C21)","v":3},3,{"$f":"IF(OR(C21=\"S\",C21=0),0,IF(ISERROR(K21),J21,SMALL(J21:K21,1)))","v":11},{"$f":"IF($C21=1,OFFSET(E21,-1,0)+1,OFFSET(E21,-1,0))","v":1},{"$f":"IF($C21=1,0,IF($C21=2,OFFSET(F21,-1,0)+1,OFFSET(F21,-1,0)))","v":1},{"$f":"IF(AND($C21<=2,$C21<>0),0,IF($C21=3,OFFSET(G21,-1,0)+1,OFFSET(G21,-1,0)))","v":1},{"$f":"IF(AND($C21<=3,$C21<>0),0,IF($C21=4,OFFSET(H21,-1,0)+1,OFFSET(H21,-1,0)))","v":0},{"$f":"IF(AND($C21<=4,$C21<>0),0,IF(AND($C21=\"S\",$Y21>0),OFFSET(I21,-1,0)+1,OFFSET(I21,-1,0)))","v":0},14,11,{"$f":"IF(OR(Y21>0,$C21=1),\"F\",\"\")","v":""},"Nível 3",{"$f":"CHOOSE(1+LOG(1+2*(C21=1)+4*(C21=2)+8*(C21=3)+16*(C21=4)+32*(C21=\"S\"),2),\"\",\"Nível 1\",\"Nível 2\",\"Nível 3\",\"Nível 4\",\"Serviço\")","v":"Nível 3"},"-","SINAPI",null,"OUTROS","-",null,1,"-",null,null,0,0,""]
["S",3,"S",0,1,1,1,0,0,0,0,"","Serviço","Serviço","-","AGETOP",20101,"DEMOLICAO COBERTURA TELHA CERAMICA C/ TRANSP. ATÉ CB. E CARGA","m2    ",51.39,1,51.39,null,null,0,0,""]
["S",3,"S",0,1,1,1,0,0,0,0,"","Serviço","Serviço","-","AGETOP",20103,"DEMOLIÇÃO ESTRUTURA EM MADEIRA TELHADO C/ TRANSP. ATÉ CB. E CARGA","m2    ",51.39,1,51.39,null,null,0,0,""]
["S",3,"S",0,1,1,1,0,0,0,0,"","Serviço","Serviço","-","AGETOP",20155,"DEMOL.MURO/PAREDE PLACA PRÉ-MOLDADA C/TRANSP.C.B.E CARGA","m2    ",60.97,1,60.97,null,null,0,0,""]
[{"$f":"CHOOSE(1+LOG(1+2*(ORÇAMENTO.Nivel=\"Nível 1\")+4*(ORÇAMENTO.Nivel=\"Nível 2\")+8*(ORÇAMENTO.Nivel=\"Nível 3\")+16*(ORÇAMENTO.Nivel=\"Nível 4\")+32*(ORÇAMENTO.Nivel=\"Serviço\"),2),0,1,2,3,4,\"S\")","v":"S"},{"$f":"IF(OR(C25=\"s\",C25=0),OFFSET(B25,-1,0),C25)","v":3},"S",{"$f":"IF(OR(C25=\"S\",C25=0),0,IF(ISERROR(K25),J25,SMALL(J25:K25,1)))","v":0},{"$f":"IF($C25=1,OFFSET(E25,-1,0)+1,OFFSET(E25,-1,0))","v":1},{"$f":"IF($C25=1,0,IF($C25=2,OFFSET(F25,-1,0)+1,OFFSET(F25,-1,0)))","v":1},{"$f":"IF(AND($C25<=2,$C25<>0),0,IF($C25=3,OFFSET(G25,-1,0)+1,OFFSET(G25,-1,0)))","v":1},{"$f":"IF(AND($C25<=3,$C25<>0),0,IF($C25=4,OFFSET(H25,-1,0)+1,OFFSET(H25,-1,0)))","v":0},{"$f":"IF(AND($C25<=4,$C25<>0),0,IF(AND($C25=\"S\",$Y25>0),OFFSET(I25,-1,0)+1,OFFSET(I25,-1,0)))","v":0},0,0,{"$f":"IF(OR(Y25>0,$C25=1),\"F\",\"\")","v":""},"Serviço",{"$f":"CHOOSE(1+LOG(1+2*(C25=1)+4*(C25=2)+8*(C25=3)+16*(C25=4)+32*(C25=\"S\"),2),\"\",\"Nível 1\",\"Nível 2\",\"Nível 3\",\"Nível 4\",\"Serviço\")","v":"Serviço"},"-","SINAPI",97622,"DEMOLIÇÃO DE ALVENARIA DE BLOCO FURADO, DE FORMA MANUAL, SEM REAPROVEITAMENTO. AF_12/2017","M3",1.89,1,1.89,null,null,0,0,"Referência: AGETOP - 20118"]
["S",3,"S",0,1,1,1,0,0,0,0,"","Serviço","Serviço","-","SINAPI",97644,"REMOÇÃO DE PORTAS, DE FORMA MANUAL, SEM REAPROVEITAMENTO. AF_12/2017","M2",5.04,1,5.04,null,null,0,0,"Referência: AGETOP - 20106"]
["S",3,"S",0,1,1,1,0,0,0,0,"","Serviço","Serviço","-","SINAPI",97645,"REMOÇÃO DE JANELAS, DE FORMA MANUAL, SEM REAPROVEITAMENTO. AF_12/2017","M2",4.2,1,4.2,null,null,0,0,"Referência: AGETOP - 20106"]
["S",3,"S",0,1,1,1,0,0,0,0,"","Serviço","Serviço","-","AGETOP",20139,"DEMOLIÇAO DE BANCADAS C/ TRANSP. ATÉ CB. E CARGA","m2    ",5,1,5,null,null,0,0,""]
["S",3,{"$f":"IF(OFFSET(C29,-1,0)=\"L\",1,IF(OFFSET(C29,-1,0)=1,2,IF(OR(A29=\"s\",A29=0),\"S\",IF(AND(OFFSET(C29,-1,0)=2,A29=4),3,IF(AND(OR(OFFSET(C29,-1,0)=\"s\",OFFSET(C29,-1,0)=0),A29<>\"s\",A29>OFFSET(B29,-1,0)),OFFSET(B29,-1,0),A29)))))","v":"S"},0,1,1,1,0,0,0,0,"","Serviço","Serviço","-","AGETOP",20111,"DEM.PISO CERAM.SOBRE LASTRO CONC.C/TR.CB.E CARGA","m2    ",36.76,1,36.76,null,null,0,0,""]
["S",3,"S",0,1,1,1,0,0,0,0,"","Serviço","Serviço","-","AGETOP",20163,"DEMOLIÇÃO DAS INSTALAÇÕES HIDROSANITÁRIAS E AFINS C/ TRANSP. ATÉ CB. E CARGA","H     ",6.5,1,6.5,null,null,0,0,""]
[{"$f":"CHOOSE(1+LOG(1+2*(ORÇAMENTO.Nivel=\"Nível 1\")+4*(ORÇAMENTO.Nivel=\"Nível 2\")+8*(ORÇAMENTO.Nivel=\"Nível 3\")+16*(ORÇAMENTO.Nivel=\"Nível 4\")+32*(ORÇAMENTO.Nivel=\"Serviço\"),2),0,1,2,3,4,\"S\")","v":"S"},{"$f":"IF(OR(C31=\"s\",C31=0),OFFSET(B31,-1,0),C31)","v":3},{"$f":"IF(OFFSET(C31,-1,0)=\"L\",1,IF(OFFSET(C31,-1,0)=1,2,IF(OR(A31=\"s\",A31=0),\"S\",IF(AND(OFFSET(C31,-1,0)=2,A31=4),3,IF(AND(OR(OFFSET(C31,-1,0)=\"s\",OFFSET(C31,-1,0)=0),A31<>\"s\",A31>OFFSET(B31,-1,0)),OFFSET(B31,-1,0),A31)))))","v":"S"},{"$f":"IF(OR(C31=\"S\",C31=0),0,IF(ISERROR(K31),J31,SMALL(J31:K31,1)))","v":0},{"$f":"IF($C31=1,OFFSET(E31,-1,0)+1,OFFSET(E31,-1,0))","v":1},{"$f":"IF($C31=1,0,IF($C31=2,OFFSET(F31,-1,0)+1,OFFSET(F31,-1,0)))","v":1},{"$f":"IF(AND($C31<=2,$C31<>0),0,IF($C31=3,OFFSET(G31,-1,0)+1,OFFSET(G31,-1,0)))","v":1},{"$f":"IF(AND($C31<=3,$C31<>0),0,IF($C31=4,OFFSET(H31,-1,0)+1,OFFSET(H31,-1,0)))","v":0},{"$f":"IF(AND($C31<=4,$C31<>0),0,IF(AND($C31=\"S\",$Y31>0),OFFSET(I31,-1,0)+1,OFFSET(I31,-1,0)))","v":0},{"$f":"IF(OR($C31=\"S\",$C31=0),0,MATCH(0,OFFSET($D31,1,$C31,ROW($C$441)-ROW($C31)),0))","v":0},{"$f":"IF(OR($C31=\"S\",$C31=0),0,MATCH(OFFSET($D31,0,$C31)+1,OFFSET($D31,1,$C31,ROW($C$441)-ROW($C31)),0))","v":0},{"$f":"IF(OR(Y31>0,$C31=1),\"F\",\"\")","v":""},"Serviço",{"$f":"CHOOSE(1+LOG(1+2*(C31=1)+4*(C31=2)+8*(C31=3)+16*(C31=4)+32*(C31=\"S\"),2),\"\",\"Nível 1\",\"Nível 2\",\"Nível 3\",\"Nível 4\",\"Serviço\")","v":"Serviço"},"-","AGETOP",20121,"DEM. MANUAL EM CONCR.SIMPLES C/TR.ATE CB.E CARGA (O.C.)","m3    ",4.42,1,4.42,null,null,0,0,""]
[3,3,3,3,1,1,2,0,0,3,58,"","Nível 3","Nível 3","-","SINAPI",null,"FORRO PVC COM ESTRUTURA","-",null,1,"-",null,null,0,0,""]
["S",3,"S",0,1,1,2,0,0,0,0,"","Serviço","Serviço","-","SINAPI",97640,"REMOÇÃO DE FORROS DE DRYWALL, PVC E FIBROMINERAL, DE FORMA MANUAL, SEM REAPROVEITAMENTO. AF_12/2017","M2",36.76,1,36.76,null,null,0,0,""]
["S",3,"S",0,1,1,2,0,0,0,0,"","Serviço","Serviço","-","SINAPI",97642,"REMOÇÃO DE TRAMA METÁLICA OU DE MADEIRA PARA FORRO, DE FORMA MANUAL, SEM REAPROVEITAMENTO. AF_12/2017","M2",36.76,1,36.76,null,null,0,0,""]
[2,2,2,3,1,2,0,0,0,3,13,"","Nível 2","Nível 2","-","AGETOP",null,"TRANSPORTES","-",null,1,"-",null,null,0,0,""]
["S",2,"S",0,1,2,0,0,0,0,0,"","Serviço","Serviço","-","SINAPI",72900,"TRANSPORTE DE ENTULHO COM CAMINHAO BASCULANTE 6 M3, RODOVIA PAVIMENTADA, DMT 0,5 A 1,0 KM","M3",24.17,1,24.17,null,null,0,0,""]
["S",2,"S",0,1,2,0,0,0,0,0,"","Serviço","Serviço","-","SINAPI",72897,"CARGA MANUAL DE ENTULHO EM CAMINHAO BASCULANTE 6 M3","M3",24.17,1,24.17,null,null,0,0,""]
[1,1,1,27,2,0,0,0,0,403,27,"F","Nível 1","Nível 1","2.","SINAPI",null,"BANHEIROS ADEQUAÇÕES","UN",1,1,1,null,null,0,0,""]
[2,2,2,6,2,1,0,0,0,26,6,"","Nível 2","Nível 2","-","SINAPI",null,"SERVIÇOS PRELIMINARES","-",null,1,"-",null,null,0,0,""]
["S",2,"S",0,2,1,0,0,0,0,0,"","Serviço","Serviço","-","AGETOP",20111,"DEM.PISO CERAM.SOBRE LASTRO CONC.C/TR.CB.E CARGA","m2    ",36.74,1,36.74,null,null,0,0,""]
["S",2,"S",0,2,1,0,0,0,0,0,"","Serviço","Serviço","-","AGETOP",20115,"DEMOLIÇÃO DE REVESTIMENTOS COM AZULEJOS C/TRANSP.ATE CB. E CARGA","m2    ",124.16,1,124.16,null,null,0,0,""]
["S",2,"S",0,2,1,0,0,0,0,0,"","Serviço","Serviço","-","AGETOP",20137,"DEMOLIÇAO BACIA SANITARIA C/ TRANSP. ATÉ CB. E CARGA","Un    ",6,1,6,null,null,0,0,""]
["S",2,"S",0,2,1,0,0,0,0,0,"","Serviço","Serviço","-","AGETOP",20140,"DEMOLIÇAO DE VÁLVULA DE DESCARGA C/ TRANSP. ATÉ CB. E CARGA","Un    ",6,1,6,null,null,0,0,""]
["S",2,"S",0,2,1,0,0,0,0,0,"","Serviço","Serviço","-","SINAPI",97644,"REMOÇÃO DE PORTAS, DE FORMA MANUAL, SEM REAPROVEITAMENTO. AF_12/2017","M2",10.56,1,10.56,null,null,0,0,"Referência: AGETOP - 20106"]
[2,2,2,3,2,2,0,0,0,20,3,"","Nível 2","Nível 2","-","AGETOP",null,"TRANSPORTES","-",null,1,"-",null,null,0,0,""]
["S",2,"S",0,2,2,0,0,0,0,0,"","Serviço","Serviço","-","SINAPI",72900,"TRANSPORTE DE ENTULHO COM CAMINHAO BASCULANTE 6 M3, RODOVIA PAVIMENTADA, DMT 0,5 A 1,0 KM","M3",9.17,1,9.17,null,null,0,0,""]
["S",2,"S",0,2,2,0,0,0,0,0,"","Serviço","Serviço","-","SINAPI",72897,"CARGA MANUAL DE ENTULHO EM CAMINHAO BASCULANTE 6 M3","M3",9.17,1,9.17,null,null,0,0,""]
[2,2,2,7,2,3,0,0,0,17,7,"","Nível 2","Nível 2","-","SINAPI",null,"PINTURA","-",null,1,"-",null,null,0,0,""]
[3,3,3,4,2,3,1,0,0,6,4,"","Nível 3","Nível 3","-","AGETOP",null,"TETO","-",null,1,"-",null,null,0,0,""]
["S",3,"S",0,2,3,1,0,0,0,0,"","Serviço","Serviço","-","AGETOP",260104,"REMOCAO DE PINTURA ANTIGA A LATEX","m2    ",36.74,1,36.74,null,null,0,0,""]
["S",3,"S",0,2,3,1,0,0,0,0,"","Serviço","Serviço","-","AGETOP",261300,"EMASSAMENTO COM MASSA PVA DUAS DEMAOS","m2    ",36.74,1,36.74,null,null,0,0,""]
["S",3,"S",0,2,3,1,0,0,0,0,"","Serviço","Serviço","-","AGETOP",261307,"PINTURA PVA LATEX 2 DEMAOS SEM SELADOR","m2    ",36.74,1,36.74,null,null,0,0,""]
[3,3,3,2,2,3,2,0,0,2,37,"","Nível 3","Nível 3","-","SINAPI",null,"ESQUADRIAS NOVAS","-",null,1,"-",null,null,0,0,""]
["S",3,"S",0,2,3,2,0,0,0,0,"","Serviço","Serviço","-","AGETOP",261602,"PINT.ESMALTE/ESQUAD.FERRO C/FUNDO ANTICOR.","m2    ",31.68,1,31.68,null,null,0,0,""]
[2,2,2,3,2,4,0,0,0,10,3,"","Nível 2","Nível 2","-","SINAPI",null,"REVESTIMENTO DE PISO","-",null,1,"-",null,null,0,0,""]
[3,3,3,2,2,4,1,0,0,2,24,"","Nível 3","Nível 3","-","SINAPI",null,"CERÂMICO","-",null,1,"-",null,null,0,0,""]
["S",3,"S",0,2,4,1,0,0,0,0,"","Serviço","Serviço","-","SINAPI",87251,"REVESTIMENTO CERÂMICO PARA PISO COM PLACAS TIPO ESMALTADA EXTRA DE DIMENSÕES 45X45 CM APLICADA EM AMBIENTES DE ÁREA MAIOR QUE 10 M2. AF_06/2014","M2",36.74,1,36.74,null,null,0,0,""]
[2,2,2,2,2,5,0,0,0,7,2,"","Nível 2","Nível 2","-","SINAPI",null,"REVESTIMENTO DE PAREDE","-",null,1,"-",null,null,0,0,""]
["S",2,"S",0,2,5,0,0,0,0,0,"","Serviço","Serviço","-","SINAPI",87273,"REVESTIMENTO CERÂMICO PARA PAREDES INTERNAS COM PLACAS TIPO ESMALTADA EXTRA DE DIMENSÕES 33X45 CM APLICADAS EM AMBIENTES DE ÁREA MAIOR QUE 5 M² NA ALTURA INTEIRA DAS PAREDES. AF_06/2014","M2",124.16,1,124.16,null,null,0,0,""]
[2,2,2,5,2,6,0,0,0,5,274,"","Nível 2","Nível 2","-","SINAPI",null,"ESQUADRIAS METÁLICAS","-",null,1,"-",null,null,0,0,""]
["S",2,"S",0,2,6,0,0,0,0,0,"","Serviço","Serviço","-","AGETOP",230174,"BARRA DE APOIO EM AÇO INOX - 40 CM","un    ",6,1,6,null,null,0,0,""]
["S",2,"S",0,2,6,0,0,0,0,0,"","Serviço","Serviço","-","AGETOP",230176,"BARRA DE APOIO EM AÇO INOX - 80 CM ","un    ",6,1,6,null,null,0,0,""]
["S",2,"S",0,2,6,0,0,0,0,0,"","Serviço","Serviço","-","AGETOP",180501,"PORTA DE ABRIR EM CHAPA PF-1 C/FERRAGENS","m2    ",6.24,1,6.24,null,null,0,0,""]
["S",2,"S",0,2,6,0,0,0,0,0,"","Serviço","Serviço","-","AGETOP",180509,"PORTA ABRIR CH.P/WC PF-10 C/FERRAGENS","m2    ",4.32,1,4.32,null,null,0,0,""]
[1,1,1,6,3,0,0,0,0,376,6,"F","Nível 1","Nível 1","3.","SINAPI",null,"ACESSIBILIDADE","UN",1,1,1,null,null,0,0,""]
[2,2,2,3,3,1,0,0,0,5,3,"","Nível 2","Nível 2","-","SINAPI",null,"REVESTIMENTO DE PISO","-",null,1,"-",null,null,0,0,""]
[3,3,3,2,3,1,1,0,0,2,13,"","Nível 3","Nível 3","-","SINAPI",null,"PODOTÁTIL","-",null,1,"-",null,null,0,0,""]
["S",3,"S",0,3,1,1,0,0,0,0,"","Serviço","Serviço","-","AGETOP",221120,"PISO DE BORRACHA COLORIDO MODELO TÁTIL ( ALERTA OU DIRECIONAL) INCLUSO CONTRAPISO (1CI:3ARML) C/ E=2CM E NATA DE CIMENTO","m2    ",5.05,1,5.05,null,null,0,0,""]
[2,2,2,2,3,2,0,0,0,2,8,"","Nível 2","Nível 2","-","SINAPI",null,"ESQUADRIAS METÁLICAS","-",null,1,"-",null,null,0,0,""]
["S",2,"S",0,3,2,0,0,0,0,0,"","Serviço","Serviço","-","COMPOSIÇÃO","COMP 084_SEE","GUARDA-CORPO COM CORRIMÃO - SEDUC","M",59.28,1,59.28,null,null,0,0,""]
[1,1,1,11,4,0,0,0,0,370,11,"F","Nível 1","Nível 1","4.","SINAPI",null,"CALÇADA ACESSÍVEL","UN",1,1,1,null,null,0,0,""]
[2,2,2,2,4,1,0,0,0,10,2,"","Nível 2","Nível 2","-","SINAPI",null,"SERVIÇOS PRELIMINARES","-",null,1,"-",null,null,0,0,""]
["S",2,"S",0,4,1,0,0,0,0,0,"","Serviço","Serviço","-","AGETOP",20121,"DEM. MANUAL EM CONCR.SIMPLES C/TR.ATE CB.E CARGA (O.C.)","m3    ",18.45,1,18.45,null,null,0,0,""]
[2,2,2,3,4,2,0,0,0,8,3,"","Nível 2","Nível 2","-","AGETOP",null,"TRANSPORTES","-",null,1,"-",null,null,0,0,""]
["S",2,"S",0,4,2,0,0,0,0,0,"","Serviço","Serviço","-","SINAPI",72900,"TRANSPORTE DE ENTULHO COM CAMINHAO BASCULANTE 6 M3, RODOVIA PAVIMENTADA, DMT 0,5 A 1,0 KM","M3",18.45,1,18.45,null,null,0,0,""]
["S",2,"S",0,4,2,0,0,0,0,0,"","Serviço","Serviço","-","SINAPI",72897,"CARGA MANUAL DE ENTULHO EM CAMINHAO BASCULANTE 6 M3","M3",18.45,1,18.45,null,null,0,0,""]
[2,2,2,5,4,3,0,0,0,5,32,"","Nível 2","Nível 2","-","SINAPI",null,"REVESTIMENTO DE PISO","-",null,1,"-",null,null,0,0,""]
[3,3,3,2,4,3,1,0,0,4,2,"","Nível 3","Nível 3","-","SINAPI",null,"PODOTÁTIL","-",null,1,"-",null,null,0,0,""]
["S",3,"S",0,4,3,1,0,0,0,0,"","Serviço","Serviço","-","AGETOP",221126,"PISO DE LADRILHO HIDRÁULICO COLORIDO MODELO TÁTIL ( ALERTA OU DIRECIONAL) SEM LASTRO","m2    ",25.53,1,25.53,null,null,0,0,""]
[3,3,3,2,4,3,2,0,0,2,10,"","Nível 3","Nível 3","-","SINAPI",null,"CONCRETO","-",null,1,"-",null,null,0,0,""]
["S",3,"S",0,4,3,2,0,0,0,0,"","Serviço","Serviço","-","AGETOP",220102,"PISO CONCRETO DESEMPENADO ESPESSURA = 5 CM  1:2,5:3,5","m2    ",369.12,1,369.12,null,null,0,0,""]
[1,1,1,18,5,0,0,0,0,359,18,"F","Nível 1","Nível 1","5.","SINAPI",null,"PINTURA GERAL","UN",1,1,1,null,null,0,0,""]
[{"$f":"CHOOSE(1+LOG(1+2*(ORÇAMENTO.Nivel=\"Nível 1\")+4*(ORÇAMENTO.Nivel=\"Nível 2\")+8*(ORÇAMENTO.Nivel=\"Nível 3\")+16*(ORÇAMENTO.Nivel=\"Nível 4\")+32*(ORÇAMENTO.Nivel=\"Serviço\"),2),0,1,2,3,4,\"S\")","v":2},{"$f":"IF(OR(C83=\"s\",C83=0),OFFSET(B83,-1,0),C83)","v":2},{"$f":"IF(OFFSET(C83,-1,0)=\"L\",1,IF(OFFSET(C83,-1,0)=1,2,IF(OR(A83=\"s\",A83=0),\"S\",IF(AND(OFFSET(C83,-1,0)=2,A83=4),3,IF(AND(OR(OFFSET(C83,-1,0)=\"s\",OFFSET(C83,-1,0)=0),A83<>\"s\",A83>OFFSET(B83,-1,0)),OFFSET(B83,-1,0),A83)))))","v":2},{"$f":"IF(OR(C83=\"S\",C83=0),0,IF(ISERROR(K83),J83,SMALL(J83:K83,1)))","v":17},{"$f":"IF($C83=1,OFFSET(E83,-1,0)+1,OFFSET(E83,-1,0))","v":5},{"$f":"IF($C83=1,0,IF($C83=2,OFFSET(F83,-1,0)+1,OFFSET(F83,-1,0)))","v":1},{"$f":"IF(AND($C83<=2,$C83<>0),0,IF($C83=3,OFFSET(G83,-1,0)+1,OFFSET(G83,-1,0)))","v":0},{"$f":"IF(AND($C83<=3,$C83<>0),0,IF($C83=4,OFFSET(H83,-1,0)+1,OFFSET(H83,-1,0)))","v":0},{"$f":"IF(AND($C83<=4,$C83<>0),0,IF(AND($C83=\"S\",$Y83>0),OFFSET(I83,-1,0)+1,OFFSET(I83,-1,0)))","v":0},17,21,{"$f":"IF(OR(Y83>0,$C83=1),\"F\",\"\")","v":""},"Nível 2",{"$f":"CHOOSE(1+LOG(1+2*(C83=1)+4*(C83=2)+8*(C83=3)+16*(C83=4)+32*(C83=\"S\"),2),\"\",\"Nível 1\",\"Nível 2\",\"Nível 3\",\"Nível 4\",\"Serviço\")","v":"Nível 2"},"-","SINAPI",null,"PINTURA","-",null,1,"-",null,null,0,0,""]
[3,3,3,2,5,1,1,0,0,{"$f":"IF(OR($C84=\"S\",$C84=0),0,MATCH(0,OFFSET($D84,1,$C84,ROW($C$441)-ROW($C84)),0))","v":16},{"$f":"IF(OR($C84=\"S\",$C84=0),0,MATCH(OFFSET($D84,0,$C84)+1,OFFSET($D84,1,$C84,ROW($C$441)-ROW($C84)),0))","v":2},"","Nível 3","Nível 3","-",null,null,"ESMALTE SINTÉTICO","-",null,1,"-",null,null,0,0,""]
["S",3,"S",0,5,1,1,0,0,0,0,"","Serviço","Serviço","-","AGETOP",261550,"PINT.ESMALTE SINT.PAREDES - 2 DEM.C/SELADOR","m2    ",787.33,1,787.33,null,null,0,0,""]
[3,3,3,4,5,1,2,0,0,14,4,"","Nível 3","Nível 3","-","AGETOP",null,"LÁTEX ACRÍLICA","-",null,1,"-",null,null,0,0,""]
["S",3,"S",0,5,1,2,0,0,0,0,"","Serviço","Serviço","-","AGETOP",260104,"REMOCAO DE PINTURA ANTIGA A LATEX","m2    ",787.33,1,787.33,null,null,0,0,""]
["S",3,"S",0,5,1,2,0,0,0,0,"","Serviço","Serviço","-","AGETOP",261300,"EMASSAMENTO COM MASSA PVA DUAS DEMAOS","m2    ",993.13,1,993.13,null,null,0,0,""]
["S",3,"S",0,5,1,2,0,0,0,0,"","Serviço","Serviço","-","AGETOP",261001,"PINTURA LATEX ACRILICO 2 DEMAOS","m2    ",787.33,1,787.33,null,null,0,0,""]
[3,3,3,3,5,1,3,0,0,10,3,"","Nível 3","Nível 3","-","AGETOP",null,"TETO","-",null,1,"-",null,null,0,0,""]
["S",3,"S",0,5,1,3,0,0,0,0,"","Serviço","Serviço","-","AGETOP",260104,"REMOCAO DE PINTURA ANTIGA A LATEX","m2    ",205.8,1,205.8,null,null,0,0,""]
["S",3,"S",0,5,1,3,0,0,0,0,"","Serviço","Serviço","-","AGETOP",261307,"PINTURA PVA LATEX 2 DEMAOS SEM SELADOR","m2    ",685.97,1,685.97,null,null,0,0,""]
[3,3,3,2,5,1,4,0,0,7,2,"","Nível 3","Nível 3","-","AGETOP",null,"EXTERNA","-",null,1,"-",null,null,0,0,""]
["S",3,"S",0,5,1,4,0,0,0,0,"","Serviço","Serviço","-","AGETOP",261000,"PINTURA LATEX ACRILICA 2 DEMAOS C/SELADOR","m2    ",2505.1800000000003,1,2505.1800000000003,null,null,0,0,""]
[3,3,3,3,5,1,5,0,0,5,3,"","Nível 3","Nível 3","-","AGETOP",null,"ESQUADRIAS EXISTENTES","-",null,1,"-",null,null,0,0,""]
["S",3,"S",0,5,1,5,0,0,0,0,"","Serviço","Serviço","-","AGETOP",260105,"REMOCAO DE PINTURA ANTIGA A OLEO OU ESMALTE","m2    ",338.45,1,338.45,null,null,0,0,""]
["S",3,"S",0,5,1,5,0,0,0,0,"","Serviço","Serviço","-","AGETOP",261503,"PINT.ESMALTE 2 DEM. ESQ.FERRO (SEM FUNDO ANTICOR.)","m2    ",338.45,1,338.45,null,null,0,0,""]
[3,3,3,2,5,1,6,0,0,2,{"$error":"#N/A"},"","Nível 3","Nível 3","-","AGETOP",null,"OUTROS","-",null,1,"-",null,null,0,0,""]
["S",3,"S",0,5,1,6,0,0,0,0,"","Serviço","Serviço","-","AGETOP",261620,"LETREIRO MÉDIO A GRANDE PORTE EM PAREDE FEITO A PINCEL","m2    ",7.2,1,7.2,null,null,0,0,""]
[1,1,1,11,6,0,0,0,0,341,11,"F","Nível 1","Nível 1","6.","SINAPI",null,"COBERTURA","UN",1,1,1,null,null,0,0,""]
[2,2,2,3,6,1,0,0,0,10,3,"","Nível 2","Nível 2","-","SINAPI",null,"SERVIÇOS PRELIMINARES","-",null,1,"-",null,null,0,0,""]
["S",2,"S",0,6,1,0,0,0,0,0,"","Serviço","Serviço","-","AGETOP",20101,"DEMOLICAO COBERTURA TELHA CERAMICA C/ TRANSP. ATÉ CB. E CARGA","m2    ",490,1,490,null,null,0,0,""]
["S",2,"S",0,6,1,0,0,0,0,0,"","Serviço","Serviço","-","AGETOP",20136,"DEMOLICAO DE CAIBROS E RIPAS C/ TRANSP. ATÉ CB. E CARGA","m2    ",490,1,490,null,null,0,0,""]
[2,2,2,3,6,2,0,0,0,7,3,"","Nível 2","Nível 2","-","AGETOP",null,"TRANSPORTES","-",null,1,"-",null,null,0,0,""]
["S",2,"S",0,6,2,0,0,0,0,0,"","Serviço","Serviço","-","SINAPI",72900,"TRANSPORTE DE ENTULHO COM CAMINHAO BASCULANTE 6 M3, RODOVIA PAVIMENTADA, DMT 0,5 A 1,0 KM","M3",49,1,49,null,null,0,0,""]
["S",2,"S",0,6,2,0,0,0,0,0,"","Serviço","Serviço","-","SINAPI",72897,"CARGA MANUAL DE ENTULHO EM CAMINHAO BASCULANTE 6 M3","M3",49,1,49,null,null,0,0,""]
[2,2,2,2,6,3,0,0,0,4,2,"","Nível 2","Nível 2","-","SINAPI",null,"COBERTURAS","-",null,1,"-",null,null,0,0,""]
["S",2,"S",0,6,3,0,0,0,0,0,"","Serviço","Serviço","-","AGETOP",160401,"COBERTURA COM TELHA PLAN RESINADA COR VERMELHA","m2    ",490,1,490,null,null,0,0,""]
[2,2,2,2,6,4,0,0,0,2,61,"","Nível 2","Nível 2","-","SINAPI",null,"ESTRUTURA DE MADEIRA","-",null,1,"-",null,null,0,0,""]
["S",2,"S",0,6,4,0,0,0,0,0,"","Serviço","Serviço","-","AGETOP",140205,"RIPAMENTO DE MADEIRA","m2    ",490,1,490,null,null,0,0,""]
[1,1,1,8,7,0,0,0,0,330,8,"F","Nível 1","Nível 1","7.","SINAPI",null,"QUADRA","UN",1,1,1,null,null,0,0,""]
[{"$f":"CHOOSE(1+LOG(1+2*(ORÇAMENTO.Nivel=\"Nível 1\")+4*(ORÇAMENTO.Nivel=\"Nível 2\")+8*(ORÇAMENTO.Nivel=\"Nível 3\")+16*(ORÇAMENTO.Nivel=\"Nível 4\")+32*(ORÇAMENTO.Nivel=\"Serviço\"),2),0,1,2,3,4,\"S\")","v":2},{"$f":"IF(OR(C112=\"s\",C112=0),OFFSET(B112,-1,0),C112)","v":2},{"$f":"IF(OFFSET(C112,-1,0)=\"L\",1,IF(OFFSET(C112,-1,0)=1,2,IF(OR(A112=\"s\",A112=0),\"S\",IF(AND(OFFSET(C112,-1,0)=2,A112=4),3,IF(AND(OR(OFFSET(C112,-1,0)=\"s\",OFFSET(C112,-1,0)=0),A112<>\"s\",A112>OFFSET(B112,-1,0)),OFFSET(B112,-1,0),A112)))))","v":2},{"$f":"IF(OR(C112=\"S\",C112=0),0,IF(ISERROR(K112),J112,SMALL(J112:K112,1)))","v":5},{"$f":"IF($C112=1,OFFSET(E112,-1,0)+1,OFFSET(E112,-1,0))","v":7},{"$f":"IF($C112=1,0,IF($C112=2,OFFSET(F112,-1,0)+1,OFFSET(F112,-1,0)))","v":1},{"$f":"IF(AND($C112<=2,$C112<>0),0,IF($C112=3,OFFSET(G112,-1,0)+1,OFFSET(G112,-1,0)))","v":0},{"$f":"IF(AND($C112<=3,$C112<>0),0,IF($C112=4,OFFSET(H112,-1,0)+1,OFFSET(H112,-1,0)))","v":0},{"$f":"IF(AND($C112<=4,$C112<>0),0,IF(AND($C112=\"S\",$Y112>0),OFFSET(I112,-1,0)+1,OFFSET(I112,-1,0)))","v":0},7,5,{"$f":"IF(OR(Y112>0,$C112=1),\"F\",\"\")","v":""},"Nível 2",{"$f":"CHOOSE(1+LOG(1+2*(C112=1)+4*(C112=2)+8*(C112=3)+16*(C112=4)+32*(C112=\"S\"),2),\"\",\"Nível 1\",\"Nível 2\",\"Nível 3\",\"Nível 4\",\"Serviço\")","v":"Nível 2"},"-","SINAPI",null,"PINTURA","-",null,1,"-",null,null,0,0,""]
[3,3,3,4,7,1,1,0,0,4,80,"","Nível 3","Nível 3","-","AGETOP",null,"QUADRA DE ESPORTES","-",null,1,"-",null,null,0,0,""]
["S",3,"S",0,7,1,1,0,0,0,0,"","Serviço","Serviço","-","AGETOP",261700,"DEMARC.QUADRA/VAGAS TINTA POLIESPORTIVA","m     ",165.76,1,165.76,null,null,0,0,""]
["S",3,"S",0,7,1,1,0,0,0,0,"","Serviço","Serviço","-","AGETOP",261703,"PINT.POLIESPORTIVA - 2 DEM.(PISOS E CIMENTADOS)","m2    ",500.95,1,500.95,null,null,0,0,""]
["S",3,"S",0,7,1,1,0,0,0,0,"","Serviço","Serviço","-","AGETOP",261001,"PINTURA LATEX ACRILICO 2 DEMAOS","m2    ",96.15,1,96.15,null,null,0,0,""]
[2,2,2,2,7,2,0,0,0,2,47,"","Nível 2","Nível 2","-","SINAPI",null,"DIVERSOS","-",null,1,"-",null,null,0,0,""]
["S",2,"S",0,7,2,0,0,0,0,0,"","Serviço","Serviço","-","AGETOP",271101,"TRAVES FERRO GALVANIZADO PARA FUTEBOL DE SALÃO PINTADAS - 3,00 x 2,00M - 2 UNID.","CJ    ",1,1,1,null,null,0,0,""]
[{"$f":"CHOOSE(1+LOG(1+2*(ORÇAMENTO.Nivel=\"Nível 1\")+4*(ORÇAMENTO.Nivel=\"Nível 2\")+8*(ORÇAMENTO.Nivel=\"Nível 3\")+16*(ORÇAMENTO.Nivel=\"Nível 4\")+32*(ORÇAMENTO.Nivel=\"Serviço\"),2),0,1,2,3,4,\"S\")","v":1},{"$f":"IF(OR(C119=\"s\",C119=0),OFFSET(B119,-1,0),C119)","v":1},{"$f":"IF(OFFSET(C119,-1,0)=\"L\",1,IF(OFFSET(C119,-1,0)=1,2,IF(OR(A119=\"s\",A119=0),\"S\",IF(AND(OFFSET(C119,-1,0)=2,A119=4),3,IF(AND(OR(OFFSET(C119,-1,0)=\"s\",OFFSET(C119,-1,0)=0),A119<>\"s\",A119>OFFSET(B119,-1,0)),OFFSET(B119,-1,0),A119)))))","v":1},{"$f":"IF(OR(C119=\"S\",C119=0),0,IF(ISERROR(K119),J119,SMALL(J119:K119,1)))","v":3},{"$f":"IF($C119=1,OFFSET(E119,-1,0)+1,OFFSET(E119,-1,0))","v":8},{"$f":"IF($C119=1,0,IF($C119=2,OFFSET(F119,-1,0)+1,OFFSET(F119,-1,0)))","v":0},{"$f":"IF(AND($C119<=2,$C119<>0),0,IF($C119=3,OFFSET(G119,-1,0)+1,OFFSET(G119,-1,0)))","v":0},{"$f":"IF(AND($C119<=3,$C119<>0),0,IF($C119=4,OFFSET(H119,-1,0)+1,OFFSET(H119,-1,0)))","v":0},{"$f":"IF(AND($C119<=4,$C119<>0),0,IF(AND($C119=\"S\",$Y119>0),OFFSET(I119,-1,0)+1,OFFSET(I119,-1,0)))","v":0},322,3,{"$f":"IF(OR(Y119>0,$C119=1),\"F\",\"\")","v":"F"},"Nível 1",{"$f":"CHOOSE(1+LOG(1+2*(C119=1)+4*(C119=2)+8*(C119=3)+16*(C119=4)+32*(C119=\"S\"),2),\"\",\"Nível 1\",\"Nível 2\",\"Nível 3\",\"Nível 4\",\"Serviço\")","v":"Nível 1"},"8.","SINAPI",null,"VIDRO","UN",1,1,1,null,null,0,0,""]
[2,2,2,2,8,1,0,0,0,2,42,"","Nível 2","Nível 2","-","SINAPI",null,"VIDROS","-",null,1,"-",null,null,0,0,""]
["S",2,"S",0,8,1,0,0,0,0,0,"","Serviço","Serviço","-","SINAPI",72117,"VIDRO LISO COMUM TRANSPARENTE, ESPESSURA 4MM","M2",30,1,30,null,null,0,0,"Referência: AGETOP - 190102"]
[1,1,1,5,9,0,0,0,0,319,5,"F","Nível 1","Nível 1","9.","SINAPI",null,"ADMINISTRAÇÃO LOCAL","UN",1,1,1,null,null,0,0,""]
[2,2,2,4,9,1,0,0,0,4,39,"","Nível 2","Nível 2","-",null,null,"ADMINISTRAÇÃO","-",null,1,"-",null,null,0,0,""]
[3,3,3,3,9,1,1,0,0,3,69,"","Nível 3","Nível 3","-",null,null,"MENSALISTAS","-",null,1,"-",null,null,0,0,""]
["S",3,"S",0,9,1,1,0,0,0,0,"","Serviço","Serviço","-","SINAPI",90778,"ENGENHEIRO CIVIL DE OBRA PLENO COM ENCARGOS COMPLEMENTARES","H",86.367935140558259,1,86.367935140558259,null,null,0,0,"Referência: AGETOP - 250101"]
["S",3,"S",0,9,1,1,0,0,0,0,"","Serviço","Serviço","-","SINAPI",90776,"ENCARREGADO GERAL COM ENCARGOS COMPLEMENTARES","H",550,1,550,null,null,0,0,"Referência: AGETOP - 250103"]
[1,1,1,5,10,0,0,0,0,314,5,"F","Nível 1","Nível 1","10.","SINAPI",null,"OBRA","UN",1,1,1,null,null,0,0,""]
[2,2,2,4,10,1,0,0,0,4,34,"","Nível 2","Nível 2","-","SINAPI",null,"DIVERSOS","-",null,1,"-",null,null,0,0,""]
["S",2,"S",0,10,1,0,0,0,0,0,"","Serviço","Serviço","-","AGETOP",270501,"LIMPEZA FINAL DE OBRA - (OBRAS CIVIS)","m2    ",400,1,400,null,null,0,0,""]
["S",2,"S",0,10,1,0,0,0,0,0,"","Serviço","Serviço","-","AGETOP",21301,"PLACA DE OBRA PLOTADA EM CHAPA METÁLICA 26 , AFIXADA EM CAVALETES DE MADEIRA DE LEI (VIGOTAS 6X12CM) - PADRÃO GOINFRA","m2    ",7.5,1,7.5,null,null,0,0,""]
["S",2,"S",0,10,1,0,0,0,0,0,"","Serviço","Serviço","-","AGETOP",270804,"PLACA DE INAUGURAÇÃO AÇO ESCOVADO 60 X 120 CM","un    ",1,1,1,null,null,0,0,""]
[1,1,1,40,11,0,0,0,0,309,40,"F","Nível 1","Nível 1","11.","SINAPI",null,"PROJETO DE GÁS","UN",1,1,1,null,null,0,0,""]
[2,2,2,29,11,1,0,0,0,39,29,"","Nível 2","Nível 2","-","SINAPI",null,"INSTALAÇÕES ESPECIAIS","-",null,1,"-",null,null,0,0,""]
[3,3,3,28,11,1,1,0,0,28,59,"","Nível 3","Nível 3","-","SINAPI",null,"PEÇAS E ACESSÓRIOS 2 CILINDROS","-",null,1,"-",null,null,0,0,""]
["S",3,"S",0,11,1,1,0,0,0,0,"","Serviço","Serviço","-","AGETOP",91007,"CENTRAL DE GÁS PADRÃO GOINFRA SEM INSTALAÇÕES (1+1 CILINDRO 45 KG)","Un    ",1,1,1,null,null,0,0,""]
["S",3,"S",0,11,1,1,0,0,0,0,"","Serviço","Serviço","-","AGETOP",91023,"UNIÃO S/BRONZE PRETA 3/4\" NPT 300 LBS","Un    ",3,1,3,null,null,0,0,""]
["S",3,"S",0,11,1,1,0,0,0,0,"","Serviço","Serviço","-","COMPOSIÇÃO","COMP 382_SEE","TE DE REDUCAO DE FERRO GALVANIZADO, COM ROSCA BSP, DE 3/4\" X 1/2\"","UN ",1,1,1,null,null,0,0,""]
["S",3,"S",0,11,1,1,0,0,0,0,"","Serviço","Serviço","-","COMPOSIÇÃO","COMP 383_SEE","BUCHA DE REDUCAO DE FERRO GALVANIZADO, COM ROSCA BSP, DE 1/2\" X 1/4\"","UN ",3,1,3,null,null,0,0,""]
["S",3,"S",0,11,1,1,0,0,0,0,"","Serviço","Serviço","-","AGETOP",91021,"LUVA GALVANIZADO DE REDUÇÃO 3/4\" X 1/2\" (GÁS)","Un    ",2,1,2,null,null,0,0,""]
["S",3,"S",0,11,1,1,0,0,0,0,"","Serviço","Serviço","-","SINAPI",92692,"NIPLE, EM FERRO GALVANIZADO, CONEXÃO ROSQUEADA, DN 15 (1/2\"), INSTALADO EM RAMAIS E SUB-RAMAIS DE GÁS - FORNECIMENTO E INSTALAÇÃO. AF_12/2015","UN",6,1,6,null,null,0,0,""]
["S",3,"S",0,11,1,1,0,0,0,0,"","Serviço","Serviço","-","AGETOP",91031,"NIPLE DUPLO 300 PSI 3/4\"","Un    ",6,1,6,null,null,0,0,""]
["S",3,"S",0,11,1,1,0,0,0,0,"","Serviço","Serviço","-","COMPOSIÇÃO","COMP 212_SEE","NIPLE DE REDUÇÃO 1/2\" X 1/4\" BSP","UN ",4,1,4,null,null,0,0,""]
["S",3,"S",0,11,1,1,0,0,0,0,"","Serviço","Serviço","-","COMPOSIÇÃO","COMP 213_SEE","NIPLE DE REDUÇÃO 3/4\" X 1/2\" BSP","UN ",4,1,4,null,null,0,0,""]
["S",3,"S",0,11,1,1,0,0,0,0,"","Serviço","Serviço","-","SINAPI",92688,"TUBO DE AÇO GALVANIZADO COM COSTURA, CLASSE MÉDIA, CONEXÃO ROSQUEADA, DN 20 (3/4\"), INSTALADO EM RAMAIS E SUB-RAMAIS DE GÁS - FORNECIMENTO E INSTALAÇÃO. AF_12/2015","M",9,1,9,null,null,0,0,""]
["S",3,"S",0,11,1,1,0,0,0,0,"","Serviço","Serviço","-","SINAPI",92701,"JOELHO 90 GRAUS, EM FERRO GALVANIZADO, CONEXÃO ROSQUEADA, DN 20 (3/4\"), INSTALADO EM RAMAIS E SUB-RAMAIS DE GÁS - FORNECIMENTO E INSTALAÇÃO. AF_12/2015","UN",3,1,3,null,null,0,0,""]
["S",3,"S",0,11,1,1,0,0,0,0,"","Serviço","Serviço","-","COMPOSIÇÃO","COMP 237_SEE","FITA ANTICORROSIVA","M",8,1,8,null,null,0,0,""]
["S",3,"S",0,11,1,1,0,0,0,0,"","Serviço","Serviço","-","AGETOP",91025,"VÁLVULA ESFERICA LATÃO 3/4\"","Un    ",3,1,3,null,null,0,0,""]
["S",3,"S",0,11,1,1,0,0,{"$f":"IF(OR($C148=\"S\",$C148=0),0,MATCH(0,OFFSET($D148,1,$C148,ROW($C$441)-ROW($C148)),0))","v":0},{"$f":"IF(OR($C148=\"S\",$C148=0),0,MATCH(OFFSET($D148,0,$C148)+1,OFFSET($D148,1,$C148,ROW($C$441)-ROW($C148)),0))","v":0},"","Serviço","Serviço","-","COMPOSIÇÃO","COMP 542_SEE","VÁLVULA UGV 3/4\" (S) LATÃO","UN ",1,1,1,null,null,0,0,""]
["S",3,"S",0,11,1,1,0,0,0,0,"","Serviço","Serviço","-","COMPOSIÇÃO","COMP 543_SEE","VÁLVULA UGV 1/2\" (S) LATÃO","UN ",1,1,1,null,null,0,0,""]
["S",3,"S",0,11,1,1,0,0,0,0,"","Serviço","Serviço","-","AGETOP",91029,"VALVULA DE RETENÇÃO LATÃO 1/2\" X 7/16\" NPT","Un    ",1,1,1,null,null,0,0,""]
["S",3,"S",0,11,1,1,0,0,0,0,"","Serviço","Serviço","-","COMPOSIÇÃO","COMP 211_SEE","REGULADOR DE 2º ESTÁGIO 5KG/H","UN ",1,1,1,null,null,0,0,""]
["S",3,"S",0,11,1,1,0,0,0,0,"","Serviço","Serviço","-","COMPOSIÇÃO","COMP 210_SEE","REGULADOR DE 1º ESTÁGIO 60KG/H MODELO AP-40  COM MANÔMETRO","UN ",1,1,1,null,null,0,0,""]
["S",3,"S",0,11,1,1,0,0,0,0,"","Serviço","Serviço","-","AGETOP",85003,"EXTINTOR PO QUIMICO SECO (6 KG) - CAPACIDADE EXTINTORA 20 BC","Un    ",1,1,1,null,null,0,0,""]
["S",3,"S",0,11,1,1,0,0,0,0,"","Serviço","Serviço","-","COMPOSIÇÃO","COMP 235_SEE","PLACA DE SINALIZAÇÃO EM PVC COD 01 - (300X300) PROIBIDO FUMAR","UN ",2,1,2,null,null,0,0,""]
["S",3,"S",0,11,1,1,0,0,0,0,"","Serviço","Serviço","-","COMPOSIÇÃO","COMP 236_SEE","PLACA DE SINALIZAÇÃO EM PVC COD 06 - (300X300) PERIGO INFLAMÁVEL","UN ",2,1,2,null,null,0,0,""]
["S",3,"S",0,11,1,1,0,0,0,0,"","Serviço","Serviço","-","AGETOP",91043,"BRAÇADEIRA METALICA TIPO \"D\" DIAM. 3/4\"","Un    ",4,1,4,null,null,0,0,""]
["S",3,"S",0,11,1,1,0,0,0,0,"","Serviço","Serviço","-","AGETOP",71863,"PARAFUSO P/BUCHA S-10","Un    ",8,1,8,null,null,0,0,""]
["S",3,"S",0,11,1,1,0,0,0,0,"","Serviço","Serviço","-","AGETOP",70393,"BUCHA DE NYLON S-10","Un    ",8,1,8,null,null,0,0,""]
["S",3,"S",0,11,1,1,0,0,0,0,"","Serviço","Serviço","-","AGETOP",91045,"SUPORTE PARA COLETOR","Un    ",2,1,2,null,null,0,0,""]
["S",3,"S",0,11,1,1,0,0,0,0,"","Serviço","Serviço","-","COMPOSIÇÃO","COMP 045_SEE","LAUDO DE ESTANQUEIDADE","UN ",1,1,1,null,null,0,0,""]
["S",3,"S",0,11,1,1,0,0,0,0,"","Serviço","Serviço","-","COMPOSIÇÃO","COMP 277_SEE","MARCAÇÃO NO PISO - 1X1 M PARA EXTINTOR","M2",1,1,1,null,null,0,0,""]
[2,2,2,2,11,2,0,0,0,10,2,"","Nível 2","Nível 2","-","SINAPI",null,"SERVIÇOS PRELIMINARES","-",null,1,"-",null,null,0,0,""]
["S",2,"S",0,11,2,0,0,0,0,0,"","Serviço","Serviço","-","AGETOP",20121,"DEM. MANUAL EM CONCR.SIMPLES C/TR.ATE CB.E CARGA (O.C.)","m3    ",3.7000000000000005E-2,1,3.7000000000000005E-2,null,null,0,0,""]
[2,2,2,3,11,3,0,0,0,8,3,"","Nível 2","Nível 2","-","AGETOP",null,"TRANSPORTES","-",null,1,"-",null,null,0,0,""]
["S",2,"S",0,11,3,0,0,0,0,0,"","Serviço","Serviço","-","SINAPI",72900,"TRANSPORTE DE ENTULHO COM CAMINHAO BASCULANTE 6 M3, RODOVIA PAVIMENTADA, DMT 0,5 A 1,0 KM","M3",3.7000000000000005E-2,1,3.7000000000000005E-2,null,null,0,0,""]
["S",2,"S",0,11,3,0,0,0,0,0,"","Serviço","Serviço","-","SINAPI",72897,"CARGA MANUAL DE ENTULHO EM CAMINHAO BASCULANTE 6 M3","M3",3.7000000000000005E-2,1,3.7000000000000005E-2,null,null,0,0,""]
[{"$f":"CHOOSE(1+LOG(1+2*(ORÇAMENTO.Nivel=\"Nível 1\")+4*(ORÇAMENTO.Nivel=\"Nível 2\")+8*(ORÇAMENTO.Nivel=\"Nível 3\")+16*(ORÇAMENTO.Nivel=\"Nível 4\")+32*(ORÇAMENTO.Nivel=\"Serviço\"),2),0,1,2,3,4,\"S\")","v":2},{"$f":"IF(OR(C167=\"s\",C167=0),OFFSET(B167,-1,0),C167)","v":2},{"$f":"IF(OFFSET(C167,-1,0)=\"L\",1,IF(OFFSET(C167,-1,0)=1,2,IF(OR(A167=\"s\",A167=0),\"S\",IF(AND(OFFSET(C167,-1,0)=2,A167=4),3,IF(AND(OR(OFFSET(C167,-1,0)=\"s\",OFFSET(C167,-1,0)=0),A167<>\"s\",A167>OFFSET(B167,-1,0)),OFFSET(B167,-1,0),A167)))))","v":2},{"$f":"IF(OR(C167=\"S\",C167=0),0,IF(ISERROR(K167),J167,SMALL(J167:K167,1)))","v":3},{"$f":"IF($C167=1,OFFSET(E167,-1,0)+1,OFFSET(E167,-1,0))","v":11},{"$f":"IF($C167=1,0,IF($C167=2,OFFSET(F167,-1,0)+1,OFFSET(F167,-1,0)))","v":4},{"$f":"IF(AND($C167<=2,$C167<>0),0,IF($C167=3,OFFSET(G167,-1,0)+1,OFFSET(G167,-1,0)))","v":0},{"$f":"IF(AND($C167<=3,$C167<>0),0,IF($C167=4,OFFSET(H167,-1,0)+1,OFFSET(H167,-1,0)))","v":0},{"$f":"IF(AND($C167<=4,$C167<>0),0,IF(AND($C167=\"S\",$Y167>0),OFFSET(I167,-1,0)+1,OFFSET(I167,-1,0)))","v":0},5,3,{"$f":"IF(OR(Y167>0,$C167=1),\"F\",\"\")","v":""},"Nível 2",{"$f":"CHOOSE(1+LOG(1+2*(C167=1)+4*(C167=2)+8*(C167=3)+16*(C167=4)+32*(C167=\"S\"),2),\"\",\"Nível 1\",\"Nível 2\",\"Nível 3\",\"Nível 4\",\"Serviço\")","v":"Nível 2"},"-","SINAPI",null,"SERVIÇO EM TERRA","-",null,1,"-",null,null,0,0,""]
["S",2,"S",0,11,4,0,0,0,0,0,"","Serviço","Serviço","-","SINAPI",93358,"ESCAVAÇÃO MANUAL DE VALA COM PROFUNDIDADE MENOR OU IGUAL A 1,30 M. AF_03/2016","M3",0.32340000000000002,1,0.32340000000000002,null,null,0,0,"Referência: AGETOP - 40101"]
["S",2,"S",0,11,4,0,0,0,0,0,"","Serviço","Serviço","-","SINAPI",96995,"REATERRO MANUAL APILOADO COM SOQUETE. AF_10/2017","M3",0.32340000000000002,1,0.32340000000000002,null,null,0,0,"Referência: AGETOP - 40902"]
[2,2,2,2,11,5,0,0,0,2,138,"","Nível 2","Nível 2","-","SINAPI",null,"REVESTIMENTO DE PISO","-",null,1,"-",null,null,0,0,""]
["S",2,"S",0,11,5,0,0,0,0,0,"","Serviço","Serviço","-","AGETOP",220102,"PISO CONCRETO DESEMPENADO ESPESSURA = 5 CM  1:2,5:3,5","m2    ",0.7400000000000001,1,0.7400000000000001,null,null,0,0,""]
[1,1,1,73,12,0,0,0,0,269,73,"F","Nível 1","Nível 1","12.","AGETOP",null,"PROJETO HIDROSSANITÁRIO","UN",1,1,1,null,null,0,0,""]
[2,2,2,67,12,1,0,0,0,72,67,"","Nível 2","Nível 2","-","AGETOP",null,"INSTALAÇÕES HIDROSSANITÁRIAS","-",null,1,"-",null,null,0,0,""]
[3,3,3,19,12,1,1,0,0,66,19,"","Nível 3","Nível 3","-","SINAPI",null,"PEÇAS E ACESSÓRIOS","-",null,1,"-",null,null,0,0,""]
[4,4,4,6,12,1,1,1,0,18,6,"","Nível 4","Nível 4","-","SINAPI",null,"VASO SANITÁRIO E ACESSÓRIOS","-",null,1,"-",null,null,0,0,""]
["S",4,"S",0,12,1,1,1,0,0,0,"","Serviço","Serviço","-","SINAPI",95469,"VASO SANITARIO SIFONADO CONVENCIONAL COM  LOUÇA BRANCA - FORNECIMENTO E INSTALAÇÃO. AF_01/2020","UN",6,1,6,null,null,0,0,""]
["S",4,"S",0,12,1,1,1,0,0,0,"","Serviço","Serviço","-","SINAPI",99635,"VÁLVULA DE DESCARGA METÁLICA, BASE 1 1/2 \", ACABAMENTO METALICO CROMADO - FORNECIMENTO E INSTALAÇÃO. AF_01/2019","UN",6,1,6,null,null,0,0,"Referência: AGETOP - 80515"]
["S",4,"S",0,12,1,1,1,0,0,0,"","Serviço","Serviço","-","AGETOP",80520,"CONJUNTO DE FIXACAO P/VASO SANITARIO (PAR)","CJ    ",6,1,6,null,null,0,0,""]
["S",4,"S",0,12,1,1,1,0,0,0,"","Serviço","Serviço","-","AGETOP",80510,"ANEL DE VEDAÇÃO PARA VASO SANITÁRIO","Un    ",6,1,6,null,null,0,0,""]
["S",4,"S",0,12,1,1,1,0,0,0,"","Serviço","Serviço","-","AGETOP",80514,"TUBO DE LIGACAO PVC CROMADO 1.1/2\" / ESPUDE  - (ENTRADA)","Un    ",6,1,6,null,null,0,0,""]
[4,4,4,7,12,1,1,2,0,12,7,"","Nível 4","Nível 4","-","SINAPI",null,"LAVATÓRIO E ACESSÓRIOS","-",null,1,"-",null,null,0,0,""]
["S",4,"S",0,12,1,1,2,0,0,0,"","Serviço","Serviço","-","AGETOP",80542,"LAVATÓRIO MÉDIO SEM COLUNA","Un    ",2,1,2,null,null,0,0,""]
["S",4,"S",0,12,1,1,2,0,0,0,"","Serviço","Serviço","-","AGETOP",80550,"FIXACAO P/LAVATORIO (PAR)","PAR   ",2,1,2,null,null,0,0,""]
["S",4,"S",0,12,1,1,2,0,0,0,"","Serviço","Serviço","-","AGETOP",80556,"LIGAÇÃO FLEXÍVEL PVC DIAM.1/2\" (ENGATE)","Un    ",2,1,2,null,null,0,0,""]
["S",4,"S",0,12,1,1,2,0,0,0,"","Serviço","Serviço","-","SINAPI",86883,"SIFÃO DO TIPO FLEXÍVEL EM PVC 1  X 1.1/2  - FORNECIMENTO E INSTALAÇÃO. AF_01/2020","UN",2,1,2,null,null,0,0,""]
["S",4,"S",0,12,1,1,2,0,0,0,"","Serviço","Serviço","-","SINAPI",86915,"TORNEIRA CROMADA DE MESA, 1/2\u0094 OU 3/4\u0094, PARA LAVATÓRIO, PADRÃO MÉDIO - FORNECIMENTO E INSTALAÇÃO. AF_01/2020","UN",2,1,2,null,null,0,0,"Referência: AGETOP - 80570"]
["S",4,"S",0,12,1,1,2,0,0,0,"","Serviço","Serviço","-","SINAPI",86877,"VÁLVULA EM METAL CROMADO 1.1/2\u0094 X 1.1/2\u0094 PARA TANQUE OU LAVATÓRIO, COM OU SEM LADRÃO - FORNECIMENTO E INSTALAÇÃO. AF_01/2020","UN",2,1,2,null,null,0,0,"Referência: AGETOP - 80580"]
[4,4,4,3,12,1,1,3,0,5,3,"","Nível 4","Nível 4","-","SINAPI",null,"TANQUES / TORNEIRAS","-",null,1,"-",null,null,0,0,""]
["S",4,"S",0,12,1,1,3,0,0,0,"","Serviço","Serviço","-","AGETOP",80840,"TAMPA T-5 ARTICULADA 20X20","Un    ",1,1,1,null,null,0,0,""]
["S",4,"S",0,12,1,1,3,0,0,0,"","Serviço","Serviço","-","AGETOP",80845,"CAIXA DE ALVENARIA 20x20x25 CM (REVESTIMENTO IMPERMEABILIZADO), FUNDO DE BRITA SEM TAMPA - PARA REGISTRO/TORNEIRA JARDIM","Un    ",1,1,1,null,null,0,0,""]
[4,4,4,2,12,1,1,4,0,2,15,"","Nível 4","Nível 4","-","SINAPI",null,"REGISTROS","-",null,1,"-",null,null,0,0,""]
["S",4,"S",0,12,1,1,4,0,0,0,"","Serviço","Serviço","-","SINAPI",94500,"REGISTRO DE GAVETA BRUTO, LATÃO, ROSCÁVEL, 3\u0094, INSTALADO EM RESERVAÇÃO DE ÁGUA DE EDIFICAÇÃO QUE POSSUA RESERVATÓRIO DE FIBRA/FIBROCIMENTO \u0096 FORNECIMENTO E INSTALAÇÃO. AF_06/2016","UN",1,1,1,null,null,0,0,"Referência: AGETOP - 80911"]
[3,3,3,28,12,1,2,0,0,47,28,"","Nível 3","Nível 3","-","SINAPI",null,"ÁGUA FRIA","-",null,1,"-",null,null,0,0,""]
[4,4,4,4,12,1,2,1,0,27,4,"","Nível 4","Nível 4","-","SINAPI",null,"TUBOS DE PVC SOLDÁVEL","-",null,1,"-",null,null,0,0,""]
["S",4,"S",0,12,1,2,1,0,0,0,"","Serviço","Serviço","-","SINAPI",89446,"TUBO, PVC, SOLDÁVEL, DN 25MM, INSTALADO EM PRUMADA DE ÁGUA - FORNECIMENTO E INSTALAÇÃO. AF_12/2014","M",6,1,6,null,null,0,0,""]
["S",4,"S",0,12,1,2,1,0,0,0,"","Serviço","Serviço","-","SINAPI",89447,"TUBO, PVC, SOLDÁVEL, DN 32MM, INSTALADO EM PRUMADA DE ÁGUA - FORNECIMENTO E INSTALAÇÃO. AF_12/2014","M",30,1,30,null,null,0,0,""]
["S",4,"S",0,12,1,2,1,0,0,0,"","Serviço","Serviço","-","SINAPI",89449,"TUBO, PVC, SOLDÁVEL, DN 50MM, INSTALADO EM PRUMADA DE ÁGUA - FORNECIMENTO E INSTALAÇÃO. AF_12/2014","M",24,1,24,null,null,0,0,""]
[4,4,4,2,12,1,2,2,0,23,2,"","Nível 4","Nível 4","-","SINAPI",null,"ADAPTADORES DE PVC SOLDÁVEL","-",null,1,"-",null,null,0,0,""]
["S",4,"S",0,12,1,2,2,0,0,0,"","Serviço","Serviço","-","COMPOSIÇÃO","COMP 028_SEE","ADAPTADOR PVC SOLDAVEL FLANGES LIVRES P/ CAIXA D' AGUA 85 MM X 3\"","UN ",2,1,2,null,null,0,0,""]
[4,4,4,3,12,1,2,3,0,21,3,"","Nível 4","Nível 4","-","SINAPI",null,"BUCHAS","-",null,1,"-",null,null,0,0,""]
["S",4,"S",0,12,1,2,3,0,0,0,"","Serviço","Serviço","-","AGETOP",81167,"BUCHA DE REDUCAO SOLDAVEL CURTA 85 X 75 mm","Un    ",1,1,1,null,null,0,0,""]
["S",4,"S",0,12,1,2,3,0,0,0,"","Serviço","Serviço","-","AGETOP",81185,"BUCHA DE REDUÇÃO SOLDÁVEL LONGA 75 X 50 MM","un    ",1,1,1,null,null,0,0,""]
[4,4,4,3,12,1,2,4,0,18,3,"","Nível 4","Nível 4","-","SINAPI",null,"LUVAS","-",null,1,"-",null,null,0,0,""]
["S",4,"S",0,12,1,2,4,0,0,0,"","Serviço","Serviço","-","SINAPI",89541,"LUVA, PVC, SOLDÁVEL, DN 32MM, INSTALADO EM PRUMADA DE ÁGUA - FORNECIMENTO E INSTALAÇÃO. AF_12/2014","UN",1,1,1,null,null,0,0,""]
["S",4,"S",0,12,1,2,4,0,0,0,"","Serviço","Serviço","-","SINAPI",89614,"LUVA, PVC, SOLDÁVEL, DN 85MM, INSTALADO EM PRUMADA DE ÁGUA - FORNECIMENTO E INSTALAÇÃO. AF_12/2014","UN",1,1,1,null,null,0,0,"Referência: AGETOP - 81108"]
[4,4,4,6,12,1,2,5,0,15,6,"","Nível 4","Nível 4","-","SINAPI",null,"JOELHO","-",null,1,"-",null,null,0,0,""]
["S",4,"S",0,12,1,2,5,0,0,0,"","Serviço","Serviço","-","SINAPI",89481,"JOELHO 90 GRAUS, PVC, SOLDÁVEL, DN 25MM, INSTALADO EM PRUMADA DE ÁGUA - FORNECIMENTO E INSTALAÇÃO. AF_12/2014","UN",2,1,2,null,null,0,0,""]
["S",4,"S",0,12,1,2,5,0,0,0,"","Serviço","Serviço","-","SINAPI",89413,"JOELHO 90 GRAUS, PVC, SOLDÁVEL, DN 32MM, INSTALADO EM RAMAL DE DISTRIBUIÇÃO DE ÁGUA - FORNECIMENTO E INSTALAÇÃO. AF_12/2014","UN",3,1,3,null,null,0,0,""]
["S",4,"S",0,12,1,2,5,0,0,0,"","Serviço","Serviço","-","SINAPI",89501,"JOELHO 90 GRAUS, PVC, SOLDÁVEL, DN 50MM, INSTALADO EM PRUMADA DE ÁGUA - FORNECIMENTO E INSTALAÇÃO. AF_12/2014","UN",1,1,1,null,null,0,0,""]
["S",4,"S",0,12,1,2,5,0,0,0,"","Serviço","Serviço","-","SINAPI",90373,"JOELHO 90 GRAUS COM BUCHA DE LATÃO, PVC, SOLDÁVEL, DN 25MM, X 1/2\u0094 INSTALADO EM RAMAL OU SUB-RAMAL DE ÁGUA - FORNECIMENTO E INSTALAÇÃO. AF_12/2014","UN",2,1,2,null,null,0,0,"Referência: AGETOP - 81360"]
["S",4,"S",0,12,1,2,5,0,0,0,"","Serviço","Serviço","-","SINAPI",89521,"JOELHO 90 GRAUS, PVC, SOLDÁVEL, DN 85MM, INSTALADO EM PRUMADA DE ÁGUA - FORNECIMENTO E INSTALAÇÃO. AF_12/2014","UN",3,1,3,null,null,0,0,"Referência: AGETOP - 81327"]
[4,4,4,3,12,1,2,6,0,{"$f":"IF(OR($C212=\"S\",$C212=0),0,MATCH(0,OFFSET($D212,1,$C212,ROW($C$441)-ROW($C212)),0))","v":9},{"$f":"IF(OR($C212=\"S\",$C212=0),0,MATCH(OFFSET($D212,0,$C212)+1,OFFSET($D212,1,$C212,ROW($C$441)-ROW($C212)),0))","v":3},"","Nível 4","Nível 4","-","SINAPI",null,"TÊ","-",null,1,"-",null,null,0,0,""]
["S",4,"S",0,12,1,2,6,0,0,0,"","Serviço","Serviço","-","AGETOP",81424,"TE REDUCAO 90 GRAUS SOLDAVEL 50 X 25 mm","Un    ",1,1,1,null,null,0,0,""]
["S",4,"S",0,12,1,2,6,0,0,0,"","Serviço","Serviço","-","SINAPI",89631,"TE, PVC, SOLDÁVEL, DN 85MM, INSTALADO EM PRUMADA DE ÁGUA - FORNECIMENTO E INSTALAÇÃO. AF_12/2014","UN",1,1,1,null,null,0,0,"Referência: AGETOP - 81408"]
[4,4,4,3,12,1,2,7,0,6,3,"","Nível 4","Nível 4","-","SINAPI",null,"ADESIVOS","-",null,1,"-",null,null,0,0,""]
["S",4,"S",0,12,1,2,7,0,0,0,"","Serviço","Serviço","-","AGETOP",81501,"ADESIVO PLASTICO - FRASCO 850 G","Un    ",1,1,1,null,null,0,0,""]
["S",4,"S",0,12,1,2,7,0,0,0,"","Serviço","Serviço","-","AGETOP",81504,"SOLUCAO LIMPADORA 1000 CM3","Un    ",1,1,1,null,null,0,0,""]
[4,4,4,3,12,1,2,8,0,3,{"$error":"#N/A"},"","Nível 4","Nível 4","-","SINAPI",null,"OUTROS","-",null,1,"-",null,null,0,0,""]
["S",4,"S",0,12,1,2,8,0,0,0,"","Serviço","Serviço","-","SINAPI",94797,"TORNEIRA DE BOIA, ROSCÁVEL, 1\u0094, FORNECIDA E INSTALADA EM RESERVAÇÃO DE ÁGUA. AF_06/2016","UN",1,1,1,null,null,0,0,""]
["S",4,"S",0,12,1,2,8,0,0,0,"","Serviço","Serviço","-","AGETOP",81881,"RES.METALICO TAÇA AÇO PATINÁVEL-V=10M3-COL.SEC.H=6M+FUNDAÇÃO+LOGOTIPO","Un    ",1,1,1,null,null,0,0,""]
[3,3,3,15,12,1,3,0,0,19,15,"","Nível 3","Nível 3","-","SINAPI",null,"ESGOTO SANITÁRIO","-",null,1,"-",null,null,0,0,""]
[4,4,4,2,12,1,3,1,0,14,2,"","Nível 4","Nível 4","-","SINAPI",null,"CORPO DE CAIXA SIFONADA / RALO","-",null,1,"-",null,null,0,0,""]
["S",4,"S",0,12,1,3,1,0,0,0,"","Serviço","Serviço","-","AGETOP",81663,"CORPO CX. SIFONADA DIAM. 150 X 150 X 50","Un    ",2,1,2,null,null,0,0,""]
[4,4,4,4,12,1,3,2,0,12,4,"","Nível 4","Nível 4","-","AGETOP",81663,"JOELHOS","Un    ",null,1,"-",null,null,0,0,""]
["S",4,"S",0,12,1,3,2,0,0,0,"","Serviço","Serviço","-","AGETOP",81927,"JOELHO 90 GRAUS C/ANEL 40 mm ","Un    ",2,1,2,null,null,0,0,""]
["S",4,"S",0,12,1,3,2,0,0,0,"","Serviço","Serviço","-","SINAPI",89724,"JOELHO 90 GRAUS, PVC, SERIE NORMAL, ESGOTO PREDIAL, DN 40 MM, JUNTA SOLDÁVEL, FORNECIDO E INSTALADO EM RAMAL DE DESCARGA OU RAMAL DE ESGOTO SANITÁRIO. AF_12/2014","UN",2,1,2,null,null,0,0,""]
["S",4,"S",0,12,1,3,2,0,0,0,"","Serviço","Serviço","-","SINAPI",89731,"JOELHO 90 GRAUS, PVC, SERIE NORMAL, ESGOTO PREDIAL, DN 50 MM, JUNTA ELÁSTICA, FORNECIDO E INSTALADO EM RAMAL DE DESCARGA OU RAMAL DE ESGOTO SANITÁRIO. AF_12/2014","UN",4,1,4,null,null,0,0,""]
[4,4,4,2,12,1,3,3,0,8,2,"","Nível 4","Nível 4","-","SINAPI",null,"JUNÇÕES","-",null,1,"-",null,null,0,0,""]
["S",4,"S",0,12,1,3,3,0,0,0,"","Serviço","Serviço","-","AGETOP",81973,"JUNCAO SIMPLES DIAM. 100 X 50 MM","Un    ",2,1,2,null,null,0,0,""]
[4,4,4,2,12,1,3,4,0,6,2,"","Nível 4","Nível 4","-","SINAPI",null,"TÊ","-",null,1,"-",null,null,0,0,""]
["S",4,"S",0,12,1,3,4,0,0,0,"","Serviço","Serviço","-","SINAPI",89825,"TE, PVC, SERIE NORMAL, ESGOTO PREDIAL, DN 50 X 50 MM, JUNTA ELÁSTICA, FORNECIDO E INSTALADO EM PRUMADA DE ESGOTO SANITÁRIO OU VENTILAÇÃO. AF_12/2014","UN",2,1,2,null,null,0,0,""]
[4,4,4,4,12,1,3,5,0,4,{"$error":"#N/A"},"","Nível 4","Nível 4","-","SINAPI",null,"TUBOS","-",null,1,"-",null,null,0,0,""]
["S",4,"S",0,12,1,3,5,0,0,0,"","Serviço","Serviço","-","AGETOP",82301,"TUBO SOLD.P/ESGOTO DIAM. 40 MM","m     ",3,1,3,null,null,0,0,""]
["S",4,"S",0,12,1,3,5,0,0,0,"","Serviço","Serviço","-","SINAPI",89798,"TUBO PVC, SERIE NORMAL, ESGOTO PREDIAL, DN 50 MM, FORNECIDO E INSTALADO EM PRUMADA DE ESGOTO SANITÁRIO OU VENTILAÇÃO. AF_12/2014","M",9,1,9,null,null,0,0,""]
["S",4,"S",0,12,1,3,5,0,0,0,"","Serviço","Serviço","-","SINAPI",89800,"TUBO PVC, SERIE NORMAL, ESGOTO PREDIAL, DN 100 MM, FORNECIDO E INSTALADO EM PRUMADA DE ESGOTO SANITÁRIO OU VENTILAÇÃO. AF_12/2014","M",6,1,6,null,null,0,0,""]
[3,3,3,4,12,1,4,0,0,4,200,"","Nível 3","Nível 3","-","SINAPI",null,"EXTRAS","-",null,1,"-",null,null,0,0,""]
["S",3,"S",0,12,1,4,0,0,0,0,"","Serviço","Serviço","-","AGETOP",81825,"CAIXA DE PASSAGEM 60 X 60 CM SEM TAMPA","Un    ",1,1,1,null,null,0,0,""]
["S",3,"S",0,12,1,4,0,0,0,0,"","Serviço","Serviço","-","AGETOP",81823,"TAMPA PARA CAIXA PASSAGEM FERRO FUNDIDO T-33 - TRÁFEGO PESADO","Un    ",1,1,1,null,null,0,0,""]
["S",3,"S",0,12,1,4,0,0,0,0,"","Serviço","Serviço","-","AGETOP",81885,"TERMINAL DE VENTILACAO DIAMETRO 50 MM","Un    ",2,1,2,null,null,0,0,""]
[2,2,2,3,12,2,0,0,0,5,3,"","Nível 2","Nível 2","-","SINAPI",null,"SERVIÇO EM TERRA","-",null,1,"-",null,null,0,0,""]
["S",2,"S",0,12,2,0,0,0,0,0,"","Serviço","Serviço","-","AGETOP",40101,"ESCAVACAO MANUAL DE VALAS < 1 MTS. (OBRAS CIVIS)","m3    ",4.5,1,4.5,null,null,0,0,""]
["S",2,"S",0,12,2,0,0,0,0,0,"","Serviço","Serviço","-","AGETOP",40902,"REATERRO COM APILOAMENTO","m3    ",4.5,1,4.5,null,null,0,0,""]
[2,2,2,2,12,3,0,0,0,2,32,"","Nível 2","Nível 2","-","SINAPI",null,"REVESTIMENTO DE PAREDE","-",null,1,"-",null,null,0,0,""]
["S",{"$f":"IF(OR(C244=\"s\",C244=0),OFFSET(B244,-1,0),C244)","v":2},{"$f":"IF(OFFSET(C244,-1,0)=\"L\",1,IF(OFFSET(C244,-1,0)=1,2,IF(OR(A244=\"s\",A244=0),\"S\",IF(AND(OFFSET(C244,-1,0)=2,A244=4),3,IF(AND(OR(OFFSET(C244,-1,0)=\"s\",OFFSET(C244,-1,0)=0),A244<>\"s\",A244>OFFSET(B244,-1,0)),OFFSET(B244,-1,0),A244)))))","v":"S"},{"$f":"IF(OR(C244=\"S\",C244=0),0,IF(ISERROR(K244),J244,SMALL(J244:K244,1)))","v":0},{"$f":"IF($C244=1,OFFSET(E244,-1,0)+1,OFFSET(E244,-1,0))","v":12},{"$f":"IF($C244=1,0,IF($C244=2,OFFSET(F244,-1,0)+1,OFFSET(F244,-1,0)))","v":3},{"$f":"IF(AND($C244<=2,$C244<>0),0,IF($C244=3,OFFSET(G244,-1,0)+1,OFFSET(G244,-1,0)))","v":0},{"$f":"IF(AND($C244<=3,$C244<>0),0,IF($C244=4,OFFSET(H244,-1,0)+1,OFFSET(H244,-1,0)))","v":0},{"$f":"IF(AND($C244<=4,$C244<>0),0,IF(AND($C244=\"S\",$Y244>0),OFFSET(I244,-1,0)+1,OFFSET(I244,-1,0)))","v":0},0,0,{"$f":"IF(OR(Y244>0,$C244=1),\"F\",\"\")","v":""},"Serviço",{"$f":"CHOOSE(1+LOG(1+2*(C244=1)+4*(C244=2)+8*(C244=3)+16*(C244=4)+32*(C244=\"S\"),2),\"\",\"Nível 1\",\"Nível 2\",\"Nível 3\",\"Nível 4\",\"Serviço\")","v":"Serviço"},"-","AGETOP",200103,"RASGO E ENCHIMENTO DE ALVENARIA","M     ",6,1,6,null,null,0,0,""]
[1,1,1,11,13,0,0,0,0,196,11,"F","Nível 1","Nível 1","13.","AGETOP",null,"PROJETO ELÉTRICO","UN",1,1,1,null,null,0,0,""]
[2,2,2,10,13,1,0,0,0,10,23,"","Nível 2","Nível 2","-",null,null,"INSTALAÇÕES ELÉTRICAS","-",null,1,"-",null,null,0,0,""]
["S",2,"S",0,13,1,0,0,0,0,0,"","Serviço","Serviço","-","AGETOP",70352,"BRACADEIRA METALICA TIPO \"U\" DIAM. 1\"","Un    ",32.5,1,32.5,null,null,0,0,""]
["S",2,"S",0,13,1,0,0,0,0,0,"","Serviço","Serviço","-","AGETOP",70422,"BUCHA E ARRUELA METALICA DIAM. 1\"","PR    ",3,1,3,null,null,0,0,""]
["S",2,"S",0,13,1,0,0,0,0,0,"","Serviço","Serviço","-","SINAPI",91876,"LUVA PARA ELETRODUTO, PVC, ROSCÁVEL, DN 32 MM (1\"), PARA CIRCUITOS TERMINAIS, INSTALADA EM FORRO - FORNECIMENTO E INSTALAÇÃO. AF_12/2015","UN",32.5,1,32.5,null,null,0,0,""]
["S",2,"S",0,13,1,0,0,0,0,0,"","Serviço","Serviço","-","SINAPI",97891,"CAIXA ENTERRADA ELÉTRICA RETANGULAR, EM ALVENARIA COM BLOCOS DE CONCRETO, FUNDO COM BRITA, DIMENSÕES INTERNAS: 0,4X0,4X0,4 M. AF_05/2018","UN",2,1,2,null,null,0,0,""]
["S",2,"S",0,13,1,0,0,0,0,0,"","Serviço","Serviço","-","SINAPI",91930,"CABO DE COBRE FLEXÍVEL ISOLADO, 6 MM², ANTI-CHAMA 450/750 V, PARA CIRCUITOS TERMINAIS - FORNECIMENTO E INSTALAÇÃO. AF_12/2015","M",325,1,325,null,null,0,0,"Referência: AGETOP - 70565"]
["S",2,"S",0,13,1,0,0,0,0,0,"","Serviço","Serviço","-","AGETOP",70691,"CAIXA METALICA RET. 4\" X 2\" X 2\"","Un    ",5,1,5,null,null,0,0,""]
["S",2,"S",0,13,1,0,0,0,0,0,"","Serviço","Serviço","-","SINAPI",91893,"CURVA 90 GRAUS PARA ELETRODUTO, PVC, ROSCÁVEL, DN 32 MM (1\"), PARA CIRCUITOS TERMINAIS, INSTALADA EM FORRO - FORNECIMENTO E INSTALAÇÃO. AF_12/2015","UN",5,1,5,null,null,0,0,""]
["S",2,"S",0,13,1,0,0,0,0,0,"","Serviço","Serviço","-","SINAPI",93672,"DISJUNTOR TRIPOLAR TIPO DIN, CORRENTE NOMINAL DE 40A - FORNECIMENTO E INSTALAÇÃO. AF_04/2016","UN",1,1,1,null,null,0,0,"Referência: AGETOP - 71174"]
["S",2,"S",0,13,1,0,0,0,0,0,"","Serviço","Serviço","-","SINAPI",91868,"ELETRODUTO RÍGIDO ROSCÁVEL, PVC, DN 32 MM (1\"), PARA CIRCUITOS TERMINAIS, INSTALADO EM LAJE - FORNECIMENTO E INSTALAÇÃO. AF_12/2015","M",65,1,65,null,null,0,0,"Referência: AGETOP - 71202"]
[{"$f":"CHOOSE(1+LOG(1+2*(ORÇAMENTO.Nivel=\"Nível 1\")+4*(ORÇAMENTO.Nivel=\"Nível 2\")+8*(ORÇAMENTO.Nivel=\"Nível 3\")+16*(ORÇAMENTO.Nivel=\"Nível 4\")+32*(ORÇAMENTO.Nivel=\"Serviço\"),2),0,1,2,3,4,\"S\")","v":1},1,1,10,14,0,0,0,0,185,10,"F","Nível 1","Nível 1","14.","AGETOP",null,"PROJETO DE PREVENÇÃO E COMBATE A INCÊNDIO","UN",1,1,1,null,null,0,0,""]
[2,2,2,9,14,1,0,0,0,9,12,"","Nível 2","Nível 2","-","AGETOP",null,"INSTALAÇÕES ESPECIAIS","-",null,1,"-",null,null,0,0,""]
["S",2,"S",0,14,1,0,0,0,0,0,"","Serviço","Serviço","-","AGETOP",85006,"EXTINTOR MULTI USO EM PO A B C (6 KG) - CAPACIDADE EXTINTORA 3A 20BC","un    ",6,1,6,null,null,0,0,""]
["S",2,"S",0,14,1,0,0,0,0,0,"","Serviço","Serviço","-","SINAPI","73775/2","EXTINTOR INCENDIO AGUA-PRESSURIZADA 10L INCL SUPORTE PAREDE CARGA     COMPLETA FORNECIMENTO E COLOCACAO","UN",1,1,1,null,null,0,0,""]
["S",2,"S",0,14,1,0,0,0,0,0,"","Serviço","Serviço","-","AGETOP",85003,"EXTINTOR PO QUIMICO SECO (6 KG) - CAPACIDADE EXTINTORA 20 BC","Un    ",1,1,1,null,null,0,0,""]
["S",2,"S",0,14,1,0,0,0,0,0,"","Serviço","Serviço","-","AGETOP",85001,"EXTINTOR CO2 (6 KG) - CAPACIDADE EXTINTORA 5 BC","Un    ",1,1,1,null,null,0,0,""]
["S",2,"S",0,14,1,0,0,0,0,0,"","Serviço","Serviço","-","SINAPI",97599,"LUMINÁRIA DE EMERGÊNCIA, COM 30 LÂMPADAS LED DE 2 W, SEM REATOR - FORNECIMENTO E INSTALAÇÃO. AF_02/2020","UN",20,1,20,null,null,0,0,""]
["S",2,"S",0,14,1,0,0,0,0,0,"","Serviço","Serviço","-","COMPOSIÇÃO","COMP 024_SEE","SINALIZADOR FOTOLUMINESCENTE PARA EXTINTOR","UN ",9,1,9,null,null,0,0,""]
["S",2,"S",0,14,1,0,0,0,0,0,"","Serviço","Serviço","-","COMPOSIÇÃO","COMP 025_SEE","SINALIZADOR FOTOLUMINESCENTE DE EMERGÊNCIA","UN ",23,1,23,null,null,0,0,""]
["S",2,"S",0,14,1,0,0,0,0,0,"","Serviço","Serviço","-","COMPOSIÇÃO","COMP 277_SEE","MARCAÇÃO NO PISO - 1X1 M PARA EXTINTOR","M2",9,1,9,null,null,0,0,""]
[1,1,1,175,15,0,0,0,0,175,{"$error":"#N/A"},"F","Nível 1","Nível 1","15.","AGETOP",null,"COZINHA SEDUC OPÇÃO 2","UN",1,1,1,null,null,0,0,""]
[2,2,2,2,15,1,0,0,0,174,2,"","Nível 2","Nível 2","-","AGETOP",null,"SERVIÇOS PRELIMINARES","-",null,1,"-",null,null,0,0,""]
["S",2,"S",0,15,1,0,0,0,0,0,"","Serviço","Serviço","-","AGETOP",20701,"LOCAÇÃO DA OBRA, EXECUÇÃO DE GABARITO SEM REAPROVEITAMENTO, INCLUSO PINTURA (FACE INTERNA DO RIPÃO 15CM) E PIQUETE COM TESTEMUNHA","m2    ",56.76,1,56.76,null,null,0,0,""]
[2,2,2,3,15,2,0,0,0,172,3,"","Nível 2","Nível 2","-","AGETOP",null,"TRANSPORTES","-",null,1,"-",null,null,0,0,""]
["S",2,"S",0,15,2,0,0,0,0,0,"","Serviço","Serviço","-","SINAPI",72900,"TRANSPORTE DE ENTULHO COM CAMINHAO BASCULANTE 6 M3, RODOVIA PAVIMENTADA, DMT 0,5 A 1,0 KM","M3",7,1,7,null,null,0,0,""]
["S",2,"S",0,15,2,0,0,0,0,0,"","Serviço","Serviço","-","SINAPI",72897,"CARGA MANUAL DE ENTULHO EM CAMINHAO BASCULANTE 6 M3","M3",7,1,7,null,null,0,0,""]
[2,2,2,3,15,3,0,0,0,169,3,"","Nível 2","Nível 2","-","AGETOP",null,"SERVIÇO EM TERRA","-",null,1,"-",null,null,0,0,""]
["S",2,"S",0,15,3,0,0,0,0,0,"","Serviço","Serviço","-","AGETOP",41003,"ATERRO INTERNO SEM APILOAM.C/TR.EM CARRINHO MÃO","m3    ",2.8380000000000001,1,2.8380000000000001,null,null,0,0,""]
["S",2,"S",0,15,3,0,0,0,0,0,"","Serviço","Serviço","-","AGETOP",41002,"APILOAMENTO","m2    ",56.76,1,56.76,null,null,0,0,""]
[2,2,2,12,15,4,0,0,0,166,12,"","Nível 2","Nível 2","-","AGETOP",null,"FUNDAÇÕES E SONDAGENS","-",null,1,"-",null,null,0,0,""]
[3,3,3,11,15,4,1,0,0,{"$f":"IF(OR($C276=\"S\",$C276=0),0,MATCH(0,OFFSET($D276,1,$C276,ROW($C$441)-ROW($C276)),0))","v":11},{"$f":"IF(OR($C276=\"S\",$C276=0),0,MATCH(OFFSET($D276,0,$C276)+1,OFFSET($D276,1,$C276,ROW($C$441)-ROW($C276)),0))","v":18},"","Nível 3","Nível 3","-","SINAPI",null,"BLOCOS SOBRE ESTACAS","-",null,1,"-",null,null,0,0,""]
["S",3,"S",0,15,4,1,0,0,0,0,"","Serviço","Serviço","-","SINAPI",98230,"ESTACA BROCA DE CONCRETO, DIÂMETRO DE 30 CM, PROFUNDIDADE DE ATÉ 3 M, ESCAVAÇÃO MANUAL COM TRADO CONCHA, NÃO ARMADA. AF_03/2018","M",54.5,1,54.5,null,null,0,0,"Referência: AGETOP - 50302"]
["S",3,"S",0,15,4,1,0,0,0,0,"","Serviço","Serviço","-","AGETOP",50902,"APILOAMENTO (BLOCOS/SAPATAS)","m2    ",2.85,1,2.85,null,null,0,0,""]
["S",3,"S",0,15,4,1,0,0,0,0,"","Serviço","Serviço","-","AGETOP",50901,"ESCAVACAO MANUAL DE VALAS (SAPATAS/BLOCOS)","m3    ",1.86,1,1.86,null,null,0,0,""]
["S",3,"S",0,15,4,1,0,0,0,0,"","Serviço","Serviço","-","SINAPI",96616,"LASTRO DE CONCRETO MAGRO, APLICADO EM BLOCOS DE COROAMENTO OU SAPATAS. AF_08/2017","M3",0.15,1,0.15,null,null,0,0,""]
["S",3,"S",0,15,4,1,0,0,0,0,"","Serviço","Serviço","-","SINAPI",94963,"CONCRETO FCK = 15MPA, TRAÇO 1:3,4:3,5 (CIMENTO/ AREIA MÉDIA/ BRITA 1)  - PREPARO MECÂNICO COM BETONEIRA 400 L. AF_07/2016","M3",1.71,1,1.71,null,null,0,0,""]
["S",3,"S",0,15,4,1,0,0,0,0,"","Serviço","Serviço","-","AGETOP",51026,"LANÇAMENTO/APLICAÇÃO/ADENSAMENTO DE CONCRETO EM FUNDAÇÃO- (O.C.)","m3    ",1.86,1,1.86,null,null,0,0,""]
["S",3,"S",0,15,4,1,0,0,0,0,"","Serviço","Serviço","-","SINAPI",96544,"ARMAÇÃO DE BLOCO, VIGA BALDRAME OU SAPATA UTILIZANDO AÇO CA-50 DE 6,3 MM - MONTAGEM. AF_06/2017","KG",26,1,26,null,null,0,0,"Referência: AGETOP - 52003"]
["S",3,"S",0,15,4,1,0,0,0,0,"","Serviço","Serviço","-","SINAPI",96545,"ARMAÇÃO DE BLOCO, VIGA BALDRAME OU SAPATA UTILIZANDO AÇO CA-50 DE 8 MM - MONTAGEM. AF_06/2017","KG",93,1,93,null,null,0,0,"Referência: AGETOP - 52004"]
[{"$f":"CHOOSE(1+LOG(1+2*(ORÇAMENTO.Nivel=\"Nível 1\")+4*(ORÇAMENTO.Nivel=\"Nível 2\")+8*(ORÇAMENTO.Nivel=\"Nível 3\")+16*(ORÇAMENTO.Nivel=\"Nível 4\")+32*(ORÇAMENTO.Nivel=\"Serviço\"),2),0,1,2,3,4,\"S\")","v":"S"},3,"S",0,15,4,1,0,0,0,0,"","Serviço","Serviço","-","SINAPI",96546,"ARMAÇÃO DE BLOCO, VIGA BALDRAME OU SAPATA UTILIZANDO AÇO CA-50 DE 10 MM - MONTAGEM. AF_06/2017","KG",76,1,76,null,null,0,0,"Referência: AGETOP - 52005"]
["S",3,"S",0,15,4,1,0,0,0,0,"","Serviço","Serviço","-","SINAPI",96543,"ARMAÇÃO DE BLOCO, VIGA BALDRAME E SAPATA UTILIZANDO AÇO CA-60 DE 5 MM - MONTAGEM. AF_06/2017","KG",28,1,28,null,null,0,0,"Referência: AGETOP - 52014"]
[2,2,2,21,15,5,0,0,0,154,21,"","Nível 2","Nível 2","-","AGETOP",null,"ESTRUTURA","-",null,1,"-",null,null,0,0,""]
[3,3,3,6,15,5,1,0,0,20,6,"","Nível 3","Nível 3","-","SINAPI",null,"PILARES","-",null,1,"-",null,null,0,0,""]
["S",3,"S",0,15,5,1,0,0,0,0,"","Serviço","Serviço","-","SINAPI",92426,"MONTAGEM E DESMONTAGEM DE FÔRMA DE PILARES RETANGULARES E ESTRUTURAS SIMILARES COM ÁREA MÉDIA DAS SEÇÕES MENOR OU IGUAL A 0,25 M², PÉ-DIREITO SIMPLES, EM CHAPA DE MADEIRA COMPENSADA RESINADA, 8 UTILIZAÇÕES. AF_12/2015","M2",27.96,1,27.96,null,null,0,0,""]
["S",3,"S",0,15,5,1,0,0,0,0,"","Serviço","Serviço","-","SINAPI",94964,"CONCRETO FCK = 20MPA, TRAÇO 1:2,7:3 (CIMENTO/ AREIA MÉDIA/ BRITA 1)  - PREPARO MECÂNICO COM BETONEIRA 400 L. AF_07/2016","M3",1.22,1,1.22,null,null,0,0,""]
["S",3,"S",0,15,5,1,0,0,0,0,"","Serviço","Serviço","-","SINAPI",92873,"LANÇAMENTO COM USO DE BALDES, ADENSAMENTO E ACABAMENTO DE CONCRETO EM ESTRUTURAS. AF_12/2015","M3",1.22,1,1.22,null,null,0,0,"Referência: AGETOP - 60801"]
["S",3,"S",0,15,5,1,0,0,0,0,"","Serviço","Serviço","-","SINAPI",92778,"ARMAÇÃO DE PILAR OU VIGA DE UMA ESTRUTURA CONVENCIONAL DE CONCRETO ARMADO EM UMA EDIFICAÇÃO TÉRREA OU SOBRADO UTILIZANDO AÇO CA-50 DE 10,0 MM - MONTAGEM. AF_12/2015","KG",104,1,104,null,null,0,0,"Referência: AGETOP - 60305"]
["S",3,"S",0,15,5,1,0,0,0,0,"","Serviço","Serviço","-","SINAPI",92775,"ARMAÇÃO DE PILAR OU VIGA DE UMA ESTRUTURA CONVENCIONAL DE CONCRETO ARMADO EM UMA EDIFICAÇÃO TÉRREA OU SOBRADO UTILIZANDO AÇO CA-60 DE 5,0 MM - MONTAGEM. AF_12/2015","KG",41,1,41,null,null,0,0,"Referência: AGETOP - 60314"]
[3,3,3,6,15,5,2,0,0,14,6,"","Nível 3","Nível 3","-",null,null,"VIGAS BALDRAMES","-",null,1,"-",null,null,0,0,""]
["S",3,"S",0,15,5,2,0,0,0,0,"","Serviço","Serviço","-","SINAPI",92464,"MONTAGEM E DESMONTAGEM DE FÔRMA DE VIGA, ESCORAMENTO METÁLICO, PÉ-DIREITO SIMPLES, EM CHAPA DE MADEIRA RESINADA, 8 UTILIZAÇÕES. AF_12/2015","M2",54.25,1,54.25,null,null,0,0,"Referência: AGETOP - 60209"]
["S",3,"S",0,15,5,2,0,0,0,0,"","Serviço","Serviço","-","SINAPI",94964,"CONCRETO FCK = 20MPA, TRAÇO 1:2,7:3 (CIMENTO/ AREIA MÉDIA/ BRITA 1)  - PREPARO MECÂNICO COM BETONEIRA 400 L. AF_07/2016","M3",3.08,1,3.08,null,null,0,0,""]
["S",3,"S",0,15,5,2,0,0,0,0,"","Serviço","Serviço","-","SINAPI",92873,"LANÇAMENTO COM USO DE BALDES, ADENSAMENTO E ACABAMENTO DE CONCRETO EM ESTRUTURAS. AF_12/2015","M3",3.08,1,3.08,null,null,0,0,"Referência: AGETOP - 60801"]
["S",3,"S",0,15,5,2,0,0,0,0,"","Serviço","Serviço","-","SINAPI",92777,"ARMAÇÃO DE PILAR OU VIGA DE UMA ESTRUTURA CONVENCIONAL DE CONCRETO ARMADO EM UMA EDIFICAÇÃO TÉRREA OU SOBRADO UTILIZANDO AÇO CA-50 DE 8,0 MM - MONTAGEM. AF_12/2015","KG",145,1,145,null,null,0,0,"Referência: AGETOP - 60304"]
["S",3,"S",0,15,5,2,0,0,0,0,"","Serviço","Serviço","-","SINAPI",92775,"ARMAÇÃO DE PILAR OU VIGA DE UMA ESTRUTURA CONVENCIONAL DE CONCRETO ARMADO EM UMA EDIFICAÇÃO TÉRREA OU SOBRADO UTILIZANDO AÇO CA-60 DE 5,0 MM - MONTAGEM. AF_12/2015","KG",71,1,71,null,null,0,0,"Referência: AGETOP - 60314"]
[3,3,3,8,15,5,3,0,0,8,134,"","Nível 3","Nível 3","-","SINAPI",null,"VIGAS DA COBERTURA E LAJE PRÉ-MOLDADA","-",null,1,"-",null,null,0,0,""]
["S",3,"S",0,15,5,3,0,0,0,0,"","Serviço","Serviço","-","SINAPI",92464,"MONTAGEM E DESMONTAGEM DE FÔRMA DE VIGA, ESCORAMENTO METÁLICO, PÉ-DIREITO SIMPLES, EM CHAPA DE MADEIRA RESINADA, 8 UTILIZAÇÕES. AF_12/2015","M2",24.38,1,24.38,null,null,0,0,"Referência: AGETOP - 60209"]
["S",3,"S",0,15,5,3,0,0,0,0,"","Serviço","Serviço","-","AGETOP",61101,"FORRO EM LAJE PRE-MOLDADA INC.CAPEAMENTO/FERR.DISTRIB./ESCORAMENTO E FORMA/DESFORMA","m2    ",41.6,1,41.6,null,null,0,0,""]
["S",3,"S",0,15,5,3,0,0,0,0,"","Serviço","Serviço","-","SINAPI",92723,"CONCRETAGEM DE VIGAS E LAJES, FCK=20 MPA, PARA LAJES PREMOLDADAS COM USO DE BOMBA EM EDIFICAÇÃO COM ÁREA MÉDIA DE LAJES MENOR OU IGUAL A 20 M² - LANÇAMENTO, ADENSAMENTO E ACABAMENTO. AF_12/2015","M3",1.38,1,1.38,null,null,0,0,""]
["S",3,"S",0,15,5,3,0,0,0,0,"","Serviço","Serviço","-","SINAPI",92873,"LANÇAMENTO COM USO DE BALDES, ADENSAMENTO E ACABAMENTO DE CONCRETO EM ESTRUTURAS. AF_12/2015","M3",2.52,1,2.52,null,null,0,0,"Referência: AGETOP - 60801"]
["S",3,"S",0,15,5,3,0,0,0,0,"","Serviço","Serviço","-","SINAPI",92778,"ARMAÇÃO DE PILAR OU VIGA DE UMA ESTRUTURA CONVENCIONAL DE CONCRETO ARMADO EM UMA EDIFICAÇÃO TÉRREA OU SOBRADO UTILIZANDO AÇO CA-50 DE 10,0 MM - MONTAGEM. AF_12/2015","KG",49,1,49,null,null,0,0,"Referência: AGETOP - 60305"]
["S",3,"S",0,15,5,3,0,0,0,0,"","Serviço","Serviço","-","SINAPI",92777,"ARMAÇÃO DE PILAR OU VIGA DE UMA ESTRUTURA CONVENCIONAL DE CONCRETO ARMADO EM UMA EDIFICAÇÃO TÉRREA OU SOBRADO UTILIZANDO AÇO CA-50 DE 8,0 MM - MONTAGEM. AF_12/2015","KG",40,1,40,null,null,0,0,"Referência: AGETOP - 60304"]
["S",3,"S",0,15,5,3,0,0,0,0,"","Serviço","Serviço","-","SINAPI",92775,"ARMAÇÃO DE PILAR OU VIGA DE UMA ESTRUTURA CONVENCIONAL DE CONCRETO ARMADO EM UMA EDIFICAÇÃO TÉRREA OU SOBRADO UTILIZANDO AÇO CA-60 DE 5,0 MM - MONTAGEM. AF_12/2015","KG",33,1,33,null,null,0,0,"Referência: AGETOP - 60314"]
[2,2,2,26,15,6,0,0,0,133,26,"","Nível 2","Nível 2","-",null,null,"INSTALAÇÕES ELÉTRICAS","-",null,1,"-",null,null,0,0,""]
["S",2,"S",0,15,6,0,0,0,0,0,"","Serviço","Serviço","-","AGETOP",70421,"BUCHA E ARRUELA METALICA DIAM. 3/4\"","PR    ",3,1,3,null,null,0,0,""]
["S",2,"S",0,15,6,0,0,0,0,0,"","Serviço","Serviço","-","AGETOP",70580,"CABO PVC (70ºC) 1 KV No 1,5 MM2","M     ",108.2,1,108.2,null,null,0,0,""]
["S",2,"S",0,15,6,0,0,0,0,0,"","Serviço","Serviço","-","AGETOP",70581,"CABO PVC (70ºC) 1 KV No. 2,5 MM2","M     ",356.5,1,356.5,null,null,0,0,""]
["S",2,"S",0,15,6,0,0,0,0,0,"","Serviço","Serviço","-","AGETOP",70583,"CABO PVC (70ºC) 1 KV No. 6 MM2","M     ",60.8,1,60.8,null,null,0,0,""]
["S",2,"S",0,15,6,0,0,0,0,0,"","Serviço","Serviço","-","SINAPI",92866,"CAIXA SEXTAVADA 3\" X 3\", METÁLICA, INSTALADA EM LAJE - FORNECIMENTO E INSTALAÇÃO. AF_12/2015","UN",10,1,10,null,null,0,0,"Referência: AGETOP - 70680"]
["S",2,"S",0,15,6,0,0,0,0,0,"","Serviço","Serviço","-","SINAPI",92868,"CAIXA RETANGULAR 4\" X 2\" MÉDIA (1,30 M DO PISO), METÁLICA, INSTALADA EM PAREDE - FORNECIMENTO E INSTALAÇÃO. AF_12/2015","UN",26,1,26,null,null,0,0,"Referência: AGETOP - 70691"]
["S",2,"S",0,15,6,0,0,0,0,0,"","Serviço","Serviço","-","SINAPI",91902,"CURVA 90 GRAUS PARA ELETRODUTO, PVC, ROSCÁVEL, DN 25 MM (3/4\"), PARA CIRCUITOS TERMINAIS, INSTALADA EM LAJE - FORNECIMENTO E INSTALAÇÃO. AF_12/2015","UN",1,1,1,null,null,0,0,"Referência: AGETOP - 71141"]
["S",2,"S",0,15,6,0,0,0,0,0,"","Serviço","Serviço","-","SINAPI",93653,"DISJUNTOR MONOPOLAR TIPO DIN, CORRENTE NOMINAL DE 10A - FORNECIMENTO E INSTALAÇÃO. AF_04/2016","UN",12,1,12,null,null,0,0,""]
[{"$f":"CHOOSE(1+LOG(1+2*(ORÇAMENTO.Nivel=\"Nível 1\")+4*(ORÇAMENTO.Nivel=\"Nível 2\")+8*(ORÇAMENTO.Nivel=\"Nível 3\")+16*(ORÇAMENTO.Nivel=\"Nível 4\")+32*(ORÇAMENTO.Nivel=\"Serviço\"),2),0,1,2,3,4,\"S\")","v":"S"},2,"S",0,15,6,0,0,0,0,0,"","Serviço","Serviço","-","SINAPI",93654,"DISJUNTOR MONOPOLAR TIPO DIN, CORRENTE NOMINAL DE 16A - FORNECIMENTO E INSTALAÇÃO. AF_04/2016","UN",1,1,1,null,null,0,0,""]
["S",2,"S",0,15,6,0,0,0,0,0,"","Serviço","Serviço","-","AGETOP",71450,"INTERRUPTOR DIFERENCIAL RESIDUAL (D.R.) BIPOLAR DE 25A-30mA","Un    ",12,1,12,null,null,0,0,""]
["S",2,"S",0,15,6,0,0,0,0,0,"","Serviço","Serviço","-","SINAPI",91844,"ELETRODUTO FLEXÍVEL CORRUGADO, PVC, DN 25 MM (3/4\"), PARA CIRCUITOS TERMINAIS, INSTALADO EM LAJE - FORNECIMENTO E INSTALAÇÃO. AF_12/2015","M",40,1,40,null,null,0,0,""]
["S",2,"S",0,15,6,0,0,0,0,0,"","Serviço","Serviço","-","SINAPI",91846,"ELETRODUTO FLEXÍVEL CORRUGADO, PVC, DN 32 MM (1\"), PARA CIRCUITOS TERMINAIS, INSTALADO EM LAJE - FORNECIMENTO E INSTALAÇÃO. AF_12/2015","M",10.1,1,10.1,null,null,0,0,""]
["S",2,"S",0,15,6,0,0,0,0,0,"","Serviço","Serviço","-","AGETOP",71197,"ELETRODUTO PVC FLEXÍVEL - MANGUEIRA CORRUGADA REFORÇADA - DIAM. 50MM","M     ",31.1,1,31.1,null,null,0,0,""]
["S",2,"S",0,15,6,0,0,0,0,0,"","Serviço","Serviço","-","SINAPI",97617,"LÂMPADA TUBULAR FLUORESCENTE T10 DE 20/40 W, BASE G13 - FORNECIMENTO E INSTALAÇÃO. AF_02/2020_P","UN",1,1,1,null,null,0,0,""]
["S",2,"S",0,15,6,0,0,0,0,0,"","Serviço","Serviço","-","SINAPI",100922,"REATOR DE PARTIDA RÁPIDA PARA LÂMPADA FLUORESCENTE 1X20W - FORNECIMENTO E INSTALAÇÃO. AF_02/2020","UN",4,1,4,null,null,0,0,""]
["S",{"$f":"IF(OR(C324=\"s\",C324=0),OFFSET(B324,-1,0),C324)","v":2},{"$f":"IF(OFFSET(C324,-1,0)=\"L\",1,IF(OFFSET(C324,-1,0)=1,2,IF(OR(A324=\"s\",A324=0),\"S\",IF(AND(OFFSET(C324,-1,0)=2,A324=4),3,IF(AND(OR(OFFSET(C324,-1,0)=\"s\",OFFSET(C324,-1,0)=0),A324<>\"s\",A324>OFFSET(B324,-1,0)),OFFSET(B324,-1,0),A324)))))","v":"S"},{"$f":"IF(OR(C324=\"S\",C324=0),0,IF(ISERROR(K324),J324,SMALL(J324:K324,1)))","v":0},{"$f":"IF($C324=1,OFFSET(E324,-1,0)+1,OFFSET(E324,-1,0))","v":15},{"$f":"IF($C324=1,0,IF($C324=2,OFFSET(F324,-1,0)+1,OFFSET(F324,-1,0)))","v":6},{"$f":"IF(AND($C324<=2,$C324<>0),0,IF($C324=3,OFFSET(G324,-1,0)+1,OFFSET(G324,-1,0)))","v":0},{"$f":"IF(AND($C324<=3,$C324<>0),0,IF($C324=4,OFFSET(H324,-1,0)+1,OFFSET(H324,-1,0)))","v":0},{"$f":"IF(AND($C324<=4,$C324<>0),0,IF(AND($C324=\"S\",$Y324>0),OFFSET(I324,-1,0)+1,OFFSET(I324,-1,0)))","v":0},0,0,{"$f":"IF(OR(Y324>0,$C324=1),\"F\",\"\")","v":""},"Serviço",{"$f":"CHOOSE(1+LOG(1+2*(C324=1)+4*(C324=2)+8*(C324=3)+16*(C324=4)+32*(C324=\"S\"),2),\"\",\"Nível 1\",\"Nível 2\",\"Nível 3\",\"Nível 4\",\"Serviço\")","v":"Serviço"},"-","SINAPI",100923,"REATOR DE PARTIDA RÁPIDA PARA LÂMPADA FLUORESCENTE 1X40W - FORNECIMENTO E INSTALAÇÃO. AF_02/2020","UN",2,1,2,null,null,0,0,""]
["S",2,"S",0,15,6,0,0,0,0,0,"","Serviço","Serviço","-","AGETOP",72341,"SOQUETE ANTIVIBRATORIO P/LAMP.FLUORESCENTE","Un    ",34,1,34,null,null,0,0,""]
["S",2,"S",0,15,6,0,0,0,0,0,"","Serviço","Serviço","-","SINAPI",91955,"INTERRUPTOR PARALELO (1 MÓDULO), 10A/250V, INCLUINDO SUPORTE E PLACA - FORNECIMENTO E INSTALAÇÃO. AF_12/2015","UN",2,1,2,null,null,0,0,"Referência: AGETOP - 71431"]
["S",2,"S",0,15,6,0,0,0,0,0,"","Serviço","Serviço","-","SINAPI",91953,"INTERRUPTOR SIMPLES (1 MÓDULO), 10A/250V, INCLUINDO SUPORTE E PLACA - FORNECIMENTO E INSTALAÇÃO. AF_12/2015","UN",5,1,5,null,null,0,0,"Referência: AGETOP - 71440"]
["S",2,"S",0,15,6,0,0,0,0,0,"","Serviço","Serviço","-","SINAPI",91959,"INTERRUPTOR SIMPLES (2 MÓDULOS), 10A/250V, INCLUINDO SUPORTE E PLACA - FORNECIMENTO E INSTALAÇÃO. AF_12/2015","UN",1,1,1,null,null,0,0,"Referência: AGETOP - 71441"]
["S",2,"S",0,15,6,0,0,0,0,0,"","Serviço","Serviço","-","AGETOP",71380,"HASTE REV.COBRE(COPPERWELD)  3/4\" X 2,40 M C/CONECTOR","Un    ",3,1,3,null,null,0,0,""]
["S",2,"S",0,15,6,0,0,0,0,0,"","Serviço","Serviço","-","SINAPI",97611,"LÂMPADA COMPACTA FLUORESCENTE DE 15 W, BASE E27 - FORNECIMENTO E INSTALAÇÃO. AF_02/2020","UN",1,1,1,null,null,0,0,"Referência: AGETOP - 71567"]
["S",2,"S",0,15,6,0,0,0,0,0,"","Serviço","Serviço","-","AGETOP",72190,"QUADRO DE DISTRIBUIÇÃO DE EMBUTIR METÁLICO CB-24E - 150A","Un    ",1,1,1,null,null,0,0,""]
["S",2,"S",0,15,6,0,0,0,0,0,"","Serviço","Serviço","-","SINAPI",91884,"LUVA PARA ELETRODUTO, PVC, ROSCÁVEL, DN 25 MM (3/4\"), PARA CIRCUITOS TERMINAIS, INSTALADA EM PAREDE - FORNECIMENTO E INSTALAÇÃO. AF_12/2015","UN",3,1,3,null,null,0,0,"Referência: AGETOP - 71741"]
["S",2,"S",0,15,6,0,0,0,0,0,"","Serviço","Serviço","-","SINAPI",91996,"TOMADA MÉDIA DE EMBUTIR (1 MÓDULO), 2P+T 10 A, INCLUINDO SUPORTE E PLACA - FORNECIMENTO E INSTALAÇÃO. AF_12/2015","UN",17,1,17,null,null,0,0,"Referência: AGETOP - 72578"]
[2,2,2,57,15,7,0,0,0,107,57,"","Nível 2","Nível 2","-","AGETOP",null,"INSTALAÇÕES HIDROSSANITÁRIAS","-",null,1,"-",null,null,0,0,""]
[3,3,3,56,15,7,1,0,0,56,93,"","Nível 3","Nível 3","-","SINAPI",null,"PEÇAS E ACESSÓRIOS","-",null,1,"-",null,null,0,0,""]
["S",3,"S",0,15,7,1,0,0,0,0,"","Serviço","Serviço","-","AGETOP",81825,"CAIXA DE PASSAGEM 60 X 60 CM SEM TAMPA","Un    ",5,1,5,null,null,0,0,""]
["S",3,"S",0,15,7,1,0,0,0,0,"","Serviço","Serviço","-","AGETOP",81826,"TAMPA EM CONCRETO ARMADO 25 MPA E=5CM PARA A CAIXA DE PASSAGEM 60X60CM","Un    ",5,1,5,null,null,0,0,""]
["S",3,"S",0,15,7,1,0,0,0,0,"","Serviço","Serviço","-","AGETOP",80510,"ANEL DE VEDAÇÃO PARA VASO SANITÁRIO","Un    ",1,1,1,null,null,0,0,""]
["S",3,"S",0,15,7,1,0,0,0,0,"","Serviço","Serviço","-","AGETOP",80512,"TUBO DE DESCIDA PARA CAIXA DE DESCARGA ( LONGO 1 1/4\" )","Un    ",1,1,1,null,null,0,0,""]
["S",3,"S",0,15,7,1,0,0,{"$f":"IF(OR($C340=\"S\",$C340=0),0,MATCH(0,OFFSET($D340,1,$C340,ROW($C$441)-ROW($C340)),0))","v":0},{"$f":"IF(OR($C340=\"S\",$C340=0),0,MATCH(OFFSET($D340,0,$C340)+1,OFFSET($D340,1,$C340,ROW($C$441)-ROW($C340)),0))","v":0},"","Serviço","Serviço","-","AGETOP",80514,"TUBO DE LIGACAO PVC CROMADO 1.1/2\" / ESPUDE  - (ENTRADA)","Un    ",1,1,1,null,null,0,0,""]
["S",3,"S",0,15,7,1,0,0,0,0,"","Serviço","Serviço","-","AGETOP",80515,"VÁLVULA DE DESCARGA DUPLO ACIONAMENTO COM ACABAMENTO CROMADO ","Un    ",14,1,14,null,null,0,0,""]
["S",3,"S",0,15,7,1,0,0,0,0,"","Serviço","Serviço","-","AGETOP",80520,"CONJUNTO DE FIXACAO P/VASO SANITARIO (PAR)","CJ    ",1,1,1,null,null,0,0,""]
["S",3,"S",0,15,7,1,0,0,0,0,"","Serviço","Serviço","-","AGETOP",80532,"PORTA PAPEL HIGIÊNICO EM METAL/ACABAMENTO CROMADO","Un    ",1,1,1,null,null,0,0,""]
["S",3,"S",0,15,7,1,0,0,0,0,"","Serviço","Serviço","-","AGETOP",80542,"LAVATÓRIO MÉDIO SEM COLUNA","Un    ",1,1,1,null,null,0,0,""]
["S",3,"S",0,15,7,1,0,0,0,0,"","Serviço","Serviço","-","AGETOP",80550,"FIXACAO P/LAVATORIO (PAR)","PAR   ",1,1,1,null,null,0,0,""]
["S",3,"S",0,15,7,1,0,0,0,0,"","Serviço","Serviço","-","AGETOP",80556,"LIGAÇÃO FLEXÍVEL PVC DIAM.1/2\" (ENGATE)","Un    ",1,1,1,null,null,0,0,""]
["S",3,"S",0,15,7,1,0,0,0,0,"","Serviço","Serviço","-","AGETOP",80562,"SIFAO FLEXIVEL UNIVERSAL ( SANFONADO) EM PVC PARA LAVATORIO","Un    ",1,1,1,null,null,0,0,""]
["S",3,"S",0,15,7,1,0,0,0,0,"","Serviço","Serviço","-","AGETOP",80570,"TORNEIRA DE MESA PARA LAVATÓRIO DIÂMETRO DE 1/2\"","Un    ",4,1,4,null,null,0,0,""]
[{"$f":"CHOOSE(1+LOG(1+2*(ORÇAMENTO.Nivel=\"Nível 1\")+4*(ORÇAMENTO.Nivel=\"Nível 2\")+8*(ORÇAMENTO.Nivel=\"Nível 3\")+16*(ORÇAMENTO.Nivel=\"Nível 4\")+32*(ORÇAMENTO.Nivel=\"Serviço\"),2),0,1,2,3,4,\"S\")","v":"S"},3,"S",0,15,7,1,0,0,0,0,"","Serviço","Serviço","-","AGETOP",80580,"VALVULA P/LAVATORIO OU BEBEDOURO METALICO DIAMETRO 1\"","Un    ",1,1,1,null,null,0,0,""]
["S",3,"S",0,15,7,1,0,0,0,0,"","Serviço","Serviço","-","SINAPI",86911,"TORNEIRA CROMADA LONGA, DE PAREDE, 1/2\u0094 OU 3/4\u0094, PARA PIA DE COZINHA, PADRÃO POPULAR - FORNECIMENTO E INSTALAÇÃO. AF_01/2020","UN",5,1,5,null,null,0,0,""]
["S",3,"S",0,15,7,1,0,0,0,0,"","Serviço","Serviço","-","AGETOP",80671,"SIFAO PVC P/PIA 1.1/2\" X 2\"","Un    ",5,1,5,null,null,0,0,""]
["S",3,"S",0,15,7,1,0,0,0,0,"","Serviço","Serviço","-","AGETOP",80680,"VALVULA P/PIA TIPO AMERICANA DIAM.3.1/2\" (METAL)","Un    ",5,1,5,null,null,0,0,""]
["S",3,"S",0,15,7,1,0,0,0,0,"","Serviço","Serviço","-","AGETOP",80687,"CUBA INOX 35X40X15CM E=0,6MM-AÇO 304 (CUBA Nº 3)","Un    ",4,1,4,null,null,0,0,""]
["S",3,"S",0,15,7,1,0,0,0,0,"","Serviço","Serviço","-","AGETOP",80693,"TANQUE (PANELAO) INOX 60 X 70 X 40 CM CH.18","Un    ",1,1,1,null,null,0,0,""]
["S",3,"S",0,15,7,1,0,0,0,0,"","Serviço","Serviço","-","AGETOP",81846,"CAIXA DE GORDURA E INSPEÇÃO EM PVC/ABS 19 LITROS COM TAMPA E PORTA TAMPA E CESTO DE LIMPEZA REMOVÍVEL","un    ",1,1,1,null,null,0,0,""]
["S",3,"S",0,15,7,1,0,0,0,0,"","Serviço","Serviço","-","SINAPI",94495,"REGISTRO DE GAVETA BRUTO, LATÃO, ROSCÁVEL, 1\u0094, INSTALADO EM RESERVAÇÃO DE ÁGUA DE EDIFICAÇÃO QUE POSSUA RESERVATÓRIO DE FIBRA/FIBROCIMENTO \u0096 FORNECIMENTO E INSTALAÇÃO. AF_06/2016","UN",1,1,1,null,null,0,0,"Referência: AGETOP - 80903"]
["S",3,"S",0,15,7,1,0,0,0,0,"","Serviço","Serviço","-","SINAPI",89987,"REGISTRO DE GAVETA BRUTO, LATÃO, ROSCÁVEL, 3/4\", COM ACABAMENTO E CANOPLA CROMADOS. FORNECIDO E INSTALADO EM RAMAL DE ÁGUA. AF_12/2014","UN",1,1,1,null,null,0,0,"Referência: AGETOP - 80926"]
["S",3,"S",0,15,7,1,0,0,0,0,"","Serviço","Serviço","-","SINAPI",89985,"REGISTRO DE PRESSÃO BRUTO, LATÃO, ROSCÁVEL, 3/4\", COM ACABAMENTO E CANOPLA CROMADOS. FORNECIDO E INSTALADO EM RAMAL DE ÁGUA. AF_12/2014","UN",4,1,4,null,null,0,0,"Referência: AGETOP - 80926"]
["S",3,"S",0,15,7,1,0,0,0,0,"","Serviço","Serviço","-","SINAPI",89356,"TUBO, PVC, SOLDÁVEL, DN 25MM, INSTALADO EM RAMAL OU SUB-RAMAL DE ÁGUA - FORNECIMENTO E INSTALAÇÃO. AF_12/2014","M",25,1,25,null,null,0,0,"Referência: AGETOP - 81003"]
["S",3,"S",0,15,7,1,0,0,0,0,"","Serviço","Serviço","-","SINAPI",89357,"TUBO, PVC, SOLDÁVEL, DN 32MM, INSTALADO EM RAMAL OU SUB-RAMAL DE ÁGUA - FORNECIMENTO E INSTALAÇÃO. AF_12/2014","M",19,1,19,null,null,0,0,"Referência: AGETOP - 81004"]
["S",3,"S",0,15,7,1,0,0,0,0,"","Serviço","Serviço","-","SINAPI",94708,"ADAPTADOR COM FLANGES LIVRES, PVC, SOLDÁVEL, DN  25 MM X 3/4 , INSTALADO EM RESERVAÇÃO DE ÁGUA DE EDIFICAÇÃO QUE POSSUA RESERVATÓRIO DE FIBRA/FIBROCIMENTO   FORNECIMENTO E INSTALAÇÃO. AF_06/2016","UN",14,1,14,null,null,0,0,"Referência: AGETOP - 81041"]
["S",3,"S",0,15,7,1,0,0,0,0,"","Serviço","Serviço","-","SINAPI",94709,"ADAPTADOR COM FLANGES LIVRES, PVC, SOLDÁVEL, DN 32 MM X 1 , INSTALADO EM RESERVAÇÃO DE ÁGUA DE EDIFICAÇÃO QUE POSSUA RESERVATÓRIO DE FIBRA/FIBROCIMENTO   FORNECIMENTO E INSTALAÇÃO. AF_06/2016","UN",2,1,2,null,null,0,0,"Referência: AGETOP - 81042"]
["S",3,"S",0,15,7,1,0,0,0,0,"","Serviço","Serviço","-","AGETOP",81162,"BUCHA DE REDUCAO SOLD.CURTA 32 X 25 MM","Un    ",2,1,2,null,null,0,0,""]
["S",3,"S",0,15,7,1,0,0,0,0,"","Serviço","Serviço","-","SINAPI",89866,"JOELHO 90 GRAUS, PVC, SOLDÁVEL, DN 25MM, INSTALADO EM DRENO DE AR-CONDICIONADO - FORNECIMENTO E INSTALAÇÃO. AF_12/2014","UN",6,1,6,null,null,0,0,""]
["S",3,"S",0,15,7,1,0,0,0,0,"","Serviço","Serviço","-","SINAPI",94672,"JOELHO 90 GRAUS COM BUCHA DE LATÃO, PVC, SOLDÁVEL, DN  25 MM, X 3/4\u0094 INSTALADO EM RESERVAÇÃO DE ÁGUA DE EDIFICAÇÃO QUE POSSUA RESERVATÓRIO DE FIBRA/FIBROCIMENTO   FORNECIMENTO E INSTALAÇÃO. AF_06/2016","UN",6,1,6,null,null,0,0,""]
["S",3,"S",0,15,7,1,0,0,0,0,"","Serviço","Serviço","-","AGETOP",81402,"TE 90 GRAUS SOLDAVEL DIAMETRO 25 mm","Un    ",2,1,2,null,null,0,0,""]
["S",3,"S",0,15,7,1,0,0,0,0,"","Serviço","Serviço","-","SINAPI",94691,"TÊ DE REDUÇÃO, PVC, SOLDÁVEL, DN 32 MM X  25 MM, INSTALADO EM RESERVAÇÃO DE ÁGUA DE EDIFICAÇÃO QUE POSSUA RESERVATÓRIO DE FIBRA/FIBROCIMENTO   FORNECIMENTO E INSTALAÇÃO. AF_06/2016","UN",1,1,1,null,null,0,0,"Referência: AGETOP - 81421"]
["S",3,"S",0,15,7,1,0,0,0,0,"","Serviço","Serviço","-","AGETOP",81602,"BUCHA DE REDUCAO LONGA DIAM. 50 X 40 MM","Un    ",5,1,5,null,null,0,0,""]
["S",3,"S",0,15,7,1,0,0,0,0,"","Serviço","Serviço","-","AGETOP",81663,"CORPO CX. SIFONADA DIAM. 150 X 150 X 50","Un    ",2,1,2,null,null,0,0,""]
["S",3,"S",0,15,7,1,0,0,0,0,"","Serviço","Serviço","-","AGETOP",81771,"GRELHA QUADRADA BRANCA DIAM. 150 MM","Un    ",2,1,2,null,null,0,0,""]
["S",3,"S",0,15,7,1,0,0,0,0,"","Serviço","Serviço","-","AGETOP",81885,"TERMINAL DE VENTILACAO DIAMETRO 50 MM","Un    ",1,1,1,null,null,0,0,""]
["S",3,"S",0,15,7,1,0,0,0,0,"","Serviço","Serviço","-","AGETOP",81831,"CAIXA DE INSPEÇÃO - ALVENARIA DE 1/2 VEZ COM REVESTIMENTO INTERNO EM REBOCO PAULISTA A-14 (COM ADIÇÃO DE IMPERMEABILIZANTE)","m2    ",3,1,3,null,null,0,0,""]
["S",3,"S",0,15,7,1,0,0,0,0,"","Serviço","Serviço","-","SINAPI",89802,"JOELHO 45 GRAUS, PVC, SERIE NORMAL, ESGOTO PREDIAL, DN 50 MM, JUNTA ELÁSTICA, FORNECIDO E INSTALADO EM PRUMADA DE ESGOTO SANITÁRIO OU VENTILAÇÃO. AF_12/2014","UN",7,1,7,null,null,0,0,""]
["S",3,"S",0,15,7,1,0,0,0,0,"","Serviço","Serviço","-","SINAPI",89732,"JOELHO 45 GRAUS, PVC, SERIE NORMAL, ESGOTO PREDIAL, DN 50 MM, JUNTA ELÁSTICA, FORNECIDO E INSTALADO EM RAMAL DE DESCARGA OU RAMAL DE ESGOTO SANITÁRIO. AF_12/2014","UN",7,1,7,null,null,0,0,""]
["S",3,"S",0,15,7,1,0,0,0,0,"","Serviço","Serviço","-","SINAPI",89724,"JOELHO 90 GRAUS, PVC, SERIE NORMAL, ESGOTO PREDIAL, DN 40 MM, JUNTA SOLDÁVEL, FORNECIDO E INSTALADO EM RAMAL DE DESCARGA OU RAMAL DE ESGOTO SANITÁRIO. AF_12/2014","UN",12,1,12,null,null,0,0,""]
["S",3,"S",0,15,7,1,0,0,0,0,"","Serviço","Serviço","-","SINAPI",89801,"JOELHO 90 GRAUS, PVC, SERIE NORMAL, ESGOTO PREDIAL, DN 50 MM, JUNTA ELÁSTICA, FORNECIDO E INSTALADO EM PRUMADA DE ESGOTO SANITÁRIO OU VENTILAÇÃO. AF_12/2014","UN",2,1,2,null,null,0,0,""]
["S",3,"S",0,15,7,1,0,0,0,0,"","Serviço","Serviço","-","AGETOP",81973,"JUNCAO SIMPLES DIAM. 100 X 50 MM","Un    ",1,1,1,null,null,0,0,""]
["S",3,"S",0,15,7,1,0,0,0,0,"","Serviço","Serviço","-","SINAPI",89834,"JUNÇÃO SIMPLES, PVC, SERIE NORMAL, ESGOTO PREDIAL, DN 100 X 100 MM, JUNTA ELÁSTICA, FORNECIDO E INSTALADO EM PRUMADA DE ESGOTO SANITÁRIO OU VENTILAÇÃO. AF_12/2014","UN",1,1,1,null,null,0,0,""]
["S",3,"S",0,15,7,1,0,0,0,0,"","Serviço","Serviço","-","AGETOP",81981,"JUNÇÃO DUPLA DIAMETRO 75 MM","Un    ",1,1,1,null,null,0,0,""]
["S",3,"S",0,15,7,1,0,0,0,0,"","Serviço","Serviço","-","SINAPI",89813,"LUVA SIMPLES, PVC, SERIE NORMAL, ESGOTO PREDIAL, DN 50 MM, JUNTA ELÁSTICA, FORNECIDO E INSTALADO EM PRUMADA DE ESGOTO SANITÁRIO OU VENTILAÇÃO. AF_12/2014","UN",8,1,8,null,null,0,0,""]
[{"$f":"CHOOSE(1+LOG(1+2*(ORÇAMENTO.Nivel=\"Nível 1\")+4*(ORÇAMENTO.Nivel=\"Nível 2\")+8*(ORÇAMENTO.Nivel=\"Nível 3\")+16*(ORÇAMENTO.Nivel=\"Nível 4\")+32*(ORÇAMENTO.Nivel=\"Serviço\"),2),0,1,2,3,4,\"S\")","v":"S"},3,"S",0,15,7,1,0,0,0,0,"","Serviço","Serviço","-","SINAPI",89821,"LUVA SIMPLES, PVC, SERIE NORMAL, ESGOTO PREDIAL, DN 100 MM, JUNTA ELÁSTICA, FORNECIDO E INSTALADO EM PRUMADA DE ESGOTO SANITÁRIO OU VENTILAÇÃO. AF_12/2014","UN",2,1,2,null,null,0,0,"Referência: AGETOP - 82004"]
["S",3,"S",0,15,7,1,0,0,0,0,"","Serviço","Serviço","-","AGETOP",82051,"PORTA GRELHA QUADRADA BRANCO DIAM. 150 MM","Un    ",2,1,2,null,null,0,0,""]
["S",3,"S",0,15,7,1,0,0,0,0,"","Serviço","Serviço","-","AGETOP",82103,"REDUCAO EXCENTRICA 100 X 50 MM","Un    ",1,1,1,null,null,0,0,""]
["S",3,"S",0,15,7,1,0,0,0,0,"","Serviço","Serviço","-","AGETOP",82233,"TE SANITARIO DIAMETRO 100 X 50 MM","Un    ",1,1,1,null,null,0,0,""]
["S",3,"S",0,15,7,1,0,0,0,0,"","Serviço","Serviço","-","SINAPI",89711,"TUBO PVC, SERIE NORMAL, ESGOTO PREDIAL, DN 40 MM, FORNECIDO E INSTALADO EM RAMAL DE DESCARGA OU RAMAL DE ESGOTO SANITÁRIO. AF_12/2014","M",14,1,14,null,null,0,0,"Referência: AGETOP - 82301"]
["S",3,"S",0,15,7,1,0,0,0,0,"","Serviço","Serviço","-","SINAPI",89798,"TUBO PVC, SERIE NORMAL, ESGOTO PREDIAL, DN 50 MM, FORNECIDO E INSTALADO EM PRUMADA DE ESGOTO SANITÁRIO OU VENTILAÇÃO. AF_12/2014","M",26,1,26,null,null,0,0,""]
["S",3,"S",0,15,7,1,0,0,0,0,"","Serviço","Serviço","-","SINAPI",89800,"TUBO PVC, SERIE NORMAL, ESGOTO PREDIAL, DN 100 MM, FORNECIDO E INSTALADO EM PRUMADA DE ESGOTO SANITÁRIO OU VENTILAÇÃO. AF_12/2014","M",35,1,35,null,null,0,0,""]
["S",{"$f":"IF(OR(C388=\"s\",C388=0),OFFSET(B388,-1,0),C388)","v":3},{"$f":"IF(OFFSET(C388,-1,0)=\"L\",1,IF(OFFSET(C388,-1,0)=1,2,IF(OR(A388=\"s\",A388=0),\"S\",IF(AND(OFFSET(C388,-1,0)=2,A388=4),3,IF(AND(OR(OFFSET(C388,-1,0)=\"s\",OFFSET(C388,-1,0)=0),A388<>\"s\",A388>OFFSET(B388,-1,0)),OFFSET(B388,-1,0),A388)))))","v":"S"},{"$f":"IF(OR(C388=\"S\",C388=0),0,IF(ISERROR(K388),J388,SMALL(J388:K388,1)))","v":0},{"$f":"IF($C388=1,OFFSET(E388,-1,0)+1,OFFSET(E388,-1,0))","v":15},{"$f":"IF($C388=1,0,IF($C388=2,OFFSET(F388,-1,0)+1,OFFSET(F388,-1,0)))","v":7},{"$f":"IF(AND($C388<=2,$C388<>0),0,IF($C388=3,OFFSET(G388,-1,0)+1,OFFSET(G388,-1,0)))","v":1},{"$f":"IF(AND($C388<=3,$C388<>0),0,IF($C388=4,OFFSET(H388,-1,0)+1,OFFSET(H388,-1,0)))","v":0},{"$f":"IF(AND($C388<=4,$C388<>0),0,IF(AND($C388=\"S\",$Y388>0),OFFSET(I388,-1,0)+1,OFFSET(I388,-1,0)))","v":0},0,0,{"$f":"IF(OR(Y388>0,$C388=1),\"F\",\"\")","v":""},"Serviço",{"$f":"CHOOSE(1+LOG(1+2*(C388=1)+4*(C388=2)+8*(C388=3)+16*(C388=4)+32*(C388=\"S\"),2),\"\",\"Nível 1\",\"Nível 2\",\"Nível 3\",\"Nível 4\",\"Serviço\")","v":"Serviço"},"-","AGETOP",82374,"TUBO FERRO GALVANIZADO DIAM.3/4\"","m     ",10,1,10,null,null,0,0,""]
["S",3,"S",0,15,7,1,0,0,0,0,"","Serviço","Serviço","-","AGETOP",85003,"EXTINTOR PO QUIMICO SECO (6 KG) - CAPACIDADE EXTINTORA 20 BC","Un    ",1,1,1,null,null,0,0,""]
["S",3,"S",0,15,7,1,0,0,0,0,"","Serviço","Serviço","-","SINAPI",95470,"VASO SANITARIO SIFONADO CONVENCIONAL COM LOUÇA BRANCA, INCLUSO CONJUNTO DE LIGAÇÃO PARA BACIA SANITÁRIA AJUSTÁVEL - FORNECIMENTO E INSTALAÇÃO. AF_10/2016","UN",1,1,1,null,null,0,0,""]
[2,2,2,3,15,8,0,0,0,50,3,"","Nível 2","Nível 2","-",null,null,"ALVENARIAS E DIVISÓRIAS","-",null,1,"-",null,null,0,0,""]
["S",2,"S",0,15,8,0,0,0,0,0,"","Serviço","Serviço","-","SINAPI","73937/1","COBOGO DE CONCRETO (ELEMENTO VAZADO), 7X50X50CM, ASSENTADO COM ARGAMASSA TRACO 1:4 (CIMENTO E AREIA)","M2",17.46,1,17.46,null,null,0,0,"Referência: AGETOP - 100501"]
["S",2,"S",0,15,8,0,0,0,0,0,"","Serviço","Serviço","-","SINAPI",87520,"ALVENARIA DE VEDAÇÃO DE BLOCOS CERÂMICOS FURADOS NA HORIZONTAL DE 9X19X19CM (ESPESSURA 9CM) DE PAREDES COM ÁREA LÍQUIDA MAIOR OU IGUAL A 6M² COM VÃOS E ARGAMASSA DE ASSENTAMENTO COM PREPARO MANUAL. AF_06/2014","M2",112.86,1,112.86,null,null,0,0,"Referência: AGETOP - 100201"]
[2,2,2,2,15,9,0,0,0,47,2,"","Nível 2","Nível 2","-",null,null,"IMPERMEABILIZAÇÃO","-",null,1,"-",null,null,0,0,""]
["S",2,"S",0,15,9,0,0,0,0,0,"","Serviço","Serviço","-","SINAPI",98562,"IMPERMEABILIZAÇÃO DE FLOREIRA OU VIGA BALDRAME COM ARGAMASSA DE CIMENTO E AREIA, COM ADITIVO IMPERMEABILIZANTE, E = 2 CM. AF_06/2018","M2",51.94,1,51.94,null,null,0,0,"Referência: AGETOP - 120902"]
[2,2,2,2,15,10,0,0,0,45,2,"","Nível 2","Nível 2","-",null,null,"ESTRUTURAS METÁLICAS","-",null,1,"-",null,null,0,0,""]
["S",2,"S",0,15,10,0,0,0,0,0,"","Serviço","Serviço","-","AGETOP",150103,"ESTRUTURA METÁLICA CONVENCIONAL EM AÇO DO TIPO USI SAC-300 COM FUNDO ANTICORROSIVO","Kg    ",1099,1,1099,null,null,0,0,""]
[2,2,2,5,15,11,0,0,0,43,5,"","Nível 2","Nível 2","-",null,null,"COBERTURAS","-",null,1,"-",null,null,0,0,""]
[3,3,3,4,15,11,1,0,0,4,29,"","Nível 3","Nível 3","-",null,null,"CERÂMICA","-",null,1,"-",null,null,0,0,""]
["S",3,"S",0,15,11,1,0,0,0,0,"","Serviço","Serviço","-","SINAPI",94445,"TELHAMENTO COM TELHA CERÂMICA CAPA-CANAL, TIPO PLAN, COM ATÉ 2 ÁGUAS, INCLUSO TRANSPORTE VERTICAL. AF_07/2019","M2",83.639999999999986,1,83.639999999999986,null,null,0,0,"Referência: AGETOP - 160401"]
["S",3,"S",0,15,11,1,0,0,0,0,"","Serviço","Serviço","-","SINAPI",94221,"CUMEEIRA PARA TELHA CERÂMICA EMBOÇADA COM ARGAMASSA TRAÇO 1:2:9 (CIMENTO, CAL E AREIA) PARA TELHADOS COM ATÉ 2 ÁGUAS, INCLUSO TRANSPORTE VERTICAL. AF_07/2019","M",8.1999999999999993,1,8.1999999999999993,null,null,0,0,""]
["S",3,"S",0,15,11,1,0,0,0,0,"","Serviço","Serviço","-","SINAPI",94224,"EMBOÇAMENTO COM ARGAMASSA TRAÇO 1:2:9 (CIMENTO, CAL E AREIA). AF_07/2019","M",36.799999999999997,1,36.799999999999997,null,null,0,0,"Referência: AGETOP - 160403"]
[2,2,2,5,15,12,0,0,0,38,5,"","Nível 2","Nível 2","-",null,null,"ESQUADRIAS METÁLICAS","-",null,1,"-",null,null,0,0,""]
["S",2,"S",0,15,12,0,0,0,{"$f":"IF(OR($C404=\"S\",$C404=0),0,MATCH(0,OFFSET($D404,1,$C404,ROW($C$441)-ROW($C404)),0))","v":0},{"$f":"IF(OR($C404=\"S\",$C404=0),0,MATCH(OFFSET($D404,0,$C404)+1,OFFSET($D404,1,$C404,ROW($C$441)-ROW($C404)),0))","v":0},"","Serviço","Serviço","-","AGETOP",180303,"PORTA DE ENROLAR C/FERRAGENS","m2    ",5.7399999999999993,1,5.7399999999999993,null,null,0,0,""]
["S",2,"S",0,15,12,0,0,0,0,0,"","Serviço","Serviço","-","AGETOP",180307,"PORTAO /CHAPA TRAPEZ / TUBO DE ACO PT-5 C/FERRAGEM","m2    ",1.4400000000000002,1,1.4400000000000002,null,null,0,0,""]
["S",2,"S",0,15,12,0,0,0,0,0,"","Serviço","Serviço","-","AGETOP",180381,"ESQ. MAXIMO AR CHAPA/VIDRO J3/J5/J6/J8 C/FERRAGENS","m2    ",4.5600000000000005,1,4.5600000000000005,null,null,0,0,""]
["S",2,"S",0,15,12,0,0,0,0,0,"","Serviço","Serviço","-","AGETOP",180501,"PORTA DE ABRIR EM CHAPA PF-1 C/FERRAGENS","m2    ",10.32,1,10.32,null,null,0,0,""]
[2,2,2,2,15,13,0,0,0,33,2,"","Nível 2","Nível 2","-",null,null,"VIDROS","-",null,1,"-",null,null,0,0,""]
["S",2,"S",0,15,13,0,0,0,0,0,"","Serviço","Serviço","-","SINAPI",72117,"VIDRO LISO COMUM TRANSPARENTE, ESPESSURA 4MM","M2",4.5600000000000005,1,4.5600000000000005,null,null,0,0,"Referência: AGETOP - 190102"]
[2,2,2,4,15,14,0,0,0,31,4,"","Nível 2","Nível 2","-",null,null,"REVESTIMENTO DE PAREDE","-",null,1,"-",null,null,0,0,""]
["S",2,"S",0,15,14,0,0,0,0,0,"","Serviço","Serviço","-","SINAPI",87553,"EMBOÇO, PARA RECEBIMENTO DE CERÂMICA, EM ARGAMASSA TRAÇO 1:2:8, PREPARO MECÂNICO COM BETONEIRA 400L, APLICADO MANUALMENTE EM FACES INTERNAS DE PAREDES, PARA AMBIENTE COM ÁREA MAIOR QUE 10M2, ESPESSURA DE 10MM, COM EXECUÇÃO DE TALISCAS. AF_06/2014","M2",90.83,1,90.83,null,null,0,0,""]
["S",2,"S",0,15,14,0,0,0,0,0,"","Serviço","Serviço","-","SINAPI",87904,"CHAPISCO APLICADO EM ALVENARIA (COM PRESENÇA DE VÃOS) E ESTRUTURAS DE CONCRETO DE FACHADA, COM COLHER DE PEDREIRO.  ARGAMASSA TRAÇO 1:3 COM PREPARO MANUAL. AF_06/2014","M2",214.24,1,214.24,null,null,0,0,"Referência: AGETOP - 200101"]
[{"$f":"CHOOSE(1+LOG(1+2*(ORÇAMENTO.Nivel=\"Nível 1\")+4*(ORÇAMENTO.Nivel=\"Nível 2\")+8*(ORÇAMENTO.Nivel=\"Nível 3\")+16*(ORÇAMENTO.Nivel=\"Nível 4\")+32*(ORÇAMENTO.Nivel=\"Serviço\"),2),0,1,2,3,4,\"S\")","v":"S"},2,"S",0,15,14,0,0,0,0,0,"","Serviço","Serviço","-","SINAPI",87273,"REVESTIMENTO CERÂMICO PARA PAREDES INTERNAS COM PLACAS TIPO ESMALTADA EXTRA DE DIMENSÕES 33X45 CM APLICADAS EM AMBIENTES DE ÁREA MAIOR QUE 5 M² NA ALTURA INTEIRA DAS PAREDES. AF_06/2014","M2",90.83,1,90.83,null,null,0,0,""]
[2,2,2,3,15,15,0,0,0,27,3,"","Nível 2","Nível 2","-",null,null,"FORROS","-",null,1,"-",null,null,0,0,""]
["S",2,"S",0,15,15,0,0,0,0,0,"","Serviço","Serviço","-","SINAPI",87884,"CHAPISCO APLICADO NO TETO, COM ROLO PARA TEXTURA ACRÍLICA. ARGAMASSA INDUSTRIALIZADA COM PREPARO MANUAL. AF_06/2014","M2",37.271000000000001,1,37.271000000000001,null,null,0,0,"Referência: AGETOP - 210102"]
["S",2,"S",0,15,15,0,0,0,0,0,"","Serviço","Serviço","-","SINAPI",90408,"MASSA ÚNICA, PARA RECEBIMENTO DE PINTURA, EM ARGAMASSA TRAÇO 1:2:8, PREPARO MECÂNICO COM BETONEIRA 400L, APLICADA MANUALMENTE EM TETO, ESPESSURA DE 10MM, COM EXECUÇÃO DE TALISCAS. AF_03/2015","M2",37.271000000000001,1,37.271000000000001,null,null,0,0,"Referência: AGETOP - 210401"]
[2,2,2,5,15,16,0,0,0,24,5,"","Nível 2","Nível 2","-",null,null,"REVESTIMENTO DE PISO","-",null,1,"-",null,null,0,0,""]
["S",2,"S",0,15,16,0,0,0,0,0,"","Serviço","Serviço","-","SINAPI",95241,"LASTRO DE CONCRETO MAGRO, APLICADO EM PISOS OU RADIERS, ESPESSURA DE 5 CM. AF_07/2016","M2",55.061,1,55.061,null,null,0,0,""]
["S",2,"S",0,15,16,0,0,0,0,0,"","Serviço","Serviço","-","AGETOP",221104,"RASPAGEM E APLICAÇÃO RESINA ACRÍLICA DUAS DEMÃOS","m2    ",55.061,1,55.061,null,null,0,0,""]
["S",2,"S",0,15,16,0,0,0,0,0,"","Serviço","Serviço","-","AGETOP",221106,"GRANITINA 8MM FUNDIDA COM CONTRAPISO (1CI:3ARML) E=2CM E JUNTA PLASTICA 27MM (COM ÓXIDO DE FERRO)","m2    ",55.061,1,55.061,null,null,0,0,""]
["S",2,"S",0,15,16,0,0,0,0,0,"","Serviço","Serviço","-","AGETOP",220100,"PASSEIO PROTECAO EM CONC.DESEMPEN.5 CM 1:2,5:3,5 ( INCLUSO ESPELHO DE 30CM/ESCAVAÇÃO/REATERRO/APILOAMENTO/ATERRO INTERNO)","m2    ",28.800000000000004,1,28.800000000000004,null,null,0,0,""]
[2,2,2,2,15,17,0,0,0,19,2,"","Nível 2","Nível 2","-","SINAPI",null,"MARCENARIA","-",null,1,"-",null,null,0,0,""]
["S",2,"S",0,15,17,0,0,0,0,0,"","Serviço","Serviço","-","AGETOP",240209,"PRATELEIRA EST.CAIBRO 4+1 TABUAS APARELHADAS E ENVERNIZADAS","m     ",3.2,1,3.2,null,null,0,0,""]
[2,2,2,14,15,18,0,0,0,17,14,"","Nível 2","Nível 2","-",null,null,"PINTURA","-",null,1,"-",null,null,0,0,""]
[3,3,3,3,15,18,1,0,0,13,3,"","Nível 3","Nível 3","-",null,null,"ESMALTE SINTÉTICO","-",null,1,"-",null,null,0,0,""]
["S",3,"S",0,15,18,1,0,0,0,0,"","Serviço","Serviço","-","SINAPI",88497,"APLICAÇÃO E LIXAMENTO DE MASSA LÁTEX EM PAREDES, DUAS DEMÃOS. AF_06/2014","M2",12.68,1,12.68,null,null,0,0,"Referência: AGETOP - 261300"]
["S",3,"S",0,15,18,1,0,0,0,0,"","Serviço","Serviço","-","AGETOP",261550,"PINT.ESMALTE SINT.PAREDES - 2 DEM.C/SELADOR","m2    ",12.68,1,12.68,null,null,0,0,""]
[3,3,3,3,15,18,2,0,0,10,3,"","Nível 3","Nível 3","-","AGETOP",null,"LÁTEX ACRÍLICA","-",null,1,"-",null,null,0,0,""]
["S",3,"S",0,15,18,2,0,0,0,0,"","Serviço","Serviço","-","SINAPI",88497,"APLICAÇÃO E LIXAMENTO DE MASSA LÁTEX EM PAREDES, DUAS DEMÃOS. AF_06/2014","M2",110.73,1,110.73,null,null,0,0,"Referência: AGETOP - 261300"]
["S",3,"S",0,15,18,2,0,0,0,0,"","Serviço","Serviço","-","SINAPI",88489,"APLICAÇÃO MANUAL DE PINTURA COM TINTA LÁTEX ACRÍLICA EM PAREDES, DUAS DEMÃOS. AF_06/2014","M2",110.73,1,110.73,null,null,0,0,"Referência: AGETOP - 261001"]
[3,3,3,3,15,18,3,0,0,7,3,"","Nível 3","Nível 3","-","SINAPI",null,"TETO","-",null,1,"-",null,null,0,0,""]
["S",3,"S",0,15,18,3,0,0,0,0,"","Serviço","Serviço","-","SINAPI",88496,"APLICAÇÃO E LIXAMENTO DE MASSA LÁTEX EM TETO, DUAS DEMÃOS. AF_06/2014","M2",37.271000000000001,1,37.271000000000001,null,null,0,0,"Referência: AGETOP - 261300"]
["S",3,"S",0,15,18,3,0,0,0,0,"","Serviço","Serviço","-","SINAPI",88486,"APLICAÇÃO MANUAL DE PINTURA COM TINTA LÁTEX PVA EM TETO, DUAS DEMÃOS. AF_06/2014","M2",37.271000000000001,1,37.271000000000001,null,null,0,0,"Referência: AGETOP - 261307"]
[3,3,3,2,15,18,4,0,0,4,2,"","Nível 3","Nível 3","-","AGETOP",null,"ESQUADRIAS NOVAS","-",null,1,"-",null,null,0,0,""]
["S",3,"S",0,15,18,4,0,0,0,0,"","Serviço","Serviço","-","AGETOP",261602,"PINT.ESMALTE/ESQUAD.FERRO C/FUNDO ANTICOR.","m2    ",61.620000000000005,1,61.620000000000005,null,null,0,0,""]
[3,3,3,2,15,18,5,0,0,2,{"$error":"#N/A"},"","Nível 3","Nível 3","-","AGETOP",null,"ESTRUTURA METÁLICA","-",null,1,"-",null,null,0,0,""]
["S",3,"S",0,15,18,5,0,0,0,0,"","Serviço","Serviço","-","AGETOP",261609,"PINTURA ESMALTE ALQUIDICO ESTR.METALICA 2 DEMAOS","m2    ",83.64,1,83.64,null,null,0,0]
[2,2,2,3,15,19,0,0,0,3,{"$error":"#N/A"},"","Nível 2","Nível 2","-",null,null,"DIVERSOS","-",null,1,"-",null,null,0,0,""]
["S",2,"S",0,15,19,0,0,0,0,0,"","Serviço","Serviço","-","AGETOP",270501,"LIMPEZA FINAL DE OBRA - (OBRAS CIVIS)","m2    ",56.76,1,56.76,null,null,0,0,""]
["S",2,"S",0,15,19,0,0,0,0,0,"","Serviço","Serviço","-","AGETOP",271608,"BANCADA DE GRANITO C/ESPELHO","m2    ",7.548,1,7.548,null,null,0,0,""]
[-1,null,-1,null,0,0,0,0,0,null,null,"F"]
[null,null,null,null,null,null,null,null,null,null,null,"F",null,null,null,null,null,"OBS: OS QUANTITATIVOS DE MATERIAIS  DAS INSTALAÇÕES HIDROSSANITÁRIAS, ELÉTRICAS E ESPECIAIS SÃO FORNECIDOS PELOS PROFISSIONAIS RESPONSÁVEIS PELOS RESPECTIVOS PROJETOS.",null,null,null,null,"VALOR TOTAL",null,null,0]
[null,null,null,null,null,null,null,null,null,null,null,"F",null,null,null,null,null,null,null,null,null,null,"VALOR BDI (26,33%)",null,null,0]
[null,null,null,null,null,null,null,null,null,null,null,"F",null,null,null,null,null,null,null,null,null,null,"TOTAL ORÇAMENTO",null,null,0]
[null,null,null,null,null,null,null,null,null,null,null,"F"]
[null,null,null,null,null,null,null,null,null,null,null,"F",null,null,null,null,null,null,null,null,null,null,"CUSTO POR M2 ³",null,null,0]
[null,null,null,null,null,null,null,null,null,null,null,"F",null,null,null,null,null,null,null,null,null,null,"MATERIAL S/ BDI",null,null,0]
[null,null,null,null,null,null,null,null,null,null,null,"F",null,null,null,null,null,null,null,null,null,null,"MÃO DE OBRA S/ BDI",null,null,0]
[null,null,null,null,null,null,null,null,null,null,null,"F"]
[null,null,null,null,null,null,null,null,null,null,null,"F",null,null,null,null,"(1) Conforme previsto pelo DECRETO Nº 7.983, DE 8 DE ABRIL DE 2013, os preços adotados são aqueles constantes dos sistemas de referência indicados. Justifica-se o uso dos preços destas composições de custos unitários devido ao seu valor ser menor à mediana de seus correspondentes na tabela SINAPI;"]
[null,null,null,null,null,null,null,null,null,null,null,"F",null,null,null,null,"(2) Optou-se pelo uso das composições de custos da AGETOP para itens não presentes na SINAPI;"]
[null,null,null,null,null,null,null,null,null,null,null,"F",null,null,null,null,"(3) Para itens da AGETOP, os vidros não estão inclusos nas esquadrias e já foram considerados os custos de contramarco para as esquadrias de alumínio;"]
[null,null,null,null,null,null,null,null,null,null,null,"F",null,null,null,null,"(4) Nos casos em que houver execução de granitina e omissão do item AGETOP 221102, considerou-se que o quantitativo para o rodapé, de altura igual a 7cm, foi incorporado na área de piso;"]
[null,null,null,null,null,null,null,null,null,null,null,"F",null,null,null,null,"(5) O custo unitário aproximado por metro quadrado é calculado dividindo-se o valor total do orçamento pela área total de construção."]
[null,null,null,null,null,null,null,null,null,null,null,"F"]
[null,null,null,null,null,null,null,null,null,null,null,"F"]
[]
[null,null,null,null,null,null,null,null,null,null,null,null,null,null,"SOMATÓRIO DE SERVIÇOS"]
[null,null,null,null,null,null,null,null,null,null,null,null,null,null,"ITEM","DESCRIÇÃO DOS SERVIÇOS",null,null,"PREÇO SEM BDI",null,null,null,null,"PREÇO COM BDI",null,null,"PARTICIPAÇÃO ( % )"]
[null,null,null,null,null,null,null,null,null,null,null,null,null,null,"a.","SERVIÇOS PRELIMINARES",null,null,{"$f":"SUMIF($R$19:$R$441,$P460,$Z$19:$Z$441)","v":0},null,null,null,null,{"$f":"ROUND(S460*(1+BDI.Taxa),2)","v":0},null,null,{"$f":"IFERROR(ROUND($X460*100/$Z$444,2),0)","v":0}]
[null,null,null,null,null,null,null,null,null,null,null,null,null,null,"b.","TRANSPORTES",null,null,0,null,null,null,null,0,null,null,0]
[null,null,null,null,null,null,null,null,null,null,null,null,null,null,"c.","SERVIÇO EM TERRA",null,null,0,null,null,null,null,0,null,null,0]
[null,null,null,null,null,null,null,null,null,null,null,null,null,null,"d.","FUNDAÇÕES E SONDAGENS",null,null,0,null,null,null,null,0,null,null,0]
[null,null,null,null,null,null,null,null,null,null,null,null,null,null,"e.","ESTRUTURA",null,null,0,null,null,null,null,0,null,null,0]
[null,null,null,null,null,null,null,null,null,null,null,null,null,null,"f.","INSTALAÇÕES ELÉTRICAS",null,null,0,null,null,null,null,0,null,null,0]
[null,null,null,null,null,null,null,null,null,null,null,null,null,null,"g.","INSTALAÇÕES HIDROSSANITÁRIAS",null,null,0,null,null,null,null,0,null,null,0]
[null,null,null,null,null,null,null,null,null,null,null,null,null,null,"h","INSTALAÇÕES ESPECIAIS",null,null,0,null,null,null,null,0,null,null,0]
[null,null,null,null,null,null,null,null,null,null,null,null,null,null,"i.","ALVENARIAS E DIVISÓRIAS",null,null,0,null,null,null,null,0,null,null,0]
[null,null,null,null,null,null,null,null,null,null,null,null,null,null,"j.","ALVENARIA AUTO-PORTANTE",null,null,0,null,null,null,null,0,null,null,0]
[null,null,null,null,null,null,null,null,null,null,null,null,null,null,"k.","IMPERMEABILIZAÇÃO",null,null,0,null,null,null,null,0,null,null,0]
[null,null,null,null,null,null,null,null,null,null,null,null,null,null,"l.","ISOLAMENTO TÉRMICO E ACÚSTICO",null,null,0,null,null,null,null,0,null,null,0]
[null,null,null,null,null,null,null,null,null,null,null,null,null,null,"m.","ESTRUTURA DE MADEIRA",null,null,0,null,null,null,null,0,null,null,0]
[null,null,null,null,null,null,null,null,null,null,null,null,null,null,"n.","ESTRUTURAS METÁLICAS",null,null,0,null,null,null,null,0,null,null,0]
[null,null,null,null,null,null,null,null,null,null,null,null,null,null,"o.","COBERTURAS",null,null,0,null,null,null,null,0,null,null,0]
[null,null,null,null,null,null,null,null,null,null,null,null,null,null,"p.","ESQUADRIAS DE MADEIRA",null,null,0,null,null,null,null,0,null,null,0]
[null,null,null,null,null,null,null,null,null,null,null,null,null,null,"q.","ESQUADRIAS METÁLICAS",null,null,0,null,null,null,null,{"$f":"ROUND(S476*(1+BDI.Taxa),2)","v":0},null,null,0]
[null,null,null,null,null,null,null,null,null,null,null,null,null,null,"r.","VIDROS",null,null,0,null,null,null,null,0,null,null,0]
[null,null,null,null,null,null,null,null,null,null,null,null,null,null,"s.","REVESTIMENTO DE PAREDE",null,null,0,null,null,null,null,0,null,null,0]
[null,null,null,null,null,null,null,null,null,null,null,null,null,null,"t.","FORROS",null,null,0,null,null,null,null,0,null,null,0]
[null,null,null,null,null,null,null,null,null,null,null,null,null,null,"u.","REVESTIMENTO DE PISO",null,null,0,null,null,null,null,0,null,null,0]
[null,null,null,null,null,null,null,null,null,null,null,null,null,null,"v.","FERRAGENS",null,null,0,null,null,null,null,0,null,null,0]
[null,null,null,null,null,null,null,null,null,null,null,null,null,null,"w.","MARCENARIA",null,null,0,null,null,null,null,0,null,null,0]
[null,null,null,null,null,null,null,null,null,null,null,null,null,null,"x.","ADMINISTRAÇÃO",null,null,0,null,null,null,null,0,null,null,0]
[null,null,null,null,null,null,null,null,null,null,null,null,null,null,"y.","PINTURA",null,null,0,null,null,null,null,{"$f":"ROUND(S484*(1+BDI.Taxa),2)","v":0},null,null,0]
[null,null,null,null,null,null,null,null,null,null,null,null,null,null,"z.","DIVERSOS",null,null,0,null,null,null,null,{"$f":"IF(S485>0,IF((SUM(X460:Y484)+ROUND(S485*(1+BDI.Taxa),2))<>X487,X487-SUM(X460:Y484),ROUND(S485*(1+BDI.Taxa),2)),0)","v":0},null,null,{"$f":"IF(S485>0,IF((SUM(AA460:AA484)+IFERROR(ROUND($X485*100/$Z$444,2),0))<>AA487,AA487-SUM(AA460:AA484),IFERROR(ROUND($X485*100/$Z$444,2),0)),0)","v":0}]
[null,null,null,null,null,null,null,null,null,null,null,null,null,null,"TOTAL GERAL DO ORÇAMENTO (R$)",null,null,null,{"$f":"SUM(S460:W485)","v":0},null,null,null,null,{"$f":"SUM(X460:Y485)","v":0},null,null,{"$f":"SUM(AA460:AA485)","v":0}]
[null,null,null,null,null,null,null,null,null,null,null,null,null,null,null,null,null,null,{"$f":"$Z$442","v":0},null,null,null,null,{"$f":"$Z$444","v":0},null,null,100]
[null,null,null,null,null,null,null,null,null,null,null,null,null,null,null,null,null,null,"(TOTAL SEM BDI)",null,null,null,null,"(TOTAL COM BDI)",null,null,"(ARRED porcentagem)"]
[null,null,null,null,null,null,null,null,null,null,null,null,null,null,null,null,null,null,{"$f":"IF(AND(S486=S487,S486>0),\"OK\",\"ERRO\")","v":"ERRO"},null,null,null,null,{"$f":"IF(AND(X486=X487,X486>0),\"OK\",\"ERRO\")","v":"ERRO"},null,null,{"$f":"IF(AA486=100,\"OK\",\"ERRO\")","v":"ERRO"}]
[]
[]
[null,null,null,null,null,null,null,null,null,null,null,null,null,null,"RESUMO GERAL DO ORÇAMENTO"]
[null,null,null,null,null,null,null,null,null,null,null,null,null,null,"ITEM","DESCRIÇÃO DOS SERVIÇOS",null,null,"PREÇO SEM BDI",null,null,null,null,"PREÇO COM BDI",null,null,"PARTICIPAÇÃO ( % )"]
[null,null,null,null,null,null,null,null,null,null,null,null,null,null,"1.",{"$f":"IFERROR(VLOOKUP(O494,$O$19:$Y$441,4,FALSE),\"\")","v":"BLOCO COZINHA DE PLACA"},null,null,{"$f":"IF(P495=\"\",$S$515-SUM(OFFSET($S$493:S493,0,0,COUNTA($S$493:S493),1)),SUMIF($R$19:$R$441,$P494,$Z$19:$Z$441))","v":0},null,null,null,null,{"$f":"IF(P495=\"\",$X$515-SUM(OFFSET($X$493:X493,0,0,COUNTA($X$493:X493),1)),ROUND(S494*(1+BDI.Taxa),2))","v":0},null,null,{"$f":"IF(P495=\"\",$AA$515-SUM(OFFSET($AA$493:AA493,0,0,COUNTA($AA$493:AA493),1)),ROUND(X494*100/ORÇAMENTO.TotalOrçamento,2))","v":{"$error":"#DIV/0!"}}]
[null,null,null,null,null,null,null,null,null,null,null,null,null,null,"2.","BANHEIROS ADEQUAÇÕES",null,null,{"$f":"IF(P496=\"\",$S$515-SUM(OFFSET($S$493:S494,0,0,COUNTA($S$493:S494),1)),SUMIF($R$19:$R$441,$P495,$Z$19:$Z$441))","v":0},null,null,null,null,{"$f":"IF(P496=\"\",$X$515-SUM(OFFSET($X$493:X494,0,0,COUNTA($X$493:X494),1)),ROUND(S495*(1+BDI.Taxa),2))","v":0},null,null,{"$f":"IF(P496=\"\",$AA$515-SUM(OFFSET($AA$493:AA494,0,0,COUNTA($AA$493:AA494),1)),ROUND(X495*100/ORÇAMENTO.TotalOrçamento,2))","v":{"$error":"#DIV/0!"}}]
[null,null,null,null,null,null,null,null,null,null,null,null,null,null,"3.","ACESSIBILIDADE",null,null,{"$f":"IF(P497=\"\",$S$515-SUM(OFFSET($S$493:S495,0,0,COUNTA($S$493:S495),1)),SUMIF($R$19:$R$441,$P496,$Z$19:$Z$441))","v":0},null,null,null,null,{"$f":"IF(P497=\"\",$X$515-SUM(OFFSET($X$493:X495,0,0,COUNTA($X$493:X495),1)),ROUND(S496*(1+BDI.Taxa),2))","v":0},null,null,{"$f":"IF(P497=\"\",$AA$515-SUM(OFFSET($AA$493:AA495,0,0,COUNTA($AA$493:AA495),1)),ROUND(X496*100/ORÇAMENTO.TotalOrçamento,2))","v":{"$error":"#DIV/0!"}}]
[null,null,null,null,null,null,null,null,null,null,null,null,null,null,"4.","CALÇADA ACESSÍVEL",null,null,{"$f":"IF(P498=\"\",$S$515-SUM(OFFSET($S$493:S496,0,0,COUNTA($S$493:S496),1)),SUMIF($R$19:$R$441,$P497,$Z$19:$Z$441))","v":0},null,null,null,null,{"$f":"IF(P498=\"\",$X$515-SUM(OFFSET($X$493:X496,0,0,COUNTA($X$493:X496),1)),ROUND(S497*(1+BDI.Taxa),2))","v":0},null,null,{"$f":"IF(P498=\"\",$AA$515-SUM(OFFSET($AA$493:AA496,0,0,COUNTA($AA$493:AA496),1)),ROUND(X497*100/ORÇAMENTO.TotalOrçamento,2))","v":{"$error":"#DIV/0!"}}]
[null,null,null,null,null,null,null,null,null,null,null,null,null,null,"5.","PINTURA GERAL",null,null,{"$f":"IF(P499=\"\",$S$515-SUM(OFFSET($S$493:S497,0,0,COUNTA($S$493:S497),1)),SUMIF($R$19:$R$441,$P498,$Z$19:$Z$441))","v":0},null,null,null,null,{"$f":"IF(P499=\"\",$X$515-SUM(OFFSET($X$493:X497,0,0,COUNTA($X$493:X497),1)),ROUND(S498*(1+BDI.Taxa),2))","v":0},null,null,{"$f":"IF(P499=\"\",$AA$515-SUM(OFFSET($AA$493:AA497,0,0,COUNTA($AA$493:AA497),1)),ROUND(X498*100/ORÇAMENTO.TotalOrçamento,2))","v":{"$error":"#DIV/0!"}}]
[null,null,null,null,null,null,null,null,null,null,null,null,null,null,"6.","COBERTURA",null,null,{"$f":"IF(P500=\"\",$S$515-SUM(OFFSET($S$493:S498,0,0,COUNTA($S$493:S498),1)),SUMIF($R$19:$R$441,$P499,$Z$19:$Z$441))","v":0},null,null,null,null,{"$f":"IF(P500=\"\",$X$515-SUM(OFFSET($X$493:X498,0,0,COUNTA($X$493:X498),1)),ROUND(S499*(1+BDI.Taxa),2))","v":0},null,null,{"$f":"IF(P500=\"\",$AA$515-SUM(OFFSET($AA$493:AA498,0,0,COUNTA($AA$493:AA498),1)),ROUND(X499*100/ORÇAMENTO.TotalOrçamento,2))","v":{"$error":"#DIV/0!"}}]
[null,null,null,null,null,null,null,null,null,null,null,null,null,null,"7.","QUADRA",null,null,{"$f":"IF(P501=\"\",$S$515-SUM(OFFSET($S$493:S499,0,0,COUNTA($S$493:S499),1)),SUMIF($R$19:$R$441,$P500,$Z$19:$Z$441))","v":0},null,null,null,null,{"$f":"IF(P501=\"\",$X$515-SUM(OFFSET($X$493:X499,0,0,COUNTA($X$493:X499),1)),ROUND(S500*(1+BDI.Taxa),2))","v":0},null,null,{"$f":"IF(P501=\"\",$AA$515-SUM(OFFSET($AA$493:AA499,0,0,COUNTA($AA$493:AA499),1)),ROUND(X500*100/ORÇAMENTO.TotalOrçamento,2))","v":{"$error":"#DIV/0!"}}]
[null,null,null,null,null,null,null,null,null,null,null,null,null,null,"8.","VIDRO",null,null,{"$f":"IF(P502=\"\",$S$515-SUM(OFFSET($S$493:S500,0,0,COUNTA($S$493:S500),1)),SUMIF($R$19:$R$441,$P501,$Z$19:$Z$441))","v":0},null,null,null,null,{"$f":"IF(P502=\"\",$X$515-SUM(OFFSET($X$493:X500,0,0,COUNTA($X$493:X500),1)),ROUND(S501*(1+BDI.Taxa),2))","v":0},null,null,{"$f":"IF(P502=\"\",$AA$515-SUM(OFFSET($AA$493:AA500,0,0,COUNTA($AA$493:AA500),1)),ROUND(X501*100/ORÇAMENTO.TotalOrçamento,2))","v":{"$error":"#DIV/0!"}}]
[null,null,null,null,null,null,null,null,null,null,null,null,null,null,"9.","ADMINISTRAÇÃO LOCAL",null,null,{"$f":"IF(P503=\"\",$S$515-SUM(OFFSET($S$493:S501,0,0,COUNTA($S$493:S501),1)),SUMIF($R$19:$R$441,$P502,$Z$19:$Z$441))","v":0},null,null,null,null,{"$f":"IF(P503=\"\",$X$515-SUM(OFFSET($X$493:X501,0,0,COUNTA($X$493:X501),1)),ROUND(S502*(1+BDI.Taxa),2))","v":0},null,null,{"$f":"IF(P503=\"\",$AA$515-SUM(OFFSET($AA$493:AA501,0,0,COUNTA($AA$493:AA501),1)),ROUND(X502*100/ORÇAMENTO.TotalOrçamento,2))","v":{"$error":"#DIV/0!"}}]
[null,null,null,null,null,null,null,null,null,null,null,null,null,null,"10.","OBRA",null,null,{"$f":"IF(P504=\"\",$S$515-SUM(OFFSET($S$493:S502,0,0,COUNTA($S$493:S502),1)),SUMIF($R$19:$R$441,$P503,$Z$19:$Z$441))","v":0},null,null,null,null,{"$f":"IF(P504=\"\",$X$515-SUM(OFFSET($X$493:X502,0,0,COUNTA($X$493:X502),1)),ROUND(S503*(1+BDI.Taxa),2))","v":0},null,null,{"$f":"IF(P504=\"\",$AA$515-SUM(OFFSET($AA$493:AA502,0,0,COUNTA($AA$493:AA502),1)),ROUND(X503*100/ORÇAMENTO.TotalOrçamento,2))","v":{"$error":"#DIV/0!"}}]
[null,null,null,null,null,null,null,null,null,null,null,null,null,null,"11.","PROJETO DE GÁS",null,null,{"$f":"IF(P505=\"\",$S$515-SUM(OFFSET($S$493:S503,0,0,COUNTA($S$493:S503),1)),SUMIF($R$19:$R$441,$P504,$Z$19:$Z$441))","v":0},null,null,null,null,{"$f":"IF(P505=\"\",$X$515-SUM(OFFSET($X$493:X503,0,0,COUNTA($X$493:X503),1)),ROUND(S504*(1+BDI.Taxa),2))","v":0},null,null,{"$f":"IF(P505=\"\",$AA$515-SUM(OFFSET($AA$493:AA503,0,0,COUNTA($AA$493:AA503),1)),ROUND(X504*100/ORÇAMENTO.TotalOrçamento,2))","v":{"$error":"#DIV/0!"}}]
[null,null,null,null,null,null,null,null,null,null,null,null,null,null,"12.","PROJETO HIDROSSANITÁRIO",null,null,{"$f":"IF(P506=\"\",$S$515-SUM(OFFSET($S$493:S504,0,0,COUNTA($S$493:S504),1)),SUMIF($R$19:$R$441,$P505,$Z$19:$Z$441))","v":0},null,null,null,null,{"$f":"IF(P506=\"\",$X$515-SUM(OFFSET($X$493:X504,0,0,COUNTA($X$493:X504),1)),ROUND(S505*(1+BDI.Taxa),2))","v":0},null,null,{"$f":"IF(P506=\"\",$AA$515-SUM(OFFSET($AA$493:AA504,0,0,COUNTA($AA$493:AA504),1)),ROUND(X505*100/ORÇAMENTO.TotalOrçamento,2))","v":{"$error":"#DIV/0!"}}]
[null,null,null,null,null,null,null,null,null,null,null,null,null,null,"13.","PROJETO ELÉTRICO",null,null,{"$f":"IF(P507=\"\",$S$515-SUM(OFFSET($S$493:S505,0,0,COUNTA($S$493:S505),1)),SUMIF($R$19:$R$441,$P506,$Z$19:$Z$441))","v":0},null,null,null,null,{"$f":"IF(P507=\"\",$X$515-SUM(OFFSET($X$493:X505,0,0,COUNTA($X$493:X505),1)),ROUND(S506*(1+BDI.Taxa),2))","v":0},null,null,{"$f":"IF(P507=\"\",$AA$515-SUM(OFFSET($AA$493:AA505,0,0,COUNTA($AA$493:AA505),1)),ROUND(X506*100/ORÇAMENTO.TotalOrçamento,2))","v":{"$error":"#DIV/0!"}}]
[null,null,null,null,null,null,null,null,null,null,null,null,null,null,"14.","PROJETO DE PREVENÇÃO E COMBATE A INCÊNDIO",null,null,{"$f":"IF(P508=\"\",$S$515-SUM(OFFSET($S$493:S506,0,0,COUNTA($S$493:S506),1)),SUMIF($R$19:$R$441,$P507,$Z$19:$Z$441))","v":0},null,null,null,null,{"$f":"IF(P508=\"\",$X$515-SUM(OFFSET($X$493:X506,0,0,COUNTA($X$493:X506),1)),ROUND(S507*(1+BDI.Taxa),2))","v":0},null,null,{"$f":"IF(P508=\"\",$AA$515-SUM(OFFSET($AA$493:AA506,0,0,COUNTA($AA$493:AA506),1)),ROUND(X507*100/ORÇAMENTO.TotalOrçamento,2))","v":{"$error":"#DIV/0!"}}]
[null,null,null,null,null,null,null,null,null,null,null,null,null,null,"15.","COZINHA SEDUC OPÇÃO 2",null,null,{"$f":"IF(P509=\"\",$S$515-SUM(OFFSET($S$493:S507,0,0,COUNTA($S$493:S507),1)),SUMIF($R$19:$R$441,$P508,$Z$19:$Z$441))","v":0},null,null,null,null,{"$f":"IF(P509=\"\",$X$515-SUM(OFFSET($X$493:X507,0,0,COUNTA($X$493:X507),1)),ROUND(S508*(1+BDI.Taxa),2))","v":0},null,null,{"$f":"IF(P509=\"\",$AA$515-SUM(OFFSET($AA$493:AA507,0,0,COUNTA($AA$493:AA507),1)),ROUND(X508*100/ORÇAMENTO.TotalOrçamento,2))","v":{"$error":"#DIV/0!"}}]
[null,null,null,null,null,null,null,null,null,null,null,null,null,null,"16.","",null,null,{"$f":"IF(P510=\"\",$S$515-SUM(OFFSET($S$493:S508,0,0,COUNTA($S$493:S508),1)),SUMIF($R$19:$R$441,$P509,$Z$19:$Z$441))","v":0},null,null,null,null,{"$f":"IF(P510=\"\",$X$515-SUM(OFFSET($X$493:X508,0,0,COUNTA($X$493:X508),1)),ROUND(S509*(1+BDI.Taxa),2))","v":0},null,null,{"$f":"IF(P510=\"\",$AA$515-SUM(OFFSET($AA$493:AA508,0,0,COUNTA($AA$493:AA508),1)),ROUND(X509*100/ORÇAMENTO.TotalOrçamento,2))","v":{"$error":"#DIV/0!"}}]
[null,null,null,null,null,null,null,null,null,null,null,null,null,null,"17.","",null,null,{"$f":"IF(P511=\"\",$S$515-SUM(OFFSET($S$493:S509,0,0,COUNTA($S$493:S509),1)),SUMIF($R$19:$R$441,$P510,$Z$19:$Z$441))","v":0},null,null,null,null,{"$f":"IF(P511=\"\",$X$515-SUM(OFFSET($X$493:X509,0,0,COUNTA($X$493:X509),1)),ROUND(S510*(1+BDI.Taxa),2))","v":0},null,null,{"$f":"IF(P511=\"\",$AA$515-SUM(OFFSET($AA$493:AA509,0,0,COUNTA($AA$493:AA509),1)),ROUND(X510*100/ORÇAMENTO.TotalOrçamento,2))","v":{"$error":"#DIV/0!"}}]
[null,null,null,null,null,null,null,null,null,null,null,null,null,null,"18.","",null,null,{"$f":"IF(P512=\"\",$S$515-SUM(OFFSET($S$493:S510,0,0,COUNTA($S$493:S510),1)),SUMIF($R$19:$R$441,$P511,$Z$19:$Z$441))","v":0},null,null,null,null,{"$f":"IF(P512=\"\",$X$515-SUM(OFFSET($X$493:X510,0,0,COUNTA($X$493:X510),1)),ROUND(S511*(1+BDI.Taxa),2))","v":0},null,null,{"$f":"IF(P512=\"\",$AA$515-SUM(OFFSET($AA$493:AA510,0,0,COUNTA($AA$493:AA510),1)),ROUND(X511*100/ORÇAMENTO.TotalOrçamento,2))","v":{"$error":"#DIV/0!"}}]
[null,null,null,null,null,null,null,null,null,null,null,null,null,null,"19.","",null,null,{"$f":"IF(P513=\"\",$S$515-SUM(OFFSET($S$493:S511,0,0,COUNTA($S$493:S511),1)),SUMIF($R$19:$R$441,$P512,$Z$19:$Z$441))","v":0},null,null,null,null,{"$f":"IF(P513=\"\",$X$515-SUM(OFFSET($X$493:X511,0,0,COUNTA($X$493:X511),1)),ROUND(S512*(1+BDI.Taxa),2))","v":0},null,null,{"$f":"IF(P513=\"\",$AA$515-SUM(OFFSET($AA$493:AA511,0,0,COUNTA($AA$493:AA511),1)),ROUND(X512*100/ORÇAMENTO.TotalOrçamento,2))","v":{"$error":"#DIV/0!"}}]
[null,null,null,null,null,null,null,null,null,null,null,null,null,null,"20.","",null,null,{"$f":"IF(P514=\"\",$S$515-SUM(OFFSET($S$493:S512,0,0,COUNTA($S$493:S512),1)),SUMIF($R$19:$R$441,$P513,$Z$19:$Z$441))","v":0},null,null,null,null,{"$f":"IF(P514=\"\",$X$515-SUM(OFFSET($X$493:X512,0,0,COUNTA($X$493:X512),1)),ROUND(S513*(1+BDI.Taxa),2))","v":0},null,null,{"$f":"IF(P514=\"\",$AA$515-SUM(OFFSET($AA$493:AA512,0,0,COUNTA($AA$493:AA512),1)),ROUND(X513*100/ORÇAMENTO.TotalOrçamento,2))","v":{"$error":"#DIV/0!"}}]
[null,null,null,null,null,null,null,null,null,null,null,null,null,null,"TOTAL GERAL DO ORÇAMENTO (R$)",null,null,null,{"$f":"SUM(S494:W513)","v":0},null,null,null,null,{"$f":"SUM(X494:Y513)","v":0},null,null,{"$f":"SUM(AA494:AA513)","v":{"$error":"#DIV/0!"}}]
[null,null,null,null,null,null,null,null,null,null,null,null,null,null,null,null,null,null,{"$f":"$Z$442","v":0},null,null,null,null,{"$f":"$Z$444","v":0},null,null,100]
[null,null,null,null,null,null,null,null,null,null,null,null,null,null,null,null,null,null,"(TOTAL SEM BDI)",null,null,null,null,"(TOTAL COM BDI)",null,null,"(ARRED porcentagem)"]
[null,null,null,null,null,null,null,null,null,null,null,null,null,null,null,null,null,null,{"$f":"IF(AND(S514=S515,S514>0),\"OK\",\"ERRO\")","v":"ERRO"},null,null,null,null,{"$f":"IF(AND(X514=X515,X514>0),\"OK\",\"ERRO\")","v":"ERRO"},null,null,{"$f":"IF(AND(AA514=100,S494<>0),\"OK\",\"ERRO\")","v":{"$error":"#DIV/0!"}}]

{"sheet":"Resumo ","index":1,"n_rows":39,"n_cols":9,"rows_kept":39,"cut":false,"hidden":false,"merged":[[13,0,14,0],[15,2,15,5],[16,2,16,5],[17,2,17,5],[18,2,18,5],[14,1,14,8],[0,1,0,8],[36,1,36,5],[2,1,2,5],[3,1,3,5],[5,1,5,5],[6,1,6,5],[8,1,8,5],[9,1,9,5],[11,3,11,5],[12,3,12,5],[10,1,10,8],[11,6,11,8],[12,6,12,8],[19,2,19,5],[20,2,20,5],[21,2,21,5],[31,2,31,5],[1,1,1,8],[2,6,2,8],[3,6,3,8],[4,1,4,8],[5,6,5,8],[6,6,6,8],[7,1,7,8],[8,6,8,8],[9,6,9,8],[13,1,13,8],[11,1,11,2],[12,1,12,2],[42,3,42,7],[41,3,41,7],[38,1,38,8],[22,2,22,5],[23,2,23,5],[24,2,24,5],[25,2,25,5],[26,2,26,5],[32,2,32,5],[33,2,33,5],[34,2,34,5],[35,2,35,5],[27,2,27,5],[28,2,28,5],[29,2,29,5],[30,2,30,5]]}
[]
[]
[null,"UNIDADE ESCOLAR",null,null,null,null,"CÓDIGO INEP"]
[null,{"$f":"Orçamento!$O$4","v":"COLÉGIO ESTADUAL MARIA ASSUNÇÃO DE AZEVEDO"},null,null,null,null,{"$f":"Orçamento!X4","v":52015041}]
[]
[null,"OBRA",null,null,null,null,"CIDADE"]
[null,{"$f":"Orçamento!$O$7","v":"REFORMA E AMPLIAÇÃO"},null,null,null,null,{"$f":"Orçamento!$X$7","v":"CARMO DO RIO VERDE"}]
[]
[null,"ENDEREÇO",null,null,null,null,"CRE"]
[null,{"$f":"Orçamento!$R$10","v":" RUA REINALDO JOSE DE SOUZA 400 Nº 400 , CENTRO , CEP:76340-000"},null,null,null,null,{"$f":"Orçamento!$O$10","v":"CRE-CERES"}]
[]
[null,"REFERÊNCIA",null,"DATA",null,null,"ÁREA TOTAL CONSTRUÍDA (M²)"]
[null,{"$f":"CONCATENATE(\"AGETOP E SINAPI - \",Orçamento!$T$10)","v":"AGETOP E SINAPI - DESONERADA"},null,{"$f":"Orçamento!$S$7","v":"2020-07-07"},null,null,{"$f":"Orçamento!$X$13","v":2719.4500000000003}]
["FILTRO"]
[null,"RESUMO GERAL DO ORÇAMENTO"]
["↓","ITEM","DESCRIÇÃO DOS SERVIÇOS",null,null,null,"PREÇO SEM BDI","PREÇO COM BDI","PARTICIP. (%)"]
[{"$f":"IF(G17>0,\"F\",\"\")","v":""},"1.",{"$f":"Orçamento!$P494","v":"BLOCO COZINHA DE PLACA"},null,null,null,{"$f":"IFERROR(Orçamento!S494,\"-\")","v":0},{"$f":"IFERROR(Orçamento!X494,\"\")","v":0},{"$f":"Orçamento!AA494","v":{"$error":"#DIV/0!"}}]
[{"$f":"IF(G18>0,\"F\",\"\")","v":""},"2.",{"$f":"Orçamento!$P495","v":"BANHEIROS ADEQUAÇÕES"},null,null,null,{"$f":"IFERROR(Orçamento!S495,\"-\")","v":0},{"$f":"IFERROR(Orçamento!X495,\"\")","v":0},{"$f":"Orçamento!AA495","v":{"$error":"#DIV/0!"}}]
["","3.",{"$f":"Orçamento!$P496","v":"ACESSIBILIDADE"},null,null,null,{"$f":"IFERROR(Orçamento!S496,\"-\")","v":0},{"$f":"IFERROR(Orçamento!X496,\"\")","v":0},{"$f":"Orçamento!AA496","v":{"$error":"#DIV/0!"}}]
["","4.",{"$f":"Orçamento!$P497","v":"CALÇADA ACESSÍVEL"},null,null,null,{"$f":"IFERROR(Orçamento!S497,\"-\")","v":0},{"$f":"IFERROR(Orçamento!X497,\"\")","v":0},{"$f":"Orçamento!AA497","v":{"$error":"#DIV/0!"}}]
["","5.","PINTURA GERAL",null,null,null,{"$f":"IFERROR(Orçamento!S498,\"-\")","v":0},{"$f":"IFERROR(Orçamento!X498,\"\")","v":0},{"$f":"Orçamento!AA498","v":{"$error":"#DIV/0!"}}]
["","6.","COBERTURA",null,null,null,{"$f":"IFERROR(Orçamento!S499,\"-\")","v":0},{"$f":"IFERROR(Orçamento!X499,\"\")","v":0},{"$f":"Orçamento!AA499","v":{"$error":"#DIV/0!"}}]
["","7.","QUADRA",null,null,null,{"$f":"IFERROR(Orçamento!S500,\"-\")","v":0},{"$f":"IFERROR(Orçamento!X500,\"\")","v":0},{"$f":"Orçamento!AA500","v":{"$error":"#DIV/0!"}}]
["","8.","VIDRO",null,null,null,{"$f":"IFERROR(Orçamento!S501,\"-\")","v":0},{"$f":"IFERROR(Orçamento!X501,\"\")","v":0},{"$f":"Orçamento!AA501","v":{"$error":"#DIV/0!"}}]
["","9.","ADMINISTRAÇÃO LOCAL",null,null,null,{"$f":"IFERROR(Orçamento!S502,\"-\")","v":0},{"$f":"IFERROR(Orçamento!X502,\"\")","v":0},{"$f":"Orçamento!AA502","v":{"$error":"#DIV/0!"}}]
["","10.","OBRA",null,null,null,{"$f":"IFERROR(Orçamento!S503,\"-\")","v":0},{"$f":"IFERROR(Orçamento!X503,\"\")","v":0},{"$f":"Orçamento!AA503","v":{"$error":"#DIV/0!"}}]
["","11.","PROJETO DE GÁS",null,null,null,{"$f":"IFERROR(Orçamento!S504,\"-\")","v":0},{"$f":"IFERROR(Orçamento!X504,\"\")","v":0},{"$f":"Orçamento!AA504","v":{"$error":"#DIV/0!"}}]
["","12.","PROJETO HIDROSSANITÁRIO",null,null,null,{"$f":"IFERROR(Orçamento!S505,\"-\")","v":0},{"$f":"IFERROR(Orçamento!X505,\"\")","v":0},{"$f":"Orçamento!AA505","v":{"$error":"#DIV/0!"}}]
["","13.","PROJETO ELÉTRICO",null,null,null,{"$f":"IFERROR(Orçamento!S506,\"-\")","v":0},{"$f":"IFERROR(Orçamento!X506,\"\")","v":0},{"$f":"Orçamento!AA506","v":{"$error":"#DIV/0!"}}]
["","14.",{"$f":"Orçamento!$P507","v":"PROJETO DE PREVENÇÃO E COMBATE A INCÊNDIO"},null,null,null,{"$f":"IFERROR(Orçamento!S507,\"-\")","v":0},{"$f":"IFERROR(Orçamento!X507,\"\")","v":0},{"$f":"Orçamento!AA507","v":{"$error":"#DIV/0!"}}]
["","15.",{"$f":"Orçamento!$P508","v":"COZINHA SEDUC OPÇÃO 2"},null,null,null,{"$f":"IFERROR(Orçamento!S508,\"-\")","v":0},{"$f":"IFERROR(Orçamento!X508,\"\")","v":0},{"$f":"Orçamento!AA508","v":{"$error":"#DIV/0!"}}]
["","16.",{"$f":"Orçamento!$P509","v":""},null,null,null,{"$f":"IFERROR(Orçamento!S509,\"-\")","v":0},{"$f":"IFERROR(Orçamento!X509,\"\")","v":0},{"$f":"Orçamento!AA509","v":{"$error":"#DIV/0!"}}]
["","17.",{"$f":"Orçamento!$P510","v":""},null,null,null,{"$f":"IFERROR(Orçamento!S510,\"-\")","v":0},{"$f":"IFERROR(Orçamento!X510,\"\")","v":0},{"$f":"Orçamento!AA510","v":{"$error":"#DIV/0!"}}]
["","18.",{"$f":"Orçamento!$P511","v":""},null,null,null,{"$f":"IFERROR(Orçamento!S511,\"-\")","v":0},{"$f":"IFERROR(Orçamento!X511,\"\")","v":0},{"$f":"Orçamento!AA511","v":{"$error":"#DIV/0!"}}]
["","19.",{"$f":"Orçamento!$P512","v":""},null,null,null,{"$f":"IFERROR(Orçamento!S512,\"-\")","v":0},{"$f":"IFERROR(Orçamento!X512,\"\")","v":0},{"$f":"Orçamento!AA512","v":{"$error":"#DIV/0!"}}]
["","20.",{"$f":"Orçamento!$P513","v":""},null,null,null,{"$f":"IFERROR(Orçamento!S513,\"-\")","v":0},{"$f":"IFERROR(Orçamento!X513,\"\")","v":0},{"$f":"Orçamento!AA513","v":{"$error":"#DIV/0!"}}]
["F","TOTAL GERAL DO ORÇAMENTO (R$)",null,null,null,null,{"$f":"SUM(G17:G36)","v":0},{"$f":"SUM(H17:H36)","v":0},{"$f":"SUM(I17:I36)","v":{"$error":"#DIV/0!"}}]
["F"]
["F"]

{"sheet":"Somatório","index":2,"n_rows":45,"n_cols":6,"rows_kept":45,"cut":false,"hidden":false,"merged":[[13,0,14,0],[42,1,42,2],[44,1,44,5],[47,3,47,5],[48,3,48,5],[13,1,13,5],[9,1,9,3],[9,4,9,5],[11,1,11,2],[11,4,11,5],[12,1,12,2],[12,4,12,5],[0,1,0,5],[14,1,14,5],[2,1,2,3],[2,4,2,5],[3,1,3,3],[3,4,3,5],[5,1,5,3],[5,4,5,5],[6,1,6,3],[6,4,6,5],[8,1,8,3],[8,4,8,5],[1,1,1,5],[4,1,4,5],[7,1,7,5],[10,1,10,5]]}
[]
[]
[null,"UNIDADE ESCOLAR",null,null,"CÓDIGO INEP"]
[null,{"$f":"Orçamento!$O$4","v":"COLÉGIO ESTADUAL MARIA ASSUNÇÃO DE AZEVEDO"},null,null,{"$f":"Orçamento!X4","v":52015041}]
[]
[null,"OBRA",null,null,"CIDADE"]
[null,{"$f":"Orçamento!$O$7","v":"REFORMA E AMPLIAÇÃO"},null,null,{"$f":"Orçamento!$X$7","v":"CARMO DO RIO VERDE"}]
[]
[null,"ENDEREÇO",null,null,"CRE"]
[null,{"$f":"Orçamento!$R$10","v":" RUA REINALDO JOSE DE SOUZA 400 Nº 400 , CENTRO , CEP:76340-000"},null,null,{"$f":"Orçamento!$O$10","v":"CRE-CERES"}]
[]
[null,"REFERÊNCIA",null,"DATA","ÁREA TOTAL CONSTRUÍDA (M²)"]
[null,{"$f":"CONCATENATE(\"AGETOP E SINAPI - \",Orçamento!$T$10)","v":"AGETOP E SINAPI - DESONERADA"},null,{"$f":"Orçamento!$S$7","v":"2020-07-07"},{"$f":"Orçamento!$X$13","v":2719.4500000000003}]
["FILTRO"]
[null,"SOMATÓRIO DE SERVIÇOS"]
["↓","ITEM","DESCRIÇÃO DOS SERVIÇOS","PREÇO SEM BDI (R$)","PREÇO COM BDI (R$)","PARTIC.  ( % )"]
[{"$f":"IF(D17>0,\"F\",\"\")","v":""},"a.",{"$f":"Orçamento!P460","v":"SERVIÇOS PRELIMINARES"},{"$f":"Orçamento!S460","v":0},{"$f":"Orçamento!X460","v":0},{"$f":"Orçamento!AA460","v":0}]
[{"$f":"IF(D18>0,\"F\",\"\")","v":""},"b.",{"$f":"Orçamento!P461","v":"TRANSPORTES"},{"$f":"Orçamento!S461","v":0},{"$f":"Orçamento!X461","v":0},{"$f":"Orçamento!AA461","v":0}]
["","c.",{"$f":"Orçamento!P462","v":"SERVIÇO EM TERRA"},{"$f":"Orçamento!S462","v":0},{"$f":"Orçamento!X462","v":0},{"$f":"Orçamento!AA462","v":0}]
["","d.",{"$f":"Orçamento!P463","v":"FUNDAÇÕES E SONDAGENS"},{"$f":"Orçamento!S463","v":0},{"$f":"Orçamento!X463","v":0},{"$f":"Orçamento!AA463","v":0}]
["","e.","ESTRUTURA",{"$f":"Orçamento!S464","v":0},{"$f":"Orçamento!X464","v":0},{"$f":"Orçamento!AA464","v":0}]
["","f.","INSTALAÇÕES ELÉTRICAS",{"$f":"Orçamento!S465","v":0},{"$f":"Orçamento!X465","v":0},{"$f":"Orçamento!AA465","v":0}]
["","g.","INSTALAÇÕES HIDROSSANITÁRIAS",{"$f":"Orçamento!S466","v":0},{"$f":"Orçamento!X466","v":0},{"$f":"Orçamento!AA466","v":0}]
["","h","INSTALAÇÕES ESPECIAIS",{"$f":"Orçamento!S467","v":0},{"$f":"Orçamento!X467","v":0},{"$f":"Orçamento!AA467","v":0}]
["","i.","ALVENARIAS E DIVISÓRIAS",{"$f":"Orçamento!S468","v":0},{"$f":"Orçamento!X468","v":0},{"$f":"Orçamento!AA468","v":0}]
["","j.","ALVENARIA AUTO-PORTANTE",{"$f":"Orçamento!S469","v":0},{"$f":"Orçamento!X469","v":0},{"$f":"Orçamento!AA469","v":0}]
["","k.","IMPERMEABILIZAÇÃO",{"$f":"Orçamento!S470","v":0},{"$f":"Orçamento!X470","v":0},{"$f":"Orçamento!AA470","v":0}]
["","l.","ISOLAMENTO TÉRMICO E ACÚSTICO",{"$f":"Orçamento!S471","v":0},{"$f":"Orçamento!X471","v":0},{"$f":"Orçamento!AA471","v":0}]
["","m.","ESTRUTURA DE MADEIRA",{"$f":"Orçamento!S472","v":0},{"$f":"Orçamento!X472","v":0},{"$f":"Orçamento!AA472","v":0}]
["","n.",{"$f":"Orçamento!P473","v":"ESTRUTURAS METÁLICAS"},{"$f":"Orçamento!S473","v":0},{"$f":"Orçamento!X473","v":0},{"$f":"Orçamento!AA473","v":0}]
["","o.",{"$f":"Orçamento!P474","v":"COBERTURAS"},{"$f":"Orçamento!S474","v":0},{"$f":"Orçamento!X474","v":0},{"$f":"Orçamento!AA474","v":0}]
["","p.",{"$f":"Orçamento!P475","v":"ESQUADRIAS DE MADEIRA"},{"$f":"Orçamento!S475","v":0},{"$f":"Orçamento!X475","v":0},{"$f":"Orçamento!AA475","v":0}]
["","q.",{"$f":"Orçamento!P476","v":"ESQUADRIAS METÁLICAS"},{"$f":"Orçamento!S476","v":0},{"$f":"Orçamento!X476","v":0},{"$f":"Orçamento!AA476","v":0}]
["","r.",{"$f":"Orçamento!P477","v":"VIDROS"},{"$f":"Orçamento!S477","v":0},{"$f":"Orçamento!X477","v":0},{"$f":"Orçamento!AA477","v":0}]
["","s.",{"$f":"Orçamento!P478","v":"REVESTIMENTO DE PAREDE"},{"$f":"Orçamento!S478","v":0},{"$f":"Orçamento!X478","v":0},{"$f":"Orçamento!AA478","v":0}]
["","t.",{"$f":"Orçamento!P479","v":"FORROS"},{"$f":"Orçamento!S479","v":0},{"$f":"Orçamento!X479","v":0},{"$f":"Orçamento!AA479","v":0}]
["","u.",{"$f":"Orçamento!P480","v":"REVESTIMENTO DE PISO"},{"$f":"Orçamento!S480","v":0},{"$f":"Orçamento!X480","v":0},{"$f":"Orçamento!AA480","v":0}]
["","v.",{"$f":"Orçamento!P481","v":"FERRAGENS"},{"$f":"Orçamento!S481","v":0},{"$f":"Orçamento!X481","v":0},{"$f":"Orçamento!AA481","v":0}]
["","w.",{"$f":"Orçamento!P482","v":"MARCENARIA"},{"$f":"Orçamento!S482","v":0},{"$f":"Orçamento!X482","v":0},{"$f":"Orçamento!AA482","v":0}]
["","x.",{"$f":"Orçamento!P483","v":"ADMINISTRAÇÃO"},{"$f":"Orçamento!S483","v":0},{"$f":"Orçamento!X483","v":0},{"$f":"Orçamento!AA483","v":0}]
["","y.",{"$f":"Orçamento!P484","v":"PINTURA"},{"$f":"Orçamento!S484","v":0},{"$f":"Orçamento!X484","v":0},{"$f":"Orçamento!AA484","v":0}]
["","z.",{"$f":"Orçamento!P485","v":"DIVERSOS"},{"$f":"Orçamento!S485","v":0},{"$f":"Orçamento!X485","v":0},{"$f":"Orçamento!AA485","v":0}]
["F","TOTAL GERAL DO ORÇAMENTO",null,{"$f":"SUM(D17:D42)","v":0},{"$f":"SUM(E17:E42)","v":0},{"$f":"SUM(F17:F42)","v":0}]
[]
[null,"(*) Para itens da AGETOP, os vidros não estão inclusos nas esquadrias e já foram considerados os custos de contramarco para as esquadrias de alumínio;"]

{"sheet":"Cronog_75_Dias","index":3,"n_rows":99,"n_cols":20,"rows_kept":99,"cut":false,"hidden":false,"merged":[[0,1,0,17],[1,1,1,17],[2,1,2,7],[2,8,2,17],[3,1,3,7],[3,8,3,17],[8,1,8,7],[8,8,8,17],[9,0,11,0],[9,1,9,7],[9,8,9,17],[10,1,10,17],[11,1,11,17],[4,1,4,17],[5,1,5,7],[5,8,5,17],[6,1,6,7],[6,8,6,17],[7,1,7,17],[12,0,13,0],[12,3,13,3],[12,5,12,8],[12,9,12,12],[12,13,12,16],[12,17,13,17],[13,1,13,2],[13,5,13,8],[13,9,13,12],[13,13,13,16],[14,1,16,2],[14,3,16,3],[14,4,16,4],[14,5,14,8],[14,9,14,12],[14,13,14,16],[16,5,16,8],[16,9,16,12],[16,13,16,16],[17,1,19,2],[17,3,19,3],[17,4,19,4],[17,5,17,8],[17,9,17,12],[17,13,17,16],[19,5,19,8],[19,9,19,12],[19,13,19,16],[20,1,22,2],[20,3,22,3],[20,4,22,4],[20,5,20,8],[20,9,20,12],[20,13,20,16],[22,5,22,8],[22,9,22,12],[22,13,22,16],[23,1,25,2],[23,3,25,3],[23,4,25,4],[23,5,23,8],[23,9,23,12],[23,13,23,16],[25,5,25,8],[25,9,25,12],[25,13,25,16],[26,1,28,2],[26,3,28,3],[26,4,28,4],[26,5,26,8],[26,9,26,12],[26,13,26,16],[28,5,28,8],[28,9,28,12],[28,13,28,16],[29,1,31,2],[29,3,31,3],[29,4,31,4],[29,5,29,8],[29,9,29,12],[29,13,29,16],[31,5,31,8],[31,9,31,12],[31,13,31,16],[32,1,34,2],[32,3,34,3],[32,4,34,4],[32,5,32,8],[32,9,32,12],[32,13,32,16],[34,5,34,8],[34,9,34,12],[34,13,34,16],[35,1,37,2],[35,3,37,3],[35,4,37,4],[35,5,35,8],[35,9,35,12],[35,13,35,16],[37,5,37,8],[37,9,37,12],[37,13,37,16],[38,1,40,2],[38,3,40,3],[38,4,40,4],[38,5,38,8],[38,9,38,12],[38,13,38,16],[40,5,40,8],[40,9,40,12],[40,13,40,16],[41,1,43,2],[41,3,43,3],[41,4,43,4],[41,5,41,8],[41,9,41,12],[41,13,41,16],[43,5,43,8],[43,9,43,12],[43,13,43,16],[44,1,46,2],[44,3,46,3],[44,4,46,4],[44,5,44,8],[44,9,44,12],[44,13,44,16],[46,5,46,8],[46,9,46,12],[46,13,46,16],[47,1,49,2],[47,3,49,3],[47,4,49,4],[47,5,47,8],[47,9,47,12],[47,13,47,16],[49,5,49,8],[49,9,49,12],[49,13,49,16],[50,1,52,2],[50,3,52,3],[50,4,52,4],[50,5,50,8],[50,9,50,12],[50,13,50,16],[52,5,52,8],[52,9,52,12],[52,13,52,16],[53,1,55,2],[53,3,55,3],[53,4,55,4],[53,5,53,8],[53,9,53,12],[53,13,53,16],[55,5,55,8],[55,9,55,12],[55,13,55,16],[56,1,58,2],[56,3,58,3],[56,4,58,4],[56,5,56,8],[56,9,56,12],[56,13,56,16],[58,5,58,8],[58,9,58,12],[58,13,58,16],[59,1,61,2],[59,3,61,3],[59,4,61,4],[59,5,59,8],[59,9,59,12],[59,13,59,16],[61,5,61,8],[61,9,61,12],[61,13,61,16],[62,1,64,2],[62,3,64,3],[62,4,64,4],[62,5,62,8],[62,9,62,12],[62,13,62,16],[64,5,64,8],[64,9,64,12],[64,13,64,16],[65,1,67,2],[65,3,67,3],[65,4,67,4],[65,5,65,8],[65,9,65,12],[65,13,65,16],[67,5,67,8],[67,9,67,12],[67,13,67,16],[68,1,70,2],[68,3,70,3],[68,4,70,4],[68,5,68,8],[68,9,68,12],[68,13,68,16],[70,5,70,8],[70,9,70,12],[70,13,70,16],[71,1,73,2],[71,3,73,3],[71,4,73,4],[71,5,71,8],[71,9,71,12],[71,13,71,16],[73,5,73,8],[73,9,73,12],[73,13,73,16],[74,1,76,2],[74,3,76,3],[74,4,76,4],[74,5,74,8],[74,9,74,12],[74,13,74,16],[76,5,76,8],[76,9,76,12],[76,13,76,16],[77,1,79,2],[77,3,79,3],[77,4,79,4],[77,5,77,8],[77,9,77,12],[77,13,77,16],[79,5,79,8],[79,9,79,12],[79,13,79,16],[80,1,82,2],[80,3,82,3],[80,4,82,4],[80,5,80,8],[80,9,80,12],[80,13,80,16],[82,5,82,8],[82,9,82,12],[82,13,82,16],[83,1,85,2],[83,3,85,3],[83,4,85,4],[83,5,83,8],[83,9,83,12],[83,13,83,16],[85,5,85,8],[85,9,85,12],[85,13,85,16],[86,1,88,2],[86,3,88,3],[86,4,88,4],[86,5,86,8],[86,9,86,12],[86,13,86,16],[88,5,88,8],[88,9,88,12],[88,13,88,16],[92,1,92,2],[92,5,92,8],[92,9,92,12],[92,13,92,16],[93,1,93,2],[93,5,93,8],[93,9,93,12],[93,13,93,16],[89,1,91,2],[89,3,91,3],[89,4,91,4],[89,5,89,8],[89,9,89,12],[89,13,89,16],[91,5,91,8],[91,9,91,12],[91,13,91,16],[97,1,97,4],[98,1,98,17],[94,1,94,2],[94,5,94,8],[94,9,94,12],[94,13,94,16],[95,1,95,2],[95,5,95,8],[95,9,95,12],[95,13,95,16]]}
[]
[]
[null,"UNIDADE ESCOLAR",null,null,null,null,null,null,"PRAZO"]
[null,{"$f":"Orçamento!O4","v":"COLÉGIO ESTADUAL MARIA ASSUNÇÃO DE AZEVEDO"},null,null,null,null,null,null,"75 DIAS CORRIDOS"]
[]
[null,"OBRA",null,null,null,null,null,null,"DATA"]
[null,{"$f":"Orçamento!O7","v":"REFORMA E AMPLIAÇÃO"},null,null,null,null,null,null,{"$f":"Orçamento!S7","v":"2020-07-07"}]
[]
[null,"LOCAL",null,null,null,null,null,null,"ÁREA TOTAL CONSTRUÍDA (M²)"]
["FILTRO",{"$f":"Orçamento!X7","v":"CARMO DO RIO VERDE"},null,null,null,null,null,null,{"$f":"Orçamento!X13","v":2719.4500000000003}]
[]
[null,"CRONOGRAMA - FÍSICO FINANCEIRO"]
["↓","CUSTO TOTAL:",{"$f":"D93","v":0},"VALOR","Dias:",25,null,null,null,50,null,null,null,75,null,null,null,"TOTAL"]
[null,"DESCRIÇÃO DOS SERVIÇOS",null,null,"%","1ª PARCELA",null,null,null,"2ª PARCELA",null,null,null,"3ª PARCELA"]
[{"$f":"IF(D15>0,\"F\",\"\")","v":""},"SERVIÇOS PRELIMINARES",null,{"$f":"Orçamento!X460","v":0},{"$f":"Orçamento!AA460","v":0},{"$f":"ROUND(F17*$D$15,2)","v":0},null,null,null,{"$f":"ROUND(J17*$D$15,2)","v":0},null,null,null,{"$f":"ROUND(N17*$D$15,2)","v":0},null,null,null,0,null,"OK"]
[{"$f":"IF(A15=\"F\",A15,\"\")","v":""}]
[{"$f":"IF(A16=\"F\",A16,\"\")","v":""},null,null,null,null,1,null,null,null,0,null,null,null,{"$f":"1-F17-J17","v":0},null,null,null,0,null,"OK"]
[{"$f":"IF(D18>0,\"F\",\"\")","v":""},"TRANSPORTES",null,{"$f":"Orçamento!X461","v":0},{"$f":"Orçamento!AA461","v":0},{"$f":"ROUND(F20*$D$18,2)","v":0},null,null,null,{"$f":"ROUND(J20*$D$18,2)","v":0},null,null,null,{"$f":"ROUND(N20*$D$18,2)","v":0},null,null,null,0,null,"OK"]
[{"$f":"IF(A18=\"F\",A18,\"\")","v":""}]
[{"$f":"IF(A19=\"F\",A19,\"\")","v":""},null,null,null,null,0.35,null,null,null,0.3,null,null,null,{"$f":"1-F20-J20","v":0.35000000000000003},null,null,null,0,null,"OK"]
[{"$f":"IF(D21>0,\"F\",\"\")","v":""},"SERVIÇO EM TERRA",null,{"$f":"Orçamento!X462","v":0},{"$f":"Orçamento!AA462","v":0},{"$f":"ROUND(F23*$D$21,2)","v":0},null,null,null,{"$f":"ROUND(J23*$D$21,2)","v":0},null,null,null,{"$f":"ROUND(N23*$D$21,2)","v":0},null,null,null,0,null,"OK"]
[{"$f":"IF(A21=\"F\",A21,\"\")","v":""}]
[{"$f":"IF(A22=\"F\",A22,\"\")","v":""},null,null,null,null,1,null,null,null,0,null,null,null,{"$f":"1-F23-J23","v":0},null,null,null,0,null,"OK"]
[{"$f":"IF(D24>0,\"F\",\"\")","v":""},"FUNDAÇÕES E SONDAGENS",null,{"$f":"Orçamento!X463","v":0},{"$f":"Orçamento!AA463","v":0},{"$f":"ROUND(F26*$D$24,2)","v":0},null,null,null,{"$f":"ROUND(J26*$D$24,2)","v":0},null,null,null,{"$f":"ROUND(N26*$D$24,2)","v":0},null,null,null,0,null,"OK"]
[{"$f":"IF(A24=\"F\",A24,\"\")","v":""}]
[{"$f":"IF(A25=\"F\",A25,\"\")","v":""},null,null,null,null,1,null,null,null,0,null,null,null,{"$f":"1-F26-J26","v":0},null,null,null,0,null,"OK"]
[{"$f":"IF(D27>0,\"F\",\"\")","v":""},"ESTRUTURA",null,{"$f":"Orçamento!X464","v":0},{"$f":"Orçamento!AA464","v":0},{"$f":"ROUND(F29*$D$27,2)","v":0},null,null,null,{"$f":"ROUND(J29*$D$27,2)","v":0},null,null,null,{"$f":"ROUND(N29*$D$27,2)","v":0},null,null,null,0,null,"OK"]
[{"$f":"IF(A27=\"F\",A27,\"\")","v":""}]
[{"$f":"IF(A28=\"F\",A28,\"\")","v":""},null,null,null,null,0.54,null,null,null,0.46,null,null,null,{"$f":"1-F29-J29","v":0},null,null,null,0,null,"OK"]
[{"$f":"IF(D30>0,\"F\",\"\")","v":""},"INST.ELET/TELEFÔNICA/CABEAMENTO ESTRUTURADO",null,{"$f":"Orçamento!X465","v":0},{"$f":"Orçamento!AA465","v":0},{"$f":"ROUND(F32*$D$30,2)","v":0},null,null,null,{"$f":"ROUND(J32*$D$30,2)","v":0},null,null,null,{"$f":"ROUND(N32*$D$30,2)","v":0},null,null,null,0,null,"OK"]
[{"$f":"IF(A30=\"F\",A30,\"\")","v":""}]
[{"$f":"IF(A31=\"F\",A31,\"\")","v":""},null,null,null,null,0,null,null,null,{"$f":"1-B32","v":1},null,null,null,{"$f":"1-F32-J32","v":0},null,null,null,0,null,"OK"]
[{"$f":"IF(D33>0,\"F\",\"\")","v":""},"INSTALAÇÕES HIDROSSANITÁRIAS",null,{"$f":"Orçamento!X466","v":0},{"$f":"Orçamento!AA466","v":0},{"$f":"ROUND(F35*$D$33,2)","v":0},null,null,null,{"$f":"ROUND(J35*$D$33,2)","v":0},null,null,null,{"$f":"ROUND(N35*$D$33,2)","v":0},null,null,null,0,null,"OK"]
[{"$f":"IF(A33=\"F\",A33,\"\")","v":""}]
[{"$f":"IF(A34=\"F\",A34,\"\")","v":""},null,null,null,null,0,null,null,null,{"$f":"1-B35","v":1},null,null,null,{"$f":"1-F35-J35","v":0},null,null,null,0,null,"OK"]
[{"$f":"IF(D36>0,\"F\",\"\")","v":""},"INSTALAÇÕES ESPECIAIS",null,{"$f":"Orçamento!X467","v":0},{"$f":"Orçamento!AA467","v":0},{"$f":"ROUND(F38*$D$36,2)","v":0},null,null,null,{"$f":"ROUND(J38*$D$36,2)","v":0},null,null,null,{"$f":"ROUND(N38*$D$36,2)","v":0},null,null,null,0,null,"OK"]
[{"$f":"IF(A36=\"F\",A36,\"\")","v":""}]
[{"$f":"IF(A37=\"F\",A37,\"\")","v":""},null,null,null,null,0,null,null,null,{"$f":"1-B38","v":1},null,null,null,{"$f":"1-F38-J38","v":0},null,null,null,0,null,"OK"]
[{"$f":"IF(D39>0,\"F\",\"\")","v":""},"ALVENARIA E DIVISÓRIAS",null,{"$f":"Orçamento!X468","v":0},{"$f":"Orçamento!AA468","v":0},{"$f":"ROUND(F41*$D$39,2)","v":0},null,null,null,{"$f":"ROUND(J41*$D$39,2)","v":0},null,null,null,{"$f":"ROUND(N41*$D$39,2)","v":0},null,null,null,0,null,"OK"]
[{"$f":"IF(A39=\"F\",A39,\"\")","v":""}]
[{"$f":"IF(A40=\"F\",A40,\"\")","v":""},null,null,null,null,0,null,null,null,{"$f":"1-B41","v":1},null,null,null,{"$f":"1-F41-J41","v":0},null,null,null,0,null,"OK"]
[{"$f":"IF(D42>0,\"F\",\"\")","v":""},"ALVENARIA AUTO-PORTANTE",null,{"$f":"Orçamento!X469","v":0},{"$f":"Orçamento!AA469","v":0},{"$f":"ROUND(F44*$D$42,2)","v":0},null,null,null,{"$f":"ROUND(J44*$D$42,2)","v":0},null,null,null,{"$f":"ROUND(N44*$D$42,2)","v":0},null,null,null,0,null,"OK"]
[{"$f":"IF(A42=\"F\",A42,\"\")","v":""}]
[{"$f":"IF(A43=\"F\",A43,\"\")","v":""},null,null,null,null,0,null,null,null,{"$f":"1-B44","v":1},null,null,null,{"$f":"1-F44-J44","v":0},null,null,null,0,null,"OK"]
[{"$f":"IF(D45>0,\"F\",\"\")","v":""},"IMPERMEABILIZAÇÃO",null,{"$f":"Orçamento!X470","v":0},{"$f":"Orçamento!AA470","v":0},{"$f":"ROUND(F47*$D$45,2)","v":0},null,null,null,{"$f":"ROUND(J47*$D$45,2)","v":0},null,null,null,{"$f":"ROUND(N47*$D$45,2)","v":0},null,null,null,0,null,"OK"]
[{"$f":"IF(A45=\"F\",A45,\"\")","v":""}]
[{"$f":"IF(A46=\"F\",A46,\"\")","v":""},null,null,null,null,0.85,null,null,null,0.15,null,null,null,{"$f":"1-F47-J47","v":0},null,null,null,0,null,"OK"]
[{"$f":"IF(D48>0,\"F\",\"\")","v":""},"ISOLAMENTO TÉRMICO E ACÚSTICO",null,{"$f":"Orçamento!X471","v":0},{"$f":"Orçamento!AA471","v":0},{"$f":"ROUND(F50*$D$48,2)","v":0},null,null,null,{"$f":"ROUND(J50*$D$48,2)","v":0},null,null,null,{"$f":"ROUND(N50*$D$48,2)","v":0},null,null,null,0,null,"OK"]
[{"$f":"IF(A48=\"F\",A48,\"\")","v":""}]
[{"$f":"IF(A49=\"F\",A49,\"\")","v":""},null,null,null,null,0,null,null,null,{"$f":"1-B50","v":1},null,null,null,{"$f":"1-F50-J50","v":0},null,null,null,0,null,"OK"]
[{"$f":"IF(D51>0,\"F\",\"\")","v":""},"ESTRUTURA DE MADEIRA",null,{"$f":"Orçamento!X472","v":0},{"$f":"Orçamento!AA472","v":0},{"$f":"ROUND(F53*$D$51,2)","v":0},null,null,null,{"$f":"ROUND(J53*$D$51,2)","v":0},null,null,null,{"$f":"ROUND(N53*$D$51,2)","v":0},null,null,null,0,null,"OK"]
[{"$f":"IF(A51=\"F\",A51,\"\")","v":""}]
[{"$f":"IF(A52=\"F\",A52,\"\")","v":""},null,null,null,null,0,null,null,null,0.57999999999999996,null,null,null,{"$f":"1-F53-J53","v":0.42000000000000004},null,null,null,0,null,"OK"]
[{"$f":"IF(D54>0,\"F\",\"\")","v":""},"ESTRUTURA METÁLICA",null,{"$f":"Orçamento!X473","v":0},{"$f":"Orçamento!AA473","v":0},{"$f":"ROUND(F56*$D$54,2)","v":0},null,null,null,{"$f":"ROUND(J56*$D$54,2)","v":0},null,null,null,{"$f":"ROUND(N56*$D$54,2)","v":0},null,null,null,0,null,"OK"]
[{"$f":"IF(A54=\"F\",A54,\"\")","v":""}]
[{"$f":"IF(A55=\"F\",A55,\"\")","v":""},null,null,null,null,0,null,null,null,0.57999999999999996,null,null,null,{"$f":"1-F56-J56","v":0.42000000000000004},null,null,null,0,null,"OK"]
[{"$f":"IF(D57>0,\"F\",\"\")","v":""},"COBERTURAS",null,{"$f":"Orçamento!X474","v":0},{"$f":"Orçamento!AA474","v":0},{"$f":"ROUND(F59*$D$57,2)","v":0},null,null,null,{"$f":"ROUND(J59*$D$57,2)","v":0},null,null,null,{"$f":"ROUND(N59*$D$57,2)","v":0},null,null,null,0,null,"OK"]
[{"$f":"IF(A57=\"F\",A57,\"\")","v":""}]
[{"$f":"IF(A58=\"F\",A58,\"\")","v":""},null,null,null,null,0,null,null,null,0,null,null,null,{"$f":"1-F59-J59","v":1},null,null,null,0,null,"OK"]
[{"$f":"IF(D60>0,\"F\",\"\")","v":""},"ESQUADRIAS DE MADEIRA",null,{"$f":"Orçamento!X475","v":0},{"$f":"Orçamento!AA475","v":0},{"$f":"ROUND(F62*$D$60,2)","v":0},null,null,null,{"$f":"ROUND(J62*$D$60,2)","v":0},null,null,null,{"$f":"ROUND(N62*$D$60,2)","v":0},null,null,null,0,null,"OK"]
[{"$f":"IF(A60=\"F\",A60,\"\")","v":""}]
[{"$f":"IF(A61=\"F\",A61,\"\")","v":""},null,null,null,null,0,null,null,null,0.4,null,null,null,{"$f":"1-F62-J62","v":0.6},null,null,null,0,null,"OK"]
[{"$f":"IF(D63>0,\"F\",\"\")","v":""},"ESQUADRIAS METÁLICAS",null,{"$f":"Orçamento!X476","v":0},{"$f":"Orçamento!AA476","v":0},{"$f":"ROUND(F65*$D$63,2)","v":0},null,null,null,{"$f":"ROUND(J65*$D$63,2)","v":0},null,null,null,{"$f":"ROUND(N65*$D$63,2)","v":0},null,null,null,0,null,"OK"]
[{"$f":"IF(A63=\"F\",A63,\"\")","v":""}]
[{"$f":"IF(A64=\"F\",A64,\"\")","v":""},null,null,null,null,0,null,null,null,0.46,null,null,null,{"$f":"1-F65-J65","v":0.54},null,null,null,0,null,"OK"]
[{"$f":"IF(D66>0,\"F\",\"\")","v":""},"VIDROS",null,{"$f":"Orçamento!X477","v":0},{"$f":"Orçamento!AA477","v":0},{"$f":"ROUND(F68*$D$66,2)","v":0},null,null,null,{"$f":"ROUND(J68*$D$66,2)","v":0},null,null,null,{"$f":"ROUND(N68*$D$66,2)","v":0},null,null,null,0,null,"OK"]
[{"$f":"IF(A66=\"F\",A66,\"\")","v":""}]
[{"$f":"IF(A67=\"F\",A67,\"\")","v":""},null,null,null,null,0,null,null,null,0,null,null,null,{"$f":"1-F68-J68","v":1},null,null,null,0,null,"OK"]
[{"$f":"IF(D69>0,\"F\",\"\")","v":""},"REVESTIMENTO DE PAREDE",null,{"$f":"Orçamento!X478","v":0},{"$f":"Orçamento!AA478","v":0},{"$f":"ROUND(F71*$D$69,2)","v":0},null,null,null,{"$f":"ROUND(J71*$D$69,2)","v":0},null,null,null,{"$f":"ROUND(N71*$D$69,2)","v":0},null,null,null,0,null,"OK"]
[{"$f":"IF(A69=\"F\",A69,\"\")","v":""}]
[{"$f":"IF(A70=\"F\",A70,\"\")","v":""},null,null,null,null,0,null,null,null,0.4,null,null,null,{"$f":"1-F71-J71","v":0.6},null,null,null,0,null,"OK"]
[{"$f":"IF(D72>0,\"F\",\"\")","v":""},"FORROS",null,{"$f":"Orçamento!X479","v":0},{"$f":"Orçamento!AA479","v":0},{"$f":"ROUND(F74*$D$72,2)","v":0},null,null,null,{"$f":"ROUND(J74*$D$72,2)","v":0},null,null,null,{"$f":"ROUND(N74*$D$72,2)","v":0},null,null,null,0,null,"OK"]
[{"$f":"IF(A72=\"F\",A72,\"\")","v":""}]
[{"$f":"IF(A73=\"F\",A73,\"\")","v":""},null,null,null,null,0,null,null,null,0.4,null,null,null,{"$f":"1-F74-J74","v":0.6},null,null,null,0,null,"OK"]
[{"$f":"IF(D75>0,\"F\",\"\")","v":""},"REVESTIMENTO DE PISO",null,{"$f":"Orçamento!X480","v":0},{"$f":"Orçamento!AA480","v":0},{"$f":"ROUND(F77*$D$75,2)","v":0},null,null,null,{"$f":"ROUND(J77*$D$75,2)","v":0},null,null,null,{"$f":"ROUND(N77*$D$75,2)","v":0},null,null,null,0,null,"OK"]
[{"$f":"IF(A75=\"F\",A75,\"\")","v":""}]
[{"$f":"IF(A76=\"F\",A76,\"\")","v":""},null,null,null,null,0,null,null,null,0.4,null,null,null,{"$f":"1-F77-J77","v":0.6},null,null,null,0,null,"OK"]
[{"$f":"IF(D78>0,\"F\",\"\")","v":""},"FERRAGENS",null,{"$f":"Orçamento!X481","v":0},{"$f":"Orçamento!AA481","v":0},{"$f":"ROUND(F80*$D$78,2)","v":0},null,null,null,{"$f":"ROUND(J80*$D$78,2)","v":0},null,null,null,{"$f":"ROUND(N80*$D$78,2)","v":0},null,null,null,0,null,"OK"]
[{"$f":"IF(A78=\"F\",A78,\"\")","v":""}]
[{"$f":"IF(A79=\"F\",A79,\"\")","v":""},null,null,null,null,0,null,null,null,0,null,null,null,{"$f":"1-F80-J80","v":1},null,null,null,0,null,"OK"]
[{"$f":"IF(D81>0,\"F\",\"\")","v":""},"MARCENARIA",null,{"$f":"Orçamento!X482","v":0},{"$f":"Orçamento!AA482","v":0},{"$f":"ROUND(F83*$D$81,2)","v":0},null,null,null,{"$f":"ROUND(J83*$D$81,2)","v":0},null,null,null,{"$f":"ROUND(N83*$D$81,2)","v":0},null,null,null,0,null,"OK"]
[{"$f":"IF(A81=\"F\",A81,\"\")","v":""}]
[{"$f":"IF(A82=\"F\",A82,\"\")","v":""},null,null,null,null,0,null,null,null,0,null,null,null,{"$f":"1-F83-J83","v":1},null,null,null,0,null,"OK"]
[{"$f":"IF(D84>0,\"F\",\"\")","v":""},"ADMINISTRAÇÃO - MENSALISTAS",null,{"$f":"Orçamento!X483","v":0},{"$f":"Orçamento!AA483","v":0},{"$f":"ROUND(F86*$D$84,2)","v":0},null,null,null,{"$f":"ROUND(J86*$D$84,2)","v":0},null,null,null,{"$f":"ROUND(N86*$D$84,2)","v":0},null,null,null,0,null,"OK"]
[{"$f":"IF(A84=\"F\",A84,\"\")","v":""}]
[{"$f":"IF(A85=\"F\",A85,\"\")","v":""},null,null,null,null,0.33750000000000002,null,null,null,0.33,null,null,null,{"$f":"1-F86-J86","v":0.33249999999999996},null,null,null,0,null,"OK"]
[{"$f":"IF(D87>0,\"F\",\"\")","v":""},"PINTURA",null,{"$f":"Orçamento!X484","v":0},{"$f":"Orçamento!AA484","v":0},{"$f":"ROUND(F89*$D$87,2)","v":0},null,null,null,{"$f":"ROUND(J89*$D$87,2)","v":0},null,null,null,{"$f":"ROUND(N89*$D$87,2)","v":0},null,null,null,0,null,"OK"]
[{"$f":"IF(A87=\"F\",A87,\"\")","v":""}]
[{"$f":"IF(A88=\"F\",A88,\"\")","v":""},null,null,null,null,0,null,null,null,0,null,null,null,{"$f":"1-F89-J89","v":1},null,null,null,0,null,"OK"]
[{"$f":"IF(D90>0,\"F\",\"\")","v":""},"DIVERSOS",null,{"$f":"Orçamento!X485","v":0},{"$f":"Orçamento!AA485","v":0},{"$f":"ROUND(F92*$D$90,2)","v":0},null,null,null,{"$f":"ROUND(J92*$D$90,2)","v":0},null,null,null,{"$f":"ROUND(N92*$D$90,2)","v":0},null,null,null,0,null,"OK"]
[{"$f":"IF(A90=\"F\",A90,\"\")","v":""}]
[{"$f":"IF(A91=\"F\",A91,\"\")","v":""},null,null,null,null,0,null,null,null,0,null,null,null,{"$f":"1-F92-J92","v":1},null,null,null,0,null,"OK"]
["F","CUSTO DO ORÇAMENTO",null,{"$f":"SUM(D15:D92)","v":0},{"$f":"SUM(E15:E92)","v":0},{"$f":"F15+F18+F21+F24+F27+F30+F33+F36+F39+F42+F45+F48+F51+F54+F57+F60+F63+F66+F69+F72+F75+F78+F81+F84+F87+F90","v":0},null,null,null,{"$f":"J15+J18+J21+J24+J27+J30+J33+J36+J39+J42+J45+J48+J51+J54+J57+J60+J63+J66+J69+J72+J75+J78+J81+J84+J87+J90","v":0},null,null,null,{"$f":"N15+N18+N21+N24+N27+N30+N33+N36+N39+N42+N45+N48+N51+N54+N57+N60+N63+N66+N69+N72+N75+N78+N81+N84+N87+N90","v":0},null,null,null,0]
["F","PERCENTUAIS:",null,null,null,{"$f":"IFERROR(F93/D93,\"\")","v":""},null,null,null,{"$f":"IFERROR(J93/D93,\"\")","v":""},null,null,null,{"$f":"IFERROR(N93/D93,\"\")","v":""},null,null,null,0]
["F","TOTAIS ACUMULADOS:",null,null,null,{"$f":"F93","v":0},null,null,null,{"$f":"F95+J93","v":0},null,null,null,{"$f":"J95+N93","v":0}]
["F","PERCENTUAIS  ACUMULADOS:",null,null,null,{"$f":"F94","v":""},null,null,null,{"$f":"J94+F96","v":{"$error":"#VALUE!"}},null,null,null,{"$f":"IFERROR(J96+N94,\"\")","v":""}]
["F"]
["F","OBSERVAÇÕES:"]
["F","Os pagamentos somente poderão ser efetuados mediante medição e atesto pelos técnicos da Secretaria da Educação. "]

{"sheet":"Composição BDI","index":4,"n_rows":45,"n_cols":9,"rows_kept":45,"cut":false,"hidden":false,"merged":[[18,5,18,8],[17,0,17,3],[16,0,16,3],[44,0,44,3],[42,0,42,3],[43,0,43,3],[18,0,18,3],[36,0,36,3],[39,0,39,3],[38,0,38,3],[40,0,40,3],[29,0,29,2],[32,0,32,3],[33,0,33,3],[34,0,34,3],[35,0,35,3],[0,0,0,3],[2,0,2,3],[3,0,3,3],[1,0,1,3],[5,0,5,3],[4,0,4,3],[12,0,12,3],[13,0,13,3],[14,0,14,3],[15,0,15,3],[6,0,6,3],[8,0,8,3],[7,0,7,3],[9,0,9,3],[11,0,11,3],[10,0,10,3]]}
[]
[]
["UNIDADE ESCOLAR"]
[{"$f":"Orçamento!$O$4","v":"COLÉGIO ESTADUAL MARIA ASSUNÇÃO DE AZEVEDO"}]
[]
["OBRA"]
[{"$f":"Orçamento!$O$7","v":"REFORMA E AMPLIAÇÃO"}]
[]
["ENDEREÇO"]
[{"$f":"Orçamento!$R$10","v":" RUA REINALDO JOSE DE SOUZA 400 Nº 400 , CENTRO , CEP:76340-000"}]
[]
["CIDADE"]
[{"$f":"Orçamento!$X$7","v":"CARMO DO RIO VERDE"}]
[]
["CRE"]
[{"$f":"Orçamento!$O$10","v":"CRE-CERES"}]
[]
["DETALHAMENTO DA COMPOSIÇÃO DE BDI"]
["COMPOSIÇÃO BDI PARA OBRAS CIVIS",null,null,null,null,"BDI CONSTRUÇÃO E REFORMA"]
["DESCRIÇÃO","COEF.","TAXA % (a.m)","% no preço de venda",null,"Situação","1º Quartil","Médio","3º Quartil"]
["1) COFINS",1,0.03,{"$f":"C21","v":0.03},null,{"$f":"IF(OR(C21<G21,C21>I21),\"FORA DO INTERVALO\",\"OK\")","v":"OK"},0.03,0.03,0.03]
["2) PIS",1,6.4999999999999997E-3,{"$f":"C22","v":6.4999999999999997E-3},null,{"$f":"IF(OR(C22<G22,C22>I22),\"FORA DO INTERVALO\",\"OK\")","v":"OK"},6.4999999999999997E-3,6.4999999999999997E-3,6.4999999999999997E-3]
["3) ISSQN",1,1.4999999999999999E-2,{"$f":"C23*B23","v":1.4999999999999999E-2},null,"FORA DO INTERVALO",0.02,3.5000000000000003E-2,0.05]
["4) CPRB",1,4.4999999999999998E-2,{"$f":"C24","v":4.4999999999999998E-2},null,"OK",4.4999999999999998E-2,4.4999999999999998E-2,4.4999999999999998E-2]
["5) Administração Central",1,0.05,0.05,null,"OK",0.03,0.04,5.5E-2]
["6) Despesas Financeiras",1,5.5999999999999999E-3,5.5999999999999999E-3,null,"FORA DO INTERVALO",5.8999999999999999E-3,1.23E-2,1.3899999999999999E-2]
["7) Seguros + Garantias",1,1.1999999999999999E-3,1.1999999999999999E-3,null,"FORA DO INTERVALO",8.0000000000000002E-3,8.0000000000000002E-3,0.01]
["8) Risco",1,9.7000000000000003E-3,9.7000000000000003E-3,null,"OK",9.7000000000000003E-3,1.2699999999999999E-2,1.2699999999999999E-2]
["9) Lucro",1,6.9900000000000004E-2,6.9900000000000004E-2,null,"OK",6.1600000000000002E-2,7.3999999999999996E-2,8.9599999999999999E-2]
["BDI - FINAL",null,null,{"$f":"(((1+D25+D27+D28)*(1+D26)*(1+D29))/(1-(D21+D22+D23+D24))-1)","v":0.2633239941294967},null,{"$f":"IF(OR(D30<G30,D30>I30),\"FORA DO INTERVALO\",\"OK\")","v":"FORA DO INTERVALO"},0.2034,0.22120000000000001,0.25]
[]
["Notas:"]
["(1) e (2) Alíquota definida por lei."]
["(3) Alíquota e base de cálculo definidas pela legislação municipal."]
["(4) Alíquota definida pelas leis 12.546/11, 12844/13 e 13.161/15 (CPRB – contribuição previdenciária sobre a receita bruta)."]
["(5) Valores definidos a partir dos limites no Acórdão nº 2.622/2013 - TCU – Plenário. Valores entre o 1º e 3º quartis."]
["(6) Valor calculado pela expressão matemática do acórdão 2.369/2011 – TCU – Plenário e disponibilizado pela AGETOP em dezembro de 2018. (Foi utilizado para o cálculo a média da Taxa SELIC no período de 11/2017 a 10/2018)"]
[]
["(7) Valores definidos pela AGETOP a partir dos limites no Acórdão nº 2.622/2013 - TCU – Plenário. Valores médios. \n\nObservação da AGETOP: (Seguros contra erros de execução, incêndio e explosão, danos da natureza (vendaval, destelhamento, alagamento, inundação, desmoronamento, geadas etc.), emprego de material defeituoso ou inadequado, roubo e/ou furto qualificado, quebra de equipamentos, desmoronamento de estrutura, nas modalidades de Obras Civis em Construção (OCC); Instalação e Montagem (IM); e Obras Civis em Construção e Instalação e Montagem (OCC/IM). Bem como coberturas adicionais para ampliação dessas coberturas básicas, como: cobertura de responsabilidade civil geral, cobertura de responsabilidade civil cruzada, cobertura de despesas extraordinárias, cobertura de tumultos, cobertura de desentulho do local, cobertura de riscos do fabricante, dentre outras, incluindo o seguro de vida em grupo regido pela convenção coletiva dos trabalhadores na indústria da construção civil). A partir de 24/02/2015 por intermédio da Portaria 449/2015 a Presidência da AGETOP, na pessoa do Senhor Jayme Eduardo Rincon, determinou a exclusão dos valores referentes aos Seguros de Risco de Engenharia e Responsabilidade Civil do Profissional na composição do cálculo do B.D.I.."]
["(8) Valores definidos a partir dos limites no Acórdão nº 2.622/2013 - TCU – Plenário. Valores entre 1º e 3° quartis."]
["(9) Valores definidos a partir dos limites definidos no Acórdão nº 2.622/2013 - TCU – Plenário. Valores adotados e praticados no mercado ( “ ex ante ” ) ou aqueles entre os 1º e 3º quartis."]
[]
["(*) A fórmula para estipulação da taxa de BDI estimado adotado é a mesma que foi aplicada para a obtenção das tabelas contidas no Acórdão n. 2.622/2013 – TCUPlenário"]
[]
["Obs.: Para obras com valores superiores a R$ 20.000.000,00 sugere-se recalcular o BDI, dimensionando as taxas de administração central e lucro para patamares inferiores ao estipulado acima."]

{"sheet":"Relatório CENTRAL","index":5,"n_rows":40,"n_cols":5,"rows_kept":40,"cut":false,"hidden":false,"merged":[[9,0,11,0],[0,1,0,4],[6,3,6,4],[9,3,9,4],[1,1,1,4],[2,1,2,2],[2,3,2,4],[3,1,3,2],[3,3,3,4],[4,1,4,4],[5,1,5,2],[5,3,5,4],[6,1,6,2],[7,1,7,4],[8,1,8,2],[8,3,8,4],[9,1,9,2],[10,1,10,4],[11,1,11,4],[39,1,39,2]]}
[]
[]
[null,"UNIDADE ESCOLAR",null,"CIDADE"]
[null,{"$f":"Orçamento!$O$4","v":"COLÉGIO ESTADUAL MARIA ASSUNÇÃO DE AZEVEDO"},null,{"$f":"Orçamento!$X$7","v":"CARMO DO RIO VERDE"}]
[]
[null,"OBRA",null,"CRE"]
[null,{"$f":"Orçamento!$O$7","v":"REFORMA E AMPLIAÇÃO"},null,{"$f":"Orçamento!$O$10","v":"CRE-CERES"}]
[]
[null,"ENDEREÇO",null,"DATA"]
["FILTRO",{"$f":"Orçamento!$R$10","v":" RUA REINALDO JOSE DE SOUZA 400 Nº 400 , CENTRO , CEP:76340-000"},null,{"$f":"Orçamento!$S$7","v":"2020-07-07"}]
[]
[null,"RELATÓRIO CENTRAL"]
["↓","CÓDIGO","ETAPA","PREÇO  (R$) C/ BDI","PARTIC  ( % )"]
[{"$f":"IF(D14>0,\"F\",\"\")","v":""},{"$f":"Orçamento!O460","v":"a."},{"$f":"Orçamento!P460","v":"SERVIÇOS PRELIMINARES"},{"$f":"Orçamento!X460","v":0},{"$f":"Orçamento!AA460","v":0}]
[{"$f":"IF(D15>0,\"F\",\"\")","v":""},{"$f":"Orçamento!O461","v":"b."},{"$f":"Orçamento!P461","v":"TRANSPORTES"},{"$f":"Orçamento!X461","v":0},{"$f":"Orçamento!AA461","v":0}]
["",{"$f":"Orçamento!O462","v":"c."},{"$f":"Orçamento!P462","v":"SERVIÇO EM TERRA"},{"$f":"Orçamento!X462","v":0},{"$f":"Orçamento!AA462","v":0}]
["",{"$f":"Orçamento!O463","v":"d."},{"$f":"Orçamento!P463","v":"FUNDAÇÕES E SONDAGENS"},{"$f":"Orçamento!X463","v":0},{"$f":"Orçamento!AA463","v":0}]
["",{"$f":"Orçamento!O464","v":"e."},{"$f":"Orçamento!P464","v":"ESTRUTURA"},{"$f":"Orçamento!X464","v":0},{"$f":"Orçamento!AA464","v":0}]
["",{"$f":"Orçamento!O465","v":"f."},{"$f":"Orçamento!P465","v":"INSTALAÇÕES ELÉTRICAS"},{"$f":"Orçamento!X465","v":0},{"$f":"Orçamento!AA465","v":0}]
["",{"$f":"Orçamento!O466","v":"g."},{"$f":"Orçamento!P466","v":"INSTALAÇÕES HIDROSSANITÁRIAS"},{"$f":"Orçamento!X466","v":0},{"$f":"Orçamento!AA466","v":0}]
["",{"$f":"Orçamento!O467","v":"h"},"INSTALAÇÕES ESPECIAIS",{"$f":"Orçamento!X467","v":0},{"$f":"Orçamento!AA467","v":0}]
["",{"$f":"Orçamento!O468","v":"i."},"ALVENARIAS E DIVISÓRIAS",{"$f":"Orçamento!X468","v":0},{"$f":"Orçamento!AA468","v":0}]
["",{"$f":"Orçamento!O469","v":"j."},"ALVENARIA AUTO-PORTANTE",{"$f":"Orçamento!X469","v":0},{"$f":"Orçamento!AA469","v":0}]
["",{"$f":"Orçamento!O470","v":"k."},"IMPERMEABILIZAÇÃO",{"$f":"Orçamento!X470","v":0},{"$f":"Orçamento!AA470","v":0}]
["",{"$f":"Orçamento!O471","v":"l."},"ISOLAMENTO TÉRMICO E ACÚSTICO",{"$f":"Orçamento!X471","v":0},{"$f":"Orçamento!AA471","v":0}]
["",{"$f":"Orçamento!O472","v":"m."},"ESTRUTURA DE MADEIRA",{"$f":"Orçamento!X472","v":0},{"$f":"Orçamento!AA472","v":0}]
["",{"$f":"Orçamento!O473","v":"n."},"ESTRUTURAS METÁLICAS",{"$f":"Orçamento!X473","v":0},{"$f":"Orçamento!AA473","v":0}]
["",{"$f":"Orçamento!O474","v":"o."},"COBERTURAS",{"$f":"Orçamento!X474","v":0},{"$f":"Orçamento!AA474","v":0}]
["",{"$f":"Orçamento!O475","v":"p."},"ESQUADRIAS DE MADEIRA",{"$f":"Orçamento!X475","v":0},{"$f":"Orçamento!AA475","v":0}]
["",{"$f":"Orçamento!O476","v":"q."},{"$f":"Orçamento!P476","v":"ESQUADRIAS METÁLICAS"},{"$f":"Orçamento!X476","v":0},{"$f":"Orçamento!AA476","v":0}]
["",{"$f":"Orçamento!O477","v":"r."},{"$f":"Orçamento!P477","v":"VIDROS"},{"$f":"Orçamento!X477","v":0},{"$f":"Orçamento!AA477","v":0}]
["",{"$f":"Orçamento!O478","v":"s."},{"$f":"Orçamento!P478","v":"REVESTIMENTO DE PAREDE"},{"$f":"Orçamento!X478","v":0},{"$f":"Orçamento!AA478","v":0}]
["",{"$f":"Orçamento!O479","v":"t."},{"$f":"Orçamento!P479","v":"FORROS"},{"$f":"Orçamento!X479","v":0},{"$f":"Orçamento!AA479","v":0}]
["",{"$f":"Orçamento!O480","v":"u."},{"$f":"Orçamento!P480","v":"REVESTIMENTO DE PISO"},{"$f":"Orçamento!X480","v":0},{"$f":"Orçamento!AA480","v":0}]
["",{"$f":"Orçamento!O481","v":"v."},{"$f":"Orçamento!P481","v":"FERRAGENS"},{"$f":"Orçamento!X481","v":0},{"$f":"Orçamento!AA481","v":0}]
["",{"$f":"Orçamento!O482","v":"w."},{"$f":"Orçamento!P482","v":"MARCENARIA"},{"$f":"Orçamento!X482","v":0},{"$f":"Orçamento!AA482","v":0}]
["",{"$f":"Orçamento!O483","v":"x."},{"$f":"Orçamento!P483","v":"ADMINISTRAÇÃO"},{"$f":"Orçamento!X483","v":0},{"$f":"Orçamento!AA483","v":0}]
["",{"$f":"Orçamento!O484","v":"y."},{"$f":"Orçamento!P484","v":"PINTURA"},{"$f":"Orçamento!X484","v":0},{"$f":"Orçamento!AA484","v":0}]
["",{"$f":"Orçamento!O485","v":"z."},{"$f":"Orçamento!P485","v":"DIVERSOS"},{"$f":"Orçamento!X485","v":0},{"$f":"Orçamento!AA485","v":0}]
["F","TOTAL GERAL DO ORÇAMENTO (R$) C/BDI",null,{"$f":"SUM(D14:D39)","v":0},{"$f":"SUM(E14:E39)","v":0}]

{"sheet":"Parc Maior Relev","index":6,"n_rows":33,"n_cols":7,"rows_kept":33,"cut":false,"hidden":false,"merged":[[0,1,0,6],[11,1,11,6],[1,1,1,6],[2,1,2,3],[2,4,2,6],[3,1,3,3],[3,4,3,6],[4,1,4,6],[5,1,5,3],[5,4,5,6],[9,1,9,3],[9,4,9,6],[10,1,10,6],[6,1,6,3],[6,4,6,6],[7,1,7,6],[8,1,8,3],[8,4,8,6],[33,3,33,7],[31,1,31,6]]}
[]
[]
[null,"UNIDADE ESCOLAR",null,null,"CÓDIGO INEP"]
[null,{"$f":"Orçamento!$O$4","v":"COLÉGIO ESTADUAL MARIA ASSUNÇÃO DE AZEVEDO"},null,null,{"$f":"Orçamento!$X$4","v":52015041}]
[]
[null,"OBRA",null,null,"CIDADE"]
[null,{"$f":"Orçamento!$O$7","v":"REFORMA E AMPLIAÇÃO"},null,null,{"$f":"Orçamento!$X$7","v":"CARMO DO RIO VERDE"}]
[]
[null,"CRE",null,null,"ÁREA TOTAL CONSTRUÍDA (M²)"]
[null,{"$f":"Orçamento!$O$10","v":"CRE-CERES"},null,null,{"$f":"Orçamento!$X$13","v":2719.4500000000003}]
[]
["FILTRO","PARCELA DE MAIOR RELEVÂNCIA"]
[{"$f":"IF(G14>0,\"F\",\"\")","v":""},"CÓDIGO","SERVIÇO","DESCRIÇÃO","UNID","QUANT","PARC. MAIOR RELEV (100%)"]
[{"$f":"IF(G14>0,\"F\",\"\")","v":""},"f.","INSTALAÇÕES ELÉTRICAS","SUBESTAÇÃO","KVA",{"$f":"SUMIF(Orçamento!$R$437:$R$441,'Parc Maior Relev'!D14,Orçamento!$T$437:$T$441)","v":0},{"$f":"F14","v":0}]
[{"$f":"IF(SUM(G16:G30)>0,\"F\",\"\")","v":"F"},"CÓDIGO","SERVIÇO","DESCRIÇÃO","UNID","QUANT","PARC. MAIOR RELEV (50%)"]
[{"$f":"IF(G16>0,\"F\",\"\")","v":""},"e.","ESTRUTURA","CONCRETO","M3",{"$f":"SUMIF(Orçamento!$R$437:$R$441,'Parc Maior Relev'!D16,Orçamento!$T$437:$T$441)","v":0},{"$f":"F16*0.5","v":0}]
[{"$f":"IF(G17>0,\"F\",\"\")","v":""},"f.","INSTALAÇÕES ELÉTRICAS","INSTALAÇÕES ELÉTRICAS","KVA",{"$f":"SUMIF(Orçamento!$R$437:$R$441,'Parc Maior Relev'!D17,Orçamento!$T$437:$T$441)","v":0},{"$f":"F17*0.5","v":0}]
[{"$f":"IF(G18>0,\"F\",\"\")","v":""},"o.","COBERTURAS","COBERTURA CERÂMICA","M2",{"$f":"SUMIF(Orçamento!$R$437:$R$441,'Parc Maior Relev'!D18,Orçamento!$T$437:$T$441)","v":0},0]
["","o.","COBERTURAS","COBERTURA COM TELHA METÁLICA","M2",{"$f":"SUMIF(Orçamento!$R$437:$R$441,'Parc Maior Relev'!D19,Orçamento!$T$437:$T$441)","v":0},0]
["","s.","REVESTIMENTO DE PAREDE","CHAPISCO","M2",{"$f":"SUMIF(Orçamento!$R$437:$R$441,'Parc Maior Relev'!D20,Orçamento!$T$437:$T$441)","v":0},0]
["","s.","REVESTIMENTO DE PAREDE","REBOCO","M2",{"$f":"SUMIF(Orçamento!$R$437:$R$441,'Parc Maior Relev'!D21,Orçamento!$T$437:$T$441)","v":0},0]
["F","s.","REVESTIMENTO DE PAREDE","REVESTIMENTO CERÂMICO","M2",214.99,107.495]
["","t.","FORROS","FORRO DE GESSO","M2",{"$f":"SUMIF(Orçamento!$R$437:$R$441,'Parc Maior Relev'!D23,Orçamento!$T$437:$T$441)","v":0},0]
["","t.","FORROS","FORRO DE PVC","M2",{"$f":"SUMIF(Orçamento!$R$437:$R$441,'Parc Maior Relev'!D24,Orçamento!$T$437:$T$441)","v":0},0]
["","t.","FORROS","FORRO DE GESSO ACARTONADO","M2",{"$f":"SUMIF(Orçamento!$R$437:$R$441,'Parc Maior Relev'!D25,Orçamento!$T$437:$T$441)","v":0},0]
["","u.","REVESTIMENTO DE PISO","PISO DE GRANITINA","M2",{"$f":"SUMIF(Orçamento!$R$437:$R$441,'Parc Maior Relev'!D26,Orçamento!$T$437:$T$441)","v":0},0]
["","u.","REVESTIMENTO DE PISO","PISO LAMINADO","M2",{"$f":"SUMIF(Orçamento!$R$437:$R$441,'Parc Maior Relev'!D27,Orçamento!$T$437:$T$441)","v":0},0]
["F","u.","REVESTIMENTO DE PISO","PISO DE CONCRETO DESEMPENADO","M2",369.12,184.56]
["","u.","REVESTIMENTO DE PISO","PISO CERÂMICO","M2",{"$f":"SUMIF(Orçamento!$R$437:$R$441,'Parc Maior Relev'!D29,Orçamento!$T$437:$T$441)","v":0},0]
["","y.","PINTURA","PINTURA","M2",{"$f":"SUMIF(Orçamento!$R$437:$R$441,'Parc Maior Relev'!D30,Orçamento!$T$437:$T$441)","v":0},0]
["F"]
["F","(*) Para os fins do inciso I dp § 1º do Art. 30 da Lei Federal 8.666/93, são consideradas parcelas de maior relevância técnica as execuções apresentadas"]
["F"]

{"sheet":"Composições","index":7,"n_rows":192,"n_cols":10,"rows_kept":192,"cut":false,"hidden":false,"merged":[[15,0,15,9],[13,0,13,2],[13,3,13,6],[1,0,1,9],[3,7,3,9],[4,7,4,9],[6,7,6,9],[7,7,7,9],[6,0,6,6],[10,8,10,9],[13,8,13,9],[14,0,14,9],[8,0,8,9],[5,0,5,9],[2,0,2,9],[0,0,0,8],[10,0,10,2],[10,3,10,6],[11,0,11,9],[12,0,12,2],[12,3,12,6],[12,7,12,8],[7,0,7,6],[9,0,9,2],[9,3,9,6],[9,7,9,8],[3,0,3,6],[4,0,4,6],[16,5,17,5],[16,6,16,7],[16,8,16,9],[21,1,21,7],[36,1,36,7],[16,0,17,0],[16,1,17,1],[16,2,17,2],[16,3,17,3],[16,4,17,4],[38,5,39,5],[38,6,38,7],[38,8,38,9],[43,1,43,7],[46,1,46,7],[38,0,39,0],[38,1,39,1],[38,2,39,2],[38,3,39,3],[38,4,39,4],[48,5,49,5],[48,6,48,7],[48,8,48,9],[53,1,53,7],[56,1,56,7],[48,0,49,0],[48,1,49,1],[48,2,49,2],[48,3,49,3],[48,4,49,4],[58,5,59,5],[58,6,58,7],[58,8,58,9],[63,1,63,7],[65,1,65,7],[58,0,59,0],[58,1,59,1],[58,2,59,2],[58,3,59,3],[58,4,59,4],[67,5,68,5],[67,6,67,7],[67,8,67,9],[72,1,72,7],[74,1,74,7],[67,0,68,0],[67,1,68,1],[67,2,68,2],[67,3,68,3],[67,4,68,4],[76,5,77,5],[76,6,76,7],[76,8,76,9],[81,1,81,7],[83,1,83,7],[76,0,77,0],[76,1,77,1],[76,2,77,2],[76,3,77,3],[76,4,77,4],[85,5,86,5],[85,6,85,7],[85,8,85,9],[90,1,90,7],[92,1,92,7],[85,0,86,0],[85,1,86,1],[85,2,86,2],[85,3,86,3],[85,4,86,4],[94,5,95,5],[94,6,94,7],[94,8,94,9],[99,1,99,7],[101,1,101,7],[94,0,95,0],[94,1,95,1],[94,2,95,2],[94,3,95,3],[94,4,95,4],[103,5,104,5],[103,6,103,7],[103,8,103,9],[108,1,108,7],[111,1,111,7],[103,0,104,0],[103,1,104,1],[103,2,104,2],[103,3,104,3],[103,4,104,4],[113,5,114,5],[113,6,113,7],[113,8,113,9],[118,1,118,7],[121,1,121,7],[113,0,114,0],[113,1,114,1],[113,2,114,2],[113,3,114,3],[113,4,114,4],[123,5,124,5],[123,6,123,7],[123,8,123,9],[127,1,127,7],[131,1,131,7],[123,0,124,0],[123,1,124,1],[123,2,124,2],[123,3,124,3],[123,4,124,4],[133,5,134,5],[133,6,133,7],[133,8,133,9],[137,1,137,7],[141,1,141,7],[133,0,134,0],[133,1,134,1],[133,2,134,2],[133,3,134,3],[133,4,134,4],[143,5,144,5],[143,6,143,7],[143,8,143,9],[147,1,147,7],[148,1,148,7],[143,0,144,0],[143,1,144,1],[143,2,144,2],[143,3,144,3],[143,4,144,4],[150,5,151,5],[150,6,150,7],[150,8,150,9],[154,1,154,7],[161,1,161,7],[150,0,151,0],[150,1,151,1],[150,2,151,2],[150,3,151,3],[150,4,151,4],[163,5,164,5],[163,6,163,7],[163,8,163,9],[168,1,168,7],[171,1,171,7],[163,0,164,0],[163,1,164,1],[163,2,164,2],[163,3,164,3],[163,4,164,4],[173,5,174,5],[173,6,173,7],[173,8,173,9],[177,1,177,7],[181,1,181,7],[173,0,174,0],[173,1,174,1],[173,2,174,2],[173,3,174,3],[173,4,174,4],[183,5,184,5],[183,6,183,7],[183,8,183,9],[187,1,187,7],[191,1,191,7],[183,0,184,0],[183,1,184,1],[183,2,184,2],[183,3,184,3],[183,4,184,4]]}
[]
[]
[]
["UNIDADE ESCOLAR",null,null,null,null,null,null,"CÓDIGO INEP"]
[{"$f":"Orçamento!$O$4","v":"COLÉGIO ESTADUAL MARIA ASSUNÇÃO DE AZEVEDO"},null,null,null,null,null,null,{"$f":"Orçamento!$X$4","v":52015041}]
[]
["OBRA",null,null,null,null,null,null,"CIDADE"]
[{"$f":"Orçamento!$O$7","v":"REFORMA E AMPLIAÇÃO"},null,null,null,null,null,null,{"$f":"Orçamento!$X$7","v":"CARMO DO RIO VERDE"}]
[]
["CRE",null,null,"ENDEREÇO",null,null,null,"REFERÊNCIA AGETOP"]
[{"$f":"Orçamento!$O$10","v":"CRE-CERES"},null,null,{"$f":"Orçamento!$R$10","v":" RUA REINALDO JOSE DE SOUZA 400 Nº 400 , CENTRO , CEP:76340-000"},null,null,null,{"$f":"Orçamento!$S$10","v":"ABR/19"},{"$f":"Orçamento!$T$10","v":"DESONERADA"}]
[]
["DATA",null,null,"ÁREA TOTAL CONSTRUÍDA (M²)",null,null,null,"REFERÊNCIA SINAPI"]
[{"$f":"Orçamento!$S$7","v":"2020-07-07"},null,null,{"$f":"Orçamento!$X$13","v":2719.4500000000003},null,null,null,{"$f":"Orçamento!$X$10","v":"ABR/20"},{"$f":"Orçamento!$Y$10","v":"DESONERADA"}]
[]
["COMPOSIÇÕES DE CUSTOS UNITÁRIOS - SEE-GO"]
[84,"FONTE","CÓDIGO","DESCRIÇÃO","UNIDADE","COEFIC.","CUSTO UNITÁRIO",null,"CUSTO  TOTAL (A) + (B) + (C) + (D) + (E)"]
[null,null,null,null,null,null,"DESONERADO","NÃO DESONER.","DESONERADO","NÃO DESONER."]
[null,"COMPOSIÇÃO","COMP 084_SEE","GUARDA-CORPO COM CORRIMÃO - SEDUC","M",null,null,null,206.14000000000001,211.22000000000003]
[null,"AGETOP_I",25,"OFICIAL \"B\"","h     ",1.1000000000000001,13.95,16.16,15.35,17.78]
[null,"AGETOP_I",8,"AJUDANTE","h     ",1.1000000000000001,8.75,10.14,9.6300000000000008,11.15]
[null,"MÃO DE OBRA (B) - TOTAL",null,null,null,null,null,null,24.98,28.93]
[null,"AGETOP_I",2376,"TUBO INDUSTRIAL 2\" CHAPA 13 ","Kg",7.7778,5.23,5.23,40.68,40.68]
[null,"AGETOP_I",2504,"TUBO INDUSTRIAL D=25 MM CHAPA 13 ","Kg",4.6319999999999997,5.07,5.07,23.48,23.48]
[null,"AGETOP_I",2377,"TUBO INDUSTRIAL 40X40 CH.13","Kg",6.3419999999999996,5.07,5.07,32.15,32.15]
[null,"AGETOP_I",2421,"TUBO INDUSTRIAL 1.1/2\" CHAPA 13 ","Kg",1.4862,5.07,5.07,7.54,7.54]
[null,"AGETOP_I",2417,"MASSA PLASTICA","Kg",0.2041,10.58,10.58,2.16,2.16]
[null,"AGETOP_I",2246,"ELETRODO 2.5 OK","Kg",0.11459999999999999,8.6999999999999993,8.6999999999999993,1,1]
[null,"AGETOP_I",1672,"LIXA PARA FERRO ( NÚMERO 100 )","un",0.25509999999999999,2.12,2.12,0.54,0.54]
[null,"AGETOP_I",1264,"DISCO DE DESBASTE 7/8\" P/ CONC./FERRO (1/4\" X 7\")","un",5.0999999999999997E-2,7,7,0.36,0.36]
[null,"AGETOP_I",1334,"DISCO DE CORTE DIAM. 5/8\"- 10\"","un",0.373,5.5,5.5,2.0499999999999998,2.0499999999999998]
[null,"AGETOP_I",2902,"FABRICAÇÃO / MONTAGEM","un",1,50.44,50.44,50.44,50.44]
[null,"AGETOP_I",2150,"CHAPA DE FERRO DOBRADA No.13","Kg",0.43519999999999998,5.28,5.28,2.2999999999999998,2.2999999999999998]
[null,"AGETOP_I",2719,"CHAPA PERFILADA 3/16\"","Kg",1.0979999999999999,5.04,5.04,5.53,5.53]
[null,"AGETOP_I",2436,"ACO CA-25 - 6,3 MM (1/4\") - BARRA LISA A-36","Kg",0.38124999999999998,5.13,5.13,1.96,1.96]
[null,"AGETOP",261602,"PINT.ESMALTE/ESQUAD.FERRO C/FUNDO ANTICOR.","m2    ",0.78,14.07,15.51,10.97,12.1]
[null,"MATERIAL (C) - TOTAL",null,null,null,null,null,null,181.16000000000003,182.29000000000002]
[]
[382,"FONTE","CÓDIGO","DESCRIÇÃO","UNIDADE","COEFIC.","CUSTO UNITÁRIO",null,"CUSTO  TOTAL (A) + (B) + (C) + (D) + (E)"]
[null,null,null,null,null,null,"DESONERADO","NÃO DESONER.","DESONERADO","NÃO DESONER."]
[null,"COMPOSIÇÃO","COMP 382_SEE","TE DE REDUCAO DE FERRO GALVANIZADO, COM ROSCA BSP, DE 3/4\" X 1/2\"","UN ",null,null,null,24.25,26.43]
[null,"AGETOP_I",8,"AJUDANTE","h     ",0.6,8.75,10.14,5.25,6.08]
[null,"AGETOP_I",11,"ENCANADOR","h     ",0.61050000000000004,13.95,16.16,8.52,9.8699999999999992]
[null,"MÃO DE OBRA (B) - TOTAL",null,null,null,null,null,null,13.77,15.95]
[null,"SINAPI_I",3146,"FITA VEDA ROSCA EM ROLOS DE 18 MM X 10 M (L X C)","UN    ",0.12075471698113208,3.4,3.4,0.41,0.41]
[null,"SINAPI_I",6302,"TE DE REDUCAO DE FERRO GALVANIZADO, COM ROSCA BSP, DE 3/4\" X 1/2\"","UN    ",1,10.07,10.07,10.07,10.07]
[null,"MATERIAL (C) - TOTAL",null,null,null,null,null,null,10.48,10.48]
[]
[383,"FONTE","CÓDIGO","DESCRIÇÃO","UNIDADE","COEFIC.","CUSTO UNITÁRIO",null,"CUSTO  TOTAL (A) + (B) + (C) + (D) + (E)"]
[null,null,null,null,null,null,"DESONERADO","NÃO DESONER.","DESONERADO","NÃO DESONER."]
[null,"COMPOSIÇÃO","COMP 383_SEE","BUCHA DE REDUCAO DE FERRO GALVANIZADO, COM ROSCA BSP, DE 1/2\" X 1/4\"","UN ",null,null,null,7.68,8.26]
[null,"AGETOP_I",8,"AJUDANTE","h     ",0.16,8.75,10.14,1.4,1.62]
[null,"AGETOP_I",11,"ENCANADOR","h     ",0.16,13.95,16.16,2.23,2.59]
[null,"MÃO DE OBRA (B) - TOTAL",null,null,null,null,null,null,3.63,4.21]
[null,"AGETOP_I","H689","FITA VEDAROSCA 12 MM","m",1.2,0.28000000000000003,0.28000000000000003,0.34,0.34]
[null,"SINAPI_I",770,"BUCHA DE REDUCAO DE FERRO GALVANIZADO, COM ROSCA BSP, DE 1/2\" X 1/4\"","UN    ",1,3.71,3.71,3.71,3.71]
[null,"MATERIAL (C) - TOTAL",null,null,null,null,null,null,4.05,4.05]
[]
[212,"FONTE","CÓDIGO","DESCRIÇÃO","UNIDADE","COEFIC.","CUSTO UNITÁRIO",null,"CUSTO  TOTAL (A) + (B) + (C) + (D) + (E)"]
[null,null,null,null,null,null,"DESONERADO","NÃO DESONER.","DESONERADO","NÃO DESONER."]
[null,"COMPOSIÇÃO","COMP 212_SEE","NIPLE DE REDUÇÃO 1/2\" X 1/4\" BSP","UN ",null,null,null,9.68,10.26]
[null,"AGETOP_I",8,"AJUDANTE","h     ",0.16,8.75,10.14,1.4,1.62]
[null,"AGETOP_I",11,"ENCANADOR","h     ",0.16,13.95,16.16,2.23,2.59]
[null,"MÃO DE OBRA (B) - TOTAL",null,null,null,null,null,null,3.63,4.21]
[null,"COTAÇÃO","COT 103_SEE","NIPLE DE REDUÇÃO 1/2\" X 1/4\" BSP","UN",1,6.0533333333333337,6.0533333333333337,6.05,6.05]
[null,"MATERIAL (C) - TOTAL",null,null,null,null,null,null,6.05,6.05]
[]
[213,"FONTE","CÓDIGO","DESCRIÇÃO","UNIDADE","COEFIC.","CUSTO UNITÁRIO",null,"CUSTO  TOTAL (A) + (B) + (C) + (D) + (E)"]
[null,null,null,null,null,null,"DESONERADO","NÃO DESONER.","DESONERADO","NÃO DESONER."]
[null,"COMPOSIÇÃO","COMP 213_SEE","NIPLE DE REDUÇÃO 3/4\" X 1/2\" BSP","UN ",null,null,null,13.34,13.920000000000002]
[null,"AGETOP_I",8,"AJUDANTE","h     ",0.16,8.75,10.14,1.4,1.62]
[null,"AGETOP_I",11,"ENCANADOR","h     ",0.16,13.95,16.16,2.23,2.59]
[null,"MÃO DE OBRA (B) - TOTAL",null,null,null,null,null,null,3.63,4.21]
[null,"COTAÇÃO","COT 104_SEE","NIPLE DE REDUÇÃO 3/4\" X 1/2\" BSP","UN",1,9.7099999999999991,9.7099999999999991,9.7100000000000009,9.7100000000000009]
[null,"MATERIAL (C) - TOTAL",null,null,null,null,null,null,9.7100000000000009,9.7100000000000009]
[]
[237,"FONTE","CÓDIGO","DESCRIÇÃO","UNIDADE","COEFIC.","CUSTO UNITÁRIO",null,"CUSTO  TOTAL (A) + (B) + (C) + (D) + (E)"]
[null,null,null,null,null,null,"DESONERADO","NÃO DESONER.","DESONERADO","NÃO DESONER."]
[null,"COMPOSIÇÃO","COMP 237_SEE","FITA ANTICORROSIVA","M",null,null,null,11.16,11.879999999999999]
[null,"AGETOP_I",8,"AJUDANTE","h     ",0.2,8.75,10.14,1.75,2.0299999999999998]
[null,"AGETOP_I",12,"ELETRICISTA","h     ",0.2,13.95,16.16,2.79,3.23]
[null,"MÃO DE OBRA (B) - TOTAL",null,null,null,null,null,null,4.54,5.26]
[null,"SINAPI_I",39634,"FITA ADESIVA ANTICORROSIVA DE PVC FLEXIVEL, COR PRETA, PARA PROTECAO TUBULACAO, 50 MM X 30 M (L X C), E= *0,25* MM","M     ",1,6.62,6.62,6.62,6.62]
[null,"MATERIAL (C) - TOTAL",null,null,null,null,null,null,6.62,6.62]
[]
[542,"FONTE","CÓDIGO","DESCRIÇÃO","UNIDADE","COEFIC.","CUSTO UNITÁRIO",null,"CUSTO  TOTAL (A) + (B) + (C) + (D) + (E)"]
[null,null,null,null,null,null,"DESONERADO","NÃO DESONER.","DESONERADO","NÃO DESONER."]
[null,"COMPOSIÇÃO","COMP 542_SEE","VÁLVULA UGV 3/4\" (S) LATÃO","UN ",null,null,null,25.65,27.2]
[null,"AGETOP_I",8,"AJUDANTE","h     ",0.432,8.75,10.14,3.78,4.38]
[null,"AGETOP_I",11,"ENCANADOR","h     ",0.432,13.95,16.16,6.03,6.98]
[null,"MÃO DE OBRA (B) - TOTAL",null,null,null,null,null,null,9.81,11.36]
[null,"COTAÇÃO","COT 281_SEE","VÁLVULA UGV 3/4\" (S) LATÃO","UN ",1,15.836666666666666,15.836666666666666,15.84,15.84]
[null,"MATERIAL (C) - TOTAL",null,null,null,null,null,null,15.84,15.84]
[]
[543,"FONTE","CÓDIGO","DESCRIÇÃO","UNIDADE","COEFIC.","CUSTO UNITÁRIO",null,"CUSTO  TOTAL (A) + (B) + (C) + (D) + (E)"]
[null,null,null,null,null,null,"DESONERADO","NÃO DESONER.","DESONERADO","NÃO DESONER."]
[null,"COMPOSIÇÃO","COMP 543_SEE","VÁLVULA UGV 1/2\" (S) LATÃO","UN ",null,null,null,24.98,26.53]
[null,"AGETOP_I",8,"AJUDANTE","h     ",0.432,8.75,10.14,3.78,4.38]
[null,"AGETOP_I",11,"ENCANADOR","h     ",0.432,13.95,16.16,6.03,6.98]
[null,"MÃO DE OBRA (B) - TOTAL",null,null,null,null,null,null,9.81,11.36]
[null,"COTAÇÃO","COT 282_SEE","VÁLVULA UGV 1/2\" (S) LATÃO","UN ",1,15.166666666666666,15.166666666666666,15.17,15.17]
[null,"MATERIAL (C) - TOTAL",null,null,null,null,null,null,15.17,15.17]
[]
[211,"FONTE","CÓDIGO","DESCRIÇÃO","UNIDADE","COEFIC.","CUSTO UNITÁRIO",null,"CUSTO  TOTAL (A) + (B) + (C) + (D) + (E)"]
[null,null,null,null,null,null,"DESONERADO","NÃO DESONER.","DESONERADO","NÃO DESONER."]
[null,"COMPOSIÇÃO","COMP 211_SEE","REGULADOR DE 2º ESTÁGIO 5KG/H","UN ",null,null,null,86.72,90.86]
[null,"AGETOP_I",8,"AJUDANTE","h     ",1.1499999999999999,8.75,10.14,10.06,11.66]
[null,"AGETOP_I",11,"ENCANADOR","h     ",1.1499999999999999,13.95,16.16,16.04,18.579999999999998]
[null,"MÃO DE OBRA (B) - TOTAL",null,null,null,null,null,null,26.1,30.24]
[null,"COTAÇÃO","COT 102_SEE","REGULADOR DE 2º ESTÁGIO 5KG/H","UN",1,59.833333333333336,59.833333333333336,59.83,59.83]
[null,"AGETOP_I","H689","FITA VEDAROSCA 12 MM","m",2.82,0.28000000000000003,0.28000000000000003,0.79,0.79]
[null,"MATERIAL (C) - TOTAL",null,null,null,null,null,null,60.62,60.62]
[]
[210,"FONTE","CÓDIGO","DESCRIÇÃO","UNIDADE","COEFIC.","CUSTO UNITÁRIO",null,"CUSTO  TOTAL (A) + (B) + (C) + (D) + (E)"]
[null,null,null,null,null,null,"DESONERADO","NÃO DESONER.","DESONERADO","NÃO DESONER."]
[null,"COMPOSIÇÃO","COMP 210_SEE","REGULADOR DE 1º ESTÁGIO 60KG/H MODELO AP-40  COM MANÔMETRO","UN ",null,null,null,232.47,236.61]
[null,"AGETOP_I",8,"AJUDANTE","h     ",1.1499999999999999,8.75,10.14,10.06,11.66]
[null,"AGETOP_I",11,"ENCANADOR","h     ",1.1499999999999999,13.95,16.16,16.04,18.579999999999998]
[null,"MÃO DE OBRA (B) - TOTAL",null,null,null,null,null,null,26.1,30.24]
[null,"COTAÇÃO","COT 101_SEE","REGULADOR DE 1º ESTÁGIO 60KG/H MODELO AP-40  COM MANÔMETRO","UN",1,205.57666666666668,205.57666666666668,205.58,205.58]
[null,"AGETOP_I","H689","FITA VEDAROSCA 12 MM","m",2.82,0.28000000000000003,0.28000000000000003,0.79,0.79]
[null,"MATERIAL (C) - TOTAL",null,null,null,null,null,null,206.37,206.37]
[]
[235,"FONTE","CÓDIGO","DESCRIÇÃO","UNIDADE","COEFIC.","CUSTO UNITÁRIO",null,"CUSTO  TOTAL (A) + (B) + (C) + (D) + (E)"]
[null,null,null,null,null,null,"DESONERADO","NÃO DESONER.","DESONERADO","NÃO DESONER."]
[null,"COMPOSIÇÃO","COMP 235_SEE","PLACA DE SINALIZAÇÃO EM PVC COD 01 - (300X300) PROIBIDO FUMAR","UN ",null,null,null,25.319999999999997,25.439999999999998]
[null,"AGETOP_I",5,"SERVENTE","h     ",0.09,8.75,10.14,0.79,0.91]
[null,"MÃO DE OBRA (B) - TOTAL",null,null,null,null,null,null,0.79,0.91]
[null,"AGETOP_I",3070,"BUCHA DE NYLON S-6","un",2,0.04,0.04,0.08,0.08]
[null,"AGETOP_I",3393,"PARAFUSO P/BUCHA S-6","un",2,0.08,0.08,0.16,0.16]
[null,"SINAPI_I",37556,"PLACA DE SINALIZACAO DE SEGURANCA CONTRA INCENDIO, FOTOLUMINESCENTE, QUADRADA, *20 X 20* CM, EM PVC *2* MM ANTI-CHAMAS (SIMBOLOS, CORES E PICTOGRAMAS CONFORME NBR 13434)","UN    ",1,24.29,24.29,24.29,24.29]
[null,"MATERIAL (C) - TOTAL",null,null,null,null,null,null,24.529999999999998,24.529999999999998]
[]
[236,"FONTE","CÓDIGO","DESCRIÇÃO","UNIDADE","COEFIC.","CUSTO UNITÁRIO",null,"CUSTO  TOTAL (A) + (B) + (C) + (D) + (E)"]
[null,null,null,null,null,null,"DESONERADO","NÃO DESONER.","DESONERADO","NÃO DESONER."]
[null,"COMPOSIÇÃO","COMP 236_SEE","PLACA DE SINALIZAÇÃO EM PVC COD 06 - (300X300) PERIGO INFLAMÁVEL","UN ",null,null,null,25.319999999999997,25.439999999999998]
[null,"AGETOP_I",5,"SERVENTE","h     ",0.09,8.75,10.14,0.79,0.91]
[null,"MÃO DE OBRA (B) - TOTAL",null,null,null,null,null,null,0.79,0.91]
[null,"AGETOP_I",3070,"BUCHA DE NYLON S-6","un",2,0.04,0.04,0.08,0.08]
[null,"AGETOP_I",3393,"PARAFUSO P/BUCHA S-6","un",2,0.08,0.08,0.16,0.16]
[null,"SINAPI_I",37556,"PLACA DE SINALIZACAO DE SEGURANCA CONTRA INCENDIO, FOTOLUMINESCENTE, QUADRADA, *20 X 20* CM, EM PVC *2* MM ANTI-CHAMAS (SIMBOLOS, CORES E PICTOGRAMAS CONFORME NBR 13434)","UN    ",1,24.29,24.29,24.29,24.29]
[null,"MATERIAL (C) - TOTAL",null,null,null,null,null,null,24.529999999999998,24.529999999999998]
[]
[45,"FONTE","CÓDIGO","DESCRIÇÃO","UNIDADE","COEFIC.","CUSTO UNITÁRIO",null,"CUSTO  TOTAL (A) + (B) + (C) + (D) + (E)"]
[null,null,null,null,null,null,"DESONERADO","NÃO DESONER.","DESONERADO","NÃO DESONER."]
[null,"COMPOSIÇÃO","COMP 045_SEE","LAUDO DE ESTANQUEIDADE","UN ",null,null,null,936,1085.1199999999999]
[null,"AGETOP",250101,"ENGENHEIRO - (OBRAS CIVIS)","H     ",16,58.5,67.819999999999993,936,1085.1199999999999]
[null,"MÃO DE OBRA (B) - TOTAL",null,null,null,null,null,null,936,1085.1199999999999]
[null,"MATERIAL (C) - TOTAL",null,null,null,null,null,null,0,0]
[]
[277,"FONTE","CÓDIGO","DESCRIÇÃO","UNIDADE","COEFIC.","CUSTO UNITÁRIO",null,"CUSTO  TOTAL (A) + (B) + (C) + (D) + (E)"]
[null,null,null,null,null,null,"DESONERADO","NÃO DESONER.","DESONERADO","NÃO DESONER."]
[null,"COMPOSIÇÃO","COMP 277_SEE","MARCAÇÃO NO PISO - 1X1 M PARA EXTINTOR","M2",null,null,null,29.69,29.76]
[null,"AGETOP_I",5,"SERVENTE","h     ",3.3300000000000003E-2,8.75,10.14,0.28999999999999998,0.34]
[null,"MÃO DE OBRA (B) - TOTAL",null,null,null,null,null,null,0.28999999999999998,0.34]
[null,"SINAPI_I",5318,"SOLVENTE DILUENTE A BASE DE AGUARRAS","L     ",0.13,11.98,11.98,1.56,1.56]
[null,"SINAPI",5824,"CAMINHÃO TOCO, PBT 16.000 KG, CARGA ÚTIL MÁX. 10.685 KG, DIST. ENTRE EIXOS 4,8 M, POTÊNCIA 189 CV, INCLUSIVE CARROCERIA FIXA ABERTA DE MADEIRA P/ TRANSPORTE GERAL DE CARGA SECA, DIMEN. APROX. 2,5 X 7,00 X 0,50 M - CHP DIURNO. AF_06/2014","CHP",3.3E-3,115.5,118.69,0.38,0.39]
[null,"SINAPI_I",7343,"TINTA A BASE DE RESINA ACRILICA, PARA SINALIZACAO HORIZONTAL VIARIA (NBR 11862)","L     ",0.6,12.82,12.82,7.69,7.69]
[null,"SINAPI_I",7348,"TINTA ACRILICA PREMIUM PARA PISO","L     ",0.03,13.96,13.96,0.42,0.42]
[null,"SINAPI_I",25972,"MICROESFERAS DE VIDRO PARA SINALIZACAO HORIZONTAL VIARIA, TIPO I-B (PREMIX) - NBR 16184","KG    ",2.14,8.8800000000000008,8.8800000000000008,19,19]
[null,"SINAPI",95133,"MÁQUINA DEMARCADORA DE FAIXA DE TRÁFEGO À FRIO, AUTOPROPELIDA, POTÊNCIA 38 HP - CHP DIURNO. AF_07/2016","CHP",3.3E-3,105.93,109.48,0.35,0.36]
[null,"MATERIAL (C) - TOTAL",null,null,null,null,null,null,29.400000000000002,29.42]
[]
[28,"FONTE","CÓDIGO","DESCRIÇÃO","UNIDADE","COEFIC.","CUSTO UNITÁRIO",null,"CUSTO  TOTAL (A) + (B) + (C) + (D) + (E)"]
[null,null,null,null,null,null,"DESONERADO","NÃO DESONER.","DESONERADO","NÃO DESONER."]
[null,"COMPOSIÇÃO","COMP 028_SEE","ADAPTADOR PVC SOLDAVEL FLANGES LIVRES P/ CAIXA D' AGUA 85 MM X 3\"","UN ",null,null,null,167.41,167.72]
[null,"AGETOP_I",8,"AJUDANTE","h     ",0.09,8.75,10.14,0.79,0.91]
[null,"AGETOP_I",11,"ENCANADOR","h     ",0.09,13.95,16.16,1.26,1.45]
[null,"MÃO DE OBRA (B) - TOTAL",null,null,null,null,null,null,2.0499999999999998,2.36]
[null,"AGETOP_I","H689","FITA VEDAROSCA 12 MM","m",4.5,0.28000000000000003,0.28000000000000003,1.26,1.26]
[null,"SINAPI_I",74,"ADAPTADOR PVC SOLDAVEL, COM FLANGES LIVRES, 85 MM X 3\", PARA CAIXA D' AGUA","UN    ",1,164.1,164.1,164.1,164.1]
[null,"MATERIAL (C) - TOTAL",null,null,null,null,null,null,165.35999999999999,165.35999999999999]
[]
[24,"FONTE","CÓDIGO","DESCRIÇÃO","UNIDADE","COEFIC.","CUSTO UNITÁRIO",null,"CUSTO  TOTAL (A) + (B) + (C) + (D) + (E)"]
[null,null,null,null,null,null,"DESONERADO","NÃO DESONER.","DESONERADO","NÃO DESONER."]
[null,"COMPOSIÇÃO","COMP 024_SEE","SINALIZADOR FOTOLUMINESCENTE PARA EXTINTOR","UN ",null,"-","-",25.319999999999997,25.439999999999998]
[null,"AGETOP_I",5,"SERVENTE","h     ",0.09,8.75,10.14,0.79,0.91]
[null,"MÃO DE OBRA (B) - TOTAL",null,null,null,null,null,null,0.79,0.91]
[null,"AGETOP_I",3070,"BUCHA DE NYLON S-6","un",2,0.04,0.04,0.08,0.08]
[null,"AGETOP_I",3393,"PARAFUSO P/BUCHA S-6","un",2,0.08,0.08,0.16,0.16]
[null,"SINAPI_I",37556,"PLACA DE SINALIZACAO DE SEGURANCA CONTRA INCENDIO, FOTOLUMINESCENTE, QUADRADA, *20 X 20* CM, EM PVC *2* MM ANTI-CHAMAS (SIMBOLOS, CORES E PICTOGRAMAS CONFORME NBR 13434)","UN    ",1,24.29,24.29,24.29,24.29]
[null,"MATERIAL (C) - TOTAL",null,null,null,null,null,null,24.529999999999998,24.529999999999998]
[]
[25,"FONTE","CÓDIGO","DESCRIÇÃO","UNIDADE","COEFIC.","CUSTO UNITÁRIO",null,"CUSTO  TOTAL (A) + (B) + (C) + (D) + (E)"]
[null,null,null,null,null,null,"DESONERADO","NÃO DESONER.","DESONERADO","NÃO DESONER."]
[null,"COMPOSIÇÃO","COMP 025_SEE","SINALIZADOR FOTOLUMINESCENTE DE EMERGÊNCIA","UN ",null,"-","-",25.319999999999997,25.439999999999998]
[null,"AGETOP_I",5,"SERVENTE","h     ",0.09,8.75,10.14,0.79,0.91]
[null,"MÃO DE OBRA (B) - TOTAL",null,null,null,null,null,null,0.79,0.91]
[null,"AGETOP_I",3070,"BUCHA DE NYLON S-6","un",2,0.04,0.04,0.08,0.08]
[null,"AGETOP_I",3393,"PARAFUSO P/BUCHA S-6","un",2,0.08,0.08,0.16,0.16]
[null,"SINAPI_I",37556,"PLACA DE SINALIZACAO DE SEGURANCA CONTRA INCENDIO, FOTOLUMINESCENTE, QUADRADA, *20 X 20* CM, EM PVC *2* MM ANTI-CHAMAS (SIMBOLOS, CORES E PICTOGRAMAS CONFORME NBR 13434)","UN    ",1,24.29,24.29,24.29,24.29]
[null,"MATERIAL (C) - TOTAL",null,null,null,null,null,null,24.529999999999998,24.529999999999998]