{"text_format":"1","workbook":"xlsx","n_sheets":8,"sheets":["Orçamento","Resumo ","Somatório","Cronog_30_Dias","Composição BDI","Relatório CENTRAL","Parc Maior Relev","Composições"],"not_rendered":{"charts":0,"images":7,"macros":1,"external_links":3,"defined_names":155,"comments":3,"pivot_tables":0},"unopened":[],"bounds":{"document_bytes":16777216,"sheet_cells":100000,"rows_first":2000,"rows_last":500,"rows_between":2000,"halvings":0,"cell_chars":16384,"cell_head_chars":4096},"cells_cut":0,"cells_raw":0,"read":"whole","date_system":"1900"}

{"sheet":"Orçamento","index":0,"n_rows":316,"n_cols":24,"rows_kept":316,"cut":false,"hidden":false,"merged":[[297,18,297,20],[297,21,297,22],[298,15,298,17],[298,18,298,20],[298,21,298,22],[299,15,299,17],[299,18,299,20],[299,21,299,22],[294,15,294,17],[294,18,294,20],[294,21,294,22],[295,15,295,17],[295,18,295,20],[295,21,295,22],[296,15,296,17],[296,18,296,20],[296,21,296,22],[308,18,308,20],[308,21,308,22],[303,15,303,17],[303,18,303,20],[303,21,303,22],[304,15,304,17],[304,18,304,20],[304,21,304,22],[305,15,305,17],[305,18,305,20],[305,21,305,22],[284,14,284,17],[291,15,291,17],[257,15,257,17],[312,18,312,20],[312,21,312,22],[300,15,300,17],[300,18,300,20],[300,21,300,22],[301,15,301,17],[301,18,301,20],[301,21,301,22],[302,15,302,17],[302,18,302,20],[302,21,302,22],[306,15,306,17],[306,18,306,20],[306,21,306,22],[307,15,307,17],[307,18,307,20],[307,21,307,22],[308,15,308,17],[297,15,297,17],[293,18,293,20],[293,21,293,22],[252,16,252,22],[315,18,315,20],[315,21,315,22],[312,14,312,17],[309,15,309,17],[309,18,309,20],[309,21,309,22],[310,15,310,17],[310,18,310,20],[310,21,310,22],[311,15,311,17],[311,18,311,20],[311,21,311,22],[314,18,314,20],[314,21,314,22],[313,18,313,20],[313,21,313,22],[290,14,290,23],[291,18,291,20],[291,21,291,22],[292,15,292,17],[292,18,292,20],[292,21,292,22],[293,15,293,17],[0,14,0,23],[248,16,248,22],[249,16,249,22],[250,16,250,22],[4,21,4,22],[3,21,3,22],[6,21,6,22],[11,14,11,23],[14,14,14,23],[7,21,7,22],[3,14,3,20],[4,14,4,20],[6,18,6,20],[7,18,7,20],[7,14,7,17],[6,14,6,17],[13,21,13,22],[13,18,13,20],[9,18,9,20],[9,21,9,22],[10,19,10,20],[270,15,270,17],[271,15,271,17],[272,15,272,17],[273,15,273,17],[274,15,274,17],[275,15,275,17],[276,15,276,17],[277,15,277,17],[278,15,278,17],[258,15,258,17],[259,15,259,17],[260,15,260,17],[261,15,261,17],[262,15,262,17],[263,15,263,17],[264,15,264,17],[265,15,265,17],[266,15,266,17],[279,15,279,17],[280,15,280,17],[281,15,281,17],[282,15,282,17],[283,15,283,17],[256,14,256,23],[245,20,245,21],[244,20,244,21],[240,17,245,17],[240,20,240,21],[257,18,257,20],[257,21,257,22],[258,18,258,20],[258,21,258,22],[246,20,246,21],[266,18,266,20],[266,21,266,22],[267,18,267,20],[267,21,267,22],[268,18,268,20],[268,21,268,22],[269,18,269,20],[269,21,269,22],[281,18,281,20],[284,18,284,20],[284,21,284,22],[281,21,281,22],[282,18,282,20],[282,21,282,22],[283,18,283,20],[283,21,283,22],[273,18,273,20],[273,21,273,22],[280,18,280,20],[280,21,280,22],[275,21,275,22],[276,18,276,20],[276,21,276,22],[278,18,278,20],[274,18,274,20],[274,21,274,22],[275,18,275,20],[285,18,285,20],[285,21,285,22],[272,18,272,20],[272,21,272,22],[265,18,265,20],[265,21,265,22],[287,18,287,20],[287,21,287,22],[241,20,241,21],[263,18,263,20],[263,21,263,22],[264,18,264,20],[264,21,264,22],[262,18,262,20],[262,21,262,22],[271,18,271,20],[242,20,242,21],[253,18,253,22],[259,18,259,20],[259,21,259,22],[260,18,260,20],[260,21,260,22],[261,18,261,20],[261,21,261,22],[251,16,251,22],[9,12,10,12],[286,18,286,20],[286,21,286,22],[1,14,1,22],[9,14,9,16],[10,14,10,16],[12,14,12,16],[13,14,13,16],[15,14,15,22],[2,14,2,22],[5,14,5,22],[8,14,8,22],[270,18,270,20],[270,21,270,22],[278,21,278,22],[267,15,267,17],[268,15,268,17],[269,15,269,17],[271,21,271,22],[279,18,279,20],[279,21,279,22],[277,18,277,20],[277,21,277,22]]}
[null,null,null,null,null,null,null,null,null,null,null,null,null,null,"ORÇAMENTO PADRÃO v3.2.10.1"]
[]
[]
[null,null,null,null,null,null,null,null,null,null,null,null,null,null,"UNIDADE ESCOLAR",null,null,null,null,null,null,"CÓDIGO INEP"]
[null,null,null,null,null,null,null,null,null,null,null,null,null,null,"CENTRO DE ENSINO EM PERÍODO INTEGRAL PROFESSORA IZABEL CHRISTINA DE SOUSA ORTIZ",null,null,null,null,null,null,52103498]
[]
["Nmax",null,null,null,null,null,null,null,null,null,null,null,"Ajustar altura?",null,"OBRA",null,null,null,"DATA",null,null,"CIDADE"]
[{"$f":"MAX($C$19:$C$240)","v":4},null,null,null,null,null,null,null,null,null,null,null,"SIM",null,"REFORMA E AMPLIAÇÃO",null,null,null,"2020-03-19",null,null,"FORMOSA"]
[]
[null,null,null,null,null,null,null,null,null,null,null,null,{"$f":"IF($M$8=\"MANUAL\",\"DESPROTEJA A PLANILHA PARA FORMATAR\",\"\")","v":""},null,"CRE",null,null,"ENDEREÇO","REFERÊNCIA AGETOP",null,null,"REFERÊNCIA SINAPI"]
[null,null,null,null,null,null,null,null,null,null,null,null,null,null,"FORMOSA",null,null,"RUA 65, PRAÇA N°04 S/N, PQ LAGO DE FORMOSA, CEP:73813-872","ABR/19","DESONERADA",null,"NOV/19","DESONERADA"]
[]
[null,null,null,null,null,null,null,null,null,null,null,null,null,null,"ÁREA EXISTENTE (M²)",null,null,"ÁREA A CONSTRUIR (M²)","ÁREA A DEMOLIR (M²)",null,null,"ÁREA TOTAL CONSTRUÍDA (M²)"]
[null,null,null,null,null,null,null,null,null,null,null,null,null,null,2958.55,null,null,2.2400000000000002,0,null,null,2960.79]
[]
[null,null,null,null,null,null,null,null,null,null,null,"FILTRO",null,null,"PLANILHA ORÇAMENTÁRIA"]
["Nível E","Save Nivel","Nível C","Altura","n1","n2","n3","n4","n5","Czero","Cnível","↓","Nível","Nível Corrigido","ITEM","TABELA","CODIGO","DESCRIÇÃO DOS SERVIÇOS","UNID","QUANT","MAT","MO","T.SERVIÇO","OBSERVAÇÕES¹"]
[{"$f":"CHOOSE(1+LOG(1+2*(ORÇAMENTO.Nivel=\"Nível 1\")+4*(ORÇAMENTO.Nivel=\"Nível 2\")+8*(ORÇAMENTO.Nivel=\"Nível 3\")+16*(ORÇAMENTO.Nivel=\"Nível 4\")+32*(ORÇAMENTO.Nivel=\"Serviço\"),2),0,1,2,3,4,\"S\")","v":"S"},{"$f":"IF(OR(C18=\"s\",C18=0),OFFSET(B18,-1,0),C18)","v":"Save Nivel"},{"$f":"IF(OFFSET(C18,-1,0)=\"L\",1,IF(OFFSET(C18,-1,0)=1,2,IF(OR(A18=\"s\",A18=0),\"S\",IF(AND(OFFSET(C18,-1,0)=2,A18=4),3,IF(AND(OR(OFFSET(C18,-1,0)=\"s\",OFFSET(C18,-1,0)=0),A18<>\"s\",A18>OFFSET(B18,-1,0)),OFFSET(B18,-1,0),A18)))))","v":"S"},{"$f":"IF(OR(C18=\"S\",C18=0),0,IF(ISERROR(K18),J18,SMALL(J18:K18,1)))","v":0},{"$f":"IF($C18=1,OFFSET(E18,-1,0)+1,OFFSET(E18,-1,0))","v":"n1"},{"$f":"IF($C18=1,0,IF($C18=2,OFFSET(F18,-1,0)+1,OFFSET(F18,-1,0)))","v":"n2"},{"$f":"IF(AND($C18<=2,$C18<>0),0,IF($C18=3,OFFSET(G18,-1,0)+1,OFFSET(G18,-1,0)))","v":"n3"},{"$f":"IF(AND($C18<=3,$C18<>0),0,IF($C18=4,OFFSET(H18,-1,0)+1,OFFSET(H18,-1,0)))","v":"n4"},{"$f":"IF(AND($C18<=4,$C18<>0),0,IF(AND($C18=\"S\",$W18>0),OFFSET(I18,-1,0)+1,OFFSET(I18,-1,0)))","v":"n5"},{"$f":"IF(OR($C18=\"S\",$C18=0),0,MATCH(0,OFFSET($D18,1,$C18,ROW($C$240)-ROW($C18)),0))","v":0},{"$f":"IF(OR($C18=\"S\",$C18=0),0,MATCH(OFFSET($D18,0,$C18)+1,OFFSET($D18,1,$C18,ROW($C$240)-ROW($C18)),0))","v":0},{"$f":"IF(OR(W18>0,$C18=1),\"F\",\"\")","v":""},"Serviço",{"$f":"CHOOSE(1+LOG(1+2*(C18=1)+4*(C18=2)+8*(C18=3)+16*(C18=4)+32*(C18=\"S\"),2),\"\",\"Nível 1\",\"Nível 2\",\"Nível 3\",\"Nível 4\",\"Serviço\")","v":"Serviço"},"-","SINAPI",null,"(sem código)","-",null,0,0,0,""]
[0,null,"L",{"$f":"COUNTA(OFFSET(D19,1,0):D$240)","v":220},{"$f":"LEFT(O20,1)-1","v":0},null,null,null,null,null,null,"F","LOTE","LOTE","REFORMA - CENTRO DE ENSINO EM PERÍODO INTEGRAL PROFESSORA IZABEL CHRISTINA DE SOUSA ORTIZ",null,null,null,null,null,null,null,30130.230000000007]
[{"$f":"CHOOSE(1+LOG(1+2*(ORÇAMENTO.Nivel=\"Nível 1\")+4*(ORÇAMENTO.Nivel=\"Nível 2\")+8*(ORÇAMENTO.Nivel=\"Nível 3\")+16*(ORÇAMENTO.Nivel=\"Nível 4\")+32*(ORÇAMENTO.Nivel=\"Serviço\"),2),0,1,2,3,4,\"S\")","v":1},{"$f":"IF(OR(C20=\"s\",C20=0),OFFSET(B20,-1,0),C20)","v":1},{"$f":"IF(OFFSET(C20,-1,0)=\"L\",1,IF(OFFSET(C20,-1,0)=1,2,IF(OR(A20=\"s\",A20=0),\"S\",IF(AND(OFFSET(C20,-1,0)=2,A20=4),3,IF(AND(OR(OFFSET(C20,-1,0)=\"s\",OFFSET(C20,-1,0)=0),A20<>\"s\",A20>OFFSET(B20,-1,0)),OFFSET(B20,-1,0),A20)))))","v":1},{"$f":"IF(OR(C20=\"S\",C20=0),0,IF(ISERROR(K20),J20,SMALL(J20:K20,1)))","v":220},{"$f":"IF($C20=1,OFFSET(E20,-1,0)+1,OFFSET(E20,-1,0))","v":1},{"$f":"IF($C20=1,0,IF($C20=2,OFFSET(F20,-1,0)+1,OFFSET(F20,-1,0)))","v":0},{"$f":"IF(AND($C20<=2,$C20<>0),0,IF($C20=3,OFFSET(G20,-1,0)+1,OFFSET(G20,-1,0)))","v":0},{"$f":"IF(AND($C20<=3,$C20<>0),0,IF($C20=4,OFFSET(H20,-1,0)+1,OFFSET(H20,-1,0)))","v":0},{"$f":"IF(AND($C20<=4,$C20<>0),0,IF(AND($C20=\"S\",$W20>0),OFFSET(I20,-1,0)+1,OFFSET(I20,-1,0)))","v":0},{"$f":"IF(OR($C20=\"S\",$C20=0),0,MATCH(0,OFFSET($D20,1,$C20,ROW($C$240)-ROW($C20)),0))","v":220},{"$f":"IF(OR($C20=\"S\",$C20=0),0,MATCH(OFFSET($D20,0,$C20)+1,OFFSET($D20,1,$C20,ROW($C$240)-ROW($C20)),0))","v":{"$error":"#N/A"}},{"$f":"IF(OR(W20>0,$C20=1),\"F\",\"\")","v":"F"},"Nível 1",{"$f":"CHOOSE(1+LOG(1+2*(C20=1)+4*(C20=2)+8*(C20=3)+16*(C20=4)+32*(C20=\"S\"),2),\"\",\"Nível 1\",\"Nível 2\",\"Nível 3\",\"Nível 4\",\"Serviço\")","v":"Nível 1"},"1.","AGETOP",null,"REFORMA"]
[2,{"$f":"IF(OR(C21=\"s\",C21=0),OFFSET(B21,-1,0),C21)","v":2},{"$f":"IF(OFFSET(C21,-1,0)=\"L\",1,IF(OFFSET(C21,-1,0)=1,2,IF(OR(A21=\"s\",A21=0),\"S\",IF(AND(OFFSET(C21,-1,0)=2,A21=4),3,IF(AND(OR(OFFSET(C21,-1,0)=\"s\",OFFSET(C21,-1,0)=0),A21<>\"s\",A21>OFFSET(B21,-1,0)),OFFSET(B21,-1,0),A21)))))","v":2},{"$f":"IF(OR(C21=\"S\",C21=0),0,IF(ISERROR(K21),J21,SMALL(J21:K21,1)))","v":19},{"$f":"IF($C21=1,OFFSET(E21,-1,0)+1,OFFSET(E21,-1,0))","v":1},{"$f":"IF($C21=1,0,IF($C21=2,OFFSET(F21,-1,0)+1,OFFSET(F21,-1,0)))","v":1},{"$f":"IF(AND($C21<=2,$C21<>0),0,IF($C21=3,OFFSET(G21,-1,0)+1,OFFSET(G21,-1,0)))","v":0},{"$f":"IF(AND($C21<=3,$C21<>0),0,IF($C21=4,OFFSET(H21,-1,0)+1,OFFSET(H21,-1,0)))","v":0},{"$f":"IF(AND($C21<=4,$C21<>0),0,IF(AND($C21=\"S\",$W21>0),OFFSET(I21,-1,0)+1,OFFSET(I21,-1,0)))","v":0},219,19,{"$f":"IF(OR(W21>0,$C21=1),\"F\",\"\")","v":""},"Nível 2",{"$f":"CHOOSE(1+LOG(1+2*(C21=1)+4*(C21=2)+8*(C21=3)+16*(C21=4)+32*(C21=\"S\"),2),\"\",\"Nível 1\",\"Nível 2\",\"Nível 3\",\"Nível 4\",\"Serviço\")","v":"Nível 2"},"1.1.","AGETOP",null,"SERVIÇOS PRELIMINARES"]
[3,{"$f":"IF(OR(C22=\"s\",C22=0),OFFSET(B22,-1,0),C22)","v":3},{"$f":"IF(OFFSET(C22,-1,0)=\"L\",1,IF(OFFSET(C22,-1,0)=1,2,IF(OR(A22=\"s\",A22=0),\"S\",IF(AND(OFFSET(C22,-1,0)=2,A22=4),3,IF(AND(OR(OFFSET(C22,-1,0)=\"s\",OFFSET(C22,-1,0)=0),A22<>\"s\",A22>OFFSET(B22,-1,0)),OFFSET(B22,-1,0),A22)))))","v":3},{"$f":"IF(OR(C22=\"S\",C22=0),0,IF(ISERROR(K22),J22,SMALL(J22:K22,1)))","v":3},{"$f":"IF($C22=1,OFFSET(E22,-1,0)+1,OFFSET(E22,-1,0))","v":1},{"$f":"IF($C22=1,0,IF($C22=2,OFFSET(F22,-1,0)+1,OFFSET(F22,-1,0)))","v":1},{"$f":"IF(AND($C22<=2,$C22<>0),0,IF($C22=3,OFFSET(G22,-1,0)+1,OFFSET(G22,-1,0)))","v":1},{"$f":"IF(AND($C22<=3,$C22<>0),0,IF($C22=4,OFFSET(H22,-1,0)+1,OFFSET(H22,-1,0)))","v":0},{"$f":"IF(AND($C22<=4,$C22<>0),0,IF(AND($C22=\"S\",$W22>0),OFFSET(I22,-1,0)+1,OFFSET(I22,-1,0)))","v":0},18,3,{"$f":"IF(OR(W22>0,$C22=1),\"F\",\"\")","v":""},"Nível 3",{"$f":"CHOOSE(1+LOG(1+2*(C22=1)+4*(C22=2)+8*(C22=3)+16*(C22=4)+32*(C22=\"S\"),2),\"\",\"Nível 1\",\"Nível 2\",\"Nível 3\",\"Nível 4\",\"Serviço\")","v":"Nível 3"},"1.1.1.","SINAPI",null,"SANITÁRIO PROFESSORES","-"]
["S",3,"S",0,1,1,1,0,0,0,0,"","Serviço","Serviço","1.1.1.0.1.","AGETOP",20109,"DEM.PISO CIMENT.SOBRE LASTRO CONC.C/TR.ATE CB. E CARGA","m2    ",4.4000000000000004]
["S",3,"S",0,1,1,1,0,0,0,0,"","Serviço","Serviço","1.1.1.0.2.","SINAPI",97645,"REMOÇÃO DE JANELAS, DE FORMA MANUAL, SEM REAPROVEITAMENTO. AF_12/2017","M2",3.87]
[3,3,3,2,1,1,2,0,0,15,2,"","Nível 3","Nível 3","1.1.2.","SINAPI",null,"SANITÁRIO LABORATÓRIO","-"]
["S",3,"S",0,1,1,2,0,0,0,0,"","Serviço","Serviço","1.1.2.0.1.","SINAPI",97631,"DEMOLIÇÃO DE ARGAMASSAS, DE FORMA MANUAL, SEM REAPROVEITAMENTO. AF_12/2017","M2",1.08]
[3,3,3,2,1,1,3,0,0,13,2,"","Nível 3","Nível 3","1.1.3.","SINAPI",null,"COZINHA","-"]
["S",3,"S",0,1,1,3,0,0,0,0,"","Serviço","Serviço","1.1.3.0.1.","AGETOP",20139,"DEMOLIÇAO DE BANCADAS C/ TRANSP. ATÉ CB. E CARGA","m2    ",1.38]
[3,3,3,2,1,1,4,0,0,11,2,"","Nível 3","Nível 3","1.1.4.","SINAPI",null,"INST. ELÉTRICAS","-"]
["S",3,"S",0,1,1,4,0,0,0,0,"","Serviço","Serviço","1.1.4.0.1.","AGETOP",20162,"DEMOLIÇÃO DAS INSTALAÇÕES ELÉTRICAS E AFINS C/ TRANSP. ATÉ CB. E CARGA","H     ",2]
[3,3,3,2,1,1,5,0,0,9,2,"","Nível 3","Nível 3","1.1.5.","SINAPI",null,"CENTRAL DE GÁS","-"]
["S",3,"S",0,1,1,5,0,0,0,0,"","Serviço","Serviço","1.1.5.0.1.","AGETOP",20121,"DEM. MANUAL EM CONCR.SIMPLES C/TR.ATE CB.E CARGA (O.C.)","m3    ",0.06]
[3,3,3,3,1,1,6,0,0,7,3,"","Nível 3","Nível 3","1.1.6.","SINAPI",null,"INST. HIDROSSANITÁRIAS","-"]
["S",3,"S",0,1,1,6,0,0,0,0,"","Serviço","Serviço","1.1.6.0.1.","AGETOP",20121,"DEM. MANUAL EM CONCR.SIMPLES C/TR.ATE CB.E CARGA (O.C.)","m3    ",1.1000000000000001]
[{"$f":"CHOOSE(1+LOG(1+2*(ORÇAMENTO.Nivel=\"Nível 1\")+4*(ORÇAMENTO.Nivel=\"Nível 2\")+8*(ORÇAMENTO.Nivel=\"Nível 3\")+16*(ORÇAMENTO.Nivel=\"Nível 4\")+32*(ORÇAMENTO.Nivel=\"Serviço\"),2),0,1,2,3,4,\"S\")","v":"S"},{"$f":"IF(OR(C35=\"s\",C35=0),OFFSET(B35,-1,0),C35)","v":3},{"$f":"IF(OFFSET(C35,-1,0)=\"L\",1,IF(OFFSET(C35,-1,0)=1,2,IF(OR(A35=\"s\",A35=0),\"S\",IF(AND(OFFSET(C35,-1,0)=2,A35=4),3,IF(AND(OR(OFFSET(C35,-1,0)=\"s\",OFFSET(C35,-1,0)=0),A35<>\"s\",A35>OFFSET(B35,-1,0)),OFFSET(B35,-1,0),A35)))))","v":"S"},{"$f":"IF(OR(C35=\"S\",C35=0),0,IF(ISERROR(K35),J35,SMALL(J35:K35,1)))","v":0},{"$f":"IF($C35=1,OFFSET(E35,-1,0)+1,OFFSET(E35,-1,0))","v":1},{"$f":"IF($C35=1,0,IF($C35=2,OFFSET(F35,-1,0)+1,OFFSET(F35,-1,0)))","v":1},{"$f":"IF(AND($C35<=2,$C35<>0),0,IF($C35=3,OFFSET(G35,-1,0)+1,OFFSET(G35,-1,0)))","v":6},{"$f":"IF(AND($C35<=3,$C35<>0),0,IF($C35=4,OFFSET(H35,-1,0)+1,OFFSET(H35,-1,0)))","v":0},{"$f":"IF(AND($C35<=4,$C35<>0),0,IF(AND($C35=\"S\",$W35>0),OFFSET(I35,-1,0)+1,OFFSET(I35,-1,0)))","v":0},0,0,{"$f":"IF(OR(W35>0,$C35=1),\"F\",\"\")","v":""},"Serviço",{"$f":"CHOOSE(1+LOG(1+2*(C35=1)+4*(C35=2)+8*(C35=3)+16*(C35=4)+32*(C35=\"S\"),2),\"\",\"Nível 1\",\"Nível 2\",\"Nível 3\",\"Nível 4\",\"Serviço\")","v":"Serviço"},"1.1.6.0.2.","AGETOP",20109,"DEM.PISO CIMENT.SOBRE LASTRO CONC.C/TR.ATE CB. E CARGA","m2    ",0.14000000000000001]
[{"$f":"CHOOSE(1+LOG(1+2*(ORÇAMENTO.Nivel=\"Nível 1\")+4*(ORÇAMENTO.Nivel=\"Nível 2\")+8*(ORÇAMENTO.Nivel=\"Nível 3\")+16*(ORÇAMENTO.Nivel=\"Nível 4\")+32*(ORÇAMENTO.Nivel=\"Serviço\"),2),0,1,2,3,4,\"S\")","v":3},{"$f":"IF(OR(C36=\"s\",C36=0),OFFSET(B36,-1,0),C36)","v":3},{"$f":"IF(OFFSET(C36,-1,0)=\"L\",1,IF(OFFSET(C36,-1,0)=1,2,IF(OR(A36=\"s\",A36=0),\"S\",IF(AND(OFFSET(C36,-1,0)=2,A36=4),3,IF(AND(OR(OFFSET(C36,-1,0)=\"s\",OFFSET(C36,-1,0)=0),A36<>\"s\",A36>OFFSET(B36,-1,0)),OFFSET(B36,-1,0),A36)))))","v":3},{"$f":"IF(OR(C36=\"S\",C36=0),0,IF(ISERROR(K36),J36,SMALL(J36:K36,1)))","v":2},{"$f":"IF($C36=1,OFFSET(E36,-1,0)+1,OFFSET(E36,-1,0))","v":1},{"$f":"IF($C36=1,0,IF($C36=2,OFFSET(F36,-1,0)+1,OFFSET(F36,-1,0)))","v":1},{"$f":"IF(AND($C36<=2,$C36<>0),0,IF($C36=3,OFFSET(G36,-1,0)+1,OFFSET(G36,-1,0)))","v":7},{"$f":"IF(AND($C36<=3,$C36<>0),0,IF($C36=4,OFFSET(H36,-1,0)+1,OFFSET(H36,-1,0)))","v":0},{"$f":"IF(AND($C36<=4,$C36<>0),0,IF(AND($C36=\"S\",$W36>0),OFFSET(I36,-1,0)+1,OFFSET(I36,-1,0)))","v":0},4,2,{"$f":"IF(OR(W36>0,$C36=1),\"F\",\"\")","v":""},"Nível 3",{"$f":"CHOOSE(1+LOG(1+2*(C36=1)+4*(C36=2)+8*(C36=3)+16*(C36=4)+32*(C36=\"S\"),2),\"\",\"Nível 1\",\"Nível 2\",\"Nível 3\",\"Nível 4\",\"Serviço\")","v":"Nível 3"},"1.1.7.","SINAPI",null,"FUNDAÇÃO","-"]
[{"$f":"CHOOSE(1+LOG(1+2*(ORÇAMENTO.Nivel=\"Nível 1\")+4*(ORÇAMENTO.Nivel=\"Nível 2\")+8*(ORÇAMENTO.Nivel=\"Nível 3\")+16*(ORÇAMENTO.Nivel=\"Nível 4\")+32*(ORÇAMENTO.Nivel=\"Serviço\"),2),0,1,2,3,4,\"S\")","v":"S"},3,"S",0,1,1,7,0,0,0,0,"","Serviço","Serviço","1.1.7.0.1.","AGETOP",20702,"LOCAÇÃO DE OBRAS DE PEQUENO PORTE COM CAVALETE, INCLUSO PINTURA ( FACE INTERNA DO SARRAFO 10CM) E PIQUETE COM TESTEMUNHA","m2    ",3.32]
[3,{"$f":"IF(OR(C38=\"s\",C38=0),OFFSET(B38,-1,0),C38)","v":3},{"$f":"IF(OFFSET(C38,-1,0)=\"L\",1,IF(OFFSET(C38,-1,0)=1,2,IF(OR(A38=\"s\",A38=0),\"S\",IF(AND(OFFSET(C38,-1,0)=2,A38=4),3,IF(AND(OR(OFFSET(C38,-1,0)=\"s\",OFFSET(C38,-1,0)=0),A38<>\"s\",A38>OFFSET(B38,-1,0)),OFFSET(B38,-1,0),A38)))))","v":3},{"$f":"IF(OR(C38=\"S\",C38=0),0,IF(ISERROR(K38),J38,SMALL(J38:K38,1)))","v":2},{"$f":"IF($C38=1,OFFSET(E38,-1,0)+1,OFFSET(E38,-1,0))","v":1},{"$f":"IF($C38=1,0,IF($C38=2,OFFSET(F38,-1,0)+1,OFFSET(F38,-1,0)))","v":1},{"$f":"IF(AND($C38<=2,$C38<>0),0,IF($C38=3,OFFSET(G38,-1,0)+1,OFFSET(G38,-1,0)))","v":8},{"$f":"IF(AND($C38<=3,$C38<>0),0,IF($C38=4,OFFSET(H38,-1,0)+1,OFFSET(H38,-1,0)))","v":0},{"$f":"IF(AND($C38<=4,$C38<>0),0,IF(AND($C38=\"S\",$W38>0),OFFSET(I38,-1,0)+1,OFFSET(I38,-1,0)))","v":0},2,{"$error":"#N/A"},{"$f":"IF(OR(W38>0,$C38=1),\"F\",\"\")","v":""},"Nível 3",{"$f":"CHOOSE(1+LOG(1+2*(C38=1)+4*(C38=2)+8*(C38=3)+16*(C38=4)+32*(C38=\"S\"),2),\"\",\"Nível 1\",\"Nível 2\",\"Nível 3\",\"Nível 4\",\"Serviço\")","v":"Nível 3"},"1.1.8.","SINAPI",null,"OUTROS","-"]
["S",{"$f":"IF(OR(C39=\"s\",C39=0),OFFSET(B39,-1,0),C39)","v":3},{"$f":"IF(OFFSET(C39,-1,0)=\"L\",1,IF(OFFSET(C39,-1,0)=1,2,IF(OR(A39=\"s\",A39=0),\"S\",IF(AND(OFFSET(C39,-1,0)=2,A39=4),3,IF(AND(OR(OFFSET(C39,-1,0)=\"s\",OFFSET(C39,-1,0)=0),A39<>\"s\",A39>OFFSET(B39,-1,0)),OFFSET(B39,-1,0),A39)))))","v":"S"},{"$f":"IF(OR(C39=\"S\",C39=0),0,IF(ISERROR(K39),J39,SMALL(J39:K39,1)))","v":0},{"$f":"IF($C39=1,OFFSET(E39,-1,0)+1,OFFSET(E39,-1,0))","v":1},{"$f":"IF($C39=1,0,IF($C39=2,OFFSET(F39,-1,0)+1,OFFSET(F39,-1,0)))","v":1},{"$f":"IF(AND($C39<=2,$C39<>0),0,IF($C39=3,OFFSET(G39,-1,0)+1,OFFSET(G39,-1,0)))","v":8},{"$f":"IF(AND($C39<=3,$C39<>0),0,IF($C39=4,OFFSET(H39,-1,0)+1,OFFSET(H39,-1,0)))","v":0},{"$f":"IF(AND($C39<=4,$C39<>0),0,IF(AND($C39=\"S\",$W39>0),OFFSET(I39,-1,0)+1,OFFSET(I39,-1,0)))","v":0},0,0,{"$f":"IF(OR(W39>0,$C39=1),\"F\",\"\")","v":""},"Serviço",{"$f":"CHOOSE(1+LOG(1+2*(C39=1)+4*(C39=2)+8*(C39=3)+16*(C39=4)+32*(C39=\"S\"),2),\"\",\"Nível 1\",\"Nível 2\",\"Nível 3\",\"Nível 4\",\"Serviço\")","v":"Serviço"},"1.1.8.0.1.","SINAPI","74209/1","PLACA DE OBRA EM CHAPA DE ACO GALVANIZADO","M2",7.5]
[2,2,2,3,1,2,0,0,0,200,3,"","Nível 2","Nível 2","1.2.","AGETOP",null,"TRANSPORTES","-"]
["S",2,"S",0,1,2,0,0,0,0,0,"","Serviço","Serviço","1.2.0.0.1.","SINAPI",72900,"TRANSPORTE DE ENTULHO COM CAMINHAO BASCULANTE 6 M3, RODOVIA PAVIMENTADA, DMT 0,5 A 1,0 KM","M3",1.5487]
["S",2,"S",0,1,2,0,0,0,0,0,"","Serviço","Serviço","1.2.0.0.2.","SINAPI",72897,"CARGA MANUAL DE ENTULHO EM CAMINHAO BASCULANTE 6 M3","M3",1.5487]
[2,2,2,11,1,3,0,0,0,197,11,"","Nível 2","Nível 2","1.3.","AGETOP",null,"SERVIÇO EM TERRA","-"]
[3,3,3,3,1,3,1,0,0,10,3,"","Nível 3","Nível 3","1.3.1.","SINAPI",null,"CENTRAL DE GÁS","-"]
["S",3,"S",0,1,3,1,0,0,0,0,"","Serviço","Serviço","1.3.1.0.1.","SINAPI",93358,"ESCAVAÇÃO MANUAL DE VALA COM PROFUNDIDADE MENOR OU IGUAL A 1,30 M. AF_03/2016","M3",0.31]
["S",3,"S",0,1,3,1,0,0,0,0,"","Serviço","Serviço","1.3.1.0.2.","SINAPI",96995,"REATERRO MANUAL APILOADO COM SOQUETE. AF_10/2017","M3",0.31]
[3,3,3,3,1,3,2,0,0,7,3,"","Nível 3","Nível 3","1.3.2.","SINAPI",null,"INST. HIDROSSANITÁRIAS","-"]
["S",3,"S",0,1,3,2,0,0,0,0,"","Serviço","Serviço","1.3.2.0.1.","AGETOP",40101,"ESCAVACAO MANUAL DE VALAS < 1 MTS. (OBRAS CIVIS)","m3    ",11.7]
["S",3,"S",0,1,3,2,0,0,0,0,"","Serviço","Serviço","1.3.2.0.2.","AGETOP",40902,"REATERRO COM APILOAMENTO","m3    ",11.7]
[3,3,3,4,1,3,3,0,0,4,99,"","Nível 3","Nível 3","1.3.3.","SINAPI",null,"FUNDAÇÃO","-"]
["S",3,"S",0,1,3,3,0,0,0,0,"","Serviço","Serviço","1.3.3.0.1.","AGETOP",50902,"APILOAMENTO (BLOCOS/SAPATAS)","m2    ",1.94]
["S",3,"S",0,1,3,3,0,0,{"$f":"IF(OR($C52=\"S\",$C52=0),0,MATCH(0,OFFSET($D52,1,$C52,ROW($C$240)-ROW($C52)),0))","v":0},{"$f":"IF(OR($C52=\"S\",$C52=0),0,MATCH(OFFSET($D52,0,$C52)+1,OFFSET($D52,1,$C52,ROW($C$240)-ROW($C52)),0))","v":0},"","Serviço","Serviço","1.3.3.0.2.","AGETOP",50901,"ESCAVACAO MANUAL DE VALAS (SAPATAS/BLOCOS)","m3    ",0.49]
["S",3,"S",0,1,3,3,0,0,0,0,"","Serviço","Serviço","1.3.3.0.3.","SINAPI",96995,"REATERRO MANUAL APILOADO COM SOQUETE. AF_10/2017","M3",0.32]
[{"$f":"CHOOSE(1+LOG(1+2*(ORÇAMENTO.Nivel=\"Nível 1\")+4*(ORÇAMENTO.Nivel=\"Nível 2\")+8*(ORÇAMENTO.Nivel=\"Nível 3\")+16*(ORÇAMENTO.Nivel=\"Nível 4\")+32*(ORÇAMENTO.Nivel=\"Serviço\"),2),0,1,2,3,4,\"S\")","v":2},2,2,5,1,4,0,0,0,186,5,"","Nível 2","Nível 2","1.4.","AGETOP",null,"FUNDAÇÕES E SONDAGENS","-"]
[3,3,3,4,1,4,1,0,0,4,24,"","Nível 3","Nível 3","1.4.1.","SINAPI",null,"ESTACAS","-"]
["S",3,"S",0,1,4,1,0,0,0,0,"","Serviço","Serviço","1.4.1.0.1.","SINAPI",98230,"ESTACA BROCA DE CONCRETO, DIÂMETRO DE 30 CM, PROFUNDIDADE DE ATÉ 3 M, ESCAVAÇÃO MANUAL COM TRADO CONCHA, NÃO ARMADA. AF_03/2018","M",4]
["S",3,"S",0,1,4,1,0,0,0,0,"","Serviço","Serviço","1.4.1.0.2.","SINAPI",96545,"ARMAÇÃO DE BLOCO, VIGA BALDRAME OU SAPATA UTILIZANDO AÇO CA-50 DE 8 MM - MONTAGEM. AF_06/2017","KG",7]
["S",3,"S",0,1,4,1,0,0,0,0,"","Serviço","Serviço","1.4.1.0.3.","SINAPI",96543,"ARMAÇÃO DE BLOCO, VIGA BALDRAME E SAPATA UTILIZANDO AÇO CA-60 DE 5 MM - MONTAGEM. AF_06/2017","KG",3]
[2,{"$f":"IF(OR(C59=\"s\",C59=0),OFFSET(B59,-1,0),C59)","v":2},{"$f":"IF(OFFSET(C59,-1,0)=\"L\",1,IF(OFFSET(C59,-1,0)=1,2,IF(OR(A59=\"s\",A59=0),\"S\",IF(AND(OFFSET(C59,-1,0)=2,A59=4),3,IF(AND(OR(OFFSET(C59,-1,0)=\"s\",OFFSET(C59,-1,0)=0),A59<>\"s\",A59>OFFSET(B59,-1,0)),OFFSET(B59,-1,0),A59)))))","v":2},{"$f":"IF(OR(C59=\"S\",C59=0),0,IF(ISERROR(K59),J59,SMALL(J59:K59,1)))","v":7},{"$f":"IF($C59=1,OFFSET(E59,-1,0)+1,OFFSET(E59,-1,0))","v":1},{"$f":"IF($C59=1,0,IF($C59=2,OFFSET(F59,-1,0)+1,OFFSET(F59,-1,0)))","v":5},{"$f":"IF(AND($C59<=2,$C59<>0),0,IF($C59=3,OFFSET(G59,-1,0)+1,OFFSET(G59,-1,0)))","v":0},{"$f":"IF(AND($C59<=3,$C59<>0),0,IF($C59=4,OFFSET(H59,-1,0)+1,OFFSET(H59,-1,0)))","v":0},{"$f":"IF(AND($C59<=4,$C59<>0),0,IF(AND($C59=\"S\",$W59>0),OFFSET(I59,-1,0)+1,OFFSET(I59,-1,0)))","v":0},181,7,{"$f":"IF(OR(W59>0,$C59=1),\"F\",\"\")","v":""},"Nível 2",{"$f":"CHOOSE(1+LOG(1+2*(C59=1)+4*(C59=2)+8*(C59=3)+16*(C59=4)+32*(C59=\"S\"),2),\"\",\"Nível 1\",\"Nível 2\",\"Nível 3\",\"Nível 4\",\"Serviço\")","v":"Nível 2"},"1.5.","AGETOP",null,"ESTRUTURA","-"]
[3,3,3,6,1,5,1,0,0,6,19,"","Nível 3","Nível 3","1.5.1.","SINAPI",null,"VIGAS BALDRAMES","-"]
["S",3,"S",0,1,5,1,0,0,0,0,"","Serviço","Serviço","1.5.1.0.1.","SINAPI",92426,"MONTAGEM E DESMONTAGEM DE FÔRMA DE PILARES RETANGULARES E ESTRUTURAS SIMILARES COM ÁREA MÉDIA DAS SEÇÕES MENOR OU IGUAL A 0,25 M², PÉ-DIREITO SIMPLES, EM CHAPA DE MADEIRA COMPENSADA RESINADA, 8 UTILIZAÇÕES. AF_12/2015","M2",2.4300000000000002]
["S",3,"S",0,1,5,1,0,0,0,0,"","Serviço","Serviço","1.5.1.0.2.","SINAPI",94964,"CONCRETO FCK = 20MPA, TRAÇO 1:2,7:3 (CIMENTO/ AREIA MÉDIA/ BRITA 1)  - PREPARO MECÂNICO COM BETONEIRA 400 L. AF_07/2016","M3",0.17]
["S",3,"S",0,1,5,1,0,0,0,0,"","Serviço","Serviço","1.5.1.0.3.","SINAPI",92873,"LANÇAMENTO COM USO DE BALDES, ADENSAMENTO E ACABAMENTO DE CONCRETO EM ESTRUTURAS. AF_12/2015","M3",0.17]
["S",3,"S",0,1,5,1,0,0,0,0,"","Serviço","Serviço","1.5.1.0.4.","SINAPI",92777,"ARMAÇÃO DE PILAR OU VIGA DE UMA ESTRUTURA CONVENCIONAL DE CONCRETO ARMADO EM UMA EDIFICAÇÃO TÉRREA OU SOBRADO UTILIZANDO AÇO CA-50 DE 8,0 MM - MONTAGEM. AF_12/2015","KG",9]
["S",3,"S",0,1,5,1,0,0,0,0,"","Serviço","Serviço","1.5.1.0.5.","SINAPI",92775,"ARMAÇÃO DE PILAR OU VIGA DE UMA ESTRUTURA CONVENCIONAL DE CONCRETO ARMADO EM UMA EDIFICAÇÃO TÉRREA OU SOBRADO UTILIZANDO AÇO CA-60 DE 5,0 MM - MONTAGEM. AF_12/2015","KG",6]
[{"$f":"CHOOSE(1+LOG(1+2*(ORÇAMENTO.Nivel=\"Nível 1\")+4*(ORÇAMENTO.Nivel=\"Nível 2\")+8*(ORÇAMENTO.Nivel=\"Nível 3\")+16*(ORÇAMENTO.Nivel=\"Nível 4\")+32*(ORÇAMENTO.Nivel=\"Serviço\"),2),0,1,2,3,4,\"S\")","v":2},{"$f":"IF(OR(C66=\"s\",C66=0),OFFSET(B66,-1,0),C66)","v":2},{"$f":"IF(OFFSET(C66,-1,0)=\"L\",1,IF(OFFSET(C66,-1,0)=1,2,IF(OR(A66=\"s\",A66=0),\"S\",IF(AND(OFFSET(C66,-1,0)=2,A66=4),3,IF(AND(OR(OFFSET(C66,-1,0)=\"s\",OFFSET(C66,-1,0)=0),A66<>\"s\",A66>OFFSET(B66,-1,0)),OFFSET(B66,-1,0),A66)))))","v":2},{"$f":"IF(OR(C66=\"S\",C66=0),0,IF(ISERROR(K66),J66,SMALL(J66:K66,1)))","v":23},{"$f":"IF($C66=1,OFFSET(E66,-1,0)+1,OFFSET(E66,-1,0))","v":1},{"$f":"IF($C66=1,0,IF($C66=2,OFFSET(F66,-1,0)+1,OFFSET(F66,-1,0)))","v":6},{"$f":"IF(AND($C66<=2,$C66<>0),0,IF($C66=3,OFFSET(G66,-1,0)+1,OFFSET(G66,-1,0)))","v":0},{"$f":"IF(AND($C66<=3,$C66<>0),0,IF($C66=4,OFFSET(H66,-1,0)+1,OFFSET(H66,-1,0)))","v":0},{"$f":"IF(AND($C66<=4,$C66<>0),0,IF(AND($C66=\"S\",$W66>0),OFFSET(I66,-1,0)+1,OFFSET(I66,-1,0)))","v":0},174,23,{"$f":"IF(OR(W66>0,$C66=1),\"F\",\"\")","v":""},"Nível 2",{"$f":"CHOOSE(1+LOG(1+2*(C66=1)+4*(C66=2)+8*(C66=3)+16*(C66=4)+32*(C66=\"S\"),2),\"\",\"Nível 1\",\"Nível 2\",\"Nível 3\",\"Nível 4\",\"Serviço\")","v":"Nível 2"},"1.6.",null,null,"INSTALAÇÕES ELÉTRICAS","-"]
[3,3,3,12,1,6,1,0,0,22,12,"","Nível 3","Nível 3","1.6.1.","SINAPI",null,"REFORMA","-"]
["S",3,"S",0,1,6,1,0,0,0,0,"","Serviço","Serviço","1.6.1.0.1.","SINAPI",91926,"CABO DE COBRE FLEXÍVEL ISOLADO, 2,5 MM², ANTI-CHAMA 450/750 V, PARA CIRCUITOS TERMINAIS - FORNECIMENTO E INSTALAÇÃO. AF_12/2015","M",40]
["S",3,"S",0,1,6,1,0,0,0,0,"","Serviço","Serviço","1.6.1.0.2.","SINAPI",91937,"CAIXA OCTOGONAL 3\" X 3\", PVC, INSTALADA EM LAJE - FORNECIMENTO E INSTALAÇÃO. AF_12/2015","UN",3]
["S",3,"S",0,1,6,1,0,0,0,0,"","Serviço","Serviço","-","SINAPI",93043,"(sem código)","-",3]
["S",3,"S",0,1,6,1,0,0,0,0,"","Serviço","Serviço","1.6.1.0.3.","SINAPI",97592,"LUMINÁRIA TIPO PLAFON, DE SOBREPOR, COM 1 LÂMPADA LED - FORNECIMENTO E INSTALAÇÃO. AF_11/2017","UN",3]
["S",3,"S",0,1,6,1,0,0,0,0,"","Serviço","Serviço","1.6.1.0.4.","SINAPI",91953,"INTERRUPTOR SIMPLES (1 MÓDULO), 10A/250V, INCLUINDO SUPORTE E PLACA - FORNECIMENTO E INSTALAÇÃO. AF_12/2015","UN",3]
["S",3,"S",0,1,6,1,0,0,0,0,"","Serviço","Serviço","1.6.1.0.5.","SINAPI",91940,"CAIXA RETANGULAR 4\" X 2\" MÉDIA (1,30 M DO PISO), PVC, INSTALADA EM PAREDE - FORNECIMENTO E INSTALAÇÃO. AF_12/2015","UN",3]
["S",3,"S",0,1,6,1,0,0,0,0,"","Serviço","Serviço","1.6.1.0.6.","SINAPI",91834,"ELETRODUTO FLEXÍVEL CORRUGADO, PVC, DN 25 MM (3/4\"), PARA CIRCUITOS TERMINAIS, INSTALADO EM FORRO - FORNECIMENTO E INSTALAÇÃO. AF_12/2015","M",6]
["S",3,"S",0,1,6,1,0,0,0,0,"","Serviço","Serviço","1.6.1.0.7.","SINAPI",91854,"ELETRODUTO FLEXÍVEL CORRUGADO, PVC, DN 25 MM (3/4\"), PARA CIRCUITOS TERMINAIS, INSTALADO EM PAREDE - FORNECIMENTO E INSTALAÇÃO. AF_12/2015","M",6]
["S",3,"S",0,1,6,1,0,0,0,0,"","Serviço","Serviço","1.6.1.0.8.","AGETOP",71331,"FITA ISOLANTE, ROLO DE 20,00 M","Un    ",2]
["S",3,"S",0,1,6,1,0,0,0,0,"","Serviço","Serviço","1.6.1.0.9.","SINAPI",91879,"LUVA PARA ELETRODUTO, PVC, ROSCÁVEL, DN 25 MM (3/4\"), PARA CIRCUITOS TERMINAIS, INSTALADA EM LAJE - FORNECIMENTO E INSTALAÇÃO. AF_12/2015","UN",2]
["S",3,"S",0,1,6,1,0,0,0,0,"","Serviço","Serviço","1.6.1.0.10.","SINAPI",91884,"LUVA PARA ELETRODUTO, PVC, ROSCÁVEL, DN 25 MM (3/4\"), PARA CIRCUITOS TERMINAIS, INSTALADA EM PAREDE - FORNECIMENTO E INSTALAÇÃO. AF_12/2015","UN",2]
[3,3,3,10,1,6,2,0,0,10,50,"","Nível 3","Nível 3","1.6.2.","SINAPI",null,"ILUMINAÇÃO DE EMERGÊNCIA","-"]
["S",3,"S",0,1,6,2,0,0,0,0,"","Serviço","Serviço","1.6.2.0.1.","SINAPI",91924,"CABO DE COBRE FLEXÍVEL ISOLADO, 1,5 MM², ANTI-CHAMA 450/750 V, PARA CIRCUITOS TERMINAIS - FORNECIMENTO E INSTALAÇÃO. AF_12/2015","M",1090]
["S",3,"S",0,1,6,2,0,0,0,0,"","Serviço","Serviço","1.6.2.0.2.","AGETOP",71250,"ELETRODUTO EM AÇO ZINCADO DIÂMETRO 1/2\"","M     ",333]
["S",3,"S",0,1,6,2,0,0,0,0,"","Serviço","Serviço","1.6.2.0.3.","AGETOP",71120,"CURVA 90 GRAUS AÇO ZINCADO DIÂMETRO 1/2\"","Un    ",21]
["S",3,"S",0,1,6,2,0,0,0,0,"","Serviço","Serviço","1.6.2.0.4.","AGETOP",71720,"LUVA EM AÇO ZINCADO DIÂMETRO 1/2\"","Un    ",111]
["S",3,"S",0,1,6,2,0,0,{"$f":"IF(OR($C84=\"S\",$C84=0),0,MATCH(0,OFFSET($D84,1,$C84,ROW($C$240)-ROW($C84)),0))","v":0},{"$f":"IF(OR($C84=\"S\",$C84=0),0,MATCH(OFFSET($D84,0,$C84)+1,OFFSET($D84,1,$C84,ROW($C$240)-ROW($C84)),0))","v":0},"","Serviço","Serviço","1.6.2.0.5.","SINAPI",95801,"CONDULETE DE ALUMÍNIO, TIPO X, PARA ELETRODUTO DE AÇO GALVANIZADO DN 20 MM (3/4''), APARENTE - FORNECIMENTO E INSTALAÇÃO. AF_11/2016_P","UN",45]
["S",3,"S",0,1,6,2,0,0,0,0,"","Serviço","Serviço","1.6.2.0.6.","AGETOP",72476,"TAMPA PARA CONDULETE METÁLICO PARA 1 TOMADA","un    ",21]
["S",3,"S",0,1,6,2,0,0,0,0,"","Serviço","Serviço","1.6.2.0.7.","AGETOP",72578,"TOMADA HEXAGONAL 2P + T - 10A - 250V","Un    ",21]
["S",3,"S",0,1,6,2,0,0,0,0,"","Serviço","Serviço","1.6.2.0.8.","AGETOP",72385,"TAMPA CEGA PARA CONDULETE DE PVC","Un    ",21]
["S",3,"S",0,1,6,2,0,0,0,0,"","Serviço","Serviço","1.6.2.0.9.","AGETOP",72395,"TAMPA CEGA PARA CONDULETE METÁLICO","Un    ",24]
[{"$f":"CHOOSE(1+LOG(1+2*(ORÇAMENTO.Nivel=\"Nível 1\")+4*(ORÇAMENTO.Nivel=\"Nível 2\")+8*(ORÇAMENTO.Nivel=\"Nível 3\")+16*(ORÇAMENTO.Nivel=\"Nível 4\")+32*(ORÇAMENTO.Nivel=\"Serviço\"),2),0,1,2,3,4,\"S\")","v":2},2,2,70,1,7,0,0,0,151,70,"","Nível 2","Nível 2","1.7.","AGETOP",null,"INSTALAÇÕES HIDROSSANITÁRIAS","-"]
[3,3,3,19,1,7,1,0,0,69,19,"","Nível 3","Nível 3","1.7.1.","SINAPI",null,"PEÇAS E ACESSÓRIOS","-"]
[4,4,4,7,1,7,1,1,0,18,7,"","Nível 4","Nível 4","1.7.1.1.","SINAPI",null,"VASO SANITÁRIO E ACESSÓRIOS","-"]
["S",4,"S",0,1,7,1,1,0,0,0,"","Serviço","Serviço","1.7.1.1.1.","SINAPI",95470,"VASO SANITARIO SIFONADO CONVENCIONAL COM LOUÇA BRANCA, INCLUSO CONJUNTO DE LIGAÇÃO PARA BACIA SANITÁRIA AJUSTÁVEL - FORNECIMENTO E INSTALAÇÃO. AF_10/2016","UN",2]
["S",4,"S",0,1,7,1,1,0,0,0,"","Serviço","Serviço","1.7.1.1.2.","SINAPI",99635,"VÁLVULA DE DESCARGA METÁLICA, BASE 1 1/2 \", ACABAMENTO METALICO CROMADO - FORNECIMENTO E INSTALAÇÃO. AF_01/2019","UN",2]
["S",4,"S",0,1,7,1,1,0,0,0,"","Serviço","Serviço","1.7.1.1.3.","AGETOP",80520,"CONJUNTO DE FIXACAO P/VASO SANITARIO (PAR)","CJ    ",2]
["S",4,"S",0,1,7,1,1,0,0,0,"","Serviço","Serviço","1.7.1.1.4.","AGETOP",80510,"ANEL DE VEDAÇÃO PARA VASO SANITÁRIO","Un    ",2]
["S",4,"S",0,1,7,1,1,0,0,0,"","Serviço","Serviço","1.7.1.1.5.","AGETOP",80513,"TUBO PARA VÁLVULA DE DESCARGA ( CURTO 1.1/4\" )","Un    ",2]
["S",4,"S",0,1,7,1,1,0,0,0,"","Serviço","Serviço","1.7.1.1.6.","AGETOP",80514,"TUBO DE LIGACAO PVC CROMADO 1.1/2\" / ESPUDE  - (ENTRADA)","Un    ",2]
[4,4,4,5,1,7,1,2,0,11,5,"","Nível 4","Nível 4","1.7.1.2.","SINAPI",null,"LAVATÓRIO E ACESSÓRIOS","-"]
["S",4,"S",0,1,7,1,2,0,0,0,"","Serviço","Serviço","1.7.1.2.1.","SINAPI",86915,"TORNEIRA CROMADA DE MESA, 1/2\" OU 3/4\", PARA LAVATÓRIO, PADRÃO MÉDIO - FORNECIMENTO E INSTALAÇÃO. AF_12/2013","UN",1]
["S",4,"S",0,1,7,1,2,0,0,0,"","Serviço","Serviço","1.7.1.2.2.","AGETOP",80621,"VÁLVULA DE DESCARGA PARA MICTÓRIO DIÂMETRO 1/2\" FECHAMENTO AUTOMÁTICO TEMPORIZADO","Un    ",1]
["S",4,"S",0,1,7,1,2,0,0,0,"","Serviço","Serviço","1.7.1.2.3.","AGETOP",80590,"CUBA DE LOUCA DE EMBUTIR OVAL MÉDIA ","Un    ",1]
["S",4,"S",0,1,7,1,2,0,0,0,"","Serviço","Serviço","1.7.1.2.4.","AGETOP",80562,"SIFAO FLEXIVEL UNIVERSAL ( SANFONADO) EM PVC PARA LAVATORIO","Un    ",1]
[4,4,4,3,1,7,1,3,0,6,3,"","Nível 4","Nível 4","1.7.1.3.","SINAPI",null,"PIA E ACESSÓRIOS","-"]
["S",4,"S",0,1,7,1,3,0,0,0,"","Serviço","Serviço","1.7.1.3.1.","SINAPI",86912,"TORNEIRA CROMADA LONGA, DE PAREDE, 1/2\" OU 3/4\", PARA PIA DE COZINHA, PADRÃO MÉDIO - FORNECIMENTO E INSTALAÇÃO. AF_12/2013","UN",1]
["S",4,"S",0,1,7,1,3,0,0,0,"","Serviço","Serviço","1.7.1.3.2.","SINAPI",86881,"SIFÃO DO TIPO GARRAFA EM METAL CROMADO 1 X 1.1/2\" - FORNECIMENTO E INSTALAÇÃO. AF_12/2013","UN",1]
[4,4,4,3,1,7,1,4,0,3,17,"","Nível 4","Nível 4","1.7.1.4.","SINAPI",null,"REGISTROS","-"]
["S",4,"S",0,1,7,1,4,0,0,0,"","Serviço","Serviço","1.7.1.4.1.","AGETOP",80902,"REGISTRO DE GAVETA BRUTO DIAMETRO 3/4\"","Un    ",2]
["S",4,"S",0,1,7,1,4,0,0,0,"","Serviço","Serviço","1.7.1.4.2.","AGETOP",80905,"REGISTRO DE GAVETA BRUTO DIAMETRO 1.1/2\"","Un    ",1]
[3,3,3,20,1,7,2,0,0,50,20,"","Nível 3","Nível 3","1.7.2.","SINAPI",null,"ÁGUA FRIA","-"]
[4,4,4,4,1,7,2,1,0,19,4,"","Nível 4","Nível 4","1.7.2.1.","SINAPI",null,"TUBOS DE PVC SOLDÁVEL","-"]
["S",4,"S",0,1,7,2,1,0,0,0,"","Serviço","Serviço","1.7.2.1.1.","SINAPI",89402,"TUBO, PVC, SOLDÁVEL, DN 25MM, INSTALADO EM RAMAL DE DISTRIBUIÇÃO DE ÁGUA - FORNECIMENTO E INSTALAÇÃO. AF_12/2014","M",1]
["S",4,"S",0,1,7,2,1,0,0,0,"","Serviço","Serviço","1.7.2.1.2.","SINAPI",89449,"TUBO, PVC, SOLDÁVEL, DN 50MM, INSTALADO EM PRUMADA DE ÁGUA - FORNECIMENTO E INSTALAÇÃO. AF_12/2014","M",30]
["S",4,"S",0,1,7,2,1,0,0,0,"","Serviço","Serviço","1.7.2.1.3.","SINAPI",89451,"TUBO, PVC, SOLDÁVEL, DN 75MM, INSTALADO EM PRUMADA DE ÁGUA - FORNECIMENTO E INSTALAÇÃO. AF_12/2014","M",40]
[4,4,4,3,1,7,2,2,0,15,3,"","Nível 4","Nível 4","1.7.2.2.","SINAPI",null,"ADAPTADORES DE PVC SOLDÁVEL","-"]
["S",4,"S",0,1,7,2,2,0,0,0,"","Serviço","Serviço","1.7.2.2.1.","SINAPI",89538,"ADAPTADOR CURTO COM BOLSA E ROSCA PARA REGISTRO, PVC, SOLDÁVEL, DN 25MM X 3/4\u0094, INSTALADO EM PRUMADA DE ÁGUA - FORNECIMENTO E INSTALAÇÃO. AF_12/2014","UN",4]
["S",4,"S",0,1,7,2,2,0,{"$f":"IF(OR($C116=\"S\",$C116=0),0,MATCH(0,OFFSET($D116,1,$C116,ROW($C$240)-ROW($C116)),0))","v":0},{"$f":"IF(OR($C116=\"S\",$C116=0),0,MATCH(OFFSET($D116,0,$C116)+1,OFFSET($D116,1,$C116,ROW($C$240)-ROW($C116)),0))","v":0},"","Serviço","Serviço","1.7.2.2.2.","SINAPI",89596,"ADAPTADOR CURTO COM BOLSA E ROSCA PARA REGISTRO, PVC, SOLDÁVEL, DN 50MM X 1.1/2\u0094, INSTALADO EM PRUMADA DE ÁGUA - FORNECIMENTO E INSTALAÇÃO. AF_12/2014","UN",4]
[4,4,4,2,1,7,2,3,0,12,2,"","Nível 4","Nível 4","1.7.2.3.","SINAPI",null,"BUCHAS","-"]
["S",4,"S",0,1,7,2,3,0,0,0,"","Serviço","Serviço","1.7.2.3.1.","AGETOP",81179,"BUCHA DE REDUCAO SOLDAVEL LONGA 50 X 25 mm","Un    ",1]
[4,4,4,4,1,7,2,4,0,10,4,"","Nível 4","Nível 4","1.7.2.4.","SINAPI",null,"JOELHO","-"]
["S",4,"S",0,1,7,2,4,0,0,0,"","Serviço","Serviço","1.7.2.4.1.","SINAPI",89501,"JOELHO 90 GRAUS, PVC, SOLDÁVEL, DN 50MM, INSTALADO EM PRUMADA DE ÁGUA - FORNECIMENTO E INSTALAÇÃO. AF_12/2014","UN",4]
["S",4,"S",0,1,7,2,4,0,0,0,"","Serviço","Serviço","1.7.2.4.2.","SINAPI",89513,"JOELHO 90 GRAUS, PVC, SOLDÁVEL, DN 75MM, INSTALADO EM PRUMADA DE ÁGUA - FORNECIMENTO E INSTALAÇÃO. AF_12/2014","UN",3]
["S",4,"S",0,1,7,2,4,0,0,0,"","Serviço","Serviço","1.7.2.4.3.","AGETOP",81360,"JOELHO RED.90 GRAUS SOLD.C/BUCHA LATAO 25X1/2\"","Un    ",1]
[4,4,4,3,1,7,2,5,0,6,3,"","Nível 4","Nível 4","1.7.2.5.","SINAPI",null,"TÊ","-"]
["S",4,"S",0,1,7,2,5,0,0,0,"","Serviço","Serviço","1.7.2.5.1.","SINAPI",89625,"TE, PVC, SOLDÁVEL, DN 50MM, INSTALADO EM PRUMADA DE ÁGUA - FORNECIMENTO E INSTALAÇÃO. AF_12/2014","UN",2]
["S",4,"S",0,1,7,2,5,0,0,0,"","Serviço","Serviço","1.7.2.5.2.","SINAPI",94698,"TÊ DE REDUÇÃO, PVC, SOLDÁVEL, DN 75 MM X 50 MM, INSTALADO EM RESERVAÇÃO DE ÁGUA DE EDIFICAÇÃO QUE POSSUA RESERVATÓRIO DE FIBRA/FIBROCIMENTO   FORNECIMENTO E INSTALAÇÃO. AF_06/2016","UN",1]
[4,4,4,3,1,7,2,6,0,3,{"$error":"#N/A"},"","Nível 4","Nível 4","1.7.2.6.","SINAPI",null,"ADESIVOS","-"]
["S",4,"S",0,1,7,2,6,0,0,0,"","Serviço","Serviço","1.7.2.6.1.","AGETOP",81501,"ADESIVO PLASTICO - FRASCO 850 G","Un    ",1]
["S",4,"S",0,1,7,2,6,0,0,0,"","Serviço","Serviço","1.7.2.6.2.","AGETOP",81504,"SOLUCAO LIMPADORA 1000 CM3","Un    ",1]
[3,3,3,20,1,7,3,0,0,30,20,"","Nível 3","Nível 3","1.7.3.","SINAPI",null,"ESGOTO SANITÁRIO","-"]
[4,4,4,4,1,7,3,1,0,19,4,"","Nível 4","Nível 4","1.7.3.1.","SINAPI",null,"CORPO DE CAIXA SIFONADA / RALO","-"]
["S",4,"S",0,1,7,3,1,0,0,0,"","Serviço","Serviço","1.7.3.1.1.","AGETOP",81663,"CORPO CX. SIFONADA DIAM. 150 X 150 X 50","Un    ",1]
["S",4,"S",0,1,7,3,1,0,0,0,"","Serviço","Serviço","1.7.3.1.2.","AGETOP",81696,"PROLONGAMENTO PARA CAIXA SIFONADA 150 MM","M     ",1]
["S",4,"S",0,1,7,3,1,0,0,0,"","Serviço","Serviço","1.7.3.1.3.","AGETOP",81786,"GRELHA REDONDA ACO INOX SIMPLES DIAM. 150 MM","Un    ",1]
[4,4,4,4,1,7,3,2,0,15,4,"","Nível 4","Nível 4","1.7.3.2.","SINAPI",null,"CURVAS","-"]
["S",4,"S",0,1,7,3,2,0,0,0,"","Serviço","Serviço","1.7.3.2.1.","AGETOP",81733,"CURVA 90 GRAUS CURTA DIAM. 100 MM","Un    ",2]
["S",4,"S",0,1,7,3,2,0,0,0,"","Serviço","Serviço","1.7.3.2.2.","AGETOP",81730,"CURVA 90 GRAUS CURTA DIAM. 40 MM","Un    ",1]
["S",4,"S",0,1,7,3,2,0,0,0,"","Serviço","Serviço","1.7.3.2.3.","AGETOP",81731,"CURVA 90 GRAUS CURTA DIAM. 50 MM","Un    ",1]
[4,4,4,3,1,7,3,3,0,11,3,"","Nível 4","Nível 4","1.7.3.3.","SINAPI",null,"JOELHOS","-"]
["S",4,"S",0,1,7,3,3,0,0,0,"","Serviço","Serviço","1.7.3.3.1.","SINAPI",89731,"JOELHO 90 GRAUS, PVC, SERIE NORMAL, ESGOTO PREDIAL, DN 50 MM, JUNTA ELÁSTICA, FORNECIDO E INSTALADO EM RAMAL DE DESCARGA OU RAMAL DE ESGOTO SANITÁRIO. AF_12/2014","UN",1]
["S",4,"S",0,1,7,3,3,0,0,0,"","Serviço","Serviço","1.7.3.3.2.","AGETOP",81927,"JOELHO 90 GRAUS C/ANEL 40 mm ","Un    ",1]
[4,4,4,2,1,7,3,4,0,8,2,"","Nível 4","Nível 4","1.7.3.4.","SINAPI",null,"JUNÇÕES","-"]
["S",4,"S",0,1,7,3,4,0,0,0,"","Serviço","Serviço","1.7.3.4.1.","AGETOP",81973,"JUNCAO SIMPLES DIAM. 100 X 50 MM","Un    ",1]
[4,4,4,2,1,7,3,5,0,6,2,"","Nível 4","Nível 4","1.7.3.5.","SINAPI",null,"TÊ","-"]
["S",4,"S",0,1,7,3,5,0,0,0,"","Serviço","Serviço","1.7.3.5.1.","SINAPI",89825,"TE, PVC, SERIE NORMAL, ESGOTO PREDIAL, DN 50 X 50 MM, JUNTA ELÁSTICA, FORNECIDO E INSTALADO EM PRUMADA DE ESGOTO SANITÁRIO OU VENTILAÇÃO. AF_12/2014","UN",1]
[4,4,4,4,1,7,3,6,0,4,{"$error":"#N/A"},"","Nível 4","Nível 4","1.7.3.6.","SINAPI",null,"TUBOS","-"]
["S",4,"S",0,1,7,3,6,0,0,0,"","Serviço","Serviço","1.7.3.6.1.","SINAPI",89711,"TUBO PVC, SERIE NORMAL, ESGOTO PREDIAL, DN 40 MM, FORNECIDO E INSTALADO EM RAMAL DE DESCARGA OU RAMAL DE ESGOTO SANITÁRIO. AF_12/2014","M",2]
["S",4,"S",0,1,7,3,6,0,0,0,"","Serviço","Serviço","1.7.3.6.2.","SINAPI",89798,"TUBO PVC, SERIE NORMAL, ESGOTO PREDIAL, DN 50 MM, FORNECIDO E INSTALADO EM PRUMADA DE ESGOTO SANITÁRIO OU VENTILAÇÃO. AF_12/2014","M",2]
["S",4,"S",0,1,7,3,6,0,{"$f":"IF(OR($C148=\"S\",$C148=0),0,MATCH(0,OFFSET($D148,1,$C148,ROW($C$240)-ROW($C148)),0))","v":0},{"$f":"IF(OR($C148=\"S\",$C148=0),0,MATCH(OFFSET($D148,0,$C148)+1,OFFSET($D148,1,$C148,ROW($C$240)-ROW($C148)),0))","v":0},"","Serviço","Serviço","1.7.3.6.3.","SINAPI",89800,"TUBO PVC, SERIE NORMAL, ESGOTO PREDIAL, DN 100 MM, FORNECIDO E INSTALADO EM PRUMADA DE ESGOTO SANITÁRIO OU VENTILAÇÃO. AF_12/2014","M",17]
[3,3,3,4,1,7,4,0,0,10,4,"","Nível 3","Nível 3","1.7.4.","SINAPI",null,"OUTROS","-"]
["S",3,"S",0,1,7,4,0,0,0,0,"","Serviço","Serviço","1.7.4.0.1.","AGETOP",81825,"CAIXA DE PASSAGEM 60 X 60 CM SEM TAMPA","Un    ",1]
["S",3,"S",0,1,7,4,0,0,0,0,"","Serviço","Serviço","1.7.4.0.2.","AGETOP",81826,"TAMPA EM CONCRETO ARMADO 25 MPA E=5CM PARA A CAIXA DE PASSAGEM 60X60CM","Un    ",1]
["S",3,"S",0,1,7,4,0,0,0,0,"","Serviço","Serviço","1.7.4.0.3.","AGETOP",81885,"TERMINAL DE VENTILACAO DIAMETRO 50 MM","Un    ",1]
[{"$f":"CHOOSE(1+LOG(1+2*(ORÇAMENTO.Nivel=\"Nível 1\")+4*(ORÇAMENTO.Nivel=\"Nível 2\")+8*(ORÇAMENTO.Nivel=\"Nível 3\")+16*(ORÇAMENTO.Nivel=\"Nível 4\")+32*(ORÇAMENTO.Nivel=\"Serviço\"),2),0,1,2,3,4,\"S\")","v":3},3,3,6,1,7,5,0,0,6,{"$error":"#N/A"},"","Nível 3","Nível 3","1.7.5.","SINAPI",null,"INST. DE INCÊNDIO","-"]
["S",3,"S",0,1,7,5,0,0,0,0,"","Serviço","Serviço","1.7.5.0.1.","AGETOP",85003,"EXTINTOR PO QUIMICO SECO (6 KG) - CAPACIDADE EXTINTORA 20 BC","Un    ",8]
["S",3,"S",0,1,7,5,0,0,0,0,"","Serviço","Serviço","1.7.5.0.2.","AGETOP",85005,"EXTINTOR AGUA PRESSURIZADA (10 LITROS) - CAPACIDADE EXTINTORA 2A","Un    ",6]
["S",3,"S",0,1,7,5,0,0,0,0,"","Serviço","Serviço","1.7.5.0.3.","COMPOSIÇÃO","COMP 024_SEE","SINALIZADOR FOTOLUMINESCENTE PARA EXTINTOR","UN ",8]
["S",3,"S",0,1,7,5,0,0,0,0,"","Serviço","Serviço","1.7.5.0.4.","COMPOSIÇÃO","COMP 025_SEE","SINALIZADOR FOTOLUMINESCENTE DE EMERGÊNCIA","UN ",8]
["S",3,"S",0,1,7,5,0,0,0,0,"","Serviço","Serviço","1.7.5.0.5.","AGETOP",71598,"LUMINÁRIA DE EMERGÊNCIA 30 LEDS","un    ",16]
[{"$f":"CHOOSE(1+LOG(1+2*(ORÇAMENTO.Nivel=\"Nível 1\")+4*(ORÇAMENTO.Nivel=\"Nível 2\")+8*(ORÇAMENTO.Nivel=\"Nível 3\")+16*(ORÇAMENTO.Nivel=\"Nível 4\")+32*(ORÇAMENTO.Nivel=\"Serviço\"),2),0,1,2,3,4,\"S\")","v":2},{"$f":"IF(OR(C159=\"s\",C159=0),OFFSET(B159,-1,0),C159)","v":2},{"$f":"IF(OFFSET(C159,-1,0)=\"L\",1,IF(OFFSET(C159,-1,0)=1,2,IF(OR(A159=\"s\",A159=0),\"S\",IF(AND(OFFSET(C159,-1,0)=2,A159=4),3,IF(AND(OR(OFFSET(C159,-1,0)=\"s\",OFFSET(C159,-1,0)=0),A159<>\"s\",A159>OFFSET(B159,-1,0)),OFFSET(B159,-1,0),A159)))))","v":2},{"$f":"IF(OR(C159=\"S\",C159=0),0,IF(ISERROR(K159),J159,SMALL(J159:K159,1)))","v":28},{"$f":"IF($C159=1,OFFSET(E159,-1,0)+1,OFFSET(E159,-1,0))","v":1},{"$f":"IF($C159=1,0,IF($C159=2,OFFSET(F159,-1,0)+1,OFFSET(F159,-1,0)))","v":8},{"$f":"IF(AND($C159<=2,$C159<>0),0,IF($C159=3,OFFSET(G159,-1,0)+1,OFFSET(G159,-1,0)))","v":0},{"$f":"IF(AND($C159<=3,$C159<>0),0,IF($C159=4,OFFSET(H159,-1,0)+1,OFFSET(H159,-1,0)))","v":0},{"$f":"IF(AND($C159<=4,$C159<>0),0,IF(AND($C159=\"S\",$W159>0),OFFSET(I159,-1,0)+1,OFFSET(I159,-1,0)))","v":0},81,28,{"$f":"IF(OR(W159>0,$C159=1),\"F\",\"\")","v":""},"Nível 2",{"$f":"CHOOSE(1+LOG(1+2*(C159=1)+4*(C159=2)+8*(C159=3)+16*(C159=4)+32*(C159=\"S\"),2),\"\",\"Nível 1\",\"Nível 2\",\"Nível 3\",\"Nível 4\",\"Serviço\")","v":"Nível 2"},"1.8.",null,null,"INSTALAÇÕES ESPECIAIS","-"]
["S",2,"S",0,1,8,0,0,0,0,0,"","Serviço","Serviço","1.8.0.0.1.","AGETOP",91007,"CENTRAL DE GÁS PADRÃO GOINFRA SEM INSTALAÇÕES (1+1 CILINDRO 45 KG)","Un    ",1]
["S",2,"S",0,1,8,0,0,0,0,0,"","Serviço","Serviço","1.8.0.0.2.","AGETOP",91023,"UNIÃO S/BRONZE PRETA 3/4\" NPT 300 LBS","Un    ",3]
["S",2,"S",0,1,8,0,0,0,0,0,"","Serviço","Serviço","1.8.0.0.3.","COMPOSIÇÃO","COMP 382_SEE","TE DE REDUCAO DE FERRO GALVANIZADO, COM ROSCA BSP, DE 3/4\" X 1/2\"","UN ",1]
["S",2,"S",0,1,8,0,0,0,0,0,"","Serviço","Serviço","1.8.0.0.4.","COMPOSIÇÃO","COMP 383_SEE","BUCHA DE REDUCAO DE FERRO GALVANIZADO, COM ROSCA BSP, DE 1/2\" X 1/4\"","UN ",3]
["S",2,"S",0,1,8,0,0,0,0,0,"","Serviço","Serviço","1.8.0.0.5.","AGETOP",91021,"LUVA GALVANIZADO DE REDUÇÃO 3/4\" X 1/2\" (GÁS)","Un    ",2]
["S",2,"S",0,1,8,0,0,0,0,0,"","Serviço","Serviço","1.8.0.0.6.","SINAPI",92692,"NIPLE, EM FERRO GALVANIZADO, CONEXÃO ROSQUEADA, DN 15 (1/2\"), INSTALADO EM RAMAIS E SUB-RAMAIS DE GÁS - FORNECIMENTO E INSTALAÇÃO. AF_12/2015","UN",6]
["S",2,"S",0,1,8,0,0,0,0,0,"","Serviço","Serviço","1.8.0.0.7.","AGETOP",91031,"NIPLE DUPLO 300 PSI 3/4\"","Un    ",6]
["S",2,"S",0,1,8,0,0,0,0,0,"","Serviço","Serviço","1.8.0.0.8.","COMPOSIÇÃO","COMP 212_SEE","NIPLE DE REDUÇÃO 1/2\" X 1/4\" BSP","UN ",4]
["S",2,"S",0,1,8,0,0,0,0,0,"","Serviço","Serviço","1.8.0.0.9.","COMPOSIÇÃO","COMP 213_SEE","NIPLE DE REDUÇÃO 3/4\" X 1/2\" BSP","UN ",4]
["S",2,"S",0,1,8,0,0,0,0,0,"","Serviço","Serviço","1.8.0.0.10.","SINAPI",92688,"TUBO DE AÇO GALVANIZADO COM COSTURA, CLASSE MÉDIA, CONEXÃO ROSQUEADA, DN 20 (3/4\"), INSTALADO EM RAMAIS E SUB-RAMAIS DE GÁS - FORNECIMENTO E INSTALAÇÃO. AF_12/2015","M",18]
["S",2,"S",0,1,8,0,0,0,0,0,"","Serviço","Serviço","1.8.0.0.11.","SINAPI",92701,"JOELHO 90 GRAUS, EM FERRO GALVANIZADO, CONEXÃO ROSQUEADA, DN 20 (3/4\"), INSTALADO EM RAMAIS E SUB-RAMAIS DE GÁS - FORNECIMENTO E INSTALAÇÃO. AF_12/2015","UN",7]
["S",2,"S",0,1,8,0,0,0,0,0,"","Serviço","Serviço","1.8.0.0.12.","COMPOSIÇÃO","COMP 237_SEE","FITA ANTICORROSIVA","M",7]
["S",2,"S",0,1,8,0,0,0,0,0,"","Serviço","Serviço","1.8.0.0.13.","AGETOP",91025,"VÁLVULA ESFERICA LATÃO 3/4\"","Un    ",3]
["S",2,"S",0,1,8,0,0,0,0,0,"","Serviço","Serviço","1.8.0.0.14.","AGETOP",91019,"TE PRETO 90º 3/4\" NPT 300 LBS","Un    ",2]
["S",2,"S",0,1,8,0,0,0,0,0,"","Serviço","Serviço","1.8.0.0.15.","COMPOSIÇÃO","COMP 542_SEE","VÁLVULA UGV 3/4\" (S) LATÃO","UN ",3]
["S",2,"S",0,1,8,0,0,0,0,0,"","Serviço","Serviço","1.8.0.0.16.","COMPOSIÇÃO","COMP 543_SEE","VÁLVULA UGV 1/2\" (S) LATÃO","UN ",3]
["S",2,"S",0,1,8,0,0,0,0,0,"","Serviço","Serviço","1.8.0.0.17.","AGETOP",91029,"VALVULA DE RETENÇÃO LATÃO 1/2\" X 7/16\" NPT","Un    ",3]
["S",2,"S",0,1,8,0,0,0,0,0,"","Serviço","Serviço","1.8.0.0.18.","COMPOSIÇÃO","COMP 211_SEE","REGULADOR DE 2º ESTÁGIO 5KG/H","UN ",3]
["S",2,"S",0,1,8,0,0,0,0,0,"","Serviço","Serviço","1.8.0.0.19.","COMPOSIÇÃO","COMP 210_SEE","REGULADOR DE 1º ESTÁGIO 60KG/H MODELO AP-40  COM MANÔMETRO","UN ",1]
["S",2,"S",0,1,8,0,0,0,0,0,"","Serviço","Serviço","1.8.0.0.20.","AGETOP",85003,"EXTINTOR PO QUIMICO SECO (6 KG) - CAPACIDADE EXTINTORA 20 BC","Un    ",1]
["S",2,"S",0,1,8,0,0,0,{"$f":"IF(OR($C180=\"S\",$C180=0),0,MATCH(0,OFFSET($D180,1,$C180,ROW($C$240)-ROW($C180)),0))","v":0},{"$f":"IF(OR($C180=\"S\",$C180=0),0,MATCH(OFFSET($D180,0,$C180)+1,OFFSET($D180,1,$C180,ROW($C$240)-ROW($C180)),0))","v":0},"","Serviço","Serviço","1.8.0.0.21.","COMPOSIÇÃO","COMP 235_SEE","PLACA DE SINALIZAÇÃO EM PVC COD 01 - (300X300) PROIBIDO FUMAR","UN ",2]
["S",2,"S",0,1,8,0,0,0,0,0,"","Serviço","Serviço","1.8.0.0.22.","COMPOSIÇÃO","COMP 236_SEE","PLACA DE SINALIZAÇÃO EM PVC COD 06 - (300X300) PERIGO INFLAMÁVEL","UN ",2]
["S",2,"S",0,1,8,0,0,0,0,0,"","Serviço","Serviço","1.8.0.0.23.","AGETOP",91043,"BRAÇADEIRA METALICA TIPO \"D\" DIAM. 3/4\"","Un    ",7]
["S",2,"S",0,1,8,0,0,0,0,0,"","Serviço","Serviço","1.8.0.0.24.","AGETOP",71863,"PARAFUSO P/BUCHA S-10","Un    ",14]
["S",2,"S",0,1,8,0,0,0,0,0,"","Serviço","Serviço","1.8.0.0.25.","AGETOP",70393,"BUCHA DE NYLON S-10","Un    ",14]
["S",2,"S",0,1,8,0,0,0,0,0,"","Serviço","Serviço","1.8.0.0.26.","AGETOP",91045,"SUPORTE PARA COLETOR","Un    ",2]
["S",2,"S",0,1,8,0,0,0,0,0,"","Serviço","Serviço","1.8.0.0.27.","COMPOSIÇÃO","COMP 045_SEE","LAUDO DE ESTANQUEIDADE","UN ",1]
[2,2,2,3,1,9,0,0,0,53,3,"","Nível 2","Nível 2","1.9.","AGETOP",91045,"ALVENARIAS E DIVISÓRIAS","Un    "]
[{"$f":"CHOOSE(1+LOG(1+2*(ORÇAMENTO.Nivel=\"Nível 1\")+4*(ORÇAMENTO.Nivel=\"Nível 2\")+8*(ORÇAMENTO.Nivel=\"Nível 3\")+16*(ORÇAMENTO.Nivel=\"Nível 4\")+32*(ORÇAMENTO.Nivel=\"Serviço\"),2),0,1,2,3,4,\"S\")","v":3},3,3,2,1,9,1,0,0,2,18,"","Nível 3","Nível 3","1.9.1.","SINAPI",null,"SANITÁRIO PROFESSORES","-"]
[{"$f":"CHOOSE(1+LOG(1+2*(ORÇAMENTO.Nivel=\"Nível 1\")+4*(ORÇAMENTO.Nivel=\"Nível 2\")+8*(ORÇAMENTO.Nivel=\"Nível 3\")+16*(ORÇAMENTO.Nivel=\"Nível 4\")+32*(ORÇAMENTO.Nivel=\"Serviço\"),2),0,1,2,3,4,\"S\")","v":"S"},3,"S",0,1,9,1,0,0,0,0,"","Serviço","Serviço","1.9.1.0.1.","SINAPI",87520,"ALVENARIA DE VEDAÇÃO DE BLOCOS CERÂMICOS FURADOS NA HORIZONTAL DE 9X19X19CM (ESPESSURA 9CM) DE PAREDES COM ÁREA LÍQUIDA MAIOR OU IGUAL A 6M² COM VÃOS E ARGAMASSA DE ASSENTAMENTO COM PREPARO MANUAL. AF_06/2014","M2",16.760000000000002]
[{"$f":"CHOOSE(1+LOG(1+2*(ORÇAMENTO.Nivel=\"Nível 1\")+4*(ORÇAMENTO.Nivel=\"Nível 2\")+8*(ORÇAMENTO.Nivel=\"Nível 3\")+16*(ORÇAMENTO.Nivel=\"Nível 4\")+32*(ORÇAMENTO.Nivel=\"Serviço\"),2),0,1,2,3,4,\"S\")","v":2},2,2,3,1,10,0,0,0,50,3,"","Nível 2","Nível 2","1.10.","SINAPI",null,"IMPERMEABILIZAÇÃO","-"]
[{"$f":"CHOOSE(1+LOG(1+2*(ORÇAMENTO.Nivel=\"Nível 1\")+4*(ORÇAMENTO.Nivel=\"Nível 2\")+8*(ORÇAMENTO.Nivel=\"Nível 3\")+16*(ORÇAMENTO.Nivel=\"Nível 4\")+32*(ORÇAMENTO.Nivel=\"Serviço\"),2),0,1,2,3,4,\"S\")","v":3},{"$f":"IF(OR(C191=\"s\",C191=0),OFFSET(B191,-1,0),C191)","v":3},{"$f":"IF(OFFSET(C191,-1,0)=\"L\",1,IF(OFFSET(C191,-1,0)=1,2,IF(OR(A191=\"s\",A191=0),\"S\",IF(AND(OFFSET(C191,-1,0)=2,A191=4),3,IF(AND(OR(OFFSET(C191,-1,0)=\"s\",OFFSET(C191,-1,0)=0),A191<>\"s\",A191>OFFSET(B191,-1,0)),OFFSET(B191,-1,0),A191)))))","v":3},{"$f":"IF(OR(C191=\"S\",C191=0),0,IF(ISERROR(K191),J191,SMALL(J191:K191,1)))","v":2},{"$f":"IF($C191=1,OFFSET(E191,-1,0)+1,OFFSET(E191,-1,0))","v":1},{"$f":"IF($C191=1,0,IF($C191=2,OFFSET(F191,-1,0)+1,OFFSET(F191,-1,0)))","v":10},{"$f":"IF(AND($C191<=2,$C191<>0),0,IF($C191=3,OFFSET(G191,-1,0)+1,OFFSET(G191,-1,0)))","v":1},{"$f":"IF(AND($C191<=3,$C191<>0),0,IF($C191=4,OFFSET(H191,-1,0)+1,OFFSET(H191,-1,0)))","v":0},{"$f":"IF(AND($C191<=4,$C191<>0),0,IF(AND($C191=\"S\",$W191>0),OFFSET(I191,-1,0)+1,OFFSET(I191,-1,0)))","v":0},2,15,{"$f":"IF(OR(W191>0,$C191=1),\"F\",\"\")","v":""},"Nível 3",{"$f":"CHOOSE(1+LOG(1+2*(C191=1)+4*(C191=2)+8*(C191=3)+16*(C191=4)+32*(C191=\"S\"),2),\"\",\"Nível 1\",\"Nível 2\",\"Nível 3\",\"Nível 4\",\"Serviço\")","v":"Nível 3"},"1.10.1.","SINAPI",null,"FUNDAÇÃO","-"]
[{"$f":"CHOOSE(1+LOG(1+2*(ORÇAMENTO.Nivel=\"Nível 1\")+4*(ORÇAMENTO.Nivel=\"Nível 2\")+8*(ORÇAMENTO.Nivel=\"Nível 3\")+16*(ORÇAMENTO.Nivel=\"Nível 4\")+32*(ORÇAMENTO.Nivel=\"Serviço\"),2),0,1,2,3,4,\"S\")","v":"S"},3,"S",0,1,10,1,0,0,0,0,"","Serviço","Serviço","1.10.1.0.1.","SINAPI","74106/1","IMPERMEABILIZACAO DE ESTRUTURAS ENTERRADAS, COM TINTA ASFALTICA, DUAS DEMAOS.","M2",3.11]
[{"$f":"CHOOSE(1+LOG(1+2*(ORÇAMENTO.Nivel=\"Nível 1\")+4*(ORÇAMENTO.Nivel=\"Nível 2\")+8*(ORÇAMENTO.Nivel=\"Nível 3\")+16*(ORÇAMENTO.Nivel=\"Nível 4\")+32*(ORÇAMENTO.Nivel=\"Serviço\"),2),0,1,2,3,4,\"S\")","v":2},2,2,4,1,11,0,0,0,47,4,"","Nível 2","Nível 2","1.11.",null,null,"ESQUADRIAS METÁLICAS","-"]
[3,3,3,3,1,11,1,0,0,3,12,"","Nível 3","Nível 3","1.11.1.","SINAPI",null,"SANITÁRIO PROFESSORES","-"]
["S",3,"S",0,1,11,1,0,0,0,0,"","Serviço","Serviço","1.11.1.0.1.","AGETOP",180509,"PORTA ABRIR CH.P/WC PF-10 C/FERRAGENS","m2    ",2.52]
["S",3,"S",0,1,11,1,0,0,0,0,"","Serviço","Serviço","1.11.1.0.2.","AGETOP",180403,"ESQ.MAXIMO AR CHAPA/VIDRO J1/J2/J7/J15 C/FERRAGENS","m2    ",1.1825000000000001]
[2,{"$f":"IF(OR(C197=\"s\",C197=0),OFFSET(B197,-1,0),C197)","v":2},{"$f":"IF(OFFSET(C197,-1,0)=\"L\",1,IF(OFFSET(C197,-1,0)=1,2,IF(OR(A197=\"s\",A197=0),\"S\",IF(AND(OFFSET(C197,-1,0)=2,A197=4),3,IF(AND(OR(OFFSET(C197,-1,0)=\"s\",OFFSET(C197,-1,0)=0),A197<>\"s\",A197>OFFSET(B197,-1,0)),OFFSET(B197,-1,0),A197)))))","v":2},{"$f":"IF(OR(C197=\"S\",C197=0),0,IF(ISERROR(K197),J197,SMALL(J197:K197,1)))","v":3},{"$f":"IF($C197=1,OFFSET(E197,-1,0)+1,OFFSET(E197,-1,0))","v":1},{"$f":"IF($C197=1,0,IF($C197=2,OFFSET(F197,-1,0)+1,OFFSET(F197,-1,0)))","v":12},{"$f":"IF(AND($C197<=2,$C197<>0),0,IF($C197=3,OFFSET(G197,-1,0)+1,OFFSET(G197,-1,0)))","v":0},{"$f":"IF(AND($C197<=3,$C197<>0),0,IF($C197=4,OFFSET(H197,-1,0)+1,OFFSET(H197,-1,0)))","v":0},{"$f":"IF(AND($C197<=4,$C197<>0),0,IF(AND($C197=\"S\",$W197>0),OFFSET(I197,-1,0)+1,OFFSET(I197,-1,0)))","v":0},43,3,{"$f":"IF(OR(W197>0,$C197=1),\"F\",\"\")","v":""},"Nível 2",{"$f":"CHOOSE(1+LOG(1+2*(C197=1)+4*(C197=2)+8*(C197=3)+16*(C197=4)+32*(C197=\"S\"),2),\"\",\"Nível 1\",\"Nível 2\",\"Nível 3\",\"Nível 4\",\"Serviço\")","v":"Nível 2"},"1.12.",null,null,"VIDROS","-"]
[{"$f":"CHOOSE(1+LOG(1+2*(ORÇAMENTO.Nivel=\"Nível 1\")+4*(ORÇAMENTO.Nivel=\"Nível 2\")+8*(ORÇAMENTO.Nivel=\"Nível 3\")+16*(ORÇAMENTO.Nivel=\"Nível 4\")+32*(ORÇAMENTO.Nivel=\"Serviço\"),2),0,1,2,3,4,\"S\")","v":3},3,3,2,1,12,1,0,0,2,8,"","Nível 3","Nível 3","1.12.1.","SINAPI",null,"SANITÁRIO PROFESSORES","-"]
[{"$f":"CHOOSE(1+LOG(1+2*(ORÇAMENTO.Nivel=\"Nível 1\")+4*(ORÇAMENTO.Nivel=\"Nível 2\")+8*(ORÇAMENTO.Nivel=\"Nível 3\")+16*(ORÇAMENTO.Nivel=\"Nível 4\")+32*(ORÇAMENTO.Nivel=\"Serviço\"),2),0,1,2,3,4,\"S\")","v":"S"},3,"S",0,1,12,1,0,0,0,0,"","Serviço","Serviço","1.12.1.0.1.","SINAPI",72117,"VIDRO LISO COMUM TRANSPARENTE, ESPESSURA 4MM","M2",1.18]
[{"$f":"CHOOSE(1+LOG(1+2*(ORÇAMENTO.Nivel=\"Nível 1\")+4*(ORÇAMENTO.Nivel=\"Nível 2\")+8*(ORÇAMENTO.Nivel=\"Nível 3\")+16*(ORÇAMENTO.Nivel=\"Nível 4\")+32*(ORÇAMENTO.Nivel=\"Serviço\"),2),0,1,2,3,4,\"S\")","v":2},2,2,11,1,13,0,0,0,40,11,"","Nível 2","Nível 2","1.13.",null,null,"REVESTIMENTO DE PAREDE","-"]
[3,3,3,5,1,13,1,0,0,10,5,"","Nível 3","Nível 3","1.13.1.","SINAPI",null,"SANITÁRIO PROFESSORES","-"]
["S",3,"S",0,1,13,1,0,0,0,0,"","Serviço","Serviço","1.13.1.0.1.","SINAPI",87904,"CHAPISCO APLICADO EM ALVENARIA (COM PRESENÇA DE VÃOS) E ESTRUTURAS DE CONCRETO DE FACHADA, COM COLHER DE PEDREIRO.  ARGAMASSA TRAÇO 1:3 COM PREPARO MANUAL. AF_06/2014","M2",33.520000000000003]
["S",3,"S",0,1,13,1,0,0,0,0,"","Serviço","Serviço","1.13.1.0.2.","SINAPI",87547,"MASSA ÚNICA, PARA RECEBIMENTO DE PINTURA, EM ARGAMASSA TRAÇO 1:2:8, PREPARO MECÂNICO COM BETONEIRA 400L, APLICADA MANUALMENTE EM FACES INTERNAS DE PAREDES, ESPESSURA DE 10MM, COM EXECUÇÃO DE TALISCAS. AF_06/2014","M2",9.8800000000000008]
["S",3,"S",0,1,13,1,0,0,0,0,"","Serviço","Serviço","1.13.1.0.3.","SINAPI",87553,"EMBOÇO, PARA RECEBIMENTO DE CERÂMICA, EM ARGAMASSA TRAÇO 1:2:8, PREPARO MECÂNICO COM BETONEIRA 400L, APLICADO MANUALMENTE EM FACES INTERNAS DE PAREDES, PARA AMBIENTE COM ÁREA MAIOR QUE 10M2, ESPESSURA DE 10MM, COM EXECUÇÃO DE TALISCAS. AF_06/2014","M2",23.64]
["S",3,"S",0,1,13,1,0,0,0,0,"","Serviço","Serviço","1.13.1.0.4.","SINAPI",87273,"REVESTIMENTO CERÂMICO PARA PAREDES INTERNAS COM PLACAS TIPO ESMALTADA EXTRA DE DIMENSÕES 33X45 CM APLICADAS EM AMBIENTES DE ÁREA MAIOR QUE 5 M² NA ALTURA INTEIRA DAS PAREDES. AF_06/2014","M2",23.64]
[3,3,3,3,1,13,2,0,0,5,3,"","Nível 3","Nível 3","1.13.2.","SINAPI",null,"DESPENSA","-"]
["S",3,"S",0,1,13,2,0,0,{"$f":"IF(OR($C207=\"S\",$C207=0),0,MATCH(0,OFFSET($D207,1,$C207,ROW($C$240)-ROW($C207)),0))","v":0},{"$f":"IF(OR($C207=\"S\",$C207=0),0,MATCH(OFFSET($D207,0,$C207)+1,OFFSET($D207,1,$C207,ROW($C$240)-ROW($C207)),0))","v":0},"","Serviço","Serviço","1.13.2.0.1.","SINAPI",87553,"EMBOÇO, PARA RECEBIMENTO DE CERÂMICA, EM ARGAMASSA TRAÇO 1:2:8, PREPARO MECÂNICO COM BETONEIRA 400L, APLICADO MANUALMENTE EM FACES INTERNAS DE PAREDES, PARA AMBIENTE COM ÁREA MAIOR QUE 10M2, ESPESSURA DE 10MM, COM EXECUÇÃO DE TALISCAS. AF_06/2014","M2",48.24]
["S",3,"S",0,1,13,2,0,0,0,0,"","Serviço","Serviço","1.13.2.0.2.","SINAPI",87273,"REVESTIMENTO CERÂMICO PARA PAREDES INTERNAS COM PLACAS TIPO ESMALTADA EXTRA DE DIMENSÕES 33X45 CM APLICADAS EM AMBIENTES DE ÁREA MAIOR QUE 5 M² NA ALTURA INTEIRA DAS PAREDES. AF_06/2014","M2",48.24]
[3,3,3,2,1,13,3,0,0,2,9,"","Nível 3","Nível 3","1.13.3.","AGETOP",200505,"SANITÁRIO LABORATÓRIO","m2    "]
["S",3,"S",0,1,13,3,0,0,0,0,"","Serviço","Serviço","1.13.3.0.1.","AGETOP",200505,"REB.PAULISTA C/IMPERM.A-15 (1CI:4ARMLC+5% IMPXCI)","m2    ",1.08]
[2,2,2,12,1,14,0,0,0,29,12,"","Nível 2","Nível 2","1.14.",null,null,"REVESTIMENTO DE PISO","-"]
[3,3,3,2,1,14,1,0,0,11,2,"","Nível 3","Nível 3","1.14.1.","SINAPI",null,"SANITÁRIO PROFESSORES","-"]
["S",3,"S",0,1,14,1,0,0,{"$f":"IF(OR($C213=\"S\",$C213=0),0,MATCH(0,OFFSET($D213,1,$C213,ROW($C$240)-ROW($C213)),0))","v":0},{"$f":"IF(OR($C213=\"S\",$C213=0),0,MATCH(OFFSET($D213,0,$C213)+1,OFFSET($D213,1,$C213,ROW($C$240)-ROW($C213)),0))","v":0},"","Serviço","Serviço","1.14.1.0.1.","SINAPI",87251,"REVESTIMENTO CERÂMICO PARA PISO COM PLACAS TIPO ESMALTADA EXTRA DE DIMENSÕES 45X45 CM APLICADA EM AMBIENTES DE ÁREA MAIOR QUE 10 M2. AF_06/2014","M2",4.4000000000000004]
[3,3,3,2,1,14,2,0,0,9,2,"","Nível 3","Nível 3","1.14.2.","SINAPI",null,"ACESSIBILIDADE","-"]
["S",3,"S",0,1,14,2,0,0,0,0,"","Serviço","Serviço","1.14.2.0.1.","AGETOP",221120,"PISO DE BORRACHA COLORIDO MODELO TÁTIL ( ALERTA OU DIRECIONAL) INCLUSO CONTRAPISO (1CI:3ARML) C/ E=2CM E NATA DE CIMENTO","m2    ",8.4499999999999993]
[3,3,3,2,1,14,3,0,0,7,2,"","Nível 3","Nível 3","1.14.3.","SINAPI",null,"CENTRAL DE GÁS","-"]
["S",3,"S",0,1,14,3,0,0,0,0,"","Serviço","Serviço","1.14.3.0.1.","AGETOP",220102,"PISO CONCRETO DESEMPENADO ESPESSURA = 5 CM  1:2,5:3,5","m2    ",1.24]
[3,3,3,5,1,14,4,0,0,5,{"$error":"#N/A"},"","Nível 3","Nível 3","1.14.4.","SINAPI",null,"INST. HIDROSSANITÁRIAS","-"]
[{"$f":"CHOOSE(1+LOG(1+2*(ORÇAMENTO.Nivel=\"Nível 1\")+4*(ORÇAMENTO.Nivel=\"Nível 2\")+8*(ORÇAMENTO.Nivel=\"Nível 3\")+16*(ORÇAMENTO.Nivel=\"Nível 4\")+32*(ORÇAMENTO.Nivel=\"Serviço\"),2),0,1,2,3,4,\"S\")","v":"S"},{"$f":"IF(OR(C219=\"s\",C219=0),OFFSET(B219,-1,0),C219)","v":3},{"$f":"IF(OFFSET(C219,-1,0)=\"L\",1,IF(OFFSET(C219,-1,0)=1,2,IF(OR(A219=\"s\",A219=0),\"S\",IF(AND(OFFSET(C219,-1,0)=2,A219=4),3,IF(AND(OR(OFFSET(C219,-1,0)=\"s\",OFFSET(C219,-1,0)=0),A219<>\"s\",A219>OFFSET(B219,-1,0)),OFFSET(B219,-1,0),A219)))))","v":"S"},{"$f":"IF(OR(C219=\"S\",C219=0),0,IF(ISERROR(K219),J219,SMALL(J219:K219,1)))","v":0},{"$f":"IF($C219=1,OFFSET(E219,-1,0)+1,OFFSET(E219,-1,0))","v":1},{"$f":"IF($C219=1,0,IF($C219=2,OFFSET(F219,-1,0)+1,OFFSET(F219,-1,0)))","v":14},{"$f":"IF(AND($C219<=2,$C219<>0),0,IF($C219=3,OFFSET(G219,-1,0)+1,OFFSET(G219,-1,0)))","v":4},{"$f":"IF(AND($C219<=3,$C219<>0),0,IF($C219=4,OFFSET(H219,-1,0)+1,OFFSET(H219,-1,0)))","v":0},{"$f":"IF(AND($C219<=4,$C219<>0),0,IF(AND($C219=\"S\",$W219>0),OFFSET(I219,-1,0)+1,OFFSET(I219,-1,0)))","v":0},{"$f":"IF(OR($C219=\"S\",$C219=0),0,MATCH(0,OFFSET($D219,1,$C219,ROW($C$240)-ROW($C219)),0))","v":0},{"$f":"IF(OR($C219=\"S\",$C219=0),0,MATCH(OFFSET($D219,0,$C219)+1,OFFSET($D219,1,$C219,ROW($C$240)-ROW($C219)),0))","v":0},{"$f":"IF(OR(W219>0,$C219=1),\"F\",\"\")","v":""},"Serviço",{"$f":"CHOOSE(1+LOG(1+2*(C219=1)+4*(C219=2)+8*(C219=3)+16*(C219=4)+32*(C219=\"S\"),2),\"\",\"Nível 1\",\"Nível 2\",\"Nível 3\",\"Nível 4\",\"Serviço\")","v":"Serviço"},"1.14.4.0.1.","AGETOP",220102,"PISO CONCRETO DESEMPENADO ESPESSURA = 5 CM  1:2,5:3,5","m2    ",2.2000000000000002]
["S",3,"S",0,1,14,4,0,0,0,0,"","Serviço","Serviço","1.14.4.0.2.","AGETOP",220101,"LASTRO DE CONCRETO REGULARIZADO IMPERMEABILIZADO 1:3:6 ESP=5CM (BASE)","m2    ",0.14000000000000001]
["S",3,"S",0,1,14,4,0,0,0,0,"","Serviço","Serviço","1.14.4.0.3.","SINAPI",84191,"PISO EM GRANILITE, MARMORITE OU GRANITINA ESPESSURA 8 MM, INCLUSO JUNTAS DE DILATACAO PLASTICAS","M2",0.23]
["S",3,"S",0,1,14,4,0,0,0,0,"","Serviço","Serviço","1.14.4.0.4.","AGETOP",221104,"RASPAGEM E APLICAÇÃO RESINA ACRÍLICA DUAS DEMÃOS","m2    ",0.23]
[2,{"$f":"IF(OR(C223=\"s\",C223=0),OFFSET(B223,-1,0),C223)","v":2},{"$f":"IF(OFFSET(C223,-1,0)=\"L\",1,IF(OFFSET(C223,-1,0)=1,2,IF(OR(A223=\"s\",A223=0),\"S\",IF(AND(OFFSET(C223,-1,0)=2,A223=4),3,IF(AND(OR(OFFSET(C223,-1,0)=\"s\",OFFSET(C223,-1,0)=0),A223<>\"s\",A223>OFFSET(B223,-1,0)),OFFSET(B223,-1,0),A223)))))","v":2},{"$f":"IF(OR(C223=\"S\",C223=0),0,IF(ISERROR(K223),J223,SMALL(J223:K223,1)))","v":4},{"$f":"IF($C223=1,OFFSET(E223,-1,0)+1,OFFSET(E223,-1,0))","v":1},{"$f":"IF($C223=1,0,IF($C223=2,OFFSET(F223,-1,0)+1,OFFSET(F223,-1,0)))","v":15},{"$f":"IF(AND($C223<=2,$C223<>0),0,IF($C223=3,OFFSET(G223,-1,0)+1,OFFSET(G223,-1,0)))","v":0},{"$f":"IF(AND($C223<=3,$C223<>0),0,IF($C223=4,OFFSET(H223,-1,0)+1,OFFSET(H223,-1,0)))","v":0},{"$f":"IF(AND($C223<=4,$C223<>0),0,IF(AND($C223=\"S\",$W223>0),OFFSET(I223,-1,0)+1,OFFSET(I223,-1,0)))","v":0},17,4,{"$f":"IF(OR(W223>0,$C223=1),\"F\",\"\")","v":""},"Nível 2",{"$f":"CHOOSE(1+LOG(1+2*(C223=1)+4*(C223=2)+8*(C223=3)+16*(C223=4)+32*(C223=\"S\"),2),\"\",\"Nível 1\",\"Nível 2\",\"Nível 3\",\"Nível 4\",\"Serviço\")","v":"Nível 2"},"1.15.",null,null,"ADMINISTRAÇÃO","-"]
[3,3,3,3,1,15,1,0,0,3,8,"","Nível 3","Nível 3","1.15.1.",null,null,"MENSALISTAS","-"]
["S",3,"S",0,1,15,1,0,0,0,0,"","Serviço","Serviço","1.15.1.0.1.","SINAPI",90778,"ENGENHEIRO CIVIL DE OBRA PLENO COM ENCARGOS COMPLEMENTARES","H",12]
["S",3,"S",0,1,15,1,0,0,0,0,"","Serviço","Serviço","1.15.1.0.2.","SINAPI",90776,"ENCARREGADO GERAL COM ENCARGOS COMPLEMENTARES","H",110]
[{"$f":"CHOOSE(1+LOG(1+2*(ORÇAMENTO.Nivel=\"Nível 1\")+4*(ORÇAMENTO.Nivel=\"Nível 2\")+8*(ORÇAMENTO.Nivel=\"Nível 3\")+16*(ORÇAMENTO.Nivel=\"Nível 4\")+32*(ORÇAMENTO.Nivel=\"Serviço\"),2),0,1,2,3,4,\"S\")","v":2},2,2,8,1,16,0,0,0,13,8,"","Nível 2","Nível 2","1.16.",null,null,"PINTURA","-"]
[3,3,3,4,1,16,1,0,0,7,4,"","Nível 3","Nível 3","1.16.1.","SINAPI",null,"SANITÁRIO PROFESSORES","-"]
["S",3,"S",0,1,16,1,0,0,0,0,"","Serviço","Serviço","1.16.1.0.1.","AGETOP",261550,"PINT.ESMALTE SINT.PAREDES - 2 DEM.C/SELADOR","m2    ",4.9400000000000004]
["S",3,"S",0,1,16,1,0,0,0,0,"","Serviço","Serviço","1.16.1.0.2.","SINAPI",88489,"APLICAÇÃO MANUAL DE PINTURA COM TINTA LÁTEX ACRÍLICA EM PAREDES, DUAS DEMÃOS. AF_06/2014","M2",7.6000000000000005]
["S",3,"S",0,1,16,1,0,0,0,0,"","Serviço","Serviço","1.16.1.0.3.","SINAPI","74145/1","PINTURA ESMALTE FOSCO, DUAS DEMAOS, SOBRE SUPERFICIE METALICA, INCLUSO UMA DEMAO DE FUNDO ANTICORROSIVO. UTILIZACAO DE REVOLVER ( AR-COMPRIMIDO).","M2",17.48]
[3,3,3,3,1,16,2,0,0,3,{"$error":"#N/A"},"","Nível 3","Nível 3","1.16.2.","SINAPI",null,"SANITÁRIO LABORATÓRIO","-"]
["S",3,"S",0,1,16,2,0,0,0,0,"","Serviço","Serviço","1.16.2.0.1.","SINAPI",88497,"APLICAÇÃO E LIXAMENTO DE MASSA LÁTEX EM PAREDES, DUAS DEMÃOS. AF_06/2014","M2",1.08]
["S",3,"S",0,1,16,2,0,0,0,0,"","Serviço","Serviço","1.16.2.0.2.","SINAPI",88489,"APLICAÇÃO MANUAL DE PINTURA COM TINTA LÁTEX ACRÍLICA EM PAREDES, DUAS DEMÃOS. AF_06/2014","M2",2.4300000000000002]
[2,2,2,5,1,17,0,0,0,5,{"$error":"#N/A"},"","Nível 2","Nível 2","1.17.",null,null,"DIVERSOS","-"]
[3,3,3,2,1,17,1,0,0,4,2,"","Nível 3","Nível 3","1.17.1.","SINAPI",null,"SANITÁRIO PROFESSORES","-"]
["S",3,"S",0,1,17,1,0,0,0,0,"","Serviço","Serviço","1.17.1.0.1.","AGETOP",271608,"BANCADA DE GRANITO C/ESPELHO","m2    ",0.53]
[3,3,3,2,1,17,2,0,0,2,{"$error":"#N/A"},"","Nível 3","Nível 3","1.17.2.","SINAPI",null,"OUTROS","-"]
["S",3,"S",0,1,17,2,0,0,0,0,"","Serviço","Serviço","1.17.2.0.1.","AGETOP",270501,"LIMPEZA FINAL DE OBRA - (OBRAS CIVIS)","m2    ",160]
[-1,null,-1,null,0,0,0,0,0,null,null,"F"]
[null,null,null,null,null,null,null,null,null,null,null,"F",null,null,null,null,null,"OBS: OS QUANTITATIVOS DE MATERIAIS  DAS INSTALAÇÕES HIDROSSANITÁRIAS, ELÉTRICAS E ESPECIAIS SÃO FORNECIDOS PELOS PROFISSIONAIS RESPONSÁVEIS PELOS RESPECTIVOS PROJETOS.",null,null,"VALOR TOTAL"]
[null,null,null,null,null,null,null,null,null,null,null,"F",null,null,null,null,null,null,null,null,"VALOR BDI (26,34%)"]
[null,null,null,null,null,null,null,null,null,null,null,"F",null,null,null,null,null,null,null,null,"TOTAL ORÇAMENTO"]
[null,null,null,null,null,null,null,null,null,null,null,"F"]
[null,null,null,null,null,null,null,null,null,null,null,"F",null,null,null,null,null,null,null,null,"CUSTO POR M2 ³"]
[null,null,null,null,null,null,null,null,null,null,null,"F",null,null,null,null,null,null,null,null,"MATERIAL S/ BDI"]
[null,null,null,null,null,null,null,null,null,null,null,"F",null,null,null,null,null,null,null,null,"MÃO DE OBRA S/ BDI"]
[null,null,null,null,null,null,null,null,null,null,null,"F"]
[null,null,null,null,null,null,null,null,null,null,null,"F",null,null,null,null,"(1) Conforme previsto pelo DECRETO Nº 7.983, DE 8 DE ABRIL DE 2013, os preços adotados são aqueles constantes dos sistemas de referência indicados. Justifica-se o uso dos preços destas composições de custos unitários devido ao seu valor ser menor à mediana de seus correspondentes na tabela SINAPI;"]
[null,null,null,null,null,null,null,null,null,null,null,"F",null,null,null,null,"(2) Optou-se pelo uso das composições de custos da AGETOP para itens não presentes na SINAPI;"]
[null,null,null,null,null,null,null,null,null,null,null,"F",null,null,null,null,"(3) Para itens da AGETOP, os vidros não estão inclusos nas esquadrias e já foram considerados os custos de contramarco para as esquadrias de alumínio;"]
[null,null,null,null,null,null,null,null,null,null,null,"F",null,null,null,null,"(4) Nos casos em que houver execução de granitina e omissão do item AGETOP 221102, considerou-se que o quantitativo para o rodapé, de altura igual a 7cm, foi incorporado na área de piso;"]
[null,null,null,null,null,null,null,null,null,null,null,"F",null,null,null,null,"(5) O custo unitário aproximado por metro quadrado é calculado dividindo-se o valor total do orçamento pela área total de construção."]
[null,null,null,null,null,null,null,null,null,null,null,"F"]
[null,null,null,null,null,null,null,null,null,null,null,"F"]
[]
[null,null,null,null,null,null,null,null,null,null,null,null,null,null,"SOMATÓRIO DE SERVIÇOS"]
[null,null,null,null,null,null,null,null,null,null,null,null,null,null,"ITEM","DESCRIÇÃO DOS SERVIÇOS",null,null,"PREÇO SEM BDI",null,null,"PREÇO COM BDI",null,"PARTICIPAÇÃO ( % )"]
[null,null,null,null,null,null,null,null,null,null,null,null,null,null,"a.","SERVIÇOS PRELIMINARES",null,null,{"$f":"SUMIF($R$20:$R$240,$P259,$W$20:$W$240)","v":0},null,null,{"$f":"ROUND(S259*(1+BDI.Taxa),2)","v":0},null,{"$f":"IFERROR(ROUND($V259*100/$W$243,2),0)","v":0}]
[null,null,null,null,null,null,null,null,null,null,null,null,null,null,"b.","TRANSPORTES",null,null,0,null,null,0,null,{"$f":"IFERROR(ROUND($V260*100/$W$243,2),0)","v":0}]
[null,null,null,null,null,null,null,null,null,null,null,null,null,null,"c.","SERVIÇO EM TERRA",null,null,0,null,null,0,null,0]
[null,null,null,null,null,null,null,null,null,null,null,null,null,null,"d.","FUNDAÇÕES E SONDAGENS",null,null,0,null,null,0,null,0]
[null,null,null,null,null,null,null,null,null,null,null,null,null,null,"e.","ESTRUTURA",null,null,0,null,null,0,null,0]
[null,null,null,null,null,null,null,null,null,null,null,null,null,null,"f.","INSTALAÇÕES ELÉTRICAS",null,null,0,null,null,0,null,0]
[null,null,null,null,null,null,null,null,null,null,null,null,null,null,"g.","INSTALAÇÕES HIDROSSANITÁRIAS",null,null,0,null,null,0,null,0]
[null,null,null,null,null,null,null,null,null,null,null,null,null,null,"h","INSTALAÇÕES ESPECIAIS",null,null,0,null,null,0,null,0]
[null,null,null,null,null,null,null,null,null,null,null,null,null,null,"i.","ALVENARIAS E DIVISÓRIAS",null,null,0,null,null,0,null,0]
[null,null,null,null,null,null,null,null,null,null,null,null,null,null,"j.","ALVENARIA AUTO-PORTANTE",null,null,0,null,null,0,null,0]
[null,null,null,null,null,null,null,null,null,null,null,null,null,null,"k.","IMPERMEABILIZAÇÃO",null,null,0,null,null,0,null,0]
[null,null,null,null,null,null,null,null,null,null,null,null,null,null,"l.","ISOLAMENTO TÉRMICO E ACÚSTICO",null,null,0,null,null,0,null,0]
[null,null,null,null,null,null,null,null,null,null,null,null,null,null,"m.","ESTRUTURA DE MADEIRA",null,null,0,null,null,0,null,0]
[null,null,null,null,null,null,null,null,null,null,null,null,null,null,"n.","ESTRUTURAS METÁLICAS",null,null,0,null,null,0,null,0]
[null,null,null,null,null,null,null,null,null,null,null,null,null,null,"o.","COBERTURAS",null,null,0,null,null,0,null,0]
[null,null,null,null,null,null,null,null,null,null,null,null,null,null,"p.","ESQUADRIAS DE MADEIRA",null,null,0,null,null,0,null,0]
[null,null,null,null,null,null,null,null,null,null,null,null,null,null,"q.","ESQUADRIAS METÁLICAS",null,null,0,null,null,{"$f":"ROUND(S275*(1+BDI.Taxa),2)","v":0},null,0]
[null,null,null,null,null,null,null,null,null,null,null,null,null,null,"r.","VIDROS",null,null,0,null,null,0,null,0]
[null,null,null,null,null,null,null,null,null,null,null,null,null,null,"s.","REVESTIMENTO DE PAREDE",null,null,0,null,null,0,null,0]
[null,null,null,null,null,null,null,null,null,null,null,null,null,null,"t.","FORROS",null,null,0,null,null,0,null,0]
[null,null,null,null,null,null,null,null,null,null,null,null,null,null,"u.","REVESTIMENTO DE PISO",null,null,0,null,null,0,null,0]
[null,null,null,null,null,null,null,null,null,null,null,null,null,null,"v.","FERRAGENS",null,null,0,null,null,0,null,0]
[null,null,null,null,null,null,null,null,null,null,null,null,null,null,"w.","MARCENARIA",null,null,0,null,null,0,null,0]
[null,null,null,null,null,null,null,null,null,null,null,null,null,null,"x.","ADMINISTRAÇÃO",null,null,0,null,null,0,null,0]
[null,null,null,null,null,null,null,null,null,null,null,null,null,null,"y.","PINTURA",null,null,0,null,null,{"$f":"ROUND(S283*(1+BDI.Taxa),2)","v":0},null,0]
[null,null,null,null,null,null,null,null,null,null,null,null,null,null,"z.","DIVERSOS",null,null,0,null,null,{"$f":"IF(S284>0,IF((SUM(V259:W283)+ROUND(S284*(1+BDI.Taxa),2))<>V286,V286-SUM(V259:W283),ROUND(S284*(1+BDI.Taxa),2)),0)","v":0},null,{"$f":"IF(S284>0,IF((SUM(X259:X283)+IFERROR(ROUND($V284*100/$W$243,2),0))<>X286,X286-SUM(X259:X283),IFERROR(ROUND($V284*100/$W$243,2),0)),0)","v":0}]
[null,null,null,null,null,null,null,null,null,null,null,null,null,null,"TOTAL GERAL DO ORÇAMENTO (R$)",null,null,null,{"$f":"SUM(S259:U284)","v":0},null,null,{"$f":"SUM(V259:W284)","v":0},null,{"$f":"SUM(X259:X284)","v":0}]
[null,null,null,null,null,null,null,null,null,null,null,null,null,null,null,null,null,null,{"$f":"$W$241","v":0},null,null,{"$f":"$W$243","v":0},null,100]
[null,null,null,null,null,null,null,null,null,null,null,null,null,null,null,null,null,null,"(TOTAL SEM BDI)",null,null,"(TOTAL COM BDI)",null,"(ARRED porcentagem)"]
[null,null,null,null,null,null,null,null,null,null,null,null,null,null,null,null,null,null,{"$f":"IF(AND(S285=S286,S285>0),\"OK\",\"ERRO\")","v":"ERRO"},null,null,{"$f":"IF(AND(V285=V286,V285>0),\"OK\",\"ERRO\")","v":"ERRO"},null,{"$f":"IF(X285=100,\"OK\",\"ERRO\")","v":"ERRO"}]
[]
[]
[null,null,null,null,null,null,null,null,null,null,null,null,null,null,"RESUMO GERAL DO ORÇAMENTO"]
[null,null,null,null,null,null,null,null,null,null,null,null,null,null,"ITEM","DESCRIÇÃO DOS SERVIÇOS",null,null,"PREÇO SEM BDI",null,null,"PREÇO COM BDI",null,"PARTICIPAÇÃO ( % )"]
[null,null,null,null,null,null,null,null,null,null,null,null,null,null,"1.",{"$f":"IFERROR(VLOOKUP(O293,$O$20:$W$240,4,FALSE),\"\")","v":"REFORMA"},null,null,{"$f":"IF(P294=\"\",$S$314-SUM(OFFSET($S$292:S292,0,0,COUNTA($S$292:S292),1)),SUMIF($R$20:$R$240,$P293,$W$20:$W$240))","v":0},null,null,{"$f":"IF(P294=\"\",$V$314-SUM(OFFSET($V$292:V292,0,0,COUNTA($V$292:V292),1)),ROUND(S293*(1+BDI.Taxa),2))","v":0},null,{"$f":"IF(P294=\"\",$X$314-SUM(OFFSET($X$292:X292,0,0,COUNTA($X$292:X292),1)),ROUND(V293*100/ORÇAMENTO.Totalorçamento,2))","v":100}]
[null,null,null,null,null,null,null,null,null,null,null,null,null,null,"2.","",null,null,{"$f":"IF(P295=\"\",$S$314-SUM(OFFSET($S$292:S293,0,0,COUNTA($S$292:S293),1)),SUMIF($R$20:$R$240,$P294,$W$20:$W$240))","v":0},null,null,{"$f":"IF(P295=\"\",$V$314-SUM(OFFSET($V$292:V293,0,0,COUNTA($V$292:V293),1)),ROUND(S294*(1+BDI.Taxa),2))","v":0},null,{"$f":"IF(P295=\"\",$X$314-SUM(OFFSET($X$292:X293,0,0,COUNTA($X$292:X293),1)),ROUND(V294*100/ORÇAMENTO.Totalorçamento,2))","v":0}]
[null,null,null,null,null,null,null,null,null,null,null,null,null,null,"3.","",null,null,{"$f":"IF(P296=\"\",$S$314-SUM(OFFSET($S$292:S294,0,0,COUNTA($S$292:S294),1)),SUMIF($R$20:$R$240,$P295,$W$20:$W$240))","v":0},null,null,{"$f":"IF(P296=\"\",$V$314-SUM(OFFSET($V$292:V294,0,0,COUNTA($V$292:V294),1)),ROUND(S295*(1+BDI.Taxa),2))","v":0},null,{"$f":"IF(P296=\"\",$X$314-SUM(OFFSET($X$292:X294,0,0,COUNTA($X$292:X294),1)),ROUND(V295*100/ORÇAMENTO.Totalorçamento,2))","v":0}]
[null,null,null,null,null,null,null,null,null,null,null,null,null,null,"4.","",null,null,{"$f":"IF(P297=\"\",$S$314-SUM(OFFSET($S$292:S295,0,0,COUNTA($S$292:S295),1)),SUMIF($R$20:$R$240,$P296,$W$20:$W$240))","v":0},null,null,{"$f":"IF(P297=\"\",$V$314-SUM(OFFSET($V$292:V295,0,0,COUNTA($V$292:V295),1)),ROUND(S296*(1+BDI.Taxa),2))","v":0},null,{"$f":"IF(P297=\"\",$X$314-SUM(OFFSET($X$292:X295,0,0,COUNTA($X$292:X295),1)),ROUND(V296*100/ORÇAMENTO.Totalorçamento,2))","v":0}]
[null,null,null,null,null,null,null,null,null,null,null,null,null,null,"5.","",null,null,{"$f":"IF(P298=\"\",$S$314-SUM(OFFSET($S$292:S296,0,0,COUNTA($S$292:S296),1)),SUMIF($R$20:$R$240,$P297,$W$20:$W$240))","v":0},null,null,{"$f":"IF(P298=\"\",$V$314-SUM(OFFSET($V$292:V296,0,0,COUNTA($V$292:V296),1)),ROUND(S297*(1+BDI.Taxa),2))","v":0},null,{"$f":"IF(P298=\"\",$X$314-SUM(OFFSET($X$292:X296,0,0,COUNTA($X$292:X296),1)),ROUND(V297*100/ORÇAMENTO.Totalorçamento,2))","v":0}]
[null,null,null,null,null,null,null,null,null,null,null,null,null,null,"6.","",null,null,{"$f":"IF(P299=\"\",$S$314-SUM(OFFSET($S$292:S297,0,0,COUNTA($S$292:S297),1)),SUMIF($R$20:$R$240,$P298,$W$20:$W$240))","v":0},null,null,{"$f":"IF(P299=\"\",$V$314-SUM(OFFSET($V$292:V297,0,0,COUNTA($V$292:V297),1)),ROUND(S298*(1+BDI.Taxa),2))","v":0},null,{"$f":"IF(P299=\"\",$X$314-SUM(OFFSET($X$292:X297,0,0,COUNTA($X$292:X297),1)),ROUND(V298*100/ORÇAMENTO.Totalorçamento,2))","v":0}]
[null,null,null,null,null,null,null,null,null,null,null,null,null,null,"7.","",null,null,{"$f":"IF(P300=\"\",$S$314-SUM(OFFSET($S$292:S298,0,0,COUNTA($S$292:S298),1)),SUMIF($R$20:$R$240,$P299,$W$20:$W$240))","v":0},null,null,{"$f":"IF(P300=\"\",$V$314-SUM(OFFSET($V$292:V298,0,0,COUNTA($V$292:V298),1)),ROUND(S299*(1+BDI.Taxa),2))","v":0},null,{"$f":"IF(P300=\"\",$X$314-SUM(OFFSET($X$292:X298,0,0,COUNTA($X$292:X298),1)),ROUND(V299*100/ORÇAMENTO.Totalorçamento,2))","v":0}]
[null,null,null,null,null,null,null,null,null,null,null,null,null,null,"8.","",null,null,{"$f":"IF(P301=\"\",$S$314-SUM(OFFSET($S$292:S299,0,0,COUNTA($S$292:S299),1)),SUMIF($R$20:$R$240,$P300,$W$20:$W$240))","v":0},null,null,{"$f":"IF(P301=\"\",$V$314-SUM(OFFSET($V$292:V299,0,0,COUNTA($V$292:V299),1)),ROUND(S300*(1+BDI.Taxa),2))","v":0},null,{"$f":"IF(P301=\"\",$X$314-SUM(OFFSET($X$292:X299,0,0,COUNTA($X$292:X299),1)),ROUND(V300*100/ORÇAMENTO.Totalorçamento,2))","v":0}]
[null,null,null,null,null,null,null,null,null,null,null,null,null,null,"9.","",null,null,{"$f":"IF(P302=\"\",$S$314-SUM(OFFSET($S$292:S300,0,0,COUNTA($S$292:S300),1)),SUMIF($R$20:$R$240,$P301,$W$20:$W$240))","v":0},null,null,{"$f":"IF(P302=\"\",$V$314-SUM(OFFSET($V$292:V300,0,0,COUNTA($V$292:V300),1)),ROUND(S301*(1+BDI.Taxa),2))","v":0},null,{"$f":"IF(P302=\"\",$X$314-SUM(OFFSET($X$292:X300,0,0,COUNTA($X$292:X300),1)),ROUND(V301*100/ORÇAMENTO.Totalorçamento,2))","v":0}]
[null,null,null,null,null,null,null,null,null,null,null,null,null,null,"10.","",null,null,{"$f":"IF(P303=\"\",$S$314-SUM(OFFSET($S$292:S301,0,0,COUNTA($S$292:S301),1)),SUMIF($R$20:$R$240,$P302,$W$20:$W$240))","v":0},null,null,{"$f":"IF(P303=\"\",$V$314-SUM(OFFSET($V$292:V301,0,0,COUNTA($V$292:V301),1)),ROUND(S302*(1+BDI.Taxa),2))","v":0},null,{"$f":"IF(P303=\"\",$X$314-SUM(OFFSET($X$292:X301,0,0,COUNTA($X$292:X301),1)),ROUND(V302*100/ORÇAMENTO.Totalorçamento,2))","v":0}]
[null,null,null,null,null,null,null,null,null,null,null,null,null,null,"11.","",null,null,{"$f":"IF(P304=\"\",$S$314-SUM(OFFSET($S$292:S302,0,0,COUNTA($S$292:S302),1)),SUMIF($R$20:$R$240,$P303,$W$20:$W$240))","v":0},null,null,{"$f":"IF(P304=\"\",$V$314-SUM(OFFSET($V$292:V302,0,0,COUNTA($V$292:V302),1)),ROUND(S303*(1+BDI.Taxa),2))","v":0},null,{"$f":"IF(P304=\"\",$X$314-SUM(OFFSET($X$292:X302,0,0,COUNTA($X$292:X302),1)),ROUND(V303*100/ORÇAMENTO.Totalorçamento,2))","v":0}]
[null,null,null,null,null,null,null,null,null,null,null,null,null,null,"12.","",null,null,{"$f":"IF(P305=\"\",$S$314-SUM(OFFSET($S$292:S303,0,0,COUNTA($S$292:S303),1)),SUMIF($R$20:$R$240,$P304,$W$20:$W$240))","v":0},null,null,{"$f":"IF(P305=\"\",$V$314-SUM(OFFSET($V$292:V303,0,0,COUNTA($V$292:V303),1)),ROUND(S304*(1+BDI.Taxa),2))","v":0},null,{"$f":"IF(P305=\"\",$X$314-SUM(OFFSET($X$292:X303,0,0,COUNTA($X$292:X303),1)),ROUND(V304*100/ORÇAMENTO.Totalorçamento,2))","v":0}]
[null,null,null,null,null,null,null,null,null,null,null,null,null,null,"13.","",null,null,{"$f":"IF(P306=\"\",$S$314-SUM(OFFSET($S$292:S304,0,0,COUNTA($S$292:S304),1)),SUMIF($R$20:$R$240,$P305,$W$20:$W$240))","v":0},null,null,{"$f":"IF(P306=\"\",$V$314-SUM(OFFSET($V$292:V304,0,0,COUNTA($V$292:V304),1)),ROUND(S305*(1+BDI.Taxa),2))","v":0},null,{"$f":"IF(P306=\"\",$X$314-SUM(OFFSET($X$292:X304,0,0,COUNTA($X$292:X304),1)),ROUND(V305*100/ORÇAMENTO.Totalorçamento,2))","v":0}]
[null,null,null,null,null,null,null,null,null,null,null,null,null,null,"14.","",null,null,{"$f":"IF(P307=\"\",$S$314-SUM(OFFSET($S$292:S305,0,0,COUNTA($S$292:S305),1)),SUMIF($R$20:$R$240,$P306,$W$20:$W$240))","v":0},null,null,{"$f":"IF(P307=\"\",$V$314-SUM(OFFSET($V$292:V305,0,0,COUNTA($V$292:V305),1)),ROUND(S306*(1+BDI.Taxa),2))","v":0},null,{"$f":"IF(P307=\"\",$X$314-SUM(OFFSET($X$292:X305,0,0,COUNTA($X$292:X305),1)),ROUND(V306*100/ORÇAMENTO.Totalorçamento,2))","v":0}]
[null,null,null,null,null,null,null,null,null,null,null,null,null,null,"15.","",null,null,{"$f":"IF(P308=\"\",$S$314-SUM(OFFSET($S$292:S306,0,0,COUNTA($S$292:S306),1)),SUMIF($R$20:$R$240,$P307,$W$20:$W$240))","v":0},null,null,{"$f":"IF(P308=\"\",$V$314-SUM(OFFSET($V$292:V306,0,0,COUNTA($V$292:V306),1)),ROUND(S307*(1+BDI.Taxa),2))","v":0},null,{"$f":"IF(P308=\"\",$X$314-SUM(OFFSET($X$292:X306,0,0,COUNTA($X$292:X306),1)),ROUND(V307*100/ORÇAMENTO.Totalorçamento,2))","v":0}]
[null,null,null,null,null,null,null,null,null,null,null,null,null,null,"16.","",null,null,{"$f":"IF(P309=\"\",$S$314-SUM(OFFSET($S$292:S307,0,0,COUNTA($S$292:S307),1)),SUMIF($R$20:$R$240,$P308,$W$20:$W$240))","v":0},null,null,{"$f":"IF(P309=\"\",$V$314-SUM(OFFSET($V$292:V307,0,0,COUNTA($V$292:V307),1)),ROUND(S308*(1+BDI.Taxa),2))","v":0},null,{"$f":"IF(P309=\"\",$X$314-SUM(OFFSET($X$292:X307,0,0,COUNTA($X$292:X307),1)),ROUND(V308*100/ORÇAMENTO.Totalorçamento,2))","v":0}]
[null,null,null,null,null,null,null,null,null,null,null,null,null,null,"17.","",null,null,{"$f":"IF(P310=\"\",$S$314-SUM(OFFSET($S$292:S308,0,0,COUNTA($S$292:S308),1)),SUMIF($R$20:$R$240,$P309,$W$20:$W$240))","v":0},null,null,{"$f":"IF(P310=\"\",$V$314-SUM(OFFSET($V$292:V308,0,0,COUNTA($V$292:V308),1)),ROUND(S309*(1+BDI.Taxa),2))","v":0},null,{"$f":"IF(P310=\"\",$X$314-SUM(OFFSET($X$292:X308,0,0,COUNTA($X$292:X308),1)),ROUND(V309*100/ORÇAMENTO.Totalorçamento,2))","v":0}]
[null,null,null,null,null,null,null,null,null,null,null,null,null,null,"18.","",null,null,{"$f":"IF(P311=\"\",$S$314-SUM(OFFSET($S$292:S309,0,0,COUNTA($S$292:S309),1)),SUMIF($R$20:$R$240,$P310,$W$20:$W$240))","v":0},null,null,{"$f":"IF(P311=\"\",$V$314-SUM(OFFSET($V$292:V309,0,0,COUNTA($V$292:V309),1)),ROUND(S310*(1+BDI.Taxa),2))","v":0},null,{"$f":"IF(P311=\"\",$X$314-SUM(OFFSET($X$292:X309,0,0,COUNTA($X$292:X309),1)),ROUND(V310*100/ORÇAMENTO.Totalorçamento,2))","v":0}]
[null,null,null,null,null,null,null,null,null,null,null,null,null,null,"19.","",null,null,{"$f":"IF(P312=\"\",$S$314-SUM(OFFSET($S$292:S310,0,0,COUNTA($S$292:S310),1)),SUMIF($R$20:$R$240,$P311,$W$20:$W$240))","v":0},null,null,{"$f":"IF(P312=\"\",$V$314-SUM(OFFSET($V$292:V310,0,0,COUNTA($V$292:V310),1)),ROUND(S311*(1+BDI.Taxa),2))","v":0},null,{"$f":"IF(P312=\"\",$X$314-SUM(OFFSET($X$292:X310,0,0,COUNTA($X$292:X310),1)),ROUND(V311*100/ORÇAMENTO.Totalorçamento,2))","v":0}]
[null,null,null,null,null,null,null,null,null,null,null,null,null,null,"20.","",null,null,{"$f":"IF(P313=\"\",$S$314-SUM(OFFSET($S$292:S311,0,0,COUNTA($S$292:S311),1)),SUMIF($R$20:$R$240,$P312,$W$20:$W$240))","v":0},null,null,{"$f":"IF(P313=\"\",$V$314-SUM(OFFSET($V$292:V311,0,0,COUNTA($V$292:V311),1)),ROUND(S312*(1+BDI.Taxa),2))","v":0},null,{"$f":"IF(P313=\"\",$X$314-SUM(OFFSET($X$292:X311,0,0,COUNTA($X$292:X311),1)),ROUND(V312*100/ORÇAMENTO.Totalorçamento,2))","v":0}]
[null,null,null,null,null,null,null,null,null,null,null,null,null,null,"TOTAL GERAL DO ORÇAMENTO (R$)",null,null,null,{"$f":"SUM(S293:U312)","v":0},null,null,{"$f":"SUM(V293:W312)","v":0},null,{"$f":"SUM(X293:X312)","v":100}]
[null,null,null,null,null,null,null,null,null,null,null,null,null,null,null,null,null,null,{"$f":"$W$241","v":0},null,null,{"$f":"$W$243","v":0},null,100]
[null,null,null,null,null,null,null,null,null,null,null,null,null,null,null,null,null,null,"(TOTAL SEM BDI)",null,null,"(TOTAL COM BDI)",null,"(ARRED porcentagem)"]
[null,null,null,null,null,null,null,null,null,null,null,null,null,null,null,null,null,null,{"$f":"IF(AND(S313=S314,S313>0),\"OK\",\"ERRO\")","v":"ERRO"},null,null,{"$f":"IF(AND(V313=V314,V313>0),\"OK\",\"ERRO\")","v":"ERRO"},null,{"$f":"IF(AND(X313=100,S293<>0),\"OK\",\"ERRO\")","v":"ERRO"}]

{"sheet":"Resumo ","index":1,"n_rows":39,"n_cols":9,"rows_kept":39,"cut":false,"hidden":false,"merged":[[13,0,14,0],[34,2,34,3],[35,2,35,3],[31,2,31,3],[32,2,32,3],[33,2,33,3],[28,2,28,3],[29,2,29,3],[30,2,30,3],[0,1,0,8],[36,1,36,5],[2,1,2,5],[3,1,3,5],[5,1,5,5],[6,1,6,5],[8,1,8,5],[9,1,9,5],[11,3,11,5],[12,3,12,5],[10,1,10,8],[11,6,11,8],[12,6,12,8],[25,2,25,3],[21,2,21,3],[22,2,22,3],[6,6,6,8],[7,1,7,8],[8,6,8,8],[9,6,9,8],[13,1,13,8],[1,1,1,8],[2,6,2,8],[3,6,3,8],[4,1,4,8],[5,6,5,8],[42,3,42,7],[11,1,11,2],[12,1,12,2],[15,2,15,3],[16,2,16,3],[14,1,14,8],[17,2,17,3],[23,2,23,3],[18,2,18,3],[19,2,19,3],[20,2,20,3],[41,3,41,7],[24,2,24,3],[26,2,26,3],[27,2,27,3],[38,1,38,8]]}
[]
[]
[null,"UNIDADE ESCOLAR",null,null,null,null,"CÓDIGO INEP"]
[null,{"$f":"Orçamento!$O$5","v":"CENTRO DE ENSINO EM PERÍODO INTEGRAL PROFESSORA IZABEL CHRISTINA DE SOUSA ORTIZ"},null,null,null,null,{"$f":"Orçamento!V5","v":52103498}]
[]
[null,"OBRA",null,null,null,null,"CIDADE"]
[null,{"$f":"Orçamento!$O$8","v":"REFORMA E AMPLIAÇÃO"},null,null,null,null,{"$f":"Orçamento!$V$8","v":"FORMOSA"}]
[]
[null,"ENDEREÇO",null,null,null,null,"CRE"]
[null,{"$f":"Orçamento!$R$11","v":"RUA 65, PRAÇA N°04 S/N, PQ LAGO DE FORMOSA, CEP:73813-872"},null,null,null,null,{"$f":"Orçamento!$O$11","v":"FORMOSA"}]
[]
[null,"REFERÊNCIA",null,"DATA",null,null,"ÁREA TOTAL CONSTRUÍDA (M²)"]
[null,{"$f":"CONCATENATE(\"AGETOP E SINAPI - \",Orçamento!$T$11)","v":"AGETOP E SINAPI - DESONERADA"},null,{"$f":"Orçamento!$S$8","v":"2020-03-19"},null,null,{"$f":"Orçamento!$V$14","v":2960.79}]
["FILTRO"]
[null,"RESUMO GERAL DO ORÇAMENTO"]
["↓","ITEM","DESCRIÇÃO DOS SERVIÇOS",null,"UNID","QUANT","PREÇO SEM BDI","PREÇO COM BDI","PARTICIP. (%)"]
[{"$f":"IF(H17>0,\"F\",\"\")","v":""},"1.",{"$f":"Orçamento!$P293","v":"REFORMA"},null,{"$f":"IF(C17<>\"\",\"UN\",\"\")","v":"UN"},{"$f":"IF(C17<>\"\",1,\"\")","v":1},{"$f":"IFERROR(Orçamento!S293,\"-\")","v":0},{"$f":"IFERROR(Orçamento!V293,\"\")","v":0},{"$f":"Orçamento!X293","v":100}]
[{"$f":"IF(H18>0,\"F\",\"\")","v":""},"2.",{"$f":"Orçamento!$P294","v":""},null,{"$f":"IF(C18<>\"\",\"UN\",\"\")","v":""},{"$f":"IF(C18<>\"\",1,\"\")","v":""},{"$f":"IFERROR(Orçamento!S294,\"-\")","v":0},{"$f":"IFERROR(Orçamento!V294,\"\")","v":0},{"$f":"Orçamento!X294","v":0}]
[{"$f":"IF(H19>0,\"F\",\"\")","v":""},"3.",{"$f":"Orçamento!$P295","v":""},null,"","",{"$f":"IFERROR(Orçamento!S295,\"-\")","v":0},{"$f":"IFERROR(Orçamento!V295,\"\")","v":0},{"$f":"Orçamento!X295","v":0}]
["","4.",{"$f":"Orçamento!$P296","v":""},null,"","",{"$f":"IFERROR(Orçamento!S296,\"-\")","v":0},{"$f":"IFERROR(Orçamento!V296,\"\")","v":0},{"$f":"Orçamento!X296","v":0}]
["","5.",{"$f":"Orçamento!$P297","v":""},null,"","",{"$f":"IFERROR(Orçamento!S297,\"-\")","v":0},{"$f":"IFERROR(Orçamento!V297,\"\")","v":0},{"$f":"Orçamento!X297","v":0}]
["","6.",{"$f":"Orçamento!$P298","v":""},null,"","",{"$f":"IFERROR(Orçamento!S298,\"-\")","v":0},{"$f":"IFERROR(Orçamento!V298,\"\")","v":0},{"$f":"Orçamento!X298","v":0}]
["","7.",{"$f":"Orçamento!$P299","v":""},null,"","",{"$f":"IFERROR(Orçamento!S299,\"-\")","v":0},{"$f":"IFERROR(Orçamento!V299,\"\")","v":0},{"$f":"Orçamento!X299","v":0}]
["","8.",{"$f":"Orçamento!$P300","v":""},null,"","",{"$f":"IFERROR(Orçamento!S300,\"-\")","v":0},{"$f":"IFERROR(Orçamento!V300,\"\")","v":0},{"$f":"Orçamento!X300","v":0}]
["","9.",{"$f":"Orçamento!$P301","v":""},null,"","",{"$f":"IFERROR(Orçamento!S301,\"-\")","v":0},{"$f":"IFERROR(Orçamento!V301,\"\")","v":0},{"$f":"Orçamento!X301","v":0}]
["","10.",{"$f":"Orçamento!$P302","v":""},null,"","",{"$f":"IFERROR(Orçamento!S302,\"-\")","v":0},{"$f":"IFERROR(Orçamento!V302,\"\")","v":0},{"$f":"Orçamento!X302","v":0}]
["","11.",{"$f":"Orçamento!$P303","v":""},null,"","",{"$f":"IFERROR(Orçamento!S303,\"-\")","v":0},{"$f":"IFERROR(Orçamento!V303,\"\")","v":0},{"$f":"Orçamento!X303","v":0}]
["","12.",{"$f":"Orçamento!$P304","v":""},null,"","",{"$f":"IFERROR(Orçamento!S304,\"-\")","v":0},{"$f":"IFERROR(Orçamento!V304,\"\")","v":0},{"$f":"Orçamento!X304","v":0}]
["","13.",{"$f":"Orçamento!$P305","v":""},null,"","",{"$f":"IFERROR(Orçamento!S305,\"-\")","v":0},{"$f":"IFERROR(Orçamento!V305,\"\")","v":0},{"$f":"Orçamento!X305","v":0}]
["","14.",{"$f":"Orçamento!$P306","v":""},null,"","",{"$f":"IFERROR(Orçamento!S306,\"-\")","v":0},{"$f":"IFERROR(Orçamento!V306,\"\")","v":0},{"$f":"Orçamento!X306","v":0}]
["","15.",{"$f":"Orçamento!$P307","v":""},null,"","",{"$f":"IFERROR(Orçamento!S307,\"-\")","v":0},{"$f":"IFERROR(Orçamento!V307,\"\")","v":0},{"$f":"Orçamento!X307","v":0}]
["","16.",{"$f":"Orçamento!$P308","v":""},null,"","",{"$f":"IFERROR(Orçamento!S308,\"-\")","v":0},{"$f":"IFERROR(Orçamento!V308,\"\")","v":0},{"$f":"Orçamento!X308","v":0}]
["","17.",{"$f":"Orçamento!$P309","v":""},null,"","",{"$f":"IFERROR(Orçamento!S309,\"-\")","v":0},{"$f":"IFERROR(Orçamento!V309,\"\")","v":0},{"$f":"Orçamento!X309","v":0}]
["","18.",{"$f":"Orçamento!$P310","v":""},null,"","",{"$f":"IFERROR(Orçamento!S310,\"-\")","v":0},{"$f":"IFERROR(Orçamento!V310,\"\")","v":0},{"$f":"Orçamento!X310","v":0}]
["","19.",{"$f":"Orçamento!$P311","v":""},null,"","",{"$f":"IFERROR(Orçamento!S311,\"-\")","v":0},{"$f":"IFERROR(Orçamento!V311,\"\")","v":0},{"$f":"Orçamento!X311","v":0}]
["","20.",{"$f":"Orçamento!$P312","v":""},null,"","",{"$f":"IFERROR(Orçamento!S312,\"-\")","v":0},{"$f":"IFERROR(Orçamento!V312,\"\")","v":0},{"$f":"Orçamento!X312","v":0}]
["F","TOTAL GERAL DO ORÇAMENTO (R$)",null,null,null,null,{"$f":"SUM(G17:G36)","v":0},{"$f":"SUM(H17:H36)","v":0},{"$f":"SUM(I17:I36)","v":100}]
["F"]
["F"]

{"sheet":"Somatório","index":2,"n_rows":45,"n_cols":6,"rows_kept":45,"cut":false,"hidden":false,"merged":[[13,0,14,0],[42,1,42,2],[44,1,44,5],[47,3,47,5],[48,3,48,5],[13,1,13,5],[9,1,9,3],[9,4,9,5],[11,1,11,2],[11,4,11,5],[12,1,12,2],[12,4,12,5],[0,1,0,5],[14,1,14,5],[2,1,2,3],[2,4,2,5],[3,1,3,3],[3,4,3,5],[5,1,5,3],[5,4,5,5],[6,1,6,3],[6,4,6,5],[8,1,8,3],[8,4,8,5],[1,1,1,5],[4,1,4,5],[7,1,7,5],[10,1,10,5]]}
[]
[]
[null,"UNIDADE ESCOLAR",null,null,"CÓDIGO INEP"]
[null,{"$f":"Orçamento!$O$5","v":"CENTRO DE ENSINO EM PERÍODO INTEGRAL PROFESSORA IZABEL CHRISTINA DE SOUSA ORTIZ"},null,null,{"$f":"Orçamento!V5","v":52103498}]
[]
[null,"OBRA",null,null,"CIDADE"]
[null,{"$f":"Orçamento!$O$8","v":"REFORMA E AMPLIAÇÃO"},null,null,{"$f":"Orçamento!$V$8","v":"FORMOSA"}]
[]
[null,"ENDEREÇO",null,null,"CRE"]
[null,{"$f":"Orçamento!$R$11","v":"RUA 65, PRAÇA N°04 S/N, PQ LAGO DE FORMOSA, CEP:73813-872"},null,null,{"$f":"Orçamento!$O$11","v":"FORMOSA"}]
[]
[null,"REFERÊNCIA",null,"DATA","ÁREA TOTAL CONSTRUÍDA (M²)"]
[null,{"$f":"CONCATENATE(\"AGETOP E SINAPI - \",Orçamento!$T$11)","v":"AGETOP E SINAPI - DESONERADA"},null,{"$f":"Orçamento!$S$8","v":"2020-03-19"},{"$f":"Orçamento!$V$14","v":2960.79}]
["FILTRO"]
[null,"SOMATÓRIO DE SERVIÇOS"]
["↓","ITEM","DESCRIÇÃO DOS SERVIÇOS","PREÇO SEM BDI (R$)","PREÇO COM BDI (R$)","PARTIC.  ( % )"]
[{"$f":"IF(D17>0,\"F\",\"\")","v":""},"a.",{"$f":"Orçamento!P259","v":"SERVIÇOS PRELIMINARES"},{"$f":"Orçamento!S259","v":0},{"$f":"Orçamento!V259","v":0},{"$f":"Orçamento!X259","v":0}]
[{"$f":"IF(D18>0,\"F\",\"\")","v":""},"b.",{"$f":"Orçamento!P260","v":"TRANSPORTES"},{"$f":"Orçamento!S260","v":0},{"$f":"Orçamento!V260","v":0},{"$f":"Orçamento!X260","v":0}]
["","c.",{"$f":"Orçamento!P261","v":"SERVIÇO EM TERRA"},{"$f":"Orçamento!S261","v":0},{"$f":"Orçamento!V261","v":0},{"$f":"Orçamento!X261","v":0}]
["","d.",{"$f":"Orçamento!P262","v":"FUNDAÇÕES E SONDAGENS"},{"$f":"Orçamento!S262","v":0},{"$f":"Orçamento!V262","v":0},{"$f":"Orçamento!X262","v":0}]
["","e.",{"$f":"Orçamento!P263","v":"ESTRUTURA"},{"$f":"Orçamento!S263","v":0},{"$f":"Orçamento!V263","v":0},{"$f":"Orçamento!X263","v":0}]
["","f.",{"$f":"Orçamento!P264","v":"INSTALAÇÕES ELÉTRICAS"},{"$f":"Orçamento!S264","v":0},{"$f":"Orçamento!V264","v":0},{"$f":"Orçamento!X264","v":0}]
["","g.",{"$f":"Orçamento!P265","v":"INSTALAÇÕES HIDROSSANITÁRIAS"},{"$f":"Orçamento!S265","v":0},{"$f":"Orçamento!V265","v":0},{"$f":"Orçamento!X265","v":0}]
["","h.",{"$f":"Orçamento!P266","v":"INSTALAÇÕES ESPECIAIS"},{"$f":"Orçamento!S266","v":0},{"$f":"Orçamento!V266","v":0},{"$f":"Orçamento!X266","v":0}]
["","i.",{"$f":"Orçamento!P267","v":"ALVENARIAS E DIVISÓRIAS"},{"$f":"Orçamento!S267","v":0},{"$f":"Orçamento!V267","v":0},{"$f":"Orçamento!X267","v":0}]
["","j.",{"$f":"Orçamento!P268","v":"ALVENARIA AUTO-PORTANTE"},{"$f":"Orçamento!S268","v":0},{"$f":"Orçamento!V268","v":0},{"$f":"Orçamento!X268","v":0}]
["","k.",{"$f":"Orçamento!P269","v":"IMPERMEABILIZAÇÃO"},{"$f":"Orçamento!S269","v":0},{"$f":"Orçamento!V269","v":0},{"$f":"Orçamento!X269","v":0}]
["","l.",{"$f":"Orçamento!P270","v":"ISOLAMENTO TÉRMICO E ACÚSTICO"},{"$f":"Orçamento!S270","v":0},{"$f":"Orçamento!V270","v":0},{"$f":"Orçamento!X270","v":0}]
["","m.",{"$f":"Orçamento!P271","v":"ESTRUTURA DE MADEIRA"},{"$f":"Orçamento!S271","v":0},{"$f":"Orçamento!V271","v":0},{"$f":"Orçamento!X271","v":0}]
["","n.",{"$f":"Orçamento!P272","v":"ESTRUTURAS METÁLICAS"},{"$f":"Orçamento!S272","v":0},{"$f":"Orçamento!V272","v":0},{"$f":"Orçamento!X272","v":0}]
["","o.",{"$f":"Orçamento!P273","v":"COBERTURAS"},{"$f":"Orçamento!S273","v":0},{"$f":"Orçamento!V273","v":0},{"$f":"Orçamento!X273","v":0}]
["","p.",{"$f":"Orçamento!P274","v":"ESQUADRIAS DE MADEIRA"},{"$f":"Orçamento!S274","v":0},{"$f":"Orçamento!V274","v":0},{"$f":"Orçamento!X274","v":0}]
["","q.",{"$f":"Orçamento!P275","v":"ESQUADRIAS METÁLICAS"},{"$f":"Orçamento!S275","v":0},{"$f":"Orçamento!V275","v":0},{"$f":"Orçamento!X275","v":0}]
["","r.",{"$f":"Orçamento!P276","v":"VIDROS"},{"$f":"Orçamento!S276","v":0},{"$f":"Orçamento!V276","v":0},{"$f":"Orçamento!X276","v":0}]
["","s.",{"$f":"Orçamento!P277","v":"REVESTIMENTO DE PAREDE"},{"$f":"Orçamento!S277","v":0},{"$f":"Orçamento!V277","v":0},{"$f":"Orçamento!X277","v":0}]
["","t.",{"$f":"Orçamento!P278","v":"FORROS"},{"$f":"Orçamento!S278","v":0},{"$f":"Orçamento!V278","v":0},{"$f":"Orçamento!X278","v":0}]
["","u.",{"$f":"Orçamento!P279","v":"REVESTIMENTO DE PISO"},{"$f":"Orçamento!S279","v":0},{"$f":"Orçamento!V279","v":0},{"$f":"Orçamento!X279","v":0}]
["","v.",{"$f":"Orçamento!P280","v":"FERRAGENS"},{"$f":"Orçamento!S280","v":0},{"$f":"Orçamento!V280","v":0},{"$f":"Orçamento!X280","v":0}]
["","w.",{"$f":"Orçamento!P281","v":"MARCENARIA"},{"$f":"Orçamento!S281","v":0},{"$f":"Orçamento!V281","v":0},{"$f":"Orçamento!X281","v":0}]
["","x.",{"$f":"Orçamento!P282","v":"ADMINISTRAÇÃO"},{"$f":"Orçamento!S282","v":0},{"$f":"Orçamento!V282","v":0},{"$f":"Orçamento!X282","v":0}]
["","y.",{"$f":"Orçamento!P283","v":"PINTURA"},{"$f":"Orçamento!S283","v":0},{"$f":"Orçamento!V283","v":0},{"$f":"Orçamento!X283","v":0}]
["","z.",{"$f":"Orçamento!P284","v":"DIVERSOS"},{"$f":"Orçamento!S284","v":0},{"$f":"Orçamento!V284","v":0},{"$f":"Orçamento!X284","v":0}]
["F","TOTAL GERAL DO ORÇAMENTO",null,{"$f":"SUM(D17:D42)","v":0},{"$f":"SUM(E17:E42)","v":0},{"$f":"SUM(F17:F42)","v":0}]
[]
[null,"(*) Para itens da AGETOP, os vidros não estão inclusos nas esquadrias e já foram considerados os custos de contramarco para as esquadrias de alumínio;"]

{"sheet":"Cronog_30_Dias","index":3,"n_rows":99,"n_cols":14,"rows_kept":99,"cut":false,"hidden":false,"merged":[[97,1,97,4],[98,1,98,13],[94,1,94,2],[94,5,94,8],[94,9,94,12],[95,1,95,2],[95,5,95,8],[95,9,95,12],[92,1,92,2],[92,5,92,8],[92,9,92,12],[93,1,93,2],[93,5,93,8],[93,9,93,12],[89,1,91,2],[89,3,91,3],[89,4,91,4],[89,5,89,8],[89,9,89,12],[91,5,91,8],[91,9,91,12],[86,1,88,2],[86,3,88,3],[86,4,88,4],[86,5,86,8],[86,9,86,12],[88,5,88,8],[88,9,88,12],[83,1,85,2],[83,3,85,3],[83,4,85,4],[83,5,83,8],[83,9,83,12],[85,5,85,8],[85,9,85,12],[80,1,82,2],[80,3,82,3],[80,4,82,4],[80,5,80,8],[80,9,80,12],[82,5,82,8],[82,9,82,12],[77,1,79,2],[77,3,79,3],[77,4,79,4],[77,5,77,8],[77,9,77,12],[79,5,79,8],[79,9,79,12],[74,1,76,2],[74,3,76,3],[74,4,76,4],[74,5,74,8],[74,9,74,12],[76,5,76,8],[76,9,76,12],[71,1,73,2],[71,3,73,3],[71,4,73,4],[71,5,71,8],[71,9,71,12],[73,5,73,8],[73,9,73,12],[68,1,70,2],[68,3,70,3],[68,4,70,4],[68,5,68,8],[68,9,68,12],[70,5,70,8],[70,9,70,12],[65,1,67,2],[65,3,67,3],[65,4,67,4],[65,5,65,8],[65,9,65,12],[67,5,67,8],[67,9,67,12],[62,1,64,2],[62,3,64,3],[62,4,64,4],[62,5,62,8],[62,9,62,12],[64,5,64,8],[64,9,64,12],[59,1,61,2],[59,3,61,3],[59,4,61,4],[59,5,59,8],[59,9,59,12],[61,5,61,8],[61,9,61,12],[56,1,58,2],[56,3,58,3],[56,4,58,4],[56,5,56,8],[56,9,56,12],[58,5,58,8],[58,9,58,12],[53,1,55,2],[53,3,55,3],[53,4,55,4],[53,5,53,8],[53,9,53,12],[55,5,55,8],[55,9,55,12],[50,1,52,2],[50,3,52,3],[50,4,52,4],[50,5,50,8],[50,9,50,12],[52,5,52,8],[52,9,52,12],[47,1,49,2],[47,3,49,3],[47,4,49,4],[47,5,47,8],[47,9,47,12],[49,5,49,8],[49,9,49,12],[44,1,46,2],[44,3,46,3],[44,4,46,4],[44,5,44,8],[44,9,44,12],[46,5,46,8],[46,9,46,12],[41,1,43,2],[41,3,43,3],[41,4,43,4],[41,5,41,8],[41,9,41,12],[43,5,43,8],[43,9,43,12],[38,1,40,2],[38,3,40,3],[38,4,40,4],[38,5,38,8],[38,9,38,12],[40,5,40,8],[40,9,40,12],[35,1,37,2],[35,3,37,3],[35,4,37,4],[35,5,35,8],[35,9,35,12],[37,5,37,8],[37,9,37,12],[32,1,34,2],[32,3,34,3],[32,4,34,4],[32,5,32,8],[32,9,32,12],[34,5,34,8],[34,9,34,12],[29,1,31,2],[29,3,31,3],[29,4,31,4],[29,5,29,8],[29,9,29,12],[31,5,31,8],[31,9,31,12],[26,1,28,2],[26,3,28,3],[26,4,28,4],[26,5,26,8],[26,9,26,12],[28,5,28,8],[28,9,28,12],[23,1,25,2],[23,3,25,3],[23,4,25,4],[23,5,23,8],[23,9,23,12],[25,5,25,8],[25,9,25,12],[20,1,22,2],[20,3,22,3],[20,4,22,4],[20,5,20,8],[20,9,20,12],[22,5,22,8],[22,9,22,12],[17,1,19,2],[17,3,19,3],[17,4,19,4],[17,5,17,8],[17,9,17,12],[19,5,19,8],[19,9,19,12],[14,1,16,2],[14,3,16,3],[14,4,16,4],[14,5,14,8],[14,9,14,12],[16,5,16,8],[16,9,16,12],[12,0,13,0],[12,3,13,3],[12,5,12,8],[12,9,12,12],[12,13,13,13],[13,1,13,2],[13,5,13,8],[13,9,13,12],[8,1,8,7],[8,8,8,13],[9,0,11,0],[9,1,9,7],[9,8,9,13],[10,1,10,13],[11,1,11,13],[4,1,4,13],[5,1,5,7],[5,8,5,13],[6,1,6,7],[6,8,6,13],[7,1,7,13],[0,1,0,13],[1,1,1,13],[2,1,2,7],[2,8,2,13],[3,1,3,7],[3,8,3,13]]}
[]
[]
[null,"UNIDADE ESCOLAR",null,null,null,null,null,null,"PRAZO"]
[null,{"$f":"[1]Orçamento!$O$5","v":"COLÉGIO ESTADUAL PROFESSOR ANTÔNIO MARÇO DE ARAUJO"},null,null,null,null,null,null,"30 DIAS CORRIDOS"]
[]
[null,"OBRA",null,null,null,null,null,null,"DATA"]
[null,{"$f":"[1]Orçamento!$O$8","v":"REFORMA"},null,null,null,null,null,null,{"$f":"[1]Orçamento!$S$8","v":"2019-12-12"}]
[]
[null,"LOCAL",null,null,null,null,null,null,"ÁREA TOTAL CONSTRUÍDA (M²)"]
["FILTRO",{"$f":"[1]Orçamento!$V$8","v":"LUZIÂNIA"},null,null,null,null,null,null,{"$f":"[1]Orçamento!$S$14","v":1463.27}]
[]
[null,"CRONOGRAMA - FÍSICO FINANCEIRO"]
["↓","CUSTO TOTAL:",{"$f":"D93","v":{"$error":"#REF!"}},"VALOR","Dias:",15,null,null,null,30,null,null,null,"TOTAL"]
[null,"DESCRIÇÃO DOS SERVIÇOS",null,null,"%","1ª PARCELA",null,null,null,"2ª PARCELA"]
[{"$f":"IF(D15>0,\"F\",\"\")","v":{"$error":"#REF!"}},"SERVIÇOS PRELIMINARES",null,{"$f":"#REF!","v":{"$error":"#REF!"}},{"$f":"Orçamento!X259","v":0},{"$f":"ROUND(F17*$D$15,2)","v":{"$error":"#REF!"}},null,null,null,{"$f":"ROUND(J17*$D$15,2)","v":{"$error":"#REF!"}},null,null,null,{"$f":"SUM(F15:M15)","v":{"$error":"#REF!"}}]
[{"$f":"IF(A15=\"F\",A15,\"\")","v":{"$error":"#REF!"}}]
[{"$f":"IF(A16=\"F\",A16,\"\")","v":{"$error":"#REF!"}},null,null,null,null,1,null,null,null,{"$f":"1-F17","v":0},null,null,null,{"$f":"IFERROR(E15/100,\"\")","v":0}]
[{"$f":"IF(D18>0,\"F\",\"\")","v":{"$error":"#REF!"}},"TRANSPORTES",null,{"$f":"#REF!","v":{"$error":"#REF!"}},{"$f":"Orçamento!X260","v":0},{"$f":"ROUND(F20*$D$18,2)","v":{"$error":"#REF!"}},null,null,null,{"$f":"ROUND(J20*$D$18,2)","v":{"$error":"#REF!"}},null,null,null,{"$f":"SUM(F18:M18)","v":{"$error":"#REF!"}}]
[{"$f":"IF(A18=\"F\",A18,\"\")","v":{"$error":"#REF!"}}]
[{"$f":"IF(A19=\"F\",A19,\"\")","v":{"$error":"#REF!"}},null,null,null,null,0.48,null,null,null,{"$f":"1-F20","v":0.52},null,null,null,{"$f":"IFERROR(E18/100,\"\")","v":0}]
[{"$f":"IF(D21>0,\"F\",\"\")","v":{"$error":"#REF!"}},"SERVIÇO EM TERRA",null,{"$f":"#REF!","v":{"$error":"#REF!"}},{"$f":"Orçamento!X261","v":0},{"$f":"ROUND(F23*$D$21,2)","v":{"$error":"#REF!"}},null,null,null,{"$f":"ROUND(J23*$D$21,2)","v":{"$error":"#REF!"}},null,null,null,{"$f":"SUM(F21:M21)","v":{"$error":"#REF!"}}]
[{"$f":"IF(A21=\"F\",A21,\"\")","v":{"$error":"#REF!"}}]
[{"$f":"IF(A22=\"F\",A22,\"\")","v":{"$error":"#REF!"}},null,null,null,null,1,null,null,null,{"$f":"1-F23","v":0},null,null,null,{"$f":"IFERROR(E21/100,\"\")","v":0}]
[{"$f":"IF(D24>0,\"F\",\"\")","v":{"$error":"#REF!"}},"FUNDAÇÕES E SONDAGENS",null,{"$f":"#REF!","v":{"$error":"#REF!"}},{"$f":"Orçamento!X262","v":0},{"$f":"ROUND(F26*$D$24,2)","v":{"$error":"#REF!"}},null,null,null,{"$f":"ROUND(J26*$D$24,2)","v":{"$error":"#REF!"}},null,null,null,{"$f":"SUM(F24:M24)","v":{"$error":"#REF!"}}]
[{"$f":"IF(A24=\"F\",A24,\"\")","v":{"$error":"#REF!"}}]
[{"$f":"IF(A25=\"F\",A25,\"\")","v":{"$error":"#REF!"}},null,null,null,null,1,null,null,null,{"$f":"1-F26","v":0},null,null,null,{"$f":"IFERROR(E24/100,\"\")","v":0}]
[{"$f":"IF(D27>0,\"F\",\"\")","v":{"$error":"#REF!"}},"ESTRUTURA",null,{"$f":"#REF!","v":{"$error":"#REF!"}},{"$f":"Orçamento!X263","v":0},{"$f":"ROUND(F29*$D$27,2)","v":{"$error":"#REF!"}},null,null,null,{"$f":"ROUND(J29*$D$27,2)","v":{"$error":"#REF!"}},null,null,null,{"$f":"SUM(F27:M27)","v":{"$error":"#REF!"}}]
[{"$f":"IF(A27=\"F\",A27,\"\")","v":{"$error":"#REF!"}}]
[{"$f":"IF(A28=\"F\",A28,\"\")","v":{"$error":"#REF!"}},null,null,null,null,0.49,null,null,null,{"$f":"1-F29","v":0.51},null,null,null,{"$f":"IFERROR(E27/100,\"\")","v":0}]
[{"$f":"IF(D30>0,\"F\",\"\")","v":{"$error":"#REF!"}},"INST.ELET/TELEFÔNICA/CABEAMENTO ESTRUTURADO",null,{"$f":"#REF!","v":{"$error":"#REF!"}},{"$f":"Orçamento!X264","v":0},{"$f":"ROUND(F32*$D$30,2)","v":{"$error":"#REF!"}},null,null,null,{"$f":"ROUND(J32*$D$30,2)","v":{"$error":"#REF!"}},null,null,null,{"$f":"SUM(F30:M30)","v":{"$error":"#REF!"}}]
[{"$f":"IF(A30=\"F\",A30,\"\")","v":{"$error":"#REF!"}}]
[{"$f":"IF(A31=\"F\",A31,\"\")","v":{"$error":"#REF!"}},null,null,null,null,0.4,null,null,null,{"$f":"1-F32","v":0.6},null,null,null,{"$f":"IFERROR(E30/100,\"\")","v":0}]
[{"$f":"IF(D33>0,\"F\",\"\")","v":{"$error":"#REF!"}},"INSTALAÇÕES HIDROSSANITÁRIAS",null,{"$f":"#REF!","v":{"$error":"#REF!"}},{"$f":"Orçamento!X265","v":0},{"$f":"ROUND(F35*$D$33,2)","v":{"$error":"#REF!"}},null,null,null,{"$f":"ROUND(J35*$D$33,2)","v":{"$error":"#REF!"}},null,null,null,{"$f":"SUM(F33:M33)","v":{"$error":"#REF!"}}]
[{"$f":"IF(A33=\"F\",A33,\"\")","v":{"$error":"#REF!"}}]
[{"$f":"IF(A34=\"F\",A34,\"\")","v":{"$error":"#REF!"}},null,null,null,null,0.48,null,null,null,{"$f":"1-F35","v":0.52},null,null,null,{"$f":"IFERROR(E33/100,\"\")","v":0}]
[{"$f":"IF(D36>0,\"F\",\"\")","v":{"$error":"#REF!"}},"INSTALAÇÕES ESPECIAIS",null,{"$f":"#REF!","v":{"$error":"#REF!"}},{"$f":"Orçamento!X266","v":0},{"$f":"ROUND(F38*$D$36,2)","v":{"$error":"#REF!"}},null,null,null,{"$f":"ROUND(J38*$D$36,2)","v":{"$error":"#REF!"}},null,null,null,{"$f":"SUM(F36:M36)","v":{"$error":"#REF!"}}]
[{"$f":"IF(A36=\"F\",A36,\"\")","v":{"$error":"#REF!"}}]
[{"$f":"IF(A37=\"F\",A37,\"\")","v":{"$error":"#REF!"}},null,null,null,null,1,null,null,null,{"$f":"1-F38","v":0},null,null,null,{"$f":"IFERROR(E36/100,\"\")","v":0}]
[{"$f":"IF(D39>0,\"F\",\"\")","v":{"$error":"#REF!"}},"ALVENARIA E DIVISÓRIAS",null,{"$f":"#REF!","v":{"$error":"#REF!"}},{"$f":"Orçamento!X267","v":0},{"$f":"ROUND(F41*$D$39,2)","v":{"$error":"#REF!"}},null,null,null,{"$f":"ROUND(J41*$D$39,2)","v":{"$error":"#REF!"}},null,null,null,{"$f":"SUM(F39:M39)","v":{"$error":"#REF!"}}]
[{"$f":"IF(A39=\"F\",A39,\"\")","v":{"$error":"#REF!"}}]
[{"$f":"IF(A40=\"F\",A40,\"\")","v":{"$error":"#REF!"}},null,null,null,null,1,null,null,null,{"$f":"1-F41","v":0},null,null,null,{"$f":"IFERROR(E39/100,\"\")","v":0}]
[{"$f":"IF(D42>0,\"F\",\"\")","v":""},"ALVENARIA AUTO-PORTANTE",null,{"$f":"[1]Orçamento!V93","v":0},{"$f":"[1]Orçamento!X93","v":0},{"$f":"ROUND(F44*$D$42,2)","v":0},null,null,null,{"$f":"ROUND(J44*$D$42,2)","v":0},null,null,null,{"$f":"SUM(F42:M42)","v":0}]
[{"$f":"IF(A42=\"F\",A42,\"\")","v":""}]
[{"$f":"IF(A43=\"F\",A43,\"\")","v":""},null,null,null,null,1,null,null,null,{"$f":"1-F44","v":0},null,null,null,{"$f":"IFERROR(E42/100,\"\")","v":0}]
[{"$f":"IF(D45>0,\"F\",\"\")","v":""},"IMPERMEABILIZAÇÃO",null,{"$f":"[3]Cronog_60_Dias!D45","v":0},{"$f":"[1]Orçamento!X94","v":0.28999999999999998},{"$f":"ROUND(F47*$D$45,2)","v":0},null,null,null,{"$f":"ROUND(J47*$D$45,2)","v":0},null,null,null,{"$f":"SUM(F45:M45)","v":0}]
[{"$f":"IF(A45=\"F\",A45,\"\")","v":""}]
[{"$f":"IF(A46=\"F\",A46,\"\")","v":""},null,null,null,null,1,null,null,null,{"$f":"1-F47","v":0},null,null,null,{"$f":"IFERROR(E45/100,\"\")","v":2.8999999999999998E-3}]
[{"$f":"IF(D48>0,\"F\",\"\")","v":""},"ISOLAMENTO TÉRMICO E ACÚSTICO",null,{"$f":"[1]Orçamento!V95","v":0},{"$f":"[1]Orçamento!X95","v":0},{"$f":"ROUND(F50*$D$48,2)","v":0},null,null,null,{"$f":"ROUND(J50*$D$48,2)","v":0},null,null,null,{"$f":"SUM(F48:M48)","v":0}]
[{"$f":"IF(A48=\"F\",A48,\"\")","v":""}]
[{"$f":"IF(A49=\"F\",A49,\"\")","v":""},null,null,null,null,0.5,null,null,null,{"$f":"1-F50","v":0.5},null,null,null,{"$f":"IFERROR(E48/100,\"\")","v":0}]
[{"$f":"IF(D51>0,\"F\",\"\")","v":""},"ESTRUTURA DE MADEIRA",null,null,{"$f":"[1]Orçamento!X96","v":41.12},{"$f":"ROUND(F53*$D$51,2)","v":0},null,null,null,{"$f":"ROUND(J53*$D$51,2)","v":0},null,null,null,{"$f":"SUM(F51:M51)","v":0}]
[{"$f":"IF(A51=\"F\",A51,\"\")","v":""}]
[{"$f":"IF(A52=\"F\",A52,\"\")","v":""},null,null,null,null,0.4,null,null,null,{"$f":"1-F53","v":0.6},null,null,null,{"$f":"IFERROR(E51/100,\"\")","v":0.41119999999999995}]
[{"$f":"IF(D54>0,\"F\",\"\")","v":{"$error":"#REF!"}},"ESTRUTURA METÁLICA",null,{"$f":"#REF!","v":{"$error":"#REF!"}},{"$f":"Orçamento!X275","v":0},{"$f":"ROUND(F56*$D$54,2)","v":{"$error":"#REF!"}},null,null,null,{"$f":"ROUND(J56*$D$54,2)","v":{"$error":"#REF!"}},null,null,null,{"$f":"SUM(F54:M54)","v":{"$error":"#REF!"}}]
[{"$f":"IF(A54=\"F\",A54,\"\")","v":{"$error":"#REF!"}}]
[{"$f":"IF(A55=\"F\",A55,\"\")","v":{"$error":"#REF!"}},null,null,null,null,0.35,null,null,null,{"$f":"1-F56","v":0.65},null,null,null,{"$f":"IFERROR(E54/100,\"\")","v":0}]
[{"$f":"IF(D57>0,\"F\",\"\")","v":""},"COBERTURAS",null,null,{"$f":"[1]Orçamento!X98","v":14.95},{"$f":"ROUND(F59*$D$57,2)","v":0},null,null,null,{"$f":"ROUND(J59*$D$57,2)","v":0},null,null,null,{"$f":"SUM(F57:M57)","v":0}]
[{"$f":"IF(A57=\"F\",A57,\"\")","v":""}]
[{"$f":"IF(A58=\"F\",A58,\"\")","v":""},null,null,null,null,0,null,null,null,{"$f":"1-F59","v":1},null,null,null,{"$f":"IFERROR(E57/100,\"\")","v":0.14949999999999999}]
[{"$f":"IF(D60>0,\"F\",\"\")","v":""},"ESQUADRIAS DE MADEIRA",null,{"$f":"[1]Orçamento!V99","v":0},{"$f":"[1]Orçamento!X99","v":0},{"$f":"ROUND(F62*$D$60,2)","v":0},null,null,null,{"$f":"ROUND(J62*$D$60,2)","v":0},null,null,null,{"$f":"SUM(F60:M60)","v":0}]
[{"$f":"IF(A60=\"F\",A60,\"\")","v":""}]
[{"$f":"IF(A61=\"F\",A61,\"\")","v":""},null,null,null,null,0.54,null,null,null,{"$f":"1-F62","v":0.45999999999999996},null,null,null,{"$f":"IFERROR(E60/100,\"\")","v":0}]
[{"$f":"IF(D63>0,\"F\",\"\")","v":""},"ESQUADRIAS METÁLICAS",null,{"$f":"[1]Orçamento!V100","v":0},{"$f":"[1]Orçamento!X100","v":0},{"$f":"ROUND(F65*$D$63,2)","v":0},null,null,null,{"$f":"ROUND(J65*$D$63,2)","v":0},null,null,null,{"$f":"SUM(F63:M63)","v":0}]
[{"$f":"IF(A63=\"F\",A63,\"\")","v":""}]
[{"$f":"IF(A64=\"F\",A64,\"\")","v":""},null,null,null,null,0.49,null,null,null,{"$f":"1-F65","v":0.51},null,null,null,{"$f":"IFERROR(E63/100,\"\")","v":0}]
[{"$f":"IF(D66>0,\"F\",\"\")","v":{"$error":"#REF!"}},"VIDROS",null,{"$f":"#REF!","v":{"$error":"#REF!"}},{"$f":"Orçamento!X276","v":0},{"$f":"ROUND(F68*$D$66,2)","v":{"$error":"#REF!"}},null,null,null,{"$f":"ROUND(J68*$D$66,2)","v":{"$error":"#REF!"}},null,null,null,{"$f":"SUM(F66:M66)","v":{"$error":"#REF!"}}]
[{"$f":"IF(A66=\"F\",A66,\"\")","v":{"$error":"#REF!"}}]
[{"$f":"IF(A67=\"F\",A67,\"\")","v":{"$error":"#REF!"}},null,null,null,null,0,null,null,null,{"$f":"1-F68","v":1},null,null,null,{"$f":"IFERROR(E66/100,\"\")","v":0}]
[{"$f":"IF(D69>0,\"F\",\"\")","v":{"$error":"#REF!"}},"REVESTIMENTO DE PAREDE",null,{"$f":"#REF!","v":{"$error":"#REF!"}},{"$f":"Orçamento!X277","v":0},{"$f":"ROUND(F71*$D$69,2)","v":{"$error":"#REF!"}},null,null,null,{"$f":"ROUND(J71*$D$69,2)","v":{"$error":"#REF!"}},null,null,null,{"$f":"SUM(F69:M69)","v":{"$error":"#REF!"}}]
[{"$f":"IF(A69=\"F\",A69,\"\")","v":{"$error":"#REF!"}}]
[{"$f":"IF(A70=\"F\",A70,\"\")","v":{"$error":"#REF!"}},null,null,null,null,0.32,null,null,null,{"$f":"1-F71","v":0.67999999999999994},null,null,null,{"$f":"IFERROR(E69/100,\"\")","v":0}]
[{"$f":"IF(D72>0,\"F\",\"\")","v":""},"FORROS",null,{"$f":"[1]Orçamento!V103","v":0},{"$f":"[1]Orçamento!X103","v":0},{"$f":"ROUND(F74*$D$72,2)","v":0},null,null,null,{"$f":"ROUND(J74*$D$72,2)","v":0},null,null,null,{"$f":"SUM(F72:M72)","v":0}]
[{"$f":"IF(A72=\"F\",A72,\"\")","v":""}]
[{"$f":"IF(A73=\"F\",A73,\"\")","v":""},null,null,null,null,0.24,null,null,null,{"$f":"1-F74","v":0.76},null,null,null,{"$f":"IFERROR(E72/100,\"\")","v":0}]
[{"$f":"IF(D75>0,\"F\",\"\")","v":{"$error":"#REF!"}},"REVESTIMENTO DE PISO",null,{"$f":"#REF!","v":{"$error":"#REF!"}},{"$f":"Orçamento!X279","v":0},{"$f":"ROUND(F77*$D$75,2)","v":{"$error":"#REF!"}},null,null,null,{"$f":"ROUND(J77*$D$75,2)","v":{"$error":"#REF!"}},null,null,null,{"$f":"SUM(F75:M75)","v":{"$error":"#REF!"}}]
[{"$f":"IF(A75=\"F\",A75,\"\")","v":{"$error":"#REF!"}}]
[{"$f":"IF(A76=\"F\",A76,\"\")","v":{"$error":"#REF!"}},null,null,null,null,0.49,null,null,null,{"$f":"1-F77","v":0.51},null,null,null,{"$f":"IFERROR(E75/100,\"\")","v":0}]
[{"$f":"IF(D78>0,\"F\",\"\")","v":""},"FERRAGENS",null,{"$f":"[1]Orçamento!V105","v":0},{"$f":"[1]Orçamento!X105","v":0},{"$f":"ROUND(F80*$D$78,2)","v":0},null,null,null,{"$f":"ROUND(J80*$D$78,2)","v":0},null,null,null,{"$f":"SUM(F78:M78)","v":0}]
[{"$f":"IF(A78=\"F\",A78,\"\")","v":""}]
[{"$f":"IF(A79=\"F\",A79,\"\")","v":""},null,null,null,null,0,null,null,null,{"$f":"1-F80","v":1},null,null,null,{"$f":"IFERROR(E78/100,\"\")","v":0}]
[{"$f":"IF(D81>0,\"F\",\"\")","v":""},"MARCENARIA",null,{"$f":"[1]Orçamento!V106","v":0},{"$f":"[1]Orçamento!X106","v":0},{"$f":"ROUND(F83*$D$81,2)","v":0},null,null,null,{"$f":"ROUND(J83*$D$81,2)","v":0},null,null,null,{"$f":"SUM(F81:M81)","v":0}]
[{"$f":"IF(A81=\"F\",A81,\"\")","v":""}]
[{"$f":"IF(A82=\"F\",A82,\"\")","v":""},null,null,null,null,0.4,null,null,null,{"$f":"1-F83","v":0.6},null,null,null,{"$f":"IFERROR(E81/100,\"\")","v":0}]
[{"$f":"IF(D84>0,\"F\",\"\")","v":{"$error":"#REF!"}},"ADMINISTRAÇÃO - MENSALISTAS",null,{"$f":"#REF!","v":{"$error":"#REF!"}},{"$f":"Orçamento!X282","v":0},{"$f":"ROUND(F86*$D$84,2)","v":{"$error":"#REF!"}},null,null,null,{"$f":"ROUND(J86*$D$84,2)","v":{"$error":"#REF!"}},null,null,null,{"$f":"SUM(F84:M84)","v":{"$error":"#REF!"}}]
[{"$f":"IF(A84=\"F\",A84,\"\")","v":{"$error":"#REF!"}}]
[{"$f":"IF(A85=\"F\",A85,\"\")","v":{"$error":"#REF!"}},null,null,null,null,0.49,null,null,null,{"$f":"1-F86","v":0.51},null,null,null,{"$f":"IFERROR(E84/100,\"\")","v":0}]
[{"$f":"IF(D87>0,\"F\",\"\")","v":{"$error":"#REF!"}},"PINTURA",null,{"$f":"#REF!","v":{"$error":"#REF!"}},{"$f":"Orçamento!X283","v":0},{"$f":"ROUND(F89*$D$87,2)","v":{"$error":"#REF!"}},null,null,null,{"$f":"ROUND(J89*$D$87,2)","v":{"$error":"#REF!"}},null,null,null,{"$f":"SUM(F87:M87)","v":{"$error":"#REF!"}}]
[{"$f":"IF(A87=\"F\",A87,\"\")","v":{"$error":"#REF!"}}]
[{"$f":"IF(A88=\"F\",A88,\"\")","v":{"$error":"#REF!"}},null,null,null,null,0,null,null,null,{"$f":"1-F89","v":1},null,null,null,{"$f":"IFERROR(E87/100,\"\")","v":0}]
[{"$f":"IF(D90>0,\"F\",\"\")","v":{"$error":"#REF!"}},"DIVERSOS",null,{"$f":"#REF!","v":{"$error":"#REF!"}},{"$f":"Orçamento!X284","v":0},{"$f":"ROUND(F92*$D$90,2)","v":{"$error":"#REF!"}},null,null,null,{"$f":"ROUND(J92*$D$90,2)","v":{"$error":"#REF!"}},null,null,null,{"$f":"SUM(F90:M90)","v":{"$error":"#REF!"}}]
[{"$f":"IF(A90=\"F\",A90,\"\")","v":{"$error":"#REF!"}}]
[{"$f":"IF(A91=\"F\",A91,\"\")","v":{"$error":"#REF!"}},null,null,null,null,0.46,null,null,null,{"$f":"1-F92","v":0.54},null,null,null,{"$f":"IFERROR(E90/100,\"\")","v":0}]
["F","CUSTO DO ORÇAMENTO",null,{"$f":"SUM(D15:D92)","v":{"$error":"#REF!"}},{"$f":"SUM(E15:E92)","v":56.36},{"$f":"F15+F18+F21+F24+F27+F30+F33+F36+F39+F42+F45+F48+F51+F54+F57+F60+F63+F66+F69+F72+F75+F78+F81+F84+F87+F90","v":{"$error":"#REF!"}},null,null,null,{"$f":"J15+J18+J21+J24+J27+J30+J33+J36+J39+J42+J45+J48+J51+J54+J57+J60+J63+J66+J69+J72+J75+J78+J81+J84+J87+J90","v":{"$error":"#REF!"}},null,null,null,{"$f":"N15+N18+N21+N24+N27+N30+N33+N36+N39+N42+N45+N48+N51+N54+N57+N60+N63+N66+N69+N72+N75+N78+N81+N84+N87+N90","v":{"$error":"#REF!"}}]
["F","PERCENTUAIS:",null,null,null,{"$f":"IFERROR(F93/D93,\"\")","v":""},null,null,null,{"$f":"IFERROR(J93/D93,\"\")","v":""},null,null,null,{"$f":"SUM(F94:M94)","v":0}]
["F","TOTAIS ACUMULADOS:",null,null,null,{"$f":"F93","v":{"$error":"#REF!"}},null,null,null,{"$f":"F95+J93","v":{"$error":"#REF!"}}]
["F","PERCENTUAIS  ACUMULADOS:",null,null,null,{"$f":"F94","v":""},null,null,null,{"$f":"IFERROR(F96+J94,\"\")","v":""}]
["F"]
["F","OBSERVAÇÕES:"]
["F","Os pagamentos somente poderão ser efetuados mediante medição e atesto pelos técnicos da Secretaria da Educação. "]

{"sheet":"Composição BDI","index":4,"n_rows":45,"n_cols":9,"rows_kept":45,"cut":false,"hidden":false,"merged":[[11,0,11,3],[12,0,12,3],[14,0,14,3],[15,0,15,3],[13,0,13,3],[0,0,0,3],[1,0,1,3],[4,0,4,3],[7,0,7,3],[10,0,10,3],[2,0,2,3],[3,0,3,3],[5,0,5,3],[6,0,6,3],[8,0,8,3],[9,0,9,3],[18,5,18,8],[17,0,17,3],[16,0,16,3],[44,0,44,3],[42,0,42,3],[43,0,43,3],[18,0,18,3],[36,0,36,3],[39,0,39,3],[38,0,38,3],[40,0,40,3],[29,0,29,2],[32,0,32,3],[33,0,33,3],[34,0,34,3],[35,0,35,3]]}
[]
[]
["UNIDADE ESCOLAR"]
[{"$f":"Orçamento!$O$5","v":"CENTRO DE ENSINO EM PERÍODO INTEGRAL PROFESSORA IZABEL CHRISTINA DE SOUSA ORTIZ"}]
[]
["OBRA"]
[{"$f":"Orçamento!$O$8","v":"REFORMA E AMPLIAÇÃO"}]
[]
["ENDEREÇO"]
[{"$f":"Orçamento!$R$11","v":"RUA 65, PRAÇA N°04 S/N, PQ LAGO DE FORMOSA, CEP:73813-872"}]
[]
["CIDADE"]
[{"$f":"Orçamento!$V$8","v":"FORMOSA"}]
[]
["CRE"]
[{"$f":"Orçamento!$O$11","v":"FORMOSA"}]
[]
["DETALHAMENTO DA COMPOSIÇÃO DE BDI"]
["COMPOSIÇÃO BDI PARA OBRAS CIVIS",null,null,null,null,"BDI CONSTRUÇÃO E REFORMA"]
["DESCRIÇÃO","COEF.","TAXA % (a.m)","% no preço de venda",null,"Situação","1º Quartil","Médio","3º Quartil"]
["1) COFINS",1,0.03,{"$f":"C21","v":0.03},null,{"$f":"IF(OR(C21<G21,C21>I21),\"FORA DO INTERVALO\",\"OK\")","v":"OK"},0.03,0.03,0.03]
["2) PIS",1,6.4999999999999997E-3,{"$f":"C22","v":6.4999999999999997E-3},null,{"$f":"IF(OR(C22<G22,C22>I22),\"FORA DO INTERVALO\",\"OK\")","v":"OK"},6.4999999999999997E-3,6.4999999999999997E-3,6.4999999999999997E-3]
["3) ISSQN",1,{"$f":"IFERROR(VLOOKUP($A$13,#REF!,10,FALSE())/100,0)","v":0},{"$f":"C23*B23","v":0},null,"FORA DO INTERVALO",0.02,3.5000000000000003E-2,0.05]
["4) CPRB",1,{"$f":"IF(Orçamento!$T$11=\"DESONERADA\",4.5%,0)","v":4.4999999999999998E-2},{"$f":"C24","v":4.4999999999999998E-2},null,"OK",4.4999999999999998E-2,4.4999999999999998E-2,4.4999999999999998E-2]
["5) Administração Central",1,4.4999999999999998E-2,4.4999999999999998E-2,null,"OK",0.03,0.04,5.5E-2]
["6) Despesas Financeiras",1,5.5999999999999999E-3,5.5999999999999999E-3,null,"FORA DO INTERVALO",5.8999999999999999E-3,1.23E-2,1.3899999999999999E-2]
["7) Seguros + Garantias",1,1.1999999999999999E-3,1.1999999999999999E-3,null,"FORA DO INTERVALO",8.0000000000000002E-3,8.0000000000000002E-3,0.01]
["8) Risco",1,9.7000000000000003E-3,9.7000000000000003E-3,null,"OK",9.7000000000000003E-3,1.2699999999999999E-2,1.2699999999999999E-2]
["9) Lucro",1,7.4999999999999997E-2,7.4999999999999997E-2,null,"OK",6.1600000000000002E-2,7.3999999999999996E-2,8.9599999999999999E-2]
["BDI - FINAL",null,null,0.26336360597675723,null,{"$f":"IF(OR(D30<G30,D30>I30),\"FORA DO INTERVALO\",\"OK\")","v":"FORA DO INTERVALO"},0.2034,0.22120000000000001,0.25]
[]
["Notas:"]
["(1) e (2) Alíquota definida por lei."]
["(3) Alíquota e base de cálculo definidas pela legislação municipal."]
["(4) Alíquota definida pelas leis 12.546/11, 12844/13 e 13.161/15 (CPRB – contribuição previdenciária sobre a receita bruta)."]
["(5) Valores definidos a partir dos limites no Acórdão nº 2.622/2013 - TCU – Plenário. Valores entre o 1º e 3º quartis."]
["(6) Valor calculado pela expressão matemática do acórdão 2.369/2011 – TCU – Plenário e disponibilizado pela AGETOP em dezembro de 2018. (Foi utilizado para o cálculo a média da Taxa SELIC no período de 11/2017 a 10/2018)"]
[]
["(7) Valores definidos pela AGETOP a partir dos limites no Acórdão nº 2.622/2013 - TCU – Plenário. Valores médios. \n\nObservação da AGETOP: (Seguros contra erros de execução, incêndio e explosão, danos da natureza (vendaval, destelhamento, alagamento, inundação, desmoronamento, geadas etc.), emprego de material defeituoso ou inadequado, roubo e/ou furto qualificado, quebra de equipamentos, desmoronamento de estrutura, nas modalidades de Obras Civis em Construção (OCC); Instalação e Montagem (IM); e Obras Civis em Construção e Instalação e Montagem (OCC/IM). Bem como coberturas adicionais para ampliação dessas coberturas básicas, como: cobertura de responsabilidade civil geral, cobertura de responsabilidade civil cruzada, cobertura de despesas extraordinárias, cobertura de tumultos, cobertura de desentulho do local, cobertura de riscos do fabricante, dentre outras, incluindo o seguro de vida em grupo regido pela convenção coletiva dos trabalhadores na indústria da construção civil). A partir de 24/02/2015 por intermédio da Portaria 449/2015 a Presidência da AGETOP, na pessoa do Senhor Jayme Eduardo Rincon, determinou a exclusão dos valores referentes aos Seguros de Risco de Engenharia e Responsabilidade Civil do Profissional na composição do cálculo do B.D.I.."]
["(8) Valores definidos a partir dos limites no Acórdão nº 2.622/2013 - TCU – Plenário. Valores entre 1º e 3° quartis."]
["(9) Valores definidos a partir dos limites definidos no Acórdão nº 2.622/2013 - TCU – Plenário. Valores adotados e praticados no mercado ( “ ex ante ” ) ou aqueles entre os 1º e 3º quartis."]
[]
["(*) A fórmula para estipulação da taxa de BDI estimado adotado é a mesma que foi aplicada para a obtenção das tabelas contidas no Acórdão n. 2.622/2013 – TCUPlenário"]
[]
["Obs.: Para obras com valores superiores a R$ 20.000.000,00 sugere-se recalcular o BDI, dimensionando as taxas de administração central e lucro para patamares inferiores ao estipulado acima."]

{"sheet":"Relatório CENTRAL","index":5,"n_rows":40,"n_cols":5,"rows_kept":40,"cut":false,"hidden":false,"merged":[[11,1,11,4],[39,1,39,2],[9,0,11,0],[0,1,0,4],[6,3,6,4],[9,3,9,4],[1,1,1,4],[2,1,2,2],[2,3,2,4],[3,1,3,2],[3,3,3,4],[4,1,4,4],[5,1,5,2],[5,3,5,4],[6,1,6,2],[7,1,7,4],[8,1,8,2],[8,3,8,4],[9,1,9,2],[10,1,10,4]]}
[]
[]
[null,"UNIDADE ESCOLAR",null,"CIDADE"]
[null,{"$f":"Orçamento!$O$5","v":"CENTRO DE ENSINO EM PERÍODO INTEGRAL PROFESSORA IZABEL CHRISTINA DE SOUSA ORTIZ"},null,{"$f":"Orçamento!$V$8","v":"FORMOSA"}]
[]
[null,"OBRA",null,"CRE"]
[null,{"$f":"Orçamento!$O$8","v":"REFORMA E AMPLIAÇÃO"},null,{"$f":"Orçamento!$O$11","v":"FORMOSA"}]
[]
[null,"ENDEREÇO",null,"DATA"]
["FILTRO",{"$f":"Orçamento!$R$11","v":"RUA 65, PRAÇA N°04 S/N, PQ LAGO DE FORMOSA, CEP:73813-872"},null,{"$f":"Orçamento!$S$8","v":"2020-03-19"}]
[]
[null,"RELATÓRIO CENTRAL"]
["↓","CÓDIGO","ETAPA","PREÇO  (R$) C/ BDI","PARTIC  ( % )"]
[{"$f":"IF(D14>0,\"F\",\"\")","v":""},{"$f":"Orçamento!O259","v":"a."},{"$f":"Orçamento!P259","v":"SERVIÇOS PRELIMINARES"},{"$f":"Orçamento!V259","v":0},{"$f":"Orçamento!X259","v":0}]
[{"$f":"IF(D15>0,\"F\",\"\")","v":""},{"$f":"Orçamento!O260","v":"b."},{"$f":"Orçamento!P260","v":"TRANSPORTES"},{"$f":"Orçamento!V260","v":0},{"$f":"Orçamento!X260","v":0}]
["",{"$f":"Orçamento!O261","v":"c."},{"$f":"Orçamento!P261","v":"SERVIÇO EM TERRA"},{"$f":"Orçamento!V261","v":0},{"$f":"Orçamento!X261","v":0}]
["",{"$f":"Orçamento!O262","v":"d."},{"$f":"Orçamento!P262","v":"FUNDAÇÕES E SONDAGENS"},{"$f":"Orçamento!V262","v":0},{"$f":"Orçamento!X262","v":0}]
["",{"$f":"Orçamento!O263","v":"e."},{"$f":"Orçamento!P263","v":"ESTRUTURA"},{"$f":"Orçamento!V263","v":0},{"$f":"Orçamento!X263","v":0}]
["",{"$f":"Orçamento!O264","v":"f."},{"$f":"Orçamento!P264","v":"INSTALAÇÕES ELÉTRICAS"},{"$f":"Orçamento!V264","v":0},{"$f":"Orçamento!X264","v":0}]
["",{"$f":"Orçamento!O265","v":"g."},{"$f":"Orçamento!P265","v":"INSTALAÇÕES HIDROSSANITÁRIAS"},{"$f":"Orçamento!V265","v":0},{"$f":"Orçamento!X265","v":0}]
["",{"$f":"Orçamento!O266","v":"h"},{"$f":"Orçamento!P266","v":"INSTALAÇÕES ESPECIAIS"},{"$f":"Orçamento!V266","v":0},{"$f":"Orçamento!X266","v":0}]
["",{"$f":"Orçamento!O267","v":"i."},{"$f":"Orçamento!P267","v":"ALVENARIAS E DIVISÓRIAS"},{"$f":"Orçamento!V267","v":0},{"$f":"Orçamento!X267","v":0}]
["",{"$f":"Orçamento!O268","v":"j."},{"$f":"Orçamento!P268","v":"ALVENARIA AUTO-PORTANTE"},{"$f":"Orçamento!V268","v":0},{"$f":"Orçamento!X268","v":0}]
["",{"$f":"Orçamento!O269","v":"k."},{"$f":"Orçamento!P269","v":"IMPERMEABILIZAÇÃO"},{"$f":"Orçamento!V269","v":0},{"$f":"Orçamento!X269","v":0}]
["",{"$f":"Orçamento!O270","v":"l."},{"$f":"Orçamento!P270","v":"ISOLAMENTO TÉRMICO E ACÚSTICO"},{"$f":"Orçamento!V270","v":0},{"$f":"Orçamento!X270","v":0}]
["",{"$f":"Orçamento!O271","v":"m."},{"$f":"Orçamento!P271","v":"ESTRUTURA DE MADEIRA"},{"$f":"Orçamento!V271","v":0},{"$f":"Orçamento!X271","v":0}]
["",{"$f":"Orçamento!O272","v":"n."},{"$f":"Orçamento!P272","v":"ESTRUTURAS METÁLICAS"},{"$f":"Orçamento!V272","v":0},{"$f":"Orçamento!X272","v":0}]
["",{"$f":"Orçamento!O273","v":"o."},{"$f":"Orçamento!P273","v":"COBERTURAS"},{"$f":"Orçamento!V273","v":0},{"$f":"Orçamento!X273","v":0}]
["",{"$f":"Orçamento!O274","v":"p."},{"$f":"Orçamento!P274","v":"ESQUADRIAS DE MADEIRA"},{"$f":"Orçamento!V274","v":0},{"$f":"Orçamento!X274","v":0}]
["",{"$f":"Orçamento!O275","v":"q."},{"$f":"Orçamento!P275","v":"ESQUADRIAS METÁLICAS"},{"$f":"Orçamento!V275","v":0},{"$f":"Orçamento!X275","v":0}]
["",{"$f":"Orçamento!O276","v":"r."},{"$f":"Orçamento!P276","v":"VIDROS"},{"$f":"Orçamento!V276","v":0},{"$f":"Orçamento!X276","v":0}]
["",{"$f":"Orçamento!O277","v":"s."},{"$f":"Orçamento!P277","v":"REVESTIMENTO DE PAREDE"},{"$f":"Orçamento!V277","v":0},{"$f":"Orçamento!X277","v":0}]
["",{"$f":"Orçamento!O278","v":"t."},{"$f":"Orçamento!P278","v":"FORROS"},{"$f":"Orçamento!V278","v":0},{"$f":"Orçamento!X278","v":0}]
["",{"$f":"Orçamento!O279","v":"u."},{"$f":"Orçamento!P279","v":"REVESTIMENTO DE PISO"},{"$f":"Orçamento!V279","v":0},{"$f":"Orçamento!X279","v":0}]
["",{"$f":"Orçamento!O280","v":"v."},{"$f":"Orçamento!P280","v":"FERRAGENS"},{"$f":"Orçamento!V280","v":0},{"$f":"Orçamento!X280","v":0}]
["",{"$f":"Orçamento!O281","v":"w."},{"$f":"Orçamento!P281","v":"MARCENARIA"},{"$f":"Orçamento!V281","v":0},{"$f":"Orçamento!X281","v":0}]
["",{"$f":"Orçamento!O282","v":"x."},{"$f":"Orçamento!P282","v":"ADMINISTRAÇÃO"},{"$f":"Orçamento!V282","v":0},{"$f":"Orçamento!X282","v":0}]
["",{"$f":"Orçamento!O283","v":"y."},{"$f":"Orçamento!P283","v":"PINTURA"},{"$f":"Orçamento!V283","v":0},{"$f":"Orçamento!X283","v":0}]
["",{"$f":"Orçamento!O284","v":"z."},{"$f":"Orçamento!P284","v":"DIVERSOS"},{"$f":"Orçamento!V284","v":0},{"$f":"Orçamento!X284","v":0}]
["F","TOTAL GERAL DO ORÇAMENTO (R$) C/BDI",null,{"$f":"SUM(D14:D39)","v":0},{"$f":"SUM(E14:E39)","v":0}]

{"sheet":"Parc Maior Relev","index":6,"n_rows":35,"n_cols":7,"rows_kept":35,"cut":false,"hidden":false,"merged":[[10,1,10,6],[6,1,6,3],[6,4,6,6],[7,1,7,6],[8,1,8,3],[8,4,8,6],[35,3,35,7],[33,1,33,6],[0,1,0,6],[11,1,11,6],[1,1,1,6],[2,1,2,3],[2,4,2,6],[3,1,3,3],[3,4,3,6],[4,1,4,6],[5,1,5,3],[5,4,5,6],[9,1,9,3],[9,4,9,6]]}
[]
[]
[null,"UNIDADE ESCOLAR",null,null,"CÓDIGO INEP"]
[null,{"$f":"Orçamento!$O$5","v":"CENTRO DE ENSINO EM PERÍODO INTEGRAL PROFESSORA IZABEL CHRISTINA DE SOUSA ORTIZ"},null,null,{"$f":"Orçamento!$V$5","v":52103498}]
[]
[null,"OBRA",null,null,"CIDADE"]
[null,{"$f":"Orçamento!$O$8","v":"REFORMA E AMPLIAÇÃO"},null,null,{"$f":"Orçamento!$V$8","v":"FORMOSA"}]
[]
[null,"CRE",null,null,"ÁREA TOTAL CONSTRUÍDA (M²)"]
[null,{"$f":"Orçamento!$O$11","v":"FORMOSA"},null,null,{"$f":"Orçamento!$V$14","v":2960.79}]
[]
["FILTRO","PARCELA DE MAIOR RELEVÂNCIA"]
[{"$f":"IF(G14>0,\"F\",\"\")","v":""},"CÓDIGO","SERVIÇO","DESCRIÇÃO","UNID","QUANT","PARC. MAIOR RELEV (100%)"]
[{"$f":"IF(G14>0,\"F\",\"\")","v":""},{"$f":"Somatório!B22","v":"f."},"INSTALAÇÕES ELÉTRICAS","SUBESTAÇÃO","KVA",{"$f":"SUMIF(Orçamento!$R$21:$R$240,'Parc Maior Relev'!D14,Orçamento!$T$21:$T$240)","v":0},{"$f":"F14","v":0}]
[{"$f":"IF(SUM(G16:G32)>0,\"F\",\"\")","v":"F"},"CÓDIGO","SERVIÇO","DESCRIÇÃO","UNID","QUANT","PARC. MAIOR RELEV (50%)"]
[{"$f":"IF(G16>0,\"F\",\"\")","v":""},{"$f":"Somatório!B21","v":"e."},"ESTRUTURA","CONCRETO","M3",{"$f":"SUMIF(Orçamento!$R$21:$R$240,'Parc Maior Relev'!D16,Orçamento!$T$21:$T$240)","v":0},{"$f":"F16*0.5","v":0}]
[{"$f":"IF(G17>0,\"F\",\"\")","v":""},"f.","INSTALAÇÕES ELÉTRICAS","INSTALAÇÕES ELÉTRICAS","KVA",{"$f":"SUMIF(Orçamento!$R$21:$R$240,'Parc Maior Relev'!D17,Orçamento!$T$21:$T$240)","v":0},{"$f":"F17","v":0}]
[{"$f":"IF(G18>0,\"F\",\"\")","v":"F"},{"$f":"Somatório!B25","v":"i."},"ALVENARIA E DIVISÓRIAS","ALVENARIA DE TIJOLOS","M2",{"$f":"Orçamento!T189","v":16.760000000000002},{"$f":"F18*0.5","v":8.3800000000000008}]
["",{"$f":"Somatório!B29","v":"m."},"ESTRUTURA DE MADEIRA","ESTRUTURA DE MADEIRA","M2",{"$f":"SUMIF(Orçamento!$R$21:$R$240,'Parc Maior Relev'!D19,Orçamento!$T$21:$T$240)","v":0},0]
["",{"$f":"Somatório!B31","v":"o."},"COBERTURAS","COBERTURA CERÂMICA","M2",{"$f":"SUMIF(Orçamento!$R$21:$R$240,'Parc Maior Relev'!D20,Orçamento!$T$21:$T$240)","v":0},0]
["","o.","COBERTURAS","COBERTURA COM TELHA METÁLICA","M2",{"$f":"SUMIF(Orçamento!$R$21:$R$240,'Parc Maior Relev'!D21,Orçamento!$T$21:$T$240)","v":0},0]
["",{"$f":"Somatório!B35","v":"s."},"REVESTIMENTO DE PAREDE","CHAPISCO","M2",{"$f":"SUMIF(Orçamento!$R$21:$R$240,'Parc Maior Relev'!D22,Orçamento!$T$21:$T$240)","v":0},0]
["","s.","REVESTIMENTO DE PAREDE","REBOCO","M2",{"$f":"SUMIF(Orçamento!$R$21:$R$240,'Parc Maior Relev'!D23,Orçamento!$T$21:$T$240)","v":0},{"$f":"F23*0.5","v":0}]
["F","s.","REVESTIMENTO DE PAREDE","REVESTIMENTO CERÂMICO","M2",{"$f":"Orçamento!T205+Orçamento!T208","v":71.88},{"$f":"F24*0.5","v":35.94}]
["",{"$f":"Somatório!B36","v":"t."},"FORROS","FORRO DE GESSO","M2",{"$f":"SUMIF(Orçamento!$R$21:$R$240,'Parc Maior Relev'!D25,Orçamento!$T$21:$T$240)","v":0},{"$f":"F25*0.5","v":0}]
["","t.","FORROS","FORRO DE PVC","M2",{"$f":"SUMIF(Orçamento!$R$21:$R$240,'Parc Maior Relev'!D26,Orçamento!$T$21:$T$240)","v":0},{"$f":"F26*0.5","v":0}]
["","t.","FORROS","FORRO DE GESSO ACARTONADO","M2",{"$f":"SUMIF(Orçamento!$R$21:$R$240,'Parc Maior Relev'!D27,Orçamento!$T$21:$T$240)","v":0},{"$f":"F27*0.5","v":0}]
["","u.","REVESTIMENTO DE PISO","PISO DE GRANITINA","M2",{"$f":"SUMIF(Orçamento!$R$21:$R$240,'Parc Maior Relev'!D28,Orçamento!$T$21:$T$240)","v":0},0]
["","u.","REVESTIMENTO DE PISO","PISO LAMINADO","M2",{"$f":"SUMIF(Orçamento!$R$21:$R$240,'Parc Maior Relev'!D29,Orçamento!$T$21:$T$240)","v":0},0]
["","u.","REVESTIMENTO DE PISO","PISO DE CONCRETO DESEMPENADO","M2",{"$f":"SUMIF(Orçamento!$R$21:$R$240,'Parc Maior Relev'!D30,Orçamento!$T$21:$T$240)","v":0},0]
["","u.","REVESTIMENTO DE PISO","PISO CERÂMICO","M2",{"$f":"SUMIF(Orçamento!$R$21:$R$240,'Parc Maior Relev'!D31,Orçamento!$T$21:$T$240)","v":0},{"$f":"F31*0.5","v":0}]
["","y.","PINTURA","PINTURA","M2",{"$f":"SUMIF(Orçamento!$R$21:$R$240,'Parc Maior Relev'!D32,Orçamento!$T$21:$T$240)","v":0},0]
["F"]
["F","(*) Para os fins do inciso I dp § 1º do Art. 30 da Lei Federal 8.666/93, são consideradas parcelas de maior relevância técnica as execuções apresentadas"]
["F"]

{"sheet":"Composições","index":7,"n_rows":147,"n_cols":10,"rows_kept":147,"cut":false,"hidden":false,"merged":[[141,5,142,5],[141,6,141,7],[141,8,141,9],[145,1,145,7],[146,1,146,7],[141,0,142,0],[141,1,142,1],[141,2,142,2],[141,3,142,3],[141,4,142,4],[131,5,132,5],[131,6,131,7],[131,8,131,9],[135,1,135,7],[139,1,139,7],[131,0,132,0],[131,1,132,1],[131,2,132,2],[131,3,132,3],[131,4,132,4],[121,5,122,5],[121,6,121,7],[121,8,121,9],[125,1,125,7],[129,1,129,7],[121,0,122,0],[121,1,122,1],[121,2,122,2],[121,3,122,3],[121,4,122,4],[111,5,112,5],[111,6,111,7],[111,8,111,9],[116,1,116,7],[119,1,119,7],[111,0,112,0],[111,1,112,1],[111,2,112,2],[111,3,112,3],[111,4,112,4],[101,5,102,5],[101,6,101,7],[101,8,101,9],[106,1,106,7],[109,1,109,7],[101,0,102,0],[101,1,102,1],[101,2,102,2],[101,3,102,3],[101,4,102,4],[92,5,93,5],[92,6,92,7],[92,8,92,9],[97,1,97,7],[99,1,99,7],[92,0,93,0],[92,1,93,1],[92,2,93,2],[92,3,93,3],[92,4,93,4],[83,5,84,5],[83,6,83,7],[83,8,83,9],[88,1,88,7],[90,1,90,7],[83,0,84,0],[83,1,84,1],[83,2,84,2],[83,3,84,3],[83,4,84,4],[74,5,75,5],[74,6,74,7],[74,8,74,9],[79,1,79,7],[81,1,81,7],[74,0,75,0],[74,1,75,1],[74,2,75,2],[74,3,75,3],[74,4,75,4],[65,5,66,5],[65,6,65,7],[65,8,65,9],[70,1,70,7],[72,1,72,7],[65,0,66,0],[65,1,66,1],[65,2,66,2],[65,3,66,3],[65,4,66,4],[56,5,57,5],[56,6,56,7],[56,8,56,9],[61,1,61,7],[63,1,63,7],[56,0,57,0],[56,1,57,1],[56,2,57,2],[56,3,57,3],[56,4,57,4],[46,5,47,5],[46,6,46,7],[46,8,46,9],[51,1,51,7],[54,1,54,7],[46,0,47,0],[46,1,47,1],[46,2,47,2],[46,3,47,3],[46,4,47,4],[36,5,37,5],[36,6,36,7],[36,8,36,9],[41,1,41,7],[44,1,44,7],[36,0,37,0],[36,1,37,1],[36,2,37,2],[36,3,37,3],[36,4,37,4],[26,5,27,5],[26,6,26,7],[26,8,26,9],[30,1,30,7],[34,1,34,7],[26,0,27,0],[26,1,27,1],[26,2,27,2],[26,3,27,3],[26,4,27,4],[16,5,17,5],[16,6,16,7],[16,8,16,9],[20,1,20,7],[24,1,24,7],[16,0,17,0],[16,1,17,1],[16,2,17,2],[16,3,17,3],[16,4,17,4],[15,0,15,9],[13,0,13,2],[13,3,13,6],[1,0,1,9],[3,7,3,9],[4,7,4,9],[6,7,6,9],[7,7,7,9],[6,0,6,6],[10,8,10,9],[13,8,13,9],[14,0,14,9],[8,0,8,9],[5,0,5,9],[2,0,2,9],[0,0,0,8],[10,0,10,2],[10,3,10,6],[11,0,11,9],[12,0,12,2],[12,3,12,6],[12,7,12,8],[7,0,7,6],[9,0,9,2],[9,3,9,6],[9,7,9,8],[3,0,3,6],[4,0,4,6]]}
[]
[]
[]
["UNIDADE ESCOLAR",null,null,null,null,null,null,"CÓDIGO INEP"]
[{"$f":"Orçamento!$O$5","v":"CENTRO DE ENSINO EM PERÍODO INTEGRAL PROFESSORA IZABEL CHRISTINA DE SOUSA ORTIZ"},null,null,null,null,null,null,{"$f":"Orçamento!$V$5","v":52103498}]
[]
["OBRA",null,null,null,null,null,null,"CIDADE"]
[{"$f":"Orçamento!$O$8","v":"REFORMA E AMPLIAÇÃO"},null,null,null,null,null,null,{"$f":"Orçamento!$V$8","v":"FORMOSA"}]
[]
["CRE",null,null,"ENDEREÇO",null,null,null,"REFERÊNCIA AGETOP"]
[{"$f":"Orçamento!$O$11","v":"FORMOSA"},null,null,{"$f":"Orçamento!$R$11","v":"RUA 65, PRAÇA N°04 S/N, PQ LAGO DE FORMOSA, CEP:73813-872"},null,null,null,{"$f":"Orçamento!$S$11","v":"ABR/19"},{"$f":"Orçamento!$T$11","v":"DESONERADA"}]
[]
["DATA",null,null,"ÁREA TOTAL CONSTRUÍDA (M²)",null,null,null,"REFERÊNCIA SINAPI"]
[{"$f":"Orçamento!$S$8","v":"2020-03-19"},null,null,{"$f":"Orçamento!$V$14","v":2960.79},null,null,null,{"$f":"Orçamento!$V$11","v":"NOV/19"},{"$f":"Orçamento!$W$11","v":"DESONERADA"}]
[]
["COMPOSIÇÕES DE CUSTOS UNITÁRIOS - SEE-GO"]
[24,"FONTE","CÓDIGO","DESCRIÇÃO","UNIDADE","COEFIC.","CUSTO UNITÁRIO",null,"CUSTO  TOTAL (A) + (B) + (C) + (D) + (E)"]
[null,null,null,null,null,null,"DESONERADO","NÃO DESONER.","DESONERADO","NÃO DESONER."]
[null,"COMPOSIÇÃO","COMP 024_SEE","SINALIZADOR FOTOLUMINESCENTE PARA EXTINTOR","UN ",null,"-","-",25.319999999999997,25.439999999999998]
[null,"AGETOP_I",5,"SERVENTE","h     ",0.09,8.75,10.14,0.79,0.91]
[null,"MÃO DE OBRA (B) - TOTAL",null,null,null,null,null,null,0.79,0.91]
[null,"AGETOP_I",3070,"BUCHA DE NYLON S-6","un",2,0.04,0.04,0.08,0.08]
[null,"AGETOP_I",3393,"PARAFUSO P/BUCHA S-6","un",2,0.08,0.08,0.16,0.16]
[null,"SINAPI_I",37556,"PLACA DE SINALIZACAO DE SEGURANCA CONTRA INCENDIO, FOTOLUMINESCENTE, QUADRADA, *20 X 20* CM, EM PVC *2* MM ANTI-CHAMAS (SIMBOLOS, CORES E PICTOGRAMAS CONFORME NBR 13434)                                                                                                                                                                                                                                                                                                                                 ","UN    ",1,24.29,24.29,24.29,24.29]
[null,"MATERIAL (C) - TOTAL",null,null,null,null,null,null,24.529999999999998,24.529999999999998]
[]
[25,"FONTE","CÓDIGO","DESCRIÇÃO","UNIDADE","COEFIC.","CUSTO UNITÁRIO",null,"CUSTO  TOTAL (A) + (B) + (C) + (D) + (E)"]
[null,null,null,null,null,null,"DESONERADO","NÃO DESONER.","DESONERADO","NÃO DESONER."]
[null,"COMPOSIÇÃO","COMP 025_SEE","SINALIZADOR FOTOLUMINESCENTE DE EMERGÊNCIA","UN ",null,"-","-",25.319999999999997,25.439999999999998]
[null,"AGETOP_I",5,"SERVENTE","h     ",0.09,8.75,10.14,0.79,0.91]
[null,"MÃO DE OBRA (B) - TOTAL",null,null,null,null,null,null,0.79,0.91]
[null,"AGETOP_I",3070,"BUCHA DE NYLON S-6","un",2,0.04,0.04,0.08,0.08]
[null,"AGETOP_I",3393,"PARAFUSO P/BUCHA S-6","un",2,0.08,0.08,0.16,0.16]
[null,"SINAPI_I",37556,"PLACA DE SINALIZACAO DE SEGURANCA CONTRA INCENDIO, FOTOLUMINESCENTE, QUADRADA, *20 X 20* CM, EM PVC *2* MM ANTI-CHAMAS (SIMBOLOS, CORES E PICTOGRAMAS CONFORME NBR 13434)                                                                                                                                                                                                                                                                                                                                 ","UN    ",1,24.29,24.29,24.29,24.29]
[null,"MATERIAL (C) - TOTAL",null,null,null,null,null,null,24.529999999999998,24.529999999999998]
[]
[382,"FONTE","CÓDIGO","DESCRIÇÃO","UNIDADE","COEFIC.","CUSTO UNITÁRIO",null,"CUSTO  TOTAL (A) + (B) + (C) + (D) + (E)"]
[null,null,null,null,null,null,"DESONERADO","NÃO DESONER.","DESONERADO","NÃO DESONER."]
[null,"COMPOSIÇÃO","COMP 382_SEE","TE DE REDUCAO DE FERRO GALVANIZADO, COM ROSCA BSP, DE 3/4\" X 1/2\"","UN ",null,null,null,22.58,24.759999999999998]
[null,"AGETOP_I",8,"AJUDANTE","h     ",0.6,8.75,10.14,5.25,6.08]
[null,"AGETOP_I",11,"ENCANADOR","h     ",0.61050000000000004,13.95,16.16,8.52,9.8699999999999992]
[null,"MÃO DE OBRA (B) - TOTAL",null,null,null,null,null,null,13.77,15.95]
[null,"SINAPI_I",3146,"FITA VEDA ROSCA EM ROLOS DE 18 MM X 10 M (L X C)                                                                                                                                                                                                                                                                                                                                                                                                                                                          ","UN    ",0.12075471698113208,3.69,3.69,0.45,0.45]
[null,"SINAPI_I",6302,"TE DE REDUCAO DE FERRO GALVANIZADO, COM ROSCA BSP, DE 3/4\" X 1/2\"                                                                                                                                                                                                                                                                                                                                                                                                                                         ","UN    ",1,8.36,8.36,8.36,8.36]
[null,"MATERIAL (C) - TOTAL",null,null,null,null,null,null,8.8099999999999987,8.8099999999999987]
[]
[383,"FONTE","CÓDIGO","DESCRIÇÃO","UNIDADE","COEFIC.","CUSTO UNITÁRIO",null,"CUSTO  TOTAL (A) + (B) + (C) + (D) + (E)"]
[null,null,null,null,null,null,"DESONERADO","NÃO DESONER.","DESONERADO","NÃO DESONER."]
[null,"COMPOSIÇÃO","COMP 383_SEE","BUCHA DE REDUCAO DE FERRO GALVANIZADO, COM ROSCA BSP, DE 1/2\" X 1/4\"","UN ",null,null,null,7.05,7.63]
[null,"AGETOP_I",8,"AJUDANTE","h     ",0.16,8.75,10.14,1.4,1.62]
[null,"AGETOP_I",11,"ENCANADOR","h     ",0.16,13.95,16.16,2.23,2.59]
[null,"MÃO DE OBRA (B) - TOTAL",null,null,null,null,null,null,3.63,4.21]
[null,"AGETOP_I","H689","FITA VEDAROSCA 12 MM","m",1.2,0.28000000000000003,0.28000000000000003,0.34,0.34]
[null,"SINAPI_I",770,"BUCHA DE REDUCAO DE FERRO GALVANIZADO, COM ROSCA BSP, DE 1/2\" X 1/4\"                                                                                                                                                                                                                                                                                                                                                                                                                                      ","UN    ",1,3.08,3.08,3.08,3.08]
[null,"MATERIAL (C) - TOTAL",null,null,null,null,null,null,3.42,3.42]
[]
[212,"FONTE","CÓDIGO","DESCRIÇÃO","UNIDADE","COEFIC.","CUSTO UNITÁRIO",null,"CUSTO  TOTAL (A) + (B) + (C) + (D) + (E)"]
[null,null,null,null,null,null,"DESONERADO","NÃO DESONER.","DESONERADO","NÃO DESONER."]
[null,"COMPOSIÇÃO","COMP 212_SEE","NIPLE DE REDUÇÃO 1/2\" X 1/4\" BSP","UN ",null,null,null,9.68,10.26]
[null,"AGETOP_I",8,"AJUDANTE","h     ",0.16,8.75,10.14,1.4,1.62]
[null,"AGETOP_I",11,"ENCANADOR","h     ",0.16,13.95,16.16,2.23,2.59]
[null,"MÃO DE OBRA (B) - TOTAL",null,null,null,null,null,null,3.63,4.21]
[null,"COTAÇÃO","COT 103_SEE","NIPLE DE REDUÇÃO 1/2\" X 1/4\" BSP","UN",1,6.0533333333333337,6.0533333333333337,6.05,6.05]
[null,"MATERIAL (C) - TOTAL",null,null,null,null,null,null,6.05,6.05]
[]
[213,"FONTE","CÓDIGO","DESCRIÇÃO","UNIDADE","COEFIC.","CUSTO UNITÁRIO",null,"CUSTO  TOTAL (A) + (B) + (C) + (D) + (E)"]
[null,null,null,null,null,null,"DESONERADO","NÃO DESONER.","DESONERADO","NÃO DESONER."]
[null,"COMPOSIÇÃO","COMP 213_SEE","NIPLE DE REDUÇÃO 3/4\" X 1/2\" BSP","UN ",null,null,null,13.34,13.920000000000002]
[null,"AGETOP_I",8,"AJUDANTE","h     ",0.16,8.75,10.14,1.4,1.62]
[null,"AGETOP_I",11,"ENCANADOR","h     ",0.16,13.95,16.16,2.23,2.59]
[null,"MÃO DE OBRA (B) - TOTAL",null,null,null,null,null,null,3.63,4.21]
[null,"COTAÇÃO","COT 104_SEE","NIPLE DE REDUÇÃO 3/4\" X 1/2\" BSP","UN",1,9.7099999999999991,9.7099999999999991,9.7100000000000009,9.7100000000000009]
[null,"MATERIAL (C) - TOTAL",null,null,null,null,null,null,9.7100000000000009,9.7100000000000009]
[]
[237,"FONTE","CÓDIGO","DESCRIÇÃO","UNIDADE","COEFIC.","CUSTO UNITÁRIO",null,"CUSTO  TOTAL (A) + (B) + (C) + (D) + (E)"]
[null,null,null,null,null,null,"DESONERADO","NÃO DESONER.","DESONERADO","NÃO DESONER."]
[null,"COMPOSIÇÃO","COMP 237_SEE","FITA ANTICORROSIVA","M",null,null,null,11.73,12.45]
[null,"AGETOP_I",8,"AJUDANTE","h     ",0.2,8.75,10.14,1.75,2.0299999999999998]
[null,"AGETOP_I",12,"ELETRICISTA","h     ",0.2,13.95,16.16,2.79,3.23]
[null,"MÃO DE OBRA (B) - TOTAL",null,null,null,null,null,null,4.54,5.26]
[null,"SINAPI_I",39634,"FITA ADESIVA ANTICORROSIVA DE PVC FLEXIVEL, COR PRETA, PARA PROTECAO TUBULACAO, 50 MM X 30 M (L X C), E= *0,25* MM                                                                                                                                                                                                                                                                                                                                                                                        ","M     ",1,7.19,7.19,7.19,7.19]
[null,"MATERIAL (C) - TOTAL",null,null,null,null,null,null,7.19,7.19]
[]
[542,"FONTE","CÓDIGO","DESCRIÇÃO","UNIDADE","COEFIC.","CUSTO UNITÁRIO",null,"CUSTO  TOTAL (A) + (B) + (C) + (D) + (E)"]
[null,null,null,null,null,null,"DESONERADO","NÃO DESONER.","DESONERADO","NÃO DESONER."]
[null,"COMPOSIÇÃO","COMP 542_SEE","VÁLVULA UGV 3/4\" (S) LATÃO","UN ",null,null,null,25.65,27.2]
[null,"AGETOP_I",8,"AJUDANTE","h     ",0.432,8.75,10.14,3.78,4.38]
[null,"AGETOP_I",11,"ENCANADOR","h     ",0.432,13.95,16.16,6.03,6.98]
[null,"MÃO DE OBRA (B) - TOTAL",null,null,null,null,null,null,9.81,11.36]
[null,"COTAÇÃO","COT 281_SEE","VÁLVULA UGV 3/4\" (S) LATÃO","UN ",1,15.836666666666666,15.836666666666666,15.84,15.84]
[null,"MATERIAL (C) - TOTAL",null,null,null,null,null,null,15.84,15.84]
[]
[543,"FONTE","CÓDIGO","DESCRIÇÃO","UNIDADE","COEFIC.","CUSTO UNITÁRIO",null,"CUSTO  TOTAL (A) + (B) + (C) + (D) + (E)"]
[null,null,null,null,null,null,"DESONERADO","NÃO DESONER.","DESONERADO","NÃO DESONER."]
[null,"COMPOSIÇÃO","COMP 543_SEE","VÁLVULA UGV 1/2\" (S) LATÃO","UN ",null,null,null,24.98,26.53]
[null,"AGETOP_I",8,"AJUDANTE","h     ",0.432,8.75,10.14,3.78,4.38]
[null,"AGETOP_I",11,"ENCANADOR","h     ",0.432,13.95,16.16,6.03,6.98]
[null,"MÃO DE OBRA (B) - TOTAL",null,null,null,null,null,null,9.81,11.36]
[null,"COTAÇÃO","COT 282_SEE","VÁLVULA UGV 1/2\" (S) LATÃO","UN ",1,15.166666666666666,15.166666666666666,15.17,15.17]
[null,"MATERIAL (C) - TOTAL",null,null,null,null,null,null,15.17,15.17]
[]
[211,"FONTE","CÓDIGO","DESCRIÇÃO","UNIDADE","COEFIC.","CUSTO UNITÁRIO",null,"CUSTO  TOTAL (A) + (B) + (C) + (D) + (E)"]
[null,null,null,null,null,null,"DESONERADO","NÃO DESONER.","DESONERADO","NÃO DESONER."]
[null,"COMPOSIÇÃO","COMP 211_SEE","REGULADOR DE 2º ESTÁGIO 5KG/H","UN ",null,null,null,86.72,90.86]
[null,"AGETOP_I",8,"AJUDANTE","h     ",1.1499999999999999,8.75,10.14,10.06,11.66]
[null,"AGETOP_I",11,"ENCANADOR","h     ",1.1499999999999999,13.95,16.16,16.04,18.579999999999998]
[null,"MÃO DE OBRA (B) - TOTAL",null,null,null,null,null,null,26.1,30.24]
[null,"COTAÇÃO","COT 102_SEE","REGULADOR DE 2º ESTÁGIO 5KG/H","UN",1,59.833333333333336,59.833333333333336,59.83,59.83]
[null,"AGETOP_I","H689","FITA VEDAROSCA 12 MM","m",2.82,0.28000000000000003,0.28000000000000003,0.79,0.79]
[null,"MATERIAL (C) - TOTAL",null,null,null,null,null,null,60.62,60.62]
[]
[210,"FONTE","CÓDIGO","DESCRIÇÃO","UNIDADE","COEFIC.","CUSTO UNITÁRIO",null,"CUSTO  TOTAL (A) + (B) + (C) + (D) + (E)"]
[null,null,null,null,null,null,"DESONERADO","NÃO DESONER.","DESONERADO","NÃO DESONER."]
[null,"COMPOSIÇÃO","COMP 210_SEE","REGULADOR DE 1º ESTÁGIO 60KG/H MODELO AP-40  COM MANÔMETRO","UN ",null,null,null,232.47,236.61]
[null,"AGETOP_I",8,"AJUDANTE","h     ",1.1499999999999999,8.75,10.14,10.06,11.66]
[null,"AGETOP_I",11,"ENCANADOR","h     ",1.1499999999999999,13.95,16.16,16.04,18.579999999999998]
[null,"MÃO DE OBRA (B) - TOTAL",null,null,null,null,null,null,26.1,30.24]
[null,"COTAÇÃO","COT 101_SEE","REGULADOR DE 1º ESTÁGIO 60KG/H MODELO AP-40  COM MANÔMETRO","UN",1,205.57666666666668,205.57666666666668,205.58,205.58]
[null,"AGETOP_I","H689","FITA VEDAROSCA 12 MM","m",2.82,0.28000000000000003,0.28000000000000003,0.79,0.79]
[null,"MATERIAL (C) - TOTAL",null,null,null,null,null,null,206.37,206.37]
[]
[235,"FONTE","CÓDIGO","DESCRIÇÃO","UNIDADE","COEFIC.","CUSTO UNITÁRIO",null,"CUSTO  TOTAL (A) + (B) + (C) + (D) + (E)"]
[null,null,null,null,null,null,"DESONERADO","NÃO DESONER.","DESONERADO","NÃO DESONER."]
[null,"COMPOSIÇÃO","COMP 235_SEE","PLACA DE SINALIZAÇÃO EM PVC COD 01 - (300X300) PROIBIDO FUMAR","UN ",null,null,null,25.319999999999997,25.439999999999998]
[null,"AGETOP_I",5,"SERVENTE","h     ",0.09,8.75,10.14,0.79,0.91]
[null,"MÃO DE OBRA (B) - TOTAL",null,null,null,null,null,null,0.79,0.91]
[null,"AGETOP_I",3070,"BUCHA DE NYLON S-6","un",2,0.04,0.04,0.08,0.08]
[null,"AGETOP_I",3393,"PARAFUSO P/BUCHA S-6","un",2,0.08,0.08,0.16,0.16]
[null,"SINAPI_I",37556,"PLACA DE SINALIZACAO DE SEGURANCA CONTRA INCENDIO, FOTOLUMINESCENTE, QUADRADA, *20 X 20* CM, EM PVC *2* MM ANTI-CHAMAS (SIMBOLOS, CORES E PICTOGRAMAS CONFORME NBR 13434)                                                                                                                                                                                                                                                                                                                                 ","UN    ",1,24.29,24.29,24.29,24.29]
[null,"MATERIAL (C) - TOTAL",null,null,null,null,null,null,24.529999999999998,24.529999999999998]
[]
[236,"FONTE","CÓDIGO","DESCRIÇÃO","UNIDADE","COEFIC.","CUSTO UNITÁRIO",null,"CUSTO  TOTAL (A) + (B) + (C) + (D) + (E)"]
[null,null,null,null,null,null,"DESONERADO","NÃO DESONER.","DESONERADO","NÃO DESONER."]
[null,"COMPOSIÇÃO","COMP 236_SEE","PLACA DE SINALIZAÇÃO EM PVC COD 06 - (300X300) PERIGO INFLAMÁVEL","UN ",null,null,null,25.319999999999997,25.439999999999998]
[null,"AGETOP_I",5,"SERVENTE","h     ",0.09,8.75,10.14,0.79,0.91]
[null,"MÃO DE OBRA (B) - TOTAL",null,null,null,null,null,null,0.79,0.91]
[null,"AGETOP_I",3070,"BUCHA DE NYLON S-6","un",2,0.04,0.04,0.08,0.08]
[null,"AGETOP_I",3393,"PARAFUSO P/BUCHA S-6","un",2,0.08,0.08,0.16,0.16]
[null,"SINAPI_I",37556,"PLACA DE SINALIZACAO DE SEGURANCA CONTRA INCENDIO, FOTOLUMINESCENTE, QUADRADA, *20 X 20* CM, EM PVC *2* MM ANTI-CHAMAS (SIMBOLOS, CORES E PICTOGRAMAS CONFORME NBR 13434)                                                                                                                                                                                                                                                                                                                                 ","UN    ",1,24.29,24.29,24.29,24.29]
[null,"MATERIAL (C) - TOTAL",null,null,null,null,null,null,24.529999999999998,24.529999999999998]
[]
[45,"FONTE","CÓDIGO","DESCRIÇÃO","UNIDADE","COEFIC.","CUSTO UNITÁRIO",null,"CUSTO  TOTAL (A) + (B) + (C) + (D) + (E)"]
[null,null,null,null,null,null,"DESONERADO","NÃO DESONER.","DESONERADO","NÃO DESONER."]
[null,"COMPOSIÇÃO","COMP 045_SEE","LAUDO DE ESTANQUEIDADE","UN ",null,null,null,936,1085.1199999999999]
[null,"AGETOP",250101,"ENGENHEIRO - (OBRAS CIVIS)","H     ",16,58.5,67.819999999999993,936,1085.1199999999999]
[null,"MÃO DE OBRA (B) - TOTAL",null,null,null,null,null,null,936,1085.1199999999999]
[null,"MATERIAL (C) - TOTAL",null,null,null,null,null,null,0,0]