{"text_format":"1","workbook":"xlsx","n_sheets":7,"sheets":["Orçamento","Resumo ","Somatório","Cronog_90_Dias","Composição BDI","Relatório CENTRAL","Parc Maior Relev"],"not_rendered":{"charts":0,"images":4,"macros":1,"external_links":1,"defined_names":103,"comments":2,"pivot_tables":0},"unopened":[],"bounds":{"document_bytes":16777216,"sheet_cells":100000,"rows_first":2000,"rows_last":500,"rows_between":2000,"halvings":0,"cell_chars":16384,"cell_head_chars":4096},"cells_cut":0,"cells_raw":0,"read":"whole","date_system":"1900"}

{"sheet":"Orçamento","index":0,"n_rows":413,"n_cols":27,"rows_kept":413,"cut":false,"hidden":false,"merged":[[400,15,400,17],[400,18,400,22],[401,15,401,17],[401,18,401,22],[402,15,402,17],[402,18,402,22],[10,24,10,25],[9,23,9,25],[394,18,394,22],[395,15,395,17],[395,18,395,22],[396,15,396,17],[396,18,396,22],[391,15,391,17],[391,18,391,22],[392,15,392,17],[392,18,392,22],[393,15,393,17],[393,18,393,22],[387,14,387,26],[388,18,388,22],[389,15,389,17],[389,18,389,22],[374,15,374,17],[406,23,406,25],[407,23,407,25],[408,23,408,25],[409,23,409,25],[410,23,410,25],[411,23,411,25],[412,23,412,25],[381,14,381,17],[388,15,388,17],[354,15,354,17],[409,18,409,22],[397,15,397,17],[397,18,397,22],[398,15,398,17],[398,18,398,22],[399,15,399,17],[399,18,399,22],[403,15,403,17],[403,18,403,22],[404,15,404,17],[404,18,404,22],[405,15,405,17],[394,15,394,17],[412,18,412,22],[409,14,409,17],[406,15,406,17],[406,18,406,22],[407,15,407,17],[407,18,407,22],[408,15,408,17],[408,18,408,22],[411,18,411,22],[410,18,410,22],[0,14,0,26],[345,16,345,24],[346,16,346,24],[347,16,347,24],[11,14,11,26],[14,14,14,26],[3,14,3,22],[4,14,4,22],[6,18,6,22],[7,18,7,22],[12,18,12,22],[13,18,13,22],[7,14,7,17],[6,14,6,17],[4,23,4,25],[3,23,3,25],[6,23,6,25],[7,23,7,25],[9,18,9,20],[337,17,342,17],[343,22,343,24],[337,22,337,24],[338,22,338,24],[339,22,339,24],[348,16,348,24],[354,23,354,25],[370,23,370,25],[371,23,371,25],[390,15,390,17],[390,18,390,22],[349,16,349,24],[367,15,367,17],[368,15,368,17],[353,14,353,26],[354,18,354,22],[355,18,355,22],[363,18,363,22],[364,18,364,22],[365,18,365,22],[366,18,366,22],[378,18,378,22],[375,15,375,17],[355,15,355,17],[356,15,356,17],[357,15,357,17],[358,15,358,17],[359,15,359,17],[360,15,360,17],[361,15,361,17],[362,15,362,17],[363,15,363,17],[372,23,372,25],[373,23,373,25],[371,15,371,17],[372,15,372,17],[373,15,373,17],[374,23,374,25],[369,15,369,17],[370,15,370,17],[368,23,368,25],[369,23,369,25],[367,23,367,25],[384,18,384,22],[360,18,360,22],[361,18,361,22],[359,18,359,22],[368,18,368,22],[350,18,350,24],[356,18,356,22],[357,18,357,22],[358,18,358,22],[381,18,381,22],[379,18,379,22],[380,18,380,22],[370,18,370,22],[377,18,377,22],[373,18,373,22],[375,18,375,22],[371,18,371,22],[372,18,372,22],[381,23,381,25],[375,23,375,25],[376,23,376,25],[377,23,377,25],[378,23,378,25],[379,23,379,25],[383,18,383,22],[1,14,1,24],[9,14,9,16],[10,14,10,16],[12,14,12,16],[13,14,13,16],[15,14,15,24],[2,14,2,24],[5,14,5,24],[8,14,8,24],[367,18,367,22],[364,15,364,17],[365,15,365,17],[366,15,366,17],[376,18,376,22],[374,18,374,22],[382,18,382,22],[369,18,369,22],[362,18,362,22],[376,15,376,17],[377,15,377,17],[379,15,379,17],[380,15,380,17],[382,23,382,25],[403,23,403,25],[404,23,404,25],[405,23,405,25],[388,23,388,25],[389,23,389,25],[390,23,390,25],[391,23,391,25],[392,23,392,25],[393,23,393,25],[394,23,394,25],[395,23,395,25],[396,23,396,25],[397,23,397,25],[398,23,398,25],[399,23,399,25],[400,23,400,25],[401,23,401,25],[402,23,402,25],[378,15,378,17],[383,23,383,25],[384,23,384,25],[405,18,405,22],[341,22,341,24],[342,22,342,24],[7,12,7,13],[6,12,6,13],[13,23,13,25],[12,23,12,25],[10,19,10,22],[380,23,380,25],[355,23,355,25],[356,23,356,25],[357,23,357,25],[358,23,358,25],[359,23,359,25],[360,23,360,25],[361,23,361,25],[362,23,362,25],[363,23,363,25],[364,23,364,25],[365,23,365,25],[366,23,366,25]]}
[]
[]
[]
[null,null,null,null,null,null,null,null,null,null,null,null,null,null,"UNIDADE ESCOLAR",null,null,null,null,null,null,null,null,"CÓDIGO INEP"]
[null,null,null,null,null,null,null,null,null,null,null,null,"",null,"COLÉGIO ESTADUAL ALVINO PEREIRA ROCHA",null,null,null,null,null,null,null,null,52093115]
[]
["Nmax",null,null,null,null,null,null,null,null,null,null,null,null,null,"OBRA",null,null,null,"DATA",null,null,null,null,"CIDADE"]
[{"$f":"MAX($C$19:$C$337)","v":4},null,null,null,null,null,null,null,null,null,null,null,null,null,"REFORMA",null,null,null,"2020-06-16",null,null,null,null,"RIO VERDE"]
[]
[null,null,null,null,null,null,null,null,null,null,null,null,null,null,"CRE",null,null,"ENDEREÇO","REFERÊNCIA AGETOP",null,null,null,null,"REFERÊNCIA SINAPI"]
[null,null,null,null,null,null,null,null,null,null,null,null,null,null,"CRE-RIO VERDE",null,null," AVENIDA ATLANTICA S/N QD 52 , VALDECI PIRES , CEP:75910-335","ABR/19","DESONERADA",null,null,null,"ABR/20","DESONERADA"]
[]
[null,null,null,null,null,null,null,null,null,null,null,null,null,null,"ÁREA EXISTENTE (M²)",null,null,"ÁREA A CONSTRUIR (M²)","ÁREA A DEMOLIR (M²)",null,null,null,null,"ÁREA TOTAL CONSTRUÍDA (M²)"]
[null,null,null,null,null,null,null,null,null,null,null,null,null,null,2681.43,null,null,null,null,null,null,null,null,2681.43]
[]
[null,null,null,null,null,null,null,null,null,null,null,"FILTRO",null,null,"PLANILHA ORÇAMENTÁRIA"]
["Nível E","Save Nivel","Nível C","Altura","n1","n2","n3","n4","n5","Czero","Cnível","↓","Nível","Nível Corrigido","ITEM","TABELA","CODIGO","DESCRIÇÃO DOS SERVIÇOS","UNID","QUANT","REPET","QUANT TOTAL","MAT","MO","T.SERVIÇO UNIT","VALOR TOTAL","OBSERVAÇÕES¹"]
[{"$f":"CHOOSE(1+LOG(1+2*(ORÇAMENTO.Nivel=\"Nível 1\")+4*(ORÇAMENTO.Nivel=\"Nível 2\")+8*(ORÇAMENTO.Nivel=\"Nível 3\")+16*(ORÇAMENTO.Nivel=\"Nível 4\")+32*(ORÇAMENTO.Nivel=\"Serviço\"),2),0,1,2,3,4,\"S\")","v":"S"},{"$f":"IF(OR(C18=\"s\",C18=0),OFFSET(B18,-1,0),C18)","v":"Save Nivel"},{"$f":"IF(OFFSET(C18,-1,0)=\"L\",1,IF(OFFSET(C18,-1,0)=1,2,IF(OR(A18=\"s\",A18=0),\"S\",IF(AND(OFFSET(C18,-1,0)=2,A18=4),3,IF(AND(OR(OFFSET(C18,-1,0)=\"s\",OFFSET(C18,-1,0)=0),A18<>\"s\",A18>OFFSET(B18,-1,0)),OFFSET(B18,-1,0),A18)))))","v":"S"},{"$f":"IF(OR(C18=\"S\",C18=0),0,IF(ISERROR(K18),J18,SMALL(J18:K18,1)))","v":0},{"$f":"IF($C18=1,OFFSET(E18,-1,0)+1,OFFSET(E18,-1,0))","v":"n1"},{"$f":"IF($C18=1,0,IF($C18=2,OFFSET(F18,-1,0)+1,OFFSET(F18,-1,0)))","v":"n2"},{"$f":"IF(AND($C18<=2,$C18<>0),0,IF($C18=3,OFFSET(G18,-1,0)+1,OFFSET(G18,-1,0)))","v":"n3"},{"$f":"IF(AND($C18<=3,$C18<>0),0,IF($C18=4,OFFSET(H18,-1,0)+1,OFFSET(H18,-1,0)))","v":"n4"},{"$f":"IF(AND($C18<=4,$C18<>0),0,IF(AND($C18=\"S\",$Y18>0),OFFSET(I18,-1,0)+1,OFFSET(I18,-1,0)))","v":"n5"},{"$f":"IF(OR($C18=\"S\",$C18=0),0,MATCH(0,OFFSET($D18,1,$C18,ROW($C$337)-ROW($C18)),0))","v":0},{"$f":"IF(OR($C18=\"S\",$C18=0),0,MATCH(OFFSET($D18,0,$C18)+1,OFFSET($D18,1,$C18,ROW($C$337)-ROW($C18)),0))","v":0},"","Serviço","Serviço","-","SINAPI",null,"(sem código)","-",null,"REPET","-",0,0,0,"-",""]
[0,null,"L",{"$f":"COUNTA(OFFSET(D19,1,0):D$337)","v":317},{"$f":"LEFT(O20,1)-1","v":0},null,null,null,null,null,null,"F","LOTE","LOTE","REFORMA - COLÉGIO ESTADUAL ALVINO PEREIRA ROCHA",null,null,null,null,null,null,null,null,null,null,0]
[{"$f":"CHOOSE(1+LOG(1+2*(ORÇAMENTO.Nivel=\"Nível 1\")+4*(ORÇAMENTO.Nivel=\"Nível 2\")+8*(ORÇAMENTO.Nivel=\"Nível 3\")+16*(ORÇAMENTO.Nivel=\"Nível 4\")+32*(ORÇAMENTO.Nivel=\"Serviço\"),2),0,1,2,3,4,\"S\")","v":1},{"$f":"IF(OR(C20=\"s\",C20=0),OFFSET(B20,-1,0),C20)","v":1},{"$f":"IF(OFFSET(C20,-1,0)=\"L\",1,IF(OFFSET(C20,-1,0)=1,2,IF(OR(A20=\"s\",A20=0),\"S\",IF(AND(OFFSET(C20,-1,0)=2,A20=4),3,IF(AND(OR(OFFSET(C20,-1,0)=\"s\",OFFSET(C20,-1,0)=0),A20<>\"s\",A20>OFFSET(B20,-1,0)),OFFSET(B20,-1,0),A20)))))","v":1},{"$f":"IF(OR(C20=\"S\",C20=0),0,IF(ISERROR(K20),J20,SMALL(J20:K20,1)))","v":12},{"$f":"IF($C20=1,OFFSET(E20,-1,0)+1,OFFSET(E20,-1,0))","v":1},{"$f":"IF($C20=1,0,IF($C20=2,OFFSET(F20,-1,0)+1,OFFSET(F20,-1,0)))","v":0},{"$f":"IF(AND($C20<=2,$C20<>0),0,IF($C20=3,OFFSET(G20,-1,0)+1,OFFSET(G20,-1,0)))","v":0},{"$f":"IF(AND($C20<=3,$C20<>0),0,IF($C20=4,OFFSET(H20,-1,0)+1,OFFSET(H20,-1,0)))","v":0},{"$f":"IF(AND($C20<=4,$C20<>0),0,IF(AND($C20=\"S\",$Y20>0),OFFSET(I20,-1,0)+1,OFFSET(I20,-1,0)))","v":0},{"$f":"IF(OR($C20=\"S\",$C20=0),0,MATCH(0,OFFSET($D20,1,$C20,ROW($C$337)-ROW($C20)),0))","v":317},{"$f":"IF(OR($C20=\"S\",$C20=0),0,MATCH(OFFSET($D20,0,$C20)+1,OFFSET($D20,1,$C20,ROW($C$337)-ROW($C20)),0))","v":12},"F","Nível 1","Nível 1","1.","AGETOP",null,"REFORMA","UN",1,1,1,null,null,0,0]
[2,2,2,2,1,1,0,0,0,{"$f":"IF(OR($C21=\"S\",$C21=0),0,MATCH(0,OFFSET($D21,1,$C21,ROW($C$337)-ROW($C21)),0))","v":11},{"$f":"IF(OR($C21=\"S\",$C21=0),0,MATCH(OFFSET($D21,0,$C21)+1,OFFSET($D21,1,$C21,ROW($C$337)-ROW($C21)),0))","v":2},"","Nível 2","Nível 2","-","AGETOP",null,"SERVIÇOS PRELIMINARES","-",null,1,"-",null,null,0,0]
["S",2,"S",0,1,1,0,0,0,{"$f":"IF(OR($C22=\"S\",$C22=0),0,MATCH(0,OFFSET($D22,1,$C22,ROW($C$337)-ROW($C22)),0))","v":0},{"$f":"IF(OR($C22=\"S\",$C22=0),0,MATCH(OFFSET($D22,0,$C22)+1,OFFSET($D22,1,$C22,ROW($C$337)-ROW($C22)),0))","v":0},"","Serviço","Serviço","-","AGETOP",21301,"PLACA DE OBRA PLOTADA EM CHAPA METÁLICA 26 , AFIXADA EM CAVALETES DE MADEIRA DE LEI (VIGOTAS 6X12CM) - PADRÃO GOINFRA","m2    ",7.5,1,7.5,null,null,0,0,""]
[2,2,2,3,1,2,0,0,0,{"$f":"IF(OR($C23=\"S\",$C23=0),0,MATCH(0,OFFSET($D23,1,$C23,ROW($C$337)-ROW($C23)),0))","v":9},{"$f":"IF(OR($C23=\"S\",$C23=0),0,MATCH(OFFSET($D23,0,$C23)+1,OFFSET($D23,1,$C23,ROW($C$337)-ROW($C23)),0))","v":3},"","Nível 2","Nível 2","-","SINAPI",null,"TRANSPORTES","-",null,1,"-",null,null,0,0,""]
["S",2,"S",0,1,2,0,0,0,{"$f":"IF(OR($C24=\"S\",$C24=0),0,MATCH(0,OFFSET($D24,1,$C24,ROW($C$337)-ROW($C24)),0))","v":0},{"$f":"IF(OR($C24=\"S\",$C24=0),0,MATCH(OFFSET($D24,0,$C24)+1,OFFSET($D24,1,$C24,ROW($C$337)-ROW($C24)),0))","v":0},"","Serviço","Serviço","-","SINAPI",72900,"TRANSPORTE DE ENTULHO COM CAMINHAO BASCULANTE 6 M3, RODOVIA PAVIMENTADA, DMT 0,5 A 1,0 KM","M3",32.396799999999999,1,32.396799999999999,null,null,0,0,""]
["S",2,"S",0,1,2,0,0,0,{"$f":"IF(OR($C25=\"S\",$C25=0),0,MATCH(0,OFFSET($D25,1,$C25,ROW($C$337)-ROW($C25)),0))","v":0},{"$f":"IF(OR($C25=\"S\",$C25=0),0,MATCH(OFFSET($D25,0,$C25)+1,OFFSET($D25,1,$C25,ROW($C$337)-ROW($C25)),0))","v":0},"","Serviço","Serviço","-","SINAPI",72897,"CARGA MANUAL DE ENTULHO EM CAMINHAO BASCULANTE 6 M3","M3",32.396799999999999,1,32.396799999999999,null,null,0,0,""]
[2,2,2,3,1,3,0,0,0,{"$f":"IF(OR($C26=\"S\",$C26=0),0,MATCH(0,OFFSET($D26,1,$C26,ROW($C$337)-ROW($C26)),0))","v":6},{"$f":"IF(OR($C26=\"S\",$C26=0),0,MATCH(OFFSET($D26,0,$C26)+1,OFFSET($D26,1,$C26,ROW($C$337)-ROW($C26)),0))","v":3},"","Nível 2","Nível 2","-","SINAPI",null,"ADMINISTRAÇÃO","-",null,1,"-",null,null,0,0,""]
["S",2,"S",0,1,3,0,0,0,{"$f":"IF(OR($C27=\"S\",$C27=0),0,MATCH(0,OFFSET($D27,1,$C27,ROW($C$337)-ROW($C27)),0))","v":0},{"$f":"IF(OR($C27=\"S\",$C27=0),0,MATCH(OFFSET($D27,0,$C27)+1,OFFSET($D27,1,$C27,ROW($C$337)-ROW($C27)),0))","v":0},"","Serviço","Serviço","-","SINAPI",90778,"ENGENHEIRO CIVIL DE OBRA PLENO COM ENCARGOS COMPLEMENTARES","H",66,1,66,null,null,0,0,"Referência: AGETOP - 250101"]
["S",2,"S",0,1,3,0,0,0,{"$f":"IF(OR($C28=\"S\",$C28=0),0,MATCH(0,OFFSET($D28,1,$C28,ROW($C$337)-ROW($C28)),0))","v":0},{"$f":"IF(OR($C28=\"S\",$C28=0),0,MATCH(OFFSET($D28,0,$C28)+1,OFFSET($D28,1,$C28,ROW($C$337)-ROW($C28)),0))","v":0},"","Serviço","Serviço","-","SINAPI",90776,"ENCARREGADO GERAL COM ENCARGOS COMPLEMENTARES","H",600,1,600,null,null,0,0,"Referência: AGETOP - 250103"]
[2,2,2,3,1,4,0,0,0,{"$f":"IF(OR($C29=\"S\",$C29=0),0,MATCH(0,OFFSET($D29,1,$C29,ROW($C$337)-ROW($C29)),0))","v":3},{"$f":"IF(OR($C29=\"S\",$C29=0),0,MATCH(OFFSET($D29,0,$C29)+1,OFFSET($D29,1,$C29,ROW($C$337)-ROW($C29)),0))","v":182},"","Nível 2","Nível 2","-",null,null,"DIVERSOS","-",null,1,"-",null,null,0,0,""]
["S",2,"S",0,1,4,0,0,0,{"$f":"IF(OR($C30=\"S\",$C30=0),0,MATCH(0,OFFSET($D30,1,$C30,ROW($C$337)-ROW($C30)),0))","v":0},{"$f":"IF(OR($C30=\"S\",$C30=0),0,MATCH(OFFSET($D30,0,$C30)+1,OFFSET($D30,1,$C30,ROW($C$337)-ROW($C30)),0))","v":0},"","Serviço","Serviço","-","AGETOP",270804,"PLACA DE INAUGURAÇÃO AÇO ESCOVADO 60 X 120 CM","un    ",1,1,1,null,null,0,0,""]
["S",2,"S",0,1,4,0,0,0,{"$f":"IF(OR($C31=\"S\",$C31=0),0,MATCH(0,OFFSET($D31,1,$C31,ROW($C$337)-ROW($C31)),0))","v":0},{"$f":"IF(OR($C31=\"S\",$C31=0),0,MATCH(OFFSET($D31,0,$C31)+1,OFFSET($D31,1,$C31,ROW($C$337)-ROW($C31)),0))","v":0},"","Serviço","Serviço","-","AGETOP",270501,"LIMPEZA FINAL DE OBRA - (OBRAS CIVIS)","m2    ",378.26,1,378.26,null,null,0,0,""]
[1,1,1,65,2,0,0,0,0,{"$f":"IF(OR($C32=\"S\",$C32=0),0,MATCH(0,OFFSET($D32,1,$C32,ROW($C$337)-ROW($C32)),0))","v":305},{"$f":"IF(OR($C32=\"S\",$C32=0),0,MATCH(OFFSET($D32,0,$C32)+1,OFFSET($D32,1,$C32,ROW($C$337)-ROW($C32)),0))","v":65},"F","Nível 1","Nível 1","2.","SINAPI",null,"INST. ELÉTRICAS","UN",1,1,1,null,null,0,0,""]
[2,2,2,3,2,1,0,0,0,{"$f":"IF(OR($C33=\"S\",$C33=0),0,MATCH(0,OFFSET($D33,1,$C33,ROW($C$337)-ROW($C33)),0))","v":64},{"$f":"IF(OR($C33=\"S\",$C33=0),0,MATCH(OFFSET($D33,0,$C33)+1,OFFSET($D33,1,$C33,ROW($C$337)-ROW($C33)),0))","v":3},"","Nível 2","Nível 2","-","SINAPI",null,"SERVIÇO EM TERRA","-",null,1,"-",null,null,0,0,""]
["S",2,"S",0,2,1,0,0,0,{"$f":"IF(OR($C34=\"S\",$C34=0),0,MATCH(0,OFFSET($D34,1,$C34,ROW($C$337)-ROW($C34)),0))","v":0},{"$f":"IF(OR($C34=\"S\",$C34=0),0,MATCH(OFFSET($D34,0,$C34)+1,OFFSET($D34,1,$C34,ROW($C$337)-ROW($C34)),0))","v":0},"","Serviço","Serviço","-","SINAPI",93358,"ESCAVAÇÃO MANUAL DE VALA COM PROFUNDIDADE MENOR OU IGUAL A 1,30 M. AF_03/2016","M3",2.34,1,2.34,null,null,0,0,"Referência: AGETOP - 40101"]
["S",2,"S",0,2,1,0,0,0,{"$f":"IF(OR($C35=\"S\",$C35=0),0,MATCH(0,OFFSET($D35,1,$C35,ROW($C$337)-ROW($C35)),0))","v":0},{"$f":"IF(OR($C35=\"S\",$C35=0),0,MATCH(OFFSET($D35,0,$C35)+1,OFFSET($D35,1,$C35,ROW($C$337)-ROW($C35)),0))","v":0},"","Serviço","Serviço","-","SINAPI",96995,"REATERRO MANUAL APILOADO COM SOQUETE. AF_10/2017","M3",3.74,1,3.74,null,null,0,0,"Referência: AGETOP - 40902"]
[{"$f":"CHOOSE(1+LOG(1+2*(ORÇAMENTO.Nivel=\"Nível 1\")+4*(ORÇAMENTO.Nivel=\"Nível 2\")+8*(ORÇAMENTO.Nivel=\"Nível 3\")+16*(ORÇAMENTO.Nivel=\"Nível 4\")+32*(ORÇAMENTO.Nivel=\"Serviço\"),2),0,1,2,3,4,\"S\")","v":2},{"$f":"IF(OR(C36=\"s\",C36=0),OFFSET(B36,-1,0),C36)","v":2},{"$f":"IF(OFFSET(C36,-1,0)=\"L\",1,IF(OFFSET(C36,-1,0)=1,2,IF(OR(A36=\"s\",A36=0),\"S\",IF(AND(OFFSET(C36,-1,0)=2,A36=4),3,IF(AND(OR(OFFSET(C36,-1,0)=\"s\",OFFSET(C36,-1,0)=0),A36<>\"s\",A36>OFFSET(B36,-1,0)),OFFSET(B36,-1,0),A36)))))","v":2},{"$f":"IF(OR(C36=\"S\",C36=0),0,IF(ISERROR(K36),J36,SMALL(J36:K36,1)))","v":61},{"$f":"IF($C36=1,OFFSET(E36,-1,0)+1,OFFSET(E36,-1,0))","v":2},{"$f":"IF($C36=1,0,IF($C36=2,OFFSET(F36,-1,0)+1,OFFSET(F36,-1,0)))","v":2},{"$f":"IF(AND($C36<=2,$C36<>0),0,IF($C36=3,OFFSET(G36,-1,0)+1,OFFSET(G36,-1,0)))","v":0},{"$f":"IF(AND($C36<=3,$C36<>0),0,IF($C36=4,OFFSET(H36,-1,0)+1,OFFSET(H36,-1,0)))","v":0},{"$f":"IF(AND($C36<=4,$C36<>0),0,IF(AND($C36=\"S\",$Y36>0),OFFSET(I36,-1,0)+1,OFFSET(I36,-1,0)))","v":0},{"$f":"IF(OR($C36=\"S\",$C36=0),0,MATCH(0,OFFSET($D36,1,$C36,ROW($C$337)-ROW($C36)),0))","v":61},{"$f":"IF(OR($C36=\"S\",$C36=0),0,MATCH(OFFSET($D36,0,$C36)+1,OFFSET($D36,1,$C36,ROW($C$337)-ROW($C36)),0))","v":67},"","Nível 2","Nível 2","-","SINAPI",null,"INSTALAÇÕES ELÉTRICAS","-",null,1,"-",null,null,0,0,""]
[3,3,3,37,2,2,1,0,0,{"$f":"IF(OR($C37=\"S\",$C37=0),0,MATCH(0,OFFSET($D37,1,$C37,ROW($C$337)-ROW($C37)),0))","v":60},{"$f":"IF(OR($C37=\"S\",$C37=0),0,MATCH(OFFSET($D37,0,$C37)+1,OFFSET($D37,1,$C37,ROW($C$337)-ROW($C37)),0))","v":37},"","Nível 3","Nível 3","-","SINAPI",null,"REFORMA GERAL","-",null,1,"-",null,null,0,0,""]
["S",3,"S",0,2,2,1,0,0,{"$f":"IF(OR($C38=\"S\",$C38=0),0,MATCH(0,OFFSET($D38,1,$C38,ROW($C$337)-ROW($C38)),0))","v":0},{"$f":"IF(OR($C38=\"S\",$C38=0),0,MATCH(OFFSET($D38,0,$C38)+1,OFFSET($D38,1,$C38,ROW($C$337)-ROW($C38)),0))","v":0},"","Serviço","Serviço","-","SINAPI","74131/4","QUADRO DE DISTRIBUICAO DE ENERGIA DE EMBUTIR, EM CHAPA METALICA, PARA 18 DISJUNTORES TERMOMAGNETICOS MONOPOLARES, COM BARRAMENTO TRIFASICO E NEUTRO, FORNECIMENTO E INSTALACAO","UN",1,1,1,null,null,0,0,""]
["S",3,"S",0,2,2,1,0,0,{"$f":"IF(OR($C39=\"S\",$C39=0),0,MATCH(0,OFFSET($D39,1,$C39,ROW($C$337)-ROW($C39)),0))","v":0},{"$f":"IF(OR($C39=\"S\",$C39=0),0,MATCH(OFFSET($D39,0,$C39)+1,OFFSET($D39,1,$C39,ROW($C$337)-ROW($C39)),0))","v":0},"","Serviço","Serviço","-","SINAPI",93673,"DISJUNTOR TRIPOLAR TIPO DIN, CORRENTE NOMINAL DE 50A - FORNECIMENTO E INSTALAÇÃO. AF_04/2016","UN",2,1,2,null,null,0,0,"Referência: AGETOP - 71174"]
["S",3,"S",0,2,2,1,0,0,{"$f":"IF(OR($C40=\"S\",$C40=0),0,MATCH(0,OFFSET($D40,1,$C40,ROW($C$337)-ROW($C40)),0))","v":0},{"$f":"IF(OR($C40=\"S\",$C40=0),0,MATCH(OFFSET($D40,0,$C40)+1,OFFSET($D40,1,$C40,ROW($C$337)-ROW($C40)),0))","v":0},"","Serviço","Serviço","-","SINAPI",93656,"DISJUNTOR MONOPOLAR TIPO DIN, CORRENTE NOMINAL DE 25A - FORNECIMENTO E INSTALAÇÃO. AF_04/2016","UN",8,1,8,null,null,0,0,""]
["S",3,"S",0,2,2,1,0,0,{"$f":"IF(OR($C41=\"S\",$C41=0),0,MATCH(0,OFFSET($D41,1,$C41,ROW($C$337)-ROW($C41)),0))","v":0},{"$f":"IF(OR($C41=\"S\",$C41=0),0,MATCH(OFFSET($D41,0,$C41)+1,OFFSET($D41,1,$C41,ROW($C$337)-ROW($C41)),0))","v":0},"","Serviço","Serviço","-","SINAPI",93654,"DISJUNTOR MONOPOLAR TIPO DIN, CORRENTE NOMINAL DE 16A - FORNECIMENTO E INSTALAÇÃO. AF_04/2016","UN",1,1,1,null,null,0,0,""]
["S",3,"S",0,2,2,1,0,0,{"$f":"IF(OR($C42=\"S\",$C42=0),0,MATCH(0,OFFSET($D42,1,$C42,ROW($C$337)-ROW($C42)),0))","v":0},{"$f":"IF(OR($C42=\"S\",$C42=0),0,MATCH(OFFSET($D42,0,$C42)+1,OFFSET($D42,1,$C42,ROW($C$337)-ROW($C42)),0))","v":0},"","Serviço","Serviço","-","AGETOP",71184,"DISPOSITIVO DE PROTEÇÃO CONTRA SURTOS (D.P.S.) 275V DE 8 A 40KA","Un    ",3,1,3,null,null,0,0,""]
["S",3,"S",0,2,2,1,0,0,{"$f":"IF(OR($C43=\"S\",$C43=0),0,MATCH(0,OFFSET($D43,1,$C43,ROW($C$337)-ROW($C43)),0))","v":0},{"$f":"IF(OR($C43=\"S\",$C43=0),0,MATCH(OFFSET($D43,0,$C43)+1,OFFSET($D43,1,$C43,ROW($C$337)-ROW($C43)),0))","v":0},"","Serviço","Serviço","-","AGETOP",71450,"INTERRUPTOR DIFERENCIAL RESIDUAL (D.R.) BIPOLAR DE 25A-30mA","Un    ",8,1,8,null,null,0,0,""]
["S",3,"S",0,2,2,1,0,0,{"$f":"IF(OR($C44=\"S\",$C44=0),0,MATCH(0,OFFSET($D44,1,$C44,ROW($C$337)-ROW($C44)),0))","v":0},{"$f":"IF(OR($C44=\"S\",$C44=0),0,MATCH(OFFSET($D44,0,$C44)+1,OFFSET($D44,1,$C44,ROW($C$337)-ROW($C44)),0))","v":0},"","Serviço","Serviço","-","SINAPI",91928,"CABO DE COBRE FLEXÍVEL ISOLADO, 4 MM², ANTI-CHAMA 450/750 V, PARA CIRCUITOS TERMINAIS - FORNECIMENTO E INSTALAÇÃO. AF_12/2015","M",125,1,125,null,null,0,0,"Referência: AGETOP - 70564"]
["S",3,"S",0,2,2,1,0,0,{"$f":"IF(OR($C45=\"S\",$C45=0),0,MATCH(0,OFFSET($D45,1,$C45,ROW($C$337)-ROW($C45)),0))","v":0},{"$f":"IF(OR($C45=\"S\",$C45=0),0,MATCH(OFFSET($D45,0,$C45)+1,OFFSET($D45,1,$C45,ROW($C$337)-ROW($C45)),0))","v":0},"","Serviço","Serviço","-","SINAPI",91926,"CABO DE COBRE FLEXÍVEL ISOLADO, 2,5 MM², ANTI-CHAMA 450/750 V, PARA CIRCUITOS TERMINAIS - FORNECIMENTO E INSTALAÇÃO. AF_12/2015","M",157,1,157,null,null,0,0,"Referência: AGETOP - 70563"]
["S",3,"S",0,2,2,1,0,0,{"$f":"IF(OR($C46=\"S\",$C46=0),0,MATCH(0,OFFSET($D46,1,$C46,ROW($C$337)-ROW($C46)),0))","v":0},{"$f":"IF(OR($C46=\"S\",$C46=0),0,MATCH(OFFSET($D46,0,$C46)+1,OFFSET($D46,1,$C46,ROW($C$337)-ROW($C46)),0))","v":0},"","Serviço","Serviço","-","SINAPI",91932,"CABO DE COBRE FLEXÍVEL ISOLADO, 10 MM², ANTI-CHAMA 450/750 V, PARA CIRCUITOS TERMINAIS - FORNECIMENTO E INSTALAÇÃO. AF_12/2015","M",623,1,623,null,null,0,0,""]
["S",3,"S",0,2,2,1,0,0,{"$f":"IF(OR($C47=\"S\",$C47=0),0,MATCH(0,OFFSET($D47,1,$C47,ROW($C$337)-ROW($C47)),0))","v":0},{"$f":"IF(OR($C47=\"S\",$C47=0),0,MATCH(OFFSET($D47,0,$C47)+1,OFFSET($D47,1,$C47,ROW($C$337)-ROW($C47)),0))","v":0},"","Serviço","Serviço","-","SINAPI",91871,"ELETRODUTO RÍGIDO ROSCÁVEL, PVC, DN 25 MM (3/4\"), PARA CIRCUITOS TERMINAIS, INSTALADO EM PAREDE - FORNECIMENTO E INSTALAÇÃO. AF_12/2015","M",55,1,55,null,null,0,0,"Referência: AGETOP - 71201"]
["S",3,"S",0,2,2,1,0,0,{"$f":"IF(OR($C48=\"S\",$C48=0),0,MATCH(0,OFFSET($D48,1,$C48,ROW($C$337)-ROW($C48)),0))","v":0},{"$f":"IF(OR($C48=\"S\",$C48=0),0,MATCH(OFFSET($D48,0,$C48)+1,OFFSET($D48,1,$C48,ROW($C$337)-ROW($C48)),0))","v":0},"","Serviço","Serviço","-","SINAPI",91872,"ELETRODUTO RÍGIDO ROSCÁVEL, PVC, DN 32 MM (1\"), PARA CIRCUITOS TERMINAIS, INSTALADO EM PAREDE - FORNECIMENTO E INSTALAÇÃO. AF_12/2015","M",20,1,20,null,null,0,0,"Referência: AGETOP - 71202"]
["S",3,"S",0,2,2,1,0,0,{"$f":"IF(OR($C49=\"S\",$C49=0),0,MATCH(0,OFFSET($D49,1,$C49,ROW($C$337)-ROW($C49)),0))","v":0},{"$f":"IF(OR($C49=\"S\",$C49=0),0,MATCH(OFFSET($D49,0,$C49)+1,OFFSET($D49,1,$C49,ROW($C$337)-ROW($C49)),0))","v":0},"","Serviço","Serviço","-","SINAPI",93009,"ELETRODUTO RÍGIDO ROSCÁVEL, PVC, DN 60 MM (2\") - FORNECIMENTO E INSTALAÇÃO. AF_12/2015","M",125,1,125,null,null,0,0,""]
["S",3,"S",0,2,2,1,0,0,{"$f":"IF(OR($C50=\"S\",$C50=0),0,MATCH(0,OFFSET($D50,1,$C50,ROW($C$337)-ROW($C50)),0))","v":0},{"$f":"IF(OR($C50=\"S\",$C50=0),0,MATCH(OFFSET($D50,0,$C50)+1,OFFSET($D50,1,$C50,ROW($C$337)-ROW($C50)),0))","v":0},"","Serviço","Serviço","-","AGETOP",70351,"BRACADEIRA METALICA TIPO \"U\" DIAM. 3/4\"","Un    ",3,1,3,null,null,0,0,""]
["S",3,"S",0,2,2,1,0,0,{"$f":"IF(OR($C51=\"S\",$C51=0),0,MATCH(0,OFFSET($D51,1,$C51,ROW($C$337)-ROW($C51)),0))","v":0},{"$f":"IF(OR($C51=\"S\",$C51=0),0,MATCH(OFFSET($D51,0,$C51)+1,OFFSET($D51,1,$C51,ROW($C$337)-ROW($C51)),0))","v":0},"","Serviço","Serviço","-","AGETOP",70352,"BRACADEIRA METALICA TIPO \"U\" DIAM. 1\"","Un    ",1,1,1,null,null,0,0,""]
["S",3,"S",0,2,2,1,0,0,{"$f":"IF(OR($C52=\"S\",$C52=0),0,MATCH(0,OFFSET($D52,1,$C52,ROW($C$337)-ROW($C52)),0))","v":0},{"$f":"IF(OR($C52=\"S\",$C52=0),0,MATCH(OFFSET($D52,0,$C52)+1,OFFSET($D52,1,$C52,ROW($C$337)-ROW($C52)),0))","v":0},"","Serviço","Serviço","-","AGETOP",70355,"BRACADEIRA METALICA TIPO \"U\" DIAM. 2\"","Un    ",6,1,6,null,null,0,0,""]
["S",3,"S",0,2,2,1,0,0,{"$f":"IF(OR($C53=\"S\",$C53=0),0,MATCH(0,OFFSET($D53,1,$C53,ROW($C$337)-ROW($C53)),0))","v":0},{"$f":"IF(OR($C53=\"S\",$C53=0),0,MATCH(OFFSET($D53,0,$C53)+1,OFFSET($D53,1,$C53,ROW($C$337)-ROW($C53)),0))","v":0},"","Serviço","Serviço","-","SINAPI",91879,"LUVA PARA ELETRODUTO, PVC, ROSCÁVEL, DN 25 MM (3/4\"), PARA CIRCUITOS TERMINAIS, INSTALADA EM LAJE - FORNECIMENTO E INSTALAÇÃO. AF_12/2015","UN",3,1,3,null,null,0,0,"Referência: AGETOP - 71741"]
["S",3,"S",0,2,2,1,0,0,{"$f":"IF(OR($C54=\"S\",$C54=0),0,MATCH(0,OFFSET($D54,1,$C54,ROW($C$337)-ROW($C54)),0))","v":0},{"$f":"IF(OR($C54=\"S\",$C54=0),0,MATCH(OFFSET($D54,0,$C54)+1,OFFSET($D54,1,$C54,ROW($C$337)-ROW($C54)),0))","v":0},"","Serviço","Serviço","-","SINAPI",91880,"LUVA PARA ELETRODUTO, PVC, ROSCÁVEL, DN 32 MM (1\"), PARA CIRCUITOS TERMINAIS, INSTALADA EM LAJE - FORNECIMENTO E INSTALAÇÃO. AF_12/2015","UN",1,1,1,null,null,0,0,"Referência: AGETOP - 71742"]
["S",3,"S",0,2,2,1,0,0,{"$f":"IF(OR($C55=\"S\",$C55=0),0,MATCH(0,OFFSET($D55,1,$C55,ROW($C$337)-ROW($C55)),0))","v":0},{"$f":"IF(OR($C55=\"S\",$C55=0),0,MATCH(OFFSET($D55,0,$C55)+1,OFFSET($D55,1,$C55,ROW($C$337)-ROW($C55)),0))","v":0},"","Serviço","Serviço","-","SINAPI",93014,"LUVA PARA ELETRODUTO, PVC, ROSCÁVEL, DN 60 MM (2\") - FORNECIMENTO E INSTALAÇÃO. AF_12/2015","UN",6,1,6,null,null,0,0,"Referência: AGETOP - 71745"]
["S",3,"S",0,2,2,1,0,0,{"$f":"IF(OR($C56=\"S\",$C56=0),0,MATCH(0,OFFSET($D56,1,$C56,ROW($C$337)-ROW($C56)),0))","v":0},{"$f":"IF(OR($C56=\"S\",$C56=0),0,MATCH(OFFSET($D56,0,$C56)+1,OFFSET($D56,1,$C56,ROW($C$337)-ROW($C56)),0))","v":0},"","Serviço","Serviço","-","AGETOP",72395,"TAMPA CEGA PARA CONDULETE METÁLICO","Un    ",20,1,20,null,null,0,0,""]
["S",3,"S",0,2,2,1,0,0,{"$f":"IF(OR($C57=\"S\",$C57=0),0,MATCH(0,OFFSET($D57,1,$C57,ROW($C$337)-ROW($C57)),0))","v":0},{"$f":"IF(OR($C57=\"S\",$C57=0),0,MATCH(OFFSET($D57,0,$C57)+1,OFFSET($D57,1,$C57,ROW($C$337)-ROW($C57)),0))","v":0},"","Serviço","Serviço","-","SINAPI",95801,"CONDULETE DE ALUMÍNIO, TIPO X, PARA ELETRODUTO DE AÇO GALVANIZADO DN 20 MM (3/4''), APARENTE - FORNECIMENTO E INSTALAÇÃO. AF_11/2016_P","UN",20,1,20,null,null,0,0,"Referência: AGETOP - 70929"]
["S",3,"S",0,2,2,1,0,0,{"$f":"IF(OR($C58=\"S\",$C58=0),0,MATCH(0,OFFSET($D58,1,$C58,ROW($C$337)-ROW($C58)),0))","v":0},{"$f":"IF(OR($C58=\"S\",$C58=0),0,MATCH(OFFSET($D58,0,$C58)+1,OFFSET($D58,1,$C58,ROW($C$337)-ROW($C58)),0))","v":0},"","Serviço","Serviço","-","SINAPI",91902,"CURVA 90 GRAUS PARA ELETRODUTO, PVC, ROSCÁVEL, DN 25 MM (3/4\"), PARA CIRCUITOS TERMINAIS, INSTALADA EM LAJE - FORNECIMENTO E INSTALAÇÃO. AF_12/2015","UN",3,1,3,null,null,0,0,"Referência: AGETOP - 71141"]
["S",3,"S",0,2,2,1,0,0,{"$f":"IF(OR($C59=\"S\",$C59=0),0,MATCH(0,OFFSET($D59,1,$C59,ROW($C$337)-ROW($C59)),0))","v":0},{"$f":"IF(OR($C59=\"S\",$C59=0),0,MATCH(OFFSET($D59,0,$C59)+1,OFFSET($D59,1,$C59,ROW($C$337)-ROW($C59)),0))","v":0},"","Serviço","Serviço","-","SINAPI",91905,"CURVA 90 GRAUS PARA ELETRODUTO, PVC, ROSCÁVEL, DN 32 MM (1\"), PARA CIRCUITOS TERMINAIS, INSTALADA EM LAJE - FORNECIMENTO E INSTALAÇÃO. AF_12/2015","UN",3,1,3,null,null,0,0,"Referência: AGETOP - 71142"]
["S",3,"S",0,2,2,1,0,0,{"$f":"IF(OR($C60=\"S\",$C60=0),0,MATCH(0,OFFSET($D60,1,$C60,ROW($C$337)-ROW($C60)),0))","v":0},{"$f":"IF(OR($C60=\"S\",$C60=0),0,MATCH(OFFSET($D60,0,$C60)+1,OFFSET($D60,1,$C60,ROW($C$337)-ROW($C60)),0))","v":0},"","Serviço","Serviço","-","AGETOP",71155,"CURVA DE 90 GRAUS AÇO GALVANIZADO DIAM. 2\"","Un    ",2,1,2,null,null,0,0,""]
["S",3,"S",0,2,2,1,0,0,{"$f":"IF(OR($C61=\"S\",$C61=0),0,MATCH(0,OFFSET($D61,1,$C61,ROW($C$337)-ROW($C61)),0))","v":0},{"$f":"IF(OR($C61=\"S\",$C61=0),0,MATCH(OFFSET($D61,0,$C61)+1,OFFSET($D61,1,$C61,ROW($C$337)-ROW($C61)),0))","v":0},"","Serviço","Serviço","-","SINAPI",91953,"INTERRUPTOR SIMPLES (1 MÓDULO), 10A/250V, INCLUINDO SUPORTE E PLACA - FORNECIMENTO E INSTALAÇÃO. AF_12/2015","UN",2,1,2,null,null,0,0,"Referência: AGETOP - 71440"]
["S",3,"S",0,2,2,1,0,0,{"$f":"IF(OR($C62=\"S\",$C62=0),0,MATCH(0,OFFSET($D62,1,$C62,ROW($C$337)-ROW($C62)),0))","v":0},{"$f":"IF(OR($C62=\"S\",$C62=0),0,MATCH(OFFSET($D62,0,$C62)+1,OFFSET($D62,1,$C62,ROW($C$337)-ROW($C62)),0))","v":0},"","Serviço","Serviço","-","SINAPI",91959,"INTERRUPTOR SIMPLES (2 MÓDULOS), 10A/250V, INCLUINDO SUPORTE E PLACA - FORNECIMENTO E INSTALAÇÃO. AF_12/2015","UN",14,1,14,null,null,0,0,"Referência: AGETOP - 71441"]
["S",3,"S",0,2,2,1,0,0,{"$f":"IF(OR($C63=\"S\",$C63=0),0,MATCH(0,OFFSET($D63,1,$C63,ROW($C$337)-ROW($C63)),0))","v":0},{"$f":"IF(OR($C63=\"S\",$C63=0),0,MATCH(OFFSET($D63,0,$C63)+1,OFFSET($D63,1,$C63,ROW($C$337)-ROW($C63)),0))","v":0},"","Serviço","Serviço","-","SINAPI",91996,"TOMADA MÉDIA DE EMBUTIR (1 MÓDULO), 2P+T 10 A, INCLUINDO SUPORTE E PLACA - FORNECIMENTO E INSTALAÇÃO. AF_12/2015","UN",4,1,4,null,null,0,0,"Referência: AGETOP - 72578"]
["S",3,"S",0,2,2,1,0,0,{"$f":"IF(OR($C64=\"S\",$C64=0),0,MATCH(0,OFFSET($D64,1,$C64,ROW($C$337)-ROW($C64)),0))","v":0},{"$f":"IF(OR($C64=\"S\",$C64=0),0,MATCH(OFFSET($D64,0,$C64)+1,OFFSET($D64,1,$C64,ROW($C$337)-ROW($C64)),0))","v":0},"","Serviço","Serviço","-","SINAPI",91993,"TOMADA ALTA DE EMBUTIR (1 MÓDULO), 2P+T 20 A, INCLUINDO SUPORTE E PLACA - FORNECIMENTO E INSTALAÇÃO. AF_12/2015","UN",8,1,8,null,null,0,0,"Referência: AGETOP - 72585"]
["S",3,"S",0,2,2,1,0,0,{"$f":"IF(OR($C65=\"S\",$C65=0),0,MATCH(0,OFFSET($D65,1,$C65,ROW($C$337)-ROW($C65)),0))","v":0},{"$f":"IF(OR($C65=\"S\",$C65=0),0,MATCH(OFFSET($D65,0,$C65)+1,OFFSET($D65,1,$C65,ROW($C$337)-ROW($C65)),0))","v":0},"","Serviço","Serviço","-","SINAPI",97585,"LUMINÁRIA TIPO CALHA, DE SOBREPOR, COM 2 LÂMPADAS TUBULARES FLUORESCENTES DE 18 W, COM REATOR DE PARTIDA RÁPIDA - FORNECIMENTO E INSTALAÇÃO. AF_02/2020","UN",8,1,8,null,null,0,0,""]
["S",3,"S",0,2,2,1,0,0,{"$f":"IF(OR($C66=\"S\",$C66=0),0,MATCH(0,OFFSET($D66,1,$C66,ROW($C$337)-ROW($C66)),0))","v":0},{"$f":"IF(OR($C66=\"S\",$C66=0),0,MATCH(OFFSET($D66,0,$C66)+1,OFFSET($D66,1,$C66,ROW($C$337)-ROW($C66)),0))","v":0},"","Serviço","Serviço","-","AGETOP",70710,"CAIXA DE PASSAGEM 30X30X40CM COM TAMPA E DRENO BRITA","Un    ",2,1,2,null,null,0,0,""]
["S",3,"S",0,2,2,1,0,0,{"$f":"IF(OR($C67=\"S\",$C67=0),0,MATCH(0,OFFSET($D67,1,$C67,ROW($C$337)-ROW($C67)),0))","v":0},{"$f":"IF(OR($C67=\"S\",$C67=0),0,MATCH(OFFSET($D67,0,$C67)+1,OFFSET($D67,1,$C67,ROW($C$337)-ROW($C67)),0))","v":0},"","Serviço","Serviço","-","AGETOP",70633,"CAIXA DE PASSAGEM - ESCAVAÇÃO MANUAL / REATERRO/ APILOAMENTO DO FUNDO ","m3    ",0.24,1,0.24,null,null,0,0,""]
["S",3,"S",0,2,2,1,0,0,{"$f":"IF(OR($C68=\"S\",$C68=0),0,MATCH(0,OFFSET($D68,1,$C68,ROW($C$337)-ROW($C68)),0))","v":0},{"$f":"IF(OR($C68=\"S\",$C68=0),0,MATCH(OFFSET($D68,0,$C68)+1,OFFSET($D68,1,$C68,ROW($C$337)-ROW($C68)),0))","v":0},"","Serviço","Serviço","-","AGETOP",70391,"BUCHA DE NYLON S-6","Un    ",200,1,200,null,null,0,0,""]
["S",3,"S",0,2,2,1,0,0,{"$f":"IF(OR($C69=\"S\",$C69=0),0,MATCH(0,OFFSET($D69,1,$C69,ROW($C$337)-ROW($C69)),0))","v":0},{"$f":"IF(OR($C69=\"S\",$C69=0),0,MATCH(OFFSET($D69,0,$C69)+1,OFFSET($D69,1,$C69,ROW($C$337)-ROW($C69)),0))","v":0},"","Serviço","Serviço","-","AGETOP",71861,"PARAFUSO P/BUCHA S-6","Un    ",200,1,200,null,null,0,0,""]
["S",3,"S",0,2,2,1,0,0,{"$f":"IF(OR($C70=\"S\",$C70=0),0,MATCH(0,OFFSET($D70,1,$C70,ROW($C$337)-ROW($C70)),0))","v":0},{"$f":"IF(OR($C70=\"S\",$C70=0),0,MATCH(OFFSET($D70,0,$C70)+1,OFFSET($D70,1,$C70,ROW($C$337)-ROW($C70)),0))","v":0},"","Serviço","Serviço","-","AGETOP",71321,"FITA DE AUTO FUSAO, ROLO E 10,00 MM","Un    ",1,1,1,null,null,0,0,""]
["S",3,"S",0,2,2,1,0,0,{"$f":"IF(OR($C71=\"S\",$C71=0),0,MATCH(0,OFFSET($D71,1,$C71,ROW($C$337)-ROW($C71)),0))","v":0},{"$f":"IF(OR($C71=\"S\",$C71=0),0,MATCH(OFFSET($D71,0,$C71)+1,OFFSET($D71,1,$C71,ROW($C$337)-ROW($C71)),0))","v":0},"","Serviço","Serviço","-","SINAPI",93358,"ESCAVAÇÃO MANUAL DE VALA COM PROFUNDIDADE MENOR OU IGUAL A 1,30 M. AF_03/2016","M3",6.1,1,6.1,null,null,0,0,"Referência: AGETOP - 40101"]
["S",3,"S",0,2,2,1,0,0,{"$f":"IF(OR($C72=\"S\",$C72=0),0,MATCH(0,OFFSET($D72,1,$C72,ROW($C$337)-ROW($C72)),0))","v":0},{"$f":"IF(OR($C72=\"S\",$C72=0),0,MATCH(OFFSET($D72,0,$C72)+1,OFFSET($D72,1,$C72,ROW($C$337)-ROW($C72)),0))","v":0},"","Serviço","Serviço","-","SINAPI",96995,"REATERRO MANUAL APILOADO COM SOQUETE. AF_10/2017","M3",9.77,1,9.77,null,null,0,0,"Referência: AGETOP - 40902"]
["S",3,"S",0,2,2,1,0,0,{"$f":"IF(OR($C73=\"S\",$C73=0),0,MATCH(0,OFFSET($D73,1,$C73,ROW($C$337)-ROW($C73)),0))","v":0},{"$f":"IF(OR($C73=\"S\",$C73=0),0,MATCH(OFFSET($D73,0,$C73)+1,OFFSET($D73,1,$C73,ROW($C$337)-ROW($C73)),0))","v":0},"","Serviço","Serviço","-","AGETOP",20162,"DEMOLIÇÃO DAS INSTALAÇÕES ELÉTRICAS E AFINS C/ TRANSP. ATÉ CB. E CARGA","H     ",5,1,5,null,null,0,0,""]
[3,3,3,16,2,2,2,0,0,{"$f":"IF(OR($C74=\"S\",$C74=0),0,MATCH(0,OFFSET($D74,1,$C74,ROW($C$337)-ROW($C74)),0))","v":23},{"$f":"IF(OR($C74=\"S\",$C74=0),0,MATCH(OFFSET($D74,0,$C74)+1,OFFSET($D74,1,$C74,ROW($C$337)-ROW($C74)),0))","v":16},"","Nível 3","Nível 3","-","SINAPI",null,"CIRC. DE COMANDO E ACIONAMENTO SISTEMA DE COMB. A INCÊNDIO","-",null,1,"-",null,null,0,0,""]
["S",3,"S",0,2,2,2,0,0,{"$f":"IF(OR($C75=\"S\",$C75=0),0,MATCH(0,OFFSET($D75,1,$C75,ROW($C$337)-ROW($C75)),0))","v":0},{"$f":"IF(OR($C75=\"S\",$C75=0),0,MATCH(OFFSET($D75,0,$C75)+1,OFFSET($D75,1,$C75,ROW($C$337)-ROW($C75)),0))","v":0},"","Serviço","Serviço","-","AGETOP",91043,"BRAÇADEIRA METALICA TIPO \"D\" DIAM. 3/4\"","Un    ",10,1,10,null,null,0,0,""]
["S",3,"S",0,2,2,2,0,0,{"$f":"IF(OR($C76=\"S\",$C76=0),0,MATCH(0,OFFSET($D76,1,$C76,ROW($C$337)-ROW($C76)),0))","v":0},{"$f":"IF(OR($C76=\"S\",$C76=0),0,MATCH(OFFSET($D76,0,$C76)+1,OFFSET($D76,1,$C76,ROW($C$337)-ROW($C76)),0))","v":0},"","Serviço","Serviço","-","AGETOP",70421,"BUCHA E ARRUELA METALICA DIAM. 3/4\"","PR    ",10,1,10,null,null,0,0,""]
["S",3,"S",0,2,2,2,0,0,{"$f":"IF(OR($C77=\"S\",$C77=0),0,MATCH(0,OFFSET($D77,1,$C77,ROW($C$337)-ROW($C77)),0))","v":0},{"$f":"IF(OR($C77=\"S\",$C77=0),0,MATCH(OFFSET($D77,0,$C77)+1,OFFSET($D77,1,$C77,ROW($C$337)-ROW($C77)),0))","v":0},"","Serviço","Serviço","-","AGETOP",70356,"BRACADEIRA METALICA TIPO \"U\" DIAM. 2.1/2\"","Un    ",5,1,5,null,null,0,0,""]
["S",3,"S",0,2,2,2,0,0,{"$f":"IF(OR($C78=\"S\",$C78=0),0,MATCH(0,OFFSET($D78,1,$C78,ROW($C$337)-ROW($C78)),0))","v":0},{"$f":"IF(OR($C78=\"S\",$C78=0),0,MATCH(OFFSET($D78,0,$C78)+1,OFFSET($D78,1,$C78,ROW($C$337)-ROW($C78)),0))","v":0},"","Serviço","Serviço","-","AGETOP",70426,"BUCHA E ARRUELA METALICA DIAM. 2.1/2\"","PR    ",5,1,5,null,null,0,0,""]
["S",3,"S",0,2,2,2,0,0,{"$f":"IF(OR($C79=\"S\",$C79=0),0,MATCH(0,OFFSET($D79,1,$C79,ROW($C$337)-ROW($C79)),0))","v":0},{"$f":"IF(OR($C79=\"S\",$C79=0),0,MATCH(OFFSET($D79,0,$C79)+1,OFFSET($D79,1,$C79,ROW($C$337)-ROW($C79)),0))","v":0},"","Serviço","Serviço","-","AGETOP",70555,"CABO FLEXIVEL PARALELO 2 X 1,5 MM2","M     ",585,1,585,null,null,0,0,""]
["S",3,"S",0,2,2,2,0,0,{"$f":"IF(OR($C80=\"S\",$C80=0),0,MATCH(0,OFFSET($D80,1,$C80,ROW($C$337)-ROW($C80)),0))","v":0},{"$f":"IF(OR($C80=\"S\",$C80=0),0,MATCH(OFFSET($D80,0,$C80)+1,OFFSET($D80,1,$C80,ROW($C$337)-ROW($C80)),0))","v":0},"","Serviço","Serviço","-","AGETOP",71201,"ELETRODUTO DE PVC RIGIDO DIAMETRO 3/4\"","M     ",189,1,189,null,null,0,0,""]
["S",3,"S",0,2,2,2,0,0,{"$f":"IF(OR($C81=\"S\",$C81=0),0,MATCH(0,OFFSET($D81,1,$C81,ROW($C$337)-ROW($C81)),0))","v":0},{"$f":"IF(OR($C81=\"S\",$C81=0),0,MATCH(OFFSET($D81,0,$C81)+1,OFFSET($D81,1,$C81,ROW($C$337)-ROW($C81)),0))","v":0},"","Serviço","Serviço","-","SINAPI",95787,"CONDULETE DE ALUMÍNIO, TIPO LR, PARA ELETRODUTO DE AÇO GALVANIZADO DN 20 MM (3/4''), APARENTE - FORNECIMENTO E INSTALAÇÃO. AF_11/2016_P","UN",5,1,5,null,null,0,0,""]
["S",3,"S",0,2,2,2,0,0,{"$f":"IF(OR($C82=\"S\",$C82=0),0,MATCH(0,OFFSET($D82,1,$C82,ROW($C$337)-ROW($C82)),0))","v":0},{"$f":"IF(OR($C82=\"S\",$C82=0),0,MATCH(OFFSET($D82,0,$C82)+1,OFFSET($D82,1,$C82,ROW($C$337)-ROW($C82)),0))","v":0},"","Serviço","Serviço","-","SINAPI",95795,"CONDULETE DE ALUMÍNIO, TIPO T, PARA ELETRODUTO DE AÇO GALVANIZADO DN 20 MM (3/4''), APARENTE - FORNECIMENTO E INSTALAÇÃO. AF_11/2016_P","UN",3,1,3,null,null,0,0,""]
["S",3,"S",0,2,2,2,0,0,{"$f":"IF(OR($C83=\"S\",$C83=0),0,MATCH(0,OFFSET($D83,1,$C83,ROW($C$337)-ROW($C83)),0))","v":0},{"$f":"IF(OR($C83=\"S\",$C83=0),0,MATCH(OFFSET($D83,0,$C83)+1,OFFSET($D83,1,$C83,ROW($C$337)-ROW($C83)),0))","v":0},"","Serviço","Serviço","-","AGETOP",72395,"TAMPA CEGA PARA CONDULETE METÁLICO","Un    ",8,1,8,null,null,0,0,""]
["S",3,"S",0,2,2,2,0,0,{"$f":"IF(OR($C84=\"S\",$C84=0),0,MATCH(0,OFFSET($D84,1,$C84,ROW($C$337)-ROW($C84)),0))","v":0},{"$f":"IF(OR($C84=\"S\",$C84=0),0,MATCH(OFFSET($D84,0,$C84)+1,OFFSET($D84,1,$C84,ROW($C$337)-ROW($C84)),0))","v":0},"","Serviço","Serviço","-","AGETOP",71216,"ELETRODUTO EM AÇO GALVANIZADO A FOGO DIÂMETRO 2 1/2\" - PESADO ","M     ",50,1,50,null,null,0,0,""]
["S",3,"S",0,2,2,2,0,0,{"$f":"IF(OR($C85=\"S\",$C85=0),0,MATCH(0,OFFSET($D85,1,$C85,ROW($C$337)-ROW($C85)),0))","v":0},{"$f":"IF(OR($C85=\"S\",$C85=0),0,MATCH(OFFSET($D85,0,$C85)+1,OFFSET($D85,1,$C85,ROW($C$337)-ROW($C85)),0))","v":0},"","Serviço","Serviço","-","AGETOP",71701,"LUVA EM AÇO GALVANIZADO DIÂMETRO 3/4\"","Un    ",10,1,10,null,null,0,0,""]
["S",3,"S",0,2,2,2,0,0,{"$f":"IF(OR($C86=\"S\",$C86=0),0,MATCH(0,OFFSET($D86,1,$C86,ROW($C$337)-ROW($C86)),0))","v":0},{"$f":"IF(OR($C86=\"S\",$C86=0),0,MATCH(OFFSET($D86,0,$C86)+1,OFFSET($D86,1,$C86,ROW($C$337)-ROW($C86)),0))","v":0},"","Serviço","Serviço","-","AGETOP",71862,"PARAFUSO P/BUCHA S-8","Un    ",40,1,40,null,null,0,0,""]
["S",3,"S",0,2,2,2,0,0,{"$f":"IF(OR($C87=\"S\",$C87=0),0,MATCH(0,OFFSET($D87,1,$C87,ROW($C$337)-ROW($C87)),0))","v":0},{"$f":"IF(OR($C87=\"S\",$C87=0),0,MATCH(OFFSET($D87,0,$C87)+1,OFFSET($D87,1,$C87,ROW($C$337)-ROW($C87)),0))","v":0},"","Serviço","Serviço","-","AGETOP",70392,"BUCHA DE NYLON S-8","Un    ",40,1,40,null,null,0,0,""]
["S",3,"S",0,2,2,2,0,0,{"$f":"IF(OR($C88=\"S\",$C88=0),0,MATCH(0,OFFSET($D88,1,$C88,ROW($C$337)-ROW($C88)),0))","v":0},{"$f":"IF(OR($C88=\"S\",$C88=0),0,MATCH(OFFSET($D88,0,$C88)+1,OFFSET($D88,1,$C88,ROW($C$337)-ROW($C88)),0))","v":0},"","Serviço","Serviço","-","SINAPI",83446,"CAIXA DE PASSAGEM 30X30X40 COM TAMPA E DRENO BRITA","UN",1,1,1,null,null,0,0,""]
["S",3,"S",0,2,2,2,0,0,{"$f":"IF(OR($C89=\"S\",$C89=0),0,MATCH(0,OFFSET($D89,1,$C89,ROW($C$337)-ROW($C89)),0))","v":0},{"$f":"IF(OR($C89=\"S\",$C89=0),0,MATCH(OFFSET($D89,0,$C89)+1,OFFSET($D89,1,$C89,ROW($C$337)-ROW($C89)),0))","v":0},"","Serviço","Serviço","-","AGETOP",70633,"CAIXA DE PASSAGEM - ESCAVAÇÃO MANUAL / REATERRO/ APILOAMENTO DO FUNDO ","m3    ",0.12,1,0.12,null,null,0,0,""]
[3,3,3,7,2,2,3,0,0,{"$f":"IF(OR($C90=\"S\",$C90=0),0,MATCH(0,OFFSET($D90,1,$C90,ROW($C$337)-ROW($C90)),0))","v":7},{"$f":"IF(OR($C90=\"S\",$C90=0),0,MATCH(OFFSET($D90,0,$C90)+1,OFFSET($D90,1,$C90,ROW($C$337)-ROW($C90)),0))","v":65},"","Nível 3","Nível 3","-","SINAPI",null,"CIRC. ILUMINAÇÃO DE EMERGÊNCIA","-",null,1,"-",null,null,0,0,""]
["S",3,"S",0,2,2,3,0,0,{"$f":"IF(OR($C91=\"S\",$C91=0),0,MATCH(0,OFFSET($D91,1,$C91,ROW($C$337)-ROW($C91)),0))","v":0},{"$f":"IF(OR($C91=\"S\",$C91=0),0,MATCH(OFFSET($D91,0,$C91)+1,OFFSET($D91,1,$C91,ROW($C$337)-ROW($C91)),0))","v":0},"","Serviço","Serviço","-","SINAPI",91926,"CABO DE COBRE FLEXÍVEL ISOLADO, 2,5 MM², ANTI-CHAMA 450/750 V, PARA CIRCUITOS TERMINAIS - FORNECIMENTO E INSTALAÇÃO. AF_12/2015","M",150,1,150,null,null,0,0,"Referência: AGETOP - 70563"]
["S",3,"S",0,2,2,3,0,0,{"$f":"IF(OR($C92=\"S\",$C92=0),0,MATCH(0,OFFSET($D92,1,$C92,ROW($C$337)-ROW($C92)),0))","v":0},{"$f":"IF(OR($C92=\"S\",$C92=0),0,MATCH(OFFSET($D92,0,$C92)+1,OFFSET($D92,1,$C92,ROW($C$337)-ROW($C92)),0))","v":0},"","Serviço","Serviço","-","SINAPI",91867,"ELETRODUTO RÍGIDO ROSCÁVEL, PVC, DN 25 MM (3/4\"), PARA CIRCUITOS TERMINAIS, INSTALADO EM LAJE - FORNECIMENTO E INSTALAÇÃO. AF_12/2015","M",50,1,50,null,null,0,0,"Referência: AGETOP - 71201"]
["S",3,"S",0,2,2,3,0,0,{"$f":"IF(OR($C93=\"S\",$C93=0),0,MATCH(0,OFFSET($D93,1,$C93,ROW($C$337)-ROW($C93)),0))","v":0},{"$f":"IF(OR($C93=\"S\",$C93=0),0,MATCH(OFFSET($D93,0,$C93)+1,OFFSET($D93,1,$C93,ROW($C$337)-ROW($C93)),0))","v":0},"","Serviço","Serviço","-","SINAPI",91879,"LUVA PARA ELETRODUTO, PVC, ROSCÁVEL, DN 25 MM (3/4\"), PARA CIRCUITOS TERMINAIS, INSTALADA EM LAJE - FORNECIMENTO E INSTALAÇÃO. AF_12/2015","UN",10,1,10,null,null,0,0,"Referência: AGETOP - 71741"]
["S",3,"S",0,2,2,3,0,0,{"$f":"IF(OR($C94=\"S\",$C94=0),0,MATCH(0,OFFSET($D94,1,$C94,ROW($C$337)-ROW($C94)),0))","v":0},{"$f":"IF(OR($C94=\"S\",$C94=0),0,MATCH(OFFSET($D94,0,$C94)+1,OFFSET($D94,1,$C94,ROW($C$337)-ROW($C94)),0))","v":0},"","Serviço","Serviço","-","AGETOP",70351,"BRACADEIRA METALICA TIPO \"U\" DIAM. 3/4\"","Un    ",10,1,10,null,null,0,0,""]
["S",3,"S",0,2,2,3,0,0,{"$f":"IF(OR($C95=\"S\",$C95=0),0,MATCH(0,OFFSET($D95,1,$C95,ROW($C$337)-ROW($C95)),0))","v":0},{"$f":"IF(OR($C95=\"S\",$C95=0),0,MATCH(OFFSET($D95,0,$C95)+1,OFFSET($D95,1,$C95,ROW($C$337)-ROW($C95)),0))","v":0},"","Serviço","Serviço","-","AGETOP",71862,"PARAFUSO P/BUCHA S-8","Un    ",40,1,40,null,null,0,0,""]
["S",3,"S",0,2,2,3,0,0,{"$f":"IF(OR($C96=\"S\",$C96=0),0,MATCH(0,OFFSET($D96,1,$C96,ROW($C$337)-ROW($C96)),0))","v":0},{"$f":"IF(OR($C96=\"S\",$C96=0),0,MATCH(OFFSET($D96,0,$C96)+1,OFFSET($D96,1,$C96,ROW($C$337)-ROW($C96)),0))","v":0},"","Serviço","Serviço","-","AGETOP",70392,"BUCHA DE NYLON S-8","Un    ",40,1,40,null,null,0,0,""]
[1,1,1,96,3,0,0,0,0,{"$f":"IF(OR($C97=\"S\",$C97=0),0,MATCH(0,OFFSET($D97,1,$C97,ROW($C$337)-ROW($C97)),0))","v":240},{"$f":"IF(OR($C97=\"S\",$C97=0),0,MATCH(OFFSET($D97,0,$C97)+1,OFFSET($D97,1,$C97,ROW($C$337)-ROW($C97)),0))","v":96},"F","Nível 1","Nível 1","3.","SINAPI",null,"INSTALAÇÕES HIDROSSANITÁRIAS E COMBATE À INCÊNDIO","UN",1,1,1,null,null,0,0,""]
[2,2,2,2,3,1,0,0,0,{"$f":"IF(OR($C98=\"S\",$C98=0),0,MATCH(0,OFFSET($D98,1,$C98,ROW($C$337)-ROW($C98)),0))","v":95},{"$f":"IF(OR($C98=\"S\",$C98=0),0,MATCH(OFFSET($D98,0,$C98)+1,OFFSET($D98,1,$C98,ROW($C$337)-ROW($C98)),0))","v":2},"","Nível 2","Nível 2","-","SINAPI",null,"SERVIÇOS PRELIMINARES","-",null,1,"-",null,null,0,0,""]
[{"$f":"CHOOSE(1+LOG(1+2*(ORÇAMENTO.Nivel=\"Nível 1\")+4*(ORÇAMENTO.Nivel=\"Nível 2\")+8*(ORÇAMENTO.Nivel=\"Nível 3\")+16*(ORÇAMENTO.Nivel=\"Nível 4\")+32*(ORÇAMENTO.Nivel=\"Serviço\"),2),0,1,2,3,4,\"S\")","v":"S"},{"$f":"IF(OR(C99=\"s\",C99=0),OFFSET(B99,-1,0),C99)","v":2},{"$f":"IF(OFFSET(C99,-1,0)=\"L\",1,IF(OFFSET(C99,-1,0)=1,2,IF(OR(A99=\"s\",A99=0),\"S\",IF(AND(OFFSET(C99,-1,0)=2,A99=4),3,IF(AND(OR(OFFSET(C99,-1,0)=\"s\",OFFSET(C99,-1,0)=0),A99<>\"s\",A99>OFFSET(B99,-1,0)),OFFSET(B99,-1,0),A99)))))","v":"S"},{"$f":"IF(OR(C99=\"S\",C99=0),0,IF(ISERROR(K99),J99,SMALL(J99:K99,1)))","v":0},{"$f":"IF($C99=1,OFFSET(E99,-1,0)+1,OFFSET(E99,-1,0))","v":3},{"$f":"IF($C99=1,0,IF($C99=2,OFFSET(F99,-1,0)+1,OFFSET(F99,-1,0)))","v":1},{"$f":"IF(AND($C99<=2,$C99<>0),0,IF($C99=3,OFFSET(G99,-1,0)+1,OFFSET(G99,-1,0)))","v":0},{"$f":"IF(AND($C99<=3,$C99<>0),0,IF($C99=4,OFFSET(H99,-1,0)+1,OFFSET(H99,-1,0)))","v":0},{"$f":"IF(AND($C99<=4,$C99<>0),0,IF(AND($C99=\"S\",$Y99>0),OFFSET(I99,-1,0)+1,OFFSET(I99,-1,0)))","v":0},{"$f":"IF(OR($C99=\"S\",$C99=0),0,MATCH(0,OFFSET($D99,1,$C99,ROW($C$337)-ROW($C99)),0))","v":0},{"$f":"IF(OR($C99=\"S\",$C99=0),0,MATCH(OFFSET($D99,0,$C99)+1,OFFSET($D99,1,$C99,ROW($C$337)-ROW($C99)),0))","v":0},"","Serviço","Serviço","-","AGETOP",20121,"DEM. MANUAL EM CONCR.SIMPLES C/TR.ATE CB.E CARGA (O.C.)","m3    ",7,1,7,null,null,0,0,""]
[2,{"$f":"IF(OR(C100=\"s\",C100=0),OFFSET(B100,-1,0),C100)","v":2},{"$f":"IF(OFFSET(C100,-1,0)=\"L\",1,IF(OFFSET(C100,-1,0)=1,2,IF(OR(A100=\"s\",A100=0),\"S\",IF(AND(OFFSET(C100,-1,0)=2,A100=4),3,IF(AND(OR(OFFSET(C100,-1,0)=\"s\",OFFSET(C100,-1,0)=0),A100<>\"s\",A100>OFFSET(B100,-1,0)),OFFSET(B100,-1,0),A100)))))","v":2},{"$f":"IF(OR(C100=\"S\",C100=0),0,IF(ISERROR(K100),J100,SMALL(J100:K100,1)))","v":3},{"$f":"IF($C100=1,OFFSET(E100,-1,0)+1,OFFSET(E100,-1,0))","v":3},{"$f":"IF($C100=1,0,IF($C100=2,OFFSET(F100,-1,0)+1,OFFSET(F100,-1,0)))","v":2},{"$f":"IF(AND($C100<=2,$C100<>0),0,IF($C100=3,OFFSET(G100,-1,0)+1,OFFSET(G100,-1,0)))","v":0},{"$f":"IF(AND($C100<=3,$C100<>0),0,IF($C100=4,OFFSET(H100,-1,0)+1,OFFSET(H100,-1,0)))","v":0},{"$f":"IF(AND($C100<=4,$C100<>0),0,IF(AND($C100=\"S\",$Y100>0),OFFSET(I100,-1,0)+1,OFFSET(I100,-1,0)))","v":0},{"$f":"IF(OR($C100=\"S\",$C100=0),0,MATCH(0,OFFSET($D100,1,$C100,ROW($C$337)-ROW($C100)),0))","v":93},{"$f":"IF(OR($C100=\"S\",$C100=0),0,MATCH(OFFSET($D100,0,$C100)+1,OFFSET($D100,1,$C100,ROW($C$337)-ROW($C100)),0))","v":3},"","Nível 2","Nível 2","-","SINAPI",null,"SERVIÇO EM TERRA","-",null,1,"-",null,null,0,0,""]
["S",2,"S",0,3,2,0,0,0,{"$f":"IF(OR($C101=\"S\",$C101=0),0,MATCH(0,OFFSET($D101,1,$C101,ROW($C$337)-ROW($C101)),0))","v":0},{"$f":"IF(OR($C101=\"S\",$C101=0),0,MATCH(OFFSET($D101,0,$C101)+1,OFFSET($D101,1,$C101,ROW($C$337)-ROW($C101)),0))","v":0},"","Serviço","Serviço","-","AGETOP",40101,"ESCAVACAO MANUAL DE VALAS < 1 MTS. (OBRAS CIVIS)","m3    ",7,1,7,null,null,0,0,""]
["S",2,"S",0,3,2,0,0,0,{"$f":"IF(OR($C102=\"S\",$C102=0),0,MATCH(0,OFFSET($D102,1,$C102,ROW($C$337)-ROW($C102)),0))","v":0},{"$f":"IF(OR($C102=\"S\",$C102=0),0,MATCH(OFFSET($D102,0,$C102)+1,OFFSET($D102,1,$C102,ROW($C$337)-ROW($C102)),0))","v":0},"","Serviço","Serviço","-","AGETOP",40902,"REATERRO COM APILOAMENTO","m3    ",7,1,7,null,null,0,0,""]
[2,2,2,88,3,3,0,0,0,{"$f":"IF(OR($C103=\"S\",$C103=0),0,MATCH(0,OFFSET($D103,1,$C103,ROW($C$337)-ROW($C103)),0))","v":90},{"$f":"IF(OR($C103=\"S\",$C103=0),0,MATCH(OFFSET($D103,0,$C103)+1,OFFSET($D103,1,$C103,ROW($C$337)-ROW($C103)),0))","v":88},"","Nível 2","Nível 2","-","SINAPI",null,"INSTALAÇÕES HIDROSSANITÁRIAS","-",null,1,"-",null,null,0,0,""]
[3,{"$f":"IF(OR(C104=\"s\",C104=0),OFFSET(B104,-1,0),C104)","v":3},{"$f":"IF(OFFSET(C104,-1,0)=\"L\",1,IF(OFFSET(C104,-1,0)=1,2,IF(OR(A104=\"s\",A104=0),\"S\",IF(AND(OFFSET(C104,-1,0)=2,A104=4),3,IF(AND(OR(OFFSET(C104,-1,0)=\"s\",OFFSET(C104,-1,0)=0),A104<>\"s\",A104>OFFSET(B104,-1,0)),OFFSET(B104,-1,0),A104)))))","v":3},{"$f":"IF(OR(C104=\"S\",C104=0),0,IF(ISERROR(K104),J104,SMALL(J104:K104,1)))","v":20},{"$f":"IF($C104=1,OFFSET(E104,-1,0)+1,OFFSET(E104,-1,0))","v":3},{"$f":"IF($C104=1,0,IF($C104=2,OFFSET(F104,-1,0)+1,OFFSET(F104,-1,0)))","v":3},{"$f":"IF(AND($C104<=2,$C104<>0),0,IF($C104=3,OFFSET(G104,-1,0)+1,OFFSET(G104,-1,0)))","v":1},{"$f":"IF(AND($C104<=3,$C104<>0),0,IF($C104=4,OFFSET(H104,-1,0)+1,OFFSET(H104,-1,0)))","v":0},{"$f":"IF(AND($C104<=4,$C104<>0),0,IF(AND($C104=\"S\",$Y104>0),OFFSET(I104,-1,0)+1,OFFSET(I104,-1,0)))","v":0},{"$f":"IF(OR($C104=\"S\",$C104=0),0,MATCH(0,OFFSET($D104,1,$C104,ROW($C$337)-ROW($C104)),0))","v":87},{"$f":"IF(OR($C104=\"S\",$C104=0),0,MATCH(OFFSET($D104,0,$C104)+1,OFFSET($D104,1,$C104,ROW($C$337)-ROW($C104)),0))","v":20},"","Nível 3","Nível 3","-","SINAPI",null,"PEÇAS E ACESSÓRIOS","-",null,1,"-",null,null,0,0,""]
[4,4,4,7,3,3,1,1,0,{"$f":"IF(OR($C105=\"S\",$C105=0),0,MATCH(0,OFFSET($D105,1,$C105,ROW($C$337)-ROW($C105)),0))","v":19},{"$f":"IF(OR($C105=\"S\",$C105=0),0,MATCH(OFFSET($D105,0,$C105)+1,OFFSET($D105,1,$C105,ROW($C$337)-ROW($C105)),0))","v":7},"","Nível 4","Nível 4","-","SINAPI",null,"VASO SANITÁRIO E ACESSÓRIOS","-",null,1,"-",null,null,0,0,""]
["S",4,"S",0,3,3,1,1,0,{"$f":"IF(OR($C106=\"S\",$C106=0),0,MATCH(0,OFFSET($D106,1,$C106,ROW($C$337)-ROW($C106)),0))","v":0},{"$f":"IF(OR($C106=\"S\",$C106=0),0,MATCH(OFFSET($D106,0,$C106)+1,OFFSET($D106,1,$C106,ROW($C$337)-ROW($C106)),0))","v":0},"","Serviço","Serviço","-","AGETOP",80502,"VASO SANITARIO","Un    ",4,1,4,null,null,0,0,""]
["S",4,"S",0,3,3,1,1,0,{"$f":"IF(OR($C107=\"S\",$C107=0),0,MATCH(0,OFFSET($D107,1,$C107,ROW($C$337)-ROW($C107)),0))","v":0},{"$f":"IF(OR($C107=\"S\",$C107=0),0,MATCH(OFFSET($D107,0,$C107)+1,OFFSET($D107,1,$C107,ROW($C$337)-ROW($C107)),0))","v":0},"","Serviço","Serviço","-","AGETOP",80515,"VÁLVULA DE DESCARGA DUPLO ACIONAMENTO COM ACABAMENTO CROMADO ","Un    ",12,1,12,null,null,0,0,""]
["S",4,"S",0,3,3,1,1,0,{"$f":"IF(OR($C108=\"S\",$C108=0),0,MATCH(0,OFFSET($D108,1,$C108,ROW($C$337)-ROW($C108)),0))","v":0},{"$f":"IF(OR($C108=\"S\",$C108=0),0,MATCH(OFFSET($D108,0,$C108)+1,OFFSET($D108,1,$C108,ROW($C$337)-ROW($C108)),0))","v":0},"","Serviço","Serviço","-","AGETOP",80520,"CONJUNTO DE FIXACAO P/VASO SANITARIO (PAR)","CJ    ",16,1,16,null,null,0,0,""]
["S",4,"S",0,3,3,1,1,0,{"$f":"IF(OR($C109=\"S\",$C109=0),0,MATCH(0,OFFSET($D109,1,$C109,ROW($C$337)-ROW($C109)),0))","v":0},{"$f":"IF(OR($C109=\"S\",$C109=0),0,MATCH(OFFSET($D109,0,$C109)+1,OFFSET($D109,1,$C109,ROW($C$337)-ROW($C109)),0))","v":0},"","Serviço","Serviço","-","AGETOP",80510,"ANEL DE VEDAÇÃO PARA VASO SANITÁRIO","Un    ",16,1,16,null,null,0,0,""]
["S",4,"S",0,3,3,1,1,0,{"$f":"IF(OR($C110=\"S\",$C110=0),0,MATCH(0,OFFSET($D110,1,$C110,ROW($C$337)-ROW($C110)),0))","v":0},{"$f":"IF(OR($C110=\"S\",$C110=0),0,MATCH(OFFSET($D110,0,$C110)+1,OFFSET($D110,1,$C110,ROW($C$337)-ROW($C110)),0))","v":0},"","Serviço","Serviço","-","AGETOP",80526,"ASSENTO EM POLIPROPILENO COM SISTEMA DE FECHAMENTO SUAVE PARA VASO SANITÁRIO","Un    ",16,1,16,null,null,0,0,""]
["S",4,"S",0,3,3,1,1,0,{"$f":"IF(OR($C111=\"S\",$C111=0),0,MATCH(0,OFFSET($D111,1,$C111,ROW($C$337)-ROW($C111)),0))","v":0},{"$f":"IF(OR($C111=\"S\",$C111=0),0,MATCH(OFFSET($D111,0,$C111)+1,OFFSET($D111,1,$C111,ROW($C$337)-ROW($C111)),0))","v":0},"","Serviço","Serviço","-","SINAPI",95544,"PAPELEIRA DE PAREDE EM METAL CROMADO SEM TAMPA, INCLUSO FIXAÇÃO. AF_01/2020","UN",16,1,16,null,null,0,0,""]
[{"$f":"CHOOSE(1+LOG(1+2*(ORÇAMENTO.Nivel=\"Nível 1\")+4*(ORÇAMENTO.Nivel=\"Nível 2\")+8*(ORÇAMENTO.Nivel=\"Nível 3\")+16*(ORÇAMENTO.Nivel=\"Nível 4\")+32*(ORÇAMENTO.Nivel=\"Serviço\"),2),0,1,2,3,4,\"S\")","v":4},4,4,2,3,3,1,2,0,{"$f":"IF(OR($C112=\"S\",$C112=0),0,MATCH(0,OFFSET($D112,1,$C112,ROW($C$337)-ROW($C112)),0))","v":12},{"$f":"IF(OR($C112=\"S\",$C112=0),0,MATCH(OFFSET($D112,0,$C112)+1,OFFSET($D112,1,$C112,ROW($C$337)-ROW($C112)),0))","v":2},"","Nível 4","Nível 4","-","SINAPI",null,"VASO SANITÁRIO COM REAPROVEITAMENTO","-",null,1,"-",null,null,0,0,""]
[{"$f":"CHOOSE(1+LOG(1+2*(ORÇAMENTO.Nivel=\"Nível 1\")+4*(ORÇAMENTO.Nivel=\"Nível 2\")+8*(ORÇAMENTO.Nivel=\"Nível 3\")+16*(ORÇAMENTO.Nivel=\"Nível 4\")+32*(ORÇAMENTO.Nivel=\"Serviço\"),2),0,1,2,3,4,\"S\")","v":"S"},4,"S",0,3,3,1,2,0,{"$f":"IF(OR($C113=\"S\",$C113=0),0,MATCH(0,OFFSET($D113,1,$C113,ROW($C$337)-ROW($C113)),0))","v":0},{"$f":"IF(OR($C113=\"S\",$C113=0),0,MATCH(OFFSET($D113,0,$C113)+1,OFFSET($D113,1,$C113,ROW($C$337)-ROW($C113)),0))","v":0},"","Serviço","Serviço","-","AGETOP",80502,"VASO SANITARIO","Un    ",12,1,12,null,null,0,0,""]
[4,4,4,8,3,3,1,3,0,{"$f":"IF(OR($C114=\"S\",$C114=0),0,MATCH(0,OFFSET($D114,1,$C114,ROW($C$337)-ROW($C114)),0))","v":10},{"$f":"IF(OR($C114=\"S\",$C114=0),0,MATCH(OFFSET($D114,0,$C114)+1,OFFSET($D114,1,$C114,ROW($C$337)-ROW($C114)),0))","v":8},"","Nível 4","Nível 4","-","SINAPI",null,"LAVATÓRIO E ACESSÓRIOS","-",null,1,"-",null,null,0,0,""]
["S",4,"S",0,3,3,1,3,0,{"$f":"IF(OR($C115=\"S\",$C115=0),0,MATCH(0,OFFSET($D115,1,$C115,ROW($C$337)-ROW($C115)),0))","v":0},{"$f":"IF(OR($C115=\"S\",$C115=0),0,MATCH(OFFSET($D115,0,$C115)+1,OFFSET($D115,1,$C115,ROW($C$337)-ROW($C115)),0))","v":0},"","Serviço","Serviço","-","AGETOP",80541,"LAVATÓRIO MÉDIO COM COLUNA","Un    ",4,1,4,null,null,0,0,""]
["S",4,"S",0,3,3,1,3,0,{"$f":"IF(OR($C116=\"S\",$C116=0),0,MATCH(0,OFFSET($D116,1,$C116,ROW($C$337)-ROW($C116)),0))","v":0},{"$f":"IF(OR($C116=\"S\",$C116=0),0,MATCH(OFFSET($D116,0,$C116)+1,OFFSET($D116,1,$C116,ROW($C$337)-ROW($C116)),0))","v":0},"","Serviço","Serviço","-","SINAPI",86904,"LAVATÓRIO LOUÇA BRANCA SUSPENSO, 29,5 X 39CM OU EQUIVALENTE, PADRÃO POPULAR - FORNECIMENTO E INSTALAÇÃO. AF_01/2020","UN",4,1,4,null,null,0,0,""]
["S",4,"S",0,3,3,1,3,0,{"$f":"IF(OR($C117=\"S\",$C117=0),0,MATCH(0,OFFSET($D117,1,$C117,ROW($C$337)-ROW($C117)),0))","v":0},{"$f":"IF(OR($C117=\"S\",$C117=0),0,MATCH(OFFSET($D117,0,$C117)+1,OFFSET($D117,1,$C117,ROW($C$337)-ROW($C117)),0))","v":0},"","Serviço","Serviço","-","AGETOP",80550,"FIXACAO P/LAVATORIO (PAR)","PAR   ",8,1,8,null,null,0,0,""]
["S",4,"S",0,3,3,1,3,0,{"$f":"IF(OR($C118=\"S\",$C118=0),0,MATCH(0,OFFSET($D118,1,$C118,ROW($C$337)-ROW($C118)),0))","v":0},{"$f":"IF(OR($C118=\"S\",$C118=0),0,MATCH(OFFSET($D118,0,$C118)+1,OFFSET($D118,1,$C118,ROW($C$337)-ROW($C118)),0))","v":0},"","Serviço","Serviço","-","AGETOP",80556,"LIGAÇÃO FLEXÍVEL PVC DIAM.1/2\" (ENGATE)","Un    ",8,1,8,null,null,0,0,""]
["S",4,"S",0,3,3,1,3,0,{"$f":"IF(OR($C119=\"S\",$C119=0),0,MATCH(0,OFFSET($D119,1,$C119,ROW($C$337)-ROW($C119)),0))","v":0},{"$f":"IF(OR($C119=\"S\",$C119=0),0,MATCH(OFFSET($D119,0,$C119)+1,OFFSET($D119,1,$C119,ROW($C$337)-ROW($C119)),0))","v":0},"","Serviço","Serviço","-","SINAPI",86883,"SIFÃO DO TIPO FLEXÍVEL EM PVC 1  X 1.1/2  - FORNECIMENTO E INSTALAÇÃO. AF_01/2020","UN",13,1,13,null,null,0,0,""]
["S",4,"S",0,3,3,1,3,0,{"$f":"IF(OR($C120=\"S\",$C120=0),0,MATCH(0,OFFSET($D120,1,$C120,ROW($C$337)-ROW($C120)),0))","v":0},{"$f":"IF(OR($C120=\"S\",$C120=0),0,MATCH(OFFSET($D120,0,$C120)+1,OFFSET($D120,1,$C120,ROW($C$337)-ROW($C120)),0))","v":0},"","Serviço","Serviço","-","AGETOP",80570,"TORNEIRA DE MESA PARA LAVATÓRIO DIÂMETRO DE 1/2\"","Un    ",13,1,13,null,null,0,0,""]
["S",4,"S",0,3,3,1,3,0,{"$f":"IF(OR($C121=\"S\",$C121=0),0,MATCH(0,OFFSET($D121,1,$C121,ROW($C$337)-ROW($C121)),0))","v":0},{"$f":"IF(OR($C121=\"S\",$C121=0),0,MATCH(OFFSET($D121,0,$C121)+1,OFFSET($D121,1,$C121,ROW($C$337)-ROW($C121)),0))","v":0},"","Serviço","Serviço","-","AGETOP",80580,"VALVULA P/LAVATORIO OU BEBEDOURO METALICO DIAMETRO 1\"","Un    ",13,1,13,null,null,0,0,""]
[4,4,4,2,3,3,1,4,0,{"$f":"IF(OR($C122=\"S\",$C122=0),0,MATCH(0,OFFSET($D122,1,$C122,ROW($C$337)-ROW($C122)),0))","v":2},{"$f":"IF(OR($C122=\"S\",$C122=0),0,MATCH(OFFSET($D122,0,$C122)+1,OFFSET($D122,1,$C122,ROW($C$337)-ROW($C122)),0))","v":17},"","Nível 4","Nível 4","-","SINAPI",null,"FILTRO E CHUVEIROS","-",null,1,"-",null,null,0,0,""]
["S",4,"S",0,3,3,1,4,0,{"$f":"IF(OR($C123=\"S\",$C123=0),0,MATCH(0,OFFSET($D123,1,$C123,ROW($C$337)-ROW($C123)),0))","v":0},{"$f":"IF(OR($C123=\"S\",$C123=0),0,MATCH(OFFSET($D123,0,$C123)+1,OFFSET($D123,1,$C123,ROW($C$337)-ROW($C123)),0))","v":0},"","Serviço","Serviço","-","AGETOP",80721,"CHUVEIRO ELÉTRICO EM PVC COM BRAÇO METÁLICO","Un    ",8,1,8,null,null,0,0,""]
[3,3,3,21,3,3,2,0,0,{"$f":"IF(OR($C124=\"S\",$C124=0),0,MATCH(0,OFFSET($D124,1,$C124,ROW($C$337)-ROW($C124)),0))","v":67},{"$f":"IF(OR($C124=\"S\",$C124=0),0,MATCH(OFFSET($D124,0,$C124)+1,OFFSET($D124,1,$C124,ROW($C$337)-ROW($C124)),0))","v":21},"","Nível 3","Nível 3","-","SINAPI",null,"ÁGUA FRIA","-",null,1,"-",null,null,0,0,""]
[4,4,4,3,3,3,2,1,0,{"$f":"IF(OR($C125=\"S\",$C125=0),0,MATCH(0,OFFSET($D125,1,$C125,ROW($C$337)-ROW($C125)),0))","v":20},{"$f":"IF(OR($C125=\"S\",$C125=0),0,MATCH(OFFSET($D125,0,$C125)+1,OFFSET($D125,1,$C125,ROW($C$337)-ROW($C125)),0))","v":3},"","Nível 4","Nível 4","-","SINAPI",null,"TUBOS DE PVC SOLDÁVEL","-",null,1,"-",null,null,0,0,""]
["S",4,"S",0,3,3,2,1,0,{"$f":"IF(OR($C126=\"S\",$C126=0),0,MATCH(0,OFFSET($D126,1,$C126,ROW($C$337)-ROW($C126)),0))","v":0},{"$f":"IF(OR($C126=\"S\",$C126=0),0,MATCH(OFFSET($D126,0,$C126)+1,OFFSET($D126,1,$C126,ROW($C$337)-ROW($C126)),0))","v":0},"","Serviço","Serviço","-","AGETOP",81003,"TUBO SOLDAVEL PVC MARROM DIAMETRO 25 mm","M     ",77,1,77,null,null,0,0,""]
["S",4,"S",0,3,3,2,1,0,{"$f":"IF(OR($C127=\"S\",$C127=0),0,MATCH(0,OFFSET($D127,1,$C127,ROW($C$337)-ROW($C127)),0))","v":0},{"$f":"IF(OR($C127=\"S\",$C127=0),0,MATCH(OFFSET($D127,0,$C127)+1,OFFSET($D127,1,$C127,ROW($C$337)-ROW($C127)),0))","v":0},"","Serviço","Serviço","-","SINAPI",89447,"TUBO, PVC, SOLDÁVEL, DN 32MM, INSTALADO EM PRUMADA DE ÁGUA - FORNECIMENTO E INSTALAÇÃO. AF_12/2014","M",24,1,24,null,null,0,0,""]
[4,4,4,3,3,3,2,2,0,{"$f":"IF(OR($C128=\"S\",$C128=0),0,MATCH(0,OFFSET($D128,1,$C128,ROW($C$337)-ROW($C128)),0))","v":17},{"$f":"IF(OR($C128=\"S\",$C128=0),0,MATCH(OFFSET($D128,0,$C128)+1,OFFSET($D128,1,$C128,ROW($C$337)-ROW($C128)),0))","v":3},"","Nível 4","Nível 4","-","SINAPI",null,"ADAPTADORES DE PVC SOLDÁVEL","-",null,1,"-",null,null,0,0,""]
["S",4,"S",0,3,3,2,2,0,{"$f":"IF(OR($C129=\"S\",$C129=0),0,MATCH(0,OFFSET($D129,1,$C129,ROW($C$337)-ROW($C129)),0))","v":0},{"$f":"IF(OR($C129=\"S\",$C129=0),0,MATCH(OFFSET($D129,0,$C129)+1,OFFSET($D129,1,$C129,ROW($C$337)-ROW($C129)),0))","v":0},"","Serviço","Serviço","-","AGETOP",81041,"ADAPTAD.PVC SOLD.LONGO C/FLANGES LIVRES P/CX.DAGUA 25X3/4\"","Un    ",2,1,2,null,null,0,0,""]
["S",4,"S",0,3,3,2,2,0,{"$f":"IF(OR($C130=\"S\",$C130=0),0,MATCH(0,OFFSET($D130,1,$C130,ROW($C$337)-ROW($C130)),0))","v":0},{"$f":"IF(OR($C130=\"S\",$C130=0),0,MATCH(OFFSET($D130,0,$C130)+1,OFFSET($D130,1,$C130,ROW($C$337)-ROW($C130)),0))","v":0},"","Serviço","Serviço","-","SINAPI",89596,"ADAPTADOR CURTO COM BOLSA E ROSCA PARA REGISTRO, PVC, SOLDÁVEL, DN 50MM X 1.1/2\u0094, INSTALADO EM PRUMADA DE ÁGUA - FORNECIMENTO E INSTALAÇÃO. AF_12/2014","UN",20,1,20,null,null,0,0,"Referência: AGETOP - 81069"]
[4,4,4,3,3,3,2,3,0,{"$f":"IF(OR($C131=\"S\",$C131=0),0,MATCH(0,OFFSET($D131,1,$C131,ROW($C$337)-ROW($C131)),0))","v":14},{"$f":"IF(OR($C131=\"S\",$C131=0),0,MATCH(OFFSET($D131,0,$C131)+1,OFFSET($D131,1,$C131,ROW($C$337)-ROW($C131)),0))","v":3},"","Nível 4","Nível 4","-","SINAPI",null,"LUVAS DE PVC","-",null,1,"-",null,null,0,0,""]
["S",4,"S",0,3,3,2,3,0,{"$f":"IF(OR($C132=\"S\",$C132=0),0,MATCH(0,OFFSET($D132,1,$C132,ROW($C$337)-ROW($C132)),0))","v":0},{"$f":"IF(OR($C132=\"S\",$C132=0),0,MATCH(OFFSET($D132,0,$C132)+1,OFFSET($D132,1,$C132,ROW($C$337)-ROW($C132)),0))","v":0},"","Serviço","Serviço","-","SINAPI",89528,"LUVA, PVC, SOLDÁVEL, DN 25MM, INSTALADO EM PRUMADA DE ÁGUA - FORNECIMENTO E INSTALAÇÃO. AF_12/2014","UN",5,1,5,null,null,0,0,""]
["S",4,"S",0,3,3,2,3,0,{"$f":"IF(OR($C133=\"S\",$C133=0),0,MATCH(0,OFFSET($D133,1,$C133,ROW($C$337)-ROW($C133)),0))","v":0},{"$f":"IF(OR($C133=\"S\",$C133=0),0,MATCH(OFFSET($D133,0,$C133)+1,OFFSET($D133,1,$C133,ROW($C$337)-ROW($C133)),0))","v":0},"","Serviço","Serviço","-","SINAPI",89434,"LUVA SOLDÁVEL E COM ROSCA, PVC, SOLDÁVEL, DN 32MM X 1\u0094, INSTALADO EM RAMAL DE DISTRIBUIÇÃO DE ÁGUA - FORNECIMENTO E INSTALAÇÃO. AF_12/2014","UN",5,1,5,null,null,0,0,""]
[4,{"$f":"IF(OR(C134=\"s\",C134=0),OFFSET(B134,-1,0),C134)","v":4},{"$f":"IF(OFFSET(C134,-1,0)=\"L\",1,IF(OFFSET(C134,-1,0)=1,2,IF(OR(A134=\"s\",A134=0),\"S\",IF(AND(OFFSET(C134,-1,0)=2,A134=4),3,IF(AND(OR(OFFSET(C134,-1,0)=\"s\",OFFSET(C134,-1,0)=0),A134<>\"s\",A134>OFFSET(B134,-1,0)),OFFSET(B134,-1,0),A134)))))","v":4},{"$f":"IF(OR(C134=\"S\",C134=0),0,IF(ISERROR(K134),J134,SMALL(J134:K134,1)))","v":5},{"$f":"IF($C134=1,OFFSET(E134,-1,0)+1,OFFSET(E134,-1,0))","v":3},{"$f":"IF($C134=1,0,IF($C134=2,OFFSET(F134,-1,0)+1,OFFSET(F134,-1,0)))","v":3},{"$f":"IF(AND($C134<=2,$C134<>0),0,IF($C134=3,OFFSET(G134,-1,0)+1,OFFSET(G134,-1,0)))","v":2},{"$f":"IF(AND($C134<=3,$C134<>0),0,IF($C134=4,OFFSET(H134,-1,0)+1,OFFSET(H134,-1,0)))","v":4},{"$f":"IF(AND($C134<=4,$C134<>0),0,IF(AND($C134=\"S\",$Y134>0),OFFSET(I134,-1,0)+1,OFFSET(I134,-1,0)))","v":0},{"$f":"IF(OR($C134=\"S\",$C134=0),0,MATCH(0,OFFSET($D134,1,$C134,ROW($C$337)-ROW($C134)),0))","v":11},{"$f":"IF(OR($C134=\"S\",$C134=0),0,MATCH(OFFSET($D134,0,$C134)+1,OFFSET($D134,1,$C134,ROW($C$337)-ROW($C134)),0))","v":5},"","Nível 4","Nível 4","-","SINAPI",null,"JOELHO","-",null,1,"-",null,null,0,0,""]
["S",4,"S",0,3,3,2,4,0,{"$f":"IF(OR($C135=\"S\",$C135=0),0,MATCH(0,OFFSET($D135,1,$C135,ROW($C$337)-ROW($C135)),0))","v":0},{"$f":"IF(OR($C135=\"S\",$C135=0),0,MATCH(OFFSET($D135,0,$C135)+1,OFFSET($D135,1,$C135,ROW($C$337)-ROW($C135)),0))","v":0},"","Serviço","Serviço","-","SINAPI",89481,"JOELHO 90 GRAUS, PVC, SOLDÁVEL, DN 25MM, INSTALADO EM PRUMADA DE ÁGUA - FORNECIMENTO E INSTALAÇÃO. AF_12/2014","UN",15,1,15,null,null,0,0,""]
["S",4,"S",0,3,3,2,4,0,{"$f":"IF(OR($C136=\"S\",$C136=0),0,MATCH(0,OFFSET($D136,1,$C136,ROW($C$337)-ROW($C136)),0))","v":0},{"$f":"IF(OR($C136=\"S\",$C136=0),0,MATCH(OFFSET($D136,0,$C136)+1,OFFSET($D136,1,$C136,ROW($C$337)-ROW($C136)),0))","v":0},"","Serviço","Serviço","-","SINAPI",89413,"JOELHO 90 GRAUS, PVC, SOLDÁVEL, DN 32MM, INSTALADO EM RAMAL DE DISTRIBUIÇÃO DE ÁGUA - FORNECIMENTO E INSTALAÇÃO. AF_12/2014","UN",10,1,10,null,null,0,0,""]
["S",4,"S",0,3,3,2,4,0,{"$f":"IF(OR($C137=\"S\",$C137=0),0,MATCH(0,OFFSET($D137,1,$C137,ROW($C$337)-ROW($C137)),0))","v":0},{"$f":"IF(OR($C137=\"S\",$C137=0),0,MATCH(OFFSET($D137,0,$C137)+1,OFFSET($D137,1,$C137,ROW($C$337)-ROW($C137)),0))","v":0},"","Serviço","Serviço","-","SINAPI",89497,"JOELHO 90 GRAUS, PVC, SOLDÁVEL, DN 40MM, INSTALADO EM PRUMADA DE ÁGUA - FORNECIMENTO E INSTALAÇÃO. AF_12/2014","UN",5,1,5,null,null,0,0,""]
["S",4,"S",0,3,3,2,4,0,{"$f":"IF(OR($C138=\"S\",$C138=0),0,MATCH(0,OFFSET($D138,1,$C138,ROW($C$337)-ROW($C138)),0))","v":0},{"$f":"IF(OR($C138=\"S\",$C138=0),0,MATCH(OFFSET($D138,0,$C138)+1,OFFSET($D138,1,$C138,ROW($C$337)-ROW($C138)),0))","v":0},"","Serviço","Serviço","-","SINAPI",89501,"JOELHO 90 GRAUS, PVC, SOLDÁVEL, DN 50MM, INSTALADO EM PRUMADA DE ÁGUA - FORNECIMENTO E INSTALAÇÃO. AF_12/2014","UN",5,1,5,null,null,0,0,""]
[4,4,4,3,3,3,2,5,0,{"$f":"IF(OR($C139=\"S\",$C139=0),0,MATCH(0,OFFSET($D139,1,$C139,ROW($C$337)-ROW($C139)),0))","v":6},{"$f":"IF(OR($C139=\"S\",$C139=0),0,MATCH(OFFSET($D139,0,$C139)+1,OFFSET($D139,1,$C139,ROW($C$337)-ROW($C139)),0))","v":3},"","Nível 4","Nível 4","-","SINAPI",null,"TÊ","-",null,1,"-",null,null,0,0,""]
["S",4,"S",0,3,3,2,5,0,{"$f":"IF(OR($C140=\"S\",$C140=0),0,MATCH(0,OFFSET($D140,1,$C140,ROW($C$337)-ROW($C140)),0))","v":0},{"$f":"IF(OR($C140=\"S\",$C140=0),0,MATCH(OFFSET($D140,0,$C140)+1,OFFSET($D140,1,$C140,ROW($C$337)-ROW($C140)),0))","v":0},"","Serviço","Serviço","-","SINAPI",89617,"TE, PVC, SOLDÁVEL, DN 25MM, INSTALADO EM PRUMADA DE ÁGUA - FORNECIMENTO E INSTALAÇÃO. AF_12/2014","UN",7,1,7,null,null,0,0,""]
["S",4,"S",0,3,3,2,5,0,{"$f":"IF(OR($C141=\"S\",$C141=0),0,MATCH(0,OFFSET($D141,1,$C141,ROW($C$337)-ROW($C141)),0))","v":0},{"$f":"IF(OR($C141=\"S\",$C141=0),0,MATCH(OFFSET($D141,0,$C141)+1,OFFSET($D141,1,$C141,ROW($C$337)-ROW($C141)),0))","v":0},"","Serviço","Serviço","-","SINAPI",89625,"TE, PVC, SOLDÁVEL, DN 50MM, INSTALADO EM PRUMADA DE ÁGUA - FORNECIMENTO E INSTALAÇÃO. AF_12/2014","UN",7,1,7,null,null,0,0,""]
[4,4,4,3,3,3,2,6,0,{"$f":"IF(OR($C142=\"S\",$C142=0),0,MATCH(0,OFFSET($D142,1,$C142,ROW($C$337)-ROW($C142)),0))","v":3},{"$f":"IF(OR($C142=\"S\",$C142=0),0,MATCH(OFFSET($D142,0,$C142)+1,OFFSET($D142,1,$C142,ROW($C$337)-ROW($C142)),0))","v":{"$error":"#N/A"}},"","Nível 4","Nível 4","-","SINAPI",null,"ADESIVOS","-",null,1,"-",null,null,0,0,""]
["S",4,"S",0,3,3,2,6,0,{"$f":"IF(OR($C143=\"S\",$C143=0),0,MATCH(0,OFFSET($D143,1,$C143,ROW($C$337)-ROW($C143)),0))","v":0},{"$f":"IF(OR($C143=\"S\",$C143=0),0,MATCH(OFFSET($D143,0,$C143)+1,OFFSET($D143,1,$C143,ROW($C$337)-ROW($C143)),0))","v":0},"","Serviço","Serviço","-","AGETOP",81501,"ADESIVO PLASTICO - FRASCO 850 G","Un    ",4,1,4,null,null,0,0,""]
["S",4,"S",0,3,3,2,6,0,{"$f":"IF(OR($C144=\"S\",$C144=0),0,MATCH(0,OFFSET($D144,1,$C144,ROW($C$337)-ROW($C144)),0))","v":0},{"$f":"IF(OR($C144=\"S\",$C144=0),0,MATCH(OFFSET($D144,0,$C144)+1,OFFSET($D144,1,$C144,ROW($C$337)-ROW($C144)),0))","v":0},"","Serviço","Serviço","-","AGETOP",81504,"SOLUCAO LIMPADORA 1000 CM3","Un    ",4,1,4,null,null,0,0,""]
[3,3,3,10,3,3,3,0,0,{"$f":"IF(OR($C145=\"S\",$C145=0),0,MATCH(0,OFFSET($D145,1,$C145,ROW($C$337)-ROW($C145)),0))","v":46},{"$f":"IF(OR($C145=\"S\",$C145=0),0,MATCH(OFFSET($D145,0,$C145)+1,OFFSET($D145,1,$C145,ROW($C$337)-ROW($C145)),0))","v":10},"","Nível 3","Nível 3","-","SINAPI",null,"ESGOTO SANITÁRIO","-",null,1,"-",null,null,0,0,""]
[4,4,4,5,3,3,3,1,0,{"$f":"IF(OR($C146=\"S\",$C146=0),0,MATCH(0,OFFSET($D146,1,$C146,ROW($C$337)-ROW($C146)),0))","v":9},{"$f":"IF(OR($C146=\"S\",$C146=0),0,MATCH(OFFSET($D146,0,$C146)+1,OFFSET($D146,1,$C146,ROW($C$337)-ROW($C146)),0))","v":5},"","Nível 4","Nível 4","-","SINAPI",null,"JOELHOS","-",null,1,"-",null,null,0,0,""]
["S",4,"S",0,3,3,3,1,0,{"$f":"IF(OR($C147=\"S\",$C147=0),0,MATCH(0,OFFSET($D147,1,$C147,ROW($C$337)-ROW($C147)),0))","v":0},{"$f":"IF(OR($C147=\"S\",$C147=0),0,MATCH(OFFSET($D147,0,$C147)+1,OFFSET($D147,1,$C147,ROW($C$337)-ROW($C147)),0))","v":0},"","Serviço","Serviço","-","SINAPI",89726,"JOELHO 45 GRAUS, PVC, SERIE NORMAL, ESGOTO PREDIAL, DN 40 MM, JUNTA SOLDÁVEL, FORNECIDO E INSTALADO EM RAMAL DE DESCARGA OU RAMAL DE ESGOTO SANITÁRIO. AF_12/2014","UN",5,1,5,null,null,0,0,""]
["S",4,"S",0,3,3,3,1,0,{"$f":"IF(OR($C148=\"S\",$C148=0),0,MATCH(0,OFFSET($D148,1,$C148,ROW($C$337)-ROW($C148)),0))","v":0},{"$f":"IF(OR($C148=\"S\",$C148=0),0,MATCH(OFFSET($D148,0,$C148)+1,OFFSET($D148,1,$C148,ROW($C$337)-ROW($C148)),0))","v":0},"","Serviço","Serviço","-","SINAPI",89802,"JOELHO 45 GRAUS, PVC, SERIE NORMAL, ESGOTO PREDIAL, DN 50 MM, JUNTA ELÁSTICA, FORNECIDO E INSTALADO EM PRUMADA DE ESGOTO SANITÁRIO OU VENTILAÇÃO. AF_12/2014","UN",5,1,5,null,null,0,0,""]
["S",4,"S",0,3,3,3,1,0,{"$f":"IF(OR($C149=\"S\",$C149=0),0,MATCH(0,OFFSET($D149,1,$C149,ROW($C$337)-ROW($C149)),0))","v":0},{"$f":"IF(OR($C149=\"S\",$C149=0),0,MATCH(OFFSET($D149,0,$C149)+1,OFFSET($D149,1,$C149,ROW($C$337)-ROW($C149)),0))","v":0},"","Serviço","Serviço","-","SINAPI",89806,"JOELHO 45 GRAUS, PVC, SERIE NORMAL, ESGOTO PREDIAL, DN 75 MM, JUNTA ELÁSTICA, FORNECIDO E INSTALADO EM PRUMADA DE ESGOTO SANITÁRIO OU VENTILAÇÃO. AF_12/2014","UN",5,1,5,null,null,0,0,""]
["S",4,"S",0,3,3,3,1,0,{"$f":"IF(OR($C150=\"S\",$C150=0),0,MATCH(0,OFFSET($D150,1,$C150,ROW($C$337)-ROW($C150)),0))","v":0},{"$f":"IF(OR($C150=\"S\",$C150=0),0,MATCH(OFFSET($D150,0,$C150)+1,OFFSET($D150,1,$C150,ROW($C$337)-ROW($C150)),0))","v":0},"","Serviço","Serviço","-","SINAPI",89810,"JOELHO 45 GRAUS, PVC, SERIE NORMAL, ESGOTO PREDIAL, DN 100 MM, JUNTA ELÁSTICA, FORNECIDO E INSTALADO EM PRUMADA DE ESGOTO SANITÁRIO OU VENTILAÇÃO. AF_12/2014","UN",2,1,2,null,null,0,0,""]
[4,4,4,4,3,3,3,2,0,{"$f":"IF(OR($C151=\"S\",$C151=0),0,MATCH(0,OFFSET($D151,1,$C151,ROW($C$337)-ROW($C151)),0))","v":4},{"$f":"IF(OR($C151=\"S\",$C151=0),0,MATCH(OFFSET($D151,0,$C151)+1,OFFSET($D151,1,$C151,ROW($C$337)-ROW($C151)),0))","v":{"$error":"#N/A"}},"","Nível 4","Nível 4","-","SINAPI",null,"TUBOS","-",null,1,"-",null,null,0,0,""]
["S",4,"S",0,3,3,3,2,0,{"$f":"IF(OR($C152=\"S\",$C152=0),0,MATCH(0,OFFSET($D152,1,$C152,ROW($C$337)-ROW($C152)),0))","v":0},{"$f":"IF(OR($C152=\"S\",$C152=0),0,MATCH(OFFSET($D152,0,$C152)+1,OFFSET($D152,1,$C152,ROW($C$337)-ROW($C152)),0))","v":0},"","Serviço","Serviço","-","SINAPI",89798,"TUBO PVC, SERIE NORMAL, ESGOTO PREDIAL, DN 50 MM, FORNECIDO E INSTALADO EM PRUMADA DE ESGOTO SANITÁRIO OU VENTILAÇÃO. AF_12/2014","M",12,1,12,null,null,0,0,""]
["S",4,"S",0,3,3,3,2,0,{"$f":"IF(OR($C153=\"S\",$C153=0),0,MATCH(0,OFFSET($D153,1,$C153,ROW($C$337)-ROW($C153)),0))","v":0},{"$f":"IF(OR($C153=\"S\",$C153=0),0,MATCH(OFFSET($D153,0,$C153)+1,OFFSET($D153,1,$C153,ROW($C$337)-ROW($C153)),0))","v":0},"","Serviço","Serviço","-","SINAPI",89799,"TUBO PVC, SERIE NORMAL, ESGOTO PREDIAL, DN 75 MM, FORNECIDO E INSTALADO EM PRUMADA DE ESGOTO SANITÁRIO OU VENTILAÇÃO. AF_12/2014","M",6,1,6,null,null,0,0,""]
["S",4,"S",0,3,3,3,2,0,{"$f":"IF(OR($C154=\"S\",$C154=0),0,MATCH(0,OFFSET($D154,1,$C154,ROW($C$337)-ROW($C154)),0))","v":0},{"$f":"IF(OR($C154=\"S\",$C154=0),0,MATCH(OFFSET($D154,0,$C154)+1,OFFSET($D154,1,$C154,ROW($C$337)-ROW($C154)),0))","v":0},"","Serviço","Serviço","-","SINAPI",89800,"TUBO PVC, SERIE NORMAL, ESGOTO PREDIAL, DN 100 MM, FORNECIDO E INSTALADO EM PRUMADA DE ESGOTO SANITÁRIO OU VENTILAÇÃO. AF_12/2014","M",12,1,12,null,null,0,0,""]
[3,3,3,3,3,3,4,0,0,{"$f":"IF(OR($C155=\"S\",$C155=0),0,MATCH(0,OFFSET($D155,1,$C155,ROW($C$337)-ROW($C155)),0))","v":36},{"$f":"IF(OR($C155=\"S\",$C155=0),0,MATCH(OFFSET($D155,0,$C155)+1,OFFSET($D155,1,$C155,ROW($C$337)-ROW($C155)),0))","v":3},"","Nível 3","Nível 3","-","SINAPI",null,"OUTROS","-",null,1,"-",null,null,0,0,""]
["S",3,"S",0,3,3,4,0,0,{"$f":"IF(OR($C156=\"S\",$C156=0),0,MATCH(0,OFFSET($D156,1,$C156,ROW($C$337)-ROW($C156)),0))","v":0},{"$f":"IF(OR($C156=\"S\",$C156=0),0,MATCH(OFFSET($D156,0,$C156)+1,OFFSET($D156,1,$C156,ROW($C$337)-ROW($C156)),0))","v":0},"","Serviço","Serviço","-","AGETOP",81815,"KIT CAVALETE D=25MM P/HIDRÔMETRO 1,5-3,0-5,0 M3/MURETA/CAIXA","Un    ",1,1,1,null,null,0,0,""]
["S",3,"S",0,3,3,4,0,0,{"$f":"IF(OR($C157=\"S\",$C157=0),0,MATCH(0,OFFSET($D157,1,$C157,ROW($C$337)-ROW($C157)),0))","v":0},{"$f":"IF(OR($C157=\"S\",$C157=0),0,MATCH(OFFSET($D157,0,$C157)+1,OFFSET($D157,1,$C157,ROW($C$337)-ROW($C157)),0))","v":0},"","Serviço","Serviço","-","SINAPI",94797,"TORNEIRA DE BOIA, ROSCÁVEL, 1\u0094, FORNECIDA E INSTALADA EM RESERVAÇÃO DE ÁGUA. AF_06/2016","UN",1,1,1,null,null,0,0,""]
[3,3,3,33,3,3,5,0,0,{"$f":"IF(OR($C158=\"S\",$C158=0),0,MATCH(0,OFFSET($D158,1,$C158,ROW($C$337)-ROW($C158)),0))","v":33},{"$f":"IF(OR($C158=\"S\",$C158=0),0,MATCH(OFFSET($D158,0,$C158)+1,OFFSET($D158,1,$C158,ROW($C$337)-ROW($C158)),0))","v":{"$error":"#N/A"}},"","Nível 3","Nível 3","-","SINAPI",null,"PREVENÇÃO E COMBATE A INCÊNDIO","-",null,1,"-",null,null,0,0,""]
[{"$f":"CHOOSE(1+LOG(1+2*(ORÇAMENTO.Nivel=\"Nível 1\")+4*(ORÇAMENTO.Nivel=\"Nível 2\")+8*(ORÇAMENTO.Nivel=\"Nível 3\")+16*(ORÇAMENTO.Nivel=\"Nível 4\")+32*(ORÇAMENTO.Nivel=\"Serviço\"),2),0,1,2,3,4,\"S\")","v":"S"},3,"S",0,3,3,5,0,0,{"$f":"IF(OR($C159=\"S\",$C159=0),0,MATCH(0,OFFSET($D159,1,$C159,ROW($C$337)-ROW($C159)),0))","v":0},{"$f":"IF(OR($C159=\"S\",$C159=0),0,MATCH(OFFSET($D159,0,$C159)+1,OFFSET($D159,1,$C159,ROW($C$337)-ROW($C159)),0))","v":0},"","Serviço","Serviço","-","AGETOP",81889,"TORNEIRA BOIA DIAMETRO 1\" (25 MM )","Un    ",1,1,1,null,null,0,0,""]
["S",3,"S",0,3,3,5,0,0,{"$f":"IF(OR($C160=\"S\",$C160=0),0,MATCH(0,OFFSET($D160,1,$C160,ROW($C$337)-ROW($C160)),0))","v":0},{"$f":"IF(OR($C160=\"S\",$C160=0),0,MATCH(OFFSET($D160,0,$C160)+1,OFFSET($D160,1,$C160,ROW($C$337)-ROW($C160)),0))","v":0},"","Serviço","Serviço","-","AGETOP",82379,"TUBO FERRO GALVANIZADO DIAM.2.1/2\"","m     ",70,1,70,null,null,0,0,""]
["S",3,"S",0,3,3,5,0,0,{"$f":"IF(OR($C161=\"S\",$C161=0),0,MATCH(0,OFFSET($D161,1,$C161,ROW($C$337)-ROW($C161)),0))","v":0},{"$f":"IF(OR($C161=\"S\",$C161=0),0,MATCH(OFFSET($D161,0,$C161)+1,OFFSET($D161,1,$C161,ROW($C$337)-ROW($C161)),0))","v":0},"","Serviço","Serviço","-","AGETOP",85015,"CAIXA DE PASSEIO C/TAMPA DE FERRO FUNDIDO 40X60 CM P/INCÊNDIO","Un    ",1,1,1,null,null,0,0,""]
["S",3,"S",0,3,3,5,0,0,{"$f":"IF(OR($C162=\"S\",$C162=0),0,MATCH(0,OFFSET($D162,1,$C162,ROW($C$337)-ROW($C162)),0))","v":0},{"$f":"IF(OR($C162=\"S\",$C162=0),0,MATCH(OFFSET($D162,0,$C162)+1,OFFSET($D162,1,$C162,ROW($C$337)-ROW($C162)),0))","v":0},"","Serviço","Serviço","-","AGETOP",81003,"TUBO SOLDAVEL PVC MARROM DIAMETRO 25 mm","M     ",24,1,24,null,null,0,0,""]
["S",3,"S",0,3,3,5,0,0,{"$f":"IF(OR($C163=\"S\",$C163=0),0,MATCH(0,OFFSET($D163,1,$C163,ROW($C$337)-ROW($C163)),0))","v":0},{"$f":"IF(OR($C163=\"S\",$C163=0),0,MATCH(OFFSET($D163,0,$C163)+1,OFFSET($D163,1,$C163,ROW($C$337)-ROW($C163)),0))","v":0},"","Serviço","Serviço","-","AGETOP",81321,"JOELHO 90 GRAUS SOLDAVEL DIAMETRO 25 MM","Un    ",10,1,10,null,null,0,0,""]
["S",3,"S",0,3,3,5,0,0,{"$f":"IF(OR($C164=\"S\",$C164=0),0,MATCH(0,OFFSET($D164,1,$C164,ROW($C$337)-ROW($C164)),0))","v":0},{"$f":"IF(OR($C164=\"S\",$C164=0),0,MATCH(OFFSET($D164,0,$C164)+1,OFFSET($D164,1,$C164,ROW($C$337)-ROW($C164)),0))","v":0},"","Serviço","Serviço","-","AGETOP",85003,"EXTINTOR PO QUIMICO SECO (6 KG) - CAPACIDADE EXTINTORA 20 BC","Un    ",2,1,2,null,null,0,0,""]
["S",3,"S",0,3,3,5,0,0,{"$f":"IF(OR($C165=\"S\",$C165=0),0,MATCH(0,OFFSET($D165,1,$C165,ROW($C$337)-ROW($C165)),0))","v":0},{"$f":"IF(OR($C165=\"S\",$C165=0),0,MATCH(OFFSET($D165,0,$C165)+1,OFFSET($D165,1,$C165,ROW($C$337)-ROW($C165)),0))","v":0},"","Serviço","Serviço","-","AGETOP",85006,"EXTINTOR MULTI USO EM PO A B C (6 KG) - CAPACIDADE EXTINTORA 3A 20BC","un    ",10,1,10,null,null,0,0,""]
["S",3,"S",0,3,3,5,0,0,{"$f":"IF(OR($C166=\"S\",$C166=0),0,MATCH(0,OFFSET($D166,1,$C166,ROW($C$337)-ROW($C166)),0))","v":0},{"$f":"IF(OR($C166=\"S\",$C166=0),0,MATCH(OFFSET($D166,0,$C166)+1,OFFSET($D166,1,$C166,ROW($C$337)-ROW($C166)),0))","v":0},"","Serviço","Serviço","-","AGETOP",85011,"CAIXA DE INCÊNDIO METÁLICA COM SUPORTE PARA MANGUEIRA, TAMPA E MURETA 17X60X90 CM C/PINTURA","Un    ",1,1,1,null,null,0,0,""]
["S",3,"S",0,3,3,5,0,0,{"$f":"IF(OR($C167=\"S\",$C167=0),0,MATCH(0,OFFSET($D167,1,$C167,ROW($C$337)-ROW($C167)),0))","v":0},{"$f":"IF(OR($C167=\"S\",$C167=0),0,MATCH(OFFSET($D167,0,$C167)+1,OFFSET($D167,1,$C167,ROW($C$337)-ROW($C167)),0))","v":0},"","Serviço","Serviço","-","AGETOP",85017,"MANGUEIRA DE INCÊNDIO D.I. = 38 MM TIPO 2 COMP. = 15 M","CJ    ",2,1,2,null,null,0,0,""]
["S",3,"S",0,3,3,5,0,0,{"$f":"IF(OR($C168=\"S\",$C168=0),0,MATCH(0,OFFSET($D168,1,$C168,ROW($C$337)-ROW($C168)),0))","v":0},{"$f":"IF(OR($C168=\"S\",$C168=0),0,MATCH(OFFSET($D168,0,$C168)+1,OFFSET($D168,1,$C168,ROW($C$337)-ROW($C168)),0))","v":0},"","Serviço","Serviço","-","AGETOP",85025,"ESGUICHO REGULÁVEL 1.1/2\"","Un    ",1,1,1,null,null,0,0,""]
["S",3,"S",0,3,3,5,0,0,{"$f":"IF(OR($C169=\"S\",$C169=0),0,MATCH(0,OFFSET($D169,1,$C169,ROW($C$337)-ROW($C169)),0))","v":0},{"$f":"IF(OR($C169=\"S\",$C169=0),0,MATCH(OFFSET($D169,0,$C169)+1,OFFSET($D169,1,$C169,ROW($C$337)-ROW($C169)),0))","v":0},"","Serviço","Serviço","-","AGETOP",85027,"ADAPTADOR P/ENGATE STORZ 2.1/2\" X 1.1/2\"","Un    ",1,1,1,null,null,0,0,""]
["S",3,"S",0,3,3,5,0,0,{"$f":"IF(OR($C170=\"S\",$C170=0),0,MATCH(0,OFFSET($D170,1,$C170,ROW($C$337)-ROW($C170)),0))","v":0},{"$f":"IF(OR($C170=\"S\",$C170=0),0,MATCH(OFFSET($D170,0,$C170)+1,OFFSET($D170,1,$C170,ROW($C$337)-ROW($C170)),0))","v":0},"","Serviço","Serviço","-","AGETOP",85031,"REGISTRO GLOBO ANGULAR 2.1/2\"","Un    ",2,1,2,null,null,0,0,""]
[{"$f":"CHOOSE(1+LOG(1+2*(ORÇAMENTO.Nivel=\"Nível 1\")+4*(ORÇAMENTO.Nivel=\"Nível 2\")+8*(ORÇAMENTO.Nivel=\"Nível 3\")+16*(ORÇAMENTO.Nivel=\"Nível 4\")+32*(ORÇAMENTO.Nivel=\"Serviço\"),2),0,1,2,3,4,\"S\")","v":"S"},{"$f":"IF(OR(C171=\"s\",C171=0),OFFSET(B171,-1,0),C171)","v":3},{"$f":"IF(OFFSET(C171,-1,0)=\"L\",1,IF(OFFSET(C171,-1,0)=1,2,IF(OR(A171=\"s\",A171=0),\"S\",IF(AND(OFFSET(C171,-1,0)=2,A171=4),3,IF(AND(OR(OFFSET(C171,-1,0)=\"s\",OFFSET(C171,-1,0)=0),A171<>\"s\",A171>OFFSET(B171,-1,0)),OFFSET(B171,-1,0),A171)))))","v":"S"},{"$f":"IF(OR(C171=\"S\",C171=0),0,IF(ISERROR(K171),J171,SMALL(J171:K171,1)))","v":0},{"$f":"IF($C171=1,OFFSET(E171,-1,0)+1,OFFSET(E171,-1,0))","v":3},{"$f":"IF($C171=1,0,IF($C171=2,OFFSET(F171,-1,0)+1,OFFSET(F171,-1,0)))","v":3},{"$f":"IF(AND($C171<=2,$C171<>0),0,IF($C171=3,OFFSET(G171,-1,0)+1,OFFSET(G171,-1,0)))","v":5},{"$f":"IF(AND($C171<=3,$C171<>0),0,IF($C171=4,OFFSET(H171,-1,0)+1,OFFSET(H171,-1,0)))","v":0},{"$f":"IF(AND($C171<=4,$C171<>0),0,IF(AND($C171=\"S\",$Y171>0),OFFSET(I171,-1,0)+1,OFFSET(I171,-1,0)))","v":0},{"$f":"IF(OR($C171=\"S\",$C171=0),0,MATCH(0,OFFSET($D171,1,$C171,ROW($C$337)-ROW($C171)),0))","v":0},{"$f":"IF(OR($C171=\"S\",$C171=0),0,MATCH(OFFSET($D171,0,$C171)+1,OFFSET($D171,1,$C171,ROW($C$337)-ROW($C171)),0))","v":0},"","Serviço","Serviço","-","AGETOP",85035,"TAMPÃO CEGO COM CORRENTE 2.1/2\"","Un    ",2,1,2,null,null,0,0,""]
["S",3,"S",0,3,3,5,0,0,{"$f":"IF(OR($C172=\"S\",$C172=0),0,MATCH(0,OFFSET($D172,1,$C172,ROW($C$337)-ROW($C172)),0))","v":0},{"$f":"IF(OR($C172=\"S\",$C172=0),0,MATCH(OFFSET($D172,0,$C172)+1,OFFSET($D172,1,$C172,ROW($C$337)-ROW($C172)),0))","v":0},"","Serviço","Serviço","-","AGETOP",85077,"VÁLVULA DE RETENÇÃO HORIZONTAL 2.1/2\"","Un    ",1,1,1,null,null,0,0,""]
["S",3,"S",0,3,3,5,0,0,{"$f":"IF(OR($C173=\"S\",$C173=0),0,MATCH(0,OFFSET($D173,1,$C173,ROW($C$337)-ROW($C173)),0))","v":0},{"$f":"IF(OR($C173=\"S\",$C173=0),0,MATCH(OFFSET($D173,0,$C173)+1,OFFSET($D173,1,$C173,ROW($C$337)-ROW($C173)),0))","v":0},"","Serviço","Serviço","-","AGETOP",85047,"NIPLE DUPLO FERRO GALVANIZADO 2.1/2\"","Un    ",4,1,4,null,null,0,0,""]
["S",3,"S",0,3,3,5,0,0,{"$f":"IF(OR($C174=\"S\",$C174=0),0,MATCH(0,OFFSET($D174,1,$C174,ROW($C$337)-ROW($C174)),0))","v":0},{"$f":"IF(OR($C174=\"S\",$C174=0),0,MATCH(OFFSET($D174,0,$C174)+1,OFFSET($D174,1,$C174,ROW($C$337)-ROW($C174)),0))","v":0},"","Serviço","Serviço","-","SINAPI",92377,"NIPLE, EM FERRO GALVANIZADO, DN 65 (2 1/2\"), CONEXÃO ROSQUEADA, INSTALADO EM REDE DE ALIMENTAÇÃO PARA HIDRANTE - FORNECIMENTO E INSTALAÇÃO. AF_12/2015","UN",4,1,4,null,null,0,0,""]
["S",3,"S",0,3,3,5,0,0,{"$f":"IF(OR($C175=\"S\",$C175=0),0,MATCH(0,OFFSET($D175,1,$C175,ROW($C$337)-ROW($C175)),0))","v":0},{"$f":"IF(OR($C175=\"S\",$C175=0),0,MATCH(OFFSET($D175,0,$C175)+1,OFFSET($D175,1,$C175,ROW($C$337)-ROW($C175)),0))","v":0},"","Serviço","Serviço","-","COMPOSIÇÃO","COMP 017_SEE","REDUCAO GIRATÓRIA TIPO STORZ LATAO P/ INST. PREDIAL COMBATE A INCENDIO ENGATE RAPIDO 2.1/2\" X 1.1/2\"","UN ",2,1,2,null,null,0,0,""]
["S",3,"S",0,3,3,5,0,0,{"$f":"IF(OR($C176=\"S\",$C176=0),0,MATCH(0,OFFSET($D176,1,$C176,ROW($C$337)-ROW($C176)),0))","v":0},{"$f":"IF(OR($C176=\"S\",$C176=0),0,MATCH(OFFSET($D176,0,$C176)+1,OFFSET($D176,1,$C176,ROW($C$337)-ROW($C176)),0))","v":0},"","Serviço","Serviço","-","COMPOSIÇÃO","COMP 018_SEE","CHAVE DUPLA P/ CONEXÕES TIPO STORZ EM LATÃO ENGATE RÁPIDO 1 1/2\" X 2 1/2\"","UN ",2,1,2,null,null,0,0,""]
["S",3,"S",0,3,3,5,0,0,{"$f":"IF(OR($C177=\"S\",$C177=0),0,MATCH(0,OFFSET($D177,1,$C177,ROW($C$337)-ROW($C177)),0))","v":0},{"$f":"IF(OR($C177=\"S\",$C177=0),0,MATCH(OFFSET($D177,0,$C177)+1,OFFSET($D177,1,$C177,ROW($C$337)-ROW($C177)),0))","v":0},"","Serviço","Serviço","-","COMPOSIÇÃO","COMP 087_SEE","REGISTRO DE GAVETA COM HASTE ASCENDENTE DE BRONZE 2 1/2\"","UN ",2,1,2,null,null,0,0,""]
["S",3,"S",0,3,3,5,0,0,{"$f":"IF(OR($C178=\"S\",$C178=0),0,MATCH(0,OFFSET($D178,1,$C178,ROW($C$337)-ROW($C178)),0))","v":0},{"$f":"IF(OR($C178=\"S\",$C178=0),0,MATCH(OFFSET($D178,0,$C178)+1,OFFSET($D178,1,$C178,ROW($C$337)-ROW($C178)),0))","v":0},"","Serviço","Serviço","-","AGETOP",85056,"TÊ DE FERRO GALVANIZADO 90º X 2 1/2\"","un    ",2,1,2,null,null,0,0,""]
["S",3,"S",0,3,3,5,0,0,{"$f":"IF(OR($C179=\"S\",$C179=0),0,MATCH(0,OFFSET($D179,1,$C179,ROW($C$337)-ROW($C179)),0))","v":0},{"$f":"IF(OR($C179=\"S\",$C179=0),0,MATCH(OFFSET($D179,0,$C179)+1,OFFSET($D179,1,$C179,ROW($C$337)-ROW($C179)),0))","v":0},"","Serviço","Serviço","-","COMPOSIÇÃO","COMP 030_SEE","COTOVELO DE FERRO GALV. 90° X 2 1/2\"","UN ",4,1,4,null,null,0,0,""]
["S",3,"S",0,3,3,5,0,0,{"$f":"IF(OR($C180=\"S\",$C180=0),0,MATCH(0,OFFSET($D180,1,$C180,ROW($C$337)-ROW($C180)),0))","v":0},{"$f":"IF(OR($C180=\"S\",$C180=0),0,MATCH(OFFSET($D180,0,$C180)+1,OFFSET($D180,1,$C180,ROW($C$337)-ROW($C180)),0))","v":0},"","Serviço","Serviço","-","COMPOSIÇÃO","COMP 077_SEE","UNIAO FERRO GALV C/ASSENTO CONICO BRONZE 2 1/2\"","UN ",2,1,2,null,null,0,0,""]
["S",3,"S",0,3,3,5,0,0,{"$f":"IF(OR($C181=\"S\",$C181=0),0,MATCH(0,OFFSET($D181,1,$C181,ROW($C$337)-ROW($C181)),0))","v":0},{"$f":"IF(OR($C181=\"S\",$C181=0),0,MATCH(OFFSET($D181,0,$C181)+1,OFFSET($D181,1,$C181,ROW($C$337)-ROW($C181)),0))","v":0},"","Serviço","Serviço","-","COMPOSIÇÃO","COMP 347_SEE","ADAPTADOR PVC SOLDAVEL, COM FLANGES LIVRES, 75 MM X 2 1/2\", PARA CAIXA D' AGUA","UN ",1,1,1,null,null,0,0,""]
["S",3,"S",0,3,3,5,0,0,{"$f":"IF(OR($C182=\"S\",$C182=0),0,MATCH(0,OFFSET($D182,1,$C182,ROW($C$337)-ROW($C182)),0))","v":0},{"$f":"IF(OR($C182=\"S\",$C182=0),0,MATCH(OFFSET($D182,0,$C182)+1,OFFSET($D182,1,$C182,ROW($C$337)-ROW($C182)),0))","v":0},"","Serviço","Serviço","-","COMPOSIÇÃO","COMP 022_SEE","TAMPÃO FOFO 40X50CM C/INSCRIÇÃO ","UN ",1,1,1,null,null,0,0,""]
["S",3,"S",0,3,3,5,0,0,{"$f":"IF(OR($C183=\"S\",$C183=0),0,MATCH(0,OFFSET($D183,1,$C183,ROW($C$337)-ROW($C183)),0))","v":0},{"$f":"IF(OR($C183=\"S\",$C183=0),0,MATCH(OFFSET($D183,0,$C183)+1,OFFSET($D183,1,$C183,ROW($C$337)-ROW($C183)),0))","v":0},"","Serviço","Serviço","-","COMPOSIÇÃO","COMP 186_SEE","BOTOEIRA BOMBA DE INCÊNDIO C/ MARTELO CONVENCIONAL/ ANALÓGICA","UN ",1,1,1,null,null,0,0,""]
["S",3,"S",0,3,3,5,0,0,{"$f":"IF(OR($C184=\"S\",$C184=0),0,MATCH(0,OFFSET($D184,1,$C184,ROW($C$337)-ROW($C184)),0))","v":0},{"$f":"IF(OR($C184=\"S\",$C184=0),0,MATCH(OFFSET($D184,0,$C184)+1,OFFSET($D184,1,$C184,ROW($C$337)-ROW($C184)),0))","v":0},"","Serviço","Serviço","-","COMPOSIÇÃO","COMP 188_SEE","ACIONADOR MANUAL DE ALARME","UN ",1,1,1,null,null,0,0,""]
["S",3,"S",0,3,3,5,0,0,{"$f":"IF(OR($C185=\"S\",$C185=0),0,MATCH(0,OFFSET($D185,1,$C185,ROW($C$337)-ROW($C185)),0))","v":0},{"$f":"IF(OR($C185=\"S\",$C185=0),0,MATCH(OFFSET($D185,0,$C185)+1,OFFSET($D185,1,$C185,ROW($C$337)-ROW($C185)),0))","v":0},"","Serviço","Serviço","-","COMPOSIÇÃO","COMP 190_SEE","CENTRAL DE DETECÇÃO E ALARME DE 40 SETORES COM BATERIA","UN ",1,1,1,null,null,0,0,""]
["S",3,"S",0,3,3,5,0,0,{"$f":"IF(OR($C186=\"S\",$C186=0),0,MATCH(0,OFFSET($D186,1,$C186,ROW($C$337)-ROW($C186)),0))","v":0},{"$f":"IF(OR($C186=\"S\",$C186=0),0,MATCH(OFFSET($D186,0,$C186)+1,OFFSET($D186,1,$C186,ROW($C$337)-ROW($C186)),0))","v":0},"","Serviço","Serviço","-","SINAPI",97599,"LUMINÁRIA DE EMERGÊNCIA, COM 30 LÂMPADAS LED DE 2 W, SEM REATOR - FORNECIMENTO E INSTALAÇÃO. AF_02/2020","UN",7,1,7,null,null,0,0,""]
["S",3,"S",0,3,3,5,0,0,{"$f":"IF(OR($C187=\"S\",$C187=0),0,MATCH(0,OFFSET($D187,1,$C187,ROW($C$337)-ROW($C187)),0))","v":0},{"$f":"IF(OR($C187=\"S\",$C187=0),0,MATCH(OFFSET($D187,0,$C187)+1,OFFSET($D187,1,$C187,ROW($C$337)-ROW($C187)),0))","v":0},"","Serviço","Serviço","-","COMPOSIÇÃO","COMP 024_SEE","SINALIZADOR FOTOLUMINESCENTE PARA EXTINTOR","UN ",12,1,12,null,null,0,0,""]
["S",3,"S",0,3,3,5,0,0,{"$f":"IF(OR($C188=\"S\",$C188=0),0,MATCH(0,OFFSET($D188,1,$C188,ROW($C$337)-ROW($C188)),0))","v":0},{"$f":"IF(OR($C188=\"S\",$C188=0),0,MATCH(OFFSET($D188,0,$C188)+1,OFFSET($D188,1,$C188,ROW($C$337)-ROW($C188)),0))","v":0},"","Serviço","Serviço","-","COMPOSIÇÃO","COMP 277_SEE","MARCAÇÃO NO PISO - 1X1 M PARA EXTINTOR","M2",12,1,12,null,null,0,0,""]
["S",3,"S",0,3,3,5,0,0,{"$f":"IF(OR($C189=\"S\",$C189=0),0,MATCH(0,OFFSET($D189,1,$C189,ROW($C$337)-ROW($C189)),0))","v":0},{"$f":"IF(OR($C189=\"S\",$C189=0),0,MATCH(OFFSET($D189,0,$C189)+1,OFFSET($D189,1,$C189,ROW($C$337)-ROW($C189)),0))","v":0},"","Serviço","Serviço","-","COMPOSIÇÃO","COMP 235_SEE","PLACA DE SINALIZAÇÃO EM PVC COD 01 - (300X300) PROIBIDO FUMAR","UN ",1,1,1,null,null,0,0,""]
["S",3,"S",0,3,3,5,0,0,{"$f":"IF(OR($C190=\"S\",$C190=0),0,MATCH(0,OFFSET($D190,1,$C190,ROW($C$337)-ROW($C190)),0))","v":0},{"$f":"IF(OR($C190=\"S\",$C190=0),0,MATCH(OFFSET($D190,0,$C190)+1,OFFSET($D190,1,$C190,ROW($C$337)-ROW($C190)),0))","v":0},"","Serviço","Serviço","-","COMPOSIÇÃO","COMP 236_SEE","PLACA DE SINALIZAÇÃO EM PVC COD 06 - (300X300) PERIGO INFLAMÁVEL","UN ",1,1,1,null,null,0,0,""]
[2,2,2,2,3,4,0,0,0,{"$f":"IF(OR($C191=\"S\",$C191=0),0,MATCH(0,OFFSET($D191,1,$C191,ROW($C$337)-ROW($C191)),0))","v":2},{"$f":"IF(OR($C191=\"S\",$C191=0),0,MATCH(OFFSET($D191,0,$C191)+1,OFFSET($D191,1,$C191,ROW($C$337)-ROW($C191)),0))","v":20},"","Nível 2","Nível 2","-","SINAPI",null,"REVESTIMENTO DE PISO","-",null,1,"-",null,null,0,0,""]
["S",2,"S",0,3,4,0,0,0,{"$f":"IF(OR($C192=\"S\",$C192=0),0,MATCH(0,OFFSET($D192,1,$C192,ROW($C$337)-ROW($C192)),0))","v":0},{"$f":"IF(OR($C192=\"S\",$C192=0),0,MATCH(OFFSET($D192,0,$C192)+1,OFFSET($D192,1,$C192,ROW($C$337)-ROW($C192)),0))","v":0},"","Serviço","Serviço","-","AGETOP",220102,"PISO CONCRETO DESEMPENADO ESPESSURA = 5 CM  1:2,5:3,5","m2    ",12.81,1,12.81,null,null,0,0,""]
[1,1,1,3,4,0,0,0,0,{"$f":"IF(OR($C193=\"S\",$C193=0),0,MATCH(0,OFFSET($D193,1,$C193,ROW($C$337)-ROW($C193)),0))","v":144},{"$f":"IF(OR($C193=\"S\",$C193=0),0,MATCH(OFFSET($D193,0,$C193)+1,OFFSET($D193,1,$C193,ROW($C$337)-ROW($C193)),0))","v":3},"F","Nível 1","Nível 1","4.","SINAPI",null,"GRAMA","UN",1,1,1,null,null,0,0,""]
[2,2,2,2,4,1,0,0,0,{"$f":"IF(OR($C194=\"S\",$C194=0),0,MATCH(0,OFFSET($D194,1,$C194,ROW($C$337)-ROW($C194)),0))","v":2},{"$f":"IF(OR($C194=\"S\",$C194=0),0,MATCH(OFFSET($D194,0,$C194)+1,OFFSET($D194,1,$C194,ROW($C$337)-ROW($C194)),0))","v":11},"","Nível 2","Nível 2","-","SINAPI",null,"DIVERSOS","-",null,1,"-",null,null,0,0,""]
["S",2,"S",0,4,1,0,0,0,{"$f":"IF(OR($C195=\"S\",$C195=0),0,MATCH(0,OFFSET($D195,1,$C195,ROW($C$337)-ROW($C195)),0))","v":0},{"$f":"IF(OR($C195=\"S\",$C195=0),0,MATCH(OFFSET($D195,0,$C195)+1,OFFSET($D195,1,$C195,ROW($C$337)-ROW($C195)),0))","v":0},"","Serviço","Serviço","-","SINAPI",98504,"PLANTIO DE GRAMA EM PLACAS. AF_05/2018","M2",344.27,1,344.27,null,null,0,0,""]
[1,1,1,22,5,0,0,0,0,{"$f":"IF(OR($C196=\"S\",$C196=0),0,MATCH(0,OFFSET($D196,1,$C196,ROW($C$337)-ROW($C196)),0))","v":141},{"$f":"IF(OR($C196=\"S\",$C196=0),0,MATCH(OFFSET($D196,0,$C196)+1,OFFSET($D196,1,$C196,ROW($C$337)-ROW($C196)),0))","v":22},"F","Nível 1","Nível 1","5.","SINAPI",null,"ADAPTAÇÃO SANITÁRIO MAS. / FEM. BLOCO 03","UN",1,1,1,null,null,0,0,""]
[2,2,2,8,5,1,0,0,0,{"$f":"IF(OR($C197=\"S\",$C197=0),0,MATCH(0,OFFSET($D197,1,$C197,ROW($C$337)-ROW($C197)),0))","v":21},{"$f":"IF(OR($C197=\"S\",$C197=0),0,MATCH(OFFSET($D197,0,$C197)+1,OFFSET($D197,1,$C197,ROW($C$337)-ROW($C197)),0))","v":8},"","Nível 2","Nível 2","-","SINAPI",null,"SERVIÇOS PRELIMINARES","-",null,1,"-",null,null,0,0,""]
["S",2,"S",0,5,1,0,0,0,{"$f":"IF(OR($C198=\"S\",$C198=0),0,MATCH(0,OFFSET($D198,1,$C198,ROW($C$337)-ROW($C198)),0))","v":0},{"$f":"IF(OR($C198=\"S\",$C198=0),0,MATCH(OFFSET($D198,0,$C198)+1,OFFSET($D198,1,$C198,ROW($C$337)-ROW($C198)),0))","v":0},"","Serviço","Serviço","-","AGETOP",20151,"DEMOL.DIVISÓRIA EM PEDRA/CONC.C/TRANSP.ATE C.B.CARGA","m2    ",15.98,1,15.98,null,null,0,0,""]
["S",2,"S",0,5,1,0,0,0,{"$f":"IF(OR($C199=\"S\",$C199=0),0,MATCH(0,OFFSET($D199,1,$C199,ROW($C$337)-ROW($C199)),0))","v":0},{"$f":"IF(OR($C199=\"S\",$C199=0),0,MATCH(OFFSET($D199,0,$C199)+1,OFFSET($D199,1,$C199,ROW($C$337)-ROW($C199)),0))","v":0},"","Serviço","Serviço","-","AGETOP",20111,"DEM.PISO CERAM.SOBRE LASTRO CONC.C/TR.CB.E CARGA","m2    ",30,1,30,null,null,0,0,""]
["S",2,"S",0,5,1,0,0,0,{"$f":"IF(OR($C200=\"S\",$C200=0),0,MATCH(0,OFFSET($D200,1,$C200,ROW($C$337)-ROW($C200)),0))","v":0},{"$f":"IF(OR($C200=\"S\",$C200=0),0,MATCH(OFFSET($D200,0,$C200)+1,OFFSET($D200,1,$C200,ROW($C$337)-ROW($C200)),0))","v":0},"","Serviço","Serviço","-","AGETOP",20115,"DEMOLIÇÃO DE REVESTIMENTOS COM AZULEJOS C/TRANSP.ATE CB. E CARGA","m2    ",18.72,1,18.72,null,null,0,0,""]
["S",2,"S",0,5,1,0,0,0,{"$f":"IF(OR($C201=\"S\",$C201=0),0,MATCH(0,OFFSET($D201,1,$C201,ROW($C$337)-ROW($C201)),0))","v":0},{"$f":"IF(OR($C201=\"S\",$C201=0),0,MATCH(OFFSET($D201,0,$C201)+1,OFFSET($D201,1,$C201,ROW($C$337)-ROW($C201)),0))","v":0},"","Serviço","Serviço","-","AGETOP",20137,"DEMOLIÇAO BACIA SANITARIA C/ TRANSP. ATÉ CB. E CARGA","Un    ",6,1,6,null,null,0,0,""]
["S",2,"S",0,5,1,0,0,0,{"$f":"IF(OR($C202=\"S\",$C202=0),0,MATCH(0,OFFSET($D202,1,$C202,ROW($C$337)-ROW($C202)),0))","v":0},{"$f":"IF(OR($C202=\"S\",$C202=0),0,MATCH(OFFSET($D202,0,$C202)+1,OFFSET($D202,1,$C202,ROW($C$337)-ROW($C202)),0))","v":0},"","Serviço","Serviço","-","AGETOP",20140,"DEMOLIÇAO DE VÁLVULA DE DESCARGA C/ TRANSP. ATÉ CB. E CARGA","Un    ",3,1,3,null,null,0,0,""]
["S",2,"S",0,5,1,0,0,0,{"$f":"IF(OR($C203=\"S\",$C203=0),0,MATCH(0,OFFSET($D203,1,$C203,ROW($C$337)-ROW($C203)),0))","v":0},{"$f":"IF(OR($C203=\"S\",$C203=0),0,MATCH(OFFSET($D203,0,$C203)+1,OFFSET($D203,1,$C203,ROW($C$337)-ROW($C203)),0))","v":0},"","Serviço","Serviço","-","AGETOP",20163,"DEMOLIÇÃO DAS INSTALAÇÕES HIDROSANITÁRIAS E AFINS C/ TRANSP. ATÉ CB. E CARGA","H     ",2,1,2,null,null,0,0,""]
["S",2,"S",0,5,1,0,0,0,{"$f":"IF(OR($C204=\"S\",$C204=0),0,MATCH(0,OFFSET($D204,1,$C204,ROW($C$337)-ROW($C204)),0))","v":0},{"$f":"IF(OR($C204=\"S\",$C204=0),0,MATCH(OFFSET($D204,0,$C204)+1,OFFSET($D204,1,$C204,ROW($C$337)-ROW($C204)),0))","v":0},"","Serviço","Serviço","-","AGETOP",20106,"RETIRADA DE JANELAS OU PORTAIS C/ TRANSP. ATÉ CB. E CARGA","m2    ",7.56,1,7.56,null,null,0,0,""]
[2,2,2,2,5,2,0,0,0,{"$f":"IF(OR($C205=\"S\",$C205=0),0,MATCH(0,OFFSET($D205,1,$C205,ROW($C$337)-ROW($C205)),0))","v":13},{"$f":"IF(OR($C205=\"S\",$C205=0),0,MATCH(OFFSET($D205,0,$C205)+1,OFFSET($D205,1,$C205,ROW($C$337)-ROW($C205)),0))","v":2},"","Nível 2","Nível 2","-","SINAPI",null,"ALVENARIAS E DIVISÓRIAS","-",null,1,"-",null,null,0,0,""]
["S",2,"S",0,5,2,0,0,0,{"$f":"IF(OR($C206=\"S\",$C206=0),0,MATCH(0,OFFSET($D206,1,$C206,ROW($C$337)-ROW($C206)),0))","v":0},{"$f":"IF(OR($C206=\"S\",$C206=0),0,MATCH(OFFSET($D206,0,$C206)+1,OFFSET($D206,1,$C206,ROW($C$337)-ROW($C206)),0))","v":0},"","Serviço","Serviço","-","AGETOP",100303,"DIVISORIA DE ARDOSIA POLIDA 3 CM","m2    ",15.98,1,15.98,null,null,0,0,""]
[2,2,2,2,5,3,0,0,0,{"$f":"IF(OR($C207=\"S\",$C207=0),0,MATCH(0,OFFSET($D207,1,$C207,ROW($C$337)-ROW($C207)),0))","v":11},{"$f":"IF(OR($C207=\"S\",$C207=0),0,MATCH(OFFSET($D207,0,$C207)+1,OFFSET($D207,1,$C207,ROW($C$337)-ROW($C207)),0))","v":2},"","Nível 2","Nível 2","-","SINAPI",null,"ESQUADRIAS METÁLICAS","-",null,1,"-",null,null,0,0,""]
["S",2,"S",0,5,3,0,0,0,{"$f":"IF(OR($C208=\"S\",$C208=0),0,MATCH(0,OFFSET($D208,1,$C208,ROW($C$337)-ROW($C208)),0))","v":0},{"$f":"IF(OR($C208=\"S\",$C208=0),0,MATCH(OFFSET($D208,0,$C208)+1,OFFSET($D208,1,$C208,ROW($C$337)-ROW($C208)),0))","v":0},"","Serviço","Serviço","-","AGETOP",180509,"PORTA ABRIR CH.P/WC PF-10 C/FERRAGENS","m2    ",7.56,1,7.56,null,null,0,0,""]
[2,2,2,2,5,4,0,0,0,{"$f":"IF(OR($C209=\"S\",$C209=0),0,MATCH(0,OFFSET($D209,1,$C209,ROW($C$337)-ROW($C209)),0))","v":9},{"$f":"IF(OR($C209=\"S\",$C209=0),0,MATCH(OFFSET($D209,0,$C209)+1,OFFSET($D209,1,$C209,ROW($C$337)-ROW($C209)),0))","v":2},"","Nível 2","Nível 2","-","SINAPI",null,"REVESTIMENTO DE PAREDE","-",null,1,"-",null,null,0,0,""]
["S",2,"S",0,5,4,0,0,0,{"$f":"IF(OR($C210=\"S\",$C210=0),0,MATCH(0,OFFSET($D210,1,$C210,ROW($C$337)-ROW($C210)),0))","v":0},{"$f":"IF(OR($C210=\"S\",$C210=0),0,MATCH(OFFSET($D210,0,$C210)+1,OFFSET($D210,1,$C210,ROW($C$337)-ROW($C210)),0))","v":0},"","Serviço","Serviço","-","SINAPI",87273,"REVESTIMENTO CERÂMICO PARA PAREDES INTERNAS COM PLACAS TIPO ESMALTADA EXTRA DE DIMENSÕES 33X45 CM APLICADAS EM AMBIENTES DE ÁREA MAIOR QUE 5 M² NA ALTURA INTEIRA DAS PAREDES. AF_06/2014","M2",18.72,1,18.72,null,null,0,0,""]
[2,2,2,2,5,5,0,0,0,{"$f":"IF(OR($C211=\"S\",$C211=0),0,MATCH(0,OFFSET($D211,1,$C211,ROW($C$337)-ROW($C211)),0))","v":7},{"$f":"IF(OR($C211=\"S\",$C211=0),0,MATCH(OFFSET($D211,0,$C211)+1,OFFSET($D211,1,$C211,ROW($C$337)-ROW($C211)),0))","v":2},"","Nível 2","Nível 2","-",null,null,"REVESTIMENTO DE PISO","-",null,1,"-",null,null,0,0,""]
["S",2,"S",0,5,5,0,0,0,{"$f":"IF(OR($C212=\"S\",$C212=0),0,MATCH(0,OFFSET($D212,1,$C212,ROW($C$337)-ROW($C212)),0))","v":0},{"$f":"IF(OR($C212=\"S\",$C212=0),0,MATCH(OFFSET($D212,0,$C212)+1,OFFSET($D212,1,$C212,ROW($C$337)-ROW($C212)),0))","v":0},"","Serviço","Serviço","-","SINAPI",87251,"REVESTIMENTO CERÂMICO PARA PISO COM PLACAS TIPO ESMALTADA EXTRA DE DIMENSÕES 45X45 CM APLICADA EM AMBIENTES DE ÁREA MAIOR QUE 10 M2. AF_06/2014","M2",30,1,30,null,null,0,0,""]
[2,2,2,3,5,6,0,0,0,{"$f":"IF(OR($C213=\"S\",$C213=0),0,MATCH(0,OFFSET($D213,1,$C213,ROW($C$337)-ROW($C213)),0))","v":5},{"$f":"IF(OR($C213=\"S\",$C213=0),0,MATCH(OFFSET($D213,0,$C213)+1,OFFSET($D213,1,$C213,ROW($C$337)-ROW($C213)),0))","v":3},"","Nível 2","Nível 2","-",null,null,"FERRAGENS","-",null,1,"-",null,null,0,0,""]
["S",2,"S",0,5,6,0,0,0,{"$f":"IF(OR($C214=\"S\",$C214=0),0,MATCH(0,OFFSET($D214,1,$C214,ROW($C$337)-ROW($C214)),0))","v":0},{"$f":"IF(OR($C214=\"S\",$C214=0),0,MATCH(OFFSET($D214,0,$C214)+1,OFFSET($D214,1,$C214,ROW($C$337)-ROW($C214)),0))","v":0},"","Serviço","Serviço","-","AGETOP",230174,"BARRA DE APOIO EM AÇO INOX - 40 CM","un    ",6,1,6,null,null,0,0,""]
["S",2,"S",0,5,6,0,0,0,{"$f":"IF(OR($C215=\"S\",$C215=0),0,MATCH(0,OFFSET($D215,1,$C215,ROW($C$337)-ROW($C215)),0))","v":0},{"$f":"IF(OR($C215=\"S\",$C215=0),0,MATCH(OFFSET($D215,0,$C215)+1,OFFSET($D215,1,$C215,ROW($C$337)-ROW($C215)),0))","v":0},"","Serviço","Serviço","-","AGETOP",230176,"BARRA DE APOIO EM AÇO INOX - 80 CM ","un    ",6,1,6,null,null,0,0,""]
[2,2,2,2,5,7,0,0,0,{"$f":"IF(OR($C216=\"S\",$C216=0),0,MATCH(0,OFFSET($D216,1,$C216,ROW($C$337)-ROW($C216)),0))","v":2},{"$f":"IF(OR($C216=\"S\",$C216=0),0,MATCH(OFFSET($D216,0,$C216)+1,OFFSET($D216,1,$C216,ROW($C$337)-ROW($C216)),0))","v":{"$error":"#N/A"}},"","Nível 2","Nível 2","-","SINAPI",null,"PINTURA","-",null,1,"-",null,null,0,0,""]
["S",2,"S",0,5,7,0,0,0,{"$f":"IF(OR($C217=\"S\",$C217=0),0,MATCH(0,OFFSET($D217,1,$C217,ROW($C$337)-ROW($C217)),0))","v":0},{"$f":"IF(OR($C217=\"S\",$C217=0),0,MATCH(OFFSET($D217,0,$C217)+1,OFFSET($D217,1,$C217,ROW($C$337)-ROW($C217)),0))","v":0},"","Serviço","Serviço","-","AGETOP",261602,"PINT.ESMALTE/ESQUAD.FERRO C/FUNDO ANTICOR.","m2    ",22.68,1,22.68,null,null,0,0,""]
[1,1,1,21,6,0,0,0,0,{"$f":"IF(OR($C218=\"S\",$C218=0),0,MATCH(0,OFFSET($D218,1,$C218,ROW($C$337)-ROW($C218)),0))","v":119},{"$f":"IF(OR($C218=\"S\",$C218=0),0,MATCH(OFFSET($D218,0,$C218)+1,OFFSET($D218,1,$C218,ROW($C$337)-ROW($C218)),0))","v":21},"F","Nível 1","Nível 1","6.","SINAPI",null,"ADAPTAÇÃO SANITÁRIO MAS. / FEM. BLOCO 06","UN",1,1,1,null,null,0,0,""]
[2,2,2,7,6,1,0,0,0,{"$f":"IF(OR($C219=\"S\",$C219=0),0,MATCH(0,OFFSET($D219,1,$C219,ROW($C$337)-ROW($C219)),0))","v":20},{"$f":"IF(OR($C219=\"S\",$C219=0),0,MATCH(OFFSET($D219,0,$C219)+1,OFFSET($D219,1,$C219,ROW($C$337)-ROW($C219)),0))","v":7},"","Nível 2","Nível 2","-","SINAPI",null,"SERVIÇOS PRELIMINARES","-",null,1,"-",null,null,0,0,""]
["S",2,"S",0,6,1,0,0,0,{"$f":"IF(OR($C220=\"S\",$C220=0),0,MATCH(0,OFFSET($D220,1,$C220,ROW($C$337)-ROW($C220)),0))","v":0},{"$f":"IF(OR($C220=\"S\",$C220=0),0,MATCH(OFFSET($D220,0,$C220)+1,OFFSET($D220,1,$C220,ROW($C$337)-ROW($C220)),0))","v":0},"","Serviço","Serviço","-","AGETOP",20151,"DEMOL.DIVISÓRIA EM PEDRA/CONC.C/TRANSP.ATE C.B.CARGA","m2    ",15.98,1,15.98,null,null,0,0,""]
["S",2,"S",0,6,1,0,0,0,{"$f":"IF(OR($C221=\"S\",$C221=0),0,MATCH(0,OFFSET($D221,1,$C221,ROW($C$337)-ROW($C221)),0))","v":0},{"$f":"IF(OR($C221=\"S\",$C221=0),0,MATCH(OFFSET($D221,0,$C221)+1,OFFSET($D221,1,$C221,ROW($C$337)-ROW($C221)),0))","v":0},"","Serviço","Serviço","-","AGETOP",20111,"DEM.PISO CERAM.SOBRE LASTRO CONC.C/TR.CB.E CARGA","m2    ",30,1,30,null,null,0,0,""]
["S",2,"S",0,6,1,0,0,0,{"$f":"IF(OR($C222=\"S\",$C222=0),0,MATCH(0,OFFSET($D222,1,$C222,ROW($C$337)-ROW($C222)),0))","v":0},{"$f":"IF(OR($C222=\"S\",$C222=0),0,MATCH(OFFSET($D222,0,$C222)+1,OFFSET($D222,1,$C222,ROW($C$337)-ROW($C222)),0))","v":0},"","Serviço","Serviço","-","AGETOP",20115,"DEMOLIÇÃO DE REVESTIMENTOS COM AZULEJOS C/TRANSP.ATE CB. E CARGA","m2    ",18.72,1,18.72,null,null,0,0,""]
["S",2,"S",0,6,1,0,0,0,{"$f":"IF(OR($C223=\"S\",$C223=0),0,MATCH(0,OFFSET($D223,1,$C223,ROW($C$337)-ROW($C223)),0))","v":0},{"$f":"IF(OR($C223=\"S\",$C223=0),0,MATCH(OFFSET($D223,0,$C223)+1,OFFSET($D223,1,$C223,ROW($C$337)-ROW($C223)),0))","v":0},"","Serviço","Serviço","-","AGETOP",20137,"DEMOLIÇAO BACIA SANITARIA C/ TRANSP. ATÉ CB. E CARGA","Un    ",6,1,6,null,null,0,0,""]
["S",2,"S",0,6,1,0,0,0,{"$f":"IF(OR($C224=\"S\",$C224=0),0,MATCH(0,OFFSET($D224,1,$C224,ROW($C$337)-ROW($C224)),0))","v":0},{"$f":"IF(OR($C224=\"S\",$C224=0),0,MATCH(OFFSET($D224,0,$C224)+1,OFFSET($D224,1,$C224,ROW($C$337)-ROW($C224)),0))","v":0},"","Serviço","Serviço","-","AGETOP",20140,"DEMOLIÇAO DE VÁLVULA DE DESCARGA C/ TRANSP. ATÉ CB. E CARGA","Un    ",3,1,3,null,null,0,0,""]
["S",2,"S",0,6,1,0,0,0,{"$f":"IF(OR($C225=\"S\",$C225=0),0,MATCH(0,OFFSET($D225,1,$C225,ROW($C$337)-ROW($C225)),0))","v":0},{"$f":"IF(OR($C225=\"S\",$C225=0),0,MATCH(OFFSET($D225,0,$C225)+1,OFFSET($D225,1,$C225,ROW($C$337)-ROW($C225)),0))","v":0},"","Serviço","Serviço","-","AGETOP",20106,"RETIRADA DE JANELAS OU PORTAIS C/ TRANSP. ATÉ CB. E CARGA","m2    ",7.56,1,7.56,null,null,0,0,""]
[2,2,2,2,6,2,0,0,0,{"$f":"IF(OR($C226=\"S\",$C226=0),0,MATCH(0,OFFSET($D226,1,$C226,ROW($C$337)-ROW($C226)),0))","v":13},{"$f":"IF(OR($C226=\"S\",$C226=0),0,MATCH(OFFSET($D226,0,$C226)+1,OFFSET($D226,1,$C226,ROW($C$337)-ROW($C226)),0))","v":2},"","Nível 2","Nível 2","-","SINAPI",null,"ALVENARIAS E DIVISÓRIAS","-",null,1,"-",null,null,0,0,""]
["S",2,"S",0,6,2,0,0,0,{"$f":"IF(OR($C227=\"S\",$C227=0),0,MATCH(0,OFFSET($D227,1,$C227,ROW($C$337)-ROW($C227)),0))","v":0},{"$f":"IF(OR($C227=\"S\",$C227=0),0,MATCH(OFFSET($D227,0,$C227)+1,OFFSET($D227,1,$C227,ROW($C$337)-ROW($C227)),0))","v":0},"","Serviço","Serviço","-","AGETOP",100303,"DIVISORIA DE ARDOSIA POLIDA 3 CM","m2    ",15.98,1,15.98,null,null,0,0,""]
[2,2,2,2,6,3,0,0,0,{"$f":"IF(OR($C228=\"S\",$C228=0),0,MATCH(0,OFFSET($D228,1,$C228,ROW($C$337)-ROW($C228)),0))","v":11},{"$f":"IF(OR($C228=\"S\",$C228=0),0,MATCH(OFFSET($D228,0,$C228)+1,OFFSET($D228,1,$C228,ROW($C$337)-ROW($C228)),0))","v":2},"","Nível 2","Nível 2","-","SINAPI",null,"ESQUADRIAS METÁLICAS","-",null,1,"-",null,null,0,0,""]
["S",2,"S",0,6,3,0,0,0,{"$f":"IF(OR($C229=\"S\",$C229=0),0,MATCH(0,OFFSET($D229,1,$C229,ROW($C$337)-ROW($C229)),0))","v":0},{"$f":"IF(OR($C229=\"S\",$C229=0),0,MATCH(OFFSET($D229,0,$C229)+1,OFFSET($D229,1,$C229,ROW($C$337)-ROW($C229)),0))","v":0},"","Serviço","Serviço","-","AGETOP",180509,"PORTA ABRIR CH.P/WC PF-10 C/FERRAGENS","m2    ",7.56,1,7.56,null,null,0,0,""]
[2,2,2,2,6,4,0,0,0,{"$f":"IF(OR($C230=\"S\",$C230=0),0,MATCH(0,OFFSET($D230,1,$C230,ROW($C$337)-ROW($C230)),0))","v":9},{"$f":"IF(OR($C230=\"S\",$C230=0),0,MATCH(OFFSET($D230,0,$C230)+1,OFFSET($D230,1,$C230,ROW($C$337)-ROW($C230)),0))","v":2},"","Nível 2","Nível 2","-","SINAPI",null,"REVESTIMENTO DE PAREDE","-",null,1,"-",null,null,0,0,""]
["S",2,"S",0,6,4,0,0,0,{"$f":"IF(OR($C231=\"S\",$C231=0),0,MATCH(0,OFFSET($D231,1,$C231,ROW($C$337)-ROW($C231)),0))","v":0},{"$f":"IF(OR($C231=\"S\",$C231=0),0,MATCH(OFFSET($D231,0,$C231)+1,OFFSET($D231,1,$C231,ROW($C$337)-ROW($C231)),0))","v":0},"","Serviço","Serviço","-","SINAPI",87273,"REVESTIMENTO CERÂMICO PARA PAREDES INTERNAS COM PLACAS TIPO ESMALTADA EXTRA DE DIMENSÕES 33X45 CM APLICADAS EM AMBIENTES DE ÁREA MAIOR QUE 5 M² NA ALTURA INTEIRA DAS PAREDES. AF_06/2014","M2",18.72,1,18.72,null,null,0,0,""]
[2,2,2,2,6,5,0,0,0,{"$f":"IF(OR($C232=\"S\",$C232=0),0,MATCH(0,OFFSET($D232,1,$C232,ROW($C$337)-ROW($C232)),0))","v":7},{"$f":"IF(OR($C232=\"S\",$C232=0),0,MATCH(OFFSET($D232,0,$C232)+1,OFFSET($D232,1,$C232,ROW($C$337)-ROW($C232)),0))","v":2},"","Nível 2","Nível 2","-",null,null,"REVESTIMENTO DE PISO","-",null,1,"-",null,null,0,0,""]
["S",2,"S",0,6,5,0,0,0,{"$f":"IF(OR($C233=\"S\",$C233=0),0,MATCH(0,OFFSET($D233,1,$C233,ROW($C$337)-ROW($C233)),0))","v":0},{"$f":"IF(OR($C233=\"S\",$C233=0),0,MATCH(OFFSET($D233,0,$C233)+1,OFFSET($D233,1,$C233,ROW($C$337)-ROW($C233)),0))","v":0},"","Serviço","Serviço","-","SINAPI",87251,"REVESTIMENTO CERÂMICO PARA PISO COM PLACAS TIPO ESMALTADA EXTRA DE DIMENSÕES 45X45 CM APLICADA EM AMBIENTES DE ÁREA MAIOR QUE 10 M2. AF_06/2014","M2",30,1,30,null,null,0,0,""]
[2,2,2,3,6,6,0,0,0,{"$f":"IF(OR($C234=\"S\",$C234=0),0,MATCH(0,OFFSET($D234,1,$C234,ROW($C$337)-ROW($C234)),0))","v":5},{"$f":"IF(OR($C234=\"S\",$C234=0),0,MATCH(OFFSET($D234,0,$C234)+1,OFFSET($D234,1,$C234,ROW($C$337)-ROW($C234)),0))","v":3},"","Nível 2","Nível 2","-",null,null,"FERRAGENS","-",null,1,"-",null,null,0,0,""]
["S",2,"S",0,6,6,0,0,0,{"$f":"IF(OR($C235=\"S\",$C235=0),0,MATCH(0,OFFSET($D235,1,$C235,ROW($C$337)-ROW($C235)),0))","v":0},{"$f":"IF(OR($C235=\"S\",$C235=0),0,MATCH(OFFSET($D235,0,$C235)+1,OFFSET($D235,1,$C235,ROW($C$337)-ROW($C235)),0))","v":0},"","Serviço","Serviço","-","AGETOP",230174,"BARRA DE APOIO EM AÇO INOX - 40 CM","un    ",6,1,6,null,null,0,0,""]
["S",2,"S",0,6,6,0,0,0,{"$f":"IF(OR($C236=\"S\",$C236=0),0,MATCH(0,OFFSET($D236,1,$C236,ROW($C$337)-ROW($C236)),0))","v":0},{"$f":"IF(OR($C236=\"S\",$C236=0),0,MATCH(OFFSET($D236,0,$C236)+1,OFFSET($D236,1,$C236,ROW($C$337)-ROW($C236)),0))","v":0},"","Serviço","Serviço","-","AGETOP",230176,"BARRA DE APOIO EM AÇO INOX - 80 CM ","un    ",6,1,6,null,null,0,0,""]
[2,2,2,2,6,7,0,0,0,{"$f":"IF(OR($C237=\"S\",$C237=0),0,MATCH(0,OFFSET($D237,1,$C237,ROW($C$337)-ROW($C237)),0))","v":2},{"$f":"IF(OR($C237=\"S\",$C237=0),0,MATCH(OFFSET($D237,0,$C237)+1,OFFSET($D237,1,$C237,ROW($C$337)-ROW($C237)),0))","v":{"$error":"#N/A"}},"","Nível 2","Nível 2","-","SINAPI",null,"PINTURA","-",null,1,"-",null,null,0,0,""]
["S",2,"S",0,6,7,0,0,0,{"$f":"IF(OR($C238=\"S\",$C238=0),0,MATCH(0,OFFSET($D238,1,$C238,ROW($C$337)-ROW($C238)),0))","v":0},{"$f":"IF(OR($C238=\"S\",$C238=0),0,MATCH(OFFSET($D238,0,$C238)+1,OFFSET($D238,1,$C238,ROW($C$337)-ROW($C238)),0))","v":0},"","Serviço","Serviço","-","AGETOP",261602,"PINT.ESMALTE/ESQUAD.FERRO C/FUNDO ANTICOR.","m2    ",22.68,1,22.68,null,null,0,0,""]
[1,1,1,23,7,0,0,0,0,{"$f":"IF(OR($C239=\"S\",$C239=0),0,MATCH(0,OFFSET($D239,1,$C239,ROW($C$337)-ROW($C239)),0))","v":98},{"$f":"IF(OR($C239=\"S\",$C239=0),0,MATCH(OFFSET($D239,0,$C239)+1,OFFSET($D239,1,$C239,ROW($C$337)-ROW($C239)),0))","v":23},"F","Nível 1","Nível 1","7.","SINAPI",null,"REFORMA VESTIÁRIO - BLOCO G","UN",1,1,1,null,null,0,0,""]
[2,2,2,8,7,1,0,0,0,{"$f":"IF(OR($C240=\"S\",$C240=0),0,MATCH(0,OFFSET($D240,1,$C240,ROW($C$337)-ROW($C240)),0))","v":22},{"$f":"IF(OR($C240=\"S\",$C240=0),0,MATCH(OFFSET($D240,0,$C240)+1,OFFSET($D240,1,$C240,ROW($C$337)-ROW($C240)),0))","v":8},"","Nível 2","Nível 2","-","SINAPI",null,"SERVIÇOS PRELIMINARES","-",null,1,"-",null,null,0,0,""]
["S",2,"S",0,7,1,0,0,0,{"$f":"IF(OR($C241=\"S\",$C241=0),0,MATCH(0,OFFSET($D241,1,$C241,ROW($C$337)-ROW($C241)),0))","v":0},{"$f":"IF(OR($C241=\"S\",$C241=0),0,MATCH(OFFSET($D241,0,$C241)+1,OFFSET($D241,1,$C241,ROW($C$337)-ROW($C241)),0))","v":0},"","Serviço","Serviço","-","AGETOP",20100,"DEMOLIÇÃO - COBERTURA TELHA METÁLICA C/ TRANSP. ATÉ CB. E CARGA","m2    ",51.15,1,51.15,null,null,0,0,""]
["S",2,"S",0,7,1,0,0,0,{"$f":"IF(OR($C242=\"S\",$C242=0),0,MATCH(0,OFFSET($D242,1,$C242,ROW($C$337)-ROW($C242)),0))","v":0},{"$f":"IF(OR($C242=\"S\",$C242=0),0,MATCH(OFFSET($D242,0,$C242)+1,OFFSET($D242,1,$C242,ROW($C$337)-ROW($C242)),0))","v":0},"","Serviço","Serviço","-","AGETOP",20157,"DEMOLIÇÃO CALHAS/ RUFOS EM CHAPA C/TR.AT.C.B.E CARGA","m2    ",8.19,1,8.19,null,null,0,0,""]
[{"$f":"CHOOSE(1+LOG(1+2*(ORÇAMENTO.Nivel=\"Nível 1\")+4*(ORÇAMENTO.Nivel=\"Nível 2\")+8*(ORÇAMENTO.Nivel=\"Nível 3\")+16*(ORÇAMENTO.Nivel=\"Nível 4\")+32*(ORÇAMENTO.Nivel=\"Serviço\"),2),0,1,2,3,4,\"S\")","v":"S"},{"$f":"IF(OR(C243=\"s\",C243=0),OFFSET(B243,-1,0),C243)","v":2},{"$f":"IF(OFFSET(C243,-1,0)=\"L\",1,IF(OFFSET(C243,-1,0)=1,2,IF(OR(A243=\"s\",A243=0),\"S\",IF(AND(OFFSET(C243,-1,0)=2,A243=4),3,IF(AND(OR(OFFSET(C243,-1,0)=\"s\",OFFSET(C243,-1,0)=0),A243<>\"s\",A243>OFFSET(B243,-1,0)),OFFSET(B243,-1,0),A243)))))","v":"S"},{"$f":"IF(OR(C243=\"S\",C243=0),0,IF(ISERROR(K243),J243,SMALL(J243:K243,1)))","v":0},{"$f":"IF($C243=1,OFFSET(E243,-1,0)+1,OFFSET(E243,-1,0))","v":7},{"$f":"IF($C243=1,0,IF($C243=2,OFFSET(F243,-1,0)+1,OFFSET(F243,-1,0)))","v":1},{"$f":"IF(AND($C243<=2,$C243<>0),0,IF($C243=3,OFFSET(G243,-1,0)+1,OFFSET(G243,-1,0)))","v":0},{"$f":"IF(AND($C243<=3,$C243<>0),0,IF($C243=4,OFFSET(H243,-1,0)+1,OFFSET(H243,-1,0)))","v":0},{"$f":"IF(AND($C243<=4,$C243<>0),0,IF(AND($C243=\"S\",$Y243>0),OFFSET(I243,-1,0)+1,OFFSET(I243,-1,0)))","v":0},{"$f":"IF(OR($C243=\"S\",$C243=0),0,MATCH(0,OFFSET($D243,1,$C243,ROW($C$337)-ROW($C243)),0))","v":0},{"$f":"IF(OR($C243=\"S\",$C243=0),0,MATCH(OFFSET($D243,0,$C243)+1,OFFSET($D243,1,$C243,ROW($C$337)-ROW($C243)),0))","v":0},"","Serviço","Serviço","-","AGETOP",20106,"RETIRADA DE JANELAS OU PORTAIS C/ TRANSP. ATÉ CB. E CARGA","m2    ",3.78,1,3.78,null,null,0,0,""]
["S",2,"S",0,7,1,0,0,0,{"$f":"IF(OR($C244=\"S\",$C244=0),0,MATCH(0,OFFSET($D244,1,$C244,ROW($C$337)-ROW($C244)),0))","v":0},{"$f":"IF(OR($C244=\"S\",$C244=0),0,MATCH(OFFSET($D244,0,$C244)+1,OFFSET($D244,1,$C244,ROW($C$337)-ROW($C244)),0))","v":0},"","Serviço","Serviço","-","AGETOP",20137,"DEMOLIÇAO BACIA SANITARIA C/ TRANSP. ATÉ CB. E CARGA","Un    ",4,1,4,null,null,0,0,""]
["S",2,"S",0,7,1,0,0,0,{"$f":"IF(OR($C245=\"S\",$C245=0),0,MATCH(0,OFFSET($D245,1,$C245,ROW($C$337)-ROW($C245)),0))","v":0},{"$f":"IF(OR($C245=\"S\",$C245=0),0,MATCH(OFFSET($D245,0,$C245)+1,OFFSET($D245,1,$C245,ROW($C$337)-ROW($C245)),0))","v":0},"","Serviço","Serviço","-","AGETOP",20138,"DEMOLIÇAO DE LAVATÓRIO C/ TRANSP. ATÉ CB. E CARGA","Un    ",4,1,4,null,null,0,0,""]
["S",2,"S",0,7,1,0,0,0,{"$f":"IF(OR($C246=\"S\",$C246=0),0,MATCH(0,OFFSET($D246,1,$C246,ROW($C$337)-ROW($C246)),0))","v":0},{"$f":"IF(OR($C246=\"S\",$C246=0),0,MATCH(OFFSET($D246,0,$C246)+1,OFFSET($D246,1,$C246,ROW($C$337)-ROW($C246)),0))","v":0},"","Serviço","Serviço","-","AGETOP",20140,"DEMOLIÇAO DE VÁLVULA DE DESCARGA C/ TRANSP. ATÉ CB. E CARGA","Un    ",4,1,4,null,null,0,0,""]
["S",2,"S",0,7,1,0,0,0,{"$f":"IF(OR($C247=\"S\",$C247=0),0,MATCH(0,OFFSET($D247,1,$C247,ROW($C$337)-ROW($C247)),0))","v":0},{"$f":"IF(OR($C247=\"S\",$C247=0),0,MATCH(OFFSET($D247,0,$C247)+1,OFFSET($D247,1,$C247,ROW($C$337)-ROW($C247)),0))","v":0},"","Serviço","Serviço","-","AGETOP",20163,"DEMOLIÇÃO DAS INSTALAÇÕES HIDROSANITÁRIAS E AFINS C/ TRANSP. ATÉ CB. E CARGA","H     ",3,1,3,null,null,0,0,""]
[{"$f":"CHOOSE(1+LOG(1+2*(ORÇAMENTO.Nivel=\"Nível 1\")+4*(ORÇAMENTO.Nivel=\"Nível 2\")+8*(ORÇAMENTO.Nivel=\"Nível 3\")+16*(ORÇAMENTO.Nivel=\"Nível 4\")+32*(ORÇAMENTO.Nivel=\"Serviço\"),2),0,1,2,3,4,\"S\")","v":2},2,2,2,7,2,0,0,0,{"$f":"IF(OR($C248=\"S\",$C248=0),0,MATCH(0,OFFSET($D248,1,$C248,ROW($C$337)-ROW($C248)),0))","v":14},{"$f":"IF(OR($C248=\"S\",$C248=0),0,MATCH(OFFSET($D248,0,$C248)+1,OFFSET($D248,1,$C248,ROW($C$337)-ROW($C248)),0))","v":2},"","Nível 2","Nível 2","-","SINAPI",null,"ESQUADRIAS METÁLICAS","-",null,1,"-",null,null,0,0,""]
[{"$f":"CHOOSE(1+LOG(1+2*(ORÇAMENTO.Nivel=\"Nível 1\")+4*(ORÇAMENTO.Nivel=\"Nível 2\")+8*(ORÇAMENTO.Nivel=\"Nível 3\")+16*(ORÇAMENTO.Nivel=\"Nível 4\")+32*(ORÇAMENTO.Nivel=\"Serviço\"),2),0,1,2,3,4,\"S\")","v":"S"},2,"S",0,7,2,0,0,0,{"$f":"IF(OR($C249=\"S\",$C249=0),0,MATCH(0,OFFSET($D249,1,$C249,ROW($C$337)-ROW($C249)),0))","v":0},{"$f":"IF(OR($C249=\"S\",$C249=0),0,MATCH(OFFSET($D249,0,$C249)+1,OFFSET($D249,1,$C249,ROW($C$337)-ROW($C249)),0))","v":0},"","Serviço","Serviço","-","AGETOP",180501,"PORTA DE ABRIR EM CHAPA PF-1 C/FERRAGENS","m2    ",3.78,1,3.78,null,null,0,0,""]
[2,2,2,4,7,3,0,0,0,{"$f":"IF(OR($C250=\"S\",$C250=0),0,MATCH(0,OFFSET($D250,1,$C250,ROW($C$337)-ROW($C250)),0))","v":12},{"$f":"IF(OR($C250=\"S\",$C250=0),0,MATCH(OFFSET($D250,0,$C250)+1,OFFSET($D250,1,$C250,ROW($C$337)-ROW($C250)),0))","v":4},"","Nível 2","Nível 2","-","SINAPI",null,"COBERTURAS","-",null,1,"-",null,null,0,0,""]
["S",2,"S",0,7,3,0,0,0,{"$f":"IF(OR($C251=\"S\",$C251=0),0,MATCH(0,OFFSET($D251,1,$C251,ROW($C$337)-ROW($C251)),0))","v":0},{"$f":"IF(OR($C251=\"S\",$C251=0),0,MATCH(OFFSET($D251,0,$C251)+1,OFFSET($D251,1,$C251,ROW($C$337)-ROW($C251)),0))","v":0},"","Serviço","Serviço","-","AGETOP",160967,"COBERTURA COM TELHA CHAPA GALVANIZADA  TRAPEZOIDAL 0,5 MM COM ACESSÓRIOS","m2    ",51.15,1,51.15,null,null,0,0,""]
["S",2,"S",0,7,3,0,0,0,{"$f":"IF(OR($C252=\"S\",$C252=0),0,MATCH(0,OFFSET($D252,1,$C252,ROW($C$337)-ROW($C252)),0))","v":0},{"$f":"IF(OR($C252=\"S\",$C252=0),0,MATCH(OFFSET($D252,0,$C252)+1,OFFSET($D252,1,$C252,ROW($C$337)-ROW($C252)),0))","v":0},"","Serviço","Serviço","-","AGETOP",160601,"CALHA DE CHAPA GALVANIZADA","m     ",10.45,1,10.45,null,null,0,0,""]
["S",2,"S",0,7,3,0,0,0,{"$f":"IF(OR($C253=\"S\",$C253=0),0,MATCH(0,OFFSET($D253,1,$C253,ROW($C$337)-ROW($C253)),0))","v":0},{"$f":"IF(OR($C253=\"S\",$C253=0),0,MATCH(OFFSET($D253,0,$C253)+1,OFFSET($D253,1,$C253,ROW($C$337)-ROW($C253)),0))","v":0},"","Serviço","Serviço","-","AGETOP",160602,"RUFO DE CHAPA GALVANIZADA","m     ",20.079999999999998,1,20.079999999999998,null,null,0,0,""]
[2,2,2,2,7,4,0,0,0,{"$f":"IF(OR($C254=\"S\",$C254=0),0,MATCH(0,OFFSET($D254,1,$C254,ROW($C$337)-ROW($C254)),0))","v":8},{"$f":"IF(OR($C254=\"S\",$C254=0),0,MATCH(OFFSET($D254,0,$C254)+1,OFFSET($D254,1,$C254,ROW($C$337)-ROW($C254)),0))","v":2},"","Nível 2","Nível 2","-","SINAPI",null,"VIDROS","-",null,1,"-",null,null,0,0,""]
["S",2,"S",0,7,4,0,0,0,{"$f":"IF(OR($C255=\"S\",$C255=0),0,MATCH(0,OFFSET($D255,1,$C255,ROW($C$337)-ROW($C255)),0))","v":0},{"$f":"IF(OR($C255=\"S\",$C255=0),0,MATCH(OFFSET($D255,0,$C255)+1,OFFSET($D255,1,$C255,ROW($C$337)-ROW($C255)),0))","v":0},"","Serviço","Serviço","-","SINAPI",72122,"VIDRO FANTASIA TIPO CANELADO, ESPESSURA 4MM","M2",6.28,1,6.28,null,null,0,0,""]
[{"$f":"CHOOSE(1+LOG(1+2*(ORÇAMENTO.Nivel=\"Nível 1\")+4*(ORÇAMENTO.Nivel=\"Nível 2\")+8*(ORÇAMENTO.Nivel=\"Nível 3\")+16*(ORÇAMENTO.Nivel=\"Nível 4\")+32*(ORÇAMENTO.Nivel=\"Serviço\"),2),0,1,2,3,4,\"S\")","v":2},2,2,2,7,5,0,0,0,{"$f":"IF(OR($C256=\"S\",$C256=0),0,MATCH(0,OFFSET($D256,1,$C256,ROW($C$337)-ROW($C256)),0))","v":6},{"$f":"IF(OR($C256=\"S\",$C256=0),0,MATCH(OFFSET($D256,0,$C256)+1,OFFSET($D256,1,$C256,ROW($C$337)-ROW($C256)),0))","v":2},"","Nível 2","Nível 2","-","SINAPI",null,"FERRAGENS","-",null,1,"-",null,null,0,0,""]
[{"$f":"CHOOSE(1+LOG(1+2*(ORÇAMENTO.Nivel=\"Nível 1\")+4*(ORÇAMENTO.Nivel=\"Nível 2\")+8*(ORÇAMENTO.Nivel=\"Nível 3\")+16*(ORÇAMENTO.Nivel=\"Nível 4\")+32*(ORÇAMENTO.Nivel=\"Serviço\"),2),0,1,2,3,4,\"S\")","v":"S"},2,"S",0,7,5,0,0,0,{"$f":"IF(OR($C257=\"S\",$C257=0),0,MATCH(0,OFFSET($D257,1,$C257,ROW($C$337)-ROW($C257)),0))","v":0},{"$f":"IF(OR($C257=\"S\",$C257=0),0,MATCH(OFFSET($D257,0,$C257)+1,OFFSET($D257,1,$C257,ROW($C$337)-ROW($C257)),0))","v":0},"","Serviço","Serviço","-","AGETOP",230174,"BARRA DE APOIO EM AÇO INOX - 40 CM","un    ",2,1,2,null,null,0,0,""]
[{"$f":"CHOOSE(1+LOG(1+2*(ORÇAMENTO.Nivel=\"Nível 1\")+4*(ORÇAMENTO.Nivel=\"Nível 2\")+8*(ORÇAMENTO.Nivel=\"Nível 3\")+16*(ORÇAMENTO.Nivel=\"Nível 4\")+32*(ORÇAMENTO.Nivel=\"Serviço\"),2),0,1,2,3,4,\"S\")","v":2},2,2,2,7,6,0,0,0,{"$f":"IF(OR($C258=\"S\",$C258=0),0,MATCH(0,OFFSET($D258,1,$C258,ROW($C$337)-ROW($C258)),0))","v":4},{"$f":"IF(OR($C258=\"S\",$C258=0),0,MATCH(OFFSET($D258,0,$C258)+1,OFFSET($D258,1,$C258,ROW($C$337)-ROW($C258)),0))","v":2},"","Nível 2","Nível 2","-","SINAPI",null,"PINTURA","-",null,1,"-",null,null,0,0,""]
[{"$f":"CHOOSE(1+LOG(1+2*(ORÇAMENTO.Nivel=\"Nível 1\")+4*(ORÇAMENTO.Nivel=\"Nível 2\")+8*(ORÇAMENTO.Nivel=\"Nível 3\")+16*(ORÇAMENTO.Nivel=\"Nível 4\")+32*(ORÇAMENTO.Nivel=\"Serviço\"),2),0,1,2,3,4,\"S\")","v":"S"},2,"S",0,7,6,0,0,0,{"$f":"IF(OR($C259=\"S\",$C259=0),0,MATCH(0,OFFSET($D259,1,$C259,ROW($C$337)-ROW($C259)),0))","v":0},{"$f":"IF(OR($C259=\"S\",$C259=0),0,MATCH(OFFSET($D259,0,$C259)+1,OFFSET($D259,1,$C259,ROW($C$337)-ROW($C259)),0))","v":0},"","Serviço","Serviço","-","AGETOP",261602,"PINT.ESMALTE/ESQUAD.FERRO C/FUNDO ANTICOR.","m2    ",11.34,1,11.34,null,null,0,0,""]
[2,2,2,2,7,7,0,0,0,{"$f":"IF(OR($C260=\"S\",$C260=0),0,MATCH(0,OFFSET($D260,1,$C260,ROW($C$337)-ROW($C260)),0))","v":2},{"$f":"IF(OR($C260=\"S\",$C260=0),0,MATCH(OFFSET($D260,0,$C260)+1,OFFSET($D260,1,$C260,ROW($C$337)-ROW($C260)),0))","v":{"$error":"#N/A"}},"","Nível 2","Nível 2","-","SINAPI",null,"DIVERSOS","-",null,1,"-",null,null,0,0,""]
["S",2,"S",0,7,7,0,0,0,{"$f":"IF(OR($C261=\"S\",$C261=0),0,MATCH(0,OFFSET($D261,1,$C261,ROW($C$337)-ROW($C261)),0))","v":0},{"$f":"IF(OR($C261=\"S\",$C261=0),0,MATCH(OFFSET($D261,0,$C261)+1,OFFSET($D261,1,$C261,ROW($C$337)-ROW($C261)),0))","v":0},"","Serviço","Serviço","-","AGETOP",270502,"LIMPEZA COM ÁCIDO MURIÁTICO (1:20), NEUTRALIZADO COM  AMÔNIA (1:14)","m2    ",216.44,1,216.44,null,null,0,0,""]
[1,1,1,3,8,0,0,0,0,{"$f":"IF(OR($C262=\"S\",$C262=0),0,MATCH(0,OFFSET($D262,1,$C262,ROW($C$337)-ROW($C262)),0))","v":75},{"$f":"IF(OR($C262=\"S\",$C262=0),0,MATCH(OFFSET($D262,0,$C262)+1,OFFSET($D262,1,$C262,ROW($C$337)-ROW($C262)),0))","v":3},"F","Nível 1","Nível 1","8.","SINAPI",null,"SANITÁRIOS BLOCO 01","UN",1,1,1,null,null,0,0,""]
[2,2,2,2,8,1,0,0,0,{"$f":"IF(OR($C263=\"S\",$C263=0),0,MATCH(0,OFFSET($D263,1,$C263,ROW($C$337)-ROW($C263)),0))","v":2},{"$f":"IF(OR($C263=\"S\",$C263=0),0,MATCH(OFFSET($D263,0,$C263)+1,OFFSET($D263,1,$C263,ROW($C$337)-ROW($C263)),0))","v":5},"","Nível 2","Nível 2","-","SINAPI",null,"SERVIÇOS PRELIMINARES","-",null,1,"-",null,null,0,0,""]
["S",2,"S",0,8,1,0,0,0,{"$f":"IF(OR($C264=\"S\",$C264=0),0,MATCH(0,OFFSET($D264,1,$C264,ROW($C$337)-ROW($C264)),0))","v":0},{"$f":"IF(OR($C264=\"S\",$C264=0),0,MATCH(OFFSET($D264,0,$C264)+1,OFFSET($D264,1,$C264,ROW($C$337)-ROW($C264)),0))","v":0},"","Serviço","Serviço","-","AGETOP",20140,"DEMOLIÇAO DE VÁLVULA DE DESCARGA C/ TRANSP. ATÉ CB. E CARGA","Un    ",2,1,2,null,null,0,0,""]
[1,1,1,5,9,0,0,0,0,{"$f":"IF(OR($C265=\"S\",$C265=0),0,MATCH(0,OFFSET($D265,1,$C265,ROW($C$337)-ROW($C265)),0))","v":72},{"$f":"IF(OR($C265=\"S\",$C265=0),0,MATCH(OFFSET($D265,0,$C265)+1,OFFSET($D265,1,$C265,ROW($C$337)-ROW($C265)),0))","v":5},"F","Nível 1","Nível 1","9.","SINAPI",null,"COZINHA BLOCO 08","UN",1,1,1,null,null,0,0,""]
[2,2,2,2,9,1,0,0,0,{"$f":"IF(OR($C266=\"S\",$C266=0),0,MATCH(0,OFFSET($D266,1,$C266,ROW($C$337)-ROW($C266)),0))","v":4},{"$f":"IF(OR($C266=\"S\",$C266=0),0,MATCH(OFFSET($D266,0,$C266)+1,OFFSET($D266,1,$C266,ROW($C$337)-ROW($C266)),0))","v":2},"","Nível 2","Nível 2","-","SINAPI",null,"SERVIÇOS PRELIMINARES","-",null,1,"-",null,null,0,0,""]
["S",2,"S",0,9,1,0,0,0,{"$f":"IF(OR($C267=\"S\",$C267=0),0,MATCH(0,OFFSET($D267,1,$C267,ROW($C$337)-ROW($C267)),0))","v":0},{"$f":"IF(OR($C267=\"S\",$C267=0),0,MATCH(OFFSET($D267,0,$C267)+1,OFFSET($D267,1,$C267,ROW($C$337)-ROW($C267)),0))","v":0},"","Serviço","Serviço","-","AGETOP",20111,"DEM.PISO CERAM.SOBRE LASTRO CONC.C/TR.CB.E CARGA","m2    ",30.45,1,30.45,null,null,0,0,""]
[2,2,2,2,9,2,0,0,0,{"$f":"IF(OR($C268=\"S\",$C268=0),0,MATCH(0,OFFSET($D268,1,$C268,ROW($C$337)-ROW($C268)),0))","v":2},{"$f":"IF(OR($C268=\"S\",$C268=0),0,MATCH(OFFSET($D268,0,$C268)+1,OFFSET($D268,1,$C268,ROW($C$337)-ROW($C268)),0))","v":22},"","Nível 2","Nível 2","-",null,null,"REVESTIMENTO DE PISO","-",null,1,"-",null,null,0,0,""]
["S",2,"S",0,9,2,0,0,0,{"$f":"IF(OR($C269=\"S\",$C269=0),0,MATCH(0,OFFSET($D269,1,$C269,ROW($C$337)-ROW($C269)),0))","v":0},{"$f":"IF(OR($C269=\"S\",$C269=0),0,MATCH(OFFSET($D269,0,$C269)+1,OFFSET($D269,1,$C269,ROW($C$337)-ROW($C269)),0))","v":0},"","Serviço","Serviço","-","SINAPI",87251,"REVESTIMENTO CERÂMICO PARA PISO COM PLACAS TIPO ESMALTADA EXTRA DE DIMENSÕES 45X45 CM APLICADA EM AMBIENTES DE ÁREA MAIOR QUE 10 M2. AF_06/2014","M2",30.45,1,30.45,null,null,0,0,""]
[1,1,1,7,10,0,0,0,0,{"$f":"IF(OR($C270=\"S\",$C270=0),0,MATCH(0,OFFSET($D270,1,$C270,ROW($C$337)-ROW($C270)),0))","v":67},{"$f":"IF(OR($C270=\"S\",$C270=0),0,MATCH(OFFSET($D270,0,$C270)+1,OFFSET($D270,1,$C270,ROW($C$337)-ROW($C270)),0))","v":7},"F","Nível 1","Nível 1","10.","SINAPI",null,"CENTRAL DE GÁS","UN",1,1,1,null,null,0,0,""]
[2,2,2,2,10,1,0,0,0,{"$f":"IF(OR($C271=\"S\",$C271=0),0,MATCH(0,OFFSET($D271,1,$C271,ROW($C$337)-ROW($C271)),0))","v":6},{"$f":"IF(OR($C271=\"S\",$C271=0),0,MATCH(OFFSET($D271,0,$C271)+1,OFFSET($D271,1,$C271,ROW($C$337)-ROW($C271)),0))","v":2},"","Nível 2","Nível 2","-","SINAPI",null,"SERVIÇOS PRELIMINARES","-",null,1,"-",null,null,0,0,""]
["S",2,"S",0,10,1,0,0,0,{"$f":"IF(OR($C272=\"S\",$C272=0),0,MATCH(0,OFFSET($D272,1,$C272,ROW($C$337)-ROW($C272)),0))","v":0},{"$f":"IF(OR($C272=\"S\",$C272=0),0,MATCH(OFFSET($D272,0,$C272)+1,OFFSET($D272,1,$C272,ROW($C$337)-ROW($C272)),0))","v":0},"","Serviço","Serviço","-","AGETOP",20163,"DEMOLIÇÃO DAS INSTALAÇÕES HIDROSANITÁRIAS E AFINS C/ TRANSP. ATÉ CB. E CARGA","H     ",2,1,2,null,null,0,0,""]
[2,2,2,4,10,2,0,0,0,{"$f":"IF(OR($C273=\"S\",$C273=0),0,MATCH(0,OFFSET($D273,1,$C273,ROW($C$337)-ROW($C273)),0))","v":4},{"$f":"IF(OR($C273=\"S\",$C273=0),0,MATCH(OFFSET($D273,0,$C273)+1,OFFSET($D273,1,$C273,ROW($C$337)-ROW($C273)),0))","v":17},"","Nível 2","Nível 2","-","SINAPI",null,"INSTALAÇÕES ESPECIAIS","-",null,1,"-",null,null,0,0,""]
["S",2,"S",0,10,2,0,0,0,{"$f":"IF(OR($C274=\"S\",$C274=0),0,MATCH(0,OFFSET($D274,1,$C274,ROW($C$337)-ROW($C274)),0))","v":0},{"$f":"IF(OR($C274=\"S\",$C274=0),0,MATCH(OFFSET($D274,0,$C274)+1,OFFSET($D274,1,$C274,ROW($C$337)-ROW($C274)),0))","v":0},"","Serviço","Serviço","-","AGETOP",91025,"VÁLVULA ESFERICA LATÃO 3/4\"","Un    ",1,1,1,null,null,0,0,""]
["S",2,"S",0,10,2,0,0,0,{"$f":"IF(OR($C275=\"S\",$C275=0),0,MATCH(0,OFFSET($D275,1,$C275,ROW($C$337)-ROW($C275)),0))","v":0},{"$f":"IF(OR($C275=\"S\",$C275=0),0,MATCH(OFFSET($D275,0,$C275)+1,OFFSET($D275,1,$C275,ROW($C$337)-ROW($C275)),0))","v":0},"","Serviço","Serviço","-","AGETOP",91031,"NIPLE DUPLO 300 PSI 3/4\"","Un    ",2,1,2,null,null,0,0,""]
["S",2,"S",0,10,2,0,0,0,{"$f":"IF(OR($C276=\"S\",$C276=0),0,MATCH(0,OFFSET($D276,1,$C276,ROW($C$337)-ROW($C276)),0))","v":0},{"$f":"IF(OR($C276=\"S\",$C276=0),0,MATCH(OFFSET($D276,0,$C276)+1,OFFSET($D276,1,$C276,ROW($C$337)-ROW($C276)),0))","v":0},"","Serviço","Serviço","-","AGETOP",91023,"UNIÃO S/BRONZE PRETA 3/4\" NPT 300 LBS","Un    ",2,1,2,null,null,0,0,""]
[1,1,1,5,11,0,0,0,0,{"$f":"IF(OR($C277=\"S\",$C277=0),0,MATCH(0,OFFSET($D277,1,$C277,ROW($C$337)-ROW($C277)),0))","v":60},{"$f":"IF(OR($C277=\"S\",$C277=0),0,MATCH(OFFSET($D277,0,$C277)+1,OFFSET($D277,1,$C277,ROW($C$337)-ROW($C277)),0))","v":5},"F","Nível 1","Nível 1","11.","SINAPI",null,"PISO ESTACIONAMENTO","UN",1,1,1,null,null,0,0,""]
[{"$f":"CHOOSE(1+LOG(1+2*(ORÇAMENTO.Nivel=\"Nível 1\")+4*(ORÇAMENTO.Nivel=\"Nível 2\")+8*(ORÇAMENTO.Nivel=\"Nível 3\")+16*(ORÇAMENTO.Nivel=\"Nível 4\")+32*(ORÇAMENTO.Nivel=\"Serviço\"),2),0,1,2,3,4,\"S\")","v":2},2,2,2,11,1,0,0,0,{"$f":"IF(OR($C278=\"S\",$C278=0),0,MATCH(0,OFFSET($D278,1,$C278,ROW($C$337)-ROW($C278)),0))","v":4},{"$f":"IF(OR($C278=\"S\",$C278=0),0,MATCH(OFFSET($D278,0,$C278)+1,OFFSET($D278,1,$C278,ROW($C$337)-ROW($C278)),0))","v":2},"","Nível 2","Nível 2","-","SINAPI",null,"SERVIÇOS PRELIMINARES","-",null,1,"-",null,null,0,0,""]
[{"$f":"CHOOSE(1+LOG(1+2*(ORÇAMENTO.Nivel=\"Nível 1\")+4*(ORÇAMENTO.Nivel=\"Nível 2\")+8*(ORÇAMENTO.Nivel=\"Nível 3\")+16*(ORÇAMENTO.Nivel=\"Nível 4\")+32*(ORÇAMENTO.Nivel=\"Serviço\"),2),0,1,2,3,4,\"S\")","v":"S"},2,"S",0,11,1,0,0,0,{"$f":"IF(OR($C279=\"S\",$C279=0),0,MATCH(0,OFFSET($D279,1,$C279,ROW($C$337)-ROW($C279)),0))","v":0},{"$f":"IF(OR($C279=\"S\",$C279=0),0,MATCH(OFFSET($D279,0,$C279)+1,OFFSET($D279,1,$C279,ROW($C$337)-ROW($C279)),0))","v":0},"","Serviço","Serviço","-","AGETOP",20190,"LIMPEZA MECANICA DE TERRENO","m2    ",1413.24,1,1413.24,null,null,0,0,""]
[2,2,2,2,11,2,0,0,0,{"$f":"IF(OR($C280=\"S\",$C280=0),0,MATCH(0,OFFSET($D280,1,$C280,ROW($C$337)-ROW($C280)),0))","v":2},{"$f":"IF(OR($C280=\"S\",$C280=0),0,MATCH(OFFSET($D280,0,$C280)+1,OFFSET($D280,1,$C280,ROW($C$337)-ROW($C280)),0))","v":10},"","Nível 2","Nível 2","-","SINAPI",null,"REVESTIMENTO DE PISO","-",null,1,"-",null,null,0,0,""]
["S",2,"S",0,11,2,0,0,0,{"$f":"IF(OR($C281=\"S\",$C281=0),0,MATCH(0,OFFSET($D281,1,$C281,ROW($C$337)-ROW($C281)),0))","v":0},{"$f":"IF(OR($C281=\"S\",$C281=0),0,MATCH(OFFSET($D281,0,$C281)+1,OFFSET($D281,1,$C281,ROW($C$337)-ROW($C281)),0))","v":0},"","Serviço","Serviço","-","AGETOP",220104,"PISO EM CONCRETO DESEMPENADO ESPESSURA = 7 CM  1:2,5:3,5","m2    ",1413.24,1,1413.24,null,null,0,0,""]
[1,1,1,3,12,0,0,0,0,{"$f":"IF(OR($C282=\"S\",$C282=0),0,MATCH(0,OFFSET($D282,1,$C282,ROW($C$337)-ROW($C282)),0))","v":55},{"$f":"IF(OR($C282=\"S\",$C282=0),0,MATCH(OFFSET($D282,0,$C282)+1,OFFSET($D282,1,$C282,ROW($C$337)-ROW($C282)),0))","v":3},"F","Nível 1","Nível 1","12.","SINAPI",null,"CORRIMÃO","UN",1,1,1,null,null,0,0,""]
[2,2,2,2,12,1,0,0,0,{"$f":"IF(OR($C283=\"S\",$C283=0),0,MATCH(0,OFFSET($D283,1,$C283,ROW($C$337)-ROW($C283)),0))","v":2},{"$f":"IF(OR($C283=\"S\",$C283=0),0,MATCH(OFFSET($D283,0,$C283)+1,OFFSET($D283,1,$C283,ROW($C$337)-ROW($C283)),0))","v":5},"","Nível 2","Nível 2","-","SINAPI",null,"ESQUADRIAS METÁLICAS","-",null,1,"-",null,null,0,0,""]
["S",2,"S",0,12,1,0,0,0,{"$f":"IF(OR($C284=\"S\",$C284=0),0,MATCH(0,OFFSET($D284,1,$C284,ROW($C$337)-ROW($C284)),0))","v":0},{"$f":"IF(OR($C284=\"S\",$C284=0),0,MATCH(OFFSET($D284,0,$C284)+1,OFFSET($D284,1,$C284,ROW($C$337)-ROW($C284)),0))","v":0},"","Serviço","Serviço","-","COMPOSIÇÃO","COMP 083_SEE","CORRIMÃO PISO - SEDUC","M",49.82,1,49.82,null,null,0,0,""]
[1,1,1,7,13,0,0,0,0,{"$f":"IF(OR($C285=\"S\",$C285=0),0,MATCH(0,OFFSET($D285,1,$C285,ROW($C$337)-ROW($C285)),0))","v":52},{"$f":"IF(OR($C285=\"S\",$C285=0),0,MATCH(OFFSET($D285,0,$C285)+1,OFFSET($D285,1,$C285,ROW($C$337)-ROW($C285)),0))","v":7},"F","Nível 1","Nível 1","13.","SINAPI",null,"PORTÃO ACESSO","UN",1,1,1,null,null,0,0,""]
[2,2,2,2,13,1,0,0,0,{"$f":"IF(OR($C286=\"S\",$C286=0),0,MATCH(0,OFFSET($D286,1,$C286,ROW($C$337)-ROW($C286)),0))","v":6},{"$f":"IF(OR($C286=\"S\",$C286=0),0,MATCH(OFFSET($D286,0,$C286)+1,OFFSET($D286,1,$C286,ROW($C$337)-ROW($C286)),0))","v":2},"","Nível 2","Nível 2","-","SINAPI",null,"SERVIÇOS PRELIMINARES","-",null,1,"-",null,null,0,0,""]
["S",2,"S",0,13,1,0,0,0,{"$f":"IF(OR($C287=\"S\",$C287=0),0,MATCH(0,OFFSET($D287,1,$C287,ROW($C$337)-ROW($C287)),0))","v":0},{"$f":"IF(OR($C287=\"S\",$C287=0),0,MATCH(OFFSET($D287,0,$C287)+1,OFFSET($D287,1,$C287,ROW($C$337)-ROW($C287)),0))","v":0},"","Serviço","Serviço","-","AGETOP",20106,"RETIRADA DE JANELAS OU PORTAIS C/ TRANSP. ATÉ CB. E CARGA","m2    ",6.15,1,6.15,null,null,0,0,""]
[2,2,2,2,13,2,0,0,0,{"$f":"IF(OR($C288=\"S\",$C288=0),0,MATCH(0,OFFSET($D288,1,$C288,ROW($C$337)-ROW($C288)),0))","v":4},{"$f":"IF(OR($C288=\"S\",$C288=0),0,MATCH(OFFSET($D288,0,$C288)+1,OFFSET($D288,1,$C288,ROW($C$337)-ROW($C288)),0))","v":2},"","Nível 2","Nível 2","-","SINAPI",null,"ESQUADRIAS METÁLICAS","-",null,1,"-",null,null,0,0,""]
["S",2,"S",0,13,2,0,0,0,{"$f":"IF(OR($C289=\"S\",$C289=0),0,MATCH(0,OFFSET($D289,1,$C289,ROW($C$337)-ROW($C289)),0))","v":0},{"$f":"IF(OR($C289=\"S\",$C289=0),0,MATCH(OFFSET($D289,0,$C289)+1,OFFSET($D289,1,$C289,ROW($C$337)-ROW($C289)),0))","v":0},"","Serviço","Serviço","-","AGETOP",180304,"PORTAO DE ABRIR CHAPA 14  PT-4 C/FERRAGENS","m2    ",6.15,1,6.15,null,null,0,0,""]
[2,2,2,2,13,3,0,0,0,{"$f":"IF(OR($C290=\"S\",$C290=0),0,MATCH(0,OFFSET($D290,1,$C290,ROW($C$337)-ROW($C290)),0))","v":2},{"$f":"IF(OR($C290=\"S\",$C290=0),0,MATCH(OFFSET($D290,0,$C290)+1,OFFSET($D290,1,$C290,ROW($C$337)-ROW($C290)),0))","v":{"$error":"#N/A"}},"","Nível 2","Nível 2","-","SINAPI",null,"PINTURA","-",null,1,"-",null,null,0,0,""]
["S",2,"S",0,13,3,0,0,0,{"$f":"IF(OR($C291=\"S\",$C291=0),0,MATCH(0,OFFSET($D291,1,$C291,ROW($C$337)-ROW($C291)),0))","v":0},{"$f":"IF(OR($C291=\"S\",$C291=0),0,MATCH(OFFSET($D291,0,$C291)+1,OFFSET($D291,1,$C291,ROW($C$337)-ROW($C291)),0))","v":0},"","Serviço","Serviço","-","AGETOP",261602,"PINT.ESMALTE/ESQUAD.FERRO C/FUNDO ANTICOR.","m2    ",18.450000000000003,1,18.450000000000003,null,null,0,0,""]
[1,1,1,5,14,0,0,0,0,{"$f":"IF(OR($C292=\"S\",$C292=0),0,MATCH(0,OFFSET($D292,1,$C292,ROW($C$337)-ROW($C292)),0))","v":45},{"$f":"IF(OR($C292=\"S\",$C292=0),0,MATCH(OFFSET($D292,0,$C292)+1,OFFSET($D292,1,$C292,ROW($C$337)-ROW($C292)),0))","v":5},"F","Nível 1","Nível 1","14.","SINAPI",null,"PISO PÁTIO","UN",1,1,1,null,null,0,0,""]
[2,2,2,2,14,1,0,0,0,{"$f":"IF(OR($C293=\"S\",$C293=0),0,MATCH(0,OFFSET($D293,1,$C293,ROW($C$337)-ROW($C293)),0))","v":4},{"$f":"IF(OR($C293=\"S\",$C293=0),0,MATCH(OFFSET($D293,0,$C293)+1,OFFSET($D293,1,$C293,ROW($C$337)-ROW($C293)),0))","v":2},"","Nível 2","Nível 2","-","SINAPI",null,"SERVIÇOS PRELIMINARES","-",null,1,"-",null,null,0,0,""]
[{"$f":"CHOOSE(1+LOG(1+2*(ORÇAMENTO.Nivel=\"Nível 1\")+4*(ORÇAMENTO.Nivel=\"Nível 2\")+8*(ORÇAMENTO.Nivel=\"Nível 3\")+16*(ORÇAMENTO.Nivel=\"Nível 4\")+32*(ORÇAMENTO.Nivel=\"Serviço\"),2),0,1,2,3,4,\"S\")","v":"S"},2,"S",0,14,1,0,0,0,{"$f":"IF(OR($C294=\"S\",$C294=0),0,MATCH(0,OFFSET($D294,1,$C294,ROW($C$337)-ROW($C294)),0))","v":0},{"$f":"IF(OR($C294=\"S\",$C294=0),0,MATCH(OFFSET($D294,0,$C294)+1,OFFSET($D294,1,$C294,ROW($C$337)-ROW($C294)),0))","v":0},"","Serviço","Serviço","-","AGETOP",20121,"DEM. MANUAL EM CONCR.SIMPLES C/TR.ATE CB.E CARGA (O.C.)","m3    ",4.01,1,4.01,null,null,0,0,""]
[2,2,2,2,14,2,0,0,0,{"$f":"IF(OR($C295=\"S\",$C295=0),0,MATCH(0,OFFSET($D295,1,$C295,ROW($C$337)-ROW($C295)),0))","v":2},{"$f":"IF(OR($C295=\"S\",$C295=0),0,MATCH(OFFSET($D295,0,$C295)+1,OFFSET($D295,1,$C295,ROW($C$337)-ROW($C295)),0))","v":7},"","Nível 2","Nível 2","-","SINAPI",null,"REVESTIMENTO DE PISO","-",null,1,"-",null,null,0,0,""]
["S",2,"S",0,14,2,0,0,0,{"$f":"IF(OR($C296=\"S\",$C296=0),0,MATCH(0,OFFSET($D296,1,$C296,ROW($C$337)-ROW($C296)),0))","v":0},{"$f":"IF(OR($C296=\"S\",$C296=0),0,MATCH(OFFSET($D296,0,$C296)+1,OFFSET($D296,1,$C296,ROW($C$337)-ROW($C296)),0))","v":0},"","Serviço","Serviço","-","AGETOP",220102,"PISO CONCRETO DESEMPENADO ESPESSURA = 5 CM  1:2,5:3,5","m2    ",80.23,1,80.23,null,null,0,0,""]
[1,1,1,7,15,0,0,0,0,{"$f":"IF(OR($C297=\"S\",$C297=0),0,MATCH(0,OFFSET($D297,1,$C297,ROW($C$337)-ROW($C297)),0))","v":40},{"$f":"IF(OR($C297=\"S\",$C297=0),0,MATCH(OFFSET($D297,0,$C297)+1,OFFSET($D297,1,$C297,ROW($C$337)-ROW($C297)),0))","v":7},"F","Nível 1","Nível 1","15.","SINAPI",null,"MURO FUNDO","UN",1,1,1,null,null,0,0,""]
[2,2,2,2,15,1,0,0,0,{"$f":"IF(OR($C298=\"S\",$C298=0),0,MATCH(0,OFFSET($D298,1,$C298,ROW($C$337)-ROW($C298)),0))","v":6},{"$f":"IF(OR($C298=\"S\",$C298=0),0,MATCH(OFFSET($D298,0,$C298)+1,OFFSET($D298,1,$C298,ROW($C$337)-ROW($C298)),0))","v":2},"","Nível 2","Nível 2","-","SINAPI",null,"REVESTIMENTO DE PAREDE","-",null,1,"-",null,null,0,0,""]
["S",2,"S",0,15,1,0,0,0,{"$f":"IF(OR($C299=\"S\",$C299=0),0,MATCH(0,OFFSET($D299,1,$C299,ROW($C$337)-ROW($C299)),0))","v":0},{"$f":"IF(OR($C299=\"S\",$C299=0),0,MATCH(OFFSET($D299,0,$C299)+1,OFFSET($D299,1,$C299,ROW($C$337)-ROW($C299)),0))","v":0},"","Serviço","Serviço","-","SINAPI",87547,"MASSA ÚNICA, PARA RECEBIMENTO DE PINTURA, EM ARGAMASSA TRAÇO 1:2:8, PREPARO MECÂNICO COM BETONEIRA 400L, APLICADA MANUALMENTE EM FACES INTERNAS DE PAREDES, ESPESSURA DE 10MM, COM EXECUÇÃO DE TALISCAS. AF_06/2014","M2",116,1,116,null,null,0,0,""]
[2,2,2,2,15,2,0,0,0,{"$f":"IF(OR($C300=\"S\",$C300=0),0,MATCH(0,OFFSET($D300,1,$C300,ROW($C$337)-ROW($C300)),0))","v":4},{"$f":"IF(OR($C300=\"S\",$C300=0),0,MATCH(OFFSET($D300,0,$C300)+1,OFFSET($D300,1,$C300,ROW($C$337)-ROW($C300)),0))","v":2},"","Nível 2","Nível 2","-","SINAPI",null,"PINTURA","-",null,1,"-",null,null,0,0,""]
["S",2,"S",0,15,2,0,0,0,{"$f":"IF(OR($C301=\"S\",$C301=0),0,MATCH(0,OFFSET($D301,1,$C301,ROW($C$337)-ROW($C301)),0))","v":0},{"$f":"IF(OR($C301=\"S\",$C301=0),0,MATCH(OFFSET($D301,0,$C301)+1,OFFSET($D301,1,$C301,ROW($C$337)-ROW($C301)),0))","v":0},"","Serviço","Serviço","-","AGETOP",261000,"PINTURA LATEX ACRILICA 2 DEMAOS C/SELADOR","m2    ",116,1,116,null,null,0,0,""]
[2,2,2,2,15,3,0,0,0,{"$f":"IF(OR($C302=\"S\",$C302=0),0,MATCH(0,OFFSET($D302,1,$C302,ROW($C$337)-ROW($C302)),0))","v":2},{"$f":"IF(OR($C302=\"S\",$C302=0),0,MATCH(OFFSET($D302,0,$C302)+1,OFFSET($D302,1,$C302,ROW($C$337)-ROW($C302)),0))","v":{"$error":"#N/A"}},"","Nível 2","Nível 2","-","SINAPI",null,"DIVERSOS","-",null,1,"-",null,null,0,0,""]
["S",2,"S",0,15,3,0,0,0,{"$f":"IF(OR($C303=\"S\",$C303=0),0,MATCH(0,OFFSET($D303,1,$C303,ROW($C$337)-ROW($C303)),0))","v":0},{"$f":"IF(OR($C303=\"S\",$C303=0),0,MATCH(OFFSET($D303,0,$C303)+1,OFFSET($D303,1,$C303,ROW($C$337)-ROW($C303)),0))","v":0},"","Serviço","Serviço","-","COMPOSIÇÃO","COMP 196_SEE","COMPL. DE MURO DE ALV. DE TIJ. FURADO - 1/2 VEZ - C/ CHP. PEDRISCO - H=0,50 M","M",116,1,116,null,null,0,0,""]
[1,1,1,5,16,0,0,0,0,{"$f":"IF(OR($C304=\"S\",$C304=0),0,MATCH(0,OFFSET($D304,1,$C304,ROW($C$337)-ROW($C304)),0))","v":33},{"$f":"IF(OR($C304=\"S\",$C304=0),0,MATCH(OFFSET($D304,0,$C304)+1,OFFSET($D304,1,$C304,ROW($C$337)-ROW($C304)),0))","v":5},"F","Nível 1","Nível 1","16.","SINAPI",null,"MURO FUNDO","UN",1,1,1,null,null,0,0,""]
[2,2,2,2,16,1,0,0,0,{"$f":"IF(OR($C305=\"S\",$C305=0),0,MATCH(0,OFFSET($D305,1,$C305,ROW($C$337)-ROW($C305)),0))","v":4},{"$f":"IF(OR($C305=\"S\",$C305=0),0,MATCH(OFFSET($D305,0,$C305)+1,OFFSET($D305,1,$C305,ROW($C$337)-ROW($C305)),0))","v":2},"","Nível 2","Nível 2","-","SINAPI",null,"REVESTIMENTO DE PAREDE","-",null,1,"-",null,null,0,0,""]
["S",2,"S",0,16,1,0,0,0,{"$f":"IF(OR($C306=\"S\",$C306=0),0,MATCH(0,OFFSET($D306,1,$C306,ROW($C$337)-ROW($C306)),0))","v":0},{"$f":"IF(OR($C306=\"S\",$C306=0),0,MATCH(OFFSET($D306,0,$C306)+1,OFFSET($D306,1,$C306,ROW($C$337)-ROW($C306)),0))","v":0},"","Serviço","Serviço","-","AGETOP",201410,"MOLDURA TIPO \"U\" INVERTIDO EM ARGAMASSA COM 2CM DE ESPESSURA TIPO PINGADEIRA EM MURO/PLATIBANDA ( A PARTE VERTICAL DESCE 2,5CM)","m2    ",118.4,1,118.4,null,null,0,0,""]
[2,2,2,2,16,2,0,0,0,{"$f":"IF(OR($C307=\"S\",$C307=0),0,MATCH(0,OFFSET($D307,1,$C307,ROW($C$337)-ROW($C307)),0))","v":2},{"$f":"IF(OR($C307=\"S\",$C307=0),0,MATCH(OFFSET($D307,0,$C307)+1,OFFSET($D307,1,$C307,ROW($C$337)-ROW($C307)),0))","v":{"$error":"#N/A"}},"","Nível 2","Nível 2","-","SINAPI",null,"PINTURA","-",null,1,"-",null,null,0,0,""]
["S",{"$f":"IF(OR(C308=\"s\",C308=0),OFFSET(B308,-1,0),C308)","v":2},{"$f":"IF(OFFSET(C308,-1,0)=\"L\",1,IF(OFFSET(C308,-1,0)=1,2,IF(OR(A308=\"s\",A308=0),\"S\",IF(AND(OFFSET(C308,-1,0)=2,A308=4),3,IF(AND(OR(OFFSET(C308,-1,0)=\"s\",OFFSET(C308,-1,0)=0),A308<>\"s\",A308>OFFSET(B308,-1,0)),OFFSET(B308,-1,0),A308)))))","v":"S"},{"$f":"IF(OR(C308=\"S\",C308=0),0,IF(ISERROR(K308),J308,SMALL(J308:K308,1)))","v":0},{"$f":"IF($C308=1,OFFSET(E308,-1,0)+1,OFFSET(E308,-1,0))","v":16},{"$f":"IF($C308=1,0,IF($C308=2,OFFSET(F308,-1,0)+1,OFFSET(F308,-1,0)))","v":2},{"$f":"IF(AND($C308<=2,$C308<>0),0,IF($C308=3,OFFSET(G308,-1,0)+1,OFFSET(G308,-1,0)))","v":0},{"$f":"IF(AND($C308<=3,$C308<>0),0,IF($C308=4,OFFSET(H308,-1,0)+1,OFFSET(H308,-1,0)))","v":0},{"$f":"IF(AND($C308<=4,$C308<>0),0,IF(AND($C308=\"S\",$Y308>0),OFFSET(I308,-1,0)+1,OFFSET(I308,-1,0)))","v":0},{"$f":"IF(OR($C308=\"S\",$C308=0),0,MATCH(0,OFFSET($D308,1,$C308,ROW($C$337)-ROW($C308)),0))","v":0},{"$f":"IF(OR($C308=\"S\",$C308=0),0,MATCH(OFFSET($D308,0,$C308)+1,OFFSET($D308,1,$C308,ROW($C$337)-ROW($C308)),0))","v":0},"","Serviço","Serviço","-","AGETOP",261000,"PINTURA LATEX ACRILICA 2 DEMAOS C/SELADOR","m2    ",1657.45,1,1657.45,null,null,0,0,""]
[1,1,1,21,17,0,0,0,0,{"$f":"IF(OR($C309=\"S\",$C309=0),0,MATCH(0,OFFSET($D309,1,$C309,ROW($C$337)-ROW($C309)),0))","v":28},{"$f":"IF(OR($C309=\"S\",$C309=0),0,MATCH(OFFSET($D309,0,$C309)+1,OFFSET($D309,1,$C309,ROW($C$337)-ROW($C309)),0))","v":21},"F","Nível 1","Nível 1","17.","SINAPI",null,"PINTURA GERAL","UN",1,1,1,null,null,0,0,""]
[2,2,2,20,17,1,0,0,0,{"$f":"IF(OR($C310=\"S\",$C310=0),0,MATCH(0,OFFSET($D310,1,$C310,ROW($C$337)-ROW($C310)),0))","v":20},{"$f":"IF(OR($C310=\"S\",$C310=0),0,MATCH(OFFSET($D310,0,$C310)+1,OFFSET($D310,1,$C310,ROW($C$337)-ROW($C310)),0))","v":23},"","Nível 2","Nível 2","-","SINAPI",null,"PINTURA","-",null,1,"-",null,null,0,0,""]
[3,3,3,4,17,1,1,0,0,{"$f":"IF(OR($C311=\"S\",$C311=0),0,MATCH(0,OFFSET($D311,1,$C311,ROW($C$337)-ROW($C311)),0))","v":19},{"$f":"IF(OR($C311=\"S\",$C311=0),0,MATCH(OFFSET($D311,0,$C311)+1,OFFSET($D311,1,$C311,ROW($C$337)-ROW($C311)),0))","v":4},"","Nível 3","Nível 3","-","SINAPI",null,"ESMALTE SINTÉTICO","-",null,1,"-",null,null,0,0,""]
["S",3,"S",0,17,1,1,0,0,{"$f":"IF(OR($C312=\"S\",$C312=0),0,MATCH(0,OFFSET($D312,1,$C312,ROW($C$337)-ROW($C312)),0))","v":0},{"$f":"IF(OR($C312=\"S\",$C312=0),0,MATCH(OFFSET($D312,0,$C312)+1,OFFSET($D312,1,$C312,ROW($C$337)-ROW($C312)),0))","v":0},"","Serviço","Serviço","-","AGETOP",260105,"REMOCAO DE PINTURA ANTIGA A OLEO OU ESMALTE","m2    ",299.02,1,299.02,null,null,0,0,""]
["S",3,"S",0,17,1,1,0,0,{"$f":"IF(OR($C313=\"S\",$C313=0),0,MATCH(0,OFFSET($D313,1,$C313,ROW($C$337)-ROW($C313)),0))","v":0},{"$f":"IF(OR($C313=\"S\",$C313=0),0,MATCH(OFFSET($D313,0,$C313)+1,OFFSET($D313,1,$C313,ROW($C$337)-ROW($C313)),0))","v":0},"","Serviço","Serviço","-","AGETOP",261300,"EMASSAMENTO COM MASSA PVA DUAS DEMAOS","m2    ",299.02,1,299.02,null,null,0,0,""]
["S",3,"S",0,17,1,1,0,0,{"$f":"IF(OR($C314=\"S\",$C314=0),0,MATCH(0,OFFSET($D314,1,$C314,ROW($C$337)-ROW($C314)),0))","v":0},{"$f":"IF(OR($C314=\"S\",$C314=0),0,MATCH(OFFSET($D314,0,$C314)+1,OFFSET($D314,1,$C314,ROW($C$337)-ROW($C314)),0))","v":0},"","Serviço","Serviço","-","AGETOP",261550,"PINT.ESMALTE SINT.PAREDES - 2 DEM.C/SELADOR","m2    ",951.24,1,951.24,null,null,0,0,""]
[3,3,3,4,17,1,2,0,0,{"$f":"IF(OR($C315=\"S\",$C315=0),0,MATCH(0,OFFSET($D315,1,$C315,ROW($C$337)-ROW($C315)),0))","v":15},{"$f":"IF(OR($C315=\"S\",$C315=0),0,MATCH(OFFSET($D315,0,$C315)+1,OFFSET($D315,1,$C315,ROW($C$337)-ROW($C315)),0))","v":4},"","Nível 3","Nível 3","-","AGETOP",null,"LÁTEX ACRÍLICA","-",null,1,"-",null,null,0,0,""]
["S",3,"S",0,17,1,2,0,0,{"$f":"IF(OR($C316=\"S\",$C316=0),0,MATCH(0,OFFSET($D316,1,$C316,ROW($C$337)-ROW($C316)),0))","v":0},{"$f":"IF(OR($C316=\"S\",$C316=0),0,MATCH(OFFSET($D316,0,$C316)+1,OFFSET($D316,1,$C316,ROW($C$337)-ROW($C316)),0))","v":0},"","Serviço","Serviço","-","AGETOP",260104,"REMOCAO DE PINTURA ANTIGA A LATEX","m2    ",415.96,1,415.96,null,null,0,0,""]
["S",3,"S",0,17,1,2,0,0,{"$f":"IF(OR($C317=\"S\",$C317=0),0,MATCH(0,OFFSET($D317,1,$C317,ROW($C$337)-ROW($C317)),0))","v":0},{"$f":"IF(OR($C317=\"S\",$C317=0),0,MATCH(OFFSET($D317,0,$C317)+1,OFFSET($D317,1,$C317,ROW($C$337)-ROW($C317)),0))","v":0},"","Serviço","Serviço","-","AGETOP",261300,"EMASSAMENTO COM MASSA PVA DUAS DEMAOS","m2    ",415.96,1,415.96,null,null,0,0,""]
["S",3,"S",0,17,1,2,0,0,{"$f":"IF(OR($C318=\"S\",$C318=0),0,MATCH(0,OFFSET($D318,1,$C318,ROW($C$337)-ROW($C318)),0))","v":0},{"$f":"IF(OR($C318=\"S\",$C318=0),0,MATCH(OFFSET($D318,0,$C318)+1,OFFSET($D318,1,$C318,ROW($C$337)-ROW($C318)),0))","v":0},"","Serviço","Serviço","-","AGETOP",261001,"PINTURA LATEX ACRILICO 2 DEMAOS","m2    ",1426.87,1,1426.87,null,null,0,0,""]
[3,3,3,4,17,1,3,0,0,{"$f":"IF(OR($C319=\"S\",$C319=0),0,MATCH(0,OFFSET($D319,1,$C319,ROW($C$337)-ROW($C319)),0))","v":11},{"$f":"IF(OR($C319=\"S\",$C319=0),0,MATCH(OFFSET($D319,0,$C319)+1,OFFSET($D319,1,$C319,ROW($C$337)-ROW($C319)),0))","v":4},"","Nível 3","Nível 3","-","AGETOP",null,"TETO","-",null,1,"-",null,null,0,0,""]
["S",3,"S",0,17,1,3,0,0,{"$f":"IF(OR($C320=\"S\",$C320=0),0,MATCH(0,OFFSET($D320,1,$C320,ROW($C$337)-ROW($C320)),0))","v":0},{"$f":"IF(OR($C320=\"S\",$C320=0),0,MATCH(OFFSET($D320,0,$C320)+1,OFFSET($D320,1,$C320,ROW($C$337)-ROW($C320)),0))","v":0},"","Serviço","Serviço","-","AGETOP",260104,"REMOCAO DE PINTURA ANTIGA A LATEX","m2    ",474.07,1,474.07,null,null,0,0,""]
["S",3,"S",0,17,1,3,0,0,{"$f":"IF(OR($C321=\"S\",$C321=0),0,MATCH(0,OFFSET($D321,1,$C321,ROW($C$337)-ROW($C321)),0))","v":0},{"$f":"IF(OR($C321=\"S\",$C321=0),0,MATCH(OFFSET($D321,0,$C321)+1,OFFSET($D321,1,$C321,ROW($C$337)-ROW($C321)),0))","v":0},"","Serviço","Serviço","-","AGETOP",261300,"EMASSAMENTO COM MASSA PVA DUAS DEMAOS","m2    ",474.07,1,474.07,null,null,0,0,""]
["S",3,"S",0,17,1,3,0,0,{"$f":"IF(OR($C322=\"S\",$C322=0),0,MATCH(0,OFFSET($D322,1,$C322,ROW($C$337)-ROW($C322)),0))","v":0},{"$f":"IF(OR($C322=\"S\",$C322=0),0,MATCH(OFFSET($D322,0,$C322)+1,OFFSET($D322,1,$C322,ROW($C$337)-ROW($C322)),0))","v":0},"","Serviço","Serviço","-","AGETOP",261307,"PINTURA PVA LATEX 2 DEMAOS SEM SELADOR","m2    ",1707.04,1,1707.04,null,null,0,0,""]
[3,3,3,4,17,1,4,0,0,{"$f":"IF(OR($C323=\"S\",$C323=0),0,MATCH(0,OFFSET($D323,1,$C323,ROW($C$337)-ROW($C323)),0))","v":7},{"$f":"IF(OR($C323=\"S\",$C323=0),0,MATCH(OFFSET($D323,0,$C323)+1,OFFSET($D323,1,$C323,ROW($C$337)-ROW($C323)),0))","v":4},"","Nível 3","Nível 3","-","SINAPI",null,"EXTERNA","-",null,1,"-",null,null,0,0,""]
["S",3,"S",0,17,1,4,0,0,{"$f":"IF(OR($C324=\"S\",$C324=0),0,MATCH(0,OFFSET($D324,1,$C324,ROW($C$337)-ROW($C324)),0))","v":0},{"$f":"IF(OR($C324=\"S\",$C324=0),0,MATCH(OFFSET($D324,0,$C324)+1,OFFSET($D324,1,$C324,ROW($C$337)-ROW($C324)),0))","v":0},"","Serviço","Serviço","-","AGETOP",261000,"PINTURA LATEX ACRILICA 2 DEMAOS C/SELADOR","m2    ",813.14,1,813.14,null,null,0,0,""]
[{"$f":"CHOOSE(1+LOG(1+2*(ORÇAMENTO.Nivel=\"Nível 1\")+4*(ORÇAMENTO.Nivel=\"Nível 2\")+8*(ORÇAMENTO.Nivel=\"Nível 3\")+16*(ORÇAMENTO.Nivel=\"Nível 4\")+32*(ORÇAMENTO.Nivel=\"Serviço\"),2),0,1,2,3,4,\"S\")","v":"S"},{"$f":"IF(OR(C325=\"s\",C325=0),OFFSET(B325,-1,0),C325)","v":3},{"$f":"IF(OFFSET(C325,-1,0)=\"L\",1,IF(OFFSET(C325,-1,0)=1,2,IF(OR(A325=\"s\",A325=0),\"S\",IF(AND(OFFSET(C325,-1,0)=2,A325=4),3,IF(AND(OR(OFFSET(C325,-1,0)=\"s\",OFFSET(C325,-1,0)=0),A325<>\"s\",A325>OFFSET(B325,-1,0)),OFFSET(B325,-1,0),A325)))))","v":"S"},{"$f":"IF(OR(C325=\"S\",C325=0),0,IF(ISERROR(K325),J325,SMALL(J325:K325,1)))","v":0},{"$f":"IF($C325=1,OFFSET(E325,-1,0)+1,OFFSET(E325,-1,0))","v":17},{"$f":"IF($C325=1,0,IF($C325=2,OFFSET(F325,-1,0)+1,OFFSET(F325,-1,0)))","v":1},{"$f":"IF(AND($C325<=2,$C325<>0),0,IF($C325=3,OFFSET(G325,-1,0)+1,OFFSET(G325,-1,0)))","v":4},{"$f":"IF(AND($C325<=3,$C325<>0),0,IF($C325=4,OFFSET(H325,-1,0)+1,OFFSET(H325,-1,0)))","v":0},{"$f":"IF(AND($C325<=4,$C325<>0),0,IF(AND($C325=\"S\",$Y325>0),OFFSET(I325,-1,0)+1,OFFSET(I325,-1,0)))","v":0},{"$f":"IF(OR($C325=\"S\",$C325=0),0,MATCH(0,OFFSET($D325,1,$C325,ROW($C$337)-ROW($C325)),0))","v":0},{"$f":"IF(OR($C325=\"S\",$C325=0),0,MATCH(OFFSET($D325,0,$C325)+1,OFFSET($D325,1,$C325,ROW($C$337)-ROW($C325)),0))","v":0},"","Serviço","Serviço","-","AGETOP",260601,"PINTURA TEXTURIZADA C/SELADOR ACRILICO","m2    ",430.7,1,430.7,null,null,0,0,""]
[{"$f":"CHOOSE(1+LOG(1+2*(ORÇAMENTO.Nivel=\"Nível 1\")+4*(ORÇAMENTO.Nivel=\"Nível 2\")+8*(ORÇAMENTO.Nivel=\"Nível 3\")+16*(ORÇAMENTO.Nivel=\"Nível 4\")+32*(ORÇAMENTO.Nivel=\"Serviço\"),2),0,1,2,3,4,\"S\")","v":"S"},{"$f":"IF(OR(C326=\"s\",C326=0),OFFSET(B326,-1,0),C326)","v":3},{"$f":"IF(OFFSET(C326,-1,0)=\"L\",1,IF(OFFSET(C326,-1,0)=1,2,IF(OR(A326=\"s\",A326=0),\"S\",IF(AND(OFFSET(C326,-1,0)=2,A326=4),3,IF(AND(OR(OFFSET(C326,-1,0)=\"s\",OFFSET(C326,-1,0)=0),A326<>\"s\",A326>OFFSET(B326,-1,0)),OFFSET(B326,-1,0),A326)))))","v":"S"},{"$f":"IF(OR(C326=\"S\",C326=0),0,IF(ISERROR(K326),J326,SMALL(J326:K326,1)))","v":0},{"$f":"IF($C326=1,OFFSET(E326,-1,0)+1,OFFSET(E326,-1,0))","v":17},{"$f":"IF($C326=1,0,IF($C326=2,OFFSET(F326,-1,0)+1,OFFSET(F326,-1,0)))","v":1},{"$f":"IF(AND($C326<=2,$C326<>0),0,IF($C326=3,OFFSET(G326,-1,0)+1,OFFSET(G326,-1,0)))","v":4},{"$f":"IF(AND($C326<=3,$C326<>0),0,IF($C326=4,OFFSET(H326,-1,0)+1,OFFSET(H326,-1,0)))","v":0},{"$f":"IF(AND($C326<=4,$C326<>0),0,IF(AND($C326=\"S\",$Y326>0),OFFSET(I326,-1,0)+1,OFFSET(I326,-1,0)))","v":0},{"$f":"IF(OR($C326=\"S\",$C326=0),0,MATCH(0,OFFSET($D326,1,$C326,ROW($C$337)-ROW($C326)),0))","v":0},{"$f":"IF(OR($C326=\"S\",$C326=0),0,MATCH(OFFSET($D326,0,$C326)+1,OFFSET($D326,1,$C326,ROW($C$337)-ROW($C326)),0))","v":0},"","Serviço","Serviço","-","AGETOP",260902,"PINTURA C/VERNIZ ACRILICO-02 DEMAOS","m2    ",766.32,1,766.32,null,null,0,0,""]
[3,3,3,3,17,1,5,0,0,{"$f":"IF(OR($C327=\"S\",$C327=0),0,MATCH(0,OFFSET($D327,1,$C327,ROW($C$337)-ROW($C327)),0))","v":3},{"$f":"IF(OR($C327=\"S\",$C327=0),0,MATCH(OFFSET($D327,0,$C327)+1,OFFSET($D327,1,$C327,ROW($C$337)-ROW($C327)),0))","v":{"$error":"#N/A"}},"","Nível 3","Nível 3","-","SINAPI",null,"ESQ. METÁLICAS","-",null,1,"-",null,null,0,0,""]
["S",3,"S",0,17,1,5,0,0,{"$f":"IF(OR($C328=\"S\",$C328=0),0,MATCH(0,OFFSET($D328,1,$C328,ROW($C$337)-ROW($C328)),0))","v":0},{"$f":"IF(OR($C328=\"S\",$C328=0),0,MATCH(OFFSET($D328,0,$C328)+1,OFFSET($D328,1,$C328,ROW($C$337)-ROW($C328)),0))","v":0},"","Serviço","Serviço","-","AGETOP",260105,"REMOCAO DE PINTURA ANTIGA A OLEO OU ESMALTE","m2    ",1345.17,1,1345.17,null,null,0,0,""]
["S",3,"S",0,17,1,5,0,0,{"$f":"IF(OR($C329=\"S\",$C329=0),0,MATCH(0,OFFSET($D329,1,$C329,ROW($C$337)-ROW($C329)),0))","v":0},{"$f":"IF(OR($C329=\"S\",$C329=0),0,MATCH(OFFSET($D329,0,$C329)+1,OFFSET($D329,1,$C329,ROW($C$337)-ROW($C329)),0))","v":0},"","Serviço","Serviço","-","AGETOP",261602,"PINT.ESMALTE/ESQUAD.FERRO C/FUNDO ANTICOR.","m2    ",1345.17,1,1345.17,null,null,0,0,""]
[1,1,1,7,18,0,0,0,0,{"$f":"IF(OR($C330=\"S\",$C330=0),0,MATCH(0,OFFSET($D330,1,$C330,ROW($C$337)-ROW($C330)),0))","v":7},{"$f":"IF(OR($C330=\"S\",$C330=0),0,MATCH(OFFSET($D330,0,$C330)+1,OFFSET($D330,1,$C330,ROW($C$337)-ROW($C330)),0))","v":{"$error":"#N/A"}},"F","Nível 1","Nível 1","18.","SINAPI",null,"ACESSIBILIDADE","UN",1,1,1,null,null,0,0,""]
[2,2,2,2,18,1,0,0,0,{"$f":"IF(OR($C331=\"S\",$C331=0),0,MATCH(0,OFFSET($D331,1,$C331,ROW($C$337)-ROW($C331)),0))","v":6},{"$f":"IF(OR($C331=\"S\",$C331=0),0,MATCH(OFFSET($D331,0,$C331)+1,OFFSET($D331,1,$C331,ROW($C$337)-ROW($C331)),0))","v":2},"","Nível 2","Nível 2","-","SINAPI",null,"SERVIÇOS PRELIMINARES","-",null,1,"-",null,null,0,0,""]
[{"$f":"CHOOSE(1+LOG(1+2*(ORÇAMENTO.Nivel=\"Nível 1\")+4*(ORÇAMENTO.Nivel=\"Nível 2\")+8*(ORÇAMENTO.Nivel=\"Nível 3\")+16*(ORÇAMENTO.Nivel=\"Nível 4\")+32*(ORÇAMENTO.Nivel=\"Serviço\"),2),0,1,2,3,4,\"S\")","v":"S"},{"$f":"IF(OR(C332=\"s\",C332=0),OFFSET(B332,-1,0),C332)","v":2},{"$f":"IF(OFFSET(C332,-1,0)=\"L\",1,IF(OFFSET(C332,-1,0)=1,2,IF(OR(A332=\"s\",A332=0),\"S\",IF(AND(OFFSET(C332,-1,0)=2,A332=4),3,IF(AND(OR(OFFSET(C332,-1,0)=\"s\",OFFSET(C332,-1,0)=0),A332<>\"s\",A332>OFFSET(B332,-1,0)),OFFSET(B332,-1,0),A332)))))","v":"S"},{"$f":"IF(OR(C332=\"S\",C332=0),0,IF(ISERROR(K332),J332,SMALL(J332:K332,1)))","v":0},{"$f":"IF($C332=1,OFFSET(E332,-1,0)+1,OFFSET(E332,-1,0))","v":18},{"$f":"IF($C332=1,0,IF($C332=2,OFFSET(F332,-1,0)+1,OFFSET(F332,-1,0)))","v":1},{"$f":"IF(AND($C332<=2,$C332<>0),0,IF($C332=3,OFFSET(G332,-1,0)+1,OFFSET(G332,-1,0)))","v":0},{"$f":"IF(AND($C332<=3,$C332<>0),0,IF($C332=4,OFFSET(H332,-1,0)+1,OFFSET(H332,-1,0)))","v":0},{"$f":"IF(AND($C332<=4,$C332<>0),0,IF(AND($C332=\"S\",$Y332>0),OFFSET(I332,-1,0)+1,OFFSET(I332,-1,0)))","v":0},{"$f":"IF(OR($C332=\"S\",$C332=0),0,MATCH(0,OFFSET($D332,1,$C332,ROW($C$337)-ROW($C332)),0))","v":0},{"$f":"IF(OR($C332=\"S\",$C332=0),0,MATCH(OFFSET($D332,0,$C332)+1,OFFSET($D332,1,$C332,ROW($C$337)-ROW($C332)),0))","v":0},"","Serviço","Serviço","-","AGETOP",20121,"DEM. MANUAL EM CONCR.SIMPLES C/TR.ATE CB.E CARGA (O.C.)","m3    ",4.82,1,4.82,null,null,0,0,""]
[2,2,2,4,18,2,0,0,0,{"$f":"IF(OR($C333=\"S\",$C333=0),0,MATCH(0,OFFSET($D333,1,$C333,ROW($C$337)-ROW($C333)),0))","v":4},{"$f":"IF(OR($C333=\"S\",$C333=0),0,MATCH(OFFSET($D333,0,$C333)+1,OFFSET($D333,1,$C333,ROW($C$337)-ROW($C333)),0))","v":{"$error":"#N/A"}},"","Nível 2","Nível 2","-","SINAPI",null,"REVESTIMENTO DE PISO","-",null,1,"-",null,null,0,0,""]
["S",2,"S",0,18,2,0,0,0,{"$f":"IF(OR($C334=\"S\",$C334=0),0,MATCH(0,OFFSET($D334,1,$C334,ROW($C$337)-ROW($C334)),0))","v":0},{"$f":"IF(OR($C334=\"S\",$C334=0),0,MATCH(OFFSET($D334,0,$C334)+1,OFFSET($D334,1,$C334,ROW($C$337)-ROW($C334)),0))","v":0},"","Serviço","Serviço","-","AGETOP",220102,"PISO CONCRETO DESEMPENADO ESPESSURA = 5 CM  1:2,5:3,5","m2    ",7.5,1,7.5,null,null,0,0,""]
["S",2,"S",0,18,2,0,0,0,{"$f":"IF(OR($C335=\"S\",$C335=0),0,MATCH(0,OFFSET($D335,1,$C335,ROW($C$337)-ROW($C335)),0))","v":0},{"$f":"IF(OR($C335=\"S\",$C335=0),0,MATCH(OFFSET($D335,0,$C335)+1,OFFSET($D335,1,$C335,ROW($C$337)-ROW($C335)),0))","v":0},"","Serviço","Serviço","-","AGETOP",221120,"PISO DE BORRACHA COLORIDO MODELO TÁTIL ( ALERTA OU DIRECIONAL) INCLUSO CONTRAPISO (1CI:3ARML) C/ E=2CM E NATA DE CIMENTO","m2    ",5.0599999999999996,1,5.0599999999999996,null,null,0,0,""]
["S",2,"S",0,18,2,0,0,0,{"$f":"IF(OR($C336=\"S\",$C336=0),0,MATCH(0,OFFSET($D336,1,$C336,ROW($C$337)-ROW($C336)),0))","v":0},{"$f":"IF(OR($C336=\"S\",$C336=0),0,MATCH(OFFSET($D336,0,$C336)+1,OFFSET($D336,1,$C336,ROW($C$337)-ROW($C336)),0))","v":0},"","Serviço","Serviço","-","AGETOP",221126,"PISO DE LADRILHO HIDRÁULICO COLORIDO MODELO TÁTIL ( ALERTA OU DIRECIONAL) SEM LASTRO","m2    ",88.92,1,88.92,null,null,0,0,""]
[-1,null,-1,null,0,0,0,0,0,null,null,"F"]
[null,null,null,null,null,null,null,null,null,null,null,"F",null,null,null,null,null,"OBS: OS QUANTITATIVOS DE MATERIAIS  DAS INSTALAÇÕES HIDROSSANITÁRIAS, ELÉTRICAS E ESPECIAIS SÃO FORNECIDOS PELOS PROFISSIONAIS RESPONSÁVEIS PELOS RESPECTIVOS PROJETOS.",null,null,null,null,"VALOR TOTAL",null,null,0]
[null,null,null,null,null,null,null,null,null,null,null,"F",null,null,null,null,null,null,null,null,null,null,"VALOR BDI (24,37%)",null,null,0]
[null,null,null,null,null,null,null,null,null,null,null,"F",null,null,null,null,null,null,null,null,null,null,"TOTAL ORÇAMENTO",null,null,0]
[null,null,null,null,null,null,null,null,null,null,null,"F"]
[null,null,null,null,null,null,null,null,null,null,null,"F",null,null,null,null,null,null,null,null,null,null,"CUSTO POR M2 ³",null,null,0]
[null,null,null,null,null,null,null,null,null,null,null,"F",null,null,null,null,null,null,null,null,null,null,"MATERIAL S/ BDI",null,null,0]
[null,null,null,null,null,null,null,null,null,null,null,"F",null,null,null,null,null,null,null,null,null,null,"MÃO DE OBRA S/ BDI",null,null,0]
[null,null,null,null,null,null,null,null,null,null,null,"F"]
[null,null,null,null,null,null,null,null,null,null,null,"F",null,null,null,null,"(1) Conforme previsto pelo DECRETO Nº 7.983, DE 8 DE ABRIL DE 2013, os preços adotados são aqueles constantes dos sistemas de referência indicados. Justifica-se o uso dos preços destas composições de custos unitários devido ao seu valor ser menor à mediana de seus correspondentes na tabela SINAPI;"]
[null,null,null,null,null,null,null,null,null,null,null,"F",null,null,null,null,"(2) Optou-se pelo uso das composições de custos da AGETOP para itens não presentes na SINAPI;"]
[null,null,null,null,null,null,null,null,null,null,null,"F",null,null,null,null,"(3) Para itens da AGETOP, os vidros não estão inclusos nas esquadrias e já foram considerados os custos de contramarco para as esquadrias de alumínio;"]
[null,null,null,null,null,null,null,null,null,null,null,"F",null,null,null,null,"(4) Nos casos em que houver execução de granitina e omissão do item AGETOP 221102, considerou-se que o quantitativo para o rodapé, de altura igual a 7cm, foi incorporado na área de piso;"]
[null,null,null,null,null,null,null,null,null,null,null,"F",null,null,null,null,"(5) O custo unitário aproximado por metro quadrado é calculado dividindo-se o valor total do orçamento pela área total de construção."]
[null,null,null,null,null,null,null,null,null,null,null,"F"]
[null,null,null,null,null,null,null,null,null,null,null,"F"]
[]
[null,null,null,null,null,null,null,null,null,null,null,null,null,null,"SOMATÓRIO DE SERVIÇOS"]
[null,null,null,null,null,null,null,null,null,null,null,null,null,null,"ITEM","DESCRIÇÃO DOS SERVIÇOS",null,null,"PREÇO SEM BDI",null,null,null,null,"PREÇO COM BDI",null,null,"PARTICIPAÇÃO ( % )"]
[null,null,null,null,null,null,null,null,null,null,null,null,null,null,"a.","SERVIÇOS PRELIMINARES",null,null,0,null,null,null,null,0,null,null,0]
[null,null,null,null,null,null,null,null,null,null,null,null,null,null,"b.","TRANSPORTES",null,null,0,null,null,null,null,0,null,null,0]
[null,null,null,null,null,null,null,null,null,null,null,null,null,null,"c.","SERVIÇO EM TERRA",null,null,0,null,null,null,null,0,null,null,0]
[null,null,null,null,null,null,null,null,null,null,null,null,null,null,"d.","FUNDAÇÕES E SONDAGENS",null,null,0,null,null,null,null,0,null,null,0]
[null,null,null,null,null,null,null,null,null,null,null,null,null,null,"e.","ESTRUTURA",null,null,0,null,null,null,null,0,null,null,0]
[null,null,null,null,null,null,null,null,null,null,null,null,null,null,"f.","INSTALAÇÕES ELÉTRICAS",null,null,0,null,null,null,null,0,null,null,0]
[null,null,null,null,null,null,null,null,null,null,null,null,null,null,"g.","INSTALAÇÕES HIDROSSANITÁRIAS",null,null,0,null,null,null,null,0,null,null,0]
[null,null,null,null,null,null,null,null,null,null,null,null,null,null,"h","INSTALAÇÕES ESPECIAIS",null,null,0,null,null,null,null,0,null,null,0]
[null,null,null,null,null,null,null,null,null,null,null,null,null,null,"i.","ALVENARIAS E DIVISÓRIAS",null,null,0,null,null,null,null,0,null,null,0]
[null,null,null,null,null,null,null,null,null,null,null,null,null,null,"j.","ALVENARIA AUTO-PORTANTE",null,null,0,null,null,null,null,0,null,null,0]
[null,null,null,null,null,null,null,null,null,null,null,null,null,null,"k.","IMPERMEABILIZAÇÃO",null,null,0,null,null,null,null,0,null,null,0]
[null,null,null,null,null,null,null,null,null,null,null,null,null,null,"l.","ISOLAMENTO TÉRMICO E ACÚSTICO",null,null,0,null,null,null,null,0,null,null,0]
[null,null,null,null,null,null,null,null,null,null,null,null,null,null,"m.","ESTRUTURA DE MADEIRA",null,null,0,null,null,null,null,0,null,null,0]
[null,null,null,null,null,null,null,null,null,null,null,null,null,null,"n.","ESTRUTURAS METÁLICAS",null,null,0,null,null,null,null,0,null,null,0]
[null,null,null,null,null,null,null,null,null,null,null,null,null,null,"o.","COBERTURAS",null,null,0,null,null,null,null,0,null,null,0]
[null,null,null,null,null,null,null,null,null,null,null,null,null,null,"p.","ESQUADRIAS DE MADEIRA",null,null,0,null,null,null,null,0,null,null,0]
[null,null,null,null,null,null,null,null,null,null,null,null,null,null,"q.","ESQUADRIAS METÁLICAS",null,null,0,null,null,null,null,0,null,null,0]
[null,null,null,null,null,null,null,null,null,null,null,null,null,null,"r.","VIDROS",null,null,0,null,null,null,null,0,null,null,0]
[null,null,null,null,null,null,null,null,null,null,null,null,null,null,"s.","REVESTIMENTO DE PAREDE",null,null,0,null,null,null,null,0,null,null,0]
[null,null,null,null,null,null,null,null,null,null,null,null,null,null,"t.","FORROS",null,null,0,null,null,null,null,0,null,null,0]
[null,null,null,null,null,null,null,null,null,null,null,null,null,null,"u.","REVESTIMENTO DE PISO",null,null,0,null,null,null,null,0,null,null,0]
[null,null,null,null,null,null,null,null,null,null,null,null,null,null,"v.","FERRAGENS",null,null,0,null,null,null,null,0,null,null,0]
[null,null,null,null,null,null,null,null,null,null,null,null,null,null,"w.","MARCENARIA",null,null,0,null,null,null,null,0,null,null,0]
[null,null,null,null,null,null,null,null,null,null,null,null,null,null,"x.","ADMINISTRAÇÃO",null,null,0,null,null,null,null,0,null,null,0]
[null,null,null,null,null,null,null,null,null,null,null,null,null,null,"y.","PINTURA",null,null,0,null,null,null,null,0,null,null,0]
[null,null,null,null,null,null,null,null,null,null,null,null,null,null,"z.","DIVERSOS",null,null,0,null,null,null,null,0,null,null,0]
[null,null,null,null,null,null,null,null,null,null,null,null,null,null,"TOTAL GERAL DO ORÇAMENTO (R$)",null,null,null,0,null,null,null,null,0,null,null,0]
[null,null,null,null,null,null,null,null,null,null,null,null,null,null,null,null,null,null,0,null,null,null,null,0,null,null,100]
[null,null,null,null,null,null,null,null,null,null,null,null,null,null,null,null,null,null,"(TOTAL SEM BDI)",null,null,null,null,"(TOTAL COM BDI)",null,null,"(ARRED porcentagem)"]
[null,null,null,null,null,null,null,null,null,null,null,null,null,null,null,null,null,null,"ERRO",null,null,null,null,"ERRO",null,null,"ERRO"]
[]
[]
[null,null,null,null,null,null,null,null,null,null,null,null,null,null,"RESUMO GERAL DO ORÇAMENTO"]
[null,null,null,null,null,null,null,null,null,null,null,null,null,null,"ITEM","DESCRIÇÃO DOS SERVIÇOS",null,null,"PREÇO SEM BDI",null,null,null,null,"PREÇO COM BDI",null,null,"PARTICIPAÇÃO ( % )"]
[null,null,null,null,null,null,null,null,null,null,null,null,null,null,"1.","REFORMA",null,null,0,null,null,null,null,0,null,null,{"$error":"#DIV/0!"}]
[null,null,null,null,null,null,null,null,null,null,null,null,null,null,"2.","INST. ELÉTRICAS",null,null,0,null,null,null,null,0,null,null,{"$error":"#DIV/0!"}]
[null,null,null,null,null,null,null,null,null,null,null,null,null,null,"3.","INSTALAÇÕES HIDROSSANITÁRIAS E COMBATE À INCÊNDIO",null,null,0,null,null,null,null,0,null,null,{"$error":"#DIV/0!"}]
[null,null,null,null,null,null,null,null,null,null,null,null,null,null,"4.","GRAMA",null,null,0,null,null,null,null,0,null,null,{"$error":"#DIV/0!"}]
[null,null,null,null,null,null,null,null,null,null,null,null,null,null,"5.","ADAPTAÇÃO SANITÁRIO MAS. / FEM. BLOCO 03",null,null,0,null,null,null,null,0,null,null,{"$error":"#DIV/0!"}]
[null,null,null,null,null,null,null,null,null,null,null,null,null,null,"6.","ADAPTAÇÃO SANITÁRIO MAS. / FEM. BLOCO 06",null,null,0,null,null,null,null,0,null,null,{"$error":"#DIV/0!"}]
[null,null,null,null,null,null,null,null,null,null,null,null,null,null,"7.","REFORMA VESTIÁRIO - BLOCO G",null,null,0,null,null,null,null,0,null,null,{"$error":"#DIV/0!"}]
[null,null,null,null,null,null,null,null,null,null,null,null,null,null,"8.","SANITÁRIOS BLOCO 01",null,null,0,null,null,null,null,0,null,null,{"$error":"#DIV/0!"}]
[null,null,null,null,null,null,null,null,null,null,null,null,null,null,"9.","COZINHA BLOCO 08",null,null,0,null,null,null,null,0,null,null,{"$error":"#DIV/0!"}]
[null,null,null,null,null,null,null,null,null,null,null,null,null,null,"10.","CENTRAL DE GÁS",null,null,0,null,null,null,null,0,null,null,{"$error":"#DIV/0!"}]
[null,null,null,null,null,null,null,null,null,null,null,null,null,null,"11.","PISO ESTACIONAMENTO",null,null,0,null,null,null,null,0,null,null,{"$error":"#DIV/0!"}]
[null,null,null,null,null,null,null,null,null,null,null,null,null,null,"12.","CORRIMÃO",null,null,0,null,null,null,null,0,null,null,{"$error":"#DIV/0!"}]
[null,null,null,null,null,null,null,null,null,null,null,null,null,null,"13.","PORTÃO ACESSO",null,null,0,null,null,null,null,0,null,null,{"$error":"#DIV/0!"}]
[null,null,null,null,null,null,null,null,null,null,null,null,null,null,"14.","PISO PÁTIO",null,null,0,null,null,null,null,0,null,null,{"$error":"#DIV/0!"}]
[null,null,null,null,null,null,null,null,null,null,null,null,null,null,"15.","MURO FUNDO",null,null,0,null,null,null,null,0,null,null,{"$error":"#DIV/0!"}]
[null,null,null,null,null,null,null,null,null,null,null,null,null,null,"16.","MURO FUNDO",null,null,0,null,null,null,null,0,null,null,{"$error":"#DIV/0!"}]
[null,null,null,null,null,null,null,null,null,null,null,null,null,null,"17.","PINTURA GERAL",null,null,0,null,null,null,null,0,null,null,{"$error":"#DIV/0!"}]
[null,null,null,null,null,null,null,null,null,null,null,null,null,null,"18.","ACESSIBILIDADE",null,null,0,null,null,null,null,0,null,null,{"$error":"#DIV/0!"}]
[null,null,null,null,null,null,null,null,null,null,null,null,null,null,"19.","",null,null,0,null,null,null,null,0,null,null,{"$error":"#DIV/0!"}]
[null,null,null,null,null,null,null,null,null,null,null,null,null,null,"20.","",null,null,0,null,null,null,null,0,null,null,{"$error":"#DIV/0!"}]
[null,null,null,null,null,null,null,null,null,null,null,null,null,null,"TOTAL GERAL DO ORÇAMENTO (R$)",null,null,null,0,null,null,null,null,0,null,null,{"$error":"#DIV/0!"}]
[null,null,null,null,null,null,null,null,null,null,null,null,null,null,null,null,null,null,0,null,null,null,null,0,null,null,100]
[null,null,null,null,null,null,null,null,null,null,null,null,null,null,null,null,null,null,"(TOTAL SEM BDI)",null,null,null,null,"(TOTAL COM BDI)",null,null,"(ARRED porcentagem)"]
[null,null,null,null,null,null,null,null,null,null,null,null,null,null,null,null,null,null,"ERRO",null,null,null,null,"ERRO",null,null,{"$error":"#DIV/0!"}]

{"sheet":"Resumo ","index":1,"n_rows":39,"n_cols":9,"rows_kept":39,"cut":false,"hidden":false,"merged":[[13,0,14,0],[15,2,15,5],[16,2,16,5],[17,2,17,5],[18,2,18,5],[14,1,14,8],[0,1,0,8],[36,1,36,5],[2,1,2,5],[3,1,3,5],[5,1,5,5],[6,1,6,5],[8,1,8,5],[9,1,9,5],[11,3,11,5],[12,3,12,5],[10,1,10,8],[11,6,11,8],[12,6,12,8],[19,2,19,5],[20,2,20,5],[21,2,21,5],[31,2,31,5],[1,1,1,8],[2,6,2,8],[3,6,3,8],[4,1,4,8],[5,6,5,8],[6,6,6,8],[7,1,7,8],[8,6,8,8],[9,6,9,8],[13,1,13,8],[11,1,11,2],[12,1,12,2],[42,3,42,7],[41,3,41,7],[38,1,38,8],[22,2,22,5],[23,2,23,5],[24,2,24,5],[25,2,25,5],[26,2,26,5],[32,2,32,5],[33,2,33,5],[34,2,34,5],[35,2,35,5],[27,2,27,5],[28,2,28,5],[29,2,29,5],[30,2,30,5]]}
[]
[]
[null,"UNIDADE ESCOLAR",null,null,null,null,"CÓDIGO INEP"]
[null,{"$f":"Orçamento!$O$5","v":"COLÉGIO ESTADUAL ALVINO PEREIRA ROCHA"},null,null,null,null,{"$f":"Orçamento!X5","v":52093115}]
[]
[null,"OBRA",null,null,null,null,"CIDADE"]
[null,{"$f":"Orçamento!$O$8","v":"REFORMA"},null,null,null,null,{"$f":"Orçamento!$X$8","v":"RIO VERDE"}]
[]
[null,"ENDEREÇO",null,null,null,null,"CRE"]
[null,{"$f":"Orçamento!$R$11","v":" AVENIDA ATLANTICA S/N QD 52 , VALDECI PIRES , CEP:75910-335"},null,null,null,null,{"$f":"Orçamento!$O$11","v":"CRE-RIO VERDE"}]
[]
[null,"REFERÊNCIA",null,"DATA",null,null,"ÁREA TOTAL CONSTRUÍDA (M²)"]
[null,{"$f":"CONCATENATE(\"AGETOP E SINAPI - \",Orçamento!$T$11)","v":"AGETOP E SINAPI - DESONERADA"},null,{"$f":"Orçamento!$S$8","v":"2020-06-16"},null,null,{"$f":"Orçamento!$X$14","v":2681.43}]
["FILTRO"]
[null,"RESUMO GERAL DO ORÇAMENTO"]
["↓","ITEM","DESCRIÇÃO DOS SERVIÇOS",null,null,null,"PREÇO SEM BDI","PREÇO COM BDI","PARTICIP. (%)"]
[{"$f":"IF(G17>0,\"F\",\"\")","v":""},"1.",{"$f":"Orçamento!$P390","v":"REFORMA"},null,null,null,{"$f":"IFERROR(Orçamento!S390,\"-\")","v":0},{"$f":"IFERROR(Orçamento!X390,\"\")","v":0},{"$f":"Orçamento!AA390","v":{"$error":"#DIV/0!"}}]
[{"$f":"IF(G18>0,\"F\",\"\")","v":""},"2.",{"$f":"Orçamento!$P391","v":"INST. ELÉTRICAS"},null,null,null,{"$f":"IFERROR(Orçamento!S391,\"-\")","v":0},{"$f":"IFERROR(Orçamento!X391,\"\")","v":0},{"$f":"Orçamento!AA391","v":{"$error":"#DIV/0!"}}]
["","3.",{"$f":"Orçamento!$P392","v":"INSTALAÇÕES HIDROSSANITÁRIAS E COMBATE À INCÊNDIO"},null,null,null,{"$f":"IFERROR(Orçamento!S392,\"-\")","v":0},{"$f":"IFERROR(Orçamento!X392,\"\")","v":0},{"$f":"Orçamento!AA392","v":{"$error":"#DIV/0!"}}]
["","4.",{"$f":"Orçamento!$P393","v":"GRAMA"},null,null,null,{"$f":"IFERROR(Orçamento!S393,\"-\")","v":0},{"$f":"IFERROR(Orçamento!X393,\"\")","v":0},{"$f":"Orçamento!AA393","v":{"$error":"#DIV/0!"}}]
["","5.",{"$f":"Orçamento!$P394","v":"ADAPTAÇÃO SANITÁRIO MAS. / FEM. BLOCO 03"},null,null,null,{"$f":"IFERROR(Orçamento!S394,\"-\")","v":0},{"$f":"IFERROR(Orçamento!X394,\"\")","v":0},{"$f":"Orçamento!AA394","v":{"$error":"#DIV/0!"}}]
["","6.",{"$f":"Orçamento!$P395","v":"ADAPTAÇÃO SANITÁRIO MAS. / FEM. BLOCO 06"},null,null,null,{"$f":"IFERROR(Orçamento!S395,\"-\")","v":0},{"$f":"IFERROR(Orçamento!X395,\"\")","v":0},{"$f":"Orçamento!AA395","v":{"$error":"#DIV/0!"}}]
["","7.",{"$f":"Orçamento!$P396","v":"REFORMA VESTIÁRIO - BLOCO G"},null,null,null,{"$f":"IFERROR(Orçamento!S396,\"-\")","v":0},{"$f":"IFERROR(Orçamento!X396,\"\")","v":0},{"$f":"Orçamento!AA396","v":{"$error":"#DIV/0!"}}]
["","8.",{"$f":"Orçamento!$P397","v":"SANITÁRIOS BLOCO 01"},null,null,null,{"$f":"IFERROR(Orçamento!S397,\"-\")","v":0},{"$f":"IFERROR(Orçamento!X397,\"\")","v":0},{"$f":"Orçamento!AA397","v":{"$error":"#DIV/0!"}}]
["","9.",{"$f":"Orçamento!$P398","v":"COZINHA BLOCO 08"},null,null,null,{"$f":"IFERROR(Orçamento!S398,\"-\")","v":0},{"$f":"IFERROR(Orçamento!X398,\"\")","v":0},{"$f":"Orçamento!AA398","v":{"$error":"#DIV/0!"}}]
["","10.",{"$f":"Orçamento!$P399","v":"CENTRAL DE GÁS"},null,null,null,{"$f":"IFERROR(Orçamento!S399,\"-\")","v":0},{"$f":"IFERROR(Orçamento!X399,\"\")","v":0},{"$f":"Orçamento!AA399","v":{"$error":"#DIV/0!"}}]
["","11.",{"$f":"Orçamento!$P400","v":"PISO ESTACIONAMENTO"},null,null,null,{"$f":"IFERROR(Orçamento!S400,\"-\")","v":0},{"$f":"IFERROR(Orçamento!X400,\"\")","v":0},{"$f":"Orçamento!AA400","v":{"$error":"#DIV/0!"}}]
["","12.",{"$f":"Orçamento!$P401","v":"CORRIMÃO"},null,null,null,{"$f":"IFERROR(Orçamento!S401,\"-\")","v":0},{"$f":"IFERROR(Orçamento!X401,\"\")","v":0},{"$f":"Orçamento!AA401","v":{"$error":"#DIV/0!"}}]
["","13.",{"$f":"Orçamento!$P402","v":"PORTÃO ACESSO"},null,null,null,{"$f":"IFERROR(Orçamento!S402,\"-\")","v":0},{"$f":"IFERROR(Orçamento!X402,\"\")","v":0},{"$f":"Orçamento!AA402","v":{"$error":"#DIV/0!"}}]
["","14.",{"$f":"Orçamento!$P403","v":"PISO PÁTIO"},null,null,null,{"$f":"IFERROR(Orçamento!S403,\"-\")","v":0},{"$f":"IFERROR(Orçamento!X403,\"\")","v":0},{"$f":"Orçamento!AA403","v":{"$error":"#DIV/0!"}}]
["","15.",{"$f":"Orçamento!$P404","v":"MURO FUNDO"},null,null,null,{"$f":"IFERROR(Orçamento!S404,\"-\")","v":0},{"$f":"IFERROR(Orçamento!X404,\"\")","v":0},{"$f":"Orçamento!AA404","v":{"$error":"#DIV/0!"}}]
["","16.",{"$f":"Orçamento!$P405","v":"MURO FUNDO"},null,null,null,{"$f":"IFERROR(Orçamento!S405,\"-\")","v":0},{"$f":"IFERROR(Orçamento!X405,\"\")","v":0},{"$f":"Orçamento!AA405","v":{"$error":"#DIV/0!"}}]
["","17.",{"$f":"Orçamento!$P406","v":"PINTURA GERAL"},null,null,null,{"$f":"IFERROR(Orçamento!S406,\"-\")","v":0},{"$f":"IFERROR(Orçamento!X406,\"\")","v":0},{"$f":"Orçamento!AA406","v":{"$error":"#DIV/0!"}}]
["","18.",{"$f":"Orçamento!$P407","v":"ACESSIBILIDADE"},null,null,null,{"$f":"IFERROR(Orçamento!S407,\"-\")","v":0},{"$f":"IFERROR(Orçamento!X407,\"\")","v":0},{"$f":"Orçamento!AA407","v":{"$error":"#DIV/0!"}}]
["","19.",{"$f":"Orçamento!$P408","v":""},null,null,null,{"$f":"IFERROR(Orçamento!S408,\"-\")","v":0},{"$f":"IFERROR(Orçamento!X408,\"\")","v":0},{"$f":"Orçamento!AA408","v":{"$error":"#DIV/0!"}}]
["","20.",{"$f":"Orçamento!$P409","v":""},null,null,null,{"$f":"IFERROR(Orçamento!S409,\"-\")","v":0},{"$f":"IFERROR(Orçamento!X409,\"\")","v":0},{"$f":"Orçamento!AA409","v":{"$error":"#DIV/0!"}}]
["F","TOTAL GERAL DO ORÇAMENTO (R$)",null,null,null,null,{"$f":"SUM(G17:G36)","v":0},{"$f":"SUM(H17:H36)","v":0},{"$f":"SUM(I17:I36)","v":{"$error":"#DIV/0!"}}]
["F"]
["F"]

{"sheet":"Somatório","index":2,"n_rows":45,"n_cols":6,"rows_kept":45,"cut":false,"hidden":false,"merged":[[13,0,14,0],[42,1,42,2],[44,1,44,5],[47,3,47,5],[48,3,48,5],[13,1,13,5],[9,1,9,3],[9,4,9,5],[11,1,11,2],[11,4,11,5],[12,1,12,2],[12,4,12,5],[0,1,0,5],[14,1,14,5],[2,1,2,3],[2,4,2,5],[3,1,3,3],[3,4,3,5],[5,1,5,3],[5,4,5,5],[6,1,6,3],[6,4,6,5],[8,1,8,3],[8,4,8,5],[1,1,1,5],[4,1,4,5],[7,1,7,5],[10,1,10,5]]}
[]
[]
[null,"UNIDADE ESCOLAR",null,null,"CÓDIGO INEP"]
[null,{"$f":"Orçamento!$O$5","v":"COLÉGIO ESTADUAL ALVINO PEREIRA ROCHA"},null,null,{"$f":"Orçamento!X5","v":52093115}]
[]
[null,"OBRA",null,null,"CIDADE"]
[null,{"$f":"Orçamento!$O$8","v":"REFORMA"},null,null,{"$f":"Orçamento!$X$8","v":"RIO VERDE"}]
[]
[null,"ENDEREÇO",null,null,"CRE"]
[null,{"$f":"Orçamento!$R$11","v":" AVENIDA ATLANTICA S/N QD 52 , VALDECI PIRES , CEP:75910-335"},null,null,{"$f":"Orçamento!$O$11","v":"CRE-RIO VERDE"}]
[]
[null,"REFERÊNCIA",null,"DATA","ÁREA TOTAL CONSTRUÍDA (M²)"]
[null,{"$f":"CONCATENATE(\"AGETOP E SINAPI - \",Orçamento!$T$11)","v":"AGETOP E SINAPI - DESONERADA"},null,{"$f":"Orçamento!$S$8","v":"2020-06-16"},{"$f":"Orçamento!$X$14","v":2681.43}]
["FILTRO"]
[null,"SOMATÓRIO DE SERVIÇOS"]
["↓","ITEM","DESCRIÇÃO DOS SERVIÇOS","PREÇO SEM BDI (R$)","PREÇO COM BDI (R$)","PARTIC.  ( % )"]
[{"$f":"IF(D17>0,\"F\",\"\")","v":""},"a.",{"$f":"Orçamento!P356","v":"SERVIÇOS PRELIMINARES"},{"$f":"Orçamento!S356","v":0},{"$f":"Orçamento!X356","v":0},{"$f":"Orçamento!AA356","v":0}]
[{"$f":"IF(D18>0,\"F\",\"\")","v":""},"b.",{"$f":"Orçamento!P357","v":"TRANSPORTES"},{"$f":"Orçamento!S357","v":0},{"$f":"Orçamento!X357","v":0},{"$f":"Orçamento!AA357","v":0}]
["","c.",{"$f":"Orçamento!P358","v":"SERVIÇO EM TERRA"},{"$f":"Orçamento!S358","v":0},{"$f":"Orçamento!X358","v":0},{"$f":"Orçamento!AA358","v":0}]
["","d.",{"$f":"Orçamento!P359","v":"FUNDAÇÕES E SONDAGENS"},{"$f":"Orçamento!S359","v":0},{"$f":"Orçamento!X359","v":0},{"$f":"Orçamento!AA359","v":0}]
["","e.",{"$f":"Orçamento!P360","v":"ESTRUTURA"},{"$f":"Orçamento!S360","v":0},{"$f":"Orçamento!X360","v":0},{"$f":"Orçamento!AA360","v":0}]
["","f.",{"$f":"Orçamento!P361","v":"INSTALAÇÕES ELÉTRICAS"},{"$f":"Orçamento!S361","v":0},{"$f":"Orçamento!X361","v":0},{"$f":"Orçamento!AA361","v":0}]
["","g.",{"$f":"Orçamento!P362","v":"INSTALAÇÕES HIDROSSANITÁRIAS"},{"$f":"Orçamento!S362","v":0},{"$f":"Orçamento!X362","v":0},{"$f":"Orçamento!AA362","v":0}]
["","h",{"$f":"Orçamento!P363","v":"INSTALAÇÕES ESPECIAIS"},{"$f":"Orçamento!S363","v":0},{"$f":"Orçamento!X363","v":0},{"$f":"Orçamento!AA363","v":0}]
["","i.",{"$f":"Orçamento!P364","v":"ALVENARIAS E DIVISÓRIAS"},{"$f":"Orçamento!S364","v":0},{"$f":"Orçamento!X364","v":0},{"$f":"Orçamento!AA364","v":0}]
["","j.",{"$f":"Orçamento!P365","v":"ALVENARIA AUTO-PORTANTE"},{"$f":"Orçamento!S365","v":0},{"$f":"Orçamento!X365","v":0},{"$f":"Orçamento!AA365","v":0}]
["","k.",{"$f":"Orçamento!P366","v":"IMPERMEABILIZAÇÃO"},{"$f":"Orçamento!S366","v":0},{"$f":"Orçamento!X366","v":0},{"$f":"Orçamento!AA366","v":0}]
["","l.",{"$f":"Orçamento!P367","v":"ISOLAMENTO TÉRMICO E ACÚSTICO"},{"$f":"Orçamento!S367","v":0},{"$f":"Orçamento!X367","v":0},{"$f":"Orçamento!AA367","v":0}]
["","m.",{"$f":"Orçamento!P368","v":"ESTRUTURA DE MADEIRA"},{"$f":"Orçamento!S368","v":0},{"$f":"Orçamento!X368","v":0},{"$f":"Orçamento!AA368","v":0}]
["","n.",{"$f":"Orçamento!P369","v":"ESTRUTURAS METÁLICAS"},{"$f":"Orçamento!S369","v":0},{"$f":"Orçamento!X369","v":0},{"$f":"Orçamento!AA369","v":0}]
["","o.",{"$f":"Orçamento!P370","v":"COBERTURAS"},{"$f":"Orçamento!S370","v":0},{"$f":"Orçamento!X370","v":0},{"$f":"Orçamento!AA370","v":0}]
["","p.",{"$f":"Orçamento!P371","v":"ESQUADRIAS DE MADEIRA"},{"$f":"Orçamento!S371","v":0},{"$f":"Orçamento!X371","v":0},{"$f":"Orçamento!AA371","v":0}]
["","q.",{"$f":"Orçamento!P372","v":"ESQUADRIAS METÁLICAS"},{"$f":"Orçamento!S372","v":0},{"$f":"Orçamento!X372","v":0},{"$f":"Orçamento!AA372","v":0}]
["","r.",{"$f":"Orçamento!P373","v":"VIDROS"},{"$f":"Orçamento!S373","v":0},{"$f":"Orçamento!X373","v":0},{"$f":"Orçamento!AA373","v":0}]
["","s.",{"$f":"Orçamento!P374","v":"REVESTIMENTO DE PAREDE"},{"$f":"Orçamento!S374","v":0},{"$f":"Orçamento!X374","v":0},{"$f":"Orçamento!AA374","v":0}]
["","t.",{"$f":"Orçamento!P375","v":"FORROS"},{"$f":"Orçamento!S375","v":0},{"$f":"Orçamento!X375","v":0},{"$f":"Orçamento!AA375","v":0}]
["","u.",{"$f":"Orçamento!P376","v":"REVESTIMENTO DE PISO"},{"$f":"Orçamento!S376","v":0},{"$f":"Orçamento!X376","v":0},{"$f":"Orçamento!AA376","v":0}]
["","v.",{"$f":"Orçamento!P377","v":"FERRAGENS"},{"$f":"Orçamento!S377","v":0},{"$f":"Orçamento!X377","v":0},{"$f":"Orçamento!AA377","v":0}]
["","w.",{"$f":"Orçamento!P378","v":"MARCENARIA"},{"$f":"Orçamento!S378","v":0},{"$f":"Orçamento!X378","v":0},{"$f":"Orçamento!AA378","v":0}]
["","x.",{"$f":"Orçamento!P379","v":"ADMINISTRAÇÃO"},{"$f":"Orçamento!S379","v":0},{"$f":"Orçamento!X379","v":0},{"$f":"Orçamento!AA379","v":0}]
["","y.",{"$f":"Orçamento!P380","v":"PINTURA"},{"$f":"Orçamento!S380","v":0},{"$f":"Orçamento!X380","v":0},{"$f":"Orçamento!AA380","v":0}]
["","z.",{"$f":"Orçamento!P381","v":"DIVERSOS"},{"$f":"Orçamento!S381","v":0},{"$f":"Orçamento!X381","v":0},{"$f":"Orçamento!AA381","v":0}]
["F","TOTAL GERAL DO ORÇAMENTO",null,{"$f":"SUM(D17:D42)","v":0},{"$f":"SUM(E17:E42)","v":0},{"$f":"SUM(F17:F42)","v":0}]
[]
[null,"(*) Para itens da AGETOP, os vidros não estão inclusos nas esquadrias e já foram considerados os custos de contramarco para as esquadrias de alumínio;"]

{"sheet":"Cronog_90_Dias","index":3,"n_rows":99,"n_cols":20,"rows_kept":99,"cut":false,"hidden":false,"merged":[[0,1,0,17],[1,1,1,17],[2,1,2,7],[2,8,2,17],[3,1,3,7],[3,8,3,17],[8,1,8,7],[8,8,8,17],[9,0,11,0],[9,1,9,7],[9,8,9,17],[10,1,10,17],[11,1,11,17],[4,1,4,17],[5,1,5,7],[5,8,5,17],[6,1,6,7],[6,8,6,17],[7,1,7,17],[12,0,13,0],[12,3,13,3],[12,5,12,8],[12,9,12,12],[12,13,12,16],[12,17,13,17],[13,1,13,2],[13,5,13,8],[13,9,13,12],[13,13,13,16],[14,1,16,2],[14,3,16,3],[14,4,16,4],[14,5,14,8],[14,9,14,12],[14,13,14,16],[16,5,16,8],[16,9,16,12],[16,13,16,16],[17,1,19,2],[17,3,19,3],[17,4,19,4],[17,5,17,8],[17,9,17,12],[17,13,17,16],[19,5,19,8],[19,9,19,12],[19,13,19,16],[20,1,22,2],[20,3,22,3],[20,4,22,4],[20,5,20,8],[20,9,20,12],[20,13,20,16],[22,5,22,8],[22,9,22,12],[22,13,22,16],[23,1,25,2],[23,3,25,3],[23,4,25,4],[23,5,23,8],[23,9,23,12],[23,13,23,16],[25,5,25,8],[25,9,25,12],[25,13,25,16],[26,1,28,2],[26,3,28,3],[26,4,28,4],[26,5,26,8],[26,9,26,12],[26,13,26,16],[28,5,28,8],[28,9,28,12],[28,13,28,16],[29,1,31,2],[29,3,31,3],[29,4,31,4],[29,5,29,8],[29,9,29,12],[29,13,29,16],[31,5,31,8],[31,9,31,12],[31,13,31,16],[32,1,34,2],[32,3,34,3],[32,4,34,4],[32,5,32,8],[32,9,32,12],[32,13,32,16],[34,5,34,8],[34,9,34,12],[34,13,34,16],[35,1,37,2],[35,3,37,3],[35,4,37,4],[35,5,35,8],[35,9,35,12],[35,13,35,16],[37,5,37,8],[37,9,37,12],[37,13,37,16],[38,1,40,2],[38,3,40,3],[38,4,40,4],[38,5,38,8],[38,9,38,12],[38,13,38,16],[40,5,40,8],[40,9,40,12],[40,13,40,16],[41,1,43,2],[41,3,43,3],[41,4,43,4],[41,5,41,8],[41,9,41,12],[41,13,41,16],[43,5,43,8],[43,9,43,12],[43,13,43,16],[44,1,46,2],[44,3,46,3],[44,4,46,4],[44,5,44,8],[44,9,44,12],[44,13,44,16],[46,5,46,8],[46,9,46,12],[46,13,46,16],[47,1,49,2],[47,3,49,3],[47,4,49,4],[47,5,47,8],[47,9,47,12],[47,13,47,16],[49,5,49,8],[49,9,49,12],[49,13,49,16],[50,1,52,2],[50,3,52,3],[50,4,52,4],[50,5,50,8],[50,9,50,12],[50,13,50,16],[52,5,52,8],[52,9,52,12],[52,13,52,16],[53,1,55,2],[53,3,55,3],[53,4,55,4],[53,5,53,8],[53,9,53,12],[53,13,53,16],[55,5,55,8],[55,9,55,12],[55,13,55,16],[56,1,58,2],[56,3,58,3],[56,4,58,4],[56,5,56,8],[56,9,56,12],[56,13,56,16],[58,5,58,8],[58,9,58,12],[58,13,58,16],[59,1,61,2],[59,3,61,3],[59,4,61,4],[59,5,59,8],[59,9,59,12],[59,13,59,16],[61,5,61,8],[61,9,61,12],[61,13,61,16],[62,1,64,2],[62,3,64,3],[62,4,64,4],[62,5,62,8],[62,9,62,12],[62,13,62,16],[64,5,64,8],[64,9,64,12],[64,13,64,16],[65,1,67,2],[65,3,67,3],[65,4,67,4],[65,5,65,8],[65,9,65,12],[65,13,65,16],[67,5,67,8],[67,9,67,12],[67,13,67,16],[68,1,70,2],[68,3,70,3],[68,4,70,4],[68,5,68,8],[68,9,68,12],[68,13,68,16],[70,5,70,8],[70,9,70,12],[70,13,70,16],[71,1,73,2],[71,3,73,3],[71,4,73,4],[71,5,71,8],[71,9,71,12],[71,13,71,16],[73,5,73,8],[73,9,73,12],[73,13,73,16],[74,1,76,2],[74,3,76,3],[74,4,76,4],[74,5,74,8],[74,9,74,12],[74,13,74,16],[76,5,76,8],[76,9,76,12],[76,13,76,16],[77,1,79,2],[77,3,79,3],[77,4,79,4],[77,5,77,8],[77,9,77,12],[77,13,77,16],[79,5,79,8],[79,9,79,12],[79,13,79,16],[80,1,82,2],[80,3,82,3],[80,4,82,4],[80,5,80,8],[80,9,80,12],[80,13,80,16],[82,5,82,8],[82,9,82,12],[82,13,82,16],[83,1,85,2],[83,3,85,3],[83,4,85,4],[83,5,83,8],[83,9,83,12],[83,13,83,16],[85,5,85,8],[85,9,85,12],[85,13,85,16],[86,1,88,2],[86,3,88,3],[86,4,88,4],[86,5,86,8],[86,9,86,12],[86,13,86,16],[88,5,88,8],[88,9,88,12],[88,13,88,16],[92,1,92,2],[92,5,92,8],[92,9,92,12],[92,13,92,16],[93,1,93,2],[93,5,93,8],[93,9,93,12],[93,13,93,16],[89,1,91,2],[89,3,91,3],[89,4,91,4],[89,5,89,8],[89,9,89,12],[89,13,89,16],[91,5,91,8],[91,9,91,12],[91,13,91,16],[97,1,97,4],[98,1,98,17],[94,1,94,2],[94,5,94,8],[94,9,94,12],[94,13,94,16],[95,1,95,2],[95,5,95,8],[95,9,95,12],[95,13,95,16]]}
[]
[]
[null,"UNIDADE ESCOLAR",null,null,null,null,null,null,"PRAZO"]
[null,{"$f":"Orçamento!O5","v":"COLÉGIO ESTADUAL ALVINO PEREIRA ROCHA"},null,null,null,null,null,null,"90 DIAS CORRIDOS"]
[]
[null,"OBRA",null,null,null,null,null,null,"DATA"]
[null,{"$f":"Orçamento!O8","v":"REFORMA"},null,null,null,null,null,null,{"$f":"Orçamento!S8","v":"2020-06-16"}]
[]
[null,"LOCAL",null,null,null,null,null,null,"ÁREA TOTAL CONSTRUÍDA (M²)"]
["FILTRO",{"$f":"Orçamento!X8","v":"RIO VERDE"},null,null,null,null,null,null,{"$f":"Orçamento!X14","v":2681.43}]
[]
[null,"CRONOGRAMA - FÍSICO FINANCEIRO"]
["↓","CUSTO TOTAL:",{"$f":"D93","v":0},"VALOR","Dias:",30,null,null,null,60,null,null,null,90,null,null,null,"TOTAL"]
[null,"DESCRIÇÃO DOS SERVIÇOS",null,null,"%","1ª PARCELA",null,null,null,"2ª PARCELA",null,null,null,"3ª PARCELA"]
[{"$f":"IF(D15>0,\"F\",\"\")","v":""},"SERVIÇOS PRELIMINARES",null,{"$f":"Orçamento!X356","v":0},{"$f":"Orçamento!AA356","v":0},{"$f":"ROUND(F17*$D$15,2)","v":0},null,null,null,{"$f":"ROUND(J17*$D$15,2)","v":0},null,null,null,{"$f":"ROUND(N17*$D$15,2)","v":0},null,null,null,{"$f":"SUM(F15:Q15)","v":0},null,{"$f":"IF(D15=R15,\"OK\",\"ERRO\")","v":"OK"}]
[{"$f":"IF(A15=\"F\",A15,\"\")","v":""}]
[{"$f":"IF(A16=\"F\",A16,\"\")","v":""},null,null,null,null,1,null,null,null,0,null,null,null,{"$f":"1-F17-J17","v":0},null,null,null,{"$f":"IFERROR(E15/100,\"\")","v":0},null,{"$f":"IF(E15=R17*100,\"OK\",\"ERRO\")","v":"OK"}]
[{"$f":"IF(D18>0,\"F\",\"\")","v":""},"TRANSPORTES",null,{"$f":"Orçamento!X357","v":0},{"$f":"Orçamento!AA357","v":0},{"$f":"ROUND(F20*$D$18,2)","v":0},null,null,null,{"$f":"ROUND(J20*$D$18,2)","v":0},null,null,null,{"$f":"ROUND(N20*$D$18,2)","v":0},null,null,null,{"$f":"SUM(F18:Q18)","v":0},null,{"$f":"IF(D18=R18,\"OK\",\"ERRO\")","v":"OK"}]
[{"$f":"IF(A18=\"F\",A18,\"\")","v":""}]
[{"$f":"IF(A19=\"F\",A19,\"\")","v":""},null,null,null,null,0.36,null,null,null,0.3,null,null,null,{"$f":"1-F20-J20","v":0.34},null,null,null,{"$f":"IFERROR(E18/100,\"\")","v":0},null,{"$f":"IF(E18=R20*100,\"OK\",\"ERRO\")","v":"OK"}]
[{"$f":"IF(D21>0,\"F\",\"\")","v":""},"SERVIÇO EM TERRA",null,{"$f":"Orçamento!X358","v":0},{"$f":"Orçamento!AA358","v":0},{"$f":"ROUND(F23*$D$21,2)","v":0},null,null,null,{"$f":"ROUND(J23*$D$21,2)","v":0},null,null,null,{"$f":"ROUND(N23*$D$21,2)","v":0},null,null,null,{"$f":"SUM(F21:Q21)","v":0},null,{"$f":"IF(D21=R21,\"OK\",\"ERRO\")","v":"OK"}]
[{"$f":"IF(A21=\"F\",A21,\"\")","v":""}]
[{"$f":"IF(A22=\"F\",A22,\"\")","v":""},null,null,null,null,1,null,null,null,0,null,null,null,{"$f":"1-F23-J23","v":0},null,null,null,{"$f":"IFERROR(E21/100,\"\")","v":0},null,{"$f":"IF(E21=R23*100,\"OK\",\"ERRO\")","v":"OK"}]
[{"$f":"IF(D24>0,\"F\",\"\")","v":""},"FUNDAÇÕES E SONDAGENS",null,{"$f":"Orçamento!X359","v":0},{"$f":"Orçamento!AA359","v":0},{"$f":"ROUND(F26*$D$24,2)","v":0},null,null,null,{"$f":"ROUND(J26*$D$24,2)","v":0},null,null,null,{"$f":"ROUND(N26*$D$24,2)","v":0},null,null,null,{"$f":"SUM(F24:Q24)","v":0},null,{"$f":"IF(D24=R24,\"OK\",\"ERRO\")","v":"OK"}]
[{"$f":"IF(A24=\"F\",A24,\"\")","v":""}]
[{"$f":"IF(A25=\"F\",A25,\"\")","v":""},null,null,null,null,1,null,null,null,0,null,null,null,{"$f":"1-F26-J26","v":0},null,null,null,{"$f":"IFERROR(E24/100,\"\")","v":0},null,{"$f":"IF(E24=R26*100,\"OK\",\"ERRO\")","v":"OK"}]
[{"$f":"IF(D27>0,\"F\",\"\")","v":""},"ESTRUTURA",null,{"$f":"Orçamento!X360","v":0},{"$f":"Orçamento!AA360","v":0},{"$f":"ROUND(F29*$D$27,2)","v":0},null,null,null,{"$f":"ROUND(J29*$D$27,2)","v":0},null,null,null,{"$f":"ROUND(N29*$D$27,2)","v":0},null,null,null,{"$f":"SUM(F27:Q27)","v":0},null,{"$f":"IF(D27=R27,\"OK\",\"ERRO\")","v":"OK"}]
[{"$f":"IF(A27=\"F\",A27,\"\")","v":""}]
[{"$f":"IF(A28=\"F\",A28,\"\")","v":""},null,null,null,null,0.54,null,null,null,0.46,null,null,null,{"$f":"1-F29-J29","v":0},null,null,null,{"$f":"IFERROR(E27/100,\"\")","v":0},null,{"$f":"IF(E27=R29*100,\"OK\",\"ERRO\")","v":"OK"}]
[{"$f":"IF(D30>0,\"F\",\"\")","v":""},"INST.ELET/TELEFÔNICA/CABEAMENTO ESTRUTURADO",null,{"$f":"Orçamento!X361","v":0},{"$f":"Orçamento!AA361","v":0},{"$f":"ROUND(F32*$D$30,2)","v":0},null,null,null,{"$f":"ROUND(J32*$D$30,2)","v":0},null,null,null,{"$f":"ROUND(N32*$D$30,2)","v":0},null,null,null,{"$f":"SUM(F30:Q30)","v":0},null,{"$f":"IF(D30=R30,\"OK\",\"ERRO\")","v":"OK"}]
[{"$f":"IF(A30=\"F\",A30,\"\")","v":""}]
[{"$f":"IF(A31=\"F\",A31,\"\")","v":""},null,null,null,null,0.4,null,null,null,0.6,null,null,null,{"$f":"1-F32-J32","v":0},null,null,null,{"$f":"IFERROR(E30/100,\"\")","v":0},null,{"$f":"IF(E30=R32*100,\"OK\",\"ERRO\")","v":"OK"}]
[{"$f":"IF(D33>0,\"F\",\"\")","v":""},"INSTALAÇÕES HIDROSSANITÁRIAS",null,{"$f":"Orçamento!X362","v":0},{"$f":"Orçamento!AA362","v":0},{"$f":"ROUND(F35*$D$33,2)","v":0},null,null,null,{"$f":"ROUND(J35*$D$33,2)","v":0},null,null,null,{"$f":"ROUND(N35*$D$33,2)","v":0},null,null,null,{"$f":"SUM(F33:Q33)","v":0},null,{"$f":"IF(D33=R33,\"OK\",\"ERRO\")","v":"OK"}]
[{"$f":"IF(A33=\"F\",A33,\"\")","v":""}]
[{"$f":"IF(A34=\"F\",A34,\"\")","v":""},null,null,null,null,0.4,null,null,null,0.6,null,null,null,{"$f":"1-F35-J35","v":0},null,null,null,{"$f":"IFERROR(E33/100,\"\")","v":0},null,{"$f":"IF(E33=R35*100,\"OK\",\"ERRO\")","v":"OK"}]
[{"$f":"IF(D36>0,\"F\",\"\")","v":""},"INSTALAÇÕES ESPECIAIS",null,{"$f":"Orçamento!X363","v":0},{"$f":"Orçamento!AA363","v":0},{"$f":"ROUND(F38*$D$36,2)","v":0},null,null,null,{"$f":"ROUND(J38*$D$36,2)","v":0},null,null,null,{"$f":"ROUND(N38*$D$36,2)","v":0},null,null,null,{"$f":"SUM(F36:Q36)","v":0},null,{"$f":"IF(D36=R36,\"OK\",\"ERRO\")","v":"OK"}]
[{"$f":"IF(A36=\"F\",A36,\"\")","v":""}]
[{"$f":"IF(A37=\"F\",A37,\"\")","v":""},null,null,null,null,0.4,null,null,null,0.6,null,null,null,{"$f":"1-F38-J38","v":0},null,null,null,{"$f":"IFERROR(E36/100,\"\")","v":0},null,{"$f":"IF(E36=R38*100,\"OK\",\"ERRO\")","v":"OK"}]
[{"$f":"IF(D39>0,\"F\",\"\")","v":""},"ALVENARIA E DIVISÓRIAS",null,{"$f":"Orçamento!X364","v":0},{"$f":"Orçamento!AA364","v":0},{"$f":"ROUND(F41*$D$39,2)","v":0},null,null,null,{"$f":"ROUND(J41*$D$39,2)","v":0},null,null,null,{"$f":"ROUND(N41*$D$39,2)","v":0},null,null,null,{"$f":"SUM(F39:Q39)","v":0},null,{"$f":"IF(D39=R39,\"OK\",\"ERRO\")","v":"OK"}]
[{"$f":"IF(A39=\"F\",A39,\"\")","v":""}]
[{"$f":"IF(A40=\"F\",A40,\"\")","v":""},null,null,null,null,0.4,null,null,null,0.6,null,null,null,{"$f":"1-F41-J41","v":0},null,null,null,{"$f":"IFERROR(E39/100,\"\")","v":0},null,{"$f":"IF(E39=R41*100,\"OK\",\"ERRO\")","v":"OK"}]
[{"$f":"IF(D42>0,\"F\",\"\")","v":""},"ALVENARIA AUTO-PORTANTE",null,{"$f":"Orçamento!X365","v":0},{"$f":"Orçamento!AA365","v":0},{"$f":"ROUND(F44*$D$42,2)","v":0},null,null,null,{"$f":"ROUND(J44*$D$42,2)","v":0},null,null,null,{"$f":"ROUND(N44*$D$42,2)","v":0},null,null,null,{"$f":"SUM(F42:Q42)","v":0},null,{"$f":"IF(D42=R42,\"OK\",\"ERRO\")","v":"OK"}]
[{"$f":"IF(A42=\"F\",A42,\"\")","v":""}]
[{"$f":"IF(A43=\"F\",A43,\"\")","v":""},null,null,null,null,0,null,null,null,{"$f":"1-B44","v":1},null,null,null,{"$f":"1-F44-J44","v":0},null,null,null,{"$f":"IFERROR(E42/100,\"\")","v":0},null,{"$f":"IF(E42=R44*100,\"OK\",\"ERRO\")","v":"OK"}]
[{"$f":"IF(D45>0,\"F\",\"\")","v":""},"IMPERMEABILIZAÇÃO",null,{"$f":"Orçamento!X366","v":0},{"$f":"Orçamento!AA366","v":0},{"$f":"ROUND(F47*$D$45,2)","v":0},null,null,null,{"$f":"ROUND(J47*$D$45,2)","v":0},null,null,null,{"$f":"ROUND(N47*$D$45,2)","v":0},null,null,null,{"$f":"SUM(F45:Q45)","v":0},null,{"$f":"IF(D45=R45,\"OK\",\"ERRO\")","v":"OK"}]
[{"$f":"IF(A45=\"F\",A45,\"\")","v":""}]
[{"$f":"IF(A46=\"F\",A46,\"\")","v":""},null,null,null,null,0.85,null,null,null,0.15,null,null,null,{"$f":"1-F47-J47","v":0},null,null,null,{"$f":"IFERROR(E45/100,\"\")","v":0},null,{"$f":"IF(E45=R47*100,\"OK\",\"ERRO\")","v":"OK"}]
[{"$f":"IF(D48>0,\"F\",\"\")","v":""},"ISOLAMENTO TÉRMICO E ACÚSTICO",null,{"$f":"Orçamento!X367","v":0},{"$f":"Orçamento!AA367","v":0},{"$f":"ROUND(F50*$D$48,2)","v":0},null,null,null,{"$f":"ROUND(J50*$D$48,2)","v":0},null,null,null,{"$f":"ROUND(N50*$D$48,2)","v":0},null,null,null,{"$f":"SUM(F48:Q48)","v":0},null,{"$f":"IF(D48=R48,\"OK\",\"ERRO\")","v":"OK"}]
[{"$f":"IF(A48=\"F\",A48,\"\")","v":""}]
[{"$f":"IF(A49=\"F\",A49,\"\")","v":""},null,null,null,null,0,null,null,null,{"$f":"1-B50","v":1},null,null,null,{"$f":"1-F50-J50","v":0},null,null,null,{"$f":"IFERROR(E48/100,\"\")","v":0},null,{"$f":"IF(E48=R50*100,\"OK\",\"ERRO\")","v":"OK"}]
[{"$f":"IF(D51>0,\"F\",\"\")","v":""},"ESTRUTURA DE MADEIRA",null,{"$f":"Orçamento!X368","v":0},{"$f":"Orçamento!AA368","v":0},{"$f":"ROUND(F53*$D$51,2)","v":0},null,null,null,{"$f":"ROUND(J53*$D$51,2)","v":0},null,null,null,{"$f":"ROUND(N53*$D$51,2)","v":0},null,null,null,{"$f":"SUM(F51:Q51)","v":0},null,{"$f":"IF(D51=R51,\"OK\",\"ERRO\")","v":"OK"}]
[{"$f":"IF(A51=\"F\",A51,\"\")","v":""}]
[{"$f":"IF(A52=\"F\",A52,\"\")","v":""},null,null,null,null,0,null,null,null,0.57999999999999996,null,null,null,{"$f":"1-F53-J53","v":0.42000000000000004},null,null,null,{"$f":"IFERROR(E51/100,\"\")","v":0},null,{"$f":"IF(E51=R53*100,\"OK\",\"ERRO\")","v":"OK"}]
[{"$f":"IF(D54>0,\"F\",\"\")","v":""},"ESTRUTURA METÁLICA",null,{"$f":"Orçamento!X369","v":0},{"$f":"Orçamento!AA369","v":0},{"$f":"ROUND(F56*$D$54,2)","v":0},null,null,null,{"$f":"ROUND(J56*$D$54,2)","v":0},null,null,null,{"$f":"ROUND(N56*$D$54,2)","v":0},null,null,null,{"$f":"SUM(F54:Q54)","v":0},null,{"$f":"IF(D54=R54,\"OK\",\"ERRO\")","v":"OK"}]
[{"$f":"IF(A54=\"F\",A54,\"\")","v":""}]
[{"$f":"IF(A55=\"F\",A55,\"\")","v":""},null,null,null,null,0,null,null,null,0.57999999999999996,null,null,null,{"$f":"1-F56-J56","v":0.42000000000000004},null,null,null,{"$f":"IFERROR(E54/100,\"\")","v":0},null,{"$f":"IF(E54=R56*100,\"OK\",\"ERRO\")","v":"OK"}]
[{"$f":"IF(D57>0,\"F\",\"\")","v":""},"COBERTURAS",null,{"$f":"Orçamento!X370","v":0},{"$f":"Orçamento!AA370","v":0},{"$f":"ROUND(F59*$D$57,2)","v":0},null,null,null,{"$f":"ROUND(J59*$D$57,2)","v":0},null,null,null,{"$f":"ROUND(N59*$D$57,2)","v":0},null,null,null,{"$f":"SUM(F57:Q57)","v":0},null,{"$f":"IF(D57=R57,\"OK\",\"ERRO\")","v":"OK"}]
[{"$f":"IF(A57=\"F\",A57,\"\")","v":""}]
[{"$f":"IF(A58=\"F\",A58,\"\")","v":""},null,null,null,null,0,null,null,null,0,null,null,null,{"$f":"1-F59-J59","v":1},null,null,null,{"$f":"IFERROR(E57/100,\"\")","v":0},null,{"$f":"IF(E57=R59*100,\"OK\",\"ERRO\")","v":"OK"}]
[{"$f":"IF(D60>0,\"F\",\"\")","v":""},"ESQUADRIAS DE MADEIRA",null,{"$f":"Orçamento!X371","v":0},{"$f":"Orçamento!AA371","v":0},{"$f":"ROUND(F62*$D$60,2)","v":0},null,null,null,{"$f":"ROUND(J62*$D$60,2)","v":0},null,null,null,{"$f":"ROUND(N62*$D$60,2)","v":0},null,null,null,{"$f":"SUM(F60:Q60)","v":0},null,{"$f":"IF(D60=R60,\"OK\",\"ERRO\")","v":"OK"}]
[{"$f":"IF(A60=\"F\",A60,\"\")","v":""}]
[{"$f":"IF(A61=\"F\",A61,\"\")","v":""},null,null,null,null,0,null,null,null,0.4,null,null,null,{"$f":"1-F62-J62","v":0.6},null,null,null,{"$f":"IFERROR(E60/100,\"\")","v":0},null,{"$f":"IF(E60=R62*100,\"OK\",\"ERRO\")","v":"OK"}]
[{"$f":"IF(D63>0,\"F\",\"\")","v":""},"ESQUADRIAS METÁLICAS",null,{"$f":"Orçamento!X372","v":0},{"$f":"Orçamento!AA372","v":0},{"$f":"ROUND(F65*$D$63,2)","v":0},null,null,null,{"$f":"ROUND(J65*$D$63,2)","v":0},null,null,null,{"$f":"ROUND(N65*$D$63,2)","v":0},null,null,null,{"$f":"SUM(F63:Q63)","v":0},null,{"$f":"IF(D63=R63,\"OK\",\"ERRO\")","v":"OK"}]
[{"$f":"IF(A63=\"F\",A63,\"\")","v":""}]
[{"$f":"IF(A64=\"F\",A64,\"\")","v":""},null,null,null,null,0,null,null,null,0.45,null,null,null,{"$f":"1-F65-J65","v":0.55000000000000004},null,null,null,{"$f":"IFERROR(E63/100,\"\")","v":0},null,{"$f":"IF(E63=R65*100,\"OK\",\"ERRO\")","v":"OK"}]
[{"$f":"IF(D66>0,\"F\",\"\")","v":""},"VIDROS",null,{"$f":"Orçamento!X373","v":0},{"$f":"Orçamento!AA373","v":0},{"$f":"ROUND(F68*$D$66,2)","v":0},null,null,null,{"$f":"ROUND(J68*$D$66,2)","v":0},null,null,null,{"$f":"ROUND(N68*$D$66,2)","v":0},null,null,null,{"$f":"SUM(F66:Q66)","v":0},null,{"$f":"IF(D66=R66,\"OK\",\"ERRO\")","v":"OK"}]
[{"$f":"IF(A66=\"F\",A66,\"\")","v":""}]
[{"$f":"IF(A67=\"F\",A67,\"\")","v":""},null,null,null,null,0,null,null,null,0,null,null,null,{"$f":"1-F68-J68","v":1},null,null,null,{"$f":"IFERROR(E66/100,\"\")","v":0},null,{"$f":"IF(E66=R68*100,\"OK\",\"ERRO\")","v":"OK"}]
[{"$f":"IF(D69>0,\"F\",\"\")","v":""},"REVESTIMENTO DE PAREDE",null,{"$f":"Orçamento!X374","v":0},{"$f":"Orçamento!AA374","v":0},{"$f":"ROUND(F71*$D$69,2)","v":0},null,null,null,{"$f":"ROUND(J71*$D$69,2)","v":0},null,null,null,{"$f":"ROUND(N71*$D$69,2)","v":0},null,null,null,{"$f":"SUM(F69:Q69)","v":0},null,{"$f":"IF(D69=R69,\"OK\",\"ERRO\")","v":"OK"}]
[{"$f":"IF(A69=\"F\",A69,\"\")","v":""}]
[{"$f":"IF(A70=\"F\",A70,\"\")","v":""},null,null,null,null,0,null,null,null,0.4,null,null,null,{"$f":"1-F71-J71","v":0.6},null,null,null,{"$f":"IFERROR(E69/100,\"\")","v":0},null,{"$f":"IF(E69=R71*100,\"OK\",\"ERRO\")","v":"OK"}]
[{"$f":"IF(D72>0,\"F\",\"\")","v":""},"FORROS",null,{"$f":"Orçamento!X375","v":0},{"$f":"Orçamento!AA375","v":0},{"$f":"ROUND(F74*$D$72,2)","v":0},null,null,null,{"$f":"ROUND(J74*$D$72,2)","v":0},null,null,null,{"$f":"ROUND(N74*$D$72,2)","v":0},null,null,null,{"$f":"SUM(F72:Q72)","v":0},null,{"$f":"IF(D72=R72,\"OK\",\"ERRO\")","v":"OK"}]
[{"$f":"IF(A72=\"F\",A72,\"\")","v":""}]
[{"$f":"IF(A73=\"F\",A73,\"\")","v":""},null,null,null,null,0,null,null,null,0.4,null,null,null,{"$f":"1-F74-J74","v":0.6},null,null,null,{"$f":"IFERROR(E72/100,\"\")","v":0},null,{"$f":"IF(E72=R74*100,\"OK\",\"ERRO\")","v":"OK"}]
[{"$f":"IF(D75>0,\"F\",\"\")","v":""},"REVESTIMENTO DE PISO",null,{"$f":"Orçamento!X376","v":0},{"$f":"Orçamento!AA376","v":0},{"$f":"ROUND(F77*$D$75,2)","v":0},null,null,null,{"$f":"ROUND(J77*$D$75,2)","v":0},null,null,null,{"$f":"ROUND(N77*$D$75,2)","v":0},null,null,null,{"$f":"SUM(F75:Q75)","v":0},null,{"$f":"IF(D75=R75,\"OK\",\"ERRO\")","v":"OK"}]
[{"$f":"IF(A75=\"F\",A75,\"\")","v":""}]
[{"$f":"IF(A76=\"F\",A76,\"\")","v":""},null,null,null,null,0,null,null,null,0.4,null,null,null,{"$f":"1-F77-J77","v":0.6},null,null,null,{"$f":"IFERROR(E75/100,\"\")","v":0},null,{"$f":"IF(E75=R77*100,\"OK\",\"ERRO\")","v":"OK"}]
[{"$f":"IF(D78>0,\"F\",\"\")","v":""},"FERRAGENS",null,{"$f":"Orçamento!X377","v":0},{"$f":"Orçamento!AA377","v":0},{"$f":"ROUND(F80*$D$78,2)","v":0},null,null,null,{"$f":"ROUND(J80*$D$78,2)","v":0},null,null,null,{"$f":"ROUND(N80*$D$78,2)","v":0},null,null,null,{"$f":"SUM(F78:Q78)","v":0},null,{"$f":"IF(D78=R78,\"OK\",\"ERRO\")","v":"OK"}]
[{"$f":"IF(A78=\"F\",A78,\"\")","v":""}]
[{"$f":"IF(A79=\"F\",A79,\"\")","v":""},null,null,null,null,0,null,null,null,0,null,null,null,{"$f":"1-F80-J80","v":1},null,null,null,{"$f":"IFERROR(E78/100,\"\")","v":0},null,{"$f":"IF(E78=R80*100,\"OK\",\"ERRO\")","v":"OK"}]
[{"$f":"IF(D81>0,\"F\",\"\")","v":""},"MARCENARIA",null,{"$f":"Orçamento!X378","v":0},{"$f":"Orçamento!AA378","v":0},{"$f":"ROUND(F83*$D$81,2)","v":0},null,null,null,{"$f":"ROUND(J83*$D$81,2)","v":0},null,null,null,{"$f":"ROUND(N83*$D$81,2)","v":0},null,null,null,{"$f":"SUM(F81:Q81)","v":0},null,{"$f":"IF(D81=R81,\"OK\",\"ERRO\")","v":"OK"}]
[{"$f":"IF(A81=\"F\",A81,\"\")","v":""}]
[{"$f":"IF(A82=\"F\",A82,\"\")","v":""},null,null,null,null,0,null,null,null,0,null,null,null,{"$f":"1-F83-J83","v":1},null,null,null,{"$f":"IFERROR(E81/100,\"\")","v":0},null,{"$f":"IF(E81=R83*100,\"OK\",\"ERRO\")","v":"OK"}]
[{"$f":"IF(D84>0,\"F\",\"\")","v":""},"ADMINISTRAÇÃO - MENSALISTAS",null,{"$f":"Orçamento!X379","v":0},{"$f":"Orçamento!AA379","v":0},{"$f":"ROUND(F86*$D$84,2)","v":0},null,null,null,{"$f":"ROUND(J86*$D$84,2)","v":0},null,null,null,{"$f":"ROUND(N86*$D$84,2)","v":0},null,null,null,{"$f":"SUM(F84:Q84)","v":0},null,{"$f":"IF(D84=R84,\"OK\",\"ERRO\")","v":"OK"}]
[{"$f":"IF(A84=\"F\",A84,\"\")","v":""}]
[{"$f":"IF(A85=\"F\",A85,\"\")","v":""},null,null,null,null,0.35149999999999998,null,null,null,0.33,null,null,null,{"$f":"1-F86-J86","v":0.31850000000000006},null,null,null,{"$f":"IFERROR(E84/100,\"\")","v":0},null,{"$f":"IF(E84=R86*100,\"OK\",\"ERRO\")","v":"OK"}]
[{"$f":"IF(D87>0,\"F\",\"\")","v":""},"PINTURA",null,{"$f":"Orçamento!X380","v":0},{"$f":"Orçamento!AA380","v":0},{"$f":"ROUND(F89*$D$87,2)","v":0},null,null,null,{"$f":"ROUND(J89*$D$87,2)","v":0},null,null,null,{"$f":"ROUND(N89*$D$87,2)","v":0},null,null,null,{"$f":"SUM(F87:Q87)","v":0},null,{"$f":"IF(D87=R87,\"OK\",\"ERRO\")","v":"OK"}]
[{"$f":"IF(A87=\"F\",A87,\"\")","v":""}]
[{"$f":"IF(A88=\"F\",A88,\"\")","v":""},null,null,null,null,0.2,null,null,null,0.3,null,null,null,{"$f":"1-F89-J89","v":0.5},null,null,null,{"$f":"IFERROR(E87/100,\"\")","v":0},null,{"$f":"IF(E87=R89*100,\"OK\",\"ERRO\")","v":"OK"}]
[{"$f":"IF(D90>0,\"F\",\"\")","v":""},"DIVERSOS",null,{"$f":"Orçamento!X381","v":0},{"$f":"Orçamento!AA381","v":0},{"$f":"ROUND(F92*$D$90,2)","v":0},null,null,null,{"$f":"ROUND(J92*$D$90,2)","v":0},null,null,null,{"$f":"ROUND(N92*$D$90,2)","v":0},null,null,null,{"$f":"SUM(F90:Q90)","v":0},null,{"$f":"IF(D90=R90,\"OK\",\"ERRO\")","v":"OK"}]
[{"$f":"IF(A90=\"F\",A90,\"\")","v":""}]
[{"$f":"IF(A91=\"F\",A91,\"\")","v":""},null,null,null,null,0,null,null,null,0,null,null,null,{"$f":"1-F92-J92","v":1},null,null,null,{"$f":"IFERROR(E90/100,\"\")","v":0},null,{"$f":"IF(E90=R92*100,\"OK\",\"ERRO\")","v":"OK"}]
["F","CUSTO DO ORÇAMENTO",null,{"$f":"SUM(D15:D92)","v":0},{"$f":"SUM(E15:E92)","v":0},{"$f":"F15+F18+F21+F24+F27+F30+F33+F36+F39+F42+F45+F48+F51+F54+F57+F60+F63+F66+F69+F72+F75+F78+F81+F84+F87+F90","v":0},null,null,null,{"$f":"J15+J18+J21+J24+J27+J30+J33+J36+J39+J42+J45+J48+J51+J54+J57+J60+J63+J66+J69+J72+J75+J78+J81+J84+J87+J90","v":0},null,null,null,{"$f":"N15+N18+N21+N24+N27+N30+N33+N36+N39+N42+N45+N48+N51+N54+N57+N60+N63+N66+N69+N72+N75+N78+N81+N84+N87+N90","v":0},null,null,null,{"$f":"R15+R18+R21+R24+R27+R30+R33+R36+R39+R42+R45+R48+R51+R54+R57+R60+R63+R66+R69+R72+R75+R78+R81+R84+R87+R90","v":0}]
["F","PERCENTUAIS:",null,null,null,{"$f":"IFERROR(F93/D93,\"\")","v":""},null,null,null,{"$f":"IFERROR(J93/D93,\"\")","v":""},null,null,null,{"$f":"IFERROR(N93/D93,\"\")","v":""},null,null,null,{"$f":"SUM(F94:Q94)","v":0}]
["F","TOTAIS ACUMULADOS:",null,null,null,{"$f":"F93","v":0},null,null,null,{"$f":"F95+J93","v":0},null,null,null,{"$f":"J95+N93","v":0}]
["F","PERCENTUAIS  ACUMULADOS:",null,null,null,{"$f":"F94","v":""},null,null,null,{"$f":"J94+F96","v":{"$error":"#VALUE!"}},null,null,null,{"$f":"IFERROR(J96+N94,\"\")","v":""}]
["F"]
["F","OBSERVAÇÕES:"]
["F","Os pagamentos somente poderão ser efetuados mediante medição e atesto pelos técnicos da Secretaria da Educação. "]

{"sheet":"Composição BDI","index":4,"n_rows":45,"n_cols":4,"rows_kept":45,"cut":false,"hidden":false,"merged":[[17,0,17,3],[16,0,16,3],[44,0,44,3],[42,0,42,3],[43,0,43,3],[18,0,18,3],[36,0,36,3],[39,0,39,3],[38,0,38,3],[40,0,40,3],[29,0,29,2],[32,0,32,3],[33,0,33,3],[34,0,34,3],[35,0,35,3],[0,0,0,3],[2,0,2,3],[3,0,3,3],[1,0,1,3],[5,0,5,3],[4,0,4,3],[12,0,12,3],[13,0,13,3],[14,0,14,3],[15,0,15,3],[6,0,6,3],[8,0,8,3],[7,0,7,3],[9,0,9,3],[11,0,11,3],[10,0,10,3]]}
[]
[]
["UNIDADE ESCOLAR"]
["COLÉGIO ESTADUAL ALVINO PEREIRA ROCHA"]
[]
["OBRA"]
["REFORMA"]
[]
["ENDEREÇO"]
[" AVENIDA ATLANTICA S/N QD 52 , VALDECI PIRES , CEP:75910-335"]
[]
["CIDADE"]
["RIO VERDE"]
[]
["CRE"]
["CRE-RIO VERDE"]
[]
["DETALHAMENTO DA COMPOSIÇÃO DE BDI"]
["COMPOSIÇÃO BDI PARA OBRAS CIVIS"]
["DESCRIÇÃO","COEF.","TAXA % (a.m)","% no preço de venda"]
["1) COFINS",1,0.03,0.03]
["2) PIS",1,6.4999999999999997E-3,6.4999999999999997E-3]
["3) ISSQN",1,2.5000000000000001E-2,2.5000000000000001E-2]
["4) CPRB",1,4.4999999999999998E-2,4.4999999999999998E-2]
["5) Administração Central",1,0.03,0.03]
["6) Despesas Financeiras",1,5.5999999999999999E-3,5.5999999999999999E-3]
["7) Seguros + Garantias",1,1.1999999999999999E-3,1.1999999999999999E-3]
["8) Risco",1,9.7000000000000003E-3,9.7000000000000003E-3]
["9) Lucro",1,6.1600000000000002E-2,6.1600000000000002E-2]
["BDI - FINAL",null,null,0.24365702167207659]
[]
["Notas:"]
["(1) e (2) Alíquota definida por lei."]
["(3) Alíquota e base de cálculo definidas pela legislação municipal."]
["(4) Alíquota definida pelas leis 12.546/11, 12844/13 e 13.161/15 (CPRB – contribuição previdenciária sobre a receita bruta)."]
["(5) Valores definidos a partir dos limites no Acórdão nº 2.622/2013 - TCU – Plenário. Valores entre o 1º e 3º quartis."]
["(6) Valor calculado pela expressão matemática do acórdão 2.369/2011 – TCU – Plenário e disponibilizado pela AGETOP em dezembro de 2018. (Foi utilizado para o cálculo a média da Taxa SELIC no período de 11/2017 a 10/2018)"]
[]
["(7) Valores definidos pela AGETOP a partir dos limites no Acórdão nº 2.622/2013 - TCU – Plenário. Valores médios. \n\nObservação da AGETOP: (Seguros contra erros de execução, incêndio e explosão, danos da natureza (vendaval, destelhamento, alagamento, inundação, desmoronamento, geadas etc.), emprego de material defeituoso ou inadequado, roubo e/ou furto qualificado, quebra de equipamentos, desmoronamento de estrutura, nas modalidades de Obras Civis em Construção (OCC); Instalação e Montagem (IM); e Obras Civis em Construção e Instalação e Montagem (OCC/IM). Bem como coberturas adicionais para ampliação dessas coberturas básicas, como: cobertura de responsabilidade civil geral, cobertura de responsabilidade civil cruzada, cobertura de despesas extraordinárias, cobertura de tumultos, cobertura de desentulho do local, cobertura de riscos do fabricante, dentre outras, incluindo o seguro de vida em grupo regido pela convenção coletiva dos trabalhadores na indústria da construção civil). A partir de 24/02/2015 por intermédio da Portaria 449/2015 a Presidência da AGETOP, na pessoa do Senhor Jayme Eduardo Rincon, determinou a exclusão dos valores referentes aos Seguros de Risco de Engenharia e Responsabilidade Civil do Profissional na composição do cálculo do B.D.I.."]
["(8) Valores definidos a partir dos limites no Acórdão nº 2.622/2013 - TCU – Plenário. Valores entre 1º e 3° quartis."]
["(9) Valores definidos a partir dos limites definidos no Acórdão nº 2.622/2013 - TCU – Plenário. Valores adotados e praticados no mercado ( “ ex ante ” ) ou aqueles entre os 1º e 3º quartis."]
[]
["(*) A fórmula para estipulação da taxa de BDI estimado adotado é a mesma que foi aplicada para a obtenção das tabelas contidas no Acórdão n. 2.622/2013 – TCUPlenário"]
[]
["Obs.: Para obras com valores superiores a R$ 20.000.000,00 sugere-se recalcular o BDI, dimensionando as taxas de administração central e lucro para patamares inferiores ao estipulado acima."]

{"sheet":"Relatório CENTRAL","index":5,"n_rows":40,"n_cols":5,"rows_kept":40,"cut":false,"hidden":false,"merged":[[9,0,11,0],[0,1,0,4],[6,3,6,4],[9,3,9,4],[1,1,1,4],[2,1,2,2],[2,3,2,4],[3,1,3,2],[3,3,3,4],[4,1,4,4],[5,1,5,2],[5,3,5,4],[6,1,6,2],[7,1,7,4],[8,1,8,2],[8,3,8,4],[9,1,9,2],[10,1,10,4],[11,1,11,4],[39,1,39,2]]}
[]
[]
[null,"UNIDADE ESCOLAR",null,"CIDADE"]
[null,{"$f":"Orçamento!$O$5","v":"COLÉGIO ESTADUAL ALVINO PEREIRA ROCHA"},null,{"$f":"Orçamento!$X$8","v":"RIO VERDE"}]
[]
[null,"OBRA",null,"CRE"]
[null,{"$f":"Orçamento!$O$8","v":"REFORMA"},null,{"$f":"Orçamento!$O$11","v":"CRE-RIO VERDE"}]
[]
[null,"ENDEREÇO",null,"DATA"]
["FILTRO",{"$f":"Orçamento!$R$11","v":" AVENIDA ATLANTICA S/N QD 52 , VALDECI PIRES , CEP:75910-335"},null,{"$f":"Orçamento!$S$8","v":"2020-06-16"}]
[]
[null,"RELATÓRIO CENTRAL"]
["↓","CÓDIGO","ETAPA","PREÇO  (R$) C/ BDI","PARTIC  ( % )"]
[{"$f":"IF(D14>0,\"F\",\"\")","v":""},{"$f":"Orçamento!O356","v":"a."},{"$f":"Orçamento!P356","v":"SERVIÇOS PRELIMINARES"},{"$f":"Orçamento!X356","v":0},{"$f":"Orçamento!AA356","v":0}]
[{"$f":"IF(D15>0,\"F\",\"\")","v":""},{"$f":"Orçamento!O357","v":"b."},{"$f":"Orçamento!P357","v":"TRANSPORTES"},{"$f":"Orçamento!X357","v":0},{"$f":"Orçamento!AA357","v":0}]
["",{"$f":"Orçamento!O358","v":"c."},{"$f":"Orçamento!P358","v":"SERVIÇO EM TERRA"},{"$f":"Orçamento!X358","v":0},{"$f":"Orçamento!AA358","v":0}]
["",{"$f":"Orçamento!O359","v":"d."},{"$f":"Orçamento!P359","v":"FUNDAÇÕES E SONDAGENS"},{"$f":"Orçamento!X359","v":0},{"$f":"Orçamento!AA359","v":0}]
["",{"$f":"Orçamento!O360","v":"e."},{"$f":"Orçamento!P360","v":"ESTRUTURA"},{"$f":"Orçamento!X360","v":0},{"$f":"Orçamento!AA360","v":0}]
["",{"$f":"Orçamento!O361","v":"f."},{"$f":"Orçamento!P361","v":"INSTALAÇÕES ELÉTRICAS"},{"$f":"Orçamento!X361","v":0},{"$f":"Orçamento!AA361","v":0}]
["",{"$f":"Orçamento!O362","v":"g."},{"$f":"Orçamento!P362","v":"INSTALAÇÕES HIDROSSANITÁRIAS"},{"$f":"Orçamento!X362","v":0},{"$f":"Orçamento!AA362","v":0}]
["",{"$f":"Orçamento!O363","v":"h"},{"$f":"Orçamento!P363","v":"INSTALAÇÕES ESPECIAIS"},{"$f":"Orçamento!X363","v":0},{"$f":"Orçamento!AA363","v":0}]
["",{"$f":"Orçamento!O364","v":"i."},{"$f":"Orçamento!P364","v":"ALVENARIAS E DIVISÓRIAS"},{"$f":"Orçamento!X364","v":0},{"$f":"Orçamento!AA364","v":0}]
["",{"$f":"Orçamento!O365","v":"j."},{"$f":"Orçamento!P365","v":"ALVENARIA AUTO-PORTANTE"},{"$f":"Orçamento!X365","v":0},{"$f":"Orçamento!AA365","v":0}]
["",{"$f":"Orçamento!O366","v":"k."},{"$f":"Orçamento!P366","v":"IMPERMEABILIZAÇÃO"},{"$f":"Orçamento!X366","v":0},{"$f":"Orçamento!AA366","v":0}]
["",{"$f":"Orçamento!O367","v":"l."},{"$f":"Orçamento!P367","v":"ISOLAMENTO TÉRMICO E ACÚSTICO"},{"$f":"Orçamento!X367","v":0},{"$f":"Orçamento!AA367","v":0}]
["",{"$f":"Orçamento!O368","v":"m."},{"$f":"Orçamento!P368","v":"ESTRUTURA DE MADEIRA"},{"$f":"Orçamento!X368","v":0},{"$f":"Orçamento!AA368","v":0}]
["",{"$f":"Orçamento!O369","v":"n."},{"$f":"Orçamento!P369","v":"ESTRUTURAS METÁLICAS"},{"$f":"Orçamento!X369","v":0},{"$f":"Orçamento!AA369","v":0}]
["",{"$f":"Orçamento!O370","v":"o."},{"$f":"Orçamento!P370","v":"COBERTURAS"},{"$f":"Orçamento!X370","v":0},{"$f":"Orçamento!AA370","v":0}]
["",{"$f":"Orçamento!O371","v":"p."},{"$f":"Orçamento!P371","v":"ESQUADRIAS DE MADEIRA"},{"$f":"Orçamento!X371","v":0},{"$f":"Orçamento!AA371","v":0}]
["",{"$f":"Orçamento!O372","v":"q."},{"$f":"Orçamento!P372","v":"ESQUADRIAS METÁLICAS"},{"$f":"Orçamento!X372","v":0},{"$f":"Orçamento!AA372","v":0}]
["",{"$f":"Orçamento!O373","v":"r."},{"$f":"Orçamento!P373","v":"VIDROS"},{"$f":"Orçamento!X373","v":0},{"$f":"Orçamento!AA373","v":0}]
["",{"$f":"Orçamento!O374","v":"s."},{"$f":"Orçamento!P374","v":"REVESTIMENTO DE PAREDE"},{"$f":"Orçamento!X374","v":0},{"$f":"Orçamento!AA374","v":0}]
["",{"$f":"Orçamento!O375","v":"t."},{"$f":"Orçamento!P375","v":"FORROS"},{"$f":"Orçamento!X375","v":0},{"$f":"Orçamento!AA375","v":0}]
["",{"$f":"Orçamento!O376","v":"u."},{"$f":"Orçamento!P376","v":"REVESTIMENTO DE PISO"},{"$f":"Orçamento!X376","v":0},{"$f":"Orçamento!AA376","v":0}]
["",{"$f":"Orçamento!O377","v":"v."},{"$f":"Orçamento!P377","v":"FERRAGENS"},{"$f":"Orçamento!X377","v":0},{"$f":"Orçamento!AA377","v":0}]
["",{"$f":"Orçamento!O378","v":"w."},{"$f":"Orçamento!P378","v":"MARCENARIA"},{"$f":"Orçamento!X378","v":0},{"$f":"Orçamento!AA378","v":0}]
["",{"$f":"Orçamento!O379","v":"x."},{"$f":"Orçamento!P379","v":"ADMINISTRAÇÃO"},{"$f":"Orçamento!X379","v":0},{"$f":"Orçamento!AA379","v":0}]
["",{"$f":"Orçamento!O380","v":"y."},{"$f":"Orçamento!P380","v":"PINTURA"},{"$f":"Orçamento!X380","v":0},{"$f":"Orçamento!AA380","v":0}]
["",{"$f":"Orçamento!O381","v":"z."},{"$f":"Orçamento!P381","v":"DIVERSOS"},{"$f":"Orçamento!X381","v":0},{"$f":"Orçamento!AA381","v":0}]
["F","TOTAL GERAL DO ORÇAMENTO (R$) C/BDI",null,{"$f":"SUM(D14:D39)","v":0},{"$f":"SUM(E14:E39)","v":0}]

{"sheet":"Parc Maior Relev","index":6,"n_rows":33,"n_cols":7,"rows_kept":33,"cut":false,"hidden":false,"merged":[[0,1,0,6],[11,1,11,6],[1,1,1,6],[2,1,2,3],[2,4,2,6],[3,1,3,3],[3,4,3,6],[4,1,4,6],[5,1,5,3],[5,4,5,6],[9,1,9,3],[9,4,9,6],[10,1,10,6],[6,1,6,3],[6,4,6,6],[7,1,7,6],[8,1,8,3],[8,4,8,6],[33,3,33,7],[31,1,31,6]]}
[]
[]
[null,"UNIDADE ESCOLAR",null,null,"CÓDIGO INEP"]
[null,{"$f":"Orçamento!$O$5","v":"COLÉGIO ESTADUAL ALVINO PEREIRA ROCHA"},null,null,{"$f":"Orçamento!$X$5","v":52093115}]
[]
[null,"OBRA",null,null,"CIDADE"]
[null,{"$f":"Orçamento!$O$8","v":"REFORMA"},null,null,{"$f":"Orçamento!$X$8","v":"RIO VERDE"}]
[]
[null,"CRE",null,null,"ÁREA TOTAL CONSTRUÍDA (M²)"]
[null,{"$f":"Orçamento!$O$11","v":"CRE-RIO VERDE"},null,null,{"$f":"Orçamento!$X$14","v":2681.43}]
[]
["FILTRO","PARCELA DE MAIOR RELEVÂNCIA"]
[{"$f":"IF(G14>0,\"F\",\"\")","v":""},"CÓDIGO","SERVIÇO","DESCRIÇÃO","UNID","QUANT","PARC. MAIOR RELEV (100%)"]
[{"$f":"IF(G14>0,\"F\",\"\")","v":""},"f.","INSTALAÇÕES ELÉTRICAS","SUBESTAÇÃO","KVA",{"$f":"SUMIF(Orçamento!$R$21:$R$337,'Parc Maior Relev'!D14,Orçamento!$T$21:$T$337)","v":0},{"$f":"F14","v":0}]
[{"$f":"IF(SUM(G16:G30)>0,\"F\",\"\")","v":"F"},"CÓDIGO","SERVIÇO","DESCRIÇÃO","UNID","QUANT","PARC. MAIOR RELEV (50%)"]
[{"$f":"IF(G16>0,\"F\",\"\")","v":""},"e.","ESTRUTURA","CONCRETO","M3",{"$f":"SUMIF(Orçamento!$R$21:$R$337,'Parc Maior Relev'!D16,Orçamento!$T$21:$T$337)","v":0},{"$f":"F16*0.5","v":0}]
[{"$f":"IF(G17>0,\"F\",\"\")","v":"F"},"f.","INSTALAÇÕES ELÉTRICAS","INSTALAÇÕES ELÉTRICAS","KVA",35.659999999999997,{"$f":"F17*0.5","v":17.829999999999998}]
[{"$f":"IF(G18>0,\"F\",\"\")","v":""},"o.","COBERTURAS","COBERTURA CERÂMICA","M2",{"$f":"SUMIF(Orçamento!$R$21:$R$337,'Parc Maior Relev'!D18,Orçamento!$T$21:$T$337)","v":0},0]
["","o.","COBERTURAS","COBERTURA COM TELHA METÁLICA","M2",{"$f":"SUMIF(Orçamento!$R$21:$R$337,'Parc Maior Relev'!D19,Orçamento!$T$21:$T$337)","v":0},0]
["","s.","REVESTIMENTO DE PAREDE","CHAPISCO","M2",{"$f":"SUMIF(Orçamento!$R$21:$R$337,'Parc Maior Relev'!D20,Orçamento!$T$21:$T$337)","v":0},0]
["","s.","REVESTIMENTO DE PAREDE","REBOCO","M2",{"$f":"SUMIF(Orçamento!$R$21:$R$337,'Parc Maior Relev'!D21,Orçamento!$T$21:$T$337)","v":0},0]
["","s.","REVESTIMENTO DE PAREDE","REVESTIMENTO CERÂMICO","M2",{"$f":"SUMIF(Orçamento!$R$21:$R$337,'Parc Maior Relev'!D22,Orçamento!$T$21:$T$337)","v":0},0]
["","t.","FORROS","FORRO DE GESSO","M2",{"$f":"SUMIF(Orçamento!$R$21:$R$337,'Parc Maior Relev'!D23,Orçamento!$T$21:$T$337)","v":0},0]
["","t.","FORROS","FORRO DE PVC","M2",{"$f":"SUMIF(Orçamento!$R$21:$R$337,'Parc Maior Relev'!D24,Orçamento!$T$21:$T$337)","v":0},0]
["","t.","FORROS","FORRO DE GESSO ACARTONADO","M2",{"$f":"SUMIF(Orçamento!$R$21:$R$337,'Parc Maior Relev'!D25,Orçamento!$T$21:$T$337)","v":0},0]
["","u.","REVESTIMENTO DE PISO","PISO DE GRANITINA","M2",{"$f":"SUMIF(Orçamento!$R$21:$R$337,'Parc Maior Relev'!D26,Orçamento!$T$21:$T$337)","v":0},0]
["","u.","REVESTIMENTO DE PISO","PISO LAMINADO","M2",{"$f":"SUMIF(Orçamento!$R$21:$R$337,'Parc Maior Relev'!D27,Orçamento!$T$21:$T$337)","v":0},0]
["F","u.","REVESTIMENTO DE PISO","PISO DE CONCRETO DESEMPENADO","M2",{"$f":"Orçamento!T192+Orçamento!T281+Orçamento!T296+Orçamento!T334","v":1513.78},756.89]
["","u.","REVESTIMENTO DE PISO","PISO CERÂMICO","M2",{"$f":"SUMIF(Orçamento!$R$21:$R$337,'Parc Maior Relev'!D29,Orçamento!$T$21:$T$337)","v":0},0]
["","y.","PINTURA","PINTURA","M2",{"$f":"SUMIF(Orçamento!$R$21:$R$337,'Parc Maior Relev'!D30,Orçamento!$T$21:$T$337)","v":0},0]
["F"]
["F","(*) Para os fins do inciso I dp § 1º do Art. 30 da Lei Federal 8.666/93, são consideradas parcelas de maior relevância técnica as execuções apresentadas"]
["F"]