{"text_format":"1","workbook":"xlsx","n_sheets":7,"sheets":["Orçamento","Resumo ","Somatório","Cronog_90_Dias","Composição BDI","Relatório CENTRAL","Parc Maior Relev"],"not_rendered":{"charts":0,"images":4,"macros":1,"external_links":1,"defined_names":103,"comments":2,"pivot_tables":0},"unopened":[],"bounds":{"document_bytes":16777216,"sheet_cells":100000,"rows_first":2000,"rows_last":500,"rows_between":2000,"halvings":0,"cell_chars":16384,"cell_head_chars":4096},"cells_cut":0,"cells_raw":0,"read":"whole","date_system":"1900"}

{"sheet":"Orçamento","index":0,"n_rows":626,"n_cols":27,"rows_kept":626,"cut":false,"hidden":false,"merged":[[618,18,618,22],[613,15,613,17],[613,18,613,22],[614,15,614,17],[614,18,614,22],[615,15,615,17],[615,18,615,22],[10,24,10,25],[9,23,9,25],[607,18,607,22],[608,15,608,17],[608,18,608,22],[609,15,609,17],[609,18,609,22],[604,15,604,17],[604,18,604,22],[605,15,605,17],[605,18,605,22],[606,15,606,17],[606,18,606,22],[600,14,600,26],[601,18,601,22],[602,15,602,17],[602,18,602,22],[619,23,619,25],[620,23,620,25],[621,23,621,25],[622,23,622,25],[623,23,623,25],[624,23,624,25],[625,23,625,25],[594,14,594,17],[601,15,601,17],[567,15,567,17],[622,18,622,22],[610,15,610,17],[610,18,610,22],[611,15,611,17],[611,18,611,22],[612,15,612,17],[612,18,612,22],[616,15,616,17],[616,18,616,22],[617,15,617,17],[617,18,617,22],[618,15,618,17],[607,15,607,17],[625,18,625,22],[622,14,622,17],[619,15,619,17],[619,18,619,22],[620,15,620,17],[620,18,620,22],[621,15,621,17],[621,18,621,22],[624,18,624,22],[623,18,623,22],[0,14,0,26],[558,16,558,24],[559,16,559,24],[560,16,560,24],[11,14,11,26],[14,14,14,26],[3,14,3,22],[4,14,4,22],[6,18,6,22],[7,18,7,22],[12,18,12,22],[13,18,13,22],[7,14,7,17],[6,14,6,17],[4,23,4,25],[3,23,3,25],[6,23,6,25],[7,23,7,25],[9,18,9,20],[550,17,555,17],[550,22,550,24],[551,22,551,24],[552,22,552,24],[556,22,556,23],[561,16,561,24],[567,23,567,25],[583,23,583,25],[584,23,584,25],[603,15,603,17],[603,18,603,22],[562,16,562,24],[580,15,580,17],[581,15,581,17],[566,14,566,26],[567,18,567,22],[568,18,568,22],[576,18,576,22],[577,18,577,22],[578,18,578,22],[579,18,579,22],[591,18,591,22],[588,15,588,17],[568,15,568,17],[569,15,569,17],[570,15,570,17],[571,15,571,17],[572,15,572,17],[573,15,573,17],[574,15,574,17],[575,15,575,17],[576,15,576,17],[585,23,585,25],[586,23,586,25],[584,15,584,17],[585,15,585,17],[586,15,586,17],[572,18,572,22],[581,18,581,22],[563,18,563,24],[569,18,569,22],[570,18,570,22],[571,18,571,22],[594,18,594,22],[592,18,592,22],[593,18,593,22],[583,18,583,22],[590,18,590,22],[586,18,586,22],[588,18,588,22],[584,18,584,22],[585,18,585,22],[594,23,594,25],[588,23,588,25],[589,23,589,25],[575,18,575,22],[589,15,589,17],[590,15,590,17],[587,23,587,25],[582,15,582,17],[583,15,583,17],[597,18,597,22],[573,18,573,22],[574,18,574,22],[587,15,587,17],[595,23,595,25],[596,23,596,25],[597,23,597,25],[590,23,590,25],[591,23,591,25],[592,23,592,25],[596,18,596,22],[580,18,580,22],[577,15,577,17],[578,15,578,17],[579,15,579,17],[589,18,589,22],[587,18,587,22],[595,18,595,22],[582,18,582,22],[1,14,1,24],[9,14,9,16],[10,14,10,16],[12,14,12,16],[13,14,13,16],[15,14,15,24],[2,14,2,24],[5,14,5,24],[8,14,8,24],[616,23,616,25],[617,23,617,25],[618,23,618,25],[601,23,601,25],[602,23,602,25],[603,23,603,25],[604,23,604,25],[605,23,605,25],[606,23,606,25],[607,23,607,25],[608,23,608,25],[609,23,609,25],[610,23,610,25],[611,23,611,25],[612,23,612,25],[613,23,613,25],[614,23,614,25],[615,23,615,25],[7,12,7,13],[6,12,6,13],[13,23,13,25],[12,23,12,25],[10,19,10,22],[593,23,593,25],[568,23,568,25],[569,23,569,25],[570,23,570,25],[571,23,571,25],[572,23,572,25],[573,23,573,25],[574,23,574,25],[575,23,575,25],[576,23,576,25],[577,23,577,25],[578,23,578,25],[579,23,579,25],[580,23,580,25],[581,23,581,25],[582,23,582,25],[591,15,591,17],[592,15,592,17],[593,15,593,17]]}
[]
[]
[]
[null,null,null,null,null,null,null,null,null,null,null,null,null,null,"UNIDADE ESCOLAR",null,null,null,null,null,null,null,null,"CÓDIGO INEP"]
[null,null,null,null,null,null,null,null,null,null,null,null,"",null,"ESCOLA ESTADUAL GERCINA BORGES TEIXEIRA",null,null,null,null,null,null,null,null,52051951]
[]
["Nmax",null,null,null,null,null,null,null,null,null,null,null,null,null,"OBRA",null,null,null,"DATA",null,null,null,null,"CIDADE"]
[{"$f":"MAX($C$19:$C$550)","v":4},null,null,null,null,null,null,null,null,null,null,null,null,null,"REFORMA E AMPLIAÇÃO",null,null,null,"2020-05-28",null,null,null,null,"CAIAPÔNIA"]
[]
[null,null,null,null,null,null,null,null,null,null,null,null,null,null,"CRE",null,null,"ENDEREÇO","REFERÊNCIA AGETOP",null,null,null,null,"REFERÊNCIA SINAPI"]
[null,null,null,null,null,null,null,null,null,null,null,null,null,null,"CRE-IPORÁ",null,null," AV. CEL. LINDOLFO A. DIAS 677 , CENTRO , CEP: 7585-000","ABR/19","DESONERADA",null,null,null,"MAR/20","DESONERADA"]
[]
[null,null,null,null,null,null,null,null,null,null,null,null,null,null,"ÁREA EXISTENTE (M²)",null,null,"ÁREA A CONSTRUIR (M²)","ÁREA A DEMOLIR (M²)",null,null,null,null,"ÁREA TOTAL CONSTRUÍDA (M²)"]
[null,null,null,null,null,null,null,null,null,null,null,null,null,null,670.53,null,null,141.27000000000001,null,null,null,null,null,811.8]
[]
[null,null,null,null,null,null,null,null,null,null,null,"FILTRO",null,null,"PLANILHA ORÇAMENTÁRIA"]
["Nível E","Save Nivel","Nível C","Altura","n1","n2","n3","n4","n5","Czero","Cnível","↓","Nível","Nível Corrigido","ITEM","TABELA","CODIGO","DESCRIÇÃO DOS SERVIÇOS","UNID","QUANT","REPET","QUANT TOTAL","MAT","MO","T.SERVIÇO UNIT","VALOR TOTAL","OBSERVAÇÕES¹"]
[{"$f":"CHOOSE(1+LOG(1+2*(ORÇAMENTO.Nivel=\"Nível 1\")+4*(ORÇAMENTO.Nivel=\"Nível 2\")+8*(ORÇAMENTO.Nivel=\"Nível 3\")+16*(ORÇAMENTO.Nivel=\"Nível 4\")+32*(ORÇAMENTO.Nivel=\"Serviço\"),2),0,1,2,3,4,\"S\")","v":"S"},{"$f":"IF(OR(C18=\"s\",C18=0),OFFSET(B18,-1,0),C18)","v":"Save Nivel"},{"$f":"IF(OFFSET(C18,-1,0)=\"L\",1,IF(OFFSET(C18,-1,0)=1,2,IF(OR(A18=\"s\",A18=0),\"S\",IF(AND(OFFSET(C18,-1,0)=2,A18=4),3,IF(AND(OR(OFFSET(C18,-1,0)=\"s\",OFFSET(C18,-1,0)=0),A18<>\"s\",A18>OFFSET(B18,-1,0)),OFFSET(B18,-1,0),A18)))))","v":"S"},{"$f":"IF(OR(C18=\"S\",C18=0),0,IF(ISERROR(K18),J18,SMALL(J18:K18,1)))","v":0},{"$f":"IF($C18=1,OFFSET(E18,-1,0)+1,OFFSET(E18,-1,0))","v":"n1"},{"$f":"IF($C18=1,0,IF($C18=2,OFFSET(F18,-1,0)+1,OFFSET(F18,-1,0)))","v":"n2"},{"$f":"IF(AND($C18<=2,$C18<>0),0,IF($C18=3,OFFSET(G18,-1,0)+1,OFFSET(G18,-1,0)))","v":"n3"},{"$f":"IF(AND($C18<=3,$C18<>0),0,IF($C18=4,OFFSET(H18,-1,0)+1,OFFSET(H18,-1,0)))","v":"n4"},{"$f":"IF(AND($C18<=4,$C18<>0),0,IF(AND($C18=\"S\",$Y18>0),OFFSET(I18,-1,0)+1,OFFSET(I18,-1,0)))","v":"n5"},{"$f":"IF(OR($C18=\"S\",$C18=0),0,MATCH(0,OFFSET($D18,1,$C18,ROW($C$550)-ROW($C18)),0))","v":0},{"$f":"IF(OR($C18=\"S\",$C18=0),0,MATCH(OFFSET($D18,0,$C18)+1,OFFSET($D18,1,$C18,ROW($C$550)-ROW($C18)),0))","v":0},"","Serviço","Serviço","-","SINAPI",null,"(sem código)","-",null,"REPET","-",0,0,0,"-",""]
[0,null,"L",{"$f":"COUNTA(OFFSET(D19,1,0):D$550)","v":530},{"$f":"LEFT(O20,1)-1","v":0},null,null,null,null,null,null,"F","LOTE","LOTE","REFORMA E AMPLIAÇÃO - ESCOLA ESTADUAL GERCINA BORGES TEIXEIRA",null,null,null,null,null,null,null,null,null,null,0]
[1,{"$f":"IF(OR(C20=\"s\",C20=0),OFFSET(B20,-1,0),C20)","v":1},{"$f":"IF(OFFSET(C20,-1,0)=\"L\",1,IF(OFFSET(C20,-1,0)=1,2,IF(OR(A20=\"s\",A20=0),\"S\",IF(AND(OFFSET(C20,-1,0)=2,A20=4),3,IF(AND(OR(OFFSET(C20,-1,0)=\"s\",OFFSET(C20,-1,0)=0),A20<>\"s\",A20>OFFSET(B20,-1,0)),OFFSET(B20,-1,0),A20)))))","v":1},{"$f":"IF(OR(C20=\"S\",C20=0),0,IF(ISERROR(K20),J20,SMALL(J20:K20,1)))","v":344},{"$f":"IF($C20=1,OFFSET(E20,-1,0)+1,OFFSET(E20,-1,0))","v":1},{"$f":"IF($C20=1,0,IF($C20=2,OFFSET(F20,-1,0)+1,OFFSET(F20,-1,0)))","v":0},{"$f":"IF(AND($C20<=2,$C20<>0),0,IF($C20=3,OFFSET(G20,-1,0)+1,OFFSET(G20,-1,0)))","v":0},{"$f":"IF(AND($C20<=3,$C20<>0),0,IF($C20=4,OFFSET(H20,-1,0)+1,OFFSET(H20,-1,0)))","v":0},0,{"$f":"IF(OR($C20=\"S\",$C20=0),0,MATCH(0,OFFSET($D20,1,$C20,ROW($C$550)-ROW($C20)),0))","v":530},{"$f":"IF(OR($C20=\"S\",$C20=0),0,MATCH(OFFSET($D20,0,$C20)+1,OFFSET($D20,1,$C20,ROW($C$550)-ROW($C20)),0))","v":344},"F","Nível 1","Nível 1","1.","AGETOP",null,"REFORMA E AMPLIAÇÃO","UN",1,1,1,null,null,0,0]
[2,{"$f":"IF(OR(C21=\"s\",C21=0),OFFSET(B21,-1,0),C21)","v":2},{"$f":"IF(OFFSET(C21,-1,0)=\"L\",1,IF(OFFSET(C21,-1,0)=1,2,IF(OR(A21=\"s\",A21=0),\"S\",IF(AND(OFFSET(C21,-1,0)=2,A21=4),3,IF(AND(OR(OFFSET(C21,-1,0)=\"s\",OFFSET(C21,-1,0)=0),A21<>\"s\",A21>OFFSET(B21,-1,0)),OFFSET(B21,-1,0),A21)))))","v":2},{"$f":"IF(OR(C21=\"S\",C21=0),0,IF(ISERROR(K21),J21,SMALL(J21:K21,1)))","v":43},{"$f":"IF($C21=1,OFFSET(E21,-1,0)+1,OFFSET(E21,-1,0))","v":1},{"$f":"IF($C21=1,0,IF($C21=2,OFFSET(F21,-1,0)+1,OFFSET(F21,-1,0)))","v":1},{"$f":"IF(AND($C21<=2,$C21<>0),0,IF($C21=3,OFFSET(G21,-1,0)+1,OFFSET(G21,-1,0)))","v":0},{"$f":"IF(AND($C21<=3,$C21<>0),0,IF($C21=4,OFFSET(H21,-1,0)+1,OFFSET(H21,-1,0)))","v":0},0,343,43,"","Nível 2","Nível 2","-","AGETOP",null,"SERVIÇOS PRELIMINARES","-",null,1,"-",null,null,0,0]
[3,3,3,5,1,1,1,0,0,42,5,"","Nível 3","Nível 3","-","SINAPI",null,"ACESSIBILIDADE","-",null,1,"-",null,null,0,0,""]
[{"$f":"CHOOSE(1+LOG(1+2*(ORÇAMENTO.Nivel=\"Nível 1\")+4*(ORÇAMENTO.Nivel=\"Nível 2\")+8*(ORÇAMENTO.Nivel=\"Nível 3\")+16*(ORÇAMENTO.Nivel=\"Nível 4\")+32*(ORÇAMENTO.Nivel=\"Serviço\"),2),0,1,2,3,4,\"S\")","v":"S"},3,"S",0,1,1,1,0,0,0,0,"","Serviço","Serviço","-","AGETOP",20121,"DEM. MANUAL EM CONCR.SIMPLES C/TR.ATE CB.E CARGA (O.C.)","m3    ",9.06,1,9.06,null,null,0,0,""]
["S",3,"S",0,1,1,1,0,0,0,0,"","Serviço","Serviço","-","COMPOSIÇÃO","COMP 010_SEE","DEMOLIÇÃO DE GRADE/GRELHA/CORRIMÃO/GUARDA CORPO - METÁLICO","M2",6.03,1,6.03,null,null,0,0,""]
["S",3,"S",0,1,1,1,0,0,0,0,"","Serviço","Serviço","-","SINAPI",97622,"DEMOLIÇÃO DE ALVENARIA DE BLOCO FURADO, DE FORMA MANUAL, SEM REAPROVEITAMENTO. AF_12/2017","M3",0.16,1,0.16,null,null,0,0,"Referência: AGETOP - 20118"]
["S",3,"S",0,1,1,1,0,0,0,0,"","Serviço","Serviço","-","AGETOP",20163,"DEMOLIÇÃO DAS INSTALAÇÕES HIDROSANITÁRIAS E AFINS C/ TRANSP. ATÉ CB. E CARGA","H     ",1,1,1,null,null,0,0,""]
[3,3,3,9,1,1,2,0,0,37,9,"","Nível 3","Nível 3","-","SINAPI",null,"IMPLANTAÇÃO COZINHA/REFEITÓRIO","-",null,1,"-",null,null,0,0,""]
["S",3,"S",0,1,1,2,0,0,0,0,"","Serviço","Serviço","-","AGETOP",20121,"DEM. MANUAL EM CONCR.SIMPLES C/TR.ATE CB.E CARGA (O.C.)","m3    ",6.37,1,6.37,null,null,0,0,""]
["S",3,"S",0,1,1,2,0,0,0,0,"","Serviço","Serviço","-","SINAPI",97622,"DEMOLIÇÃO DE ALVENARIA DE BLOCO FURADO, DE FORMA MANUAL, SEM REAPROVEITAMENTO. AF_12/2017","M3",0.9,1,0.9,null,null,0,0,"Referência: AGETOP - 20118"]
["S",{"$f":"IF(OR(C30=\"s\",C30=0),OFFSET(B30,-1,0),C30)","v":3},{"$f":"IF(OFFSET(C30,-1,0)=\"L\",1,IF(OFFSET(C30,-1,0)=1,2,IF(OR(A30=\"s\",A30=0),\"S\",IF(AND(OFFSET(C30,-1,0)=2,A30=4),3,IF(AND(OR(OFFSET(C30,-1,0)=\"s\",OFFSET(C30,-1,0)=0),A30<>\"s\",A30>OFFSET(B30,-1,0)),OFFSET(B30,-1,0),A30)))))","v":"S"},{"$f":"IF(OR(C30=\"S\",C30=0),0,IF(ISERROR(K30),J30,SMALL(J30:K30,1)))","v":0},{"$f":"IF($C30=1,OFFSET(E30,-1,0)+1,OFFSET(E30,-1,0))","v":1},{"$f":"IF($C30=1,0,IF($C30=2,OFFSET(F30,-1,0)+1,OFFSET(F30,-1,0)))","v":1},{"$f":"IF(AND($C30<=2,$C30<>0),0,IF($C30=3,OFFSET(G30,-1,0)+1,OFFSET(G30,-1,0)))","v":2},{"$f":"IF(AND($C30<=3,$C30<>0),0,IF($C30=4,OFFSET(H30,-1,0)+1,OFFSET(H30,-1,0)))","v":0},{"$f":"IF(AND($C30<=4,$C30<>0),0,IF(AND($C30=\"S\",$Y30>0),OFFSET(I30,-1,0)+1,OFFSET(I30,-1,0)))","v":0},0,0,"","Serviço","Serviço","-","SINAPI",98533,"PODA EM ALTURA DE ÁRVORE COM DIÂMETRO DE TRONCO MAIOR OU IGUAL A 0,20 M E MENOR QUE 0,40 M.AF_05/2018","UN",2,1,2,null,null,0,0,""]
["S",3,"S",0,1,1,2,0,0,0,0,"","Serviço","Serviço","-","SINAPI",98529,"CORTE RASO E RECORTE DE ÁRVORE COM DIÂMETRO DE TRONCO MAIOR OU IGUAL A 0,20 M E MENOR QUE 0,40 M.AF_05/2018","UN",2,1,2,null,null,0,0,""]
["S",3,"S",0,1,1,2,0,0,0,0,"","Serviço","Serviço","-","SINAPI",98526,"REMOÇÃO DE RAÍZES REMANESCENTES DE TRONCO DE ÁRVORE COM DIÂMETRO MAIOR OU IGUAL A 0,20 M E MENOR QUE 0,40 M.AF_05/2018","UN",2,1,2,null,null,0,0,""]
["S",3,"S",0,1,1,2,0,0,0,0,"","Serviço","Serviço","-","SINAPI",98535,"PODA EM ALTURA DE ÁRVORE COM DIÂMETRO DE TRONCO MAIOR OU IGUAL A 0,60 M.AF_05/2018","UN",1,1,1,null,null,0,0,""]
["S",3,"S",0,1,1,2,0,{"$f":"IF(AND($C34<=4,$C34<>0),0,IF(AND($C34=\"S\",$Y34>0),OFFSET(I34,-1,0)+1,OFFSET(I34,-1,0)))","v":0},0,0,"","Serviço","Serviço","-","SINAPI",98531,"CORTE RASO E RECORTE DE ÁRVORE COM DIÂMETRO DE TRONCO MAIOR OU IGUAL A 0,60 M.AF_05/2018","UN",1,1,1,null,null,0,0,""]
["S",3,"S",0,1,1,2,0,0,0,0,"","Serviço","Serviço","-","SINAPI",98528,"REMOÇÃO DE RAÍZES REMANESCENTES DE TRONCO DE ÁRVORE COM DIÂMETRO MAIOR OU IGUAL A 0,60 M.AF_05/2018","UN",1,1,1,null,null,0,0,""]
[3,3,3,2,1,1,3,0,0,28,2,"","Nível 3","Nível 3","-","SINAPI",null,"DESATIVAR CAIXAS D'ÁGUA","-",null,1,"-",null,null,0,0,""]
["S",3,"S",0,1,1,3,0,0,0,0,"","Serviço","Serviço","-","AGETOP",20163,"DEMOLIÇÃO DAS INSTALAÇÕES HIDROSANITÁRIAS E AFINS C/ TRANSP. ATÉ CB. E CARGA","H     ",8,1,8,null,null,0,0,""]
[3,3,3,7,1,1,4,0,0,26,7,"","Nível 3","Nível 3","-","SINAPI",null,"QUADRA DE ESPORTES","-",null,1,"-",null,null,0,0,""]
["S",3,"S",0,1,1,4,0,0,0,0,"","Serviço","Serviço","-","SINAPI",97622,"DEMOLIÇÃO DE ALVENARIA DE BLOCO FURADO, DE FORMA MANUAL, SEM REAPROVEITAMENTO. AF_12/2017","M3",12.38,1,12.38,null,null,0,0,"Referência: AGETOP - 20118"]
["S",3,"S",0,1,1,4,0,0,0,0,"","Serviço","Serviço","-","AGETOP",20121,"DEM. MANUAL EM CONCR.SIMPLES C/TR.ATE CB.E CARGA (O.C.)","m3    ",17.25,1,17.25,null,null,0,0,""]
["S",3,"S",0,1,1,4,0,0,0,0,"","Serviço","Serviço","-","COMPOSIÇÃO","COMP 428_SEE","DEMOLIÇÃO DE ALAMBRADO COM TUBO GALVANIZADO C/ TR. ATE CB. E CARGA ","M",36.6,1,36.6,null,null,0,0,""]
["S",3,"S",0,1,1,4,0,0,0,0,"","Serviço","Serviço","-","SINAPI",98535,"PODA EM ALTURA DE ÁRVORE COM DIÂMETRO DE TRONCO MAIOR OU IGUAL A 0,60 M.AF_05/2018","UN",1,1,1,null,null,0,0,""]
[{"$f":"CHOOSE(1+LOG(1+2*(ORÇAMENTO.Nivel=\"Nível 1\")+4*(ORÇAMENTO.Nivel=\"Nível 2\")+8*(ORÇAMENTO.Nivel=\"Nível 3\")+16*(ORÇAMENTO.Nivel=\"Nível 4\")+32*(ORÇAMENTO.Nivel=\"Serviço\"),2),0,1,2,3,4,\"S\")","v":"S"},3,"S",0,1,1,4,0,{"$f":"IF(AND($C43<=4,$C43<>0),0,IF(AND($C43=\"S\",$Y43>0),OFFSET(I43,-1,0)+1,OFFSET(I43,-1,0)))","v":0},0,0,"","Serviço","Serviço","-","SINAPI",98531,"CORTE RASO E RECORTE DE ÁRVORE COM DIÂMETRO DE TRONCO MAIOR OU IGUAL A 0,60 M.AF_05/2018","UN",1,1,1,null,null,0,0,""]
["S",3,"S",0,1,1,4,0,0,0,0,"","Serviço","Serviço","-","SINAPI",98528,"REMOÇÃO DE RAÍZES REMANESCENTES DE TRONCO DE ÁRVORE COM DIÂMETRO MAIOR OU IGUAL A 0,60 M.AF_05/2018","UN",1,1,1,null,null,0,0,""]
[3,3,3,9,1,1,5,0,0,19,9,"","Nível 3","Nível 3","-","SINAPI",null,"ADEQUAÇÃO WC PCD","-",null,1,"-",null,null,0,0,""]
["S",3,"S",0,1,1,5,0,0,0,0,"","Serviço","Serviço","-","AGETOP",20139,"DEMOLIÇAO DE BANCADAS C/ TRANSP. ATÉ CB. E CARGA","m2    ",2.1,1,2.1,null,null,0,0,""]
["S",3,"S",0,1,1,5,0,0,0,0,"","Serviço","Serviço","-","AGETOP",20163,"DEMOLIÇÃO DAS INSTALAÇÕES HIDROSANITÁRIAS E AFINS C/ TRANSP. ATÉ CB. E CARGA","H     ",2,1,2,null,null,0,0,""]
["S",3,"S",0,1,1,5,0,0,0,0,"","Serviço","Serviço","-","SINAPI",97645,"REMOÇÃO DE JANELAS, DE FORMA MANUAL, SEM REAPROVEITAMENTO. AF_12/2017","M2",2.4,1,2.4,null,null,0,0,"Referência: AGETOP - 20106"]
["S",3,"S",0,1,1,5,0,0,0,0,"","Serviço","Serviço","-","SINAPI",97622,"DEMOLIÇÃO DE ALVENARIA DE BLOCO FURADO, DE FORMA MANUAL, SEM REAPROVEITAMENTO. AF_12/2017","M3",0.72,1,0.72,null,null,0,0,"Referência: AGETOP - 20118"]
["S",3,"S",0,1,1,5,0,0,0,0,"","Serviço","Serviço","-","SINAPI",97640,"REMOÇÃO DE FORROS DE DRYWALL, PVC E FIBROMINERAL, DE FORMA MANUAL, SEM REAPROVEITAMENTO. AF_12/2017","M2",11.95,1,11.95,null,null,0,0,""]
["S",3,"S",0,1,1,5,0,0,0,0,"","Serviço","Serviço","-","SINAPI",97642,"REMOÇÃO DE TRAMA METÁLICA OU DE MADEIRA PARA FORRO, DE FORMA MANUAL, SEM REAPROVEITAMENTO. AF_12/2017","M2",11.95,1,11.95,null,null,0,0,""]
["S",3,"S",0,1,1,5,0,0,0,0,"","Serviço","Serviço","-","AGETOP",20112,"DEM.PISO CERAM. INCLUS. RETIRADA DE CONTRAPISO SOBRE LASTRO CONC.C/TR.CB.E CARGA","m2    ",6.34,1,6.34,null,null,0,0,""]
["S",3,"S",0,1,1,5,0,0,0,0,"","Serviço","Serviço","-","SINAPI",97633,"DEMOLIÇÃO DE REVESTIMENTO CERÂMICO, DE FORMA MANUAL, SEM REAPROVEITAMENTO. AF_12/2017","M2",24.81,1,24.81,null,null,0,0,"Referência: AGETOP - 20115"]
[3,3,3,2,1,1,6,0,0,10,2,"","Nível 3","Nível 3","-","SINAPI",null,"INST. HIDROSSANITÁRIAS","-",null,1,"-",null,null,0,0,""]
["S",3,"S",0,1,1,6,0,0,0,0,"","Serviço","Serviço","-","AGETOP",20121,"DEM. MANUAL EM CONCR.SIMPLES C/TR.ATE CB.E CARGA (O.C.)","m3    ",2.13,1,2.13,null,null,0,0,""]
[3,3,3,2,1,1,7,0,0,8,2,"","Nível 3","Nível 3","-","SINAPI",null,"CENTRAL DE GÁS","-",null,1,"-",null,null,0,0,""]
["S",3,"S",0,1,1,7,0,0,0,0,"","Serviço","Serviço","-","AGETOP",20121,"DEM. MANUAL EM CONCR.SIMPLES C/TR.ATE CB.E CARGA (O.C.)","m3    ",0.09,1,0.09,null,null,0,0,""]
[3,3,3,4,1,1,8,0,0,6,4,"","Nível 3","Nível 3","-","SINAPI",null,"INST. ELÉTRICAS","-",null,1,"-",null,null,0,0,""]
["S",3,"S",0,1,1,8,0,0,0,0,"","Serviço","Serviço","-","SINAPI",97661,"REMOÇÃO DE CABOS ELÉTRICOS, DE FORMA MANUAL, SEM REAPROVEITAMENTO. AF_12/2017","M",60,1,60,null,null,0,0,""]
["S",3,"S",0,1,1,8,0,0,0,0,"","Serviço","Serviço","-","SINAPI",97660,"REMOÇÃO DE INTERRUPTORES/TOMADAS ELÉTRICAS, DE FORMA MANUAL, SEM REAPROVEITAMENTO. AF_12/2017","UN",7,1,7,null,null,0,0,""]
["S",3,"S",0,1,1,8,0,0,0,0,"","Serviço","Serviço","-","SINAPI",97665,"REMOÇÃO DE LUMINÁRIAS, DE FORMA MANUAL, SEM REAPROVEITAMENTO. AF_12/2017","UN",1,1,1,null,null,0,0,""]
[3,3,3,2,1,1,9,0,0,2,{"$error":"#N/A"},"","Nível 3","Nível 3","-","SINAPI",null,"OUTROS","-",null,1,"-",null,null,0,0,""]
[{"$f":"CHOOSE(1+LOG(1+2*(ORÇAMENTO.Nivel=\"Nível 1\")+4*(ORÇAMENTO.Nivel=\"Nível 2\")+8*(ORÇAMENTO.Nivel=\"Nível 3\")+16*(ORÇAMENTO.Nivel=\"Nível 4\")+32*(ORÇAMENTO.Nivel=\"Serviço\"),2),0,1,2,3,4,\"S\")","v":"S"},3,"S",0,1,1,9,0,0,0,0,"","Serviço","Serviço","-","AGETOP",21301,"PLACA DE OBRA PLOTADA EM CHAPA METÁLICA 26 , AFIXADA EM CAVALETES DE MADEIRA DE LEI (VIGOTAS 6X12CM) - PADRÃO GOINFRA","m2    ",7.5,1,7.5,null,null,0,0,""]
[2,2,2,3,1,2,0,0,0,300,3,"","Nível 2","Nível 2","-","AGETOP",null,"TRANSPORTES","-",null,1,"-",null,null,0,0,""]
["S",2,"S",0,1,2,0,0,0,0,0,"","Serviço","Serviço","-","SINAPI",72900,"TRANSPORTE DE ENTULHO COM CAMINHAO BASCULANTE 6 M3, RODOVIA PAVIMENTADA, DMT 0,5 A 1,0 KM","M3",46.93,1,46.93,null,null,0,0,""]
["S",2,"S",0,1,2,0,0,0,0,0,"","Serviço","Serviço","-","SINAPI",72897,"CARGA MANUAL DE ENTULHO EM CAMINHAO BASCULANTE 6 M3","M3",46.93,1,46.93,null,null,0,0,""]
[2,2,2,27,1,3,0,0,0,297,27,"","Nível 2","Nível 2","-","AGETOP",null,"SERVIÇO EM TERRA","-",null,1,"-",null,null,0,0,""]
[3,3,3,8,1,3,1,0,0,26,8,"","Nível 3","Nível 3","-",null,null,"ACESSIBILIDADE","-",null,1,"-",null,null,0,0,""]
["S",3,"S",0,1,3,1,0,0,0,0,"","Serviço","Serviço","-","SINAPI",79480,"ESCAVACAO MECANICA CAMPO ABERTO EM SOLO EXCETO ROCHA ATE 2,00M PROFUNDIDADE","M3",7.93,1,7.93,null,null,0,0,"Referência: AGETOP - 41004"]
["S",3,"S",0,1,3,1,0,0,0,0,"","Serviço","Serviço","-","AGETOP",41005,"CARGA MECANIZADA","m3    ",7.93,1,7.93,null,null,0,0,""]
["S",3,"S",0,1,3,1,0,0,0,0,"","Serviço","Serviço","-","AGETOP",41012,"INDENIZAÇÃO DE JAZIDA","m3    ",7.93,1,7.93,null,null,0,0,""]
[{"$f":"CHOOSE(1+LOG(1+2*(ORÇAMENTO.Nivel=\"Nível 1\")+4*(ORÇAMENTO.Nivel=\"Nível 2\")+8*(ORÇAMENTO.Nivel=\"Nível 3\")+16*(ORÇAMENTO.Nivel=\"Nível 4\")+32*(ORÇAMENTO.Nivel=\"Serviço\"),2),0,1,2,3,4,\"S\")","v":"S"},3,"S",0,1,3,1,0,0,0,0,"","Serviço","Serviço","-","AGETOP",41006,"TRANSPORTE DE MATERIAL ESCAVADO M3.KM","m3km  ",79.3,1,79.3,null,null,0,0,""]
["S",3,"S",0,1,3,1,0,0,0,0,"","Serviço","Serviço","-","AGETOP",41009,"COMPACTAÇÃO MECÂNICA SEM CONTROLE LABORATÓRIO","m3    ",6.35,1,6.35,null,null,0,0,""]
["S",{"$f":"IF(OR(C74=\"s\",C74=0),OFFSET(B74,-1,0),C74)","v":3},{"$f":"IF(OFFSET(C74,-1,0)=\"L\",1,IF(OFFSET(C74,-1,0)=1,2,IF(OR(A74=\"s\",A74=0),\"S\",IF(AND(OFFSET(C74,-1,0)=2,A74=4),3,IF(AND(OR(OFFSET(C74,-1,0)=\"s\",OFFSET(C74,-1,0)=0),A74<>\"s\",A74>OFFSET(B74,-1,0)),OFFSET(B74,-1,0),A74)))))","v":"S"},{"$f":"IF(OR(C74=\"S\",C74=0),0,IF(ISERROR(K74),J74,SMALL(J74:K74,1)))","v":0},{"$f":"IF($C74=1,OFFSET(E74,-1,0)+1,OFFSET(E74,-1,0))","v":1},{"$f":"IF($C74=1,0,IF($C74=2,OFFSET(F74,-1,0)+1,OFFSET(F74,-1,0)))","v":3},{"$f":"IF(AND($C74<=2,$C74<>0),0,IF($C74=3,OFFSET(G74,-1,0)+1,OFFSET(G74,-1,0)))","v":1},{"$f":"IF(AND($C74<=3,$C74<>0),0,IF($C74=4,OFFSET(H74,-1,0)+1,OFFSET(H74,-1,0)))","v":0},{"$f":"IF(AND($C74<=4,$C74<>0),0,IF(AND($C74=\"S\",$Y74>0),OFFSET(I74,-1,0)+1,OFFSET(I74,-1,0)))","v":0},0,0,"","Serviço","Serviço","-","AGETOP",41140,"REGULARIZAÇÃO DO TERRENO SEM APILOAMENTO COM TRANSPORTE MANUAL DA TERRA ESCAVADA ","m2    ",96.44,1,96.44,null,null,0,0,""]
["S",3,"S",0,1,3,1,0,0,0,0,"","Serviço","Serviço","-","AGETOP",41002,"APILOAMENTO","m2    ",96.44,1,96.44,null,null,0,0,""]
[3,3,3,3,1,3,2,0,0,18,3,"","Nível 3","Nível 3","-",null,null,"IMPLANTAÇÃO COZINHA/REFEITÓRIO","-",null,1,"-",null,null,0,0,""]
["S",3,"S",0,1,3,2,0,0,0,0,"","Serviço","Serviço","-","AGETOP",41140,"REGULARIZAÇÃO DO TERRENO SEM APILOAMENTO COM TRANSPORTE MANUAL DA TERRA ESCAVADA ","m2    ",190.15,1,190.15,null,null,0,0,""]
["S",3,"S",0,1,3,2,0,0,0,0,"","Serviço","Serviço","-","AGETOP",41002,"APILOAMENTO","m2    ",190.15,1,190.15,null,null,0,0,""]
[3,3,3,6,1,3,3,0,0,15,6,"","Nível 3","Nível 3","-","SINAPI",null,"QUADRA DE ESPORTES","-",null,1,"-",null,null,0,0,""]
["S",3,"S",0,1,3,3,0,0,0,0,"","Serviço","Serviço","-","SINAPI",79480,"ESCAVACAO MECANICA CAMPO ABERTO EM SOLO EXCETO ROCHA ATE 2,00M PROFUNDIDADE","M3",8.6199999999999992,1,8.6199999999999992,null,null,0,0,"Referência: AGETOP - 41004"]
["S",3,"S",0,1,3,3,0,0,0,0,"","Serviço","Serviço","-","AGETOP",41005,"CARGA MECANIZADA","m3    ",8.6199999999999992,1,8.6199999999999992,null,null,0,0,""]
["S",3,"S",0,1,3,3,0,0,0,0,"","Serviço","Serviço","-","AGETOP",41012,"INDENIZAÇÃO DE JAZIDA","m3    ",8.6199999999999992,1,8.6199999999999992,null,null,0,0,""]
["S",3,"S",0,1,3,3,0,{"$f":"IF(AND($C83<=4,$C83<>0),0,IF(AND($C83=\"S\",$Y83>0),OFFSET(I83,-1,0)+1,OFFSET(I83,-1,0)))","v":0},0,0,"","Serviço","Serviço","-","AGETOP",41006,"TRANSPORTE DE MATERIAL ESCAVADO M3.KM","m3km  ",86.199999999999989,1,86.199999999999989,null,null,0,0,""]
["S",3,"S",0,1,3,3,0,0,{"$f":"IF(OR($C84=\"S\",$C84=0),0,MATCH(0,OFFSET($D84,1,$C84,ROW($C$550)-ROW($C84)),0))","v":0},{"$f":"IF(OR($C84=\"S\",$C84=0),0,MATCH(OFFSET($D84,0,$C84)+1,OFFSET($D84,1,$C84,ROW($C$550)-ROW($C84)),0))","v":0},"","Serviço","Serviço","-","AGETOP",41009,"COMPACTAÇÃO MECÂNICA SEM CONTROLE LABORATÓRIO","m3    ",6.9,1,6.9,null,null,0,0,""]
[3,3,3,3,1,3,4,0,0,9,3,"","Nível 3","Nível 3","-","SINAPI",null,"INST. HIDROSSANITÁRIAS","-",null,1,"-",null,null,0,0,""]
["S",3,"S",0,1,3,4,0,0,0,0,"","Serviço","Serviço","-","SINAPI",93358,"ESCAVAÇÃO MANUAL DE VALA COM PROFUNDIDADE MENOR OU IGUAL A 1,30 M. AF_03/2016","M3",19,1,19,null,null,0,0,"Referência: AGETOP - 40101"]
["S",3,"S",0,1,3,4,0,0,0,0,"","Serviço","Serviço","-","SINAPI",96995,"REATERRO MANUAL APILOADO COM SOQUETE. AF_10/2017","M3",19,1,19,null,null,0,0,"Referência: AGETOP - 40902"]
[3,3,3,3,1,3,5,0,0,6,3,"","Nível 3","Nível 3","-","SINAPI",null,"CENTRAL DE GÁS","-",null,1,"-",null,null,0,0,""]
["S",3,"S",0,1,3,5,0,0,0,0,"","Serviço","Serviço","-","SINAPI",93358,"ESCAVAÇÃO MANUAL DE VALA COM PROFUNDIDADE MENOR OU IGUAL A 1,30 M. AF_03/2016","M3",0.45,1,0.45,null,null,0,0,"Referência: AGETOP - 40101"]
["S",3,"S",0,1,3,5,0,0,0,0,"","Serviço","Serviço","-","SINAPI",96995,"REATERRO MANUAL APILOADO COM SOQUETE. AF_10/2017","M3",0.45,1,0.45,null,null,0,0,"Referência: AGETOP - 40902"]
[3,3,3,3,1,3,6,0,0,3,{"$error":"#N/A"},"","Nível 3","Nível 3","-","SINAPI",null,"INST. ELÉTRICAS","-",null,1,"-",null,null,0,0,""]
["S",3,"S",0,1,3,6,0,0,0,0,"","Serviço","Serviço","-","SINAPI",93358,"ESCAVAÇÃO MANUAL DE VALA COM PROFUNDIDADE MENOR OU IGUAL A 1,30 M. AF_03/2016","M3",3,1,3,null,null,0,0,"Referência: AGETOP - 40101"]
["S",3,"S",0,1,3,6,0,0,0,0,"","Serviço","Serviço","-","SINAPI",96995,"REATERRO MANUAL APILOADO COM SOQUETE. AF_10/2017","M3",3,1,3,null,null,0,0,"Referência: AGETOP - 40902"]
[2,2,2,14,1,4,0,0,0,270,14,"","Nível 2","Nível 2","-","AGETOP",null,"FUNDAÇÕES E SONDAGENS","-",null,1,"-",null,null,0,0,""]
[3,3,3,4,1,4,1,0,0,13,4,"","Nível 3","Nível 3","-","SINAPI",null,"ESTACAS","-",null,1,"-",null,null,0,0,""]
["S",3,"S",0,1,4,1,0,0,0,0,"","Serviço","Serviço","-","SINAPI",98230,"ESTACA BROCA DE CONCRETO, DIÂMETRO DE 30 CM, PROFUNDIDADE DE ATÉ 3 M, ESCAVAÇÃO MANUAL COM TRADO CONCHA, NÃO ARMADA. AF_03/2018","M",3,1,3,null,null,0,0,"Referência: AGETOP - 50302"]
["S",3,"S",0,1,4,1,0,0,0,0,"","Serviço","Serviço","-","SINAPI",95576,"MONTAGEM DE ARMADURA LONGITUDINAL/TRANSVERSAL DE ESTACAS DE SEÇÃO CIRCULAR, DIÂMETRO = 8,0 MM. AF_11/2016","KG",4.32,1,4.32,null,null,0,0,"Referência: AGETOP - 52004"]
["S",3,"S",0,1,4,1,0,0,0,0,"","Serviço","Serviço","-","SINAPI",95583,"MONTAGEM DE ARMADURA TRANSVERSAL DE ESTACAS DE SEÇÃO CIRCULAR, DIÂMETRO = 5,0 MM. AF_11/2016","KG",1.69,1,1.69,null,null,0,0,"Referência: AGETOP - 52014"]
[3,3,3,9,1,4,2,0,0,9,114,"","Nível 3","Nível 3","-","SINAPI",null,"VIGAS BALDRAMES","-",null,1,"-",null,null,0,0,""]
["S",3,"S",0,1,4,2,0,0,0,0,"","Serviço","Serviço","-","SINAPI",96527,"ESCAVAÇÃO MANUAL DE VALA PARA VIGA BALDRAME, COM PREVISÃO DE FÔRMA. AF_06/2017","M3",0.66,1,0.66,null,null,0,0,"Referência: AGETOP - 40101"]
["S",3,"S",0,1,4,2,0,0,0,0,"","Serviço","Serviço","-","AGETOP",60191,"FORMA DE TABUA CINTA BALDRAME U=8 VEZES","m2    ",3.29,1,3.29,null,null,0,0,""]
["S",3,"S",0,1,4,2,0,0,0,0,"","Serviço","Serviço","-","AGETOP",41002,"APILOAMENTO","m2    ",2.19,1,2.19,null,null,0,0,""]
["S",3,"S",0,1,4,2,0,0,0,0,"","Serviço","Serviço","-","SINAPI",94963,"CONCRETO FCK = 15MPA, TRAÇO 1:3,4:3,5 (CIMENTO/ AREIA MÉDIA/ BRITA 1)  - PREPARO MECÂNICO COM BETONEIRA 400 L. AF_07/2016","M3",0.23,1,0.23,null,null,0,0,""]
["S",3,"S",0,1,4,2,0,0,0,0,"","Serviço","Serviço","-","AGETOP",51055,"LANÇAMENTO/APLICAÇÃO/ADENSAMENTO MANUAL DE CONCRETO - (O.C.)","m3    ",0.23,1,0.23,null,null,0,0,""]
["S",3,"S",0,1,4,2,0,0,0,0,"","Serviço","Serviço","-","SINAPI",96995,"REATERRO MANUAL APILOADO COM SOQUETE. AF_10/2017","M3",0.43,1,0.43,null,null,0,0,"Referência: AGETOP - 40902"]
["S",3,"S",0,1,4,2,0,0,0,0,"","Serviço","Serviço","-","SINAPI",96545,"ARMAÇÃO DE BLOCO, VIGA BALDRAME OU SAPATA UTILIZANDO AÇO CA-50 DE 8 MM - MONTAGEM. AF_06/2017","KG",9.2799999999999994,1,9.2799999999999994,null,null,0,0,"Referência: AGETOP - 52004"]
["S",3,"S",0,1,4,2,0,0,0,0,"","Serviço","Serviço","-","SINAPI",96543,"ARMAÇÃO DE BLOCO, VIGA BALDRAME E SAPATA UTILIZANDO AÇO CA-60 DE 5 MM - MONTAGEM. AF_06/2017","KG",4.72,1,4.72,null,null,0,0,"Referência: AGETOP - 52014"]
[2,2,2,2,1,5,0,0,0,256,2,"","Nível 2","Nível 2","-","AGETOP",null,"ESTRUTURA","-",null,1,"-",null,null,0,0,""]
[{"$f":"CHOOSE(1+LOG(1+2*(ORÇAMENTO.Nivel=\"Nível 1\")+4*(ORÇAMENTO.Nivel=\"Nível 2\")+8*(ORÇAMENTO.Nivel=\"Nível 3\")+16*(ORÇAMENTO.Nivel=\"Nível 4\")+32*(ORÇAMENTO.Nivel=\"Serviço\"),2),0,1,2,3,4,\"S\")","v":"S"},2,"S",0,1,5,0,0,0,0,0,"","Serviço","Serviço","-","AGETOP",60010,"VERGA/CONTRAVERGA EM CONCRETO ARMADO FCK = 20 MPA","m3    ",0.04,1,0.04,null,null,0,0,""]
[2,2,2,45,1,6,0,0,0,254,45,"","Nível 2","Nível 2","-",null,null,"INSTALAÇÕES ELÉTRICAS","-",null,1,"-",null,null,0,0,""]
["S",2,"S",0,1,6,0,0,0,0,0,"","Serviço","Serviço","-","AGETOP",70351,"BRACADEIRA METALICA TIPO \"U\" DIAM. 3/4\"","Un    ",135,1,135,null,null,0,0,""]
["S",2,"S",0,1,6,0,0,0,0,0,"","Serviço","Serviço","-","AGETOP",70352,"BRACADEIRA METALICA TIPO \"U\" DIAM. 1\"","Un    ",15,1,15,null,null,0,0,""]
["S",2,"S",0,1,6,0,0,0,0,0,"","Serviço","Serviço","-","AGETOP",70354,"BRACADEIRA METALICA TIPO \"U\" DIAM. 1.1/2\"","Un    ",3,1,3,null,null,0,0,""]
["S",2,"S",0,1,6,0,0,0,0,0,"","Serviço","Serviço","-","AGETOP",70421,"BUCHA E ARRUELA METALICA DIAM. 3/4\"","PR    ",270,1,270,null,null,0,0,""]
["S",2,"S",0,1,6,0,0,0,0,0,"","Serviço","Serviço","-","AGETOP",70422,"BUCHA E ARRUELA METALICA DIAM. 1\"","PR    ",30,1,30,null,null,0,0,""]
["S",2,"S",0,1,6,0,0,0,0,0,"","Serviço","Serviço","-","AGETOP",70424,"BUCHA E ARRUELA METALICA DIAM. 1.1/2\"","PR    ",6,1,6,null,null,0,0,""]
["S",2,"S",0,1,6,0,0,0,0,0,"","Serviço","Serviço","-","AGETOP",71861,"PARAFUSO P/BUCHA S-6","Un    ",306,1,306,null,null,0,0,""]
["S",2,"S",0,1,6,0,0,0,0,0,"","Serviço","Serviço","-","SINAPI",92980,"CABO DE COBRE FLEXÍVEL ISOLADO, 10 MM², ANTI-CHAMA 0,6/1,0 KV, PARA DISTRIBUIÇÃO - FORNECIMENTO E INSTALAÇÃO. AF_12/2015","M",10,1,10,null,null,0,0,""]
["S",2,"S",0,1,6,0,0,0,0,0,"","Serviço","Serviço","-","SINAPI",92982,"CABO DE COBRE FLEXÍVEL ISOLADO, 16 MM², ANTI-CHAMA 0,6/1,0 KV, PARA DISTRIBUIÇÃO - FORNECIMENTO E INSTALAÇÃO. AF_12/2015","M",10,1,10,null,null,0,0,""]
["S",2,"S",0,1,6,0,0,0,0,0,"","Serviço","Serviço","-","SINAPI",92984,"CABO DE COBRE FLEXÍVEL ISOLADO, 25 MM², ANTI-CHAMA 0,6/1,0 KV, PARA DISTRIBUIÇÃO - FORNECIMENTO E INSTALAÇÃO. AF_12/2015","M",40,1,40,null,null,0,0,"Referência: AGETOP - 70511"]
["S",2,"S",0,1,6,0,0,0,0,0,"","Serviço","Serviço","-","SINAPI",96971,"CORDOALHA DE COBRE NU 16 MM², NÃO ENTERRADA, COM ISOLADOR - FORNECIMENTO E INSTALAÇÃO. AF_12/2017","M",7,1,7,null,null,0,0,"Referência: AGETOP - 70541"]
["S",2,"S",0,1,6,0,0,0,0,0,"","Serviço","Serviço","-","SINAPI",91926,"CABO DE COBRE FLEXÍVEL ISOLADO, 2,5 MM², ANTI-CHAMA 450/750 V, PARA CIRCUITOS TERMINAIS - FORNECIMENTO E INSTALAÇÃO. AF_12/2015","M",400,1,400,null,null,0,0,"Referência: AGETOP - 70563"]
["S",2,"S",0,1,6,0,0,0,0,0,"","Serviço","Serviço","-","SINAPI",91931,"CABO DE COBRE FLEXÍVEL ISOLADO, 6 MM², ANTI-CHAMA 0,6/1,0 KV, PARA CIRCUITOS TERMINAIS - FORNECIMENTO E INSTALAÇÃO. AF_12/2015","M",225,1,225,null,null,0,0,"Referência: AGETOP - 70583"]
["S",2,"S",0,1,6,0,0,0,0,0,"","Serviço","Serviço","-","AGETOP",70645,"CAIXA DE PASSAGEM METÁLICA DE EMBUTIR 15X15X8 CM","Un    ",1,1,1,null,null,0,0,""]
["S",2,"S",0,1,6,0,0,0,0,0,"","Serviço","Serviço","-","SINAPI",92868,"CAIXA RETANGULAR 4\" X 2\" MÉDIA (1,30 M DO PISO), METÁLICA, INSTALADA EM PAREDE - FORNECIMENTO E INSTALAÇÃO. AF_12/2015","UN",3,1,3,null,null,0,0,"Referência: AGETOP - 70691"]
["S",2,"S",0,1,6,0,0,0,0,0,"","Serviço","Serviço","-","SINAPI",92867,"CAIXA RETANGULAR 4\" X 2\" ALTA (2,00 M DO PISO), METÁLICA, INSTALADA EM PAREDE - FORNECIMENTO E INSTALAÇÃO. AF_12/2015","UN",2,1,2,null,null,0,0,""]
["S",2,"S",0,1,6,0,0,0,0,0,"","Serviço","Serviço","-","SINAPI",97891,"CAIXA ENTERRADA ELÉTRICA RETANGULAR, EM ALVENARIA COM BLOCOS DE CONCRETO, FUNDO COM BRITA, DIMENSÕES INTERNAS: 0,4X0,4X0,4 M. AF_05/2018","UN",2,1,2,null,null,0,0,""]
["S",2,"S",0,1,6,0,0,0,0,0,"","Serviço","Serviço","-","AGETOP",70720,"CAIXA METÁLICA PARA MEDIDOR POLIFÁSICO PADRÃO ENEL 500X380X166MM","Un    ",1,1,1,null,null,0,0,""]
["S",2,"S",0,1,6,0,0,0,0,0,"","Serviço","Serviço","-","AGETOP",70924,"CONDULETE DE PVC - CAIXA COM 5 ENTRADAS ","un    ",15,1,15,null,null,0,0,""]
["S",2,"S",0,1,6,0,0,0,0,0,"","Serviço","Serviço","-","SINAPI",91902,"CURVA 90 GRAUS PARA ELETRODUTO, PVC, ROSCÁVEL, DN 25 MM (3/4\"), PARA CIRCUITOS TERMINAIS, INSTALADA EM LAJE - FORNECIMENTO E INSTALAÇÃO. AF_12/2015","UN",8,1,8,null,null,0,0,"Referência: AGETOP - 71141"]
["S",2,"S",0,1,6,0,0,0,0,0,"","Serviço","Serviço","-","SINAPI",93654,"DISJUNTOR MONOPOLAR TIPO DIN, CORRENTE NOMINAL DE 16A - FORNECIMENTO E INSTALAÇÃO. AF_04/2016","UN",2,1,2,null,null,0,0,""]
["S",2,"S",0,1,6,0,0,0,0,0,"","Serviço","Serviço","-","SINAPI",93671,"DISJUNTOR TRIPOLAR TIPO DIN, CORRENTE NOMINAL DE 32A - FORNECIMENTO E INSTALAÇÃO. AF_04/2016","UN",2,1,2,null,null,0,0,"Referência: AGETOP - 71173"]
["S",2,"S",0,1,6,0,0,0,0,0,"","Serviço","Serviço","-","SINAPI","74130/5","DISJUNTOR TERMOMAGNETICO TRIPOLAR PADRAO NEMA (AMERICANO) 60 A 100A 240V, FORNECIMENTO E INSTALACAO","UN",1,1,1,null,null,0,0,""]
["S",2,"S",0,1,6,0,0,0,0,0,"","Serviço","Serviço","-","AGETOP",71184,"DISPOSITIVO DE PROTEÇÃO CONTRA SURTOS (D.P.S.) 275V DE 8 A 40KA","Un    ",4,1,4,null,null,0,0,""]
["S",2,"S",0,1,6,0,0,0,0,0,"","Serviço","Serviço","-","AGETOP",71196,"ELETRODUTO PVC FLEXÍVEL - MANGUEIRA CORRUGADA REFORÇADA - DIAM. 40MM","M     ",30,1,30,null,null,0,0,""]
["S",2,"S",0,1,6,0,0,0,0,0,"","Serviço","Serviço","-","SINAPI",91871,"ELETRODUTO RÍGIDO ROSCÁVEL, PVC, DN 25 MM (3/4\"), PARA CIRCUITOS TERMINAIS, INSTALADO EM PAREDE - FORNECIMENTO E INSTALAÇÃO. AF_12/2015","M",130,1,130,null,null,0,0,"Referência: AGETOP - 71201"]
[{"$f":"CHOOSE(1+LOG(1+2*(ORÇAMENTO.Nivel=\"Nível 1\")+4*(ORÇAMENTO.Nivel=\"Nível 2\")+8*(ORÇAMENTO.Nivel=\"Nível 3\")+16*(ORÇAMENTO.Nivel=\"Nível 4\")+32*(ORÇAMENTO.Nivel=\"Serviço\"),2),0,1,2,3,4,\"S\")","v":"S"},2,"S",0,1,6,0,0,0,0,0,"","Serviço","Serviço","-","SINAPI",91872,"ELETRODUTO RÍGIDO ROSCÁVEL, PVC, DN 32 MM (1\"), PARA CIRCUITOS TERMINAIS, INSTALADO EM PAREDE - FORNECIMENTO E INSTALAÇÃO. AF_12/2015","M",12,1,12,null,null,0,0,"Referência: AGETOP - 71202"]
["S",2,"S",0,1,6,0,0,0,0,0,"","Serviço","Serviço","-","SINAPI",93008,"ELETRODUTO RÍGIDO ROSCÁVEL, PVC, DN 50 MM (1 1/2\") - FORNECIMENTO E INSTALAÇÃO. AF_12/2015","M",3,1,3,null,null,0,0,""]
["S",2,"S",0,1,6,0,0,0,0,0,"","Serviço","Serviço","-","AGETOP",71321,"FITA DE AUTO FUSAO, ROLO E 10,00 MM","Un    ",2,1,2,null,null,0,0,""]
["S",2,"S",0,1,6,0,0,0,0,0,"","Serviço","Serviço","-","AGETOP",71331,"FITA ISOLANTE, ROLO DE 20,00 M","Un    ",10,1,10,null,null,0,0,""]
["S",2,"S",0,1,6,0,0,0,0,0,"","Serviço","Serviço","-","AGETOP",71381,"HASTE REV.COBRE(COPPERWELD)  5/8\" X 3,00 M C/CONECTOR","Un    ",3,1,3,null,null,0,0,""]
["S",2,"S",0,1,6,0,0,0,0,0,"","Serviço","Serviço","-","SINAPI",92023,"INTERRUPTOR SIMPLES (1 MÓDULO) COM 1 TOMADA DE EMBUTIR 2P+T 10 A,  INCLUINDO SUPORTE E PLACA - FORNECIMENTO E INSTALAÇÃO. AF_12/2015","UN",1,1,1,null,null,0,0,""]
["S",2,"S",0,1,6,0,0,0,0,0,"","Serviço","Serviço","-","SINAPI",91953,"INTERRUPTOR SIMPLES (1 MÓDULO), 10A/250V, INCLUINDO SUPORTE E PLACA - FORNECIMENTO E INSTALAÇÃO. AF_12/2015","UN",1,1,1,null,null,0,0,"Referência: AGETOP - 71440"]
["S",2,"S",0,1,6,0,0,0,0,0,"","Serviço","Serviço","-","COMPOSIÇÃO","COMP 387_SEE","LÂMPADA LED TUBULAR 18W ","UN ",2,1,2,null,null,0,0,""]
["S",2,"S",0,1,6,0,0,0,0,0,"","Serviço","Serviço","-","SINAPI",97611,"LÂMPADA COMPACTA FLUORESCENTE DE 15 W, BASE E27 - FORNECIMENTO E INSTALAÇÃO. AF_02/2020","UN",2,1,2,null,null,0,0,"Referência: AGETOP - 71567"]
["S",2,"S",0,1,6,0,0,0,0,0,"","Serviço","Serviço","-","SINAPI",97585,"LUMINÁRIA TIPO CALHA, DE SOBREPOR, COM 2 LÂMPADAS TUBULARES FLUORESCENTES DE 18 W, COM REATOR DE PARTIDA RÁPIDA - FORNECIMENTO E INSTALAÇÃO. AF_02/2020","UN",1,1,1,null,null,0,0,""]
["S",2,"S",0,1,6,0,0,0,0,0,"","Serviço","Serviço","-","AGETOP",71614,"LUMINÁRIA TIPO ARANDELA DE USO INTERNO - BASE E-27","un    ",2,1,2,null,null,0,0,""]
["S",2,"S",0,1,6,0,0,0,{"$f":"IF(OR($C148=\"S\",$C148=0),0,MATCH(0,OFFSET($D148,1,$C148,ROW($C$550)-ROW($C148)),0))","v":0},{"$f":"IF(OR($C148=\"S\",$C148=0),0,MATCH(OFFSET($D148,0,$C148)+1,OFFSET($D148,1,$C148,ROW($C$550)-ROW($C148)),0))","v":0},"","Serviço","Serviço","-","SINAPI",91884,"LUVA PARA ELETRODUTO, PVC, ROSCÁVEL, DN 25 MM (3/4\"), PARA CIRCUITOS TERMINAIS, INSTALADA EM PAREDE - FORNECIMENTO E INSTALAÇÃO. AF_12/2015","UN",45,1,45,null,null,0,0,"Referência: AGETOP - 71741"]
["S",2,"S",0,1,6,0,0,0,0,0,"","Serviço","Serviço","-","SINAPI",91885,"LUVA PARA ELETRODUTO, PVC, ROSCÁVEL, DN 32 MM (1\"), PARA CIRCUITOS TERMINAIS, INSTALADA EM PAREDE - FORNECIMENTO E INSTALAÇÃO. AF_12/2015","UN",3,1,3,null,null,0,0,"Referência: AGETOP - 71742"]
["S",2,"S",0,1,6,0,0,0,0,0,"","Serviço","Serviço","-","AGETOP",71826,"PADRÃO TRIFASICO 25 MM H=7 METROS","Un    ",1,1,1,null,null,0,0,""]
["S",2,"S",0,1,6,0,0,0,0,0,"","Serviço","Serviço","-","SINAPI","74131/6","QUADRO DE DISTRIBUICAO DE ENERGIA DE EMBUTIR, EM CHAPA METALICA, PARA 32 DISJUNTORES TERMOMAGNETICOS MONOPOLARES, COM BARRAMENTO TRIFASICO E NEUTRO, FORNECIMENTO E INSTALACAO","UN",1,1,1,null,null,0,0,""]
["S",2,"S",0,1,6,0,0,0,0,0,"","Serviço","Serviço","-","AGETOP",72385,"TAMPA CEGA PARA CONDULETE DE PVC","Un    ",5,1,5,null,null,0,0,""]
["S",2,"S",0,1,6,0,0,0,0,0,"","Serviço","Serviço","-","AGETOP",72441,"TAMPA PARA CONDULETE DE PVC PARA 1 TOMADA","un    ",10,1,10,null,null,0,0,""]
["S",2,"S",0,1,6,0,0,0,0,0,"","Serviço","Serviço","-","SINAPI",91990,"TOMADA ALTA DE EMBUTIR (1 MÓDULO), 2P+T 10 A, SEM SUPORTE E SEM PLACA - FORNECIMENTO E INSTALAÇÃO. AF_12/2015","UN",10,1,10,null,null,0,0,""]
[{"$f":"CHOOSE(1+LOG(1+2*(ORÇAMENTO.Nivel=\"Nível 1\")+4*(ORÇAMENTO.Nivel=\"Nível 2\")+8*(ORÇAMENTO.Nivel=\"Nível 3\")+16*(ORÇAMENTO.Nivel=\"Nível 4\")+32*(ORÇAMENTO.Nivel=\"Serviço\"),2),0,1,2,3,4,\"S\")","v":2},{"$f":"IF(OR(C155=\"s\",C155=0),OFFSET(B155,-1,0),C155)","v":2},{"$f":"IF(OFFSET(C155,-1,0)=\"L\",1,IF(OFFSET(C155,-1,0)=1,2,IF(OR(A155=\"s\",A155=0),\"S\",IF(AND(OFFSET(C155,-1,0)=2,A155=4),3,IF(AND(OR(OFFSET(C155,-1,0)=\"s\",OFFSET(C155,-1,0)=0),A155<>\"s\",A155>OFFSET(B155,-1,0)),OFFSET(B155,-1,0),A155)))))","v":2},{"$f":"IF(OR(C155=\"S\",C155=0),0,IF(ISERROR(K155),J155,SMALL(J155:K155,1)))","v":97},{"$f":"IF($C155=1,OFFSET(E155,-1,0)+1,OFFSET(E155,-1,0))","v":1},{"$f":"IF($C155=1,0,IF($C155=2,OFFSET(F155,-1,0)+1,OFFSET(F155,-1,0)))","v":7},{"$f":"IF(AND($C155<=2,$C155<>0),0,IF($C155=3,OFFSET(G155,-1,0)+1,OFFSET(G155,-1,0)))","v":0},{"$f":"IF(AND($C155<=3,$C155<>0),0,IF($C155=4,OFFSET(H155,-1,0)+1,OFFSET(H155,-1,0)))","v":0},{"$f":"IF(AND($C155<=4,$C155<>0),0,IF(AND($C155=\"S\",$Y155>0),OFFSET(I155,-1,0)+1,OFFSET(I155,-1,0)))","v":0},209,97,"","Nível 2","Nível 2","-","AGETOP",null,"INSTALAÇÕES HIDROSSANITÁRIAS","-",null,1,"-",null,null,0,0,""]
[3,3,3,22,1,7,1,0,0,96,22,"","Nível 3","Nível 3","-","SINAPI",null,"PEÇAS E ACESSÓRIOS","-",null,1,"-",null,null,0,0,""]
[4,4,4,9,1,7,1,1,0,21,9,"","Nível 4","Nível 4","-","SINAPI",null,"VASO SANITÁRIO E ACESSÓRIOS","-",null,1,"-",null,null,0,0,""]
["S",4,"S",0,1,7,1,1,0,0,0,"","Serviço","Serviço","-","AGETOP",80502,"VASO SANITARIO","Un    ",2,1,2,null,null,0,0,""]
["S",4,"S",0,1,7,1,1,0,0,0,"","Serviço","Serviço","-","SINAPI",99635,"VÁLVULA DE DESCARGA METÁLICA, BASE 1 1/2 \", ACABAMENTO METALICO CROMADO - FORNECIMENTO E INSTALAÇÃO. AF_01/2019","UN",2,1,2,null,null,0,0,"Referência: AGETOP - 80515"]
["S",4,"S",0,1,7,1,1,0,0,0,"","Serviço","Serviço","-","AGETOP",80510,"ANEL DE VEDAÇÃO PARA VASO SANITÁRIO","Un    ",2,1,2,null,null,0,0,""]
["S",4,"S",0,1,7,1,1,0,0,0,"","Serviço","Serviço","-","AGETOP",80514,"TUBO DE LIGACAO PVC CROMADO 1.1/2\" / ESPUDE  - (ENTRADA)","Un    ",2,1,2,null,null,0,0,""]
["S",4,"S",0,1,7,1,1,0,0,0,"","Serviço","Serviço","-","AGETOP",80513,"TUBO PARA VÁLVULA DE DESCARGA ( CURTO 1.1/4\" )","Un    ",2,1,2,null,null,0,0,""]
["S",4,"S",0,1,7,1,1,0,0,0,"","Serviço","Serviço","-","AGETOP",80520,"CONJUNTO DE FIXACAO P/VASO SANITARIO (PAR)","CJ    ",2,1,2,null,null,0,0,""]
["S",4,"S",0,1,7,1,1,0,0,0,"","Serviço","Serviço","-","AGETOP",80526,"ASSENTO EM POLIPROPILENO COM SISTEMA DE FECHAMENTO SUAVE PARA VASO SANITÁRIO","Un    ",2,1,2,null,null,0,0,""]
["S",4,"S",0,1,7,1,1,0,0,0,"","Serviço","Serviço","-","SINAPI",95544,"PAPELEIRA DE PAREDE EM METAL CROMADO SEM TAMPA, INCLUSO FIXAÇÃO. AF_01/2020","UN",2,1,2,null,null,0,0,""]
[4,4,4,7,1,7,1,2,0,12,7,"","Nível 4","Nível 4","-","SINAPI",null,"LAVATÓRIO E ACESSÓRIOS","-",null,1,"-",null,null,0,0,""]
["S",4,"S",0,1,7,1,2,0,0,0,"","Serviço","Serviço","-","AGETOP",80542,"LAVATÓRIO MÉDIO SEM COLUNA","Un    ",2,1,2,null,null,0,0,""]
["S",4,"S",0,1,7,1,2,0,0,0,"","Serviço","Serviço","-","AGETOP",80550,"FIXACAO P/LAVATORIO (PAR)","PAR   ",2,1,2,null,null,0,0,""]
["S",4,"S",0,1,7,1,2,0,0,0,"","Serviço","Serviço","-","AGETOP",80556,"LIGAÇÃO FLEXÍVEL PVC DIAM.1/2\" (ENGATE)","Un    ",2,1,2,null,null,0,0,""]
["S",4,"S",0,1,7,1,2,0,0,0,"","Serviço","Serviço","-","SINAPI",86883,"SIFÃO DO TIPO FLEXÍVEL EM PVC 1  X 1.1/2  - FORNECIMENTO E INSTALAÇÃO. AF_01/2020","UN",2,1,2,null,null,0,0,""]
["S",4,"S",0,1,7,1,2,0,0,0,"","Serviço","Serviço","-","SINAPI",86915,"TORNEIRA CROMADA DE MESA, 1/2\u0094 OU 3/4\u0094, PARA LAVATÓRIO, PADRÃO MÉDIO - FORNECIMENTO E INSTALAÇÃO. AF_01/2020","UN",2,1,2,null,null,0,0,"Referência: AGETOP - 80570"]
["S",4,"S",0,1,7,1,2,0,0,0,"","Serviço","Serviço","-","SINAPI",86877,"VÁLVULA EM METAL CROMADO 1.1/2\u0094 X 1.1/2\u0094 PARA TANQUE OU LAVATÓRIO, COM OU SEM LADRÃO - FORNECIMENTO E INSTALAÇÃO. AF_01/2020","UN",2,1,2,null,null,0,0,"Referência: AGETOP - 80580"]
[4,4,4,2,1,7,1,3,0,5,2,"","Nível 4","Nível 4","-","SINAPI",null,"TANQUES / TORNEIRAS","-",null,1,"-",null,null,0,0,""]
["S",4,"S",0,1,7,1,3,0,0,0,"","Serviço","Serviço","-","AGETOP",80811,"TORNEIRA DE JARDIM COM BICO PARA MANGUEIRA DIÂMETRO DE 1/2\" E 3/4\"","Un    ",2,1,2,null,null,0,0,""]
[4,4,4,3,1,7,1,4,0,3,20,"","Nível 4","Nível 4","-","SINAPI",null,"REGISTROS","-",null,1,"-",null,null,0,0,""]
["S",4,"S",0,1,7,1,4,0,0,0,"","Serviço","Serviço","-","SINAPI",94794,"REGISTRO DE GAVETA BRUTO, LATÃO, ROSCÁVEL, 1 1/2\u0094, COM ACABAMENTO E CANOPLA CROMADOS, INSTALADO EM RESERVAÇÃO DE ÁGUA DE EDIFICAÇÃO QUE POSSUA RESERVATÓRIO DE FIBRA/FIBROCIMENTO \u0096 FORNECIMENTO E INSTALAÇÃO. AF_06/2016","UN",2,1,2,null,null,0,0,"Referência: AGETOP - 80929"]
["S",4,"S",0,1,7,1,4,0,0,0,"","Serviço","Serviço","-","AGETOP",80911,"REGISTRO DE GAVETA BRUTO 3\"","Un    ",1,1,1,null,null,0,0,""]
[3,3,3,35,1,7,2,0,0,74,35,"","Nível 3","Nível 3","-","SINAPI",null,"ÁGUA FRIA","-",null,1,"-",null,null,0,0,""]
[4,4,4,5,1,7,2,1,0,34,5,"","Nível 4","Nível 4","-","SINAPI",null,"TUBOS DE PVC SOLDÁVEL","-",null,1,"-",null,null,0,0,""]
["S",4,"S",0,1,7,2,1,0,0,0,"","Serviço","Serviço","-","SINAPI",89402,"TUBO, PVC, SOLDÁVEL, DN 25MM, INSTALADO EM RAMAL DE DISTRIBUIÇÃO DE ÁGUA - FORNECIMENTO E INSTALAÇÃO. AF_12/2014","M",20,1,20,null,null,0,0,"Referência: AGETOP - 81003"]
["S",4,"S",0,1,7,2,1,0,0,0,"","Serviço","Serviço","-","SINAPI",89449,"TUBO, PVC, SOLDÁVEL, DN 50MM, INSTALADO EM PRUMADA DE ÁGUA - FORNECIMENTO E INSTALAÇÃO. AF_12/2014","M",15,1,15,null,null,0,0,""]
["S",4,"S",0,1,7,2,1,0,0,0,"","Serviço","Serviço","-","SINAPI",94652,"TUBO, PVC, SOLDÁVEL, DN 60 MM, INSTALADO EM RESERVAÇÃO DE ÁGUA DE EDIFICAÇÃO QUE POSSUA RESERVATÓRIO DE FIBRA/FIBROCIMENTO   FORNECIMENTO E INSTALAÇÃO. AF_06/2016","M",42,1,42,null,null,0,0,""]
["S",4,"S",0,1,7,2,1,0,0,0,"","Serviço","Serviço","-","SINAPI",89452,"TUBO, PVC, SOLDÁVEL, DN 85MM, INSTALADO EM PRUMADA DE ÁGUA - FORNECIMENTO E INSTALAÇÃO. AF_12/2014","M",36,1,36,null,null,0,0,""]
[4,4,4,5,1,7,2,2,0,29,5,"","Nível 4","Nível 4","-","SINAPI",null,"ADAPTADORES DE PVC SOLDÁVEL","-",null,1,"-",null,null,0,0,""]
["S",4,"S",0,1,7,2,2,0,0,0,"","Serviço","Serviço","-","SINAPI",95141,"ADAPTADOR COM FLANGES LIVRES, PVC, SOLDÁVEL LONGO, DN  25 MM X 3/4 , INSTALADO EM RESERVAÇÃO DE ÁGUA DE EDIFICAÇÃO QUE POSSUA RESERVATÓRIO DE FIBRA/FIBROCIMENTO    FORNECIMENTO E INSTALAÇÃO. AF_06/2016","UN",1,1,1,null,null,0,0,""]
["S",4,"S",0,1,7,2,2,0,0,0,"","Serviço","Serviço","-","SINAPI",94714,"ADAPTADOR COM FLANGES LIVRES, PVC, SOLDÁVEL, DN 85 MM X 3 , INSTALADO EM RESERVAÇÃO DE ÁGUA DE EDIFICAÇÃO QUE POSSUA RESERVATÓRIO DE FIBRA/FIBROCIMENTO   FORNECIMENTO E INSTALAÇÃO. AF_06/2016","UN",1,1,1,null,null,0,0,""]
["S",4,"S",0,1,7,2,2,0,0,0,"","Serviço","Serviço","-","SINAPI",89596,"ADAPTADOR CURTO COM BOLSA E ROSCA PARA REGISTRO, PVC, SOLDÁVEL, DN 50MM X 1.1/2\u0094, INSTALADO EM PRUMADA DE ÁGUA - FORNECIMENTO E INSTALAÇÃO. AF_12/2014","UN",6,1,6,null,null,0,0,"Referência: AGETOP - 81069"]
["S",4,"S",0,1,7,2,2,0,0,0,"","Serviço","Serviço","-","SINAPI",94668,"ADAPTADOR CURTO COM BOLSA E ROSCA PARA REGISTRO, PVC, SOLDÁVEL, DN 85 MM X 3 , INSTALADO EM RESERVAÇÃO DE ÁGUA DE EDIFICAÇÃO QUE POSSUA RESERVATÓRIO DE FIBRA/FIBROCIMENTO   FORNECIMENTO E INSTALAÇÃO. AF_06/2016","UN",2,1,2,null,null,0,0,"Referência: AGETOP - 81072"]
[4,4,4,3,1,7,2,3,0,24,3,"","Nível 4","Nível 4","-","SINAPI",null,"LUVAS DE PVC","-",null,1,"-",null,null,0,0,""]
["S",4,"S",0,1,7,2,3,0,0,0,"","Serviço","Serviço","-","SINAPI",89575,"LUVA, PVC, SOLDÁVEL, DN 50MM, INSTALADO EM PRUMADA DE ÁGUA - FORNECIMENTO E INSTALAÇÃO. AF_12/2014","UN",2,1,2,null,null,0,0,"Referência: AGETOP - 81105"]
["S",4,"S",0,1,7,2,3,0,0,0,"","Serviço","Serviço","-","SINAPI",94665,"LUVA, PVC, SOLDÁVEL, DN 60 MM, INSTALADO EM RESERVAÇÃO DE ÁGUA DE EDIFICAÇÃO QUE POSSUA RESERVATÓRIO DE FIBRA/FIBROCIMENTO   FORNECIMENTO E INSTALAÇÃO. AF_06/2016","UN",1,1,1,null,null,0,0,""]
[4,4,4,3,1,7,2,4,0,21,3,"","Nível 4","Nível 4","-","SINAPI",null,"BUCHAS","-",null,1,"-",null,null,0,0,""]
["S",4,"S",0,1,7,2,4,0,0,0,"","Serviço","Serviço","-","COMPOSIÇÃO","COMP 057_SEE","BUCHA DE REDUCAO SOLDAVEL LONGA 85 X 60 mm","UN ",1,1,1,null,null,0,0,""]
["S",4,"S",0,1,7,2,4,0,0,0,"","Serviço","Serviço","-","AGETOP",81165,"BUCHA DE REDUCAO SOLD. CURTA 60 X 50 mm","Un    ",3,1,3,null,null,0,0,""]
[4,4,4,3,1,7,2,5,0,18,3,"","Nível 4","Nível 4","-","SINAPI",null,"CAP","-",null,1,"-",null,null,0,0,""]
["S",4,"S",0,1,7,2,5,0,0,0,"","Serviço","Serviço","-","AGETOP",81254,"CAP PVC SOLDAVEL DIAMETRO 50 mm","Un    ",2,1,2,null,null,0,0,""]
["S",4,"S",0,1,7,2,5,0,0,0,"","Serviço","Serviço","-","AGETOP",81257,"CAP PVC SOLDAVEL DIAMETRO 85 mm","Un    ",1,1,1,null,null,0,0,""]
[4,4,4,7,1,7,2,6,0,15,7,"","Nível 4","Nível 4","-","SINAPI",null,"JOELHO","-",null,1,"-",null,null,0,0,""]
["S",4,"S",0,1,7,2,6,0,0,0,"","Serviço","Serviço","-","SINAPI",89363,"JOELHO 45 GRAUS, PVC, SOLDÁVEL, DN 25MM, INSTALADO EM RAMAL OU SUB-RAMAL DE ÁGUA - FORNECIMENTO E INSTALAÇÃO. AF_12/2014","UN",2,1,2,null,null,0,0,"Referência: AGETOP - 81302"]
["S",4,"S",0,1,7,2,6,0,0,0,"","Serviço","Serviço","-","SINAPI",89481,"JOELHO 90 GRAUS, PVC, SOLDÁVEL, DN 25MM, INSTALADO EM PRUMADA DE ÁGUA - FORNECIMENTO E INSTALAÇÃO. AF_12/2014","UN",10,1,10,null,null,0,0,""]
["S",4,"S",0,1,7,2,6,0,0,0,"","Serviço","Serviço","-","SINAPI",94678,"JOELHO 90 GRAUS, PVC, SOLDÁVEL, DN 50 MM INSTALADO EM RESERVAÇÃO DE ÁGUA DE EDIFICAÇÃO QUE POSSUA RESERVATÓRIO DE FIBRA/FIBROCIMENTO   FORNECIMENTO E INSTALAÇÃO. AF_06/2016","UN",4,1,4,null,null,0,0,"Referência: AGETOP - 81324"]
["S",4,"S",0,1,7,2,6,0,0,0,"","Serviço","Serviço","-","SINAPI",94680,"JOELHO 90 GRAUS, PVC, SOLDÁVEL, DN 60 MM INSTALADO EM RESERVAÇÃO DE ÁGUA DE EDIFICAÇÃO QUE POSSUA RESERVATÓRIO DE FIBRA/FIBROCIMENTO   FORNECIMENTO E INSTALAÇÃO. AF_06/2016","UN",4,1,4,null,null,0,0,"Referência: AGETOP - 81325"]
["S",4,"S",0,1,7,2,6,0,0,0,"","Serviço","Serviço","-","SINAPI",89521,"JOELHO 90 GRAUS, PVC, SOLDÁVEL, DN 85MM, INSTALADO EM PRUMADA DE ÁGUA - FORNECIMENTO E INSTALAÇÃO. AF_12/2014","UN",1,1,1,null,null,0,0,"Referência: AGETOP - 81327"]
["S",4,"S",0,1,7,2,6,0,0,0,"","Serviço","Serviço","-","SINAPI",90373,"JOELHO 90 GRAUS COM BUCHA DE LATÃO, PVC, SOLDÁVEL, DN 25MM, X 1/2\u0094 INSTALADO EM RAMAL OU SUB-RAMAL DE ÁGUA - FORNECIMENTO E INSTALAÇÃO. AF_12/2014","UN",2,1,2,null,null,0,0,"Referência: AGETOP - 81360"]
[4,4,4,5,1,7,2,7,0,8,5,"","Nível 4","Nível 4","-","SINAPI",null,"TÊ","-",null,1,"-",null,null,0,0,""]
["S",4,"S",0,1,7,2,7,0,0,0,"","Serviço","Serviço","-","SINAPI",89625,"TE, PVC, SOLDÁVEL, DN 50MM, INSTALADO EM PRUMADA DE ÁGUA - FORNECIMENTO E INSTALAÇÃO. AF_12/2014","UN",1,1,1,null,null,0,0,""]
["S",4,"S",0,1,7,2,7,0,0,0,"","Serviço","Serviço","-","SINAPI",94699,"TÊ, PVC, SOLDÁVEL, DN 85 MM INSTALADO EM RESERVAÇÃO DE ÁGUA DE EDIFICAÇÃO QUE POSSUA RESERVATÓRIO DE FIBRA/FIBROCIMENTO   FORNECIMENTO E INSTALAÇÃO. AF_06/2016","UN",1,1,1,null,null,0,0,"Referência: AGETOP - 81408"]
["S",4,"S",0,1,7,2,7,0,0,0,"","Serviço","Serviço","-","SINAPI",89627,"TÊ DE REDUÇÃO, PVC, SOLDÁVEL, DN 50MM X 25MM, INSTALADO EM PRUMADA DE ÁGUA - FORNECIMENTO E INSTALAÇÃO. AF_12/2014","UN",2,1,2,null,null,0,0,""]
["S",4,"S",0,1,7,2,7,0,0,0,"","Serviço","Serviço","-","SINAPI",94700,"TÊ DE REDUÇÃO, PVC, SOLDÁVEL, DN 85 MM X 60 MM, INSTALADO EM RESERVAÇÃO DE ÁGUA DE EDIFICAÇÃO QUE POSSUA RESERVATÓRIO DE FIBRA/FIBROCIMENTO   FORNECIMENTO E INSTALAÇÃO. AF_06/2016","UN",2,1,2,null,null,0,0,"Referência: AGETOP - 81428"]
[4,4,4,3,1,7,2,8,0,3,{"$error":"#N/A"},"","Nível 4","Nível 4","-","SINAPI",null,"ADESIVOS","-",null,1,"-",null,null,0,0,""]
["S",4,"S",0,1,7,2,8,0,0,0,"","Serviço","Serviço","-","AGETOP",81501,"ADESIVO PLASTICO - FRASCO 850 G","Un    ",2,1,2,null,null,0,0,""]
["S",4,"S",0,1,7,2,8,0,{"$f":"IF(OR($C212=\"S\",$C212=0),0,MATCH(0,OFFSET($D212,1,$C212,ROW($C$550)-ROW($C212)),0))","v":0},{"$f":"IF(OR($C212=\"S\",$C212=0),0,MATCH(OFFSET($D212,0,$C212)+1,OFFSET($D212,1,$C212,ROW($C$550)-ROW($C212)),0))","v":0},"","Serviço","Serviço","-","AGETOP",81504,"SOLUCAO LIMPADORA 1000 CM3","Un    ",2,1,2,null,null,0,0,""]
[3,3,3,22,1,7,3,0,0,39,22,"","Nível 3","Nível 3","-","SINAPI",null,"ESGOTO SANITÁRIO","-",null,1,"-",null,null,0,0,""]
[4,4,4,4,1,7,3,1,0,21,4,"","Nível 4","Nível 4","-","SINAPI",null,"CORPO DE CAIXA SIFONADA / RALO","-",null,1,"-",null,null,0,0,""]
["S",4,"S",0,1,7,3,1,0,0,0,"","Serviço","Serviço","-","AGETOP",81663,"CORPO CX. SIFONADA DIAM. 150 X 150 X 50","Un    ",2,1,2,null,null,0,0,""]
["S",4,"S",0,1,7,3,1,0,0,0,"","Serviço","Serviço","-","AGETOP",81696,"PROLONGAMENTO PARA CAIXA SIFONADA 150 MM","M     ",2,1,2,null,null,0,0,""]
["S",4,"S",0,1,7,3,1,0,0,0,"","Serviço","Serviço","-","AGETOP",81791,"GRELHA REDONDA BRANCA DIAM. 150 MM","Un    ",2,1,2,null,null,0,0,""]
[4,4,4,2,1,7,3,2,0,17,2,"","Nível 4","Nível 4","-","SINAPI",null,"CURVAS","-",null,1,"-",null,null,0,0,""]
["S",4,"S",0,1,7,3,2,0,0,0,"","Serviço","Serviço","-","SINAPI",89728,"CURVA CURTA 90 GRAUS, PVC, SERIE NORMAL, ESGOTO PREDIAL, DN 40 MM, JUNTA SOLDÁVEL, FORNECIDO E INSTALADO EM RAMAL DE DESCARGA OU RAMAL DE ESGOTO SANITÁRIO. AF_12/2014","UN",4,1,4,null,null,0,0,""]
[4,4,4,6,1,7,3,3,0,15,6,"","Nível 4","Nível 4","-","SINAPI",null,"JOELHOS","-",null,1,"-",null,null,0,0,""]
["S",4,"S",0,1,7,3,3,0,0,0,"","Serviço","Serviço","-","SINAPI",89726,"JOELHO 45 GRAUS, PVC, SERIE NORMAL, ESGOTO PREDIAL, DN 40 MM, JUNTA SOLDÁVEL, FORNECIDO E INSTALADO EM RAMAL DE DESCARGA OU RAMAL DE ESGOTO SANITÁRIO. AF_12/2014","UN",2,1,2,null,null,0,0,""]
["S",4,"S",0,1,7,3,3,0,0,0,"","Serviço","Serviço","-","SINAPI",89732,"JOELHO 45 GRAUS, PVC, SERIE NORMAL, ESGOTO PREDIAL, DN 50 MM, JUNTA ELÁSTICA, FORNECIDO E INSTALADO EM RAMAL DE DESCARGA OU RAMAL DE ESGOTO SANITÁRIO. AF_12/2014","UN",1,1,1,null,null,0,0,""]
["S",4,"S",0,1,7,3,3,0,0,0,"","Serviço","Serviço","-","SINAPI",89810,"JOELHO 45 GRAUS, PVC, SERIE NORMAL, ESGOTO PREDIAL, DN 100 MM, JUNTA ELÁSTICA, FORNECIDO E INSTALADO EM PRUMADA DE ESGOTO SANITÁRIO OU VENTILAÇÃO. AF_12/2014","UN",1,1,1,null,null,0,0,""]
["S",4,"S",0,1,7,3,3,0,0,0,"","Serviço","Serviço","-","AGETOP",81927,"JOELHO 90 GRAUS C/ANEL 40 mm ","Un    ",2,1,2,null,null,0,0,""]
["S",4,"S",0,1,7,3,3,0,0,0,"","Serviço","Serviço","-","SINAPI",89850,"JOELHO 90 GRAUS, PVC, SERIE NORMAL, ESGOTO PREDIAL, DN 100 MM, JUNTA ELÁSTICA, FORNECIDO E INSTALADO EM SUBCOLETOR AÉREO DE ESGOTO SANITÁRIO. AF_12/2014","UN",2,1,2,null,null,0,0,"Referência: AGETOP - 81938"]
[4,4,4,3,1,7,3,4,0,9,3,"","Nível 4","Nível 4","-","SINAPI",null,"JUNÇÕES","-",null,1,"-",null,null,0,0,""]
["S",4,"S",0,1,7,3,4,0,0,0,"","Serviço","Serviço","-","SINAPI",89785,"JUNÇÃO SIMPLES, PVC, SERIE NORMAL, ESGOTO PREDIAL, DN 50 X 50 MM, JUNTA ELÁSTICA, FORNECIDO E INSTALADO EM RAMAL DE DESCARGA OU RAMAL DE ESGOTO SANITÁRIO. AF_12/2014","UN",1,1,1,null,null,0,0,"Referência: AGETOP - 81970"]
["S",4,"S",0,1,7,3,4,0,0,0,"","Serviço","Serviço","-","SINAPI",89797,"JUNÇÃO SIMPLES, PVC, SERIE NORMAL, ESGOTO PREDIAL, DN 100 X 100 MM, JUNTA ELÁSTICA, FORNECIDO E INSTALADO EM RAMAL DE DESCARGA OU RAMAL DE ESGOTO SANITÁRIO. AF_12/2014","UN",1,1,1,null,null,0,0,"Referência: AGETOP - 81975"]
[4,4,4,2,1,7,3,5,0,6,2,"","Nível 4","Nível 4","-","SINAPI",null,"TÊ","-",null,1,"-",null,null,0,0,""]
["S",4,"S",0,1,7,3,5,0,0,0,"","Serviço","Serviço","-","SINAPI",89825,"TE, PVC, SERIE NORMAL, ESGOTO PREDIAL, DN 50 X 50 MM, JUNTA ELÁSTICA, FORNECIDO E INSTALADO EM PRUMADA DE ESGOTO SANITÁRIO OU VENTILAÇÃO. AF_12/2014","UN",1,1,1,null,null,0,0,""]
[4,4,4,4,1,7,3,6,0,4,{"$error":"#N/A"},"","Nível 4","Nível 4","-","SINAPI",null,"TUBOS","-",null,1,"-",null,null,0,0,""]
["S",4,"S",0,1,7,3,6,0,0,0,"","Serviço","Serviço","-","SINAPI",89711,"TUBO PVC, SERIE NORMAL, ESGOTO PREDIAL, DN 40 MM, FORNECIDO E INSTALADO EM RAMAL DE DESCARGA OU RAMAL DE ESGOTO SANITÁRIO. AF_12/2014","M",4,1,4,null,null,0,0,"Referência: AGETOP - 82301"]
["S",4,"S",0,1,7,3,6,0,0,0,"","Serviço","Serviço","-","SINAPI",89798,"TUBO PVC, SERIE NORMAL, ESGOTO PREDIAL, DN 50 MM, FORNECIDO E INSTALADO EM PRUMADA DE ESGOTO SANITÁRIO OU VENTILAÇÃO. AF_12/2014","M",8,1,8,null,null,0,0,""]
["S",4,"S",0,1,7,3,6,0,0,0,"","Serviço","Serviço","-","SINAPI",89800,"TUBO PVC, SERIE NORMAL, ESGOTO PREDIAL, DN 100 MM, FORNECIDO E INSTALADO EM PRUMADA DE ESGOTO SANITÁRIO OU VENTILAÇÃO. AF_12/2014","M",25,1,25,null,null,0,0,""]
[3,3,3,6,1,7,4,0,0,17,6,"","Nível 3","Nível 3","-","SINAPI",null,"OUTROS","-",null,1,"-",null,null,0,0,""]
["S",3,"S",0,1,7,4,0,0,0,0,"","Serviço","Serviço","-","AGETOP",81880,"RES.METALICO TAÇA AÇO PATINÁVEL-V=5M3-COL.SEC.H=6M+FUNDAÇÃO+LOGOTIPO","Un    ",1,1,1,null,null,0,0,""]
["S",3,"S",0,1,7,4,0,0,0,0,"","Serviço","Serviço","-","AGETOP",81885,"TERMINAL DE VENTILACAO DIAMETRO 50 MM","Un    ",1,1,1,null,null,0,0,""]
["S",3,"S",0,1,7,4,0,0,0,0,"","Serviço","Serviço","-","AGETOP",81825,"CAIXA DE PASSAGEM 60 X 60 CM SEM TAMPA","Un    ",2,1,2,null,null,0,0,""]
["S",3,"S",0,1,7,4,0,0,0,0,"","Serviço","Serviço","-","AGETOP",81826,"TAMPA EM CONCRETO ARMADO 25 MPA E=5CM PARA A CAIXA DE PASSAGEM 60X60CM","Un    ",2,1,2,null,null,0,0,""]
["S",3,"S",0,1,7,4,0,0,0,0,"","Serviço","Serviço","-","SINAPI",94797,"TORNEIRA DE BOIA, ROSCÁVEL, 1\u0094, FORNECIDA E INSTALADA EM RESERVAÇÃO DE ÁGUA. AF_06/2016","UN",1,1,1,null,null,0,0,""]
[3,3,3,11,1,7,5,0,0,11,90,"","Nível 3","Nível 3","-","SINAPI",null,"PREVENÇÃO E COMBATE A INCÊNDIO","-",null,1,"-",null,null,0,0,""]
["S",3,"S",0,1,7,5,0,0,0,0,"","Serviço","Serviço","-","AGETOP",85003,"EXTINTOR PO QUIMICO SECO (6 KG) - CAPACIDADE EXTINTORA 20 BC","Un    ",4,1,4,null,null,0,0,""]
["S",3,"S",0,1,7,5,0,0,0,0,"","Serviço","Serviço","-","SINAPI","73775/2","EXTINTOR INCENDIO AGUA-PRESSURIZADA 10L INCL SUPORTE PAREDE CARGA     COMPLETA FORNECIMENTO E COLOCACAO","UN",2,1,2,null,null,0,0,""]
["S",3,"S",0,1,7,5,0,0,0,0,"","Serviço","Serviço","-","SINAPI",97599,"LUMINÁRIA DE EMERGÊNCIA, COM 30 LÂMPADAS LED DE 2 W, SEM REATOR - FORNECIMENTO E INSTALAÇÃO. AF_02/2020","UN",10,1,10,null,null,0,0,""]
["S",3,"S",0,1,7,5,0,0,0,0,"","Serviço","Serviço","-","COMPOSIÇÃO","COMP 024_SEE","SINALIZADOR FOTOLUMINESCENTE PARA EXTINTOR","UN ",6,1,6,null,null,0,0,""]
["S",3,"S",0,1,7,5,0,0,0,0,"","Serviço","Serviço","-","COMPOSIÇÃO","COMP 025_SEE","SINALIZADOR FOTOLUMINESCENTE DE EMERGÊNCIA","UN ",11,1,11,null,null,0,0,""]
["S",3,"S",0,1,7,5,0,0,0,0,"","Serviço","Serviço","-","COMPOSIÇÃO","COMP 277_SEE","MARCAÇÃO NO PISO - 1X1 M PARA EXTINTOR","M2",6,1,6,null,null,0,0,""]
["S",3,"S",0,1,7,5,0,0,0,0,"","Serviço","Serviço","-","COMPOSIÇÃO","COMP 235_SEE","PLACA DE SINALIZAÇÃO EM PVC COD 01 - (300X300) PROIBIDO FUMAR","UN ",1,1,1,null,null,0,0,""]
["S",3,"S",0,1,7,5,0,0,0,0,"","Serviço","Serviço","-","COMPOSIÇÃO","COMP 236_SEE","PLACA DE SINALIZAÇÃO EM PVC COD 06 - (300X300) PERIGO INFLAMÁVEL","UN ",1,1,1,null,null,0,0,""]
["S",3,"S",0,1,7,5,0,0,0,0,"","Serviço","Serviço","-","COMPOSIÇÃO","COMP 411_SEE","PLACA DE SINALIZAÇÃO EM PVC COD 13 - (316X158) SAÍDA DE EMERGÊNCIA","UN ",3,1,3,null,null,0,0,""]
["S",3,"S",0,1,7,5,0,0,0,0,"","Serviço","Serviço","-","COMPOSIÇÃO","COMP 412_SEE","PLACA DE SINALIZAÇÃO EM PVC COD 17 - (316X158) MENSAGEM \"SAÍDA\"","UN ",3,1,3,null,null,0,0,""]
[{"$f":"CHOOSE(1+LOG(1+2*(ORÇAMENTO.Nivel=\"Nível 1\")+4*(ORÇAMENTO.Nivel=\"Nível 2\")+8*(ORÇAMENTO.Nivel=\"Nível 3\")+16*(ORÇAMENTO.Nivel=\"Nível 4\")+32*(ORÇAMENTO.Nivel=\"Serviço\"),2),0,1,2,3,4,\"S\")","v":2},{"$f":"IF(OR(C252=\"s\",C252=0),OFFSET(B252,-1,0),C252)","v":2},{"$f":"IF(OFFSET(C252,-1,0)=\"L\",1,IF(OFFSET(C252,-1,0)=1,2,IF(OR(A252=\"s\",A252=0),\"S\",IF(AND(OFFSET(C252,-1,0)=2,A252=4),3,IF(AND(OR(OFFSET(C252,-1,0)=\"s\",OFFSET(C252,-1,0)=0),A252<>\"s\",A252>OFFSET(B252,-1,0)),OFFSET(B252,-1,0),A252)))))","v":2},{"$f":"IF(OR(C252=\"S\",C252=0),0,IF(ISERROR(K252),J252,SMALL(J252:K252,1)))","v":28},{"$f":"IF($C252=1,OFFSET(E252,-1,0)+1,OFFSET(E252,-1,0))","v":1},{"$f":"IF($C252=1,0,IF($C252=2,OFFSET(F252,-1,0)+1,OFFSET(F252,-1,0)))","v":8},{"$f":"IF(AND($C252<=2,$C252<>0),0,IF($C252=3,OFFSET(G252,-1,0)+1,OFFSET(G252,-1,0)))","v":0},{"$f":"IF(AND($C252<=3,$C252<>0),0,IF($C252=4,OFFSET(H252,-1,0)+1,OFFSET(H252,-1,0)))","v":0},{"$f":"IF(AND($C252<=4,$C252<>0),0,IF(AND($C252=\"S\",$Y252>0),OFFSET(I252,-1,0)+1,OFFSET(I252,-1,0)))","v":0},112,28,"","Nível 2","Nível 2","-",null,null,"INSTALAÇÕES ESPECIAIS","-",null,1,"-",null,null,0,0,""]
["S",2,"S",0,1,8,0,0,0,0,0,"","Serviço","Serviço","-","AGETOP",91007,"CENTRAL DE GÁS PADRÃO GOINFRA SEM INSTALAÇÕES (1+1 CILINDRO 45 KG)","Un    ",1,1,1,null,null,0,0,""]
["S",2,"S",0,1,8,0,0,0,0,0,"","Serviço","Serviço","-","AGETOP",91023,"UNIÃO S/BRONZE PRETA 3/4\" NPT 300 LBS","Un    ",3,1,3,null,null,0,0,""]
["S",2,"S",0,1,8,0,0,0,0,0,"","Serviço","Serviço","-","COMPOSIÇÃO","COMP 382_SEE","TE DE REDUCAO DE FERRO GALVANIZADO, COM ROSCA BSP, DE 3/4\" X 1/2\"","UN ",1,1,1,null,null,0,0,""]
["S",2,"S",0,1,8,0,0,0,0,0,"","Serviço","Serviço","-","COMPOSIÇÃO","COMP 383_SEE","BUCHA DE REDUCAO DE FERRO GALVANIZADO, COM ROSCA BSP, DE 1/2\" X 1/4\"","UN ",3,1,3,null,null,0,0,""]
["S",2,"S",0,1,8,0,0,0,0,0,"","Serviço","Serviço","-","AGETOP",91021,"LUVA GALVANIZADO DE REDUÇÃO 3/4\" X 1/2\" (GÁS)","Un    ",2,1,2,null,null,0,0,""]
["S",2,"S",0,1,8,0,0,0,0,0,"","Serviço","Serviço","-","SINAPI",92692,"NIPLE, EM FERRO GALVANIZADO, CONEXÃO ROSQUEADA, DN 15 (1/2\"), INSTALADO EM RAMAIS E SUB-RAMAIS DE GÁS - FORNECIMENTO E INSTALAÇÃO. AF_12/2015","UN",6,1,6,null,null,0,0,""]
["S",2,"S",0,1,8,0,0,0,0,0,"","Serviço","Serviço","-","AGETOP",91031,"NIPLE DUPLO 300 PSI 3/4\"","Un    ",6,1,6,null,null,0,0,""]
["S",2,"S",0,1,8,0,0,0,0,0,"","Serviço","Serviço","-","COMPOSIÇÃO","COMP 212_SEE","NIPLE DE REDUÇÃO 1/2\" X 1/4\" BSP","UN ",4,1,4,null,null,0,0,""]
["S",2,"S",0,1,8,0,0,0,0,0,"","Serviço","Serviço","-","COMPOSIÇÃO","COMP 213_SEE","NIPLE DE REDUÇÃO 3/4\" X 1/2\" BSP","UN ",4,1,4,null,null,0,0,""]
["S",2,"S",0,1,8,0,0,0,0,0,"","Serviço","Serviço","-","SINAPI",92688,"TUBO DE AÇO GALVANIZADO COM COSTURA, CLASSE MÉDIA, CONEXÃO ROSQUEADA, DN 20 (3/4\"), INSTALADO EM RAMAIS E SUB-RAMAIS DE GÁS - FORNECIMENTO E INSTALAÇÃO. AF_12/2015","M",12,1,12,null,null,0,0,""]
["S",2,"S",0,1,8,0,0,0,0,0,"","Serviço","Serviço","-","SINAPI",92701,"JOELHO 90 GRAUS, EM FERRO GALVANIZADO, CONEXÃO ROSQUEADA, DN 20 (3/4\"), INSTALADO EM RAMAIS E SUB-RAMAIS DE GÁS - FORNECIMENTO E INSTALAÇÃO. AF_12/2015","UN",4,1,4,null,null,0,0,""]
["S",2,"S",0,1,8,0,0,0,0,0,"","Serviço","Serviço","-","COMPOSIÇÃO","COMP 237_SEE","FITA ANTICORROSIVA","M",10,1,10,null,null,0,0,""]
["S",2,"S",0,1,8,0,0,0,0,0,"","Serviço","Serviço","-","AGETOP",91025,"VÁLVULA ESFERICA LATÃO 3/4\"","Un    ",3,1,3,null,null,0,0,""]
["S",2,"S",0,1,8,0,0,0,0,0,"","Serviço","Serviço","-","COMPOSIÇÃO","COMP 542_SEE","VÁLVULA UGV 3/4\" (S) LATÃO","UN ",1,1,1,null,null,0,0,""]
["S",2,"S",0,1,8,0,0,0,0,0,"","Serviço","Serviço","-","COMPOSIÇÃO","COMP 543_SEE","VÁLVULA UGV 1/2\" (S) LATÃO","UN ",1,1,1,null,null,0,0,""]
["S",2,"S",0,1,8,0,0,0,0,0,"","Serviço","Serviço","-","AGETOP",91029,"VALVULA DE RETENÇÃO LATÃO 1/2\" X 7/16\" NPT","Un    ",1,1,1,null,null,0,0,""]
["S",2,"S",0,1,8,0,0,0,0,0,"","Serviço","Serviço","-","COMPOSIÇÃO","COMP 211_SEE","REGULADOR DE 2º ESTÁGIO 5KG/H","UN ",1,1,1,null,null,0,0,""]
["S",2,"S",0,1,8,0,0,0,0,0,"","Serviço","Serviço","-","COMPOSIÇÃO","COMP 210_SEE","REGULADOR DE 1º ESTÁGIO 60KG/H MODELO AP-40  COM MANÔMETRO","UN ",1,1,1,null,null,0,0,""]
["S",2,"S",0,1,8,0,0,0,0,0,"","Serviço","Serviço","-","AGETOP",85003,"EXTINTOR PO QUIMICO SECO (6 KG) - CAPACIDADE EXTINTORA 20 BC","Un    ",1,1,1,null,null,0,0,""]
["S",2,"S",0,1,8,0,0,0,0,0,"","Serviço","Serviço","-","COMPOSIÇÃO","COMP 235_SEE","PLACA DE SINALIZAÇÃO EM PVC COD 01 - (300X300) PROIBIDO FUMAR","UN ",2,1,2,null,null,0,0,""]
["S",2,"S",0,1,8,0,0,0,0,0,"","Serviço","Serviço","-","COMPOSIÇÃO","COMP 236_SEE","PLACA DE SINALIZAÇÃO EM PVC COD 06 - (300X300) PERIGO INFLAMÁVEL","UN ",2,1,2,null,null,0,0,""]
["S",2,"S",0,1,8,0,0,0,0,0,"","Serviço","Serviço","-","AGETOP",91043,"BRAÇADEIRA METALICA TIPO \"D\" DIAM. 3/4\"","Un    ",4,1,4,null,null,0,0,""]
["S",2,"S",0,1,8,0,0,0,0,0,"","Serviço","Serviço","-","AGETOP",71863,"PARAFUSO P/BUCHA S-10","Un    ",8,1,8,null,null,0,0,""]
["S",2,"S",0,1,8,0,0,0,{"$f":"IF(OR($C276=\"S\",$C276=0),0,MATCH(0,OFFSET($D276,1,$C276,ROW($C$550)-ROW($C276)),0))","v":0},{"$f":"IF(OR($C276=\"S\",$C276=0),0,MATCH(OFFSET($D276,0,$C276)+1,OFFSET($D276,1,$C276,ROW($C$550)-ROW($C276)),0))","v":0},"","Serviço","Serviço","-","AGETOP",70393,"BUCHA DE NYLON S-10","Un    ",8,1,8,null,null,0,0,""]
["S",2,"S",0,1,8,0,0,0,0,0,"","Serviço","Serviço","-","AGETOP",91045,"SUPORTE PARA COLETOR","Un    ",2,1,2,null,null,0,0,""]
["S",2,"S",0,1,8,0,0,0,0,0,"","Serviço","Serviço","-","COMPOSIÇÃO","COMP 045_SEE","LAUDO DE ESTANQUEIDADE","UN ",1,1,1,null,null,0,0,""]
["S",2,"S",0,1,8,0,0,0,0,0,"","Serviço","Serviço","-","COMPOSIÇÃO","COMP 277_SEE","MARCAÇÃO NO PISO - 1X1 M PARA EXTINTOR","M2",1,1,1,null,null,0,0,""]
[2,2,2,8,1,9,0,0,0,84,8,"","Nível 2","Nível 2","-","AGETOP",91045,"ALVENARIAS E DIVISÓRIAS","Un    ",null,1,"-",null,null,0,0,""]
[{"$f":"CHOOSE(1+LOG(1+2*(ORÇAMENTO.Nivel=\"Nível 1\")+4*(ORÇAMENTO.Nivel=\"Nível 2\")+8*(ORÇAMENTO.Nivel=\"Nível 3\")+16*(ORÇAMENTO.Nivel=\"Nível 4\")+32*(ORÇAMENTO.Nivel=\"Serviço\"),2),0,1,2,3,4,\"S\")","v":3},{"$f":"IF(OR(C281=\"s\",C281=0),OFFSET(B281,-1,0),C281)","v":3},{"$f":"IF(OFFSET(C281,-1,0)=\"L\",1,IF(OFFSET(C281,-1,0)=1,2,IF(OR(A281=\"s\",A281=0),\"S\",IF(AND(OFFSET(C281,-1,0)=2,A281=4),3,IF(AND(OR(OFFSET(C281,-1,0)=\"s\",OFFSET(C281,-1,0)=0),A281<>\"s\",A281>OFFSET(B281,-1,0)),OFFSET(B281,-1,0),A281)))))","v":3},{"$f":"IF(OR(C281=\"S\",C281=0),0,IF(ISERROR(K281),J281,SMALL(J281:K281,1)))","v":2},{"$f":"IF($C281=1,OFFSET(E281,-1,0)+1,OFFSET(E281,-1,0))","v":1},{"$f":"IF($C281=1,0,IF($C281=2,OFFSET(F281,-1,0)+1,OFFSET(F281,-1,0)))","v":9},{"$f":"IF(AND($C281<=2,$C281<>0),0,IF($C281=3,OFFSET(G281,-1,0)+1,OFFSET(G281,-1,0)))","v":1},{"$f":"IF(AND($C281<=3,$C281<>0),0,IF($C281=4,OFFSET(H281,-1,0)+1,OFFSET(H281,-1,0)))","v":0},{"$f":"IF(AND($C281<=4,$C281<>0),0,IF(AND($C281=\"S\",$Y281>0),OFFSET(I281,-1,0)+1,OFFSET(I281,-1,0)))","v":0},7,2,"","Nível 3","Nível 3","-","SINAPI",null,"ACESSIBILIDADE","-",null,1,"-",null,null,0,0,""]
["S",3,"S",0,1,9,1,0,0,0,0,"","Serviço","Serviço","-","SINAPI",72132,"ALVENARIA EM TIJOLO CERAMICO MACICO 5X10X20CM 1/2 VEZ (ESPESSURA 10CM), ASSENTADO COM ARGAMASSA TRACO 1:2:8 (CIMENTO, CAL E AREIA)","M2",2.3199999999999998,1,2.3199999999999998,null,null,0,0,"Referência: AGETOP - 100102"]
[3,3,3,3,1,9,2,0,0,5,3,"","Nível 3","Nível 3","-","SINAPI",null,"QUADRA DE ESPORTES","-",null,1,"-",null,null,0,0,""]
["S",3,"S",0,1,9,2,0,0,0,0,"","Serviço","Serviço","-","COMPOSIÇÃO","COMP 031_SEE","MURETA P/ QUAD. POLIESP. ALV. DE TIJ. FURADO - 1/2 VEZ - C/ CHP. E PEDRISCO - H=0,80 M","M",70.13,1,70.13,null,null,0,0,""]
["S",3,"S",0,1,9,2,0,0,0,0,"","Serviço","Serviço","-","SINAPI",72132,"ALVENARIA EM TIJOLO CERAMICO MACICO 5X10X20CM 1/2 VEZ (ESPESSURA 10CM), ASSENTADO COM ARGAMASSA TRACO 1:2:8 (CIMENTO, CAL E AREIA)","M2",26.47,1,26.47,null,null,0,0,"Referência: AGETOP - 100102"]
[3,3,3,2,1,9,3,0,0,2,41,"","Nível 3","Nível 3","-","SINAPI",null,"ADEQUAÇÃO WC PCD","-",null,1,"-",null,null,0,0,""]
["S",3,"S",0,1,9,3,0,0,0,0,"","Serviço","Serviço","-","SINAPI",87520,"ALVENARIA DE VEDAÇÃO DE BLOCOS CERÂMICOS FURADOS NA HORIZONTAL DE 9X19X19CM (ESPESSURA 9CM) DE PAREDES COM ÁREA LÍQUIDA MAIOR OU IGUAL A 6M² COM VÃOS E ARGAMASSA DE ASSENTAMENTO COM PREPARO MANUAL. AF_06/2014","M2",17.91,1,17.91,null,null,0,0,"Referência: AGETOP - 100201"]
[2,2,2,3,1,10,0,0,0,76,3,"","Nível 2","Nível 2","-",null,null,"IMPERMEABILIZAÇÃO","-",null,1,"-",null,null,0,0,""]
["S",2,"S",0,1,10,0,0,0,0,0,"","Serviço","Serviço","-","AGETOP",120208,"IMPERMEABILIZACAO-ARGAM. SINT.SEMI - FLEXIVEL","m2    ",12.42,1,12.42,null,null,0,0,""]
["S",2,"S",0,1,10,0,0,0,0,0,"","Serviço","Serviço","-","SINAPI",98562,"IMPERMEABILIZAÇÃO DE FLOREIRA OU VIGA BALDRAME COM ARGAMASSA DE CIMENTO E AREIA, COM ADITIVO IMPERMEABILIZANTE, E = 2 CM. AF_06/2018","M2",3.98,1,3.98,null,null,0,0,"Referência: AGETOP - 120902"]
[2,{"$f":"IF(OR(C291=\"s\",C291=0),OFFSET(B291,-1,0),C291)","v":2},{"$f":"IF(OFFSET(C291,-1,0)=\"L\",1,IF(OFFSET(C291,-1,0)=1,2,IF(OR(A291=\"s\",A291=0),\"S\",IF(AND(OFFSET(C291,-1,0)=2,A291=4),3,IF(AND(OR(OFFSET(C291,-1,0)=\"s\",OFFSET(C291,-1,0)=0),A291<>\"s\",A291>OFFSET(B291,-1,0)),OFFSET(B291,-1,0),A291)))))","v":2},{"$f":"IF(OR(C291=\"S\",C291=0),0,IF(ISERROR(K291),J291,SMALL(J291:K291,1)))","v":9},{"$f":"IF($C291=1,OFFSET(E291,-1,0)+1,OFFSET(E291,-1,0))","v":1},{"$f":"IF($C291=1,0,IF($C291=2,OFFSET(F291,-1,0)+1,OFFSET(F291,-1,0)))","v":11},{"$f":"IF(AND($C291<=2,$C291<>0),0,IF($C291=3,OFFSET(G291,-1,0)+1,OFFSET(G291,-1,0)))","v":0},{"$f":"IF(AND($C291<=3,$C291<>0),0,IF($C291=4,OFFSET(H291,-1,0)+1,OFFSET(H291,-1,0)))","v":0},{"$f":"IF(AND($C291<=4,$C291<>0),0,IF(AND($C291=\"S\",$Y291>0),OFFSET(I291,-1,0)+1,OFFSET(I291,-1,0)))","v":0},73,9,"","Nível 2","Nível 2","-",null,null,"ESQUADRIAS METÁLICAS","-",null,1,"-",null,null,0,0,""]
[{"$f":"CHOOSE(1+LOG(1+2*(ORÇAMENTO.Nivel=\"Nível 1\")+4*(ORÇAMENTO.Nivel=\"Nível 2\")+8*(ORÇAMENTO.Nivel=\"Nível 3\")+16*(ORÇAMENTO.Nivel=\"Nível 4\")+32*(ORÇAMENTO.Nivel=\"Serviço\"),2),0,1,2,3,4,\"S\")","v":3},3,3,4,1,11,1,0,0,8,4,"","Nível 3","Nível 3","-","SINAPI",null,"ACESSIBILIDADE","-",null,1,"-",null,null,0,0,""]
["S",3,"S",0,1,11,1,0,0,0,0,"","Serviço","Serviço","-","COMPOSIÇÃO","COMP 083_SEE","CORRIMÃO PISO - SEDUC","M",8.4,1,8.4,null,null,0,0,""]
["S",3,"S",0,1,11,1,0,0,0,0,"","Serviço","Serviço","-","COMPOSIÇÃO","COMP 082_SEE","CORRIMÃO PAREDE - SEDUC","M",22.65,1,22.65,null,null,0,0,""]
["S",3,"S",0,1,11,1,0,0,0,0,"","Serviço","Serviço","-","COMPOSIÇÃO","COMP 084_SEE","GUARDA-CORPO COM CORRIMÃO - SEDUC","M",13.75,1,13.75,null,null,0,0,""]
[3,3,3,4,1,11,2,0,0,4,13,"","Nível 3","Nível 3","-","SINAPI",null,"ADEQUAÇÃO WC PCD","-",null,1,"-",null,null,0,0,""]
["S",3,"S",0,1,11,2,0,0,0,0,"","Serviço","Serviço","-","AGETOP",180380,"ESQ. MAXIMO AR CHAPA/VIDRO J4 C/FERRAGENS","m2    ",1.08,1,1.08,null,null,0,0,""]
["S",3,"S",0,1,11,2,0,0,0,0,"","Serviço","Serviço","-","AGETOP",180404,"ESQUADRIA BASCULANTE EM CHAPA  J17, J18 e J19 C/FERRAGENS","m2    ",1.08,1,1.08,null,null,0,0,""]
["S",3,"S",0,1,11,2,0,0,0,0,"","Serviço","Serviço","-","AGETOP",180501,"PORTA DE ABRIR EM CHAPA PF-1 C/FERRAGENS","m2    ",3.78,1,3.78,null,null,0,0,""]
[2,2,2,2,1,12,0,0,0,64,2,"","Nível 2","Nível 2","-",null,null,"VIDROS","-",null,1,"-",null,null,0,0,""]
["S",2,"S",0,1,12,0,0,0,0,0,"","Serviço","Serviço","-","SINAPI",72117,"VIDRO LISO COMUM TRANSPARENTE, ESPESSURA 4MM","M2",2.16,1,2.16,null,null,0,0,"Referência: AGETOP - 190102"]
[2,2,2,12,1,13,0,0,0,62,12,"","Nível 2","Nível 2","-",null,null,"REVESTIMENTO DE PAREDE","-",null,1,"-",null,null,0,0,""]
[{"$f":"CHOOSE(1+LOG(1+2*(ORÇAMENTO.Nivel=\"Nível 1\")+4*(ORÇAMENTO.Nivel=\"Nível 2\")+8*(ORÇAMENTO.Nivel=\"Nível 3\")+16*(ORÇAMENTO.Nivel=\"Nível 4\")+32*(ORÇAMENTO.Nivel=\"Serviço\"),2),0,1,2,3,4,\"S\")","v":3},3,3,3,1,13,1,0,0,11,3,"","Nível 3","Nível 3","-","SINAPI",null,"ACESSIBILIDADE","-",null,1,"-",null,null,0,0,""]
["S",3,"S",0,1,13,1,0,0,0,0,"","Serviço","Serviço","-","SINAPI",87904,"CHAPISCO APLICADO EM ALVENARIA (COM PRESENÇA DE VÃOS) E ESTRUTURAS DE CONCRETO DE FACHADA, COM COLHER DE PEDREIRO.  ARGAMASSA TRAÇO 1:3 COM PREPARO MANUAL. AF_06/2014","M2",1.1599999999999999,1,1.1599999999999999,null,null,0,0,"Referência: AGETOP - 200101"]
["S",3,"S",0,1,13,1,0,0,0,0,"","Serviço","Serviço","-","SINAPI",87547,"MASSA ÚNICA, PARA RECEBIMENTO DE PINTURA, EM ARGAMASSA TRAÇO 1:2:8, PREPARO MECÂNICO COM BETONEIRA 400L, APLICADA MANUALMENTE EM FACES INTERNAS DE PAREDES, ESPESSURA DE 10MM, COM EXECUÇÃO DE TALISCAS. AF_06/2014","M2",1.1599999999999999,1,1.1599999999999999,null,null,0,0,""]
[3,3,3,3,1,13,2,0,0,8,3,"","Nível 3","Nível 3","-","SINAPI",null,"QUADRA DE ESPORTES","-",null,1,"-",null,null,0,0,""]
["S",3,"S",0,1,13,2,0,0,0,0,"","Serviço","Serviço","-","SINAPI",87904,"CHAPISCO APLICADO EM ALVENARIA (COM PRESENÇA DE VÃOS) E ESTRUTURAS DE CONCRETO DE FACHADA, COM COLHER DE PEDREIRO.  ARGAMASSA TRAÇO 1:3 COM PREPARO MANUAL. AF_06/2014","M2",15.78,1,15.78,null,null,0,0,"Referência: AGETOP - 200101"]
["S",3,"S",0,1,13,2,0,0,0,0,"","Serviço","Serviço","-","SINAPI",87547,"MASSA ÚNICA, PARA RECEBIMENTO DE PINTURA, EM ARGAMASSA TRAÇO 1:2:8, PREPARO MECÂNICO COM BETONEIRA 400L, APLICADA MANUALMENTE EM FACES INTERNAS DE PAREDES, ESPESSURA DE 10MM, COM EXECUÇÃO DE TALISCAS. AF_06/2014","M2",129.51999999999998,1,129.51999999999998,null,null,0,0,""]
[3,3,3,5,1,13,3,0,0,5,18,"","Nível 3","Nível 3","-","SINAPI",null,"ADEQUAÇÃO WC PCD","-",null,1,"-",null,null,0,0,""]
["S",3,"S",0,1,13,3,0,0,0,0,"","Serviço","Serviço","-","SINAPI",87904,"CHAPISCO APLICADO EM ALVENARIA (COM PRESENÇA DE VÃOS) E ESTRUTURAS DE CONCRETO DE FACHADA, COM COLHER DE PEDREIRO.  ARGAMASSA TRAÇO 1:3 COM PREPARO MANUAL. AF_06/2014","M2",35.35,1,35.35,null,null,0,0,"Referência: AGETOP - 200101"]
["S",3,"S",0,1,13,3,0,0,0,0,"","Serviço","Serviço","-","SINAPI",87553,"EMBOÇO, PARA RECEBIMENTO DE CERÂMICA, EM ARGAMASSA TRAÇO 1:2:8, PREPARO MECÂNICO COM BETONEIRA 400L, APLICADO MANUALMENTE EM FACES INTERNAS DE PAREDES, PARA AMBIENTE COM ÁREA MAIOR QUE 10M2, ESPESSURA DE 10MM, COM EXECUÇÃO DE TALISCAS. AF_06/2014","M2",33.520000000000003,1,33.520000000000003,null,null,0,0,""]
["S",3,"S",0,1,13,3,0,0,0,0,"","Serviço","Serviço","-","SINAPI",87547,"MASSA ÚNICA, PARA RECEBIMENTO DE PINTURA, EM ARGAMASSA TRAÇO 1:2:8, PREPARO MECÂNICO COM BETONEIRA 400L, APLICADA MANUALMENTE EM FACES INTERNAS DE PAREDES, ESPESSURA DE 10MM, COM EXECUÇÃO DE TALISCAS. AF_06/2014","M2",1.83,1,1.83,null,null,0,0,""]
["S",3,"S",0,1,13,3,0,0,0,0,"","Serviço","Serviço","-","SINAPI",87273,"REVESTIMENTO CERÂMICO PARA PAREDES INTERNAS COM PLACAS TIPO ESMALTADA EXTRA DE DIMENSÕES 33X45 CM APLICADAS EM AMBIENTES DE ÁREA MAIOR QUE 5 M² NA ALTURA INTEIRA DAS PAREDES. AF_06/2014","M2",46.41,1,46.41,null,null,0,0,""]
[2,2,2,3,1,14,0,0,0,50,3,"","Nível 2","Nível 2","-",null,null,"FORROS","-",null,1,"-",null,null,0,0,""]
[3,3,3,2,1,14,1,0,0,2,7,"","Nível 3","Nível 3","-","SINAPI",null,"PVC COM ESTRUTURA","-",null,1,"-",null,null,0,0,""]
["S",3,"S",0,1,14,1,0,0,0,0,"","Serviço","Serviço","-","SINAPI",96116,"FORRO EM RÉGUAS DE PVC, FRISADO, PARA AMBIENTES COMERCIAIS, INCLUSIVE ESTRUTURA DE FIXAÇÃO. AF_05/2017_P","M2",11.15,1,11.15,null,null,0,0,"Referência: AGETOP - 210460"]
[2,2,2,16,1,15,0,0,0,47,16,"","Nível 2","Nível 2","-",null,null,"REVESTIMENTO DE PISO","-",null,1,"-",null,null,0,0,""]
[{"$f":"CHOOSE(1+LOG(1+2*(ORÇAMENTO.Nivel=\"Nível 1\")+4*(ORÇAMENTO.Nivel=\"Nível 2\")+8*(ORÇAMENTO.Nivel=\"Nível 3\")+16*(ORÇAMENTO.Nivel=\"Nível 4\")+32*(ORÇAMENTO.Nivel=\"Serviço\"),2),0,1,2,3,4,\"S\")","v":3},3,3,4,1,15,1,0,0,15,4,"","Nível 3","Nível 3","-","SINAPI",null,"ACESSIBILIDADE","-",null,1,"-",null,null,0,0,""]
["S",3,"S",0,1,15,1,0,0,0,0,"","Serviço","Serviço","-","AGETOP",220102,"PISO CONCRETO DESEMPENADO ESPESSURA = 5 CM  1:2,5:3,5","m2    ",96.44,1,96.44,null,null,0,0,""]
["S",3,"S",0,1,15,1,0,0,0,0,"","Serviço","Serviço","-","AGETOP",221120,"PISO DE BORRACHA COLORIDO MODELO TÁTIL ( ALERTA OU DIRECIONAL) INCLUSO CONTRAPISO (1CI:3ARML) C/ E=2CM E NATA DE CIMENTO","m2    ",4.01,1,4.01,null,null,0,0,""]
["S",3,"S",0,1,15,1,0,0,0,0,"","Serviço","Serviço","-","AGETOP",221126,"PISO DE LADRILHO HIDRÁULICO COLORIDO MODELO TÁTIL ( ALERTA OU DIRECIONAL) SEM LASTRO","m2    ",47.400000000000006,1,47.400000000000006,null,null,0,0,""]
[3,3,3,2,1,15,2,0,0,11,2,"","Nível 3","Nível 3","-","SINAPI",null,"IMPLANTAÇÃO COZINHA/REFEITÓRIO","-",null,1,"-",null,null,0,0,""]
["S",3,"S",0,1,15,2,0,0,0,0,"","Serviço","Serviço","-","AGETOP",220102,"PISO CONCRETO DESEMPENADO ESPESSURA = 5 CM  1:2,5:3,5","m2    ",18.95,1,18.95,null,null,0,0,""]
[3,3,3,3,1,15,3,0,0,9,3,"","Nível 3","Nível 3","-","SINAPI",null,"QUADRA DE ESPORTES","-",null,1,"-",null,null,0,0,""]
["S",3,"S",0,1,15,3,0,0,0,0,"","Serviço","Serviço","-","AGETOP",220102,"PISO CONCRETO DESEMPENADO ESPESSURA = 5 CM  1:2,5:3,5","m2    ",38.980000000000004,1,38.980000000000004,null,null,0,0,""]
["S",3,"S",0,1,15,3,0,0,0,0,"","Serviço","Serviço","-","AGETOP",220059,"PISO LAMINADO COM CONCRETO USINADO 20MPA E=5CM","m2    ",326.88,1,326.88,null,null,0,0,""]
[3,3,3,2,1,15,4,0,0,6,2,"","Nível 3","Nível 3","-","SINAPI",null,"ADEQUAÇÃO WC PCD","-",null,1,"-",null,null,0,0,""]
["S",3,"S",0,1,15,4,0,0,0,0,"","Serviço","Serviço","-","SINAPI",87251,"REVESTIMENTO CERÂMICO PARA PISO COM PLACAS TIPO ESMALTADA EXTRA DE DIMENSÕES 45X45 CM APLICADA EM AMBIENTES DE ÁREA MAIOR QUE 10 M2. AF_06/2014","M2",5.82,1,5.82,null,null,0,0,""]
[3,3,3,2,1,15,5,0,0,4,2,"","Nível 3","Nível 3","-","SINAPI",null,"INST. HIDROSSANITÁRIAS","-",null,1,"-",null,null,0,0,""]
["S",3,"S",0,1,15,5,0,0,0,0,"","Serviço","Serviço","-","AGETOP",220102,"PISO CONCRETO DESEMPENADO ESPESSURA = 5 CM  1:2,5:3,5","m2    ",42.5,1,42.5,null,null,0,0,""]
[3,3,3,2,1,15,6,0,0,2,{"$error":"#N/A"},"","Nível 3","Nível 3","-","SINAPI",null,"CENTRAL DE GÁS","-",null,1,"-",null,null,0,0,""]
["S",3,"S",0,1,15,6,0,0,0,0,"","Serviço","Serviço","-","AGETOP",220102,"PISO CONCRETO DESEMPENADO ESPESSURA = 5 CM  1:2,5:3,5","m2    ",1.79,1,1.79,null,null,0,0,""]
[2,{"$f":"IF(OR(C333=\"s\",C333=0),OFFSET(B333,-1,0),C333)","v":2},{"$f":"IF(OFFSET(C333,-1,0)=\"L\",1,IF(OFFSET(C333,-1,0)=1,2,IF(OR(A333=\"s\",A333=0),\"S\",IF(AND(OFFSET(C333,-1,0)=2,A333=4),3,IF(AND(OR(OFFSET(C333,-1,0)=\"s\",OFFSET(C333,-1,0)=0),A333<>\"s\",A333>OFFSET(B333,-1,0)),OFFSET(B333,-1,0),A333)))))","v":2},{"$f":"IF(OR(C333=\"S\",C333=0),0,IF(ISERROR(K333),J333,SMALL(J333:K333,1)))","v":3},{"$f":"IF($C333=1,OFFSET(E333,-1,0)+1,OFFSET(E333,-1,0))","v":1},{"$f":"IF($C333=1,0,IF($C333=2,OFFSET(F333,-1,0)+1,OFFSET(F333,-1,0)))","v":16},{"$f":"IF(AND($C333<=2,$C333<>0),0,IF($C333=3,OFFSET(G333,-1,0)+1,OFFSET(G333,-1,0)))","v":0},{"$f":"IF(AND($C333<=3,$C333<>0),0,IF($C333=4,OFFSET(H333,-1,0)+1,OFFSET(H333,-1,0)))","v":0},{"$f":"IF(AND($C333<=4,$C333<>0),0,IF(AND($C333=\"S\",$Y333>0),OFFSET(I333,-1,0)+1,OFFSET(I333,-1,0)))","v":0},31,3,"","Nível 2","Nível 2","-",null,null,"FERRAGENS","-",null,1,"-",null,null,0,0,""]
["S",2,"S",0,1,16,0,0,0,0,0,"","Serviço","Serviço","-","AGETOP",230174,"BARRA DE APOIO EM AÇO INOX - 40 CM","un    ",6,1,6,null,null,0,0,""]
["S",2,"S",0,1,16,0,0,0,0,0,"","Serviço","Serviço","-","AGETOP",230176,"BARRA DE APOIO EM AÇO INOX - 80 CM ","un    ",6,1,6,null,null,0,0,""]
[2,2,2,3,1,17,0,0,0,28,3,"","Nível 2","Nível 2","-",null,null,"ADMINISTRAÇÃO","-",null,1,"-",null,null,0,0,""]
["S",2,"S",0,1,17,0,0,0,0,0,"","Serviço","Serviço","-","SINAPI",90778,"ENGENHEIRO CIVIL DE OBRA PLENO COM ENCARGOS COMPLEMENTARES","H",50,1,50,null,null,0,0,"Referência: AGETOP - 250101"]
["S",2,"S",0,1,17,0,0,0,0,0,"","Serviço","Serviço","-","SINAPI",90776,"ENCARREGADO GERAL COM ENCARGOS COMPLEMENTARES","H",660,1,660,null,null,0,0,"Referência: AGETOP - 250103"]
[2,2,2,19,1,18,0,0,0,25,19,"","Nível 2","Nível 2","-",null,null,"PINTURA","-",null,1,"-",null,null,0,0,""]
[3,3,3,5,1,18,1,0,0,{"$f":"IF(OR($C340=\"S\",$C340=0),0,MATCH(0,OFFSET($D340,1,$C340,ROW($C$550)-ROW($C340)),0))","v":18},{"$f":"IF(OR($C340=\"S\",$C340=0),0,MATCH(OFFSET($D340,0,$C340)+1,OFFSET($D340,1,$C340,ROW($C$550)-ROW($C340)),0))","v":5},"","Nível 3","Nível 3","-","SINAPI",null,"QUADRA DE ESPORTES","-",null,1,"-",null,null,0,0,""]
[{"$f":"CHOOSE(1+LOG(1+2*(ORÇAMENTO.Nivel=\"Nível 1\")+4*(ORÇAMENTO.Nivel=\"Nível 2\")+8*(ORÇAMENTO.Nivel=\"Nível 3\")+16*(ORÇAMENTO.Nivel=\"Nível 4\")+32*(ORÇAMENTO.Nivel=\"Serviço\"),2),0,1,2,3,4,\"S\")","v":"S"},3,"S",0,1,18,1,0,0,0,0,"","Serviço","Serviço","-","AGETOP",261703,"PINT.POLIESPORTIVA - 2 DEM.(PISOS E CIMENTADOS)","m2    ",326.88,1,326.88,null,null,0,0,""]
["S",3,"S",0,1,18,1,0,0,0,0,"","Serviço","Serviço","-","SINAPI",41595,"PINTURA ACRILICA DE FAIXAS DE DEMARCACAO EM QUADRA POLIESPORTIVA, 5 CM DE LARGURA","M",82.7,1,82.7,null,null,0,0,"Referência: AGETOP - 261700"]
["S",3,"S",0,1,18,1,0,0,0,0,"","Serviço","Serviço","-","AGETOP",261000,"PINTURA LATEX ACRILICA 2 DEMAOS C/SELADOR","m2    ",160.91999999999999,1,160.91999999999999,null,null,0,0,""]
[{"$f":"CHOOSE(1+LOG(1+2*(ORÇAMENTO.Nivel=\"Nível 1\")+4*(ORÇAMENTO.Nivel=\"Nível 2\")+8*(ORÇAMENTO.Nivel=\"Nível 3\")+16*(ORÇAMENTO.Nivel=\"Nível 4\")+32*(ORÇAMENTO.Nivel=\"Serviço\"),2),0,1,2,3,4,\"S\")","v":"S"},3,"S",0,1,18,1,0,0,0,0,"","Serviço","Serviço","-","AGETOP",261602,"PINT.ESMALTE/ESQUAD.FERRO C/FUNDO ANTICOR.","m2    ",168,1,168,null,null,0,0,""]
[3,3,3,4,1,18,2,0,0,13,4,"","Nível 3","Nível 3","-","SINAPI",null,"ADEQUAÇÃO WC PCD","-",null,1,"-",null,null,0,0,""]
["S",3,"S",0,1,18,2,0,0,{"$f":"IF(OR($C346=\"S\",$C346=0),0,MATCH(0,OFFSET($D346,1,$C346,ROW($C$550)-ROW($C346)),0))","v":0},{"$f":"IF(OR($C346=\"S\",$C346=0),0,MATCH(OFFSET($D346,0,$C346)+1,OFFSET($D346,1,$C346,ROW($C$550)-ROW($C346)),0))","v":0},"","Serviço","Serviço","-","SINAPI",88497,"APLICAÇÃO E LIXAMENTO DE MASSA LÁTEX EM PAREDES, DUAS DEMÃOS. AF_06/2014","M2",1.83,1,1.83,null,null,0,0,"Referência: AGETOP - 261300"]
[{"$f":"CHOOSE(1+LOG(1+2*(ORÇAMENTO.Nivel=\"Nível 1\")+4*(ORÇAMENTO.Nivel=\"Nível 2\")+8*(ORÇAMENTO.Nivel=\"Nível 3\")+16*(ORÇAMENTO.Nivel=\"Nível 4\")+32*(ORÇAMENTO.Nivel=\"Serviço\"),2),0,1,2,3,4,\"S\")","v":"S"},3,"S",0,1,18,2,0,0,0,0,"","Serviço","Serviço","-","SINAPI",88489,"APLICAÇÃO MANUAL DE PINTURA COM TINTA LÁTEX ACRÍLICA EM PAREDES, DUAS DEMÃOS. AF_06/2014","M2",1.83,1,1.83,null,null,0,0,"Referência: AGETOP - 261001"]
["S",3,"S",0,1,18,2,0,0,{"$f":"IF(OR($C348=\"S\",$C348=0),0,MATCH(0,OFFSET($D348,1,$C348,ROW($C$550)-ROW($C348)),0))","v":0},{"$f":"IF(OR($C348=\"S\",$C348=0),0,MATCH(OFFSET($D348,0,$C348)+1,OFFSET($D348,1,$C348,ROW($C$550)-ROW($C348)),0))","v":0},"","Serviço","Serviço","-","AGETOP",261602,"PINT.ESMALTE/ESQUAD.FERRO C/FUNDO ANTICOR.","m2    ",15.66,1,15.66,null,null,0,0,""]
[3,3,3,9,1,18,3,0,0,9,{"$error":"#N/A"},"","Nível 3","Nível 3","-","SINAPI",null,"GERAL","-",null,1,"-",null,null,0,0,""]
["S",3,"S",0,1,18,3,0,0,0,0,"","Serviço","Serviço","-","AGETOP",260105,"REMOCAO DE PINTURA ANTIGA A OLEO OU ESMALTE","m2    ",100,1,100,null,null,0,0,""]
["S",3,"S",0,1,18,3,0,0,0,0,"","Serviço","Serviço","-","AGETOP",260104,"REMOCAO DE PINTURA ANTIGA A LATEX","m2    ",100,1,100,null,null,0,0,""]
["S",3,"S",0,1,18,3,0,0,0,0,"","Serviço","Serviço","-","SINAPI",88497,"APLICAÇÃO E LIXAMENTO DE MASSA LÁTEX EM PAREDES, DUAS DEMÃOS. AF_06/2014","M2",200,1,200,null,null,0,0,"Referência: AGETOP - 261300"]
["S",3,"S",0,1,18,3,0,0,0,0,"","Serviço","Serviço","-","SINAPI",88489,"APLICAÇÃO MANUAL DE PINTURA COM TINTA LÁTEX ACRÍLICA EM PAREDES, DUAS DEMÃOS. AF_06/2014","M2",804.8,1,804.8,null,null,0,0,"Referência: AGETOP - 261001"]
["S",3,"S",0,1,18,3,0,0,0,0,"","Serviço","Serviço","-","AGETOP",261550,"PINT.ESMALTE SINT.PAREDES - 2 DEM.C/SELADOR","m2    ",859.12,1,859.12,null,null,0,0,""]
["S",3,"S",0,1,18,3,0,0,0,0,"","Serviço","Serviço","-","AGETOP",260105,"REMOCAO DE PINTURA ANTIGA A OLEO OU ESMALTE","m2    ",302.3,1,302.3,null,null,0,0,""]
["S",3,"S",0,1,18,3,0,0,0,0,"","Serviço","Serviço","-","AGETOP",261602,"PINT.ESMALTE/ESQUAD.FERRO C/FUNDO ANTICOR.","m2    ",302.3,1,302.3,null,null,0,0,""]
[{"$f":"CHOOSE(1+LOG(1+2*(ORÇAMENTO.Nivel=\"Nível 1\")+4*(ORÇAMENTO.Nivel=\"Nível 2\")+8*(ORÇAMENTO.Nivel=\"Nível 3\")+16*(ORÇAMENTO.Nivel=\"Nível 4\")+32*(ORÇAMENTO.Nivel=\"Serviço\"),2),0,1,2,3,4,\"S\")","v":"S"},3,"S",0,1,18,3,0,0,0,0,"","Serviço","Serviço","-","AGETOP",261000,"PINTURA LATEX ACRILICA 2 DEMAOS C/SELADOR","m2    ",558.29999999999995,1,558.29999999999995,null,null,0,0,""]
[2,{"$f":"IF(OR(C358=\"s\",C358=0),OFFSET(B358,-1,0),C358)","v":2},{"$f":"IF(OFFSET(C358,-1,0)=\"L\",1,IF(OFFSET(C358,-1,0)=1,2,IF(OR(A358=\"s\",A358=0),\"S\",IF(AND(OFFSET(C358,-1,0)=2,A358=4),3,IF(AND(OR(OFFSET(C358,-1,0)=\"s\",OFFSET(C358,-1,0)=0),A358<>\"s\",A358>OFFSET(B358,-1,0)),OFFSET(B358,-1,0),A358)))))","v":2},{"$f":"IF(OR(C358=\"S\",C358=0),0,IF(ISERROR(K358),J358,SMALL(J358:K358,1)))","v":6},{"$f":"IF($C358=1,OFFSET(E358,-1,0)+1,OFFSET(E358,-1,0))","v":1},{"$f":"IF($C358=1,0,IF($C358=2,OFFSET(F358,-1,0)+1,OFFSET(F358,-1,0)))","v":19},{"$f":"IF(AND($C358<=2,$C358<>0),0,IF($C358=3,OFFSET(G358,-1,0)+1,OFFSET(G358,-1,0)))","v":0},{"$f":"IF(AND($C358<=3,$C358<>0),0,IF($C358=4,OFFSET(H358,-1,0)+1,OFFSET(H358,-1,0)))","v":0},{"$f":"IF(AND($C358<=4,$C358<>0),0,IF(AND($C358=\"S\",$Y358>0),OFFSET(I358,-1,0)+1,OFFSET(I358,-1,0)))","v":0},6,{"$error":"#N/A"},"","Nível 2","Nível 2","-",null,null,"DIVERSOS","-",null,1,"-",null,null,0,0,""]
["S",2,"S",0,1,19,0,0,0,{"$f":"IF(OR($C359=\"S\",$C359=0),0,MATCH(0,OFFSET($D359,1,$C359,ROW($C$550)-ROW($C359)),0))","v":0},{"$f":"IF(OR($C359=\"S\",$C359=0),0,MATCH(OFFSET($D359,0,$C359)+1,OFFSET($D359,1,$C359,ROW($C$550)-ROW($C359)),0))","v":0},"","Serviço","Serviço","-","AGETOP",270501,"LIMPEZA FINAL DE OBRA - (OBRAS CIVIS)","m2    ",228.13,1,228.13,null,null,0,0,""]
["S",2,"S",0,1,19,0,0,0,0,0,"","Serviço","Serviço","-","COMPOSIÇÃO","COMP 027_SEE","TELA MOSQUITEIRA EM NYLON COM ESTRUTURA DE ALUMÍNIO, COM FORNECIMENTO DE MÃO DE OBRA E INSTALAÇÃO","M2",8.4,1,8.4,null,null,0,0,""]
["S",2,"S",0,1,19,0,0,0,{"$f":"IF(OR($C361=\"S\",$C361=0),0,MATCH(0,OFFSET($D361,1,$C361,ROW($C$550)-ROW($C361)),0))","v":0},{"$f":"IF(OR($C361=\"S\",$C361=0),0,MATCH(OFFSET($D361,0,$C361)+1,OFFSET($D361,1,$C361,ROW($C$550)-ROW($C361)),0))","v":0},"","Serviço","Serviço","-","AGETOP",271103,"CONJUNTO PARA VOLEIBOL EM FERRO GALVANIZADO COM PINTURA (2 SUPORTES)","CJ    ",1,1,1,null,null,0,0,""]
[{"$f":"CHOOSE(1+LOG(1+2*(ORÇAMENTO.Nivel=\"Nível 1\")+4*(ORÇAMENTO.Nivel=\"Nível 2\")+8*(ORÇAMENTO.Nivel=\"Nível 3\")+16*(ORÇAMENTO.Nivel=\"Nível 4\")+32*(ORÇAMENTO.Nivel=\"Serviço\"),2),0,1,2,3,4,\"S\")","v":"S"},2,"S",0,1,19,0,0,0,{"$f":"IF(OR($C362=\"S\",$C362=0),0,MATCH(0,OFFSET($D362,1,$C362,ROW($C$550)-ROW($C362)),0))","v":0},{"$f":"IF(OR($C362=\"S\",$C362=0),0,MATCH(OFFSET($D362,0,$C362)+1,OFFSET($D362,1,$C362,ROW($C$550)-ROW($C362)),0))","v":0},"","Serviço","Serviço","-","AGETOP",270621,"ALAMBRADO EM TUBO INDUSTRIAL 2\"#2,28 E TELA MALHA 4\" FIO 12 (QUADRA ESPORTE EXISTENTE) SEM PINTURA","m2    ",112,1,112,null,null,0,0,""]
["S",2,"S",0,1,19,0,0,0,{"$f":"IF(OR($C363=\"S\",$C363=0),0,MATCH(0,OFFSET($D363,1,$C363,ROW($C$550)-ROW($C363)),0))","v":0},{"$f":"IF(OR($C363=\"S\",$C363=0),0,MATCH(OFFSET($D363,0,$C363)+1,OFFSET($D363,1,$C363,ROW($C$550)-ROW($C363)),0))","v":0},"","Serviço","Serviço","-","AGETOP",270804,"PLACA DE INAUGURAÇÃO AÇO ESCOVADO 60 X 120 CM","un    ",1,1,1,null,null,0,0,""]
[1,1,1,186,2,0,0,0,0,186,{"$error":"#N/A"},"F","Nível 1","Nível 1","2.","SINAPI",null,"COZINHA - REFEITORIO PADRÃO 2009","UN",1,1,1,null,null,0,0,""]
[2,2,2,2,2,1,0,0,0,185,2,"","Nível 2","Nível 2","-","SINAPI",null,"SERVIÇOS PRELIMINARES","-",null,1,"-",null,null,0,0,""]
["S",2,"S",0,2,1,0,0,0,0,0,"","Serviço","Serviço","-","AGETOP",20701,"LOCAÇÃO DA OBRA, EXECUÇÃO DE GABARITO SEM REAPROVEITAMENTO, INCLUSO PINTURA (FACE INTERNA DO RIPÃO 15CM) E PIQUETE COM TESTEMUNHA","m2    ",139.75,1,139.75,null,null,0,0,""]
[2,2,2,3,2,2,0,0,0,183,3,"","Nível 2","Nível 2","-","AGETOP",null,"TRANSPORTES","-",null,1,"-",null,null,0,0,""]
["S",2,"S",0,2,2,0,0,0,0,0,"","Serviço","Serviço","-","SINAPI",72900,"TRANSPORTE DE ENTULHO COM CAMINHAO BASCULANTE 6 M3, RODOVIA PAVIMENTADA, DMT 0,5 A 1,0 KM","M3",10,1,10,null,null,0,0,""]
["S",2,"S",0,2,2,0,0,0,0,0,"","Serviço","Serviço","-","SINAPI",72897,"CARGA MANUAL DE ENTULHO EM CAMINHAO BASCULANTE 6 M3","M3",10,1,10,null,null,0,0,""]
[2,2,2,2,2,3,0,0,0,180,2,"","Nível 2","Nível 2","-","AGETOP",null,"SERVIÇO EM TERRA","-",null,1,"-",null,null,0,0,""]
["S",2,"S",0,2,3,0,0,0,0,0,"","Serviço","Serviço","-","AGETOP",41002,"APILOAMENTO","m2    ",139.75,1,139.75,null,null,0,0,""]
[2,2,2,20,2,4,0,0,0,178,20,"","Nível 2","Nível 2","-","AGETOP",null,"FUNDAÇÕES E SONDAGENS","-",null,1,"-",null,null,0,0,""]
[3,3,3,9,2,4,1,0,0,19,9,"","Nível 3","Nível 3","-","SINAPI",null,"ESTACAS E BLOCOS","-",null,1,"-",null,null,0,0,""]
["S",3,"S",0,2,4,1,0,0,0,0,"","Serviço","Serviço","-","SINAPI",98230,"ESTACA BROCA DE CONCRETO, DIÂMETRO DE 30 CM, PROFUNDIDADE DE ATÉ 3 M, ESCAVAÇÃO MANUAL COM TRADO CONCHA, NÃO ARMADA. AF_03/2018","M",101.5,1,101.5,null,null,0,0,"Referência: AGETOP - 50302"]
["S",3,"S",0,2,4,1,0,0,0,0,"","Serviço","Serviço","-","SINAPI",96522,"ESCAVAÇÃO MANUAL PARA BLOCO DE COROAMENTO OU SAPATA, SEM PREVISÃO DE FÔRMA. AF_06/2017","M3",5.19,1,5.19,null,null,0,0,"Referência: AGETOP - 50901"]
["S",3,"S",0,2,4,1,0,0,0,0,"","Serviço","Serviço","-","SINAPI",94963,"CONCRETO FCK = 15MPA, TRAÇO 1:3,4:3,5 (CIMENTO/ AREIA MÉDIA/ BRITA 1)  - PREPARO MECÂNICO COM BETONEIRA 400 L. AF_07/2016","M3",3.4,1,3.4,null,null,0,0,""]
["S",3,"S",0,2,4,1,0,0,0,0,"","Serviço","Serviço","-","AGETOP",51026,"LANÇAMENTO/APLICAÇÃO/ADENSAMENTO DE CONCRETO EM FUNDAÇÃO- (O.C.)","m3    ",3.4,1,3.4,null,null,0,0,""]
["S",3,"S",0,2,4,1,0,0,0,0,"","Serviço","Serviço","-","AGETOP",60191,"FORMA DE TABUA CINTA BALDRAME U=8 VEZES","m2    ",23.7,1,23.7,null,null,0,0,""]
["S",3,"S",0,2,4,1,0,0,0,0,"","Serviço","Serviço","-","SINAPI",96543,"ARMAÇÃO DE BLOCO, VIGA BALDRAME E SAPATA UTILIZANDO AÇO CA-60 DE 5 MM - MONTAGEM. AF_06/2017","KG",98.2,1,98.2,null,null,0,0,"Referência: AGETOP - 52014"]
["S",3,"S",0,2,4,1,0,0,0,0,"","Serviço","Serviço","-","SINAPI",96546,"ARMAÇÃO DE BLOCO, VIGA BALDRAME OU SAPATA UTILIZANDO AÇO CA-50 DE 10 MM - MONTAGEM. AF_06/2017","KG",226.54,1,226.54,null,null,0,0,"Referência: AGETOP - 52005"]
["S",3,"S",0,2,4,1,0,0,0,0,"","Serviço","Serviço","-","SINAPI",96547,"ARMAÇÃO DE BLOCO, VIGA BALDRAME OU SAPATA UTILIZANDO AÇO CA-50 DE 12,5 MM - MONTAGEM. AF_06/2017","KG",240,1,240,null,null,0,0,""]
[3,3,3,8,2,4,2,0,0,10,8,"","Nível 3","Nível 3","-","SINAPI",null,"VIGAS BALDRAMES","-",null,1,"-",null,null,0,0,""]
["S",3,"S",0,2,4,2,0,0,0,0,"","Serviço","Serviço","-","AGETOP",60191,"FORMA DE TABUA CINTA BALDRAME U=8 VEZES","m2    ",41.5,1,41.5,null,null,0,0,""]
["S",3,"S",0,2,4,2,0,0,0,0,"","Serviço","Serviço","-","SINAPI",94964,"CONCRETO FCK = 20MPA, TRAÇO 1:2,7:3 (CIMENTO/ AREIA MÉDIA/ BRITA 1)  - PREPARO MECÂNICO COM BETONEIRA 400 L. AF_07/2016","M3",2.4,1,2.4,null,null,0,0,""]
["S",3,"S",0,2,4,2,0,0,0,0,"","Serviço","Serviço","-","AGETOP",51026,"LANÇAMENTO/APLICAÇÃO/ADENSAMENTO DE CONCRETO EM FUNDAÇÃO- (O.C.)","m3    ",2.4,1,2.4,null,null,0,0,""]
["S",3,"S",0,2,4,2,0,0,0,0,"","Serviço","Serviço","-","SINAPI",96544,"ARMAÇÃO DE BLOCO, VIGA BALDRAME OU SAPATA UTILIZANDO AÇO CA-50 DE 6,3 MM - MONTAGEM. AF_06/2017","KG",47,1,47,null,null,0,0,"Referência: AGETOP - 52003"]
["S",3,"S",0,2,4,2,0,0,0,0,"","Serviço","Serviço","-","SINAPI",96545,"ARMAÇÃO DE BLOCO, VIGA BALDRAME OU SAPATA UTILIZANDO AÇO CA-50 DE 8 MM - MONTAGEM. AF_06/2017","KG",49,1,49,null,null,0,0,"Referência: AGETOP - 52004"]
["S",3,"S",0,2,4,2,0,0,0,0,"","Serviço","Serviço","-","SINAPI",96546,"ARMAÇÃO DE BLOCO, VIGA BALDRAME OU SAPATA UTILIZANDO AÇO CA-50 DE 10 MM - MONTAGEM. AF_06/2017","KG",38,1,38,null,null,0,0,"Referência: AGETOP - 52005"]
["S",3,"S",0,2,4,2,0,0,0,0,"","Serviço","Serviço","-","SINAPI",96543,"ARMAÇÃO DE BLOCO, VIGA BALDRAME E SAPATA UTILIZANDO AÇO CA-60 DE 5 MM - MONTAGEM. AF_06/2017","KG",72,1,72,null,null,0,0,"Referência: AGETOP - 52014"]
[3,3,3,2,2,4,3,0,0,2,{"$error":"#N/A"},"","Nível 3","Nível 3","-","SINAPI",null,"OUTROS","-",null,1,"-",null,null,0,0,""]
["S",3,"S",0,2,4,3,0,0,0,0,"","Serviço","Serviço","-","AGETOP",50101,"SONDAGENS P/INTERIOR - (OBRAS CIVIS)","m     ",28,1,28,null,null,0,0,""]
[2,2,2,20,2,5,0,0,0,158,20,"","Nível 2","Nível 2","-","AGETOP",null,"ESTRUTURA","-",null,1,"-",null,null,0,0,""]
[3,3,3,8,2,5,1,0,0,19,8,"","Nível 3","Nível 3","-","AGETOP",null,"PILAR","-",null,1,"-",null,null,0,0,""]
["S",3,"S",0,2,5,1,0,0,0,0,"","Serviço","Serviço","-","SINAPI",92426,"MONTAGEM E DESMONTAGEM DE FÔRMA DE PILARES RETANGULARES E ESTRUTURAS SIMILARES COM ÁREA MÉDIA DAS SEÇÕES MENOR OU IGUAL A 0,25 M², PÉ-DIREITO SIMPLES, EM CHAPA DE MADEIRA COMPENSADA RESINADA, 8 UTILIZAÇÕES. AF_12/2015","M2",59.6,1,59.6,null,null,0,0,""]
["S",3,"S",0,2,5,1,0,0,0,0,"","Serviço","Serviço","-","SINAPI",94964,"CONCRETO FCK = 20MPA, TRAÇO 1:2,7:3 (CIMENTO/ AREIA MÉDIA/ BRITA 1)  - PREPARO MECÂNICO COM BETONEIRA 400 L. AF_07/2016","M3",2.5,1,2.5,null,null,0,0,""]
["S",3,"S",0,2,5,1,0,0,0,0,"","Serviço","Serviço","-","SINAPI",92873,"LANÇAMENTO COM USO DE BALDES, ADENSAMENTO E ACABAMENTO DE CONCRETO EM ESTRUTURAS. AF_12/2015","M3",2.5,1,2.5,null,null,0,0,"Referência: AGETOP - 60801"]
["S",3,"S",0,2,5,1,0,0,0,0,"","Serviço","Serviço","-","SINAPI",92776,"ARMAÇÃO DE PILAR OU VIGA DE UMA ESTRUTURA CONVENCIONAL DE CONCRETO ARMADO EM UMA EDIFICAÇÃO TÉRREA OU SOBRADO UTILIZANDO AÇO CA-50 DE 6,3 MM - MONTAGEM. AF_12/2015","KG",42,1,42,null,null,0,0,"Referência: AGETOP - 60303"]
["S",3,"S",0,2,5,1,0,0,0,0,"","Serviço","Serviço","-","SINAPI",92777,"ARMAÇÃO DE PILAR OU VIGA DE UMA ESTRUTURA CONVENCIONAL DE CONCRETO ARMADO EM UMA EDIFICAÇÃO TÉRREA OU SOBRADO UTILIZANDO AÇO CA-50 DE 8,0 MM - MONTAGEM. AF_12/2015","KG",64,1,64,null,null,0,0,"Referência: AGETOP - 60304"]
["S",3,"S",0,2,5,1,0,0,0,0,"","Serviço","Serviço","-","SINAPI",92778,"ARMAÇÃO DE PILAR OU VIGA DE UMA ESTRUTURA CONVENCIONAL DE CONCRETO ARMADO EM UMA EDIFICAÇÃO TÉRREA OU SOBRADO UTILIZANDO AÇO CA-50 DE 10,0 MM - MONTAGEM. AF_12/2015","KG",165.46,1,165.46,null,null,0,0,"Referência: AGETOP - 60305"]
["S",3,"S",0,2,5,1,0,0,0,0,"","Serviço","Serviço","-","SINAPI",92775,"ARMAÇÃO DE PILAR OU VIGA DE UMA ESTRUTURA CONVENCIONAL DE CONCRETO ARMADO EM UMA EDIFICAÇÃO TÉRREA OU SOBRADO UTILIZANDO AÇO CA-60 DE 5,0 MM - MONTAGEM. AF_12/2015","KG",22.8,1,22.8,null,null,0,0,"Referência: AGETOP - 60314"]
[3,3,3,9,2,5,2,0,0,11,9,"","Nível 3","Nível 3","-",null,null,"VIGA DE COBERTURA","-",null,1,"-",null,null,0,0,""]
["S",3,"S",0,2,5,2,0,0,0,0,"","Serviço","Serviço","-","SINAPI",92464,"MONTAGEM E DESMONTAGEM DE FÔRMA DE VIGA, ESCORAMENTO METÁLICO, PÉ-DIREITO SIMPLES, EM CHAPA DE MADEIRA RESINADA, 8 UTILIZAÇÕES. AF_12/2015","M2",40.9,1,40.9,null,null,0,0,"Referência: AGETOP - 60209"]
["S",3,"S",0,2,5,2,0,0,0,0,"","Serviço","Serviço","-","SINAPI",94964,"CONCRETO FCK = 20MPA, TRAÇO 1:2,7:3 (CIMENTO/ AREIA MÉDIA/ BRITA 1)  - PREPARO MECÂNICO COM BETONEIRA 400 L. AF_07/2016","M3",2.4,1,2.4,null,null,0,0,""]
["S",3,"S",0,2,5,2,0,0,0,0,"","Serviço","Serviço","-","SINAPI",92873,"LANÇAMENTO COM USO DE BALDES, ADENSAMENTO E ACABAMENTO DE CONCRETO EM ESTRUTURAS. AF_12/2015","M3",2.4,1,2.4,null,null,0,0,"Referência: AGETOP - 60801"]
["S",3,"S",0,2,5,2,0,0,0,0,"","Serviço","Serviço","-","SINAPI",92776,"ARMAÇÃO DE PILAR OU VIGA DE UMA ESTRUTURA CONVENCIONAL DE CONCRETO ARMADO EM UMA EDIFICAÇÃO TÉRREA OU SOBRADO UTILIZANDO AÇO CA-50 DE 6,3 MM - MONTAGEM. AF_12/2015","KG",18,1,18,null,null,0,0,"Referência: AGETOP - 60303"]
[{"$f":"CHOOSE(1+LOG(1+2*(ORÇAMENTO.Nivel=\"Nível 1\")+4*(ORÇAMENTO.Nivel=\"Nível 2\")+8*(ORÇAMENTO.Nivel=\"Nível 3\")+16*(ORÇAMENTO.Nivel=\"Nível 4\")+32*(ORÇAMENTO.Nivel=\"Serviço\"),2),0,1,2,3,4,\"S\")","v":"S"},3,"S",0,2,5,2,0,{"$f":"IF(AND($C406<=4,$C406<>0),0,IF(AND($C406=\"S\",$Y406>0),OFFSET(I406,-1,0)+1,OFFSET(I406,-1,0)))","v":0},0,0,"","Serviço","Serviço","-","SINAPI",92777,"ARMAÇÃO DE PILAR OU VIGA DE UMA ESTRUTURA CONVENCIONAL DE CONCRETO ARMADO EM UMA EDIFICAÇÃO TÉRREA OU SOBRADO UTILIZANDO AÇO CA-50 DE 8,0 MM - MONTAGEM. AF_12/2015","KG",35,1,35,null,null,0,0,"Referência: AGETOP - 60304"]
["S",3,"S",0,2,5,2,0,0,0,0,"","Serviço","Serviço","-","SINAPI",92778,"ARMAÇÃO DE PILAR OU VIGA DE UMA ESTRUTURA CONVENCIONAL DE CONCRETO ARMADO EM UMA EDIFICAÇÃO TÉRREA OU SOBRADO UTILIZANDO AÇO CA-50 DE 10,0 MM - MONTAGEM. AF_12/2015","KG",89,1,89,null,null,0,0,"Referência: AGETOP - 60305"]
["S",3,"S",0,2,5,2,0,0,0,0,"","Serviço","Serviço","-","SINAPI",92779,"ARMAÇÃO DE PILAR OU VIGA DE UMA ESTRUTURA CONVENCIONAL DE CONCRETO ARMADO EM UMA EDIFICAÇÃO TÉRREA OU SOBRADO UTILIZANDO AÇO CA-50 DE 12,5 MM - MONTAGEM. AF_12/2015","KG",24,1,24,null,null,0,0,""]
["S",{"$f":"IF(OR(C409=\"s\",C409=0),OFFSET(B409,-1,0),C409)","v":3},{"$f":"IF(OFFSET(C409,-1,0)=\"L\",1,IF(OFFSET(C409,-1,0)=1,2,IF(OR(A409=\"s\",A409=0),\"S\",IF(AND(OFFSET(C409,-1,0)=2,A409=4),3,IF(AND(OR(OFFSET(C409,-1,0)=\"s\",OFFSET(C409,-1,0)=0),A409<>\"s\",A409>OFFSET(B409,-1,0)),OFFSET(B409,-1,0),A409)))))","v":"S"},{"$f":"IF(OR(C409=\"S\",C409=0),0,IF(ISERROR(K409),J409,SMALL(J409:K409,1)))","v":0},{"$f":"IF($C409=1,OFFSET(E409,-1,0)+1,OFFSET(E409,-1,0))","v":2},{"$f":"IF($C409=1,0,IF($C409=2,OFFSET(F409,-1,0)+1,OFFSET(F409,-1,0)))","v":5},{"$f":"IF(AND($C409<=2,$C409<>0),0,IF($C409=3,OFFSET(G409,-1,0)+1,OFFSET(G409,-1,0)))","v":2},{"$f":"IF(AND($C409<=3,$C409<>0),0,IF($C409=4,OFFSET(H409,-1,0)+1,OFFSET(H409,-1,0)))","v":0},0,0,0,"","Serviço","Serviço","-","SINAPI",92775,"ARMAÇÃO DE PILAR OU VIGA DE UMA ESTRUTURA CONVENCIONAL DE CONCRETO ARMADO EM UMA EDIFICAÇÃO TÉRREA OU SOBRADO UTILIZANDO AÇO CA-60 DE 5,0 MM - MONTAGEM. AF_12/2015","KG",57,1,57,null,null,0,0,"Referência: AGETOP - 60314"]
[3,3,3,2,2,5,3,0,0,2,{"$error":"#N/A"},"","Nível 3","Nível 3","-",null,null,"LAJE","-",null,1,"-",null,null,0,0,""]
["S",3,"S",0,2,5,3,0,0,0,0,"","Serviço","Serviço","-","SINAPI","74202/1","LAJE PRE-MOLDADA P/FORRO, SOBRECARGA 100KG/M2, VAOS ATE 3,50M/E=8CM, C/LAJOTAS E CAP.C/CONC FCK=20MPA, 3CM, INTER-EIXO 38CM, C/ESCORAMENTO (REAPR.3X) E FERRAGEM NEGATIVA","M2",40.75,1,40.75,null,null,0,0,""]
[2,2,2,28,2,6,0,0,0,138,28,"","Nível 2","Nível 2","-",null,null,"INSTALAÇÕES ELÉTRICAS","-",null,1,"-",null,null,0,0,""]
["S",2,"S",0,2,6,0,0,0,0,0,"","Serviço","Serviço","-","AGETOP",70421,"BUCHA E ARRUELA METALICA DIAM. 3/4\"","PR    ",3,1,3,null,null,0,0,""]
["S",2,"S",0,2,6,0,0,0,0,0,"","Serviço","Serviço","-","SINAPI",92868,"CAIXA RETANGULAR 4\" X 2\" MÉDIA (1,30 M DO PISO), METÁLICA, INSTALADA EM PAREDE - FORNECIMENTO E INSTALAÇÃO. AF_12/2015","UN",26,1,26,null,null,0,0,"Referência: AGETOP - 70691"]
["S",2,"S",0,2,6,0,0,0,0,0,"","Serviço","Serviço","-","SINAPI",92866,"CAIXA SEXTAVADA 3\" X 3\", METÁLICA, INSTALADA EM LAJE - FORNECIMENTO E INSTALAÇÃO. AF_12/2015","UN",10,1,10,null,null,0,0,"Referência: AGETOP - 70680"]
["S",2,"S",0,2,6,0,0,0,0,0,"","Serviço","Serviço","-","SINAPI",91902,"CURVA 90 GRAUS PARA ELETRODUTO, PVC, ROSCÁVEL, DN 25 MM (3/4\"), PARA CIRCUITOS TERMINAIS, INSTALADA EM LAJE - FORNECIMENTO E INSTALAÇÃO. AF_12/2015","UN",6,1,6,null,null,0,0,"Referência: AGETOP - 71141"]
["S",2,"S",0,2,6,0,0,0,0,0,"","Serviço","Serviço","-","SINAPI",97585,"LUMINÁRIA TIPO CALHA, DE SOBREPOR, COM 2 LÂMPADAS TUBULARES FLUORESCENTES DE 18 W, COM REATOR DE PARTIDA RÁPIDA - FORNECIMENTO E INSTALAÇÃO. AF_02/2020","UN",2,1,2,null,null,0,0,""]
["S",2,"S",0,2,6,0,0,0,0,0,"","Serviço","Serviço","-","SINAPI",97586,"LUMINÁRIA TIPO CALHA, DE SOBREPOR, COM 2 LÂMPADAS TUBULARES FLUORESCENTES DE 36 W, COM REATOR DE PARTIDA RÁPIDA - FORNECIMENTO E INSTALAÇÃO. AF_02/2020","UN",14,1,14,null,null,0,0,""]
["S",2,"S",0,2,6,0,0,0,0,0,"","Serviço","Serviço","-","SINAPI",97584,"LUMINÁRIA TIPO CALHA, DE SOBREPOR, COM 1 LÂMPADA TUBULAR FLUORESCENTE DE 36 W, COM REATOR DE PARTIDA RÁPIDA - FORNECIMENTO E INSTALAÇÃO. AF_02/2020","UN",2,1,2,null,null,0,0,""]
["S",2,"S",0,2,6,0,0,0,0,0,"","Serviço","Serviço","-","SINAPI",91884,"LUVA PARA ELETRODUTO, PVC, ROSCÁVEL, DN 25 MM (3/4\"), PARA CIRCUITOS TERMINAIS, INSTALADA EM PAREDE - FORNECIMENTO E INSTALAÇÃO. AF_12/2015","UN",3,1,3,null,null,0,0,"Referência: AGETOP - 71741"]
["S",2,"S",0,2,6,0,0,0,0,0,"","Serviço","Serviço","-","SINAPI",91927,"CABO DE COBRE FLEXÍVEL ISOLADO, 2,5 MM², ANTI-CHAMA 0,6/1,0 KV, PARA CIRCUITOS TERMINAIS - FORNECIMENTO E INSTALAÇÃO. AF_12/2015","M",723.31000000000006,1,723.31000000000006,null,null,0,0,"Referência: AGETOP - 70581"]
["S",2,"S",0,2,6,0,0,0,0,0,"","Serviço","Serviço","-","SINAPI",91931,"CABO DE COBRE FLEXÍVEL ISOLADO, 6 MM², ANTI-CHAMA 0,6/1,0 KV, PARA CIRCUITOS TERMINAIS - FORNECIMENTO E INSTALAÇÃO. AF_12/2015","M",60.8,1,60.8,null,null,0,0,"Referência: AGETOP - 70583"]
["S",2,"S",0,2,6,0,0,0,0,0,"","Serviço","Serviço","-","SINAPI",93654,"DISJUNTOR MONOPOLAR TIPO DIN, CORRENTE NOMINAL DE 16A - FORNECIMENTO E INSTALAÇÃO. AF_04/2016","UN",11,1,11,null,null,0,0,""]
["S",2,"S",0,2,6,0,0,0,0,0,"","Serviço","Serviço","-","SINAPI",93656,"DISJUNTOR MONOPOLAR TIPO DIN, CORRENTE NOMINAL DE 25A - FORNECIMENTO E INSTALAÇÃO. AF_04/2016","UN",1,1,1,null,null,0,0,""]
["S",2,"S",0,2,6,0,0,0,0,0,"","Serviço","Serviço","-","SINAPI",93673,"DISJUNTOR TRIPOLAR TIPO DIN, CORRENTE NOMINAL DE 50A - FORNECIMENTO E INSTALAÇÃO. AF_04/2016","UN",1,1,1,null,null,0,0,"Referência: AGETOP - 71174"]
["S",2,"S",0,2,6,0,0,0,{"$f":"IF(OR($C426=\"S\",$C426=0),0,MATCH(0,OFFSET($D426,1,$C426,ROW($C$550)-ROW($C426)),0))","v":0},{"$f":"IF(OR($C426=\"S\",$C426=0),0,MATCH(OFFSET($D426,0,$C426)+1,OFFSET($D426,1,$C426,ROW($C$550)-ROW($C426)),0))","v":0},"","Serviço","Serviço","-","AGETOP",71456,"INTERRUPTOR DIFERENCIAL RESIDUAL (D.R.) TETRAPOLAR DE 40A-30mA","Un    ",1,1,1,null,null,0,0,""]
["S",2,"S",0,2,6,0,0,0,0,0,"","Serviço","Serviço","-","SINAPI",91844,"ELETRODUTO FLEXÍVEL CORRUGADO, PVC, DN 25 MM (3/4\"), PARA CIRCUITOS TERMINAIS, INSTALADO EM LAJE - FORNECIMENTO E INSTALAÇÃO. AF_12/2015","M",96.82,1,96.82,null,null,0,0,""]
["S",2,"S",0,2,6,0,0,0,0,0,"","Serviço","Serviço","-","SINAPI",91846,"ELETRODUTO FLEXÍVEL CORRUGADO, PVC, DN 32 MM (1\"), PARA CIRCUITOS TERMINAIS, INSTALADO EM LAJE - FORNECIMENTO E INSTALAÇÃO. AF_12/2015","M",10.1,1,10.1,null,null,0,0,""]
["S",2,"S",0,2,6,0,0,0,0,0,"","Serviço","Serviço","-","AGETOP",71197,"ELETRODUTO PVC FLEXÍVEL - MANGUEIRA CORRUGADA REFORÇADA - DIAM. 50MM","M     ",31.1,1,31.1,null,null,0,0,""]
["S",2,"S",0,2,6,0,0,0,0,0,"","Serviço","Serviço","-","COMPOSIÇÃO","COMP 387_SEE","LÂMPADA LED TUBULAR 18W ","UN ",29,1,29,null,null,0,0,""]
["S",2,"S",0,2,6,0,0,0,0,0,"","Serviço","Serviço","-","SINAPI",97611,"LÂMPADA COMPACTA FLUORESCENTE DE 15 W, BASE E27 - FORNECIMENTO E INSTALAÇÃO. AF_02/2020","UN",2,1,2,null,null,0,0,"Referência: AGETOP - 71567"]
["S",2,"S",0,2,6,0,0,0,0,0,"","Serviço","Serviço","-","SINAPI",92000,"TOMADA BAIXA DE EMBUTIR (1 MÓDULO), 2P+T 10 A, INCLUINDO SUPORTE E PLACA - FORNECIMENTO E INSTALAÇÃO. AF_12/2015","UN",3,1,3,null,null,0,0,"Referência: AGETOP - 72578"]
["S",2,"S",0,2,6,0,0,0,0,0,"","Serviço","Serviço","-","SINAPI",91996,"TOMADA MÉDIA DE EMBUTIR (1 MÓDULO), 2P+T 10 A, INCLUINDO SUPORTE E PLACA - FORNECIMENTO E INSTALAÇÃO. AF_12/2015","UN",14,1,14,null,null,0,0,"Referência: AGETOP - 72578"]
["S",2,"S",0,2,6,0,0,0,0,0,"","Serviço","Serviço","-","SINAPI",91992,"TOMADA ALTA DE EMBUTIR (1 MÓDULO), 2P+T 10 A, INCLUINDO SUPORTE E PLACA - FORNECIMENTO E INSTALAÇÃO. AF_12/2015","UN",1,1,1,null,null,0,0,""]
["S",2,"S",0,2,6,0,0,0,0,0,"","Serviço","Serviço","-","SINAPI",91955,"INTERRUPTOR PARALELO (1 MÓDULO), 10A/250V, INCLUINDO SUPORTE E PLACA - FORNECIMENTO E INSTALAÇÃO. AF_12/2015","UN",4,1,4,null,null,0,0,"Referência: AGETOP - 71431"]
["S",2,"S",0,2,6,0,0,0,0,0,"","Serviço","Serviço","-","SINAPI",91953,"INTERRUPTOR SIMPLES (1 MÓDULO), 10A/250V, INCLUINDO SUPORTE E PLACA - FORNECIMENTO E INSTALAÇÃO. AF_12/2015","UN",5,1,5,null,null,0,0,"Referência: AGETOP - 71440"]
["S",2,"S",0,2,6,0,0,0,0,0,"","Serviço","Serviço","-","SINAPI",91959,"INTERRUPTOR SIMPLES (2 MÓDULOS), 10A/250V, INCLUINDO SUPORTE E PLACA - FORNECIMENTO E INSTALAÇÃO. AF_12/2015","UN",1,1,1,null,null,0,0,"Referência: AGETOP - 71441"]
["S",2,"S",0,2,6,0,0,0,0,0,"","Serviço","Serviço","-","SINAPI",96986,"HASTE DE ATERRAMENTO 3/4  PARA SPDA - FORNECIMENTO E INSTALAÇÃO. AF_12/2017","UN",3,1,3,null,null,0,0,""]
["S",2,"S",0,2,6,0,0,0,0,0,"","Serviço","Serviço","-","SINAPI","74131/4","QUADRO DE DISTRIBUICAO DE ENERGIA DE EMBUTIR, EM CHAPA METALICA, PARA 18 DISJUNTORES TERMOMAGNETICOS MONOPOLARES, COM BARRAMENTO TRIFASICO E NEUTRO, FORNECIMENTO E INSTALACAO","UN",1,1,1,null,null,0,0,""]
[2,2,2,60,2,7,0,0,0,110,60,"","Nível 2","Nível 2","-",null,null,"INSTALAÇÕES HIDROSSANITÁRIAS","-",null,1,"-",null,null,0,0,""]
["S",2,"S",0,2,7,0,0,0,0,0,"","Serviço","Serviço","-","AGETOP",80502,"VASO SANITARIO","Un    ",1,1,1,null,null,0,0,""]
["S",2,"S",0,2,7,0,0,0,0,0,"","Serviço","Serviço","-","AGETOP",80510,"ANEL DE VEDAÇÃO PARA VASO SANITÁRIO","Un    ",1,1,1,null,null,0,0,""]
["S",2,"S",0,2,7,0,0,0,0,0,"","Serviço","Serviço","-","AGETOP",80513,"TUBO PARA VÁLVULA DE DESCARGA ( CURTO 1.1/4\" )","Un    ",1,1,1,null,null,0,0,""]
["S",2,"S",0,2,7,0,0,0,0,0,"","Serviço","Serviço","-","AGETOP",80514,"TUBO DE LIGACAO PVC CROMADO 1.1/2\" / ESPUDE  - (ENTRADA)","Un    ",1,1,1,null,null,0,0,""]
["S",2,"S",0,2,7,0,0,0,0,0,"","Serviço","Serviço","-","AGETOP",80517,"VÁLVULA DE DESCARGA DUPLO ACIONAMENTO COM ACABAMENTO CROMADO ANTIVANDALISMO","Un    ",1,1,1,null,null,0,0,""]
["S",2,"S",0,2,7,0,0,0,0,0,"","Serviço","Serviço","-","AGETOP",80520,"CONJUNTO DE FIXACAO P/VASO SANITARIO (PAR)","CJ    ",1,1,1,null,null,0,0,""]
["S",2,"S",0,2,7,0,0,0,0,0,"","Serviço","Serviço","-","AGETOP",80526,"ASSENTO EM POLIPROPILENO COM SISTEMA DE FECHAMENTO SUAVE PARA VASO SANITÁRIO","Un    ",1,1,1,null,null,0,0,""]
["S",2,"S",0,2,7,0,0,0,0,0,"","Serviço","Serviço","-","SINAPI",95544,"PAPELEIRA DE PAREDE EM METAL CROMADO SEM TAMPA, INCLUSO FIXAÇÃO. AF_01/2020","UN",1,1,1,null,null,0,0,""]
["S",2,"S",0,2,7,0,0,0,0,0,"","Serviço","Serviço","-","COMPOSIÇÃO","COMP 209_SEE","TOALHEIRO PLÁSTICO TIPO DISPENSER PARA PAPEL TOALHA INTERFOLHADO","UN ",1,1,1,null,null,0,0,""]
["S",2,"S",0,2,7,0,0,0,0,0,"","Serviço","Serviço","-","AGETOP",80542,"LAVATÓRIO MÉDIO SEM COLUNA","Un    ",2,1,2,null,null,0,0,""]
["S",2,"S",0,2,7,0,0,0,0,0,"","Serviço","Serviço","-","AGETOP",80550,"FIXACAO P/LAVATORIO (PAR)","PAR   ",2,1,2,null,null,0,0,""]
["S",2,"S",0,2,7,0,0,0,0,0,"","Serviço","Serviço","-","SINAPI",86885,"ENGATE FLEXÍVEL EM PLÁSTICO BRANCO, 1/2\u0094 X 40CM - FORNECIMENTO E INSTALAÇÃO. AF_01/2020","UN",2,1,2,null,null,0,0,""]
["S",2,"S",0,2,7,0,0,0,0,0,"","Serviço","Serviço","-","SINAPI",86883,"SIFÃO DO TIPO FLEXÍVEL EM PVC 1  X 1.1/2  - FORNECIMENTO E INSTALAÇÃO. AF_01/2020","UN",2,1,2,null,null,0,0,""]
["S",2,"S",0,2,7,0,0,0,0,0,"","Serviço","Serviço","-","SINAPI",86906,"TORNEIRA CROMADA DE MESA, 1/2\u0094 OU 3/4\u0094, PARA LAVATÓRIO, PADRÃO POPULAR - FORNECIMENTO E INSTALAÇÃO. AF_01/2020","UN",2,1,2,null,null,0,0,""]
["S",2,"S",0,2,7,0,0,0,0,0,"","Serviço","Serviço","-","AGETOP",80580,"VALVULA P/LAVATORIO OU BEBEDOURO METALICO DIAMETRO 1\"","Un    ",2,1,2,null,null,0,0,""]
["S",2,"S",0,2,7,0,0,0,0,0,"","Serviço","Serviço","-","SINAPI",86911,"TORNEIRA CROMADA LONGA, DE PAREDE, 1/2\u0094 OU 3/4\u0094, PARA PIA DE COZINHA, PADRÃO POPULAR - FORNECIMENTO E INSTALAÇÃO. AF_01/2020","UN",5,1,5,null,null,0,0,""]
["S",2,"S",0,2,7,0,0,0,0,0,"","Serviço","Serviço","-","AGETOP",80671,"SIFAO PVC P/PIA 1.1/2\" X 2\"","Un    ",5,1,5,null,null,0,0,""]
["S",2,"S",0,2,7,0,0,0,0,0,"","Serviço","Serviço","-","SINAPI",86878,"VÁLVULA EM METAL CROMADO TIPO AMERICANA 3.1/2\u0094 X 1.1/2\u0094 PARA PIA - FORNECIMENTO E INSTALAÇÃO. AF_01/2020","UN",5,1,5,null,null,0,0,""]
["S",2,"S",0,2,7,0,0,0,0,0,"","Serviço","Serviço","-","AGETOP",80687,"CUBA INOX 35X40X15CM E=0,6MM-AÇO 304 (CUBA Nº 3)","Un    ",4,1,4,null,null,0,0,""]
["S",2,"S",0,2,7,0,0,0,0,0,"","Serviço","Serviço","-","AGETOP",80693,"TANQUE (PANELAO) INOX 60 X 70 X 40 CM CH.18","Un    ",1,1,1,null,null,0,0,""]
["S",2,"S",0,2,7,0,0,0,0,0,"","Serviço","Serviço","-","AGETOP",80819,"SIFÃO METÁLICO PARA TANQUE DE 1 1/4\" X 1 1/2\"","un    ",1,1,1,null,null,0,0,""]
["S",2,"S",0,2,7,0,0,0,0,0,"","Serviço","Serviço","-","AGETOP",80830,"VALVULA P/TANQUE METALICA DIAM.1\" S/LADRAO","Un    ",1,1,1,null,null,0,0,""]
["S",2,"S",0,2,7,0,0,0,0,0,"","Serviço","Serviço","-","AGETOP",81846,"CAIXA DE GORDURA E INSPEÇÃO EM PVC/ABS 19 LITROS COM TAMPA E PORTA TAMPA E CESTO DE LIMPEZA REMOVÍVEL","un    ",1,1,1,null,null,0,0,""]
["S",2,"S",0,2,7,0,0,0,0,0,"","Serviço","Serviço","-","SINAPI",94495,"REGISTRO DE GAVETA BRUTO, LATÃO, ROSCÁVEL, 1\u0094, INSTALADO EM RESERVAÇÃO DE ÁGUA DE EDIFICAÇÃO QUE POSSUA RESERVATÓRIO DE FIBRA/FIBROCIMENTO \u0096 FORNECIMENTO E INSTALAÇÃO. AF_06/2016","UN",1,1,1,null,null,0,0,"Referência: AGETOP - 80903"]
["S",2,"S",0,2,7,0,0,0,0,0,"","Serviço","Serviço","-","SINAPI",89353,"REGISTRO DE GAVETA BRUTO, LATÃO, ROSCÁVEL, 3/4\", FORNECIDO E INSTALADO EM RAMAL DE ÁGUA. AF_12/2014","UN",4,1,4,null,null,0,0,"Referência: AGETOP - 80902"]
["S",2,"S",0,2,7,0,0,0,0,0,"","Serviço","Serviço","-","SINAPI",95141,"ADAPTADOR COM FLANGES LIVRES, PVC, SOLDÁVEL LONGO, DN  25 MM X 3/4 , INSTALADO EM RESERVAÇÃO DE ÁGUA DE EDIFICAÇÃO QUE POSSUA RESERVATÓRIO DE FIBRA/FIBROCIMENTO    FORNECIMENTO E INSTALAÇÃO. AF_06/2016","UN",14,1,14,null,null,0,0,""]
["S",2,"S",0,2,7,0,0,0,0,0,"","Serviço","Serviço","-","SINAPI",94785,"ADAPTADOR COM FLANGES LIVRES, PVC, SOLDÁVEL LONGO, DN 32 MM X 1 , INSTALADO EM RESERVAÇÃO DE ÁGUA DE EDIFICAÇÃO QUE POSSUA RESERVATÓRIO DE FIBRA/FIBROCIMENTO   FORNECIMENTO E INSTALAÇÃO. AF_06/2016","UN",2,1,2,null,null,0,0,""]
["S",2,"S",0,2,7,0,0,0,0,0,"","Serviço","Serviço","-","AGETOP",81504,"SOLUCAO LIMPADORA 1000 CM3","Un    ",5,1,5,null,null,0,0,""]
["S",2,"S",0,2,7,0,0,0,0,0,"","Serviço","Serviço","-","AGETOP",81663,"CORPO CX. SIFONADA DIAM. 150 X 150 X 50","Un    ",2,1,2,null,null,0,0,""]
[{"$f":"CHOOSE(1+LOG(1+2*(ORÇAMENTO.Nivel=\"Nível 1\")+4*(ORÇAMENTO.Nivel=\"Nível 2\")+8*(ORÇAMENTO.Nivel=\"Nível 3\")+16*(ORÇAMENTO.Nivel=\"Nível 4\")+32*(ORÇAMENTO.Nivel=\"Serviço\"),2),0,1,2,3,4,\"S\")","v":"S"},2,"S",0,2,7,0,0,{"$f":"IF(AND($C470<=4,$C470<>0),0,IF(AND($C470=\"S\",$Y470>0),OFFSET(I470,-1,0)+1,OFFSET(I470,-1,0)))","v":0},0,0,"","Serviço","Serviço","-","SINAPI",89708,"CAIXA SIFONADA, PVC, DN 150 X 185 X 75 MM, JUNTA ELÁSTICA, FORNECIDA E INSTALADA EM RAMAL DE DESCARGA OU EM RAMAL DE ESGOTO SANITÁRIO. AF_12/2014","UN",2,1,2,null,null,0,0,""]
["S",2,"S",0,2,7,0,0,0,0,0,"","Serviço","Serviço","-","AGETOP",81771,"GRELHA QUADRADA BRANCA DIAM. 150 MM","Un    ",2,1,2,null,null,0,0,""]
["S",2,"S",0,2,7,0,0,0,0,0,"","Serviço","Serviço","-","AGETOP",81885,"TERMINAL DE VENTILACAO DIAMETRO 50 MM","Un    ",1,1,1,null,null,0,0,""]
["S",{"$f":"IF(OR(C473=\"s\",C473=0),OFFSET(B473,-1,0),C473)","v":2},{"$f":"IF(OFFSET(C473,-1,0)=\"L\",1,IF(OFFSET(C473,-1,0)=1,2,IF(OR(A473=\"s\",A473=0),\"S\",IF(AND(OFFSET(C473,-1,0)=2,A473=4),3,IF(AND(OR(OFFSET(C473,-1,0)=\"s\",OFFSET(C473,-1,0)=0),A473<>\"s\",A473>OFFSET(B473,-1,0)),OFFSET(B473,-1,0),A473)))))","v":"S"},{"$f":"IF(OR(C473=\"S\",C473=0),0,IF(ISERROR(K473),J473,SMALL(J473:K473,1)))","v":0},{"$f":"IF($C473=1,OFFSET(E473,-1,0)+1,OFFSET(E473,-1,0))","v":2},{"$f":"IF($C473=1,0,IF($C473=2,OFFSET(F473,-1,0)+1,OFFSET(F473,-1,0)))","v":7},{"$f":"IF(AND($C473<=2,$C473<>0),0,IF($C473=3,OFFSET(G473,-1,0)+1,OFFSET(G473,-1,0)))","v":0},{"$f":"IF(AND($C473<=3,$C473<>0),0,IF($C473=4,OFFSET(H473,-1,0)+1,OFFSET(H473,-1,0)))","v":0},0,0,0,"","Serviço","Serviço","-","AGETOP",81831,"CAIXA DE INSPEÇÃO - ALVENARIA DE 1/2 VEZ COM REVESTIMENTO INTERNO EM REBOCO PAULISTA A-14 (COM ADIÇÃO DE IMPERMEABILIZANTE)","m2    ",3,1,3,null,null,0,0,""]
["S",2,"S",0,2,7,0,0,0,0,0,"","Serviço","Serviço","-","AGETOP",81825,"CAIXA DE PASSAGEM 60 X 60 CM SEM TAMPA","Un    ",5,1,5,null,null,0,0,""]
["S",2,"S",0,2,7,0,0,0,0,0,"","Serviço","Serviço","-","AGETOP",81826,"TAMPA EM CONCRETO ARMADO 25 MPA E=5CM PARA A CAIXA DE PASSAGEM 60X60CM","Un    ",5,1,5,null,null,0,0,""]
["S",2,"S",0,2,7,0,0,0,0,0,"","Serviço","Serviço","-","SINAPI",89402,"TUBO, PVC, SOLDÁVEL, DN 25MM, INSTALADO EM RAMAL DE DISTRIBUIÇÃO DE ÁGUA - FORNECIMENTO E INSTALAÇÃO. AF_12/2014","M",25,1,25,null,null,0,0,"Referência: AGETOP - 81003"]
["S",2,"S",0,2,7,0,0,0,0,0,"","Serviço","Serviço","-","SINAPI",89403,"TUBO, PVC, SOLDÁVEL, DN 32MM, INSTALADO EM RAMAL DE DISTRIBUIÇÃO DE ÁGUA - FORNECIMENTO E INSTALAÇÃO. AF_12/2014","M",20,1,20,null,null,0,0,"Referência: AGETOP - 81004"]
["S",2,"S",0,2,7,0,0,0,0,0,"","Serviço","Serviço","-","SINAPI",89617,"TE, PVC, SOLDÁVEL, DN 25MM, INSTALADO EM PRUMADA DE ÁGUA - FORNECIMENTO E INSTALAÇÃO. AF_12/2014","UN",3,1,3,null,null,0,0,""]
["S",2,"S",0,2,7,0,0,0,0,0,"","Serviço","Serviço","-","SINAPI",89620,"TE, PVC, SOLDÁVEL, DN 32MM, INSTALADO EM PRUMADA DE ÁGUA - FORNECIMENTO E INSTALAÇÃO. AF_12/2014","UN",3,1,3,null,null,0,0,"Referência: AGETOP - 81403"]
["S",2,"S",0,2,7,0,0,0,0,0,"","Serviço","Serviço","-","SINAPI",89622,"TÊ DE REDUÇÃO, PVC, SOLDÁVEL, DN 32MM X 25MM, INSTALADO EM PRUMADA DE ÁGUA - FORNECIMENTO E INSTALAÇÃO. AF_12/2014","UN",2,1,2,null,null,0,0,"Referência: AGETOP - 81421"]
["S",2,"S",0,2,7,0,0,0,0,0,"","Serviço","Serviço","-","SINAPI",89802,"JOELHO 45 GRAUS, PVC, SERIE NORMAL, ESGOTO PREDIAL, DN 50 MM, JUNTA ELÁSTICA, FORNECIDO E INSTALADO EM PRUMADA DE ESGOTO SANITÁRIO OU VENTILAÇÃO. AF_12/2014","UN",7,1,7,null,null,0,0,""]
["S",2,"S",0,2,7,0,0,0,0,0,"","Serviço","Serviço","-","SINAPI",89724,"JOELHO 90 GRAUS, PVC, SERIE NORMAL, ESGOTO PREDIAL, DN 40 MM, JUNTA SOLDÁVEL, FORNECIDO E INSTALADO EM RAMAL DE DESCARGA OU RAMAL DE ESGOTO SANITÁRIO. AF_12/2014","UN",12,1,12,null,null,0,0,""]
["S",2,"S",0,2,7,0,0,0,0,0,"","Serviço","Serviço","-","SINAPI",89731,"JOELHO 90 GRAUS, PVC, SERIE NORMAL, ESGOTO PREDIAL, DN 50 MM, JUNTA ELÁSTICA, FORNECIDO E INSTALADO EM RAMAL DE DESCARGA OU RAMAL DE ESGOTO SANITÁRIO. AF_12/2014","UN",3,1,3,null,null,0,0,""]
["S",2,"S",0,2,7,0,0,0,0,0,"","Serviço","Serviço","-","AGETOP",81973,"JUNCAO SIMPLES DIAM. 100 X 50 MM","Un    ",1,1,1,null,null,0,0,""]
["S",2,"S",0,2,7,0,0,0,0,0,"","Serviço","Serviço","-","SINAPI",89834,"JUNÇÃO SIMPLES, PVC, SERIE NORMAL, ESGOTO PREDIAL, DN 100 X 100 MM, JUNTA ELÁSTICA, FORNECIDO E INSTALADO EM PRUMADA DE ESGOTO SANITÁRIO OU VENTILAÇÃO. AF_12/2014","UN",1,1,1,null,null,0,0,""]
["S",2,"S",0,2,7,0,0,0,0,0,"","Serviço","Serviço","-","AGETOP",81981,"JUNÇÃO DUPLA DIAMETRO 75 MM","Un    ",1,1,1,null,null,0,0,""]
["S",2,"S",0,2,7,0,0,0,0,0,"","Serviço","Serviço","-","SINAPI",89753,"LUVA SIMPLES, PVC, SERIE NORMAL, ESGOTO PREDIAL, DN 50 MM, JUNTA ELÁSTICA, FORNECIDO E INSTALADO EM RAMAL DE DESCARGA OU RAMAL DE ESGOTO SANITÁRIO. AF_12/2014","UN",8,1,8,null,null,0,0,"Referência: AGETOP - 82002"]
["S",2,"S",0,2,7,0,0,0,0,0,"","Serviço","Serviço","-","SINAPI",89778,"LUVA SIMPLES, PVC, SERIE NORMAL, ESGOTO PREDIAL, DN 100 MM, JUNTA ELÁSTICA, FORNECIDO E INSTALADO EM RAMAL DE DESCARGA OU RAMAL DE ESGOTO SANITÁRIO. AF_12/2014","UN",2,1,2,null,null,0,0,"Referência: AGETOP - 82004"]
["S",2,"S",0,2,7,0,0,0,0,0,"","Serviço","Serviço","-","AGETOP",82051,"PORTA GRELHA QUADRADA BRANCO DIAM. 150 MM","Un    ",2,1,2,null,null,0,0,""]
["S",2,"S",0,2,7,0,0,0,{"$f":"IF(OR($C490=\"S\",$C490=0),0,MATCH(0,OFFSET($D490,1,$C490,ROW($C$550)-ROW($C490)),0))","v":0},{"$f":"IF(OR($C490=\"S\",$C490=0),0,MATCH(OFFSET($D490,0,$C490)+1,OFFSET($D490,1,$C490,ROW($C$550)-ROW($C490)),0))","v":0},"","Serviço","Serviço","-","AGETOP",82103,"REDUCAO EXCENTRICA 100 X 50 MM","Un    ",1,1,1,null,null,0,0,""]
["S",2,"S",0,2,7,0,0,0,0,0,"","Serviço","Serviço","-","AGETOP",82233,"TE SANITARIO DIAMETRO 100 X 50 MM","Un    ",1,1,1,null,null,0,0,""]
["S",2,"S",0,2,7,0,0,0,0,0,"","Serviço","Serviço","-","SINAPI",89711,"TUBO PVC, SERIE NORMAL, ESGOTO PREDIAL, DN 40 MM, FORNECIDO E INSTALADO EM RAMAL DE DESCARGA OU RAMAL DE ESGOTO SANITÁRIO. AF_12/2014","M",14,1,14,null,null,0,0,"Referência: AGETOP - 82301"]
["S",2,"S",0,2,7,0,0,0,0,0,"","Serviço","Serviço","-","SINAPI",89712,"TUBO PVC, SERIE NORMAL, ESGOTO PREDIAL, DN 50 MM, FORNECIDO E INSTALADO EM RAMAL DE DESCARGA OU RAMAL DE ESGOTO SANITÁRIO. AF_12/2014","M",26,1,26,null,null,0,0,"Referência: AGETOP - 82302"]
["S",2,"S",0,2,7,0,0,0,0,0,"","Serviço","Serviço","-","AGETOP",82374,"TUBO FERRO GALVANIZADO DIAM.3/4\"","m     ",10,1,10,null,null,0,0,""]
["S",2,"S",0,2,7,0,0,0,0,0,"","Serviço","Serviço","-","SINAPI",83635,"EXTINTOR INCENDIO TP PO QUIMICO 6KG - FORNECIMENTO E INSTALACAO","UN",1,1,1,null,null,0,0,""]
["S",2,"S",0,2,7,0,0,0,0,0,"","Serviço","Serviço","-","SINAPI",96702,"BUCHA DE REDUÇÃO, PPR, 32 X 25, CLASSE PN 25, INSTALADO EM PRUMADA DE ÁGUA \u0096 FORNECIMENTO E INSTALAÇÃO . AF_06/2015","UN",25,1,25,null,null,0,0,""]
["S",2,"S",0,2,7,0,0,0,0,0,"","Serviço","Serviço","-","SINAPI",94672,"JOELHO 90 GRAUS COM BUCHA DE LATÃO, PVC, SOLDÁVEL, DN  25 MM, X 3/4\u0094 INSTALADO EM RESERVAÇÃO DE ÁGUA DE EDIFICAÇÃO QUE POSSUA RESERVATÓRIO DE FIBRA/FIBROCIMENTO   FORNECIMENTO E INSTALAÇÃO. AF_06/2016","UN",6,1,6,null,null,0,0,""]
["S",2,"S",0,2,7,0,0,0,0,0,"","Serviço","Serviço","-","SINAPI",89362,"JOELHO 90 GRAUS, PVC, SOLDÁVEL, DN 25MM, INSTALADO EM RAMAL OU SUB-RAMAL DE ÁGUA - FORNECIMENTO E INSTALAÇÃO. AF_12/2014","UN",6,1,6,null,null,0,0,"Referência: AGETOP - 81321"]
["S",2,"S",0,2,7,0,0,0,0,0,"","Serviço","Serviço","-","SINAPI",89546,"BUCHA DE REDUÇÃO LONGA, PVC, SERIE R, ÁGUA PLUVIAL, DN 50 X 40 MM, JUNTA ELÁSTICA, FORNECIDO E INSTALADO EM RAMAL DE ENCAMINHAMENTO. AF_12/2014","UN",6,1,6,null,null,0,0,""]
[2,2,2,5,2,8,0,0,0,50,5,"","Nível 2","Nível 2","-","AGETOP",91045,"ALVENARIAS E DIVISÓRIAS","Un    ",null,1,"-",null,null,0,0,""]
["S",2,"S",0,2,8,0,0,0,0,0,"","Serviço","Serviço","-","SINAPI","73937/1","COBOGO DE CONCRETO (ELEMENTO VAZADO), 7X50X50CM, ASSENTADO COM ARGAMASSA TRACO 1:4 (CIMENTO E AREIA)","M2",16.3,1,16.3,null,null,0,0,"Referência: AGETOP - 100501"]
["S",2,"S",0,2,8,0,0,0,0,0,"","Serviço","Serviço","-","SINAPI",72132,"ALVENARIA EM TIJOLO CERAMICO MACICO 5X10X20CM 1/2 VEZ (ESPESSURA 10CM), ASSENTADO COM ARGAMASSA TRACO 1:2:8 (CIMENTO, CAL E AREIA)","M2",17.11,1,17.11,null,null,0,0,"Referência: AGETOP - 100102"]
["S",2,"S",0,2,8,0,0,0,0,0,"","Serviço","Serviço","-","SINAPI",87489,"ALVENARIA DE VEDAÇÃO DE BLOCOS CERÂMICOS FURADOS NA VERTICAL DE 9X19X39CM (ESPESSURA 9CM) DE PAREDES COM ÁREA LÍQUIDA MAIOR OU IGUAL A 6M² COM VÃOS E ARGAMASSA DE ASSENTAMENTO COM PREPARO EM BETONEIRA. AF_06/2014","M2",142.08000000000001,1,142.08000000000001,null,null,0,0,""]
["S",2,"S",0,2,8,0,0,0,0,0,"","Serviço","Serviço","-","SINAPI",93202,"FIXAÇÃO (ENCUNHAMENTO) DE ALVENARIA DE VEDAÇÃO COM TIJOLO MACIÇO. AF_03/2016","M",27,1,27,null,null,0,0,"Referência: AGETOP - 100204"]
[2,2,2,2,2,9,0,0,0,45,2,"","Nível 2","Nível 2","-",null,null,"IMPERMEABILIZAÇÃO","-",null,1,"-",null,null,0,0,""]
["S",2,"S",0,2,9,0,0,0,0,0,"","Serviço","Serviço","-","SINAPI",98562,"IMPERMEABILIZAÇÃO DE FLOREIRA OU VIGA BALDRAME COM ARGAMASSA DE CIMENTO E AREIA, COM ADITIVO IMPERMEABILIZANTE, E = 2 CM. AF_06/2018","M2",43.03,1,43.03,null,null,0,0,"Referência: AGETOP - 120902"]
[2,2,2,2,2,10,0,0,0,43,2,"","Nível 2","Nível 2","-",null,null,"ESTRUTURAS METÁLICAS","-",null,1,"-",null,null,0,0,""]
["S",2,"S",0,2,10,0,0,0,0,0,"","Serviço","Serviço","-","AGETOP",150103,"ESTRUTURA METÁLICA CONVENCIONAL EM AÇO DO TIPO USI SAC-300 COM FUNDO ANTICORROSIVO","Kg    ",1956.5,1,1956.5,null,null,0,0,""]
[2,2,2,6,2,11,0,0,0,41,6,"","Nível 2","Nível 2","-",null,null,"COBERTURAS","-",null,1,"-",null,null,0,0,""]
[3,3,3,5,2,11,1,0,0,5,22,"","Nível 3","Nível 3","-",null,null,"CERÂMICA","-",null,1,"-",null,null,0,0,""]
["S",3,"S",0,2,11,1,0,0,0,0,"","Serviço","Serviço","-","SINAPI",94445,"TELHAMENTO COM TELHA CERÂMICA CAPA-CANAL, TIPO PLAN, COM ATÉ 2 ÁGUAS, INCLUSO TRANSPORTE VERTICAL. AF_07/2019","M2",182.07,1,182.07,null,null,0,0,"Referência: AGETOP - 160401"]
["S",3,"S",0,2,11,1,0,0,0,0,"","Serviço","Serviço","-","SINAPI",94221,"CUMEEIRA PARA TELHA CERÂMICA EMBOÇADA COM ARGAMASSA TRAÇO 1:2:9 (CIMENTO, CAL E AREIA) PARA TELHADOS COM ATÉ 2 ÁGUAS, INCLUSO TRANSPORTE VERTICAL. AF_07/2019","M",17.68,1,17.68,null,null,0,0,""]
["S",3,"S",0,2,11,1,0,0,0,0,"","Serviço","Serviço","-","SINAPI",94224,"EMBOÇAMENTO COM ARGAMASSA TRAÇO 1:2:9 (CIMENTO, CAL E AREIA). AF_07/2019","M",20.399999999999999,1,20.399999999999999,null,null,0,0,"Referência: AGETOP - 160403"]
["S",3,"S",0,2,11,1,0,0,0,0,"","Serviço","Serviço","-","SINAPI",94224,"EMBOÇAMENTO COM ARGAMASSA TRAÇO 1:2:9 (CIMENTO, CAL E AREIA). AF_07/2019","M",35.36,1,35.36,null,null,0,0,"Referência: AGETOP - 160403"]
[2,2,2,5,2,12,0,0,0,35,5,"","Nível 2","Nível 2","-",null,null,"ESQUADRIAS METÁLICAS","-",null,1,"-",null,null,0,0,""]
["S",2,"S",0,2,12,0,0,0,0,0,"","Serviço","Serviço","-","SINAPI",94570,"JANELA DE ALUMÍNIO DE CORRER COM 2 FOLHAS PARA VIDROS, COM VIDROS, BATENTE, ACABAMENTO COM ACETATO OU BRILHANTE E FERRAGENS. EXCLUSIVE ALIZAR E CONTRAMARCO. FORNECIMENTO E INSTALAÇÃO. AF_12/2019","M2",5.52,1,5.52,null,null,0,0,""]
["S",2,"S",0,2,12,0,0,0,0,0,"","Serviço","Serviço","-","AGETOP",180303,"PORTA DE ENROLAR C/FERRAGENS","m2    ",5.74,1,5.74,null,null,0,0,""]
["S",2,"S",0,2,12,0,0,0,0,0,"","Serviço","Serviço","-","AGETOP",180501,"PORTA DE ABRIR EM CHAPA PF-1 C/FERRAGENS","m2    ",8.64,1,8.64,null,null,0,0,""]
["S",2,"S",0,2,12,0,0,0,0,0,"","Serviço","Serviço","-","AGETOP",180307,"PORTAO /CHAPA TRAPEZ / TUBO DE ACO PT-5 C/FERRAGEM","m2    ",4,1,4,null,null,0,0,""]
[2,2,2,2,2,13,0,0,0,30,2,"","Nível 2","Nível 2","-",null,null,"VIDROS","-",null,1,"-",null,null,0,0,""]
["S",2,"S",0,2,13,0,0,0,0,0,"","Serviço","Serviço","-","SINAPI",72117,"VIDRO LISO COMUM TRANSPARENTE, ESPESSURA 4MM","M2",5.52,1,5.52,null,null,0,0,"Referência: AGETOP - 190102"]
[2,2,2,4,2,14,0,0,0,28,4,"","Nível 2","Nível 2","-",null,null,"REVESTIMENTO DE PAREDE","-",null,1,"-",null,null,0,0,""]
["S",2,"S",0,2,14,0,0,0,0,0,"","Serviço","Serviço","-","SINAPI",87553,"EMBOÇO, PARA RECEBIMENTO DE CERÂMICA, EM ARGAMASSA TRAÇO 1:2:8, PREPARO MECÂNICO COM BETONEIRA 400L, APLICADO MANUALMENTE EM FACES INTERNAS DE PAREDES, PARA AMBIENTE COM ÁREA MAIOR QUE 10M2, ESPESSURA DE 10MM, COM EXECUÇÃO DE TALISCAS. AF_06/2014","M2",186.65,1,186.65,null,null,0,0,""]
["S",2,"S",0,2,14,0,0,0,0,0,"","Serviço","Serviço","-","SINAPI",87904,"CHAPISCO APLICADO EM ALVENARIA (COM PRESENÇA DE VÃOS) E ESTRUTURAS DE CONCRETO DE FACHADA, COM COLHER DE PEDREIRO.  ARGAMASSA TRAÇO 1:3 COM PREPARO MANUAL. AF_06/2014","M2",284.16000000000003,1,284.16000000000003,null,null,0,0,"Referência: AGETOP - 200101"]
["S",2,"S",0,2,14,0,0,0,0,0,"","Serviço","Serviço","-","SINAPI",87273,"REVESTIMENTO CERÂMICO PARA PAREDES INTERNAS COM PLACAS TIPO ESMALTADA EXTRA DE DIMENSÕES 33X45 CM APLICADAS EM AMBIENTES DE ÁREA MAIOR QUE 5 M² NA ALTURA INTEIRA DAS PAREDES. AF_06/2014","M2",127.56,1,127.56,null,null,0,0,""]
[2,2,2,3,2,15,0,0,0,24,3,"","Nível 2","Nível 2","-",null,null,"FORROS","-",null,1,"-",null,null,0,0,""]
["S",2,"S",0,2,15,0,0,0,0,0,"","Serviço","Serviço","-","SINAPI",87884,"CHAPISCO APLICADO NO TETO, COM ROLO PARA TEXTURA ACRÍLICA. ARGAMASSA INDUSTRIALIZADA COM PREPARO MANUAL. AF_06/2014","M2",40.75,1,40.75,null,null,0,0,"Referência: AGETOP - 210102"]
["S",2,"S",0,2,15,0,0,0,0,0,"","Serviço","Serviço","-","SINAPI",90408,"MASSA ÚNICA, PARA RECEBIMENTO DE PINTURA, EM ARGAMASSA TRAÇO 1:2:8, PREPARO MECÂNICO COM BETONEIRA 400L, APLICADA MANUALMENTE EM TETO, ESPESSURA DE 10MM, COM EXECUÇÃO DE TALISCAS. AF_03/2015","M2",40.75,1,40.75,null,null,0,0,"Referência: AGETOP - 210401"]
[2,2,2,8,2,16,0,0,0,21,8,"","Nível 2","Nível 2","-",null,null,"REVESTIMENTO DE PISO","-",null,1,"-",null,null,0,0,""]
[3,3,3,2,2,16,1,0,0,7,2,"","Nível 3","Nível 3","-",null,null,"LASTRO","-",null,1,"-",null,null,0,0,""]
["S",3,"S",0,2,16,1,0,0,0,0,"","Serviço","Serviço","-","AGETOP",220101,"LASTRO DE CONCRETO REGULARIZADO IMPERMEABILIZADO 1:3:6 ESP=5CM (BASE)","m2    ",139.75,1,139.75,null,null,0,0,""]
[3,3,3,3,2,16,2,0,0,5,3,"","Nível 3","Nível 3","-",null,null,"GRANITINA","-",null,1,"-",null,null,0,0,""]
["S",3,"S",0,2,16,2,0,0,0,0,"","Serviço","Serviço","-","SINAPI",84191,"PISO EM GRANILITE, MARMORITE OU GRANITINA ESPESSURA 8 MM, INCLUSO JUNTAS DE DILATACAO PLASTICAS","M2",144.74,1,144.74,null,null,0,0,"Referência: AGETOP - 221101"]
[{"$f":"CHOOSE(1+LOG(1+2*(ORÇAMENTO.Nivel=\"Nível 1\")+4*(ORÇAMENTO.Nivel=\"Nível 2\")+8*(ORÇAMENTO.Nivel=\"Nível 3\")+16*(ORÇAMENTO.Nivel=\"Nível 4\")+32*(ORÇAMENTO.Nivel=\"Serviço\"),2),0,1,2,3,4,\"S\")","v":"S"},3,"S",0,2,16,2,0,{"$f":"IF(AND($C534<=4,$C534<>0),0,IF(AND($C534=\"S\",$Y534>0),OFFSET(I534,-1,0)+1,OFFSET(I534,-1,0)))","v":0},0,0,"","Serviço","Serviço","-","AGETOP",221104,"RASPAGEM E APLICAÇÃO RESINA ACRÍLICA DUAS DEMÃOS","m2    ",144.74,1,144.74,null,null,0,0,""]
[3,3,3,2,2,16,3,0,0,2,{"$error":"#N/A"},"","Nível 3","Nível 3","-",null,null,"PASSEIO (CALÇADA)","-",null,1,"-",null,null,0,0,""]
["S",3,"S",0,2,16,3,0,0,0,0,"","Serviço","Serviço","-","AGETOP",220100,"PASSEIO PROTECAO EM CONC.DESEMPEN.5 CM 1:2,5:3,5 ( INCLUSO ESPELHO DE 30CM/ESCAVAÇÃO/REATERRO/APILOAMENTO/ATERRO INTERNO)","m2    ",35.04,1,35.04,null,null,0,0,""]
[2,{"$f":"IF(OR(C537=\"s\",C537=0),OFFSET(B537,-1,0),C537)","v":2},{"$f":"IF(OFFSET(C537,-1,0)=\"L\",1,IF(OFFSET(C537,-1,0)=1,2,IF(OR(A537=\"s\",A537=0),\"S\",IF(AND(OFFSET(C537,-1,0)=2,A537=4),3,IF(AND(OR(OFFSET(C537,-1,0)=\"s\",OFFSET(C537,-1,0)=0),A537<>\"s\",A537>OFFSET(B537,-1,0)),OFFSET(B537,-1,0),A537)))))","v":2},{"$f":"IF(OR(C537=\"S\",C537=0),0,IF(ISERROR(K537),J537,SMALL(J537:K537,1)))","v":2},{"$f":"IF($C537=1,OFFSET(E537,-1,0)+1,OFFSET(E537,-1,0))","v":2},{"$f":"IF($C537=1,0,IF($C537=2,OFFSET(F537,-1,0)+1,OFFSET(F537,-1,0)))","v":17},{"$f":"IF(AND($C537<=2,$C537<>0),0,IF($C537=3,OFFSET(G537,-1,0)+1,OFFSET(G537,-1,0)))","v":0},{"$f":"IF(AND($C537<=3,$C537<>0),0,IF($C537=4,OFFSET(H537,-1,0)+1,OFFSET(H537,-1,0)))","v":0},0,13,2,"","Nível 2","Nível 2","-",null,null,"MARCENARIA","-",null,1,"-",null,null,0,0,""]
["S",2,"S",0,2,17,0,0,0,0,0,"","Serviço","Serviço","-","AGETOP",240209,"PRATELEIRA EST.CAIBRO 4+1 TABUAS APARELHADAS E ENVERNIZADAS","m     ",3.2,1,3.2,null,null,0,0,""]
[2,2,2,8,2,18,0,0,0,11,8,"","Nível 2","Nível 2","-",null,null,"PINTURA","-",null,1,"-",null,null,0,0,""]
[3,3,3,7,2,18,1,0,0,7,{"$error":"#N/A"},"","Nível 3","Nível 3","-",null,null,"ESMALTE SINTÉTICO","-",null,1,"-",null,null,0,0,""]
["S",3,"S",0,2,18,1,0,0,0,0,"","Serviço","Serviço","-","SINAPI",88497,"APLICAÇÃO E LIXAMENTO DE MASSA LÁTEX EM PAREDES, DUAS DEMÃOS. AF_06/2014","M2",128,1,128,null,null,0,0,"Referência: AGETOP - 261300"]
["S",3,"S",0,2,18,1,0,0,0,0,"","Serviço","Serviço","-","SINAPI",88486,"APLICAÇÃO MANUAL DE PINTURA COM TINTA LÁTEX PVA EM TETO, DUAS DEMÃOS. AF_06/2014","M2",40.75,1,40.75,null,null,0,0,"Referência: AGETOP - 261307"]
["S",3,"S",0,2,18,1,0,0,0,0,"","Serviço","Serviço","-","AGETOP",261550,"PINT.ESMALTE SINT.PAREDES - 2 DEM.C/SELADOR","m2    ",87.25,1,87.25,null,null,0,0,""]
["S",3,"S",0,2,18,1,0,0,0,0,"","Serviço","Serviço","-","SINAPI",88489,"APLICAÇÃO MANUAL DE PINTURA COM TINTA LÁTEX ACRÍLICA EM PAREDES, DUAS DEMÃOS. AF_06/2014","M2",87.25,1,87.25,null,null,0,0,"Referência: AGETOP - 261001"]
["S",3,"S",0,2,18,1,0,0,0,0,"","Serviço","Serviço","-","AGETOP",261602,"PINT.ESMALTE/ESQUAD.FERRO C/FUNDO ANTICOR.","m2    ",66.180000000000007,1,66.180000000000007,null,null,0,0,""]
["S",3,"S",0,2,18,1,0,0,0,0,"","Serviço","Serviço","-","AGETOP",261609,"PINTURA ESMALTE ALQUIDICO ESTR.METALICA 2 DEMAOS","m2    ",139.75,1,139.75,null,null,0,0,""]
[2,2,2,3,2,19,0,0,0,3,{"$error":"#N/A"},"","Nível 2","Nível 2","-",null,null,"DIVERSOS","-",null,1,"-",null,null,0,0,""]
["S",2,"S",0,2,19,0,0,0,0,0,"","Serviço","Serviço","-","AGETOP",270501,"LIMPEZA FINAL DE OBRA - (OBRAS CIVIS)","m2    ",139.75,1,139.75,null,null,0,0,""]
["S",2,"S",0,2,19,0,0,0,0,0,"","Serviço","Serviço","-","AGETOP",271608,"BANCADA DE GRANITO C/ESPELHO","m2    ",6.83,1,6.83,null,null,0,0,""]
[-1,null,-1,null,0,0,0,0,0,null,null,"F"]
[null,null,null,null,null,null,null,null,null,null,null,"F",null,null,null,null,null,"OBS: OS QUANTITATIVOS DE MATERIAIS  DAS INSTALAÇÕES HIDROSSANITÁRIAS, ELÉTRICAS E ESPECIAIS SÃO FORNECIDOS PELOS PROFISSIONAIS RESPONSÁVEIS PELOS RESPECTIVOS PROJETOS.",null,null,null,null,"VALOR TOTAL",null,null,0]
[null,null,null,null,null,null,null,null,null,null,null,"F",null,null,null,null,null,null,null,null,null,null,"VALOR BDI (27,95%)",null,null,0]
[null,null,null,null,null,null,null,null,null,null,null,"F",null,null,null,null,null,null,null,null,null,null,"TOTAL ORÇAMENTO",null,null,0]
[null,null,null,null,null,null,null,null,null,null,null,"F"]
[null,null,null,null,null,null,null,null,null,null,null,"F",null,null,null,null,null,null,null,null,null,null,"CUSTO POR M2 ³",null,null,0]
[null,null,null,null,null,null,null,null,null,null,null,"F",null,null,null,null,null,null,null,null,null,null,"MATERIAL S/ BDI",null,null,0]
[null,null,null,null,null,null,null,null,null,null,null,"F",null,null,null,null,null,null,null,null,null,null,"MÃO DE OBRA S/ BDI",null,null,0]
[null,null,null,null,null,null,null,null,null,null,null,"F"]
[null,null,null,null,null,null,null,null,null,null,null,"F",null,null,null,null,"(1) Conforme previsto pelo DECRETO Nº 7.983, DE 8 DE ABRIL DE 2013, os preços adotados são aqueles constantes dos sistemas de referência indicados. Justifica-se o uso dos preços destas composições de custos unitários devido ao seu valor ser menor à mediana de seus correspondentes na tabela SINAPI;"]
[null,null,null,null,null,null,null,null,null,null,null,"F",null,null,null,null,"(2) Optou-se pelo uso das composições de custos da AGETOP para itens não presentes na SINAPI;"]
[null,null,null,null,null,null,null,null,null,null,null,"F",null,null,null,null,"(3) Para itens da AGETOP, os vidros não estão inclusos nas esquadrias e já foram considerados os custos de contramarco para as esquadrias de alumínio;"]
[null,null,null,null,null,null,null,null,null,null,null,"F",null,null,null,null,"(4) Nos casos em que houver execução de granitina e omissão do item AGETOP 221102, considerou-se que o quantitativo para o rodapé, de altura igual a 7cm, foi incorporado na área de piso;"]
[null,null,null,null,null,null,null,null,null,null,null,"F",null,null,null,null,"(5) O custo unitário aproximado por metro quadrado é calculado dividindo-se o valor total do orçamento pela área total de construção."]
[null,null,null,null,null,null,null,null,null,null,null,"F"]
[null,null,null,null,null,null,null,null,null,null,null,"F"]
[]
[null,null,null,null,null,null,null,null,null,null,null,null,null,null,"SOMATÓRIO DE SERVIÇOS"]
[null,null,null,null,null,null,null,null,null,null,null,null,null,null,"ITEM","DESCRIÇÃO DOS SERVIÇOS",null,null,"PREÇO SEM BDI",null,null,null,null,"PREÇO COM BDI",null,null,"PARTICIPAÇÃO ( % )"]
[null,null,null,null,null,null,null,null,null,null,null,null,null,null,"a.","SERVIÇOS PRELIMINARES",null,null,0,null,null,null,null,0,null,null,0]
[null,null,null,null,null,null,null,null,null,null,null,null,null,null,"b.","TRANSPORTES",null,null,0,null,null,null,null,0,null,null,0]
[null,null,null,null,null,null,null,null,null,null,null,null,null,null,"c.","SERVIÇO EM TERRA",null,null,0,null,null,null,null,0,null,null,0]
[null,null,null,null,null,null,null,null,null,null,null,null,null,null,"d.","FUNDAÇÕES E SONDAGENS",null,null,0,null,null,null,null,0,null,null,0]
[null,null,null,null,null,null,null,null,null,null,null,null,null,null,"e.","ESTRUTURA",null,null,0,null,null,null,null,0,null,null,0]
[null,null,null,null,null,null,null,null,null,null,null,null,null,null,"f.","INSTALAÇÕES ELÉTRICAS",null,null,0,null,null,null,null,0,null,null,0]
[null,null,null,null,null,null,null,null,null,null,null,null,null,null,"g.","INSTALAÇÕES HIDROSSANITÁRIAS",null,null,0,null,null,null,null,0,null,null,0]
[null,null,null,null,null,null,null,null,null,null,null,null,null,null,"h","INSTALAÇÕES ESPECIAIS",null,null,0,null,null,null,null,0,null,null,0]
[null,null,null,null,null,null,null,null,null,null,null,null,null,null,"i.","ALVENARIAS E DIVISÓRIAS",null,null,0,null,null,null,null,0,null,null,0]
[null,null,null,null,null,null,null,null,null,null,null,null,null,null,"j.","ALVENARIA AUTO-PORTANTE",null,null,0,null,null,null,null,0,null,null,0]
[null,null,null,null,null,null,null,null,null,null,null,null,null,null,"k.","IMPERMEABILIZAÇÃO",null,null,0,null,null,null,null,0,null,null,0]
[null,null,null,null,null,null,null,null,null,null,null,null,null,null,"l.","ISOLAMENTO TÉRMICO E ACÚSTICO",null,null,0,null,null,null,null,0,null,null,0]
[null,null,null,null,null,null,null,null,null,null,null,null,null,null,"m.","ESTRUTURA DE MADEIRA",null,null,0,null,null,null,null,0,null,null,0]
[null,null,null,null,null,null,null,null,null,null,null,null,null,null,"n.","ESTRUTURAS METÁLICAS",null,null,0,null,null,null,null,0,null,null,0]
[null,null,null,null,null,null,null,null,null,null,null,null,null,null,"o.","COBERTURAS",null,null,0,null,null,null,null,0,null,null,0]
[null,null,null,null,null,null,null,null,null,null,null,null,null,null,"p.","ESQUADRIAS DE MADEIRA",null,null,0,null,null,null,null,0,null,null,0]
[null,null,null,null,null,null,null,null,null,null,null,null,null,null,"q.","ESQUADRIAS METÁLICAS",null,null,0,null,null,null,null,0,null,null,0]
[null,null,null,null,null,null,null,null,null,null,null,null,null,null,"r.","VIDROS",null,null,0,null,null,null,null,0,null,null,0]
[null,null,null,null,null,null,null,null,null,null,null,null,null,null,"s.","REVESTIMENTO DE PAREDE",null,null,0,null,null,null,null,0,null,null,0]
[null,null,null,null,null,null,null,null,null,null,null,null,null,null,"t.","FORROS",null,null,0,null,null,null,null,0,null,null,0]
[null,null,null,null,null,null,null,null,null,null,null,null,null,null,"u.","REVESTIMENTO DE PISO",null,null,0,null,null,null,null,0,null,null,0]
[null,null,null,null,null,null,null,null,null,null,null,null,null,null,"v.","FERRAGENS",null,null,0,null,null,null,null,0,null,null,0]
[null,null,null,null,null,null,null,null,null,null,null,null,null,null,"w.","MARCENARIA",null,null,0,null,null,null,null,0,null,null,0]
[null,null,null,null,null,null,null,null,null,null,null,null,null,null,"x.","ADMINISTRAÇÃO",null,null,0,null,null,null,null,0,null,null,0]
[null,null,null,null,null,null,null,null,null,null,null,null,null,null,"y.","PINTURA",null,null,0,null,null,null,null,0,null,null,0]
[null,null,null,null,null,null,null,null,null,null,null,null,null,null,"z.","DIVERSOS",null,null,0,null,null,null,null,0,null,null,0]
[null,null,null,null,null,null,null,null,null,null,null,null,null,null,"TOTAL GERAL DO ORÇAMENTO (R$)",null,null,null,0,null,null,null,null,0,null,null,0]
[null,null,null,null,null,null,null,null,null,null,null,null,null,null,null,null,null,null,0,null,null,null,null,0,null,null,100]
[null,null,null,null,null,null,null,null,null,null,null,null,null,null,null,null,null,null,"(TOTAL SEM BDI)",null,null,null,null,"(TOTAL COM BDI)",null,null,"(ARRED porcentagem)"]
[null,null,null,null,null,null,null,null,null,null,null,null,null,null,null,null,null,null,"ERRO",null,null,null,null,"ERRO",null,null,"ERRO"]
[]
[]
[null,null,null,null,null,null,null,null,null,null,null,null,null,null,"RESUMO GERAL DO ORÇAMENTO"]
[null,null,null,null,null,null,null,null,null,null,null,null,null,null,"ITEM","DESCRIÇÃO DOS SERVIÇOS",null,null,"PREÇO SEM BDI",null,null,null,null,"PREÇO COM BDI",null,null,"PARTICIPAÇÃO ( % )"]
[null,null,null,null,null,null,null,null,null,null,null,null,null,null,"1.","REFORMA E AMPLIAÇÃO",null,null,0,null,null,null,null,0,null,null,{"$error":"#DIV/0!"}]
[null,null,null,null,null,null,null,null,null,null,null,null,null,null,"2.","COZINHA - REFEITORIO PADRÃO 2009",null,null,0,null,null,null,null,0,null,null,{"$error":"#DIV/0!"}]
[null,null,null,null,null,null,null,null,null,null,null,null,null,null,"3.","",null,null,0,null,null,null,null,0,null,null,{"$error":"#DIV/0!"}]
[null,null,null,null,null,null,null,null,null,null,null,null,null,null,"4.","",null,null,0,null,null,null,null,0,null,null,{"$error":"#DIV/0!"}]
[null,null,null,null,null,null,null,null,null,null,null,null,null,null,"5.","",null,null,0,null,null,null,null,0,null,null,{"$error":"#DIV/0!"}]
[null,null,null,null,null,null,null,null,null,null,null,null,null,null,"6.","",null,null,0,null,null,null,null,0,null,null,{"$error":"#DIV/0!"}]
[null,null,null,null,null,null,null,null,null,null,null,null,null,null,"7.","",null,null,0,null,null,null,null,0,null,null,{"$error":"#DIV/0!"}]
[null,null,null,null,null,null,null,null,null,null,null,null,null,null,"8.","",null,null,0,null,null,null,null,0,null,null,{"$error":"#DIV/0!"}]
[null,null,null,null,null,null,null,null,null,null,null,null,null,null,"9.","",null,null,0,null,null,null,null,0,null,null,{"$error":"#DIV/0!"}]
[null,null,null,null,null,null,null,null,null,null,null,null,null,null,"10.","",null,null,0,null,null,null,null,0,null,null,{"$error":"#DIV/0!"}]
[null,null,null,null,null,null,null,null,null,null,null,null,null,null,"11.","",null,null,0,null,null,null,null,0,null,null,{"$error":"#DIV/0!"}]
[null,null,null,null,null,null,null,null,null,null,null,null,null,null,"12.","",null,null,0,null,null,null,null,0,null,null,{"$error":"#DIV/0!"}]
[null,null,null,null,null,null,null,null,null,null,null,null,null,null,"13.","",null,null,0,null,null,null,null,0,null,null,{"$error":"#DIV/0!"}]
[null,null,null,null,null,null,null,null,null,null,null,null,null,null,"14.","",null,null,0,null,null,null,null,0,null,null,{"$error":"#DIV/0!"}]
[null,null,null,null,null,null,null,null,null,null,null,null,null,null,"15.","",null,null,0,null,null,null,null,0,null,null,{"$error":"#DIV/0!"}]
[null,null,null,null,null,null,null,null,null,null,null,null,null,null,"16.","",null,null,0,null,null,null,null,0,null,null,{"$error":"#DIV/0!"}]
[null,null,null,null,null,null,null,null,null,null,null,null,null,null,"17.","",null,null,0,null,null,null,null,0,null,null,{"$error":"#DIV/0!"}]
[null,null,null,null,null,null,null,null,null,null,null,null,null,null,"18.","",null,null,0,null,null,null,null,0,null,null,{"$error":"#DIV/0!"}]
[null,null,null,null,null,null,null,null,null,null,null,null,null,null,"19.","",null,null,0,null,null,null,null,0,null,null,{"$error":"#DIV/0!"}]
[null,null,null,null,null,null,null,null,null,null,null,null,null,null,"20.","",null,null,0,null,null,null,null,0,null,null,{"$error":"#DIV/0!"}]
[null,null,null,null,null,null,null,null,null,null,null,null,null,null,"TOTAL GERAL DO ORÇAMENTO (R$)",null,null,null,0,null,null,null,null,0,null,null,{"$error":"#DIV/0!"}]
[null,null,null,null,null,null,null,null,null,null,null,null,null,null,null,null,null,null,0,null,null,null,null,0,null,null,100]
[null,null,null,null,null,null,null,null,null,null,null,null,null,null,null,null,null,null,"(TOTAL SEM BDI)",null,null,null,null,"(TOTAL COM BDI)",null,null,"(ARRED porcentagem)"]
[null,null,null,null,null,null,null,null,null,null,null,null,null,null,null,null,null,null,"ERRO",null,null,null,null,"ERRO",null,null,{"$error":"#DIV/0!"}]

{"sheet":"Resumo ","index":1,"n_rows":39,"n_cols":9,"rows_kept":39,"cut":false,"hidden":false,"merged":[[13,0,14,0],[15,2,15,5],[16,2,16,5],[17,2,17,5],[18,2,18,5],[14,1,14,8],[0,1,0,8],[36,1,36,5],[2,1,2,5],[3,1,3,5],[5,1,5,5],[6,1,6,5],[8,1,8,5],[9,1,9,5],[11,3,11,5],[12,3,12,5],[10,1,10,8],[11,6,11,8],[12,6,12,8],[19,2,19,5],[20,2,20,5],[21,2,21,5],[31,2,31,5],[1,1,1,8],[2,6,2,8],[3,6,3,8],[4,1,4,8],[5,6,5,8],[6,6,6,8],[7,1,7,8],[8,6,8,8],[9,6,9,8],[13,1,13,8],[11,1,11,2],[12,1,12,2],[42,3,42,7],[41,3,41,7],[38,1,38,8],[22,2,22,5],[23,2,23,5],[24,2,24,5],[25,2,25,5],[26,2,26,5],[32,2,32,5],[33,2,33,5],[34,2,34,5],[35,2,35,5],[27,2,27,5],[28,2,28,5],[29,2,29,5],[30,2,30,5]]}
[]
[]
[null,"UNIDADE ESCOLAR",null,null,null,null,"CÓDIGO INEP"]
[null,{"$f":"Orçamento!$O$5","v":"ESCOLA ESTADUAL GERCINA BORGES TEIXEIRA"},null,null,null,null,{"$f":"Orçamento!X5","v":52051951}]
[]
[null,"OBRA",null,null,null,null,"CIDADE"]
[null,{"$f":"Orçamento!$O$8","v":"REFORMA E AMPLIAÇÃO"},null,null,null,null,{"$f":"Orçamento!$X$8","v":"CAIAPÔNIA"}]
[]
[null,"ENDEREÇO",null,null,null,null,"CRE"]
[null,{"$f":"Orçamento!$R$11","v":" AV. CEL. LINDOLFO A. DIAS 677 , CENTRO , CEP: 7585-000"},null,null,null,null,{"$f":"Orçamento!$O$11","v":"CRE-IPORÁ"}]
[]
[null,"REFERÊNCIA",null,"DATA",null,null,"ÁREA TOTAL CONSTRUÍDA (M²)"]
[null,{"$f":"CONCATENATE(\"AGETOP E SINAPI - \",Orçamento!$T$11)","v":"AGETOP E SINAPI - DESONERADA"},null,{"$f":"Orçamento!$S$8","v":"2020-05-28"},null,null,{"$f":"Orçamento!$X$14","v":811.8}]
["FILTRO"]
[null,"RESUMO GERAL DO ORÇAMENTO"]
["↓","ITEM","DESCRIÇÃO DOS SERVIÇOS",null,null,null,"PREÇO SEM BDI","PREÇO COM BDI","PARTICIP. (%)"]
[{"$f":"IF(G17>0,\"F\",\"\")","v":""},"1.",{"$f":"Orçamento!$P603","v":"REFORMA E AMPLIAÇÃO"},null,null,null,{"$f":"IFERROR(Orçamento!S603,\"-\")","v":0},{"$f":"IFERROR(Orçamento!X603,\"\")","v":0},{"$f":"Orçamento!AA603","v":{"$error":"#DIV/0!"}}]
[{"$f":"IF(G18>0,\"F\",\"\")","v":""},"2.",{"$f":"Orçamento!$P604","v":"COZINHA - REFEITORIO PADRÃO 2009"},null,null,null,{"$f":"IFERROR(Orçamento!S604,\"-\")","v":0},{"$f":"IFERROR(Orçamento!X604,\"\")","v":0},{"$f":"Orçamento!AA604","v":{"$error":"#DIV/0!"}}]
["","3.",{"$f":"Orçamento!$P605","v":""},null,null,null,{"$f":"IFERROR(Orçamento!S605,\"-\")","v":0},{"$f":"IFERROR(Orçamento!X605,\"\")","v":0},{"$f":"Orçamento!AA605","v":{"$error":"#DIV/0!"}}]
["","4.",{"$f":"Orçamento!$P606","v":""},null,null,null,{"$f":"IFERROR(Orçamento!S606,\"-\")","v":0},{"$f":"IFERROR(Orçamento!X606,\"\")","v":0},{"$f":"Orçamento!AA606","v":{"$error":"#DIV/0!"}}]
["","5.",{"$f":"Orçamento!$P607","v":""},null,null,null,{"$f":"IFERROR(Orçamento!S607,\"-\")","v":0},{"$f":"IFERROR(Orçamento!X607,\"\")","v":0},{"$f":"Orçamento!AA607","v":{"$error":"#DIV/0!"}}]
["","6.",{"$f":"Orçamento!$P608","v":""},null,null,null,{"$f":"IFERROR(Orçamento!S608,\"-\")","v":0},{"$f":"IFERROR(Orçamento!X608,\"\")","v":0},{"$f":"Orçamento!AA608","v":{"$error":"#DIV/0!"}}]
["","7.",{"$f":"Orçamento!$P609","v":""},null,null,null,{"$f":"IFERROR(Orçamento!S609,\"-\")","v":0},{"$f":"IFERROR(Orçamento!X609,\"\")","v":0},{"$f":"Orçamento!AA609","v":{"$error":"#DIV/0!"}}]
["","8.",{"$f":"Orçamento!$P610","v":""},null,null,null,{"$f":"IFERROR(Orçamento!S610,\"-\")","v":0},{"$f":"IFERROR(Orçamento!X610,\"\")","v":0},{"$f":"Orçamento!AA610","v":{"$error":"#DIV/0!"}}]
["","9.",{"$f":"Orçamento!$P611","v":""},null,null,null,{"$f":"IFERROR(Orçamento!S611,\"-\")","v":0},{"$f":"IFERROR(Orçamento!X611,\"\")","v":0},{"$f":"Orçamento!AA611","v":{"$error":"#DIV/0!"}}]
["","10.",{"$f":"Orçamento!$P612","v":""},null,null,null,{"$f":"IFERROR(Orçamento!S612,\"-\")","v":0},{"$f":"IFERROR(Orçamento!X612,\"\")","v":0},{"$f":"Orçamento!AA612","v":{"$error":"#DIV/0!"}}]
["","11.",{"$f":"Orçamento!$P613","v":""},null,null,null,{"$f":"IFERROR(Orçamento!S613,\"-\")","v":0},{"$f":"IFERROR(Orçamento!X613,\"\")","v":0},{"$f":"Orçamento!AA613","v":{"$error":"#DIV/0!"}}]
["","12.",{"$f":"Orçamento!$P614","v":""},null,null,null,{"$f":"IFERROR(Orçamento!S614,\"-\")","v":0},{"$f":"IFERROR(Orçamento!X614,\"\")","v":0},{"$f":"Orçamento!AA614","v":{"$error":"#DIV/0!"}}]
["","13.",{"$f":"Orçamento!$P615","v":""},null,null,null,{"$f":"IFERROR(Orçamento!S615,\"-\")","v":0},{"$f":"IFERROR(Orçamento!X615,\"\")","v":0},{"$f":"Orçamento!AA615","v":{"$error":"#DIV/0!"}}]
["","14.",{"$f":"Orçamento!$P616","v":""},null,null,null,{"$f":"IFERROR(Orçamento!S616,\"-\")","v":0},{"$f":"IFERROR(Orçamento!X616,\"\")","v":0},{"$f":"Orçamento!AA616","v":{"$error":"#DIV/0!"}}]
["","15.",{"$f":"Orçamento!$P617","v":""},null,null,null,{"$f":"IFERROR(Orçamento!S617,\"-\")","v":0},{"$f":"IFERROR(Orçamento!X617,\"\")","v":0},{"$f":"Orçamento!AA617","v":{"$error":"#DIV/0!"}}]
["","16.",{"$f":"Orçamento!$P618","v":""},null,null,null,{"$f":"IFERROR(Orçamento!S618,\"-\")","v":0},{"$f":"IFERROR(Orçamento!X618,\"\")","v":0},{"$f":"Orçamento!AA618","v":{"$error":"#DIV/0!"}}]
["","17.",{"$f":"Orçamento!$P619","v":""},null,null,null,{"$f":"IFERROR(Orçamento!S619,\"-\")","v":0},{"$f":"IFERROR(Orçamento!X619,\"\")","v":0},{"$f":"Orçamento!AA619","v":{"$error":"#DIV/0!"}}]
["","18.",{"$f":"Orçamento!$P620","v":""},null,null,null,{"$f":"IFERROR(Orçamento!S620,\"-\")","v":0},{"$f":"IFERROR(Orçamento!X620,\"\")","v":0},{"$f":"Orçamento!AA620","v":{"$error":"#DIV/0!"}}]
["","19.",{"$f":"Orçamento!$P621","v":""},null,null,null,{"$f":"IFERROR(Orçamento!S621,\"-\")","v":0},{"$f":"IFERROR(Orçamento!X621,\"\")","v":0},{"$f":"Orçamento!AA621","v":{"$error":"#DIV/0!"}}]
["","20.",{"$f":"Orçamento!$P622","v":""},null,null,null,{"$f":"IFERROR(Orçamento!S622,\"-\")","v":0},{"$f":"IFERROR(Orçamento!X622,\"\")","v":0},{"$f":"Orçamento!AA622","v":{"$error":"#DIV/0!"}}]
["F","TOTAL GERAL DO ORÇAMENTO (R$)",null,null,null,null,{"$f":"SUM(G17:G36)","v":0},0,{"$f":"SUM(I17:I36)","v":{"$error":"#DIV/0!"}}]
["F"]
["F"]

{"sheet":"Somatório","index":2,"n_rows":45,"n_cols":6,"rows_kept":45,"cut":false,"hidden":false,"merged":[[13,0,14,0],[42,1,42,2],[44,1,44,5],[47,3,47,5],[48,3,48,5],[13,1,13,5],[9,1,9,3],[9,4,9,5],[11,1,11,2],[11,4,11,5],[12,1,12,2],[12,4,12,5],[0,1,0,5],[14,1,14,5],[2,1,2,3],[2,4,2,5],[3,1,3,3],[3,4,3,5],[5,1,5,3],[5,4,5,5],[6,1,6,3],[6,4,6,5],[8,1,8,3],[8,4,8,5],[1,1,1,5],[4,1,4,5],[7,1,7,5],[10,1,10,5]]}
[]
[]
[null,"UNIDADE ESCOLAR",null,null,"CÓDIGO INEP"]
[null,{"$f":"Orçamento!$O$5","v":"ESCOLA ESTADUAL GERCINA BORGES TEIXEIRA"},null,null,{"$f":"Orçamento!X5","v":52051951}]
[]
[null,"OBRA",null,null,"CIDADE"]
[null,{"$f":"Orçamento!$O$8","v":"REFORMA E AMPLIAÇÃO"},null,null,{"$f":"Orçamento!$X$8","v":"CAIAPÔNIA"}]
[]
[null,"ENDEREÇO",null,null,"CRE"]
[null,{"$f":"Orçamento!$R$11","v":" AV. CEL. LINDOLFO A. DIAS 677 , CENTRO , CEP: 7585-000"},null,null,{"$f":"Orçamento!$O$11","v":"CRE-IPORÁ"}]
[]
[null,"REFERÊNCIA",null,"DATA","ÁREA TOTAL CONSTRUÍDA (M²)"]
[null,{"$f":"CONCATENATE(\"AGETOP E SINAPI - \",Orçamento!$T$11)","v":"AGETOP E SINAPI - DESONERADA"},null,{"$f":"Orçamento!$S$8","v":"2020-05-28"},{"$f":"Orçamento!$X$14","v":811.8}]
["FILTRO"]
[null,"SOMATÓRIO DE SERVIÇOS"]
["↓","ITEM","DESCRIÇÃO DOS SERVIÇOS","PREÇO SEM BDI (R$)","PREÇO COM BDI (R$)","PARTIC.  ( % )"]
[{"$f":"IF(D17>0,\"F\",\"\")","v":""},"a.",{"$f":"Orçamento!P569","v":"SERVIÇOS PRELIMINARES"},{"$f":"Orçamento!S569","v":0},{"$f":"Orçamento!X569","v":0},{"$f":"Orçamento!AA569","v":0}]
[{"$f":"IF(D18>0,\"F\",\"\")","v":""},"b.",{"$f":"Orçamento!P570","v":"TRANSPORTES"},{"$f":"Orçamento!S570","v":0},{"$f":"Orçamento!X570","v":0},{"$f":"Orçamento!AA570","v":0}]
["","c.",{"$f":"Orçamento!P571","v":"SERVIÇO EM TERRA"},{"$f":"Orçamento!S571","v":0},{"$f":"Orçamento!X571","v":0},{"$f":"Orçamento!AA571","v":0}]
["","d.",{"$f":"Orçamento!P572","v":"FUNDAÇÕES E SONDAGENS"},{"$f":"Orçamento!S572","v":0},{"$f":"Orçamento!X572","v":0},{"$f":"Orçamento!AA572","v":0}]
["","e.",{"$f":"Orçamento!P573","v":"ESTRUTURA"},{"$f":"Orçamento!S573","v":0},{"$f":"Orçamento!X573","v":0},{"$f":"Orçamento!AA573","v":0}]
["","f.",{"$f":"Orçamento!P574","v":"INSTALAÇÕES ELÉTRICAS"},{"$f":"Orçamento!S574","v":0},{"$f":"Orçamento!X574","v":0},{"$f":"Orçamento!AA574","v":0}]
["","g.",{"$f":"Orçamento!P575","v":"INSTALAÇÕES HIDROSSANITÁRIAS"},{"$f":"Orçamento!S575","v":0},{"$f":"Orçamento!X575","v":0},{"$f":"Orçamento!AA575","v":0}]
["","h",{"$f":"Orçamento!P576","v":"INSTALAÇÕES ESPECIAIS"},{"$f":"Orçamento!S576","v":0},{"$f":"Orçamento!X576","v":0},{"$f":"Orçamento!AA576","v":0}]
["","i.",{"$f":"Orçamento!P577","v":"ALVENARIAS E DIVISÓRIAS"},{"$f":"Orçamento!S577","v":0},{"$f":"Orçamento!X577","v":0},{"$f":"Orçamento!AA577","v":0}]
["","j.",{"$f":"Orçamento!P578","v":"ALVENARIA AUTO-PORTANTE"},{"$f":"Orçamento!S578","v":0},{"$f":"Orçamento!X578","v":0},{"$f":"Orçamento!AA578","v":0}]
["","k.",{"$f":"Orçamento!P579","v":"IMPERMEABILIZAÇÃO"},{"$f":"Orçamento!S579","v":0},{"$f":"Orçamento!X579","v":0},{"$f":"Orçamento!AA579","v":0}]
["","l.",{"$f":"Orçamento!P580","v":"ISOLAMENTO TÉRMICO E ACÚSTICO"},{"$f":"Orçamento!S580","v":0},{"$f":"Orçamento!X580","v":0},{"$f":"Orçamento!AA580","v":0}]
["","m.",{"$f":"Orçamento!P581","v":"ESTRUTURA DE MADEIRA"},{"$f":"Orçamento!S581","v":0},{"$f":"Orçamento!X581","v":0},{"$f":"Orçamento!AA581","v":0}]
["","n.",{"$f":"Orçamento!P582","v":"ESTRUTURAS METÁLICAS"},{"$f":"Orçamento!S582","v":0},{"$f":"Orçamento!X582","v":0},{"$f":"Orçamento!AA582","v":0}]
["","o.",{"$f":"Orçamento!P583","v":"COBERTURAS"},{"$f":"Orçamento!S583","v":0},{"$f":"Orçamento!X583","v":0},{"$f":"Orçamento!AA583","v":0}]
["","p.",{"$f":"Orçamento!P584","v":"ESQUADRIAS DE MADEIRA"},{"$f":"Orçamento!S584","v":0},{"$f":"Orçamento!X584","v":0},{"$f":"Orçamento!AA584","v":0}]
["","q.",{"$f":"Orçamento!P585","v":"ESQUADRIAS METÁLICAS"},{"$f":"Orçamento!S585","v":0},{"$f":"Orçamento!X585","v":0},{"$f":"Orçamento!AA585","v":0}]
["","r.",{"$f":"Orçamento!P586","v":"VIDROS"},{"$f":"Orçamento!S586","v":0},{"$f":"Orçamento!X586","v":0},{"$f":"Orçamento!AA586","v":0}]
["","s.",{"$f":"Orçamento!P587","v":"REVESTIMENTO DE PAREDE"},{"$f":"Orçamento!S587","v":0},{"$f":"Orçamento!X587","v":0},{"$f":"Orçamento!AA587","v":0}]
["","t.",{"$f":"Orçamento!P588","v":"FORROS"},{"$f":"Orçamento!S588","v":0},{"$f":"Orçamento!X588","v":0},{"$f":"Orçamento!AA588","v":0}]
["","u.",{"$f":"Orçamento!P589","v":"REVESTIMENTO DE PISO"},{"$f":"Orçamento!S589","v":0},{"$f":"Orçamento!X589","v":0},{"$f":"Orçamento!AA589","v":0}]
["","v.",{"$f":"Orçamento!P590","v":"FERRAGENS"},{"$f":"Orçamento!S590","v":0},{"$f":"Orçamento!X590","v":0},{"$f":"Orçamento!AA590","v":0}]
["","w.",{"$f":"Orçamento!P591","v":"MARCENARIA"},{"$f":"Orçamento!S591","v":0},{"$f":"Orçamento!X591","v":0},{"$f":"Orçamento!AA591","v":0}]
["","x.",{"$f":"Orçamento!P592","v":"ADMINISTRAÇÃO"},{"$f":"Orçamento!S592","v":0},{"$f":"Orçamento!X592","v":0},{"$f":"Orçamento!AA592","v":0}]
["","y.",{"$f":"Orçamento!P593","v":"PINTURA"},{"$f":"Orçamento!S593","v":0},{"$f":"Orçamento!X593","v":0},{"$f":"Orçamento!AA593","v":0}]
["","z.",{"$f":"Orçamento!P594","v":"DIVERSOS"},{"$f":"Orçamento!S594","v":0},{"$f":"Orçamento!X594","v":0},{"$f":"Orçamento!AA594","v":0}]
["F","TOTAL GERAL DO ORÇAMENTO",null,{"$f":"SUM(D17:D42)","v":0},{"$f":"SUM(E17:E42)","v":0},{"$f":"SUM(F17:F42)","v":0}]
[]
[null,"(*) Para itens da AGETOP, os vidros não estão inclusos nas esquadrias e já foram considerados os custos de contramarco para as esquadrias de alumínio;"]

{"sheet":"Cronog_90_Dias","index":3,"n_rows":99,"n_cols":20,"rows_kept":99,"cut":false,"hidden":false,"merged":[[0,1,0,17],[1,1,1,17],[2,1,2,7],[2,8,2,17],[3,1,3,7],[3,8,3,17],[8,1,8,7],[8,8,8,17],[9,0,11,0],[9,1,9,7],[9,8,9,17],[10,1,10,17],[11,1,11,17],[4,1,4,17],[5,1,5,7],[5,8,5,17],[6,1,6,7],[6,8,6,17],[7,1,7,17],[12,0,13,0],[12,3,13,3],[12,5,12,8],[12,9,12,12],[12,13,12,16],[12,17,13,17],[13,1,13,2],[13,5,13,8],[13,9,13,12],[13,13,13,16],[14,1,16,2],[14,3,16,3],[14,4,16,4],[14,5,14,8],[14,9,14,12],[14,13,14,16],[16,5,16,8],[16,9,16,12],[16,13,16,16],[17,1,19,2],[17,3,19,3],[17,4,19,4],[17,5,17,8],[17,9,17,12],[17,13,17,16],[19,5,19,8],[19,9,19,12],[19,13,19,16],[20,1,22,2],[20,3,22,3],[20,4,22,4],[20,5,20,8],[20,9,20,12],[20,13,20,16],[22,5,22,8],[22,9,22,12],[22,13,22,16],[23,1,25,2],[23,3,25,3],[23,4,25,4],[23,5,23,8],[23,9,23,12],[23,13,23,16],[25,5,25,8],[25,9,25,12],[25,13,25,16],[26,1,28,2],[26,3,28,3],[26,4,28,4],[26,5,26,8],[26,9,26,12],[26,13,26,16],[28,5,28,8],[28,9,28,12],[28,13,28,16],[29,1,31,2],[29,3,31,3],[29,4,31,4],[29,5,29,8],[29,9,29,12],[29,13,29,16],[31,5,31,8],[31,9,31,12],[31,13,31,16],[32,1,34,2],[32,3,34,3],[32,4,34,4],[32,5,32,8],[32,9,32,12],[32,13,32,16],[34,5,34,8],[34,9,34,12],[34,13,34,16],[35,1,37,2],[35,3,37,3],[35,4,37,4],[35,5,35,8],[35,9,35,12],[35,13,35,16],[37,5,37,8],[37,9,37,12],[37,13,37,16],[38,1,40,2],[38,3,40,3],[38,4,40,4],[38,5,38,8],[38,9,38,12],[38,13,38,16],[40,5,40,8],[40,9,40,12],[40,13,40,16],[41,1,43,2],[41,3,43,3],[41,4,43,4],[41,5,41,8],[41,9,41,12],[41,13,41,16],[43,5,43,8],[43,9,43,12],[43,13,43,16],[44,1,46,2],[44,3,46,3],[44,4,46,4],[44,5,44,8],[44,9,44,12],[44,13,44,16],[46,5,46,8],[46,9,46,12],[46,13,46,16],[47,1,49,2],[47,3,49,3],[47,4,49,4],[47,5,47,8],[47,9,47,12],[47,13,47,16],[49,5,49,8],[49,9,49,12],[49,13,49,16],[50,1,52,2],[50,3,52,3],[50,4,52,4],[50,5,50,8],[50,9,50,12],[50,13,50,16],[52,5,52,8],[52,9,52,12],[52,13,52,16],[53,1,55,2],[53,3,55,3],[53,4,55,4],[53,5,53,8],[53,9,53,12],[53,13,53,16],[55,5,55,8],[55,9,55,12],[55,13,55,16],[56,1,58,2],[56,3,58,3],[56,4,58,4],[56,5,56,8],[56,9,56,12],[56,13,56,16],[58,5,58,8],[58,9,58,12],[58,13,58,16],[59,1,61,2],[59,3,61,3],[59,4,61,4],[59,5,59,8],[59,9,59,12],[59,13,59,16],[61,5,61,8],[61,9,61,12],[61,13,61,16],[62,1,64,2],[62,3,64,3],[62,4,64,4],[62,5,62,8],[62,9,62,12],[62,13,62,16],[64,5,64,8],[64,9,64,12],[64,13,64,16],[65,1,67,2],[65,3,67,3],[65,4,67,4],[65,5,65,8],[65,9,65,12],[65,13,65,16],[67,5,67,8],[67,9,67,12],[67,13,67,16],[68,1,70,2],[68,3,70,3],[68,4,70,4],[68,5,68,8],[68,9,68,12],[68,13,68,16],[70,5,70,8],[70,9,70,12],[70,13,70,16],[71,1,73,2],[71,3,73,3],[71,4,73,4],[71,5,71,8],[71,9,71,12],[71,13,71,16],[73,5,73,8],[73,9,73,12],[73,13,73,16],[74,1,76,2],[74,3,76,3],[74,4,76,4],[74,5,74,8],[74,9,74,12],[74,13,74,16],[76,5,76,8],[76,9,76,12],[76,13,76,16],[77,1,79,2],[77,3,79,3],[77,4,79,4],[77,5,77,8],[77,9,77,12],[77,13,77,16],[79,5,79,8],[79,9,79,12],[79,13,79,16],[80,1,82,2],[80,3,82,3],[80,4,82,4],[80,5,80,8],[80,9,80,12],[80,13,80,16],[82,5,82,8],[82,9,82,12],[82,13,82,16],[83,1,85,2],[83,3,85,3],[83,4,85,4],[83,5,83,8],[83,9,83,12],[83,13,83,16],[85,5,85,8],[85,9,85,12],[85,13,85,16],[86,1,88,2],[86,3,88,3],[86,4,88,4],[86,5,86,8],[86,9,86,12],[86,13,86,16],[88,5,88,8],[88,9,88,12],[88,13,88,16],[92,1,92,2],[92,5,92,8],[92,9,92,12],[92,13,92,16],[93,1,93,2],[93,5,93,8],[93,9,93,12],[93,13,93,16],[89,1,91,2],[89,3,91,3],[89,4,91,4],[89,5,89,8],[89,9,89,12],[89,13,89,16],[91,5,91,8],[91,9,91,12],[91,13,91,16],[97,1,97,4],[98,1,98,17],[94,1,94,2],[94,5,94,8],[94,9,94,12],[94,13,94,16],[95,1,95,2],[95,5,95,8],[95,9,95,12],[95,13,95,16]]}
[]
[]
[null,"UNIDADE ESCOLAR",null,null,null,null,null,null,"PRAZO"]
[null,{"$f":"Orçamento!O5","v":"ESCOLA ESTADUAL GERCINA BORGES TEIXEIRA"},null,null,null,null,null,null,"90 DIAS CORRIDOS"]
[]
[null,"OBRA",null,null,null,null,null,null,"DATA"]
[null,{"$f":"Orçamento!O8","v":"REFORMA E AMPLIAÇÃO"},null,null,null,null,null,null,{"$f":"Orçamento!S8","v":"2020-05-28"}]
[]
[null,"LOCAL",null,null,null,null,null,null,"ÁREA TOTAL CONSTRUÍDA (M²)"]
["FILTRO",{"$f":"Orçamento!X8","v":"CAIAPÔNIA"},null,null,null,null,null,null,{"$f":"Orçamento!X14","v":811.8}]
[]
[null,"CRONOGRAMA - FÍSICO FINANCEIRO"]
["↓","CUSTO TOTAL:",{"$f":"D93","v":0},"VALOR","Dias:",30,null,null,null,60,null,null,null,90,null,null,null,"TOTAL"]
[null,"DESCRIÇÃO DOS SERVIÇOS",null,null,"%","1ª PARCELA",null,null,null,"2ª PARCELA",null,null,null,"3ª PARCELA"]
[{"$f":"IF(D15>0,\"F\",\"\")","v":""},"SERVIÇOS PRELIMINARES",null,{"$f":"Orçamento!X569","v":0},{"$f":"Orçamento!AA569","v":0},{"$f":"ROUND(F17*$D$15,2)","v":0},null,null,null,{"$f":"ROUND(J17*$D$15,2)","v":0},null,null,null,{"$f":"ROUND(N17*$D$15,2)","v":0},null,null,null,{"$f":"SUM(F15:Q15)","v":0},null,{"$f":"IF(D15=R15,\"OK\",\"ERRO\")","v":"OK"}]
[{"$f":"IF(A15=\"F\",A15,\"\")","v":""}]
[{"$f":"IF(A16=\"F\",A16,\"\")","v":""},null,null,null,null,1,null,null,null,0,null,null,null,{"$f":"1-F17-J17","v":0},null,null,null,{"$f":"IFERROR(E15/100,\"\")","v":0},null,{"$f":"IF(E15=R17*100,\"OK\",\"ERRO\")","v":"OK"}]
[{"$f":"IF(D18>0,\"F\",\"\")","v":""},"TRANSPORTES",null,{"$f":"Orçamento!X570","v":0},{"$f":"Orçamento!AA570","v":0},{"$f":"ROUND(F20*$D$18,2)","v":0},null,null,null,{"$f":"ROUND(J20*$D$18,2)","v":0},null,null,null,{"$f":"ROUND(N20*$D$18,2)","v":0},null,null,null,{"$f":"SUM(F18:Q18)","v":0},null,{"$f":"IF(D18=R18,\"OK\",\"ERRO\")","v":"OK"}]
[{"$f":"IF(A18=\"F\",A18,\"\")","v":""}]
[{"$f":"IF(A19=\"F\",A19,\"\")","v":""},null,null,null,null,0.37,null,null,null,0.3,null,null,null,{"$f":"1-F20-J20","v":0.33},null,null,null,{"$f":"IFERROR(E18/100,\"\")","v":0},null,{"$f":"IF(E18=R20*100,\"OK\",\"ERRO\")","v":"OK"}]
[{"$f":"IF(D21>0,\"F\",\"\")","v":""},"SERVIÇO EM TERRA",null,{"$f":"Orçamento!X571","v":0},{"$f":"Orçamento!AA571","v":0},{"$f":"ROUND(F23*$D$21,2)","v":0},null,null,null,{"$f":"ROUND(J23*$D$21,2)","v":0},null,null,null,{"$f":"ROUND(N23*$D$21,2)","v":0},null,null,null,{"$f":"SUM(F21:Q21)","v":0},null,{"$f":"IF(D21=R21,\"OK\",\"ERRO\")","v":"OK"}]
[{"$f":"IF(A21=\"F\",A21,\"\")","v":""}]
[{"$f":"IF(A22=\"F\",A22,\"\")","v":""},null,null,null,null,1,null,null,null,0,null,null,null,{"$f":"1-F23-J23","v":0},null,null,null,{"$f":"IFERROR(E21/100,\"\")","v":0},null,{"$f":"IF(E21=R23*100,\"OK\",\"ERRO\")","v":"OK"}]
[{"$f":"IF(D24>0,\"F\",\"\")","v":""},"FUNDAÇÕES E SONDAGENS",null,{"$f":"Orçamento!X572","v":0},{"$f":"Orçamento!AA572","v":0},{"$f":"ROUND(F26*$D$24,2)","v":0},null,null,null,{"$f":"ROUND(J26*$D$24,2)","v":0},null,null,null,{"$f":"ROUND(N26*$D$24,2)","v":0},null,null,null,{"$f":"SUM(F24:Q24)","v":0},null,{"$f":"IF(D24=R24,\"OK\",\"ERRO\")","v":"OK"}]
[{"$f":"IF(A24=\"F\",A24,\"\")","v":""}]
[{"$f":"IF(A25=\"F\",A25,\"\")","v":""},null,null,null,null,1,null,null,null,0,null,null,null,{"$f":"1-F26-J26","v":0},null,null,null,{"$f":"IFERROR(E24/100,\"\")","v":0},null,{"$f":"IF(E24=R26*100,\"OK\",\"ERRO\")","v":"OK"}]
[{"$f":"IF(D27>0,\"F\",\"\")","v":""},"ESTRUTURA",null,{"$f":"Orçamento!X573","v":0},{"$f":"Orçamento!AA573","v":0},{"$f":"ROUND(F29*$D$27,2)","v":0},null,null,null,{"$f":"ROUND(J29*$D$27,2)","v":0},null,null,null,{"$f":"ROUND(N29*$D$27,2)","v":0},null,null,null,{"$f":"SUM(F27:Q27)","v":0},null,{"$f":"IF(D27=R27,\"OK\",\"ERRO\")","v":"OK"}]
[{"$f":"IF(A27=\"F\",A27,\"\")","v":""}]
[{"$f":"IF(A28=\"F\",A28,\"\")","v":""},null,null,null,null,0.54,null,null,null,0.46,null,null,null,{"$f":"1-F29-J29","v":0},null,null,null,{"$f":"IFERROR(E27/100,\"\")","v":0},null,{"$f":"IF(E27=R29*100,\"OK\",\"ERRO\")","v":"OK"}]
[{"$f":"IF(D30>0,\"F\",\"\")","v":""},"INST.ELET/TELEFÔNICA/CABEAMENTO ESTRUTURADO",null,{"$f":"Orçamento!X574","v":0},{"$f":"Orçamento!AA574","v":0},{"$f":"ROUND(F32*$D$30,2)","v":0},null,null,null,{"$f":"ROUND(J32*$D$30,2)","v":0},null,null,null,{"$f":"ROUND(N32*$D$30,2)","v":0},null,null,null,{"$f":"SUM(F30:Q30)","v":0},null,{"$f":"IF(D30=R30,\"OK\",\"ERRO\")","v":"OK"}]
[{"$f":"IF(A30=\"F\",A30,\"\")","v":""}]
[{"$f":"IF(A31=\"F\",A31,\"\")","v":""},null,null,null,null,0.3,null,null,null,0.7,null,null,null,{"$f":"1-F32-J32","v":0},null,null,null,{"$f":"IFERROR(E30/100,\"\")","v":0},null,{"$f":"IF(E30=R32*100,\"OK\",\"ERRO\")","v":"OK"}]
[{"$f":"IF(D33>0,\"F\",\"\")","v":""},"INSTALAÇÕES HIDROSSANITÁRIAS",null,{"$f":"Orçamento!X575","v":0},{"$f":"Orçamento!AA575","v":0},{"$f":"ROUND(F35*$D$33,2)","v":0},null,null,null,{"$f":"ROUND(J35*$D$33,2)","v":0},null,null,null,{"$f":"ROUND(N35*$D$33,2)","v":0},null,null,null,{"$f":"SUM(F33:Q33)","v":0},null,{"$f":"IF(D33=R33,\"OK\",\"ERRO\")","v":"OK"}]
[{"$f":"IF(A33=\"F\",A33,\"\")","v":""}]
[{"$f":"IF(A34=\"F\",A34,\"\")","v":""},null,null,null,null,0.3,null,null,null,0.7,null,null,null,{"$f":"1-F35-J35","v":0},null,null,null,{"$f":"IFERROR(E33/100,\"\")","v":0},null,{"$f":"IF(E33=R35*100,\"OK\",\"ERRO\")","v":"OK"}]
[{"$f":"IF(D36>0,\"F\",\"\")","v":""},"INSTALAÇÕES ESPECIAIS",null,{"$f":"Orçamento!X576","v":0},{"$f":"Orçamento!AA576","v":0},{"$f":"ROUND(F38*$D$36,2)","v":0},null,null,null,{"$f":"ROUND(J38*$D$36,2)","v":0},null,null,null,{"$f":"ROUND(N38*$D$36,2)","v":0},null,null,null,{"$f":"SUM(F36:Q36)","v":0},null,{"$f":"IF(D36=R36,\"OK\",\"ERRO\")","v":"OK"}]
[{"$f":"IF(A36=\"F\",A36,\"\")","v":""}]
[{"$f":"IF(A37=\"F\",A37,\"\")","v":""},null,null,null,null,0.3,null,null,null,0.7,null,null,null,{"$f":"1-F38-J38","v":0},null,null,null,{"$f":"IFERROR(E36/100,\"\")","v":0},null,{"$f":"IF(E36=R38*100,\"OK\",\"ERRO\")","v":"OK"}]
[{"$f":"IF(D39>0,\"F\",\"\")","v":""},"ALVENARIA E DIVISÓRIAS",null,{"$f":"Orçamento!X577","v":0},{"$f":"Orçamento!AA577","v":0},{"$f":"ROUND(F41*$D$39,2)","v":0},null,null,null,{"$f":"ROUND(J41*$D$39,2)","v":0},null,null,null,{"$f":"ROUND(N41*$D$39,2)","v":0},null,null,null,{"$f":"SUM(F39:Q39)","v":0},null,{"$f":"IF(D39=R39,\"OK\",\"ERRO\")","v":"OK"}]
[{"$f":"IF(A39=\"F\",A39,\"\")","v":""}]
[{"$f":"IF(A40=\"F\",A40,\"\")","v":""},null,null,null,null,0.3,null,null,null,0.7,null,null,null,{"$f":"1-F41-J41","v":0},null,null,null,{"$f":"IFERROR(E39/100,\"\")","v":0},null,{"$f":"IF(E39=R41*100,\"OK\",\"ERRO\")","v":"OK"}]
[{"$f":"IF(D42>0,\"F\",\"\")","v":""},"ALVENARIA AUTO-PORTANTE",null,{"$f":"Orçamento!X578","v":0},{"$f":"Orçamento!AA578","v":0},{"$f":"ROUND(F44*$D$42,2)","v":0},null,null,null,{"$f":"ROUND(J44*$D$42,2)","v":0},null,null,null,{"$f":"ROUND(N44*$D$42,2)","v":0},null,null,null,{"$f":"SUM(F42:Q42)","v":0},null,{"$f":"IF(D42=R42,\"OK\",\"ERRO\")","v":"OK"}]
[{"$f":"IF(A42=\"F\",A42,\"\")","v":""}]
[{"$f":"IF(A43=\"F\",A43,\"\")","v":""},null,null,null,null,0,null,null,null,{"$f":"1-B44","v":1},null,null,null,{"$f":"1-F44-J44","v":0},null,null,null,{"$f":"IFERROR(E42/100,\"\")","v":0},null,{"$f":"IF(E42=R44*100,\"OK\",\"ERRO\")","v":"OK"}]
[{"$f":"IF(D45>0,\"F\",\"\")","v":""},"IMPERMEABILIZAÇÃO",null,{"$f":"Orçamento!X579","v":0},{"$f":"Orçamento!AA579","v":0},{"$f":"ROUND(F47*$D$45,2)","v":0},null,null,null,{"$f":"ROUND(J47*$D$45,2)","v":0},null,null,null,{"$f":"ROUND(N47*$D$45,2)","v":0},null,null,null,{"$f":"SUM(F45:Q45)","v":0},null,{"$f":"IF(D45=R45,\"OK\",\"ERRO\")","v":"OK"}]
[{"$f":"IF(A45=\"F\",A45,\"\")","v":""}]
[{"$f":"IF(A46=\"F\",A46,\"\")","v":""},null,null,null,null,0.85,null,null,null,0.15,null,null,null,{"$f":"1-F47-J47","v":0},null,null,null,{"$f":"IFERROR(E45/100,\"\")","v":0},null,{"$f":"IF(E45=R47*100,\"OK\",\"ERRO\")","v":"OK"}]
[{"$f":"IF(D48>0,\"F\",\"\")","v":""},"ISOLAMENTO TÉRMICO E ACÚSTICO",null,{"$f":"Orçamento!X580","v":0},{"$f":"Orçamento!AA580","v":0},{"$f":"ROUND(F50*$D$48,2)","v":0},null,null,null,{"$f":"ROUND(J50*$D$48,2)","v":0},null,null,null,{"$f":"ROUND(N50*$D$48,2)","v":0},null,null,null,{"$f":"SUM(F48:Q48)","v":0},null,{"$f":"IF(D48=R48,\"OK\",\"ERRO\")","v":"OK"}]
[{"$f":"IF(A48=\"F\",A48,\"\")","v":""}]
[{"$f":"IF(A49=\"F\",A49,\"\")","v":""},null,null,null,null,0,null,null,null,{"$f":"1-B50","v":1},null,null,null,{"$f":"1-F50-J50","v":0},null,null,null,{"$f":"IFERROR(E48/100,\"\")","v":0},null,{"$f":"IF(E48=R50*100,\"OK\",\"ERRO\")","v":"OK"}]
[{"$f":"IF(D51>0,\"F\",\"\")","v":""},"ESTRUTURA DE MADEIRA",null,{"$f":"Orçamento!X581","v":0},{"$f":"Orçamento!AA581","v":0},{"$f":"ROUND(F53*$D$51,2)","v":0},null,null,null,{"$f":"ROUND(J53*$D$51,2)","v":0},null,null,null,{"$f":"ROUND(N53*$D$51,2)","v":0},null,null,null,{"$f":"SUM(F51:Q51)","v":0},null,{"$f":"IF(D51=R51,\"OK\",\"ERRO\")","v":"OK"}]
[{"$f":"IF(A51=\"F\",A51,\"\")","v":""}]
[{"$f":"IF(A52=\"F\",A52,\"\")","v":""},null,null,null,null,0,null,null,null,0.57999999999999996,null,null,null,{"$f":"1-F53-J53","v":0.42000000000000004},null,null,null,{"$f":"IFERROR(E51/100,\"\")","v":0},null,{"$f":"IF(E51=R53*100,\"OK\",\"ERRO\")","v":"OK"}]
[{"$f":"IF(D54>0,\"F\",\"\")","v":""},"ESTRUTURA METÁLICA",null,{"$f":"Orçamento!X582","v":0},{"$f":"Orçamento!AA582","v":0},{"$f":"ROUND(F56*$D$54,2)","v":0},null,null,null,{"$f":"ROUND(J56*$D$54,2)","v":0},null,null,null,{"$f":"ROUND(N56*$D$54,2)","v":0},null,null,null,{"$f":"SUM(F54:Q54)","v":0},null,{"$f":"IF(D54=R54,\"OK\",\"ERRO\")","v":"OK"}]
[{"$f":"IF(A54=\"F\",A54,\"\")","v":""}]
[{"$f":"IF(A55=\"F\",A55,\"\")","v":""},null,null,null,null,0,null,null,null,0.57999999999999996,null,null,null,{"$f":"1-F56-J56","v":0.42000000000000004},null,null,null,{"$f":"IFERROR(E54/100,\"\")","v":0},null,{"$f":"IF(E54=R56*100,\"OK\",\"ERRO\")","v":"OK"}]
[{"$f":"IF(D57>0,\"F\",\"\")","v":""},"COBERTURAS",null,{"$f":"Orçamento!X583","v":0},{"$f":"Orçamento!AA583","v":0},{"$f":"ROUND(F59*$D$57,2)","v":0},null,null,null,{"$f":"ROUND(J59*$D$57,2)","v":0},null,null,null,{"$f":"ROUND(N59*$D$57,2)","v":0},null,null,null,{"$f":"SUM(F57:Q57)","v":0},null,{"$f":"IF(D57=R57,\"OK\",\"ERRO\")","v":"OK"}]
[{"$f":"IF(A57=\"F\",A57,\"\")","v":""}]
[{"$f":"IF(A58=\"F\",A58,\"\")","v":""},null,null,null,null,0,null,null,null,0,null,null,null,{"$f":"1-F59-J59","v":1},null,null,null,{"$f":"IFERROR(E57/100,\"\")","v":0},null,{"$f":"IF(E57=R59*100,\"OK\",\"ERRO\")","v":"OK"}]
[{"$f":"IF(D60>0,\"F\",\"\")","v":""},"ESQUADRIAS DE MADEIRA",null,{"$f":"Orçamento!X584","v":0},{"$f":"Orçamento!AA584","v":0},{"$f":"ROUND(F62*$D$60,2)","v":0},null,null,null,{"$f":"ROUND(J62*$D$60,2)","v":0},null,null,null,{"$f":"ROUND(N62*$D$60,2)","v":0},null,null,null,{"$f":"SUM(F60:Q60)","v":0},null,{"$f":"IF(D60=R60,\"OK\",\"ERRO\")","v":"OK"}]
[{"$f":"IF(A60=\"F\",A60,\"\")","v":""}]
[{"$f":"IF(A61=\"F\",A61,\"\")","v":""},null,null,null,null,0,null,null,null,0.4,null,null,null,{"$f":"1-F62-J62","v":0.6},null,null,null,{"$f":"IFERROR(E60/100,\"\")","v":0},null,{"$f":"IF(E60=R62*100,\"OK\",\"ERRO\")","v":"OK"}]
[{"$f":"IF(D63>0,\"F\",\"\")","v":""},"ESQUADRIAS METÁLICAS",null,{"$f":"Orçamento!X585","v":0},{"$f":"Orçamento!AA585","v":0},{"$f":"ROUND(F65*$D$63,2)","v":0},null,null,null,{"$f":"ROUND(J65*$D$63,2)","v":0},null,null,null,{"$f":"ROUND(N65*$D$63,2)","v":0},null,null,null,{"$f":"SUM(F63:Q63)","v":0},null,{"$f":"IF(D63=R63,\"OK\",\"ERRO\")","v":"OK"}]
[{"$f":"IF(A63=\"F\",A63,\"\")","v":""}]
[{"$f":"IF(A64=\"F\",A64,\"\")","v":""},null,null,null,null,0,null,null,null,0.45,null,null,null,{"$f":"1-F65-J65","v":0.55000000000000004},null,null,null,{"$f":"IFERROR(E63/100,\"\")","v":0},null,{"$f":"IF(E63=R65*100,\"OK\",\"ERRO\")","v":"OK"}]
[{"$f":"IF(D66>0,\"F\",\"\")","v":""},"VIDROS",null,{"$f":"Orçamento!X586","v":0},{"$f":"Orçamento!AA586","v":0},{"$f":"ROUND(F68*$D$66,2)","v":0},null,null,null,{"$f":"ROUND(J68*$D$66,2)","v":0},null,null,null,{"$f":"ROUND(N68*$D$66,2)","v":0},null,null,null,{"$f":"SUM(F66:Q66)","v":0},null,{"$f":"IF(D66=R66,\"OK\",\"ERRO\")","v":"OK"}]
[{"$f":"IF(A66=\"F\",A66,\"\")","v":""}]
[{"$f":"IF(A67=\"F\",A67,\"\")","v":""},null,null,null,null,0,null,null,null,0,null,null,null,{"$f":"1-F68-J68","v":1},null,null,null,{"$f":"IFERROR(E66/100,\"\")","v":0},null,{"$f":"IF(E66=R68*100,\"OK\",\"ERRO\")","v":"OK"}]
[{"$f":"IF(D69>0,\"F\",\"\")","v":""},"REVESTIMENTO DE PAREDE",null,{"$f":"Orçamento!X587","v":0},{"$f":"Orçamento!AA587","v":0},{"$f":"ROUND(F71*$D$69,2)","v":0},null,null,null,{"$f":"ROUND(J71*$D$69,2)","v":0},null,null,null,{"$f":"ROUND(N71*$D$69,2)","v":0},null,null,null,{"$f":"SUM(F69:Q69)","v":0},null,{"$f":"IF(D69=R69,\"OK\",\"ERRO\")","v":"OK"}]
[{"$f":"IF(A69=\"F\",A69,\"\")","v":""}]
[{"$f":"IF(A70=\"F\",A70,\"\")","v":""},null,null,null,null,0,null,null,null,0.4,null,null,null,{"$f":"1-F71-J71","v":0.6},null,null,null,{"$f":"IFERROR(E69/100,\"\")","v":0},null,{"$f":"IF(E69=R71*100,\"OK\",\"ERRO\")","v":"OK"}]
[{"$f":"IF(D72>0,\"F\",\"\")","v":""},"FORROS",null,{"$f":"Orçamento!X588","v":0},{"$f":"Orçamento!AA588","v":0},{"$f":"ROUND(F74*$D$72,2)","v":0},null,null,null,{"$f":"ROUND(J74*$D$72,2)","v":0},null,null,null,{"$f":"ROUND(N74*$D$72,2)","v":0},null,null,null,{"$f":"SUM(F72:Q72)","v":0},null,{"$f":"IF(D72=R72,\"OK\",\"ERRO\")","v":"OK"}]
[{"$f":"IF(A72=\"F\",A72,\"\")","v":""}]
[{"$f":"IF(A73=\"F\",A73,\"\")","v":""},null,null,null,null,0,null,null,null,0.4,null,null,null,{"$f":"1-F74-J74","v":0.6},null,null,null,{"$f":"IFERROR(E72/100,\"\")","v":0},null,{"$f":"IF(E72=R74*100,\"OK\",\"ERRO\")","v":"OK"}]
[{"$f":"IF(D75>0,\"F\",\"\")","v":""},"REVESTIMENTO DE PISO",null,{"$f":"Orçamento!X589","v":0},{"$f":"Orçamento!AA589","v":0},{"$f":"ROUND(F77*$D$75,2)","v":0},null,null,null,{"$f":"ROUND(J77*$D$75,2)","v":0},null,null,null,{"$f":"ROUND(N77*$D$75,2)","v":0},null,null,null,{"$f":"SUM(F75:Q75)","v":0},null,{"$f":"IF(D75=R75,\"OK\",\"ERRO\")","v":"OK"}]
[{"$f":"IF(A75=\"F\",A75,\"\")","v":""}]
[{"$f":"IF(A76=\"F\",A76,\"\")","v":""},null,null,null,null,0,null,null,null,0.4,null,null,null,{"$f":"1-F77-J77","v":0.6},null,null,null,{"$f":"IFERROR(E75/100,\"\")","v":0},null,{"$f":"IF(E75=R77*100,\"OK\",\"ERRO\")","v":"OK"}]
[{"$f":"IF(D78>0,\"F\",\"\")","v":""},"FERRAGENS",null,{"$f":"Orçamento!X590","v":0},{"$f":"Orçamento!AA590","v":0},{"$f":"ROUND(F80*$D$78,2)","v":0},null,null,null,{"$f":"ROUND(J80*$D$78,2)","v":0},null,null,null,{"$f":"ROUND(N80*$D$78,2)","v":0},null,null,null,{"$f":"SUM(F78:Q78)","v":0},null,{"$f":"IF(D78=R78,\"OK\",\"ERRO\")","v":"OK"}]
[{"$f":"IF(A78=\"F\",A78,\"\")","v":""}]
[{"$f":"IF(A79=\"F\",A79,\"\")","v":""},null,null,null,null,0,null,null,null,0,null,null,null,{"$f":"1-F80-J80","v":1},null,null,null,{"$f":"IFERROR(E78/100,\"\")","v":0},null,{"$f":"IF(E78=R80*100,\"OK\",\"ERRO\")","v":"OK"}]
[{"$f":"IF(D81>0,\"F\",\"\")","v":""},"MARCENARIA",null,{"$f":"Orçamento!X591","v":0},{"$f":"Orçamento!AA591","v":0},{"$f":"ROUND(F83*$D$81,2)","v":0},null,null,null,{"$f":"ROUND(J83*$D$81,2)","v":0},null,null,null,{"$f":"ROUND(N83*$D$81,2)","v":0},null,null,null,{"$f":"SUM(F81:Q81)","v":0},null,{"$f":"IF(D81=R81,\"OK\",\"ERRO\")","v":"OK"}]
[{"$f":"IF(A81=\"F\",A81,\"\")","v":""}]
[{"$f":"IF(A82=\"F\",A82,\"\")","v":""},null,null,null,null,0,null,null,null,0,null,null,null,{"$f":"1-F83-J83","v":1},null,null,null,{"$f":"IFERROR(E81/100,\"\")","v":0},null,{"$f":"IF(E81=R83*100,\"OK\",\"ERRO\")","v":"OK"}]
[{"$f":"IF(D84>0,\"F\",\"\")","v":""},"ADMINISTRAÇÃO - MENSALISTAS",null,{"$f":"Orçamento!X592","v":0},{"$f":"Orçamento!AA592","v":0},{"$f":"ROUND(F86*$D$84,2)","v":0},null,null,null,{"$f":"ROUND(J86*$D$84,2)","v":0},null,null,null,{"$f":"ROUND(N86*$D$84,2)","v":0},null,null,null,{"$f":"SUM(F84:Q84)","v":0},null,{"$f":"IF(D84=R84,\"OK\",\"ERRO\")","v":"OK"}]
[{"$f":"IF(A84=\"F\",A84,\"\")","v":""}]
[{"$f":"IF(A85=\"F\",A85,\"\")","v":""},null,null,null,null,0.34300000000000003,null,null,null,0.33,null,null,null,{"$f":"1-F86-J86","v":0.32700000000000001},null,null,null,{"$f":"IFERROR(E84/100,\"\")","v":0},null,{"$f":"IF(E84=R86*100,\"OK\",\"ERRO\")","v":"OK"}]
[{"$f":"IF(D87>0,\"F\",\"\")","v":""},"PINTURA",null,{"$f":"Orçamento!X593","v":0},{"$f":"Orçamento!AA593","v":0},{"$f":"ROUND(F89*$D$87,2)","v":0},null,null,null,{"$f":"ROUND(J89*$D$87,2)","v":0},null,null,null,{"$f":"ROUND(N89*$D$87,2)","v":0},null,null,null,{"$f":"SUM(F87:Q87)","v":0},null,{"$f":"IF(D87=R87,\"OK\",\"ERRO\")","v":"OK"}]
[{"$f":"IF(A87=\"F\",A87,\"\")","v":""}]
[{"$f":"IF(A88=\"F\",A88,\"\")","v":""},null,null,null,null,0,null,null,null,0,null,null,null,{"$f":"1-F89-J89","v":1},null,null,null,{"$f":"IFERROR(E87/100,\"\")","v":0},null,{"$f":"IF(E87=R89*100,\"OK\",\"ERRO\")","v":"OK"}]
[{"$f":"IF(D90>0,\"F\",\"\")","v":""},"DIVERSOS",null,{"$f":"Orçamento!X594","v":0},{"$f":"Orçamento!AA594","v":0},{"$f":"ROUND(F92*$D$90,2)","v":0},null,null,null,{"$f":"ROUND(J92*$D$90,2)","v":0},null,null,null,{"$f":"ROUND(N92*$D$90,2)","v":0},null,null,null,{"$f":"SUM(F90:Q90)","v":0},null,{"$f":"IF(D90=R90,\"OK\",\"ERRO\")","v":"OK"}]
[{"$f":"IF(A90=\"F\",A90,\"\")","v":""}]
[{"$f":"IF(A91=\"F\",A91,\"\")","v":""},null,null,null,null,0,null,null,null,0,null,null,null,{"$f":"1-F92-J92","v":1},null,null,null,{"$f":"IFERROR(E90/100,\"\")","v":0},null,{"$f":"IF(E90=R92*100,\"OK\",\"ERRO\")","v":"OK"}]
["F","CUSTO DO ORÇAMENTO",null,{"$f":"SUM(D15:D92)","v":0},{"$f":"SUM(E15:E92)","v":0},{"$f":"F15+F18+F21+F24+F27+F30+F33+F36+F39+F42+F45+F48+F51+F54+F57+F60+F63+F66+F69+F72+F75+F78+F81+F84+F87+F90","v":0},null,null,null,{"$f":"J15+J18+J21+J24+J27+J30+J33+J36+J39+J42+J45+J48+J51+J54+J57+J60+J63+J66+J69+J72+J75+J78+J81+J84+J87+J90","v":0},null,null,null,{"$f":"N15+N18+N21+N24+N27+N30+N33+N36+N39+N42+N45+N48+N51+N54+N57+N60+N63+N66+N69+N72+N75+N78+N81+N84+N87+N90","v":0},null,null,null,{"$f":"R15+R18+R21+R24+R27+R30+R33+R36+R39+R42+R45+R48+R51+R54+R57+R60+R63+R66+R69+R72+R75+R78+R81+R84+R87+R90","v":0}]
["F","PERCENTUAIS:",null,null,null,{"$f":"IFERROR(F93/D93,\"\")","v":""},null,null,null,{"$f":"IFERROR(J93/D93,\"\")","v":""},null,null,null,{"$f":"IFERROR(N93/D93,\"\")","v":""},null,null,null,{"$f":"SUM(F94:Q94)","v":0}]
["F","TOTAIS ACUMULADOS:",null,null,null,{"$f":"F93","v":0},null,null,null,{"$f":"F95+J93","v":0},null,null,null,{"$f":"J95+N93","v":0}]
["F","PERCENTUAIS  ACUMULADOS:",null,null,null,{"$f":"F94","v":""},null,null,null,{"$f":"J94+F96","v":{"$error":"#VALUE!"}},null,null,null,{"$f":"IFERROR(J96+N94,\"\")","v":""}]
["F"]
["F","OBSERVAÇÕES:"]
["F","Os pagamentos somente poderão ser efetuados mediante medição e atesto pelos técnicos da Secretaria da Educação. "]

{"sheet":"Composição BDI","index":4,"n_rows":45,"n_cols":4,"rows_kept":45,"cut":false,"hidden":false,"merged":[[17,0,17,3],[16,0,16,3],[44,0,44,3],[42,0,42,3],[43,0,43,3],[18,0,18,3],[36,0,36,3],[39,0,39,3],[38,0,38,3],[40,0,40,3],[29,0,29,2],[32,0,32,3],[33,0,33,3],[34,0,34,3],[35,0,35,3],[0,0,0,3],[2,0,2,3],[3,0,3,3],[1,0,1,3],[5,0,5,3],[4,0,4,3],[12,0,12,3],[13,0,13,3],[14,0,14,3],[15,0,15,3],[6,0,6,3],[8,0,8,3],[7,0,7,3],[9,0,9,3],[11,0,11,3],[10,0,10,3]]}
[]
[]
["UNIDADE ESCOLAR"]
["ESCOLA ESTADUAL GERCINA BORGES TEIXEIRA"]
[]
["OBRA"]
["REFORMA E AMPLIAÇÃO"]
[]
["ENDEREÇO"]
[" AV. CEL. LINDOLFO A. DIAS 677 , CENTRO , CEP: 7585-000"]
[]
["CIDADE"]
["CAIAPÔNIA"]
[]
["CRE"]
["CRE-IPORÁ"]
[]
["DETALHAMENTO DA COMPOSIÇÃO DE BDI"]
["COMPOSIÇÃO BDI PARA OBRAS CIVIS"]
["DESCRIÇÃO","COEF.","TAXA % (a.m)","% no preço de venda"]
["1) COFINS",1,0.03,0.03]
["2) PIS",1,6.4999999999999997E-3,6.4999999999999997E-3]
["3) ISSQN",1,0.05,0.05]
["4) CPRB",1,4.4999999999999998E-2,4.4999999999999998E-2]
["5) Administração Central",1,0.03,0.03]
["6) Despesas Financeiras",1,5.5999999999999999E-3,5.5999999999999999E-3]
["7) Seguros + Garantias",1,1.1999999999999999E-3,1.1999999999999999E-3]
["8) Risco",1,9.7000000000000003E-3,9.7000000000000003E-3]
["9) Lucro",1,6.1600000000000002E-2,6.1600000000000002E-2]
["BDI - FINAL",null,null,0.27945601481174465]
[]
["Notas:"]
["(1) e (2) Alíquota definida por lei."]
["(3) Alíquota e base de cálculo definidas pela legislação municipal."]
["(4) Alíquota definida pelas leis 12.546/11, 12844/13 e 13.161/15 (CPRB – contribuição previdenciária sobre a receita bruta)."]
["(5) Valores definidos a partir dos limites no Acórdão nº 2.622/2013 - TCU – Plenário. Valores entre o 1º e 3º quartis."]
["(6) Valor calculado pela expressão matemática do acórdão 2.369/2011 – TCU – Plenário e disponibilizado pela AGETOP em dezembro de 2018. (Foi utilizado para o cálculo a média da Taxa SELIC no período de 11/2017 a 10/2018)"]
[]
["(7) Valores definidos pela AGETOP a partir dos limites no Acórdão nº 2.622/2013 - TCU – Plenário. Valores médios. \n\nObservação da AGETOP: (Seguros contra erros de execução, incêndio e explosão, danos da natureza (vendaval, destelhamento, alagamento, inundação, desmoronamento, geadas etc.), emprego de material defeituoso ou inadequado, roubo e/ou furto qualificado, quebra de equipamentos, desmoronamento de estrutura, nas modalidades de Obras Civis em Construção (OCC); Instalação e Montagem (IM); e Obras Civis em Construção e Instalação e Montagem (OCC/IM). Bem como coberturas adicionais para ampliação dessas coberturas básicas, como: cobertura de responsabilidade civil geral, cobertura de responsabilidade civil cruzada, cobertura de despesas extraordinárias, cobertura de tumultos, cobertura de desentulho do local, cobertura de riscos do fabricante, dentre outras, incluindo o seguro de vida em grupo regido pela convenção coletiva dos trabalhadores na indústria da construção civil). A partir de 24/02/2015 por intermédio da Portaria 449/2015 a Presidência da AGETOP, na pessoa do Senhor Jayme Eduardo Rincon, determinou a exclusão dos valores referentes aos Seguros de Risco de Engenharia e Responsabilidade Civil do Profissional na composição do cálculo do B.D.I.."]
["(8) Valores definidos a partir dos limites no Acórdão nº 2.622/2013 - TCU – Plenário. Valores entre 1º e 3° quartis."]
["(9) Valores definidos a partir dos limites definidos no Acórdão nº 2.622/2013 - TCU – Plenário. Valores adotados e praticados no mercado ( “ ex ante ” ) ou aqueles entre os 1º e 3º quartis."]
[]
["(*) A fórmula para estipulação da taxa de BDI estimado adotado é a mesma que foi aplicada para a obtenção das tabelas contidas no Acórdão n. 2.622/2013 – TCUPlenário"]
[]
["Obs.: Para obras com valores superiores a R$ 20.000.000,00 sugere-se recalcular o BDI, dimensionando as taxas de administração central e lucro para patamares inferiores ao estipulado acima."]

{"sheet":"Relatório CENTRAL","index":5,"n_rows":40,"n_cols":5,"rows_kept":40,"cut":false,"hidden":false,"merged":[[0,1,0,4],[6,3,6,4],[9,3,9,4],[1,1,1,4],[2,1,2,2],[2,3,2,4],[3,1,3,2],[3,3,3,4],[4,1,4,4],[5,1,5,2],[5,3,5,4],[6,1,6,2],[7,1,7,4],[8,1,8,2],[8,3,8,4],[9,1,9,2],[10,1,10,4],[11,1,11,4],[39,1,39,2],[9,0,11,0]]}
[]
[]
[null,"UNIDADE ESCOLAR",null,"CIDADE"]
[null,{"$f":"Orçamento!$O$5","v":"ESCOLA ESTADUAL GERCINA BORGES TEIXEIRA"},null,{"$f":"Orçamento!$X$8","v":"CAIAPÔNIA"}]
[]
[null,"OBRA",null,"CRE"]
[null,{"$f":"Orçamento!$O$8","v":"REFORMA E AMPLIAÇÃO"},null,{"$f":"Orçamento!$O$11","v":"CRE-IPORÁ"}]
[]
[null,"ENDEREÇO",null,"DATA"]
["FILTRO",{"$f":"Orçamento!$R$11","v":" AV. CEL. LINDOLFO A. DIAS 677 , CENTRO , CEP: 7585-000"},null,{"$f":"Orçamento!$S$8","v":"2020-05-28"}]
[]
[null,"RELATÓRIO CENTRAL"]
["↓","CÓDIGO","ETAPA","PREÇO  (R$) C/ BDI","PARTIC  ( % )"]
[{"$f":"IF(D14>0,\"F\",\"\")","v":""},{"$f":"Orçamento!O569","v":"a."},{"$f":"Orçamento!P569","v":"SERVIÇOS PRELIMINARES"},{"$f":"Orçamento!X569","v":0},{"$f":"Orçamento!AA569","v":0}]
[{"$f":"IF(D15>0,\"F\",\"\")","v":""},{"$f":"Orçamento!O570","v":"b."},{"$f":"Orçamento!P570","v":"TRANSPORTES"},{"$f":"Orçamento!X570","v":0},{"$f":"Orçamento!AA570","v":0}]
["",{"$f":"Orçamento!O571","v":"c."},{"$f":"Orçamento!P571","v":"SERVIÇO EM TERRA"},{"$f":"Orçamento!X571","v":0},{"$f":"Orçamento!AA571","v":0}]
["",{"$f":"Orçamento!O572","v":"d."},{"$f":"Orçamento!P572","v":"FUNDAÇÕES E SONDAGENS"},{"$f":"Orçamento!X572","v":0},{"$f":"Orçamento!AA572","v":0}]
["",{"$f":"Orçamento!O573","v":"e."},{"$f":"Orçamento!P573","v":"ESTRUTURA"},{"$f":"Orçamento!X573","v":0},{"$f":"Orçamento!AA573","v":0}]
["",{"$f":"Orçamento!O574","v":"f."},{"$f":"Orçamento!P574","v":"INSTALAÇÕES ELÉTRICAS"},{"$f":"Orçamento!X574","v":0},{"$f":"Orçamento!AA574","v":0}]
["",{"$f":"Orçamento!O575","v":"g."},{"$f":"Orçamento!P575","v":"INSTALAÇÕES HIDROSSANITÁRIAS"},{"$f":"Orçamento!X575","v":0},{"$f":"Orçamento!AA575","v":0}]
["",{"$f":"Orçamento!O576","v":"h"},{"$f":"Orçamento!P576","v":"INSTALAÇÕES ESPECIAIS"},{"$f":"Orçamento!X576","v":0},{"$f":"Orçamento!AA576","v":0}]
["",{"$f":"Orçamento!O577","v":"i."},{"$f":"Orçamento!P577","v":"ALVENARIAS E DIVISÓRIAS"},{"$f":"Orçamento!X577","v":0},{"$f":"Orçamento!AA577","v":0}]
["",{"$f":"Orçamento!O578","v":"j."},{"$f":"Orçamento!P578","v":"ALVENARIA AUTO-PORTANTE"},{"$f":"Orçamento!X578","v":0},{"$f":"Orçamento!AA578","v":0}]
["",{"$f":"Orçamento!O579","v":"k."},{"$f":"Orçamento!P579","v":"IMPERMEABILIZAÇÃO"},{"$f":"Orçamento!X579","v":0},{"$f":"Orçamento!AA579","v":0}]
["",{"$f":"Orçamento!O580","v":"l."},{"$f":"Orçamento!P580","v":"ISOLAMENTO TÉRMICO E ACÚSTICO"},{"$f":"Orçamento!X580","v":0},{"$f":"Orçamento!AA580","v":0}]
["",{"$f":"Orçamento!O581","v":"m."},{"$f":"Orçamento!P581","v":"ESTRUTURA DE MADEIRA"},{"$f":"Orçamento!X581","v":0},{"$f":"Orçamento!AA581","v":0}]
["",{"$f":"Orçamento!O582","v":"n."},{"$f":"Orçamento!P582","v":"ESTRUTURAS METÁLICAS"},{"$f":"Orçamento!X582","v":0},{"$f":"Orçamento!AA582","v":0}]
["",{"$f":"Orçamento!O583","v":"o."},{"$f":"Orçamento!P583","v":"COBERTURAS"},{"$f":"Orçamento!X583","v":0},{"$f":"Orçamento!AA583","v":0}]
["",{"$f":"Orçamento!O584","v":"p."},{"$f":"Orçamento!P584","v":"ESQUADRIAS DE MADEIRA"},{"$f":"Orçamento!X584","v":0},{"$f":"Orçamento!AA584","v":0}]
["",{"$f":"Orçamento!O585","v":"q."},{"$f":"Orçamento!P585","v":"ESQUADRIAS METÁLICAS"},{"$f":"Orçamento!X585","v":0},{"$f":"Orçamento!AA585","v":0}]
["",{"$f":"Orçamento!O586","v":"r."},{"$f":"Orçamento!P586","v":"VIDROS"},{"$f":"Orçamento!X586","v":0},{"$f":"Orçamento!AA586","v":0}]
["",{"$f":"Orçamento!O587","v":"s."},{"$f":"Orçamento!P587","v":"REVESTIMENTO DE PAREDE"},{"$f":"Orçamento!X587","v":0},{"$f":"Orçamento!AA587","v":0}]
["",{"$f":"Orçamento!O588","v":"t."},{"$f":"Orçamento!P588","v":"FORROS"},{"$f":"Orçamento!X588","v":0},{"$f":"Orçamento!AA588","v":0}]
["",{"$f":"Orçamento!O589","v":"u."},{"$f":"Orçamento!P589","v":"REVESTIMENTO DE PISO"},{"$f":"Orçamento!X589","v":0},{"$f":"Orçamento!AA589","v":0}]
["",{"$f":"Orçamento!O590","v":"v."},{"$f":"Orçamento!P590","v":"FERRAGENS"},{"$f":"Orçamento!X590","v":0},{"$f":"Orçamento!AA590","v":0}]
["",{"$f":"Orçamento!O591","v":"w."},{"$f":"Orçamento!P591","v":"MARCENARIA"},{"$f":"Orçamento!X591","v":0},{"$f":"Orçamento!AA591","v":0}]
["",{"$f":"Orçamento!O592","v":"x."},{"$f":"Orçamento!P592","v":"ADMINISTRAÇÃO"},{"$f":"Orçamento!X592","v":0},{"$f":"Orçamento!AA592","v":0}]
["",{"$f":"Orçamento!O593","v":"y."},{"$f":"Orçamento!P593","v":"PINTURA"},{"$f":"Orçamento!X593","v":0},{"$f":"Orçamento!AA593","v":0}]
["",{"$f":"Orçamento!O594","v":"z."},{"$f":"Orçamento!P594","v":"DIVERSOS"},{"$f":"Orçamento!X594","v":0},{"$f":"Orçamento!AA594","v":0}]
["F","TOTAL GERAL DO ORÇAMENTO (R$) C/BDI",null,{"$f":"SUM(D14:D39)","v":0},{"$f":"SUM(E14:E39)","v":0}]

{"sheet":"Parc Maior Relev","index":6,"n_rows":33,"n_cols":7,"rows_kept":33,"cut":false,"hidden":false,"merged":[[6,4,6,6],[7,1,7,6],[8,1,8,3],[8,4,8,6],[33,3,33,7],[31,1,31,6],[0,1,0,6],[11,1,11,6],[1,1,1,6],[2,1,2,3],[2,4,2,6],[3,1,3,3],[3,4,3,6],[4,1,4,6],[5,1,5,3],[5,4,5,6],[9,1,9,3],[9,4,9,6],[10,1,10,6],[6,1,6,3]]}
[]
[]
[null,"UNIDADE ESCOLAR",null,null,"CÓDIGO INEP"]
[null,{"$f":"Orçamento!$O$5","v":"ESCOLA ESTADUAL GERCINA BORGES TEIXEIRA"},null,null,{"$f":"Orçamento!$X$5","v":52051951}]
[]
[null,"OBRA",null,null,"CIDADE"]
[null,{"$f":"Orçamento!$O$8","v":"REFORMA E AMPLIAÇÃO"},null,null,{"$f":"Orçamento!$X$8","v":"CAIAPÔNIA"}]
[]
[null,"CRE",null,null,"ÁREA TOTAL CONSTRUÍDA (M²)"]
[null,{"$f":"Orçamento!$O$11","v":"CRE-IPORÁ"},null,null,{"$f":"Orçamento!$X$14","v":811.8}]
[]
["FILTRO","PARCELA DE MAIOR RELEVÂNCIA"]
[{"$f":"IF(G14>0,\"F\",\"\")","v":""},"CÓDIGO","SERVIÇO","DESCRIÇÃO","UNID","QUANT","PARC. MAIOR RELEV (100%)"]
[{"$f":"IF(G14>0,\"F\",\"\")","v":""},"f.","INSTALAÇÕES ELÉTRICAS","SUBESTAÇÃO","KVA",{"$f":"SUMIF(Orçamento!$R$21:$R$550,'Parc Maior Relev'!D14,Orçamento!$T$21:$T$550)","v":0},{"$f":"F14","v":0}]
[{"$f":"IF(SUM(G16:G30)>0,\"F\",\"\")","v":"F"},"CÓDIGO","SERVIÇO","DESCRIÇÃO","UNID","QUANT","PARC. MAIOR RELEV (50%)"]
[{"$f":"IF(G16>0,\"F\",\"\")","v":""},"e.","ESTRUTURA","CONCRETO","M3",{"$f":"SUMIF(Orçamento!$R$21:$R$550,'Parc Maior Relev'!D16,Orçamento!$T$21:$T$550)","v":0},{"$f":"F16*0.5","v":0}]
[{"$f":"IF(G17>0,\"F\",\"\")","v":"F"},"f.","INSTALAÇÕES ELÉTRICAS","INSTALAÇÕES ELÉTRICAS","KVA",44.07,{"$f":"F17*0.5","v":22.035}]
[{"$f":"IF(G18>0,\"F\",\"\")","v":""},"o.","COBERTURAS","COBERTURA CERÂMICA","M2",{"$f":"SUMIF(Orçamento!$R$21:$R$550,'Parc Maior Relev'!D18,Orçamento!$T$21:$T$550)","v":0},0]
["","o.","COBERTURAS","COBERTURA COM TELHA METÁLICA","M2",{"$f":"SUMIF(Orçamento!$R$21:$R$550,'Parc Maior Relev'!D19,Orçamento!$T$21:$T$550)","v":0},0]
["","s.","REVESTIMENTO DE PAREDE","CHAPISCO","M2",{"$f":"SUMIF(Orçamento!$R$21:$R$550,'Parc Maior Relev'!D20,Orçamento!$T$21:$T$550)","v":0},0]
["","s.","REVESTIMENTO DE PAREDE","REBOCO","M2",{"$f":"SUMIF(Orçamento!$R$21:$R$550,'Parc Maior Relev'!D21,Orçamento!$T$21:$T$550)","v":0},0]
["","s.","REVESTIMENTO DE PAREDE","REVESTIMENTO CERÂMICO","M2",{"$f":"SUMIF(Orçamento!$R$21:$R$550,'Parc Maior Relev'!D22,Orçamento!$T$21:$T$550)","v":0},0]
["","t.","FORROS","FORRO DE GESSO","M2",{"$f":"SUMIF(Orçamento!$R$21:$R$550,'Parc Maior Relev'!D23,Orçamento!$T$21:$T$550)","v":0},0]
["","t.","FORROS","FORRO DE PVC","M2",{"$f":"SUMIF(Orçamento!$R$21:$R$550,'Parc Maior Relev'!D24,Orçamento!$T$21:$T$550)","v":0},0]
["","t.","FORROS","FORRO DE GESSO ACARTONADO","M2",{"$f":"SUMIF(Orçamento!$R$21:$R$550,'Parc Maior Relev'!D25,Orçamento!$T$21:$T$550)","v":0},0]
["","u.","REVESTIMENTO DE PISO","PISO DE GRANITINA","M2",null,0]
["F","u.","REVESTIMENTO DE PISO","PISO LAMINADO","M2",{"$f":"Orçamento!T326","v":326.88},163.44]
["","u.","REVESTIMENTO DE PISO","PISO DE CONCRETO DESEMPENADO","M2",{"$f":"SUMIF(Orçamento!$R$21:$R$550,'Parc Maior Relev'!D28,Orçamento!$T$21:$T$550)","v":0},0]
["","u.","REVESTIMENTO DE PISO","PISO CERÂMICO","M2",{"$f":"SUMIF(Orçamento!$R$21:$R$550,'Parc Maior Relev'!D29,Orçamento!$T$21:$T$550)","v":0},0]
["","y.","PINTURA","PINTURA","M2",{"$f":"SUMIF(Orçamento!$R$21:$R$550,'Parc Maior Relev'!D30,Orçamento!$T$21:$T$550)","v":0},0]
["F"]
["F","(*) Para os fins do inciso I dp § 1º do Art. 30 da Lei Federal 8.666/93, são consideradas parcelas de maior relevância técnica as execuções apresentadas"]
["F"]