{"text_format":"1","workbook":"xlsx","n_sheets":8,"sheets":["Orçamento","Resumo ","Somatório","Cronog_90_Dias","Composição BDI","Relatório CENTRAL","Parc Maior Relev","Composições"],"not_rendered":{"charts":0,"images":3,"macros":1,"external_links":1,"defined_names":105,"comments":2,"pivot_tables":0},"unopened":[],"bounds":{"document_bytes":16777216,"sheet_cells":100000,"rows_first":2000,"rows_last":500,"rows_between":2000,"halvings":0,"cell_chars":16384,"cell_head_chars":4096},"cells_cut":0,"cells_raw":0,"read":"whole","date_system":"1900"}

{"sheet":"Orçamento","index":0,"n_rows":614,"n_cols":27,"rows_kept":614,"cut":false,"hidden":false,"merged":[[601,18,601,22],[602,15,602,17],[602,18,602,22],[603,15,603,17],[603,18,603,22],[9,24,9,25],[8,23,8,25],[595,18,595,22],[596,15,596,17],[596,18,596,22],[597,15,597,17],[597,18,597,22],[592,15,592,17],[592,18,592,22],[593,15,593,17],[593,18,593,22],[594,15,594,17],[594,18,594,22],[588,14,588,26],[589,18,589,22],[590,15,590,17],[590,18,590,22],[607,23,607,25],[608,23,608,25],[609,23,609,25],[610,23,610,25],[611,23,611,25],[612,23,612,25],[613,23,613,25],[582,14,582,17],[589,15,589,17],[610,18,610,22],[598,15,598,17],[598,18,598,22],[599,15,599,17],[599,18,599,22],[600,15,600,17],[600,18,600,22],[604,15,604,17],[604,18,604,22],[605,15,605,17],[605,18,605,22],[606,15,606,17],[595,15,595,17],[606,18,606,22],[601,15,601,17],[613,18,613,22],[610,14,610,17],[607,15,607,17],[607,18,607,22],[608,15,608,17],[608,18,608,22],[609,15,609,17],[609,18,609,22],[612,18,612,22],[611,18,611,22],[591,15,591,17],[591,18,591,22],[546,16,546,24],[547,16,547,24],[548,16,548,24],[10,14,10,26],[13,14,13,26],[2,14,2,22],[3,14,3,22],[5,18,5,22],[6,18,6,22],[11,18,11,22],[12,18,12,22],[6,14,6,17],[5,14,5,17],[3,23,3,25],[2,23,2,25],[5,23,5,25],[6,23,6,25],[550,16,550,24],[8,18,8,20],[568,15,568,17],[569,15,569,17],[571,15,571,17],[572,15,572,17],[573,15,573,17],[574,15,574,17],[575,15,575,17],[549,16,549,24],[539,23,539,24],[540,23,540,24],[555,23,555,25],[571,23,571,25],[572,23,572,25],[555,15,555,17],[581,15,581,17],[554,14,554,26],[538,17,543,17],[555,18,555,22],[556,18,556,22],[564,18,564,22],[565,18,565,22],[566,18,566,22],[567,18,567,22],[579,18,579,22],[576,15,576,17],[556,15,556,17],[557,15,557,17],[558,15,558,17],[559,15,559,17],[560,15,560,17],[561,15,561,17],[562,15,562,17],[563,15,563,17],[564,15,564,17],[573,23,573,25],[574,23,574,25],[575,23,575,25],[570,15,570,17],[585,18,585,22],[561,18,561,22],[562,18,562,22],[560,18,560,22],[569,18,569,22],[551,18,551,24],[557,18,557,22],[558,18,558,22],[559,18,559,22],[582,18,582,22],[580,18,580,22],[581,18,581,22],[571,18,571,22],[578,18,578,22],[574,18,574,22],[576,18,576,22],[572,18,572,22],[573,18,573,22],[582,23,582,25],[576,23,576,25],[577,23,577,25],[578,23,578,25],[579,23,579,25],[580,23,580,25],[584,18,584,22],[0,14,0,24],[8,14,8,16],[9,14,9,16],[11,14,11,16],[12,14,12,16],[14,14,14,24],[1,14,1,24],[4,14,4,24],[7,14,7,24],[568,18,568,22],[565,15,565,17],[566,15,566,17],[567,15,567,17],[577,18,577,22],[575,18,575,22],[538,23,538,24],[583,18,583,22],[570,18,570,22],[563,18,563,22],[577,15,577,17],[578,15,578,17],[579,15,579,17],[580,15,580,17],[604,23,604,25],[605,23,605,25],[606,23,606,25],[589,23,589,25],[590,23,590,25],[591,23,591,25],[592,23,592,25],[593,23,593,25],[594,23,594,25],[595,23,595,25],[596,23,596,25],[597,23,597,25],[598,23,598,25],[599,23,599,25],[600,23,600,25],[601,23,601,25],[602,23,602,25],[603,23,603,25],[6,12,6,13],[5,12,5,13],[12,23,12,25],[11,23,11,25],[9,19,9,22],[583,23,583,25],[584,23,584,25],[585,23,585,25],[581,23,581,25],[556,23,556,25],[557,23,557,25],[558,23,558,25],[559,23,559,25],[560,23,560,25],[561,23,561,25],[562,23,562,25],[563,23,563,25],[564,23,564,25],[565,23,565,25],[566,23,566,25],[567,23,567,25],[568,23,568,25],[569,23,569,25],[570,23,570,25]]}
[]
[]
[null,null,null,null,null,null,null,null,null,null,null,null,null,null,"UNIDADE ESCOLAR",null,null,null,null,null,null,null,null,"CÓDIGO INEP"]
[null,null,null,null,null,null,null,null,null,null,null,null,{"$f":"IF($M$7=\"MANUAL\",\"DESPROTEJA A PLANILHA PARA FORMATAR\",\"\")","v":""},null,"CENTRO DE ENSINO EM PERÍODO INTEGRAL SÃO SEBASTIÃO",null,null,null,null,null,null,null,null,52030180]
[]
["Nmax",null,null,null,null,null,null,null,null,null,null,null,null,null,"OBRA",null,null,null,"DATA",null,null,null,null,"CIDADE"]
[{"$f":"MAX($C$18:$C$538)","v":4},null,null,null,null,null,null,null,null,null,null,null,null,null,"AMPLIAÇÃO/REFORMA",null,null,null,"2020-05-15",null,null,null,null,"SÃO LUÍS DE MONTES BELOS"]
[]
[null,null,null,null,null,null,null,null,null,null,null,null,null,null,"CRE",null,null,"ENDEREÇO","REFERÊNCIA AGETOP",null,null,null,null,"REFERÊNCIA SINAPI"]
[null,null,null,null,null,null,null,null,null,null,null,null,null,null,"CRE-SÃO L. M. BELOS",null,null," RUA 02 , VILA CANAA , CEP: 7610-000","ABR/19","DESONERADA",null,null,null,"MAR/20","DESONERADA"]
[]
[null,null,null,null,null,null,null,null,null,null,null,null,null,null,"ÁREA EXISTENTE (M²)",null,null,"ÁREA A CONSTRUIR (M²)","ÁREA A DEMOLIR (M²)",null,null,null,null,"ÁREA TOTAL CONSTRUÍDA (M²)"]
[null,null,null,null,null,null,null,null,null,null,null,null,null,null,1718.9,null,null,58.28,null,null,null,null,null,1777.18]
[]
[null,null,null,null,null,null,null,null,null,null,null,"FILTRO",null,null,"PLANILHA ORÇAMENTÁRIA"]
["Nível E","Save Nivel","Nível C","Altura","n1","n2","n3","n4","n5","Czero","Cnível","↓","Nível","Nível Corrigido","ITEM","TABELA","CODIGO","DESCRIÇÃO DOS SERVIÇOS","UNID","QUANT","REPET","QUANT TOTAL","MAT","MO","T.SERVIÇO UNIT","VALOR TOTAL","OBSERVAÇÕES¹"]
[{"$f":"CHOOSE(1+LOG(1+2*(ORÇAMENTO.Nivel=\"Nível 1\")+4*(ORÇAMENTO.Nivel=\"Nível 2\")+8*(ORÇAMENTO.Nivel=\"Nível 3\")+16*(ORÇAMENTO.Nivel=\"Nível 4\")+32*(ORÇAMENTO.Nivel=\"Serviço\"),2),0,1,2,3,4,\"S\")","v":"S"},{"$f":"IF(OR(C17=\"s\",C17=0),OFFSET(B17,-1,0),C17)","v":"Save Nivel"},{"$f":"IF(OFFSET(C17,-1,0)=\"L\",1,IF(OFFSET(C17,-1,0)=1,2,IF(OR(A17=\"s\",A17=0),\"S\",IF(AND(OFFSET(C17,-1,0)=2,A17=4),3,IF(AND(OR(OFFSET(C17,-1,0)=\"s\",OFFSET(C17,-1,0)=0),A17<>\"s\",A17>OFFSET(B17,-1,0)),OFFSET(B17,-1,0),A17)))))","v":"S"},{"$f":"IF(OR(C17=\"S\",C17=0),0,IF(ISERROR(K17),J17,SMALL(J17:K17,1)))","v":0},{"$f":"IF($C17=1,OFFSET(E17,-1,0)+1,OFFSET(E17,-1,0))","v":"n1"},{"$f":"IF($C17=1,0,IF($C17=2,OFFSET(F17,-1,0)+1,OFFSET(F17,-1,0)))","v":"n2"},{"$f":"IF(AND($C17<=2,$C17<>0),0,IF($C17=3,OFFSET(G17,-1,0)+1,OFFSET(G17,-1,0)))","v":"n3"},{"$f":"IF(AND($C17<=3,$C17<>0),0,IF($C17=4,OFFSET(H17,-1,0)+1,OFFSET(H17,-1,0)))","v":"n4"},{"$f":"IF(AND($C17<=4,$C17<>0),0,IF(AND($C17=\"S\",$Y17>0),OFFSET(I17,-1,0)+1,OFFSET(I17,-1,0)))","v":"n5"},{"$f":"IF(OR($C17=\"S\",$C17=0),0,MATCH(0,OFFSET($D17,1,$C17,ROW($C$538)-ROW($C17)),0))","v":0},{"$f":"IF(OR($C17=\"S\",$C17=0),0,MATCH(OFFSET($D17,0,$C17)+1,OFFSET($D17,1,$C17,ROW($C$538)-ROW($C17)),0))","v":0},{"$f":"IF(OR(Y17>0,$C17=1),\"F\",\"\")","v":""},"Serviço",{"$f":"CHOOSE(1+LOG(1+2*(C17=1)+4*(C17=2)+8*(C17=3)+16*(C17=4)+32*(C17=\"S\"),2),\"\",\"Nível 1\",\"Nível 2\",\"Nível 3\",\"Nível 4\",\"Serviço\")","v":"Serviço"},"-","SINAPI",null,"(sem código)","-",null,"REPET","-",0,0,0,"-",""]
[0,null,"L",{"$f":"COUNTA(OFFSET(D18,1,0):D$538)","v":519},{"$f":"LEFT(O19,1)-1","v":0},null,null,null,null,null,null,"F","LOTE","LOTE","AMPLIAÇÃO/REFORMA - CENTRO DE ENSINO EM PERÍODO INTEGRAL SÃO SEBASTIÃO",null,null,null,null,null,null,null,null,null,null,0]
[{"$f":"CHOOSE(1+LOG(1+2*(ORÇAMENTO.Nivel=\"Nível 1\")+4*(ORÇAMENTO.Nivel=\"Nível 2\")+8*(ORÇAMENTO.Nivel=\"Nível 3\")+16*(ORÇAMENTO.Nivel=\"Nível 4\")+32*(ORÇAMENTO.Nivel=\"Serviço\"),2),0,1,2,3,4,\"S\")","v":1},{"$f":"IF(OR(C19=\"s\",C19=0),OFFSET(B19,-1,0),C19)","v":1},{"$f":"IF(OFFSET(C19,-1,0)=\"L\",1,IF(OFFSET(C19,-1,0)=1,2,IF(OR(A19=\"s\",A19=0),\"S\",IF(AND(OFFSET(C19,-1,0)=2,A19=4),3,IF(AND(OR(OFFSET(C19,-1,0)=\"s\",OFFSET(C19,-1,0)=0),A19<>\"s\",A19>OFFSET(B19,-1,0)),OFFSET(B19,-1,0),A19)))))","v":1},{"$f":"IF(OR(C19=\"S\",C19=0),0,IF(ISERROR(K19),J19,SMALL(J19:K19,1)))","v":344},{"$f":"IF($C19=1,OFFSET(E19,-1,0)+1,OFFSET(E19,-1,0))","v":1},{"$f":"IF($C19=1,0,IF($C19=2,OFFSET(F19,-1,0)+1,OFFSET(F19,-1,0)))","v":0},{"$f":"IF(AND($C19<=2,$C19<>0),0,IF($C19=3,OFFSET(G19,-1,0)+1,OFFSET(G19,-1,0)))","v":0},{"$f":"IF(AND($C19<=3,$C19<>0),0,IF($C19=4,OFFSET(H19,-1,0)+1,OFFSET(H19,-1,0)))","v":0},{"$f":"IF(AND($C19<=4,$C19<>0),0,IF(AND($C19=\"S\",$Y19>0),OFFSET(I19,-1,0)+1,OFFSET(I19,-1,0)))","v":0},{"$f":"IF(OR($C19=\"S\",$C19=0),0,MATCH(0,OFFSET($D19,1,$C19,ROW($C$538)-ROW($C19)),0))","v":519},{"$f":"IF(OR($C19=\"S\",$C19=0),0,MATCH(OFFSET($D19,0,$C19)+1,OFFSET($D19,1,$C19,ROW($C$538)-ROW($C19)),0))","v":344},{"$f":"IF(OR(Y19>0,$C19=1),\"F\",\"\")","v":"F"},"Nível 1",{"$f":"CHOOSE(1+LOG(1+2*(C19=1)+4*(C19=2)+8*(C19=3)+16*(C19=4)+32*(C19=\"S\"),2),\"\",\"Nível 1\",\"Nível 2\",\"Nível 3\",\"Nível 4\",\"Serviço\")","v":"Nível 1"},"1.","AGETOP",null,"AMPLIAÇÃO/REFORMA","UN",1,1,1,null,null,0,0]
[{"$f":"CHOOSE(1+LOG(1+2*(ORÇAMENTO.Nivel=\"Nível 1\")+4*(ORÇAMENTO.Nivel=\"Nível 2\")+8*(ORÇAMENTO.Nivel=\"Nível 3\")+16*(ORÇAMENTO.Nivel=\"Nível 4\")+32*(ORÇAMENTO.Nivel=\"Serviço\"),2),0,1,2,3,4,\"S\")","v":2},2,2,37,1,1,0,0,0,343,37,"","Nível 2","Nível 2","-","AGETOP",null,"SERVIÇOS PRELIMINARES","-",null,1,"-",null,null,0,0]
[{"$f":"CHOOSE(1+LOG(1+2*(ORÇAMENTO.Nivel=\"Nível 1\")+4*(ORÇAMENTO.Nivel=\"Nível 2\")+8*(ORÇAMENTO.Nivel=\"Nível 3\")+16*(ORÇAMENTO.Nivel=\"Nível 4\")+32*(ORÇAMENTO.Nivel=\"Serviço\"),2),0,1,2,3,4,\"S\")","v":3},3,3,36,1,1,1,0,0,36,47,"","Nível 3","Nível 3","-","SINAPI",null,"OUTROS","-",null,1,"-",0,0,0,0,""]
[{"$f":"CHOOSE(1+LOG(1+2*(ORÇAMENTO.Nivel=\"Nível 1\")+4*(ORÇAMENTO.Nivel=\"Nível 2\")+8*(ORÇAMENTO.Nivel=\"Nível 3\")+16*(ORÇAMENTO.Nivel=\"Nível 4\")+32*(ORÇAMENTO.Nivel=\"Serviço\"),2),0,1,2,3,4,\"S\")","v":4},4,4,3,1,1,1,1,0,35,3,"","Nível 4","Nível 4","-","SINAPI",null,"02 - ACESSIBILIDADE RAMPAS","-",null,1,"-",0,0,0,0,""]
[{"$f":"CHOOSE(1+LOG(1+2*(ORÇAMENTO.Nivel=\"Nível 1\")+4*(ORÇAMENTO.Nivel=\"Nível 2\")+8*(ORÇAMENTO.Nivel=\"Nível 3\")+16*(ORÇAMENTO.Nivel=\"Nível 4\")+32*(ORÇAMENTO.Nivel=\"Serviço\"),2),0,1,2,3,4,\"S\")","v":"S"},4,"S",0,1,1,1,1,0,0,0,"","Serviço","Serviço","-","COMPOSIÇÃO","COMP 010_SEE","DEMOLIÇÃO DE GRADE/GRELHA/CORRIMÃO/GUARDA CORPO - METÁLICO","M2",null,1,"-",null,null,0,0,""]
[{"$f":"CHOOSE(1+LOG(1+2*(ORÇAMENTO.Nivel=\"Nível 1\")+4*(ORÇAMENTO.Nivel=\"Nível 2\")+8*(ORÇAMENTO.Nivel=\"Nível 3\")+16*(ORÇAMENTO.Nivel=\"Nível 4\")+32*(ORÇAMENTO.Nivel=\"Serviço\"),2),0,1,2,3,4,\"S\")","v":"S"},4,"S",0,1,1,1,1,0,0,0,"","Serviço","Serviço","-","AGETOP",20118,"DEM.ALVEN.TIJOLO S/REAP. C/TR.ATE CB. E CARGA","m3    ",null,1,"-",null,null,0,0,""]
[4,4,4,2,1,1,1,2,0,32,2,"","Nível 4","Nível 4","-","SINAPI",null,"03 - ACESSIBILIDADE CALÇADA E PASSEIO","-",null,1,"-",null,null,0,0,""]
["S",4,"S",0,1,1,1,2,0,0,0,"","Serviço","Serviço","-","AGETOP",20121,"DEM. MANUAL EM CONCR.SIMPLES C/TR.ATE CB.E CARGA (O.C.)","m3    ",null,1,"-",null,null,0,0,""]
[4,4,4,3,1,1,1,3,0,30,3,"","Nível 4","Nível 4","-","SINAPI",null,"05 - CENTRAL DE GÁS","-",null,1,"-",null,null,0,0,""]
["S",4,"S",0,1,1,1,3,0,0,0,"","Serviço","Serviço","-","AGETOP",20118,"DEM.ALVEN.TIJOLO S/REAP. C/TR.ATE CB. E CARGA","m3    ",null,1,"-",null,null,0,0,""]
["S",4,"S",0,1,1,1,3,0,0,0,"","Serviço","Serviço","-","AGETOP",20106,"RETIRADA DE JANELAS OU PORTAIS C/ TRANSP. ATÉ CB. E CARGA","m2    ",null,1,"-",null,null,0,0,""]
[4,4,4,5,1,1,1,4,0,27,5,"","Nível 4","Nível 4","-","SINAPI",null,"06 - IMPLANTAÇÃO COZINHA","-",null,1,"-",null,null,0,0,""]
["S",4,"S",0,1,1,1,4,0,0,0,"","Serviço","Serviço","-","AGETOP",20121,"DEM. MANUAL EM CONCR.SIMPLES C/TR.ATE CB.E CARGA (O.C.)","m3    ",null,1,"-",null,null,0,0,""]
["S",4,"S",0,1,1,1,4,0,0,0,"","Serviço","Serviço","-","SINAPI",98533,"PODA EM ALTURA DE ÁRVORE COM DIÂMETRO DE TRONCO MAIOR OU IGUAL A 0,20 M E MENOR QUE 0,40 M.AF_05/2018","UN",null,1,"-",null,null,0,0,""]
["S",4,"S",0,1,1,1,4,0,0,0,"","Serviço","Serviço","-","SINAPI",98529,"CORTE RASO E RECORTE DE ÁRVORE COM DIÂMETRO DE TRONCO MAIOR OU IGUAL A 0,20 M E MENOR QUE 0,40 M.AF_05/2018","UN",null,1,"-",null,null,0,0,""]
["S",4,"S",0,1,1,1,4,0,0,0,"","Serviço","Serviço","-","SINAPI",98526,"REMOÇÃO DE RAÍZES REMANESCENTES DE TRONCO DE ÁRVORE COM DIÂMETRO MAIOR OU IGUAL A 0,20 M E MENOR QUE 0,40 M.AF_05/2018","UN",null,1,"-",null,null,0,0,""]
[4,4,4,6,1,1,1,5,0,22,6,"","Nível 4","Nível 4","-","SINAPI",null,"07 - ADEQUAÇÃO ADMINISTRATIVO","-",null,1,"-",null,null,0,0,""]
["S",4,"S",0,1,1,1,5,0,0,0,"","Serviço","Serviço","-","COMPOSIÇÃO","COMP 010_SEE","DEMOLIÇÃO DE GRADE/GRELHA/CORRIMÃO/GUARDA CORPO - METÁLICO","M2",null,1,"-",null,null,0,0,""]
["S",4,"S",0,1,1,1,5,0,0,0,"","Serviço","Serviço","-","AGETOP",20163,"DEMOLIÇÃO DAS INSTALAÇÕES HIDROSANITÁRIAS E AFINS C/ TRANSP. ATÉ CB. E CARGA","H     ",null,1,"-",null,null,0,0,""]
["S",4,"S",0,1,1,1,5,0,0,0,"","Serviço","Serviço","-","AGETOP",20139,"DEMOLIÇAO DE BANCADAS C/ TRANSP. ATÉ CB. E CARGA","m2    ",null,1,"-",null,null,0,0,""]
["S",4,"S",0,1,1,1,5,0,0,0,"","Serviço","Serviço","-","AGETOP",20118,"DEM.ALVEN.TIJOLO S/REAP. C/TR.ATE CB. E CARGA","m3    ",null,1,"-",null,null,0,0,""]
["S",4,"S",0,1,1,1,5,0,0,0,"","Serviço","Serviço","-","AGETOP",20115,"DEMOLIÇÃO DE REVESTIMENTOS COM AZULEJOS C/TRANSP.ATE CB. E CARGA","m2    ",null,1,"-",null,null,0,0,""]
[4,{"$f":"IF(OR(C41=\"s\",C41=0),OFFSET(B41,-1,0),C41)","v":4},{"$f":"IF(OFFSET(C41,-1,0)=\"L\",1,IF(OFFSET(C41,-1,0)=1,2,IF(OR(A41=\"s\",A41=0),\"S\",IF(AND(OFFSET(C41,-1,0)=2,A41=4),3,IF(AND(OR(OFFSET(C41,-1,0)=\"s\",OFFSET(C41,-1,0)=0),A41<>\"s\",A41>OFFSET(B41,-1,0)),OFFSET(B41,-1,0),A41)))))","v":4},{"$f":"IF(OR(C41=\"S\",C41=0),0,IF(ISERROR(K41),J41,SMALL(J41:K41,1)))","v":5},{"$f":"IF($C41=1,OFFSET(E41,-1,0)+1,OFFSET(E41,-1,0))","v":1},{"$f":"IF($C41=1,0,IF($C41=2,OFFSET(F41,-1,0)+1,OFFSET(F41,-1,0)))","v":1},{"$f":"IF(AND($C41<=2,$C41<>0),0,IF($C41=3,OFFSET(G41,-1,0)+1,OFFSET(G41,-1,0)))","v":1},{"$f":"IF(AND($C41<=3,$C41<>0),0,IF($C41=4,OFFSET(H41,-1,0)+1,OFFSET(H41,-1,0)))","v":6},{"$f":"IF(AND($C41<=4,$C41<>0),0,IF(AND($C41=\"S\",$Y41>0),OFFSET(I41,-1,0)+1,OFFSET(I41,-1,0)))","v":0},16,5,{"$f":"IF(OR(Y41>0,$C41=1),\"F\",\"\")","v":""},"Nível 4",{"$f":"CHOOSE(1+LOG(1+2*(C41=1)+4*(C41=2)+8*(C41=3)+16*(C41=4)+32*(C41=\"S\"),2),\"\",\"Nível 1\",\"Nível 2\",\"Nível 3\",\"Nível 4\",\"Serviço\")","v":"Nível 4"},"-","SINAPI",null,"09 - REFORMA SANITÁRIOS FEM E MASC.","-",null,1,"-",null,null,0,0,""]
["S",4,"S",0,1,1,1,6,0,0,0,"","Serviço","Serviço","-","AGETOP",20111,"DEM.PISO CERAM.SOBRE LASTRO CONC.C/TR.CB.E CARGA","m2    ",null,1,"-",null,null,0,0,""]
[{"$f":"CHOOSE(1+LOG(1+2*(ORÇAMENTO.Nivel=\"Nível 1\")+4*(ORÇAMENTO.Nivel=\"Nível 2\")+8*(ORÇAMENTO.Nivel=\"Nível 3\")+16*(ORÇAMENTO.Nivel=\"Nível 4\")+32*(ORÇAMENTO.Nivel=\"Serviço\"),2),0,1,2,3,4,\"S\")","v":"S"},4,"S",0,1,1,1,6,{"$f":"IF(AND($C43<=4,$C43<>0),0,IF(AND($C43=\"S\",$Y43>0),OFFSET(I43,-1,0)+1,OFFSET(I43,-1,0)))","v":0},0,0,"","Serviço","Serviço","-","AGETOP",20137,"DEMOLIÇAO BACIA SANITARIA C/ TRANSP. ATÉ CB. E CARGA","Un    ",null,1,"-",null,null,0,0,""]
[{"$f":"CHOOSE(1+LOG(1+2*(ORÇAMENTO.Nivel=\"Nível 1\")+4*(ORÇAMENTO.Nivel=\"Nível 2\")+8*(ORÇAMENTO.Nivel=\"Nível 3\")+16*(ORÇAMENTO.Nivel=\"Nível 4\")+32*(ORÇAMENTO.Nivel=\"Serviço\"),2),0,1,2,3,4,\"S\")","v":"S"},4,"S",0,1,1,1,6,{"$f":"IF(AND($C44<=4,$C44<>0),0,IF(AND($C44=\"S\",$Y44>0),OFFSET(I44,-1,0)+1,OFFSET(I44,-1,0)))","v":0},0,0,"","Serviço","Serviço","-","AGETOP",20140,"DEMOLIÇAO DE VÁLVULA DE DESCARGA C/ TRANSP. ATÉ CB. E CARGA","Un    ",null,1,"-",null,null,0,0,""]
[{"$f":"CHOOSE(1+LOG(1+2*(ORÇAMENTO.Nivel=\"Nível 1\")+4*(ORÇAMENTO.Nivel=\"Nível 2\")+8*(ORÇAMENTO.Nivel=\"Nível 3\")+16*(ORÇAMENTO.Nivel=\"Nível 4\")+32*(ORÇAMENTO.Nivel=\"Serviço\"),2),0,1,2,3,4,\"S\")","v":"S"},4,"S",0,1,1,1,6,{"$f":"IF(AND($C45<=4,$C45<>0),0,IF(AND($C45=\"S\",$Y45>0),OFFSET(I45,-1,0)+1,OFFSET(I45,-1,0)))","v":0},0,0,"","Serviço","Serviço","-","AGETOP",20163,"DEMOLIÇÃO DAS INSTALAÇÕES HIDROSANITÁRIAS E AFINS C/ TRANSP. ATÉ CB. E CARGA","H     ",null,1,"-",null,null,0,0,""]
[4,4,4,2,1,1,1,7,0,11,2,"","Nível 4","Nível 4","-","SINAPI",null,"COMP. HIDROSSANITÁRIO","-",null,1,"-",null,null,0,0,""]
["S",4,"S",0,1,1,1,7,0,0,0,"","Serviço","Serviço","-","AGETOP",20121,"DEM. MANUAL EM CONCR.SIMPLES C/TR.ATE CB.E CARGA (O.C.)","m3    ",null,1,"-",null,null,0,0,""]
[4,4,4,2,1,1,1,8,0,9,2,"","Nível 4","Nível 4","-","SINAPI",null,"COMP. GÁS","-",null,1,"-",null,null,0,0,""]
["S",4,"S",0,1,1,1,8,0,0,0,"","Serviço","Serviço","-","AGETOP",20121,"DEM. MANUAL EM CONCR.SIMPLES C/TR.ATE CB.E CARGA (O.C.)","m3    ",null,1,"-",null,null,0,0,""]
[{"$f":"CHOOSE(1+LOG(1+2*(ORÇAMENTO.Nivel=\"Nível 1\")+4*(ORÇAMENTO.Nivel=\"Nível 2\")+8*(ORÇAMENTO.Nivel=\"Nível 3\")+16*(ORÇAMENTO.Nivel=\"Nível 4\")+32*(ORÇAMENTO.Nivel=\"Serviço\"),2),0,1,2,3,4,\"S\")","v":4},4,4,3,1,1,1,9,{"$f":"IF(AND($C50<=4,$C50<>0),0,IF(AND($C50=\"S\",$Y50>0),OFFSET(I50,-1,0)+1,OFFSET(I50,-1,0)))","v":0},7,3,"","Nível 4","Nível 4","-","SINAPI",null,"13 - PISO","-",null,1,"-",null,null,0,0,""]
[{"$f":"CHOOSE(1+LOG(1+2*(ORÇAMENTO.Nivel=\"Nível 1\")+4*(ORÇAMENTO.Nivel=\"Nível 2\")+8*(ORÇAMENTO.Nivel=\"Nível 3\")+16*(ORÇAMENTO.Nivel=\"Nível 4\")+32*(ORÇAMENTO.Nivel=\"Serviço\"),2),0,1,2,3,4,\"S\")","v":"S"},4,"S",0,1,1,1,9,{"$f":"IF(AND($C51<=4,$C51<>0),0,IF(AND($C51=\"S\",$Y51>0),OFFSET(I51,-1,0)+1,OFFSET(I51,-1,0)))","v":0},{"$f":"IF(OR($C51=\"S\",$C51=0),0,MATCH(0,OFFSET($D51,1,$C51,ROW($C$538)-ROW($C51)),0))","v":0},{"$f":"IF(OR($C51=\"S\",$C51=0),0,MATCH(OFFSET($D51,0,$C51)+1,OFFSET($D51,1,$C51,ROW($C$538)-ROW($C51)),0))","v":0},"","Serviço","Serviço","-","AGETOP",20121,"DEM. MANUAL EM CONCR.SIMPLES C/TR.ATE CB.E CARGA (O.C.)","m3    ",null,1,"-",null,null,0,0,""]
[{"$f":"CHOOSE(1+LOG(1+2*(ORÇAMENTO.Nivel=\"Nível 1\")+4*(ORÇAMENTO.Nivel=\"Nível 2\")+8*(ORÇAMENTO.Nivel=\"Nível 3\")+16*(ORÇAMENTO.Nivel=\"Nível 4\")+32*(ORÇAMENTO.Nivel=\"Serviço\"),2),0,1,2,3,4,\"S\")","v":"S"},4,"S",0,1,1,1,9,{"$f":"IF(AND($C52<=4,$C52<>0),0,IF(AND($C52=\"S\",$Y52>0),OFFSET(I52,-1,0)+1,OFFSET(I52,-1,0)))","v":0},0,0,"","Serviço","Serviço","-","AGETOP",20111,"DEM.PISO CERAM.SOBRE LASTRO CONC.C/TR.CB.E CARGA","m2    ",null,1,"-",null,null,0,0,""]
[{"$f":"CHOOSE(1+LOG(1+2*(ORÇAMENTO.Nivel=\"Nível 1\")+4*(ORÇAMENTO.Nivel=\"Nível 2\")+8*(ORÇAMENTO.Nivel=\"Nível 3\")+16*(ORÇAMENTO.Nivel=\"Nível 4\")+32*(ORÇAMENTO.Nivel=\"Serviço\"),2),0,1,2,3,4,\"S\")","v":4},4,4,2,1,1,1,10,{"$f":"IF(AND($C53<=4,$C53<>0),0,IF(AND($C53=\"S\",$Y53>0),OFFSET(I53,-1,0)+1,OFFSET(I53,-1,0)))","v":0},4,2,"","Nível 4","Nível 4","-","SINAPI",null,"14 - COBERTURA","-",null,1,"-",null,null,0,0,""]
[{"$f":"CHOOSE(1+LOG(1+2*(ORÇAMENTO.Nivel=\"Nível 1\")+4*(ORÇAMENTO.Nivel=\"Nível 2\")+8*(ORÇAMENTO.Nivel=\"Nível 3\")+16*(ORÇAMENTO.Nivel=\"Nível 4\")+32*(ORÇAMENTO.Nivel=\"Serviço\"),2),0,1,2,3,4,\"S\")","v":"S"},4,"S",0,1,1,1,10,{"$f":"IF(AND($C54<=4,$C54<>0),0,IF(AND($C54=\"S\",$Y54>0),OFFSET(I54,-1,0)+1,OFFSET(I54,-1,0)))","v":0},0,0,"","Serviço","Serviço","-","AGETOP",20102,"DEMOLICAO-COBERTURA TELHA FIBROCIMENTO/FIBRA DE VIDRO/SIMILARES C/ TRANSP. ATÉ CB. E CARGA","m2    ",null,1,"-",null,null,0,0,""]
[4,4,4,2,1,1,1,11,0,2,{"$error":"#N/A"},"","Nível 4","Nível 4","-","SINAPI",null,"PLACAS","-",null,1,"-",null,null,0,0,""]
["S",4,"S",0,1,1,1,11,0,0,0,"","Serviço","Serviço","-","AGETOP",21301,"PLACA DE OBRA PLOTADA EM CHAPA METÁLICA 26 , AFIXADA EM CAVALETES DE MADEIRA DE LEI (VIGOTAS 6X12CM) - PADRÃO GOINFRA","m2    ",null,1,"-",null,null,0,0,""]
[{"$f":"CHOOSE(1+LOG(1+2*(ORÇAMENTO.Nivel=\"Nível 1\")+4*(ORÇAMENTO.Nivel=\"Nível 2\")+8*(ORÇAMENTO.Nivel=\"Nível 3\")+16*(ORÇAMENTO.Nivel=\"Nível 4\")+32*(ORÇAMENTO.Nivel=\"Serviço\"),2),0,1,2,3,4,\"S\")","v":2},{"$f":"IF(OR(C57=\"s\",C57=0),OFFSET(B57,-1,0),C57)","v":2},{"$f":"IF(OFFSET(C57,-1,0)=\"L\",1,IF(OFFSET(C57,-1,0)=1,2,IF(OR(A57=\"s\",A57=0),\"S\",IF(AND(OFFSET(C57,-1,0)=2,A57=4),3,IF(AND(OR(OFFSET(C57,-1,0)=\"s\",OFFSET(C57,-1,0)=0),A57<>\"s\",A57>OFFSET(B57,-1,0)),OFFSET(B57,-1,0),A57)))))","v":2},{"$f":"IF(OR(C57=\"S\",C57=0),0,IF(ISERROR(K57),J57,SMALL(J57:K57,1)))","v":3},{"$f":"IF($C57=1,OFFSET(E57,-1,0)+1,OFFSET(E57,-1,0))","v":1},{"$f":"IF($C57=1,0,IF($C57=2,OFFSET(F57,-1,0)+1,OFFSET(F57,-1,0)))","v":2},{"$f":"IF(AND($C57<=2,$C57<>0),0,IF($C57=3,OFFSET(G57,-1,0)+1,OFFSET(G57,-1,0)))","v":0},{"$f":"IF(AND($C57<=3,$C57<>0),0,IF($C57=4,OFFSET(H57,-1,0)+1,OFFSET(H57,-1,0)))","v":0},{"$f":"IF(AND($C57<=4,$C57<>0),0,IF(AND($C57=\"S\",$Y57>0),OFFSET(I57,-1,0)+1,OFFSET(I57,-1,0)))","v":0},306,3,{"$f":"IF(OR(Y57>0,$C57=1),\"F\",\"\")","v":""},"Nível 2",{"$f":"CHOOSE(1+LOG(1+2*(C57=1)+4*(C57=2)+8*(C57=3)+16*(C57=4)+32*(C57=\"S\"),2),\"\",\"Nível 1\",\"Nível 2\",\"Nível 3\",\"Nível 4\",\"Serviço\")","v":"Nível 2"},"-","AGETOP",null,"TRANSPORTES","-",null,1,"-",null,null,0,0,""]
["S",2,"S",0,1,2,0,0,0,0,0,"","Serviço","Serviço","-","SINAPI",72900,"TRANSPORTE DE ENTULHO COM CAMINHAO BASCULANTE 6 M3, RODOVIA PAVIMENTADA, DMT 0,5 A 1,0 KM","M3",null,1,"-",null,null,0,0,""]
["S",2,"S",0,1,2,0,0,0,0,0,"","Serviço","Serviço","-","SINAPI",72897,"CARGA MANUAL DE ENTULHO EM CAMINHAO BASCULANTE 6 M3","M3",null,1,"-",null,null,0,0,""]
[2,2,2,32,1,3,0,0,0,303,32,"","Nível 2","Nível 2","-","AGETOP",null,"SERVIÇO EM TERRA","-",null,1,"-",null,null,0,0,""]
[3,3,3,7,1,3,1,0,0,31,7,"","Nível 3","Nível 3","-",null,null,"AQUISIÇÃO DE TERRA (SOMENTE ATERRO)","-",null,1,"-",null,null,0,0,""]
[4,4,4,6,1,3,1,1,0,6,17,"","Nível 4","Nível 4","-","SINAPI",null,"06 - IMPLANTAÇÃO COZINHA","-",null,1,"-",null,null,0,0,""]
["S",4,"S",0,1,3,1,1,0,0,0,"","Serviço","Serviço","-","AGETOP",41004,"ESCAVACAO MECANICA","m3    ",null,1,"-",null,null,0,0,""]
["S",4,"S",0,1,3,1,1,0,0,0,"","Serviço","Serviço","-","AGETOP",41005,"CARGA MECANIZADA","m3    ",null,1,"-",null,null,0,0,""]
["S",4,"S",0,1,3,1,1,0,0,0,"","Serviço","Serviço","-","AGETOP",41012,"INDENIZAÇÃO DE JAZIDA","m3    ",null,1,"-",null,null,0,0,""]
[{"$f":"CHOOSE(1+LOG(1+2*(ORÇAMENTO.Nivel=\"Nível 1\")+4*(ORÇAMENTO.Nivel=\"Nível 2\")+8*(ORÇAMENTO.Nivel=\"Nível 3\")+16*(ORÇAMENTO.Nivel=\"Nível 4\")+32*(ORÇAMENTO.Nivel=\"Serviço\"),2),0,1,2,3,4,\"S\")","v":"S"},4,"S",0,1,3,1,1,0,0,0,"","Serviço","Serviço","-","AGETOP",41006,"TRANSPORTE DE MATERIAL ESCAVADO M3.KM","m3km  ",null,1,"-",null,null,0,0,""]
["S",4,"S",0,1,3,1,1,0,0,0,"","Serviço","Serviço","-","AGETOP",41009,"COMPACTAÇÃO MECÂNICA SEM CONTROLE LABORATÓRIO","m3    ",null,1,"-",null,null,0,0,""]
[3,3,3,8,1,3,2,0,0,24,8,"","Nível 3","Nível 3","-",null,null,"ATERRO + CORTE","-",null,1,"-",null,null,0,0,""]
[4,4,4,7,1,3,2,1,0,7,10,"","Nível 4","Nível 4","-","SINAPI",null,"02 - ACESSIBILIDADE RAMPAS","-",null,1,"-",null,null,0,0,""]
["S",4,"S",0,1,3,2,1,0,0,0,"","Serviço","Serviço","-","AGETOP",41004,"ESCAVACAO MECANICA","m3    ",null,1,"-",null,null,0,0,""]
["S",4,"S",0,1,3,2,1,0,0,0,"","Serviço","Serviço","-","AGETOP",41005,"CARGA MECANIZADA","m3    ",null,1,"-",null,null,0,0,""]
["S",4,"S",0,1,3,2,1,0,0,0,"","Serviço","Serviço","-","AGETOP",41012,"INDENIZAÇÃO DE JAZIDA","m3    ",null,1,"-",null,null,0,0,""]
["S",4,"S",0,1,3,2,1,0,0,0,"","Serviço","Serviço","-","AGETOP",41006,"TRANSPORTE DE MATERIAL ESCAVADO M3.KM","m3km  ",null,1,"-",null,null,0,0,""]
["S",4,"S",0,1,3,2,1,0,0,0,"","Serviço","Serviço","-","AGETOP",41010,"TRANSPORTE COM LÂMINA ATE 100 M - (OBRAS CIVIS)","m3    ",null,1,"-",null,null,0,0,""]
["S",4,"S",0,1,3,2,1,0,0,0,"","Serviço","Serviço","-","AGETOP",41009,"COMPACTAÇÃO MECÂNICA SEM CONTROLE LABORATÓRIO","m3    ",null,1,"-",null,null,0,0,""]
[3,3,3,16,1,3,3,0,0,16,127,"","Nível 3","Nível 3","-",null,null,"OUTROS SERVIÇOS","-",null,1,"-",null,null,0,0,""]
[4,4,4,2,1,3,3,1,0,15,2,"","Nível 4","Nível 4","-","SINAPI",null,"02 - ACESSIBILIDADE RAMPAS","-",null,1,"-",null,null,0,0,""]
["S",4,"S",0,1,3,3,1,0,0,0,"","Serviço","Serviço","-","AGETOP",41140,"REGULARIZAÇÃO DO TERRENO SEM APILOAMENTO COM TRANSPORTE MANUAL DA TERRA ESCAVADA ","m2    ",null,1,"-",null,null,0,0,""]
[4,4,4,2,1,3,3,2,0,13,2,"","Nível 4","Nível 4","-","SINAPI",null,"03 - ACESSIBILIDADE CALÇADA E PASSEIO","-",null,1,"-",null,null,0,0,""]
["S",4,"S",0,1,3,3,2,0,0,0,"","Serviço","Serviço","-","AGETOP",41140,"REGULARIZAÇÃO DO TERRENO SEM APILOAMENTO COM TRANSPORTE MANUAL DA TERRA ESCAVADA ","m2    ",null,1,"-",null,null,0,0,""]
[4,4,4,2,1,3,3,3,0,11,2,"","Nível 4","Nível 4","-","SINAPI",null,"06 - IMPLANTAÇÃO COZINHA","-",null,1,"-",null,null,0,0,""]
["S",4,"S",0,1,3,3,3,0,0,0,"","Serviço","Serviço","-","AGETOP",41140,"REGULARIZAÇÃO DO TERRENO SEM APILOAMENTO COM TRANSPORTE MANUAL DA TERRA ESCAVADA ","m2    ",null,1,"-",null,null,0,0,""]
[4,4,4,3,1,3,3,4,0,{"$f":"IF(OR($C83=\"S\",$C83=0),0,MATCH(0,OFFSET($D83,1,$C83,ROW($C$538)-ROW($C83)),0))","v":9},{"$f":"IF(OR($C83=\"S\",$C83=0),0,MATCH(OFFSET($D83,0,$C83)+1,OFFSET($D83,1,$C83,ROW($C$538)-ROW($C83)),0))","v":3},"","Nível 4","Nível 4","-","SINAPI",null,"COMP. HIDROSSANITÁRIO","-",null,1,"-",null,null,0,0,""]
["S",4,"S",0,1,3,3,4,0,0,0,"","Serviço","Serviço","-","AGETOP",40101,"ESCAVACAO MANUAL DE VALAS < 1 MTS. (OBRAS CIVIS)","m3    ",null,1,"-",null,null,0,0,""]
["S",4,"S",0,1,3,3,4,0,0,0,"","Serviço","Serviço","-","AGETOP",40902,"REATERRO COM APILOAMENTO","m3    ",null,1,"-",null,null,0,0,""]
[4,4,4,3,1,3,3,5,0,6,3,"","Nível 4","Nível 4","-","SINAPI",null,"COMP. GÁS","-",null,1,"-",null,null,0,0,""]
["S",4,"S",0,1,3,3,5,0,0,0,"","Serviço","Serviço","-","AGETOP",40101,"ESCAVACAO MANUAL DE VALAS < 1 MTS. (OBRAS CIVIS)","m3    ",null,1,"-",null,null,0,0,""]
["S",4,"S",0,1,3,3,5,0,0,0,"","Serviço","Serviço","-","AGETOP",40902,"REATERRO COM APILOAMENTO","m3    ",null,1,"-",null,null,0,0,""]
[{"$f":"CHOOSE(1+LOG(1+2*(ORÇAMENTO.Nivel=\"Nível 1\")+4*(ORÇAMENTO.Nivel=\"Nível 2\")+8*(ORÇAMENTO.Nivel=\"Nível 3\")+16*(ORÇAMENTO.Nivel=\"Nível 4\")+32*(ORÇAMENTO.Nivel=\"Serviço\"),2),0,1,2,3,4,\"S\")","v":4},4,4,3,1,3,3,6,0,3,{"$error":"#N/A"},"","Nível 4","Nível 4","-","SINAPI",null,"COMP. ELÉTRICO","-",null,1,"-",null,null,0,0,""]
["S",4,"S",0,1,3,3,6,0,0,0,"","Serviço","Serviço","-","AGETOP",40101,"ESCAVACAO MANUAL DE VALAS < 1 MTS. (OBRAS CIVIS)","m3    ",null,1,"-",null,null,0,0,""]
["S",4,"S",0,1,3,3,6,0,0,0,"","Serviço","Serviço","-","AGETOP",40902,"REATERRO COM APILOAMENTO","m3    ",null,1,"-",null,null,0,0,""]
[2,2,2,78,1,4,0,0,0,271,78,"","Nível 2","Nível 2","-",null,null,"INSTALAÇÕES ELÉTRICAS","-",null,1,"-",null,null,0,0,""]
[3,3,3,5,1,4,1,0,0,77,5,"","Nível 3","Nível 3","-","AGETOP",null,"SERV. PRELIMINARES","-",null,1,"-",null,null,0,0,""]
["S",3,"S",0,1,4,1,0,0,0,0,"","Serviço","Serviço","-","SINAPI",97661,"REMOÇÃO DE CABOS ELÉTRICOS, DE FORMA MANUAL, SEM REAPROVEITAMENTO. AF_12/2017","M",null,1,"-",null,null,0,0,""]
["S",3,"S",0,1,4,1,0,0,0,0,"","Serviço","Serviço","-","SINAPI",97660,"REMOÇÃO DE INTERRUPTORES/TOMADAS ELÉTRICAS, DE FORMA MANUAL, SEM REAPROVEITAMENTO. AF_12/2017","UN",null,1,"-",null,null,0,0,""]
["S",{"$f":"IF(OR(C96=\"s\",C96=0),OFFSET(B96,-1,0),C96)","v":3},{"$f":"IF(OFFSET(C96,-1,0)=\"L\",1,IF(OFFSET(C96,-1,0)=1,2,IF(OR(A96=\"s\",A96=0),\"S\",IF(AND(OFFSET(C96,-1,0)=2,A96=4),3,IF(AND(OR(OFFSET(C96,-1,0)=\"s\",OFFSET(C96,-1,0)=0),A96<>\"s\",A96>OFFSET(B96,-1,0)),OFFSET(B96,-1,0),A96)))))","v":"S"},{"$f":"IF(OR(C96=\"S\",C96=0),0,IF(ISERROR(K96),J96,SMALL(J96:K96,1)))","v":0},{"$f":"IF($C96=1,OFFSET(E96,-1,0)+1,OFFSET(E96,-1,0))","v":1},{"$f":"IF($C96=1,0,IF($C96=2,OFFSET(F96,-1,0)+1,OFFSET(F96,-1,0)))","v":4},{"$f":"IF(AND($C96<=2,$C96<>0),0,IF($C96=3,OFFSET(G96,-1,0)+1,OFFSET(G96,-1,0)))","v":1},{"$f":"IF(AND($C96<=3,$C96<>0),0,IF($C96=4,OFFSET(H96,-1,0)+1,OFFSET(H96,-1,0)))","v":0},0,0,0,{"$f":"IF(OR(Y96>0,$C96=1),\"F\",\"\")","v":""},"Serviço",{"$f":"CHOOSE(1+LOG(1+2*(C96=1)+4*(C96=2)+8*(C96=3)+16*(C96=4)+32*(C96=\"S\"),2),\"\",\"Nível 1\",\"Nível 2\",\"Nível 3\",\"Nível 4\",\"Serviço\")","v":"Serviço"},"-","SINAPI",97665,"REMOÇÃO DE LUMINÁRIAS, DE FORMA MANUAL, SEM REAPROVEITAMENTO. AF_12/2017","UN",null,1,"-",null,null,0,0,""]
[{"$f":"CHOOSE(1+LOG(1+2*(ORÇAMENTO.Nivel=\"Nível 1\")+4*(ORÇAMENTO.Nivel=\"Nível 2\")+8*(ORÇAMENTO.Nivel=\"Nível 3\")+16*(ORÇAMENTO.Nivel=\"Nível 4\")+32*(ORÇAMENTO.Nivel=\"Serviço\"),2),0,1,2,3,4,\"S\")","v":"S"},3,"S",0,1,4,1,0,{"$f":"IF(AND($C97<=4,$C97<>0),0,IF(AND($C97=\"S\",$Y97>0),OFFSET(I97,-1,0)+1,OFFSET(I97,-1,0)))","v":0},0,0,"","Serviço","Serviço","-","AGETOP",20162,"DEMOLIÇÃO DAS INSTALAÇÕES ELÉTRICAS E AFINS C/ TRANSP. ATÉ CB. E CARGA","H     ",null,1,"-",null,null,0,0,""]
[3,3,3,72,1,4,2,0,0,72,88,"","Nível 3","Nível 3","-",null,null,"INST.ELÉTRICAS","-",null,1,"-",null,null,0,0,""]
["S",3,"S",0,1,4,2,0,0,0,0,"","Serviço","Serviço","-","AGETOP",70391,"BUCHA DE NYLON S-6","Un    ",null,1,"-",null,null,0,0,""]
["S",3,"S",0,1,4,2,0,0,0,0,"","Serviço","Serviço","-","AGETOP",71861,"PARAFUSO P/BUCHA S-6","Un    ",null,1,"-",null,null,0,0,""]
["S",3,"S",0,1,4,2,0,0,0,0,"","Serviço","Serviço","-","AGETOP",70351,"BRACADEIRA METALICA TIPO \"U\" DIAM. 3/4\"","Un    ",null,1,"-",null,null,0,0,""]
["S",3,"S",0,1,4,2,0,0,0,0,"","Serviço","Serviço","-","AGETOP",70352,"BRACADEIRA METALICA TIPO \"U\" DIAM. 1\"","Un    ",null,1,"-",null,null,0,0,""]
["S",3,"S",0,1,4,2,0,0,0,0,"","Serviço","Serviço","-","AGETOP",70354,"BRACADEIRA METALICA TIPO \"U\" DIAM. 1.1/2\"","Un    ",null,1,"-",null,null,0,0,""]
["S",3,"S",0,1,4,2,0,0,0,0,"","Serviço","Serviço","-","AGETOP",70355,"BRACADEIRA METALICA TIPO \"U\" DIAM. 2\"","Un    ",null,1,"-",null,null,0,0,""]
["S",3,"S",0,1,4,2,0,0,0,0,"","Serviço","Serviço","-","AGETOP",70421,"BUCHA E ARRUELA METALICA DIAM. 3/4\"","PR    ",null,1,"-",null,null,0,0,""]
["S",3,"S",0,1,4,2,0,0,0,0,"","Serviço","Serviço","-","AGETOP",70424,"BUCHA E ARRUELA METALICA DIAM. 1.1/2\"","PR    ",null,1,"-",null,null,0,0,""]
["S",3,"S",0,1,4,2,0,0,0,0,"","Serviço","Serviço","-","AGETOP",70425,"BUCHA E ARRUELA METALICA DIAM. 2\"","PR    ",null,1,"-",null,null,0,0,""]
["S",3,"S",0,1,4,2,0,0,0,0,"","Serviço","Serviço","-","SINAPI",92980,"CABO DE COBRE FLEXÍVEL ISOLADO, 10 MM², ANTI-CHAMA 0,6/1,0 KV, PARA DISTRIBUIÇÃO - FORNECIMENTO E INSTALAÇÃO. AF_12/2015","M",null,1,"-",null,null,0,0,""]
["S",3,"S",0,1,4,2,0,0,0,0,"","Serviço","Serviço","-","SINAPI",92982,"CABO DE COBRE FLEXÍVEL ISOLADO, 16 MM², ANTI-CHAMA 0,6/1,0 KV, PARA DISTRIBUIÇÃO - FORNECIMENTO E INSTALAÇÃO. AF_12/2015","M",null,1,"-",null,null,0,0,""]
["S",3,"S",0,1,4,2,0,0,0,0,"","Serviço","Serviço","-","AGETOP",70511,"CABO EPR/XLPE (90°C) 1 KV - 25 MM2","M     ",null,1,"-",null,null,0,0,""]
["S",3,"S",0,1,4,2,0,0,0,0,"","Serviço","Serviço","-","AGETOP",70512,"CABO EPR/XLPE (90°C) 1 KV - 35 MM2","M     ",null,1,"-",null,null,0,0,""]
["S",3,"S",0,1,4,2,0,0,0,0,"","Serviço","Serviço","-","AGETOP",70541,"CABO DE COBRE NU No. 16 MM2 (6,94 M/KG)","M     ",null,1,"-",null,null,0,0,""]
["S",3,"S",0,1,4,2,0,0,0,0,"","Serviço","Serviço","-","AGETOP",70556,"CABO FLEXIVEL PARALELO 2 X 2,5 MM2","M     ",null,1,"-",null,null,0,0,""]
["S",3,"S",0,1,4,2,0,0,0,0,"","Serviço","Serviço","-","AGETOP",70581,"CABO PVC (70ºC) 1 KV No. 2,5 MM2","M     ",null,1,"-",null,null,0,0,""]
["S",3,"S",0,1,4,2,0,0,{"$f":"IF(OR($C115=\"S\",$C115=0),0,MATCH(0,OFFSET($D115,1,$C115,ROW($C$538)-ROW($C115)),0))","v":0},{"$f":"IF(OR($C115=\"S\",$C115=0),0,MATCH(OFFSET($D115,0,$C115)+1,OFFSET($D115,1,$C115,ROW($C$538)-ROW($C115)),0))","v":0},"","Serviço","Serviço","-","AGETOP",70582,"CABO PVC (70ºC) 1 KV No. 4 MM2","M     ",null,1,"-",null,null,0,0,""]
["S",3,"S",0,1,4,2,0,0,0,0,"","Serviço","Serviço","-","AGETOP",70583,"CABO PVC (70ºC) 1 KV No. 6 MM2","M     ",null,1,"-",null,null,0,0,""]
["S",3,"S",0,1,4,2,0,0,0,0,"","Serviço","Serviço","-","SINAPI",100556,"CAIXA DE PASSAGEM PARA TELEFONE 15X15X10CM (SOBREPOR), FORNECIMENTO E INSTALACAO. AF_11/2019","UN",null,1,"-",null,null,0,0,""]
["S",3,"S",0,1,4,2,0,0,0,0,"","Serviço","Serviço","-","AGETOP",70647,"CAIXA DE PASSAGEM METÁLICA DE EMBUTIR 30X30X12 CM","Un    ",null,1,"-",null,null,0,0,""]
["S",3,"S",0,1,4,2,0,0,0,0,"","Serviço","Serviço","-","AGETOP",70680,"CAIXA MET.HEXAGONAL P/ARANDELA (SEXTAVADA 3\"X3\")","Un    ",null,1,"-",null,null,0,0,""]
["S",3,"S",0,1,4,2,0,0,0,0,"","Serviço","Serviço","-","SINAPI",97891,"CAIXA ENTERRADA ELÉTRICA RETANGULAR, EM ALVENARIA COM BLOCOS DE CONCRETO, FUNDO COM BRITA, DIMENSÕES INTERNAS: 0,4X0,4X0,4 M. AF_05/2018","UN",null,1,"-",null,null,0,0,""]
["S",3,"S",0,1,4,2,0,0,0,0,"","Serviço","Serviço","-","SINAPI",97892,"CAIXA ENTERRADA ELÉTRICA RETANGULAR, EM ALVENARIA COM BLOCOS DE CONCRETO, FUNDO COM BRITA, DIMENSÕES INTERNAS: 0,6X0,6X0,6 M. AF_05/2018","UN",null,1,"-",null,null,0,0,""]
["S",3,"S",0,1,4,2,0,0,0,0,"","Serviço","Serviço","-","AGETOP",70720,"CAIXA METÁLICA PARA MEDIDOR POLIFÁSICO PADRÃO ENEL 500X380X166MM","Un    ",null,1,"-",null,null,0,0,""]
["S",3,"S",0,1,4,2,0,0,0,0,"","Serviço","Serviço","-","AGETOP",70929,"CONDULETE METÁLICO - CAIXA COM 5 ENTRADAS ","un    ",null,1,"-",null,null,0,0,""]
["S",3,"S",0,1,4,2,0,0,0,0,"","Serviço","Serviço","-","AGETOP",70930,"CONDULETE METÁLICO - ADAPTADOR DE SAÍDA 3/4\" ","un    ",null,1,"-",null,null,0,0,""]
["S",3,"S",0,1,4,2,0,0,0,0,"","Serviço","Serviço","-","AGETOP",70924,"CONDULETE DE PVC - CAIXA COM 5 ENTRADAS ","un    ",null,1,"-",null,null,0,0,""]
["S",3,"S",0,1,4,2,0,0,0,0,"","Serviço","Serviço","-","AGETOP",70925,"CONDULETE DE PVC - ADAPTADOR DE SAÍDA 3/4\"  ","un    ",null,1,"-",null,null,0,0,""]
["S",3,"S",0,1,4,2,0,0,0,0,"","Serviço","Serviço","-","AGETOP",72385,"TAMPA CEGA PARA CONDULETE DE PVC","Un    ",null,1,"-",null,null,0,0,""]
["S",3,"S",0,1,4,2,0,0,0,0,"","Serviço","Serviço","-","AGETOP",71141,"CURVA DE 90 GRAUS DE PVC RIGIDO DIAM. 3/4\"","Un    ",null,1,"-",null,null,0,0,""]
["S",3,"S",0,1,4,2,0,0,0,0,"","Serviço","Serviço","-","AGETOP",71142,"CURVA DE 90 GRAUS DE PVC RIGIDO DIAM. 1\"","Un    ",null,1,"-",null,null,0,0,""]
["S",3,"S",0,1,4,2,0,0,0,0,"","Serviço","Serviço","-","SINAPI",93018,"CURVA 90 GRAUS PARA ELETRODUTO, PVC, ROSCÁVEL, DN 50 MM (1 1/2\") - FORNECIMENTO E INSTALAÇÃO. AF_12/2015","UN",null,1,"-",null,null,0,0,""]
["S",3,"S",0,1,4,2,0,0,0,0,"","Serviço","Serviço","-","SINAPI",93020,"CURVA 90 GRAUS PARA ELETRODUTO, PVC, ROSCÁVEL, DN 60 MM (2\") - FORNECIMENTO E INSTALAÇÃO. AF_12/2015","UN",null,1,"-",null,null,0,0,""]
["S",3,"S",0,1,4,2,0,0,0,0,"","Serviço","Serviço","-","SINAPI",93022,"CURVA 90 GRAUS PARA ELETRODUTO, PVC, ROSCÁVEL, DN 75 MM (2 1/2\") - FORNECIMENTO E INSTALAÇÃO. AF_12/2015","UN",null,1,"-",null,null,0,0,""]
["S",3,"S",0,1,4,2,0,0,0,0,"","Serviço","Serviço","-","AGETOP",71121,"CURVA 90 GRAUS AÇO ZINCADO DIÂMETRO 3/4\"","Un    ",null,1,"-",null,null,0,0,""]
["S",3,"S",0,1,4,2,0,0,0,0,"","Serviço","Serviço","-","SINAPI",93653,"DISJUNTOR MONOPOLAR TIPO DIN, CORRENTE NOMINAL DE 10A - FORNECIMENTO E INSTALAÇÃO. AF_04/2016","UN",null,1,"-",null,null,0,0,""]
["S",3,"S",0,1,4,2,0,0,0,0,"","Serviço","Serviço","-","SINAPI",93654,"DISJUNTOR MONOPOLAR TIPO DIN, CORRENTE NOMINAL DE 16A - FORNECIMENTO E INSTALAÇÃO. AF_04/2016","UN",null,1,"-",null,null,0,0,""]
["S",3,"S",0,1,4,2,0,0,0,0,"","Serviço","Serviço","-","SINAPI",93656,"DISJUNTOR MONOPOLAR TIPO DIN, CORRENTE NOMINAL DE 25A - FORNECIMENTO E INSTALAÇÃO. AF_04/2016","UN",null,1,"-",null,null,0,0,""]
["S",3,"S",0,1,4,2,0,0,0,0,"","Serviço","Serviço","-","AGETOP",71173,"DISJUNTOR TRIPOLAR DE 10 A 35-A","Un    ",null,1,"-",null,null,0,0,""]
["S",3,"S",0,1,4,2,0,0,0,0,"","Serviço","Serviço","-","AGETOP",71174,"DISJUNTOR TRIPOLAR 40 A 50A","Un    ",null,1,"-",null,null,0,0,""]
["S",3,"S",0,1,4,2,0,0,0,0,"","Serviço","Serviço","-","SINAPI","74130/5","DISJUNTOR TERMOMAGNETICO TRIPOLAR PADRAO NEMA (AMERICANO) 60 A 100A 240V, FORNECIMENTO E INSTALACAO","UN",null,1,"-",null,null,0,0,""]
["S",3,"S",0,1,4,2,0,0,0,0,"","Serviço","Serviço","-","AGETOP",71184,"DISPOSITIVO DE PROTEÇÃO CONTRA SURTOS (D.P.S.) 275V DE 8 A 40KA","Un    ",null,1,"-",null,null,0,0,""]
["S",3,"S",0,1,4,2,0,0,0,0,"","Serviço","Serviço","-","AGETOP",71450,"INTERRUPTOR DIFERENCIAL RESIDUAL (D.R.) BIPOLAR DE 25A-30mA","Un    ",null,1,"-",null,null,0,0,""]
["S",3,"S",0,1,4,2,0,0,0,0,"","Serviço","Serviço","-","AGETOP",71201,"ELETRODUTO DE PVC RIGIDO DIAMETRO 3/4\"","M     ",null,1,"-",null,null,0,0,""]
["S",3,"S",0,1,4,2,0,0,0,0,"","Serviço","Serviço","-","AGETOP",71202,"ELETRODUTO DE PVC RIGIDO DIAMETRO 1\"","M     ",null,1,"-",null,null,0,0,""]
["S",3,"S",0,1,4,2,0,0,0,0,"","Serviço","Serviço","-","SINAPI",93008,"ELETRODUTO RÍGIDO ROSCÁVEL, PVC, DN 50 MM (1 1/2\") - FORNECIMENTO E INSTALAÇÃO. AF_12/2015","M",null,1,"-",null,null,0,0,""]
["S",3,"S",0,1,4,2,0,0,0,0,"","Serviço","Serviço","-","SINAPI",93009,"ELETRODUTO RÍGIDO ROSCÁVEL, PVC, DN 60 MM (2\") - FORNECIMENTO E INSTALAÇÃO. AF_12/2015","M",null,1,"-",null,null,0,0,""]
["S",3,"S",0,1,4,2,0,0,0,0,"","Serviço","Serviço","-","AGETOP",71251,"ELETRODUTO EM AÇO ZINCADO DIÂMETRO 3/4\"","M     ",null,1,"-",null,null,0,0,""]
["S",3,"S",0,1,4,2,0,0,{"$f":"IF(OR($C147=\"S\",$C147=0),0,MATCH(0,OFFSET($D147,1,$C147,ROW($C$538)-ROW($C147)),0))","v":0},{"$f":"IF(OR($C147=\"S\",$C147=0),0,MATCH(OFFSET($D147,0,$C147)+1,OFFSET($D147,1,$C147,ROW($C$538)-ROW($C147)),0))","v":0},"","Serviço","Serviço","-","AGETOP",71215,"ELETRODUTO EM AÇO GALVANIZADO A FOGO DIÂMETRO 2\" - PESADO ","M     ",null,1,"-",null,null,0,0,""]
["S",3,"S",0,1,4,2,0,0,0,0,"","Serviço","Serviço","-","AGETOP",71321,"FITA DE AUTO FUSAO, ROLO E 10,00 MM","Un    ",null,1,"-",null,null,0,0,""]
["S",3,"S",0,1,4,2,0,0,0,0,"","Serviço","Serviço","-","AGETOP",71331,"FITA ISOLANTE, ROLO DE 20,00 M","Un    ",null,1,"-",null,null,0,0,""]
["S",3,"S",0,1,4,2,0,0,0,0,"","Serviço","Serviço","-","AGETOP",71381,"HASTE REV.COBRE(COPPERWELD)  5/8\" X 3,00 M C/CONECTOR","Un    ",null,1,"-",null,null,0,0,""]
["S",3,"S",0,1,4,2,0,0,0,0,"","Serviço","Serviço","-","AGETOP",71440,"INTERRUPTOR SIMPLES (1 SECAO)","Un    ",null,1,"-",null,null,0,0,""]
["S",3,"S",0,1,4,2,0,0,0,0,"","Serviço","Serviço","-","AGETOP",71577,"LAMPADA COMPACTA ELETRÔNICA COM REATOR INTEGRADO  25/26 W","Un    ",null,1,"-",null,null,0,0,""]
["S",3,"S",0,1,4,2,0,0,0,0,"","Serviço","Serviço","-","AGETOP",71688,"LUMINÁRIA TIPO SPOT DE SOBREPOR PARA 01 LÂMPADA","un    ",null,1,"-",null,null,0,0,""]
["S",{"$f":"IF(OR(C154=\"s\",C154=0),OFFSET(B154,-1,0),C154)","v":3},{"$f":"IF(OFFSET(C154,-1,0)=\"L\",1,IF(OFFSET(C154,-1,0)=1,2,IF(OR(A154=\"s\",A154=0),\"S\",IF(AND(OFFSET(C154,-1,0)=2,A154=4),3,IF(AND(OR(OFFSET(C154,-1,0)=\"s\",OFFSET(C154,-1,0)=0),A154<>\"s\",A154>OFFSET(B154,-1,0)),OFFSET(B154,-1,0),A154)))))","v":"S"},{"$f":"IF(OR(C154=\"S\",C154=0),0,IF(ISERROR(K154),J154,SMALL(J154:K154,1)))","v":0},{"$f":"IF($C154=1,OFFSET(E154,-1,0)+1,OFFSET(E154,-1,0))","v":1},{"$f":"IF($C154=1,0,IF($C154=2,OFFSET(F154,-1,0)+1,OFFSET(F154,-1,0)))","v":4},{"$f":"IF(AND($C154<=2,$C154<>0),0,IF($C154=3,OFFSET(G154,-1,0)+1,OFFSET(G154,-1,0)))","v":2},{"$f":"IF(AND($C154<=3,$C154<>0),0,IF($C154=4,OFFSET(H154,-1,0)+1,OFFSET(H154,-1,0)))","v":0},0,0,0,{"$f":"IF(OR(Y154>0,$C154=1),\"F\",\"\")","v":""},"Serviço",{"$f":"CHOOSE(1+LOG(1+2*(C154=1)+4*(C154=2)+8*(C154=3)+16*(C154=4)+32*(C154=\"S\"),2),\"\",\"Nível 1\",\"Nível 2\",\"Nível 3\",\"Nível 4\",\"Serviço\")","v":"Serviço"},"-","AGETOP",71722,"LUVA EM AÇO ZINCADO DIÂMETRO 3/4\"","Un    ",null,1,"-",null,null,0,0,""]
[{"$f":"CHOOSE(1+LOG(1+2*(ORÇAMENTO.Nivel=\"Nível 1\")+4*(ORÇAMENTO.Nivel=\"Nível 2\")+8*(ORÇAMENTO.Nivel=\"Nível 3\")+16*(ORÇAMENTO.Nivel=\"Nível 4\")+32*(ORÇAMENTO.Nivel=\"Serviço\"),2),0,1,2,3,4,\"S\")","v":"S"},3,"S",0,1,4,2,0,{"$f":"IF(AND($C155<=4,$C155<>0),0,IF(AND($C155=\"S\",$Y155>0),OFFSET(I155,-1,0)+1,OFFSET(I155,-1,0)))","v":0},0,0,"","Serviço","Serviço","-","AGETOP",71705,"LUVA EM AÇO GALVANIZADO DIÂMETRO 2\"","Un    ",null,1,"-",null,null,0,0,""]
["S",3,"S",0,1,4,2,0,0,0,0,"","Serviço","Serviço","-","AGETOP",71741,"LUVA PVC ROSQUEAVEL DIAMETRO 3/4\"","Un    ",null,1,"-",null,null,0,0,""]
["S",3,"S",0,1,4,2,0,0,0,0,"","Serviço","Serviço","-","AGETOP",71742,"LUVA PVC ROSQUEAVEL DIAMETRO 1\"","Un    ",null,1,"-",null,null,0,0,""]
["S",3,"S",0,1,4,2,0,0,0,0,"","Serviço","Serviço","-","AGETOP",71744,"LUVA PVC ROSQUEAVEL DIAMETRO 1.1/2\"","Un    ",null,1,"-",null,null,0,0,""]
["S",3,"S",0,1,4,2,0,0,0,0,"","Serviço","Serviço","-","AGETOP",71745,"LUVA PVC ROSQUEAVEL DIAMETRO 2\"","Un    ",null,1,"-",null,null,0,0,""]
["S",3,"S",0,1,4,2,0,0,0,0,"","Serviço","Serviço","-","AGETOP",71824,"PADRÃO TRIFASICO 35 MM H=7 METROS","Un    ",null,1,"-",null,null,0,0,""]
["S",3,"S",0,1,4,2,0,0,0,0,"","Serviço","Serviço","-","SINAPI","74131/4","QUADRO DE DISTRIBUICAO DE ENERGIA DE EMBUTIR, EM CHAPA METALICA, PARA 18 DISJUNTORES TERMOMAGNETICOS MONOPOLARES, COM BARRAMENTO TRIFASICO E NEUTRO, FORNECIMENTO E INSTALACAO","UN",null,1,"-",null,null,0,0,""]
["S",3,"S",0,1,4,2,0,0,0,0,"","Serviço","Serviço","-","SINAPI","74131/6","QUADRO DE DISTRIBUICAO DE ENERGIA DE EMBUTIR, EM CHAPA METALICA, PARA 32 DISJUNTORES TERMOMAGNETICOS MONOPOLARES, COM BARRAMENTO TRIFASICO E NEUTRO, FORNECIMENTO E INSTALACAO","UN",null,1,"-",null,null,0,0,""]
["S",3,"S",0,1,4,2,0,0,0,0,"","Serviço","Serviço","-","AGETOP",72395,"TAMPA CEGA PARA CONDULETE METÁLICO","Un    ",null,1,"-",null,null,0,0,""]
["S",3,"S",0,1,4,2,0,0,0,0,"","Serviço","Serviço","-","AGETOP",72425,"TAMPA CEGA PLASTICA RETANGULAR 4\"X2\"","Un    ",null,1,"-",null,null,0,0,""]
["S",3,"S",0,1,4,2,0,0,0,0,"","Serviço","Serviço","-","AGETOP",72578,"TOMADA HEXAGONAL 2P + T - 10A - 250V","Un    ",null,1,"-",null,null,0,0,""]
["S",3,"S",0,1,4,2,0,0,0,0,"","Serviço","Serviço","-","AGETOP",72578,"TOMADA HEXAGONAL 2P + T - 10A - 250V","Un    ",null,1,"-",null,null,0,0,""]
["S",3,"S",0,1,4,2,0,0,0,0,"","Serviço","Serviço","-","SINAPI",92008,"TOMADA BAIXA DE EMBUTIR (2 MÓDULOS), 2P+T 10 A, INCLUINDO SUPORTE E PLACA - FORNECIMENTO E INSTALAÇÃO. AF_12/2015","UN",null,1,"-",null,null,0,0,""]
[{"$f":"CHOOSE(1+LOG(1+2*(ORÇAMENTO.Nivel=\"Nível 1\")+4*(ORÇAMENTO.Nivel=\"Nível 2\")+8*(ORÇAMENTO.Nivel=\"Nível 3\")+16*(ORÇAMENTO.Nivel=\"Nível 4\")+32*(ORÇAMENTO.Nivel=\"Serviço\"),2),0,1,2,3,4,\"S\")","v":"S"},3,"S",0,1,4,2,0,{"$f":"IF(AND($C168<=4,$C168<>0),0,IF(AND($C168=\"S\",$Y168>0),OFFSET(I168,-1,0)+1,OFFSET(I168,-1,0)))","v":0},0,0,"","Serviço","Serviço","-","SINAPI",91992,"TOMADA ALTA DE EMBUTIR (1 MÓDULO), 2P+T 10 A, INCLUINDO SUPORTE E PLACA - FORNECIMENTO E INSTALAÇÃO. AF_12/2015","UN",null,1,"-",null,null,0,0,""]
[{"$f":"CHOOSE(1+LOG(1+2*(ORÇAMENTO.Nivel=\"Nível 1\")+4*(ORÇAMENTO.Nivel=\"Nível 2\")+8*(ORÇAMENTO.Nivel=\"Nível 3\")+16*(ORÇAMENTO.Nivel=\"Nível 4\")+32*(ORÇAMENTO.Nivel=\"Serviço\"),2),0,1,2,3,4,\"S\")","v":"S"},3,"S",0,1,4,2,0,{"$f":"IF(AND($C169<=4,$C169<>0),0,IF(AND($C169=\"S\",$Y169>0),OFFSET(I169,-1,0)+1,OFFSET(I169,-1,0)))","v":0},0,0,"","Serviço","Serviço","-","AGETOP",72585,"TOMADA HEXAGONAL 2P + T - 20A - 250V","Un    ",null,1,"-",null,null,0,0,""]
[2,2,2,39,1,5,0,0,0,193,39,"","Nível 2","Nível 2","-","AGETOP",null,"INSTALAÇÕES HIDROSSANITÁRIAS","-",null,1,"-",null,null,0,0,""]
[3,3,3,2,1,5,1,0,{"$f":"IF(AND($C171<=4,$C171<>0),0,IF(AND($C171=\"S\",$Y171>0),OFFSET(I171,-1,0)+1,OFFSET(I171,-1,0)))","v":0},38,2,"","Nível 3","Nível 3","-","SINAPI",null,"RECOLOCAÇÃO VASOS SANITÁRIOS","-",null,1,"-",null,null,0,0,""]
[{"$f":"CHOOSE(1+LOG(1+2*(ORÇAMENTO.Nivel=\"Nível 1\")+4*(ORÇAMENTO.Nivel=\"Nível 2\")+8*(ORÇAMENTO.Nivel=\"Nível 3\")+16*(ORÇAMENTO.Nivel=\"Nível 4\")+32*(ORÇAMENTO.Nivel=\"Serviço\"),2),0,1,2,3,4,\"S\")","v":"S"},3,"S",0,1,5,1,0,{"$f":"IF(AND($C172<=4,$C172<>0),0,IF(AND($C172=\"S\",$Y172>0),OFFSET(I172,-1,0)+1,OFFSET(I172,-1,0)))","v":0},0,0,"","Serviço","Serviço","-","SINAPI",95469,"VASO SANITARIO SIFONADO CONVENCIONAL COM  LOUÇA BRANCA - FORNECIMENTO E INSTALAÇÃO. AF_01/2020","UN",null,1,"-",null,null,0,0,""]
[{"$f":"CHOOSE(1+LOG(1+2*(ORÇAMENTO.Nivel=\"Nível 1\")+4*(ORÇAMENTO.Nivel=\"Nível 2\")+8*(ORÇAMENTO.Nivel=\"Nível 3\")+16*(ORÇAMENTO.Nivel=\"Nível 4\")+32*(ORÇAMENTO.Nivel=\"Serviço\"),2),0,1,2,3,4,\"S\")","v":3},3,3,13,1,5,2,0,{"$f":"IF(AND($C173<=4,$C173<>0),0,IF(AND($C173=\"S\",$Y173>0),OFFSET(I173,-1,0)+1,OFFSET(I173,-1,0)))","v":0},36,13,"","Nível 3","Nível 3","-","SINAPI",null,"PEÇAS E ACESSÓRIOS","-",null,1,"-",null,null,0,0,""]
[4,4,4,6,1,5,2,1,{"$f":"IF(AND($C174<=4,$C174<>0),0,IF(AND($C174=\"S\",$Y174>0),OFFSET(I174,-1,0)+1,OFFSET(I174,-1,0)))","v":0},12,6,"","Nível 4","Nível 4","-","SINAPI",null,"VASO SANITÁRIO E ACESSÓRIOS","-",null,1,"-",null,null,0,0,""]
["S",4,"S",0,1,5,2,1,{"$f":"IF(AND($C175<=4,$C175<>0),0,IF(AND($C175=\"S\",$Y175>0),OFFSET(I175,-1,0)+1,OFFSET(I175,-1,0)))","v":0},0,0,"","Serviço","Serviço","-","AGETOP",80517,"VÁLVULA DE DESCARGA DUPLO ACIONAMENTO COM ACABAMENTO CROMADO ANTIVANDALISMO","Un    ",null,1,"-",null,null,0,0,""]
["S",4,"S",0,1,5,2,1,{"$f":"IF(AND($C176<=4,$C176<>0),0,IF(AND($C176=\"S\",$Y176>0),OFFSET(I176,-1,0)+1,OFFSET(I176,-1,0)))","v":0},0,0,"","Serviço","Serviço","-","AGETOP",80520,"CONJUNTO DE FIXACAO P/VASO SANITARIO (PAR)","CJ    ",null,1,"-",null,null,0,0,""]
["S",4,"S",0,1,5,2,1,0,0,0,"","Serviço","Serviço","-","AGETOP",80510,"ANEL DE VEDAÇÃO PARA VASO SANITÁRIO","Un    ",null,1,"-",null,null,0,0,""]
["S",4,"S",0,1,5,2,1,0,0,0,"","Serviço","Serviço","-","AGETOP",80513,"TUBO PARA VÁLVULA DE DESCARGA ( CURTO 1.1/4\" )","Un    ",null,1,"-",null,null,0,0,""]
["S",4,"S",0,1,5,2,1,0,{"$f":"IF(OR($C179=\"S\",$C179=0),0,MATCH(0,OFFSET($D179,1,$C179,ROW($C$538)-ROW($C179)),0))","v":0},{"$f":"IF(OR($C179=\"S\",$C179=0),0,MATCH(OFFSET($D179,0,$C179)+1,OFFSET($D179,1,$C179,ROW($C$538)-ROW($C179)),0))","v":0},"","Serviço","Serviço","-","AGETOP",80514,"TUBO DE LIGACAO PVC CROMADO 1.1/2\" / ESPUDE  - (ENTRADA)","Un    ",null,1,"-",null,null,0,0,""]
[4,4,4,4,1,5,2,2,0,6,4,"","Nível 4","Nível 4","-","SINAPI",null,"LAVATÓRIO E ACESSÓRIOS","-",null,1,"-",null,null,0,0,""]
["S",4,"S",0,1,5,2,2,0,0,0,"","Serviço","Serviço","-","SINAPI",86883,"SIFÃO DO TIPO FLEXÍVEL EM PVC 1  X 1.1/2  - FORNECIMENTO E INSTALAÇÃO. AF_01/2020","UN",null,1,"-",null,null,0,0,""]
["S",4,"S",0,1,5,2,2,0,0,0,"","Serviço","Serviço","-","AGETOP",80570,"TORNEIRA DE MESA PARA LAVATÓRIO DIÂMETRO DE 1/2\"","Un    ",null,1,"-",null,null,0,0,""]
["S",4,"S",0,1,5,2,2,0,0,0,"","Serviço","Serviço","-","AGETOP",80580,"VALVULA P/LAVATORIO OU BEBEDOURO METALICO DIAMETRO 1\"","Un    ",null,1,"-",null,null,0,0,""]
[4,4,4,2,1,5,2,3,0,2,11,"","Nível 4","Nível 4","-","SINAPI",null,"REGISTROS","-",null,1,"-",null,null,0,0,""]
["S",4,"S",0,1,5,2,3,0,0,0,"","Serviço","Serviço","-","AGETOP",80910,"REGISTRO DE GAVETA BRUTO DIAMETRO 2.1/2\"","Un    ",null,1,"-",null,null,0,0,""]
[3,3,3,17,1,5,3,0,0,23,17,"","Nível 3","Nível 3","-","SINAPI",null,"ÁGUA FRIA","-",null,1,"-",null,null,0,0,""]
[4,4,4,4,1,5,3,1,0,16,4,"","Nível 4","Nível 4","-","SINAPI",null,"TUBOS DE PVC SOLDÁVEL","-",null,1,"-",null,null,0,0,""]
["S",4,"S",0,1,5,3,1,0,0,0,"","Serviço","Serviço","-","AGETOP",81003,"TUBO SOLDAVEL PVC MARROM DIAMETRO 25 mm","M     ",null,1,"-",null,null,0,0,""]
["S",4,"S",0,1,5,3,1,0,0,0,"","Serviço","Serviço","-","SINAPI",89449,"TUBO, PVC, SOLDÁVEL, DN 50MM, INSTALADO EM PRUMADA DE ÁGUA - FORNECIMENTO E INSTALAÇÃO. AF_12/2014","M",null,1,"-",null,null,0,0,""]
["S",4,"S",0,1,5,3,1,0,0,0,"","Serviço","Serviço","-","SINAPI",89451,"TUBO, PVC, SOLDÁVEL, DN 75MM, INSTALADO EM PRUMADA DE ÁGUA - FORNECIMENTO E INSTALAÇÃO. AF_12/2014","M",null,1,"-",null,null,0,0,""]
[4,4,4,2,1,5,3,2,0,12,2,"","Nível 4","Nível 4","-","SINAPI",null,"ADAPTADORES DE PVC SOLDÁVEL","-",null,1,"-",null,null,0,0,""]
["S",4,"S",0,1,5,3,2,0,0,0,"","Serviço","Serviço","-","AGETOP",81069,"ADAPTAD.SOLD.CURTO C/BOLSA/ROSCA P/REG.50X11/2\"","Un    ",null,1,"-",null,null,0,0,""]
[4,4,4,2,1,5,3,3,0,10,2,"","Nível 4","Nível 4","-","SINAPI",null,"BUCHAS","-",null,1,"-",null,null,0,0,""]
["S",4,"S",0,1,5,3,3,0,0,0,"","Serviço","Serviço","-","AGETOP",81185,"BUCHA DE REDUÇÃO SOLDÁVEL LONGA 75 X 50 MM","un    ",null,1,"-",null,null,0,0,""]
[4,4,4,5,1,5,3,4,0,8,5,"","Nível 4","Nível 4","-","SINAPI",null,"JOELHO","-",null,1,"-",null,null,0,0,""]
["S",4,"S",0,1,5,3,4,0,0,0,"","Serviço","Serviço","-","SINAPI",89409,"JOELHO 45 GRAUS, PVC, SOLDÁVEL, DN 25MM, INSTALADO EM RAMAL DE DISTRIBUIÇÃO DE ÁGUA - FORNECIMENTO E INSTALAÇÃO. AF_12/2014","UN",null,1,"-",null,null,0,0,""]
["S",4,"S",0,1,5,3,4,0,0,0,"","Serviço","Serviço","-","AGETOP",81307,"JOELHO 45 GRAUS SOLDAVEL 75 mm","Un    ",null,1,"-",null,null,0,0,""]
["S",4,"S",0,1,5,3,4,0,0,0,"","Serviço","Serviço","-","SINAPI",89481,"JOELHO 90 GRAUS, PVC, SOLDÁVEL, DN 25MM, INSTALADO EM PRUMADA DE ÁGUA - FORNECIMENTO E INSTALAÇÃO. AF_12/2014","UN",null,1,"-",null,null,0,0,""]
["S",4,"S",0,1,5,3,4,0,0,0,"","Serviço","Serviço","-","AGETOP",81326,"JOELHO 90 GRAUS SOLDAVEL DIAMETRO 75 mm","Un    ",null,1,"-",null,null,0,0,""]
[4,4,4,3,1,5,3,5,0,3,110,"","Nível 4","Nível 4","-","SINAPI",null,"ADESIVOS","-",null,1,"-",null,null,0,0,""]
["S",4,"S",0,1,5,3,5,0,0,0,"","Serviço","Serviço","-","AGETOP",81501,"ADESIVO PLASTICO - FRASCO 850 G","Un    ",null,1,"-",null,null,0,0,""]
["S",4,"S",0,1,5,3,5,0,0,0,"","Serviço","Serviço","-","AGETOP",81504,"SOLUCAO LIMPADORA 1000 CM3","Un    ",null,1,"-",null,null,0,0,""]
[3,3,3,3,1,5,4,0,0,6,3,"","Nível 3","Nível 3","-","SINAPI",null,"ESGOTO SANITÁRIO","-",null,1,"-",null,null,0,0,""]
[4,4,4,2,1,5,4,1,0,2,90,"","Nível 4","Nível 4","-","SINAPI",null,"TUBOS","-",null,1,"-",null,null,0,0,""]
["S",4,"S",0,1,5,4,1,0,0,0,"","Serviço","Serviço","-","SINAPI",89800,"TUBO PVC, SERIE NORMAL, ESGOTO PREDIAL, DN 100 MM, FORNECIDO E INSTALADO EM PRUMADA DE ESGOTO SANITÁRIO OU VENTILAÇÃO. AF_12/2014","M",null,1,"-",null,null,0,0,""]
[3,3,3,3,1,5,5,0,0,3,142,"","Nível 3","Nível 3","-","SINAPI",null,"EXTRAS","-",null,1,"-",null,null,0,0,""]
["S",3,"S",0,1,5,5,0,0,0,0,"","Serviço","Serviço","-","AGETOP",80845,"CAIXA DE ALVENARIA 20x20x25 CM (REVESTIMENTO IMPERMEABILIZADO), FUNDO DE BRITA SEM TAMPA - PARA REGISTRO/TORNEIRA JARDIM","Un    ",null,1,"-",null,null,0,0,""]
["S",3,"S",0,1,5,5,0,0,0,0,"","Serviço","Serviço","-","AGETOP",81880,"RES.METALICO TAÇA AÇO PATINÁVEL-V=5M3-COL.SEC.H=6M+FUNDAÇÃO+LOGOTIPO","Un    ",null,1,"-",null,null,0,0,""]
[2,2,2,44,1,6,0,0,0,154,44,"","Nível 2","Nível 2","-","SINAPI",null,"INSTALAÇÕES ESPECIAIS","-",null,1,"-",null,null,0,0,""]
[3,3,3,28,1,6,1,0,0,43,28,"","Nível 3","Nível 3","-","SINAPI",null,"INTALAÇÕES DE GÁS - PEÇAS E ACESSÓRIOS 2 CILINDROS","-",null,1,"-",null,null,0,0,""]
["S",3,"S",0,1,6,1,0,0,0,0,"","Serviço","Serviço","-","AGETOP",91007,"CENTRAL DE GÁS PADRÃO GOINFRA SEM INSTALAÇÕES (1+1 CILINDRO 45 KG)","Un    ",null,1,"-",null,null,0,0,""]
["S",3,"S",0,1,6,1,0,0,{"$f":"IF(OR($C212=\"S\",$C212=0),0,MATCH(0,OFFSET($D212,1,$C212,ROW($C$538)-ROW($C212)),0))","v":0},{"$f":"IF(OR($C212=\"S\",$C212=0),0,MATCH(OFFSET($D212,0,$C212)+1,OFFSET($D212,1,$C212,ROW($C$538)-ROW($C212)),0))","v":0},"","Serviço","Serviço","-","AGETOP",91023,"UNIÃO S/BRONZE PRETA 3/4\" NPT 300 LBS","Un    ",null,1,"-",null,null,0,0,""]
["S",3,"S",0,1,6,1,0,0,0,0,"","Serviço","Serviço","-","COMPOSIÇÃO","COMP 382_SEE","TE DE REDUCAO DE FERRO GALVANIZADO, COM ROSCA BSP, DE 3/4\" X 1/2\"","UN ",null,1,"-",null,null,0,0,""]
["S",3,"S",0,1,6,1,0,0,0,0,"","Serviço","Serviço","-","COMPOSIÇÃO","COMP 383_SEE","BUCHA DE REDUCAO DE FERRO GALVANIZADO, COM ROSCA BSP, DE 1/2\" X 1/4\"","UN ",null,1,"-",null,null,0,0,""]
["S",3,"S",0,1,6,1,0,0,0,0,"","Serviço","Serviço","-","AGETOP",91021,"LUVA GALVANIZADO DE REDUÇÃO 3/4\" X 1/2\" (GÁS)","Un    ",null,1,"-",null,null,0,0,""]
["S",3,"S",0,1,6,1,0,0,0,0,"","Serviço","Serviço","-","SINAPI",92692,"NIPLE, EM FERRO GALVANIZADO, CONEXÃO ROSQUEADA, DN 15 (1/2\"), INSTALADO EM RAMAIS E SUB-RAMAIS DE GÁS - FORNECIMENTO E INSTALAÇÃO. AF_12/2015","UN",null,1,"-",null,null,0,0,""]
["S",3,"S",0,1,6,1,0,0,0,0,"","Serviço","Serviço","-","AGETOP",91031,"NIPLE DUPLO 300 PSI 3/4\"","Un    ",null,1,"-",null,null,0,0,""]
["S",3,"S",0,1,6,1,0,0,0,0,"","Serviço","Serviço","-","COMPOSIÇÃO","COMP 212_SEE","NIPLE DE REDUÇÃO 1/2\" X 1/4\" BSP","UN ",null,1,"-",null,null,0,0,""]
["S",3,"S",0,1,6,1,0,0,0,0,"","Serviço","Serviço","-","COMPOSIÇÃO","COMP 213_SEE","NIPLE DE REDUÇÃO 3/4\" X 1/2\" BSP","UN ",null,1,"-",null,null,0,0,""]
["S",3,"S",0,1,6,1,0,0,0,0,"","Serviço","Serviço","-","SINAPI",92688,"TUBO DE AÇO GALVANIZADO COM COSTURA, CLASSE MÉDIA, CONEXÃO ROSQUEADA, DN 20 (3/4\"), INSTALADO EM RAMAIS E SUB-RAMAIS DE GÁS - FORNECIMENTO E INSTALAÇÃO. AF_12/2015","M",null,1,"-",null,null,0,0,""]
["S",3,"S",0,1,6,1,0,0,0,0,"","Serviço","Serviço","-","SINAPI",92701,"JOELHO 90 GRAUS, EM FERRO GALVANIZADO, CONEXÃO ROSQUEADA, DN 20 (3/4\"), INSTALADO EM RAMAIS E SUB-RAMAIS DE GÁS - FORNECIMENTO E INSTALAÇÃO. AF_12/2015","UN",null,1,"-",null,null,0,0,""]
["S",3,"S",0,1,6,1,0,0,0,0,"","Serviço","Serviço","-","COMPOSIÇÃO","COMP 237_SEE","FITA ANTICORROSIVA","M",null,1,"-",null,null,0,0,""]
["S",3,"S",0,1,6,1,0,0,0,0,"","Serviço","Serviço","-","AGETOP",91025,"VÁLVULA ESFERICA LATÃO 3/4\"","Un    ",null,1,"-",null,null,0,0,""]
["S",3,"S",0,1,6,1,0,0,0,0,"","Serviço","Serviço","-","COMPOSIÇÃO","COMP 542_SEE","VÁLVULA UGV 3/4\" (S) LATÃO","UN ",null,1,"-",null,null,0,0,""]
["S",3,"S",0,1,6,1,0,0,0,0,"","Serviço","Serviço","-","COMPOSIÇÃO","COMP 543_SEE","VÁLVULA UGV 1/2\" (S) LATÃO","UN ",null,1,"-",null,null,0,0,""]
["S",3,"S",0,1,6,1,0,0,0,0,"","Serviço","Serviço","-","AGETOP",91029,"VALVULA DE RETENÇÃO LATÃO 1/2\" X 7/16\" NPT","Un    ",null,1,"-",null,null,0,0,""]
["S",3,"S",0,1,6,1,0,0,0,0,"","Serviço","Serviço","-","COMPOSIÇÃO","COMP 211_SEE","REGULADOR DE 2º ESTÁGIO 5KG/H","UN ",null,1,"-",null,null,0,0,""]
["S",3,"S",0,1,6,1,0,0,0,0,"","Serviço","Serviço","-","COMPOSIÇÃO","COMP 210_SEE","REGULADOR DE 1º ESTÁGIO 60KG/H MODELO AP-40  COM MANÔMETRO","UN ",null,1,"-",null,null,0,0,""]
["S",3,"S",0,1,6,1,0,0,0,0,"","Serviço","Serviço","-","AGETOP",85003,"EXTINTOR PO QUIMICO SECO (6 KG) - CAPACIDADE EXTINTORA 20 BC","Un    ",null,1,"-",null,null,0,0,""]
["S",3,"S",0,1,6,1,0,0,0,0,"","Serviço","Serviço","-","COMPOSIÇÃO","COMP 235_SEE","PLACA DE SINALIZAÇÃO EM PVC COD 01 - (300X300) PROIBIDO FUMAR","UN ",null,1,"-",null,null,0,0,""]
["S",3,"S",0,1,6,1,0,0,0,0,"","Serviço","Serviço","-","COMPOSIÇÃO","COMP 236_SEE","PLACA DE SINALIZAÇÃO EM PVC COD 06 - (300X300) PERIGO INFLAMÁVEL","UN ",null,1,"-",null,null,0,0,""]
["S",3,"S",0,1,6,1,0,0,0,0,"","Serviço","Serviço","-","AGETOP",91043,"BRAÇADEIRA METALICA TIPO \"D\" DIAM. 3/4\"","Un    ",null,1,"-",null,null,0,0,""]
["S",3,"S",0,1,6,1,0,0,0,0,"","Serviço","Serviço","-","AGETOP",71863,"PARAFUSO P/BUCHA S-10","Un    ",null,1,"-",null,null,0,0,""]
["S",3,"S",0,1,6,1,0,0,0,0,"","Serviço","Serviço","-","AGETOP",70393,"BUCHA DE NYLON S-10","Un    ",null,1,"-",null,null,0,0,""]
["S",3,"S",0,1,6,1,0,0,0,0,"","Serviço","Serviço","-","AGETOP",91045,"SUPORTE PARA COLETOR","Un    ",null,1,"-",null,null,0,0,""]
["S",3,"S",0,1,6,1,0,0,0,0,"","Serviço","Serviço","-","COMPOSIÇÃO","COMP 045_SEE","LAUDO DE ESTANQUEIDADE","UN ",null,1,"-",null,null,0,0,""]
["S",3,"S",0,1,6,1,0,0,0,0,"","Serviço","Serviço","-","COMPOSIÇÃO","COMP 277_SEE","MARCAÇÃO NO PISO - 1X1 M PARA EXTINTOR","M2",null,1,"-",null,null,0,0,""]
[3,3,3,15,1,6,2,0,0,15,61,"","Nível 3","Nível 3","-","SINAPI",null,"INSTALAÇÕES DE PREVENÇÃO E COMBATE A INCÊNDIO","-",null,1,"-",null,null,0,0,""]
["S",3,"S",0,1,6,2,0,0,0,0,"","Serviço","Serviço","-","AGETOP",85003,"EXTINTOR PO QUIMICO SECO (6 KG) - CAPACIDADE EXTINTORA 20 BC","Un    ",null,1,"-",null,null,0,0,""]
["S",3,"S",0,1,6,2,0,0,0,0,"","Serviço","Serviço","-","SINAPI","73775/2","EXTINTOR INCENDIO AGUA-PRESSURIZADA 10L INCL SUPORTE PAREDE CARGA     COMPLETA FORNECIMENTO E COLOCACAO","UN",null,1,"-",null,null,0,0,""]
["S",3,"S",0,1,6,2,0,0,0,0,"","Serviço","Serviço","-","AGETOP",85006,"EXTINTOR MULTI USO EM PO A B C (6 KG) - CAPACIDADE EXTINTORA 3A 20BC","un    ",null,1,"-",null,null,0,0,""]
["S",3,"S",0,1,6,2,0,0,0,0,"","Serviço","Serviço","-","COMPOSIÇÃO","COMP 188_SEE","ACIONADOR MANUAL DE ALARME","UN ",null,1,"-",null,null,0,0,""]
["S",3,"S",0,1,6,2,0,0,0,0,"","Serviço","Serviço","-","AGETOP",72338,"SIRENE METALICA ALCANCE 500 M","Un    ",null,1,"-",null,null,0,0,""]
["S",3,"S",0,1,6,2,0,0,0,0,"","Serviço","Serviço","-","COMPOSIÇÃO","COMP 190_SEE","CENTRAL DE DETECÇÃO E ALARME DE 40 SETORES COM BATERIA","UN ",null,1,"-",null,null,0,0,""]
["S",3,"S",0,1,6,2,0,0,0,0,"","Serviço","Serviço","-","SINAPI",97599,"LUMINÁRIA DE EMERGÊNCIA, COM 30 LÂMPADAS LED DE 2 W, SEM REATOR - FORNECIMENTO E INSTALAÇÃO. AF_02/2020","UN",null,1,"-",null,null,0,0,""]
["S",3,"S",0,1,6,2,0,0,0,0,"","Serviço","Serviço","-","COMPOSIÇÃO","COMP 024_SEE","SINALIZADOR FOTOLUMINESCENTE PARA EXTINTOR","UN ",null,1,"-",null,null,0,0,""]
["S",3,"S",0,1,6,2,0,0,0,0,"","Serviço","Serviço","-","COMPOSIÇÃO","COMP 025_SEE","SINALIZADOR FOTOLUMINESCENTE DE EMERGÊNCIA","UN ",null,1,"-",null,null,0,0,""]
["S",3,"S",0,1,6,2,0,0,0,0,"","Serviço","Serviço","-","COMPOSIÇÃO","COMP 277_SEE","MARCAÇÃO NO PISO - 1X1 M PARA EXTINTOR","M2",null,1,"-",null,null,0,0,""]
["S",3,"S",0,1,6,2,0,0,0,0,"","Serviço","Serviço","-","COMPOSIÇÃO","COMP 235_SEE","PLACA DE SINALIZAÇÃO EM PVC COD 01 - (300X300) PROIBIDO FUMAR","UN ",null,1,"-",null,null,0,0,""]
["S",3,"S",0,1,6,2,0,0,0,0,"","Serviço","Serviço","-","COMPOSIÇÃO","COMP 236_SEE","PLACA DE SINALIZAÇÃO EM PVC COD 06 - (300X300) PERIGO INFLAMÁVEL","UN ",null,1,"-",null,null,0,0,""]
["S",3,"S",0,1,6,2,0,0,0,0,"","Serviço","Serviço","-","COMPOSIÇÃO","COMP 411_SEE","PLACA DE SINALIZAÇÃO EM PVC COD 13 - (316X158) SAÍDA DE EMERGÊNCIA","UN ",null,1,"-",null,null,0,0,""]
["S",3,"S",0,1,6,2,0,0,0,0,"","Serviço","Serviço","-","COMPOSIÇÃO","COMP 412_SEE","PLACA DE SINALIZAÇÃO EM PVC COD 17 - (316X158) MENSAGEM \"SAÍDA\"","UN ",null,1,"-",null,null,0,0,""]
[{"$f":"CHOOSE(1+LOG(1+2*(ORÇAMENTO.Nivel=\"Nível 1\")+4*(ORÇAMENTO.Nivel=\"Nível 2\")+8*(ORÇAMENTO.Nivel=\"Nível 3\")+16*(ORÇAMENTO.Nivel=\"Nível 4\")+32*(ORÇAMENTO.Nivel=\"Serviço\"),2),0,1,2,3,4,\"S\")","v":2},{"$f":"IF(OR(C253=\"s\",C253=0),OFFSET(B253,-1,0),C253)","v":2},{"$f":"IF(OFFSET(C253,-1,0)=\"L\",1,IF(OFFSET(C253,-1,0)=1,2,IF(OR(A253=\"s\",A253=0),\"S\",IF(AND(OFFSET(C253,-1,0)=2,A253=4),3,IF(AND(OR(OFFSET(C253,-1,0)=\"s\",OFFSET(C253,-1,0)=0),A253<>\"s\",A253>OFFSET(B253,-1,0)),OFFSET(B253,-1,0),A253)))))","v":2},{"$f":"IF(OR(C253=\"S\",C253=0),0,IF(ISERROR(K253),J253,SMALL(J253:K253,1)))","v":5},{"$f":"IF($C253=1,OFFSET(E253,-1,0)+1,OFFSET(E253,-1,0))","v":1},{"$f":"IF($C253=1,0,IF($C253=2,OFFSET(F253,-1,0)+1,OFFSET(F253,-1,0)))","v":7},{"$f":"IF(AND($C253<=2,$C253<>0),0,IF($C253=3,OFFSET(G253,-1,0)+1,OFFSET(G253,-1,0)))","v":0},{"$f":"IF(AND($C253<=3,$C253<>0),0,IF($C253=4,OFFSET(H253,-1,0)+1,OFFSET(H253,-1,0)))","v":0},{"$f":"IF(AND($C253<=4,$C253<>0),0,IF(AND($C253=\"S\",$Y253>0),OFFSET(I253,-1,0)+1,OFFSET(I253,-1,0)))","v":0},110,5,{"$f":"IF(OR(Y253>0,$C253=1),\"F\",\"\")","v":""},"Nível 2",{"$f":"CHOOSE(1+LOG(1+2*(C253=1)+4*(C253=2)+8*(C253=3)+16*(C253=4)+32*(C253=\"S\"),2),\"\",\"Nível 1\",\"Nível 2\",\"Nível 3\",\"Nível 4\",\"Serviço\")","v":"Nível 2"},"-","AGETOP",91045,"ALVENARIAS E DIVISÓRIAS","Un    ",null,1,"-",null,null,0,0,""]
[3,3,3,2,1,7,1,0,0,4,2,"","Nível 3","Nível 3","-","SINAPI",null,"02 - ACESSIBILIDADE RAMPAS","-",null,1,"-",null,null,0,0,""]
["S",3,"S",0,1,7,1,0,0,0,0,"","Serviço","Serviço","-","AGETOP",100102,"ALVENARIA DE TIJOLO COMUM 1/2 VEZ - ARG. (1CI : 2CH : 8ARML)","m2    ",null,1,"-",null,null,0,0,""]
[3,3,3,2,1,7,2,0,0,2,43,"","Nível 3","Nível 3","-","SINAPI",null,"07 - ADEQUAÇÃO ADMINISTRATIVO","-",null,1,"-",null,null,0,0,""]
["S",3,"S",0,1,7,2,0,0,0,0,"","Serviço","Serviço","-","AGETOP",100102,"ALVENARIA DE TIJOLO COMUM 1/2 VEZ - ARG. (1CI : 2CH : 8ARML)","m2    ",null,1,"-",null,null,0,0,""]
[2,2,2,7,1,8,0,0,0,105,7,"","Nível 2","Nível 2","-",null,null,"COBERTURAS","-",null,1,"-",null,null,0,0,""]
[3,3,3,3,1,8,1,0,0,6,3,"","Nível 3","Nível 3","-","SINAPI",null,"FRIBROCIMENTO","-",null,1,"-",null,null,0,0,""]
[4,4,4,2,1,8,1,1,0,2,34,"","Nível 4","Nível 4","-","SINAPI",null,"14 - COBERTURA","-",null,1,"-",null,null,0,0,""]
["S",4,"S",0,1,8,1,1,0,0,0,"","Serviço","Serviço","-","AGETOP",160901,"COBERTURA COM TELHA CANALETE 90 OU EQUIV. COM ACESSÓRIOS","m2    ",null,1,"-",null,null,0,0,""]
[3,{"$f":"IF(OR(C262=\"s\",C262=0),OFFSET(B262,-1,0),C262)","v":3},{"$f":"IF(OFFSET(C262,-1,0)=\"L\",1,IF(OFFSET(C262,-1,0)=1,2,IF(OR(A262=\"s\",A262=0),\"S\",IF(AND(OFFSET(C262,-1,0)=2,A262=4),3,IF(AND(OR(OFFSET(C262,-1,0)=\"s\",OFFSET(C262,-1,0)=0),A262<>\"s\",A262>OFFSET(B262,-1,0)),OFFSET(B262,-1,0),A262)))))","v":3},{"$f":"IF(OR(C262=\"S\",C262=0),0,IF(ISERROR(K262),J262,SMALL(J262:K262,1)))","v":3},{"$f":"IF($C262=1,OFFSET(E262,-1,0)+1,OFFSET(E262,-1,0))","v":1},{"$f":"IF($C262=1,0,IF($C262=2,OFFSET(F262,-1,0)+1,OFFSET(F262,-1,0)))","v":8},{"$f":"IF(AND($C262<=2,$C262<>0),0,IF($C262=3,OFFSET(G262,-1,0)+1,OFFSET(G262,-1,0)))","v":2},{"$f":"IF(AND($C262<=3,$C262<>0),0,IF($C262=4,OFFSET(H262,-1,0)+1,OFFSET(H262,-1,0)))","v":0},{"$f":"IF(AND($C262<=4,$C262<>0),0,IF(AND($C262=\"S\",$Y262>0),OFFSET(I262,-1,0)+1,OFFSET(I262,-1,0)))","v":0},3,37,{"$f":"IF(OR(Y262>0,$C262=1),\"F\",\"\")","v":""},"Nível 3",{"$f":"CHOOSE(1+LOG(1+2*(C262=1)+4*(C262=2)+8*(C262=3)+16*(C262=4)+32*(C262=\"S\"),2),\"\",\"Nível 1\",\"Nível 2\",\"Nível 3\",\"Nível 4\",\"Serviço\")","v":"Nível 3"},"-",null,null,"CALHA E RUFO","-",null,1,"-",null,null,0,0,""]
[4,4,4,2,1,8,2,1,0,2,31,"","Nível 4","Nível 4","-","SINAPI",null,"06 - IMPLANTAÇÃO COZINHA","-",null,1,"-",null,null,0,0,""]
["S",4,"S",0,1,8,2,1,0,0,0,"","Serviço","Serviço","-","AGETOP",160601,"CALHA DE CHAPA GALVANIZADA","m     ",null,1,"-",null,null,0,0,""]
[2,2,2,9,1,9,0,0,0,98,9,"","Nível 2","Nível 2","-",null,null,"ESQUADRIAS METÁLICAS","-",null,1,"-",null,null,0,0,""]
[{"$f":"CHOOSE(1+LOG(1+2*(ORÇAMENTO.Nivel=\"Nível 1\")+4*(ORÇAMENTO.Nivel=\"Nível 2\")+8*(ORÇAMENTO.Nivel=\"Nível 3\")+16*(ORÇAMENTO.Nivel=\"Nível 4\")+32*(ORÇAMENTO.Nivel=\"Serviço\"),2),0,1,2,3,4,\"S\")","v":3},3,3,6,1,9,1,0,0,8,6,"","Nível 3","Nível 3","-","SINAPI",null,"02 - ACESSIBILIDADE RAMPAS","-",null,1,"-",null,null,0,0,""]
["S",3,"S",0,1,9,1,0,0,0,0,"","Serviço","Serviço","-","COMPOSIÇÃO","COMP 082_SEE","CORRIMÃO PAREDE - SEDUC","M",null,1,"-",null,null,0,0,""]
["S",3,"S",0,1,9,1,0,0,0,0,"","Serviço","Serviço","-","COMPOSIÇÃO","COMP 083_SEE","CORRIMÃO PISO - SEDUC","M",null,1,"-",null,null,0,0,""]
["S",3,"S",0,1,9,1,0,0,0,0,"","Serviço","Serviço","-","COMPOSIÇÃO","COMP 084_SEE","GUARDA-CORPO COM CORRIMÃO - SEDUC","M",null,1,"-",null,null,0,0,""]
["S",3,"S",0,1,9,1,0,0,0,0,"","Serviço","Serviço","-","COMPOSIÇÃO","COMP 085_SEE","GUARDA-CORPO - SEDUC","M",null,1,"-",null,null,0,0,""]
[{"$f":"CHOOSE(1+LOG(1+2*(ORÇAMENTO.Nivel=\"Nível 1\")+4*(ORÇAMENTO.Nivel=\"Nível 2\")+8*(ORÇAMENTO.Nivel=\"Nível 3\")+16*(ORÇAMENTO.Nivel=\"Nível 4\")+32*(ORÇAMENTO.Nivel=\"Serviço\"),2),0,1,2,3,4,\"S\")","v":"S"},3,"S",0,1,9,1,0,0,0,0,"","Serviço","Serviço","-","AGETOP",180309,"PORTAO CORRER / ABRIR CONJUGADO PT-8 C/FERRAGENS","m2    ",null,1,"-",null,null,0,0,""]
[3,3,3,2,1,9,2,0,0,2,27,"","Nível 3","Nível 3","-","SINAPI",null,"07 - ADEQUAÇÃO ADMINISTRATIVO","-",null,1,"-",null,null,0,0,""]
["S",3,"S",0,1,9,2,0,0,0,0,"","Serviço","Serviço","-","AGETOP",180380,"ESQ. MAXIMO AR CHAPA/VIDRO J4 C/FERRAGENS","m2    ",null,1,"-",null,null,0,0,""]
[{"$f":"CHOOSE(1+LOG(1+2*(ORÇAMENTO.Nivel=\"Nível 1\")+4*(ORÇAMENTO.Nivel=\"Nível 2\")+8*(ORÇAMENTO.Nivel=\"Nível 3\")+16*(ORÇAMENTO.Nivel=\"Nível 4\")+32*(ORÇAMENTO.Nivel=\"Serviço\"),2),0,1,2,3,4,\"S\")","v":2},2,2,3,1,10,0,0,0,89,3,"","Nível 2","Nível 2","-",null,null,"VIDROS","-",null,1,"-",null,null,0,0,""]
[3,3,3,2,1,10,1,0,0,2,6,"","Nível 3","Nível 3","-","SINAPI",null,"07 - ADEQUAÇÃO ADMINISTRATIVO","-",null,1,"-",null,null,0,0,""]
["S",3,"S",0,1,10,1,0,0,{"$f":"IF(OR($C276=\"S\",$C276=0),0,MATCH(0,OFFSET($D276,1,$C276,ROW($C$538)-ROW($C276)),0))","v":0},{"$f":"IF(OR($C276=\"S\",$C276=0),0,MATCH(OFFSET($D276,0,$C276)+1,OFFSET($D276,1,$C276,ROW($C$538)-ROW($C276)),0))","v":0},"","Serviço","Serviço","-","AGETOP",190102,"VIDRO LISO 4 MM - COLOCADO","m2    ",null,1,"-",null,null,0,0,""]
[2,2,2,7,1,11,0,0,0,86,7,"","Nível 2","Nível 2","-",null,null,"REVESTIMENTO DE PAREDE","-",null,1,"-",null,null,0,0,""]
[3,3,3,3,1,11,1,0,0,6,3,"","Nível 3","Nível 3","-","SINAPI",null,"02 - ACESSIBILIDADE RAMPAS","-",null,1,"-",null,null,0,0,""]
["S",3,"S",0,1,11,1,0,0,0,0,"","Serviço","Serviço","-","AGETOP",200101,"CHAPISCO COMUM","m2    ",null,1,"-",null,null,0,0,""]
["S",3,"S",0,1,11,1,0,0,0,0,"","Serviço","Serviço","-","AGETOP",200499,"REBOCO PAULISTA A-14 (1CALH:4ARMLC+100kgCI/M3)","m2    ",null,1,"-",null,null,0,0,""]
[3,3,3,3,1,11,2,0,0,3,18,"","Nível 3","Nível 3","-","SINAPI",null,"07 - ADEQUAÇÃO ADMINISTRATIVO","-",null,1,"-",null,null,0,0,""]
["S",3,"S",0,1,11,2,0,0,0,0,"","Serviço","Serviço","-","AGETOP",200101,"CHAPISCO COMUM","m2    ",null,1,"-",null,null,0,0,""]
["S",3,"S",0,1,11,2,0,0,0,0,"","Serviço","Serviço","-","AGETOP",200499,"REBOCO PAULISTA A-14 (1CALH:4ARMLC+100kgCI/M3)","m2    ",null,1,"-",null,null,0,0,""]
[2,2,2,4,1,12,0,0,0,79,4,"","Nível 2","Nível 2","-",null,null,"FORROS","-",null,1,"-",null,null,0,0,""]
[3,3,3,3,1,12,1,0,0,3,11,"","Nível 3","Nível 3","-","SINAPI",null,"PVC COM ESTRUTURA","-",null,1,"-",null,null,0,0,""]
[4,4,4,2,1,12,1,1,0,2,8,"","Nível 4","Nível 4","-","SINAPI",null,"08 - REFORMA BIBLIOTECA E SALA 04","-",null,1,"-",null,null,0,0,""]
["S",4,"S",0,1,12,1,1,0,0,0,"","Serviço","Serviço","-","AGETOP",210460,"FORRO DE PVC COM ESTRUTURA EM METALON PINTADA COM TINTA ALQUÍDICA D.F.","m2    ",null,1,"-",null,null,0,0,""]
[2,2,2,28,1,13,0,0,0,75,28,"","Nível 2","Nível 2","-",null,null,"REVESTIMENTO DE PISO","-",null,1,"-",null,null,0,0,""]
[3,3,3,7,1,13,1,0,0,27,7,"","Nível 3","Nível 3","-",null,null,"GRANITINA","-",null,1,"-",null,null,0,0,""]
[4,4,4,4,1,13,1,1,0,6,4,"","Nível 4","Nível 4","-","SINAPI",null,"13 - PISO","-",null,1,"-",null,null,0,0,""]
["S",4,"S",0,1,13,1,1,0,0,0,"","Serviço","Serviço","-","AGETOP",221101,"GRANITINA 8MM FUNDIDA COM CONTRAPISO (1CI:3ARML) E=2CM E JUNTA PLASTICA 27MM","m2    ",null,1,"-",null,null,0,0,""]
["S",4,"S",0,1,13,1,1,0,0,0,"","Serviço","Serviço","-","AGETOP",221102,"RODAPÉ FUNDIDO DE GRANITINA 7CM","m     ",null,1,"-",null,null,0,0,""]
["S",4,"S",0,1,13,1,1,0,0,0,"","Serviço","Serviço","-","AGETOP",221104,"RASPAGEM E APLICAÇÃO RESINA ACRÍLICA DUAS DEMÃOS","m2    ",null,1,"-",null,null,0,0,""]
[4,4,4,2,1,13,1,2,{"$f":"IF(AND($C294<=4,$C294<>0),0,IF(AND($C294=\"S\",$Y294>0),OFFSET(I294,-1,0)+1,OFFSET(I294,-1,0)))","v":0},2,10,"","Nível 4","Nível 4","-","SINAPI",null,"COMP. ELÉTRICO","-",null,1,"-",null,null,0,0,""]
["S",4,"S",0,1,13,1,2,{"$f":"IF(AND($C295<=4,$C295<>0),0,IF(AND($C295=\"S\",$Y295>0),OFFSET(I295,-1,0)+1,OFFSET(I295,-1,0)))","v":0},0,0,"","Serviço","Serviço","-","SINAPI",68325,"PISO EM CONCRETO 20 MPA PREPARO MECANICO, ESPESSURA 7CM, INCLUSO SELANTE ELASTICO A BASE DE POLIURETANO","M2",null,1,"-",null,null,0,0,""]
[3,{"$f":"IF(OR(C296=\"s\",C296=0),OFFSET(B296,-1,0),C296)","v":3},{"$f":"IF(OFFSET(C296,-1,0)=\"L\",1,IF(OFFSET(C296,-1,0)=1,2,IF(OR(A296=\"s\",A296=0),\"S\",IF(AND(OFFSET(C296,-1,0)=2,A296=4),3,IF(AND(OR(OFFSET(C296,-1,0)=\"s\",OFFSET(C296,-1,0)=0),A296<>\"s\",A296>OFFSET(B296,-1,0)),OFFSET(B296,-1,0),A296)))))","v":3},{"$f":"IF(OR(C296=\"S\",C296=0),0,IF(ISERROR(K296),J296,SMALL(J296:K296,1)))","v":3},{"$f":"IF($C296=1,OFFSET(E296,-1,0)+1,OFFSET(E296,-1,0))","v":1},{"$f":"IF($C296=1,0,IF($C296=2,OFFSET(F296,-1,0)+1,OFFSET(F296,-1,0)))","v":13},{"$f":"IF(AND($C296<=2,$C296<>0),0,IF($C296=3,OFFSET(G296,-1,0)+1,OFFSET(G296,-1,0)))","v":2},{"$f":"IF(AND($C296<=3,$C296<>0),0,IF($C296=4,OFFSET(H296,-1,0)+1,OFFSET(H296,-1,0)))","v":0},{"$f":"IF(AND($C296<=4,$C296<>0),0,IF(AND($C296=\"S\",$Y296>0),OFFSET(I296,-1,0)+1,OFFSET(I296,-1,0)))","v":0},20,3,{"$f":"IF(OR(Y296>0,$C296=1),\"F\",\"\")","v":""},"Nível 3",{"$f":"CHOOSE(1+LOG(1+2*(C296=1)+4*(C296=2)+8*(C296=3)+16*(C296=4)+32*(C296=\"S\"),2),\"\",\"Nível 1\",\"Nível 2\",\"Nível 3\",\"Nível 4\",\"Serviço\")","v":"Nível 3"},"-",null,null,"CERÂMICO","-",null,1,"-",null,null,0,0,""]
[4,4,4,2,1,13,2,1,0,2,5,"","Nível 4","Nível 4","-","SINAPI",null,"09 - REFORMA SANITÁRIOS FEM E MASC.","-",null,1,"-",null,null,0,0,""]
["S",4,"S",0,1,13,2,1,0,0,0,"","Serviço","Serviço","-","SINAPI",87251,"REVESTIMENTO CERÂMICO PARA PISO COM PLACAS TIPO ESMALTADA EXTRA DE DIMENSÕES 45X45 CM APLICADA EM AMBIENTES DE ÁREA MAIOR QUE 10 M2. AF_06/2014","M2",null,1,"-",null,null,0,0,""]
[3,3,3,13,1,13,3,0,0,17,13,"","Nível 3","Nível 3","-",null,null,"CONCRETO","-",null,1,"-",null,null,0,0,""]
[{"$f":"CHOOSE(1+LOG(1+2*(ORÇAMENTO.Nivel=\"Nível 1\")+4*(ORÇAMENTO.Nivel=\"Nível 2\")+8*(ORÇAMENTO.Nivel=\"Nível 3\")+16*(ORÇAMENTO.Nivel=\"Nível 4\")+32*(ORÇAMENTO.Nivel=\"Serviço\"),2),0,1,2,3,4,\"S\")","v":4},4,4,2,1,13,3,1,0,12,2,"","Nível 4","Nível 4","-","SINAPI",null,"02 - ACESSIBILIDADE RAMPAS","-",null,1,"-",null,null,0,0,""]
["S",4,"S",0,1,13,3,1,0,0,0,"","Serviço","Serviço","-","AGETOP",220102,"PISO CONCRETO DESEMPENADO ESPESSURA = 5 CM  1:2,5:3,5","m2    ",null,1,"-",null,null,0,0,""]
[4,4,4,2,1,13,3,2,0,10,2,"","Nível 4","Nível 4","-","SINAPI",null,"03 - ACESSIBILIDADE CALÇADA E PASSEIO","-",null,1,"-",null,null,0,0,""]
["S",4,"S",0,1,13,3,2,0,0,0,"","Serviço","Serviço","-","AGETOP",220102,"PISO CONCRETO DESEMPENADO ESPESSURA = 5 CM  1:2,5:3,5","m2    ",null,1,"-",null,null,0,0,""]
[{"$f":"CHOOSE(1+LOG(1+2*(ORÇAMENTO.Nivel=\"Nível 1\")+4*(ORÇAMENTO.Nivel=\"Nível 2\")+8*(ORÇAMENTO.Nivel=\"Nível 3\")+16*(ORÇAMENTO.Nivel=\"Nível 4\")+32*(ORÇAMENTO.Nivel=\"Serviço\"),2),0,1,2,3,4,\"S\")","v":4},4,4,2,1,13,3,3,0,8,2,"","Nível 4","Nível 4","-","SINAPI",null,"04 - ACESSIBILIDADE PISO TÁTIL","-",null,1,"-",null,null,0,0,""]
["S",4,"S",0,1,13,3,3,0,0,0,"","Serviço","Serviço","-","AGETOP",67010,"ESCARIFICAÇÃO MANUAL, CORTE DE CONCRETO ATÉ 3CM DE PROFUNDIDADE","m3    ",null,1,"-",null,null,0,0,""]
[4,4,4,2,1,13,3,4,0,6,2,"","Nível 4","Nível 4","-","SINAPI",null,"06 - IMPLANTAÇÃO COZINHA","-",null,1,"-",null,null,0,0,""]
["S",4,"S",0,1,13,3,4,0,0,0,"","Serviço","Serviço","-","AGETOP",220102,"PISO CONCRETO DESEMPENADO ESPESSURA = 5 CM  1:2,5:3,5","m2    ",null,1,"-",null,null,0,0,""]
[4,4,4,2,1,13,3,5,0,4,2,"","Nível 4","Nível 4","-","SINAPI",null,"COMP. HIDROSSANITÁRIO","-",null,1,"-",null,null,0,0,""]
["S",4,"S",0,1,13,3,5,0,0,0,"","Serviço","Serviço","-","AGETOP",220102,"PISO CONCRETO DESEMPENADO ESPESSURA = 5 CM  1:2,5:3,5","m2    ",null,1,"-",null,null,0,0,""]
[4,4,4,2,1,13,3,6,0,2,{"$error":"#N/A"},"","Nível 4","Nível 4","-","SINAPI",null,"COMP. GÁS","-",null,1,"-",null,null,0,0,""]
["S",4,"S",0,1,13,3,6,0,0,0,"","Serviço","Serviço","-","AGETOP",220102,"PISO CONCRETO DESEMPENADO ESPESSURA = 5 CM  1:2,5:3,5","m2    ",null,1,"-",null,null,0,0,""]
[{"$f":"CHOOSE(1+LOG(1+2*(ORÇAMENTO.Nivel=\"Nível 1\")+4*(ORÇAMENTO.Nivel=\"Nível 2\")+8*(ORÇAMENTO.Nivel=\"Nível 3\")+16*(ORÇAMENTO.Nivel=\"Nível 4\")+32*(ORÇAMENTO.Nivel=\"Serviço\"),2),0,1,2,3,4,\"S\")","v":3},3,3,4,1,13,4,0,0,4,31,"","Nível 3","Nível 3","-",null,null,"PODOTÁTIL","-",null,1,"-",null,null,0,0,""]
[4,4,4,3,1,13,4,1,0,3,11,"","Nível 4","Nível 4","-","SINAPI",null,"04 - ACESSIBILIDADE PISO TÁTIL","-",null,1,"-",null,null,0,0,""]
["S",4,"S",0,1,13,4,1,0,0,0,"","Serviço","Serviço","-","AGETOP",221126,"PISO DE LADRILHO HIDRÁULICO COLORIDO MODELO TÁTIL ( ALERTA OU DIRECIONAL) SEM LASTRO","m2    ",null,1,"-",null,null,0,0,""]
["S",4,"S",0,1,13,4,1,0,0,0,"","Serviço","Serviço","-","AGETOP",221120,"PISO DE BORRACHA COLORIDO MODELO TÁTIL ( ALERTA OU DIRECIONAL) INCLUSO CONTRAPISO (1CI:3ARML) C/ E=2CM E NATA DE CIMENTO","m2    ",null,1,"-",null,null,0,0,""]
[2,2,2,4,1,14,0,0,0,47,4,"","Nível 2","Nível 2","-",null,null,"ADMINISTRAÇÃO","-",null,1,"-",null,null,0,0,""]
[3,3,3,3,1,14,1,0,0,3,9,"","Nível 3","Nível 3","-",null,null,"MENSALISTAS","-",null,1,"-",null,null,0,0,""]
["S",3,"S",0,1,14,1,0,0,0,0,"","Serviço","Serviço","-","AGETOP",250101,"ENGENHEIRO - (OBRAS CIVIS)","H     ",null,1,"-",null,null,0,0,""]
["S",3,"S",0,1,14,1,0,0,0,0,"","Serviço","Serviço","-","AGETOP",250103,"ENCARREGADO - (OBRAS CIVIS)","H     ",null,1,"-",null,null,0,0,""]
[2,2,2,35,1,15,0,0,0,43,35,"","Nível 2","Nível 2","-",null,null,"PINTURA","-",null,1,"-",null,null,0,0,""]
[3,3,3,5,1,15,1,0,0,34,5,"","Nível 3","Nível 3","-",null,null,"ESMALTE SINTÉTICO","-",null,1,"-",null,null,0,0,""]
[4,4,4,2,1,15,1,1,0,4,2,"","Nível 4","Nível 4","-","SINAPI",null,"07 - ADEQUAÇÃO ADMINISTRATIVO","-",null,1,"-",null,null,0,0,""]
["S",4,"S",0,1,15,1,1,0,0,0,"","Serviço","Serviço","-","AGETOP",261550,"PINT.ESMALTE SINT.PAREDES - 2 DEM.C/SELADOR","m2    ",null,1,"-",null,null,0,0,""]
[4,4,4,2,1,15,1,2,0,2,{"$error":"#N/A"},"","Nível 4","Nível 4","-","SINAPI",null,"12 - PINTURA GERAL","-",null,1,"-",null,null,0,0,""]
["S",4,"S",0,1,15,1,2,0,0,0,"","Serviço","Serviço","-","AGETOP",261550,"PINT.ESMALTE SINT.PAREDES - 2 DEM.C/SELADOR","m2    ",null,1,"-",null,null,0,0,""]
[3,3,3,7,1,15,2,0,0,29,7,"","Nível 3","Nível 3","-","AGETOP",null,"LÁTEX ACRÍLICA","-",null,1,"-",null,null,0,0,""]
[{"$f":"CHOOSE(1+LOG(1+2*(ORÇAMENTO.Nivel=\"Nível 1\")+4*(ORÇAMENTO.Nivel=\"Nível 2\")+8*(ORÇAMENTO.Nivel=\"Nível 3\")+16*(ORÇAMENTO.Nivel=\"Nível 4\")+32*(ORÇAMENTO.Nivel=\"Serviço\"),2),0,1,2,3,4,\"S\")","v":4},4,4,3,1,15,2,1,0,6,3,"","Nível 4","Nível 4","-","SINAPI",null,"07 - ADEQUAÇÃO ADMINISTRATIVO","-",null,1,"-",null,null,0,0,""]
["S",4,"S",0,1,15,2,1,0,0,0,"","Serviço","Serviço","-","AGETOP",261300,"EMASSAMENTO COM MASSA PVA DUAS DEMAOS","m2    ",null,1,"-",null,null,0,0,""]
["S",4,"S",0,1,15,2,1,0,0,0,"","Serviço","Serviço","-","AGETOP",261001,"PINTURA LATEX ACRILICO 2 DEMAOS","m2    ",null,1,"-",null,null,0,0,""]
[4,4,4,3,1,15,2,2,0,3,{"$error":"#N/A"},"","Nível 4","Nível 4","-","SINAPI",null,"12 - PINTURA GERAL","-",null,1,"-",null,null,0,0,""]
[{"$f":"CHOOSE(1+LOG(1+2*(ORÇAMENTO.Nivel=\"Nível 1\")+4*(ORÇAMENTO.Nivel=\"Nível 2\")+8*(ORÇAMENTO.Nivel=\"Nível 3\")+16*(ORÇAMENTO.Nivel=\"Nível 4\")+32*(ORÇAMENTO.Nivel=\"Serviço\"),2),0,1,2,3,4,\"S\")","v":"S"},4,"S",0,1,15,2,2,0,0,0,"","Serviço","Serviço","-","AGETOP",260104,"REMOCAO DE PINTURA ANTIGA A LATEX","m2    ",null,1,"-",null,null,0,0,""]
["S",4,"S",0,1,15,2,2,0,0,0,"","Serviço","Serviço","-","AGETOP",261001,"PINTURA LATEX ACRILICO 2 DEMAOS","m2    ",null,1,"-",null,null,0,0,""]
[{"$f":"CHOOSE(1+LOG(1+2*(ORÇAMENTO.Nivel=\"Nível 1\")+4*(ORÇAMENTO.Nivel=\"Nível 2\")+8*(ORÇAMENTO.Nivel=\"Nível 3\")+16*(ORÇAMENTO.Nivel=\"Nível 4\")+32*(ORÇAMENTO.Nivel=\"Serviço\"),2),0,1,2,3,4,\"S\")","v":3},3,3,7,1,15,3,0,0,22,7,"","Nível 3","Nível 3","-","AGETOP",null,"TETO","-",null,1,"-",null,null,0,0,""]
[4,4,4,2,1,15,3,1,0,6,2,"","Nível 4","Nível 4","-","SINAPI",null,"07 - ADEQUAÇÃO ADMINISTRATIVO","-",null,1,"-",null,null,0,0,""]
["S",4,"S",0,1,15,3,1,0,0,0,"","Serviço","Serviço","-","AGETOP",261307,"PINTURA PVA LATEX 2 DEMAOS SEM SELADOR","m2    ",null,1,"-",null,null,0,0,""]
[4,4,4,4,1,15,3,2,0,4,{"$error":"#N/A"},"","Nível 4","Nível 4","-","SINAPI",null,"12 - PINTURA GERAL","-",null,1,"-",null,null,0,0,""]
["S",4,"S",0,1,15,3,2,0,0,0,"","Serviço","Serviço","-","AGETOP",260104,"REMOCAO DE PINTURA ANTIGA A LATEX","m2    ",null,1,"-",null,null,0,0,""]
["S",4,"S",0,1,15,3,2,0,0,0,"","Serviço","Serviço","-","AGETOP",261300,"EMASSAMENTO COM MASSA PVA DUAS DEMAOS","m2    ",null,1,"-",null,null,0,0,""]
["S",4,"S",0,1,15,3,2,0,0,0,"","Serviço","Serviço","-","AGETOP",261307,"PINTURA PVA LATEX 2 DEMAOS SEM SELADOR","m2    ",null,1,"-",null,null,0,0,""]
[3,3,3,3,1,15,4,0,0,{"$f":"IF(OR($C340=\"S\",$C340=0),0,MATCH(0,OFFSET($D340,1,$C340,ROW($C$538)-ROW($C340)),0))","v":15},{"$f":"IF(OR($C340=\"S\",$C340=0),0,MATCH(OFFSET($D340,0,$C340)+1,OFFSET($D340,1,$C340,ROW($C$538)-ROW($C340)),0))","v":3},"","Nível 3","Nível 3","-","AGETOP",null,"EXTERNA","-",null,1,"-",null,null,0,0,""]
[4,4,4,2,1,15,4,1,0,2,5,"","Nível 4","Nível 4","-","SINAPI",null,"12 - PINTURA GERAL","-",null,1,"-",null,null,0,0,""]
["S",4,"S",0,1,15,4,1,0,0,0,"","Serviço","Serviço","-","AGETOP",261000,"PINTURA LATEX ACRILICA 2 DEMAOS C/SELADOR","m2    ",null,1,"-",null,null,0,0,""]
[3,3,3,5,1,15,5,0,0,12,5,"","Nível 3","Nível 3","-","SINAPI",null,"ESQUADRIAS NOVAS","-",null,1,"-",null,null,0,0,""]
[4,4,4,2,1,15,5,1,0,4,2,"","Nível 4","Nível 4","-","SINAPI",null,"02 - ACESSIBILIDADE RAMPAS","-",null,1,"-",null,null,0,0,""]
["S",4,"S",0,1,15,5,1,0,0,0,"","Serviço","Serviço","-","AGETOP",261602,"PINT.ESMALTE/ESQUAD.FERRO C/FUNDO ANTICOR.","m2    ",null,1,"-",null,null,0,0,""]
[4,4,4,2,1,15,5,2,0,2,{"$error":"#N/A"},"","Nível 4","Nível 4","-","SINAPI",null,"07 - ADEQUAÇÃO ADMINISTRATIVO","-",null,1,"-",null,null,0,0,""]
["S",4,"S",0,1,15,5,2,0,0,0,"","Serviço","Serviço","-","AGETOP",261602,"PINT.ESMALTE/ESQUAD.FERRO C/FUNDO ANTICOR.","m2    ",null,1,"-",null,null,0,0,""]
[3,3,3,4,1,15,6,0,0,7,4,"","Nível 3","Nível 3","-","AGETOP",null,"ESQUADRIAS EXISTENTES","-",null,1,"-",null,null,0,0,""]
[4,4,4,3,1,15,6,1,0,3,{"$error":"#N/A"},"","Nível 4","Nível 4","-","SINAPI",null,"12 - PINTURA GERAL","-",null,1,"-",null,null,0,0,""]
["S",4,"S",0,1,15,6,1,0,0,0,"","Serviço","Serviço","-","AGETOP",260105,"REMOCAO DE PINTURA ANTIGA A OLEO OU ESMALTE","m2    ",null,1,"-",null,null,0,0,""]
["S",4,"S",0,1,15,6,1,0,0,0,"","Serviço","Serviço","-","AGETOP",261602,"PINT.ESMALTE/ESQUAD.FERRO C/FUNDO ANTICOR.","m2    ",null,1,"-",null,null,0,0,""]
[3,3,3,3,1,15,7,0,0,3,{"$error":"#N/A"},"","Nível 3","Nível 3","-","SINAPI",null,"QUADRA DE ESPORTES","-",null,1,"-",null,null,0,0,""]
["S",3,"S",0,1,15,7,0,0,0,0,"","Serviço","Serviço","-","AGETOP",261703,"PINT.POLIESPORTIVA - 2 DEM.(PISOS E CIMENTADOS)","m2    ",null,1,"-",null,null,0,0,""]
["S",3,"S",0,1,15,7,0,0,0,0,"","Serviço","Serviço","-","AGETOP",261000,"PINTURA LATEX ACRILICA 2 DEMAOS C/SELADOR","m2    ",null,1,"-",null,null,0,0,""]
[2,{"$f":"IF(OR(C355=\"s\",C355=0),OFFSET(B355,-1,0),C355)","v":2},{"$f":"IF(OFFSET(C355,-1,0)=\"L\",1,IF(OFFSET(C355,-1,0)=1,2,IF(OR(A355=\"s\",A355=0),\"S\",IF(AND(OFFSET(C355,-1,0)=2,A355=4),3,IF(AND(OR(OFFSET(C355,-1,0)=\"s\",OFFSET(C355,-1,0)=0),A355<>\"s\",A355>OFFSET(B355,-1,0)),OFFSET(B355,-1,0),A355)))))","v":2},{"$f":"IF(OR(C355=\"S\",C355=0),0,IF(ISERROR(K355),J355,SMALL(J355:K355,1)))","v":8},{"$f":"IF($C355=1,OFFSET(E355,-1,0)+1,OFFSET(E355,-1,0))","v":1},{"$f":"IF($C355=1,0,IF($C355=2,OFFSET(F355,-1,0)+1,OFFSET(F355,-1,0)))","v":16},{"$f":"IF(AND($C355<=2,$C355<>0),0,IF($C355=3,OFFSET(G355,-1,0)+1,OFFSET(G355,-1,0)))","v":0},{"$f":"IF(AND($C355<=3,$C355<>0),0,IF($C355=4,OFFSET(H355,-1,0)+1,OFFSET(H355,-1,0)))","v":0},{"$f":"IF(AND($C355<=4,$C355<>0),0,IF(AND($C355=\"S\",$Y355>0),OFFSET(I355,-1,0)+1,OFFSET(I355,-1,0)))","v":0},8,164,{"$f":"IF(OR(Y355>0,$C355=1),\"F\",\"\")","v":""},"Nível 2",{"$f":"CHOOSE(1+LOG(1+2*(C355=1)+4*(C355=2)+8*(C355=3)+16*(C355=4)+32*(C355=\"S\"),2),\"\",\"Nível 1\",\"Nível 2\",\"Nível 3\",\"Nível 4\",\"Serviço\")","v":"Nível 2"},"-",null,null,"DIVERSOS","-",null,1,"-",null,null,0,0,""]
[3,3,3,2,1,16,1,0,0,7,2,"","Nível 3","Nível 3","-","SINAPI",null,"08 - REFORMA BIBLIOTECA E SALA 04","-",null,1,"-",null,null,0,0,""]
["S",3,"S",0,1,16,1,0,0,0,0,"","Serviço","Serviço","-","AGETOP",270210,"PLANTIO GRAMA ESMERALDA PLACA C/ M.O. IRRIG., ADUBO,TERRA VEGETAL (O.C.) A<11.000,00M2","m2    ",null,1,"-",null,null,0,0,""]
[{"$f":"CHOOSE(1+LOG(1+2*(ORÇAMENTO.Nivel=\"Nível 1\")+4*(ORÇAMENTO.Nivel=\"Nível 2\")+8*(ORÇAMENTO.Nivel=\"Nível 3\")+16*(ORÇAMENTO.Nivel=\"Nível 4\")+32*(ORÇAMENTO.Nivel=\"Serviço\"),2),0,1,2,3,4,\"S\")","v":3},3,3,3,1,16,2,0,0,5,3,"","Nível 3","Nível 3","-","SINAPI",null,"07 - ADEQUAÇÃO ADMINISTRATIVO","-",null,1,"-",null,null,0,0,""]
["S",3,"S",0,1,16,2,0,0,0,0,"","Serviço","Serviço","-","AGETOP",60010,"VERGA/CONTRAVERGA EM CONCRETO ARMADO FCK = 20 MPA","m3    ",null,1,"-",null,null,0,0,""]
["S",3,"S",0,1,16,2,0,0,0,0,"","Serviço","Serviço","-","COMPOSIÇÃO","COMP 415_SEE","PEITORIL EM GRANITO CINZA, LARGURA VARIÁVEL E PINGADEIRA","M2",null,1,"-",null,null,0,0,""]
[{"$f":"CHOOSE(1+LOG(1+2*(ORÇAMENTO.Nivel=\"Nível 1\")+4*(ORÇAMENTO.Nivel=\"Nível 2\")+8*(ORÇAMENTO.Nivel=\"Nível 3\")+16*(ORÇAMENTO.Nivel=\"Nível 4\")+32*(ORÇAMENTO.Nivel=\"Serviço\"),2),0,1,2,3,4,\"S\")","v":3},3,3,2,1,16,3,0,0,2,170,"","Nível 3","Nível 3","-","SINAPI",null,"LIMPEZA","-",null,1,"-",null,null,0,0,""]
[{"$f":"CHOOSE(1+LOG(1+2*(ORÇAMENTO.Nivel=\"Nível 1\")+4*(ORÇAMENTO.Nivel=\"Nível 2\")+8*(ORÇAMENTO.Nivel=\"Nível 3\")+16*(ORÇAMENTO.Nivel=\"Nível 4\")+32*(ORÇAMENTO.Nivel=\"Serviço\"),2),0,1,2,3,4,\"S\")","v":"S"},3,"S",0,1,16,3,0,0,0,0,"","Serviço","Serviço","-","AGETOP",270501,"LIMPEZA FINAL DE OBRA - (OBRAS CIVIS)","m2    ",null,1,"-",null,null,0,0,""]
[1,1,1,175,2,0,0,0,0,175,{"$error":"#N/A"},"F","Nível 1","Nível 1","2.","AGETOP",null,"COZINHA SEDUC OPÇÃO 2","UN",null,0,0,null,null,0,0,""]
[2,2,2,2,2,1,0,0,0,174,2,"","Nível 2","Nível 2","-","AGETOP",null,"SERVIÇOS PRELIMINARES","-",null,0,"-",null,null,0,0,""]
["S",2,"S",0,2,1,0,0,0,0,0,"","Serviço","Serviço","-","AGETOP",20701,"LOCAÇÃO DA OBRA, EXECUÇÃO DE GABARITO SEM REAPROVEITAMENTO, INCLUSO PINTURA (FACE INTERNA DO RIPÃO 15CM) E PIQUETE COM TESTEMUNHA","m2    ",null,0,"-",null,null,0,0,""]
[2,2,2,3,2,2,0,0,0,172,3,"","Nível 2","Nível 2","-","AGETOP",null,"TRANSPORTES","-",null,0,"-",null,null,0,0,""]
[{"$f":"CHOOSE(1+LOG(1+2*(ORÇAMENTO.Nivel=\"Nível 1\")+4*(ORÇAMENTO.Nivel=\"Nível 2\")+8*(ORÇAMENTO.Nivel=\"Nível 3\")+16*(ORÇAMENTO.Nivel=\"Nível 4\")+32*(ORÇAMENTO.Nivel=\"Serviço\"),2),0,1,2,3,4,\"S\")","v":"S"},2,"S",0,2,2,0,0,0,0,0,"","Serviço","Serviço","-","SINAPI",72900,"TRANSPORTE DE ENTULHO COM CAMINHAO BASCULANTE 6 M3, RODOVIA PAVIMENTADA, DMT 0,5 A 1,0 KM","M3",null,0,"-",null,null,0,0,""]
["S",2,"S",0,2,2,0,0,0,0,0,"","Serviço","Serviço","-","SINAPI",72897,"CARGA MANUAL DE ENTULHO EM CAMINHAO BASCULANTE 6 M3","M3",null,0,"-",null,null,0,0,""]
[2,2,2,3,2,3,0,0,0,169,3,"","Nível 2","Nível 2","-","AGETOP",null,"SERVIÇO EM TERRA","-",null,0,"-",null,null,0,0,""]
["S",2,"S",0,2,3,0,0,0,0,0,"","Serviço","Serviço","-","AGETOP",41003,"ATERRO INTERNO SEM APILOAM.C/TR.EM CARRINHO MÃO","m3    ",null,0,"-",null,null,0,0,""]
["S",2,"S",0,2,3,0,0,0,0,0,"","Serviço","Serviço","-","AGETOP",41002,"APILOAMENTO","m2    ",null,0,"-",null,null,0,0,""]
[2,2,2,12,2,4,0,0,0,166,12,"","Nível 2","Nível 2","-","AGETOP",null,"FUNDAÇÕES E SONDAGENS","-",null,0,"-",null,null,0,0,""]
[3,3,3,11,2,4,1,0,0,11,18,"","Nível 3","Nível 3","-","SINAPI",null,"BLOCOS SOBRE ESTACAS","-",null,0,"-",null,null,0,0,""]
["S",3,"S",0,2,4,1,0,0,0,0,"","Serviço","Serviço","-","AGETOP",50302,"ESTACA A TRADO DIAM.30 CM SEM FERRO","M     ",null,0,"-",null,null,0,0,""]
["S",3,"S",0,2,4,1,0,0,0,0,"","Serviço","Serviço","-","AGETOP",50902,"APILOAMENTO (BLOCOS/SAPATAS)","m2    ",null,0,"-",null,null,0,0,""]
["S",3,"S",0,2,4,1,0,0,0,0,"","Serviço","Serviço","-","AGETOP",50901,"ESCAVACAO MANUAL DE VALAS (SAPATAS/BLOCOS)","m3    ",null,0,"-",null,null,0,0,""]
["S",3,"S",0,2,4,1,0,0,0,0,"","Serviço","Serviço","-","SINAPI",96616,"LASTRO DE CONCRETO MAGRO, APLICADO EM BLOCOS DE COROAMENTO OU SAPATAS. AF_08/2017","M3",null,0,"-",null,null,0,0,""]
["S",3,"S",0,2,4,1,0,0,0,0,"","Serviço","Serviço","-","SINAPI",94963,"CONCRETO FCK = 15MPA, TRAÇO 1:3,4:3,5 (CIMENTO/ AREIA MÉDIA/ BRITA 1)  - PREPARO MECÂNICO COM BETONEIRA 400 L. AF_07/2016","M3",null,0,"-",null,null,0,0,""]
["S",3,"S",0,2,4,1,0,0,0,0,"","Serviço","Serviço","-","AGETOP",51026,"LANÇAMENTO/APLICAÇÃO/ADENSAMENTO DE CONCRETO EM FUNDAÇÃO- (O.C.)","m3    ",null,0,"-",null,null,0,0,""]
["S",3,"S",0,2,4,1,0,0,0,0,"","Serviço","Serviço","-","AGETOP",52003,"ACO CA-50A - 6,3 MM (1/4\") - (OBRAS CIVIS)","Kg    ",null,0,"-",null,null,0,0,""]
["S",3,"S",0,2,4,1,0,0,0,0,"","Serviço","Serviço","-","AGETOP",52004,"ACO CA 50-A - 8,0 MM (5/16\") - (OBRAS CIVIS)","Kg    ",null,0,"-",null,null,0,0,""]
["S",3,"S",0,2,4,1,0,0,0,0,"","Serviço","Serviço","-","AGETOP",52005,"ACO CA-50A - 10,0 MM (3/8\") - (OBRAS CIVIS)","Kg    ",null,0,"-",null,null,0,0,""]
["S",3,"S",0,2,4,1,0,0,0,0,"","Serviço","Serviço","-","AGETOP",52014,"ACO CA-60 - 5,0 MM - (OBRAS CIVIS)","Kg    ",null,0,"-",null,null,0,0,""]
[2,2,2,21,2,5,0,0,0,154,21,"","Nível 2","Nível 2","-","AGETOP",null,"ESTRUTURA","-",null,0,"-",null,null,0,0,""]
[3,3,3,6,2,5,1,0,0,20,6,"","Nível 3","Nível 3","-","SINAPI",null,"PILARES","-",null,0,"-",null,null,0,0,""]
["S",3,"S",0,2,5,1,0,0,0,0,"","Serviço","Serviço","-","SINAPI",92426,"MONTAGEM E DESMONTAGEM DE FÔRMA DE PILARES RETANGULARES E ESTRUTURAS SIMILARES COM ÁREA MÉDIA DAS SEÇÕES MENOR OU IGUAL A 0,25 M², PÉ-DIREITO SIMPLES, EM CHAPA DE MADEIRA COMPENSADA RESINADA, 8 UTILIZAÇÕES. AF_12/2015","M2",null,0,"-",null,null,0,0,""]
["S",3,"S",0,2,5,1,0,0,0,0,"","Serviço","Serviço","-","SINAPI",94964,"CONCRETO FCK = 20MPA, TRAÇO 1:2,7:3 (CIMENTO/ AREIA MÉDIA/ BRITA 1)  - PREPARO MECÂNICO COM BETONEIRA 400 L. AF_07/2016","M3",null,0,"-",null,null,0,0,""]
["S",3,"S",0,2,5,1,0,0,0,0,"","Serviço","Serviço","-","SINAPI",92873,"LANÇAMENTO COM USO DE BALDES, ADENSAMENTO E ACABAMENTO DE CONCRETO EM ESTRUTURAS. AF_12/2015","M3",null,0,"-",null,null,0,0,"Referência: AGETOP - 60801"]
["S",3,"S",0,2,5,1,0,0,0,0,"","Serviço","Serviço","-","SINAPI",92778,"ARMAÇÃO DE PILAR OU VIGA DE UMA ESTRUTURA CONVENCIONAL DE CONCRETO ARMADO EM UMA EDIFICAÇÃO TÉRREA OU SOBRADO UTILIZANDO AÇO CA-50 DE 10,0 MM - MONTAGEM. AF_12/2015","KG",null,0,"-",null,null,0,0,"Referência: AGETOP - 60305"]
["S",3,"S",0,2,5,1,0,0,0,0,"","Serviço","Serviço","-","SINAPI",92775,"ARMAÇÃO DE PILAR OU VIGA DE UMA ESTRUTURA CONVENCIONAL DE CONCRETO ARMADO EM UMA EDIFICAÇÃO TÉRREA OU SOBRADO UTILIZANDO AÇO CA-60 DE 5,0 MM - MONTAGEM. AF_12/2015","KG",null,0,"-",null,null,0,0,"Referência: AGETOP - 60314"]
[3,3,3,6,2,5,2,0,0,{"$f":"IF(OR($C391=\"S\",$C391=0),0,MATCH(0,OFFSET($D391,1,$C391,ROW($C$538)-ROW($C391)),0))","v":14},{"$f":"IF(OR($C391=\"S\",$C391=0),0,MATCH(OFFSET($D391,0,$C391)+1,OFFSET($D391,1,$C391,ROW($C$538)-ROW($C391)),0))","v":6},"","Nível 3","Nível 3","-",null,null,"VIGAS BALDRAMES","-",null,0,"-",null,null,0,0,""]
["S",3,"S",0,2,5,2,0,0,0,0,"","Serviço","Serviço","-","AGETOP",60209,"FORMA CH.COMPENSADA 12MM-VIGA/PILAR U=4V - (OBRAS CIVIS","m2    ",null,0,"-",null,null,0,0,""]
["S",3,"S",0,2,5,2,0,0,0,0,"","Serviço","Serviço","-","SINAPI",94964,"CONCRETO FCK = 20MPA, TRAÇO 1:2,7:3 (CIMENTO/ AREIA MÉDIA/ BRITA 1)  - PREPARO MECÂNICO COM BETONEIRA 400 L. AF_07/2016","M3",null,0,"-",null,null,0,0,""]
["S",3,"S",0,2,5,2,0,0,0,0,"","Serviço","Serviço","-","AGETOP",60801,"LANÇAMENTO/APLICAÇÃO/ADENSAMENTO MANUAL DE CONCRETO - (OBRAS CIVIS)","m3    ",null,0,"-",null,null,0,0,""]
["S",3,"S",0,2,5,2,0,0,0,0,"","Serviço","Serviço","-","AGETOP",60304,"ACO CA-50 A - 8,0 MM (5/16\") - (OBRAS CIVIS)","Kg    ",null,0,"-",null,null,0,0,""]
["S",3,"S",0,2,5,2,0,0,0,0,"","Serviço","Serviço","-","AGETOP",60314,"ACO CA - 60 - 5,0 MM - (OBRAS CIVIS)","Kg    ",null,0,"-",null,null,0,0,""]
[3,3,3,8,2,5,3,0,0,8,134,"","Nível 3","Nível 3","-","SINAPI",null,"VIGAS DA COBERTURA E LAJE PRÉ-MOLDADA","-",null,0,"-",null,null,0,0,""]
["S",3,"S",0,2,5,3,0,0,0,0,"","Serviço","Serviço","-","AGETOP",60209,"FORMA CH.COMPENSADA 12MM-VIGA/PILAR U=4V - (OBRAS CIVIS","m2    ",null,0,"-",null,null,0,0,""]
[{"$f":"CHOOSE(1+LOG(1+2*(ORÇAMENTO.Nivel=\"Nível 1\")+4*(ORÇAMENTO.Nivel=\"Nível 2\")+8*(ORÇAMENTO.Nivel=\"Nível 3\")+16*(ORÇAMENTO.Nivel=\"Nível 4\")+32*(ORÇAMENTO.Nivel=\"Serviço\"),2),0,1,2,3,4,\"S\")","v":"S"},3,"S",0,2,5,3,0,0,0,0,"","Serviço","Serviço","-","SINAPI","74202/1","LAJE PRE-MOLDADA P/FORRO, SOBRECARGA 100KG/M2, VAOS ATE 3,50M/E=8CM, C/LAJOTAS E CAP.C/CONC FCK=20MPA, 3CM, INTER-EIXO 38CM, C/ESCORAMENTO (REAPR.3X) E FERRAGEM NEGATIVA","M2",null,0,"-",null,null,0,0,""]
["S",3,"S",0,2,5,3,0,0,0,0,"","Serviço","Serviço","-","SINAPI",92723,"CONCRETAGEM DE VIGAS E LAJES, FCK=20 MPA, PARA LAJES PREMOLDADAS COM USO DE BOMBA EM EDIFICAÇÃO COM ÁREA MÉDIA DE LAJES MENOR OU IGUAL A 20 M² - LANÇAMENTO, ADENSAMENTO E ACABAMENTO. AF_12/2015","M3",null,0,"-",null,null,0,0,""]
["S",3,"S",0,2,5,3,0,0,0,0,"","Serviço","Serviço","-","AGETOP",60801,"LANÇAMENTO/APLICAÇÃO/ADENSAMENTO MANUAL DE CONCRETO - (OBRAS CIVIS)","m3    ",null,0,"-",null,null,0,0,""]
["S",3,"S",0,2,5,3,0,0,0,0,"","Serviço","Serviço","-","AGETOP",60305,"ACO CA-50A - 10,0 MM (3/8\") - (OBRAS CIVIS)","Kg    ",null,0,"-",null,null,0,0,""]
["S",3,"S",0,2,5,3,0,0,0,0,"","Serviço","Serviço","-","AGETOP",60304,"ACO CA-50 A - 8,0 MM (5/16\") - (OBRAS CIVIS)","Kg    ",null,0,"-",null,null,0,0,""]
["S",3,"S",0,2,5,3,0,0,0,0,"","Serviço","Serviço","-","AGETOP",60314,"ACO CA - 60 - 5,0 MM - (OBRAS CIVIS)","Kg    ",null,0,"-",null,null,0,0,""]
[2,2,2,26,2,6,0,0,0,133,26,"","Nível 2","Nível 2","-",null,null,"INSTALAÇÕES ELÉTRICAS","-",null,0,"-",null,null,0,0,""]
["S",2,"S",0,2,6,0,0,0,0,0,"","Serviço","Serviço","-","AGETOP",70421,"BUCHA E ARRUELA METALICA DIAM. 3/4\"","PR    ",null,0,"-",null,null,0,0,""]
["S",2,"S",0,2,6,0,0,0,0,0,"","Serviço","Serviço","-","AGETOP",70580,"CABO PVC (70ºC) 1 KV No 1,5 MM2","M     ",null,0,"-",null,null,0,0,""]
["S",2,"S",0,2,6,0,0,0,0,0,"","Serviço","Serviço","-","AGETOP",70581,"CABO PVC (70ºC) 1 KV No. 2,5 MM2","M     ",null,0,"-",null,null,0,0,""]
["S",2,"S",0,2,6,0,0,0,0,0,"","Serviço","Serviço","-","AGETOP",70583,"CABO PVC (70ºC) 1 KV No. 6 MM2","M     ",null,0,"-",null,null,0,0,""]
["S",2,"S",0,2,6,0,0,0,0,0,"","Serviço","Serviço","-","AGETOP",70680,"CAIXA MET.HEXAGONAL P/ARANDELA (SEXTAVADA 3\"X3\")","Un    ",null,0,"-",null,null,0,0,""]
["S",2,"S",0,2,6,0,0,0,0,0,"","Serviço","Serviço","-","AGETOP",70691,"CAIXA METALICA RET. 4\" X 2\" X 2\"","Un    ",null,0,"-",null,null,0,0,""]
["S",2,"S",0,2,6,0,0,0,0,0,"","Serviço","Serviço","-","AGETOP",71141,"CURVA DE 90 GRAUS DE PVC RIGIDO DIAM. 3/4\"","Un    ",null,0,"-",null,null,0,0,""]
["S",2,"S",0,2,6,0,0,0,0,0,"","Serviço","Serviço","-","SINAPI",93653,"DISJUNTOR MONOPOLAR TIPO DIN, CORRENTE NOMINAL DE 10A - FORNECIMENTO E INSTALAÇÃO. AF_04/2016","UN",null,0,"-",null,null,0,0,""]
["S",2,"S",0,2,6,0,0,0,0,0,"","Serviço","Serviço","-","SINAPI",93654,"DISJUNTOR MONOPOLAR TIPO DIN, CORRENTE NOMINAL DE 16A - FORNECIMENTO E INSTALAÇÃO. AF_04/2016","UN",null,0,"-",null,null,0,0,""]
["S",2,"S",0,2,6,0,0,0,0,0,"","Serviço","Serviço","-","AGETOP",71450,"INTERRUPTOR DIFERENCIAL RESIDUAL (D.R.) BIPOLAR DE 25A-30mA","Un    ",null,0,"-",null,null,0,0,""]
["S",2,"S",0,2,6,0,0,0,0,0,"","Serviço","Serviço","-","SINAPI",91844,"ELETRODUTO FLEXÍVEL CORRUGADO, PVC, DN 25 MM (3/4\"), PARA CIRCUITOS TERMINAIS, INSTALADO EM LAJE - FORNECIMENTO E INSTALAÇÃO. AF_12/2015","M",null,0,"-",null,null,0,0,""]
["S",2,"S",0,2,6,0,0,0,0,0,"","Serviço","Serviço","-","SINAPI",91846,"ELETRODUTO FLEXÍVEL CORRUGADO, PVC, DN 32 MM (1\"), PARA CIRCUITOS TERMINAIS, INSTALADO EM LAJE - FORNECIMENTO E INSTALAÇÃO. AF_12/2015","M",null,0,"-",null,null,0,0,""]
["S",2,"S",0,2,6,0,0,0,0,0,"","Serviço","Serviço","-","AGETOP",71197,"ELETRODUTO PVC FLEXÍVEL - MANGUEIRA CORRUGADA REFORÇADA - DIAM. 50MM","M     ",null,0,"-",null,null,0,0,""]
["S",2,"S",0,2,6,0,0,0,0,0,"","Serviço","Serviço","-","SINAPI",97617,"LÂMPADA TUBULAR FLUORESCENTE T10 DE 20/40 W, BASE G13 - FORNECIMENTO E INSTALAÇÃO. AF_02/2020_P","UN",null,0,"-",null,null,0,0,""]
["S",2,"S",0,2,6,0,0,0,0,0,"","Serviço","Serviço","-","SINAPI",100922,"REATOR DE PARTIDA RÁPIDA PARA LÂMPADA FLUORESCENTE 1X20W - FORNECIMENTO E INSTALAÇÃO. AF_02/2020","UN",null,0,"-",null,null,0,0,""]
["S",2,"S",0,2,6,0,0,0,0,0,"","Serviço","Serviço","-","SINAPI",100923,"REATOR DE PARTIDA RÁPIDA PARA LÂMPADA FLUORESCENTE 1X40W - FORNECIMENTO E INSTALAÇÃO. AF_02/2020","UN",null,0,"-",null,null,0,0,""]
["S",2,"S",0,2,6,0,0,0,0,0,"","Serviço","Serviço","-","AGETOP",72341,"SOQUETE ANTIVIBRATORIO P/LAMP.FLUORESCENTE","Un    ",null,0,"-",null,null,0,0,""]
["S",2,"S",0,2,6,0,0,0,{"$f":"IF(OR($C423=\"S\",$C423=0),0,MATCH(0,OFFSET($D423,1,$C423,ROW($C$538)-ROW($C423)),0))","v":0},{"$f":"IF(OR($C423=\"S\",$C423=0),0,MATCH(OFFSET($D423,0,$C423)+1,OFFSET($D423,1,$C423,ROW($C$538)-ROW($C423)),0))","v":0},"","Serviço","Serviço","-","AGETOP",71431,"INTERRUPTOR PARALELO SIMPLES (1 SECAO)","Un    ",null,0,"-",null,null,0,0,""]
["S",2,"S",0,2,6,0,0,0,0,0,"","Serviço","Serviço","-","AGETOP",71440,"INTERRUPTOR SIMPLES (1 SECAO)","Un    ",null,0,"-",null,null,0,0,""]
["S",2,"S",0,2,6,0,0,0,0,0,"","Serviço","Serviço","-","AGETOP",71441,"INTERRUPTOR SIMPLES (2 SECOES)","Un    ",null,0,"-",null,null,0,0,""]
[{"$f":"CHOOSE(1+LOG(1+2*(ORÇAMENTO.Nivel=\"Nível 1\")+4*(ORÇAMENTO.Nivel=\"Nível 2\")+8*(ORÇAMENTO.Nivel=\"Nível 3\")+16*(ORÇAMENTO.Nivel=\"Nível 4\")+32*(ORÇAMENTO.Nivel=\"Serviço\"),2),0,1,2,3,4,\"S\")","v":"S"},2,"S",0,2,6,0,0,{"$f":"IF(AND($C426<=4,$C426<>0),0,IF(AND($C426=\"S\",$Y426>0),OFFSET(I426,-1,0)+1,OFFSET(I426,-1,0)))","v":0},0,0,"","Serviço","Serviço","-","AGETOP",71380,"HASTE REV.COBRE(COPPERWELD)  3/4\" X 2,40 M C/CONECTOR","Un    ",null,0,"-",null,null,0,0,""]
["S",2,"S",0,2,6,0,0,0,0,0,"","Serviço","Serviço","-","AGETOP",71567,"LAMPADA COMPACTA ELETRÔNICA COM REATOR INTEGRADO 15 W","Un    ",null,0,"-",null,null,0,0,""]
["S",2,"S",0,2,6,0,0,0,0,0,{"$f":"IF(OR(Y428>0,$C428=1),\"F\",\"\")","v":""},"Serviço",{"$f":"CHOOSE(1+LOG(1+2*(C428=1)+4*(C428=2)+8*(C428=3)+16*(C428=4)+32*(C428=\"S\"),2),\"\",\"Nível 1\",\"Nível 2\",\"Nível 3\",\"Nível 4\",\"Serviço\")","v":"Serviço"},"-","AGETOP",72190,"QUADRO DE DISTRIBUIÇÃO DE EMBUTIR METÁLICO CB-24E - 150A","Un    ",null,0,"-",null,null,0,0,""]
["S",{"$f":"IF(OR(C429=\"s\",C429=0),OFFSET(B429,-1,0),C429)","v":2},{"$f":"IF(OFFSET(C429,-1,0)=\"L\",1,IF(OFFSET(C429,-1,0)=1,2,IF(OR(A429=\"s\",A429=0),\"S\",IF(AND(OFFSET(C429,-1,0)=2,A429=4),3,IF(AND(OR(OFFSET(C429,-1,0)=\"s\",OFFSET(C429,-1,0)=0),A429<>\"s\",A429>OFFSET(B429,-1,0)),OFFSET(B429,-1,0),A429)))))","v":"S"},{"$f":"IF(OR(C429=\"S\",C429=0),0,IF(ISERROR(K429),J429,SMALL(J429:K429,1)))","v":0},{"$f":"IF($C429=1,OFFSET(E429,-1,0)+1,OFFSET(E429,-1,0))","v":2},{"$f":"IF($C429=1,0,IF($C429=2,OFFSET(F429,-1,0)+1,OFFSET(F429,-1,0)))","v":6},{"$f":"IF(AND($C429<=2,$C429<>0),0,IF($C429=3,OFFSET(G429,-1,0)+1,OFFSET(G429,-1,0)))","v":0},{"$f":"IF(AND($C429<=3,$C429<>0),0,IF($C429=4,OFFSET(H429,-1,0)+1,OFFSET(H429,-1,0)))","v":0},0,0,0,"","Serviço","Serviço","-","AGETOP",71741,"LUVA PVC ROSQUEAVEL DIAMETRO 3/4\"","Un    ",null,0,"-",null,null,0,0,""]
["S",2,"S",0,2,6,0,0,0,0,0,"","Serviço","Serviço","-","AGETOP",72578,"TOMADA HEXAGONAL 2P + T - 10A - 250V","Un    ",null,0,"-",null,null,0,0,""]
[2,2,2,57,2,7,0,0,0,107,57,"","Nível 2","Nível 2","-","AGETOP",null,"INSTALAÇÕES HIDROSSANITÁRIAS","-",null,0,"-",null,null,0,0,""]
[3,3,3,56,2,7,1,0,0,56,93,"","Nível 3","Nível 3","-","SINAPI",null,"PEÇAS E ACESSÓRIOS","-",null,0,"-",null,null,0,0,""]
["S",3,"S",0,2,7,1,0,0,0,0,"","Serviço","Serviço","-","AGETOP",81825,"CAIXA DE PASSAGEM 60 X 60 CM SEM TAMPA","Un    ",null,0,"-",null,null,0,0,""]
["S",3,"S",0,2,7,1,0,0,0,0,"","Serviço","Serviço","-","AGETOP",81826,"TAMPA EM CONCRETO ARMADO 25 MPA E=5CM PARA A CAIXA DE PASSAGEM 60X60CM","Un    ",null,0,"-",null,null,0,0,""]
["S",3,"S",0,2,7,1,0,0,0,0,"","Serviço","Serviço","-","AGETOP",80510,"ANEL DE VEDAÇÃO PARA VASO SANITÁRIO","Un    ",null,0,"-",null,null,0,0,""]
["S",3,"S",0,2,7,1,0,0,0,0,"","Serviço","Serviço","-","AGETOP",80512,"TUBO DE DESCIDA PARA CAIXA DE DESCARGA ( LONGO 1 1/4\" )","Un    ",null,0,"-",null,null,0,0,""]
["S",3,"S",0,2,7,1,0,0,0,0,"","Serviço","Serviço","-","AGETOP",80514,"TUBO DE LIGACAO PVC CROMADO 1.1/2\" / ESPUDE  - (ENTRADA)","Un    ",null,0,"-",null,null,0,0,""]
["S",3,"S",0,2,7,1,0,0,0,0,"","Serviço","Serviço","-","AGETOP",80515,"VÁLVULA DE DESCARGA DUPLO ACIONAMENTO COM ACABAMENTO CROMADO ","Un    ",null,0,"-",null,null,0,0,""]
["S",3,"S",0,2,7,1,0,0,0,0,"","Serviço","Serviço","-","AGETOP",80520,"CONJUNTO DE FIXACAO P/VASO SANITARIO (PAR)","CJ    ",null,0,"-",null,null,0,0,""]
["S",3,"S",0,2,7,1,0,0,0,0,"","Serviço","Serviço","-","AGETOP",80532,"PORTA PAPEL HIGIÊNICO EM METAL/ACABAMENTO CROMADO","Un    ",null,0,"-",null,null,0,0,""]
["S",3,"S",0,2,7,1,0,0,0,0,"","Serviço","Serviço","-","AGETOP",80542,"LAVATÓRIO MÉDIO SEM COLUNA","Un    ",null,0,"-",null,null,0,0,""]
["S",3,"S",0,2,7,1,0,0,0,0,"","Serviço","Serviço","-","AGETOP",80550,"FIXACAO P/LAVATORIO (PAR)","PAR   ",null,0,"-",null,null,0,0,""]
["S",3,"S",0,2,7,1,0,0,0,0,"","Serviço","Serviço","-","AGETOP",80556,"LIGAÇÃO FLEXÍVEL PVC DIAM.1/2\" (ENGATE)","Un    ",null,0,"-",null,null,0,0,""]
["S",3,"S",0,2,7,1,0,0,0,0,"","Serviço","Serviço","-","AGETOP",80562,"SIFAO FLEXIVEL UNIVERSAL ( SANFONADO) EM PVC PARA LAVATORIO","Un    ",null,0,"-",null,null,0,0,""]
["S",3,"S",0,2,7,1,0,0,0,0,"","Serviço","Serviço","-","AGETOP",80570,"TORNEIRA DE MESA PARA LAVATÓRIO DIÂMETRO DE 1/2\"","Un    ",null,0,"-",null,null,0,0,""]
["S",3,"S",0,2,7,1,0,0,0,0,"","Serviço","Serviço","-","AGETOP",80580,"VALVULA P/LAVATORIO OU BEBEDOURO METALICO DIAMETRO 1\"","Un    ",null,0,"-",null,null,0,0,""]
["S",3,"S",0,2,7,1,0,0,0,0,"","Serviço","Serviço","-","SINAPI",86911,"TORNEIRA CROMADA LONGA, DE PAREDE, 1/2\u0094 OU 3/4\u0094, PARA PIA DE COZINHA, PADRÃO POPULAR - FORNECIMENTO E INSTALAÇÃO. AF_01/2020","UN",null,0,"-",null,null,0,0,""]
["S",3,"S",0,2,7,1,0,0,0,0,"","Serviço","Serviço","-","AGETOP",80671,"SIFAO PVC P/PIA 1.1/2\" X 2\"","Un    ",null,0,"-",null,null,0,0,""]
["S",3,"S",0,2,7,1,0,0,0,0,"","Serviço","Serviço","-","AGETOP",80680,"VALVULA P/PIA TIPO AMERICANA DIAM.3.1/2\" (METAL)","Un    ",null,0,"-",null,null,0,0,""]
["S",3,"S",0,2,7,1,0,0,0,0,"","Serviço","Serviço","-","AGETOP",80687,"CUBA INOX 35X40X15CM E=0,6MM-AÇO 304 (CUBA Nº 3)","Un    ",null,0,"-",null,null,0,0,""]
["S",3,"S",0,2,7,1,0,0,0,0,"","Serviço","Serviço","-","AGETOP",80693,"TANQUE (PANELAO) INOX 60 X 70 X 40 CM CH.18","Un    ",null,0,"-",null,null,0,0,""]
["S",3,"S",0,2,7,1,0,0,0,0,"","Serviço","Serviço","-","AGETOP",81846,"CAIXA DE GORDURA E INSPEÇÃO EM PVC/ABS 19 LITROS COM TAMPA E PORTA TAMPA E CESTO DE LIMPEZA REMOVÍVEL","un    ",null,0,"-",null,null,0,0,""]
["S",3,"S",0,2,7,1,0,0,0,0,"","Serviço","Serviço","-","AGETOP",80903,"REGISTRO DE GAVETA BRUTO DIAMETRO 1\"","Un    ",null,0,"-",null,null,0,0,""]
["S",3,"S",0,2,7,1,0,0,0,0,"","Serviço","Serviço","-","AGETOP",80926,"REGISTRO DE GAVETA C/CANOPLA DIAMETRO 3/4\"","Un    ",null,0,"-",null,null,0,0,""]
["S",3,"S",0,2,7,1,0,0,{"$f":"IF(OR($C455=\"S\",$C455=0),0,MATCH(0,OFFSET($D455,1,$C455,ROW($C$538)-ROW($C455)),0))","v":0},{"$f":"IF(OR($C455=\"S\",$C455=0),0,MATCH(OFFSET($D455,0,$C455)+1,OFFSET($D455,1,$C455,ROW($C$538)-ROW($C455)),0))","v":0},"","Serviço","Serviço","-","AGETOP",80926,"REGISTRO DE GAVETA C/CANOPLA DIAMETRO 3/4\"","Un    ",null,0,"-",null,null,0,0,""]
["S",3,"S",0,2,7,1,0,0,0,0,"","Serviço","Serviço","-","AGETOP",81003,"TUBO SOLDAVEL PVC MARROM DIAMETRO 25 mm","M     ",null,0,"-",null,null,0,0,""]
["S",3,"S",0,2,7,1,0,0,0,0,"","Serviço","Serviço","-","AGETOP",81004,"TUBO SOLDAVEL PVC MARROM DIAMETRO 32 mm","m     ",null,0,"-",null,null,0,0,""]
["S",3,"S",0,2,7,1,0,0,0,0,"","Serviço","Serviço","-","AGETOP",81041,"ADAPTAD.PVC SOLD.LONGO C/FLANGES LIVRES P/CX.DAGUA 25X3/4\"","Un    ",null,0,"-",null,null,0,0,""]
["S",3,"S",0,2,7,1,0,0,0,0,"","Serviço","Serviço","-","AGETOP",81042,"ADAPTAD.PVC SOLD.LONGO C/FLANGES LIVRES P/CX.DAGUA 32X1\"","Un    ",null,0,"-",null,null,0,0,""]
["S",3,"S",0,2,7,1,0,0,0,0,"","Serviço","Serviço","-","AGETOP",81162,"BUCHA DE REDUCAO SOLD.CURTA 32 X 25 MM","Un    ",null,0,"-",null,null,0,0,""]
["S",3,"S",0,2,7,1,0,0,0,0,"","Serviço","Serviço","-","SINAPI",89866,"JOELHO 90 GRAUS, PVC, SOLDÁVEL, DN 25MM, INSTALADO EM DRENO DE AR-CONDICIONADO - FORNECIMENTO E INSTALAÇÃO. AF_12/2014","UN",null,0,"-",null,null,0,0,""]
["S",3,"S",0,2,7,1,0,0,0,0,"","Serviço","Serviço","-","SINAPI",94672,"JOELHO 90 GRAUS COM BUCHA DE LATÃO, PVC, SOLDÁVEL, DN  25 MM, X 3/4\u0094 INSTALADO EM RESERVAÇÃO DE ÁGUA DE EDIFICAÇÃO QUE POSSUA RESERVATÓRIO DE FIBRA/FIBROCIMENTO   FORNECIMENTO E INSTALAÇÃO. AF_06/2016","UN",null,0,"-",null,null,0,0,""]
["S",3,"S",0,2,7,1,0,0,0,0,"","Serviço","Serviço","-","AGETOP",81402,"TE 90 GRAUS SOLDAVEL DIAMETRO 25 mm","Un    ",null,0,"-",null,null,0,0,""]
["S",3,"S",0,2,7,1,0,0,0,0,"","Serviço","Serviço","-","AGETOP",81421,"TE REDUCAO 90 GRAUS SOLDAVEL 32 X 25 mm","Un    ",null,0,"-",null,null,0,0,""]
["S",3,"S",0,2,7,1,0,0,0,0,"","Serviço","Serviço","-","AGETOP",81602,"BUCHA DE REDUCAO LONGA DIAM. 50 X 40 MM","Un    ",null,0,"-",null,null,0,0,""]
["S",3,"S",0,2,7,1,0,0,0,0,"","Serviço","Serviço","-","AGETOP",81663,"CORPO CX. SIFONADA DIAM. 150 X 150 X 50","Un    ",null,0,"-",null,null,0,0,""]
["S",3,"S",0,2,7,1,0,0,0,0,"","Serviço","Serviço","-","AGETOP",81771,"GRELHA QUADRADA BRANCA DIAM. 150 MM","Un    ",null,0,"-",null,null,0,0,""]
["S",3,"S",0,2,7,1,0,0,0,0,"","Serviço","Serviço","-","AGETOP",81885,"TERMINAL DE VENTILACAO DIAMETRO 50 MM","Un    ",null,0,"-",null,null,0,0,""]
["S",3,"S",0,2,7,1,0,0,0,0,"","Serviço","Serviço","-","AGETOP",81831,"CAIXA DE INSPEÇÃO - ALVENARIA DE 1/2 VEZ COM REVESTIMENTO INTERNO EM REBOCO PAULISTA A-14 (COM ADIÇÃO DE IMPERMEABILIZANTE)","m2    ",null,0,"-",null,null,0,0,""]
["S",3,"S",0,2,7,1,0,0,0,0,"","Serviço","Serviço","-","SINAPI",89802,"JOELHO 45 GRAUS, PVC, SERIE NORMAL, ESGOTO PREDIAL, DN 50 MM, JUNTA ELÁSTICA, FORNECIDO E INSTALADO EM PRUMADA DE ESGOTO SANITÁRIO OU VENTILAÇÃO. AF_12/2014","UN",null,0,"-",null,null,0,0,""]
["S",3,"S",0,2,7,1,0,0,0,0,"","Serviço","Serviço","-","SINAPI",89732,"JOELHO 45 GRAUS, PVC, SERIE NORMAL, ESGOTO PREDIAL, DN 50 MM, JUNTA ELÁSTICA, FORNECIDO E INSTALADO EM RAMAL DE DESCARGA OU RAMAL DE ESGOTO SANITÁRIO. AF_12/2014","UN",null,0,"-",null,null,0,0,""]
["S",3,"S",0,2,7,1,0,0,0,0,"","Serviço","Serviço","-","SINAPI",89724,"JOELHO 90 GRAUS, PVC, SERIE NORMAL, ESGOTO PREDIAL, DN 40 MM, JUNTA SOLDÁVEL, FORNECIDO E INSTALADO EM RAMAL DE DESCARGA OU RAMAL DE ESGOTO SANITÁRIO. AF_12/2014","UN",null,0,"-",null,null,0,0,""]
["S",3,"S",0,2,7,1,0,0,0,0,"","Serviço","Serviço","-","SINAPI",89801,"JOELHO 90 GRAUS, PVC, SERIE NORMAL, ESGOTO PREDIAL, DN 50 MM, JUNTA ELÁSTICA, FORNECIDO E INSTALADO EM PRUMADA DE ESGOTO SANITÁRIO OU VENTILAÇÃO. AF_12/2014","UN",null,0,"-",null,null,0,0,""]
["S",3,"S",0,2,7,1,0,0,0,0,"","Serviço","Serviço","-","AGETOP",81973,"JUNCAO SIMPLES DIAM. 100 X 50 MM","Un    ",null,0,"-",null,null,0,0,""]
["S",3,"S",0,2,7,1,0,0,0,0,"","Serviço","Serviço","-","SINAPI",89834,"JUNÇÃO SIMPLES, PVC, SERIE NORMAL, ESGOTO PREDIAL, DN 100 X 100 MM, JUNTA ELÁSTICA, FORNECIDO E INSTALADO EM PRUMADA DE ESGOTO SANITÁRIO OU VENTILAÇÃO. AF_12/2014","UN",null,0,"-",null,null,0,0,""]
["S",3,"S",0,2,7,1,0,0,0,0,"","Serviço","Serviço","-","AGETOP",81981,"JUNÇÃO DUPLA DIAMETRO 75 MM","Un    ",null,0,"-",null,null,0,0,""]
["S",3,"S",0,2,7,1,0,0,0,0,"","Serviço","Serviço","-","SINAPI",89813,"LUVA SIMPLES, PVC, SERIE NORMAL, ESGOTO PREDIAL, DN 50 MM, JUNTA ELÁSTICA, FORNECIDO E INSTALADO EM PRUMADA DE ESGOTO SANITÁRIO OU VENTILAÇÃO. AF_12/2014","UN",null,0,"-",null,null,0,0,""]
["S",3,"S",0,2,7,1,0,0,0,0,"","Serviço","Serviço","-","AGETOP",82004,"LUVA SIMPLES DIAM. 100 MM","Un    ",null,0,"-",null,null,0,0,""]
["S",3,"S",0,2,7,1,0,0,0,0,"","Serviço","Serviço","-","AGETOP",82051,"PORTA GRELHA QUADRADA BRANCO DIAM. 150 MM","Un    ",null,0,"-",null,null,0,0,""]
["S",3,"S",0,2,7,1,0,0,0,0,"","Serviço","Serviço","-","AGETOP",82103,"REDUCAO EXCENTRICA 100 X 50 MM","Un    ",null,0,"-",null,null,0,0,""]
["S",3,"S",0,2,7,1,0,0,0,0,"","Serviço","Serviço","-","AGETOP",82233,"TE SANITARIO DIAMETRO 100 X 50 MM","Un    ",null,0,"-",null,null,0,0,""]
["S",3,"S",0,2,7,1,0,0,0,0,"","Serviço","Serviço","-","AGETOP",82301,"TUBO SOLD.P/ESGOTO DIAM. 40 MM","m     ",null,0,"-",null,null,0,0,""]
["S",3,"S",0,2,7,1,0,0,0,0,"","Serviço","Serviço","-","SINAPI",89798,"TUBO PVC, SERIE NORMAL, ESGOTO PREDIAL, DN 50 MM, FORNECIDO E INSTALADO EM PRUMADA DE ESGOTO SANITÁRIO OU VENTILAÇÃO. AF_12/2014","M",null,0,"-",null,null,0,0,""]
["S",3,"S",0,2,7,1,0,0,0,0,"","Serviço","Serviço","-","SINAPI",89800,"TUBO PVC, SERIE NORMAL, ESGOTO PREDIAL, DN 100 MM, FORNECIDO E INSTALADO EM PRUMADA DE ESGOTO SANITÁRIO OU VENTILAÇÃO. AF_12/2014","M",null,0,"-",null,null,0,0,""]
["S",3,"S",0,2,7,1,0,0,0,0,"","Serviço","Serviço","-","AGETOP",82374,"TUBO FERRO GALVANIZADO DIAM.3/4\"","m     ",null,0,"-",null,null,0,0,""]
["S",3,"S",0,2,7,1,0,0,0,0,"","Serviço","Serviço","-","AGETOP",85003,"EXTINTOR PO QUIMICO SECO (6 KG) - CAPACIDADE EXTINTORA 20 BC","Un    ",null,0,"-",null,null,0,0,""]
["S",3,"S",0,2,7,1,0,0,{"$f":"IF(OR($C487=\"S\",$C487=0),0,MATCH(0,OFFSET($D487,1,$C487,ROW($C$538)-ROW($C487)),0))","v":0},{"$f":"IF(OR($C487=\"S\",$C487=0),0,MATCH(OFFSET($D487,0,$C487)+1,OFFSET($D487,1,$C487,ROW($C$538)-ROW($C487)),0))","v":0},"","Serviço","Serviço","-","SINAPI",95470,"VASO SANITARIO SIFONADO CONVENCIONAL COM LOUÇA BRANCA, INCLUSO CONJUNTO DE LIGAÇÃO PARA BACIA SANITÁRIA AJUSTÁVEL - FORNECIMENTO E INSTALAÇÃO. AF_10/2016","UN",null,0,"-",null,null,0,0,""]
[2,2,2,3,2,8,0,0,0,50,3,"","Nível 2","Nível 2","-",null,null,"ALVENARIAS E DIVISÓRIAS","-",null,0,"-",null,null,0,0,""]
["S",2,"S",0,2,8,0,0,0,0,0,"","Serviço","Serviço","-","AGETOP",100501,"ELEMENTO VAZADO DE CONCRETO","m2    ",null,0,"-",null,null,0,0,""]
[{"$f":"CHOOSE(1+LOG(1+2*(ORÇAMENTO.Nivel=\"Nível 1\")+4*(ORÇAMENTO.Nivel=\"Nível 2\")+8*(ORÇAMENTO.Nivel=\"Nível 3\")+16*(ORÇAMENTO.Nivel=\"Nível 4\")+32*(ORÇAMENTO.Nivel=\"Serviço\"),2),0,1,2,3,4,\"S\")","v":"S"},2,"S",0,2,8,0,0,{"$f":"IF(AND($C490<=4,$C490<>0),0,IF(AND($C490=\"S\",$Y490>0),OFFSET(I490,-1,0)+1,OFFSET(I490,-1,0)))","v":0},0,0,"","Serviço","Serviço","-","AGETOP",100201,"ALVENARIA DE TIJOLO FURADO 1/2 VEZ - 9 x 19 x 19 - ARG. (1CALH:4ARML+100KG DE CI/M3)","m2    ",null,0,"-",null,null,0,0,""]
[2,2,2,2,2,9,0,0,0,47,2,"","Nível 2","Nível 2","-",null,null,"IMPERMEABILIZAÇÃO","-",null,0,"-",null,null,0,0,""]
["S",2,"S",0,2,9,0,0,0,0,0,{"$f":"IF(OR(Y492>0,$C492=1),\"F\",\"\")","v":""},"Serviço",{"$f":"CHOOSE(1+LOG(1+2*(C492=1)+4*(C492=2)+8*(C492=3)+16*(C492=4)+32*(C492=\"S\"),2),\"\",\"Nível 1\",\"Nível 2\",\"Nível 3\",\"Nível 4\",\"Serviço\")","v":"Serviço"},"-","AGETOP",120902,"IMPERMEABILIZACAO VIGAS BALDRAMES E=2,0 CM","m2    ",null,0,"-",null,null,0,0,""]
[2,{"$f":"IF(OR(C493=\"s\",C493=0),OFFSET(B493,-1,0),C493)","v":2},{"$f":"IF(OFFSET(C493,-1,0)=\"L\",1,IF(OFFSET(C493,-1,0)=1,2,IF(OR(A493=\"s\",A493=0),\"S\",IF(AND(OFFSET(C493,-1,0)=2,A493=4),3,IF(AND(OR(OFFSET(C493,-1,0)=\"s\",OFFSET(C493,-1,0)=0),A493<>\"s\",A493>OFFSET(B493,-1,0)),OFFSET(B493,-1,0),A493)))))","v":2},{"$f":"IF(OR(C493=\"S\",C493=0),0,IF(ISERROR(K493),J493,SMALL(J493:K493,1)))","v":2},{"$f":"IF($C493=1,OFFSET(E493,-1,0)+1,OFFSET(E493,-1,0))","v":2},{"$f":"IF($C493=1,0,IF($C493=2,OFFSET(F493,-1,0)+1,OFFSET(F493,-1,0)))","v":10},{"$f":"IF(AND($C493<=2,$C493<>0),0,IF($C493=3,OFFSET(G493,-1,0)+1,OFFSET(G493,-1,0)))","v":0},{"$f":"IF(AND($C493<=3,$C493<>0),0,IF($C493=4,OFFSET(H493,-1,0)+1,OFFSET(H493,-1,0)))","v":0},0,45,2,"","Nível 2","Nível 2","-",null,null,"ESTRUTURAS METÁLICAS","-",null,0,"-",null,null,0,0,""]
["S",2,"S",0,2,10,0,0,0,0,0,"","Serviço","Serviço","-","AGETOP",150103,"ESTRUTURA METÁLICA CONVENCIONAL EM AÇO DO TIPO USI SAC-300 COM FUNDO ANTICORROSIVO","Kg    ",null,0,"-",null,null,0,0,""]
[2,2,2,5,2,11,0,0,0,43,5,"","Nível 2","Nível 2","-",null,null,"COBERTURAS","-",null,0,"-",null,null,0,0,""]
[3,3,3,4,2,11,1,0,0,4,29,"","Nível 3","Nível 3","-",null,null,"CERÂMICA","-",null,0,"-",null,null,0,0,""]
["S",3,"S",0,2,11,1,0,0,0,0,"","Serviço","Serviço","-","AGETOP",160401,"COBERTURA COM TELHA PLAN RESINADA COR VERMELHA","m2    ",null,0,"-",null,null,0,0,""]
["S",3,"S",0,2,11,1,0,0,0,0,"","Serviço","Serviço","-","SINAPI",94221,"CUMEEIRA PARA TELHA CERÂMICA EMBOÇADA COM ARGAMASSA TRAÇO 1:2:9 (CIMENTO, CAL E AREIA) PARA TELHADOS COM ATÉ 2 ÁGUAS, INCLUSO TRANSPORTE VERTICAL. AF_07/2019","M",null,0,"-",null,null,0,0,""]
["S",3,"S",0,2,11,1,0,0,0,0,"","Serviço","Serviço","-","AGETOP",160403,"EMBOCAMENTO LATERAL  (OITOES)","m     ",null,0,"-",null,null,0,0,""]
[2,2,2,5,2,12,0,0,0,38,5,"","Nível 2","Nível 2","-",null,null,"ESQUADRIAS METÁLICAS","-",null,0,"-",null,null,0,0,""]
["S",2,"S",0,2,12,0,0,0,0,0,"","Serviço","Serviço","-","AGETOP",180303,"PORTA DE ENROLAR C/FERRAGENS","m2    ",null,0,"-",null,null,0,0,""]
["S",2,"S",0,2,12,0,0,0,0,0,"","Serviço","Serviço","-","AGETOP",180307,"PORTAO /CHAPA TRAPEZ / TUBO DE ACO PT-5 C/FERRAGEM","m2    ",null,0,"-",null,null,0,0,""]
["S",2,"S",0,2,12,0,0,0,0,0,"","Serviço","Serviço","-","AGETOP",180381,"ESQ. MAXIMO AR CHAPA/VIDRO J3/J5/J6/J8 C/FERRAGENS","m2    ",null,0,"-",null,null,0,0,""]
["S",2,"S",0,2,12,0,0,0,0,0,"","Serviço","Serviço","-","AGETOP",180501,"PORTA DE ABRIR EM CHAPA PF-1 C/FERRAGENS","m2    ",null,0,"-",null,null,0,0,""]
[2,2,2,2,2,13,0,0,0,33,2,"","Nível 2","Nível 2","-",null,null,"VIDROS","-",null,0,"-",null,null,0,0,""]
["S",2,"S",0,2,13,0,0,0,0,0,"","Serviço","Serviço","-","AGETOP",190102,"VIDRO LISO 4 MM - COLOCADO","m2    ",null,0,"-",null,null,0,0,""]
[2,2,2,4,2,14,0,0,0,31,4,"","Nível 2","Nível 2","-",null,null,"REVESTIMENTO DE PAREDE","-",null,0,"-",null,null,0,0,""]
["S",2,"S",0,2,14,0,0,0,0,0,"","Serviço","Serviço","-","SINAPI",87553,"EMBOÇO, PARA RECEBIMENTO DE CERÂMICA, EM ARGAMASSA TRAÇO 1:2:8, PREPARO MECÂNICO COM BETONEIRA 400L, APLICADO MANUALMENTE EM FACES INTERNAS DE PAREDES, PARA AMBIENTE COM ÁREA MAIOR QUE 10M2, ESPESSURA DE 10MM, COM EXECUÇÃO DE TALISCAS. AF_06/2014","M2",null,0,"-",null,null,0,0,""]
["S",2,"S",0,2,14,0,0,0,0,0,"","Serviço","Serviço","-","AGETOP",200101,"CHAPISCO COMUM","m2    ",null,0,"-",null,null,0,0,""]
["S",2,"S",0,2,14,0,0,0,0,0,"","Serviço","Serviço","-","SINAPI",87273,"REVESTIMENTO CERÂMICO PARA PAREDES INTERNAS COM PLACAS TIPO ESMALTADA EXTRA DE DIMENSÕES 33X45 CM APLICADAS EM AMBIENTES DE ÁREA MAIOR QUE 5 M² NA ALTURA INTEIRA DAS PAREDES. AF_06/2014","M2",null,0,"-",null,null,0,0,""]
[2,2,2,3,2,15,0,0,0,27,3,"","Nível 2","Nível 2","-",null,null,"FORROS","-",null,0,"-",null,null,0,0,""]
["S",2,"S",0,2,15,0,0,0,0,0,"","Serviço","Serviço","-","AGETOP",210102,"CHAPISCO ROLADO ( 1CIM:3 ARML)+(1 COLA:10 CIM)","m2    ",null,0,"-",null,null,0,0,""]
["S",2,"S",0,2,15,0,0,0,0,0,"","Serviço","Serviço","-","AGETOP",210401,"REBOCO PAULISTA EM FORRO(1CALH:4ARML+150KG CI/M3)","m2    ",null,0,"-",null,null,0,0,""]
[2,2,2,5,2,16,0,0,0,24,5,"","Nível 2","Nível 2","-",null,null,"REVESTIMENTO DE PISO","-",null,0,"-",null,null,0,0,""]
["S",2,"S",0,2,16,0,0,0,0,0,"","Serviço","Serviço","-","SINAPI",95241,"LASTRO DE CONCRETO MAGRO, APLICADO EM PISOS OU RADIERS, ESPESSURA DE 5 CM. AF_07/2016","M2",null,0,"-",null,null,0,0,""]
["S",2,"S",0,2,16,0,0,0,0,0,"","Serviço","Serviço","-","AGETOP",221104,"RASPAGEM E APLICAÇÃO RESINA ACRÍLICA DUAS DEMÃOS","m2    ",null,0,"-",null,null,0,0,""]
["S",2,"S",0,2,16,0,0,0,0,0,"","Serviço","Serviço","-","AGETOP",221106,"GRANITINA 8MM FUNDIDA COM CONTRAPISO (1CI:3ARML) E=2CM E JUNTA PLASTICA 27MM (COM ÓXIDO DE FERRO)","m2    ",null,0,"-",null,null,0,0,""]
["S",2,"S",0,2,16,0,0,0,0,0,"","Serviço","Serviço","-","AGETOP",220100,"PASSEIO PROTECAO EM CONC.DESEMPEN.5 CM 1:2,5:3,5 ( INCLUSO ESPELHO DE 30CM/ESCAVAÇÃO/REATERRO/APILOAMENTO/ATERRO INTERNO)","m2    ",null,0,"-",null,null,0,0,""]
[2,2,2,2,2,17,0,0,0,{"$f":"IF(OR($C519=\"S\",$C519=0),0,MATCH(0,OFFSET($D519,1,$C519,ROW($C$538)-ROW($C519)),0))","v":19},{"$f":"IF(OR($C519=\"S\",$C519=0),0,MATCH(OFFSET($D519,0,$C519)+1,OFFSET($D519,1,$C519,ROW($C$538)-ROW($C519)),0))","v":2},"","Nível 2","Nível 2","-","SINAPI",null,"MARCENARIA","-",null,0,"-",null,null,0,0,""]
["S",2,"S",0,2,17,0,0,0,0,0,"","Serviço","Serviço","-","AGETOP",240209,"PRATELEIRA EST.CAIBRO 4+1 TABUAS APARELHADAS E ENVERNIZADAS","m     ",null,0,"-",null,null,0,0,""]
[2,2,2,14,2,18,0,0,0,17,14,"","Nível 2","Nível 2","-",null,null,"PINTURA","-",null,0,"-",null,null,0,0,""]
[3,3,3,3,2,18,1,0,0,13,3,"","Nível 3","Nível 3","-",null,null,"ESMALTE SINTÉTICO","-",null,0,"-",null,null,0,0,""]
["S",3,"S",0,2,18,1,0,0,0,0,"","Serviço","Serviço","-","AGETOP",261300,"EMASSAMENTO COM MASSA PVA DUAS DEMAOS","m2    ",null,0,"-",null,null,0,0,""]
["S",3,"S",0,2,18,1,0,0,0,0,"","Serviço","Serviço","-","AGETOP",261550,"PINT.ESMALTE SINT.PAREDES - 2 DEM.C/SELADOR","m2    ",null,0,"-",null,null,0,0,""]
[3,3,3,3,2,18,2,0,0,10,3,"","Nível 3","Nível 3","-","AGETOP",null,"LÁTEX ACRÍLICA","-",null,0,"-",null,null,0,0,""]
["S",3,"S",0,2,18,2,0,0,0,0,"","Serviço","Serviço","-","AGETOP",261300,"EMASSAMENTO COM MASSA PVA DUAS DEMAOS","m2    ",null,0,"-",null,null,0,0,""]
["S",3,"S",0,2,18,2,0,0,0,0,"","Serviço","Serviço","-","AGETOP",261001,"PINTURA LATEX ACRILICO 2 DEMAOS","m2    ",null,0,"-",null,null,0,0,""]
[3,3,3,3,2,18,3,0,0,7,3,"","Nível 3","Nível 3","-","SINAPI",null,"TETO","-",null,0,"-",null,null,0,0,""]
["S",3,"S",0,2,18,3,0,0,0,0,"","Serviço","Serviço","-","AGETOP",261300,"EMASSAMENTO COM MASSA PVA DUAS DEMAOS","m2    ",null,0,"-",null,null,0,0,""]
["S",3,"S",0,2,18,3,0,0,0,0,"","Serviço","Serviço","-","AGETOP",261307,"PINTURA PVA LATEX 2 DEMAOS SEM SELADOR","m2    ",null,0,"-",null,null,0,0,""]
[3,3,3,2,2,18,4,0,0,4,2,"","Nível 3","Nível 3","-","AGETOP",null,"ESQUADRIAS NOVAS","-",null,0,"-",null,null,0,0,""]
["S",3,"S",0,2,18,4,0,0,0,0,"","Serviço","Serviço","-","AGETOP",261602,"PINT.ESMALTE/ESQUAD.FERRO C/FUNDO ANTICOR.","m2    ",null,0,"-",null,null,0,0,""]
[3,3,3,2,2,18,5,0,0,2,{"$error":"#N/A"},"","Nível 3","Nível 3","-","AGETOP",null,"PINTURA ESTRUTURA METÁLICA","-",null,0,"-",null,null,0,0,""]
["S",3,"S",0,2,18,5,0,0,0,0,"","Serviço","Serviço","-","AGETOP",261602,"PINT.ESMALTE/ESQUAD.FERRO C/FUNDO ANTICOR.","m2    ",null,0,"-",null,null,0,0,""]
[2,2,2,3,2,19,0,0,0,3,{"$error":"#N/A"},"","Nível 2","Nível 2","-",null,null,"DIVERSOS","-",null,0,"-",null,null,0,0,""]
["S",2,"S",0,2,19,0,0,0,0,0,"","Serviço","Serviço","-","AGETOP",270501,"LIMPEZA FINAL DE OBRA - (OBRAS CIVIS)","m2    ",null,0,"-",null,null,0,0,""]
["S",2,"S",0,2,19,0,0,0,0,0,"","Serviço","Serviço","-","AGETOP",271608,"BANCADA DE GRANITO C/ESPELHO","m2    ",null,0,"-",null,null,0,0,""]
[-1,null,-1,null,0,0,0,0,0,null,null,"F"]
[null,null,null,null,null,null,null,null,null,null,null,"F",null,null,null,null,null,"OBS: OS QUANTITATIVOS DE MATERIAIS  DAS INSTALAÇÕES HIDROSSANITÁRIAS, ELÉTRICAS E ESPECIAIS SÃO FORNECIDOS PELOS PROFISSIONAIS RESPONSÁVEIS PELOS RESPECTIVOS PROJETOS.",null,null,null,null,null,"VALOR TOTAL",null,0]
[null,null,null,null,null,null,null,null,null,null,null,"F",null,null,null,null,null,null,null,null,null,null,null,"VALOR BDI (26,44%)",null,0]
[null,null,null,null,null,null,null,null,null,null,null,"F",null,null,null,null,null,null,null,null,null,null,null,"TOTAL ORÇAMENTO",null,0]
[null,null,null,null,null,null,null,null,null,null,null,"F"]
[null,null,null,null,null,null,null,null,null,null,null,"F",null,null,null,null,null,null,null,null,null,null,null,"CUSTO POR M2 ³",null,0]
[null,null,null,null,null,null,null,null,null,null,null,"F",null,null,null,null,null,null,null,null,null,null,null,"MATERIAL S/ BDI",null,0]
[null,null,null,null,null,null,null,null,null,null,null,"F",null,null,null,null,null,null,null,null,null,null,null,"MÃO DE OBRA S/ BDI",null,0]
[null,null,null,null,null,null,null,null,null,null,null,"F"]
[null,null,null,null,null,null,null,null,null,null,null,"F",null,null,null,null,"(1) Conforme previsto pelo DECRETO Nº 7.983, DE 8 DE ABRIL DE 2013, os preços adotados são aqueles constantes dos sistemas de referência indicados. Justifica-se o uso dos preços destas composições de custos unitários devido ao seu valor ser menor à mediana de seus correspondentes na tabela SINAPI;"]
[null,null,null,null,null,null,null,null,null,null,null,"F",null,null,null,null,"(2) Optou-se pelo uso das composições de custos da AGETOP para itens não presentes na SINAPI;"]
[null,null,null,null,null,null,null,null,null,null,null,"F",null,null,null,null,"(3) Para itens da AGETOP, os vidros não estão inclusos nas esquadrias e já foram considerados os custos de contramarco para as esquadrias de alumínio;"]
[null,null,null,null,null,null,null,null,null,null,null,"F",null,null,null,null,"(4) Nos casos em que houver execução de granitina e omissão do item AGETOP 221102, considerou-se que o quantitativo para o rodapé, de altura igual a 7cm, foi incorporado na área de piso;"]
[null,null,null,null,null,null,null,null,null,null,null,"F",null,null,null,null,"(5) O custo unitário aproximado por metro quadrado é calculado dividindo-se o valor total do orçamento pela área total de construção."]
[null,null,null,null,null,null,null,null,null,null,null,"F"]
[null,null,null,null,null,null,null,null,null,null,null,"F"]
[]
[null,null,null,null,null,null,null,null,null,null,null,null,null,null,"SOMATÓRIO DE SERVIÇOS"]
[null,null,null,null,null,null,null,null,null,null,null,null,null,null,"ITEM","DESCRIÇÃO DOS SERVIÇOS",null,null,"PREÇO SEM BDI",null,null,null,null,"PREÇO COM BDI",null,null,"PARTICIPAÇÃO ( % )"]
[null,null,null,null,null,null,null,null,null,null,null,null,null,null,"a.","SERVIÇOS PRELIMINARES",null,null,{"$f":"SUMIF($R$19:$R$538,$P557,$Z$19:$Z$538)","v":0},null,null,null,null,{"$f":"ROUND(S557*(1+BDI.Taxa),2)","v":0},null,null,{"$f":"IFERROR(ROUND($X557*100/$Z$541,2),0)","v":0}]
[null,null,null,null,null,null,null,null,null,null,null,null,null,null,"b.","TRANSPORTES",null,null,0,null,null,null,null,0,null,null,0]
[null,null,null,null,null,null,null,null,null,null,null,null,null,null,"c.","SERVIÇO EM TERRA",null,null,0,null,null,null,null,0,null,null,0]
[null,null,null,null,null,null,null,null,null,null,null,null,null,null,"d.","FUNDAÇÕES E SONDAGENS",null,null,0,null,null,null,null,0,null,null,0]
[null,null,null,null,null,null,null,null,null,null,null,null,null,null,"e.","ESTRUTURA",null,null,0,null,null,null,null,0,null,null,0]
[null,null,null,null,null,null,null,null,null,null,null,null,null,null,"f.","INSTALAÇÕES ELÉTRICAS",null,null,0,null,null,null,null,0,null,null,0]
[null,null,null,null,null,null,null,null,null,null,null,null,null,null,"g.","INSTALAÇÕES HIDROSSANITÁRIAS",null,null,0,null,null,null,null,0,null,null,0]
[null,null,null,null,null,null,null,null,null,null,null,null,null,null,"h","INSTALAÇÕES ESPECIAIS",null,null,0,null,null,null,null,0,null,null,0]
[null,null,null,null,null,null,null,null,null,null,null,null,null,null,"i.","ALVENARIAS E DIVISÓRIAS",null,null,0,null,null,null,null,0,null,null,0]
[null,null,null,null,null,null,null,null,null,null,null,null,null,null,"j.","ALVENARIA AUTO-PORTANTE",null,null,0,null,null,null,null,0,null,null,0]
[null,null,null,null,null,null,null,null,null,null,null,null,null,null,"k.","IMPERMEABILIZAÇÃO",null,null,0,null,null,null,null,0,null,null,0]
[null,null,null,null,null,null,null,null,null,null,null,null,null,null,"l.","ISOLAMENTO TÉRMICO E ACÚSTICO",null,null,0,null,null,null,null,0,null,null,0]
[null,null,null,null,null,null,null,null,null,null,null,null,null,null,"m.","ESTRUTURA DE MADEIRA",null,null,0,null,null,null,null,0,null,null,0]
[null,null,null,null,null,null,null,null,null,null,null,null,null,null,"n.","ESTRUTURAS METÁLICAS",null,null,0,null,null,null,null,0,null,null,0]
[null,null,null,null,null,null,null,null,null,null,null,null,null,null,"o.","COBERTURAS",null,null,0,null,null,null,null,0,null,null,0]
[null,null,null,null,null,null,null,null,null,null,null,null,null,null,"p.","ESQUADRIAS DE MADEIRA",null,null,0,null,null,null,null,0,null,null,0]
[null,null,null,null,null,null,null,null,null,null,null,null,null,null,"q.","ESQUADRIAS METÁLICAS",null,null,0,null,null,null,null,{"$f":"ROUND(S573*(1+BDI.Taxa),2)","v":0},null,null,0]
[null,null,null,null,null,null,null,null,null,null,null,null,null,null,"r.","VIDROS",null,null,0,null,null,null,null,0,null,null,0]
[null,null,null,null,null,null,null,null,null,null,null,null,null,null,"s.","REVESTIMENTO DE PAREDE",null,null,0,null,null,null,null,0,null,null,0]
[null,null,null,null,null,null,null,null,null,null,null,null,null,null,"t.","FORROS",null,null,0,null,null,null,null,0,null,null,0]
[null,null,null,null,null,null,null,null,null,null,null,null,null,null,"u.","REVESTIMENTO DE PISO",null,null,0,null,null,null,null,0,null,null,0]
[null,null,null,null,null,null,null,null,null,null,null,null,null,null,"v.","FERRAGENS",null,null,0,null,null,null,null,0,null,null,0]
[null,null,null,null,null,null,null,null,null,null,null,null,null,null,"w.","MARCENARIA",null,null,0,null,null,null,null,0,null,null,0]
[null,null,null,null,null,null,null,null,null,null,null,null,null,null,"x.","ADMINISTRAÇÃO",null,null,0,null,null,null,null,0,null,null,0]
[null,null,null,null,null,null,null,null,null,null,null,null,null,null,"y.","PINTURA",null,null,0,null,null,null,null,{"$f":"ROUND(S581*(1+BDI.Taxa),2)","v":0},null,null,0]
[null,null,null,null,null,null,null,null,null,null,null,null,null,null,"z.","DIVERSOS",null,null,0,null,null,null,null,{"$f":"IF(S582>0,IF((SUM(X557:Y581)+ROUND(S582*(1+BDI.Taxa),2))<>X584,X584-SUM(X557:Y581),ROUND(S582*(1+BDI.Taxa),2)),0)","v":0},null,null,{"$f":"IF(S582>0,IF((SUM(AA557:AA581)+IFERROR(ROUND($X582*100/$Z$541,2),0))<>AA584,AA584-SUM(AA557:AA581),IFERROR(ROUND($X582*100/$Z$541,2),0)),0)","v":0}]
[null,null,null,null,null,null,null,null,null,null,null,null,null,null,"TOTAL GERAL DO ORÇAMENTO (R$)",null,null,null,{"$f":"SUM(S557:W582)","v":0},null,null,null,null,{"$f":"SUM(X557:Y582)","v":0},null,null,{"$f":"SUM(AA557:AA582)","v":0}]
[null,null,null,null,null,null,null,null,null,null,null,null,null,null,null,null,null,null,{"$f":"$Z$539","v":0},null,null,null,null,{"$f":"$Z$541","v":0},null,null,100]
[null,null,null,null,null,null,null,null,null,null,null,null,null,null,null,null,null,null,"(TOTAL SEM BDI)",null,null,null,null,"(TOTAL COM BDI)",null,null,"(ARRED porcentagem)"]
[null,null,null,null,null,null,null,null,null,null,null,null,null,null,null,null,null,null,{"$f":"IF(AND(S583=S584,S583>0),\"OK\",\"ERRO\")","v":"ERRO"},null,null,null,null,{"$f":"IF(AND(X583=X584,X583>0),\"OK\",\"ERRO\")","v":"ERRO"},null,null,{"$f":"IF(AA583=100,\"OK\",\"ERRO\")","v":"ERRO"}]
[]
[]
[null,null,null,null,null,null,null,null,null,null,null,null,null,null,"RESUMO GERAL DO ORÇAMENTO"]
[null,null,null,null,null,null,null,null,null,null,null,null,null,null,"ITEM","DESCRIÇÃO DOS SERVIÇOS",null,null,"PREÇO SEM BDI",null,null,null,null,"PREÇO COM BDI",null,null,"PARTICIPAÇÃO ( % )"]
[null,null,null,null,null,null,null,null,null,null,null,null,null,null,"1.",{"$f":"IFERROR(VLOOKUP(O591,$O$19:$Y$538,4,FALSE),\"\")","v":"AMPLIAÇÃO/REFORMA"},null,null,{"$f":"IF(P592=\"\",$S$612-SUM(OFFSET($S$590:S590,0,0,COUNTA($S$590:S590),1)),SUMIF($R$19:$R$538,$P591,$Z$19:$Z$538))","v":0},null,null,null,null,{"$f":"IF(P592=\"\",$X$612-SUM(OFFSET($X$590:X590,0,0,COUNTA($X$590:X590),1)),ROUND(S591*(1+BDI.Taxa),2))","v":0},null,null,{"$f":"IF(P592=\"\",$AA$612-SUM(OFFSET($AA$590:AA590,0,0,COUNTA($AA$590:AA590),1)),ROUND(X591*100/ORÇAMENTO.TotalOrçamento,2))","v":{"$error":"#DIV/0!"}}]
[null,null,null,null,null,null,null,null,null,null,null,null,null,null,"2.","COZINHA SEDUC OPÇÃO 2",null,null,{"$f":"IF(P593=\"\",$S$612-SUM(OFFSET($S$590:S591,0,0,COUNTA($S$590:S591),1)),SUMIF($R$19:$R$538,$P592,$Z$19:$Z$538))","v":0},null,null,null,null,{"$f":"IF(P593=\"\",$X$612-SUM(OFFSET($X$590:X591,0,0,COUNTA($X$590:X591),1)),ROUND(S592*(1+BDI.Taxa),2))","v":0},null,null,{"$f":"IF(P593=\"\",$AA$612-SUM(OFFSET($AA$590:AA591,0,0,COUNTA($AA$590:AA591),1)),ROUND(X592*100/ORÇAMENTO.TotalOrçamento,2))","v":{"$error":"#DIV/0!"}}]
[null,null,null,null,null,null,null,null,null,null,null,null,null,null,"3.","",null,null,{"$f":"IF(P594=\"\",$S$612-SUM(OFFSET($S$590:S592,0,0,COUNTA($S$590:S592),1)),SUMIF($R$19:$R$538,$P593,$Z$19:$Z$538))","v":0},null,null,null,null,{"$f":"IF(P594=\"\",$X$612-SUM(OFFSET($X$590:X592,0,0,COUNTA($X$590:X592),1)),ROUND(S593*(1+BDI.Taxa),2))","v":0},null,null,{"$f":"IF(P594=\"\",$AA$612-SUM(OFFSET($AA$590:AA592,0,0,COUNTA($AA$590:AA592),1)),ROUND(X593*100/ORÇAMENTO.TotalOrçamento,2))","v":{"$error":"#DIV/0!"}}]
[null,null,null,null,null,null,null,null,null,null,null,null,null,null,"4.","",null,null,{"$f":"IF(P595=\"\",$S$612-SUM(OFFSET($S$590:S593,0,0,COUNTA($S$590:S593),1)),SUMIF($R$19:$R$538,$P594,$Z$19:$Z$538))","v":0},null,null,null,null,{"$f":"IF(P595=\"\",$X$612-SUM(OFFSET($X$590:X593,0,0,COUNTA($X$590:X593),1)),ROUND(S594*(1+BDI.Taxa),2))","v":0},null,null,{"$f":"IF(P595=\"\",$AA$612-SUM(OFFSET($AA$590:AA593,0,0,COUNTA($AA$590:AA593),1)),ROUND(X594*100/ORÇAMENTO.TotalOrçamento,2))","v":{"$error":"#DIV/0!"}}]
[null,null,null,null,null,null,null,null,null,null,null,null,null,null,"5.","",null,null,{"$f":"IF(P596=\"\",$S$612-SUM(OFFSET($S$590:S594,0,0,COUNTA($S$590:S594),1)),SUMIF($R$19:$R$538,$P595,$Z$19:$Z$538))","v":0},null,null,null,null,{"$f":"IF(P596=\"\",$X$612-SUM(OFFSET($X$590:X594,0,0,COUNTA($X$590:X594),1)),ROUND(S595*(1+BDI.Taxa),2))","v":0},null,null,{"$f":"IF(P596=\"\",$AA$612-SUM(OFFSET($AA$590:AA594,0,0,COUNTA($AA$590:AA594),1)),ROUND(X595*100/ORÇAMENTO.TotalOrçamento,2))","v":{"$error":"#DIV/0!"}}]
[null,null,null,null,null,null,null,null,null,null,null,null,null,null,"6.","",null,null,{"$f":"IF(P597=\"\",$S$612-SUM(OFFSET($S$590:S595,0,0,COUNTA($S$590:S595),1)),SUMIF($R$19:$R$538,$P596,$Z$19:$Z$538))","v":0},null,null,null,null,{"$f":"IF(P597=\"\",$X$612-SUM(OFFSET($X$590:X595,0,0,COUNTA($X$590:X595),1)),ROUND(S596*(1+BDI.Taxa),2))","v":0},null,null,{"$f":"IF(P597=\"\",$AA$612-SUM(OFFSET($AA$590:AA595,0,0,COUNTA($AA$590:AA595),1)),ROUND(X596*100/ORÇAMENTO.TotalOrçamento,2))","v":{"$error":"#DIV/0!"}}]
[null,null,null,null,null,null,null,null,null,null,null,null,null,null,"7.","",null,null,{"$f":"IF(P598=\"\",$S$612-SUM(OFFSET($S$590:S596,0,0,COUNTA($S$590:S596),1)),SUMIF($R$19:$R$538,$P597,$Z$19:$Z$538))","v":0},null,null,null,null,{"$f":"IF(P598=\"\",$X$612-SUM(OFFSET($X$590:X596,0,0,COUNTA($X$590:X596),1)),ROUND(S597*(1+BDI.Taxa),2))","v":0},null,null,{"$f":"IF(P598=\"\",$AA$612-SUM(OFFSET($AA$590:AA596,0,0,COUNTA($AA$590:AA596),1)),ROUND(X597*100/ORÇAMENTO.TotalOrçamento,2))","v":{"$error":"#DIV/0!"}}]
[null,null,null,null,null,null,null,null,null,null,null,null,null,null,"8.","",null,null,{"$f":"IF(P599=\"\",$S$612-SUM(OFFSET($S$590:S597,0,0,COUNTA($S$590:S597),1)),SUMIF($R$19:$R$538,$P598,$Z$19:$Z$538))","v":0},null,null,null,null,{"$f":"IF(P599=\"\",$X$612-SUM(OFFSET($X$590:X597,0,0,COUNTA($X$590:X597),1)),ROUND(S598*(1+BDI.Taxa),2))","v":0},null,null,{"$f":"IF(P599=\"\",$AA$612-SUM(OFFSET($AA$590:AA597,0,0,COUNTA($AA$590:AA597),1)),ROUND(X598*100/ORÇAMENTO.TotalOrçamento,2))","v":{"$error":"#DIV/0!"}}]
[null,null,null,null,null,null,null,null,null,null,null,null,null,null,"9.","",null,null,{"$f":"IF(P600=\"\",$S$612-SUM(OFFSET($S$590:S598,0,0,COUNTA($S$590:S598),1)),SUMIF($R$19:$R$538,$P599,$Z$19:$Z$538))","v":0},null,null,null,null,{"$f":"IF(P600=\"\",$X$612-SUM(OFFSET($X$590:X598,0,0,COUNTA($X$590:X598),1)),ROUND(S599*(1+BDI.Taxa),2))","v":0},null,null,{"$f":"IF(P600=\"\",$AA$612-SUM(OFFSET($AA$590:AA598,0,0,COUNTA($AA$590:AA598),1)),ROUND(X599*100/ORÇAMENTO.TotalOrçamento,2))","v":{"$error":"#DIV/0!"}}]
[null,null,null,null,null,null,null,null,null,null,null,null,null,null,"10.","",null,null,{"$f":"IF(P601=\"\",$S$612-SUM(OFFSET($S$590:S599,0,0,COUNTA($S$590:S599),1)),SUMIF($R$19:$R$538,$P600,$Z$19:$Z$538))","v":0},null,null,null,null,{"$f":"IF(P601=\"\",$X$612-SUM(OFFSET($X$590:X599,0,0,COUNTA($X$590:X599),1)),ROUND(S600*(1+BDI.Taxa),2))","v":0},null,null,{"$f":"IF(P601=\"\",$AA$612-SUM(OFFSET($AA$590:AA599,0,0,COUNTA($AA$590:AA599),1)),ROUND(X600*100/ORÇAMENTO.TotalOrçamento,2))","v":{"$error":"#DIV/0!"}}]
[null,null,null,null,null,null,null,null,null,null,null,null,null,null,"11.","",null,null,{"$f":"IF(P602=\"\",$S$612-SUM(OFFSET($S$590:S600,0,0,COUNTA($S$590:S600),1)),SUMIF($R$19:$R$538,$P601,$Z$19:$Z$538))","v":0},null,null,null,null,{"$f":"IF(P602=\"\",$X$612-SUM(OFFSET($X$590:X600,0,0,COUNTA($X$590:X600),1)),ROUND(S601*(1+BDI.Taxa),2))","v":0},null,null,{"$f":"IF(P602=\"\",$AA$612-SUM(OFFSET($AA$590:AA600,0,0,COUNTA($AA$590:AA600),1)),ROUND(X601*100/ORÇAMENTO.TotalOrçamento,2))","v":{"$error":"#DIV/0!"}}]
[null,null,null,null,null,null,null,null,null,null,null,null,null,null,"12.","",null,null,{"$f":"IF(P603=\"\",$S$612-SUM(OFFSET($S$590:S601,0,0,COUNTA($S$590:S601),1)),SUMIF($R$19:$R$538,$P602,$Z$19:$Z$538))","v":0},null,null,null,null,{"$f":"IF(P603=\"\",$X$612-SUM(OFFSET($X$590:X601,0,0,COUNTA($X$590:X601),1)),ROUND(S602*(1+BDI.Taxa),2))","v":0},null,null,{"$f":"IF(P603=\"\",$AA$612-SUM(OFFSET($AA$590:AA601,0,0,COUNTA($AA$590:AA601),1)),ROUND(X602*100/ORÇAMENTO.TotalOrçamento,2))","v":{"$error":"#DIV/0!"}}]
[null,null,null,null,null,null,null,null,null,null,null,null,null,null,"13.","",null,null,{"$f":"IF(P604=\"\",$S$612-SUM(OFFSET($S$590:S602,0,0,COUNTA($S$590:S602),1)),SUMIF($R$19:$R$538,$P603,$Z$19:$Z$538))","v":0},null,null,null,null,{"$f":"IF(P604=\"\",$X$612-SUM(OFFSET($X$590:X602,0,0,COUNTA($X$590:X602),1)),ROUND(S603*(1+BDI.Taxa),2))","v":0},null,null,{"$f":"IF(P604=\"\",$AA$612-SUM(OFFSET($AA$590:AA602,0,0,COUNTA($AA$590:AA602),1)),ROUND(X603*100/ORÇAMENTO.TotalOrçamento,2))","v":{"$error":"#DIV/0!"}}]
[null,null,null,null,null,null,null,null,null,null,null,null,null,null,"14.","",null,null,{"$f":"IF(P605=\"\",$S$612-SUM(OFFSET($S$590:S603,0,0,COUNTA($S$590:S603),1)),SUMIF($R$19:$R$538,$P604,$Z$19:$Z$538))","v":0},null,null,null,null,{"$f":"IF(P605=\"\",$X$612-SUM(OFFSET($X$590:X603,0,0,COUNTA($X$590:X603),1)),ROUND(S604*(1+BDI.Taxa),2))","v":0},null,null,{"$f":"IF(P605=\"\",$AA$612-SUM(OFFSET($AA$590:AA603,0,0,COUNTA($AA$590:AA603),1)),ROUND(X604*100/ORÇAMENTO.TotalOrçamento,2))","v":{"$error":"#DIV/0!"}}]
[null,null,null,null,null,null,null,null,null,null,null,null,null,null,"15.","",null,null,{"$f":"IF(P606=\"\",$S$612-SUM(OFFSET($S$590:S604,0,0,COUNTA($S$590:S604),1)),SUMIF($R$19:$R$538,$P605,$Z$19:$Z$538))","v":0},null,null,null,null,{"$f":"IF(P606=\"\",$X$612-SUM(OFFSET($X$590:X604,0,0,COUNTA($X$590:X604),1)),ROUND(S605*(1+BDI.Taxa),2))","v":0},null,null,{"$f":"IF(P606=\"\",$AA$612-SUM(OFFSET($AA$590:AA604,0,0,COUNTA($AA$590:AA604),1)),ROUND(X605*100/ORÇAMENTO.TotalOrçamento,2))","v":{"$error":"#DIV/0!"}}]
[null,null,null,null,null,null,null,null,null,null,null,null,null,null,"16.","",null,null,{"$f":"IF(P607=\"\",$S$612-SUM(OFFSET($S$590:S605,0,0,COUNTA($S$590:S605),1)),SUMIF($R$19:$R$538,$P606,$Z$19:$Z$538))","v":0},null,null,null,null,{"$f":"IF(P607=\"\",$X$612-SUM(OFFSET($X$590:X605,0,0,COUNTA($X$590:X605),1)),ROUND(S606*(1+BDI.Taxa),2))","v":0},null,null,{"$f":"IF(P607=\"\",$AA$612-SUM(OFFSET($AA$590:AA605,0,0,COUNTA($AA$590:AA605),1)),ROUND(X606*100/ORÇAMENTO.TotalOrçamento,2))","v":{"$error":"#DIV/0!"}}]
[null,null,null,null,null,null,null,null,null,null,null,null,null,null,"17.","",null,null,{"$f":"IF(P608=\"\",$S$612-SUM(OFFSET($S$590:S606,0,0,COUNTA($S$590:S606),1)),SUMIF($R$19:$R$538,$P607,$Z$19:$Z$538))","v":0},null,null,null,null,{"$f":"IF(P608=\"\",$X$612-SUM(OFFSET($X$590:X606,0,0,COUNTA($X$590:X606),1)),ROUND(S607*(1+BDI.Taxa),2))","v":0},null,null,{"$f":"IF(P608=\"\",$AA$612-SUM(OFFSET($AA$590:AA606,0,0,COUNTA($AA$590:AA606),1)),ROUND(X607*100/ORÇAMENTO.TotalOrçamento,2))","v":{"$error":"#DIV/0!"}}]
[null,null,null,null,null,null,null,null,null,null,null,null,null,null,"18.","",null,null,{"$f":"IF(P609=\"\",$S$612-SUM(OFFSET($S$590:S607,0,0,COUNTA($S$590:S607),1)),SUMIF($R$19:$R$538,$P608,$Z$19:$Z$538))","v":0},null,null,null,null,{"$f":"IF(P609=\"\",$X$612-SUM(OFFSET($X$590:X607,0,0,COUNTA($X$590:X607),1)),ROUND(S608*(1+BDI.Taxa),2))","v":0},null,null,{"$f":"IF(P609=\"\",$AA$612-SUM(OFFSET($AA$590:AA607,0,0,COUNTA($AA$590:AA607),1)),ROUND(X608*100/ORÇAMENTO.TotalOrçamento,2))","v":{"$error":"#DIV/0!"}}]
[null,null,null,null,null,null,null,null,null,null,null,null,null,null,"19.","",null,null,{"$f":"IF(P610=\"\",$S$612-SUM(OFFSET($S$590:S608,0,0,COUNTA($S$590:S608),1)),SUMIF($R$19:$R$538,$P609,$Z$19:$Z$538))","v":0},null,null,null,null,{"$f":"IF(P610=\"\",$X$612-SUM(OFFSET($X$590:X608,0,0,COUNTA($X$590:X608),1)),ROUND(S609*(1+BDI.Taxa),2))","v":0},null,null,{"$f":"IF(P610=\"\",$AA$612-SUM(OFFSET($AA$590:AA608,0,0,COUNTA($AA$590:AA608),1)),ROUND(X609*100/ORÇAMENTO.TotalOrçamento,2))","v":{"$error":"#DIV/0!"}}]
[null,null,null,null,null,null,null,null,null,null,null,null,null,null,"20.","",null,null,{"$f":"IF(P611=\"\",$S$612-SUM(OFFSET($S$590:S609,0,0,COUNTA($S$590:S609),1)),SUMIF($R$19:$R$538,$P610,$Z$19:$Z$538))","v":0},null,null,null,null,{"$f":"IF(P611=\"\",$X$612-SUM(OFFSET($X$590:X609,0,0,COUNTA($X$590:X609),1)),ROUND(S610*(1+BDI.Taxa),2))","v":0},null,null,{"$f":"IF(P611=\"\",$AA$612-SUM(OFFSET($AA$590:AA609,0,0,COUNTA($AA$590:AA609),1)),ROUND(X610*100/ORÇAMENTO.TotalOrçamento,2))","v":{"$error":"#DIV/0!"}}]
[null,null,null,null,null,null,null,null,null,null,null,null,null,null,"TOTAL GERAL DO ORÇAMENTO (R$)",null,null,null,{"$f":"SUM(S591:W610)","v":0},null,null,null,null,{"$f":"SUM(X591:Y610)","v":0},null,null,{"$f":"SUM(AA591:AA610)","v":{"$error":"#DIV/0!"}}]
[null,null,null,null,null,null,null,null,null,null,null,null,null,null,null,null,null,null,{"$f":"$Z$539","v":0},null,null,null,null,{"$f":"$Z$541","v":0},null,null,100]
[null,null,null,null,null,null,null,null,null,null,null,null,null,null,null,null,null,null,"(TOTAL SEM BDI)",null,null,null,null,"(TOTAL COM BDI)",null,null,"(ARRED porcentagem)"]
[null,null,null,null,null,null,null,null,null,null,null,null,null,null,null,null,null,null,{"$f":"IF(AND(S611=S612,S611>0),\"OK\",\"ERRO\")","v":"ERRO"},null,null,null,null,{"$f":"IF(AND(X611=X612,X611>0),\"OK\",\"ERRO\")","v":"ERRO"},null,null,{"$f":"IF(AND(AA611=100,S591<>0),\"OK\",\"ERRO\")","v":{"$error":"#DIV/0!"}}]

{"sheet":"Resumo ","index":1,"n_rows":39,"n_cols":9,"rows_kept":39,"cut":false,"hidden":false,"merged":[[13,0,14,0],[15,2,15,5],[16,2,16,5],[17,2,17,5],[18,2,18,5],[14,1,14,8],[0,1,0,8],[36,1,36,5],[2,1,2,5],[3,1,3,5],[5,1,5,5],[6,1,6,5],[8,1,8,5],[9,1,9,5],[11,3,11,5],[12,3,12,5],[10,1,10,8],[11,6,11,8],[12,6,12,8],[19,2,19,5],[20,2,20,5],[21,2,21,5],[31,2,31,5],[1,1,1,8],[2,6,2,8],[3,6,3,8],[4,1,4,8],[5,6,5,8],[6,6,6,8],[7,1,7,8],[8,6,8,8],[9,6,9,8],[13,1,13,8],[11,1,11,2],[12,1,12,2],[42,3,42,7],[41,3,41,7],[38,1,38,8],[22,2,22,5],[23,2,23,5],[24,2,24,5],[25,2,25,5],[26,2,26,5],[32,2,32,5],[33,2,33,5],[34,2,34,5],[35,2,35,5],[27,2,27,5],[28,2,28,5],[29,2,29,5],[30,2,30,5]]}
[]
[]
[null,"UNIDADE ESCOLAR",null,null,null,null,"CÓDIGO INEP"]
[null,{"$f":"Orçamento!$O$4","v":"CENTRO DE ENSINO EM PERÍODO INTEGRAL SÃO SEBASTIÃO"},null,null,null,null,{"$f":"Orçamento!X4","v":52030180}]
[]
[null,"OBRA",null,null,null,null,"CIDADE"]
[null,{"$f":"Orçamento!$O$7","v":"AMPLIAÇÃO/REFORMA"},null,null,null,null,{"$f":"Orçamento!$X$7","v":"SÃO LUÍS DE MONTES BELOS"}]
[]
[null,"ENDEREÇO",null,null,null,null,"CRE"]
[null,{"$f":"Orçamento!$R$10","v":" RUA 02 , VILA CANAA , CEP: 7610-000"},null,null,null,null,{"$f":"Orçamento!$O$10","v":"CRE-SÃO L. M. BELOS"}]
[]
[null,"REFERÊNCIA",null,"DATA",null,null,"ÁREA TOTAL CONSTRUÍDA (M²)"]
[null,{"$f":"CONCATENATE(\"AGETOP E SINAPI - \",Orçamento!$T$10)","v":"AGETOP E SINAPI - DESONERADA"},null,{"$f":"Orçamento!$S$7","v":"2020-05-15"},null,null,{"$f":"Orçamento!$X$13","v":1777.18}]
["FILTRO"]
[null,"RESUMO GERAL DO ORÇAMENTO"]
["↓","ITEM","DESCRIÇÃO DOS SERVIÇOS",null,null,null,"PREÇO SEM BDI","PREÇO COM BDI","PARTICIP. (%)"]
[{"$f":"IF(G17>0,\"F\",\"\")","v":""},"1.",{"$f":"Orçamento!$P591","v":"AMPLIAÇÃO/REFORMA"},null,null,null,{"$f":"IFERROR(Orçamento!S591,\"-\")","v":0},{"$f":"IFERROR(Orçamento!X591,\"\")","v":0},{"$f":"Orçamento!AA591","v":{"$error":"#DIV/0!"}}]
[{"$f":"IF(G18>0,\"F\",\"\")","v":""},"2.",{"$f":"Orçamento!$P592","v":"COZINHA SEDUC OPÇÃO 2"},null,null,null,{"$f":"IFERROR(Orçamento!S592,\"-\")","v":0},{"$f":"IFERROR(Orçamento!X592,\"\")","v":0},{"$f":"Orçamento!AA592","v":{"$error":"#DIV/0!"}}]
["","3.",{"$f":"Orçamento!$P593","v":""},null,null,null,{"$f":"IFERROR(Orçamento!S593,\"-\")","v":0},{"$f":"IFERROR(Orçamento!X593,\"\")","v":0},{"$f":"Orçamento!AA593","v":{"$error":"#DIV/0!"}}]
["","4.",{"$f":"Orçamento!$P594","v":""},null,null,null,{"$f":"IFERROR(Orçamento!S594,\"-\")","v":0},{"$f":"IFERROR(Orçamento!X594,\"\")","v":0},{"$f":"Orçamento!AA594","v":{"$error":"#DIV/0!"}}]
["","5.",{"$f":"Orçamento!$P595","v":""},null,null,null,{"$f":"IFERROR(Orçamento!S595,\"-\")","v":0},{"$f":"IFERROR(Orçamento!X595,\"\")","v":0},{"$f":"Orçamento!AA595","v":{"$error":"#DIV/0!"}}]
["","6.",{"$f":"Orçamento!$P596","v":""},null,null,null,{"$f":"IFERROR(Orçamento!S596,\"-\")","v":0},{"$f":"IFERROR(Orçamento!X596,\"\")","v":0},{"$f":"Orçamento!AA596","v":{"$error":"#DIV/0!"}}]
["","7.",{"$f":"Orçamento!$P597","v":""},null,null,null,{"$f":"IFERROR(Orçamento!S597,\"-\")","v":0},{"$f":"IFERROR(Orçamento!X597,\"\")","v":0},{"$f":"Orçamento!AA597","v":{"$error":"#DIV/0!"}}]
["","8.",{"$f":"Orçamento!$P598","v":""},null,null,null,{"$f":"IFERROR(Orçamento!S598,\"-\")","v":0},{"$f":"IFERROR(Orçamento!X598,\"\")","v":0},{"$f":"Orçamento!AA598","v":{"$error":"#DIV/0!"}}]
["","9.",{"$f":"Orçamento!$P599","v":""},null,null,null,{"$f":"IFERROR(Orçamento!S599,\"-\")","v":0},{"$f":"IFERROR(Orçamento!X599,\"\")","v":0},{"$f":"Orçamento!AA599","v":{"$error":"#DIV/0!"}}]
["","10.",{"$f":"Orçamento!$P600","v":""},null,null,null,{"$f":"IFERROR(Orçamento!S600,\"-\")","v":0},{"$f":"IFERROR(Orçamento!X600,\"\")","v":0},{"$f":"Orçamento!AA600","v":{"$error":"#DIV/0!"}}]
["","11.",{"$f":"Orçamento!$P601","v":""},null,null,null,{"$f":"IFERROR(Orçamento!S601,\"-\")","v":0},{"$f":"IFERROR(Orçamento!X601,\"\")","v":0},{"$f":"Orçamento!AA601","v":{"$error":"#DIV/0!"}}]
["","12.",{"$f":"Orçamento!$P602","v":""},null,null,null,{"$f":"IFERROR(Orçamento!S602,\"-\")","v":0},{"$f":"IFERROR(Orçamento!X602,\"\")","v":0},{"$f":"Orçamento!AA602","v":{"$error":"#DIV/0!"}}]
["","13.",{"$f":"Orçamento!$P603","v":""},null,null,null,{"$f":"IFERROR(Orçamento!S603,\"-\")","v":0},{"$f":"IFERROR(Orçamento!X603,\"\")","v":0},{"$f":"Orçamento!AA603","v":{"$error":"#DIV/0!"}}]
["","14.",{"$f":"Orçamento!$P604","v":""},null,null,null,{"$f":"IFERROR(Orçamento!S604,\"-\")","v":0},{"$f":"IFERROR(Orçamento!X604,\"\")","v":0},{"$f":"Orçamento!AA604","v":{"$error":"#DIV/0!"}}]
["","15.",{"$f":"Orçamento!$P605","v":""},null,null,null,{"$f":"IFERROR(Orçamento!S605,\"-\")","v":0},{"$f":"IFERROR(Orçamento!X605,\"\")","v":0},{"$f":"Orçamento!AA605","v":{"$error":"#DIV/0!"}}]
["","16.",{"$f":"Orçamento!$P606","v":""},null,null,null,{"$f":"IFERROR(Orçamento!S606,\"-\")","v":0},{"$f":"IFERROR(Orçamento!X606,\"\")","v":0},{"$f":"Orçamento!AA606","v":{"$error":"#DIV/0!"}}]
["","17.",{"$f":"Orçamento!$P607","v":""},null,null,null,{"$f":"IFERROR(Orçamento!S607,\"-\")","v":0},{"$f":"IFERROR(Orçamento!X607,\"\")","v":0},{"$f":"Orçamento!AA607","v":{"$error":"#DIV/0!"}}]
["","18.",{"$f":"Orçamento!$P608","v":""},null,null,null,{"$f":"IFERROR(Orçamento!S608,\"-\")","v":0},{"$f":"IFERROR(Orçamento!X608,\"\")","v":0},{"$f":"Orçamento!AA608","v":{"$error":"#DIV/0!"}}]
["","19.",{"$f":"Orçamento!$P609","v":""},null,null,null,{"$f":"IFERROR(Orçamento!S609,\"-\")","v":0},{"$f":"IFERROR(Orçamento!X609,\"\")","v":0},{"$f":"Orçamento!AA609","v":{"$error":"#DIV/0!"}}]
["","20.",{"$f":"Orçamento!$P610","v":""},null,null,null,{"$f":"IFERROR(Orçamento!S610,\"-\")","v":0},{"$f":"IFERROR(Orçamento!X610,\"\")","v":0},{"$f":"Orçamento!AA610","v":{"$error":"#DIV/0!"}}]
["F","TOTAL GERAL DO ORÇAMENTO (R$)",null,null,null,null,{"$f":"SUM(G17:G36)","v":0},{"$f":"SUM(H17:H36)","v":0},{"$f":"SUM(I17:I36)","v":{"$error":"#DIV/0!"}}]
["F"]
["F"]

{"sheet":"Somatório","index":2,"n_rows":45,"n_cols":6,"rows_kept":45,"cut":false,"hidden":false,"merged":[[13,0,14,0],[42,1,42,2],[44,1,44,5],[47,3,47,5],[48,3,48,5],[13,1,13,5],[9,1,9,3],[9,4,9,5],[11,1,11,2],[11,4,11,5],[12,1,12,2],[12,4,12,5],[0,1,0,5],[14,1,14,5],[2,1,2,3],[2,4,2,5],[3,1,3,3],[3,4,3,5],[5,1,5,3],[5,4,5,5],[6,1,6,3],[6,4,6,5],[8,1,8,3],[8,4,8,5],[1,1,1,5],[4,1,4,5],[7,1,7,5],[10,1,10,5]]}
[]
[]
[null,"UNIDADE ESCOLAR",null,null,"CÓDIGO INEP"]
[null,{"$f":"Orçamento!$O$4","v":"CENTRO DE ENSINO EM PERÍODO INTEGRAL SÃO SEBASTIÃO"},null,null,{"$f":"Orçamento!X4","v":52030180}]
[]
[null,"OBRA",null,null,"CIDADE"]
[null,{"$f":"Orçamento!$O$7","v":"AMPLIAÇÃO/REFORMA"},null,null,{"$f":"Orçamento!$X$7","v":"SÃO LUÍS DE MONTES BELOS"}]
[]
[null,"ENDEREÇO",null,null,"CRE"]
[null,{"$f":"Orçamento!$R$10","v":" RUA 02 , VILA CANAA , CEP: 7610-000"},null,null,{"$f":"Orçamento!$O$10","v":"CRE-SÃO L. M. BELOS"}]
[]
[null,"REFERÊNCIA",null,"DATA","ÁREA TOTAL CONSTRUÍDA (M²)"]
[null,{"$f":"CONCATENATE(\"AGETOP E SINAPI - \",Orçamento!$T$10)","v":"AGETOP E SINAPI - DESONERADA"},null,{"$f":"Orçamento!$S$7","v":"2020-05-15"},{"$f":"Orçamento!$X$13","v":1777.18}]
["FILTRO"]
[null,"SOMATÓRIO DE SERVIÇOS"]
["↓","ITEM","DESCRIÇÃO DOS SERVIÇOS","PREÇO SEM BDI (R$)","PREÇO COM BDI (R$)","PARTIC.  ( % )"]
[{"$f":"IF(D17>0,\"F\",\"\")","v":""},"a.",{"$f":"Orçamento!P557","v":"SERVIÇOS PRELIMINARES"},{"$f":"Orçamento!S557","v":0},{"$f":"Orçamento!X557","v":0},{"$f":"Orçamento!AA557","v":0}]
[{"$f":"IF(D18>0,\"F\",\"\")","v":""},"b.",{"$f":"Orçamento!P558","v":"TRANSPORTES"},{"$f":"Orçamento!S558","v":0},{"$f":"Orçamento!X558","v":0},{"$f":"Orçamento!AA558","v":0}]
["","c.",{"$f":"Orçamento!P559","v":"SERVIÇO EM TERRA"},{"$f":"Orçamento!S559","v":0},{"$f":"Orçamento!X559","v":0},{"$f":"Orçamento!AA559","v":0}]
["","d.",{"$f":"Orçamento!P560","v":"FUNDAÇÕES E SONDAGENS"},{"$f":"Orçamento!S560","v":0},{"$f":"Orçamento!X560","v":0},{"$f":"Orçamento!AA560","v":0}]
["","e.",{"$f":"Orçamento!P561","v":"ESTRUTURA"},{"$f":"Orçamento!S561","v":0},{"$f":"Orçamento!X561","v":0},{"$f":"Orçamento!AA561","v":0}]
["","f.",{"$f":"Orçamento!P562","v":"INSTALAÇÕES ELÉTRICAS"},{"$f":"Orçamento!S562","v":0},{"$f":"Orçamento!X562","v":0},{"$f":"Orçamento!AA562","v":0}]
["","g.",{"$f":"Orçamento!P563","v":"INSTALAÇÕES HIDROSSANITÁRIAS"},{"$f":"Orçamento!S563","v":0},{"$f":"Orçamento!X563","v":0},{"$f":"Orçamento!AA563","v":0}]
["","h",{"$f":"Orçamento!P564","v":"INSTALAÇÕES ESPECIAIS"},{"$f":"Orçamento!S564","v":0},{"$f":"Orçamento!X564","v":0},{"$f":"Orçamento!AA564","v":0}]
["","i.",{"$f":"Orçamento!P565","v":"ALVENARIAS E DIVISÓRIAS"},{"$f":"Orçamento!S565","v":0},{"$f":"Orçamento!X565","v":0},{"$f":"Orçamento!AA565","v":0}]
["","j.",{"$f":"Orçamento!P566","v":"ALVENARIA AUTO-PORTANTE"},{"$f":"Orçamento!S566","v":0},{"$f":"Orçamento!X566","v":0},{"$f":"Orçamento!AA566","v":0}]
["","k.",{"$f":"Orçamento!P567","v":"IMPERMEABILIZAÇÃO"},{"$f":"Orçamento!S567","v":0},{"$f":"Orçamento!X567","v":0},{"$f":"Orçamento!AA567","v":0}]
["","l.",{"$f":"Orçamento!P568","v":"ISOLAMENTO TÉRMICO E ACÚSTICO"},{"$f":"Orçamento!S568","v":0},{"$f":"Orçamento!X568","v":0},{"$f":"Orçamento!AA568","v":0}]
["","m.",{"$f":"Orçamento!P569","v":"ESTRUTURA DE MADEIRA"},{"$f":"Orçamento!S569","v":0},{"$f":"Orçamento!X569","v":0},{"$f":"Orçamento!AA569","v":0}]
["","n.",{"$f":"Orçamento!P570","v":"ESTRUTURAS METÁLICAS"},{"$f":"Orçamento!S570","v":0},{"$f":"Orçamento!X570","v":0},{"$f":"Orçamento!AA570","v":0}]
["","o.",{"$f":"Orçamento!P571","v":"COBERTURAS"},{"$f":"Orçamento!S571","v":0},{"$f":"Orçamento!X571","v":0},{"$f":"Orçamento!AA571","v":0}]
["","p.",{"$f":"Orçamento!P572","v":"ESQUADRIAS DE MADEIRA"},{"$f":"Orçamento!S572","v":0},{"$f":"Orçamento!X572","v":0},{"$f":"Orçamento!AA572","v":0}]
["","q.",{"$f":"Orçamento!P573","v":"ESQUADRIAS METÁLICAS"},{"$f":"Orçamento!S573","v":0},{"$f":"Orçamento!X573","v":0},{"$f":"Orçamento!AA573","v":0}]
["","r.",{"$f":"Orçamento!P574","v":"VIDROS"},{"$f":"Orçamento!S574","v":0},{"$f":"Orçamento!X574","v":0},{"$f":"Orçamento!AA574","v":0}]
["","s.",{"$f":"Orçamento!P575","v":"REVESTIMENTO DE PAREDE"},{"$f":"Orçamento!S575","v":0},{"$f":"Orçamento!X575","v":0},{"$f":"Orçamento!AA575","v":0}]
["","t.",{"$f":"Orçamento!P576","v":"FORROS"},{"$f":"Orçamento!S576","v":0},{"$f":"Orçamento!X576","v":0},{"$f":"Orçamento!AA576","v":0}]
["","u.",{"$f":"Orçamento!P577","v":"REVESTIMENTO DE PISO"},{"$f":"Orçamento!S577","v":0},{"$f":"Orçamento!X577","v":0},{"$f":"Orçamento!AA577","v":0}]
["","v.",{"$f":"Orçamento!P578","v":"FERRAGENS"},{"$f":"Orçamento!S578","v":0},{"$f":"Orçamento!X578","v":0},{"$f":"Orçamento!AA578","v":0}]
["","w.",{"$f":"Orçamento!P579","v":"MARCENARIA"},{"$f":"Orçamento!S579","v":0},{"$f":"Orçamento!X579","v":0},{"$f":"Orçamento!AA579","v":0}]
["","x.",{"$f":"Orçamento!P580","v":"ADMINISTRAÇÃO"},{"$f":"Orçamento!S580","v":0},{"$f":"Orçamento!X580","v":0},{"$f":"Orçamento!AA580","v":0}]
["","y.",{"$f":"Orçamento!P581","v":"PINTURA"},{"$f":"Orçamento!S581","v":0},{"$f":"Orçamento!X581","v":0},{"$f":"Orçamento!AA581","v":0}]
["","z.",{"$f":"Orçamento!P582","v":"DIVERSOS"},{"$f":"Orçamento!S582","v":0},{"$f":"Orçamento!X582","v":0},{"$f":"Orçamento!AA582","v":0}]
["F","TOTAL GERAL DO ORÇAMENTO",null,{"$f":"SUM(D17:D42)","v":0},{"$f":"SUM(E17:E42)","v":0},{"$f":"SUM(F17:F42)","v":0}]
[]
[null,"(*) Para itens da AGETOP, os vidros não estão inclusos nas esquadrias e já foram considerados os custos de contramarco para as esquadrias de alumínio;"]

{"sheet":"Cronog_90_Dias","index":3,"n_rows":99,"n_cols":20,"rows_kept":99,"cut":false,"hidden":false,"merged":[[0,1,0,17],[1,1,1,17],[2,1,2,7],[2,8,2,17],[3,1,3,7],[3,8,3,17],[8,1,8,7],[8,8,8,17],[9,0,11,0],[9,1,9,7],[9,8,9,17],[10,1,10,17],[11,1,11,17],[4,1,4,17],[5,1,5,7],[5,8,5,17],[6,1,6,7],[6,8,6,17],[7,1,7,17],[12,0,13,0],[12,3,13,3],[12,5,12,8],[12,9,12,12],[12,13,12,16],[12,17,13,17],[13,1,13,2],[13,5,13,8],[13,9,13,12],[13,13,13,16],[14,1,16,2],[14,3,16,3],[14,4,16,4],[14,5,14,8],[14,9,14,12],[14,13,14,16],[16,5,16,8],[16,9,16,12],[16,13,16,16],[17,1,19,2],[17,3,19,3],[17,4,19,4],[17,5,17,8],[17,9,17,12],[17,13,17,16],[19,5,19,8],[19,9,19,12],[19,13,19,16],[20,1,22,2],[20,3,22,3],[20,4,22,4],[20,5,20,8],[20,9,20,12],[20,13,20,16],[22,5,22,8],[22,9,22,12],[22,13,22,16],[23,1,25,2],[23,3,25,3],[23,4,25,4],[23,5,23,8],[23,9,23,12],[23,13,23,16],[25,5,25,8],[25,9,25,12],[25,13,25,16],[26,1,28,2],[26,3,28,3],[26,4,28,4],[26,5,26,8],[26,9,26,12],[26,13,26,16],[28,5,28,8],[28,9,28,12],[28,13,28,16],[29,1,31,2],[29,3,31,3],[29,4,31,4],[29,5,29,8],[29,9,29,12],[29,13,29,16],[31,5,31,8],[31,9,31,12],[31,13,31,16],[32,1,34,2],[32,3,34,3],[32,4,34,4],[32,5,32,8],[32,9,32,12],[32,13,32,16],[34,5,34,8],[34,9,34,12],[34,13,34,16],[35,1,37,2],[35,3,37,3],[35,4,37,4],[35,5,35,8],[35,9,35,12],[35,13,35,16],[37,5,37,8],[37,9,37,12],[37,13,37,16],[38,1,40,2],[38,3,40,3],[38,4,40,4],[38,5,38,8],[38,9,38,12],[38,13,38,16],[40,5,40,8],[40,9,40,12],[40,13,40,16],[41,1,43,2],[41,3,43,3],[41,4,43,4],[41,5,41,8],[41,9,41,12],[41,13,41,16],[43,5,43,8],[43,9,43,12],[43,13,43,16],[44,1,46,2],[44,3,46,3],[44,4,46,4],[44,5,44,8],[44,9,44,12],[44,13,44,16],[46,5,46,8],[46,9,46,12],[46,13,46,16],[47,1,49,2],[47,3,49,3],[47,4,49,4],[47,5,47,8],[47,9,47,12],[47,13,47,16],[49,5,49,8],[49,9,49,12],[49,13,49,16],[50,1,52,2],[50,3,52,3],[50,4,52,4],[50,5,50,8],[50,9,50,12],[50,13,50,16],[52,5,52,8],[52,9,52,12],[52,13,52,16],[53,1,55,2],[53,3,55,3],[53,4,55,4],[53,5,53,8],[53,9,53,12],[53,13,53,16],[55,5,55,8],[55,9,55,12],[55,13,55,16],[56,1,58,2],[56,3,58,3],[56,4,58,4],[56,5,56,8],[56,9,56,12],[56,13,56,16],[58,5,58,8],[58,9,58,12],[58,13,58,16],[59,1,61,2],[59,3,61,3],[59,4,61,4],[59,5,59,8],[59,9,59,12],[59,13,59,16],[61,5,61,8],[61,9,61,12],[61,13,61,16],[62,1,64,2],[62,3,64,3],[62,4,64,4],[62,5,62,8],[62,9,62,12],[62,13,62,16],[64,5,64,8],[64,9,64,12],[64,13,64,16],[65,1,67,2],[65,3,67,3],[65,4,67,4],[65,5,65,8],[65,9,65,12],[65,13,65,16],[67,5,67,8],[67,9,67,12],[67,13,67,16],[68,1,70,2],[68,3,70,3],[68,4,70,4],[68,5,68,8],[68,9,68,12],[68,13,68,16],[70,5,70,8],[70,9,70,12],[70,13,70,16],[71,1,73,2],[71,3,73,3],[71,4,73,4],[71,5,71,8],[71,9,71,12],[71,13,71,16],[73,5,73,8],[73,9,73,12],[73,13,73,16],[74,1,76,2],[74,3,76,3],[74,4,76,4],[74,5,74,8],[74,9,74,12],[74,13,74,16],[76,5,76,8],[76,9,76,12],[76,13,76,16],[77,1,79,2],[77,3,79,3],[77,4,79,4],[77,5,77,8],[77,9,77,12],[77,13,77,16],[79,5,79,8],[79,9,79,12],[79,13,79,16],[80,1,82,2],[80,3,82,3],[80,4,82,4],[80,5,80,8],[80,9,80,12],[80,13,80,16],[82,5,82,8],[82,9,82,12],[82,13,82,16],[83,1,85,2],[83,3,85,3],[83,4,85,4],[83,5,83,8],[83,9,83,12],[83,13,83,16],[85,5,85,8],[85,9,85,12],[85,13,85,16],[86,1,88,2],[86,3,88,3],[86,4,88,4],[86,5,86,8],[86,9,86,12],[86,13,86,16],[88,5,88,8],[88,9,88,12],[88,13,88,16],[92,1,92,2],[92,5,92,8],[92,9,92,12],[92,13,92,16],[93,1,93,2],[93,5,93,8],[93,9,93,12],[93,13,93,16],[89,1,91,2],[89,3,91,3],[89,4,91,4],[89,5,89,8],[89,9,89,12],[89,13,89,16],[91,5,91,8],[91,9,91,12],[91,13,91,16],[97,1,97,4],[98,1,98,17],[94,1,94,2],[94,5,94,8],[94,9,94,12],[94,13,94,16],[95,1,95,2],[95,5,95,8],[95,9,95,12],[95,13,95,16]]}
[]
[]
[null,"UNIDADE ESCOLAR",null,null,null,null,null,null,"PRAZO"]
[null,{"$f":"Orçamento!O4","v":"CENTRO DE ENSINO EM PERÍODO INTEGRAL SÃO SEBASTIÃO"},null,null,null,null,null,null,"90 DIAS CORRIDOS"]
[]
[null,"OBRA",null,null,null,null,null,null,"DATA"]
[null,{"$f":"Orçamento!O7","v":"AMPLIAÇÃO/REFORMA"},null,null,null,null,null,null,{"$f":"Orçamento!S7","v":"2020-05-15"}]
[]
[null,"LOCAL",null,null,null,null,null,null,"ÁREA TOTAL CONSTRUÍDA (M²)"]
["FILTRO",{"$f":"Orçamento!X7","v":"SÃO LUÍS DE MONTES BELOS"},null,null,null,null,null,null,{"$f":"Orçamento!X13","v":1777.18}]
[]
[null,"CRONOGRAMA - FÍSICO FINANCEIRO"]
["↓","CUSTO TOTAL:",{"$f":"D93","v":0},"VALOR","Dias:",30,null,null,null,60,null,null,null,90,null,null,null,"TOTAL"]
[null,"DESCRIÇÃO DOS SERVIÇOS",null,null,"%","1ª PARCELA",null,null,null,"2ª PARCELA",null,null,null,"3ª PARCELA"]
[{"$f":"IF(D15>0,\"F\",\"\")","v":""},"SERVIÇOS PRELIMINARES",null,{"$f":"Orçamento!X557","v":0},{"$f":"Orçamento!AA557","v":0},{"$f":"ROUND(F17*$D$15,2)","v":0},null,null,null,{"$f":"ROUND(J17*$D$15,2)","v":0},null,null,null,{"$f":"ROUND(N17*$D$15,2)","v":0},null,null,null,{"$f":"SUM(F15:Q15)","v":0},null,{"$f":"IF(D15=R15,\"OK\",\"ERRO\")","v":"OK"}]
[{"$f":"IF(A15=\"F\",A15,\"\")","v":""}]
[{"$f":"IF(A16=\"F\",A16,\"\")","v":""},null,null,null,null,1,null,null,null,0,null,null,null,{"$f":"1-F17-J17","v":0},null,null,null,{"$f":"IFERROR(E15/100,\"\")","v":0},null,{"$f":"IF(E15=R17*100,\"OK\",\"ERRO\")","v":"OK"}]
[{"$f":"IF(D18>0,\"F\",\"\")","v":""},"TRANSPORTES",null,{"$f":"Orçamento!X558","v":0},{"$f":"Orçamento!AA558","v":0},{"$f":"ROUND(F20*$D$18,2)","v":0},null,null,null,{"$f":"ROUND(J20*$D$18,2)","v":0},null,null,null,{"$f":"ROUND(N20*$D$18,2)","v":0},null,null,null,{"$f":"SUM(F18:Q18)","v":0},null,{"$f":"IF(D18=R18,\"OK\",\"ERRO\")","v":"OK"}]
[{"$f":"IF(A18=\"F\",A18,\"\")","v":""}]
[{"$f":"IF(A19=\"F\",A19,\"\")","v":""},null,null,null,null,0.35199999999999998,null,null,null,0.3,null,null,null,{"$f":"1-F20-J20","v":0.34800000000000003},null,null,null,{"$f":"IFERROR(E18/100,\"\")","v":0},null,{"$f":"IF(E18=R20*100,\"OK\",\"ERRO\")","v":"OK"}]
[{"$f":"IF(D21>0,\"F\",\"\")","v":""},"SERVIÇO EM TERRA",null,{"$f":"Orçamento!X559","v":0},{"$f":"Orçamento!AA559","v":0},{"$f":"ROUND(F23*$D$21,2)","v":0},null,null,null,{"$f":"ROUND(J23*$D$21,2)","v":0},null,null,null,{"$f":"ROUND(N23*$D$21,2)","v":0},null,null,null,{"$f":"SUM(F21:Q21)","v":0},null,{"$f":"IF(D21=R21,\"OK\",\"ERRO\")","v":"OK"}]
[{"$f":"IF(A21=\"F\",A21,\"\")","v":""}]
[{"$f":"IF(A22=\"F\",A22,\"\")","v":""},null,null,null,null,1,null,null,null,0,null,null,null,{"$f":"1-F23-J23","v":0},null,null,null,{"$f":"IFERROR(E21/100,\"\")","v":0},null,{"$f":"IF(E21=R23*100,\"OK\",\"ERRO\")","v":"OK"}]
[{"$f":"IF(D24>0,\"F\",\"\")","v":""},"FUNDAÇÕES E SONDAGENS",null,{"$f":"Orçamento!X560","v":0},{"$f":"Orçamento!AA560","v":0},{"$f":"ROUND(F26*$D$24,2)","v":0},null,null,null,{"$f":"ROUND(J26*$D$24,2)","v":0},null,null,null,{"$f":"ROUND(N26*$D$24,2)","v":0},null,null,null,{"$f":"SUM(F24:Q24)","v":0},null,{"$f":"IF(D24=R24,\"OK\",\"ERRO\")","v":"OK"}]
[{"$f":"IF(A24=\"F\",A24,\"\")","v":""}]
[{"$f":"IF(A25=\"F\",A25,\"\")","v":""},null,null,null,null,1,null,null,null,0,null,null,null,{"$f":"1-F26-J26","v":0},null,null,null,{"$f":"IFERROR(E24/100,\"\")","v":0},null,{"$f":"IF(E24=R26*100,\"OK\",\"ERRO\")","v":"OK"}]
[{"$f":"IF(D27>0,\"F\",\"\")","v":""},"ESTRUTURA",null,{"$f":"Orçamento!X561","v":0},{"$f":"Orçamento!AA561","v":0},{"$f":"ROUND(F29*$D$27,2)","v":0},null,null,null,{"$f":"ROUND(J29*$D$27,2)","v":0},null,null,null,{"$f":"ROUND(N29*$D$27,2)","v":0},null,null,null,{"$f":"SUM(F27:Q27)","v":0},null,{"$f":"IF(D27=R27,\"OK\",\"ERRO\")","v":"OK"}]
[{"$f":"IF(A27=\"F\",A27,\"\")","v":""}]
[{"$f":"IF(A28=\"F\",A28,\"\")","v":""},null,null,null,null,0.54,null,null,null,0.46,null,null,null,{"$f":"1-F29-J29","v":0},null,null,null,{"$f":"IFERROR(E27/100,\"\")","v":0},null,{"$f":"IF(E27=R29*100,\"OK\",\"ERRO\")","v":"OK"}]
[{"$f":"IF(D30>0,\"F\",\"\")","v":""},"INST.ELET/TELEFÔNICA/CABEAMENTO ESTRUTURADO",null,{"$f":"Orçamento!X562","v":0},{"$f":"Orçamento!AA562","v":0},{"$f":"ROUND(F32*$D$30,2)","v":0},null,null,null,{"$f":"ROUND(J32*$D$30,2)","v":0},null,null,null,{"$f":"ROUND(N32*$D$30,2)","v":0},null,null,null,{"$f":"SUM(F30:Q30)","v":0},null,{"$f":"IF(D30=R30,\"OK\",\"ERRO\")","v":"OK"}]
[{"$f":"IF(A30=\"F\",A30,\"\")","v":""}]
[{"$f":"IF(A31=\"F\",A31,\"\")","v":""},null,null,null,null,0,null,null,null,{"$f":"1-B32","v":1},null,null,null,{"$f":"1-F32-J32","v":0},null,null,null,{"$f":"IFERROR(E30/100,\"\")","v":0},null,{"$f":"IF(E30=R32*100,\"OK\",\"ERRO\")","v":"OK"}]
[{"$f":"IF(D33>0,\"F\",\"\")","v":""},"INSTALAÇÕES HIDROSSANITÁRIAS",null,{"$f":"Orçamento!X563","v":0},{"$f":"Orçamento!AA563","v":0},{"$f":"ROUND(F35*$D$33,2)","v":0},null,null,null,{"$f":"ROUND(J35*$D$33,2)","v":0},null,null,null,{"$f":"ROUND(N35*$D$33,2)","v":0},null,null,null,{"$f":"SUM(F33:Q33)","v":0},null,{"$f":"IF(D33=R33,\"OK\",\"ERRO\")","v":"OK"}]
[{"$f":"IF(A33=\"F\",A33,\"\")","v":""}]
[{"$f":"IF(A34=\"F\",A34,\"\")","v":""},null,null,null,null,0,null,null,null,{"$f":"1-B35","v":1},null,null,null,{"$f":"1-F35-J35","v":0},null,null,null,{"$f":"IFERROR(E33/100,\"\")","v":0},null,{"$f":"IF(E33=R35*100,\"OK\",\"ERRO\")","v":"OK"}]
[{"$f":"IF(D36>0,\"F\",\"\")","v":""},"INSTALAÇÕES ESPECIAIS",null,{"$f":"Orçamento!X564","v":0},{"$f":"Orçamento!AA564","v":0},{"$f":"ROUND(F38*$D$36,2)","v":0},null,null,null,{"$f":"ROUND(J38*$D$36,2)","v":0},null,null,null,{"$f":"ROUND(N38*$D$36,2)","v":0},null,null,null,{"$f":"SUM(F36:Q36)","v":0},null,{"$f":"IF(D36=R36,\"OK\",\"ERRO\")","v":"OK"}]
[{"$f":"IF(A36=\"F\",A36,\"\")","v":""}]
[{"$f":"IF(A37=\"F\",A37,\"\")","v":""},null,null,null,null,0,null,null,null,{"$f":"1-B38","v":1},null,null,null,{"$f":"1-F38-J38","v":0},null,null,null,{"$f":"IFERROR(E36/100,\"\")","v":0},null,{"$f":"IF(E36=R38*100,\"OK\",\"ERRO\")","v":"OK"}]
[{"$f":"IF(D39>0,\"F\",\"\")","v":""},"ALVENARIA E DIVISÓRIAS",null,{"$f":"Orçamento!X565","v":0},{"$f":"Orçamento!AA565","v":0},{"$f":"ROUND(F41*$D$39,2)","v":0},null,null,null,{"$f":"ROUND(J41*$D$39,2)","v":0},null,null,null,{"$f":"ROUND(N41*$D$39,2)","v":0},null,null,null,{"$f":"SUM(F39:Q39)","v":0},null,{"$f":"IF(D39=R39,\"OK\",\"ERRO\")","v":"OK"}]
[{"$f":"IF(A39=\"F\",A39,\"\")","v":""}]
[{"$f":"IF(A40=\"F\",A40,\"\")","v":""},null,null,null,null,0,null,null,null,{"$f":"1-B41","v":1},null,null,null,{"$f":"1-F41-J41","v":0},null,null,null,{"$f":"IFERROR(E39/100,\"\")","v":0},null,{"$f":"IF(E39=R41*100,\"OK\",\"ERRO\")","v":"OK"}]
[{"$f":"IF(D42>0,\"F\",\"\")","v":""},"ALVENARIA AUTO-PORTANTE",null,{"$f":"Orçamento!X566","v":0},{"$f":"Orçamento!AA566","v":0},{"$f":"ROUND(F44*$D$42,2)","v":0},null,null,null,{"$f":"ROUND(J44*$D$42,2)","v":0},null,null,null,{"$f":"ROUND(N44*$D$42,2)","v":0},null,null,null,{"$f":"SUM(F42:Q42)","v":0},null,{"$f":"IF(D42=R42,\"OK\",\"ERRO\")","v":"OK"}]
[{"$f":"IF(A42=\"F\",A42,\"\")","v":""}]
[{"$f":"IF(A43=\"F\",A43,\"\")","v":""},null,null,null,null,0,null,null,null,{"$f":"1-B44","v":1},null,null,null,{"$f":"1-F44-J44","v":0},null,null,null,{"$f":"IFERROR(E42/100,\"\")","v":0},null,{"$f":"IF(E42=R44*100,\"OK\",\"ERRO\")","v":"OK"}]
[{"$f":"IF(D45>0,\"F\",\"\")","v":""},"IMPERMEABILIZAÇÃO",null,{"$f":"Orçamento!X567","v":0},{"$f":"Orçamento!AA567","v":0},{"$f":"ROUND(F47*$D$45,2)","v":0},null,null,null,{"$f":"ROUND(J47*$D$45,2)","v":0},null,null,null,{"$f":"ROUND(N47*$D$45,2)","v":0},null,null,null,{"$f":"SUM(F45:Q45)","v":0},null,{"$f":"IF(D45=R45,\"OK\",\"ERRO\")","v":"OK"}]
[{"$f":"IF(A45=\"F\",A45,\"\")","v":""}]
[{"$f":"IF(A46=\"F\",A46,\"\")","v":""},null,null,null,null,0.85,null,null,null,0.15,null,null,null,{"$f":"1-F47-J47","v":0},null,null,null,{"$f":"IFERROR(E45/100,\"\")","v":0},null,{"$f":"IF(E45=R47*100,\"OK\",\"ERRO\")","v":"OK"}]
[{"$f":"IF(D48>0,\"F\",\"\")","v":""},"ISOLAMENTO TÉRMICO E ACÚSTICO",null,{"$f":"Orçamento!X568","v":0},{"$f":"Orçamento!AA568","v":0},{"$f":"ROUND(F50*$D$48,2)","v":0},null,null,null,{"$f":"ROUND(J50*$D$48,2)","v":0},null,null,null,{"$f":"ROUND(N50*$D$48,2)","v":0},null,null,null,{"$f":"SUM(F48:Q48)","v":0},null,{"$f":"IF(D48=R48,\"OK\",\"ERRO\")","v":"OK"}]
[{"$f":"IF(A48=\"F\",A48,\"\")","v":""}]
[{"$f":"IF(A49=\"F\",A49,\"\")","v":""},null,null,null,null,0,null,null,null,{"$f":"1-B50","v":1},null,null,null,{"$f":"1-F50-J50","v":0},null,null,null,{"$f":"IFERROR(E48/100,\"\")","v":0},null,{"$f":"IF(E48=R50*100,\"OK\",\"ERRO\")","v":"OK"}]
[{"$f":"IF(D51>0,\"F\",\"\")","v":""},"ESTRUTURA DE MADEIRA",null,{"$f":"Orçamento!X569","v":0},{"$f":"Orçamento!AA569","v":0},{"$f":"ROUND(F53*$D$51,2)","v":0},null,null,null,{"$f":"ROUND(J53*$D$51,2)","v":0},null,null,null,{"$f":"ROUND(N53*$D$51,2)","v":0},null,null,null,{"$f":"SUM(F51:Q51)","v":0},null,{"$f":"IF(D51=R51,\"OK\",\"ERRO\")","v":"OK"}]
[{"$f":"IF(A51=\"F\",A51,\"\")","v":""}]
[{"$f":"IF(A52=\"F\",A52,\"\")","v":""},null,null,null,null,0,null,null,null,0.57999999999999996,null,null,null,{"$f":"1-F53-J53","v":0.42000000000000004},null,null,null,{"$f":"IFERROR(E51/100,\"\")","v":0},null,{"$f":"IF(E51=R53*100,\"OK\",\"ERRO\")","v":"OK"}]
[{"$f":"IF(D54>0,\"F\",\"\")","v":""},"ESTRUTURA METÁLICA",null,{"$f":"Orçamento!X570","v":0},{"$f":"Orçamento!AA570","v":0},{"$f":"ROUND(F56*$D$54,2)","v":0},null,null,null,{"$f":"ROUND(J56*$D$54,2)","v":0},null,null,null,{"$f":"ROUND(N56*$D$54,2)","v":0},null,null,null,{"$f":"SUM(F54:Q54)","v":0},null,{"$f":"IF(D54=R54,\"OK\",\"ERRO\")","v":"OK"}]
[{"$f":"IF(A54=\"F\",A54,\"\")","v":""}]
[{"$f":"IF(A55=\"F\",A55,\"\")","v":""},null,null,null,null,0,null,null,null,0.57999999999999996,null,null,null,{"$f":"1-F56-J56","v":0.42000000000000004},null,null,null,{"$f":"IFERROR(E54/100,\"\")","v":0},null,{"$f":"IF(E54=R56*100,\"OK\",\"ERRO\")","v":"OK"}]
[{"$f":"IF(D57>0,\"F\",\"\")","v":""},"COBERTURAS",null,{"$f":"Orçamento!X571","v":0},{"$f":"Orçamento!AA571","v":0},{"$f":"ROUND(F59*$D$57,2)","v":0},null,null,null,{"$f":"ROUND(J59*$D$57,2)","v":0},null,null,null,{"$f":"ROUND(N59*$D$57,2)","v":0},null,null,null,{"$f":"SUM(F57:Q57)","v":0},null,{"$f":"IF(D57=R57,\"OK\",\"ERRO\")","v":"OK"}]
[{"$f":"IF(A57=\"F\",A57,\"\")","v":""}]
[{"$f":"IF(A58=\"F\",A58,\"\")","v":""},null,null,null,null,0,null,null,null,0,null,null,null,{"$f":"1-F59-J59","v":1},null,null,null,{"$f":"IFERROR(E57/100,\"\")","v":0},null,{"$f":"IF(E57=R59*100,\"OK\",\"ERRO\")","v":"OK"}]
[{"$f":"IF(D60>0,\"F\",\"\")","v":""},"ESQUADRIAS DE MADEIRA",null,{"$f":"Orçamento!X572","v":0},{"$f":"Orçamento!AA572","v":0},{"$f":"ROUND(F62*$D$60,2)","v":0},null,null,null,{"$f":"ROUND(J62*$D$60,2)","v":0},null,null,null,{"$f":"ROUND(N62*$D$60,2)","v":0},null,null,null,{"$f":"SUM(F60:Q60)","v":0},null,{"$f":"IF(D60=R60,\"OK\",\"ERRO\")","v":"OK"}]
[{"$f":"IF(A60=\"F\",A60,\"\")","v":""}]
[{"$f":"IF(A61=\"F\",A61,\"\")","v":""},null,null,null,null,0,null,null,null,0.4,null,null,null,{"$f":"1-F62-J62","v":0.6},null,null,null,{"$f":"IFERROR(E60/100,\"\")","v":0},null,{"$f":"IF(E60=R62*100,\"OK\",\"ERRO\")","v":"OK"}]
[{"$f":"IF(D63>0,\"F\",\"\")","v":""},"ESQUADRIAS METÁLICAS",null,{"$f":"Orçamento!X573","v":0},{"$f":"Orçamento!AA573","v":0},{"$f":"ROUND(F65*$D$63,2)","v":0},null,null,null,{"$f":"ROUND(J65*$D$63,2)","v":0},null,null,null,{"$f":"ROUND(N65*$D$63,2)","v":0},null,null,null,{"$f":"SUM(F63:Q63)","v":0},null,{"$f":"IF(D63=R63,\"OK\",\"ERRO\")","v":"OK"}]
[{"$f":"IF(A63=\"F\",A63,\"\")","v":""}]
[{"$f":"IF(A64=\"F\",A64,\"\")","v":""},null,null,null,null,0,null,null,null,0.45,null,null,null,{"$f":"1-F65-J65","v":0.55000000000000004},null,null,null,{"$f":"IFERROR(E63/100,\"\")","v":0},null,{"$f":"IF(E63=R65*100,\"OK\",\"ERRO\")","v":"OK"}]
[{"$f":"IF(D66>0,\"F\",\"\")","v":""},"VIDROS",null,{"$f":"Orçamento!X574","v":0},{"$f":"Orçamento!AA574","v":0},{"$f":"ROUND(F68*$D$66,2)","v":0},null,null,null,{"$f":"ROUND(J68*$D$66,2)","v":0},null,null,null,{"$f":"ROUND(N68*$D$66,2)","v":0},null,null,null,{"$f":"SUM(F66:Q66)","v":0},null,{"$f":"IF(D66=R66,\"OK\",\"ERRO\")","v":"OK"}]
[{"$f":"IF(A66=\"F\",A66,\"\")","v":""}]
[{"$f":"IF(A67=\"F\",A67,\"\")","v":""},null,null,null,null,0,null,null,null,0,null,null,null,{"$f":"1-F68-J68","v":1},null,null,null,{"$f":"IFERROR(E66/100,\"\")","v":0},null,{"$f":"IF(E66=R68*100,\"OK\",\"ERRO\")","v":"OK"}]
[{"$f":"IF(D69>0,\"F\",\"\")","v":""},"REVESTIMENTO DE PAREDE",null,{"$f":"Orçamento!X575","v":0},{"$f":"Orçamento!AA575","v":0},{"$f":"ROUND(F71*$D$69,2)","v":0},null,null,null,{"$f":"ROUND(J71*$D$69,2)","v":0},null,null,null,{"$f":"ROUND(N71*$D$69,2)","v":0},null,null,null,{"$f":"SUM(F69:Q69)","v":0},null,{"$f":"IF(D69=R69,\"OK\",\"ERRO\")","v":"OK"}]
[{"$f":"IF(A69=\"F\",A69,\"\")","v":""}]
[{"$f":"IF(A70=\"F\",A70,\"\")","v":""},null,null,null,null,0,null,null,null,0.4,null,null,null,{"$f":"1-F71-J71","v":0.6},null,null,null,{"$f":"IFERROR(E69/100,\"\")","v":0},null,{"$f":"IF(E69=R71*100,\"OK\",\"ERRO\")","v":"OK"}]
[{"$f":"IF(D72>0,\"F\",\"\")","v":""},"FORROS",null,{"$f":"Orçamento!X576","v":0},{"$f":"Orçamento!AA576","v":0},{"$f":"ROUND(F74*$D$72,2)","v":0},null,null,null,{"$f":"ROUND(J74*$D$72,2)","v":0},null,null,null,{"$f":"ROUND(N74*$D$72,2)","v":0},null,null,null,{"$f":"SUM(F72:Q72)","v":0},null,{"$f":"IF(D72=R72,\"OK\",\"ERRO\")","v":"OK"}]
[{"$f":"IF(A72=\"F\",A72,\"\")","v":""}]
[{"$f":"IF(A73=\"F\",A73,\"\")","v":""},null,null,null,null,0,null,null,null,0.4,null,null,null,{"$f":"1-F74-J74","v":0.6},null,null,null,{"$f":"IFERROR(E72/100,\"\")","v":0},null,{"$f":"IF(E72=R74*100,\"OK\",\"ERRO\")","v":"OK"}]
[{"$f":"IF(D75>0,\"F\",\"\")","v":""},"REVESTIMENTO DE PISO",null,{"$f":"Orçamento!X577","v":0},{"$f":"Orçamento!AA577","v":0},{"$f":"ROUND(F77*$D$75,2)","v":0},null,null,null,{"$f":"ROUND(J77*$D$75,2)","v":0},null,null,null,{"$f":"ROUND(N77*$D$75,2)","v":0},null,null,null,{"$f":"SUM(F75:Q75)","v":0},null,{"$f":"IF(D75=R75,\"OK\",\"ERRO\")","v":"OK"}]
[{"$f":"IF(A75=\"F\",A75,\"\")","v":""}]
[{"$f":"IF(A76=\"F\",A76,\"\")","v":""},null,null,null,null,0,null,null,null,0.4,null,null,null,{"$f":"1-F77-J77","v":0.6},null,null,null,{"$f":"IFERROR(E75/100,\"\")","v":0},null,{"$f":"IF(E75=R77*100,\"OK\",\"ERRO\")","v":"OK"}]
[{"$f":"IF(D78>0,\"F\",\"\")","v":""},"FERRAGENS",null,{"$f":"Orçamento!X578","v":0},{"$f":"Orçamento!AA578","v":0},{"$f":"ROUND(F80*$D$78,2)","v":0},null,null,null,{"$f":"ROUND(J80*$D$78,2)","v":0},null,null,null,{"$f":"ROUND(N80*$D$78,2)","v":0},null,null,null,{"$f":"SUM(F78:Q78)","v":0},null,{"$f":"IF(D78=R78,\"OK\",\"ERRO\")","v":"OK"}]
[{"$f":"IF(A78=\"F\",A78,\"\")","v":""}]
[{"$f":"IF(A79=\"F\",A79,\"\")","v":""},null,null,null,null,0,null,null,null,0,null,null,null,{"$f":"1-F80-J80","v":1},null,null,null,{"$f":"IFERROR(E78/100,\"\")","v":0},null,{"$f":"IF(E78=R80*100,\"OK\",\"ERRO\")","v":"OK"}]
[{"$f":"IF(D81>0,\"F\",\"\")","v":""},"MARCENARIA",null,{"$f":"Orçamento!X579","v":0},{"$f":"Orçamento!AA579","v":0},{"$f":"ROUND(F83*$D$81,2)","v":0},null,null,null,{"$f":"ROUND(J83*$D$81,2)","v":0},null,null,null,{"$f":"ROUND(N83*$D$81,2)","v":0},null,null,null,{"$f":"SUM(F81:Q81)","v":0},null,{"$f":"IF(D81=R81,\"OK\",\"ERRO\")","v":"OK"}]
[{"$f":"IF(A81=\"F\",A81,\"\")","v":""}]
[{"$f":"IF(A82=\"F\",A82,\"\")","v":""},null,null,null,null,0,null,null,null,0,null,null,null,{"$f":"1-F83-J83","v":1},null,null,null,{"$f":"IFERROR(E81/100,\"\")","v":0},null,{"$f":"IF(E81=R83*100,\"OK\",\"ERRO\")","v":"OK"}]
[{"$f":"IF(D84>0,\"F\",\"\")","v":""},"ADMINISTRAÇÃO - MENSALISTAS",null,{"$f":"Orçamento!X580","v":0},{"$f":"Orçamento!AA580","v":0},{"$f":"ROUND(F86*$D$84,2)","v":0},null,null,null,{"$f":"ROUND(J86*$D$84,2)","v":0},null,null,null,{"$f":"ROUND(N86*$D$84,2)","v":0},null,null,null,{"$f":"SUM(F84:Q84)","v":0},null,{"$f":"IF(D84=R84,\"OK\",\"ERRO\")","v":"OK"}]
[{"$f":"IF(A84=\"F\",A84,\"\")","v":""}]
[{"$f":"IF(A85=\"F\",A85,\"\")","v":""},null,null,null,null,0.34340000000000004,null,null,null,0.33,null,null,null,{"$f":"100%-SUM(F86:M86)","v":0.3266},null,null,null,{"$f":"IFERROR(E84/100,\"\")","v":0},null,{"$f":"IF(E84=R86*100,\"OK\",\"ERRO\")","v":"OK"}]
[{"$f":"IF(D87>0,\"F\",\"\")","v":""},"PINTURA",null,{"$f":"Orçamento!X581","v":0},{"$f":"Orçamento!AA581","v":0},{"$f":"ROUND(F89*$D$87,2)","v":0},null,null,null,{"$f":"ROUND(J89*$D$87,2)","v":0},null,null,null,{"$f":"ROUND(N89*$D$87,2)","v":0},null,null,null,{"$f":"SUM(F87:Q87)","v":0},null,{"$f":"IF(D87=R87,\"OK\",\"ERRO\")","v":"OK"}]
[{"$f":"IF(A87=\"F\",A87,\"\")","v":""}]
[{"$f":"IF(A88=\"F\",A88,\"\")","v":""},null,null,null,null,0,null,null,null,0,null,null,null,{"$f":"1-F89-J89","v":1},null,null,null,{"$f":"IFERROR(E87/100,\"\")","v":0},null,{"$f":"IF(E87=R89*100,\"OK\",\"ERRO\")","v":"OK"}]
[{"$f":"IF(D90>0,\"F\",\"\")","v":""},"DIVERSOS",null,{"$f":"Orçamento!X582","v":0},{"$f":"Orçamento!AA582","v":0},{"$f":"ROUND(F92*$D$90,2)","v":0},null,null,null,{"$f":"ROUND(J92*$D$90,2)","v":0},null,null,null,{"$f":"ROUND(N92*$D$90,2)","v":0},null,null,null,{"$f":"SUM(F90:Q90)","v":0},null,{"$f":"IF(D90=R90,\"OK\",\"ERRO\")","v":"OK"}]
[{"$f":"IF(A90=\"F\",A90,\"\")","v":""}]
[{"$f":"IF(A91=\"F\",A91,\"\")","v":""},null,null,null,null,0,null,null,null,0,null,null,null,{"$f":"1-F92-J92","v":1},null,null,null,{"$f":"IFERROR(E90/100,\"\")","v":0},null,{"$f":"IF(E90=R92*100,\"OK\",\"ERRO\")","v":"OK"}]
["F","CUSTO DO ORÇAMENTO",null,{"$f":"SUM(D15:D92)","v":0},{"$f":"SUM(E15:E92)","v":0},{"$f":"F15+F18+F21+F24+F27+F30+F33+F36+F39+F42+F45+F48+F51+F54+F57+F60+F63+F66+F69+F72+F75+F78+F81+F84+F87+F90","v":0},null,null,null,{"$f":"J15+J18+J21+J24+J27+J30+J33+J36+J39+J42+J45+J48+J51+J54+J57+J60+J63+J66+J69+J72+J75+J78+J81+J84+J87+J90","v":0},null,null,null,{"$f":"N15+N18+N21+N24+N27+N30+N33+N36+N39+N42+N45+N48+N51+N54+N57+N60+N63+N66+N69+N72+N75+N78+N81+N84+N87+N90","v":0},null,null,null,{"$f":"R15+R18+R21+R24+R27+R30+R33+R36+R39+R42+R45+R48+R51+R54+R57+R60+R63+R66+R69+R72+R75+R78+R81+R84+R87+R90","v":0}]
["F","PERCENTUAIS:",null,null,null,{"$f":"IFERROR(F93/D93,\"\")","v":""},null,null,null,{"$f":"IFERROR(J93/D93,\"\")","v":""},null,null,null,{"$f":"IFERROR(N93/D93,\"\")","v":""},null,null,null,{"$f":"SUM(F94:Q94)","v":0}]
["F","TOTAIS ACUMULADOS:",null,null,null,{"$f":"F93","v":0},null,null,null,{"$f":"F95+J93","v":0},null,null,null,{"$f":"J95+N93","v":0}]
["F","PERCENTUAIS  ACUMULADOS:",null,null,null,{"$f":"F94","v":""},null,null,null,{"$f":"J94+F96","v":{"$error":"#VALUE!"}},null,null,null,{"$f":"IFERROR(J96+N94,\"\")","v":""}]
["F"]
["F","OBSERVAÇÕES:"]
["F","Os pagamentos somente poderão ser efetuados mediante medição e atesto pelos técnicos da Secretaria da Educação. "]

{"sheet":"Composição BDI","index":4,"n_rows":45,"n_cols":9,"rows_kept":45,"cut":false,"hidden":false,"merged":[[18,5,18,8],[17,0,17,3],[16,0,16,3],[44,0,44,3],[42,0,42,3],[43,0,43,3],[18,0,18,3],[36,0,36,3],[39,0,39,3],[38,0,38,3],[40,0,40,3],[29,0,29,2],[32,0,32,3],[33,0,33,3],[34,0,34,3],[35,0,35,3],[0,0,0,3],[2,0,2,3],[3,0,3,3],[1,0,1,3],[5,0,5,3],[4,0,4,3],[12,0,12,3],[13,0,13,3],[14,0,14,3],[15,0,15,3],[6,0,6,3],[8,0,8,3],[7,0,7,3],[9,0,9,3],[11,0,11,3],[10,0,10,3]]}
[]
[]
["UNIDADE ESCOLAR"]
[{"$f":"Orçamento!$O$4","v":"CENTRO DE ENSINO EM PERÍODO INTEGRAL SÃO SEBASTIÃO"}]
[]
["OBRA"]
[{"$f":"Orçamento!$O$7","v":"AMPLIAÇÃO/REFORMA"}]
[]
["ENDEREÇO"]
[{"$f":"Orçamento!$R$10","v":" RUA 02 , VILA CANAA , CEP: 7610-000"}]
[]
["CIDADE"]
[{"$f":"Orçamento!$X$7","v":"SÃO LUÍS DE MONTES BELOS"}]
[]
["CRE"]
[{"$f":"Orçamento!$O$10","v":"CRE-SÃO L. M. BELOS"}]
[]
["DETALHAMENTO DA COMPOSIÇÃO DE BDI"]
["COMPOSIÇÃO BDI PARA OBRAS CIVIS",null,null,null,null,"BDI CONSTRUÇÃO E REFORMA"]
["DESCRIÇÃO","COEF.","TAXA % (a.m)","% no preço de venda",null,"Situação","1º Quartil","Médio","3º Quartil"]
["1) COFINS",1,0.03,{"$f":"C21","v":0.03},null,{"$f":"IF(OR(C21<G21,C21>I21),\"FORA DO INTERVALO\",\"OK\")","v":"OK"},0.03,0.03,0.03]
["2) PIS",1,6.4999999999999997E-3,{"$f":"C22","v":6.4999999999999997E-3},null,{"$f":"IF(OR(C22<G22,C22>I22),\"FORA DO INTERVALO\",\"OK\")","v":"OK"},6.4999999999999997E-3,6.4999999999999997E-3,6.4999999999999997E-3]
["3) ISSQN",1,0,{"$f":"C23*B23","v":0},null,"FORA DO INTERVALO",0.02,3.5000000000000003E-2,0.05]
["4) CPRB",1,4.4999999999999998E-2,{"$f":"C24","v":4.4999999999999998E-2},null,"OK",4.4999999999999998E-2,4.4999999999999998E-2,4.4999999999999998E-2]
["5) Administração Central",1,0.04,0.04,null,"OK",0.03,0.04,5.5E-2]
["6) Despesas Financeiras",1,5.5999999999999999E-3,5.5999999999999999E-3,null,"FORA DO INTERVALO",5.8999999999999999E-3,1.23E-2,1.3899999999999999E-2]
["7) Seguros + Garantias",1,1.1999999999999999E-3,1.1999999999999999E-3,null,"FORA DO INTERVALO",8.0000000000000002E-3,8.0000000000000002E-3,0.01]
["8) Risco",1,9.7000000000000003E-3,9.7000000000000003E-3,null,"OK",9.7000000000000003E-3,1.2699999999999999E-2,1.2699999999999999E-2]
["9) Lucro",1,6.3020000000000007E-2,6.3020000000000007E-2,null,"OK",6.1600000000000002E-2,7.3999999999999996E-2,8.9599999999999999E-2]
["BDI - FINAL",null,null,{"$f":"(((1+D25+D27+D28)*(1+D26)*(1+D29))/(1-(D21+D22+D23+D24))-1)","v":0.22306329147610282},null,{"$f":"IF(OR(D30<G30,D30>I30),\"FORA DO INTERVALO\",\"OK\")","v":"OK"},0.2034,0.22120000000000001,0.25]
[]
["Notas:"]
["(1) e (2) Alíquota definida por lei."]
["(3) Alíquota e base de cálculo definidas pela legislação municipal."]
["(4) Alíquota definida pelas leis 12.546/11, 12844/13 e 13.161/15 (CPRB – contribuição previdenciária sobre a receita bruta)."]
["(5) Valores definidos a partir dos limites no Acórdão nº 2.622/2013 - TCU – Plenário. Valores entre o 1º e 3º quartis."]
["(6) Valor calculado pela expressão matemática do acórdão 2.369/2011 – TCU – Plenário e disponibilizado pela AGETOP em dezembro de 2018. (Foi utilizado para o cálculo a média da Taxa SELIC no período de 11/2017 a 10/2018)"]
[]
["(7) Valores definidos pela AGETOP a partir dos limites no Acórdão nº 2.622/2013 - TCU – Plenário. Valores médios. \n\nObservação da AGETOP: (Seguros contra erros de execução, incêndio e explosão, danos da natureza (vendaval, destelhamento, alagamento, inundação, desmoronamento, geadas etc.), emprego de material defeituoso ou inadequado, roubo e/ou furto qualificado, quebra de equipamentos, desmoronamento de estrutura, nas modalidades de Obras Civis em Construção (OCC); Instalação e Montagem (IM); e Obras Civis em Construção e Instalação e Montagem (OCC/IM). Bem como coberturas adicionais para ampliação dessas coberturas básicas, como: cobertura de responsabilidade civil geral, cobertura de responsabilidade civil cruzada, cobertura de despesas extraordinárias, cobertura de tumultos, cobertura de desentulho do local, cobertura de riscos do fabricante, dentre outras, incluindo o seguro de vida em grupo regido pela convenção coletiva dos trabalhadores na indústria da construção civil). A partir de 24/02/2015 por intermédio da Portaria 449/2015 a Presidência da AGETOP, na pessoa do Senhor Jayme Eduardo Rincon, determinou a exclusão dos valores referentes aos Seguros de Risco de Engenharia e Responsabilidade Civil do Profissional na composição do cálculo do B.D.I.."]
["(8) Valores definidos a partir dos limites no Acórdão nº 2.622/2013 - TCU – Plenário. Valores entre 1º e 3° quartis."]
["(9) Valores definidos a partir dos limites definidos no Acórdão nº 2.622/2013 - TCU – Plenário. Valores adotados e praticados no mercado ( “ ex ante ” ) ou aqueles entre os 1º e 3º quartis."]
[]
["(*) A fórmula para estipulação da taxa de BDI estimado adotado é a mesma que foi aplicada para a obtenção das tabelas contidas no Acórdão n. 2.622/2013 – TCUPlenário"]
[]
["Obs.: Para obras com valores superiores a R$ 20.000.000,00 sugere-se recalcular o BDI, dimensionando as taxas de administração central e lucro para patamares inferiores ao estipulado acima."]

{"sheet":"Relatório CENTRAL","index":5,"n_rows":40,"n_cols":5,"rows_kept":40,"cut":false,"hidden":false,"merged":[[8,3,8,4],[9,1,9,2],[10,1,10,4],[11,1,11,4],[39,1,39,2],[9,0,11,0],[0,1,0,4],[6,3,6,4],[9,3,9,4],[1,1,1,4],[2,1,2,2],[2,3,2,4],[3,1,3,2],[3,3,3,4],[4,1,4,4],[5,1,5,2],[5,3,5,4],[6,1,6,2],[7,1,7,4],[8,1,8,2]]}
[]
[]
[null,"UNIDADE ESCOLAR",null,"CIDADE"]
[null,{"$f":"Orçamento!$O$4","v":"CENTRO DE ENSINO EM PERÍODO INTEGRAL SÃO SEBASTIÃO"},null,{"$f":"Orçamento!$X$7","v":"SÃO LUÍS DE MONTES BELOS"}]
[]
[null,"OBRA",null,"CRE"]
[null,{"$f":"Orçamento!$O$7","v":"AMPLIAÇÃO/REFORMA"},null,{"$f":"Orçamento!$O$10","v":"CRE-SÃO L. M. BELOS"}]
[]
[null,"ENDEREÇO",null,"DATA"]
["FILTRO",{"$f":"Orçamento!$R$10","v":" RUA 02 , VILA CANAA , CEP: 7610-000"},null,{"$f":"Orçamento!$S$7","v":"2020-05-15"}]
[]
[null,"RELATÓRIO CENTRAL"]
["↓","CÓDIGO","ETAPA","PREÇO  (R$) C/ BDI","PARTIC  ( % )"]
[{"$f":"IF(D14>0,\"F\",\"\")","v":""},{"$f":"Orçamento!O557","v":"a."},{"$f":"Orçamento!P557","v":"SERVIÇOS PRELIMINARES"},{"$f":"Orçamento!X557","v":0},{"$f":"Orçamento!AA557","v":0}]
[{"$f":"IF(D15>0,\"F\",\"\")","v":""},{"$f":"Orçamento!O558","v":"b."},{"$f":"Orçamento!P558","v":"TRANSPORTES"},{"$f":"Orçamento!X558","v":0},{"$f":"Orçamento!AA558","v":0}]
["",{"$f":"Orçamento!O559","v":"c."},{"$f":"Orçamento!P559","v":"SERVIÇO EM TERRA"},{"$f":"Orçamento!X559","v":0},{"$f":"Orçamento!AA559","v":0}]
["",{"$f":"Orçamento!O560","v":"d."},{"$f":"Orçamento!P560","v":"FUNDAÇÕES E SONDAGENS"},{"$f":"Orçamento!X560","v":0},{"$f":"Orçamento!AA560","v":0}]
["",{"$f":"Orçamento!O561","v":"e."},{"$f":"Orçamento!P561","v":"ESTRUTURA"},{"$f":"Orçamento!X561","v":0},{"$f":"Orçamento!AA561","v":0}]
["",{"$f":"Orçamento!O562","v":"f."},{"$f":"Orçamento!P562","v":"INSTALAÇÕES ELÉTRICAS"},{"$f":"Orçamento!X562","v":0},{"$f":"Orçamento!AA562","v":0}]
["",{"$f":"Orçamento!O563","v":"g."},{"$f":"Orçamento!P563","v":"INSTALAÇÕES HIDROSSANITÁRIAS"},{"$f":"Orçamento!X563","v":0},{"$f":"Orçamento!AA563","v":0}]
["",{"$f":"Orçamento!O564","v":"h"},{"$f":"Orçamento!P564","v":"INSTALAÇÕES ESPECIAIS"},{"$f":"Orçamento!X564","v":0},{"$f":"Orçamento!AA564","v":0}]
["",{"$f":"Orçamento!O565","v":"i."},{"$f":"Orçamento!P565","v":"ALVENARIAS E DIVISÓRIAS"},{"$f":"Orçamento!X565","v":0},{"$f":"Orçamento!AA565","v":0}]
["",{"$f":"Orçamento!O566","v":"j."},{"$f":"Orçamento!P566","v":"ALVENARIA AUTO-PORTANTE"},{"$f":"Orçamento!X566","v":0},{"$f":"Orçamento!AA566","v":0}]
["",{"$f":"Orçamento!O567","v":"k."},{"$f":"Orçamento!P567","v":"IMPERMEABILIZAÇÃO"},{"$f":"Orçamento!X567","v":0},{"$f":"Orçamento!AA567","v":0}]
["",{"$f":"Orçamento!O568","v":"l."},{"$f":"Orçamento!P568","v":"ISOLAMENTO TÉRMICO E ACÚSTICO"},{"$f":"Orçamento!X568","v":0},{"$f":"Orçamento!AA568","v":0}]
["",{"$f":"Orçamento!O569","v":"m."},{"$f":"Orçamento!P569","v":"ESTRUTURA DE MADEIRA"},{"$f":"Orçamento!X569","v":0},{"$f":"Orçamento!AA569","v":0}]
["",{"$f":"Orçamento!O570","v":"n."},{"$f":"Orçamento!P570","v":"ESTRUTURAS METÁLICAS"},{"$f":"Orçamento!X570","v":0},{"$f":"Orçamento!AA570","v":0}]
["",{"$f":"Orçamento!O571","v":"o."},{"$f":"Orçamento!P571","v":"COBERTURAS"},{"$f":"Orçamento!X571","v":0},{"$f":"Orçamento!AA571","v":0}]
["",{"$f":"Orçamento!O572","v":"p."},{"$f":"Orçamento!P572","v":"ESQUADRIAS DE MADEIRA"},{"$f":"Orçamento!X572","v":0},{"$f":"Orçamento!AA572","v":0}]
["",{"$f":"Orçamento!O573","v":"q."},{"$f":"Orçamento!P573","v":"ESQUADRIAS METÁLICAS"},{"$f":"Orçamento!X573","v":0},{"$f":"Orçamento!AA573","v":0}]
["",{"$f":"Orçamento!O574","v":"r."},{"$f":"Orçamento!P574","v":"VIDROS"},{"$f":"Orçamento!X574","v":0},{"$f":"Orçamento!AA574","v":0}]
["",{"$f":"Orçamento!O575","v":"s."},{"$f":"Orçamento!P575","v":"REVESTIMENTO DE PAREDE"},{"$f":"Orçamento!X575","v":0},{"$f":"Orçamento!AA575","v":0}]
["",{"$f":"Orçamento!O576","v":"t."},{"$f":"Orçamento!P576","v":"FORROS"},{"$f":"Orçamento!X576","v":0},{"$f":"Orçamento!AA576","v":0}]
["",{"$f":"Orçamento!O577","v":"u."},{"$f":"Orçamento!P577","v":"REVESTIMENTO DE PISO"},{"$f":"Orçamento!X577","v":0},{"$f":"Orçamento!AA577","v":0}]
["",{"$f":"Orçamento!O578","v":"v."},{"$f":"Orçamento!P578","v":"FERRAGENS"},{"$f":"Orçamento!X578","v":0},{"$f":"Orçamento!AA578","v":0}]
["",{"$f":"Orçamento!O579","v":"w."},{"$f":"Orçamento!P579","v":"MARCENARIA"},{"$f":"Orçamento!X579","v":0},{"$f":"Orçamento!AA579","v":0}]
["",{"$f":"Orçamento!O580","v":"x."},{"$f":"Orçamento!P580","v":"ADMINISTRAÇÃO"},{"$f":"Orçamento!X580","v":0},{"$f":"Orçamento!AA580","v":0}]
["",{"$f":"Orçamento!O581","v":"y."},{"$f":"Orçamento!P581","v":"PINTURA"},{"$f":"Orçamento!X581","v":0},{"$f":"Orçamento!AA581","v":0}]
["",{"$f":"Orçamento!O582","v":"z."},{"$f":"Orçamento!P582","v":"DIVERSOS"},{"$f":"Orçamento!X582","v":0},{"$f":"Orçamento!AA582","v":0}]
["F","TOTAL GERAL DO ORÇAMENTO (R$) C/BDI",null,{"$f":"SUM(D14:D39)","v":0},{"$f":"SUM(E14:E39)","v":0}]

{"sheet":"Parc Maior Relev","index":6,"n_rows":33,"n_cols":7,"rows_kept":33,"cut":false,"hidden":false,"merged":[[0,1,0,6],[11,1,11,6],[1,1,1,6],[2,1,2,3],[2,4,2,6],[3,1,3,3],[3,4,3,6],[4,1,4,6],[5,1,5,3],[5,4,5,6],[9,1,9,3],[9,4,9,6],[10,1,10,6],[6,1,6,3],[6,4,6,6],[7,1,7,6],[8,1,8,3],[8,4,8,6],[33,3,33,7],[31,1,31,6]]}
[]
[]
[null,"UNIDADE ESCOLAR",null,null,"CÓDIGO INEP"]
[null,{"$f":"Orçamento!$O$4","v":"CENTRO DE ENSINO EM PERÍODO INTEGRAL SÃO SEBASTIÃO"},null,null,{"$f":"Orçamento!$X$4","v":52030180}]
[]
[null,"OBRA",null,null,"CIDADE"]
[null,{"$f":"Orçamento!$O$7","v":"AMPLIAÇÃO/REFORMA"},null,null,{"$f":"Orçamento!$X$7","v":"SÃO LUÍS DE MONTES BELOS"}]
[]
[null,"CRE",null,null,"ÁREA TOTAL CONSTRUÍDA (M²)"]
[null,{"$f":"Orçamento!$O$10","v":"CRE-SÃO L. M. BELOS"},null,null,{"$f":"Orçamento!$X$13","v":1777.18}]
[]
["FILTRO","PARCELA DE MAIOR RELEVÂNCIA"]
[{"$f":"IF(G14>0,\"F\",\"\")","v":""},"CÓDIGO","SERVIÇO","DESCRIÇÃO","UNID","QUANT","PARC. MAIOR RELEV (100%)"]
[{"$f":"IF(G14>0,\"F\",\"\")","v":""},"f.","INSTALAÇÕES ELÉTRICAS","SUBESTAÇÃO","KVA",{"$f":"SUMIF(Orçamento!$R$20:$R$538,'Parc Maior Relev'!D14,Orçamento!$T$20:$T$538)","v":0},{"$f":"F14","v":0}]
[{"$f":"IF(SUM(G16:G30)>0,\"F\",\"\")","v":"F"},"CÓDIGO","SERVIÇO","DESCRIÇÃO","UNID","QUANT","PARC. MAIOR RELEV (50%)"]
[{"$f":"IF(G16>0,\"F\",\"\")","v":""},"e.","ESTRUTURA","CONCRETO","M3",{"$f":"SUMIF(Orçamento!$R$20:$R$538,'Parc Maior Relev'!D16,Orçamento!$T$20:$T$538)","v":0},{"$f":"F16*0.5","v":0}]
[{"$f":"IF(G17>0,\"F\",\"\")","v":""},"f.","INSTALAÇÕES ELÉTRICAS","INSTALAÇÕES ELÉTRICAS","KVA",{"$f":"SUMIF(Orçamento!$R$20:$R$538,'Parc Maior Relev'!D17,Orçamento!$T$20:$T$538)","v":0},{"$f":"F17*0.5","v":0}]
[{"$f":"IF(G18>0,\"F\",\"\")","v":""},"o.","COBERTURAS","COBERTURA CERÂMICA","M2",{"$f":"SUMIF(Orçamento!$R$20:$R$538,'Parc Maior Relev'!D18,Orçamento!$T$20:$T$538)","v":0},0]
["","o.","COBERTURAS","COBERTURA COM TELHA METÁLICA","M2",{"$f":"SUMIF(Orçamento!$R$20:$R$538,'Parc Maior Relev'!D19,Orçamento!$T$20:$T$538)","v":0},0]
["","s.","REVESTIMENTO DE PAREDE","CHAPISCO","M2",{"$f":"SUMIF(Orçamento!$R$20:$R$538,'Parc Maior Relev'!D20,Orçamento!$T$20:$T$538)","v":0},0]
["","s.","REVESTIMENTO DE PAREDE","REBOCO","M2",{"$f":"SUMIF(Orçamento!$R$20:$R$538,'Parc Maior Relev'!D21,Orçamento!$T$20:$T$538)","v":0},0]
["","s.","REVESTIMENTO DE PAREDE","REVESTIMENTO CERÂMICO","M2",{"$f":"SUMIF(Orçamento!$R$20:$R$538,'Parc Maior Relev'!D22,Orçamento!$T$20:$T$538)","v":0},0]
["","t.","FORROS","FORRO DE GESSO","M2",{"$f":"SUMIF(Orçamento!$R$20:$R$538,'Parc Maior Relev'!D23,Orçamento!$T$20:$T$538)","v":0},0]
["","t.","FORROS","FORRO DE PVC","M2",{"$f":"SUMIF(Orçamento!$R$20:$R$538,'Parc Maior Relev'!D24,Orçamento!$T$20:$T$538)","v":0},0]
["","t.","FORROS","FORRO DE GESSO ACARTONADO","M2",{"$f":"SUMIF(Orçamento!$R$20:$R$538,'Parc Maior Relev'!D25,Orçamento!$T$20:$T$538)","v":0},0]
["F","u.","REVESTIMENTO DE PISO","PISO DE GRANITINA","M2",455.01,227.505]
["","u.","REVESTIMENTO DE PISO","PISO LAMINADO","M2",{"$f":"SUMIF(Orçamento!$R$20:$R$538,'Parc Maior Relev'!D27,Orçamento!$T$20:$T$538)","v":0},0]
["","u.","REVESTIMENTO DE PISO","PISO DE CONCRETO DESEMPENADO","M2",{"$f":"SUMIF(Orçamento!$R$20:$R$538,'Parc Maior Relev'!D28,Orçamento!$T$20:$T$538)","v":0},0]
["","u.","REVESTIMENTO DE PISO","PISO CERÂMICO","M2",{"$f":"SUMIF(Orçamento!$R$20:$R$538,'Parc Maior Relev'!D29,Orçamento!$T$20:$T$538)","v":0},0]
["","y.","PINTURA","PINTURA","M2",{"$f":"SUMIF(Orçamento!$R$20:$R$538,'Parc Maior Relev'!D30,Orçamento!$T$20:$T$538)","v":0},0]
["F"]
["F","(*) Para os fins do inciso I dp § 1º do Art. 30 da Lei Federal 8.666/93, são consideradas parcelas de maior relevância técnica as execuções apresentadas"]
["F"]

{"sheet":"Composições","index":7,"n_rows":304,"n_cols":10,"rows_kept":304,"cut":false,"hidden":false,"merged":[[293,5,294,5],[293,6,293,7],[293,8,293,9],[298,1,298,7],[303,1,303,7],[293,0,294,0],[293,1,294,1],[293,2,294,2],[293,3,294,3],[293,4,294,4],[272,5,273,5],[272,6,272,7],[272,8,272,9],[277,1,277,7],[291,1,291,7],[272,0,273,0],[272,1,273,1],[272,2,273,2],[272,3,273,3],[272,4,273,4],[250,5,251,5],[250,6,250,7],[250,8,250,9],[255,1,255,7],[270,1,270,7],[250,0,251,0],[250,1,251,1],[250,2,251,2],[250,3,251,3],[250,4,251,4],[230,5,231,5],[230,6,230,7],[230,8,230,9],[235,1,235,7],[248,1,248,7],[230,0,231,0],[230,1,231,1],[230,2,231,2],[230,3,231,3],[230,4,231,4],[211,5,212,5],[211,6,211,7],[211,8,211,9],[216,1,216,7],[228,1,228,7],[211,0,212,0],[211,1,212,1],[211,2,212,2],[211,3,212,3],[211,4,212,4],[201,5,202,5],[201,6,201,7],[201,8,201,9],[205,1,205,7],[209,1,209,7],[201,0,202,0],[201,1,202,1],[201,2,202,2],[201,3,202,3],[201,4,202,4],[191,5,192,5],[191,6,191,7],[191,8,191,9],[195,1,195,7],[199,1,199,7],[191,0,192,0],[191,1,192,1],[191,2,192,2],[191,3,192,3],[191,4,192,4],[181,5,182,5],[181,6,181,7],[181,8,181,9],[185,1,185,7],[189,1,189,7],[181,0,182,0],[181,1,182,1],[181,2,182,2],[181,3,182,3],[181,4,182,4],[171,5,172,5],[171,6,171,7],[171,8,171,9],[175,1,175,7],[179,1,179,7],[171,0,172,0],[171,1,172,1],[171,2,172,2],[171,3,172,3],[171,4,172,4],[162,5,163,5],[162,6,162,7],[162,8,162,9],[167,1,167,7],[169,1,169,7],[162,0,163,0],[162,1,163,1],[162,2,163,2],[162,3,163,3],[162,4,163,4],[153,5,154,5],[153,6,153,7],[153,8,153,9],[158,1,158,7],[160,1,160,7],[153,0,154,0],[153,1,154,1],[153,2,154,2],[153,3,154,3],[153,4,154,4],[140,5,141,5],[140,6,140,7],[140,8,140,9],[144,1,144,7],[151,1,151,7],[140,0,141,0],[140,1,141,1],[140,2,141,2],[140,3,141,3],[140,4,141,4],[133,5,134,5],[133,6,133,7],[133,8,133,9],[137,1,137,7],[138,1,138,7],[133,0,134,0],[133,1,134,1],[133,2,134,2],[133,3,134,3],[133,4,134,4],[123,5,124,5],[123,6,123,7],[123,8,123,9],[127,1,127,7],[131,1,131,7],[123,0,124,0],[123,1,124,1],[123,2,124,2],[123,3,124,3],[123,4,124,4],[113,5,114,5],[113,6,113,7],[113,8,113,9],[117,1,117,7],[121,1,121,7],[113,0,114,0],[113,1,114,1],[113,2,114,2],[113,3,114,3],[113,4,114,4],[103,5,104,5],[103,6,103,7],[103,8,103,9],[108,1,108,7],[111,1,111,7],[103,0,104,0],[103,1,104,1],[103,2,104,2],[103,3,104,3],[103,4,104,4],[93,5,94,5],[93,6,93,7],[93,8,93,9],[98,1,98,7],[101,1,101,7],[93,0,94,0],[93,1,94,1],[93,2,94,2],[93,3,94,3],[93,4,94,4],[84,5,85,5],[84,6,84,7],[84,8,84,9],[89,1,89,7],[91,1,91,7],[84,0,85,0],[84,1,85,1],[84,2,85,2],[84,3,85,3],[84,4,85,4],[75,5,76,5],[75,6,75,7],[75,8,75,9],[80,1,80,7],[82,1,82,7],[75,0,76,0],[75,1,76,1],[75,2,76,2],[75,3,76,3],[75,4,76,4],[66,5,67,5],[66,6,66,7],[66,8,66,9],[71,1,71,7],[73,1,73,7],[66,0,67,0],[66,1,67,1],[66,2,67,2],[66,3,67,3],[66,4,67,4],[57,5,58,5],[57,6,57,7],[57,8,57,9],[62,1,62,7],[64,1,64,7],[57,0,58,0],[57,1,58,1],[57,2,58,2],[57,3,58,3],[57,4,58,4],[48,5,49,5],[48,6,48,7],[48,8,48,9],[53,1,53,7],[55,1,55,7],[48,0,49,0],[48,1,49,1],[48,2,49,2],[48,3,49,3],[48,4,49,4],[38,5,39,5],[38,6,38,7],[38,8,38,9],[43,1,43,7],[46,1,46,7],[38,0,39,0],[38,1,39,1],[38,2,39,2],[38,3,39,3],[38,4,39,4],[28,5,29,5],[28,6,28,7],[28,8,28,9],[33,1,33,7],[36,1,36,7],[28,0,29,0],[28,1,29,1],[28,2,29,2],[28,3,29,3],[28,4,29,4],[16,5,17,5],[16,6,16,7],[16,8,16,9],[22,1,22,7],[26,1,26,7],[16,0,17,0],[16,1,17,1],[16,2,17,2],[16,3,17,3],[16,4,17,4],[15,0,15,9],[13,0,13,2],[13,3,13,6],[1,0,1,9],[3,7,3,9],[4,7,4,9],[6,7,6,9],[7,7,7,9],[6,0,6,6],[10,8,10,9],[13,8,13,9],[14,0,14,9],[8,0,8,9],[5,0,5,9],[2,0,2,9],[0,0,0,8],[10,0,10,2],[10,3,10,6],[11,0,11,9],[12,0,12,2],[12,3,12,6],[12,7,12,8],[7,0,7,6],[9,0,9,2],[9,3,9,6],[9,7,9,8],[3,0,3,6],[4,0,4,6]]}
[]
[]
[]
["UNIDADE ESCOLAR",null,null,null,null,null,null,"CÓDIGO INEP"]
[{"$f":"Orçamento!$O$4","v":"CENTRO DE ENSINO EM PERÍODO INTEGRAL SÃO SEBASTIÃO"},null,null,null,null,null,null,{"$f":"Orçamento!$X$4","v":52030180}]
[]
["OBRA",null,null,null,null,null,null,"CIDADE"]
[{"$f":"Orçamento!$O$7","v":"AMPLIAÇÃO/REFORMA"},null,null,null,null,null,null,{"$f":"Orçamento!$X$7","v":"SÃO LUÍS DE MONTES BELOS"}]
[]
["CRE",null,null,"ENDEREÇO",null,null,null,"REFERÊNCIA AGETOP"]
[{"$f":"Orçamento!$O$10","v":"CRE-SÃO L. M. BELOS"},null,null,{"$f":"Orçamento!$R$10","v":" RUA 02 , VILA CANAA , CEP: 7610-000"},null,null,null,{"$f":"Orçamento!$S$10","v":"ABR/19"},{"$f":"Orçamento!$T$10","v":"DESONERADA"}]
[]
["DATA",null,null,"ÁREA TOTAL CONSTRUÍDA (M²)",null,null,null,"REFERÊNCIA SINAPI"]
[{"$f":"Orçamento!$S$7","v":"2020-05-15"},null,null,{"$f":"Orçamento!$X$13","v":1777.18},null,null,null,{"$f":"Orçamento!$X$10","v":"MAR/20"},{"$f":"Orçamento!$Y$10","v":"DESONERADA"}]
[]
["COMPOSIÇÕES DE CUSTOS UNITÁRIOS - SEE-GO"]
[10,"FONTE","CÓDIGO","DESCRIÇÃO","UNIDADE","COEFIC.","CUSTO UNITÁRIO",null,"CUSTO  TOTAL (A) + (B) + (C) + (D) + (E)"]
[null,null,null,null,null,null,"DESONERADO","NÃO DESONER.","DESONERADO","NÃO DESONER."]
[null,"COMPOSIÇÃO","COMP 010_SEE","DEMOLIÇÃO DE GRADE/GRELHA/CORRIMÃO/GUARDA CORPO - METÁLICO","M2",null,"-","-",4.0599999999999996,4.71]
[null,null,null,"","",null,0,0,0,0]
[null,null,null,"","",null,0,0,0,0]
[null,null,null,"","",null,0,0,0,0]
[null,"MÃO DE OBRA (B) - TOTAL",null,null,null,null,null,null,0,0]
[null,"AGETOP",20106,"RETIRADA DE JANELAS OU PORTAIS C/ TRANSP. ATÉ CB. E CARGA","m2    ",1,4.0599999999999996,4.71,4.0599999999999996,4.71]
[null,null,null,"","",null,0,0,0,0]
[null,null,null,"","",null,0,0,0,0]
[null,"MATERIAL (C) - TOTAL",null,null,null,null,null,null,4.0599999999999996,4.71]
[]
[382,"FONTE","CÓDIGO","DESCRIÇÃO","UNIDADE","COEFIC.","CUSTO UNITÁRIO",null,"CUSTO  TOTAL (A) + (B) + (C) + (D) + (E)"]
[null,null,null,null,null,null,"DESONERADO","NÃO DESONER.","DESONERADO","NÃO DESONER."]
[null,"COMPOSIÇÃO","COMP 382_SEE","TE DE REDUCAO DE FERRO GALVANIZADO, COM ROSCA BSP, DE 3/4\" X 1/2\"","UN ",null,null,null,24.25,26.43]
[null,"AGETOP_I",8,"AJUDANTE","h     ",0.6,8.75,10.14,5.25,6.08]
[null,"AGETOP_I",11,"ENCANADOR","h     ",0.61050000000000004,13.95,16.16,8.52,9.8699999999999992]
[null,"MÃO DE OBRA (B) - TOTAL",null,null,null,null,null,null,13.77,15.95]
[null,"SINAPI_I",3146,"FITA VEDA ROSCA EM ROLOS DE 18 MM X 10 M (L X C)","UN    ",0.12075471698113208,3.4,3.4,0.41,0.41]
[null,"SINAPI_I",6302,"TE DE REDUCAO DE FERRO GALVANIZADO, COM ROSCA BSP, DE 3/4\" X 1/2\"","UN    ",1,10.07,10.07,10.07,10.07]
[null,"MATERIAL (C) - TOTAL",null,null,null,null,null,null,10.48,10.48]
[]
[383,"FONTE","CÓDIGO","DESCRIÇÃO","UNIDADE","COEFIC.","CUSTO UNITÁRIO",null,"CUSTO  TOTAL (A) + (B) + (C) + (D) + (E)"]
[null,null,null,null,null,null,"DESONERADO","NÃO DESONER.","DESONERADO","NÃO DESONER."]
[null,"COMPOSIÇÃO","COMP 383_SEE","BUCHA DE REDUCAO DE FERRO GALVANIZADO, COM ROSCA BSP, DE 1/2\" X 1/4\"","UN ",null,null,null,7.68,8.26]
[null,"AGETOP_I",8,"AJUDANTE","h     ",0.16,8.75,10.14,1.4,1.62]
[null,"AGETOP_I",11,"ENCANADOR","h     ",0.16,13.95,16.16,2.23,2.59]
[null,"MÃO DE OBRA (B) - TOTAL",null,null,null,null,null,null,3.63,4.21]
[null,"AGETOP_I","H689","FITA VEDAROSCA 12 MM","m",1.2,0.28000000000000003,0.28000000000000003,0.34,0.34]
[null,"SINAPI_I",770,"BUCHA DE REDUCAO DE FERRO GALVANIZADO, COM ROSCA BSP, DE 1/2\" X 1/4\"","UN    ",1,3.71,3.71,3.71,3.71]
[null,"MATERIAL (C) - TOTAL",null,null,null,null,null,null,4.05,4.05]
[]
[212,"FONTE","CÓDIGO","DESCRIÇÃO","UNIDADE","COEFIC.","CUSTO UNITÁRIO",null,"CUSTO  TOTAL (A) + (B) + (C) + (D) + (E)"]
[null,null,null,null,null,null,"DESONERADO","NÃO DESONER.","DESONERADO","NÃO DESONER."]
[null,"COMPOSIÇÃO","COMP 212_SEE","NIPLE DE REDUÇÃO 1/2\" X 1/4\" BSP","UN ",null,null,null,9.68,10.26]
[null,"AGETOP_I",8,"AJUDANTE","h     ",0.16,8.75,10.14,1.4,1.62]
[null,"AGETOP_I",11,"ENCANADOR","h     ",0.16,13.95,16.16,2.23,2.59]
[null,"MÃO DE OBRA (B) - TOTAL",null,null,null,null,null,null,3.63,4.21]
[null,"COTAÇÃO","COT 103_SEE","NIPLE DE REDUÇÃO 1/2\" X 1/4\" BSP","UN",1,6.0533333333333337,6.0533333333333337,6.05,6.05]
[null,"MATERIAL (C) - TOTAL",null,null,null,null,null,null,6.05,6.05]
[]
[213,"FONTE","CÓDIGO","DESCRIÇÃO","UNIDADE","COEFIC.","CUSTO UNITÁRIO",null,"CUSTO  TOTAL (A) + (B) + (C) + (D) + (E)"]
[null,null,null,null,null,null,"DESONERADO","NÃO DESONER.","DESONERADO","NÃO DESONER."]
[null,"COMPOSIÇÃO","COMP 213_SEE","NIPLE DE REDUÇÃO 3/4\" X 1/2\" BSP","UN ",null,null,null,13.34,13.920000000000002]
[null,"AGETOP_I",8,"AJUDANTE","h     ",0.16,8.75,10.14,1.4,1.62]
[null,"AGETOP_I",11,"ENCANADOR","h     ",0.16,13.95,16.16,2.23,2.59]
[null,"MÃO DE OBRA (B) - TOTAL",null,null,null,null,null,null,3.63,4.21]
[null,"COTAÇÃO","COT 104_SEE","NIPLE DE REDUÇÃO 3/4\" X 1/2\" BSP","UN",1,9.7099999999999991,9.7099999999999991,9.7100000000000009,9.7100000000000009]
[null,"MATERIAL (C) - TOTAL",null,null,null,null,null,null,9.7100000000000009,9.7100000000000009]
[]
[237,"FONTE","CÓDIGO","DESCRIÇÃO","UNIDADE","COEFIC.","CUSTO UNITÁRIO",null,"CUSTO  TOTAL (A) + (B) + (C) + (D) + (E)"]
[null,null,null,null,null,null,"DESONERADO","NÃO DESONER.","DESONERADO","NÃO DESONER."]
[null,"COMPOSIÇÃO","COMP 237_SEE","FITA ANTICORROSIVA","M",null,null,null,11.16,11.879999999999999]
[null,"AGETOP_I",8,"AJUDANTE","h     ",0.2,8.75,10.14,1.75,2.0299999999999998]
[null,"AGETOP_I",12,"ELETRICISTA","h     ",0.2,13.95,16.16,2.79,3.23]
[null,"MÃO DE OBRA (B) - TOTAL",null,null,null,null,null,null,4.54,5.26]
[null,"SINAPI_I",39634,"FITA ADESIVA ANTICORROSIVA DE PVC FLEXIVEL, COR PRETA, PARA PROTECAO TUBULACAO, 50 MM X 30 M (L X C), E= *0,25* MM","M     ",1,6.62,6.62,6.62,6.62]
[null,"MATERIAL (C) - TOTAL",null,null,null,null,null,null,6.62,6.62]
[]
[542,"FONTE","CÓDIGO","DESCRIÇÃO","UNIDADE","COEFIC.","CUSTO UNITÁRIO",null,"CUSTO  TOTAL (A) + (B) + (C) + (D) + (E)"]
[null,null,null,null,null,null,"DESONERADO","NÃO DESONER.","DESONERADO","NÃO DESONER."]
[null,"COMPOSIÇÃO","COMP 542_SEE","VÁLVULA UGV 3/4\" (S) LATÃO","UN ",null,null,null,25.65,27.2]
[null,"AGETOP_I",8,"AJUDANTE","h     ",0.432,8.75,10.14,3.78,4.38]
[null,"AGETOP_I",11,"ENCANADOR","h     ",0.432,13.95,16.16,6.03,6.98]
[null,"MÃO DE OBRA (B) - TOTAL",null,null,null,null,null,null,9.81,11.36]
[null,"COTAÇÃO","COT 281_SEE","VÁLVULA UGV 3/4\" (S) LATÃO","UN ",1,15.836666666666666,15.836666666666666,15.84,15.84]
[null,"MATERIAL (C) - TOTAL",null,null,null,null,null,null,15.84,15.84]
[]
[543,"FONTE","CÓDIGO","DESCRIÇÃO","UNIDADE","COEFIC.","CUSTO UNITÁRIO",null,"CUSTO  TOTAL (A) + (B) + (C) + (D) + (E)"]
[null,null,null,null,null,null,"DESONERADO","NÃO DESONER.","DESONERADO","NÃO DESONER."]
[null,"COMPOSIÇÃO","COMP 543_SEE","VÁLVULA UGV 1/2\" (S) LATÃO","UN ",null,null,null,24.98,26.53]
[null,"AGETOP_I",8,"AJUDANTE","h     ",0.432,8.75,10.14,3.78,4.38]
[null,"AGETOP_I",11,"ENCANADOR","h     ",0.432,13.95,16.16,6.03,6.98]
[null,"MÃO DE OBRA (B) - TOTAL",null,null,null,null,null,null,9.81,11.36]
[null,"COTAÇÃO","COT 282_SEE","VÁLVULA UGV 1/2\" (S) LATÃO","UN ",1,15.166666666666666,15.166666666666666,15.17,15.17]
[null,"MATERIAL (C) - TOTAL",null,null,null,null,null,null,15.17,15.17]
[]
[211,"FONTE","CÓDIGO","DESCRIÇÃO","UNIDADE","COEFIC.","CUSTO UNITÁRIO",null,"CUSTO  TOTAL (A) + (B) + (C) + (D) + (E)"]
[null,null,null,null,null,null,"DESONERADO","NÃO DESONER.","DESONERADO","NÃO DESONER."]
[null,"COMPOSIÇÃO","COMP 211_SEE","REGULADOR DE 2º ESTÁGIO 5KG/H","UN ",null,null,null,86.72,90.86]
[null,"AGETOP_I",8,"AJUDANTE","h     ",1.1499999999999999,8.75,10.14,10.06,11.66]
[null,"AGETOP_I",11,"ENCANADOR","h     ",1.1499999999999999,13.95,16.16,16.04,18.579999999999998]
[null,"MÃO DE OBRA (B) - TOTAL",null,null,null,null,null,null,26.1,30.24]
[null,"COTAÇÃO","COT 102_SEE","REGULADOR DE 2º ESTÁGIO 5KG/H","UN",1,59.833333333333336,59.833333333333336,59.83,59.83]
[null,"AGETOP_I","H689","FITA VEDAROSCA 12 MM","m",2.82,0.28000000000000003,0.28000000000000003,0.79,0.79]
[null,"MATERIAL (C) - TOTAL",null,null,null,null,null,null,60.62,60.62]
[]
[210,"FONTE","CÓDIGO","DESCRIÇÃO","UNIDADE","COEFIC.","CUSTO UNITÁRIO",null,"CUSTO  TOTAL (A) + (B) + (C) + (D) + (E)"]
[null,null,null,null,null,null,"DESONERADO","NÃO DESONER.","DESONERADO","NÃO DESONER."]
[null,"COMPOSIÇÃO","COMP 210_SEE","REGULADOR DE 1º ESTÁGIO 60KG/H MODELO AP-40  COM MANÔMETRO","UN ",null,null,null,232.47,236.61]
[null,"AGETOP_I",8,"AJUDANTE","h     ",1.1499999999999999,8.75,10.14,10.06,11.66]
[null,"AGETOP_I",11,"ENCANADOR","h     ",1.1499999999999999,13.95,16.16,16.04,18.579999999999998]
[null,"MÃO DE OBRA (B) - TOTAL",null,null,null,null,null,null,26.1,30.24]
[null,"COTAÇÃO","COT 101_SEE","REGULADOR DE 1º ESTÁGIO 60KG/H MODELO AP-40  COM MANÔMETRO","UN",1,205.57666666666668,205.57666666666668,205.58,205.58]
[null,"AGETOP_I","H689","FITA VEDAROSCA 12 MM","m",2.82,0.28000000000000003,0.28000000000000003,0.79,0.79]
[null,"MATERIAL (C) - TOTAL",null,null,null,null,null,null,206.37,206.37]
[]
[235,"FONTE","CÓDIGO","DESCRIÇÃO","UNIDADE","COEFIC.","CUSTO UNITÁRIO",null,"CUSTO  TOTAL (A) + (B) + (C) + (D) + (E)"]
[null,null,null,null,null,null,"DESONERADO","NÃO DESONER.","DESONERADO","NÃO DESONER."]
[null,"COMPOSIÇÃO","COMP 235_SEE","PLACA DE SINALIZAÇÃO EM PVC COD 01 - (300X300) PROIBIDO FUMAR","UN ",null,null,null,25.319999999999997,25.439999999999998]
[null,"AGETOP_I",5,"SERVENTE","h     ",0.09,8.75,10.14,0.79,0.91]
[null,"MÃO DE OBRA (B) - TOTAL",null,null,null,null,null,null,0.79,0.91]
[null,"AGETOP_I",3070,"BUCHA DE NYLON S-6","un",2,0.04,0.04,0.08,0.08]
[null,"AGETOP_I",3393,"PARAFUSO P/BUCHA S-6","un",2,0.08,0.08,0.16,0.16]
[null,"SINAPI_I",37556,"PLACA DE SINALIZACAO DE SEGURANCA CONTRA INCENDIO, FOTOLUMINESCENTE, QUADRADA, *20 X 20* CM, EM PVC *2* MM ANTI-CHAMAS (SIMBOLOS, CORES E PICTOGRAMAS CONFORME NBR 13434)","UN    ",1,24.29,24.29,24.29,24.29]
[null,"MATERIAL (C) - TOTAL",null,null,null,null,null,null,24.529999999999998,24.529999999999998]
[]
[236,"FONTE","CÓDIGO","DESCRIÇÃO","UNIDADE","COEFIC.","CUSTO UNITÁRIO",null,"CUSTO  TOTAL (A) + (B) + (C) + (D) + (E)"]
[null,null,null,null,null,null,"DESONERADO","NÃO DESONER.","DESONERADO","NÃO DESONER."]
[null,"COMPOSIÇÃO","COMP 236_SEE","PLACA DE SINALIZAÇÃO EM PVC COD 06 - (300X300) PERIGO INFLAMÁVEL","UN ",null,null,null,25.319999999999997,25.439999999999998]
[null,"AGETOP_I",5,"SERVENTE","h     ",0.09,8.75,10.14,0.79,0.91]
[null,"MÃO DE OBRA (B) - TOTAL",null,null,null,null,null,null,0.79,0.91]
[null,"AGETOP_I",3070,"BUCHA DE NYLON S-6","un",2,0.04,0.04,0.08,0.08]
[null,"AGETOP_I",3393,"PARAFUSO P/BUCHA S-6","un",2,0.08,0.08,0.16,0.16]
[null,"SINAPI_I",37556,"PLACA DE SINALIZACAO DE SEGURANCA CONTRA INCENDIO, FOTOLUMINESCENTE, QUADRADA, *20 X 20* CM, EM PVC *2* MM ANTI-CHAMAS (SIMBOLOS, CORES E PICTOGRAMAS CONFORME NBR 13434)","UN    ",1,24.29,24.29,24.29,24.29]
[null,"MATERIAL (C) - TOTAL",null,null,null,null,null,null,24.529999999999998,24.529999999999998]
[]
[45,"FONTE","CÓDIGO","DESCRIÇÃO","UNIDADE","COEFIC.","CUSTO UNITÁRIO",null,"CUSTO  TOTAL (A) + (B) + (C) + (D) + (E)"]
[null,null,null,null,null,null,"DESONERADO","NÃO DESONER.","DESONERADO","NÃO DESONER."]
[null,"COMPOSIÇÃO","COMP 045_SEE","LAUDO DE ESTANQUEIDADE","UN ",null,null,null,936,1085.1199999999999]
[null,"AGETOP",250101,"ENGENHEIRO - (OBRAS CIVIS)","H     ",16,58.5,67.819999999999993,936,1085.1199999999999]
[null,"MÃO DE OBRA (B) - TOTAL",null,null,null,null,null,null,936,1085.1199999999999]
[null,"MATERIAL (C) - TOTAL",null,null,null,null,null,null,0,0]
[]
[277,"FONTE","CÓDIGO","DESCRIÇÃO","UNIDADE","COEFIC.","CUSTO UNITÁRIO",null,"CUSTO  TOTAL (A) + (B) + (C) + (D) + (E)"]
[null,null,null,null,null,null,"DESONERADO","NÃO DESONER.","DESONERADO","NÃO DESONER."]
[null,"COMPOSIÇÃO","COMP 277_SEE","MARCAÇÃO NO PISO - 1X1 M PARA EXTINTOR","M2",null,null,null,29.67,29.75]
[null,"AGETOP_I",5,"SERVENTE","h     ",3.3300000000000003E-2,8.75,10.14,0.28999999999999998,0.34]
[null,"MÃO DE OBRA (B) - TOTAL",null,null,null,null,null,null,0.28999999999999998,0.34]
[null,"SINAPI_I",5318,"SOLVENTE DILUENTE A BASE DE AGUARRAS","L     ",0.13,11.78,11.78,1.53,1.53]
[null,"SINAPI",5824,"CAMINHÃO TOCO, PBT 16.000 KG, CARGA ÚTIL MÁX. 10.685 KG, DIST. ENTRE EIXOS 4,8 M, POTÊNCIA 189 CV, INCLUSIVE CARROCERIA FIXA ABERTA DE MADEIRA P/ TRANSPORTE GERAL DE CARGA SECA, DIMEN. APROX. 2,5 X 7,00 X 0,50 M - CHP DIURNO. AF_06/2014","CHP",3.3E-3,120.02,123.21,0.4,0.41]
[null,"SINAPI_I",7343,"TINTA A BASE DE RESINA ACRILICA, PARA SINALIZACAO HORIZONTAL VIARIA (NBR 11862)","L     ",0.6,12.82,12.82,7.69,7.69]
[null,"SINAPI_I",7348,"TINTA ACRILICA PREMIUM PARA PISO","L     ",0.03,13.72,13.72,0.41,0.41]
[null,"SINAPI_I",25972,"MICROESFERAS DE VIDRO PARA SINALIZACAO HORIZONTAL VIARIA, TIPO I-B (PREMIX) - NBR 16184","KG    ",2.14,8.8800000000000008,8.8800000000000008,19,19]
[null,"SINAPI",95133,"MÁQUINA DEMARCADORA DE FAIXA DE TRÁFEGO À FRIO, AUTOPROPELIDA, POTÊNCIA 38 HP - CHP DIURNO. AF_07/2016","CHP",3.3E-3,107.44,110.99,0.35,0.37]
[null,"MATERIAL (C) - TOTAL",null,null,null,null,null,null,29.380000000000003,29.41]
[]
[188,"FONTE","CÓDIGO","DESCRIÇÃO","UNIDADE","COEFIC.","CUSTO UNITÁRIO",null,"CUSTO  TOTAL (A) + (B) + (C) + (D) + (E)"]
[null,null,null,null,null,null,"DESONERADO","NÃO DESONER.","DESONERADO","NÃO DESONER."]
[null,"COMPOSIÇÃO","COMP 188_SEE","ACIONADOR MANUAL DE ALARME","UN ",null,null,null,101.49,104.37]
[null,"AGETOP_I",8,"AJUDANTE","h     ",0.8,8.75,10.14,7,8.11]
[null,"AGETOP_I",12,"ELETRICISTA","h     ",0.8,13.95,16.16,11.16,12.93]
[null,"MÃO DE OBRA (B) - TOTAL",null,null,null,null,null,null,18.16,21.04]
[null,"COTAÇÃO","COT 090_SEE","ACIONADOR MANUAL DE ALARME","UN",1,83.333333333333329,83.333333333333329,83.33,83.33]
[null,"MATERIAL (C) - TOTAL",null,null,null,null,null,null,83.33,83.33]
[]
[190,"FONTE","CÓDIGO","DESCRIÇÃO","UNIDADE","COEFIC.","CUSTO UNITÁRIO",null,"CUSTO  TOTAL (A) + (B) + (C) + (D) + (E)"]
[null,null,null,null,null,null,"DESONERADO","NÃO DESONER.","DESONERADO","NÃO DESONER."]
[null,"COMPOSIÇÃO","COMP 190_SEE","CENTRAL DE DETECÇÃO E ALARME DE 40 SETORES COM BATERIA","UN ",null,null,null,1144.93,1173.73]
[null,"AGETOP_I",8,"AJUDANTE","h     ",8,8.75,10.14,70,81.12]
[null,"AGETOP_I",12,"ELETRICISTA","h     ",8,13.95,16.16,111.6,129.28]
[null,"MÃO DE OBRA (B) - TOTAL",null,null,null,null,null,null,181.6,210.4]
[null,"COTAÇÃO","COT 092_SEE","CENTRAL DE DETECÇÃO E ALARME DE 40 SETORES COM BATERIA (PREÇO MÉDIO)","UN",1,963.33333333333337,963.33333333333337,963.33,963.33]
[null,"MATERIAL (C) - TOTAL",null,null,null,null,null,null,963.33,963.33]
[]
[24,"FONTE","CÓDIGO","DESCRIÇÃO","UNIDADE","COEFIC.","CUSTO UNITÁRIO",null,"CUSTO  TOTAL (A) + (B) + (C) + (D) + (E)"]
[null,null,null,null,null,null,"DESONERADO","NÃO DESONER.","DESONERADO","NÃO DESONER."]
[null,"COMPOSIÇÃO","COMP 024_SEE","SINALIZADOR FOTOLUMINESCENTE PARA EXTINTOR","UN ",null,"-","-",25.319999999999997,25.439999999999998]
[null,"AGETOP_I",5,"SERVENTE","h     ",0.09,8.75,10.14,0.79,0.91]
[null,"MÃO DE OBRA (B) - TOTAL",null,null,null,null,null,null,0.79,0.91]
[null,"AGETOP_I",3070,"BUCHA DE NYLON S-6","un",2,0.04,0.04,0.08,0.08]
[null,"AGETOP_I",3393,"PARAFUSO P/BUCHA S-6","un",2,0.08,0.08,0.16,0.16]
[null,"SINAPI_I",37556,"PLACA DE SINALIZACAO DE SEGURANCA CONTRA INCENDIO, FOTOLUMINESCENTE, QUADRADA, *20 X 20* CM, EM PVC *2* MM ANTI-CHAMAS (SIMBOLOS, CORES E PICTOGRAMAS CONFORME NBR 13434)","UN    ",1,24.29,24.29,24.29,24.29]
[null,"MATERIAL (C) - TOTAL",null,null,null,null,null,null,24.529999999999998,24.529999999999998]
[]
[25,"FONTE","CÓDIGO","DESCRIÇÃO","UNIDADE","COEFIC.","CUSTO UNITÁRIO",null,"CUSTO  TOTAL (A) + (B) + (C) + (D) + (E)"]
[null,null,null,null,null,null,"DESONERADO","NÃO DESONER.","DESONERADO","NÃO DESONER."]
[null,"COMPOSIÇÃO","COMP 025_SEE","SINALIZADOR FOTOLUMINESCENTE DE EMERGÊNCIA","UN ",null,"-","-",25.319999999999997,25.439999999999998]
[null,"AGETOP_I",5,"SERVENTE","h     ",0.09,8.75,10.14,0.79,0.91]
[null,"MÃO DE OBRA (B) - TOTAL",null,null,null,null,null,null,0.79,0.91]
[null,"AGETOP_I",3070,"BUCHA DE NYLON S-6","un",2,0.04,0.04,0.08,0.08]
[null,"AGETOP_I",3393,"PARAFUSO P/BUCHA S-6","un",2,0.08,0.08,0.16,0.16]
[null,"SINAPI_I",37556,"PLACA DE SINALIZACAO DE SEGURANCA CONTRA INCENDIO, FOTOLUMINESCENTE, QUADRADA, *20 X 20* CM, EM PVC *2* MM ANTI-CHAMAS (SIMBOLOS, CORES E PICTOGRAMAS CONFORME NBR 13434)","UN    ",1,24.29,24.29,24.29,24.29]
[null,"MATERIAL (C) - TOTAL",null,null,null,null,null,null,24.529999999999998,24.529999999999998]
[]
[411,"FONTE","CÓDIGO","DESCRIÇÃO","UNIDADE","COEFIC.","CUSTO UNITÁRIO",null,"CUSTO  TOTAL (A) + (B) + (C) + (D) + (E)"]
[null,null,null,null,null,null,"DESONERADO","NÃO DESONER.","DESONERADO","NÃO DESONER."]
[null,"COMPOSIÇÃO","COMP 411_SEE","PLACA DE SINALIZAÇÃO EM PVC COD 13 - (316X158) SAÍDA DE EMERGÊNCIA","UN ",null,null,null,30.819999999999997,30.939999999999998]
[null,"AGETOP_I",5,"SERVENTE","h     ",0.09,8.75,10.14,0.79,0.91]
[null,"MÃO DE OBRA (B) - TOTAL",null,null,null,null,null,null,0.79,0.91]
[null,"AGETOP_I",3070,"BUCHA DE NYLON S-6","un",2,0.04,0.04,0.08,0.08]
[null,"AGETOP_I",3393,"PARAFUSO P/BUCHA S-6","un",2,0.08,0.08,0.16,0.16]
[null,"SINAPI_I",37559,"PLACA DE SINALIZACAO DE SEGURANCA CONTRA INCENDIO, FOTOLUMINESCENTE, RETANGULAR, *12 X 40* CM, EM PVC *2* MM ANTI-CHAMAS (SIMBOLOS, CORES E PICTOGRAMAS CONFORME NBR 13434)","UN    ",1,29.79,29.79,29.79,29.79]
[null,"MATERIAL (C) - TOTAL",null,null,null,null,null,null,30.029999999999998,30.029999999999998]
[]
[412,"FONTE","CÓDIGO","DESCRIÇÃO","UNIDADE","COEFIC.","CUSTO UNITÁRIO",null,"CUSTO  TOTAL (A) + (B) + (C) + (D) + (E)"]
[null,null,null,null,null,null,"DESONERADO","NÃO DESONER.","DESONERADO","NÃO DESONER."]
[null,"COMPOSIÇÃO","COMP 412_SEE","PLACA DE SINALIZAÇÃO EM PVC COD 17 - (316X158) MENSAGEM \"SAÍDA\"","UN ",null,null,null,30.819999999999997,30.939999999999998]
[null,"AGETOP_I",5,"SERVENTE","h     ",0.09,8.75,10.14,0.79,0.91]
[null,"MÃO DE OBRA (B) - TOTAL",null,null,null,null,null,null,0.79,0.91]
[null,"AGETOP_I",3070,"BUCHA DE NYLON S-6","un",2,0.04,0.04,0.08,0.08]
[null,"AGETOP_I",3393,"PARAFUSO P/BUCHA S-6","un",2,0.08,0.08,0.16,0.16]
[null,"SINAPI_I",37559,"PLACA DE SINALIZACAO DE SEGURANCA CONTRA INCENDIO, FOTOLUMINESCENTE, RETANGULAR, *12 X 40* CM, EM PVC *2* MM ANTI-CHAMAS (SIMBOLOS, CORES E PICTOGRAMAS CONFORME NBR 13434)","UN    ",1,29.79,29.79,29.79,29.79]
[null,"MATERIAL (C) - TOTAL",null,null,null,null,null,null,30.029999999999998,30.029999999999998]
[]
[82,"FONTE","CÓDIGO","DESCRIÇÃO","UNIDADE","COEFIC.","CUSTO UNITÁRIO",null,"CUSTO  TOTAL (A) + (B) + (C) + (D) + (E)"]
[null,null,null,null,null,null,"DESONERADO","NÃO DESONER.","DESONERADO","NÃO DESONER."]
[null,"COMPOSIÇÃO","COMP 082_SEE","CORRIMÃO PAREDE - SEDUC","M",null,null,null,121.38,125.41]
[null,"AGETOP_I",25,"OFICIAL \"B\"","h     ",1,13.95,16.16,13.95,16.16]
[null,"AGETOP_I",8,"AJUDANTE","h     ",1,8.75,10.14,8.75,10.14]
[null,"MÃO DE OBRA (B) - TOTAL",null,null,null,null,null,null,22.7,26.3]
[null,"AGETOP_I",2376,"TUBO INDUSTRIAL 2\" CHAPA 13 ","Kg",5.5247999999999999,5.23,5.23,28.89,28.89]
[null,"AGETOP_I",2504,"TUBO INDUSTRIAL D=25 MM CHAPA 13 ","Kg",1.1000000000000001,5.07,5.07,5.58,5.58]
[null,"AGETOP_I",2417,"MASSA PLASTICA","Kg",0.2041,10.58,10.58,2.16,2.16]
[null,"AGETOP_I",2246,"ELETRODO 2.5 OK","Kg",0.11459999999999999,8.6999999999999993,8.6999999999999993,1,1]
[null,"AGETOP_I",1672,"LIXA PARA FERRO ( NÚMERO 100 )","un",0.125,2.12,2.12,0.27,0.27]
[null,"AGETOP_I",1264,"DISCO DE DESBASTE 7/8\" P/ CONC./FERRO (1/4\" X 7\")","un",2.5000000000000001E-2,7,7,0.18,0.18]
[null,"AGETOP_I",1334,"DISCO DE CORTE DIAM. 5/8\"- 10\"","un",0.1865,5.5,5.5,1.03,1.03]
[null,"AGETOP_I",2902,"FABRICAÇÃO / MONTAGEM","un",1,50.44,50.44,50.44,50.44]
[null,"AGETOP_I",2719,"CHAPA PERFILADA 3/16\"","Kg",0.72,5.04,5.04,3.63,3.63]
[null,"AGETOP_I",2436,"ACO CA-25 - 6,3 MM (1/4\") - BARRA LISA A-36","Kg",0.25,5.13,5.13,1.28,1.28]
[null,"AGETOP",261602,"PINT.ESMALTE/ESQUAD.FERRO C/FUNDO ANTICOR.","m2    ",0.3,14.07,15.51,4.22,4.6500000000000004]
[null,"MATERIAL (C) - TOTAL",null,null,null,null,null,null,98.679999999999993,99.11]
[]
[83,"FONTE","CÓDIGO","DESCRIÇÃO","UNIDADE","COEFIC.","CUSTO UNITÁRIO",null,"CUSTO  TOTAL (A) + (B) + (C) + (D) + (E)"]
[null,null,null,null,null,null,"DESONERADO","NÃO DESONER.","DESONERADO","NÃO DESONER."]
[null,"COMPOSIÇÃO","COMP 083_SEE","CORRIMÃO PISO - SEDUC","M",null,null,null,143.18,147.41000000000003]
[null,"AGETOP_I",25,"OFICIAL \"B\"","h     ",1,13.95,16.16,13.95,16.16]
[null,"AGETOP_I",8,"AJUDANTE","h     ",1,8.75,10.14,8.75,10.14]
[null,"MÃO DE OBRA (B) - TOTAL",null,null,null,null,null,null,22.7,26.3]
[null,"AGETOP_I",2376,"TUBO INDUSTRIAL 2\" CHAPA 13 ","Kg",8.2197499999999994,5.23,5.23,42.99,42.99]
[null,"AGETOP_I",2504,"TUBO INDUSTRIAL D=25 MM CHAPA 13 ","Kg",1.1000000000000001,5.07,5.07,5.58,5.58]
[null,"AGETOP_I",2417,"MASSA PLASTICA","Kg",0.2041,10.58,10.58,2.16,2.16]
[null,"AGETOP_I",2246,"ELETRODO 2.5 OK","Kg",0.11459999999999999,8.6999999999999993,8.6999999999999993,1,1]
[null,"AGETOP_I",1672,"LIXA PARA FERRO ( NÚMERO 100 )","un",0.125,2.12,2.12,0.27,0.27]
[null,"AGETOP_I",1264,"DISCO DE DESBASTE 7/8\" P/ CONC./FERRO (1/4\" X 7\")","un",2.5000000000000001E-2,7,7,0.18,0.18]
[null,"AGETOP_I",1334,"DISCO DE CORTE DIAM. 5/8\"- 10\"","un",0.1865,5.5,5.5,1.03,1.03]
[null,"AGETOP_I",2902,"FABRICAÇÃO / MONTAGEM","un",1,50.44,50.44,50.44,50.44]
[null,"AGETOP_I",2150,"CHAPA DE FERRO DOBRADA No.13","Kg",0.43519999999999998,5.28,5.28,2.2999999999999998,2.2999999999999998]
[null,"AGETOP_I",2719,"CHAPA PERFILADA 3/16\"","Kg",1.1644000000000001,5.04,5.04,5.87,5.87]
[null,"AGETOP_I",2436,"ACO CA-25 - 6,3 MM (1/4\") - BARRA LISA A-36","Kg",0.48150000000000004,5.13,5.13,2.4700000000000002,2.4700000000000002]
[null,"AGETOP",261602,"PINT.ESMALTE/ESQUAD.FERRO C/FUNDO ANTICOR.","m2    ",0.44,14.07,15.51,6.19,6.82]
[null,"MATERIAL (C) - TOTAL",null,null,null,null,null,null,120.48,121.11000000000001]
[]
[84,"FONTE","CÓDIGO","DESCRIÇÃO","UNIDADE","COEFIC.","CUSTO UNITÁRIO",null,"CUSTO  TOTAL (A) + (B) + (C) + (D) + (E)"]
[null,null,null,null,null,null,"DESONERADO","NÃO DESONER.","DESONERADO","NÃO DESONER."]
[null,"COMPOSIÇÃO","COMP 084_SEE","GUARDA-CORPO COM CORRIMÃO - SEDUC","M",null,null,null,206.14000000000001,211.22000000000003]
[null,"AGETOP_I",25,"OFICIAL \"B\"","h     ",1.1000000000000001,13.95,16.16,15.35,17.78]
[null,"AGETOP_I",8,"AJUDANTE","h     ",1.1000000000000001,8.75,10.14,9.6300000000000008,11.15]
[null,"MÃO DE OBRA (B) - TOTAL",null,null,null,null,null,null,24.98,28.93]
[null,"AGETOP_I",2376,"TUBO INDUSTRIAL 2\" CHAPA 13 ","Kg",7.7778,5.23,5.23,40.68,40.68]
[null,"AGETOP_I",2504,"TUBO INDUSTRIAL D=25 MM CHAPA 13 ","Kg",4.6319999999999997,5.07,5.07,23.48,23.48]
[null,"AGETOP_I",2377,"TUBO INDUSTRIAL 40X40 CH.13","Kg",6.3419999999999996,5.07,5.07,32.15,32.15]
[null,"AGETOP_I",2421,"TUBO INDUSTRIAL 1.1/2\" CHAPA 13 ","Kg",1.4862,5.07,5.07,7.54,7.54]
[null,"AGETOP_I",2417,"MASSA PLASTICA","Kg",0.2041,10.58,10.58,2.16,2.16]
[null,"AGETOP_I",2246,"ELETRODO 2.5 OK","Kg",0.11459999999999999,8.6999999999999993,8.6999999999999993,1,1]
[null,"AGETOP_I",1672,"LIXA PARA FERRO ( NÚMERO 100 )","un",0.25509999999999999,2.12,2.12,0.54,0.54]
[null,"AGETOP_I",1264,"DISCO DE DESBASTE 7/8\" P/ CONC./FERRO (1/4\" X 7\")","un",5.0999999999999997E-2,7,7,0.36,0.36]
[null,"AGETOP_I",1334,"DISCO DE CORTE DIAM. 5/8\"- 10\"","un",0.373,5.5,5.5,2.0499999999999998,2.0499999999999998]
[null,"AGETOP_I",2902,"FABRICAÇÃO / MONTAGEM","un",1,50.44,50.44,50.44,50.44]
[null,"AGETOP_I",2150,"CHAPA DE FERRO DOBRADA No.13","Kg",0.43519999999999998,5.28,5.28,2.2999999999999998,2.2999999999999998]
[null,"AGETOP_I",2719,"CHAPA PERFILADA 3/16\"","Kg",1.0979999999999999,5.04,5.04,5.53,5.53]
[null,"AGETOP_I",2436,"ACO CA-25 - 6,3 MM (1/4\") - BARRA LISA A-36","Kg",0.38124999999999998,5.13,5.13,1.96,1.96]
[null,"AGETOP",261602,"PINT.ESMALTE/ESQUAD.FERRO C/FUNDO ANTICOR.","m2    ",0.78,14.07,15.51,10.97,12.1]
[null,"MATERIAL (C) - TOTAL",null,null,null,null,null,null,181.16000000000003,182.29000000000002]
[]
[85,"FONTE","CÓDIGO","DESCRIÇÃO","UNIDADE","COEFIC.","CUSTO UNITÁRIO",null,"CUSTO  TOTAL (A) + (B) + (C) + (D) + (E)"]
[null,null,null,null,null,null,"DESONERADO","NÃO DESONER.","DESONERADO","NÃO DESONER."]
[null,"COMPOSIÇÃO","COMP 085_SEE","GUARDA-CORPO - SEDUC","M",null,null,null,190.52999999999997,195.41]
[null,"AGETOP_I",25,"OFICIAL \"B\"","h     ",1.1000000000000001,13.95,16.16,15.35,17.78]
[null,"AGETOP_I",8,"AJUDANTE","h     ",1.1000000000000001,8.75,10.14,9.6300000000000008,11.15]
[null,"MÃO DE OBRA (B) - TOTAL",null,null,null,null,null,null,24.98,28.93]
[null,"AGETOP_I",2376,"TUBO INDUSTRIAL 2\" CHAPA 13 ","Kg",7.7778,5.23,5.23,40.68,40.68]
[null,"AGETOP_I",2504,"TUBO INDUSTRIAL D=25 MM CHAPA 13 ","Kg",4.6319999999999997,5.07,5.07,23.48,23.48]
[null,"AGETOP_I",2377,"TUBO INDUSTRIAL 40X40 CH.13","Kg",6.3419999999999996,5.07,5.07,32.15,32.15]
[null,"AGETOP_I",2417,"MASSA PLASTICA","Kg",0.2041,10.58,10.58,2.16,2.16]
[null,"AGETOP_I",2246,"ELETRODO 2.5 OK","Kg",0.11459999999999999,8.6999999999999993,8.6999999999999993,1,1]
[null,"AGETOP_I",1672,"LIXA PARA FERRO ( NÚMERO 100 )","un",0.25509999999999999,2.12,2.12,0.54,0.54]
[null,"AGETOP_I",1264,"DISCO DE DESBASTE 7/8\" P/ CONC./FERRO (1/4\" X 7\")","un",5.0999999999999997E-2,7,7,0.36,0.36]
[null,"AGETOP_I",1334,"DISCO DE CORTE DIAM. 5/8\"- 10\"","un",0.2334,5.5,5.5,1.28,1.28]
[null,"AGETOP_I",2902,"FABRICAÇÃO / MONTAGEM","un",1,50.44,50.44,50.44,50.44]
[null,"AGETOP_I",2150,"CHAPA DE FERRO DOBRADA No.13","Kg",0.33909,5.28,5.28,1.79,1.79]
[null,"AGETOP_I",2719,"CHAPA PERFILADA 3/16\"","Kg",0.3463,5.04,5.04,1.75,1.75]
[null,"AGETOP_I",2436,"ACO CA-25 - 6,3 MM (1/4\") - BARRA LISA A-36","Kg",0.18029999999999999,5.13,5.13,0.92,0.92]
[null,"AGETOP",261602,"PINT.ESMALTE/ESQUAD.FERRO C/FUNDO ANTICOR.","m2    ",0.64,14.07,15.51,9,9.93]
[null,"MATERIAL (C) - TOTAL",null,null,null,null,null,null,165.54999999999998,166.48]
[]
[415,"FONTE","CÓDIGO","DESCRIÇÃO","UNIDADE","COEFIC.","CUSTO UNITÁRIO",null,"CUSTO  TOTAL (A) + (B) + (C) + (D) + (E)"]
[null,null,null,null,null,null,"DESONERADO","NÃO DESONER.","DESONERADO","NÃO DESONER."]
[null,"COMPOSIÇÃO","COMP 415_SEE","PEITORIL EM GRANITO CINZA, LARGURA VARIÁVEL E PINGADEIRA","M2",null,null,null,204.79,207.57999999999998]
[null,"AGETOP_I",28,"AZULEJISTA","h     ",0.66910000000000003,13.95,16.16,9.33,10.81]
[null,"AGETOP_I",5,"SERVENTE","h     ",0.93879999999999997,8.75,10.14,8.2100000000000009,9.52]
[null,"MÃO DE OBRA (B) - TOTAL",null,null,null,null,null,null,17.54,20.329999999999998]
[null,"AGETOP_I",1421,"GRANITO POLIDO P/BANCADA 2 CM","m2",1,180,180,180,180]
[null,"AGETOP_I",1215,"CIMENTO PORTLAND C.P. 32","Kg",10.34,0.39,0.39,4.03,4.03]
[null,"AGETOP_I",2690,"ARGAMASSA DE REJUNTAMENTO","Kg",0.32,3.54,3.54,1.1299999999999999,1.1299999999999999]
[null,"AGETOP_I",104,"AREIA MEDIA ","m3",2.52E-2,82.85,82.85,2.09,2.09]
[null,"MATERIAL (C) - TOTAL",null,null,null,null,null,null,187.25,187.25]