{"text_format":"1","workbook":"xlsx","n_sheets":8,"sheets":["Orçamento","Resumo ","Somatório","Cronog_90_Dias","Composição BDI","Relatório CENTRAL","Parc Maior Relev","Composições"],"not_rendered":{"charts":0,"images":3,"macros":1,"external_links":1,"defined_names":105,"comments":2,"pivot_tables":0},"unopened":[],"bounds":{"document_bytes":16777216,"sheet_cells":100000,"rows_first":2000,"rows_last":500,"rows_between":2000,"halvings":0,"cell_chars":16384,"cell_head_chars":4096},"cells_cut":0,"cells_raw":0,"read":"whole","date_system":"1900"}

{"sheet":"Orçamento","index":0,"n_rows":344,"n_cols":28,"rows_kept":344,"cut":false,"hidden":false,"merged":[[331,15,331,17],[331,18,331,22],[332,15,332,17],[332,18,332,22],[333,15,333,17],[333,18,333,22],[9,24,9,25],[8,23,8,25],[325,18,325,22],[326,15,326,17],[326,18,326,22],[327,15,327,17],[327,18,327,22],[322,15,322,17],[322,18,322,22],[323,15,323,17],[323,18,323,22],[324,15,324,17],[324,18,324,22],[318,14,318,26],[319,18,319,22],[320,15,320,17],[320,18,320,22],[305,15,305,17],[337,23,337,25],[338,23,338,25],[339,23,339,25],[340,23,340,25],[341,23,341,25],[342,23,342,25],[343,23,343,25],[18,27,18,28],[312,14,312,17],[319,15,319,17],[285,15,285,17],[340,18,340,22],[328,15,328,17],[328,18,328,22],[329,15,329,17],[329,18,329,22],[330,15,330,17],[330,18,330,22],[334,15,334,17],[334,18,334,22],[335,15,335,17],[335,18,335,22],[336,15,336,17],[325,15,325,17],[343,18,343,22],[340,14,340,17],[337,15,337,17],[337,18,337,22],[338,15,338,17],[338,18,338,22],[339,15,339,17],[339,18,339,22],[342,18,342,22],[341,18,341,22],[276,16,276,24],[277,16,277,24],[278,16,278,24],[10,14,10,26],[13,14,13,26],[2,14,2,22],[3,14,3,22],[5,18,5,22],[6,18,6,22],[11,18,11,22],[12,18,12,22],[6,14,6,17],[5,14,5,17],[3,23,3,25],[2,23,2,25],[5,23,5,25],[6,23,6,25],[8,18,8,20],[268,17,273,17],[274,22,274,24],[268,22,268,24],[269,22,269,24],[270,22,270,24],[279,16,279,24],[285,23,285,25],[301,23,301,25],[302,23,302,25],[321,15,321,17],[321,18,321,22],[280,16,280,24],[298,15,298,17],[299,15,299,17],[284,14,284,26],[285,18,285,22],[286,18,286,22],[294,18,294,22],[295,18,295,22],[296,18,296,22],[297,18,297,22],[309,18,309,22],[306,15,306,17],[286,15,286,17],[287,15,287,17],[288,15,288,17],[289,15,289,17],[290,15,290,17],[291,15,291,17],[292,15,292,17],[293,15,293,17],[294,15,294,17],[303,23,303,25],[304,23,304,25],[302,15,302,17],[303,15,303,17],[304,15,304,17],[305,23,305,25],[300,15,300,17],[301,15,301,17],[299,23,299,25],[300,23,300,25],[298,23,298,25],[315,18,315,22],[291,18,291,22],[292,18,292,22],[290,18,290,22],[299,18,299,22],[281,18,281,24],[287,18,287,22],[288,18,288,22],[289,18,289,22],[312,18,312,22],[310,18,310,22],[311,18,311,22],[301,18,301,22],[308,18,308,22],[304,18,304,22],[306,18,306,22],[302,18,302,22],[303,18,303,22],[312,23,312,25],[306,23,306,25],[307,23,307,25],[308,23,308,25],[309,23,309,25],[310,23,310,25],[314,18,314,22],[0,14,0,24],[8,14,8,16],[9,14,9,16],[11,14,11,16],[12,14,12,16],[14,14,14,24],[1,14,1,24],[4,14,4,24],[7,14,7,24],[298,18,298,22],[295,15,295,17],[296,15,296,17],[297,15,297,17],[307,18,307,22],[305,18,305,22],[313,18,313,22],[300,18,300,22],[293,18,293,22],[307,15,307,17],[308,15,308,17],[310,15,310,17],[311,15,311,17],[313,23,313,25],[334,23,334,25],[335,23,335,25],[336,23,336,25],[319,23,319,25],[320,23,320,25],[321,23,321,25],[322,23,322,25],[323,23,323,25],[324,23,324,25],[325,23,325,25],[326,23,326,25],[327,23,327,25],[328,23,328,25],[329,23,329,25],[330,23,330,25],[331,23,331,25],[332,23,332,25],[333,23,333,25],[309,15,309,17],[314,23,314,25],[315,23,315,25],[336,18,336,22],[272,22,272,24],[273,22,273,24],[6,12,6,13],[5,12,5,13],[12,23,12,25],[11,23,11,25],[9,19,9,22],[311,23,311,25],[286,23,286,25],[287,23,287,25],[288,23,288,25],[289,23,289,25],[290,23,290,25],[291,23,291,25],[292,23,292,25],[293,23,293,25],[294,23,294,25],[295,23,295,25],[296,23,296,25],[297,23,297,25]]}
[]
[]
[null,null,null,null,null,null,null,null,null,null,null,null,null,null,"UNIDADE ESCOLAR",null,null,null,null,null,null,null,null,"CÓDIGO INEP"]
[null,null,null,null,null,null,null,null,null,null,null,null,{"$f":"IF($M$7=\"MANUAL\",\"DESPROTEJA A PLANILHA PARA FORMATAR\",\"\")","v":""},null,"ESCOLA ESTADUAL VICENÇA MARIA DE JESUS",null,null,null,null,null,null,null,null,52017362]
[]
["Nmax",null,null,null,null,null,null,null,null,null,null,null,null,null,"OBRA",null,null,null,"DATA",null,null,null,null,"CIDADE"]
[{"$f":"MAX($C$18:$C$268)","v":3},null,null,null,null,null,null,null,null,null,null,null,null,null,"REFORMA E AMPLIAÇÃO",null,null,null,"2020-06-17",null,null,null,null,"ITAPACI"]
[]
[null,null,null,null,null,null,null,null,null,null,null,null,null,null,"CRE",null,null,"ENDEREÇO","REFERÊNCIA AGETOP",null,null,null,null,"REFERÊNCIA SINAPI"]
[null,null,null,null,null,null,null,null,null,null,null,null,null,null,"CRE-ITAPACI",null,null," RUA PRINCIPAL S/N , VILA SANTANA , CEP:76360-000","ABR/19","DESONERADA",null,null,null,"ABR/20","DESONERADA"]
[]
[null,null,null,null,null,null,null,null,null,null,null,null,null,null,"ÁREA EXISTENTE (M²)",null,null,"ÁREA A CONSTRUIR (M²)","ÁREA A DEMOLIR (M²)",null,null,null,null,"ÁREA TOTAL CONSTRUÍDA (M²)"]
[null,null,null,null,null,null,null,null,null,null,null,null,null,null,320.62,null,null,299.24,null,null,null,null,null,619.86]
[]
[null,null,null,null,null,null,null,null,null,null,null,"FILTRO",null,null,"PLANILHA ORÇAMENTÁRIA"]
["Nível E","Save Nivel","Nível C","Altura","n1","n2","n3","n4","n5","Czero","Cnível","↓","Nível","Nível Corrigido","ITEM","TABELA","CODIGO","DESCRIÇÃO DOS SERVIÇOS","UNID","QUANT","REPET","QUANT TOTAL","MAT","MO","T.SERVIÇO UNIT","VALOR TOTAL","OBSERVAÇÕES¹"]
[{"$f":"CHOOSE(1+LOG(1+2*(ORÇAMENTO.Nivel=\"Nível 1\")+4*(ORÇAMENTO.Nivel=\"Nível 2\")+8*(ORÇAMENTO.Nivel=\"Nível 3\")+16*(ORÇAMENTO.Nivel=\"Nível 4\")+32*(ORÇAMENTO.Nivel=\"Serviço\"),2),0,1,2,3,4,\"S\")","v":"S"},{"$f":"IF(OR(C17=\"s\",C17=0),OFFSET(B17,-1,0),C17)","v":"Save Nivel"},{"$f":"IF(OFFSET(C17,-1,0)=\"L\",1,IF(OFFSET(C17,-1,0)=1,2,IF(OR(A17=\"s\",A17=0),\"S\",IF(AND(OFFSET(C17,-1,0)=2,A17=4),3,IF(AND(OR(OFFSET(C17,-1,0)=\"s\",OFFSET(C17,-1,0)=0),A17<>\"s\",A17>OFFSET(B17,-1,0)),OFFSET(B17,-1,0),A17)))))","v":"S"},{"$f":"IF(OR(C17=\"S\",C17=0),0,IF(ISERROR(K17),J17,SMALL(J17:K17,1)))","v":0},{"$f":"IF($C17=1,OFFSET(E17,-1,0)+1,OFFSET(E17,-1,0))","v":"n1"},{"$f":"IF($C17=1,0,IF($C17=2,OFFSET(F17,-1,0)+1,OFFSET(F17,-1,0)))","v":"n2"},{"$f":"IF(AND($C17<=2,$C17<>0),0,IF($C17=3,OFFSET(G17,-1,0)+1,OFFSET(G17,-1,0)))","v":"n3"},{"$f":"IF(AND($C17<=3,$C17<>0),0,IF($C17=4,OFFSET(H17,-1,0)+1,OFFSET(H17,-1,0)))","v":"n4"},{"$f":"IF(AND($C17<=4,$C17<>0),0,IF(AND($C17=\"S\",$Y17>0),OFFSET(I17,-1,0)+1,OFFSET(I17,-1,0)))","v":"n5"},{"$f":"IF(OR($C17=\"S\",$C17=0),0,MATCH(0,OFFSET($D17,1,$C17,ROW($C$268)-ROW($C17)),0))","v":0},{"$f":"IF(OR($C17=\"S\",$C17=0),0,MATCH(OFFSET($D17,0,$C17)+1,OFFSET($D17,1,$C17,ROW($C$268)-ROW($C17)),0))","v":0},{"$f":"IF(OR(Y17>0,$C17=1),\"F\",\"\")","v":""},"Serviço",{"$f":"CHOOSE(1+LOG(1+2*(C17=1)+4*(C17=2)+8*(C17=3)+16*(C17=4)+32*(C17=\"S\"),2),\"\",\"Nível 1\",\"Nível 2\",\"Nível 3\",\"Nível 4\",\"Serviço\")","v":"Serviço"},"-","SINAPI",null,"(sem código)","-",null,"REPET","-",0,0,0,"-",""]
[0,null,"L",{"$f":"COUNTA(OFFSET(D18,1,0):D$268)","v":249},{"$f":"LEFT(O19,1)-1","v":0},null,null,null,null,null,null,"F","LOTE","LOTE","REFORMA E AMPLIAÇÃO - ESCOLA ESTADUAL VICENÇA MARIA DE JESUS",null,null,null,null,null,null,null,null,null,null,0]
[{"$f":"CHOOSE(1+LOG(1+2*(ORÇAMENTO.Nivel=\"Nível 1\")+4*(ORÇAMENTO.Nivel=\"Nível 2\")+8*(ORÇAMENTO.Nivel=\"Nível 3\")+16*(ORÇAMENTO.Nivel=\"Nível 4\")+32*(ORÇAMENTO.Nivel=\"Serviço\"),2),0,1,2,3,4,\"S\")","v":1},{"$f":"IF(OR(C19=\"s\",C19=0),OFFSET(B19,-1,0),C19)","v":1},{"$f":"IF(OFFSET(C19,-1,0)=\"L\",1,IF(OFFSET(C19,-1,0)=1,2,IF(OR(A19=\"s\",A19=0),\"S\",IF(AND(OFFSET(C19,-1,0)=2,A19=4),3,IF(AND(OR(OFFSET(C19,-1,0)=\"s\",OFFSET(C19,-1,0)=0),A19<>\"s\",A19>OFFSET(B19,-1,0)),OFFSET(B19,-1,0),A19)))))","v":1},{"$f":"IF(OR(C19=\"S\",C19=0),0,IF(ISERROR(K19),J19,SMALL(J19:K19,1)))","v":19},{"$f":"IF($C19=1,OFFSET(E19,-1,0)+1,OFFSET(E19,-1,0))","v":1},{"$f":"IF($C19=1,0,IF($C19=2,OFFSET(F19,-1,0)+1,OFFSET(F19,-1,0)))","v":0},{"$f":"IF(AND($C19<=2,$C19<>0),0,IF($C19=3,OFFSET(G19,-1,0)+1,OFFSET(G19,-1,0)))","v":0},{"$f":"IF(AND($C19<=3,$C19<>0),0,IF($C19=4,OFFSET(H19,-1,0)+1,OFFSET(H19,-1,0)))","v":0},{"$f":"IF(AND($C19<=4,$C19<>0),0,IF(AND($C19=\"S\",$Y19>0),OFFSET(I19,-1,0)+1,OFFSET(I19,-1,0)))","v":0},{"$f":"IF(OR($C19=\"S\",$C19=0),0,MATCH(0,OFFSET($D19,1,$C19,ROW($C$268)-ROW($C19)),0))","v":249},{"$f":"IF(OR($C19=\"S\",$C19=0),0,MATCH(OFFSET($D19,0,$C19)+1,OFFSET($D19,1,$C19,ROW($C$268)-ROW($C19)),0))","v":19},{"$f":"IF(OR(Y19>0,$C19=1),\"F\",\"\")","v":"F"},"Nível 1",{"$f":"CHOOSE(1+LOG(1+2*(C19=1)+4*(C19=2)+8*(C19=3)+16*(C19=4)+32*(C19=\"S\"),2),\"\",\"Nível 1\",\"Nível 2\",\"Nível 3\",\"Nível 4\",\"Serviço\")","v":"Nível 1"},"1.","AGETOP",null,"1. PASSARELA COBERTA","UN",1,1,1,null,null,0,0,null,"RESPOSTA"]
[2,2,2,2,1,1,0,0,0,18,2,"","Nível 2","Nível 2","-","SINAPI",null,"SERVIÇOS PRELIMINARES","-",null,1,"-",0,0,0,0,""]
["S",2,"S",0,1,1,0,0,0,0,0,"","Serviço","Serviço","-","AGETOP",20155,"DEMOL.MURO/PAREDE PLACA PRÉ-MOLDADA C/TRANSP.C.B.E CARGA","m2    ",6,1,6,null,null,0,0,""]
[{"$f":"CHOOSE(1+LOG(1+2*(ORÇAMENTO.Nivel=\"Nível 1\")+4*(ORÇAMENTO.Nivel=\"Nível 2\")+8*(ORÇAMENTO.Nivel=\"Nível 3\")+16*(ORÇAMENTO.Nivel=\"Nível 4\")+32*(ORÇAMENTO.Nivel=\"Serviço\"),2),0,1,2,3,4,\"S\")","v":2},{"$f":"IF(OR(C22=\"s\",C22=0),OFFSET(B22,-1,0),C22)","v":2},{"$f":"IF(OFFSET(C22,-1,0)=\"L\",1,IF(OFFSET(C22,-1,0)=1,2,IF(OR(A22=\"s\",A22=0),\"S\",IF(AND(OFFSET(C22,-1,0)=2,A22=4),3,IF(AND(OR(OFFSET(C22,-1,0)=\"s\",OFFSET(C22,-1,0)=0),A22<>\"s\",A22>OFFSET(B22,-1,0)),OFFSET(B22,-1,0),A22)))))","v":2},{"$f":"IF(OR(C22=\"S\",C22=0),0,IF(ISERROR(K22),J22,SMALL(J22:K22,1)))","v":3},{"$f":"IF($C22=1,OFFSET(E22,-1,0)+1,OFFSET(E22,-1,0))","v":1},{"$f":"IF($C22=1,0,IF($C22=2,OFFSET(F22,-1,0)+1,OFFSET(F22,-1,0)))","v":2},{"$f":"IF(AND($C22<=2,$C22<>0),0,IF($C22=3,OFFSET(G22,-1,0)+1,OFFSET(G22,-1,0)))","v":0},{"$f":"IF(AND($C22<=3,$C22<>0),0,IF($C22=4,OFFSET(H22,-1,0)+1,OFFSET(H22,-1,0)))","v":0},{"$f":"IF(AND($C22<=4,$C22<>0),0,IF(AND($C22=\"S\",$Y22>0),OFFSET(I22,-1,0)+1,OFFSET(I22,-1,0)))","v":0},16,3,{"$f":"IF(OR(Y22>0,$C22=1),\"F\",\"\")","v":""},"Nível 2",{"$f":"CHOOSE(1+LOG(1+2*(C22=1)+4*(C22=2)+8*(C22=3)+16*(C22=4)+32*(C22=\"S\"),2),\"\",\"Nível 1\",\"Nível 2\",\"Nível 3\",\"Nível 4\",\"Serviço\")","v":"Nível 2"},"-","SINAPI",null,"TRANSPORTES","-",null,1,"-",null,null,0,0,""]
[{"$f":"CHOOSE(1+LOG(1+2*(ORÇAMENTO.Nivel=\"Nível 1\")+4*(ORÇAMENTO.Nivel=\"Nível 2\")+8*(ORÇAMENTO.Nivel=\"Nível 3\")+16*(ORÇAMENTO.Nivel=\"Nível 4\")+32*(ORÇAMENTO.Nivel=\"Serviço\"),2),0,1,2,3,4,\"S\")","v":"S"},2,"S",0,1,2,0,0,0,0,0,"","Serviço","Serviço","-","SINAPI",72897,"CARGA MANUAL DE ENTULHO EM CAMINHAO BASCULANTE 6 M3","M3",0.6,1,0.6,null,null,0,0,""]
[{"$f":"CHOOSE(1+LOG(1+2*(ORÇAMENTO.Nivel=\"Nível 1\")+4*(ORÇAMENTO.Nivel=\"Nível 2\")+8*(ORÇAMENTO.Nivel=\"Nível 3\")+16*(ORÇAMENTO.Nivel=\"Nível 4\")+32*(ORÇAMENTO.Nivel=\"Serviço\"),2),0,1,2,3,4,\"S\")","v":"S"},2,"S",0,1,2,0,0,0,0,0,"","Serviço","Serviço","-","SINAPI",72900,"TRANSPORTE DE ENTULHO COM CAMINHAO BASCULANTE 6 M3, RODOVIA PAVIMENTADA, DMT 0,5 A 1,0 KM","M3",0.6,1,0.6,null,null,0,0,""]
[2,2,2,5,1,3,0,0,0,13,5,"","Nível 2","Nível 2","-","SINAPI",null,"REVESTIMENTO DE PISO","-",null,1,"-",null,null,0,0,""]
[3,3,3,2,1,3,1,0,0,4,2,"","Nível 3","Nível 3","-",null,null,"CONCRETO","-",null,1,"-",null,null,0,0,""]
["S",3,"S",0,1,3,1,0,0,0,0,"","Serviço","Serviço","-","AGETOP",220102,"PISO CONCRETO DESEMPENADO ESPESSURA = 5 CM  1:2,5:3,5","m2    ",15.48,1,15.48,null,null,0,0,""]
[3,3,3,2,1,3,2,0,0,2,168,"","Nível 3","Nível 3","-","SINAPI",null,"CONTRAPISO","-",null,1,"-",null,null,0,0,""]
["S",3,"S",0,1,3,2,0,0,0,0,"","Serviço","Serviço","-","SINAPI",87622,"CONTRAPISO EM ARGAMASSA TRAÇO 1:4 (CIMENTO E AREIA), PREPARO MANUAL, APLICADO EM ÁREAS SECAS SOBRE LAJE, ADERIDO, ESPESSURA 2CM. AF_06/2014","M2",15.48,1,15.48,null,null,0,0,""]
[2,2,2,3,1,4,0,0,0,8,3,"","Nível 2","Nível 2","-","SINAPI",null,"PINTURA","-",null,1,"-",null,null,0,0,""]
[3,3,3,2,1,4,1,0,0,2,5,"","Nível 3","Nível 3","-","SINAPI",null,"ESTRUTURA METÁLICA","-",null,1,"-",null,null,0,0,""]
["S",3,"S",0,1,4,1,0,0,0,0,"","Serviço","Serviço","-","AGETOP",261609,"PINTURA ESMALTE ALQUIDICO ESTR.METALICA 2 DEMAOS","m2    ",30.91,1,30.91,null,null,0,0,""]
[2,2,2,5,1,5,0,0,0,5,154,"","Nível 2","Nível 2","-","SINAPI",null,"COBERTURAS","-",null,1,"-",null,null,0,0,""]
[3,3,3,2,1,5,1,0,0,4,2,"","Nível 3","Nível 3","-","SINAPI",null,"METÁLICA","-",null,1,"-",null,null,0,0,""]
["S",3,"S",0,1,5,1,0,0,0,0,"","Serviço","Serviço","-","AGETOP",160969,"COBERTURA COM TELHA CHAPA GALVANIZADA TRAPEZOIDAL 0,43 MM COM ACESSÓRIOS","m2    ",30.91,1,30.91,null,null,0,0,""]
[3,3,3,2,1,5,2,0,0,2,160,"","Nível 3","Nível 3","-","SINAPI",null,"CALHAS","-",null,1,"-",null,null,0,0,""]
["S",3,"S",0,1,5,2,0,0,0,0,"","Serviço","Serviço","-","AGETOP",160601,"CALHA DE CHAPA GALVANIZADA","m     ",14.05,1,14.05,null,null,0,0,""]
[1,1,1,12,2,0,0,0,0,230,12,"F","Nível 1","Nível 1","2.","SINAPI",null,"2. IMPLANTAÇÃO: BLOCO 03 SALAS","UN",1,1,1,null,null,0,0,""]
[2,2,2,9,2,1,0,0,0,11,9,"","Nível 2","Nível 2","-","AGETOP",null,"SERVIÇO EM TERRA","-",null,1,"-",null,null,0,0,""]
[{"$f":"CHOOSE(1+LOG(1+2*(ORÇAMENTO.Nivel=\"Nível 1\")+4*(ORÇAMENTO.Nivel=\"Nível 2\")+8*(ORÇAMENTO.Nivel=\"Nível 3\")+16*(ORÇAMENTO.Nivel=\"Nível 4\")+32*(ORÇAMENTO.Nivel=\"Serviço\"),2),0,1,2,3,4,\"S\")","v":3},{"$f":"IF(OR(C40=\"s\",C40=0),OFFSET(B40,-1,0),C40)","v":3},{"$f":"IF(OFFSET(C40,-1,0)=\"L\",1,IF(OFFSET(C40,-1,0)=1,2,IF(OR(A40=\"s\",A40=0),\"S\",IF(AND(OFFSET(C40,-1,0)=2,A40=4),3,IF(AND(OR(OFFSET(C40,-1,0)=\"s\",OFFSET(C40,-1,0)=0),A40<>\"s\",A40>OFFSET(B40,-1,0)),OFFSET(B40,-1,0),A40)))))","v":3},{"$f":"IF(OR(C40=\"S\",C40=0),0,IF(ISERROR(K40),J40,SMALL(J40:K40,1)))","v":8},{"$f":"IF($C40=1,OFFSET(E40,-1,0)+1,OFFSET(E40,-1,0))","v":2},{"$f":"IF($C40=1,0,IF($C40=2,OFFSET(F40,-1,0)+1,OFFSET(F40,-1,0)))","v":1},{"$f":"IF(AND($C40<=2,$C40<>0),0,IF($C40=3,OFFSET(G40,-1,0)+1,OFFSET(G40,-1,0)))","v":1},{"$f":"IF(AND($C40<=3,$C40<>0),0,IF($C40=4,OFFSET(H40,-1,0)+1,OFFSET(H40,-1,0)))","v":0},{"$f":"IF(AND($C40<=4,$C40<>0),0,IF(AND($C40=\"S\",$Y40>0),OFFSET(I40,-1,0)+1,OFFSET(I40,-1,0)))","v":0},8,30,{"$f":"IF(OR(Y40>0,$C40=1),\"F\",\"\")","v":""},"Nível 3",{"$f":"CHOOSE(1+LOG(1+2*(C40=1)+4*(C40=2)+8*(C40=3)+16*(C40=4)+32*(C40=\"S\"),2),\"\",\"Nível 1\",\"Nível 2\",\"Nível 3\",\"Nível 4\",\"Serviço\")","v":"Nível 3"},"-",null,null,"ATERRO + CORTE","-",null,1,"-",null,null,0,0,""]
["S",3,"S",0,2,1,1,0,0,0,0,"","Serviço","Serviço","-","AGETOP",41004,"ESCAVACAO MECANICA","m3    ",154.57,1,154.57,null,null,0,0,""]
["S",3,"S",0,2,1,1,0,0,0,0,"","Serviço","Serviço","-","AGETOP",41005,"CARGA MECANIZADA","m3    ",136.94,1,136.94,null,null,0,0,""]
["S",3,"S",0,2,1,1,0,0,0,0,"","Serviço","Serviço","-","AGETOP",41012,"INDENIZAÇÃO DE JAZIDA","m3    ",136.94,1,136.94,null,null,0,0,""]
["S",3,"S",0,2,1,1,0,0,0,0,"","Serviço","Serviço","-","AGETOP",41006,"TRANSPORTE DE MATERIAL ESCAVADO M3.KM","m3km  ",1369.4,1,1369.4,null,null,0,0,""]
["S",3,"S",0,2,1,1,0,0,0,0,"","Serviço","Serviço","-","AGETOP",41010,"TRANSPORTE COM LÂMINA ATE 100 M - (OBRAS CIVIS)","m3    ",123.66,1,123.66,null,null,0,0,""]
["S",3,"S",0,2,1,1,0,0,0,0,"","Serviço","Serviço","-","AGETOP",41140,"REGULARIZAÇÃO DO TERRENO SEM APILOAMENTO COM TRANSPORTE MANUAL DA TERRA ESCAVADA ","m2    ",380.23,1,380.23,null,null,0,0,""]
["S",3,"S",0,2,1,1,0,0,0,0,"","Serviço","Serviço","-","AGETOP",41009,"COMPACTAÇÃO MECÂNICA SEM CONTROLE LABORATÓRIO","m3    ",123.66,1,123.66,null,null,0,0,""]
[2,2,2,2,2,2,0,0,0,2,14,"","Nível 2","Nível 2","-","SINAPI",null,"DIVERSOS","-",null,1,"-",null,null,0,0,""]
["S",2,"S",0,2,2,0,0,0,0,0,"","Serviço","Serviço","-","SINAPI",98504,"PLANTIO DE GRAMA EM PLACAS. AF_05/2018","M2",42.3,1,42.3,null,null,0,0,""]
[1,1,1,14,3,0,0,0,0,218,14,"F","Nível 1","Nível 1","3.","SINAPI",null,"3. CALÇADA DE PROTEÇÃO","UN",1,1,1,null,null,0,0,""]
[2,2,2,8,3,1,0,0,0,13,8,"","Nível 2","Nível 2","-","AGETOP",null,"SERVIÇO EM TERRA","-",null,1,"-",null,null,0,0,""]
[3,3,3,7,3,1,1,0,0,7,18,"","Nível 3","Nível 3","-",null,null,"AQUISIÇÃO DE TERRA (SOMENTE ATERRO)","-",null,1,"-",null,null,0,0,""]
["S",3,"S",0,3,1,1,0,0,0,0,"","Serviço","Serviço","-","AGETOP",41004,"ESCAVACAO MECANICA","m3    ",2.12,1,2.12,null,null,0,0,""]
["S",3,"S",0,3,1,1,0,0,0,0,"","Serviço","Serviço","-","AGETOP",41005,"CARGA MECANIZADA","m3    ",2.12,1,2.12,null,null,0,0,""]
["S",3,"S",0,3,1,1,0,0,0,0,"","Serviço","Serviço","-","AGETOP",41012,"INDENIZAÇÃO DE JAZIDA","m3    ",2.12,1,2.12,null,null,0,0,""]
["S",3,"S",0,3,1,1,0,0,0,0,"","Serviço","Serviço","-","AGETOP",41006,"TRANSPORTE DE MATERIAL ESCAVADO M3.KM","m3km  ",2.12,1,2.12,null,null,0,0,""]
["S",3,"S",0,3,1,1,0,0,0,0,"","Serviço","Serviço","-","AGETOP",41140,"REGULARIZAÇÃO DO TERRENO SEM APILOAMENTO COM TRANSPORTE MANUAL DA TERRA ESCAVADA ","m2    ",11.3,1,11.3,null,null,0,0,""]
["S",3,"S",0,3,1,1,0,0,0,0,"","Serviço","Serviço","-","AGETOP",41002,"APILOAMENTO","m2    ",11.3,1,11.3,null,null,0,0,""]
[2,2,2,3,3,2,0,0,0,5,3,"","Nível 2","Nível 2","-","SINAPI",null,"REVESTIMENTO DE PISO","-",null,1,"-",null,null,0,0,""]
[3,3,3,2,3,2,1,0,0,2,10,"","Nível 3","Nível 3","-","SINAPI",null,"CONCRETO","-",null,1,"-",null,null,0,0,""]
["S",3,"S",0,3,2,1,0,0,0,0,"","Serviço","Serviço","-","AGETOP",220102,"PISO CONCRETO DESEMPENADO ESPESSURA = 5 CM  1:2,5:3,5","m2    ",11.3,1,11.3,null,null,0,0,""]
[2,2,2,2,3,3,0,0,0,2,85,"","Nível 2","Nível 2","-","SINAPI",null,"DIVERSOS","-",null,1,"-",null,null,0,0,""]
["S",2,"S",0,3,3,0,0,0,0,0,"","Serviço","Serviço","-","AGETOP",271417,"CANALETA CONCRETO DESEMPENADO 5 CM PD.GOINFRA","m     ",25.1,1,25.1,null,null,0,0,""]
[1,1,1,8,4,0,0,0,0,204,8,"F","Nível 1","Nível 1","4.","SINAPI",null,"4. MURO","UN",1,1,1,null,null,0,0,""]
[2,2,2,2,4,1,0,0,0,7,2,"","Nível 2","Nível 2","-","SINAPI",null,"REVESTIMENTO DE PAREDE","-",null,1,"-",null,null,0,0,""]
["S",2,"S",0,4,1,0,0,0,0,0,"","Serviço","Serviço","-","AGETOP",200499,"REBOCO PAULISTA A-14 (1CALH:4ARMLC+100kgCI/M3)","m2    ",709.9080763163139,1,709.9080763163139,null,null,0,0,""]
[2,2,2,5,4,2,0,0,0,5,40,"","Nível 2","Nível 2","-","SINAPI",null,"PINTURA","-",null,1,"-",null,null,0,0,""]
[3,3,3,2,4,2,1,0,0,4,2,"","Nível 3","Nível 3","-","SINAPI",null,"EXTERNA","-",null,1,"-",null,null,0,0,""]
["S",3,"S",0,4,2,1,0,0,0,0,"","Serviço","Serviço","-","AGETOP",261000,"PINTURA LATEX ACRILICA 2 DEMAOS C/SELADOR","m2    ",709.9080763163139,1,709.9080763163139,null,null,0,0,""]
[3,3,3,2,4,2,2,0,0,2,126,"","Nível 3","Nível 3","-","SINAPI",null,"OUTROS","-",null,1,"-",null,null,0,0,""]
["S",3,"S",0,4,2,2,0,0,0,0,"","Serviço","Serviço","-","AGETOP",261620,"LETREIRO MÉDIO A GRANDE PORTE EM PAREDE FEITO A PINCEL","m2    ",7.2,1,7.2,null,null,0,0,""]
[1,1,1,5,5,0,0,0,0,196,5,"F","Nível 1","Nível 1","5.","SINAPI",null,"ADMINISTRAÇÃO LOCAL","UN",1,1,1,null,null,0,0,""]
[2,2,2,4,5,1,0,0,0,4,19,"","Nível 2","Nível 2","-",null,null,"ADMINISTRAÇÃO","-",null,1,"-",null,null,0,0,""]
[3,3,3,3,5,1,1,0,0,3,85,"","Nível 3","Nível 3","-",null,null,"MENSALISTAS","-",null,1,"-",null,null,0,0,""]
["S",3,"S",0,5,1,1,0,0,0,0,"","Serviço","Serviço","-","SINAPI",90778,"ENGENHEIRO CIVIL DE OBRA PLENO COM ENCARGOS COMPLEMENTARES","H",63,1,63,null,null,0,0,"Referência: AGETOP - 250101"]
["S",3,"S",0,5,1,1,0,0,0,0,"","Serviço","Serviço","-","SINAPI",90776,"ENCARREGADO GERAL COM ENCARGOS COMPLEMENTARES","H",660,1,660,null,null,0,0,"Referência: AGETOP - 250103"]
[1,1,1,5,6,0,0,0,0,191,5,"F","Nível 1","Nível 1","6.","SINAPI",null,"OBRA","UN",1,1,1,null,null,0,0,""]
[2,2,2,4,6,1,0,0,0,4,14,"","Nível 2","Nível 2","-","SINAPI",null,"DIVERSOS","-",null,1,"-",null,null,0,0,""]
["S",2,"S",0,6,1,0,0,0,0,0,"","Serviço","Serviço","-","AGETOP",270501,"LIMPEZA FINAL DE OBRA - (OBRAS CIVIS)","m2    ",258.99311531834007,1,258.99311531834007,null,null,0,0,""]
["S",2,"S",0,6,1,0,0,0,0,0,"","Serviço","Serviço","-","AGETOP",21301,"PLACA DE OBRA PLOTADA EM CHAPA METÁLICA 26 , AFIXADA EM CAVALETES DE MADEIRA DE LEI (VIGOTAS 6X12CM) - PADRÃO GOINFRA","m2    ",7.5,1,7.5,null,null,0,0,""]
["S",2,"S",0,6,1,0,0,0,0,0,"","Serviço","Serviço","-","AGETOP",270804,"PLACA DE INAUGURAÇÃO AÇO ESCOVADO 60 X 120 CM","un    ",1,1,1,null,null,0,0,""]
[{"$f":"CHOOSE(1+LOG(1+2*(ORÇAMENTO.Nivel=\"Nível 1\")+4*(ORÇAMENTO.Nivel=\"Nível 2\")+8*(ORÇAMENTO.Nivel=\"Nível 3\")+16*(ORÇAMENTO.Nivel=\"Nível 4\")+32*(ORÇAMENTO.Nivel=\"Serviço\"),2),0,1,2,3,4,\"S\")","v":1},{"$f":"IF(OR(C82=\"s\",C82=0),OFFSET(B82,-1,0),C82)","v":1},{"$f":"IF(OFFSET(C82,-1,0)=\"L\",1,IF(OFFSET(C82,-1,0)=1,2,IF(OR(A82=\"s\",A82=0),\"S\",IF(AND(OFFSET(C82,-1,0)=2,A82=4),3,IF(AND(OR(OFFSET(C82,-1,0)=\"s\",OFFSET(C82,-1,0)=0),A82<>\"s\",A82>OFFSET(B82,-1,0)),OFFSET(B82,-1,0),A82)))))","v":1},{"$f":"IF(OR(C82=\"S\",C82=0),0,IF(ISERROR(K82),J82,SMALL(J82:K82,1)))","v":16},{"$f":"IF($C82=1,OFFSET(E82,-1,0)+1,OFFSET(E82,-1,0))","v":7},{"$f":"IF($C82=1,0,IF($C82=2,OFFSET(F82,-1,0)+1,OFFSET(F82,-1,0)))","v":0},{"$f":"IF(AND($C82<=2,$C82<>0),0,IF($C82=3,OFFSET(G82,-1,0)+1,OFFSET(G82,-1,0)))","v":0},{"$f":"IF(AND($C82<=3,$C82<>0),0,IF($C82=4,OFFSET(H82,-1,0)+1,OFFSET(H82,-1,0)))","v":0},{"$f":"IF(AND($C82<=4,$C82<>0),0,IF(AND($C82=\"S\",$Y82>0),OFFSET(I82,-1,0)+1,OFFSET(I82,-1,0)))","v":0},186,16,{"$f":"IF(OR(Y82>0,$C82=1),\"F\",\"\")","v":"F"},"Nível 1",{"$f":"CHOOSE(1+LOG(1+2*(C82=1)+4*(C82=2)+8*(C82=3)+16*(C82=4)+32*(C82=\"S\"),2),\"\",\"Nível 1\",\"Nível 2\",\"Nível 3\",\"Nível 4\",\"Serviço\")","v":"Nível 1"},"7.","AGETOP",null,"PROJETO ESTRUTURAL","UN",1,1,1,null,null,0,0,""]
[2,2,2,9,7,1,0,0,0,15,9,"","Nível 2","Nível 2","-","AGETOP",null,"FUNDAÇÕES E SONDAGENS","-",null,1,"-",null,null,0,0,""]
[3,3,3,8,7,1,1,0,0,8,75,"","Nível 3","Nível 3","-","SINAPI",null,"BLOCOS, ESTACAS E ARRANQUES","-",null,1,"-",null,null,0,0,""]
["S",3,"S",0,7,1,1,0,0,0,0,"","Serviço","Serviço","-","AGETOP",20702,"LOCAÇÃO DE OBRAS DE PEQUENO PORTE COM CAVALETE, INCLUSO PINTURA ( FACE INTERNA DO SARRAFO 10CM) E PIQUETE COM TESTEMUNHA","m2    ",30.91,1,30.91,null,null,0,0,""]
["S",3,"S",0,7,1,1,0,0,{"$f":"IF(OR($C86=\"S\",$C86=0),0,MATCH(0,OFFSET($D86,1,$C86,ROW($C$268)-ROW($C86)),0))","v":0},{"$f":"IF(OR($C86=\"S\",$C86=0),0,MATCH(OFFSET($D86,0,$C86)+1,OFFSET($D86,1,$C86,ROW($C$268)-ROW($C86)),0))","v":0},"","Serviço","Serviço","-","SINAPI",98230,"ESTACA BROCA DE CONCRETO, DIÂMETRO DE 30 CM, PROFUNDIDADE DE ATÉ 3 M, ESCAVAÇÃO MANUAL COM TRADO CONCHA, NÃO ARMADA. AF_03/2018","M",42,1,42,null,null,0,0,"Referência: AGETOP - 50302"]
["S",3,"S",0,7,1,1,0,0,0,0,"","Serviço","Serviço","-","SINAPI",96545,"ARMAÇÃO DE BLOCO, VIGA BALDRAME OU SAPATA UTILIZANDO AÇO CA-50 DE 8 MM - MONTAGEM. AF_06/2017","KG",73.81,1,73.81,null,null,0,0,"Referência: AGETOP - 52004"]
["S",3,"S",0,7,1,1,0,0,0,0,"","Serviço","Serviço","-","SINAPI",96546,"ARMAÇÃO DE BLOCO, VIGA BALDRAME OU SAPATA UTILIZANDO AÇO CA-50 DE 10 MM - MONTAGEM. AF_06/2017","KG",183.79,1,183.79,null,null,0,0,"Referência: AGETOP - 52005"]
["S",3,"S",0,7,1,1,0,0,0,0,"","Serviço","Serviço","-","SINAPI",96544,"ARMAÇÃO DE BLOCO, VIGA BALDRAME OU SAPATA UTILIZANDO AÇO CA-50 DE 6,3 MM - MONTAGEM. AF_06/2017","KG",62.227272727272727,1,62.227272727272727,null,null,0,0,"Referência: AGETOP - 52003"]
["S",3,"S",0,7,1,1,0,0,0,0,"","Serviço","Serviço","-","SINAPI",94971,"CONCRETO FCK = 25MPA, TRAÇO 1:2,3:2,7 (CIMENTO/ AREIA MÉDIA/ BRITA 1)  - PREPARO MECÂNICO COM BETONEIRA 600 L. AF_07/2016","M3",1.53,1,1.53,null,null,0,0,""]
["S",3,"S",0,7,1,1,0,0,0,0,"","Serviço","Serviço","-","AGETOP",41002,"APILOAMENTO","m2    ",3.5,1,3.5,null,null,0,0,""]
[2,2,2,6,7,2,0,0,0,6,15,"","Nível 2","Nível 2","-","AGETOP",null,"ESTRUTURA","-",null,1,"-",null,null,0,0,""]
[3,3,3,5,7,2,1,0,0,5,66,"","Nível 3","Nível 3","-","AGETOP",null,"VIGAS BALDRAMES","-",null,1,"-",null,null,0,0,""]
["S",3,"S",0,7,2,1,0,0,0,0,"","Serviço","Serviço","-","SINAPI",94971,"CONCRETO FCK = 25MPA, TRAÇO 1:2,3:2,7 (CIMENTO/ AREIA MÉDIA/ BRITA 1)  - PREPARO MECÂNICO COM BETONEIRA 600 L. AF_07/2016","M3",1.32,1,1.32,null,null,0,0,""]
["S",3,"S",0,7,2,1,0,0,0,0,"","Serviço","Serviço","-","SINAPI",96546,"ARMAÇÃO DE BLOCO, VIGA BALDRAME OU SAPATA UTILIZANDO AÇO CA-50 DE 10 MM - MONTAGEM. AF_06/2017","KG",74,1,74,null,null,0,0,"Referência: AGETOP - 52005"]
["S",3,"S",0,7,2,1,0,0,0,0,"","Serviço","Serviço","-","SINAPI",96544,"ARMAÇÃO DE BLOCO, VIGA BALDRAME OU SAPATA UTILIZANDO AÇO CA-50 DE 6,3 MM - MONTAGEM. AF_06/2017","KG",34.54545454545454,1,34.54545454545454,null,null,0,0,"Referência: AGETOP - 52003"]
["S",3,"S",0,7,2,1,0,0,0,0,"","Serviço","Serviço","-","AGETOP",41002,"APILOAMENTO","m2    ",4.4000000000000004,1,4.4000000000000004,null,null,0,0,""]
[1,1,1,3,8,0,0,0,0,170,3,"F","Nível 1","Nível 1","8.","SINAPI",null,"PROJETO ESTRUTURAS METÁLICAS","UN",1,1,1,null,null,0,0,""]
[2,2,2,2,8,1,0,0,0,2,6,"","Nível 2","Nível 2","-","SINAPI",null,"ESTRUTURAS METÁLICAS","-",null,1,"-",null,null,0,0,""]
["S",2,"S",0,8,1,0,0,0,0,0,"","Serviço","Serviço","-","AGETOP",150204,"ESTRUTURA METÁLICA CONVENCIONAL EM AÇO DO TIPO MR-250 / ASTM A36 COM FUNDO ANTICORROSIVO","Kg    ",890.13,1,890.13,null,null,0,0,""]
[1,1,1,37,9,0,0,0,0,167,37,"F","Nível 1","Nível 1","9.","AGETOP",null,"PROJETO ELÉTRICO","UN",1,1,1,null,null,0,0,""]
[2,2,2,3,9,1,0,0,0,36,3,"","Nível 2","Nível 2","-","AGETOP",null,"SERVIÇO EM TERRA","-",null,1,"-",null,null,0,0,""]
["S",2,"S",0,9,1,0,0,0,0,0,"","Serviço","Serviço","-","SINAPI",93358,"ESCAVAÇÃO MANUAL DE VALA COM PROFUNDIDADE MENOR OU IGUAL A 1,30 M. AF_03/2016","M3",2,1,2,null,null,0,0,"Referência: AGETOP - 40101"]
["S",2,"S",0,9,1,0,0,0,0,0,"","Serviço","Serviço","-","SINAPI",96995,"REATERRO MANUAL APILOADO COM SOQUETE. AF_10/2017","M3",2,1,2,null,null,0,0,"Referência: AGETOP - 40902"]
[{"$f":"CHOOSE(1+LOG(1+2*(ORÇAMENTO.Nivel=\"Nível 1\")+4*(ORÇAMENTO.Nivel=\"Nível 2\")+8*(ORÇAMENTO.Nivel=\"Nível 3\")+16*(ORÇAMENTO.Nivel=\"Nível 4\")+32*(ORÇAMENTO.Nivel=\"Serviço\"),2),0,1,2,3,4,\"S\")","v":2},{"$f":"IF(OR(C105=\"s\",C105=0),OFFSET(B105,-1,0),C105)","v":2},{"$f":"IF(OFFSET(C105,-1,0)=\"L\",1,IF(OFFSET(C105,-1,0)=1,2,IF(OR(A105=\"s\",A105=0),\"S\",IF(AND(OFFSET(C105,-1,0)=2,A105=4),3,IF(AND(OR(OFFSET(C105,-1,0)=\"s\",OFFSET(C105,-1,0)=0),A105<>\"s\",A105>OFFSET(B105,-1,0)),OFFSET(B105,-1,0),A105)))))","v":2},{"$f":"IF(OR(C105=\"S\",C105=0),0,IF(ISERROR(K105),J105,SMALL(J105:K105,1)))","v":2},{"$f":"IF($C105=1,OFFSET(E105,-1,0)+1,OFFSET(E105,-1,0))","v":9},{"$f":"IF($C105=1,0,IF($C105=2,OFFSET(F105,-1,0)+1,OFFSET(F105,-1,0)))","v":2},{"$f":"IF(AND($C105<=2,$C105<>0),0,IF($C105=3,OFFSET(G105,-1,0)+1,OFFSET(G105,-1,0)))","v":0},{"$f":"IF(AND($C105<=3,$C105<>0),0,IF($C105=4,OFFSET(H105,-1,0)+1,OFFSET(H105,-1,0)))","v":0},{"$f":"IF(AND($C105<=4,$C105<>0),0,IF(AND($C105=\"S\",$Y105>0),OFFSET(I105,-1,0)+1,OFFSET(I105,-1,0)))","v":0},33,2,{"$f":"IF(OR(Y105>0,$C105=1),\"F\",\"\")","v":""},"Nível 2",{"$f":"CHOOSE(1+LOG(1+2*(C105=1)+4*(C105=2)+8*(C105=3)+16*(C105=4)+32*(C105=\"S\"),2),\"\",\"Nível 1\",\"Nível 2\",\"Nível 3\",\"Nível 4\",\"Serviço\")","v":"Nível 2"},"-","SINAPI",null,"REVESTIMENTO DE PISO","-",null,1,"-",null,null,0,0,""]
["S",2,"S",0,9,2,0,0,0,0,0,"","Serviço","Serviço","-","AGETOP",220102,"PISO CONCRETO DESEMPENADO ESPESSURA = 5 CM  1:2,5:3,5","m2    ",1,1,1,null,null,0,0,""]
[2,2,2,31,9,3,0,0,0,31,40,"","Nível 2","Nível 2","-",null,null,"INSTALAÇÕES ELÉTRICAS","-",null,1,"-",null,null,0,0,""]
["S",2,"S",0,9,3,0,0,0,0,0,"","Serviço","Serviço","-","SINAPI",91941,"CAIXA RETANGULAR 4\" X 2\" BAIXA (0,30 M DO PISO), PVC, INSTALADA EM PAREDE - FORNECIMENTO E INSTALAÇÃO. AF_12/2015","UN",7,1,7,null,null,0,0,""]
["S",2,"S",0,9,3,0,0,0,0,0,"","Serviço","Serviço","-","SINAPI",91940,"CAIXA RETANGULAR 4\" X 2\" MÉDIA (1,30 M DO PISO), PVC, INSTALADA EM PAREDE - FORNECIMENTO E INSTALAÇÃO. AF_12/2015","UN",3,1,3,null,null,0,0,""]
["S",2,"S",0,9,3,0,0,0,0,0,"","Serviço","Serviço","-","SINAPI",91939,"CAIXA RETANGULAR 4\" X 2\" ALTA (2,00 M DO PISO), PVC, INSTALADA EM PAREDE - FORNECIMENTO E INSTALAÇÃO. AF_12/2015","UN",7,1,7,null,null,0,0,""]
["S",2,"S",0,9,3,0,0,0,0,0,"","Serviço","Serviço","-","SINAPI",91927,"CABO DE COBRE FLEXÍVEL ISOLADO, 2,5 MM², ANTI-CHAMA 0,6/1,0 KV, PARA CIRCUITOS TERMINAIS - FORNECIMENTO E INSTALAÇÃO. AF_12/2015","M",748,1,748,null,null,0,0,"Referência: AGETOP - 70581"]
["S",2,"S",0,9,3,0,0,0,0,0,"","Serviço","Serviço","-","SINAPI",91929,"CABO DE COBRE FLEXÍVEL ISOLADO, 4 MM², ANTI-CHAMA 0,6/1,0 KV, PARA CIRCUITOS TERMINAIS - FORNECIMENTO E INSTALAÇÃO. AF_12/2015","M",300,1,300,null,null,0,0,"Referência: AGETOP - 70582"]
["S",2,"S",0,9,3,0,0,0,0,0,"","Serviço","Serviço","-","SINAPI",91931,"CABO DE COBRE FLEXÍVEL ISOLADO, 6 MM², ANTI-CHAMA 0,6/1,0 KV, PARA CIRCUITOS TERMINAIS - FORNECIMENTO E INSTALAÇÃO. AF_12/2015","M",129,1,129,null,null,0,0,"Referência: AGETOP - 70583"]
["S",2,"S",0,9,3,0,0,0,0,0,"","Serviço","Serviço","-","SINAPI",91953,"INTERRUPTOR SIMPLES (1 MÓDULO), 10A/250V, INCLUINDO SUPORTE E PLACA - FORNECIMENTO E INSTALAÇÃO. AF_12/2015","UN",4,1,4,null,null,0,0,"Referência: AGETOP - 71440"]
[{"$f":"CHOOSE(1+LOG(1+2*(ORÇAMENTO.Nivel=\"Nível 1\")+4*(ORÇAMENTO.Nivel=\"Nível 2\")+8*(ORÇAMENTO.Nivel=\"Nível 3\")+16*(ORÇAMENTO.Nivel=\"Nível 4\")+32*(ORÇAMENTO.Nivel=\"Serviço\"),2),0,1,2,3,4,\"S\")","v":"S"},2,"S",0,9,3,0,0,0,0,0,"","Serviço","Serviço","-","SINAPI",92000,"TOMADA BAIXA DE EMBUTIR (1 MÓDULO), 2P+T 10 A, INCLUINDO SUPORTE E PLACA - FORNECIMENTO E INSTALAÇÃO. AF_12/2015","UN",2,1,2,null,null,0,0,"Referência: AGETOP - 72578"]
["S",2,"S",0,9,3,0,0,0,0,0,"","Serviço","Serviço","-","SINAPI",91993,"TOMADA ALTA DE EMBUTIR (1 MÓDULO), 2P+T 20 A, INCLUINDO SUPORTE E PLACA - FORNECIMENTO E INSTALAÇÃO. AF_12/2015","UN",3,1,3,null,null,0,0,"Referência: AGETOP - 72585"]
["S",2,"S",0,9,3,0,0,0,0,0,"","Serviço","Serviço","-","SINAPI",93654,"DISJUNTOR MONOPOLAR TIPO DIN, CORRENTE NOMINAL DE 16A - FORNECIMENTO E INSTALAÇÃO. AF_04/2016","UN",7,1,7,null,null,0,0,""]
["S",2,"S",0,9,3,0,0,0,0,0,"","Serviço","Serviço","-","SINAPI",93656,"DISJUNTOR MONOPOLAR TIPO DIN, CORRENTE NOMINAL DE 25A - FORNECIMENTO E INSTALAÇÃO. AF_04/2016","UN",3,1,3,null,null,0,0,""]
["S",2,"S",0,9,3,0,0,0,0,0,"","Serviço","Serviço","-","SINAPI",93671,"DISJUNTOR TRIPOLAR TIPO DIN, CORRENTE NOMINAL DE 32A - FORNECIMENTO E INSTALAÇÃO. AF_04/2016","UN",2,1,2,null,null,0,0,"Referência: AGETOP - 71173"]
["S",2,"S",0,9,3,0,0,0,0,0,"","Serviço","Serviço","-","AGETOP",71184,"DISPOSITIVO DE PROTEÇÃO CONTRA SURTOS (D.P.S.) 275V DE 8 A 40KA","Un    ",3,1,3,null,null,0,0,""]
["S",2,"S",0,9,3,0,0,0,0,0,"","Serviço","Serviço","-","SINAPI",91844,"ELETRODUTO FLEXÍVEL CORRUGADO, PVC, DN 25 MM (3/4\"), PARA CIRCUITOS TERMINAIS, INSTALADO EM LAJE - FORNECIMENTO E INSTALAÇÃO. AF_12/2015","M",150,1,150,null,null,0,0,""]
["S",2,"S",0,9,3,0,0,0,0,0,"","Serviço","Serviço","-","SINAPI",91854,"ELETRODUTO FLEXÍVEL CORRUGADO, PVC, DN 25 MM (3/4\"), PARA CIRCUITOS TERMINAIS, INSTALADO EM PAREDE - FORNECIMENTO E INSTALAÇÃO. AF_12/2015","M",52,1,52,null,null,0,0,""]
["S",2,"S",0,9,3,0,0,0,0,0,"","Serviço","Serviço","-","SINAPI",91847,"ELETRODUTO FLEXÍVEL CORRUGADO REFORÇADO, PVC, DN 32 MM (1\"), PARA CIRCUITOS TERMINAIS, INSTALADO EM LAJE - FORNECIMENTO E INSTALAÇÃO. AF_12/2015","M",58,1,58,null,null,0,0,""]
["S",2,"S",0,9,3,0,0,0,0,0,"","Serviço","Serviço","-","SINAPI",91864,"ELETRODUTO RÍGIDO ROSCÁVEL, PVC, DN 32 MM (1\"), PARA CIRCUITOS TERMINAIS, INSTALADO EM FORRO - FORNECIMENTO E INSTALAÇÃO. AF_12/2015","M",18,1,18,null,null,0,0,""]
["S",2,"S",0,9,3,0,0,0,0,0,"","Serviço","Serviço","-","SINAPI",95806,"CONDULETE DE PVC, TIPO B, PARA ELETRODUTO DE PVC SOLDÁVEL DN 32 MM (1''), APARENTE - FORNECIMENTO E INSTALAÇÃO. AF_11/2016","UN",2,1,2,null,null,0,0,""]
["S",2,"S",0,9,3,0,0,0,0,0,"","Serviço","Serviço","-","SINAPI",95805,"CONDULETE DE PVC, TIPO B, PARA ELETRODUTO DE PVC SOLDÁVEL DN 25 MM (3/4''), APARENTE - FORNECIMENTO E INSTALAÇÃO. AF_11/2016","UN",25,1,25,null,null,0,0,""]
["S",2,"S",0,9,3,0,0,0,0,0,"","Serviço","Serviço","-","SINAPI",97585,"LUMINÁRIA TIPO CALHA, DE SOBREPOR, COM 2 LÂMPADAS TUBULARES FLUORESCENTES DE 18 W, COM REATOR DE PARTIDA RÁPIDA - FORNECIMENTO E INSTALAÇÃO. AF_02/2020","UN",86,1,86,null,null,0,0,""]
["S",2,"S",0,9,3,0,0,0,0,0,"","Serviço","Serviço","-","SINAPI",97585,"LUMINÁRIA TIPO CALHA, DE SOBREPOR, COM 2 LÂMPADAS TUBULARES FLUORESCENTES DE 18 W, COM REATOR DE PARTIDA RÁPIDA - FORNECIMENTO E INSTALAÇÃO. AF_02/2020","UN",24,1,24,null,null,0,0,""]
["S",2,"S",0,9,3,0,0,0,0,0,"","Serviço","Serviço","-","AGETOP",71684,"LUMINÁRIA TIPO PROJETOR RETANGULAR ATÉ 400 W - BASE E-40","un    ",3,1,3,null,null,0,0,""]
["S",2,"S",0,9,3,0,0,0,0,0,"","Serviço","Serviço","-","AGETOP",71520,"LAMPADA A VAPOR DE MERCURIO 125 W","Un    ",3,1,3,null,null,0,0,""]
["S",2,"S",0,9,3,0,0,0,0,0,"","Serviço","Serviço","-","SINAPI","74131/4","QUADRO DE DISTRIBUICAO DE ENERGIA DE EMBUTIR, EM CHAPA METALICA, PARA 18 DISJUNTORES TERMOMAGNETICOS MONOPOLARES, COM BARRAMENTO TRIFASICO E NEUTRO, FORNECIMENTO E INSTALACAO","UN",1,1,1,null,null,0,0,""]
["S",2,"S",0,9,3,0,0,0,0,0,"","Serviço","Serviço","-","AGETOP",72190,"QUADRO DE DISTRIBUIÇÃO DE EMBUTIR METÁLICO CB-24E - 150A","Un    ",1,1,1,null,null,0,0,""]
["S",2,"S",0,9,3,0,0,0,0,0,"","Serviço","Serviço","-","AGETOP",70352,"BRACADEIRA METALICA TIPO \"U\" DIAM. 1\"","Un    ",12,1,12,null,null,0,0,""]
["S",2,"S",0,9,3,0,0,0,0,0,"","Serviço","Serviço","-","AGETOP",70422,"BUCHA E ARRUELA METALICA DIAM. 1\"","PR    ",3,1,3,null,null,0,0,""]
["S",2,"S",0,9,3,0,0,0,0,0,"","Serviço","Serviço","-","AGETOP",71184,"DISPOSITIVO DE PROTEÇÃO CONTRA SURTOS (D.P.S.) 275V DE 8 A 40KA","Un    ",3,1,3,null,null,0,0,""]
["S",2,"S",0,9,3,0,0,0,0,0,"","Serviço","Serviço","-","AGETOP",71321,"FITA DE AUTO FUSAO, ROLO E 10,00 MM","Un    ",1,1,1,null,null,0,0,""]
["S",2,"S",0,9,3,0,0,0,0,0,"","Serviço","Serviço","-","AGETOP",71331,"FITA ISOLANTE, ROLO DE 20,00 M","Un    ",1,1,1,null,null,0,0,""]
[1,1,1,130,10,0,0,0,0,130,{"$error":"#N/A"},"F","Nível 1","Nível 1","10.","AGETOP",null,"4 SALAS DE AULA - PADRÃO LAJE PLANA","UN",1,1,1,null,null,0,0,""]
[2,2,2,2,10,1,0,0,0,129,2,"","Nível 2","Nível 2","-","AGETOP",null,"SERVIÇOS PRELIMINARES","-",null,1,"-",null,null,0,0,""]
["S",2,"S",0,10,1,0,0,0,0,0,"","Serviço","Serviço","-","AGETOP",20701,"LOCAÇÃO DA OBRA, EXECUÇÃO DE GABARITO SEM REAPROVEITAMENTO, INCLUSO PINTURA (FACE INTERNA DO RIPÃO 15CM) E PIQUETE COM TESTEMUNHA","m2    ",268.33,1,268.33,null,null,0,0,""]
[2,2,2,3,10,2,0,0,0,127,3,"","Nível 2","Nível 2","-","AGETOP",null,"TRANSPORTES","-",null,1,"-",null,null,0,0,""]
["S",2,"S",0,10,2,0,0,0,0,0,"","Serviço","Serviço","-","SINAPI",72900,"TRANSPORTE DE ENTULHO COM CAMINHAO BASCULANTE 6 M3, RODOVIA PAVIMENTADA, DMT 0,5 A 1,0 KM","M3",18.78,1,18.78,null,null,0,0,""]
["S",2,"S",0,10,2,0,0,0,0,0,"","Serviço","Serviço","-","SINAPI",72897,"CARGA MANUAL DE ENTULHO EM CAMINHAO BASCULANTE 6 M3","M3",18.78,1,18.78,null,null,0,0,""]
[2,2,2,3,10,3,0,0,0,124,3,"","Nível 2","Nível 2","-","AGETOP",null,"SERVIÇO EM TERRA","-",null,1,"-",null,null,0,0,""]
["S",2,"S",0,10,3,0,0,0,0,0,"","Serviço","Serviço","-","AGETOP",41002,"APILOAMENTO","m2    ",268.33,1,268.33,null,null,0,0,""]
["S",2,"S",0,10,3,0,0,0,0,0,"","Serviço","Serviço","-","AGETOP",41003,"ATERRO INTERNO SEM APILOAM.C/TR.EM CARRINHO MÃO","m3    ",26.83,1,26.83,null,null,0,0,""]
[2,2,2,21,10,4,0,0,0,121,21,"","Nível 2","Nível 2","-","AGETOP",null,"FUNDAÇÕES E SONDAGENS","-",null,1,"-",null,null,0,0,""]
[3,3,3,11,10,4,1,0,0,20,11,"","Nível 3","Nível 3","-","SINAPI",null,"ESTACAS E BLOCOS","-",null,1,"-",null,null,0,0,""]
["S",3,"S",0,10,4,1,0,0,0,0,"","Serviço","Serviço","-","SINAPI",98230,"ESTACA BROCA DE CONCRETO, DIÂMETRO DE 30 CM, PROFUNDIDADE DE ATÉ 3 M, ESCAVAÇÃO MANUAL COM TRADO CONCHA, NÃO ARMADA. AF_03/2018","M",210.5,1,210.5,null,null,0,0,"Referência: AGETOP - 50302"]
["S",3,"S",0,10,4,1,0,0,{"$f":"IF(OR($C150=\"S\",$C150=0),0,MATCH(0,OFFSET($D150,1,$C150,ROW($C$268)-ROW($C150)),0))","v":0},{"$f":"IF(OR($C150=\"S\",$C150=0),0,MATCH(OFFSET($D150,0,$C150)+1,OFFSET($D150,1,$C150,ROW($C$268)-ROW($C150)),0))","v":0},"","Serviço","Serviço","-","SINAPI",96522,"ESCAVAÇÃO MANUAL PARA BLOCO DE COROAMENTO OU SAPATA, SEM PREVISÃO DE FÔRMA. AF_06/2017","M3",12.1,1,12.1,null,null,0,0,"Referência: AGETOP - 50901"]
["S",3,"S",0,10,4,1,0,0,0,0,"","Serviço","Serviço","-","AGETOP",50902,"APILOAMENTO (BLOCOS/SAPATAS)","m2    ",12.6,1,12.6,null,null,0,0,""]
["S",3,"S",0,10,4,1,0,0,0,0,"","Serviço","Serviço","-","SINAPI",94964,"CONCRETO FCK = 20MPA, TRAÇO 1:2,7:3 (CIMENTO/ AREIA MÉDIA/ BRITA 1)  - PREPARO MECÂNICO COM BETONEIRA 400 L. AF_07/2016","M3",7.56,1,7.56,null,null,0,0,""]
["S",3,"S",0,10,4,1,0,0,0,0,"","Serviço","Serviço","-","AGETOP",51026,"LANÇAMENTO/APLICAÇÃO/ADENSAMENTO DE CONCRETO EM FUNDAÇÃO- (O.C.)","m3    ",7.56,1,7.56,null,null,0,0,""]
["S",3,"S",0,10,4,1,0,0,0,0,"","Serviço","Serviço","-","SINAPI",94962,"CONCRETO MAGRO PARA LASTRO, TRAÇO 1:4,5:4,5 (CIMENTO/ AREIA MÉDIA/ BRITA 1)  - PREPARO MECÂNICO COM BETONEIRA 400 L. AF_07/2016","M3",0.63,1,0.63,null,null,0,0,""]
["S",3,"S",0,10,4,1,0,0,0,0,"","Serviço","Serviço","-","SINAPI",96544,"ARMAÇÃO DE BLOCO, VIGA BALDRAME OU SAPATA UTILIZANDO AÇO CA-50 DE 6,3 MM - MONTAGEM. AF_06/2017","KG",98,1,98,null,null,0,0,"Referência: AGETOP - 52003"]
["S",3,"S",0,10,4,1,0,0,0,0,"","Serviço","Serviço","-","SINAPI",96545,"ARMAÇÃO DE BLOCO, VIGA BALDRAME OU SAPATA UTILIZANDO AÇO CA-50 DE 8 MM - MONTAGEM. AF_06/2017","KG",93,1,93,null,null,0,0,"Referência: AGETOP - 52004"]
["S",3,"S",0,10,4,1,0,0,0,0,"","Serviço","Serviço","-","SINAPI",96546,"ARMAÇÃO DE BLOCO, VIGA BALDRAME OU SAPATA UTILIZANDO AÇO CA-50 DE 10 MM - MONTAGEM. AF_06/2017","KG",122,1,122,null,null,0,0,"Referência: AGETOP - 52005"]
["S",3,"S",0,10,4,1,0,0,0,0,"","Serviço","Serviço","-","SINAPI",96543,"ARMAÇÃO DE BLOCO, VIGA BALDRAME E SAPATA UTILIZANDO AÇO CA-60 DE 5 MM - MONTAGEM. AF_06/2017","KG",5,1,5,null,null,0,0,"Referência: AGETOP - 52014"]
[3,3,3,9,10,4,2,0,0,9,37,"","Nível 3","Nível 3","-","SINAPI",null,"VIGAS BALDRAMES","-",null,1,"-",null,null,0,0,""]
["S",3,"S",0,10,4,2,0,0,0,0,"","Serviço","Serviço","-","SINAPI",96527,"ESCAVAÇÃO MANUAL DE VALA PARA VIGA BALDRAME, COM PREVISÃO DE FÔRMA. AF_06/2017","M3",12.43,1,12.43,null,null,0,0,"Referência: AGETOP - 40101"]
["S",3,"S",0,10,4,2,0,0,0,0,"","Serviço","Serviço","-","SINAPI",96995,"REATERRO MANUAL APILOADO COM SOQUETE. AF_10/2017","M3",9.629999999999999,1,9.629999999999999,null,null,0,0,"Referência: AGETOP - 40902"]
["S",3,"S",0,10,4,2,0,0,0,0,"","Serviço","Serviço","-","AGETOP",60191,"FORMA DE TABUA CINTA BALDRAME U=8 VEZES","m2    ",47.8,1,47.8,null,null,0,0,""]
["S",{"$f":"IF(OR(C163=\"s\",C163=0),OFFSET(B163,-1,0),C163)","v":3},{"$f":"IF(OFFSET(C163,-1,0)=\"L\",1,IF(OFFSET(C163,-1,0)=1,2,IF(OR(A163=\"s\",A163=0),\"S\",IF(AND(OFFSET(C163,-1,0)=2,A163=4),3,IF(AND(OR(OFFSET(C163,-1,0)=\"s\",OFFSET(C163,-1,0)=0),A163<>\"s\",A163>OFFSET(B163,-1,0)),OFFSET(B163,-1,0),A163)))))","v":"S"},{"$f":"IF(OR(C163=\"S\",C163=0),0,IF(ISERROR(K163),J163,SMALL(J163:K163,1)))","v":0},{"$f":"IF($C163=1,OFFSET(E163,-1,0)+1,OFFSET(E163,-1,0))","v":10},{"$f":"IF($C163=1,0,IF($C163=2,OFFSET(F163,-1,0)+1,OFFSET(F163,-1,0)))","v":4},{"$f":"IF(AND($C163<=2,$C163<>0),0,IF($C163=3,OFFSET(G163,-1,0)+1,OFFSET(G163,-1,0)))","v":2},{"$f":"IF(AND($C163<=3,$C163<>0),0,IF($C163=4,OFFSET(H163,-1,0)+1,OFFSET(H163,-1,0)))","v":0},{"$f":"IF(AND($C163<=4,$C163<>0),0,IF(AND($C163=\"S\",$Y163>0),OFFSET(I163,-1,0)+1,OFFSET(I163,-1,0)))","v":0},0,0,{"$f":"IF(OR(Y163>0,$C163=1),\"F\",\"\")","v":""},"Serviço",{"$f":"CHOOSE(1+LOG(1+2*(C163=1)+4*(C163=2)+8*(C163=3)+16*(C163=4)+32*(C163=\"S\"),2),\"\",\"Nível 1\",\"Nível 2\",\"Nível 3\",\"Nível 4\",\"Serviço\")","v":"Serviço"},"-","SINAPI",94964,"CONCRETO FCK = 20MPA, TRAÇO 1:2,7:3 (CIMENTO/ AREIA MÉDIA/ BRITA 1)  - PREPARO MECÂNICO COM BETONEIRA 400 L. AF_07/2016","M3",2.8,1,2.8,null,null,0,0,""]
["S",3,"S",0,10,4,2,0,0,0,0,"","Serviço","Serviço","-","SINAPI",92873,"LANÇAMENTO COM USO DE BALDES, ADENSAMENTO E ACABAMENTO DE CONCRETO EM ESTRUTURAS. AF_12/2015","M3",2.8,1,2.8,null,null,0,0,"Referência: AGETOP - 60801"]
["S",3,"S",0,10,4,2,0,0,0,0,"","Serviço","Serviço","-","SINAPI",96545,"ARMAÇÃO DE BLOCO, VIGA BALDRAME OU SAPATA UTILIZANDO AÇO CA-50 DE 8 MM - MONTAGEM. AF_06/2017","KG",97.27,1,97.27,null,null,0,0,"Referência: AGETOP - 52004"]
["S",3,"S",0,10,4,2,0,0,0,0,"","Serviço","Serviço","-","SINAPI",96546,"ARMAÇÃO DE BLOCO, VIGA BALDRAME OU SAPATA UTILIZANDO AÇO CA-50 DE 10 MM - MONTAGEM. AF_06/2017","KG",82.72,1,82.72,null,null,0,0,"Referência: AGETOP - 52005"]
["S",3,"S",0,10,4,2,0,0,0,0,"","Serviço","Serviço","-","SINAPI",96543,"ARMAÇÃO DE BLOCO, VIGA BALDRAME E SAPATA UTILIZANDO AÇO CA-60 DE 5 MM - MONTAGEM. AF_06/2017","KG",75.45,1,75.45,null,null,0,0,"Referência: AGETOP - 52014"]
[2,2,2,19,10,5,0,0,0,100,19,"","Nível 2","Nível 2","-","AGETOP",null,"ESTRUTURA","-",null,1,"-",null,null,0,0,""]
[3,3,3,8,10,5,1,0,0,18,8,"","Nível 3","Nível 3","-","SINAPI",null,"PILARES","-",null,1,"-",null,null,0,0,""]
["S",3,"S",0,10,5,1,0,0,0,0,"","Serviço","Serviço","-","SINAPI",92426,"MONTAGEM E DESMONTAGEM DE FÔRMA DE PILARES RETANGULARES E ESTRUTURAS SIMILARES COM ÁREA MÉDIA DAS SEÇÕES MENOR OU IGUAL A 0,25 M², PÉ-DIREITO SIMPLES, EM CHAPA DE MADEIRA COMPENSADA RESINADA, 8 UTILIZAÇÕES. AF_12/2015","M2",47.08,1,47.08,null,null,0,0,""]
["S",3,"S",0,10,5,1,0,0,0,0,"","Serviço","Serviço","-","SINAPI",94964,"CONCRETO FCK = 20MPA, TRAÇO 1:2,7:3 (CIMENTO/ AREIA MÉDIA/ BRITA 1)  - PREPARO MECÂNICO COM BETONEIRA 400 L. AF_07/2016","M3",1.94,1,1.94,null,null,0,0,""]
["S",3,"S",0,10,5,1,0,0,0,0,"","Serviço","Serviço","-","SINAPI",92873,"LANÇAMENTO COM USO DE BALDES, ADENSAMENTO E ACABAMENTO DE CONCRETO EM ESTRUTURAS. AF_12/2015","M3",1.94,1,1.94,null,null,0,0,"Referência: AGETOP - 60801"]
["S",3,"S",0,10,5,1,0,0,0,0,"","Serviço","Serviço","-","SINAPI",92777,"ARMAÇÃO DE PILAR OU VIGA DE UMA ESTRUTURA CONVENCIONAL DE CONCRETO ARMADO EM UMA EDIFICAÇÃO TÉRREA OU SOBRADO UTILIZANDO AÇO CA-50 DE 8,0 MM - MONTAGEM. AF_12/2015","KG",10.9,1,10.9,null,null,0,0,"Referência: AGETOP - 60304"]
["S",3,"S",0,10,5,1,0,0,0,0,"","Serviço","Serviço","-","SINAPI",92778,"ARMAÇÃO DE PILAR OU VIGA DE UMA ESTRUTURA CONVENCIONAL DE CONCRETO ARMADO EM UMA EDIFICAÇÃO TÉRREA OU SOBRADO UTILIZANDO AÇO CA-50 DE 10,0 MM - MONTAGEM. AF_12/2015","KG",40,1,40,null,null,0,0,"Referência: AGETOP - 60305"]
["S",3,"S",0,10,5,1,0,0,0,0,"","Serviço","Serviço","-","SINAPI",92779,"ARMAÇÃO DE PILAR OU VIGA DE UMA ESTRUTURA CONVENCIONAL DE CONCRETO ARMADO EM UMA EDIFICAÇÃO TÉRREA OU SOBRADO UTILIZANDO AÇO CA-50 DE 12,5 MM - MONTAGEM. AF_12/2015","KG",239.09,1,239.09,null,null,0,0,""]
["S",3,"S",0,10,5,1,0,0,0,0,"","Serviço","Serviço","-","SINAPI",92775,"ARMAÇÃO DE PILAR OU VIGA DE UMA ESTRUTURA CONVENCIONAL DE CONCRETO ARMADO EM UMA EDIFICAÇÃO TÉRREA OU SOBRADO UTILIZANDO AÇO CA-60 DE 5,0 MM - MONTAGEM. AF_12/2015","KG",64.540000000000006,1,64.540000000000006,null,null,0,0,"Referência: AGETOP - 60314"]
[3,3,3,10,10,5,2,0,0,10,19,"","Nível 3","Nível 3","-","SINAPI",null,"VIGAS DE COBERTURA","-",null,1,"-",null,null,0,0,""]
["S",3,"S",0,10,5,2,0,0,0,0,"","Serviço","Serviço","-","SINAPI",92464,"MONTAGEM E DESMONTAGEM DE FÔRMA DE VIGA, ESCORAMENTO METÁLICO, PÉ-DIREITO SIMPLES, EM CHAPA DE MADEIRA RESINADA, 8 UTILIZAÇÕES. AF_12/2015","M2",125.45,1,125.45,null,null,0,0,"Referência: AGETOP - 60209"]
["S",3,"S",0,10,5,2,0,0,0,0,"","Serviço","Serviço","-","SINAPI",94964,"CONCRETO FCK = 20MPA, TRAÇO 1:2,7:3 (CIMENTO/ AREIA MÉDIA/ BRITA 1)  - PREPARO MECÂNICO COM BETONEIRA 400 L. AF_07/2016","M3",6.1,1,6.1,null,null,0,0,""]
["S",3,"S",0,10,5,2,0,0,0,0,"","Serviço","Serviço","-","SINAPI",92873,"LANÇAMENTO COM USO DE BALDES, ADENSAMENTO E ACABAMENTO DE CONCRETO EM ESTRUTURAS. AF_12/2015","M3",6.1,1,6.1,null,null,0,0,"Referência: AGETOP - 60801"]
["S",3,"S",0,10,5,2,0,0,0,0,"","Serviço","Serviço","-","SINAPI",92777,"ARMAÇÃO DE PILAR OU VIGA DE UMA ESTRUTURA CONVENCIONAL DE CONCRETO ARMADO EM UMA EDIFICAÇÃO TÉRREA OU SOBRADO UTILIZANDO AÇO CA-50 DE 8,0 MM - MONTAGEM. AF_12/2015","KG",121.81,1,121.81,null,null,0,0,"Referência: AGETOP - 60304"]
["S",3,"S",0,10,5,2,0,0,0,0,"","Serviço","Serviço","-","SINAPI",92778,"ARMAÇÃO DE PILAR OU VIGA DE UMA ESTRUTURA CONVENCIONAL DE CONCRETO ARMADO EM UMA EDIFICAÇÃO TÉRREA OU SOBRADO UTILIZANDO AÇO CA-50 DE 10,0 MM - MONTAGEM. AF_12/2015","KG",7.27,1,7.27,null,null,0,0,"Referência: AGETOP - 60305"]
["S",3,"S",0,10,5,2,0,0,0,0,"","Serviço","Serviço","-","SINAPI",92779,"ARMAÇÃO DE PILAR OU VIGA DE UMA ESTRUTURA CONVENCIONAL DE CONCRETO ARMADO EM UMA EDIFICAÇÃO TÉRREA OU SOBRADO UTILIZANDO AÇO CA-50 DE 12,5 MM - MONTAGEM. AF_12/2015","KG",93.63,1,93.63,null,null,0,0,""]
["S",3,"S",0,10,5,2,0,0,0,0,"","Serviço","Serviço","-","SINAPI",92780,"ARMAÇÃO DE PILAR OU VIGA DE UMA ESTRUTURA CONVENCIONAL DE CONCRETO ARMADO EM UMA EDIFICAÇÃO TÉRREA OU SOBRADO UTILIZANDO AÇO CA-50 DE 16,0 MM - MONTAGEM. AF_12/2015","KG",217.27,1,217.27,null,null,0,0,""]
["S",3,"S",0,10,5,2,0,0,0,0,"","Serviço","Serviço","-","SINAPI",92775,"ARMAÇÃO DE PILAR OU VIGA DE UMA ESTRUTURA CONVENCIONAL DE CONCRETO ARMADO EM UMA EDIFICAÇÃO TÉRREA OU SOBRADO UTILIZANDO AÇO CA-60 DE 5,0 MM - MONTAGEM. AF_12/2015","KG",86.36,1,86.36,null,null,0,0,"Referência: AGETOP - 60314"]
["S",3,"S",0,10,5,2,0,0,0,0,"","Serviço","Serviço","-","AGETOP",61101,"FORRO EM LAJE PRE-MOLDADA INC.CAPEAMENTO/FERR.DISTRIB./ESCORAMENTO E FORMA/DESFORMA","m2    ",205.72,1,205.72,null,null,0,0,""]
[2,2,2,39,10,6,0,0,0,81,39,"","Nível 2","Nível 2","-","AGETOP",null,"INSTALAÇÕES ELÉTRICAS","-",null,1,"-",null,null,0,0,""]
[{"$f":"CHOOSE(1+LOG(1+2*(ORÇAMENTO.Nivel=\"Nível 1\")+4*(ORÇAMENTO.Nivel=\"Nível 2\")+8*(ORÇAMENTO.Nivel=\"Nível 3\")+16*(ORÇAMENTO.Nivel=\"Nível 4\")+32*(ORÇAMENTO.Nivel=\"Serviço\"),2),0,1,2,3,4,\"S\")","v":3},3,3,4,10,6,1,0,0,38,4,"","Nível 3","Nível 3","-","AGETOP",null,"QUADRO DE DISTRIBUIÇÃO","-",null,1,"-",null,null,0,0,""]
["S",3,"S",0,10,6,1,0,0,0,0,"","Serviço","Serviço","-","SINAPI","74131/5","QUADRO DE DISTRIBUICAO DE ENERGIA DE EMBUTIR, EM CHAPA METALICA, PARA 24 DISJUNTORES TERMOMAGNETICOS MONOPOLARES, COM BARRAMENTO TRIFASICO E NEUTRO, FORNECIMENTO E INSTALACAO","UN",1,1,1,null,null,0,0,""]
["S",3,"S",0,10,6,1,0,0,0,0,"","Serviço","Serviço","-","AGETOP",71173,"DISJUNTOR TRIPOLAR DE 10 A 35-A","Un    ",1,1,1,null,null,0,0,""]
["S",3,"S",0,10,6,1,0,0,0,0,"","Serviço","Serviço","-","AGETOP",71171,"DISJUNTOR MONOPOLAR DE 10 A 32-A","Un    ",12,1,12,null,null,0,0,""]
[3,3,3,4,10,6,2,0,0,34,4,"","Nível 3","Nível 3","-","AGETOP",null,"CABOS E FIOS (CONDUTORES)","-",null,1,"-",null,null,0,0,""]
["S",3,"S",0,10,6,2,0,0,0,0,"","Serviço","Serviço","-","AGETOP",70563,"CABO ISOLADO PVC 750 V. No. 2,5 MM2","m     ",850,1,850,null,null,0,0,""]
["S",3,"S",0,10,6,2,0,0,0,0,"","Serviço","Serviço","-","AGETOP",70564,"CABO ISOLADO PVC 750 V. No. 4 MM2","m     ",280,1,280,null,null,0,0,""]
["S",3,"S",0,10,6,2,0,0,0,0,"","Serviço","Serviço","-","SINAPI",96971,"CORDOALHA DE COBRE NU 16 MM², NÃO ENTERRADA, COM ISOLADOR - FORNECIMENTO E INSTALAÇÃO. AF_12/2017","M",10,1,10,null,null,0,0,"Referência: AGETOP - 70541"]
[3,3,3,30,10,6,3,0,0,30,{"$error":"#N/A"},"","Nível 3","Nível 3","-","AGETOP",null,"ELETRODUTOS E ACESSÓRIOS","-",null,1,"-",null,null,0,0,""]
["S",3,"S",0,10,6,3,0,0,0,0,"","Serviço","Serviço","-","SINAPI",91844,"ELETRODUTO FLEXÍVEL CORRUGADO, PVC, DN 25 MM (3/4\"), PARA CIRCUITOS TERMINAIS, INSTALADO EM LAJE - FORNECIMENTO E INSTALAÇÃO. AF_12/2015","M",200,1,200,null,null,0,0,""]
["S",3,"S",0,10,6,3,0,0,0,0,"","Serviço","Serviço","-","SINAPI",91871,"ELETRODUTO RÍGIDO ROSCÁVEL, PVC, DN 25 MM (3/4\"), PARA CIRCUITOS TERMINAIS, INSTALADO EM PAREDE - FORNECIMENTO E INSTALAÇÃO. AF_12/2015","M",30,1,30,null,null,0,0,"Referência: AGETOP - 71201"]
["S",3,"S",0,10,6,3,0,0,0,0,"","Serviço","Serviço","-","SINAPI",91872,"ELETRODUTO RÍGIDO ROSCÁVEL, PVC, DN 32 MM (1\"), PARA CIRCUITOS TERMINAIS, INSTALADO EM PAREDE - FORNECIMENTO E INSTALAÇÃO. AF_12/2015","M",50,1,50,null,null,0,0,"Referência: AGETOP - 71202"]
["S",3,"S",0,10,6,3,0,0,0,0,"","Serviço","Serviço","-","AGETOP",70681,"CAIXA METALICA OCTOGONAL FUNDO MOVEL, SIMPLES 2\"","Un    ",32,1,32,null,null,0,0,""]
["S",3,"S",0,10,6,3,0,0,0,0,"","Serviço","Serviço","-","SINAPI",92866,"CAIXA SEXTAVADA 3\" X 3\", METÁLICA, INSTALADA EM LAJE - FORNECIMENTO E INSTALAÇÃO. AF_12/2015","UN",4,1,4,null,null,0,0,"Referência: AGETOP - 70680"]
["S",3,"S",0,10,6,3,0,0,0,0,"","Serviço","Serviço","-","SINAPI",92868,"CAIXA RETANGULAR 4\" X 2\" MÉDIA (1,30 M DO PISO), METÁLICA, INSTALADA EM PAREDE - FORNECIMENTO E INSTALAÇÃO. AF_12/2015","UN",20,1,20,null,null,0,0,"Referência: AGETOP - 70691"]
["S",3,"S",0,10,6,3,0,0,0,0,"","Serviço","Serviço","-","SINAPI",92871,"CAIXA RETANGULAR 4\" X 4\" MÉDIA (1,30 M DO PISO), METÁLICA, INSTALADA EM PAREDE - FORNECIMENTO E INSTALAÇÃO. AF_12/2015","UN",6,1,6,null,null,0,0,"Referência: AGETOP - 70692"]
["S",3,"S",0,10,6,3,0,0,0,0,"","Serviço","Serviço","-","AGETOP",70645,"CAIXA DE PASSAGEM METÁLICA DE EMBUTIR 15X15X8 CM","Un    ",1,1,1,null,null,0,0,""]
["S",3,"S",0,10,6,3,0,0,0,0,"","Serviço","Serviço","-","SINAPI",91902,"CURVA 90 GRAUS PARA ELETRODUTO, PVC, ROSCÁVEL, DN 25 MM (3/4\"), PARA CIRCUITOS TERMINAIS, INSTALADA EM LAJE - FORNECIMENTO E INSTALAÇÃO. AF_12/2015","UN",10,1,10,null,null,0,0,"Referência: AGETOP - 71141"]
["S",3,"S",0,10,6,3,0,0,0,0,"","Serviço","Serviço","-","SINAPI",91905,"CURVA 90 GRAUS PARA ELETRODUTO, PVC, ROSCÁVEL, DN 32 MM (1\"), PARA CIRCUITOS TERMINAIS, INSTALADA EM LAJE - FORNECIMENTO E INSTALAÇÃO. AF_12/2015","UN",7,1,7,null,null,0,0,"Referência: AGETOP - 71142"]
["S",3,"S",0,10,6,3,0,0,0,0,"","Serviço","Serviço","-","AGETOP",70351,"BRACADEIRA METALICA TIPO \"U\" DIAM. 3/4\"","Un    ",60,1,60,null,null,0,0,""]
["S",3,"S",0,10,6,3,0,0,0,0,"","Serviço","Serviço","-","AGETOP",70352,"BRACADEIRA METALICA TIPO \"U\" DIAM. 1\"","Un    ",10,1,10,null,null,0,0,""]
["S",3,"S",0,10,6,3,0,0,0,0,"","Serviço","Serviço","-","SINAPI",91884,"LUVA PARA ELETRODUTO, PVC, ROSCÁVEL, DN 25 MM (3/4\"), PARA CIRCUITOS TERMINAIS, INSTALADA EM PAREDE - FORNECIMENTO E INSTALAÇÃO. AF_12/2015","UN",15,1,15,null,null,0,0,"Referência: AGETOP - 71741"]
["S",3,"S",0,10,6,3,0,0,0,0,"","Serviço","Serviço","-","SINAPI",91885,"LUVA PARA ELETRODUTO, PVC, ROSCÁVEL, DN 32 MM (1\"), PARA CIRCUITOS TERMINAIS, INSTALADA EM PAREDE - FORNECIMENTO E INSTALAÇÃO. AF_12/2015","UN",16.670000000000002,1,16.670000000000002,null,null,0,0,"Referência: AGETOP - 71742"]
["S",3,"S",0,10,6,3,0,0,0,0,"","Serviço","Serviço","-","AGETOP",70421,"BUCHA E ARRUELA METALICA DIAM. 3/4\"","PR    ",6,1,6,null,null,0,0,""]
["S",3,"S",0,10,6,3,0,0,0,0,"","Serviço","Serviço","-","AGETOP",70422,"BUCHA E ARRUELA METALICA DIAM. 1\"","PR    ",6,1,6,null,null,0,0,""]
["S",3,"S",0,10,6,3,0,0,0,0,"","Serviço","Serviço","-","AGETOP",71331,"FITA ISOLANTE, ROLO DE 20,00 M","Un    ",8,1,8,null,null,0,0,""]
["S",3,"S",0,10,6,3,0,0,{"$f":"IF(OR($C214=\"S\",$C214=0),0,MATCH(0,OFFSET($D214,1,$C214,ROW($C$268)-ROW($C214)),0))","v":0},{"$f":"IF(OR($C214=\"S\",$C214=0),0,MATCH(OFFSET($D214,0,$C214)+1,OFFSET($D214,1,$C214,ROW($C$268)-ROW($C214)),0))","v":0},"","Serviço","Serviço","-","SINAPI",95801,"CONDULETE DE ALUMÍNIO, TIPO X, PARA ELETRODUTO DE AÇO GALVANIZADO DN 20 MM (3/4''), APARENTE - FORNECIMENTO E INSTALAÇÃO. AF_11/2016_P","UN",12,1,12,null,null,0,0,"Referência: AGETOP - 70929"]
["S",3,"S",0,10,6,3,0,0,0,0,"","Serviço","Serviço","-","AGETOP",70930,"CONDULETE METÁLICO - ADAPTADOR DE SAÍDA 3/4\" ","un    ",12,1,12,null,null,0,0,""]
["S",3,"S",0,10,6,3,0,0,0,0,"","Serviço","Serviço","-","AGETOP",72395,"TAMPA CEGA PARA CONDULETE METÁLICO","Un    ",12,1,12,null,null,0,0,""]
["S",3,"S",0,10,6,3,0,0,0,0,"","Serviço","Serviço","-","AGETOP",71450,"INTERRUPTOR DIFERENCIAL RESIDUAL (D.R.) BIPOLAR DE 25A-30mA","Un    ",5,1,5,null,null,0,0,""]
["S",3,"S",0,10,6,3,0,0,0,0,"","Serviço","Serviço","-","AGETOP",71610,"LUMINÁRIA TIPO ARANDELA DE USO EXTERNO BLINDADA COM GRADE ( PEQUENA ) - BASE E-27","un    ",4,1,4,null,null,0,0,""]
["S",3,"S",0,10,6,3,0,0,0,0,"","Serviço","Serviço","-","SINAPI",91953,"INTERRUPTOR SIMPLES (1 MÓDULO), 10A/250V, INCLUINDO SUPORTE E PLACA - FORNECIMENTO E INSTALAÇÃO. AF_12/2015","UN",5,1,5,null,null,0,0,"Referência: AGETOP - 71440"]
[{"$f":"CHOOSE(1+LOG(1+2*(ORÇAMENTO.Nivel=\"Nível 1\")+4*(ORÇAMENTO.Nivel=\"Nível 2\")+8*(ORÇAMENTO.Nivel=\"Nível 3\")+16*(ORÇAMENTO.Nivel=\"Nível 4\")+32*(ORÇAMENTO.Nivel=\"Serviço\"),2),0,1,2,3,4,\"S\")","v":"S"},3,"S",0,10,6,3,0,0,0,0,"","Serviço","Serviço","-","AGETOP",71644,"LUMINÁRIA TIPO PLAFON DE SOBREPOR QUADRADA PARA 02 LÂMPADAS","Un    ",32,1,32,null,null,0,0,""]
["S",3,"S",0,10,6,3,0,0,0,0,"","Serviço","Serviço","-","AGETOP",71577,"LAMPADA COMPACTA ELETRÔNICA COM REATOR INTEGRADO  25/26 W","Un    ",64,1,64,null,null,0,0,""]
["S",3,"S",0,10,6,3,0,0,0,0,"","Serviço","Serviço","-","AGETOP",71520,"LAMPADA A VAPOR DE MERCURIO 125 W","Un    ",4,1,4,null,null,0,0,""]
["S",3,"S",0,10,6,3,0,0,0,0,"","Serviço","Serviço","-","AGETOP",72570,"TOMADA HEXAGONAL 2P + T - 10A - 250V (LINHA X OU EQUIVALENTE)","Un    ",10,1,10,null,null,0,0,""]
["S",3,"S",0,10,6,3,0,0,0,0,"","Serviço","Serviço","-","AGETOP",72575,"TOMADA HEXAGONAL 2P + T - 20A - 250V (LINHA X OU EQUIVALENTE)","Un    ",4,1,4,null,null,0,0,""]
["S",3,"S",0,10,6,3,0,0,0,0,"","Serviço","Serviço","-","AGETOP",71598,"LUMINÁRIA DE EMERGÊNCIA 30 LEDS","un    ",2,1,2,null,null,0,0,""]
[2,2,2,2,10,7,0,0,0,42,2,"","Nível 2","Nível 2","-","AGETOP",null,"ALVENARIAS E DIVISÓRIAS","-",null,1,"-",null,null,0,0,""]
["S",{"$f":"IF(OR(C227=\"s\",C227=0),OFFSET(B227,-1,0),C227)","v":2},{"$f":"IF(OFFSET(C227,-1,0)=\"L\",1,IF(OFFSET(C227,-1,0)=1,2,IF(OR(A227=\"s\",A227=0),\"S\",IF(AND(OFFSET(C227,-1,0)=2,A227=4),3,IF(AND(OR(OFFSET(C227,-1,0)=\"s\",OFFSET(C227,-1,0)=0),A227<>\"s\",A227>OFFSET(B227,-1,0)),OFFSET(B227,-1,0),A227)))))","v":"S"},{"$f":"IF(OR(C227=\"S\",C227=0),0,IF(ISERROR(K227),J227,SMALL(J227:K227,1)))","v":0},{"$f":"IF($C227=1,OFFSET(E227,-1,0)+1,OFFSET(E227,-1,0))","v":10},{"$f":"IF($C227=1,0,IF($C227=2,OFFSET(F227,-1,0)+1,OFFSET(F227,-1,0)))","v":7},{"$f":"IF(AND($C227<=2,$C227<>0),0,IF($C227=3,OFFSET(G227,-1,0)+1,OFFSET(G227,-1,0)))","v":0},{"$f":"IF(AND($C227<=3,$C227<>0),0,IF($C227=4,OFFSET(H227,-1,0)+1,OFFSET(H227,-1,0)))","v":0},{"$f":"IF(AND($C227<=4,$C227<>0),0,IF(AND($C227=\"S\",$Y227>0),OFFSET(I227,-1,0)+1,OFFSET(I227,-1,0)))","v":0},0,0,{"$f":"IF(OR(Y227>0,$C227=1),\"F\",\"\")","v":""},"Serviço",{"$f":"CHOOSE(1+LOG(1+2*(C227=1)+4*(C227=2)+8*(C227=3)+16*(C227=4)+32*(C227=\"S\"),2),\"\",\"Nível 1\",\"Nível 2\",\"Nível 3\",\"Nível 4\",\"Serviço\")","v":"Serviço"},"-","SINAPI",87520,"ALVENARIA DE VEDAÇÃO DE BLOCOS CERÂMICOS FURADOS NA HORIZONTAL DE 9X19X19CM (ESPESSURA 9CM) DE PAREDES COM ÁREA LÍQUIDA MAIOR OU IGUAL A 6M² COM VÃOS E ARGAMASSA DE ASSENTAMENTO COM PREPARO MANUAL. AF_06/2014","M2",212.97,1,212.97,null,null,0,0,"Referência: AGETOP - 100201"]
[2,2,2,2,10,8,0,0,0,40,2,"","Nível 2","Nível 2","-","AGETOP",null,"IMPERMEABILIZAÇÃO","-",null,1,"-",null,null,0,0,""]
["S",2,"S",0,10,8,0,0,0,0,0,"","Serviço","Serviço","-","SINAPI",98562,"IMPERMEABILIZAÇÃO DE FLOREIRA OU VIGA BALDRAME COM ARGAMASSA DE CIMENTO E AREIA, COM ADITIVO IMPERMEABILIZANTE, E = 2 CM. AF_06/2018","M2",59.27,1,59.27,null,null,0,0,"Referência: AGETOP - 120902"]
[2,2,2,2,10,9,0,0,0,38,2,"","Nível 2","Nível 2","-","AGETOP",null,"ESTRUTURAS METÁLICAS","-",null,1,"-",null,null,0,0,""]
["S",2,"S",0,10,9,0,0,0,0,0,"","Serviço","Serviço","-","AGETOP",150103,"ESTRUTURA METÁLICA CONVENCIONAL EM AÇO DO TIPO USI SAC-300 COM FUNDO ANTICORROSIVO","Kg    ",2326.92,1,2326.92,null,null,0,0,""]
[2,2,2,4,10,10,0,0,0,36,4,"","Nível 2","Nível 2","-","AGETOP",null,"COBERTURAS","-",null,1,"-",null,null,0,0,""]
["S",2,"S",0,10,10,0,0,0,0,0,"","Serviço","Serviço","-","SINAPI",94445,"TELHAMENTO COM TELHA CERÂMICA CAPA-CANAL, TIPO PLAN, COM ATÉ 2 ÁGUAS, INCLUSO TRANSPORTE VERTICAL. AF_07/2019","M2",341.87,1,341.87,null,null,0,0,"Referência: AGETOP - 160401"]
["S",2,"S",0,10,10,0,0,0,0,0,"","Serviço","Serviço","-","SINAPI",94221,"CUMEEIRA PARA TELHA CERÂMICA EMBOÇADA COM ARGAMASSA TRAÇO 1:2:9 (CIMENTO, CAL E AREIA) PARA TELHADOS COM ATÉ 2 ÁGUAS, INCLUSO TRANSPORTE VERTICAL. AF_07/2019","M",31.95,1,31.95,null,null,0,0,""]
["S",2,"S",0,10,10,0,0,0,0,0,"","Serviço","Serviço","-","SINAPI",94224,"EMBOÇAMENTO COM ARGAMASSA TRAÇO 1:2:9 (CIMENTO, CAL E AREIA). AF_07/2019","M",85.94,1,85.94,null,null,0,0,"Referência: AGETOP - 160403"]
[2,2,2,4,10,11,0,0,0,32,4,"","Nível 2","Nível 2","-","AGETOP",null,"ESQUADRIAS METÁLICAS","-",null,1,"-",null,null,0,0,""]
["S",2,"S",0,10,11,0,0,0,0,0,"","Serviço","Serviço","-","AGETOP",180311,"GRADE DE PROTECAO/TUBO INDUSTRIAL/FERRO REDONDO-GP5","m2    ",57.6,1,57.6,null,null,0,0,""]
["S",2,"S",0,10,11,0,0,0,0,0,"","Serviço","Serviço","-","AGETOP",180403,"ESQ.MAXIMO AR CHAPA/VIDRO J1/J2/J7/J15 C/FERRAGENS","m2    ",57.6,1,57.6,null,null,0,0,""]
["S",2,"S",0,10,11,0,0,0,0,0,"","Serviço","Serviço","-","AGETOP",180501,"PORTA DE ABRIR EM CHAPA PF-1 C/FERRAGENS","m2    ",6.72,1,6.72,null,null,0,0,""]
[2,2,2,2,10,12,0,0,0,28,2,"","Nível 2","Nível 2","-","AGETOP",null,"VIDROS","-",null,1,"-",null,null,0,0,""]
["S",2,"S",0,10,12,0,0,0,0,0,"","Serviço","Serviço","-","SINAPI",72117,"VIDRO LISO COMUM TRANSPARENTE, ESPESSURA 4MM","M2",57.6,1,57.6,null,null,0,0,"Referência: AGETOP - 190102"]
[2,2,2,4,10,13,0,0,0,26,4,"","Nível 2","Nível 2","-","AGETOP",null,"REVESTIMENTO DE PAREDE","-",null,1,"-",null,null,0,0,""]
["S",2,"S",0,10,13,0,0,0,0,0,"","Serviço","Serviço","-","SINAPI",87904,"CHAPISCO APLICADO EM ALVENARIA (COM PRESENÇA DE VÃOS) E ESTRUTURAS DE CONCRETO DE FACHADA, COM COLHER DE PEDREIRO.  ARGAMASSA TRAÇO 1:3 COM PREPARO MANUAL. AF_06/2014","M2",390.12,1,390.12,null,null,0,0,"Referência: AGETOP - 200101"]
["S",2,"S",0,10,13,0,0,0,0,0,"","Serviço","Serviço","-","SINAPI",87547,"MASSA ÚNICA, PARA RECEBIMENTO DE PINTURA, EM ARGAMASSA TRAÇO 1:2:8, PREPARO MECÂNICO COM BETONEIRA 400L, APLICADA MANUALMENTE EM FACES INTERNAS DE PAREDES, ESPESSURA DE 10MM, COM EXECUÇÃO DE TALISCAS. AF_06/2014","M2",390.12,1,390.12,null,null,0,0,""]
["S",2,"S",0,10,13,0,0,0,0,0,"","Serviço","Serviço","-","COMPOSIÇÃO","COMP 415_SEE","PEITORIL EM GRANITO CINZA, LARGURA VARIÁVEL E PINGADEIRA","M2",5.71,1,5.71,null,null,0,0,""]
[2,2,2,3,10,14,0,0,0,22,3,"","Nível 2","Nível 2","-","AGETOP",null,"FORROS","-",null,1,"-",null,null,0,0,""]
["S",2,"S",0,10,14,0,0,0,0,0,"","Serviço","Serviço","-","SINAPI",87884,"CHAPISCO APLICADO NO TETO, COM ROLO PARA TEXTURA ACRÍLICA. ARGAMASSA INDUSTRIALIZADA COM PREPARO MANUAL. AF_06/2014","M2",194.04,1,194.04,null,null,0,0,"Referência: AGETOP - 210102"]
["S",2,"S",0,10,14,0,0,0,0,0,"","Serviço","Serviço","-","SINAPI",90408,"MASSA ÚNICA, PARA RECEBIMENTO DE PINTURA, EM ARGAMASSA TRAÇO 1:2:8, PREPARO MECÂNICO COM BETONEIRA 400L, APLICADA MANUALMENTE EM TETO, ESPESSURA DE 10MM, COM EXECUÇÃO DE TALISCAS. AF_03/2015","M2",194.04,1,194.04,null,null,0,0,"Referência: AGETOP - 210401"]
[2,2,2,5,10,15,0,0,0,19,5,"","Nível 2","Nível 2","-","AGETOP",null,"REVESTIMENTO DE PISO","-",null,1,"-",null,null,0,0,""]
["S",2,"S",0,10,15,0,0,0,0,0,"","Serviço","Serviço","-","AGETOP",220100,"PASSEIO PROTECAO EM CONC.DESEMPEN.5 CM 1:2,5:3,5 ( INCLUSO ESPELHO DE 30CM/ESCAVAÇÃO/REATERRO/APILOAMENTO/ATERRO INTERNO)","m2    ",65.22,1,65.22,null,null,0,0,""]
["S",2,"S",0,10,15,0,0,0,0,0,"","Serviço","Serviço","-","AGETOP",220101,"LASTRO DE CONCRETO REGULARIZADO IMPERMEABILIZADO 1:3:6 ESP=5CM (BASE)","m2    ",269.68,1,269.68,null,null,0,0,""]
[{"$f":"CHOOSE(1+LOG(1+2*(ORÇAMENTO.Nivel=\"Nível 1\")+4*(ORÇAMENTO.Nivel=\"Nível 2\")+8*(ORÇAMENTO.Nivel=\"Nível 3\")+16*(ORÇAMENTO.Nivel=\"Nível 4\")+32*(ORÇAMENTO.Nivel=\"Serviço\"),2),0,1,2,3,4,\"S\")","v":"S"},2,"S",0,10,15,0,0,0,0,0,"","Serviço","Serviço","-","SINAPI",84191,"PISO EM GRANILITE, MARMORITE OU GRANITINA ESPESSURA 8 MM, INCLUSO JUNTAS DE DILATACAO PLASTICAS","M2",279.19,1,279.19,null,null,0,0,"Referência: AGETOP - 221101"]
["S",2,"S",0,10,15,0,0,0,0,0,"","Serviço","Serviço","-","AGETOP",221104,"RASPAGEM E APLICAÇÃO RESINA ACRÍLICA DUAS DEMÃOS","m2    ",279.19,1,279.19,null,null,0,0,""]
[2,2,2,3,10,16,0,0,0,14,3,"","Nível 2","Nível 2","-","AGETOP",null,"MARCENARIA","-",null,1,"-",null,null,0,0,""]
["S",2,"S",0,10,16,0,0,0,0,0,"","Serviço","Serviço","-","AGETOP",240106,"BATE CARTEIRA ENVERNIZADO E ASSENT. 2,5 X 12 CM","M     ",77.599999999999994,1,77.599999999999994,null,null,0,0,""]
["S",2,"S",0,10,16,0,0,0,0,0,"","Serviço","Serviço","-","AGETOP",240110,"QUADRO AVISO TP-1 (1,20 X 1,20 M)","Un    ",4,1,4,null,null,0,0,""]
[2,2,2,8,10,17,0,0,0,11,8,"","Nível 2","Nível 2","-","AGETOP",null,"PINTURA","-",null,1,"-",null,null,0,0,""]
["S",2,"S",0,10,17,0,0,0,0,0,"","Serviço","Serviço","-","SINAPI",88496,"APLICAÇÃO E LIXAMENTO DE MASSA LÁTEX EM TETO, DUAS DEMÃOS. AF_06/2014","M2",194.04,1,194.04,null,null,0,0,"Referência: AGETOP - 261300"]
["S",2,"S",0,10,17,0,0,0,0,0,"","Serviço","Serviço","-","SINAPI",88486,"APLICAÇÃO MANUAL DE PINTURA COM TINTA LÁTEX PVA EM TETO, DUAS DEMÃOS. AF_06/2014","M2",194.04,1,194.04,null,null,0,0,"Referência: AGETOP - 261307"]
["S",2,"S",0,10,17,0,0,0,0,0,"","Serviço","Serviço","-","SINAPI",88497,"APLICAÇÃO E LIXAMENTO DE MASSA LÁTEX EM PAREDES, DUAS DEMÃOS. AF_06/2014","M2",390.12,1,390.12,null,null,0,0,"Referência: AGETOP - 261300"]
["S",2,"S",0,10,17,0,0,0,0,0,"","Serviço","Serviço","-","SINAPI",88487,"APLICAÇÃO MANUAL DE PINTURA COM TINTA LÁTEX PVA EM PAREDES, DUAS DEMÃOS. AF_06/2014","M2",244.1,1,244.1,null,null,0,0,"Referência: AGETOP - 261000"]
["S",2,"S",0,10,17,0,0,0,0,0,"","Serviço","Serviço","-","AGETOP",261550,"PINT.ESMALTE SINT.PAREDES - 2 DEM.C/SELADOR","m2    ",146.02000000000001,1,146.02000000000001,null,null,0,0,""]
["S",2,"S",0,10,17,0,0,0,0,0,"","Serviço","Serviço","-","AGETOP",261602,"PINT.ESMALTE/ESQUAD.FERRO C/FUNDO ANTICOR.","m2    ",250.56,1,250.56,null,null,0,0,""]
["S",2,"S",0,10,17,0,0,0,0,0,"","Serviço","Serviço","-","AGETOP",261609,"PINTURA ESMALTE ALQUIDICO ESTR.METALICA 2 DEMAOS","m2    ",341.87,1,341.87,null,null,0,0,""]
[2,2,2,3,10,18,0,0,0,3,{"$error":"#N/A"},"","Nível 2","Nível 2","-","AGETOP",null,"DIVERSOS","-",null,1,"-",null,null,0,0,""]
["S",2,"S",0,10,18,0,0,0,0,0,"","Serviço","Serviço","-","AGETOP",270501,"LIMPEZA FINAL DE OBRA - (OBRAS CIVIS)","m2    ",268.33,1,268.33,null,null,0,0,""]
["S",2,"S",0,10,18,0,0,0,0,0,"","Serviço","Serviço","-","AGETOP",271210,"QUADRO DE GIZ EMBOÇO/PINTURA COMPLETO","m2    ",19.2,1,19.2,null,null,0,0,""]
[-1,null,-1,null,0,0,0,0,0,null,null,"F"]
[null,null,null,null,null,null,null,null,null,null,null,"F",null,null,null,null,null,"OBS: OS QUANTITATIVOS DE MATERIAIS  DAS INSTALAÇÕES HIDROSSANITÁRIAS, ELÉTRICAS E ESPECIAIS SÃO FORNECIDOS PELOS PROFISSIONAIS RESPONSÁVEIS PELOS RESPECTIVOS PROJETOS.",null,null,null,null,"VALOR TOTAL",null,null,0]
[null,null,null,null,null,null,null,null,null,null,null,"F",null,null,null,null,null,null,null,null,null,null,"VALOR BDI (26,40%)",null,null,0]
[null,null,null,null,null,null,null,null,null,null,null,"F",null,null,null,null,null,null,null,null,null,null,"TOTAL ORÇAMENTO",null,null,0]
[null,null,null,null,null,null,null,null,null,null,null,"F"]
[null,null,null,null,null,null,null,null,null,null,null,"F",null,null,null,null,null,null,null,null,null,null,"CUSTO POR M2 ³",null,null,0]
[null,null,null,null,null,null,null,null,null,null,null,"F",null,null,null,null,null,null,null,null,null,null,"MATERIAL S/ BDI",null,null,0]
[null,null,null,null,null,null,null,null,null,null,null,"F",null,null,null,null,null,null,null,null,null,null,"MÃO DE OBRA S/ BDI",null,null,0]
[null,null,null,null,null,null,null,null,null,null,null,"F"]
[null,null,null,null,null,null,null,null,null,null,null,"F",null,null,null,null,"(1) Conforme previsto pelo DECRETO Nº 7.983, DE 8 DE ABRIL DE 2013, os preços adotados são aqueles constantes dos sistemas de referência indicados. Justifica-se o uso dos preços destas composições de custos unitários devido ao seu valor ser menor à mediana de seus correspondentes na tabela SINAPI;"]
[null,null,null,null,null,null,null,null,null,null,null,"F",null,null,null,null,"(2) Optou-se pelo uso das composições de custos da AGETOP para itens não presentes na SINAPI;"]
[null,null,null,null,null,null,null,null,null,null,null,"F",null,null,null,null,"(3) Para itens da AGETOP, os vidros não estão inclusos nas esquadrias e já foram considerados os custos de contramarco para as esquadrias de alumínio;"]
[null,null,null,null,null,null,null,null,null,null,null,"F",null,null,null,null,"(4) Nos casos em que houver execução de granitina e omissão do item AGETOP 221102, considerou-se que o quantitativo para o rodapé, de altura igual a 7cm, foi incorporado na área de piso;"]
[null,null,null,null,null,null,null,null,null,null,null,"F",null,null,null,null,"(5) O custo unitário aproximado por metro quadrado é calculado dividindo-se o valor total do orçamento pela área total de construção."]
[null,null,null,null,null,null,null,null,null,null,null,"F"]
[null,null,null,null,null,null,null,null,null,null,null,"F"]
[]
[null,null,null,null,null,null,null,null,null,null,null,null,null,null,"SOMATÓRIO DE SERVIÇOS"]
[null,null,null,null,null,null,null,null,null,null,null,null,null,null,"ITEM","DESCRIÇÃO DOS SERVIÇOS",null,null,"PREÇO SEM BDI",null,null,null,null,"PREÇO COM BDI",null,null,"PARTICIPAÇÃO ( % )"]
[null,null,null,null,null,null,null,null,null,null,null,null,null,null,"a.","SERVIÇOS PRELIMINARES",null,null,{"$f":"SUMIF($R$19:$R$268,$P287,$Z$19:$Z$268)","v":0},null,null,null,null,{"$f":"ROUND(S287*(1+BDI.Taxa),2)","v":0},null,null,{"$f":"IFERROR(ROUND($X287*100/$Z$271,2),0)","v":0}]
[null,null,null,null,null,null,null,null,null,null,null,null,null,null,"b.","TRANSPORTES",null,null,0,null,null,null,null,0,null,null,0]
[null,null,null,null,null,null,null,null,null,null,null,null,null,null,"c.","SERVIÇO EM TERRA",null,null,0,null,null,null,null,0,null,null,0]
[null,null,null,null,null,null,null,null,null,null,null,null,null,null,"d.","FUNDAÇÕES E SONDAGENS",null,null,0,null,null,null,null,0,null,null,0]
[null,null,null,null,null,null,null,null,null,null,null,null,null,null,"e.","ESTRUTURA",null,null,0,null,null,null,null,0,null,null,0]
[null,null,null,null,null,null,null,null,null,null,null,null,null,null,"f.","INSTALAÇÕES ELÉTRICAS",null,null,0,null,null,null,null,0,null,null,0]
[null,null,null,null,null,null,null,null,null,null,null,null,null,null,"g.","INSTALAÇÕES HIDROSSANITÁRIAS",null,null,0,null,null,null,null,0,null,null,0]
[null,null,null,null,null,null,null,null,null,null,null,null,null,null,"h","INSTALAÇÕES ESPECIAIS",null,null,0,null,null,null,null,0,null,null,0]
[null,null,null,null,null,null,null,null,null,null,null,null,null,null,"i.","ALVENARIAS E DIVISÓRIAS",null,null,0,null,null,null,null,0,null,null,0]
[null,null,null,null,null,null,null,null,null,null,null,null,null,null,"j.","ALVENARIA AUTO-PORTANTE",null,null,0,null,null,null,null,0,null,null,0]
[null,null,null,null,null,null,null,null,null,null,null,null,null,null,"k.","IMPERMEABILIZAÇÃO",null,null,0,null,null,null,null,0,null,null,0]
[null,null,null,null,null,null,null,null,null,null,null,null,null,null,"l.","ISOLAMENTO TÉRMICO E ACÚSTICO",null,null,0,null,null,null,null,0,null,null,0]
[null,null,null,null,null,null,null,null,null,null,null,null,null,null,"m.","ESTRUTURA DE MADEIRA",null,null,0,null,null,null,null,0,null,null,0]
[null,null,null,null,null,null,null,null,null,null,null,null,null,null,"n.","ESTRUTURAS METÁLICAS",null,null,0,null,null,null,null,0,null,null,0]
[null,null,null,null,null,null,null,null,null,null,null,null,null,null,"o.","COBERTURAS",null,null,0,null,null,null,null,0,null,null,0]
[null,null,null,null,null,null,null,null,null,null,null,null,null,null,"p.","ESQUADRIAS DE MADEIRA",null,null,0,null,null,null,null,0,null,null,0]
[null,null,null,null,null,null,null,null,null,null,null,null,null,null,"q.","ESQUADRIAS METÁLICAS",null,null,0,null,null,null,null,{"$f":"ROUND(S303*(1+BDI.Taxa),2)","v":0},null,null,0]
[null,null,null,null,null,null,null,null,null,null,null,null,null,null,"r.","VIDROS",null,null,0,null,null,null,null,0,null,null,0]
[null,null,null,null,null,null,null,null,null,null,null,null,null,null,"s.","REVESTIMENTO DE PAREDE",null,null,0,null,null,null,null,0,null,null,0]
[null,null,null,null,null,null,null,null,null,null,null,null,null,null,"t.","FORROS",null,null,0,null,null,null,null,0,null,null,0]
[null,null,null,null,null,null,null,null,null,null,null,null,null,null,"u.","REVESTIMENTO DE PISO",null,null,0,null,null,null,null,0,null,null,0]
[null,null,null,null,null,null,null,null,null,null,null,null,null,null,"v.","FERRAGENS",null,null,0,null,null,null,null,0,null,null,0]
[null,null,null,null,null,null,null,null,null,null,null,null,null,null,"w.","MARCENARIA",null,null,0,null,null,null,null,0,null,null,0]
[null,null,null,null,null,null,null,null,null,null,null,null,null,null,"x.","ADMINISTRAÇÃO",null,null,0,null,null,null,null,0,null,null,0]
[null,null,null,null,null,null,null,null,null,null,null,null,null,null,"y.","PINTURA",null,null,0,null,null,null,null,{"$f":"ROUND(S311*(1+BDI.Taxa),2)","v":0},null,null,0]
[null,null,null,null,null,null,null,null,null,null,null,null,null,null,"z.","DIVERSOS",null,null,0,null,null,null,null,{"$f":"IF(S312>0,IF((SUM(X287:Y311)+ROUND(S312*(1+BDI.Taxa),2))<>X314,X314-SUM(X287:Y311),ROUND(S312*(1+BDI.Taxa),2)),0)","v":0},null,null,{"$f":"IF(S312>0,IF((SUM(AA287:AA311)+IFERROR(ROUND($X312*100/$Z$271,2),0))<>AA314,AA314-SUM(AA287:AA311),IFERROR(ROUND($X312*100/$Z$271,2),0)),0)","v":0}]
[null,null,null,null,null,null,null,null,null,null,null,null,null,null,"TOTAL GERAL DO ORÇAMENTO (R$)",null,null,null,{"$f":"SUM(S287:W312)","v":0},null,null,null,null,{"$f":"SUM(X287:Y312)","v":0},null,null,{"$f":"SUM(AA287:AA312)","v":0}]
[null,null,null,null,null,null,null,null,null,null,null,null,null,null,null,null,null,null,{"$f":"$Z$269","v":0},null,null,null,null,{"$f":"$Z$271","v":0},null,null,100]
[null,null,null,null,null,null,null,null,null,null,null,null,null,null,null,null,null,null,"(TOTAL SEM BDI)",null,null,null,null,"(TOTAL COM BDI)",null,null,"(ARRED porcentagem)"]
[null,null,null,null,null,null,null,null,null,null,null,null,null,null,null,null,null,null,{"$f":"IF(AND(S313=S314,S313>0),\"OK\",\"ERRO\")","v":"ERRO"},null,null,null,null,{"$f":"IF(AND(X313=X314,X313>0),\"OK\",\"ERRO\")","v":"ERRO"},null,null,{"$f":"IF(AA313=100,\"OK\",\"ERRO\")","v":"ERRO"}]
[]
[]
[null,null,null,null,null,null,null,null,null,null,null,null,null,null,"RESUMO GERAL DO ORÇAMENTO"]
[null,null,null,null,null,null,null,null,null,null,null,null,null,null,"ITEM","DESCRIÇÃO DOS SERVIÇOS",null,null,"PREÇO SEM BDI",null,null,null,null,"PREÇO COM BDI",null,null,"PARTICIPAÇÃO ( % )"]
[null,null,null,null,null,null,null,null,null,null,null,null,null,null,"1.",{"$f":"IFERROR(VLOOKUP(O321,$O$19:$Y$268,4,FALSE),\"\")","v":"1. PASSARELA COBERTA"},null,null,{"$f":"IF(P322=\"\",$S$342-SUM(OFFSET($S$320:S320,0,0,COUNTA($S$320:S320),1)),SUMIF($R$19:$R$268,$P321,$Z$19:$Z$268))","v":0},null,null,null,null,{"$f":"IF(P322=\"\",$X$342-SUM(OFFSET($X$320:X320,0,0,COUNTA($X$320:X320),1)),ROUND(S321*(1+BDI.Taxa),2))","v":0},null,null,{"$f":"IF(P322=\"\",$AA$342-SUM(OFFSET($AA$320:AA320,0,0,COUNTA($AA$320:AA320),1)),ROUND(X321*100/ORÇAMENTO.TotalOrçamento,2))","v":{"$error":"#DIV/0!"}}]
[null,null,null,null,null,null,null,null,null,null,null,null,null,null,"2.","2. IMPLANTAÇÃO: BLOCO 03 SALAS",null,null,{"$f":"IF(P323=\"\",$S$342-SUM(OFFSET($S$320:S321,0,0,COUNTA($S$320:S321),1)),SUMIF($R$19:$R$268,$P322,$Z$19:$Z$268))","v":0},null,null,null,null,{"$f":"IF(P323=\"\",$X$342-SUM(OFFSET($X$320:X321,0,0,COUNTA($X$320:X321),1)),ROUND(S322*(1+BDI.Taxa),2))","v":0},null,null,{"$f":"IF(P323=\"\",$AA$342-SUM(OFFSET($AA$320:AA321,0,0,COUNTA($AA$320:AA321),1)),ROUND(X322*100/ORÇAMENTO.TotalOrçamento,2))","v":{"$error":"#DIV/0!"}}]
[null,null,null,null,null,null,null,null,null,null,null,null,null,null,"3.","3. CALÇADA DE PROTEÇÃO",null,null,{"$f":"IF(P324=\"\",$S$342-SUM(OFFSET($S$320:S322,0,0,COUNTA($S$320:S322),1)),SUMIF($R$19:$R$268,$P323,$Z$19:$Z$268))","v":0},null,null,null,null,{"$f":"IF(P324=\"\",$X$342-SUM(OFFSET($X$320:X322,0,0,COUNTA($X$320:X322),1)),ROUND(S323*(1+BDI.Taxa),2))","v":0},null,null,{"$f":"IF(P324=\"\",$AA$342-SUM(OFFSET($AA$320:AA322,0,0,COUNTA($AA$320:AA322),1)),ROUND(X323*100/ORÇAMENTO.TotalOrçamento,2))","v":{"$error":"#DIV/0!"}}]
[null,null,null,null,null,null,null,null,null,null,null,null,null,null,"4.","4. MURO",null,null,{"$f":"IF(P325=\"\",$S$342-SUM(OFFSET($S$320:S323,0,0,COUNTA($S$320:S323),1)),SUMIF($R$19:$R$268,$P324,$Z$19:$Z$268))","v":0},null,null,null,null,{"$f":"IF(P325=\"\",$X$342-SUM(OFFSET($X$320:X323,0,0,COUNTA($X$320:X323),1)),ROUND(S324*(1+BDI.Taxa),2))","v":0},null,null,{"$f":"IF(P325=\"\",$AA$342-SUM(OFFSET($AA$320:AA323,0,0,COUNTA($AA$320:AA323),1)),ROUND(X324*100/ORÇAMENTO.TotalOrçamento,2))","v":{"$error":"#DIV/0!"}}]
[null,null,null,null,null,null,null,null,null,null,null,null,null,null,"5.","ADMINISTRAÇÃO LOCAL",null,null,{"$f":"IF(P326=\"\",$S$342-SUM(OFFSET($S$320:S324,0,0,COUNTA($S$320:S324),1)),SUMIF($R$19:$R$268,$P325,$Z$19:$Z$268))","v":0},null,null,null,null,{"$f":"IF(P326=\"\",$X$342-SUM(OFFSET($X$320:X324,0,0,COUNTA($X$320:X324),1)),ROUND(S325*(1+BDI.Taxa),2))","v":0},null,null,{"$f":"IF(P326=\"\",$AA$342-SUM(OFFSET($AA$320:AA324,0,0,COUNTA($AA$320:AA324),1)),ROUND(X325*100/ORÇAMENTO.TotalOrçamento,2))","v":{"$error":"#DIV/0!"}}]
[null,null,null,null,null,null,null,null,null,null,null,null,null,null,"6.","OBRA",null,null,{"$f":"IF(P327=\"\",$S$342-SUM(OFFSET($S$320:S325,0,0,COUNTA($S$320:S325),1)),SUMIF($R$19:$R$268,$P326,$Z$19:$Z$268))","v":0},null,null,null,null,{"$f":"IF(P327=\"\",$X$342-SUM(OFFSET($X$320:X325,0,0,COUNTA($X$320:X325),1)),ROUND(S326*(1+BDI.Taxa),2))","v":0},null,null,{"$f":"IF(P327=\"\",$AA$342-SUM(OFFSET($AA$320:AA325,0,0,COUNTA($AA$320:AA325),1)),ROUND(X326*100/ORÇAMENTO.TotalOrçamento,2))","v":{"$error":"#DIV/0!"}}]
[null,null,null,null,null,null,null,null,null,null,null,null,null,null,"7.","PROJETO ESTRUTURAL",null,null,{"$f":"IF(P328=\"\",$S$342-SUM(OFFSET($S$320:S326,0,0,COUNTA($S$320:S326),1)),SUMIF($R$19:$R$268,$P327,$Z$19:$Z$268))","v":0},null,null,null,null,{"$f":"IF(P328=\"\",$X$342-SUM(OFFSET($X$320:X326,0,0,COUNTA($X$320:X326),1)),ROUND(S327*(1+BDI.Taxa),2))","v":0},null,null,{"$f":"IF(P328=\"\",$AA$342-SUM(OFFSET($AA$320:AA326,0,0,COUNTA($AA$320:AA326),1)),ROUND(X327*100/ORÇAMENTO.TotalOrçamento,2))","v":{"$error":"#DIV/0!"}}]
[null,null,null,null,null,null,null,null,null,null,null,null,null,null,"8.","PROJETO ESTRUTURAS METÁLICAS",null,null,{"$f":"IF(P329=\"\",$S$342-SUM(OFFSET($S$320:S327,0,0,COUNTA($S$320:S327),1)),SUMIF($R$19:$R$268,$P328,$Z$19:$Z$268))","v":0},null,null,null,null,{"$f":"IF(P329=\"\",$X$342-SUM(OFFSET($X$320:X327,0,0,COUNTA($X$320:X327),1)),ROUND(S328*(1+BDI.Taxa),2))","v":0},null,null,{"$f":"IF(P329=\"\",$AA$342-SUM(OFFSET($AA$320:AA327,0,0,COUNTA($AA$320:AA327),1)),ROUND(X328*100/ORÇAMENTO.TotalOrçamento,2))","v":{"$error":"#DIV/0!"}}]
[null,null,null,null,null,null,null,null,null,null,null,null,null,null,"9.","PROJETO ELÉTRICO",null,null,{"$f":"IF(P330=\"\",$S$342-SUM(OFFSET($S$320:S328,0,0,COUNTA($S$320:S328),1)),SUMIF($R$19:$R$268,$P329,$Z$19:$Z$268))","v":0},null,null,null,null,{"$f":"IF(P330=\"\",$X$342-SUM(OFFSET($X$320:X328,0,0,COUNTA($X$320:X328),1)),ROUND(S329*(1+BDI.Taxa),2))","v":0},null,null,{"$f":"IF(P330=\"\",$AA$342-SUM(OFFSET($AA$320:AA328,0,0,COUNTA($AA$320:AA328),1)),ROUND(X329*100/ORÇAMENTO.TotalOrçamento,2))","v":{"$error":"#DIV/0!"}}]
[null,null,null,null,null,null,null,null,null,null,null,null,null,null,"10.","4 SALAS DE AULA - PADRÃO LAJE PLANA",null,null,{"$f":"IF(P331=\"\",$S$342-SUM(OFFSET($S$320:S329,0,0,COUNTA($S$320:S329),1)),SUMIF($R$19:$R$268,$P330,$Z$19:$Z$268))","v":0},null,null,null,null,{"$f":"IF(P331=\"\",$X$342-SUM(OFFSET($X$320:X329,0,0,COUNTA($X$320:X329),1)),ROUND(S330*(1+BDI.Taxa),2))","v":0},null,null,{"$f":"IF(P331=\"\",$AA$342-SUM(OFFSET($AA$320:AA329,0,0,COUNTA($AA$320:AA329),1)),ROUND(X330*100/ORÇAMENTO.TotalOrçamento,2))","v":{"$error":"#DIV/0!"}}]
[null,null,null,null,null,null,null,null,null,null,null,null,null,null,"11.","",null,null,{"$f":"IF(P332=\"\",$S$342-SUM(OFFSET($S$320:S330,0,0,COUNTA($S$320:S330),1)),SUMIF($R$19:$R$268,$P331,$Z$19:$Z$268))","v":0},null,null,null,null,{"$f":"IF(P332=\"\",$X$342-SUM(OFFSET($X$320:X330,0,0,COUNTA($X$320:X330),1)),ROUND(S331*(1+BDI.Taxa),2))","v":0},null,null,{"$f":"IF(P332=\"\",$AA$342-SUM(OFFSET($AA$320:AA330,0,0,COUNTA($AA$320:AA330),1)),ROUND(X331*100/ORÇAMENTO.TotalOrçamento,2))","v":{"$error":"#DIV/0!"}}]
[null,null,null,null,null,null,null,null,null,null,null,null,null,null,"12.","",null,null,{"$f":"IF(P333=\"\",$S$342-SUM(OFFSET($S$320:S331,0,0,COUNTA($S$320:S331),1)),SUMIF($R$19:$R$268,$P332,$Z$19:$Z$268))","v":0},null,null,null,null,{"$f":"IF(P333=\"\",$X$342-SUM(OFFSET($X$320:X331,0,0,COUNTA($X$320:X331),1)),ROUND(S332*(1+BDI.Taxa),2))","v":0},null,null,{"$f":"IF(P333=\"\",$AA$342-SUM(OFFSET($AA$320:AA331,0,0,COUNTA($AA$320:AA331),1)),ROUND(X332*100/ORÇAMENTO.TotalOrçamento,2))","v":{"$error":"#DIV/0!"}}]
[null,null,null,null,null,null,null,null,null,null,null,null,null,null,"13.","",null,null,{"$f":"IF(P334=\"\",$S$342-SUM(OFFSET($S$320:S332,0,0,COUNTA($S$320:S332),1)),SUMIF($R$19:$R$268,$P333,$Z$19:$Z$268))","v":0},null,null,null,null,{"$f":"IF(P334=\"\",$X$342-SUM(OFFSET($X$320:X332,0,0,COUNTA($X$320:X332),1)),ROUND(S333*(1+BDI.Taxa),2))","v":0},null,null,{"$f":"IF(P334=\"\",$AA$342-SUM(OFFSET($AA$320:AA332,0,0,COUNTA($AA$320:AA332),1)),ROUND(X333*100/ORÇAMENTO.TotalOrçamento,2))","v":{"$error":"#DIV/0!"}}]
[null,null,null,null,null,null,null,null,null,null,null,null,null,null,"14.","",null,null,{"$f":"IF(P335=\"\",$S$342-SUM(OFFSET($S$320:S333,0,0,COUNTA($S$320:S333),1)),SUMIF($R$19:$R$268,$P334,$Z$19:$Z$268))","v":0},null,null,null,null,{"$f":"IF(P335=\"\",$X$342-SUM(OFFSET($X$320:X333,0,0,COUNTA($X$320:X333),1)),ROUND(S334*(1+BDI.Taxa),2))","v":0},null,null,{"$f":"IF(P335=\"\",$AA$342-SUM(OFFSET($AA$320:AA333,0,0,COUNTA($AA$320:AA333),1)),ROUND(X334*100/ORÇAMENTO.TotalOrçamento,2))","v":{"$error":"#DIV/0!"}}]
[null,null,null,null,null,null,null,null,null,null,null,null,null,null,"15.","",null,null,{"$f":"IF(P336=\"\",$S$342-SUM(OFFSET($S$320:S334,0,0,COUNTA($S$320:S334),1)),SUMIF($R$19:$R$268,$P335,$Z$19:$Z$268))","v":0},null,null,null,null,{"$f":"IF(P336=\"\",$X$342-SUM(OFFSET($X$320:X334,0,0,COUNTA($X$320:X334),1)),ROUND(S335*(1+BDI.Taxa),2))","v":0},null,null,{"$f":"IF(P336=\"\",$AA$342-SUM(OFFSET($AA$320:AA334,0,0,COUNTA($AA$320:AA334),1)),ROUND(X335*100/ORÇAMENTO.TotalOrçamento,2))","v":{"$error":"#DIV/0!"}}]
[null,null,null,null,null,null,null,null,null,null,null,null,null,null,"16.","",null,null,{"$f":"IF(P337=\"\",$S$342-SUM(OFFSET($S$320:S335,0,0,COUNTA($S$320:S335),1)),SUMIF($R$19:$R$268,$P336,$Z$19:$Z$268))","v":0},null,null,null,null,{"$f":"IF(P337=\"\",$X$342-SUM(OFFSET($X$320:X335,0,0,COUNTA($X$320:X335),1)),ROUND(S336*(1+BDI.Taxa),2))","v":0},null,null,{"$f":"IF(P337=\"\",$AA$342-SUM(OFFSET($AA$320:AA335,0,0,COUNTA($AA$320:AA335),1)),ROUND(X336*100/ORÇAMENTO.TotalOrçamento,2))","v":{"$error":"#DIV/0!"}}]
[null,null,null,null,null,null,null,null,null,null,null,null,null,null,"17.","",null,null,{"$f":"IF(P338=\"\",$S$342-SUM(OFFSET($S$320:S336,0,0,COUNTA($S$320:S336),1)),SUMIF($R$19:$R$268,$P337,$Z$19:$Z$268))","v":0},null,null,null,null,{"$f":"IF(P338=\"\",$X$342-SUM(OFFSET($X$320:X336,0,0,COUNTA($X$320:X336),1)),ROUND(S337*(1+BDI.Taxa),2))","v":0},null,null,{"$f":"IF(P338=\"\",$AA$342-SUM(OFFSET($AA$320:AA336,0,0,COUNTA($AA$320:AA336),1)),ROUND(X337*100/ORÇAMENTO.TotalOrçamento,2))","v":{"$error":"#DIV/0!"}}]
[null,null,null,null,null,null,null,null,null,null,null,null,null,null,"18.","",null,null,{"$f":"IF(P339=\"\",$S$342-SUM(OFFSET($S$320:S337,0,0,COUNTA($S$320:S337),1)),SUMIF($R$19:$R$268,$P338,$Z$19:$Z$268))","v":0},null,null,null,null,{"$f":"IF(P339=\"\",$X$342-SUM(OFFSET($X$320:X337,0,0,COUNTA($X$320:X337),1)),ROUND(S338*(1+BDI.Taxa),2))","v":0},null,null,{"$f":"IF(P339=\"\",$AA$342-SUM(OFFSET($AA$320:AA337,0,0,COUNTA($AA$320:AA337),1)),ROUND(X338*100/ORÇAMENTO.TotalOrçamento,2))","v":{"$error":"#DIV/0!"}}]
[null,null,null,null,null,null,null,null,null,null,null,null,null,null,"19.","",null,null,{"$f":"IF(P340=\"\",$S$342-SUM(OFFSET($S$320:S338,0,0,COUNTA($S$320:S338),1)),SUMIF($R$19:$R$268,$P339,$Z$19:$Z$268))","v":0},null,null,null,null,{"$f":"IF(P340=\"\",$X$342-SUM(OFFSET($X$320:X338,0,0,COUNTA($X$320:X338),1)),ROUND(S339*(1+BDI.Taxa),2))","v":0},null,null,{"$f":"IF(P340=\"\",$AA$342-SUM(OFFSET($AA$320:AA338,0,0,COUNTA($AA$320:AA338),1)),ROUND(X339*100/ORÇAMENTO.TotalOrçamento,2))","v":{"$error":"#DIV/0!"}}]
[null,null,null,null,null,null,null,null,null,null,null,null,null,null,"20.","",null,null,{"$f":"IF(P341=\"\",$S$342-SUM(OFFSET($S$320:S339,0,0,COUNTA($S$320:S339),1)),SUMIF($R$19:$R$268,$P340,$Z$19:$Z$268))","v":0},null,null,null,null,{"$f":"IF(P341=\"\",$X$342-SUM(OFFSET($X$320:X339,0,0,COUNTA($X$320:X339),1)),ROUND(S340*(1+BDI.Taxa),2))","v":0},null,null,{"$f":"IF(P341=\"\",$AA$342-SUM(OFFSET($AA$320:AA339,0,0,COUNTA($AA$320:AA339),1)),ROUND(X340*100/ORÇAMENTO.TotalOrçamento,2))","v":{"$error":"#DIV/0!"}}]
[null,null,null,null,null,null,null,null,null,null,null,null,null,null,"TOTAL GERAL DO ORÇAMENTO (R$)",null,null,null,{"$f":"SUM(S321:W340)","v":0},null,null,null,null,{"$f":"SUM(X321:Y340)","v":0},null,null,{"$f":"SUM(AA321:AA340)","v":{"$error":"#DIV/0!"}}]
[null,null,null,null,null,null,null,null,null,null,null,null,null,null,null,null,null,null,{"$f":"$Z$269","v":0},null,null,null,null,{"$f":"$Z$271","v":0},null,null,100]
[null,null,null,null,null,null,null,null,null,null,null,null,null,null,null,null,null,null,"(TOTAL SEM BDI)",null,null,null,null,"(TOTAL COM BDI)",null,null,"(ARRED porcentagem)"]
[null,null,null,null,null,null,null,null,null,null,null,null,null,null,null,null,null,null,{"$f":"IF(AND(S341=S342,S341>0),\"OK\",\"ERRO\")","v":"ERRO"},null,null,null,null,{"$f":"IF(AND(X341=X342,X341>0),\"OK\",\"ERRO\")","v":"ERRO"},null,null,{"$f":"IF(AND(AA341=100,S321<>0),\"OK\",\"ERRO\")","v":{"$error":"#DIV/0!"}}]

{"sheet":"Resumo ","index":1,"n_rows":39,"n_cols":9,"rows_kept":39,"cut":false,"hidden":false,"merged":[[13,0,14,0],[15,2,15,5],[16,2,16,5],[17,2,17,5],[18,2,18,5],[14,1,14,8],[0,1,0,8],[36,1,36,5],[2,1,2,5],[3,1,3,5],[5,1,5,5],[6,1,6,5],[8,1,8,5],[9,1,9,5],[11,3,11,5],[12,3,12,5],[10,1,10,8],[11,6,11,8],[12,6,12,8],[19,2,19,5],[20,2,20,5],[21,2,21,5],[31,2,31,5],[1,1,1,8],[2,6,2,8],[3,6,3,8],[4,1,4,8],[5,6,5,8],[6,6,6,8],[7,1,7,8],[8,6,8,8],[9,6,9,8],[13,1,13,8],[11,1,11,2],[12,1,12,2],[42,3,42,7],[41,3,41,7],[38,1,38,8],[22,2,22,5],[23,2,23,5],[24,2,24,5],[25,2,25,5],[26,2,26,5],[32,2,32,5],[33,2,33,5],[34,2,34,5],[35,2,35,5],[27,2,27,5],[28,2,28,5],[29,2,29,5],[30,2,30,5]]}
[]
[]
[null,"UNIDADE ESCOLAR",null,null,null,null,"CÓDIGO INEP"]
[null,{"$f":"Orçamento!$O$4","v":"ESCOLA ESTADUAL VICENÇA MARIA DE JESUS"},null,null,null,null,{"$f":"Orçamento!X4","v":52017362}]
[]
[null,"OBRA",null,null,null,null,"CIDADE"]
[null,{"$f":"Orçamento!$O$7","v":"REFORMA E AMPLIAÇÃO"},null,null,null,null,{"$f":"Orçamento!$X$7","v":"ITAPACI"}]
[]
[null,"ENDEREÇO",null,null,null,null,"CRE"]
[null,{"$f":"Orçamento!$R$10","v":" RUA PRINCIPAL S/N , VILA SANTANA , CEP:76360-000"},null,null,null,null,{"$f":"Orçamento!$O$10","v":"CRE-ITAPACI"}]
[]
[null,"REFERÊNCIA",null,"DATA",null,null,"ÁREA TOTAL CONSTRUÍDA (M²)"]
[null,{"$f":"CONCATENATE(\"AGETOP E SINAPI - \",Orçamento!$T$10)","v":"AGETOP E SINAPI - DESONERADA"},null,{"$f":"Orçamento!$S$7","v":"2020-06-17"},null,null,{"$f":"Orçamento!$X$13","v":619.86}]
["FILTRO"]
[null,"RESUMO GERAL DO ORÇAMENTO"]
["↓","ITEM","DESCRIÇÃO DOS SERVIÇOS",null,null,null,"PREÇO SEM BDI","PREÇO COM BDI","PARTICIP. (%)"]
[{"$f":"IF(G17>0,\"F\",\"\")","v":""},"1.",{"$f":"Orçamento!$P321","v":"1. PASSARELA COBERTA"},null,null,null,{"$f":"IFERROR(Orçamento!S321,\"-\")","v":0},{"$f":"IFERROR(Orçamento!X321,\"\")","v":0},{"$f":"Orçamento!AA321","v":{"$error":"#DIV/0!"}}]
[{"$f":"IF(G18>0,\"F\",\"\")","v":""},"2.",{"$f":"Orçamento!$P322","v":"2. IMPLANTAÇÃO: BLOCO 03 SALAS"},null,null,null,{"$f":"IFERROR(Orçamento!S322,\"-\")","v":0},{"$f":"IFERROR(Orçamento!X322,\"\")","v":0},{"$f":"Orçamento!AA322","v":{"$error":"#DIV/0!"}}]
["","3.",{"$f":"Orçamento!$P323","v":"3. CALÇADA DE PROTEÇÃO"},null,null,null,{"$f":"IFERROR(Orçamento!S323,\"-\")","v":0},{"$f":"IFERROR(Orçamento!X323,\"\")","v":0},{"$f":"Orçamento!AA323","v":{"$error":"#DIV/0!"}}]
["","4.",{"$f":"Orçamento!$P324","v":"4. MURO"},null,null,null,{"$f":"IFERROR(Orçamento!S324,\"-\")","v":0},{"$f":"IFERROR(Orçamento!X324,\"\")","v":0},{"$f":"Orçamento!AA324","v":{"$error":"#DIV/0!"}}]
["","5.",{"$f":"Orçamento!$P325","v":"ADMINISTRAÇÃO LOCAL"},null,null,null,{"$f":"IFERROR(Orçamento!S325,\"-\")","v":0},{"$f":"IFERROR(Orçamento!X325,\"\")","v":0},{"$f":"Orçamento!AA325","v":{"$error":"#DIV/0!"}}]
["","6.",{"$f":"Orçamento!$P326","v":"OBRA"},null,null,null,{"$f":"IFERROR(Orçamento!S326,\"-\")","v":0},{"$f":"IFERROR(Orçamento!X326,\"\")","v":0},{"$f":"Orçamento!AA326","v":{"$error":"#DIV/0!"}}]
["","7.",{"$f":"Orçamento!$P327","v":"PROJETO ESTRUTURAL"},null,null,null,{"$f":"IFERROR(Orçamento!S327,\"-\")","v":0},{"$f":"IFERROR(Orçamento!X327,\"\")","v":0},{"$f":"Orçamento!AA327","v":{"$error":"#DIV/0!"}}]
["","8.",{"$f":"Orçamento!$P328","v":"PROJETO ESTRUTURAS METÁLICAS"},null,null,null,{"$f":"IFERROR(Orçamento!S328,\"-\")","v":0},{"$f":"IFERROR(Orçamento!X328,\"\")","v":0},{"$f":"Orçamento!AA328","v":{"$error":"#DIV/0!"}}]
["","9.",{"$f":"Orçamento!$P329","v":"PROJETO ELÉTRICO"},null,null,null,{"$f":"IFERROR(Orçamento!S329,\"-\")","v":0},{"$f":"IFERROR(Orçamento!X329,\"\")","v":0},{"$f":"Orçamento!AA329","v":{"$error":"#DIV/0!"}}]
["","10.",{"$f":"Orçamento!$P330","v":"4 SALAS DE AULA - PADRÃO LAJE PLANA"},null,null,null,{"$f":"IFERROR(Orçamento!S330,\"-\")","v":0},{"$f":"IFERROR(Orçamento!X330,\"\")","v":0},{"$f":"Orçamento!AA330","v":{"$error":"#DIV/0!"}}]
["","11.",{"$f":"Orçamento!$P331","v":""},null,null,null,{"$f":"IFERROR(Orçamento!S331,\"-\")","v":0},{"$f":"IFERROR(Orçamento!X331,\"\")","v":0},{"$f":"Orçamento!AA331","v":{"$error":"#DIV/0!"}}]
["","12.",{"$f":"Orçamento!$P332","v":""},null,null,null,{"$f":"IFERROR(Orçamento!S332,\"-\")","v":0},{"$f":"IFERROR(Orçamento!X332,\"\")","v":0},{"$f":"Orçamento!AA332","v":{"$error":"#DIV/0!"}}]
["","13.",{"$f":"Orçamento!$P333","v":""},null,null,null,{"$f":"IFERROR(Orçamento!S333,\"-\")","v":0},{"$f":"IFERROR(Orçamento!X333,\"\")","v":0},{"$f":"Orçamento!AA333","v":{"$error":"#DIV/0!"}}]
["","14.",{"$f":"Orçamento!$P334","v":""},null,null,null,{"$f":"IFERROR(Orçamento!S334,\"-\")","v":0},{"$f":"IFERROR(Orçamento!X334,\"\")","v":0},{"$f":"Orçamento!AA334","v":{"$error":"#DIV/0!"}}]
["","15.",{"$f":"Orçamento!$P335","v":""},null,null,null,{"$f":"IFERROR(Orçamento!S335,\"-\")","v":0},{"$f":"IFERROR(Orçamento!X335,\"\")","v":0},{"$f":"Orçamento!AA335","v":{"$error":"#DIV/0!"}}]
["","16.",{"$f":"Orçamento!$P336","v":""},null,null,null,{"$f":"IFERROR(Orçamento!S336,\"-\")","v":0},{"$f":"IFERROR(Orçamento!X336,\"\")","v":0},{"$f":"Orçamento!AA336","v":{"$error":"#DIV/0!"}}]
["","17.",{"$f":"Orçamento!$P337","v":""},null,null,null,{"$f":"IFERROR(Orçamento!S337,\"-\")","v":0},{"$f":"IFERROR(Orçamento!X337,\"\")","v":0},{"$f":"Orçamento!AA337","v":{"$error":"#DIV/0!"}}]
["","18.",{"$f":"Orçamento!$P338","v":""},null,null,null,{"$f":"IFERROR(Orçamento!S338,\"-\")","v":0},{"$f":"IFERROR(Orçamento!X338,\"\")","v":0},{"$f":"Orçamento!AA338","v":{"$error":"#DIV/0!"}}]
["","19.",{"$f":"Orçamento!$P339","v":""},null,null,null,{"$f":"IFERROR(Orçamento!S339,\"-\")","v":0},{"$f":"IFERROR(Orçamento!X339,\"\")","v":0},{"$f":"Orçamento!AA339","v":{"$error":"#DIV/0!"}}]
["","20.",{"$f":"Orçamento!$P340","v":""},null,null,null,{"$f":"IFERROR(Orçamento!S340,\"-\")","v":0},{"$f":"IFERROR(Orçamento!X340,\"\")","v":0},{"$f":"Orçamento!AA340","v":{"$error":"#DIV/0!"}}]
["F","TOTAL GERAL DO ORÇAMENTO (R$)",null,null,null,null,{"$f":"SUM(G17:G36)","v":0},{"$f":"SUM(H17:H36)","v":0},{"$f":"SUM(I17:I36)","v":{"$error":"#DIV/0!"}}]
["F"]
["F"]

{"sheet":"Somatório","index":2,"n_rows":45,"n_cols":6,"rows_kept":45,"cut":false,"hidden":false,"merged":[[13,0,14,0],[42,1,42,2],[44,1,44,5],[47,3,47,5],[48,3,48,5],[13,1,13,5],[9,1,9,3],[9,4,9,5],[11,1,11,2],[11,4,11,5],[12,1,12,2],[12,4,12,5],[0,1,0,5],[14,1,14,5],[2,1,2,3],[2,4,2,5],[3,1,3,3],[3,4,3,5],[5,1,5,3],[5,4,5,5],[6,1,6,3],[6,4,6,5],[8,1,8,3],[8,4,8,5],[1,1,1,5],[4,1,4,5],[7,1,7,5],[10,1,10,5]]}
[]
[]
[null,"UNIDADE ESCOLAR",null,null,"CÓDIGO INEP"]
[null,{"$f":"Orçamento!$O$4","v":"ESCOLA ESTADUAL VICENÇA MARIA DE JESUS"},null,null,{"$f":"Orçamento!X4","v":52017362}]
[]
[null,"OBRA",null,null,"CIDADE"]
[null,{"$f":"Orçamento!$O$7","v":"REFORMA E AMPLIAÇÃO"},null,null,{"$f":"Orçamento!$X$7","v":"ITAPACI"}]
[]
[null,"ENDEREÇO",null,null,"CRE"]
[null,{"$f":"Orçamento!$R$10","v":" RUA PRINCIPAL S/N , VILA SANTANA , CEP:76360-000"},null,null,{"$f":"Orçamento!$O$10","v":"CRE-ITAPACI"}]
[]
[null,"REFERÊNCIA",null,"DATA","ÁREA TOTAL CONSTRUÍDA (M²)"]
[null,{"$f":"CONCATENATE(\"AGETOP E SINAPI - \",Orçamento!$T$10)","v":"AGETOP E SINAPI - DESONERADA"},null,{"$f":"Orçamento!$S$7","v":"2020-06-17"},{"$f":"Orçamento!$X$13","v":619.86}]
["FILTRO"]
[null,"SOMATÓRIO DE SERVIÇOS"]
["↓","ITEM","DESCRIÇÃO DOS SERVIÇOS","PREÇO SEM BDI (R$)","PREÇO COM BDI (R$)","PARTIC.  ( % )"]
[{"$f":"IF(D17>0,\"F\",\"\")","v":""},"a.",{"$f":"Orçamento!P287","v":"SERVIÇOS PRELIMINARES"},{"$f":"Orçamento!S287","v":0},{"$f":"Orçamento!X287","v":0},{"$f":"Orçamento!AA287","v":0}]
[{"$f":"IF(D18>0,\"F\",\"\")","v":""},"b.",{"$f":"Orçamento!P288","v":"TRANSPORTES"},{"$f":"Orçamento!S288","v":0},{"$f":"Orçamento!X288","v":0},{"$f":"Orçamento!AA288","v":0}]
["","c.",{"$f":"Orçamento!P289","v":"SERVIÇO EM TERRA"},{"$f":"Orçamento!S289","v":0},{"$f":"Orçamento!X289","v":0},{"$f":"Orçamento!AA289","v":0}]
["","d.",{"$f":"Orçamento!P290","v":"FUNDAÇÕES E SONDAGENS"},{"$f":"Orçamento!S290","v":0},{"$f":"Orçamento!X290","v":0},{"$f":"Orçamento!AA290","v":0}]
["","e.",{"$f":"Orçamento!P291","v":"ESTRUTURA"},{"$f":"Orçamento!S291","v":0},{"$f":"Orçamento!X291","v":0},{"$f":"Orçamento!AA291","v":0}]
["","f.",{"$f":"Orçamento!P292","v":"INSTALAÇÕES ELÉTRICAS"},{"$f":"Orçamento!S292","v":0},{"$f":"Orçamento!X292","v":0},{"$f":"Orçamento!AA292","v":0}]
["","g.",{"$f":"Orçamento!P293","v":"INSTALAÇÕES HIDROSSANITÁRIAS"},{"$f":"Orçamento!S293","v":0},{"$f":"Orçamento!X293","v":0},{"$f":"Orçamento!AA293","v":0}]
["","h",{"$f":"Orçamento!P294","v":"INSTALAÇÕES ESPECIAIS"},{"$f":"Orçamento!S294","v":0},{"$f":"Orçamento!X294","v":0},{"$f":"Orçamento!AA294","v":0}]
["","i.",{"$f":"Orçamento!P295","v":"ALVENARIAS E DIVISÓRIAS"},{"$f":"Orçamento!S295","v":0},{"$f":"Orçamento!X295","v":0},{"$f":"Orçamento!AA295","v":0}]
["","j.",{"$f":"Orçamento!P296","v":"ALVENARIA AUTO-PORTANTE"},{"$f":"Orçamento!S296","v":0},{"$f":"Orçamento!X296","v":0},{"$f":"Orçamento!AA296","v":0}]
["","k.",{"$f":"Orçamento!P297","v":"IMPERMEABILIZAÇÃO"},{"$f":"Orçamento!S297","v":0},{"$f":"Orçamento!X297","v":0},{"$f":"Orçamento!AA297","v":0}]
["","l.",{"$f":"Orçamento!P298","v":"ISOLAMENTO TÉRMICO E ACÚSTICO"},{"$f":"Orçamento!S298","v":0},{"$f":"Orçamento!X298","v":0},{"$f":"Orçamento!AA298","v":0}]
["","m.",{"$f":"Orçamento!P299","v":"ESTRUTURA DE MADEIRA"},{"$f":"Orçamento!S299","v":0},{"$f":"Orçamento!X299","v":0},{"$f":"Orçamento!AA299","v":0}]
["","n.",{"$f":"Orçamento!P300","v":"ESTRUTURAS METÁLICAS"},{"$f":"Orçamento!S300","v":0},{"$f":"Orçamento!X300","v":0},{"$f":"Orçamento!AA300","v":0}]
["","o.",{"$f":"Orçamento!P301","v":"COBERTURAS"},{"$f":"Orçamento!S301","v":0},{"$f":"Orçamento!X301","v":0},{"$f":"Orçamento!AA301","v":0}]
["","p.",{"$f":"Orçamento!P302","v":"ESQUADRIAS DE MADEIRA"},{"$f":"Orçamento!S302","v":0},{"$f":"Orçamento!X302","v":0},{"$f":"Orçamento!AA302","v":0}]
["","q.",{"$f":"Orçamento!P303","v":"ESQUADRIAS METÁLICAS"},{"$f":"Orçamento!S303","v":0},{"$f":"Orçamento!X303","v":0},{"$f":"Orçamento!AA303","v":0}]
["","r.",{"$f":"Orçamento!P304","v":"VIDROS"},{"$f":"Orçamento!S304","v":0},{"$f":"Orçamento!X304","v":0},{"$f":"Orçamento!AA304","v":0}]
["","s.",{"$f":"Orçamento!P305","v":"REVESTIMENTO DE PAREDE"},{"$f":"Orçamento!S305","v":0},{"$f":"Orçamento!X305","v":0},{"$f":"Orçamento!AA305","v":0}]
["","t.",{"$f":"Orçamento!P306","v":"FORROS"},{"$f":"Orçamento!S306","v":0},{"$f":"Orçamento!X306","v":0},{"$f":"Orçamento!AA306","v":0}]
["","u.",{"$f":"Orçamento!P307","v":"REVESTIMENTO DE PISO"},{"$f":"Orçamento!S307","v":0},{"$f":"Orçamento!X307","v":0},{"$f":"Orçamento!AA307","v":0}]
["","v.",{"$f":"Orçamento!P308","v":"FERRAGENS"},{"$f":"Orçamento!S308","v":0},{"$f":"Orçamento!X308","v":0},{"$f":"Orçamento!AA308","v":0}]
["","w.",{"$f":"Orçamento!P309","v":"MARCENARIA"},{"$f":"Orçamento!S309","v":0},{"$f":"Orçamento!X309","v":0},{"$f":"Orçamento!AA309","v":0}]
["","x.",{"$f":"Orçamento!P310","v":"ADMINISTRAÇÃO"},{"$f":"Orçamento!S310","v":0},{"$f":"Orçamento!X310","v":0},{"$f":"Orçamento!AA310","v":0}]
["","y.",{"$f":"Orçamento!P311","v":"PINTURA"},{"$f":"Orçamento!S311","v":0},{"$f":"Orçamento!X311","v":0},{"$f":"Orçamento!AA311","v":0}]
["","z.",{"$f":"Orçamento!P312","v":"DIVERSOS"},{"$f":"Orçamento!S312","v":0},{"$f":"Orçamento!X312","v":0},{"$f":"Orçamento!AA312","v":0}]
["F","TOTAL GERAL DO ORÇAMENTO",null,{"$f":"SUM(D17:D42)","v":0},{"$f":"SUM(E17:E42)","v":0},{"$f":"SUM(F17:F42)","v":0}]
[]
[null,"(*) Para itens da AGETOP, os vidros não estão inclusos nas esquadrias e já foram considerados os custos de contramarco para as esquadrias de alumínio;"]

{"sheet":"Cronog_90_Dias","index":3,"n_rows":99,"n_cols":20,"rows_kept":99,"cut":false,"hidden":false,"merged":[[0,1,0,17],[1,1,1,17],[2,1,2,7],[2,8,2,17],[3,1,3,7],[3,8,3,17],[8,1,8,7],[8,8,8,17],[9,0,11,0],[9,1,9,7],[9,8,9,17],[10,1,10,17],[11,1,11,17],[4,1,4,17],[5,1,5,7],[5,8,5,17],[6,1,6,7],[6,8,6,17],[7,1,7,17],[12,0,13,0],[12,3,13,3],[12,5,12,8],[12,9,12,12],[12,13,12,16],[12,17,13,17],[13,1,13,2],[13,5,13,8],[13,9,13,12],[13,13,13,16],[14,1,16,2],[14,3,16,3],[14,4,16,4],[14,5,14,8],[14,9,14,12],[14,13,14,16],[16,5,16,8],[16,9,16,12],[16,13,16,16],[17,1,19,2],[17,3,19,3],[17,4,19,4],[17,5,17,8],[17,9,17,12],[17,13,17,16],[19,5,19,8],[19,9,19,12],[19,13,19,16],[20,1,22,2],[20,3,22,3],[20,4,22,4],[20,5,20,8],[20,9,20,12],[20,13,20,16],[22,5,22,8],[22,9,22,12],[22,13,22,16],[23,1,25,2],[23,3,25,3],[23,4,25,4],[23,5,23,8],[23,9,23,12],[23,13,23,16],[25,5,25,8],[25,9,25,12],[25,13,25,16],[26,1,28,2],[26,3,28,3],[26,4,28,4],[26,5,26,8],[26,9,26,12],[26,13,26,16],[28,5,28,8],[28,9,28,12],[28,13,28,16],[29,1,31,2],[29,3,31,3],[29,4,31,4],[29,5,29,8],[29,9,29,12],[29,13,29,16],[31,5,31,8],[31,9,31,12],[31,13,31,16],[32,1,34,2],[32,3,34,3],[32,4,34,4],[32,5,32,8],[32,9,32,12],[32,13,32,16],[34,5,34,8],[34,9,34,12],[34,13,34,16],[35,1,37,2],[35,3,37,3],[35,4,37,4],[35,5,35,8],[35,9,35,12],[35,13,35,16],[37,5,37,8],[37,9,37,12],[37,13,37,16],[38,1,40,2],[38,3,40,3],[38,4,40,4],[38,5,38,8],[38,9,38,12],[38,13,38,16],[40,5,40,8],[40,9,40,12],[40,13,40,16],[41,1,43,2],[41,3,43,3],[41,4,43,4],[41,5,41,8],[41,9,41,12],[41,13,41,16],[43,5,43,8],[43,9,43,12],[43,13,43,16],[44,1,46,2],[44,3,46,3],[44,4,46,4],[44,5,44,8],[44,9,44,12],[44,13,44,16],[46,5,46,8],[46,9,46,12],[46,13,46,16],[47,1,49,2],[47,3,49,3],[47,4,49,4],[47,5,47,8],[47,9,47,12],[47,13,47,16],[49,5,49,8],[49,9,49,12],[49,13,49,16],[50,1,52,2],[50,3,52,3],[50,4,52,4],[50,5,50,8],[50,9,50,12],[50,13,50,16],[52,5,52,8],[52,9,52,12],[52,13,52,16],[53,1,55,2],[53,3,55,3],[53,4,55,4],[53,5,53,8],[53,9,53,12],[53,13,53,16],[55,5,55,8],[55,9,55,12],[55,13,55,16],[56,1,58,2],[56,3,58,3],[56,4,58,4],[56,5,56,8],[56,9,56,12],[56,13,56,16],[58,5,58,8],[58,9,58,12],[58,13,58,16],[59,1,61,2],[59,3,61,3],[59,4,61,4],[59,5,59,8],[59,9,59,12],[59,13,59,16],[61,5,61,8],[61,9,61,12],[61,13,61,16],[62,1,64,2],[62,3,64,3],[62,4,64,4],[62,5,62,8],[62,9,62,12],[62,13,62,16],[64,5,64,8],[64,9,64,12],[64,13,64,16],[65,1,67,2],[65,3,67,3],[65,4,67,4],[65,5,65,8],[65,9,65,12],[65,13,65,16],[67,5,67,8],[67,9,67,12],[67,13,67,16],[68,1,70,2],[68,3,70,3],[68,4,70,4],[68,5,68,8],[68,9,68,12],[68,13,68,16],[70,5,70,8],[70,9,70,12],[70,13,70,16],[71,1,73,2],[71,3,73,3],[71,4,73,4],[71,5,71,8],[71,9,71,12],[71,13,71,16],[73,5,73,8],[73,9,73,12],[73,13,73,16],[74,1,76,2],[74,3,76,3],[74,4,76,4],[74,5,74,8],[74,9,74,12],[74,13,74,16],[76,5,76,8],[76,9,76,12],[76,13,76,16],[77,1,79,2],[77,3,79,3],[77,4,79,4],[77,5,77,8],[77,9,77,12],[77,13,77,16],[79,5,79,8],[79,9,79,12],[79,13,79,16],[80,1,82,2],[80,3,82,3],[80,4,82,4],[80,5,80,8],[80,9,80,12],[80,13,80,16],[82,5,82,8],[82,9,82,12],[82,13,82,16],[83,1,85,2],[83,3,85,3],[83,4,85,4],[83,5,83,8],[83,9,83,12],[83,13,83,16],[85,5,85,8],[85,9,85,12],[85,13,85,16],[86,1,88,2],[86,3,88,3],[86,4,88,4],[86,5,86,8],[86,9,86,12],[86,13,86,16],[88,5,88,8],[88,9,88,12],[88,13,88,16],[92,1,92,2],[92,5,92,8],[92,9,92,12],[92,13,92,16],[93,1,93,2],[93,5,93,8],[93,9,93,12],[93,13,93,16],[89,1,91,2],[89,3,91,3],[89,4,91,4],[89,5,89,8],[89,9,89,12],[89,13,89,16],[91,5,91,8],[91,9,91,12],[91,13,91,16],[97,1,97,4],[98,1,98,17],[94,1,94,2],[94,5,94,8],[94,9,94,12],[94,13,94,16],[95,1,95,2],[95,5,95,8],[95,9,95,12],[95,13,95,16]]}
[]
[]
[null,"UNIDADE ESCOLAR",null,null,null,null,null,null,"PRAZO"]
[null,{"$f":"Orçamento!O4","v":"ESCOLA ESTADUAL VICENÇA MARIA DE JESUS"},null,null,null,null,null,null,"90 DIAS CORRIDOS"]
[]
[null,"OBRA",null,null,null,null,null,null,"DATA"]
[null,{"$f":"Orçamento!O7","v":"REFORMA E AMPLIAÇÃO"},null,null,null,null,null,null,{"$f":"Orçamento!S7","v":"2020-06-17"}]
[]
[null,"LOCAL",null,null,null,null,null,null,"ÁREA TOTAL CONSTRUÍDA (M²)"]
["FILTRO",{"$f":"Orçamento!X7","v":"ITAPACI"},null,null,null,null,null,null,{"$f":"Orçamento!X13","v":619.86}]
[]
[null,"CRONOGRAMA - FÍSICO FINANCEIRO"]
["↓","CUSTO TOTAL:",{"$f":"D93","v":0},"VALOR","Dias:",30,null,null,null,60,null,null,null,90,null,null,null,"TOTAL"]
[null,"DESCRIÇÃO DOS SERVIÇOS",null,null,"%","1ª PARCELA",null,null,null,"2ª PARCELA",null,null,null,"3ª PARCELA"]
[{"$f":"IF(D15>0,\"F\",\"\")","v":""},"SERVIÇOS PRELIMINARES",null,{"$f":"Orçamento!X287","v":0},{"$f":"Orçamento!AA287","v":0},{"$f":"ROUND(F17*$D$15,2)","v":0},null,null,null,{"$f":"ROUND(J17*$D$15,2)","v":0},null,null,null,{"$f":"ROUND(N17*$D$15,2)","v":0},null,null,null,{"$f":"SUM(F15:Q15)","v":0},null,{"$f":"IF(D15=R15,\"OK\",\"ERRO\")","v":"OK"}]
[{"$f":"IF(A15=\"F\",A15,\"\")","v":""}]
[{"$f":"IF(A16=\"F\",A16,\"\")","v":""},null,null,null,null,1,null,null,null,0,null,null,null,{"$f":"1-F17-J17","v":0},null,null,null,{"$f":"IFERROR(E15/100,\"\")","v":0},null,{"$f":"IF(E15=R17*100,\"OK\",\"ERRO\")","v":"OK"}]
[{"$f":"IF(D18>0,\"F\",\"\")","v":""},"TRANSPORTES",null,{"$f":"Orçamento!X288","v":0},{"$f":"Orçamento!AA288","v":0},{"$f":"ROUND(F20*$D$18,2)","v":0},null,null,null,{"$f":"ROUND(J20*$D$18,2)","v":0},null,null,null,{"$f":"ROUND(N20*$D$18,2)","v":0},null,null,null,{"$f":"SUM(F18:Q18)","v":0},null,{"$f":"IF(D18=R18,\"OK\",\"ERRO\")","v":"OK"}]
[{"$f":"IF(A18=\"F\",A18,\"\")","v":""}]
[{"$f":"IF(A19=\"F\",A19,\"\")","v":""},null,null,null,null,0.37,null,null,null,0.3,null,null,null,{"$f":"1-F20-J20","v":0.33},null,null,null,{"$f":"IFERROR(E18/100,\"\")","v":0},null,{"$f":"IF(E18=R20*100,\"OK\",\"ERRO\")","v":"OK"}]
[{"$f":"IF(D21>0,\"F\",\"\")","v":""},"SERVIÇO EM TERRA",null,{"$f":"Orçamento!X289","v":0},{"$f":"Orçamento!AA289","v":0},{"$f":"ROUND(F23*$D$21,2)","v":0},null,null,null,{"$f":"ROUND(J23*$D$21,2)","v":0},null,null,null,{"$f":"ROUND(N23*$D$21,2)","v":0},null,null,null,{"$f":"SUM(F21:Q21)","v":0},null,{"$f":"IF(D21=R21,\"OK\",\"ERRO\")","v":"OK"}]
[{"$f":"IF(A21=\"F\",A21,\"\")","v":""}]
[{"$f":"IF(A22=\"F\",A22,\"\")","v":""},null,null,null,null,1,null,null,null,0,null,null,null,{"$f":"1-F23-J23","v":0},null,null,null,{"$f":"IFERROR(E21/100,\"\")","v":0},null,{"$f":"IF(E21=R23*100,\"OK\",\"ERRO\")","v":"OK"}]
[{"$f":"IF(D24>0,\"F\",\"\")","v":""},"FUNDAÇÕES E SONDAGENS",null,{"$f":"Orçamento!X290","v":0},{"$f":"Orçamento!AA290","v":0},{"$f":"ROUND(F26*$D$24,2)","v":0},null,null,null,{"$f":"ROUND(J26*$D$24,2)","v":0},null,null,null,{"$f":"ROUND(N26*$D$24,2)","v":0},null,null,null,{"$f":"SUM(F24:Q24)","v":0},null,{"$f":"IF(D24=R24,\"OK\",\"ERRO\")","v":"OK"}]
[{"$f":"IF(A24=\"F\",A24,\"\")","v":""}]
[{"$f":"IF(A25=\"F\",A25,\"\")","v":""},null,null,null,null,1,null,null,null,0,null,null,null,{"$f":"1-F26-J26","v":0},null,null,null,{"$f":"IFERROR(E24/100,\"\")","v":0},null,{"$f":"IF(E24=R26*100,\"OK\",\"ERRO\")","v":"OK"}]
[{"$f":"IF(D27>0,\"F\",\"\")","v":""},"ESTRUTURA",null,{"$f":"Orçamento!X291","v":0},{"$f":"Orçamento!AA291","v":0},{"$f":"ROUND(F29*$D$27,2)","v":0},null,null,null,{"$f":"ROUND(J29*$D$27,2)","v":0},null,null,null,{"$f":"ROUND(N29*$D$27,2)","v":0},null,null,null,{"$f":"SUM(F27:Q27)","v":0},null,{"$f":"IF(D27=R27,\"OK\",\"ERRO\")","v":"OK"}]
[{"$f":"IF(A27=\"F\",A27,\"\")","v":""}]
[{"$f":"IF(A28=\"F\",A28,\"\")","v":""},null,null,null,null,0.53,null,null,null,{"$f":"1-F29","v":0.47},null,null,null,{"$f":"1-F29-J29","v":0},null,null,null,{"$f":"IFERROR(E27/100,\"\")","v":0},null,{"$f":"IF(E27=R29*100,\"OK\",\"ERRO\")","v":"OK"}]
[{"$f":"IF(D30>0,\"F\",\"\")","v":""},"INST.ELET/TELEFÔNICA/CABEAMENTO ESTRUTURADO",null,{"$f":"Orçamento!X292","v":0},{"$f":"Orçamento!AA292","v":0},{"$f":"ROUND(F32*$D$30,2)","v":0},null,null,null,{"$f":"ROUND(J32*$D$30,2)","v":0},null,null,null,{"$f":"ROUND(N32*$D$30,2)","v":0},null,null,null,{"$f":"SUM(F30:Q30)","v":0},null,{"$f":"IF(D30=R30,\"OK\",\"ERRO\")","v":"OK"}]
[{"$f":"IF(A30=\"F\",A30,\"\")","v":""}]
[{"$f":"IF(A31=\"F\",A31,\"\")","v":""},null,null,null,null,0,null,null,null,{"$f":"1-B32","v":1},null,null,null,{"$f":"1-F32-J32","v":0},null,null,null,{"$f":"IFERROR(E30/100,\"\")","v":0},null,{"$f":"IF(E30=R32*100,\"OK\",\"ERRO\")","v":"OK"}]
[{"$f":"IF(D33>0,\"F\",\"\")","v":""},"INSTALAÇÕES HIDROSSANITÁRIAS",null,{"$f":"Orçamento!X293","v":0},{"$f":"Orçamento!AA293","v":0},{"$f":"ROUND(F35*$D$33,2)","v":0},null,null,null,{"$f":"ROUND(J35*$D$33,2)","v":0},null,null,null,{"$f":"ROUND(N35*$D$33,2)","v":0},null,null,null,{"$f":"SUM(F33:Q33)","v":0},null,{"$f":"IF(D33=R33,\"OK\",\"ERRO\")","v":"OK"}]
[{"$f":"IF(A33=\"F\",A33,\"\")","v":""}]
[{"$f":"IF(A34=\"F\",A34,\"\")","v":""},null,null,null,null,0,null,null,null,{"$f":"1-B35","v":1},null,null,null,{"$f":"1-F35-J35","v":0},null,null,null,{"$f":"IFERROR(E33/100,\"\")","v":0},null,{"$f":"IF(E33=R35*100,\"OK\",\"ERRO\")","v":"OK"}]
[{"$f":"IF(D36>0,\"F\",\"\")","v":""},"INSTALAÇÕES ESPECIAIS",null,{"$f":"Orçamento!X294","v":0},{"$f":"Orçamento!AA294","v":0},{"$f":"ROUND(F38*$D$36,2)","v":0},null,null,null,{"$f":"ROUND(J38*$D$36,2)","v":0},null,null,null,{"$f":"ROUND(N38*$D$36,2)","v":0},null,null,null,{"$f":"SUM(F36:Q36)","v":0},null,{"$f":"IF(D36=R36,\"OK\",\"ERRO\")","v":"OK"}]
[{"$f":"IF(A36=\"F\",A36,\"\")","v":""}]
[{"$f":"IF(A37=\"F\",A37,\"\")","v":""},null,null,null,null,0,null,null,null,{"$f":"1-B38","v":1},null,null,null,{"$f":"1-F38-J38","v":0},null,null,null,{"$f":"IFERROR(E36/100,\"\")","v":0},null,{"$f":"IF(E36=R38*100,\"OK\",\"ERRO\")","v":"OK"}]
[{"$f":"IF(D39>0,\"F\",\"\")","v":""},"ALVENARIA E DIVISÓRIAS",null,{"$f":"Orçamento!X295","v":0},{"$f":"Orçamento!AA295","v":0},{"$f":"ROUND(F41*$D$39,2)","v":0},null,null,null,{"$f":"ROUND(J41*$D$39,2)","v":0},null,null,null,{"$f":"ROUND(N41*$D$39,2)","v":0},null,null,null,{"$f":"SUM(F39:Q39)","v":0},null,{"$f":"IF(D39=R39,\"OK\",\"ERRO\")","v":"OK"}]
[{"$f":"IF(A39=\"F\",A39,\"\")","v":""}]
[{"$f":"IF(A40=\"F\",A40,\"\")","v":""},null,null,null,null,0,null,null,null,{"$f":"1-B41","v":1},null,null,null,{"$f":"1-F41-J41","v":0},null,null,null,{"$f":"IFERROR(E39/100,\"\")","v":0},null,{"$f":"IF(E39=R41*100,\"OK\",\"ERRO\")","v":"OK"}]
[{"$f":"IF(D42>0,\"F\",\"\")","v":""},"ALVENARIA AUTO-PORTANTE",null,{"$f":"Orçamento!X296","v":0},{"$f":"Orçamento!AA296","v":0},{"$f":"ROUND(F44*$D$42,2)","v":0},null,null,null,{"$f":"ROUND(J44*$D$42,2)","v":0},null,null,null,{"$f":"ROUND(N44*$D$42,2)","v":0},null,null,null,{"$f":"SUM(F42:Q42)","v":0},null,{"$f":"IF(D42=R42,\"OK\",\"ERRO\")","v":"OK"}]
[{"$f":"IF(A42=\"F\",A42,\"\")","v":""}]
[{"$f":"IF(A43=\"F\",A43,\"\")","v":""},null,null,null,null,0,null,null,null,{"$f":"1-B44","v":1},null,null,null,{"$f":"1-F44-J44","v":0},null,null,null,{"$f":"IFERROR(E42/100,\"\")","v":0},null,{"$f":"IF(E42=R44*100,\"OK\",\"ERRO\")","v":"OK"}]
[{"$f":"IF(D45>0,\"F\",\"\")","v":""},"IMPERMEABILIZAÇÃO",null,{"$f":"Orçamento!X297","v":0},{"$f":"Orçamento!AA297","v":0},{"$f":"ROUND(F47*$D$45,2)","v":0},null,null,null,{"$f":"ROUND(J47*$D$45,2)","v":0},null,null,null,{"$f":"ROUND(N47*$D$45,2)","v":0},null,null,null,{"$f":"SUM(F45:Q45)","v":0},null,{"$f":"IF(D45=R45,\"OK\",\"ERRO\")","v":"OK"}]
[{"$f":"IF(A45=\"F\",A45,\"\")","v":""}]
[{"$f":"IF(A46=\"F\",A46,\"\")","v":""},null,null,null,null,0.85,null,null,null,0.15,null,null,null,{"$f":"1-F47-J47","v":0},null,null,null,{"$f":"IFERROR(E45/100,\"\")","v":0},null,{"$f":"IF(E45=R47*100,\"OK\",\"ERRO\")","v":"OK"}]
[{"$f":"IF(D48>0,\"F\",\"\")","v":""},"ISOLAMENTO TÉRMICO E ACÚSTICO",null,{"$f":"Orçamento!X298","v":0},{"$f":"Orçamento!AA298","v":0},{"$f":"ROUND(F50*$D$48,2)","v":0},null,null,null,{"$f":"ROUND(J50*$D$48,2)","v":0},null,null,null,{"$f":"ROUND(N50*$D$48,2)","v":0},null,null,null,{"$f":"SUM(F48:Q48)","v":0},null,{"$f":"IF(D48=R48,\"OK\",\"ERRO\")","v":"OK"}]
[{"$f":"IF(A48=\"F\",A48,\"\")","v":""}]
[{"$f":"IF(A49=\"F\",A49,\"\")","v":""},null,null,null,null,0,null,null,null,{"$f":"1-B50","v":1},null,null,null,{"$f":"1-F50-J50","v":0},null,null,null,{"$f":"IFERROR(E48/100,\"\")","v":0},null,{"$f":"IF(E48=R50*100,\"OK\",\"ERRO\")","v":"OK"}]
[{"$f":"IF(D51>0,\"F\",\"\")","v":""},"ESTRUTURA DE MADEIRA",null,{"$f":"Orçamento!X299","v":0},{"$f":"Orçamento!AA299","v":0},{"$f":"ROUND(F53*$D$51,2)","v":0},null,null,null,{"$f":"ROUND(J53*$D$51,2)","v":0},null,null,null,{"$f":"ROUND(N53*$D$51,2)","v":0},null,null,null,{"$f":"SUM(F51:Q51)","v":0},null,{"$f":"IF(D51=R51,\"OK\",\"ERRO\")","v":"OK"}]
[{"$f":"IF(A51=\"F\",A51,\"\")","v":""}]
[{"$f":"IF(A52=\"F\",A52,\"\")","v":""},null,null,null,null,0,null,null,null,0.57999999999999996,null,null,null,{"$f":"1-F53-J53","v":0.42000000000000004},null,null,null,{"$f":"IFERROR(E51/100,\"\")","v":0},null,{"$f":"IF(E51=R53*100,\"OK\",\"ERRO\")","v":"OK"}]
[{"$f":"IF(D54>0,\"F\",\"\")","v":""},"ESTRUTURA METÁLICA",null,{"$f":"Orçamento!X300","v":0},{"$f":"Orçamento!AA300","v":0},{"$f":"ROUND(F56*$D$54,2)","v":0},null,null,null,{"$f":"ROUND(J56*$D$54,2)","v":0},null,null,null,{"$f":"ROUND(N56*$D$54,2)","v":0},null,null,null,{"$f":"SUM(F54:Q54)","v":0},null,{"$f":"IF(D54=R54,\"OK\",\"ERRO\")","v":"OK"}]
[{"$f":"IF(A54=\"F\",A54,\"\")","v":""}]
[{"$f":"IF(A55=\"F\",A55,\"\")","v":""},null,null,null,null,0,null,null,null,0.57999999999999996,null,null,null,{"$f":"1-F56-J56","v":0.42000000000000004},null,null,null,{"$f":"IFERROR(E54/100,\"\")","v":0},null,{"$f":"IF(E54=R56*100,\"OK\",\"ERRO\")","v":"OK"}]
[{"$f":"IF(D57>0,\"F\",\"\")","v":""},"COBERTURAS",null,{"$f":"Orçamento!X301","v":0},{"$f":"Orçamento!AA301","v":0},{"$f":"ROUND(F59*$D$57,2)","v":0},null,null,null,{"$f":"ROUND(J59*$D$57,2)","v":0},null,null,null,{"$f":"ROUND(N59*$D$57,2)","v":0},null,null,null,{"$f":"SUM(F57:Q57)","v":0},null,{"$f":"IF(D57=R57,\"OK\",\"ERRO\")","v":"OK"}]
[{"$f":"IF(A57=\"F\",A57,\"\")","v":""}]
[{"$f":"IF(A58=\"F\",A58,\"\")","v":""},null,null,null,null,0,null,null,null,0,null,null,null,{"$f":"1-F59-J59","v":1},null,null,null,{"$f":"IFERROR(E57/100,\"\")","v":0},null,{"$f":"IF(E57=R59*100,\"OK\",\"ERRO\")","v":"OK"}]
[{"$f":"IF(D60>0,\"F\",\"\")","v":""},"ESQUADRIAS DE MADEIRA",null,{"$f":"Orçamento!X302","v":0},{"$f":"Orçamento!AA302","v":0},{"$f":"ROUND(F62*$D$60,2)","v":0},null,null,null,{"$f":"ROUND(J62*$D$60,2)","v":0},null,null,null,{"$f":"ROUND(N62*$D$60,2)","v":0},null,null,null,{"$f":"SUM(F60:Q60)","v":0},null,{"$f":"IF(D60=R60,\"OK\",\"ERRO\")","v":"OK"}]
[{"$f":"IF(A60=\"F\",A60,\"\")","v":""}]
[{"$f":"IF(A61=\"F\",A61,\"\")","v":""},null,null,null,null,0,null,null,null,0.4,null,null,null,{"$f":"1-F62-J62","v":0.6},null,null,null,{"$f":"IFERROR(E60/100,\"\")","v":0},null,{"$f":"IF(E60=R62*100,\"OK\",\"ERRO\")","v":"OK"}]
[{"$f":"IF(D63>0,\"F\",\"\")","v":""},"ESQUADRIAS METÁLICAS",null,{"$f":"Orçamento!X303","v":0},{"$f":"Orçamento!AA303","v":0},{"$f":"ROUND(F65*$D$63,2)","v":0},null,null,null,{"$f":"ROUND(J65*$D$63,2)","v":0},null,null,null,{"$f":"ROUND(N65*$D$63,2)","v":0},null,null,null,{"$f":"SUM(F63:Q63)","v":0},null,{"$f":"IF(D63=R63,\"OK\",\"ERRO\")","v":"OK"}]
[{"$f":"IF(A63=\"F\",A63,\"\")","v":""}]
[{"$f":"IF(A64=\"F\",A64,\"\")","v":""},null,null,null,null,0,null,null,null,0.45,null,null,null,{"$f":"1-F65-J65","v":0.55000000000000004},null,null,null,{"$f":"IFERROR(E63/100,\"\")","v":0},null,{"$f":"IF(E63=R65*100,\"OK\",\"ERRO\")","v":"OK"}]
[{"$f":"IF(D66>0,\"F\",\"\")","v":""},"VIDROS",null,{"$f":"Orçamento!X304","v":0},{"$f":"Orçamento!AA304","v":0},{"$f":"ROUND(F68*$D$66,2)","v":0},null,null,null,{"$f":"ROUND(J68*$D$66,2)","v":0},null,null,null,{"$f":"ROUND(N68*$D$66,2)","v":0},null,null,null,{"$f":"SUM(F66:Q66)","v":0},null,{"$f":"IF(D66=R66,\"OK\",\"ERRO\")","v":"OK"}]
[{"$f":"IF(A66=\"F\",A66,\"\")","v":""}]
[{"$f":"IF(A67=\"F\",A67,\"\")","v":""},null,null,null,null,0,null,null,null,0,null,null,null,{"$f":"1-F68-J68","v":1},null,null,null,{"$f":"IFERROR(E66/100,\"\")","v":0},null,{"$f":"IF(E66=R68*100,\"OK\",\"ERRO\")","v":"OK"}]
[{"$f":"IF(D69>0,\"F\",\"\")","v":""},"REVESTIMENTO DE PAREDE",null,{"$f":"Orçamento!X305","v":0},{"$f":"Orçamento!AA305","v":0},{"$f":"ROUND(F71*$D$69,2)","v":0},null,null,null,{"$f":"ROUND(J71*$D$69,2)","v":0},null,null,null,{"$f":"ROUND(N71*$D$69,2)","v":0},null,null,null,{"$f":"SUM(F69:Q69)","v":0},null,{"$f":"IF(D69=R69,\"OK\",\"ERRO\")","v":"OK"}]
[{"$f":"IF(A69=\"F\",A69,\"\")","v":""}]
[{"$f":"IF(A70=\"F\",A70,\"\")","v":""},null,null,null,null,0,null,null,null,0.4,null,null,null,{"$f":"1-F71-J71","v":0.6},null,null,null,{"$f":"IFERROR(E69/100,\"\")","v":0},null,{"$f":"IF(E69=R71*100,\"OK\",\"ERRO\")","v":"OK"}]
[{"$f":"IF(D72>0,\"F\",\"\")","v":""},"FORROS",null,{"$f":"Orçamento!X306","v":0},{"$f":"Orçamento!AA306","v":0},{"$f":"ROUND(F74*$D$72,2)","v":0},null,null,null,{"$f":"ROUND(J74*$D$72,2)","v":0},null,null,null,{"$f":"ROUND(N74*$D$72,2)","v":0},null,null,null,{"$f":"SUM(F72:Q72)","v":0},null,{"$f":"IF(D72=R72,\"OK\",\"ERRO\")","v":"OK"}]
[{"$f":"IF(A72=\"F\",A72,\"\")","v":""}]
[{"$f":"IF(A73=\"F\",A73,\"\")","v":""},null,null,null,null,0,null,null,null,0.4,null,null,null,{"$f":"1-F74-J74","v":0.6},null,null,null,{"$f":"IFERROR(E72/100,\"\")","v":0},null,{"$f":"IF(E72=R74*100,\"OK\",\"ERRO\")","v":"OK"}]
[{"$f":"IF(D75>0,\"F\",\"\")","v":""},"REVESTIMENTO DE PISO",null,{"$f":"Orçamento!X307","v":0},{"$f":"Orçamento!AA307","v":0},{"$f":"ROUND(F77*$D$75,2)","v":0},null,null,null,{"$f":"ROUND(J77*$D$75,2)","v":0},null,null,null,{"$f":"ROUND(N77*$D$75,2)","v":0},null,null,null,{"$f":"SUM(F75:Q75)","v":0},null,{"$f":"IF(D75=R75,\"OK\",\"ERRO\")","v":"OK"}]
[{"$f":"IF(A75=\"F\",A75,\"\")","v":""}]
[{"$f":"IF(A76=\"F\",A76,\"\")","v":""},null,null,null,null,0,null,null,null,0.4,null,null,null,{"$f":"1-F77-J77","v":0.6},null,null,null,{"$f":"IFERROR(E75/100,\"\")","v":0},null,{"$f":"IF(E75=R77*100,\"OK\",\"ERRO\")","v":"OK"}]
[{"$f":"IF(D78>0,\"F\",\"\")","v":""},"FERRAGENS",null,{"$f":"Orçamento!X308","v":0},{"$f":"Orçamento!AA308","v":0},{"$f":"ROUND(F80*$D$78,2)","v":0},null,null,null,{"$f":"ROUND(J80*$D$78,2)","v":0},null,null,null,{"$f":"ROUND(N80*$D$78,2)","v":0},null,null,null,{"$f":"SUM(F78:Q78)","v":0},null,{"$f":"IF(D78=R78,\"OK\",\"ERRO\")","v":"OK"}]
[{"$f":"IF(A78=\"F\",A78,\"\")","v":""}]
[{"$f":"IF(A79=\"F\",A79,\"\")","v":""},null,null,null,null,0,null,null,null,0,null,null,null,{"$f":"1-F80-J80","v":1},null,null,null,{"$f":"IFERROR(E78/100,\"\")","v":0},null,{"$f":"IF(E78=R80*100,\"OK\",\"ERRO\")","v":"OK"}]
[{"$f":"IF(D81>0,\"F\",\"\")","v":""},"MARCENARIA",null,{"$f":"Orçamento!X309","v":0},{"$f":"Orçamento!AA309","v":0},{"$f":"ROUND(F83*$D$81,2)","v":0},null,null,null,{"$f":"ROUND(J83*$D$81,2)","v":0},null,null,null,{"$f":"ROUND(N83*$D$81,2)","v":0},null,null,null,{"$f":"SUM(F81:Q81)","v":0},null,{"$f":"IF(D81=R81,\"OK\",\"ERRO\")","v":"OK"}]
[{"$f":"IF(A81=\"F\",A81,\"\")","v":""}]
[{"$f":"IF(A82=\"F\",A82,\"\")","v":""},null,null,null,null,0,null,null,null,0,null,null,null,{"$f":"1-F83-J83","v":1},null,null,null,{"$f":"IFERROR(E81/100,\"\")","v":0},null,{"$f":"IF(E81=R83*100,\"OK\",\"ERRO\")","v":"OK"}]
[{"$f":"IF(D84>0,\"F\",\"\")","v":""},"ADMINISTRAÇÃO - MENSALISTAS",null,{"$f":"Orçamento!X310","v":0},{"$f":"Orçamento!AA310","v":0},{"$f":"ROUND(F86*$D$84,2)","v":0},null,null,null,{"$f":"ROUND(J86*$D$84,2)","v":0},null,null,null,{"$f":"ROUND(N86*$D$84,2)","v":0},null,null,null,{"$f":"SUM(F84:Q84)","v":0},null,{"$f":"IF(D84=R84,\"OK\",\"ERRO\")","v":"OK"}]
[{"$f":"IF(A84=\"F\",A84,\"\")","v":""}]
[{"$f":"IF(A85=\"F\",A85,\"\")","v":""},null,null,null,null,0.36,null,null,null,{"$f":"F86","v":0.36},null,null,null,{"$f":"1-F86-J86","v":0.28000000000000003},null,null,null,{"$f":"IFERROR(E84/100,\"\")","v":0},null,{"$f":"IF(E84=R86*100,\"OK\",\"ERRO\")","v":"OK"}]
[{"$f":"IF(D87>0,\"F\",\"\")","v":""},"PINTURA",null,{"$f":"Orçamento!X311","v":0},{"$f":"Orçamento!AA311","v":0},{"$f":"ROUND(F89*$D$87,2)","v":0},null,null,null,{"$f":"ROUND(J89*$D$87,2)","v":0},null,null,null,{"$f":"ROUND(N89*$D$87,2)","v":0},null,null,null,{"$f":"SUM(F87:Q87)","v":0},null,{"$f":"IF(D87=R87,\"OK\",\"ERRO\")","v":"OK"}]
[{"$f":"IF(A87=\"F\",A87,\"\")","v":""}]
[{"$f":"IF(A88=\"F\",A88,\"\")","v":""},null,null,null,null,0,null,null,null,0,null,null,null,{"$f":"1-F89-J89","v":1},null,null,null,{"$f":"IFERROR(E87/100,\"\")","v":0},null,{"$f":"IF(E87=R89*100,\"OK\",\"ERRO\")","v":"OK"}]
[{"$f":"IF(D90>0,\"F\",\"\")","v":""},"DIVERSOS",null,{"$f":"Orçamento!X312","v":0},{"$f":"Orçamento!AA312","v":0},{"$f":"ROUND(F92*$D$90,2)","v":0},null,null,null,{"$f":"ROUND(J92*$D$90,2)","v":0},null,null,null,{"$f":"ROUND(N92*$D$90,2)","v":0},null,null,null,{"$f":"SUM(F90:Q90)","v":0},null,{"$f":"IF(D90=R90,\"OK\",\"ERRO\")","v":"OK"}]
[{"$f":"IF(A90=\"F\",A90,\"\")","v":""}]
[{"$f":"IF(A91=\"F\",A91,\"\")","v":""},null,null,null,null,0,null,null,null,0,null,null,null,{"$f":"1-F92-J92","v":1},null,null,null,{"$f":"IFERROR(E90/100,\"\")","v":0},null,{"$f":"IF(E90=R92*100,\"OK\",\"ERRO\")","v":"OK"}]
["F","CUSTO DO ORÇAMENTO",null,{"$f":"SUM(D15:D92)","v":0},{"$f":"SUM(E15:E92)","v":0},{"$f":"F15+F18+F21+F24+F27+F30+F33+F36+F39+F42+F45+F48+F51+F54+F57+F60+F63+F66+F69+F72+F75+F78+F81+F84+F87+F90","v":0},null,null,null,{"$f":"J15+J18+J21+J24+J27+J30+J33+J36+J39+J42+J45+J48+J51+J54+J57+J60+J63+J66+J69+J72+J75+J78+J81+J84+J87+J90","v":0},null,null,null,{"$f":"N15+N18+N21+N24+N27+N30+N33+N36+N39+N42+N45+N48+N51+N54+N57+N60+N63+N66+N69+N72+N75+N78+N81+N84+N87+N90","v":0},null,null,null,{"$f":"R15+R18+R21+R24+R27+R30+R33+R36+R39+R42+R45+R48+R51+R54+R57+R60+R63+R66+R69+R72+R75+R78+R81+R84+R87+R90","v":0}]
["F","PERCENTUAIS:",null,null,null,{"$f":"IFERROR(F93/D93,\"\")","v":""},null,null,null,{"$f":"IFERROR(J93/D93,\"\")","v":""},null,null,null,{"$f":"IFERROR(N93/D93,\"\")","v":""},null,null,null,{"$f":"SUM(F94:Q94)","v":0}]
["F","TOTAIS ACUMULADOS:",null,null,null,{"$f":"F93","v":0},null,null,null,{"$f":"F95+J93","v":0},null,null,null,{"$f":"J95+N93","v":0}]
["F","PERCENTUAIS  ACUMULADOS:",null,null,null,{"$f":"F94","v":""},null,null,null,{"$f":"J94+F96","v":{"$error":"#VALUE!"}},null,null,null,{"$f":"IFERROR(J96+N94,\"\")","v":""}]
["F"]
["F","OBSERVAÇÕES:"]
["F","Os pagamentos somente poderão ser efetuados mediante medição e atesto pelos técnicos da Secretaria da Educação. "]

{"sheet":"Composição BDI","index":4,"n_rows":45,"n_cols":9,"rows_kept":45,"cut":false,"hidden":false,"merged":[[18,5,18,8],[17,0,17,3],[16,0,16,3],[44,0,44,3],[42,0,42,3],[43,0,43,3],[18,0,18,3],[36,0,36,3],[39,0,39,3],[38,0,38,3],[40,0,40,3],[29,0,29,2],[32,0,32,3],[33,0,33,3],[34,0,34,3],[35,0,35,3],[0,0,0,3],[2,0,2,3],[3,0,3,3],[1,0,1,3],[5,0,5,3],[4,0,4,3],[12,0,12,3],[13,0,13,3],[14,0,14,3],[15,0,15,3],[6,0,6,3],[8,0,8,3],[7,0,7,3],[9,0,9,3],[11,0,11,3],[10,0,10,3]]}
[]
[]
["UNIDADE ESCOLAR"]
[{"$f":"Orçamento!$O$4","v":"ESCOLA ESTADUAL VICENÇA MARIA DE JESUS"}]
[]
["OBRA"]
[{"$f":"Orçamento!$O$7","v":"REFORMA E AMPLIAÇÃO"}]
[]
["ENDEREÇO"]
[{"$f":"Orçamento!$R$10","v":" RUA PRINCIPAL S/N , VILA SANTANA , CEP:76360-000"}]
[]
["CIDADE"]
[{"$f":"Orçamento!$X$7","v":"ITAPACI"}]
[]
["CRE"]
[{"$f":"Orçamento!$O$10","v":"CRE-ITAPACI"}]
[]
["DETALHAMENTO DA COMPOSIÇÃO DE BDI"]
["COMPOSIÇÃO BDI PARA OBRAS CIVIS",null,null,null,null,"BDI CONSTRUÇÃO E REFORMA"]
["DESCRIÇÃO","COEF.","TAXA % (a.m)","% no preço de venda",null,"Situação","1º Quartil","Médio","3º Quartil"]
["1) COFINS",1,0.03,{"$f":"C21","v":0.03},null,{"$f":"IF(OR(C21<G21,C21>I21),\"FORA DO INTERVALO\",\"OK\")","v":"OK"},0.03,0.03,0.03]
["2) PIS",1,6.4999999999999997E-3,{"$f":"C22","v":6.4999999999999997E-3},null,{"$f":"IF(OR(C22<G22,C22>I22),\"FORA DO INTERVALO\",\"OK\")","v":"OK"},6.4999999999999997E-3,6.4999999999999997E-3,6.4999999999999997E-3]
["3) ISSQN",1,2.5000000000000001E-2,{"$f":"C23*B23","v":2.5000000000000001E-2},null,"OK",0.02,3.5000000000000003E-2,0.05]
["4) CPRB",1,4.4999999999999998E-2,{"$f":"C24","v":4.4999999999999998E-2},null,"OK",4.4999999999999998E-2,4.4999999999999998E-2,4.4999999999999998E-2]
["5) Administração Central",1,0.04,0.04,null,"OK",0.03,0.04,5.5E-2]
["6) Despesas Financeiras",1,5.5999999999999999E-3,5.5999999999999999E-3,null,"FORA DO INTERVALO",5.8999999999999999E-3,1.23E-2,1.3899999999999999E-2]
["7) Seguros + Garantias",1,1.1999999999999999E-3,1.1999999999999999E-3,null,"FORA DO INTERVALO",8.0000000000000002E-3,8.0000000000000002E-3,0.01]
["8) Risco",1,9.7000000000000003E-3,9.7000000000000003E-3,null,"OK",9.7000000000000003E-3,1.2699999999999999E-2,1.2699999999999999E-2]
["9) Lucro",1,6.8699999999999997E-2,6.8699999999999997E-2,null,"OK",6.1600000000000002E-2,7.3999999999999996E-2,8.9599999999999999E-2]
["BDI - FINAL",null,null,{"$f":"(((1+D25+D27+D28)*(1+D26)*(1+D29))/(1-(D21+D22+D23+D24))-1)","v":0.26400243116731992},null,{"$f":"IF(OR(D30<G30,D30>I30),\"FORA DO INTERVALO\",\"OK\")","v":"FORA DO INTERVALO"},0.2034,0.22120000000000001,0.25]
[]
["Notas:"]
["(1) e (2) Alíquota definida por lei."]
["(3) Alíquota e base de cálculo definidas pela legislação municipal."]
["(4) Alíquota definida pelas leis 12.546/11, 12844/13 e 13.161/15 (CPRB – contribuição previdenciária sobre a receita bruta)."]
["(5) Valores definidos a partir dos limites no Acórdão nº 2.622/2013 - TCU – Plenário. Valores entre o 1º e 3º quartis."]
["(6) Valor calculado pela expressão matemática do acórdão 2.369/2011 – TCU – Plenário e disponibilizado pela AGETOP em dezembro de 2018. (Foi utilizado para o cálculo a média da Taxa SELIC no período de 11/2017 a 10/2018)"]
[]
["(7) Valores definidos pela AGETOP a partir dos limites no Acórdão nº 2.622/2013 - TCU – Plenário. Valores médios. \n\nObservação da AGETOP: (Seguros contra erros de execução, incêndio e explosão, danos da natureza (vendaval, destelhamento, alagamento, inundação, desmoronamento, geadas etc.), emprego de material defeituoso ou inadequado, roubo e/ou furto qualificado, quebra de equipamentos, desmoronamento de estrutura, nas modalidades de Obras Civis em Construção (OCC); Instalação e Montagem (IM); e Obras Civis em Construção e Instalação e Montagem (OCC/IM). Bem como coberturas adicionais para ampliação dessas coberturas básicas, como: cobertura de responsabilidade civil geral, cobertura de responsabilidade civil cruzada, cobertura de despesas extraordinárias, cobertura de tumultos, cobertura de desentulho do local, cobertura de riscos do fabricante, dentre outras, incluindo o seguro de vida em grupo regido pela convenção coletiva dos trabalhadores na indústria da construção civil). A partir de 24/02/2015 por intermédio da Portaria 449/2015 a Presidência da AGETOP, na pessoa do Senhor Jayme Eduardo Rincon, determinou a exclusão dos valores referentes aos Seguros de Risco de Engenharia e Responsabilidade Civil do Profissional na composição do cálculo do B.D.I.."]
["(8) Valores definidos a partir dos limites no Acórdão nº 2.622/2013 - TCU – Plenário. Valores entre 1º e 3° quartis."]
["(9) Valores definidos a partir dos limites definidos no Acórdão nº 2.622/2013 - TCU – Plenário. Valores adotados e praticados no mercado ( “ ex ante ” ) ou aqueles entre os 1º e 3º quartis."]
[]
["(*) A fórmula para estipulação da taxa de BDI estimado adotado é a mesma que foi aplicada para a obtenção das tabelas contidas no Acórdão n. 2.622/2013 – TCUPlenário"]
[]
["Obs.: Para obras com valores superiores a R$ 20.000.000,00 sugere-se recalcular o BDI, dimensionando as taxas de administração central e lucro para patamares inferiores ao estipulado acima."]

{"sheet":"Relatório CENTRAL","index":5,"n_rows":40,"n_cols":5,"rows_kept":40,"cut":false,"hidden":false,"merged":[[7,1,7,4],[8,1,8,2],[8,3,8,4],[9,1,9,2],[10,1,10,4],[11,1,11,4],[39,1,39,2],[9,0,11,0],[0,1,0,4],[6,3,6,4],[9,3,9,4],[1,1,1,4],[2,1,2,2],[2,3,2,4],[3,1,3,2],[3,3,3,4],[4,1,4,4],[5,1,5,2],[5,3,5,4],[6,1,6,2]]}
[]
[]
[null,"UNIDADE ESCOLAR",null,"CIDADE"]
[null,{"$f":"Orçamento!$O$4","v":"ESCOLA ESTADUAL VICENÇA MARIA DE JESUS"},null,{"$f":"Orçamento!$X$7","v":"ITAPACI"}]
[]
[null,"OBRA",null,"CRE"]
[null,{"$f":"Orçamento!$O$7","v":"REFORMA E AMPLIAÇÃO"},null,{"$f":"Orçamento!$O$10","v":"CRE-ITAPACI"}]
[]
[null,"ENDEREÇO",null,"DATA"]
["FILTRO",{"$f":"Orçamento!$R$10","v":" RUA PRINCIPAL S/N , VILA SANTANA , CEP:76360-000"},null,{"$f":"Orçamento!$S$7","v":"2020-06-17"}]
[]
[null,"RELATÓRIO CENTRAL"]
["↓","CÓDIGO","ETAPA","PREÇO  (R$) C/ BDI","PARTIC  ( % )"]
[{"$f":"IF(D14>0,\"F\",\"\")","v":""},{"$f":"Orçamento!O287","v":"a."},{"$f":"Orçamento!P287","v":"SERVIÇOS PRELIMINARES"},{"$f":"Orçamento!X287","v":0},{"$f":"Orçamento!AA287","v":0}]
[{"$f":"IF(D15>0,\"F\",\"\")","v":""},{"$f":"Orçamento!O288","v":"b."},{"$f":"Orçamento!P288","v":"TRANSPORTES"},{"$f":"Orçamento!X288","v":0},{"$f":"Orçamento!AA288","v":0}]
["",{"$f":"Orçamento!O289","v":"c."},{"$f":"Orçamento!P289","v":"SERVIÇO EM TERRA"},{"$f":"Orçamento!X289","v":0},{"$f":"Orçamento!AA289","v":0}]
["",{"$f":"Orçamento!O290","v":"d."},{"$f":"Orçamento!P290","v":"FUNDAÇÕES E SONDAGENS"},{"$f":"Orçamento!X290","v":0},{"$f":"Orçamento!AA290","v":0}]
["",{"$f":"Orçamento!O291","v":"e."},{"$f":"Orçamento!P291","v":"ESTRUTURA"},{"$f":"Orçamento!X291","v":0},{"$f":"Orçamento!AA291","v":0}]
["",{"$f":"Orçamento!O292","v":"f."},{"$f":"Orçamento!P292","v":"INSTALAÇÕES ELÉTRICAS"},{"$f":"Orçamento!X292","v":0},{"$f":"Orçamento!AA292","v":0}]
["",{"$f":"Orçamento!O293","v":"g."},{"$f":"Orçamento!P293","v":"INSTALAÇÕES HIDROSSANITÁRIAS"},{"$f":"Orçamento!X293","v":0},{"$f":"Orçamento!AA293","v":0}]
["",{"$f":"Orçamento!O294","v":"h"},{"$f":"Orçamento!P294","v":"INSTALAÇÕES ESPECIAIS"},{"$f":"Orçamento!X294","v":0},{"$f":"Orçamento!AA294","v":0}]
["",{"$f":"Orçamento!O295","v":"i."},{"$f":"Orçamento!P295","v":"ALVENARIAS E DIVISÓRIAS"},{"$f":"Orçamento!X295","v":0},{"$f":"Orçamento!AA295","v":0}]
["",{"$f":"Orçamento!O296","v":"j."},{"$f":"Orçamento!P296","v":"ALVENARIA AUTO-PORTANTE"},{"$f":"Orçamento!X296","v":0},{"$f":"Orçamento!AA296","v":0}]
["",{"$f":"Orçamento!O297","v":"k."},{"$f":"Orçamento!P297","v":"IMPERMEABILIZAÇÃO"},{"$f":"Orçamento!X297","v":0},{"$f":"Orçamento!AA297","v":0}]
["",{"$f":"Orçamento!O298","v":"l."},{"$f":"Orçamento!P298","v":"ISOLAMENTO TÉRMICO E ACÚSTICO"},{"$f":"Orçamento!X298","v":0},{"$f":"Orçamento!AA298","v":0}]
["",{"$f":"Orçamento!O299","v":"m."},{"$f":"Orçamento!P299","v":"ESTRUTURA DE MADEIRA"},{"$f":"Orçamento!X299","v":0},{"$f":"Orçamento!AA299","v":0}]
["",{"$f":"Orçamento!O300","v":"n."},{"$f":"Orçamento!P300","v":"ESTRUTURAS METÁLICAS"},{"$f":"Orçamento!X300","v":0},{"$f":"Orçamento!AA300","v":0}]
["",{"$f":"Orçamento!O301","v":"o."},{"$f":"Orçamento!P301","v":"COBERTURAS"},{"$f":"Orçamento!X301","v":0},{"$f":"Orçamento!AA301","v":0}]
["",{"$f":"Orçamento!O302","v":"p."},{"$f":"Orçamento!P302","v":"ESQUADRIAS DE MADEIRA"},{"$f":"Orçamento!X302","v":0},{"$f":"Orçamento!AA302","v":0}]
["",{"$f":"Orçamento!O303","v":"q."},{"$f":"Orçamento!P303","v":"ESQUADRIAS METÁLICAS"},{"$f":"Orçamento!X303","v":0},{"$f":"Orçamento!AA303","v":0}]
["",{"$f":"Orçamento!O304","v":"r."},{"$f":"Orçamento!P304","v":"VIDROS"},{"$f":"Orçamento!X304","v":0},{"$f":"Orçamento!AA304","v":0}]
["",{"$f":"Orçamento!O305","v":"s."},{"$f":"Orçamento!P305","v":"REVESTIMENTO DE PAREDE"},{"$f":"Orçamento!X305","v":0},{"$f":"Orçamento!AA305","v":0}]
["",{"$f":"Orçamento!O306","v":"t."},{"$f":"Orçamento!P306","v":"FORROS"},{"$f":"Orçamento!X306","v":0},{"$f":"Orçamento!AA306","v":0}]
["",{"$f":"Orçamento!O307","v":"u."},{"$f":"Orçamento!P307","v":"REVESTIMENTO DE PISO"},{"$f":"Orçamento!X307","v":0},{"$f":"Orçamento!AA307","v":0}]
["",{"$f":"Orçamento!O308","v":"v."},{"$f":"Orçamento!P308","v":"FERRAGENS"},{"$f":"Orçamento!X308","v":0},{"$f":"Orçamento!AA308","v":0}]
["",{"$f":"Orçamento!O309","v":"w."},{"$f":"Orçamento!P309","v":"MARCENARIA"},{"$f":"Orçamento!X309","v":0},{"$f":"Orçamento!AA309","v":0}]
["",{"$f":"Orçamento!O310","v":"x."},{"$f":"Orçamento!P310","v":"ADMINISTRAÇÃO"},{"$f":"Orçamento!X310","v":0},{"$f":"Orçamento!AA310","v":0}]
["",{"$f":"Orçamento!O311","v":"y."},{"$f":"Orçamento!P311","v":"PINTURA"},{"$f":"Orçamento!X311","v":0},{"$f":"Orçamento!AA311","v":0}]
["",{"$f":"Orçamento!O312","v":"z."},{"$f":"Orçamento!P312","v":"DIVERSOS"},{"$f":"Orçamento!X312","v":0},{"$f":"Orçamento!AA312","v":0}]
["F","TOTAL GERAL DO ORÇAMENTO (R$) C/BDI",null,{"$f":"SUM(D14:D39)","v":0},{"$f":"SUM(E14:E39)","v":0}]

{"sheet":"Parc Maior Relev","index":6,"n_rows":33,"n_cols":7,"rows_kept":33,"cut":false,"hidden":false,"merged":[[6,4,6,6],[7,1,7,6],[8,1,8,3],[8,4,8,6],[33,3,33,7],[31,1,31,6],[0,1,0,6],[11,1,11,6],[1,1,1,6],[2,1,2,3],[2,4,2,6],[3,1,3,3],[3,4,3,6],[4,1,4,6],[5,1,5,3],[5,4,5,6],[9,1,9,3],[9,4,9,6],[10,1,10,6],[6,1,6,3]]}
[]
[]
[null,"UNIDADE ESCOLAR",null,null,"CÓDIGO INEP"]
[null,{"$f":"Orçamento!$O$4","v":"ESCOLA ESTADUAL VICENÇA MARIA DE JESUS"},null,null,{"$f":"Orçamento!$X$4","v":52017362}]
[]
[null,"OBRA",null,null,"CIDADE"]
[null,{"$f":"Orçamento!$O$7","v":"REFORMA E AMPLIAÇÃO"},null,null,{"$f":"Orçamento!$X$7","v":"ITAPACI"}]
[]
[null,"CRE",null,null,"ÁREA TOTAL CONSTRUÍDA (M²)"]
[null,{"$f":"Orçamento!$O$10","v":"CRE-ITAPACI"},null,null,{"$f":"Orçamento!$X$13","v":619.86}]
[]
["FILTRO","PARCELA DE MAIOR RELEVÂNCIA"]
[{"$f":"IF(G14>0,\"F\",\"\")","v":""},"CÓDIGO","SERVIÇO","DESCRIÇÃO","UNID","QUANT","PARC. MAIOR RELEV (100%)"]
[{"$f":"IF(G14>0,\"F\",\"\")","v":""},"f.","INSTALAÇÕES ELÉTRICAS","SUBESTAÇÃO","KVA",{"$f":"SUMIF(Orçamento!$R$268:$R$268,'Parc Maior Relev'!D14,Orçamento!$T$268:$T$268)","v":0},{"$f":"F14","v":0}]
[{"$f":"IF(SUM(G16:G30)>0,\"F\",\"\")","v":"F"},"CÓDIGO","SERVIÇO","DESCRIÇÃO","UNID","QUANT","PARC. MAIOR RELEV (50%)"]
[{"$f":"IF(G16>0,\"F\",\"\")","v":""},"e.","ESTRUTURA","CONCRETO","M3",{"$f":"SUMIF(Orçamento!$R$268:$R$268,'Parc Maior Relev'!D16,Orçamento!$T$268:$T$268)","v":0},{"$f":"F16*0.5","v":0}]
[{"$f":"IF(G17>0,\"F\",\"\")","v":""},"f.","INSTALAÇÕES ELÉTRICAS","INSTALAÇÕES ELÉTRICAS","KVA",{"$f":"SUMIF(Orçamento!$R$268:$R$268,'Parc Maior Relev'!D17,Orçamento!$T$268:$T$268)","v":0},{"$f":"F17*0.5","v":0}]
[{"$f":"IF(G18>0,\"F\",\"\")","v":""},"o.","COBERTURAS","COBERTURA CERÂMICA","M2",{"$f":"SUMIF(Orçamento!$R$268:$R$268,'Parc Maior Relev'!D18,Orçamento!$T$268:$T$268)","v":0},0]
["","o.","COBERTURAS","COBERTURA COM TELHA METÁLICA","M2",{"$f":"SUMIF(Orçamento!$R$268:$R$268,'Parc Maior Relev'!D19,Orçamento!$T$268:$T$268)","v":0},0]
["","s.","REVESTIMENTO DE PAREDE","CHAPISCO","M2",{"$f":"SUMIF(Orçamento!$R$268:$R$268,'Parc Maior Relev'!D20,Orçamento!$T$268:$T$268)","v":0},0]
["F","s.","REVESTIMENTO DE PAREDE","REBOCO","M2",720.44029234604454,360.22014617302227]
["","s.","REVESTIMENTO DE PAREDE","REVESTIMENTO CERÂMICO","M2",{"$f":"SUMIF(Orçamento!$R$268:$R$268,'Parc Maior Relev'!D22,Orçamento!$T$268:$T$268)","v":0},0]
["","t.","FORROS","FORRO DE GESSO","M2",{"$f":"SUMIF(Orçamento!$R$268:$R$268,'Parc Maior Relev'!D23,Orçamento!$T$268:$T$268)","v":0},0]
["","t.","FORROS","FORRO DE PVC","M2",{"$f":"SUMIF(Orçamento!$R$268:$R$268,'Parc Maior Relev'!D24,Orçamento!$T$268:$T$268)","v":0},0]
["","t.","FORROS","FORRO DE GESSO ACARTONADO","M2",{"$f":"SUMIF(Orçamento!$R$268:$R$268,'Parc Maior Relev'!D25,Orçamento!$T$268:$T$268)","v":0},0]
["F","u.","REVESTIMENTO DE PISO","PISO DE GRANITINA","M2",279.19,139.595]
["","u.","REVESTIMENTO DE PISO","PISO LAMINADO","M2",{"$f":"SUMIF(Orçamento!$R$268:$R$268,'Parc Maior Relev'!D27,Orçamento!$T$268:$T$268)","v":0},0]
["","u.","REVESTIMENTO DE PISO","PISO DE CONCRETO DESEMPENADO","M2",{"$f":"SUMIF(Orçamento!$R$268:$R$268,'Parc Maior Relev'!D28,Orçamento!$T$268:$T$268)","v":0},0]
["","u.","REVESTIMENTO DE PISO","PISO CERÂMICO","M2",{"$f":"SUMIF(Orçamento!$R$268:$R$268,'Parc Maior Relev'!D29,Orçamento!$T$268:$T$268)","v":0},0]
["","y.","PINTURA","PINTURA","M2",{"$f":"SUMIF(Orçamento!$R$268:$R$268,'Parc Maior Relev'!D30,Orçamento!$T$268:$T$268)","v":0},0]
["F"]
["F","(*) Para os fins do inciso I dp § 1º do Art. 30 da Lei Federal 8.666/93, são consideradas parcelas de maior relevância técnica as execuções apresentadas"]
["F"]

{"sheet":"Composições","index":7,"n_rows":27,"n_cols":10,"rows_kept":27,"cut":false,"hidden":false,"merged":[[16,5,17,5],[16,6,16,7],[16,8,16,9],[21,1,21,7],[26,1,26,7],[16,0,17,0],[16,1,17,1],[16,2,17,2],[16,3,17,3],[16,4,17,4],[15,0,15,9],[13,0,13,2],[13,3,13,6],[1,0,1,9],[3,7,3,9],[4,7,4,9],[6,7,6,9],[7,7,7,9],[6,0,6,6],[10,8,10,9],[13,8,13,9],[14,0,14,9],[8,0,8,9],[5,0,5,9],[2,0,2,9],[0,0,0,8],[10,0,10,2],[10,3,10,6],[11,0,11,9],[12,0,12,2],[12,3,12,6],[12,7,12,8],[7,0,7,6],[9,0,9,2],[9,3,9,6],[9,7,9,8],[3,0,3,6],[4,0,4,6]]}
[]
[]
[]
["UNIDADE ESCOLAR",null,null,null,null,null,null,"CÓDIGO INEP"]
[{"$f":"Orçamento!$O$4","v":"ESCOLA ESTADUAL VICENÇA MARIA DE JESUS"},null,null,null,null,null,null,{"$f":"Orçamento!$X$4","v":52017362}]
[]
["OBRA",null,null,null,null,null,null,"CIDADE"]
[{"$f":"Orçamento!$O$7","v":"REFORMA E AMPLIAÇÃO"},null,null,null,null,null,null,{"$f":"Orçamento!$X$7","v":"ITAPACI"}]
[]
["CRE",null,null,"ENDEREÇO",null,null,null,"REFERÊNCIA AGETOP"]
[{"$f":"Orçamento!$O$10","v":"CRE-ITAPACI"},null,null,{"$f":"Orçamento!$R$10","v":" RUA PRINCIPAL S/N , VILA SANTANA , CEP:76360-000"},null,null,null,{"$f":"Orçamento!$S$10","v":"ABR/19"},{"$f":"Orçamento!$T$10","v":"DESONERADA"}]
[]
["DATA",null,null,"ÁREA TOTAL CONSTRUÍDA (M²)",null,null,null,"REFERÊNCIA SINAPI"]
[{"$f":"Orçamento!$S$7","v":"2020-06-17"},null,null,{"$f":"Orçamento!$X$13","v":619.86},null,null,null,{"$f":"Orçamento!$X$10","v":"ABR/20"},{"$f":"Orçamento!$Y$10","v":"DESONERADA"}]
[]
["COMPOSIÇÕES DE CUSTOS UNITÁRIOS - SEE-GO"]
[415,"FONTE","CÓDIGO","DESCRIÇÃO","UNIDADE","COEFIC.","CUSTO UNITÁRIO",null,"CUSTO  TOTAL (A) + (B) + (C) + (D) + (E)"]
[null,null,null,null,null,null,"DESONERADO","NÃO DESONER.","DESONERADO","NÃO DESONER."]
[null,"COMPOSIÇÃO","COMP 415_SEE","PEITORIL EM GRANITO CINZA, LARGURA VARIÁVEL E PINGADEIRA","M2",null,null,null,204.79,207.57999999999998]
[null,"AGETOP_I",28,"AZULEJISTA","h     ",0.66910000000000003,13.95,16.16,9.33,10.81]
[null,"AGETOP_I",5,"SERVENTE","h     ",0.93879999999999997,8.75,10.14,8.2100000000000009,9.52]
[null,"MÃO DE OBRA (B) - TOTAL",null,null,null,null,null,null,17.54,20.329999999999998]
[null,"AGETOP_I",1421,"GRANITO POLIDO P/BANCADA 2 CM","m2",1,180,180,180,180]
[null,"AGETOP_I",1215,"CIMENTO PORTLAND C.P. 32","Kg",10.34,0.39,0.39,4.03,4.03]
[null,"AGETOP_I",2690,"ARGAMASSA DE REJUNTAMENTO","Kg",0.32,3.54,3.54,1.1299999999999999,1.1299999999999999]
[null,"AGETOP_I",104,"AREIA MEDIA ","m3",2.52E-2,82.85,82.85,2.09,2.09]
[null,"MATERIAL (C) - TOTAL",null,null,null,null,null,null,187.25,187.25]