{"text_format":"1","workbook":"xlsx","n_sheets":7,"sheets":["Orçamento","Resumo ","Somatório","Cronog_60_Dias","Composição BDI","Relatório CENTRAL","Parc Maior Relev"],"not_rendered":{"charts":0,"images":4,"macros":1,"external_links":0,"defined_names":102,"comments":0,"pivot_tables":0},"unopened":[],"bounds":{"document_bytes":16777216,"sheet_cells":100000,"rows_first":2000,"rows_last":500,"rows_between":2000,"halvings":0,"cell_chars":16384,"cell_head_chars":4096},"cells_cut":0,"cells_raw":0,"read":"whole","date_system":"1900"}

{"sheet":"Orçamento","index":0,"n_rows":330,"n_cols":27,"rows_kept":330,"cut":false,"hidden":false,"merged":[[10,24,10,25],[9,23,9,25],[311,18,311,22],[312,15,312,17],[312,18,312,22],[313,15,313,17],[313,18,313,22],[308,15,308,17],[308,18,308,22],[309,15,309,17],[309,18,309,22],[310,15,310,17],[310,18,310,22],[304,14,304,26],[305,18,305,22],[306,15,306,17],[306,18,306,22],[291,15,291,17],[271,15,271,17],[326,18,326,22],[314,15,314,17],[314,18,314,22],[315,15,315,17],[315,18,315,22],[316,15,316,17],[316,18,316,22],[320,15,320,17],[320,18,320,22],[321,15,321,17],[321,18,321,22],[322,15,322,17],[311,15,311,17],[317,15,317,17],[317,18,317,22],[318,15,318,17],[318,18,318,22],[319,15,319,17],[319,18,319,22],[323,23,323,25],[324,23,324,25],[325,23,325,25],[326,23,326,25],[327,23,327,25],[328,23,328,25],[329,23,329,25],[298,14,298,17],[305,15,305,17],[329,18,329,22],[326,14,326,17],[323,15,323,17],[323,18,323,22],[324,15,324,17],[324,18,324,22],[325,15,325,17],[325,18,325,22],[328,18,328,22],[327,18,327,22],[0,14,0,26],[262,16,262,24],[263,16,263,24],[264,16,264,24],[11,14,11,26],[14,14,14,26],[3,14,3,22],[4,14,4,22],[6,18,6,22],[7,18,7,22],[12,18,12,22],[13,18,13,22],[7,14,7,17],[6,14,6,17],[4,23,4,25],[3,23,3,25],[6,23,6,25],[7,23,7,25],[9,18,9,20],[254,17,259,17],[254,22,254,24],[255,22,255,24],[256,22,256,24],[258,22,258,23],[265,16,265,24],[271,23,271,25],[287,23,287,25],[288,23,288,25],[307,15,307,17],[307,18,307,22],[266,16,266,24],[284,15,284,17],[285,15,285,17],[270,14,270,26],[271,18,271,22],[272,18,272,22],[280,18,280,22],[281,18,281,22],[282,18,282,22],[283,18,283,22],[295,18,295,22],[292,15,292,17],[272,15,272,17],[273,15,273,17],[274,15,274,17],[275,15,275,17],[276,15,276,17],[277,15,277,17],[278,15,278,17],[279,15,279,17],[280,15,280,17],[289,23,289,25],[290,23,290,25],[288,15,288,17],[289,15,289,17],[290,15,290,17],[291,23,291,25],[286,15,286,17],[287,15,287,17],[285,23,285,25],[286,23,286,25],[301,18,301,22],[277,18,277,22],[278,18,278,22],[276,18,276,22],[285,18,285,22],[267,18,267,24],[273,18,273,22],[274,18,274,22],[275,18,275,22],[298,18,298,22],[296,18,296,22],[297,18,297,22],[287,18,287,22],[294,18,294,22],[290,18,290,22],[292,18,292,22],[288,18,288,22],[289,18,289,22],[298,23,298,25],[292,23,292,25],[293,23,293,25],[294,23,294,25],[295,23,295,25],[296,23,296,25],[300,18,300,22],[1,14,1,24],[9,14,9,16],[10,14,10,16],[12,14,12,16],[13,14,13,16],[15,14,15,24],[2,14,2,24],[5,14,5,24],[8,14,8,24],[284,18,284,22],[281,15,281,17],[282,15,282,17],[283,15,283,17],[293,18,293,22],[291,18,291,22],[299,18,299,22],[286,18,286,22],[279,18,279,22],[293,15,293,17],[294,15,294,17],[296,15,296,17],[297,15,297,17],[299,23,299,25],[284,23,284,25],[320,23,320,25],[321,23,321,25],[322,23,322,25],[305,23,305,25],[306,23,306,25],[307,23,307,25],[308,23,308,25],[309,23,309,25],[310,23,310,25],[311,23,311,25],[312,23,312,25],[313,23,313,25],[314,23,314,25],[315,23,315,25],[316,23,316,25],[317,23,317,25],[318,23,318,25],[319,23,319,25],[295,15,295,17],[300,23,300,25],[301,23,301,25],[322,18,322,22],[259,22,259,23],[260,22,260,23],[7,12,7,13],[6,12,6,13],[13,23,13,25],[12,23,12,25],[10,19,10,22],[297,23,297,25],[272,23,272,25],[273,23,273,25],[274,23,274,25],[275,23,275,25],[276,23,276,25],[277,23,277,25],[278,23,278,25],[279,23,279,25],[280,23,280,25],[281,23,281,25],[282,23,282,25],[283,23,283,25]]}
[]
[]
[]
[null,null,null,null,null,null,null,null,null,null,null,null,null,null,"UNIDADE ESCOLAR",null,null,null,null,null,null,null,null,"CÓDIGO INEP"]
[null,null,null,null,null,null,null,null,null,null,null,null,"",null,"CENTRO DE ENSINO EM PERÍODO INTEGRAL JOSÉ EDUARDO DO COUTO",null,null,null,null,null,null,null,null,52024148]
[]
["Nmax",null,null,null,null,null,null,null,null,null,null,null,null,null,"OBRA",null,null,null,"DATA",null,null,null,null,"CIDADE"]
[{"$f":"MAX($C$19:$C$254)","v":4},null,null,null,null,null,null,null,null,null,null,null,null,null,"REFORMA",null,null,null,"2020-05-26",null,null,null,null,"ITAGUARI"]
[]
[null,null,null,null,null,null,null,null,null,null,null,null,null,null,"CRE",null,null,"ENDEREÇO","REFERÊNCIA AGETOP",null,null,null,null,"REFERÊNCIA SINAPI"]
[null,null,null,null,null,null,null,null,null,null,null,null,null,null,"CRE-ITABERAI",null,null," RUA JOSE FERNANDES CARVALHARES 197 Nº 197 , CENTRO , CEP: 7665-000","ABR/19","DESONERADA",null,null,null,"MAR/20","DESONERADA"]
[]
[null,null,null,null,null,null,null,null,null,null,null,null,null,null,"ÁREA EXISTENTE (M²)",null,null,"ÁREA A CONSTRUIR (M²)","ÁREA A DEMOLIR (M²)",null,null,null,null,"ÁREA TOTAL CONSTRUÍDA (M²)"]
[null,null,null,null,null,null,null,null,null,null,null,null,null,null,970.52,null,null,null,null,null,null,null,null,970.52]
[]
[null,null,null,null,null,null,null,null,null,null,null,"FILTRO",null,null,"PLANILHA ORÇAMENTÁRIA"]
["Nível E","Save Nivel","Nível C","Altura","n1","n2","n3","n4","n5","Czero","Cnível","↓","Nível","Nível Corrigido","ITEM","TABELA","CODIGO","DESCRIÇÃO DOS SERVIÇOS","UNID","QUANT","REPET","QUANT TOTAL","MAT","MO","T.SERVIÇO UNIT","VALOR TOTAL","OBSERVAÇÕES¹"]
[{"$f":"CHOOSE(1+LOG(1+2*(ORÇAMENTO.Nivel=\"Nível 1\")+4*(ORÇAMENTO.Nivel=\"Nível 2\")+8*(ORÇAMENTO.Nivel=\"Nível 3\")+16*(ORÇAMENTO.Nivel=\"Nível 4\")+32*(ORÇAMENTO.Nivel=\"Serviço\"),2),0,1,2,3,4,\"S\")","v":"S"},{"$f":"IF(OR(C18=\"s\",C18=0),OFFSET(B18,-1,0),C18)","v":"Save Nivel"},{"$f":"IF(OFFSET(C18,-1,0)=\"L\",1,IF(OFFSET(C18,-1,0)=1,2,IF(OR(A18=\"s\",A18=0),\"S\",IF(AND(OFFSET(C18,-1,0)=2,A18=4),3,IF(AND(OR(OFFSET(C18,-1,0)=\"s\",OFFSET(C18,-1,0)=0),A18<>\"s\",A18>OFFSET(B18,-1,0)),OFFSET(B18,-1,0),A18)))))","v":"S"},{"$f":"IF(OR(C18=\"S\",C18=0),0,IF(ISERROR(K18),J18,SMALL(J18:K18,1)))","v":0},{"$f":"IF($C18=1,OFFSET(E18,-1,0)+1,OFFSET(E18,-1,0))","v":"n1"},{"$f":"IF($C18=1,0,IF($C18=2,OFFSET(F18,-1,0)+1,OFFSET(F18,-1,0)))","v":"n2"},{"$f":"IF(AND($C18<=2,$C18<>0),0,IF($C18=3,OFFSET(G18,-1,0)+1,OFFSET(G18,-1,0)))","v":"n3"},{"$f":"IF(AND($C18<=3,$C18<>0),0,IF($C18=4,OFFSET(H18,-1,0)+1,OFFSET(H18,-1,0)))","v":"n4"},{"$f":"IF(AND($C18<=4,$C18<>0),0,IF(AND($C18=\"S\",$Y18>0),OFFSET(I18,-1,0)+1,OFFSET(I18,-1,0)))","v":"n5"},{"$f":"IF(OR($C18=\"S\",$C18=0),0,MATCH(0,OFFSET($D18,1,$C18,ROW($C$254)-ROW($C18)),0))","v":0},{"$f":"IF(OR($C18=\"S\",$C18=0),0,MATCH(OFFSET($D18,0,$C18)+1,OFFSET($D18,1,$C18,ROW($C$254)-ROW($C18)),0))","v":0},"","Serviço","Serviço","-","SINAPI",null,"(sem código)","-",null,"REPET","-",0,0,0,"-",""]
[0,null,"L",{"$f":"COUNTA(OFFSET(D19,1,0):D$254)","v":234},{"$f":"LEFT(O20,1)-1","v":0},null,null,null,null,null,null,"F","LOTE","LOTE","REFORMA - CENTRO DE ENSINO EM PERÍODO INTEGRAL JOSÉ EDUARDO DO COUTO",null,null,null,null,null,null,null,null,null,null,0]
[1,{"$f":"IF(OR(C20=\"s\",C20=0),OFFSET(B20,-1,0),C20)","v":1},{"$f":"IF(OFFSET(C20,-1,0)=\"L\",1,IF(OFFSET(C20,-1,0)=1,2,IF(OR(A20=\"s\",A20=0),\"S\",IF(AND(OFFSET(C20,-1,0)=2,A20=4),3,IF(AND(OR(OFFSET(C20,-1,0)=\"s\",OFFSET(C20,-1,0)=0),A20<>\"s\",A20>OFFSET(B20,-1,0)),OFFSET(B20,-1,0),A20)))))","v":1},{"$f":"IF(OR(C20=\"S\",C20=0),0,IF(ISERROR(K20),J20,SMALL(J20:K20,1)))","v":234},{"$f":"IF($C20=1,OFFSET(E20,-1,0)+1,OFFSET(E20,-1,0))","v":1},{"$f":"IF($C20=1,0,IF($C20=2,OFFSET(F20,-1,0)+1,OFFSET(F20,-1,0)))","v":0},{"$f":"IF(AND($C20<=2,$C20<>0),0,IF($C20=3,OFFSET(G20,-1,0)+1,OFFSET(G20,-1,0)))","v":0},{"$f":"IF(AND($C20<=3,$C20<>0),0,IF($C20=4,OFFSET(H20,-1,0)+1,OFFSET(H20,-1,0)))","v":0},0,{"$f":"IF(OR($C20=\"S\",$C20=0),0,MATCH(0,OFFSET($D20,1,$C20,ROW($C$254)-ROW($C20)),0))","v":234},{"$f":"IF(OR($C20=\"S\",$C20=0),0,MATCH(OFFSET($D20,0,$C20)+1,OFFSET($D20,1,$C20,ROW($C$254)-ROW($C20)),0))","v":{"$error":"#N/A"}},"F","Nível 1","Nível 1","1.","AGETOP",null,"REFORMA","UN",1,1,1,null,null,0,0]
[2,{"$f":"IF(OR(C21=\"s\",C21=0),OFFSET(B21,-1,0),C21)","v":2},{"$f":"IF(OFFSET(C21,-1,0)=\"L\",1,IF(OFFSET(C21,-1,0)=1,2,IF(OR(A21=\"s\",A21=0),\"S\",IF(AND(OFFSET(C21,-1,0)=2,A21=4),3,IF(AND(OR(OFFSET(C21,-1,0)=\"s\",OFFSET(C21,-1,0)=0),A21<>\"s\",A21>OFFSET(B21,-1,0)),OFFSET(B21,-1,0),A21)))))","v":2},{"$f":"IF(OR(C21=\"S\",C21=0),0,IF(ISERROR(K21),J21,SMALL(J21:K21,1)))","v":25},{"$f":"IF($C21=1,OFFSET(E21,-1,0)+1,OFFSET(E21,-1,0))","v":1},{"$f":"IF($C21=1,0,IF($C21=2,OFFSET(F21,-1,0)+1,OFFSET(F21,-1,0)))","v":1},{"$f":"IF(AND($C21<=2,$C21<>0),0,IF($C21=3,OFFSET(G21,-1,0)+1,OFFSET(G21,-1,0)))","v":0},{"$f":"IF(AND($C21<=3,$C21<>0),0,IF($C21=4,OFFSET(H21,-1,0)+1,OFFSET(H21,-1,0)))","v":0},0,233,25,"","Nível 2","Nível 2","-","AGETOP",null,"SERVIÇOS PRELIMINARES","-",null,1,"-",null,null,0,0]
[3,3,3,10,1,1,1,0,0,24,10,"","Nível 3","Nível 3","-","SINAPI",null,"CASA ZELADOR / NOVA SECRETARIA","-",null,1,"-",0,0,0,0,""]
[{"$f":"CHOOSE(1+LOG(1+2*(ORÇAMENTO.Nivel=\"Nível 1\")+4*(ORÇAMENTO.Nivel=\"Nível 2\")+8*(ORÇAMENTO.Nivel=\"Nível 3\")+16*(ORÇAMENTO.Nivel=\"Nível 4\")+32*(ORÇAMENTO.Nivel=\"Serviço\"),2),0,1,2,3,4,\"S\")","v":"S"},3,"S",0,1,1,1,0,0,0,0,"","Serviço","Serviço","-","AGETOP",20112,"DEM.PISO CERAM. INCLUS. RETIRADA DE CONTRAPISO SOBRE LASTRO CONC.C/TR.CB.E CARGA","m2    ",23.8,1,23.8,null,null,0,0,""]
["S",3,"S",0,1,1,1,0,0,0,0,"","Serviço","Serviço","-","AGETOP",20121,"DEM. MANUAL EM CONCR.SIMPLES C/TR.ATE CB.E CARGA (O.C.)","m3    ",1.02,1,1.02,null,null,0,0,""]
["S",{"$f":"IF(OR(C25=\"s\",C25=0),OFFSET(B25,-1,0),C25)","v":3},{"$f":"IF(OFFSET(C25,-1,0)=\"L\",1,IF(OFFSET(C25,-1,0)=1,2,IF(OR(A25=\"s\",A25=0),\"S\",IF(AND(OFFSET(C25,-1,0)=2,A25=4),3,IF(AND(OR(OFFSET(C25,-1,0)=\"s\",OFFSET(C25,-1,0)=0),A25<>\"s\",A25>OFFSET(B25,-1,0)),OFFSET(B25,-1,0),A25)))))","v":"S"},{"$f":"IF(OR(C25=\"S\",C25=0),0,IF(ISERROR(K25),J25,SMALL(J25:K25,1)))","v":0},{"$f":"IF($C25=1,OFFSET(E25,-1,0)+1,OFFSET(E25,-1,0))","v":1},{"$f":"IF($C25=1,0,IF($C25=2,OFFSET(F25,-1,0)+1,OFFSET(F25,-1,0)))","v":1},{"$f":"IF(AND($C25<=2,$C25<>0),0,IF($C25=3,OFFSET(G25,-1,0)+1,OFFSET(G25,-1,0)))","v":1},{"$f":"IF(AND($C25<=3,$C25<>0),0,IF($C25=4,OFFSET(H25,-1,0)+1,OFFSET(H25,-1,0)))","v":0},{"$f":"IF(AND($C25<=4,$C25<>0),0,IF(AND($C25=\"S\",$Y25>0),OFFSET(I25,-1,0)+1,OFFSET(I25,-1,0)))","v":0},0,0,"","Serviço","Serviço","-","SINAPI",97622,"DEMOLIÇÃO DE ALVENARIA DE BLOCO FURADO, DE FORMA MANUAL, SEM REAPROVEITAMENTO. AF_12/2017","M3",1.49,1,1.49,null,null,0,0,"Referência: AGETOP - 20118"]
["S",3,"S",0,1,1,1,0,0,0,0,"","Serviço","Serviço","-","SINAPI",97644,"REMOÇÃO DE PORTAS, DE FORMA MANUAL, SEM REAPROVEITAMENTO. AF_12/2017","M2",11.55,1,11.55,null,null,0,0,"Referência: AGETOP - 20106"]
["S",3,"S",0,1,1,1,0,0,0,0,"","Serviço","Serviço","-","SINAPI",97645,"REMOÇÃO DE JANELAS, DE FORMA MANUAL, SEM REAPROVEITAMENTO. AF_12/2017","M2",4.2,1,4.2,null,null,0,0,"Referência: AGETOP - 20106"]
["S",3,"S",0,1,1,1,0,0,0,0,"","Serviço","Serviço","-","AGETOP",20137,"DEMOLIÇAO BACIA SANITARIA C/ TRANSP. ATÉ CB. E CARGA","Un    ",1,1,1,null,null,0,0,""]
["S",3,"S",0,1,1,1,0,0,0,0,"","Serviço","Serviço","-","AGETOP",20141,"DEMOLIÇAO DE CAIXA DESCARGA EXTERNA C/ TRANSP. ATÉ CB. E CARGA","Un    ",1,1,1,null,null,0,0,""]
["S",3,"S",0,1,1,1,0,0,0,0,"","Serviço","Serviço","-","AGETOP",20163,"DEMOLIÇÃO DAS INSTALAÇÕES HIDROSANITÁRIAS E AFINS C/ TRANSP. ATÉ CB. E CARGA","H     ",2,1,2,null,null,0,0,""]
["S",3,"S",0,1,1,1,0,0,0,0,"","Serviço","Serviço","-","AGETOP",20138,"DEMOLIÇAO DE LAVATÓRIO C/ TRANSP. ATÉ CB. E CARGA","Un    ",1,1,1,null,null,0,0,""]
[3,3,3,3,1,1,2,0,0,14,3,"","Nível 3","Nível 3","-","SINAPI",null,"ACESSO NOVA SECRETARIA","-",null,1,"-",null,null,0,0,""]
["S",3,"S",0,1,1,2,0,0,0,0,"","Serviço","Serviço","-","SINAPI",97622,"DEMOLIÇÃO DE ALVENARIA DE BLOCO FURADO, DE FORMA MANUAL, SEM REAPROVEITAMENTO. AF_12/2017","M3",0.67,1,0.67,null,null,0,0,"Referência: AGETOP - 20118"]
["S",3,"S",0,1,1,2,0,0,0,0,"","Serviço","Serviço","-","AGETOP",20121,"DEM. MANUAL EM CONCR.SIMPLES C/TR.ATE CB.E CARGA (O.C.)","m3    ",3.43,1,3.43,null,null,0,0,""]
[3,3,3,3,1,1,3,0,0,11,3,"","Nível 3","Nível 3","-","SINAPI",null,"ACESSO COLÉGIO / QUADRA","-",null,1,"-",null,null,0,0,""]
["S",3,"S",0,1,1,3,0,0,0,0,"","Serviço","Serviço","-","SINAPI",97622,"DEMOLIÇÃO DE ALVENARIA DE BLOCO FURADO, DE FORMA MANUAL, SEM REAPROVEITAMENTO. AF_12/2017","M3",1.1200000000000001,1,1.1200000000000001,null,null,0,0,"Referência: AGETOP - 20118"]
["S",3,"S",0,1,1,3,0,0,0,0,"","Serviço","Serviço","-","SINAPI",97644,"REMOÇÃO DE PORTAS, DE FORMA MANUAL, SEM REAPROVEITAMENTO. AF_12/2017","M2",5.62,1,5.62,null,null,0,0,"Referência: AGETOP - 20106"]
[3,3,3,2,1,1,4,0,0,8,2,"","Nível 3","Nível 3","-","SINAPI",null,"CALÇADAS","-",null,1,"-",null,null,0,0,""]
["S",3,"S",0,1,1,4,0,0,0,0,"","Serviço","Serviço","-","AGETOP",20121,"DEM. MANUAL EM CONCR.SIMPLES C/TR.ATE CB.E CARGA (O.C.)","m3    ",17.82,1,17.82,null,null,0,0,""]
[3,3,3,4,1,1,5,0,0,6,4,"","Nível 3","Nível 3","-","SINAPI",null,"INST. ELÉTRICAS","-",null,1,"-",null,null,0,0,""]
["S",3,"S",0,1,1,5,0,0,0,0,"","Serviço","Serviço","-","SINAPI",97661,"REMOÇÃO DE CABOS ELÉTRICOS, DE FORMA MANUAL, SEM REAPROVEITAMENTO. AF_12/2017","M",3000,1,3000,null,null,0,0,""]
["S",3,"S",0,1,1,5,0,0,0,0,"","Serviço","Serviço","-","SINAPI",97660,"REMOÇÃO DE INTERRUPTORES/TOMADAS ELÉTRICAS, DE FORMA MANUAL, SEM REAPROVEITAMENTO. AF_12/2017","UN",65,1,65,null,null,0,0,""]
["S",3,"S",0,1,1,5,0,0,0,0,"","Serviço","Serviço","-","SINAPI",97665,"REMOÇÃO DE LUMINÁRIAS, DE FORMA MANUAL, SEM REAPROVEITAMENTO. AF_12/2017","UN",102,1,102,null,null,0,0,""]
[{"$f":"CHOOSE(1+LOG(1+2*(ORÇAMENTO.Nivel=\"Nível 1\")+4*(ORÇAMENTO.Nivel=\"Nível 2\")+8*(ORÇAMENTO.Nivel=\"Nível 3\")+16*(ORÇAMENTO.Nivel=\"Nível 4\")+32*(ORÇAMENTO.Nivel=\"Serviço\"),2),0,1,2,3,4,\"S\")","v":3},3,3,2,1,1,6,0,0,2,{"$error":"#N/A"},"","Nível 3","Nível 3","-","SINAPI",null,"OUTROS","-",null,1,"-",null,null,0,0,""]
["S",3,"S",0,1,1,6,0,0,0,0,"","Serviço","Serviço","-","AGETOP",21301,"PLACA DE OBRA PLOTADA EM CHAPA METÁLICA 26 , AFIXADA EM CAVALETES DE MADEIRA DE LEI (VIGOTAS 6X12CM) - PADRÃO GOINFRA","m2    ",7.5,1,7.5,null,null,0,0,""]
[2,2,2,3,1,2,0,0,0,208,3,"","Nível 2","Nível 2","-","AGETOP",null,"TRANSPORTES","-",null,1,"-",null,null,0,0,""]
["S",2,"S",0,1,2,0,0,0,0,0,"","Serviço","Serviço","-","SINAPI",72900,"TRANSPORTE DE ENTULHO COM CAMINHAO BASCULANTE 6 M3, RODOVIA PAVIMENTADA, DMT 0,5 A 1,0 KM","M3",31.97,1,31.97,null,null,0,0,""]
["S",2,"S",0,1,2,0,0,0,0,0,"","Serviço","Serviço","-","SINAPI",72897,"CARGA MANUAL DE ENTULHO EM CAMINHAO BASCULANTE 6 M3","M3",31.97,1,31.97,null,null,0,0,""]
[2,2,2,10,1,3,0,0,0,205,10,"","Nível 2","Nível 2","-","AGETOP",null,"SERVIÇO EM TERRA","-",null,1,"-",null,null,0,0,""]
[3,3,3,3,1,3,1,0,0,9,3,"","Nível 3","Nível 3","-","SINAPI",null,"INST. ELÉTRICAS","-",null,1,"-",null,null,0,0,""]
["S",3,"S",0,1,3,1,0,0,0,0,"","Serviço","Serviço","-","SINAPI",93358,"ESCAVAÇÃO MANUAL DE VALA COM PROFUNDIDADE MENOR OU IGUAL A 1,30 M. AF_03/2016","M3",12,1,12,null,null,0,0,"Referência: AGETOP - 40101"]
["S",3,"S",0,1,3,1,0,0,0,0,"","Serviço","Serviço","-","SINAPI",96995,"REATERRO MANUAL APILOADO COM SOQUETE. AF_10/2017","M3",12,1,12,null,null,0,0,"Referência: AGETOP - 40902"]
[3,3,3,3,1,3,2,0,0,6,3,"","Nível 3","Nível 3","-","SINAPI",null,"INST. HIDROSSANITÁRIAS","-",null,1,"-",null,null,0,0,""]
["S",3,"S",0,1,3,2,0,0,0,0,"","Serviço","Serviço","-","SINAPI",93358,"ESCAVAÇÃO MANUAL DE VALA COM PROFUNDIDADE MENOR OU IGUAL A 1,30 M. AF_03/2016","M3",6,1,6,null,null,0,0,"Referência: AGETOP - 40101"]
["S",3,"S",0,1,3,2,0,0,0,0,"","Serviço","Serviço","-","SINAPI",96995,"REATERRO MANUAL APILOADO COM SOQUETE. AF_10/2017","M3",6,1,6,null,null,0,0,"Referência: AGETOP - 40902"]
[3,3,3,3,1,3,3,0,0,3,122,"","Nível 3","Nível 3","-","SINAPI",null,"OUTROS","-",null,1,"-",null,null,0,0,""]
[{"$f":"CHOOSE(1+LOG(1+2*(ORÇAMENTO.Nivel=\"Nível 1\")+4*(ORÇAMENTO.Nivel=\"Nível 2\")+8*(ORÇAMENTO.Nivel=\"Nível 3\")+16*(ORÇAMENTO.Nivel=\"Nível 4\")+32*(ORÇAMENTO.Nivel=\"Serviço\"),2),0,1,2,3,4,\"S\")","v":"S"},3,"S",0,1,3,3,0,0,0,0,"","Serviço","Serviço","-","AGETOP",41140,"REGULARIZAÇÃO DO TERRENO SEM APILOAMENTO COM TRANSPORTE MANUAL DA TERRA ESCAVADA ","m2    ",68.709999999999994,1,68.709999999999994,null,null,0,0,""]
["S",3,"S",0,1,3,3,0,0,0,0,"","Serviço","Serviço","-","AGETOP",41002,"APILOAMENTO","m2    ",68.709999999999994,1,68.709999999999994,null,null,0,0,""]
[2,2,2,5,1,4,0,0,0,195,5,"","Nível 2","Nível 2","-","AGETOP",null,"FUNDAÇÕES E SONDAGENS","-",null,1,"-",null,null,0,0,""]
[3,3,3,4,1,4,1,0,0,4,94,"","Nível 3","Nível 3","-","SINAPI",null,"ESTACAS E BLOCOS","-",null,1,"-",null,null,0,0,""]
["S",3,"S",0,1,4,1,0,0,0,0,"","Serviço","Serviço","-","SINAPI",98230,"ESTACA BROCA DE CONCRETO, DIÂMETRO DE 30 CM, PROFUNDIDADE DE ATÉ 3 M, ESCAVAÇÃO MANUAL COM TRADO CONCHA, NÃO ARMADA. AF_03/2018","M",30,1,30,null,null,0,0,"Referência: AGETOP - 50302"]
["S",3,"S",0,1,4,1,0,0,0,0,"","Serviço","Serviço","-","SINAPI",96546,"ARMAÇÃO DE BLOCO, VIGA BALDRAME OU SAPATA UTILIZANDO AÇO CA-50 DE 10 MM - MONTAGEM. AF_06/2017","KG",72,1,72,null,null,0,0,"Referência: AGETOP - 52005"]
["S",3,"S",0,1,4,1,0,0,0,0,"","Serviço","Serviço","-","SINAPI",96543,"ARMAÇÃO DE BLOCO, VIGA BALDRAME E SAPATA UTILIZANDO AÇO CA-60 DE 5 MM - MONTAGEM. AF_06/2017","KG",22.5,1,22.5,null,null,0,0,"Referência: AGETOP - 52014"]
[{"$f":"CHOOSE(1+LOG(1+2*(ORÇAMENTO.Nivel=\"Nível 1\")+4*(ORÇAMENTO.Nivel=\"Nível 2\")+8*(ORÇAMENTO.Nivel=\"Nível 3\")+16*(ORÇAMENTO.Nivel=\"Nível 4\")+32*(ORÇAMENTO.Nivel=\"Serviço\"),2),0,1,2,3,4,\"S\")","v":2},2,2,71,1,5,0,0,0,190,71,"","Nível 2","Nível 2","-",null,null,"INSTALAÇÕES ELÉTRICAS","-",null,1,"-",null,null,0,0,""]
["S",2,"S",0,1,5,0,0,0,0,0,"","Serviço","Serviço","-","AGETOP",70351,"BRACADEIRA METALICA TIPO \"U\" DIAM. 3/4\"","Un    ",527,1,527,null,null,0,0,""]
["S",2,"S",0,1,5,0,0,0,0,0,"","Serviço","Serviço","-","AGETOP",70352,"BRACADEIRA METALICA TIPO \"U\" DIAM. 1\"","Un    ",145,1,145,null,null,0,0,""]
["S",2,"S",0,1,5,0,0,0,0,0,"","Serviço","Serviço","-","AGETOP",70354,"BRACADEIRA METALICA TIPO \"U\" DIAM. 1.1/2\"","Un    ",10,1,10,null,null,0,0,""]
["S",2,"S",0,1,5,0,0,0,0,0,"","Serviço","Serviço","-","AGETOP",70355,"BRACADEIRA METALICA TIPO \"U\" DIAM. 2\"","Un    ",6,1,6,null,null,0,0,""]
["S",2,"S",0,1,5,0,0,0,0,0,"","Serviço","Serviço","-","AGETOP",70421,"BUCHA E ARRUELA METALICA DIAM. 3/4\"","PR    ",1100,1,1100,null,null,0,0,""]
["S",2,"S",0,1,5,0,0,0,0,0,"","Serviço","Serviço","-","AGETOP",70422,"BUCHA E ARRUELA METALICA DIAM. 1\"","PR    ",270,1,270,null,null,0,0,""]
["S",2,"S",0,1,5,0,0,0,0,0,"","Serviço","Serviço","-","AGETOP",70424,"BUCHA E ARRUELA METALICA DIAM. 1.1/2\"","PR    ",20,1,20,null,null,0,0,""]
["S",2,"S",0,1,5,0,0,0,0,0,"","Serviço","Serviço","-","AGETOP",70425,"BUCHA E ARRUELA METALICA DIAM. 2\"","PR    ",12,1,12,null,null,0,0,""]
["S",2,"S",0,1,5,0,0,0,0,0,"","Serviço","Serviço","-","AGETOP",71861,"PARAFUSO P/BUCHA S-6","Un    ",860,1,860,null,null,0,0,""]
["S",2,"S",0,1,5,0,0,0,0,0,"","Serviço","Serviço","-","SINAPI",96971,"CORDOALHA DE COBRE NU 16 MM², NÃO ENTERRADA, COM ISOLADOR - FORNECIMENTO E INSTALAÇÃO. AF_12/2017","M",12,1,12,null,null,0,0,"Referência: AGETOP - 70541"]
["S",2,"S",0,1,5,0,0,0,0,0,"","Serviço","Serviço","-","SINAPI",91926,"CABO DE COBRE FLEXÍVEL ISOLADO, 2,5 MM², ANTI-CHAMA 450/750 V, PARA CIRCUITOS TERMINAIS - FORNECIMENTO E INSTALAÇÃO. AF_12/2015","M",3500,1,3500,null,null,0,0,"Referência: AGETOP - 70563"]
["S",2,"S",0,1,5,0,0,0,0,0,"","Serviço","Serviço","-","SINAPI",91928,"CABO DE COBRE FLEXÍVEL ISOLADO, 4 MM², ANTI-CHAMA 450/750 V, PARA CIRCUITOS TERMINAIS - FORNECIMENTO E INSTALAÇÃO. AF_12/2015","M",530,1,530,null,null,0,0,"Referência: AGETOP - 70564"]
["S",2,"S",0,1,5,0,0,0,0,0,"","Serviço","Serviço","-","SINAPI",91931,"CABO DE COBRE FLEXÍVEL ISOLADO, 6 MM², ANTI-CHAMA 0,6/1,0 KV, PARA CIRCUITOS TERMINAIS - FORNECIMENTO E INSTALAÇÃO. AF_12/2015","M",1200,1,1200,null,null,0,0,"Referência: AGETOP - 70583"]
["S",2,"S",0,1,5,0,0,0,0,0,"","Serviço","Serviço","-","SINAPI",92980,"CABO DE COBRE FLEXÍVEL ISOLADO, 10 MM², ANTI-CHAMA 0,6/1,0 KV, PARA DISTRIBUIÇÃO - FORNECIMENTO E INSTALAÇÃO. AF_12/2015","M",50,1,50,null,null,0,0,""]
["S",2,"S",0,1,5,0,0,0,0,0,"","Serviço","Serviço","-","SINAPI",92982,"CABO DE COBRE FLEXÍVEL ISOLADO, 16 MM², ANTI-CHAMA 0,6/1,0 KV, PARA DISTRIBUIÇÃO - FORNECIMENTO E INSTALAÇÃO. AF_12/2015","M",120,1,120,null,null,0,0,""]
["S",2,"S",0,1,5,0,0,0,0,0,"","Serviço","Serviço","-","SINAPI",92986,"CABO DE COBRE FLEXÍVEL ISOLADO, 35 MM², ANTI-CHAMA 0,6/1,0 KV, PARA DISTRIBUIÇÃO - FORNECIMENTO E INSTALAÇÃO. AF_12/2015","M",100,1,100,null,null,0,0,"Referência: AGETOP - 70512"]
["S",2,"S",0,1,5,0,0,0,0,0,"","Serviço","Serviço","-","AGETOP",70645,"CAIXA DE PASSAGEM METÁLICA DE EMBUTIR 15X15X8 CM","Un    ",2,1,2,null,null,0,0,""]
["S",2,"S",0,1,5,0,0,0,0,0,"","Serviço","Serviço","-","AGETOP",70646,"CAIXA DE PASSAGEM METÁLICA DE EMBUTIR 20X20X10 CM","Un    ",1,1,1,null,null,0,0,""]
["S",2,"S",0,1,5,0,0,0,0,0,"","Serviço","Serviço","-","SINAPI",92866,"CAIXA SEXTAVADA 3\" X 3\", METÁLICA, INSTALADA EM LAJE - FORNECIMENTO E INSTALAÇÃO. AF_12/2015","UN",121,1,121,null,null,0,0,"Referência: AGETOP - 70680"]
["S",2,"S",0,1,5,0,0,0,{"$f":"IF(OR($C84=\"S\",$C84=0),0,MATCH(0,OFFSET($D84,1,$C84,ROW($C$254)-ROW($C84)),0))","v":0},{"$f":"IF(OR($C84=\"S\",$C84=0),0,MATCH(OFFSET($D84,0,$C84)+1,OFFSET($D84,1,$C84,ROW($C$254)-ROW($C84)),0))","v":0},"","Serviço","Serviço","-","SINAPI",92868,"CAIXA RETANGULAR 4\" X 2\" MÉDIA (1,30 M DO PISO), METÁLICA, INSTALADA EM PAREDE - FORNECIMENTO E INSTALAÇÃO. AF_12/2015","UN",54,1,54,null,null,0,0,"Referência: AGETOP - 70691"]
["S",2,"S",0,1,5,0,0,0,0,0,"","Serviço","Serviço","-","SINAPI",97893,"CAIXA ENTERRADA ELÉTRICA RETANGULAR, EM ALVENARIA COM BLOCOS DE CONCRETO, FUNDO COM BRITA, DIMENSÕES INTERNAS: 0,8X0,8X0,6 M. AF_05/2018","UN",2,1,2,null,null,0,0,""]
["S",2,"S",0,1,5,0,0,0,0,0,"","Serviço","Serviço","-","AGETOP",70713,"CAIXA DE PASSAGEM 40X40X50CM FUNDO DE BRITA SEM TAMPA","Un    ",9,1,9,null,null,0,0,""]
["S",2,"S",0,1,5,0,0,0,0,0,"","Serviço","Serviço","-","AGETOP",70720,"CAIXA METÁLICA PARA MEDIDOR POLIFÁSICO PADRÃO ENEL 500X380X166MM","Un    ",1,1,1,null,null,0,0,""]
["S",2,"S",0,1,5,0,0,0,0,0,"","Serviço","Serviço","-","AGETOP",70926,"CONDULETE DE PVC - ADAPTADOR DE SAÍDA 1\" ","un    ",13,1,13,null,null,0,0,""]
["S",2,"S",0,1,5,0,0,0,0,0,"","Serviço","Serviço","-","AGETOP",70930,"CONDULETE METÁLICO - ADAPTADOR DE SAÍDA 3/4\" ","un    ",91,1,91,null,null,0,0,""]
["S",2,"S",0,1,5,0,0,0,0,0,"","Serviço","Serviço","-","SINAPI",93654,"DISJUNTOR MONOPOLAR TIPO DIN, CORRENTE NOMINAL DE 16A - FORNECIMENTO E INSTALAÇÃO. AF_04/2016","UN",52,1,52,null,null,0,0,""]
["S",2,"S",0,1,5,0,0,0,0,0,"","Serviço","Serviço","-","SINAPI",93656,"DISJUNTOR MONOPOLAR TIPO DIN, CORRENTE NOMINAL DE 25A - FORNECIMENTO E INSTALAÇÃO. AF_04/2016","UN",4,1,4,null,null,0,0,""]
["S",2,"S",0,1,5,0,0,0,0,0,"","Serviço","Serviço","-","SINAPI",93668,"DISJUNTOR TRIPOLAR TIPO DIN, CORRENTE NOMINAL DE 16A - FORNECIMENTO E INSTALAÇÃO. AF_04/2016","UN",2,1,2,null,null,0,0,""]
["S",2,"S",0,1,5,0,0,0,0,0,"","Serviço","Serviço","-","SINAPI",93671,"DISJUNTOR TRIPOLAR TIPO DIN, CORRENTE NOMINAL DE 32A - FORNECIMENTO E INSTALAÇÃO. AF_04/2016","UN",6,1,6,null,null,0,0,"Referência: AGETOP - 71173"]
["S",2,"S",0,1,5,0,0,0,0,0,"","Serviço","Serviço","-","SINAPI",93673,"DISJUNTOR TRIPOLAR TIPO DIN, CORRENTE NOMINAL DE 50A - FORNECIMENTO E INSTALAÇÃO. AF_04/2016","UN",2,1,2,null,null,0,0,"Referência: AGETOP - 71174"]
["S",2,"S",0,1,5,0,0,0,0,0,"","Serviço","Serviço","-","SINAPI","74130/5","DISJUNTOR TERMOMAGNETICO TRIPOLAR PADRAO NEMA (AMERICANO) 60 A 100A 240V, FORNECIMENTO E INSTALACAO","UN",3,1,3,null,null,0,0,""]
["S",2,"S",0,1,5,0,0,0,0,0,"","Serviço","Serviço","-","AGETOP",71184,"DISPOSITIVO DE PROTEÇÃO CONTRA SURTOS (D.P.S.) 275V DE 8 A 40KA","Un    ",4,1,4,null,null,0,0,""]
["S",2,"S",0,1,5,0,0,0,0,0,"","Serviço","Serviço","-","SINAPI",91844,"ELETRODUTO FLEXÍVEL CORRUGADO, PVC, DN 25 MM (3/4\"), PARA CIRCUITOS TERMINAIS, INSTALADO EM LAJE - FORNECIMENTO E INSTALAÇÃO. AF_12/2015","M",440,1,440,null,null,0,0,""]
["S",2,"S",0,1,5,0,0,0,0,0,"","Serviço","Serviço","-","SINAPI",91846,"ELETRODUTO FLEXÍVEL CORRUGADO, PVC, DN 32 MM (1\"), PARA CIRCUITOS TERMINAIS, INSTALADO EM LAJE - FORNECIMENTO E INSTALAÇÃO. AF_12/2015","M",20,1,20,null,null,0,0,""]
["S",2,"S",0,1,5,0,0,0,0,0,"","Serviço","Serviço","-","AGETOP",71197,"ELETRODUTO PVC FLEXÍVEL - MANGUEIRA CORRUGADA REFORÇADA - DIAM. 50MM","M     ",126,1,126,null,null,0,0,""]
["S",2,"S",0,1,5,0,0,0,0,0,"","Serviço","Serviço","-","SINAPI",91871,"ELETRODUTO RÍGIDO ROSCÁVEL, PVC, DN 25 MM (3/4\"), PARA CIRCUITOS TERMINAIS, INSTALADO EM PAREDE - FORNECIMENTO E INSTALAÇÃO. AF_12/2015","M",460,1,460,null,null,0,0,"Referência: AGETOP - 71201"]
["S",2,"S",0,1,5,0,0,0,0,0,"","Serviço","Serviço","-","SINAPI",91872,"ELETRODUTO RÍGIDO ROSCÁVEL, PVC, DN 32 MM (1\"), PARA CIRCUITOS TERMINAIS, INSTALADO EM PAREDE - FORNECIMENTO E INSTALAÇÃO. AF_12/2015","M",175,1,175,null,null,0,0,"Referência: AGETOP - 71202"]
["S",2,"S",0,1,5,0,0,0,0,0,"","Serviço","Serviço","-","SINAPI",93008,"ELETRODUTO RÍGIDO ROSCÁVEL, PVC, DN 50 MM (1 1/2\") - FORNECIMENTO E INSTALAÇÃO. AF_12/2015","M",30,1,30,null,null,0,0,""]
["S",2,"S",0,1,5,0,0,0,0,0,"","Serviço","Serviço","-","SINAPI",93009,"ELETRODUTO RÍGIDO ROSCÁVEL, PVC, DN 60 MM (2\") - FORNECIMENTO E INSTALAÇÃO. AF_12/2015","M",20,1,20,null,null,0,0,""]
["S",2,"S",0,1,5,0,0,0,0,0,"","Serviço","Serviço","-","AGETOP",71321,"FITA DE AUTO FUSAO, ROLO E 10,00 MM","Un    ",30,1,30,null,null,0,0,""]
["S",2,"S",0,1,5,0,0,0,0,0,"","Serviço","Serviço","-","AGETOP",71331,"FITA ISOLANTE, ROLO DE 20,00 M","Un    ",5,1,5,null,null,0,0,""]
["S",2,"S",0,1,5,0,0,0,0,0,"","Serviço","Serviço","-","AGETOP",71381,"HASTE REV.COBRE(COPPERWELD)  5/8\" X 3,00 M C/CONECTOR","Un    ",3,1,3,null,null,0,0,""]
["S",2,"S",0,1,5,0,0,0,0,0,"","Serviço","Serviço","-","AGETOP",71450,"INTERRUPTOR DIFERENCIAL RESIDUAL (D.R.) BIPOLAR DE 25A-30mA","Un    ",8,1,8,null,null,0,0,""]
["S",2,"S",0,1,5,0,0,0,0,0,"","Serviço","Serviço","-","SINAPI",91953,"INTERRUPTOR SIMPLES (1 MÓDULO), 10A/250V, INCLUINDO SUPORTE E PLACA - FORNECIMENTO E INSTALAÇÃO. AF_12/2015","UN",10,1,10,null,null,0,0,"Referência: AGETOP - 71440"]
["S",2,"S",0,1,5,0,0,0,0,0,"","Serviço","Serviço","-","SINAPI",91959,"INTERRUPTOR SIMPLES (2 MÓDULOS), 10A/250V, INCLUINDO SUPORTE E PLACA - FORNECIMENTO E INSTALAÇÃO. AF_12/2015","UN",14,1,14,null,null,0,0,"Referência: AGETOP - 71441"]
["S",2,"S",0,1,5,0,0,0,0,0,"","Serviço","Serviço","-","SINAPI",91967,"INTERRUPTOR SIMPLES (3 MÓDULOS), 10A/250V, INCLUINDO SUPORTE E PLACA - FORNECIMENTO E INSTALAÇÃO. AF_12/2015","UN",2,1,2,null,null,0,0,"Referência: AGETOP - 71442"]
["S",2,"S",0,1,5,0,0,0,0,0,"","Serviço","Serviço","-","SINAPI",92023,"INTERRUPTOR SIMPLES (1 MÓDULO) COM 1 TOMADA DE EMBUTIR 2P+T 10 A,  INCLUINDO SUPORTE E PLACA - FORNECIMENTO E INSTALAÇÃO. AF_12/2015","UN",5,1,5,null,null,0,0,""]
["S",2,"S",0,1,5,0,0,0,0,0,"","Serviço","Serviço","-","SINAPI",72278,"LAMPADA VAPOR METALICO 400W - FORNECIMENTO E INSTALACAO","UN",8,1,8,null,null,0,0,"Referência: AGETOP - 71527"]
["S",2,"S",0,1,5,0,0,0,0,0,"","Serviço","Serviço","-","SINAPI",97611,"LÂMPADA COMPACTA FLUORESCENTE DE 15 W, BASE E27 - FORNECIMENTO E INSTALAÇÃO. AF_02/2020","UN",11,1,11,null,null,0,0,"Referência: AGETOP - 71567"]
["S",2,"S",0,1,5,0,0,0,0,0,"","Serviço","Serviço","-","COMPOSIÇÃO","COMP 387_SEE","LÂMPADA LED TUBULAR 18W ","UN ",204,1,204,null,null,0,0,""]
["S",2,"S",0,1,5,0,0,0,0,0,"","Serviço","Serviço","-","COMPOSIÇÃO","COMP 375_SEE","REFLETOR DE LED HOLOFORTE 50W","UN ",19,1,19,null,null,0,0,""]
["S",2,"S",0,1,5,0,0,0,0,0,"","Serviço","Serviço","-","SINAPI",97585,"LUMINÁRIA TIPO CALHA, DE SOBREPOR, COM 2 LÂMPADAS TUBULARES FLUORESCENTES DE 18 W, COM REATOR DE PARTIDA RÁPIDA - FORNECIMENTO E INSTALAÇÃO. AF_02/2020","UN",102,1,102,null,null,0,0,""]
["S",2,"S",0,1,5,0,0,0,0,0,"","Serviço","Serviço","-","SINAPI",97591,"LUMINÁRIA TIPO PLAFON REDONDO COM VIDRO FOSCO, DE SOBREPOR, COM 2 LÂMPADAS FLUORESCENTES DE 15 W, SEM REATOR - FORNECIMENTO E INSTALAÇÃO. AF_02/2020","UN",11,1,11,null,null,0,0,""]
["S",2,"S",0,1,5,0,0,0,0,0,"","Serviço","Serviço","-","SINAPI","74246/1","REFLETOR RETANGULAR FECHADO COM LAMPADA VAPOR METALICO 400 W","UN",8,1,8,null,null,0,0,"Referência: AGETOP - 71684"]
["S",2,"S",0,1,5,0,0,0,0,0,"","Serviço","Serviço","-","SINAPI",91884,"LUVA PARA ELETRODUTO, PVC, ROSCÁVEL, DN 25 MM (3/4\"), PARA CIRCUITOS TERMINAIS, INSTALADA EM PAREDE - FORNECIMENTO E INSTALAÇÃO. AF_12/2015","UN",68,1,68,null,null,0,0,"Referência: AGETOP - 71741"]
["S",2,"S",0,1,5,0,0,0,0,0,"","Serviço","Serviço","-","SINAPI",91885,"LUVA PARA ELETRODUTO, PVC, ROSCÁVEL, DN 32 MM (1\"), PARA CIRCUITOS TERMINAIS, INSTALADA EM PAREDE - FORNECIMENTO E INSTALAÇÃO. AF_12/2015","UN",46,1,46,null,null,0,0,"Referência: AGETOP - 71742"]
["S",2,"S",0,1,5,0,0,0,0,0,"","Serviço","Serviço","-","SINAPI",93013,"LUVA PARA ELETRODUTO, PVC, ROSCÁVEL, DN 50 MM (1 1/2\") - FORNECIMENTO E INSTALAÇÃO. AF_12/2015","UN",9,1,9,null,null,0,0,"Referência: AGETOP - 71744"]
["S",2,"S",0,1,5,0,0,0,0,0,"","Serviço","Serviço","-","SINAPI",93014,"LUVA PARA ELETRODUTO, PVC, ROSCÁVEL, DN 60 MM (2\") - FORNECIMENTO E INSTALAÇÃO. AF_12/2015","UN",6,1,6,null,null,0,0,"Referência: AGETOP - 71745"]
["S",2,"S",0,1,5,0,0,0,0,0,"","Serviço","Serviço","-","AGETOP",71824,"PADRÃO TRIFASICO 35 MM H=7 METROS","Un    ",1,1,1,null,null,0,0,""]
["S",2,"S",0,1,5,0,0,0,0,0,"","Serviço","Serviço","-","SINAPI",83463,"QUADRO DE DISTRIBUICAO DE ENERGIA EM CHAPA DE ACO GALVANIZADO, PARA 12 DISJUNTORES TERMOMAGNETICOS MONOPOLARES, COM BARRAMENTO TRIFASICO E NEUTRO - FORNECIMENTO E INSTALACAO","UN",3,1,3,null,null,0,0,""]
["S",2,"S",0,1,5,0,0,0,0,0,"","Serviço","Serviço","-","SINAPI","74131/4","QUADRO DE DISTRIBUICAO DE ENERGIA DE EMBUTIR, EM CHAPA METALICA, PARA 18 DISJUNTORES TERMOMAGNETICOS MONOPOLARES, COM BARRAMENTO TRIFASICO E NEUTRO, FORNECIMENTO E INSTALACAO","UN",1,1,1,null,null,0,0,""]
["S",2,"S",0,1,5,0,0,0,0,0,"","Serviço","Serviço","-","SINAPI","74131/5","QUADRO DE DISTRIBUICAO DE ENERGIA DE EMBUTIR, EM CHAPA METALICA, PARA 24 DISJUNTORES TERMOMAGNETICOS MONOPOLARES, COM BARRAMENTO TRIFASICO E NEUTRO, FORNECIMENTO E INSTALACAO","UN",2,1,2,null,null,0,0,""]
["S",2,"S",0,1,5,0,0,0,0,0,"","Serviço","Serviço","-","SINAPI","74131/7","QUADRO DE DISTRIBUICAO DE ENERGIA DE EMBUTIR, EM CHAPA METALICA, PARA 40 DISJUNTORES TERMOMAGNETICOS MONOPOLARES, COM BARRAMENTO TRIFASICO E NEUTRO, FORNECIMENTO E INSTALACAO","UN",1,1,1,null,null,0,0,""]
["S",2,"S",0,1,5,0,0,0,0,0,"","Serviço","Serviço","-","AGETOP",72385,"TAMPA CEGA PARA CONDULETE DE PVC","Un    ",34,1,34,null,null,0,0,""]
["S",2,"S",0,1,5,0,0,0,0,0,"","Serviço","Serviço","-","AGETOP",72441,"TAMPA PARA CONDULETE DE PVC PARA 1 TOMADA","un    ",70,1,70,null,null,0,0,""]
["S",2,"S",0,1,5,0,0,0,0,0,"","Serviço","Serviço","-","SINAPI",91996,"TOMADA MÉDIA DE EMBUTIR (1 MÓDULO), 2P+T 10 A, INCLUINDO SUPORTE E PLACA - FORNECIMENTO E INSTALAÇÃO. AF_12/2015","UN",6,1,6,null,null,0,0,"Referência: AGETOP - 72578"]
["S",2,"S",0,1,5,0,0,0,0,0,"","Serviço","Serviço","-","SINAPI",92000,"TOMADA BAIXA DE EMBUTIR (1 MÓDULO), 2P+T 10 A, INCLUINDO SUPORTE E PLACA - FORNECIMENTO E INSTALAÇÃO. AF_12/2015","UN",7,1,7,null,null,0,0,"Referência: AGETOP - 72578"]
["S",2,"S",0,1,5,0,0,0,0,0,"","Serviço","Serviço","-","SINAPI",92004,"TOMADA MÉDIA DE EMBUTIR (2 MÓDULOS), 2P+T 10 A, INCLUINDO SUPORTE E PLACA - FORNECIMENTO E INSTALAÇÃO. AF_12/2015","UN",1,1,1,null,null,0,0,"Referência: AGETOP - 72578"]
["S",2,"S",0,1,5,0,0,0,0,0,"","Serviço","Serviço","-","AGETOP",72578,"TOMADA HEXAGONAL 2P + T - 10A - 250V","Un    ",69,1,69,null,null,0,0,""]
["S",2,"S",0,1,5,0,0,0,0,0,"","Serviço","Serviço","-","AGETOP",72585,"TOMADA HEXAGONAL 2P + T - 20A - 250V","Un    ",12,1,12,null,null,0,0,""]
[{"$f":"CHOOSE(1+LOG(1+2*(ORÇAMENTO.Nivel=\"Nível 1\")+4*(ORÇAMENTO.Nivel=\"Nível 2\")+8*(ORÇAMENTO.Nivel=\"Nível 3\")+16*(ORÇAMENTO.Nivel=\"Nível 4\")+32*(ORÇAMENTO.Nivel=\"Serviço\"),2),0,1,2,3,4,\"S\")","v":2},{"$f":"IF(OR(C135=\"s\",C135=0),OFFSET(B135,-1,0),C135)","v":2},{"$f":"IF(OFFSET(C135,-1,0)=\"L\",1,IF(OFFSET(C135,-1,0)=1,2,IF(OR(A135=\"s\",A135=0),\"S\",IF(AND(OFFSET(C135,-1,0)=2,A135=4),3,IF(AND(OR(OFFSET(C135,-1,0)=\"s\",OFFSET(C135,-1,0)=0),A135<>\"s\",A135>OFFSET(B135,-1,0)),OFFSET(B135,-1,0),A135)))))","v":2},{"$f":"IF(OR(C135=\"S\",C135=0),0,IF(ISERROR(K135),J135,SMALL(J135:K135,1)))","v":56},{"$f":"IF($C135=1,OFFSET(E135,-1,0)+1,OFFSET(E135,-1,0))","v":1},{"$f":"IF($C135=1,0,IF($C135=2,OFFSET(F135,-1,0)+1,OFFSET(F135,-1,0)))","v":6},{"$f":"IF(AND($C135<=2,$C135<>0),0,IF($C135=3,OFFSET(G135,-1,0)+1,OFFSET(G135,-1,0)))","v":0},{"$f":"IF(AND($C135<=3,$C135<>0),0,IF($C135=4,OFFSET(H135,-1,0)+1,OFFSET(H135,-1,0)))","v":0},{"$f":"IF(AND($C135<=4,$C135<>0),0,IF(AND($C135=\"S\",$Y135>0),OFFSET(I135,-1,0)+1,OFFSET(I135,-1,0)))","v":0},119,56,"","Nível 2","Nível 2","-","AGETOP",null,"INSTALAÇÕES HIDROSSANITÁRIAS","-",null,1,"-",null,null,0,0,""]
[3,3,3,18,1,6,1,0,0,55,18,"","Nível 3","Nível 3","-","SINAPI",null,"PEÇAS E ACESSÓRIOS","-",null,1,"-",null,null,0,0,""]
[4,4,4,7,1,6,1,1,0,17,7,"","Nível 4","Nível 4","-","SINAPI",null,"VASO SANITÁRIO E ACESSÓRIOS","-",null,1,"-",null,null,0,0,""]
["S",4,"S",0,1,6,1,1,0,0,0,"","Serviço","Serviço","-","SINAPI",95470,"VASO SANITARIO SIFONADO CONVENCIONAL COM LOUÇA BRANCA, INCLUSO CONJUNTO DE LIGAÇÃO PARA BACIA SANITÁRIA AJUSTÁVEL - FORNECIMENTO E INSTALAÇÃO. AF_10/2016","UN",1,1,1,null,null,0,0,""]
["S",4,"S",0,1,6,1,1,0,0,0,"","Serviço","Serviço","-","SINAPI",99635,"VÁLVULA DE DESCARGA METÁLICA, BASE 1 1/2 \", ACABAMENTO METALICO CROMADO - FORNECIMENTO E INSTALAÇÃO. AF_01/2019","UN",1,1,1,null,null,0,0,"Referência: AGETOP - 80515"]
["S",4,"S",0,1,6,1,1,0,0,0,"","Serviço","Serviço","-","AGETOP",80520,"CONJUNTO DE FIXACAO P/VASO SANITARIO (PAR)","CJ    ",1,1,1,null,null,0,0,""]
["S",4,"S",0,1,6,1,1,0,0,0,"","Serviço","Serviço","-","AGETOP",80526,"ASSENTO EM POLIPROPILENO COM SISTEMA DE FECHAMENTO SUAVE PARA VASO SANITÁRIO","Un    ",1,1,1,null,null,0,0,""]
["S",4,"S",0,1,6,1,1,0,0,0,"","Serviço","Serviço","-","SINAPI",95544,"PAPELEIRA DE PAREDE EM METAL CROMADO SEM TAMPA, INCLUSO FIXAÇÃO. AF_01/2020","UN",1,1,1,null,null,0,0,""]
["S",4,"S",0,1,6,1,1,0,0,0,"","Serviço","Serviço","-","AGETOP",80513,"TUBO PARA VÁLVULA DE DESCARGA ( CURTO 1.1/4\" )","Un    ",1,1,1,null,null,0,0,""]
[4,4,4,7,1,6,1,2,0,10,7,"","Nível 4","Nível 4","-","SINAPI",null,"LAVATÓRIO E ACESSÓRIOS","-",null,1,"-",null,null,0,0,""]
["S",4,"S",0,1,6,1,2,0,0,0,"","Serviço","Serviço","-","AGETOP",80550,"FIXACAO P/LAVATORIO (PAR)","PAR   ",1,1,1,null,null,0,0,""]
["S",4,"S",0,1,6,1,2,0,0,0,"","Serviço","Serviço","-","AGETOP",80556,"LIGAÇÃO FLEXÍVEL PVC DIAM.1/2\" (ENGATE)","Un    ",1,1,1,null,null,0,0,""]
["S",4,"S",0,1,6,1,2,0,0,0,"","Serviço","Serviço","-","SINAPI",86883,"SIFÃO DO TIPO FLEXÍVEL EM PVC 1  X 1.1/2  - FORNECIMENTO E INSTALAÇÃO. AF_01/2020","UN",1,1,1,null,null,0,0,""]
["S",4,"S",0,1,6,1,2,0,{"$f":"IF(OR($C148=\"S\",$C148=0),0,MATCH(0,OFFSET($D148,1,$C148,ROW($C$254)-ROW($C148)),0))","v":0},{"$f":"IF(OR($C148=\"S\",$C148=0),0,MATCH(OFFSET($D148,0,$C148)+1,OFFSET($D148,1,$C148,ROW($C$254)-ROW($C148)),0))","v":0},"","Serviço","Serviço","-","SINAPI",86915,"TORNEIRA CROMADA DE MESA, 1/2\u0094 OU 3/4\u0094, PARA LAVATÓRIO, PADRÃO MÉDIO - FORNECIMENTO E INSTALAÇÃO. AF_01/2020","UN",1,1,1,null,null,0,0,"Referência: AGETOP - 80570"]
["S",4,"S",0,1,6,1,2,0,0,0,"","Serviço","Serviço","-","SINAPI",86877,"VÁLVULA EM METAL CROMADO 1.1/2\u0094 X 1.1/2\u0094 PARA TANQUE OU LAVATÓRIO, COM OU SEM LADRÃO - FORNECIMENTO E INSTALAÇÃO. AF_01/2020","UN",1,1,1,null,null,0,0,"Referência: AGETOP - 80580"]
["S",4,"S",0,1,6,1,2,0,0,0,"","Serviço","Serviço","-","SINAPI",86901,"CUBA DE EMBUTIR OVAL EM LOUÇA BRANCA, 35 X 50CM OU EQUIVALENTE - FORNECIMENTO E INSTALAÇÃO. AF_01/2020","UN",1,1,1,null,null,0,0,"Referência: AGETOP - 80587"]
[4,4,4,3,1,6,1,3,0,3,13,"","Nível 4","Nível 4","-","SINAPI",null,"REGISTROS","-",null,1,"-",null,null,0,0,""]
["S",4,"S",0,1,6,1,3,0,0,0,"","Serviço","Serviço","-","SINAPI",94794,"REGISTRO DE GAVETA BRUTO, LATÃO, ROSCÁVEL, 1 1/2\u0094, COM ACABAMENTO E CANOPLA CROMADOS, INSTALADO EM RESERVAÇÃO DE ÁGUA DE EDIFICAÇÃO QUE POSSUA RESERVATÓRIO DE FIBRA/FIBROCIMENTO \u0096 FORNECIMENTO E INSTALAÇÃO. AF_06/2016","UN",1,1,1,null,null,0,0,"Referência: AGETOP - 80929"]
["S",4,"S",0,1,6,1,3,0,0,0,"","Serviço","Serviço","-","SINAPI",94497,"REGISTRO DE GAVETA BRUTO, LATÃO, ROSCÁVEL, 1 1/2\u0094, INSTALADO EM RESERVAÇÃO DE ÁGUA DE EDIFICAÇÃO QUE POSSUA RESERVATÓRIO DE FIBRA/FIBROCIMENTO \u0096 FORNECIMENTO E INSTALAÇÃO. AF_06/2016","UN",1,1,1,null,null,0,0,"Referência: AGETOP - 80905"]
[3,3,3,18,1,6,2,0,0,37,18,"","Nível 3","Nível 3","-","SINAPI",null,"ÁGUA FRIA","-",null,1,"-",null,null,0,0,""]
[4,4,4,3,1,6,2,1,0,17,3,"","Nível 4","Nível 4","-","SINAPI",null,"TUBOS DE PVC SOLDÁVEL","-",null,1,"-",null,null,0,0,""]
["S",4,"S",0,1,6,2,1,0,0,0,"","Serviço","Serviço","-","SINAPI",89402,"TUBO, PVC, SOLDÁVEL, DN 25MM, INSTALADO EM RAMAL DE DISTRIBUIÇÃO DE ÁGUA - FORNECIMENTO E INSTALAÇÃO. AF_12/2014","M",6,1,6,null,null,0,0,"Referência: AGETOP - 81003"]
["S",4,"S",0,1,6,2,1,0,0,0,"","Serviço","Serviço","-","SINAPI",89449,"TUBO, PVC, SOLDÁVEL, DN 50MM, INSTALADO EM PRUMADA DE ÁGUA - FORNECIMENTO E INSTALAÇÃO. AF_12/2014","M",42,1,42,null,null,0,0,""]
[4,4,4,3,1,6,2,2,0,14,3,"","Nível 4","Nível 4","-","SINAPI",null,"ADAPTADORES DE PVC SOLDÁVEL","-",null,1,"-",null,null,0,0,""]
["S",4,"S",0,1,6,2,2,0,0,0,"","Serviço","Serviço","-","SINAPI",89596,"ADAPTADOR CURTO COM BOLSA E ROSCA PARA REGISTRO, PVC, SOLDÁVEL, DN 50MM X 1.1/2\u0094, INSTALADO EM PRUMADA DE ÁGUA - FORNECIMENTO E INSTALAÇÃO. AF_12/2014","UN",5,1,5,null,null,0,0,"Referência: AGETOP - 81069"]
["S",4,"S",0,1,6,2,2,0,0,0,"","Serviço","Serviço","-","SINAPI",94787,"ADAPTADOR COM FLANGES LIVRES, PVC, SOLDÁVEL LONGO, DN 50 MM X 1 1/2 , INSTALADO EM RESERVAÇÃO DE ÁGUA DE EDIFICAÇÃO QUE POSSUA RESERVATÓRIO DE FIBRA/FIBROCIMENTO   FORNECIMENTO E INSTALAÇÃO. AF_06/2016","UN",1,1,1,null,null,0,0,""]
[4,4,4,3,1,6,2,3,0,11,3,"","Nível 4","Nível 4","-","SINAPI",null,"LUVAS DE PVC","-",null,1,"-",null,null,0,0,""]
["S",4,"S",0,1,6,2,3,0,0,0,"","Serviço","Serviço","-","SINAPI",89528,"LUVA, PVC, SOLDÁVEL, DN 25MM, INSTALADO EM PRUMADA DE ÁGUA - FORNECIMENTO E INSTALAÇÃO. AF_12/2014","UN",2,1,2,null,null,0,0,""]
["S",4,"S",0,1,6,2,3,0,0,0,"","Serviço","Serviço","-","SINAPI",89575,"LUVA, PVC, SOLDÁVEL, DN 50MM, INSTALADO EM PRUMADA DE ÁGUA - FORNECIMENTO E INSTALAÇÃO. AF_12/2014","UN",5,1,5,null,null,0,0,"Referência: AGETOP - 81105"]
[4,4,4,2,1,6,2,4,0,8,2,"","Nível 4","Nível 4","-","SINAPI",null,"BUCHAS","-",null,1,"-",null,null,0,0,""]
["S",4,"S",0,1,6,2,4,0,0,0,"","Serviço","Serviço","-","AGETOP",81179,"BUCHA DE REDUCAO SOLDAVEL LONGA 50 X 25 mm","Un    ",1,1,1,null,null,0,0,""]
[4,4,4,4,1,6,2,5,0,6,4,"","Nível 4","Nível 4","-","SINAPI",null,"JOELHO","-",null,1,"-",null,null,0,0,""]
["S",4,"S",0,1,6,2,5,0,0,0,"","Serviço","Serviço","-","SINAPI",89481,"JOELHO 90 GRAUS, PVC, SOLDÁVEL, DN 25MM, INSTALADO EM PRUMADA DE ÁGUA - FORNECIMENTO E INSTALAÇÃO. AF_12/2014","UN",3,1,3,null,null,0,0,""]
["S",4,"S",0,1,6,2,5,0,0,0,"","Serviço","Serviço","-","SINAPI",89501,"JOELHO 90 GRAUS, PVC, SOLDÁVEL, DN 50MM, INSTALADO EM PRUMADA DE ÁGUA - FORNECIMENTO E INSTALAÇÃO. AF_12/2014","UN",9,1,9,null,null,0,0,""]
["S",4,"S",0,1,6,2,5,0,0,0,"","Serviço","Serviço","-","AGETOP",81380,"JOELHO 90 GRAUS C/ROSCA E BUCHA LATAO DIAM.1/2\"","Un    ",1,1,1,null,null,0,0,""]
[4,4,4,2,1,6,2,6,0,2,{"$error":"#N/A"},"","Nível 4","Nível 4","-","SINAPI",null,"TÊ","-",null,1,"-",null,null,0,0,""]
["S",4,"S",0,1,6,2,6,0,0,0,"","Serviço","Serviço","-","SINAPI",89625,"TE, PVC, SOLDÁVEL, DN 50MM, INSTALADO EM PRUMADA DE ÁGUA - FORNECIMENTO E INSTALAÇÃO. AF_12/2014","UN",1,1,1,null,null,0,0,""]
[3,3,3,6,1,6,3,0,0,19,6,"","Nível 3","Nível 3","-","SINAPI",null,"ESGOTO","-",null,1,"-",null,null,0,0,""]
[4,4,4,2,1,6,3,1,0,5,2,"","Nível 4","Nível 4","-","SINAPI",null,"TUBOS","-",null,1,"-",null,null,0,0,""]
["S",4,"S",0,1,6,3,1,0,0,0,"","Serviço","Serviço","-","SINAPI",89800,"TUBO PVC, SERIE NORMAL, ESGOTO PREDIAL, DN 100 MM, FORNECIDO E INSTALADO EM PRUMADA DE ESGOTO SANITÁRIO OU VENTILAÇÃO. AF_12/2014","M",12,1,12,null,null,0,0,""]
[4,4,4,3,1,6,3,2,0,3,{"$error":"#N/A"},"","Nível 4","Nível 4","-","SINAPI",null,"ADESIVOS","-",null,1,"-",null,null,0,0,""]
["S",4,"S",0,1,6,3,2,0,0,0,"","Serviço","Serviço","-","AGETOP",81501,"ADESIVO PLASTICO - FRASCO 850 G","Un    ",2,1,2,null,null,0,0,""]
["S",4,"S",0,1,6,3,2,0,0,0,"","Serviço","Serviço","-","AGETOP",81504,"SOLUCAO LIMPADORA 1000 CM3","Un    ",2,1,2,null,null,0,0,""]
[3,3,3,3,1,6,4,0,0,13,3,"","Nível 3","Nível 3","-","SINAPI",null,"OUTROS","-",null,1,"-",null,null,0,0,""]
["S",3,"S",0,1,6,4,0,0,0,0,"","Serviço","Serviço","-","AGETOP",80845,"CAIXA DE ALVENARIA 20x20x25 CM (REVESTIMENTO IMPERMEABILIZADO), FUNDO DE BRITA SEM TAMPA - PARA REGISTRO/TORNEIRA JARDIM","Un    ",1,1,1,null,null,0,0,""]
["S",3,"S",0,1,6,4,0,0,0,0,"","Serviço","Serviço","-","AGETOP",80840,"TAMPA T-5 ARTICULADA 20X20","Un    ",1,1,1,null,null,0,0,""]
[3,3,3,10,1,6,5,0,0,10,{"$error":"#N/A"},"","Nível 3","Nível 3","-","SINAPI",null,"COMBATE A INCÊNDIO","-",null,1,"-",null,null,0,0,""]
["S",3,"S",0,1,6,5,0,0,0,0,"","Serviço","Serviço","-","AGETOP",85003,"EXTINTOR PO QUIMICO SECO (6 KG) - CAPACIDADE EXTINTORA 20 BC","Un    ",1,1,1,null,null,0,0,""]
["S",3,"S",0,1,6,5,0,0,0,0,"","Serviço","Serviço","-","AGETOP",85006,"EXTINTOR MULTI USO EM PO A B C (6 KG) - CAPACIDADE EXTINTORA 3A 20BC","un    ",4,1,4,null,null,0,0,""]
["S",3,"S",0,1,6,5,0,0,0,0,"","Serviço","Serviço","-","COMPOSIÇÃO","COMP 024_SEE","SINALIZADOR FOTOLUMINESCENTE PARA EXTINTOR","UN ",5,1,5,null,null,0,0,""]
["S",3,"S",0,1,6,5,0,0,0,0,"","Serviço","Serviço","-","COMPOSIÇÃO","COMP 277_SEE","MARCAÇÃO NO PISO - 1X1 M PARA EXTINTOR","M2",5,1,5,null,null,0,0,""]
["S",3,"S",0,1,6,5,0,0,0,0,"","Serviço","Serviço","-","COMPOSIÇÃO","COMP 235_SEE","PLACA DE SINALIZAÇÃO EM PVC COD 01 - (300X300) PROIBIDO FUMAR","UN ",1,1,1,null,null,0,0,""]
["S",3,"S",0,1,6,5,0,0,0,0,"","Serviço","Serviço","-","COMPOSIÇÃO","COMP 236_SEE","PLACA DE SINALIZAÇÃO EM PVC COD 06 - (300X300) PERIGO INFLAMÁVEL","UN ",1,1,1,null,null,0,0,""]
["S",3,"S",0,1,6,5,0,0,0,0,"","Serviço","Serviço","-","COMPOSIÇÃO","COMP 411_SEE","PLACA DE SINALIZAÇÃO EM PVC COD 13 - (316X158) SAÍDA DE EMERGÊNCIA","UN ",13,1,13,null,null,0,0,""]
["S",3,"S",0,1,6,5,0,0,0,0,"","Serviço","Serviço","-","COMPOSIÇÃO","COMP 412_SEE","PLACA DE SINALIZAÇÃO EM PVC COD 17 - (316X158) MENSAGEM \"SAÍDA\"","UN ",2,1,2,null,null,0,0,""]
["S",3,"S",0,1,6,5,0,0,0,0,"","Serviço","Serviço","-","SINAPI",97599,"LUMINÁRIA DE EMERGÊNCIA, COM 30 LÂMPADAS LED DE 2 W, SEM REATOR - FORNECIMENTO E INSTALAÇÃO. AF_02/2020","UN",8,1,8,null,null,0,0,""]
[2,2,2,2,1,7,0,0,0,63,2,"","Nível 2","Nível 2","-",null,null,"ESTRUTURAS METÁLICAS","-",null,1,"-",null,null,0,0,""]
["S",2,"S",0,1,7,0,0,0,0,0,"","Serviço","Serviço","-","AGETOP",150204,"ESTRUTURA METÁLICA CONVENCIONAL EM AÇO DO TIPO MR-250 / ASTM A36 COM FUNDO ANTICORROSIVO","Kg    ",856,1,856,null,null,0,0,""]
[2,2,2,2,1,8,0,0,0,61,2,"","Nível 2","Nível 2","-",null,null,"COBERTURAS","-",null,1,"-",null,null,0,0,""]
["S",{"$f":"IF(OR(C194=\"s\",C194=0),OFFSET(B194,-1,0),C194)","v":2},{"$f":"IF(OFFSET(C194,-1,0)=\"L\",1,IF(OFFSET(C194,-1,0)=1,2,IF(OR(A194=\"s\",A194=0),\"S\",IF(AND(OFFSET(C194,-1,0)=2,A194=4),3,IF(AND(OR(OFFSET(C194,-1,0)=\"s\",OFFSET(C194,-1,0)=0),A194<>\"s\",A194>OFFSET(B194,-1,0)),OFFSET(B194,-1,0),A194)))))","v":"S"},{"$f":"IF(OR(C194=\"S\",C194=0),0,IF(ISERROR(K194),J194,SMALL(J194:K194,1)))","v":0},{"$f":"IF($C194=1,OFFSET(E194,-1,0)+1,OFFSET(E194,-1,0))","v":1},{"$f":"IF($C194=1,0,IF($C194=2,OFFSET(F194,-1,0)+1,OFFSET(F194,-1,0)))","v":8},{"$f":"IF(AND($C194<=2,$C194<>0),0,IF($C194=3,OFFSET(G194,-1,0)+1,OFFSET(G194,-1,0)))","v":0},{"$f":"IF(AND($C194<=3,$C194<>0),0,IF($C194=4,OFFSET(H194,-1,0)+1,OFFSET(H194,-1,0)))","v":0},{"$f":"IF(AND($C194<=4,$C194<>0),0,IF(AND($C194=\"S\",$Y194>0),OFFSET(I194,-1,0)+1,OFFSET(I194,-1,0)))","v":0},0,0,"","Serviço","Serviço","-","SINAPI",94213,"TELHAMENTO COM TELHA DE AÇO/ALUMÍNIO E = 0,5 MM, COM ATÉ 2 ÁGUAS, INCLUSO IÇAMENTO. AF_07/2019","M2",35,1,35,null,null,0,0,"Referência: AGETOP - 160905"]
[2,2,2,11,1,9,0,0,0,59,11,"","Nível 2","Nível 2","-",null,null,"ESQUADRIAS METÁLICAS","-",null,1,"-",null,null,0,0,""]
[{"$f":"CHOOSE(1+LOG(1+2*(ORÇAMENTO.Nivel=\"Nível 1\")+4*(ORÇAMENTO.Nivel=\"Nível 2\")+8*(ORÇAMENTO.Nivel=\"Nível 3\")+16*(ORÇAMENTO.Nivel=\"Nível 4\")+32*(ORÇAMENTO.Nivel=\"Serviço\"),2),0,1,2,3,4,\"S\")","v":3},3,3,5,1,9,1,0,0,10,5,"","Nível 3","Nível 3","-","SINAPI",null,"CASA ZELADOR / NOVA SECRETARIA","-",null,1,"-",null,null,0,0,""]
["S",3,"S",0,1,9,1,0,0,0,0,"","Serviço","Serviço","-","AGETOP",180501,"PORTA DE ABRIR EM CHAPA PF-1 C/FERRAGENS","m2    ",4.83,1,4.83,null,null,0,0,""]
["S",3,"S",0,1,9,1,0,0,0,0,"","Serviço","Serviço","-","AGETOP",180402,"ESQ.VENEZIANA CHAPA/VIDRO J11 e J16 C/FERRAGENS","m2    ",4,1,4,null,null,0,0,""]
["S",3,"S",0,1,9,1,0,0,0,0,"","Serviço","Serviço","-","AGETOP",180380,"ESQ. MAXIMO AR CHAPA/VIDRO J4 C/FERRAGENS","m2    ",0.6,1,0.6,null,null,0,0,""]
["S",3,"S",0,1,9,1,0,0,0,0,"","Serviço","Serviço","-","COMPOSIÇÃO","COMP 007_SEE","GUICHÊ CANTONEIRA/GRADE PARA VIDRO","M²",4,1,4,null,null,0,0,""]
[3,3,3,3,1,9,2,0,0,5,3,"","Nível 3","Nível 3","-","SINAPI",null,"ACESSO NOVA SECRETARIA","-",null,1,"-",null,null,0,0,""]
["S",3,"S",0,1,9,2,0,0,0,0,"","Serviço","Serviço","-","AGETOP",180304,"PORTAO DE ABRIR CHAPA 14  PT-4 C/FERRAGENS","m2    ",2.7,1,2.7,null,null,0,0,""]
["S",3,"S",0,1,9,2,0,0,0,0,"","Serviço","Serviço","-","AGETOP",180323,"GRELHA PADRÃO GOINFRA DE FERRO CHATO COM BERÇO (ESPAÇAMENTO ENTRE FACES = 1,5CM - NBR 9050 ACESSIBILIDADE)","m2    ",4.4800000000000004,1,4.4800000000000004,null,null,0,0,""]
[3,3,3,2,1,9,3,0,0,2,20,"","Nível 3","Nível 3","-","SINAPI",null,"ACESSO COLÉGIO / QUADRA","-",null,1,"-",null,null,0,0,""]
["S",3,"S",0,1,9,3,0,0,0,0,"","Serviço","Serviço","-","AGETOP",180304,"PORTAO DE ABRIR CHAPA 14  PT-4 C/FERRAGENS","m2    ",5.62,1,5.62,null,null,0,0,""]
[2,2,2,2,1,10,0,0,0,48,2,"","Nível 2","Nível 2","-",null,null,"VIDROS","-",null,1,"-",null,null,0,0,""]
["S",2,"S",0,1,10,0,0,0,0,0,"","Serviço","Serviço","-","SINAPI",72117,"VIDRO LISO COMUM TRANSPARENTE, ESPESSURA 4MM","M2",4.5999999999999996,1,4.5999999999999996,null,null,0,0,"Referência: AGETOP - 190102"]
[2,2,2,7,1,11,0,0,0,46,7,"","Nível 2","Nível 2","-",null,null,"REVESTIMENTO DE PAREDE","-",null,1,"-",null,null,0,0,""]
[{"$f":"CHOOSE(1+LOG(1+2*(ORÇAMENTO.Nivel=\"Nível 1\")+4*(ORÇAMENTO.Nivel=\"Nível 2\")+8*(ORÇAMENTO.Nivel=\"Nível 3\")+16*(ORÇAMENTO.Nivel=\"Nível 4\")+32*(ORÇAMENTO.Nivel=\"Serviço\"),2),0,1,2,3,4,\"S\")","v":3},3,3,3,1,11,1,0,0,6,3,"","Nível 3","Nível 3","-","SINAPI",null,"CASA ZELADOR / NOVA SECRETARIA","-",null,1,"-",null,null,0,0,""]
["S",3,"S",0,1,11,1,0,0,0,0,"","Serviço","Serviço","-","SINAPI",87553,"EMBOÇO, PARA RECEBIMENTO DE CERÂMICA, EM ARGAMASSA TRAÇO 1:2:8, PREPARO MECÂNICO COM BETONEIRA 400L, APLICADO MANUALMENTE EM FACES INTERNAS DE PAREDES, PARA AMBIENTE COM ÁREA MAIOR QUE 10M2, ESPESSURA DE 10MM, COM EXECUÇÃO DE TALISCAS. AF_06/2014","M2",23.7,1,23.7,null,null,0,0,""]
["S",3,"S",0,1,11,1,0,0,0,0,"","Serviço","Serviço","-","SINAPI",87273,"REVESTIMENTO CERÂMICO PARA PAREDES INTERNAS COM PLACAS TIPO ESMALTADA EXTRA DE DIMENSÕES 33X45 CM APLICADAS EM AMBIENTES DE ÁREA MAIOR QUE 5 M² NA ALTURA INTEIRA DAS PAREDES. AF_06/2014","M2",23.7,1,23.7,null,null,0,0,""]
[3,3,3,3,1,11,2,0,0,{"$f":"IF(OR($C212=\"S\",$C212=0),0,MATCH(0,OFFSET($D212,1,$C212,ROW($C$254)-ROW($C212)),0))","v":3},{"$f":"IF(OR($C212=\"S\",$C212=0),0,MATCH(OFFSET($D212,0,$C212)+1,OFFSET($D212,1,$C212,ROW($C$254)-ROW($C212)),0))","v":9},"","Nível 3","Nível 3","-","SINAPI",null,"ACESSO NOVA SECRETARIA","-",null,1,"-",null,null,0,0,""]
["S",3,"S",0,1,11,2,0,0,0,0,"","Serviço","Serviço","-","SINAPI",87904,"CHAPISCO APLICADO EM ALVENARIA (COM PRESENÇA DE VÃOS) E ESTRUTURAS DE CONCRETO DE FACHADA, COM COLHER DE PEDREIRO.  ARGAMASSA TRAÇO 1:3 COM PREPARO MANUAL. AF_06/2014","M2",56,1,56,null,null,0,0,"Referência: AGETOP - 200101"]
["S",3,"S",0,1,11,2,0,0,0,0,"","Serviço","Serviço","-","SINAPI",87547,"MASSA ÚNICA, PARA RECEBIMENTO DE PINTURA, EM ARGAMASSA TRAÇO 1:2:8, PREPARO MECÂNICO COM BETONEIRA 400L, APLICADA MANUALMENTE EM FACES INTERNAS DE PAREDES, ESPESSURA DE 10MM, COM EXECUÇÃO DE TALISCAS. AF_06/2014","M2",56,1,56,null,null,0,0,""]
[2,2,2,12,1,12,0,0,0,39,12,"","Nível 2","Nível 2","-",null,null,"REVESTIMENTO DE PISO","-",null,1,"-",null,null,0,0,""]
[{"$f":"CHOOSE(1+LOG(1+2*(ORÇAMENTO.Nivel=\"Nível 1\")+4*(ORÇAMENTO.Nivel=\"Nível 2\")+8*(ORÇAMENTO.Nivel=\"Nível 3\")+16*(ORÇAMENTO.Nivel=\"Nível 4\")+32*(ORÇAMENTO.Nivel=\"Serviço\"),2),0,1,2,3,4,\"S\")","v":3},3,3,3,1,12,1,0,0,11,3,"","Nível 3","Nível 3","-","SINAPI",null,"CASA ZELADOR / NOVA SECRETARIA","-",null,1,"-",null,null,0,0,""]
["S",3,"S",0,1,12,1,0,0,0,0,"","Serviço","Serviço","-","SINAPI",84191,"PISO EM GRANILITE, MARMORITE OU GRANITINA ESPESSURA 8 MM, INCLUSO JUNTAS DE DILATACAO PLASTICAS","M2",47.34,1,47.34,null,null,0,0,"Referência: AGETOP - 221101"]
["S",3,"S",0,1,12,1,0,0,0,0,"","Serviço","Serviço","-","AGETOP",221104,"RASPAGEM E APLICAÇÃO RESINA ACRÍLICA DUAS DEMÃOS","m2    ",47.34,1,47.34,null,null,0,0,""]
[3,3,3,2,1,12,2,0,0,8,2,"","Nível 3","Nível 3","-","SINAPI",null,"ACESSO NOVA SECRETARIA","-",null,1,"-",null,null,0,0,""]
["S",3,"S",0,1,12,2,0,0,0,0,"","Serviço","Serviço","-","AGETOP",220102,"PISO CONCRETO DESEMPENADO ESPESSURA = 5 CM  1:2,5:3,5","m2    ",68.709999999999994,1,68.709999999999994,null,null,0,0,""]
[3,3,3,3,1,12,3,0,0,6,3,"","Nível 3","Nível 3","-","SINAPI",null,"CALÇADAS","-",null,1,"-",null,null,0,0,""]
["S",3,"S",0,1,12,3,0,0,0,0,"","Serviço","Serviço","-","AGETOP",221126,"PISO DE LADRILHO HIDRÁULICO COLORIDO MODELO TÁTIL ( ALERTA OU DIRECIONAL) SEM LASTRO","m2    ",70,1,70,null,null,0,0,""]
["S",3,"S",0,1,12,3,0,0,0,0,"","Serviço","Serviço","-","AGETOP",220102,"PISO CONCRETO DESEMPENADO ESPESSURA = 5 CM  1:2,5:3,5","m2    ",286.52,1,286.52,null,null,0,0,""]
[3,3,3,3,1,12,4,0,0,3,{"$error":"#N/A"},"","Nível 3","Nível 3","-","SINAPI",null,"INST. ELÉTRICAS","-",null,1,"-",null,null,0,0,""]
["S",3,"S",0,1,12,4,0,0,0,0,"","Serviço","Serviço","-","SINAPI",94992,"EXECUÇÃO DE PASSEIO (CALÇADA) OU PISO DE CONCRETO COM CONCRETO MOLDADO IN LOCO, FEITO EM OBRA, ACABAMENTO CONVENCIONAL, ESPESSURA 6 CM, ARMADO. AF_07/2016","M2",3,1,3,null,null,0,0,""]
["S",3,"S",0,1,12,4,0,0,0,0,"","Serviço","Serviço","-","SINAPI",68325,"PISO EM CONCRETO 20 MPA PREPARO MECANICO, ESPESSURA 7CM, INCLUSO SELANTE ELASTICO A BASE DE POLIURETANO","M2",3,1,3,null,null,0,0,""]
[2,{"$f":"IF(OR(C227=\"s\",C227=0),OFFSET(B227,-1,0),C227)","v":2},{"$f":"IF(OFFSET(C227,-1,0)=\"L\",1,IF(OFFSET(C227,-1,0)=1,2,IF(OR(A227=\"s\",A227=0),\"S\",IF(AND(OFFSET(C227,-1,0)=2,A227=4),3,IF(AND(OR(OFFSET(C227,-1,0)=\"s\",OFFSET(C227,-1,0)=0),A227<>\"s\",A227>OFFSET(B227,-1,0)),OFFSET(B227,-1,0),A227)))))","v":2},{"$f":"IF(OR(C227=\"S\",C227=0),0,IF(ISERROR(K227),J227,SMALL(J227:K227,1)))","v":3},{"$f":"IF($C227=1,OFFSET(E227,-1,0)+1,OFFSET(E227,-1,0))","v":1},{"$f":"IF($C227=1,0,IF($C227=2,OFFSET(F227,-1,0)+1,OFFSET(F227,-1,0)))","v":13},{"$f":"IF(AND($C227<=2,$C227<>0),0,IF($C227=3,OFFSET(G227,-1,0)+1,OFFSET(G227,-1,0)))","v":0},{"$f":"IF(AND($C227<=3,$C227<>0),0,IF($C227=4,OFFSET(H227,-1,0)+1,OFFSET(H227,-1,0)))","v":0},{"$f":"IF(AND($C227<=4,$C227<>0),0,IF(AND($C227=\"S\",$Y227>0),OFFSET(I227,-1,0)+1,OFFSET(I227,-1,0)))","v":0},27,3,"","Nível 2","Nível 2","-",null,null,"ADMINISTRAÇÃO","-",null,1,"-",null,null,0,0,""]
["S",2,"S",0,1,13,0,0,0,0,0,"","Serviço","Serviço","-","SINAPI",90778,"ENGENHEIRO CIVIL DE OBRA PLENO COM ENCARGOS COMPLEMENTARES","H",30,1,30,null,null,0,0,"Referência: AGETOP - 250101"]
["S",2,"S",0,1,13,0,0,0,0,0,"","Serviço","Serviço","-","SINAPI",90776,"ENCARREGADO GERAL COM ENCARGOS COMPLEMENTARES","H",370,1,370,null,null,0,0,"Referência: AGETOP - 250103"]
[2,2,2,15,1,14,0,0,0,24,15,"","Nível 2","Nível 2","-",null,null,"PINTURA","-",null,1,"-",null,null,0,0,""]
[{"$f":"CHOOSE(1+LOG(1+2*(ORÇAMENTO.Nivel=\"Nível 1\")+4*(ORÇAMENTO.Nivel=\"Nível 2\")+8*(ORÇAMENTO.Nivel=\"Nível 3\")+16*(ORÇAMENTO.Nivel=\"Nível 4\")+32*(ORÇAMENTO.Nivel=\"Serviço\"),2),0,1,2,3,4,\"S\")","v":3},3,3,8,1,14,1,0,0,14,8,"","Nível 3","Nível 3","-","SINAPI",null,"CASA ZELADOR / NOVA SECRETARIA","-",null,1,"-",null,null,0,0,""]
["S",3,"S",0,1,14,1,0,0,0,0,"","Serviço","Serviço","-","AGETOP",260105,"REMOCAO DE PINTURA ANTIGA A OLEO OU ESMALTE","m2    ",27,1,27,null,null,0,0,""]
["S",3,"S",0,1,14,1,0,0,0,0,"","Serviço","Serviço","-","AGETOP",260104,"REMOCAO DE PINTURA ANTIGA A LATEX","m2    ",28,1,28,null,null,0,0,""]
["S",3,"S",0,1,14,1,0,0,0,0,"","Serviço","Serviço","-","SINAPI",88497,"APLICAÇÃO E LIXAMENTO DE MASSA LÁTEX EM PAREDES, DUAS DEMÃOS. AF_06/2014","M2",55,1,55,null,null,0,0,"Referência: AGETOP - 261300"]
["S",3,"S",0,1,14,1,0,0,0,0,"","Serviço","Serviço","-","AGETOP",261550,"PINT.ESMALTE SINT.PAREDES - 2 DEM.C/SELADOR","m2    ",55,1,55,null,null,0,0,""]
["S",3,"S",0,1,14,1,0,0,0,0,"","Serviço","Serviço","-","SINAPI",88489,"APLICAÇÃO MANUAL DE PINTURA COM TINTA LÁTEX ACRÍLICA EM PAREDES, DUAS DEMÃOS. AF_06/2014","M2",55,1,55,null,null,0,0,"Referência: AGETOP - 261001"]
["S",3,"S",0,1,14,1,0,0,0,0,"","Serviço","Serviço","-","SINAPI",88486,"APLICAÇÃO MANUAL DE PINTURA COM TINTA LÁTEX PVA EM TETO, DUAS DEMÃOS. AF_06/2014","M2",44.33,1,44.33,null,null,0,0,"Referência: AGETOP - 261307"]
["S",3,"S",0,1,14,1,0,0,0,0,"","Serviço","Serviço","-","AGETOP",261602,"PINT.ESMALTE/ESQUAD.FERRO C/FUNDO ANTICOR.","m2    ",23.69,1,23.69,null,null,0,0,""]
[3,3,3,4,1,14,2,0,0,6,4,"","Nível 3","Nível 3","-","SINAPI",null,"ACESSO NOVA SECRETARIA","-",null,1,"-",null,null,0,0,""]
["S",3,"S",0,1,14,2,0,0,0,0,"","Serviço","Serviço","-","AGETOP",261602,"PINT.ESMALTE/ESQUAD.FERRO C/FUNDO ANTICOR.","m2    ",14.82,1,14.82,null,null,0,0,""]
["S",3,"S",0,1,14,2,0,0,0,0,"","Serviço","Serviço","-","AGETOP",261000,"PINTURA LATEX ACRILICA 2 DEMAOS C/SELADOR","m2    ",5.71,1,5.71,null,null,0,0,""]
["S",3,"S",0,1,14,2,0,0,{"$f":"IF(OR($C242=\"S\",$C242=0),0,MATCH(0,OFFSET($D242,1,$C242,ROW($C$254)-ROW($C242)),0))","v":0},{"$f":"IF(OR($C242=\"S\",$C242=0),0,MATCH(OFFSET($D242,0,$C242)+1,OFFSET($D242,1,$C242,ROW($C$254)-ROW($C242)),0))","v":0},"","Serviço","Serviço","-","AGETOP",261609,"PINTURA ESMALTE ALQUIDICO ESTR.METALICA 2 DEMAOS","m2    ",35,1,35,null,null,0,0,""]
[3,3,3,2,1,14,3,0,0,2,{"$error":"#N/A"},"","Nível 3","Nível 3","-",null,null,"ACESSO COLÉGIO / QUADRA","-",null,1,"-",null,null,0,0,""]
["S",3,"S",0,1,14,3,0,0,0,0,"","Serviço","Serviço","-","AGETOP",261602,"PINT.ESMALTE/ESQUAD.FERRO C/FUNDO ANTICOR.","m2    ",16.86,1,16.86,null,null,0,0,""]
[2,{"$f":"IF(OR(C245=\"s\",C245=0),OFFSET(B245,-1,0),C245)","v":2},{"$f":"IF(OFFSET(C245,-1,0)=\"L\",1,IF(OFFSET(C245,-1,0)=1,2,IF(OR(A245=\"s\",A245=0),\"S\",IF(AND(OFFSET(C245,-1,0)=2,A245=4),3,IF(AND(OR(OFFSET(C245,-1,0)=\"s\",OFFSET(C245,-1,0)=0),A245<>\"s\",A245>OFFSET(B245,-1,0)),OFFSET(B245,-1,0),A245)))))","v":2},{"$f":"IF(OR(C245=\"S\",C245=0),0,IF(ISERROR(K245),J245,SMALL(J245:K245,1)))","v":9},{"$f":"IF($C245=1,OFFSET(E245,-1,0)+1,OFFSET(E245,-1,0))","v":1},{"$f":"IF($C245=1,0,IF($C245=2,OFFSET(F245,-1,0)+1,OFFSET(F245,-1,0)))","v":15},{"$f":"IF(AND($C245<=2,$C245<>0),0,IF($C245=3,OFFSET(G245,-1,0)+1,OFFSET(G245,-1,0)))","v":0},{"$f":"IF(AND($C245<=3,$C245<>0),0,IF($C245=4,OFFSET(H245,-1,0)+1,OFFSET(H245,-1,0)))","v":0},{"$f":"IF(AND($C245<=4,$C245<>0),0,IF(AND($C245=\"S\",$Y245>0),OFFSET(I245,-1,0)+1,OFFSET(I245,-1,0)))","v":0},9,{"$error":"#N/A"},"","Nível 2","Nível 2","-",null,null,"DIVERSOS","-",null,1,"-",null,null,0,0,""]
[{"$f":"CHOOSE(1+LOG(1+2*(ORÇAMENTO.Nivel=\"Nível 1\")+4*(ORÇAMENTO.Nivel=\"Nível 2\")+8*(ORÇAMENTO.Nivel=\"Nível 3\")+16*(ORÇAMENTO.Nivel=\"Nível 4\")+32*(ORÇAMENTO.Nivel=\"Serviço\"),2),0,1,2,3,4,\"S\")","v":3},3,3,2,1,15,1,0,0,8,2,"","Nível 3","Nível 3","-","SINAPI",null,"CASA ZELADOR / NOVA SECRETARIA","-",null,1,"-",null,null,0,0,""]
["S",3,"S",0,1,15,1,0,0,0,0,"","Serviço","Serviço","-","AGETOP",271608,"BANCADA DE GRANITO C/ESPELHO","m2    ",0.7,1,0.7,null,null,0,0,""]
[3,3,3,3,1,15,2,0,0,6,3,"","Nível 3","Nível 3","-","SINAPI",null,"ACESSO NOVA SECRETARIA","-",null,1,"-",null,null,0,0,""]
["S",3,"S",0,1,15,2,0,0,0,0,"","Serviço","Serviço","-","AGETOP",270312,"MURO DE ALVENARIA TIJOLO FURADO 1/2 VEZ ( H=2,50M) COM FUNDAÇÃO - SEM REVESTIMENTOS (PADRÃO GOINFRA)","m2    ",28,1,28,null,null,0,0,""]
["S",3,"S",0,1,15,2,0,0,0,0,"","Serviço","Serviço","-","AGETOP",271417,"CANALETA CONCRETO DESEMPENADO 5 CM PD.GOINFRA","m     ",11.2,1,11.2,null,null,0,0,""]
[3,3,3,3,1,15,3,0,0,3,{"$error":"#N/A"},"","Nível 3","Nível 3","-","SINAPI",null,"OUTROS","-",null,1,"-",null,null,0,0,""]
["S",3,"S",0,1,15,3,0,0,0,0,"","Serviço","Serviço","-","AGETOP",270501,"LIMPEZA FINAL DE OBRA - (OBRAS CIVIS)","m2    ",306.48,1,306.48,null,null,0,0,""]
["S",3,"S",0,1,15,3,0,0,0,0,"","Serviço","Serviço","-","AGETOP",270804,"PLACA DE INAUGURAÇÃO AÇO ESCOVADO 60 X 120 CM","un    ",1,1,1,null,null,0,0,""]
[-1,null,-1,null,0,0,0,0,0,null,null,"F"]
[null,null,null,null,null,null,null,null,null,null,null,"F",null,null,null,null,null,"OBS: OS QUANTITATIVOS DE MATERIAIS  DAS INSTALAÇÕES HIDROSSANITÁRIAS, ELÉTRICAS E ESPECIAIS SÃO FORNECIDOS PELOS PROFISSIONAIS RESPONSÁVEIS PELOS RESPECTIVOS PROJETOS.",null,null,null,null,"VALOR TOTAL",null,null,0]
[null,null,null,null,null,null,null,null,null,null,null,"F",null,null,null,null,null,null,null,null,null,null,"VALOR BDI (26,44%)",null,null,0]
[null,null,null,null,null,null,null,null,null,null,null,"F",null,null,null,null,null,null,null,null,null,null,"TOTAL ORÇAMENTO",null,null,0]
[null,null,null,null,null,null,null,null,null,null,null,"F"]
[null,null,null,null,null,null,null,null,null,null,null,"F",null,null,null,null,null,null,null,null,null,null,"CUSTO POR M2 ³",null,null,0]
[null,null,null,null,null,null,null,null,null,null,null,"F",null,null,null,null,null,null,null,null,null,null,"MATERIAL S/ BDI",null,null,0]
[null,null,null,null,null,null,null,null,null,null,null,"F",null,null,null,null,null,null,null,null,null,null,"MÃO DE OBRA S/ BDI",null,null,0]
[null,null,null,null,null,null,null,null,null,null,null,"F"]
[null,null,null,null,null,null,null,null,null,null,null,"F",null,null,null,null,"(1) Conforme previsto pelo DECRETO Nº 7.983, DE 8 DE ABRIL DE 2013, os preços adotados são aqueles constantes dos sistemas de referência indicados. Justifica-se o uso dos preços destas composições de custos unitários devido ao seu valor ser menor à mediana de seus correspondentes na tabela SINAPI;"]
[null,null,null,null,null,null,null,null,null,null,null,"F",null,null,null,null,"(2) Optou-se pelo uso das composições de custos da AGETOP para itens não presentes na SINAPI;"]
[null,null,null,null,null,null,null,null,null,null,null,"F",null,null,null,null,"(3) Para itens da AGETOP, os vidros não estão inclusos nas esquadrias e já foram considerados os custos de contramarco para as esquadrias de alumínio;"]
[null,null,null,null,null,null,null,null,null,null,null,"F",null,null,null,null,"(4) Nos casos em que houver execução de granitina e omissão do item AGETOP 221102, considerou-se que o quantitativo para o rodapé, de altura igual a 7cm, foi incorporado na área de piso;"]
[null,null,null,null,null,null,null,null,null,null,null,"F",null,null,null,null,"(5) O custo unitário aproximado por metro quadrado é calculado dividindo-se o valor total do orçamento pela área total de construção."]
[null,null,null,null,null,null,null,null,null,null,null,"F"]
[null,null,null,null,null,null,null,null,null,null,null,"F"]
[]
[null,null,null,null,null,null,null,null,null,null,null,null,null,null,"SOMATÓRIO DE SERVIÇOS"]
[null,null,null,null,null,null,null,null,null,null,null,null,null,null,"ITEM","DESCRIÇÃO DOS SERVIÇOS",null,null,"PREÇO SEM BDI",null,null,null,null,"PREÇO COM BDI",null,null,"PARTICIPAÇÃO ( % )"]
[null,null,null,null,null,null,null,null,null,null,null,null,null,null,"a.","SERVIÇOS PRELIMINARES",null,null,0,null,null,null,null,0,null,null,0]
[null,null,null,null,null,null,null,null,null,null,null,null,null,null,"b.","TRANSPORTES",null,null,0,null,null,null,null,0,null,null,0]
[null,null,null,null,null,null,null,null,null,null,null,null,null,null,"c.","SERVIÇO EM TERRA",null,null,0,null,null,null,null,0,null,null,0]
[null,null,null,null,null,null,null,null,null,null,null,null,null,null,"d.","FUNDAÇÕES E SONDAGENS",null,null,0,null,null,null,null,0,null,null,0]
[null,null,null,null,null,null,null,null,null,null,null,null,null,null,"e.","ESTRUTURA",null,null,0,null,null,null,null,0,null,null,0]
[null,null,null,null,null,null,null,null,null,null,null,null,null,null,"f.","INSTALAÇÕES ELÉTRICAS",null,null,0,null,null,null,null,0,null,null,0]
[null,null,null,null,null,null,null,null,null,null,null,null,null,null,"g.","INSTALAÇÕES HIDROSSANITÁRIAS",null,null,0,null,null,null,null,0,null,null,0]
[null,null,null,null,null,null,null,null,null,null,null,null,null,null,"h","INSTALAÇÕES ESPECIAIS",null,null,0,null,null,null,null,0,null,null,0]
[null,null,null,null,null,null,null,null,null,null,null,null,null,null,"i.","ALVENARIAS E DIVISÓRIAS",null,null,0,null,null,null,null,0,null,null,0]
[null,null,null,null,null,null,null,null,null,null,null,null,null,null,"j.","ALVENARIA AUTO-PORTANTE",null,null,0,null,null,null,null,0,null,null,0]
[null,null,null,null,null,null,null,null,null,null,null,null,null,null,"k.","IMPERMEABILIZAÇÃO",null,null,0,null,null,null,null,0,null,null,0]
[null,null,null,null,null,null,null,null,null,null,null,null,null,null,"l.","ISOLAMENTO TÉRMICO E ACÚSTICO",null,null,0,null,null,null,null,0,null,null,0]
[null,null,null,null,null,null,null,null,null,null,null,null,null,null,"m.","ESTRUTURA DE MADEIRA",null,null,0,null,null,null,null,0,null,null,0]
[null,null,null,null,null,null,null,null,null,null,null,null,null,null,"n.","ESTRUTURAS METÁLICAS",null,null,0,null,null,null,null,0,null,null,0]
[null,null,null,null,null,null,null,null,null,null,null,null,null,null,"o.","COBERTURAS",null,null,0,null,null,null,null,0,null,null,0]
[null,null,null,null,null,null,null,null,null,null,null,null,null,null,"p.","ESQUADRIAS DE MADEIRA",null,null,0,null,null,null,null,0,null,null,0]
[null,null,null,null,null,null,null,null,null,null,null,null,null,null,"q.","ESQUADRIAS METÁLICAS",null,null,0,null,null,null,null,0,null,null,0]
[null,null,null,null,null,null,null,null,null,null,null,null,null,null,"r.","VIDROS",null,null,0,null,null,null,null,0,null,null,0]
[null,null,null,null,null,null,null,null,null,null,null,null,null,null,"s.","REVESTIMENTO DE PAREDE",null,null,0,null,null,null,null,0,null,null,0]
[null,null,null,null,null,null,null,null,null,null,null,null,null,null,"t.","FORROS",null,null,0,null,null,null,null,0,null,null,0]
[null,null,null,null,null,null,null,null,null,null,null,null,null,null,"u.","REVESTIMENTO DE PISO",null,null,0,null,null,null,null,0,null,null,0]
[null,null,null,null,null,null,null,null,null,null,null,null,null,null,"v.","FERRAGENS",null,null,0,null,null,null,null,0,null,null,0]
[null,null,null,null,null,null,null,null,null,null,null,null,null,null,"w.","MARCENARIA",null,null,0,null,null,null,null,0,null,null,0]
[null,null,null,null,null,null,null,null,null,null,null,null,null,null,"x.","ADMINISTRAÇÃO",null,null,0,null,null,null,null,0,null,null,0]
[null,null,null,null,null,null,null,null,null,null,null,null,null,null,"y.","PINTURA",null,null,0,null,null,null,null,0,null,null,0]
[null,null,null,null,null,null,null,null,null,null,null,null,null,null,"z.","DIVERSOS",null,null,0,null,null,null,null,0,null,null,0]
[null,null,null,null,null,null,null,null,null,null,null,null,null,null,"TOTAL GERAL DO ORÇAMENTO (R$)",null,null,null,0,null,null,null,null,0,null,null,0]
[null,null,null,null,null,null,null,null,null,null,null,null,null,null,null,null,null,null,0,null,null,null,null,0,null,null,100]
[null,null,null,null,null,null,null,null,null,null,null,null,null,null,null,null,null,null,"(TOTAL SEM BDI)",null,null,null,null,"(TOTAL COM BDI)",null,null,"(ARRED porcentagem)"]
[null,null,null,null,null,null,null,null,null,null,null,null,null,null,null,null,null,null,"ERRO",null,null,null,null,"ERRO",null,null,"ERRO"]
[]
[]
[null,null,null,null,null,null,null,null,null,null,null,null,null,null,"RESUMO GERAL DO ORÇAMENTO"]
[null,null,null,null,null,null,null,null,null,null,null,null,null,null,"ITEM","DESCRIÇÃO DOS SERVIÇOS",null,null,"PREÇO SEM BDI",null,null,null,null,"PREÇO COM BDI",null,null,"PARTICIPAÇÃO ( % )"]
[null,null,null,null,null,null,null,null,null,null,null,null,null,null,"1.","REFORMA",null,null,0,null,null,null,null,0,null,null,100]
[null,null,null,null,null,null,null,null,null,null,null,null,null,null,"2.","",null,null,0,null,null,null,null,0,null,null,0]
[null,null,null,null,null,null,null,null,null,null,null,null,null,null,"3.","",null,null,0,null,null,null,null,0,null,null,0]
[null,null,null,null,null,null,null,null,null,null,null,null,null,null,"4.","",null,null,0,null,null,null,null,0,null,null,0]
[null,null,null,null,null,null,null,null,null,null,null,null,null,null,"5.","",null,null,0,null,null,null,null,0,null,null,0]
[null,null,null,null,null,null,null,null,null,null,null,null,null,null,"6.","",null,null,0,null,null,null,null,0,null,null,0]
[null,null,null,null,null,null,null,null,null,null,null,null,null,null,"7.","",null,null,0,null,null,null,null,0,null,null,0]
[null,null,null,null,null,null,null,null,null,null,null,null,null,null,"8.","",null,null,0,null,null,null,null,0,null,null,0]
[null,null,null,null,null,null,null,null,null,null,null,null,null,null,"9.","",null,null,0,null,null,null,null,0,null,null,0]
[null,null,null,null,null,null,null,null,null,null,null,null,null,null,"10.","",null,null,0,null,null,null,null,0,null,null,0]
[null,null,null,null,null,null,null,null,null,null,null,null,null,null,"11.","",null,null,0,null,null,null,null,0,null,null,0]
[null,null,null,null,null,null,null,null,null,null,null,null,null,null,"12.","",null,null,0,null,null,null,null,0,null,null,0]
[null,null,null,null,null,null,null,null,null,null,null,null,null,null,"13.","",null,null,0,null,null,null,null,0,null,null,0]
[null,null,null,null,null,null,null,null,null,null,null,null,null,null,"14.","",null,null,0,null,null,null,null,0,null,null,0]
[null,null,null,null,null,null,null,null,null,null,null,null,null,null,"15.","",null,null,0,null,null,null,null,0,null,null,0]
[null,null,null,null,null,null,null,null,null,null,null,null,null,null,"16.","",null,null,0,null,null,null,null,0,null,null,0]
[null,null,null,null,null,null,null,null,null,null,null,null,null,null,"17.","",null,null,0,null,null,null,null,0,null,null,0]
[null,null,null,null,null,null,null,null,null,null,null,null,null,null,"18.","",null,null,0,null,null,null,null,0,null,null,0]
[null,null,null,null,null,null,null,null,null,null,null,null,null,null,"19.","",null,null,0,null,null,null,null,0,null,null,0]
[null,null,null,null,null,null,null,null,null,null,null,null,null,null,"20.","",null,null,0,null,null,null,null,0,null,null,0]
[null,null,null,null,null,null,null,null,null,null,null,null,null,null,"TOTAL GERAL DO ORÇAMENTO (R$)",null,null,null,0,null,null,null,null,0,null,null,100]
[null,null,null,null,null,null,null,null,null,null,null,null,null,null,null,null,null,null,0,null,null,null,null,0,null,null,100]
[null,null,null,null,null,null,null,null,null,null,null,null,null,null,null,null,null,null,"(TOTAL SEM BDI)",null,null,null,null,"(TOTAL COM BDI)",null,null,"(ARRED porcentagem)"]
[null,null,null,null,null,null,null,null,null,null,null,null,null,null,null,null,null,null,"ERRO",null,null,null,null,"ERRO",null,null,"ERRO"]

{"sheet":"Resumo ","index":1,"n_rows":39,"n_cols":9,"rows_kept":39,"cut":false,"hidden":false,"merged":[[13,0,14,0],[15,2,15,5],[16,2,16,5],[17,2,17,5],[18,2,18,5],[14,1,14,8],[0,1,0,8],[36,1,36,5],[2,1,2,5],[3,1,3,5],[5,1,5,5],[6,1,6,5],[8,1,8,5],[9,1,9,5],[11,3,11,5],[12,3,12,5],[10,1,10,8],[11,6,11,8],[12,6,12,8],[19,2,19,5],[20,2,20,5],[21,2,21,5],[31,2,31,5],[1,1,1,8],[2,6,2,8],[3,6,3,8],[4,1,4,8],[5,6,5,8],[6,6,6,8],[7,1,7,8],[8,6,8,8],[9,6,9,8],[13,1,13,8],[11,1,11,2],[12,1,12,2],[42,3,42,7],[41,3,41,7],[38,1,38,8],[22,2,22,5],[23,2,23,5],[24,2,24,5],[25,2,25,5],[26,2,26,5],[32,2,32,5],[33,2,33,5],[34,2,34,5],[35,2,35,5],[27,2,27,5],[28,2,28,5],[29,2,29,5],[30,2,30,5]]}
[]
[]
[null,"UNIDADE ESCOLAR",null,null,null,null,"CÓDIGO INEP"]
[null,{"$f":"Orçamento!$O$5","v":"CENTRO DE ENSINO EM PERÍODO INTEGRAL JOSÉ EDUARDO DO COUTO"},null,null,null,null,{"$f":"Orçamento!X5","v":52024148}]
[]
[null,"OBRA",null,null,null,null,"CIDADE"]
[null,{"$f":"Orçamento!$O$8","v":"REFORMA"},null,null,null,null,{"$f":"Orçamento!$X$8","v":"ITAGUARI"}]
[]
[null,"ENDEREÇO",null,null,null,null,"CRE"]
[null,{"$f":"Orçamento!$R$11","v":" RUA JOSE FERNANDES CARVALHARES 197 Nº 197 , CENTRO , CEP: 7665-000"},null,null,null,null,{"$f":"Orçamento!$O$11","v":"CRE-ITABERAI"}]
[]
[null,"REFERÊNCIA",null,"DATA",null,null,"ÁREA TOTAL CONSTRUÍDA (M²)"]
[null,{"$f":"CONCATENATE(\"AGETOP E SINAPI - \",Orçamento!$T$11)","v":"AGETOP E SINAPI - DESONERADA"},null,{"$f":"Orçamento!$S$8","v":"2020-05-26"},null,null,{"$f":"Orçamento!$X$14","v":970.52}]
["FILTRO"]
[null,"RESUMO GERAL DO ORÇAMENTO"]
["↓","ITEM","DESCRIÇÃO DOS SERVIÇOS",null,null,null,"PREÇO SEM BDI","PREÇO COM BDI","PARTICIP. (%)"]
[{"$f":"IF(G17>0,\"F\",\"\")","v":""},"1.",{"$f":"Orçamento!$P307","v":"REFORMA"},null,null,null,{"$f":"IFERROR(Orçamento!S307,\"-\")","v":0},{"$f":"IFERROR(Orçamento!X307,\"\")","v":0},{"$f":"Orçamento!AA307","v":100}]
[{"$f":"IF(G18>0,\"F\",\"\")","v":""},"2.",{"$f":"Orçamento!$P308","v":""},null,null,null,{"$f":"IFERROR(Orçamento!S308,\"-\")","v":0},{"$f":"IFERROR(Orçamento!X308,\"\")","v":0},{"$f":"Orçamento!AA308","v":0}]
["","3.",{"$f":"Orçamento!$P309","v":""},null,null,null,{"$f":"IFERROR(Orçamento!S309,\"-\")","v":0},{"$f":"IFERROR(Orçamento!X309,\"\")","v":0},{"$f":"Orçamento!AA309","v":0}]
["","4.",{"$f":"Orçamento!$P310","v":""},null,null,null,{"$f":"IFERROR(Orçamento!S310,\"-\")","v":0},{"$f":"IFERROR(Orçamento!X310,\"\")","v":0},{"$f":"Orçamento!AA310","v":0}]
["","5.",{"$f":"Orçamento!$P311","v":""},null,null,null,{"$f":"IFERROR(Orçamento!S311,\"-\")","v":0},{"$f":"IFERROR(Orçamento!X311,\"\")","v":0},{"$f":"Orçamento!AA311","v":0}]
["","6.",{"$f":"Orçamento!$P312","v":""},null,null,null,{"$f":"IFERROR(Orçamento!S312,\"-\")","v":0},{"$f":"IFERROR(Orçamento!X312,\"\")","v":0},{"$f":"Orçamento!AA312","v":0}]
["","7.",{"$f":"Orçamento!$P313","v":""},null,null,null,{"$f":"IFERROR(Orçamento!S313,\"-\")","v":0},{"$f":"IFERROR(Orçamento!X313,\"\")","v":0},{"$f":"Orçamento!AA313","v":0}]
["","8.",{"$f":"Orçamento!$P314","v":""},null,null,null,{"$f":"IFERROR(Orçamento!S314,\"-\")","v":0},{"$f":"IFERROR(Orçamento!X314,\"\")","v":0},{"$f":"Orçamento!AA314","v":0}]
["","9.",{"$f":"Orçamento!$P315","v":""},null,null,null,{"$f":"IFERROR(Orçamento!S315,\"-\")","v":0},{"$f":"IFERROR(Orçamento!X315,\"\")","v":0},{"$f":"Orçamento!AA315","v":0}]
["","10.",{"$f":"Orçamento!$P316","v":""},null,null,null,{"$f":"IFERROR(Orçamento!S316,\"-\")","v":0},{"$f":"IFERROR(Orçamento!X316,\"\")","v":0},{"$f":"Orçamento!AA316","v":0}]
["","11.",{"$f":"Orçamento!$P317","v":""},null,null,null,{"$f":"IFERROR(Orçamento!S317,\"-\")","v":0},{"$f":"IFERROR(Orçamento!X317,\"\")","v":0},{"$f":"Orçamento!AA317","v":0}]
["","12.",{"$f":"Orçamento!$P318","v":""},null,null,null,{"$f":"IFERROR(Orçamento!S318,\"-\")","v":0},{"$f":"IFERROR(Orçamento!X318,\"\")","v":0},{"$f":"Orçamento!AA318","v":0}]
["","13.",{"$f":"Orçamento!$P319","v":""},null,null,null,{"$f":"IFERROR(Orçamento!S319,\"-\")","v":0},{"$f":"IFERROR(Orçamento!X319,\"\")","v":0},{"$f":"Orçamento!AA319","v":0}]
["","14.",{"$f":"Orçamento!$P320","v":""},null,null,null,{"$f":"IFERROR(Orçamento!S320,\"-\")","v":0},{"$f":"IFERROR(Orçamento!X320,\"\")","v":0},{"$f":"Orçamento!AA320","v":0}]
["","15.",{"$f":"Orçamento!$P321","v":""},null,null,null,{"$f":"IFERROR(Orçamento!S321,\"-\")","v":0},{"$f":"IFERROR(Orçamento!X321,\"\")","v":0},{"$f":"Orçamento!AA321","v":0}]
["","16.",{"$f":"Orçamento!$P322","v":""},null,null,null,{"$f":"IFERROR(Orçamento!S322,\"-\")","v":0},{"$f":"IFERROR(Orçamento!X322,\"\")","v":0},{"$f":"Orçamento!AA322","v":0}]
["","17.",{"$f":"Orçamento!$P323","v":""},null,null,null,{"$f":"IFERROR(Orçamento!S323,\"-\")","v":0},{"$f":"IFERROR(Orçamento!X323,\"\")","v":0},{"$f":"Orçamento!AA323","v":0}]
["","18.",{"$f":"Orçamento!$P324","v":""},null,null,null,{"$f":"IFERROR(Orçamento!S324,\"-\")","v":0},{"$f":"IFERROR(Orçamento!X324,\"\")","v":0},{"$f":"Orçamento!AA324","v":0}]
["","19.",{"$f":"Orçamento!$P325","v":""},null,null,null,{"$f":"IFERROR(Orçamento!S325,\"-\")","v":0},{"$f":"IFERROR(Orçamento!X325,\"\")","v":0},{"$f":"Orçamento!AA325","v":0}]
["","20.",{"$f":"Orçamento!$P326","v":""},null,null,null,{"$f":"IFERROR(Orçamento!S326,\"-\")","v":0},{"$f":"IFERROR(Orçamento!X326,\"\")","v":0},{"$f":"Orçamento!AA326","v":0}]
["F","TOTAL GERAL DO ORÇAMENTO (R$)",null,null,null,null,{"$f":"SUM(G17:G36)","v":0},0,{"$f":"SUM(I17:I36)","v":100}]
["F"]
["F"]

{"sheet":"Somatório","index":2,"n_rows":45,"n_cols":6,"rows_kept":45,"cut":false,"hidden":false,"merged":[[13,0,14,0],[42,1,42,2],[44,1,44,5],[47,3,47,5],[48,3,48,5],[13,1,13,5],[9,1,9,3],[9,4,9,5],[11,1,11,2],[11,4,11,5],[12,1,12,2],[12,4,12,5],[0,1,0,5],[14,1,14,5],[2,1,2,3],[2,4,2,5],[3,1,3,3],[3,4,3,5],[5,1,5,3],[5,4,5,5],[6,1,6,3],[6,4,6,5],[8,1,8,3],[8,4,8,5],[1,1,1,5],[4,1,4,5],[7,1,7,5],[10,1,10,5]]}
[]
[]
[null,"UNIDADE ESCOLAR",null,null,"CÓDIGO INEP"]
[null,{"$f":"Orçamento!$O$5","v":"CENTRO DE ENSINO EM PERÍODO INTEGRAL JOSÉ EDUARDO DO COUTO"},null,null,{"$f":"Orçamento!X5","v":52024148}]
[]
[null,"OBRA",null,null,"CIDADE"]
[null,{"$f":"Orçamento!$O$8","v":"REFORMA"},null,null,{"$f":"Orçamento!$X$8","v":"ITAGUARI"}]
[]
[null,"ENDEREÇO",null,null,"CRE"]
[null,{"$f":"Orçamento!$R$11","v":" RUA JOSE FERNANDES CARVALHARES 197 Nº 197 , CENTRO , CEP: 7665-000"},null,null,{"$f":"Orçamento!$O$11","v":"CRE-ITABERAI"}]
[]
[null,"REFERÊNCIA",null,"DATA","ÁREA TOTAL CONSTRUÍDA (M²)"]
[null,{"$f":"CONCATENATE(\"AGETOP E SINAPI - \",Orçamento!$T$11)","v":"AGETOP E SINAPI - DESONERADA"},null,{"$f":"Orçamento!$S$8","v":"2020-05-26"},{"$f":"Orçamento!$X$14","v":970.52}]
["FILTRO"]
[null,"SOMATÓRIO DE SERVIÇOS"]
["↓","ITEM","DESCRIÇÃO DOS SERVIÇOS","PREÇO SEM BDI (R$)","PREÇO COM BDI (R$)","PARTIC.  ( % )"]
[{"$f":"IF(D17>0,\"F\",\"\")","v":""},"a.",{"$f":"Orçamento!P273","v":"SERVIÇOS PRELIMINARES"},{"$f":"Orçamento!S273","v":0},{"$f":"Orçamento!X273","v":0},{"$f":"Orçamento!AA273","v":0}]
[{"$f":"IF(D18>0,\"F\",\"\")","v":""},"b.",{"$f":"Orçamento!P274","v":"TRANSPORTES"},{"$f":"Orçamento!S274","v":0},{"$f":"Orçamento!X274","v":0},{"$f":"Orçamento!AA274","v":0}]
["","c.",{"$f":"Orçamento!P275","v":"SERVIÇO EM TERRA"},{"$f":"Orçamento!S275","v":0},{"$f":"Orçamento!X275","v":0},{"$f":"Orçamento!AA275","v":0}]
["","d.",{"$f":"Orçamento!P276","v":"FUNDAÇÕES E SONDAGENS"},{"$f":"Orçamento!S276","v":0},{"$f":"Orçamento!X276","v":0},{"$f":"Orçamento!AA276","v":0}]
["","e.",{"$f":"Orçamento!P277","v":"ESTRUTURA"},{"$f":"Orçamento!S277","v":0},{"$f":"Orçamento!X277","v":0},{"$f":"Orçamento!AA277","v":0}]
["","f.",{"$f":"Orçamento!P278","v":"INSTALAÇÕES ELÉTRICAS"},{"$f":"Orçamento!S278","v":0},{"$f":"Orçamento!X278","v":0},{"$f":"Orçamento!AA278","v":0}]
["","g.",{"$f":"Orçamento!P279","v":"INSTALAÇÕES HIDROSSANITÁRIAS"},{"$f":"Orçamento!S279","v":0},{"$f":"Orçamento!X279","v":0},{"$f":"Orçamento!AA279","v":0}]
["","h",{"$f":"Orçamento!P280","v":"INSTALAÇÕES ESPECIAIS"},{"$f":"Orçamento!S280","v":0},{"$f":"Orçamento!X280","v":0},{"$f":"Orçamento!AA280","v":0}]
["","i.",{"$f":"Orçamento!P281","v":"ALVENARIAS E DIVISÓRIAS"},{"$f":"Orçamento!S281","v":0},{"$f":"Orçamento!X281","v":0},{"$f":"Orçamento!AA281","v":0}]
["","j.",{"$f":"Orçamento!P282","v":"ALVENARIA AUTO-PORTANTE"},{"$f":"Orçamento!S282","v":0},{"$f":"Orçamento!X282","v":0},{"$f":"Orçamento!AA282","v":0}]
["","k.",{"$f":"Orçamento!P283","v":"IMPERMEABILIZAÇÃO"},{"$f":"Orçamento!S283","v":0},{"$f":"Orçamento!X283","v":0},{"$f":"Orçamento!AA283","v":0}]
["","l.",{"$f":"Orçamento!P284","v":"ISOLAMENTO TÉRMICO E ACÚSTICO"},{"$f":"Orçamento!S284","v":0},{"$f":"Orçamento!X284","v":0},{"$f":"Orçamento!AA284","v":0}]
["","m.",{"$f":"Orçamento!P285","v":"ESTRUTURA DE MADEIRA"},{"$f":"Orçamento!S285","v":0},{"$f":"Orçamento!X285","v":0},{"$f":"Orçamento!AA285","v":0}]
["","n.",{"$f":"Orçamento!P286","v":"ESTRUTURAS METÁLICAS"},{"$f":"Orçamento!S286","v":0},{"$f":"Orçamento!X286","v":0},{"$f":"Orçamento!AA286","v":0}]
["","o.",{"$f":"Orçamento!P287","v":"COBERTURAS"},{"$f":"Orçamento!S287","v":0},{"$f":"Orçamento!X287","v":0},{"$f":"Orçamento!AA287","v":0}]
["","p.",{"$f":"Orçamento!P288","v":"ESQUADRIAS DE MADEIRA"},{"$f":"Orçamento!S288","v":0},{"$f":"Orçamento!X288","v":0},{"$f":"Orçamento!AA288","v":0}]
["","q.",{"$f":"Orçamento!P289","v":"ESQUADRIAS METÁLICAS"},{"$f":"Orçamento!S289","v":0},{"$f":"Orçamento!X289","v":0},{"$f":"Orçamento!AA289","v":0}]
["","r.",{"$f":"Orçamento!P290","v":"VIDROS"},{"$f":"Orçamento!S290","v":0},{"$f":"Orçamento!X290","v":0},{"$f":"Orçamento!AA290","v":0}]
["","s.",{"$f":"Orçamento!P291","v":"REVESTIMENTO DE PAREDE"},{"$f":"Orçamento!S291","v":0},{"$f":"Orçamento!X291","v":0},{"$f":"Orçamento!AA291","v":0}]
["","t.",{"$f":"Orçamento!P292","v":"FORROS"},{"$f":"Orçamento!S292","v":0},{"$f":"Orçamento!X292","v":0},{"$f":"Orçamento!AA292","v":0}]
["","u.",{"$f":"Orçamento!P293","v":"REVESTIMENTO DE PISO"},{"$f":"Orçamento!S293","v":0},{"$f":"Orçamento!X293","v":0},{"$f":"Orçamento!AA293","v":0}]
["","v.",{"$f":"Orçamento!P294","v":"FERRAGENS"},{"$f":"Orçamento!S294","v":0},{"$f":"Orçamento!X294","v":0},{"$f":"Orçamento!AA294","v":0}]
["","w.",{"$f":"Orçamento!P295","v":"MARCENARIA"},{"$f":"Orçamento!S295","v":0},{"$f":"Orçamento!X295","v":0},{"$f":"Orçamento!AA295","v":0}]
["","x.",{"$f":"Orçamento!P296","v":"ADMINISTRAÇÃO"},{"$f":"Orçamento!S296","v":0},{"$f":"Orçamento!X296","v":0},{"$f":"Orçamento!AA296","v":0}]
["","y.",{"$f":"Orçamento!P297","v":"PINTURA"},{"$f":"Orçamento!S297","v":0},{"$f":"Orçamento!X297","v":0},{"$f":"Orçamento!AA297","v":0}]
["","z.",{"$f":"Orçamento!P298","v":"DIVERSOS"},{"$f":"Orçamento!S298","v":0},{"$f":"Orçamento!X298","v":0},{"$f":"Orçamento!AA298","v":0}]
["F","TOTAL GERAL DO ORÇAMENTO",null,{"$f":"SUM(D17:D42)","v":0},{"$f":"SUM(E17:E42)","v":0},{"$f":"SUM(F17:F42)","v":0}]
[]
[null,"(*) Para itens da AGETOP, os vidros não estão inclusos nas esquadrias e já foram considerados os custos de contramarco para as esquadrias de alumínio;"]

{"sheet":"Cronog_60_Dias","index":3,"n_rows":99,"n_cols":14,"rows_kept":99,"cut":false,"hidden":false,"merged":[[12,0,13,0],[9,0,11,0],[11,1,11,13],[92,1,92,2],[92,5,92,8],[92,9,92,12],[93,1,93,2],[93,5,93,8],[93,9,93,12],[74,9,74,12],[74,5,74,8],[68,9,68,12],[70,5,70,8],[70,9,70,12],[59,5,59,8],[71,1,73,2],[71,4,73,4],[71,5,71,8],[71,9,71,12],[73,5,73,8],[73,9,73,12],[59,9,59,12],[61,5,61,8],[61,9,61,12],[94,1,94,2],[94,5,94,8],[94,9,94,12],[76,5,76,8],[76,9,76,12],[77,5,77,8],[77,9,77,12],[79,5,79,8],[79,9,79,12],[80,5,80,8],[80,9,80,12],[82,5,82,8],[82,9,82,12],[77,3,79,3],[80,3,82,3],[86,1,88,2],[80,4,82,4],[83,3,85,3],[77,1,79,2],[77,4,79,4],[80,1,82,2],[95,1,95,2],[95,5,95,8],[95,9,95,12],[97,1,97,4],[98,1,98,13],[86,9,86,12],[88,5,88,8],[88,9,88,12],[85,5,85,8],[85,9,85,12],[89,1,91,2],[89,4,91,4],[89,5,89,8],[89,9,89,12],[91,5,91,8],[91,9,91,12],[89,3,91,3],[86,4,88,4],[86,5,86,8],[86,3,88,3],[83,1,85,2],[83,4,85,4],[83,5,83,8],[83,9,83,12],[68,5,68,8],[65,5,65,8],[65,9,65,12],[67,5,67,8],[67,9,67,12],[65,3,67,3],[62,9,62,12],[64,5,64,8],[64,9,64,12],[62,5,62,8],[53,9,53,12],[55,5,55,8],[55,9,55,12],[50,5,50,8],[50,9,50,12],[52,5,52,8],[52,9,52,12],[56,9,56,12],[58,5,58,8],[58,9,58,12],[53,5,53,8],[56,5,56,8],[44,9,44,12],[46,5,46,8],[46,9,46,12],[47,1,49,2],[47,4,49,4],[47,5,47,8],[47,9,47,12],[49,5,49,8],[49,9,49,12],[44,5,44,8],[47,3,49,3],[44,3,46,3],[44,1,46,2],[44,4,46,4],[35,9,35,12],[37,5,37,8],[37,9,37,12],[35,3,37,3],[40,9,40,12],[38,3,40,3],[38,9,38,12],[41,1,43,2],[41,4,43,4],[41,5,41,8],[41,9,41,12],[43,5,43,8],[43,9,43,12],[41,3,43,3],[35,5,35,8],[38,5,38,8],[40,5,40,8],[35,1,37,2],[35,4,37,4],[38,1,40,2],[38,4,40,4],[29,9,29,12],[31,5,31,8],[31,9,31,12],[32,1,34,2],[32,4,34,4],[32,5,32,8],[32,9,32,12],[34,5,34,8],[34,9,34,12],[32,3,34,3],[29,5,29,8],[29,1,31,2],[29,4,31,4],[29,3,31,3],[23,9,23,12],[25,5,25,8],[25,9,25,12],[26,1,28,2],[26,4,28,4],[26,5,26,8],[26,9,26,12],[28,5,28,8],[28,9,28,12],[23,3,25,3],[23,1,25,2],[23,4,25,4],[23,5,23,8],[26,3,28,3],[20,4,22,4],[20,5,20,8],[20,9,20,12],[22,5,22,8],[22,9,22,12],[20,3,22,3],[14,3,16,3],[17,3,19,3],[14,4,16,4],[14,5,14,8],[14,9,14,12],[16,5,16,8],[16,9,16,12],[65,1,67,2],[68,3,70,3],[62,3,64,3],[68,1,70,2],[56,3,58,3],[65,4,67,4],[74,3,76,3],[50,4,52,4],[74,4,76,4],[56,1,58,2],[56,4,58,4],[50,3,52,3],[53,3,55,3],[68,4,70,4],[62,1,64,2],[62,4,64,4],[59,3,61,3],[53,1,55,2],[53,4,55,4],[59,1,61,2],[59,4,61,4],[74,1,76,2],[10,1,10,13],[9,8,9,13],[8,8,8,13],[3,8,3,13],[6,8,6,13],[5,8,5,13],[2,8,2,13],[50,1,52,2],[71,3,73,3],[12,13,13,13],[13,1,13,2],[13,5,13,8],[13,9,13,12],[12,3,13,3],[12,9,12,12],[14,1,16,2],[12,5,12,8],[17,1,19,2],[17,4,19,4],[17,5,17,8],[17,9,17,12],[19,5,19,8],[19,9,19,12],[20,1,22,2],[0,1,0,13],[2,1,2,7],[3,1,3,7],[5,1,5,7],[6,1,6,7],[8,1,8,7],[9,1,9,7],[1,1,1,13],[7,1,7,13],[4,1,4,13]]}
[]
[]
[null,"UNIDADE ESCOLAR",null,null,null,null,null,null,"PRAZO"]
[null,{"$f":"Orçamento!$O$5","v":"CENTRO DE ENSINO EM PERÍODO INTEGRAL JOSÉ EDUARDO DO COUTO"},null,null,null,null,null,null,"60 DIAS CORRIDOS"]
[]
[null,"OBRA",null,null,null,null,null,null,"DATA"]
[null,{"$f":"Orçamento!$O$8","v":"REFORMA"},null,null,null,null,null,null,{"$f":"Orçamento!$S$8","v":"2020-05-26"}]
[]
[null,"LOCAL",null,null,null,null,null,null,"ÁREA TOTAL CONSTRUÍDA (M²)"]
["FILTRO",{"$f":"Orçamento!$X$8","v":"ITAGUARI"},null,null,null,null,null,null,{"$f":"Orçamento!$X$14","v":970.52}]
[]
[null,"CRONOGRAMA - FÍSICO FINANCEIRO"]
["↓","CUSTO TOTAL:",{"$f":"D93","v":0},"VALOR","Dias:",30,null,null,null,60,null,null,null,"TOTAL"]
[null,"DESCRIÇÃO DOS SERVIÇOS",null,null,"%","1ª PARCELA",null,null,null,"2ª PARCELA"]
[{"$f":"IF(D15>0,\"F\",\"\")","v":""},"SERVIÇOS PRELIMINARES",null,{"$f":"Orçamento!X273","v":0},{"$f":"Orçamento!AA273","v":0},{"$f":"ROUND(F17*$D$15,2)","v":0},null,null,null,{"$f":"ROUND(J17*$D$15,2)","v":0},null,null,null,{"$f":"SUM(F15:M15)","v":0}]
[{"$f":"IF(A15=\"F\",A15,\"\")","v":""}]
[{"$f":"IF(A16=\"F\",A16,\"\")","v":""},null,null,null,null,1,null,null,null,{"$f":"1-F17","v":0},null,null,null,{"$f":"IFERROR(E15/100,\"\")","v":0}]
[{"$f":"IF(D18>0,\"F\",\"\")","v":""},"TRANSPORTES",null,{"$f":"Orçamento!X274","v":0},{"$f":"Orçamento!AA274","v":0},{"$f":"ROUND(F20*$D$18,2)","v":0},null,null,null,{"$f":"ROUND(J20*$D$18,2)","v":0},null,null,null,{"$f":"SUM(F18:M18)","v":0}]
[{"$f":"IF(A18=\"F\",A18,\"\")","v":""}]
[{"$f":"IF(A19=\"F\",A19,\"\")","v":""},null,null,null,null,0.48,null,null,null,{"$f":"1-F20","v":0.52},null,null,null,{"$f":"IFERROR(E18/100,\"\")","v":0}]
[{"$f":"IF(D21>0,\"F\",\"\")","v":""},"SERVIÇO EM TERRA",null,{"$f":"Orçamento!X275","v":0},{"$f":"Orçamento!AA275","v":0},{"$f":"ROUND(F23*$D$21,2)","v":0},null,null,null,{"$f":"ROUND(J23*$D$21,2)","v":0},null,null,null,{"$f":"SUM(F21:M21)","v":0}]
[{"$f":"IF(A21=\"F\",A21,\"\")","v":""}]
[{"$f":"IF(A22=\"F\",A22,\"\")","v":""},null,null,null,null,1,null,null,null,{"$f":"1-F23","v":0},null,null,null,{"$f":"IFERROR(E21/100,\"\")","v":0}]
[{"$f":"IF(D24>0,\"F\",\"\")","v":""},"FUNDAÇÕES E SONDAGENS",null,{"$f":"Orçamento!X276","v":0},{"$f":"Orçamento!AA276","v":0},{"$f":"ROUND(F26*$D$24,2)","v":0},null,null,null,{"$f":"ROUND(J26*$D$24,2)","v":0},null,null,null,{"$f":"SUM(F24:M24)","v":0}]
[{"$f":"IF(A24=\"F\",A24,\"\")","v":""}]
[{"$f":"IF(A25=\"F\",A25,\"\")","v":""},null,null,null,null,1,null,null,null,{"$f":"1-F26","v":0},null,null,null,{"$f":"IFERROR(E24/100,\"\")","v":0}]
[{"$f":"IF(D27>0,\"F\",\"\")","v":""},"ESTRUTURA",null,{"$f":"Orçamento!X277","v":0},{"$f":"Orçamento!AA277","v":0},{"$f":"ROUND(F29*$D$27,2)","v":0},null,null,null,{"$f":"ROUND(J29*$D$27,2)","v":0},null,null,null,{"$f":"SUM(F27:M27)","v":0}]
[{"$f":"IF(A27=\"F\",A27,\"\")","v":""}]
[{"$f":"IF(A28=\"F\",A28,\"\")","v":""},null,null,null,null,0.49,null,null,null,{"$f":"1-F29","v":0.51},null,null,null,{"$f":"IFERROR(E27/100,\"\")","v":0}]
[{"$f":"IF(D30>0,\"F\",\"\")","v":""},"INST.ELET/TELEFÔNICA/CABEAMENTO ESTRUTURADO",null,{"$f":"Orçamento!X278","v":0},{"$f":"Orçamento!AA278","v":0},{"$f":"ROUND(F32*$D$30,2)","v":0},null,null,null,{"$f":"ROUND(J32*$D$30,2)","v":0},null,null,null,{"$f":"SUM(F30:M30)","v":0}]
[{"$f":"IF(A30=\"F\",A30,\"\")","v":""}]
[{"$f":"IF(A31=\"F\",A31,\"\")","v":""},null,null,null,null,0.4,null,null,null,{"$f":"1-F32","v":0.6},null,null,null,{"$f":"IFERROR(E30/100,\"\")","v":0}]
[{"$f":"IF(D33>0,\"F\",\"\")","v":""},"INSTALAÇÕES HIDROSSANITÁRIAS",null,{"$f":"Orçamento!X279","v":0},{"$f":"Orçamento!AA279","v":0},{"$f":"ROUND(F35*$D$33,2)","v":0},null,null,null,{"$f":"ROUND(J35*$D$33,2)","v":0},null,null,null,{"$f":"SUM(F33:M33)","v":0}]
[{"$f":"IF(A33=\"F\",A33,\"\")","v":""}]
[{"$f":"IF(A34=\"F\",A34,\"\")","v":""},null,null,null,null,0.48,null,null,null,{"$f":"1-F35","v":0.52},null,null,null,{"$f":"IFERROR(E33/100,\"\")","v":0}]
[{"$f":"IF(D36>0,\"F\",\"\")","v":""},"INSTALAÇÕES ESPECIAIS",null,{"$f":"Orçamento!X280","v":0},{"$f":"Orçamento!AA280","v":0},{"$f":"ROUND(F38*$D$36,2)","v":0},null,null,null,{"$f":"ROUND(J38*$D$36,2)","v":0},null,null,null,{"$f":"SUM(F36:M36)","v":0}]
[{"$f":"IF(A36=\"F\",A36,\"\")","v":""}]
[{"$f":"IF(A37=\"F\",A37,\"\")","v":""},null,null,null,null,1,null,null,null,{"$f":"1-F38","v":0},null,null,null,{"$f":"IFERROR(E36/100,\"\")","v":0}]
[{"$f":"IF(D39>0,\"F\",\"\")","v":""},"ALVENARIA E DIVISÓRIAS",null,{"$f":"Orçamento!X281","v":0},{"$f":"Orçamento!AA281","v":0},{"$f":"ROUND(F41*$D$39,2)","v":0},null,null,null,{"$f":"ROUND(J41*$D$39,2)","v":0},null,null,null,{"$f":"SUM(F39:M39)","v":0}]
[{"$f":"IF(A39=\"F\",A39,\"\")","v":""}]
[{"$f":"IF(A40=\"F\",A40,\"\")","v":""},null,null,null,null,1,null,null,null,{"$f":"1-F41","v":0},null,null,null,{"$f":"IFERROR(E39/100,\"\")","v":0}]
[{"$f":"IF(D42>0,\"F\",\"\")","v":""},"ALVENARIA AUTO-PORTANTE",null,{"$f":"Orçamento!X282","v":0},{"$f":"Orçamento!AA282","v":0},{"$f":"ROUND(F44*$D$42,2)","v":0},null,null,null,{"$f":"ROUND(J44*$D$42,2)","v":0},null,null,null,{"$f":"SUM(F42:M42)","v":0}]
[{"$f":"IF(A42=\"F\",A42,\"\")","v":""}]
[{"$f":"IF(A43=\"F\",A43,\"\")","v":""},null,null,null,null,1,null,null,null,{"$f":"1-F44","v":0},null,null,null,{"$f":"IFERROR(E42/100,\"\")","v":0}]
[{"$f":"IF(D45>0,\"F\",\"\")","v":""},"IMPERMEABILIZAÇÃO",null,{"$f":"Orçamento!X283","v":0},{"$f":"Orçamento!AA283","v":0},{"$f":"ROUND(F47*$D$45,2)","v":0},null,null,null,{"$f":"ROUND(J47*$D$45,2)","v":0},null,null,null,{"$f":"SUM(F45:M45)","v":0}]
[{"$f":"IF(A45=\"F\",A45,\"\")","v":""}]
[{"$f":"IF(A46=\"F\",A46,\"\")","v":""},null,null,null,null,1,null,null,null,{"$f":"1-F47","v":0},null,null,null,{"$f":"IFERROR(E45/100,\"\")","v":0}]
[{"$f":"IF(D48>0,\"F\",\"\")","v":""},"ISOLAMENTO TÉRMICO E ACÚSTICO",null,{"$f":"Orçamento!X284","v":0},{"$f":"Orçamento!AA284","v":0},{"$f":"ROUND(F50*$D$48,2)","v":0},null,null,null,{"$f":"ROUND(J50*$D$48,2)","v":0},null,null,null,{"$f":"SUM(F48:M48)","v":0}]
[{"$f":"IF(A48=\"F\",A48,\"\")","v":""}]
[{"$f":"IF(A49=\"F\",A49,\"\")","v":""},null,null,null,null,0.5,null,null,null,{"$f":"1-F50","v":0.5},null,null,null,{"$f":"IFERROR(E48/100,\"\")","v":0}]
[{"$f":"IF(D51>0,\"F\",\"\")","v":""},"ESTRUTURA DE MADEIRA",null,{"$f":"Orçamento!X285","v":0},{"$f":"Orçamento!AA285","v":0},{"$f":"ROUND(F53*$D$51,2)","v":0},null,null,null,{"$f":"ROUND(J53*$D$51,2)","v":0},null,null,null,{"$f":"SUM(F51:M51)","v":0}]
[{"$f":"IF(A51=\"F\",A51,\"\")","v":""}]
[{"$f":"IF(A52=\"F\",A52,\"\")","v":""},null,null,null,null,0.4,null,null,null,{"$f":"1-F53","v":0.6},null,null,null,{"$f":"IFERROR(E51/100,\"\")","v":0}]
[{"$f":"IF(D54>0,\"F\",\"\")","v":""},"ESTRUTURA METÁLICA",null,{"$f":"Orçamento!X286","v":0},{"$f":"Orçamento!AA286","v":0},{"$f":"ROUND(F56*$D$54,2)","v":0},null,null,null,{"$f":"ROUND(J56*$D$54,2)","v":0},null,null,null,{"$f":"SUM(F54:M54)","v":0}]
[{"$f":"IF(A54=\"F\",A54,\"\")","v":""}]
[{"$f":"IF(A55=\"F\",A55,\"\")","v":""},null,null,null,null,0.35,null,null,null,{"$f":"1-F56","v":0.65},null,null,null,{"$f":"IFERROR(E54/100,\"\")","v":0}]
[{"$f":"IF(D57>0,\"F\",\"\")","v":""},"COBERTURAS",null,{"$f":"Orçamento!X287","v":0},{"$f":"Orçamento!AA287","v":0},{"$f":"ROUND(F59*$D$57,2)","v":0},null,null,null,{"$f":"ROUND(J59*$D$57,2)","v":0},null,null,null,{"$f":"SUM(F57:M57)","v":0}]
[{"$f":"IF(A57=\"F\",A57,\"\")","v":""}]
[{"$f":"IF(A58=\"F\",A58,\"\")","v":""},null,null,null,null,0,null,null,null,{"$f":"1-F59","v":1},null,null,null,{"$f":"IFERROR(E57/100,\"\")","v":0}]
[{"$f":"IF(D60>0,\"F\",\"\")","v":""},"ESQUADRIAS DE MADEIRA",null,{"$f":"Orçamento!X288","v":0},{"$f":"Orçamento!AA288","v":0},{"$f":"ROUND(F62*$D$60,2)","v":0},null,null,null,{"$f":"ROUND(J62*$D$60,2)","v":0},null,null,null,{"$f":"SUM(F60:M60)","v":0}]
[{"$f":"IF(A60=\"F\",A60,\"\")","v":""}]
[{"$f":"IF(A61=\"F\",A61,\"\")","v":""},null,null,null,null,0.54,null,null,null,{"$f":"1-F62","v":0.45999999999999996},null,null,null,{"$f":"IFERROR(E60/100,\"\")","v":0}]
[{"$f":"IF(D63>0,\"F\",\"\")","v":""},"ESQUADRIAS METÁLICAS",null,{"$f":"Orçamento!X289","v":0},{"$f":"Orçamento!AA289","v":0},{"$f":"ROUND(F65*$D$63,2)","v":0},null,null,null,{"$f":"ROUND(J65*$D$63,2)","v":0},null,null,null,{"$f":"SUM(F63:M63)","v":0}]
[{"$f":"IF(A63=\"F\",A63,\"\")","v":""}]
[{"$f":"IF(A64=\"F\",A64,\"\")","v":""},null,null,null,null,0.49,null,null,null,{"$f":"1-F65","v":0.51},null,null,null,{"$f":"IFERROR(E63/100,\"\")","v":0}]
[{"$f":"IF(D66>0,\"F\",\"\")","v":""},"VIDROS",null,{"$f":"Orçamento!X290","v":0},{"$f":"Orçamento!AA290","v":0},{"$f":"ROUND(F68*$D$66,2)","v":0},null,null,null,{"$f":"ROUND(J68*$D$66,2)","v":0},null,null,null,{"$f":"SUM(F66:M66)","v":0}]
[{"$f":"IF(A66=\"F\",A66,\"\")","v":""}]
[{"$f":"IF(A67=\"F\",A67,\"\")","v":""},null,null,null,null,0,null,null,null,{"$f":"1-F68","v":1},null,null,null,{"$f":"IFERROR(E66/100,\"\")","v":0}]
[{"$f":"IF(D69>0,\"F\",\"\")","v":""},"REVESTIMENTO DE PAREDE",null,{"$f":"Orçamento!X291","v":0},{"$f":"Orçamento!AA291","v":0},{"$f":"ROUND(F71*$D$69,2)","v":0},null,null,null,{"$f":"ROUND(J71*$D$69,2)","v":0},null,null,null,{"$f":"SUM(F69:M69)","v":0}]
[{"$f":"IF(A69=\"F\",A69,\"\")","v":""}]
[{"$f":"IF(A70=\"F\",A70,\"\")","v":""},null,null,null,null,0.32,null,null,null,{"$f":"1-F71","v":0.67999999999999994},null,null,null,{"$f":"IFERROR(E69/100,\"\")","v":0}]
[{"$f":"IF(D72>0,\"F\",\"\")","v":""},"FORROS",null,{"$f":"Orçamento!X292","v":0},{"$f":"Orçamento!AA292","v":0},{"$f":"ROUND(F74*$D$72,2)","v":0},null,null,null,{"$f":"ROUND(J74*$D$72,2)","v":0},null,null,null,{"$f":"SUM(F72:M72)","v":0}]
[{"$f":"IF(A72=\"F\",A72,\"\")","v":""}]
[{"$f":"IF(A73=\"F\",A73,\"\")","v":""},null,null,null,null,0.24,null,null,null,{"$f":"1-F74","v":0.76},null,null,null,{"$f":"IFERROR(E72/100,\"\")","v":0}]
[{"$f":"IF(D75>0,\"F\",\"\")","v":""},"REVESTIMENTO DE PISO",null,{"$f":"Orçamento!X293","v":0},{"$f":"Orçamento!AA293","v":0},{"$f":"ROUND(F77*$D$75,2)","v":0},null,null,null,{"$f":"ROUND(J77*$D$75,2)","v":0},null,null,null,{"$f":"SUM(F75:M75)","v":0}]
[{"$f":"IF(A75=\"F\",A75,\"\")","v":""}]
[{"$f":"IF(A76=\"F\",A76,\"\")","v":""},null,null,null,null,0.49,null,null,null,{"$f":"1-F77","v":0.51},null,null,null,{"$f":"IFERROR(E75/100,\"\")","v":0}]
[{"$f":"IF(D78>0,\"F\",\"\")","v":""},"FERRAGENS",null,{"$f":"Orçamento!X294","v":0},{"$f":"Orçamento!AA294","v":0},{"$f":"ROUND(F80*$D$78,2)","v":0},null,null,null,{"$f":"ROUND(J80*$D$78,2)","v":0},null,null,null,{"$f":"SUM(F78:M78)","v":0}]
[{"$f":"IF(A78=\"F\",A78,\"\")","v":""}]
[{"$f":"IF(A79=\"F\",A79,\"\")","v":""},null,null,null,null,0,null,null,null,{"$f":"1-F80","v":1},null,null,null,{"$f":"IFERROR(E78/100,\"\")","v":0}]
[{"$f":"IF(D81>0,\"F\",\"\")","v":""},"MARCENARIA",null,{"$f":"Orçamento!X295","v":0},{"$f":"Orçamento!AA295","v":0},{"$f":"ROUND(F83*$D$81,2)","v":0},null,null,null,{"$f":"ROUND(J83*$D$81,2)","v":0},null,null,null,{"$f":"SUM(F81:M81)","v":0}]
[{"$f":"IF(A81=\"F\",A81,\"\")","v":""}]
[{"$f":"IF(A82=\"F\",A82,\"\")","v":""},null,null,null,null,0.4,null,null,null,{"$f":"1-F83","v":0.6},null,null,null,{"$f":"IFERROR(E81/100,\"\")","v":0}]
[{"$f":"IF(D84>0,\"F\",\"\")","v":""},"ADMINISTRAÇÃO - MENSALISTAS",null,{"$f":"Orçamento!X296","v":0},{"$f":"Orçamento!AA296","v":0},{"$f":"ROUND(F86*$D$84,2)","v":0},null,null,null,{"$f":"ROUND(J86*$D$84,2)","v":0},null,null,null,{"$f":"SUM(F84:M84)","v":0}]
[{"$f":"IF(A84=\"F\",A84,\"\")","v":""}]
[{"$f":"IF(A85=\"F\",A85,\"\")","v":""},null,null,null,null,0.49,null,null,null,{"$f":"1-F86","v":0.51},null,null,null,{"$f":"IFERROR(E84/100,\"\")","v":0}]
[{"$f":"IF(D87>0,\"F\",\"\")","v":""},"PINTURA",null,{"$f":"Orçamento!X297","v":0},{"$f":"Orçamento!AA297","v":0},{"$f":"ROUND(F89*$D$87,2)","v":0},null,null,null,{"$f":"ROUND(J89*$D$87,2)","v":0},null,null,null,{"$f":"SUM(F87:M87)","v":0}]
[{"$f":"IF(A87=\"F\",A87,\"\")","v":""}]
[{"$f":"IF(A88=\"F\",A88,\"\")","v":""},null,null,null,null,0,null,null,null,{"$f":"1-F89","v":1},null,null,null,{"$f":"IFERROR(E87/100,\"\")","v":0}]
[{"$f":"IF(D90>0,\"F\",\"\")","v":""},"DIVERSOS",null,{"$f":"Orçamento!X298","v":0},{"$f":"Orçamento!AA298","v":0},{"$f":"ROUND(F92*$D$90,2)","v":0},null,null,null,{"$f":"ROUND(J92*$D$90,2)","v":0},null,null,null,{"$f":"SUM(F90:M90)","v":0}]
[{"$f":"IF(A90=\"F\",A90,\"\")","v":""}]
[{"$f":"IF(A91=\"F\",A91,\"\")","v":""},null,null,null,null,0.46,null,null,null,{"$f":"1-F92","v":0.54},null,null,null,{"$f":"IFERROR(E90/100,\"\")","v":0}]
["F","CUSTO DO ORÇAMENTO",null,{"$f":"SUM(D15:D92)","v":0},{"$f":"SUM(E15:E92)","v":0},{"$f":"F15+F18+F21+F24+F27+F30+F33+F36+F39+F42+F45+F48+F51+F54+F57+F60+F63+F66+F69+F72+F75+F78+F81+F84+F87+F90","v":0},null,null,null,{"$f":"J15+J18+J21+J24+J27+J30+J33+J36+J39+J42+J45+J48+J51+J54+J57+J60+J63+J66+J69+J72+J75+J78+J81+J84+J87+J90","v":0},null,null,null,{"$f":"N15+N18+N21+N24+N27+N30+N33+N36+N39+N42+N45+N48+N51+N54+N57+N60+N63+N66+N69+N72+N75+N78+N81+N84+N87+N90","v":0}]
["F","PERCENTUAIS:",null,null,null,{"$f":"IFERROR(F93/D93,\"\")","v":""},null,null,null,{"$f":"IFERROR(J93/D93,\"\")","v":""},null,null,null,{"$f":"SUM(F94:M94)","v":0}]
["F","TOTAIS ACUMULADOS:",null,null,null,{"$f":"F93","v":0},null,null,null,{"$f":"F95+J93","v":0}]
["F","PERCENTUAIS  ACUMULADOS:",null,null,null,{"$f":"F94","v":""},null,null,null,{"$f":"IFERROR(F96+J94,\"\")","v":""}]
["F"]
["F","OBSERVAÇÕES:"]
["F","Os pagamentos somente poderão ser efetuados mediante medição e atesto pelos técnicos da Secretaria da Educação. "]

{"sheet":"Composição BDI","index":4,"n_rows":45,"n_cols":4,"rows_kept":45,"cut":false,"hidden":false,"merged":[[17,0,17,3],[16,0,16,3],[44,0,44,3],[42,0,42,3],[43,0,43,3],[18,0,18,3],[36,0,36,3],[39,0,39,3],[38,0,38,3],[40,0,40,3],[29,0,29,2],[32,0,32,3],[33,0,33,3],[34,0,34,3],[35,0,35,3],[0,0,0,3],[2,0,2,3],[3,0,3,3],[1,0,1,3],[5,0,5,3],[4,0,4,3],[12,0,12,3],[13,0,13,3],[14,0,14,3],[15,0,15,3],[6,0,6,3],[8,0,8,3],[7,0,7,3],[9,0,9,3],[11,0,11,3],[10,0,10,3]]}
[]
[]
["UNIDADE ESCOLAR"]
["CENTRO DE ENSINO EM PERÍODO INTEGRAL JOSÉ EDUARDO DO COUTO"]
[]
["OBRA"]
["REFORMA"]
[]
["ENDEREÇO"]
[" RUA JOSE FERNANDES CARVALHARES 197 Nº 197 , CENTRO , CEP: 7665-000"]
[]
["CIDADE"]
["ITAGUARI"]
[]
["CRE"]
["CRE-ITABERAI"]
[]
["DETALHAMENTO DA COMPOSIÇÃO DE BDI"]
["COMPOSIÇÃO BDI PARA OBRAS CIVIS"]
["DESCRIÇÃO","COEF.","TAXA % (a.m)","% no preço de venda"]
["1) COFINS",1,0.03,0.03]
["2) PIS",1,6.4999999999999997E-3,6.4999999999999997E-3]
["3) ISSQN",1,0.03,0.03]
["4) CPRB",1,4.4999999999999998E-2,4.4999999999999998E-2]
["5) Administração Central",1,3.1199999999999999E-2,3.1199999999999999E-2]
["6) Despesas Financeiras",1,5.5999999999999999E-3,5.5999999999999999E-3]
["7) Seguros + Garantias",1,1.1999999999999999E-3,1.1999999999999999E-3]
["8) Risco",1,9.7000000000000003E-3,9.7000000000000003E-3]
["9) Lucro",1,7.1999999999999995E-2,7.1999999999999995E-2]
["BDI - FINAL",null,null,0.26436368567248203]
[]
["Notas:"]
["(1) e (2) Alíquota definida por lei."]
["(3) Alíquota e base de cálculo definidas pela legislação municipal."]
["(4) Alíquota definida pelas leis 12.546/11, 12844/13 e 13.161/15 (CPRB – contribuição previdenciária sobre a receita bruta)."]
["(5) Valores definidos a partir dos limites no Acórdão nº 2.622/2013 - TCU – Plenário. Valores entre o 1º e 3º quartis."]
["(6) Valor calculado pela expressão matemática do acórdão 2.369/2011 – TCU – Plenário e disponibilizado pela AGETOP em dezembro de 2018. (Foi utilizado para o cálculo a média da Taxa SELIC no período de 11/2017 a 10/2018)"]
[]
["(7) Valores definidos pela AGETOP a partir dos limites no Acórdão nº 2.622/2013 - TCU – Plenário. Valores médios. \n\nObservação da AGETOP: (Seguros contra erros de execução, incêndio e explosão, danos da natureza (vendaval, destelhamento, alagamento, inundação, desmoronamento, geadas etc.), emprego de material defeituoso ou inadequado, roubo e/ou furto qualificado, quebra de equipamentos, desmoronamento de estrutura, nas modalidades de Obras Civis em Construção (OCC); Instalação e Montagem (IM); e Obras Civis em Construção e Instalação e Montagem (OCC/IM). Bem como coberturas adicionais para ampliação dessas coberturas básicas, como: cobertura de responsabilidade civil geral, cobertura de responsabilidade civil cruzada, cobertura de despesas extraordinárias, cobertura de tumultos, cobertura de desentulho do local, cobertura de riscos do fabricante, dentre outras, incluindo o seguro de vida em grupo regido pela convenção coletiva dos trabalhadores na indústria da construção civil). A partir de 24/02/2015 por intermédio da Portaria 449/2015 a Presidência da AGETOP, na pessoa do Senhor Jayme Eduardo Rincon, determinou a exclusão dos valores referentes aos Seguros de Risco de Engenharia e Responsabilidade Civil do Profissional na composição do cálculo do B.D.I.."]
["(8) Valores definidos a partir dos limites no Acórdão nº 2.622/2013 - TCU – Plenário. Valores entre 1º e 3° quartis."]
["(9) Valores definidos a partir dos limites definidos no Acórdão nº 2.622/2013 - TCU – Plenário. Valores adotados e praticados no mercado ( “ ex ante ” ) ou aqueles entre os 1º e 3º quartis."]
[]
["(*) A fórmula para estipulação da taxa de BDI estimado adotado é a mesma que foi aplicada para a obtenção das tabelas contidas no Acórdão n. 2.622/2013 – TCUPlenário"]
[]
["Obs.: Para obras com valores superiores a R$ 20.000.000,00 sugere-se recalcular o BDI, dimensionando as taxas de administração central e lucro para patamares inferiores ao estipulado acima."]

{"sheet":"Relatório CENTRAL","index":5,"n_rows":40,"n_cols":5,"rows_kept":40,"cut":false,"hidden":false,"merged":[[10,1,10,4],[11,1,11,4],[39,1,39,2],[9,0,11,0],[0,1,0,4],[6,3,6,4],[9,3,9,4],[1,1,1,4],[2,1,2,2],[2,3,2,4],[3,1,3,2],[3,3,3,4],[4,1,4,4],[5,1,5,2],[5,3,5,4],[6,1,6,2],[7,1,7,4],[8,1,8,2],[8,3,8,4],[9,1,9,2]]}
[]
[]
[null,"UNIDADE ESCOLAR",null,"CIDADE"]
[null,{"$f":"Orçamento!$O$5","v":"CENTRO DE ENSINO EM PERÍODO INTEGRAL JOSÉ EDUARDO DO COUTO"},null,{"$f":"Orçamento!$X$8","v":"ITAGUARI"}]
[]
[null,"OBRA",null,"CRE"]
[null,{"$f":"Orçamento!$O$8","v":"REFORMA"},null,{"$f":"Orçamento!$O$11","v":"CRE-ITABERAI"}]
[]
[null,"ENDEREÇO",null,"DATA"]
["FILTRO",{"$f":"Orçamento!$R$11","v":" RUA JOSE FERNANDES CARVALHARES 197 Nº 197 , CENTRO , CEP: 7665-000"},null,{"$f":"Orçamento!$S$8","v":"2020-05-26"}]
[]
[null,"RELATÓRIO CENTRAL"]
["↓","CÓDIGO","ETAPA","PREÇO  (R$) C/ BDI","PARTIC  ( % )"]
[{"$f":"IF(D14>0,\"F\",\"\")","v":""},{"$f":"Orçamento!O273","v":"a."},{"$f":"Orçamento!P273","v":"SERVIÇOS PRELIMINARES"},{"$f":"Orçamento!X273","v":0},{"$f":"Orçamento!AA273","v":0}]
[{"$f":"IF(D15>0,\"F\",\"\")","v":""},{"$f":"Orçamento!O274","v":"b."},{"$f":"Orçamento!P274","v":"TRANSPORTES"},{"$f":"Orçamento!X274","v":0},{"$f":"Orçamento!AA274","v":0}]
["",{"$f":"Orçamento!O275","v":"c."},{"$f":"Orçamento!P275","v":"SERVIÇO EM TERRA"},{"$f":"Orçamento!X275","v":0},{"$f":"Orçamento!AA275","v":0}]
["",{"$f":"Orçamento!O276","v":"d."},{"$f":"Orçamento!P276","v":"FUNDAÇÕES E SONDAGENS"},{"$f":"Orçamento!X276","v":0},{"$f":"Orçamento!AA276","v":0}]
["",{"$f":"Orçamento!O277","v":"e."},{"$f":"Orçamento!P277","v":"ESTRUTURA"},{"$f":"Orçamento!X277","v":0},{"$f":"Orçamento!AA277","v":0}]
["",{"$f":"Orçamento!O278","v":"f."},{"$f":"Orçamento!P278","v":"INSTALAÇÕES ELÉTRICAS"},{"$f":"Orçamento!X278","v":0},{"$f":"Orçamento!AA278","v":0}]
["",{"$f":"Orçamento!O279","v":"g."},{"$f":"Orçamento!P279","v":"INSTALAÇÕES HIDROSSANITÁRIAS"},{"$f":"Orçamento!X279","v":0},{"$f":"Orçamento!AA279","v":0}]
["",{"$f":"Orçamento!O280","v":"h"},{"$f":"Orçamento!P280","v":"INSTALAÇÕES ESPECIAIS"},{"$f":"Orçamento!X280","v":0},{"$f":"Orçamento!AA280","v":0}]
["",{"$f":"Orçamento!O281","v":"i."},{"$f":"Orçamento!P281","v":"ALVENARIAS E DIVISÓRIAS"},{"$f":"Orçamento!X281","v":0},{"$f":"Orçamento!AA281","v":0}]
["",{"$f":"Orçamento!O282","v":"j."},{"$f":"Orçamento!P282","v":"ALVENARIA AUTO-PORTANTE"},{"$f":"Orçamento!X282","v":0},{"$f":"Orçamento!AA282","v":0}]
["",{"$f":"Orçamento!O283","v":"k."},{"$f":"Orçamento!P283","v":"IMPERMEABILIZAÇÃO"},{"$f":"Orçamento!X283","v":0},{"$f":"Orçamento!AA283","v":0}]
["",{"$f":"Orçamento!O284","v":"l."},{"$f":"Orçamento!P284","v":"ISOLAMENTO TÉRMICO E ACÚSTICO"},{"$f":"Orçamento!X284","v":0},{"$f":"Orçamento!AA284","v":0}]
["",{"$f":"Orçamento!O285","v":"m."},{"$f":"Orçamento!P285","v":"ESTRUTURA DE MADEIRA"},{"$f":"Orçamento!X285","v":0},{"$f":"Orçamento!AA285","v":0}]
["",{"$f":"Orçamento!O286","v":"n."},{"$f":"Orçamento!P286","v":"ESTRUTURAS METÁLICAS"},{"$f":"Orçamento!X286","v":0},{"$f":"Orçamento!AA286","v":0}]
["",{"$f":"Orçamento!O287","v":"o."},{"$f":"Orçamento!P287","v":"COBERTURAS"},{"$f":"Orçamento!X287","v":0},{"$f":"Orçamento!AA287","v":0}]
["",{"$f":"Orçamento!O288","v":"p."},{"$f":"Orçamento!P288","v":"ESQUADRIAS DE MADEIRA"},{"$f":"Orçamento!X288","v":0},{"$f":"Orçamento!AA288","v":0}]
["",{"$f":"Orçamento!O289","v":"q."},{"$f":"Orçamento!P289","v":"ESQUADRIAS METÁLICAS"},{"$f":"Orçamento!X289","v":0},{"$f":"Orçamento!AA289","v":0}]
["",{"$f":"Orçamento!O290","v":"r."},{"$f":"Orçamento!P290","v":"VIDROS"},{"$f":"Orçamento!X290","v":0},{"$f":"Orçamento!AA290","v":0}]
["",{"$f":"Orçamento!O291","v":"s."},{"$f":"Orçamento!P291","v":"REVESTIMENTO DE PAREDE"},{"$f":"Orçamento!X291","v":0},{"$f":"Orçamento!AA291","v":0}]
["",{"$f":"Orçamento!O292","v":"t."},{"$f":"Orçamento!P292","v":"FORROS"},{"$f":"Orçamento!X292","v":0},{"$f":"Orçamento!AA292","v":0}]
["",{"$f":"Orçamento!O293","v":"u."},{"$f":"Orçamento!P293","v":"REVESTIMENTO DE PISO"},{"$f":"Orçamento!X293","v":0},{"$f":"Orçamento!AA293","v":0}]
["",{"$f":"Orçamento!O294","v":"v."},{"$f":"Orçamento!P294","v":"FERRAGENS"},{"$f":"Orçamento!X294","v":0},{"$f":"Orçamento!AA294","v":0}]
["",{"$f":"Orçamento!O295","v":"w."},{"$f":"Orçamento!P295","v":"MARCENARIA"},{"$f":"Orçamento!X295","v":0},{"$f":"Orçamento!AA295","v":0}]
["",{"$f":"Orçamento!O296","v":"x."},{"$f":"Orçamento!P296","v":"ADMINISTRAÇÃO"},{"$f":"Orçamento!X296","v":0},{"$f":"Orçamento!AA296","v":0}]
["",{"$f":"Orçamento!O297","v":"y."},{"$f":"Orçamento!P297","v":"PINTURA"},{"$f":"Orçamento!X297","v":0},{"$f":"Orçamento!AA297","v":0}]
["",{"$f":"Orçamento!O298","v":"z."},{"$f":"Orçamento!P298","v":"DIVERSOS"},{"$f":"Orçamento!X298","v":0},{"$f":"Orçamento!AA298","v":0}]
["F","TOTAL GERAL DO ORÇAMENTO (R$) C/BDI",null,{"$f":"SUM(D14:D39)","v":0},{"$f":"SUM(E14:E39)","v":0}]

{"sheet":"Parc Maior Relev","index":6,"n_rows":33,"n_cols":7,"rows_kept":33,"cut":false,"hidden":false,"merged":[[8,1,8,3],[8,4,8,6],[33,3,33,7],[31,1,31,6],[0,1,0,6],[11,1,11,6],[1,1,1,6],[2,1,2,3],[2,4,2,6],[3,1,3,3],[3,4,3,6],[4,1,4,6],[5,1,5,3],[5,4,5,6],[9,1,9,3],[9,4,9,6],[10,1,10,6],[6,1,6,3],[6,4,6,6],[7,1,7,6]]}
[]
[]
[null,"UNIDADE ESCOLAR",null,null,"CÓDIGO INEP"]
[null,{"$f":"Orçamento!$O$5","v":"CENTRO DE ENSINO EM PERÍODO INTEGRAL JOSÉ EDUARDO DO COUTO"},null,null,{"$f":"Orçamento!$X$5","v":52024148}]
[]
[null,"OBRA",null,null,"CIDADE"]
[null,{"$f":"Orçamento!$O$8","v":"REFORMA"},null,null,{"$f":"Orçamento!$X$8","v":"ITAGUARI"}]
[]
[null,"CRE",null,null,"ÁREA TOTAL CONSTRUÍDA (M²)"]
[null,{"$f":"Orçamento!$O$11","v":"CRE-ITABERAI"},null,null,{"$f":"Orçamento!$X$14","v":970.52}]
[]
["FILTRO","PARCELA DE MAIOR RELEVÂNCIA"]
[{"$f":"IF(G14>0,\"F\",\"\")","v":""},"CÓDIGO","SERVIÇO","DESCRIÇÃO","UNID","QUANT","PARC. MAIOR RELEV (100%)"]
[{"$f":"IF(G14>0,\"F\",\"\")","v":""},"f.","INSTALAÇÕES ELÉTRICAS","SUBESTAÇÃO","KVA",{"$f":"SUMIF(Orçamento!$R$21:$R$254,'Parc Maior Relev'!D14,Orçamento!$T$21:$T$254)","v":0},{"$f":"F14","v":0}]
[{"$f":"IF(SUM(G16:G30)>0,\"F\",\"\")","v":"F"},"CÓDIGO","SERVIÇO","DESCRIÇÃO","UNID","QUANT","PARC. MAIOR RELEV (50%)"]
[{"$f":"IF(G16>0,\"F\",\"\")","v":""},"e.","ESTRUTURA","CONCRETO","M3",{"$f":"SUMIF(Orçamento!$R$21:$R$254,'Parc Maior Relev'!D16,Orçamento!$T$21:$T$254)","v":0},{"$f":"F16*0.5","v":0}]
[{"$f":"IF(G17>0,\"F\",\"\")","v":"F"},"f.","INSTALAÇÕES ELÉTRICAS","INSTALAÇÕES ELÉTRICAS","KVA",62.97,{"$f":"F17*0.5","v":31.484999999999999}]
[{"$f":"IF(G18>0,\"F\",\"\")","v":""},"o.","COBERTURAS","COBERTURA CERÂMICA","M2",{"$f":"SUMIF(Orçamento!$R$21:$R$254,'Parc Maior Relev'!D18,Orçamento!$T$21:$T$254)","v":0},0]
["","o.","COBERTURAS","COBERTURA COM TELHA METÁLICA","M2",{"$f":"SUMIF(Orçamento!$R$21:$R$254,'Parc Maior Relev'!D19,Orçamento!$T$21:$T$254)","v":0},0]
["","s.","REVESTIMENTO DE PAREDE","CHAPISCO","M2",{"$f":"SUMIF(Orçamento!$R$21:$R$254,'Parc Maior Relev'!D20,Orçamento!$T$21:$T$254)","v":0},0]
["","s.","REVESTIMENTO DE PAREDE","REBOCO","M2",{"$f":"SUMIF(Orçamento!$R$21:$R$254,'Parc Maior Relev'!D21,Orçamento!$T$21:$T$254)","v":0},0]
["","s.","REVESTIMENTO DE PAREDE","REVESTIMENTO CERÂMICO","M2",{"$f":"SUMIF(Orçamento!$R$21:$R$254,'Parc Maior Relev'!D22,Orçamento!$T$21:$T$254)","v":0},0]
["","t.","FORROS","FORRO DE GESSO","M2",{"$f":"SUMIF(Orçamento!$R$21:$R$254,'Parc Maior Relev'!D23,Orçamento!$T$21:$T$254)","v":0},0]
["","t.","FORROS","FORRO DE PVC","M2",{"$f":"SUMIF(Orçamento!$R$21:$R$254,'Parc Maior Relev'!D24,Orçamento!$T$21:$T$254)","v":0},0]
["","t.","FORROS","FORRO DE GESSO ACARTONADO","M2",{"$f":"SUMIF(Orçamento!$R$21:$R$254,'Parc Maior Relev'!D25,Orçamento!$T$21:$T$254)","v":0},0]
["","u.","REVESTIMENTO DE PISO","PISO DE GRANITINA","M2",{"$f":"SUMIF(Orçamento!$R$21:$R$254,'Parc Maior Relev'!D26,Orçamento!$T$21:$T$254)","v":0},0]
["","u.","REVESTIMENTO DE PISO","PISO LAMINADO","M2",{"$f":"SUMIF(Orçamento!$R$21:$R$254,'Parc Maior Relev'!D27,Orçamento!$T$21:$T$254)","v":0},0]
["","u.","REVESTIMENTO DE PISO","PISO DE CONCRETO DESEMPENADO","M2",{"$f":"SUMIF(Orçamento!$R$21:$R$254,'Parc Maior Relev'!D28,Orçamento!$T$21:$T$254)","v":0},0]
["","u.","REVESTIMENTO DE PISO","PISO CERÂMICO","M2",{"$f":"SUMIF(Orçamento!$R$21:$R$254,'Parc Maior Relev'!D29,Orçamento!$T$21:$T$254)","v":0},0]
["","y.","PINTURA","PINTURA","M2",{"$f":"SUMIF(Orçamento!$R$21:$R$254,'Parc Maior Relev'!D30,Orçamento!$T$21:$T$254)","v":0},0]
["F"]
["F","(*) Para os fins do inciso I dp § 1º do Art. 30 da Lei Federal 8.666/93, são consideradas parcelas de maior relevância técnica as execuções apresentadas"]
["F"]