{"text_format":"1","workbook":"xlsx","n_sheets":8,"sheets":["Orçamento","Resumo ","Somatório","Cronog_90_Dias","Composição BDI","Relatório CENTRAL","Parc Maior Relev","Composições"],"not_rendered":{"charts":0,"images":5,"macros":1,"external_links":2,"defined_names":151,"comments":2,"pivot_tables":0},"unopened":[],"bounds":{"document_bytes":16777216,"sheet_cells":100000,"rows_first":2000,"rows_last":500,"rows_between":2000,"halvings":0,"cell_chars":16384,"cell_head_chars":4096},"cells_cut":0,"cells_raw":0,"read":"whole","date_system":"1900"}

{"sheet":"Orçamento","index":0,"n_rows":453,"n_cols":24,"rows_kept":453,"cut":false,"hidden":false,"merged":[[434,18,434,20],[434,21,434,22],[435,15,435,17],[435,18,435,20],[435,21,435,22],[436,15,436,17],[436,18,436,20],[436,21,436,22],[431,15,431,17],[431,18,431,20],[431,21,431,22],[432,15,432,17],[432,18,432,20],[432,21,432,22],[433,15,433,17],[433,18,433,20],[433,21,433,22],[445,18,445,20],[445,21,445,22],[440,15,440,17],[440,18,440,20],[440,21,440,22],[441,15,441,17],[441,18,441,20],[441,21,441,22],[442,15,442,17],[442,18,442,20],[442,21,442,22],[421,14,421,17],[428,15,428,17],[394,15,394,17],[449,18,449,20],[449,21,449,22],[437,15,437,17],[437,18,437,20],[437,21,437,22],[438,15,438,17],[438,18,438,20],[438,21,438,22],[439,15,439,17],[439,18,439,20],[439,21,439,22],[443,15,443,17],[443,18,443,20],[443,21,443,22],[444,15,444,17],[444,18,444,20],[444,21,444,22],[445,15,445,17],[434,15,434,17],[430,18,430,20],[430,21,430,22],[389,16,389,22],[452,18,452,20],[452,21,452,22],[449,14,449,17],[446,15,446,17],[446,18,446,20],[446,21,446,22],[447,15,447,17],[447,18,447,20],[447,21,447,22],[448,15,448,17],[448,18,448,20],[448,21,448,22],[451,18,451,20],[451,21,451,22],[450,18,450,20],[450,21,450,22],[427,14,427,23],[428,18,428,20],[428,21,428,22],[429,15,429,17],[429,18,429,20],[429,21,429,22],[430,15,430,17],[385,16,385,22],[386,16,386,22],[387,16,387,22],[3,21,3,22],[2,21,2,22],[5,21,5,22],[10,14,10,23],[13,14,13,23],[6,21,6,22],[2,14,2,20],[3,14,3,20],[5,18,5,20],[6,18,6,20],[6,14,6,17],[5,14,5,17],[12,21,12,22],[12,18,12,20],[8,18,8,20],[8,21,8,22],[9,19,9,20],[407,15,407,17],[408,15,408,17],[409,15,409,17],[410,15,410,17],[411,15,411,17],[412,15,412,17],[413,15,413,17],[414,15,414,17],[415,15,415,17],[395,15,395,17],[396,15,396,17],[397,15,397,17],[398,15,398,17],[399,15,399,17],[400,15,400,17],[401,15,401,17],[402,15,402,17],[403,15,403,17],[416,15,416,17],[417,15,417,17],[418,15,418,17],[419,15,419,17],[420,15,420,17],[393,14,393,23],[382,20,382,21],[381,20,381,21],[377,17,382,17],[377,20,377,21],[394,18,394,20],[394,21,394,22],[395,18,395,20],[395,21,395,22],[383,20,383,21],[403,18,403,20],[403,21,403,22],[404,18,404,20],[404,21,404,22],[405,18,405,20],[405,21,405,22],[406,18,406,20],[406,21,406,22],[418,18,418,20],[421,18,421,20],[421,21,421,22],[418,21,418,22],[419,18,419,20],[419,21,419,22],[420,18,420,20],[420,21,420,22],[410,18,410,20],[410,21,410,22],[417,18,417,20],[417,21,417,22],[412,21,412,22],[413,18,413,20],[413,21,413,22],[415,18,415,20],[411,18,411,20],[411,21,411,22],[412,18,412,20],[422,18,422,20],[422,21,422,22],[409,18,409,20],[409,21,409,22],[402,18,402,20],[402,21,402,22],[424,18,424,20],[424,21,424,22],[378,20,378,21],[400,18,400,20],[400,21,400,22],[401,18,401,20],[401,21,401,22],[399,18,399,20],[399,21,399,22],[408,18,408,20],[379,20,379,21],[390,18,390,22],[396,18,396,20],[396,21,396,22],[397,18,397,20],[397,21,397,22],[398,18,398,20],[398,21,398,22],[388,16,388,22],[8,12,9,12],[423,18,423,20],[423,21,423,22],[0,14,0,22],[8,14,8,16],[9,14,9,16],[11,14,11,16],[12,14,12,16],[14,14,14,22],[1,14,1,22],[4,14,4,22],[7,14,7,22],[407,18,407,20],[407,21,407,22],[415,21,415,22],[404,15,404,17],[405,15,405,17],[406,15,406,17],[408,21,408,22],[416,18,416,20],[416,21,416,22],[414,18,414,20],[414,21,414,22]]}
[]
[]
[null,null,null,null,null,null,null,null,null,null,null,null,null,null,"UNIDADE ESCOLAR",null,null,null,null,null,null,"CÓDIGO INEP"]
[null,null,null,null,null,null,null,null,null,null,null,null,null,null,"COLÉGIO ESTADUAL THIAGO VIDAL FERNANDES",null,null,null,null,null,null,52044572]
[]
["Nmax",null,null,null,null,null,null,null,null,null,null,null,"Ajustar altura?",null,"OBRA",null,null,null,"DATA",null,null,"CIDADE"]
[{"$f":"MAX($C$18:$C$377)","v":4},null,null,null,null,null,null,null,null,null,null,null,"SIM",null,"REFORMA E AMPLIAÇÃO",null,null,null,"2020-05-06",null,null,"COCALZINHO DE GOIÁS"]
[]
[null,null,null,null,null,null,null,null,null,null,null,null,{"$f":"IF($M$7=\"MANUAL\",\"DESPROTEJA A PLANILHA PARA FORMATAR\",\"\")","v":""},null,"CRE",null,null,"ENDEREÇO","REFERÊNCIA AGETOP",null,null,"REFERÊNCIA SINAPI"]
[null,null,null,null,null,null,null,null,null,null,null,null,null,null,"CRE-ANÁPOLIS",null,null," AV. TOCANTINS ESQ. COM A ITAPACI S/N , CENTRO , CEP: 7297-000","ABR/19","DESONERADA",null,"FEV/20","DESONERADA"]
[]
[null,null,null,null,null,null,null,null,null,null,null,null,null,null,"ÁREA EXISTENTE (M²)",null,null,"ÁREA A CONSTRUIR (M²)","ÁREA A DEMOLIR (M²)",null,null,"ÁREA TOTAL CONSTRUÍDA (M²)"]
[null,null,null,null,null,null,null,null,null,null,null,null,null,null,1944.49,null,null,1.52,0,null,null,1946.01]
[]
[null,null,null,null,null,null,null,null,null,null,null,"FILTRO",null,null,"PLANILHA ORÇAMENTÁRIA"]
["Nível E","Save Nivel","Nível C","Altura","n1","n2","n3","n4","n5","Czero","Cnível","↓","Nível","Nível Corrigido","ITEM","TABELA","CODIGO","DESCRIÇÃO DOS SERVIÇOS","UNID","QUANT","MAT","MO","T.SERVIÇO","OBSERVAÇÕES¹"]
[{"$f":"CHOOSE(1+LOG(1+2*(ORÇAMENTO.Nivel=\"Nível 1\")+4*(ORÇAMENTO.Nivel=\"Nível 2\")+8*(ORÇAMENTO.Nivel=\"Nível 3\")+16*(ORÇAMENTO.Nivel=\"Nível 4\")+32*(ORÇAMENTO.Nivel=\"Serviço\"),2),0,1,2,3,4,\"S\")","v":"S"},{"$f":"IF(OR(C17=\"s\",C17=0),OFFSET(B17,-1,0),C17)","v":"Save Nivel"},{"$f":"IF(OFFSET(C17,-1,0)=\"L\",1,IF(OFFSET(C17,-1,0)=1,2,IF(OR(A17=\"s\",A17=0),\"S\",IF(AND(OFFSET(C17,-1,0)=2,A17=4),3,IF(AND(OR(OFFSET(C17,-1,0)=\"s\",OFFSET(C17,-1,0)=0),A17<>\"s\",A17>OFFSET(B17,-1,0)),OFFSET(B17,-1,0),A17)))))","v":"S"},{"$f":"IF(OR(C17=\"S\",C17=0),0,IF(ISERROR(K17),J17,SMALL(J17:K17,1)))","v":0},{"$f":"IF($C17=1,OFFSET(E17,-1,0)+1,OFFSET(E17,-1,0))","v":"n1"},{"$f":"IF($C17=1,0,IF($C17=2,OFFSET(F17,-1,0)+1,OFFSET(F17,-1,0)))","v":"n2"},{"$f":"IF(AND($C17<=2,$C17<>0),0,IF($C17=3,OFFSET(G17,-1,0)+1,OFFSET(G17,-1,0)))","v":"n3"},{"$f":"IF(AND($C17<=3,$C17<>0),0,IF($C17=4,OFFSET(H17,-1,0)+1,OFFSET(H17,-1,0)))","v":"n4"},{"$f":"IF(AND($C17<=4,$C17<>0),0,IF(AND($C17=\"S\",$W17>0),OFFSET(I17,-1,0)+1,OFFSET(I17,-1,0)))","v":"n5"},{"$f":"IF(OR($C17=\"S\",$C17=0),0,MATCH(0,OFFSET($D17,1,$C17,ROW($C$377)-ROW($C17)),0))","v":0},{"$f":"IF(OR($C17=\"S\",$C17=0),0,MATCH(OFFSET($D17,0,$C17)+1,OFFSET($D17,1,$C17,ROW($C$377)-ROW($C17)),0))","v":0},{"$f":"IF(OR(W17>0,$C17=1),\"F\",\"\")","v":""},"Serviço",{"$f":"CHOOSE(1+LOG(1+2*(C17=1)+4*(C17=2)+8*(C17=3)+16*(C17=4)+32*(C17=\"S\"),2),\"\",\"Nível 1\",\"Nível 2\",\"Nível 3\",\"Nível 4\",\"Serviço\")","v":"Serviço"},"-","SINAPI",null,"(sem código)","-",null,0,0,0,""]
[0,null,"L",{"$f":"COUNTA(OFFSET(D18,1,0):D$377)","v":358},{"$f":"LEFT(O19,1)-1","v":0},null,null,null,null,null,null,"F","LOTE","LOTE","REFORMA E AMPLIAÇÃO - COLÉGIO ESTADUAL THIAGO VIDAL FERNANDES",null,null,null,null,null,null,null,260925.77999999988]
[{"$f":"CHOOSE(1+LOG(1+2*(ORÇAMENTO.Nivel=\"Nível 1\")+4*(ORÇAMENTO.Nivel=\"Nível 2\")+8*(ORÇAMENTO.Nivel=\"Nível 3\")+16*(ORÇAMENTO.Nivel=\"Nível 4\")+32*(ORÇAMENTO.Nivel=\"Serviço\"),2),0,1,2,3,4,\"S\")","v":1},{"$f":"IF(OR(C19=\"s\",C19=0),OFFSET(B19,-1,0),C19)","v":1},{"$f":"IF(OFFSET(C19,-1,0)=\"L\",1,IF(OFFSET(C19,-1,0)=1,2,IF(OR(A19=\"s\",A19=0),\"S\",IF(AND(OFFSET(C19,-1,0)=2,A19=4),3,IF(AND(OR(OFFSET(C19,-1,0)=\"s\",OFFSET(C19,-1,0)=0),A19<>\"s\",A19>OFFSET(B19,-1,0)),OFFSET(B19,-1,0),A19)))))","v":1},{"$f":"IF(OR(C19=\"S\",C19=0),0,IF(ISERROR(K19),J19,SMALL(J19:K19,1)))","v":332},{"$f":"IF($C19=1,OFFSET(E19,-1,0)+1,OFFSET(E19,-1,0))","v":1},{"$f":"IF($C19=1,0,IF($C19=2,OFFSET(F19,-1,0)+1,OFFSET(F19,-1,0)))","v":0},{"$f":"IF(AND($C19<=2,$C19<>0),0,IF($C19=3,OFFSET(G19,-1,0)+1,OFFSET(G19,-1,0)))","v":0},{"$f":"IF(AND($C19<=3,$C19<>0),0,IF($C19=4,OFFSET(H19,-1,0)+1,OFFSET(H19,-1,0)))","v":0},{"$f":"IF(AND($C19<=4,$C19<>0),0,IF(AND($C19=\"S\",$W19>0),OFFSET(I19,-1,0)+1,OFFSET(I19,-1,0)))","v":0},{"$f":"IF(OR($C19=\"S\",$C19=0),0,MATCH(0,OFFSET($D19,1,$C19,ROW($C$377)-ROW($C19)),0))","v":358},{"$f":"IF(OR($C19=\"S\",$C19=0),0,MATCH(OFFSET($D19,0,$C19)+1,OFFSET($D19,1,$C19,ROW($C$377)-ROW($C19)),0))","v":332},{"$f":"IF(OR(W19>0,$C19=1),\"F\",\"\")","v":"F"},"Nível 1",{"$f":"CHOOSE(1+LOG(1+2*(C19=1)+4*(C19=2)+8*(C19=3)+16*(C19=4)+32*(C19=\"S\"),2),\"\",\"Nível 1\",\"Nível 2\",\"Nível 3\",\"Nível 4\",\"Serviço\")","v":"Nível 1"},"1.","AGETOP",null,"REFORMA E AMPLIAÇÃO"]
[2,2,2,25,1,1,0,0,0,331,25,"","Nível 2","Nível 2","1.1.","AGETOP",null,"SERVIÇOS PRELIMINARES"]
[3,3,3,2,1,1,1,0,0,24,2,"","Nível 3","Nível 3","1.1.1.","SINAPI",null,"CALÇADA ACESSÍVEL","-",null,null,null,null,""]
["S",3,"S",0,1,1,1,0,0,0,0,"","Serviço","Serviço","1.1.1.0.1.","AGETOP",20121,"DEM. MANUAL EM CONCR.SIMPLES C/TR.ATE CB.E CARGA (O.C.)","m3    ",2.12,null,null,null,""]
[3,3,3,2,1,1,2,0,0,22,2,"","Nível 3","Nível 3","1.1.2.","SINAPI",null,"ACESSIBILIDADE DENTRO DO COLÉGIO","-",null,null,null,null,""]
["S",3,"S",0,1,1,2,0,0,0,0,"","Serviço","Serviço","1.1.2.0.1.","AGETOP",20121,"DEM. MANUAL EM CONCR.SIMPLES C/TR.ATE CB.E CARGA (O.C.)","m3    ",0.08,null,null,null,""]
[3,3,3,7,1,1,3,0,0,20,7,"","Nível 3","Nível 3","1.1.3.","SINAPI",null,"BANHEIROS","-",null,null,null,null,""]
["S",3,"S",0,1,1,3,0,0,0,0,"","Serviço","Serviço","1.1.3.0.1.","SINAPI",97622,"DEMOLIÇÃO DE ALVENARIA DE BLOCO FURADO, DE FORMA MANUAL, SEM REAPROVEITAMENTO. AF_12/2017","M3",0.25,null,null,null,"Referência: AGETOP - 20118"]
["S",3,"S",0,1,1,3,0,0,0,0,"","Serviço","Serviço","1.1.3.0.2.","AGETOP",20111,"DEM.PISO CERAM.SOBRE LASTRO CONC.C/TR.CB.E CARGA","m2    ",59.04,null,null,null,""]
["S",3,"S",0,1,1,3,0,0,0,0,"","Serviço","Serviço","1.1.3.0.3.","SINAPI",97633,"DEMOLIÇÃO DE REVESTIMENTO CERÂMICO, DE FORMA MANUAL, SEM REAPROVEITAMENTO. AF_12/2017","M2",225.14,null,null,null,"Referência: AGETOP - 20115"]
["S",3,"S",0,1,1,3,0,0,0,0,"","Serviço","Serviço","1.1.3.0.4.","SINAPI",97644,"REMOÇÃO DE PORTAS, DE FORMA MANUAL, SEM REAPROVEITAMENTO. AF_12/2017","M2",11.1,null,null,null,"Referência: AGETOP - 20106"]
["S",3,"S",0,1,1,3,0,0,0,0,"","Serviço","Serviço","1.1.3.0.5.","AGETOP",20151,"DEMOL.DIVISÓRIA EM PEDRA/CONC.C/TRANSP.ATE C.B.CARGA","m2    ",5.4,null,null,null,""]
["S",3,"S",0,1,1,3,0,0,0,0,"","Serviço","Serviço","1.1.3.0.6.","AGETOP",20163,"DEMOLIÇÃO DAS INSTALAÇÕES HIDROSANITÁRIAS E AFINS C/ TRANSP. ATÉ CB. E CARGA","H     ",4,null,null,null,""]
[3,3,3,4,1,1,4,0,0,13,4,"","Nível 3","Nível 3","1.1.4.","SINAPI",null,"QUADRA EXISTENTE","-",null,null,null,null,""]
["S",3,"S",0,1,1,4,0,0,0,0,"","Serviço","Serviço","1.1.4.0.1.","COMPOSIÇÃO","COMP 012_SEE","DEMOLIÇÃO/RETIRADA DAS TRAVES DE FUTEBOL DE SALÃO","CJ",1,null,null,null,""]
["S",3,"S",0,1,1,4,0,0,0,0,"","Serviço","Serviço","1.1.4.0.2.","COMPOSIÇÃO","COMP 001_SEE","RETIRADA DA ESTRUTURA/TABELA DE BASQUETE C/ TRANSP ATÉ CB. E CARGA","UN ",2,null,null,null,""]
[{"$f":"CHOOSE(1+LOG(1+2*(ORÇAMENTO.Nivel=\"Nível 1\")+4*(ORÇAMENTO.Nivel=\"Nível 2\")+8*(ORÇAMENTO.Nivel=\"Nível 3\")+16*(ORÇAMENTO.Nivel=\"Nível 4\")+32*(ORÇAMENTO.Nivel=\"Serviço\"),2),0,1,2,3,4,\"S\")","v":"S"},{"$f":"IF(OR(C35=\"s\",C35=0),OFFSET(B35,-1,0),C35)","v":3},{"$f":"IF(OFFSET(C35,-1,0)=\"L\",1,IF(OFFSET(C35,-1,0)=1,2,IF(OR(A35=\"s\",A35=0),\"S\",IF(AND(OFFSET(C35,-1,0)=2,A35=4),3,IF(AND(OR(OFFSET(C35,-1,0)=\"s\",OFFSET(C35,-1,0)=0),A35<>\"s\",A35>OFFSET(B35,-1,0)),OFFSET(B35,-1,0),A35)))))","v":"S"},{"$f":"IF(OR(C35=\"S\",C35=0),0,IF(ISERROR(K35),J35,SMALL(J35:K35,1)))","v":0},{"$f":"IF($C35=1,OFFSET(E35,-1,0)+1,OFFSET(E35,-1,0))","v":1},{"$f":"IF($C35=1,0,IF($C35=2,OFFSET(F35,-1,0)+1,OFFSET(F35,-1,0)))","v":1},{"$f":"IF(AND($C35<=2,$C35<>0),0,IF($C35=3,OFFSET(G35,-1,0)+1,OFFSET(G35,-1,0)))","v":4},{"$f":"IF(AND($C35<=3,$C35<>0),0,IF($C35=4,OFFSET(H35,-1,0)+1,OFFSET(H35,-1,0)))","v":0},{"$f":"IF(AND($C35<=4,$C35<>0),0,IF(AND($C35=\"S\",$W35>0),OFFSET(I35,-1,0)+1,OFFSET(I35,-1,0)))","v":0},0,0,{"$f":"IF(OR(W35>0,$C35=1),\"F\",\"\")","v":""},"Serviço",{"$f":"CHOOSE(1+LOG(1+2*(C35=1)+4*(C35=2)+8*(C35=3)+16*(C35=4)+32*(C35=\"S\"),2),\"\",\"Nível 1\",\"Nível 2\",\"Nível 3\",\"Nível 4\",\"Serviço\")","v":"Serviço"},"1.1.4.0.3.","AGETOP",20121,"DEM. MANUAL EM CONCR.SIMPLES C/TR.ATE CB.E CARGA (O.C.)","m3    ",3.01,null,null,null,""]
[3,3,3,2,1,1,5,0,0,9,2,"","Nível 3","Nível 3","1.1.5.","SINAPI",null,"COZINHA E DESPENSA","-",null,null,null,null,""]
["S",3,"S",0,1,1,5,0,0,0,0,"","Serviço","Serviço","1.1.5.0.1.","AGETOP",20139,"DEMOLIÇAO DE BANCADAS C/ TRANSP. ATÉ CB. E CARGA","m2    ",3.29,null,null,null,""]
[3,3,3,2,1,1,6,0,0,7,2,"","Nível 3","Nível 3","1.1.6.","SINAPI",null,"COBERTURA","-",null,null,null,null,""]
["S",3,"S",0,1,1,6,0,0,0,0,"","Serviço","Serviço","1.1.6.0.1.","AGETOP",20101,"DEMOLICAO COBERTURA TELHA CERAMICA C/ TRANSP. ATÉ CB. E CARGA","m2    ",46.61,null,null,null,""]
[3,3,3,5,1,1,7,0,0,5,{"$error":"#N/A"},"","Nível 3","Nível 3","1.1.7.","SINAPI",null,"IMPLANTAÇÃO PROJ. COMPLEMENTÁRES","-",null,null,null,null,""]
[{"$f":"CHOOSE(1+LOG(1+2*(ORÇAMENTO.Nivel=\"Nível 1\")+4*(ORÇAMENTO.Nivel=\"Nível 2\")+8*(ORÇAMENTO.Nivel=\"Nível 3\")+16*(ORÇAMENTO.Nivel=\"Nível 4\")+32*(ORÇAMENTO.Nivel=\"Serviço\"),2),0,1,2,3,4,\"S\")","v":"S"},{"$f":"IF(OR(C41=\"s\",C41=0),OFFSET(B41,-1,0),C41)","v":3},{"$f":"IF(OFFSET(C41,-1,0)=\"L\",1,IF(OFFSET(C41,-1,0)=1,2,IF(OR(A41=\"s\",A41=0),\"S\",IF(AND(OFFSET(C41,-1,0)=2,A41=4),3,IF(AND(OR(OFFSET(C41,-1,0)=\"s\",OFFSET(C41,-1,0)=0),A41<>\"s\",A41>OFFSET(B41,-1,0)),OFFSET(B41,-1,0),A41)))))","v":"S"},{"$f":"IF(OR(C41=\"S\",C41=0),0,IF(ISERROR(K41),J41,SMALL(J41:K41,1)))","v":0},{"$f":"IF($C41=1,OFFSET(E41,-1,0)+1,OFFSET(E41,-1,0))","v":1},{"$f":"IF($C41=1,0,IF($C41=2,OFFSET(F41,-1,0)+1,OFFSET(F41,-1,0)))","v":1},{"$f":"IF(AND($C41<=2,$C41<>0),0,IF($C41=3,OFFSET(G41,-1,0)+1,OFFSET(G41,-1,0)))","v":7},{"$f":"IF(AND($C41<=3,$C41<>0),0,IF($C41=4,OFFSET(H41,-1,0)+1,OFFSET(H41,-1,0)))","v":0},{"$f":"IF(AND($C41<=4,$C41<>0),0,IF(AND($C41=\"S\",$W41>0),OFFSET(I41,-1,0)+1,OFFSET(I41,-1,0)))","v":0},0,0,{"$f":"IF(OR(W41>0,$C41=1),\"F\",\"\")","v":""},"Serviço",{"$f":"CHOOSE(1+LOG(1+2*(C41=1)+4*(C41=2)+8*(C41=3)+16*(C41=4)+32*(C41=\"S\"),2),\"\",\"Nível 1\",\"Nível 2\",\"Nível 3\",\"Nível 4\",\"Serviço\")","v":"Serviço"},"1.1.7.0.1.","AGETOP",20162,"DEMOLIÇÃO DAS INSTALAÇÕES ELÉTRICAS E AFINS C/ TRANSP. ATÉ CB. E CARGA","H     ",2,null,null,null,""]
[{"$f":"CHOOSE(1+LOG(1+2*(ORÇAMENTO.Nivel=\"Nível 1\")+4*(ORÇAMENTO.Nivel=\"Nível 2\")+8*(ORÇAMENTO.Nivel=\"Nível 3\")+16*(ORÇAMENTO.Nivel=\"Nível 4\")+32*(ORÇAMENTO.Nivel=\"Serviço\"),2),0,1,2,3,4,\"S\")","v":"S"},{"$f":"IF(OR(C42=\"s\",C42=0),OFFSET(B42,-1,0),C42)","v":3},{"$f":"IF(OFFSET(C42,-1,0)=\"L\",1,IF(OFFSET(C42,-1,0)=1,2,IF(OR(A42=\"s\",A42=0),\"S\",IF(AND(OFFSET(C42,-1,0)=2,A42=4),3,IF(AND(OR(OFFSET(C42,-1,0)=\"s\",OFFSET(C42,-1,0)=0),A42<>\"s\",A42>OFFSET(B42,-1,0)),OFFSET(B42,-1,0),A42)))))","v":"S"},{"$f":"IF(OR(C42=\"S\",C42=0),0,IF(ISERROR(K42),J42,SMALL(J42:K42,1)))","v":0},{"$f":"IF($C42=1,OFFSET(E42,-1,0)+1,OFFSET(E42,-1,0))","v":1},{"$f":"IF($C42=1,0,IF($C42=2,OFFSET(F42,-1,0)+1,OFFSET(F42,-1,0)))","v":1},{"$f":"IF(AND($C42<=2,$C42<>0),0,IF($C42=3,OFFSET(G42,-1,0)+1,OFFSET(G42,-1,0)))","v":7},{"$f":"IF(AND($C42<=3,$C42<>0),0,IF($C42=4,OFFSET(H42,-1,0)+1,OFFSET(H42,-1,0)))","v":0},{"$f":"IF(AND($C42<=4,$C42<>0),0,IF(AND($C42=\"S\",$W42>0),OFFSET(I42,-1,0)+1,OFFSET(I42,-1,0)))","v":0},0,0,{"$f":"IF(OR(W42>0,$C42=1),\"F\",\"\")","v":""},"Serviço",{"$f":"CHOOSE(1+LOG(1+2*(C42=1)+4*(C42=2)+8*(C42=3)+16*(C42=4)+32*(C42=\"S\"),2),\"\",\"Nível 1\",\"Nível 2\",\"Nível 3\",\"Nível 4\",\"Serviço\")","v":"Serviço"},"1.1.7.0.2.","AGETOP",20109,"DEM.PISO CIMENT.SOBRE LASTRO CONC.C/TR.ATE CB. E CARGA","m2    ",39.700000000000003,null,null,null,""]
[{"$f":"CHOOSE(1+LOG(1+2*(ORÇAMENTO.Nivel=\"Nível 1\")+4*(ORÇAMENTO.Nivel=\"Nível 2\")+8*(ORÇAMENTO.Nivel=\"Nível 3\")+16*(ORÇAMENTO.Nivel=\"Nível 4\")+32*(ORÇAMENTO.Nivel=\"Serviço\"),2),0,1,2,3,4,\"S\")","v":"S"},{"$f":"IF(OR(C43=\"s\",C43=0),OFFSET(B43,-1,0),C43)","v":3},{"$f":"IF(OFFSET(C43,-1,0)=\"L\",1,IF(OFFSET(C43,-1,0)=1,2,IF(OR(A43=\"s\",A43=0),\"S\",IF(AND(OFFSET(C43,-1,0)=2,A43=4),3,IF(AND(OR(OFFSET(C43,-1,0)=\"s\",OFFSET(C43,-1,0)=0),A43<>\"s\",A43>OFFSET(B43,-1,0)),OFFSET(B43,-1,0),A43)))))","v":"S"},{"$f":"IF(OR(C43=\"S\",C43=0),0,IF(ISERROR(K43),J43,SMALL(J43:K43,1)))","v":0},{"$f":"IF($C43=1,OFFSET(E43,-1,0)+1,OFFSET(E43,-1,0))","v":1},{"$f":"IF($C43=1,0,IF($C43=2,OFFSET(F43,-1,0)+1,OFFSET(F43,-1,0)))","v":1},{"$f":"IF(AND($C43<=2,$C43<>0),0,IF($C43=3,OFFSET(G43,-1,0)+1,OFFSET(G43,-1,0)))","v":7},{"$f":"IF(AND($C43<=3,$C43<>0),0,IF($C43=4,OFFSET(H43,-1,0)+1,OFFSET(H43,-1,0)))","v":0},{"$f":"IF(AND($C43<=4,$C43<>0),0,IF(AND($C43=\"S\",$W43>0),OFFSET(I43,-1,0)+1,OFFSET(I43,-1,0)))","v":0},0,0,{"$f":"IF(OR(W43>0,$C43=1),\"F\",\"\")","v":""},"Serviço",{"$f":"CHOOSE(1+LOG(1+2*(C43=1)+4*(C43=2)+8*(C43=3)+16*(C43=4)+32*(C43=\"S\"),2),\"\",\"Nível 1\",\"Nível 2\",\"Nível 3\",\"Nível 4\",\"Serviço\")","v":"Serviço"},"1.1.7.0.3.","AGETOP",20121,"DEM. MANUAL EM CONCR.SIMPLES C/TR.ATE CB.E CARGA (O.C.)","m3    ",0.03,null,null,null,""]
[{"$f":"CHOOSE(1+LOG(1+2*(ORÇAMENTO.Nivel=\"Nível 1\")+4*(ORÇAMENTO.Nivel=\"Nível 2\")+8*(ORÇAMENTO.Nivel=\"Nível 3\")+16*(ORÇAMENTO.Nivel=\"Nível 4\")+32*(ORÇAMENTO.Nivel=\"Serviço\"),2),0,1,2,3,4,\"S\")","v":"S"},{"$f":"IF(OR(C44=\"s\",C44=0),OFFSET(B44,-1,0),C44)","v":3},{"$f":"IF(OFFSET(C44,-1,0)=\"L\",1,IF(OFFSET(C44,-1,0)=1,2,IF(OR(A44=\"s\",A44=0),\"S\",IF(AND(OFFSET(C44,-1,0)=2,A44=4),3,IF(AND(OR(OFFSET(C44,-1,0)=\"s\",OFFSET(C44,-1,0)=0),A44<>\"s\",A44>OFFSET(B44,-1,0)),OFFSET(B44,-1,0),A44)))))","v":"S"},{"$f":"IF(OR(C44=\"S\",C44=0),0,IF(ISERROR(K44),J44,SMALL(J44:K44,1)))","v":0},{"$f":"IF($C44=1,OFFSET(E44,-1,0)+1,OFFSET(E44,-1,0))","v":1},{"$f":"IF($C44=1,0,IF($C44=2,OFFSET(F44,-1,0)+1,OFFSET(F44,-1,0)))","v":1},{"$f":"IF(AND($C44<=2,$C44<>0),0,IF($C44=3,OFFSET(G44,-1,0)+1,OFFSET(G44,-1,0)))","v":7},{"$f":"IF(AND($C44<=3,$C44<>0),0,IF($C44=4,OFFSET(H44,-1,0)+1,OFFSET(H44,-1,0)))","v":0},{"$f":"IF(AND($C44<=4,$C44<>0),0,IF(AND($C44=\"S\",$W44>0),OFFSET(I44,-1,0)+1,OFFSET(I44,-1,0)))","v":0},0,0,{"$f":"IF(OR(W44>0,$C44=1),\"F\",\"\")","v":""},"Serviço",{"$f":"CHOOSE(1+LOG(1+2*(C44=1)+4*(C44=2)+8*(C44=3)+16*(C44=4)+32*(C44=\"S\"),2),\"\",\"Nível 1\",\"Nível 2\",\"Nível 3\",\"Nível 4\",\"Serviço\")","v":"Serviço"},"1.1.7.0.4.","AGETOP",21301,"PLACA DE OBRA PLOTADA EM CHAPA METÁLICA 26 , AFIXADA EM CAVALETES DE MADEIRA DE LEI (VIGOTAS 6X12CM) - PADRÃO GOINFRA","m2    ",7.5,null,null,null,""]
[2,{"$f":"IF(OR(C45=\"s\",C45=0),OFFSET(B45,-1,0),C45)","v":2},{"$f":"IF(OFFSET(C45,-1,0)=\"L\",1,IF(OFFSET(C45,-1,0)=1,2,IF(OR(A45=\"s\",A45=0),\"S\",IF(AND(OFFSET(C45,-1,0)=2,A45=4),3,IF(AND(OR(OFFSET(C45,-1,0)=\"s\",OFFSET(C45,-1,0)=0),A45<>\"s\",A45>OFFSET(B45,-1,0)),OFFSET(B45,-1,0),A45)))))","v":2},{"$f":"IF(OR(C45=\"S\",C45=0),0,IF(ISERROR(K45),J45,SMALL(J45:K45,1)))","v":3},{"$f":"IF($C45=1,OFFSET(E45,-1,0)+1,OFFSET(E45,-1,0))","v":1},{"$f":"IF($C45=1,0,IF($C45=2,OFFSET(F45,-1,0)+1,OFFSET(F45,-1,0)))","v":2},{"$f":"IF(AND($C45<=2,$C45<>0),0,IF($C45=3,OFFSET(G45,-1,0)+1,OFFSET(G45,-1,0)))","v":0},{"$f":"IF(AND($C45<=3,$C45<>0),0,IF($C45=4,OFFSET(H45,-1,0)+1,OFFSET(H45,-1,0)))","v":0},{"$f":"IF(AND($C45<=4,$C45<>0),0,IF(AND($C45=\"S\",$W45>0),OFFSET(I45,-1,0)+1,OFFSET(I45,-1,0)))","v":0},306,3,{"$f":"IF(OR(W45>0,$C45=1),\"F\",\"\")","v":""},"Nível 2",{"$f":"CHOOSE(1+LOG(1+2*(C45=1)+4*(C45=2)+8*(C45=3)+16*(C45=4)+32*(C45=\"S\"),2),\"\",\"Nível 1\",\"Nível 2\",\"Nível 3\",\"Nível 4\",\"Serviço\")","v":"Nível 2"},"1.2.","AGETOP",null,"TRANSPORTES","-",null,null,null,null,""]
["S",2,"S",0,1,2,0,0,0,0,0,"","Serviço","Serviço","1.2.0.0.1.","SINAPI",72900,"TRANSPORTE DE ENTULHO COM CAMINHAO BASCULANTE 6 M3, RODOVIA PAVIMENTADA, DMT 0,5 A 1,0 KM","M3",25,null,null,null,""]
["S",2,"S",0,1,2,0,0,0,0,0,"","Serviço","Serviço","1.2.0.0.2.","SINAPI",72897,"CARGA MANUAL DE ENTULHO EM CAMINHAO BASCULANTE 6 M3","M3",25,null,null,null,""]
[2,2,2,4,1,3,0,0,0,303,4,"","Nível 2","Nível 2","1.3.","AGETOP",null,"SERVIÇO EM TERRA","-",null,null,null,null,""]
[3,3,3,3,1,3,1,0,0,3,44,"","Nível 3","Nível 3","1.3.1.","SINAPI",null,"IMPLANTAÇÃO PROJ. COMPLEMENTÁRES","-",null,null,null,null,""]
["S",3,"S",0,1,3,1,0,0,0,0,"","Serviço","Serviço","1.3.1.0.1.","SINAPI",93358,"ESCAVAÇÃO MANUAL DE VALA COM PROFUNDIDADE MENOR OU IGUAL A 1,30 M. AF_03/2016","M3",24.33,null,null,null,"Referência: AGETOP - 40101"]
["S",3,"S",0,1,3,1,0,0,0,0,"","Serviço","Serviço","1.3.1.0.2.","SINAPI",96995,"REATERRO MANUAL APILOADO COM SOQUETE. AF_10/2017","M3",24.33,null,null,null,"Referência: AGETOP - 40902"]
[{"$f":"CHOOSE(1+LOG(1+2*(ORÇAMENTO.Nivel=\"Nível 1\")+4*(ORÇAMENTO.Nivel=\"Nível 2\")+8*(ORÇAMENTO.Nivel=\"Nível 3\")+16*(ORÇAMENTO.Nivel=\"Nível 4\")+32*(ORÇAMENTO.Nivel=\"Serviço\"),2),0,1,2,3,4,\"S\")","v":2},{"$f":"IF(OR(C52=\"s\",C52=0),OFFSET(B52,-1,0),C52)","v":2},{"$f":"IF(OFFSET(C52,-1,0)=\"L\",1,IF(OFFSET(C52,-1,0)=1,2,IF(OR(A52=\"s\",A52=0),\"S\",IF(AND(OFFSET(C52,-1,0)=2,A52=4),3,IF(AND(OR(OFFSET(C52,-1,0)=\"s\",OFFSET(C52,-1,0)=0),A52<>\"s\",A52>OFFSET(B52,-1,0)),OFFSET(B52,-1,0),A52)))))","v":2},{"$f":"IF(OR(C52=\"S\",C52=0),0,IF(ISERROR(K52),J52,SMALL(J52:K52,1)))","v":88},{"$f":"IF($C52=1,OFFSET(E52,-1,0)+1,OFFSET(E52,-1,0))","v":1},{"$f":"IF($C52=1,0,IF($C52=2,OFFSET(F52,-1,0)+1,OFFSET(F52,-1,0)))","v":4},{"$f":"IF(AND($C52<=2,$C52<>0),0,IF($C52=3,OFFSET(G52,-1,0)+1,OFFSET(G52,-1,0)))","v":0},{"$f":"IF(AND($C52<=3,$C52<>0),0,IF($C52=4,OFFSET(H52,-1,0)+1,OFFSET(H52,-1,0)))","v":0},{"$f":"IF(AND($C52<=4,$C52<>0),0,IF(AND($C52=\"S\",$W52>0),OFFSET(I52,-1,0)+1,OFFSET(I52,-1,0)))","v":0},299,88,{"$f":"IF(OR(W52>0,$C52=1),\"F\",\"\")","v":""},"Nível 2",{"$f":"CHOOSE(1+LOG(1+2*(C52=1)+4*(C52=2)+8*(C52=3)+16*(C52=4)+32*(C52=\"S\"),2),\"\",\"Nível 1\",\"Nível 2\",\"Nível 3\",\"Nível 4\",\"Serviço\")","v":"Nível 2"},"1.4.",null,null,"INSTALAÇÕES ELÉTRICAS","-",null,null,null,null,""]
[{"$f":"CHOOSE(1+LOG(1+2*(ORÇAMENTO.Nivel=\"Nível 1\")+4*(ORÇAMENTO.Nivel=\"Nível 2\")+8*(ORÇAMENTO.Nivel=\"Nível 3\")+16*(ORÇAMENTO.Nivel=\"Nível 4\")+32*(ORÇAMENTO.Nivel=\"Serviço\"),2),0,1,2,3,4,\"S\")","v":3},{"$f":"IF(OR(C53=\"s\",C53=0),OFFSET(B53,-1,0),C53)","v":3},{"$f":"IF(OFFSET(C53,-1,0)=\"L\",1,IF(OFFSET(C53,-1,0)=1,2,IF(OR(A53=\"s\",A53=0),\"S\",IF(AND(OFFSET(C53,-1,0)=2,A53=4),3,IF(AND(OR(OFFSET(C53,-1,0)=\"s\",OFFSET(C53,-1,0)=0),A53<>\"s\",A53>OFFSET(B53,-1,0)),OFFSET(B53,-1,0),A53)))))","v":3},{"$f":"IF(OR(C53=\"S\",C53=0),0,IF(ISERROR(K53),J53,SMALL(J53:K53,1)))","v":40},{"$f":"IF($C53=1,OFFSET(E53,-1,0)+1,OFFSET(E53,-1,0))","v":1},{"$f":"IF($C53=1,0,IF($C53=2,OFFSET(F53,-1,0)+1,OFFSET(F53,-1,0)))","v":4},{"$f":"IF(AND($C53<=2,$C53<>0),0,IF($C53=3,OFFSET(G53,-1,0)+1,OFFSET(G53,-1,0)))","v":1},{"$f":"IF(AND($C53<=3,$C53<>0),0,IF($C53=4,OFFSET(H53,-1,0)+1,OFFSET(H53,-1,0)))","v":0},{"$f":"IF(AND($C53<=4,$C53<>0),0,IF(AND($C53=\"S\",$W53>0),OFFSET(I53,-1,0)+1,OFFSET(I53,-1,0)))","v":0},87,40,{"$f":"IF(OR(W53>0,$C53=1),\"F\",\"\")","v":""},"Nível 3",{"$f":"CHOOSE(1+LOG(1+2*(C53=1)+4*(C53=2)+8*(C53=3)+16*(C53=4)+32*(C53=\"S\"),2),\"\",\"Nível 1\",\"Nível 2\",\"Nível 3\",\"Nível 4\",\"Serviço\")","v":"Nível 3"},"1.4.1.","SINAPI",null,"INSTALAÇÕES GERAIS","-",null,null,null,null,""]
["S",{"$f":"IF(OR(C54=\"s\",C54=0),OFFSET(B54,-1,0),C54)","v":3},{"$f":"IF(OFFSET(C54,-1,0)=\"L\",1,IF(OFFSET(C54,-1,0)=1,2,IF(OR(A54=\"s\",A54=0),\"S\",IF(AND(OFFSET(C54,-1,0)=2,A54=4),3,IF(AND(OR(OFFSET(C54,-1,0)=\"s\",OFFSET(C54,-1,0)=0),A54<>\"s\",A54>OFFSET(B54,-1,0)),OFFSET(B54,-1,0),A54)))))","v":"S"},{"$f":"IF(OR(C54=\"S\",C54=0),0,IF(ISERROR(K54),J54,SMALL(J54:K54,1)))","v":0},{"$f":"IF($C54=1,OFFSET(E54,-1,0)+1,OFFSET(E54,-1,0))","v":1},{"$f":"IF($C54=1,0,IF($C54=2,OFFSET(F54,-1,0)+1,OFFSET(F54,-1,0)))","v":4},{"$f":"IF(AND($C54<=2,$C54<>0),0,IF($C54=3,OFFSET(G54,-1,0)+1,OFFSET(G54,-1,0)))","v":1},{"$f":"IF(AND($C54<=3,$C54<>0),0,IF($C54=4,OFFSET(H54,-1,0)+1,OFFSET(H54,-1,0)))","v":0},{"$f":"IF(AND($C54<=4,$C54<>0),0,IF(AND($C54=\"S\",$W54>0),OFFSET(I54,-1,0)+1,OFFSET(I54,-1,0)))","v":0},0,0,{"$f":"IF(OR(W54>0,$C54=1),\"F\",\"\")","v":""},"Serviço",{"$f":"CHOOSE(1+LOG(1+2*(C54=1)+4*(C54=2)+8*(C54=3)+16*(C54=4)+32*(C54=\"S\"),2),\"\",\"Nível 1\",\"Nível 2\",\"Nível 3\",\"Nível 4\",\"Serviço\")","v":"Serviço"},"1.4.1.0.1.","AGETOP",70351,"BRACADEIRA METALICA TIPO \"U\" DIAM. 3/4\"","Un    ",200,null,null,null,""]
["S",3,"S",0,1,4,1,0,0,0,0,"","Serviço","Serviço","1.4.1.0.2.","AGETOP",70352,"BRACADEIRA METALICA TIPO \"U\" DIAM. 1\"","Un    ",65,null,null,null,""]
["S",3,"S",0,1,4,1,0,0,0,0,"","Serviço","Serviço","1.4.1.0.3.","AGETOP",70421,"BUCHA E ARRUELA METALICA DIAM. 3/4\"","PR    ",6,null,null,null,""]
["S",3,"S",0,1,4,1,0,0,0,0,"","Serviço","Serviço","1.4.1.0.4.","AGETOP",70422,"BUCHA E ARRUELA METALICA DIAM. 1\"","PR    ",4,null,null,null,""]
["S",3,"S",0,1,4,1,0,0,0,0,"","Serviço","Serviço","1.4.1.0.5.","SINAPI",91931,"CABO DE COBRE FLEXÍVEL ISOLADO, 6 MM², ANTI-CHAMA 0,6/1,0 KV, PARA CIRCUITOS TERMINAIS - FORNECIMENTO E INSTALAÇÃO. AF_12/2015","M",500,null,null,null,"Referência: AGETOP - 70583"]
["S",3,"S",0,1,4,1,0,0,0,0,"","Serviço","Serviço","1.4.1.0.6.","SINAPI",96971,"CORDOALHA DE COBRE NU 16 MM², NÃO ENTERRADA, COM ISOLADOR - FORNECIMENTO E INSTALAÇÃO. AF_12/2017","M",10,null,null,null,"Referência: AGETOP - 70541"]
["S",3,"S",0,1,4,1,0,0,0,0,"","Serviço","Serviço","1.4.1.0.7.","SINAPI",91926,"CABO DE COBRE FLEXÍVEL ISOLADO, 2,5 MM², ANTI-CHAMA 450/750 V, PARA CIRCUITOS TERMINAIS - FORNECIMENTO E INSTALAÇÃO. AF_12/2015","M",900,null,null,null,"Referência: AGETOP - 70563"]
["S",3,"S",0,1,4,1,0,0,0,0,"","Serviço","Serviço","1.4.1.0.8.","SINAPI",91928,"CABO DE COBRE FLEXÍVEL ISOLADO, 4 MM², ANTI-CHAMA 450/750 V, PARA CIRCUITOS TERMINAIS - FORNECIMENTO E INSTALAÇÃO. AF_12/2015","M",250,null,null,null,"Referência: AGETOP - 70564"]
["S",3,"S",0,1,4,1,0,0,0,0,"","Serviço","Serviço","1.4.1.0.9.","SINAPI",92870,"CAIXA RETANGULAR 4\" X 4\" ALTA (2,00 M DO PISO), METÁLICA, INSTALADA EM PAREDE - FORNECIMENTO E INSTALAÇÃO. AF_12/2015","UN",2,null,null,null,""]
["S",3,"S",0,1,4,1,0,0,0,0,"","Serviço","Serviço","1.4.1.0.10.","SINAPI",92867,"CAIXA RETANGULAR 4\" X 2\" ALTA (2,00 M DO PISO), METÁLICA, INSTALADA EM PAREDE - FORNECIMENTO E INSTALAÇÃO. AF_12/2015","UN",60,null,null,null,""]
["S",3,"S",0,1,4,1,0,0,0,0,"","Serviço","Serviço","1.4.1.0.11.","SINAPI",97891,"CAIXA ENTERRADA ELÉTRICA RETANGULAR, EM ALVENARIA COM BLOCOS DE CONCRETO, FUNDO COM BRITA, DIMENSÕES INTERNAS: 0,4X0,4X0,4 M. AF_05/2018","UN",2,null,null,null,""]
["S",3,"S",0,1,4,1,0,0,0,0,"","Serviço","Serviço","1.4.1.0.12.","SINAPI",98111,"CAIXA DE INSPEÇÃO PARA ATERRAMENTO, CIRCULAR, EM POLIETILENO, DIÂMETRO INTERNO = 0,3 M. AF_05/2018","UN",1,null,null,null,""]
["S",3,"S",0,1,4,1,0,0,0,0,"","Serviço","Serviço","1.4.1.0.13.","SINAPI",91902,"CURVA 90 GRAUS PARA ELETRODUTO, PVC, ROSCÁVEL, DN 25 MM (3/4\"), PARA CIRCUITOS TERMINAIS, INSTALADA EM LAJE - FORNECIMENTO E INSTALAÇÃO. AF_12/2015","UN",30,null,null,null,"Referência: AGETOP - 71141"]
["S",3,"S",0,1,4,1,0,0,0,0,"","Serviço","Serviço","1.4.1.0.14.","SINAPI",91905,"CURVA 90 GRAUS PARA ELETRODUTO, PVC, ROSCÁVEL, DN 32 MM (1\"), PARA CIRCUITOS TERMINAIS, INSTALADA EM LAJE - FORNECIMENTO E INSTALAÇÃO. AF_12/2015","UN",10,null,null,null,"Referência: AGETOP - 71142"]
["S",3,"S",0,1,4,1,0,0,0,0,"","Serviço","Serviço","1.4.1.0.15.","SINAPI",93654,"DISJUNTOR MONOPOLAR TIPO DIN, CORRENTE NOMINAL DE 16A - FORNECIMENTO E INSTALAÇÃO. AF_04/2016","UN",15,null,null,null,""]
["S",3,"S",0,1,4,1,0,0,0,0,"","Serviço","Serviço","1.4.1.0.16.","SINAPI",93656,"DISJUNTOR MONOPOLAR TIPO DIN, CORRENTE NOMINAL DE 25A - FORNECIMENTO E INSTALAÇÃO. AF_04/2016","UN",3,null,null,null,""]
["S",3,"S",0,1,4,1,0,0,0,0,"","Serviço","Serviço","1.4.1.0.17.","SINAPI",93671,"DISJUNTOR TRIPOLAR TIPO DIN, CORRENTE NOMINAL DE 32A - FORNECIMENTO E INSTALAÇÃO. AF_04/2016","UN",2,null,null,null,"Referência: AGETOP - 71173"]
["S",3,"S",0,1,4,1,0,0,0,0,"","Serviço","Serviço","1.4.1.0.18.","SINAPI",93672,"DISJUNTOR TRIPOLAR TIPO DIN, CORRENTE NOMINAL DE 40A - FORNECIMENTO E INSTALAÇÃO. AF_04/2016","UN",1,null,null,null,"Referência: AGETOP - 71174"]
["S",3,"S",0,1,4,1,0,0,0,0,"","Serviço","Serviço","1.4.1.0.19.","SINAPI",91844,"ELETRODUTO FLEXÍVEL CORRUGADO, PVC, DN 25 MM (3/4\"), PARA CIRCUITOS TERMINAIS, INSTALADO EM LAJE - FORNECIMENTO E INSTALAÇÃO. AF_12/2015","M",100,null,null,null,""]
["S",3,"S",0,1,4,1,0,0,0,0,"","Serviço","Serviço","1.4.1.0.20.","SINAPI",91871,"ELETRODUTO RÍGIDO ROSCÁVEL, PVC, DN 25 MM (3/4\"), PARA CIRCUITOS TERMINAIS, INSTALADO EM PAREDE - FORNECIMENTO E INSTALAÇÃO. AF_12/2015","M",400,null,null,null,"Referência: AGETOP - 71201"]
["S",3,"S",0,1,4,1,0,0,0,0,"","Serviço","Serviço","1.4.1.0.21.","SINAPI",91872,"ELETRODUTO RÍGIDO ROSCÁVEL, PVC, DN 32 MM (1\"), PARA CIRCUITOS TERMINAIS, INSTALADO EM PAREDE - FORNECIMENTO E INSTALAÇÃO. AF_12/2015","M",130,null,null,null,"Referência: AGETOP - 71202"]
["S",3,"S",0,1,4,1,0,0,0,0,"","Serviço","Serviço","1.4.1.0.22.","AGETOP",71381,"HASTE REV.COBRE(COPPERWELD)  5/8\" X 3,00 M C/CONECTOR","Un    ",3,null,null,null,""]
["S",3,"S",0,1,4,1,0,0,0,0,"","Serviço","Serviço","1.4.1.0.23.","AGETOP",70255,"ATERRAMENTO - SOLDA EXOTÉRMICA - CARTUCHO 90 G","un    ",3,null,null,null,""]
["S",3,"S",0,1,4,1,0,0,0,0,"","Serviço","Serviço","1.4.1.0.24.","SINAPI",91953,"INTERRUPTOR SIMPLES (1 MÓDULO), 10A/250V, INCLUINDO SUPORTE E PLACA - FORNECIMENTO E INSTALAÇÃO. AF_12/2015","UN",18,null,null,null,"Referência: AGETOP - 71440"]
["S",3,"S",0,1,4,1,0,0,0,0,"","Serviço","Serviço","1.4.1.0.25.","COMPOSIÇÃO","COMP 387_SEE","LÂMPADA LED TUBULAR 18W ","UN ",124,null,null,null,""]
["S",3,"S",0,1,4,1,0,0,0,0,"","Serviço","Serviço","1.4.1.0.26.","SINAPI",97610,"LÂMPADA COMPACTA DE LED 10 W, BASE E27 - FORNECIMENTO E INSTALAÇÃO. AF_11/2017","UN",6,null,null,null,""]
["S",3,"S",0,1,4,1,0,0,0,0,"","Serviço","Serviço","1.4.1.0.27.","SINAPI",97585,"LUMINÁRIA TIPO CALHA, DE SOBREPOR, COM 2 LÂMPADAS TUBULARES DE 18 W - FORNECIMENTO E INSTALAÇÃO. AF_11/2017","UN",30,null,null,null,""]
["S",3,"S",0,1,4,1,0,0,0,0,"","Serviço","Serviço","1.4.1.0.28.","AGETOP",71110,"CRUZETA POLIMÉRICA 90X112X2400 MM","Un    ",4,null,null,null,""]
["S",3,"S",0,1,4,1,0,0,0,0,"","Serviço","Serviço","1.4.1.0.29.","COMPOSIÇÃO","COMP 375_SEE","REFLETOR DE LED HOLOFORTE 50W","UN ",12,null,null,null,""]
["S",3,"S",0,1,4,1,0,0,{"$f":"IF(OR($C83=\"S\",$C83=0),0,MATCH(0,OFFSET($D83,1,$C83,ROW($C$377)-ROW($C83)),0))","v":0},{"$f":"IF(OR($C83=\"S\",$C83=0),0,MATCH(OFFSET($D83,0,$C83)+1,OFFSET($D83,1,$C83,ROW($C$377)-ROW($C83)),0))","v":0},"","Serviço","Serviço","1.4.1.0.30.","AGETOP",72001,"POSTE DE CONCRETO DT 10/300 - SEM FUNDAÇÃO/CONCRETO","Un    ",4,null,null,null,""]
["S",3,"S",0,1,4,1,0,0,0,0,"","Serviço","Serviço","1.4.1.0.31.","AGETOP",71765,"MAO FRANCESA PLANA DE ACO GALVANIZADO 726 MM","Un    ",8,null,null,null,""]
["S",3,"S",0,1,4,1,0,0,0,0,"","Serviço","Serviço","1.4.1.0.32.","AGETOP",71835,"PARAFUSO CABEÇA ABAULADA (FRANCES) M16 X 45 MM","Un    ",12,null,null,null,""]
["S",3,"S",0,1,4,1,0,0,0,0,"","Serviço","Serviço","1.4.1.0.33.","AGETOP",71837,"PARAFUSO CABEÇA ABAULADA (FRANCES) M16 X 70 MM","un    ",4,null,null,null,""]
["S",3,"S",0,1,4,1,0,0,0,0,"","Serviço","Serviço","1.4.1.0.34.","SINAPI",91884,"LUVA PARA ELETRODUTO, PVC, ROSCÁVEL, DN 25 MM (3/4\"), PARA CIRCUITOS TERMINAIS, INSTALADA EM PAREDE - FORNECIMENTO E INSTALAÇÃO. AF_12/2015","UN",200,null,null,null,"Referência: AGETOP - 71741"]
["S",3,"S",0,1,4,1,0,0,0,0,"","Serviço","Serviço","1.4.1.0.35.","SINAPI",91885,"LUVA PARA ELETRODUTO, PVC, ROSCÁVEL, DN 32 MM (1\"), PARA CIRCUITOS TERMINAIS, INSTALADA EM PAREDE - FORNECIMENTO E INSTALAÇÃO. AF_12/2015","UN",65,null,null,null,"Referência: AGETOP - 71742"]
["S",3,"S",0,1,4,1,0,0,0,0,"","Serviço","Serviço","1.4.1.0.36.","SINAPI",91992,"TOMADA ALTA DE EMBUTIR (1 MÓDULO), 2P+T 10 A, INCLUINDO SUPORTE E PLACA - FORNECIMENTO E INSTALAÇÃO. AF_12/2015","UN",18,null,null,null,""]
["S",3,"S",0,1,4,1,0,0,0,0,"","Serviço","Serviço","1.4.1.0.37.","SINAPI",91993,"TOMADA ALTA DE EMBUTIR (1 MÓDULO), 2P+T 20 A, INCLUINDO SUPORTE E PLACA - FORNECIMENTO E INSTALAÇÃO. AF_12/2015","UN",2,null,null,null,"Referência: AGETOP - 72585"]
["S",3,"S",0,1,4,1,0,0,0,0,"","Serviço","Serviço","1.4.1.0.38.","SINAPI",97599,"LUMINÁRIA DE EMERGÊNCIA - FORNECIMENTO E INSTALAÇÃO. AF_11/2017","UN",18,null,null,null,""]
["S",3,"S",0,1,4,1,0,0,0,0,"","Serviço","Serviço","1.4.1.0.39.","SINAPI",83463,"QUADRO DE DISTRIBUICAO DE ENERGIA EM CHAPA DE ACO GALVANIZADO, PARA 12 DISJUNTORES TERMOMAGNETICOS MONOPOLARES, COM BARRAMENTO TRIFASICO E NEUTRO - FORNECIMENTO E INSTALACAO","UN",1,null,null,null,""]
[{"$f":"CHOOSE(1+LOG(1+2*(ORÇAMENTO.Nivel=\"Nível 1\")+4*(ORÇAMENTO.Nivel=\"Nível 2\")+8*(ORÇAMENTO.Nivel=\"Nível 3\")+16*(ORÇAMENTO.Nivel=\"Nível 4\")+32*(ORÇAMENTO.Nivel=\"Serviço\"),2),0,1,2,3,4,\"S\")","v":3},{"$f":"IF(OR(C93=\"s\",C93=0),OFFSET(B93,-1,0),C93)","v":3},{"$f":"IF(OFFSET(C93,-1,0)=\"L\",1,IF(OFFSET(C93,-1,0)=1,2,IF(OR(A93=\"s\",A93=0),\"S\",IF(AND(OFFSET(C93,-1,0)=2,A93=4),3,IF(AND(OR(OFFSET(C93,-1,0)=\"s\",OFFSET(C93,-1,0)=0),A93<>\"s\",A93>OFFSET(B93,-1,0)),OFFSET(B93,-1,0),A93)))))","v":3},{"$f":"IF(OR(C93=\"S\",C93=0),0,IF(ISERROR(K93),J93,SMALL(J93:K93,1)))","v":15},{"$f":"IF($C93=1,OFFSET(E93,-1,0)+1,OFFSET(E93,-1,0))","v":1},{"$f":"IF($C93=1,0,IF($C93=2,OFFSET(F93,-1,0)+1,OFFSET(F93,-1,0)))","v":4},{"$f":"IF(AND($C93<=2,$C93<>0),0,IF($C93=3,OFFSET(G93,-1,0)+1,OFFSET(G93,-1,0)))","v":2},{"$f":"IF(AND($C93<=3,$C93<>0),0,IF($C93=4,OFFSET(H93,-1,0)+1,OFFSET(H93,-1,0)))","v":0},{"$f":"IF(AND($C93<=4,$C93<>0),0,IF(AND($C93=\"S\",$W93>0),OFFSET(I93,-1,0)+1,OFFSET(I93,-1,0)))","v":0},47,15,{"$f":"IF(OR(W93>0,$C93=1),\"F\",\"\")","v":""},"Nível 3",{"$f":"CHOOSE(1+LOG(1+2*(C93=1)+4*(C93=2)+8*(C93=3)+16*(C93=4)+32*(C93=\"S\"),2),\"\",\"Nível 1\",\"Nível 2\",\"Nível 3\",\"Nível 4\",\"Serviço\")","v":"Nível 3"},"1.4.2.","AGETOP",null,"QUADRO DE COMANDO DE MOTORES, RESERV. ENTERRADO","-",null,null,null,null,""]
["S",3,"S",0,1,4,2,0,0,0,0,"","Serviço","Serviço","1.4.2.0.1.","AGETOP",70700,"CAIXA PARA QUADRO DE COMANDO METÁLICA DE SOBREPOR 40X30X20 CM","Un    ",1,null,null,null,""]
["S",3,"S",0,1,4,2,0,0,0,0,"","Serviço","Serviço","1.4.2.0.2.","COMPOSIÇÃO","COMP 544_SEE","RELE DE NÍVEL","UN ",1,null,null,null,""]
["S",3,"S",0,1,4,2,0,0,0,0,"","Serviço","Serviço","1.4.2.0.3.","AGETOP",70305,"BOTOEIRA \"LIGA-DESLIGA\" P/INST.EM PORTA  DE QUADRO","Un    ",3,null,null,null,""]
["S",3,"S",0,1,4,2,0,0,0,0,"","Serviço","Serviço","1.4.2.0.4.","AGETOP",70837,"CH.PARTIDA DE MOTOR TRIF.C/RELE FALTA DE FASE 1 CV","Un    ",2,null,null,null,""]
["S",3,"S",0,1,4,2,0,0,0,0,"","Serviço","Serviço","1.4.2.0.5.","SINAPI",93671,"DISJUNTOR TRIPOLAR TIPO DIN, CORRENTE NOMINAL DE 32A - FORNECIMENTO E INSTALAÇÃO. AF_04/2016","UN",3,null,null,null,"Referência: AGETOP - 71173"]
["S",3,"S",0,1,4,2,0,0,0,0,"","Serviço","Serviço","1.4.2.0.6.","SINAPI",93670,"DISJUNTOR TRIPOLAR TIPO DIN, CORRENTE NOMINAL DE 25A - FORNECIMENTO E INSTALAÇÃO. AF_04/2016","UN",1,null,null,null,"Referência: AGETOP - 71173"]
["S",3,"S",0,1,4,2,0,0,0,0,"","Serviço","Serviço","1.4.2.0.7.","AGETOP",70286,"BORNE TERMINAL SAK 4 MM2","Un    ",4,null,null,null,""]
["S",3,"S",0,1,4,2,0,0,0,0,"","Serviço","Serviço","1.4.2.0.8.","AGETOP",70288,"BORNE TERMINAL SAK 10 MM2","Un    ",8,null,null,null,""]
["S",3,"S",0,1,4,2,0,0,0,0,"","Serviço","Serviço","1.4.2.0.9.","AGETOP",71184,"DISPOSITIVO DE PROTEÇÃO CONTRA SURTOS (D.P.S.) 275V DE 8 A 40KA","Un    ",4,null,null,null,""]
["S",3,"S",0,1,4,2,0,0,0,0,"","Serviço","Serviço","1.4.2.0.10.","SINAPI",88547,"CHAVE DE BOIA AUTOMÁTICA SUPERIOR 10A/250V - FORNECIMENTO E INSTALACAO","UN",1,null,null,null,""]
["S",3,"S",0,1,4,2,0,0,0,0,"","Serviço","Serviço","1.4.2.0.11.","AGETOP",70893,"CHAVE TRIPOLAR TIPO PACCO 40A","Un    ",2,null,null,null,""]
[{"$f":"CHOOSE(1+LOG(1+2*(ORÇAMENTO.Nivel=\"Nível 1\")+4*(ORÇAMENTO.Nivel=\"Nível 2\")+8*(ORÇAMENTO.Nivel=\"Nível 3\")+16*(ORÇAMENTO.Nivel=\"Nível 4\")+32*(ORÇAMENTO.Nivel=\"Serviço\"),2),0,1,2,3,4,\"S\")","v":"S"},{"$f":"IF(OR(C105=\"s\",C105=0),OFFSET(B105,-1,0),C105)","v":3},{"$f":"IF(OFFSET(C105,-1,0)=\"L\",1,IF(OFFSET(C105,-1,0)=1,2,IF(OR(A105=\"s\",A105=0),\"S\",IF(AND(OFFSET(C105,-1,0)=2,A105=4),3,IF(AND(OR(OFFSET(C105,-1,0)=\"s\",OFFSET(C105,-1,0)=0),A105<>\"s\",A105>OFFSET(B105,-1,0)),OFFSET(B105,-1,0),A105)))))","v":"S"},{"$f":"IF(OR(C105=\"S\",C105=0),0,IF(ISERROR(K105),J105,SMALL(J105:K105,1)))","v":0},{"$f":"IF($C105=1,OFFSET(E105,-1,0)+1,OFFSET(E105,-1,0))","v":1},{"$f":"IF($C105=1,0,IF($C105=2,OFFSET(F105,-1,0)+1,OFFSET(F105,-1,0)))","v":4},{"$f":"IF(AND($C105<=2,$C105<>0),0,IF($C105=3,OFFSET(G105,-1,0)+1,OFFSET(G105,-1,0)))","v":2},{"$f":"IF(AND($C105<=3,$C105<>0),0,IF($C105=4,OFFSET(H105,-1,0)+1,OFFSET(H105,-1,0)))","v":0},{"$f":"IF(AND($C105<=4,$C105<>0),0,IF(AND($C105=\"S\",$W105>0),OFFSET(I105,-1,0)+1,OFFSET(I105,-1,0)))","v":0},0,0,{"$f":"IF(OR(W105>0,$C105=1),\"F\",\"\")","v":""},"Serviço",{"$f":"CHOOSE(1+LOG(1+2*(C105=1)+4*(C105=2)+8*(C105=3)+16*(C105=4)+32*(C105=\"S\"),2),\"\",\"Nível 1\",\"Nível 2\",\"Nível 3\",\"Nível 4\",\"Serviço\")","v":"Serviço"},"1.4.2.0.12.","AGETOP",81894,"CHAVE DE BOIA AUTOMÁTICA - 15A/250V ","un    ",1,null,null,null,""]
["S",3,"S",0,1,4,2,0,0,0,0,"","Serviço","Serviço","1.4.2.0.13.","AGETOP",70561,"CABO ISOLADO PP 3 X 2,5 MM2","M     ",30,null,null,null,""]
["S",3,"S",0,1,4,2,0,0,0,0,"","Serviço","Serviço","1.4.2.0.14.","AGETOP",71064,"CONTATOR 3 TF 44 - 32A","Un    ",2,null,null,null,""]
[3,3,3,19,1,4,3,0,0,32,19,"","Nível 3","Nível 3","1.4.3.","AGETOP",null,"QUADRO DE COMANDO DE MOTORES, INCÊNDIO 12,5CV","-",null,null,null,null,""]
["S",3,"S",0,1,4,3,0,0,0,0,"","Serviço","Serviço","1.4.3.0.1.","AGETOP",70700,"CAIXA PARA QUADRO DE COMANDO METÁLICA DE SOBREPOR 40X30X20 CM","Un    ",1,null,null,null,""]
["S",3,"S",0,1,4,3,0,0,0,0,"","Serviço","Serviço","1.4.3.0.2.","AGETOP",70424,"BUCHA E ARRUELA METALICA DIAM. 1.1/2\"","PR    ",4,null,null,null,""]
["S",3,"S",0,1,4,3,0,0,0,0,"","Serviço","Serviço","1.4.3.0.3.","COMPOSIÇÃO","COMP 544_SEE","RELE DE NÍVEL","UN ",1,null,null,null,""]
["S",3,"S",0,1,4,3,0,0,0,0,"","Serviço","Serviço","1.4.3.0.4.","AGETOP",70305,"BOTOEIRA \"LIGA-DESLIGA\" P/INST.EM PORTA  DE QUADRO","Un    ",1,null,null,null,""]
["S",3,"S",0,1,4,3,0,0,0,0,"","Serviço","Serviço","1.4.3.0.5.","AGETOP",70777,"CH.PARTIDA MOTOR TRIF.C/RELE DE FALTA DE FASE 10CV","Un    ",1,null,null,null,""]
["S",3,"S",0,1,4,3,0,0,0,0,"","Serviço","Serviço","1.4.3.0.6.","SINAPI",93672,"DISJUNTOR TRIPOLAR TIPO DIN, CORRENTE NOMINAL DE 40A - FORNECIMENTO E INSTALAÇÃO. AF_04/2016","UN",2,null,null,null,"Referência: AGETOP - 71174"]
["S",3,"S",0,1,4,3,0,0,0,0,"","Serviço","Serviço","1.4.3.0.7.","SINAPI",93655,"DISJUNTOR MONOPOLAR TIPO DIN, CORRENTE NOMINAL DE 20A - FORNECIMENTO E INSTALAÇÃO. AF_04/2016","UN",3,null,null,null,""]
["S",3,"S",0,1,4,3,0,0,0,0,"","Serviço","Serviço","1.4.3.0.8.","AGETOP",71184,"DISPOSITIVO DE PROTEÇÃO CONTRA SURTOS (D.P.S.) 275V DE 8 A 40KA","Un    ",4,null,null,null,""]
["S",3,"S",0,1,4,3,0,0,0,0,"","Serviço","Serviço","1.4.3.0.9.","AGETOP",71064,"CONTATOR 3 TF 44 - 32A","Un    ",2,null,null,null,""]
["S",3,"S",0,1,4,3,0,0,0,0,"","Serviço","Serviço","1.4.3.0.10.","AGETOP",70893,"CHAVE TRIPOLAR TIPO PACCO 40A","Un    ",1,null,null,null,""]
[{"$f":"CHOOSE(1+LOG(1+2*(ORÇAMENTO.Nivel=\"Nível 1\")+4*(ORÇAMENTO.Nivel=\"Nível 2\")+8*(ORÇAMENTO.Nivel=\"Nível 3\")+16*(ORÇAMENTO.Nivel=\"Nível 4\")+32*(ORÇAMENTO.Nivel=\"Serviço\"),2),0,1,2,3,4,\"S\")","v":"S"},{"$f":"IF(OR(C119=\"s\",C119=0),OFFSET(B119,-1,0),C119)","v":3},{"$f":"IF(OFFSET(C119,-1,0)=\"L\",1,IF(OFFSET(C119,-1,0)=1,2,IF(OR(A119=\"s\",A119=0),\"S\",IF(AND(OFFSET(C119,-1,0)=2,A119=4),3,IF(AND(OR(OFFSET(C119,-1,0)=\"s\",OFFSET(C119,-1,0)=0),A119<>\"s\",A119>OFFSET(B119,-1,0)),OFFSET(B119,-1,0),A119)))))","v":"S"},{"$f":"IF(OR(C119=\"S\",C119=0),0,IF(ISERROR(K119),J119,SMALL(J119:K119,1)))","v":0},{"$f":"IF($C119=1,OFFSET(E119,-1,0)+1,OFFSET(E119,-1,0))","v":1},{"$f":"IF($C119=1,0,IF($C119=2,OFFSET(F119,-1,0)+1,OFFSET(F119,-1,0)))","v":4},{"$f":"IF(AND($C119<=2,$C119<>0),0,IF($C119=3,OFFSET(G119,-1,0)+1,OFFSET(G119,-1,0)))","v":3},{"$f":"IF(AND($C119<=3,$C119<>0),0,IF($C119=4,OFFSET(H119,-1,0)+1,OFFSET(H119,-1,0)))","v":0},{"$f":"IF(AND($C119<=4,$C119<>0),0,IF(AND($C119=\"S\",$W119>0),OFFSET(I119,-1,0)+1,OFFSET(I119,-1,0)))","v":0},0,0,{"$f":"IF(OR(W119>0,$C119=1),\"F\",\"\")","v":""},"Serviço",{"$f":"CHOOSE(1+LOG(1+2*(C119=1)+4*(C119=2)+8*(C119=3)+16*(C119=4)+32*(C119=\"S\"),2),\"\",\"Nível 1\",\"Nível 2\",\"Nível 3\",\"Nível 4\",\"Serviço\")","v":"Serviço"},"1.4.3.0.11.","AGETOP",81894,"CHAVE DE BOIA AUTOMÁTICA - 15A/250V ","un    ",2,null,null,null,""]
["S",3,"S",0,1,4,3,0,0,0,0,"","Serviço","Serviço","1.4.3.0.12.","AGETOP",70561,"CABO ISOLADO PP 3 X 2,5 MM2","M     ",20,null,null,null,""]
["S",{"$f":"IF(OR(C121=\"s\",C121=0),OFFSET(B121,-1,0),C121)","v":3},{"$f":"IF(OFFSET(C121,-1,0)=\"L\",1,IF(OFFSET(C121,-1,0)=1,2,IF(OR(A121=\"s\",A121=0),\"S\",IF(AND(OFFSET(C121,-1,0)=2,A121=4),3,IF(AND(OR(OFFSET(C121,-1,0)=\"s\",OFFSET(C121,-1,0)=0),A121<>\"s\",A121>OFFSET(B121,-1,0)),OFFSET(B121,-1,0),A121)))))","v":"S"},{"$f":"IF(OR(C121=\"S\",C121=0),0,IF(ISERROR(K121),J121,SMALL(J121:K121,1)))","v":0},{"$f":"IF($C121=1,OFFSET(E121,-1,0)+1,OFFSET(E121,-1,0))","v":1},{"$f":"IF($C121=1,0,IF($C121=2,OFFSET(F121,-1,0)+1,OFFSET(F121,-1,0)))","v":4},{"$f":"IF(AND($C121<=2,$C121<>0),0,IF($C121=3,OFFSET(G121,-1,0)+1,OFFSET(G121,-1,0)))","v":3},{"$f":"IF(AND($C121<=3,$C121<>0),0,IF($C121=4,OFFSET(H121,-1,0)+1,OFFSET(H121,-1,0)))","v":0},{"$f":"IF(AND($C121<=4,$C121<>0),0,IF(AND($C121=\"S\",$W121>0),OFFSET(I121,-1,0)+1,OFFSET(I121,-1,0)))","v":0},0,0,{"$f":"IF(OR(W121>0,$C121=1),\"F\",\"\")","v":""},"Serviço",{"$f":"CHOOSE(1+LOG(1+2*(C121=1)+4*(C121=2)+8*(C121=3)+16*(C121=4)+32*(C121=\"S\"),2),\"\",\"Nível 1\",\"Nível 2\",\"Nível 3\",\"Nível 4\",\"Serviço\")","v":"Serviço"},"1.4.3.0.13.","AGETOP",71184,"DISPOSITIVO DE PROTEÇÃO CONTRA SURTOS (D.P.S.) 275V DE 8 A 40KA","Un    ",4,null,null,null,""]
["S",3,"S",0,1,4,3,0,0,0,0,"","Serviço","Serviço","1.4.3.0.14.","AGETOP",70288,"BORNE TERMINAL SAK 10 MM2","Un    ",4,null,null,null,""]
["S",3,"S",0,1,4,3,0,0,0,0,"","Serviço","Serviço","1.4.3.0.15.","SINAPI",92980,"CABO DE COBRE FLEXÍVEL ISOLADO, 10 MM², ANTI-CHAMA 0,6/1,0 KV, PARA DISTRIBUIÇÃO - FORNECIMENTO E INSTALAÇÃO. AF_12/2015","M",520,null,null,null,""]
["S",3,"S",0,1,4,3,0,0,0,0,"","Serviço","Serviço","1.4.3.0.16.","AGETOP",71203,"ELETRODUTO DE PVC RIGIDO DIAMETRO 1.1/2\"","M     ",100,null,null,null,""]
["S",3,"S",0,1,4,3,0,0,0,0,"","Serviço","Serviço","1.4.3.0.17.","AGETOP",71744,"LUVA PVC ROSQUEAVEL DIAMETRO 1.1/2\"","Un    ",50,null,null,null,""]
["S",3,"S",0,1,4,3,0,0,0,0,"","Serviço","Serviço","1.4.3.0.18.","AGETOP",71144,"CURVA DE 90 GRAUS DE PVC RIGIDO DIAM. 1.1/2\"","Un    ",12,null,null,null,""]
[3,3,3,13,1,4,4,0,0,13,179,"","Nível 3","Nível 3","1.4.4.",null,null,"CIRC. DE COMANDO E ACIONAMENTO SISTEMA DE COMB. A INCÊNDIO","-",null,null,null,null,""]
["S",3,"S",0,1,4,4,0,0,0,0,"","Serviço","Serviço","1.4.4.0.1.","AGETOP",91043,"BRAÇADEIRA METALICA TIPO \"D\" DIAM. 3/4\"","Un    ",130,null,null,null,""]
["S",3,"S",0,1,4,4,0,0,0,0,"","Serviço","Serviço","1.4.4.0.2.","AGETOP",70421,"BUCHA E ARRUELA METALICA DIAM. 3/4\"","PR    ",10,null,null,null,""]
["S",3,"S",0,1,4,4,0,0,0,0,"","Serviço","Serviço","1.4.4.0.3.","AGETOP",70556,"CABO FLEXIVEL PARALELO 2 X 2,5 MM2","M     ",600,null,null,null,""]
["S",3,"S",0,1,4,4,0,0,0,0,"","Serviço","Serviço","1.4.4.0.4.","AGETOP",71201,"ELETRODUTO DE PVC RIGIDO DIAMETRO 3/4\"","M     ",200,null,null,null,""]
["S",3,"S",0,1,4,4,0,0,0,0,"","Serviço","Serviço","1.4.4.0.5.","AGETOP",70924,"CONDULETE DE PVC - CAIXA COM 5 ENTRADAS ","un    ",21,null,null,null,""]
["S",3,"S",0,1,4,4,0,0,0,0,"","Serviço","Serviço","1.4.4.0.6.","AGETOP",70925,"CONDULETE DE PVC - ADAPTADOR DE SAÍDA 3/4\"  ","un    ",63,null,null,null,""]
["S",3,"S",0,1,4,4,0,0,0,0,"","Serviço","Serviço","1.4.4.0.7.","AGETOP",71251,"ELETRODUTO EM AÇO ZINCADO DIÂMETRO 3/4\"","M     ",33,null,null,null,""]
["S",3,"S",0,1,4,4,0,0,0,0,"","Serviço","Serviço","1.4.4.0.8.","AGETOP",71701,"LUVA EM AÇO GALVANIZADO DIÂMETRO 3/4\"","Un    ",11,null,null,null,""]
["S",3,"S",0,1,4,4,0,0,0,0,"","Serviço","Serviço","1.4.4.0.9.","AGETOP",71862,"PARAFUSO P/BUCHA S-8","Un    ",130,null,null,null,""]
[{"$f":"CHOOSE(1+LOG(1+2*(ORÇAMENTO.Nivel=\"Nível 1\")+4*(ORÇAMENTO.Nivel=\"Nível 2\")+8*(ORÇAMENTO.Nivel=\"Nível 3\")+16*(ORÇAMENTO.Nivel=\"Nível 4\")+32*(ORÇAMENTO.Nivel=\"Serviço\"),2),0,1,2,3,4,\"S\")","v":"S"},3,"S",0,1,4,4,0,0,0,0,"","Serviço","Serviço","1.4.4.0.10.","AGETOP",70392,"BUCHA DE NYLON S-8","Un    ",130,null,null,null,""]
[{"$f":"CHOOSE(1+LOG(1+2*(ORÇAMENTO.Nivel=\"Nível 1\")+4*(ORÇAMENTO.Nivel=\"Nível 2\")+8*(ORÇAMENTO.Nivel=\"Nível 3\")+16*(ORÇAMENTO.Nivel=\"Nível 4\")+32*(ORÇAMENTO.Nivel=\"Serviço\"),2),0,1,2,3,4,\"S\")","v":"S"},{"$f":"IF(OR(C138=\"s\",C138=0),OFFSET(B138,-1,0),C138)","v":3},{"$f":"IF(OFFSET(C138,-1,0)=\"L\",1,IF(OFFSET(C138,-1,0)=1,2,IF(OR(A138=\"s\",A138=0),\"S\",IF(AND(OFFSET(C138,-1,0)=2,A138=4),3,IF(AND(OR(OFFSET(C138,-1,0)=\"s\",OFFSET(C138,-1,0)=0),A138<>\"s\",A138>OFFSET(B138,-1,0)),OFFSET(B138,-1,0),A138)))))","v":"S"},{"$f":"IF(OR(C138=\"S\",C138=0),0,IF(ISERROR(K138),J138,SMALL(J138:K138,1)))","v":0},{"$f":"IF($C138=1,OFFSET(E138,-1,0)+1,OFFSET(E138,-1,0))","v":1},{"$f":"IF($C138=1,0,IF($C138=2,OFFSET(F138,-1,0)+1,OFFSET(F138,-1,0)))","v":4},{"$f":"IF(AND($C138<=2,$C138<>0),0,IF($C138=3,OFFSET(G138,-1,0)+1,OFFSET(G138,-1,0)))","v":4},{"$f":"IF(AND($C138<=3,$C138<>0),0,IF($C138=4,OFFSET(H138,-1,0)+1,OFFSET(H138,-1,0)))","v":0},{"$f":"IF(AND($C138<=4,$C138<>0),0,IF(AND($C138=\"S\",$W138>0),OFFSET(I138,-1,0)+1,OFFSET(I138,-1,0)))","v":0},0,0,{"$f":"IF(OR(W138>0,$C138=1),\"F\",\"\")","v":""},"Serviço",{"$f":"CHOOSE(1+LOG(1+2*(C138=1)+4*(C138=2)+8*(C138=3)+16*(C138=4)+32*(C138=\"S\"),2),\"\",\"Nível 1\",\"Nível 2\",\"Nível 3\",\"Nível 4\",\"Serviço\")","v":"Serviço"},"1.4.4.0.11.","SINAPI",100556,"CAIXA DE PASSAGEM PARA TELEFONE 15X15X10CM (SOBREPOR), FORNECIMENTO E INSTALACAO. AF_11/2019","UN",1,null,null,null,""]
[{"$f":"CHOOSE(1+LOG(1+2*(ORÇAMENTO.Nivel=\"Nível 1\")+4*(ORÇAMENTO.Nivel=\"Nível 2\")+8*(ORÇAMENTO.Nivel=\"Nível 3\")+16*(ORÇAMENTO.Nivel=\"Nível 4\")+32*(ORÇAMENTO.Nivel=\"Serviço\"),2),0,1,2,3,4,\"S\")","v":"S"},{"$f":"IF(OR(C139=\"s\",C139=0),OFFSET(B139,-1,0),C139)","v":3},{"$f":"IF(OFFSET(C139,-1,0)=\"L\",1,IF(OFFSET(C139,-1,0)=1,2,IF(OR(A139=\"s\",A139=0),\"S\",IF(AND(OFFSET(C139,-1,0)=2,A139=4),3,IF(AND(OR(OFFSET(C139,-1,0)=\"s\",OFFSET(C139,-1,0)=0),A139<>\"s\",A139>OFFSET(B139,-1,0)),OFFSET(B139,-1,0),A139)))))","v":"S"},{"$f":"IF(OR(C139=\"S\",C139=0),0,IF(ISERROR(K139),J139,SMALL(J139:K139,1)))","v":0},{"$f":"IF($C139=1,OFFSET(E139,-1,0)+1,OFFSET(E139,-1,0))","v":1},{"$f":"IF($C139=1,0,IF($C139=2,OFFSET(F139,-1,0)+1,OFFSET(F139,-1,0)))","v":4},{"$f":"IF(AND($C139<=2,$C139<>0),0,IF($C139=3,OFFSET(G139,-1,0)+1,OFFSET(G139,-1,0)))","v":4},{"$f":"IF(AND($C139<=3,$C139<>0),0,IF($C139=4,OFFSET(H139,-1,0)+1,OFFSET(H139,-1,0)))","v":0},{"$f":"IF(AND($C139<=4,$C139<>0),0,IF(AND($C139=\"S\",$W139>0),OFFSET(I139,-1,0)+1,OFFSET(I139,-1,0)))","v":0},0,0,{"$f":"IF(OR(W139>0,$C139=1),\"F\",\"\")","v":""},"Serviço",{"$f":"CHOOSE(1+LOG(1+2*(C139=1)+4*(C139=2)+8*(C139=3)+16*(C139=4)+32*(C139=\"S\"),2),\"\",\"Nível 1\",\"Nível 2\",\"Nível 3\",\"Nível 4\",\"Serviço\")","v":"Serviço"},"1.4.4.0.12.","AGETOP",72080,"POSTE/TRAFO - CAMINHÃO MUNCK 12 TON. (MÍNIMO 4H/DIA)","H     ",8,null,null,null,""]
[2,2,2,48,1,5,0,0,0,211,48,"","Nível 2","Nível 2","1.5.","AGETOP",null,"INSTALAÇÕES HIDROSSANITÁRIAS","-",null,null,null,null,""]
[3,3,3,10,1,5,1,0,0,47,10,"","Nível 3","Nível 3","1.5.1.","SINAPI",null,"PEÇAS E ACESSÓRIOS","-",null,null,null,null,""]
[4,4,4,7,1,5,1,1,0,9,7,"","Nível 4","Nível 4","1.5.1.1.","SINAPI",null,"LAVATÓRIO E ACESSÓRIOS","-",null,null,null,null,""]
["S",4,"S",0,1,5,1,1,0,0,0,"","Serviço","Serviço","1.5.1.1.1.","AGETOP",80542,"LAVATÓRIO MÉDIO SEM COLUNA","Un    ",4,null,null,null,""]
["S",4,"S",0,1,5,1,1,0,0,0,"","Serviço","Serviço","1.5.1.1.2.","AGETOP",80550,"FIXACAO P/LAVATORIO (PAR)","PAR   ",4,null,null,null,""]
["S",4,"S",0,1,5,1,1,0,0,0,"","Serviço","Serviço","1.5.1.1.3.","AGETOP",80556,"LIGAÇÃO FLEXÍVEL PVC DIAM.1/2\" (ENGATE)","Un    ",2,null,null,null,""]
["S",4,"S",0,1,5,1,1,0,0,0,"","Serviço","Serviço","1.5.1.1.4.","SINAPI",86883,"SIFÃO DO TIPO FLEXÍVEL EM PVC 1  X 1.1/2  - FORNECIMENTO E INSTALAÇÃO. AF_01/2020","UN",4,null,null,null,""]
["S",4,"S",0,1,5,1,1,0,{"$f":"IF(OR($C147=\"S\",$C147=0),0,MATCH(0,OFFSET($D147,1,$C147,ROW($C$377)-ROW($C147)),0))","v":0},{"$f":"IF(OR($C147=\"S\",$C147=0),0,MATCH(OFFSET($D147,0,$C147)+1,OFFSET($D147,1,$C147,ROW($C$377)-ROW($C147)),0))","v":0},"","Serviço","Serviço","1.5.1.1.5.","SINAPI",86915,"TORNEIRA CROMADA DE MESA, 1/2\u0094 OU 3/4\u0094, PARA LAVATÓRIO, PADRÃO MÉDIO - FORNECIMENTO E INSTALAÇÃO. AF_01/2020","UN",2,null,null,null,"Referência: AGETOP - 80570"]
["S",4,"S",0,1,5,1,1,0,0,0,"","Serviço","Serviço","1.5.1.1.6.","SINAPI",86877,"VÁLVULA EM METAL CROMADO 1.1/2\u0094 X 1.1/2\u0094 PARA TANQUE OU LAVATÓRIO, COM OU SEM LADRÃO - FORNECIMENTO E INSTALAÇÃO. AF_01/2020","UN",4,null,null,null,"Referência: AGETOP - 80580"]
[4,4,4,2,1,5,1,2,0,2,8,"","Nível 4","Nível 4","1.5.1.2.","SINAPI",null,"REGISTROS","-",null,null,null,null,""]
["S",4,"S",0,1,5,1,2,0,0,0,"","Serviço","Serviço","1.5.1.2.1.","SINAPI",89986,"REGISTRO DE GAVETA BRUTO, LATÃO, ROSCÁVEL, 1/2\", COM ACABAMENTO E CANOPLA CROMADOS. FORNECIDO E INSTALADO EM RAMAL DE ÁGUA. AF_12/2014","UN",2,null,null,null,"Referência: AGETOP - 80925"]
[3,3,3,18,1,5,2,0,0,37,18,"","Nível 3","Nível 3","1.5.2.","SINAPI",null,"ÁGUA FRIA","-",null,null,null,null,""]
[4,4,4,3,1,5,2,1,0,17,3,"","Nível 4","Nível 4","1.5.2.1.","SINAPI",null,"TUBOS DE PVC SOLDÁVEL","-",null,null,null,null,""]
["S",4,"S",0,1,5,2,1,0,0,0,"","Serviço","Serviço","1.5.2.1.1.","SINAPI",89402,"TUBO, PVC, SOLDÁVEL, DN 25MM, INSTALADO EM RAMAL DE DISTRIBUIÇÃO DE ÁGUA - FORNECIMENTO E INSTALAÇÃO. AF_12/2014","M",12,null,null,null,"Referência: AGETOP - 81003"]
["S",4,"S",0,1,5,2,1,0,0,0,"","Serviço","Serviço","1.5.2.1.2.","SINAPI",89447,"TUBO, PVC, SOLDÁVEL, DN 32MM, INSTALADO EM PRUMADA DE ÁGUA - FORNECIMENTO E INSTALAÇÃO. AF_12/2014","M",60,null,null,null,""]
[4,4,4,2,1,5,2,2,0,14,2,"","Nível 4","Nível 4","1.5.2.2.","SINAPI",null,"ADAPTADORES DE PVC SOLDÁVEL","-",null,null,null,null,""]
["S",4,"S",0,1,5,2,2,0,0,0,"","Serviço","Serviço","1.5.2.2.1.","SINAPI",89553,"ADAPTADOR CURTO COM BOLSA E ROSCA PARA REGISTRO, PVC, SOLDÁVEL, DN 32MM X 1\u0094, INSTALADO EM PRUMADA DE ÁGUA - FORNECIMENTO E INSTALAÇÃO. AF_12/2014","UN",4,null,null,null,"Referência: AGETOP - 81067"]
[4,4,4,3,1,5,2,3,0,12,3,"","Nível 4","Nível 4","1.5.2.3.","SINAPI",null,"LUVAS DE PVC","-",null,null,null,null,""]
["S",4,"S",0,1,5,2,3,0,0,0,"","Serviço","Serviço","1.5.2.3.1.","SINAPI",89434,"LUVA SOLDÁVEL E COM ROSCA, PVC, SOLDÁVEL, DN 32MM X 1\u0094, INSTALADO EM RAMAL DE DISTRIBUIÇÃO DE ÁGUA - FORNECIMENTO E INSTALAÇÃO. AF_12/2014","UN",1,null,null,null,""]
["S",4,"S",0,1,5,2,3,0,0,0,"","Serviço","Serviço","1.5.2.3.2.","SINAPI",89541,"LUVA, PVC, SOLDÁVEL, DN 32MM, INSTALADO EM PRUMADA DE ÁGUA - FORNECIMENTO E INSTALAÇÃO. AF_12/2014","UN",1,null,null,null,""]
[4,4,4,3,1,5,2,4,0,9,3,"","Nível 4","Nível 4","1.5.2.4.","SINAPI",null,"JOELHO","-",null,null,null,null,""]
["S",4,"S",0,1,5,2,4,0,0,0,"","Serviço","Serviço","1.5.2.4.1.","SINAPI",89481,"JOELHO 90 GRAUS, PVC, SOLDÁVEL, DN 25MM, INSTALADO EM PRUMADA DE ÁGUA - FORNECIMENTO E INSTALAÇÃO. AF_12/2014","UN",5,null,null,null,""]
["S",4,"S",0,1,5,2,4,0,0,0,"","Serviço","Serviço","1.5.2.4.2.","SINAPI",89413,"JOELHO 90 GRAUS, PVC, SOLDÁVEL, DN 32MM, INSTALADO EM RAMAL DE DISTRIBUIÇÃO DE ÁGUA - FORNECIMENTO E INSTALAÇÃO. AF_12/2014","UN",2,null,null,null,"Referência: AGETOP - 81322"]
[4,4,4,3,1,5,2,5,0,6,3,"","Nível 4","Nível 4","1.5.2.5.","SINAPI",null,"TÊ","-",null,null,null,null,""]
["S",4,"S",0,1,5,2,5,0,0,0,"","Serviço","Serviço","1.5.2.5.1.","SINAPI",89617,"TE, PVC, SOLDÁVEL, DN 25MM, INSTALADO EM PRUMADA DE ÁGUA - FORNECIMENTO E INSTALAÇÃO. AF_12/2014","UN",5,null,null,null,""]
["S",4,"S",0,1,5,2,5,0,0,0,"","Serviço","Serviço","1.5.2.5.2.","SINAPI",89443,"TE, PVC, SOLDÁVEL, DN 32MM, INSTALADO EM RAMAL DE DISTRIBUIÇÃO DE ÁGUA - FORNECIMENTO E INSTALAÇÃO. AF_12/2014","UN",1,null,null,null,"Referência: AGETOP - 81403"]
[4,4,4,3,1,5,2,6,0,3,{"$error":"#N/A"},"","Nível 4","Nível 4","1.5.2.6.","SINAPI",null,"ADESIVOS","-",null,null,null,null,""]
["S",4,"S",0,1,5,2,6,0,0,0,"","Serviço","Serviço","1.5.2.6.1.","AGETOP",81501,"ADESIVO PLASTICO - FRASCO 850 G","Un    ",1,null,null,null,""]
["S",4,"S",0,1,5,2,6,0,0,0,"","Serviço","Serviço","1.5.2.6.2.","AGETOP",81504,"SOLUCAO LIMPADORA 1000 CM3","Un    ",1,null,null,null,""]
[3,3,3,19,1,5,3,0,0,19,133,"","Nível 3","Nível 3","1.5.3.","SINAPI",null,"CONJUNTO MOTO BOMBA","-",null,null,null,null,""]
["S",3,"S",0,1,5,3,0,0,0,0,"","Serviço","Serviço","1.5.3.0.1.","SINAPI",94495,"REGISTRO DE GAVETA BRUTO, LATÃO, ROSCÁVEL, 1\u0094, INSTALADO EM RESERVAÇÃO DE ÁGUA DE EDIFICAÇÃO QUE POSSUA RESERVATÓRIO DE FIBRA/FIBROCIMENTO \u0096 FORNECIMENTO E INSTALAÇÃO. AF_06/2016","UN",2,null,null,null,"Referência: AGETOP - 80903"]
["S",3,"S",0,1,5,3,0,0,0,0,"","Serviço","Serviço","1.5.3.0.2.","SINAPI",94797,"TORNEIRA DE BOIA, ROSCÁVEL, 1\u0094, FORNECIDA E INSTALADA EM RESERVAÇÃO DE ÁGUA. AF_06/2016","UN",1,null,null,null,""]
["S",3,"S",0,1,5,3,0,0,0,0,"","Serviço","Serviço","1.5.3.0.3.","SINAPI",92364,"TUBO DE AÇO GALVANIZADO COM COSTURA, CLASSE MÉDIA, DN 32 (1 1/4\"), CONEXÃO ROSQUEADA, INSTALADO EM REDE DE ALIMENTAÇÃO PARA HIDRANTE - FORNECIMENTO E INSTALAÇÃO. AF_12/2015","M",30,null,null,null,""]
["S",3,"S",0,1,5,3,0,0,0,0,"","Serviço","Serviço","1.5.3.0.4.","AGETOP",85082,"CHAVE DE FLUXO 3/4\"","Un    ",1,null,null,null,""]
["S",3,"S",0,1,5,3,0,0,0,0,"","Serviço","Serviço","1.5.3.0.5.","AGETOP",85076,"VALVULA DE RETENÇÃO HORIZONTAL 1\"","Un    ",1,null,null,null,""]
["S",3,"S",0,1,5,3,0,0,0,0,"","Serviço","Serviço","1.5.3.0.6.","AGETOP",85080,"VALVULA DE RETENÇÃO VERTICAL 1\"","Un    ",1,null,null,null,""]
["S",3,"S",0,1,5,3,0,0,0,0,"","Serviço","Serviço","1.5.3.0.7.","SINAPI",92369,"NIPLE, EM FERRO GALVANIZADO, DN 25 (1\"), CONEXÃO ROSQUEADA, INSTALADO EM REDE DE ALIMENTAÇÃO PARA HIDRANTE - FORNECIMENTO E INSTALAÇÃO. AF_12/2015","UN",7,null,null,null,""]
["S",3,"S",0,1,5,3,0,0,0,0,"","Serviço","Serviço","1.5.3.0.8.","SINAPI",92681,"TÊ, EM FERRO GALVANIZADO, CONEXÃO ROSQUEADA, DN 25 (1\"), INSTALADO EM REDE DE ALIMENTAÇÃO PARA SPRINKLER - FORNECIMENTO E INSTALAÇÃO. AF_12/2015","UN",5,null,null,null,""]
["S",3,"S",0,1,5,3,0,0,0,0,"","Serviço","Serviço","1.5.3.0.9.","AGETOP",85061,"COTOVELO FERRO GALVANIZADO 90º X 1\"","Un    ",2,null,null,null,""]
["S",3,"S",0,1,5,3,0,0,0,0,"","Serviço","Serviço","1.5.3.0.10.","COMPOSIÇÃO","COMP 066_SEE","COTOVELO FERRO GALVANIZADO 90º X 1.1/4\"","UN ",4,null,null,null,""]
["S",3,"S",0,1,5,3,0,0,0,0,"","Serviço","Serviço","1.5.3.0.11.","SINAPI",92893,"UNIÃO, EM FERRO GALVANIZADO, DN 32 (1 1/4\"), CONEXÃO ROSQUEADA, INSTALADO EM REDE DE ALIMENTAÇÃO PARA HIDRANTE - FORNECIMENTO E INSTALAÇÃO. AF_12/2015","UN",2,null,null,null,""]
["S",3,"S",0,1,5,3,0,0,0,0,"","Serviço","Serviço","1.5.3.0.12.","COMPOSIÇÃO","COMP 331_SEE","VALVULA PÉ DE CRIVO 1.1/4\"","UN ",2,null,null,null,""]
["S",3,"S",0,1,5,3,0,0,0,0,"","Serviço","Serviço","1.5.3.0.13.","COMPOSIÇÃO","COMP 071_SEE","UNIÃO COM ASSENTO MACHO FEMEA 1\"","UN ",2,null,null,null,""]
["S",3,"S",0,1,5,3,0,0,0,0,"","Serviço","Serviço","1.5.3.0.14.","COMPOSIÇÃO","COMP 330_SEE","LUVA SIMPLES 1\"","UN ",2,null,null,null,""]
["S",3,"S",0,1,5,3,0,0,0,0,"","Serviço","Serviço","1.5.3.0.15.","COMPOSIÇÃO","COMP 095_SEE","ADAPTADOR PARA MANGOTE 1\"","UN ",4,null,null,null,""]
["S",3,"S",0,1,5,3,0,0,0,0,"","Serviço","Serviço","1.5.3.0.16.","COMPOSIÇÃO","COMP 094_SEE","MANGUEIRA DE BORRACHA PARA ALTA PRESSÃO","M",2,null,null,null,""]
["S",{"$f":"IF(OR(C186=\"s\",C186=0),OFFSET(B186,-1,0),C186)","v":3},{"$f":"IF(OFFSET(C186,-1,0)=\"L\",1,IF(OFFSET(C186,-1,0)=1,2,IF(OR(A186=\"s\",A186=0),\"S\",IF(AND(OFFSET(C186,-1,0)=2,A186=4),3,IF(AND(OR(OFFSET(C186,-1,0)=\"s\",OFFSET(C186,-1,0)=0),A186<>\"s\",A186>OFFSET(B186,-1,0)),OFFSET(B186,-1,0),A186)))))","v":"S"},{"$f":"IF(OR(C186=\"S\",C186=0),0,IF(ISERROR(K186),J186,SMALL(J186:K186,1)))","v":0},{"$f":"IF($C186=1,OFFSET(E186,-1,0)+1,OFFSET(E186,-1,0))","v":1},{"$f":"IF($C186=1,0,IF($C186=2,OFFSET(F186,-1,0)+1,OFFSET(F186,-1,0)))","v":5},{"$f":"IF(AND($C186<=2,$C186<>0),0,IF($C186=3,OFFSET(G186,-1,0)+1,OFFSET(G186,-1,0)))","v":3},{"$f":"IF(AND($C186<=3,$C186<>0),0,IF($C186=4,OFFSET(H186,-1,0)+1,OFFSET(H186,-1,0)))","v":0},{"$f":"IF(AND($C186<=4,$C186<>0),0,IF(AND($C186=\"S\",$W186>0),OFFSET(I186,-1,0)+1,OFFSET(I186,-1,0)))","v":0},0,0,{"$f":"IF(OR(W186>0,$C186=1),\"F\",\"\")","v":""},"Serviço",{"$f":"CHOOSE(1+LOG(1+2*(C186=1)+4*(C186=2)+8*(C186=3)+16*(C186=4)+32*(C186=\"S\"),2),\"\",\"Nível 1\",\"Nível 2\",\"Nível 3\",\"Nível 4\",\"Serviço\")","v":"Serviço"},"1.5.3.0.17.","COMPOSIÇÃO","COMP 090_SEE","CONJUNTO MOTO BOMBA VAZÃO 5 M³/H, HM=20 M, REC. 1\", SUCÇÃO 1.1/4\"","UN ",2,null,null,null,""]
["S",3,"S",0,1,5,3,0,0,0,0,"","Serviço","Serviço","1.5.3.0.18.","COMPOSIÇÃO","COMP 041_SEE","CASA DE BOMBAS - EXCLUSO INSTALAÇÕES ELÉTRICAS, HIDROSANITÁRIAS E ESPECIAIS","UN ",1,null,null,null,""]
[{"$f":"CHOOSE(1+LOG(1+2*(ORÇAMENTO.Nivel=\"Nível 1\")+4*(ORÇAMENTO.Nivel=\"Nível 2\")+8*(ORÇAMENTO.Nivel=\"Nível 3\")+16*(ORÇAMENTO.Nivel=\"Nível 4\")+32*(ORÇAMENTO.Nivel=\"Serviço\"),2),0,1,2,3,4,\"S\")","v":2},{"$f":"IF(OR(C188=\"s\",C188=0),OFFSET(B188,-1,0),C188)","v":2},{"$f":"IF(OFFSET(C188,-1,0)=\"L\",1,IF(OFFSET(C188,-1,0)=1,2,IF(OR(A188=\"s\",A188=0),\"S\",IF(AND(OFFSET(C188,-1,0)=2,A188=4),3,IF(AND(OR(OFFSET(C188,-1,0)=\"s\",OFFSET(C188,-1,0)=0),A188<>\"s\",A188>OFFSET(B188,-1,0)),OFFSET(B188,-1,0),A188)))))","v":2},{"$f":"IF(OR(C188=\"S\",C188=0),0,IF(ISERROR(K188),J188,SMALL(J188:K188,1)))","v":83},{"$f":"IF($C188=1,OFFSET(E188,-1,0)+1,OFFSET(E188,-1,0))","v":1},{"$f":"IF($C188=1,0,IF($C188=2,OFFSET(F188,-1,0)+1,OFFSET(F188,-1,0)))","v":6},{"$f":"IF(AND($C188<=2,$C188<>0),0,IF($C188=3,OFFSET(G188,-1,0)+1,OFFSET(G188,-1,0)))","v":0},{"$f":"IF(AND($C188<=3,$C188<>0),0,IF($C188=4,OFFSET(H188,-1,0)+1,OFFSET(H188,-1,0)))","v":0},{"$f":"IF(AND($C188<=4,$C188<>0),0,IF(AND($C188=\"S\",$W188>0),OFFSET(I188,-1,0)+1,OFFSET(I188,-1,0)))","v":0},163,83,{"$f":"IF(OR(W188>0,$C188=1),\"F\",\"\")","v":""},"Nível 2",{"$f":"CHOOSE(1+LOG(1+2*(C188=1)+4*(C188=2)+8*(C188=3)+16*(C188=4)+32*(C188=\"S\"),2),\"\",\"Nível 1\",\"Nível 2\",\"Nível 3\",\"Nível 4\",\"Serviço\")","v":"Nível 2"},"1.6.",null,null,"INSTALAÇÕES ESPECIAIS","-",null,null,null,null,""]
[3,3,3,54,1,6,1,0,0,82,54,"","Nível 3","Nível 3","1.6.1.","SINAPI",null,"INSTALAÇÕES DE INCENDIO","-",null,null,null,null,""]
[4,4,4,8,1,6,1,1,0,53,8,"","Nível 4","Nível 4","1.6.1.1.","COMPOSIÇÃO","COMP 040_SEE","REGISTRO DE PASSEIO","UN ",null,null,null,null,""]
["S",4,"S",0,1,6,1,1,0,0,0,"","Serviço","Serviço","1.6.1.1.1.","AGETOP",85015,"CAIXA DE PASSEIO C/TAMPA DE FERRO FUNDIDO 40X60 CM P/INCÊNDIO","Un    ",1,null,null,null,""]
["S",4,"S",0,1,6,1,1,0,0,0,"","Serviço","Serviço","1.6.1.1.2.","AGETOP",85027,"ADAPTADOR P/ENGATE STORZ 2.1/2\" X 1.1/2\"","Un    ",1,null,null,null,""]
["S",4,"S",0,1,6,1,1,0,0,0,"","Serviço","Serviço","1.6.1.1.3.","AGETOP",85035,"TAMPÃO CEGO COM CORRENTE 2.1/2\"","Un    ",1,null,null,null,""]
["S",4,"S",0,1,6,1,1,0,0,0,"","Serviço","Serviço","1.6.1.1.4.","AGETOP",85047,"NIPLE DUPLO FERRO GALVANIZADO 2.1/2\"","Un    ",2,null,null,null,""]
["S",4,"S",0,1,6,1,1,0,0,0,"","Serviço","Serviço","1.6.1.1.5.","AGETOP",85077,"VÁLVULA DE RETENÇÃO HORIZONTAL 2.1/2\"","Un    ",1,null,null,null,""]
["S",4,"S",0,1,6,1,1,0,0,0,"","Serviço","Serviço","1.6.1.1.6.","COMPOSIÇÃO","COMP 077_SEE","UNIAO FERRO GALV C/ASSENTO CONICO BRONZE 2 1/2\"","UN ",1,null,null,null,""]
["S",4,"S",0,1,6,1,1,0,0,0,"","Serviço","Serviço","1.6.1.1.7.","COMPOSIÇÃO","COMP 087_SEE","REGISTRO DE GAVETA COM HASTE ASCENDENTE DE BRONZE 2 1/2\"","UN ",1,null,null,null,""]
[4,4,4,13,1,6,1,2,0,45,13,"","Nível 4","Nível 4","1.6.1.2.","AGETOP",82379,"HIDRANTES","m     ",null,null,null,null,""]
["S",4,"S",0,1,6,1,2,0,0,0,"","Serviço","Serviço","1.6.1.2.1.","AGETOP",85011,"CAIXA DE INCÊNDIO METÁLICA COM SUPORTE PARA MANGUEIRA, TAMPA E MURETA 17X60X90 CM C/PINTURA","Un    ",5,null,null,null,""]
["S",4,"S",0,1,6,1,2,0,0,0,"","Serviço","Serviço","1.6.1.2.2.","AGETOP",85017,"MANGUEIRA DE INCÊNDIO D.I. = 38 MM TIPO 2 COMP. = 15 M","CJ    ",10,null,null,null,""]
["S",4,"S",0,1,6,1,2,0,0,0,"","Serviço","Serviço","1.6.1.2.3.","AGETOP",85025,"ESGUICHO REGULÁVEL 1.1/2\"","Un    ",5,null,null,null,""]
["S",4,"S",0,1,6,1,2,0,0,0,"","Serviço","Serviço","1.6.1.2.4.","AGETOP",85027,"ADAPTADOR P/ENGATE STORZ 2.1/2\" X 1.1/2\"","Un    ",5,null,null,null,""]
["S",4,"S",0,1,6,1,2,0,0,0,"","Serviço","Serviço","1.6.1.2.5.","AGETOP",85031,"REGISTRO GLOBO ANGULAR 2.1/2\"","Un    ",5,null,null,null,""]
["S",4,"S",0,1,6,1,2,0,0,0,"","Serviço","Serviço","1.6.1.2.6.","COMPOSIÇÃO","COMP 018_SEE","CHAVE DUPLA P/ CONEXÕES TIPO STORZ EM LATÃO ENGATE RÁPIDO 1 1/2\" X 2 1/2\"","UN ",5,null,null,null,""]
["S",4,"S",0,1,6,1,2,0,0,0,"","Serviço","Serviço","1.6.1.2.7.","COMPOSIÇÃO","COMP 025_SEE","SINALIZADOR FOTOLUMINESCENTE DE EMERGÊNCIA","UN ",10,null,null,null,""]
["S",4,"S",0,1,6,1,2,0,0,0,"","Serviço","Serviço","1.6.1.2.8.","SINAPI",94473,"COTOVELO 90 GRAUS, EM FERRO GALVANIZADO, CONEXÃO ROSQUEADA, DN 65 (2 1/2\u0094), INSTALADO EM RESERVAÇÃO DE ÁGUA DE EDIFICAÇÃO QUE POSSUA RESERVATÓRIO DE FIBRA/FIBROCIMENTO \u0096 FORNECIMENTO E INSTALAÇÃO. AF_06/2016","UN",5,null,null,null,""]
["S",4,"S",0,1,6,1,2,0,0,0,"","Serviço","Serviço","1.6.1.2.9.","COMPOSIÇÃO","COMP 077_SEE","UNIAO FERRO GALV C/ASSENTO CONICO BRONZE 2 1/2\"","UN ",5,null,null,null,""]
["S",4,"S",0,1,6,1,2,0,0,0,"","Serviço","Serviço","1.6.1.2.10.","COMPOSIÇÃO","COMP 078_SEE","TAMPÃO CEGO COM CORRENTE 1 1/2\"","UN ",5,null,null,null,""]
["S",4,"S",0,1,6,1,2,0,0,0,"","Serviço","Serviço","1.6.1.2.11.","COMPOSIÇÃO","COMP 188_SEE","ACIONADOR MANUAL DE ALARME","UN ",5,null,null,null,""]
["S",4,"S",0,1,6,1,2,0,0,0,"","Serviço","Serviço","1.6.1.2.12.","COMPOSIÇÃO","COMP 277_SEE","MARCAÇÃO NO PISO - 1X1 M PARA EXTINTOR","M2",5,null,null,null,""]
[4,4,4,11,1,6,1,3,0,{"$f":"IF(OR($C211=\"S\",$C211=0),0,MATCH(0,OFFSET($D211,1,$C211,ROW($C$377)-ROW($C211)),0))","v":32},{"$f":"IF(OR($C211=\"S\",$C211=0),0,MATCH(OFFSET($D211,0,$C211)+1,OFFSET($D211,1,$C211,ROW($C$377)-ROW($C211)),0))","v":11},"","Nível 4","Nível 4","1.6.1.3.","AGETOP",85041,"BOMBAS","Un    ",null,null,null,null,""]
["S",4,"S",0,1,6,1,3,0,0,0,"","Serviço","Serviço","1.6.1.3.1.","AGETOP",80903,"REGISTRO DE GAVETA BRUTO DIAMETRO 1\"","Un    ",1,null,null,null,""]
["S",4,"S",0,1,6,1,3,0,0,0,"","Serviço","Serviço","1.6.1.3.2.","AGETOP",80910,"REGISTRO DE GAVETA BRUTO DIAMETRO 2.1/2\"","Un    ",3,null,null,null,""]
["S",4,"S",0,1,6,1,3,0,0,0,"","Serviço","Serviço","1.6.1.3.3.","AGETOP",85047,"NIPLE DUPLO FERRO GALVANIZADO 2.1/2\"","Un    ",12,null,null,null,""]
["S",4,"S",0,1,6,1,3,0,0,0,"","Serviço","Serviço","1.6.1.3.4.","AGETOP",85079,"VÁLVULA DE RETENÇÃO VERTICAL 2.1/2\"","Un    ",2,null,null,null,""]
["S",4,"S",0,1,6,1,3,0,0,0,"","Serviço","Serviço","1.6.1.3.5.","AGETOP",82379,"TUBO FERRO GALVANIZADO DIAM.2.1/2\"","m     ",18,null,null,null,""]
["S",4,"S",0,1,6,1,3,0,0,0,"","Serviço","Serviço","1.6.1.3.6.","AGETOP",85056,"TÊ DE FERRO GALVANIZADO 90º X 2 1/2\"","un    ",3,null,null,null,""]
["S",4,"S",0,1,6,1,3,0,0,0,"","Serviço","Serviço","1.6.1.3.7.","COMPOSIÇÃO","COMP 040_SEE","CONJUNTO MOTOR-BOMBA ELÉTRICA TRIFÁSICO 380/220 V PARA VZ= 24,33 M³/H, HM= 46,24 M POTÊNCIA= 7,5 CV","UN ",1,null,null,null,""]
["S",4,"S",0,1,6,1,3,0,0,0,"","Serviço","Serviço","1.6.1.3.8.","SINAPI",94473,"COTOVELO 90 GRAUS, EM FERRO GALVANIZADO, CONEXÃO ROSQUEADA, DN 65 (2 1/2\u0094), INSTALADO EM RESERVAÇÃO DE ÁGUA DE EDIFICAÇÃO QUE POSSUA RESERVATÓRIO DE FIBRA/FIBROCIMENTO \u0096 FORNECIMENTO E INSTALAÇÃO. AF_06/2016","UN",7,null,null,null,""]
["S",4,"S",0,1,6,1,3,0,0,0,"","Serviço","Serviço","1.6.1.3.9.","COMPOSIÇÃO","COMP 077_SEE","UNIAO FERRO GALV C/ASSENTO CONICO BRONZE 2 1/2\"","UN ",4,null,null,null,""]
["S",4,"S",0,1,6,1,3,0,0,0,"","Serviço","Serviço","1.6.1.3.10.","COMPOSIÇÃO","COMP 088_SEE","TE DE FERRO GALVANIZADO 90º X 2.1/2\" X 1\"","UN ",1,null,null,null,""]
[4,4,4,12,1,6,1,4,0,21,12,"","Nível 4","Nível 4","1.6.1.4.","COMPOSIÇÃO","COMP 347_SEE","IMPLANTAÇÃO","UN ",null,null,null,null,""]
["S",4,"S",0,1,6,1,4,0,0,0,"","Serviço","Serviço","1.6.1.4.1.","AGETOP",82379,"TUBO FERRO GALVANIZADO DIAM.2.1/2\"","m     ",168.28,null,null,null,""]
["S",4,"S",0,1,6,1,4,0,0,0,"","Serviço","Serviço","1.6.1.4.2.","AGETOP",85056,"TÊ DE FERRO GALVANIZADO 90º X 2 1/2\"","un    ",11,null,null,null,""]
["S",4,"S",0,1,6,1,4,0,0,0,"","Serviço","Serviço","1.6.1.4.3.","COMPOSIÇÃO","COMP 025_SEE","SINALIZADOR FOTOLUMINESCENTE DE EMERGÊNCIA","UN ",20,null,null,null,""]
["S",4,"S",0,1,6,1,4,0,0,0,"","Serviço","Serviço","1.6.1.4.4.","SINAPI",94473,"COTOVELO 90 GRAUS, EM FERRO GALVANIZADO, CONEXÃO ROSQUEADA, DN 65 (2 1/2\u0094), INSTALADO EM RESERVAÇÃO DE ÁGUA DE EDIFICAÇÃO QUE POSSUA RESERVATÓRIO DE FIBRA/FIBROCIMENTO \u0096 FORNECIMENTO E INSTALAÇÃO. AF_06/2016","UN",19,null,null,null,""]
["S",4,"S",0,1,6,1,4,0,0,0,"","Serviço","Serviço","1.6.1.4.5.","AGETOP",85003,"EXTINTOR PO QUIMICO SECO (6 KG) - CAPACIDADE EXTINTORA 20 BC","Un    ",1,null,null,null,""]
["S",4,"S",0,1,6,1,4,0,0,0,"","Serviço","Serviço","1.6.1.4.6.","AGETOP",85005,"EXTINTOR AGUA PRESSURIZADA (10 LITROS) - CAPACIDADE EXTINTORA 2A","Un    ",1,null,null,null,""]
["S",4,"S",0,1,6,1,4,0,0,0,"","Serviço","Serviço","1.6.1.4.7.","AGETOP",85001,"EXTINTOR CO2 (6 KG) - CAPACIDADE EXTINTORA 5 BC","Un    ",1,null,null,null,""]
["S",4,"S",0,1,6,1,4,0,0,0,"","Serviço","Serviço","1.6.1.4.8.","AGETOP",85006,"EXTINTOR MULTI USO EM PO A B C (6 KG) - CAPACIDADE EXTINTORA 3A 20BC","un    ",9,null,null,null,""]
["S",4,"S",0,1,6,1,4,0,0,0,"","Serviço","Serviço","1.6.1.4.9.","COMPOSIÇÃO","COMP 024_SEE","SINALIZADOR FOTOLUMINESCENTE PARA EXTINTOR","UN ",12,null,null,null,""]
["S",4,"S",0,1,6,1,4,0,0,0,"","Serviço","Serviço","1.6.1.4.10.","COMPOSIÇÃO","COMP 277_SEE","MARCAÇÃO NO PISO - 1X1 M PARA EXTINTOR","M2",12,null,null,null,""]
["S",4,"S",0,1,6,1,4,0,0,0,"","Serviço","Serviço","1.6.1.4.11.","AGETOP",71598,"LUMINÁRIA DE EMERGÊNCIA 30 LEDS","un    ",16,null,null,null,""]
[4,4,4,9,1,6,1,5,0,9,{"$error":"#N/A"},"","Nível 4","Nível 4","1.6.1.5.","COMPOSIÇÃO","COMP 190_SEE","PADRÃO","UN ",null,null,null,null,""]
["S",4,"S",0,1,6,1,5,0,0,0,"","Serviço","Serviço","1.6.1.5.1.","AGETOP",81882,"RES.METALICO TAÇA AÇO PATINÁVEL-V=15M3-COL.SEC.H=6M+FUNDAÇÃO+LOGOTIPO","Un    ",1,null,null,null,""]
["S",4,"S",0,1,6,1,5,0,0,0,"","Serviço","Serviço","1.6.1.5.2.","AGETOP",85037,"TANQUE DE PRESSÃO DE 10 L","Un    ",1,null,null,null,""]
["S",4,"S",0,1,6,1,5,0,0,0,"","Serviço","Serviço","1.6.1.5.3.","AGETOP",85039,"PRESSOSTATO 50 A 80 PSI","Un    ",1,null,null,null,""]
["S",4,"S",0,1,6,1,5,0,0,0,"","Serviço","Serviço","1.6.1.5.4.","AGETOP",85041,"MANOMETRO - 0 A 10 KG/CM2","Un    ",1,null,null,null,""]
["S",4,"S",0,1,6,1,5,0,0,0,"","Serviço","Serviço","1.6.1.5.5.","AGETOP",72338,"SIRENE METALICA ALCANCE 500 M","Un    ",1,null,null,null,""]
["S",4,"S",0,1,6,1,5,0,0,0,"","Serviço","Serviço","1.6.1.5.6.","COMPOSIÇÃO","COMP 186_SEE","BOTOEIRA BOMBA DE INCÊNDIO C/ MARTELO CONVENCIONAL/ ANALÓGICA","UN ",1,null,null,null,""]
["S",4,"S",0,1,6,1,5,0,0,0,"","Serviço","Serviço","1.6.1.5.7.","COMPOSIÇÃO","COMP 188_SEE","ACIONADOR MANUAL DE ALARME","UN ",1,null,null,null,""]
["S",4,"S",0,1,6,1,5,0,0,0,"","Serviço","Serviço","1.6.1.5.8.","COMPOSIÇÃO","COMP 190_SEE","CENTRAL DE DETECÇÃO E ALARME DE 40 SETORES COM BATERIA","UN ",1,null,null,null,""]
[3,3,3,28,1,6,2,0,0,28,45,"","Nível 3","Nível 3","1.6.2.","SINAPI",null,"INST. DE GÁS - PEÇAS E ACESSÓRIOS 2 CILINDROS","-",null,null,null,null,""]
["S",3,"S",0,1,6,2,0,0,0,0,"","Serviço","Serviço","1.6.2.0.1.","AGETOP",91007,"CENTRAL DE GÁS PADRÃO GOINFRA SEM INSTALAÇÕES (1+1 CILINDRO 45 KG)","Un    ",1,null,null,null,""]
["S",3,"S",0,1,6,2,0,0,0,0,"","Serviço","Serviço","1.6.2.0.2.","AGETOP",91023,"UNIÃO S/BRONZE PRETA 3/4\" NPT 300 LBS","Un    ",3,null,null,null,""]
["S",3,"S",0,1,6,2,0,0,0,0,"","Serviço","Serviço","1.6.2.0.3.","COMPOSIÇÃO","COMP 382_SEE","TE DE REDUCAO DE FERRO GALVANIZADO, COM ROSCA BSP, DE 3/4\" X 1/2\"","UN ",1,null,null,null,""]
["S",3,"S",0,1,6,2,0,0,0,0,"","Serviço","Serviço","1.6.2.0.4.","COMPOSIÇÃO","COMP 383_SEE","BUCHA DE REDUCAO DE FERRO GALVANIZADO, COM ROSCA BSP, DE 1/2\" X 1/4\"","UN ",3,null,null,null,""]
["S",3,"S",0,1,6,2,0,0,0,0,"","Serviço","Serviço","1.6.2.0.5.","AGETOP",91021,"LUVA GALVANIZADO DE REDUÇÃO 3/4\" X 1/2\" (GÁS)","Un    ",2,null,null,null,""]
["S",3,"S",0,1,6,2,0,0,0,0,"","Serviço","Serviço","1.6.2.0.6.","SINAPI",92692,"NIPLE, EM FERRO GALVANIZADO, CONEXÃO ROSQUEADA, DN 15 (1/2\"), INSTALADO EM RAMAIS E SUB-RAMAIS DE GÁS - FORNECIMENTO E INSTALAÇÃO. AF_12/2015","UN",6,null,null,null,""]
["S",3,"S",0,1,6,2,0,0,0,0,"","Serviço","Serviço","1.6.2.0.7.","AGETOP",91031,"NIPLE DUPLO 300 PSI 3/4\"","Un    ",6,null,null,null,""]
["S",3,"S",0,1,6,2,0,0,0,0,"","Serviço","Serviço","1.6.2.0.8.","COMPOSIÇÃO","COMP 212_SEE","NIPLE DE REDUÇÃO 1/2\" X 1/4\" BSP","UN ",4,null,null,null,""]
[{"$f":"CHOOSE(1+LOG(1+2*(ORÇAMENTO.Nivel=\"Nível 1\")+4*(ORÇAMENTO.Nivel=\"Nível 2\")+8*(ORÇAMENTO.Nivel=\"Nível 3\")+16*(ORÇAMENTO.Nivel=\"Nível 4\")+32*(ORÇAMENTO.Nivel=\"Serviço\"),2),0,1,2,3,4,\"S\")","v":"S"},{"$f":"IF(OR(C252=\"s\",C252=0),OFFSET(B252,-1,0),C252)","v":3},{"$f":"IF(OFFSET(C252,-1,0)=\"L\",1,IF(OFFSET(C252,-1,0)=1,2,IF(OR(A252=\"s\",A252=0),\"S\",IF(AND(OFFSET(C252,-1,0)=2,A252=4),3,IF(AND(OR(OFFSET(C252,-1,0)=\"s\",OFFSET(C252,-1,0)=0),A252<>\"s\",A252>OFFSET(B252,-1,0)),OFFSET(B252,-1,0),A252)))))","v":"S"},{"$f":"IF(OR(C252=\"S\",C252=0),0,IF(ISERROR(K252),J252,SMALL(J252:K252,1)))","v":0},{"$f":"IF($C252=1,OFFSET(E252,-1,0)+1,OFFSET(E252,-1,0))","v":1},{"$f":"IF($C252=1,0,IF($C252=2,OFFSET(F252,-1,0)+1,OFFSET(F252,-1,0)))","v":6},{"$f":"IF(AND($C252<=2,$C252<>0),0,IF($C252=3,OFFSET(G252,-1,0)+1,OFFSET(G252,-1,0)))","v":2},{"$f":"IF(AND($C252<=3,$C252<>0),0,IF($C252=4,OFFSET(H252,-1,0)+1,OFFSET(H252,-1,0)))","v":0},{"$f":"IF(AND($C252<=4,$C252<>0),0,IF(AND($C252=\"S\",$W252>0),OFFSET(I252,-1,0)+1,OFFSET(I252,-1,0)))","v":0},0,0,{"$f":"IF(OR(W252>0,$C252=1),\"F\",\"\")","v":""},"Serviço",{"$f":"CHOOSE(1+LOG(1+2*(C252=1)+4*(C252=2)+8*(C252=3)+16*(C252=4)+32*(C252=\"S\"),2),\"\",\"Nível 1\",\"Nível 2\",\"Nível 3\",\"Nível 4\",\"Serviço\")","v":"Serviço"},"1.6.2.0.9.","COMPOSIÇÃO","COMP 213_SEE","NIPLE DE REDUÇÃO 3/4\" X 1/2\" BSP","UN ",4,null,null,null,""]
["S",3,"S",0,1,6,2,0,0,0,0,"","Serviço","Serviço","1.6.2.0.10.","SINAPI",92688,"TUBO DE AÇO GALVANIZADO COM COSTURA, CLASSE MÉDIA, CONEXÃO ROSQUEADA, DN 20 (3/4\"), INSTALADO EM RAMAIS E SUB-RAMAIS DE GÁS - FORNECIMENTO E INSTALAÇÃO. AF_12/2015","M",12,null,null,null,""]
["S",3,"S",0,1,6,2,0,0,0,0,"","Serviço","Serviço","1.6.2.0.11.","SINAPI",92701,"JOELHO 90 GRAUS, EM FERRO GALVANIZADO, CONEXÃO ROSQUEADA, DN 20 (3/4\"), INSTALADO EM RAMAIS E SUB-RAMAIS DE GÁS - FORNECIMENTO E INSTALAÇÃO. AF_12/2015","UN",5,null,null,null,""]
["S",3,"S",0,1,6,2,0,0,0,0,"","Serviço","Serviço","1.6.2.0.12.","COMPOSIÇÃO","COMP 237_SEE","FITA ANTICORROSIVA","M",4,null,null,null,""]
["S",3,"S",0,1,6,2,0,0,0,0,"","Serviço","Serviço","1.6.2.0.13.","AGETOP",91025,"VÁLVULA ESFERICA LATÃO 3/4\"","Un    ",3,null,null,null,""]
["S",3,"S",0,1,6,2,0,0,0,0,"","Serviço","Serviço","1.6.2.0.14.","COMPOSIÇÃO","COMP 542_SEE","VÁLVULA UGV 3/4\" (S) LATÃO","UN ",1,null,null,null,""]
["S",3,"S",0,1,6,2,0,0,0,0,"","Serviço","Serviço","1.6.2.0.15.","COMPOSIÇÃO","COMP 543_SEE","VÁLVULA UGV 1/2\" (S) LATÃO","UN ",1,null,null,null,""]
["S",3,"S",0,1,6,2,0,0,0,0,"","Serviço","Serviço","1.6.2.0.16.","AGETOP",91029,"VALVULA DE RETENÇÃO LATÃO 1/2\" X 7/16\" NPT","Un    ",1,null,null,null,""]
["S",3,"S",0,1,6,2,0,0,0,0,"","Serviço","Serviço","1.6.2.0.17.","COMPOSIÇÃO","COMP 211_SEE","REGULADOR DE 2º ESTÁGIO 5KG/H","UN ",1,null,null,null,""]
["S",3,"S",0,1,6,2,0,0,0,0,"","Serviço","Serviço","1.6.2.0.18.","COMPOSIÇÃO","COMP 210_SEE","REGULADOR DE 1º ESTÁGIO 60KG/H MODELO AP-40  COM MANÔMETRO","UN ",1,null,null,null,""]
["S",3,"S",0,1,6,2,0,0,0,0,"","Serviço","Serviço","1.6.2.0.19.","AGETOP",85003,"EXTINTOR PO QUIMICO SECO (6 KG) - CAPACIDADE EXTINTORA 20 BC","Un    ",1,null,null,null,""]
["S",3,"S",0,1,6,2,0,0,0,0,"","Serviço","Serviço","1.6.2.0.20.","COMPOSIÇÃO","COMP 235_SEE","PLACA DE SINALIZAÇÃO EM PVC COD 01 - (300X300) PROIBIDO FUMAR","UN ",2,null,null,null,""]
["S",3,"S",0,1,6,2,0,0,0,0,"","Serviço","Serviço","1.6.2.0.21.","COMPOSIÇÃO","COMP 236_SEE","PLACA DE SINALIZAÇÃO EM PVC COD 06 - (300X300) PERIGO INFLAMÁVEL","UN ",2,null,null,null,""]
["S",3,"S",0,1,6,2,0,0,0,0,"","Serviço","Serviço","1.6.2.0.22.","AGETOP",91043,"BRAÇADEIRA METALICA TIPO \"D\" DIAM. 3/4\"","Un    ",6,null,null,null,""]
["S",3,"S",0,1,6,2,0,0,0,0,"","Serviço","Serviço","1.6.2.0.23.","AGETOP",71863,"PARAFUSO P/BUCHA S-10","Un    ",12,null,null,null,""]
["S",3,"S",0,1,6,2,0,0,0,0,"","Serviço","Serviço","1.6.2.0.24.","AGETOP",70393,"BUCHA DE NYLON S-10","Un    ",12,null,null,null,""]
["S",3,"S",0,1,6,2,0,0,0,0,"","Serviço","Serviço","1.6.2.0.25.","AGETOP",91045,"SUPORTE PARA COLETOR","Un    ",2,null,null,null,""]
["S",3,"S",0,1,6,2,0,0,0,0,"","Serviço","Serviço","1.6.2.0.26.","COMPOSIÇÃO","COMP 045_SEE","LAUDO DE ESTANQUEIDADE","UN ",1,null,null,null,""]
["S",3,"S",0,1,6,2,0,0,0,0,"","Serviço","Serviço","1.6.2.0.27.","COMPOSIÇÃO","COMP 277_SEE","MARCAÇÃO NO PISO - 1X1 M PARA EXTINTOR","M2",1,null,null,null,""]
[2,{"$f":"IF(OR(C271=\"s\",C271=0),OFFSET(B271,-1,0),C271)","v":2},{"$f":"IF(OFFSET(C271,-1,0)=\"L\",1,IF(OFFSET(C271,-1,0)=1,2,IF(OR(A271=\"s\",A271=0),\"S\",IF(AND(OFFSET(C271,-1,0)=2,A271=4),3,IF(AND(OR(OFFSET(C271,-1,0)=\"s\",OFFSET(C271,-1,0)=0),A271<>\"s\",A271>OFFSET(B271,-1,0)),OFFSET(B271,-1,0),A271)))))","v":2},{"$f":"IF(OR(C271=\"S\",C271=0),0,IF(ISERROR(K271),J271,SMALL(J271:K271,1)))","v":3},{"$f":"IF($C271=1,OFFSET(E271,-1,0)+1,OFFSET(E271,-1,0))","v":1},{"$f":"IF($C271=1,0,IF($C271=2,OFFSET(F271,-1,0)+1,OFFSET(F271,-1,0)))","v":7},{"$f":"IF(AND($C271<=2,$C271<>0),0,IF($C271=3,OFFSET(G271,-1,0)+1,OFFSET(G271,-1,0)))","v":0},{"$f":"IF(AND($C271<=3,$C271<>0),0,IF($C271=4,OFFSET(H271,-1,0)+1,OFFSET(H271,-1,0)))","v":0},{"$f":"IF(AND($C271<=4,$C271<>0),0,IF(AND($C271=\"S\",$W271>0),OFFSET(I271,-1,0)+1,OFFSET(I271,-1,0)))","v":0},80,3,{"$f":"IF(OR(W271>0,$C271=1),\"F\",\"\")","v":""},"Nível 2",{"$f":"CHOOSE(1+LOG(1+2*(C271=1)+4*(C271=2)+8*(C271=3)+16*(C271=4)+32*(C271=\"S\"),2),\"\",\"Nível 1\",\"Nível 2\",\"Nível 3\",\"Nível 4\",\"Serviço\")","v":"Nível 2"},"1.7.","AGETOP",91045,"ALVENARIAS E DIVISÓRIAS","Un    ",null,null,null,null,""]
[{"$f":"CHOOSE(1+LOG(1+2*(ORÇAMENTO.Nivel=\"Nível 1\")+4*(ORÇAMENTO.Nivel=\"Nível 2\")+8*(ORÇAMENTO.Nivel=\"Nível 3\")+16*(ORÇAMENTO.Nivel=\"Nível 4\")+32*(ORÇAMENTO.Nivel=\"Serviço\"),2),0,1,2,3,4,\"S\")","v":3},3,3,2,1,7,1,0,0,2,8,"","Nível 3","Nível 3","1.7.1.","SINAPI",null,"BANHEIROS","-",null,null,null,null,""]
[{"$f":"CHOOSE(1+LOG(1+2*(ORÇAMENTO.Nivel=\"Nível 1\")+4*(ORÇAMENTO.Nivel=\"Nível 2\")+8*(ORÇAMENTO.Nivel=\"Nível 3\")+16*(ORÇAMENTO.Nivel=\"Nível 4\")+32*(ORÇAMENTO.Nivel=\"Serviço\"),2),0,1,2,3,4,\"S\")","v":"S"},3,"S",0,1,7,1,0,0,0,0,"","Serviço","Serviço","1.7.1.0.1.","AGETOP",100303,"DIVISORIA DE ARDOSIA POLIDA 3 CM","m2    ",4.32,null,null,null,""]
[{"$f":"CHOOSE(1+LOG(1+2*(ORÇAMENTO.Nivel=\"Nível 1\")+4*(ORÇAMENTO.Nivel=\"Nível 2\")+8*(ORÇAMENTO.Nivel=\"Nível 3\")+16*(ORÇAMENTO.Nivel=\"Nível 4\")+32*(ORÇAMENTO.Nivel=\"Serviço\"),2),0,1,2,3,4,\"S\")","v":2},2,2,3,1,8,0,0,0,77,3,"","Nível 2","Nível 2","1.8.","SINAPI",null,"COBERTURAS","-",null,null,null,null,""]
[{"$f":"CHOOSE(1+LOG(1+2*(ORÇAMENTO.Nivel=\"Nível 1\")+4*(ORÇAMENTO.Nivel=\"Nível 2\")+8*(ORÇAMENTO.Nivel=\"Nível 3\")+16*(ORÇAMENTO.Nivel=\"Nível 4\")+32*(ORÇAMENTO.Nivel=\"Serviço\"),2),0,1,2,3,4,\"S\")","v":3},3,3,2,1,8,1,0,0,{"$f":"IF(OR($C275=\"S\",$C275=0),0,MATCH(0,OFFSET($D275,1,$C275,ROW($C$377)-ROW($C275)),0))","v":2},{"$f":"IF(OR($C275=\"S\",$C275=0),0,MATCH(OFFSET($D275,0,$C275)+1,OFFSET($D275,1,$C275,ROW($C$377)-ROW($C275)),0))","v":5},"","Nível 3","Nível 3","1.8.1.","SINAPI",null,"CERAMICA","-",null,null,null,null,""]
[{"$f":"CHOOSE(1+LOG(1+2*(ORÇAMENTO.Nivel=\"Nível 1\")+4*(ORÇAMENTO.Nivel=\"Nível 2\")+8*(ORÇAMENTO.Nivel=\"Nível 3\")+16*(ORÇAMENTO.Nivel=\"Nível 4\")+32*(ORÇAMENTO.Nivel=\"Serviço\"),2),0,1,2,3,4,\"S\")","v":"S"},3,"S",0,1,8,1,0,0,0,0,"","Serviço","Serviço","1.8.1.0.1.","SINAPI",94445,"TELHAMENTO COM TELHA CERÂMICA CAPA-CANAL, TIPO PLAN, COM ATÉ 2 ÁGUAS, INCLUSO TRANSPORTE VERTICAL. AF_07/2019","M2",46.61,null,null,null,"Referência: AGETOP - 160401"]
[{"$f":"CHOOSE(1+LOG(1+2*(ORÇAMENTO.Nivel=\"Nível 1\")+4*(ORÇAMENTO.Nivel=\"Nível 2\")+8*(ORÇAMENTO.Nivel=\"Nível 3\")+16*(ORÇAMENTO.Nivel=\"Nível 4\")+32*(ORÇAMENTO.Nivel=\"Serviço\"),2),0,1,2,3,4,\"S\")","v":2},{"$f":"IF(OR(C277=\"s\",C277=0),OFFSET(B277,-1,0),C277)","v":2},{"$f":"IF(OFFSET(C277,-1,0)=\"L\",1,IF(OFFSET(C277,-1,0)=1,2,IF(OR(A277=\"s\",A277=0),\"S\",IF(AND(OFFSET(C277,-1,0)=2,A277=4),3,IF(AND(OR(OFFSET(C277,-1,0)=\"s\",OFFSET(C277,-1,0)=0),A277<>\"s\",A277>OFFSET(B277,-1,0)),OFFSET(B277,-1,0),A277)))))","v":2},{"$f":"IF(OR(C277=\"S\",C277=0),0,IF(ISERROR(K277),J277,SMALL(J277:K277,1)))","v":6},{"$f":"IF($C277=1,OFFSET(E277,-1,0)+1,OFFSET(E277,-1,0))","v":1},{"$f":"IF($C277=1,0,IF($C277=2,OFFSET(F277,-1,0)+1,OFFSET(F277,-1,0)))","v":9},{"$f":"IF(AND($C277<=2,$C277<>0),0,IF($C277=3,OFFSET(G277,-1,0)+1,OFFSET(G277,-1,0)))","v":0},{"$f":"IF(AND($C277<=3,$C277<>0),0,IF($C277=4,OFFSET(H277,-1,0)+1,OFFSET(H277,-1,0)))","v":0},{"$f":"IF(AND($C277<=4,$C277<>0),0,IF(AND($C277=\"S\",$W277>0),OFFSET(I277,-1,0)+1,OFFSET(I277,-1,0)))","v":0},74,6,{"$f":"IF(OR(W277>0,$C277=1),\"F\",\"\")","v":""},"Nível 2",{"$f":"CHOOSE(1+LOG(1+2*(C277=1)+4*(C277=2)+8*(C277=3)+16*(C277=4)+32*(C277=\"S\"),2),\"\",\"Nível 1\",\"Nível 2\",\"Nível 3\",\"Nível 4\",\"Serviço\")","v":"Nível 2"},"1.9.",null,null,"ESQUADRIAS METÁLICAS","-",null,null,null,null,""]
[3,3,3,2,1,9,1,0,0,5,2,"","Nível 3","Nível 3","1.9.1.","SINAPI",null,"ACESSIBILIDADE DENTRO DO COLÉGIO","-",null,null,null,null,""]
["S",3,"S",0,1,9,1,0,0,0,0,"","Serviço","Serviço","1.9.1.0.1.","COMPOSIÇÃO","COMP 083_SEE","CORRIMÃO PISO - SEDUC","M",4.24,null,null,null,""]
[3,3,3,3,1,9,2,0,0,3,8,"","Nível 3","Nível 3","1.9.2.","SINAPI",null,"BANHEIROS","-",null,null,null,null,""]
["S",3,"S",0,1,9,2,0,0,0,0,"","Serviço","Serviço","1.9.2.0.1.","AGETOP",180501,"PORTA DE ABRIR EM CHAPA PF-1 C/FERRAGENS","m2    ",7.56,null,null,null,""]
["S",3,"S",0,1,9,2,0,0,0,0,"","Serviço","Serviço","1.9.2.0.2.","AGETOP",180509,"PORTA ABRIR CH.P/WC PF-10 C/FERRAGENS","m2    ",5.76,null,null,null,""]
[{"$f":"CHOOSE(1+LOG(1+2*(ORÇAMENTO.Nivel=\"Nível 1\")+4*(ORÇAMENTO.Nivel=\"Nível 2\")+8*(ORÇAMENTO.Nivel=\"Nível 3\")+16*(ORÇAMENTO.Nivel=\"Nível 4\")+32*(ORÇAMENTO.Nivel=\"Serviço\"),2),0,1,2,3,4,\"S\")","v":2},{"$f":"IF(OR(C283=\"s\",C283=0),OFFSET(B283,-1,0),C283)","v":2},{"$f":"IF(OFFSET(C283,-1,0)=\"L\",1,IF(OFFSET(C283,-1,0)=1,2,IF(OR(A283=\"s\",A283=0),\"S\",IF(AND(OFFSET(C283,-1,0)=2,A283=4),3,IF(AND(OR(OFFSET(C283,-1,0)=\"s\",OFFSET(C283,-1,0)=0),A283<>\"s\",A283>OFFSET(B283,-1,0)),OFFSET(B283,-1,0),A283)))))","v":2},{"$f":"IF(OR(C283=\"S\",C283=0),0,IF(ISERROR(K283),J283,SMALL(J283:K283,1)))","v":7},{"$f":"IF($C283=1,OFFSET(E283,-1,0)+1,OFFSET(E283,-1,0))","v":1},{"$f":"IF($C283=1,0,IF($C283=2,OFFSET(F283,-1,0)+1,OFFSET(F283,-1,0)))","v":10},{"$f":"IF(AND($C283<=2,$C283<>0),0,IF($C283=3,OFFSET(G283,-1,0)+1,OFFSET(G283,-1,0)))","v":0},{"$f":"IF(AND($C283<=3,$C283<>0),0,IF($C283=4,OFFSET(H283,-1,0)+1,OFFSET(H283,-1,0)))","v":0},{"$f":"IF(AND($C283<=4,$C283<>0),0,IF(AND($C283=\"S\",$W283>0),OFFSET(I283,-1,0)+1,OFFSET(I283,-1,0)))","v":0},68,7,{"$f":"IF(OR(W283>0,$C283=1),\"F\",\"\")","v":""},"Nível 2",{"$f":"CHOOSE(1+LOG(1+2*(C283=1)+4*(C283=2)+8*(C283=3)+16*(C283=4)+32*(C283=\"S\"),2),\"\",\"Nível 1\",\"Nível 2\",\"Nível 3\",\"Nível 4\",\"Serviço\")","v":"Nível 2"},"1.10.",null,null,"REVESTIMENTO DE PAREDE","-",null,null,null,null,""]
[3,3,3,2,1,10,1,0,0,6,2,"","Nível 3","Nível 3","1.10.1.","SINAPI",null,"BANHEIROS","-",null,null,null,null,""]
["S",3,"S",0,1,10,1,0,0,0,0,"","Serviço","Serviço","1.10.1.0.1.","SINAPI",87273,"REVESTIMENTO CERÂMICO PARA PAREDES INTERNAS COM PLACAS TIPO ESMALTADA EXTRA DE DIMENSÕES 33X45 CM APLICADAS EM AMBIENTES DE ÁREA MAIOR QUE 5 M² NA ALTURA INTEIRA DAS PAREDES. AF_06/2014","M2",225.14,null,null,null,""]
[3,3,3,2,1,10,2,0,0,4,2,"","Nível 3","Nível 3","1.10.2.","SINAPI",null,"COZINHA E DESPENSA","-",null,null,null,null,""]
[{"$f":"CHOOSE(1+LOG(1+2*(ORÇAMENTO.Nivel=\"Nível 1\")+4*(ORÇAMENTO.Nivel=\"Nível 2\")+8*(ORÇAMENTO.Nivel=\"Nível 3\")+16*(ORÇAMENTO.Nivel=\"Nível 4\")+32*(ORÇAMENTO.Nivel=\"Serviço\"),2),0,1,2,3,4,\"S\")","v":"S"},{"$f":"IF(OR(C287=\"s\",C287=0),OFFSET(B287,-1,0),C287)","v":3},{"$f":"IF(OFFSET(C287,-1,0)=\"L\",1,IF(OFFSET(C287,-1,0)=1,2,IF(OR(A287=\"s\",A287=0),\"S\",IF(AND(OFFSET(C287,-1,0)=2,A287=4),3,IF(AND(OR(OFFSET(C287,-1,0)=\"s\",OFFSET(C287,-1,0)=0),A287<>\"s\",A287>OFFSET(B287,-1,0)),OFFSET(B287,-1,0),A287)))))","v":"S"},{"$f":"IF(OR(C287=\"S\",C287=0),0,IF(ISERROR(K287),J287,SMALL(J287:K287,1)))","v":0},{"$f":"IF($C287=1,OFFSET(E287,-1,0)+1,OFFSET(E287,-1,0))","v":1},{"$f":"IF($C287=1,0,IF($C287=2,OFFSET(F287,-1,0)+1,OFFSET(F287,-1,0)))","v":10},{"$f":"IF(AND($C287<=2,$C287<>0),0,IF($C287=3,OFFSET(G287,-1,0)+1,OFFSET(G287,-1,0)))","v":2},{"$f":"IF(AND($C287<=3,$C287<>0),0,IF($C287=4,OFFSET(H287,-1,0)+1,OFFSET(H287,-1,0)))","v":0},{"$f":"IF(AND($C287<=4,$C287<>0),0,IF(AND($C287=\"S\",$W287>0),OFFSET(I287,-1,0)+1,OFFSET(I287,-1,0)))","v":0},0,0,{"$f":"IF(OR(W287>0,$C287=1),\"F\",\"\")","v":""},"Serviço",{"$f":"CHOOSE(1+LOG(1+2*(C287=1)+4*(C287=2)+8*(C287=3)+16*(C287=4)+32*(C287=\"S\"),2),\"\",\"Nível 1\",\"Nível 2\",\"Nível 3\",\"Nível 4\",\"Serviço\")","v":"Serviço"},"1.10.2.0.1.","SINAPI",87273,"REVESTIMENTO CERÂMICO PARA PAREDES INTERNAS COM PLACAS TIPO ESMALTADA EXTRA DE DIMENSÕES 33X45 CM APLICADAS EM AMBIENTES DE ÁREA MAIOR QUE 5 M² NA ALTURA INTEIRA DAS PAREDES. AF_06/2014","M2",22.16,null,null,null,""]
[{"$f":"CHOOSE(1+LOG(1+2*(ORÇAMENTO.Nivel=\"Nível 1\")+4*(ORÇAMENTO.Nivel=\"Nível 2\")+8*(ORÇAMENTO.Nivel=\"Nível 3\")+16*(ORÇAMENTO.Nivel=\"Nível 4\")+32*(ORÇAMENTO.Nivel=\"Serviço\"),2),0,1,2,3,4,\"S\")","v":3},{"$f":"IF(OR(C288=\"s\",C288=0),OFFSET(B288,-1,0),C288)","v":3},{"$f":"IF(OFFSET(C288,-1,0)=\"L\",1,IF(OFFSET(C288,-1,0)=1,2,IF(OR(A288=\"s\",A288=0),\"S\",IF(AND(OFFSET(C288,-1,0)=2,A288=4),3,IF(AND(OR(OFFSET(C288,-1,0)=\"s\",OFFSET(C288,-1,0)=0),A288<>\"s\",A288>OFFSET(B288,-1,0)),OFFSET(B288,-1,0),A288)))))","v":3},{"$f":"IF(OR(C288=\"S\",C288=0),0,IF(ISERROR(K288),J288,SMALL(J288:K288,1)))","v":2},{"$f":"IF($C288=1,OFFSET(E288,-1,0)+1,OFFSET(E288,-1,0))","v":1},{"$f":"IF($C288=1,0,IF($C288=2,OFFSET(F288,-1,0)+1,OFFSET(F288,-1,0)))","v":10},{"$f":"IF(AND($C288<=2,$C288<>0),0,IF($C288=3,OFFSET(G288,-1,0)+1,OFFSET(G288,-1,0)))","v":3},{"$f":"IF(AND($C288<=3,$C288<>0),0,IF($C288=4,OFFSET(H288,-1,0)+1,OFFSET(H288,-1,0)))","v":0},{"$f":"IF(AND($C288<=4,$C288<>0),0,IF(AND($C288=\"S\",$W288>0),OFFSET(I288,-1,0)+1,OFFSET(I288,-1,0)))","v":0},2,14,{"$f":"IF(OR(W288>0,$C288=1),\"F\",\"\")","v":""},"Nível 3",{"$f":"CHOOSE(1+LOG(1+2*(C288=1)+4*(C288=2)+8*(C288=3)+16*(C288=4)+32*(C288=\"S\"),2),\"\",\"Nível 1\",\"Nível 2\",\"Nível 3\",\"Nível 4\",\"Serviço\")","v":"Nível 3"},"1.10.3.","SINAPI",null,"MURO","-",null,null,null,null,""]
[{"$f":"CHOOSE(1+LOG(1+2*(ORÇAMENTO.Nivel=\"Nível 1\")+4*(ORÇAMENTO.Nivel=\"Nível 2\")+8*(ORÇAMENTO.Nivel=\"Nível 3\")+16*(ORÇAMENTO.Nivel=\"Nível 4\")+32*(ORÇAMENTO.Nivel=\"Serviço\"),2),0,1,2,3,4,\"S\")","v":"S"},3,"S",0,1,10,3,0,0,0,0,"","Serviço","Serviço","1.10.3.0.1.","AGETOP",200505,"REB.PAULISTA C/IMPERM.A-15 (1CI:4ARMLC+5% IMPXCI)","m2    ",894.09,null,null,null,""]
[2,2,2,18,1,11,0,0,0,61,18,"","Nível 2","Nível 2","1.11.",null,null,"REVESTIMENTO DE PISO","-",null,null,null,null,""]
[3,3,3,3,1,11,1,0,0,17,3,"","Nível 3","Nível 3","1.11.1.","SINAPI",null,"CALÇADA ACESSÍVEL","-",null,null,null,null,""]
[4,4,4,2,1,11,1,1,0,2,31,"","Nível 4","Nível 4","1.11.1.1.","SINAPI",null,"PODOTÁTIL","-",null,null,null,null,""]
["S",4,"S",0,1,11,1,1,0,0,0,"","Serviço","Serviço","1.11.1.1.1.","AGETOP",221126,"PISO DE LADRILHO HIDRÁULICO COLORIDO MODELO TÁTIL ( ALERTA OU DIRECIONAL) SEM LASTRO","m2    ",42.59,null,null,null,""]
[3,3,3,4,1,11,2,0,0,14,4,"","Nível 3","Nível 3","1.11.2.","SINAPI",null,"ACESSIBILIDADE DENTRO DO COLÉGIO","-",null,null,null,null,""]
[4,4,4,3,1,11,2,1,0,3,28,"","Nível 4","Nível 4","1.11.2.1.","SINAPI",null,"PODOTÁTIL","-",null,null,null,null,""]
[{"$f":"CHOOSE(1+LOG(1+2*(ORÇAMENTO.Nivel=\"Nível 1\")+4*(ORÇAMENTO.Nivel=\"Nível 2\")+8*(ORÇAMENTO.Nivel=\"Nível 3\")+16*(ORÇAMENTO.Nivel=\"Nível 4\")+32*(ORÇAMENTO.Nivel=\"Serviço\"),2),0,1,2,3,4,\"S\")","v":"S"},{"$f":"IF(OR(C296=\"s\",C296=0),OFFSET(B296,-1,0),C296)","v":4},{"$f":"IF(OFFSET(C296,-1,0)=\"L\",1,IF(OFFSET(C296,-1,0)=1,2,IF(OR(A296=\"s\",A296=0),\"S\",IF(AND(OFFSET(C296,-1,0)=2,A296=4),3,IF(AND(OR(OFFSET(C296,-1,0)=\"s\",OFFSET(C296,-1,0)=0),A296<>\"s\",A296>OFFSET(B296,-1,0)),OFFSET(B296,-1,0),A296)))))","v":"S"},{"$f":"IF(OR(C296=\"S\",C296=0),0,IF(ISERROR(K296),J296,SMALL(J296:K296,1)))","v":0},{"$f":"IF($C296=1,OFFSET(E296,-1,0)+1,OFFSET(E296,-1,0))","v":1},{"$f":"IF($C296=1,0,IF($C296=2,OFFSET(F296,-1,0)+1,OFFSET(F296,-1,0)))","v":11},{"$f":"IF(AND($C296<=2,$C296<>0),0,IF($C296=3,OFFSET(G296,-1,0)+1,OFFSET(G296,-1,0)))","v":2},{"$f":"IF(AND($C296<=3,$C296<>0),0,IF($C296=4,OFFSET(H296,-1,0)+1,OFFSET(H296,-1,0)))","v":1},{"$f":"IF(AND($C296<=4,$C296<>0),0,IF(AND($C296=\"S\",$W296>0),OFFSET(I296,-1,0)+1,OFFSET(I296,-1,0)))","v":0},0,0,{"$f":"IF(OR(W296>0,$C296=1),\"F\",\"\")","v":""},"Serviço",{"$f":"CHOOSE(1+LOG(1+2*(C296=1)+4*(C296=2)+8*(C296=3)+16*(C296=4)+32*(C296=\"S\"),2),\"\",\"Nível 1\",\"Nível 2\",\"Nível 3\",\"Nível 4\",\"Serviço\")","v":"Serviço"},"1.11.2.1.1.","AGETOP",221126,"PISO DE LADRILHO HIDRÁULICO COLORIDO MODELO TÁTIL ( ALERTA OU DIRECIONAL) SEM LASTRO","m2    ",1.63,null,null,null,""]
["S",4,"S",0,1,11,2,1,0,0,0,"","Serviço","Serviço","1.11.2.1.2.","AGETOP",221120,"PISO DE BORRACHA COLORIDO MODELO TÁTIL ( ALERTA OU DIRECIONAL) INCLUSO CONTRAPISO (1CI:3ARML) C/ E=2CM E NATA DE CIMENTO","m2    ",3.07,null,null,null,""]
[3,3,3,4,1,11,3,0,0,10,4,"","Nível 3","Nível 3","1.11.3.","SINAPI",null,"BANHEIROS","-",null,null,null,null,""]
[4,4,4,3,1,11,3,1,0,3,24,"","Nível 4","Nível 4","1.11.3.1.",null,null,"GRANITINA","-",null,null,null,null,""]
["S",4,"S",0,1,11,3,1,0,0,0,"","Serviço","Serviço","1.11.3.1.1.","SINAPI",84191,"PISO EM GRANILITE, MARMORITE OU GRANITINA ESPESSURA 8 MM, INCLUSO JUNTAS DE DILATACAO PLASTICAS","M2",59.04,null,null,null,"Referência: AGETOP - 221101"]
[{"$f":"CHOOSE(1+LOG(1+2*(ORÇAMENTO.Nivel=\"Nível 1\")+4*(ORÇAMENTO.Nivel=\"Nível 2\")+8*(ORÇAMENTO.Nivel=\"Nível 3\")+16*(ORÇAMENTO.Nivel=\"Nível 4\")+32*(ORÇAMENTO.Nivel=\"Serviço\"),2),0,1,2,3,4,\"S\")","v":"S"},{"$f":"IF(OR(C301=\"s\",C301=0),OFFSET(B301,-1,0),C301)","v":4},{"$f":"IF(OFFSET(C301,-1,0)=\"L\",1,IF(OFFSET(C301,-1,0)=1,2,IF(OR(A301=\"s\",A301=0),\"S\",IF(AND(OFFSET(C301,-1,0)=2,A301=4),3,IF(AND(OR(OFFSET(C301,-1,0)=\"s\",OFFSET(C301,-1,0)=0),A301<>\"s\",A301>OFFSET(B301,-1,0)),OFFSET(B301,-1,0),A301)))))","v":"S"},{"$f":"IF(OR(C301=\"S\",C301=0),0,IF(ISERROR(K301),J301,SMALL(J301:K301,1)))","v":0},{"$f":"IF($C301=1,OFFSET(E301,-1,0)+1,OFFSET(E301,-1,0))","v":1},{"$f":"IF($C301=1,0,IF($C301=2,OFFSET(F301,-1,0)+1,OFFSET(F301,-1,0)))","v":11},{"$f":"IF(AND($C301<=2,$C301<>0),0,IF($C301=3,OFFSET(G301,-1,0)+1,OFFSET(G301,-1,0)))","v":3},{"$f":"IF(AND($C301<=3,$C301<>0),0,IF($C301=4,OFFSET(H301,-1,0)+1,OFFSET(H301,-1,0)))","v":1},{"$f":"IF(AND($C301<=4,$C301<>0),0,IF(AND($C301=\"S\",$W301>0),OFFSET(I301,-1,0)+1,OFFSET(I301,-1,0)))","v":0},0,0,{"$f":"IF(OR(W301>0,$C301=1),\"F\",\"\")","v":""},"Serviço",{"$f":"CHOOSE(1+LOG(1+2*(C301=1)+4*(C301=2)+8*(C301=3)+16*(C301=4)+32*(C301=\"S\"),2),\"\",\"Nível 1\",\"Nível 2\",\"Nível 3\",\"Nível 4\",\"Serviço\")","v":"Serviço"},"1.11.3.1.2.","AGETOP",221104,"RASPAGEM E APLICAÇÃO RESINA ACRÍLICA DUAS DEMÃOS","m2    ",59.04,null,null,null,""]
[{"$f":"CHOOSE(1+LOG(1+2*(ORÇAMENTO.Nivel=\"Nível 1\")+4*(ORÇAMENTO.Nivel=\"Nível 2\")+8*(ORÇAMENTO.Nivel=\"Nível 3\")+16*(ORÇAMENTO.Nivel=\"Nível 4\")+32*(ORÇAMENTO.Nivel=\"Serviço\"),2),0,1,2,3,4,\"S\")","v":3},{"$f":"IF(OR(C302=\"s\",C302=0),OFFSET(B302,-1,0),C302)","v":3},{"$f":"IF(OFFSET(C302,-1,0)=\"L\",1,IF(OFFSET(C302,-1,0)=1,2,IF(OR(A302=\"s\",A302=0),\"S\",IF(AND(OFFSET(C302,-1,0)=2,A302=4),3,IF(AND(OR(OFFSET(C302,-1,0)=\"s\",OFFSET(C302,-1,0)=0),A302<>\"s\",A302>OFFSET(B302,-1,0)),OFFSET(B302,-1,0),A302)))))","v":3},{"$f":"IF(OR(C302=\"S\",C302=0),0,IF(ISERROR(K302),J302,SMALL(J302:K302,1)))","v":4},{"$f":"IF($C302=1,OFFSET(E302,-1,0)+1,OFFSET(E302,-1,0))","v":1},{"$f":"IF($C302=1,0,IF($C302=2,OFFSET(F302,-1,0)+1,OFFSET(F302,-1,0)))","v":11},{"$f":"IF(AND($C302<=2,$C302<>0),0,IF($C302=3,OFFSET(G302,-1,0)+1,OFFSET(G302,-1,0)))","v":4},{"$f":"IF(AND($C302<=3,$C302<>0),0,IF($C302=4,OFFSET(H302,-1,0)+1,OFFSET(H302,-1,0)))","v":0},{"$f":"IF(AND($C302<=4,$C302<>0),0,IF(AND($C302=\"S\",$W302>0),OFFSET(I302,-1,0)+1,OFFSET(I302,-1,0)))","v":0},6,4,{"$f":"IF(OR(W302>0,$C302=1),\"F\",\"\")","v":""},"Nível 3",{"$f":"CHOOSE(1+LOG(1+2*(C302=1)+4*(C302=2)+8*(C302=3)+16*(C302=4)+32*(C302=\"S\"),2),\"\",\"Nível 1\",\"Nível 2\",\"Nível 3\",\"Nível 4\",\"Serviço\")","v":"Nível 3"},"1.11.4.","SINAPI",null,"QUADRA","-",null,null,null,null,""]
[{"$f":"CHOOSE(1+LOG(1+2*(ORÇAMENTO.Nivel=\"Nível 1\")+4*(ORÇAMENTO.Nivel=\"Nível 2\")+8*(ORÇAMENTO.Nivel=\"Nível 3\")+16*(ORÇAMENTO.Nivel=\"Nível 4\")+32*(ORÇAMENTO.Nivel=\"Serviço\"),2),0,1,2,3,4,\"S\")","v":4},{"$f":"IF(OR(C303=\"s\",C303=0),OFFSET(B303,-1,0),C303)","v":4},{"$f":"IF(OFFSET(C303,-1,0)=\"L\",1,IF(OFFSET(C303,-1,0)=1,2,IF(OR(A303=\"s\",A303=0),\"S\",IF(AND(OFFSET(C303,-1,0)=2,A303=4),3,IF(AND(OR(OFFSET(C303,-1,0)=\"s\",OFFSET(C303,-1,0)=0),A303<>\"s\",A303>OFFSET(B303,-1,0)),OFFSET(B303,-1,0),A303)))))","v":4},{"$f":"IF(OR(C303=\"S\",C303=0),0,IF(ISERROR(K303),J303,SMALL(J303:K303,1)))","v":3},{"$f":"IF($C303=1,OFFSET(E303,-1,0)+1,OFFSET(E303,-1,0))","v":1},{"$f":"IF($C303=1,0,IF($C303=2,OFFSET(F303,-1,0)+1,OFFSET(F303,-1,0)))","v":11},{"$f":"IF(AND($C303<=2,$C303<>0),0,IF($C303=3,OFFSET(G303,-1,0)+1,OFFSET(G303,-1,0)))","v":4},{"$f":"IF(AND($C303<=3,$C303<>0),0,IF($C303=4,OFFSET(H303,-1,0)+1,OFFSET(H303,-1,0)))","v":1},{"$f":"IF(AND($C303<=4,$C303<>0),0,IF(AND($C303=\"S\",$W303>0),OFFSET(I303,-1,0)+1,OFFSET(I303,-1,0)))","v":0},3,20,{"$f":"IF(OR(W303>0,$C303=1),\"F\",\"\")","v":""},"Nível 4",{"$f":"CHOOSE(1+LOG(1+2*(C303=1)+4*(C303=2)+8*(C303=3)+16*(C303=4)+32*(C303=\"S\"),2),\"\",\"Nível 1\",\"Nível 2\",\"Nível 3\",\"Nível 4\",\"Serviço\")","v":"Nível 4"},"1.11.4.1.","SINAPI",null,"CONCRETO","-",null,null,null,null,""]
[{"$f":"CHOOSE(1+LOG(1+2*(ORÇAMENTO.Nivel=\"Nível 1\")+4*(ORÇAMENTO.Nivel=\"Nível 2\")+8*(ORÇAMENTO.Nivel=\"Nível 3\")+16*(ORÇAMENTO.Nivel=\"Nível 4\")+32*(ORÇAMENTO.Nivel=\"Serviço\"),2),0,1,2,3,4,\"S\")","v":"S"},4,"S",0,1,11,4,1,0,0,0,"","Serviço","Serviço","1.11.4.1.1.","AGETOP",220061,"PISO LAMINADO COM CONCRETO USINADO 20MPA E=7 CM  ","m2    ",488.59,null,null,null,""]
[{"$f":"CHOOSE(1+LOG(1+2*(ORÇAMENTO.Nivel=\"Nível 1\")+4*(ORÇAMENTO.Nivel=\"Nível 2\")+8*(ORÇAMENTO.Nivel=\"Nível 3\")+16*(ORÇAMENTO.Nivel=\"Nível 4\")+32*(ORÇAMENTO.Nivel=\"Serviço\"),2),0,1,2,3,4,\"S\")","v":"S"},4,"S",0,1,11,4,1,0,0,0,"","Serviço","Serviço","1.11.4.1.2.","AGETOP",220102,"PISO CONCRETO DESEMPENADO ESPESSURA = 5 CM  1:2,5:3,5","m2    ",108.5,null,null,null,""]
[3,3,3,2,1,11,5,0,0,2,{"$error":"#N/A"},"","Nível 3","Nível 3","1.11.5.",null,null,"IMPLANTAÇÃO PROJ. COMPLEMENTÁRES","-",null,null,null,null,""]
["S",3,"S",0,1,11,5,0,0,0,0,"","Serviço","Serviço","1.11.5.0.1.","AGETOP",220102,"PISO CONCRETO DESEMPENADO ESPESSURA = 5 CM  1:2,5:3,5","m2    ",40.340000000000003,null,null,null,""]
[2,2,2,6,1,12,0,0,0,43,6,"","Nível 2","Nível 2","1.12.",null,null,"FERRAGENS","-",null,null,null,null,""]
[3,3,3,3,1,12,1,0,0,5,3,"","Nível 3","Nível 3","1.12.1.","SINAPI",null,"BANHEIROS","-",null,null,null,null,""]
["S",3,"S",0,1,12,1,0,0,0,0,"","Serviço","Serviço","1.12.1.0.1.","AGETOP",230176,"BARRA DE APOIO EM AÇO INOX - 80 CM ","un    ",12,null,null,null,""]
["S",3,"S",0,1,12,1,0,0,0,0,"","Serviço","Serviço","1.12.1.0.2.","AGETOP",230174,"BARRA DE APOIO EM AÇO INOX - 40 CM","un    ",12,null,null,null,""]
[3,3,3,2,1,12,2,0,0,2,24,"","Nível 3","Nível 3","1.12.2.","SINAPI",null,"COZINHA E DESPENSA","-",null,null,null,null,""]
[{"$f":"CHOOSE(1+LOG(1+2*(ORÇAMENTO.Nivel=\"Nível 1\")+4*(ORÇAMENTO.Nivel=\"Nível 2\")+8*(ORÇAMENTO.Nivel=\"Nível 3\")+16*(ORÇAMENTO.Nivel=\"Nível 4\")+32*(ORÇAMENTO.Nivel=\"Serviço\"),2),0,1,2,3,4,\"S\")","v":"S"},{"$f":"IF(OR(C313=\"s\",C313=0),OFFSET(B313,-1,0),C313)","v":3},{"$f":"IF(OFFSET(C313,-1,0)=\"L\",1,IF(OFFSET(C313,-1,0)=1,2,IF(OR(A313=\"s\",A313=0),\"S\",IF(AND(OFFSET(C313,-1,0)=2,A313=4),3,IF(AND(OR(OFFSET(C313,-1,0)=\"s\",OFFSET(C313,-1,0)=0),A313<>\"s\",A313>OFFSET(B313,-1,0)),OFFSET(B313,-1,0),A313)))))","v":"S"},{"$f":"IF(OR(C313=\"S\",C313=0),0,IF(ISERROR(K313),J313,SMALL(J313:K313,1)))","v":0},{"$f":"IF($C313=1,OFFSET(E313,-1,0)+1,OFFSET(E313,-1,0))","v":1},{"$f":"IF($C313=1,0,IF($C313=2,OFFSET(F313,-1,0)+1,OFFSET(F313,-1,0)))","v":12},{"$f":"IF(AND($C313<=2,$C313<>0),0,IF($C313=3,OFFSET(G313,-1,0)+1,OFFSET(G313,-1,0)))","v":2},{"$f":"IF(AND($C313<=3,$C313<>0),0,IF($C313=4,OFFSET(H313,-1,0)+1,OFFSET(H313,-1,0)))","v":0},{"$f":"IF(AND($C313<=4,$C313<>0),0,IF(AND($C313=\"S\",$W313>0),OFFSET(I313,-1,0)+1,OFFSET(I313,-1,0)))","v":0},0,0,{"$f":"IF(OR(W313>0,$C313=1),\"F\",\"\")","v":""},"Serviço",{"$f":"CHOOSE(1+LOG(1+2*(C313=1)+4*(C313=2)+8*(C313=3)+16*(C313=4)+32*(C313=\"S\"),2),\"\",\"Nível 1\",\"Nível 2\",\"Nível 3\",\"Nível 4\",\"Serviço\")","v":"Serviço"},"1.12.2.0.1.","COMPOSIÇÃO","COMP 575_SEE","MOLA AEREA FECHA PORTA, PARA PORTAS COM LARGURA ATE 95 CM","UN ",2,null,null,null,""]
[2,{"$f":"IF(OR(C314=\"s\",C314=0),OFFSET(B314,-1,0),C314)","v":2},{"$f":"IF(OFFSET(C314,-1,0)=\"L\",1,IF(OFFSET(C314,-1,0)=1,2,IF(OR(A314=\"s\",A314=0),\"S\",IF(AND(OFFSET(C314,-1,0)=2,A314=4),3,IF(AND(OR(OFFSET(C314,-1,0)=\"s\",OFFSET(C314,-1,0)=0),A314<>\"s\",A314>OFFSET(B314,-1,0)),OFFSET(B314,-1,0),A314)))))","v":2},{"$f":"IF(OR(C314=\"S\",C314=0),0,IF(ISERROR(K314),J314,SMALL(J314:K314,1)))","v":4},{"$f":"IF($C314=1,OFFSET(E314,-1,0)+1,OFFSET(E314,-1,0))","v":1},{"$f":"IF($C314=1,0,IF($C314=2,OFFSET(F314,-1,0)+1,OFFSET(F314,-1,0)))","v":13},{"$f":"IF(AND($C314<=2,$C314<>0),0,IF($C314=3,OFFSET(G314,-1,0)+1,OFFSET(G314,-1,0)))","v":0},{"$f":"IF(AND($C314<=3,$C314<>0),0,IF($C314=4,OFFSET(H314,-1,0)+1,OFFSET(H314,-1,0)))","v":0},{"$f":"IF(AND($C314<=4,$C314<>0),0,IF(AND($C314=\"S\",$W314>0),OFFSET(I314,-1,0)+1,OFFSET(I314,-1,0)))","v":0},37,4,{"$f":"IF(OR(W314>0,$C314=1),\"F\",\"\")","v":""},"Nível 2",{"$f":"CHOOSE(1+LOG(1+2*(C314=1)+4*(C314=2)+8*(C314=3)+16*(C314=4)+32*(C314=\"S\"),2),\"\",\"Nível 1\",\"Nível 2\",\"Nível 3\",\"Nível 4\",\"Serviço\")","v":"Nível 2"},"1.13.",null,null,"ADMINISTRAÇÃO","-",null,null,null,null,""]
[3,3,3,3,1,13,1,0,0,3,12,"","Nível 3","Nível 3","1.13.1.",null,null,"MENSALISTAS","-",null,null,null,null,""]
["S",3,"S",0,1,13,1,0,0,0,0,"","Serviço","Serviço","1.13.1.0.1.","SINAPI",90778,"ENGENHEIRO CIVIL DE OBRA PLENO COM ENCARGOS COMPLEMENTARES","H",132,null,null,null,"Referência: AGETOP - 250101"]
["S",3,"S",0,1,13,1,0,0,0,0,"","Serviço","Serviço","1.13.1.0.2.","SINAPI",90776,"ENCARREGADO GERAL COM ENCARGOS COMPLEMENTARES","H",660,null,null,null,"Referência: AGETOP - 250103"]
[{"$f":"CHOOSE(1+LOG(1+2*(ORÇAMENTO.Nivel=\"Nível 1\")+4*(ORÇAMENTO.Nivel=\"Nível 2\")+8*(ORÇAMENTO.Nivel=\"Nível 3\")+16*(ORÇAMENTO.Nivel=\"Nível 4\")+32*(ORÇAMENTO.Nivel=\"Serviço\"),2),0,1,2,3,4,\"S\")","v":2},2,2,24,1,14,0,0,0,33,24,"","Nível 2","Nível 2","1.14.",null,null,"PINTURA","-",null,null,null,null,""]
[3,3,3,8,1,14,1,0,0,23,8,"","Nível 3","Nível 3","1.14.1.","SINAPI",null,"BANHEIROS","-",null,null,null,null,""]
[4,4,4,3,1,14,1,1,0,7,3,"","Nível 4","Nível 4","1.14.1.1.","SINAPI",null,"ESQUADRIAS EXISTENTES","-",null,null,null,null,""]
["S",4,"S",0,1,14,1,1,0,0,0,"","Serviço","Serviço","1.14.1.1.1.","AGETOP",260105,"REMOCAO DE PINTURA ANTIGA A OLEO OU ESMALTE","m2    ",40.24,null,null,null,""]
["S",4,"S",0,1,14,1,1,0,0,0,"","Serviço","Serviço","1.14.1.1.2.","AGETOP",261503,"PINT.ESMALTE 2 DEM. ESQ.FERRO (SEM FUNDO ANTICOR.)","m2    ",40.239999999999995,null,null,null,""]
[4,4,4,2,1,14,1,2,0,4,2,"","Nível 4","Nível 4","1.14.1.2.","SINAPI",null,"ESQUADRIAS NOVAS","-",null,null,null,null,""]
["S",4,"S",0,1,14,1,2,0,0,0,"","Serviço","Serviço","1.14.1.2.1.","AGETOP",261602,"PINT.ESMALTE/ESQUAD.FERRO C/FUNDO ANTICOR.","m2    ",39.96,null,null,null,""]
[4,4,4,2,1,14,1,3,0,2,{"$error":"#N/A"},"","Nível 4","Nível 4","1.14.1.3.","SINAPI",null,"TETO","-",null,null,null,null,""]
["S",4,"S",0,1,14,1,3,0,0,0,"","Serviço","Serviço","1.14.1.3.1.","SINAPI",88486,"APLICAÇÃO MANUAL DE PINTURA COM TINTA LÁTEX PVA EM TETO, DUAS DEMÃOS. AF_06/2014","M2",59.04,null,null,null,"Referência: AGETOP - 261307"]
[3,3,3,9,1,14,2,0,0,15,9,"","Nível 3","Nível 3","1.14.2.","SINAPI",null,"QUADRA EXISTENTE","-",null,null,null,null,""]
[4,4,4,3,1,14,2,1,0,8,3,"","Nível 4","Nível 4","1.14.2.1.","SINAPI",null,"ESQUADRIAS EXISTENTES","-",null,null,null,null,""]
["S",4,"S",0,1,14,2,1,0,0,0,"","Serviço","Serviço","1.14.2.1.1.","AGETOP",260105,"REMOCAO DE PINTURA ANTIGA A OLEO OU ESMALTE","m2    ",15.12,null,null,null,""]
["S",4,"S",0,1,14,2,1,0,0,0,"","Serviço","Serviço","1.14.2.1.2.","AGETOP",261503,"PINT.ESMALTE 2 DEM. ESQ.FERRO (SEM FUNDO ANTICOR.)","m2    ",15.12,null,null,null,""]
[4,4,4,3,1,14,2,2,0,5,3,"","Nível 4","Nível 4","1.14.2.2.","SINAPI",null,"QUADRA DE ESPORTES","-",null,null,null,null,""]
["S",4,"S",0,1,14,2,2,0,0,0,"","Serviço","Serviço","1.14.2.2.1.","SINAPI","74245/1","PINTURA ACRILICA EM PISO CIMENTADO DUAS DEMAOS","M2",596.58999999999992,null,null,null,"Referência: AGETOP - 261703"]
["S",4,"S",0,1,14,2,2,0,0,0,"","Serviço","Serviço","1.14.2.2.2.","SINAPI",41595,"PINTURA ACRILICA DE FAIXAS DE DEMARCACAO EM QUADRA POLIESPORTIVA, 5 CM DE LARGURA","M",313.18,null,null,null,"Referência: AGETOP - 261700"]
[4,4,4,2,1,14,2,3,0,2,{"$error":"#N/A"},"","Nível 4","Nível 4","1.14.2.3.","SINAPI",null,"ESQUADRIAS NOVAS","-",null,null,null,null,""]
["S",4,"S",0,1,14,2,3,0,0,0,"","Serviço","Serviço","1.14.2.3.1.","AGETOP",261602,"PINT.ESMALTE/ESQUAD.FERRO C/FUNDO ANTICOR.","m2    ",395.76,null,null,null,""]
[3,3,3,6,1,14,3,0,0,6,{"$error":"#N/A"},"","Nível 3","Nível 3","1.14.3.","SINAPI",null,"PINTURA GERAL","-",null,null,null,null,""]
["S",3,"S",0,1,14,3,0,0,0,0,"","Serviço","Serviço","1.14.3.0.1.","SINAPI",88486,"APLICAÇÃO MANUAL DE PINTURA COM TINTA LÁTEX PVA EM TETO, DUAS DEMÃOS. AF_06/2014","M2",24.26,null,null,null,"Referência: AGETOP - 261307"]
["S",3,"S",0,1,14,3,0,0,0,0,"","Serviço","Serviço","1.14.3.0.2.","AGETOP",260104,"REMOCAO DE PINTURA ANTIGA A LATEX","m2    ",356.69000000000005,null,null,null,""]
["S",3,"S",0,1,14,3,0,0,{"$f":"IF(OR($C339=\"S\",$C339=0),0,MATCH(0,OFFSET($D339,1,$C339,ROW($C$377)-ROW($C339)),0))","v":0},{"$f":"IF(OR($C339=\"S\",$C339=0),0,MATCH(OFFSET($D339,0,$C339)+1,OFFSET($D339,1,$C339,ROW($C$377)-ROW($C339)),0))","v":0},"","Serviço","Serviço","1.14.3.0.3.","AGETOP",260105,"REMOCAO DE PINTURA ANTIGA A OLEO OU ESMALTE","m2    ",37.879999999999995,null,null,null,""]
["S",3,"S",0,1,14,3,0,0,0,0,"","Serviço","Serviço","1.14.3.0.4.","AGETOP",261503,"PINT.ESMALTE 2 DEM. ESQ.FERRO (SEM FUNDO ANTICOR.)","m2    ",37.879999999999995,null,null,null,""]
["S",3,"S",0,1,14,3,0,0,0,0,"","Serviço","Serviço","1.14.3.0.5.","SINAPI",88489,"APLICAÇÃO MANUAL DE PINTURA COM TINTA LÁTEX ACRÍLICA EM PAREDES, DUAS DEMÃOS. AF_06/2014","M2",1189.01,null,null,null,"Referência: AGETOP - 261001"]
[2,2,2,9,1,15,0,0,0,9,{"$error":"#N/A"},"","Nível 2","Nível 2","1.15.",null,null,"DIVERSOS","-",null,null,null,null,""]
[{"$f":"CHOOSE(1+LOG(1+2*(ORÇAMENTO.Nivel=\"Nível 1\")+4*(ORÇAMENTO.Nivel=\"Nível 2\")+8*(ORÇAMENTO.Nivel=\"Nível 3\")+16*(ORÇAMENTO.Nivel=\"Nível 4\")+32*(ORÇAMENTO.Nivel=\"Serviço\"),2),0,1,2,3,4,\"S\")","v":3},{"$f":"IF(OR(C343=\"s\",C343=0),OFFSET(B343,-1,0),C343)","v":3},{"$f":"IF(OFFSET(C343,-1,0)=\"L\",1,IF(OFFSET(C343,-1,0)=1,2,IF(OR(A343=\"s\",A343=0),\"S\",IF(AND(OFFSET(C343,-1,0)=2,A343=4),3,IF(AND(OR(OFFSET(C343,-1,0)=\"s\",OFFSET(C343,-1,0)=0),A343<>\"s\",A343>OFFSET(B343,-1,0)),OFFSET(B343,-1,0),A343)))))","v":3},{"$f":"IF(OR(C343=\"S\",C343=0),0,IF(ISERROR(K343),J343,SMALL(J343:K343,1)))","v":4},{"$f":"IF($C343=1,OFFSET(E343,-1,0)+1,OFFSET(E343,-1,0))","v":1},{"$f":"IF($C343=1,0,IF($C343=2,OFFSET(F343,-1,0)+1,OFFSET(F343,-1,0)))","v":15},{"$f":"IF(AND($C343<=2,$C343<>0),0,IF($C343=3,OFFSET(G343,-1,0)+1,OFFSET(G343,-1,0)))","v":1},{"$f":"IF(AND($C343<=3,$C343<>0),0,IF($C343=4,OFFSET(H343,-1,0)+1,OFFSET(H343,-1,0)))","v":0},{"$f":"IF(AND($C343<=4,$C343<>0),0,IF(AND($C343=\"S\",$W343>0),OFFSET(I343,-1,0)+1,OFFSET(I343,-1,0)))","v":0},8,4,{"$f":"IF(OR(W343>0,$C343=1),\"F\",\"\")","v":""},"Nível 3",{"$f":"CHOOSE(1+LOG(1+2*(C343=1)+4*(C343=2)+8*(C343=3)+16*(C343=4)+32*(C343=\"S\"),2),\"\",\"Nível 1\",\"Nível 2\",\"Nível 3\",\"Nível 4\",\"Serviço\")","v":"Nível 3"},"1.15.1.","SINAPI",null,"QUADRA EXISTENTE","-",null,null,null,null,""]
["S",3,"S",0,1,15,1,0,0,0,0,"","Serviço","Serviço","1.15.1.0.1.","AGETOP",271099,"TABELA PARA BASQUETE ESTRUTURA METÁLICA E COMPENSADO (ASSENT./PINTADAS) ARO METÁLICO - 2 UNID.","CJ    ",1,null,null,null,""]
["S",3,"S",0,1,15,1,0,0,0,0,"","Serviço","Serviço","1.15.1.0.2.","AGETOP",271101,"TRAVES FERRO GALVANIZADO PARA FUTEBOL DE SALÃO PINTADAS - 3,00 x 2,00M - 2 UNID.","CJ    ",1,null,null,null,""]
["S",3,"S",0,1,15,1,0,0,0,0,"","Serviço","Serviço","1.15.1.0.3.","AGETOP",270621,"ALAMBRADO EM TUBO INDUSTRIAL 2\"#2,28 E TELA MALHA 4\" FIO 12 (QUADRA ESPORTE EXISTENTE) SEM PINTURA","m2    ",263.83999999999997,null,null,null,""]
[3,3,3,2,1,15,2,0,0,4,2,"","Nível 3","Nível 3","1.15.2.","SINAPI",null,"COZINHA E DESPENSA","-",null,null,null,null,""]
["S",3,"S",0,1,15,2,0,0,0,0,"","Serviço","Serviço","1.15.2.0.1.","AGETOP",271304,"BANCADA DE ARDOSIA POLIDA","m2    ",4.01,null,null,null,""]
[3,3,3,2,1,15,3,0,0,2,{"$error":"#N/A"},"","Nível 3","Nível 3","1.15.3.","SINAPI",null,"LIMPEZA FINAL","-",null,null,null,null,""]
[{"$f":"CHOOSE(1+LOG(1+2*(ORÇAMENTO.Nivel=\"Nível 1\")+4*(ORÇAMENTO.Nivel=\"Nível 2\")+8*(ORÇAMENTO.Nivel=\"Nível 3\")+16*(ORÇAMENTO.Nivel=\"Nível 4\")+32*(ORÇAMENTO.Nivel=\"Serviço\"),2),0,1,2,3,4,\"S\")","v":"S"},{"$f":"IF(OR(C350=\"s\",C350=0),OFFSET(B350,-1,0),C350)","v":3},{"$f":"IF(OFFSET(C350,-1,0)=\"L\",1,IF(OFFSET(C350,-1,0)=1,2,IF(OR(A350=\"s\",A350=0),\"S\",IF(AND(OFFSET(C350,-1,0)=2,A350=4),3,IF(AND(OR(OFFSET(C350,-1,0)=\"s\",OFFSET(C350,-1,0)=0),A350<>\"s\",A350>OFFSET(B350,-1,0)),OFFSET(B350,-1,0),A350)))))","v":"S"},{"$f":"IF(OR(C350=\"S\",C350=0),0,IF(ISERROR(K350),J350,SMALL(J350:K350,1)))","v":0},{"$f":"IF($C350=1,OFFSET(E350,-1,0)+1,OFFSET(E350,-1,0))","v":1},{"$f":"IF($C350=1,0,IF($C350=2,OFFSET(F350,-1,0)+1,OFFSET(F350,-1,0)))","v":15},{"$f":"IF(AND($C350<=2,$C350<>0),0,IF($C350=3,OFFSET(G350,-1,0)+1,OFFSET(G350,-1,0)))","v":3},{"$f":"IF(AND($C350<=3,$C350<>0),0,IF($C350=4,OFFSET(H350,-1,0)+1,OFFSET(H350,-1,0)))","v":0},{"$f":"IF(AND($C350<=4,$C350<>0),0,IF(AND($C350=\"S\",$W350>0),OFFSET(I350,-1,0)+1,OFFSET(I350,-1,0)))","v":0},0,0,{"$f":"IF(OR(W350>0,$C350=1),\"F\",\"\")","v":""},"Serviço",{"$f":"CHOOSE(1+LOG(1+2*(C350=1)+4*(C350=2)+8*(C350=3)+16*(C350=4)+32*(C350=\"S\"),2),\"\",\"Nível 1\",\"Nível 2\",\"Nível 3\",\"Nível 4\",\"Serviço\")","v":"Serviço"},"1.15.3.0.1.","AGETOP",270501,"LIMPEZA FINAL DE OBRA - (OBRAS CIVIS)","m2    ",240.11,null,null,null,""]
[{"$f":"CHOOSE(1+LOG(1+2*(ORÇAMENTO.Nivel=\"Nível 1\")+4*(ORÇAMENTO.Nivel=\"Nível 2\")+8*(ORÇAMENTO.Nivel=\"Nível 3\")+16*(ORÇAMENTO.Nivel=\"Nível 4\")+32*(ORÇAMENTO.Nivel=\"Serviço\"),2),0,1,2,3,4,\"S\")","v":1},{"$f":"IF(OR(C351=\"s\",C351=0),OFFSET(B351,-1,0),C351)","v":1},{"$f":"IF(OFFSET(C351,-1,0)=\"L\",1,IF(OFFSET(C351,-1,0)=1,2,IF(OR(A351=\"s\",A351=0),\"S\",IF(AND(OFFSET(C351,-1,0)=2,A351=4),3,IF(AND(OR(OFFSET(C351,-1,0)=\"s\",OFFSET(C351,-1,0)=0),A351<>\"s\",A351>OFFSET(B351,-1,0)),OFFSET(B351,-1,0),A351)))))","v":1},{"$f":"IF(OR(C351=\"S\",C351=0),0,IF(ISERROR(K351),J351,SMALL(J351:K351,1)))","v":26},{"$f":"IF($C351=1,OFFSET(E351,-1,0)+1,OFFSET(E351,-1,0))","v":2},{"$f":"IF($C351=1,0,IF($C351=2,OFFSET(F351,-1,0)+1,OFFSET(F351,-1,0)))","v":0},{"$f":"IF(AND($C351<=2,$C351<>0),0,IF($C351=3,OFFSET(G351,-1,0)+1,OFFSET(G351,-1,0)))","v":0},{"$f":"IF(AND($C351<=3,$C351<>0),0,IF($C351=4,OFFSET(H351,-1,0)+1,OFFSET(H351,-1,0)))","v":0},{"$f":"IF(AND($C351<=4,$C351<>0),0,IF(AND($C351=\"S\",$W351>0),OFFSET(I351,-1,0)+1,OFFSET(I351,-1,0)))","v":0},26,{"$error":"#N/A"},{"$f":"IF(OR(W351>0,$C351=1),\"F\",\"\")","v":"F"},"Nível 1",{"$f":"CHOOSE(1+LOG(1+2*(C351=1)+4*(C351=2)+8*(C351=3)+16*(C351=4)+32*(C351=\"S\"),2),\"\",\"Nível 1\",\"Nível 2\",\"Nível 3\",\"Nível 4\",\"Serviço\")","v":"Nível 1"},"2.","SINAPI",null,"RESERVATÓRIO ENTERRADO","-",1,null,null,null,""]
[2,2,2,2,2,1,0,0,0,25,2,"","Nível 2","Nível 2","2.1.","SINAPI",null,"SERVIÇOS PRELIMINARES","-",null,null,null,null,""]
["S",2,"S",0,2,1,0,0,0,0,0,"","Serviço","Serviço","2.1.0.0.1.","AGETOP",20701,"LOCAÇÃO DA OBRA, EXECUÇÃO DE GABARITO SEM REAPROVEITAMENTO, INCLUSO PINTURA (FACE INTERNA DO RIPÃO 15CM) E PIQUETE COM TESTEMUNHA","m2    ",12.24,null,null,null,""]
[2,2,2,3,2,2,0,0,0,23,3,"","Nível 2","Nível 2","2.2.","AGETOP",null,"SERVIÇO EM TERRA","-",null,null,null,null,""]
["S",2,"S",0,2,2,0,0,0,0,0,"","Serviço","Serviço","2.2.0.0.1.","SINAPI",93358,"ESCAVAÇÃO MANUAL DE VALA COM PROFUNDIDADE MENOR OU IGUAL A 1,30 M. AF_03/2016","M3",25.58,null,null,null,"Referência: AGETOP - 40101"]
["S",2,"S",0,2,2,0,0,0,0,0,"","Serviço","Serviço","2.2.0.0.2.","SINAPI",96995,"REATERRO MANUAL APILOADO COM SOQUETE. AF_10/2017","M3",12.28,null,null,null,"Referência: AGETOP - 40902"]
[2,2,2,3,2,3,0,0,0,20,3,"","Nível 2","Nível 2","2.3.","AGETOP",null,"FUNDAÇÕES E SONDAGENS","-",null,null,null,null,""]
["S",2,"S",0,2,3,0,0,0,0,0,"","Serviço","Serviço","2.3.0.0.1.","SINAPI",94964,"CONCRETO FCK = 20MPA, TRAÇO 1:2,7:3 (CIMENTO/ AREIA MÉDIA/ BRITA 1)  - PREPARO MECÂNICO COM BETONEIRA 400 L. AF_07/2016","M3",0.61,null,null,null,""]
[{"$f":"CHOOSE(1+LOG(1+2*(ORÇAMENTO.Nivel=\"Nível 1\")+4*(ORÇAMENTO.Nivel=\"Nível 2\")+8*(ORÇAMENTO.Nivel=\"Nível 3\")+16*(ORÇAMENTO.Nivel=\"Nível 4\")+32*(ORÇAMENTO.Nivel=\"Serviço\"),2),0,1,2,3,4,\"S\")","v":"S"},{"$f":"IF(OR(C359=\"s\",C359=0),OFFSET(B359,-1,0),C359)","v":2},{"$f":"IF(OFFSET(C359,-1,0)=\"L\",1,IF(OFFSET(C359,-1,0)=1,2,IF(OR(A359=\"s\",A359=0),\"S\",IF(AND(OFFSET(C359,-1,0)=2,A359=4),3,IF(AND(OR(OFFSET(C359,-1,0)=\"s\",OFFSET(C359,-1,0)=0),A359<>\"s\",A359>OFFSET(B359,-1,0)),OFFSET(B359,-1,0),A359)))))","v":"S"},{"$f":"IF(OR(C359=\"S\",C359=0),0,IF(ISERROR(K359),J359,SMALL(J359:K359,1)))","v":0},{"$f":"IF($C359=1,OFFSET(E359,-1,0)+1,OFFSET(E359,-1,0))","v":2},{"$f":"IF($C359=1,0,IF($C359=2,OFFSET(F359,-1,0)+1,OFFSET(F359,-1,0)))","v":3},{"$f":"IF(AND($C359<=2,$C359<>0),0,IF($C359=3,OFFSET(G359,-1,0)+1,OFFSET(G359,-1,0)))","v":0},{"$f":"IF(AND($C359<=3,$C359<>0),0,IF($C359=4,OFFSET(H359,-1,0)+1,OFFSET(H359,-1,0)))","v":0},{"$f":"IF(AND($C359<=4,$C359<>0),0,IF(AND($C359=\"S\",$W359>0),OFFSET(I359,-1,0)+1,OFFSET(I359,-1,0)))","v":0},0,0,{"$f":"IF(OR(W359>0,$C359=1),\"F\",\"\")","v":""},"Serviço",{"$f":"CHOOSE(1+LOG(1+2*(C359=1)+4*(C359=2)+8*(C359=3)+16*(C359=4)+32*(C359=\"S\"),2),\"\",\"Nível 1\",\"Nível 2\",\"Nível 3\",\"Nível 4\",\"Serviço\")","v":"Serviço"},"2.3.0.0.2.","AGETOP",51026,"LANÇAMENTO/APLICAÇÃO/ADENSAMENTO DE CONCRETO EM FUNDAÇÃO- (O.C.)","m3    ",0.61,null,null,null,""]
[2,2,2,6,2,4,0,0,0,17,6,"","Nível 2","Nível 2","2.4.","AGETOP",null,"ESTRUTURA","-",null,null,null,null,""]
["S",2,"S",0,2,4,0,0,0,0,0,"","Serviço","Serviço","2.4.0.0.1.","SINAPI",92418,"MONTAGEM E DESMONTAGEM DE FÔRMA DE PILARES RETANGULARES E ESTRUTURAS SIMILARES COM ÁREA MÉDIA DAS SEÇÕES MENOR OU IGUAL A 0,25 M², PÉ-DIREITO SIMPLES, EM CHAPA DE MADEIRA COMPENSADA RESINADA, 4 UTILIZAÇÕES. AF_12/2015","M2",65.739999999999995,null,null,null,"Referência: AGETOP - 60209"]
["S",2,"S",0,2,4,0,0,0,0,0,"","Serviço","Serviço","2.4.0.0.2.","SINAPI",94965,"CONCRETO FCK = 25MPA, TRAÇO 1:2,3:2,7 (CIMENTO/ AREIA MÉDIA/ BRITA 1)  - PREPARO MECÂNICO COM BETONEIRA 400 L. AF_07/2016","M3",6.61,null,null,null,"Referência: AGETOP - 51030"]
["S",2,"S",0,2,4,0,0,0,0,0,"","Serviço","Serviço","2.4.0.0.3.","SINAPI",92873,"LANÇAMENTO COM USO DE BALDES, ADENSAMENTO E ACABAMENTO DE CONCRETO EM ESTRUTURAS. AF_12/2015","M3",6.61,null,null,null,"Referência: AGETOP - 60801"]
["S",2,"S",0,2,4,0,0,0,0,0,"","Serviço","Serviço","2.4.0.0.4.","SINAPI",92776,"ARMAÇÃO DE PILAR OU VIGA DE UMA ESTRUTURA CONVENCIONAL DE CONCRETO ARMADO EM UMA EDIFICAÇÃO TÉRREA OU SOBRADO UTILIZANDO AÇO CA-50 DE 6,3 MM - MONTAGEM. AF_12/2015","KG",422,null,null,null,"Referência: AGETOP - 60303"]
["S",2,"S",0,2,4,0,0,0,0,0,"","Serviço","Serviço","2.4.0.0.5.","SINAPI",92775,"ARMAÇÃO DE PILAR OU VIGA DE UMA ESTRUTURA CONVENCIONAL DE CONCRETO ARMADO EM UMA EDIFICAÇÃO TÉRREA OU SOBRADO UTILIZANDO AÇO CA-60 DE 5,0 MM - MONTAGEM. AF_12/2015","KG",11,null,null,null,"Referência: AGETOP - 60314"]
[2,2,2,6,2,5,0,0,0,11,6,"","Nível 2","Nível 2","2.5.","SINAPI",null,"IMPERMEABILIZAÇÃO","-",null,null,null,null,""]
["S",2,"S",0,2,5,0,0,0,0,0,"","Serviço","Serviço","2.5.0.0.1.","AGETOP",120101,"REGULARIZAÇÃO (1:3) E=2 CM","m2    ",12.24,null,null,null,""]
["S",2,"S",0,2,5,0,0,0,0,0,"","Serviço","Serviço","2.5.0.0.2.","SINAPI",98546,"IMPERMEABILIZAÇÃO DE SUPERFÍCIE COM MANTA ASFÁLTICA, UMA CAMADA, INCLUSIVE APLICAÇÃO DE PRIMER ASFÁLTICO, E=3MM. AF_06/2018","M2",12.24,null,null,null,"Referência: AGETOP - 120107"]
["S",2,"S",0,2,5,0,0,0,0,0,"","Serviço","Serviço","2.5.0.0.3.","AGETOP",120207,"PROTECAO MECANICA (1:3) E=2 CM","m2    ",19.12,null,null,null,""]
["S",2,"S",0,2,5,0,0,0,0,0,"","Serviço","Serviço","2.5.0.0.4.","SINAPI",98555,"IMPERMEABILIZAÇÃO DE SUPERFÍCIE COM ARGAMASSA POLIMÉRICA / MEMBRANA ACRÍLICA, 3 DEMÃOS. AF_06/2018","M2",47.7,null,null,null,""]
["S",2,"S",0,2,5,0,0,0,0,0,"","Serviço","Serviço","2.5.0.0.5.","SINAPI",98557,"IMPERMEABILIZAÇÃO DE SUPERFÍCIE COM EMULSÃO ASFÁLTICA, 2 DEMÃOS AF_06/2018","M2",35.5,null,null,null,""]
[2,2,2,3,2,6,0,0,0,5,3,"","Nível 2","Nível 2","2.6.","SINAPI",null,"ESQUADRIAS METÁLICAS","-",null,null,null,null,""]
["S",2,"S",0,2,6,0,0,0,0,0,"","Serviço","Serviço","2.6.0.0.1.","AGETOP",180710,"ALÇAPÃO FORMATO COIFA EM CHAPA VINCADA Nº. 18 H=(10+2)CM, C/ALÇAS E PORTA CADEADOS (INCLUSIVE CADEADOS Nº. 30)","m2    ",3.28,null,null,null,""]
["S",2,"S",0,2,6,0,0,0,0,0,"","Serviço","Serviço","2.6.0.0.2.","AGETOP",180703,"ESCADA TIPO MARINHEIRO SEM GUARDA CORPO PADRÃO AGETOP ( H <= 3M)","m     ",1.4,null,null,null,""]
[2,2,2,2,2,7,0,0,0,2,{"$error":"#N/A"},"","Nível 2","Nível 2","2.7.","SINAPI",null,"PINTURA","-",null,null,null,null,""]
[{"$f":"CHOOSE(1+LOG(1+2*(ORÇAMENTO.Nivel=\"Nível 1\")+4*(ORÇAMENTO.Nivel=\"Nível 2\")+8*(ORÇAMENTO.Nivel=\"Nível 3\")+16*(ORÇAMENTO.Nivel=\"Nível 4\")+32*(ORÇAMENTO.Nivel=\"Serviço\"),2),0,1,2,3,4,\"S\")","v":"S"},{"$f":"IF(OR(C376=\"s\",C376=0),OFFSET(B376,-1,0),C376)","v":2},{"$f":"IF(OFFSET(C376,-1,0)=\"L\",1,IF(OFFSET(C376,-1,0)=1,2,IF(OR(A376=\"s\",A376=0),\"S\",IF(AND(OFFSET(C376,-1,0)=2,A376=4),3,IF(AND(OR(OFFSET(C376,-1,0)=\"s\",OFFSET(C376,-1,0)=0),A376<>\"s\",A376>OFFSET(B376,-1,0)),OFFSET(B376,-1,0),A376)))))","v":"S"},{"$f":"IF(OR(C376=\"S\",C376=0),0,IF(ISERROR(K376),J376,SMALL(J376:K376,1)))","v":0},{"$f":"IF($C376=1,OFFSET(E376,-1,0)+1,OFFSET(E376,-1,0))","v":2},{"$f":"IF($C376=1,0,IF($C376=2,OFFSET(F376,-1,0)+1,OFFSET(F376,-1,0)))","v":7},{"$f":"IF(AND($C376<=2,$C376<>0),0,IF($C376=3,OFFSET(G376,-1,0)+1,OFFSET(G376,-1,0)))","v":0},{"$f":"IF(AND($C376<=3,$C376<>0),0,IF($C376=4,OFFSET(H376,-1,0)+1,OFFSET(H376,-1,0)))","v":0},{"$f":"IF(AND($C376<=4,$C376<>0),0,IF(AND($C376=\"S\",$W376>0),OFFSET(I376,-1,0)+1,OFFSET(I376,-1,0)))","v":0},0,0,{"$f":"IF(OR(W376>0,$C376=1),\"F\",\"\")","v":""},"Serviço",{"$f":"CHOOSE(1+LOG(1+2*(C376=1)+4*(C376=2)+8*(C376=3)+16*(C376=4)+32*(C376=\"S\"),2),\"\",\"Nível 1\",\"Nível 2\",\"Nível 3\",\"Nível 4\",\"Serviço\")","v":"Serviço"},"2.7.0.0.1.","AGETOP",261602,"PINT.ESMALTE/ESQUAD.FERRO C/FUNDO ANTICOR.","m2    ",7.01,null,null,null,""]
[-1,null,-1,null,0,0,0,0,0,null,null,"F"]
[null,null,null,null,null,null,null,null,null,null,null,"F",null,null,null,null,null,"OBS: OS QUANTITATIVOS DE MATERIAIS  DAS INSTALAÇÕES HIDROSSANITÁRIAS, ELÉTRICAS E ESPECIAIS SÃO FORNECIDOS PELOS PROFISSIONAIS RESPONSÁVEIS PELOS RESPECTIVOS PROJETOS.",null,null,"VALOR TOTAL"]
[null,null,null,null,null,null,null,null,null,null,null,"F",null,null,null,null,null,null,null,null,"VALOR BDI (26,47%)"]
[null,null,null,null,null,null,null,null,null,null,null,"F",null,null,null,null,null,null,null,null,"TOTAL ORÇAMENTO"]
[null,null,null,null,null,null,null,null,null,null,null,"F"]
[null,null,null,null,null,null,null,null,null,null,null,"F",null,null,null,null,null,null,null,null,"CUSTO POR M2 ³"]
[null,null,null,null,null,null,null,null,null,null,null,"F",null,null,null,null,null,null,null,null,"MATERIAL S/ BDI"]
[null,null,null,null,null,null,null,null,null,null,null,"F",null,null,null,null,null,null,null,null,"MÃO DE OBRA S/ BDI"]
[null,null,null,null,null,null,null,null,null,null,null,"F"]
[null,null,null,null,null,null,null,null,null,null,null,"F",null,null,null,null,"(1) Conforme previsto pelo DECRETO Nº 7.983, DE 8 DE ABRIL DE 2013, os preços adotados são aqueles constantes dos sistemas de referência indicados. Justifica-se o uso dos preços destas composições de custos unitários devido ao seu valor ser menor à mediana de seus correspondentes na tabela SINAPI;"]
[null,null,null,null,null,null,null,null,null,null,null,"F",null,null,null,null,"(2) Optou-se pelo uso das composições de custos da AGETOP para itens não presentes na SINAPI;"]
[null,null,null,null,null,null,null,null,null,null,null,"F",null,null,null,null,"(3) Para itens da AGETOP, os vidros não estão inclusos nas esquadrias e já foram considerados os custos de contramarco para as esquadrias de alumínio;"]
[null,null,null,null,null,null,null,null,null,null,null,"F",null,null,null,null,"(4) Nos casos em que houver execução de granitina e omissão do item AGETOP 221102, considerou-se que o quantitativo para o rodapé, de altura igual a 7cm, foi incorporado na área de piso;"]
[null,null,null,null,null,null,null,null,null,null,null,"F",null,null,null,null,"(5) O custo unitário aproximado por metro quadrado é calculado dividindo-se o valor total do orçamento pela área total de construção."]
[null,null,null,null,null,null,null,null,null,null,null,"F"]
[null,null,null,null,null,null,null,null,null,null,null,"F"]
[]
[null,null,null,null,null,null,null,null,null,null,null,null,null,null,"SOMATÓRIO DE SERVIÇOS"]
[null,null,null,null,null,null,null,null,null,null,null,null,null,null,"ITEM","DESCRIÇÃO DOS SERVIÇOS",null,null,"PREÇO SEM BDI",null,null,"PREÇO COM BDI",null,"PARTICIPAÇÃO ( % )"]
[null,null,null,null,null,null,null,null,null,null,null,null,null,null,"a.","SERVIÇOS PRELIMINARES",null,null,{"$f":"SUMIF($R$19:$R$377,$P396,$W$19:$W$377)","v":0},null,null,{"$f":"ROUND(S396*(1+BDI.Taxa),2)","v":0},null,{"$f":"IFERROR(ROUND($V396*100/$W$380,2),0)","v":0}]
[null,null,null,null,null,null,null,null,null,null,null,null,null,null,"b.","TRANSPORTES",null,null,0,null,null,0,null,{"$f":"IFERROR(ROUND($V397*100/$W$380,2),0)","v":0}]
[null,null,null,null,null,null,null,null,null,null,null,null,null,null,"c.","SERVIÇO EM TERRA",null,null,0,null,null,0,null,0]
[null,null,null,null,null,null,null,null,null,null,null,null,null,null,"d.","FUNDAÇÕES E SONDAGENS",null,null,0,null,null,0,null,0]
[null,null,null,null,null,null,null,null,null,null,null,null,null,null,"e.","ESTRUTURA",null,null,0,null,null,0,null,0]
[null,null,null,null,null,null,null,null,null,null,null,null,null,null,"f.","INSTALAÇÕES ELÉTRICAS",null,null,0,null,null,0,null,0]
[null,null,null,null,null,null,null,null,null,null,null,null,null,null,"g.","INSTALAÇÕES HIDROSSANITÁRIAS",null,null,0,null,null,0,null,0]
[null,null,null,null,null,null,null,null,null,null,null,null,null,null,"h","INSTALAÇÕES ESPECIAIS",null,null,0,null,null,0,null,0]
[null,null,null,null,null,null,null,null,null,null,null,null,null,null,"i.","ALVENARIAS E DIVISÓRIAS",null,null,0,null,null,0,null,0]
[null,null,null,null,null,null,null,null,null,null,null,null,null,null,"j.","ALVENARIA AUTO-PORTANTE",null,null,0,null,null,0,null,0]
[null,null,null,null,null,null,null,null,null,null,null,null,null,null,"k.","IMPERMEABILIZAÇÃO",null,null,0,null,null,0,null,0]
[null,null,null,null,null,null,null,null,null,null,null,null,null,null,"l.","ISOLAMENTO TÉRMICO E ACÚSTICO",null,null,0,null,null,0,null,0]
[null,null,null,null,null,null,null,null,null,null,null,null,null,null,"m.","ESTRUTURA DE MADEIRA",null,null,0,null,null,0,null,0]
[null,null,null,null,null,null,null,null,null,null,null,null,null,null,"n.","ESTRUTURAS METÁLICAS",null,null,0,null,null,0,null,0]
[null,null,null,null,null,null,null,null,null,null,null,null,null,null,"o.","COBERTURAS",null,null,0,null,null,0,null,0]
[null,null,null,null,null,null,null,null,null,null,null,null,null,null,"p.","ESQUADRIAS DE MADEIRA",null,null,0,null,null,0,null,0]
[null,null,null,null,null,null,null,null,null,null,null,null,null,null,"q.","ESQUADRIAS METÁLICAS",null,null,0,null,null,{"$f":"ROUND(S412*(1+BDI.Taxa),2)","v":0},null,0]
[null,null,null,null,null,null,null,null,null,null,null,null,null,null,"r.","VIDROS",null,null,0,null,null,0,null,0]
[null,null,null,null,null,null,null,null,null,null,null,null,null,null,"s.","REVESTIMENTO DE PAREDE",null,null,0,null,null,0,null,0]
[null,null,null,null,null,null,null,null,null,null,null,null,null,null,"t.","FORROS",null,null,0,null,null,0,null,0]
[null,null,null,null,null,null,null,null,null,null,null,null,null,null,"u.","REVESTIMENTO DE PISO",null,null,0,null,null,0,null,0]
[null,null,null,null,null,null,null,null,null,null,null,null,null,null,"v.","FERRAGENS",null,null,0,null,null,0,null,0]
[null,null,null,null,null,null,null,null,null,null,null,null,null,null,"w.","MARCENARIA",null,null,0,null,null,0,null,0]
[null,null,null,null,null,null,null,null,null,null,null,null,null,null,"x.","ADMINISTRAÇÃO",null,null,0,null,null,0,null,0]
[null,null,null,null,null,null,null,null,null,null,null,null,null,null,"y.","PINTURA",null,null,0,null,null,{"$f":"ROUND(S420*(1+BDI.Taxa),2)","v":0},null,0]
[null,null,null,null,null,null,null,null,null,null,null,null,null,null,"z.","DIVERSOS",null,null,0,null,null,{"$f":"IF(S421>0,IF((SUM(V396:W420)+ROUND(S421*(1+BDI.Taxa),2))<>V423,V423-SUM(V396:W420),ROUND(S421*(1+BDI.Taxa),2)),0)","v":0},null,{"$f":"IF(S421>0,IF((SUM(X396:X420)+IFERROR(ROUND($V421*100/$W$380,2),0))<>X423,X423-SUM(X396:X420),IFERROR(ROUND($V421*100/$W$380,2),0)),0)","v":0}]
[null,null,null,null,null,null,null,null,null,null,null,null,null,null,"TOTAL GERAL DO ORÇAMENTO (R$)",null,null,null,{"$f":"SUM(S396:U421)","v":0},null,null,{"$f":"SUM(V396:W421)","v":0},null,{"$f":"SUM(X396:X421)","v":0}]
[null,null,null,null,null,null,null,null,null,null,null,null,null,null,null,null,null,null,{"$f":"$W$378","v":0},null,null,{"$f":"$W$380","v":0},null,100]
[null,null,null,null,null,null,null,null,null,null,null,null,null,null,null,null,null,null,"(TOTAL SEM BDI)",null,null,"(TOTAL COM BDI)",null,"(ARRED porcentagem)"]
[null,null,null,null,null,null,null,null,null,null,null,null,null,null,null,null,null,null,{"$f":"IF(AND(S422=S423,S422>0),\"OK\",\"ERRO\")","v":"ERRO"},null,null,{"$f":"IF(AND(V422=V423,V422>0),\"OK\",\"ERRO\")","v":"ERRO"},null,{"$f":"IF(X422=100,\"OK\",\"ERRO\")","v":"ERRO"}]
[]
[]
[null,null,null,null,null,null,null,null,null,null,null,null,null,null,"RESUMO GERAL DO ORÇAMENTO"]
[null,null,null,null,null,null,null,null,null,null,null,null,null,null,"ITEM","DESCRIÇÃO DOS SERVIÇOS",null,null,"PREÇO SEM BDI",null,null,"PREÇO COM BDI",null,"PARTICIPAÇÃO ( % )"]
[null,null,null,null,null,null,null,null,null,null,null,null,null,null,"1.",{"$f":"IFERROR(VLOOKUP(O430,$O$19:$W$377,4,FALSE),\"\")","v":"REFORMA E AMPLIAÇÃO"},null,null,{"$f":"IF(P431=\"\",$S$451-SUM(OFFSET($S$429:S429,0,0,COUNTA($S$429:S429),1)),SUMIF($R$19:$R$377,$P430,$W$19:$W$377))","v":0},null,null,{"$f":"IF(P431=\"\",$V$451-SUM(OFFSET($V$429:V429,0,0,COUNTA($V$429:V429),1)),ROUND(S430*(1+BDI.Taxa),2))","v":0},null,{"$f":"IF(P431=\"\",$X$451-SUM(OFFSET($X$429:X429,0,0,COUNTA($X$429:X429),1)),ROUND(V430*100/ORÇAMENTO.Totalorçamento,2))","v":{"$error":"#DIV/0!"}}]
[null,null,null,null,null,null,null,null,null,null,null,null,null,null,"2.","RESERVATÓRIO ENTERRADO",null,null,{"$f":"IF(P432=\"\",$S$451-SUM(OFFSET($S$429:S430,0,0,COUNTA($S$429:S430),1)),SUMIF($R$19:$R$377,$P431,$W$19:$W$377))","v":0},null,null,{"$f":"IF(P432=\"\",$V$451-SUM(OFFSET($V$429:V430,0,0,COUNTA($V$429:V430),1)),ROUND(S431*(1+BDI.Taxa),2))","v":0},null,{"$f":"IF(P432=\"\",$X$451-SUM(OFFSET($X$429:X430,0,0,COUNTA($X$429:X430),1)),ROUND(V431*100/ORÇAMENTO.Totalorçamento,2))","v":{"$error":"#DIV/0!"}}]
[null,null,null,null,null,null,null,null,null,null,null,null,null,null,"3.","",null,null,{"$f":"IF(P433=\"\",$S$451-SUM(OFFSET($S$429:S431,0,0,COUNTA($S$429:S431),1)),SUMIF($R$19:$R$377,$P432,$W$19:$W$377))","v":0},null,null,{"$f":"IF(P433=\"\",$V$451-SUM(OFFSET($V$429:V431,0,0,COUNTA($V$429:V431),1)),ROUND(S432*(1+BDI.Taxa),2))","v":0},null,{"$f":"IF(P433=\"\",$X$451-SUM(OFFSET($X$429:X431,0,0,COUNTA($X$429:X431),1)),ROUND(V432*100/ORÇAMENTO.Totalorçamento,2))","v":{"$error":"#DIV/0!"}}]
[null,null,null,null,null,null,null,null,null,null,null,null,null,null,"4.","",null,null,{"$f":"IF(P434=\"\",$S$451-SUM(OFFSET($S$429:S432,0,0,COUNTA($S$429:S432),1)),SUMIF($R$19:$R$377,$P433,$W$19:$W$377))","v":0},null,null,{"$f":"IF(P434=\"\",$V$451-SUM(OFFSET($V$429:V432,0,0,COUNTA($V$429:V432),1)),ROUND(S433*(1+BDI.Taxa),2))","v":0},null,{"$f":"IF(P434=\"\",$X$451-SUM(OFFSET($X$429:X432,0,0,COUNTA($X$429:X432),1)),ROUND(V433*100/ORÇAMENTO.Totalorçamento,2))","v":{"$error":"#DIV/0!"}}]
[null,null,null,null,null,null,null,null,null,null,null,null,null,null,"5.","",null,null,{"$f":"IF(P435=\"\",$S$451-SUM(OFFSET($S$429:S433,0,0,COUNTA($S$429:S433),1)),SUMIF($R$19:$R$377,$P434,$W$19:$W$377))","v":0},null,null,{"$f":"IF(P435=\"\",$V$451-SUM(OFFSET($V$429:V433,0,0,COUNTA($V$429:V433),1)),ROUND(S434*(1+BDI.Taxa),2))","v":0},null,{"$f":"IF(P435=\"\",$X$451-SUM(OFFSET($X$429:X433,0,0,COUNTA($X$429:X433),1)),ROUND(V434*100/ORÇAMENTO.Totalorçamento,2))","v":{"$error":"#DIV/0!"}}]
[null,null,null,null,null,null,null,null,null,null,null,null,null,null,"6.","",null,null,{"$f":"IF(P436=\"\",$S$451-SUM(OFFSET($S$429:S434,0,0,COUNTA($S$429:S434),1)),SUMIF($R$19:$R$377,$P435,$W$19:$W$377))","v":0},null,null,{"$f":"IF(P436=\"\",$V$451-SUM(OFFSET($V$429:V434,0,0,COUNTA($V$429:V434),1)),ROUND(S435*(1+BDI.Taxa),2))","v":0},null,{"$f":"IF(P436=\"\",$X$451-SUM(OFFSET($X$429:X434,0,0,COUNTA($X$429:X434),1)),ROUND(V435*100/ORÇAMENTO.Totalorçamento,2))","v":{"$error":"#DIV/0!"}}]
[null,null,null,null,null,null,null,null,null,null,null,null,null,null,"7.","",null,null,{"$f":"IF(P437=\"\",$S$451-SUM(OFFSET($S$429:S435,0,0,COUNTA($S$429:S435),1)),SUMIF($R$19:$R$377,$P436,$W$19:$W$377))","v":0},null,null,{"$f":"IF(P437=\"\",$V$451-SUM(OFFSET($V$429:V435,0,0,COUNTA($V$429:V435),1)),ROUND(S436*(1+BDI.Taxa),2))","v":0},null,{"$f":"IF(P437=\"\",$X$451-SUM(OFFSET($X$429:X435,0,0,COUNTA($X$429:X435),1)),ROUND(V436*100/ORÇAMENTO.Totalorçamento,2))","v":{"$error":"#DIV/0!"}}]
[null,null,null,null,null,null,null,null,null,null,null,null,null,null,"8.","",null,null,{"$f":"IF(P438=\"\",$S$451-SUM(OFFSET($S$429:S436,0,0,COUNTA($S$429:S436),1)),SUMIF($R$19:$R$377,$P437,$W$19:$W$377))","v":0},null,null,{"$f":"IF(P438=\"\",$V$451-SUM(OFFSET($V$429:V436,0,0,COUNTA($V$429:V436),1)),ROUND(S437*(1+BDI.Taxa),2))","v":0},null,{"$f":"IF(P438=\"\",$X$451-SUM(OFFSET($X$429:X436,0,0,COUNTA($X$429:X436),1)),ROUND(V437*100/ORÇAMENTO.Totalorçamento,2))","v":{"$error":"#DIV/0!"}}]
[null,null,null,null,null,null,null,null,null,null,null,null,null,null,"9.","",null,null,{"$f":"IF(P439=\"\",$S$451-SUM(OFFSET($S$429:S437,0,0,COUNTA($S$429:S437),1)),SUMIF($R$19:$R$377,$P438,$W$19:$W$377))","v":0},null,null,{"$f":"IF(P439=\"\",$V$451-SUM(OFFSET($V$429:V437,0,0,COUNTA($V$429:V437),1)),ROUND(S438*(1+BDI.Taxa),2))","v":0},null,{"$f":"IF(P439=\"\",$X$451-SUM(OFFSET($X$429:X437,0,0,COUNTA($X$429:X437),1)),ROUND(V438*100/ORÇAMENTO.Totalorçamento,2))","v":{"$error":"#DIV/0!"}}]
[null,null,null,null,null,null,null,null,null,null,null,null,null,null,"10.","",null,null,{"$f":"IF(P440=\"\",$S$451-SUM(OFFSET($S$429:S438,0,0,COUNTA($S$429:S438),1)),SUMIF($R$19:$R$377,$P439,$W$19:$W$377))","v":0},null,null,{"$f":"IF(P440=\"\",$V$451-SUM(OFFSET($V$429:V438,0,0,COUNTA($V$429:V438),1)),ROUND(S439*(1+BDI.Taxa),2))","v":0},null,{"$f":"IF(P440=\"\",$X$451-SUM(OFFSET($X$429:X438,0,0,COUNTA($X$429:X438),1)),ROUND(V439*100/ORÇAMENTO.Totalorçamento,2))","v":{"$error":"#DIV/0!"}}]
[null,null,null,null,null,null,null,null,null,null,null,null,null,null,"11.","",null,null,{"$f":"IF(P441=\"\",$S$451-SUM(OFFSET($S$429:S439,0,0,COUNTA($S$429:S439),1)),SUMIF($R$19:$R$377,$P440,$W$19:$W$377))","v":0},null,null,{"$f":"IF(P441=\"\",$V$451-SUM(OFFSET($V$429:V439,0,0,COUNTA($V$429:V439),1)),ROUND(S440*(1+BDI.Taxa),2))","v":0},null,{"$f":"IF(P441=\"\",$X$451-SUM(OFFSET($X$429:X439,0,0,COUNTA($X$429:X439),1)),ROUND(V440*100/ORÇAMENTO.Totalorçamento,2))","v":{"$error":"#DIV/0!"}}]
[null,null,null,null,null,null,null,null,null,null,null,null,null,null,"12.","",null,null,{"$f":"IF(P442=\"\",$S$451-SUM(OFFSET($S$429:S440,0,0,COUNTA($S$429:S440),1)),SUMIF($R$19:$R$377,$P441,$W$19:$W$377))","v":0},null,null,{"$f":"IF(P442=\"\",$V$451-SUM(OFFSET($V$429:V440,0,0,COUNTA($V$429:V440),1)),ROUND(S441*(1+BDI.Taxa),2))","v":0},null,{"$f":"IF(P442=\"\",$X$451-SUM(OFFSET($X$429:X440,0,0,COUNTA($X$429:X440),1)),ROUND(V441*100/ORÇAMENTO.Totalorçamento,2))","v":{"$error":"#DIV/0!"}}]
[null,null,null,null,null,null,null,null,null,null,null,null,null,null,"13.","",null,null,{"$f":"IF(P443=\"\",$S$451-SUM(OFFSET($S$429:S441,0,0,COUNTA($S$429:S441),1)),SUMIF($R$19:$R$377,$P442,$W$19:$W$377))","v":0},null,null,{"$f":"IF(P443=\"\",$V$451-SUM(OFFSET($V$429:V441,0,0,COUNTA($V$429:V441),1)),ROUND(S442*(1+BDI.Taxa),2))","v":0},null,{"$f":"IF(P443=\"\",$X$451-SUM(OFFSET($X$429:X441,0,0,COUNTA($X$429:X441),1)),ROUND(V442*100/ORÇAMENTO.Totalorçamento,2))","v":{"$error":"#DIV/0!"}}]
[null,null,null,null,null,null,null,null,null,null,null,null,null,null,"14.","",null,null,{"$f":"IF(P444=\"\",$S$451-SUM(OFFSET($S$429:S442,0,0,COUNTA($S$429:S442),1)),SUMIF($R$19:$R$377,$P443,$W$19:$W$377))","v":0},null,null,{"$f":"IF(P444=\"\",$V$451-SUM(OFFSET($V$429:V442,0,0,COUNTA($V$429:V442),1)),ROUND(S443*(1+BDI.Taxa),2))","v":0},null,{"$f":"IF(P444=\"\",$X$451-SUM(OFFSET($X$429:X442,0,0,COUNTA($X$429:X442),1)),ROUND(V443*100/ORÇAMENTO.Totalorçamento,2))","v":{"$error":"#DIV/0!"}}]
[null,null,null,null,null,null,null,null,null,null,null,null,null,null,"15.","",null,null,{"$f":"IF(P445=\"\",$S$451-SUM(OFFSET($S$429:S443,0,0,COUNTA($S$429:S443),1)),SUMIF($R$19:$R$377,$P444,$W$19:$W$377))","v":0},null,null,{"$f":"IF(P445=\"\",$V$451-SUM(OFFSET($V$429:V443,0,0,COUNTA($V$429:V443),1)),ROUND(S444*(1+BDI.Taxa),2))","v":0},null,{"$f":"IF(P445=\"\",$X$451-SUM(OFFSET($X$429:X443,0,0,COUNTA($X$429:X443),1)),ROUND(V444*100/ORÇAMENTO.Totalorçamento,2))","v":{"$error":"#DIV/0!"}}]
[null,null,null,null,null,null,null,null,null,null,null,null,null,null,"16.","",null,null,{"$f":"IF(P446=\"\",$S$451-SUM(OFFSET($S$429:S444,0,0,COUNTA($S$429:S444),1)),SUMIF($R$19:$R$377,$P445,$W$19:$W$377))","v":0},null,null,{"$f":"IF(P446=\"\",$V$451-SUM(OFFSET($V$429:V444,0,0,COUNTA($V$429:V444),1)),ROUND(S445*(1+BDI.Taxa),2))","v":0},null,{"$f":"IF(P446=\"\",$X$451-SUM(OFFSET($X$429:X444,0,0,COUNTA($X$429:X444),1)),ROUND(V445*100/ORÇAMENTO.Totalorçamento,2))","v":{"$error":"#DIV/0!"}}]
[null,null,null,null,null,null,null,null,null,null,null,null,null,null,"17.","",null,null,{"$f":"IF(P447=\"\",$S$451-SUM(OFFSET($S$429:S445,0,0,COUNTA($S$429:S445),1)),SUMIF($R$19:$R$377,$P446,$W$19:$W$377))","v":0},null,null,{"$f":"IF(P447=\"\",$V$451-SUM(OFFSET($V$429:V445,0,0,COUNTA($V$429:V445),1)),ROUND(S446*(1+BDI.Taxa),2))","v":0},null,{"$f":"IF(P447=\"\",$X$451-SUM(OFFSET($X$429:X445,0,0,COUNTA($X$429:X445),1)),ROUND(V446*100/ORÇAMENTO.Totalorçamento,2))","v":{"$error":"#DIV/0!"}}]
[null,null,null,null,null,null,null,null,null,null,null,null,null,null,"18.","",null,null,{"$f":"IF(P448=\"\",$S$451-SUM(OFFSET($S$429:S446,0,0,COUNTA($S$429:S446),1)),SUMIF($R$19:$R$377,$P447,$W$19:$W$377))","v":0},null,null,{"$f":"IF(P448=\"\",$V$451-SUM(OFFSET($V$429:V446,0,0,COUNTA($V$429:V446),1)),ROUND(S447*(1+BDI.Taxa),2))","v":0},null,{"$f":"IF(P448=\"\",$X$451-SUM(OFFSET($X$429:X446,0,0,COUNTA($X$429:X446),1)),ROUND(V447*100/ORÇAMENTO.Totalorçamento,2))","v":{"$error":"#DIV/0!"}}]
[null,null,null,null,null,null,null,null,null,null,null,null,null,null,"19.","",null,null,{"$f":"IF(P449=\"\",$S$451-SUM(OFFSET($S$429:S447,0,0,COUNTA($S$429:S447),1)),SUMIF($R$19:$R$377,$P448,$W$19:$W$377))","v":0},null,null,{"$f":"IF(P449=\"\",$V$451-SUM(OFFSET($V$429:V447,0,0,COUNTA($V$429:V447),1)),ROUND(S448*(1+BDI.Taxa),2))","v":0},null,{"$f":"IF(P449=\"\",$X$451-SUM(OFFSET($X$429:X447,0,0,COUNTA($X$429:X447),1)),ROUND(V448*100/ORÇAMENTO.Totalorçamento,2))","v":{"$error":"#DIV/0!"}}]
[null,null,null,null,null,null,null,null,null,null,null,null,null,null,"20.","",null,null,{"$f":"IF(P450=\"\",$S$451-SUM(OFFSET($S$429:S448,0,0,COUNTA($S$429:S448),1)),SUMIF($R$19:$R$377,$P449,$W$19:$W$377))","v":0},null,null,{"$f":"IF(P450=\"\",$V$451-SUM(OFFSET($V$429:V448,0,0,COUNTA($V$429:V448),1)),ROUND(S449*(1+BDI.Taxa),2))","v":0},null,{"$f":"IF(P450=\"\",$X$451-SUM(OFFSET($X$429:X448,0,0,COUNTA($X$429:X448),1)),ROUND(V449*100/ORÇAMENTO.Totalorçamento,2))","v":{"$error":"#DIV/0!"}}]
[null,null,null,null,null,null,null,null,null,null,null,null,null,null,"TOTAL GERAL DO ORÇAMENTO (R$)",null,null,null,{"$f":"SUM(S430:U449)","v":0},null,null,{"$f":"SUM(V430:W449)","v":0},null,{"$f":"SUM(X430:X449)","v":{"$error":"#DIV/0!"}}]
[null,null,null,null,null,null,null,null,null,null,null,null,null,null,null,null,null,null,{"$f":"$W$378","v":0},null,null,{"$f":"$W$380","v":0},null,100]
[null,null,null,null,null,null,null,null,null,null,null,null,null,null,null,null,null,null,"(TOTAL SEM BDI)",null,null,"(TOTAL COM BDI)",null,"(ARRED porcentagem)"]
[null,null,null,null,null,null,null,null,null,null,null,null,null,null,null,null,null,null,{"$f":"IF(AND(S450=S451,S450>0),\"OK\",\"ERRO\")","v":"ERRO"},null,null,{"$f":"IF(AND(V450=V451,V450>0),\"OK\",\"ERRO\")","v":"ERRO"},null,{"$f":"IF(AND(X450=100,S430<>0),\"OK\",\"ERRO\")","v":{"$error":"#DIV/0!"}}]

{"sheet":"Resumo ","index":1,"n_rows":39,"n_cols":9,"rows_kept":39,"cut":false,"hidden":false,"merged":[[13,0,14,0],[34,2,34,3],[35,2,35,3],[31,2,31,3],[32,2,32,3],[33,2,33,3],[28,2,28,3],[29,2,29,3],[30,2,30,3],[0,1,0,8],[36,1,36,5],[2,1,2,5],[3,1,3,5],[5,1,5,5],[6,1,6,5],[8,1,8,5],[9,1,9,5],[11,3,11,5],[12,3,12,5],[10,1,10,8],[11,6,11,8],[12,6,12,8],[25,2,25,3],[21,2,21,3],[22,2,22,3],[6,6,6,8],[7,1,7,8],[8,6,8,8],[9,6,9,8],[13,1,13,8],[1,1,1,8],[2,6,2,8],[3,6,3,8],[4,1,4,8],[5,6,5,8],[42,3,42,7],[11,1,11,2],[12,1,12,2],[15,2,15,3],[16,2,16,3],[14,1,14,8],[17,2,17,3],[23,2,23,3],[18,2,18,3],[19,2,19,3],[20,2,20,3],[41,3,41,7],[24,2,24,3],[26,2,26,3],[27,2,27,3],[38,1,38,8]]}
[]
[]
[null,"UNIDADE ESCOLAR",null,null,null,null,"CÓDIGO INEP"]
[null,{"$f":"Orçamento!$O$4","v":"COLÉGIO ESTADUAL THIAGO VIDAL FERNANDES"},null,null,null,null,{"$f":"Orçamento!V4","v":52044572}]
[]
[null,"OBRA",null,null,null,null,"CIDADE"]
[null,{"$f":"Orçamento!$O$7","v":"REFORMA E AMPLIAÇÃO"},null,null,null,null,{"$f":"Orçamento!$V$7","v":"COCALZINHO DE GOIÁS"}]
[]
[null,"ENDEREÇO",null,null,null,null,"CRE"]
[null,{"$f":"Orçamento!$R$10","v":" AV. TOCANTINS ESQ. COM A ITAPACI S/N , CENTRO , CEP: 7297-000"},null,null,null,null,{"$f":"Orçamento!$O$10","v":"CRE-ANÁPOLIS"}]
[]
[null,"REFERÊNCIA",null,"DATA",null,null,"ÁREA TOTAL CONSTRUÍDA (M²)"]
[null,{"$f":"CONCATENATE(\"AGETOP E SINAPI - \",Orçamento!$T$10)","v":"AGETOP E SINAPI - DESONERADA"},null,{"$f":"Orçamento!$S$7","v":"2020-05-06"},null,null,{"$f":"Orçamento!$V$13","v":1946.01}]
["FILTRO"]
[null,"RESUMO GERAL DO ORÇAMENTO"]
["↓","ITEM","DESCRIÇÃO DOS SERVIÇOS",null,"UNID","QUANT","PREÇO SEM BDI","PREÇO COM BDI","PARTICIP. (%)"]
[{"$f":"IF(H17>0,\"F\",\"\")","v":""},"1.",{"$f":"Orçamento!$P430","v":"REFORMA E AMPLIAÇÃO"},null,{"$f":"IF(C17<>\"\",\"UN\",\"\")","v":"UN"},{"$f":"IF(C17<>\"\",1,\"\")","v":1},{"$f":"IFERROR(Orçamento!S430,\"-\")","v":0},{"$f":"IFERROR(Orçamento!V430,\"\")","v":0},{"$f":"Orçamento!X430","v":{"$error":"#DIV/0!"}}]
[{"$f":"IF(H18>0,\"F\",\"\")","v":""},"2.",{"$f":"Orçamento!$P431","v":"RESERVATÓRIO ENTERRADO"},null,{"$f":"IF(C18<>\"\",\"UN\",\"\")","v":"UN"},{"$f":"IF(C18<>\"\",1,\"\")","v":1},{"$f":"IFERROR(Orçamento!S431,\"-\")","v":0},{"$f":"IFERROR(Orçamento!V431,\"\")","v":0},{"$f":"Orçamento!X431","v":{"$error":"#DIV/0!"}}]
[{"$f":"IF(H19>0,\"F\",\"\")","v":""},"3.",{"$f":"Orçamento!$P432","v":""},null,"","",{"$f":"IFERROR(Orçamento!S432,\"-\")","v":0},{"$f":"IFERROR(Orçamento!V432,\"\")","v":0},{"$f":"Orçamento!X432","v":{"$error":"#DIV/0!"}}]
["","4.",{"$f":"Orçamento!$P433","v":""},null,"","",{"$f":"IFERROR(Orçamento!S433,\"-\")","v":0},{"$f":"IFERROR(Orçamento!V433,\"\")","v":0},{"$f":"Orçamento!X433","v":{"$error":"#DIV/0!"}}]
["","5.",{"$f":"Orçamento!$P434","v":""},null,"","",{"$f":"IFERROR(Orçamento!S434,\"-\")","v":0},{"$f":"IFERROR(Orçamento!V434,\"\")","v":0},{"$f":"Orçamento!X434","v":{"$error":"#DIV/0!"}}]
["","6.",{"$f":"Orçamento!$P435","v":""},null,"","",{"$f":"IFERROR(Orçamento!S435,\"-\")","v":0},{"$f":"IFERROR(Orçamento!V435,\"\")","v":0},{"$f":"Orçamento!X435","v":{"$error":"#DIV/0!"}}]
["","7.",{"$f":"Orçamento!$P436","v":""},null,"","",{"$f":"IFERROR(Orçamento!S436,\"-\")","v":0},{"$f":"IFERROR(Orçamento!V436,\"\")","v":0},{"$f":"Orçamento!X436","v":{"$error":"#DIV/0!"}}]
["","8.",{"$f":"Orçamento!$P437","v":""},null,"","",{"$f":"IFERROR(Orçamento!S437,\"-\")","v":0},{"$f":"IFERROR(Orçamento!V437,\"\")","v":0},{"$f":"Orçamento!X437","v":{"$error":"#DIV/0!"}}]
["","9.",{"$f":"Orçamento!$P438","v":""},null,"","",{"$f":"IFERROR(Orçamento!S438,\"-\")","v":0},{"$f":"IFERROR(Orçamento!V438,\"\")","v":0},{"$f":"Orçamento!X438","v":{"$error":"#DIV/0!"}}]
["","10.",{"$f":"Orçamento!$P439","v":""},null,"","",{"$f":"IFERROR(Orçamento!S439,\"-\")","v":0},{"$f":"IFERROR(Orçamento!V439,\"\")","v":0},{"$f":"Orçamento!X439","v":{"$error":"#DIV/0!"}}]
["","11.",{"$f":"Orçamento!$P440","v":""},null,"","",{"$f":"IFERROR(Orçamento!S440,\"-\")","v":0},{"$f":"IFERROR(Orçamento!V440,\"\")","v":0},{"$f":"Orçamento!X440","v":{"$error":"#DIV/0!"}}]
["","12.",{"$f":"Orçamento!$P441","v":""},null,"","",{"$f":"IFERROR(Orçamento!S441,\"-\")","v":0},{"$f":"IFERROR(Orçamento!V441,\"\")","v":0},{"$f":"Orçamento!X441","v":{"$error":"#DIV/0!"}}]
["","13.",{"$f":"Orçamento!$P442","v":""},null,"","",{"$f":"IFERROR(Orçamento!S442,\"-\")","v":0},{"$f":"IFERROR(Orçamento!V442,\"\")","v":0},{"$f":"Orçamento!X442","v":{"$error":"#DIV/0!"}}]
["","14.",{"$f":"Orçamento!$P443","v":""},null,"","",{"$f":"IFERROR(Orçamento!S443,\"-\")","v":0},{"$f":"IFERROR(Orçamento!V443,\"\")","v":0},{"$f":"Orçamento!X443","v":{"$error":"#DIV/0!"}}]
["","15.",{"$f":"Orçamento!$P444","v":""},null,"","",{"$f":"IFERROR(Orçamento!S444,\"-\")","v":0},{"$f":"IFERROR(Orçamento!V444,\"\")","v":0},{"$f":"Orçamento!X444","v":{"$error":"#DIV/0!"}}]
["","16.",{"$f":"Orçamento!$P445","v":""},null,"","",{"$f":"IFERROR(Orçamento!S445,\"-\")","v":0},{"$f":"IFERROR(Orçamento!V445,\"\")","v":0},{"$f":"Orçamento!X445","v":{"$error":"#DIV/0!"}}]
["","17.",{"$f":"Orçamento!$P446","v":""},null,"","",{"$f":"IFERROR(Orçamento!S446,\"-\")","v":0},{"$f":"IFERROR(Orçamento!V446,\"\")","v":0},{"$f":"Orçamento!X446","v":{"$error":"#DIV/0!"}}]
["","18.",{"$f":"Orçamento!$P447","v":""},null,"","",{"$f":"IFERROR(Orçamento!S447,\"-\")","v":0},{"$f":"IFERROR(Orçamento!V447,\"\")","v":0},{"$f":"Orçamento!X447","v":{"$error":"#DIV/0!"}}]
["","19.",{"$f":"Orçamento!$P448","v":""},null,"","",{"$f":"IFERROR(Orçamento!S448,\"-\")","v":0},{"$f":"IFERROR(Orçamento!V448,\"\")","v":0},{"$f":"Orçamento!X448","v":{"$error":"#DIV/0!"}}]
["","20.",{"$f":"Orçamento!$P449","v":""},null,"","",{"$f":"IFERROR(Orçamento!S449,\"-\")","v":0},{"$f":"IFERROR(Orçamento!V449,\"\")","v":0},{"$f":"Orçamento!X449","v":{"$error":"#DIV/0!"}}]
["F","TOTAL GERAL DO ORÇAMENTO (R$)",null,null,null,null,{"$f":"SUM(G17:G36)","v":0},{"$f":"SUM(H17:H36)","v":0},{"$f":"SUM(I17:I36)","v":{"$error":"#DIV/0!"}}]
["F"]
["F"]

{"sheet":"Somatório","index":2,"n_rows":45,"n_cols":6,"rows_kept":45,"cut":false,"hidden":false,"merged":[[13,0,14,0],[42,1,42,2],[44,1,44,5],[47,3,47,5],[48,3,48,5],[13,1,13,5],[9,1,9,3],[9,4,9,5],[11,1,11,2],[11,4,11,5],[12,1,12,2],[12,4,12,5],[0,1,0,5],[14,1,14,5],[2,1,2,3],[2,4,2,5],[3,1,3,3],[3,4,3,5],[5,1,5,3],[5,4,5,5],[6,1,6,3],[6,4,6,5],[8,1,8,3],[8,4,8,5],[1,1,1,5],[4,1,4,5],[7,1,7,5],[10,1,10,5]]}
[]
[]
[null,"UNIDADE ESCOLAR",null,null,"CÓDIGO INEP"]
[null,{"$f":"Orçamento!$O$4","v":"COLÉGIO ESTADUAL THIAGO VIDAL FERNANDES"},null,null,{"$f":"Orçamento!V4","v":52044572}]
[]
[null,"OBRA",null,null,"CIDADE"]
[null,{"$f":"Orçamento!$O$7","v":"REFORMA E AMPLIAÇÃO"},null,null,{"$f":"Orçamento!$V$7","v":"COCALZINHO DE GOIÁS"}]
[]
[null,"ENDEREÇO",null,null,"CRE"]
[null,{"$f":"Orçamento!$R$10","v":" AV. TOCANTINS ESQ. COM A ITAPACI S/N , CENTRO , CEP: 7297-000"},null,null,{"$f":"Orçamento!$O$10","v":"CRE-ANÁPOLIS"}]
[]
[null,"REFERÊNCIA",null,"DATA","ÁREA TOTAL CONSTRUÍDA (M²)"]
[null,{"$f":"CONCATENATE(\"AGETOP E SINAPI - \",Orçamento!$T$10)","v":"AGETOP E SINAPI - DESONERADA"},null,{"$f":"Orçamento!$S$7","v":"2020-05-06"},{"$f":"Orçamento!$V$13","v":1946.01}]
["FILTRO"]
[null,"SOMATÓRIO DE SERVIÇOS"]
["↓","ITEM","DESCRIÇÃO DOS SERVIÇOS","PREÇO SEM BDI (R$)","PREÇO COM BDI (R$)","PARTIC.  ( % )"]
[{"$f":"IF(D17>0,\"F\",\"\")","v":""},"a.",{"$f":"Orçamento!P396","v":"SERVIÇOS PRELIMINARES"},{"$f":"Orçamento!S396","v":0},{"$f":"Orçamento!V396","v":0},{"$f":"Orçamento!X396","v":0}]
[{"$f":"IF(D18>0,\"F\",\"\")","v":""},"b.",{"$f":"Orçamento!P397","v":"TRANSPORTES"},{"$f":"Orçamento!S397","v":0},{"$f":"Orçamento!V397","v":0},{"$f":"Orçamento!X397","v":0}]
["","c.",{"$f":"Orçamento!P398","v":"SERVIÇO EM TERRA"},{"$f":"Orçamento!S398","v":0},{"$f":"Orçamento!V398","v":0},{"$f":"Orçamento!X398","v":0}]
["","d.",{"$f":"Orçamento!P399","v":"FUNDAÇÕES E SONDAGENS"},{"$f":"Orçamento!S399","v":0},{"$f":"Orçamento!V399","v":0},{"$f":"Orçamento!X399","v":0}]
["","e.",{"$f":"Orçamento!P400","v":"ESTRUTURA"},{"$f":"Orçamento!S400","v":0},{"$f":"Orçamento!V400","v":0},{"$f":"Orçamento!X400","v":0}]
["","f.",{"$f":"Orçamento!P401","v":"INSTALAÇÕES ELÉTRICAS"},{"$f":"Orçamento!S401","v":0},{"$f":"Orçamento!V401","v":0},{"$f":"Orçamento!X401","v":0}]
["","g.",{"$f":"Orçamento!P402","v":"INSTALAÇÕES HIDROSSANITÁRIAS"},{"$f":"Orçamento!S402","v":0},{"$f":"Orçamento!V402","v":0},{"$f":"Orçamento!X402","v":0}]
["","h.",{"$f":"Orçamento!P403","v":"INSTALAÇÕES ESPECIAIS"},{"$f":"Orçamento!S403","v":0},{"$f":"Orçamento!V403","v":0},{"$f":"Orçamento!X403","v":0}]
["","i.",{"$f":"Orçamento!P404","v":"ALVENARIAS E DIVISÓRIAS"},{"$f":"Orçamento!S404","v":0},{"$f":"Orçamento!V404","v":0},{"$f":"Orçamento!X404","v":0}]
["","j.",{"$f":"Orçamento!P405","v":"ALVENARIA AUTO-PORTANTE"},{"$f":"Orçamento!S405","v":0},{"$f":"Orçamento!V405","v":0},{"$f":"Orçamento!X405","v":0}]
["","k.",{"$f":"Orçamento!P406","v":"IMPERMEABILIZAÇÃO"},{"$f":"Orçamento!S406","v":0},{"$f":"Orçamento!V406","v":0},{"$f":"Orçamento!X406","v":0}]
["","l.",{"$f":"Orçamento!P407","v":"ISOLAMENTO TÉRMICO E ACÚSTICO"},{"$f":"Orçamento!S407","v":0},{"$f":"Orçamento!V407","v":0},{"$f":"Orçamento!X407","v":0}]
["","m.",{"$f":"Orçamento!P408","v":"ESTRUTURA DE MADEIRA"},{"$f":"Orçamento!S408","v":0},{"$f":"Orçamento!V408","v":0},{"$f":"Orçamento!X408","v":0}]
["","n.",{"$f":"Orçamento!P409","v":"ESTRUTURAS METÁLICAS"},{"$f":"Orçamento!S409","v":0},{"$f":"Orçamento!V409","v":0},{"$f":"Orçamento!X409","v":0}]
["","o.",{"$f":"Orçamento!P410","v":"COBERTURAS"},{"$f":"Orçamento!S410","v":0},{"$f":"Orçamento!V410","v":0},{"$f":"Orçamento!X410","v":0}]
["","p.",{"$f":"Orçamento!P411","v":"ESQUADRIAS DE MADEIRA"},{"$f":"Orçamento!S411","v":0},{"$f":"Orçamento!V411","v":0},{"$f":"Orçamento!X411","v":0}]
["","q.",{"$f":"Orçamento!P412","v":"ESQUADRIAS METÁLICAS"},{"$f":"Orçamento!S412","v":0},{"$f":"Orçamento!V412","v":0},{"$f":"Orçamento!X412","v":0}]
["","r.",{"$f":"Orçamento!P413","v":"VIDROS"},{"$f":"Orçamento!S413","v":0},{"$f":"Orçamento!V413","v":0},{"$f":"Orçamento!X413","v":0}]
["","s.",{"$f":"Orçamento!P414","v":"REVESTIMENTO DE PAREDE"},{"$f":"Orçamento!S414","v":0},{"$f":"Orçamento!V414","v":0},{"$f":"Orçamento!X414","v":0}]
["","t.",{"$f":"Orçamento!P415","v":"FORROS"},{"$f":"Orçamento!S415","v":0},{"$f":"Orçamento!V415","v":0},{"$f":"Orçamento!X415","v":0}]
["","u.",{"$f":"Orçamento!P416","v":"REVESTIMENTO DE PISO"},{"$f":"Orçamento!S416","v":0},{"$f":"Orçamento!V416","v":0},{"$f":"Orçamento!X416","v":0}]
["","v.",{"$f":"Orçamento!P417","v":"FERRAGENS"},{"$f":"Orçamento!S417","v":0},{"$f":"Orçamento!V417","v":0},{"$f":"Orçamento!X417","v":0}]
["","w.",{"$f":"Orçamento!P418","v":"MARCENARIA"},{"$f":"Orçamento!S418","v":0},{"$f":"Orçamento!V418","v":0},{"$f":"Orçamento!X418","v":0}]
["","x.",{"$f":"Orçamento!P419","v":"ADMINISTRAÇÃO"},{"$f":"Orçamento!S419","v":0},{"$f":"Orçamento!V419","v":0},{"$f":"Orçamento!X419","v":0}]
["","y.",{"$f":"Orçamento!P420","v":"PINTURA"},{"$f":"Orçamento!S420","v":0},{"$f":"Orçamento!V420","v":0},{"$f":"Orçamento!X420","v":0}]
["","z.",{"$f":"Orçamento!P421","v":"DIVERSOS"},{"$f":"Orçamento!S421","v":0},{"$f":"Orçamento!V421","v":0},{"$f":"Orçamento!X421","v":0}]
["F","TOTAL GERAL DO ORÇAMENTO",null,{"$f":"SUM(D17:D42)","v":0},{"$f":"SUM(E17:E42)","v":0},{"$f":"SUM(F17:F42)","v":0}]
[]
[null,"(*) Para itens da AGETOP, os vidros não estão inclusos nas esquadrias e já foram considerados os custos de contramarco para as esquadrias de alumínio;"]

{"sheet":"Cronog_90_Dias","index":3,"n_rows":99,"n_cols":21,"rows_kept":99,"cut":false,"hidden":false,"merged":[[0,1,0,17],[1,1,1,17],[2,1,2,7],[2,8,2,17],[3,1,3,7],[3,8,3,17],[8,1,8,7],[8,8,8,17],[9,0,11,0],[9,1,9,7],[9,8,9,17],[10,1,10,17],[11,1,11,17],[4,1,4,17],[5,1,5,7],[5,8,5,17],[6,1,6,7],[6,8,6,17],[7,1,7,17],[12,0,13,0],[12,3,13,3],[12,5,12,8],[12,9,12,12],[12,13,12,16],[12,17,13,17],[13,1,13,2],[13,5,13,8],[13,9,13,12],[13,13,13,16],[14,1,16,2],[14,3,16,3],[14,4,16,4],[14,5,14,8],[14,9,14,12],[14,13,14,16],[16,5,16,8],[16,9,16,12],[16,13,16,16],[17,1,19,2],[17,3,19,3],[17,4,19,4],[17,5,17,8],[17,9,17,12],[17,13,17,16],[19,5,19,8],[19,9,19,12],[19,13,19,16],[20,1,22,2],[20,3,22,3],[20,4,22,4],[20,5,20,8],[20,9,20,12],[20,13,20,16],[22,5,22,8],[22,9,22,12],[22,13,22,16],[23,1,25,2],[23,3,25,3],[23,4,25,4],[23,5,23,8],[23,9,23,12],[23,13,23,16],[25,5,25,8],[25,9,25,12],[25,13,25,16],[26,1,28,2],[26,3,28,3],[26,4,28,4],[26,5,26,8],[26,9,26,12],[26,13,26,16],[28,5,28,8],[28,9,28,12],[28,13,28,16],[29,1,31,2],[29,3,31,3],[29,4,31,4],[29,5,29,8],[29,9,29,12],[29,13,29,16],[31,5,31,8],[31,9,31,12],[31,13,31,16],[32,1,34,2],[32,3,34,3],[32,4,34,4],[32,5,32,8],[32,9,32,12],[32,13,32,16],[34,5,34,8],[34,9,34,12],[34,13,34,16],[35,1,37,2],[35,3,37,3],[35,4,37,4],[35,5,35,8],[35,9,35,12],[35,13,35,16],[37,5,37,8],[37,9,37,12],[37,13,37,16],[38,1,40,2],[38,3,40,3],[38,4,40,4],[38,5,38,8],[38,9,38,12],[38,13,38,16],[40,5,40,8],[40,9,40,12],[40,13,40,16],[41,1,43,2],[41,3,43,3],[41,4,43,4],[41,5,41,8],[41,9,41,12],[41,13,41,16],[43,5,43,8],[43,9,43,12],[43,13,43,16],[44,1,46,2],[44,3,46,3],[44,4,46,4],[44,5,44,8],[44,9,44,12],[44,13,44,16],[46,5,46,8],[46,9,46,12],[46,13,46,16],[47,1,49,2],[47,3,49,3],[47,4,49,4],[47,5,47,8],[47,9,47,12],[47,13,47,16],[49,5,49,8],[49,9,49,12],[49,13,49,16],[50,1,52,2],[50,3,52,3],[50,4,52,4],[50,5,50,8],[50,9,50,12],[50,13,50,16],[52,5,52,8],[52,9,52,12],[52,13,52,16],[53,1,55,2],[53,3,55,3],[53,4,55,4],[53,5,53,8],[53,9,53,12],[53,13,53,16],[55,5,55,8],[55,9,55,12],[55,13,55,16],[56,1,58,2],[56,3,58,3],[56,4,58,4],[56,5,56,8],[56,9,56,12],[56,13,56,16],[58,5,58,8],[58,9,58,12],[58,13,58,16],[59,1,61,2],[59,3,61,3],[59,4,61,4],[59,5,59,8],[59,9,59,12],[59,13,59,16],[61,5,61,8],[61,9,61,12],[61,13,61,16],[62,1,64,2],[62,3,64,3],[62,4,64,4],[62,5,62,8],[62,9,62,12],[62,13,62,16],[64,5,64,8],[64,9,64,12],[64,13,64,16],[65,1,67,2],[65,3,67,3],[65,4,67,4],[65,5,65,8],[65,9,65,12],[65,13,65,16],[67,5,67,8],[67,9,67,12],[67,13,67,16],[68,1,70,2],[68,3,70,3],[68,4,70,4],[68,5,68,8],[68,9,68,12],[68,13,68,16],[70,5,70,8],[70,9,70,12],[70,13,70,16],[71,1,73,2],[71,3,73,3],[71,4,73,4],[71,5,71,8],[71,9,71,12],[71,13,71,16],[73,5,73,8],[73,9,73,12],[73,13,73,16],[74,1,76,2],[74,3,76,3],[74,4,76,4],[74,5,74,8],[74,9,74,12],[74,13,74,16],[76,5,76,8],[76,9,76,12],[76,13,76,16],[77,1,79,2],[77,3,79,3],[77,4,79,4],[77,5,77,8],[77,9,77,12],[77,13,77,16],[79,5,79,8],[79,9,79,12],[79,13,79,16],[80,1,82,2],[80,3,82,3],[80,4,82,4],[80,5,80,8],[80,9,80,12],[80,13,80,16],[82,5,82,8],[82,9,82,12],[82,13,82,16],[83,1,85,2],[83,3,85,3],[83,4,85,4],[83,5,83,8],[83,9,83,12],[83,13,83,16],[85,5,85,8],[85,9,85,12],[85,13,85,16],[86,1,88,2],[86,3,88,3],[86,4,88,4],[86,5,86,8],[86,9,86,12],[86,13,86,16],[88,5,88,8],[88,9,88,12],[88,13,88,16],[92,1,92,2],[92,5,92,8],[92,9,92,12],[92,13,92,16],[93,1,93,2],[93,5,93,8],[93,9,93,12],[93,13,93,16],[89,1,91,2],[89,3,91,3],[89,4,91,4],[89,5,89,8],[89,9,89,12],[89,13,89,16],[91,5,91,8],[91,9,91,12],[91,13,91,16],[97,1,97,4],[98,1,98,17],[94,1,94,2],[94,5,94,8],[94,9,94,12],[94,13,94,16],[95,1,95,2],[95,5,95,8],[95,9,95,12],[95,13,95,16]]}
[]
[]
[null,"UNIDADE ESCOLAR",null,null,null,null,null,null,"PRAZO"]
[null,{"$f":"Orçamento!O4","v":"COLÉGIO ESTADUAL THIAGO VIDAL FERNANDES"},null,null,null,null,null,null,"90 DIAS CORRIDOS"]
[]
[null,"OBRA",null,null,null,null,null,null,"DATA"]
[null,{"$f":"Orçamento!O7","v":"REFORMA E AMPLIAÇÃO"},null,null,null,null,null,null,{"$f":"Orçamento!S7","v":"2020-05-06"}]
[]
[null,"LOCAL",null,null,null,null,null,null,"ÁREA TOTAL CONSTRUÍDA (M²)"]
["FILTRO",{"$f":"Orçamento!V7","v":"COCALZINHO DE GOIÁS"},null,null,null,null,null,null,{"$f":"Orçamento!V13","v":1946.01}]
[]
[null,"CRONOGRAMA - FÍSICO FINANCEIRO"]
["↓","CUSTO TOTAL:",{"$f":"D93","v":0},"VALOR","Dias:",30,null,null,null,60,null,null,null,90,null,null,null,"TOTAL"]
[null,"DESCRIÇÃO DOS SERVIÇOS",null,null,"%","1ª PARCELA",null,null,null,"2ª PARCELA",null,null,null,"3ª PARCELA"]
[{"$f":"IF(D15>0,\"F\",\"\")","v":""},"SERVIÇOS PRELIMINARES",null,{"$f":"Orçamento!V396","v":0},{"$f":"Orçamento!X396","v":0},{"$f":"ROUND(F17*$D$15,2)","v":0},null,null,null,{"$f":"ROUND(J17*$D$15,2)","v":0},null,null,null,{"$f":"ROUND(N17*$D$15,2)","v":0},null,null,null,{"$f":"SUM(F15:Q15)","v":0},null,{"$f":"IF(D15=R15,\"OK\",\"ERRO\")","v":"OK"}]
[{"$f":"IF(A15=\"F\",A15,\"\")","v":""}]
[{"$f":"IF(A16=\"F\",A16,\"\")","v":""},null,null,null,null,1,null,null,null,0,null,null,null,{"$f":"1-F17-J17","v":0},null,null,null,{"$f":"IFERROR(E15/100,\"\")","v":0},null,{"$f":"IF(E15=R17*100,\"OK\",\"ERRO\")","v":"OK"}]
[{"$f":"IF(D18>0,\"F\",\"\")","v":""},"TRANSPORTES",null,{"$f":"Orçamento!V397","v":0},{"$f":"Orçamento!X397","v":0},{"$f":"ROUND(F20*$D$18,2)","v":0},null,null,null,{"$f":"ROUND(J20*$D$18,2)","v":0},null,null,null,{"$f":"ROUND(N20*$D$18,2)","v":0},null,null,null,{"$f":"SUM(F18:Q18)","v":0},null,{"$f":"IF(D18=R18,\"OK\",\"ERRO\")","v":"OK"}]
[{"$f":"IF(A18=\"F\",A18,\"\")","v":""}]
[{"$f":"IF(A19=\"F\",A19,\"\")","v":""},null,null,null,null,0.36,null,null,null,0.34,null,null,null,{"$f":"1-F20-J20","v":0.3},null,null,null,{"$f":"IFERROR(E18/100,\"\")","v":0},null,{"$f":"IF(E18=R20*100,\"OK\",\"ERRO\")","v":"OK"}]
[{"$f":"IF(D21>0,\"F\",\"\")","v":""},"SERVIÇO EM TERRA",null,{"$f":"Orçamento!V398","v":0},{"$f":"Orçamento!X398","v":0},{"$f":"ROUND(F23*$D$21,2)","v":0},null,null,null,{"$f":"ROUND(J23*$D$21,2)","v":0},null,null,null,{"$f":"ROUND(N23*$D$21,2)","v":0},null,null,null,{"$f":"SUM(F21:Q21)","v":0},null,{"$f":"IF(D21=R21,\"OK\",\"ERRO\")","v":"OK"}]
[{"$f":"IF(A21=\"F\",A21,\"\")","v":""}]
[{"$f":"IF(A22=\"F\",A22,\"\")","v":""},null,null,null,null,1,null,null,null,0,null,null,null,{"$f":"1-F23-J23","v":0},null,null,null,{"$f":"IFERROR(E21/100,\"\")","v":0},null,{"$f":"IF(E21=R23*100,\"OK\",\"ERRO\")","v":"OK"}]
[{"$f":"IF(D24>0,\"F\",\"\")","v":""},"FUNDAÇÕES E SONDAGENS",null,{"$f":"Orçamento!V399","v":0},{"$f":"Orçamento!X399","v":0},{"$f":"ROUND(F26*$D$24,2)","v":0},null,null,null,{"$f":"ROUND(J26*$D$24,2)","v":0},null,null,null,{"$f":"ROUND(N26*$D$24,2)","v":0},null,null,null,{"$f":"SUM(F24:Q24)","v":0},null,{"$f":"IF(D24=R24,\"OK\",\"ERRO\")","v":"OK"}]
[{"$f":"IF(A24=\"F\",A24,\"\")","v":""}]
[{"$f":"IF(A25=\"F\",A25,\"\")","v":""},null,null,null,null,1,null,null,null,0,null,null,null,{"$f":"1-F26-J26","v":0},null,null,null,{"$f":"IFERROR(E24/100,\"\")","v":0},null,{"$f":"IF(E24=R26*100,\"OK\",\"ERRO\")","v":"OK"}]
[{"$f":"IF(D27>0,\"F\",\"\")","v":""},"ESTRUTURA",null,{"$f":"Orçamento!V400","v":0},{"$f":"Orçamento!X400","v":0},{"$f":"ROUND(F29*$D$27,2)","v":0},null,null,null,{"$f":"ROUND(J29*$D$27,2)","v":0},null,null,null,{"$f":"ROUND(N29*$D$27,2)","v":0},null,null,null,{"$f":"SUM(F27:Q27)","v":0},null,{"$f":"IF(D27=R27,\"OK\",\"ERRO\")","v":"OK"}]
[{"$f":"IF(A27=\"F\",A27,\"\")","v":""}]
[{"$f":"IF(A28=\"F\",A28,\"\")","v":""},null,null,null,null,0.54,null,null,null,0.46,null,null,null,{"$f":"1-F29-J29","v":0},null,null,null,{"$f":"IFERROR(E27/100,\"\")","v":0},null,{"$f":"IF(E27=R29*100,\"OK\",\"ERRO\")","v":"OK"}]
[{"$f":"IF(D30>0,\"F\",\"\")","v":""},"INST.ELET/TELEFÔNICA/CABEAMENTO ESTRUTURADO",null,{"$f":"Orçamento!V401","v":0},{"$f":"Orçamento!X401","v":0},{"$f":"ROUND(F32*$D$30,2)","v":0},null,null,null,{"$f":"ROUND(J32*$D$30,2)","v":0},null,null,null,{"$f":"ROUND(N32*$D$30,2)","v":0},null,null,null,{"$f":"SUM(F30:Q30)","v":0},null,{"$f":"IF(D30=R30,\"OK\",\"ERRO\")","v":"OK"}]
[{"$f":"IF(A30=\"F\",A30,\"\")","v":""}]
[{"$f":"IF(A31=\"F\",A31,\"\")","v":""},null,null,null,null,0,null,null,null,{"$f":"1-B32","v":1},null,null,null,{"$f":"1-F32-J32","v":0},null,null,null,{"$f":"IFERROR(E30/100,\"\")","v":0},null,{"$f":"IF(E30=R32*100,\"OK\",\"ERRO\")","v":"OK"}]
[{"$f":"IF(D33>0,\"F\",\"\")","v":""},"INSTALAÇÕES HIDROSSANITÁRIAS",null,{"$f":"Orçamento!V402","v":0},{"$f":"Orçamento!X402","v":0},{"$f":"ROUND(F35*$D$33,2)","v":0},null,null,null,{"$f":"ROUND(J35*$D$33,2)","v":0},null,null,null,{"$f":"ROUND(N35*$D$33,2)","v":0},null,null,null,{"$f":"SUM(F33:Q33)","v":0},null,{"$f":"IF(D33=R33,\"OK\",\"ERRO\")","v":"OK"}]
[{"$f":"IF(A33=\"F\",A33,\"\")","v":""}]
[{"$f":"IF(A34=\"F\",A34,\"\")","v":""},null,null,null,null,0,null,null,null,{"$f":"1-B35","v":1},null,null,null,{"$f":"1-F35-J35","v":0},null,null,null,{"$f":"IFERROR(E33/100,\"\")","v":0},null,{"$f":"IF(E33=R35*100,\"OK\",\"ERRO\")","v":"OK"}]
[{"$f":"IF(D36>0,\"F\",\"\")","v":""},"INSTALAÇÕES ESPECIAIS",null,{"$f":"Orçamento!V403","v":0},{"$f":"Orçamento!X403","v":0},{"$f":"ROUND(F38*$D$36,2)","v":0},null,null,null,{"$f":"ROUND(J38*$D$36,2)","v":0},null,null,null,{"$f":"ROUND(N38*$D$36,2)","v":0},null,null,null,{"$f":"SUM(F36:Q36)","v":0},null,{"$f":"IF(D36=R36,\"OK\",\"ERRO\")","v":"OK"}]
[{"$f":"IF(A36=\"F\",A36,\"\")","v":""}]
[{"$f":"IF(A37=\"F\",A37,\"\")","v":""},null,null,null,null,0,null,null,null,{"$f":"1-B38","v":1},null,null,null,{"$f":"1-F38-J38","v":0},null,null,null,{"$f":"IFERROR(E36/100,\"\")","v":0},null,{"$f":"IF(E36=R38*100,\"OK\",\"ERRO\")","v":"OK"}]
[{"$f":"IF(D39>0,\"F\",\"\")","v":""},"ALVENARIA E DIVISÓRIAS",null,{"$f":"Orçamento!V404","v":0},{"$f":"Orçamento!X404","v":0},{"$f":"ROUND(F41*$D$39,2)","v":0},null,null,null,{"$f":"ROUND(J41*$D$39,2)","v":0},null,null,null,{"$f":"ROUND(N41*$D$39,2)","v":0},null,null,null,{"$f":"SUM(F39:Q39)","v":0},null,{"$f":"IF(D39=R39,\"OK\",\"ERRO\")","v":"OK"}]
[{"$f":"IF(A39=\"F\",A39,\"\")","v":""}]
[{"$f":"IF(A40=\"F\",A40,\"\")","v":""},null,null,null,null,0,null,null,null,{"$f":"1-B41","v":1},null,null,null,{"$f":"1-F41-J41","v":0},null,null,null,{"$f":"IFERROR(E39/100,\"\")","v":0},null,{"$f":"IF(E39=R41*100,\"OK\",\"ERRO\")","v":"OK"}]
[{"$f":"IF(D42>0,\"F\",\"\")","v":""},"ALVENARIA AUTO-PORTANTE",null,{"$f":"Orçamento!V405","v":0},{"$f":"Orçamento!X405","v":0},{"$f":"ROUND(F44*$D$42,2)","v":0},null,null,null,{"$f":"ROUND(J44*$D$42,2)","v":0},null,null,null,{"$f":"ROUND(N44*$D$42,2)","v":0},null,null,null,{"$f":"SUM(F42:Q42)","v":0},null,{"$f":"IF(D42=R42,\"OK\",\"ERRO\")","v":"OK"}]
[{"$f":"IF(A42=\"F\",A42,\"\")","v":""}]
[{"$f":"IF(A43=\"F\",A43,\"\")","v":""},null,null,null,null,0,null,null,null,{"$f":"1-B44","v":1},null,null,null,{"$f":"1-F44-J44","v":0},null,null,null,{"$f":"IFERROR(E42/100,\"\")","v":0},null,{"$f":"IF(E42=R44*100,\"OK\",\"ERRO\")","v":"OK"}]
[{"$f":"IF(D45>0,\"F\",\"\")","v":""},"IMPERMEABILIZAÇÃO",null,{"$f":"Orçamento!V406","v":0},{"$f":"Orçamento!X406","v":0},{"$f":"ROUND(F47*$D$45,2)","v":0},null,null,null,{"$f":"ROUND(J47*$D$45,2)","v":0},null,null,null,{"$f":"ROUND(N47*$D$45,2)","v":0},null,null,null,{"$f":"SUM(F45:Q45)","v":0},null,{"$f":"IF(D45=R45,\"OK\",\"ERRO\")","v":"OK"}]
[{"$f":"IF(A45=\"F\",A45,\"\")","v":""}]
[{"$f":"IF(A46=\"F\",A46,\"\")","v":""},null,null,null,null,0.85,null,null,null,0.15,null,null,null,{"$f":"1-F47-J47","v":0},null,null,null,{"$f":"IFERROR(E45/100,\"\")","v":0},null,{"$f":"IF(E45=R47*100,\"OK\",\"ERRO\")","v":"OK"}]
[{"$f":"IF(D48>0,\"F\",\"\")","v":""},"ISOLAMENTO TÉRMICO E ACÚSTICO",null,{"$f":"Orçamento!V407","v":0},{"$f":"Orçamento!X407","v":0},{"$f":"ROUND(F50*$D$48,2)","v":0},null,null,null,{"$f":"ROUND(J50*$D$48,2)","v":0},null,null,null,{"$f":"ROUND(N50*$D$48,2)","v":0},null,null,null,{"$f":"SUM(F48:Q48)","v":0},null,{"$f":"IF(D48=R48,\"OK\",\"ERRO\")","v":"OK"}]
[{"$f":"IF(A48=\"F\",A48,\"\")","v":""}]
[{"$f":"IF(A49=\"F\",A49,\"\")","v":""},null,null,null,null,0,null,null,null,{"$f":"1-B50","v":1},null,null,null,{"$f":"1-F50-J50","v":0},null,null,null,{"$f":"IFERROR(E48/100,\"\")","v":0},null,{"$f":"IF(E48=R50*100,\"OK\",\"ERRO\")","v":"OK"}]
[{"$f":"IF(D51>0,\"F\",\"\")","v":""},"ESTRUTURA DE MADEIRA",null,{"$f":"Orçamento!V408","v":0},{"$f":"Orçamento!X408","v":0},{"$f":"ROUND(F53*$D$51,2)","v":0},null,null,null,{"$f":"ROUND(J53*$D$51,2)","v":0},null,null,null,{"$f":"ROUND(N53*$D$51,2)","v":0},null,null,null,{"$f":"SUM(F51:Q51)","v":0},null,{"$f":"IF(D51=R51,\"OK\",\"ERRO\")","v":"OK"}]
[{"$f":"IF(A51=\"F\",A51,\"\")","v":""}]
[{"$f":"IF(A52=\"F\",A52,\"\")","v":""},null,null,null,null,0,null,null,null,0.57999999999999996,null,null,null,{"$f":"1-F53-J53","v":0.42000000000000004},null,null,null,{"$f":"IFERROR(E51/100,\"\")","v":0},null,{"$f":"IF(E51=R53*100,\"OK\",\"ERRO\")","v":"OK"}]
[{"$f":"IF(D54>0,\"F\",\"\")","v":""},"ESTRUTURA METÁLICA",null,{"$f":"Orçamento!V409","v":0},{"$f":"Orçamento!X409","v":0},{"$f":"ROUND(F56*$D$54,2)","v":0},null,null,null,{"$f":"ROUND(J56*$D$54,2)","v":0},null,null,null,{"$f":"ROUND(N56*$D$54,2)","v":0},null,null,null,{"$f":"SUM(F54:Q54)","v":0},null,{"$f":"IF(D54=R54,\"OK\",\"ERRO\")","v":"OK"}]
[{"$f":"IF(A54=\"F\",A54,\"\")","v":""}]
[{"$f":"IF(A55=\"F\",A55,\"\")","v":""},null,null,null,null,0,null,null,null,0.57999999999999996,null,null,null,{"$f":"1-F56-J56","v":0.42000000000000004},null,null,null,{"$f":"IFERROR(E54/100,\"\")","v":0},null,{"$f":"IF(E54=R56*100,\"OK\",\"ERRO\")","v":"OK"}]
[{"$f":"IF(D57>0,\"F\",\"\")","v":""},"COBERTURAS",null,{"$f":"Orçamento!V410","v":0},{"$f":"Orçamento!X410","v":0},{"$f":"ROUND(F59*$D$57,2)","v":0},null,null,null,{"$f":"ROUND(J59*$D$57,2)","v":0},null,null,null,{"$f":"ROUND(N59*$D$57,2)","v":0},null,null,null,{"$f":"SUM(F57:Q57)","v":0},null,{"$f":"IF(D57=R57,\"OK\",\"ERRO\")","v":"OK"}]
[{"$f":"IF(A57=\"F\",A57,\"\")","v":""}]
[{"$f":"IF(A58=\"F\",A58,\"\")","v":""},null,null,null,null,0,null,null,null,0,null,null,null,{"$f":"1-F59-J59","v":1},null,null,null,{"$f":"IFERROR(E57/100,\"\")","v":0},null,{"$f":"IF(E57=R59*100,\"OK\",\"ERRO\")","v":"OK"}]
[{"$f":"IF(D60>0,\"F\",\"\")","v":""},"ESQUADRIAS DE MADEIRA",null,{"$f":"Orçamento!V411","v":0},{"$f":"Orçamento!X411","v":0},{"$f":"ROUND(F62*$D$60,2)","v":0},null,null,null,{"$f":"ROUND(J62*$D$60,2)","v":0},null,null,null,{"$f":"ROUND(N62*$D$60,2)","v":0},null,null,null,{"$f":"SUM(F60:Q60)","v":0},null,{"$f":"IF(D60=R60,\"OK\",\"ERRO\")","v":"OK"}]
[{"$f":"IF(A60=\"F\",A60,\"\")","v":""}]
[{"$f":"IF(A61=\"F\",A61,\"\")","v":""},null,null,null,null,0,null,null,null,0.4,null,null,null,{"$f":"1-F62-J62","v":0.6},null,null,null,{"$f":"IFERROR(E60/100,\"\")","v":0},null,{"$f":"IF(E60=R62*100,\"OK\",\"ERRO\")","v":"OK"}]
[{"$f":"IF(D63>0,\"F\",\"\")","v":""},"ESQUADRIAS METÁLICAS",null,{"$f":"Orçamento!V412","v":0},{"$f":"Orçamento!X412","v":0},{"$f":"ROUND(F65*$D$63,2)","v":0},null,null,null,{"$f":"ROUND(J65*$D$63,2)","v":0},null,null,null,{"$f":"ROUND(N65*$D$63,2)","v":0},null,null,null,{"$f":"SUM(F63:Q63)","v":0},null,{"$f":"IF(D63=R63,\"OK\",\"ERRO\")","v":"OK"}]
[{"$f":"IF(A63=\"F\",A63,\"\")","v":""}]
[{"$f":"IF(A64=\"F\",A64,\"\")","v":""},null,null,null,null,0,null,null,null,0.45,null,null,null,{"$f":"1-F65-J65","v":0.55000000000000004},null,null,null,{"$f":"IFERROR(E63/100,\"\")","v":0},null,{"$f":"IF(E63=R65*100,\"OK\",\"ERRO\")","v":"OK"}]
[{"$f":"IF(D66>0,\"F\",\"\")","v":""},"VIDROS",null,{"$f":"Orçamento!V413","v":0},{"$f":"Orçamento!X413","v":0},{"$f":"ROUND(F68*$D$66,2)","v":0},null,null,null,{"$f":"ROUND(J68*$D$66,2)","v":0},null,null,null,{"$f":"ROUND(N68*$D$66,2)","v":0},null,null,null,{"$f":"SUM(F66:Q66)","v":0},null,{"$f":"IF(D66=R66,\"OK\",\"ERRO\")","v":"OK"}]
[{"$f":"IF(A66=\"F\",A66,\"\")","v":""}]
[{"$f":"IF(A67=\"F\",A67,\"\")","v":""},null,null,null,null,0,null,null,null,0,null,null,null,{"$f":"1-F68-J68","v":1},null,null,null,{"$f":"IFERROR(E66/100,\"\")","v":0},null,{"$f":"IF(E66=R68*100,\"OK\",\"ERRO\")","v":"OK"}]
[{"$f":"IF(D69>0,\"F\",\"\")","v":""},"REVESTIMENTO DE PAREDE",null,{"$f":"Orçamento!V414","v":0},{"$f":"Orçamento!X414","v":0},{"$f":"ROUND(F71*$D$69,2)","v":0},null,null,null,{"$f":"ROUND(J71*$D$69,2)","v":0},null,null,null,{"$f":"ROUND(N71*$D$69,2)","v":0},null,null,null,{"$f":"SUM(F69:Q69)","v":0},null,{"$f":"IF(D69=R69,\"OK\",\"ERRO\")","v":"OK"}]
[{"$f":"IF(A69=\"F\",A69,\"\")","v":""}]
[{"$f":"IF(A70=\"F\",A70,\"\")","v":""},null,null,null,null,0,null,null,null,0.4,null,null,null,{"$f":"1-F71-J71","v":0.6},null,null,null,{"$f":"IFERROR(E69/100,\"\")","v":0},null,{"$f":"IF(E69=R71*100,\"OK\",\"ERRO\")","v":"OK"}]
[{"$f":"IF(D72>0,\"F\",\"\")","v":""},"FORROS",null,{"$f":"Orçamento!V415","v":0},{"$f":"Orçamento!X415","v":0},{"$f":"ROUND(F74*$D$72,2)","v":0},null,null,null,{"$f":"ROUND(J74*$D$72,2)","v":0},null,null,null,{"$f":"ROUND(N74*$D$72,2)","v":0},null,null,null,{"$f":"SUM(F72:Q72)","v":0},null,{"$f":"IF(D72=R72,\"OK\",\"ERRO\")","v":"OK"}]
[{"$f":"IF(A72=\"F\",A72,\"\")","v":""}]
[{"$f":"IF(A73=\"F\",A73,\"\")","v":""},null,null,null,null,0,null,null,null,0.4,null,null,null,{"$f":"1-F74-J74","v":0.6},null,null,null,{"$f":"IFERROR(E72/100,\"\")","v":0},null,{"$f":"IF(E72=R74*100,\"OK\",\"ERRO\")","v":"OK"}]
[{"$f":"IF(D75>0,\"F\",\"\")","v":""},"REVESTIMENTO DE PISO",null,{"$f":"Orçamento!V416","v":0},{"$f":"Orçamento!X416","v":0},{"$f":"ROUND(F77*$D$75,2)","v":0},null,null,null,{"$f":"ROUND(J77*$D$75,2)","v":0},null,null,null,{"$f":"ROUND(N77*$D$75,2)","v":0},null,null,null,{"$f":"SUM(F75:Q75)","v":0},null,{"$f":"IF(D75=R75,\"OK\",\"ERRO\")","v":"OK"}]
[{"$f":"IF(A75=\"F\",A75,\"\")","v":""}]
[{"$f":"IF(A76=\"F\",A76,\"\")","v":""},null,null,null,null,0,null,null,null,0.4,null,null,null,{"$f":"1-F77-J77","v":0.6},null,null,null,{"$f":"IFERROR(E75/100,\"\")","v":0},null,{"$f":"IF(E75=R77*100,\"OK\",\"ERRO\")","v":"OK"}]
[{"$f":"IF(D78>0,\"F\",\"\")","v":""},"FERRAGENS",null,{"$f":"Orçamento!V417","v":0},{"$f":"Orçamento!X417","v":0},{"$f":"ROUND(F80*$D$78,2)","v":0},null,null,null,{"$f":"ROUND(J80*$D$78,2)","v":0},null,null,null,{"$f":"ROUND(N80*$D$78,2)","v":0},null,null,null,{"$f":"SUM(F78:Q78)","v":0},null,{"$f":"IF(D78=R78,\"OK\",\"ERRO\")","v":"OK"}]
[{"$f":"IF(A78=\"F\",A78,\"\")","v":""}]
[{"$f":"IF(A79=\"F\",A79,\"\")","v":""},null,null,null,null,0,null,null,null,0,null,null,null,{"$f":"1-F80-J80","v":1},null,null,null,{"$f":"IFERROR(E78/100,\"\")","v":0},null,{"$f":"IF(E78=R80*100,\"OK\",\"ERRO\")","v":"OK"}]
[{"$f":"IF(D81>0,\"F\",\"\")","v":""},"MARCENARIA",null,{"$f":"Orçamento!V418","v":0},{"$f":"Orçamento!X418","v":0},{"$f":"ROUND(F83*$D$81,2)","v":0},null,null,null,{"$f":"ROUND(J83*$D$81,2)","v":0},null,null,null,{"$f":"ROUND(N83*$D$81,2)","v":0},null,null,null,{"$f":"SUM(F81:Q81)","v":0},null,{"$f":"IF(D81=R81,\"OK\",\"ERRO\")","v":"OK"}]
[{"$f":"IF(A81=\"F\",A81,\"\")","v":""}]
[{"$f":"IF(A82=\"F\",A82,\"\")","v":""},null,null,null,null,0,null,null,null,0,null,null,null,{"$f":"1-F83-J83","v":1},null,null,null,{"$f":"IFERROR(E81/100,\"\")","v":0},null,{"$f":"IF(E81=R83*100,\"OK\",\"ERRO\")","v":"OK"}]
[{"$f":"IF(D84>0,\"F\",\"\")","v":""},"ADMINISTRAÇÃO - MENSALISTAS",null,{"$f":"Orçamento!V419","v":0},{"$f":"Orçamento!X419","v":0},{"$f":"ROUND(F86*$D$84,2)","v":0},null,null,null,{"$f":"ROUND(J86*$D$84,2)","v":0},null,null,null,{"$f":"ROUND(N86*$D$84,2)","v":0},null,null,null,{"$f":"SUM(F84:Q84)","v":0},null,{"$f":"IF(D84=R84,\"OK\",\"ERRO\")","v":"OK"}]
[{"$f":"IF(A84=\"F\",A84,\"\")","v":""}]
[{"$f":"IF(A85=\"F\",A85,\"\")","v":""},null,null,null,null,0.34,null,null,null,0.34,null,null,null,{"$f":"1-F86-J86","v":0.3199999999999999},null,null,null,{"$f":"IFERROR(E84/100,\"\")","v":0},null,{"$f":"IF(E84=R86*100,\"OK\",\"ERRO\")","v":"OK"}]
[{"$f":"IF(D87>0,\"F\",\"\")","v":""},"PINTURA",null,{"$f":"Orçamento!V420","v":0},{"$f":"Orçamento!X420","v":0},{"$f":"ROUND(F89*$D$87,2)","v":0},null,null,null,{"$f":"ROUND(J89*$D$87,2)","v":0},null,null,null,{"$f":"ROUND(N89*$D$87,2)","v":0},null,null,null,{"$f":"SUM(F87:Q87)","v":0},null,{"$f":"IF(D87=R87,\"OK\",\"ERRO\")","v":"OK"}]
[{"$f":"IF(A87=\"F\",A87,\"\")","v":""}]
[{"$f":"IF(A88=\"F\",A88,\"\")","v":""},null,null,null,null,0,null,null,null,0,null,null,null,{"$f":"1-F89-J89","v":1},null,null,null,{"$f":"IFERROR(E87/100,\"\")","v":0},null,{"$f":"IF(E87=R89*100,\"OK\",\"ERRO\")","v":"OK"}]
[{"$f":"IF(D90>0,\"F\",\"\")","v":""},"DIVERSOS",null,{"$f":"Orçamento!V421","v":0},{"$f":"Orçamento!X421","v":0},{"$f":"ROUND(F92*$D$90,2)","v":0},null,null,null,{"$f":"ROUND(J92*$D$90,2)","v":0},null,null,null,{"$f":"ROUND(N92*$D$90,2)","v":0},null,null,null,{"$f":"SUM(F90:Q90)","v":0},null,{"$f":"IF(D90=R90,\"OK\",\"ERRO\")","v":"OK"}]
[{"$f":"IF(A90=\"F\",A90,\"\")","v":""}]
[{"$f":"IF(A91=\"F\",A91,\"\")","v":""},null,null,null,null,0,null,null,null,0,null,null,null,{"$f":"1-F92-J92","v":1},null,null,null,{"$f":"IFERROR(E90/100,\"\")","v":0},null,{"$f":"IF(E90=R92*100,\"OK\",\"ERRO\")","v":"OK"}]
["F","CUSTO DO ORÇAMENTO",null,{"$f":"SUM(D15:D92)","v":0},{"$f":"SUM(E15:E92)","v":0},{"$f":"F15+F18+F21+F24+F27+F30+F33+F36+F39+F42+F45+F48+F51+F54+F57+F60+F63+F66+F69+F72+F75+F78+F81+F84+F87+F90","v":0},null,null,null,{"$f":"J15+J18+J21+J24+J27+J30+J33+J36+J39+J42+J45+J48+J51+J54+J57+J60+J63+J66+J69+J72+J75+J78+J81+J84+J87+J90","v":0},null,null,null,{"$f":"N15+N18+N21+N24+N27+N30+N33+N36+N39+N42+N45+N48+N51+N54+N57+N60+N63+N66+N69+N72+N75+N78+N81+N84+N87+N90","v":0},null,null,null,{"$f":"R15+R18+R21+R24+R27+R30+R33+R36+R39+R42+R45+R48+R51+R54+R57+R60+R63+R66+R69+R72+R75+R78+R81+R84+R87+R90","v":0}]
["F","PERCENTUAIS:",null,null,null,{"$f":"IFERROR(F93/D93,\"\")","v":""},null,null,null,{"$f":"IFERROR(J93/D93,\"\")","v":""},null,null,null,{"$f":"IFERROR(N93/D93,\"\")+0.01%","v":{"$error":"#VALUE!"}},null,null,null,{"$f":"SUM(F94:Q94)","v":{"$error":"#VALUE!"}}]
["F","TOTAIS ACUMULADOS:",null,null,null,{"$f":"F93","v":0},null,null,null,{"$f":"F95+J93","v":0},null,null,null,{"$f":"J95+N93","v":0}]
["F","PERCENTUAIS  ACUMULADOS:",null,null,null,{"$f":"F94","v":""},null,null,null,{"$f":"J94+F96","v":{"$error":"#VALUE!"}},null,null,null,{"$f":"IFERROR(J96+N94,\"\")","v":""},null,null,null,null,null,null,{"$f":"7.01+56.64+36.35","v":100}]
["F"]
["F","OBSERVAÇÕES:"]
["F","Os pagamentos somente poderão ser efetuados mediante medição e atesto pelos técnicos da Secretaria da Educação. "]

{"sheet":"Composição BDI","index":4,"n_rows":45,"n_cols":9,"rows_kept":45,"cut":false,"hidden":false,"merged":[[11,0,11,3],[12,0,12,3],[14,0,14,3],[15,0,15,3],[13,0,13,3],[0,0,0,3],[1,0,1,3],[4,0,4,3],[7,0,7,3],[10,0,10,3],[2,0,2,3],[3,0,3,3],[5,0,5,3],[6,0,6,3],[8,0,8,3],[9,0,9,3],[18,5,18,8],[17,0,17,3],[16,0,16,3],[44,0,44,3],[42,0,42,3],[43,0,43,3],[18,0,18,3],[36,0,36,3],[39,0,39,3],[38,0,38,3],[40,0,40,3],[29,0,29,2],[32,0,32,3],[33,0,33,3],[34,0,34,3],[35,0,35,3]]}
[]
[]
["UNIDADE ESCOLAR"]
[{"$f":"Orçamento!$O$4","v":"COLÉGIO ESTADUAL THIAGO VIDAL FERNANDES"}]
[]
["OBRA"]
[{"$f":"Orçamento!$O$7","v":"REFORMA E AMPLIAÇÃO"}]
[]
["ENDEREÇO"]
[{"$f":"Orçamento!$R$10","v":" AV. TOCANTINS ESQ. COM A ITAPACI S/N , CENTRO , CEP: 7297-000"}]
[]
["CIDADE"]
[{"$f":"Orçamento!$V$7","v":"COCALZINHO DE GOIÁS"}]
[]
["CRE"]
[{"$f":"Orçamento!$O$10","v":"CRE-ANÁPOLIS"}]
[]
["DETALHAMENTO DA COMPOSIÇÃO DE BDI"]
["COMPOSIÇÃO BDI PARA OBRAS CIVIS",null,null,null,null,"BDI CONSTRUÇÃO E REFORMA"]
["DESCRIÇÃO","COEF.","TAXA % (a.m)","% no preço de venda",null,"Situação","1º Quartil","Médio","3º Quartil"]
["1) COFINS",1,0.03,{"$f":"C21","v":0.03},null,{"$f":"IF(OR(C21<G21,C21>I21),\"FORA DO INTERVALO\",\"OK\")","v":"OK"},0.03,0.03,0.03]
["2) PIS",1,6.4999999999999997E-3,{"$f":"C22","v":6.4999999999999997E-3},null,{"$f":"IF(OR(C22<G22,C22>I22),\"FORA DO INTERVALO\",\"OK\")","v":"OK"},6.4999999999999997E-3,6.4999999999999997E-3,6.4999999999999997E-3]
["3) ISSQN",1,{"$f":"IFERROR(VLOOKUP($A$13,#REF!,10,FALSE())/100,0)","v":0},{"$f":"C23*B23","v":0},null,"FORA DO INTERVALO",0.02,3.5000000000000003E-2,0.05]
["4) CPRB",1,{"$f":"IF(Orçamento!$T$10=\"DESONERADA\",4.5%,0)","v":4.4999999999999998E-2},{"$f":"C24","v":4.4999999999999998E-2},null,"OK",4.4999999999999998E-2,4.4999999999999998E-2,4.4999999999999998E-2]
["5) Administração Central",1,3.5000000000000003E-2,3.5000000000000003E-2,null,"OK",0.03,0.04,5.5E-2]
["6) Despesas Financeiras",1,5.5999999999999999E-3,5.5999999999999999E-3,null,"FORA DO INTERVALO",5.8999999999999999E-3,1.23E-2,1.3899999999999999E-2]
["7) Seguros + Garantias",1,1.1999999999999999E-3,1.1999999999999999E-3,null,"FORA DO INTERVALO",8.0000000000000002E-3,8.0000000000000002E-3,0.01]
["8) Risco",1,9.7000000000000003E-3,9.7000000000000003E-3,null,"OK",9.7000000000000003E-3,1.2699999999999999E-2,1.2699999999999999E-2]
["9) Lucro",1,6.2399999999999997E-2,6.2399999999999997E-2,null,"OK",6.1600000000000002E-2,7.3999999999999996E-2,8.9599999999999999E-2]
["BDI - FINAL",null,null,{"$f":"(((1+D25+D27+D28)*(1+D26)*(1+D29))/(1-(D21+D22+D23+D24))-1)","v":0.2165342180685903},null,{"$f":"IF(OR(D30<G30,D30>I30),\"FORA DO INTERVALO\",\"OK\")","v":"OK"},0.2034,0.22120000000000001,0.25]
[]
["Notas:"]
["(1) e (2) Alíquota definida por lei."]
["(3) Alíquota e base de cálculo definidas pela legislação municipal."]
["(4) Alíquota definida pelas leis 12.546/11, 12844/13 e 13.161/15 (CPRB – contribuição previdenciária sobre a receita bruta)."]
["(5) Valores definidos a partir dos limites no Acórdão nº 2.622/2013 - TCU – Plenário. Valores entre o 1º e 3º quartis."]
["(6) Valor calculado pela expressão matemática do acórdão 2.369/2011 – TCU – Plenário e disponibilizado pela AGETOP em dezembro de 2018. (Foi utilizado para o cálculo a média da Taxa SELIC no período de 11/2017 a 10/2018)"]
[]
["(7) Valores definidos pela AGETOP a partir dos limites no Acórdão nº 2.622/2013 - TCU – Plenário. Valores médios. \n\nObservação da AGETOP: (Seguros contra erros de execução, incêndio e explosão, danos da natureza (vendaval, destelhamento, alagamento, inundação, desmoronamento, geadas etc.), emprego de material defeituoso ou inadequado, roubo e/ou furto qualificado, quebra de equipamentos, desmoronamento de estrutura, nas modalidades de Obras Civis em Construção (OCC); Instalação e Montagem (IM); e Obras Civis em Construção e Instalação e Montagem (OCC/IM). Bem como coberturas adicionais para ampliação dessas coberturas básicas, como: cobertura de responsabilidade civil geral, cobertura de responsabilidade civil cruzada, cobertura de despesas extraordinárias, cobertura de tumultos, cobertura de desentulho do local, cobertura de riscos do fabricante, dentre outras, incluindo o seguro de vida em grupo regido pela convenção coletiva dos trabalhadores na indústria da construção civil). A partir de 24/02/2015 por intermédio da Portaria 449/2015 a Presidência da AGETOP, na pessoa do Senhor Jayme Eduardo Rincon, determinou a exclusão dos valores referentes aos Seguros de Risco de Engenharia e Responsabilidade Civil do Profissional na composição do cálculo do B.D.I.."]
["(8) Valores definidos a partir dos limites no Acórdão nº 2.622/2013 - TCU – Plenário. Valores entre 1º e 3° quartis."]
["(9) Valores definidos a partir dos limites definidos no Acórdão nº 2.622/2013 - TCU – Plenário. Valores adotados e praticados no mercado ( “ ex ante ” ) ou aqueles entre os 1º e 3º quartis."]
[]
["(*) A fórmula para estipulação da taxa de BDI estimado adotado é a mesma que foi aplicada para a obtenção das tabelas contidas no Acórdão n. 2.622/2013 – TCUPlenário"]
[]
["Obs.: Para obras com valores superiores a R$ 20.000.000,00 sugere-se recalcular o BDI, dimensionando as taxas de administração central e lucro para patamares inferiores ao estipulado acima."]

{"sheet":"Relatório CENTRAL","index":5,"n_rows":40,"n_cols":5,"rows_kept":40,"cut":false,"hidden":false,"merged":[[11,1,11,4],[39,1,39,2],[9,0,11,0],[0,1,0,4],[6,3,6,4],[9,3,9,4],[1,1,1,4],[2,1,2,2],[2,3,2,4],[3,1,3,2],[3,3,3,4],[4,1,4,4],[5,1,5,2],[5,3,5,4],[6,1,6,2],[7,1,7,4],[8,1,8,2],[8,3,8,4],[9,1,9,2],[10,1,10,4]]}
[]
[]
[null,"UNIDADE ESCOLAR",null,"CIDADE"]
[null,{"$f":"Orçamento!$O$4","v":"COLÉGIO ESTADUAL THIAGO VIDAL FERNANDES"},null,{"$f":"Orçamento!$V$7","v":"COCALZINHO DE GOIÁS"}]
[]
[null,"OBRA",null,"CRE"]
[null,{"$f":"Orçamento!$O$7","v":"REFORMA E AMPLIAÇÃO"},null,{"$f":"Orçamento!$O$10","v":"CRE-ANÁPOLIS"}]
[]
[null,"ENDEREÇO",null,"DATA"]
["FILTRO",{"$f":"Orçamento!$R$10","v":" AV. TOCANTINS ESQ. COM A ITAPACI S/N , CENTRO , CEP: 7297-000"},null,{"$f":"Orçamento!$S$7","v":"2020-05-06"}]
[]
[null,"RELATÓRIO CENTRAL"]
["↓","CÓDIGO","ETAPA","PREÇO  (R$) C/ BDI","PARTIC  ( % )"]
[{"$f":"IF(D14>0,\"F\",\"\")","v":""},{"$f":"Orçamento!O396","v":"a."},{"$f":"Orçamento!P396","v":"SERVIÇOS PRELIMINARES"},{"$f":"Orçamento!V396","v":0},{"$f":"Orçamento!X396","v":0}]
[{"$f":"IF(D15>0,\"F\",\"\")","v":""},{"$f":"Orçamento!O397","v":"b."},{"$f":"Orçamento!P397","v":"TRANSPORTES"},{"$f":"Orçamento!V397","v":0},{"$f":"Orçamento!X397","v":0}]
["",{"$f":"Orçamento!O398","v":"c."},{"$f":"Orçamento!P398","v":"SERVIÇO EM TERRA"},{"$f":"Orçamento!V398","v":0},{"$f":"Orçamento!X398","v":0}]
["",{"$f":"Orçamento!O399","v":"d."},{"$f":"Orçamento!P399","v":"FUNDAÇÕES E SONDAGENS"},{"$f":"Orçamento!V399","v":0},{"$f":"Orçamento!X399","v":0}]
["",{"$f":"Orçamento!O400","v":"e."},{"$f":"Orçamento!P400","v":"ESTRUTURA"},{"$f":"Orçamento!V400","v":0},{"$f":"Orçamento!X400","v":0}]
["",{"$f":"Orçamento!O401","v":"f."},{"$f":"Orçamento!P401","v":"INSTALAÇÕES ELÉTRICAS"},{"$f":"Orçamento!V401","v":0},{"$f":"Orçamento!X401","v":0}]
["",{"$f":"Orçamento!O402","v":"g."},{"$f":"Orçamento!P402","v":"INSTALAÇÕES HIDROSSANITÁRIAS"},{"$f":"Orçamento!V402","v":0},{"$f":"Orçamento!X402","v":0}]
["",{"$f":"Orçamento!O403","v":"h"},{"$f":"Orçamento!P403","v":"INSTALAÇÕES ESPECIAIS"},{"$f":"Orçamento!V403","v":0},{"$f":"Orçamento!X403","v":0}]
["",{"$f":"Orçamento!O404","v":"i."},{"$f":"Orçamento!P404","v":"ALVENARIAS E DIVISÓRIAS"},{"$f":"Orçamento!V404","v":0},{"$f":"Orçamento!X404","v":0}]
["",{"$f":"Orçamento!O405","v":"j."},{"$f":"Orçamento!P405","v":"ALVENARIA AUTO-PORTANTE"},{"$f":"Orçamento!V405","v":0},{"$f":"Orçamento!X405","v":0}]
["",{"$f":"Orçamento!O406","v":"k."},{"$f":"Orçamento!P406","v":"IMPERMEABILIZAÇÃO"},{"$f":"Orçamento!V406","v":0},{"$f":"Orçamento!X406","v":0}]
["",{"$f":"Orçamento!O407","v":"l."},{"$f":"Orçamento!P407","v":"ISOLAMENTO TÉRMICO E ACÚSTICO"},{"$f":"Orçamento!V407","v":0},{"$f":"Orçamento!X407","v":0}]
["",{"$f":"Orçamento!O408","v":"m."},{"$f":"Orçamento!P408","v":"ESTRUTURA DE MADEIRA"},{"$f":"Orçamento!V408","v":0},{"$f":"Orçamento!X408","v":0}]
["",{"$f":"Orçamento!O409","v":"n."},{"$f":"Orçamento!P409","v":"ESTRUTURAS METÁLICAS"},{"$f":"Orçamento!V409","v":0},{"$f":"Orçamento!X409","v":0}]
["",{"$f":"Orçamento!O410","v":"o."},{"$f":"Orçamento!P410","v":"COBERTURAS"},{"$f":"Orçamento!V410","v":0},{"$f":"Orçamento!X410","v":0}]
["",{"$f":"Orçamento!O411","v":"p."},{"$f":"Orçamento!P411","v":"ESQUADRIAS DE MADEIRA"},{"$f":"Orçamento!V411","v":0},{"$f":"Orçamento!X411","v":0}]
["",{"$f":"Orçamento!O412","v":"q."},{"$f":"Orçamento!P412","v":"ESQUADRIAS METÁLICAS"},{"$f":"Orçamento!V412","v":0},{"$f":"Orçamento!X412","v":0}]
["",{"$f":"Orçamento!O413","v":"r."},{"$f":"Orçamento!P413","v":"VIDROS"},{"$f":"Orçamento!V413","v":0},{"$f":"Orçamento!X413","v":0}]
["",{"$f":"Orçamento!O414","v":"s."},{"$f":"Orçamento!P414","v":"REVESTIMENTO DE PAREDE"},{"$f":"Orçamento!V414","v":0},{"$f":"Orçamento!X414","v":0}]
["",{"$f":"Orçamento!O415","v":"t."},{"$f":"Orçamento!P415","v":"FORROS"},{"$f":"Orçamento!V415","v":0},{"$f":"Orçamento!X415","v":0}]
["",{"$f":"Orçamento!O416","v":"u."},{"$f":"Orçamento!P416","v":"REVESTIMENTO DE PISO"},{"$f":"Orçamento!V416","v":0},{"$f":"Orçamento!X416","v":0}]
["",{"$f":"Orçamento!O417","v":"v."},{"$f":"Orçamento!P417","v":"FERRAGENS"},{"$f":"Orçamento!V417","v":0},{"$f":"Orçamento!X417","v":0}]
["",{"$f":"Orçamento!O418","v":"w."},{"$f":"Orçamento!P418","v":"MARCENARIA"},{"$f":"Orçamento!V418","v":0},{"$f":"Orçamento!X418","v":0}]
["",{"$f":"Orçamento!O419","v":"x."},{"$f":"Orçamento!P419","v":"ADMINISTRAÇÃO"},{"$f":"Orçamento!V419","v":0},{"$f":"Orçamento!X419","v":0}]
["",{"$f":"Orçamento!O420","v":"y."},{"$f":"Orçamento!P420","v":"PINTURA"},{"$f":"Orçamento!V420","v":0},{"$f":"Orçamento!X420","v":0}]
["",{"$f":"Orçamento!O421","v":"z."},{"$f":"Orçamento!P421","v":"DIVERSOS"},{"$f":"Orçamento!V421","v":0},{"$f":"Orçamento!X421","v":0}]
["F","TOTAL GERAL DO ORÇAMENTO (R$) C/BDI",null,{"$f":"SUM(D14:D39)","v":0},{"$f":"SUM(E14:E39)","v":0}]

{"sheet":"Parc Maior Relev","index":6,"n_rows":33,"n_cols":7,"rows_kept":33,"cut":false,"hidden":false,"merged":[[0,1,0,6],[11,1,11,6],[1,1,1,6],[2,1,2,3],[2,4,2,6],[3,1,3,3],[3,4,3,6],[4,1,4,6],[5,1,5,3],[5,4,5,6],[9,1,9,3],[9,4,9,6],[10,1,10,6],[6,1,6,3],[6,4,6,6],[7,1,7,6],[8,1,8,3],[8,4,8,6],[33,3,33,7],[31,1,31,6]]}
[]
[]
[null,"UNIDADE ESCOLAR",null,null,"CÓDIGO INEP"]
[null,{"$f":"Orçamento!$O$4","v":"COLÉGIO ESTADUAL THIAGO VIDAL FERNANDES"},null,null,{"$f":"Orçamento!$V$4","v":52044572}]
[]
[null,"OBRA",null,null,"CIDADE"]
[null,{"$f":"Orçamento!$O$7","v":"REFORMA E AMPLIAÇÃO"},null,null,{"$f":"Orçamento!$V$7","v":"COCALZINHO DE GOIÁS"}]
[]
[null,"CRE",null,null,"ÁREA TOTAL CONSTRUÍDA (M²)"]
[null,{"$f":"Orçamento!$O$10","v":"CRE-ANÁPOLIS"},null,null,{"$f":"Orçamento!$V$13","v":1946.01}]
[]
["FILTRO","PARCELA DE MAIOR RELEVÂNCIA"]
[{"$f":"IF(G14>0,\"F\",\"\")","v":""},"CÓDIGO","SERVIÇO","DESCRIÇÃO","UNID","QUANT","PARC. MAIOR RELEV (100%)"]
[{"$f":"IF(G14>0,\"F\",\"\")","v":""},{"$f":"Somatório!B22","v":"f."},"INSTALAÇÕES ELÉTRICAS","SUBESTAÇÃO","KVA",{"$f":"SUMIF(Orçamento!$R$20:$R$377,'Parc Maior Relev'!D14,Orçamento!$T$20:$T$377)","v":0},{"$f":"F14","v":0}]
[{"$f":"IF(SUM(G16:G30)>0,\"F\",\"\")","v":"F"},"CÓDIGO","SERVIÇO","DESCRIÇÃO","UNID","QUANT","PARC. MAIOR RELEV (50%)"]
[{"$f":"IF(G16>0,\"F\",\"\")","v":""},{"$f":"Somatório!B21","v":"e."},"ESTRUTURA","CONCRETO","M3",{"$f":"SUMIF(Orçamento!$R$20:$R$377,'Parc Maior Relev'!D16,Orçamento!$T$20:$T$377)","v":0},{"$f":"F16*0.5","v":0}]
[{"$f":"IF(G17>0,\"F\",\"\")","v":""},"f.","INSTALAÇÕES ELÉTRICAS","INSTALAÇÕES ELÉTRICAS","KVA",{"$f":"SUMIF(Orçamento!$R$20:$R$377,'Parc Maior Relev'!D17,Orçamento!$T$20:$T$377)","v":0},{"$f":"F17","v":0}]
[{"$f":"IF(G18>0,\"F\",\"\")","v":""},{"$f":"Somatório!B31","v":"o."},"COBERTURAS","COBERTURA CERÂMICA","M2",{"$f":"SUMIF(Orçamento!$R$20:$R$377,'Parc Maior Relev'!D18,Orçamento!$T$20:$T$377)","v":0},{"$f":"F18*0.5","v":0}]
["","o.","COBERTURAS","COBERTURA COM TELHA METÁLICA","M2",{"$f":"SUMIF(Orçamento!$R$20:$R$377,'Parc Maior Relev'!D19,Orçamento!$T$20:$T$377)","v":0},0]
["",{"$f":"Somatório!B35","v":"s."},"REVESTIMENTO DE PAREDE","CHAPISCO","M2",{"$f":"SUMIF(Orçamento!$R$20:$R$377,'Parc Maior Relev'!D20,Orçamento!$T$20:$T$377)","v":0},0]
["","s.","REVESTIMENTO DE PAREDE","REBOCO","M2",{"$f":"SUMIF(Orçamento!$R$20:$R$377,'Parc Maior Relev'!D21,Orçamento!$T$20:$T$377)","v":0},{"$f":"F21*0.5","v":0}]
["","s.","REVESTIMENTO DE PAREDE","REVESTIMENTO CERÂMICO","M2",{"$f":"SUMIF(Orçamento!$R$20:$R$377,'Parc Maior Relev'!D22,Orçamento!$T$20:$T$377)","v":0},{"$f":"F22*0.5","v":0}]
["",{"$f":"Somatório!B36","v":"t."},"FORROS","FORRO DE GESSO","M2",{"$f":"SUMIF(Orçamento!$R$20:$R$377,'Parc Maior Relev'!D23,Orçamento!$T$20:$T$377)","v":0},{"$f":"F23*0.5","v":0}]
["","t.","FORROS","FORRO DE PVC","M2",{"$f":"SUMIF(Orçamento!$R$20:$R$377,'Parc Maior Relev'!D24,Orçamento!$T$20:$T$377)","v":0},{"$f":"F24*0.5","v":0}]
["","t.","FORROS","FORRO DE GESSO ACARTONADO","M2",{"$f":"SUMIF(Orçamento!$R$20:$R$377,'Parc Maior Relev'!D25,Orçamento!$T$20:$T$377)","v":0},{"$f":"F25*0.5","v":0}]
["","u.","REVESTIMENTO DE PISO","PISO DE GRANITINA","M2",{"$f":"SUMIF(Orçamento!$R$20:$R$377,'Parc Maior Relev'!D26,Orçamento!$T$20:$T$377)","v":0},0]
["","u.","REVESTIMENTO DE PISO","PISO LAMINADO","M2",{"$f":"SUMIF(Orçamento!$R$20:$R$377,'Parc Maior Relev'!D27,Orçamento!$T$20:$T$377)","v":0},0]
["F","u.","REVESTIMENTO DE PISO","PISO EM CONCRETO ","M2",486.97,243.48500000000001]
["","u.","REVESTIMENTO DE PISO","PISO CERÂMICO","M2",{"$f":"SUMIF(Orçamento!$R$20:$R$377,'Parc Maior Relev'!D29,Orçamento!$T$20:$T$377)","v":0},{"$f":"F29*0.5","v":0}]
["F","y.","PINTURA"," PINTURA ACRÍLICA","M2",1146.3600000000001,573.18000000000006]
["F"]
["F","(*) Para os fins do inciso I dp § 1º do Art. 30 da Lei Federal 8.666/93, são consideradas parcelas de maior relevância técnica as execuções apresentadas"]
["F"]

{"sheet":"Composições","index":7,"n_rows":534,"n_cols":10,"rows_kept":534,"cut":false,"hidden":false,"merged":[[15,0,15,9],[13,0,13,2],[13,3,13,6],[1,0,1,9],[3,7,3,9],[4,7,4,9],[6,7,6,9],[7,7,7,9],[6,0,6,6],[10,8,10,9],[13,8,13,9],[14,0,14,9],[8,0,8,9],[5,0,5,9],[2,0,2,9],[0,0,0,8],[10,0,10,2],[10,3,10,6],[11,0,11,9],[12,0,12,2],[12,3,12,6],[12,7,12,8],[7,0,7,6],[9,0,9,2],[9,3,9,6],[9,7,9,8],[3,0,3,6],[4,0,4,6],[16,5,17,5],[16,6,16,7],[16,8,16,9],[22,1,22,7],[26,1,26,7],[16,0,17,0],[16,1,17,1],[16,2,17,2],[16,3,17,3],[16,4,17,4],[28,5,29,5],[28,6,28,7],[28,8,28,9],[33,1,33,7],[34,1,34,7],[28,0,29,0],[28,1,29,1],[28,2,29,2],[28,3,29,3],[28,4,29,4],[36,5,37,5],[36,6,36,7],[36,8,36,9],[41,1,41,7],[43,1,43,7],[36,0,37,0],[36,1,37,1],[36,2,37,2],[36,3,37,3],[36,4,37,4],[45,5,46,5],[45,6,45,7],[45,8,45,9],[50,1,50,7],[52,1,52,7],[45,0,46,0],[45,1,46,1],[45,2,46,2],[45,3,46,3],[45,4,46,4],[54,5,55,5],[54,6,54,7],[54,8,54,9],[59,1,59,7],[61,1,61,7],[54,0,55,0],[54,1,55,1],[54,2,55,2],[54,3,55,3],[54,4,55,4],[63,5,64,5],[63,6,63,7],[63,8,63,9],[68,1,68,7],[70,1,70,7],[63,0,64,0],[63,1,64,1],[63,2,64,2],[63,3,64,3],[63,4,64,4],[72,5,73,5],[72,6,72,7],[72,8,72,9],[77,1,77,7],[80,1,80,7],[72,0,73,0],[72,1,73,1],[72,2,73,2],[72,3,73,3],[72,4,73,4],[82,5,83,5],[82,6,82,7],[82,8,82,9],[87,1,87,7],[91,1,91,7],[82,0,83,0],[82,1,83,1],[82,2,83,2],[82,3,83,3],[82,4,83,4],[93,5,94,5],[93,6,93,7],[93,8,93,9],[98,1,98,7],[101,1,101,7],[93,0,94,0],[93,1,94,1],[93,2,94,2],[93,3,94,3],[93,4,94,4],[103,5,104,5],[103,6,103,7],[103,8,103,9],[108,1,108,7],[110,1,110,7],[103,0,104,0],[103,1,104,1],[103,2,104,2],[103,3,104,3],[103,4,104,4],[112,5,113,5],[112,6,112,7],[112,8,112,9],[117,1,117,7],[119,1,119,7],[112,0,113,0],[112,1,113,1],[112,2,113,2],[112,3,113,3],[112,4,113,4],[121,5,122,5],[121,6,121,7],[121,8,121,9],[126,1,126,7],[128,1,128,7],[121,0,122,0],[121,1,122,1],[121,2,122,2],[121,3,122,3],[121,4,122,4],[130,5,131,5],[130,6,130,7],[130,8,130,9],[135,1,135,7],[137,1,137,7],[130,0,131,0],[130,1,131,1],[130,2,131,2],[130,3,131,3],[130,4,131,4],[139,5,140,5],[139,6,139,7],[139,8,139,9],[183,1,183,7],[184,1,184,7],[139,0,140,0],[139,1,140,1],[139,2,140,2],[139,3,140,3],[139,4,140,4],[186,5,187,5],[186,6,186,7],[186,8,186,9],[191,1,191,7],[193,1,193,7],[186,0,187,0],[186,1,187,1],[186,2,187,2],[186,3,187,3],[186,4,187,4],[195,5,196,5],[195,6,195,7],[195,8,195,9],[200,1,200,7],[203,1,203,7],[195,0,196,0],[195,1,196,1],[195,2,196,2],[195,3,196,3],[195,4,196,4],[205,5,206,5],[205,6,205,7],[205,8,205,9],[210,1,210,7],[213,1,213,7],[205,0,206,0],[205,1,206,1],[205,2,206,2],[205,3,206,3],[205,4,206,4],[215,5,216,5],[215,6,215,7],[215,8,215,9],[219,1,219,7],[221,1,221,7],[215,0,216,0],[215,1,216,1],[215,2,216,2],[215,3,216,3],[215,4,216,4],[223,5,224,5],[223,6,223,7],[223,8,223,9],[227,1,227,7],[231,1,231,7],[223,0,224,0],[223,1,224,1],[223,2,224,2],[223,3,224,3],[223,4,224,4],[233,5,234,5],[233,6,233,7],[233,8,233,9],[238,1,238,7],[241,1,241,7],[233,0,234,0],[233,1,234,1],[233,2,234,2],[233,3,234,3],[233,4,234,4],[243,5,244,5],[243,6,243,7],[243,8,243,9],[247,1,247,7],[249,1,249,7],[243,0,244,0],[243,1,244,1],[243,2,244,2],[243,3,244,3],[243,4,244,4],[251,5,252,5],[251,6,251,7],[251,8,251,9],[256,1,256,7],[258,1,258,7],[251,0,252,0],[251,1,252,1],[251,2,252,2],[251,3,252,3],[251,4,252,4],[260,5,261,5],[260,6,260,7],[260,8,260,9],[264,1,264,7],[271,1,271,7],[260,0,261,0],[260,1,261,1],[260,2,261,2],[260,3,261,3],[260,4,261,4],[273,5,274,5],[273,6,273,7],[273,8,273,9],[278,1,278,7],[280,1,280,7],[273,0,274,0],[273,1,274,1],[273,2,274,2],[273,3,274,3],[273,4,274,4],[282,5,283,5],[282,6,282,7],[282,8,282,9],[287,1,287,7],[290,1,290,7],[282,0,283,0],[282,1,283,1],[282,2,283,2],[282,3,283,3],[282,4,283,4],[292,5,293,5],[292,6,292,7],[292,8,292,9],[297,1,297,7],[300,1,300,7],[292,0,293,0],[292,1,293,1],[292,2,293,2],[292,3,293,3],[292,4,293,4],[302,5,303,5],[302,6,302,7],[302,8,302,9],[307,1,307,7],[310,1,310,7],[302,0,303,0],[302,1,303,1],[302,2,303,2],[302,3,303,3],[302,4,303,4],[312,5,313,5],[312,6,312,7],[312,8,312,9],[316,1,316,7],[320,1,320,7],[312,0,313,0],[312,1,313,1],[312,2,313,2],[312,3,313,3],[312,4,313,4],[322,5,323,5],[322,6,322,7],[322,8,322,9],[326,1,326,7],[330,1,330,7],[322,0,323,0],[322,1,323,1],[322,2,323,2],[322,3,323,3],[322,4,323,4],[332,5,333,5],[332,6,332,7],[332,8,332,9],[336,1,336,7],[343,1,343,7],[332,0,333,0],[332,1,333,1],[332,2,333,2],[332,3,333,3],[332,4,333,4],[345,5,346,5],[345,6,345,7],[345,8,345,9],[350,1,350,7],[352,1,352,7],[345,0,346,0],[345,1,346,1],[345,2,346,2],[345,3,346,3],[345,4,346,4],[354,5,355,5],[354,6,354,7],[354,8,354,9],[359,1,359,7],[361,1,361,7],[354,0,355,0],[354,1,355,1],[354,2,355,2],[354,3,355,3],[354,4,355,4],[363,5,364,5],[363,6,363,7],[363,8,363,9],[368,1,368,7],[370,1,370,7],[363,0,364,0],[363,1,364,1],[363,2,364,2],[363,3,364,3],[363,4,364,4],[372,5,373,5],[372,6,372,7],[372,8,372,9],[377,1,377,7],[379,1,379,7],[372,0,373,0],[372,1,373,1],[372,2,373,2],[372,3,373,3],[372,4,373,4],[381,5,382,5],[381,6,381,7],[381,8,381,9],[386,1,386,7],[389,1,389,7],[381,0,382,0],[381,1,382,1],[381,2,382,2],[381,3,382,3],[381,4,382,4],[391,5,392,5],[391,6,391,7],[391,8,391,9],[396,1,396,7],[399,1,399,7],[391,0,392,0],[391,1,392,1],[391,2,392,2],[391,3,392,3],[391,4,392,4],[401,5,402,5],[401,6,401,7],[401,8,401,9],[406,1,406,7],[408,1,408,7],[401,0,402,0],[401,1,402,1],[401,2,402,2],[401,3,402,3],[401,4,402,4],[410,5,411,5],[410,6,410,7],[410,8,410,9],[415,1,415,7],[417,1,417,7],[410,0,411,0],[410,1,411,1],[410,2,411,2],[410,3,411,3],[410,4,411,4],[419,5,420,5],[419,6,419,7],[419,8,419,9],[424,1,424,7],[426,1,426,7],[419,0,420,0],[419,1,420,1],[419,2,420,2],[419,3,420,3],[419,4,420,4],[428,5,429,5],[428,6,428,7],[428,8,428,9],[433,1,433,7],[435,1,435,7],[428,0,429,0],[428,1,429,1],[428,2,429,2],[428,3,429,3],[428,4,429,4],[437,5,438,5],[437,6,437,7],[437,8,437,9],[442,1,442,7],[444,1,444,7],[437,0,438,0],[437,1,438,1],[437,2,438,2],[437,3,438,3],[437,4,438,4],[446,5,447,5],[446,6,446,7],[446,8,446,9],[451,1,451,7],[454,1,454,7],[446,0,447,0],[446,1,447,1],[446,2,447,2],[446,3,447,3],[446,4,447,4],[456,5,457,5],[456,6,456,7],[456,8,456,9],[461,1,461,7],[464,1,464,7],[456,0,457,0],[456,1,457,1],[456,2,457,2],[456,3,457,3],[456,4,457,4],[466,5,467,5],[466,6,466,7],[466,8,466,9],[470,1,470,7],[474,1,474,7],[466,0,467,0],[466,1,467,1],[466,2,467,2],[466,3,467,3],[466,4,467,4],[476,5,477,5],[476,6,476,7],[476,8,476,9],[480,1,480,7],[484,1,484,7],[476,0,477,0],[476,1,477,1],[476,2,477,2],[476,3,477,3],[476,4,477,4],[486,5,487,5],[486,6,486,7],[486,8,486,9],[490,1,490,7],[491,1,491,7],[486,0,487,0],[486,1,487,1],[486,2,487,2],[486,3,487,3],[486,4,487,4],[493,5,494,5],[493,6,493,7],[493,8,493,9],[497,1,497,7],[504,1,504,7],[493,0,494,0],[493,1,494,1],[493,2,494,2],[493,3,494,3],[493,4,494,4],[506,5,507,5],[506,6,506,7],[506,8,506,9],[511,1,511,7],[524,1,524,7],[506,0,507,0],[506,1,507,1],[506,2,507,2],[506,3,507,3],[506,4,507,4],[526,5,527,5],[526,6,526,7],[526,8,526,9],[531,1,531,7],[533,1,533,7],[526,0,527,0],[526,1,527,1],[526,2,527,2],[526,3,527,3],[526,4,527,4]]}
[]
[]
[]
["UNIDADE ESCOLAR",null,null,null,null,null,null,"CÓDIGO INEP"]
[{"$f":"Orçamento!$O$4","v":"COLÉGIO ESTADUAL THIAGO VIDAL FERNANDES"},null,null,null,null,null,null,{"$f":"Orçamento!$V$4","v":52044572}]
[]
["OBRA",null,null,null,null,null,null,"CIDADE"]
[{"$f":"Orçamento!$O$7","v":"REFORMA E AMPLIAÇÃO"},null,null,null,null,null,null,{"$f":"Orçamento!$V$7","v":"COCALZINHO DE GOIÁS"}]
[]
["CRE",null,null,"ENDEREÇO",null,null,null,"REFERÊNCIA AGETOP"]
[{"$f":"Orçamento!$O$10","v":"CRE-ANÁPOLIS"},null,null,{"$f":"Orçamento!$R$10","v":" AV. TOCANTINS ESQ. COM A ITAPACI S/N , CENTRO , CEP: 7297-000"},null,null,null,{"$f":"Orçamento!$S$10","v":"ABR/19"},{"$f":"Orçamento!$T$10","v":"DESONERADA"}]
[]
["DATA",null,null,"ÁREA TOTAL CONSTRUÍDA (M²)",null,null,null,"REFERÊNCIA SINAPI"]
[{"$f":"Orçamento!$S$7","v":"2020-05-06"},null,null,{"$f":"Orçamento!$V$13","v":1946.01},null,null,null,{"$f":"Orçamento!$V$10","v":"FEV/20"},{"$f":"Orçamento!$W$10","v":"DESONERADA"}]
[]
["COMPOSIÇÕES DE CUSTOS UNITÁRIOS - SEE-GO"]
[12,"FONTE","CÓDIGO","DESCRIÇÃO","UNIDADE","COEFIC.","CUSTO UNITÁRIO",null,"CUSTO  TOTAL (A) + (B) + (C) + (D) + (E)"]
[null,null,null,null,null,null,"DESONERADO","NÃO DESONER.","DESONERADO","NÃO DESONER."]
[null,"COMPOSIÇÃO","COMP 012_SEE","DEMOLIÇÃO/RETIRADA DAS TRAVES DE FUTEBOL DE SALÃO","CJ",null,"-","-",16.489999999999998,19.100000000000001]
[null,null,null,"","",null,0,0,0,0]
[null,null,null,"","",null,0,0,0,0]
[null,null,null,"","",null,0,0,0,0]
[null,"MÃO DE OBRA (B) - TOTAL",null,null,null,null,null,null,0,0]
[null,"AGETOP_I",8,"AJUDANTE","h     ",1.8841000000000001,8.75,10.14,16.489999999999998,19.100000000000001]
[null,null,null,"","",null,0,0,0,0]
[null,null,null,"","",null,0,0,0,0]
[null,"MATERIAL (C) - TOTAL",null,null,null,null,null,null,16.489999999999998,19.100000000000001]
[]
[1,"FONTE","CÓDIGO","DESCRIÇÃO","UNIDADE","COEFIC.","CUSTO UNITÁRIO",null,"CUSTO  TOTAL (A) + (B) + (C) + (D) + (E)"]
[null,null,null,null,null,null,"DESONERADO","NÃO DESONER.","DESONERADO","NÃO DESONER."]
[null,"COMPOSIÇÃO","COMP 001_SEE","RETIRADA DA ESTRUTURA/TABELA DE BASQUETE C/ TRANSP ATÉ CB. E CARGA","UN ","-","-","-",49.78,57.67]
[null,"AGETOP_I",5,"SERVENTE","h     ",2.5,8.75,10.14,21.88,25.35]
[null,"AGETOP_I",4,"PEDREIRO","h     ",2,13.95,16.16,27.9,32.32]
[null,"MÃO DE OBRA (B) - TOTAL",null,null,null,null,null,null,49.78,57.67]
[null,"MATERIAL (C) - TOTAL",null,null,null,null,null,null,0,0]
[]
[387,"FONTE","CÓDIGO","DESCRIÇÃO","UNIDADE","COEFIC.","CUSTO UNITÁRIO",null,"CUSTO  TOTAL (A) + (B) + (C) + (D) + (E)"]
[null,null,null,null,null,null,"DESONERADO","NÃO DESONER.","DESONERADO","NÃO DESONER."]
[null,"COMPOSIÇÃO","COMP 387_SEE","LÂMPADA LED TUBULAR 18W ","UN ",null,null,null,22.3,22.35]
[null,"AGETOP_I",8,"AJUDANTE","h     ",1.4999999999999999E-2,8.75,10.14,0.13,0.15]
[null,"AGETOP_I",12,"ELETRICISTA","h     ",1.4999999999999999E-2,13.95,16.16,0.21,0.24]
[null,"MÃO DE OBRA (B) - TOTAL",null,null,null,null,null,null,0.33999999999999997,0.39]
[null,"COTAÇÃO","COT 195_SEE","LÂMPADA LED TUBULAR 18W ","UN",1,21.959999999999997,21.959999999999997,21.96,21.96]
[null,"MATERIAL (C) - TOTAL",null,null,null,null,null,null,21.96,21.96]
[]
[375,"FONTE","CÓDIGO","DESCRIÇÃO","UNIDADE","COEFIC.","CUSTO UNITÁRIO",null,"CUSTO  TOTAL (A) + (B) + (C) + (D) + (E)"]
[null,null,null,null,null,null,"DESONERADO","NÃO DESONER.","DESONERADO","NÃO DESONER."]
[null,"COMPOSIÇÃO","COMP 375_SEE","REFLETOR DE LED HOLOFORTE 50W","UN ",null,null,null,82.16,83.32]
[null,"AGETOP_I",12,"ELETRICISTA","h     ",0.41649999999999998,13.95,16.16,5.81,6.73]
[null,"AGETOP_I",8,"AJUDANTE","h     ",0.17349999999999999,8.75,10.14,1.52,1.76]
[null,"MÃO DE OBRA (B) - TOTAL",null,null,null,null,null,null,7.33,8.49]
[null,"COTAÇÃO","COT 190_SEE","REFLETOR DE LED HOLOFORTE 50W","UN",1,74.830000000000013,74.830000000000013,74.83,74.83]
[null,"MATERIAL (C) - TOTAL",null,null,null,null,null,null,74.83,74.83]
[]
[544,"FONTE","CÓDIGO","DESCRIÇÃO","UNIDADE","COEFIC.","CUSTO UNITÁRIO",null,"CUSTO  TOTAL (A) + (B) + (C) + (D) + (E)"]
[null,null,null,null,null,null,"DESONERADO","NÃO DESONER.","DESONERADO","NÃO DESONER."]
[null,"COMPOSIÇÃO","COMP 544_SEE","RELE DE NÍVEL","UN ",null,null,null,190.4,197.6]
[null,"AGETOP_I",12,"ELETRICISTA","h     ",2,13.95,16.16,27.9,32.32]
[null,"AGETOP_I",8,"AJUDANTE","h     ",2,8.75,10.14,17.5,20.28]
[null,"MÃO DE OBRA (B) - TOTAL",null,null,null,null,null,null,45.4,52.6]
[null,"COTAÇÃO","COT 285_SEE","RELE DE NÍVEL ","UN ",1,145,145,145,145]
[null,"MATERIAL (C) - TOTAL",null,null,null,null,null,null,145,145]
[]
[544,"FONTE","CÓDIGO","DESCRIÇÃO","UNIDADE","COEFIC.","CUSTO UNITÁRIO",null,"CUSTO  TOTAL (A) + (B) + (C) + (D) + (E)"]
[null,null,null,null,null,null,"DESONERADO","NÃO DESONER.","DESONERADO","NÃO DESONER."]
[null,"COMPOSIÇÃO","COMP 544_SEE","RELE DE NÍVEL","UN ",null,null,null,190.4,197.6]
[null,"AGETOP_I",12,"ELETRICISTA","h     ",2,13.95,16.16,27.9,32.32]
[null,"AGETOP_I",8,"AJUDANTE","h     ",2,8.75,10.14,17.5,20.28]
[null,"MÃO DE OBRA (B) - TOTAL",null,null,null,null,null,null,45.4,52.6]
[null,"COTAÇÃO","COT 285_SEE","RELE DE NÍVEL ","UN ",1,145,145,145,145]
[null,"MATERIAL (C) - TOTAL",null,null,null,null,null,null,145,145]
[]
[66,"FONTE","CÓDIGO","DESCRIÇÃO","UNIDADE","COEFIC.","CUSTO UNITÁRIO",null,"CUSTO  TOTAL (A) + (B) + (C) + (D) + (E)"]
[null,null,null,null,null,null,"DESONERADO","NÃO DESONER.","DESONERADO","NÃO DESONER."]
[null,"COMPOSIÇÃO","COMP 066_SEE","COTOVELO FERRO GALVANIZADO 90º X 1.1/4\"","UN ",null,null,null,37.22,40.54]
[null,"AGETOP_I",8,"AJUDANTE","h     ",0.92,8.75,10.14,8.0500000000000007,9.33]
[null,"AGETOP_I",11,"ENCANADOR","h     ",0.92,13.95,16.16,12.83,14.87]
[null,"MÃO DE OBRA (B) - TOTAL",null,null,null,null,null,null,20.880000000000003,24.2]
[null,"SINAPI_I",3457,"COTOVELO 90 GRAUS DE FERRO GALVANIZADO, COM ROSCA BSP, DE 1 1/4\"","UN    ",1,15.78,15.78,15.78,15.78]
[null,"AGETOP_I","H689","FITA VEDAROSCA 12 MM","m",2,0.28000000000000003,0.28000000000000003,0.56000000000000005,0.56000000000000005]
[null,"MATERIAL (C) - TOTAL",null,null,null,null,null,null,16.34,16.34]
[]
[331,"FONTE","CÓDIGO","DESCRIÇÃO","UNIDADE","COEFIC.","CUSTO UNITÁRIO",null,"CUSTO  TOTAL (A) + (B) + (C) + (D) + (E)"]
[null,null,null,null,null,null,"DESONERADO","NÃO DESONER.","DESONERADO","NÃO DESONER."]
[null,"COMPOSIÇÃO","COMP 331_SEE","VALVULA PÉ DE CRIVO 1.1/4\"","UN ",null,null,null,55.180000000000007,57.17]
[null,"AGETOP_I",8,"AJUDANTE","h     ",0.55000000000000004,8.75,10.14,4.8099999999999996,5.58]
[null,"AGETOP_I",11,"ENCANADOR","h     ",0.55000000000000004,13.95,16.16,7.67,8.89]
[null,"MÃO DE OBRA (B) - TOTAL",null,null,null,null,null,null,12.48,14.47]
[null,"SINAPI_I",118,"PASTA VEDA JUNTAS/ROSCA, LATA DE *500* G, PARA INSTALACOES DE GAS E OUTROS","UN    ",2.4E-2,71.260000000000005,71.260000000000005,1.71,1.71]
[null,"AGETOP_I","H689","FITA VEDAROSCA 12 MM","m",1.3,0.28000000000000003,0.28000000000000003,0.36,0.36]
[null,"SINAPI_I",10233,"VALVULA DE RETENCAO DE BRONZE, PE COM CRIVOS, EXTREMIDADE COM ROSCA, DE 1 1/4\", PARA FUNDO DE POCO","UN    ",1,40.630000000000003,40.630000000000003,40.630000000000003,40.630000000000003]
[null,"MATERIAL (C) - TOTAL",null,null,null,null,null,null,42.7,42.7]
[]
[71,"FONTE","CÓDIGO","DESCRIÇÃO","UNIDADE","COEFIC.","CUSTO UNITÁRIO",null,"CUSTO  TOTAL (A) + (B) + (C) + (D) + (E)"]
[null,null,null,null,null,null,"DESONERADO","NÃO DESONER.","DESONERADO","NÃO DESONER."]
[null,"COMPOSIÇÃO","COMP 071_SEE","UNIÃO COM ASSENTO MACHO FEMEA 1\"","UN ",null,null,null,31.15,32.590000000000003]
[null,"AGETOP_I",8,"AJUDANTE","h     ",0.4,8.75,10.14,3.5,4.0599999999999996]
[null,"AGETOP_I",11,"ENCANADOR","h     ",0.4,13.95,16.16,5.58,6.46]
[null,"MÃO DE OBRA (B) - TOTAL",null,null,null,null,null,null,9.08,10.52]
[null,"AGETOP_I","H689","FITA VEDAROSCA 12 MM","m",2,0.28000000000000003,0.28000000000000003,0.56000000000000005,0.56000000000000005]
[null,"SINAPI_I",9886,"UNIAO DE FERRO GALVANIZADO, COM ROSCA BSP, COM ASSENTO PLANO, DE 1\"","UN    ",1,21.51,21.51,21.51,21.51]
[null,"MATERIAL (C) - TOTAL",null,null,null,null,null,null,22.07,22.07]
[]
[330,"FONTE","CÓDIGO","DESCRIÇÃO","UNIDADE","COEFIC.","CUSTO UNITÁRIO",null,"CUSTO  TOTAL (A) + (B) + (C) + (D) + (E)"]
[null,null,null,null,null,null,"DESONERADO","NÃO DESONER.","DESONERADO","NÃO DESONER."]
[null,"COMPOSIÇÃO","COMP 330_SEE","LUVA SIMPLES 1\"","UN ",null,null,null,16.61,17.880000000000003]
[null,"AGETOP_I",5,"SERVENTE","h     ",0.35,8.75,10.14,3.06,3.55]
[null,"AGETOP_I",11,"ENCANADOR","h     ",0.35,13.95,16.16,4.88,5.66]
[null,"MÃO DE OBRA (B) - TOTAL",null,null,null,null,null,null,7.9399999999999995,9.2100000000000009]
[null,"SINAPI_I",3910,"LUVA DE FERRO GALVANIZADO, COM ROSCA BSP, DE 1\"","UN    ",1,8.67,8.67,8.67,8.67]
[null,"MATERIAL (C) - TOTAL",null,null,null,null,null,null,8.67,8.67]
[]
[95,"FONTE","CÓDIGO","DESCRIÇÃO","UNIDADE","COEFIC.","CUSTO UNITÁRIO",null,"CUSTO  TOTAL (A) + (B) + (C) + (D) + (E)"]
[null,null,null,null,null,null,"DESONERADO","NÃO DESONER.","DESONERADO","NÃO DESONER."]
[null,"COMPOSIÇÃO","COMP 095_SEE","ADAPTADOR PARA MANGOTE 1\"","UN ",null,null,null,22.85,23.75]
[null,"AGETOP_I",8,"AJUDANTE","h     ",0.25,8.75,10.14,2.19,2.54]
[null,"AGETOP_I",11,"ENCANADOR","h     ",0.25,13.95,16.16,3.49,4.04]
[null,"MÃO DE OBRA (B) - TOTAL",null,null,null,null,null,null,5.68,6.58]
[null,"COTAÇÃO","COT 023_SEE","ADAPTADOR PARA MANGUEIRA 1\"","UN ",1,17.169999999999998,17.169999999999998,17.170000000000002,17.170000000000002]
[null,"MATERIAL (C) - TOTAL",null,null,null,null,null,null,17.170000000000002,17.170000000000002]
[]
[94,"FONTE","CÓDIGO","DESCRIÇÃO","UNIDADE","COEFIC.","CUSTO UNITÁRIO",null,"CUSTO  TOTAL (A) + (B) + (C) + (D) + (E)"]
[null,null,null,null,null,null,"DESONERADO","NÃO DESONER.","DESONERADO","NÃO DESONER."]
[null,"COMPOSIÇÃO","COMP 094_SEE","MANGUEIRA DE BORRACHA PARA ALTA PRESSÃO","M",null,null,null,19.310000000000002,20.75]
[null,"AGETOP_I",8,"AJUDANTE","h     ",0.4,8.75,10.14,3.5,4.0599999999999996]
[null,"AGETOP_I",11,"ENCANADOR","h     ",0.4,13.95,16.16,5.58,6.46]
[null,"MÃO DE OBRA (B) - TOTAL",null,null,null,null,null,null,9.08,10.52]
[null,"COTAÇÃO","COT 022_SEE","MANGUEIRA DE BORRACHA PARA ALTA PRESSÃO 1\" - 300 PSI","M",1,10.229999999999999,10.229999999999999,10.23,10.23]
[null,"MATERIAL (C) - TOTAL",null,null,null,null,null,null,10.23,10.23]
[]
[90,"FONTE","CÓDIGO","DESCRIÇÃO","UNIDADE","COEFIC.","CUSTO UNITÁRIO",null,"CUSTO  TOTAL (A) + (B) + (C) + (D) + (E)"]
[null,null,null,null,null,null,"DESONERADO","NÃO DESONER.","DESONERADO","NÃO DESONER."]
[null,"COMPOSIÇÃO","COMP 090_SEE","CONJUNTO MOTO BOMBA VAZÃO 5 M³/H, HM=20 M, REC. 1\", SUCÇÃO 1.1/4\"","UN ",null,null,null,1431.83,1460.63]
[null,"AGETOP_I",8,"AJUDANTE","h     ",8,8.75,10.14,70,81.12]
[null,"AGETOP_I",11,"ENCANADOR","h     ",8,13.95,16.16,111.6,129.28]
[null,"MÃO DE OBRA (B) - TOTAL",null,null,null,null,null,null,181.6,210.4]
[null,"COTAÇÃO","COT 019_SEE","CONJUNTO MOTO BOMBA VAZÃO 5 M³/H, HM=20 M, REC. 1\", SUCÇÃO 1.1/4\" - 1 CV","UN ",1,1250.2249999999999,1250.2249999999999,1250.23,1250.23]
[null,"MATERIAL (C) - TOTAL",null,null,null,null,null,null,1250.23,1250.23]
[]
[41,"FONTE","CÓDIGO","DESCRIÇÃO","UNIDADE","COEFIC.","CUSTO UNITÁRIO",null,"CUSTO  TOTAL (A) + (B) + (C) + (D) + (E)"]
[null,null,null,null,null,null,"DESONERADO","NÃO DESONER.","DESONERADO","NÃO DESONER."]
[null,"COMPOSIÇÃO","COMP 041_SEE","CASA DE BOMBAS - EXCLUSO INSTALAÇÕES ELÉTRICAS, HIDROSANITÁRIAS E ESPECIAIS","UN ",null,null,null,4725.21,5018.4100000000008]
[null,"AGETOP",20701,"LOCAÇÃO DA OBRA, EXECUÇÃO DE GABARITO SEM REAPROVEITAMENTO, INCLUSO PINTURA (FACE INTERNA DO RIPÃO 15CM) E PIQUETE COM TESTEMUNHA","m2    ",3,2.86,3.02,8.58,9.06]
[null,"SINAPI",72900,"TRANSPORTE DE ENTULHO COM CAMINHAO BASCULANTE 6 M3, RODOVIA PAVIMENTADA, DMT 0,5 A 1,0 KM","M3",0.21,4.49,4.59,0.94,0.96]
[null,"SINAPI",72897,"CARGA MANUAL DE ENTULHO EM CAMINHAO BASCULANTE 6 M3","M3",0.21,19.05,20.8,4,4.37]
[null,"AGETOP",40101,"ESCAVACAO MANUAL DE VALAS < 1 MTS. (OBRAS CIVIS)","m3    ",0.59,22.45,26.02,13.25,15.35]
[null,"AGETOP",40902,"REATERRO COM APILOAMENTO","m3    ",0.13,14.88,17.239999999999998,1.93,2.2400000000000002]
[null,"AGETOP",50302,"ESTACA A TRADO DIAM.30 CM SEM FERRO","M     ",6,42.64,46.51,255.84,279.06]
[null,"AGETOP",52005,"ACO CA-50A - 10,0 MM (3/8\") - (OBRAS CIVIS)","Kg    ",17.82,6.42,6.7,114.4,119.39]
[null,"AGETOP",52014,"ACO CA-60 - 5,0 MM - (OBRAS CIVIS)","Kg    ",6.84,6.63,6.88,45.35,47.06]
[null,"AGETOP",50901,"ESCAVACAO MANUAL DE VALAS (SAPATAS/BLOCOS)","m3    ",0.8,28.43,32.950000000000003,22.74,26.36]
[null,"AGETOP",50902,"APILOAMENTO (BLOCOS/SAPATAS)","m2    ",1.44,3.5,4.0599999999999996,5.04,5.85]
[null,"SINAPI",94965,"CONCRETO FCK = 25MPA, TRAÇO 1:2,3:2,7 (CIMENTO/ AREIA MÉDIA/ BRITA 1)  - PREPARO MECÂNICO COM BETONEIRA 400 L. AF_07/2016","M3",0.75,315.39,322.75,236.54,242.06]
[null,"AGETOP",51026,"LANÇAMENTO/APLICAÇÃO/ADENSAMENTO DE CONCRETO EM FUNDAÇÃO- (O.C.)","m3    ",0.75,25.98,30.1,19.489999999999998,22.58]
[null,"AGETOP",52014,"ACO CA-60 - 5,0 MM - (OBRAS CIVIS)","Kg    ",9.18,6.63,6.88,60.86,63.16]
[null,"AGETOP",40101,"ESCAVACAO MANUAL DE VALAS < 1 MTS. (OBRAS CIVIS)","m3    ",0.37,22.45,26.02,8.31,9.6300000000000008]
[null,"SINAPI",94965,"CONCRETO FCK = 25MPA, TRAÇO 1:2,3:2,7 (CIMENTO/ AREIA MÉDIA/ BRITA 1)  - PREPARO MECÂNICO COM BETONEIRA 400 L. AF_07/2016","M3",0.37,315.39,322.75,116.69,119.42]
[null,"AGETOP",51026,"LANÇAMENTO/APLICAÇÃO/ADENSAMENTO DE CONCRETO EM FUNDAÇÃO- (O.C.)","m3    ",0.37,25.98,30.1,9.61,11.14]
[null,"AGETOP",52004,"ACO CA 50-A - 8,0 MM (5/16\") - (OBRAS CIVIS)","Kg    ",12.96,6.47,6.75,83.85,87.48]
[null,"AGETOP",52014,"ACO CA-60 - 5,0 MM - (OBRAS CIVIS)","Kg    ",5.4,6.63,6.88,35.799999999999997,37.15]
[null,"SINAPI",92426,"MONTAGEM E DESMONTAGEM DE FÔRMA DE PILARES RETANGULARES E ESTRUTURAS SIMILARES COM ÁREA MÉDIA DAS SEÇÕES MENOR OU IGUAL A 0,25 M², PÉ-DIREITO SIMPLES, EM CHAPA DE MADEIRA COMPENSADA RESINADA, 8 UTILIZAÇÕES. AF_12/2015","M2",9.01,41.78,44.77,376.44,403.38]
[null,"SINAPI",94965,"CONCRETO FCK = 25MPA, TRAÇO 1:2,3:2,7 (CIMENTO/ AREIA MÉDIA/ BRITA 1)  - PREPARO MECÂNICO COM BETONEIRA 400 L. AF_07/2016","M3",0.42,315.39,322.75,132.46,135.56]
[null,"AGETOP",60801,"LANÇAMENTO/APLICAÇÃO/ADENSAMENTO MANUAL DE CONCRETO - (OBRAS CIVIS)","m3    ",0.42,31.11,36.04,13.07,15.14]
[null,"AGETOP",60305,"ACO CA-50A - 10,0 MM (3/8\") - (OBRAS CIVIS)","Kg    ",32.31,6.42,6.7,207.43,216.48]
[null,"AGETOP",60314,"ACO CA - 60 - 5,0 MM - (OBRAS CIVIS)","Kg    ",10.89,6.63,6.88,72.2,74.92]
[null,"AGETOP",60209,"FORMA CH.COMPENSADA 12MM-VIGA/PILAR U=4V - (OBRAS CIVIS","m2    ",5.92,45.47,50.13,269.18,296.77]
[null,"SINAPI",94965,"CONCRETO FCK = 25MPA, TRAÇO 1:2,3:2,7 (CIMENTO/ AREIA MÉDIA/ BRITA 1)  - PREPARO MECÂNICO COM BETONEIRA 400 L. AF_07/2016","M3",0.35,315.39,322.75,110.39,112.96]
[null,"AGETOP",60801,"LANÇAMENTO/APLICAÇÃO/ADENSAMENTO MANUAL DE CONCRETO - (OBRAS CIVIS)","m3    ",0.35,31.11,36.04,10.89,12.61]
[null,"AGETOP",60304,"ACO CA-50 A - 8,0 MM (5/16\") - (OBRAS CIVIS)","Kg    ",13.23,6.47,6.75,85.6,89.3]
[null,"AGETOP",60314,"ACO CA - 60 - 5,0 MM - (OBRAS CIVIS)","Kg    ",5.49,6.63,6.88,36.4,37.770000000000003]
[null,"SINAPI",92267,"FABRICAÇÃO DE FÔRMA PARA LAJES, EM CHAPA DE MADEIRA COMPENSADA RESINADA, E = 17 MM. AF_12/2015","M2",3.03,24.27,24.36,73.540000000000006,73.81]
[null,"AGETOP",60314,"ACO CA - 60 - 5,0 MM - (OBRAS CIVIS)","Kg    ",5.67,6.63,6.88,37.590000000000003,39.01]
[null,"SINAPI",94965,"CONCRETO FCK = 25MPA, TRAÇO 1:2,3:2,7 (CIMENTO/ AREIA MÉDIA/ BRITA 1)  - PREPARO MECÂNICO COM BETONEIRA 400 L. AF_07/2016","M3",0.3,315.39,322.75,94.62,96.83]
[null,"AGETOP",100201,"ALVENARIA DE TIJOLO FURADO 1/2 VEZ - 9 x 19 x 19 - ARG. (1CALH:4ARML+100KG DE CI/M3)","m2    ",14.76,33.78,36.67,498.59,541.25]
[null,"AGETOP",120902,"IMPERMEABILIZACAO VIGAS BALDRAMES E=2,0 CM","m2    ",5.9039999999999999,20.9,23.1,123.39,136.38]
[null,"AGETOP",120208,"IMPERMEABILIZACAO-ARGAM. SINT.SEMI - FLEXIVEL","m2    ",4.68,23.33,23.33,109.18,109.18]
[null,"AGETOP",180504,"PORTA ABRIR/VENEZIANA PF-4 C/FERRAGENS","m2    ",1.0149999999999999,345.72,350.32,350.91,355.57]
[null,"AGETOP",200101,"CHAPISCO COMUM","m2    ",29.52,3.53,3.88,104.21,114.54]
[null,"SINAPI",87547,"MASSA ÚNICA, PARA RECEBIMENTO DE PINTURA, EM ARGAMASSA TRAÇO 1:2:8, PREPARO MECÂNICO COM BETONEIRA 400L, APLICADA MANUALMENTE EM FACES INTERNAS DE PAREDES, ESPESSURA DE 10MM, COM EXECUÇÃO DE TALISCAS. AF_06/2014","M2",29.52,16.64,17.88,491.21,527.82000000000005]
[null,"AGETOP",220104,"PISO EM CONCRETO DESEMPENADO ESPESSURA = 7 CM  1:2,5:3,5","m2    ",3.1,29.07,31.02,90.12,96.16]
[null,"AGETOP",261000,"PINTURA LATEX ACRILICA 2 DEMAOS C/SELADOR","m2    ",38.880000000000003,8.74,9.52,339.81,370.14]
[null,"AGETOP",261602,"PINT.ESMALTE/ESQUAD.FERRO C/FUNDO ANTICOR.","m2    ",3.05,14.07,15.51,42.91,47.31]
[null,"AGETOP",270501,"LIMPEZA FINAL DE OBRA - (OBRAS CIVIS)","m2    ",6.44,1.84,2.0499999999999998,11.85,13.2]
[null,"MÃO DE OBRA (B) - TOTAL",null,null,null,null,null,null,4725.21,5018.4100000000008]
[null,"MATERIAL (C) - TOTAL",null,null,null,null,null,null,0,0]
[]
[40,"FONTE","CÓDIGO","DESCRIÇÃO","UNIDADE","COEFIC.","CUSTO UNITÁRIO",null,"CUSTO  TOTAL (A) + (B) + (C) + (D) + (E)"]
[null,null,null,null,null,null,"DESONERADO","NÃO DESONER.","DESONERADO","NÃO DESONER."]
[null,"COMPOSIÇÃO","COMP 040_SEE","CONJUNTO MOTOR-BOMBA ELÉTRICA TRIFÁSICO 380/220 V PARA VZ= 24,33 M³/H, HM= 46,24 M POTÊNCIA= 7,5 CV","UN ",null,null,null,3974.27,4003.07]
[null,"AGETOP_I",8,"AJUDANTE","h     ",8,8.75,10.14,70,81.12]
[null,"AGETOP_I",11,"ENCANADOR","h     ",8,13.95,16.16,111.6,129.28]
[null,"MÃO DE OBRA (B) - TOTAL",null,null,null,null,null,null,181.6,210.4]
[null,"COTAÇÃO","COT 008_SEE","CONJUNTO MOTOR-BOMBA ELÉTRICA TRIFÁSICO 380/220 V PARA VZ= 24,33 M³/H, HM= 46,24 M POTÊNCIA= 7,5 CV","UN ",1,3792.6666666666665,3792.6666666666665,3792.67,3792.67]
[null,"MATERIAL (C) - TOTAL",null,null,null,null,null,null,3792.67,3792.67]
[]
[77,"FONTE","CÓDIGO","DESCRIÇÃO","UNIDADE","COEFIC.","CUSTO UNITÁRIO",null,"CUSTO  TOTAL (A) + (B) + (C) + (D) + (E)"]
[null,null,null,null,null,null,"DESONERADO","NÃO DESONER.","DESONERADO","NÃO DESONER."]
[null,"COMPOSIÇÃO","COMP 077_SEE","UNIAO FERRO GALV C/ASSENTO CONICO BRONZE 2 1/2\"","UN ",null,null,null,177.21,178.65]
[null,"AGETOP_I",8,"AJUDANTE","h     ",0.4,8.75,10.14,3.5,4.0599999999999996]
[null,"AGETOP_I",11,"ENCANADOR","h     ",0.4,13.95,16.16,5.58,6.46]
[null,"MÃO DE OBRA (B) - TOTAL",null,null,null,null,null,null,9.08,10.52]
[null,"AGETOP_I","H689","FITA VEDAROSCA 12 MM","m",2.4,0.28000000000000003,0.28000000000000003,0.67,0.67]
[null,"SINAPI_I",12427,"UNIAO COM ASSENTO CONICO DE BRONZE, DIAMETRO 2 1/2\"","UN    ",1,167.46,167.46,167.46,167.46]
[null,"MATERIAL (C) - TOTAL",null,null,null,null,null,null,168.13,168.13]
[]
[87,"FONTE","CÓDIGO","DESCRIÇÃO","UNIDADE","COEFIC.","CUSTO UNITÁRIO",null,"CUSTO  TOTAL (A) + (B) + (C) + (D) + (E)"]
[null,null,null,null,null,null,"DESONERADO","NÃO DESONER.","DESONERADO","NÃO DESONER."]
[null,"COMPOSIÇÃO","COMP 087_SEE","REGISTRO DE GAVETA COM HASTE ASCENDENTE DE BRONZE 2 1/2\"","UN ",null,null,null,258.56,262.7]
[null,"AGETOP_I",8,"AJUDANTE","h     ",1.1499999999999999,8.75,10.14,10.06,11.66]
[null,"AGETOP_I",11,"ENCANADOR","h     ",1.1499999999999999,13.95,16.16,16.04,18.579999999999998]
[null,"MÃO DE OBRA (B) - TOTAL",null,null,null,null,null,null,26.1,30.24]
[null,"AGETOP_I","H689","FITA VEDAROSCA 12 MM","m",2.82,0.28000000000000003,0.28000000000000003,0.79,0.79]
[null,"COTAÇÃO","COT 017_SEE","REGISTRO DE GAVETA COM HASTE ASCENDENTE DE BRONZE 2 1/2\"","UN ",1,231.66666666666666,231.66666666666666,231.67,231.67]
[null,"MATERIAL (C) - TOTAL",null,null,null,null,null,null,232.45999999999998,232.45999999999998]
[]
[18,"FONTE","CÓDIGO","DESCRIÇÃO","UNIDADE","COEFIC.","CUSTO UNITÁRIO",null,"CUSTO  TOTAL (A) + (B) + (C) + (D) + (E)"]
[null,null,null,null,null,null,"DESONERADO","NÃO DESONER.","DESONERADO","NÃO DESONER."]
[null,"COMPOSIÇÃO","COMP 018_SEE","CHAVE DUPLA P/ CONEXÕES TIPO STORZ EM LATÃO ENGATE RÁPIDO 1 1/2\" X 2 1/2\"","UN ",null,"-","-",16.079999999999998,16.41]
[null,"AGETOP_I",11,"ENCANADOR","h     ",0.15,13.95,16.16,2.09,2.42]
[null,"MÃO DE OBRA (B) - TOTAL",null,null,null,null,null,null,2.09,2.42]
[null,"SINAPI_I",20971,"CHAVE DUPLA PARA CONEXOES TIPO STORZ, ENGATE RAPIDO 1 1/2\" X 2 1/2\", EM LATAO, PARA INSTALACAO PREDIAL COMBATE A INCENDIO","UN    ",1,13.99,13.99,13.99,13.99]
[null,"MATERIAL (C) - TOTAL",null,null,null,null,null,null,13.99,13.99]
[]
[25,"FONTE","CÓDIGO","DESCRIÇÃO","UNIDADE","COEFIC.","CUSTO UNITÁRIO",null,"CUSTO  TOTAL (A) + (B) + (C) + (D) + (E)"]
[null,null,null,null,null,null,"DESONERADO","NÃO DESONER.","DESONERADO","NÃO DESONER."]
[null,"COMPOSIÇÃO","COMP 025_SEE","SINALIZADOR FOTOLUMINESCENTE DE EMERGÊNCIA","UN ",null,"-","-",25.319999999999997,25.439999999999998]
[null,"AGETOP_I",5,"SERVENTE","h     ",0.09,8.75,10.14,0.79,0.91]
[null,"MÃO DE OBRA (B) - TOTAL",null,null,null,null,null,null,0.79,0.91]
[null,"AGETOP_I",3070,"BUCHA DE NYLON S-6","un",2,0.04,0.04,0.08,0.08]
[null,"AGETOP_I",3393,"PARAFUSO P/BUCHA S-6","un",2,0.08,0.08,0.16,0.16]
[null,"SINAPI_I",37556,"PLACA DE SINALIZACAO DE SEGURANCA CONTRA INCENDIO, FOTOLUMINESCENTE, QUADRADA, *20 X 20* CM, EM PVC *2* MM ANTI-CHAMAS (SIMBOLOS, CORES E PICTOGRAMAS CONFORME NBR 13434)","UN    ",1,24.29,24.29,24.29,24.29]
[null,"MATERIAL (C) - TOTAL",null,null,null,null,null,null,24.529999999999998,24.529999999999998]
[]
[77,"FONTE","CÓDIGO","DESCRIÇÃO","UNIDADE","COEFIC.","CUSTO UNITÁRIO",null,"CUSTO  TOTAL (A) + (B) + (C) + (D) + (E)"]
[null,null,null,null,null,null,"DESONERADO","NÃO DESONER.","DESONERADO","NÃO DESONER."]
[null,"COMPOSIÇÃO","COMP 077_SEE","UNIAO FERRO GALV C/ASSENTO CONICO BRONZE 2 1/2\"","UN ",null,null,null,177.21,178.65]
[null,"AGETOP_I",8,"AJUDANTE","h     ",0.4,8.75,10.14,3.5,4.0599999999999996]
[null,"AGETOP_I",11,"ENCANADOR","h     ",0.4,13.95,16.16,5.58,6.46]
[null,"MÃO DE OBRA (B) - TOTAL",null,null,null,null,null,null,9.08,10.52]
[null,"AGETOP_I","H689","FITA VEDAROSCA 12 MM","m",2.4,0.28000000000000003,0.28000000000000003,0.67,0.67]
[null,"SINAPI_I",12427,"UNIAO COM ASSENTO CONICO DE BRONZE, DIAMETRO 2 1/2\"","UN    ",1,167.46,167.46,167.46,167.46]
[null,"MATERIAL (C) - TOTAL",null,null,null,null,null,null,168.13,168.13]
[]
[78,"FONTE","CÓDIGO","DESCRIÇÃO","UNIDADE","COEFIC.","CUSTO UNITÁRIO",null,"CUSTO  TOTAL (A) + (B) + (C) + (D) + (E)"]
[null,null,null,null,null,null,"DESONERADO","NÃO DESONER.","DESONERADO","NÃO DESONER."]
[null,"COMPOSIÇÃO","COMP 078_SEE","TAMPÃO CEGO COM CORRENTE 1 1/2\"","UN ",null,null,null,61.3,61.91]
[null,"AGETOP_I",11,"ENCANADOR","h     ",0.28000000000000003,13.95,16.16,3.91,4.5199999999999996]
[null,"MÃO DE OBRA (B) - TOTAL",null,null,null,null,null,null,3.91,4.5199999999999996]
[null,"SINAPI_I",20964,"TAMPAO COM CORRENTE, EM LATAO, ENGATE RAPIDO 1 1/2\", PARA INSTALACAO PREDIAL DE COMBATE A INCENDIO","UN    ",1,57.39,57.39,57.39,57.39]
[null,"MATERIAL (C) - TOTAL",null,null,null,null,null,null,57.39,57.39]
[]
[188,"FONTE","CÓDIGO","DESCRIÇÃO","UNIDADE","COEFIC.","CUSTO UNITÁRIO",null,"CUSTO  TOTAL (A) + (B) + (C) + (D) + (E)"]
[null,null,null,null,null,null,"DESONERADO","NÃO DESONER.","DESONERADO","NÃO DESONER."]
[null,"COMPOSIÇÃO","COMP 188_SEE","ACIONADOR MANUAL DE ALARME","UN ",null,null,null,101.49,104.37]
[null,"AGETOP_I",8,"AJUDANTE","h     ",0.8,8.75,10.14,7,8.11]
[null,"AGETOP_I",12,"ELETRICISTA","h     ",0.8,13.95,16.16,11.16,12.93]
[null,"MÃO DE OBRA (B) - TOTAL",null,null,null,null,null,null,18.16,21.04]
[null,"COTAÇÃO","COT 090_SEE","ACIONADOR MANUAL DE ALARME","UN",1,83.333333333333329,83.333333333333329,83.33,83.33]
[null,"MATERIAL (C) - TOTAL",null,null,null,null,null,null,83.33,83.33]
[]
[277,"FONTE","CÓDIGO","DESCRIÇÃO","UNIDADE","COEFIC.","CUSTO UNITÁRIO",null,"CUSTO  TOTAL (A) + (B) + (C) + (D) + (E)"]
[null,null,null,null,null,null,"DESONERADO","NÃO DESONER.","DESONERADO","NÃO DESONER."]
[null,"COMPOSIÇÃO","COMP 277_SEE","MARCAÇÃO NO PISO - 1X1 M PARA EXTINTOR","M2",null,null,null,29.67,29.75]
[null,"AGETOP_I",5,"SERVENTE","h     ",3.3300000000000003E-2,8.75,10.14,0.28999999999999998,0.34]
[null,"MÃO DE OBRA (B) - TOTAL",null,null,null,null,null,null,0.28999999999999998,0.34]
[null,"SINAPI_I",5318,"SOLVENTE DILUENTE A BASE DE AGUARRAS","L     ",0.13,11.78,11.78,1.53,1.53]
[null,"SINAPI",5824,"CAMINHÃO TOCO, PBT 16.000 KG, CARGA ÚTIL MÁX. 10.685 KG, DIST. ENTRE EIXOS 4,8 M, POTÊNCIA 189 CV, INCLUSIVE CARROCERIA FIXA ABERTA DE MADEIRA P/ TRANSPORTE GERAL DE CARGA SECA, DIMEN. APROX. 2,5 X 7,00 X 0,50 M - CHP DIURNO. AF_06/2014","CHP",3.3E-3,120.02,123.21,0.4,0.41]
[null,"SINAPI_I",7343,"TINTA A BASE DE RESINA ACRILICA, PARA SINALIZACAO HORIZONTAL VIARIA (NBR 11862)","L     ",0.6,12.82,12.82,7.69,7.69]
[null,"SINAPI_I",7348,"TINTA ACRILICA PREMIUM PARA PISO","L     ",0.03,13.72,13.72,0.41,0.41]
[null,"SINAPI_I",25972,"MICROESFERAS DE VIDRO PARA SINALIZACAO HORIZONTAL VIARIA, TIPO I-B (PREMIX) - NBR 16184","KG    ",2.14,8.8800000000000008,8.8800000000000008,19,19]
[null,"SINAPI",95133,"MÁQUINA DEMARCADORA DE FAIXA DE TRÁFEGO À FRIO, AUTOPROPELIDA, POTÊNCIA 38 HP - CHP DIURNO. AF_07/2016","CHP",3.3E-3,107.44,110.99,0.35,0.37]
[null,"MATERIAL (C) - TOTAL",null,null,null,null,null,null,29.380000000000003,29.41]
[]
[40,"FONTE","CÓDIGO","DESCRIÇÃO","UNIDADE","COEFIC.","CUSTO UNITÁRIO",null,"CUSTO  TOTAL (A) + (B) + (C) + (D) + (E)"]
[null,null,null,null,null,null,"DESONERADO","NÃO DESONER.","DESONERADO","NÃO DESONER."]
[null,"COMPOSIÇÃO","COMP 040_SEE","CONJUNTO MOTOR-BOMBA ELÉTRICA TRIFÁSICO 380/220 V PARA VZ= 24,33 M³/H, HM= 46,24 M POTÊNCIA= 7,5 CV","UN ",null,null,null,3974.27,4003.07]
[null,"AGETOP_I",8,"AJUDANTE","h     ",8,8.75,10.14,70,81.12]
[null,"AGETOP_I",11,"ENCANADOR","h     ",8,13.95,16.16,111.6,129.28]
[null,"MÃO DE OBRA (B) - TOTAL",null,null,null,null,null,null,181.6,210.4]
[null,"COTAÇÃO","COT 008_SEE","CONJUNTO MOTOR-BOMBA ELÉTRICA TRIFÁSICO 380/220 V PARA VZ= 24,33 M³/H, HM= 46,24 M POTÊNCIA= 7,5 CV","UN ",1,3792.6666666666665,3792.6666666666665,3792.67,3792.67]
[null,"MATERIAL (C) - TOTAL",null,null,null,null,null,null,3792.67,3792.67]
[]
[77,"FONTE","CÓDIGO","DESCRIÇÃO","UNIDADE","COEFIC.","CUSTO UNITÁRIO",null,"CUSTO  TOTAL (A) + (B) + (C) + (D) + (E)"]
[null,null,null,null,null,null,"DESONERADO","NÃO DESONER.","DESONERADO","NÃO DESONER."]
[null,"COMPOSIÇÃO","COMP 077_SEE","UNIAO FERRO GALV C/ASSENTO CONICO BRONZE 2 1/2\"","UN ",null,null,null,177.21,178.65]
[null,"AGETOP_I",8,"AJUDANTE","h     ",0.4,8.75,10.14,3.5,4.0599999999999996]
[null,"AGETOP_I",11,"ENCANADOR","h     ",0.4,13.95,16.16,5.58,6.46]
[null,"MÃO DE OBRA (B) - TOTAL",null,null,null,null,null,null,9.08,10.52]
[null,"AGETOP_I","H689","FITA VEDAROSCA 12 MM","m",2.4,0.28000000000000003,0.28000000000000003,0.67,0.67]
[null,"SINAPI_I",12427,"UNIAO COM ASSENTO CONICO DE BRONZE, DIAMETRO 2 1/2\"","UN    ",1,167.46,167.46,167.46,167.46]
[null,"MATERIAL (C) - TOTAL",null,null,null,null,null,null,168.13,168.13]
[]
[88,"FONTE","CÓDIGO","DESCRIÇÃO","UNIDADE","COEFIC.","CUSTO UNITÁRIO",null,"CUSTO  TOTAL (A) + (B) + (C) + (D) + (E)"]
[null,null,null,null,null,null,"DESONERADO","NÃO DESONER.","DESONERADO","NÃO DESONER."]
[null,"COMPOSIÇÃO","COMP 088_SEE","TE DE FERRO GALVANIZADO 90º X 2.1/2\" X 1\"","UN ",null,null,null,102.53,104.78]
[null,"AGETOP_I",8,"AJUDANTE","h     ",0.624,8.75,10.14,5.46,6.33]
[null,"AGETOP_I",11,"ENCANADOR","h     ",0.624,13.95,16.16,8.6999999999999993,10.08]
[null,"MÃO DE OBRA (B) - TOTAL",null,null,null,null,null,null,14.16,16.41]
[null,"AGETOP_I","H689","FITA VEDAROSCA 12 MM","m",1.2,0.28000000000000003,0.28000000000000003,0.34,0.34]
[null,"SINAPI_I",6307,"TE DE REDUCAO DE FERRO GALVANIZADO, COM ROSCA BSP, DE 2 1/2\" X 1\"","UN    ",1,88.03,88.03,88.03,88.03]
[null,"MATERIAL (C) - TOTAL",null,null,null,null,null,null,88.37,88.37]
[]
[347,"FONTE","CÓDIGO","DESCRIÇÃO","UNIDADE","COEFIC.","CUSTO UNITÁRIO",null,"CUSTO  TOTAL (A) + (B) + (C) + (D) + (E)"]
[null,null,null,null,null,null,"DESONERADO","NÃO DESONER.","DESONERADO","NÃO DESONER."]
[null,"COMPOSIÇÃO","COMP 347_SEE","ADAPTADOR PVC SOLDAVEL, COM FLANGES LIVRES, 75 MM X 2 1/2\", PARA CAIXA D' AGUA","UN ",null,null,null,121.25,121.75]
[null,"AGETOP_I",11,"ENCANADOR","h     ",0.14000000000000001,13.95,16.16,1.95,2.2599999999999998]
[null,"AGETOP_I",8,"AJUDANTE","h     ",0.14000000000000001,8.75,10.14,1.23,1.42]
[null,"MÃO DE OBRA (B) - TOTAL",null,null,null,null,null,null,3.1799999999999997,3.6799999999999997]
[null,"SINAPI_I",83,"ADAPTADOR PVC SOLDAVEL, COM FLANGES LIVRES, 75 MM X 2  1/2\", PARA CAIXA D' AGUA","UN    ",1,117.54,117.54,117.54,117.54]
[null,"AGETOP_I","H689","FITA VEDAROSCA 12 MM","m",1.88,0.28000000000000003,0.28000000000000003,0.53,0.53]
[null,"MATERIAL (C) - TOTAL",null,null,null,null,null,null,118.07000000000001,118.07000000000001]
[]
[25,"FONTE","CÓDIGO","DESCRIÇÃO","UNIDADE","COEFIC.","CUSTO UNITÁRIO",null,"CUSTO  TOTAL (A) + (B) + (C) + (D) + (E)"]
[null,null,null,null,null,null,"DESONERADO","NÃO DESONER.","DESONERADO","NÃO DESONER."]
[null,"COMPOSIÇÃO","COMP 025_SEE","SINALIZADOR FOTOLUMINESCENTE DE EMERGÊNCIA","UN ",null,"-","-",25.319999999999997,25.439999999999998]
[null,"AGETOP_I",5,"SERVENTE","h     ",0.09,8.75,10.14,0.79,0.91]
[null,"MÃO DE OBRA (B) - TOTAL",null,null,null,null,null,null,0.79,0.91]
[null,"AGETOP_I",3070,"BUCHA DE NYLON S-6","un",2,0.04,0.04,0.08,0.08]
[null,"AGETOP_I",3393,"PARAFUSO P/BUCHA S-6","un",2,0.08,0.08,0.16,0.16]
[null,"SINAPI_I",37556,"PLACA DE SINALIZACAO DE SEGURANCA CONTRA INCENDIO, FOTOLUMINESCENTE, QUADRADA, *20 X 20* CM, EM PVC *2* MM ANTI-CHAMAS (SIMBOLOS, CORES E PICTOGRAMAS CONFORME NBR 13434)","UN    ",1,24.29,24.29,24.29,24.29]
[null,"MATERIAL (C) - TOTAL",null,null,null,null,null,null,24.529999999999998,24.529999999999998]
[]
[24,"FONTE","CÓDIGO","DESCRIÇÃO","UNIDADE","COEFIC.","CUSTO UNITÁRIO",null,"CUSTO  TOTAL (A) + (B) + (C) + (D) + (E)"]
[null,null,null,null,null,null,"DESONERADO","NÃO DESONER.","DESONERADO","NÃO DESONER."]
[null,"COMPOSIÇÃO","COMP 024_SEE","SINALIZADOR FOTOLUMINESCENTE PARA EXTINTOR","UN ",null,"-","-",25.319999999999997,25.439999999999998]
[null,"AGETOP_I",5,"SERVENTE","h     ",0.09,8.75,10.14,0.79,0.91]
[null,"MÃO DE OBRA (B) - TOTAL",null,null,null,null,null,null,0.79,0.91]
[null,"AGETOP_I",3070,"BUCHA DE NYLON S-6","un",2,0.04,0.04,0.08,0.08]
[null,"AGETOP_I",3393,"PARAFUSO P/BUCHA S-6","un",2,0.08,0.08,0.16,0.16]
[null,"SINAPI_I",37556,"PLACA DE SINALIZACAO DE SEGURANCA CONTRA INCENDIO, FOTOLUMINESCENTE, QUADRADA, *20 X 20* CM, EM PVC *2* MM ANTI-CHAMAS (SIMBOLOS, CORES E PICTOGRAMAS CONFORME NBR 13434)","UN    ",1,24.29,24.29,24.29,24.29]
[null,"MATERIAL (C) - TOTAL",null,null,null,null,null,null,24.529999999999998,24.529999999999998]
[]
[277,"FONTE","CÓDIGO","DESCRIÇÃO","UNIDADE","COEFIC.","CUSTO UNITÁRIO",null,"CUSTO  TOTAL (A) + (B) + (C) + (D) + (E)"]
[null,null,null,null,null,null,"DESONERADO","NÃO DESONER.","DESONERADO","NÃO DESONER."]
[null,"COMPOSIÇÃO","COMP 277_SEE","MARCAÇÃO NO PISO - 1X1 M PARA EXTINTOR","M2",null,null,null,29.67,29.75]
[null,"AGETOP_I",5,"SERVENTE","h     ",3.3300000000000003E-2,8.75,10.14,0.28999999999999998,0.34]
[null,"MÃO DE OBRA (B) - TOTAL",null,null,null,null,null,null,0.28999999999999998,0.34]
[null,"SINAPI_I",5318,"SOLVENTE DILUENTE A BASE DE AGUARRAS","L     ",0.13,11.78,11.78,1.53,1.53]
[null,"SINAPI",5824,"CAMINHÃO TOCO, PBT 16.000 KG, CARGA ÚTIL MÁX. 10.685 KG, DIST. ENTRE EIXOS 4,8 M, POTÊNCIA 189 CV, INCLUSIVE CARROCERIA FIXA ABERTA DE MADEIRA P/ TRANSPORTE GERAL DE CARGA SECA, DIMEN. APROX. 2,5 X 7,00 X 0,50 M - CHP DIURNO. AF_06/2014","CHP",3.3E-3,120.02,123.21,0.4,0.41]
[null,"SINAPI_I",7343,"TINTA A BASE DE RESINA ACRILICA, PARA SINALIZACAO HORIZONTAL VIARIA (NBR 11862)","L     ",0.6,12.82,12.82,7.69,7.69]
[null,"SINAPI_I",7348,"TINTA ACRILICA PREMIUM PARA PISO","L     ",0.03,13.72,13.72,0.41,0.41]
[null,"SINAPI_I",25972,"MICROESFERAS DE VIDRO PARA SINALIZACAO HORIZONTAL VIARIA, TIPO I-B (PREMIX) - NBR 16184","KG    ",2.14,8.8800000000000008,8.8800000000000008,19,19]
[null,"SINAPI",95133,"MÁQUINA DEMARCADORA DE FAIXA DE TRÁFEGO À FRIO, AUTOPROPELIDA, POTÊNCIA 38 HP - CHP DIURNO. AF_07/2016","CHP",3.3E-3,107.44,110.99,0.35,0.37]
[null,"MATERIAL (C) - TOTAL",null,null,null,null,null,null,29.380000000000003,29.41]
[]
[190,"FONTE","CÓDIGO","DESCRIÇÃO","UNIDADE","COEFIC.","CUSTO UNITÁRIO",null,"CUSTO  TOTAL (A) + (B) + (C) + (D) + (E)"]
[null,null,null,null,null,null,"DESONERADO","NÃO DESONER.","DESONERADO","NÃO DESONER."]
[null,"COMPOSIÇÃO","COMP 190_SEE","CENTRAL DE DETECÇÃO E ALARME DE 40 SETORES COM BATERIA","UN ",null,null,null,1144.93,1173.73]
[null,"AGETOP_I",8,"AJUDANTE","h     ",8,8.75,10.14,70,81.12]
[null,"AGETOP_I",12,"ELETRICISTA","h     ",8,13.95,16.16,111.6,129.28]
[null,"MÃO DE OBRA (B) - TOTAL",null,null,null,null,null,null,181.6,210.4]
[null,"COTAÇÃO","COT 092_SEE","CENTRAL DE DETECÇÃO E ALARME DE 40 SETORES COM BATERIA (PREÇO MÉDIO)","UN",1,963.33333333333337,963.33333333333337,963.33,963.33]
[null,"MATERIAL (C) - TOTAL",null,null,null,null,null,null,963.33,963.33]
[]
[186,"FONTE","CÓDIGO","DESCRIÇÃO","UNIDADE","COEFIC.","CUSTO UNITÁRIO",null,"CUSTO  TOTAL (A) + (B) + (C) + (D) + (E)"]
[null,null,null,null,null,null,"DESONERADO","NÃO DESONER.","DESONERADO","NÃO DESONER."]
[null,"COMPOSIÇÃO","COMP 186_SEE","BOTOEIRA BOMBA DE INCÊNDIO C/ MARTELO CONVENCIONAL/ ANALÓGICA","UN ",null,null,null,86.2,89.8]
[null,"AGETOP_I",8,"AJUDANTE","h     ",1,8.75,10.14,8.75,10.14]
[null,"AGETOP_I",12,"ELETRICISTA","h     ",1,13.95,16.16,13.95,16.16]
[null,"MÃO DE OBRA (B) - TOTAL",null,null,null,null,null,null,22.7,26.3]
[null,"COTAÇÃO","COT 088_SEE","BOTOEIRA BOMBA DE INCÊNDIO C/ MARTELO CONVENCIONAL/ ANALÓGICA","UN",1,63.5,63.5,63.5,63.5]
[null,"MATERIAL (C) - TOTAL",null,null,null,null,null,null,63.5,63.5]
[]
[188,"FONTE","CÓDIGO","DESCRIÇÃO","UNIDADE","COEFIC.","CUSTO UNITÁRIO",null,"CUSTO  TOTAL (A) + (B) + (C) + (D) + (E)"]
[null,null,null,null,null,null,"DESONERADO","NÃO DESONER.","DESONERADO","NÃO DESONER."]
[null,"COMPOSIÇÃO","COMP 188_SEE","ACIONADOR MANUAL DE ALARME","UN ",null,null,null,101.49,104.37]
[null,"AGETOP_I",8,"AJUDANTE","h     ",0.8,8.75,10.14,7,8.11]
[null,"AGETOP_I",12,"ELETRICISTA","h     ",0.8,13.95,16.16,11.16,12.93]
[null,"MÃO DE OBRA (B) - TOTAL",null,null,null,null,null,null,18.16,21.04]
[null,"COTAÇÃO","COT 090_SEE","ACIONADOR MANUAL DE ALARME","UN",1,83.333333333333329,83.333333333333329,83.33,83.33]
[null,"MATERIAL (C) - TOTAL",null,null,null,null,null,null,83.33,83.33]
[]
[190,"FONTE","CÓDIGO","DESCRIÇÃO","UNIDADE","COEFIC.","CUSTO UNITÁRIO",null,"CUSTO  TOTAL (A) + (B) + (C) + (D) + (E)"]
[null,null,null,null,null,null,"DESONERADO","NÃO DESONER.","DESONERADO","NÃO DESONER."]
[null,"COMPOSIÇÃO","COMP 190_SEE","CENTRAL DE DETECÇÃO E ALARME DE 40 SETORES COM BATERIA","UN ",null,null,null,1144.93,1173.73]
[null,"AGETOP_I",8,"AJUDANTE","h     ",8,8.75,10.14,70,81.12]
[null,"AGETOP_I",12,"ELETRICISTA","h     ",8,13.95,16.16,111.6,129.28]
[null,"MÃO DE OBRA (B) - TOTAL",null,null,null,null,null,null,181.6,210.4]
[null,"COTAÇÃO","COT 092_SEE","CENTRAL DE DETECÇÃO E ALARME DE 40 SETORES COM BATERIA (PREÇO MÉDIO)","UN",1,963.33333333333337,963.33333333333337,963.33,963.33]
[null,"MATERIAL (C) - TOTAL",null,null,null,null,null,null,963.33,963.33]
[]
[382,"FONTE","CÓDIGO","DESCRIÇÃO","UNIDADE","COEFIC.","CUSTO UNITÁRIO",null,"CUSTO  TOTAL (A) + (B) + (C) + (D) + (E)"]
[null,null,null,null,null,null,"DESONERADO","NÃO DESONER.","DESONERADO","NÃO DESONER."]
[null,"COMPOSIÇÃO","COMP 382_SEE","TE DE REDUCAO DE FERRO GALVANIZADO, COM ROSCA BSP, DE 3/4\" X 1/2\"","UN ",null,null,null,24.25,26.43]
[null,"AGETOP_I",8,"AJUDANTE","h     ",0.6,8.75,10.14,5.25,6.08]
[null,"AGETOP_I",11,"ENCANADOR","h     ",0.61050000000000004,13.95,16.16,8.52,9.8699999999999992]
[null,"MÃO DE OBRA (B) - TOTAL",null,null,null,null,null,null,13.77,15.95]
[null,"SINAPI_I",3146,"FITA VEDA ROSCA EM ROLOS DE 18 MM X 10 M (L X C)","UN    ",0.12075471698113208,3.4,3.4,0.41,0.41]
[null,"SINAPI_I",6302,"TE DE REDUCAO DE FERRO GALVANIZADO, COM ROSCA BSP, DE 3/4\" X 1/2\"","UN    ",1,10.07,10.07,10.07,10.07]
[null,"MATERIAL (C) - TOTAL",null,null,null,null,null,null,10.48,10.48]
[]
[383,"FONTE","CÓDIGO","DESCRIÇÃO","UNIDADE","COEFIC.","CUSTO UNITÁRIO",null,"CUSTO  TOTAL (A) + (B) + (C) + (D) + (E)"]
[null,null,null,null,null,null,"DESONERADO","NÃO DESONER.","DESONERADO","NÃO DESONER."]
[null,"COMPOSIÇÃO","COMP 383_SEE","BUCHA DE REDUCAO DE FERRO GALVANIZADO, COM ROSCA BSP, DE 1/2\" X 1/4\"","UN ",null,null,null,7.68,8.26]
[null,"AGETOP_I",8,"AJUDANTE","h     ",0.16,8.75,10.14,1.4,1.62]
[null,"AGETOP_I",11,"ENCANADOR","h     ",0.16,13.95,16.16,2.23,2.59]
[null,"MÃO DE OBRA (B) - TOTAL",null,null,null,null,null,null,3.63,4.21]
[null,"AGETOP_I","H689","FITA VEDAROSCA 12 MM","m",1.2,0.28000000000000003,0.28000000000000003,0.34,0.34]
[null,"SINAPI_I",770,"BUCHA DE REDUCAO DE FERRO GALVANIZADO, COM ROSCA BSP, DE 1/2\" X 1/4\"","UN    ",1,3.71,3.71,3.71,3.71]
[null,"MATERIAL (C) - TOTAL",null,null,null,null,null,null,4.05,4.05]
[]
[212,"FONTE","CÓDIGO","DESCRIÇÃO","UNIDADE","COEFIC.","CUSTO UNITÁRIO",null,"CUSTO  TOTAL (A) + (B) + (C) + (D) + (E)"]
[null,null,null,null,null,null,"DESONERADO","NÃO DESONER.","DESONERADO","NÃO DESONER."]
[null,"COMPOSIÇÃO","COMP 212_SEE","NIPLE DE REDUÇÃO 1/2\" X 1/4\" BSP","UN ",null,null,null,9.68,10.26]
[null,"AGETOP_I",8,"AJUDANTE","h     ",0.16,8.75,10.14,1.4,1.62]
[null,"AGETOP_I",11,"ENCANADOR","h     ",0.16,13.95,16.16,2.23,2.59]
[null,"MÃO DE OBRA (B) - TOTAL",null,null,null,null,null,null,3.63,4.21]
[null,"COTAÇÃO","COT 103_SEE","NIPLE DE REDUÇÃO 1/2\" X 1/4\" BSP","UN",1,6.0533333333333337,6.0533333333333337,6.05,6.05]
[null,"MATERIAL (C) - TOTAL",null,null,null,null,null,null,6.05,6.05]
[]
[213,"FONTE","CÓDIGO","DESCRIÇÃO","UNIDADE","COEFIC.","CUSTO UNITÁRIO",null,"CUSTO  TOTAL (A) + (B) + (C) + (D) + (E)"]
[null,null,null,null,null,null,"DESONERADO","NÃO DESONER.","DESONERADO","NÃO DESONER."]
[null,"COMPOSIÇÃO","COMP 213_SEE","NIPLE DE REDUÇÃO 3/4\" X 1/2\" BSP","UN ",null,null,null,13.34,13.920000000000002]
[null,"AGETOP_I",8,"AJUDANTE","h     ",0.16,8.75,10.14,1.4,1.62]
[null,"AGETOP_I",11,"ENCANADOR","h     ",0.16,13.95,16.16,2.23,2.59]
[null,"MÃO DE OBRA (B) - TOTAL",null,null,null,null,null,null,3.63,4.21]
[null,"COTAÇÃO","COT 104_SEE","NIPLE DE REDUÇÃO 3/4\" X 1/2\" BSP","UN",1,9.7099999999999991,9.7099999999999991,9.7100000000000009,9.7100000000000009]
[null,"MATERIAL (C) - TOTAL",null,null,null,null,null,null,9.7100000000000009,9.7100000000000009]
[]
[237,"FONTE","CÓDIGO","DESCRIÇÃO","UNIDADE","COEFIC.","CUSTO UNITÁRIO",null,"CUSTO  TOTAL (A) + (B) + (C) + (D) + (E)"]
[null,null,null,null,null,null,"DESONERADO","NÃO DESONER.","DESONERADO","NÃO DESONER."]
[null,"COMPOSIÇÃO","COMP 237_SEE","FITA ANTICORROSIVA","M",null,null,null,11.16,11.879999999999999]
[null,"AGETOP_I",8,"AJUDANTE","h     ",0.2,8.75,10.14,1.75,2.0299999999999998]
[null,"AGETOP_I",12,"ELETRICISTA","h     ",0.2,13.95,16.16,2.79,3.23]
[null,"MÃO DE OBRA (B) - TOTAL",null,null,null,null,null,null,4.54,5.26]
[null,"SINAPI_I",39634,"FITA ADESIVA ANTICORROSIVA DE PVC FLEXIVEL, COR PRETA, PARA PROTECAO TUBULACAO, 50 MM X 30 M (L X C), E= *0,25* MM","M     ",1,6.62,6.62,6.62,6.62]
[null,"MATERIAL (C) - TOTAL",null,null,null,null,null,null,6.62,6.62]
[]
[542,"FONTE","CÓDIGO","DESCRIÇÃO","UNIDADE","COEFIC.","CUSTO UNITÁRIO",null,"CUSTO  TOTAL (A) + (B) + (C) + (D) + (E)"]
[null,null,null,null,null,null,"DESONERADO","NÃO DESONER.","DESONERADO","NÃO DESONER."]
[null,"COMPOSIÇÃO","COMP 542_SEE","VÁLVULA UGV 3/4\" (S) LATÃO","UN ",null,null,null,25.65,27.2]
[null,"AGETOP_I",8,"AJUDANTE","h     ",0.432,8.75,10.14,3.78,4.38]
[null,"AGETOP_I",11,"ENCANADOR","h     ",0.432,13.95,16.16,6.03,6.98]
[null,"MÃO DE OBRA (B) - TOTAL",null,null,null,null,null,null,9.81,11.36]
[null,"COTAÇÃO","COT 281_SEE","VÁLVULA UGV 3/4\" (S) LATÃO","UN ",1,15.836666666666666,15.836666666666666,15.84,15.84]
[null,"MATERIAL (C) - TOTAL",null,null,null,null,null,null,15.84,15.84]
[]
[543,"FONTE","CÓDIGO","DESCRIÇÃO","UNIDADE","COEFIC.","CUSTO UNITÁRIO",null,"CUSTO  TOTAL (A) + (B) + (C) + (D) + (E)"]
[null,null,null,null,null,null,"DESONERADO","NÃO DESONER.","DESONERADO","NÃO DESONER."]
[null,"COMPOSIÇÃO","COMP 543_SEE","VÁLVULA UGV 1/2\" (S) LATÃO","UN ",null,null,null,24.98,26.53]
[null,"AGETOP_I",8,"AJUDANTE","h     ",0.432,8.75,10.14,3.78,4.38]
[null,"AGETOP_I",11,"ENCANADOR","h     ",0.432,13.95,16.16,6.03,6.98]
[null,"MÃO DE OBRA (B) - TOTAL",null,null,null,null,null,null,9.81,11.36]
[null,"COTAÇÃO","COT 282_SEE","VÁLVULA UGV 1/2\" (S) LATÃO","UN ",1,15.166666666666666,15.166666666666666,15.17,15.17]
[null,"MATERIAL (C) - TOTAL",null,null,null,null,null,null,15.17,15.17]
[]
[211,"FONTE","CÓDIGO","DESCRIÇÃO","UNIDADE","COEFIC.","CUSTO UNITÁRIO",null,"CUSTO  TOTAL (A) + (B) + (C) + (D) + (E)"]
[null,null,null,null,null,null,"DESONERADO","NÃO DESONER.","DESONERADO","NÃO DESONER."]
[null,"COMPOSIÇÃO","COMP 211_SEE","REGULADOR DE 2º ESTÁGIO 5KG/H","UN ",null,null,null,86.72,90.86]
[null,"AGETOP_I",8,"AJUDANTE","h     ",1.1499999999999999,8.75,10.14,10.06,11.66]
[null,"AGETOP_I",11,"ENCANADOR","h     ",1.1499999999999999,13.95,16.16,16.04,18.579999999999998]
[null,"MÃO DE OBRA (B) - TOTAL",null,null,null,null,null,null,26.1,30.24]
[null,"COTAÇÃO","COT 102_SEE","REGULADOR DE 2º ESTÁGIO 5KG/H","UN",1,59.833333333333336,59.833333333333336,59.83,59.83]
[null,"AGETOP_I","H689","FITA VEDAROSCA 12 MM","m",2.82,0.28000000000000003,0.28000000000000003,0.79,0.79]
[null,"MATERIAL (C) - TOTAL",null,null,null,null,null,null,60.62,60.62]
[]
[210,"FONTE","CÓDIGO","DESCRIÇÃO","UNIDADE","COEFIC.","CUSTO UNITÁRIO",null,"CUSTO  TOTAL (A) + (B) + (C) + (D) + (E)"]
[null,null,null,null,null,null,"DESONERADO","NÃO DESONER.","DESONERADO","NÃO DESONER."]
[null,"COMPOSIÇÃO","COMP 210_SEE","REGULADOR DE 1º ESTÁGIO 60KG/H MODELO AP-40  COM MANÔMETRO","UN ",null,null,null,232.47,236.61]
[null,"AGETOP_I",8,"AJUDANTE","h     ",1.1499999999999999,8.75,10.14,10.06,11.66]
[null,"AGETOP_I",11,"ENCANADOR","h     ",1.1499999999999999,13.95,16.16,16.04,18.579999999999998]
[null,"MÃO DE OBRA (B) - TOTAL",null,null,null,null,null,null,26.1,30.24]
[null,"COTAÇÃO","COT 101_SEE","REGULADOR DE 1º ESTÁGIO 60KG/H MODELO AP-40  COM MANÔMETRO","UN",1,205.57666666666668,205.57666666666668,205.58,205.58]
[null,"AGETOP_I","H689","FITA VEDAROSCA 12 MM","m",2.82,0.28000000000000003,0.28000000000000003,0.79,0.79]
[null,"MATERIAL (C) - TOTAL",null,null,null,null,null,null,206.37,206.37]
[]
[235,"FONTE","CÓDIGO","DESCRIÇÃO","UNIDADE","COEFIC.","CUSTO UNITÁRIO",null,"CUSTO  TOTAL (A) + (B) + (C) + (D) + (E)"]
[null,null,null,null,null,null,"DESONERADO","NÃO DESONER.","DESONERADO","NÃO DESONER."]
[null,"COMPOSIÇÃO","COMP 235_SEE","PLACA DE SINALIZAÇÃO EM PVC COD 01 - (300X300) PROIBIDO FUMAR","UN ",null,null,null,25.319999999999997,25.439999999999998]
[null,"AGETOP_I",5,"SERVENTE","h     ",0.09,8.75,10.14,0.79,0.91]
[null,"MÃO DE OBRA (B) - TOTAL",null,null,null,null,null,null,0.79,0.91]
[null,"AGETOP_I",3070,"BUCHA DE NYLON S-6","un",2,0.04,0.04,0.08,0.08]
[null,"AGETOP_I",3393,"PARAFUSO P/BUCHA S-6","un",2,0.08,0.08,0.16,0.16]
[null,"SINAPI_I",37556,"PLACA DE SINALIZACAO DE SEGURANCA CONTRA INCENDIO, FOTOLUMINESCENTE, QUADRADA, *20 X 20* CM, EM PVC *2* MM ANTI-CHAMAS (SIMBOLOS, CORES E PICTOGRAMAS CONFORME NBR 13434)","UN    ",1,24.29,24.29,24.29,24.29]
[null,"MATERIAL (C) - TOTAL",null,null,null,null,null,null,24.529999999999998,24.529999999999998]
[]
[236,"FONTE","CÓDIGO","DESCRIÇÃO","UNIDADE","COEFIC.","CUSTO UNITÁRIO",null,"CUSTO  TOTAL (A) + (B) + (C) + (D) + (E)"]
[null,null,null,null,null,null,"DESONERADO","NÃO DESONER.","DESONERADO","NÃO DESONER."]
[null,"COMPOSIÇÃO","COMP 236_SEE","PLACA DE SINALIZAÇÃO EM PVC COD 06 - (300X300) PERIGO INFLAMÁVEL","UN ",null,null,null,25.319999999999997,25.439999999999998]
[null,"AGETOP_I",5,"SERVENTE","h     ",0.09,8.75,10.14,0.79,0.91]
[null,"MÃO DE OBRA (B) - TOTAL",null,null,null,null,null,null,0.79,0.91]
[null,"AGETOP_I",3070,"BUCHA DE NYLON S-6","un",2,0.04,0.04,0.08,0.08]
[null,"AGETOP_I",3393,"PARAFUSO P/BUCHA S-6","un",2,0.08,0.08,0.16,0.16]
[null,"SINAPI_I",37556,"PLACA DE SINALIZACAO DE SEGURANCA CONTRA INCENDIO, FOTOLUMINESCENTE, QUADRADA, *20 X 20* CM, EM PVC *2* MM ANTI-CHAMAS (SIMBOLOS, CORES E PICTOGRAMAS CONFORME NBR 13434)","UN    ",1,24.29,24.29,24.29,24.29]
[null,"MATERIAL (C) - TOTAL",null,null,null,null,null,null,24.529999999999998,24.529999999999998]
[]
[45,"FONTE","CÓDIGO","DESCRIÇÃO","UNIDADE","COEFIC.","CUSTO UNITÁRIO",null,"CUSTO  TOTAL (A) + (B) + (C) + (D) + (E)"]
[null,null,null,null,null,null,"DESONERADO","NÃO DESONER.","DESONERADO","NÃO DESONER."]
[null,"COMPOSIÇÃO","COMP 045_SEE","LAUDO DE ESTANQUEIDADE","UN ",null,null,null,936,1085.1199999999999]
[null,"AGETOP",250101,"ENGENHEIRO - (OBRAS CIVIS)","H     ",16,58.5,67.819999999999993,936,1085.1199999999999]
[null,"MÃO DE OBRA (B) - TOTAL",null,null,null,null,null,null,936,1085.1199999999999]
[null,"MATERIAL (C) - TOTAL",null,null,null,null,null,null,0,0]
[]
[277,"FONTE","CÓDIGO","DESCRIÇÃO","UNIDADE","COEFIC.","CUSTO UNITÁRIO",null,"CUSTO  TOTAL (A) + (B) + (C) + (D) + (E)"]
[null,null,null,null,null,null,"DESONERADO","NÃO DESONER.","DESONERADO","NÃO DESONER."]
[null,"COMPOSIÇÃO","COMP 277_SEE","MARCAÇÃO NO PISO - 1X1 M PARA EXTINTOR","M2",null,null,null,29.67,29.75]
[null,"AGETOP_I",5,"SERVENTE","h     ",3.3300000000000003E-2,8.75,10.14,0.28999999999999998,0.34]
[null,"MÃO DE OBRA (B) - TOTAL",null,null,null,null,null,null,0.28999999999999998,0.34]
[null,"SINAPI_I",5318,"SOLVENTE DILUENTE A BASE DE AGUARRAS","L     ",0.13,11.78,11.78,1.53,1.53]
[null,"SINAPI",5824,"CAMINHÃO TOCO, PBT 16.000 KG, CARGA ÚTIL MÁX. 10.685 KG, DIST. ENTRE EIXOS 4,8 M, POTÊNCIA 189 CV, INCLUSIVE CARROCERIA FIXA ABERTA DE MADEIRA P/ TRANSPORTE GERAL DE CARGA SECA, DIMEN. APROX. 2,5 X 7,00 X 0,50 M - CHP DIURNO. AF_06/2014","CHP",3.3E-3,120.02,123.21,0.4,0.41]
[null,"SINAPI_I",7343,"TINTA A BASE DE RESINA ACRILICA, PARA SINALIZACAO HORIZONTAL VIARIA (NBR 11862)","L     ",0.6,12.82,12.82,7.69,7.69]
[null,"SINAPI_I",7348,"TINTA ACRILICA PREMIUM PARA PISO","L     ",0.03,13.72,13.72,0.41,0.41]
[null,"SINAPI_I",25972,"MICROESFERAS DE VIDRO PARA SINALIZACAO HORIZONTAL VIARIA, TIPO I-B (PREMIX) - NBR 16184","KG    ",2.14,8.8800000000000008,8.8800000000000008,19,19]
[null,"SINAPI",95133,"MÁQUINA DEMARCADORA DE FAIXA DE TRÁFEGO À FRIO, AUTOPROPELIDA, POTÊNCIA 38 HP - CHP DIURNO. AF_07/2016","CHP",3.3E-3,107.44,110.99,0.35,0.37]
[null,"MATERIAL (C) - TOTAL",null,null,null,null,null,null,29.380000000000003,29.41]
[]
[83,"FONTE","CÓDIGO","DESCRIÇÃO","UNIDADE","COEFIC.","CUSTO UNITÁRIO",null,"CUSTO  TOTAL (A) + (B) + (C) + (D) + (E)"]
[null,null,null,null,null,null,"DESONERADO","NÃO DESONER.","DESONERADO","NÃO DESONER."]
[null,"COMPOSIÇÃO","COMP 083_SEE","CORRIMÃO PISO - SEDUC","M",null,null,null,143.18,147.41000000000003]
[null,"AGETOP_I",25,"OFICIAL \"B\"","h     ",1,13.95,16.16,13.95,16.16]
[null,"AGETOP_I",8,"AJUDANTE","h     ",1,8.75,10.14,8.75,10.14]
[null,"MÃO DE OBRA (B) - TOTAL",null,null,null,null,null,null,22.7,26.3]
[null,"AGETOP_I",2376,"TUBO INDUSTRIAL 2\" CHAPA 13 ","Kg",8.2197499999999994,5.23,5.23,42.99,42.99]
[null,"AGETOP_I",2504,"TUBO INDUSTRIAL D=25 MM CHAPA 13 ","Kg",1.1000000000000001,5.07,5.07,5.58,5.58]
[null,"AGETOP_I",2417,"MASSA PLASTICA","Kg",0.2041,10.58,10.58,2.16,2.16]
[null,"AGETOP_I",2246,"ELETRODO 2.5 OK","Kg",0.11459999999999999,8.6999999999999993,8.6999999999999993,1,1]
[null,"AGETOP_I",1672,"LIXA PARA FERRO ( NÚMERO 100 )","un",0.125,2.12,2.12,0.27,0.27]
[null,"AGETOP_I",1264,"DISCO DE DESBASTE 7/8\" P/ CONC./FERRO (1/4\" X 7\")","un",2.5000000000000001E-2,7,7,0.18,0.18]
[null,"AGETOP_I",1334,"DISCO DE CORTE DIAM. 5/8\"- 10\"","un",0.1865,5.5,5.5,1.03,1.03]
[null,"AGETOP_I",2902,"FABRICAÇÃO / MONTAGEM","un",1,50.44,50.44,50.44,50.44]
[null,"AGETOP_I",2150,"CHAPA DE FERRO DOBRADA No.13","Kg",0.43519999999999998,5.28,5.28,2.2999999999999998,2.2999999999999998]
[null,"AGETOP_I",2719,"CHAPA PERFILADA 3/16\"","Kg",1.1644000000000001,5.04,5.04,5.87,5.87]
[null,"AGETOP_I",2436,"ACO CA-25 - 6,3 MM (1/4\") - BARRA LISA A-36","Kg",0.48150000000000004,5.13,5.13,2.4700000000000002,2.4700000000000002]
[null,"AGETOP",261602,"PINT.ESMALTE/ESQUAD.FERRO C/FUNDO ANTICOR.","m2    ",0.44,14.07,15.51,6.19,6.82]
[null,"MATERIAL (C) - TOTAL",null,null,null,null,null,null,120.48,121.11000000000001]
[]
[575,"FONTE","CÓDIGO","DESCRIÇÃO","UNID ","COEFIC.","CUSTO UNITÁRIO",null,"CUSTO  TOTAL (A) + (B) + (C) + (D) + (E)"]
[null,null,null,null,null,null,"DESONERADO","NÃO DESONER.","DESONERADO","NÃO DESONER."]
[null,"COMPOSIÇÃO","COMP 575_SEE","MOLA AEREA FECHA PORTA, PARA PORTAS COM LARGURA ATE 95 CM","UN ","-","-","-",121.89,122.76]
[null,"AGETOP_I",5,"SERVENTE","h     ",0.15,8.75,10.14,1.31,1.52]
[null,"AGETOP_I",24,"MARCENEIRO","h     ",0.3,13.95,16.16,4.1900000000000004,4.8499999999999996]
[null,"MÃO DE OBRA (B) - TOTAL",null,null,null,null,null,null,5.5,6.3699999999999992]
[null,"SINAPI_I",11560,"MOLA AEREA FECHA PORTA, PARA PORTAS COM LARGURA ATE 95 CM","UN    ",1,116.39,116.39,116.39,116.39]
[null,"MATERIAL (C) - TOTAL",null,null,null,null,null,null,116.39,116.39]