{"text_format":"1","workbook":"xlsx","n_sheets":8,"sheets":["Orçamento","Resumo ","Somatório","Cronog_90_Dias","Composição BDI","Relatório CENTRAL","Parc Maior Relev","Composições"],"not_rendered":{"charts":0,"images":5,"macros":1,"external_links":2,"defined_names":151,"comments":3,"pivot_tables":0},"unopened":[],"bounds":{"document_bytes":16777216,"sheet_cells":100000,"rows_first":2000,"rows_last":500,"rows_between":2000,"halvings":0,"cell_chars":16384,"cell_head_chars":4096},"cells_cut":0,"cells_raw":0,"read":"whole","date_system":"1900"}

{"sheet":"Orçamento","index":0,"n_rows":541,"n_cols":24,"rows_kept":541,"cut":false,"hidden":false,"merged":[[476,16,476,22],[8,12,9,12],[511,18,511,20],[511,21,511,22],[0,14,0,22],[8,14,8,16],[9,14,9,16],[11,14,11,16],[12,14,12,16],[14,14,14,22],[1,14,1,22],[4,14,4,22],[7,14,7,22],[495,18,495,20],[495,21,495,22],[503,21,503,22],[492,15,492,17],[493,15,493,17],[494,15,494,17],[496,21,496,22],[504,18,504,20],[504,21,504,22],[502,18,502,20],[502,21,502,22],[510,18,510,20],[510,21,510,22],[497,18,497,20],[497,21,497,22],[490,18,490,20],[490,21,490,22],[512,18,512,20],[512,21,512,22],[466,20,466,21],[488,18,488,20],[488,21,488,22],[489,18,489,20],[489,21,489,22],[487,18,487,20],[487,21,487,22],[496,18,496,20],[467,20,467,21],[478,18,478,22],[484,18,484,20],[484,21,484,22],[485,18,485,20],[485,21,485,22],[486,18,486,20],[486,21,486,22],[509,18,509,20],[509,21,509,22],[506,21,506,22],[507,18,507,20],[507,21,507,22],[508,18,508,20],[508,21,508,22],[498,18,498,20],[498,21,498,22],[505,18,505,20],[505,21,505,22],[500,21,500,22],[501,18,501,20],[501,21,501,22],[503,18,503,20],[499,18,499,20],[499,21,499,22],[500,18,500,20],[504,15,504,17],[505,15,505,17],[506,15,506,17],[507,15,507,17],[508,15,508,17],[481,14,481,23],[470,20,470,21],[469,20,469,21],[465,17,470,17],[465,20,465,21],[482,18,482,20],[482,21,482,22],[483,18,483,20],[483,21,483,22],[471,20,471,21],[491,18,491,20],[491,21,491,22],[492,18,492,20],[492,21,492,22],[493,18,493,20],[493,21,493,22],[494,18,494,20],[494,21,494,22],[506,18,506,20],[483,15,483,17],[484,15,484,17],[485,15,485,17],[486,15,486,17],[487,15,487,17],[488,15,488,17],[489,15,489,17],[490,15,490,17],[491,15,491,17],[495,15,495,17],[496,15,496,17],[497,15,497,17],[498,15,498,17],[499,15,499,17],[500,15,500,17],[501,15,501,17],[502,15,502,17],[503,15,503,17],[473,16,473,22],[474,16,474,22],[475,16,475,22],[3,21,3,22],[2,21,2,22],[5,21,5,22],[10,14,10,23],[13,14,13,23],[6,21,6,22],[2,14,2,20],[3,14,3,20],[5,18,5,20],[6,18,6,20],[6,14,6,17],[5,14,5,17],[12,21,12,22],[12,18,12,20],[8,18,8,20],[8,21,8,22],[9,19,9,20],[477,16,477,22],[540,18,540,20],[540,21,540,22],[537,14,537,17],[534,15,534,17],[534,18,534,20],[534,21,534,22],[535,15,535,17],[535,18,535,20],[535,21,535,22],[536,15,536,17],[536,18,536,20],[536,21,536,22],[539,18,539,20],[539,21,539,22],[538,18,538,20],[538,21,538,22],[515,14,515,23],[516,18,516,20],[516,21,516,22],[517,15,517,17],[517,18,517,20],[517,21,517,22],[518,15,518,17],[509,14,509,17],[516,15,516,17],[482,15,482,17],[537,18,537,20],[537,21,537,22],[525,15,525,17],[525,18,525,20],[525,21,525,22],[526,15,526,17],[526,18,526,20],[526,21,526,22],[527,15,527,17],[527,18,527,20],[527,21,527,22],[531,15,531,17],[531,18,531,20],[531,21,531,22],[532,15,532,17],[532,18,532,20],[532,21,532,22],[533,15,533,17],[522,15,522,17],[518,18,518,20],[518,21,518,22],[533,18,533,20],[533,21,533,22],[528,15,528,17],[528,18,528,20],[528,21,528,22],[529,15,529,17],[529,18,529,20],[529,21,529,22],[530,15,530,17],[530,18,530,20],[530,21,530,22],[522,18,522,20],[522,21,522,22],[523,15,523,17],[523,18,523,20],[523,21,523,22],[524,15,524,17],[524,18,524,20],[524,21,524,22],[519,15,519,17],[519,18,519,20],[519,21,519,22],[520,15,520,17],[520,18,520,20],[520,21,520,22],[521,15,521,17],[521,18,521,20],[521,21,521,22]]}
[]
[]
[null,null,null,null,null,null,null,null,null,null,null,null,null,null,"UNIDADE ESCOLAR",null,null,null,null,null,null,"CÓDIGO INEP"]
[null,null,null,null,null,null,null,null,null,null,null,null,null,null,"ESCOLA ESTADUAL DOM EMANUEL",null,null,null,null,null,null,52063321]
[]
["Nmax",null,null,null,null,null,null,null,null,null,null,null,"Ajustar altura?",null,"OBRA",null,null,null,"DATA",null,null,"CIDADE"]
[{"$f":"MAX($C$18:$C$465)","v":4},null,null,null,null,null,null,null,null,null,null,null,"SIM",null,"REFORMA E AMPLIAÇÃO",null,null,null,"2020-05-08",null,null,"SILVÂNIA"]
[]
[null,null,null,null,null,null,null,null,null,null,null,null,{"$f":"IF($M$7=\"MANUAL\",\"DESPROTEJA A PLANILHA PARA FORMATAR\",\"\")","v":""},null,"CRE",null,null,"ENDEREÇO","REFERÊNCIA AGETOP",null,null,"REFERÊNCIA SINAPI"]
[null,null,null,null,null,null,null,null,null,null,null,null,null,null,"CRE-SILVÂNIA",null,null," AV DOM BOSCO , CENTRO , CEP: 7518-000","ABR/19","DESONERADA",null,"MAR/20","DESONERADA"]
[]
[null,null,null,null,null,null,null,null,null,null,null,null,null,null,"ÁREA EXISTENTE (M²)",null,null,"ÁREA A CONSTRUIR (M²)","ÁREA A DEMOLIR (M²)",null,null,"ÁREA TOTAL CONSTRUÍDA (M²)"]
[null,null,null,null,null,null,null,null,null,null,null,null,null,null,868.37,null,null,127.26,48.64,null,null,946.99]
[]
[null,null,null,null,null,null,null,null,null,null,null,"FILTRO",null,null,"PLANILHA ORÇAMENTÁRIA"]
["Nível E","Save Nivel","Nível C","Altura","n1","n2","n3","n4","n5","Czero","Cnível","↓","Nível","Nível Corrigido","ITEM","TABELA","CODIGO","DESCRIÇÃO DOS SERVIÇOS","UNID","QUANT","MAT","MO","T.SERVIÇO","OBSERVAÇÕES¹"]
[{"$f":"CHOOSE(1+LOG(1+2*(ORÇAMENTO.Nivel=\"Nível 1\")+4*(ORÇAMENTO.Nivel=\"Nível 2\")+8*(ORÇAMENTO.Nivel=\"Nível 3\")+16*(ORÇAMENTO.Nivel=\"Nível 4\")+32*(ORÇAMENTO.Nivel=\"Serviço\"),2),0,1,2,3,4,\"S\")","v":"S"},{"$f":"IF(OR(C17=\"s\",C17=0),OFFSET(B17,-1,0),C17)","v":"Save Nivel"},{"$f":"IF(OFFSET(C17,-1,0)=\"L\",1,IF(OFFSET(C17,-1,0)=1,2,IF(OR(A17=\"s\",A17=0),\"S\",IF(AND(OFFSET(C17,-1,0)=2,A17=4),3,IF(AND(OR(OFFSET(C17,-1,0)=\"s\",OFFSET(C17,-1,0)=0),A17<>\"s\",A17>OFFSET(B17,-1,0)),OFFSET(B17,-1,0),A17)))))","v":"S"},{"$f":"IF(OR(C17=\"S\",C17=0),0,IF(ISERROR(K17),J17,SMALL(J17:K17,1)))","v":0},{"$f":"IF($C17=1,OFFSET(E17,-1,0)+1,OFFSET(E17,-1,0))","v":"n1"},{"$f":"IF($C17=1,0,IF($C17=2,OFFSET(F17,-1,0)+1,OFFSET(F17,-1,0)))","v":"n2"},{"$f":"IF(AND($C17<=2,$C17<>0),0,IF($C17=3,OFFSET(G17,-1,0)+1,OFFSET(G17,-1,0)))","v":"n3"},{"$f":"IF(AND($C17<=3,$C17<>0),0,IF($C17=4,OFFSET(H17,-1,0)+1,OFFSET(H17,-1,0)))","v":"n4"},{"$f":"IF(AND($C17<=4,$C17<>0),0,IF(AND($C17=\"S\",$W17>0),OFFSET(I17,-1,0)+1,OFFSET(I17,-1,0)))","v":"n5"},{"$f":"IF(OR($C17=\"S\",$C17=0),0,MATCH(0,OFFSET($D17,1,$C17,ROW($C$465)-ROW($C17)),0))","v":0},{"$f":"IF(OR($C17=\"S\",$C17=0),0,MATCH(OFFSET($D17,0,$C17)+1,OFFSET($D17,1,$C17,ROW($C$465)-ROW($C17)),0))","v":0},{"$f":"IF(OR(W17>0,$C17=1),\"F\",\"\")","v":""},"Serviço",{"$f":"CHOOSE(1+LOG(1+2*(C17=1)+4*(C17=2)+8*(C17=3)+16*(C17=4)+32*(C17=\"S\"),2),\"\",\"Nível 1\",\"Nível 2\",\"Nível 3\",\"Nível 4\",\"Serviço\")","v":"Serviço"},"-","SINAPI",null,"(sem código)","-",null,0,0,0,""]
[0,null,"L",{"$f":"COUNTA(OFFSET(D18,1,0):D$465)","v":446},{"$f":"LEFT(O19,1)-1","v":0},null,null,null,null,null,null,"F","LOTE","LOTE","REFORMA E AMPLIAÇÃO - ESCOLA ESTADUAL DOM EMANUEL",null,null,null,null,null,null,null,261051.00999999998]
[{"$f":"CHOOSE(1+LOG(1+2*(ORÇAMENTO.Nivel=\"Nível 1\")+4*(ORÇAMENTO.Nivel=\"Nível 2\")+8*(ORÇAMENTO.Nivel=\"Nível 3\")+16*(ORÇAMENTO.Nivel=\"Nível 4\")+32*(ORÇAMENTO.Nivel=\"Serviço\"),2),0,1,2,3,4,\"S\")","v":1},{"$f":"IF(OR(C19=\"s\",C19=0),OFFSET(B19,-1,0),C19)","v":1},{"$f":"IF(OFFSET(C19,-1,0)=\"L\",1,IF(OFFSET(C19,-1,0)=1,2,IF(OR(A19=\"s\",A19=0),\"S\",IF(AND(OFFSET(C19,-1,0)=2,A19=4),3,IF(AND(OR(OFFSET(C19,-1,0)=\"s\",OFFSET(C19,-1,0)=0),A19<>\"s\",A19>OFFSET(B19,-1,0)),OFFSET(B19,-1,0),A19)))))","v":1},{"$f":"IF(OR(C19=\"S\",C19=0),0,IF(ISERROR(K19),J19,SMALL(J19:K19,1)))","v":301},{"$f":"IF($C19=1,OFFSET(E19,-1,0)+1,OFFSET(E19,-1,0))","v":1},{"$f":"IF($C19=1,0,IF($C19=2,OFFSET(F19,-1,0)+1,OFFSET(F19,-1,0)))","v":0},{"$f":"IF(AND($C19<=2,$C19<>0),0,IF($C19=3,OFFSET(G19,-1,0)+1,OFFSET(G19,-1,0)))","v":0},{"$f":"IF(AND($C19<=3,$C19<>0),0,IF($C19=4,OFFSET(H19,-1,0)+1,OFFSET(H19,-1,0)))","v":0},{"$f":"IF(AND($C19<=4,$C19<>0),0,IF(AND($C19=\"S\",$W19>0),OFFSET(I19,-1,0)+1,OFFSET(I19,-1,0)))","v":0},{"$f":"IF(OR($C19=\"S\",$C19=0),0,MATCH(0,OFFSET($D19,1,$C19,ROW($C$465)-ROW($C19)),0))","v":446},{"$f":"IF(OR($C19=\"S\",$C19=0),0,MATCH(OFFSET($D19,0,$C19)+1,OFFSET($D19,1,$C19,ROW($C$465)-ROW($C19)),0))","v":301},{"$f":"IF(OR(W19>0,$C19=1),\"F\",\"\")","v":"F"},"Nível 1",{"$f":"CHOOSE(1+LOG(1+2*(C19=1)+4*(C19=2)+8*(C19=3)+16*(C19=4)+32*(C19=\"S\"),2),\"\",\"Nível 1\",\"Nível 2\",\"Nível 3\",\"Nível 4\",\"Serviço\")","v":"Nível 1"},"1.","AGETOP",null,"REFORMA E AMPLIAÇÃO"]
[2,2,2,37,1,1,0,0,0,300,37,"","Nível 2","Nível 2","1.1.","AGETOP",null,"SERVIÇOS PRELIMINARES"]
[3,3,3,2,1,1,1,0,0,36,2,"","Nível 3","Nível 3","1.1.1.","SINAPI",null,"ACESSIBILIDADE","-",null,null,null,null,""]
["S",3,"S",0,1,1,1,0,0,0,0,"","Serviço","Serviço","1.1.1.0.1.","AGETOP",20121,"DEM. MANUAL EM CONCR.SIMPLES C/TR.ATE CB.E CARGA (O.C.)","m3    ",15.89,null,null,null,""]
[3,3,3,4,1,1,2,0,0,34,4,"","Nível 3","Nível 3","1.1.2.","SINAPI",null,"BANHEIRO FEMININO","-",null,null,null,null,""]
["S",3,"S",0,1,1,2,0,0,0,0,"","Serviço","Serviço","1.1.2.0.1.","SINAPI",97644,"REMOÇÃO DE PORTAS, DE FORMA MANUAL, SEM REAPROVEITAMENTO. AF_12/2017","M2",6.43,null,null,null,"Referência: AGETOP - 20106"]
["S",3,"S",0,1,1,2,0,0,0,0,"","Serviço","Serviço","1.1.2.0.2.","AGETOP",20163,"DEMOLIÇÃO DAS INSTALAÇÕES HIDROSANITÁRIAS E AFINS C/ TRANSP. ATÉ CB. E CARGA","H     ",1,null,null,null,""]
["S",3,"S",0,1,1,2,0,0,0,0,"","Serviço","Serviço","1.1.2.0.3.","SINAPI",97622,"DEMOLIÇÃO DE ALVENARIA DE BLOCO FURADO, DE FORMA MANUAL, SEM REAPROVEITAMENTO. AF_12/2017","M3",0.15,null,null,null,"Referência: AGETOP - 20118"]
[3,3,3,3,1,1,3,0,0,30,3,"","Nível 3","Nível 3","1.1.3.","SINAPI",null,"BANHEIRO MASCULINO","-",null,null,null,null,""]
["S",3,"S",0,1,1,3,0,0,0,0,"","Serviço","Serviço","1.1.3.0.1.","SINAPI",97644,"REMOÇÃO DE PORTAS, DE FORMA MANUAL, SEM REAPROVEITAMENTO. AF_12/2017","M2",6.43,null,null,null,"Referência: AGETOP - 20106"]
["S",3,"S",0,1,1,3,0,0,0,0,"","Serviço","Serviço","1.1.3.0.2.","SINAPI",97622,"DEMOLIÇÃO DE ALVENARIA DE BLOCO FURADO, DE FORMA MANUAL, SEM REAPROVEITAMENTO. AF_12/2017","M3",0.15,null,null,null,"Referência: AGETOP - 20118"]
[3,3,3,8,1,1,4,0,0,27,8,"","Nível 3","Nível 3","1.1.4.","SINAPI",null,"REFORMA ADMINISTRATIVO","-",null,null,null,null,""]
["S",3,"S",0,1,1,4,0,0,0,0,"","Serviço","Serviço","1.1.4.0.1.","SINAPI",97640,"REMOÇÃO DE FORROS DE DRYWALL, PVC E FIBROMINERAL, DE FORMA MANUAL, SEM REAPROVEITAMENTO. AF_12/2017","M2",87.84,null,null,null,""]
["S",3,"S",0,1,1,4,0,0,0,0,"","Serviço","Serviço","1.1.4.0.2.","SINAPI",97642,"REMOÇÃO DE TRAMA METÁLICA OU DE MADEIRA PARA FORRO, DE FORMA MANUAL, SEM REAPROVEITAMENTO. AF_12/2017","M2",87.84,null,null,null,""]
["S",3,"S",0,1,1,4,0,0,0,0,"","Serviço","Serviço","1.1.4.0.3.","AGETOP",20109,"DEM.PISO CIMENT.SOBRE LASTRO CONC.C/TR.ATE CB. E CARGA","m2    ",87.84,null,null,null,""]
["S",3,"S",0,1,1,4,0,0,0,0,"","Serviço","Serviço","1.1.4.0.4.","SINAPI",97645,"REMOÇÃO DE JANELAS, DE FORMA MANUAL, SEM REAPROVEITAMENTO. AF_12/2017","M2",9.36,null,null,null,"Referência: AGETOP - 20106"]
["S",3,"S",0,1,1,4,0,0,0,0,"","Serviço","Serviço","1.1.4.0.5.","SINAPI",97644,"REMOÇÃO DE PORTAS, DE FORMA MANUAL, SEM REAPROVEITAMENTO. AF_12/2017","M2",1.68,null,null,null,"Referência: AGETOP - 20106"]
[{"$f":"CHOOSE(1+LOG(1+2*(ORÇAMENTO.Nivel=\"Nível 1\")+4*(ORÇAMENTO.Nivel=\"Nível 2\")+8*(ORÇAMENTO.Nivel=\"Nível 3\")+16*(ORÇAMENTO.Nivel=\"Nível 4\")+32*(ORÇAMENTO.Nivel=\"Serviço\"),2),0,1,2,3,4,\"S\")","v":"S"},{"$f":"IF(OR(C36=\"s\",C36=0),OFFSET(B36,-1,0),C36)","v":3},{"$f":"IF(OFFSET(C36,-1,0)=\"L\",1,IF(OFFSET(C36,-1,0)=1,2,IF(OR(A36=\"s\",A36=0),\"S\",IF(AND(OFFSET(C36,-1,0)=2,A36=4),3,IF(AND(OR(OFFSET(C36,-1,0)=\"s\",OFFSET(C36,-1,0)=0),A36<>\"s\",A36>OFFSET(B36,-1,0)),OFFSET(B36,-1,0),A36)))))","v":"S"},{"$f":"IF(OR(C36=\"S\",C36=0),0,IF(ISERROR(K36),J36,SMALL(J36:K36,1)))","v":0},{"$f":"IF($C36=1,OFFSET(E36,-1,0)+1,OFFSET(E36,-1,0))","v":1},{"$f":"IF($C36=1,0,IF($C36=2,OFFSET(F36,-1,0)+1,OFFSET(F36,-1,0)))","v":1},{"$f":"IF(AND($C36<=2,$C36<>0),0,IF($C36=3,OFFSET(G36,-1,0)+1,OFFSET(G36,-1,0)))","v":4},{"$f":"IF(AND($C36<=3,$C36<>0),0,IF($C36=4,OFFSET(H36,-1,0)+1,OFFSET(H36,-1,0)))","v":0},{"$f":"IF(AND($C36<=4,$C36<>0),0,IF(AND($C36=\"S\",$W36>0),OFFSET(I36,-1,0)+1,OFFSET(I36,-1,0)))","v":0},0,0,{"$f":"IF(OR(W36>0,$C36=1),\"F\",\"\")","v":""},"Serviço",{"$f":"CHOOSE(1+LOG(1+2*(C36=1)+4*(C36=2)+8*(C36=3)+16*(C36=4)+32*(C36=\"S\"),2),\"\",\"Nível 1\",\"Nível 2\",\"Nível 3\",\"Nível 4\",\"Serviço\")","v":"Serviço"},"1.1.4.0.6.","SINAPI",97633,"DEMOLIÇÃO DE REVESTIMENTO CERÂMICO, DE FORMA MANUAL, SEM REAPROVEITAMENTO. AF_12/2017","M2",16.5,null,null,null,"Referência: AGETOP - 20115"]
["S",3,"S",0,1,1,4,0,0,0,0,"","Serviço","Serviço","1.1.4.0.7.","SINAPI",97622,"DEMOLIÇÃO DE ALVENARIA DE BLOCO FURADO, DE FORMA MANUAL, SEM REAPROVEITAMENTO. AF_12/2017","M3",8.81,null,null,null,"Referência: AGETOP - 20118"]
[3,3,3,9,1,1,5,0,0,19,9,"","Nível 3","Nível 3","1.1.5.","SINAPI",null,"DEMOLIÇÃO DE SALA DE PROJEÇÃO","-",null,null,null,null,""]
["S",3,"S",0,1,1,5,0,0,0,0,"","Serviço","Serviço","1.1.5.0.1.","SINAPI",97645,"REMOÇÃO DE JANELAS, DE FORMA MANUAL, SEM REAPROVEITAMENTO. AF_12/2017","M2",4.68,null,null,null,"Referência: AGETOP - 20106"]
["S",3,"S",0,1,1,5,0,0,0,0,"","Serviço","Serviço","1.1.5.0.2.","SINAPI",97644,"REMOÇÃO DE PORTAS, DE FORMA MANUAL, SEM REAPROVEITAMENTO. AF_12/2017","M2",1.68,null,null,null,"Referência: AGETOP - 20106"]
[{"$f":"CHOOSE(1+LOG(1+2*(ORÇAMENTO.Nivel=\"Nível 1\")+4*(ORÇAMENTO.Nivel=\"Nível 2\")+8*(ORÇAMENTO.Nivel=\"Nível 3\")+16*(ORÇAMENTO.Nivel=\"Nível 4\")+32*(ORÇAMENTO.Nivel=\"Serviço\"),2),0,1,2,3,4,\"S\")","v":"S"},{"$f":"IF(OR(C41=\"s\",C41=0),OFFSET(B41,-1,0),C41)","v":3},{"$f":"IF(OFFSET(C41,-1,0)=\"L\",1,IF(OFFSET(C41,-1,0)=1,2,IF(OR(A41=\"s\",A41=0),\"S\",IF(AND(OFFSET(C41,-1,0)=2,A41=4),3,IF(AND(OR(OFFSET(C41,-1,0)=\"s\",OFFSET(C41,-1,0)=0),A41<>\"s\",A41>OFFSET(B41,-1,0)),OFFSET(B41,-1,0),A41)))))","v":"S"},{"$f":"IF(OR(C41=\"S\",C41=0),0,IF(ISERROR(K41),J41,SMALL(J41:K41,1)))","v":0},{"$f":"IF($C41=1,OFFSET(E41,-1,0)+1,OFFSET(E41,-1,0))","v":1},{"$f":"IF($C41=1,0,IF($C41=2,OFFSET(F41,-1,0)+1,OFFSET(F41,-1,0)))","v":1},{"$f":"IF(AND($C41<=2,$C41<>0),0,IF($C41=3,OFFSET(G41,-1,0)+1,OFFSET(G41,-1,0)))","v":5},{"$f":"IF(AND($C41<=3,$C41<>0),0,IF($C41=4,OFFSET(H41,-1,0)+1,OFFSET(H41,-1,0)))","v":0},{"$f":"IF(AND($C41<=4,$C41<>0),0,IF(AND($C41=\"S\",$W41>0),OFFSET(I41,-1,0)+1,OFFSET(I41,-1,0)))","v":0},0,0,{"$f":"IF(OR(W41>0,$C41=1),\"F\",\"\")","v":""},"Serviço",{"$f":"CHOOSE(1+LOG(1+2*(C41=1)+4*(C41=2)+8*(C41=3)+16*(C41=4)+32*(C41=\"S\"),2),\"\",\"Nível 1\",\"Nível 2\",\"Nível 3\",\"Nível 4\",\"Serviço\")","v":"Serviço"},"1.1.5.0.3.","COMPOSIÇÃO","COMP 010_SEE","DEMOLIÇÃO DE GRADE/GRELHA/CORRIMÃO/GUARDA CORPO - METÁLICO","M2",6,null,null,null,""]
[{"$f":"CHOOSE(1+LOG(1+2*(ORÇAMENTO.Nivel=\"Nível 1\")+4*(ORÇAMENTO.Nivel=\"Nível 2\")+8*(ORÇAMENTO.Nivel=\"Nível 3\")+16*(ORÇAMENTO.Nivel=\"Nível 4\")+32*(ORÇAMENTO.Nivel=\"Serviço\"),2),0,1,2,3,4,\"S\")","v":"S"},{"$f":"IF(OR(C42=\"s\",C42=0),OFFSET(B42,-1,0),C42)","v":3},{"$f":"IF(OFFSET(C42,-1,0)=\"L\",1,IF(OFFSET(C42,-1,0)=1,2,IF(OR(A42=\"s\",A42=0),\"S\",IF(AND(OFFSET(C42,-1,0)=2,A42=4),3,IF(AND(OR(OFFSET(C42,-1,0)=\"s\",OFFSET(C42,-1,0)=0),A42<>\"s\",A42>OFFSET(B42,-1,0)),OFFSET(B42,-1,0),A42)))))","v":"S"},{"$f":"IF(OR(C42=\"S\",C42=0),0,IF(ISERROR(K42),J42,SMALL(J42:K42,1)))","v":0},{"$f":"IF($C42=1,OFFSET(E42,-1,0)+1,OFFSET(E42,-1,0))","v":1},{"$f":"IF($C42=1,0,IF($C42=2,OFFSET(F42,-1,0)+1,OFFSET(F42,-1,0)))","v":1},{"$f":"IF(AND($C42<=2,$C42<>0),0,IF($C42=3,OFFSET(G42,-1,0)+1,OFFSET(G42,-1,0)))","v":5},{"$f":"IF(AND($C42<=3,$C42<>0),0,IF($C42=4,OFFSET(H42,-1,0)+1,OFFSET(H42,-1,0)))","v":0},{"$f":"IF(AND($C42<=4,$C42<>0),0,IF(AND($C42=\"S\",$W42>0),OFFSET(I42,-1,0)+1,OFFSET(I42,-1,0)))","v":0},0,0,{"$f":"IF(OR(W42>0,$C42=1),\"F\",\"\")","v":""},"Serviço",{"$f":"CHOOSE(1+LOG(1+2*(C42=1)+4*(C42=2)+8*(C42=3)+16*(C42=4)+32*(C42=\"S\"),2),\"\",\"Nível 1\",\"Nível 2\",\"Nível 3\",\"Nível 4\",\"Serviço\")","v":"Serviço"},"1.1.5.0.4.","AGETOP",20109,"DEM.PISO CIMENT.SOBRE LASTRO CONC.C/TR.ATE CB. E CARGA","m2    ",44.53,null,null,null,""]
["S",3,"S",0,1,1,5,0,0,0,0,"","Serviço","Serviço","1.1.5.0.5.","AGETOP",20101,"DEMOLICAO COBERTURA TELHA CERAMICA C/ TRANSP. ATÉ CB. E CARGA","m2    ",69.3,null,null,null,""]
["S",3,"S",0,1,1,5,0,0,0,0,"","Serviço","Serviço","1.1.5.0.6.","AGETOP",20103,"DEMOLIÇÃO ESTRUTURA EM MADEIRA TELHADO C/ TRANSP. ATÉ CB. E CARGA","m2    ",69.3,null,null,null,""]
["S",3,"S",0,1,1,5,0,0,0,0,"","Serviço","Serviço","1.1.5.0.7.","AGETOP",20127,"DEM.LAJE CONC. ARM.MANUAL C/TR.ATE CB.E CARGA (OC)","m3    ",4.8600000000000003,null,null,null,""]
["S",3,"S",0,1,1,5,0,0,0,0,"","Serviço","Serviço","1.1.5.0.8.","SINAPI",97622,"DEMOLIÇÃO DE ALVENARIA DE BLOCO FURADO, DE FORMA MANUAL, SEM REAPROVEITAMENTO. AF_12/2017","M3",5.97,null,null,null,"Referência: AGETOP - 20118"]
[3,3,3,2,1,1,6,0,0,10,2,"","Nível 3","Nível 3","1.1.6.","SINAPI",null,"TROCAR PISO DAS SALAS DE AULA 03, 04, 05 e 06","-",null,null,null,null,""]
["S",3,"S",0,1,1,6,0,0,0,0,"","Serviço","Serviço","1.1.6.0.1.","AGETOP",20109,"DEM.PISO CIMENT.SOBRE LASTRO CONC.C/TR.ATE CB. E CARGA","m2    ",185.16,null,null,null,""]
[3,3,3,2,1,1,7,0,0,8,2,"","Nível 3","Nível 3","1.1.7.","SINAPI",null,"REFORMA TELHADO BLOCO 2","-",null,null,null,null,""]
["S",3,"S",0,1,1,7,0,0,0,0,"","Serviço","Serviço","1.1.7.0.1.","AGETOP",20101,"DEMOLICAO COBERTURA TELHA CERAMICA C/ TRANSP. ATÉ CB. E CARGA","m2    ",396.76,null,null,null,""]
[3,3,3,4,1,1,8,0,0,6,4,"","Nível 3","Nível 3","1.1.8.","SINAPI",null,"IMPLANTAÇÃO PROJETOS COMPLEMENTÁRES","-",null,null,null,null,""]
["S",3,"S",0,1,1,8,0,0,0,0,"","Serviço","Serviço","1.1.8.0.1.","SINAPI",97661,"REMOÇÃO DE CABOS ELÉTRICOS, DE FORMA MANUAL, SEM REAPROVEITAMENTO. AF_12/2017","M",1000,null,null,null,""]
["S",3,"S",0,1,1,8,0,0,0,0,"","Serviço","Serviço","1.1.8.0.2.","SINAPI",97660,"REMOÇÃO DE INTERRUPTORES/TOMADAS ELÉTRICAS, DE FORMA MANUAL, SEM REAPROVEITAMENTO. AF_12/2017","UN",80,null,null,null,""]
["S",3,"S",0,1,1,8,0,0,0,0,"","Serviço","Serviço","1.1.8.0.3.","SINAPI",97665,"REMOÇÃO DE LUMINÁRIAS, DE FORMA MANUAL, SEM REAPROVEITAMENTO. AF_12/2017","UN",83,null,null,null,""]
[3,3,3,2,1,1,9,0,0,2,{"$error":"#N/A"},"","Nível 3","Nível 3","1.1.9.","SINAPI",null,"OUTROS","-",null,null,null,null,""]
["S",{"$f":"IF(OR(C56=\"s\",C56=0),OFFSET(B56,-1,0),C56)","v":3},{"$f":"IF(OFFSET(C56,-1,0)=\"L\",1,IF(OFFSET(C56,-1,0)=1,2,IF(OR(A56=\"s\",A56=0),\"S\",IF(AND(OFFSET(C56,-1,0)=2,A56=4),3,IF(AND(OR(OFFSET(C56,-1,0)=\"s\",OFFSET(C56,-1,0)=0),A56<>\"s\",A56>OFFSET(B56,-1,0)),OFFSET(B56,-1,0),A56)))))","v":"S"},{"$f":"IF(OR(C56=\"S\",C56=0),0,IF(ISERROR(K56),J56,SMALL(J56:K56,1)))","v":0},{"$f":"IF($C56=1,OFFSET(E56,-1,0)+1,OFFSET(E56,-1,0))","v":1},{"$f":"IF($C56=1,0,IF($C56=2,OFFSET(F56,-1,0)+1,OFFSET(F56,-1,0)))","v":1},{"$f":"IF(AND($C56<=2,$C56<>0),0,IF($C56=3,OFFSET(G56,-1,0)+1,OFFSET(G56,-1,0)))","v":9},{"$f":"IF(AND($C56<=3,$C56<>0),0,IF($C56=4,OFFSET(H56,-1,0)+1,OFFSET(H56,-1,0)))","v":0},{"$f":"IF(AND($C56<=4,$C56<>0),0,IF(AND($C56=\"S\",$W56>0),OFFSET(I56,-1,0)+1,OFFSET(I56,-1,0)))","v":0},0,0,{"$f":"IF(OR(W56>0,$C56=1),\"F\",\"\")","v":""},"Serviço",{"$f":"CHOOSE(1+LOG(1+2*(C56=1)+4*(C56=2)+8*(C56=3)+16*(C56=4)+32*(C56=\"S\"),2),\"\",\"Nível 1\",\"Nível 2\",\"Nível 3\",\"Nível 4\",\"Serviço\")","v":"Serviço"},"1.1.9.0.1.","AGETOP",21301,"PLACA DE OBRA PLOTADA EM CHAPA METÁLICA 26 , AFIXADA EM CAVALETES DE MADEIRA DE LEI (VIGOTAS 6X12CM) - PADRÃO GOINFRA","m2    ",7.5,null,null,null,""]
[2,2,2,3,1,2,0,0,0,263,3,"","Nível 2","Nível 2","1.2.","AGETOP",null,"TRANSPORTES","-",null,null,null,null,""]
["S",2,"S",0,1,2,0,0,0,0,0,"","Serviço","Serviço","1.2.0.0.1.","SINAPI",72900,"TRANSPORTE DE ENTULHO COM CAMINHAO BASCULANTE 6 M3, RODOVIA PAVIMENTADA, DMT 0,5 A 1,0 KM","M3",52.795999999999992,null,null,null,""]
["S",2,"S",0,1,2,0,0,0,0,0,"","Serviço","Serviço","1.2.0.0.2.","SINAPI",72897,"CARGA MANUAL DE ENTULHO EM CAMINHAO BASCULANTE 6 M3","M3",52.795999999999992,null,null,null,""]
[2,2,2,10,1,3,0,0,0,260,10,"","Nível 2","Nível 2","1.3.","AGETOP",null,"SERVIÇO EM TERRA","-",null,null,null,null,""]
[3,3,3,6,1,3,1,0,0,9,6,"","Nível 3","Nível 3","1.3.1.","SINAPI",null,"ACESSIBILIDADE PÁTIO COBERTO","-",null,null,null,null,""]
["S",3,"S",0,1,3,1,0,0,0,0,"","Serviço","Serviço","1.3.1.0.1.","SINAPI",79480,"ESCAVACAO MECANICA CAMPO ABERTO EM SOLO EXCETO ROCHA ATE 2,00M PROFUNDIDADE","M3",0.2,null,null,null,"Referência: AGETOP - 41004"]
["S",3,"S",0,1,3,1,0,0,0,0,"","Serviço","Serviço","1.3.1.0.2.","AGETOP",41005,"CARGA MECANIZADA","m3    ",0.2,null,null,null,""]
["S",3,"S",0,1,3,1,0,0,0,0,"","Serviço","Serviço","1.3.1.0.3.","AGETOP",41012,"INDENIZAÇÃO DE JAZIDA","m3    ",0.2,null,null,null,""]
["S",3,"S",0,1,3,1,0,0,0,0,"","Serviço","Serviço","1.3.1.0.4.","AGETOP",41006,"TRANSPORTE DE MATERIAL ESCAVADO M3.KM","m3km  ",2,null,null,null,""]
["S",3,"S",0,1,3,1,0,0,0,0,"","Serviço","Serviço","1.3.1.0.5.","AGETOP",41009,"COMPACTAÇÃO MECÂNICA SEM CONTROLE LABORATÓRIO","m3    ",0.16,null,null,null,""]
[3,3,3,3,1,3,2,0,0,3,18,"","Nível 3","Nível 3","1.3.2.","SINAPI",null,"IMPLANTAÇÃO PROJETOS COMPLEMENTÁRES","-",null,null,null,null,""]
["S",3,"S",0,1,3,2,0,0,0,0,"","Serviço","Serviço","1.3.2.0.1.","SINAPI",93358,"ESCAVAÇÃO MANUAL DE VALA COM PROFUNDIDADE MENOR OU IGUAL A 1,30 M. AF_03/2016","M3",4.3,null,null,null,"Referência: AGETOP - 40101"]
["S",3,"S",0,1,3,2,0,0,0,0,"","Serviço","Serviço","1.3.2.0.2.","SINAPI",96995,"REATERRO MANUAL APILOADO COM SOQUETE. AF_10/2017","M3",4.3,null,null,null,"Referência: AGETOP - 40902"]
[{"$f":"CHOOSE(1+LOG(1+2*(ORÇAMENTO.Nivel=\"Nível 1\")+4*(ORÇAMENTO.Nivel=\"Nível 2\")+8*(ORÇAMENTO.Nivel=\"Nível 3\")+16*(ORÇAMENTO.Nivel=\"Nível 4\")+32*(ORÇAMENTO.Nivel=\"Serviço\"),2),0,1,2,3,4,\"S\")","v":2},{"$f":"IF(OR(C70=\"s\",C70=0),OFFSET(B70,-1,0),C70)","v":2},{"$f":"IF(OFFSET(C70,-1,0)=\"L\",1,IF(OFFSET(C70,-1,0)=1,2,IF(OR(A70=\"s\",A70=0),\"S\",IF(AND(OFFSET(C70,-1,0)=2,A70=4),3,IF(AND(OR(OFFSET(C70,-1,0)=\"s\",OFFSET(C70,-1,0)=0),A70<>\"s\",A70>OFFSET(B70,-1,0)),OFFSET(B70,-1,0),A70)))))","v":2},{"$f":"IF(OR(C70=\"S\",C70=0),0,IF(ISERROR(K70),J70,SMALL(J70:K70,1)))","v":26},{"$f":"IF($C70=1,OFFSET(E70,-1,0)+1,OFFSET(E70,-1,0))","v":1},{"$f":"IF($C70=1,0,IF($C70=2,OFFSET(F70,-1,0)+1,OFFSET(F70,-1,0)))","v":4},{"$f":"IF(AND($C70<=2,$C70<>0),0,IF($C70=3,OFFSET(G70,-1,0)+1,OFFSET(G70,-1,0)))","v":0},{"$f":"IF(AND($C70<=3,$C70<>0),0,IF($C70=4,OFFSET(H70,-1,0)+1,OFFSET(H70,-1,0)))","v":0},{"$f":"IF(AND($C70<=4,$C70<>0),0,IF(AND($C70=\"S\",$W70>0),OFFSET(I70,-1,0)+1,OFFSET(I70,-1,0)))","v":0},250,26,{"$f":"IF(OR(W70>0,$C70=1),\"F\",\"\")","v":""},"Nível 2",{"$f":"CHOOSE(1+LOG(1+2*(C70=1)+4*(C70=2)+8*(C70=3)+16*(C70=4)+32*(C70=\"S\"),2),\"\",\"Nível 1\",\"Nível 2\",\"Nível 3\",\"Nível 4\",\"Serviço\")","v":"Nível 2"},"1.4.","AGETOP",null,"FUNDAÇÕES E SONDAGENS","-",null,null,null,null,""]
[3,3,3,6,1,4,1,0,0,25,6,"","Nível 3","Nível 3","1.4.1.","SINAPI",null,"ESTACAS","-",null,null,null,null,""]
["S",3,"S",0,1,4,1,0,0,0,0,"","Serviço","Serviço","1.4.1.0.1.","SINAPI",98230,"ESTACA BROCA DE CONCRETO, DIÂMETRO DE 30 CM, PROFUNDIDADE DE ATÉ 3 M, ESCAVAÇÃO MANUAL COM TRADO CONCHA, NÃO ARMADA. AF_03/2018","M",42,null,null,null,"Referência: AGETOP - 50302"]
["S",3,"S",0,1,4,1,0,0,0,0,"","Serviço","Serviço","1.4.1.0.2.","SINAPI",95577,"MONTAGEM DE ARMADURA LONGITUDINAL DE ESTACAS DE SEÇÃO CIRCULAR, DIÂMETRO = 10,0 MM. AF_11/2016","KG",254.59,null,null,null,"Referência: AGETOP - 52005"]
["S",3,"S",0,1,4,1,0,0,0,0,"","Serviço","Serviço","1.4.1.0.3.","SINAPI",95581,"MONTAGEM DE ARMADURA LONGITUDINAL DE ESTACAS DE SEÇÃO CIRCULAR, DIÂMETRO = 25,0 MM. AF_11/2016","KG",3.26,null,null,null,""]
["S",3,"S",0,1,4,1,0,0,0,0,"","Serviço","Serviço","1.4.1.0.4.","SINAPI",95583,"MONTAGEM DE ARMADURA TRANSVERSAL DE ESTACAS DE SEÇÃO CIRCULAR, DIÂMETRO = 5,0 MM. AF_11/2016","KG",4.24,null,null,null,"Referência: AGETOP - 52014"]
["S",3,"S",0,1,4,1,0,0,0,0,"","Serviço","Serviço","1.4.1.0.5.","SINAPI",95584,"MONTAGEM DE ARMADURA TRANSVERSAL DE ESTACAS DE SEÇÃO CIRCULAR, DIÂMETRO = 6,3 MM. AF_11/2016","KG",74.400000000000006,null,null,null,"Referência: AGETOP - 52003"]
[3,3,3,8,1,4,2,0,0,19,8,"","Nível 3","Nível 3","1.4.2.","SINAPI",null,"BLOCOS","-",null,null,null,null,""]
["S",3,"S",0,1,4,2,0,0,0,0,"","Serviço","Serviço","1.4.2.0.1.","SINAPI",96522,"ESCAVAÇÃO MANUAL PARA BLOCO DE COROAMENTO OU SAPATA, SEM PREVISÃO DE FÔRMA. AF_06/2017","M3",2.2200000000000002,null,null,null,"Referência: AGETOP - 50901"]
["S",3,"S",0,1,4,2,0,0,0,0,"","Serviço","Serviço","1.4.2.0.2.","AGETOP",50902,"APILOAMENTO (BLOCOS/SAPATAS)","m2    ",5.04,null,null,null,""]
["S",3,"S",0,1,4,2,0,0,0,0,"","Serviço","Serviço","1.4.2.0.3.","SINAPI",94103,"LASTRO DE VALA COM PREPARO DE FUNDO, LARGURA MENOR QUE 1,5 M, COM CAMADA DE BRITA, LANÇAMENTO MANUAL, EM LOCAL COM NÍVEL BAIXO DE INTERFERÊNCIA. AF_06/2016","M3",0.25,null,null,null,"Referência: AGETOP - 60470"]
["S",3,"S",0,1,4,2,0,0,0,0,"","Serviço","Serviço","1.4.2.0.4.","SINAPI",94965,"CONCRETO FCK = 25MPA, TRAÇO 1:2,3:2,7 (CIMENTO/ AREIA MÉDIA/ BRITA 1)  - PREPARO MECÂNICO COM BETONEIRA 400 L. AF_07/2016","M3",1.9700000000000002,null,null,null,"Referência: AGETOP - 51030"]
["S",3,"S",0,1,4,2,0,0,0,0,"","Serviço","Serviço","1.4.2.0.5.","AGETOP",51055,"LANÇAMENTO/APLICAÇÃO/ADENSAMENTO MANUAL DE CONCRETO - (O.C.)","m3    ",1.9700000000000002,null,null,null,""]
["S",3,"S",0,1,4,2,0,0,{"$f":"IF(OR($C83=\"S\",$C83=0),0,MATCH(0,OFFSET($D83,1,$C83,ROW($C$465)-ROW($C83)),0))","v":0},{"$f":"IF(OR($C83=\"S\",$C83=0),0,MATCH(OFFSET($D83,0,$C83)+1,OFFSET($D83,1,$C83,ROW($C$465)-ROW($C83)),0))","v":0},"","Serviço","Serviço","1.4.2.0.6.","SINAPI",96995,"REATERRO MANUAL APILOADO COM SOQUETE. AF_10/2017","M3",0.25,null,null,null,"Referência: AGETOP - 40902"]
["S",3,"S",0,1,4,2,0,0,0,0,"","Serviço","Serviço","1.4.2.0.7.","SINAPI",96545,"ARMAÇÃO DE BLOCO, VIGA BALDRAME OU SAPATA UTILIZANDO AÇO CA-50 DE 8 MM - MONTAGEM. AF_06/2017","KG",93.3,null,null,null,"Referência: AGETOP - 52004"]
[3,3,3,8,1,4,3,0,0,11,8,"","Nível 3","Nível 3","1.4.3.","SINAPI",null,"VIGAS BALDRAMES","-",null,null,null,null,""]
["S",3,"S",0,1,4,3,0,0,0,0,"","Serviço","Serviço","1.4.3.0.1.","SINAPI",96527,"ESCAVAÇÃO MANUAL DE VALA PARA VIGA BALDRAME, COM PREVISÃO DE FÔRMA. AF_06/2017","M3",2.5,null,null,null,"Referência: AGETOP - 40101"]
["S",3,"S",0,1,4,3,0,0,0,0,"","Serviço","Serviço","1.4.3.0.2.","AGETOP",50902,"APILOAMENTO (BLOCOS/SAPATAS)","m2    ",8.25,null,null,null,""]
["S",3,"S",0,1,4,3,0,0,0,0,"","Serviço","Serviço","1.4.3.0.3.","SINAPI",94103,"LASTRO DE VALA COM PREPARO DE FUNDO, LARGURA MENOR QUE 1,5 M, COM CAMADA DE BRITA, LANÇAMENTO MANUAL, EM LOCAL COM NÍVEL BAIXO DE INTERFERÊNCIA. AF_06/2016","M3",0.41250000000000003,null,null,null,"Referência: AGETOP - 60470"]
["S",3,"S",0,1,4,3,0,0,0,0,"","Serviço","Serviço","1.4.3.0.4.","SINAPI",94965,"CONCRETO FCK = 25MPA, TRAÇO 1:2,3:2,7 (CIMENTO/ AREIA MÉDIA/ BRITA 1)  - PREPARO MECÂNICO COM BETONEIRA 400 L. AF_07/2016","M3",2.5,null,null,null,"Referência: AGETOP - 51030"]
["S",3,"S",0,1,4,3,0,0,0,0,"","Serviço","Serviço","1.4.3.0.5.","AGETOP",51055,"LANÇAMENTO/APLICAÇÃO/ADENSAMENTO MANUAL DE CONCRETO - (O.C.)","m3    ",2.5,null,null,null,""]
["S",3,"S",0,1,4,3,0,0,0,0,"","Serviço","Serviço","1.4.3.0.6.","SINAPI",96544,"ARMAÇÃO DE BLOCO, VIGA BALDRAME OU SAPATA UTILIZANDO AÇO CA-50 DE 6,3 MM - MONTAGEM. AF_06/2017","KG",77.8,null,null,null,"Referência: AGETOP - 52003"]
["S",3,"S",0,1,4,3,0,0,0,0,"","Serviço","Serviço","1.4.3.0.7.","SINAPI",96545,"ARMAÇÃO DE BLOCO, VIGA BALDRAME OU SAPATA UTILIZANDO AÇO CA-50 DE 8 MM - MONTAGEM. AF_06/2017","KG",98.4,null,null,null,"Referência: AGETOP - 52004"]
[3,3,3,3,1,4,4,0,0,3,152,"","Nível 3","Nível 3","1.4.4.","SINAPI",null,"OUTROS","-",null,null,null,null,""]
["S",3,"S",0,1,4,4,0,0,0,0,"","Serviço","Serviço","1.4.4.0.1.","AGETOP",120902,"IMPERMEABILIZACAO VIGAS BALDRAMES E=2,0 CM","m2    ",49.95,null,null,null,""]
[{"$f":"CHOOSE(1+LOG(1+2*(ORÇAMENTO.Nivel=\"Nível 1\")+4*(ORÇAMENTO.Nivel=\"Nível 2\")+8*(ORÇAMENTO.Nivel=\"Nível 3\")+16*(ORÇAMENTO.Nivel=\"Nível 4\")+32*(ORÇAMENTO.Nivel=\"Serviço\"),2),0,1,2,3,4,\"S\")","v":"S"},{"$f":"IF(OR(C95=\"s\",C95=0),OFFSET(B95,-1,0),C95)","v":3},{"$f":"IF(OFFSET(C95,-1,0)=\"L\",1,IF(OFFSET(C95,-1,0)=1,2,IF(OR(A95=\"s\",A95=0),\"S\",IF(AND(OFFSET(C95,-1,0)=2,A95=4),3,IF(AND(OR(OFFSET(C95,-1,0)=\"s\",OFFSET(C95,-1,0)=0),A95<>\"s\",A95>OFFSET(B95,-1,0)),OFFSET(B95,-1,0),A95)))))","v":"S"},{"$f":"IF(OR(C95=\"S\",C95=0),0,IF(ISERROR(K95),J95,SMALL(J95:K95,1)))","v":0},{"$f":"IF($C95=1,OFFSET(E95,-1,0)+1,OFFSET(E95,-1,0))","v":1},{"$f":"IF($C95=1,0,IF($C95=2,OFFSET(F95,-1,0)+1,OFFSET(F95,-1,0)))","v":4},{"$f":"IF(AND($C95<=2,$C95<>0),0,IF($C95=3,OFFSET(G95,-1,0)+1,OFFSET(G95,-1,0)))","v":4},{"$f":"IF(AND($C95<=3,$C95<>0),0,IF($C95=4,OFFSET(H95,-1,0)+1,OFFSET(H95,-1,0)))","v":0},{"$f":"IF(AND($C95<=4,$C95<>0),0,IF(AND($C95=\"S\",$W95>0),OFFSET(I95,-1,0)+1,OFFSET(I95,-1,0)))","v":0},0,0,{"$f":"IF(OR(W95>0,$C95=1),\"F\",\"\")","v":""},"Serviço",{"$f":"CHOOSE(1+LOG(1+2*(C95=1)+4*(C95=2)+8*(C95=3)+16*(C95=4)+32*(C95=\"S\"),2),\"\",\"Nível 1\",\"Nível 2\",\"Nível 3\",\"Nível 4\",\"Serviço\")","v":"Serviço"},"1.4.4.0.2.","AGETOP",60010,"VERGA/CONTRAVERGA EM CONCRETO ARMADO FCK = 20 MPA","m3    ",0.51,null,null,null,""]
[2,2,2,13,1,5,0,0,0,224,13,"","Nível 2","Nível 2","1.5.","AGETOP",null,"ESTRUTURA","-",null,null,null,null,""]
[3,3,3,6,1,5,1,0,0,12,6,"","Nível 3","Nível 3","1.5.1.","AGETOP",null,"PILARES","-",null,null,null,null,""]
["S",3,"S",0,1,5,1,0,0,0,0,"","Serviço","Serviço","1.5.1.0.1.","SINAPI",92426,"MONTAGEM E DESMONTAGEM DE FÔRMA DE PILARES RETANGULARES E ESTRUTURAS SIMILARES COM ÁREA MÉDIA DAS SEÇÕES MENOR OU IGUAL A 0,25 M², PÉ-DIREITO SIMPLES, EM CHAPA DE MADEIRA COMPENSADA RESINADA, 8 UTILIZAÇÕES. AF_12/2015","M2",64.260000000000005,null,null,null,""]
["S",3,"S",0,1,5,1,0,0,0,0,"","Serviço","Serviço","1.5.1.0.2.","SINAPI",94965,"CONCRETO FCK = 25MPA, TRAÇO 1:2,3:2,7 (CIMENTO/ AREIA MÉDIA/ BRITA 1)  - PREPARO MECÂNICO COM BETONEIRA 400 L. AF_07/2016","M3",3.21,null,null,null,"Referência: AGETOP - 51030"]
["S",3,"S",0,1,5,1,0,0,0,0,"","Serviço","Serviço","1.5.1.0.3.","SINAPI",92873,"LANÇAMENTO COM USO DE BALDES, ADENSAMENTO E ACABAMENTO DE CONCRETO EM ESTRUTURAS. AF_12/2015","M3",3.21,null,null,null,"Referência: AGETOP - 60801"]
["S",3,"S",0,1,5,1,0,0,0,0,"","Serviço","Serviço","1.5.1.0.4.","SINAPI",92776,"ARMAÇÃO DE PILAR OU VIGA DE UMA ESTRUTURA CONVENCIONAL DE CONCRETO ARMADO EM UMA EDIFICAÇÃO TÉRREA OU SOBRADO UTILIZANDO AÇO CA-50 DE 6,3 MM - MONTAGEM. AF_12/2015","KG",165.3,null,null,null,"Referência: AGETOP - 60303"]
["S",3,"S",0,1,5,1,0,0,0,0,"","Serviço","Serviço","1.5.1.0.5.","SINAPI",92778,"ARMAÇÃO DE PILAR OU VIGA DE UMA ESTRUTURA CONVENCIONAL DE CONCRETO ARMADO EM UMA EDIFICAÇÃO TÉRREA OU SOBRADO UTILIZANDO AÇO CA-50 DE 10,0 MM - MONTAGEM. AF_12/2015","KG",283.60000000000002,null,null,null,"Referência: AGETOP - 60305"]
[3,3,3,6,1,5,2,0,0,6,90,"","Nível 3","Nível 3","1.5.2.",null,null,"VIGAS DE COBERTURA","-",null,null,null,null,""]
["S",3,"S",0,1,5,2,0,0,0,0,"","Serviço","Serviço","1.5.2.0.1.","SINAPI",92464,"MONTAGEM E DESMONTAGEM DE FÔRMA DE VIGA, ESCORAMENTO METÁLICO, PÉ-DIREITO SIMPLES, EM CHAPA DE MADEIRA RESINADA, 8 UTILIZAÇÕES. AF_12/2015","M2",138.22,null,null,null,"Referência: AGETOP - 60209"]
["S",3,"S",0,1,5,2,0,0,0,0,"","Serviço","Serviço","1.5.2.0.2.","SINAPI",94965,"CONCRETO FCK = 25MPA, TRAÇO 1:2,3:2,7 (CIMENTO/ AREIA MÉDIA/ BRITA 1)  - PREPARO MECÂNICO COM BETONEIRA 400 L. AF_07/2016","M3",8.8699999999999992,null,null,null,"Referência: AGETOP - 51030"]
["S",3,"S",0,1,5,2,0,0,0,0,"","Serviço","Serviço","1.5.2.0.3.","SINAPI",92873,"LANÇAMENTO COM USO DE BALDES, ADENSAMENTO E ACABAMENTO DE CONCRETO EM ESTRUTURAS. AF_12/2015","M3",8.8699999999999992,null,null,null,"Referência: AGETOP - 60801"]
["S",3,"S",0,1,5,2,0,0,0,0,"","Serviço","Serviço","1.5.2.0.4.","SINAPI",92776,"ARMAÇÃO DE PILAR OU VIGA DE UMA ESTRUTURA CONVENCIONAL DE CONCRETO ARMADO EM UMA EDIFICAÇÃO TÉRREA OU SOBRADO UTILIZANDO AÇO CA-50 DE 6,3 MM - MONTAGEM. AF_12/2015","KG",161.1,null,null,null,"Referência: AGETOP - 60303"]
["S",3,"S",0,1,5,2,0,0,0,0,"","Serviço","Serviço","1.5.2.0.5.","SINAPI",92777,"ARMAÇÃO DE PILAR OU VIGA DE UMA ESTRUTURA CONVENCIONAL DE CONCRETO ARMADO EM UMA EDIFICAÇÃO TÉRREA OU SOBRADO UTILIZANDO AÇO CA-50 DE 8,0 MM - MONTAGEM. AF_12/2015","KG",288.39999999999998,null,null,null,"Referência: AGETOP - 60304"]
[2,2,2,53,1,6,0,0,0,211,53,"","Nível 2","Nível 2","1.6.",null,null,"INSTALAÇÕES ELÉTRICAS","-",null,null,null,null,""]
["S",2,"S",0,1,6,0,0,0,0,0,"","Serviço","Serviço","1.6.0.0.1.","AGETOP",70351,"BRACADEIRA METALICA TIPO \"U\" DIAM. 3/4\"","Un    ",60,null,null,null,""]
["S",2,"S",0,1,6,0,0,0,0,0,"","Serviço","Serviço","1.6.0.0.2.","AGETOP",70352,"BRACADEIRA METALICA TIPO \"U\" DIAM. 1\"","Un    ",100,null,null,null,""]
["S",2,"S",0,1,6,0,0,0,0,0,"","Serviço","Serviço","1.6.0.0.3.","AGETOP",70354,"BRACADEIRA METALICA TIPO \"U\" DIAM. 1.1/2\"","Un    ",3,null,null,null,""]
["S",2,"S",0,1,6,0,0,0,0,0,"","Serviço","Serviço","1.6.0.0.4.","AGETOP",70421,"BUCHA E ARRUELA METALICA DIAM. 3/4\"","PR    ",6,null,null,null,""]
["S",2,"S",0,1,6,0,0,0,0,0,"","Serviço","Serviço","1.6.0.0.5.","AGETOP",70422,"BUCHA E ARRUELA METALICA DIAM. 1\"","PR    ",4,null,null,null,""]
["S",2,"S",0,1,6,0,0,0,0,0,"","Serviço","Serviço","1.6.0.0.6.","AGETOP",70424,"BUCHA E ARRUELA METALICA DIAM. 1.1/2\"","PR    ",2,null,null,null,""]
["S",2,"S",0,1,6,0,0,0,0,0,"","Serviço","Serviço","1.6.0.0.7.","AGETOP",70425,"BUCHA E ARRUELA METALICA DIAM. 2\"","PR    ",2,null,null,null,""]
["S",2,"S",0,1,6,0,0,0,0,0,"","Serviço","Serviço","1.6.0.0.8.","SINAPI",91931,"CABO DE COBRE FLEXÍVEL ISOLADO, 6 MM², ANTI-CHAMA 0,6/1,0 KV, PARA CIRCUITOS TERMINAIS - FORNECIMENTO E INSTALAÇÃO. AF_12/2015","M",350,null,null,null,"Referência: AGETOP - 70583"]
["S",2,"S",0,1,6,0,0,0,0,0,"","Serviço","Serviço","1.6.0.0.9.","SINAPI",92982,"CABO DE COBRE FLEXÍVEL ISOLADO, 16 MM², ANTI-CHAMA 0,6/1,0 KV, PARA DISTRIBUIÇÃO - FORNECIMENTO E INSTALAÇÃO. AF_12/2015","M",15,null,null,null,""]
["S",2,"S",0,1,6,0,0,0,0,0,"","Serviço","Serviço","1.6.0.0.10.","SINAPI",92984,"CABO DE COBRE FLEXÍVEL ISOLADO, 25 MM², ANTI-CHAMA 0,6/1,0 KV, PARA DISTRIBUIÇÃO - FORNECIMENTO E INSTALAÇÃO. AF_12/2015","M",60,null,null,null,"Referência: AGETOP - 70511"]
["S",2,"S",0,1,6,0,0,0,0,0,"","Serviço","Serviço","1.6.0.0.11.","SINAPI",96971,"CORDOALHA DE COBRE NU 16 MM², NÃO ENTERRADA, COM ISOLADOR - FORNECIMENTO E INSTALAÇÃO. AF_12/2017","M",40,null,null,null,"Referência: AGETOP - 70541"]
["S",2,"S",0,1,6,0,0,0,0,0,"","Serviço","Serviço","1.6.0.0.12.","SINAPI",91927,"CABO DE COBRE FLEXÍVEL ISOLADO, 2,5 MM², ANTI-CHAMA 0,6/1,0 KV, PARA CIRCUITOS TERMINAIS - FORNECIMENTO E INSTALAÇÃO. AF_12/2015","M",1300,null,null,null,"Referência: AGETOP - 70581"]
["S",2,"S",0,1,6,0,0,0,0,0,"","Serviço","Serviço","1.6.0.0.13.","SINAPI",91929,"CABO DE COBRE FLEXÍVEL ISOLADO, 4 MM², ANTI-CHAMA 0,6/1,0 KV, PARA CIRCUITOS TERMINAIS - FORNECIMENTO E INSTALAÇÃO. AF_12/2015","M",1000,null,null,null,"Referência: AGETOP - 70582"]
["S",2,"S",0,1,6,0,0,0,0,0,"","Serviço","Serviço","1.6.0.0.14.","AGETOP",70645,"CAIXA DE PASSAGEM METÁLICA DE EMBUTIR 15X15X8 CM","Un    ",3,null,null,null,""]
["S",2,"S",0,1,6,0,0,0,0,0,"","Serviço","Serviço","1.6.0.0.15.","SINAPI",92866,"CAIXA SEXTAVADA 3\" X 3\", METÁLICA, INSTALADA EM LAJE - FORNECIMENTO E INSTALAÇÃO. AF_12/2015","UN",15,null,null,null,"Referência: AGETOP - 70680"]
["S",2,"S",0,1,6,0,0,0,0,0,"","Serviço","Serviço","1.6.0.0.16.","AGETOP",70691,"CAIXA METALICA RET. 4\" X 2\" X 2\"","Un    ",13,null,null,null,""]
["S",2,"S",0,1,6,0,0,0,0,0,"","Serviço","Serviço","1.6.0.0.17.","AGETOP",70720,"CAIXA METÁLICA PARA MEDIDOR POLIFÁSICO PADRÃO ENEL 500X380X166MM","Un    ",1,null,null,null,""]
["S",2,"S",0,1,6,0,0,0,0,0,"","Serviço","Serviço","1.6.0.0.18.","SINAPI",95801,"CONDULETE DE ALUMÍNIO, TIPO X, PARA ELETRODUTO DE AÇO GALVANIZADO DN 20 MM (3/4''), APARENTE - FORNECIMENTO E INSTALAÇÃO. AF_11/2016_P","UN",15,null,null,null,"Referência: AGETOP - 70929"]
["S",2,"S",0,1,6,0,0,0,0,0,"","Serviço","Serviço","1.6.0.0.19.","AGETOP",70930,"CONDULETE METÁLICO - ADAPTADOR DE SAÍDA 3/4\" ","un    ",45,null,null,null,""]
["S",2,"S",0,1,6,0,0,0,0,0,"","Serviço","Serviço","1.6.0.0.20.","SINAPI",93653,"DISJUNTOR MONOPOLAR TIPO DIN, CORRENTE NOMINAL DE 10A - FORNECIMENTO E INSTALAÇÃO. AF_04/2016","UN",6,null,null,null,""]
["S",2,"S",0,1,6,0,0,0,0,0,"","Serviço","Serviço","1.6.0.0.21.","SINAPI",93654,"DISJUNTOR MONOPOLAR TIPO DIN, CORRENTE NOMINAL DE 16A - FORNECIMENTO E INSTALAÇÃO. AF_04/2016","UN",5,null,null,null,""]
["S",2,"S",0,1,6,0,0,0,0,0,"","Serviço","Serviço","1.6.0.0.22.","SINAPI",93656,"DISJUNTOR MONOPOLAR TIPO DIN, CORRENTE NOMINAL DE 25A - FORNECIMENTO E INSTALAÇÃO. AF_04/2016","UN",14,null,null,null,""]
["S",2,"S",0,1,6,0,0,0,0,0,"","Serviço","Serviço","1.6.0.0.23.","SINAPI",93671,"DISJUNTOR TRIPOLAR TIPO DIN, CORRENTE NOMINAL DE 32A - FORNECIMENTO E INSTALAÇÃO. AF_04/2016","UN",3,null,null,null,"Referência: AGETOP - 71173"]
["S",2,"S",0,1,6,0,0,0,0,0,"","Serviço","Serviço","1.6.0.0.24.","AGETOP",71175,"DISJUNTOR TRIPOLAR DE 60 A 100-A","Un    ",4,null,null,null,""]
[{"$f":"CHOOSE(1+LOG(1+2*(ORÇAMENTO.Nivel=\"Nível 1\")+4*(ORÇAMENTO.Nivel=\"Nível 2\")+8*(ORÇAMENTO.Nivel=\"Nível 3\")+16*(ORÇAMENTO.Nivel=\"Nível 4\")+32*(ORÇAMENTO.Nivel=\"Serviço\"),2),0,1,2,3,4,\"S\")","v":"S"},{"$f":"IF(OR(C134=\"s\",C134=0),OFFSET(B134,-1,0),C134)","v":2},{"$f":"IF(OFFSET(C134,-1,0)=\"L\",1,IF(OFFSET(C134,-1,0)=1,2,IF(OR(A134=\"s\",A134=0),\"S\",IF(AND(OFFSET(C134,-1,0)=2,A134=4),3,IF(AND(OR(OFFSET(C134,-1,0)=\"s\",OFFSET(C134,-1,0)=0),A134<>\"s\",A134>OFFSET(B134,-1,0)),OFFSET(B134,-1,0),A134)))))","v":"S"},{"$f":"IF(OR(C134=\"S\",C134=0),0,IF(ISERROR(K134),J134,SMALL(J134:K134,1)))","v":0},{"$f":"IF($C134=1,OFFSET(E134,-1,0)+1,OFFSET(E134,-1,0))","v":1},{"$f":"IF($C134=1,0,IF($C134=2,OFFSET(F134,-1,0)+1,OFFSET(F134,-1,0)))","v":6},{"$f":"IF(AND($C134<=2,$C134<>0),0,IF($C134=3,OFFSET(G134,-1,0)+1,OFFSET(G134,-1,0)))","v":0},{"$f":"IF(AND($C134<=3,$C134<>0),0,IF($C134=4,OFFSET(H134,-1,0)+1,OFFSET(H134,-1,0)))","v":0},{"$f":"IF(AND($C134<=4,$C134<>0),0,IF(AND($C134=\"S\",$W134>0),OFFSET(I134,-1,0)+1,OFFSET(I134,-1,0)))","v":0},0,0,{"$f":"IF(OR(W134>0,$C134=1),\"F\",\"\")","v":""},"Serviço",{"$f":"CHOOSE(1+LOG(1+2*(C134=1)+4*(C134=2)+8*(C134=3)+16*(C134=4)+32*(C134=\"S\"),2),\"\",\"Nível 1\",\"Nível 2\",\"Nível 3\",\"Nível 4\",\"Serviço\")","v":"Serviço"},"1.6.0.0.25.","AGETOP",71184,"DISPOSITIVO DE PROTEÇÃO CONTRA SURTOS (D.P.S.) 275V DE 8 A 40KA","Un    ",4,null,null,null,""]
["S",2,"S",0,1,6,0,0,0,0,0,"","Serviço","Serviço","1.6.0.0.26.","SINAPI",91844,"ELETRODUTO FLEXÍVEL CORRUGADO, PVC, DN 25 MM (3/4\"), PARA CIRCUITOS TERMINAIS, INSTALADO EM LAJE - FORNECIMENTO E INSTALAÇÃO. AF_12/2015","M",110,null,null,null,""]
["S",2,"S",0,1,6,0,0,0,0,0,"","Serviço","Serviço","1.6.0.0.27.","SINAPI",91846,"ELETRODUTO FLEXÍVEL CORRUGADO, PVC, DN 32 MM (1\"), PARA CIRCUITOS TERMINAIS, INSTALADO EM LAJE - FORNECIMENTO E INSTALAÇÃO. AF_12/2015","M",25,null,null,null,""]
["S",2,"S",0,1,6,0,0,0,0,0,"","Serviço","Serviço","1.6.0.0.28.","SINAPI",91871,"ELETRODUTO RÍGIDO ROSCÁVEL, PVC, DN 25 MM (3/4\"), PARA CIRCUITOS TERMINAIS, INSTALADO EM PAREDE - FORNECIMENTO E INSTALAÇÃO. AF_12/2015","M",90,null,null,null,"Referência: AGETOP - 71201"]
["S",2,"S",0,1,6,0,0,0,0,0,"","Serviço","Serviço","1.6.0.0.29.","SINAPI",91872,"ELETRODUTO RÍGIDO ROSCÁVEL, PVC, DN 32 MM (1\"), PARA CIRCUITOS TERMINAIS, INSTALADO EM PAREDE - FORNECIMENTO E INSTALAÇÃO. AF_12/2015","M",120,null,null,null,"Referência: AGETOP - 71202"]
["S",2,"S",0,1,6,0,0,0,0,0,"","Serviço","Serviço","1.6.0.0.30.","SINAPI",93008,"ELETRODUTO RÍGIDO ROSCÁVEL, PVC, DN 50 MM (1 1/2\") - FORNECIMENTO E INSTALAÇÃO. AF_12/2015","M",9,null,null,null,""]
["S",2,"S",0,1,6,0,0,0,0,0,"","Serviço","Serviço","1.6.0.0.31.","SINAPI",93009,"ELETRODUTO RÍGIDO ROSCÁVEL, PVC, DN 60 MM (2\") - FORNECIMENTO E INSTALAÇÃO. AF_12/2015","M",24,null,null,null,""]
["S",2,"S",0,1,6,0,0,0,0,0,"","Serviço","Serviço","1.6.0.0.32.","AGETOP",71321,"FITA DE AUTO FUSAO, ROLO E 10,00 MM","Un    ",6,null,null,null,""]
["S",2,"S",0,1,6,0,0,0,0,0,"","Serviço","Serviço","1.6.0.0.33.","AGETOP",71331,"FITA ISOLANTE, ROLO DE 20,00 M","Un    ",20,null,null,null,""]
["S",2,"S",0,1,6,0,0,0,0,0,"","Serviço","Serviço","1.6.0.0.34.","AGETOP",71381,"HASTE REV.COBRE(COPPERWELD)  5/8\" X 3,00 M C/CONECTOR","Un    ",3,null,null,null,""]
["S",2,"S",0,1,6,0,0,0,0,0,"","Serviço","Serviço","1.6.0.0.35.","AGETOP",71450,"INTERRUPTOR DIFERENCIAL RESIDUAL (D.R.) BIPOLAR DE 25A-30mA","Un    ",2,null,null,null,""]
["S",2,"S",0,1,6,0,0,0,0,0,"","Serviço","Serviço","1.6.0.0.36.","SINAPI",91953,"INTERRUPTOR SIMPLES (1 MÓDULO), 10A/250V, INCLUINDO SUPORTE E PLACA - FORNECIMENTO E INSTALAÇÃO. AF_12/2015","UN",24,null,null,null,"Referência: AGETOP - 71440"]
["S",2,"S",0,1,6,0,0,0,0,0,"","Serviço","Serviço","1.6.0.0.37.","SINAPI",91959,"INTERRUPTOR SIMPLES (2 MÓDULOS), 10A/250V, INCLUINDO SUPORTE E PLACA - FORNECIMENTO E INSTALAÇÃO. AF_12/2015","UN",1,null,null,null,"Referência: AGETOP - 71441"]
["S",2,"S",0,1,6,0,0,0,{"$f":"IF(OR($C147=\"S\",$C147=0),0,MATCH(0,OFFSET($D147,1,$C147,ROW($C$465)-ROW($C147)),0))","v":0},{"$f":"IF(OR($C147=\"S\",$C147=0),0,MATCH(OFFSET($D147,0,$C147)+1,OFFSET($D147,1,$C147,ROW($C$465)-ROW($C147)),0))","v":0},"","Serviço","Serviço","1.6.0.0.38.","SINAPI",97608,"LUMINÁRIA ARANDELA TIPO TARTARUGA, COM GRADE, DE SOBREPOR, COM 1 LÂMPADA FLUORESCENTE DE 15 W, SEM REATOR - FORNECIMENTO E INSTALAÇÃO. AF_02/2020","UN",2,null,null,null,""]
["S",2,"S",0,1,6,0,0,0,0,0,"","Serviço","Serviço","1.6.0.0.39.","SINAPI",97586,"LUMINÁRIA TIPO CALHA, DE SOBREPOR, COM 2 LÂMPADAS TUBULARES FLUORESCENTES DE 36 W, COM REATOR DE PARTIDA RÁPIDA - FORNECIMENTO E INSTALAÇÃO. AF_02/2020","UN",70,null,null,null,""]
["S",2,"S",0,1,6,0,0,0,0,0,"","Serviço","Serviço","1.6.0.0.40.","SINAPI",91884,"LUVA PARA ELETRODUTO, PVC, ROSCÁVEL, DN 25 MM (3/4\"), PARA CIRCUITOS TERMINAIS, INSTALADA EM PAREDE - FORNECIMENTO E INSTALAÇÃO. AF_12/2015","UN",30,null,null,null,"Referência: AGETOP - 71741"]
["S",2,"S",0,1,6,0,0,0,0,0,"","Serviço","Serviço","1.6.0.0.41.","SINAPI",91885,"LUVA PARA ELETRODUTO, PVC, ROSCÁVEL, DN 32 MM (1\"), PARA CIRCUITOS TERMINAIS, INSTALADA EM PAREDE - FORNECIMENTO E INSTALAÇÃO. AF_12/2015","UN",50,null,null,null,"Referência: AGETOP - 71742"]
["S",2,"S",0,1,6,0,0,0,0,0,"","Serviço","Serviço","1.6.0.0.42.","SINAPI",93013,"LUVA PARA ELETRODUTO, PVC, ROSCÁVEL, DN 50 MM (1 1/2\") - FORNECIMENTO E INSTALAÇÃO. AF_12/2015","UN",3,null,null,null,"Referência: AGETOP - 71744"]
["S",2,"S",0,1,6,0,0,0,0,0,"","Serviço","Serviço","1.6.0.0.43.","SINAPI",93014,"LUVA PARA ELETRODUTO, PVC, ROSCÁVEL, DN 60 MM (2\") - FORNECIMENTO E INSTALAÇÃO. AF_12/2015","UN",8,null,null,null,"Referência: AGETOP - 71745"]
["S",2,"S",0,1,6,0,0,0,0,0,"","Serviço","Serviço","1.6.0.0.44.","SINAPI","74131/5","QUADRO DE DISTRIBUICAO DE ENERGIA DE EMBUTIR, EM CHAPA METALICA, PARA 24 DISJUNTORES TERMOMAGNETICOS MONOPOLARES, COM BARRAMENTO TRIFASICO E NEUTRO, FORNECIMENTO E INSTALACAO","UN",1,null,null,null,""]
["S",2,"S",0,1,6,0,0,0,0,0,"","Serviço","Serviço","1.6.0.0.45.","SINAPI","74131/6","QUADRO DE DISTRIBUICAO DE ENERGIA DE EMBUTIR, EM CHAPA METALICA, PARA 32 DISJUNTORES TERMOMAGNETICOS MONOPOLARES, COM BARRAMENTO TRIFASICO E NEUTRO, FORNECIMENTO E INSTALACAO","UN",1,null,null,null,""]
["S",2,"S",0,1,6,0,0,0,0,0,"","Serviço","Serviço","1.6.0.0.46.","SINAPI",83463,"QUADRO DE DISTRIBUICAO DE ENERGIA EM CHAPA DE ACO GALVANIZADO, PARA 12 DISJUNTORES TERMOMAGNETICOS MONOPOLARES, COM BARRAMENTO TRIFASICO E NEUTRO - FORNECIMENTO E INSTALACAO","UN",1,null,null,null,""]
["S",2,"S",0,1,6,0,0,0,0,0,"","Serviço","Serviço","1.6.0.0.47.","COMPOSIÇÃO","COMP 375_SEE","REFLETOR DE LED HOLOFORTE 50W","UN ",4,null,null,null,""]
["S",2,"S",0,1,6,0,0,0,0,0,"","Serviço","Serviço","1.6.0.0.48.","AGETOP",72395,"TAMPA CEGA PARA CONDULETE METÁLICO","Un    ",15,null,null,null,""]
["S",2,"S",0,1,6,0,0,0,0,0,"","Serviço","Serviço","1.6.0.0.49.","AGETOP",72425,"TAMPA CEGA PLASTICA RETANGULAR 4\"X2\"","Un    ",15,null,null,null,""]
["S",2,"S",0,1,6,0,0,0,0,0,"","Serviço","Serviço","1.6.0.0.50.","AGETOP",72578,"TOMADA HEXAGONAL 2P + T - 10A - 250V","Un    ",60,null,null,null,""]
["S",2,"S",0,1,6,0,0,0,0,0,"","Serviço","Serviço","1.6.0.0.51.","AGETOP",72579,"TOMADA HEXAGONAL DUPLA 2P + T - 10A - 250V","un    ",10,null,null,null,""]
["S",2,"S",0,1,6,0,0,0,0,0,"","Serviço","Serviço","1.6.0.0.52.","AGETOP",72585,"TOMADA HEXAGONAL 2P + T - 20A - 250V","Un    ",9,null,null,null,""]
[{"$f":"CHOOSE(1+LOG(1+2*(ORÇAMENTO.Nivel=\"Nível 1\")+4*(ORÇAMENTO.Nivel=\"Nível 2\")+8*(ORÇAMENTO.Nivel=\"Nível 3\")+16*(ORÇAMENTO.Nivel=\"Nível 4\")+32*(ORÇAMENTO.Nivel=\"Serviço\"),2),0,1,2,3,4,\"S\")","v":2},{"$f":"IF(OR(C162=\"s\",C162=0),OFFSET(B162,-1,0),C162)","v":2},{"$f":"IF(OFFSET(C162,-1,0)=\"L\",1,IF(OFFSET(C162,-1,0)=1,2,IF(OR(A162=\"s\",A162=0),\"S\",IF(AND(OFFSET(C162,-1,0)=2,A162=4),3,IF(AND(OR(OFFSET(C162,-1,0)=\"s\",OFFSET(C162,-1,0)=0),A162<>\"s\",A162>OFFSET(B162,-1,0)),OFFSET(B162,-1,0),A162)))))","v":2},{"$f":"IF(OR(C162=\"S\",C162=0),0,IF(ISERROR(K162),J162,SMALL(J162:K162,1)))","v":47},{"$f":"IF($C162=1,OFFSET(E162,-1,0)+1,OFFSET(E162,-1,0))","v":1},{"$f":"IF($C162=1,0,IF($C162=2,OFFSET(F162,-1,0)+1,OFFSET(F162,-1,0)))","v":7},{"$f":"IF(AND($C162<=2,$C162<>0),0,IF($C162=3,OFFSET(G162,-1,0)+1,OFFSET(G162,-1,0)))","v":0},{"$f":"IF(AND($C162<=3,$C162<>0),0,IF($C162=4,OFFSET(H162,-1,0)+1,OFFSET(H162,-1,0)))","v":0},{"$f":"IF(AND($C162<=4,$C162<>0),0,IF(AND($C162=\"S\",$W162>0),OFFSET(I162,-1,0)+1,OFFSET(I162,-1,0)))","v":0},158,47,{"$f":"IF(OR(W162>0,$C162=1),\"F\",\"\")","v":""},"Nível 2",{"$f":"CHOOSE(1+LOG(1+2*(C162=1)+4*(C162=2)+8*(C162=3)+16*(C162=4)+32*(C162=\"S\"),2),\"\",\"Nível 1\",\"Nível 2\",\"Nível 3\",\"Nível 4\",\"Serviço\")","v":"Nível 2"},"1.7.","AGETOP",null,"INSTALAÇÕES HIDROSSANITÁRIAS","-",null,null,null,null,""]
[3,3,3,15,1,7,1,0,0,46,15,"","Nível 3","Nível 3","1.7.1.","SINAPI",null,"PEÇAS E ACESSÓRIOS","-",null,null,null,null,""]
[4,4,4,6,1,7,1,1,0,14,6,"","Nível 4","Nível 4","1.7.1.1.","SINAPI",null,"VASO SANITÁRIO E ACESSÓRIOS","-",null,null,null,null,""]
["S",4,"S",0,1,7,1,1,0,0,0,"","Serviço","Serviço","1.7.1.1.1.","AGETOP",80502,"VASO SANITARIO","Un    ",1,null,null,null,""]
["S",4,"S",0,1,7,1,1,0,0,0,"","Serviço","Serviço","1.7.1.1.2.","SINAPI",99635,"VÁLVULA DE DESCARGA METÁLICA, BASE 1 1/2 \", ACABAMENTO METALICO CROMADO - FORNECIMENTO E INSTALAÇÃO. AF_01/2019","UN",1,null,null,null,"Referência: AGETOP - 80515"]
["S",4,"S",0,1,7,1,1,0,0,0,"","Serviço","Serviço","1.7.1.1.3.","AGETOP",80520,"CONJUNTO DE FIXACAO P/VASO SANITARIO (PAR)","CJ    ",1,null,null,null,""]
["S",4,"S",0,1,7,1,1,0,0,0,"","Serviço","Serviço","1.7.1.1.4.","AGETOP",80526,"ASSENTO EM POLIPROPILENO COM SISTEMA DE FECHAMENTO SUAVE PARA VASO SANITÁRIO","Un    ",1,null,null,null,""]
["S",4,"S",0,1,7,1,1,0,0,0,"","Serviço","Serviço","1.7.1.1.5.","SINAPI",95544,"PAPELEIRA DE PAREDE EM METAL CROMADO SEM TAMPA, INCLUSO FIXAÇÃO. AF_01/2020","UN",1,null,null,null,""]
[4,4,4,8,1,7,1,2,0,8,13,"","Nível 4","Nível 4","1.7.1.2.","SINAPI",null,"LAVATÓRIO E ACESSÓRIOS","-",null,null,null,null,""]
["S",4,"S",0,1,7,1,2,0,0,0,"","Serviço","Serviço","1.7.1.2.1.","AGETOP",80542,"LAVATÓRIO MÉDIO SEM COLUNA","Un    ",2,null,null,null,""]
["S",4,"S",0,1,7,1,2,0,0,0,"","Serviço","Serviço","1.7.1.2.2.","AGETOP",80550,"FIXACAO P/LAVATORIO (PAR)","PAR   ",2,null,null,null,""]
["S",4,"S",0,1,7,1,2,0,0,0,"","Serviço","Serviço","1.7.1.2.3.","AGETOP",80555,"LIGAÇÃO FLEXÍVEL METÁLICA DIAM.1/2\"(ENGATE)","Un    ",3,null,null,null,""]
["S",4,"S",0,1,7,1,2,0,0,0,"","Serviço","Serviço","1.7.1.2.4.","SINAPI",86883,"SIFÃO DO TIPO FLEXÍVEL EM PVC 1  X 1.1/2  - FORNECIMENTO E INSTALAÇÃO. AF_01/2020","UN",3,null,null,null,""]
["S",4,"S",0,1,7,1,2,0,0,0,"","Serviço","Serviço","1.7.1.2.5.","SINAPI",86915,"TORNEIRA CROMADA DE MESA, 1/2\u0094 OU 3/4\u0094, PARA LAVATÓRIO, PADRÃO MÉDIO - FORNECIMENTO E INSTALAÇÃO. AF_01/2020","UN",3,null,null,null,"Referência: AGETOP - 80570"]
["S",4,"S",0,1,7,1,2,0,0,0,"","Serviço","Serviço","1.7.1.2.6.","SINAPI",86877,"VÁLVULA EM METAL CROMADO 1.1/2\u0094 X 1.1/2\u0094 PARA TANQUE OU LAVATÓRIO, COM OU SEM LADRÃO - FORNECIMENTO E INSTALAÇÃO. AF_01/2020","UN",3,null,null,null,"Referência: AGETOP - 80580"]
["S",4,"S",0,1,7,1,2,0,0,0,"","Serviço","Serviço","1.7.1.2.7.","SINAPI",86901,"CUBA DE EMBUTIR OVAL EM LOUÇA BRANCA, 35 X 50CM OU EQUIVALENTE - FORNECIMENTO E INSTALAÇÃO. AF_01/2020","UN",1,null,null,null,"Referência: AGETOP - 80587"]
[3,3,3,15,1,7,2,0,0,31,15,"","Nível 3","Nível 3","1.7.2.","SINAPI",null,"ÁGUA FRIA","-",null,null,null,null,""]
[4,4,4,2,1,7,2,1,0,14,2,"","Nível 4","Nível 4","1.7.2.1.","SINAPI",null,"TUBOS DE PVC SOLDÁVEL","-",null,null,null,null,""]
["S",4,"S",0,1,7,2,1,0,0,0,"","Serviço","Serviço","1.7.2.1.1.","SINAPI",89402,"TUBO, PVC, SOLDÁVEL, DN 25MM, INSTALADO EM RAMAL DE DISTRIBUIÇÃO DE ÁGUA - FORNECIMENTO E INSTALAÇÃO. AF_12/2014","M",12,null,null,null,"Referência: AGETOP - 81003"]
[4,4,4,2,1,7,2,2,0,12,2,"","Nível 4","Nível 4","1.7.2.2.","SINAPI",null,"LUVAS DE PVC","-",null,null,null,null,""]
["S",4,"S",0,1,7,2,2,0,0,0,"","Serviço","Serviço","1.7.2.2.1.","SINAPI",89528,"LUVA, PVC, SOLDÁVEL, DN 25MM, INSTALADO EM PRUMADA DE ÁGUA - FORNECIMENTO E INSTALAÇÃO. AF_12/2014","UN",4,null,null,null,""]
[4,4,4,2,1,7,2,3,0,10,2,"","Nível 4","Nível 4","1.7.2.3.","SINAPI",null,"BUCHAS","-",null,null,null,null,""]
["S",4,"S",0,1,7,2,3,0,0,0,"","Serviço","Serviço","1.7.2.3.1.","SINAPI",89579,"LUVA DE REDUÇÃO, PVC, SOLDÁVEL, DN 50MM X 25MM, INSTALADO EM PRUMADA DE ÁGUA   FORNECIMENTO E INSTALAÇÃO. AF_12/2014","UN",2,null,null,null,""]
[4,4,4,2,1,7,2,4,0,8,2,"","Nível 4","Nível 4","1.7.2.4.","SINAPI",null,"JOELHO","-",null,null,null,null,""]
["S",4,"S",0,1,7,2,4,0,0,0,"","Serviço","Serviço","1.7.2.4.1.","SINAPI",89481,"JOELHO 90 GRAUS, PVC, SOLDÁVEL, DN 25MM, INSTALADO EM PRUMADA DE ÁGUA - FORNECIMENTO E INSTALAÇÃO. AF_12/2014","UN",4,null,null,null,""]
[4,4,4,2,1,7,2,5,0,6,2,"","Nível 4","Nível 4","1.7.2.5.","SINAPI",null,"TÊ","-",null,null,null,null,""]
["S",4,"S",0,1,7,2,5,0,0,0,"","Serviço","Serviço","1.7.2.5.1.","SINAPI",89617,"TE, PVC, SOLDÁVEL, DN 25MM, INSTALADO EM PRUMADA DE ÁGUA - FORNECIMENTO E INSTALAÇÃO. AF_12/2014","UN",1,null,null,null,""]
[4,4,4,2,1,7,2,6,0,4,2,"","Nível 4","Nível 4","1.7.2.6.","SINAPI",null,"UNIÃO","-",null,null,null,null,""]
["S",4,"S",0,1,7,2,6,0,0,0,"","Serviço","Serviço","1.7.2.6.1.","SINAPI",89428,"UNIÃO, PVC, SOLDÁVEL, DN 25MM, INSTALADO EM RAMAL DE DISTRIBUIÇÃO DE ÁGUA - FORNECIMENTO E INSTALAÇÃO. AF_12/2014","UN",2,null,null,null,"Referência: AGETOP - 81462"]
[4,4,4,2,1,7,2,7,0,2,{"$error":"#N/A"},"","Nível 4","Nível 4","1.7.2.7.","SINAPI",null,"ADESIVOS","-",null,null,null,null,""]
["S",4,"S",0,1,7,2,7,0,0,0,"","Serviço","Serviço","1.7.2.7.1.","AGETOP",81502,"ADESIVO PLASTICO - BISNAGA 75 G","Un    ",1,null,null,null,""]
[3,3,3,16,1,7,3,0,0,16,35,"","Nível 3","Nível 3","1.7.3.","SINAPI",null,"ESGOTO SANITÁRIO","-",null,null,null,null,""]
[4,4,4,5,1,7,3,1,0,15,5,"","Nível 4","Nível 4","1.7.3.1.","SINAPI",null,"JOELHOS","-",null,null,null,null,""]
["S",4,"S",0,1,7,3,1,0,0,0,"","Serviço","Serviço","1.7.3.1.1.","SINAPI",89726,"JOELHO 45 GRAUS, PVC, SERIE NORMAL, ESGOTO PREDIAL, DN 40 MM, JUNTA SOLDÁVEL, FORNECIDO E INSTALADO EM RAMAL DE DESCARGA OU RAMAL DE ESGOTO SANITÁRIO. AF_12/2014","UN",2,null,null,null,""]
["S",4,"S",0,1,7,3,1,0,0,0,"","Serviço","Serviço","1.7.3.1.2.","AGETOP",81922,"JOELHO 45 GRAUS DIAMETRO 50 MM","Un    ",2,null,null,null,""]
["S",4,"S",0,1,7,3,1,0,0,0,"","Serviço","Serviço","1.7.3.1.3.","SINAPI",89724,"JOELHO 90 GRAUS, PVC, SERIE NORMAL, ESGOTO PREDIAL, DN 40 MM, JUNTA SOLDÁVEL, FORNECIDO E INSTALADO EM RAMAL DE DESCARGA OU RAMAL DE ESGOTO SANITÁRIO. AF_12/2014","UN",2,null,null,null,""]
["S",4,"S",0,1,7,3,1,0,0,0,"","Serviço","Serviço","1.7.3.1.4.","AGETOP",81938,"JOELHO 90 GRAUS DIAMETRO 100 MM","Un    ",2,null,null,null,""]
[4,4,4,2,1,7,3,2,0,10,2,"","Nível 4","Nível 4","1.7.3.2.","SINAPI",null,"LUVAS","-",null,null,null,null,""]
["S",4,"S",0,1,7,3,2,0,0,0,"","Serviço","Serviço","1.7.3.2.1.","SINAPI",89752,"LUVA SIMPLES, PVC, SERIE NORMAL, ESGOTO PREDIAL, DN 40 MM, JUNTA SOLDÁVEL, FORNECIDO E INSTALADO EM RAMAL DE DESCARGA OU RAMAL DE ESGOTO SANITÁRIO. AF_12/2014","UN",2,null,null,null,"Referência: AGETOP - 82001"]
[4,4,4,4,1,7,3,3,0,8,4,"","Nível 4","Nível 4","1.7.3.3.","SINAPI",null,"TUBOS","-",null,null,null,null,""]
["S",4,"S",0,1,7,3,3,0,0,0,"","Serviço","Serviço","1.7.3.3.1.","SINAPI",89711,"TUBO PVC, SERIE NORMAL, ESGOTO PREDIAL, DN 40 MM, FORNECIDO E INSTALADO EM RAMAL DE DESCARGA OU RAMAL DE ESGOTO SANITÁRIO. AF_12/2014","M",12,null,null,null,"Referência: AGETOP - 82301"]
["S",4,"S",0,1,7,3,3,0,0,0,"","Serviço","Serviço","1.7.3.3.2.","SINAPI",89800,"TUBO PVC, SERIE NORMAL, ESGOTO PREDIAL, DN 100 MM, FORNECIDO E INSTALADO EM PRUMADA DE ESGOTO SANITÁRIO OU VENTILAÇÃO. AF_12/2014","M",18,null,null,null,""]
["S",4,"S",0,1,7,3,3,0,0,0,"","Serviço","Serviço","1.7.3.3.3.","SINAPI",89798,"TUBO PVC, SERIE NORMAL, ESGOTO PREDIAL, DN 50 MM, FORNECIDO E INSTALADO EM PRUMADA DE ESGOTO SANITÁRIO OU VENTILAÇÃO. AF_12/2014","M",6,null,null,null,""]
[4,4,4,4,1,7,3,4,0,4,{"$error":"#N/A"},"","Nível 4","Nível 4","1.7.3.4.","SINAPI",null,"CAIXAS","-",null,null,null,null,""]
["S",4,"S",0,1,7,3,4,0,0,0,"","Serviço","Serviço","1.7.3.4.1.","SINAPI",89707,"CAIXA SIFONADA, PVC, DN 100 X 100 X 50 MM, JUNTA ELÁSTICA, FORNECIDA E INSTALADA EM RAMAL DE DESCARGA OU EM RAMAL DE ESGOTO SANITÁRIO. AF_12/2014","UN",1,null,null,null,""]
["S",4,"S",0,1,7,3,4,0,0,0,"","Serviço","Serviço","1.7.3.4.2.","AGETOP",81825,"CAIXA DE PASSAGEM 60 X 60 CM SEM TAMPA","Un    ",1,null,null,null,""]
["S",4,"S",0,1,7,3,4,0,0,0,"","Serviço","Serviço","1.7.3.4.3.","SINAPI",6171,"TAMPA DE CONCRETO ARMADO 60X60X5CM PARA CAIXA","UN",1,null,null,null,""]
[{"$f":"CHOOSE(1+LOG(1+2*(ORÇAMENTO.Nivel=\"Nível 1\")+4*(ORÇAMENTO.Nivel=\"Nível 2\")+8*(ORÇAMENTO.Nivel=\"Nível 3\")+16*(ORÇAMENTO.Nivel=\"Nível 4\")+32*(ORÇAMENTO.Nivel=\"Serviço\"),2),0,1,2,3,4,\"S\")","v":2},{"$f":"IF(OR(C209=\"s\",C209=0),OFFSET(B209,-1,0),C209)","v":2},{"$f":"IF(OFFSET(C209,-1,0)=\"L\",1,IF(OFFSET(C209,-1,0)=1,2,IF(OR(A209=\"s\",A209=0),\"S\",IF(AND(OFFSET(C209,-1,0)=2,A209=4),3,IF(AND(OR(OFFSET(C209,-1,0)=\"s\",OFFSET(C209,-1,0)=0),A209<>\"s\",A209>OFFSET(B209,-1,0)),OFFSET(B209,-1,0),A209)))))","v":2},{"$f":"IF(OR(C209=\"S\",C209=0),0,IF(ISERROR(K209),J209,SMALL(J209:K209,1)))","v":9},{"$f":"IF($C209=1,OFFSET(E209,-1,0)+1,OFFSET(E209,-1,0))","v":1},{"$f":"IF($C209=1,0,IF($C209=2,OFFSET(F209,-1,0)+1,OFFSET(F209,-1,0)))","v":8},{"$f":"IF(AND($C209<=2,$C209<>0),0,IF($C209=3,OFFSET(G209,-1,0)+1,OFFSET(G209,-1,0)))","v":0},{"$f":"IF(AND($C209<=3,$C209<>0),0,IF($C209=4,OFFSET(H209,-1,0)+1,OFFSET(H209,-1,0)))","v":0},{"$f":"IF(AND($C209<=4,$C209<>0),0,IF(AND($C209=\"S\",$W209>0),OFFSET(I209,-1,0)+1,OFFSET(I209,-1,0)))","v":0},111,9,{"$f":"IF(OR(W209>0,$C209=1),\"F\",\"\")","v":""},"Nível 2",{"$f":"CHOOSE(1+LOG(1+2*(C209=1)+4*(C209=2)+8*(C209=3)+16*(C209=4)+32*(C209=\"S\"),2),\"\",\"Nível 1\",\"Nível 2\",\"Nível 3\",\"Nível 4\",\"Serviço\")","v":"Nível 2"},"1.8.",null,null,"INSTALAÇÕES ESPECIAIS","-",null,null,null,null,""]
[3,3,3,8,1,8,1,0,0,8,12,"","Nível 3","Nível 3","1.8.1.","AGETOP",null,"EQUIPAMENTOS COMBATE INCENDIO","-",null,null,null,null,""]
[4,4,4,7,1,8,1,1,0,{"$f":"IF(OR($C211=\"S\",$C211=0),0,MATCH(0,OFFSET($D211,1,$C211,ROW($C$465)-ROW($C211)),0))","v":7},{"$f":"IF(OR($C211=\"S\",$C211=0),0,MATCH(OFFSET($D211,0,$C211)+1,OFFSET($D211,1,$C211,ROW($C$465)-ROW($C211)),0))","v":57},"","Nível 4","Nível 4","1.8.1.1.","AGETOP",null,"PEÇAS E ACESSÓRIOS ","-",null,null,null,null,""]
["S",4,"S",0,1,8,1,1,0,0,0,"","Serviço","Serviço","1.8.1.1.1.","AGETOP",85006,"EXTINTOR MULTI USO EM PO A B C (6 KG) - CAPACIDADE EXTINTORA 3A 20BC","un    ",5,null,null,null,""]
["S",4,"S",0,1,8,1,1,0,0,0,"","Serviço","Serviço","1.8.1.1.2.","COMPOSIÇÃO","COMP 277_SEE","MARCAÇÃO NO PISO - 1X1 M PARA EXTINTOR","M2",5,null,null,null,""]
["S",4,"S",0,1,8,1,1,0,0,0,"","Serviço","Serviço","1.8.1.1.3.","COMPOSIÇÃO","COMP 024_SEE","SINALIZADOR FOTOLUMINESCENTE PARA EXTINTOR","UN ",5,null,null,null,""]
["S",4,"S",0,1,8,1,1,0,0,0,"","Serviço","Serviço","1.8.1.1.4.","COMPOSIÇÃO","COMP 033_SEE","LUMINÁRIA DE EMERGÊNCIA LED PORTÁTIL - 30 LEDS","UN ",11,null,null,null,""]
["S",4,"S",0,1,8,1,1,0,0,0,"","Serviço","Serviço","1.8.1.1.5.","COMPOSIÇÃO","COMP 411_SEE","PLACA DE SINALIZAÇÃO EM PVC COD 13 - (316X158) SAÍDA DE EMERGÊNCIA","UN ",9,null,null,null,""]
["S",4,"S",0,1,8,1,1,0,0,0,"","Serviço","Serviço","1.8.1.1.6.","COMPOSIÇÃO","COMP 412_SEE","PLACA DE SINALIZAÇÃO EM PVC COD 17 - (316X158) MENSAGEM \"SAÍDA\"","UN ",2,null,null,null,""]
[2,{"$f":"IF(OR(C218=\"s\",C218=0),OFFSET(B218,-1,0),C218)","v":2},{"$f":"IF(OFFSET(C218,-1,0)=\"L\",1,IF(OFFSET(C218,-1,0)=1,2,IF(OR(A218=\"s\",A218=0),\"S\",IF(AND(OFFSET(C218,-1,0)=2,A218=4),3,IF(AND(OR(OFFSET(C218,-1,0)=\"s\",OFFSET(C218,-1,0)=0),A218<>\"s\",A218>OFFSET(B218,-1,0)),OFFSET(B218,-1,0),A218)))))","v":2},{"$f":"IF(OR(C218=\"S\",C218=0),0,IF(ISERROR(K218),J218,SMALL(J218:K218,1)))","v":12},{"$f":"IF($C218=1,OFFSET(E218,-1,0)+1,OFFSET(E218,-1,0))","v":1},{"$f":"IF($C218=1,0,IF($C218=2,OFFSET(F218,-1,0)+1,OFFSET(F218,-1,0)))","v":9},{"$f":"IF(AND($C218<=2,$C218<>0),0,IF($C218=3,OFFSET(G218,-1,0)+1,OFFSET(G218,-1,0)))","v":0},{"$f":"IF(AND($C218<=3,$C218<>0),0,IF($C218=4,OFFSET(H218,-1,0)+1,OFFSET(H218,-1,0)))","v":0},{"$f":"IF(AND($C218<=4,$C218<>0),0,IF(AND($C218=\"S\",$W218>0),OFFSET(I218,-1,0)+1,OFFSET(I218,-1,0)))","v":0},102,12,{"$f":"IF(OR(W218>0,$C218=1),\"F\",\"\")","v":""},"Nível 2",{"$f":"CHOOSE(1+LOG(1+2*(C218=1)+4*(C218=2)+8*(C218=3)+16*(C218=4)+32*(C218=\"S\"),2),\"\",\"Nível 1\",\"Nível 2\",\"Nível 3\",\"Nível 4\",\"Serviço\")","v":"Nível 2"},"1.9.","AGETOP",91045,"ALVENARIAS E DIVISÓRIAS","Un    ",null,null,null,null,""]
[{"$f":"CHOOSE(1+LOG(1+2*(ORÇAMENTO.Nivel=\"Nível 1\")+4*(ORÇAMENTO.Nivel=\"Nível 2\")+8*(ORÇAMENTO.Nivel=\"Nível 3\")+16*(ORÇAMENTO.Nivel=\"Nível 4\")+32*(ORÇAMENTO.Nivel=\"Serviço\"),2),0,1,2,3,4,\"S\")","v":3},3,3,3,1,9,1,0,0,11,3,"","Nível 3","Nível 3","1.9.1.","SINAPI",null,"REFORMA ADMINISTRATIVO","-",null,null,null,null,""]
[{"$f":"CHOOSE(1+LOG(1+2*(ORÇAMENTO.Nivel=\"Nível 1\")+4*(ORÇAMENTO.Nivel=\"Nível 2\")+8*(ORÇAMENTO.Nivel=\"Nível 3\")+16*(ORÇAMENTO.Nivel=\"Nível 4\")+32*(ORÇAMENTO.Nivel=\"Serviço\"),2),0,1,2,3,4,\"S\")","v":"S"},3,"S",0,1,9,1,0,0,0,0,"","Serviço","Serviço","1.9.1.0.1.","SINAPI",87520,"ALVENARIA DE VEDAÇÃO DE BLOCOS CERÂMICOS FURADOS NA HORIZONTAL DE 9X19X19CM (ESPESSURA 9CM) DE PAREDES COM ÁREA LÍQUIDA MAIOR OU IGUAL A 6M² COM VÃOS E ARGAMASSA DE ASSENTAMENTO COM PREPARO MANUAL. AF_06/2014","M2",93.63,null,null,null,"Referência: AGETOP - 100201"]
[{"$f":"CHOOSE(1+LOG(1+2*(ORÇAMENTO.Nivel=\"Nível 1\")+4*(ORÇAMENTO.Nivel=\"Nível 2\")+8*(ORÇAMENTO.Nivel=\"Nível 3\")+16*(ORÇAMENTO.Nivel=\"Nível 4\")+32*(ORÇAMENTO.Nivel=\"Serviço\"),2),0,1,2,3,4,\"S\")","v":"S"},3,"S",0,1,9,1,0,0,0,0,"","Serviço","Serviço","1.9.1.0.2.","SINAPI","73937/1","COBOGO DE CONCRETO (ELEMENTO VAZADO), 7X50X50CM, ASSENTADO COM ARGAMASSA TRACO 1:4 (CIMENTO E AREIA)","M2",17.98,null,null,null,"Referência: AGETOP - 100501"]
[{"$f":"CHOOSE(1+LOG(1+2*(ORÇAMENTO.Nivel=\"Nível 1\")+4*(ORÇAMENTO.Nivel=\"Nível 2\")+8*(ORÇAMENTO.Nivel=\"Nível 3\")+16*(ORÇAMENTO.Nivel=\"Nível 4\")+32*(ORÇAMENTO.Nivel=\"Serviço\"),2),0,1,2,3,4,\"S\")","v":3},3,3,2,1,9,2,0,0,8,2,"","Nível 3","Nível 3","1.9.2.","SINAPI",null,"ACESSIBILIDADE PÁTIO COBERTO","-",null,null,null,null,""]
[{"$f":"CHOOSE(1+LOG(1+2*(ORÇAMENTO.Nivel=\"Nível 1\")+4*(ORÇAMENTO.Nivel=\"Nível 2\")+8*(ORÇAMENTO.Nivel=\"Nível 3\")+16*(ORÇAMENTO.Nivel=\"Nível 4\")+32*(ORÇAMENTO.Nivel=\"Serviço\"),2),0,1,2,3,4,\"S\")","v":"S"},3,"S",0,1,9,2,0,0,0,0,"","Serviço","Serviço","1.9.2.0.1.","SINAPI",87520,"ALVENARIA DE VEDAÇÃO DE BLOCOS CERÂMICOS FURADOS NA HORIZONTAL DE 9X19X19CM (ESPESSURA 9CM) DE PAREDES COM ÁREA LÍQUIDA MAIOR OU IGUAL A 6M² COM VÃOS E ARGAMASSA DE ASSENTAMENTO COM PREPARO MANUAL. AF_06/2014","M2",0.12,null,null,null,"Referência: AGETOP - 100201"]
[{"$f":"CHOOSE(1+LOG(1+2*(ORÇAMENTO.Nivel=\"Nível 1\")+4*(ORÇAMENTO.Nivel=\"Nível 2\")+8*(ORÇAMENTO.Nivel=\"Nível 3\")+16*(ORÇAMENTO.Nivel=\"Nível 4\")+32*(ORÇAMENTO.Nivel=\"Serviço\"),2),0,1,2,3,4,\"S\")","v":3},{"$f":"IF(OR(C224=\"s\",C224=0),OFFSET(B224,-1,0),C224)","v":3},{"$f":"IF(OFFSET(C224,-1,0)=\"L\",1,IF(OFFSET(C224,-1,0)=1,2,IF(OR(A224=\"s\",A224=0),\"S\",IF(AND(OFFSET(C224,-1,0)=2,A224=4),3,IF(AND(OR(OFFSET(C224,-1,0)=\"s\",OFFSET(C224,-1,0)=0),A224<>\"s\",A224>OFFSET(B224,-1,0)),OFFSET(B224,-1,0),A224)))))","v":3},{"$f":"IF(OR(C224=\"S\",C224=0),0,IF(ISERROR(K224),J224,SMALL(J224:K224,1)))","v":4},{"$f":"IF($C224=1,OFFSET(E224,-1,0)+1,OFFSET(E224,-1,0))","v":1},{"$f":"IF($C224=1,0,IF($C224=2,OFFSET(F224,-1,0)+1,OFFSET(F224,-1,0)))","v":9},{"$f":"IF(AND($C224<=2,$C224<>0),0,IF($C224=3,OFFSET(G224,-1,0)+1,OFFSET(G224,-1,0)))","v":3},{"$f":"IF(AND($C224<=3,$C224<>0),0,IF($C224=4,OFFSET(H224,-1,0)+1,OFFSET(H224,-1,0)))","v":0},{"$f":"IF(AND($C224<=4,$C224<>0),0,IF(AND($C224=\"S\",$W224>0),OFFSET(I224,-1,0)+1,OFFSET(I224,-1,0)))","v":0},6,4,{"$f":"IF(OR(W224>0,$C224=1),\"F\",\"\")","v":""},"Nível 3",{"$f":"CHOOSE(1+LOG(1+2*(C224=1)+4*(C224=2)+8*(C224=3)+16*(C224=4)+32*(C224=\"S\"),2),\"\",\"Nível 1\",\"Nível 2\",\"Nível 3\",\"Nível 4\",\"Serviço\")","v":"Nível 3"},"1.9.3.","SINAPI",null,"REFORMA TELHADO BLOCO 2","-",null,null,null,null,""]
[4,4,4,3,1,9,3,1,0,3,43,"","Nível 4","Nível 4","1.9.3.1.","SINAPI",null,"CERÂMICA","-",null,null,null,null,""]
["S",4,"S",0,1,9,3,1,0,0,0,"","Serviço","Serviço","1.9.3.1.1.","AGETOP",160421,"MAO DE OBRA PARA COBERTURA C/TELHA COLONIAL PLAN","m2    ",198.38,null,null,null,""]
["S",4,"S",0,1,9,3,1,0,0,0,"","Serviço","Serviço","1.9.3.1.2.","SINAPI",94445,"TELHAMENTO COM TELHA CERÂMICA CAPA-CANAL, TIPO PLAN, COM ATÉ 2 ÁGUAS, INCLUSO TRANSPORTE VERTICAL. AF_07/2019","M2",198.38,null,null,null,"Referência: AGETOP - 160401"]
[3,3,3,2,1,9,4,0,0,2,17,"","Nível 3","Nível 3","1.9.4.",null,null,"ACESSIBILIDADE PÁTIO COBERTO","-",null,null,null,null,""]
["S",3,"S",0,1,9,4,0,0,0,0,"","Serviço","Serviço","1.9.4.0.1.","SINAPI",94228,"CALHA EM CHAPA DE AÇO GALVANIZADO NÚMERO 24, DESENVOLVIMENTO DE 50 CM, INCLUSO TRANSPORTE VERTICAL. AF_07/2019","M",47.45,null,null,null,"Referência: AGETOP - 160601"]
[2,2,2,18,1,10,0,0,0,90,18,"","Nível 2","Nível 2","1.10.",null,null,"ESQUADRIAS METÁLICAS","-",null,null,null,null,""]
[3,3,3,3,1,10,1,0,0,17,3,"","Nível 3","Nível 3","1.10.1.","SINAPI",null,"BANHEIRO FEMININO","-",null,null,null,null,""]
[{"$f":"CHOOSE(1+LOG(1+2*(ORÇAMENTO.Nivel=\"Nível 1\")+4*(ORÇAMENTO.Nivel=\"Nível 2\")+8*(ORÇAMENTO.Nivel=\"Nível 3\")+16*(ORÇAMENTO.Nivel=\"Nível 4\")+32*(ORÇAMENTO.Nivel=\"Serviço\"),2),0,1,2,3,4,\"S\")","v":"S"},{"$f":"IF(OR(C232=\"s\",C232=0),OFFSET(B232,-1,0),C232)","v":3},{"$f":"IF(OFFSET(C232,-1,0)=\"L\",1,IF(OFFSET(C232,-1,0)=1,2,IF(OR(A232=\"s\",A232=0),\"S\",IF(AND(OFFSET(C232,-1,0)=2,A232=4),3,IF(AND(OR(OFFSET(C232,-1,0)=\"s\",OFFSET(C232,-1,0)=0),A232<>\"s\",A232>OFFSET(B232,-1,0)),OFFSET(B232,-1,0),A232)))))","v":"S"},{"$f":"IF(OR(C232=\"S\",C232=0),0,IF(ISERROR(K232),J232,SMALL(J232:K232,1)))","v":0},{"$f":"IF($C232=1,OFFSET(E232,-1,0)+1,OFFSET(E232,-1,0))","v":1},{"$f":"IF($C232=1,0,IF($C232=2,OFFSET(F232,-1,0)+1,OFFSET(F232,-1,0)))","v":10},{"$f":"IF(AND($C232<=2,$C232<>0),0,IF($C232=3,OFFSET(G232,-1,0)+1,OFFSET(G232,-1,0)))","v":1},{"$f":"IF(AND($C232<=3,$C232<>0),0,IF($C232=4,OFFSET(H232,-1,0)+1,OFFSET(H232,-1,0)))","v":0},{"$f":"IF(AND($C232<=4,$C232<>0),0,IF(AND($C232=\"S\",$W232>0),OFFSET(I232,-1,0)+1,OFFSET(I232,-1,0)))","v":0},0,0,{"$f":"IF(OR(W232>0,$C232=1),\"F\",\"\")","v":""},"Serviço",{"$f":"CHOOSE(1+LOG(1+2*(C232=1)+4*(C232=2)+8*(C232=3)+16*(C232=4)+32*(C232=\"S\"),2),\"\",\"Nível 1\",\"Nível 2\",\"Nível 3\",\"Nível 4\",\"Serviço\")","v":"Serviço"},"1.10.1.0.1.","AGETOP",180501,"PORTA DE ABRIR EM CHAPA PF-1 C/FERRAGENS","m2    ",1.68,null,null,null,""]
["S",3,"S",0,1,10,1,0,0,0,0,"","Serviço","Serviço","1.10.1.0.2.","AGETOP",180509,"PORTA ABRIR CH.P/WC PF-10 C/FERRAGENS","m2    ",4.9399999999999995,null,null,null,""]
[3,3,3,3,1,10,2,0,0,14,3,"","Nível 3","Nível 3","1.10.2.","SINAPI",null,"BANHEIRO MASCULINO","-",null,null,null,null,""]
[{"$f":"CHOOSE(1+LOG(1+2*(ORÇAMENTO.Nivel=\"Nível 1\")+4*(ORÇAMENTO.Nivel=\"Nível 2\")+8*(ORÇAMENTO.Nivel=\"Nível 3\")+16*(ORÇAMENTO.Nivel=\"Nível 4\")+32*(ORÇAMENTO.Nivel=\"Serviço\"),2),0,1,2,3,4,\"S\")","v":"S"},{"$f":"IF(OR(C235=\"s\",C235=0),OFFSET(B235,-1,0),C235)","v":3},{"$f":"IF(OFFSET(C235,-1,0)=\"L\",1,IF(OFFSET(C235,-1,0)=1,2,IF(OR(A235=\"s\",A235=0),\"S\",IF(AND(OFFSET(C235,-1,0)=2,A235=4),3,IF(AND(OR(OFFSET(C235,-1,0)=\"s\",OFFSET(C235,-1,0)=0),A235<>\"s\",A235>OFFSET(B235,-1,0)),OFFSET(B235,-1,0),A235)))))","v":"S"},{"$f":"IF(OR(C235=\"S\",C235=0),0,IF(ISERROR(K235),J235,SMALL(J235:K235,1)))","v":0},{"$f":"IF($C235=1,OFFSET(E235,-1,0)+1,OFFSET(E235,-1,0))","v":1},{"$f":"IF($C235=1,0,IF($C235=2,OFFSET(F235,-1,0)+1,OFFSET(F235,-1,0)))","v":10},{"$f":"IF(AND($C235<=2,$C235<>0),0,IF($C235=3,OFFSET(G235,-1,0)+1,OFFSET(G235,-1,0)))","v":2},{"$f":"IF(AND($C235<=3,$C235<>0),0,IF($C235=4,OFFSET(H235,-1,0)+1,OFFSET(H235,-1,0)))","v":0},{"$f":"IF(AND($C235<=4,$C235<>0),0,IF(AND($C235=\"S\",$W235>0),OFFSET(I235,-1,0)+1,OFFSET(I235,-1,0)))","v":0},0,0,{"$f":"IF(OR(W235>0,$C235=1),\"F\",\"\")","v":""},"Serviço",{"$f":"CHOOSE(1+LOG(1+2*(C235=1)+4*(C235=2)+8*(C235=3)+16*(C235=4)+32*(C235=\"S\"),2),\"\",\"Nível 1\",\"Nível 2\",\"Nível 3\",\"Nível 4\",\"Serviço\")","v":"Serviço"},"1.10.2.0.1.","AGETOP",180501,"PORTA DE ABRIR EM CHAPA PF-1 C/FERRAGENS","m2    ",1.68,null,null,null,""]
["S",3,"S",0,1,10,2,0,0,0,0,"","Serviço","Serviço","1.10.2.0.2.","AGETOP",180509,"PORTA ABRIR CH.P/WC PF-10 C/FERRAGENS","m2    ",4.9399999999999995,null,null,null,""]
[3,3,3,6,1,10,3,0,0,11,6,"","Nível 3","Nível 3","1.10.3.","SINAPI",null,"REFORMA ADMINISTRATIVO","-",null,null,null,null,""]
["S",3,"S",0,1,10,3,0,0,0,0,"","Serviço","Serviço","1.10.3.0.1.","COMPOSIÇÃO","COMP 051_SEE","PORTA PADRÃO SEDUC PF-01 REFORÇADA","M2",8.19,null,null,null,""]
["S",3,"S",0,1,10,3,0,0,0,0,"","Serviço","Serviço","1.10.3.0.2.","AGETOP",180404,"ESQUADRIA BASCULANTE EM CHAPA  J17, J18 e J19 C/FERRAGENS","m2    ",3.96,null,null,null,""]
["S",3,"S",0,1,10,3,0,0,0,0,"","Serviço","Serviço","1.10.3.0.3.","AGETOP",180381,"ESQ. MAXIMO AR CHAPA/VIDRO J3/J5/J6/J8 C/FERRAGENS","m2    ",0.5,null,null,null,""]
[{"$f":"CHOOSE(1+LOG(1+2*(ORÇAMENTO.Nivel=\"Nível 1\")+4*(ORÇAMENTO.Nivel=\"Nível 2\")+8*(ORÇAMENTO.Nivel=\"Nível 3\")+16*(ORÇAMENTO.Nivel=\"Nível 4\")+32*(ORÇAMENTO.Nivel=\"Serviço\"),2),0,1,2,3,4,\"S\")","v":"S"},{"$f":"IF(OR(C241=\"s\",C241=0),OFFSET(B241,-1,0),C241)","v":3},{"$f":"IF(OFFSET(C241,-1,0)=\"L\",1,IF(OFFSET(C241,-1,0)=1,2,IF(OR(A241=\"s\",A241=0),\"S\",IF(AND(OFFSET(C241,-1,0)=2,A241=4),3,IF(AND(OR(OFFSET(C241,-1,0)=\"s\",OFFSET(C241,-1,0)=0),A241<>\"s\",A241>OFFSET(B241,-1,0)),OFFSET(B241,-1,0),A241)))))","v":"S"},{"$f":"IF(OR(C241=\"S\",C241=0),0,IF(ISERROR(K241),J241,SMALL(J241:K241,1)))","v":0},{"$f":"IF($C241=1,OFFSET(E241,-1,0)+1,OFFSET(E241,-1,0))","v":1},{"$f":"IF($C241=1,0,IF($C241=2,OFFSET(F241,-1,0)+1,OFFSET(F241,-1,0)))","v":10},{"$f":"IF(AND($C241<=2,$C241<>0),0,IF($C241=3,OFFSET(G241,-1,0)+1,OFFSET(G241,-1,0)))","v":3},{"$f":"IF(AND($C241<=3,$C241<>0),0,IF($C241=4,OFFSET(H241,-1,0)+1,OFFSET(H241,-1,0)))","v":0},{"$f":"IF(AND($C241<=4,$C241<>0),0,IF(AND($C241=\"S\",$W241>0),OFFSET(I241,-1,0)+1,OFFSET(I241,-1,0)))","v":0},0,0,{"$f":"IF(OR(W241>0,$C241=1),\"F\",\"\")","v":""},"Serviço",{"$f":"CHOOSE(1+LOG(1+2*(C241=1)+4*(C241=2)+8*(C241=3)+16*(C241=4)+32*(C241=\"S\"),2),\"\",\"Nível 1\",\"Nível 2\",\"Nível 3\",\"Nível 4\",\"Serviço\")","v":"Serviço"},"1.10.3.0.4.","COMPOSIÇÃO","COMP 059_SEE","RETIRADA E RECOLOCAÇÃO DE JANELAS OU PORTAS - AGETOP","M2",2.34,null,null,null,""]
[{"$f":"CHOOSE(1+LOG(1+2*(ORÇAMENTO.Nivel=\"Nível 1\")+4*(ORÇAMENTO.Nivel=\"Nível 2\")+8*(ORÇAMENTO.Nivel=\"Nível 3\")+16*(ORÇAMENTO.Nivel=\"Nível 4\")+32*(ORÇAMENTO.Nivel=\"Serviço\"),2),0,1,2,3,4,\"S\")","v":"S"},{"$f":"IF(OR(C242=\"s\",C242=0),OFFSET(B242,-1,0),C242)","v":3},{"$f":"IF(OFFSET(C242,-1,0)=\"L\",1,IF(OFFSET(C242,-1,0)=1,2,IF(OR(A242=\"s\",A242=0),\"S\",IF(AND(OFFSET(C242,-1,0)=2,A242=4),3,IF(AND(OR(OFFSET(C242,-1,0)=\"s\",OFFSET(C242,-1,0)=0),A242<>\"s\",A242>OFFSET(B242,-1,0)),OFFSET(B242,-1,0),A242)))))","v":"S"},{"$f":"IF(OR(C242=\"S\",C242=0),0,IF(ISERROR(K242),J242,SMALL(J242:K242,1)))","v":0},{"$f":"IF($C242=1,OFFSET(E242,-1,0)+1,OFFSET(E242,-1,0))","v":1},{"$f":"IF($C242=1,0,IF($C242=2,OFFSET(F242,-1,0)+1,OFFSET(F242,-1,0)))","v":10},{"$f":"IF(AND($C242<=2,$C242<>0),0,IF($C242=3,OFFSET(G242,-1,0)+1,OFFSET(G242,-1,0)))","v":3},{"$f":"IF(AND($C242<=3,$C242<>0),0,IF($C242=4,OFFSET(H242,-1,0)+1,OFFSET(H242,-1,0)))","v":0},{"$f":"IF(AND($C242<=4,$C242<>0),0,IF(AND($C242=\"S\",$W242>0),OFFSET(I242,-1,0)+1,OFFSET(I242,-1,0)))","v":0},0,0,{"$f":"IF(OR(W242>0,$C242=1),\"F\",\"\")","v":""},"Serviço",{"$f":"CHOOSE(1+LOG(1+2*(C242=1)+4*(C242=2)+8*(C242=3)+16*(C242=4)+32*(C242=\"S\"),2),\"\",\"Nível 1\",\"Nível 2\",\"Nível 3\",\"Nível 4\",\"Serviço\")","v":"Serviço"},"1.10.3.0.5.","COMPOSIÇÃO","COMP 007_SEE","GUICHÊ CANTONEIRA/GRADE PARA VIDRO","M²",1.26,null,null,null,""]
[3,{"$f":"IF(OR(C243=\"s\",C243=0),OFFSET(B243,-1,0),C243)","v":3},{"$f":"IF(OFFSET(C243,-1,0)=\"L\",1,IF(OFFSET(C243,-1,0)=1,2,IF(OR(A243=\"s\",A243=0),\"S\",IF(AND(OFFSET(C243,-1,0)=2,A243=4),3,IF(AND(OR(OFFSET(C243,-1,0)=\"s\",OFFSET(C243,-1,0)=0),A243<>\"s\",A243>OFFSET(B243,-1,0)),OFFSET(B243,-1,0),A243)))))","v":3},{"$f":"IF(OR(C243=\"S\",C243=0),0,IF(ISERROR(K243),J243,SMALL(J243:K243,1)))","v":2},{"$f":"IF($C243=1,OFFSET(E243,-1,0)+1,OFFSET(E243,-1,0))","v":1},{"$f":"IF($C243=1,0,IF($C243=2,OFFSET(F243,-1,0)+1,OFFSET(F243,-1,0)))","v":10},{"$f":"IF(AND($C243<=2,$C243<>0),0,IF($C243=3,OFFSET(G243,-1,0)+1,OFFSET(G243,-1,0)))","v":4},{"$f":"IF(AND($C243<=3,$C243<>0),0,IF($C243=4,OFFSET(H243,-1,0)+1,OFFSET(H243,-1,0)))","v":0},{"$f":"IF(AND($C243<=4,$C243<>0),0,IF(AND($C243=\"S\",$W243>0),OFFSET(I243,-1,0)+1,OFFSET(I243,-1,0)))","v":0},5,2,{"$f":"IF(OR(W243>0,$C243=1),\"F\",\"\")","v":""},"Nível 3",{"$f":"CHOOSE(1+LOG(1+2*(C243=1)+4*(C243=2)+8*(C243=3)+16*(C243=4)+32*(C243=\"S\"),2),\"\",\"Nível 1\",\"Nível 2\",\"Nível 3\",\"Nível 4\",\"Serviço\")","v":"Nível 3"},"1.10.4.","SINAPI","74238/2","ACESSIBILIDADE PÁTIO COBERTO","-",null,null,null,null,""]
["S",3,"S",0,1,10,4,0,0,0,0,"","Serviço","Serviço","1.10.4.0.1.","COMPOSIÇÃO","COMP 083_SEE","CORRIMÃO PISO - SEDUC","M",2.5,null,null,null,""]
[3,3,3,3,1,10,5,0,0,3,44,"","Nível 3","Nível 3","1.10.5.","SINAPI",null,"COZINHA","-",null,null,null,null,""]
["S",3,"S",0,1,10,5,0,0,0,0,"","Serviço","Serviço","1.10.5.0.1.","COMPOSIÇÃO","COMP 027_SEE","TELA MOSQUITEIRA EM NYLON COM ESTRUTURA DE ALUMÍNIO, COM FORNECIMENTO DE MÃO DE OBRA E INSTALAÇÃO","M2",1.68,null,null,null,""]
[{"$f":"CHOOSE(1+LOG(1+2*(ORÇAMENTO.Nivel=\"Nível 1\")+4*(ORÇAMENTO.Nivel=\"Nível 2\")+8*(ORÇAMENTO.Nivel=\"Nível 3\")+16*(ORÇAMENTO.Nivel=\"Nível 4\")+32*(ORÇAMENTO.Nivel=\"Serviço\"),2),0,1,2,3,4,\"S\")","v":"S"},{"$f":"IF(OR(C247=\"s\",C247=0),OFFSET(B247,-1,0),C247)","v":3},{"$f":"IF(OFFSET(C247,-1,0)=\"L\",1,IF(OFFSET(C247,-1,0)=1,2,IF(OR(A247=\"s\",A247=0),\"S\",IF(AND(OFFSET(C247,-1,0)=2,A247=4),3,IF(AND(OR(OFFSET(C247,-1,0)=\"s\",OFFSET(C247,-1,0)=0),A247<>\"s\",A247>OFFSET(B247,-1,0)),OFFSET(B247,-1,0),A247)))))","v":"S"},{"$f":"IF(OR(C247=\"S\",C247=0),0,IF(ISERROR(K247),J247,SMALL(J247:K247,1)))","v":0},{"$f":"IF($C247=1,OFFSET(E247,-1,0)+1,OFFSET(E247,-1,0))","v":1},{"$f":"IF($C247=1,0,IF($C247=2,OFFSET(F247,-1,0)+1,OFFSET(F247,-1,0)))","v":10},{"$f":"IF(AND($C247<=2,$C247<>0),0,IF($C247=3,OFFSET(G247,-1,0)+1,OFFSET(G247,-1,0)))","v":5},{"$f":"IF(AND($C247<=3,$C247<>0),0,IF($C247=4,OFFSET(H247,-1,0)+1,OFFSET(H247,-1,0)))","v":0},{"$f":"IF(AND($C247<=4,$C247<>0),0,IF(AND($C247=\"S\",$W247>0),OFFSET(I247,-1,0)+1,OFFSET(I247,-1,0)))","v":0},0,0,{"$f":"IF(OR(W247>0,$C247=1),\"F\",\"\")","v":""},"Serviço",{"$f":"CHOOSE(1+LOG(1+2*(C247=1)+4*(C247=2)+8*(C247=3)+16*(C247=4)+32*(C247=\"S\"),2),\"\",\"Nível 1\",\"Nível 2\",\"Nível 3\",\"Nível 4\",\"Serviço\")","v":"Serviço"},"1.10.5.0.2.","COMPOSIÇÃO","COMP 575_SEE","MOLA AEREA FECHA PORTA, PARA PORTAS COM LARGURA ATE 95 CM","UN ",1,null,null,null,""]
[2,2,2,3,1,11,0,0,0,72,3,"","Nível 2","Nível 2","1.11.",null,null,"VIDROS","-",null,null,null,null,""]
[{"$f":"CHOOSE(1+LOG(1+2*(ORÇAMENTO.Nivel=\"Nível 1\")+4*(ORÇAMENTO.Nivel=\"Nível 2\")+8*(ORÇAMENTO.Nivel=\"Nível 3\")+16*(ORÇAMENTO.Nivel=\"Nível 4\")+32*(ORÇAMENTO.Nivel=\"Serviço\"),2),0,1,2,3,4,\"S\")","v":3},{"$f":"IF(OR(C249=\"s\",C249=0),OFFSET(B249,-1,0),C249)","v":3},{"$f":"IF(OFFSET(C249,-1,0)=\"L\",1,IF(OFFSET(C249,-1,0)=1,2,IF(OR(A249=\"s\",A249=0),\"S\",IF(AND(OFFSET(C249,-1,0)=2,A249=4),3,IF(AND(OR(OFFSET(C249,-1,0)=\"s\",OFFSET(C249,-1,0)=0),A249<>\"s\",A249>OFFSET(B249,-1,0)),OFFSET(B249,-1,0),A249)))))","v":3},{"$f":"IF(OR(C249=\"S\",C249=0),0,IF(ISERROR(K249),J249,SMALL(J249:K249,1)))","v":2},{"$f":"IF($C249=1,OFFSET(E249,-1,0)+1,OFFSET(E249,-1,0))","v":1},{"$f":"IF($C249=1,0,IF($C249=2,OFFSET(F249,-1,0)+1,OFFSET(F249,-1,0)))","v":11},{"$f":"IF(AND($C249<=2,$C249<>0),0,IF($C249=3,OFFSET(G249,-1,0)+1,OFFSET(G249,-1,0)))","v":1},{"$f":"IF(AND($C249<=3,$C249<>0),0,IF($C249=4,OFFSET(H249,-1,0)+1,OFFSET(H249,-1,0)))","v":0},{"$f":"IF(AND($C249<=4,$C249<>0),0,IF(AND($C249=\"S\",$W249>0),OFFSET(I249,-1,0)+1,OFFSET(I249,-1,0)))","v":0},2,8,{"$f":"IF(OR(W249>0,$C249=1),\"F\",\"\")","v":""},"Nível 3",{"$f":"CHOOSE(1+LOG(1+2*(C249=1)+4*(C249=2)+8*(C249=3)+16*(C249=4)+32*(C249=\"S\"),2),\"\",\"Nível 1\",\"Nível 2\",\"Nível 3\",\"Nível 4\",\"Serviço\")","v":"Nível 3"},"1.11.1.","SINAPI",null,"REFORMA ADMINISTRATIVO","-",null,null,null,null,""]
[{"$f":"CHOOSE(1+LOG(1+2*(ORÇAMENTO.Nivel=\"Nível 1\")+4*(ORÇAMENTO.Nivel=\"Nível 2\")+8*(ORÇAMENTO.Nivel=\"Nível 3\")+16*(ORÇAMENTO.Nivel=\"Nível 4\")+32*(ORÇAMENTO.Nivel=\"Serviço\"),2),0,1,2,3,4,\"S\")","v":"S"},3,"S",0,1,11,1,0,0,0,0,"","Serviço","Serviço","1.11.1.0.1.","SINAPI",72117,"VIDRO LISO COMUM TRANSPARENTE, ESPESSURA 4MM","M2",4.46,null,null,null,"Referência: AGETOP - 190102"]
[2,2,2,9,1,12,0,0,0,69,9,"","Nível 2","Nível 2","1.12.",null,null,"REVESTIMENTO DE PAREDE","-",null,null,null,null,""]
[3,3,3,5,1,12,1,0,0,8,5,"","Nível 3","Nível 3","1.12.1.","SINAPI",null,"REFORMA ADMINISTRATIVO","-",null,null,null,null,""]
["S",3,"S",0,1,12,1,0,0,0,0,"","Serviço","Serviço","1.12.1.0.1.","SINAPI",87904,"CHAPISCO APLICADO EM ALVENARIA (COM PRESENÇA DE VÃOS) E ESTRUTURAS DE CONCRETO DE FACHADA, COM COLHER DE PEDREIRO.  ARGAMASSA TRAÇO 1:3 COM PREPARO MANUAL. AF_06/2014","M2",184.51,null,null,null,"Referência: AGETOP - 200101"]
["S",3,"S",0,1,12,1,0,0,0,0,"","Serviço","Serviço","1.12.1.0.2.","SINAPI",87553,"EMBOÇO, PARA RECEBIMENTO DE CERÂMICA, EM ARGAMASSA TRAÇO 1:2:8, PREPARO MECÂNICO COM BETONEIRA 400L, APLICADO MANUALMENTE EM FACES INTERNAS DE PAREDES, PARA AMBIENTE COM ÁREA MAIOR QUE 10M2, ESPESSURA DE 10MM, COM EXECUÇÃO DE TALISCAS. AF_06/2014","M2",27.21,null,null,null,""]
["S",3,"S",0,1,12,1,0,0,0,0,"","Serviço","Serviço","1.12.1.0.3.","SINAPI",87273,"REVESTIMENTO CERÂMICO PARA PAREDES INTERNAS COM PLACAS TIPO ESMALTADA EXTRA DE DIMENSÕES 33X45 CM APLICADAS EM AMBIENTES DE ÁREA MAIOR QUE 5 M² NA ALTURA INTEIRA DAS PAREDES. AF_06/2014","M2",27.21,null,null,null,""]
["S",3,"S",0,1,12,1,0,0,0,0,"","Serviço","Serviço","1.12.1.0.4.","SINAPI",87547,"MASSA ÚNICA, PARA RECEBIMENTO DE PINTURA, EM ARGAMASSA TRAÇO 1:2:8, PREPARO MECÂNICO COM BETONEIRA 400L, APLICADA MANUALMENTE EM FACES INTERNAS DE PAREDES, ESPESSURA DE 10MM, COM EXECUÇÃO DE TALISCAS. AF_06/2014","M2",158.25,null,null,null,""]
[3,3,3,3,1,12,2,0,0,3,20,"","Nível 3","Nível 3","1.12.2.","SINAPI",null,"ACESSIBILIDADE PÁTIO COBERTO","-",null,null,null,null,""]
["S",3,"S",0,1,12,2,0,0,0,0,"","Serviço","Serviço","1.12.2.0.1.","SINAPI",87904,"CHAPISCO APLICADO EM ALVENARIA (COM PRESENÇA DE VÃOS) E ESTRUTURAS DE CONCRETO DE FACHADA, COM COLHER DE PEDREIRO.  ARGAMASSA TRAÇO 1:3 COM PREPARO MANUAL. AF_06/2014","M2",0.06,null,null,null,"Referência: AGETOP - 200101"]
[{"$f":"CHOOSE(1+LOG(1+2*(ORÇAMENTO.Nivel=\"Nível 1\")+4*(ORÇAMENTO.Nivel=\"Nível 2\")+8*(ORÇAMENTO.Nivel=\"Nível 3\")+16*(ORÇAMENTO.Nivel=\"Nível 4\")+32*(ORÇAMENTO.Nivel=\"Serviço\"),2),0,1,2,3,4,\"S\")","v":"S"},{"$f":"IF(OR(C259=\"s\",C259=0),OFFSET(B259,-1,0),C259)","v":3},{"$f":"IF(OFFSET(C259,-1,0)=\"L\",1,IF(OFFSET(C259,-1,0)=1,2,IF(OR(A259=\"s\",A259=0),\"S\",IF(AND(OFFSET(C259,-1,0)=2,A259=4),3,IF(AND(OR(OFFSET(C259,-1,0)=\"s\",OFFSET(C259,-1,0)=0),A259<>\"s\",A259>OFFSET(B259,-1,0)),OFFSET(B259,-1,0),A259)))))","v":"S"},{"$f":"IF(OR(C259=\"S\",C259=0),0,IF(ISERROR(K259),J259,SMALL(J259:K259,1)))","v":0},{"$f":"IF($C259=1,OFFSET(E259,-1,0)+1,OFFSET(E259,-1,0))","v":1},{"$f":"IF($C259=1,0,IF($C259=2,OFFSET(F259,-1,0)+1,OFFSET(F259,-1,0)))","v":12},{"$f":"IF(AND($C259<=2,$C259<>0),0,IF($C259=3,OFFSET(G259,-1,0)+1,OFFSET(G259,-1,0)))","v":2},{"$f":"IF(AND($C259<=3,$C259<>0),0,IF($C259=4,OFFSET(H259,-1,0)+1,OFFSET(H259,-1,0)))","v":0},{"$f":"IF(AND($C259<=4,$C259<>0),0,IF(AND($C259=\"S\",$W259>0),OFFSET(I259,-1,0)+1,OFFSET(I259,-1,0)))","v":0},0,0,{"$f":"IF(OR(W259>0,$C259=1),\"F\",\"\")","v":""},"Serviço",{"$f":"CHOOSE(1+LOG(1+2*(C259=1)+4*(C259=2)+8*(C259=3)+16*(C259=4)+32*(C259=\"S\"),2),\"\",\"Nível 1\",\"Nível 2\",\"Nível 3\",\"Nível 4\",\"Serviço\")","v":"Serviço"},"1.12.2.0.2.","AGETOP",200505,"REB.PAULISTA C/IMPERM.A-15 (1CI:4ARMLC+5% IMPXCI)","m2    ",0.06,null,null,null,""]
[2,2,2,4,1,13,0,0,0,60,4,"","Nível 2","Nível 2","1.13.",null,null,"FORROS","-",null,null,null,null,""]
[3,3,3,3,1,13,1,0,0,3,10,"","Nível 3","Nível 3","1.13.1.","SINAPI",null,"REFORMA ADMINISTRATIVO","-",null,null,null,null,""]
[4,4,4,2,1,13,1,1,0,2,6,"","Nível 4","Nível 4","1.13.1.1.","SINAPI",null,"PVC COM ESTRUTURA","-",null,null,null,null,""]
["S",4,"S",0,1,13,1,1,0,0,0,"","Serviço","Serviço","1.13.1.1.1.","SINAPI",96116,"FORRO EM RÉGUAS DE PVC, FRISADO, PARA AMBIENTES COMERCIAIS, INCLUSIVE ESTRUTURA DE FIXAÇÃO. AF_05/2017_P","M2",91.6,null,null,null,"Referência: AGETOP - 210460"]
[2,2,2,27,1,14,0,0,0,56,27,"","Nível 2","Nível 2","1.14.",null,null,"REVESTIMENTO DE PISO","-",null,null,null,null,""]
[3,3,3,6,1,14,1,0,0,26,6,"","Nível 3","Nível 3","1.14.1.","SINAPI",null,"ACESSIBILIDADE","-",null,null,null,null,""]
[4,4,4,2,1,14,1,1,0,5,2,"","Nível 4","Nível 4","1.14.1.1.",null,null,"CONCRETO","-",null,null,null,null,""]
["S",4,"S",0,1,14,1,1,0,0,0,"","Serviço","Serviço","1.14.1.1.1.","AGETOP",220102,"PISO CONCRETO DESEMPENADO ESPESSURA = 5 CM  1:2,5:3,5","m2    ",317.86,null,null,null,""]
[4,4,4,3,1,14,1,2,0,3,{"$error":"#N/A"},"","Nível 4","Nível 4","1.14.1.2.",null,null,"PODOTÁTIL","-",null,null,null,null,""]
["S",4,"S",0,1,14,1,2,0,0,0,"","Serviço","Serviço","1.14.1.2.1.","AGETOP",221120,"PISO DE BORRACHA COLORIDO MODELO TÁTIL ( ALERTA OU DIRECIONAL) INCLUSO CONTRAPISO (1CI:3ARML) C/ E=2CM E NATA DE CIMENTO","m2    ",22.99,null,null,null,""]
["S",4,"S",0,1,14,1,2,0,0,0,"","Serviço","Serviço","1.14.1.2.2.","AGETOP",221126,"PISO DE LADRILHO HIDRÁULICO COLORIDO MODELO TÁTIL ( ALERTA OU DIRECIONAL) SEM LASTRO","m2    ",33.17,null,null,null,""]
[3,3,3,6,1,14,2,0,0,20,6,"","Nível 3","Nível 3","1.14.2.","SINAPI",null,"REFORMA ADMINISTRATIVO","-",null,null,null,null,""]
[4,4,4,2,1,14,2,1,0,5,2,"","Nível 4","Nível 4","1.14.2.1.","SINAPI",null,"CERÃMICO","-",null,null,null,null,""]
["S",4,"S",0,1,14,2,1,0,0,0,"","Serviço","Serviço","1.14.2.1.1.","SINAPI",87251,"REVESTIMENTO CERÂMICO PARA PISO COM PLACAS TIPO ESMALTADA EXTRA DE DIMENSÕES 45X45 CM APLICADA EM AMBIENTES DE ÁREA MAIOR QUE 10 M2. AF_06/2014","M2",2.1,null,null,null,""]
[4,4,4,3,1,14,2,2,0,3,{"$error":"#N/A"},"","Nível 4","Nível 4","1.14.2.2.",null,null,"GRANITINA","-",null,null,null,null,""]
["S",4,"S",0,1,14,2,2,0,{"$f":"IF(OR($C275=\"S\",$C275=0),0,MATCH(0,OFFSET($D275,1,$C275,ROW($C$465)-ROW($C275)),0))","v":0},{"$f":"IF(OR($C275=\"S\",$C275=0),0,MATCH(OFFSET($D275,0,$C275)+1,OFFSET($D275,1,$C275,ROW($C$465)-ROW($C275)),0))","v":0},"","Serviço","Serviço","1.14.2.2.1.","SINAPI",84191,"PISO EM GRANILITE, MARMORITE OU GRANITINA ESPESSURA 8 MM, INCLUSO JUNTAS DE DILATACAO PLASTICAS","M2",89.5,null,null,null,"Referência: AGETOP - 221101"]
["S",4,"S",0,1,14,2,2,0,0,0,"","Serviço","Serviço","1.14.2.2.2.","AGETOP",221104,"RASPAGEM E APLICAÇÃO RESINA ACRÍLICA DUAS DEMÃOS","m2    ",89.5,null,null,null,""]
[3,3,3,4,1,14,3,0,0,14,4,"","Nível 3","Nível 3","1.14.3.","SINAPI",null,"IMPLANTAÇÃO BLCO 2 SALAS DE AULA PADRÃO SEDUCE PADRÃO 2017 COM LAJE","-",null,null,null,null,""]
[4,4,4,3,1,14,3,1,0,3,{"$error":"#N/A"},"","Nível 4","Nível 4","1.14.3.1.",null,null,"GRANITINA","-",null,null,null,null,""]
["S",4,"S",0,1,14,3,1,0,0,0,"","Serviço","Serviço","1.14.3.1.1.","SINAPI",84191,"PISO EM GRANILITE, MARMORITE OU GRANITINA ESPESSURA 8 MM, INCLUSO JUNTAS DE DILATACAO PLASTICAS","M2",12.12,null,null,null,"Referência: AGETOP - 221101"]
["S",4,"S",0,1,14,3,1,0,0,0,"","Serviço","Serviço","1.14.3.1.2.","AGETOP",221104,"RASPAGEM E APLICAÇÃO RESINA ACRÍLICA DUAS DEMÃOS","m2    ",12.12,null,null,null,""]
[3,3,3,4,1,14,4,0,0,10,4,"","Nível 3","Nível 3","1.14.4.","SINAPI",null,"TROCAR PISO DAS SALAS DE AULA 03, 04, 05 e 06","-",null,null,null,null,""]
[4,4,4,3,1,14,4,1,0,3,{"$error":"#N/A"},"","Nível 4","Nível 4","1.14.4.1.",null,null,"GRANITINA","-",null,null,null,null,""]
["S",4,"S",0,1,14,4,1,0,0,0,"","Serviço","Serviço","1.14.4.1.1.","SINAPI",84191,"PISO EM GRANILITE, MARMORITE OU GRANITINA ESPESSURA 8 MM, INCLUSO JUNTAS DE DILATACAO PLASTICAS","M2",185.16,null,null,null,"Referência: AGETOP - 221101"]
["S",4,"S",0,1,14,4,1,0,0,0,"","Serviço","Serviço","1.14.4.1.2.","AGETOP",221104,"RASPAGEM E APLICAÇÃO RESINA ACRÍLICA DUAS DEMÃOS","m2    ",185.16,null,null,null,""]
[3,3,3,4,1,14,5,0,0,6,4,"","Nível 3","Nível 3","1.14.5.","SINAPI",null,"ACESSIBILIDADE PÁTIO COBERTO","-",null,null,null,null,""]
[{"$f":"CHOOSE(1+LOG(1+2*(ORÇAMENTO.Nivel=\"Nível 1\")+4*(ORÇAMENTO.Nivel=\"Nível 2\")+8*(ORÇAMENTO.Nivel=\"Nível 3\")+16*(ORÇAMENTO.Nivel=\"Nível 4\")+32*(ORÇAMENTO.Nivel=\"Serviço\"),2),0,1,2,3,4,\"S\")","v":4},{"$f":"IF(OR(C286=\"s\",C286=0),OFFSET(B286,-1,0),C286)","v":4},{"$f":"IF(OFFSET(C286,-1,0)=\"L\",1,IF(OFFSET(C286,-1,0)=1,2,IF(OR(A286=\"s\",A286=0),\"S\",IF(AND(OFFSET(C286,-1,0)=2,A286=4),3,IF(AND(OR(OFFSET(C286,-1,0)=\"s\",OFFSET(C286,-1,0)=0),A286<>\"s\",A286>OFFSET(B286,-1,0)),OFFSET(B286,-1,0),A286)))))","v":4},{"$f":"IF(OR(C286=\"S\",C286=0),0,IF(ISERROR(K286),J286,SMALL(J286:K286,1)))","v":3},{"$f":"IF($C286=1,OFFSET(E286,-1,0)+1,OFFSET(E286,-1,0))","v":1},{"$f":"IF($C286=1,0,IF($C286=2,OFFSET(F286,-1,0)+1,OFFSET(F286,-1,0)))","v":14},{"$f":"IF(AND($C286<=2,$C286<>0),0,IF($C286=3,OFFSET(G286,-1,0)+1,OFFSET(G286,-1,0)))","v":5},{"$f":"IF(AND($C286<=3,$C286<>0),0,IF($C286=4,OFFSET(H286,-1,0)+1,OFFSET(H286,-1,0)))","v":1},{"$f":"IF(AND($C286<=4,$C286<>0),0,IF(AND($C286=\"S\",$W286>0),OFFSET(I286,-1,0)+1,OFFSET(I286,-1,0)))","v":0},3,{"$error":"#N/A"},{"$f":"IF(OR(W286>0,$C286=1),\"F\",\"\")","v":""},"Nível 4",{"$f":"CHOOSE(1+LOG(1+2*(C286=1)+4*(C286=2)+8*(C286=3)+16*(C286=4)+32*(C286=\"S\"),2),\"\",\"Nível 1\",\"Nível 2\",\"Nível 3\",\"Nível 4\",\"Serviço\")","v":"Nível 4"},"1.14.5.1.",null,null,"GRANITINA","-",null,null,null,null,""]
["S",4,"S",0,1,14,5,1,0,0,0,"","Serviço","Serviço","1.14.5.1.1.","SINAPI",84191,"PISO EM GRANILITE, MARMORITE OU GRANITINA ESPESSURA 8 MM, INCLUSO JUNTAS DE DILATACAO PLASTICAS","M2",12.2,null,null,null,"Referência: AGETOP - 221101"]
["S",4,"S",0,1,14,5,1,0,0,0,"","Serviço","Serviço","1.14.5.1.2.","AGETOP",221104,"RASPAGEM E APLICAÇÃO RESINA ACRÍLICA DUAS DEMÃOS","m2    ",102.3,null,null,null,""]
[3,3,3,2,1,14,6,0,0,2,{"$error":"#N/A"},"","Nível 3","Nível 3","1.14.6.","SINAPI",null,"IMPLANTAÇÃO PROJETOS COMPLEMENTÁRES","-",null,null,null,null,""]
["S",3,"S",0,1,14,6,0,0,0,0,"","Serviço","Serviço","1.14.6.0.1.","SINAPI",68325,"PISO EM CONCRETO 20 MPA PREPARO MECANICO, ESPESSURA 7CM, INCLUSO SELANTE ELASTICO A BASE DE POLIURETANO","M2",9.4,null,null,null,""]
[2,2,2,7,1,15,0,0,0,29,7,"","Nível 2","Nível 2","1.15.",null,null,"FERRAGENS","-",null,null,null,null,""]
[3,3,3,3,1,15,1,0,0,6,3,"","Nível 3","Nível 3","1.15.1.","SINAPI",null,"BANHEIRO FEMININO","-",null,null,null,null,""]
["S",3,"S",0,1,15,1,0,0,0,0,"","Serviço","Serviço","1.15.1.0.1.","AGETOP",230174,"BARRA DE APOIO EM AÇO INOX - 40 CM","un    ",4,null,null,null,""]
["S",3,"S",0,1,15,1,0,0,0,0,"","Serviço","Serviço","1.15.1.0.2.","AGETOP",230176,"BARRA DE APOIO EM AÇO INOX - 80 CM ","un    ",3,null,null,null,""]
[3,3,3,3,1,15,2,0,0,3,12,"","Nível 3","Nível 3","1.15.2.","SINAPI",null,"BANHEIRO MASCULINO","-",null,null,null,null,""]
["S",3,"S",0,1,15,2,0,0,0,0,"","Serviço","Serviço","1.15.2.0.1.","AGETOP",230174,"BARRA DE APOIO EM AÇO INOX - 40 CM","un    ",4,null,null,null,""]
["S",3,"S",0,1,15,2,0,0,0,0,"","Serviço","Serviço","1.15.2.0.2.","AGETOP",230176,"BARRA DE APOIO EM AÇO INOX - 80 CM ","un    ",3,null,null,null,""]
[2,{"$f":"IF(OR(C298=\"s\",C298=0),OFFSET(B298,-1,0),C298)","v":2},{"$f":"IF(OFFSET(C298,-1,0)=\"L\",1,IF(OFFSET(C298,-1,0)=1,2,IF(OR(A298=\"s\",A298=0),\"S\",IF(AND(OFFSET(C298,-1,0)=2,A298=4),3,IF(AND(OR(OFFSET(C298,-1,0)=\"s\",OFFSET(C298,-1,0)=0),A298<>\"s\",A298>OFFSET(B298,-1,0)),OFFSET(B298,-1,0),A298)))))","v":2},{"$f":"IF(OR(C298=\"S\",C298=0),0,IF(ISERROR(K298),J298,SMALL(J298:K298,1)))","v":4},{"$f":"IF($C298=1,OFFSET(E298,-1,0)+1,OFFSET(E298,-1,0))","v":1},{"$f":"IF($C298=1,0,IF($C298=2,OFFSET(F298,-1,0)+1,OFFSET(F298,-1,0)))","v":16},{"$f":"IF(AND($C298<=2,$C298<>0),0,IF($C298=3,OFFSET(G298,-1,0)+1,OFFSET(G298,-1,0)))","v":0},{"$f":"IF(AND($C298<=3,$C298<>0),0,IF($C298=4,OFFSET(H298,-1,0)+1,OFFSET(H298,-1,0)))","v":0},{"$f":"IF(AND($C298<=4,$C298<>0),0,IF(AND($C298=\"S\",$W298>0),OFFSET(I298,-1,0)+1,OFFSET(I298,-1,0)))","v":0},22,4,{"$f":"IF(OR(W298>0,$C298=1),\"F\",\"\")","v":""},"Nível 2",{"$f":"CHOOSE(1+LOG(1+2*(C298=1)+4*(C298=2)+8*(C298=3)+16*(C298=4)+32*(C298=\"S\"),2),\"\",\"Nível 1\",\"Nível 2\",\"Nível 3\",\"Nível 4\",\"Serviço\")","v":"Nível 2"},"1.16.",null,null,"ADMINISTRAÇÃO","-",null,null,null,null,""]
[3,3,3,3,1,16,1,0,0,3,6,"","Nível 3","Nível 3","1.16.1.",null,null,"MENSALISTAS","-",null,null,null,null,""]
["S",3,"S",0,1,16,1,0,0,0,0,"","Serviço","Serviço","1.16.1.0.1.","SINAPI",90778,"ENGENHEIRO CIVIL DE OBRA PLENO COM ENCARGOS COMPLEMENTARES","H",112,null,null,null,"Referência: AGETOP - 250101"]
["S",3,"S",0,1,16,1,0,0,0,0,"","Serviço","Serviço","1.16.1.0.2.","SINAPI",90776,"ENCARREGADO GERAL COM ENCARGOS COMPLEMENTARES","H",660,null,null,null,"Referência: AGETOP - 250103"]
[{"$f":"CHOOSE(1+LOG(1+2*(ORÇAMENTO.Nivel=\"Nível 1\")+4*(ORÇAMENTO.Nivel=\"Nível 2\")+8*(ORÇAMENTO.Nivel=\"Nível 3\")+16*(ORÇAMENTO.Nivel=\"Nível 4\")+32*(ORÇAMENTO.Nivel=\"Serviço\"),2),0,1,2,3,4,\"S\")","v":2},2,2,15,1,17,0,0,0,18,15,"","Nível 2","Nível 2","1.17.",null,null,"PINTURA","-",null,null,null,null,""]
[3,3,3,2,1,17,1,0,0,14,2,"","Nível 3","Nível 3","1.17.1.","SINAPI",null,"BANHEIRO FEMININO","-",null,null,null,null,""]
["S",3,"S",0,1,17,1,0,0,0,0,"","Serviço","Serviço","1.17.1.0.1.","AGETOP",261602,"PINT.ESMALTE/ESQUAD.FERRO C/FUNDO ANTICOR.","m2    ",19.86,null,null,null,""]
[3,3,3,2,1,17,2,0,0,12,2,"","Nível 3","Nível 3","1.17.2.","SINAPI",null,"BANHEIRO MASCULINO","-",null,null,null,null,""]
["S",3,"S",0,1,17,2,0,0,0,0,"","Serviço","Serviço","1.17.2.0.1.","AGETOP",261602,"PINT.ESMALTE/ESQUAD.FERRO C/FUNDO ANTICOR.","m2    ",19.86,null,null,null,""]
[3,3,3,7,1,17,3,0,0,10,7,"","Nível 3","Nível 3","1.17.3.","SINAPI",null,"REFORMA ADMINISTRATIVO","-",null,null,null,null,""]
["S",3,"S",0,1,17,3,0,0,0,0,"","Serviço","Serviço","1.17.3.0.1.","SINAPI",88497,"APLICAÇÃO E LIXAMENTO DE MASSA LÁTEX EM PAREDES, DUAS DEMÃOS. AF_06/2014","M2",158.25,null,null,null,"Referência: AGETOP - 261300"]
["S",3,"S",0,1,17,3,0,0,0,0,"","Serviço","Serviço","1.17.3.0.2.","AGETOP",261550,"PINT.ESMALTE SINT.PAREDES - 2 DEM.C/SELADOR","m2    ",106.44,null,null,null,""]
["S",3,"S",0,1,17,3,0,0,0,0,"","Serviço","Serviço","1.17.3.0.3.","SINAPI",88489,"APLICAÇÃO MANUAL DE PINTURA COM TINTA LÁTEX ACRÍLICA EM PAREDES, DUAS DEMÃOS. AF_06/2014","M2",122,null,null,null,"Referência: AGETOP - 261001"]
["S",3,"S",0,1,17,3,0,0,0,0,"","Serviço","Serviço","1.17.3.0.4.","AGETOP",261602,"PINT.ESMALTE/ESQUAD.FERRO C/FUNDO ANTICOR.","m2    ",33.49,null,null,null,""]
[{"$f":"CHOOSE(1+LOG(1+2*(ORÇAMENTO.Nivel=\"Nível 1\")+4*(ORÇAMENTO.Nivel=\"Nível 2\")+8*(ORÇAMENTO.Nivel=\"Nível 3\")+16*(ORÇAMENTO.Nivel=\"Nível 4\")+32*(ORÇAMENTO.Nivel=\"Serviço\"),2),0,1,2,3,4,\"S\")","v":"S"},{"$f":"IF(OR(C312=\"s\",C312=0),OFFSET(B312,-1,0),C312)","v":3},{"$f":"IF(OFFSET(C312,-1,0)=\"L\",1,IF(OFFSET(C312,-1,0)=1,2,IF(OR(A312=\"s\",A312=0),\"S\",IF(AND(OFFSET(C312,-1,0)=2,A312=4),3,IF(AND(OR(OFFSET(C312,-1,0)=\"s\",OFFSET(C312,-1,0)=0),A312<>\"s\",A312>OFFSET(B312,-1,0)),OFFSET(B312,-1,0),A312)))))","v":"S"},{"$f":"IF(OR(C312=\"S\",C312=0),0,IF(ISERROR(K312),J312,SMALL(J312:K312,1)))","v":0},{"$f":"IF($C312=1,OFFSET(E312,-1,0)+1,OFFSET(E312,-1,0))","v":1},{"$f":"IF($C312=1,0,IF($C312=2,OFFSET(F312,-1,0)+1,OFFSET(F312,-1,0)))","v":17},{"$f":"IF(AND($C312<=2,$C312<>0),0,IF($C312=3,OFFSET(G312,-1,0)+1,OFFSET(G312,-1,0)))","v":3},{"$f":"IF(AND($C312<=3,$C312<>0),0,IF($C312=4,OFFSET(H312,-1,0)+1,OFFSET(H312,-1,0)))","v":0},{"$f":"IF(AND($C312<=4,$C312<>0),0,IF(AND($C312=\"S\",$W312>0),OFFSET(I312,-1,0)+1,OFFSET(I312,-1,0)))","v":0},0,0,{"$f":"IF(OR(W312>0,$C312=1),\"F\",\"\")","v":""},"Serviço",{"$f":"CHOOSE(1+LOG(1+2*(C312=1)+4*(C312=2)+8*(C312=3)+16*(C312=4)+32*(C312=\"S\"),2),\"\",\"Nível 1\",\"Nível 2\",\"Nível 3\",\"Nível 4\",\"Serviço\")","v":"Serviço"},"1.17.3.0.5.","AGETOP",260105,"REMOCAO DE PINTURA ANTIGA A OLEO OU ESMALTE","m2    ",4.68,null,null,null,""]
["S",3,"S",0,1,17,3,0,0,0,0,"","Serviço","Serviço","1.17.3.0.6.","AGETOP",261503,"PINT.ESMALTE 2 DEM. ESQ.FERRO (SEM FUNDO ANTICOR.)","m2    ",4.68,null,null,null,""]
[3,3,3,3,1,17,4,0,0,3,{"$error":"#N/A"},"","Nível 3","Nível 3","1.17.4.","SINAPI",null,"ACESSIBILIDADE PÁTIO COBERTO","-",null,null,null,null,""]
["S",3,"S",0,1,17,4,0,0,0,0,"","Serviço","Serviço","1.17.4.0.1.","SINAPI",88497,"APLICAÇÃO E LIXAMENTO DE MASSA LÁTEX EM PAREDES, DUAS DEMÃOS. AF_06/2014","M2",0.06,null,null,null,"Referência: AGETOP - 261300"]
[{"$f":"CHOOSE(1+LOG(1+2*(ORÇAMENTO.Nivel=\"Nível 1\")+4*(ORÇAMENTO.Nivel=\"Nível 2\")+8*(ORÇAMENTO.Nivel=\"Nível 3\")+16*(ORÇAMENTO.Nivel=\"Nível 4\")+32*(ORÇAMENTO.Nivel=\"Serviço\"),2),0,1,2,3,4,\"S\")","v":"S"},{"$f":"IF(OR(C316=\"s\",C316=0),OFFSET(B316,-1,0),C316)","v":3},{"$f":"IF(OFFSET(C316,-1,0)=\"L\",1,IF(OFFSET(C316,-1,0)=1,2,IF(OR(A316=\"s\",A316=0),\"S\",IF(AND(OFFSET(C316,-1,0)=2,A316=4),3,IF(AND(OR(OFFSET(C316,-1,0)=\"s\",OFFSET(C316,-1,0)=0),A316<>\"s\",A316>OFFSET(B316,-1,0)),OFFSET(B316,-1,0),A316)))))","v":"S"},{"$f":"IF(OR(C316=\"S\",C316=0),0,IF(ISERROR(K316),J316,SMALL(J316:K316,1)))","v":0},{"$f":"IF($C316=1,OFFSET(E316,-1,0)+1,OFFSET(E316,-1,0))","v":1},{"$f":"IF($C316=1,0,IF($C316=2,OFFSET(F316,-1,0)+1,OFFSET(F316,-1,0)))","v":17},{"$f":"IF(AND($C316<=2,$C316<>0),0,IF($C316=3,OFFSET(G316,-1,0)+1,OFFSET(G316,-1,0)))","v":4},{"$f":"IF(AND($C316<=3,$C316<>0),0,IF($C316=4,OFFSET(H316,-1,0)+1,OFFSET(H316,-1,0)))","v":0},{"$f":"IF(AND($C316<=4,$C316<>0),0,IF(AND($C316=\"S\",$W316>0),OFFSET(I316,-1,0)+1,OFFSET(I316,-1,0)))","v":0},0,0,{"$f":"IF(OR(W316>0,$C316=1),\"F\",\"\")","v":""},"Serviço",{"$f":"CHOOSE(1+LOG(1+2*(C316=1)+4*(C316=2)+8*(C316=3)+16*(C316=4)+32*(C316=\"S\"),2),\"\",\"Nível 1\",\"Nível 2\",\"Nível 3\",\"Nível 4\",\"Serviço\")","v":"Serviço"},"1.17.4.0.2.","AGETOP",261000,"PINTURA LATEX ACRILICA 2 DEMAOS C/SELADOR","m2    ",0.06,null,null,null,""]
[2,2,2,3,1,18,0,0,0,3,146,"","Nível 2","Nível 2","1.18.",null,null,"DIVERSOS","-",null,null,null,null,""]
["S",2,"S",0,1,18,0,0,0,0,0,"","Serviço","Serviço","1.18.0.0.1.","AGETOP",270501,"LIMPEZA FINAL DE OBRA - (OBRAS CIVIS)","m2    ",159.41999999999999,null,null,null,""]
["S",2,"S",0,1,18,0,0,0,0,0,"","Serviço","Serviço","1.18.0.0.2.","AGETOP",271608,"BANCADA DE GRANITO C/ESPELHO","m2    ",0.96,null,null,null,""]
[{"$f":"CHOOSE(1+LOG(1+2*(ORÇAMENTO.Nivel=\"Nível 1\")+4*(ORÇAMENTO.Nivel=\"Nível 2\")+8*(ORÇAMENTO.Nivel=\"Nível 3\")+16*(ORÇAMENTO.Nivel=\"Nível 4\")+32*(ORÇAMENTO.Nivel=\"Serviço\"),2),0,1,2,3,4,\"S\")","v":1},{"$f":"IF(OR(C320=\"s\",C320=0),OFFSET(B320,-1,0),C320)","v":1},{"$f":"IF(OFFSET(C320,-1,0)=\"L\",1,IF(OFFSET(C320,-1,0)=1,2,IF(OR(A320=\"s\",A320=0),\"S\",IF(AND(OFFSET(C320,-1,0)=2,A320=4),3,IF(AND(OR(OFFSET(C320,-1,0)=\"s\",OFFSET(C320,-1,0)=0),A320<>\"s\",A320>OFFSET(B320,-1,0)),OFFSET(B320,-1,0),A320)))))","v":1},{"$f":"IF(OR(C320=\"S\",C320=0),0,IF(ISERROR(K320),J320,SMALL(J320:K320,1)))","v":145},{"$f":"IF($C320=1,OFFSET(E320,-1,0)+1,OFFSET(E320,-1,0))","v":2},{"$f":"IF($C320=1,0,IF($C320=2,OFFSET(F320,-1,0)+1,OFFSET(F320,-1,0)))","v":0},{"$f":"IF(AND($C320<=2,$C320<>0),0,IF($C320=3,OFFSET(G320,-1,0)+1,OFFSET(G320,-1,0)))","v":0},{"$f":"IF(AND($C320<=3,$C320<>0),0,IF($C320=4,OFFSET(H320,-1,0)+1,OFFSET(H320,-1,0)))","v":0},{"$f":"IF(AND($C320<=4,$C320<>0),0,IF(AND($C320=\"S\",$W320>0),OFFSET(I320,-1,0)+1,OFFSET(I320,-1,0)))","v":0},145,{"$error":"#N/A"},{"$f":"IF(OR(W320>0,$C320=1),\"F\",\"\")","v":"F"},"Nível 1",{"$f":"CHOOSE(1+LOG(1+2*(C320=1)+4*(C320=2)+8*(C320=3)+16*(C320=4)+32*(C320=\"S\"),2),\"\",\"Nível 1\",\"Nível 2\",\"Nível 3\",\"Nível 4\",\"Serviço\")","v":"Nível 1"},"2.","AGETOP",null,"BLOCO 02 SALAS PADRÃO SEDUC 2017 - LAJE","-",null,null,null,null,""]
[2,2,2,2,2,1,0,0,0,144,2,"","Nível 2","Nível 2","2.1.","AGETOP",null,"SERVIÇOS PRELIMINARES","-",null,null,null,null,""]
["S",2,"S",0,2,1,0,0,0,0,0,"","Serviço","Serviço","2.1.0.0.1.","AGETOP",20701,"LOCAÇÃO DA OBRA, EXECUÇÃO DE GABARITO SEM REAPROVEITAMENTO, INCLUSO PINTURA (FACE INTERNA DO RIPÃO 15CM) E PIQUETE COM TESTEMUNHA","m2    ",127.26,null,null,null,""]
[2,2,2,3,2,2,0,0,0,142,3,"","Nível 2","Nível 2","2.2.","SINAPI",null,"TRANSPORTES","-",null,null,null,null,""]
["S",2,"S",0,2,2,0,0,0,0,0,"","Serviço","Serviço","2.2.0.0.1.","SINAPI",72897,"CARGA MANUAL DE ENTULHO EM CAMINHAO BASCULANTE 6 M3","M3",8.9,null,null,null,""]
["S",2,"S",0,2,2,0,0,0,0,0,"","Serviço","Serviço","2.2.0.0.2.","SINAPI",72900,"TRANSPORTE DE ENTULHO COM CAMINHAO BASCULANTE 6 M3, RODOVIA PAVIMENTADA, DMT 0,5 A 1,0 KM","M3",8.9,null,null,null,""]
[2,2,2,7,2,3,0,0,0,139,7,"","Nível 2","Nível 2","2.3.","SINAPI",null,"SERVIÇO EM TERRA","-",null,null,null,null,""]
[3,3,3,3,2,3,1,0,0,6,3,"","Nível 3","Nível 3","2.3.1.","SINAPI",null,"SPDA","-",null,null,null,null,""]
["S",3,"S",0,2,3,1,0,0,0,0,"","Serviço","Serviço","2.3.1.0.1.","SINAPI",93358,"ESCAVAÇÃO MANUAL DE VALA COM PROFUNDIDADE MENOR OU IGUAL A 1,30 M. AF_03/2016","M3",6.6,null,null,null,"Referência: AGETOP - 40101"]
["S",3,"S",0,2,3,1,0,0,0,0,"","Serviço","Serviço","2.3.1.0.2.","AGETOP",40902,"REATERRO COM APILOAMENTO","m3    ",6.6,null,null,null,""]
[3,3,3,3,2,3,2,0,0,3,37,"","Nível 3","Nível 3","2.3.2.","SINAPI",null,"OUTROS","-",null,null,null,null,""]
["S",3,"S",0,2,3,2,0,0,0,0,"","Serviço","Serviço","2.3.2.0.1.","AGETOP",41140,"REGULARIZAÇÃO DO TERRENO SEM APILOAMENTO COM TRANSPORTE MANUAL DA TERRA ESCAVADA ","m2    ",127.26,null,null,null,""]
["S",3,"S",0,2,3,2,0,0,0,0,"","Serviço","Serviço","2.3.2.0.2.","AGETOP",41002,"APILOAMENTO","m2    ",127.26,null,null,null,""]
[2,2,2,19,2,4,0,0,0,132,19,"","Nível 2","Nível 2","2.4.","SINAPI",null,"FUNDAÇÕES E SONDAGENS","-",null,null,null,null,""]
[3,3,3,10,2,4,1,0,0,{"$f":"IF(OR($C334=\"S\",$C334=0),0,MATCH(0,OFFSET($D334,1,$C334,ROW($C$465)-ROW($C334)),0))","v":18},{"$f":"IF(OR($C334=\"S\",$C334=0),0,MATCH(OFFSET($D334,0,$C334)+1,OFFSET($D334,1,$C334,ROW($C$465)-ROW($C334)),0))","v":10},"","Nível 3","Nível 3","2.4.1.","SINAPI",null,"ESTACAS E BLOCOS","-",null,null,null,null,""]
["S",3,"S",0,2,4,1,0,0,0,0,"","Serviço","Serviço","2.4.1.0.1.","SINAPI",98230,"ESTACA BROCA DE CONCRETO, DIÂMETRO DE 30 CM, PROFUNDIDADE DE ATÉ 3 M, ESCAVAÇÃO MANUAL COM TRADO CONCHA, NÃO ARMADA. AF_03/2018","M",75.5,null,null,null,"Referência: AGETOP - 50302"]
["S",3,"S",0,2,4,1,0,0,0,0,"","Serviço","Serviço","2.4.1.0.2.","SINAPI",96522,"ESCAVAÇÃO MANUAL PARA BLOCO DE COROAMENTO OU SAPATA, SEM PREVISÃO DE FÔRMA. AF_06/2017","M3",2.41,null,null,null,"Referência: AGETOP - 50901"]
["S",3,"S",0,2,4,1,0,0,0,0,"","Serviço","Serviço","2.4.1.0.3.","SINAPI",96995,"REATERRO MANUAL APILOADO COM SOQUETE. AF_10/2017","M3",0.20999999999999996,null,null,null,"Referência: AGETOP - 40902"]
["S",3,"S",0,2,4,1,0,0,0,0,"","Serviço","Serviço","2.4.1.0.4.","SINAPI",94963,"CONCRETO FCK = 15MPA, TRAÇO 1:3,4:3,5 (CIMENTO/ AREIA MÉDIA/ BRITA 1)  - PREPARO MECÂNICO COM BETONEIRA 400 L. AF_07/2016","M3",2.2000000000000002,null,null,null,""]
["S",3,"S",0,2,4,1,0,0,0,0,"","Serviço","Serviço","2.4.1.0.5.","AGETOP",51026,"LANÇAMENTO/APLICAÇÃO/ADENSAMENTO DE CONCRETO EM FUNDAÇÃO- (O.C.)","m3    ",2.2000000000000002,null,null,null,""]
["S",3,"S",0,2,4,1,0,0,0,0,"","Serviço","Serviço","2.4.1.0.6.","SINAPI",96544,"ARMAÇÃO DE BLOCO, VIGA BALDRAME OU SAPATA UTILIZANDO AÇO CA-50 DE 6,3 MM - MONTAGEM. AF_06/2017","KG",42.63,null,null,null,"Referência: AGETOP - 52003"]
["S",3,"S",0,2,4,1,0,0,0,0,"","Serviço","Serviço","2.4.1.0.7.","SINAPI",96545,"ARMAÇÃO DE BLOCO, VIGA BALDRAME OU SAPATA UTILIZANDO AÇO CA-50 DE 8 MM - MONTAGEM. AF_06/2017","KG",96.7,null,null,null,"Referência: AGETOP - 52004"]
["S",3,"S",0,2,4,1,0,0,0,0,"","Serviço","Serviço","2.4.1.0.8.","SINAPI",96546,"ARMAÇÃO DE BLOCO, VIGA BALDRAME OU SAPATA UTILIZANDO AÇO CA-50 DE 10 MM - MONTAGEM. AF_06/2017","KG",71.06,null,null,null,"Referência: AGETOP - 52005"]
["S",3,"S",0,2,4,1,0,0,0,0,"","Serviço","Serviço","2.4.1.0.9.","SINAPI",96543,"ARMAÇÃO DE BLOCO, VIGA BALDRAME E SAPATA UTILIZANDO AÇO CA-60 DE 5 MM - MONTAGEM. AF_06/2017","KG",29.99,null,null,null,"Referência: AGETOP - 52014"]
[3,3,3,8,2,4,2,0,0,8,23,"","Nível 3","Nível 3","2.4.2.","SINAPI",null,"VIGAS BALDRAMES","-",null,null,null,null,""]
["S",3,"S",0,2,4,2,0,0,{"$f":"IF(OR($C345=\"S\",$C345=0),0,MATCH(0,OFFSET($D345,1,$C345,ROW($C$465)-ROW($C345)),0))","v":0},{"$f":"IF(OR($C345=\"S\",$C345=0),0,MATCH(OFFSET($D345,0,$C345)+1,OFFSET($D345,1,$C345,ROW($C$465)-ROW($C345)),0))","v":0},"","Serviço","Serviço","2.4.2.0.1.","SINAPI",96527,"ESCAVAÇÃO MANUAL DE VALA PARA VIGA BALDRAME, COM PREVISÃO DE FÔRMA. AF_06/2017","M3",0.6,null,null,null,"Referência: AGETOP - 40101"]
["S",3,"S",0,2,4,2,0,0,0,0,"","Serviço","Serviço","2.4.2.0.2.","SINAPI",96995,"REATERRO MANUAL APILOADO COM SOQUETE. AF_10/2017","M3",2.4,null,null,null,"Referência: AGETOP - 40902"]
["S",3,"S",0,2,4,2,0,0,0,0,"","Serviço","Serviço","2.4.2.0.3.","AGETOP",60191,"FORMA DE TABUA CINTA BALDRAME U=8 VEZES","m2    ",42.79,null,null,null,""]
["S",3,"S",0,2,4,2,0,0,0,0,"","Serviço","Serviço","2.4.2.0.4.","SINAPI",94963,"CONCRETO FCK = 15MPA, TRAÇO 1:3,4:3,5 (CIMENTO/ AREIA MÉDIA/ BRITA 1)  - PREPARO MECÂNICO COM BETONEIRA 400 L. AF_07/2016","M3",3,null,null,null,""]
["S",3,"S",0,2,4,2,0,0,0,0,"","Serviço","Serviço","2.4.2.0.5.","AGETOP",51026,"LANÇAMENTO/APLICAÇÃO/ADENSAMENTO DE CONCRETO EM FUNDAÇÃO- (O.C.)","m3    ",3,null,null,null,""]
["S",3,"S",0,2,4,2,0,0,0,0,"","Serviço","Serviço","2.4.2.0.6.","SINAPI",96545,"ARMAÇÃO DE BLOCO, VIGA BALDRAME OU SAPATA UTILIZANDO AÇO CA-50 DE 8 MM - MONTAGEM. AF_06/2017","KG",123.12,null,null,null,"Referência: AGETOP - 52004"]
["S",3,"S",0,2,4,2,0,0,0,0,"","Serviço","Serviço","2.4.2.0.7.","SINAPI",96543,"ARMAÇÃO DE BLOCO, VIGA BALDRAME E SAPATA UTILIZANDO AÇO CA-60 DE 5 MM - MONTAGEM. AF_06/2017","KG",66.91,null,null,null,"Referência: AGETOP - 52014"]
[{"$f":"CHOOSE(1+LOG(1+2*(ORÇAMENTO.Nivel=\"Nível 1\")+4*(ORÇAMENTO.Nivel=\"Nível 2\")+8*(ORÇAMENTO.Nivel=\"Nível 3\")+16*(ORÇAMENTO.Nivel=\"Nível 4\")+32*(ORÇAMENTO.Nivel=\"Serviço\"),2),0,1,2,3,4,\"S\")","v":2},2,2,17,2,5,0,0,0,113,17,"","Nível 2","Nível 2","2.5.","SINAPI",null,"ESTRUTURA","-",null,null,null,null,""]
[3,3,3,6,2,5,1,0,0,16,6,"","Nível 3","Nível 3","2.5.1.","SINAPI",null,"PILARES","-",null,null,null,null,""]
["S",3,"S",0,2,5,1,0,0,0,0,"","Serviço","Serviço","2.5.1.0.1.","SINAPI",92426,"MONTAGEM E DESMONTAGEM DE FÔRMA DE PILARES RETANGULARES E ESTRUTURAS SIMILARES COM ÁREA MÉDIA DAS SEÇÕES MENOR OU IGUAL A 0,25 M², PÉ-DIREITO SIMPLES, EM CHAPA DE MADEIRA COMPENSADA RESINADA, 8 UTILIZAÇÕES. AF_12/2015","M2",27.1,null,null,null,""]
["S",3,"S",0,2,5,1,0,0,0,0,"","Serviço","Serviço","2.5.1.0.2.","SINAPI",94964,"CONCRETO FCK = 20MPA, TRAÇO 1:2,7:3 (CIMENTO/ AREIA MÉDIA/ BRITA 1)  - PREPARO MECÂNICO COM BETONEIRA 400 L. AF_07/2016","M3",1.29,null,null,null,""]
["S",3,"S",0,2,5,1,0,0,0,0,"","Serviço","Serviço","2.5.1.0.3.","SINAPI",92873,"LANÇAMENTO COM USO DE BALDES, ADENSAMENTO E ACABAMENTO DE CONCRETO EM ESTRUTURAS. AF_12/2015","M3",1.29,null,null,null,"Referência: AGETOP - 60801"]
["S",3,"S",0,2,5,1,0,0,0,0,"","Serviço","Serviço","2.5.1.0.4.","SINAPI",92778,"ARMAÇÃO DE PILAR OU VIGA DE UMA ESTRUTURA CONVENCIONAL DE CONCRETO ARMADO EM UMA EDIFICAÇÃO TÉRREA OU SOBRADO UTILIZANDO AÇO CA-50 DE 10,0 MM - MONTAGEM. AF_12/2015","KG",77.62,null,null,null,"Referência: AGETOP - 60305"]
["S",3,"S",0,2,5,1,0,0,0,0,"","Serviço","Serviço","2.5.1.0.5.","SINAPI",92775,"ARMAÇÃO DE PILAR OU VIGA DE UMA ESTRUTURA CONVENCIONAL DE CONCRETO ARMADO EM UMA EDIFICAÇÃO TÉRREA OU SOBRADO UTILIZANDO AÇO CA-60 DE 5,0 MM - MONTAGEM. AF_12/2015","KG",35.36,null,null,null,"Referência: AGETOP - 60314"]
[3,3,3,8,2,5,2,0,0,10,8,"","Nível 3","Nível 3","2.5.2.","SINAPI",null,"VIGAS DE COBERTURA","-",null,null,null,null,""]
["S",3,"S",0,2,5,2,0,0,0,0,"","Serviço","Serviço","2.5.2.0.1.","SINAPI",92464,"MONTAGEM E DESMONTAGEM DE FÔRMA DE VIGA, ESCORAMENTO METÁLICO, PÉ-DIREITO SIMPLES, EM CHAPA DE MADEIRA RESINADA, 8 UTILIZAÇÕES. AF_12/2015","M2",37.729999999999997,null,null,null,"Referência: AGETOP - 60209"]
["S",3,"S",0,2,5,2,0,0,0,0,"","Serviço","Serviço","2.5.2.0.2.","SINAPI",94964,"CONCRETO FCK = 20MPA, TRAÇO 1:2,7:3 (CIMENTO/ AREIA MÉDIA/ BRITA 1)  - PREPARO MECÂNICO COM BETONEIRA 400 L. AF_07/2016","M3",2.14,null,null,null,""]
["S",3,"S",0,2,5,2,0,0,0,0,"","Serviço","Serviço","2.5.2.0.3.","SINAPI",92873,"LANÇAMENTO COM USO DE BALDES, ADENSAMENTO E ACABAMENTO DE CONCRETO EM ESTRUTURAS. AF_12/2015","M3",2.14,null,null,null,"Referência: AGETOP - 60801"]
["S",3,"S",0,2,5,2,0,0,0,0,"","Serviço","Serviço","2.5.2.0.4.","SINAPI",92777,"ARMAÇÃO DE PILAR OU VIGA DE UMA ESTRUTURA CONVENCIONAL DE CONCRETO ARMADO EM UMA EDIFICAÇÃO TÉRREA OU SOBRADO UTILIZANDO AÇO CA-50 DE 8,0 MM - MONTAGEM. AF_12/2015","KG",5.84,null,null,null,"Referência: AGETOP - 60304"]
["S",3,"S",0,2,5,2,0,0,0,0,"","Serviço","Serviço","2.5.2.0.5.","SINAPI",92778,"ARMAÇÃO DE PILAR OU VIGA DE UMA ESTRUTURA CONVENCIONAL DE CONCRETO ARMADO EM UMA EDIFICAÇÃO TÉRREA OU SOBRADO UTILIZANDO AÇO CA-50 DE 10,0 MM - MONTAGEM. AF_12/2015","KG",26.59,null,null,null,"Referência: AGETOP - 60305"]
["S",3,"S",0,2,5,2,0,0,0,0,"","Serviço","Serviço","2.5.2.0.6.","SINAPI",92779,"ARMAÇÃO DE PILAR OU VIGA DE UMA ESTRUTURA CONVENCIONAL DE CONCRETO ARMADO EM UMA EDIFICAÇÃO TÉRREA OU SOBRADO UTILIZANDO AÇO CA-50 DE 12,5 MM - MONTAGEM. AF_12/2015","KG",231.7,null,null,null,""]
["S",3,"S",0,2,5,2,0,0,0,0,"","Serviço","Serviço","2.5.2.0.7.","SINAPI",92775,"ARMAÇÃO DE PILAR OU VIGA DE UMA ESTRUTURA CONVENCIONAL DE CONCRETO ARMADO EM UMA EDIFICAÇÃO TÉRREA OU SOBRADO UTILIZANDO AÇO CA-60 DE 5,0 MM - MONTAGEM. AF_12/2015","KG",56.29,null,null,null,"Referência: AGETOP - 60314"]
[3,3,3,2,2,5,3,0,0,2,{"$error":"#N/A"},"","Nível 3","Nível 3","2.5.3.","SINAPI",null,"LAJE","-",null,null,null,null,""]
["S",3,"S",0,2,5,3,0,0,0,0,"","Serviço","Serviço","2.5.3.0.1.","SINAPI","74202/1","LAJE PRE-MOLDADA P/FORRO, SOBRECARGA 100KG/M2, VAOS ATE 3,50M/E=8CM, C/LAJOTAS E CAP.C/CONC FCK=20MPA, 3CM, INTER-EIXO 38CM, C/ESCORAMENTO (REAPR.3X) E FERRAGEM NEGATIVA","M2",97.3,null,null,null,""]
[2,2,2,48,2,6,0,0,0,96,48,"","Nível 2","Nível 2","2.6.","SINAPI",null,"INSTALAÇÕES ELÉTRICAS","-",null,null,null,null,""]
[3,3,3,32,2,6,1,0,0,47,32,"","Nível 3","Nível 3","2.6.1.","SINAPI",null,"INST. ELÉTRICAS","-",null,null,null,null,""]
["S",3,"S",0,2,6,1,0,0,0,0,"","Serviço","Serviço","2.6.1.0.1.","AGETOP",70351,"BRACADEIRA METALICA TIPO \"U\" DIAM. 3/4\"","Un    ",50,null,null,null,""]
["S",3,"S",0,2,6,1,0,0,0,0,"","Serviço","Serviço","2.6.1.0.2.","AGETOP",70352,"BRACADEIRA METALICA TIPO \"U\" DIAM. 1\"","Un    ",10,null,null,null,""]
["S",3,"S",0,2,6,1,0,0,0,0,"","Serviço","Serviço","2.6.1.0.3.","AGETOP",70421,"BUCHA E ARRUELA METALICA DIAM. 3/4\"","PR    ",2,null,null,null,""]
["S",3,"S",0,2,6,1,0,0,0,0,"","Serviço","Serviço","2.6.1.0.4.","AGETOP",70422,"BUCHA E ARRUELA METALICA DIAM. 1\"","PR    ",2,null,null,null,""]
["S",3,"S",0,2,6,1,0,0,0,0,"","Serviço","Serviço","2.6.1.0.5.","SINAPI",92980,"CABO DE COBRE FLEXÍVEL ISOLADO, 10 MM², ANTI-CHAMA 0,6/1,0 KV, PARA DISTRIBUIÇÃO - FORNECIMENTO E INSTALAÇÃO. AF_12/2015","M",1,null,null,null,""]
["S",3,"S",0,2,6,1,0,0,0,0,"","Serviço","Serviço","2.6.1.0.6.","AGETOP",70561,"CABO ISOLADO PP 3 X 2,5 MM2","M     ",60,null,null,null,""]
["S",3,"S",0,2,6,1,0,0,0,0,"","Serviço","Serviço","2.6.1.0.7.","SINAPI",91926,"CABO DE COBRE FLEXÍVEL ISOLADO, 2,5 MM², ANTI-CHAMA 450/750 V, PARA CIRCUITOS TERMINAIS - FORNECIMENTO E INSTALAÇÃO. AF_12/2015","M",230,null,null,null,"Referência: AGETOP - 70563"]
["S",3,"S",0,2,6,1,0,0,0,0,"","Serviço","Serviço","2.6.1.0.8.","SINAPI",91928,"CABO DE COBRE FLEXÍVEL ISOLADO, 4 MM², ANTI-CHAMA 450/750 V, PARA CIRCUITOS TERMINAIS - FORNECIMENTO E INSTALAÇÃO. AF_12/2015","M",190,null,null,null,"Referência: AGETOP - 70564"]
["S",3,"S",0,2,6,1,0,0,0,0,"","Serviço","Serviço","2.6.1.0.9.","SINAPI",91937,"CAIXA OCTOGONAL 3\" X 3\", PVC, INSTALADA EM LAJE - FORNECIMENTO E INSTALAÇÃO. AF_12/2015","UN",15,null,null,null,""]
["S",3,"S",0,2,6,1,0,0,0,0,"","Serviço","Serviço","2.6.1.0.10.","SINAPI",92868,"CAIXA RETANGULAR 4\" X 2\" MÉDIA (1,30 M DO PISO), METÁLICA, INSTALADA EM PAREDE - FORNECIMENTO E INSTALAÇÃO. AF_12/2015","UN",12,null,null,null,"Referência: AGETOP - 70691"]
["S",3,"S",0,2,6,1,0,0,0,0,"","Serviço","Serviço","2.6.1.0.11.","AGETOP",70924,"CONDULETE DE PVC - CAIXA COM 5 ENTRADAS ","un    ",10,null,null,null,""]
["S",3,"S",0,2,6,1,0,0,0,0,"","Serviço","Serviço","2.6.1.0.12.","SINAPI",91902,"CURVA 90 GRAUS PARA ELETRODUTO, PVC, ROSCÁVEL, DN 25 MM (3/4\"), PARA CIRCUITOS TERMINAIS, INSTALADA EM LAJE - FORNECIMENTO E INSTALAÇÃO. AF_12/2015","UN",4,null,null,null,"Referência: AGETOP - 71141"]
["S",3,"S",0,2,6,1,0,0,0,0,"","Serviço","Serviço","2.6.1.0.13.","SINAPI",91905,"CURVA 90 GRAUS PARA ELETRODUTO, PVC, ROSCÁVEL, DN 32 MM (1\"), PARA CIRCUITOS TERMINAIS, INSTALADA EM LAJE - FORNECIMENTO E INSTALAÇÃO. AF_12/2015","UN",4,null,null,null,"Referência: AGETOP - 71142"]
[{"$f":"CHOOSE(1+LOG(1+2*(ORÇAMENTO.Nivel=\"Nível 1\")+4*(ORÇAMENTO.Nivel=\"Nível 2\")+8*(ORÇAMENTO.Nivel=\"Nível 3\")+16*(ORÇAMENTO.Nivel=\"Nível 4\")+32*(ORÇAMENTO.Nivel=\"Serviço\"),2),0,1,2,3,4,\"S\")","v":"S"},{"$f":"IF(OR(C384=\"s\",C384=0),OFFSET(B384,-1,0),C384)","v":3},{"$f":"IF(OFFSET(C384,-1,0)=\"L\",1,IF(OFFSET(C384,-1,0)=1,2,IF(OR(A384=\"s\",A384=0),\"S\",IF(AND(OFFSET(C384,-1,0)=2,A384=4),3,IF(AND(OR(OFFSET(C384,-1,0)=\"s\",OFFSET(C384,-1,0)=0),A384<>\"s\",A384>OFFSET(B384,-1,0)),OFFSET(B384,-1,0),A384)))))","v":"S"},{"$f":"IF(OR(C384=\"S\",C384=0),0,IF(ISERROR(K384),J384,SMALL(J384:K384,1)))","v":0},{"$f":"IF($C384=1,OFFSET(E384,-1,0)+1,OFFSET(E384,-1,0))","v":2},{"$f":"IF($C384=1,0,IF($C384=2,OFFSET(F384,-1,0)+1,OFFSET(F384,-1,0)))","v":6},{"$f":"IF(AND($C384<=2,$C384<>0),0,IF($C384=3,OFFSET(G384,-1,0)+1,OFFSET(G384,-1,0)))","v":1},{"$f":"IF(AND($C384<=3,$C384<>0),0,IF($C384=4,OFFSET(H384,-1,0)+1,OFFSET(H384,-1,0)))","v":0},{"$f":"IF(AND($C384<=4,$C384<>0),0,IF(AND($C384=\"S\",$W384>0),OFFSET(I384,-1,0)+1,OFFSET(I384,-1,0)))","v":0},0,0,{"$f":"IF(OR(W384>0,$C384=1),\"F\",\"\")","v":""},"Serviço",{"$f":"CHOOSE(1+LOG(1+2*(C384=1)+4*(C384=2)+8*(C384=3)+16*(C384=4)+32*(C384=\"S\"),2),\"\",\"Nível 1\",\"Nível 2\",\"Nível 3\",\"Nível 4\",\"Serviço\")","v":"Serviço"},"2.6.1.0.14.","SINAPI",93653,"DISJUNTOR MONOPOLAR TIPO DIN, CORRENTE NOMINAL DE 10A - FORNECIMENTO E INSTALAÇÃO. AF_04/2016","UN",3,null,null,null,""]
["S",3,"S",0,2,6,1,0,0,0,0,"","Serviço","Serviço","2.6.1.0.15.","SINAPI",93654,"DISJUNTOR MONOPOLAR TIPO DIN, CORRENTE NOMINAL DE 16A - FORNECIMENTO E INSTALAÇÃO. AF_04/2016","UN",2,null,null,null,""]
["S",3,"S",0,2,6,1,0,0,0,0,"","Serviço","Serviço","2.6.1.0.16.","SINAPI",93656,"DISJUNTOR MONOPOLAR TIPO DIN, CORRENTE NOMINAL DE 25A - FORNECIMENTO E INSTALAÇÃO. AF_04/2016","UN",4,null,null,null,""]
["S",3,"S",0,2,6,1,0,0,0,0,"","Serviço","Serviço","2.6.1.0.17.","SINAPI",93671,"DISJUNTOR TRIPOLAR TIPO DIN, CORRENTE NOMINAL DE 32A - FORNECIMENTO E INSTALAÇÃO. AF_04/2016","UN",1,null,null,null,"Referência: AGETOP - 71173"]
["S",3,"S",0,2,6,1,0,0,0,0,"","Serviço","Serviço","2.6.1.0.18.","AGETOP",71184,"DISPOSITIVO DE PROTEÇÃO CONTRA SURTOS (D.P.S.) 275V DE 8 A 40KA","Un    ",3,null,null,null,""]
["S",3,"S",0,2,6,1,0,0,0,0,"","Serviço","Serviço","2.6.1.0.19.","SINAPI",91844,"ELETRODUTO FLEXÍVEL CORRUGADO, PVC, DN 25 MM (3/4\"), PARA CIRCUITOS TERMINAIS, INSTALADO EM LAJE - FORNECIMENTO E INSTALAÇÃO. AF_12/2015","M",100,null,null,null,""]
["S",3,"S",0,2,6,1,0,0,0,0,"","Serviço","Serviço","2.6.1.0.20.","SINAPI",91846,"ELETRODUTO FLEXÍVEL CORRUGADO, PVC, DN 32 MM (1\"), PARA CIRCUITOS TERMINAIS, INSTALADO EM LAJE - FORNECIMENTO E INSTALAÇÃO. AF_12/2015","M",10,null,null,null,""]
["S",3,"S",0,2,6,1,0,0,0,0,"","Serviço","Serviço","2.6.1.0.21.","SINAPI",91871,"ELETRODUTO RÍGIDO ROSCÁVEL, PVC, DN 25 MM (3/4\"), PARA CIRCUITOS TERMINAIS, INSTALADO EM PAREDE - FORNECIMENTO E INSTALAÇÃO. AF_12/2015","M",20,null,null,null,"Referência: AGETOP - 71201"]
["S",3,"S",0,2,6,1,0,0,0,0,"","Serviço","Serviço","2.6.1.0.22.","SINAPI",91872,"ELETRODUTO RÍGIDO ROSCÁVEL, PVC, DN 32 MM (1\"), PARA CIRCUITOS TERMINAIS, INSTALADO EM PAREDE - FORNECIMENTO E INSTALAÇÃO. AF_12/2015","M",20,null,null,null,"Referência: AGETOP - 71202"]
["S",3,"S",0,2,6,1,0,0,0,0,"","Serviço","Serviço","2.6.1.0.23.","SINAPI",91953,"INTERRUPTOR SIMPLES (1 MÓDULO), 10A/250V, INCLUINDO SUPORTE E PLACA - FORNECIMENTO E INSTALAÇÃO. AF_12/2015","UN",3,null,null,null,"Referência: AGETOP - 71440"]
["S",3,"S",0,2,6,1,0,0,0,0,"","Serviço","Serviço","2.6.1.0.24.","COMPOSIÇÃO","COMP 387_SEE","LÂMPADA LED TUBULAR 18W ","UN ",30,null,null,null,""]
["S",3,"S",0,2,6,1,0,0,0,0,"","Serviço","Serviço","2.6.1.0.25.","SINAPI",97585,"LUMINÁRIA TIPO CALHA, DE SOBREPOR, COM 2 LÂMPADAS TUBULARES DE 18 W - FORNECIMENTO E INSTALAÇÃO. AF_11/2017","UN",15,null,null,null,""]
["S",3,"S",0,2,6,1,0,0,0,0,"","Serviço","Serviço","2.6.1.0.26.","SINAPI",91884,"LUVA PARA ELETRODUTO, PVC, ROSCÁVEL, DN 25 MM (3/4\"), PARA CIRCUITOS TERMINAIS, INSTALADA EM PAREDE - FORNECIMENTO E INSTALAÇÃO. AF_12/2015","UN",50,null,null,null,"Referência: AGETOP - 71741"]
["S",3,"S",0,2,6,1,0,0,0,0,"","Serviço","Serviço","2.6.1.0.27.","SINAPI",91885,"LUVA PARA ELETRODUTO, PVC, ROSCÁVEL, DN 32 MM (1\"), PARA CIRCUITOS TERMINAIS, INSTALADA EM PAREDE - FORNECIMENTO E INSTALAÇÃO. AF_12/2015","UN",5,null,null,null,"Referência: AGETOP - 71742"]
["S",3,"S",0,2,6,1,0,0,0,0,"","Serviço","Serviço","2.6.1.0.28.","AGETOP",72170,"QUADRO DE DISTRIBUIÇÃO DE EMBUTIR EM PVC CB 12E - 80A","Un    ",1,null,null,null,""]
["S",3,"S",0,2,6,1,0,0,0,0,"","Serviço","Serviço","2.6.1.0.29.","AGETOP",72385,"TAMPA CEGA PARA CONDULETE DE PVC","Un    ",10,null,null,null,""]
["S",3,"S",0,2,6,1,0,0,0,0,"","Serviço","Serviço","2.6.1.0.30.","SINAPI",92000,"TOMADA BAIXA DE EMBUTIR (1 MÓDULO), 2P+T 10 A, INCLUINDO SUPORTE E PLACA - FORNECIMENTO E INSTALAÇÃO. AF_12/2015","UN",5,null,null,null,"Referência: AGETOP - 72578"]
["S",3,"S",0,2,6,1,0,0,0,0,"","Serviço","Serviço","2.6.1.0.31.","SINAPI",91993,"TOMADA ALTA DE EMBUTIR (1 MÓDULO), 2P+T 20 A, INCLUINDO SUPORTE E PLACA - FORNECIMENTO E INSTALAÇÃO. AF_12/2015","UN",4,null,null,null,"Referência: AGETOP - 72585"]
[3,3,3,15,2,6,2,0,0,15,{"$error":"#N/A"},"","Nível 3","Nível 3","2.6.2.","SINAPI",null,"SPDA","-",null,null,null,null,""]
["S",3,"S",0,2,6,2,0,0,0,0,"","Serviço","Serviço","2.6.2.0.1.","COMPOSIÇÃO","COMP 034_SEE","TERMINAL AÉREO SPDA 30CM Fo Go DIAM. 5/16\" COM SUPORTE","UN ",10,null,null,null,""]
["S",3,"S",0,2,6,2,0,0,0,0,"","Serviço","Serviço","2.6.2.0.2.","COMPOSIÇÃO","COMP 036_SEE","PRESILHA LATÃO 16/35MM 5MM+PARAF FENDA ","UN ",110,null,null,null,""]
["S",3,"S",0,2,6,2,0,0,0,0,"","Serviço","Serviço","2.6.2.0.3.","SINAPI",93203,"FIXAÇÃO (ENCUNHAMENTO) DE ALVENARIA DE VEDAÇÃO COM ESPUMA DE POLIURETANO EXPANSIVA. AF_03/2016","M",1,null,null,null,""]
["S",3,"S",0,2,6,2,0,0,0,0,"","Serviço","Serviço","2.6.2.0.4.","AGETOP",71035,"CONECTOR TIPO PARAFUSO FENDIDO 35 MM2","Un    ",15,null,null,null,""]
["S",3,"S",0,2,6,2,0,0,0,0,"","Serviço","Serviço","2.6.2.0.5.","AGETOP",70543,"CABO DE COBRE NÚ No. 35 MM2","M     ",82,null,null,null,""]
["S",3,"S",0,2,6,2,0,0,0,0,"","Serviço","Serviço","2.6.2.0.6.","AGETOP",70544,"CABO DE COBRE NÚ No. 50 MM2","M     ",60,null,null,null,""]
["S",3,"S",0,2,6,2,0,0,{"$f":"IF(OR($C409=\"S\",$C409=0),0,MATCH(0,OFFSET($D409,1,$C409,ROW($C$465)-ROW($C409)),0))","v":0},{"$f":"IF(OR($C409=\"S\",$C409=0),0,MATCH(OFFSET($D409,0,$C409)+1,OFFSET($D409,1,$C409,ROW($C$465)-ROW($C409)),0))","v":0},"","Serviço","Serviço","2.6.2.0.7.","SINAPI",91872,"ELETRODUTO RÍGIDO ROSCÁVEL, PVC, DN 32 MM (1\"), PARA CIRCUITOS TERMINAIS, INSTALADO EM PAREDE - FORNECIMENTO E INSTALAÇÃO. AF_12/2015","M",14.52,null,null,null,"Referência: AGETOP - 71202"]
["S",3,"S",0,2,6,2,0,0,0,0,"","Serviço","Serviço","2.6.2.0.8.","AGETOP",70372,"BRACADEIRA METALICA TIPO \"D\" DIAM. 1\"","Un    ",7.26,null,null,null,""]
["S",3,"S",0,2,6,2,0,0,0,0,"","Serviço","Serviço","2.6.2.0.9.","SINAPI",96985,"HASTE DE ATERRAMENTO 5/8  PARA SPDA - FORNECIMENTO E INSTALAÇÃO. AF_12/2017","UN",6,null,null,null,""]
["S",3,"S",0,2,6,2,0,0,0,0,"","Serviço","Serviço","2.6.2.0.10.","SINAPI",98111,"CAIXA DE INSPEÇÃO PARA ATERRAMENTO, CIRCULAR, EM POLIETILENO, DIÂMETRO INTERNO = 0,3 M. AF_05/2018","UN",1,null,null,null,""]
["S",3,"S",0,2,6,2,0,0,0,0,"","Serviço","Serviço","2.6.2.0.11.","AGETOP",70255,"ATERRAMENTO - SOLDA EXOTÉRMICA - CARTUCHO 90 G","un    ",6,null,null,null,""]
["S",3,"S",0,2,6,2,0,0,0,0,"","Serviço","Serviço","2.6.2.0.12.","COMPOSIÇÃO","COMP 039_SEE","MOLDE GRAF CGT 5/8 50MM C","UN ",1,null,null,null,""]
["S",3,"S",0,2,6,2,0,0,0,0,"","Serviço","Serviço","2.6.2.0.13.","COMPOSIÇÃO","COMP 550_SEE","ALIC P/MOLDE C-84","UN ",1,null,null,null,""]
[{"$f":"CHOOSE(1+LOG(1+2*(ORÇAMENTO.Nivel=\"Nível 1\")+4*(ORÇAMENTO.Nivel=\"Nível 2\")+8*(ORÇAMENTO.Nivel=\"Nível 3\")+16*(ORÇAMENTO.Nivel=\"Nível 4\")+32*(ORÇAMENTO.Nivel=\"Serviço\"),2),0,1,2,3,4,\"S\")","v":"S"},3,"S",0,2,6,2,0,0,0,0,"","Serviço","Serviço","2.6.2.0.14.","COMPOSIÇÃO","COMP 048_SEE","HASTE ROSQUEADA \"TIRANTE\" 3/8\"","M",6,null,null,null,""]
[2,2,2,8,2,7,0,0,0,48,8,"","Nível 2","Nível 2","2.7.","SINAPI",null,"INSTALAÇÕES ESPECIAIS","-",null,null,null,null,""]
[3,3,3,7,2,7,1,0,0,7,{"$error":"#N/A"},"","Nível 3","Nível 3","2.7.1.","SINAPI",null,"INSTALAÇÕES DE INCENDIO","-",null,null,null,null,""]
["S",3,"S",0,2,7,1,0,0,0,0,"","Serviço","Serviço","2.7.1.0.1.","AGETOP",85006,"EXTINTOR MULTI USO EM PO A B C (6 KG) - CAPACIDADE EXTINTORA 3A 20BC","un    ",1,null,null,null,""]
["S",3,"S",0,2,7,1,0,0,0,0,"","Serviço","Serviço","2.7.1.0.2.","SINAPI",97599,"LUMINÁRIA DE EMERGÊNCIA - FORNECIMENTO E INSTALAÇÃO. AF_11/2017","UN",2,null,null,null,""]
["S",3,"S",0,2,7,1,0,0,0,0,"","Serviço","Serviço","2.7.1.0.3.","COMPOSIÇÃO","COMP 024_SEE","SINALIZADOR FOTOLUMINESCENTE PARA EXTINTOR","UN ",1,null,null,null,""]
["S",3,"S",0,2,7,1,0,0,0,0,"","Serviço","Serviço","2.7.1.0.4.","COMPOSIÇÃO","COMP 025_SEE","SINALIZADOR FOTOLUMINESCENTE DE EMERGÊNCIA","UN ",4,null,null,null,""]
["S",3,"S",0,2,7,1,0,0,0,0,"","Serviço","Serviço","2.7.1.0.5.","COMPOSIÇÃO","COMP 277_SEE","MARCAÇÃO NO PISO - 1X1 M PARA EXTINTOR","M2",1,null,null,null,""]
["S",3,"S",0,2,7,1,0,0,0,0,"","Serviço","Serviço","2.7.1.0.6.","COMPOSIÇÃO","COMP 412_SEE","PLACA DE SINALIZAÇÃO EM PVC COD 17 - (316X158) MENSAGEM \"SAÍDA\"","UN ",2,null,null,null,""]
[2,2,2,3,2,8,0,0,0,40,3,"","Nível 2","Nível 2","2.8.",null,null,"ALVENARIAS E DIVISÓRIAS","-",null,null,null,null,""]
["S",2,"S",0,2,8,0,0,0,0,0,"","Serviço","Serviço","2.8.0.0.1.","SINAPI",87503,"ALVENARIA DE VEDAÇÃO DE BLOCOS CERÂMICOS FURADOS NA HORIZONTAL DE 9X19X19CM (ESPESSURA 9CM) DE PAREDES COM ÁREA LÍQUIDA MAIOR OU IGUAL A 6M² SEM VÃOS E ARGAMASSA DE ASSENTAMENTO COM PREPARO EM BETONEIRA. AF_06/2014","M2",137.08000000000001,null,null,null,"Referência: AGETOP - 100201"]
["S",2,"S",0,2,8,0,0,0,0,0,"","Serviço","Serviço","2.8.0.0.2.","SINAPI",93201,"FIXAÇÃO (ENCUNHAMENTO) DE ALVENARIA DE VEDAÇÃO COM ARGAMASSA APLICADA COM COLHER. AF_03/2016","M",49.2,null,null,null,""]
[2,2,2,2,2,9,0,0,0,37,2,"","Nível 2","Nível 2","2.9.",null,null,"IMPERMEABILIZAÇÃO","-",null,null,null,null,""]
["S",2,"S",0,2,9,0,0,0,0,0,"","Serviço","Serviço","2.9.0.0.1.","SINAPI",98557,"IMPERMEABILIZAÇÃO DE SUPERFÍCIE COM EMULSÃO ASFÁLTICA, 2 DEMÃOS AF_06/2018","M2",52.77,null,null,null,""]
[2,2,2,2,2,10,0,0,0,35,2,"","Nível 2","Nível 2","2.10.",null,null,"ESTRUTURAS METÁLICAS","-",null,null,null,null,""]
["S",2,"S",0,2,10,0,0,0,0,0,"","Serviço","Serviço","2.10.0.0.1.","AGETOP",150103,"ESTRUTURA METÁLICA CONVENCIONAL EM AÇO DO TIPO USI SAC-300 COM FUNDO ANTICORROSIVO","Kg    ",2688.02,null,null,null,""]
[2,2,2,4,2,11,0,0,0,33,4,"","Nível 2","Nível 2","2.11.",null,null,"COBERTURAS","-",null,null,null,null,""]
["S",{"$f":"IF(OR(C433=\"s\",C433=0),OFFSET(B433,-1,0),C433)","v":2},{"$f":"IF(OFFSET(C433,-1,0)=\"L\",1,IF(OFFSET(C433,-1,0)=1,2,IF(OR(A433=\"s\",A433=0),\"S\",IF(AND(OFFSET(C433,-1,0)=2,A433=4),3,IF(AND(OR(OFFSET(C433,-1,0)=\"s\",OFFSET(C433,-1,0)=0),A433<>\"s\",A433>OFFSET(B433,-1,0)),OFFSET(B433,-1,0),A433)))))","v":"S"},{"$f":"IF(OR(C433=\"S\",C433=0),0,IF(ISERROR(K433),J433,SMALL(J433:K433,1)))","v":0},{"$f":"IF($C433=1,OFFSET(E433,-1,0)+1,OFFSET(E433,-1,0))","v":2},{"$f":"IF($C433=1,0,IF($C433=2,OFFSET(F433,-1,0)+1,OFFSET(F433,-1,0)))","v":11},{"$f":"IF(AND($C433<=2,$C433<>0),0,IF($C433=3,OFFSET(G433,-1,0)+1,OFFSET(G433,-1,0)))","v":0},{"$f":"IF(AND($C433<=3,$C433<>0),0,IF($C433=4,OFFSET(H433,-1,0)+1,OFFSET(H433,-1,0)))","v":0},{"$f":"IF(AND($C433<=4,$C433<>0),0,IF(AND($C433=\"S\",$W433>0),OFFSET(I433,-1,0)+1,OFFSET(I433,-1,0)))","v":0},0,0,{"$f":"IF(OR(W433>0,$C433=1),\"F\",\"\")","v":""},"Serviço",{"$f":"CHOOSE(1+LOG(1+2*(C433=1)+4*(C433=2)+8*(C433=3)+16*(C433=4)+32*(C433=\"S\"),2),\"\",\"Nível 1\",\"Nível 2\",\"Nível 3\",\"Nível 4\",\"Serviço\")","v":"Serviço"},"2.11.0.0.1.","AGETOP",160100,"COBERTURA COM TELHA AMERICANA  RESINADA COR VERMELHA","m2    ",162.19,null,null,null,""]
["S",2,"S",0,2,11,0,0,0,0,0,"","Serviço","Serviço","2.11.0.0.2.","SINAPI",94221,"CUMEEIRA PARA TELHA CERÂMICA EMBOÇADA COM ARGAMASSA TRAÇO 1:2:9 (CIMENTO, CAL E AREIA) PARA TELHADOS COM ATÉ 2 ÁGUAS, INCLUSO TRANSPORTE VERTICAL. AF_07/2019","M",16.55,null,null,null,""]
["S",2,"S",0,2,11,0,0,0,0,0,"","Serviço","Serviço","2.11.0.0.3.","SINAPI",94224,"EMBOÇAMENTO COM ARGAMASSA TRAÇO 1:2:9 (CIMENTO, CAL E AREIA). AF_07/2019","M",52.7,null,null,null,"Referência: AGETOP - 160403"]
[2,2,2,4,2,12,0,0,0,29,4,"","Nível 2","Nível 2","2.12.",null,null,"ESQUADRIAS METÁLICAS","-",null,null,null,null,""]
["S",2,"S",0,2,12,0,0,0,0,0,"","Serviço","Serviço","2.12.0.0.1.","SINAPI",94562,"JANELA DE AÇO DE CORRER, 4 FOLHAS, FIXAÇÃO COM ARGAMASSA, SEM VIDROS, PADRONIZADA. AF_07/2016","M2",9.6,null,null,null,"Referência: AGETOP - 180401"]
["S",2,"S",0,2,12,0,0,0,0,0,"","Serviço","Serviço","2.12.0.0.2.","SINAPI",94559,"JANELA DE AÇO BASCULANTE, FIXAÇÃO COM ARGAMASSA, SEM VIDROS, PADRONIZADA. AF_07/2016","M2",4.8,null,null,null,"Referência: AGETOP - 180404"]
["S",2,"S",0,2,12,0,0,0,0,0,"","Serviço","Serviço","2.12.0.0.3.","AGETOP",180501,"PORTA DE ABRIR EM CHAPA PF-1 C/FERRAGENS","m2    ",3.36,null,null,null,""]
[2,2,2,2,2,13,0,0,0,25,2,"","Nível 2","Nível 2","2.13.",null,null,"VIDROS","-",null,null,null,null,""]
["S",2,"S",0,2,13,0,0,0,0,0,"","Serviço","Serviço","2.13.0.0.1.","SINAPI",72117,"VIDRO LISO COMUM TRANSPARENTE, ESPESSURA 4MM","M2",14.399999999999999,null,null,null,"Referência: AGETOP - 190102"]
[2,2,2,3,2,14,0,0,0,23,3,"","Nível 2","Nível 2","2.14.",null,null,"REVESTIMENTO DE PAREDE","-",null,null,null,null,""]
["S",2,"S",0,2,14,0,0,0,0,0,"","Serviço","Serviço","2.14.0.0.1.","SINAPI",87879,"CHAPISCO APLICADO EM ALVENARIAS E ESTRUTURAS DE CONCRETO INTERNAS, COM COLHER DE PEDREIRO.  ARGAMASSA TRAÇO 1:3 COM PREPARO EM BETONEIRA 400L. AF_06/2014","M2",274.18,null,null,null,""]
["S",2,"S",0,2,14,0,0,0,0,0,"","Serviço","Serviço","2.14.0.0.2.","SINAPI",87548,"MASSA ÚNICA, PARA RECEBIMENTO DE PINTURA, EM ARGAMASSA TRAÇO 1:2:8, PREPARO MANUAL, APLICADA MANUALMENTE EM FACES INTERNAS DE PAREDES, ESPESSURA DE 10MM, COM EXECUÇÃO DE TALISCAS. AF_06/2014","M2",274.18,null,null,null,"Referência: AGETOP - 200500"]
[2,2,2,2,2,15,0,0,0,20,2,"","Nível 2","Nível 2","2.15.",null,null,"FORROS","-",null,null,null,null,""]
["S",2,"S",0,2,15,0,0,0,0,0,"","Serviço","Serviço","2.15.0.0.1.","SINAPI",87414,"APLICAÇÃO MANUAL DE GESSO DESEMPENADO (SEM TALISCAS) EM TETO DE AMBIENTES DE ÁREA MAIOR QUE 10M², ESPESSURA DE 1,0CM. AF_06/2014","M2",97.02,null,null,null,"Referência: AGETOP - 210515"]
[2,2,2,5,2,16,0,0,0,18,5,"","Nível 2","Nível 2","2.16.","SINAPI",null,"REVESTIMENTO DE PISO","-",null,null,null,null,""]
[{"$f":"CHOOSE(1+LOG(1+2*(ORÇAMENTO.Nivel=\"Nível 1\")+4*(ORÇAMENTO.Nivel=\"Nível 2\")+8*(ORÇAMENTO.Nivel=\"Nível 3\")+16*(ORÇAMENTO.Nivel=\"Nível 4\")+32*(ORÇAMENTO.Nivel=\"Serviço\"),2),0,1,2,3,4,\"S\")","v":"S"},{"$f":"IF(OR(C448=\"s\",C448=0),OFFSET(B448,-1,0),C448)","v":2},{"$f":"IF(OFFSET(C448,-1,0)=\"L\",1,IF(OFFSET(C448,-1,0)=1,2,IF(OR(A448=\"s\",A448=0),\"S\",IF(AND(OFFSET(C448,-1,0)=2,A448=4),3,IF(AND(OR(OFFSET(C448,-1,0)=\"s\",OFFSET(C448,-1,0)=0),A448<>\"s\",A448>OFFSET(B448,-1,0)),OFFSET(B448,-1,0),A448)))))","v":"S"},{"$f":"IF(OR(C448=\"S\",C448=0),0,IF(ISERROR(K448),J448,SMALL(J448:K448,1)))","v":0},{"$f":"IF($C448=1,OFFSET(E448,-1,0)+1,OFFSET(E448,-1,0))","v":2},{"$f":"IF($C448=1,0,IF($C448=2,OFFSET(F448,-1,0)+1,OFFSET(F448,-1,0)))","v":16},{"$f":"IF(AND($C448<=2,$C448<>0),0,IF($C448=3,OFFSET(G448,-1,0)+1,OFFSET(G448,-1,0)))","v":0},{"$f":"IF(AND($C448<=3,$C448<>0),0,IF($C448=4,OFFSET(H448,-1,0)+1,OFFSET(H448,-1,0)))","v":0},{"$f":"IF(AND($C448<=4,$C448<>0),0,IF(AND($C448=\"S\",$W448>0),OFFSET(I448,-1,0)+1,OFFSET(I448,-1,0)))","v":0},0,0,{"$f":"IF(OR(W448>0,$C448=1),\"F\",\"\")","v":""},"Serviço",{"$f":"CHOOSE(1+LOG(1+2*(C448=1)+4*(C448=2)+8*(C448=3)+16*(C448=4)+32*(C448=\"S\"),2),\"\",\"Nível 1\",\"Nível 2\",\"Nível 3\",\"Nível 4\",\"Serviço\")","v":"Serviço"},"2.16.0.0.1.","SINAPI",95240,"LASTRO DE CONCRETO MAGRO, APLICADO EM PISOS OU RADIERS, ESPESSURA DE 3 CM. AF_07/2016","M2",119.74,null,null,null,""]
["S",2,"S",0,2,16,0,0,0,0,0,"","Serviço","Serviço","2.16.0.0.2.","SINAPI",94992,"EXECUÇÃO DE PASSEIO (CALÇADA) OU PISO DE CONCRETO COM CONCRETO MOLDADO IN LOCO, FEITO EM OBRA, ACABAMENTO CONVENCIONAL, ESPESSURA 6 CM, ARMADO. AF_07/2016","M2",29.7,null,null,null,""]
["S",2,"S",0,2,16,0,0,0,0,0,"","Serviço","Serviço","2.16.0.0.3.","SINAPI",84191,"PISO EM GRANILITE, MARMORITE OU GRANITINA ESPESSURA 8 MM, INCLUSO JUNTAS DE DILATACAO PLASTICAS","M2",124.44,null,null,null,"Referência: AGETOP - 221101"]
["S",2,"S",0,2,16,0,0,0,0,0,"","Serviço","Serviço","2.16.0.0.4.","AGETOP",221104,"RASPAGEM E APLICAÇÃO RESINA ACRÍLICA DUAS DEMÃOS","m2    ",124.44,null,null,null,""]
[2,2,2,2,2,17,0,0,0,13,2,"","Nível 2","Nível 2","2.17.","SINAPI",null,"MARCENARIA","-",null,null,null,null,""]
["S",2,"S",0,2,17,0,0,0,0,0,"","Serviço","Serviço","2.17.0.0.1.","AGETOP",240106,"BATE CARTEIRA ENVERNIZADO E ASSENT. 2,5 X 12 CM","M     ",40.64,null,null,null,""]
[2,2,2,9,2,18,0,0,0,11,9,"","Nível 2","Nível 2","2.18.","SINAPI",null,"PINTURA","-",null,null,null,null,""]
["S",2,"S",0,2,18,0,0,0,0,0,"","Serviço","Serviço","2.18.0.0.1.","AGETOP",261602,"PINT.ESMALTE/ESQUAD.FERRO C/FUNDO ANTICOR.","m2    ",162.19,null,null,null,""]
["S",2,"S",0,2,18,0,0,0,0,0,"","Serviço","Serviço","2.18.0.0.2.","SINAPI",88423,"APLICAÇÃO MANUAL DE PINTURA COM TINTA TEXTURIZADA ACRÍLICA EM PAREDES EXTERNAS DE CASAS, UMA COR. AF_06/2014","M2",50.02,null,null,null,"Referência: AGETOP - 260601"]
["S",2,"S",0,2,18,0,0,0,0,0,"","Serviço","Serviço","2.18.0.0.3.","SINAPI",88489,"APLICAÇÃO MANUAL DE PINTURA COM TINTA LÁTEX ACRÍLICA EM PAREDES, DUAS DEMÃOS. AF_06/2014","M2",104.42,null,null,null,"Referência: AGETOP - 261001"]
["S",2,"S",0,2,18,0,0,0,0,0,"","Serviço","Serviço","2.18.0.0.4.","SINAPI",88497,"APLICAÇÃO E LIXAMENTO DE MASSA LÁTEX EM PAREDES, DUAS DEMÃOS. AF_06/2014","M2",215.73000000000002,null,null,null,"Referência: AGETOP - 261300"]
["S",2,"S",0,2,18,0,0,0,0,0,"","Serviço","Serviço","2.18.0.0.5.","AGETOP",261550,"PINT.ESMALTE SINT.PAREDES - 2 DEM.C/SELADOR","m2    ",111.31,null,null,null,""]
["S",2,"S",0,2,18,0,0,0,0,0,"","Serviço","Serviço","2.18.0.0.6.","SINAPI",88496,"APLICAÇÃO E LIXAMENTO DE MASSA LÁTEX EM TETO, DUAS DEMÃOS. AF_06/2014","M2",97.02,null,null,null,"Referência: AGETOP - 261300"]
["S",2,"S",0,2,18,0,0,0,0,0,"","Serviço","Serviço","2.18.0.0.7.","SINAPI",88486,"APLICAÇÃO MANUAL DE PINTURA COM TINTA LÁTEX PVA EM TETO, DUAS DEMÃOS. AF_06/2014","M2",97.02,null,null,null,"Referência: AGETOP - 261307"]
["S",2,"S",0,2,18,0,0,0,0,0,"","Serviço","Serviço","2.18.0.0.8.","AGETOP",261602,"PINT.ESMALTE/ESQUAD.FERRO C/FUNDO ANTICOR.","m2    ",38.880000000000003,null,null,null,""]
[2,2,2,2,2,19,0,0,0,2,{"$error":"#N/A"},"","Nível 2","Nível 2","2.19.","SINAPI",null,"DIVERSOS","-",null,null,null,null,""]
["S",2,"S",0,2,19,0,0,0,0,0,"","Serviço","Serviço","2.19.0.0.1.","AGETOP",271210,"QUADRO DE GIZ EMBOÇO/PINTURA COMPLETO","m2    ",10.08,null,null,null,""]
[-1,null,-1,null,0,0,0,0,0,null,null,"F"]
[null,null,null,null,null,null,null,null,null,null,null,"F",null,null,null,null,null,"OBS: OS QUANTITATIVOS DE MATERIAIS  DAS INSTALAÇÕES HIDROSSANITÁRIAS, ELÉTRICAS E ESPECIAIS SÃO FORNECIDOS PELOS PROFISSIONAIS RESPONSÁVEIS PELOS RESPECTIVOS PROJETOS.",null,null,"VALOR TOTAL"]
[null,null,null,null,null,null,null,null,null,null,null,"F",null,null,null,null,null,null,null,null,"VALOR BDI (26,41%)"]
[null,null,null,null,null,null,null,null,null,null,null,"F",null,null,null,null,null,null,null,null,"TOTAL ORÇAMENTO"]
[null,null,null,null,null,null,null,null,null,null,null,"F"]
[null,null,null,null,null,null,null,null,null,null,null,"F",null,null,null,null,null,null,null,null,"CUSTO POR M2 ³"]
[null,null,null,null,null,null,null,null,null,null,null,"F",null,null,null,null,null,null,null,null,"MATERIAL S/ BDI"]
[null,null,null,null,null,null,null,null,null,null,null,"F",null,null,null,null,null,null,null,null,"MÃO DE OBRA S/ BDI"]
[null,null,null,null,null,null,null,null,null,null,null,"F"]
[null,null,null,null,null,null,null,null,null,null,null,"F",null,null,null,null,"(1) Conforme previsto pelo DECRETO Nº 7.983, DE 8 DE ABRIL DE 2013, os preços adotados são aqueles constantes dos sistemas de referência indicados. Justifica-se o uso dos preços destas composições de custos unitários devido ao seu valor ser menor à mediana de seus correspondentes na tabela SINAPI;"]
[null,null,null,null,null,null,null,null,null,null,null,"F",null,null,null,null,"(2) Optou-se pelo uso das composições de custos da AGETOP para itens não presentes na SINAPI;"]
[null,null,null,null,null,null,null,null,null,null,null,"F",null,null,null,null,"(3) Para itens da AGETOP, os vidros não estão inclusos nas esquadrias e já foram considerados os custos de contramarco para as esquadrias de alumínio;"]
[null,null,null,null,null,null,null,null,null,null,null,"F",null,null,null,null,"(4) Nos casos em que houver execução de granitina e omissão do item AGETOP 221102, considerou-se que o quantitativo para o rodapé, de altura igual a 7cm, foi incorporado na área de piso;"]
[null,null,null,null,null,null,null,null,null,null,null,"F",null,null,null,null,"(5) O custo unitário aproximado por metro quadrado é calculado dividindo-se o valor total do orçamento pela área total de construção."]
[null,null,null,null,null,null,null,null,null,null,null,"F"]
[null,null,null,null,null,null,null,null,null,null,null,"F"]
[]
[null,null,null,null,null,null,null,null,null,null,null,null,null,null,"SOMATÓRIO DE SERVIÇOS"]
[null,null,null,null,null,null,null,null,null,null,null,null,null,null,"ITEM","DESCRIÇÃO DOS SERVIÇOS",null,null,"PREÇO SEM BDI",null,null,"PREÇO COM BDI",null,"PARTICIPAÇÃO ( % )"]
[null,null,null,null,null,null,null,null,null,null,null,null,null,null,"a.","SERVIÇOS PRELIMINARES",null,null,{"$f":"SUMIF($R$19:$R$465,$P484,$W$19:$W$465)","v":0},null,null,{"$f":"ROUND(S484*(1+BDI.Taxa),2)","v":0},null,{"$f":"IFERROR(ROUND($V484*100/$W$468,2),0)","v":0}]
[null,null,null,null,null,null,null,null,null,null,null,null,null,null,"b.","TRANSPORTES",null,null,0,null,null,0,null,{"$f":"IFERROR(ROUND($V485*100/$W$468,2),0)","v":0}]
[null,null,null,null,null,null,null,null,null,null,null,null,null,null,"c.","SERVIÇO EM TERRA",null,null,0,null,null,0,null,0]
[null,null,null,null,null,null,null,null,null,null,null,null,null,null,"d.","FUNDAÇÕES E SONDAGENS",null,null,0,null,null,0,null,0]
[null,null,null,null,null,null,null,null,null,null,null,null,null,null,"e.","ESTRUTURA",null,null,0,null,null,0,null,0]
[null,null,null,null,null,null,null,null,null,null,null,null,null,null,"f.","INSTALAÇÕES ELÉTRICAS",null,null,0,null,null,0,null,0]
[null,null,null,null,null,null,null,null,null,null,null,null,null,null,"g.","INSTALAÇÕES HIDROSSANITÁRIAS",null,null,0,null,null,0,null,0]
[null,null,null,null,null,null,null,null,null,null,null,null,null,null,"h","INSTALAÇÕES ESPECIAIS",null,null,0,null,null,0,null,0]
[null,null,null,null,null,null,null,null,null,null,null,null,null,null,"i.","ALVENARIAS E DIVISÓRIAS",null,null,0,null,null,0,null,0]
[null,null,null,null,null,null,null,null,null,null,null,null,null,null,"j.","ALVENARIA AUTO-PORTANTE",null,null,0,null,null,0,null,0]
[null,null,null,null,null,null,null,null,null,null,null,null,null,null,"k.","IMPERMEABILIZAÇÃO",null,null,0,null,null,0,null,0]
[null,null,null,null,null,null,null,null,null,null,null,null,null,null,"l.","ISOLAMENTO TÉRMICO E ACÚSTICO",null,null,0,null,null,0,null,0]
[null,null,null,null,null,null,null,null,null,null,null,null,null,null,"m.","ESTRUTURA DE MADEIRA",null,null,0,null,null,0,null,0]
[null,null,null,null,null,null,null,null,null,null,null,null,null,null,"n.","ESTRUTURAS METÁLICAS",null,null,0,null,null,0,null,0]
[null,null,null,null,null,null,null,null,null,null,null,null,null,null,"o.","COBERTURAS",null,null,0,null,null,0,null,0]
[null,null,null,null,null,null,null,null,null,null,null,null,null,null,"p.","ESQUADRIAS DE MADEIRA",null,null,0,null,null,0,null,0]
[null,null,null,null,null,null,null,null,null,null,null,null,null,null,"q.","ESQUADRIAS METÁLICAS",null,null,0,null,null,{"$f":"ROUND(S500*(1+BDI.Taxa),2)","v":0},null,0]
[null,null,null,null,null,null,null,null,null,null,null,null,null,null,"r.","VIDROS",null,null,0,null,null,0,null,0]
[null,null,null,null,null,null,null,null,null,null,null,null,null,null,"s.","REVESTIMENTO DE PAREDE",null,null,0,null,null,0,null,0]
[null,null,null,null,null,null,null,null,null,null,null,null,null,null,"t.","FORROS",null,null,0,null,null,0,null,0]
[null,null,null,null,null,null,null,null,null,null,null,null,null,null,"u.","REVESTIMENTO DE PISO",null,null,0,null,null,0,null,0]
[null,null,null,null,null,null,null,null,null,null,null,null,null,null,"v.","FERRAGENS",null,null,0,null,null,0,null,0]
[null,null,null,null,null,null,null,null,null,null,null,null,null,null,"w.","MARCENARIA",null,null,0,null,null,0,null,0]
[null,null,null,null,null,null,null,null,null,null,null,null,null,null,"x.","ADMINISTRAÇÃO",null,null,0,null,null,0,null,0]
[null,null,null,null,null,null,null,null,null,null,null,null,null,null,"y.","PINTURA",null,null,0,null,null,{"$f":"ROUND(S508*(1+BDI.Taxa),2)","v":0},null,0]
[null,null,null,null,null,null,null,null,null,null,null,null,null,null,"z.","DIVERSOS",null,null,0,null,null,{"$f":"IF(S509>0,IF((SUM(V484:W508)+ROUND(S509*(1+BDI.Taxa),2))<>V511,V511-SUM(V484:W508),ROUND(S509*(1+BDI.Taxa),2)),0)","v":0},null,{"$f":"IF(S509>0,IF((SUM(X484:X508)+IFERROR(ROUND($V509*100/$W$468,2),0))<>X511,X511-SUM(X484:X508),IFERROR(ROUND($V509*100/$W$468,2),0)),0)","v":0}]
[null,null,null,null,null,null,null,null,null,null,null,null,null,null,"TOTAL GERAL DO ORÇAMENTO (R$)",null,null,null,{"$f":"SUM(S484:U509)","v":0},null,null,{"$f":"SUM(V484:W509)","v":0},null,{"$f":"SUM(X484:X509)","v":0}]
[null,null,null,null,null,null,null,null,null,null,null,null,null,null,null,null,null,null,{"$f":"$W$466","v":0},null,null,{"$f":"$W$468","v":0},null,100]
[null,null,null,null,null,null,null,null,null,null,null,null,null,null,null,null,null,null,"(TOTAL SEM BDI)",null,null,"(TOTAL COM BDI)",null,"(ARRED porcentagem)"]
[null,null,null,null,null,null,null,null,null,null,null,null,null,null,null,null,null,null,{"$f":"IF(AND(S510=S511,S510>0),\"OK\",\"ERRO\")","v":"ERRO"},null,null,{"$f":"IF(AND(V510=V511,V510>0),\"OK\",\"ERRO\")","v":"ERRO"},null,{"$f":"IF(X510=100,\"OK\",\"ERRO\")","v":"ERRO"}]
[]
[]
[null,null,null,null,null,null,null,null,null,null,null,null,null,null,"RESUMO GERAL DO ORÇAMENTO"]
[null,null,null,null,null,null,null,null,null,null,null,null,null,null,"ITEM","DESCRIÇÃO DOS SERVIÇOS",null,null,"PREÇO SEM BDI",null,null,"PREÇO COM BDI",null,"PARTICIPAÇÃO ( % )"]
[null,null,null,null,null,null,null,null,null,null,null,null,null,null,"1.",{"$f":"IFERROR(VLOOKUP(O518,$O$19:$W$465,4,FALSE),\"\")","v":"REFORMA E AMPLIAÇÃO"},null,null,{"$f":"IF(P519=\"\",$S$539-SUM(OFFSET($S$517:S517,0,0,COUNTA($S$517:S517),1)),SUMIF($R$19:$R$465,$P518,$W$19:$W$465))","v":0},null,null,{"$f":"IF(P519=\"\",$V$539-SUM(OFFSET($V$517:V517,0,0,COUNTA($V$517:V517),1)),ROUND(S518*(1+BDI.Taxa),2))","v":0},null,{"$f":"IF(P519=\"\",$X$539-SUM(OFFSET($X$517:X517,0,0,COUNTA($X$517:X517),1)),ROUND(V518*100/ORÇAMENTO.Totalorçamento,2))","v":{"$error":"#DIV/0!"}}]
[null,null,null,null,null,null,null,null,null,null,null,null,null,null,"2.","BLOCO 02 SALAS PADRÃO SEDUC 2017 - LAJE",null,null,{"$f":"IF(P520=\"\",$S$539-SUM(OFFSET($S$517:S518,0,0,COUNTA($S$517:S518),1)),SUMIF($R$19:$R$465,$P519,$W$19:$W$465))","v":0},null,null,{"$f":"IF(P520=\"\",$V$539-SUM(OFFSET($V$517:V518,0,0,COUNTA($V$517:V518),1)),ROUND(S519*(1+BDI.Taxa),2))","v":0},null,{"$f":"IF(P520=\"\",$X$539-SUM(OFFSET($X$517:X518,0,0,COUNTA($X$517:X518),1)),ROUND(V519*100/ORÇAMENTO.Totalorçamento,2))","v":{"$error":"#DIV/0!"}}]
[null,null,null,null,null,null,null,null,null,null,null,null,null,null,"3.","",null,null,{"$f":"IF(P521=\"\",$S$539-SUM(OFFSET($S$517:S519,0,0,COUNTA($S$517:S519),1)),SUMIF($R$19:$R$465,$P520,$W$19:$W$465))","v":0},null,null,{"$f":"IF(P521=\"\",$V$539-SUM(OFFSET($V$517:V519,0,0,COUNTA($V$517:V519),1)),ROUND(S520*(1+BDI.Taxa),2))","v":0},null,{"$f":"IF(P521=\"\",$X$539-SUM(OFFSET($X$517:X519,0,0,COUNTA($X$517:X519),1)),ROUND(V520*100/ORÇAMENTO.Totalorçamento,2))","v":{"$error":"#DIV/0!"}}]
[null,null,null,null,null,null,null,null,null,null,null,null,null,null,"4.","",null,null,{"$f":"IF(P522=\"\",$S$539-SUM(OFFSET($S$517:S520,0,0,COUNTA($S$517:S520),1)),SUMIF($R$19:$R$465,$P521,$W$19:$W$465))","v":0},null,null,{"$f":"IF(P522=\"\",$V$539-SUM(OFFSET($V$517:V520,0,0,COUNTA($V$517:V520),1)),ROUND(S521*(1+BDI.Taxa),2))","v":0},null,{"$f":"IF(P522=\"\",$X$539-SUM(OFFSET($X$517:X520,0,0,COUNTA($X$517:X520),1)),ROUND(V521*100/ORÇAMENTO.Totalorçamento,2))","v":{"$error":"#DIV/0!"}}]
[null,null,null,null,null,null,null,null,null,null,null,null,null,null,"5.","",null,null,{"$f":"IF(P523=\"\",$S$539-SUM(OFFSET($S$517:S521,0,0,COUNTA($S$517:S521),1)),SUMIF($R$19:$R$465,$P522,$W$19:$W$465))","v":0},null,null,{"$f":"IF(P523=\"\",$V$539-SUM(OFFSET($V$517:V521,0,0,COUNTA($V$517:V521),1)),ROUND(S522*(1+BDI.Taxa),2))","v":0},null,{"$f":"IF(P523=\"\",$X$539-SUM(OFFSET($X$517:X521,0,0,COUNTA($X$517:X521),1)),ROUND(V522*100/ORÇAMENTO.Totalorçamento,2))","v":{"$error":"#DIV/0!"}}]
[null,null,null,null,null,null,null,null,null,null,null,null,null,null,"6.","",null,null,{"$f":"IF(P524=\"\",$S$539-SUM(OFFSET($S$517:S522,0,0,COUNTA($S$517:S522),1)),SUMIF($R$19:$R$465,$P523,$W$19:$W$465))","v":0},null,null,{"$f":"IF(P524=\"\",$V$539-SUM(OFFSET($V$517:V522,0,0,COUNTA($V$517:V522),1)),ROUND(S523*(1+BDI.Taxa),2))","v":0},null,{"$f":"IF(P524=\"\",$X$539-SUM(OFFSET($X$517:X522,0,0,COUNTA($X$517:X522),1)),ROUND(V523*100/ORÇAMENTO.Totalorçamento,2))","v":{"$error":"#DIV/0!"}}]
[null,null,null,null,null,null,null,null,null,null,null,null,null,null,"7.","",null,null,{"$f":"IF(P525=\"\",$S$539-SUM(OFFSET($S$517:S523,0,0,COUNTA($S$517:S523),1)),SUMIF($R$19:$R$465,$P524,$W$19:$W$465))","v":0},null,null,{"$f":"IF(P525=\"\",$V$539-SUM(OFFSET($V$517:V523,0,0,COUNTA($V$517:V523),1)),ROUND(S524*(1+BDI.Taxa),2))","v":0},null,{"$f":"IF(P525=\"\",$X$539-SUM(OFFSET($X$517:X523,0,0,COUNTA($X$517:X523),1)),ROUND(V524*100/ORÇAMENTO.Totalorçamento,2))","v":{"$error":"#DIV/0!"}}]
[null,null,null,null,null,null,null,null,null,null,null,null,null,null,"8.","",null,null,{"$f":"IF(P526=\"\",$S$539-SUM(OFFSET($S$517:S524,0,0,COUNTA($S$517:S524),1)),SUMIF($R$19:$R$465,$P525,$W$19:$W$465))","v":0},null,null,{"$f":"IF(P526=\"\",$V$539-SUM(OFFSET($V$517:V524,0,0,COUNTA($V$517:V524),1)),ROUND(S525*(1+BDI.Taxa),2))","v":0},null,{"$f":"IF(P526=\"\",$X$539-SUM(OFFSET($X$517:X524,0,0,COUNTA($X$517:X524),1)),ROUND(V525*100/ORÇAMENTO.Totalorçamento,2))","v":{"$error":"#DIV/0!"}}]
[null,null,null,null,null,null,null,null,null,null,null,null,null,null,"9.","",null,null,{"$f":"IF(P527=\"\",$S$539-SUM(OFFSET($S$517:S525,0,0,COUNTA($S$517:S525),1)),SUMIF($R$19:$R$465,$P526,$W$19:$W$465))","v":0},null,null,{"$f":"IF(P527=\"\",$V$539-SUM(OFFSET($V$517:V525,0,0,COUNTA($V$517:V525),1)),ROUND(S526*(1+BDI.Taxa),2))","v":0},null,{"$f":"IF(P527=\"\",$X$539-SUM(OFFSET($X$517:X525,0,0,COUNTA($X$517:X525),1)),ROUND(V526*100/ORÇAMENTO.Totalorçamento,2))","v":{"$error":"#DIV/0!"}}]
[null,null,null,null,null,null,null,null,null,null,null,null,null,null,"10.","",null,null,{"$f":"IF(P528=\"\",$S$539-SUM(OFFSET($S$517:S526,0,0,COUNTA($S$517:S526),1)),SUMIF($R$19:$R$465,$P527,$W$19:$W$465))","v":0},null,null,{"$f":"IF(P528=\"\",$V$539-SUM(OFFSET($V$517:V526,0,0,COUNTA($V$517:V526),1)),ROUND(S527*(1+BDI.Taxa),2))","v":0},null,{"$f":"IF(P528=\"\",$X$539-SUM(OFFSET($X$517:X526,0,0,COUNTA($X$517:X526),1)),ROUND(V527*100/ORÇAMENTO.Totalorçamento,2))","v":{"$error":"#DIV/0!"}}]
[null,null,null,null,null,null,null,null,null,null,null,null,null,null,"11.","",null,null,{"$f":"IF(P529=\"\",$S$539-SUM(OFFSET($S$517:S527,0,0,COUNTA($S$517:S527),1)),SUMIF($R$19:$R$465,$P528,$W$19:$W$465))","v":0},null,null,{"$f":"IF(P529=\"\",$V$539-SUM(OFFSET($V$517:V527,0,0,COUNTA($V$517:V527),1)),ROUND(S528*(1+BDI.Taxa),2))","v":0},null,{"$f":"IF(P529=\"\",$X$539-SUM(OFFSET($X$517:X527,0,0,COUNTA($X$517:X527),1)),ROUND(V528*100/ORÇAMENTO.Totalorçamento,2))","v":{"$error":"#DIV/0!"}}]
[null,null,null,null,null,null,null,null,null,null,null,null,null,null,"12.","",null,null,{"$f":"IF(P530=\"\",$S$539-SUM(OFFSET($S$517:S528,0,0,COUNTA($S$517:S528),1)),SUMIF($R$19:$R$465,$P529,$W$19:$W$465))","v":0},null,null,{"$f":"IF(P530=\"\",$V$539-SUM(OFFSET($V$517:V528,0,0,COUNTA($V$517:V528),1)),ROUND(S529*(1+BDI.Taxa),2))","v":0},null,{"$f":"IF(P530=\"\",$X$539-SUM(OFFSET($X$517:X528,0,0,COUNTA($X$517:X528),1)),ROUND(V529*100/ORÇAMENTO.Totalorçamento,2))","v":{"$error":"#DIV/0!"}}]
[null,null,null,null,null,null,null,null,null,null,null,null,null,null,"13.","",null,null,{"$f":"IF(P531=\"\",$S$539-SUM(OFFSET($S$517:S529,0,0,COUNTA($S$517:S529),1)),SUMIF($R$19:$R$465,$P530,$W$19:$W$465))","v":0},null,null,{"$f":"IF(P531=\"\",$V$539-SUM(OFFSET($V$517:V529,0,0,COUNTA($V$517:V529),1)),ROUND(S530*(1+BDI.Taxa),2))","v":0},null,{"$f":"IF(P531=\"\",$X$539-SUM(OFFSET($X$517:X529,0,0,COUNTA($X$517:X529),1)),ROUND(V530*100/ORÇAMENTO.Totalorçamento,2))","v":{"$error":"#DIV/0!"}}]
[null,null,null,null,null,null,null,null,null,null,null,null,null,null,"14.","",null,null,{"$f":"IF(P532=\"\",$S$539-SUM(OFFSET($S$517:S530,0,0,COUNTA($S$517:S530),1)),SUMIF($R$19:$R$465,$P531,$W$19:$W$465))","v":0},null,null,{"$f":"IF(P532=\"\",$V$539-SUM(OFFSET($V$517:V530,0,0,COUNTA($V$517:V530),1)),ROUND(S531*(1+BDI.Taxa),2))","v":0},null,{"$f":"IF(P532=\"\",$X$539-SUM(OFFSET($X$517:X530,0,0,COUNTA($X$517:X530),1)),ROUND(V531*100/ORÇAMENTO.Totalorçamento,2))","v":{"$error":"#DIV/0!"}}]
[null,null,null,null,null,null,null,null,null,null,null,null,null,null,"15.","",null,null,{"$f":"IF(P533=\"\",$S$539-SUM(OFFSET($S$517:S531,0,0,COUNTA($S$517:S531),1)),SUMIF($R$19:$R$465,$P532,$W$19:$W$465))","v":0},null,null,{"$f":"IF(P533=\"\",$V$539-SUM(OFFSET($V$517:V531,0,0,COUNTA($V$517:V531),1)),ROUND(S532*(1+BDI.Taxa),2))","v":0},null,{"$f":"IF(P533=\"\",$X$539-SUM(OFFSET($X$517:X531,0,0,COUNTA($X$517:X531),1)),ROUND(V532*100/ORÇAMENTO.Totalorçamento,2))","v":{"$error":"#DIV/0!"}}]
[null,null,null,null,null,null,null,null,null,null,null,null,null,null,"16.","",null,null,{"$f":"IF(P534=\"\",$S$539-SUM(OFFSET($S$517:S532,0,0,COUNTA($S$517:S532),1)),SUMIF($R$19:$R$465,$P533,$W$19:$W$465))","v":0},null,null,{"$f":"IF(P534=\"\",$V$539-SUM(OFFSET($V$517:V532,0,0,COUNTA($V$517:V532),1)),ROUND(S533*(1+BDI.Taxa),2))","v":0},null,{"$f":"IF(P534=\"\",$X$539-SUM(OFFSET($X$517:X532,0,0,COUNTA($X$517:X532),1)),ROUND(V533*100/ORÇAMENTO.Totalorçamento,2))","v":{"$error":"#DIV/0!"}}]
[null,null,null,null,null,null,null,null,null,null,null,null,null,null,"17.","",null,null,{"$f":"IF(P535=\"\",$S$539-SUM(OFFSET($S$517:S533,0,0,COUNTA($S$517:S533),1)),SUMIF($R$19:$R$465,$P534,$W$19:$W$465))","v":0},null,null,{"$f":"IF(P535=\"\",$V$539-SUM(OFFSET($V$517:V533,0,0,COUNTA($V$517:V533),1)),ROUND(S534*(1+BDI.Taxa),2))","v":0},null,{"$f":"IF(P535=\"\",$X$539-SUM(OFFSET($X$517:X533,0,0,COUNTA($X$517:X533),1)),ROUND(V534*100/ORÇAMENTO.Totalorçamento,2))","v":{"$error":"#DIV/0!"}}]
[null,null,null,null,null,null,null,null,null,null,null,null,null,null,"18.","",null,null,{"$f":"IF(P536=\"\",$S$539-SUM(OFFSET($S$517:S534,0,0,COUNTA($S$517:S534),1)),SUMIF($R$19:$R$465,$P535,$W$19:$W$465))","v":0},null,null,{"$f":"IF(P536=\"\",$V$539-SUM(OFFSET($V$517:V534,0,0,COUNTA($V$517:V534),1)),ROUND(S535*(1+BDI.Taxa),2))","v":0},null,{"$f":"IF(P536=\"\",$X$539-SUM(OFFSET($X$517:X534,0,0,COUNTA($X$517:X534),1)),ROUND(V535*100/ORÇAMENTO.Totalorçamento,2))","v":{"$error":"#DIV/0!"}}]
[null,null,null,null,null,null,null,null,null,null,null,null,null,null,"19.","",null,null,{"$f":"IF(P537=\"\",$S$539-SUM(OFFSET($S$517:S535,0,0,COUNTA($S$517:S535),1)),SUMIF($R$19:$R$465,$P536,$W$19:$W$465))","v":0},null,null,{"$f":"IF(P537=\"\",$V$539-SUM(OFFSET($V$517:V535,0,0,COUNTA($V$517:V535),1)),ROUND(S536*(1+BDI.Taxa),2))","v":0},null,{"$f":"IF(P537=\"\",$X$539-SUM(OFFSET($X$517:X535,0,0,COUNTA($X$517:X535),1)),ROUND(V536*100/ORÇAMENTO.Totalorçamento,2))","v":{"$error":"#DIV/0!"}}]
[null,null,null,null,null,null,null,null,null,null,null,null,null,null,"20.","",null,null,{"$f":"IF(P538=\"\",$S$539-SUM(OFFSET($S$517:S536,0,0,COUNTA($S$517:S536),1)),SUMIF($R$19:$R$465,$P537,$W$19:$W$465))","v":0},null,null,{"$f":"IF(P538=\"\",$V$539-SUM(OFFSET($V$517:V536,0,0,COUNTA($V$517:V536),1)),ROUND(S537*(1+BDI.Taxa),2))","v":0},null,{"$f":"IF(P538=\"\",$X$539-SUM(OFFSET($X$517:X536,0,0,COUNTA($X$517:X536),1)),ROUND(V537*100/ORÇAMENTO.Totalorçamento,2))","v":{"$error":"#DIV/0!"}}]
[null,null,null,null,null,null,null,null,null,null,null,null,null,null,"TOTAL GERAL DO ORÇAMENTO (R$)",null,null,null,{"$f":"SUM(S518:U537)","v":0},null,null,{"$f":"SUM(V518:W537)","v":0},null,{"$f":"SUM(X518:X537)","v":{"$error":"#DIV/0!"}}]
[null,null,null,null,null,null,null,null,null,null,null,null,null,null,null,null,null,null,{"$f":"$W$466","v":0},null,null,{"$f":"$W$468","v":0},null,100]
[null,null,null,null,null,null,null,null,null,null,null,null,null,null,null,null,null,null,"(TOTAL SEM BDI)",null,null,"(TOTAL COM BDI)",null,"(ARRED porcentagem)"]
[null,null,null,null,null,null,null,null,null,null,null,null,null,null,null,null,null,null,{"$f":"IF(AND(S538=S539,S538>0),\"OK\",\"ERRO\")","v":"ERRO"},null,null,{"$f":"IF(AND(V538=V539,V538>0),\"OK\",\"ERRO\")","v":"ERRO"},null,{"$f":"IF(AND(X538=100,S518<>0),\"OK\",\"ERRO\")","v":{"$error":"#DIV/0!"}}]

{"sheet":"Resumo ","index":1,"n_rows":39,"n_cols":9,"rows_kept":39,"cut":false,"hidden":false,"merged":[[42,3,42,7],[11,1,11,2],[12,1,12,2],[15,2,15,3],[16,2,16,3],[14,1,14,8],[17,2,17,3],[23,2,23,3],[18,2,18,3],[19,2,19,3],[20,2,20,3],[41,3,41,7],[24,2,24,3],[26,2,26,3],[27,2,27,3],[38,1,38,8],[1,1,1,8],[2,6,2,8],[3,6,3,8],[4,1,4,8],[5,6,5,8],[6,6,6,8],[7,1,7,8],[8,6,8,8],[9,6,9,8],[13,1,13,8],[0,1,0,8],[36,1,36,5],[2,1,2,5],[3,1,3,5],[5,1,5,5],[6,1,6,5],[8,1,8,5],[9,1,9,5],[11,3,11,5],[12,3,12,5],[10,1,10,8],[11,6,11,8],[12,6,12,8],[25,2,25,3],[21,2,21,3],[22,2,22,3],[13,0,14,0],[34,2,34,3],[35,2,35,3],[31,2,31,3],[32,2,32,3],[33,2,33,3],[28,2,28,3],[29,2,29,3],[30,2,30,3]]}
[]
[]
[null,"UNIDADE ESCOLAR",null,null,null,null,"CÓDIGO INEP"]
[null,{"$f":"Orçamento!$O$4","v":"ESCOLA ESTADUAL DOM EMANUEL"},null,null,null,null,{"$f":"Orçamento!V4","v":52063321}]
[]
[null,"OBRA",null,null,null,null,"CIDADE"]
[null,{"$f":"Orçamento!$O$7","v":"REFORMA E AMPLIAÇÃO"},null,null,null,null,{"$f":"Orçamento!$V$7","v":"SILVÂNIA"}]
[]
[null,"ENDEREÇO",null,null,null,null,"CRE"]
[null,{"$f":"Orçamento!$R$10","v":" AV DOM BOSCO , CENTRO , CEP: 7518-000"},null,null,null,null,{"$f":"Orçamento!$O$10","v":"CRE-SILVÂNIA"}]
[]
[null,"REFERÊNCIA",null,"DATA",null,null,"ÁREA TOTAL CONSTRUÍDA (M²)"]
[null,{"$f":"CONCATENATE(\"AGETOP E SINAPI - \",Orçamento!$T$10)","v":"AGETOP E SINAPI - DESONERADA"},null,{"$f":"Orçamento!$S$7","v":"2020-05-08"},null,null,{"$f":"Orçamento!$V$13","v":946.99}]
["FILTRO"]
[null,"RESUMO GERAL DO ORÇAMENTO"]
["↓","ITEM","DESCRIÇÃO DOS SERVIÇOS",null,"UNID","QUANT","PREÇO SEM BDI","PREÇO COM BDI","PARTICIP. (%)"]
[{"$f":"IF(H17>0,\"F\",\"\")","v":""},"1.",{"$f":"Orçamento!$P518","v":"REFORMA E AMPLIAÇÃO"},null,{"$f":"IF(C17<>\"\",\"UN\",\"\")","v":"UN"},{"$f":"IF(C17<>\"\",1,\"\")","v":1},{"$f":"IFERROR(Orçamento!S518,\"-\")","v":0},{"$f":"IFERROR(Orçamento!V518,\"\")","v":0},{"$f":"Orçamento!X518","v":{"$error":"#DIV/0!"}}]
[{"$f":"IF(H18>0,\"F\",\"\")","v":""},"2.",{"$f":"Orçamento!$P519","v":"BLOCO 02 SALAS PADRÃO SEDUC 2017 - LAJE"},null,{"$f":"IF(C18<>\"\",\"UN\",\"\")","v":"UN"},{"$f":"IF(C18<>\"\",1,\"\")","v":1},{"$f":"IFERROR(Orçamento!S519,\"-\")","v":0},{"$f":"IFERROR(Orçamento!V519,\"\")","v":0},{"$f":"Orçamento!X519","v":{"$error":"#DIV/0!"}}]
[{"$f":"IF(H19>0,\"F\",\"\")","v":""},"3.",{"$f":"Orçamento!$P520","v":""},null,"","",{"$f":"IFERROR(Orçamento!S520,\"-\")","v":0},{"$f":"IFERROR(Orçamento!V520,\"\")","v":0},{"$f":"Orçamento!X520","v":{"$error":"#DIV/0!"}}]
["","4.",{"$f":"Orçamento!$P521","v":""},null,"","",{"$f":"IFERROR(Orçamento!S521,\"-\")","v":0},{"$f":"IFERROR(Orçamento!V521,\"\")","v":0},{"$f":"Orçamento!X521","v":{"$error":"#DIV/0!"}}]
["","5.",{"$f":"Orçamento!$P522","v":""},null,"","",{"$f":"IFERROR(Orçamento!S522,\"-\")","v":0},{"$f":"IFERROR(Orçamento!V522,\"\")","v":0},{"$f":"Orçamento!X522","v":{"$error":"#DIV/0!"}}]
["","6.",{"$f":"Orçamento!$P523","v":""},null,"","",{"$f":"IFERROR(Orçamento!S523,\"-\")","v":0},{"$f":"IFERROR(Orçamento!V523,\"\")","v":0},{"$f":"Orçamento!X523","v":{"$error":"#DIV/0!"}}]
["","7.",{"$f":"Orçamento!$P524","v":""},null,"","",{"$f":"IFERROR(Orçamento!S524,\"-\")","v":0},{"$f":"IFERROR(Orçamento!V524,\"\")","v":0},{"$f":"Orçamento!X524","v":{"$error":"#DIV/0!"}}]
["","8.",{"$f":"Orçamento!$P525","v":""},null,"","",{"$f":"IFERROR(Orçamento!S525,\"-\")","v":0},{"$f":"IFERROR(Orçamento!V525,\"\")","v":0},{"$f":"Orçamento!X525","v":{"$error":"#DIV/0!"}}]
["","9.",{"$f":"Orçamento!$P526","v":""},null,"","",{"$f":"IFERROR(Orçamento!S526,\"-\")","v":0},{"$f":"IFERROR(Orçamento!V526,\"\")","v":0},{"$f":"Orçamento!X526","v":{"$error":"#DIV/0!"}}]
["","10.",{"$f":"Orçamento!$P527","v":""},null,"","",{"$f":"IFERROR(Orçamento!S527,\"-\")","v":0},{"$f":"IFERROR(Orçamento!V527,\"\")","v":0},{"$f":"Orçamento!X527","v":{"$error":"#DIV/0!"}}]
["","11.",{"$f":"Orçamento!$P528","v":""},null,"","",{"$f":"IFERROR(Orçamento!S528,\"-\")","v":0},{"$f":"IFERROR(Orçamento!V528,\"\")","v":0},{"$f":"Orçamento!X528","v":{"$error":"#DIV/0!"}}]
["","12.",{"$f":"Orçamento!$P529","v":""},null,"","",{"$f":"IFERROR(Orçamento!S529,\"-\")","v":0},{"$f":"IFERROR(Orçamento!V529,\"\")","v":0},{"$f":"Orçamento!X529","v":{"$error":"#DIV/0!"}}]
["","13.",{"$f":"Orçamento!$P530","v":""},null,"","",{"$f":"IFERROR(Orçamento!S530,\"-\")","v":0},{"$f":"IFERROR(Orçamento!V530,\"\")","v":0},{"$f":"Orçamento!X530","v":{"$error":"#DIV/0!"}}]
["","14.",{"$f":"Orçamento!$P531","v":""},null,"","",{"$f":"IFERROR(Orçamento!S531,\"-\")","v":0},{"$f":"IFERROR(Orçamento!V531,\"\")","v":0},{"$f":"Orçamento!X531","v":{"$error":"#DIV/0!"}}]
["","15.",{"$f":"Orçamento!$P532","v":""},null,"","",{"$f":"IFERROR(Orçamento!S532,\"-\")","v":0},{"$f":"IFERROR(Orçamento!V532,\"\")","v":0},{"$f":"Orçamento!X532","v":{"$error":"#DIV/0!"}}]
["","16.",{"$f":"Orçamento!$P533","v":""},null,"","",{"$f":"IFERROR(Orçamento!S533,\"-\")","v":0},{"$f":"IFERROR(Orçamento!V533,\"\")","v":0},{"$f":"Orçamento!X533","v":{"$error":"#DIV/0!"}}]
["","17.",{"$f":"Orçamento!$P534","v":""},null,"","",{"$f":"IFERROR(Orçamento!S534,\"-\")","v":0},{"$f":"IFERROR(Orçamento!V534,\"\")","v":0},{"$f":"Orçamento!X534","v":{"$error":"#DIV/0!"}}]
["","18.",{"$f":"Orçamento!$P535","v":""},null,"","",{"$f":"IFERROR(Orçamento!S535,\"-\")","v":0},{"$f":"IFERROR(Orçamento!V535,\"\")","v":0},{"$f":"Orçamento!X535","v":{"$error":"#DIV/0!"}}]
["","19.",{"$f":"Orçamento!$P536","v":""},null,"","",{"$f":"IFERROR(Orçamento!S536,\"-\")","v":0},{"$f":"IFERROR(Orçamento!V536,\"\")","v":0},{"$f":"Orçamento!X536","v":{"$error":"#DIV/0!"}}]
["","20.",{"$f":"Orçamento!$P537","v":""},null,"","",{"$f":"IFERROR(Orçamento!S537,\"-\")","v":0},{"$f":"IFERROR(Orçamento!V537,\"\")","v":0},{"$f":"Orçamento!X537","v":{"$error":"#DIV/0!"}}]
["F","TOTAL GERAL DO ORÇAMENTO (R$)",null,null,null,null,{"$f":"SUM(G17:G36)","v":0},{"$f":"SUM(H17:H36)","v":0},{"$f":"SUM(I17:I36)","v":{"$error":"#DIV/0!"}}]
["F"]
["F"]

{"sheet":"Somatório","index":2,"n_rows":45,"n_cols":6,"rows_kept":45,"cut":false,"hidden":false,"merged":[[0,1,0,5],[14,1,14,5],[2,1,2,3],[2,4,2,5],[3,1,3,3],[3,4,3,5],[5,1,5,3],[5,4,5,5],[6,1,6,3],[6,4,6,5],[8,1,8,3],[8,4,8,5],[1,1,1,5],[4,1,4,5],[7,1,7,5],[10,1,10,5],[9,1,9,3],[9,4,9,5],[11,1,11,2],[11,4,11,5],[12,1,12,2],[12,4,12,5],[13,0,14,0],[42,1,42,2],[44,1,44,5],[47,3,47,5],[48,3,48,5],[13,1,13,5]]}
[]
[]
[null,"UNIDADE ESCOLAR",null,null,"CÓDIGO INEP"]
[null,{"$f":"Orçamento!$O$4","v":"ESCOLA ESTADUAL DOM EMANUEL"},null,null,{"$f":"Orçamento!V4","v":52063321}]
[]
[null,"OBRA",null,null,"CIDADE"]
[null,{"$f":"Orçamento!$O$7","v":"REFORMA E AMPLIAÇÃO"},null,null,{"$f":"Orçamento!$V$7","v":"SILVÂNIA"}]
[]
[null,"ENDEREÇO",null,null,"CRE"]
[null,{"$f":"Orçamento!$R$10","v":" AV DOM BOSCO , CENTRO , CEP: 7518-000"},null,null,{"$f":"Orçamento!$O$10","v":"CRE-SILVÂNIA"}]
[]
[null,"REFERÊNCIA",null,"DATA","ÁREA TOTAL CONSTRUÍDA (M²)"]
[null,{"$f":"CONCATENATE(\"AGETOP E SINAPI - \",Orçamento!$T$10)","v":"AGETOP E SINAPI - DESONERADA"},null,{"$f":"Orçamento!$S$7","v":"2020-05-08"},{"$f":"Orçamento!$V$13","v":946.99}]
["FILTRO"]
[null,"SOMATÓRIO DE SERVIÇOS"]
["↓","ITEM","DESCRIÇÃO DOS SERVIÇOS","PREÇO SEM BDI (R$)","PREÇO COM BDI (R$)","PARTIC.  ( % )"]
[{"$f":"IF(D17>0,\"F\",\"\")","v":""},"a.",{"$f":"Orçamento!P484","v":"SERVIÇOS PRELIMINARES"},{"$f":"Orçamento!S484","v":0},{"$f":"Orçamento!V484","v":0},{"$f":"Orçamento!X484","v":0}]
[{"$f":"IF(D18>0,\"F\",\"\")","v":""},"b.",{"$f":"Orçamento!P485","v":"TRANSPORTES"},{"$f":"Orçamento!S485","v":0},{"$f":"Orçamento!V485","v":0},{"$f":"Orçamento!X485","v":0}]
["","c.",{"$f":"Orçamento!P486","v":"SERVIÇO EM TERRA"},{"$f":"Orçamento!S486","v":0},{"$f":"Orçamento!V486","v":0},{"$f":"Orçamento!X486","v":0}]
["","d.",{"$f":"Orçamento!P487","v":"FUNDAÇÕES E SONDAGENS"},{"$f":"Orçamento!S487","v":0},{"$f":"Orçamento!V487","v":0},{"$f":"Orçamento!X487","v":0}]
["","e.",{"$f":"Orçamento!P488","v":"ESTRUTURA"},{"$f":"Orçamento!S488","v":0},{"$f":"Orçamento!V488","v":0},{"$f":"Orçamento!X488","v":0}]
["","f.",{"$f":"Orçamento!P489","v":"INSTALAÇÕES ELÉTRICAS"},{"$f":"Orçamento!S489","v":0},{"$f":"Orçamento!V489","v":0},{"$f":"Orçamento!X489","v":0}]
["","g.",{"$f":"Orçamento!P490","v":"INSTALAÇÕES HIDROSSANITÁRIAS"},{"$f":"Orçamento!S490","v":0},{"$f":"Orçamento!V490","v":0},{"$f":"Orçamento!X490","v":0}]
["","h.",{"$f":"Orçamento!P491","v":"INSTALAÇÕES ESPECIAIS"},{"$f":"Orçamento!S491","v":0},{"$f":"Orçamento!V491","v":0},{"$f":"Orçamento!X491","v":0}]
["","i.",{"$f":"Orçamento!P492","v":"ALVENARIAS E DIVISÓRIAS"},{"$f":"Orçamento!S492","v":0},{"$f":"Orçamento!V492","v":0},{"$f":"Orçamento!X492","v":0}]
["","j.",{"$f":"Orçamento!P493","v":"ALVENARIA AUTO-PORTANTE"},{"$f":"Orçamento!S493","v":0},{"$f":"Orçamento!V493","v":0},{"$f":"Orçamento!X493","v":0}]
["","k.",{"$f":"Orçamento!P494","v":"IMPERMEABILIZAÇÃO"},{"$f":"Orçamento!S494","v":0},{"$f":"Orçamento!V494","v":0},{"$f":"Orçamento!X494","v":0}]
["","l.",{"$f":"Orçamento!P495","v":"ISOLAMENTO TÉRMICO E ACÚSTICO"},{"$f":"Orçamento!S495","v":0},{"$f":"Orçamento!V495","v":0},{"$f":"Orçamento!X495","v":0}]
["","m.",{"$f":"Orçamento!P496","v":"ESTRUTURA DE MADEIRA"},{"$f":"Orçamento!S496","v":0},{"$f":"Orçamento!V496","v":0},{"$f":"Orçamento!X496","v":0}]
["","n.",{"$f":"Orçamento!P497","v":"ESTRUTURAS METÁLICAS"},{"$f":"Orçamento!S497","v":0},{"$f":"Orçamento!V497","v":0},{"$f":"Orçamento!X497","v":0}]
["","o.",{"$f":"Orçamento!P498","v":"COBERTURAS"},{"$f":"Orçamento!S498","v":0},{"$f":"Orçamento!V498","v":0},{"$f":"Orçamento!X498","v":0}]
["","p.",{"$f":"Orçamento!P499","v":"ESQUADRIAS DE MADEIRA"},{"$f":"Orçamento!S499","v":0},{"$f":"Orçamento!V499","v":0},{"$f":"Orçamento!X499","v":0}]
["","q.",{"$f":"Orçamento!P500","v":"ESQUADRIAS METÁLICAS"},{"$f":"Orçamento!S500","v":0},{"$f":"Orçamento!V500","v":0},{"$f":"Orçamento!X500","v":0}]
["","r.",{"$f":"Orçamento!P501","v":"VIDROS"},{"$f":"Orçamento!S501","v":0},{"$f":"Orçamento!V501","v":0},{"$f":"Orçamento!X501","v":0}]
["","s.",{"$f":"Orçamento!P502","v":"REVESTIMENTO DE PAREDE"},{"$f":"Orçamento!S502","v":0},{"$f":"Orçamento!V502","v":0},{"$f":"Orçamento!X502","v":0}]
["","t.",{"$f":"Orçamento!P503","v":"FORROS"},{"$f":"Orçamento!S503","v":0},{"$f":"Orçamento!V503","v":0},{"$f":"Orçamento!X503","v":0}]
["","u.",{"$f":"Orçamento!P504","v":"REVESTIMENTO DE PISO"},{"$f":"Orçamento!S504","v":0},{"$f":"Orçamento!V504","v":0},{"$f":"Orçamento!X504","v":0}]
["","v.",{"$f":"Orçamento!P505","v":"FERRAGENS"},{"$f":"Orçamento!S505","v":0},{"$f":"Orçamento!V505","v":0},{"$f":"Orçamento!X505","v":0}]
["","w.",{"$f":"Orçamento!P506","v":"MARCENARIA"},{"$f":"Orçamento!S506","v":0},{"$f":"Orçamento!V506","v":0},{"$f":"Orçamento!X506","v":0}]
["","x.",{"$f":"Orçamento!P507","v":"ADMINISTRAÇÃO"},{"$f":"Orçamento!S507","v":0},{"$f":"Orçamento!V507","v":0},{"$f":"Orçamento!X507","v":0}]
["","y.",{"$f":"Orçamento!P508","v":"PINTURA"},{"$f":"Orçamento!S508","v":0},{"$f":"Orçamento!V508","v":0},{"$f":"Orçamento!X508","v":0}]
["","z.",{"$f":"Orçamento!P509","v":"DIVERSOS"},{"$f":"Orçamento!S509","v":0},{"$f":"Orçamento!V509","v":0},{"$f":"Orçamento!X509","v":0}]
["F","TOTAL GERAL DO ORÇAMENTO",null,{"$f":"SUM(D17:D42)","v":0},{"$f":"SUM(E17:E42)","v":0},{"$f":"SUM(F17:F42)","v":0}]
[]
[null,"(*) Para itens da AGETOP, os vidros não estão inclusos nas esquadrias e já foram considerados os custos de contramarco para as esquadrias de alumínio;"]

{"sheet":"Cronog_90_Dias","index":3,"n_rows":99,"n_cols":20,"rows_kept":99,"cut":false,"hidden":false,"merged":[[97,1,97,4],[98,1,98,17],[94,1,94,2],[94,5,94,8],[94,9,94,12],[94,13,94,16],[95,1,95,2],[95,5,95,8],[95,9,95,12],[95,13,95,16],[92,1,92,2],[92,5,92,8],[92,9,92,12],[92,13,92,16],[93,1,93,2],[93,5,93,8],[93,9,93,12],[93,13,93,16],[89,1,91,2],[89,3,91,3],[89,4,91,4],[89,5,89,8],[89,9,89,12],[89,13,89,16],[91,5,91,8],[91,9,91,12],[91,13,91,16],[86,1,88,2],[86,3,88,3],[86,4,88,4],[86,5,86,8],[86,9,86,12],[86,13,86,16],[88,5,88,8],[88,9,88,12],[88,13,88,16],[83,1,85,2],[83,3,85,3],[83,4,85,4],[83,5,83,8],[83,9,83,12],[83,13,83,16],[85,5,85,8],[85,9,85,12],[85,13,85,16],[80,1,82,2],[80,3,82,3],[80,4,82,4],[80,5,80,8],[80,9,80,12],[80,13,80,16],[82,5,82,8],[82,9,82,12],[82,13,82,16],[77,1,79,2],[77,3,79,3],[77,4,79,4],[77,5,77,8],[77,9,77,12],[77,13,77,16],[79,5,79,8],[79,9,79,12],[79,13,79,16],[74,1,76,2],[74,3,76,3],[74,4,76,4],[74,5,74,8],[74,9,74,12],[74,13,74,16],[76,5,76,8],[76,9,76,12],[76,13,76,16],[71,1,73,2],[71,3,73,3],[71,4,73,4],[71,5,71,8],[71,9,71,12],[71,13,71,16],[73,5,73,8],[73,9,73,12],[73,13,73,16],[68,1,70,2],[68,3,70,3],[68,4,70,4],[68,5,68,8],[68,9,68,12],[68,13,68,16],[70,5,70,8],[70,9,70,12],[70,13,70,16],[65,1,67,2],[65,3,67,3],[65,4,67,4],[65,5,65,8],[65,9,65,12],[65,13,65,16],[67,5,67,8],[67,9,67,12],[67,13,67,16],[62,1,64,2],[62,3,64,3],[62,4,64,4],[62,5,62,8],[62,9,62,12],[62,13,62,16],[64,5,64,8],[64,9,64,12],[64,13,64,16],[59,1,61,2],[59,3,61,3],[59,4,61,4],[59,5,59,8],[59,9,59,12],[59,13,59,16],[61,5,61,8],[61,9,61,12],[61,13,61,16],[56,1,58,2],[56,3,58,3],[56,4,58,4],[56,5,56,8],[56,9,56,12],[56,13,56,16],[58,5,58,8],[58,9,58,12],[58,13,58,16],[53,1,55,2],[53,3,55,3],[53,4,55,4],[53,5,53,8],[53,9,53,12],[53,13,53,16],[55,5,55,8],[55,9,55,12],[55,13,55,16],[50,1,52,2],[50,3,52,3],[50,4,52,4],[50,5,50,8],[50,9,50,12],[50,13,50,16],[52,5,52,8],[52,9,52,12],[52,13,52,16],[47,1,49,2],[47,3,49,3],[47,4,49,4],[47,5,47,8],[47,9,47,12],[47,13,47,16],[49,5,49,8],[49,9,49,12],[49,13,49,16],[44,1,46,2],[44,3,46,3],[44,4,46,4],[44,5,44,8],[44,9,44,12],[44,13,44,16],[46,5,46,8],[46,9,46,12],[46,13,46,16],[41,1,43,2],[41,3,43,3],[41,4,43,4],[41,5,41,8],[41,9,41,12],[41,13,41,16],[43,5,43,8],[43,9,43,12],[43,13,43,16],[38,1,40,2],[38,3,40,3],[38,4,40,4],[38,5,38,8],[38,9,38,12],[38,13,38,16],[40,5,40,8],[40,9,40,12],[40,13,40,16],[35,1,37,2],[35,3,37,3],[35,4,37,4],[35,5,35,8],[35,9,35,12],[35,13,35,16],[37,5,37,8],[37,9,37,12],[37,13,37,16],[32,1,34,2],[32,3,34,3],[32,4,34,4],[32,5,32,8],[32,9,32,12],[32,13,32,16],[34,5,34,8],[34,9,34,12],[34,13,34,16],[29,1,31,2],[29,3,31,3],[29,4,31,4],[29,5,29,8],[29,9,29,12],[29,13,29,16],[31,5,31,8],[31,9,31,12],[31,13,31,16],[26,1,28,2],[26,3,28,3],[26,4,28,4],[26,5,26,8],[26,9,26,12],[26,13,26,16],[28,5,28,8],[28,9,28,12],[28,13,28,16],[23,1,25,2],[23,3,25,3],[23,4,25,4],[23,5,23,8],[23,9,23,12],[23,13,23,16],[25,5,25,8],[25,9,25,12],[25,13,25,16],[20,1,22,2],[20,3,22,3],[20,4,22,4],[20,5,20,8],[20,9,20,12],[20,13,20,16],[22,5,22,8],[22,9,22,12],[22,13,22,16],[17,1,19,2],[17,3,19,3],[17,4,19,4],[17,5,17,8],[17,9,17,12],[17,13,17,16],[19,5,19,8],[19,9,19,12],[19,13,19,16],[14,1,16,2],[14,3,16,3],[14,4,16,4],[14,5,14,8],[14,9,14,12],[14,13,14,16],[16,5,16,8],[16,9,16,12],[16,13,16,16],[12,0,13,0],[12,3,13,3],[12,5,12,8],[12,9,12,12],[12,13,12,16],[12,17,13,17],[13,1,13,2],[13,5,13,8],[13,9,13,12],[13,13,13,16],[0,1,0,17],[1,1,1,17],[2,1,2,7],[2,8,2,17],[3,1,3,7],[3,8,3,17],[8,1,8,7],[8,8,8,17],[9,0,11,0],[9,1,9,7],[9,8,9,17],[10,1,10,17],[11,1,11,17],[4,1,4,17],[5,1,5,7],[5,8,5,17],[6,1,6,7],[6,8,6,17],[7,1,7,17]]}
[]
[]
[null,"UNIDADE ESCOLAR",null,null,null,null,null,null,"PRAZO"]
[null,{"$f":"Orçamento!O4","v":"ESCOLA ESTADUAL DOM EMANUEL"},null,null,null,null,null,null,"90 DIAS CORRIDOS"]
[]
[null,"OBRA",null,null,null,null,null,null,"DATA"]
[null,{"$f":"Orçamento!O7","v":"REFORMA E AMPLIAÇÃO"},null,null,null,null,null,null,{"$f":"Orçamento!S7","v":"2020-05-08"}]
[]
[null,"LOCAL",null,null,null,null,null,null,"ÁREA TOTAL CONSTRUÍDA (M²)"]
["FILTRO",{"$f":"Orçamento!V7","v":"SILVÂNIA"},null,null,null,null,null,null,{"$f":"Orçamento!V13","v":946.99}]
[]
[null,"CRONOGRAMA - FÍSICO FINANCEIRO"]
["↓","CUSTO TOTAL:",{"$f":"D93","v":0},"VALOR","Dias:",30,null,null,null,60,null,null,null,90,null,null,null,"TOTAL"]
[null,"DESCRIÇÃO DOS SERVIÇOS",null,null,"%","1ª PARCELA",null,null,null,"2ª PARCELA",null,null,null,"3ª PARCELA"]
[{"$f":"IF(D15>0,\"F\",\"\")","v":""},"SERVIÇOS PRELIMINARES",null,{"$f":"Orçamento!V484","v":0},{"$f":"Orçamento!X484","v":0},{"$f":"ROUND(F17*$D$15,2)","v":0},null,null,null,{"$f":"ROUND(J17*$D$15,2)","v":0},null,null,null,{"$f":"ROUND(N17*$D$15,2)","v":0},null,null,null,{"$f":"SUM(F15:Q15)","v":0},null,{"$f":"IF(D15=R15,\"OK\",\"ERRO\")","v":"OK"}]
[{"$f":"IF(A15=\"F\",A15,\"\")","v":""}]
[{"$f":"IF(A16=\"F\",A16,\"\")","v":""},null,null,null,null,1,null,null,null,0,null,null,null,{"$f":"1-F17-J17","v":0},null,null,null,{"$f":"IFERROR(E15/100,\"\")","v":0},null,{"$f":"IF(E15=R17*100,\"OK\",\"ERRO\")","v":"OK"}]
[{"$f":"IF(D18>0,\"F\",\"\")","v":""},"TRANSPORTES",null,{"$f":"Orçamento!V485","v":0},{"$f":"Orçamento!X485","v":0},{"$f":"ROUND(F20*$D$18,2)","v":0},null,null,null,{"$f":"ROUND(J20*$D$18,2)","v":0},null,null,null,{"$f":"ROUND(N20*$D$18,2)","v":0},null,null,null,{"$f":"SUM(F18:Q18)","v":0},null,{"$f":"IF(D18=R18,\"OK\",\"ERRO\")","v":"OK"}]
[{"$f":"IF(A18=\"F\",A18,\"\")","v":""}]
[{"$f":"IF(A19=\"F\",A19,\"\")","v":""},null,null,null,null,0.37,null,null,null,0.3,null,null,null,{"$f":"1-F20-J20","v":0.33},null,null,null,{"$f":"IFERROR(E18/100,\"\")","v":0},null,{"$f":"IF(E18=R20*100,\"OK\",\"ERRO\")","v":"OK"}]
[{"$f":"IF(D21>0,\"F\",\"\")","v":""},"SERVIÇO EM TERRA",null,{"$f":"Orçamento!V486","v":0},{"$f":"Orçamento!X486","v":0},{"$f":"ROUND(F23*$D$21,2)","v":0},null,null,null,{"$f":"ROUND(J23*$D$21,2)","v":0},null,null,null,{"$f":"ROUND(N23*$D$21,2)","v":0},null,null,null,{"$f":"SUM(F21:Q21)","v":0},null,{"$f":"IF(D21=R21,\"OK\",\"ERRO\")","v":"OK"}]
[{"$f":"IF(A21=\"F\",A21,\"\")","v":""}]
[{"$f":"IF(A22=\"F\",A22,\"\")","v":""},null,null,null,null,1,null,null,null,0,null,null,null,{"$f":"1-F23-J23","v":0},null,null,null,{"$f":"IFERROR(E21/100,\"\")","v":0},null,{"$f":"IF(E21=R23*100,\"OK\",\"ERRO\")","v":"OK"}]
[{"$f":"IF(D24>0,\"F\",\"\")","v":""},"FUNDAÇÕES E SONDAGENS",null,{"$f":"Orçamento!V487","v":0},{"$f":"Orçamento!X487","v":0},{"$f":"ROUND(F26*$D$24,2)","v":0},null,null,null,{"$f":"ROUND(J26*$D$24,2)","v":0},null,null,null,{"$f":"ROUND(N26*$D$24,2)","v":0},null,null,null,{"$f":"SUM(F24:Q24)","v":0},null,{"$f":"IF(D24=R24,\"OK\",\"ERRO\")","v":"OK"}]
[{"$f":"IF(A24=\"F\",A24,\"\")","v":""}]
[{"$f":"IF(A25=\"F\",A25,\"\")","v":""},null,null,null,null,1,null,null,null,0,null,null,null,{"$f":"1-F26-J26","v":0},null,null,null,{"$f":"IFERROR(E24/100,\"\")","v":0},null,{"$f":"IF(E24=R26*100,\"OK\",\"ERRO\")","v":"OK"}]
[{"$f":"IF(D27>0,\"F\",\"\")","v":""},"ESTRUTURA",null,{"$f":"Orçamento!V488","v":0},{"$f":"Orçamento!X488","v":0},{"$f":"ROUND(F29*$D$27,2)","v":0},null,null,null,{"$f":"ROUND(J29*$D$27,2)","v":0},null,null,null,{"$f":"ROUND(N29*$D$27,2)","v":0},null,null,null,{"$f":"SUM(F27:Q27)","v":0},null,{"$f":"IF(D27=R27,\"OK\",\"ERRO\")","v":"OK"}]
[{"$f":"IF(A27=\"F\",A27,\"\")","v":""}]
[{"$f":"IF(A28=\"F\",A28,\"\")","v":""},null,null,null,null,0.54,null,null,null,0.46,null,null,null,{"$f":"1-F29-J29","v":0},null,null,null,{"$f":"IFERROR(E27/100,\"\")","v":0},null,{"$f":"IF(E27=R29*100,\"OK\",\"ERRO\")","v":"OK"}]
[{"$f":"IF(D30>0,\"F\",\"\")","v":""},"INST.ELET/TELEFÔNICA/CABEAMENTO ESTRUTURADO",null,{"$f":"Orçamento!V489","v":0},{"$f":"Orçamento!X489","v":0},{"$f":"ROUND(F32*$D$30,2)","v":0},null,null,null,{"$f":"ROUND(J32*$D$30,2)","v":0},null,null,null,{"$f":"ROUND(N32*$D$30,2)","v":0},null,null,null,{"$f":"SUM(F30:Q30)","v":0},null,{"$f":"IF(D30=R30,\"OK\",\"ERRO\")","v":"OK"}]
[{"$f":"IF(A30=\"F\",A30,\"\")","v":""}]
[{"$f":"IF(A31=\"F\",A31,\"\")","v":""},null,null,null,null,0,null,null,null,{"$f":"1-B32","v":1},null,null,null,{"$f":"1-F32-J32","v":0},null,null,null,{"$f":"IFERROR(E30/100,\"\")","v":0},null,{"$f":"IF(E30=R32*100,\"OK\",\"ERRO\")","v":"OK"}]
[{"$f":"IF(D33>0,\"F\",\"\")","v":""},"INSTALAÇÕES HIDROSSANITÁRIAS",null,{"$f":"Orçamento!V490","v":0},{"$f":"Orçamento!X490","v":0},{"$f":"ROUND(F35*$D$33,2)","v":0},null,null,null,{"$f":"ROUND(J35*$D$33,2)","v":0},null,null,null,{"$f":"ROUND(N35*$D$33,2)","v":0},null,null,null,{"$f":"SUM(F33:Q33)","v":0},null,{"$f":"IF(D33=R33,\"OK\",\"ERRO\")","v":"OK"}]
[{"$f":"IF(A33=\"F\",A33,\"\")","v":""}]
[{"$f":"IF(A34=\"F\",A34,\"\")","v":""},null,null,null,null,0,null,null,null,{"$f":"1-B35","v":1},null,null,null,{"$f":"1-F35-J35","v":0},null,null,null,{"$f":"IFERROR(E33/100,\"\")","v":0},null,{"$f":"IF(E33=R35*100,\"OK\",\"ERRO\")","v":"OK"}]
[{"$f":"IF(D36>0,\"F\",\"\")","v":""},"INSTALAÇÕES ESPECIAIS",null,{"$f":"Orçamento!V491","v":0},{"$f":"Orçamento!X491","v":0},{"$f":"ROUND(F38*$D$36,2)","v":0},null,null,null,{"$f":"ROUND(J38*$D$36,2)","v":0},null,null,null,{"$f":"ROUND(N38*$D$36,2)","v":0},null,null,null,{"$f":"SUM(F36:Q36)","v":0},null,{"$f":"IF(D36=R36,\"OK\",\"ERRO\")","v":"OK"}]
[{"$f":"IF(A36=\"F\",A36,\"\")","v":""}]
[{"$f":"IF(A37=\"F\",A37,\"\")","v":""},null,null,null,null,0,null,null,null,{"$f":"1-B38","v":1},null,null,null,{"$f":"1-F38-J38","v":0},null,null,null,{"$f":"IFERROR(E36/100,\"\")","v":0},null,{"$f":"IF(E36=R38*100,\"OK\",\"ERRO\")","v":"OK"}]
[{"$f":"IF(D39>0,\"F\",\"\")","v":""},"ALVENARIA E DIVISÓRIAS",null,{"$f":"Orçamento!V492","v":0},{"$f":"Orçamento!X492","v":0},{"$f":"ROUND(F41*$D$39,2)","v":0},null,null,null,{"$f":"ROUND(J41*$D$39,2)","v":0},null,null,null,{"$f":"ROUND(N41*$D$39,2)","v":0},null,null,null,{"$f":"SUM(F39:Q39)","v":0},null,{"$f":"IF(D39=R39,\"OK\",\"ERRO\")","v":"OK"}]
[{"$f":"IF(A39=\"F\",A39,\"\")","v":""}]
[{"$f":"IF(A40=\"F\",A40,\"\")","v":""},null,null,null,null,0,null,null,null,{"$f":"1-B41","v":1},null,null,null,{"$f":"1-F41-J41","v":0},null,null,null,{"$f":"IFERROR(E39/100,\"\")","v":0},null,{"$f":"IF(E39=R41*100,\"OK\",\"ERRO\")","v":"OK"}]
[{"$f":"IF(D42>0,\"F\",\"\")","v":""},"ALVENARIA AUTO-PORTANTE",null,{"$f":"Orçamento!V493","v":0},{"$f":"Orçamento!X493","v":0},{"$f":"ROUND(F44*$D$42,2)","v":0},null,null,null,{"$f":"ROUND(J44*$D$42,2)","v":0},null,null,null,{"$f":"ROUND(N44*$D$42,2)","v":0},null,null,null,{"$f":"SUM(F42:Q42)","v":0},null,{"$f":"IF(D42=R42,\"OK\",\"ERRO\")","v":"OK"}]
[{"$f":"IF(A42=\"F\",A42,\"\")","v":""}]
[{"$f":"IF(A43=\"F\",A43,\"\")","v":""},null,null,null,null,0,null,null,null,{"$f":"1-B44","v":1},null,null,null,{"$f":"1-F44-J44","v":0},null,null,null,{"$f":"IFERROR(E42/100,\"\")","v":0},null,{"$f":"IF(E42=R44*100,\"OK\",\"ERRO\")","v":"OK"}]
[{"$f":"IF(D45>0,\"F\",\"\")","v":""},"IMPERMEABILIZAÇÃO",null,{"$f":"Orçamento!V494","v":0},{"$f":"Orçamento!X494","v":0},{"$f":"ROUND(F47*$D$45,2)","v":0},null,null,null,{"$f":"ROUND(J47*$D$45,2)","v":0},null,null,null,{"$f":"ROUND(N47*$D$45,2)","v":0},null,null,null,{"$f":"SUM(F45:Q45)","v":0},null,{"$f":"IF(D45=R45,\"OK\",\"ERRO\")","v":"OK"}]
[{"$f":"IF(A45=\"F\",A45,\"\")","v":""}]
[{"$f":"IF(A46=\"F\",A46,\"\")","v":""},null,null,null,null,0.85,null,null,null,0.15,null,null,null,{"$f":"1-F47-J47","v":0},null,null,null,{"$f":"IFERROR(E45/100,\"\")","v":0},null,{"$f":"IF(E45=R47*100,\"OK\",\"ERRO\")","v":"OK"}]
[{"$f":"IF(D48>0,\"F\",\"\")","v":""},"ISOLAMENTO TÉRMICO E ACÚSTICO",null,{"$f":"Orçamento!V495","v":0},{"$f":"Orçamento!X495","v":0},{"$f":"ROUND(F50*$D$48,2)","v":0},null,null,null,{"$f":"ROUND(J50*$D$48,2)","v":0},null,null,null,{"$f":"ROUND(N50*$D$48,2)","v":0},null,null,null,{"$f":"SUM(F48:Q48)","v":0},null,{"$f":"IF(D48=R48,\"OK\",\"ERRO\")","v":"OK"}]
[{"$f":"IF(A48=\"F\",A48,\"\")","v":""}]
[{"$f":"IF(A49=\"F\",A49,\"\")","v":""},null,null,null,null,0,null,null,null,{"$f":"1-B50","v":1},null,null,null,{"$f":"1-F50-J50","v":0},null,null,null,{"$f":"IFERROR(E48/100,\"\")","v":0},null,{"$f":"IF(E48=R50*100,\"OK\",\"ERRO\")","v":"OK"}]
[{"$f":"IF(D51>0,\"F\",\"\")","v":""},"ESTRUTURA DE MADEIRA",null,{"$f":"Orçamento!V496","v":0},{"$f":"Orçamento!X496","v":0},{"$f":"ROUND(F53*$D$51,2)","v":0},null,null,null,{"$f":"ROUND(J53*$D$51,2)","v":0},null,null,null,{"$f":"ROUND(N53*$D$51,2)","v":0},null,null,null,{"$f":"SUM(F51:Q51)","v":0},null,{"$f":"IF(D51=R51,\"OK\",\"ERRO\")","v":"OK"}]
[{"$f":"IF(A51=\"F\",A51,\"\")","v":""}]
[{"$f":"IF(A52=\"F\",A52,\"\")","v":""},null,null,null,null,0,null,null,null,0.57999999999999996,null,null,null,{"$f":"1-F53-J53","v":0.42000000000000004},null,null,null,{"$f":"IFERROR(E51/100,\"\")","v":0},null,{"$f":"IF(E51=R53*100,\"OK\",\"ERRO\")","v":"OK"}]
[{"$f":"IF(D54>0,\"F\",\"\")","v":""},"ESTRUTURA METÁLICA",null,{"$f":"Orçamento!V497","v":0},{"$f":"Orçamento!X497","v":0},{"$f":"ROUND(F56*$D$54,2)","v":0},null,null,null,{"$f":"ROUND(J56*$D$54,2)","v":0},null,null,null,{"$f":"ROUND(N56*$D$54,2)","v":0},null,null,null,{"$f":"SUM(F54:Q54)","v":0},null,{"$f":"IF(D54=R54,\"OK\",\"ERRO\")","v":"OK"}]
[{"$f":"IF(A54=\"F\",A54,\"\")","v":""}]
[{"$f":"IF(A55=\"F\",A55,\"\")","v":""},null,null,null,null,0,null,null,null,0.57999999999999996,null,null,null,{"$f":"1-F56-J56","v":0.42000000000000004},null,null,null,{"$f":"IFERROR(E54/100,\"\")","v":0},null,{"$f":"IF(E54=R56*100,\"OK\",\"ERRO\")","v":"OK"}]
[{"$f":"IF(D57>0,\"F\",\"\")","v":""},"COBERTURAS",null,{"$f":"Orçamento!V498","v":0},{"$f":"Orçamento!X498","v":0},{"$f":"ROUND(F59*$D$57,2)","v":0},null,null,null,{"$f":"ROUND(J59*$D$57,2)","v":0},null,null,null,{"$f":"ROUND(N59*$D$57,2)","v":0},null,null,null,{"$f":"SUM(F57:Q57)","v":0},null,{"$f":"IF(D57=R57,\"OK\",\"ERRO\")","v":"OK"}]
[{"$f":"IF(A57=\"F\",A57,\"\")","v":""}]
[{"$f":"IF(A58=\"F\",A58,\"\")","v":""},null,null,null,null,0,null,null,null,0,null,null,null,{"$f":"1-F59-J59","v":1},null,null,null,{"$f":"IFERROR(E57/100,\"\")","v":0},null,{"$f":"IF(E57=R59*100,\"OK\",\"ERRO\")","v":"OK"}]
[{"$f":"IF(D60>0,\"F\",\"\")","v":""},"ESQUADRIAS DE MADEIRA",null,{"$f":"Orçamento!V499","v":0},{"$f":"Orçamento!X499","v":0},{"$f":"ROUND(F62*$D$60,2)","v":0},null,null,null,{"$f":"ROUND(J62*$D$60,2)","v":0},null,null,null,{"$f":"ROUND(N62*$D$60,2)","v":0},null,null,null,{"$f":"SUM(F60:Q60)","v":0},null,{"$f":"IF(D60=R60,\"OK\",\"ERRO\")","v":"OK"}]
[{"$f":"IF(A60=\"F\",A60,\"\")","v":""}]
[{"$f":"IF(A61=\"F\",A61,\"\")","v":""},null,null,null,null,0,null,null,null,0.4,null,null,null,{"$f":"1-F62-J62","v":0.6},null,null,null,{"$f":"IFERROR(E60/100,\"\")","v":0},null,{"$f":"IF(E60=R62*100,\"OK\",\"ERRO\")","v":"OK"}]
[{"$f":"IF(D63>0,\"F\",\"\")","v":""},"ESQUADRIAS METÁLICAS",null,{"$f":"Orçamento!V500","v":0},{"$f":"Orçamento!X500","v":0},{"$f":"ROUND(F65*$D$63,2)","v":0},null,null,null,{"$f":"ROUND(J65*$D$63,2)","v":0},null,null,null,{"$f":"ROUND(N65*$D$63,2)","v":0},null,null,null,{"$f":"SUM(F63:Q63)","v":0},null,{"$f":"IF(D63=R63,\"OK\",\"ERRO\")","v":"OK"}]
[{"$f":"IF(A63=\"F\",A63,\"\")","v":""}]
[{"$f":"IF(A64=\"F\",A64,\"\")","v":""},null,null,null,null,0,null,null,null,0.45,null,null,null,{"$f":"1-F65-J65","v":0.55000000000000004},null,null,null,{"$f":"IFERROR(E63/100,\"\")","v":0},null,{"$f":"IF(E63=R65*100,\"OK\",\"ERRO\")","v":"OK"}]
[{"$f":"IF(D66>0,\"F\",\"\")","v":""},"VIDROS",null,{"$f":"Orçamento!V501","v":0},{"$f":"Orçamento!X501","v":0},{"$f":"ROUND(F68*$D$66,2)","v":0},null,null,null,{"$f":"ROUND(J68*$D$66,2)","v":0},null,null,null,{"$f":"ROUND(N68*$D$66,2)","v":0},null,null,null,{"$f":"SUM(F66:Q66)","v":0},null,{"$f":"IF(D66=R66,\"OK\",\"ERRO\")","v":"OK"}]
[{"$f":"IF(A66=\"F\",A66,\"\")","v":""}]
[{"$f":"IF(A67=\"F\",A67,\"\")","v":""},null,null,null,null,0,null,null,null,0,null,null,null,{"$f":"1-F68-J68","v":1},null,null,null,{"$f":"IFERROR(E66/100,\"\")","v":0},null,{"$f":"IF(E66=R68*100,\"OK\",\"ERRO\")","v":"OK"}]
[{"$f":"IF(D69>0,\"F\",\"\")","v":""},"REVESTIMENTO DE PAREDE",null,{"$f":"Orçamento!V502","v":0},{"$f":"Orçamento!X502","v":0},{"$f":"ROUND(F71*$D$69,2)","v":0},null,null,null,{"$f":"ROUND(J71*$D$69,2)","v":0},null,null,null,{"$f":"ROUND(N71*$D$69,2)","v":0},null,null,null,{"$f":"SUM(F69:Q69)","v":0},null,{"$f":"IF(D69=R69,\"OK\",\"ERRO\")","v":"OK"}]
[{"$f":"IF(A69=\"F\",A69,\"\")","v":""}]
[{"$f":"IF(A70=\"F\",A70,\"\")","v":""},null,null,null,null,0,null,null,null,0.4,null,null,null,{"$f":"1-F71-J71","v":0.6},null,null,null,{"$f":"IFERROR(E69/100,\"\")","v":0},null,{"$f":"IF(E69=R71*100,\"OK\",\"ERRO\")","v":"OK"}]
[{"$f":"IF(D72>0,\"F\",\"\")","v":""},"FORROS",null,{"$f":"Orçamento!V503","v":0},{"$f":"Orçamento!X503","v":0},{"$f":"ROUND(F74*$D$72,2)","v":0},null,null,null,{"$f":"ROUND(J74*$D$72,2)","v":0},null,null,null,{"$f":"ROUND(N74*$D$72,2)","v":0},null,null,null,{"$f":"SUM(F72:Q72)","v":0},null,{"$f":"IF(D72=R72,\"OK\",\"ERRO\")","v":"OK"}]
[{"$f":"IF(A72=\"F\",A72,\"\")","v":""}]
[{"$f":"IF(A73=\"F\",A73,\"\")","v":""},null,null,null,null,0,null,null,null,0.4,null,null,null,{"$f":"1-F74-J74","v":0.6},null,null,null,{"$f":"IFERROR(E72/100,\"\")","v":0},null,{"$f":"IF(E72=R74*100,\"OK\",\"ERRO\")","v":"OK"}]
[{"$f":"IF(D75>0,\"F\",\"\")","v":""},"REVESTIMENTO DE PISO",null,{"$f":"Orçamento!V504","v":0},{"$f":"Orçamento!X504","v":0},{"$f":"ROUND(F77*$D$75,2)","v":0},null,null,null,{"$f":"ROUND(J77*$D$75,2)","v":0},null,null,null,{"$f":"ROUND(N77*$D$75,2)","v":0},null,null,null,{"$f":"SUM(F75:Q75)","v":0},null,{"$f":"IF(D75=R75,\"OK\",\"ERRO\")","v":"OK"}]
[{"$f":"IF(A75=\"F\",A75,\"\")","v":""}]
[{"$f":"IF(A76=\"F\",A76,\"\")","v":""},null,null,null,null,0,null,null,null,0.4,null,null,null,{"$f":"1-F77-J77","v":0.6},null,null,null,{"$f":"IFERROR(E75/100,\"\")","v":0},null,{"$f":"IF(E75=R77*100,\"OK\",\"ERRO\")","v":"OK"}]
[{"$f":"IF(D78>0,\"F\",\"\")","v":""},"FERRAGENS",null,{"$f":"Orçamento!V505","v":0},{"$f":"Orçamento!X505","v":0},{"$f":"ROUND(F80*$D$78,2)","v":0},null,null,null,{"$f":"ROUND(J80*$D$78,2)","v":0},null,null,null,{"$f":"ROUND(N80*$D$78,2)","v":0},null,null,null,{"$f":"SUM(F78:Q78)","v":0},null,{"$f":"IF(D78=R78,\"OK\",\"ERRO\")","v":"OK"}]
[{"$f":"IF(A78=\"F\",A78,\"\")","v":""}]
[{"$f":"IF(A79=\"F\",A79,\"\")","v":""},null,null,null,null,0,null,null,null,0,null,null,null,{"$f":"1-F80-J80","v":1},null,null,null,{"$f":"IFERROR(E78/100,\"\")","v":0},null,{"$f":"IF(E78=R80*100,\"OK\",\"ERRO\")","v":"OK"}]
[{"$f":"IF(D81>0,\"F\",\"\")","v":""},"MARCENARIA",null,{"$f":"Orçamento!V506","v":0},{"$f":"Orçamento!X506","v":0},{"$f":"ROUND(F83*$D$81,2)","v":0},null,null,null,{"$f":"ROUND(J83*$D$81,2)","v":0},null,null,null,{"$f":"ROUND(N83*$D$81,2)","v":0},null,null,null,{"$f":"SUM(F81:Q81)","v":0},null,{"$f":"IF(D81=R81,\"OK\",\"ERRO\")","v":"OK"}]
[{"$f":"IF(A81=\"F\",A81,\"\")","v":""}]
[{"$f":"IF(A82=\"F\",A82,\"\")","v":""},null,null,null,null,0,null,null,null,0,null,null,null,{"$f":"1-F83-J83","v":1},null,null,null,{"$f":"IFERROR(E81/100,\"\")","v":0},null,{"$f":"IF(E81=R83*100,\"OK\",\"ERRO\")","v":"OK"}]
[{"$f":"IF(D84>0,\"F\",\"\")","v":""},"ADMINISTRAÇÃO - MENSALISTAS",null,{"$f":"Orçamento!V507","v":0},{"$f":"Orçamento!X507","v":0},{"$f":"ROUND(F86*$D$84,2)","v":0},null,null,null,{"$f":"ROUND(J86*$D$84,2)","v":0},null,null,null,{"$f":"ROUND(N86*$D$84,2)","v":0},null,null,null,{"$f":"SUM(F84:Q84)","v":0},null,{"$f":"IF(D84=R84,\"OK\",\"ERRO\")","v":"OK"}]
[{"$f":"IF(A84=\"F\",A84,\"\")","v":""}]
[{"$f":"IF(A85=\"F\",A85,\"\")","v":""},null,null,null,null,0.36,null,null,null,0.32,null,null,null,{"$f":"1-F86-J86","v":0.32},null,null,null,{"$f":"IFERROR(E84/100,\"\")","v":0},null,{"$f":"IF(E84=R86*100,\"OK\",\"ERRO\")","v":"OK"}]
[{"$f":"IF(D87>0,\"F\",\"\")","v":""},"PINTURA",null,{"$f":"Orçamento!V508","v":0},{"$f":"Orçamento!X508","v":0},{"$f":"ROUND(F89*$D$87,2)","v":0},null,null,null,{"$f":"ROUND(J89*$D$87,2)","v":0},null,null,null,{"$f":"ROUND(N89*$D$87,2)","v":0},null,null,null,{"$f":"SUM(F87:Q87)","v":0},null,{"$f":"IF(D87=R87,\"OK\",\"ERRO\")","v":"OK"}]
[{"$f":"IF(A87=\"F\",A87,\"\")","v":""}]
[{"$f":"IF(A88=\"F\",A88,\"\")","v":""},null,null,null,null,0,null,null,null,0,null,null,null,{"$f":"1-F89-J89","v":1},null,null,null,{"$f":"IFERROR(E87/100,\"\")","v":0},null,{"$f":"IF(E87=R89*100,\"OK\",\"ERRO\")","v":"OK"}]
[{"$f":"IF(D90>0,\"F\",\"\")","v":""},"DIVERSOS",null,{"$f":"Orçamento!V509","v":0},{"$f":"Orçamento!X509","v":0},{"$f":"ROUND(F92*$D$90,2)","v":0},null,null,null,{"$f":"ROUND(J92*$D$90,2)","v":0},null,null,null,{"$f":"ROUND(N92*$D$90,2)","v":0},null,null,null,{"$f":"SUM(F90:Q90)","v":0},null,{"$f":"IF(D90=R90,\"OK\",\"ERRO\")","v":"OK"}]
[{"$f":"IF(A90=\"F\",A90,\"\")","v":""}]
[{"$f":"IF(A91=\"F\",A91,\"\")","v":""},null,null,null,null,0,null,null,null,0,null,null,null,{"$f":"1-F92-J92","v":1},null,null,null,{"$f":"IFERROR(E90/100,\"\")","v":0},null,{"$f":"IF(E90=R92*100,\"OK\",\"ERRO\")","v":"OK"}]
["F","CUSTO DO ORÇAMENTO",null,{"$f":"SUM(D15:D92)","v":0},{"$f":"SUM(E15:E92)","v":0},{"$f":"F15+F18+F21+F24+F27+F30+F33+F36+F39+F42+F45+F48+F51+F54+F57+F60+F63+F66+F69+F72+F75+F78+F81+F84+F87+F90","v":0},null,null,null,{"$f":"J15+J18+J21+J24+J27+J30+J33+J36+J39+J42+J45+J48+J51+J54+J57+J60+J63+J66+J69+J72+J75+J78+J81+J84+J87+J90","v":0},null,null,null,{"$f":"N15+N18+N21+N24+N27+N30+N33+N36+N39+N42+N45+N48+N51+N54+N57+N60+N63+N66+N69+N72+N75+N78+N81+N84+N87+N90","v":0},null,null,null,{"$f":"R15+R18+R21+R24+R27+R30+R33+R36+R39+R42+R45+R48+R51+R54+R57+R60+R63+R66+R69+R72+R75+R78+R81+R84+R87+R90","v":0}]
["F","PERCENTUAIS:",null,null,null,{"$f":"IFERROR(F93/D93,\"\")","v":""},null,null,null,{"$f":"IFERROR(J93/D93,\"\")","v":""},null,null,null,{"$f":"IFERROR(N93/D93,\"\")","v":""},null,null,null,{"$f":"SUM(F94:Q94)","v":0}]
["F","TOTAIS ACUMULADOS:",null,null,null,{"$f":"F93","v":0},null,null,null,{"$f":"F95+J93","v":0},null,null,null,{"$f":"J95+N93","v":0}]
["F","PERCENTUAIS  ACUMULADOS:",null,null,null,{"$f":"F94","v":""},null,null,null,null,null,null,null,{"$f":"IFERROR(J96+N94,\"\")","v":""}]
["F"]
["F","OBSERVAÇÕES:"]
["F","Os pagamentos somente poderão ser efetuados mediante medição e atesto pelos técnicos da Secretaria da Educação. "]

{"sheet":"Composição BDI","index":4,"n_rows":45,"n_cols":4,"rows_kept":45,"cut":false,"hidden":false,"merged":[[17,0,17,3],[16,0,16,3],[44,0,44,3],[42,0,42,3],[43,0,43,3],[18,0,18,3],[36,0,36,3],[39,0,39,3],[38,0,38,3],[40,0,40,3],[29,0,29,2],[32,0,32,3],[33,0,33,3],[34,0,34,3],[35,0,35,3],[0,0,0,3],[1,0,1,3],[4,0,4,3],[7,0,7,3],[10,0,10,3],[2,0,2,3],[3,0,3,3],[5,0,5,3],[6,0,6,3],[8,0,8,3],[9,0,9,3],[11,0,11,3],[12,0,12,3],[14,0,14,3],[15,0,15,3],[13,0,13,3]]}
[]
[]
["UNIDADE ESCOLAR"]
[{"$f":"Orçamento!$O$4","v":"ESCOLA ESTADUAL DOM EMANUEL"}]
[]
["OBRA"]
[{"$f":"Orçamento!$O$7","v":"REFORMA E AMPLIAÇÃO"}]
[]
["ENDEREÇO"]
[{"$f":"Orçamento!$R$10","v":" AV DOM BOSCO , CENTRO , CEP: 7518-000"}]
[]
["CIDADE"]
[{"$f":"Orçamento!$V$7","v":"SILVÂNIA"}]
[]
["CRE"]
[{"$f":"Orçamento!$O$10","v":"CRE-SILVÂNIA"}]
[]
["DETALHAMENTO DA COMPOSIÇÃO DE BDI"]
["COMPOSIÇÃO BDI PARA OBRAS CIVIS"]
["DESCRIÇÃO","COEF.","TAXA % (a.m)","% no preço de venda"]
["1) COFINS",1,0.03,{"$f":"C21","v":0.03}]
["2) PIS",1,6.4999999999999997E-3,{"$f":"C22","v":6.4999999999999997E-3}]
["3) ISSQN",1,{"$f":"IFERROR(VLOOKUP($A$13,#REF!,10,FALSE())/100,0)","v":0},{"$f":"C23*B23","v":0}]
["4) CPRB",1,{"$f":"IF(Orçamento!$T$10=\"DESONERADA\",4.5%,0)","v":4.4999999999999998E-2},{"$f":"C24","v":4.4999999999999998E-2}]
["5) Administração Central",1,0.04,0.04]
["6) Despesas Financeiras",1,5.5999999999999999E-3,5.5999999999999999E-3]
["7) Seguros + Garantias",1,1.1999999999999999E-3,1.1999999999999999E-3]
["8) Risco",1,9.7000000000000003E-3,9.7000000000000003E-3]
["9) Lucro",1,6.88E-2,6.88E-2]
["BDI - FINAL",null,null,{"$f":"(((1+D25+D27+D28)*(1+D26)*(1+D29))/(1-(D21+D22+D23+D24))-1)","v":0.22971350109090927}]
[]
["Notas:"]
["(1) e (2) Alíquota definida por lei."]
["(3) Alíquota e base de cálculo definidas pela legislação municipal."]
["(4) Alíquota definida pelas leis 12.546/11, 12844/13 e 13.161/15 (CPRB – contribuição previdenciária sobre a receita bruta)."]
["(5) Valores definidos a partir dos limites no Acórdão nº 2.622/2013 - TCU – Plenário. Valores entre o 1º e 3º quartis."]
["(6) Valor calculado pela expressão matemática do acórdão 2.369/2011 – TCU – Plenário e disponibilizado pela AGETOP em dezembro de 2018. (Foi utilizado para o cálculo a média da Taxa SELIC no período de 11/2017 a 10/2018)"]
[]
["(7) Valores definidos pela AGETOP a partir dos limites no Acórdão nº 2.622/2013 - TCU – Plenário. Valores médios. \n\nObservação da AGETOP: (Seguros contra erros de execução, incêndio e explosão, danos da natureza (vendaval, destelhamento, alagamento, inundação, desmoronamento, geadas etc.), emprego de material defeituoso ou inadequado, roubo e/ou furto qualificado, quebra de equipamentos, desmoronamento de estrutura, nas modalidades de Obras Civis em Construção (OCC); Instalação e Montagem (IM); e Obras Civis em Construção e Instalação e Montagem (OCC/IM). Bem como coberturas adicionais para ampliação dessas coberturas básicas, como: cobertura de responsabilidade civil geral, cobertura de responsabilidade civil cruzada, cobertura de despesas extraordinárias, cobertura de tumultos, cobertura de desentulho do local, cobertura de riscos do fabricante, dentre outras, incluindo o seguro de vida em grupo regido pela convenção coletiva dos trabalhadores na indústria da construção civil). A partir de 24/02/2015 por intermédio da Portaria 449/2015 a Presidência da AGETOP, na pessoa do Senhor Jayme Eduardo Rincon, determinou a exclusão dos valores referentes aos Seguros de Risco de Engenharia e Responsabilidade Civil do Profissional na composição do cálculo do B.D.I.."]
["(8) Valores definidos a partir dos limites no Acórdão nº 2.622/2013 - TCU – Plenário. Valores entre 1º e 3° quartis."]
["(9) Valores definidos a partir dos limites definidos no Acórdão nº 2.622/2013 - TCU – Plenário. Valores adotados e praticados no mercado ( “ ex ante ” ) ou aqueles entre os 1º e 3º quartis."]
[]
["(*) A fórmula para estipulação da taxa de BDI estimado adotado é a mesma que foi aplicada para a obtenção das tabelas contidas no Acórdão n. 2.622/2013 – TCUPlenário"]
[]
["Obs.: Para obras com valores superiores a R$ 20.000.000,00 sugere-se recalcular o BDI, dimensionando as taxas de administração central e lucro para patamares inferiores ao estipulado acima."]

{"sheet":"Relatório CENTRAL","index":5,"n_rows":40,"n_cols":5,"rows_kept":40,"cut":false,"hidden":false,"merged":[[8,1,8,2],[8,3,8,4],[9,1,9,2],[10,1,10,4],[11,1,11,4],[39,1,39,2],[9,0,11,0],[0,1,0,4],[6,3,6,4],[9,3,9,4],[1,1,1,4],[2,1,2,2],[2,3,2,4],[3,1,3,2],[3,3,3,4],[4,1,4,4],[5,1,5,2],[5,3,5,4],[6,1,6,2],[7,1,7,4]]}
[]
[]
[null,"UNIDADE ESCOLAR",null,"CIDADE"]
[null,{"$f":"Orçamento!$O$4","v":"ESCOLA ESTADUAL DOM EMANUEL"},null,{"$f":"Orçamento!$V$7","v":"SILVÂNIA"}]
[]
[null,"OBRA",null,"CRE"]
[null,{"$f":"Orçamento!$O$7","v":"REFORMA E AMPLIAÇÃO"},null,{"$f":"Orçamento!$O$10","v":"CRE-SILVÂNIA"}]
[]
[null,"ENDEREÇO",null,"DATA"]
["FILTRO",{"$f":"Orçamento!$R$10","v":" AV DOM BOSCO , CENTRO , CEP: 7518-000"},null,{"$f":"Orçamento!$S$7","v":"2020-05-08"}]
[]
[null,"RELATÓRIO CENTRAL"]
["↓","CÓDIGO","ETAPA","PREÇO  (R$) C/ BDI","PARTIC  ( % )"]
[{"$f":"IF(D14>0,\"F\",\"\")","v":""},{"$f":"Orçamento!O484","v":"a."},{"$f":"Orçamento!P484","v":"SERVIÇOS PRELIMINARES"},{"$f":"Orçamento!V484","v":0},{"$f":"Orçamento!X484","v":0}]
[{"$f":"IF(D15>0,\"F\",\"\")","v":""},{"$f":"Orçamento!O485","v":"b."},{"$f":"Orçamento!P485","v":"TRANSPORTES"},{"$f":"Orçamento!V485","v":0},{"$f":"Orçamento!X485","v":0}]
["",{"$f":"Orçamento!O486","v":"c."},{"$f":"Orçamento!P486","v":"SERVIÇO EM TERRA"},{"$f":"Orçamento!V486","v":0},{"$f":"Orçamento!X486","v":0}]
["",{"$f":"Orçamento!O487","v":"d."},{"$f":"Orçamento!P487","v":"FUNDAÇÕES E SONDAGENS"},{"$f":"Orçamento!V487","v":0},{"$f":"Orçamento!X487","v":0}]
["",{"$f":"Orçamento!O488","v":"e."},{"$f":"Orçamento!P488","v":"ESTRUTURA"},{"$f":"Orçamento!V488","v":0},{"$f":"Orçamento!X488","v":0}]
["",{"$f":"Orçamento!O489","v":"f."},{"$f":"Orçamento!P489","v":"INSTALAÇÕES ELÉTRICAS"},{"$f":"Orçamento!V489","v":0},{"$f":"Orçamento!X489","v":0}]
["",{"$f":"Orçamento!O490","v":"g."},{"$f":"Orçamento!P490","v":"INSTALAÇÕES HIDROSSANITÁRIAS"},{"$f":"Orçamento!V490","v":0},{"$f":"Orçamento!X490","v":0}]
["",{"$f":"Orçamento!O491","v":"h"},{"$f":"Orçamento!P491","v":"INSTALAÇÕES ESPECIAIS"},{"$f":"Orçamento!V491","v":0},{"$f":"Orçamento!X491","v":0}]
["",{"$f":"Orçamento!O492","v":"i."},{"$f":"Orçamento!P492","v":"ALVENARIAS E DIVISÓRIAS"},{"$f":"Orçamento!V492","v":0},{"$f":"Orçamento!X492","v":0}]
["",{"$f":"Orçamento!O493","v":"j."},{"$f":"Orçamento!P493","v":"ALVENARIA AUTO-PORTANTE"},{"$f":"Orçamento!V493","v":0},{"$f":"Orçamento!X493","v":0}]
["",{"$f":"Orçamento!O494","v":"k."},{"$f":"Orçamento!P494","v":"IMPERMEABILIZAÇÃO"},{"$f":"Orçamento!V494","v":0},{"$f":"Orçamento!X494","v":0}]
["",{"$f":"Orçamento!O495","v":"l."},{"$f":"Orçamento!P495","v":"ISOLAMENTO TÉRMICO E ACÚSTICO"},{"$f":"Orçamento!V495","v":0},{"$f":"Orçamento!X495","v":0}]
["",{"$f":"Orçamento!O496","v":"m."},{"$f":"Orçamento!P496","v":"ESTRUTURA DE MADEIRA"},{"$f":"Orçamento!V496","v":0},{"$f":"Orçamento!X496","v":0}]
["",{"$f":"Orçamento!O497","v":"n."},{"$f":"Orçamento!P497","v":"ESTRUTURAS METÁLICAS"},{"$f":"Orçamento!V497","v":0},{"$f":"Orçamento!X497","v":0}]
["",{"$f":"Orçamento!O498","v":"o."},{"$f":"Orçamento!P498","v":"COBERTURAS"},{"$f":"Orçamento!V498","v":0},{"$f":"Orçamento!X498","v":0}]
["",{"$f":"Orçamento!O499","v":"p."},{"$f":"Orçamento!P499","v":"ESQUADRIAS DE MADEIRA"},{"$f":"Orçamento!V499","v":0},{"$f":"Orçamento!X499","v":0}]
["",{"$f":"Orçamento!O500","v":"q."},{"$f":"Orçamento!P500","v":"ESQUADRIAS METÁLICAS"},{"$f":"Orçamento!V500","v":0},{"$f":"Orçamento!X500","v":0}]
["",{"$f":"Orçamento!O501","v":"r."},{"$f":"Orçamento!P501","v":"VIDROS"},{"$f":"Orçamento!V501","v":0},{"$f":"Orçamento!X501","v":0}]
["",{"$f":"Orçamento!O502","v":"s."},{"$f":"Orçamento!P502","v":"REVESTIMENTO DE PAREDE"},{"$f":"Orçamento!V502","v":0},{"$f":"Orçamento!X502","v":0}]
["",{"$f":"Orçamento!O503","v":"t."},{"$f":"Orçamento!P503","v":"FORROS"},{"$f":"Orçamento!V503","v":0},{"$f":"Orçamento!X503","v":0}]
["",{"$f":"Orçamento!O504","v":"u."},{"$f":"Orçamento!P504","v":"REVESTIMENTO DE PISO"},{"$f":"Orçamento!V504","v":0},{"$f":"Orçamento!X504","v":0}]
["",{"$f":"Orçamento!O505","v":"v."},{"$f":"Orçamento!P505","v":"FERRAGENS"},{"$f":"Orçamento!V505","v":0},{"$f":"Orçamento!X505","v":0}]
["",{"$f":"Orçamento!O506","v":"w."},{"$f":"Orçamento!P506","v":"MARCENARIA"},{"$f":"Orçamento!V506","v":0},{"$f":"Orçamento!X506","v":0}]
["",{"$f":"Orçamento!O507","v":"x."},{"$f":"Orçamento!P507","v":"ADMINISTRAÇÃO"},{"$f":"Orçamento!V507","v":0},{"$f":"Orçamento!X507","v":0}]
["",{"$f":"Orçamento!O508","v":"y."},{"$f":"Orçamento!P508","v":"PINTURA"},{"$f":"Orçamento!V508","v":0},{"$f":"Orçamento!X508","v":0}]
["",{"$f":"Orçamento!O509","v":"z."},{"$f":"Orçamento!P509","v":"DIVERSOS"},{"$f":"Orçamento!V509","v":0},{"$f":"Orçamento!X509","v":0}]
["F","TOTAL GERAL DO ORÇAMENTO (R$) C/BDI",null,{"$f":"SUM(D14:D39)","v":0},{"$f":"SUM(E14:E39)","v":0}]

{"sheet":"Parc Maior Relev","index":6,"n_rows":33,"n_cols":7,"rows_kept":33,"cut":false,"hidden":false,"merged":[[8,1,8,3],[8,4,8,6],[33,3,33,7],[31,1,31,6],[0,1,0,6],[11,1,11,6],[1,1,1,6],[2,1,2,3],[2,4,2,6],[3,1,3,3],[3,4,3,6],[4,1,4,6],[5,1,5,3],[5,4,5,6],[9,1,9,3],[9,4,9,6],[10,1,10,6],[6,1,6,3],[6,4,6,6],[7,1,7,6]]}
[]
[]
[null,"UNIDADE ESCOLAR",null,null,"CÓDIGO INEP"]
[null,{"$f":"Orçamento!$O$4","v":"ESCOLA ESTADUAL DOM EMANUEL"},null,null,{"$f":"Orçamento!$V$4","v":52063321}]
[]
[null,"OBRA",null,null,"CIDADE"]
[null,{"$f":"Orçamento!$O$7","v":"REFORMA E AMPLIAÇÃO"},null,null,{"$f":"Orçamento!$V$7","v":"SILVÂNIA"}]
[]
[null,"CRE",null,null,"ÁREA TOTAL CONSTRUÍDA (M²)"]
[null,{"$f":"Orçamento!$O$10","v":"CRE-SILVÂNIA"},null,null,{"$f":"Orçamento!$V$13","v":946.99}]
[]
["FILTRO","PARCELA DE MAIOR RELEVÂNCIA"]
[{"$f":"IF(G14>0,\"F\",\"\")","v":""},"CÓDIGO","SERVIÇO","DESCRIÇÃO","UNID","QUANT","PARC. MAIOR RELEV (100%)"]
[{"$f":"IF(G14>0,\"F\",\"\")","v":""},{"$f":"Somatório!B22","v":"f."},"INSTALAÇÕES ELÉTRICAS","SUBESTAÇÃO","KVA",{"$f":"SUMIF(Orçamento!$R$20:$R$465,'Parc Maior Relev'!D14,Orçamento!$T$20:$T$465)","v":0},{"$f":"F14","v":0}]
[{"$f":"IF(SUM(G16:G30)>0,\"F\",\"\")","v":"F"},"CÓDIGO","SERVIÇO","DESCRIÇÃO","UNID","QUANT","PARC. MAIOR RELEV (50%)"]
[{"$f":"IF(G16>0,\"F\",\"\")","v":""},{"$f":"Somatório!B21","v":"e."},"ESTRUTURA","CONCRETO","M3",{"$f":"SUMIF(Orçamento!$R$20:$R$465,'Parc Maior Relev'!D16,Orçamento!$T$20:$T$465)","v":0},{"$f":"F16*0.5","v":0}]
[{"$f":"IF(G17>0,\"F\",\"\")","v":""},"f.","INSTALAÇÕES ELÉTRICAS","INSTALAÇÕES ELÉTRICAS","KVA",{"$f":"SUMIF(Orçamento!$R$20:$R$465,'Parc Maior Relev'!D17,Orçamento!$T$20:$T$465)","v":0},{"$f":"F17","v":0}]
[{"$f":"IF(G18>0,\"F\",\"\")","v":"F"},{"$f":"Somatório!B31","v":"o."},"COBERTURAS"," TELHA CERÂMICA ","M2",198.38,99.19]
["","o.","COBERTURAS","COBERTURA COM TELHA METÁLICA","M2",{"$f":"SUMIF(Orçamento!$R$20:$R$465,'Parc Maior Relev'!D19,Orçamento!$T$20:$T$465)","v":0},{"$f":"F19*0.5","v":0}]
["",{"$f":"Somatório!B35","v":"s."},"REVESTIMENTO DE PAREDE","CHAPISCO","M2",{"$f":"SUMIF(Orçamento!$R$20:$R$465,'Parc Maior Relev'!D20,Orçamento!$T$20:$T$465)","v":0},0]
["","s.","REVESTIMENTO DE PAREDE","REBOCO","M2",{"$f":"SUMIF(Orçamento!$R$20:$R$465,'Parc Maior Relev'!D21,Orçamento!$T$20:$T$465)","v":0},{"$f":"F21*0.5","v":0}]
["","s.","REVESTIMENTO DE PAREDE","REVESTIMENTO CERÂMICO","M2",{"$f":"SUMIF(Orçamento!$R$20:$R$465,'Parc Maior Relev'!D22,Orçamento!$T$20:$T$465)","v":0},{"$f":"F22*0.5","v":0}]
["",{"$f":"Somatório!B36","v":"t."},"FORROS","FORRO DE GESSO","M2",{"$f":"SUMIF(Orçamento!$R$20:$R$465,'Parc Maior Relev'!D23,Orçamento!$T$20:$T$465)","v":0},{"$f":"F23*0.5","v":0}]
["","t.","FORROS","FORRO DE PVC","M2",{"$f":"SUMIF(Orçamento!$R$20:$R$465,'Parc Maior Relev'!D24,Orçamento!$T$20:$T$465)","v":0},{"$f":"F24*0.5","v":0}]
["","t.","FORROS","FORRO DE GESSO ACARTONADO","M2",{"$f":"SUMIF(Orçamento!$R$20:$R$465,'Parc Maior Relev'!D25,Orçamento!$T$20:$T$465)","v":0},{"$f":"F25*0.5","v":0}]
["","u.","REVESTIMENTO DE PISO","PISO DE GRANITINA","M2",{"$f":"SUMIF(Orçamento!$R$20:$R$465,'Parc Maior Relev'!D26,Orçamento!$T$20:$T$465)","v":0},0]
["","u.","REVESTIMENTO DE PISO","PISO LAMINADO","M2",{"$f":"SUMIF(Orçamento!$R$20:$R$465,'Parc Maior Relev'!D27,Orçamento!$T$20:$T$465)","v":0},0]
["","u.","REVESTIMENTO DE PISO","PISO DE CONCRETO DESEMPENADO","M2",{"$f":"SUMIF(Orçamento!$R$20:$R$465,'Parc Maior Relev'!D28,Orçamento!$T$20:$T$465)","v":0},0]
["F","u.","REVESTIMENTO DE PISO","PISO EM GRANILITE OU GRANITINA","M2",416.21999999999997,208.10999999999999]
["","y.","PINTURA","PINTURA","M2",{"$f":"SUMIF(Orçamento!$R$20:$R$465,'Parc Maior Relev'!D30,Orçamento!$T$20:$T$465)","v":0},0]
["F"]
["F","(*) Para os fins do inciso I dp § 1º do Art. 30 da Lei Federal 8.666/93, são consideradas parcelas de maior relevância técnica as execuções apresentadas"]
["F"]

{"sheet":"Composições","index":7,"n_rows":258,"n_cols":10,"rows_kept":258,"cut":false,"hidden":false,"merged":[[0,0,0,8],[10,0,10,2],[10,3,10,6],[11,0,11,9],[12,0,12,2],[12,3,12,6],[12,7,12,8],[7,0,7,6],[9,0,9,2],[9,3,9,6],[9,7,9,8],[3,0,3,6],[4,0,4,6],[15,0,15,9],[13,0,13,2],[13,3,13,6],[1,0,1,9],[3,7,3,9],[4,7,4,9],[6,7,6,9],[7,7,7,9],[6,0,6,6],[10,8,10,9],[13,8,13,9],[14,0,14,9],[8,0,8,9],[5,0,5,9],[2,0,2,9],[16,5,17,5],[16,6,16,7],[16,8,16,9],[22,1,22,7],[26,1,26,7],[16,0,17,0],[16,1,17,1],[16,2,17,2],[16,3,17,3],[16,4,17,4],[28,5,29,5],[28,6,28,7],[28,8,28,9],[33,1,33,7],[35,1,35,7],[28,0,29,0],[28,1,29,1],[28,2,29,2],[28,3,29,3],[28,4,29,4],[37,5,38,5],[37,6,37,7],[37,8,37,9],[41,1,41,7],[48,1,48,7],[37,0,38,0],[37,1,38,1],[37,2,38,2],[37,3,38,3],[37,4,38,4],[50,5,51,5],[50,6,50,7],[50,8,50,9],[54,1,54,7],[58,1,58,7],[50,0,51,0],[50,1,51,1],[50,2,51,2],[50,3,51,3],[50,4,51,4],[60,5,61,5],[60,6,60,7],[60,8,60,9],[65,1,65,7],[67,1,67,7],[60,0,61,0],[60,1,61,1],[60,2,61,2],[60,3,61,3],[60,4,61,4],[69,5,70,5],[69,6,69,7],[69,8,69,9],[73,1,73,7],[77,1,77,7],[69,0,70,0],[69,1,70,1],[69,2,70,2],[69,3,70,3],[69,4,70,4],[79,5,80,5],[79,6,79,7],[79,8,79,9],[83,1,83,7],[87,1,87,7],[79,0,80,0],[79,1,80,1],[79,2,80,2],[79,3,80,3],[79,4,80,4],[89,5,90,5],[89,6,89,7],[89,8,89,9],[94,1,94,7],[95,1,95,7],[89,0,90,0],[89,1,90,1],[89,2,90,2],[89,3,90,3],[89,4,90,4],[97,5,98,5],[97,6,97,7],[97,8,97,9],[103,1,103,7],[107,1,107,7],[97,0,98,0],[97,1,98,1],[97,2,98,2],[97,3,98,3],[97,4,98,4],[109,5,110,5],[109,6,109,7],[109,8,109,9],[114,1,114,7],[124,1,124,7],[109,0,110,0],[109,1,110,1],[109,2,110,2],[109,3,110,3],[109,4,110,4],[126,5,127,5],[126,6,126,7],[126,8,126,9],[131,1,131,7],[144,1,144,7],[126,0,127,0],[126,1,127,1],[126,2,127,2],[126,3,127,3],[126,4,127,4],[146,5,147,5],[146,6,146,7],[146,8,146,9],[149,1,149,7],[151,1,151,7],[146,0,147,0],[146,1,147,1],[146,2,147,2],[146,3,147,3],[146,4,147,4],[153,5,154,5],[153,6,153,7],[153,8,153,9],[158,1,158,7],[160,1,160,7],[153,0,154,0],[153,1,154,1],[153,2,154,2],[153,3,154,3],[153,4,154,4],[162,5,163,5],[162,6,162,7],[162,8,162,9],[167,1,167,7],[169,1,169,7],[162,0,163,0],[162,1,163,1],[162,2,163,2],[162,3,163,3],[162,4,163,4],[171,5,172,5],[171,6,171,7],[171,8,171,9],[176,1,176,7],[178,1,178,7],[171,0,172,0],[171,1,172,1],[171,2,172,2],[171,3,172,3],[171,4,172,4],[180,5,181,5],[180,6,180,7],[180,8,180,9],[185,1,185,7],[187,1,187,7],[180,0,181,0],[180,1,181,1],[180,2,181,2],[180,3,181,3],[180,4,181,4],[189,5,190,5],[189,6,189,7],[189,8,189,9],[194,1,194,7],[196,1,196,7],[189,0,190,0],[189,1,190,1],[189,2,190,2],[189,3,190,3],[189,4,190,4],[198,5,199,5],[198,6,198,7],[198,8,198,9],[203,1,203,7],[205,1,205,7],[198,0,199,0],[198,1,199,1],[198,2,199,2],[198,3,199,3],[198,4,199,4],[207,5,208,5],[207,6,207,7],[207,8,207,9],[212,1,212,7],[214,1,214,7],[207,0,208,0],[207,1,208,1],[207,2,208,2],[207,3,208,3],[207,4,208,4],[216,5,217,5],[216,6,216,7],[216,8,216,9],[220,1,220,7],[224,1,224,7],[216,0,217,0],[216,1,217,1],[216,2,217,2],[216,3,217,3],[216,4,217,4],[226,5,227,5],[226,6,226,7],[226,8,226,9],[230,1,230,7],[234,1,234,7],[226,0,227,0],[226,1,227,1],[226,2,227,2],[226,3,227,3],[226,4,227,4],[236,5,237,5],[236,6,236,7],[236,8,236,9],[240,1,240,7],[247,1,247,7],[236,0,237,0],[236,1,237,1],[236,2,237,2],[236,3,237,3],[236,4,237,4],[249,5,250,5],[249,6,249,7],[249,8,249,9],[253,1,253,7],[257,1,257,7],[249,0,250,0],[249,1,250,1],[249,2,250,2],[249,3,250,3],[249,4,250,4]]}
[]
[]
[]
["UNIDADE ESCOLAR",null,null,null,null,null,null,"CÓDIGO INEP"]
[{"$f":"Orçamento!$O$4","v":"ESCOLA ESTADUAL DOM EMANUEL"},null,null,null,null,null,null,{"$f":"Orçamento!$V$4","v":52063321}]
[]
["OBRA",null,null,null,null,null,null,"CIDADE"]
[{"$f":"Orçamento!$O$7","v":"REFORMA E AMPLIAÇÃO"},null,null,null,null,null,null,{"$f":"Orçamento!$V$7","v":"SILVÂNIA"}]
[]
["CRE",null,null,"ENDEREÇO",null,null,null,"REFERÊNCIA AGETOP"]
[{"$f":"Orçamento!$O$10","v":"CRE-SILVÂNIA"},null,null,{"$f":"Orçamento!$R$10","v":" AV DOM BOSCO , CENTRO , CEP: 7518-000"},null,null,null,{"$f":"Orçamento!$S$10","v":"ABR/19"},{"$f":"Orçamento!$T$10","v":"DESONERADA"}]
[]
["DATA",null,null,"ÁREA TOTAL CONSTRUÍDA (M²)",null,null,null,"REFERÊNCIA SINAPI"]
[{"$f":"Orçamento!$S$7","v":"2020-05-08"},null,null,{"$f":"Orçamento!$V$13","v":946.99},null,null,null,{"$f":"Orçamento!$V$10","v":"MAR/20"},{"$f":"Orçamento!$W$10","v":"DESONERADA"}]
[]
["COMPOSIÇÕES DE CUSTOS UNITÁRIOS - SEE-GO"]
[10,"FONTE","CÓDIGO","DESCRIÇÃO","UNIDADE","COEFIC.","CUSTO UNITÁRIO",null,"CUSTO  TOTAL (A) + (B) + (C) + (D) + (E)"]
[null,null,null,null,null,null,"DESONERADO","NÃO DESONER.","DESONERADO","NÃO DESONER."]
[null,"COMPOSIÇÃO","COMP 010_SEE","DEMOLIÇÃO DE GRADE/GRELHA/CORRIMÃO/GUARDA CORPO - METÁLICO","M2",null,"-","-",4.0599999999999996,4.71]
[null,null,null,"","",null,0,0,0,0]
[null,null,null,"","",null,0,0,0,0]
[null,null,null,"","",null,0,0,0,0]
[null,"MÃO DE OBRA (B) - TOTAL",null,null,null,null,null,null,0,0]
[null,"AGETOP",20106,"RETIRADA DE JANELAS OU PORTAIS C/ TRANSP. ATÉ CB. E CARGA","m2    ",1,4.0599999999999996,4.71,4.0599999999999996,4.71]
[null,null,null,"","",null,0,0,0,0]
[null,null,null,"","",null,0,0,0,0]
[null,"MATERIAL (C) - TOTAL",null,null,null,null,null,null,4.0599999999999996,4.71]
[]
[375,"FONTE","CÓDIGO","DESCRIÇÃO","UNIDADE","COEFIC.","CUSTO UNITÁRIO",null,"CUSTO  TOTAL (A) + (B) + (C) + (D) + (E)"]
[null,null,null,null,null,null,"DESONERADO","NÃO DESONER.","DESONERADO","NÃO DESONER."]
[null,"COMPOSIÇÃO","COMP 375_SEE","REFLETOR DE LED HOLOFORTE 50W","UN ",null,null,null,82.16,83.32]
[null,"AGETOP_I",12,"ELETRICISTA","h     ",0.41649999999999998,13.95,16.16,5.81,6.73]
[null,"AGETOP_I",8,"AJUDANTE","h     ",0.17349999999999999,8.75,10.14,1.52,1.76]
[null,"MÃO DE OBRA (B) - TOTAL",null,null,null,null,null,null,7.33,8.49]
[null,"COTAÇÃO","COT 190_SEE","REFLETOR DE LED HOLOFORTE 50W","UN",1,74.830000000000013,74.830000000000013,74.83,74.83]
[null,"MATERIAL (C) - TOTAL",null,null,null,null,null,null,74.83,74.83]
[]
[277,"FONTE","CÓDIGO","DESCRIÇÃO","UNIDADE","COEFIC.","CUSTO UNITÁRIO",null,"CUSTO  TOTAL (A) + (B) + (C) + (D) + (E)"]
[null,null,null,null,null,null,"DESONERADO","NÃO DESONER.","DESONERADO","NÃO DESONER."]
[null,"COMPOSIÇÃO","COMP 277_SEE","MARCAÇÃO NO PISO - 1X1 M PARA EXTINTOR","M2",null,null,null,29.67,29.75]
[null,"AGETOP_I",5,"SERVENTE","h     ",3.3300000000000003E-2,8.75,10.14,0.28999999999999998,0.34]
[null,"MÃO DE OBRA (B) - TOTAL",null,null,null,null,null,null,0.28999999999999998,0.34]
[null,"SINAPI_I",5318,"SOLVENTE DILUENTE A BASE DE AGUARRAS","L     ",0.13,11.78,11.78,1.53,1.53]
[null,"SINAPI",5824,"CAMINHÃO TOCO, PBT 16.000 KG, CARGA ÚTIL MÁX. 10.685 KG, DIST. ENTRE EIXOS 4,8 M, POTÊNCIA 189 CV, INCLUSIVE CARROCERIA FIXA ABERTA DE MADEIRA P/ TRANSPORTE GERAL DE CARGA SECA, DIMEN. APROX. 2,5 X 7,00 X 0,50 M - CHP DIURNO. AF_06/2014","CHP",3.3E-3,120.02,123.21,0.4,0.41]
[null,"SINAPI_I",7343,"TINTA A BASE DE RESINA ACRILICA, PARA SINALIZACAO HORIZONTAL VIARIA (NBR 11862)","L     ",0.6,12.82,12.82,7.69,7.69]
[null,"SINAPI_I",7348,"TINTA ACRILICA PREMIUM PARA PISO","L     ",0.03,13.72,13.72,0.41,0.41]
[null,"SINAPI_I",25972,"MICROESFERAS DE VIDRO PARA SINALIZACAO HORIZONTAL VIARIA, TIPO I-B (PREMIX) - NBR 16184","KG    ",2.14,8.8800000000000008,8.8800000000000008,19,19]
[null,"SINAPI",95133,"MÁQUINA DEMARCADORA DE FAIXA DE TRÁFEGO À FRIO, AUTOPROPELIDA, POTÊNCIA 38 HP - CHP DIURNO. AF_07/2016","CHP",3.3E-3,107.44,110.99,0.35,0.37]
[null,"MATERIAL (C) - TOTAL",null,null,null,null,null,null,29.380000000000003,29.41]
[]
[24,"FONTE","CÓDIGO","DESCRIÇÃO","UNIDADE","COEFIC.","CUSTO UNITÁRIO",null,"CUSTO  TOTAL (A) + (B) + (C) + (D) + (E)"]
[null,null,null,null,null,null,"DESONERADO","NÃO DESONER.","DESONERADO","NÃO DESONER."]
[null,"COMPOSIÇÃO","COMP 024_SEE","SINALIZADOR FOTOLUMINESCENTE PARA EXTINTOR","UN ",null,"-","-",25.319999999999997,25.439999999999998]
[null,"AGETOP_I",5,"SERVENTE","h     ",0.09,8.75,10.14,0.79,0.91]
[null,"MÃO DE OBRA (B) - TOTAL",null,null,null,null,null,null,0.79,0.91]
[null,"AGETOP_I",3070,"BUCHA DE NYLON S-6","un",2,0.04,0.04,0.08,0.08]
[null,"AGETOP_I",3393,"PARAFUSO P/BUCHA S-6","un",2,0.08,0.08,0.16,0.16]
[null,"SINAPI_I",37556,"PLACA DE SINALIZACAO DE SEGURANCA CONTRA INCENDIO, FOTOLUMINESCENTE, QUADRADA, *20 X 20* CM, EM PVC *2* MM ANTI-CHAMAS (SIMBOLOS, CORES E PICTOGRAMAS CONFORME NBR 13434)","UN    ",1,24.29,24.29,24.29,24.29]
[null,"MATERIAL (C) - TOTAL",null,null,null,null,null,null,24.529999999999998,24.529999999999998]
[]
[33,"FONTE","CÓDIGO","DESCRIÇÃO","UNIDADE","COEFIC.","CUSTO UNITÁRIO",null,"CUSTO  TOTAL (A) + (B) + (C) + (D) + (E)"]
[null,null,null,null,null,null,"DESONERADO","NÃO DESONER.","DESONERADO","NÃO DESONER."]
[null,"COMPOSIÇÃO","COMP 033_SEE","LUMINÁRIA DE EMERGÊNCIA LED PORTÁTIL - 30 LEDS","UN ",null,null,null,34.67,36.83]
[null,"AGETOP_I",8,"AJUDANTE","h     ",0.6,8.75,10.14,5.25,6.08]
[null,"AGETOP_I",12,"ELETRICISTA","h     ",0.6,13.95,16.16,8.3699999999999992,9.6999999999999993]
[null,"MÃO DE OBRA (B) - TOTAL",null,null,null,null,null,null,13.62,15.78]
[null,"SINAPI_I",38774,"LUMINARIA DE EMERGENCIA 30 LEDS, POTENCIA 2 W, BATERIA DE LITIO, AUTONOMIA DE 6 HORAS","UN    ",1,21.05,21.05,21.05,21.05]
[null,"MATERIAL (C) - TOTAL",null,null,null,null,null,null,21.05,21.05]
[]
[411,"FONTE","CÓDIGO","DESCRIÇÃO","UNIDADE","COEFIC.","CUSTO UNITÁRIO",null,"CUSTO  TOTAL (A) + (B) + (C) + (D) + (E)"]
[null,null,null,null,null,null,"DESONERADO","NÃO DESONER.","DESONERADO","NÃO DESONER."]
[null,"COMPOSIÇÃO","COMP 411_SEE","PLACA DE SINALIZAÇÃO EM PVC COD 13 - (316X158) SAÍDA DE EMERGÊNCIA","UN ",null,null,null,30.819999999999997,30.939999999999998]
[null,"AGETOP_I",5,"SERVENTE","h     ",0.09,8.75,10.14,0.79,0.91]
[null,"MÃO DE OBRA (B) - TOTAL",null,null,null,null,null,null,0.79,0.91]
[null,"AGETOP_I",3070,"BUCHA DE NYLON S-6","un",2,0.04,0.04,0.08,0.08]
[null,"AGETOP_I",3393,"PARAFUSO P/BUCHA S-6","un",2,0.08,0.08,0.16,0.16]
[null,"SINAPI_I",37559,"PLACA DE SINALIZACAO DE SEGURANCA CONTRA INCENDIO, FOTOLUMINESCENTE, RETANGULAR, *12 X 40* CM, EM PVC *2* MM ANTI-CHAMAS (SIMBOLOS, CORES E PICTOGRAMAS CONFORME NBR 13434)","UN    ",1,29.79,29.79,29.79,29.79]
[null,"MATERIAL (C) - TOTAL",null,null,null,null,null,null,30.029999999999998,30.029999999999998]
[]
[412,"FONTE","CÓDIGO","DESCRIÇÃO","UNIDADE","COEFIC.","CUSTO UNITÁRIO",null,"CUSTO  TOTAL (A) + (B) + (C) + (D) + (E)"]
[null,null,null,null,null,null,"DESONERADO","NÃO DESONER.","DESONERADO","NÃO DESONER."]
[null,"COMPOSIÇÃO","COMP 412_SEE","PLACA DE SINALIZAÇÃO EM PVC COD 17 - (316X158) MENSAGEM \"SAÍDA\"","UN ",null,null,null,30.819999999999997,30.939999999999998]
[null,"AGETOP_I",5,"SERVENTE","h     ",0.09,8.75,10.14,0.79,0.91]
[null,"MÃO DE OBRA (B) - TOTAL",null,null,null,null,null,null,0.79,0.91]
[null,"AGETOP_I",3070,"BUCHA DE NYLON S-6","un",2,0.04,0.04,0.08,0.08]
[null,"AGETOP_I",3393,"PARAFUSO P/BUCHA S-6","un",2,0.08,0.08,0.16,0.16]
[null,"SINAPI_I",37559,"PLACA DE SINALIZACAO DE SEGURANCA CONTRA INCENDIO, FOTOLUMINESCENTE, RETANGULAR, *12 X 40* CM, EM PVC *2* MM ANTI-CHAMAS (SIMBOLOS, CORES E PICTOGRAMAS CONFORME NBR 13434)","UN    ",1,29.79,29.79,29.79,29.79]
[null,"MATERIAL (C) - TOTAL",null,null,null,null,null,null,30.029999999999998,30.029999999999998]
[]
[51,"FONTE","CÓDIGO","DESCRIÇÃO","UNIDADE","COEFIC.","CUSTO UNITÁRIO",null,"CUSTO  TOTAL (A) + (B) + (C) + (D) + (E)"]
[null,null,null,null,null,null,"DESONERADO","NÃO DESONER.","DESONERADO","NÃO DESONER."]
[null,"COMPOSIÇÃO","COMP 051_SEE","PORTA PADRÃO SEDUC PF-01 REFORÇADA","M2",null,null,null,541.27,545.87]
[null,"AGETOP",180501,"PORTA DE ABRIR EM CHAPA PF-1 C/FERRAGENS","m2    ",1,457.81,462.41,457.81,462.41]
[null,"AGETOP",150204,"ESTRUTURA METÁLICA CONVENCIONAL EM AÇO DO TIPO MR-250 / ASTM A36 COM FUNDO ANTICORROSIVO","Kg    ",8.7857142857142847,9.5,9.5,83.46,83.46]
[null,"MÃO DE OBRA (B) - TOTAL",null,null,null,null,null,null,541.27,545.87]
[null,"MATERIAL (C) - TOTAL",null,null,null,null,null,null,0,0]
[]
[59,"FONTE","CÓDIGO","DESCRIÇÃO","UNIDADE","COEFIC.","CUSTO UNITÁRIO",null,"CUSTO  TOTAL (A) + (B) + (C) + (D) + (E)"]
[null,null,null,null,null,null,"DESONERADO","NÃO DESONER.","DESONERADO","NÃO DESONER."]
[null,"COMPOSIÇÃO","COMP 059_SEE","RETIRADA E RECOLOCAÇÃO DE JANELAS OU PORTAS - AGETOP","M2",null,null,null,38.29,43.87]
[null,"AGETOP_I",5,"SERVENTE","h     ",1.7336,8.75,10.14,15.17,17.579999999999998]
[null,"AGETOP_I",4,"PEDREIRO","h     ",1.4330000000000001,13.95,16.16,19.989999999999998,23.16]
[null,null,null,"","",null,0,0,0,0]
[null,"MÃO DE OBRA (B) - TOTAL",null,null,null,null,null,null,35.159999999999997,40.739999999999995]
[null,"AGETOP_I",104,"AREIA MEDIA ","m3",1.43E-2,82.85,82.85,1.18,1.18]
[null,"AGETOP_I",1215,"CIMENTO PORTLAND C.P. 32","Kg",5,0.39,0.39,1.95,1.95]
[null,null,null,"","",null,0,0,0,0]
[null,"MATERIAL (C) - TOTAL",null,null,null,null,null,null,3.13,3.13]
[]
[7,"FONTE","CÓDIGO","DESCRIÇÃO","UNIDADE","COEFIC.","CUSTO UNITÁRIO",null,"CUSTO  TOTAL (A) + (B) + (C) + (D) + (E)"]
[null,null,null,null,null,null,"DESONERADO","NÃO DESONER.","DESONERADO","NÃO DESONER."]
[null,"COMPOSIÇÃO","COMP 007_SEE","GUICHÊ CANTONEIRA/GRADE PARA VIDRO","M²","-","-","-",229.98999999999998,236.89999999999998]
[null,"AGETOP_I",4,"PEDREIRO","h     ",2.5,13.95,16.16,34.880000000000003,40.4]
[null,"AGETOP_I",5,"SERVENTE","h     ",1,8.75,10.14,8.75,10.14]
[null,"MÃO DE OBRA (B) - TOTAL",null,null,null,null,null,null,43.63,50.54]
[null,"AGETOP_I",104,"AREIA MEDIA ","m3",9.7000000000000003E-3,82.85,82.85,0.8,0.8]
[null,"AGETOP_I",1221,"CAL HIDRATADA","Kg",0.73,0.54,0.54,0.39,0.39]
[null,"AGETOP_I",1215,"CIMENTO PORTLAND C.P. 32","Kg",2.67,0.39,0.39,1.04,1.04]
[null,"AGETOP_I",2470,"FERRO CANTONEIRA 1/8\" X 7/8\"","Kg",3.5478000000000001,4.3899999999999997,4.3899999999999997,15.57,15.57]
[null,"AGETOP_I",2423,"FERRO CANTONEIRA 1/8\" X 3/4\"","Kg",7.9390000000000001,4.87,4.87,38.659999999999997,38.659999999999997]
[null,"AGETOP_I",2372,"CHAPA PERFILADA No. 18","Kg",13.320600000000001,5.42,5.42,72.2,72.2]
[null,"SINAPI_I",11552,"PERFIL U / CANALETA DE ALUMINIO, DE ABAS IGUAIS, 1/2\" (1,27 X 1,27 CM), PARA PORTA OU JANELA DE CORRER","M     ",1.306,8.14,8.14,10.63,10.63]
[null,"AGETOP_I",2898,"FABRICAÇÃO / MONTAGEM","un",1,36.729999999999997,36.729999999999997,36.729999999999997,36.729999999999997]
[null,"AGETOP_I",2529,"FECHO FIO REDONDO 4\" ZINCADO C/PARAFUSO DA SOPRANO OU EQUIVALENTE","un",2,5.17,5.17,10.34,10.34]
[null,"MATERIAL (C) - TOTAL",null,null,null,null,null,null,186.35999999999999,186.35999999999999]
[]
[83,"FONTE","CÓDIGO","DESCRIÇÃO","UNIDADE","COEFIC.","CUSTO UNITÁRIO",null,"CUSTO  TOTAL (A) + (B) + (C) + (D) + (E)"]
[null,null,null,null,null,null,"DESONERADO","NÃO DESONER.","DESONERADO","NÃO DESONER."]
[null,"COMPOSIÇÃO","COMP 083_SEE","CORRIMÃO PISO - SEDUC","M",null,null,null,143.18,147.41000000000003]
[null,"AGETOP_I",25,"OFICIAL \"B\"","h     ",1,13.95,16.16,13.95,16.16]
[null,"AGETOP_I",8,"AJUDANTE","h     ",1,8.75,10.14,8.75,10.14]
[null,"MÃO DE OBRA (B) - TOTAL",null,null,null,null,null,null,22.7,26.3]
[null,"AGETOP_I",2376,"TUBO INDUSTRIAL 2\" CHAPA 13 ","Kg",8.2197499999999994,5.23,5.23,42.99,42.99]
[null,"AGETOP_I",2504,"TUBO INDUSTRIAL D=25 MM CHAPA 13 ","Kg",1.1000000000000001,5.07,5.07,5.58,5.58]
[null,"AGETOP_I",2417,"MASSA PLASTICA","Kg",0.2041,10.58,10.58,2.16,2.16]
[null,"AGETOP_I",2246,"ELETRODO 2.5 OK","Kg",0.11459999999999999,8.6999999999999993,8.6999999999999993,1,1]
[null,"AGETOP_I",1672,"LIXA PARA FERRO ( NÚMERO 100 )","un",0.125,2.12,2.12,0.27,0.27]
[null,"AGETOP_I",1264,"DISCO DE DESBASTE 7/8\" P/ CONC./FERRO (1/4\" X 7\")","un",2.5000000000000001E-2,7,7,0.18,0.18]
[null,"AGETOP_I",1334,"DISCO DE CORTE DIAM. 5/8\"- 10\"","un",0.1865,5.5,5.5,1.03,1.03]
[null,"AGETOP_I",2902,"FABRICAÇÃO / MONTAGEM","un",1,50.44,50.44,50.44,50.44]
[null,"AGETOP_I",2150,"CHAPA DE FERRO DOBRADA No.13","Kg",0.43519999999999998,5.28,5.28,2.2999999999999998,2.2999999999999998]
[null,"AGETOP_I",2719,"CHAPA PERFILADA 3/16\"","Kg",1.1644000000000001,5.04,5.04,5.87,5.87]
[null,"AGETOP_I",2436,"ACO CA-25 - 6,3 MM (1/4\") - BARRA LISA A-36","Kg",0.48150000000000004,5.13,5.13,2.4700000000000002,2.4700000000000002]
[null,"AGETOP",261602,"PINT.ESMALTE/ESQUAD.FERRO C/FUNDO ANTICOR.","m2    ",0.44,14.07,15.51,6.19,6.82]
[null,"MATERIAL (C) - TOTAL",null,null,null,null,null,null,120.48,121.11000000000001]
[]
[27,"FONTE","CÓDIGO","DESCRIÇÃO","UNIDADE","COEFIC.","CUSTO UNITÁRIO",null,"CUSTO  TOTAL (A) + (B) + (C) + (D) + (E)"]
[null,null,null,null,null,null,"DESONERADO","NÃO DESONER.","DESONERADO","NÃO DESONER."]
[null,"COMPOSIÇÃO","COMP 027_SEE","TELA MOSQUITEIRA EM NYLON COM ESTRUTURA DE ALUMÍNIO, COM FORNECIMENTO DE MÃO DE OBRA E INSTALAÇÃO","M2",null,null,null,123.21,123.21]
[null,"MÃO DE OBRA (B) - TOTAL",null,null,null,null,null,null,0,0]
[null,"COTAÇÃO","COT 002_SEE","TELA MOSQUITEIRA EM NYLON COM ESTRUTURA DE ALUMÍNIO [M²], COM FORNECIMENTO DE MÃO DE OBRA E INSTALAÇÃO","M2",1,123.21333333333332,123.21333333333332,123.21,123.21]
[null,"MATERIAL (C) - TOTAL",null,null,null,null,null,null,123.21,123.21]
[]
[575,"FONTE","CÓDIGO","DESCRIÇÃO","UNID ","COEFIC.","CUSTO UNITÁRIO",null,"CUSTO  TOTAL (A) + (B) + (C) + (D) + (E)"]
[null,null,null,null,null,null,"DESONERADO","NÃO DESONER.","DESONERADO","NÃO DESONER."]
[null,"COMPOSIÇÃO","COMP 575_SEE","MOLA AEREA FECHA PORTA, PARA PORTAS COM LARGURA ATE 95 CM","UN ","-","-","-",121.89,122.76]
[null,"AGETOP_I",5,"SERVENTE","h     ",0.15,8.75,10.14,1.31,1.52]
[null,"AGETOP_I",24,"MARCENEIRO","h     ",0.3,13.95,16.16,4.1900000000000004,4.8499999999999996]
[null,"MÃO DE OBRA (B) - TOTAL",null,null,null,null,null,null,5.5,6.3699999999999992]
[null,"SINAPI_I",11560,"MOLA AEREA FECHA PORTA, PARA PORTAS COM LARGURA ATE 95 CM","UN    ",1,116.39,116.39,116.39,116.39]
[null,"MATERIAL (C) - TOTAL",null,null,null,null,null,null,116.39,116.39]
[]
[387,"FONTE","CÓDIGO","DESCRIÇÃO","UNIDADE","COEFIC.","CUSTO UNITÁRIO",null,"CUSTO  TOTAL (A) + (B) + (C) + (D) + (E)"]
[null,null,null,null,null,null,"DESONERADO","NÃO DESONER.","DESONERADO","NÃO DESONER."]
[null,"COMPOSIÇÃO","COMP 387_SEE","LÂMPADA LED TUBULAR 18W ","UN ",null,null,null,22.3,22.35]
[null,"AGETOP_I",8,"AJUDANTE","h     ",1.4999999999999999E-2,8.75,10.14,0.13,0.15]
[null,"AGETOP_I",12,"ELETRICISTA","h     ",1.4999999999999999E-2,13.95,16.16,0.21,0.24]
[null,"MÃO DE OBRA (B) - TOTAL",null,null,null,null,null,null,0.33999999999999997,0.39]
[null,"COTAÇÃO","COT 195_SEE","LÂMPADA LED TUBULAR 18W ","UN",1,21.959999999999997,21.959999999999997,21.96,21.96]
[null,"MATERIAL (C) - TOTAL",null,null,null,null,null,null,21.96,21.96]
[]
[34,"FONTE","CÓDIGO","DESCRIÇÃO","UNIDADE","COEFIC.","CUSTO UNITÁRIO",null,"CUSTO  TOTAL (A) + (B) + (C) + (D) + (E)"]
[null,null,null,null,null,null,"DESONERADO","NÃO DESONER.","DESONERADO","NÃO DESONER."]
[null,"COMPOSIÇÃO","COMP 034_SEE","TERMINAL AÉREO SPDA 30CM Fo Go DIAM. 5/16\" COM SUPORTE","UN ",null,null,null,16.259999999999998,17.329999999999998]
[null,"AGETOP_I",8,"AJUDANTE","h     ",0.3,8.75,10.14,2.63,3.04]
[null,"AGETOP_I",12,"ELETRICISTA","h     ",0.3,13.95,16.16,4.1900000000000004,4.8499999999999996]
[null,"MÃO DE OBRA (B) - TOTAL",null,null,null,null,null,null,6.82,7.89]
[null,"SINAPI_I",7571,"TERMINAL AEREO EM ACO GALVANIZADO DN 5/16\", COMPRIMENTO DE 350MM, COM BASE DE FIXACAO HORIZONTAL","UN    ",1,9.44,9.44,9.44,9.44]
[null,"MATERIAL (C) - TOTAL",null,null,null,null,null,null,9.44,9.44]
[]
[36,"FONTE","CÓDIGO","DESCRIÇÃO","UNIDADE","COEFIC.","CUSTO UNITÁRIO",null,"CUSTO  TOTAL (A) + (B) + (C) + (D) + (E)"]
[null,null,null,null,null,null,"DESONERADO","NÃO DESONER.","DESONERADO","NÃO DESONER."]
[null,"COMPOSIÇÃO","COMP 036_SEE","PRESILHA LATÃO 16/35MM 5MM+PARAF FENDA ","UN ",null,null,null,3.03,3.33]
[null,"AGETOP_I",8,"AJUDANTE","h     ",8.3299999999999999E-2,8.75,10.14,0.73,0.84]
[null,"AGETOP_I",12,"ELETRICISTA","h     ",8.3299999999999999E-2,13.95,16.16,1.1599999999999999,1.35]
[null,"MÃO DE OBRA (B) - TOTAL",null,null,null,null,null,null,1.89,2.19]
[null,"COTAÇÃO","COT 004_SEE","PRESILHA LATÃO 16/35MM 5MM+PARAF FENDA 1/4''X1.1/4''","UN ",1,1.1433333333333333,1.1433333333333333,1.1399999999999999,1.1399999999999999]
[null,"MATERIAL (C) - TOTAL",null,null,null,null,null,null,1.1399999999999999,1.1399999999999999]
[]
[39,"FONTE","CÓDIGO","DESCRIÇÃO","UNIDADE","COEFIC.","CUSTO UNITÁRIO",null,"CUSTO  TOTAL (A) + (B) + (C) + (D) + (E)"]
[null,null,null,null,null,null,"DESONERADO","NÃO DESONER.","DESONERADO","NÃO DESONER."]
[null,"COMPOSIÇÃO","COMP 039_SEE","MOLDE GRAF CGT 5/8 50MM C","UN ",null,null,null,139.47,139.6]
[null,"AGETOP_I",8,"AJUDANTE","h     ",3.3300000000000003E-2,8.75,10.14,0.28999999999999998,0.34]
[null,"AGETOP_I",12,"ELETRICISTA","h     ",3.3300000000000003E-2,13.95,16.16,0.46,0.54]
[null,"MÃO DE OBRA (B) - TOTAL",null,null,null,null,null,null,0.75,0.88000000000000012]
[null,"COTAÇÃO","COT 007_SEE","MOLDE GRAF CGT 5/8 50MM C","UN",1,138.7175,138.7175,138.72,138.72]
[null,"MATERIAL (C) - TOTAL",null,null,null,null,null,null,138.72,138.72]
[]
[550,"FONTE","CÓDIGO","DESCRIÇÃO","UNID ","COEFIC.","CUSTO UNITÁRIO",null,"CUSTO  TOTAL (A) + (B) + (C) + (D) + (E)"]
[null,null,null,null,null,null,"DESONERADO","NÃO DESONER.","DESONERADO","NÃO DESONER."]
[null,"COMPOSIÇÃO","COMP 550_SEE","ALIC P/MOLDE C-84","UN ","-","-","-",88.22,88.35]
[null,"AGETOP_I",8,"AJUDANTE","h     ",3.3300000000000003E-2,8.75,10.14,0.28999999999999998,0.34]
[null,"AGETOP_I",12,"ELETRICISTA","h     ",3.3300000000000003E-2,13.95,16.16,0.46,0.54]
[null,"MÃO DE OBRA (B) - TOTAL",null,null,null,null,null,null,0.75,0.88000000000000012]
[null,"COTAÇÃO","COT 292_SEE","ALIC P/MOLDE C-84","UN ",1,87.465000000000003,87.465000000000003,87.47,87.47]
[null,"MATERIAL (C) - TOTAL",null,null,null,null,null,null,87.47,87.47]
[]
[48,"FONTE","CÓDIGO","DESCRIÇÃO","UNIDADE","COEFIC.","CUSTO UNITÁRIO",null,"CUSTO  TOTAL (A) + (B) + (C) + (D) + (E)"]
[null,null,null,null,null,null,"DESONERADO","NÃO DESONER.","DESONERADO","NÃO DESONER."]
[null,"COMPOSIÇÃO","COMP 048_SEE","HASTE ROSQUEADA \"TIRANTE\" 3/8\"","M",null,null,null,14.46,15.899999999999999]
[null,"AGETOP_I",8,"AJUDANTE","h     ",0.4,8.75,10.14,3.5,4.0599999999999996]
[null,"AGETOP_I",12,"ELETRICISTA","h     ",0.4,13.95,16.16,5.58,6.46]
[null,"MÃO DE OBRA (B) - TOTAL",null,null,null,null,null,null,9.08,10.52]
[null,"COTAÇÃO","COT 012_SEE","HASTE ROSQUEADA \"TIRANTE\" 3/8\"","M",1,5.3833333333333329,5.3833333333333329,5.38,5.38]
[null,"MATERIAL (C) - TOTAL",null,null,null,null,null,null,5.38,5.38]
[]
[24,"FONTE","CÓDIGO","DESCRIÇÃO","UNIDADE","COEFIC.","CUSTO UNITÁRIO",null,"CUSTO  TOTAL (A) + (B) + (C) + (D) + (E)"]
[null,null,null,null,null,null,"DESONERADO","NÃO DESONER.","DESONERADO","NÃO DESONER."]
[null,"COMPOSIÇÃO","COMP 024_SEE","SINALIZADOR FOTOLUMINESCENTE PARA EXTINTOR","UN ",null,"-","-",25.319999999999997,25.439999999999998]
[null,"AGETOP_I",5,"SERVENTE","h     ",0.09,8.75,10.14,0.79,0.91]
[null,"MÃO DE OBRA (B) - TOTAL",null,null,null,null,null,null,0.79,0.91]
[null,"AGETOP_I",3070,"BUCHA DE NYLON S-6","un",2,0.04,0.04,0.08,0.08]
[null,"AGETOP_I",3393,"PARAFUSO P/BUCHA S-6","un",2,0.08,0.08,0.16,0.16]
[null,"SINAPI_I",37556,"PLACA DE SINALIZACAO DE SEGURANCA CONTRA INCENDIO, FOTOLUMINESCENTE, QUADRADA, *20 X 20* CM, EM PVC *2* MM ANTI-CHAMAS (SIMBOLOS, CORES E PICTOGRAMAS CONFORME NBR 13434)","UN    ",1,24.29,24.29,24.29,24.29]
[null,"MATERIAL (C) - TOTAL",null,null,null,null,null,null,24.529999999999998,24.529999999999998]
[]
[25,"FONTE","CÓDIGO","DESCRIÇÃO","UNIDADE","COEFIC.","CUSTO UNITÁRIO",null,"CUSTO  TOTAL (A) + (B) + (C) + (D) + (E)"]
[null,null,null,null,null,null,"DESONERADO","NÃO DESONER.","DESONERADO","NÃO DESONER."]
[null,"COMPOSIÇÃO","COMP 025_SEE","SINALIZADOR FOTOLUMINESCENTE DE EMERGÊNCIA","UN ",null,"-","-",25.319999999999997,25.439999999999998]
[null,"AGETOP_I",5,"SERVENTE","h     ",0.09,8.75,10.14,0.79,0.91]
[null,"MÃO DE OBRA (B) - TOTAL",null,null,null,null,null,null,0.79,0.91]
[null,"AGETOP_I",3070,"BUCHA DE NYLON S-6","un",2,0.04,0.04,0.08,0.08]
[null,"AGETOP_I",3393,"PARAFUSO P/BUCHA S-6","un",2,0.08,0.08,0.16,0.16]
[null,"SINAPI_I",37556,"PLACA DE SINALIZACAO DE SEGURANCA CONTRA INCENDIO, FOTOLUMINESCENTE, QUADRADA, *20 X 20* CM, EM PVC *2* MM ANTI-CHAMAS (SIMBOLOS, CORES E PICTOGRAMAS CONFORME NBR 13434)","UN    ",1,24.29,24.29,24.29,24.29]
[null,"MATERIAL (C) - TOTAL",null,null,null,null,null,null,24.529999999999998,24.529999999999998]
[]
[277,"FONTE","CÓDIGO","DESCRIÇÃO","UNIDADE","COEFIC.","CUSTO UNITÁRIO",null,"CUSTO  TOTAL (A) + (B) + (C) + (D) + (E)"]
[null,null,null,null,null,null,"DESONERADO","NÃO DESONER.","DESONERADO","NÃO DESONER."]
[null,"COMPOSIÇÃO","COMP 277_SEE","MARCAÇÃO NO PISO - 1X1 M PARA EXTINTOR","M2",null,null,null,29.67,29.75]
[null,"AGETOP_I",5,"SERVENTE","h     ",3.3300000000000003E-2,8.75,10.14,0.28999999999999998,0.34]
[null,"MÃO DE OBRA (B) - TOTAL",null,null,null,null,null,null,0.28999999999999998,0.34]
[null,"SINAPI_I",5318,"SOLVENTE DILUENTE A BASE DE AGUARRAS","L     ",0.13,11.78,11.78,1.53,1.53]
[null,"SINAPI",5824,"CAMINHÃO TOCO, PBT 16.000 KG, CARGA ÚTIL MÁX. 10.685 KG, DIST. ENTRE EIXOS 4,8 M, POTÊNCIA 189 CV, INCLUSIVE CARROCERIA FIXA ABERTA DE MADEIRA P/ TRANSPORTE GERAL DE CARGA SECA, DIMEN. APROX. 2,5 X 7,00 X 0,50 M - CHP DIURNO. AF_06/2014","CHP",3.3E-3,120.02,123.21,0.4,0.41]
[null,"SINAPI_I",7343,"TINTA A BASE DE RESINA ACRILICA, PARA SINALIZACAO HORIZONTAL VIARIA (NBR 11862)","L     ",0.6,12.82,12.82,7.69,7.69]
[null,"SINAPI_I",7348,"TINTA ACRILICA PREMIUM PARA PISO","L     ",0.03,13.72,13.72,0.41,0.41]
[null,"SINAPI_I",25972,"MICROESFERAS DE VIDRO PARA SINALIZACAO HORIZONTAL VIARIA, TIPO I-B (PREMIX) - NBR 16184","KG    ",2.14,8.8800000000000008,8.8800000000000008,19,19]
[null,"SINAPI",95133,"MÁQUINA DEMARCADORA DE FAIXA DE TRÁFEGO À FRIO, AUTOPROPELIDA, POTÊNCIA 38 HP - CHP DIURNO. AF_07/2016","CHP",3.3E-3,107.44,110.99,0.35,0.37]
[null,"MATERIAL (C) - TOTAL",null,null,null,null,null,null,29.380000000000003,29.41]
[]
[412,"FONTE","CÓDIGO","DESCRIÇÃO","UNIDADE","COEFIC.","CUSTO UNITÁRIO",null,"CUSTO  TOTAL (A) + (B) + (C) + (D) + (E)"]
[null,null,null,null,null,null,"DESONERADO","NÃO DESONER.","DESONERADO","NÃO DESONER."]
[null,"COMPOSIÇÃO","COMP 412_SEE","PLACA DE SINALIZAÇÃO EM PVC COD 17 - (316X158) MENSAGEM \"SAÍDA\"","UN ",null,null,null,30.819999999999997,30.939999999999998]
[null,"AGETOP_I",5,"SERVENTE","h     ",0.09,8.75,10.14,0.79,0.91]
[null,"MÃO DE OBRA (B) - TOTAL",null,null,null,null,null,null,0.79,0.91]
[null,"AGETOP_I",3070,"BUCHA DE NYLON S-6","un",2,0.04,0.04,0.08,0.08]
[null,"AGETOP_I",3393,"PARAFUSO P/BUCHA S-6","un",2,0.08,0.08,0.16,0.16]
[null,"SINAPI_I",37559,"PLACA DE SINALIZACAO DE SEGURANCA CONTRA INCENDIO, FOTOLUMINESCENTE, RETANGULAR, *12 X 40* CM, EM PVC *2* MM ANTI-CHAMAS (SIMBOLOS, CORES E PICTOGRAMAS CONFORME NBR 13434)","UN    ",1,29.79,29.79,29.79,29.79]
[null,"MATERIAL (C) - TOTAL",null,null,null,null,null,null,30.029999999999998,30.029999999999998]