{"text_format":"1","workbook":"xlsx","n_sheets":8,"sheets":["Orçamento","Resumo ","Somatório","Cronog_30_Dias","Composição BDI","Relatório CENTRAL","Parc Maior Relev","Composições"],"not_rendered":{"charts":0,"images":4,"macros":1,"external_links":0,"defined_names":104,"comments":3,"pivot_tables":0},"unopened":[],"bounds":{"document_bytes":16777216,"sheet_cells":100000,"rows_first":2000,"rows_last":500,"rows_between":2000,"halvings":0,"cell_chars":16384,"cell_head_chars":4096},"cells_cut":0,"cells_raw":0,"read":"whole","date_system":"1900"}

{"sheet":"Orçamento","index":0,"n_rows":401,"n_cols":27,"rows_kept":401,"cut":false,"hidden":false,"merged":[[381,15,381,17],[381,18,381,22],[375,14,375,26],[376,18,376,22],[377,15,377,17],[377,18,377,22],[362,15,362,17],[394,23,394,25],[395,23,395,25],[396,23,396,25],[397,23,397,25],[398,23,398,25],[399,23,399,25],[400,23,400,25],[369,14,369,17],[376,15,376,17],[400,18,400,22],[399,18,399,22],[398,18,398,22],[370,23,370,25],[391,23,391,25],[392,23,392,25],[393,23,393,25],[376,23,376,25],[377,23,377,25],[378,23,378,25],[379,23,379,25],[380,23,380,25],[381,23,381,25],[382,23,382,25],[383,23,383,25],[342,15,342,17],[397,18,397,22],[385,15,385,17],[385,18,385,22],[386,15,386,17],[386,18,386,22],[387,15,387,17],[387,18,387,22],[391,15,391,17],[391,18,391,22],[392,15,392,17],[392,18,392,22],[393,15,393,17],[382,15,382,17],[397,14,397,17],[394,15,394,17],[394,18,394,22],[395,15,395,17],[395,18,395,22],[396,15,396,17],[396,18,396,22],[349,15,349,17],[350,15,350,17],[351,15,351,17],[0,14,0,26],[333,16,333,24],[334,16,334,24],[335,16,335,24],[11,14,11,26],[14,14,14,26],[3,14,3,22],[4,14,4,22],[6,18,6,22],[7,18,7,22],[12,18,12,22],[13,18,13,22],[7,14,7,17],[6,14,6,17],[4,23,4,25],[3,23,3,25],[6,23,6,25],[7,23,7,25],[9,18,9,20],[325,17,330,17],[331,22,331,24],[325,22,325,24],[326,22,326,24],[327,22,327,24],[336,16,336,24],[342,23,342,25],[358,23,358,25],[359,23,359,25],[378,15,378,17],[378,18,378,22],[337,16,337,24],[355,15,355,17],[356,15,356,17],[341,14,341,26],[342,18,342,22],[343,18,343,22],[351,18,351,22],[352,18,352,22],[353,18,353,22],[354,18,354,22],[366,18,366,22],[363,15,363,17],[343,15,343,17],[344,15,344,17],[345,15,345,17],[346,15,346,17],[347,15,347,17],[348,15,348,17],[360,23,360,25],[361,23,361,25],[359,15,359,17],[360,15,360,17],[361,15,361,17],[362,23,362,25],[357,15,357,17],[358,15,358,17],[356,23,356,25],[357,23,357,25],[355,23,355,25],[372,18,372,22],[348,18,348,22],[349,18,349,22],[347,18,347,22],[356,18,356,22],[338,18,338,24],[344,18,344,22],[345,18,345,22],[346,18,346,22],[369,18,369,22],[367,18,367,22],[368,18,368,22],[358,18,358,22],[365,18,365,22],[361,18,361,22],[363,18,363,22],[359,18,359,22],[360,18,360,22],[369,23,369,25],[363,23,363,25],[364,23,364,25],[365,23,365,25],[366,23,366,25],[355,18,355,22],[352,15,352,17],[353,15,353,17],[354,15,354,17],[364,18,364,22],[362,18,362,22],[370,18,370,22],[357,18,357,22],[350,18,350,22],[364,15,364,17],[365,15,365,17],[367,15,367,17],[368,15,368,17],[1,14,1,24],[9,14,9,16],[10,14,10,16],[12,14,12,16],[13,14,13,16],[15,14,15,24],[2,14,2,24],[5,14,5,24],[8,14,8,24],[10,24,10,25],[9,23,9,25],[387,23,387,25],[388,23,388,25],[389,23,389,25],[390,23,390,25],[366,15,366,17],[371,23,371,25],[372,23,372,25],[367,23,367,25],[371,18,371,22],[388,15,388,17],[388,18,388,22],[389,15,389,17],[389,18,389,22],[390,15,390,17],[390,18,390,22],[382,18,382,22],[383,15,383,17],[383,18,383,22],[384,15,384,17],[384,18,384,22],[379,15,379,17],[379,18,379,22],[380,15,380,17],[380,18,380,22],[393,18,393,22],[329,22,329,24],[330,22,330,24],[7,12,7,13],[6,12,6,13],[13,23,13,25],[12,23,12,25],[10,19,10,22],[368,23,368,25],[343,23,343,25],[344,23,344,25],[345,23,345,25],[346,23,346,25],[347,23,347,25],[348,23,348,25],[349,23,349,25],[350,23,350,25],[351,23,351,25],[352,23,352,25],[353,23,353,25],[354,23,354,25],[384,23,384,25],[385,23,385,25],[386,23,386,25]]}
[]
[]
[]
[null,null,null,null,null,null,null,null,null,null,null,null,null,null,"UNIDADE ESCOLAR",null,null,null,null,null,null,null,null,"CÓDIGO INEP"]
[null,null,null,null,null,null,null,null,null,null,null,null,"",null,"COORDENAÇÃO REGIONAL DE EDUCAÇÃO DE FORMOSA",null,null,null,null,null,null,null,null,52073190]
[]
["Nmax",null,null,null,null,null,null,null,null,null,null,null,null,null,"OBRA",null,null,null,"DATA",null,null,null,null,"CIDADE"]
[{"$f":"MAX($C$19:$C$325)","v":4},null,null,null,null,null,null,null,null,null,null,null,null,null,"REFORMA E AMPLIAÇÃO",null,null,null,"2020-05-21",null,null,null,null,"FORMOSA"]
[]
[null,null,null,null,null,null,null,null,null,null,null,null,null,null,"CRE",null,null,"ENDEREÇO","REFERÊNCIA AGETOP",null,null,null,null,"REFERÊNCIA SINAPI"]
[null,null,null,null,null,null,null,null,null,null,null,null,null,null,"CRE-FORMOSA",null,null,"RUA PRESIDENTE VENCESLAU BRÁZ , S/N, BAIRRO PAMPULHA","ABR/19","DESONERADA",null,null,null,"MAR/20","DESONERADA"]
[]
[null,null,null,null,null,null,null,null,null,null,null,null,null,null,"ÁREA EXISTENTE (M²)",null,null,"ÁREA A CONSTRUIR (M²)","ÁREA A DEMOLIR (M²)",null,null,null,null,"ÁREA TOTAL CONSTRUÍDA (M²)"]
[null,null,null,null,null,null,null,null,null,null,null,null,null,null,544.26,null,null,30.24,null,null,null,null,null,574.5]
[]
[null,null,null,null,null,null,null,null,null,null,null,"FILTRO",null,null,"PLANILHA ORÇAMENTÁRIA"]
["Nível E","Save Nivel","Nível C","Altura","n1","n2","n3","n4","n5","Czero","Cnível","↓","Nível","Nível Corrigido","ITEM","TABELA","CODIGO","DESCRIÇÃO DOS SERVIÇOS","UNID","QUANT","REPET","QUANT TOTAL","MAT","MO","T.SERVIÇO UNIT","VALOR TOTAL","OBSERVAÇÕES¹"]
[{"$f":"CHOOSE(1+LOG(1+2*(ORÇAMENTO.Nivel=\"Nível 1\")+4*(ORÇAMENTO.Nivel=\"Nível 2\")+8*(ORÇAMENTO.Nivel=\"Nível 3\")+16*(ORÇAMENTO.Nivel=\"Nível 4\")+32*(ORÇAMENTO.Nivel=\"Serviço\"),2),0,1,2,3,4,\"S\")","v":"S"},{"$f":"IF(OR(C18=\"s\",C18=0),OFFSET(B18,-1,0),C18)","v":"Save Nivel"},{"$f":"IF(OFFSET(C18,-1,0)=\"L\",1,IF(OFFSET(C18,-1,0)=1,2,IF(OR(A18=\"s\",A18=0),\"S\",IF(AND(OFFSET(C18,-1,0)=2,A18=4),3,IF(AND(OR(OFFSET(C18,-1,0)=\"s\",OFFSET(C18,-1,0)=0),A18<>\"s\",A18>OFFSET(B18,-1,0)),OFFSET(B18,-1,0),A18)))))","v":"S"},{"$f":"IF(OR(C18=\"S\",C18=0),0,IF(ISERROR(K18),J18,SMALL(J18:K18,1)))","v":0},{"$f":"IF($C18=1,OFFSET(E18,-1,0)+1,OFFSET(E18,-1,0))","v":"n1"},{"$f":"IF($C18=1,0,IF($C18=2,OFFSET(F18,-1,0)+1,OFFSET(F18,-1,0)))","v":"n2"},{"$f":"IF(AND($C18<=2,$C18<>0),0,IF($C18=3,OFFSET(G18,-1,0)+1,OFFSET(G18,-1,0)))","v":"n3"},{"$f":"IF(AND($C18<=3,$C18<>0),0,IF($C18=4,OFFSET(H18,-1,0)+1,OFFSET(H18,-1,0)))","v":"n4"},{"$f":"IF(AND($C18<=4,$C18<>0),0,IF(AND($C18=\"S\",$Y18>0),OFFSET(I18,-1,0)+1,OFFSET(I18,-1,0)))","v":"n5"},{"$f":"IF(OR($C18=\"S\",$C18=0),0,MATCH(0,OFFSET($D18,1,$C18,ROW($C$325)-ROW($C18)),0))","v":0},{"$f":"IF(OR($C18=\"S\",$C18=0),0,MATCH(OFFSET($D18,0,$C18)+1,OFFSET($D18,1,$C18,ROW($C$325)-ROW($C18)),0))","v":0},"","Serviço","Serviço","-","SINAPI",null,"(sem código)","-",null,"REPET","-",0,0,0,"-",""]
[0,null,"L",{"$f":"COUNTA(OFFSET(D19,1,0):D$325)","v":305},{"$f":"LEFT(O20,1)-1","v":0},null,null,null,null,null,null,"F","LOTE","LOTE","REFORMA E AMPLIAÇÃO - COORDENAÇÃO REGIONAL DE EDUCAÇÃO DE FORMOSA",null,null,null,null,null,null,null,null,null,null,0]
[1,{"$f":"IF(OR(C20=\"s\",C20=0),OFFSET(B20,-1,0),C20)","v":1},{"$f":"IF(OFFSET(C20,-1,0)=\"L\",1,IF(OFFSET(C20,-1,0)=1,2,IF(OR(A20=\"s\",A20=0),\"S\",IF(AND(OFFSET(C20,-1,0)=2,A20=4),3,IF(AND(OR(OFFSET(C20,-1,0)=\"s\",OFFSET(C20,-1,0)=0),A20<>\"s\",A20>OFFSET(B20,-1,0)),OFFSET(B20,-1,0),A20)))))","v":1},{"$f":"IF(OR(C20=\"S\",C20=0),0,IF(ISERROR(K20),J20,SMALL(J20:K20,1)))","v":36},{"$f":"IF($C20=1,OFFSET(E20,-1,0)+1,OFFSET(E20,-1,0))","v":1},{"$f":"IF($C20=1,0,IF($C20=2,OFFSET(F20,-1,0)+1,OFFSET(F20,-1,0)))","v":0},{"$f":"IF(AND($C20<=2,$C20<>0),0,IF($C20=3,OFFSET(G20,-1,0)+1,OFFSET(G20,-1,0)))","v":0},{"$f":"IF(AND($C20<=3,$C20<>0),0,IF($C20=4,OFFSET(H20,-1,0)+1,OFFSET(H20,-1,0)))","v":0},0,{"$f":"IF(OR($C20=\"S\",$C20=0),0,MATCH(0,OFFSET($D20,1,$C20,ROW($C$325)-ROW($C20)),0))","v":305},{"$f":"IF(OR($C20=\"S\",$C20=0),0,MATCH(OFFSET($D20,0,$C20)+1,OFFSET($D20,1,$C20,ROW($C$325)-ROW($C20)),0))","v":36},"F","Nível 1","Nível 1","1.","AGETOP",null,"PASSARELA MODELO 1 PADRÃO SEC. XXII","UN",1,1,1,null,null,0,0]
[2,2,{"$f":"IF(OFFSET(C21,-1,0)=\"L\",1,IF(OFFSET(C21,-1,0)=1,2,IF(OR(A21=\"s\",A21=0),\"S\",IF(AND(OFFSET(C21,-1,0)=2,A21=4),3,IF(AND(OR(OFFSET(C21,-1,0)=\"s\",OFFSET(C21,-1,0)=0),A21<>\"s\",A21>OFFSET(B21,-1,0)),OFFSET(B21,-1,0),A21)))))","v":2},2,{"$f":"IF($C21=1,OFFSET(E21,-1,0)+1,OFFSET(E21,-1,0))","v":1},{"$f":"IF($C21=1,0,IF($C21=2,OFFSET(F21,-1,0)+1,OFFSET(F21,-1,0)))","v":1},{"$f":"IF(AND($C21<=2,$C21<>0),0,IF($C21=3,OFFSET(G21,-1,0)+1,OFFSET(G21,-1,0)))","v":0},{"$f":"IF(AND($C21<=3,$C21<>0),0,IF($C21=4,OFFSET(H21,-1,0)+1,OFFSET(H21,-1,0)))","v":0},0,35,2,"","Nível 2","Nível 2","-","SINAPI",null,"SERVIÇOS PRELIMINARES","-",null,1,"-",0,0,0,0,""]
[{"$f":"CHOOSE(1+LOG(1+2*(ORÇAMENTO.Nivel=\"Nível 1\")+4*(ORÇAMENTO.Nivel=\"Nível 2\")+8*(ORÇAMENTO.Nivel=\"Nível 3\")+16*(ORÇAMENTO.Nivel=\"Nível 4\")+32*(ORÇAMENTO.Nivel=\"Serviço\"),2),0,1,2,3,4,\"S\")","v":"S"},2,"S",0,1,1,0,0,0,0,0,"","Serviço","Serviço","-","AGETOP",20701,"LOCAÇÃO DA OBRA, EXECUÇÃO DE GABARITO SEM REAPROVEITAMENTO, INCLUSO PINTURA (FACE INTERNA DO RIPÃO 15CM) E PIQUETE COM TESTEMUNHA","m2    ",10.08,1,10.08,null,null,0,0,""]
[2,2,2,3,1,2,0,0,{"$f":"IF(AND($C23<=4,$C23<>0),0,IF(AND($C23=\"S\",$Y23>0),OFFSET(I23,-1,0)+1,OFFSET(I23,-1,0)))","v":0},33,3,"","Nível 2","Nível 2","-","AGETOP",null,"TRANSPORTES","-",null,1,"-",null,null,0,0,""]
["S",2,"S",0,1,2,0,0,0,0,0,"","Serviço","Serviço","-","SINAPI",72900,"TRANSPORTE DE ENTULHO COM CAMINHAO BASCULANTE 6 M3, RODOVIA PAVIMENTADA, DMT 0,5 A 1,0 KM","M3",3,1,3,null,null,0,0,""]
["S",2,"S",0,1,2,0,0,0,0,0,"","Serviço","Serviço","-","SINAPI",72897,"CARGA MANUAL DE ENTULHO EM CAMINHAO BASCULANTE 6 M3","M3",3,1,3,null,null,0,0,""]
[2,2,2,9,1,3,0,0,0,30,9,"","Nível 2","Nível 2","-","AGETOP",null,"FUNDAÇÕES E SONDAGENS","-",null,1,"-",null,null,0,0,""]
["S",2,"S",0,1,3,0,0,0,0,0,"","Serviço","Serviço","-","SINAPI",96534,"FABRICAÇÃO, MONTAGEM E DESMONTAGEM DE FÔRMA PARA BLOCO DE COROAMENTO, EM MADEIRA SERRADA, E=25 MM, 4 UTILIZAÇÕES. AF_06/2017","M2",5.28,1,5.28,null,null,0,0,""]
["S",2,"S",0,1,3,0,0,0,0,0,"","Serviço","Serviço","-","SINAPI",96523,"ESCAVAÇÃO MANUAL PARA BLOCO DE COROAMENTO OU SAPATA, COM PREVISÃO DE FÔRMA. AF_06/2017","M3",1.0289999999999999,1,1.0289999999999999,null,null,0,0,""]
["S",2,"S",0,1,3,0,0,0,0,0,"","Serviço","Serviço","-","AGETOP",50902,"APILOAMENTO (BLOCOS/SAPATAS)","m2    ",1,1,1,null,null,0,0,""]
["S",2,"S",0,1,3,0,0,0,0,0,"","Serviço","Serviço","-","SINAPI",96995,"REATERRO MANUAL APILOADO COM SOQUETE. AF_10/2017","M3",0.44899999999999995,1,0.44899999999999995,null,null,0,0,""]
["S",2,"S",0,1,3,0,0,0,0,0,"","Serviço","Serviço","-","SINAPI",94964,"CONCRETO FCK = 20MPA, TRAÇO 1:2,7:3 (CIMENTO/ AREIA MÉDIA/ BRITA 1)  - PREPARO MECÂNICO COM BETONEIRA 400 L. AF_07/2016","M3",0.57999999999999996,1,0.57999999999999996,null,null,0,0,""]
["S",2,"S",0,1,3,0,0,0,0,0,"","Serviço","Serviço","-","AGETOP",51026,"LANÇAMENTO/APLICAÇÃO/ADENSAMENTO DE CONCRETO EM FUNDAÇÃO- (O.C.)","m3    ",0.57999999999999996,1,0.57999999999999996,null,null,0,0,""]
["S",2,"S",0,1,3,0,0,0,0,0,"","Serviço","Serviço","-","SINAPI",96547,"ARMAÇÃO DE BLOCO, VIGA BALDRAME OU SAPATA UTILIZANDO AÇO CA-50 DE 12,5 MM - MONTAGEM. AF_06/2017","KG",13.18181818181818,1,13.18181818181818,null,null,0,0,""]
["S",2,"S",0,1,3,0,0,0,0,0,"","Serviço","Serviço","-","SINAPI",96543,"ARMAÇÃO DE BLOCO, VIGA BALDRAME E SAPATA UTILIZANDO AÇO CA-60 DE 5 MM - MONTAGEM. AF_06/2017","KG",8.7272727272727266,1,8.7272727272727266,null,null,0,0,""]
[2,2,2,6,1,4,0,0,0,21,6,"","Nível 2","Nível 2","-","AGETOP",null,"ESTRUTURA","-",null,1,"-",null,null,0,0,""]
["S",2,"S",0,1,4,0,0,0,0,0,"","Serviço","Serviço","-","SINAPI",92426,"MONTAGEM E DESMONTAGEM DE FÔRMA DE PILARES RETANGULARES E ESTRUTURAS SIMILARES COM ÁREA MÉDIA DAS SEÇÕES MENOR OU IGUAL A 0,25 M², PÉ-DIREITO SIMPLES, EM CHAPA DE MADEIRA COMPENSADA RESINADA, 8 UTILIZAÇÕES. AF_12/2015","M2",1.29,1,1.29,null,null,0,0,""]
["S",2,"S",0,1,4,0,0,0,0,0,"","Serviço","Serviço","-","SINAPI",94964,"CONCRETO FCK = 20MPA, TRAÇO 1:2,7:3 (CIMENTO/ AREIA MÉDIA/ BRITA 1)  - PREPARO MECÂNICO COM BETONEIRA 400 L. AF_07/2016","M3",0.11,1,0.11,null,null,0,0,""]
["S",2,"S",0,1,4,0,0,0,0,0,"","Serviço","Serviço","-","SINAPI",92873,"LANÇAMENTO COM USO DE BALDES, ADENSAMENTO E ACABAMENTO DE CONCRETO EM ESTRUTURAS. AF_12/2015","M3",0.11,1,0.11,null,null,0,0,""]
["S",2,"S",0,1,4,0,0,0,0,0,"","Serviço","Serviço","-","SINAPI",92779,"ARMAÇÃO DE PILAR OU VIGA DE UMA ESTRUTURA CONVENCIONAL DE CONCRETO ARMADO EM UMA EDIFICAÇÃO TÉRREA OU SOBRADO UTILIZANDO AÇO CA-50 DE 12,5 MM - MONTAGEM. AF_12/2015","KG",2.8181818181818179,1,2.8181818181818179,null,null,0,0,""]
["S",2,"S",0,1,4,0,0,0,0,0,"","Serviço","Serviço","-","SINAPI",92775,"ARMAÇÃO DE PILAR OU VIGA DE UMA ESTRUTURA CONVENCIONAL DE CONCRETO ARMADO EM UMA EDIFICAÇÃO TÉRREA OU SOBRADO UTILIZANDO AÇO CA-60 DE 5,0 MM - MONTAGEM. AF_12/2015","KG",1.4545454545454546,1,1.4545454545454546,null,null,0,0,""]
[2,2,2,2,1,5,0,0,0,15,2,"","Nível 2","Nível 2","-",null,null,"IMPERMEABILIZAÇÃO","-",null,1,"-",null,null,0,0,""]
["S",2,"S",0,1,5,0,0,0,0,0,"","Serviço","Serviço","-","SINAPI",98562,"IMPERMEABILIZAÇÃO DE FLOREIRA OU VIGA BALDRAME COM ARGAMASSA DE CIMENTO E AREIA, COM ADITIVO IMPERMEABILIZANTE, E = 2 CM. AF_06/2018","M2",3.6,1,3.6,null,null,0,0,""]
[2,2,2,2,1,6,0,0,0,13,2,"","Nível 2","Nível 2","-",null,null,"ESTRUTURAS METÁLICAS","-",null,1,"-",null,null,0,0,""]
["S",2,"S",0,1,6,0,0,0,0,0,"","Serviço","Serviço","-","AGETOP",150103,"ESTRUTURA METÁLICA CONVENCIONAL EM AÇO DO TIPO USI SAC-300 COM FUNDO ANTICORROSIVO","Kg    ",161.91200000000003,1,161.91200000000003,null,null,0,0,""]
[2,2,2,3,1,7,0,0,0,11,3,"","Nível 2","Nível 2","-",null,null,"COBERTURAS","-",null,1,"-",null,null,0,0,""]
["S",2,"S",0,1,7,0,0,0,0,0,"","Serviço","Serviço","-","SINAPI",94213,"TELHAMENTO COM TELHA DE AÇO/ALUMÍNIO E = 0,5 MM, COM ATÉ 2 ÁGUAS, INCLUSO IÇAMENTO. AF_07/2019","M2",12.96,1,12.96,null,null,0,0,""]
["S",2,"S",0,1,7,0,0,0,0,0,"","Serviço","Serviço","-","SINAPI",94228,"CALHA EM CHAPA DE AÇO GALVANIZADO NÚMERO 24, DESENVOLVIMENTO DE 50 CM, INCLUSO TRANSPORTE VERTICAL. AF_07/2019","M",3.6,1,3.6,null,null,0,0,""]
[2,2,2,4,1,8,0,0,0,8,4,"","Nível 2","Nível 2","-",null,null,"REVESTIMENTO DE PISO","-",null,1,"-",null,null,0,0,""]
["S",2,"S",0,1,8,0,0,0,0,0,"","Serviço","Serviço","-","SINAPI",95241,"LASTRO DE CONCRETO MAGRO, APLICADO EM PISOS OU RADIERS, ESPESSURA DE 5 CM. AF_07/2016","M2",10.08,1,10.08,null,null,0,0,""]
["S",2,"S",0,1,8,0,0,0,0,0,"","Serviço","Serviço","-","SINAPI",84191,"PISO EM GRANILITE, MARMORITE OU GRANITINA ESPESSURA 8 MM, INCLUSO JUNTAS DE DILATACAO PLASTICAS","M2",10.64,1,10.64,null,null,0,0,""]
["S",2,"S",0,1,8,0,0,0,0,0,"","Serviço","Serviço","-","AGETOP",221104,"RASPAGEM E APLICAÇÃO RESINA ACRÍLICA DUAS DEMÃOS","m2    ",10.64,1,10.64,null,null,0,0,""]
[2,2,2,2,1,9,0,0,0,4,2,"","Nível 2","Nível 2","-",null,null,"PINTURA","-",null,1,"-",null,null,0,0,""]
["S",2,"S",0,1,9,0,0,0,0,0,"","Serviço","Serviço","-","AGETOP",261602,"PINT.ESMALTE/ESQUAD.FERRO C/FUNDO ANTICOR.","m2    ",25.92,1,25.92,null,null,0,0,""]
[2,2,2,2,1,10,0,0,0,2,{"$error":"#N/A"},"","Nível 2","Nível 2","-","SINAPI",null,"DIVERSOS","-",null,1,"-",null,null,0,0,""]
["S",2,"S",0,1,10,0,0,0,0,0,"","Serviço","Serviço","-","AGETOP",270501,"LIMPEZA FINAL DE OBRA - (OBRAS CIVIS)","m2    ",10.08,1,10.08,null,null,0,0,""]
[1,1,1,36,2,0,0,0,0,269,36,"F","Nível 1","Nível 1","2.","SINAPI",null,"PASSARELA MODELO 02 - PADRÃO SÉC. XXI ","UN",1,1,1,null,null,0,0,""]
[2,2,2,2,2,1,0,0,0,35,2,"","Nível 2","Nível 2","-","SINAPI",null,"SERVIÇOS PRELIMINARES","-",null,1,"-",null,null,0,0,""]
["S",2,"S",0,2,1,0,0,0,0,0,"","Serviço","Serviço","-","AGETOP",20701,"LOCAÇÃO DA OBRA, EXECUÇÃO DE GABARITO SEM REAPROVEITAMENTO, INCLUSO PINTURA (FACE INTERNA DO RIPÃO 15CM) E PIQUETE COM TESTEMUNHA","m2    ",20.16,1,20.16,null,null,0,0,""]
[2,2,2,3,2,2,0,0,0,33,3,"","Nível 2","Nível 2","-","AGETOP",null,"TRANSPORTES","-",null,1,"-",null,null,0,0,""]
["S",2,"S",0,2,2,0,0,0,0,0,"","Serviço","Serviço","-","SINAPI",72900,"TRANSPORTE DE ENTULHO COM CAMINHAO BASCULANTE 6 M3, RODOVIA PAVIMENTADA, DMT 0,5 A 1,0 KM","M3",6,1,6,null,null,0,0,""]
["S",2,"S",0,2,2,0,0,0,0,0,"","Serviço","Serviço","-","SINAPI",72897,"CARGA MANUAL DE ENTULHO EM CAMINHAO BASCULANTE 6 M3","M3",6,1,6,null,null,0,0,""]
[2,2,2,9,2,3,0,0,0,30,9,"","Nível 2","Nível 2","-","AGETOP",null,"FUNDAÇÕES E SONDAGENS","-",null,1,"-",null,null,0,0,""]
["S",2,"S",0,2,3,0,0,0,0,0,"","Serviço","Serviço","-","SINAPI",96534,"FABRICAÇÃO, MONTAGEM E DESMONTAGEM DE FÔRMA PARA BLOCO DE COROAMENTO, EM MADEIRA SERRADA, E=25 MM, 4 UTILIZAÇÕES. AF_06/2017","M2",5.28,1,5.28,null,null,0,0,""]
["S",2,"S",0,2,3,0,0,0,0,0,"","Serviço","Serviço","-","SINAPI",96523,"ESCAVAÇÃO MANUAL PARA BLOCO DE COROAMENTO OU SAPATA, COM PREVISÃO DE FÔRMA. AF_06/2017","M3",1.0289999999999999,1,1.0289999999999999,null,null,0,0,""]
["S",2,"S",0,2,3,0,0,0,0,0,"","Serviço","Serviço","-","AGETOP",50902,"APILOAMENTO (BLOCOS/SAPATAS)","m2    ",1,1,1,null,null,0,0,""]
["S",2,"S",0,2,3,0,0,0,0,0,"","Serviço","Serviço","-","SINAPI",96995,"REATERRO MANUAL APILOADO COM SOQUETE. AF_10/2017","M3",0.44899999999999995,1,0.44899999999999995,null,null,0,0,""]
["S",2,"S",0,2,3,0,0,0,0,0,"","Serviço","Serviço","-","SINAPI",94964,"CONCRETO FCK = 20MPA, TRAÇO 1:2,7:3 (CIMENTO/ AREIA MÉDIA/ BRITA 1)  - PREPARO MECÂNICO COM BETONEIRA 400 L. AF_07/2016","M3",0.57999999999999996,1,0.57999999999999996,null,null,0,0,""]
["S",2,"S",0,2,3,0,0,0,0,0,"","Serviço","Serviço","-","AGETOP",51026,"LANÇAMENTO/APLICAÇÃO/ADENSAMENTO DE CONCRETO EM FUNDAÇÃO- (O.C.)","m3    ",0.57999999999999996,1,0.57999999999999996,null,null,0,0,""]
["S",2,"S",0,2,3,0,0,0,0,0,"","Serviço","Serviço","-","SINAPI",96547,"ARMAÇÃO DE BLOCO, VIGA BALDRAME OU SAPATA UTILIZANDO AÇO CA-50 DE 12,5 MM - MONTAGEM. AF_06/2017","KG",13.18181818181818,1,13.18181818181818,null,null,0,0,""]
["S",2,"S",0,2,3,0,0,0,0,0,"","Serviço","Serviço","-","SINAPI",96543,"ARMAÇÃO DE BLOCO, VIGA BALDRAME E SAPATA UTILIZANDO AÇO CA-60 DE 5 MM - MONTAGEM. AF_06/2017","KG",8.7272727272727266,1,8.7272727272727266,null,null,0,0,""]
[2,2,2,6,2,4,0,0,0,21,6,"","Nível 2","Nível 2","-","AGETOP",null,"ESTRUTURA","-",null,1,"-",null,null,0,0,""]
["S",2,"S",0,2,4,0,0,0,0,0,"","Serviço","Serviço","-","SINAPI",92426,"MONTAGEM E DESMONTAGEM DE FÔRMA DE PILARES RETANGULARES E ESTRUTURAS SIMILARES COM ÁREA MÉDIA DAS SEÇÕES MENOR OU IGUAL A 0,25 M², PÉ-DIREITO SIMPLES, EM CHAPA DE MADEIRA COMPENSADA RESINADA, 8 UTILIZAÇÕES. AF_12/2015","M2",1.29,1,1.29,null,null,0,0,""]
["S",2,"S",0,2,4,0,0,0,0,0,"","Serviço","Serviço","-","SINAPI",94964,"CONCRETO FCK = 20MPA, TRAÇO 1:2,7:3 (CIMENTO/ AREIA MÉDIA/ BRITA 1)  - PREPARO MECÂNICO COM BETONEIRA 400 L. AF_07/2016","M3",0.11,1,0.11,null,null,0,0,""]
["S",2,"S",0,2,4,0,0,0,0,0,"","Serviço","Serviço","-","SINAPI",92873,"LANÇAMENTO COM USO DE BALDES, ADENSAMENTO E ACABAMENTO DE CONCRETO EM ESTRUTURAS. AF_12/2015","M3",0.11,1,0.11,null,null,0,0,""]
["S",2,"S",0,2,4,0,0,0,0,0,"","Serviço","Serviço","-","SINAPI",92779,"ARMAÇÃO DE PILAR OU VIGA DE UMA ESTRUTURA CONVENCIONAL DE CONCRETO ARMADO EM UMA EDIFICAÇÃO TÉRREA OU SOBRADO UTILIZANDO AÇO CA-50 DE 12,5 MM - MONTAGEM. AF_12/2015","KG",2.8181818181818179,1,2.8181818181818179,null,null,0,0,""]
["S",2,"S",0,2,4,0,0,0,0,0,"","Serviço","Serviço","-","SINAPI",92775,"ARMAÇÃO DE PILAR OU VIGA DE UMA ESTRUTURA CONVENCIONAL DE CONCRETO ARMADO EM UMA EDIFICAÇÃO TÉRREA OU SOBRADO UTILIZANDO AÇO CA-60 DE 5,0 MM - MONTAGEM. AF_12/2015","KG",1.4545454545454546,1,1.4545454545454546,null,null,0,0,""]
[2,2,2,2,2,5,0,0,0,15,2,"","Nível 2","Nível 2","-",null,null,"IMPERMEABILIZAÇÃO","-",null,1,"-",null,null,0,0,""]
["S",2,"S",0,2,5,0,0,0,0,0,"","Serviço","Serviço","-","SINAPI",98562,"IMPERMEABILIZAÇÃO DE FLOREIRA OU VIGA BALDRAME COM ARGAMASSA DE CIMENTO E AREIA, COM ADITIVO IMPERMEABILIZANTE, E = 2 CM. AF_06/2018","M2",3.6,1,3.6,null,null,0,0,""]
[2,2,2,2,2,6,0,0,0,13,2,"","Nível 2","Nível 2","-",null,null,"ESTRUTURAS METÁLICAS","-",null,1,"-",null,null,0,0,""]
["S",2,"S",0,2,6,0,0,0,0,0,"","Serviço","Serviço","-","AGETOP",150103,"ESTRUTURA METÁLICA CONVENCIONAL EM AÇO DO TIPO USI SAC-300 COM FUNDO ANTICORROSIVO","Kg    ",270.56000000000006,1,270.56000000000006,null,null,0,0,""]
[2,2,2,3,2,7,0,0,0,11,3,"","Nível 2","Nível 2","-",null,null,"COBERTURAS","-",null,1,"-",null,null,0,0,""]
["S",2,"S",0,2,7,0,0,0,0,0,"","Serviço","Serviço","-","SINAPI",94213,"TELHAMENTO COM TELHA DE AÇO/ALUMÍNIO E = 0,5 MM, COM ATÉ 2 ÁGUAS, INCLUSO IÇAMENTO. AF_07/2019","M2",25.92,1,25.92,null,null,0,0,""]
["S",2,"S",0,2,7,0,0,0,0,0,"","Serviço","Serviço","-","SINAPI",94228,"CALHA EM CHAPA DE AÇO GALVANIZADO NÚMERO 24, DESENVOLVIMENTO DE 50 CM, INCLUSO TRANSPORTE VERTICAL. AF_07/2019","M",7.2,1,7.2,null,null,0,0,""]
[2,2,2,4,2,8,0,0,0,{"$f":"IF(OR($C84=\"S\",$C84=0),0,MATCH(0,OFFSET($D84,1,$C84,ROW($C$325)-ROW($C84)),0))","v":8},{"$f":"IF(OR($C84=\"S\",$C84=0),0,MATCH(OFFSET($D84,0,$C84)+1,OFFSET($D84,1,$C84,ROW($C$325)-ROW($C84)),0))","v":4},"","Nível 2","Nível 2","-",null,null,"REVESTIMENTO DE PISO","-",null,1,"-",null,null,0,0,""]
["S",2,"S",0,2,8,0,0,0,0,0,"","Serviço","Serviço","-","SINAPI",95241,"LASTRO DE CONCRETO MAGRO, APLICADO EM PISOS OU RADIERS, ESPESSURA DE 5 CM. AF_07/2016","M2",20.16,1,20.16,null,null,0,0,""]
["S",2,"S",0,2,8,0,0,0,0,0,"","Serviço","Serviço","-","SINAPI",84191,"PISO EM GRANILITE, MARMORITE OU GRANITINA ESPESSURA 8 MM, INCLUSO JUNTAS DE DILATACAO PLASTICAS","M2",20.16,1,20.16,null,null,0,0,""]
["S",2,"S",0,2,8,0,0,0,0,0,"","Serviço","Serviço","-","AGETOP",221104,"RASPAGEM E APLICAÇÃO RESINA ACRÍLICA DUAS DEMÃOS","m2    ",20.72,1,20.72,null,null,0,0,""]
[2,2,2,2,2,9,0,0,0,4,2,"","Nível 2","Nível 2","-",null,null,"PINTURA","-",null,1,"-",null,null,0,0,""]
["S",2,"S",0,2,9,0,0,0,0,0,"","Serviço","Serviço","-","AGETOP",261602,"PINT.ESMALTE/ESQUAD.FERRO C/FUNDO ANTICOR.","m2    ",51.84,1,51.84,null,null,0,0,""]
[2,2,2,2,2,10,0,0,0,2,{"$error":"#N/A"},"","Nível 2","Nível 2","-","SINAPI",null,"DIVERSOS","-",null,1,"-",null,null,0,0,""]
["S",2,"S",0,2,10,0,0,0,0,0,"","Serviço","Serviço","-","AGETOP",270501,"LIMPEZA FINAL DE OBRA - (OBRAS CIVIS)","m2    ",20.16,1,20.16,null,null,0,0,""]
[1,1,1,8,3,0,0,0,0,233,8,"F","Nível 1","Nível 1","3.","SINAPI",null,"COBERTURA","UN",1,1,1,null,null,0,0,""]
[2,2,2,2,3,1,0,0,{"$f":"IF(AND($C93<=4,$C93<>0),0,IF(AND($C93=\"S\",$Y93>0),OFFSET(I93,-1,0)+1,OFFSET(I93,-1,0)))","v":0},7,2,"","Nível 2","Nível 2","-","SINAPI",null,"SERVIÇOS PRELIMINARES","-",null,1,"-",null,null,0,0,""]
["S",2,"S",0,3,1,0,0,0,0,0,"","Serviço","Serviço","-","AGETOP",20101,"DEMOLICAO COBERTURA TELHA CERAMICA C/ TRANSP. ATÉ CB. E CARGA","m2    ",227.94,1,227.94,null,null,0,0,""]
[2,2,2,3,3,2,0,0,0,5,3,"","Nível 2","Nível 2","-","SINAPI",null,"TRANSPORTES","-",null,1,"-",null,null,0,0,""]
["S",2,"S",0,3,2,0,0,0,0,0,"","Serviço","Serviço","-","SINAPI",72900,"TRANSPORTE DE ENTULHO COM CAMINHAO BASCULANTE 6 M3, RODOVIA PAVIMENTADA, DMT 0,5 A 1,0 KM","M3",11.39,1,11.39,null,null,0,0,""]
["S",2,"S",0,3,2,0,0,0,0,0,"","Serviço","Serviço","-","SINAPI",72897,"CARGA MANUAL DE ENTULHO EM CAMINHAO BASCULANTE 6 M3","M3",11.39,1,11.39,null,null,0,0,""]
[2,2,2,2,3,3,0,0,0,2,11,"","Nível 2","Nível 2","-","SINAPI",null,"COBERTURAS","-",null,1,"-",null,null,0,0,""]
["S",2,"S",0,3,3,0,0,0,0,0,"","Serviço","Serviço","-","AGETOP",160901,"COBERTURA COM TELHA CANALETE 90 OU EQUIV. COM ACESSÓRIOS","m2    ",227.94,1,227.94,null,null,0,0,""]
[1,1,1,11,4,0,0,0,0,225,11,"F","Nível 1","Nível 1","4.","SINAPI",null,"PRESTAÇÃO DE CONTAS, MERENDA ESCOLAR","UN",1,1,1,null,null,0,0,""]
[2,2,2,2,4,1,0,0,0,10,2,"","Nível 2","Nível 2","-","SINAPI",null,"ALVENARIAS E DIVISÓRIAS","-",null,1,"-",null,null,0,0,""]
["S",2,"S",0,4,1,0,0,0,0,0,"","Serviço","Serviço","-","SINAPI",96370,"PAREDE COM PLACAS DE GESSO ACARTONADO (DRYWALL), PARA USO INTERNO, COM UMA FACE SIMPLES E ESTRUTURA METÁLICA COM GUIAS SIMPLES, SEM VÃOS. AF_06/2017_P","M2",37.86,1,37.86,null,null,0,0,""]
[2,2,2,4,4,2,0,0,0,8,4,"","Nível 2","Nível 2","-","SINAPI",null,"PINTURA","-",null,1,"-",null,null,0,0,""]
["S",2,"S",0,4,2,0,0,0,0,0,"","Serviço","Serviço","-","SINAPI",88495,"APLICAÇÃO E LIXAMENTO DE MASSA LÁTEX EM PAREDES, UMA DEMÃO. AF_06/2014","M2",75.72,1,75.72,null,null,0,0,""]
["S",2,"S",0,4,2,0,0,0,0,0,"","Serviço","Serviço","-","AGETOP",261550,"PINT.ESMALTE SINT.PAREDES - 2 DEM.C/SELADOR","m2    ",37.86,1,37.86,null,null,0,0,""]
["S",2,"S",0,4,2,0,0,0,0,0,"","Serviço","Serviço","-","AGETOP",261001,"PINTURA LATEX ACRILICO 2 DEMAOS","m2    ",37.86,1,37.86,null,null,0,0,""]
[2,2,2,2,4,3,0,0,0,4,2,"","Nível 2","Nível 2","-","SINAPI",null,"ESQUADRIAS METÁLICAS","-",null,1,"-",null,null,0,0,""]
["S",2,"S",0,4,3,0,0,0,0,0,"","Serviço","Serviço","-","AGETOP",180501,"PORTA DE ABRIR EM CHAPA PF-1 C/FERRAGENS","m2    ",5.04,1,5.04,null,null,0,0,""]
[2,2,2,2,4,4,0,0,{"$f":"IF(AND($C109<=4,$C109<>0),0,IF(AND($C109=\"S\",$Y109>0),OFFSET(I109,-1,0)+1,OFFSET(I109,-1,0)))","v":0},2,19,"","Nível 2","Nível 2","-","SINAPI",null,"PINTURA","-",null,1,"-",null,null,0,0,""]
["S",2,"S",0,4,4,0,0,0,0,0,"","Serviço","Serviço","-","AGETOP",261602,"PINT.ESMALTE/ESQUAD.FERRO C/FUNDO ANTICOR.","m2    ",15.120000000000001,1,15.120000000000001,null,null,0,0,""]
[1,1,1,24,5,0,0,0,0,214,24,"F","Nível 1","Nível 1","5.","SINAPI",null,"BANHEIRO MASCULINO, FEMININO E ACESSÍVEL","UN",1,1,1,null,null,0,0,""]
[2,2,2,8,5,1,0,0,0,23,8,"","Nível 2","Nível 2","-","SINAPI",null,"SERVIÇOS PRELIMINARES","-",null,1,"-",null,null,0,0,""]
["S",2,"S",0,5,1,0,0,0,0,0,"","Serviço","Serviço","-","AGETOP",20118,"DEM.ALVEN.TIJOLO S/REAP. C/TR.ATE CB. E CARGA","m3    ",0.9,1,0.9,null,null,0,0,""]
["S",2,"S",0,5,1,0,0,0,0,0,"","Serviço","Serviço","-","AGETOP",20137,"DEMOLIÇAO BACIA SANITARIA C/ TRANSP. ATÉ CB. E CARGA","Un    ",8,1,8,null,null,0,0,""]
["S",2,"S",0,5,1,0,0,0,0,0,"","Serviço","Serviço","-","AGETOP",20140,"DEMOLIÇAO DE VÁLVULA DE DESCARGA C/ TRANSP. ATÉ CB. E CARGA","Un    ",8,1,8,null,null,0,0,""]
["S",2,"S",0,5,1,0,0,0,{"$f":"IF(OR($C116=\"S\",$C116=0),0,MATCH(0,OFFSET($D116,1,$C116,ROW($C$325)-ROW($C116)),0))","v":0},{"$f":"IF(OR($C116=\"S\",$C116=0),0,MATCH(OFFSET($D116,0,$C116)+1,OFFSET($D116,1,$C116,ROW($C$325)-ROW($C116)),0))","v":0},"","Serviço","Serviço","-","AGETOP",20138,"DEMOLIÇAO DE LAVATÓRIO C/ TRANSP. ATÉ CB. E CARGA","Un    ",7,1,7,null,null,0,0,""]
["S",2,"S",0,5,1,0,0,0,0,0,"","Serviço","Serviço","-","AGETOP",20163,"DEMOLIÇÃO DAS INSTALAÇÕES HIDROSANITÁRIAS E AFINS C/ TRANSP. ATÉ CB. E CARGA","H     ",2.1,1,2.1,null,null,0,0,""]
["S",2,"S",0,5,1,0,0,0,0,0,"","Serviço","Serviço","-","AGETOP",20146,"DEMOLIÇÃO DE MICTÓRIO C/ TRANSP. ATÉ CB. E CARGA","Un    ",2,1,2,null,null,0,0,""]
["S",2,"S",0,5,1,0,0,0,0,0,"","Serviço","Serviço","-","SINAPI",97644,"REMOÇÃO DE PORTAS, DE FORMA MANUAL, SEM REAPROVEITAMENTO. AF_12/2017","M2",3.3600000000000003,1,3.3600000000000003,null,null,0,0,""]
[2,2,2,3,5,2,0,0,0,15,3,"","Nível 2","Nível 2","-","SINAPI",null,"TRANSPORTES","-",null,1,"-",null,null,0,0,""]
["S",2,"S",0,5,2,0,0,0,0,0,"","Serviço","Serviço","4.1.0.0.6.","SINAPI",72900,"TRANSPORTE DE ENTULHO COM CAMINHAO BASCULANTE 6 M3, RODOVIA PAVIMENTADA, DMT 0,5 A 1,0 KM","M3",5.23,1,5.23,null,null,0,0,""]
["S",2,"S",0,5,2,0,0,0,0,0,"","Serviço","Serviço","-","SINAPI",72897,"CARGA MANUAL DE ENTULHO EM CAMINHAO BASCULANTE 6 M3","M3",5.23,1,5.23,null,null,0,0,""]
[2,2,2,2,5,3,0,0,0,12,2,"","Nível 2","Nível 2","-","SINAPI",null,"ALVENARIAS E DIVISÓRIAS","-",null,1,"-",null,null,0,0,""]
["S",2,"S",0,5,3,0,0,0,0,0,"","Serviço","Serviço","-","AGETOP",100320,"DIVISORIA DE GRANITO POLIDO","m2    ",2.8,1,2.8,null,null,0,0,""]
[2,2,2,3,5,4,0,0,0,10,3,"","Nível 2","Nível 2","-","SINAPI",null,"FERRAGENS","-",null,1,"-",null,null,0,0,""]
["S",2,"S",0,5,4,0,0,0,0,0,"","Serviço","Serviço","-","AGETOP",230174,"BARRA DE APOIO EM AÇO INOX - 40 CM","un    ",6,1,6,null,null,0,0,""]
["S",2,"S",0,5,4,0,0,0,0,0,"","Serviço","Serviço","-","AGETOP",230176,"BARRA DE APOIO EM AÇO INOX - 80 CM ","un    ",6,1,6,null,null,0,0,""]
[2,2,2,2,5,5,0,0,0,7,2,"","Nível 2","Nível 2","-","SINAPI",null,"ESQUADRIAS METÁLICAS","-",null,1,"-",null,null,0,0,""]
["S",2,"S",0,5,5,0,0,0,0,0,"","Serviço","Serviço","-","AGETOP",180501,"PORTA DE ABRIR EM CHAPA PF-1 C/FERRAGENS","m2    ",3.7800000000000002,1,3.7800000000000002,null,null,0,0,""]
[2,2,2,2,5,6,0,0,0,5,2,"","Nível 2","Nível 2","-","SINAPI",null,"PINTURA","-",null,1,"-",null,null,0,0,""]
["S",2,"S",0,5,6,0,0,0,0,0,"","Serviço","Serviço","-","AGETOP",261602,"PINT.ESMALTE/ESQUAD.FERRO C/FUNDO ANTICOR.","m2    ",11.34,1,11.34,null,null,0,0,""]
[2,2,2,3,5,7,0,0,0,3,{"$error":"#N/A"},"","Nível 2","Nível 2","-","SINAPI",null,"REVESTIMENTO DE PAREDE","-",null,1,"-",null,null,0,0,""]
["S",2,"S",0,5,7,0,0,0,0,0,"","Serviço","Serviço","-","SINAPI",87553,"EMBOÇO, PARA RECEBIMENTO DE CERÂMICA, EM ARGAMASSA TRAÇO 1:2:8, PREPARO MECÂNICO COM BETONEIRA 400L, APLICADO MANUALMENTE EM FACES INTERNAS DE PAREDES, PARA AMBIENTE COM ÁREA MAIOR QUE 10M2, ESPESSURA DE 10MM, COM EXECUÇÃO DE TALISCAS. AF_06/2014","M2",36.86,1,36.86,null,null,0,0,""]
["S",2,"S",0,5,7,0,0,0,0,0,"","Serviço","Serviço","-","SINAPI",87273,"REVESTIMENTO CERÂMICO PARA PAREDES INTERNAS COM PLACAS TIPO ESMALTADA EXTRA DE DIMENSÕES 33X45 CM APLICADAS EM AMBIENTES DE ÁREA MAIOR QUE 5 M² NA ALTURA INTEIRA DAS PAREDES. AF_06/2014","M2",36.86,1,36.86,null,null,0,0,""]
[{"$f":"CHOOSE(1+LOG(1+2*(ORÇAMENTO.Nivel=\"Nível 1\")+4*(ORÇAMENTO.Nivel=\"Nível 2\")+8*(ORÇAMENTO.Nivel=\"Nível 3\")+16*(ORÇAMENTO.Nivel=\"Nível 4\")+32*(ORÇAMENTO.Nivel=\"Serviço\"),2),0,1,2,3,4,\"S\")","v":1},{"$f":"IF(OR(C135=\"s\",C135=0),OFFSET(B135,-1,0),C135)","v":1},{"$f":"IF(OFFSET(C135,-1,0)=\"L\",1,IF(OFFSET(C135,-1,0)=1,2,IF(OR(A135=\"s\",A135=0),\"S\",IF(AND(OFFSET(C135,-1,0)=2,A135=4),3,IF(AND(OR(OFFSET(C135,-1,0)=\"s\",OFFSET(C135,-1,0)=0),A135<>\"s\",A135>OFFSET(B135,-1,0)),OFFSET(B135,-1,0),A135)))))","v":1},{"$f":"IF(OR(C135=\"S\",C135=0),0,IF(ISERROR(K135),J135,SMALL(J135:K135,1)))","v":12},{"$f":"IF($C135=1,OFFSET(E135,-1,0)+1,OFFSET(E135,-1,0))","v":6},{"$f":"IF($C135=1,0,IF($C135=2,OFFSET(F135,-1,0)+1,OFFSET(F135,-1,0)))","v":0},{"$f":"IF(AND($C135<=2,$C135<>0),0,IF($C135=3,OFFSET(G135,-1,0)+1,OFFSET(G135,-1,0)))","v":0},{"$f":"IF(AND($C135<=3,$C135<>0),0,IF($C135=4,OFFSET(H135,-1,0)+1,OFFSET(H135,-1,0)))","v":0},0,190,12,"F","Nível 1","Nível 1","6.","SINAPI",null,"ACESSIBILIDADE","UN",1,1,1,null,null,0,0,""]
[2,2,2,2,6,1,0,0,0,11,2,"","Nível 2","Nível 2","-","SINAPI",null,"SERVIÇOS PRELIMINARES","-",null,1,"-",null,null,0,0,""]
["S",2,"S",0,6,1,0,0,0,0,0,"","Serviço","Serviço","-","AGETOP",20109,"DEM.PISO CIMENT.SOBRE LASTRO CONC.C/TR.ATE CB. E CARGA","m2    ",71.599999999999994,1,71.599999999999994,null,null,0,0,""]
[2,2,2,3,6,2,0,0,0,9,3,"","Nível 2","Nível 2","-","SINAPI",null,"TRANSPORTES","-",null,1,"-",null,null,0,0,""]
["S",2,"S",0,6,2,0,0,0,0,0,"","Serviço","Serviço","-","SINAPI",72900,"TRANSPORTE DE ENTULHO COM CAMINHAO BASCULANTE 6 M3, RODOVIA PAVIMENTADA, DMT 0,5 A 1,0 KM","M3",3.58,1,3.58,null,null,0,0,""]
["S",2,"S",0,6,2,0,0,0,0,0,"","Serviço","Serviço","-","SINAPI",72897,"CARGA MANUAL DE ENTULHO EM CAMINHAO BASCULANTE 6 M3","M3",3.58,1,3.58,null,null,0,0,""]
[2,2,2,4,6,3,0,0,0,6,4,"","Nível 2","Nível 2","-","SINAPI",null,"REVESTIMENTO DE PISO","-",null,1,"-",null,null,0,0,""]
["S",2,"S",0,6,3,0,0,0,0,0,"","Serviço","Serviço","-","AGETOP",221126,"PISO DE LADRILHO HIDRÁULICO COLORIDO MODELO TÁTIL ( ALERTA OU DIRECIONAL) SEM LASTRO","m2    ",71.599999999999994,1,71.599999999999994,null,null,0,0,""]
["S",2,"S",0,6,3,0,0,0,0,0,"","Serviço","Serviço","-","AGETOP",221120,"PISO DE BORRACHA COLORIDO MODELO TÁTIL ( ALERTA OU DIRECIONAL) INCLUSO CONTRAPISO (1CI:3ARML) C/ E=2CM E NATA DE CIMENTO","m2    ",5.22,1,5.22,null,null,0,0,""]
["S",2,"S",0,6,3,0,0,0,0,0,"","Serviço","Serviço","-","AGETOP",220102,"PISO CONCRETO DESEMPENADO ESPESSURA = 5 CM  1:2,5:3,5","m2    ",1.52,1,1.52,null,null,0,0,""]
[2,2,2,2,6,4,0,0,0,2,30,"","Nível 2","Nível 2","-","SINAPI",null,"ESQUADRIAS METÁLICAS","-",null,1,"-",null,null,0,0,""]
["S",2,"S",0,6,4,0,0,0,0,0,"","Serviço","Serviço","-","COMPOSIÇÃO","COMP 084_SEE","GUARDA-CORPO COM CORRIMÃO - SEDUC","M",50.55,1,50.55,null,null,0,0,""]
[1,1,1,9,7,0,0,0,0,178,9,"F","Nível 1","Nível 1","7.","SINAPI",null,"PINTURA GERAL","UN",1,1,1,null,null,0,0,""]
[2,2,2,8,7,1,0,0,0,8,18,"","Nível 2","Nível 2","-","SINAPI",null,"PINTURA","-",null,1,"-",null,null,0,0,""]
["S",2,"S",0,7,1,0,0,0,{"$f":"IF(OR($C149=\"S\",$C149=0),0,MATCH(0,OFFSET($D149,1,$C149,ROW($C$325)-ROW($C149)),0))","v":0},{"$f":"IF(OR($C149=\"S\",$C149=0),0,MATCH(OFFSET($D149,0,$C149)+1,OFFSET($D149,1,$C149,ROW($C$325)-ROW($C149)),0))","v":0},"","Serviço","Serviço","-","AGETOP",260104,"REMOCAO DE PINTURA ANTIGA A LATEX","m2    ",35.36,1,35.36,null,null,0,0,""]
["S",2,"S",0,7,1,0,0,0,0,0,"","Serviço","Serviço","-","SINAPI",88495,"APLICAÇÃO E LIXAMENTO DE MASSA LÁTEX EM PAREDES, UMA DEMÃO. AF_06/2014","M2",35.36,1,35.36,null,null,0,0,""]
["S",2,"S",0,7,1,0,0,0,0,0,"","Serviço","Serviço","-","AGETOP",261001,"PINTURA LATEX ACRILICO 2 DEMAOS","m2    ",117.88,1,117.88,null,null,0,0,""]
["S",2,"S",0,7,1,0,0,0,0,0,"","Serviço","Serviço","-","AGETOP",260104,"REMOCAO DE PINTURA ANTIGA A LATEX","m2    ",127.82,1,127.82,null,null,0,0,""]
["S",2,"S",0,7,1,0,0,{"$f":"IF(AND($C153<=4,$C153<>0),0,IF(AND($C153=\"S\",$Y153>0),OFFSET(I153,-1,0)+1,OFFSET(I153,-1,0)))","v":0},0,0,"","Serviço","Serviço","-","AGETOP",261000,"PINTURA LATEX ACRILICA 2 DEMAOS C/SELADOR","m2    ",426.08,1,426.08,null,null,0,0,""]
["S",2,"S",0,7,1,0,0,0,0,0,"","Serviço","Serviço","-","AGETOP",260104,"REMOCAO DE PINTURA ANTIGA A LATEX","m2    ",104.61,1,104.61,null,null,0,0,""]
["S",2,"S",0,7,1,0,0,0,0,0,"","Serviço","Serviço","-","SINAPI",88488,"APLICAÇÃO MANUAL DE PINTURA COM TINTA LÁTEX ACRÍLICA EM TETO, DUAS DEMÃOS. AF_06/2014","M2",104.61,1,104.61,null,null,0,0,""]
[1,1,1,5,8,0,0,0,0,169,5,"F","Nível 1","Nível 1","8.","SINAPI",null,"ESQUADRIAS EXISTENTES","UN",1,1,1,null,null,0,0,""]
[2,2,2,4,8,1,0,0,0,4,9,"","Nível 2","Nível 2","-","SINAPI",null,"PINTURA","-",null,1,"-",null,null,0,0,""]
["S",2,"S",0,8,1,0,0,0,0,0,"","Serviço","Serviço","-","AGETOP",260105,"REMOCAO DE PINTURA ANTIGA A OLEO OU ESMALTE","m2    ",283.76,1,283.76,null,null,0,0,""]
["S",2,"S",0,8,1,0,0,0,0,0,"","Serviço","Serviço","-","AGETOP",261602,"PINT.ESMALTE/ESQUAD.FERRO C/FUNDO ANTICOR.","m2    ",178.56,1,178.56,null,null,0,0,""]
["S",2,"S",0,8,1,0,0,0,0,0,"","Serviço","Serviço","-","AGETOP",261602,"PINT.ESMALTE/ESQUAD.FERRO C/FUNDO ANTICOR.","m2    ",105.2,1,105.2,null,null,0,0,""]
[1,1,1,19,9,0,0,0,0,164,19,"F","Nível 1","Nível 1","9.","SINAPI",null,"COZINHA","UN",1,1,1,null,null,0,0,""]
[2,2,2,4,9,1,0,0,0,18,4,"","Nível 2","Nível 2","-","SINAPI",null,"SERVIÇOS PRELIMINARES","-",null,1,"-",null,null,0,0,""]
["S",2,"S",0,9,1,0,0,0,0,0,"","Serviço","Serviço","-","AGETOP",20118,"DEM.ALVEN.TIJOLO S/REAP. C/TR.ATE CB. E CARGA","m3    ",0.45,1,0.45,null,null,0,0,""]
["S",2,"S",0,9,1,0,0,0,0,0,"","Serviço","Serviço","-","AGETOP",20163,"DEMOLIÇÃO DAS INSTALAÇÕES HIDROSANITÁRIAS E AFINS C/ TRANSP. ATÉ CB. E CARGA","H     ",1.2,1,1.2,null,null,0,0,""]
["S",2,"S",0,9,1,0,0,0,0,0,"","Serviço","Serviço","-","SINAPI",97633,"DEMOLIÇÃO DE REVESTIMENTO CERÂMICO, DE FORMA MANUAL, SEM REAPROVEITAMENTO. AF_12/2017","M2",13.72,1,13.72,null,null,0,0,""]
[2,2,2,3,9,2,0,0,0,14,3,"","Nível 2","Nível 2","-","SINAPI",null,"TRANSPORTES","-",null,1,"-",null,null,0,0,""]
["S",2,"S",0,9,2,0,0,0,0,0,"","Serviço","Serviço","-","SINAPI",72900,"TRANSPORTE DE ENTULHO COM CAMINHAO BASCULANTE 6 M3, RODOVIA PAVIMENTADA, DMT 0,5 A 1,0 KM","M3",1.1299999999999999,1,1.1299999999999999,null,null,0,0,""]
["S",2,"S",0,9,2,0,0,0,0,0,"","Serviço","Serviço","-","SINAPI",72897,"CARGA MANUAL DE ENTULHO EM CAMINHAO BASCULANTE 6 M3","M3",1.1299999999999999,1,1.1299999999999999,null,null,0,0,""]
[2,2,2,2,9,3,0,0,0,11,2,"","Nível 2","Nível 2","-","SINAPI",null,"REVESTIMENTO DE PAREDE","-",null,1,"-",null,null,0,0,""]
["S",2,"S",0,9,3,0,0,0,0,0,"","Serviço","Serviço","-","SINAPI",87547,"MASSA ÚNICA, PARA RECEBIMENTO DE PINTURA, EM ARGAMASSA TRAÇO 1:2:8, PREPARO MECÂNICO COM BETONEIRA 400L, APLICADA MANUALMENTE EM FACES INTERNAS DE PAREDES, ESPESSURA DE 10MM, COM EXECUÇÃO DE TALISCAS. AF_06/2014","M2",13.72,1,13.72,null,null,0,0,""]
[2,2,2,4,9,4,0,0,0,9,4,"","Nível 2","Nível 2","-","SINAPI",null,"PINTURA","-",null,1,"-",null,null,0,0,""]
["S",2,"S",0,9,4,0,0,0,0,0,"","Serviço","Serviço","-","SINAPI",88495,"APLICAÇÃO E LIXAMENTO DE MASSA LÁTEX EM PAREDES, UMA DEMÃO. AF_06/2014","M2",13.72,1,13.72,null,null,0,0,""]
["S",2,"S",0,9,4,0,0,0,0,0,"","Serviço","Serviço","-","AGETOP",261550,"PINT.ESMALTE SINT.PAREDES - 2 DEM.C/SELADOR","m2    ",6.86,1,6.86,null,null,0,0,""]
["S",2,"S",0,9,4,0,0,0,0,0,"","Serviço","Serviço","-","AGETOP",261001,"PINTURA LATEX ACRILICO 2 DEMAOS","m2    ",6.86,1,6.86,null,null,0,0,""]
[2,2,2,3,9,5,0,0,0,5,3,"","Nível 2","Nível 2","-","SINAPI",null,"DIVERSOS","-",null,1,"-",null,null,0,0,""]
["S",2,"S",0,9,5,0,0,0,0,0,"","Serviço","Serviço","-","COMPOSIÇÃO","COMP 027_SEE","TELA MOSQUITEIRA EM NYLON COM ESTRUTURA DE ALUMÍNIO, COM FORNECIMENTO DE MÃO DE OBRA E INSTALAÇÃO","M2",5.52,1,5.52,null,null,0,0,""]
["S",2,"S",0,9,5,0,0,0,0,0,"","Serviço","Serviço","-","COMPOSIÇÃO","COMP 575_SEE","MOLA AEREA FECHA PORTA, PARA PORTAS COM LARGURA ATE 95 CM","UN ",2,1,2,null,null,0,0,""]
[2,2,2,2,9,6,0,0,0,2,{"$error":"#N/A"},"","Nível 2","Nível 2","-","SINAPI",null,"ESQUADRIAS METÁLICAS","-",null,1,"-",null,null,0,0,""]
["S",2,"S",0,9,6,0,0,0,0,0,"","Serviço","Serviço","-","AGETOP",180311,"GRADE DE PROTECAO/TUBO INDUSTRIAL/FERRO REDONDO-GP5","m2    ",1.32,1,1.32,null,null,0,0,""]
[1,{"$f":"IF(OR(C180=\"s\",C180=0),OFFSET(B180,-1,0),C180)","v":1},1,{"$f":"IF(OR(C180=\"S\",C180=0),0,IF(ISERROR(K180),J180,SMALL(J180:K180,1)))","v":73},10,0,0,0,0,145,73,"F","Nível 1","Nível 1","10.","SINAPI",null,"PROJETO HIDROSSANITÁRIO","UN",1,1,1,null,null,0,0,""]
[2,2,{"$f":"IF(OFFSET(C181,-1,0)=\"L\",1,IF(OFFSET(C181,-1,0)=1,2,IF(OR(A181=\"s\",A181=0),\"S\",IF(AND(OFFSET(C181,-1,0)=2,A181=4),3,IF(AND(OR(OFFSET(C181,-1,0)=\"s\",OFFSET(C181,-1,0)=0),A181<>\"s\",A181>OFFSET(B181,-1,0)),OFFSET(B181,-1,0),A181)))))","v":2},72,{"$f":"IF($C181=1,OFFSET(E181,-1,0)+1,OFFSET(E181,-1,0))","v":10},{"$f":"IF($C181=1,0,IF($C181=2,OFFSET(F181,-1,0)+1,OFFSET(F181,-1,0)))","v":1},{"$f":"IF(AND($C181<=2,$C181<>0),0,IF($C181=3,OFFSET(G181,-1,0)+1,OFFSET(G181,-1,0)))","v":0},{"$f":"IF(AND($C181<=3,$C181<>0),0,IF($C181=4,OFFSET(H181,-1,0)+1,OFFSET(H181,-1,0)))","v":0},0,72,142,"","Nível 2","Nível 2","-","SINAPI",null,"INSTALAÇÕES HIDROSSANITÁRIAS","-",null,1,"-",null,null,0,0,""]
[{"$f":"CHOOSE(1+LOG(1+2*(ORÇAMENTO.Nivel=\"Nível 1\")+4*(ORÇAMENTO.Nivel=\"Nível 2\")+8*(ORÇAMENTO.Nivel=\"Nível 3\")+16*(ORÇAMENTO.Nivel=\"Nível 4\")+32*(ORÇAMENTO.Nivel=\"Serviço\"),2),0,1,2,3,4,\"S\")","v":3},3,3,22,10,1,1,0,0,71,22,"","Nível 3","Nível 3","-","SINAPI",null,"PEÇAS E ACESSÓRIOS","-",null,1,"-",null,null,0,0,""]
[4,4,4,7,10,1,1,1,0,21,7,"","Nível 4","Nível 4","-","SINAPI",null,"VASO SANITÁRIO E ACESSÓRIOS","-",null,1,"-",null,null,0,0,""]
["S",4,"S",0,10,1,1,1,0,0,0,"","Serviço","Serviço","-","SINAPI",95470,"VASO SANITARIO SIFONADO CONVENCIONAL COM LOUÇA BRANCA, INCLUSO CONJUNTO DE LIGAÇÃO PARA BACIA SANITÁRIA AJUSTÁVEL - FORNECIMENTO E INSTALAÇÃO. AF_10/2016","UN",8,1,8,null,null,0,0,""]
["S",4,"S",0,10,1,1,1,0,0,0,"","Serviço","Serviço","-","SINAPI",99635,"VÁLVULA DE DESCARGA METÁLICA, BASE 1 1/2 \", ACABAMENTO METALICO CROMADO - FORNECIMENTO E INSTALAÇÃO. AF_01/2019","UN",8,1,8,null,null,0,0,""]
["S",4,"S",0,10,1,1,1,0,0,0,"","Serviço","Serviço","-","AGETOP",80520,"CONJUNTO DE FIXACAO P/VASO SANITARIO (PAR)","CJ    ",8,1,8,null,null,0,0,""]
["S",4,"S",0,10,1,1,1,0,0,0,"","Serviço","Serviço","-","AGETOP",80510,"ANEL DE VEDAÇÃO PARA VASO SANITÁRIO","Un    ",8,1,8,null,null,0,0,""]
["S",4,"S",0,10,1,1,1,0,0,0,"","Serviço","Serviço","-","AGETOP",80513,"TUBO PARA VÁLVULA DE DESCARGA ( CURTO 1.1/4\" )","Un    ",8,1,8,null,null,0,0,""]
["S",4,"S",0,10,1,1,1,0,0,0,"","Serviço","Serviço","-","AGETOP",80514,"TUBO DE LIGACAO PVC CROMADO 1.1/2\" / ESPUDE  - (ENTRADA)","Un    ",8,1,8,null,null,0,0,""]
[4,4,4,12,10,1,1,2,0,14,12,"","Nível 4","Nível 4","-","SINAPI",null,"LAVATÓRIO E ACESSÓRIOS","-",null,1,"-",null,null,0,0,""]
["S",4,"S",0,10,1,1,2,0,0,0,"","Serviço","Serviço","-","SINAPI",86903,"LAVATÓRIO LOUÇA BRANCA COM COLUNA, 45 X 55CM OU EQUIVALENTE, PADRÃO MÉDIO - FORNECIMENTO E INSTALAÇÃO. AF_01/2020","UN",5,1,5,null,null,0,0,""]
["S",4,"S",0,10,1,1,2,0,0,0,"","Serviço","Serviço","-","AGETOP",80542,"LAVATÓRIO MÉDIO SEM COLUNA","Un    ",2,1,2,null,null,0,0,""]
["S",4,"S",0,10,1,1,2,0,0,0,"","Serviço","Serviço","-","AGETOP",80550,"FIXACAO P/LAVATORIO (PAR)","PAR   ",7,1,7,null,null,0,0,""]
["S",4,"S",0,10,1,1,2,0,0,0,"","Serviço","Serviço","-","AGETOP",80556,"LIGAÇÃO FLEXÍVEL PVC DIAM.1/2\" (ENGATE)","Un    ",7,1,7,null,null,0,0,""]
["S",4,"S",0,10,1,1,2,0,0,0,"","Serviço","Serviço","-","SINAPI",86883,"SIFÃO DO TIPO FLEXÍVEL EM PVC 1  X 1.1/2  - FORNECIMENTO E INSTALAÇÃO. AF_01/2020","UN",7,1,7,null,null,0,0,""]
["S",4,"S",0,10,1,1,2,0,0,0,"","Serviço","Serviço","-","SINAPI",86877,"VÁLVULA EM METAL CROMADO 1.1/2\u0094 X 1.1/2\u0094 PARA TANQUE OU LAVATÓRIO, COM OU SEM LADRÃO - FORNECIMENTO E INSTALAÇÃO. AF_01/2020","UN",7,1,7,null,null,0,0,""]
["S",4,"S",0,10,1,1,2,0,{"$f":"IF(OR($C197=\"S\",$C197=0),0,MATCH(0,OFFSET($D197,1,$C197,ROW($C$325)-ROW($C197)),0))","v":0},{"$f":"IF(OR($C197=\"S\",$C197=0),0,MATCH(OFFSET($D197,0,$C197)+1,OFFSET($D197,1,$C197,ROW($C$325)-ROW($C197)),0))","v":0},"","Serviço","Serviço","-","SINAPI",86915,"TORNEIRA CROMADA DE MESA, 1/2\u0094 OU 3/4\u0094, PARA LAVATÓRIO, PADRÃO MÉDIO - FORNECIMENTO E INSTALAÇÃO. AF_01/2020","UN",7,1,7,null,null,0,0,""]
["S",4,"S",0,10,1,1,2,0,0,0,"","Serviço","Serviço","-","AGETOP",80601,"MICTORIO DE LOUCA C/SIFAO INTEGRADO","Un    ",2,1,2,null,null,0,0,""]
["S",4,"S",0,10,1,1,2,0,0,0,"","Serviço","Serviço","-","AGETOP",80610,"KIT FERR.P/MICT.LOUCA (ESPUDE,CONEXÃO ENTR.PARAFUSOS)","Un    ",2,1,2,null,null,0,0,""]
["S",4,"S",0,10,1,1,2,0,0,0,"","Serviço","Serviço","-","AGETOP",80613,"SIFÃO METÁLICO 1 1/2\" X 2\" P/MICTÓRIO","Un    ",2,1,2,null,null,0,0,""]
["S",4,"S",0,10,1,1,2,0,0,0,"","Serviço","Serviço","-","AGETOP",80621,"VÁLVULA DE DESCARGA PARA MICTÓRIO DIÂMETRO 1/2\" FECHAMENTO AUTOMÁTICO TEMPORIZADO","Un    ",2,1,2,null,null,0,0,""]
[4,4,4,2,10,1,1,3,{"$f":"IF(AND($C202<=4,$C202<>0),0,IF(AND($C202=\"S\",$Y202>0),OFFSET(I202,-1,0)+1,OFFSET(I202,-1,0)))","v":0},2,11,"","Nível 4","Nível 4","-","SINAPI",null,"REGISTROS","-",null,1,"-",null,null,0,0,""]
["S",4,"S",0,10,1,1,3,0,0,0,"","Serviço","Serviço","-","AGETOP",80902,"REGISTRO DE GAVETA BRUTO DIAMETRO 3/4\"","Un    ",2,1,2,null,null,0,0,""]
[3,3,3,14,10,1,2,0,0,49,14,"","Nível 3","Nível 3","-","SINAPI",null,"ÁGUA FRIA","-",null,1,"-",null,null,0,0,""]
[4,4,4,2,10,1,2,1,0,13,2,"","Nível 4","Nível 4","-","SINAPI",null,"TUBOS DE PVC SOLDÁVEL","-",null,1,"-",null,null,0,0,""]
["S",4,"S",0,10,1,2,1,0,0,0,"","Serviço","Serviço","-","SINAPI",89402,"TUBO, PVC, SOLDÁVEL, DN 25MM, INSTALADO EM RAMAL DE DISTRIBUIÇÃO DE ÁGUA - FORNECIMENTO E INSTALAÇÃO. AF_12/2014","M",6,1,6,null,null,0,0,""]
[4,4,4,2,10,1,2,2,0,11,2,"","Nível 4","Nível 4","-","SINAPI",null,"ADAPTADORES DE PVC SOLDÁVEL","-",null,1,"-",null,null,0,0,""]
["S",4,"S",0,10,1,2,2,0,0,0,"","Serviço","Serviço","-","SINAPI",89538,"ADAPTADOR CURTO COM BOLSA E ROSCA PARA REGISTRO, PVC, SOLDÁVEL, DN 25MM X 3/4\u0094, INSTALADO EM PRUMADA DE ÁGUA - FORNECIMENTO E INSTALAÇÃO. AF_12/2014","UN",4,1,4,null,null,0,0,""]
[4,4,4,4,10,1,2,3,0,9,4,"","Nível 4","Nível 4","-","SINAPI",null,"JOELHO","-",null,1,"-",null,null,0,0,""]
["S",4,"S",0,10,1,2,3,0,0,0,"","Serviço","Serviço","-","SINAPI",89481,"JOELHO 90 GRAUS, PVC, SOLDÁVEL, DN 25MM, INSTALADO EM PRUMADA DE ÁGUA - FORNECIMENTO E INSTALAÇÃO. AF_12/2014","UN",2,1,2,null,null,0,0,""]
["S",4,"S",0,10,1,2,3,0,0,0,"","Serviço","Serviço","-","AGETOP",81360,"JOELHO RED.90 GRAUS SOLD.C/BUCHA LATAO 25X1/2\"","Un    ",2,1,2,null,null,0,0,""]
["S",4,"S",0,10,1,2,3,0,0,0,"","Serviço","Serviço","-","SINAPI",94672,"JOELHO 90 GRAUS COM BUCHA DE LATÃO, PVC, SOLDÁVEL, DN  25 MM, X 3/4\u0094 INSTALADO EM RESERVAÇÃO DE ÁGUA DE EDIFICAÇÃO QUE POSSUA RESERVATÓRIO DE FIBRA/FIBROCIMENTO   FORNECIMENTO E INSTALAÇÃO. AF_06/2016","UN",2,1,2,null,null,0,0,""]
[4,4,4,2,10,1,2,4,0,5,2,"","Nível 4","Nível 4","-","SINAPI",null,"TÊ","-",null,1,"-",null,null,0,0,""]
["S",4,"S",0,10,1,2,4,0,{"$f":"IF(OR($C214=\"S\",$C214=0),0,MATCH(0,OFFSET($D214,1,$C214,ROW($C$325)-ROW($C214)),0))","v":0},{"$f":"IF(OR($C214=\"S\",$C214=0),0,MATCH(OFFSET($D214,0,$C214)+1,OFFSET($D214,1,$C214,ROW($C$325)-ROW($C214)),0))","v":0},"","Serviço","Serviço","-","SINAPI",89617,"TE, PVC, SOLDÁVEL, DN 25MM, INSTALADO EM PRUMADA DE ÁGUA - FORNECIMENTO E INSTALAÇÃO. AF_12/2014","UN",2,1,2,null,null,0,0,""]
[4,4,4,3,10,1,2,5,0,3,19,"","Nível 4","Nível 4","-","SINAPI",null,"ADESIVOS","-",null,1,"-",null,null,0,0,""]
["S",4,"S",0,10,1,2,5,0,0,0,"","Serviço","Serviço","-","AGETOP",81501,"ADESIVO PLASTICO - FRASCO 850 G","Un    ",1,1,1,null,null,0,0,""]
["S",4,"S",0,10,1,2,5,0,0,0,"","Serviço","Serviço","-","AGETOP",81504,"SOLUCAO LIMPADORA 1000 CM3","Un    ",1,1,1,null,null,0,0,""]
[3,3,3,19,10,1,3,0,0,35,19,"","Nível 3","Nível 3","-","SINAPI",null,"ESGOTO SANITÁRIO","-",null,1,"-",null,null,0,0,""]
[4,4,4,4,10,1,3,1,0,18,4,"","Nível 4","Nível 4","-","SINAPI",null,"CORPO DE CAIXA SIFONADA / RALO","-",null,1,"-",null,null,0,0,""]
["S",4,"S",0,10,1,3,1,0,0,0,"","Serviço","Serviço","-","AGETOP",81663,"CORPO CX. SIFONADA DIAM. 150 X 150 X 50","Un    ",1,1,1,null,null,0,0,""]
["S",4,"S",0,10,1,3,1,0,0,0,"","Serviço","Serviço","-","AGETOP",81696,"PROLONGAMENTO PARA CAIXA SIFONADA 150 MM","M     ",1,1,1,null,null,0,0,""]
["S",4,"S",0,10,1,3,1,0,0,0,"","Serviço","Serviço","-","AGETOP",81791,"GRELHA REDONDA BRANCA DIAM. 150 MM","Un    ",1,1,1,null,null,0,0,""]
[4,4,4,4,10,1,3,2,0,14,4,"","Nível 4","Nível 4","-","SINAPI",null,"CURVAS","-",null,1,"-",null,null,0,0,""]
["S",4,"S",0,10,1,3,2,0,0,0,"","Serviço","Serviço","-","AGETOP",81550,"CURVA 45º DIAMETRO 50 MM","Un    ",1,1,1,null,null,0,0,""]
["S",4,"S",0,10,1,3,2,0,0,0,"","Serviço","Serviço","-","AGETOP",81731,"CURVA 90 GRAUS CURTA DIAM. 50 MM","Un    ",3,1,3,null,null,0,0,""]
["S",4,"S",0,10,1,3,2,0,0,0,"","Serviço","Serviço","-","AGETOP",81730,"CURVA 90 GRAUS CURTA DIAM. 40 MM","Un    ",2,1,2,null,null,0,0,""]
[4,4,4,3,10,1,3,3,0,10,3,"","Nível 4","Nível 4","-","SINAPI",null,"JOELHOS","-",null,1,"-",null,null,0,0,""]
["S",4,"S",0,10,1,3,3,0,0,0,"","Serviço","Serviço","-","SINAPI",89731,"JOELHO 90 GRAUS, PVC, SERIE NORMAL, ESGOTO PREDIAL, DN 50 MM, JUNTA ELÁSTICA, FORNECIDO E INSTALADO EM RAMAL DE DESCARGA OU RAMAL DE ESGOTO SANITÁRIO. AF_12/2014","UN",4,1,4,null,null,0,0,""]
["S",4,"S",0,10,1,3,3,0,0,0,"","Serviço","Serviço","-","AGETOP",81927,"JOELHO 90 GRAUS C/ANEL 40 mm ","Un    ",2,1,2,null,null,0,0,""]
[4,4,4,2,10,1,3,4,0,7,2,"","Nível 4","Nível 4","-","SINAPI",null,"JUNÇÕES","-",null,1,"-",null,null,0,0,""]
["S",4,"S",0,10,1,3,4,0,0,0,"","Serviço","Serviço","-","SINAPI",89785,"JUNÇÃO SIMPLES, PVC, SERIE NORMAL, ESGOTO PREDIAL, DN 50 X 50 MM, JUNTA ELÁSTICA, FORNECIDO E INSTALADO EM RAMAL DE DESCARGA OU RAMAL DE ESGOTO SANITÁRIO. AF_12/2014","UN",1,1,1,null,null,0,0,""]
[4,4,4,2,10,1,3,5,0,5,2,"","Nível 4","Nível 4","-","SINAPI",null,"TÊ","-",null,1,"-",null,null,0,0,""]
["S",4,"S",0,10,1,3,5,0,0,0,"","Serviço","Serviço","-","SINAPI",89825,"TE, PVC, SERIE NORMAL, ESGOTO PREDIAL, DN 50 X 50 MM, JUNTA ELÁSTICA, FORNECIDO E INSTALADO EM PRUMADA DE ESGOTO SANITÁRIO OU VENTILAÇÃO. AF_12/2014","UN",3,1,3,null,null,0,0,""]
[4,4,4,3,10,1,3,6,0,3,{"$error":"#N/A"},"","Nível 4","Nível 4","-","SINAPI",null,"TUBOS","-",null,1,"-",null,null,0,0,""]
["S",4,"S",0,10,1,3,6,0,0,0,"","Serviço","Serviço","-","SINAPI",89711,"TUBO PVC, SERIE NORMAL, ESGOTO PREDIAL, DN 40 MM, FORNECIDO E INSTALADO EM RAMAL DE DESCARGA OU RAMAL DE ESGOTO SANITÁRIO. AF_12/2014","M",3,1,3,null,null,0,0,""]
["S",4,"S",0,10,1,3,6,0,0,0,"","Serviço","Serviço","-","SINAPI",89798,"TUBO PVC, SERIE NORMAL, ESGOTO PREDIAL, DN 50 MM, FORNECIDO E INSTALADO EM PRUMADA DE ESGOTO SANITÁRIO OU VENTILAÇÃO. AF_12/2014","M",12,1,12,null,null,0,0,""]
[3,3,3,4,10,1,4,0,0,16,4,"","Nível 3","Nível 3","-","SINAPI",null,"OUTROS","-",null,1,"-",null,null,0,0,""]
["S",3,"S",0,10,1,4,0,0,0,0,"","Serviço","Serviço","-","AGETOP",81885,"TERMINAL DE VENTILACAO DIAMETRO 50 MM","Un    ",1,1,1,null,null,0,0,""]
["S",3,"S",0,10,1,4,0,0,0,0,"","Serviço","Serviço","-","AGETOP",81825,"CAIXA DE PASSAGEM 60 X 60 CM SEM TAMPA","Un    ",1,1,1,null,null,0,0,""]
["S",3,"S",0,10,1,4,0,0,0,0,"","Serviço","Serviço","-","AGETOP",81826,"TAMPA EM CONCRETO ARMADO 25 MPA E=5CM PARA A CAIXA DE PASSAGEM 60X60CM","Un    ",1,1,1,null,null,0,0,""]
[3,3,3,6,10,1,5,0,0,12,6,"","Nível 3","Nível 3","-","SINAPI",null,"DEMOLIÇÕES","-",null,1,"-",null,null,0,0,""]
[4,4,4,5,10,1,5,1,0,5,{"$error":"#N/A"},"","Nível 4","Nível 4","-","SINAPI",null,"PISO DE CONCRETO","-",null,1,"-",null,null,0,0,""]
["S",4,"S",0,10,1,5,1,0,0,0,"","Serviço","Serviço","-","AGETOP",20121,"DEM. MANUAL EM CONCR.SIMPLES C/TR.ATE CB.E CARGA (O.C.)","m3    ",0.35,1,0.35,null,null,0,0,""]
["S",4,"S",0,10,1,5,1,0,0,0,"","Serviço","Serviço","-","AGETOP",40101,"ESCAVACAO MANUAL DE VALAS < 1 MTS. (OBRAS CIVIS)","m3    ",3.5,1,3.5,null,null,0,0,""]
["S",{"$f":"IF(OR(C245=\"s\",C245=0),OFFSET(B245,-1,0),C245)","v":4},"S",{"$f":"IF(OR(C245=\"S\",C245=0),0,IF(ISERROR(K245),J245,SMALL(J245:K245,1)))","v":0},10,1,5,1,0,0,0,"","Serviço","Serviço","-","AGETOP",40902,"REATERRO COM APILOAMENTO","m3    ",3.5,1,3.5,null,null,0,0,""]
["S",4,{"$f":"IF(OFFSET(C246,-1,0)=\"L\",1,IF(OFFSET(C246,-1,0)=1,2,IF(OR(A246=\"s\",A246=0),\"S\",IF(AND(OFFSET(C246,-1,0)=2,A246=4),3,IF(AND(OR(OFFSET(C246,-1,0)=\"s\",OFFSET(C246,-1,0)=0),A246<>\"s\",A246>OFFSET(B246,-1,0)),OFFSET(B246,-1,0),A246)))))","v":"S"},0,{"$f":"IF($C246=1,OFFSET(E246,-1,0)+1,OFFSET(E246,-1,0))","v":10},{"$f":"IF($C246=1,0,IF($C246=2,OFFSET(F246,-1,0)+1,OFFSET(F246,-1,0)))","v":1},{"$f":"IF(AND($C246<=2,$C246<>0),0,IF($C246=3,OFFSET(G246,-1,0)+1,OFFSET(G246,-1,0)))","v":5},{"$f":"IF(AND($C246<=3,$C246<>0),0,IF($C246=4,OFFSET(H246,-1,0)+1,OFFSET(H246,-1,0)))","v":1},0,0,0,"","Serviço","Serviço","-","AGETOP",220102,"PISO CONCRETO DESEMPENADO ESPESSURA = 5 CM  1:2,5:3,5","m2    ",0.35,1,0.35,null,null,0,0,""]
[{"$f":"CHOOSE(1+LOG(1+2*(ORÇAMENTO.Nivel=\"Nível 1\")+4*(ORÇAMENTO.Nivel=\"Nível 2\")+8*(ORÇAMENTO.Nivel=\"Nível 3\")+16*(ORÇAMENTO.Nivel=\"Nível 4\")+32*(ORÇAMENTO.Nivel=\"Serviço\"),2),0,1,2,3,4,\"S\")","v":3},3,3,6,10,1,6,0,0,6,{"$error":"#N/A"},"","Nível 3","Nível 3","-","SINAPI",null,"PISO CERÂMICO/ARDÓSIA","-",null,1,"-",null,null,0,0,""]
["S",3,"S",0,10,1,6,0,0,0,0,"","Serviço","Serviço","-","AGETOP",20111,"DEM.PISO CERAM.SOBRE LASTRO CONC.C/TR.CB.E CARGA","m2    ",0.24,1,0.24,null,null,0,0,""]
["S",3,"S",0,10,1,6,0,0,0,0,"","Serviço","Serviço","-","AGETOP",40101,"ESCAVACAO MANUAL DE VALAS < 1 MTS. (OBRAS CIVIS)","m3    ",2,1,2,null,null,0,0,""]
["S",3,"S",0,10,1,6,0,0,0,0,"","Serviço","Serviço","-","AGETOP",40902,"REATERRO COM APILOAMENTO","m3    ",2,1,2,null,null,0,0,""]
["S",3,"S",0,10,1,6,0,0,0,0,"","Serviço","Serviço","-","AGETOP",220101,"LASTRO DE CONCRETO REGULARIZADO IMPERMEABILIZADO 1:3:6 ESP=5CM (BASE)","m2    ",0.4,1,0.4,null,null,0,0,""]
["S",3,"S",0,10,1,6,0,0,0,0,"","Serviço","Serviço","-","SINAPI",87251,"REVESTIMENTO CERÂMICO PARA PISO COM PLACAS TIPO ESMALTADA EXTRA DE DIMENSÕES 45X45 CM APLICADA EM AMBIENTES DE ÁREA MAIOR QUE 10 M2. AF_06/2014","M2",0.24,1,0.24,null,null,0,0,""]
[1,1,1,54,11,0,0,0,0,72,54,"F","Nível 1","Nível 1","11.","SINAPI",null,"REFORMA ELÉTRICA","UN",1,1,1,null,null,0,0,""]
[2,2,2,53,11,1,0,0,0,53,69,"","Nível 2","Nível 2","-","SINAPI",null,"INSTALAÇÕES ELÉTRICAS","-",null,1,"-",null,null,0,0,""]
["S",2,"S",0,11,1,0,0,0,0,0,"","Serviço","Serviço","-","SINAPI",93358,"ESCAVAÇÃO MANUAL DE VALA COM PROFUNDIDADE MENOR OU IGUAL A 1,30 M. AF_03/2016","M3",7,1,7,null,null,0,0,""]
["S",2,"S",0,11,1,0,0,0,0,0,"","Serviço","Serviço","-","SINAPI",96995,"REATERRO MANUAL APILOADO COM SOQUETE. AF_10/2017","M3",7,1,7,null,null,0,0,""]
["S",2,"S",0,11,1,0,0,0,0,0,"","Serviço","Serviço","-","AGETOP",70371,"BRACADEIRA METALICA TIPO \"D\" DIAM. 3/4\"","Un    ",298,1,298,null,null,0,0,""]
["S",2,"S",0,11,1,0,0,0,0,0,"","Serviço","Serviço","-","AGETOP",70421,"BUCHA E ARRUELA METALICA DIAM. 3/4\"","PR    ",298,1,298,null,null,0,0,""]
["S",2,"S",0,11,1,0,0,0,0,0,"","Serviço","Serviço","-","AGETOP",70372,"BRACADEIRA METALICA TIPO \"D\" DIAM. 1\"","Un    ",52,1,52,null,null,0,0,""]
["S",2,"S",0,11,1,0,0,{"$f":"IF(AND($C260<=4,$C260<>0),0,IF(AND($C260=\"S\",$Y260>0),OFFSET(I260,-1,0)+1,OFFSET(I260,-1,0)))","v":0},0,0,"","Serviço","Serviço","-","AGETOP",70422,"BUCHA E ARRUELA METALICA DIAM. 1\"","PR    ",52,1,52,null,null,0,0,""]
["S",2,"S",0,11,1,0,0,0,0,0,"","Serviço","Serviço","-","AGETOP",70374,"BRACADEIRA METALICA TIPO \"D\" DIAM. 1.1/2\"","Un    ",16,1,16,null,null,0,0,""]
["S",2,"S",0,11,1,0,0,0,0,0,"","Serviço","Serviço","-","AGETOP",70424,"BUCHA E ARRUELA METALICA DIAM. 1.1/2\"","PR    ",16,1,16,null,null,0,0,""]
["S",2,"S",0,11,1,0,0,0,0,0,"","Serviço","Serviço","-","AGETOP",70375,"BRACADEIRA METALICA TIPO \"D\" DIAM. 2\"","Un    ",10,1,10,null,null,0,0,""]
["S",2,"S",0,11,1,0,0,0,0,0,"","Serviço","Serviço","-","AGETOP",70425,"BUCHA E ARRUELA METALICA DIAM. 2\"","PR    ",10,1,10,null,null,0,0,""]
["S",2,"S",0,11,1,0,0,0,0,0,"","Serviço","Serviço","-","AGETOP",71251,"ELETRODUTO EM AÇO ZINCADO DIÂMETRO 3/4\"","M     ",447,1,447,null,null,0,0,""]
["S",2,"S",0,11,1,0,0,0,0,0,"","Serviço","Serviço","-","AGETOP",71252,"ELETRODUTO EM AÇO ZINCADO DIÂMETRO 1\"","M     ",78,1,78,null,null,0,0,""]
["S",2,"S",0,11,1,0,0,0,0,0,"","Serviço","Serviço","-","AGETOP",71254,"ELETRODUTO EM AÇO ZINCADO DIÂMETRO 1.1/2\"","M     ",24,1,24,null,null,0,0,""]
["S",2,"S",0,11,1,0,0,0,0,0,"","Serviço","Serviço","-","AGETOP",71255,"ELETRODUTO EM AÇO ZINCADO DIÂMETRO 2\"","M     ",15,1,15,null,null,0,0,""]
["S",2,"S",0,11,1,0,0,0,0,0,"","Serviço","Serviço","-","AGETOP",71722,"LUVA EM AÇO ZINCADO DIÂMETRO 3/4\"","Un    ",176,1,176,null,null,0,0,""]
["S",2,"S",0,11,1,0,0,0,0,0,"","Serviço","Serviço","-","AGETOP",71121,"CURVA 90 GRAUS AÇO ZINCADO DIÂMETRO 3/4\"","Un    ",88,1,88,null,null,0,0,""]
["S",2,"S",0,11,1,0,0,0,0,0,"","Serviço","Serviço","-","AGETOP",71721,"LUVA EM AÇO ZINCADO DIÂMETRO 1\"","Un    ",6,1,6,null,null,0,0,""]
["S",2,"S",0,11,1,0,0,0,0,0,"","Serviço","Serviço","-","AGETOP",71122,"CURVA 90 GRAUS AÇO ZINCADO DIÂMETRO 1\"","Un    ",3,1,3,null,null,0,0,""]
["S",2,"S",0,11,1,0,0,0,0,0,"","Serviço","Serviço","-","AGETOP",71724,"LUVA EM AÇO ZINCADO DIÂMETRO 1.1/2\"","Un    ",6,1,6,null,null,0,0,""]
["S",2,"S",0,11,1,0,0,0,0,0,"","Serviço","Serviço","-","AGETOP",71124,"CURVA 90 GRAUS AÇO ZINCADO DIÂMETRO 1.1/2\"","Un    ",3,1,3,null,null,0,0,""]
["S",2,"S",0,11,1,0,0,0,0,0,"","Serviço","Serviço","-","AGETOP",71725,"LUVA EM AÇO ZINCADO DIÂMETRO 2\"","Un    ",2,1,2,null,null,0,0,""]
["S",2,"S",0,11,1,0,0,0,0,0,"","Serviço","Serviço","-","AGETOP",71125,"CURVA 90 GRAUS AÇO ZINCADO DIÂMETRO 2\"","Un    ",1,1,1,null,null,0,0,""]
["S",2,"S",0,11,1,0,0,0,0,0,"","Serviço","Serviço","-","SINAPI",97667,"ELETRODUTO FLEXÍVEL CORRUGADO, PEAD, DN 50 (1 ½\u0094)  - FORNECIMENTO E INSTALAÇÃO. AF_04/2016","M",12,1,12,null,null,0,0,""]
["S",2,"S",0,11,1,0,0,0,{"$f":"IF(OR($C278=\"S\",$C278=0),0,MATCH(0,OFFSET($D278,1,$C278,ROW($C$325)-ROW($C278)),0))","v":0},{"$f":"IF(OR($C278=\"S\",$C278=0),0,MATCH(OFFSET($D278,0,$C278)+1,OFFSET($D278,1,$C278,ROW($C$325)-ROW($C278)),0))","v":0},"","Serviço","Serviço","-","AGETOP",70924,"CONDULETE DE PVC - CAIXA COM 5 ENTRADAS ","un    ",115,1,115,null,null,0,0,""]
["S",2,"S",0,11,1,0,0,0,0,0,"","Serviço","Serviço","-","SINAPI",92008,"TOMADA BAIXA DE EMBUTIR (2 MÓDULOS), 2P+T 10 A, INCLUINDO SUPORTE E PLACA - FORNECIMENTO E INSTALAÇÃO. AF_12/2015","UN",15,1,15,null,null,0,0,""]
["S",2,"S",0,11,1,0,0,0,0,0,"","Serviço","Serviço","-","SINAPI",92004,"TOMADA MÉDIA DE EMBUTIR (2 MÓDULOS), 2P+T 10 A, INCLUINDO SUPORTE E PLACA - FORNECIMENTO E INSTALAÇÃO. AF_12/2015","UN",4,1,4,null,null,0,0,""]
["S",2,"S",0,11,1,0,0,0,0,0,"","Serviço","Serviço","-","SINAPI",92000,"TOMADA BAIXA DE EMBUTIR (1 MÓDULO), 2P+T 10 A, INCLUINDO SUPORTE E PLACA - FORNECIMENTO E INSTALAÇÃO. AF_12/2015","UN",40,1,40,null,null,0,0,""]
["S",2,"S",0,11,1,0,0,0,0,0,"","Serviço","Serviço","-","AGETOP",71411,"INTERRUPTOR 1 SEÇÃO (LINHA X OU EQUIVALENTE)","Un    ",27,1,27,null,null,0,0,""]
["S",2,"S",0,11,1,0,0,0,0,0,"","Serviço","Serviço","-","AGETOP",71442,"INTERRUPTOR SIMPLES (3 SECOES)","Un    ",4,1,4,null,null,0,0,""]
["S",2,"S",0,11,1,0,0,0,0,0,"","Serviço","Serviço","-","AGETOP",71043,"CONECTOR TRIPOLAR EM PORCELANA PARA FIOS DE ATÉ 10MM2 (BORNES) 50A-250V (CHUVEIRO)","un    ",10,1,10,null,null,0,0,""]
["S",2,"S",0,11,1,0,0,0,0,0,"","Serviço","Serviço","-","AGETOP",72575,"TOMADA HEXAGONAL 2P + T - 20A - 250V (LINHA X OU EQUIVALENTE)","Un    ",10,1,10,null,null,0,0,""]
["S",2,"S",0,11,1,0,0,0,0,0,"","Serviço","Serviço","-","SINAPI",97592,"LUMINÁRIA TIPO PLAFON, DE SOBREPOR, COM 1 LÂMPADA LED DE 12/13 W, SEM REATOR - FORNECIMENTO E INSTALAÇÃO. AF_02/2020","UN",102,1,102,null,null,0,0,""]
["S",2,"S",0,11,1,0,0,0,0,0,"","Serviço","Serviço","-","SINAPI",91926,"CABO DE COBRE FLEXÍVEL ISOLADO, 2,5 MM², ANTI-CHAMA 450/750 V, PARA CIRCUITOS TERMINAIS - FORNECIMENTO E INSTALAÇÃO. AF_12/2015","M",2935,1,2935,null,null,0,0,""]
["S",2,"S",0,11,1,0,0,0,0,0,"","Serviço","Serviço","-","SINAPI",91928,"CABO DE COBRE FLEXÍVEL ISOLADO, 4 MM², ANTI-CHAMA 450/750 V, PARA CIRCUITOS TERMINAIS - FORNECIMENTO E INSTALAÇÃO. AF_12/2015","M",230,1,230,null,null,0,0,""]
["S",2,"S",0,11,1,0,0,0,0,0,"","Serviço","Serviço","-","SINAPI",92982,"CABO DE COBRE FLEXÍVEL ISOLADO, 16 MM², ANTI-CHAMA 0,6/1,0 KV, PARA DISTRIBUIÇÃO - FORNECIMENTO E INSTALAÇÃO. AF_12/2015","M",120,1,120,null,null,0,0,""]
["S",2,"S",0,11,1,0,0,0,0,0,"","Serviço","Serviço","-","AGETOP",70646,"CAIXA DE PASSAGEM METÁLICA DE EMBUTIR 20X20X10 CM","Un    ",1,1,1,null,null,0,0,""]
["S",2,"S",0,11,1,0,0,0,0,0,"","Serviço","Serviço","-","COMPOSIÇÃO","COMP 022_SEE","TAMPÃO FOFO 40X50CM C/INSCRIÇÃO ","UN ",2,1,2,null,null,0,0,""]
["S",2,"S",0,11,1,0,0,0,0,0,"","Serviço","Serviço","-","AGETOP",70716,"CAIXA DE PASSAGEM 80X80X110 CM FUNDO DE BRITA SEM TAMPA","Un    ",2,1,2,null,null,0,0,""]
["S",2,"S",0,11,1,0,0,0,0,0,"","Serviço","Serviço","-","SINAPI","74131/7","QUADRO DE DISTRIBUICAO DE ENERGIA DE EMBUTIR, EM CHAPA METALICA, PARA 40 DISJUNTORES TERMOMAGNETICOS MONOPOLARES, COM BARRAMENTO TRIFASICO E NEUTRO, FORNECIMENTO E INSTALACAO","UN",1,1,1,null,null,0,0,""]
["S",2,"S",0,11,1,0,0,0,0,0,"","Serviço","Serviço","-","AGETOP",71184,"DISPOSITIVO DE PROTEÇÃO CONTRA SURTOS (D.P.S.) 275V DE 8 A 40KA","Un    ",3,1,3,null,null,0,0,""]
["S",2,"S",0,11,1,0,0,0,0,0,"","Serviço","Serviço","-","SINAPI",93655,"DISJUNTOR MONOPOLAR TIPO DIN, CORRENTE NOMINAL DE 20A - FORNECIMENTO E INSTALAÇÃO. AF_04/2016","UN",3,1,3,null,null,0,0,""]
["S",2,"S",0,11,1,0,0,0,0,0,"","Serviço","Serviço","-","SINAPI",93654,"DISJUNTOR MONOPOLAR TIPO DIN, CORRENTE NOMINAL DE 16A - FORNECIMENTO E INSTALAÇÃO. AF_04/2016","UN",17,1,17,null,null,0,0,""]
["S",2,"S",0,11,1,0,0,0,0,0,"","Serviço","Serviço","-","SINAPI",93656,"DISJUNTOR MONOPOLAR TIPO DIN, CORRENTE NOMINAL DE 25A - FORNECIMENTO E INSTALAÇÃO. AF_04/2016","UN",4,1,4,null,null,0,0,""]
["S",2,"S",0,11,1,0,0,0,0,0,"","Serviço","Serviço","-","AGETOP",71175,"DISJUNTOR TRIPOLAR DE 60 A 100-A","Un    ",2,1,2,null,null,0,0,""]
["S",2,"S",0,11,1,0,0,0,0,0,"","Serviço","Serviço","-","AGETOP",70764,"CANALETA COM TAMPA (LINHA X OU EQUIVALENTE) 50X20X2000 MM","M     ",2,1,2,null,null,0,0,""]
["S",2,"S",0,11,1,0,0,0,0,0,"","Serviço","Serviço","-","AGETOP",72630,"TRILHO OU SUPORTE P/BORNE TERMINAL","M     ",4,1,4,null,null,0,0,""]
["S",2,"S",0,11,1,0,0,0,0,0,"","Serviço","Serviço","-","AGETOP",70255,"ATERRAMENTO - SOLDA EXOTÉRMICA - CARTUCHO 90 G","un    ",5,1,5,null,null,0,0,""]
["S",2,"S",0,11,1,0,0,0,0,0,"","Serviço","Serviço","-","SINAPI",98111,"CAIXA DE INSPEÇÃO PARA ATERRAMENTO, CIRCULAR, EM POLIETILENO, DIÂMETRO INTERNO = 0,3 M. AF_05/2018","UN",1,1,1,null,null,0,0,""]
["S",2,"S",0,11,1,0,0,0,0,0,"","Serviço","Serviço","-","SINAPI",96986,"HASTE DE ATERRAMENTO 3/4  PARA SPDA - FORNECIMENTO E INSTALAÇÃO. AF_12/2017","UN",4,1,4,null,null,0,0,""]
["S",2,"S",0,11,1,0,0,0,0,0,"","Serviço","Serviço","-","AGETOP",70541,"CABO DE COBRE NU No. 16 MM2 (6,94 M/KG)","M     ",18,1,18,null,null,0,0,""]
["S",2,"S",0,11,1,0,0,0,0,0,"","Serviço","Serviço","-","AGETOP",71331,"FITA ISOLANTE, ROLO DE 20,00 M","Un    ",10,1,10,null,null,0,0,""]
["S",2,"S",0,11,1,0,0,0,0,0,"","Serviço","Serviço","-","AGETOP",71826,"PADRÃO TRIFASICO 25 MM H=7 METROS","Un    ",1,1,1,null,null,0,0,""]
[1,1,1,12,12,0,0,0,0,18,12,"F","Nível 1","Nível 1","12.","SINAPI",null,"INSTALAÇÕES DE PREVENÇÃO E COMBATE À INCÊNDIO","UN",1,1,1,null,null,0,0,""]
[2,2,2,11,12,1,0,0,0,11,15,"","Nível 2","Nível 2","-","SINAPI",null,"INSTALAÇÕES ESPECIAIS","-",null,1,"-",null,null,0,0,""]
["S",{"$f":"IF(OR(C309=\"s\",C309=0),OFFSET(B309,-1,0),C309)","v":2},"S",{"$f":"IF(OR(C309=\"S\",C309=0),0,IF(ISERROR(K309),J309,SMALL(J309:K309,1)))","v":0},12,1,0,0,{"$f":"IF(AND($C309<=4,$C309<>0),0,IF(AND($C309=\"S\",$Y309>0),OFFSET(I309,-1,0)+1,OFFSET(I309,-1,0)))","v":0},0,0,"","Serviço","Serviço","-","AGETOP",85003,"EXTINTOR PO QUIMICO SECO (6 KG) - CAPACIDADE EXTINTORA 20 BC","Un    ",1,1,1,null,null,0,0,""]
[{"$f":"CHOOSE(1+LOG(1+2*(ORÇAMENTO.Nivel=\"Nível 1\")+4*(ORÇAMENTO.Nivel=\"Nível 2\")+8*(ORÇAMENTO.Nivel=\"Nível 3\")+16*(ORÇAMENTO.Nivel=\"Nível 4\")+32*(ORÇAMENTO.Nivel=\"Serviço\"),2),0,1,2,3,4,\"S\")","v":"S"},2,{"$f":"IF(OFFSET(C310,-1,0)=\"L\",1,IF(OFFSET(C310,-1,0)=1,2,IF(OR(A310=\"s\",A310=0),\"S\",IF(AND(OFFSET(C310,-1,0)=2,A310=4),3,IF(AND(OR(OFFSET(C310,-1,0)=\"s\",OFFSET(C310,-1,0)=0),A310<>\"s\",A310>OFFSET(B310,-1,0)),OFFSET(B310,-1,0),A310)))))","v":"S"},0,{"$f":"IF($C310=1,OFFSET(E310,-1,0)+1,OFFSET(E310,-1,0))","v":12},{"$f":"IF($C310=1,0,IF($C310=2,OFFSET(F310,-1,0)+1,OFFSET(F310,-1,0)))","v":1},{"$f":"IF(AND($C310<=2,$C310<>0),0,IF($C310=3,OFFSET(G310,-1,0)+1,OFFSET(G310,-1,0)))","v":0},{"$f":"IF(AND($C310<=3,$C310<>0),0,IF($C310=4,OFFSET(H310,-1,0)+1,OFFSET(H310,-1,0)))","v":0},0,0,0,"","Serviço","Serviço","-","AGETOP",85006,"EXTINTOR MULTI USO EM PO A B C (6 KG) - CAPACIDADE EXTINTORA 3A 20BC","un    ",2,1,2,null,null,0,0,""]
["S",2,"S",0,12,1,0,0,0,0,0,"","Serviço","Serviço","-","SINAPI",97599,"LUMINÁRIA DE EMERGÊNCIA, COM 30 LÂMPADAS LED DE 2 W, SEM REATOR - FORNECIMENTO E INSTALAÇÃO. AF_02/2020","UN",8,1,8,null,null,0,0,""]
["S",2,"S",0,12,1,0,0,0,0,0,"","Serviço","Serviço","-","COMPOSIÇÃO","COMP 024_SEE","SINALIZADOR FOTOLUMINESCENTE PARA EXTINTOR","UN ",3,1,3,null,null,0,0,""]
["S",2,"S",0,12,1,0,0,0,0,0,"","Serviço","Serviço","-","COMPOSIÇÃO","COMP 025_SEE","SINALIZADOR FOTOLUMINESCENTE DE EMERGÊNCIA","UN ",6,1,6,null,null,0,0,""]
["S",2,"S",0,12,1,0,0,0,0,0,"","Serviço","Serviço","-","COMPOSIÇÃO","COMP 277_SEE","MARCAÇÃO NO PISO - 1X1 M PARA EXTINTOR","M2",3,1,3,null,null,0,0,""]
["S",2,"S",0,12,1,0,0,0,0,0,"","Serviço","Serviço","-","COMPOSIÇÃO","COMP 235_SEE","PLACA DE SINALIZAÇÃO EM PVC COD 01 - (300X300) PROIBIDO FUMAR","UN ",1,1,1,null,null,0,0,""]
["S",2,"S",0,12,1,0,0,0,0,0,"","Serviço","Serviço","-","COMPOSIÇÃO","COMP 236_SEE","PLACA DE SINALIZAÇÃO EM PVC COD 06 - (300X300) PERIGO INFLAMÁVEL","UN ",1,1,1,null,null,0,0,""]
["S",2,"S",0,12,1,0,0,0,0,0,"","Serviço","Serviço","-","COMPOSIÇÃO","COMP 411_SEE","PLACA DE SINALIZAÇÃO EM PVC COD 13 - (316X158) SAÍDA DE EMERGÊNCIA","UN ",1,1,1,null,null,0,0,""]
["S",2,"S",0,12,1,0,0,0,0,0,"","Serviço","Serviço","-","COMPOSIÇÃO","COMP 412_SEE","PLACA DE SINALIZAÇÃO EM PVC COD 17 - (316X158) MENSAGEM \"SAÍDA\"","UN ",1,1,1,null,null,0,0,""]
[1,1,1,6,13,0,0,0,0,6,{"$error":"#N/A"},"F","Nível 1","Nível 1","13.","SINAPI",null,"CUSTOS RELATIVOS À OBRA","UN",1,1,1,null,null,0,0,""]
[2,2,2,3,13,1,0,0,0,5,3,"","Nível 2","Nível 2","-","SINAPI",null,"ADMINISTRAÇÃO","-",null,1,"-",null,null,0,0,""]
["S",2,"S",0,13,1,0,0,0,0,0,"","Serviço","Serviço","-","SINAPI",90778,"ENGENHEIRO CIVIL DE OBRA PLENO COM ENCARGOS COMPLEMENTARES","H",38,1,38,null,null,0,0,""]
["S",2,"S",0,13,1,0,0,0,0,0,"","Serviço","Serviço","-","SINAPI",90776,"ENCARREGADO GERAL COM ENCARGOS COMPLEMENTARES","H",211,1,211,null,null,0,0,""]
[2,2,2,2,13,2,0,0,0,2,{"$error":"#N/A"},"","Nível 2","Nível 2","-","SINAPI",null,"DIVERSOS","-",null,1,"-",null,null,0,0,""]
["S",2,"S",0,13,2,0,0,0,0,0,"","Serviço","Serviço","-","AGETOP",270501,"LIMPEZA FINAL DE OBRA - (OBRAS CIVIS)","m2    ",101.95504750633002,1,101.95504750633002,null,null,0,0,""]
[-1,null,-1,null,0,0,0,0,0,null,null,"F"]
[null,null,null,null,null,null,null,null,null,null,null,"F",null,null,null,null,null,"OBS: OS QUANTITATIVOS DE MATERIAIS  DAS INSTALAÇÕES HIDROSSANITÁRIAS, ELÉTRICAS E ESPECIAIS SÃO FORNECIDOS PELOS PROFISSIONAIS RESPONSÁVEIS PELOS RESPECTIVOS PROJETOS.",null,null,null,null,"VALOR TOTAL",null,null,0]
[null,null,null,null,null,null,null,null,null,null,null,"F",null,null,null,null,null,null,null,null,null,null,"VALOR BDI (26,33%)",null,null,0]
[null,null,null,null,null,null,null,null,null,null,null,"F",null,null,null,null,null,null,null,null,null,null,"TOTAL ORÇAMENTO",null,null,0]
[null,null,null,null,null,null,null,null,null,null,null,"F"]
[null,null,null,null,null,null,null,null,null,null,null,"F",null,null,null,null,null,null,null,null,null,null,"CUSTO POR M2 ³",null,null,0]
[null,null,null,null,null,null,null,null,null,null,null,"F",null,null,null,null,null,null,null,null,null,null,"MATERIAL S/ BDI",null,null,0]
[null,null,null,null,null,null,null,null,null,null,null,"F",null,null,null,null,null,null,null,null,null,null,"MÃO DE OBRA S/ BDI",null,null,0]
[null,null,null,null,null,null,null,null,null,null,null,"F"]
[null,null,null,null,null,null,null,null,null,null,null,"F",null,null,null,null,"(1) Conforme previsto pelo DECRETO Nº 7.983, DE 8 DE ABRIL DE 2013, os preços adotados são aqueles constantes dos sistemas de referência indicados. Justifica-se o uso dos preços destas composições de custos unitários devido ao seu valor ser menor à mediana de seus correspondentes na tabela SINAPI;"]
[null,null,null,null,null,null,null,null,null,null,null,"F",null,null,null,null,"(2) Optou-se pelo uso das composições de custos da AGETOP para itens não presentes na SINAPI;"]
[null,null,null,null,null,null,null,null,null,null,null,"F",null,null,null,null,"(3) Para itens da AGETOP, os vidros não estão inclusos nas esquadrias e já foram considerados os custos de contramarco para as esquadrias de alumínio;"]
[null,null,null,null,null,null,null,null,null,null,null,"F",null,null,null,null,"(4) Nos casos em que houver execução de granitina e omissão do item AGETOP 221102, considerou-se que o quantitativo para o rodapé, de altura igual a 7cm, foi incorporado na área de piso;"]
[null,null,null,null,null,null,null,null,null,null,null,"F",null,null,null,null,"(5) O custo unitário aproximado por metro quadrado é calculado dividindo-se o valor total do orçamento pela área total de construção."]
[null,null,null,null,null,null,null,null,null,null,null,"F"]
[null,null,null,null,null,null,null,null,null,null,null,"F"]
[]
[null,null,null,null,null,null,null,null,null,null,null,null,null,null,"SOMATÓRIO DE SERVIÇOS"]
[null,null,null,null,null,null,null,null,null,null,null,null,null,null,"ITEM","DESCRIÇÃO DOS SERVIÇOS",null,null,"PREÇO SEM BDI",null,null,null,null,"PREÇO COM BDI",null,null,"PARTICIPAÇÃO ( % )"]
[null,null,null,null,null,null,null,null,null,null,null,null,null,null,"a.","SERVIÇOS PRELIMINARES",null,null,0,null,null,null,null,0,null,null,0]
[null,null,null,null,null,null,null,null,null,null,null,null,null,null,"b.","TRANSPORTES",null,null,0,null,null,null,null,0,null,null,0]
[null,null,null,null,null,null,null,null,null,null,null,null,null,null,"c.","SERVIÇO EM TERRA",null,null,0,null,null,null,null,0,null,null,0]
[null,null,null,null,null,null,null,null,null,null,null,null,null,null,"d.","FUNDAÇÕES E SONDAGENS",null,null,0,null,null,null,null,0,null,null,0]
[null,null,null,null,null,null,null,null,null,null,null,null,null,null,"e.","ESTRUTURA",null,null,0,null,null,null,null,0,null,null,0]
[null,null,null,null,null,null,null,null,null,null,null,null,null,null,"f.","INSTALAÇÕES ELÉTRICAS",null,null,0,null,null,null,null,0,null,null,0]
[null,null,null,null,null,null,null,null,null,null,null,null,null,null,"g.","INSTALAÇÕES HIDROSSANITÁRIAS",null,null,0,null,null,null,null,0,null,null,0]
[null,null,null,null,null,null,null,null,null,null,null,null,null,null,"h","INSTALAÇÕES ESPECIAIS",null,null,0,null,null,null,null,0,null,null,0]
[null,null,null,null,null,null,null,null,null,null,null,null,null,null,"i.","ALVENARIAS E DIVISÓRIAS",null,null,0,null,null,null,null,0,null,null,0]
[null,null,null,null,null,null,null,null,null,null,null,null,null,null,"j.","ALVENARIA AUTO-PORTANTE",null,null,0,null,null,null,null,0,null,null,0]
[null,null,null,null,null,null,null,null,null,null,null,null,null,null,"k.","IMPERMEABILIZAÇÃO",null,null,0,null,null,null,null,0,null,null,0]
[null,null,null,null,null,null,null,null,null,null,null,null,null,null,"l.","ISOLAMENTO TÉRMICO E ACÚSTICO",null,null,0,null,null,null,null,0,null,null,0]
[null,null,null,null,null,null,null,null,null,null,null,null,null,null,"m.","ESTRUTURA DE MADEIRA",null,null,0,null,null,null,null,0,null,null,0]
[null,null,null,null,null,null,null,null,null,null,null,null,null,null,"n.","ESTRUTURAS METÁLICAS",null,null,0,null,null,null,null,0,null,null,0]
[null,null,null,null,null,null,null,null,null,null,null,null,null,null,"o.","COBERTURAS",null,null,0,null,null,null,null,0,null,null,0]
[null,null,null,null,null,null,null,null,null,null,null,null,null,null,"p.","ESQUADRIAS DE MADEIRA",null,null,0,null,null,null,null,0,null,null,0]
[null,null,null,null,null,null,null,null,null,null,null,null,null,null,"q.","ESQUADRIAS METÁLICAS",null,null,0,null,null,null,null,0,null,null,0]
[null,null,null,null,null,null,null,null,null,null,null,null,null,null,"r.","VIDROS",null,null,0,null,null,null,null,0,null,null,0]
[null,null,null,null,null,null,null,null,null,null,null,null,null,null,"s.","REVESTIMENTO DE PAREDE",null,null,0,null,null,null,null,0,null,null,0]
[null,null,null,null,null,null,null,null,null,null,null,null,null,null,"t.","FORROS",null,null,0,null,null,null,null,0,null,null,0]
[null,null,null,null,null,null,null,null,null,null,null,null,null,null,"u.","REVESTIMENTO DE PISO",null,null,0,null,null,null,null,0,null,null,0]
[null,null,null,null,null,null,null,null,null,null,null,null,null,null,"v.","FERRAGENS",null,null,0,null,null,null,null,0,null,null,0]
[null,null,null,null,null,null,null,null,null,null,null,null,null,null,"w.","MARCENARIA",null,null,0,null,null,null,null,0,null,null,0]
[null,null,null,null,null,null,null,null,null,null,null,null,null,null,"x.","ADMINISTRAÇÃO",null,null,0,null,null,null,null,0,null,null,0]
[null,null,null,null,null,null,null,null,null,null,null,null,null,null,"y.","PINTURA",null,null,0,null,null,null,null,0,null,null,0]
[null,null,null,null,null,null,null,null,null,null,null,null,null,null,"z.","DIVERSOS",null,null,0,null,null,null,null,0,null,null,0]
[null,null,null,null,null,null,null,null,null,null,null,null,null,null,"TOTAL GERAL DO ORÇAMENTO (R$)",null,null,null,0,null,null,null,null,0,null,null,0]
[null,null,null,null,null,null,null,null,null,null,null,null,null,null,null,null,null,null,0,null,null,null,null,0,null,null,100]
[null,null,null,null,null,null,null,null,null,null,null,null,null,null,null,null,null,null,"(TOTAL SEM BDI)",null,null,null,null,"(TOTAL COM BDI)",null,null,"(ARRED porcentagem)"]
[null,null,null,null,null,null,null,null,null,null,null,null,null,null,null,null,null,null,"ERRO",null,null,null,null,"ERRO",null,null,"ERRO"]
[]
[]
[null,null,null,null,null,null,null,null,null,null,null,null,null,null,"RESUMO GERAL DO ORÇAMENTO"]
[null,null,null,null,null,null,null,null,null,null,null,null,null,null,"ITEM","DESCRIÇÃO DOS SERVIÇOS",null,null,"PREÇO SEM BDI",null,null,null,null,"PREÇO COM BDI",null,null,"PARTICIPAÇÃO ( % )"]
[null,null,null,null,null,null,null,null,null,null,null,null,null,null,"1.","PASSARELA MODELO 1 PADRÃO SEC. XXII",null,null,0,null,null,null,null,0,null,null,{"$error":"#DIV/0!"}]
[null,null,null,null,null,null,null,null,null,null,null,null,null,null,"2.","PASSARELA MODELO 02 - PADRÃO SÉC. XXI ",null,null,0,null,null,null,null,0,null,null,{"$error":"#DIV/0!"}]
[null,null,null,null,null,null,null,null,null,null,null,null,null,null,"3.","COBERTURA",null,null,0,null,null,null,null,0,null,null,{"$error":"#DIV/0!"}]
[null,null,null,null,null,null,null,null,null,null,null,null,null,null,"4.","PRESTAÇÃO DE CONTAS, MERENDA ESCOLAR",null,null,0,null,null,null,null,0,null,null,{"$error":"#DIV/0!"}]
[null,null,null,null,null,null,null,null,null,null,null,null,null,null,"5.","BANHEIRO MASCULINO, FEMININO E ACESSÍVEL",null,null,0,null,null,null,null,0,null,null,{"$error":"#DIV/0!"}]
[null,null,null,null,null,null,null,null,null,null,null,null,null,null,"6.","ACESSIBILIDADE",null,null,0,null,null,null,null,0,null,null,{"$error":"#DIV/0!"}]
[null,null,null,null,null,null,null,null,null,null,null,null,null,null,"7.","PINTURA GERAL",null,null,0,null,null,null,null,0,null,null,{"$error":"#DIV/0!"}]
[null,null,null,null,null,null,null,null,null,null,null,null,null,null,"8.","ESQUADRIAS EXISTENTES",null,null,0,null,null,null,null,0,null,null,{"$error":"#DIV/0!"}]
[null,null,null,null,null,null,null,null,null,null,null,null,null,null,"9.","COZINHA",null,null,0,null,null,null,null,0,null,null,{"$error":"#DIV/0!"}]
[null,null,null,null,null,null,null,null,null,null,null,null,null,null,"10.","PROJETO HIDROSSANITÁRIO",null,null,0,null,null,null,null,0,null,null,{"$error":"#DIV/0!"}]
[null,null,null,null,null,null,null,null,null,null,null,null,null,null,"11.","REFORMA ELÉTRICA",null,null,0,null,null,null,null,0,null,null,{"$error":"#DIV/0!"}]
[null,null,null,null,null,null,null,null,null,null,null,null,null,null,"12.","INSTALAÇÕES DE PREVENÇÃO E COMBATE À INCÊNDIO",null,null,0,null,null,null,null,0,null,null,{"$error":"#DIV/0!"}]
[null,null,null,null,null,null,null,null,null,null,null,null,null,null,"13.","CUSTOS RELATIVOS À OBRA",null,null,0,null,null,null,null,0,null,null,{"$error":"#DIV/0!"}]
[null,null,null,null,null,null,null,null,null,null,null,null,null,null,"14.","",null,null,0,null,null,null,null,0,null,null,{"$error":"#DIV/0!"}]
[null,null,null,null,null,null,null,null,null,null,null,null,null,null,"15.","",null,null,0,null,null,null,null,0,null,null,{"$error":"#DIV/0!"}]
[null,null,null,null,null,null,null,null,null,null,null,null,null,null,"16.","",null,null,0,null,null,null,null,0,null,null,{"$error":"#DIV/0!"}]
[null,null,null,null,null,null,null,null,null,null,null,null,null,null,"17.","",null,null,0,null,null,null,null,0,null,null,{"$error":"#DIV/0!"}]
[null,null,null,null,null,null,null,null,null,null,null,null,null,null,"18.","",null,null,0,null,null,null,null,0,null,null,{"$error":"#DIV/0!"}]
[null,null,null,null,null,null,null,null,null,null,null,null,null,null,"19.","",null,null,0,null,null,null,null,0,null,null,{"$error":"#DIV/0!"}]
[null,null,null,null,null,null,null,null,null,null,null,null,null,null,"20.","",null,null,0,null,null,null,null,0,null,null,{"$error":"#DIV/0!"}]
[null,null,null,null,null,null,null,null,null,null,null,null,null,null,"TOTAL GERAL DO ORÇAMENTO (R$)",null,null,null,0,null,null,null,null,0,null,null,{"$error":"#DIV/0!"}]
[null,null,null,null,null,null,null,null,null,null,null,null,null,null,null,null,null,null,0,null,null,null,null,0,null,null,100]
[null,null,null,null,null,null,null,null,null,null,null,null,null,null,null,null,null,null,"(TOTAL SEM BDI)",null,null,null,null,"(TOTAL COM BDI)",null,null,"(ARRED porcentagem)"]
[null,null,null,null,null,null,null,null,null,null,null,null,null,null,null,null,null,null,"ERRO",null,null,null,null,"ERRO",null,null,{"$error":"#DIV/0!"}]

{"sheet":"Resumo ","index":1,"n_rows":39,"n_cols":9,"rows_kept":39,"cut":false,"hidden":false,"merged":[[13,0,14,0],[15,2,15,5],[16,2,16,5],[17,2,17,5],[18,2,18,5],[14,1,14,8],[0,1,0,8],[36,1,36,5],[2,1,2,5],[3,1,3,5],[5,1,5,5],[6,1,6,5],[8,1,8,5],[9,1,9,5],[11,3,11,5],[12,3,12,5],[10,1,10,8],[11,6,11,8],[12,6,12,8],[19,2,19,5],[20,2,20,5],[21,2,21,5],[31,2,31,5],[1,1,1,8],[2,6,2,8],[3,6,3,8],[4,1,4,8],[5,6,5,8],[6,6,6,8],[7,1,7,8],[8,6,8,8],[9,6,9,8],[13,1,13,8],[11,1,11,2],[12,1,12,2],[42,3,42,7],[41,3,41,7],[38,1,38,8],[22,2,22,5],[23,2,23,5],[24,2,24,5],[25,2,25,5],[26,2,26,5],[32,2,32,5],[33,2,33,5],[34,2,34,5],[35,2,35,5],[27,2,27,5],[28,2,28,5],[29,2,29,5],[30,2,30,5]]}
[]
[]
[null,"UNIDADE ESCOLAR",null,null,null,null,"CÓDIGO INEP"]
[null,{"$f":"Orçamento!$O$5","v":"COORDENAÇÃO REGIONAL DE EDUCAÇÃO DE FORMOSA"},null,null,null,null,{"$f":"Orçamento!X5","v":52073190}]
[]
[null,"OBRA",null,null,null,null,"CIDADE"]
[null,{"$f":"Orçamento!$O$8","v":"REFORMA E AMPLIAÇÃO"},null,null,null,null,{"$f":"Orçamento!$X$8","v":"FORMOSA"}]
[]
[null,"ENDEREÇO",null,null,null,null,"CRE"]
[null,{"$f":"Orçamento!$R$11","v":"RUA PRESIDENTE VENCESLAU BRÁZ , S/N, BAIRRO PAMPULHA"},null,null,null,null,{"$f":"Orçamento!$O$11","v":"CRE-FORMOSA"}]
[]
[null,"REFERÊNCIA",null,"DATA",null,null,"ÁREA TOTAL CONSTRUÍDA (M²)"]
[null,{"$f":"CONCATENATE(\"AGETOP E SINAPI - \",Orçamento!$T$11)","v":"AGETOP E SINAPI - DESONERADA"},null,{"$f":"Orçamento!$S$8","v":"2020-05-21"},null,null,{"$f":"Orçamento!$X$14","v":574.5}]
["FILTRO"]
[null,"RESUMO GERAL DO ORÇAMENTO"]
["↓","ITEM","DESCRIÇÃO DOS SERVIÇOS",null,null,null,"PREÇO SEM BDI","PREÇO COM BDI","PARTICIP. (%)"]
[{"$f":"IF(G17>0,\"F\",\"\")","v":""},"1.",{"$f":"Orçamento!$P378","v":"PASSARELA MODELO 1 PADRÃO SEC. XXII"},null,null,null,{"$f":"IFERROR(Orçamento!S378,\"-\")","v":0},{"$f":"IFERROR(Orçamento!X378,\"\")","v":0},{"$f":"Orçamento!AA378","v":{"$error":"#DIV/0!"}}]
[{"$f":"IF(G18>0,\"F\",\"\")","v":""},"2.",{"$f":"Orçamento!$P379","v":"PASSARELA MODELO 02 - PADRÃO SÉC. XXI "},null,null,null,{"$f":"IFERROR(Orçamento!S379,\"-\")","v":0},{"$f":"IFERROR(Orçamento!X379,\"\")","v":0},{"$f":"Orçamento!AA379","v":{"$error":"#DIV/0!"}}]
["","3.",{"$f":"Orçamento!$P380","v":"COBERTURA"},null,null,null,{"$f":"IFERROR(Orçamento!S380,\"-\")","v":0},{"$f":"IFERROR(Orçamento!X380,\"\")","v":0},{"$f":"Orçamento!AA380","v":{"$error":"#DIV/0!"}}]
["","4.",{"$f":"Orçamento!$P381","v":"PRESTAÇÃO DE CONTAS, MERENDA ESCOLAR"},null,null,null,{"$f":"IFERROR(Orçamento!S381,\"-\")","v":0},{"$f":"IFERROR(Orçamento!X381,\"\")","v":0},{"$f":"Orçamento!AA381","v":{"$error":"#DIV/0!"}}]
["","5.",{"$f":"Orçamento!$P382","v":"BANHEIRO MASCULINO, FEMININO E ACESSÍVEL"},null,null,null,{"$f":"IFERROR(Orçamento!S382,\"-\")","v":0},{"$f":"IFERROR(Orçamento!X382,\"\")","v":0},{"$f":"Orçamento!AA382","v":{"$error":"#DIV/0!"}}]
["","6.",{"$f":"Orçamento!$P383","v":"ACESSIBILIDADE"},null,null,null,{"$f":"IFERROR(Orçamento!S383,\"-\")","v":0},{"$f":"IFERROR(Orçamento!X383,\"\")","v":0},{"$f":"Orçamento!AA383","v":{"$error":"#DIV/0!"}}]
["","7.",{"$f":"Orçamento!$P384","v":"PINTURA GERAL"},null,null,null,{"$f":"IFERROR(Orçamento!S384,\"-\")","v":0},{"$f":"IFERROR(Orçamento!X384,\"\")","v":0},{"$f":"Orçamento!AA384","v":{"$error":"#DIV/0!"}}]
["","8.",{"$f":"Orçamento!$P385","v":"ESQUADRIAS EXISTENTES"},null,null,null,{"$f":"IFERROR(Orçamento!S385,\"-\")","v":0},{"$f":"IFERROR(Orçamento!X385,\"\")","v":0},{"$f":"Orçamento!AA385","v":{"$error":"#DIV/0!"}}]
["","9.",{"$f":"Orçamento!$P386","v":"COZINHA"},null,null,null,{"$f":"IFERROR(Orçamento!S386,\"-\")","v":0},{"$f":"IFERROR(Orçamento!X386,\"\")","v":0},{"$f":"Orçamento!AA386","v":{"$error":"#DIV/0!"}}]
["","10.",{"$f":"Orçamento!$P387","v":"PROJETO HIDROSSANITÁRIO"},null,null,null,{"$f":"IFERROR(Orçamento!S387,\"-\")","v":0},{"$f":"IFERROR(Orçamento!X387,\"\")","v":0},{"$f":"Orçamento!AA387","v":{"$error":"#DIV/0!"}}]
["","11.",{"$f":"Orçamento!$P388","v":"REFORMA ELÉTRICA"},null,null,null,{"$f":"IFERROR(Orçamento!S388,\"-\")","v":0},{"$f":"IFERROR(Orçamento!X388,\"\")","v":0},{"$f":"Orçamento!AA388","v":{"$error":"#DIV/0!"}}]
["","12.",{"$f":"Orçamento!$P389","v":"INSTALAÇÕES DE PREVENÇÃO E COMBATE À INCÊNDIO"},null,null,null,{"$f":"IFERROR(Orçamento!S389,\"-\")","v":0},{"$f":"IFERROR(Orçamento!X389,\"\")","v":0},{"$f":"Orçamento!AA389","v":{"$error":"#DIV/0!"}}]
["","13.",{"$f":"Orçamento!$P390","v":"CUSTOS RELATIVOS À OBRA"},null,null,null,{"$f":"IFERROR(Orçamento!S390,\"-\")","v":0},{"$f":"IFERROR(Orçamento!X390,\"\")","v":0},{"$f":"Orçamento!AA390","v":{"$error":"#DIV/0!"}}]
["","14.",{"$f":"Orçamento!$P391","v":""},null,null,null,{"$f":"IFERROR(Orçamento!S391,\"-\")","v":0},{"$f":"IFERROR(Orçamento!X391,\"\")","v":0},{"$f":"Orçamento!AA391","v":{"$error":"#DIV/0!"}}]
["","15.",{"$f":"Orçamento!$P392","v":""},null,null,null,{"$f":"IFERROR(Orçamento!S392,\"-\")","v":0},{"$f":"IFERROR(Orçamento!X392,\"\")","v":0},{"$f":"Orçamento!AA392","v":{"$error":"#DIV/0!"}}]
["","16.",{"$f":"Orçamento!$P393","v":""},null,null,null,{"$f":"IFERROR(Orçamento!S393,\"-\")","v":0},{"$f":"IFERROR(Orçamento!X393,\"\")","v":0},{"$f":"Orçamento!AA393","v":{"$error":"#DIV/0!"}}]
["","17.",{"$f":"Orçamento!$P394","v":""},null,null,null,{"$f":"IFERROR(Orçamento!S394,\"-\")","v":0},{"$f":"IFERROR(Orçamento!X394,\"\")","v":0},{"$f":"Orçamento!AA394","v":{"$error":"#DIV/0!"}}]
["","18.",{"$f":"Orçamento!$P395","v":""},null,null,null,{"$f":"IFERROR(Orçamento!S395,\"-\")","v":0},{"$f":"IFERROR(Orçamento!X395,\"\")","v":0},{"$f":"Orçamento!AA395","v":{"$error":"#DIV/0!"}}]
["","19.",{"$f":"Orçamento!$P396","v":""},null,null,null,{"$f":"IFERROR(Orçamento!S396,\"-\")","v":0},{"$f":"IFERROR(Orçamento!X396,\"\")","v":0},{"$f":"Orçamento!AA396","v":{"$error":"#DIV/0!"}}]
["","20.",{"$f":"Orçamento!$P397","v":""},null,null,null,{"$f":"IFERROR(Orçamento!S397,\"-\")","v":0},{"$f":"IFERROR(Orçamento!X397,\"\")","v":0},{"$f":"Orçamento!AA397","v":{"$error":"#DIV/0!"}}]
["F","TOTAL GERAL DO ORÇAMENTO (R$)",null,null,null,null,{"$f":"SUM(G17:G36)","v":0},0,{"$f":"SUM(I17:I36)","v":{"$error":"#DIV/0!"}}]
["F"]
["F"]

{"sheet":"Somatório","index":2,"n_rows":45,"n_cols":6,"rows_kept":45,"cut":false,"hidden":false,"merged":[[13,0,14,0],[42,1,42,2],[44,1,44,5],[47,3,47,5],[48,3,48,5],[13,1,13,5],[9,1,9,3],[9,4,9,5],[11,1,11,2],[11,4,11,5],[12,1,12,2],[12,4,12,5],[0,1,0,5],[14,1,14,5],[2,1,2,3],[2,4,2,5],[3,1,3,3],[3,4,3,5],[5,1,5,3],[5,4,5,5],[6,1,6,3],[6,4,6,5],[8,1,8,3],[8,4,8,5],[1,1,1,5],[4,1,4,5],[7,1,7,5],[10,1,10,5]]}
[]
[]
[null,"UNIDADE ESCOLAR",null,null,"CÓDIGO INEP"]
[null,{"$f":"Orçamento!$O$5","v":"COORDENAÇÃO REGIONAL DE EDUCAÇÃO DE FORMOSA"},null,null,{"$f":"Orçamento!X5","v":52073190}]
[]
[null,"OBRA",null,null,"CIDADE"]
[null,{"$f":"Orçamento!$O$8","v":"REFORMA E AMPLIAÇÃO"},null,null,{"$f":"Orçamento!$X$8","v":"FORMOSA"}]
[]
[null,"ENDEREÇO",null,null,"CRE"]
[null,{"$f":"Orçamento!$R$11","v":"RUA PRESIDENTE VENCESLAU BRÁZ , S/N, BAIRRO PAMPULHA"},null,null,{"$f":"Orçamento!$O$11","v":"CRE-FORMOSA"}]
[]
[null,"REFERÊNCIA",null,"DATA","ÁREA TOTAL CONSTRUÍDA (M²)"]
[null,{"$f":"CONCATENATE(\"AGETOP E SINAPI - \",Orçamento!$T$11)","v":"AGETOP E SINAPI - DESONERADA"},null,{"$f":"Orçamento!$S$8","v":"2020-05-21"},{"$f":"Orçamento!$X$14","v":574.5}]
["FILTRO"]
[null,"SOMATÓRIO DE SERVIÇOS"]
["↓","ITEM","DESCRIÇÃO DOS SERVIÇOS","PREÇO SEM BDI (R$)","PREÇO COM BDI (R$)","PARTIC.  ( % )"]
[{"$f":"IF(D17>0,\"F\",\"\")","v":""},"a.",{"$f":"Orçamento!P344","v":"SERVIÇOS PRELIMINARES"},{"$f":"Orçamento!S344","v":0},{"$f":"Orçamento!X344","v":0},{"$f":"Orçamento!AA344","v":0}]
[{"$f":"IF(D18>0,\"F\",\"\")","v":""},"b.",{"$f":"Orçamento!P345","v":"TRANSPORTES"},{"$f":"Orçamento!S345","v":0},{"$f":"Orçamento!X345","v":0},{"$f":"Orçamento!AA345","v":0}]
["","c.",{"$f":"Orçamento!P346","v":"SERVIÇO EM TERRA"},{"$f":"Orçamento!S346","v":0},{"$f":"Orçamento!X346","v":0},{"$f":"Orçamento!AA346","v":0}]
["","d.",{"$f":"Orçamento!P347","v":"FUNDAÇÕES E SONDAGENS"},{"$f":"Orçamento!S347","v":0},{"$f":"Orçamento!X347","v":0},{"$f":"Orçamento!AA347","v":0}]
["","e.",{"$f":"Orçamento!P348","v":"ESTRUTURA"},{"$f":"Orçamento!S348","v":0},{"$f":"Orçamento!X348","v":0},{"$f":"Orçamento!AA348","v":0}]
["","f.",{"$f":"Orçamento!P349","v":"INSTALAÇÕES ELÉTRICAS"},{"$f":"Orçamento!S349","v":0},{"$f":"Orçamento!X349","v":0},{"$f":"Orçamento!AA349","v":0}]
["","g.",{"$f":"Orçamento!P350","v":"INSTALAÇÕES HIDROSSANITÁRIAS"},{"$f":"Orçamento!S350","v":0},{"$f":"Orçamento!X350","v":0},{"$f":"Orçamento!AA350","v":0}]
["","h",{"$f":"Orçamento!P351","v":"INSTALAÇÕES ESPECIAIS"},{"$f":"Orçamento!S351","v":0},{"$f":"Orçamento!X351","v":0},{"$f":"Orçamento!AA351","v":0}]
["","i.",{"$f":"Orçamento!P352","v":"ALVENARIAS E DIVISÓRIAS"},{"$f":"Orçamento!S352","v":0},{"$f":"Orçamento!X352","v":0},{"$f":"Orçamento!AA352","v":0}]
["","j.",{"$f":"Orçamento!P353","v":"ALVENARIA AUTO-PORTANTE"},{"$f":"Orçamento!S353","v":0},{"$f":"Orçamento!X353","v":0},{"$f":"Orçamento!AA353","v":0}]
["","k.",{"$f":"Orçamento!P354","v":"IMPERMEABILIZAÇÃO"},{"$f":"Orçamento!S354","v":0},{"$f":"Orçamento!X354","v":0},{"$f":"Orçamento!AA354","v":0}]
["","l.",{"$f":"Orçamento!P355","v":"ISOLAMENTO TÉRMICO E ACÚSTICO"},{"$f":"Orçamento!S355","v":0},{"$f":"Orçamento!X355","v":0},{"$f":"Orçamento!AA355","v":0}]
["","m.",{"$f":"Orçamento!P356","v":"ESTRUTURA DE MADEIRA"},{"$f":"Orçamento!S356","v":0},{"$f":"Orçamento!X356","v":0},{"$f":"Orçamento!AA356","v":0}]
["","n.",{"$f":"Orçamento!P357","v":"ESTRUTURAS METÁLICAS"},{"$f":"Orçamento!S357","v":0},{"$f":"Orçamento!X357","v":0},{"$f":"Orçamento!AA357","v":0}]
["","o.",{"$f":"Orçamento!P358","v":"COBERTURAS"},{"$f":"Orçamento!S358","v":0},{"$f":"Orçamento!X358","v":0},{"$f":"Orçamento!AA358","v":0}]
["","p.",{"$f":"Orçamento!P359","v":"ESQUADRIAS DE MADEIRA"},{"$f":"Orçamento!S359","v":0},{"$f":"Orçamento!X359","v":0},{"$f":"Orçamento!AA359","v":0}]
["","q.",{"$f":"Orçamento!P360","v":"ESQUADRIAS METÁLICAS"},{"$f":"Orçamento!S360","v":0},{"$f":"Orçamento!X360","v":0},{"$f":"Orçamento!AA360","v":0}]
["","r.",{"$f":"Orçamento!P361","v":"VIDROS"},{"$f":"Orçamento!S361","v":0},{"$f":"Orçamento!X361","v":0},{"$f":"Orçamento!AA361","v":0}]
["","s.",{"$f":"Orçamento!P362","v":"REVESTIMENTO DE PAREDE"},{"$f":"Orçamento!S362","v":0},{"$f":"Orçamento!X362","v":0},{"$f":"Orçamento!AA362","v":0}]
["","t.",{"$f":"Orçamento!P363","v":"FORROS"},{"$f":"Orçamento!S363","v":0},{"$f":"Orçamento!X363","v":0},{"$f":"Orçamento!AA363","v":0}]
["","u.",{"$f":"Orçamento!P364","v":"REVESTIMENTO DE PISO"},{"$f":"Orçamento!S364","v":0},{"$f":"Orçamento!X364","v":0},{"$f":"Orçamento!AA364","v":0}]
["","v.",{"$f":"Orçamento!P365","v":"FERRAGENS"},{"$f":"Orçamento!S365","v":0},{"$f":"Orçamento!X365","v":0},{"$f":"Orçamento!AA365","v":0}]
["","w.",{"$f":"Orçamento!P366","v":"MARCENARIA"},{"$f":"Orçamento!S366","v":0},{"$f":"Orçamento!X366","v":0},{"$f":"Orçamento!AA366","v":0}]
["","x.",{"$f":"Orçamento!P367","v":"ADMINISTRAÇÃO"},{"$f":"Orçamento!S367","v":0},{"$f":"Orçamento!X367","v":0},{"$f":"Orçamento!AA367","v":0}]
["","y.",{"$f":"Orçamento!P368","v":"PINTURA"},{"$f":"Orçamento!S368","v":0},{"$f":"Orçamento!X368","v":0},{"$f":"Orçamento!AA368","v":0}]
["","z.",{"$f":"Orçamento!P369","v":"DIVERSOS"},{"$f":"Orçamento!S369","v":0},{"$f":"Orçamento!X369","v":0},{"$f":"Orçamento!AA369","v":0}]
["F","TOTAL GERAL DO ORÇAMENTO",null,{"$f":"SUM(D17:D42)","v":0},{"$f":"SUM(E17:E42)","v":0},{"$f":"SUM(F17:F42)","v":0}]
[]
[null,"(*) Para itens da AGETOP, os vidros não estão inclusos nas esquadrias e já foram considerados os custos de contramarco para as esquadrias de alumínio;"]

{"sheet":"Cronog_30_Dias","index":3,"n_rows":99,"n_cols":16,"rows_kept":99,"cut":false,"hidden":false,"merged":[[12,0,13,0],[9,0,11,0],[11,1,11,13],[92,1,92,2],[92,5,92,8],[92,9,92,12],[93,1,93,2],[93,5,93,8],[93,9,93,12],[74,9,74,12],[74,5,74,8],[68,9,68,12],[70,5,70,8],[70,9,70,12],[59,5,59,8],[71,1,73,2],[71,4,73,4],[71,5,71,8],[71,9,71,12],[73,5,73,8],[73,9,73,12],[59,9,59,12],[61,5,61,8],[61,9,61,12],[94,1,94,2],[94,5,94,8],[94,9,94,12],[76,5,76,8],[76,9,76,12],[77,5,77,8],[77,9,77,12],[79,5,79,8],[79,9,79,12],[80,5,80,8],[80,9,80,12],[82,5,82,8],[82,9,82,12],[77,3,79,3],[80,3,82,3],[86,1,88,2],[80,4,82,4],[83,3,85,3],[77,1,79,2],[77,4,79,4],[80,1,82,2],[95,1,95,2],[95,5,95,8],[95,9,95,12],[97,1,97,4],[98,1,98,13],[86,9,86,12],[88,5,88,8],[88,9,88,12],[85,5,85,8],[85,9,85,12],[89,1,91,2],[89,4,91,4],[89,5,89,8],[89,9,89,12],[91,5,91,8],[91,9,91,12],[89,3,91,3],[86,4,88,4],[86,5,86,8],[86,3,88,3],[83,1,85,2],[83,4,85,4],[83,5,83,8],[83,9,83,12],[68,5,68,8],[65,5,65,8],[65,9,65,12],[67,5,67,8],[67,9,67,12],[65,3,67,3],[62,9,62,12],[64,5,64,8],[64,9,64,12],[62,5,62,8],[53,9,53,12],[55,5,55,8],[55,9,55,12],[50,5,50,8],[50,9,50,12],[52,5,52,8],[52,9,52,12],[56,9,56,12],[58,5,58,8],[58,9,58,12],[53,5,53,8],[56,5,56,8],[44,9,44,12],[46,5,46,8],[46,9,46,12],[47,1,49,2],[47,4,49,4],[47,5,47,8],[47,9,47,12],[49,5,49,8],[49,9,49,12],[44,5,44,8],[47,3,49,3],[44,3,46,3],[44,1,46,2],[44,4,46,4],[35,9,35,12],[37,5,37,8],[37,9,37,12],[35,3,37,3],[40,9,40,12],[38,3,40,3],[38,9,38,12],[41,1,43,2],[41,4,43,4],[41,5,41,8],[41,9,41,12],[43,5,43,8],[43,9,43,12],[41,3,43,3],[35,5,35,8],[38,5,38,8],[40,5,40,8],[35,1,37,2],[35,4,37,4],[38,1,40,2],[38,4,40,4],[29,9,29,12],[31,5,31,8],[31,9,31,12],[32,1,34,2],[32,4,34,4],[32,5,32,8],[32,9,32,12],[34,5,34,8],[34,9,34,12],[32,3,34,3],[29,5,29,8],[29,1,31,2],[29,4,31,4],[29,3,31,3],[23,9,23,12],[25,5,25,8],[25,9,25,12],[26,1,28,2],[26,4,28,4],[26,5,26,8],[26,9,26,12],[28,5,28,8],[28,9,28,12],[23,3,25,3],[23,1,25,2],[23,4,25,4],[23,5,23,8],[26,3,28,3],[20,4,22,4],[20,5,20,8],[20,9,20,12],[22,5,22,8],[22,9,22,12],[20,3,22,3],[14,3,16,3],[17,3,19,3],[14,4,16,4],[14,5,14,8],[14,9,14,12],[16,5,16,8],[16,9,16,12],[65,1,67,2],[68,3,70,3],[62,3,64,3],[68,1,70,2],[56,3,58,3],[65,4,67,4],[74,3,76,3],[50,4,52,4],[74,4,76,4],[56,1,58,2],[56,4,58,4],[50,3,52,3],[53,3,55,3],[68,4,70,4],[62,1,64,2],[62,4,64,4],[59,3,61,3],[53,1,55,2],[53,4,55,4],[59,1,61,2],[59,4,61,4],[74,1,76,2],[10,1,10,13],[9,8,9,13],[8,8,8,13],[3,8,3,13],[6,8,6,13],[5,8,5,13],[2,8,2,13],[50,1,52,2],[71,3,73,3],[12,13,13,13],[13,1,13,2],[13,5,13,8],[13,9,13,12],[12,3,13,3],[12,9,12,12],[14,1,16,2],[12,5,12,8],[17,1,19,2],[17,4,19,4],[17,5,17,8],[17,9,17,12],[19,5,19,8],[19,9,19,12],[20,1,22,2],[0,1,0,13],[2,1,2,7],[3,1,3,7],[5,1,5,7],[6,1,6,7],[8,1,8,7],[9,1,9,7],[1,1,1,13],[7,1,7,13],[4,1,4,13]]}
[]
[]
[null,"UNIDADE ESCOLAR",null,null,null,null,null,null,"PRAZO"]
[null,{"$f":"Orçamento!$O$5","v":"COORDENAÇÃO REGIONAL DE EDUCAÇÃO DE FORMOSA"},null,null,null,null,null,null,"30 DIAS CORRIDOS"]
[]
[null,"OBRA",null,null,null,null,null,null,"DATA"]
[null,{"$f":"Orçamento!$O$8","v":"REFORMA E AMPLIAÇÃO"},null,null,null,null,null,null,{"$f":"Orçamento!$S$8","v":"2020-05-21"}]
[]
[null,"LOCAL",null,null,null,null,null,null,"ÁREA TOTAL CONSTRUÍDA (M²)"]
["FILTRO",{"$f":"Orçamento!$X$8","v":"FORMOSA"},null,null,null,null,null,null,{"$f":"Orçamento!$X$14","v":574.5}]
[]
[null,"CRONOGRAMA - FÍSICO FINANCEIRO"]
["↓","CUSTO TOTAL:",{"$f":"D93","v":0},"VALOR","Dias:",15,null,null,null,30,null,null,null,"TOTAL"]
[null,"DESCRIÇÃO DOS SERVIÇOS",null,null,"%","1ª PARCELA",null,null,null,"2ª PARCELA"]
[{"$f":"IF(D15>0,\"F\",\"\")","v":""},"SERVIÇOS PRELIMINARES",null,{"$f":"Orçamento!X344","v":0},{"$f":"Orçamento!AA344","v":0},{"$f":"ROUND(F17*$D$15,2)","v":0},null,null,null,{"$f":"ROUND(J17*$D$15,2)","v":0},null,null,null,{"$f":"SUM(F15:M15)","v":0},null,{"$f":"N15=D15","v":true}]
[{"$f":"IF(A15=\"F\",A15,\"\")","v":""},null,null,null,null,null,null,null,null,null,null,null,null,null,null,{"$f":"N16=D16","v":true}]
[{"$f":"IF(A16=\"F\",A16,\"\")","v":""},null,null,null,null,1,null,null,null,{"$f":"1-F17","v":0},null,null,null,{"$f":"IFERROR(E15/100,\"\")","v":0},null,true]
[{"$f":"IF(D18>0,\"F\",\"\")","v":""},"TRANSPORTES",null,{"$f":"Orçamento!X345","v":0},{"$f":"Orçamento!AA345","v":0},{"$f":"ROUND(F20*$D$18,2)","v":0},null,null,null,{"$f":"ROUND(J20*$D$18,2)","v":0},null,null,null,{"$f":"SUM(F18:M18)","v":0},null,true]
[{"$f":"IF(A18=\"F\",A18,\"\")","v":""},null,null,null,null,null,null,null,null,null,null,null,null,null,null,true]
[{"$f":"IF(A19=\"F\",A19,\"\")","v":""},null,null,null,null,0.48,null,null,null,{"$f":"1-F20","v":0.52},null,null,null,{"$f":"IFERROR(E18/100,\"\")","v":0},null,true]
[{"$f":"IF(D21>0,\"F\",\"\")","v":""},"SERVIÇO EM TERRA",null,{"$f":"Orçamento!X346","v":0},{"$f":"Orçamento!AA346","v":0},{"$f":"ROUND(F23*$D$21,2)","v":0},null,null,null,{"$f":"ROUND(J23*$D$21,2)","v":0},null,null,null,{"$f":"SUM(F21:M21)","v":0}]
[{"$f":"IF(A21=\"F\",A21,\"\")","v":""}]
[{"$f":"IF(A22=\"F\",A22,\"\")","v":""},null,null,null,null,1,null,null,null,{"$f":"1-F23","v":0},null,null,null,{"$f":"IFERROR(E21/100,\"\")","v":0}]
[{"$f":"IF(D24>0,\"F\",\"\")","v":""},"FUNDAÇÕES E SONDAGENS",null,{"$f":"Orçamento!X347","v":0},{"$f":"Orçamento!AA347","v":0},{"$f":"ROUND(F26*$D$24,2)","v":0},null,null,null,{"$f":"ROUND(J26*$D$24,2)","v":0},null,null,null,{"$f":"SUM(F24:M24)","v":0},null,{"$f":"N24=D24","v":true}]
[{"$f":"IF(A24=\"F\",A24,\"\")","v":""},null,null,null,null,null,null,null,null,null,null,null,null,null,null,true]
[{"$f":"IF(A25=\"F\",A25,\"\")","v":""},null,null,null,null,1,null,null,null,{"$f":"1-F26","v":0},null,null,null,{"$f":"IFERROR(E24/100,\"\")","v":0},null,true]
[{"$f":"IF(D27>0,\"F\",\"\")","v":""},"ESTRUTURA",null,{"$f":"Orçamento!X348","v":0},{"$f":"Orçamento!AA348","v":0},{"$f":"ROUND(F29*$D$27,2)","v":0},null,null,null,{"$f":"ROUND(J29*$D$27,2)","v":0},null,null,null,{"$f":"SUM(F27:M27)","v":0},null,true]
[{"$f":"IF(A27=\"F\",A27,\"\")","v":""},null,null,null,null,null,null,null,null,null,null,null,null,null,null,true]
[{"$f":"IF(A28=\"F\",A28,\"\")","v":""},null,null,null,null,0.49,null,null,null,{"$f":"1-F29","v":0.51},null,null,null,{"$f":"IFERROR(E27/100,\"\")","v":0},null,true]
[{"$f":"IF(D30>0,\"F\",\"\")","v":""},"INST.ELET/TELEFÔNICA/CABEAMENTO ESTRUTURADO",null,{"$f":"Orçamento!X349","v":0},{"$f":"Orçamento!AA349","v":0},{"$f":"ROUND(F32*$D$30,2)","v":0},null,null,null,{"$f":"ROUND(J32*$D$30,2)","v":0},null,null,null,{"$f":"SUM(F30:M30)","v":0},null,true]
[{"$f":"IF(A30=\"F\",A30,\"\")","v":""},null,null,null,null,null,null,null,null,null,null,null,null,null,null,true]
[{"$f":"IF(A31=\"F\",A31,\"\")","v":""},null,null,null,null,0.4,null,null,null,{"$f":"1-F32","v":0.6},null,null,null,{"$f":"IFERROR(E30/100,\"\")","v":0},null,true]
[{"$f":"IF(D33>0,\"F\",\"\")","v":""},"INSTALAÇÕES HIDROSSANITÁRIAS",null,{"$f":"Orçamento!X350","v":0},{"$f":"Orçamento!AA350","v":0},{"$f":"ROUND(F35*$D$33,2)","v":0},null,null,null,{"$f":"ROUND(J35*$D$33,2)","v":0},null,null,null,{"$f":"SUM(F33:M33)","v":0},null,true]
[{"$f":"IF(A33=\"F\",A33,\"\")","v":""},null,null,null,null,null,null,null,null,null,null,null,null,null,null,true]
[{"$f":"IF(A34=\"F\",A34,\"\")","v":""},null,null,null,null,0.48,null,null,null,{"$f":"1-F35","v":0.52},null,null,null,{"$f":"IFERROR(E33/100,\"\")","v":0},null,true]
[{"$f":"IF(D36>0,\"F\",\"\")","v":""},"INSTALAÇÕES ESPECIAIS",null,{"$f":"Orçamento!X351","v":0},{"$f":"Orçamento!AA351","v":0},{"$f":"ROUND(F38*$D$36,2)","v":0},null,null,null,{"$f":"ROUND(J38*$D$36,2)","v":0},null,null,null,{"$f":"SUM(F36:M36)","v":0},null,true]
[{"$f":"IF(A36=\"F\",A36,\"\")","v":""},null,null,null,null,null,null,null,null,null,null,null,null,null,null,true]
[{"$f":"IF(A37=\"F\",A37,\"\")","v":""},null,null,null,null,1,null,null,null,{"$f":"1-F38","v":0},null,null,null,{"$f":"IFERROR(E36/100,\"\")","v":0},null,true]
[{"$f":"IF(D39>0,\"F\",\"\")","v":""},"ALVENARIA E DIVISÓRIAS",null,{"$f":"Orçamento!X352","v":0},{"$f":"Orçamento!AA352","v":0},{"$f":"ROUND(F41*$D$39,2)","v":0},null,null,null,{"$f":"ROUND(J41*$D$39,2)","v":0},null,null,null,{"$f":"SUM(F39:M39)","v":0},null,true]
[{"$f":"IF(A39=\"F\",A39,\"\")","v":""},null,null,null,null,null,null,null,null,null,null,null,null,null,null,true]
[{"$f":"IF(A40=\"F\",A40,\"\")","v":""},null,null,null,null,1,null,null,null,{"$f":"1-F41","v":0},null,null,null,{"$f":"IFERROR(E39/100,\"\")","v":0},null,true]
[{"$f":"IF(D42>0,\"F\",\"\")","v":""},"ALVENARIA AUTO-PORTANTE",null,{"$f":"Orçamento!X353","v":0},{"$f":"Orçamento!AA353","v":0},{"$f":"ROUND(F44*$D$42,2)","v":0},null,null,null,{"$f":"ROUND(J44*$D$42,2)","v":0},null,null,null,{"$f":"SUM(F42:M42)","v":0}]
[{"$f":"IF(A42=\"F\",A42,\"\")","v":""}]
[{"$f":"IF(A43=\"F\",A43,\"\")","v":""},null,null,null,null,1,null,null,null,{"$f":"1-F44","v":0},null,null,null,{"$f":"IFERROR(E42/100,\"\")","v":0}]
[{"$f":"IF(D45>0,\"F\",\"\")","v":""},"IMPERMEABILIZAÇÃO",null,{"$f":"Orçamento!X354","v":0},{"$f":"Orçamento!AA354","v":0},{"$f":"ROUND(F47*$D$45,2)","v":0},null,null,null,{"$f":"ROUND(J47*$D$45,2)","v":0},null,null,null,{"$f":"SUM(F45:M45)","v":0},null,{"$f":"N45=D45","v":true}]
[{"$f":"IF(A45=\"F\",A45,\"\")","v":""},null,null,null,null,null,null,null,null,null,null,null,null,null,null,true]
[{"$f":"IF(A46=\"F\",A46,\"\")","v":""},null,null,null,null,1,null,null,null,{"$f":"1-F47","v":0},null,null,null,{"$f":"IFERROR(E45/100,\"\")","v":0},null,true]
[{"$f":"IF(D48>0,\"F\",\"\")","v":""},"ISOLAMENTO TÉRMICO E ACÚSTICO",null,{"$f":"Orçamento!X355","v":0},{"$f":"Orçamento!AA355","v":0},{"$f":"ROUND(F50*$D$48,2)","v":0},null,null,null,{"$f":"ROUND(J50*$D$48,2)","v":0},null,null,null,{"$f":"SUM(F48:M48)","v":0}]
[{"$f":"IF(A48=\"F\",A48,\"\")","v":""}]
[{"$f":"IF(A49=\"F\",A49,\"\")","v":""},null,null,null,null,0.5,null,null,null,{"$f":"1-F50","v":0.5},null,null,null,{"$f":"IFERROR(E48/100,\"\")","v":0}]
[{"$f":"IF(D51>0,\"F\",\"\")","v":""},"ESTRUTURA DE MADEIRA",null,{"$f":"Orçamento!X356","v":0},{"$f":"Orçamento!AA356","v":0},{"$f":"ROUND(F53*$D$51,2)","v":0},null,null,null,{"$f":"ROUND(J53*$D$51,2)","v":0},null,null,null,{"$f":"SUM(F51:M51)","v":0}]
[{"$f":"IF(A51=\"F\",A51,\"\")","v":""}]
[{"$f":"IF(A52=\"F\",A52,\"\")","v":""},null,null,null,null,0.4,null,null,null,{"$f":"1-F53","v":0.6},null,null,null,{"$f":"IFERROR(E51/100,\"\")","v":0}]
[{"$f":"IF(D54>0,\"F\",\"\")","v":""},"ESTRUTURA METÁLICA",null,{"$f":"Orçamento!X357","v":0},{"$f":"Orçamento!AA357","v":0},{"$f":"ROUND(F56*$D$54,2)","v":0},null,null,null,{"$f":"ROUND(J56*$D$54,2)","v":0},null,null,null,{"$f":"SUM(F54:M54)","v":0},null,{"$f":"N54=D54","v":true}]
[{"$f":"IF(A54=\"F\",A54,\"\")","v":""},null,null,null,null,null,null,null,null,null,null,null,null,null,null,true]
[{"$f":"IF(A55=\"F\",A55,\"\")","v":""},null,null,null,null,0.35,null,null,null,{"$f":"1-F56","v":0.65},null,null,null,{"$f":"IFERROR(E54/100,\"\")","v":0},null,true]
[{"$f":"IF(D57>0,\"F\",\"\")","v":""},"COBERTURAS",null,{"$f":"Orçamento!X358","v":0},{"$f":"Orçamento!AA358","v":0},{"$f":"ROUND(F59*$D$57,2)","v":0},null,null,null,{"$f":"ROUND(J59*$D$57,2)","v":0},null,null,null,{"$f":"SUM(F57:M57)","v":0},null,true]
[{"$f":"IF(A57=\"F\",A57,\"\")","v":""},null,null,null,null,null,null,null,null,null,null,null,null,null,null,true]
[{"$f":"IF(A58=\"F\",A58,\"\")","v":""},null,null,null,null,0,null,null,null,{"$f":"1-F59","v":1},null,null,null,{"$f":"IFERROR(E57/100,\"\")","v":0},null,true]
[{"$f":"IF(D60>0,\"F\",\"\")","v":""},"ESQUADRIAS DE MADEIRA",null,{"$f":"Orçamento!X359","v":0},{"$f":"Orçamento!AA359","v":0},{"$f":"ROUND(F62*$D$60,2)","v":0},null,null,null,{"$f":"ROUND(J62*$D$60,2)","v":0},null,null,null,{"$f":"SUM(F60:M60)","v":0}]
[{"$f":"IF(A60=\"F\",A60,\"\")","v":""}]
[{"$f":"IF(A61=\"F\",A61,\"\")","v":""},null,null,null,null,0.54,null,null,null,{"$f":"1-F62","v":0.45999999999999996},null,null,null,{"$f":"IFERROR(E60/100,\"\")","v":0}]
[{"$f":"IF(D63>0,\"F\",\"\")","v":""},"ESQUADRIAS METÁLICAS",null,{"$f":"Orçamento!X360","v":0},{"$f":"Orçamento!AA360","v":0},{"$f":"ROUND(F65*$D$63,2)","v":0},null,null,null,{"$f":"ROUND(J65*$D$63,2)","v":0},null,null,null,{"$f":"SUM(F63:M63)","v":0},null,{"$f":"N63=D63","v":true}]
[{"$f":"IF(A63=\"F\",A63,\"\")","v":""},null,null,null,null,null,null,null,null,null,null,null,null,null,null,true]
[{"$f":"IF(A64=\"F\",A64,\"\")","v":""},null,null,null,null,0.49,null,null,null,{"$f":"1-F65","v":0.51},null,null,null,{"$f":"IFERROR(E63/100,\"\")","v":0},null,true]
[{"$f":"IF(D66>0,\"F\",\"\")","v":""},"VIDROS",null,{"$f":"Orçamento!X361","v":0},{"$f":"Orçamento!AA361","v":0},{"$f":"ROUND(F68*$D$66,2)","v":0},null,null,null,{"$f":"ROUND(J68*$D$66,2)","v":0},null,null,null,{"$f":"SUM(F66:M66)","v":0}]
[{"$f":"IF(A66=\"F\",A66,\"\")","v":""}]
[{"$f":"IF(A67=\"F\",A67,\"\")","v":""},null,null,null,null,0,null,null,null,{"$f":"1-F68","v":1},null,null,null,{"$f":"IFERROR(E66/100,\"\")","v":0}]
[{"$f":"IF(D69>0,\"F\",\"\")","v":""},"REVESTIMENTO DE PAREDE",null,{"$f":"Orçamento!X362","v":0},{"$f":"Orçamento!AA362","v":0},{"$f":"ROUND(F71*$D$69,2)","v":0},null,null,null,{"$f":"ROUND(J71*$D$69,2)","v":0},null,null,null,{"$f":"SUM(F69:M69)","v":0},null,{"$f":"N69=D69","v":true}]
[{"$f":"IF(A69=\"F\",A69,\"\")","v":""},null,null,null,null,null,null,null,null,null,null,null,null,null,null,true]
[{"$f":"IF(A70=\"F\",A70,\"\")","v":""},null,null,null,null,0.32,null,null,null,{"$f":"1-F71","v":0.67999999999999994},null,null,null,{"$f":"IFERROR(E69/100,\"\")","v":0},null,true]
[{"$f":"IF(D72>0,\"F\",\"\")","v":""},"FORROS",null,{"$f":"Orçamento!X363","v":0},{"$f":"Orçamento!AA363","v":0},{"$f":"ROUND(F74*$D$72,2)","v":0},null,null,null,{"$f":"ROUND(J74*$D$72,2)","v":0},null,null,null,{"$f":"SUM(F72:M72)","v":0}]
[{"$f":"IF(A72=\"F\",A72,\"\")","v":""}]
[{"$f":"IF(A73=\"F\",A73,\"\")","v":""},null,null,null,null,0.24,null,null,null,{"$f":"1-F74","v":0.76},null,null,null,{"$f":"IFERROR(E72/100,\"\")","v":0}]
[{"$f":"IF(D75>0,\"F\",\"\")","v":""},"REVESTIMENTO DE PISO",null,{"$f":"Orçamento!X364","v":0},{"$f":"Orçamento!AA364","v":0},{"$f":"ROUND(F77*$D$75,2)","v":0},null,null,null,{"$f":"ROUND(J77*$D$75,2)","v":0},null,null,null,{"$f":"SUM(F75:M75)","v":0},null,{"$f":"N75=D75","v":true}]
[{"$f":"IF(A75=\"F\",A75,\"\")","v":""},null,null,null,null,null,null,null,null,null,null,null,null,null,null,true]
[{"$f":"IF(A76=\"F\",A76,\"\")","v":""},null,null,null,null,0.49,null,null,null,{"$f":"1-F77","v":0.51},null,null,null,{"$f":"IFERROR(E75/100,\"\")","v":0},null,true]
[{"$f":"IF(D78>0,\"F\",\"\")","v":""},"FERRAGENS",null,{"$f":"Orçamento!X365","v":0},{"$f":"Orçamento!AA365","v":0},{"$f":"ROUND(F80*$D$78,2)","v":0},null,null,null,{"$f":"ROUND(J80*$D$78,2)","v":0},null,null,null,{"$f":"SUM(F78:M78)","v":0},null,true]
[{"$f":"IF(A78=\"F\",A78,\"\")","v":""},null,null,null,null,null,null,null,null,null,null,null,null,null,null,true]
[{"$f":"IF(A79=\"F\",A79,\"\")","v":""},null,null,null,null,0,null,null,null,{"$f":"1-F80","v":1},null,null,null,{"$f":"IFERROR(E78/100,\"\")","v":0},null,true]
[{"$f":"IF(D81>0,\"F\",\"\")","v":""},"MARCENARIA",null,{"$f":"Orçamento!X366","v":0},{"$f":"Orçamento!AA366","v":0},{"$f":"ROUND(F83*$D$81,2)","v":0},null,null,null,{"$f":"ROUND(J83*$D$81,2)","v":0},null,null,null,{"$f":"SUM(F81:M81)","v":0}]
[{"$f":"IF(A81=\"F\",A81,\"\")","v":""}]
[{"$f":"IF(A82=\"F\",A82,\"\")","v":""},null,null,null,null,0.4,null,null,null,{"$f":"1-F83","v":0.6},null,null,null,{"$f":"IFERROR(E81/100,\"\")","v":0}]
[{"$f":"IF(D84>0,\"F\",\"\")","v":""},"ADMINISTRAÇÃO - MENSALISTAS",null,{"$f":"Orçamento!X367","v":0},{"$f":"Orçamento!AA367","v":0},{"$f":"ROUND(F86*$D$84,2)","v":0},null,null,null,{"$f":"ROUND(J86*$D$84,2)","v":0},null,null,null,{"$f":"SUM(F84:M84)","v":0},null,{"$f":"N84=D84","v":true}]
[{"$f":"IF(A84=\"F\",A84,\"\")","v":""},null,null,null,null,null,null,null,null,null,null,null,null,null,null,true]
[{"$f":"IF(A85=\"F\",A85,\"\")","v":""},null,null,null,null,0.49,null,null,null,{"$f":"1-F86","v":0.51},null,null,null,{"$f":"IFERROR(E84/100,\"\")","v":0},null,true]
[{"$f":"IF(D87>0,\"F\",\"\")","v":""},"PINTURA",null,{"$f":"Orçamento!X368","v":0},{"$f":"Orçamento!AA368","v":0},{"$f":"ROUND(F89*$D$87,2)","v":0},null,null,null,{"$f":"ROUND(J89*$D$87,2)","v":0},null,null,null,{"$f":"SUM(F87:M87)","v":0},null,true]
[{"$f":"IF(A87=\"F\",A87,\"\")","v":""},null,null,null,null,null,null,null,null,null,null,null,null,null,null,true]
[{"$f":"IF(A88=\"F\",A88,\"\")","v":""},null,null,null,null,0,null,null,null,{"$f":"1-F89","v":1},null,null,null,{"$f":"IFERROR(E87/100,\"\")","v":0},null,true]
[{"$f":"IF(D90>0,\"F\",\"\")","v":""},"DIVERSOS",null,{"$f":"Orçamento!X369","v":0},{"$f":"Orçamento!AA369","v":0},{"$f":"ROUND(F92*$D$90,2)","v":0},null,null,null,{"$f":"ROUND(J92*$D$90,2)","v":0},null,null,null,{"$f":"SUM(F90:M90)","v":0},null,true]
[{"$f":"IF(A90=\"F\",A90,\"\")","v":""},null,null,null,null,null,null,null,null,null,null,null,null,null,null,true]
[{"$f":"IF(A91=\"F\",A91,\"\")","v":""},null,null,null,null,0.46,null,null,null,{"$f":"1-F92","v":0.54},null,null,null,{"$f":"IFERROR(E90/100,\"\")","v":0},null,true]
["F","CUSTO DO ORÇAMENTO",null,{"$f":"SUM(D15:D92)","v":0},{"$f":"SUM(E15:E92)","v":0},{"$f":"F15+F18+F21+F24+F27+F30+F33+F36+F39+F42+F45+F48+F51+F54+F57+F60+F63+F66+F69+F72+F75+F78+F81+F84+F87+F90","v":0},null,null,null,{"$f":"J15+J18+J21+J24+J27+J30+J33+J36+J39+J42+J45+J48+J51+J54+J57+J60+J63+J66+J69+J72+J75+J78+J81+J84+J87+J90","v":0},null,null,null,{"$f":"N15+N18+N21+N24+N27+N30+N33+N36+N39+N42+N45+N48+N51+N54+N57+N60+N63+N66+N69+N72+N75+N78+N81+N84+N87+N90","v":0}]
["F","PERCENTUAIS:",null,null,null,{"$f":"IFERROR(F93/D93,\"\")","v":""},null,null,null,{"$f":"IFERROR(J93/D93,\"\")","v":""},null,null,null,{"$f":"SUM(F94:M94)","v":0}]
["F","TOTAIS ACUMULADOS:",null,null,null,{"$f":"F93","v":0},null,null,null,{"$f":"F95+J93","v":0}]
["F","PERCENTUAIS  ACUMULADOS:",null,null,null,{"$f":"F94","v":""},null,null,null,{"$f":"IFERROR(F96+J94,\"\")","v":""}]
["F"]
["F","OBSERVAÇÕES:"]
["F","Os pagamentos somente poderão ser efetuados mediante medição e atesto pelos técnicos da Secretaria da Educação. "]

{"sheet":"Composição BDI","index":4,"n_rows":45,"n_cols":9,"rows_kept":45,"cut":false,"hidden":false,"merged":[[18,5,18,8],[17,0,17,3],[16,0,16,3],[44,0,44,3],[42,0,42,3],[43,0,43,3],[18,0,18,3],[36,0,36,3],[39,0,39,3],[38,0,38,3],[40,0,40,3],[29,0,29,2],[32,0,32,3],[33,0,33,3],[34,0,34,3],[35,0,35,3],[0,0,0,3],[2,0,2,3],[3,0,3,3],[1,0,1,3],[5,0,5,3],[4,0,4,3],[12,0,12,3],[13,0,13,3],[14,0,14,3],[15,0,15,3],[6,0,6,3],[8,0,8,3],[7,0,7,3],[9,0,9,3],[11,0,11,3],[10,0,10,3]]}
[]
[]
["UNIDADE ESCOLAR"]
["COORDENAÇÃO REGIONAL DE EDUCAÇÃO DE FORMOSA"]
[]
["OBRA"]
["REFORMA E AMPLIAÇÃO"]
[]
["ENDEREÇO"]
["RUA PRESIDENTE VENCESLAU BRÁZ , S/N, BAIRRO PAMPULHA"]
[]
["CIDADE"]
["FORMOSA"]
[]
["CRE"]
["CRE-FORMOSA"]
[]
["DETALHAMENTO DA COMPOSIÇÃO DE BDI"]
["COMPOSIÇÃO BDI PARA OBRAS CIVIS",null,null,null,null,"BDI CONSTRUÇÃO E REFORMA"]
["DESCRIÇÃO","COEF.","TAXA % (a.m)","% no preço de venda",null,"Situação","1º Quartil","Médio","3º Quartil"]
["1) COFINS",1,0.03,0.03,null,"OK",0.03,0.03,0.03]
["2) PIS",1,6.4999999999999997E-3,6.4999999999999997E-3,null,"OK",6.4999999999999997E-3,6.4999999999999997E-3,6.4999999999999997E-3]
["3) ISSQN",1,1.4999999999999999E-2,1.4999999999999999E-2,null,"FORA DO INTERVALO",0.02,3.5000000000000003E-2,0.05]
["4) CPRB",1,4.4999999999999998E-2,4.4999999999999998E-2,null,"OK",4.4999999999999998E-2,4.4999999999999998E-2,4.4999999999999998E-2]
["5) Administração Central",1,4.4999999999999998E-2,4.4999999999999998E-2,null,"OK",0.03,0.04,5.5E-2]
["6) Despesas Financeiras",1,5.5999999999999999E-3,5.5999999999999999E-3,null,"FORA DO INTERVALO",5.8999999999999999E-3,1.23E-2,1.3899999999999999E-2]
["7) Seguros + Garantias",1,1.1999999999999999E-3,1.1999999999999999E-3,null,"FORA DO INTERVALO",8.0000000000000002E-3,8.0000000000000002E-3,0.01]
["8) Risco",1,9.7000000000000003E-3,9.7000000000000003E-3,null,"OK",9.7000000000000003E-3,1.2699999999999999E-2,1.2699999999999999E-2]
["9) Lucro",1,7.4977286020145292E-2,7.4977286020145292E-2,null,"OK",6.1600000000000002E-2,7.3999999999999996E-2,8.9599999999999999E-2]
["BDI - FINAL",null,null,0.26333691200885467,null,"FORA DO INTERVALO",0.2034,0.22120000000000001,0.25]
[]
["Notas:"]
["(1) e (2) Alíquota definida por lei."]
["(3) Alíquota e base de cálculo definidas pela legislação municipal."]
["(4) Alíquota definida pelas leis 12.546/11, 12844/13 e 13.161/15 (CPRB – contribuição previdenciária sobre a receita bruta)."]
["(5) Valores definidos a partir dos limites no Acórdão nº 2.622/2013 - TCU – Plenário. Valores entre o 1º e 3º quartis."]
["(6) Valor calculado pela expressão matemática do acórdão 2.369/2011 – TCU – Plenário e disponibilizado pela AGETOP em dezembro de 2018. (Foi utilizado para o cálculo a média da Taxa SELIC no período de 11/2017 a 10/2018)"]
[]
["(7) Valores definidos pela AGETOP a partir dos limites no Acórdão nº 2.622/2013 - TCU – Plenário. Valores médios. \n\nObservação da AGETOP: (Seguros contra erros de execução, incêndio e explosão, danos da natureza (vendaval, destelhamento, alagamento, inundação, desmoronamento, geadas etc.), emprego de material defeituoso ou inadequado, roubo e/ou furto qualificado, quebra de equipamentos, desmoronamento de estrutura, nas modalidades de Obras Civis em Construção (OCC); Instalação e Montagem (IM); e Obras Civis em Construção e Instalação e Montagem (OCC/IM). Bem como coberturas adicionais para ampliação dessas coberturas básicas, como: cobertura de responsabilidade civil geral, cobertura de responsabilidade civil cruzada, cobertura de despesas extraordinárias, cobertura de tumultos, cobertura de desentulho do local, cobertura de riscos do fabricante, dentre outras, incluindo o seguro de vida em grupo regido pela convenção coletiva dos trabalhadores na indústria da construção civil). A partir de 24/02/2015 por intermédio da Portaria 449/2015 a Presidência da AGETOP, na pessoa do Senhor Jayme Eduardo Rincon, determinou a exclusão dos valores referentes aos Seguros de Risco de Engenharia e Responsabilidade Civil do Profissional na composição do cálculo do B.D.I.."]
["(8) Valores definidos a partir dos limites no Acórdão nº 2.622/2013 - TCU – Plenário. Valores entre 1º e 3° quartis."]
["(9) Valores definidos a partir dos limites definidos no Acórdão nº 2.622/2013 - TCU – Plenário. Valores adotados e praticados no mercado ( “ ex ante ” ) ou aqueles entre os 1º e 3º quartis."]
[]
["(*) A fórmula para estipulação da taxa de BDI estimado adotado é a mesma que foi aplicada para a obtenção das tabelas contidas no Acórdão n. 2.622/2013 – TCUPlenário"]
[]
["Obs.: Para obras com valores superiores a R$ 20.000.000,00 sugere-se recalcular o BDI, dimensionando as taxas de administração central e lucro para patamares inferiores ao estipulado acima."]

{"sheet":"Relatório CENTRAL","index":5,"n_rows":40,"n_cols":5,"rows_kept":40,"cut":false,"hidden":false,"merged":[[0,1,0,4],[6,3,6,4],[9,3,9,4],[1,1,1,4],[2,1,2,2],[2,3,2,4],[3,1,3,2],[3,3,3,4],[4,1,4,4],[5,1,5,2],[5,3,5,4],[6,1,6,2],[7,1,7,4],[8,1,8,2],[8,3,8,4],[9,1,9,2],[10,1,10,4],[11,1,11,4],[39,1,39,2],[9,0,11,0]]}
[]
[]
[null,"UNIDADE ESCOLAR",null,"CIDADE"]
[null,{"$f":"Orçamento!$O$5","v":"COORDENAÇÃO REGIONAL DE EDUCAÇÃO DE FORMOSA"},null,{"$f":"Orçamento!$X$8","v":"FORMOSA"}]
[]
[null,"OBRA",null,"CRE"]
[null,{"$f":"Orçamento!$O$8","v":"REFORMA E AMPLIAÇÃO"},null,{"$f":"Orçamento!$O$11","v":"CRE-FORMOSA"}]
[]
[null,"ENDEREÇO",null,"DATA"]
["FILTRO",{"$f":"Orçamento!$R$11","v":"RUA PRESIDENTE VENCESLAU BRÁZ , S/N, BAIRRO PAMPULHA"},null,{"$f":"Orçamento!$S$8","v":"2020-05-21"}]
[]
[null,"RELATÓRIO CENTRAL"]
["↓","CÓDIGO","ETAPA","PREÇO  (R$) C/ BDI","PARTIC  ( % )"]
[{"$f":"IF(D14>0,\"F\",\"\")","v":""},{"$f":"Orçamento!O344","v":"a."},{"$f":"Orçamento!P344","v":"SERVIÇOS PRELIMINARES"},{"$f":"Orçamento!X344","v":0},{"$f":"Orçamento!AA344","v":0}]
[{"$f":"IF(D15>0,\"F\",\"\")","v":""},{"$f":"Orçamento!O345","v":"b."},{"$f":"Orçamento!P345","v":"TRANSPORTES"},{"$f":"Orçamento!X345","v":0},{"$f":"Orçamento!AA345","v":0}]
["",{"$f":"Orçamento!O346","v":"c."},{"$f":"Orçamento!P346","v":"SERVIÇO EM TERRA"},{"$f":"Orçamento!X346","v":0},{"$f":"Orçamento!AA346","v":0}]
["",{"$f":"Orçamento!O347","v":"d."},{"$f":"Orçamento!P347","v":"FUNDAÇÕES E SONDAGENS"},{"$f":"Orçamento!X347","v":0},{"$f":"Orçamento!AA347","v":0}]
["",{"$f":"Orçamento!O348","v":"e."},{"$f":"Orçamento!P348","v":"ESTRUTURA"},{"$f":"Orçamento!X348","v":0},{"$f":"Orçamento!AA348","v":0}]
["",{"$f":"Orçamento!O349","v":"f."},{"$f":"Orçamento!P349","v":"INSTALAÇÕES ELÉTRICAS"},{"$f":"Orçamento!X349","v":0},{"$f":"Orçamento!AA349","v":0}]
["",{"$f":"Orçamento!O350","v":"g."},{"$f":"Orçamento!P350","v":"INSTALAÇÕES HIDROSSANITÁRIAS"},{"$f":"Orçamento!X350","v":0},{"$f":"Orçamento!AA350","v":0}]
["",{"$f":"Orçamento!O351","v":"h"},{"$f":"Orçamento!P351","v":"INSTALAÇÕES ESPECIAIS"},{"$f":"Orçamento!X351","v":0},{"$f":"Orçamento!AA351","v":0}]
["",{"$f":"Orçamento!O352","v":"i."},{"$f":"Orçamento!P352","v":"ALVENARIAS E DIVISÓRIAS"},{"$f":"Orçamento!X352","v":0},{"$f":"Orçamento!AA352","v":0}]
["",{"$f":"Orçamento!O353","v":"j."},{"$f":"Orçamento!P353","v":"ALVENARIA AUTO-PORTANTE"},{"$f":"Orçamento!X353","v":0},{"$f":"Orçamento!AA353","v":0}]
["",{"$f":"Orçamento!O354","v":"k."},{"$f":"Orçamento!P354","v":"IMPERMEABILIZAÇÃO"},{"$f":"Orçamento!X354","v":0},{"$f":"Orçamento!AA354","v":0}]
["",{"$f":"Orçamento!O355","v":"l."},{"$f":"Orçamento!P355","v":"ISOLAMENTO TÉRMICO E ACÚSTICO"},{"$f":"Orçamento!X355","v":0},{"$f":"Orçamento!AA355","v":0}]
["",{"$f":"Orçamento!O356","v":"m."},{"$f":"Orçamento!P356","v":"ESTRUTURA DE MADEIRA"},{"$f":"Orçamento!X356","v":0},{"$f":"Orçamento!AA356","v":0}]
["",{"$f":"Orçamento!O357","v":"n."},{"$f":"Orçamento!P357","v":"ESTRUTURAS METÁLICAS"},{"$f":"Orçamento!X357","v":0},{"$f":"Orçamento!AA357","v":0}]
["",{"$f":"Orçamento!O358","v":"o."},{"$f":"Orçamento!P358","v":"COBERTURAS"},{"$f":"Orçamento!X358","v":0},{"$f":"Orçamento!AA358","v":0}]
["",{"$f":"Orçamento!O359","v":"p."},{"$f":"Orçamento!P359","v":"ESQUADRIAS DE MADEIRA"},{"$f":"Orçamento!X359","v":0},{"$f":"Orçamento!AA359","v":0}]
["",{"$f":"Orçamento!O360","v":"q."},{"$f":"Orçamento!P360","v":"ESQUADRIAS METÁLICAS"},{"$f":"Orçamento!X360","v":0},{"$f":"Orçamento!AA360","v":0}]
["",{"$f":"Orçamento!O361","v":"r."},{"$f":"Orçamento!P361","v":"VIDROS"},{"$f":"Orçamento!X361","v":0},{"$f":"Orçamento!AA361","v":0}]
["",{"$f":"Orçamento!O362","v":"s."},{"$f":"Orçamento!P362","v":"REVESTIMENTO DE PAREDE"},{"$f":"Orçamento!X362","v":0},{"$f":"Orçamento!AA362","v":0}]
["",{"$f":"Orçamento!O363","v":"t."},{"$f":"Orçamento!P363","v":"FORROS"},{"$f":"Orçamento!X363","v":0},{"$f":"Orçamento!AA363","v":0}]
["",{"$f":"Orçamento!O364","v":"u."},{"$f":"Orçamento!P364","v":"REVESTIMENTO DE PISO"},{"$f":"Orçamento!X364","v":0},{"$f":"Orçamento!AA364","v":0}]
["",{"$f":"Orçamento!O365","v":"v."},{"$f":"Orçamento!P365","v":"FERRAGENS"},{"$f":"Orçamento!X365","v":0},{"$f":"Orçamento!AA365","v":0}]
["",{"$f":"Orçamento!O366","v":"w."},{"$f":"Orçamento!P366","v":"MARCENARIA"},{"$f":"Orçamento!X366","v":0},{"$f":"Orçamento!AA366","v":0}]
["",{"$f":"Orçamento!O367","v":"x."},{"$f":"Orçamento!P367","v":"ADMINISTRAÇÃO"},{"$f":"Orçamento!X367","v":0},{"$f":"Orçamento!AA367","v":0}]
["",{"$f":"Orçamento!O368","v":"y."},{"$f":"Orçamento!P368","v":"PINTURA"},{"$f":"Orçamento!X368","v":0},{"$f":"Orçamento!AA368","v":0}]
["",{"$f":"Orçamento!O369","v":"z."},{"$f":"Orçamento!P369","v":"DIVERSOS"},{"$f":"Orçamento!X369","v":0},{"$f":"Orçamento!AA369","v":0}]
["F","TOTAL GERAL DO ORÇAMENTO (R$) C/BDI",null,{"$f":"SUM(D14:D39)","v":0},{"$f":"SUM(E14:E39)","v":0}]

{"sheet":"Parc Maior Relev","index":6,"n_rows":33,"n_cols":7,"rows_kept":33,"cut":false,"hidden":false,"merged":[[6,4,6,6],[7,1,7,6],[8,1,8,3],[8,4,8,6],[33,3,33,7],[31,1,31,6],[0,1,0,6],[11,1,11,6],[1,1,1,6],[2,1,2,3],[2,4,2,6],[3,1,3,3],[3,4,3,6],[4,1,4,6],[5,1,5,3],[5,4,5,6],[9,1,9,3],[9,4,9,6],[10,1,10,6],[6,1,6,3]]}
[]
[]
[null,"UNIDADE ESCOLAR",null,null,"CÓDIGO INEP"]
[null,{"$f":"Orçamento!$O$5","v":"COORDENAÇÃO REGIONAL DE EDUCAÇÃO DE FORMOSA"},null,null,{"$f":"Orçamento!$X$5","v":52073190}]
[]
[null,"OBRA",null,null,"CIDADE"]
[null,{"$f":"Orçamento!$O$8","v":"REFORMA E AMPLIAÇÃO"},null,null,{"$f":"Orçamento!$X$8","v":"FORMOSA"}]
[]
[null,"CRE",null,null,"ÁREA TOTAL CONSTRUÍDA (M²)"]
[null,{"$f":"Orçamento!$O$11","v":"CRE-FORMOSA"},null,null,{"$f":"Orçamento!$X$14","v":574.5}]
[]
["FILTRO","PARCELA DE MAIOR RELEVÂNCIA"]
[{"$f":"IF(G14>0,\"F\",\"\")","v":""},"CÓDIGO","SERVIÇO","DESCRIÇÃO","UNID","QUANT","PARC. MAIOR RELEV (100%)"]
[{"$f":"IF(G14>0,\"F\",\"\")","v":""},"f.","INSTALAÇÕES ELÉTRICAS","SUBESTAÇÃO","KVA",{"$f":"SUMIF(Orçamento!$R$325:$R$325,'Parc Maior Relev'!D14,Orçamento!$T$325:$T$325)","v":0},{"$f":"F14","v":0}]
[{"$f":"IF(SUM(G16:G30)>0,\"F\",\"\")","v":"F"},"CÓDIGO","SERVIÇO","DESCRIÇÃO","UNID","QUANT","PARC. MAIOR RELEV (50%)"]
[{"$f":"IF(G16>0,\"F\",\"\")","v":""},"e.","ESTRUTURA","ESTRUTURA METÁLICA","M3",{"$f":"SUMIF(Orçamento!$R$18:$R$324,'Parc Maior Relev'!D16,Orçamento!$T$18:$T$32)","v":0},{"$f":"F16*0.5","v":0}]
[{"$f":"IF(G17>0,\"F\",\"\")","v":""},"f.","INSTALAÇÕES ELÉTRICAS","INSTALAÇÕES ELÉTRICAS","KVA",{"$f":"SUMIF(Orçamento!$R$18:$R$324,'Parc Maior Relev'!D17,Orçamento!$T$18:$T$32)","v":0},{"$f":"F17*0.5","v":0}]
[{"$f":"IF(G18>0,\"F\",\"\")","v":"F"},"o.","COBERTURAS","COBERTURA COM TELHA CERÂMICA","M2",227.94,113.97]
["","o.","COBERTURAS","COBERTURA COM TELHA METÁLICA","M2",{"$f":"SUMIF(Orçamento!$R$18:$R$324,'Parc Maior Relev'!D19,Orçamento!$T$18:$T$32)","v":0},0]
["","s.","REVESTIMENTO DE PAREDE","CHAPISCO","M2",{"$f":"SUMIF(Orçamento!$R$18:$R$324,'Parc Maior Relev'!D20,Orçamento!$T$18:$T$32)","v":0},0]
["","s.","REVESTIMENTO DE PAREDE","REBOCO","M2",{"$f":"SUMIF(Orçamento!$R$18:$R$324,'Parc Maior Relev'!D21,Orçamento!$T$18:$T$32)","v":0},0]
["","s.","REVESTIMENTO DE PAREDE","REVESTIMENTO CERÂMICO","M2",{"$f":"SUMIF(Orçamento!$R$18:$R$324,'Parc Maior Relev'!D22,Orçamento!$T$18:$T$32)","v":0},0]
["","t.","FORROS","FORRO DE GESSO","M2",{"$f":"SUMIF(Orçamento!$R$18:$R$324,'Parc Maior Relev'!D23,Orçamento!$T$18:$T$32)","v":0},0]
["","t.","FORROS","FORRO DE PVC","M2",{"$f":"SUMIF(Orçamento!$R$18:$R$324,'Parc Maior Relev'!D24,Orçamento!$T$18:$T$32)","v":0},0]
["","t.","FORROS","FORRO DE GESSO ACARTONADO","M2",{"$f":"SUMIF(Orçamento!$R$18:$R$324,'Parc Maior Relev'!D25,Orçamento!$T$18:$T$32)","v":0},0]
["","u.","REVESTIMENTO DE PISO","PISO DE GRANITINA","M2",{"$f":"SUMIF(Orçamento!$R$18:$R$324,'Parc Maior Relev'!D26,Orçamento!$T$18:$T$32)","v":0},0]
["","u.","REVESTIMENTO DE PISO","PISO LAMINADO","M2",{"$f":"SUMIF(Orçamento!$R$18:$R$324,'Parc Maior Relev'!D27,Orçamento!$T$18:$T$32)","v":0},0]
["","u.","REVESTIMENTO DE PISO","PISO DE CONCRETO DESEMPENADO","M2",{"$f":"SUMIF(Orçamento!$R$18:$R$324,'Parc Maior Relev'!D28,Orçamento!$T$18:$T$32)","v":0},0]
["","u.","REVESTIMENTO DE PISO","PISO CERÂMICO","M2",{"$f":"SUMIF(Orçamento!$R$18:$R$324,'Parc Maior Relev'!D29,Orçamento!$T$18:$T$32)","v":0},0]
["","y.","PINTURA","PINTURA","M2",{"$f":"SUMIF(Orçamento!$R$18:$R$324,'Parc Maior Relev'!D30,Orçamento!$T$18:$T$32)","v":0},0]
["F"]
["F","(*) Para os fins do inciso I dp § 1º do Art. 30 da Lei Federal 8.666/93, são consideradas parcelas de maior relevância técnica as execuções apresentadas"]
["F"]

{"sheet":"Composições","index":7,"n_rows":134,"n_cols":10,"rows_kept":134,"cut":false,"hidden":false,"merged":[[125,5,126,5],[125,6,125,7],[125,8,125,9],[129,1,129,7],[133,1,133,7],[125,0,126,0],[125,1,126,1],[125,2,126,2],[125,3,126,3],[125,4,126,4],[115,5,116,5],[115,6,115,7],[115,8,115,9],[119,1,119,7],[123,1,123,7],[115,0,116,0],[115,1,116,1],[115,2,116,2],[115,3,116,3],[115,4,116,4],[105,5,106,5],[105,6,105,7],[105,8,105,9],[109,1,109,7],[113,1,113,7],[105,0,106,0],[105,1,106,1],[105,2,106,2],[105,3,106,3],[105,4,106,4],[95,5,96,5],[95,6,95,7],[95,8,95,9],[99,1,99,7],[103,1,103,7],[95,0,96,0],[95,1,96,1],[95,2,96,2],[95,3,96,3],[95,4,96,4],[82,5,83,5],[82,6,82,7],[82,8,82,9],[86,1,86,7],[93,1,93,7],[82,0,83,0],[82,1,83,1],[82,2,83,2],[82,3,83,3],[82,4,83,4],[72,5,73,5],[72,6,72,7],[72,8,72,9],[76,1,76,7],[80,1,80,7],[72,0,73,0],[72,1,73,1],[72,2,73,2],[72,3,73,3],[72,4,73,4],[62,5,63,5],[62,6,62,7],[62,8,62,9],[66,1,66,7],[70,1,70,7],[62,0,63,0],[62,1,63,1],[62,2,63,2],[62,3,63,3],[62,4,63,4],[54,5,55,5],[54,6,54,7],[54,8,54,9],[58,1,58,7],[60,1,60,7],[54,0,55,0],[54,1,55,1],[54,2,55,2],[54,3,55,3],[54,4,55,4],[45,5,46,5],[45,6,45,7],[45,8,45,9],[50,1,50,7],[52,1,52,7],[45,0,46,0],[45,1,46,1],[45,2,46,2],[45,3,46,3],[45,4,46,4],[38,5,39,5],[38,6,38,7],[38,8,38,9],[41,1,41,7],[43,1,43,7],[38,0,39,0],[38,1,39,1],[38,2,39,2],[38,3,39,3],[38,4,39,4],[16,5,17,5],[16,6,16,7],[16,8,16,9],[21,1,21,7],[36,1,36,7],[16,0,17,0],[16,1,17,1],[16,2,17,2],[16,3,17,3],[16,4,17,4],[15,0,15,9],[13,0,13,2],[13,3,13,6],[1,0,1,9],[3,7,3,9],[4,7,4,9],[6,7,6,9],[7,7,7,9],[6,0,6,6],[10,8,10,9],[13,8,13,9],[14,0,14,9],[8,0,8,9],[5,0,5,9],[2,0,2,9],[0,0,0,8],[10,0,10,2],[10,3,10,6],[11,0,11,9],[12,0,12,2],[12,3,12,6],[12,7,12,8],[7,0,7,6],[9,0,9,2],[9,3,9,6],[9,7,9,8],[3,0,3,6],[4,0,4,6]]}
[]
[]
[]
["UNIDADE ESCOLAR",null,null,null,null,null,null,"CÓDIGO INEP"]
[{"$f":"Orçamento!$O$5","v":"COORDENAÇÃO REGIONAL DE EDUCAÇÃO DE FORMOSA"},null,null,null,null,null,null,{"$f":"Orçamento!$X$5","v":52073190}]
[]
["OBRA",null,null,null,null,null,null,"CIDADE"]
[{"$f":"Orçamento!$O$8","v":"REFORMA E AMPLIAÇÃO"},null,null,null,null,null,null,{"$f":"Orçamento!$X$8","v":"FORMOSA"}]
[]
["CRE",null,null,"ENDEREÇO",null,null,null,"REFERÊNCIA AGETOP"]
[{"$f":"Orçamento!$O$11","v":"CRE-FORMOSA"},null,null,{"$f":"Orçamento!$R$11","v":"RUA PRESIDENTE VENCESLAU BRÁZ , S/N, BAIRRO PAMPULHA"},null,null,null,{"$f":"Orçamento!$S$11","v":"ABR/19"},{"$f":"Orçamento!$T$11","v":"DESONERADA"}]
[]
["DATA",null,null,"ÁREA TOTAL CONSTRUÍDA (M²)",null,null,null,"REFERÊNCIA SINAPI"]
[{"$f":"Orçamento!$S$8","v":"2020-05-21"},null,null,{"$f":"Orçamento!$X$14","v":574.5},null,null,null,{"$f":"Orçamento!$X$11","v":"MAR/20"},{"$f":"Orçamento!$Y$11","v":"DESONERADA"}]
[]
["COMPOSIÇÕES DE CUSTOS UNITÁRIOS - SEE-GO"]
[84,"FONTE","CÓDIGO","DESCRIÇÃO","UNIDADE","COEFIC.","CUSTO UNITÁRIO",null,"CUSTO  TOTAL (A) + (B) + (C) + (D) + (E)"]
[null,null,null,null,null,null,"DESONERADO","NÃO DESONER.","DESONERADO","NÃO DESONER."]
[null,"COMPOSIÇÃO","COMP 084_SEE","GUARDA-CORPO COM CORRIMÃO - SEDUC","M",null,null,null,206.14000000000001,211.22000000000003]
[null,"AGETOP_I",25,"OFICIAL \"B\"","h     ",1.1000000000000001,13.95,16.16,15.35,17.78]
[null,"AGETOP_I",8,"AJUDANTE","h     ",1.1000000000000001,8.75,10.14,9.6300000000000008,11.15]
[null,"MÃO DE OBRA (B) - TOTAL",null,null,null,null,null,null,24.98,28.93]
[null,"AGETOP_I",2376,"TUBO INDUSTRIAL 2\" CHAPA 13 ","Kg",7.7778,5.23,5.23,40.68,40.68]
[null,"AGETOP_I",2504,"TUBO INDUSTRIAL D=25 MM CHAPA 13 ","Kg",4.6319999999999997,5.07,5.07,23.48,23.48]
[null,"AGETOP_I",2377,"TUBO INDUSTRIAL 40X40 CH.13","Kg",6.3419999999999996,5.07,5.07,32.15,32.15]
[null,"AGETOP_I",2421,"TUBO INDUSTRIAL 1.1/2\" CHAPA 13 ","Kg",1.4862,5.07,5.07,7.54,7.54]
[null,"AGETOP_I",2417,"MASSA PLASTICA","Kg",0.2041,10.58,10.58,2.16,2.16]
[null,"AGETOP_I",2246,"ELETRODO 2.5 OK","Kg",0.11459999999999999,8.6999999999999993,8.6999999999999993,1,1]
[null,"AGETOP_I",1672,"LIXA PARA FERRO ( NÚMERO 100 )","un",0.25509999999999999,2.12,2.12,0.54,0.54]
[null,"AGETOP_I",1264,"DISCO DE DESBASTE 7/8\" P/ CONC./FERRO (1/4\" X 7\")","un",5.0999999999999997E-2,7,7,0.36,0.36]
[null,"AGETOP_I",1334,"DISCO DE CORTE DIAM. 5/8\"- 10\"","un",0.373,5.5,5.5,2.0499999999999998,2.0499999999999998]
[null,"AGETOP_I",2902,"FABRICAÇÃO / MONTAGEM","un",1,50.44,50.44,50.44,50.44]
[null,"AGETOP_I",2150,"CHAPA DE FERRO DOBRADA No.13","Kg",0.43519999999999998,5.28,5.28,2.2999999999999998,2.2999999999999998]
[null,"AGETOP_I",2719,"CHAPA PERFILADA 3/16\"","Kg",1.0979999999999999,5.04,5.04,5.53,5.53]
[null,"AGETOP_I",2436,"ACO CA-25 - 6,3 MM (1/4\") - BARRA LISA A-36","Kg",0.38124999999999998,5.13,5.13,1.96,1.96]
[null,"AGETOP",261602,"PINT.ESMALTE/ESQUAD.FERRO C/FUNDO ANTICOR.","m2    ",0.78,14.07,15.51,10.97,12.1]
[null,"MATERIAL (C) - TOTAL",null,null,null,null,null,null,181.16000000000003,182.29000000000002]
[]
[27,"FONTE","CÓDIGO","DESCRIÇÃO","UNIDADE","COEFIC.","CUSTO UNITÁRIO",null,"CUSTO  TOTAL (A) + (B) + (C) + (D) + (E)"]
[null,null,null,null,null,null,"DESONERADO","NÃO DESONER.","DESONERADO","NÃO DESONER."]
[null,"COMPOSIÇÃO","COMP 027_SEE","TELA MOSQUITEIRA EM NYLON COM ESTRUTURA DE ALUMÍNIO, COM FORNECIMENTO DE MÃO DE OBRA E INSTALAÇÃO","M2",null,null,null,123.21,123.21]
[null,"MÃO DE OBRA (B) - TOTAL",null,null,null,null,null,null,0,0]
[null,"COTAÇÃO","COT 002_SEE","TELA MOSQUITEIRA EM NYLON COM ESTRUTURA DE ALUMÍNIO [M²], COM FORNECIMENTO DE MÃO DE OBRA E INSTALAÇÃO","M2",1,123.21333333333332,123.21333333333332,123.21,123.21]
[null,"MATERIAL (C) - TOTAL",null,null,null,null,null,null,123.21,123.21]
[]
[575,"FONTE","CÓDIGO","DESCRIÇÃO","UNID ","COEFIC.","CUSTO UNITÁRIO",null,"CUSTO  TOTAL (A) + (B) + (C) + (D) + (E)"]
[null,null,null,null,null,null,"DESONERADO","NÃO DESONER.","DESONERADO","NÃO DESONER."]
[null,"COMPOSIÇÃO","COMP 575_SEE","MOLA AEREA FECHA PORTA, PARA PORTAS COM LARGURA ATE 95 CM","UN ","-","-","-",121.89,122.76]
[null,"AGETOP_I",5,"SERVENTE","h     ",0.15,8.75,10.14,1.31,1.52]
[null,"AGETOP_I",24,"MARCENEIRO","h     ",0.3,13.95,16.16,4.1900000000000004,4.8499999999999996]
[null,"MÃO DE OBRA (B) - TOTAL",null,null,null,null,null,null,5.5,6.3699999999999992]
[null,"SINAPI_I",11560,"MOLA AEREA FECHA PORTA, PARA PORTAS COM LARGURA ATE 95 CM","UN    ",1,116.39,116.39,116.39,116.39]
[null,"MATERIAL (C) - TOTAL",null,null,null,null,null,null,116.39,116.39]
[]
[22,"FONTE","CÓDIGO","DESCRIÇÃO","UNIDADE","COEFIC.","CUSTO UNITÁRIO",null,"CUSTO  TOTAL (A) + (B) + (C) + (D) + (E)"]
[null,null,null,null,null,null,"DESONERADO","NÃO DESONER.","DESONERADO","NÃO DESONER."]
[null,"COMPOSIÇÃO","COMP 022_SEE","TAMPÃO FOFO 40X50CM C/INSCRIÇÃO ","UN ",null,"-","-",197.64000000000001,197.97]
[null,"AGETOP_I",11,"ENCANADOR","h     ",0.15,13.95,16.16,2.09,2.42]
[null,"MÃO DE OBRA (B) - TOTAL",null,null,null,null,null,null,2.09,2.42]
[null,"SINAPI_I",11293,"TAMPAO FOFO SIMPLES COM BASE, CLASSE A15 CARGA MAX 1,5 T, 400 X 500 MM, COM INSCRICAO INCENDIO","UN    ",1,195.55,195.55,195.55,195.55]
[null,"MATERIAL (C) - TOTAL",null,null,null,null,null,null,195.55,195.55]
[]
[24,"FONTE","CÓDIGO","DESCRIÇÃO","UNIDADE","COEFIC.","CUSTO UNITÁRIO",null,"CUSTO  TOTAL (A) + (B) + (C) + (D) + (E)"]
[null,null,null,null,null,null,"DESONERADO","NÃO DESONER.","DESONERADO","NÃO DESONER."]
[null,"COMPOSIÇÃO","COMP 024_SEE","SINALIZADOR FOTOLUMINESCENTE PARA EXTINTOR","UN ",null,"-","-",25.319999999999997,25.439999999999998]
[null,"AGETOP_I",5,"SERVENTE","h     ",0.09,8.75,10.14,0.79,0.91]
[null,"MÃO DE OBRA (B) - TOTAL",null,null,null,null,null,null,0.79,0.91]
[null,"AGETOP_I",3070,"BUCHA DE NYLON S-6","un",2,0.04,0.04,0.08,0.08]
[null,"AGETOP_I",3393,"PARAFUSO P/BUCHA S-6","un",2,0.08,0.08,0.16,0.16]
[null,"SINAPI_I",37556,"PLACA DE SINALIZACAO DE SEGURANCA CONTRA INCENDIO, FOTOLUMINESCENTE, QUADRADA, *20 X 20* CM, EM PVC *2* MM ANTI-CHAMAS (SIMBOLOS, CORES E PICTOGRAMAS CONFORME NBR 13434)","UN    ",1,24.29,24.29,24.29,24.29]
[null,"MATERIAL (C) - TOTAL",null,null,null,null,null,null,24.529999999999998,24.529999999999998]
[]
[25,"FONTE","CÓDIGO","DESCRIÇÃO","UNIDADE","COEFIC.","CUSTO UNITÁRIO",null,"CUSTO  TOTAL (A) + (B) + (C) + (D) + (E)"]
[null,null,null,null,null,null,"DESONERADO","NÃO DESONER.","DESONERADO","NÃO DESONER."]
[null,"COMPOSIÇÃO","COMP 025_SEE","SINALIZADOR FOTOLUMINESCENTE DE EMERGÊNCIA","UN ",null,"-","-",25.319999999999997,25.439999999999998]
[null,"AGETOP_I",5,"SERVENTE","h     ",0.09,8.75,10.14,0.79,0.91]
[null,"MÃO DE OBRA (B) - TOTAL",null,null,null,null,null,null,0.79,0.91]
[null,"AGETOP_I",3070,"BUCHA DE NYLON S-6","un",2,0.04,0.04,0.08,0.08]
[null,"AGETOP_I",3393,"PARAFUSO P/BUCHA S-6","un",2,0.08,0.08,0.16,0.16]
[null,"SINAPI_I",37556,"PLACA DE SINALIZACAO DE SEGURANCA CONTRA INCENDIO, FOTOLUMINESCENTE, QUADRADA, *20 X 20* CM, EM PVC *2* MM ANTI-CHAMAS (SIMBOLOS, CORES E PICTOGRAMAS CONFORME NBR 13434)","UN    ",1,24.29,24.29,24.29,24.29]
[null,"MATERIAL (C) - TOTAL",null,null,null,null,null,null,24.529999999999998,24.529999999999998]
[]
[277,"FONTE","CÓDIGO","DESCRIÇÃO","UNIDADE","COEFIC.","CUSTO UNITÁRIO",null,"CUSTO  TOTAL (A) + (B) + (C) + (D) + (E)"]
[null,null,null,null,null,null,"DESONERADO","NÃO DESONER.","DESONERADO","NÃO DESONER."]
[null,"COMPOSIÇÃO","COMP 277_SEE","MARCAÇÃO NO PISO - 1X1 M PARA EXTINTOR","M2",null,null,null,29.67,29.75]
[null,"AGETOP_I",5,"SERVENTE","h     ",3.3300000000000003E-2,8.75,10.14,0.28999999999999998,0.34]
[null,"MÃO DE OBRA (B) - TOTAL",null,null,null,null,null,null,0.28999999999999998,0.34]
[null,"SINAPI_I",5318,"SOLVENTE DILUENTE A BASE DE AGUARRAS","L     ",0.13,11.78,11.78,1.53,1.53]
[null,"SINAPI",5824,"CAMINHÃO TOCO, PBT 16.000 KG, CARGA ÚTIL MÁX. 10.685 KG, DIST. ENTRE EIXOS 4,8 M, POTÊNCIA 189 CV, INCLUSIVE CARROCERIA FIXA ABERTA DE MADEIRA P/ TRANSPORTE GERAL DE CARGA SECA, DIMEN. APROX. 2,5 X 7,00 X 0,50 M - CHP DIURNO. AF_06/2014","CHP",3.3E-3,120.02,123.21,0.4,0.41]
[null,"SINAPI_I",7343,"TINTA A BASE DE RESINA ACRILICA, PARA SINALIZACAO HORIZONTAL VIARIA (NBR 11862)","L     ",0.6,12.82,12.82,7.69,7.69]
[null,"SINAPI_I",7348,"TINTA ACRILICA PREMIUM PARA PISO","L     ",0.03,13.72,13.72,0.41,0.41]
[null,"SINAPI_I",25972,"MICROESFERAS DE VIDRO PARA SINALIZACAO HORIZONTAL VIARIA, TIPO I-B (PREMIX) - NBR 16184","KG    ",2.14,8.8800000000000008,8.8800000000000008,19,19]
[null,"SINAPI",95133,"MÁQUINA DEMARCADORA DE FAIXA DE TRÁFEGO À FRIO, AUTOPROPELIDA, POTÊNCIA 38 HP - CHP DIURNO. AF_07/2016","CHP",3.3E-3,107.44,110.99,0.35,0.37]
[null,"MATERIAL (C) - TOTAL",null,null,null,null,null,null,29.380000000000003,29.41]
[]
[235,"FONTE","CÓDIGO","DESCRIÇÃO","UNIDADE","COEFIC.","CUSTO UNITÁRIO",null,"CUSTO  TOTAL (A) + (B) + (C) + (D) + (E)"]
[null,null,null,null,null,null,"DESONERADO","NÃO DESONER.","DESONERADO","NÃO DESONER."]
[null,"COMPOSIÇÃO","COMP 235_SEE","PLACA DE SINALIZAÇÃO EM PVC COD 01 - (300X300) PROIBIDO FUMAR","UN ",null,null,null,25.319999999999997,25.439999999999998]
[null,"AGETOP_I",5,"SERVENTE","h     ",0.09,8.75,10.14,0.79,0.91]
[null,"MÃO DE OBRA (B) - TOTAL",null,null,null,null,null,null,0.79,0.91]
[null,"AGETOP_I",3070,"BUCHA DE NYLON S-6","un",2,0.04,0.04,0.08,0.08]
[null,"AGETOP_I",3393,"PARAFUSO P/BUCHA S-6","un",2,0.08,0.08,0.16,0.16]
[null,"SINAPI_I",37556,"PLACA DE SINALIZACAO DE SEGURANCA CONTRA INCENDIO, FOTOLUMINESCENTE, QUADRADA, *20 X 20* CM, EM PVC *2* MM ANTI-CHAMAS (SIMBOLOS, CORES E PICTOGRAMAS CONFORME NBR 13434)","UN    ",1,24.29,24.29,24.29,24.29]
[null,"MATERIAL (C) - TOTAL",null,null,null,null,null,null,24.529999999999998,24.529999999999998]
[]
[236,"FONTE","CÓDIGO","DESCRIÇÃO","UNIDADE","COEFIC.","CUSTO UNITÁRIO",null,"CUSTO  TOTAL (A) + (B) + (C) + (D) + (E)"]
[null,null,null,null,null,null,"DESONERADO","NÃO DESONER.","DESONERADO","NÃO DESONER."]
[null,"COMPOSIÇÃO","COMP 236_SEE","PLACA DE SINALIZAÇÃO EM PVC COD 06 - (300X300) PERIGO INFLAMÁVEL","UN ",null,null,null,25.319999999999997,25.439999999999998]
[null,"AGETOP_I",5,"SERVENTE","h     ",0.09,8.75,10.14,0.79,0.91]
[null,"MÃO DE OBRA (B) - TOTAL",null,null,null,null,null,null,0.79,0.91]
[null,"AGETOP_I",3070,"BUCHA DE NYLON S-6","un",2,0.04,0.04,0.08,0.08]
[null,"AGETOP_I",3393,"PARAFUSO P/BUCHA S-6","un",2,0.08,0.08,0.16,0.16]
[null,"SINAPI_I",37556,"PLACA DE SINALIZACAO DE SEGURANCA CONTRA INCENDIO, FOTOLUMINESCENTE, QUADRADA, *20 X 20* CM, EM PVC *2* MM ANTI-CHAMAS (SIMBOLOS, CORES E PICTOGRAMAS CONFORME NBR 13434)","UN    ",1,24.29,24.29,24.29,24.29]
[null,"MATERIAL (C) - TOTAL",null,null,null,null,null,null,24.529999999999998,24.529999999999998]
[]
[411,"FONTE","CÓDIGO","DESCRIÇÃO","UNIDADE","COEFIC.","CUSTO UNITÁRIO",null,"CUSTO  TOTAL (A) + (B) + (C) + (D) + (E)"]
[null,null,null,null,null,null,"DESONERADO","NÃO DESONER.","DESONERADO","NÃO DESONER."]
[null,"COMPOSIÇÃO","COMP 411_SEE","PLACA DE SINALIZAÇÃO EM PVC COD 13 - (316X158) SAÍDA DE EMERGÊNCIA","UN ",null,null,null,30.819999999999997,30.939999999999998]
[null,"AGETOP_I",5,"SERVENTE","h     ",0.09,8.75,10.14,0.79,0.91]
[null,"MÃO DE OBRA (B) - TOTAL",null,null,null,null,null,null,0.79,0.91]
[null,"AGETOP_I",3070,"BUCHA DE NYLON S-6","un",2,0.04,0.04,0.08,0.08]
[null,"AGETOP_I",3393,"PARAFUSO P/BUCHA S-6","un",2,0.08,0.08,0.16,0.16]
[null,"SINAPI_I",37559,"PLACA DE SINALIZACAO DE SEGURANCA CONTRA INCENDIO, FOTOLUMINESCENTE, RETANGULAR, *12 X 40* CM, EM PVC *2* MM ANTI-CHAMAS (SIMBOLOS, CORES E PICTOGRAMAS CONFORME NBR 13434)","UN    ",1,29.79,29.79,29.79,29.79]
[null,"MATERIAL (C) - TOTAL",null,null,null,null,null,null,30.029999999999998,30.029999999999998]
[]
[412,"FONTE","CÓDIGO","DESCRIÇÃO","UNIDADE","COEFIC.","CUSTO UNITÁRIO",null,"CUSTO  TOTAL (A) + (B) + (C) + (D) + (E)"]
[null,null,null,null,null,null,"DESONERADO","NÃO DESONER.","DESONERADO","NÃO DESONER."]
[null,"COMPOSIÇÃO","COMP 412_SEE","PLACA DE SINALIZAÇÃO EM PVC COD 17 - (316X158) MENSAGEM \"SAÍDA\"","UN ",null,null,null,30.819999999999997,30.939999999999998]
[null,"AGETOP_I",5,"SERVENTE","h     ",0.09,8.75,10.14,0.79,0.91]
[null,"MÃO DE OBRA (B) - TOTAL",null,null,null,null,null,null,0.79,0.91]
[null,"AGETOP_I",3070,"BUCHA DE NYLON S-6","un",2,0.04,0.04,0.08,0.08]
[null,"AGETOP_I",3393,"PARAFUSO P/BUCHA S-6","un",2,0.08,0.08,0.16,0.16]
[null,"SINAPI_I",37559,"PLACA DE SINALIZACAO DE SEGURANCA CONTRA INCENDIO, FOTOLUMINESCENTE, RETANGULAR, *12 X 40* CM, EM PVC *2* MM ANTI-CHAMAS (SIMBOLOS, CORES E PICTOGRAMAS CONFORME NBR 13434)","UN    ",1,29.79,29.79,29.79,29.79]
[null,"MATERIAL (C) - TOTAL",null,null,null,null,null,null,30.029999999999998,30.029999999999998]