{"text_format":"1","workbook":"xlsx","n_sheets":7,"sheets":["Orçamento","Resumo ","Somatório","Cronog_90_Dias","Composição BDI","Relatório CENTRAL","Parc Maior Relev"],"not_rendered":{"charts":0,"images":4,"macros":1,"external_links":1,"defined_names":103,"comments":2,"pivot_tables":0},"unopened":[],"bounds":{"document_bytes":16777216,"sheet_cells":100000,"rows_first":2000,"rows_last":500,"rows_between":2000,"halvings":0,"cell_chars":16384,"cell_head_chars":4096},"cells_cut":0,"cells_raw":0,"read":"whole","date_system":"1900"}

{"sheet":"Orçamento","index":0,"n_rows":541,"n_cols":27,"rows_kept":541,"cut":false,"hidden":false,"merged":[[10,24,10,25],[9,23,9,25],[522,18,522,22],[523,15,523,17],[523,18,523,22],[524,15,524,17],[524,18,524,22],[519,15,519,17],[519,18,519,22],[520,15,520,17],[520,18,520,22],[521,15,521,17],[521,18,521,22],[515,14,515,26],[516,18,516,22],[517,15,517,17],[517,18,517,22],[502,15,502,17],[482,15,482,17],[537,18,537,22],[525,15,525,17],[525,18,525,22],[526,15,526,17],[526,18,526,22],[527,15,527,17],[527,18,527,22],[531,15,531,17],[531,18,531,22],[532,15,532,17],[532,18,532,22],[533,15,533,17],[522,15,522,17],[528,15,528,17],[528,18,528,22],[529,15,529,17],[529,18,529,22],[530,15,530,17],[530,18,530,22],[534,23,534,25],[535,23,535,25],[536,23,536,25],[537,23,537,25],[538,23,538,25],[539,23,539,25],[540,23,540,25],[509,14,509,17],[516,15,516,17],[540,18,540,22],[537,14,537,17],[534,15,534,17],[534,18,534,22],[535,15,535,17],[535,18,535,22],[536,15,536,17],[536,18,536,22],[539,18,539,22],[538,18,538,22],[0,14,0,26],[473,16,473,24],[474,16,474,24],[475,16,475,24],[11,14,11,26],[14,14,14,26],[3,14,3,22],[4,14,4,22],[6,18,6,22],[7,18,7,22],[12,18,12,22],[13,18,13,22],[7,14,7,17],[6,14,6,17],[4,23,4,25],[3,23,3,25],[6,23,6,25],[7,23,7,25],[9,18,9,20],[465,17,470,17],[471,22,471,24],[465,22,465,24],[466,22,466,24],[467,22,467,24],[476,16,476,24],[482,23,482,25],[498,23,498,25],[499,23,499,25],[518,15,518,17],[518,18,518,22],[477,16,477,24],[495,15,495,17],[496,15,496,17],[481,14,481,26],[482,18,482,22],[483,18,483,22],[491,18,491,22],[492,18,492,22],[493,18,493,22],[494,18,494,22],[506,18,506,22],[503,15,503,17],[483,15,483,17],[484,15,484,17],[485,15,485,17],[486,15,486,17],[487,15,487,17],[488,15,488,17],[489,15,489,17],[490,15,490,17],[491,15,491,17],[500,23,500,25],[501,23,501,25],[499,15,499,17],[500,15,500,17],[501,15,501,17],[502,23,502,25],[497,15,497,17],[498,15,498,17],[496,23,496,25],[497,23,497,25],[495,23,495,25],[512,18,512,22],[488,18,488,22],[489,18,489,22],[487,18,487,22],[496,18,496,22],[478,18,478,24],[484,18,484,22],[485,18,485,22],[486,18,486,22],[509,18,509,22],[507,18,507,22],[508,18,508,22],[498,18,498,22],[505,18,505,22],[501,18,501,22],[503,18,503,22],[499,18,499,22],[500,18,500,22],[509,23,509,25],[503,23,503,25],[504,23,504,25],[505,23,505,25],[506,23,506,25],[507,23,507,25],[511,18,511,22],[1,14,1,24],[9,14,9,16],[10,14,10,16],[12,14,12,16],[13,14,13,16],[15,14,15,24],[2,14,2,24],[5,14,5,24],[8,14,8,24],[495,18,495,22],[492,15,492,17],[493,15,493,17],[494,15,494,17],[504,18,504,22],[502,18,502,22],[510,18,510,22],[497,18,497,22],[490,18,490,22],[504,15,504,17],[505,15,505,17],[507,15,507,17],[508,15,508,17],[510,23,510,25],[531,23,531,25],[532,23,532,25],[533,23,533,25],[516,23,516,25],[517,23,517,25],[518,23,518,25],[519,23,519,25],[520,23,520,25],[521,23,521,25],[522,23,522,25],[523,23,523,25],[524,23,524,25],[525,23,525,25],[526,23,526,25],[527,23,527,25],[528,23,528,25],[529,23,529,25],[530,23,530,25],[506,15,506,17],[511,23,511,25],[512,23,512,25],[533,18,533,22],[469,22,469,24],[470,22,470,24],[7,12,7,13],[6,12,6,13],[13,23,13,25],[12,23,12,25],[10,19,10,22],[508,23,508,25],[483,23,483,25],[484,23,484,25],[485,23,485,25],[486,23,486,25],[487,23,487,25],[488,23,488,25],[489,23,489,25],[490,23,490,25],[491,23,491,25],[492,23,492,25],[493,23,493,25],[494,23,494,25]]}
[]
[]
[]
[null,null,null,null,null,null,null,null,null,null,null,null,null,null,"UNIDADE ESCOLAR",null,null,null,null,null,null,null,null,"CÓDIGO INEP"]
[null,null,null,null,null,null,null,null,null,null,null,null,"",null,"COLÉGIO ESTADUAL DA POLÍCIA MILITAR DE GOIÁS DE MORRINHOS - XAVIER DE ALMEIDA",null,null,null,null,null,null,null,null,52060098]
[]
["Nmax",null,null,null,null,null,null,null,null,null,null,null,null,null,"OBRA",null,null,null,"DATA",null,null,null,null,"CIDADE"]
[{"$f":"MAX($C$19:$C$465)","v":4},null,null,null,null,null,null,null,null,null,null,null,null,null,"REFORMA  E AMPLIAÇÃO",null,null,null,"2020-07-02",null,null,null,null,"MORRINHOS"]
[]
[null,null,null,null,null,null,null,null,null,null,null,null,null,null,"CRE",null,null,"ENDEREÇO","REFERÊNCIA AGETOP",null,null,null,null,"REFERÊNCIA SINAPI"]
[null,null,null,null,null,null,null,null,null,null,null,null,null,null,"CRE-MORRINHOS",null,null," AV JOSE NASCIMENTO S/N , SETOR OESTE , CEP:75650-000","ABR/19","ONERADA",null,null,null,"ABR/20","ONERADA"]
[]
[null,null,null,null,null,null,null,null,null,null,null,null,null,null,"ÁREA EXISTENTE (M²)",null,null,"ÁREA A CONSTRUIR (M²)","ÁREA A DEMOLIR (M²)",null,null,null,null,"ÁREA TOTAL CONSTRUÍDA (M²)"]
[null,null,null,null,null,null,null,null,null,null,null,null,null,null,3832.1,null,null,145.41,null,null,null,null,null,3977.5099999999998]
[]
[null,null,null,null,null,null,null,null,null,null,null,"FILTRO",null,null,"PLANILHA ORÇAMENTÁRIA"]
["Nível E","Save Nivel","Nível C","Altura","n1","n2","n3","n4","n5","Czero","Cnível","↓","Nível","Nível Corrigido","ITEM","TABELA","CODIGO","DESCRIÇÃO DOS SERVIÇOS","UNID","QUANT","REPET","QUANT TOTAL","MAT","MO","T.SERVIÇO UNIT","VALOR TOTAL","OBSERVAÇÕES¹"]
[{"$f":"CHOOSE(1+LOG(1+2*(ORÇAMENTO.Nivel=\"Nível 1\")+4*(ORÇAMENTO.Nivel=\"Nível 2\")+8*(ORÇAMENTO.Nivel=\"Nível 3\")+16*(ORÇAMENTO.Nivel=\"Nível 4\")+32*(ORÇAMENTO.Nivel=\"Serviço\"),2),0,1,2,3,4,\"S\")","v":"S"},{"$f":"IF(OR(C18=\"s\",C18=0),OFFSET(B18,-1,0),C18)","v":"Save Nivel"},{"$f":"IF(OFFSET(C18,-1,0)=\"L\",1,IF(OFFSET(C18,-1,0)=1,2,IF(OR(A18=\"s\",A18=0),\"S\",IF(AND(OFFSET(C18,-1,0)=2,A18=4),3,IF(AND(OR(OFFSET(C18,-1,0)=\"s\",OFFSET(C18,-1,0)=0),A18<>\"s\",A18>OFFSET(B18,-1,0)),OFFSET(B18,-1,0),A18)))))","v":"S"},{"$f":"IF(OR(C18=\"S\",C18=0),0,IF(ISERROR(K18),J18,SMALL(J18:K18,1)))","v":0},{"$f":"IF($C18=1,OFFSET(E18,-1,0)+1,OFFSET(E18,-1,0))","v":"n1"},{"$f":"IF($C18=1,0,IF($C18=2,OFFSET(F18,-1,0)+1,OFFSET(F18,-1,0)))","v":"n2"},{"$f":"IF(AND($C18<=2,$C18<>0),0,IF($C18=3,OFFSET(G18,-1,0)+1,OFFSET(G18,-1,0)))","v":"n3"},{"$f":"IF(AND($C18<=3,$C18<>0),0,IF($C18=4,OFFSET(H18,-1,0)+1,OFFSET(H18,-1,0)))","v":"n4"},{"$f":"IF(AND($C18<=4,$C18<>0),0,IF(AND($C18=\"S\",$Y18>0),OFFSET(I18,-1,0)+1,OFFSET(I18,-1,0)))","v":"n5"},{"$f":"IF(OR($C18=\"S\",$C18=0),0,MATCH(0,OFFSET($D18,1,$C18,ROW($C$465)-ROW($C18)),0))","v":0},{"$f":"IF(OR($C18=\"S\",$C18=0),0,MATCH(OFFSET($D18,0,$C18)+1,OFFSET($D18,1,$C18,ROW($C$465)-ROW($C18)),0))","v":0},"","Serviço","Serviço","-","SINAPI",null,"(sem código)","-",null,"REPET","-",0,0,0,"-",""]
[0,null,"L",{"$f":"COUNTA(OFFSET(D19,1,0):D$465)","v":445},{"$f":"LEFT(O20,1)-1","v":0},null,null,null,null,null,null,"F","LOTE","LOTE","REFORMA  E AMPLIAÇÃO - COLÉGIO ESTADUAL DA POLÍCIA MILITAR DE GOIÁS DE MORRINHOS - XAVIER DE ALMEIDA",null,null,null,null,null,null,null,null,null,null,0]
[{"$f":"CHOOSE(1+LOG(1+2*(ORÇAMENTO.Nivel=\"Nível 1\")+4*(ORÇAMENTO.Nivel=\"Nível 2\")+8*(ORÇAMENTO.Nivel=\"Nível 3\")+16*(ORÇAMENTO.Nivel=\"Nível 4\")+32*(ORÇAMENTO.Nivel=\"Serviço\"),2),0,1,2,3,4,\"S\")","v":1},{"$f":"IF(OR(C20=\"s\",C20=0),OFFSET(B20,-1,0),C20)","v":1},{"$f":"IF(OFFSET(C20,-1,0)=\"L\",1,IF(OFFSET(C20,-1,0)=1,2,IF(OR(A20=\"s\",A20=0),\"S\",IF(AND(OFFSET(C20,-1,0)=2,A20=4),3,IF(AND(OR(OFFSET(C20,-1,0)=\"s\",OFFSET(C20,-1,0)=0),A20<>\"s\",A20>OFFSET(B20,-1,0)),OFFSET(B20,-1,0),A20)))))","v":1},{"$f":"IF(OR(C20=\"S\",C20=0),0,IF(ISERROR(K20),J20,SMALL(J20:K20,1)))","v":12},{"$f":"IF($C20=1,OFFSET(E20,-1,0)+1,OFFSET(E20,-1,0))","v":1},{"$f":"IF($C20=1,0,IF($C20=2,OFFSET(F20,-1,0)+1,OFFSET(F20,-1,0)))","v":0},{"$f":"IF(AND($C20<=2,$C20<>0),0,IF($C20=3,OFFSET(G20,-1,0)+1,OFFSET(G20,-1,0)))","v":0},{"$f":"IF(AND($C20<=3,$C20<>0),0,IF($C20=4,OFFSET(H20,-1,0)+1,OFFSET(H20,-1,0)))","v":0},{"$f":"IF(AND($C20<=4,$C20<>0),0,IF(AND($C20=\"S\",$Y20>0),OFFSET(I20,-1,0)+1,OFFSET(I20,-1,0)))","v":0},{"$f":"IF(OR($C20=\"S\",$C20=0),0,MATCH(0,OFFSET($D20,1,$C20,ROW($C$465)-ROW($C20)),0))","v":445},{"$f":"IF(OR($C20=\"S\",$C20=0),0,MATCH(OFFSET($D20,0,$C20)+1,OFFSET($D20,1,$C20,ROW($C$465)-ROW($C20)),0))","v":12},"F","Nível 1","Nível 1","1.","AGETOP",null,"REFORMA  E AMPLIAÇÃO","UN",1,1,1,null,null,0,0]
[2,2,2,2,1,1,0,0,0,11,2,"","Nível 2","Nível 2","-","AGETOP",null,"SERVIÇOS PRELIMINARES","-",null,1,"-",null,null,0,0]
["S",2,"S",0,1,1,0,0,0,0,0,"","Serviço","Serviço","-","AGETOP",21301,"PLACA DE OBRA PLOTADA EM CHAPA METÁLICA 26 , AFIXADA EM CAVALETES DE MADEIRA DE LEI (VIGOTAS 6X12CM) - PADRÃO GOINFRA","m2    ",7.5,1,7.5,null,null,0,0,""]
[2,2,2,3,1,2,0,0,0,9,3,"","Nível 2","Nível 2","-","SINAPI",null,"TRANSPORTES","-",null,1,"-",null,null,0,0,""]
["S",2,"S",0,1,2,0,0,0,0,0,"","Serviço","Serviço","-","SINAPI",72900,"TRANSPORTE DE ENTULHO COM CAMINHAO BASCULANTE 6 M3, RODOVIA PAVIMENTADA, DMT 0,5 A 1,0 KM","M3",7.2960000000000003,1,7.2960000000000003,null,null,0,0,""]
["S",2,"S",0,1,2,0,0,0,0,0,"","Serviço","Serviço","-","SINAPI",72897,"CARGA MANUAL DE ENTULHO EM CAMINHAO BASCULANTE 6 M3","M3",7.2960000000000003,1,7.2960000000000003,null,null,0,0,""]
[2,2,2,3,1,3,0,0,0,6,3,"","Nível 2","Nível 2","-","SINAPI",null,"ADMINISTRAÇÃO","-",null,1,"-",null,null,0,0,""]
["S",2,"S",0,1,3,0,0,0,0,0,"","Serviço","Serviço","-","SINAPI",90778,"ENGENHEIRO CIVIL DE OBRA PLENO COM ENCARGOS COMPLEMENTARES","H",40,1,40,null,null,0,0,"Referência: AGETOP - 250101"]
["S",2,"S",0,1,3,0,0,0,0,0,"","Serviço","Serviço","-","SINAPI",90776,"ENCARREGADO GERAL COM ENCARGOS COMPLEMENTARES","H",330,1,330,null,null,0,0,"Referência: AGETOP - 250103"]
[2,2,2,3,1,4,0,0,0,3,18,"","Nível 2","Nível 2","-",null,null,"DIVERSOS","-",null,1,"-",null,null,0,0,""]
["S",2,"S",0,1,4,0,0,0,0,0,"","Serviço","Serviço","-","AGETOP",270804,"PLACA DE INAUGURAÇÃO AÇO ESCOVADO 60 X 120 CM","un    ",1,1,1,null,null,0,0,""]
["S",2,"S",0,1,4,0,0,0,0,0,"","Serviço","Serviço","-","AGETOP",270501,"LIMPEZA FINAL DE OBRA - (OBRAS CIVIS)","m2    ",101,1,101,null,null,0,0,""]
[1,1,1,22,2,0,0,0,0,433,22,"F","Nível 1","Nível 1","2.","SINAPI",null,"SERVIÇOS PRELIMINARES - IMPLANTAÇÃO DE REFEITÓRIO","UN",1,1,1,null,null,0,0,""]
[2,2,2,6,2,1,0,0,0,21,6,"","Nível 2","Nível 2","-","SINAPI",null,"SERVIÇO EM TERRA","-",null,1,"-",null,null,0,0,""]
["S",2,"S",0,2,1,0,0,0,0,0,"","Serviço","Serviço","-","AGETOP",41004,"ESCAVACAO MECANICA","m3    ",21.93,1,21.93,null,null,0,0,""]
["S",2,"S",0,2,1,0,0,0,0,0,"","Serviço","Serviço","-","AGETOP",41005,"CARGA MECANIZADA","m3    ",21.93,1,21.93,null,null,0,0,""]
["S",2,"S",0,2,1,0,0,0,0,0,"","Serviço","Serviço","-","AGETOP",41012,"INDENIZAÇÃO DE JAZIDA","m3    ",21.93,1,21.93,null,null,0,0,""]
["S",2,"S",0,2,1,0,0,0,0,0,"","Serviço","Serviço","-","AGETOP",41006,"TRANSPORTE DE MATERIAL ESCAVADO M3.KM","m3km  ",219.3,1,219.3,null,null,0,0,""]
["S",2,"S",0,2,1,0,0,0,0,0,"","Serviço","Serviço","-","AGETOP",41009,"COMPACTAÇÃO MECÂNICA SEM CONTROLE LABORATÓRIO","m3    ",17.55,1,17.55,null,null,0,0,""]
[2,2,2,3,2,2,0,0,0,15,3,"","Nível 2","Nível 2","-","SINAPI",null,"ALVENARIAS E DIVISÓRIAS","-",null,1,"-",null,null,0,0,""]
["S",2,"S",0,2,2,0,0,0,0,0,"","Serviço","Serviço","-","SINAPI",72132,"ALVENARIA EM TIJOLO CERAMICO MACICO 5X10X20CM 1/2 VEZ (ESPESSURA 10CM), ASSENTADO COM ARGAMASSA TRACO 1:2:8 (CIMENTO, CAL E AREIA)","M2",0.7,1,0.7,null,null,0,0,""]
["S",2,"S",0,2,2,0,0,0,0,0,"","Serviço","Serviço","-","AGETOP",100201,"ALVENARIA DE TIJOLO FURADO 1/2 VEZ - 9 x 19 x 19 - ARG. (1CALH:4ARML+100KG DE CI/M3)","m2    ",4.0199999999999996,1,4.0199999999999996,null,null,0,0,""]
[2,2,2,2,2,3,0,0,0,12,2,"","Nível 2","Nível 2","-","SINAPI",null,"ESQUADRIAS METÁLICAS","-",null,1,"-",null,null,0,0,""]
["S",2,"S",0,2,3,0,0,0,0,0,"","Serviço","Serviço","-","AGETOP",180323,"GRELHA PADRÃO GOINFRA DE FERRO CHATO COM BERÇO (ESPAÇAMENTO ENTRE FACES = 1,5CM - NBR 9050 ACESSIBILIDADE)","m2    ",0.92,1,0.92,null,null,0,0,""]
[2,2,2,3,2,4,0,0,0,10,3,"","Nível 2","Nível 2","-",null,null,"REVESTIMENTO DE PAREDE","-",null,1,"-",null,null,0,0,""]
["S",2,"S",0,2,4,0,0,0,0,0,"","Serviço","Serviço","-","AGETOP",200101,"CHAPISCO COMUM","m2    ",8.0399999999999991,1,8.0399999999999991,null,null,0,0,""]
["S",2,"S",0,2,4,0,0,0,0,0,"","Serviço","Serviço","-","SINAPI",87547,"MASSA ÚNICA, PARA RECEBIMENTO DE PINTURA, EM ARGAMASSA TRAÇO 1:2:8, PREPARO MECÂNICO COM BETONEIRA 400L, APLICADA MANUALMENTE EM FACES INTERNAS DE PAREDES, ESPESSURA DE 10MM, COM EXECUÇÃO DE TALISCAS. AF_06/2014","M2",8.0399999999999991,1,8.0399999999999991,null,null,0,0,""]
[2,2,2,2,2,5,0,0,0,7,2,"","Nível 2","Nível 2","-",null,null,"REVESTIMENTO DE PISO","-",null,1,"-",null,null,0,0,""]
["S",2,"S",0,2,5,0,0,0,0,0,"","Serviço","Serviço","-","AGETOP",220102,"PISO CONCRETO DESEMPENADO ESPESSURA = 5 CM  1:2,5:3,5","m2    ",5.0599999999999996,1,5.0599999999999996,null,null,0,0,""]
[2,2,2,3,2,6,0,0,0,5,3,"","Nível 2","Nível 2","-","AGETOP",null,"PINTURA","-",null,1,"-",null,null,0,0,""]
["S",2,"S",0,2,6,0,0,0,0,0,"","Serviço","Serviço","-","AGETOP",261000,"PINTURA LATEX ACRILICA 2 DEMAOS C/SELADOR","m2    ",8.0399999999999991,1,8.0399999999999991,null,null,0,0,""]
["S",2,"S",0,2,6,0,0,0,0,0,"","Serviço","Serviço","-","AGETOP",261602,"PINT.ESMALTE/ESQUAD.FERRO C/FUNDO ANTICOR.","m2    ",1.38,1,1.38,null,null,0,0,""]
[2,2,2,2,2,7,0,0,0,2,138,"","Nível 2","Nível 2","-","SINAPI",null,"DIVERSOS","-",null,1,"-",null,null,0,0,""]
["S",2,"S",0,2,7,0,0,0,0,0,"","Serviço","Serviço","-","AGETOP",271417,"CANALETA CONCRETO DESEMPENADO 5 CM PD.GOINFRA","m     ",2.2999999999999998,1,2.2999999999999998,null,null,0,0,""]
[1,1,1,186,3,0,0,0,0,411,186,"F","Nível 1","Nível 1","3.","SINAPI",null,"COZINHA COM REFEITÓRIO - SEDUC 2009","UN",1,1,1,null,null,0,0,""]
[2,2,2,2,3,1,0,0,0,185,2,"","Nível 2","Nível 2","-","SINAPI",null,"SERVIÇOS PRELIMINARES","-",null,1,"-",null,null,0,0,""]
["S",2,"S",0,3,1,0,0,0,0,0,"","Serviço","Serviço","-","AGETOP",20701,"LOCAÇÃO DA OBRA, EXECUÇÃO DE GABARITO SEM REAPROVEITAMENTO, INCLUSO PINTURA (FACE INTERNA DO RIPÃO 15CM) E PIQUETE COM TESTEMUNHA","m2    ",139.75,1,139.75,null,null,0,0,""]
[2,2,2,3,3,2,0,0,0,183,3,"","Nível 2","Nível 2","-","AGETOP",null,"TRANSPORTES","-",null,1,"-",null,null,0,0,""]
["S",2,"S",0,3,2,0,0,0,0,0,"","Serviço","Serviço","-","SINAPI",72900,"TRANSPORTE DE ENTULHO COM CAMINHAO BASCULANTE 6 M3, RODOVIA PAVIMENTADA, DMT 0,5 A 1,0 KM","M3",10,1,10,null,null,0,0,""]
["S",2,"S",0,3,2,0,0,0,0,0,"","Serviço","Serviço","-","SINAPI",72897,"CARGA MANUAL DE ENTULHO EM CAMINHAO BASCULANTE 6 M3","M3",10,1,10,null,null,0,0,""]
[2,2,2,2,3,3,0,0,0,180,2,"","Nível 2","Nível 2","-","AGETOP",null,"SERVIÇO EM TERRA","-",null,1,"-",null,null,0,0,""]
["S",2,"S",0,3,3,0,0,0,0,0,"","Serviço","Serviço","-","AGETOP",41002,"APILOAMENTO","m2    ",139.75,1,139.75,null,null,0,0,""]
[2,2,2,20,3,4,0,0,0,178,20,"","Nível 2","Nível 2","-","AGETOP",null,"FUNDAÇÕES E SONDAGENS","-",null,1,"-",null,null,0,0,""]
[3,3,3,9,3,4,1,0,0,19,9,"","Nível 3","Nível 3","-","SINAPI",null,"ESTACAS E BLOCOS","-",null,1,"-",null,null,0,0,""]
["S",3,"S",0,3,4,1,0,0,0,0,"","Serviço","Serviço","-","SINAPI",98230,"ESTACA BROCA DE CONCRETO, DIÂMETRO DE 30 CM, PROFUNDIDADE DE ATÉ 3 M, ESCAVAÇÃO MANUAL COM TRADO CONCHA, NÃO ARMADA. AF_03/2018","M",101.5,1,101.5,null,null,0,0,"Referência: AGETOP - 50302"]
["S",3,"S",0,3,4,1,0,0,0,0,"","Serviço","Serviço","-","SINAPI",96522,"ESCAVAÇÃO MANUAL PARA BLOCO DE COROAMENTO OU SAPATA, SEM PREVISÃO DE FÔRMA. AF_06/2017","M3",5.19,1,5.19,null,null,0,0,"Referência: AGETOP - 50901"]
["S",3,"S",0,3,4,1,0,0,0,0,"","Serviço","Serviço","-","SINAPI",94963,"CONCRETO FCK = 15MPA, TRAÇO 1:3,4:3,5 (CIMENTO/ AREIA MÉDIA/ BRITA 1)  - PREPARO MECÂNICO COM BETONEIRA 400 L. AF_07/2016","M3",3.4,1,3.4,null,null,0,0,""]
["S",3,"S",0,3,4,1,0,0,0,0,"","Serviço","Serviço","-","AGETOP",51055,"LANÇAMENTO/APLICAÇÃO/ADENSAMENTO MANUAL DE CONCRETO - (O.C.)","m3    ",3.4,1,3.4,null,null,0,0,""]
["S",3,"S",0,3,4,1,0,0,0,0,"","Serviço","Serviço","-","AGETOP",60191,"FORMA DE TABUA CINTA BALDRAME U=8 VEZES","m2    ",23.7,1,23.7,null,null,0,0,""]
["S",3,"S",0,3,4,1,0,0,0,0,"","Serviço","Serviço","-","SINAPI",96543,"ARMAÇÃO DE BLOCO, VIGA BALDRAME E SAPATA UTILIZANDO AÇO CA-60 DE 5 MM - MONTAGEM. AF_06/2017","KG",98.2,1,98.2,null,null,0,0,"Referência: AGETOP - 52014"]
["S",3,"S",0,3,4,1,0,0,0,0,"","Serviço","Serviço","-","SINAPI",96546,"ARMAÇÃO DE BLOCO, VIGA BALDRAME OU SAPATA UTILIZANDO AÇO CA-50 DE 10 MM - MONTAGEM. AF_06/2017","KG",226.54,1,226.54,null,null,0,0,"Referência: AGETOP - 52005"]
["S",3,"S",0,3,4,1,0,0,0,0,"","Serviço","Serviço","-","SINAPI",96547,"ARMAÇÃO DE BLOCO, VIGA BALDRAME OU SAPATA UTILIZANDO AÇO CA-50 DE 12,5 MM - MONTAGEM. AF_06/2017","KG",240,1,240,null,null,0,0,""]
[3,3,3,8,3,4,2,0,0,10,8,"","Nível 3","Nível 3","-","SINAPI",null,"VIGAS BALDRAMES","-",null,1,"-",null,null,0,0,""]
["S",3,"S",0,3,4,2,0,0,0,0,"","Serviço","Serviço","-","AGETOP",60191,"FORMA DE TABUA CINTA BALDRAME U=8 VEZES","m2    ",41.5,1,41.5,null,null,0,0,""]
["S",3,"S",0,3,4,2,0,0,0,0,"","Serviço","Serviço","-","SINAPI",94964,"CONCRETO FCK = 20MPA, TRAÇO 1:2,7:3 (CIMENTO/ AREIA MÉDIA/ BRITA 1)  - PREPARO MECÂNICO COM BETONEIRA 400 L. AF_07/2016","M3",2.4,1,2.4,null,null,0,0,""]
["S",3,"S",0,3,4,2,0,0,0,0,"","Serviço","Serviço","-","AGETOP",51055,"LANÇAMENTO/APLICAÇÃO/ADENSAMENTO MANUAL DE CONCRETO - (O.C.)","m3    ",2.4,1,2.4,null,null,0,0,""]
["S",3,"S",0,3,4,2,0,0,0,0,"","Serviço","Serviço","-","SINAPI",96544,"ARMAÇÃO DE BLOCO, VIGA BALDRAME OU SAPATA UTILIZANDO AÇO CA-50 DE 6,3 MM - MONTAGEM. AF_06/2017","KG",47,1,47,null,null,0,0,"Referência: AGETOP - 52003"]
["S",3,"S",0,3,4,2,0,0,0,0,"","Serviço","Serviço","-","SINAPI",96545,"ARMAÇÃO DE BLOCO, VIGA BALDRAME OU SAPATA UTILIZANDO AÇO CA-50 DE 8 MM - MONTAGEM. AF_06/2017","KG",49,1,49,null,null,0,0,"Referência: AGETOP - 52004"]
["S",3,"S",0,3,4,2,0,0,0,0,"","Serviço","Serviço","-","SINAPI",96546,"ARMAÇÃO DE BLOCO, VIGA BALDRAME OU SAPATA UTILIZANDO AÇO CA-50 DE 10 MM - MONTAGEM. AF_06/2017","KG",38,1,38,null,null,0,0,"Referência: AGETOP - 52005"]
["S",3,"S",0,3,4,2,0,0,0,0,"","Serviço","Serviço","-","SINAPI",96543,"ARMAÇÃO DE BLOCO, VIGA BALDRAME E SAPATA UTILIZANDO AÇO CA-60 DE 5 MM - MONTAGEM. AF_06/2017","KG",72,1,72,null,null,0,0,"Referência: AGETOP - 52014"]
[3,3,3,2,3,4,3,0,0,2,190,"","Nível 3","Nível 3","-","SINAPI",null,"OUTROS","-",null,1,"-",null,null,0,0,""]
["S",3,"S",0,3,4,3,0,0,0,0,"","Serviço","Serviço","-","AGETOP",50101,"SONDAGENS P/INTERIOR - (OBRAS CIVIS)","m     ",28,1,28,null,null,0,0,""]
[2,2,2,20,3,5,0,0,0,158,20,"","Nível 2","Nível 2","-","AGETOP",null,"ESTRUTURA","-",null,1,"-",null,null,0,0,""]
[3,3,3,8,3,5,1,0,0,19,8,"","Nível 3","Nível 3","-","AGETOP",null,"PILAR","-",null,1,"-",null,null,0,0,""]
["S",3,"S",0,3,5,1,0,0,{"$f":"IF(OR($C84=\"S\",$C84=0),0,MATCH(0,OFFSET($D84,1,$C84,ROW($C$465)-ROW($C84)),0))","v":0},{"$f":"IF(OR($C84=\"S\",$C84=0),0,MATCH(OFFSET($D84,0,$C84)+1,OFFSET($D84,1,$C84,ROW($C$465)-ROW($C84)),0))","v":0},"","Serviço","Serviço","-","SINAPI",92426,"MONTAGEM E DESMONTAGEM DE FÔRMA DE PILARES RETANGULARES E ESTRUTURAS SIMILARES COM ÁREA MÉDIA DAS SEÇÕES MENOR OU IGUAL A 0,25 M², PÉ-DIREITO SIMPLES, EM CHAPA DE MADEIRA COMPENSADA RESINADA, 8 UTILIZAÇÕES. AF_12/2015","M2",59.6,1,59.6,null,null,0,0,""]
["S",3,"S",0,3,5,1,0,0,0,0,"","Serviço","Serviço","-","SINAPI",94964,"CONCRETO FCK = 20MPA, TRAÇO 1:2,7:3 (CIMENTO/ AREIA MÉDIA/ BRITA 1)  - PREPARO MECÂNICO COM BETONEIRA 400 L. AF_07/2016","M3",2.5,1,2.5,null,null,0,0,""]
["S",3,"S",0,3,5,1,0,0,0,0,"","Serviço","Serviço","-","SINAPI",92873,"LANÇAMENTO COM USO DE BALDES, ADENSAMENTO E ACABAMENTO DE CONCRETO EM ESTRUTURAS. AF_12/2015","M3",2.5,1,2.5,null,null,0,0,"Referência: AGETOP - 60801"]
["S",3,"S",0,3,5,1,0,0,0,0,"","Serviço","Serviço","-","SINAPI",92776,"ARMAÇÃO DE PILAR OU VIGA DE UMA ESTRUTURA CONVENCIONAL DE CONCRETO ARMADO EM UMA EDIFICAÇÃO TÉRREA OU SOBRADO UTILIZANDO AÇO CA-50 DE 6,3 MM - MONTAGEM. AF_12/2015","KG",42,1,42,null,null,0,0,"Referência: AGETOP - 60303"]
["S",3,"S",0,3,5,1,0,0,0,0,"","Serviço","Serviço","-","SINAPI",92777,"ARMAÇÃO DE PILAR OU VIGA DE UMA ESTRUTURA CONVENCIONAL DE CONCRETO ARMADO EM UMA EDIFICAÇÃO TÉRREA OU SOBRADO UTILIZANDO AÇO CA-50 DE 8,0 MM - MONTAGEM. AF_12/2015","KG",64,1,64,null,null,0,0,"Referência: AGETOP - 60304"]
["S",3,"S",0,3,5,1,0,0,0,0,"","Serviço","Serviço","-","SINAPI",92778,"ARMAÇÃO DE PILAR OU VIGA DE UMA ESTRUTURA CONVENCIONAL DE CONCRETO ARMADO EM UMA EDIFICAÇÃO TÉRREA OU SOBRADO UTILIZANDO AÇO CA-50 DE 10,0 MM - MONTAGEM. AF_12/2015","KG",165.46,1,165.46,null,null,0,0,"Referência: AGETOP - 60305"]
["S",3,"S",0,3,5,1,0,0,0,0,"","Serviço","Serviço","-","SINAPI",92775,"ARMAÇÃO DE PILAR OU VIGA DE UMA ESTRUTURA CONVENCIONAL DE CONCRETO ARMADO EM UMA EDIFICAÇÃO TÉRREA OU SOBRADO UTILIZANDO AÇO CA-60 DE 5,0 MM - MONTAGEM. AF_12/2015","KG",22.8,1,22.8,null,null,0,0,"Referência: AGETOP - 60314"]
[3,3,3,9,3,5,2,0,0,11,9,"","Nível 3","Nível 3","-",null,null,"VIGA DE COBERTURA","-",null,1,"-",null,null,0,0,""]
["S",3,"S",0,3,5,2,0,0,0,0,"","Serviço","Serviço","-","SINAPI",92464,"MONTAGEM E DESMONTAGEM DE FÔRMA DE VIGA, ESCORAMENTO METÁLICO, PÉ-DIREITO SIMPLES, EM CHAPA DE MADEIRA RESINADA, 8 UTILIZAÇÕES. AF_12/2015","M2",40.9,1,40.9,null,null,0,0,"Referência: AGETOP - 60209"]
["S",3,"S",0,3,5,2,0,0,0,0,"","Serviço","Serviço","-","SINAPI",94964,"CONCRETO FCK = 20MPA, TRAÇO 1:2,7:3 (CIMENTO/ AREIA MÉDIA/ BRITA 1)  - PREPARO MECÂNICO COM BETONEIRA 400 L. AF_07/2016","M3",2.4,1,2.4,null,null,0,0,""]
["S",3,"S",0,3,5,2,0,0,0,0,"","Serviço","Serviço","-","SINAPI",92873,"LANÇAMENTO COM USO DE BALDES, ADENSAMENTO E ACABAMENTO DE CONCRETO EM ESTRUTURAS. AF_12/2015","M3",2.4,1,2.4,null,null,0,0,"Referência: AGETOP - 60801"]
["S",3,"S",0,3,5,2,0,0,0,0,"","Serviço","Serviço","-","SINAPI",92776,"ARMAÇÃO DE PILAR OU VIGA DE UMA ESTRUTURA CONVENCIONAL DE CONCRETO ARMADO EM UMA EDIFICAÇÃO TÉRREA OU SOBRADO UTILIZANDO AÇO CA-50 DE 6,3 MM - MONTAGEM. AF_12/2015","KG",18,1,18,null,null,0,0,"Referência: AGETOP - 60303"]
["S",3,"S",0,3,5,2,0,0,0,0,"","Serviço","Serviço","-","SINAPI",92777,"ARMAÇÃO DE PILAR OU VIGA DE UMA ESTRUTURA CONVENCIONAL DE CONCRETO ARMADO EM UMA EDIFICAÇÃO TÉRREA OU SOBRADO UTILIZANDO AÇO CA-50 DE 8,0 MM - MONTAGEM. AF_12/2015","KG",35,1,35,null,null,0,0,"Referência: AGETOP - 60304"]
["S",3,"S",0,3,5,2,0,0,0,0,"","Serviço","Serviço","-","SINAPI",92778,"ARMAÇÃO DE PILAR OU VIGA DE UMA ESTRUTURA CONVENCIONAL DE CONCRETO ARMADO EM UMA EDIFICAÇÃO TÉRREA OU SOBRADO UTILIZANDO AÇO CA-50 DE 10,0 MM - MONTAGEM. AF_12/2015","KG",89,1,89,null,null,0,0,"Referência: AGETOP - 60305"]
["S",3,"S",0,3,5,2,0,0,0,0,"","Serviço","Serviço","-","SINAPI",92779,"ARMAÇÃO DE PILAR OU VIGA DE UMA ESTRUTURA CONVENCIONAL DE CONCRETO ARMADO EM UMA EDIFICAÇÃO TÉRREA OU SOBRADO UTILIZANDO AÇO CA-50 DE 12,5 MM - MONTAGEM. AF_12/2015","KG",24,1,24,null,null,0,0,""]
["S",3,"S",0,3,5,2,0,0,0,0,"","Serviço","Serviço","-","SINAPI",92775,"ARMAÇÃO DE PILAR OU VIGA DE UMA ESTRUTURA CONVENCIONAL DE CONCRETO ARMADO EM UMA EDIFICAÇÃO TÉRREA OU SOBRADO UTILIZANDO AÇO CA-60 DE 5,0 MM - MONTAGEM. AF_12/2015","KG",57,1,57,null,null,0,0,"Referência: AGETOP - 60314"]
[3,3,3,2,3,5,3,0,0,2,170,"","Nível 3","Nível 3","-",null,null,"LAJE","-",null,1,"-",null,null,0,0,""]
["S",3,"S",0,3,5,3,0,0,0,0,"","Serviço","Serviço","-","SINAPI","74202/1","LAJE PRE-MOLDADA P/FORRO, SOBRECARGA 100KG/M2, VAOS ATE 3,50M/E=8CM, C/LAJOTAS E CAP.C/CONC FCK=20MPA, 3CM, INTER-EIXO 38CM, C/ESCORAMENTO (REAPR.3X) E FERRAGEM NEGATIVA","M2",40.75,1,40.75,null,null,0,0,"Referência: AGETOP - 61101"]
[2,2,2,28,3,6,0,0,0,138,28,"","Nível 2","Nível 2","-",null,null,"INSTALAÇÕES ELÉTRICAS","-",null,1,"-",null,null,0,0,""]
["S",2,"S",0,3,6,0,0,0,0,0,"","Serviço","Serviço","-","AGETOP",70421,"BUCHA E ARRUELA METALICA DIAM. 3/4\"","PR    ",3,1,3,null,null,0,0,""]
["S",2,"S",0,3,6,0,0,0,0,0,"","Serviço","Serviço","-","SINAPI",92868,"CAIXA RETANGULAR 4\" X 2\" MÉDIA (1,30 M DO PISO), METÁLICA, INSTALADA EM PAREDE - FORNECIMENTO E INSTALAÇÃO. AF_12/2015","UN",26,1,26,null,null,0,0,"Referência: AGETOP - 70691"]
["S",2,"S",0,3,6,0,0,0,0,0,"","Serviço","Serviço","-","SINAPI",92866,"CAIXA SEXTAVADA 3\" X 3\", METÁLICA, INSTALADA EM LAJE - FORNECIMENTO E INSTALAÇÃO. AF_12/2015","UN",10,1,10,null,null,0,0,"Referência: AGETOP - 70680"]
["S",2,"S",0,3,6,0,0,0,0,0,"","Serviço","Serviço","-","SINAPI",91902,"CURVA 90 GRAUS PARA ELETRODUTO, PVC, ROSCÁVEL, DN 25 MM (3/4\"), PARA CIRCUITOS TERMINAIS, INSTALADA EM LAJE - FORNECIMENTO E INSTALAÇÃO. AF_12/2015","UN",6,1,6,null,null,0,0,"Referência: AGETOP - 71141"]
["S",2,"S",0,3,6,0,0,0,0,0,"","Serviço","Serviço","-","SINAPI",97585,"LUMINÁRIA TIPO CALHA, DE SOBREPOR, COM 2 LÂMPADAS TUBULARES FLUORESCENTES DE 18 W, COM REATOR DE PARTIDA RÁPIDA - FORNECIMENTO E INSTALAÇÃO. AF_02/2020","UN",2,1,2,null,null,0,0,""]
["S",2,"S",0,3,6,0,0,0,0,0,"","Serviço","Serviço","-","SINAPI",97586,"LUMINÁRIA TIPO CALHA, DE SOBREPOR, COM 2 LÂMPADAS TUBULARES FLUORESCENTES DE 36 W, COM REATOR DE PARTIDA RÁPIDA - FORNECIMENTO E INSTALAÇÃO. AF_02/2020","UN",14,1,14,null,null,0,0,""]
["S",2,"S",0,3,6,0,0,0,0,0,"","Serviço","Serviço","-","SINAPI",97584,"LUMINÁRIA TIPO CALHA, DE SOBREPOR, COM 1 LÂMPADA TUBULAR FLUORESCENTE DE 36 W, COM REATOR DE PARTIDA RÁPIDA - FORNECIMENTO E INSTALAÇÃO. AF_02/2020","UN",2,1,2,null,null,0,0,""]
["S",2,"S",0,3,6,0,0,0,0,0,"","Serviço","Serviço","-","SINAPI",91884,"LUVA PARA ELETRODUTO, PVC, ROSCÁVEL, DN 25 MM (3/4\"), PARA CIRCUITOS TERMINAIS, INSTALADA EM PAREDE - FORNECIMENTO E INSTALAÇÃO. AF_12/2015","UN",3,1,3,null,null,0,0,"Referência: AGETOP - 71741"]
["S",2,"S",0,3,6,0,0,0,0,0,"","Serviço","Serviço","-","SINAPI",91927,"CABO DE COBRE FLEXÍVEL ISOLADO, 2,5 MM², ANTI-CHAMA 0,6/1,0 KV, PARA CIRCUITOS TERMINAIS - FORNECIMENTO E INSTALAÇÃO. AF_12/2015","M",723.31000000000006,1,723.31000000000006,null,null,0,0,"Referência: AGETOP - 70581"]
["S",2,"S",0,3,6,0,0,0,0,0,"","Serviço","Serviço","-","SINAPI",91931,"CABO DE COBRE FLEXÍVEL ISOLADO, 6 MM², ANTI-CHAMA 0,6/1,0 KV, PARA CIRCUITOS TERMINAIS - FORNECIMENTO E INSTALAÇÃO. AF_12/2015","M",60.8,1,60.8,null,null,0,0,"Referência: AGETOP - 70583"]
["S",2,"S",0,3,6,0,0,0,0,0,"","Serviço","Serviço","-","SINAPI",93654,"DISJUNTOR MONOPOLAR TIPO DIN, CORRENTE NOMINAL DE 16A - FORNECIMENTO E INSTALAÇÃO. AF_04/2016","UN",11,1,11,null,null,0,0,""]
["S",2,"S",0,3,6,0,0,0,0,0,"","Serviço","Serviço","-","SINAPI",93656,"DISJUNTOR MONOPOLAR TIPO DIN, CORRENTE NOMINAL DE 25A - FORNECIMENTO E INSTALAÇÃO. AF_04/2016","UN",1,1,1,null,null,0,0,""]
["S",2,"S",0,3,6,0,0,0,0,0,"","Serviço","Serviço","-","SINAPI",93673,"DISJUNTOR TRIPOLAR TIPO DIN, CORRENTE NOMINAL DE 50A - FORNECIMENTO E INSTALAÇÃO. AF_04/2016","UN",1,1,1,null,null,0,0,"Referência: AGETOP - 71174"]
["S",2,"S",0,3,6,0,0,0,0,0,"","Serviço","Serviço","-","AGETOP",71456,"INTERRUPTOR DIFERENCIAL RESIDUAL (D.R.) TETRAPOLAR DE 40A-30mA","Un    ",1,1,1,null,null,0,0,""]
["S",2,"S",0,3,6,0,0,0,0,0,"","Serviço","Serviço","-","SINAPI",91844,"ELETRODUTO FLEXÍVEL CORRUGADO, PVC, DN 25 MM (3/4\"), PARA CIRCUITOS TERMINAIS, INSTALADO EM LAJE - FORNECIMENTO E INSTALAÇÃO. AF_12/2015","M",96.82,1,96.82,null,null,0,0,""]
["S",2,"S",0,3,6,0,0,0,0,0,"","Serviço","Serviço","-","SINAPI",91846,"ELETRODUTO FLEXÍVEL CORRUGADO, PVC, DN 32 MM (1\"), PARA CIRCUITOS TERMINAIS, INSTALADO EM LAJE - FORNECIMENTO E INSTALAÇÃO. AF_12/2015","M",10.1,1,10.1,null,null,0,0,""]
["S",2,"S",0,3,6,0,0,0,0,0,"","Serviço","Serviço","-","AGETOP",71197,"ELETRODUTO PVC FLEXÍVEL - MANGUEIRA CORRUGADA REFORÇADA - DIAM. 50MM","M     ",31.1,1,31.1,null,null,0,0,""]
["S",2,"S",0,3,6,0,0,0,0,0,"","Serviço","Serviço","-","COMPOSIÇÃO","COMP 387_SEE","LÂMPADA LED TUBULAR 18W ","UN ",29,1,29,null,null,0,0,""]
["S",2,"S",0,3,6,0,0,0,0,0,"","Serviço","Serviço","-","SINAPI",97611,"LÂMPADA COMPACTA FLUORESCENTE DE 15 W, BASE E27 - FORNECIMENTO E INSTALAÇÃO. AF_02/2020","UN",2,1,2,null,null,0,0,"Referência: AGETOP - 71567"]
["S",2,"S",0,3,6,0,0,0,0,0,"","Serviço","Serviço","-","SINAPI",92000,"TOMADA BAIXA DE EMBUTIR (1 MÓDULO), 2P+T 10 A, INCLUINDO SUPORTE E PLACA - FORNECIMENTO E INSTALAÇÃO. AF_12/2015","UN",3,1,3,null,null,0,0,"Referência: AGETOP - 72578"]
["S",2,"S",0,3,6,0,0,0,0,0,"","Serviço","Serviço","-","SINAPI",91996,"TOMADA MÉDIA DE EMBUTIR (1 MÓDULO), 2P+T 10 A, INCLUINDO SUPORTE E PLACA - FORNECIMENTO E INSTALAÇÃO. AF_12/2015","UN",14,1,14,null,null,0,0,"Referência: AGETOP - 72578"]
["S",2,"S",0,3,6,0,0,0,0,0,"","Serviço","Serviço","-","SINAPI",91992,"TOMADA ALTA DE EMBUTIR (1 MÓDULO), 2P+T 10 A, INCLUINDO SUPORTE E PLACA - FORNECIMENTO E INSTALAÇÃO. AF_12/2015","UN",1,1,1,null,null,0,0,""]
["S",2,"S",0,3,6,0,0,0,0,0,"","Serviço","Serviço","-","SINAPI",91955,"INTERRUPTOR PARALELO (1 MÓDULO), 10A/250V, INCLUINDO SUPORTE E PLACA - FORNECIMENTO E INSTALAÇÃO. AF_12/2015","UN",4,1,4,null,null,0,0,"Referência: AGETOP - 71431"]
["S",2,"S",0,3,6,0,0,0,0,0,"","Serviço","Serviço","-","SINAPI",91953,"INTERRUPTOR SIMPLES (1 MÓDULO), 10A/250V, INCLUINDO SUPORTE E PLACA - FORNECIMENTO E INSTALAÇÃO. AF_12/2015","UN",5,1,5,null,null,0,0,"Referência: AGETOP - 71440"]
["S",2,"S",0,3,6,0,0,0,0,0,"","Serviço","Serviço","-","SINAPI",91959,"INTERRUPTOR SIMPLES (2 MÓDULOS), 10A/250V, INCLUINDO SUPORTE E PLACA - FORNECIMENTO E INSTALAÇÃO. AF_12/2015","UN",1,1,1,null,null,0,0,"Referência: AGETOP - 71441"]
["S",2,"S",0,3,6,0,0,0,0,0,"","Serviço","Serviço","-","SINAPI",96986,"HASTE DE ATERRAMENTO 3/4  PARA SPDA - FORNECIMENTO E INSTALAÇÃO. AF_12/2017","UN",3,1,3,null,null,0,0,""]
["S",2,"S",0,3,6,0,0,0,0,0,"","Serviço","Serviço","-","SINAPI","74131/4","QUADRO DE DISTRIBUICAO DE ENERGIA DE EMBUTIR, EM CHAPA METALICA, PARA 18 DISJUNTORES TERMOMAGNETICOS MONOPOLARES, COM BARRAMENTO TRIFASICO E NEUTRO, FORNECIMENTO E INSTALACAO","UN",1,1,1,null,null,0,0,""]
[2,2,2,60,3,7,0,0,0,110,60,"","Nível 2","Nível 2","-",null,null,"INSTALAÇÕES HIDROSSANITÁRIAS","-",null,1,"-",null,null,0,0,""]
["S",2,"S",0,3,7,0,0,0,0,0,"","Serviço","Serviço","-","AGETOP",80502,"VASO SANITARIO","Un    ",1,1,1,null,null,0,0,""]
["S",2,"S",0,3,7,0,0,0,0,0,"","Serviço","Serviço","-","AGETOP",80510,"ANEL DE VEDAÇÃO PARA VASO SANITÁRIO","Un    ",1,1,1,null,null,0,0,""]
["S",2,"S",0,3,7,0,0,0,0,0,"","Serviço","Serviço","-","AGETOP",80513,"TUBO PARA VÁLVULA DE DESCARGA ( CURTO 1.1/4\" )","Un    ",1,1,1,null,null,0,0,""]
["S",2,"S",0,3,7,0,0,0,0,0,"","Serviço","Serviço","-","AGETOP",80514,"TUBO DE LIGACAO PVC CROMADO 1.1/2\" / ESPUDE  - (ENTRADA)","Un    ",1,1,1,null,null,0,0,""]
["S",2,"S",0,3,7,0,0,0,0,0,"","Serviço","Serviço","-","AGETOP",80517,"VÁLVULA DE DESCARGA DUPLO ACIONAMENTO COM ACABAMENTO CROMADO ANTIVANDALISMO","Un    ",1,1,1,null,null,0,0,""]
["S",2,"S",0,3,7,0,0,0,0,0,"","Serviço","Serviço","-","AGETOP",80520,"CONJUNTO DE FIXACAO P/VASO SANITARIO (PAR)","CJ    ",1,1,1,null,null,0,0,""]
["S",2,"S",0,3,7,0,0,0,0,0,"","Serviço","Serviço","-","AGETOP",80526,"ASSENTO EM POLIPROPILENO COM SISTEMA DE FECHAMENTO SUAVE PARA VASO SANITÁRIO","Un    ",1,1,1,null,null,0,0,""]
["S",2,"S",0,3,7,0,0,0,0,0,"","Serviço","Serviço","-","SINAPI",95544,"PAPELEIRA DE PAREDE EM METAL CROMADO SEM TAMPA, INCLUSO FIXAÇÃO. AF_01/2020","UN",1,1,1,null,null,0,0,""]
["S",2,"S",0,3,7,0,0,0,0,0,"","Serviço","Serviço","-","COMPOSIÇÃO","COMP 209_SEE","TOALHEIRO PLÁSTICO TIPO DISPENSER PARA PAPEL TOALHA INTERFOLHADO","UN ",1,1,1,null,null,0,0,""]
["S",2,"S",0,3,7,0,0,0,0,0,"","Serviço","Serviço","-","AGETOP",80542,"LAVATÓRIO MÉDIO SEM COLUNA","Un    ",2,1,2,null,null,0,0,""]
["S",2,"S",0,3,7,0,0,0,0,0,"","Serviço","Serviço","-","AGETOP",80550,"FIXACAO P/LAVATORIO (PAR)","PAR   ",2,1,2,null,null,0,0,""]
["S",2,"S",0,3,7,0,0,0,0,0,"","Serviço","Serviço","-","SINAPI",86885,"ENGATE FLEXÍVEL EM PLÁSTICO BRANCO, 1/2\u0094 X 40CM - FORNECIMENTO E INSTALAÇÃO. AF_01/2020","UN",2,1,2,null,null,0,0,""]
["S",2,"S",0,3,7,0,0,0,0,0,"","Serviço","Serviço","-","SINAPI",86883,"SIFÃO DO TIPO FLEXÍVEL EM PVC 1  X 1.1/2  - FORNECIMENTO E INSTALAÇÃO. AF_01/2020","UN",2,1,2,null,null,0,0,""]
["S",2,"S",0,3,7,0,0,0,0,0,"","Serviço","Serviço","-","SINAPI",86906,"TORNEIRA CROMADA DE MESA, 1/2\u0094 OU 3/4\u0094, PARA LAVATÓRIO, PADRÃO POPULAR - FORNECIMENTO E INSTALAÇÃO. AF_01/2020","UN",2,1,2,null,null,0,0,""]
["S",2,"S",0,3,7,0,0,0,0,0,"","Serviço","Serviço","-","AGETOP",80580,"VALVULA P/LAVATORIO OU BEBEDOURO METALICO DIAMETRO 1\"","Un    ",2,1,2,null,null,0,0,""]
["S",2,"S",0,3,7,0,0,0,0,0,"","Serviço","Serviço","-","SINAPI",86911,"TORNEIRA CROMADA LONGA, DE PAREDE, 1/2\u0094 OU 3/4\u0094, PARA PIA DE COZINHA, PADRÃO POPULAR - FORNECIMENTO E INSTALAÇÃO. AF_01/2020","UN",5,1,5,null,null,0,0,""]
["S",2,"S",0,3,7,0,0,0,0,0,"","Serviço","Serviço","-","AGETOP",80671,"SIFAO PVC P/PIA 1.1/2\" X 2\"","Un    ",5,1,5,null,null,0,0,""]
["S",2,"S",0,3,7,0,0,0,{"$f":"IF(OR($C148=\"S\",$C148=0),0,MATCH(0,OFFSET($D148,1,$C148,ROW($C$465)-ROW($C148)),0))","v":0},{"$f":"IF(OR($C148=\"S\",$C148=0),0,MATCH(OFFSET($D148,0,$C148)+1,OFFSET($D148,1,$C148,ROW($C$465)-ROW($C148)),0))","v":0},"","Serviço","Serviço","-","SINAPI",86878,"VÁLVULA EM METAL CROMADO TIPO AMERICANA 3.1/2\u0094 X 1.1/2\u0094 PARA PIA - FORNECIMENTO E INSTALAÇÃO. AF_01/2020","UN",5,1,5,null,null,0,0,""]
["S",2,"S",0,3,7,0,0,0,0,0,"","Serviço","Serviço","-","AGETOP",80687,"CUBA INOX 35X40X15CM E=0,6MM-AÇO 304 (CUBA Nº 3)","Un    ",4,1,4,null,null,0,0,""]
["S",2,"S",0,3,7,0,0,0,0,0,"","Serviço","Serviço","-","AGETOP",80693,"TANQUE (PANELAO) INOX 60 X 70 X 40 CM CH.18","Un    ",1,1,1,null,null,0,0,""]
["S",2,"S",0,3,7,0,0,0,0,0,"","Serviço","Serviço","-","AGETOP",80819,"SIFÃO METÁLICO PARA TANQUE DE 1 1/4\" X 1 1/2\"","un    ",1,1,1,null,null,0,0,""]
["S",2,"S",0,3,7,0,0,0,0,0,"","Serviço","Serviço","-","AGETOP",80830,"VALVULA P/TANQUE METALICA DIAM.1\" S/LADRAO","Un    ",1,1,1,null,null,0,0,""]
["S",2,"S",0,3,7,0,0,0,0,0,"","Serviço","Serviço","-","AGETOP",81846,"CAIXA DE GORDURA E INSPEÇÃO EM PVC/ABS 19 LITROS COM TAMPA E PORTA TAMPA E CESTO DE LIMPEZA REMOVÍVEL","un    ",1,1,1,null,null,0,0,""]
["S",2,"S",0,3,7,0,0,0,0,0,"","Serviço","Serviço","-","SINAPI",94495,"REGISTRO DE GAVETA BRUTO, LATÃO, ROSCÁVEL, 1\u0094, INSTALADO EM RESERVAÇÃO DE ÁGUA DE EDIFICAÇÃO QUE POSSUA RESERVATÓRIO DE FIBRA/FIBROCIMENTO \u0096 FORNECIMENTO E INSTALAÇÃO. AF_06/2016","UN",1,1,1,null,null,0,0,"Referência: AGETOP - 80903"]
["S",2,"S",0,3,7,0,0,0,0,0,"","Serviço","Serviço","-","SINAPI",89353,"REGISTRO DE GAVETA BRUTO, LATÃO, ROSCÁVEL, 3/4\", FORNECIDO E INSTALADO EM RAMAL DE ÁGUA. AF_12/2014","UN",4,1,4,null,null,0,0,"Referência: AGETOP - 80902"]
["S",2,"S",0,3,7,0,0,0,0,0,"","Serviço","Serviço","-","SINAPI",95141,"ADAPTADOR COM FLANGES LIVRES, PVC, SOLDÁVEL LONGO, DN  25 MM X 3/4 , INSTALADO EM RESERVAÇÃO DE ÁGUA DE EDIFICAÇÃO QUE POSSUA RESERVATÓRIO DE FIBRA/FIBROCIMENTO    FORNECIMENTO E INSTALAÇÃO. AF_06/2016","UN",14,1,14,null,null,0,0,""]
["S",2,"S",0,3,7,0,0,0,0,0,"","Serviço","Serviço","-","SINAPI",94785,"ADAPTADOR COM FLANGES LIVRES, PVC, SOLDÁVEL LONGO, DN 32 MM X 1 , INSTALADO EM RESERVAÇÃO DE ÁGUA DE EDIFICAÇÃO QUE POSSUA RESERVATÓRIO DE FIBRA/FIBROCIMENTO   FORNECIMENTO E INSTALAÇÃO. AF_06/2016","UN",2,1,2,null,null,0,0,""]
["S",2,"S",0,3,7,0,0,0,0,0,"","Serviço","Serviço","-","AGETOP",81504,"SOLUCAO LIMPADORA 1000 CM3","Un    ",5,1,5,null,null,0,0,""]
["S",2,"S",0,3,7,0,0,0,0,0,"","Serviço","Serviço","-","AGETOP",81663,"CORPO CX. SIFONADA DIAM. 150 X 150 X 50","Un    ",2,1,2,null,null,0,0,""]
["S",2,"S",0,3,7,0,0,0,0,0,"","Serviço","Serviço","-","SINAPI",89708,"CAIXA SIFONADA, PVC, DN 150 X 185 X 75 MM, JUNTA ELÁSTICA, FORNECIDA E INSTALADA EM RAMAL DE DESCARGA OU EM RAMAL DE ESGOTO SANITÁRIO. AF_12/2014","UN",2,1,2,null,null,0,0,""]
["S",2,"S",0,3,7,0,0,0,0,0,"","Serviço","Serviço","-","AGETOP",81771,"GRELHA QUADRADA BRANCA DIAM. 150 MM","Un    ",2,1,2,null,null,0,0,""]
["S",2,"S",0,3,7,0,0,0,0,0,"","Serviço","Serviço","-","AGETOP",81885,"TERMINAL DE VENTILACAO DIAMETRO 50 MM","Un    ",1,1,1,null,null,0,0,""]
["S",2,"S",0,3,7,0,0,0,0,0,"","Serviço","Serviço","-","AGETOP",81831,"CAIXA DE INSPEÇÃO - ALVENARIA DE 1/2 VEZ COM REVESTIMENTO INTERNO EM REBOCO PAULISTA A-14 (COM ADIÇÃO DE IMPERMEABILIZANTE)","m2    ",3,1,3,null,null,0,0,""]
["S",2,"S",0,3,7,0,0,0,0,0,"","Serviço","Serviço","-","AGETOP",81825,"CAIXA DE PASSAGEM 60 X 60 CM SEM TAMPA","Un    ",5,1,5,null,null,0,0,""]
["S",2,"S",0,3,7,0,0,0,0,0,"","Serviço","Serviço","-","AGETOP",81826,"TAMPA EM CONCRETO ARMADO 25 MPA E=5CM PARA A CAIXA DE PASSAGEM 60X60CM","Un    ",5,1,5,null,null,0,0,""]
["S",2,"S",0,3,7,0,0,0,0,0,"","Serviço","Serviço","-","SINAPI",89402,"TUBO, PVC, SOLDÁVEL, DN 25MM, INSTALADO EM RAMAL DE DISTRIBUIÇÃO DE ÁGUA - FORNECIMENTO E INSTALAÇÃO. AF_12/2014","M",25,1,25,null,null,0,0,"Referência: AGETOP - 81003"]
["S",2,"S",0,3,7,0,0,0,0,0,"","Serviço","Serviço","-","SINAPI",89403,"TUBO, PVC, SOLDÁVEL, DN 32MM, INSTALADO EM RAMAL DE DISTRIBUIÇÃO DE ÁGUA - FORNECIMENTO E INSTALAÇÃO. AF_12/2014","M",20,1,20,null,null,0,0,"Referência: AGETOP - 81004"]
["S",2,"S",0,3,7,0,0,0,0,0,"","Serviço","Serviço","-","SINAPI",89617,"TE, PVC, SOLDÁVEL, DN 25MM, INSTALADO EM PRUMADA DE ÁGUA - FORNECIMENTO E INSTALAÇÃO. AF_12/2014","UN",3,1,3,null,null,0,0,""]
["S",2,"S",0,3,7,0,0,0,0,0,"","Serviço","Serviço","-","SINAPI",89620,"TE, PVC, SOLDÁVEL, DN 32MM, INSTALADO EM PRUMADA DE ÁGUA - FORNECIMENTO E INSTALAÇÃO. AF_12/2014","UN",3,1,3,null,null,0,0,"Referência: AGETOP - 81403"]
["S",2,"S",0,3,7,0,0,0,0,0,"","Serviço","Serviço","-","SINAPI",89622,"TÊ DE REDUÇÃO, PVC, SOLDÁVEL, DN 32MM X 25MM, INSTALADO EM PRUMADA DE ÁGUA - FORNECIMENTO E INSTALAÇÃO. AF_12/2014","UN",2,1,2,null,null,0,0,"Referência: AGETOP - 81421"]
["S",2,"S",0,3,7,0,0,0,0,0,"","Serviço","Serviço","-","SINAPI",89802,"JOELHO 45 GRAUS, PVC, SERIE NORMAL, ESGOTO PREDIAL, DN 50 MM, JUNTA ELÁSTICA, FORNECIDO E INSTALADO EM PRUMADA DE ESGOTO SANITÁRIO OU VENTILAÇÃO. AF_12/2014","UN",7,1,7,null,null,0,0,""]
["S",2,"S",0,3,7,0,0,0,0,0,"","Serviço","Serviço","-","SINAPI",89724,"JOELHO 90 GRAUS, PVC, SERIE NORMAL, ESGOTO PREDIAL, DN 40 MM, JUNTA SOLDÁVEL, FORNECIDO E INSTALADO EM RAMAL DE DESCARGA OU RAMAL DE ESGOTO SANITÁRIO. AF_12/2014","UN",12,1,12,null,null,0,0,""]
["S",2,"S",0,3,7,0,0,0,0,0,"","Serviço","Serviço","-","SINAPI",89731,"JOELHO 90 GRAUS, PVC, SERIE NORMAL, ESGOTO PREDIAL, DN 50 MM, JUNTA ELÁSTICA, FORNECIDO E INSTALADO EM RAMAL DE DESCARGA OU RAMAL DE ESGOTO SANITÁRIO. AF_12/2014","UN",3,1,3,null,null,0,0,""]
["S",{"$f":"IF(OR(C174=\"s\",C174=0),OFFSET(B174,-1,0),C174)","v":2},{"$f":"IF(OFFSET(C174,-1,0)=\"L\",1,IF(OFFSET(C174,-1,0)=1,2,IF(OR(A174=\"s\",A174=0),\"S\",IF(AND(OFFSET(C174,-1,0)=2,A174=4),3,IF(AND(OR(OFFSET(C174,-1,0)=\"s\",OFFSET(C174,-1,0)=0),A174<>\"s\",A174>OFFSET(B174,-1,0)),OFFSET(B174,-1,0),A174)))))","v":"S"},{"$f":"IF(OR(C174=\"S\",C174=0),0,IF(ISERROR(K174),J174,SMALL(J174:K174,1)))","v":0},{"$f":"IF($C174=1,OFFSET(E174,-1,0)+1,OFFSET(E174,-1,0))","v":3},{"$f":"IF($C174=1,0,IF($C174=2,OFFSET(F174,-1,0)+1,OFFSET(F174,-1,0)))","v":7},{"$f":"IF(AND($C174<=2,$C174<>0),0,IF($C174=3,OFFSET(G174,-1,0)+1,OFFSET(G174,-1,0)))","v":0},{"$f":"IF(AND($C174<=3,$C174<>0),0,IF($C174=4,OFFSET(H174,-1,0)+1,OFFSET(H174,-1,0)))","v":0},{"$f":"IF(AND($C174<=4,$C174<>0),0,IF(AND($C174=\"S\",$Y174>0),OFFSET(I174,-1,0)+1,OFFSET(I174,-1,0)))","v":0},0,0,"","Serviço","Serviço","-","AGETOP",81973,"JUNCAO SIMPLES DIAM. 100 X 50 MM","Un    ",1,1,1,null,null,0,0,""]
["S",2,"S",0,3,7,0,0,0,0,0,"","Serviço","Serviço","-","SINAPI",89834,"JUNÇÃO SIMPLES, PVC, SERIE NORMAL, ESGOTO PREDIAL, DN 100 X 100 MM, JUNTA ELÁSTICA, FORNECIDO E INSTALADO EM PRUMADA DE ESGOTO SANITÁRIO OU VENTILAÇÃO. AF_12/2014","UN",1,1,1,null,null,0,0,""]
["S",2,"S",0,3,7,0,0,0,0,0,"","Serviço","Serviço","-","AGETOP",81981,"JUNÇÃO DUPLA DIAMETRO 75 MM","Un    ",1,1,1,null,null,0,0,""]
["S",2,"S",0,3,7,0,0,0,0,0,"","Serviço","Serviço","-","SINAPI",89753,"LUVA SIMPLES, PVC, SERIE NORMAL, ESGOTO PREDIAL, DN 50 MM, JUNTA ELÁSTICA, FORNECIDO E INSTALADO EM RAMAL DE DESCARGA OU RAMAL DE ESGOTO SANITÁRIO. AF_12/2014","UN",8,1,8,null,null,0,0,"Referência: AGETOP - 82002"]
["S",2,"S",0,3,7,0,0,0,0,0,"","Serviço","Serviço","-","SINAPI",89778,"LUVA SIMPLES, PVC, SERIE NORMAL, ESGOTO PREDIAL, DN 100 MM, JUNTA ELÁSTICA, FORNECIDO E INSTALADO EM RAMAL DE DESCARGA OU RAMAL DE ESGOTO SANITÁRIO. AF_12/2014","UN",2,1,2,null,null,0,0,"Referência: AGETOP - 82004"]
["S",2,"S",0,3,7,0,0,0,0,0,"","Serviço","Serviço","-","AGETOP",82051,"PORTA GRELHA QUADRADA BRANCO DIAM. 150 MM","Un    ",2,1,2,null,null,0,0,""]
["S",2,"S",0,3,7,0,0,0,0,0,"","Serviço","Serviço","-","AGETOP",82103,"REDUCAO EXCENTRICA 100 X 50 MM","Un    ",1,1,1,null,null,0,0,""]
["S",2,"S",0,3,7,0,0,0,0,0,"","Serviço","Serviço","-","AGETOP",82233,"TE SANITARIO DIAMETRO 100 X 50 MM","Un    ",1,1,1,null,null,0,0,""]
["S",2,"S",0,3,7,0,0,0,0,0,"","Serviço","Serviço","-","SINAPI",89711,"TUBO PVC, SERIE NORMAL, ESGOTO PREDIAL, DN 40 MM, FORNECIDO E INSTALADO EM RAMAL DE DESCARGA OU RAMAL DE ESGOTO SANITÁRIO. AF_12/2014","M",14,1,14,null,null,0,0,"Referência: AGETOP - 82301"]
["S",2,"S",0,3,7,0,0,0,0,0,"","Serviço","Serviço","-","SINAPI",89712,"TUBO PVC, SERIE NORMAL, ESGOTO PREDIAL, DN 50 MM, FORNECIDO E INSTALADO EM RAMAL DE DESCARGA OU RAMAL DE ESGOTO SANITÁRIO. AF_12/2014","M",26,1,26,null,null,0,0,"Referência: AGETOP - 82302"]
["S",2,"S",0,3,7,0,0,0,0,0,"","Serviço","Serviço","-","AGETOP",82374,"TUBO FERRO GALVANIZADO DIAM.3/4\"","m     ",10,1,10,null,null,0,0,""]
["S",2,"S",0,3,7,0,0,0,0,0,"","Serviço","Serviço","-","SINAPI",83635,"EXTINTOR INCENDIO TP PO QUIMICO 6KG - FORNECIMENTO E INSTALACAO","UN",1,1,1,null,null,0,0,""]
["S",2,"S",0,3,7,0,0,0,0,0,"","Serviço","Serviço","-","SINAPI",96702,"BUCHA DE REDUÇÃO, PPR, 32 X 25, CLASSE PN 25, INSTALADO EM PRUMADA DE ÁGUA \u0096 FORNECIMENTO E INSTALAÇÃO . AF_06/2015","UN",25,1,25,null,null,0,0,""]
["S",2,"S",0,3,7,0,0,0,0,0,"","Serviço","Serviço","-","SINAPI",94672,"JOELHO 90 GRAUS COM BUCHA DE LATÃO, PVC, SOLDÁVEL, DN  25 MM, X 3/4\u0094 INSTALADO EM RESERVAÇÃO DE ÁGUA DE EDIFICAÇÃO QUE POSSUA RESERVATÓRIO DE FIBRA/FIBROCIMENTO   FORNECIMENTO E INSTALAÇÃO. AF_06/2016","UN",6,1,6,null,null,0,0,""]
["S",2,"S",0,3,7,0,0,0,0,0,"","Serviço","Serviço","-","SINAPI",89362,"JOELHO 90 GRAUS, PVC, SOLDÁVEL, DN 25MM, INSTALADO EM RAMAL OU SUB-RAMAL DE ÁGUA - FORNECIMENTO E INSTALAÇÃO. AF_12/2014","UN",6,1,6,null,null,0,0,"Referência: AGETOP - 81321"]
["S",2,"S",0,3,7,0,0,0,0,0,"","Serviço","Serviço","-","SINAPI",89546,"BUCHA DE REDUÇÃO LONGA, PVC, SERIE R, ÁGUA PLUVIAL, DN 50 X 40 MM, JUNTA ELÁSTICA, FORNECIDO E INSTALADO EM RAMAL DE ENCAMINHAMENTO. AF_12/2014","UN",6,1,6,null,null,0,0,""]
[2,2,2,5,3,8,0,0,0,50,5,"","Nível 2","Nível 2","-","AGETOP",91045,"ALVENARIAS E DIVISÓRIAS","Un    ",null,1,"-",null,null,0,0,""]
["S",2,"S",0,3,8,0,0,0,0,0,"","Serviço","Serviço","-","SINAPI","73937/1","COBOGO DE CONCRETO (ELEMENTO VAZADO), 7X50X50CM, ASSENTADO COM ARGAMASSA TRACO 1:4 (CIMENTO E AREIA)","M2",16.3,1,16.3,null,null,0,0,"Referência: AGETOP - 100501"]
["S",2,"S",0,3,8,0,0,0,0,0,"","Serviço","Serviço","-","SINAPI",72132,"ALVENARIA EM TIJOLO CERAMICO MACICO 5X10X20CM 1/2 VEZ (ESPESSURA 10CM), ASSENTADO COM ARGAMASSA TRACO 1:2:8 (CIMENTO, CAL E AREIA)","M2",17.11,1,17.11,null,null,0,0,""]
["S",2,"S",0,3,8,0,0,0,0,0,"","Serviço","Serviço","-","SINAPI",87489,"ALVENARIA DE VEDAÇÃO DE BLOCOS CERÂMICOS FURADOS NA VERTICAL DE 9X19X39CM (ESPESSURA 9CM) DE PAREDES COM ÁREA LÍQUIDA MAIOR OU IGUAL A 6M² COM VÃOS E ARGAMASSA DE ASSENTAMENTO COM PREPARO EM BETONEIRA. AF_06/2014","M2",142.08000000000001,1,142.08000000000001,null,null,0,0,""]
["S",2,"S",0,3,8,0,0,0,0,0,"","Serviço","Serviço","-","SINAPI",93202,"FIXAÇÃO (ENCUNHAMENTO) DE ALVENARIA DE VEDAÇÃO COM TIJOLO MACIÇO. AF_03/2016","M",27,1,27,null,null,0,0,"Referência: AGETOP - 100204"]
[2,2,2,2,3,9,0,0,0,45,2,"","Nível 2","Nível 2","-",null,null,"IMPERMEABILIZAÇÃO","-",null,1,"-",null,null,0,0,""]
["S",2,"S",0,3,9,0,0,0,0,0,"","Serviço","Serviço","-","SINAPI",98562,"IMPERMEABILIZAÇÃO DE FLOREIRA OU VIGA BALDRAME COM ARGAMASSA DE CIMENTO E AREIA, COM ADITIVO IMPERMEABILIZANTE, E = 2 CM. AF_06/2018","M2",43.03,1,43.03,null,null,0,0,"Referência: AGETOP - 120902"]
[2,2,2,2,3,10,0,0,0,43,2,"","Nível 2","Nível 2","-",null,null,"ESTRUTURAS METÁLICAS","-",null,1,"-",null,null,0,0,""]
["S",2,"S",0,3,10,0,0,0,0,0,"","Serviço","Serviço","-","AGETOP",150103,"ESTRUTURA METÁLICA CONVENCIONAL EM AÇO DO TIPO USI SAC-300 COM FUNDO ANTICORROSIVO","Kg    ",1956.5,1,1956.5,null,null,0,0,""]
[{"$f":"CHOOSE(1+LOG(1+2*(ORÇAMENTO.Nivel=\"Nível 1\")+4*(ORÇAMENTO.Nivel=\"Nível 2\")+8*(ORÇAMENTO.Nivel=\"Nível 3\")+16*(ORÇAMENTO.Nivel=\"Nível 4\")+32*(ORÇAMENTO.Nivel=\"Serviço\"),2),0,1,2,3,4,\"S\")","v":2},2,2,6,3,11,0,0,0,41,6,"","Nível 2","Nível 2","-",null,null,"COBERTURAS","-",null,1,"-",null,null,0,0,""]
[3,3,3,5,3,11,1,0,0,5,22,"","Nível 3","Nível 3","-",null,null,"CERÂMICA","-",null,1,"-",null,null,0,0,""]
["S",3,"S",0,3,11,1,0,0,0,0,"","Serviço","Serviço","-","SINAPI",94445,"TELHAMENTO COM TELHA CERÂMICA CAPA-CANAL, TIPO PLAN, COM ATÉ 2 ÁGUAS, INCLUSO TRANSPORTE VERTICAL. AF_07/2019","M2",182.07,1,182.07,null,null,0,0,"Referência: AGETOP - 160401"]
["S",3,"S",0,3,11,1,0,0,0,0,"","Serviço","Serviço","-","SINAPI",94221,"CUMEEIRA PARA TELHA CERÂMICA EMBOÇADA COM ARGAMASSA TRAÇO 1:2:9 (CIMENTO, CAL E AREIA) PARA TELHADOS COM ATÉ 2 ÁGUAS, INCLUSO TRANSPORTE VERTICAL. AF_07/2019","M",17.68,1,17.68,null,null,0,0,""]
["S",3,"S",0,3,11,1,0,0,0,0,"","Serviço","Serviço","-","SINAPI",94224,"EMBOÇAMENTO COM ARGAMASSA TRAÇO 1:2:9 (CIMENTO, CAL E AREIA). AF_07/2019","M",20.399999999999999,1,20.399999999999999,null,null,0,0,"Referência: AGETOP - 160403"]
["S",3,"S",0,3,11,1,0,0,0,0,"","Serviço","Serviço","-","SINAPI",94224,"EMBOÇAMENTO COM ARGAMASSA TRAÇO 1:2:9 (CIMENTO, CAL E AREIA). AF_07/2019","M",35.36,1,35.36,null,null,0,0,"Referência: AGETOP - 160403"]
[2,2,2,5,3,12,0,0,0,35,5,"","Nível 2","Nível 2","-",null,null,"ESQUADRIAS METÁLICAS","-",null,1,"-",null,null,0,0,""]
["S",2,"S",0,3,12,0,0,0,0,0,"","Serviço","Serviço","-","SINAPI",94570,"JANELA DE ALUMÍNIO DE CORRER COM 2 FOLHAS PARA VIDROS, COM VIDROS, BATENTE, ACABAMENTO COM ACETATO OU BRILHANTE E FERRAGENS. EXCLUSIVE ALIZAR E CONTRAMARCO. FORNECIMENTO E INSTALAÇÃO. AF_12/2019","M2",5.52,1,5.52,null,null,0,0,""]
["S",2,"S",0,3,12,0,0,0,0,0,"","Serviço","Serviço","-","AGETOP",180303,"PORTA DE ENROLAR C/FERRAGENS","m2    ",5.74,1,5.74,null,null,0,0,""]
["S",2,"S",0,3,12,0,0,0,0,0,"","Serviço","Serviço","-","AGETOP",180501,"PORTA DE ABRIR EM CHAPA PF-1 C/FERRAGENS","m2    ",8.64,1,8.64,null,null,0,0,""]
["S",2,"S",0,3,12,0,0,0,0,0,"","Serviço","Serviço","-","AGETOP",180307,"PORTAO /CHAPA TRAPEZ / TUBO DE ACO PT-5 C/FERRAGEM","m2    ",4,1,4,null,null,0,0,""]
[2,2,2,2,3,13,0,0,0,30,2,"","Nível 2","Nível 2","-",null,null,"VIDROS","-",null,1,"-",null,null,0,0,""]
["S",2,"S",0,3,13,0,0,0,0,0,"","Serviço","Serviço","-","SINAPI",72117,"VIDRO LISO COMUM TRANSPARENTE, ESPESSURA 4MM","M2",5.52,1,5.52,null,null,0,0,"Referência: AGETOP - 190102"]
[2,2,2,4,3,14,0,0,0,{"$f":"IF(OR($C212=\"S\",$C212=0),0,MATCH(0,OFFSET($D212,1,$C212,ROW($C$465)-ROW($C212)),0))","v":28},{"$f":"IF(OR($C212=\"S\",$C212=0),0,MATCH(OFFSET($D212,0,$C212)+1,OFFSET($D212,1,$C212,ROW($C$465)-ROW($C212)),0))","v":4},"","Nível 2","Nível 2","-",null,null,"REVESTIMENTO DE PAREDE","-",null,1,"-",null,null,0,0,""]
["S",2,"S",0,3,14,0,0,0,0,0,"","Serviço","Serviço","-","SINAPI",87553,"EMBOÇO, PARA RECEBIMENTO DE CERÂMICA, EM ARGAMASSA TRAÇO 1:2:8, PREPARO MECÂNICO COM BETONEIRA 400L, APLICADO MANUALMENTE EM FACES INTERNAS DE PAREDES, PARA AMBIENTE COM ÁREA MAIOR QUE 10M2, ESPESSURA DE 10MM, COM EXECUÇÃO DE TALISCAS. AF_06/2014","M2",186.65,1,186.65,null,null,0,0,""]
["S",2,"S",0,3,14,0,0,0,0,0,"","Serviço","Serviço","-","SINAPI",87904,"CHAPISCO APLICADO EM ALVENARIA (COM PRESENÇA DE VÃOS) E ESTRUTURAS DE CONCRETO DE FACHADA, COM COLHER DE PEDREIRO.  ARGAMASSA TRAÇO 1:3 COM PREPARO MANUAL. AF_06/2014","M2",284.16000000000003,1,284.16000000000003,null,null,0,0,"Referência: AGETOP - 200101"]
["S",2,"S",0,3,14,0,0,0,0,0,"","Serviço","Serviço","-","SINAPI",87273,"REVESTIMENTO CERÂMICO PARA PAREDES INTERNAS COM PLACAS TIPO ESMALTADA EXTRA DE DIMENSÕES 33X45 CM APLICADAS EM AMBIENTES DE ÁREA MAIOR QUE 5 M² NA ALTURA INTEIRA DAS PAREDES. AF_06/2014","M2",127.57,1,127.57,null,null,0,0,""]
[2,2,2,3,3,15,0,0,0,24,3,"","Nível 2","Nível 2","-",null,null,"FORROS","-",null,1,"-",null,null,0,0,""]
["S",2,"S",0,3,15,0,0,0,0,0,"","Serviço","Serviço","-","SINAPI",87884,"CHAPISCO APLICADO NO TETO, COM ROLO PARA TEXTURA ACRÍLICA. ARGAMASSA INDUSTRIALIZADA COM PREPARO MANUAL. AF_06/2014","M2",40.75,1,40.75,null,null,0,0,"Referência: AGETOP - 210102"]
["S",2,"S",0,3,15,0,0,0,0,0,"","Serviço","Serviço","-","SINAPI",90408,"MASSA ÚNICA, PARA RECEBIMENTO DE PINTURA, EM ARGAMASSA TRAÇO 1:2:8, PREPARO MECÂNICO COM BETONEIRA 400L, APLICADA MANUALMENTE EM TETO, ESPESSURA DE 10MM, COM EXECUÇÃO DE TALISCAS. AF_03/2015","M2",40.75,1,40.75,null,null,0,0,"Referência: AGETOP - 210401"]
[2,2,2,8,3,16,0,0,0,21,8,"","Nível 2","Nível 2","-",null,null,"REVESTIMENTO DE PISO","-",null,1,"-",null,null,0,0,""]
[3,3,3,2,3,16,1,0,0,7,2,"","Nível 3","Nível 3","-",null,null,"LASTRO","-",null,1,"-",null,null,0,0,""]
["S",3,"S",0,3,16,1,0,0,0,0,"","Serviço","Serviço","-","AGETOP",220101,"LASTRO DE CONCRETO REGULARIZADO IMPERMEABILIZADO 1:3:6 ESP=5CM (BASE)","m2    ",139.75,1,139.75,null,null,0,0,""]
[3,3,3,3,3,16,2,0,0,5,3,"","Nível 3","Nível 3","-",null,null,"GRANITINA","-",null,1,"-",null,null,0,0,""]
["S",3,"S",0,3,16,2,0,0,0,0,"","Serviço","Serviço","-","SINAPI",84191,"PISO EM GRANILITE, MARMORITE OU GRANITINA ESPESSURA 8 MM, INCLUSO JUNTAS DE DILATACAO PLASTICAS","M2",144.74,1,144.74,null,null,0,0,"Referência: AGETOP - 221101"]
["S",3,"S",0,3,16,2,0,0,0,0,"","Serviço","Serviço","-","AGETOP",221104,"RASPAGEM E APLICAÇÃO RESINA ACRÍLICA DUAS DEMÃOS","m2    ",144.74,1,144.74,null,null,0,0,""]
[3,3,3,2,3,16,3,0,0,2,45,"","Nível 3","Nível 3","-",null,null,"PASSEIO (CALÇADA)","-",null,1,"-",null,null,0,0,""]
["S",3,"S",0,3,16,3,0,0,0,0,"","Serviço","Serviço","-","AGETOP",220100,"PASSEIO PROTECAO EM CONC.DESEMPEN.5 CM 1:2,5:3,5 ( INCLUSO ESPELHO DE 30CM/ESCAVAÇÃO/REATERRO/APILOAMENTO/ATERRO INTERNO)","m2    ",35.04,1,35.04,null,null,0,0,""]
[2,2,2,2,3,17,0,0,0,13,2,"","Nível 2","Nível 2","-",null,null,"MARCENARIA","-",null,1,"-",null,null,0,0,""]
["S",2,"S",0,3,17,0,0,0,0,0,"","Serviço","Serviço","-","AGETOP",240209,"PRATELEIRA EST.CAIBRO 4+1 TABUAS APARELHADAS E ENVERNIZADAS","m     ",3.2,1,3.2,null,null,0,0,""]
[2,2,2,8,3,18,0,0,0,11,8,"","Nível 2","Nível 2","-",null,null,"PINTURA","-",null,1,"-",null,null,0,0,""]
[3,3,3,7,3,18,1,0,0,7,29,"","Nível 3","Nível 3","-",null,null,"ESMALTE SINTÉTICO","-",null,1,"-",null,null,0,0,""]
["S",3,"S",0,3,18,1,0,0,0,0,"","Serviço","Serviço","-","SINAPI",88497,"APLICAÇÃO E LIXAMENTO DE MASSA LÁTEX EM PAREDES, DUAS DEMÃOS. AF_06/2014","M2",128,1,128,null,null,0,0,"Referência: AGETOP - 261300"]
["S",3,"S",0,3,18,1,0,0,0,0,"","Serviço","Serviço","-","SINAPI",88486,"APLICAÇÃO MANUAL DE PINTURA COM TINTA LÁTEX PVA EM TETO, DUAS DEMÃOS. AF_06/2014","M2",40.75,1,40.75,null,null,0,0,"Referência: AGETOP - 261307"]
["S",3,"S",0,3,18,1,0,0,0,0,"","Serviço","Serviço","-","AGETOP",261550,"PINT.ESMALTE SINT.PAREDES - 2 DEM.C/SELADOR","m2    ",87.25,1,87.25,null,null,0,0,""]
["S",3,"S",0,3,18,1,0,0,0,0,"","Serviço","Serviço","-","SINAPI",88489,"APLICAÇÃO MANUAL DE PINTURA COM TINTA LÁTEX ACRÍLICA EM PAREDES, DUAS DEMÃOS. AF_06/2014","M2",87.25,1,87.25,null,null,0,0,"Referência: AGETOP - 261001"]
["S",3,"S",0,3,18,1,0,0,0,0,"","Serviço","Serviço","-","AGETOP",261602,"PINT.ESMALTE/ESQUAD.FERRO C/FUNDO ANTICOR.","m2    ",66.180000000000007,1,66.180000000000007,null,null,0,0,""]
["S",3,"S",0,3,18,1,0,0,0,0,"","Serviço","Serviço","-","AGETOP",261609,"PINTURA ESMALTE ALQUIDICO ESTR.METALICA 2 DEMAOS","m2    ",139.75,1,139.75,null,null,0,0,""]
[2,2,2,3,3,19,0,0,0,3,{"$error":"#N/A"},"","Nível 2","Nível 2","-",null,null,"DIVERSOS","-",null,1,"-",null,null,0,0,""]
["S",{"$f":"IF(OR(C238=\"s\",C238=0),OFFSET(B238,-1,0),C238)","v":2},{"$f":"IF(OFFSET(C238,-1,0)=\"L\",1,IF(OFFSET(C238,-1,0)=1,2,IF(OR(A238=\"s\",A238=0),\"S\",IF(AND(OFFSET(C238,-1,0)=2,A238=4),3,IF(AND(OR(OFFSET(C238,-1,0)=\"s\",OFFSET(C238,-1,0)=0),A238<>\"s\",A238>OFFSET(B238,-1,0)),OFFSET(B238,-1,0),A238)))))","v":"S"},{"$f":"IF(OR(C238=\"S\",C238=0),0,IF(ISERROR(K238),J238,SMALL(J238:K238,1)))","v":0},{"$f":"IF($C238=1,OFFSET(E238,-1,0)+1,OFFSET(E238,-1,0))","v":3},{"$f":"IF($C238=1,0,IF($C238=2,OFFSET(F238,-1,0)+1,OFFSET(F238,-1,0)))","v":19},{"$f":"IF(AND($C238<=2,$C238<>0),0,IF($C238=3,OFFSET(G238,-1,0)+1,OFFSET(G238,-1,0)))","v":0},{"$f":"IF(AND($C238<=3,$C238<>0),0,IF($C238=4,OFFSET(H238,-1,0)+1,OFFSET(H238,-1,0)))","v":0},{"$f":"IF(AND($C238<=4,$C238<>0),0,IF(AND($C238=\"S\",$Y238>0),OFFSET(I238,-1,0)+1,OFFSET(I238,-1,0)))","v":0},0,0,"","Serviço","Serviço","-","AGETOP",270501,"LIMPEZA FINAL DE OBRA - (OBRAS CIVIS)","m2    ",139.75,1,139.75,null,null,0,0,""]
["S",2,"S",0,3,19,0,0,0,0,0,"","Serviço","Serviço","-","AGETOP",271608,"BANCADA DE GRANITO C/ESPELHO","m2    ",6.83,1,6.83,null,null,0,0,""]
[1,1,1,36,4,0,0,0,0,225,36,"F","Nível 1","Nível 1","4.","SINAPI",null,"PROJETO DE FUNDAÇÕES E ESTRUTURA","UN",1,1,1,null,null,0,0,""]
[2,2,2,7,4,1,0,0,0,35,7,"","Nível 2","Nível 2","-","SINAPI",null,"FUNDAÇÕES E SONDAGENS","-",null,1,"-",null,null,0,0,""]
[3,3,3,6,4,1,1,0,0,6,17,"","Nível 3","Nível 3","-","SINAPI",null,"ESTACAS E ARRANQUES DA RAMPA E ESCADA","-",null,1,"-",null,null,0,0,""]
["S",3,"S",0,4,1,1,0,0,0,0,"","Serviço","Serviço","-","SINAPI",98228,"ESTACA BROCA DE CONCRETO, DIÃMETRO DE 20 CM, PROFUNDIDADE DE ATÉ 3 M, ESCAVAÇÃO MANUAL COM TRADO CONCHA, NÃO ARMADA. AF_03/2018","M",12,1,12,null,null,0,0,""]
["S",3,"S",0,4,1,1,0,0,0,0,"","Serviço","Serviço","-","SINAPI",98230,"ESTACA BROCA DE CONCRETO, DIÂMETRO DE 30 CM, PROFUNDIDADE DE ATÉ 3 M, ESCAVAÇÃO MANUAL COM TRADO CONCHA, NÃO ARMADA. AF_03/2018","M",5.5,1,5.5,null,null,0,0,"Referência: AGETOP - 50302"]
["S",3,"S",0,4,1,1,0,0,0,0,"","Serviço","Serviço","-","SINAPI",95576,"MONTAGEM DE ARMADURA LONGITUDINAL/TRANSVERSAL DE ESTACAS DE SEÇÃO CIRCULAR, DIÂMETRO = 8,0 MM. AF_11/2016","KG",2.88,1,2.88,null,null,0,0,"Referência: AGETOP - 52004"]
["S",3,"S",0,4,1,1,0,0,0,0,"","Serviço","Serviço","-","SINAPI",95577,"MONTAGEM DE ARMADURA LONGITUDINAL DE ESTACAS DE SEÇÃO CIRCULAR, DIÂMETRO = 10,0 MM. AF_11/2016","KG",39.82,1,39.82,null,null,0,0,"Referência: AGETOP - 52005"]
["S",3,"S",0,4,1,1,0,0,0,0,"","Serviço","Serviço","-","SINAPI",95583,"MONTAGEM DE ARMADURA TRANSVERSAL DE ESTACAS DE SEÇÃO CIRCULAR, DIÂMETRO = 5,0 MM. AF_11/2016","KG",8.8000000000000007,1,8.8000000000000007,null,null,0,0,"Referência: AGETOP - 52014"]
[2,2,2,28,4,2,0,0,0,28,73,"","Nível 2","Nível 2","-","SINAPI",null,"ESTRUTURA","-",null,1,"-",null,null,0,0,""]
[3,3,3,10,4,2,1,0,0,27,10,"","Nível 3","Nível 3","-","SINAPI",null,"VIGAS DA RAMPA/ESCADA","-",null,1,"-",null,null,0,0,""]
["S",3,"S",0,4,2,1,0,0,0,0,"","Serviço","Serviço","-","SINAPI",96527,"ESCAVAÇÃO MANUAL DE VALA PARA VIGA BALDRAME, COM PREVISÃO DE FÔRMA. AF_06/2017","M3",4.1500000000000004,1,4.1500000000000004,null,null,0,0,"Referência: AGETOP - 40101"]
["S",3,"S",0,4,2,1,0,0,0,0,"","Serviço","Serviço","-","AGETOP",60191,"FORMA DE TABUA CINTA BALDRAME U=8 VEZES","m2    ",12.36,1,12.36,null,null,0,0,""]
["S",3,"S",0,4,2,1,0,0,0,0,"","Serviço","Serviço","-","AGETOP",41002,"APILOAMENTO","m2    ",16.57,1,16.57,null,null,0,0,""]
["S",3,"S",0,4,2,1,0,0,0,0,"","Serviço","Serviço","-","SINAPI",94963,"CONCRETO FCK = 15MPA, TRAÇO 1:3,4:3,5 (CIMENTO/ AREIA MÉDIA/ BRITA 1)  - PREPARO MECÂNICO COM BETONEIRA 400 L. AF_07/2016","M3",1.45,1,1.45,null,null,0,0,""]
["S",3,"S",0,4,2,1,0,0,0,0,"","Serviço","Serviço","-","AGETOP",51055,"LANÇAMENTO/APLICAÇÃO/ADENSAMENTO MANUAL DE CONCRETO - (O.C.)","m3    ",1.45,1,1.45,null,null,0,0,""]
["S",3,"S",0,4,2,1,0,0,0,0,"","Serviço","Serviço","-","SINAPI",96995,"REATERRO MANUAL APILOADO COM SOQUETE. AF_10/2017","M3",2.7,1,2.7,null,null,0,0,"Referência: AGETOP - 40902"]
["S",3,"S",0,4,2,1,0,0,0,0,"","Serviço","Serviço","-","SINAPI",96545,"ARMAÇÃO DE BLOCO, VIGA BALDRAME OU SAPATA UTILIZANDO AÇO CA-50 DE 8 MM - MONTAGEM. AF_06/2017","KG",75.03,1,75.03,null,null,0,0,"Referência: AGETOP - 52004"]
["S",3,"S",0,4,2,1,0,0,0,0,"","Serviço","Serviço","-","SINAPI",96543,"ARMAÇÃO DE BLOCO, VIGA BALDRAME E SAPATA UTILIZANDO AÇO CA-60 DE 5 MM - MONTAGEM. AF_06/2017","KG",56.76,1,56.76,null,null,0,0,"Referência: AGETOP - 52014"]
["S",3,"S",0,4,2,1,0,0,0,0,"","Serviço","Serviço","-","AGETOP",120902,"IMPERMEABILIZACAO VIGAS BALDRAMES E=2,0 CM","m2    ",29.4,1,29.4,null,null,0,0,""]
[3,3,3,6,4,2,2,0,0,17,6,"","Nível 3","Nível 3","-","SINAPI",null,"ESCADA","-",null,1,"-",null,null,0,0,""]
["S",3,"S",0,4,2,2,0,0,0,0,"","Serviço","Serviço","-","SINAPI",92426,"MONTAGEM E DESMONTAGEM DE FÔRMA DE PILARES RETANGULARES E ESTRUTURAS SIMILARES COM ÁREA MÉDIA DAS SEÇÕES MENOR OU IGUAL A 0,25 M², PÉ-DIREITO SIMPLES, EM CHAPA DE MADEIRA COMPENSADA RESINADA, 8 UTILIZAÇÕES. AF_12/2015","M2",2.04,1,2.04,null,null,0,0,""]
["S",3,"S",0,4,2,2,0,0,0,0,"","Serviço","Serviço","-","SINAPI",94963,"CONCRETO FCK = 15MPA, TRAÇO 1:3,4:3,5 (CIMENTO/ AREIA MÉDIA/ BRITA 1)  - PREPARO MECÂNICO COM BETONEIRA 400 L. AF_07/2016","M3",0.21,1,0.21,null,null,0,0,""]
["S",3,"S",0,4,2,2,0,0,0,0,"","Serviço","Serviço","-","AGETOP",51055,"LANÇAMENTO/APLICAÇÃO/ADENSAMENTO MANUAL DE CONCRETO - (O.C.)","m3    ",0.21,1,0.21,null,null,0,0,""]
[{"$f":"CHOOSE(1+LOG(1+2*(ORÇAMENTO.Nivel=\"Nível 1\")+4*(ORÇAMENTO.Nivel=\"Nível 2\")+8*(ORÇAMENTO.Nivel=\"Nível 3\")+16*(ORÇAMENTO.Nivel=\"Nível 4\")+32*(ORÇAMENTO.Nivel=\"Serviço\"),2),0,1,2,3,4,\"S\")","v":"S"},3,"S",0,4,2,2,0,0,0,0,"","Serviço","Serviço","-","SINAPI",92777,"ARMAÇÃO DE PILAR OU VIGA DE UMA ESTRUTURA CONVENCIONAL DE CONCRETO ARMADO EM UMA EDIFICAÇÃO TÉRREA OU SOBRADO UTILIZANDO AÇO CA-50 DE 8,0 MM - MONTAGEM. AF_12/2015","KG",19.16,1,19.16,null,null,0,0,"Referência: AGETOP - 60304"]
["S",3,"S",0,4,2,2,0,0,0,0,"","Serviço","Serviço","-","SINAPI",92776,"ARMAÇÃO DE PILAR OU VIGA DE UMA ESTRUTURA CONVENCIONAL DE CONCRETO ARMADO EM UMA EDIFICAÇÃO TÉRREA OU SOBRADO UTILIZANDO AÇO CA-50 DE 6,3 MM - MONTAGEM. AF_12/2015","KG",5.63,1,5.63,null,null,0,0,"Referência: AGETOP - 60303"]
[3,3,3,5,4,2,3,0,0,11,5,"","Nível 3","Nível 3","-","SINAPI",null,"PISO DA RAMPA","-",null,1,"-",null,null,0,0,""]
["S",3,"S",0,4,2,3,0,0,0,0,"","Serviço","Serviço","-","AGETOP",40902,"REATERRO COM APILOAMENTO","m3    ",12.46,1,12.46,null,null,0,0,""]
["S",3,"S",0,4,2,3,0,0,0,0,"","Serviço","Serviço","-","SINAPI",95241,"LASTRO DE CONCRETO MAGRO, APLICADO EM PISOS OU RADIERS, ESPESSURA DE 5 CM. AF_07/2016","M2",23.53,1,23.53,null,null,0,0,""]
["S",3,"S",0,4,2,3,0,0,0,0,"","Serviço","Serviço","-","SINAPI",89456,"ALVENARIA DE BLOCOS DE CONCRETO ESTRUTURAL 14X19X39 CM, (ESPESSURA 14 CM) FBK = 14,0 MPA, PARA PAREDES COM ÁREA LÍQUIDA MAIOR OU IGUAL A 6M², SEM VÃOS, UTILIZANDO PALHETA. AF_12/2014","M2",13.47,1,13.47,null,null,0,0,""]
["S",3,"S",0,4,2,3,0,0,0,0,"","Serviço","Serviço","-","SINAPI",92775,"ARMAÇÃO DE PILAR OU VIGA DE UMA ESTRUTURA CONVENCIONAL DE CONCRETO ARMADO EM UMA EDIFICAÇÃO TÉRREA OU SOBRADO UTILIZANDO AÇO CA-60 DE 5,0 MM - MONTAGEM. AF_12/2015","KG",57.69,1,57.69,null,null,0,0,"Referência: AGETOP - 60314"]
[3,3,3,6,4,2,4,0,0,6,83,"","Nível 3","Nível 3","-","SINAPI",null,"PILARES DA RAMPA","-",null,1,"-",null,null,0,0,""]
["S",3,"S",0,4,2,4,0,0,0,0,"","Serviço","Serviço","-","SINAPI",92426,"MONTAGEM E DESMONTAGEM DE FÔRMA DE PILARES RETANGULARES E ESTRUTURAS SIMILARES COM ÁREA MÉDIA DAS SEÇÕES MENOR OU IGUAL A 0,25 M², PÉ-DIREITO SIMPLES, EM CHAPA DE MADEIRA COMPENSADA RESINADA, 8 UTILIZAÇÕES. AF_12/2015","M2",3.56,1,3.56,null,null,0,0,""]
["S",3,"S",0,4,2,4,0,0,0,0,"","Serviço","Serviço","-","SINAPI",94964,"CONCRETO FCK = 20MPA, TRAÇO 1:2,7:3 (CIMENTO/ AREIA MÉDIA/ BRITA 1)  - PREPARO MECÂNICO COM BETONEIRA 400 L. AF_07/2016","M3",0.15,1,0.15,null,null,0,0,""]
["S",3,"S",0,4,2,4,0,0,0,0,"","Serviço","Serviço","-","SINAPI",92873,"LANÇAMENTO COM USO DE BALDES, ADENSAMENTO E ACABAMENTO DE CONCRETO EM ESTRUTURAS. AF_12/2015","M3",0.15,1,0.15,null,null,0,0,"Referência: AGETOP - 60801"]
["S",3,"S",0,4,2,4,0,0,0,0,"","Serviço","Serviço","-","SINAPI",92778,"ARMAÇÃO DE PILAR OU VIGA DE UMA ESTRUTURA CONVENCIONAL DE CONCRETO ARMADO EM UMA EDIFICAÇÃO TÉRREA OU SOBRADO UTILIZANDO AÇO CA-50 DE 10,0 MM - MONTAGEM. AF_12/2015","KG",13.86,1,13.86,null,null,0,0,"Referência: AGETOP - 60305"]
["S",3,"S",0,4,2,4,0,0,0,0,"","Serviço","Serviço","-","SINAPI",92775,"ARMAÇÃO DE PILAR OU VIGA DE UMA ESTRUTURA CONVENCIONAL DE CONCRETO ARMADO EM UMA EDIFICAÇÃO TÉRREA OU SOBRADO UTILIZANDO AÇO CA-60 DE 5,0 MM - MONTAGEM. AF_12/2015","KG",5.44,1,5.44,null,null,0,0,"Referência: AGETOP - 60314"]
[1,1,1,48,5,0,0,0,0,{"$f":"IF(OR($C276=\"S\",$C276=0),0,MATCH(0,OFFSET($D276,1,$C276,ROW($C$465)-ROW($C276)),0))","v":189},{"$f":"IF(OR($C276=\"S\",$C276=0),0,MATCH(OFFSET($D276,0,$C276)+1,OFFSET($D276,1,$C276,ROW($C$465)-ROW($C276)),0))","v":48},"F","Nível 1","Nível 1","5.","SINAPI",null,"INST. ELÉTRICAS","UN",1,1,1,null,null,0,0,""]
[2,2,2,3,5,1,0,0,0,47,3,"","Nível 2","Nível 2","-","SINAPI",null,"SERVIÇO EM TERRA","-",null,1,"-",null,null,0,0,""]
["S",2,"S",0,5,1,0,0,0,0,0,"","Serviço","Serviço","-","SINAPI",93358,"ESCAVAÇÃO MANUAL DE VALA COM PROFUNDIDADE MENOR OU IGUAL A 1,30 M. AF_03/2016","M3",9,1,9,null,null,0,0,"Referência: AGETOP - 40101"]
["S",2,"S",0,5,1,0,0,0,0,0,"","Serviço","Serviço","-","SINAPI",96995,"REATERRO MANUAL APILOADO COM SOQUETE. AF_10/2017","M3",9,1,9,null,null,0,0,"Referência: AGETOP - 40902"]
[2,2,2,41,5,2,0,0,0,44,41,"","Nível 2","Nível 2","-",null,null,"INSTALAÇÕES ELÉTRICAS","-",null,1,"-",null,null,0,0,""]
[3,3,3,19,5,2,1,0,0,40,19,"","Nível 3","Nível 3","-","SINAPI",null,"REFORMA","-",null,1,"-",null,null,0,0,""]
[{"$f":"CHOOSE(1+LOG(1+2*(ORÇAMENTO.Nivel=\"Nível 1\")+4*(ORÇAMENTO.Nivel=\"Nível 2\")+8*(ORÇAMENTO.Nivel=\"Nível 3\")+16*(ORÇAMENTO.Nivel=\"Nível 4\")+32*(ORÇAMENTO.Nivel=\"Serviço\"),2),0,1,2,3,4,\"S\")","v":"S"},{"$f":"IF(OR(C282=\"s\",C282=0),OFFSET(B282,-1,0),C282)","v":3},{"$f":"IF(OFFSET(C282,-1,0)=\"L\",1,IF(OFFSET(C282,-1,0)=1,2,IF(OR(A282=\"s\",A282=0),\"S\",IF(AND(OFFSET(C282,-1,0)=2,A282=4),3,IF(AND(OR(OFFSET(C282,-1,0)=\"s\",OFFSET(C282,-1,0)=0),A282<>\"s\",A282>OFFSET(B282,-1,0)),OFFSET(B282,-1,0),A282)))))","v":"S"},{"$f":"IF(OR(C282=\"S\",C282=0),0,IF(ISERROR(K282),J282,SMALL(J282:K282,1)))","v":0},{"$f":"IF($C282=1,OFFSET(E282,-1,0)+1,OFFSET(E282,-1,0))","v":5},{"$f":"IF($C282=1,0,IF($C282=2,OFFSET(F282,-1,0)+1,OFFSET(F282,-1,0)))","v":2},{"$f":"IF(AND($C282<=2,$C282<>0),0,IF($C282=3,OFFSET(G282,-1,0)+1,OFFSET(G282,-1,0)))","v":1},{"$f":"IF(AND($C282<=3,$C282<>0),0,IF($C282=4,OFFSET(H282,-1,0)+1,OFFSET(H282,-1,0)))","v":0},{"$f":"IF(AND($C282<=4,$C282<>0),0,IF(AND($C282=\"S\",$Y282>0),OFFSET(I282,-1,0)+1,OFFSET(I282,-1,0)))","v":0},0,0,"","Serviço","Serviço","-","AGETOP",70352,"BRACADEIRA METALICA TIPO \"U\" DIAM. 1\"","Un    ",14,1,14,null,null,0,0,""]
["S",3,"S",0,5,2,1,0,0,0,0,"","Serviço","Serviço","-","AGETOP",70354,"BRACADEIRA METALICA TIPO \"U\" DIAM. 1.1/2\"","Un    ",72,1,72,null,null,0,0,""]
["S",3,"S",0,5,2,1,0,0,0,0,"","Serviço","Serviço","-","AGETOP",70422,"BUCHA E ARRUELA METALICA DIAM. 1\"","PR    ",28,1,28,null,null,0,0,""]
["S",3,"S",0,5,2,1,0,0,0,0,"","Serviço","Serviço","-","AGETOP",70424,"BUCHA E ARRUELA METALICA DIAM. 1.1/2\"","PR    ",144,1,144,null,null,0,0,""]
["S",3,"S",0,5,2,1,0,0,0,0,"","Serviço","Serviço","-","AGETOP",71861,"PARAFUSO P/BUCHA S-6","Un    ",172,1,172,null,null,0,0,""]
["S",3,"S",0,5,2,1,0,0,0,0,"","Serviço","Serviço","-","SINAPI",91931,"CABO DE COBRE FLEXÍVEL ISOLADO, 6 MM², ANTI-CHAMA 0,6/1,0 KV, PARA CIRCUITOS TERMINAIS - FORNECIMENTO E INSTALAÇÃO. AF_12/2015","M",350,1,350,null,null,0,0,"Referência: AGETOP - 70583"]
["S",3,"S",0,5,2,1,0,0,0,0,"","Serviço","Serviço","-","SINAPI",92980,"CABO DE COBRE FLEXÍVEL ISOLADO, 10 MM², ANTI-CHAMA 0,6/1,0 KV, PARA DISTRIBUIÇÃO - FORNECIMENTO E INSTALAÇÃO. AF_12/2015","M",400,1,400,null,null,0,0,""]
["S",3,"S",0,5,2,1,0,0,0,0,"","Serviço","Serviço","-","AGETOP",70645,"CAIXA DE PASSAGEM METÁLICA DE EMBUTIR 15X15X8 CM","Un    ",5,1,5,null,null,0,0,""]
["S",3,"S",0,5,2,1,0,0,0,0,"","Serviço","Serviço","-","SINAPI",93671,"DISJUNTOR TRIPOLAR TIPO DIN, CORRENTE NOMINAL DE 32A - FORNECIMENTO E INSTALAÇÃO. AF_04/2016","UN",1,1,1,null,null,0,0,"Referência: AGETOP - 71173"]
["S",3,"S",0,5,2,1,0,0,0,0,"","Serviço","Serviço","-","AGETOP",71184,"DISPOSITIVO DE PROTEÇÃO CONTRA SURTOS (D.P.S.) 275V DE 8 A 40KA","Un    ",4,1,4,null,null,0,0,""]
["S",3,"S",0,5,2,1,0,0,0,0,"","Serviço","Serviço","-","SINAPI",91857,"ELETRODUTO FLEXÍVEL CORRUGADO REFORÇADO, PVC, DN 32 MM (1\"), PARA CIRCUITOS TERMINAIS, INSTALADO EM PAREDE - FORNECIMENTO E INSTALAÇÃO. AF_12/2015","M",60,1,60,null,null,0,0,""]
["S",3,"S",0,5,2,1,0,0,0,0,"","Serviço","Serviço","-","SINAPI",91872,"ELETRODUTO RÍGIDO ROSCÁVEL, PVC, DN 32 MM (1\"), PARA CIRCUITOS TERMINAIS, INSTALADO EM PAREDE - FORNECIMENTO E INSTALAÇÃO. AF_12/2015","M",10,1,10,null,null,0,0,"Referência: AGETOP - 71202"]
["S",3,"S",0,5,2,1,0,0,0,0,"","Serviço","Serviço","-","SINAPI",91893,"CURVA 90 GRAUS PARA ELETRODUTO, PVC, ROSCÁVEL, DN 32 MM (1\"), PARA CIRCUITOS TERMINAIS, INSTALADA EM FORRO - FORNECIMENTO E INSTALAÇÃO. AF_12/2015","UN",1,1,1,null,null,0,0,""]
["S",3,"S",0,5,2,1,0,0,0,0,"","Serviço","Serviço","-","SINAPI",93018,"CURVA 90 GRAUS PARA ELETRODUTO, PVC, ROSCÁVEL, DN 50 MM (1 1/2\") - FORNECIMENTO E INSTALAÇÃO. AF_12/2015","UN",4,1,4,null,null,0,0,""]
["S",3,"S",0,5,2,1,0,0,0,0,"","Serviço","Serviço","-","SINAPI",93008,"ELETRODUTO RÍGIDO ROSCÁVEL, PVC, DN 50 MM (1 1/2\") - FORNECIMENTO E INSTALAÇÃO. AF_12/2015","M",60,1,60,null,null,0,0,""]
["S",3,"S",0,5,2,1,0,0,0,0,"","Serviço","Serviço","-","SINAPI",97667,"ELETRODUTO FLEXÍVEL CORRUGADO, PEAD, DN 50 (1 ½\u0094)  - FORNECIMENTO E INSTALAÇÃO. AF_04/2016","M",20,1,20,null,null,0,0,""]
["S",3,"S",0,5,2,1,0,0,0,0,"","Serviço","Serviço","-","AGETOP",71321,"FITA DE AUTO FUSAO, ROLO E 10,00 MM","Un    ",2,1,2,null,null,0,0,""]
["S",3,"S",0,5,2,1,0,0,0,0,"","Serviço","Serviço","-","AGETOP",71331,"FITA ISOLANTE, ROLO DE 20,00 M","Un    ",10,1,10,null,null,0,0,""]
[3,3,3,9,5,2,2,0,0,21,9,"","Nível 3","Nível 3","-","SINAPI",null,"DETECÇÃO E ALARME","-",null,1,"-",null,null,0,0,""]
["S",3,"S",0,5,2,2,0,0,0,0,"","Serviço","Serviço","-","SINAPI",91871,"ELETRODUTO RÍGIDO ROSCÁVEL, PVC, DN 25 MM (3/4\"), PARA CIRCUITOS TERMINAIS, INSTALADO EM PAREDE - FORNECIMENTO E INSTALAÇÃO. AF_12/2015","M",170,1,170,null,null,0,0,"Referência: AGETOP - 71201"]
["S",3,"S",0,5,2,2,0,0,0,0,"","Serviço","Serviço","-","SINAPI",91855,"ELETRODUTO FLEXÍVEL CORRUGADO REFORÇADO, PVC, DN 25 MM (3/4\"), PARA CIRCUITOS TERMINAIS, INSTALADO EM PAREDE - FORNECIMENTO E INSTALAÇÃO. AF_12/2015","M",70,1,70,null,null,0,0,""]
["S",3,"S",0,5,2,2,0,0,0,0,"","Serviço","Serviço","-","AGETOP",70351,"BRACADEIRA METALICA TIPO \"U\" DIAM. 3/4\"","Un    ",210,1,210,null,null,0,0,""]
["S",3,"S",0,5,2,2,0,0,0,0,"","Serviço","Serviço","-","AGETOP",70421,"BUCHA E ARRUELA METALICA DIAM. 3/4\"","PR    ",420,1,420,null,null,0,0,""]
["S",3,"S",0,5,2,2,0,0,0,0,"","Serviço","Serviço","-","AGETOP",71861,"PARAFUSO P/BUCHA S-6","Un    ",420,1,420,null,null,0,0,""]
["S",3,"S",0,5,2,2,0,0,0,0,"","Serviço","Serviço","-","AGETOP",70924,"CONDULETE DE PVC - CAIXA COM 5 ENTRADAS ","un    ",26,1,26,null,null,0,0,""]
["S",3,"S",0,5,2,2,0,0,0,0,"","Serviço","Serviço","-","AGETOP",72385,"TAMPA CEGA PARA CONDULETE DE PVC","Un    ",26,1,26,null,null,0,0,""]
["S",3,"S",0,5,2,2,0,0,0,0,"","Serviço","Serviço","-","AGETOP",70556,"CABO FLEXIVEL PARALELO 2 X 2,5 MM2","M     ",270,1,270,null,null,0,0,""]
[3,3,3,12,5,2,3,0,0,12,39,"","Nível 3","Nível 3","-","SINAPI",null,"SISTEMA DE ILUMINAÇÃO DE EMERGÊNCIA","-",null,1,"-",null,null,0,0,""]
["S",3,"S",0,5,2,3,0,0,0,0,"","Serviço","Serviço","-","SINAPI",91871,"ELETRODUTO RÍGIDO ROSCÁVEL, PVC, DN 25 MM (3/4\"), PARA CIRCUITOS TERMINAIS, INSTALADO EM PAREDE - FORNECIMENTO E INSTALAÇÃO. AF_12/2015","M",330,1,330,null,null,0,0,"Referência: AGETOP - 71201"]
["S",3,"S",0,5,2,3,0,0,0,0,"","Serviço","Serviço","-","SINAPI",91855,"ELETRODUTO FLEXÍVEL CORRUGADO REFORÇADO, PVC, DN 25 MM (3/4\"), PARA CIRCUITOS TERMINAIS, INSTALADO EM PAREDE - FORNECIMENTO E INSTALAÇÃO. AF_12/2015","M",25,1,25,null,null,0,0,""]
["S",3,"S",0,5,2,3,0,0,0,0,"","Serviço","Serviço","-","AGETOP",70924,"CONDULETE DE PVC - CAIXA COM 5 ENTRADAS ","un    ",30,1,30,null,null,0,0,""]
["S",3,"S",0,5,2,3,0,0,0,0,"","Serviço","Serviço","-","SINAPI",91914,"CURVA 90 GRAUS PARA ELETRODUTO, PVC, ROSCÁVEL, DN 25 MM (3/4\"), PARA CIRCUITOS TERMINAIS, INSTALADA EM PAREDE - FORNECIMENTO E INSTALAÇÃO. AF_12/2015","UN",12,1,12,null,null,0,0,""]
["S",3,"S",0,5,2,3,0,0,0,0,"","Serviço","Serviço","-","AGETOP",70351,"BRACADEIRA METALICA TIPO \"U\" DIAM. 3/4\"","Un    ",420,1,420,null,null,0,0,""]
["S",3,"S",0,5,2,3,0,0,0,0,"","Serviço","Serviço","-","AGETOP",70421,"BUCHA E ARRUELA METALICA DIAM. 3/4\"","PR    ",840,1,840,null,null,0,0,""]
["S",3,"S",0,5,2,3,0,0,0,0,"","Serviço","Serviço","-","AGETOP",71861,"PARAFUSO P/BUCHA S-6","Un    ",840,1,840,null,null,0,0,""]
["S",3,"S",0,5,2,3,0,0,0,0,"","Serviço","Serviço","-","AGETOP",72441,"TAMPA PARA CONDULETE DE PVC PARA 1 TOMADA","un    ",21,1,21,null,null,0,0,""]
["S",3,"S",0,5,2,3,0,0,0,0,"","Serviço","Serviço","-","AGETOP",72385,"TAMPA CEGA PARA CONDULETE DE PVC","Un    ",9,1,9,null,null,0,0,""]
["S",3,"S",0,5,2,3,0,0,0,0,"","Serviço","Serviço","-","SINAPI",91926,"CABO DE COBRE FLEXÍVEL ISOLADO, 2,5 MM², ANTI-CHAMA 450/750 V, PARA CIRCUITOS TERMINAIS - FORNECIMENTO E INSTALAÇÃO. AF_12/2015","M",1100,1,1100,null,null,0,0,"Referência: AGETOP - 70563"]
["S",3,"S",0,5,2,3,0,0,0,0,"","Serviço","Serviço","-","SINAPI",93654,"DISJUNTOR MONOPOLAR TIPO DIN, CORRENTE NOMINAL DE 16A - FORNECIMENTO E INSTALAÇÃO. AF_04/2016","UN",4,1,4,null,null,0,0,""]
[2,2,2,3,5,3,0,0,0,3,85,"","Nível 2","Nível 2","-",null,null,"REVESTIMENTO DE PISO","-",null,1,"-",null,null,0,0,""]
["S",2,"S",0,5,3,0,0,0,0,0,"","Serviço","Serviço","-","SINAPI",94992,"EXECUÇÃO DE PASSEIO (CALÇADA) OU PISO DE CONCRETO COM CONCRETO MOLDADO IN LOCO, FEITO EM OBRA, ACABAMENTO CONVENCIONAL, ESPESSURA 6 CM, ARMADO. AF_07/2016","M2",5,1,5,null,null,0,0,""]
["S",2,"S",0,5,3,0,0,0,0,0,"","Serviço","Serviço","-","SINAPI",68325,"PISO EM CONCRETO 20 MPA PREPARO MECANICO, ESPESSURA 7CM, INCLUSO SELANTE ELASTICO A BASE DE POLIURETANO","M2",5,1,5,null,null,0,0,""]
[1,1,1,84,6,0,0,0,0,141,84,"F","Nível 1","Nível 1","6.","SINAPI",null,"INST. HIDROSSANITÁRIAS E COMBATE À INCÊNDIO","UN",1,1,1,null,null,0,0,""]
[2,2,2,2,6,1,0,0,0,83,2,"","Nível 2","Nível 2","-","SINAPI",null,"SERVIÇOS PRELIMINARES","-",null,1,"-",null,null,0,0,""]
["S",2,"S",0,6,1,0,0,0,0,0,"","Serviço","Serviço","-","AGETOP",20121,"DEM. MANUAL EM CONCR.SIMPLES C/TR.ATE CB.E CARGA (O.C.)","m3    ",0.11,1,0.11,null,null,0,0,""]
[2,2,2,3,6,2,0,0,0,81,3,"","Nível 2","Nível 2","-","SINAPI",null,"SERVIÇO EM TERRA","-",null,1,"-",null,null,0,0,""]
["S",2,"S",0,6,2,0,0,0,0,0,"","Serviço","Serviço","-","AGETOP",40101,"ESCAVACAO MANUAL DE VALAS < 1 MTS. (OBRAS CIVIS)","m3    ",28.36,1,28.36,null,null,0,0,""]
["S",2,"S",0,6,2,0,0,0,0,0,"","Serviço","Serviço","-","AGETOP",40902,"REATERRO COM APILOAMENTO","m3    ",28.36,1,28.36,null,null,0,0,""]
[2,2,2,76,6,3,0,0,0,78,76,"","Nível 2","Nível 2","-","SINAPI",null,"INSTALAÇÕES HIDROSSANITÁRIAS","-",null,1,"-",null,null,0,0,""]
[{"$f":"CHOOSE(1+LOG(1+2*(ORÇAMENTO.Nivel=\"Nível 1\")+4*(ORÇAMENTO.Nivel=\"Nível 2\")+8*(ORÇAMENTO.Nivel=\"Nível 3\")+16*(ORÇAMENTO.Nivel=\"Nível 4\")+32*(ORÇAMENTO.Nivel=\"Serviço\"),2),0,1,2,3,4,\"S\")","v":3},{"$f":"IF(OR(C331=\"s\",C331=0),OFFSET(B331,-1,0),C331)","v":3},{"$f":"IF(OFFSET(C331,-1,0)=\"L\",1,IF(OFFSET(C331,-1,0)=1,2,IF(OR(A331=\"s\",A331=0),\"S\",IF(AND(OFFSET(C331,-1,0)=2,A331=4),3,IF(AND(OR(OFFSET(C331,-1,0)=\"s\",OFFSET(C331,-1,0)=0),A331<>\"s\",A331>OFFSET(B331,-1,0)),OFFSET(B331,-1,0),A331)))))","v":3},{"$f":"IF(OR(C331=\"S\",C331=0),0,IF(ISERROR(K331),J331,SMALL(J331:K331,1)))","v":3},{"$f":"IF($C331=1,OFFSET(E331,-1,0)+1,OFFSET(E331,-1,0))","v":6},{"$f":"IF($C331=1,0,IF($C331=2,OFFSET(F331,-1,0)+1,OFFSET(F331,-1,0)))","v":3},{"$f":"IF(AND($C331<=2,$C331<>0),0,IF($C331=3,OFFSET(G331,-1,0)+1,OFFSET(G331,-1,0)))","v":1},{"$f":"IF(AND($C331<=3,$C331<>0),0,IF($C331=4,OFFSET(H331,-1,0)+1,OFFSET(H331,-1,0)))","v":0},{"$f":"IF(AND($C331<=4,$C331<>0),0,IF(AND($C331=\"S\",$Y331>0),OFFSET(I331,-1,0)+1,OFFSET(I331,-1,0)))","v":0},75,3,"","Nível 3","Nível 3","-","SINAPI",null,"PEÇAS E ACESSÓRIOS","-",null,1,"-",null,null,0,0,""]
[4,4,4,2,6,3,1,1,0,2,5,"","Nível 4","Nível 4","-","SINAPI",null,"REGISTROS","-",null,1,"-",null,null,0,0,""]
["S",4,"S",0,6,3,1,1,0,0,0,"","Serviço","Serviço","-","AGETOP",80905,"REGISTRO DE GAVETA BRUTO DIAMETRO 1.1/2\"","Un    ",1,1,1,null,null,0,0,""]
[3,3,3,11,6,3,2,0,0,72,11,"","Nível 3","Nível 3","-","SINAPI",null,"ÁGUA FRIA","-",null,1,"-",null,null,0,0,""]
[4,4,4,2,6,3,2,1,0,10,2,"","Nível 4","Nível 4","-","SINAPI",null,"TUBOS DE PVC SOLDÁVEL","-",null,1,"-",null,null,0,0,""]
["S",4,"S",0,6,3,2,1,0,0,0,"","Serviço","Serviço","-","SINAPI",89449,"TUBO, PVC, SOLDÁVEL, DN 50MM, INSTALADO EM PRUMADA DE ÁGUA - FORNECIMENTO E INSTALAÇÃO. AF_12/2014","M",24,1,24,null,null,0,0,""]
[{"$f":"CHOOSE(1+LOG(1+2*(ORÇAMENTO.Nivel=\"Nível 1\")+4*(ORÇAMENTO.Nivel=\"Nível 2\")+8*(ORÇAMENTO.Nivel=\"Nível 3\")+16*(ORÇAMENTO.Nivel=\"Nível 4\")+32*(ORÇAMENTO.Nivel=\"Serviço\"),2),0,1,2,3,4,\"S\")","v":4},{"$f":"IF(OR(C337=\"s\",C337=0),OFFSET(B337,-1,0),C337)","v":4},{"$f":"IF(OFFSET(C337,-1,0)=\"L\",1,IF(OFFSET(C337,-1,0)=1,2,IF(OR(A337=\"s\",A337=0),\"S\",IF(AND(OFFSET(C337,-1,0)=2,A337=4),3,IF(AND(OR(OFFSET(C337,-1,0)=\"s\",OFFSET(C337,-1,0)=0),A337<>\"s\",A337>OFFSET(B337,-1,0)),OFFSET(B337,-1,0),A337)))))","v":4},{"$f":"IF(OR(C337=\"S\",C337=0),0,IF(ISERROR(K337),J337,SMALL(J337:K337,1)))","v":3},{"$f":"IF($C337=1,OFFSET(E337,-1,0)+1,OFFSET(E337,-1,0))","v":6},{"$f":"IF($C337=1,0,IF($C337=2,OFFSET(F337,-1,0)+1,OFFSET(F337,-1,0)))","v":3},{"$f":"IF(AND($C337<=2,$C337<>0),0,IF($C337=3,OFFSET(G337,-1,0)+1,OFFSET(G337,-1,0)))","v":2},{"$f":"IF(AND($C337<=3,$C337<>0),0,IF($C337=4,OFFSET(H337,-1,0)+1,OFFSET(H337,-1,0)))","v":2},{"$f":"IF(AND($C337<=4,$C337<>0),0,IF(AND($C337=\"S\",$Y337>0),OFFSET(I337,-1,0)+1,OFFSET(I337,-1,0)))","v":0},8,3,"","Nível 4","Nível 4","-","SINAPI",null,"ADAPTADORES DE PVC SOLDÁVEL","-",null,1,"-",null,null,0,0,""]
["S",4,"S",0,6,3,2,2,0,0,0,"","Serviço","Serviço","-","SINAPI",89596,"ADAPTADOR CURTO COM BOLSA E ROSCA PARA REGISTRO, PVC, SOLDÁVEL, DN 50MM X 1.1/2\u0094, INSTALADO EM PRUMADA DE ÁGUA - FORNECIMENTO E INSTALAÇÃO. AF_12/2014","UN",2,1,2,null,null,0,0,"Referência: AGETOP - 81069"]
["S",4,"S",0,6,3,2,2,0,0,0,"","Serviço","Serviço","-","SINAPI",94711,"ADAPTADOR COM FLANGES LIVRES, PVC, SOLDÁVEL, DN 50 MM X 1 1/2 , INSTALADO EM RESERVAÇÃO DE ÁGUA DE EDIFICAÇÃO QUE POSSUA RESERVATÓRIO DE FIBRA/FIBROCIMENTO   FORNECIMENTO E INSTALAÇÃO. AF_06/2016","UN",1,1,1,null,null,0,0,"Referência: AGETOP - 81043"]
[4,4,4,2,6,3,2,3,0,5,2,"","Nível 4","Nível 4","-","SINAPI",null,"JOELHO","-",null,1,"-",null,null,0,0,""]
["S",4,"S",0,6,3,2,3,0,0,0,"","Serviço","Serviço","-","SINAPI",89501,"JOELHO 90 GRAUS, PVC, SOLDÁVEL, DN 50MM, INSTALADO EM PRUMADA DE ÁGUA - FORNECIMENTO E INSTALAÇÃO. AF_12/2014","UN",2,1,2,null,null,0,0,""]
[4,4,4,3,6,3,2,4,0,{"$f":"IF(OR($C342=\"S\",$C342=0),0,MATCH(0,OFFSET($D342,1,$C342,ROW($C$465)-ROW($C342)),0))","v":3},{"$f":"IF(OR($C342=\"S\",$C342=0),0,MATCH(OFFSET($D342,0,$C342)+1,OFFSET($D342,1,$C342,ROW($C$465)-ROW($C342)),0))","v":55},"","Nível 4","Nível 4","-","SINAPI",null,"ADESIVOS","-",null,1,"-",null,null,0,0,""]
["S",4,"S",0,6,3,2,4,0,0,0,"","Serviço","Serviço","-","AGETOP",81501,"ADESIVO PLASTICO - FRASCO 850 G","Un    ",1,1,1,null,null,0,0,""]
["S",4,"S",0,6,3,2,4,0,0,0,"","Serviço","Serviço","-","AGETOP",81504,"SOLUCAO LIMPADORA 1000 CM3","Un    ",1,1,1,null,null,0,0,""]
[3,3,3,3,6,3,3,0,0,61,3,"","Nível 3","Nível 3","-","SINAPI",null,"ESGOTO SANITÁRIO","-",null,1,"-",null,null,0,0,""]
[4,4,4,2,6,3,3,1,0,2,16,"","Nível 4","Nível 4","-","SINAPI",null,"TUBOS","-",null,1,"-",null,null,0,0,""]
["S",4,"S",0,6,3,3,1,0,0,0,"","Serviço","Serviço","-","SINAPI",89800,"TUBO PVC, SERIE NORMAL, ESGOTO PREDIAL, DN 100 MM, FORNECIDO E INSTALADO EM PRUMADA DE ESGOTO SANITÁRIO OU VENTILAÇÃO. AF_12/2014","M",12,1,12,null,null,0,0,""]
[3,3,3,5,6,3,4,0,0,58,5,"","Nível 3","Nível 3","-","SINAPI",null,"OUTROS","-",null,1,"-",null,null,0,0,""]
["S",3,"S",0,6,3,4,0,0,0,0,"","Serviço","Serviço","-","AGETOP",81825,"CAIXA DE PASSAGEM 60 X 60 CM SEM TAMPA","Un    ",1,1,1,null,null,0,0,""]
["S",3,"S",0,6,3,4,0,0,0,0,"","Serviço","Serviço","-","AGETOP",81823,"TAMPA PARA CAIXA PASSAGEM FERRO FUNDIDO T-33 - TRÁFEGO PESADO","Un    ",1,1,1,null,null,0,0,""]
["S",3,"S",0,6,3,4,0,0,0,0,"","Serviço","Serviço","-","AGETOP",80840,"TAMPA T-5 ARTICULADA 20X20","Un    ",1,1,1,null,null,0,0,""]
["S",3,"S",0,6,3,4,0,0,0,0,"","Serviço","Serviço","-","AGETOP",80845,"CAIXA DE ALVENARIA 20x20x25 CM (REVESTIMENTO IMPERMEABILIZADO), FUNDO DE BRITA SEM TAMPA - PARA REGISTRO/TORNEIRA JARDIM","Un    ",1,1,1,null,null,0,0,""]
[3,3,3,53,6,3,5,0,0,53,{"$error":"#N/A"},"","Nível 3","Nível 3","-","SINAPI",null,"INSTALAÇÕES DE INCENDIO","-",null,1,"-",null,null,0,0,""]
[4,4,4,8,6,3,5,1,0,52,8,"","Nível 4","Nível 4","-","SINAPI",null,"REGISTRO DE PASSEIO","-",null,1,"-",null,null,0,0,""]
["S",4,"S",0,6,3,5,1,0,0,0,"","Serviço","Serviço","-","AGETOP",85015,"CAIXA DE PASSEIO C/TAMPA DE FERRO FUNDIDO 40X60 CM P/INCÊNDIO","Un    ",1,1,1,null,null,0,0,""]
["S",4,"S",0,6,3,5,1,0,0,0,"","Serviço","Serviço","-","AGETOP",85027,"ADAPTADOR P/ENGATE STORZ 2.1/2\" X 1.1/2\"","Un    ",1,1,1,null,null,0,0,""]
["S",4,"S",0,6,3,5,1,0,0,0,"","Serviço","Serviço","-","AGETOP",85035,"TAMPÃO CEGO COM CORRENTE 2.1/2\"","Un    ",1,1,1,null,null,0,0,""]
["S",4,"S",0,6,3,5,1,0,0,0,"","Serviço","Serviço","-","AGETOP",85047,"NIPLE DUPLO FERRO GALVANIZADO 2.1/2\"","Un    ",2,1,2,null,null,0,0,""]
["S",4,"S",0,6,3,5,1,0,0,0,"","Serviço","Serviço","-","AGETOP",85077,"VÁLVULA DE RETENÇÃO HORIZONTAL 2.1/2\"","Un    ",1,1,1,null,null,0,0,""]
["S",4,"S",0,6,3,5,1,0,0,0,"","Serviço","Serviço","-","COMPOSIÇÃO","COMP 077_SEE","UNIAO FERRO GALV C/ASSENTO CONICO BRONZE 2 1/2\"","UN ",1,1,1,null,null,0,0,""]
["S",4,"S",0,6,3,5,1,0,0,0,"","Serviço","Serviço","-","COMPOSIÇÃO","COMP 087_SEE","REGISTRO DE GAVETA COM HASTE ASCENDENTE DE BRONZE 2 1/2\"","UN ",1,1,1,null,null,0,0,""]
[4,4,4,13,6,3,5,2,0,44,13,"","Nível 4","Nível 4","-","AGETOP",82379,"HIDRANTES","m     ",null,1,"-",null,null,0,0,""]
["S",4,"S",0,6,3,5,2,0,0,0,"","Serviço","Serviço","-","AGETOP",85011,"CAIXA DE INCÊNDIO METÁLICA COM SUPORTE PARA MANGUEIRA, TAMPA E MURETA 17X60X90 CM C/PINTURA","Un    ",6,1,6,null,null,0,0,""]
["S",4,"S",0,6,3,5,2,0,0,0,"","Serviço","Serviço","-","AGETOP",85017,"MANGUEIRA DE INCÊNDIO D.I. = 38 MM TIPO 2 COMP. = 15 M","CJ    ",12,1,12,null,null,0,0,""]
["S",4,"S",0,6,3,5,2,0,0,0,"","Serviço","Serviço","-","AGETOP",85025,"ESGUICHO REGULÁVEL 1.1/2\"","Un    ",6,1,6,null,null,0,0,""]
["S",4,"S",0,6,3,5,2,0,0,0,"","Serviço","Serviço","-","AGETOP",85027,"ADAPTADOR P/ENGATE STORZ 2.1/2\" X 1.1/2\"","Un    ",6,1,6,null,null,0,0,""]
["S",4,"S",0,6,3,5,2,0,0,0,"","Serviço","Serviço","-","AGETOP",85031,"REGISTRO GLOBO ANGULAR 2.1/2\"","Un    ",6,1,6,null,null,0,0,""]
["S",4,"S",0,6,3,5,2,0,0,0,"","Serviço","Serviço","-","COMPOSIÇÃO","COMP 018_SEE","CHAVE DUPLA P/ CONEXÕES TIPO STORZ EM LATÃO ENGATE RÁPIDO 1 1/2\" X 2 1/2\"","UN ",6,1,6,null,null,0,0,""]
[{"$f":"CHOOSE(1+LOG(1+2*(ORÇAMENTO.Nivel=\"Nível 1\")+4*(ORÇAMENTO.Nivel=\"Nível 2\")+8*(ORÇAMENTO.Nivel=\"Nível 3\")+16*(ORÇAMENTO.Nivel=\"Nível 4\")+32*(ORÇAMENTO.Nivel=\"Serviço\"),2),0,1,2,3,4,\"S\")","v":"S"},4,"S",0,6,3,5,2,0,0,0,"","Serviço","Serviço","-","COMPOSIÇÃO","COMP 025_SEE","SINALIZADOR FOTOLUMINESCENTE DE EMERGÊNCIA","UN ",12,1,12,null,null,0,0,""]
["S",4,"S",0,6,3,5,2,0,0,0,"","Serviço","Serviço","-","SINAPI",94473,"COTOVELO 90 GRAUS, EM FERRO GALVANIZADO, CONEXÃO ROSQUEADA, DN 65 (2 1/2\u0094), INSTALADO EM RESERVAÇÃO DE ÁGUA DE EDIFICAÇÃO QUE POSSUA RESERVATÓRIO DE FIBRA/FIBROCIMENTO \u0096 FORNECIMENTO E INSTALAÇÃO. AF_06/2016","UN",6,1,6,null,null,0,0,""]
["S",4,"S",0,6,3,5,2,0,0,0,"","Serviço","Serviço","-","COMPOSIÇÃO","COMP 077_SEE","UNIAO FERRO GALV C/ASSENTO CONICO BRONZE 2 1/2\"","UN ",6,1,6,null,null,0,0,""]
["S",4,"S",0,6,3,5,2,0,0,0,"","Serviço","Serviço","-","COMPOSIÇÃO","COMP 078_SEE","TAMPÃO CEGO COM CORRENTE 1 1/2\"","UN ",6,1,6,null,null,0,0,""]
["S",4,"S",0,6,3,5,2,0,0,0,"","Serviço","Serviço","-","COMPOSIÇÃO","COMP 188_SEE","ACIONADOR MANUAL DE ALARME","UN ",6,1,6,null,null,0,0,""]
["S",4,"S",0,6,3,5,2,0,0,0,"","Serviço","Serviço","-","COMPOSIÇÃO","COMP 277_SEE","MARCAÇÃO NO PISO - 1X1 M PARA EXTINTOR","M2",6,1,6,null,null,0,0,""]
[4,4,4,11,6,3,5,3,0,31,11,"","Nível 4","Nível 4","-","AGETOP",85041,"BOMBAS","Un    ",null,1,"-",null,null,0,0,""]
["S",4,"S",0,6,3,5,3,0,0,0,"","Serviço","Serviço","-","AGETOP",80903,"REGISTRO DE GAVETA BRUTO DIAMETRO 1\"","Un    ",1,1,1,null,null,0,0,""]
["S",4,"S",0,6,3,5,3,0,0,0,"","Serviço","Serviço","-","AGETOP",80910,"REGISTRO DE GAVETA BRUTO DIAMETRO 2.1/2\"","Un    ",3,1,3,null,null,0,0,""]
["S",4,"S",0,6,3,5,3,0,0,0,"","Serviço","Serviço","-","AGETOP",85047,"NIPLE DUPLO FERRO GALVANIZADO 2.1/2\"","Un    ",12,1,12,null,null,0,0,""]
["S",4,"S",0,6,3,5,3,0,0,0,"","Serviço","Serviço","-","AGETOP",85079,"VÁLVULA DE RETENÇÃO VERTICAL 2.1/2\"","Un    ",2,1,2,null,null,0,0,""]
["S",4,"S",0,6,3,5,3,0,0,0,"","Serviço","Serviço","-","AGETOP",82379,"TUBO FERRO GALVANIZADO DIAM.2.1/2\"","m     ",18,1,18,null,null,0,0,""]
["S",4,"S",0,6,3,5,3,0,0,0,"","Serviço","Serviço","-","AGETOP",85056,"TÊ DE FERRO GALVANIZADO 90º X 2 1/2\"","un    ",3,1,3,null,null,0,0,""]
["S",4,"S",0,6,3,5,3,0,0,0,"","Serviço","Serviço","-","COMPOSIÇÃO","COMP 040_SEE","CONJUNTO MOTOR-BOMBA ELÉTRICA TRIFÁSICO 380/220 V PARA VZ= 24,33 M³/H, HM= 46,24 M POTÊNCIA= 7,5 CV","UN ",1,1,1,null,null,0,0,""]
["S",4,"S",0,6,3,5,3,0,0,0,"","Serviço","Serviço","-","SINAPI",94473,"COTOVELO 90 GRAUS, EM FERRO GALVANIZADO, CONEXÃO ROSQUEADA, DN 65 (2 1/2\u0094), INSTALADO EM RESERVAÇÃO DE ÁGUA DE EDIFICAÇÃO QUE POSSUA RESERVATÓRIO DE FIBRA/FIBROCIMENTO \u0096 FORNECIMENTO E INSTALAÇÃO. AF_06/2016","UN",7,1,7,null,null,0,0,""]
["S",4,"S",0,6,3,5,3,0,0,0,"","Serviço","Serviço","-","COMPOSIÇÃO","COMP 077_SEE","UNIAO FERRO GALV C/ASSENTO CONICO BRONZE 2 1/2\"","UN ",4,1,4,null,null,0,0,""]
["S",4,"S",0,6,3,5,3,0,0,0,"","Serviço","Serviço","-","COMPOSIÇÃO","COMP 088_SEE","TE DE FERRO GALVANIZADO 90º X 2.1/2\" X 1\"","UN ",1,1,1,null,null,0,0,""]
[4,4,4,11,6,3,5,4,0,20,11,"","Nível 4","Nível 4","-","COMPOSIÇÃO","COMP 347_SEE","IMPLANTAÇÃO","UN ",null,1,"-",null,null,0,0,""]
["S",4,"S",0,6,3,5,4,0,0,0,"","Serviço","Serviço","-","AGETOP",82379,"TUBO FERRO GALVANIZADO DIAM.2.1/2\"","m     ",286.58,1,286.58,null,null,0,0,""]
["S",4,"S",0,6,3,5,4,0,0,0,"","Serviço","Serviço","-","AGETOP",85056,"TÊ DE FERRO GALVANIZADO 90º X 2 1/2\"","un    ",12,1,12,null,null,0,0,""]
["S",4,"S",0,6,3,5,4,0,0,0,"","Serviço","Serviço","-","COMPOSIÇÃO","COMP 025_SEE","SINALIZADOR FOTOLUMINESCENTE DE EMERGÊNCIA","UN ",31,1,31,null,null,0,0,""]
["S",4,"S",0,6,3,5,4,0,0,0,"","Serviço","Serviço","-","SINAPI",94473,"COTOVELO 90 GRAUS, EM FERRO GALVANIZADO, CONEXÃO ROSQUEADA, DN 65 (2 1/2\u0094), INSTALADO EM RESERVAÇÃO DE ÁGUA DE EDIFICAÇÃO QUE POSSUA RESERVATÓRIO DE FIBRA/FIBROCIMENTO \u0096 FORNECIMENTO E INSTALAÇÃO. AF_06/2016","UN",25,1,25,null,null,0,0,""]
["S",4,"S",0,6,3,5,4,0,0,0,"","Serviço","Serviço","-","AGETOP",85003,"EXTINTOR PO QUIMICO SECO (6 KG) - CAPACIDADE EXTINTORA 20 BC","Un    ",2,1,2,null,null,0,0,""]
["S",4,"S",0,6,3,5,4,0,0,0,"","Serviço","Serviço","-","AGETOP",85006,"EXTINTOR MULTI USO EM PO A B C (6 KG) - CAPACIDADE EXTINTORA 3A 20BC","un    ",11,1,11,null,null,0,0,""]
["S",4,"S",0,6,3,5,4,0,0,0,"","Serviço","Serviço","-","COMPOSIÇÃO","COMP 024_SEE","SINALIZADOR FOTOLUMINESCENTE PARA EXTINTOR","UN ",13,1,13,null,null,0,0,""]
["S",4,"S",0,6,3,5,4,0,0,0,"","Serviço","Serviço","-","COMPOSIÇÃO","COMP 277_SEE","MARCAÇÃO NO PISO - 1X1 M PARA EXTINTOR","M2",13,1,13,null,null,0,0,""]
["S",4,"S",0,6,3,5,4,0,0,0,"","Serviço","Serviço","-","AGETOP",71598,"LUMINÁRIA DE EMERGÊNCIA 30 LEDS","un    ",20,1,20,null,null,0,0,""]
["S",4,"S",0,6,3,5,4,0,0,0,"","Serviço","Serviço","-","COMPOSIÇÃO","COMP 041_SEE","CASA DE BOMBA","UN ",1,1,1,null,null,0,0,""]
[4,4,4,9,6,3,5,5,0,9,{"$error":"#N/A"},"","Nível 4","Nível 4","-","COMPOSIÇÃO","COMP 190_SEE","PADRÃO","UN ",null,1,"-",null,null,0,0,""]
["S",4,"S",0,6,3,5,5,0,0,0,"","Serviço","Serviço","-","AGETOP",81882,"RES.METALICO TAÇA AÇO PATINÁVEL-V=15M3-COL.SEC.H=6M+FUNDAÇÃO+LOGOTIPO","Un    ",1,1,1,null,null,0,0,""]
["S",{"$f":"IF(OR(C399=\"s\",C399=0),OFFSET(B399,-1,0),C399)","v":4},{"$f":"IF(OFFSET(C399,-1,0)=\"L\",1,IF(OFFSET(C399,-1,0)=1,2,IF(OR(A399=\"s\",A399=0),\"S\",IF(AND(OFFSET(C399,-1,0)=2,A399=4),3,IF(AND(OR(OFFSET(C399,-1,0)=\"s\",OFFSET(C399,-1,0)=0),A399<>\"s\",A399>OFFSET(B399,-1,0)),OFFSET(B399,-1,0),A399)))))","v":"S"},{"$f":"IF(OR(C399=\"S\",C399=0),0,IF(ISERROR(K399),J399,SMALL(J399:K399,1)))","v":0},{"$f":"IF($C399=1,OFFSET(E399,-1,0)+1,OFFSET(E399,-1,0))","v":6},{"$f":"IF($C399=1,0,IF($C399=2,OFFSET(F399,-1,0)+1,OFFSET(F399,-1,0)))","v":3},{"$f":"IF(AND($C399<=2,$C399<>0),0,IF($C399=3,OFFSET(G399,-1,0)+1,OFFSET(G399,-1,0)))","v":5},{"$f":"IF(AND($C399<=3,$C399<>0),0,IF($C399=4,OFFSET(H399,-1,0)+1,OFFSET(H399,-1,0)))","v":5},{"$f":"IF(AND($C399<=4,$C399<>0),0,IF(AND($C399=\"S\",$Y399>0),OFFSET(I399,-1,0)+1,OFFSET(I399,-1,0)))","v":0},0,0,"","Serviço","Serviço","-","AGETOP",85037,"TANQUE DE PRESSÃO DE 10 L","Un    ",1,1,1,null,null,0,0,""]
["S",4,"S",0,6,3,5,5,0,0,0,"","Serviço","Serviço","-","AGETOP",85039,"PRESSOSTATO 50 A 80 PSI","Un    ",1,1,1,null,null,0,0,""]
[{"$f":"CHOOSE(1+LOG(1+2*(ORÇAMENTO.Nivel=\"Nível 1\")+4*(ORÇAMENTO.Nivel=\"Nível 2\")+8*(ORÇAMENTO.Nivel=\"Nível 3\")+16*(ORÇAMENTO.Nivel=\"Nível 4\")+32*(ORÇAMENTO.Nivel=\"Serviço\"),2),0,1,2,3,4,\"S\")","v":"S"},4,"S",0,6,3,5,5,0,0,0,"","Serviço","Serviço","-","AGETOP",85041,"MANOMETRO - 0 A 10 KG/CM2","Un    ",1,1,1,null,null,0,0,""]
["S",4,"S",0,6,3,5,5,0,0,0,"","Serviço","Serviço","-","AGETOP",72338,"SIRENE METALICA ALCANCE 500 M","Un    ",1,1,1,null,null,0,0,""]
["S",4,"S",0,6,3,5,5,0,0,0,"","Serviço","Serviço","-","COMPOSIÇÃO","COMP 186_SEE","BOTOEIRA BOMBA DE INCÊNDIO C/ MARTELO CONVENCIONAL/ ANALÓGICA","UN ",1,1,1,null,null,0,0,""]
["S",4,"S",0,6,3,5,5,0,0,0,"","Serviço","Serviço","-","COMPOSIÇÃO","COMP 188_SEE","ACIONADOR MANUAL DE ALARME","UN ",1,1,1,null,null,0,0,""]
["S",4,"S",0,6,3,5,5,0,0,0,"","Serviço","Serviço","-","COMPOSIÇÃO","COMP 190_SEE","CENTRAL DE DETECÇÃO E ALARME DE 40 SETORES COM BATERIA","UN ",1,1,1,null,null,0,0,""]
[2,2,2,2,6,4,0,0,0,{"$f":"IF(OR($C406=\"S\",$C406=0),0,MATCH(0,OFFSET($D406,1,$C406,ROW($C$465)-ROW($C406)),0))","v":2},{"$f":"IF(OR($C406=\"S\",$C406=0),0,MATCH(OFFSET($D406,0,$C406)+1,OFFSET($D406,1,$C406,ROW($C$465)-ROW($C406)),0))","v":50},"","Nível 2","Nível 2","-","SINAPI",null,"REVESTIMENTO DE PISO","-",null,1,"-",null,null,0,0,""]
["S",2,"S",0,6,4,0,0,0,0,0,"","Serviço","Serviço","-","AGETOP",220102,"PISO CONCRETO DESEMPENADO ESPESSURA = 5 CM  1:2,5:3,5","m2    ",2.11,1,2.11,null,null,0,0,""]
[1,1,1,32,7,0,0,0,0,57,32,"F","Nível 1","Nível 1","7.","SINAPI",null,"CENTRAL DE GÁS","UN",1,1,1,null,null,0,0,""]
[2,2,2,3,7,1,0,0,0,31,3,"","Nível 2","Nível 2","-","SINAPI",null,"SERVIÇO EM TERRA","-",null,1,"-",null,null,0,0,""]
["S",2,"S",0,7,1,0,0,0,0,0,"","Serviço","Serviço","-","SINAPI",93358,"ESCAVAÇÃO MANUAL DE VALA COM PROFUNDIDADE MENOR OU IGUAL A 1,30 M. AF_03/2016","M3",0.19000000000000003,1,0.19000000000000003,null,null,0,0,"Referência: AGETOP - 40101"]
["S",2,"S",0,7,1,0,0,0,0,0,"","Serviço","Serviço","-","SINAPI",96995,"REATERRO MANUAL APILOADO COM SOQUETE. AF_10/2017","M3",0.19000000000000003,1,0.19000000000000003,null,null,0,0,"Referência: AGETOP - 40902"]
[2,2,2,28,7,2,0,0,0,28,40,"","Nível 2","Nível 2","-","SINAPI",null,"INSTALAÇÕES ESPECIAIS","-",null,1,"-",null,null,0,0,""]
["S",2,"S",0,7,2,0,0,0,0,0,"","Serviço","Serviço","-","AGETOP",91007,"CENTRAL DE GÁS PADRÃO GOINFRA SEM INSTALAÇÕES (1+1 CILINDRO 45 KG)","Un    ",1,1,1,null,null,0,0,""]
["S",2,"S",0,7,2,0,0,0,0,0,"","Serviço","Serviço","-","AGETOP",91023,"UNIÃO S/BRONZE PRETA 3/4\" NPT 300 LBS","Un    ",3,1,3,null,null,0,0,""]
["S",2,"S",0,7,2,0,0,0,0,0,"","Serviço","Serviço","-","COMPOSIÇÃO","COMP 382_SEE","TE DE REDUCAO DE FERRO GALVANIZADO, COM ROSCA BSP, DE 3/4\" X 1/2\"","UN ",1,1,1,null,null,0,0,""]
["S",2,"S",0,7,2,0,0,0,0,0,"","Serviço","Serviço","-","COMPOSIÇÃO","COMP 383_SEE","BUCHA DE REDUCAO DE FERRO GALVANIZADO, COM ROSCA BSP, DE 1/2\" X 1/4\"","UN ",3,1,3,null,null,0,0,""]
[{"$f":"CHOOSE(1+LOG(1+2*(ORÇAMENTO.Nivel=\"Nível 1\")+4*(ORÇAMENTO.Nivel=\"Nível 2\")+8*(ORÇAMENTO.Nivel=\"Nível 3\")+16*(ORÇAMENTO.Nivel=\"Nível 4\")+32*(ORÇAMENTO.Nivel=\"Serviço\"),2),0,1,2,3,4,\"S\")","v":"S"},{"$f":"IF(OR(C417=\"s\",C417=0),OFFSET(B417,-1,0),C417)","v":2},{"$f":"IF(OFFSET(C417,-1,0)=\"L\",1,IF(OFFSET(C417,-1,0)=1,2,IF(OR(A417=\"s\",A417=0),\"S\",IF(AND(OFFSET(C417,-1,0)=2,A417=4),3,IF(AND(OR(OFFSET(C417,-1,0)=\"s\",OFFSET(C417,-1,0)=0),A417<>\"s\",A417>OFFSET(B417,-1,0)),OFFSET(B417,-1,0),A417)))))","v":"S"},{"$f":"IF(OR(C417=\"S\",C417=0),0,IF(ISERROR(K417),J417,SMALL(J417:K417,1)))","v":0},{"$f":"IF($C417=1,OFFSET(E417,-1,0)+1,OFFSET(E417,-1,0))","v":7},{"$f":"IF($C417=1,0,IF($C417=2,OFFSET(F417,-1,0)+1,OFFSET(F417,-1,0)))","v":2},{"$f":"IF(AND($C417<=2,$C417<>0),0,IF($C417=3,OFFSET(G417,-1,0)+1,OFFSET(G417,-1,0)))","v":0},{"$f":"IF(AND($C417<=3,$C417<>0),0,IF($C417=4,OFFSET(H417,-1,0)+1,OFFSET(H417,-1,0)))","v":0},{"$f":"IF(AND($C417<=4,$C417<>0),0,IF(AND($C417=\"S\",$Y417>0),OFFSET(I417,-1,0)+1,OFFSET(I417,-1,0)))","v":0},0,0,"","Serviço","Serviço","-","AGETOP",91021,"LUVA GALVANIZADO DE REDUÇÃO 3/4\" X 1/2\" (GÁS)","Un    ",2,1,2,null,null,0,0,""]
["S",2,"S",0,7,2,0,0,0,0,0,"","Serviço","Serviço","-","SINAPI",92692,"NIPLE, EM FERRO GALVANIZADO, CONEXÃO ROSQUEADA, DN 15 (1/2\"), INSTALADO EM RAMAIS E SUB-RAMAIS DE GÁS - FORNECIMENTO E INSTALAÇÃO. AF_12/2015","UN",6,1,6,null,null,0,0,""]
["S",2,"S",0,7,2,0,0,0,0,0,"","Serviço","Serviço","-","AGETOP",91031,"NIPLE DUPLO 300 PSI 3/4\"","Un    ",6,1,6,null,null,0,0,""]
["S",2,"S",0,7,2,0,0,0,0,0,"","Serviço","Serviço","-","COMPOSIÇÃO","COMP 212_SEE","NIPLE DE REDUÇÃO 1/2\" X 1/4\" BSP","UN ",4,1,4,null,null,0,0,""]
["S",2,"S",0,7,2,0,0,0,0,0,"","Serviço","Serviço","-","COMPOSIÇÃO","COMP 213_SEE","NIPLE DE REDUÇÃO 3/4\" X 1/2\" BSP","UN ",4,1,4,null,null,0,0,""]
["S",2,"S",0,7,2,0,0,0,0,0,"","Serviço","Serviço","-","SINAPI",92688,"TUBO DE AÇO GALVANIZADO COM COSTURA, CLASSE MÉDIA, CONEXÃO ROSQUEADA, DN 20 (3/4\"), INSTALADO EM RAMAIS E SUB-RAMAIS DE GÁS - FORNECIMENTO E INSTALAÇÃO. AF_12/2015","M",9,1,9,null,null,0,0,""]
["S",2,"S",0,7,2,0,0,0,0,0,"","Serviço","Serviço","-","SINAPI",92701,"JOELHO 90 GRAUS, EM FERRO GALVANIZADO, CONEXÃO ROSQUEADA, DN 20 (3/4\"), INSTALADO EM RAMAIS E SUB-RAMAIS DE GÁS - FORNECIMENTO E INSTALAÇÃO. AF_12/2015","UN",4,1,4,null,null,0,0,""]
["S",2,"S",0,7,2,0,0,0,0,0,"","Serviço","Serviço","-","COMPOSIÇÃO","COMP 237_SEE","FITA ANTICORROSIVA","M",5,1,5,null,null,0,0,""]
["S",2,"S",0,7,2,0,0,0,0,0,"","Serviço","Serviço","-","AGETOP",91025,"VÁLVULA ESFERICA LATÃO 3/4\"","Un    ",3,1,3,null,null,0,0,""]
["S",2,"S",0,7,2,0,0,0,0,0,"","Serviço","Serviço","-","COMPOSIÇÃO","COMP 542_SEE","VÁLVULA UGV 3/4\" (S) LATÃO","UN ",1,1,1,null,null,0,0,""]
["S",2,"S",0,7,2,0,0,0,0,0,"","Serviço","Serviço","-","COMPOSIÇÃO","COMP 543_SEE","VÁLVULA UGV 1/2\" (S) LATÃO","UN ",1,1,1,null,null,0,0,""]
["S",2,"S",0,7,2,0,0,0,0,0,"","Serviço","Serviço","-","AGETOP",91029,"VALVULA DE RETENÇÃO LATÃO 1/2\" X 7/16\" NPT","Un    ",1,1,1,null,null,0,0,""]
["S",2,"S",0,7,2,0,0,0,0,0,"","Serviço","Serviço","-","COMPOSIÇÃO","COMP 211_SEE","REGULADOR DE 2º ESTÁGIO 5KG/H","UN ",1,1,1,null,null,0,0,""]
["S",2,"S",0,7,2,0,0,0,0,0,"","Serviço","Serviço","-","COMPOSIÇÃO","COMP 210_SEE","REGULADOR DE 1º ESTÁGIO 60KG/H MODELO AP-40  COM MANÔMETRO","UN ",1,1,1,null,null,0,0,""]
["S",2,"S",0,7,2,0,0,0,0,0,"","Serviço","Serviço","-","AGETOP",85003,"EXTINTOR PO QUIMICO SECO (6 KG) - CAPACIDADE EXTINTORA 20 BC","Un    ",1,1,1,null,null,0,0,""]
["S",2,"S",0,7,2,0,0,0,0,0,"","Serviço","Serviço","-","COMPOSIÇÃO","COMP 235_SEE","PLACA DE SINALIZAÇÃO EM PVC COD 01 - (300X300) PROIBIDO FUMAR","UN ",2,1,2,null,null,0,0,""]
["S",2,"S",0,7,2,0,0,0,0,0,"","Serviço","Serviço","-","COMPOSIÇÃO","COMP 236_SEE","PLACA DE SINALIZAÇÃO EM PVC COD 06 - (300X300) PERIGO INFLAMÁVEL","UN ",2,1,2,null,null,0,0,""]
["S",2,"S",0,7,2,0,0,0,0,0,"","Serviço","Serviço","-","AGETOP",91043,"BRAÇADEIRA METALICA TIPO \"D\" DIAM. 3/4\"","Un    ",4,1,4,null,null,0,0,""]
["S",2,"S",0,7,2,0,0,0,0,0,"","Serviço","Serviço","-","AGETOP",71863,"PARAFUSO P/BUCHA S-10","Un    ",8,1,8,null,null,0,0,""]
["S",2,"S",0,7,2,0,0,0,0,0,"","Serviço","Serviço","-","AGETOP",70393,"BUCHA DE NYLON S-10","Un    ",8,1,8,null,null,0,0,""]
["S",2,"S",0,7,2,0,0,0,0,0,"","Serviço","Serviço","-","AGETOP",91045,"SUPORTE PARA COLETOR","Un    ",2,1,2,null,null,0,0,""]
["S",2,"S",0,7,2,0,0,0,0,0,"","Serviço","Serviço","-","COMPOSIÇÃO","COMP 045_SEE","LAUDO DE ESTANQUEIDADE","UN ",1,1,1,null,null,0,0,""]
["S",2,"S",0,7,2,0,0,0,0,0,"","Serviço","Serviço","-","COMPOSIÇÃO","COMP 277_SEE","MARCAÇÃO NO PISO - 1X1 M PARA EXTINTOR","M2",1,1,1,null,null,0,0,""]
[1,1,1,25,8,0,0,0,0,25,{"$error":"#N/A"},"F","Nível 1","Nível 1","8.","SINAPI",null,"RAMPA E ESCADA","UN",1,1,1,null,null,0,0,""]
[2,2,2,5,8,1,0,0,0,24,5,"","Nível 2","Nível 2","-","SINAPI",null,"SERVIÇOS PRELIMINARES","-",null,1,"-",null,null,0,0,""]
["S",2,"S",0,8,1,0,0,0,0,0,"","Serviço","Serviço","-","COMPOSIÇÃO","COMP 010_SEE","DEMOLIÇÃO DE GRADE/GRELHA/CORRIMÃO/GUARDA CORPO - METÁLICO","M2",7.92,1,7.92,null,null,0,0,""]
["S",2,"S",0,8,1,0,0,0,0,0,"","Serviço","Serviço","-","AGETOP",20111,"DEM.PISO CERAM.SOBRE LASTRO CONC.C/TR.CB.E CARGA","m2    ",14.72,1,14.72,null,null,0,0,""]
["S",2,"S",0,8,1,0,0,0,0,0,"","Serviço","Serviço","-","AGETOP",20121,"DEM. MANUAL EM CONCR.SIMPLES C/TR.ATE CB.E CARGA (O.C.)","m3    ",0.81,1,0.81,null,null,0,0,""]
["S",2,"S",0,8,1,0,0,0,0,0,"","Serviço","Serviço","-","AGETOP",20118,"DEM.ALVEN.TIJOLO S/REAP. C/TR.ATE CB. E CARGA","m3    ",3.75,1,3.75,null,null,0,0,""]
[2,2,2,6,8,2,0,0,0,19,6,"","Nível 2","Nível 2","-",null,null,"SERVIÇO EM TERRA","-",null,1,"-",null,null,0,0,""]
["S",2,"S",0,8,2,0,0,0,0,0,"","Serviço","Serviço","-","AGETOP",41004,"ESCAVACAO MECANICA","m3    ",6.9,1,6.9,null,null,0,0,""]
["S",2,"S",0,8,2,0,0,0,0,0,"","Serviço","Serviço","-","AGETOP",41005,"CARGA MECANIZADA","m3    ",2.4000000000000004,1,2.4000000000000004,null,null,0,0,""]
["S",2,"S",0,8,2,0,0,0,0,0,"","Serviço","Serviço","-","AGETOP",41006,"TRANSPORTE DE MATERIAL ESCAVADO M3.KM","m3km  ",24.000000000000004,1,24.000000000000004,null,null,0,0,""]
["S",2,"S",0,8,2,0,0,0,0,0,"","Serviço","Serviço","-","AGETOP",41010,"TRANSPORTE COM LÂMINA ATE 100 M - (OBRAS CIVIS)","m3    ",4.5,1,4.5,null,null,0,0,""]
["S",2,"S",0,8,2,0,0,0,0,0,"","Serviço","Serviço","-","AGETOP",41009,"COMPACTAÇÃO MECÂNICA SEM CONTROLE LABORATÓRIO","m3    ",3.6,1,3.6,null,null,0,0,""]
[2,2,2,2,8,3,0,0,0,13,2,"","Nível 2","Nível 2","-","SINAPI",null,"ALVENARIAS E DIVISÓRIAS","-",null,1,"-",null,null,0,0,""]
["S",2,"S",0,8,3,0,0,0,0,0,"","Serviço","Serviço","-","AGETOP",100201,"ALVENARIA DE TIJOLO FURADO 1/2 VEZ - 9 x 19 x 19 - ARG. (1CALH:4ARML+100KG DE CI/M3)","m2    ",31.65,1,31.65,null,null,0,0,""]
[2,2,2,2,8,4,0,0,0,11,2,"","Nível 2","Nível 2","-",null,null,"ESQUADRIAS METÁLICAS","-",null,1,"-",null,null,0,0,""]
["S",2,"S",0,8,4,0,0,0,0,0,"","Serviço","Serviço","-","COMPOSIÇÃO","COMP 082_SEE","CORRIMÃO PAREDE - SEDUC","M",22.2,1,22.2,null,null,0,0,""]
[2,2,2,3,8,5,0,0,0,9,3,"","Nível 2","Nível 2","-",null,null,"REVESTIMENTO DE PAREDE","-",null,1,"-",null,null,0,0,""]
[{"$f":"CHOOSE(1+LOG(1+2*(ORÇAMENTO.Nivel=\"Nível 1\")+4*(ORÇAMENTO.Nivel=\"Nível 2\")+8*(ORÇAMENTO.Nivel=\"Nível 3\")+16*(ORÇAMENTO.Nivel=\"Nível 4\")+32*(ORÇAMENTO.Nivel=\"Serviço\"),2),0,1,2,3,4,\"S\")","v":"S"},{"$f":"IF(OR(C457=\"s\",C457=0),OFFSET(B457,-1,0),C457)","v":2},{"$f":"IF(OFFSET(C457,-1,0)=\"L\",1,IF(OFFSET(C457,-1,0)=1,2,IF(OR(A457=\"s\",A457=0),\"S\",IF(AND(OFFSET(C457,-1,0)=2,A457=4),3,IF(AND(OR(OFFSET(C457,-1,0)=\"s\",OFFSET(C457,-1,0)=0),A457<>\"s\",A457>OFFSET(B457,-1,0)),OFFSET(B457,-1,0),A457)))))","v":"S"},{"$f":"IF(OR(C457=\"S\",C457=0),0,IF(ISERROR(K457),J457,SMALL(J457:K457,1)))","v":0},{"$f":"IF($C457=1,OFFSET(E457,-1,0)+1,OFFSET(E457,-1,0))","v":8},{"$f":"IF($C457=1,0,IF($C457=2,OFFSET(F457,-1,0)+1,OFFSET(F457,-1,0)))","v":5},{"$f":"IF(AND($C457<=2,$C457<>0),0,IF($C457=3,OFFSET(G457,-1,0)+1,OFFSET(G457,-1,0)))","v":0},{"$f":"IF(AND($C457<=3,$C457<>0),0,IF($C457=4,OFFSET(H457,-1,0)+1,OFFSET(H457,-1,0)))","v":0},{"$f":"IF(AND($C457<=4,$C457<>0),0,IF(AND($C457=\"S\",$Y457>0),OFFSET(I457,-1,0)+1,OFFSET(I457,-1,0)))","v":0},{"$f":"IF(OR($C457=\"S\",$C457=0),0,MATCH(0,OFFSET($D457,1,$C457,ROW($C$465)-ROW($C457)),0))","v":0},{"$f":"IF(OR($C457=\"S\",$C457=0),0,MATCH(OFFSET($D457,0,$C457)+1,OFFSET($D457,1,$C457,ROW($C$465)-ROW($C457)),0))","v":0},"","Serviço","Serviço","-","SINAPI",87547,"MASSA ÚNICA, PARA RECEBIMENTO DE PINTURA, EM ARGAMASSA TRAÇO 1:2:8, PREPARO MECÂNICO COM BETONEIRA 400L, APLICADA MANUALMENTE EM FACES INTERNAS DE PAREDES, ESPESSURA DE 10MM, COM EXECUÇÃO DE TALISCAS. AF_06/2014","M2",99.45,1,99.45,null,null,0,0,""]
["S",2,"S",0,8,5,0,0,0,0,0,"","Serviço","Serviço","-","AGETOP",200101,"CHAPISCO COMUM","m2    ",99.45,1,99.45,null,null,0,0,""]
[2,2,2,4,8,6,0,0,0,6,4,"","Nível 2","Nível 2","-",null,null,"REVESTIMENTO DE PISO","-",null,1,"-",null,null,0,0,""]
["S",2,"S",0,8,6,0,0,0,0,0,"","Serviço","Serviço","-","AGETOP",220101,"LASTRO DE CONCRETO REGULARIZADO IMPERMEABILIZADO 1:3:6 ESP=5CM (BASE)","m2    ",26.35,1,26.35,null,null,0,0,""]
["S",2,"S",0,8,6,0,0,0,0,0,"","Serviço","Serviço","-","AGETOP",221101,"GRANITINA 8MM FUNDIDA COM CONTRAPISO (1CI:3ARML) E=2CM E JUNTA PLASTICA 27MM","m2    ",31.7,1,31.7,null,null,0,0,""]
["S",2,"S",0,8,6,0,0,0,0,0,"","Serviço","Serviço","-","AGETOP",221104,"RASPAGEM E APLICAÇÃO RESINA ACRÍLICA DUAS DEMÃOS","m2    ",31.7,1,31.7,null,null,0,0,""]
[2,2,2,2,8,7,0,0,0,2,{"$error":"#N/A"},"","Nível 2","Nível 2","-","AGETOP",null,"PINTURA","-",null,1,"-",null,null,0,0,""]
["S",2,"S",0,8,7,0,0,0,0,0,"","Serviço","Serviço","-","AGETOP",261001,"PINTURA LATEX ACRILICO 2 DEMAOS","m2    ",99.45,1,99.45,null,null,0,0,""]
[-1,null,-1,null,0,0,0,0,0,null,null,"F"]
[null,null,null,null,null,null,null,null,null,null,null,"F",null,null,null,null,null,"OBS: OS QUANTITATIVOS DE MATERIAIS  DAS INSTALAÇÕES HIDROSSANITÁRIAS, ELÉTRICAS E ESPECIAIS SÃO FORNECIDOS PELOS PROFISSIONAIS RESPONSÁVEIS PELOS RESPECTIVOS PROJETOS.",null,null,null,null,"VALOR TOTAL",null,null,0]
[null,null,null,null,null,null,null,null,null,null,null,"F",null,null,null,null,null,null,null,null,null,null,"VALOR BDI (20,34%)",null,null,0]
[null,null,null,null,null,null,null,null,null,null,null,"F",null,null,null,null,null,null,null,null,null,null,"TOTAL ORÇAMENTO",null,null,0]
[null,null,null,null,null,null,null,null,null,null,null,"F"]
[null,null,null,null,null,null,null,null,null,null,null,"F",null,null,null,null,null,null,null,null,null,null,"CUSTO POR M2 ³",null,null,0]
[null,null,null,null,null,null,null,null,null,null,null,"F",null,null,null,null,null,null,null,null,null,null,"MATERIAL S/ BDI",null,null,0]
[null,null,null,null,null,null,null,null,null,null,null,"F",null,null,null,null,null,null,null,null,null,null,"MÃO DE OBRA S/ BDI",null,null,0]
[null,null,null,null,null,null,null,null,null,null,null,"F"]
[null,null,null,null,null,null,null,null,null,null,null,"F",null,null,null,null,"(1) Conforme previsto pelo DECRETO Nº 7.983, DE 8 DE ABRIL DE 2013, os preços adotados são aqueles constantes dos sistemas de referência indicados. Justifica-se o uso dos preços destas composições de custos unitários devido ao seu valor ser menor à mediana de seus correspondentes na tabela SINAPI;"]
[null,null,null,null,null,null,null,null,null,null,null,"F",null,null,null,null,"(2) Optou-se pelo uso das composições de custos da AGETOP para itens não presentes na SINAPI;"]
[null,null,null,null,null,null,null,null,null,null,null,"F",null,null,null,null,"(3) Para itens da AGETOP, os vidros não estão inclusos nas esquadrias e já foram considerados os custos de contramarco para as esquadrias de alumínio;"]
[null,null,null,null,null,null,null,null,null,null,null,"F",null,null,null,null,"(4) Nos casos em que houver execução de granitina e omissão do item AGETOP 221102, considerou-se que o quantitativo para o rodapé, de altura igual a 7cm, foi incorporado na área de piso;"]
[null,null,null,null,null,null,null,null,null,null,null,"F",null,null,null,null,"(5) O custo unitário aproximado por metro quadrado é calculado dividindo-se o valor total do orçamento pela área total de construção."]
[null,null,null,null,null,null,null,null,null,null,null,"F"]
[null,null,null,null,null,null,null,null,null,null,null,"F"]
[]
[null,null,null,null,null,null,null,null,null,null,null,null,null,null,"SOMATÓRIO DE SERVIÇOS"]
[null,null,null,null,null,null,null,null,null,null,null,null,null,null,"ITEM","DESCRIÇÃO DOS SERVIÇOS",null,null,"PREÇO SEM BDI",null,null,null,null,"PREÇO COM BDI",null,null,"PARTICIPAÇÃO ( % )"]
[null,null,null,null,null,null,null,null,null,null,null,null,null,null,"a.","SERVIÇOS PRELIMINARES",null,null,0,null,null,null,null,0,null,null,0]
[null,null,null,null,null,null,null,null,null,null,null,null,null,null,"b.","TRANSPORTES",null,null,0,null,null,null,null,0,null,null,0]
[null,null,null,null,null,null,null,null,null,null,null,null,null,null,"c.","SERVIÇO EM TERRA",null,null,0,null,null,null,null,0,null,null,0]
[null,null,null,null,null,null,null,null,null,null,null,null,null,null,"d.","FUNDAÇÕES E SONDAGENS",null,null,0,null,null,null,null,0,null,null,0]
[null,null,null,null,null,null,null,null,null,null,null,null,null,null,"e.","ESTRUTURA",null,null,0,null,null,null,null,0,null,null,0]
[null,null,null,null,null,null,null,null,null,null,null,null,null,null,"f.","INSTALAÇÕES ELÉTRICAS",null,null,0,null,null,null,null,0,null,null,0]
[null,null,null,null,null,null,null,null,null,null,null,null,null,null,"g.","INSTALAÇÕES HIDROSSANITÁRIAS",null,null,0,null,null,null,null,0,null,null,0]
[null,null,null,null,null,null,null,null,null,null,null,null,null,null,"h","INSTALAÇÕES ESPECIAIS",null,null,0,null,null,null,null,0,null,null,0]
[null,null,null,null,null,null,null,null,null,null,null,null,null,null,"i.","ALVENARIAS E DIVISÓRIAS",null,null,0,null,null,null,null,0,null,null,0]
[null,null,null,null,null,null,null,null,null,null,null,null,null,null,"j.","ALVENARIA AUTO-PORTANTE",null,null,0,null,null,null,null,0,null,null,0]
[null,null,null,null,null,null,null,null,null,null,null,null,null,null,"k.","IMPERMEABILIZAÇÃO",null,null,0,null,null,null,null,0,null,null,0]
[null,null,null,null,null,null,null,null,null,null,null,null,null,null,"l.","ISOLAMENTO TÉRMICO E ACÚSTICO",null,null,0,null,null,null,null,0,null,null,0]
[null,null,null,null,null,null,null,null,null,null,null,null,null,null,"m.","ESTRUTURA DE MADEIRA",null,null,0,null,null,null,null,0,null,null,0]
[null,null,null,null,null,null,null,null,null,null,null,null,null,null,"n.","ESTRUTURAS METÁLICAS",null,null,0,null,null,null,null,0,null,null,0]
[null,null,null,null,null,null,null,null,null,null,null,null,null,null,"o.","COBERTURAS",null,null,0,null,null,null,null,0,null,null,0]
[null,null,null,null,null,null,null,null,null,null,null,null,null,null,"p.","ESQUADRIAS DE MADEIRA",null,null,0,null,null,null,null,0,null,null,0]
[null,null,null,null,null,null,null,null,null,null,null,null,null,null,"q.","ESQUADRIAS METÁLICAS",null,null,0,null,null,null,null,0,null,null,0]
[null,null,null,null,null,null,null,null,null,null,null,null,null,null,"r.","VIDROS",null,null,0,null,null,null,null,0,null,null,0]
[null,null,null,null,null,null,null,null,null,null,null,null,null,null,"s.","REVESTIMENTO DE PAREDE",null,null,0,null,null,null,null,0,null,null,0]
[null,null,null,null,null,null,null,null,null,null,null,null,null,null,"t.","FORROS",null,null,0,null,null,null,null,0,null,null,0]
[null,null,null,null,null,null,null,null,null,null,null,null,null,null,"u.","REVESTIMENTO DE PISO",null,null,0,null,null,null,null,0,null,null,0]
[null,null,null,null,null,null,null,null,null,null,null,null,null,null,"v.","FERRAGENS",null,null,0,null,null,null,null,0,null,null,0]
[null,null,null,null,null,null,null,null,null,null,null,null,null,null,"w.","MARCENARIA",null,null,0,null,null,null,null,0,null,null,0]
[null,null,null,null,null,null,null,null,null,null,null,null,null,null,"x.","ADMINISTRAÇÃO",null,null,0,null,null,null,null,0,null,null,0]
[null,null,null,null,null,null,null,null,null,null,null,null,null,null,"y.","PINTURA",null,null,0,null,null,null,null,0,null,null,0]
[null,null,null,null,null,null,null,null,null,null,null,null,null,null,"z.","DIVERSOS",null,null,0,null,null,null,null,0,null,null,0]
[null,null,null,null,null,null,null,null,null,null,null,null,null,null,"TOTAL GERAL DO ORÇAMENTO (R$)",null,null,null,0,null,null,null,null,0,null,null,0]
[null,null,null,null,null,null,null,null,null,null,null,null,null,null,null,null,null,null,0,null,null,null,null,0,null,null,100]
[null,null,null,null,null,null,null,null,null,null,null,null,null,null,null,null,null,null,"(TOTAL SEM BDI)",null,null,null,null,"(TOTAL COM BDI)",null,null,"(ARRED porcentagem)"]
[null,null,null,null,null,null,null,null,null,null,null,null,null,null,null,null,null,null,"ERRO",null,null,null,null,"ERRO",null,null,"ERRO"]
[]
[]
[null,null,null,null,null,null,null,null,null,null,null,null,null,null,"RESUMO GERAL DO ORÇAMENTO"]
[null,null,null,null,null,null,null,null,null,null,null,null,null,null,"ITEM","DESCRIÇÃO DOS SERVIÇOS",null,null,"PREÇO SEM BDI",null,null,null,null,"PREÇO COM BDI",null,null,"PARTICIPAÇÃO ( % )"]
[null,null,null,null,null,null,null,null,null,null,null,null,null,null,"1.","REFORMA  E AMPLIAÇÃO",null,null,0,null,null,null,null,0,null,null,{"$error":"#DIV/0!"}]
[null,null,null,null,null,null,null,null,null,null,null,null,null,null,"2.","SERVIÇOS PRELIMINARES - IMPLANTAÇÃO DE REFEITÓRIO",null,null,0,null,null,null,null,0,null,null,{"$error":"#DIV/0!"}]
[null,null,null,null,null,null,null,null,null,null,null,null,null,null,"3.","COZINHA COM REFEITÓRIO - SEDUC 2009",null,null,0,null,null,null,null,0,null,null,{"$error":"#DIV/0!"}]
[null,null,null,null,null,null,null,null,null,null,null,null,null,null,"4.","PROJETO DE FUNDAÇÕES E ESTRUTURA",null,null,0,null,null,null,null,0,null,null,{"$error":"#DIV/0!"}]
[null,null,null,null,null,null,null,null,null,null,null,null,null,null,"5.","INST. ELÉTRICAS",null,null,0,null,null,null,null,0,null,null,{"$error":"#DIV/0!"}]
[null,null,null,null,null,null,null,null,null,null,null,null,null,null,"6.","INST. HIDROSSANITÁRIAS E COMBATE À INCÊNDIO",null,null,0,null,null,null,null,0,null,null,{"$error":"#DIV/0!"}]
[null,null,null,null,null,null,null,null,null,null,null,null,null,null,"7.","CENTRAL DE GÁS",null,null,0,null,null,null,null,0,null,null,{"$error":"#DIV/0!"}]
[null,null,null,null,null,null,null,null,null,null,null,null,null,null,"8.","RAMPA E ESCADA",null,null,0,null,null,null,null,0,null,null,{"$error":"#DIV/0!"}]
[null,null,null,null,null,null,null,null,null,null,null,null,null,null,"9.","",null,null,0,null,null,null,null,0,null,null,{"$error":"#DIV/0!"}]
[null,null,null,null,null,null,null,null,null,null,null,null,null,null,"10.","",null,null,0,null,null,null,null,0,null,null,{"$error":"#DIV/0!"}]
[null,null,null,null,null,null,null,null,null,null,null,null,null,null,"11.","",null,null,0,null,null,null,null,0,null,null,{"$error":"#DIV/0!"}]
[null,null,null,null,null,null,null,null,null,null,null,null,null,null,"12.","",null,null,0,null,null,null,null,0,null,null,{"$error":"#DIV/0!"}]
[null,null,null,null,null,null,null,null,null,null,null,null,null,null,"13.","",null,null,0,null,null,null,null,0,null,null,{"$error":"#DIV/0!"}]
[null,null,null,null,null,null,null,null,null,null,null,null,null,null,"14.","",null,null,0,null,null,null,null,0,null,null,{"$error":"#DIV/0!"}]
[null,null,null,null,null,null,null,null,null,null,null,null,null,null,"15.","",null,null,0,null,null,null,null,0,null,null,{"$error":"#DIV/0!"}]
[null,null,null,null,null,null,null,null,null,null,null,null,null,null,"16.","",null,null,0,null,null,null,null,0,null,null,{"$error":"#DIV/0!"}]
[null,null,null,null,null,null,null,null,null,null,null,null,null,null,"17.","",null,null,0,null,null,null,null,0,null,null,{"$error":"#DIV/0!"}]
[null,null,null,null,null,null,null,null,null,null,null,null,null,null,"18.","",null,null,0,null,null,null,null,0,null,null,{"$error":"#DIV/0!"}]
[null,null,null,null,null,null,null,null,null,null,null,null,null,null,"19.","",null,null,0,null,null,null,null,0,null,null,{"$error":"#DIV/0!"}]
[null,null,null,null,null,null,null,null,null,null,null,null,null,null,"20.","",null,null,0,null,null,null,null,0,null,null,{"$error":"#DIV/0!"}]
[null,null,null,null,null,null,null,null,null,null,null,null,null,null,"TOTAL GERAL DO ORÇAMENTO (R$)",null,null,null,0,null,null,null,null,0,null,null,{"$error":"#DIV/0!"}]
[null,null,null,null,null,null,null,null,null,null,null,null,null,null,null,null,null,null,0,null,null,null,null,0,null,null,100]
[null,null,null,null,null,null,null,null,null,null,null,null,null,null,null,null,null,null,"(TOTAL SEM BDI)",null,null,null,null,"(TOTAL COM BDI)",null,null,"(ARRED porcentagem)"]
[null,null,null,null,null,null,null,null,null,null,null,null,null,null,null,null,null,null,"ERRO",null,null,null,null,"ERRO",null,null,{"$error":"#DIV/0!"}]

{"sheet":"Resumo ","index":1,"n_rows":39,"n_cols":9,"rows_kept":39,"cut":false,"hidden":false,"merged":[[13,0,14,0],[15,2,15,5],[16,2,16,5],[17,2,17,5],[18,2,18,5],[14,1,14,8],[0,1,0,8],[36,1,36,5],[2,1,2,5],[3,1,3,5],[5,1,5,5],[6,1,6,5],[8,1,8,5],[9,1,9,5],[11,3,11,5],[12,3,12,5],[10,1,10,8],[11,6,11,8],[12,6,12,8],[19,2,19,5],[20,2,20,5],[21,2,21,5],[31,2,31,5],[1,1,1,8],[2,6,2,8],[3,6,3,8],[4,1,4,8],[5,6,5,8],[6,6,6,8],[7,1,7,8],[8,6,8,8],[9,6,9,8],[13,1,13,8],[11,1,11,2],[12,1,12,2],[42,3,42,7],[41,3,41,7],[38,1,38,8],[22,2,22,5],[23,2,23,5],[24,2,24,5],[25,2,25,5],[26,2,26,5],[32,2,32,5],[33,2,33,5],[34,2,34,5],[35,2,35,5],[27,2,27,5],[28,2,28,5],[29,2,29,5],[30,2,30,5]]}
[]
[]
[null,"UNIDADE ESCOLAR",null,null,null,null,"CÓDIGO INEP"]
[null,{"$f":"Orçamento!$O$5","v":"COLÉGIO ESTADUAL DA POLÍCIA MILITAR DE GOIÁS DE MORRINHOS - XAVIER DE ALMEIDA"},null,null,null,null,{"$f":"Orçamento!X5","v":52060098}]
[]
[null,"OBRA",null,null,null,null,"CIDADE"]
[null,{"$f":"Orçamento!$O$8","v":"REFORMA  E AMPLIAÇÃO"},null,null,null,null,{"$f":"Orçamento!$X$8","v":"MORRINHOS"}]
[]
[null,"ENDEREÇO",null,null,null,null,"CRE"]
[null,{"$f":"Orçamento!$R$11","v":" AV JOSE NASCIMENTO S/N , SETOR OESTE , CEP:75650-000"},null,null,null,null,{"$f":"Orçamento!$O$11","v":"CRE-MORRINHOS"}]
[]
[null,"REFERÊNCIA",null,"DATA",null,null,"ÁREA TOTAL CONSTRUÍDA (M²)"]
[null,{"$f":"CONCATENATE(\"AGETOP E SINAPI - \",Orçamento!$T$11)","v":"AGETOP E SINAPI - ONERADA"},null,{"$f":"Orçamento!$S$8","v":"2020-07-02"},null,null,{"$f":"Orçamento!$X$14","v":3977.5099999999998}]
["FILTRO"]
[null,"RESUMO GERAL DO ORÇAMENTO"]
["↓","ITEM","DESCRIÇÃO DOS SERVIÇOS",null,null,null,"PREÇO SEM BDI","PREÇO COM BDI","PARTICIP. (%)"]
[{"$f":"IF(G17>0,\"F\",\"\")","v":""},"1.",{"$f":"Orçamento!$P518","v":"REFORMA  E AMPLIAÇÃO"},null,null,null,{"$f":"IFERROR(Orçamento!S518,\"-\")","v":0},{"$f":"IFERROR(Orçamento!X518,\"\")","v":0},{"$f":"Orçamento!AA518","v":{"$error":"#DIV/0!"}}]
[{"$f":"IF(G18>0,\"F\",\"\")","v":""},"2.",{"$f":"Orçamento!$P519","v":"SERVIÇOS PRELIMINARES - IMPLANTAÇÃO DE REFEITÓRIO"},null,null,null,{"$f":"IFERROR(Orçamento!S519,\"-\")","v":0},{"$f":"IFERROR(Orçamento!X519,\"\")","v":0},{"$f":"Orçamento!AA519","v":{"$error":"#DIV/0!"}}]
["","3.",{"$f":"Orçamento!$P520","v":"COZINHA COM REFEITÓRIO - SEDUC 2009"},null,null,null,{"$f":"IFERROR(Orçamento!S520,\"-\")","v":0},{"$f":"IFERROR(Orçamento!X520,\"\")","v":0},{"$f":"Orçamento!AA520","v":{"$error":"#DIV/0!"}}]
["","4.",{"$f":"Orçamento!$P521","v":"PROJETO DE FUNDAÇÕES E ESTRUTURA"},null,null,null,{"$f":"IFERROR(Orçamento!S521,\"-\")","v":0},{"$f":"IFERROR(Orçamento!X521,\"\")","v":0},{"$f":"Orçamento!AA521","v":{"$error":"#DIV/0!"}}]
["","5.",{"$f":"Orçamento!$P522","v":"INST. ELÉTRICAS"},null,null,null,{"$f":"IFERROR(Orçamento!S522,\"-\")","v":0},{"$f":"IFERROR(Orçamento!X522,\"\")","v":0},{"$f":"Orçamento!AA522","v":{"$error":"#DIV/0!"}}]
["","6.",{"$f":"Orçamento!$P523","v":"INST. HIDROSSANITÁRIAS E COMBATE À INCÊNDIO"},null,null,null,{"$f":"IFERROR(Orçamento!S523,\"-\")","v":0},{"$f":"IFERROR(Orçamento!X523,\"\")","v":0},{"$f":"Orçamento!AA523","v":{"$error":"#DIV/0!"}}]
["","7.",{"$f":"Orçamento!$P524","v":"CENTRAL DE GÁS"},null,null,null,{"$f":"IFERROR(Orçamento!S524,\"-\")","v":0},{"$f":"IFERROR(Orçamento!X524,\"\")","v":0},{"$f":"Orçamento!AA524","v":{"$error":"#DIV/0!"}}]
["","8.",{"$f":"Orçamento!$P525","v":"RAMPA E ESCADA"},null,null,null,{"$f":"IFERROR(Orçamento!S525,\"-\")","v":0},{"$f":"IFERROR(Orçamento!X525,\"\")","v":0},{"$f":"Orçamento!AA525","v":{"$error":"#DIV/0!"}}]
["","9.",{"$f":"Orçamento!$P526","v":""},null,null,null,{"$f":"IFERROR(Orçamento!S526,\"-\")","v":0},{"$f":"IFERROR(Orçamento!X526,\"\")","v":0},{"$f":"Orçamento!AA526","v":{"$error":"#DIV/0!"}}]
["","10.",{"$f":"Orçamento!$P527","v":""},null,null,null,{"$f":"IFERROR(Orçamento!S527,\"-\")","v":0},{"$f":"IFERROR(Orçamento!X527,\"\")","v":0},{"$f":"Orçamento!AA527","v":{"$error":"#DIV/0!"}}]
["","11.",{"$f":"Orçamento!$P528","v":""},null,null,null,{"$f":"IFERROR(Orçamento!S528,\"-\")","v":0},{"$f":"IFERROR(Orçamento!X528,\"\")","v":0},{"$f":"Orçamento!AA528","v":{"$error":"#DIV/0!"}}]
["","12.",{"$f":"Orçamento!$P529","v":""},null,null,null,{"$f":"IFERROR(Orçamento!S529,\"-\")","v":0},{"$f":"IFERROR(Orçamento!X529,\"\")","v":0},{"$f":"Orçamento!AA529","v":{"$error":"#DIV/0!"}}]
["","13.",{"$f":"Orçamento!$P530","v":""},null,null,null,{"$f":"IFERROR(Orçamento!S530,\"-\")","v":0},{"$f":"IFERROR(Orçamento!X530,\"\")","v":0},{"$f":"Orçamento!AA530","v":{"$error":"#DIV/0!"}}]
["","14.",{"$f":"Orçamento!$P531","v":""},null,null,null,{"$f":"IFERROR(Orçamento!S531,\"-\")","v":0},{"$f":"IFERROR(Orçamento!X531,\"\")","v":0},{"$f":"Orçamento!AA531","v":{"$error":"#DIV/0!"}}]
["","15.",{"$f":"Orçamento!$P532","v":""},null,null,null,{"$f":"IFERROR(Orçamento!S532,\"-\")","v":0},{"$f":"IFERROR(Orçamento!X532,\"\")","v":0},{"$f":"Orçamento!AA532","v":{"$error":"#DIV/0!"}}]
["","16.",{"$f":"Orçamento!$P533","v":""},null,null,null,{"$f":"IFERROR(Orçamento!S533,\"-\")","v":0},{"$f":"IFERROR(Orçamento!X533,\"\")","v":0},{"$f":"Orçamento!AA533","v":{"$error":"#DIV/0!"}}]
["","17.",{"$f":"Orçamento!$P534","v":""},null,null,null,{"$f":"IFERROR(Orçamento!S534,\"-\")","v":0},{"$f":"IFERROR(Orçamento!X534,\"\")","v":0},{"$f":"Orçamento!AA534","v":{"$error":"#DIV/0!"}}]
["","18.",{"$f":"Orçamento!$P535","v":""},null,null,null,{"$f":"IFERROR(Orçamento!S535,\"-\")","v":0},{"$f":"IFERROR(Orçamento!X535,\"\")","v":0},{"$f":"Orçamento!AA535","v":{"$error":"#DIV/0!"}}]
["","19.",{"$f":"Orçamento!$P536","v":""},null,null,null,{"$f":"IFERROR(Orçamento!S536,\"-\")","v":0},{"$f":"IFERROR(Orçamento!X536,\"\")","v":0},{"$f":"Orçamento!AA536","v":{"$error":"#DIV/0!"}}]
["","20.",{"$f":"Orçamento!$P537","v":""},null,null,null,{"$f":"IFERROR(Orçamento!S537,\"-\")","v":0},{"$f":"IFERROR(Orçamento!X537,\"\")","v":0},{"$f":"Orçamento!AA537","v":{"$error":"#DIV/0!"}}]
["F","TOTAL GERAL DO ORÇAMENTO (R$)",null,null,null,null,{"$f":"SUM(G17:G36)","v":0},{"$f":"SUM(H17:H36)","v":0},{"$f":"SUM(I17:I36)","v":{"$error":"#DIV/0!"}}]
["F"]
["F"]

{"sheet":"Somatório","index":2,"n_rows":45,"n_cols":6,"rows_kept":45,"cut":false,"hidden":false,"merged":[[13,0,14,0],[42,1,42,2],[44,1,44,5],[47,3,47,5],[48,3,48,5],[13,1,13,5],[9,1,9,3],[9,4,9,5],[11,1,11,2],[11,4,11,5],[12,1,12,2],[12,4,12,5],[0,1,0,5],[14,1,14,5],[2,1,2,3],[2,4,2,5],[3,1,3,3],[3,4,3,5],[5,1,5,3],[5,4,5,5],[6,1,6,3],[6,4,6,5],[8,1,8,3],[8,4,8,5],[1,1,1,5],[4,1,4,5],[7,1,7,5],[10,1,10,5]]}
[]
[]
[null,"UNIDADE ESCOLAR",null,null,"CÓDIGO INEP"]
[null,{"$f":"Orçamento!$O$5","v":"COLÉGIO ESTADUAL DA POLÍCIA MILITAR DE GOIÁS DE MORRINHOS - XAVIER DE ALMEIDA"},null,null,{"$f":"Orçamento!X5","v":52060098}]
[]
[null,"OBRA",null,null,"CIDADE"]
[null,{"$f":"Orçamento!$O$8","v":"REFORMA  E AMPLIAÇÃO"},null,null,{"$f":"Orçamento!$X$8","v":"MORRINHOS"}]
[]
[null,"ENDEREÇO",null,null,"CRE"]
[null,{"$f":"Orçamento!$R$11","v":" AV JOSE NASCIMENTO S/N , SETOR OESTE , CEP:75650-000"},null,null,{"$f":"Orçamento!$O$11","v":"CRE-MORRINHOS"}]
[]
[null,"REFERÊNCIA",null,"DATA","ÁREA TOTAL CONSTRUÍDA (M²)"]
[null,{"$f":"CONCATENATE(\"AGETOP E SINAPI - \",Orçamento!$T$11)","v":"AGETOP E SINAPI - ONERADA"},null,{"$f":"Orçamento!$S$8","v":"2020-07-02"},{"$f":"Orçamento!$X$14","v":3977.5099999999998}]
["FILTRO"]
[null,"SOMATÓRIO DE SERVIÇOS"]
["↓","ITEM","DESCRIÇÃO DOS SERVIÇOS","PREÇO SEM BDI (R$)","PREÇO COM BDI (R$)","PARTIC.  ( % )"]
[{"$f":"IF(D17>0,\"F\",\"\")","v":""},"a.",{"$f":"Orçamento!P484","v":"SERVIÇOS PRELIMINARES"},{"$f":"Orçamento!S484","v":0},{"$f":"Orçamento!X484","v":0},{"$f":"Orçamento!AA484","v":0}]
[{"$f":"IF(D18>0,\"F\",\"\")","v":""},"b.",{"$f":"Orçamento!P485","v":"TRANSPORTES"},{"$f":"Orçamento!S485","v":0},{"$f":"Orçamento!X485","v":0},{"$f":"Orçamento!AA485","v":0}]
["","c.",{"$f":"Orçamento!P486","v":"SERVIÇO EM TERRA"},{"$f":"Orçamento!S486","v":0},{"$f":"Orçamento!X486","v":0},{"$f":"Orçamento!AA486","v":0}]
["","d.",{"$f":"Orçamento!P487","v":"FUNDAÇÕES E SONDAGENS"},{"$f":"Orçamento!S487","v":0},{"$f":"Orçamento!X487","v":0},{"$f":"Orçamento!AA487","v":0}]
["","e.",{"$f":"Orçamento!P488","v":"ESTRUTURA"},{"$f":"Orçamento!S488","v":0},{"$f":"Orçamento!X488","v":0},{"$f":"Orçamento!AA488","v":0}]
["","f.",{"$f":"Orçamento!P489","v":"INSTALAÇÕES ELÉTRICAS"},{"$f":"Orçamento!S489","v":0},{"$f":"Orçamento!X489","v":0},{"$f":"Orçamento!AA489","v":0}]
["","g.",{"$f":"Orçamento!P490","v":"INSTALAÇÕES HIDROSSANITÁRIAS"},{"$f":"Orçamento!S490","v":0},{"$f":"Orçamento!X490","v":0},{"$f":"Orçamento!AA490","v":0}]
["","h",{"$f":"Orçamento!P491","v":"INSTALAÇÕES ESPECIAIS"},{"$f":"Orçamento!S491","v":0},{"$f":"Orçamento!X491","v":0},{"$f":"Orçamento!AA491","v":0}]
["","i.",{"$f":"Orçamento!P492","v":"ALVENARIAS E DIVISÓRIAS"},{"$f":"Orçamento!S492","v":0},{"$f":"Orçamento!X492","v":0},{"$f":"Orçamento!AA492","v":0}]
["","j.",{"$f":"Orçamento!P493","v":"ALVENARIA AUTO-PORTANTE"},{"$f":"Orçamento!S493","v":0},{"$f":"Orçamento!X493","v":0},{"$f":"Orçamento!AA493","v":0}]
["","k.",{"$f":"Orçamento!P494","v":"IMPERMEABILIZAÇÃO"},{"$f":"Orçamento!S494","v":0},{"$f":"Orçamento!X494","v":0},{"$f":"Orçamento!AA494","v":0}]
["","l.",{"$f":"Orçamento!P495","v":"ISOLAMENTO TÉRMICO E ACÚSTICO"},{"$f":"Orçamento!S495","v":0},{"$f":"Orçamento!X495","v":0},{"$f":"Orçamento!AA495","v":0}]
["","m.",{"$f":"Orçamento!P496","v":"ESTRUTURA DE MADEIRA"},{"$f":"Orçamento!S496","v":0},{"$f":"Orçamento!X496","v":0},{"$f":"Orçamento!AA496","v":0}]
["","n.",{"$f":"Orçamento!P497","v":"ESTRUTURAS METÁLICAS"},{"$f":"Orçamento!S497","v":0},{"$f":"Orçamento!X497","v":0},{"$f":"Orçamento!AA497","v":0}]
["","o.",{"$f":"Orçamento!P498","v":"COBERTURAS"},{"$f":"Orçamento!S498","v":0},{"$f":"Orçamento!X498","v":0},{"$f":"Orçamento!AA498","v":0}]
["","p.",{"$f":"Orçamento!P499","v":"ESQUADRIAS DE MADEIRA"},{"$f":"Orçamento!S499","v":0},{"$f":"Orçamento!X499","v":0},{"$f":"Orçamento!AA499","v":0}]
["","q.",{"$f":"Orçamento!P500","v":"ESQUADRIAS METÁLICAS"},{"$f":"Orçamento!S500","v":0},{"$f":"Orçamento!X500","v":0},{"$f":"Orçamento!AA500","v":0}]
["","r.",{"$f":"Orçamento!P501","v":"VIDROS"},{"$f":"Orçamento!S501","v":0},{"$f":"Orçamento!X501","v":0},{"$f":"Orçamento!AA501","v":0}]
["","s.",{"$f":"Orçamento!P502","v":"REVESTIMENTO DE PAREDE"},{"$f":"Orçamento!S502","v":0},{"$f":"Orçamento!X502","v":0},{"$f":"Orçamento!AA502","v":0}]
["","t.",{"$f":"Orçamento!P503","v":"FORROS"},{"$f":"Orçamento!S503","v":0},{"$f":"Orçamento!X503","v":0},{"$f":"Orçamento!AA503","v":0}]
["","u.",{"$f":"Orçamento!P504","v":"REVESTIMENTO DE PISO"},{"$f":"Orçamento!S504","v":0},{"$f":"Orçamento!X504","v":0},{"$f":"Orçamento!AA504","v":0}]
["","v.",{"$f":"Orçamento!P505","v":"FERRAGENS"},{"$f":"Orçamento!S505","v":0},{"$f":"Orçamento!X505","v":0},{"$f":"Orçamento!AA505","v":0}]
["","w.",{"$f":"Orçamento!P506","v":"MARCENARIA"},{"$f":"Orçamento!S506","v":0},{"$f":"Orçamento!X506","v":0},{"$f":"Orçamento!AA506","v":0}]
["","x.",{"$f":"Orçamento!P507","v":"ADMINISTRAÇÃO"},{"$f":"Orçamento!S507","v":0},{"$f":"Orçamento!X507","v":0},{"$f":"Orçamento!AA507","v":0}]
["","y.",{"$f":"Orçamento!P508","v":"PINTURA"},{"$f":"Orçamento!S508","v":0},{"$f":"Orçamento!X508","v":0},{"$f":"Orçamento!AA508","v":0}]
["","z.",{"$f":"Orçamento!P509","v":"DIVERSOS"},{"$f":"Orçamento!S509","v":0},{"$f":"Orçamento!X509","v":0},{"$f":"Orçamento!AA509","v":0}]
["F","TOTAL GERAL DO ORÇAMENTO",null,{"$f":"SUM(D17:D42)","v":0},{"$f":"SUM(E17:E42)","v":0},{"$f":"SUM(F17:F42)","v":0}]
[]
[null,"(*) Para itens da AGETOP, os vidros não estão inclusos nas esquadrias e já foram considerados os custos de contramarco para as esquadrias de alumínio;"]

{"sheet":"Cronog_90_Dias","index":3,"n_rows":99,"n_cols":20,"rows_kept":99,"cut":false,"hidden":false,"merged":[[0,1,0,17],[1,1,1,17],[2,1,2,7],[2,8,2,17],[3,1,3,7],[3,8,3,17],[8,1,8,7],[8,8,8,17],[9,0,11,0],[9,1,9,7],[9,8,9,17],[10,1,10,17],[11,1,11,17],[4,1,4,17],[5,1,5,7],[5,8,5,17],[6,1,6,7],[6,8,6,17],[7,1,7,17],[12,0,13,0],[12,3,13,3],[12,5,12,8],[12,9,12,12],[12,13,12,16],[12,17,13,17],[13,1,13,2],[13,5,13,8],[13,9,13,12],[13,13,13,16],[14,1,16,2],[14,3,16,3],[14,4,16,4],[14,5,14,8],[14,9,14,12],[14,13,14,16],[16,5,16,8],[16,9,16,12],[16,13,16,16],[17,1,19,2],[17,3,19,3],[17,4,19,4],[17,5,17,8],[17,9,17,12],[17,13,17,16],[19,5,19,8],[19,9,19,12],[19,13,19,16],[20,1,22,2],[20,3,22,3],[20,4,22,4],[20,5,20,8],[20,9,20,12],[20,13,20,16],[22,5,22,8],[22,9,22,12],[22,13,22,16],[23,1,25,2],[23,3,25,3],[23,4,25,4],[23,5,23,8],[23,9,23,12],[23,13,23,16],[25,5,25,8],[25,9,25,12],[25,13,25,16],[26,1,28,2],[26,3,28,3],[26,4,28,4],[26,5,26,8],[26,9,26,12],[26,13,26,16],[28,5,28,8],[28,9,28,12],[28,13,28,16],[29,1,31,2],[29,3,31,3],[29,4,31,4],[29,5,29,8],[29,9,29,12],[29,13,29,16],[31,5,31,8],[31,9,31,12],[31,13,31,16],[32,1,34,2],[32,3,34,3],[32,4,34,4],[32,5,32,8],[32,9,32,12],[32,13,32,16],[34,5,34,8],[34,9,34,12],[34,13,34,16],[35,1,37,2],[35,3,37,3],[35,4,37,4],[35,5,35,8],[35,9,35,12],[35,13,35,16],[37,5,37,8],[37,9,37,12],[37,13,37,16],[38,1,40,2],[38,3,40,3],[38,4,40,4],[38,5,38,8],[38,9,38,12],[38,13,38,16],[40,5,40,8],[40,9,40,12],[40,13,40,16],[41,1,43,2],[41,3,43,3],[41,4,43,4],[41,5,41,8],[41,9,41,12],[41,13,41,16],[43,5,43,8],[43,9,43,12],[43,13,43,16],[44,1,46,2],[44,3,46,3],[44,4,46,4],[44,5,44,8],[44,9,44,12],[44,13,44,16],[46,5,46,8],[46,9,46,12],[46,13,46,16],[47,1,49,2],[47,3,49,3],[47,4,49,4],[47,5,47,8],[47,9,47,12],[47,13,47,16],[49,5,49,8],[49,9,49,12],[49,13,49,16],[50,1,52,2],[50,3,52,3],[50,4,52,4],[50,5,50,8],[50,9,50,12],[50,13,50,16],[52,5,52,8],[52,9,52,12],[52,13,52,16],[53,1,55,2],[53,3,55,3],[53,4,55,4],[53,5,53,8],[53,9,53,12],[53,13,53,16],[55,5,55,8],[55,9,55,12],[55,13,55,16],[56,1,58,2],[56,3,58,3],[56,4,58,4],[56,5,56,8],[56,9,56,12],[56,13,56,16],[58,5,58,8],[58,9,58,12],[58,13,58,16],[59,1,61,2],[59,3,61,3],[59,4,61,4],[59,5,59,8],[59,9,59,12],[59,13,59,16],[61,5,61,8],[61,9,61,12],[61,13,61,16],[62,1,64,2],[62,3,64,3],[62,4,64,4],[62,5,62,8],[62,9,62,12],[62,13,62,16],[64,5,64,8],[64,9,64,12],[64,13,64,16],[65,1,67,2],[65,3,67,3],[65,4,67,4],[65,5,65,8],[65,9,65,12],[65,13,65,16],[67,5,67,8],[67,9,67,12],[67,13,67,16],[68,1,70,2],[68,3,70,3],[68,4,70,4],[68,5,68,8],[68,9,68,12],[68,13,68,16],[70,5,70,8],[70,9,70,12],[70,13,70,16],[71,1,73,2],[71,3,73,3],[71,4,73,4],[71,5,71,8],[71,9,71,12],[71,13,71,16],[73,5,73,8],[73,9,73,12],[73,13,73,16],[74,1,76,2],[74,3,76,3],[74,4,76,4],[74,5,74,8],[74,9,74,12],[74,13,74,16],[76,5,76,8],[76,9,76,12],[76,13,76,16],[77,1,79,2],[77,3,79,3],[77,4,79,4],[77,5,77,8],[77,9,77,12],[77,13,77,16],[79,5,79,8],[79,9,79,12],[79,13,79,16],[80,1,82,2],[80,3,82,3],[80,4,82,4],[80,5,80,8],[80,9,80,12],[80,13,80,16],[82,5,82,8],[82,9,82,12],[82,13,82,16],[83,1,85,2],[83,3,85,3],[83,4,85,4],[83,5,83,8],[83,9,83,12],[83,13,83,16],[85,5,85,8],[85,9,85,12],[85,13,85,16],[86,1,88,2],[86,3,88,3],[86,4,88,4],[86,5,86,8],[86,9,86,12],[86,13,86,16],[88,5,88,8],[88,9,88,12],[88,13,88,16],[92,1,92,2],[92,5,92,8],[92,9,92,12],[92,13,92,16],[93,1,93,2],[93,5,93,8],[93,9,93,12],[93,13,93,16],[89,1,91,2],[89,3,91,3],[89,4,91,4],[89,5,89,8],[89,9,89,12],[89,13,89,16],[91,5,91,8],[91,9,91,12],[91,13,91,16],[97,1,97,4],[98,1,98,17],[94,1,94,2],[94,5,94,8],[94,9,94,12],[94,13,94,16],[95,1,95,2],[95,5,95,8],[95,9,95,12],[95,13,95,16]]}
[]
[]
[null,"UNIDADE ESCOLAR",null,null,null,null,null,null,"PRAZO"]
[null,{"$f":"Orçamento!O5","v":"COLÉGIO ESTADUAL DA POLÍCIA MILITAR DE GOIÁS DE MORRINHOS - XAVIER DE ALMEIDA"},null,null,null,null,null,null,"90 DIAS CORRIDOS"]
[]
[null,"OBRA",null,null,null,null,null,null,"DATA"]
[null,{"$f":"Orçamento!O8","v":"REFORMA  E AMPLIAÇÃO"},null,null,null,null,null,null,{"$f":"Orçamento!S8","v":"2020-07-02"}]
[]
[null,"LOCAL",null,null,null,null,null,null,"ÁREA TOTAL CONSTRUÍDA (M²)"]
["FILTRO",{"$f":"Orçamento!X8","v":"MORRINHOS"},null,null,null,null,null,null,{"$f":"Orçamento!X14","v":3977.5099999999998}]
[]
[null,"CRONOGRAMA - FÍSICO FINANCEIRO"]
["↓","CUSTO TOTAL:",{"$f":"D93","v":0},"VALOR","Dias:",30,null,null,null,60,null,null,null,90,null,null,null,"TOTAL"]
[null,"DESCRIÇÃO DOS SERVIÇOS",null,null,"%","1ª PARCELA",null,null,null,"2ª PARCELA",null,null,null,"3ª PARCELA"]
[{"$f":"IF(D15>0,\"F\",\"\")","v":""},"SERVIÇOS PRELIMINARES",null,{"$f":"Orçamento!X484","v":0},{"$f":"Orçamento!AA484","v":0},{"$f":"ROUND(F17*$D$15,2)","v":0},null,null,null,{"$f":"ROUND(J17*$D$15,2)","v":0},null,null,null,{"$f":"ROUND(N17*$D$15,2)","v":0},null,null,null,{"$f":"SUM(F15:Q15)","v":0},null,{"$f":"IF(D15=R15,\"OK\",\"ERRO\")","v":"OK"}]
[{"$f":"IF(A15=\"F\",A15,\"\")","v":""}]
[{"$f":"IF(A16=\"F\",A16,\"\")","v":""},null,null,null,null,1,null,null,null,0,null,null,null,{"$f":"1-F17-J17","v":0},null,null,null,{"$f":"IFERROR(E15/100,\"\")","v":0},null,{"$f":"IF(E15=R17*100,\"OK\",\"ERRO\")","v":"OK"}]
[{"$f":"IF(D18>0,\"F\",\"\")","v":""},"TRANSPORTES",null,{"$f":"Orçamento!X485","v":0},{"$f":"Orçamento!AA485","v":0},{"$f":"ROUND(F20*$D$18,2)","v":0},null,null,null,{"$f":"ROUND(J20*$D$18,2)","v":0},null,null,null,{"$f":"ROUND(N20*$D$18,2)","v":0},null,null,null,{"$f":"SUM(F18:Q18)","v":0},null,{"$f":"IF(D18=R18,\"OK\",\"ERRO\")","v":"OK"}]
[{"$f":"IF(A18=\"F\",A18,\"\")","v":""}]
[{"$f":"IF(A19=\"F\",A19,\"\")","v":""},null,null,null,null,0.36899999999999999,null,null,null,0.3,null,null,null,{"$f":"1-F20-J20","v":0.33100000000000002},null,null,null,{"$f":"IFERROR(E18/100,\"\")","v":0},null,{"$f":"IF(E18=R20*100,\"OK\",\"ERRO\")","v":"OK"}]
[{"$f":"IF(D21>0,\"F\",\"\")","v":""},"SERVIÇO EM TERRA",null,{"$f":"Orçamento!X486","v":0},{"$f":"Orçamento!AA486","v":0},{"$f":"ROUND(F23*$D$21,2)","v":0},null,null,null,{"$f":"ROUND(J23*$D$21,2)","v":0},null,null,null,{"$f":"ROUND(N23*$D$21,2)","v":0},null,null,null,{"$f":"SUM(F21:Q21)","v":0},null,{"$f":"IF(D21=R21,\"OK\",\"ERRO\")","v":"OK"}]
[{"$f":"IF(A21=\"F\",A21,\"\")","v":""}]
[{"$f":"IF(A22=\"F\",A22,\"\")","v":""},null,null,null,null,1,null,null,null,0,null,null,null,{"$f":"1-F23-J23","v":0},null,null,null,{"$f":"IFERROR(E21/100,\"\")","v":0},null,{"$f":"IF(E21=R23*100,\"OK\",\"ERRO\")","v":"OK"}]
[{"$f":"IF(D24>0,\"F\",\"\")","v":""},"FUNDAÇÕES E SONDAGENS",null,{"$f":"Orçamento!X487","v":0},{"$f":"Orçamento!AA487","v":0},{"$f":"ROUND(F26*$D$24,2)","v":0},null,null,null,{"$f":"ROUND(J26*$D$24,2)","v":0},null,null,null,{"$f":"ROUND(N26*$D$24,2)","v":0},null,null,null,{"$f":"SUM(F24:Q24)","v":0},null,{"$f":"IF(D24=R24,\"OK\",\"ERRO\")","v":"OK"}]
[{"$f":"IF(A24=\"F\",A24,\"\")","v":""}]
[{"$f":"IF(A25=\"F\",A25,\"\")","v":""},null,null,null,null,1,null,null,null,0,null,null,null,{"$f":"1-F26-J26","v":0},null,null,null,{"$f":"IFERROR(E24/100,\"\")","v":0},null,{"$f":"IF(E24=R26*100,\"OK\",\"ERRO\")","v":"OK"}]
[{"$f":"IF(D27>0,\"F\",\"\")","v":""},"ESTRUTURA",null,{"$f":"Orçamento!X488","v":0},{"$f":"Orçamento!AA488","v":0},{"$f":"ROUND(F29*$D$27,2)","v":0},null,null,null,{"$f":"ROUND(J29*$D$27,2)","v":0},null,null,null,{"$f":"ROUND(N29*$D$27,2)","v":0},null,null,null,{"$f":"SUM(F27:Q27)","v":0},null,{"$f":"IF(D27=R27,\"OK\",\"ERRO\")","v":"OK"}]
[{"$f":"IF(A27=\"F\",A27,\"\")","v":""}]
[{"$f":"IF(A28=\"F\",A28,\"\")","v":""},null,null,null,null,0.54,null,null,null,0.46,null,null,null,{"$f":"1-F29-J29","v":0},null,null,null,{"$f":"IFERROR(E27/100,\"\")","v":0},null,{"$f":"IF(E27=R29*100,\"OK\",\"ERRO\")","v":"OK"}]
[{"$f":"IF(D30>0,\"F\",\"\")","v":""},"INST.ELET/TELEFÔNICA/CABEAMENTO ESTRUTURADO",null,{"$f":"Orçamento!X489","v":0},{"$f":"Orçamento!AA489","v":0},{"$f":"ROUND(F32*$D$30,2)","v":0},null,null,null,{"$f":"ROUND(J32*$D$30,2)","v":0},null,null,null,{"$f":"ROUND(N32*$D$30,2)","v":0},null,null,null,{"$f":"SUM(F30:Q30)","v":0},null,{"$f":"IF(D30=R30,\"OK\",\"ERRO\")","v":"OK"}]
[{"$f":"IF(A30=\"F\",A30,\"\")","v":""}]
[{"$f":"IF(A31=\"F\",A31,\"\")","v":""},null,null,null,null,0.3,null,null,null,0.7,null,null,null,{"$f":"1-F32-J32","v":0},null,null,null,{"$f":"IFERROR(E30/100,\"\")","v":0},null,{"$f":"IF(E30=R32*100,\"OK\",\"ERRO\")","v":"OK"}]
[{"$f":"IF(D33>0,\"F\",\"\")","v":""},"INSTALAÇÕES HIDROSSANITÁRIAS",null,{"$f":"Orçamento!X490","v":0},{"$f":"Orçamento!AA490","v":0},{"$f":"ROUND(F35*$D$33,2)","v":0},null,null,null,{"$f":"ROUND(J35*$D$33,2)","v":0},null,null,null,{"$f":"ROUND(N35*$D$33,2)","v":0},null,null,null,{"$f":"SUM(F33:Q33)","v":0},null,{"$f":"IF(D33=R33,\"OK\",\"ERRO\")","v":"OK"}]
[{"$f":"IF(A33=\"F\",A33,\"\")","v":""}]
[{"$f":"IF(A34=\"F\",A34,\"\")","v":""},null,null,null,null,0.3,null,null,null,0.7,null,null,null,{"$f":"1-F35-J35","v":0},null,null,null,{"$f":"IFERROR(E33/100,\"\")","v":0},null,{"$f":"IF(E33=R35*100,\"OK\",\"ERRO\")","v":"OK"}]
[{"$f":"IF(D36>0,\"F\",\"\")","v":""},"INSTALAÇÕES ESPECIAIS",null,{"$f":"Orçamento!X491","v":0},{"$f":"Orçamento!AA491","v":0},{"$f":"ROUND(F38*$D$36,2)","v":0},null,null,null,{"$f":"ROUND(J38*$D$36,2)","v":0},null,null,null,{"$f":"ROUND(N38*$D$36,2)","v":0},null,null,null,{"$f":"SUM(F36:Q36)","v":0},null,{"$f":"IF(D36=R36,\"OK\",\"ERRO\")","v":"OK"}]
[{"$f":"IF(A36=\"F\",A36,\"\")","v":""}]
[{"$f":"IF(A37=\"F\",A37,\"\")","v":""},null,null,null,null,0.3,null,null,null,0.7,null,null,null,{"$f":"1-F38-J38","v":0},null,null,null,{"$f":"IFERROR(E36/100,\"\")","v":0},null,{"$f":"IF(E36=R38*100,\"OK\",\"ERRO\")","v":"OK"}]
[{"$f":"IF(D39>0,\"F\",\"\")","v":""},"ALVENARIA E DIVISÓRIAS",null,{"$f":"Orçamento!X492","v":0},{"$f":"Orçamento!AA492","v":0},{"$f":"ROUND(F41*$D$39,2)","v":0},null,null,null,{"$f":"ROUND(J41*$D$39,2)","v":0},null,null,null,{"$f":"ROUND(N41*$D$39,2)","v":0},null,null,null,{"$f":"SUM(F39:Q39)","v":0},null,{"$f":"IF(D39=R39,\"OK\",\"ERRO\")","v":"OK"}]
[{"$f":"IF(A39=\"F\",A39,\"\")","v":""}]
[{"$f":"IF(A40=\"F\",A40,\"\")","v":""},null,null,null,null,0.3,null,null,null,0.7,null,null,null,{"$f":"1-F41-J41","v":0},null,null,null,{"$f":"IFERROR(E39/100,\"\")","v":0},null,{"$f":"IF(E39=R41*100,\"OK\",\"ERRO\")","v":"OK"}]
[{"$f":"IF(D42>0,\"F\",\"\")","v":""},"ALVENARIA AUTO-PORTANTE",null,{"$f":"Orçamento!X493","v":0},{"$f":"Orçamento!AA493","v":0},{"$f":"ROUND(F44*$D$42,2)","v":0},null,null,null,{"$f":"ROUND(J44*$D$42,2)","v":0},null,null,null,{"$f":"ROUND(N44*$D$42,2)","v":0},null,null,null,{"$f":"SUM(F42:Q42)","v":0},null,{"$f":"IF(D42=R42,\"OK\",\"ERRO\")","v":"OK"}]
[{"$f":"IF(A42=\"F\",A42,\"\")","v":""}]
[{"$f":"IF(A43=\"F\",A43,\"\")","v":""},null,null,null,null,0,null,null,null,{"$f":"1-B44","v":1},null,null,null,{"$f":"1-F44-J44","v":0},null,null,null,{"$f":"IFERROR(E42/100,\"\")","v":0},null,{"$f":"IF(E42=R44*100,\"OK\",\"ERRO\")","v":"OK"}]
[{"$f":"IF(D45>0,\"F\",\"\")","v":""},"IMPERMEABILIZAÇÃO",null,{"$f":"Orçamento!X494","v":0},{"$f":"Orçamento!AA494","v":0},{"$f":"ROUND(F47*$D$45,2)","v":0},null,null,null,{"$f":"ROUND(J47*$D$45,2)","v":0},null,null,null,{"$f":"ROUND(N47*$D$45,2)","v":0},null,null,null,{"$f":"SUM(F45:Q45)","v":0},null,{"$f":"IF(D45=R45,\"OK\",\"ERRO\")","v":"OK"}]
[{"$f":"IF(A45=\"F\",A45,\"\")","v":""}]
[{"$f":"IF(A46=\"F\",A46,\"\")","v":""},null,null,null,null,0.85,null,null,null,0.15,null,null,null,{"$f":"1-F47-J47","v":0},null,null,null,{"$f":"IFERROR(E45/100,\"\")","v":0},null,{"$f":"IF(E45=R47*100,\"OK\",\"ERRO\")","v":"OK"}]
[{"$f":"IF(D48>0,\"F\",\"\")","v":""},"ISOLAMENTO TÉRMICO E ACÚSTICO",null,{"$f":"Orçamento!X495","v":0},{"$f":"Orçamento!AA495","v":0},{"$f":"ROUND(F50*$D$48,2)","v":0},null,null,null,{"$f":"ROUND(J50*$D$48,2)","v":0},null,null,null,{"$f":"ROUND(N50*$D$48,2)","v":0},null,null,null,{"$f":"SUM(F48:Q48)","v":0},null,{"$f":"IF(D48=R48,\"OK\",\"ERRO\")","v":"OK"}]
[{"$f":"IF(A48=\"F\",A48,\"\")","v":""}]
[{"$f":"IF(A49=\"F\",A49,\"\")","v":""},null,null,null,null,0,null,null,null,{"$f":"1-B50","v":1},null,null,null,{"$f":"1-F50-J50","v":0},null,null,null,{"$f":"IFERROR(E48/100,\"\")","v":0},null,{"$f":"IF(E48=R50*100,\"OK\",\"ERRO\")","v":"OK"}]
[{"$f":"IF(D51>0,\"F\",\"\")","v":""},"ESTRUTURA DE MADEIRA",null,{"$f":"Orçamento!X496","v":0},{"$f":"Orçamento!AA496","v":0},{"$f":"ROUND(F53*$D$51,2)","v":0},null,null,null,{"$f":"ROUND(J53*$D$51,2)","v":0},null,null,null,{"$f":"ROUND(N53*$D$51,2)","v":0},null,null,null,{"$f":"SUM(F51:Q51)","v":0},null,{"$f":"IF(D51=R51,\"OK\",\"ERRO\")","v":"OK"}]
[{"$f":"IF(A51=\"F\",A51,\"\")","v":""}]
[{"$f":"IF(A52=\"F\",A52,\"\")","v":""},null,null,null,null,0,null,null,null,0.57999999999999996,null,null,null,{"$f":"1-F53-J53","v":0.42000000000000004},null,null,null,{"$f":"IFERROR(E51/100,\"\")","v":0},null,{"$f":"IF(E51=R53*100,\"OK\",\"ERRO\")","v":"OK"}]
[{"$f":"IF(D54>0,\"F\",\"\")","v":""},"ESTRUTURA METÁLICA",null,{"$f":"Orçamento!X497","v":0},{"$f":"Orçamento!AA497","v":0},{"$f":"ROUND(F56*$D$54,2)","v":0},null,null,null,{"$f":"ROUND(J56*$D$54,2)","v":0},null,null,null,{"$f":"ROUND(N56*$D$54,2)","v":0},null,null,null,{"$f":"SUM(F54:Q54)","v":0},null,{"$f":"IF(D54=R54,\"OK\",\"ERRO\")","v":"OK"}]
[{"$f":"IF(A54=\"F\",A54,\"\")","v":""}]
[{"$f":"IF(A55=\"F\",A55,\"\")","v":""},null,null,null,null,0,null,null,null,0.57999999999999996,null,null,null,{"$f":"1-F56-J56","v":0.42000000000000004},null,null,null,{"$f":"IFERROR(E54/100,\"\")","v":0},null,{"$f":"IF(E54=R56*100,\"OK\",\"ERRO\")","v":"OK"}]
[{"$f":"IF(D57>0,\"F\",\"\")","v":""},"COBERTURAS",null,{"$f":"Orçamento!X498","v":0},{"$f":"Orçamento!AA498","v":0},{"$f":"ROUND(F59*$D$57,2)","v":0},null,null,null,{"$f":"ROUND(J59*$D$57,2)","v":0},null,null,null,{"$f":"ROUND(N59*$D$57,2)","v":0},null,null,null,{"$f":"SUM(F57:Q57)","v":0},null,{"$f":"IF(D57=R57,\"OK\",\"ERRO\")","v":"OK"}]
[{"$f":"IF(A57=\"F\",A57,\"\")","v":""}]
[{"$f":"IF(A58=\"F\",A58,\"\")","v":""},null,null,null,null,0,null,null,null,0,null,null,null,{"$f":"1-F59-J59","v":1},null,null,null,{"$f":"IFERROR(E57/100,\"\")","v":0},null,{"$f":"IF(E57=R59*100,\"OK\",\"ERRO\")","v":"OK"}]
[{"$f":"IF(D60>0,\"F\",\"\")","v":""},"ESQUADRIAS DE MADEIRA",null,{"$f":"Orçamento!X499","v":0},{"$f":"Orçamento!AA499","v":0},{"$f":"ROUND(F62*$D$60,2)","v":0},null,null,null,{"$f":"ROUND(J62*$D$60,2)","v":0},null,null,null,{"$f":"ROUND(N62*$D$60,2)","v":0},null,null,null,{"$f":"SUM(F60:Q60)","v":0},null,{"$f":"IF(D60=R60,\"OK\",\"ERRO\")","v":"OK"}]
[{"$f":"IF(A60=\"F\",A60,\"\")","v":""}]
[{"$f":"IF(A61=\"F\",A61,\"\")","v":""},null,null,null,null,0,null,null,null,0.4,null,null,null,{"$f":"1-F62-J62","v":0.6},null,null,null,{"$f":"IFERROR(E60/100,\"\")","v":0},null,{"$f":"IF(E60=R62*100,\"OK\",\"ERRO\")","v":"OK"}]
[{"$f":"IF(D63>0,\"F\",\"\")","v":""},"ESQUADRIAS METÁLICAS",null,{"$f":"Orçamento!X500","v":0},{"$f":"Orçamento!AA500","v":0},{"$f":"ROUND(F65*$D$63,2)","v":0},null,null,null,{"$f":"ROUND(J65*$D$63,2)","v":0},null,null,null,{"$f":"ROUND(N65*$D$63,2)","v":0},null,null,null,{"$f":"SUM(F63:Q63)","v":0},null,{"$f":"IF(D63=R63,\"OK\",\"ERRO\")","v":"OK"}]
[{"$f":"IF(A63=\"F\",A63,\"\")","v":""}]
[{"$f":"IF(A64=\"F\",A64,\"\")","v":""},null,null,null,null,0,null,null,null,0.45,null,null,null,{"$f":"1-F65-J65","v":0.55000000000000004},null,null,null,{"$f":"IFERROR(E63/100,\"\")","v":0},null,{"$f":"IF(E63=R65*100,\"OK\",\"ERRO\")","v":"OK"}]
[{"$f":"IF(D66>0,\"F\",\"\")","v":""},"VIDROS",null,{"$f":"Orçamento!X501","v":0},{"$f":"Orçamento!AA501","v":0},{"$f":"ROUND(F68*$D$66,2)","v":0},null,null,null,{"$f":"ROUND(J68*$D$66,2)","v":0},null,null,null,{"$f":"ROUND(N68*$D$66,2)","v":0},null,null,null,{"$f":"SUM(F66:Q66)","v":0},null,{"$f":"IF(D66=R66,\"OK\",\"ERRO\")","v":"OK"}]
[{"$f":"IF(A66=\"F\",A66,\"\")","v":""}]
[{"$f":"IF(A67=\"F\",A67,\"\")","v":""},null,null,null,null,0,null,null,null,0,null,null,null,{"$f":"1-F68-J68","v":1},null,null,null,{"$f":"IFERROR(E66/100,\"\")","v":0},null,{"$f":"IF(E66=R68*100,\"OK\",\"ERRO\")","v":"OK"}]
[{"$f":"IF(D69>0,\"F\",\"\")","v":""},"REVESTIMENTO DE PAREDE",null,{"$f":"Orçamento!X502","v":0},{"$f":"Orçamento!AA502","v":0},{"$f":"ROUND(F71*$D$69,2)","v":0},null,null,null,{"$f":"ROUND(J71*$D$69,2)","v":0},null,null,null,{"$f":"ROUND(N71*$D$69,2)","v":0},null,null,null,{"$f":"SUM(F69:Q69)","v":0},null,{"$f":"IF(D69=R69,\"OK\",\"ERRO\")","v":"OK"}]
[{"$f":"IF(A69=\"F\",A69,\"\")","v":""}]
[{"$f":"IF(A70=\"F\",A70,\"\")","v":""},null,null,null,null,0,null,null,null,0.4,null,null,null,{"$f":"1-F71-J71","v":0.6},null,null,null,{"$f":"IFERROR(E69/100,\"\")","v":0},null,{"$f":"IF(E69=R71*100,\"OK\",\"ERRO\")","v":"OK"}]
[{"$f":"IF(D72>0,\"F\",\"\")","v":""},"FORROS",null,{"$f":"Orçamento!X503","v":0},{"$f":"Orçamento!AA503","v":0},{"$f":"ROUND(F74*$D$72,2)","v":0},null,null,null,{"$f":"ROUND(J74*$D$72,2)","v":0},null,null,null,{"$f":"ROUND(N74*$D$72,2)","v":0},null,null,null,{"$f":"SUM(F72:Q72)","v":0},null,{"$f":"IF(D72=R72,\"OK\",\"ERRO\")","v":"OK"}]
[{"$f":"IF(A72=\"F\",A72,\"\")","v":""}]
[{"$f":"IF(A73=\"F\",A73,\"\")","v":""},null,null,null,null,0,null,null,null,0.4,null,null,null,{"$f":"1-F74-J74","v":0.6},null,null,null,{"$f":"IFERROR(E72/100,\"\")","v":0},null,{"$f":"IF(E72=R74*100,\"OK\",\"ERRO\")","v":"OK"}]
[{"$f":"IF(D75>0,\"F\",\"\")","v":""},"REVESTIMENTO DE PISO",null,{"$f":"Orçamento!X504","v":0},{"$f":"Orçamento!AA504","v":0},{"$f":"ROUND(F77*$D$75,2)","v":0},null,null,null,{"$f":"ROUND(J77*$D$75,2)","v":0},null,null,null,{"$f":"ROUND(N77*$D$75,2)","v":0},null,null,null,{"$f":"SUM(F75:Q75)","v":0},null,{"$f":"IF(D75=R75,\"OK\",\"ERRO\")","v":"OK"}]
[{"$f":"IF(A75=\"F\",A75,\"\")","v":""}]
[{"$f":"IF(A76=\"F\",A76,\"\")","v":""},null,null,null,null,0,null,null,null,0.4,null,null,null,{"$f":"1-F77-J77","v":0.6},null,null,null,{"$f":"IFERROR(E75/100,\"\")","v":0},null,{"$f":"IF(E75=R77*100,\"OK\",\"ERRO\")","v":"OK"}]
[{"$f":"IF(D78>0,\"F\",\"\")","v":""},"FERRAGENS",null,{"$f":"Orçamento!X505","v":0},{"$f":"Orçamento!AA505","v":0},{"$f":"ROUND(F80*$D$78,2)","v":0},null,null,null,{"$f":"ROUND(J80*$D$78,2)","v":0},null,null,null,{"$f":"ROUND(N80*$D$78,2)","v":0},null,null,null,{"$f":"SUM(F78:Q78)","v":0},null,{"$f":"IF(D78=R78,\"OK\",\"ERRO\")","v":"OK"}]
[{"$f":"IF(A78=\"F\",A78,\"\")","v":""}]
[{"$f":"IF(A79=\"F\",A79,\"\")","v":""},null,null,null,null,0,null,null,null,0,null,null,null,{"$f":"1-F80-J80","v":1},null,null,null,{"$f":"IFERROR(E78/100,\"\")","v":0},null,{"$f":"IF(E78=R80*100,\"OK\",\"ERRO\")","v":"OK"}]
[{"$f":"IF(D81>0,\"F\",\"\")","v":""},"MARCENARIA",null,{"$f":"Orçamento!X506","v":0},{"$f":"Orçamento!AA506","v":0},{"$f":"ROUND(F83*$D$81,2)","v":0},null,null,null,{"$f":"ROUND(J83*$D$81,2)","v":0},null,null,null,{"$f":"ROUND(N83*$D$81,2)","v":0},null,null,null,{"$f":"SUM(F81:Q81)","v":0},null,{"$f":"IF(D81=R81,\"OK\",\"ERRO\")","v":"OK"}]
[{"$f":"IF(A81=\"F\",A81,\"\")","v":""}]
[{"$f":"IF(A82=\"F\",A82,\"\")","v":""},null,null,null,null,0,null,null,null,0,null,null,null,{"$f":"1-F83-J83","v":1},null,null,null,{"$f":"IFERROR(E81/100,\"\")","v":0},null,{"$f":"IF(E81=R83*100,\"OK\",\"ERRO\")","v":"OK"}]
[{"$f":"IF(D84>0,\"F\",\"\")","v":""},"ADMINISTRAÇÃO - MENSALISTAS",null,{"$f":"Orçamento!X507","v":0},{"$f":"Orçamento!AA507","v":0},{"$f":"ROUND(F86*$D$84,2)","v":0},null,null,null,{"$f":"ROUND(J86*$D$84,2)","v":0},null,null,null,{"$f":"ROUND(N86*$D$84,2)","v":0},null,null,null,{"$f":"SUM(F84:Q84)","v":0},null,{"$f":"IF(D84=R84,\"OK\",\"ERRO\")","v":"OK"}]
[{"$f":"IF(A84=\"F\",A84,\"\")","v":""}]
[{"$f":"IF(A85=\"F\",A85,\"\")","v":""},null,null,null,null,0.34,null,null,null,0.33,null,null,null,{"$f":"1-F86-J86","v":0.3299999999999999},null,null,null,{"$f":"IFERROR(E84/100,\"\")","v":0},null,{"$f":"IF(E84=R86*100,\"OK\",\"ERRO\")","v":"OK"}]
[{"$f":"IF(D87>0,\"F\",\"\")","v":""},"PINTURA",null,{"$f":"Orçamento!X508","v":0},{"$f":"Orçamento!AA508","v":0},{"$f":"ROUND(F89*$D$87,2)","v":0},null,null,null,{"$f":"ROUND(J89*$D$87,2)","v":0},null,null,null,{"$f":"ROUND(N89*$D$87,2)","v":0},null,null,null,{"$f":"SUM(F87:Q87)","v":0},null,{"$f":"IF(D87=R87,\"OK\",\"ERRO\")","v":"OK"}]
[{"$f":"IF(A87=\"F\",A87,\"\")","v":""}]
[{"$f":"IF(A88=\"F\",A88,\"\")","v":""},null,null,null,null,0,null,null,null,0,null,null,null,{"$f":"1-F89-J89","v":1},null,null,null,{"$f":"IFERROR(E87/100,\"\")","v":0},null,{"$f":"IF(E87=R89*100,\"OK\",\"ERRO\")","v":"OK"}]
[{"$f":"IF(D90>0,\"F\",\"\")","v":""},"DIVERSOS",null,{"$f":"Orçamento!X509","v":0},{"$f":"Orçamento!AA509","v":0},{"$f":"ROUND(F92*$D$90,2)","v":0},null,null,null,{"$f":"ROUND(J92*$D$90,2)","v":0},null,null,null,{"$f":"ROUND(N92*$D$90,2)","v":0},null,null,null,{"$f":"SUM(F90:Q90)","v":0},null,{"$f":"IF(D90=R90,\"OK\",\"ERRO\")","v":"OK"}]
[{"$f":"IF(A90=\"F\",A90,\"\")","v":""}]
[{"$f":"IF(A91=\"F\",A91,\"\")","v":""},null,null,null,null,0,null,null,null,0,null,null,null,{"$f":"1-F92-J92","v":1},null,null,null,{"$f":"IFERROR(E90/100,\"\")","v":0},null,{"$f":"IF(E90=R92*100,\"OK\",\"ERRO\")","v":"OK"}]
["F","CUSTO DO ORÇAMENTO",null,{"$f":"SUM(D15:D92)","v":0},{"$f":"SUM(E15:E92)","v":0},{"$f":"F15+F18+F21+F24+F27+F30+F33+F36+F39+F42+F45+F48+F51+F54+F57+F60+F63+F66+F69+F72+F75+F78+F81+F84+F87+F90","v":0},null,null,null,{"$f":"J15+J18+J21+J24+J27+J30+J33+J36+J39+J42+J45+J48+J51+J54+J57+J60+J63+J66+J69+J72+J75+J78+J81+J84+J87+J90","v":0},null,null,null,{"$f":"N15+N18+N21+N24+N27+N30+N33+N36+N39+N42+N45+N48+N51+N54+N57+N60+N63+N66+N69+N72+N75+N78+N81+N84+N87+N90","v":0},null,null,null,{"$f":"R15+R18+R21+R24+R27+R30+R33+R36+R39+R42+R45+R48+R51+R54+R57+R60+R63+R66+R69+R72+R75+R78+R81+R84+R87+R90","v":0}]
["F","PERCENTUAIS:",null,null,null,{"$f":"IFERROR(F93/D93,\"\")","v":""},null,null,null,{"$f":"IFERROR(J93/D93,\"\")","v":""},null,null,null,{"$f":"IFERROR(N93/D93,\"\")","v":""},null,null,null,{"$f":"SUM(F94:Q94)","v":0}]
["F","TOTAIS ACUMULADOS:",null,null,null,{"$f":"F93","v":0},null,null,null,{"$f":"F95+J93","v":0},null,null,null,{"$f":"J95+N93","v":0}]
["F","PERCENTUAIS  ACUMULADOS:",null,null,null,{"$f":"F94","v":""},null,null,null,{"$f":"J94+F96","v":{"$error":"#VALUE!"}},null,null,null,{"$f":"IFERROR(J96+N94,\"\")","v":""}]
["F"]
["F","OBSERVAÇÕES:"]
["F","Os pagamentos somente poderão ser efetuados mediante medição e atesto pelos técnicos da Secretaria da Educação. "]

{"sheet":"Composição BDI","index":4,"n_rows":45,"n_cols":4,"rows_kept":45,"cut":false,"hidden":false,"merged":[[17,0,17,3],[16,0,16,3],[44,0,44,3],[42,0,42,3],[43,0,43,3],[18,0,18,3],[36,0,36,3],[39,0,39,3],[38,0,38,3],[40,0,40,3],[29,0,29,2],[32,0,32,3],[33,0,33,3],[34,0,34,3],[35,0,35,3],[0,0,0,3],[2,0,2,3],[3,0,3,3],[1,0,1,3],[5,0,5,3],[4,0,4,3],[12,0,12,3],[13,0,13,3],[14,0,14,3],[15,0,15,3],[6,0,6,3],[8,0,8,3],[7,0,7,3],[9,0,9,3],[11,0,11,3],[10,0,10,3]]}
[]
[]
["UNIDADE ESCOLAR"]
["COLÉGIO ESTADUAL DA POLÍCIA MILITAR DE GOIÁS DE MORRINHOS - XAVIER DE ALMEIDA"]
[]
["OBRA"]
["REFORMA  E AMPLIAÇÃO"]
[]
["ENDEREÇO"]
[" AV JOSE NASCIMENTO S/N , SETOR OESTE , CEP:75650-000"]
[]
["CIDADE"]
["MORRINHOS"]
[]
["CRE"]
["CRE-MORRINHOS"]
[]
["DETALHAMENTO DA COMPOSIÇÃO DE BDI"]
["COMPOSIÇÃO BDI PARA OBRAS CIVIS"]
["DESCRIÇÃO","COEF.","TAXA % (a.m)","% no preço de venda"]
["1) COFINS",1,0.03,0.03]
["2) PIS",1,6.4999999999999997E-3,6.4999999999999997E-3]
["3) ISSQN",1,2.894E-2,2.894E-2]
["4) CPRB",1,0,0]
["5) Administração Central",1,3.2399999999999998E-2,3.2399999999999998E-2]
["6) Despesas Financeiras",1,5.5999999999999999E-3,5.5999999999999999E-3]
["7) Seguros + Garantias",1,1.1999999999999999E-3,1.1999999999999999E-3]
["8) Risco",1,9.7000000000000003E-3,9.7000000000000003E-3]
["9) Lucro",1,7.1999999999999995E-2,7.1999999999999995E-2]
["BDI - FINAL",null,null,0.20343342167437117]
[]
["Notas:"]
["(1) e (2) Alíquota definida por lei."]
["(3) Alíquota e base de cálculo definidas pela legislação municipal."]
["(4) Alíquota definida pelas leis 12.546/11, 12844/13 e 13.161/15 (CPRB – contribuição previdenciária sobre a receita bruta)."]
["(5) Valores definidos a partir dos limites no Acórdão nº 2.622/2013 - TCU – Plenário. Valores entre o 1º e 3º quartis."]
["(6) Valor calculado pela expressão matemática do acórdão 2.369/2011 – TCU – Plenário e disponibilizado pela AGETOP em dezembro de 2018. (Foi utilizado para o cálculo a média da Taxa SELIC no período de 11/2017 a 10/2018)"]
[]
["(7) Valores definidos pela AGETOP a partir dos limites no Acórdão nº 2.622/2013 - TCU – Plenário. Valores médios. \n\nObservação da AGETOP: (Seguros contra erros de execução, incêndio e explosão, danos da natureza (vendaval, destelhamento, alagamento, inundação, desmoronamento, geadas etc.), emprego de material defeituoso ou inadequado, roubo e/ou furto qualificado, quebra de equipamentos, desmoronamento de estrutura, nas modalidades de Obras Civis em Construção (OCC); Instalação e Montagem (IM); e Obras Civis em Construção e Instalação e Montagem (OCC/IM). Bem como coberturas adicionais para ampliação dessas coberturas básicas, como: cobertura de responsabilidade civil geral, cobertura de responsabilidade civil cruzada, cobertura de despesas extraordinárias, cobertura de tumultos, cobertura de desentulho do local, cobertura de riscos do fabricante, dentre outras, incluindo o seguro de vida em grupo regido pela convenção coletiva dos trabalhadores na indústria da construção civil). A partir de 24/02/2015 por intermédio da Portaria 449/2015 a Presidência da AGETOP, na pessoa do Senhor Jayme Eduardo Rincon, determinou a exclusão dos valores referentes aos Seguros de Risco de Engenharia e Responsabilidade Civil do Profissional na composição do cálculo do B.D.I.."]
["(8) Valores definidos a partir dos limites no Acórdão nº 2.622/2013 - TCU – Plenário. Valores entre 1º e 3° quartis."]
["(9) Valores definidos a partir dos limites definidos no Acórdão nº 2.622/2013 - TCU – Plenário. Valores adotados e praticados no mercado ( “ ex ante ” ) ou aqueles entre os 1º e 3º quartis."]
[]
["(*) A fórmula para estipulação da taxa de BDI estimado adotado é a mesma que foi aplicada para a obtenção das tabelas contidas no Acórdão n. 2.622/2013 – TCUPlenário"]
[]
["Obs.: Para obras com valores superiores a R$ 20.000.000,00 sugere-se recalcular o BDI, dimensionando as taxas de administração central e lucro para patamares inferiores ao estipulado acima."]

{"sheet":"Relatório CENTRAL","index":5,"n_rows":40,"n_cols":5,"rows_kept":40,"cut":false,"hidden":false,"merged":[[0,1,0,4],[6,3,6,4],[9,3,9,4],[1,1,1,4],[2,1,2,2],[2,3,2,4],[4,1,4,4],[5,1,5,2],[5,3,5,4],[6,1,6,2],[7,1,7,4],[8,1,8,2],[3,1,3,2],[8,3,8,4],[9,1,9,2],[10,1,10,4],[11,1,11,4],[39,1,39,2],[3,3,3,4],[9,0,11,0]]}
[]
[]
[null,"UNIDADE ESCOLAR",null,"CIDADE"]
[null,{"$f":"Orçamento!$O$5","v":"COLÉGIO ESTADUAL DA POLÍCIA MILITAR DE GOIÁS DE MORRINHOS - XAVIER DE ALMEIDA"},null,{"$f":"Orçamento!$X$8","v":"MORRINHOS"}]
[]
[null,"OBRA",null,"CRE"]
[null,{"$f":"Orçamento!$O$8","v":"REFORMA  E AMPLIAÇÃO"},null,{"$f":"Orçamento!$O$11","v":"CRE-MORRINHOS"}]
[]
[null,"ENDEREÇO",null,"DATA"]
["FILTRO",{"$f":"Orçamento!$R$11","v":" AV JOSE NASCIMENTO S/N , SETOR OESTE , CEP:75650-000"},null,{"$f":"Orçamento!$S$8","v":"2020-07-02"}]
[]
[null,"RELATÓRIO CENTRAL"]
["↓","CÓDIGO","ETAPA","PREÇO  (R$) C/ BDI","PARTIC  ( % )"]
[{"$f":"IF(D14>0,\"F\",\"\")","v":""},{"$f":"Orçamento!O484","v":"a."},{"$f":"Orçamento!P484","v":"SERVIÇOS PRELIMINARES"},{"$f":"Orçamento!X484","v":0},{"$f":"Orçamento!AA484","v":0}]
[{"$f":"IF(D15>0,\"F\",\"\")","v":""},{"$f":"Orçamento!O485","v":"b."},{"$f":"Orçamento!P485","v":"TRANSPORTES"},{"$f":"Orçamento!X485","v":0},{"$f":"Orçamento!AA485","v":0}]
["",{"$f":"Orçamento!O486","v":"c."},{"$f":"Orçamento!P486","v":"SERVIÇO EM TERRA"},{"$f":"Orçamento!X486","v":0},{"$f":"Orçamento!AA486","v":0}]
["",{"$f":"Orçamento!O487","v":"d."},{"$f":"Orçamento!P487","v":"FUNDAÇÕES E SONDAGENS"},{"$f":"Orçamento!X487","v":0},{"$f":"Orçamento!AA487","v":0}]
["",{"$f":"Orçamento!O488","v":"e."},{"$f":"Orçamento!P488","v":"ESTRUTURA"},{"$f":"Orçamento!X488","v":0},{"$f":"Orçamento!AA488","v":0}]
["",{"$f":"Orçamento!O489","v":"f."},{"$f":"Orçamento!P489","v":"INSTALAÇÕES ELÉTRICAS"},{"$f":"Orçamento!X489","v":0},{"$f":"Orçamento!AA489","v":0}]
["",{"$f":"Orçamento!O490","v":"g."},{"$f":"Orçamento!P490","v":"INSTALAÇÕES HIDROSSANITÁRIAS"},{"$f":"Orçamento!X490","v":0},{"$f":"Orçamento!AA490","v":0}]
["",{"$f":"Orçamento!O491","v":"h"},{"$f":"Orçamento!P491","v":"INSTALAÇÕES ESPECIAIS"},{"$f":"Orçamento!X491","v":0},{"$f":"Orçamento!AA491","v":0}]
["",{"$f":"Orçamento!O492","v":"i."},{"$f":"Orçamento!P492","v":"ALVENARIAS E DIVISÓRIAS"},{"$f":"Orçamento!X492","v":0},{"$f":"Orçamento!AA492","v":0}]
["",{"$f":"Orçamento!O493","v":"j."},{"$f":"Orçamento!P493","v":"ALVENARIA AUTO-PORTANTE"},{"$f":"Orçamento!X493","v":0},{"$f":"Orçamento!AA493","v":0}]
["",{"$f":"Orçamento!O494","v":"k."},{"$f":"Orçamento!P494","v":"IMPERMEABILIZAÇÃO"},{"$f":"Orçamento!X494","v":0},{"$f":"Orçamento!AA494","v":0}]
["",{"$f":"Orçamento!O495","v":"l."},{"$f":"Orçamento!P495","v":"ISOLAMENTO TÉRMICO E ACÚSTICO"},{"$f":"Orçamento!X495","v":0},{"$f":"Orçamento!AA495","v":0}]
["",{"$f":"Orçamento!O496","v":"m."},{"$f":"Orçamento!P496","v":"ESTRUTURA DE MADEIRA"},{"$f":"Orçamento!X496","v":0},{"$f":"Orçamento!AA496","v":0}]
["",{"$f":"Orçamento!O497","v":"n."},{"$f":"Orçamento!P497","v":"ESTRUTURAS METÁLICAS"},{"$f":"Orçamento!X497","v":0},{"$f":"Orçamento!AA497","v":0}]
["",{"$f":"Orçamento!O498","v":"o."},{"$f":"Orçamento!P498","v":"COBERTURAS"},{"$f":"Orçamento!X498","v":0},{"$f":"Orçamento!AA498","v":0}]
["",{"$f":"Orçamento!O499","v":"p."},{"$f":"Orçamento!P499","v":"ESQUADRIAS DE MADEIRA"},{"$f":"Orçamento!X499","v":0},{"$f":"Orçamento!AA499","v":0}]
["",{"$f":"Orçamento!O500","v":"q."},{"$f":"Orçamento!P500","v":"ESQUADRIAS METÁLICAS"},{"$f":"Orçamento!X500","v":0},{"$f":"Orçamento!AA500","v":0}]
["",{"$f":"Orçamento!O501","v":"r."},{"$f":"Orçamento!P501","v":"VIDROS"},{"$f":"Orçamento!X501","v":0},{"$f":"Orçamento!AA501","v":0}]
["",{"$f":"Orçamento!O502","v":"s."},{"$f":"Orçamento!P502","v":"REVESTIMENTO DE PAREDE"},{"$f":"Orçamento!X502","v":0},{"$f":"Orçamento!AA502","v":0}]
["",{"$f":"Orçamento!O503","v":"t."},{"$f":"Orçamento!P503","v":"FORROS"},{"$f":"Orçamento!X503","v":0},{"$f":"Orçamento!AA503","v":0}]
["",{"$f":"Orçamento!O504","v":"u."},{"$f":"Orçamento!P504","v":"REVESTIMENTO DE PISO"},{"$f":"Orçamento!X504","v":0},{"$f":"Orçamento!AA504","v":0}]
["",{"$f":"Orçamento!O505","v":"v."},{"$f":"Orçamento!P505","v":"FERRAGENS"},{"$f":"Orçamento!X505","v":0},{"$f":"Orçamento!AA505","v":0}]
["",{"$f":"Orçamento!O506","v":"w."},{"$f":"Orçamento!P506","v":"MARCENARIA"},{"$f":"Orçamento!X506","v":0},{"$f":"Orçamento!AA506","v":0}]
["",{"$f":"Orçamento!O507","v":"x."},{"$f":"Orçamento!P507","v":"ADMINISTRAÇÃO"},{"$f":"Orçamento!X507","v":0},{"$f":"Orçamento!AA507","v":0}]
["",{"$f":"Orçamento!O508","v":"y."},{"$f":"Orçamento!P508","v":"PINTURA"},{"$f":"Orçamento!X508","v":0},{"$f":"Orçamento!AA508","v":0}]
["",{"$f":"Orçamento!O509","v":"z."},{"$f":"Orçamento!P509","v":"DIVERSOS"},{"$f":"Orçamento!X509","v":0},{"$f":"Orçamento!AA509","v":0}]
["F","TOTAL GERAL DO ORÇAMENTO (R$) C/BDI",null,{"$f":"SUM(D14:D39)","v":0},{"$f":"SUM(E14:E39)","v":0}]

{"sheet":"Parc Maior Relev","index":6,"n_rows":33,"n_cols":7,"rows_kept":33,"cut":false,"hidden":false,"merged":[[6,4,6,6],[7,1,7,6],[8,1,8,3],[8,4,8,6],[33,3,33,7],[31,1,31,6],[0,1,0,6],[11,1,11,6],[1,1,1,6],[2,1,2,3],[2,4,2,6],[3,1,3,3],[3,4,3,6],[4,1,4,6],[5,1,5,3],[5,4,5,6],[9,1,9,3],[9,4,9,6],[10,1,10,6],[6,1,6,3]]}
[]
[]
[null,"UNIDADE ESCOLAR",null,null,"CÓDIGO INEP"]
[null,{"$f":"Orçamento!$O$5","v":"COLÉGIO ESTADUAL DA POLÍCIA MILITAR DE GOIÁS DE MORRINHOS - XAVIER DE ALMEIDA"},null,null,{"$f":"Orçamento!$X$5","v":52060098}]
[]
[null,"OBRA",null,null,"CIDADE"]
[null,{"$f":"Orçamento!$O$8","v":"REFORMA  E AMPLIAÇÃO"},null,null,{"$f":"Orçamento!$X$8","v":"MORRINHOS"}]
[]
[null,"CRE",null,null,"ÁREA TOTAL CONSTRUÍDA (M²)"]
[null,{"$f":"Orçamento!$O$11","v":"CRE-MORRINHOS"},null,null,{"$f":"Orçamento!$X$14","v":3977.5099999999998}]
[]
["FILTRO","PARCELA DE MAIOR RELEVÂNCIA"]
[{"$f":"IF(G14>0,\"F\",\"\")","v":""},"CÓDIGO","SERVIÇO","DESCRIÇÃO","UNID","QUANT","PARC. MAIOR RELEV (100%)"]
[{"$f":"IF(G14>0,\"F\",\"\")","v":""},"f.","INSTALAÇÕES ELÉTRICAS","SUBESTAÇÃO","KVA",{"$f":"SUMIF(Orçamento!$R$21:$R$465,'Parc Maior Relev'!D14,Orçamento!$T$21:$T$465)","v":0},{"$f":"F14","v":0}]
[{"$f":"IF(SUM(G16:G30)>0,\"F\",\"\")","v":"F"},"CÓDIGO","SERVIÇO","DESCRIÇÃO","UNID","QUANT","PARC. MAIOR RELEV (50%)"]
[{"$f":"IF(G16>0,\"F\",\"\")","v":""},"e.","ESTRUTURA","CONCRETO","M3",{"$f":"SUMIF(Orçamento!$R$21:$R$465,'Parc Maior Relev'!D16,Orçamento!$T$21:$T$465)","v":0},{"$f":"F16*0.5","v":0}]
[{"$f":"IF(G17>0,\"F\",\"\")","v":"F"},"f.","INSTALAÇÕES ELÉTRICAS","INSTALAÇÕES ELÉTRICAS","KVA",8.5299999999999994,{"$f":"F17*0.5","v":4.2649999999999997}]
[{"$f":"IF(G18>0,\"F\",\"\")","v":""},"o.","COBERTURAS","COBERTURA CERÂMICA","M2",{"$f":"SUMIF(Orçamento!$R$21:$R$465,'Parc Maior Relev'!D18,Orçamento!$T$21:$T$465)","v":0},0]
["","o.","COBERTURAS","COBERTURA COM TELHA METÁLICA","M2",{"$f":"SUMIF(Orçamento!$R$21:$R$465,'Parc Maior Relev'!D19,Orçamento!$T$21:$T$465)","v":0},0]
["","s.","REVESTIMENTO DE PAREDE","CHAPISCO","M2",{"$f":"SUMIF(Orçamento!$R$21:$R$465,'Parc Maior Relev'!D20,Orçamento!$T$21:$T$465)","v":0},0]
["","s.","REVESTIMENTO DE PAREDE","REBOCO","M2",{"$f":"SUMIF(Orçamento!$R$21:$R$465,'Parc Maior Relev'!D21,Orçamento!$T$21:$T$465)","v":0},0]
["","s.","REVESTIMENTO DE PAREDE","REVESTIMENTO CERÂMICO","M2",{"$f":"SUMIF(Orçamento!$R$21:$R$465,'Parc Maior Relev'!D22,Orçamento!$T$21:$T$465)","v":0},0]
["","t.","FORROS","FORRO DE GESSO","M2",{"$f":"SUMIF(Orçamento!$R$21:$R$465,'Parc Maior Relev'!D23,Orçamento!$T$21:$T$465)","v":0},0]
["","t.","FORROS","FORRO DE PVC","M2",{"$f":"SUMIF(Orçamento!$R$21:$R$465,'Parc Maior Relev'!D24,Orçamento!$T$21:$T$465)","v":0},0]
["","t.","FORROS","FORRO DE GESSO ACARTONADO","M2",{"$f":"SUMIF(Orçamento!$R$21:$R$465,'Parc Maior Relev'!D25,Orçamento!$T$21:$T$465)","v":0},0]
["F","u.","REVESTIMENTO DE PISO","PISO DE GRANITINA","M2",{"$f":"Orçamento!T223+Orçamento!T461","v":176.44},88.22]
["","u.","REVESTIMENTO DE PISO","PISO LAMINADO","M2",{"$f":"SUMIF(Orçamento!$R$21:$R$465,'Parc Maior Relev'!D27,Orçamento!$T$21:$T$465)","v":0},0]
["","u.","REVESTIMENTO DE PISO","PISO DE CONCRETO DESEMPENADO","M2",{"$f":"SUMIF(Orçamento!$R$21:$R$465,'Parc Maior Relev'!D28,Orçamento!$T$21:$T$465)","v":0},0]
["","u.","REVESTIMENTO DE PISO","PISO CERÂMICO","M2",{"$f":"SUMIF(Orçamento!$R$21:$R$465,'Parc Maior Relev'!D29,Orçamento!$T$21:$T$465)","v":0},0]
["","y.","PINTURA","PINTURA","M2",{"$f":"SUMIF(Orçamento!$R$21:$R$465,'Parc Maior Relev'!D30,Orçamento!$T$21:$T$465)","v":0},0]
["F"]
["F","(*) Para os fins do inciso I dp § 1º do Art. 30 da Lei Federal 8.666/93, são consideradas parcelas de maior relevância técnica as execuções apresentadas"]
["F"]