{"text_format":"1","workbook":"xlsx","n_sheets":8,"sheets":["Orçamento","Resumo ","Somatório","Cronog_60_Dias","Composição BDI","Relatório CENTRAL","Parc Maior Relev","Composições"],"not_rendered":{"charts":0,"images":5,"macros":1,"external_links":1,"defined_names":124,"comments":3,"pivot_tables":0},"unopened":[],"bounds":{"document_bytes":16777216,"sheet_cells":100000,"rows_first":2000,"rows_last":500,"rows_between":2000,"halvings":0,"cell_chars":16384,"cell_head_chars":4096},"cells_cut":0,"cells_raw":0,"read":"whole","date_system":"1900"}

{"sheet":"Orçamento","index":0,"n_rows":524,"n_cols":24,"rows_kept":524,"cut":false,"hidden":false,"merged":[[459,16,459,22],[8,12,9,12],[494,18,494,20],[494,21,494,22],[0,14,0,22],[8,14,8,16],[9,14,9,16],[11,14,11,16],[12,14,12,16],[14,14,14,22],[1,14,1,22],[4,14,4,22],[7,14,7,22],[478,18,478,20],[478,21,478,22],[486,21,486,22],[475,15,475,17],[476,15,476,17],[477,15,477,17],[479,21,479,22],[487,18,487,20],[487,21,487,22],[485,18,485,20],[485,21,485,22],[493,18,493,20],[493,21,493,22],[480,18,480,20],[480,21,480,22],[473,18,473,20],[473,21,473,22],[495,18,495,20],[495,21,495,22],[449,20,449,21],[471,18,471,20],[471,21,471,22],[472,18,472,20],[472,21,472,22],[470,18,470,20],[470,21,470,22],[479,18,479,20],[450,20,450,21],[461,18,461,22],[467,18,467,20],[467,21,467,22],[468,18,468,20],[468,21,468,22],[469,18,469,20],[469,21,469,22],[492,18,492,20],[492,21,492,22],[489,21,489,22],[490,18,490,20],[490,21,490,22],[491,18,491,20],[491,21,491,22],[481,18,481,20],[481,21,481,22],[488,18,488,20],[488,21,488,22],[483,21,483,22],[484,18,484,20],[484,21,484,22],[486,18,486,20],[482,18,482,20],[482,21,482,22],[483,18,483,20],[487,15,487,17],[488,15,488,17],[489,15,489,17],[490,15,490,17],[491,15,491,17],[464,14,464,23],[453,20,453,21],[452,20,452,21],[448,17,453,17],[448,20,448,21],[465,18,465,20],[465,21,465,22],[466,18,466,20],[466,21,466,22],[454,20,454,21],[474,18,474,20],[474,21,474,22],[475,18,475,20],[475,21,475,22],[476,18,476,20],[476,21,476,22],[477,18,477,20],[477,21,477,22],[489,18,489,20],[466,15,466,17],[467,15,467,17],[468,15,468,17],[469,15,469,17],[470,15,470,17],[471,15,471,17],[472,15,472,17],[473,15,473,17],[474,15,474,17],[478,15,478,17],[479,15,479,17],[480,15,480,17],[481,15,481,17],[482,15,482,17],[483,15,483,17],[484,15,484,17],[485,15,485,17],[486,15,486,17],[456,16,456,22],[457,16,457,22],[458,16,458,22],[3,21,3,22],[2,21,2,22],[5,21,5,22],[10,14,10,23],[13,14,13,23],[6,21,6,22],[2,14,2,20],[3,14,3,20],[5,18,5,20],[6,18,6,20],[6,14,6,17],[5,14,5,17],[12,21,12,22],[12,18,12,20],[8,18,8,20],[8,21,8,22],[9,19,9,20],[498,14,498,23],[499,18,499,20],[499,21,499,22],[500,15,500,17],[500,18,500,20],[500,21,500,22],[501,15,501,17],[501,18,501,20],[501,21,501,22],[505,15,505,17],[503,18,503,20],[503,21,503,22],[523,18,523,20],[523,21,523,22],[520,14,520,17],[517,15,517,17],[517,18,517,20],[517,21,517,22],[518,15,518,17],[518,18,518,20],[518,21,518,22],[519,15,519,17],[519,18,519,20],[519,21,519,22],[522,18,522,20],[522,21,522,22],[521,18,521,20],[521,21,521,22],[502,18,502,20],[502,21,502,22],[503,15,503,17],[492,14,492,17],[499,15,499,17],[465,15,465,17],[520,18,520,20],[520,21,520,22],[508,15,508,17],[508,18,508,20],[508,21,508,22],[509,15,509,17],[509,18,509,20],[509,21,509,22],[510,15,510,17],[510,18,510,20],[510,21,510,22],[514,15,514,17],[514,18,514,20],[514,21,514,22],[515,15,515,17],[515,18,515,20],[515,21,515,22],[516,15,516,17],[504,15,504,17],[504,18,504,20],[504,21,504,22],[460,16,460,22],[516,18,516,20],[516,21,516,22],[511,15,511,17],[511,18,511,20],[511,21,511,22],[512,15,512,17],[512,18,512,20],[512,21,512,22],[513,15,513,17],[513,18,513,20],[513,21,513,22],[505,18,505,20],[505,21,505,22],[506,15,506,17],[506,18,506,20],[506,21,506,22],[507,15,507,17],[507,18,507,20],[507,21,507,22],[502,15,502,17]]}
[]
[]
[null,null,null,null,null,null,null,null,null,null,null,null,null,null,"UNIDADE ESCOLAR",null,null,null,null,null,null,"CÓDIGO INEP"]
[null,null,null,null,null,null,null,null,null,null,null,null,null,null,"COLÉGIO ESTADUAL FREDERICO JAYME",null,null,null,null,null,null,52054365]
[]
["Nmax",null,null,null,null,null,null,null,null,null,null,null,"Ajustar altura?",null,"OBRA",null,null,null,"DATA",null,null,"CIDADE"]
[{"$f":"MAX($C$18:$C$448)","v":4},null,null,null,null,null,null,null,null,null,null,null,"NÃO",null,"REFORMA E AMPLIAÇÃO",null,null,null,"2020-04-16",null,null,"RIO VERDE"]
[]
[null,null,null,null,null,null,null,null,null,null,null,null,"",null,"CRE",null,null,"ENDEREÇO","REFERÊNCIA AGETOP",null,null,"REFERÊNCIA SINAPI"]
[null,null,null,null,null,null,null,null,null,null,null,null,null,null,"RIO VERDE",null,null,"RUA TERCIO CAMPOS LEAO SN, SANTO ANTONIO, CEP:75906-420","ABR/19","DESONERADA",null,"DEZ/19","DESONERADA"]
[]
[null,null,null,null,null,null,null,null,null,null,null,null,null,null,"ÁREA EXISTENTE (M²)",null,null,"ÁREA A CONSTRUIR (M²)","ÁREA A DEMOLIR (M²)",null,null,"ÁREA TOTAL CONSTRUÍDA (M²)"]
[null,null,null,null,null,null,null,null,null,null,null,null,null,null,1401.85,null,null,25.2,2,null,null,1425.05]
[]
[null,null,null,null,null,null,null,null,null,null,null,"FILTRO",null,null,"PLANILHA ORÇAMENTÁRIA"]
["Nível E","Save Nivel","Nível C","Altura","n1","n2","n3","n4","n5","Czero","Cnível","↓","Nível","Nível Corrigido","ITEM","TABELA","CODIGO","DESCRIÇÃO DOS SERVIÇOS","UNID","QUANT","MAT","MO","T.SERVIÇO","OBSERVAÇÕES¹"]
[{"$f":"CHOOSE(1+LOG(1+2*(ORÇAMENTO.Nivel=\"Nível 1\")+4*(ORÇAMENTO.Nivel=\"Nível 2\")+8*(ORÇAMENTO.Nivel=\"Nível 3\")+16*(ORÇAMENTO.Nivel=\"Nível 4\")+32*(ORÇAMENTO.Nivel=\"Serviço\"),2),0,1,2,3,4,\"S\")","v":"S"},{"$f":"IF(OR(C17=\"s\",C17=0),OFFSET(B17,-1,0),C17)","v":"Save Nivel"},{"$f":"IF(OFFSET(C17,-1,0)=\"L\",1,IF(OFFSET(C17,-1,0)=1,2,IF(OR(A17=\"s\",A17=0),\"S\",IF(AND(OFFSET(C17,-1,0)=2,A17=4),3,IF(AND(OR(OFFSET(C17,-1,0)=\"s\",OFFSET(C17,-1,0)=0),A17<>\"s\",A17>OFFSET(B17,-1,0)),OFFSET(B17,-1,0),A17)))))","v":"S"},{"$f":"IF(OR(C17=\"S\",C17=0),0,IF(ISERROR(K17),J17,SMALL(J17:K17,1)))","v":0},{"$f":"IF($C17=1,OFFSET(E17,-1,0)+1,OFFSET(E17,-1,0))","v":"n1"},{"$f":"IF($C17=1,0,IF($C17=2,OFFSET(F17,-1,0)+1,OFFSET(F17,-1,0)))","v":"n2"},{"$f":"IF(AND($C17<=2,$C17<>0),0,IF($C17=3,OFFSET(G17,-1,0)+1,OFFSET(G17,-1,0)))","v":"n3"},{"$f":"IF(AND($C17<=3,$C17<>0),0,IF($C17=4,OFFSET(H17,-1,0)+1,OFFSET(H17,-1,0)))","v":"n4"},{"$f":"IF(AND($C17<=4,$C17<>0),0,IF(AND($C17=\"S\",$W17>0),OFFSET(I17,-1,0)+1,OFFSET(I17,-1,0)))","v":"n5"},{"$f":"IF(OR($C17=\"S\",$C17=0),0,MATCH(0,OFFSET($D17,1,$C17,ROW($C$448)-ROW($C17)),0))","v":0},{"$f":"IF(OR($C17=\"S\",$C17=0),0,MATCH(OFFSET($D17,0,$C17)+1,OFFSET($D17,1,$C17,ROW($C$448)-ROW($C17)),0))","v":0},"","Serviço","Serviço","-","SINAPI",null,"(sem código)","-",null,0,0,0,""]
[0,null,"L",{"$f":"COUNTA(OFFSET(D18,1,0):D$448)","v":429},{"$f":"LEFT(O19,1)-1","v":0},null,null,null,null,null,null,"F","LOTE","LOTE","REFORMA E AMPLIAÇÃO - COLÉGIO ESTADUAL FREDERICO JAYME",null,null,null,null,null,null,null,0]
[{"$f":"CHOOSE(1+LOG(1+2*(ORÇAMENTO.Nivel=\"Nível 1\")+4*(ORÇAMENTO.Nivel=\"Nível 2\")+8*(ORÇAMENTO.Nivel=\"Nível 3\")+16*(ORÇAMENTO.Nivel=\"Nível 4\")+32*(ORÇAMENTO.Nivel=\"Serviço\"),2),0,1,2,3,4,\"S\")","v":1},{"$f":"IF(OR(C19=\"s\",C19=0),OFFSET(B19,-1,0),C19)","v":1},{"$f":"IF(OFFSET(C19,-1,0)=\"L\",1,IF(OFFSET(C19,-1,0)=1,2,IF(OR(A19=\"s\",A19=0),\"S\",IF(AND(OFFSET(C19,-1,0)=2,A19=4),3,IF(AND(OR(OFFSET(C19,-1,0)=\"s\",OFFSET(C19,-1,0)=0),A19<>\"s\",A19>OFFSET(B19,-1,0)),OFFSET(B19,-1,0),A19)))))","v":1},{"$f":"IF(OR(C19=\"S\",C19=0),0,IF(ISERROR(K19),J19,SMALL(J19:K19,1)))","v":429},{"$f":"IF($C19=1,OFFSET(E19,-1,0)+1,OFFSET(E19,-1,0))","v":1},{"$f":"IF($C19=1,0,IF($C19=2,OFFSET(F19,-1,0)+1,OFFSET(F19,-1,0)))","v":0},{"$f":"IF(AND($C19<=2,$C19<>0),0,IF($C19=3,OFFSET(G19,-1,0)+1,OFFSET(G19,-1,0)))","v":0},{"$f":"IF(AND($C19<=3,$C19<>0),0,IF($C19=4,OFFSET(H19,-1,0)+1,OFFSET(H19,-1,0)))","v":0},{"$f":"IF(AND($C19<=4,$C19<>0),0,IF(AND($C19=\"S\",$W19>0),OFFSET(I19,-1,0)+1,OFFSET(I19,-1,0)))","v":0},{"$f":"IF(OR($C19=\"S\",$C19=0),0,MATCH(0,OFFSET($D19,1,$C19,ROW($C$448)-ROW($C19)),0))","v":429},{"$f":"IF(OR($C19=\"S\",$C19=0),0,MATCH(OFFSET($D19,0,$C19)+1,OFFSET($D19,1,$C19,ROW($C$448)-ROW($C19)),0))","v":{"$error":"#N/A"}},"F","Nível 1","Nível 1","1.","AGETOP",null,"REFORMA E AMPLIAÇÃO",null,null,null,null,0]
[2,{"$f":"IF(OR(C20=\"s\",C20=0),OFFSET(B20,-1,0),C20)","v":2},{"$f":"IF(OFFSET(C20,-1,0)=\"L\",1,IF(OFFSET(C20,-1,0)=1,2,IF(OR(A20=\"s\",A20=0),\"S\",IF(AND(OFFSET(C20,-1,0)=2,A20=4),3,IF(AND(OR(OFFSET(C20,-1,0)=\"s\",OFFSET(C20,-1,0)=0),A20<>\"s\",A20>OFFSET(B20,-1,0)),OFFSET(B20,-1,0),A20)))))","v":2},{"$f":"IF(OR(C20=\"S\",C20=0),0,IF(ISERROR(K20),J20,SMALL(J20:K20,1)))","v":26},{"$f":"IF($C20=1,OFFSET(E20,-1,0)+1,OFFSET(E20,-1,0))","v":1},{"$f":"IF($C20=1,0,IF($C20=2,OFFSET(F20,-1,0)+1,OFFSET(F20,-1,0)))","v":1},{"$f":"IF(AND($C20<=2,$C20<>0),0,IF($C20=3,OFFSET(G20,-1,0)+1,OFFSET(G20,-1,0)))","v":0},{"$f":"IF(AND($C20<=3,$C20<>0),0,IF($C20=4,OFFSET(H20,-1,0)+1,OFFSET(H20,-1,0)))","v":0},{"$f":"IF(AND($C20<=4,$C20<>0),0,IF(AND($C20=\"S\",$W20>0),OFFSET(I20,-1,0)+1,OFFSET(I20,-1,0)))","v":0},428,26,"","Nível 2","Nível 2","-","AGETOP",null,"SERVIÇOS PRELIMINARES",null,null,null,null,0]
[3,{"$f":"IF(OR(C21=\"s\",C21=0),OFFSET(B21,-1,0),C21)","v":3},{"$f":"IF(OFFSET(C21,-1,0)=\"L\",1,IF(OFFSET(C21,-1,0)=1,2,IF(OR(A21=\"s\",A21=0),\"S\",IF(AND(OFFSET(C21,-1,0)=2,A21=4),3,IF(AND(OR(OFFSET(C21,-1,0)=\"s\",OFFSET(C21,-1,0)=0),A21<>\"s\",A21>OFFSET(B21,-1,0)),OFFSET(B21,-1,0),A21)))))","v":3},{"$f":"IF(OR(C21=\"S\",C21=0),0,IF(ISERROR(K21),J21,SMALL(J21:K21,1)))","v":4},{"$f":"IF($C21=1,OFFSET(E21,-1,0)+1,OFFSET(E21,-1,0))","v":1},{"$f":"IF($C21=1,0,IF($C21=2,OFFSET(F21,-1,0)+1,OFFSET(F21,-1,0)))","v":1},{"$f":"IF(AND($C21<=2,$C21<>0),0,IF($C21=3,OFFSET(G21,-1,0)+1,OFFSET(G21,-1,0)))","v":1},{"$f":"IF(AND($C21<=3,$C21<>0),0,IF($C21=4,OFFSET(H21,-1,0)+1,OFFSET(H21,-1,0)))","v":0},{"$f":"IF(AND($C21<=4,$C21<>0),0,IF(AND($C21=\"S\",$W21>0),OFFSET(I21,-1,0)+1,OFFSET(I21,-1,0)))","v":0},25,4,"","Nível 3","Nível 3","-","SINAPI",null,"REFORMA GERAL DO BLOCO EM ANEXO","-",null,0,0,0,""]
["S",3,"S",0,1,1,1,0,0,0,0,"","Serviço","Serviço","-","AGETOP",20118,"DEM.ALVEN.TIJOLO S/REAP. C/TR.ATE CB. E CARGA","m3    ",27.78,null,null,0,""]
[{"$f":"CHOOSE(1+LOG(1+2*(ORÇAMENTO.Nivel=\"Nível 1\")+4*(ORÇAMENTO.Nivel=\"Nível 2\")+8*(ORÇAMENTO.Nivel=\"Nível 3\")+16*(ORÇAMENTO.Nivel=\"Nível 4\")+32*(ORÇAMENTO.Nivel=\"Serviço\"),2),0,1,2,3,4,\"S\")","v":"S"},{"$f":"IF(OR(C23=\"s\",C23=0),OFFSET(B23,-1,0),C23)","v":3},{"$f":"IF(OFFSET(C23,-1,0)=\"L\",1,IF(OFFSET(C23,-1,0)=1,2,IF(OR(A23=\"s\",A23=0),\"S\",IF(AND(OFFSET(C23,-1,0)=2,A23=4),3,IF(AND(OR(OFFSET(C23,-1,0)=\"s\",OFFSET(C23,-1,0)=0),A23<>\"s\",A23>OFFSET(B23,-1,0)),OFFSET(B23,-1,0),A23)))))","v":"S"},{"$f":"IF(OR(C23=\"S\",C23=0),0,IF(ISERROR(K23),J23,SMALL(J23:K23,1)))","v":0},{"$f":"IF($C23=1,OFFSET(E23,-1,0)+1,OFFSET(E23,-1,0))","v":1},{"$f":"IF($C23=1,0,IF($C23=2,OFFSET(F23,-1,0)+1,OFFSET(F23,-1,0)))","v":1},{"$f":"IF(AND($C23<=2,$C23<>0),0,IF($C23=3,OFFSET(G23,-1,0)+1,OFFSET(G23,-1,0)))","v":1},{"$f":"IF(AND($C23<=3,$C23<>0),0,IF($C23=4,OFFSET(H23,-1,0)+1,OFFSET(H23,-1,0)))","v":0},{"$f":"IF(AND($C23<=4,$C23<>0),0,IF(AND($C23=\"S\",$W23>0),OFFSET(I23,-1,0)+1,OFFSET(I23,-1,0)))","v":0},0,0,"","Serviço","Serviço","-","AGETOP",20202,"RASPAGEM E LIMPEZA MANUAL DO TERRENO","m2    ",200,null,null,0,""]
[{"$f":"CHOOSE(1+LOG(1+2*(ORÇAMENTO.Nivel=\"Nível 1\")+4*(ORÇAMENTO.Nivel=\"Nível 2\")+8*(ORÇAMENTO.Nivel=\"Nível 3\")+16*(ORÇAMENTO.Nivel=\"Nível 4\")+32*(ORÇAMENTO.Nivel=\"Serviço\"),2),0,1,2,3,4,\"S\")","v":"S"},{"$f":"IF(OR(C24=\"s\",C24=0),OFFSET(B24,-1,0),C24)","v":3},{"$f":"IF(OFFSET(C24,-1,0)=\"L\",1,IF(OFFSET(C24,-1,0)=1,2,IF(OR(A24=\"s\",A24=0),\"S\",IF(AND(OFFSET(C24,-1,0)=2,A24=4),3,IF(AND(OR(OFFSET(C24,-1,0)=\"s\",OFFSET(C24,-1,0)=0),A24<>\"s\",A24>OFFSET(B24,-1,0)),OFFSET(B24,-1,0),A24)))))","v":"S"},{"$f":"IF(OR(C24=\"S\",C24=0),0,IF(ISERROR(K24),J24,SMALL(J24:K24,1)))","v":0},{"$f":"IF($C24=1,OFFSET(E24,-1,0)+1,OFFSET(E24,-1,0))","v":1},{"$f":"IF($C24=1,0,IF($C24=2,OFFSET(F24,-1,0)+1,OFFSET(F24,-1,0)))","v":1},{"$f":"IF(AND($C24<=2,$C24<>0),0,IF($C24=3,OFFSET(G24,-1,0)+1,OFFSET(G24,-1,0)))","v":1},{"$f":"IF(AND($C24<=3,$C24<>0),0,IF($C24=4,OFFSET(H24,-1,0)+1,OFFSET(H24,-1,0)))","v":0},{"$f":"IF(AND($C24<=4,$C24<>0),0,IF(AND($C24=\"S\",$W24>0),OFFSET(I24,-1,0)+1,OFFSET(I24,-1,0)))","v":0},0,0,"","Serviço","Serviço","-","AGETOP",20203,"CAPINA - (OBRAS CIVIS)","m2    ",77.91,null,null,0,""]
[{"$f":"CHOOSE(1+LOG(1+2*(ORÇAMENTO.Nivel=\"Nível 1\")+4*(ORÇAMENTO.Nivel=\"Nível 2\")+8*(ORÇAMENTO.Nivel=\"Nível 3\")+16*(ORÇAMENTO.Nivel=\"Nível 4\")+32*(ORÇAMENTO.Nivel=\"Serviço\"),2),0,1,2,3,4,\"S\")","v":3},{"$f":"IF(OR(C25=\"s\",C25=0),OFFSET(B25,-1,0),C25)","v":3},{"$f":"IF(OFFSET(C25,-1,0)=\"L\",1,IF(OFFSET(C25,-1,0)=1,2,IF(OR(A25=\"s\",A25=0),\"S\",IF(AND(OFFSET(C25,-1,0)=2,A25=4),3,IF(AND(OR(OFFSET(C25,-1,0)=\"s\",OFFSET(C25,-1,0)=0),A25<>\"s\",A25>OFFSET(B25,-1,0)),OFFSET(B25,-1,0),A25)))))","v":3},{"$f":"IF(OR(C25=\"S\",C25=0),0,IF(ISERROR(K25),J25,SMALL(J25:K25,1)))","v":2},{"$f":"IF($C25=1,OFFSET(E25,-1,0)+1,OFFSET(E25,-1,0))","v":1},{"$f":"IF($C25=1,0,IF($C25=2,OFFSET(F25,-1,0)+1,OFFSET(F25,-1,0)))","v":1},{"$f":"IF(AND($C25<=2,$C25<>0),0,IF($C25=3,OFFSET(G25,-1,0)+1,OFFSET(G25,-1,0)))","v":2},{"$f":"IF(AND($C25<=3,$C25<>0),0,IF($C25=4,OFFSET(H25,-1,0)+1,OFFSET(H25,-1,0)))","v":0},{"$f":"IF(AND($C25<=4,$C25<>0),0,IF(AND($C25=\"S\",$W25>0),OFFSET(I25,-1,0)+1,OFFSET(I25,-1,0)))","v":0},21,2,"","Nível 3","Nível 3","-","SINAPI",null,"REMOÇÃO DE JANELAS COM REAPROVEITAMENTO","-",null,null,null,0,""]
[{"$f":"CHOOSE(1+LOG(1+2*(ORÇAMENTO.Nivel=\"Nível 1\")+4*(ORÇAMENTO.Nivel=\"Nível 2\")+8*(ORÇAMENTO.Nivel=\"Nível 3\")+16*(ORÇAMENTO.Nivel=\"Nível 4\")+32*(ORÇAMENTO.Nivel=\"Serviço\"),2),0,1,2,3,4,\"S\")","v":"S"},3,"S",0,1,1,2,0,0,0,0,"","Serviço","Serviço","-","SINAPI",97645,"REMOÇÃO DE JANELAS, DE FORMA MANUAL, SEM REAPROVEITAMENTO. AF_12/2017","M2",5.4,null,null,0,"Referência: AGETOP - 20106"]
[3,3,3,2,1,1,3,0,0,19,2,"","Nível 3","Nível 3","-","SINAPI",null,"CENTRAL DE GÁS","-",null,null,null,0,""]
["S",3,"S",0,1,1,3,0,0,0,0,"","Serviço","Serviço","-","AGETOP",20118,"DEM.ALVEN.TIJOLO S/REAP. C/TR.ATE CB. E CARGA","m3    ",1.26,null,null,0,""]
[3,3,3,2,1,1,4,0,0,17,2,"","Nível 3","Nível 3","-","SINAPI",null,"TROCAR CALHA PÁTIO COBERTO 02","-",null,null,null,0,""]
["S",3,"S",0,1,1,4,0,0,0,0,"","Serviço","Serviço","-","AGETOP",20157,"DEMOLIÇÃO CALHAS/ RUFOS EM CHAPA C/TR.AT.C.B.E CARGA","m2    ",62.5,null,null,0,""]
[3,3,3,3,1,1,5,0,0,15,3,"","Nível 3","Nível 3","-","SINAPI",null,"MANUTENÇÃO DAS INFILTRAÇÕES NOS BANHEIROS","-",null,null,null,0,""]
["S",3,"S",0,1,1,5,0,0,0,0,"","Serviço","Serviço","-","AGETOP",20163,"DEMOLIÇÃO DAS INSTALAÇÕES HIDROSANITÁRIAS E AFINS C/ TRANSP. ATÉ CB. E CARGA","H     ",2.4,null,null,0,""]
["S",3,"S",0,1,1,5,0,0,0,0,"","Serviço","Serviço","-","AGETOP",20137,"DEMOLIÇAO BACIA SANITARIA C/ TRANSP. ATÉ CB. E CARGA","Un    ",5,null,null,0,""]
[3,3,3,8,1,1,6,0,0,12,8,"","Nível 3","Nível 3","-","SINAPI",null,"REFORMA DOS BANHEIROS","-",null,null,null,0,""]
["S",3,"S",0,1,1,6,0,0,0,0,"","Serviço","Serviço","-","AGETOP",20118,"DEM.ALVEN.TIJOLO S/REAP. C/TR.ATE CB. E CARGA","m3    ",2.5,null,null,0,""]
["S",3,"S",0,1,1,6,0,0,0,0,"","Serviço","Serviço","-","AGETOP",20111,"DEM.PISO CERAM.SOBRE LASTRO CONC.C/TR.CB.E CARGA","m2    ",10.1,null,null,0,""]
["S",3,"S",0,1,1,6,0,0,0,0,"","Serviço","Serviço","-","AGETOP",20134,"DEM.DE FORRO GESSO C/TRANSP.ATE CB.E CARGA","m2    ",6.22,null,null,0,""]
["S",3,"S",0,1,1,6,0,0,0,0,"","Serviço","Serviço","-","SINAPI",97633,"DEMOLIÇÃO DE REVESTIMENTO CERÂMICO, DE FORMA MANUAL, SEM REAPROVEITAMENTO. AF_12/2017","M2",51,null,null,0,"Referência: AGETOP - 20115"]
["S",3,"S",0,1,1,6,0,0,0,0,"","Serviço","Serviço","-","AGETOP",20163,"DEMOLIÇÃO DAS INSTALAÇÕES HIDROSANITÁRIAS E AFINS C/ TRANSP. ATÉ CB. E CARGA","H     ",0.6,null,null,0,""]
["S",3,"S",0,1,1,6,0,0,0,0,"","Serviço","Serviço","-","AGETOP",20137,"DEMOLIÇAO BACIA SANITARIA C/ TRANSP. ATÉ CB. E CARGA","Un    ",2,null,null,0,""]
["S",3,"S",0,1,1,6,0,0,0,0,"","Serviço","Serviço","-","SINAPI",97644,"REMOÇÃO DE PORTAS, DE FORMA MANUAL, SEM REAPROVEITAMENTO. AF_12/2017","M2",3.1500000000000004,null,null,0,"Referência: AGETOP - 20106"]
[3,3,3,2,1,1,7,0,0,4,2,"","Nível 3","Nível 3","-","SINAPI",null,"PISO TÁTIL","-",null,null,null,0,""]
["S",3,"S",0,1,1,7,0,0,0,0,"","Serviço","Serviço","-","AGETOP",20121,"DEM. MANUAL EM CONCR.SIMPLES C/TR.ATE CB.E CARGA (O.C.)","m3    ",1.1000000000000001,null,null,0,""]
[{"$f":"CHOOSE(1+LOG(1+2*(ORÇAMENTO.Nivel=\"Nível 1\")+4*(ORÇAMENTO.Nivel=\"Nível 2\")+8*(ORÇAMENTO.Nivel=\"Nível 3\")+16*(ORÇAMENTO.Nivel=\"Nível 4\")+32*(ORÇAMENTO.Nivel=\"Serviço\"),2),0,1,2,3,4,\"S\")","v":3},{"$f":"IF(OR(C44=\"s\",C44=0),OFFSET(B44,-1,0),C44)","v":3},{"$f":"IF(OFFSET(C44,-1,0)=\"L\",1,IF(OFFSET(C44,-1,0)=1,2,IF(OR(A44=\"s\",A44=0),\"S\",IF(AND(OFFSET(C44,-1,0)=2,A44=4),3,IF(AND(OR(OFFSET(C44,-1,0)=\"s\",OFFSET(C44,-1,0)=0),A44<>\"s\",A44>OFFSET(B44,-1,0)),OFFSET(B44,-1,0),A44)))))","v":3},{"$f":"IF(OR(C44=\"S\",C44=0),0,IF(ISERROR(K44),J44,SMALL(J44:K44,1)))","v":2},{"$f":"IF($C44=1,OFFSET(E44,-1,0)+1,OFFSET(E44,-1,0))","v":1},{"$f":"IF($C44=1,0,IF($C44=2,OFFSET(F44,-1,0)+1,OFFSET(F44,-1,0)))","v":1},{"$f":"IF(AND($C44<=2,$C44<>0),0,IF($C44=3,OFFSET(G44,-1,0)+1,OFFSET(G44,-1,0)))","v":8},{"$f":"IF(AND($C44<=3,$C44<>0),0,IF($C44=4,OFFSET(H44,-1,0)+1,OFFSET(H44,-1,0)))","v":0},{"$f":"IF(AND($C44<=4,$C44<>0),0,IF(AND($C44=\"S\",$W44>0),OFFSET(I44,-1,0)+1,OFFSET(I44,-1,0)))","v":0},2,{"$error":"#N/A"},"","Nível 3","Nível 3","-","SINAPI",null,"OUTROS","-",null,null,null,0,""]
["S",{"$f":"IF(OR(C45=\"s\",C45=0),OFFSET(B45,-1,0),C45)","v":3},{"$f":"IF(OFFSET(C45,-1,0)=\"L\",1,IF(OFFSET(C45,-1,0)=1,2,IF(OR(A45=\"s\",A45=0),\"S\",IF(AND(OFFSET(C45,-1,0)=2,A45=4),3,IF(AND(OR(OFFSET(C45,-1,0)=\"s\",OFFSET(C45,-1,0)=0),A45<>\"s\",A45>OFFSET(B45,-1,0)),OFFSET(B45,-1,0),A45)))))","v":"S"},{"$f":"IF(OR(C45=\"S\",C45=0),0,IF(ISERROR(K45),J45,SMALL(J45:K45,1)))","v":0},{"$f":"IF($C45=1,OFFSET(E45,-1,0)+1,OFFSET(E45,-1,0))","v":1},{"$f":"IF($C45=1,0,IF($C45=2,OFFSET(F45,-1,0)+1,OFFSET(F45,-1,0)))","v":1},{"$f":"IF(AND($C45<=2,$C45<>0),0,IF($C45=3,OFFSET(G45,-1,0)+1,OFFSET(G45,-1,0)))","v":8},{"$f":"IF(AND($C45<=3,$C45<>0),0,IF($C45=4,OFFSET(H45,-1,0)+1,OFFSET(H45,-1,0)))","v":0},{"$f":"IF(AND($C45<=4,$C45<>0),0,IF(AND($C45=\"S\",$W45>0),OFFSET(I45,-1,0)+1,OFFSET(I45,-1,0)))","v":0},0,0,"","Serviço","Serviço","-","SINAPI","74209/1","PLACA DE OBRA EM CHAPA DE ACO GALVANIZADO","M2",7.5,null,null,0,"Referência: AGETOP - 21301"]
[2,2,2,3,1,2,0,0,0,402,3,"","Nível 2","Nível 2","-","AGETOP",null,"TRANSPORTES","-",null,null,null,0,""]
["S",2,"S",0,1,2,0,0,0,0,0,"","Serviço","Serviço","-","SINAPI",72900,"TRANSPORTE DE ENTULHO COM CAMINHAO BASCULANTE 6 M3, RODOVIA PAVIMENTADA, DMT 0,5 A 1,0 KM","M3",78.53,null,null,0,""]
["S",2,"S",0,1,2,0,0,0,0,0,"","Serviço","Serviço","-","SINAPI",72897,"CARGA MANUAL DE ENTULHO EM CAMINHAO BASCULANTE 6 M3","M3",78.53,null,null,0,""]
[2,2,2,5,1,3,0,0,0,399,5,"","Nível 2","Nível 2","-","AGETOP",null,"SERVIÇO EM TERRA","-",null,null,null,0,""]
[3,3,3,4,1,3,1,0,0,4,9,"","Nível 3","Nível 3","-",null,null,"OUTROS SERVIÇOS","-",null,null,null,0,""]
[{"$f":"CHOOSE(1+LOG(1+2*(ORÇAMENTO.Nivel=\"Nível 1\")+4*(ORÇAMENTO.Nivel=\"Nível 2\")+8*(ORÇAMENTO.Nivel=\"Nível 3\")+16*(ORÇAMENTO.Nivel=\"Nível 4\")+32*(ORÇAMENTO.Nivel=\"Serviço\"),2),0,1,2,3,4,\"S\")","v":4},{"$f":"IF(OR(C51=\"s\",C51=0),OFFSET(B51,-1,0),C51)","v":4},{"$f":"IF(OFFSET(C51,-1,0)=\"L\",1,IF(OFFSET(C51,-1,0)=1,2,IF(OR(A51=\"s\",A51=0),\"S\",IF(AND(OFFSET(C51,-1,0)=2,A51=4),3,IF(AND(OR(OFFSET(C51,-1,0)=\"s\",OFFSET(C51,-1,0)=0),A51<>\"s\",A51>OFFSET(B51,-1,0)),OFFSET(B51,-1,0),A51)))))","v":4},{"$f":"IF(OR(C51=\"S\",C51=0),0,IF(ISERROR(K51),J51,SMALL(J51:K51,1)))","v":3},{"$f":"IF($C51=1,OFFSET(E51,-1,0)+1,OFFSET(E51,-1,0))","v":1},{"$f":"IF($C51=1,0,IF($C51=2,OFFSET(F51,-1,0)+1,OFFSET(F51,-1,0)))","v":3},{"$f":"IF(AND($C51<=2,$C51<>0),0,IF($C51=3,OFFSET(G51,-1,0)+1,OFFSET(G51,-1,0)))","v":1},{"$f":"IF(AND($C51<=3,$C51<>0),0,IF($C51=4,OFFSET(H51,-1,0)+1,OFFSET(H51,-1,0)))","v":1},{"$f":"IF(AND($C51<=4,$C51<>0),0,IF(AND($C51=\"S\",$W51>0),OFFSET(I51,-1,0)+1,OFFSET(I51,-1,0)))","v":0},{"$f":"IF(OR($C51=\"S\",$C51=0),0,MATCH(0,OFFSET($D51,1,$C51,ROW($C$448)-ROW($C51)),0))","v":3},{"$f":"IF(OR($C51=\"S\",$C51=0),0,MATCH(OFFSET($D51,0,$C51)+1,OFFSET($D51,1,$C51,ROW($C$448)-ROW($C51)),0))","v":33},"","Nível 4","Nível 4","-","AGETOP",20202,"REFORMA GERAL DO BLOCO EM ANEXO","m2    ",null,null,null,0,""]
["S",4,"S",0,1,3,1,1,0,0,0,"","Serviço","Serviço","-","AGETOP",41140,"REGULARIZAÇÃO DO TERRENO SEM APILOAMENTO COM TRANSPORTE MANUAL DA TERRA ESCAVADA ","m2    ",123.68,null,null,0,""]
[{"$f":"CHOOSE(1+LOG(1+2*(ORÇAMENTO.Nivel=\"Nível 1\")+4*(ORÇAMENTO.Nivel=\"Nível 2\")+8*(ORÇAMENTO.Nivel=\"Nível 3\")+16*(ORÇAMENTO.Nivel=\"Nível 4\")+32*(ORÇAMENTO.Nivel=\"Serviço\"),2),0,1,2,3,4,\"S\")","v":"S"},{"$f":"IF(OR(C53=\"s\",C53=0),OFFSET(B53,-1,0),C53)","v":4},{"$f":"IF(OFFSET(C53,-1,0)=\"L\",1,IF(OFFSET(C53,-1,0)=1,2,IF(OR(A53=\"s\",A53=0),\"S\",IF(AND(OFFSET(C53,-1,0)=2,A53=4),3,IF(AND(OR(OFFSET(C53,-1,0)=\"s\",OFFSET(C53,-1,0)=0),A53<>\"s\",A53>OFFSET(B53,-1,0)),OFFSET(B53,-1,0),A53)))))","v":"S"},{"$f":"IF(OR(C53=\"S\",C53=0),0,IF(ISERROR(K53),J53,SMALL(J53:K53,1)))","v":0},{"$f":"IF($C53=1,OFFSET(E53,-1,0)+1,OFFSET(E53,-1,0))","v":1},{"$f":"IF($C53=1,0,IF($C53=2,OFFSET(F53,-1,0)+1,OFFSET(F53,-1,0)))","v":3},{"$f":"IF(AND($C53<=2,$C53<>0),0,IF($C53=3,OFFSET(G53,-1,0)+1,OFFSET(G53,-1,0)))","v":1},{"$f":"IF(AND($C53<=3,$C53<>0),0,IF($C53=4,OFFSET(H53,-1,0)+1,OFFSET(H53,-1,0)))","v":1},{"$f":"IF(AND($C53<=4,$C53<>0),0,IF(AND($C53=\"S\",$W53>0),OFFSET(I53,-1,0)+1,OFFSET(I53,-1,0)))","v":0},0,0,"","Serviço","Serviço","-","AGETOP",41002,"APILOAMENTO","m2    ",123.68,null,null,0,""]
[{"$f":"CHOOSE(1+LOG(1+2*(ORÇAMENTO.Nivel=\"Nível 1\")+4*(ORÇAMENTO.Nivel=\"Nível 2\")+8*(ORÇAMENTO.Nivel=\"Nível 3\")+16*(ORÇAMENTO.Nivel=\"Nível 4\")+32*(ORÇAMENTO.Nivel=\"Serviço\"),2),0,1,2,3,4,\"S\")","v":2},{"$f":"IF(OR(C54=\"s\",C54=0),OFFSET(B54,-1,0),C54)","v":2},{"$f":"IF(OFFSET(C54,-1,0)=\"L\",1,IF(OFFSET(C54,-1,0)=1,2,IF(OR(A54=\"s\",A54=0),\"S\",IF(AND(OFFSET(C54,-1,0)=2,A54=4),3,IF(AND(OR(OFFSET(C54,-1,0)=\"s\",OFFSET(C54,-1,0)=0),A54<>\"s\",A54>OFFSET(B54,-1,0)),OFFSET(B54,-1,0),A54)))))","v":2},{"$f":"IF(OR(C54=\"S\",C54=0),0,IF(ISERROR(K54),J54,SMALL(J54:K54,1)))","v":16},{"$f":"IF($C54=1,OFFSET(E54,-1,0)+1,OFFSET(E54,-1,0))","v":1},{"$f":"IF($C54=1,0,IF($C54=2,OFFSET(F54,-1,0)+1,OFFSET(F54,-1,0)))","v":4},{"$f":"IF(AND($C54<=2,$C54<>0),0,IF($C54=3,OFFSET(G54,-1,0)+1,OFFSET(G54,-1,0)))","v":0},{"$f":"IF(AND($C54<=3,$C54<>0),0,IF($C54=4,OFFSET(H54,-1,0)+1,OFFSET(H54,-1,0)))","v":0},{"$f":"IF(AND($C54<=4,$C54<>0),0,IF(AND($C54=\"S\",$W54>0),OFFSET(I54,-1,0)+1,OFFSET(I54,-1,0)))","v":0},394,16,"","Nível 2","Nível 2","-","AGETOP",null,"FUNDAÇÕES E SONDAGENS","-",null,null,null,0,""]
[3,3,3,4,1,4,1,0,0,15,4,"","Nível 3","Nível 3","-","SINAPI",null,"ESTACAS","-",null,null,null,0,""]
["S",3,"S",0,1,4,1,0,0,0,0,"","Serviço","Serviço","-","SINAPI",98230,"ESTACA BROCA DE CONCRETO, DIÂMETRO DE 30 CM, PROFUNDIDADE DE ATÉ 3 M, ESCAVAÇÃO MANUAL COM TRADO CONCHA, NÃO ARMADA. AF_03/2018","M",16,null,null,0,"Referência: AGETOP - 50302"]
["S",3,"S",0,1,4,1,0,0,0,0,"","Serviço","Serviço","-","SINAPI",95577,"MONTAGEM DE ARMADURA LONGITUDINAL DE ESTACAS DE SEÇÃO CIRCULAR, DIÂMETRO = 10,0 MM. AF_11/2016","KG",59.999999999999993,null,null,0,"Referência: AGETOP - 52005"]
["S",3,"S",0,1,4,1,0,0,0,0,"","Serviço","Serviço","-","SINAPI",95583,"MONTAGEM DE ARMADURA TRANSVERSAL DE ESTACAS DE SEÇÃO CIRCULAR, DIÂMETRO = 5,0 MM. AF_11/2016","KG",18,null,null,0,"Referência: AGETOP - 52014"]
[3,3,3,5,1,4,2,0,0,11,5,"","Nível 3","Nível 3","-","SINAPI",null,"BLOCO","-",null,null,null,0,""]
["S",3,"S",0,1,4,2,0,0,0,0,"","Serviço","Serviço","-","SINAPI",96522,"ESCAVAÇÃO MANUAL PARA BLOCO DE COROAMENTO OU SAPATA, SEM PREVISÃO DE FÔRMA. AF_06/2017","M3",0.79200000000000004,null,null,0,"Referência: AGETOP - 50901"]
["S",3,"S",0,1,4,2,0,0,0,0,"","Serviço","Serviço","-","AGETOP",50902,"APILOAMENTO (BLOCOS/SAPATAS)","m2    ",1.44,null,null,0,""]
["S",3,"S",0,1,4,2,0,0,0,0,"","Serviço","Serviço","-","SINAPI","74157/4","LANCAMENTO/APLICACAO MANUAL DE CONCRETO EM FUNDACOES","M3",0.94,null,null,0,"Referência: AGETOP - 51026"]
["S",3,"S",0,1,4,2,0,0,0,0,"","Serviço","Serviço","-","SINAPI",96543,"ARMAÇÃO DE BLOCO, VIGA BALDRAME E SAPATA UTILIZANDO AÇO CA-60 DE 5 MM - MONTAGEM. AF_06/2017","KG",11.636363636363637,null,null,0,"Referência: AGETOP - 52014"]
[3,3,3,6,1,4,3,0,0,6,170,"","Nível 3","Nível 3","-","SINAPI",null,"VIGAS BALDRAMES","-",null,null,null,0,""]
["S",3,"S",0,1,4,3,0,0,0,0,"","Serviço","Serviço","-","SINAPI",96526,"ESCAVAÇÃO MANUAL DE VALA PARA VIGA BALDRAME, SEM PREVISÃO DE FÔRMA. AF_06/2017","M3",1.7266666666666666,null,null,0,"Referência: AGETOP - 40101"]
["S",3,"S",0,1,4,3,0,0,0,0,"","Serviço","Serviço","-","AGETOP",60191,"FORMA DE TABUA CINTA BALDRAME U=8 VEZES","m2    ",12.25,null,null,0,""]
["S",3,"S",0,1,4,3,0,0,0,0,"","Serviço","Serviço","-","SINAPI","74157/4","LANCAMENTO/APLICACAO MANUAL DE CONCRETO EM FUNDACOES","M3",0.74,null,null,0,"Referência: AGETOP - 51026"]
["S",3,"S",0,1,4,3,0,0,0,0,"","Serviço","Serviço","-","SINAPI",96545,"ARMAÇÃO DE BLOCO, VIGA BALDRAME OU SAPATA UTILIZANDO AÇO CA-50 DE 8 MM - MONTAGEM. AF_06/2017","KG",24.636363636363637,null,null,0,"Referência: AGETOP - 52004"]
["S",3,"S",0,1,4,3,0,0,0,0,"","Serviço","Serviço","-","SINAPI",96543,"ARMAÇÃO DE BLOCO, VIGA BALDRAME E SAPATA UTILIZANDO AÇO CA-60 DE 5 MM - MONTAGEM. AF_06/2017","KG",11.454545454545453,null,null,0,"Referência: AGETOP - 52014"]
[{"$f":"CHOOSE(1+LOG(1+2*(ORÇAMENTO.Nivel=\"Nível 1\")+4*(ORÇAMENTO.Nivel=\"Nível 2\")+8*(ORÇAMENTO.Nivel=\"Nível 3\")+16*(ORÇAMENTO.Nivel=\"Nível 4\")+32*(ORÇAMENTO.Nivel=\"Serviço\"),2),0,1,2,3,4,\"S\")","v":2},{"$f":"IF(OR(C70=\"s\",C70=0),OFFSET(B70,-1,0),C70)","v":2},{"$f":"IF(OFFSET(C70,-1,0)=\"L\",1,IF(OFFSET(C70,-1,0)=1,2,IF(OR(A70=\"s\",A70=0),\"S\",IF(AND(OFFSET(C70,-1,0)=2,A70=4),3,IF(AND(OR(OFFSET(C70,-1,0)=\"s\",OFFSET(C70,-1,0)=0),A70<>\"s\",A70>OFFSET(B70,-1,0)),OFFSET(B70,-1,0),A70)))))","v":2},{"$f":"IF(OR(C70=\"S\",C70=0),0,IF(ISERROR(K70),J70,SMALL(J70:K70,1)))","v":18},{"$f":"IF($C70=1,OFFSET(E70,-1,0)+1,OFFSET(E70,-1,0))","v":1},{"$f":"IF($C70=1,0,IF($C70=2,OFFSET(F70,-1,0)+1,OFFSET(F70,-1,0)))","v":5},{"$f":"IF(AND($C70<=2,$C70<>0),0,IF($C70=3,OFFSET(G70,-1,0)+1,OFFSET(G70,-1,0)))","v":0},{"$f":"IF(AND($C70<=3,$C70<>0),0,IF($C70=4,OFFSET(H70,-1,0)+1,OFFSET(H70,-1,0)))","v":0},{"$f":"IF(AND($C70<=4,$C70<>0),0,IF(AND($C70=\"S\",$W70>0),OFFSET(I70,-1,0)+1,OFFSET(I70,-1,0)))","v":0},378,18,"","Nível 2","Nível 2","-","SINAPI",null,"ESTRUTURA","-",null,null,null,0,""]
[3,3,3,5,1,5,1,0,0,17,5,"","Nível 3","Nível 3","-","AGETOP",null,"PILARES","-",null,null,null,0,""]
["S",3,"S",0,1,5,1,0,0,0,0,"","Serviço","Serviço","-","SINAPI",92426,"MONTAGEM E DESMONTAGEM DE FÔRMA DE PILARES RETANGULARES E ESTRUTURAS SIMILARES COM ÁREA MÉDIA DAS SEÇÕES MENOR OU IGUAL A 0,25 M², PÉ-DIREITO SIMPLES, EM CHAPA DE MADEIRA COMPENSADA RESINADA, 8 UTILIZAÇÕES. AF_12/2015","M2",14.91,null,null,0,""]
["S",3,"S",0,1,5,1,0,0,0,0,"","Serviço","Serviço","-","SINAPI",92873,"LANÇAMENTO COM USO DE BALDES, ADENSAMENTO E ACABAMENTO DE CONCRETO EM ESTRUTURAS. AF_12/2015","M3",0.85,null,null,0,"Referência: AGETOP - 60801"]
["S",3,"S",0,1,5,1,0,0,{"$f":"IF(OR($C74=\"S\",$C74=0),0,MATCH(0,OFFSET($D74,1,$C74,ROW($C$448)-ROW($C74)),0))","v":0},{"$f":"IF(OR($C74=\"S\",$C74=0),0,MATCH(OFFSET($D74,0,$C74)+1,OFFSET($D74,1,$C74,ROW($C$448)-ROW($C74)),0))","v":0},"","Serviço","Serviço","-","SINAPI",92778,"ARMAÇÃO DE PILAR OU VIGA DE UMA ESTRUTURA CONVENCIONAL DE CONCRETO ARMADO EM UMA EDIFICAÇÃO TÉRREA OU SOBRADO UTILIZANDO AÇO CA-50 DE 10,0 MM - MONTAGEM. AF_12/2015","KG",55.72727272727272,null,null,0,"Referência: AGETOP - 60305"]
["S",3,"S",0,1,5,1,0,0,0,0,"","Serviço","Serviço","-","SINAPI",92775,"ARMAÇÃO DE PILAR OU VIGA DE UMA ESTRUTURA CONVENCIONAL DE CONCRETO ARMADO EM UMA EDIFICAÇÃO TÉRREA OU SOBRADO UTILIZANDO AÇO CA-60 DE 5,0 MM - MONTAGEM. AF_12/2015","KG",18.545454545454543,null,null,0,"Referência: AGETOP - 60314"]
[3,3,3,5,1,5,2,0,0,12,5,"","Nível 3","Nível 3","-",null,null,"VIGAS DE COBERTURA","-",null,null,null,0,""]
["S",3,"S",0,1,5,2,0,0,0,0,"","Serviço","Serviço","-","SINAPI",92464,"MONTAGEM E DESMONTAGEM DE FÔRMA DE VIGA, ESCORAMENTO METÁLICO, PÉ-DIREITO SIMPLES, EM CHAPA DE MADEIRA RESINADA, 8 UTILIZAÇÕES. AF_12/2015","M2",7.93,null,null,0,"Referência: AGETOP - 60209"]
["S",3,"S",0,1,5,2,0,0,0,0,"","Serviço","Serviço","-","SINAPI",92873,"LANÇAMENTO COM USO DE BALDES, ADENSAMENTO E ACABAMENTO DE CONCRETO EM ESTRUTURAS. AF_12/2015","M3",0.46,null,null,0,"Referência: AGETOP - 60801"]
["S",3,"S",0,1,5,2,0,0,0,0,"","Serviço","Serviço","-","SINAPI",92777,"ARMAÇÃO DE PILAR OU VIGA DE UMA ESTRUTURA CONVENCIONAL DE CONCRETO ARMADO EM UMA EDIFICAÇÃO TÉRREA OU SOBRADO UTILIZANDO AÇO CA-50 DE 8,0 MM - MONTAGEM. AF_12/2015","KG",18.272727272727273,null,null,0,"Referência: AGETOP - 60304"]
["S",3,"S",0,1,5,2,0,0,0,0,"","Serviço","Serviço","-","SINAPI",92775,"ARMAÇÃO DE PILAR OU VIGA DE UMA ESTRUTURA CONVENCIONAL DE CONCRETO ARMADO EM UMA EDIFICAÇÃO TÉRREA OU SOBRADO UTILIZANDO AÇO CA-60 DE 5,0 MM - MONTAGEM. AF_12/2015","KG",10.09090909090909,null,null,0,"Referência: AGETOP - 60314"]
[3,3,3,7,1,5,3,0,0,7,153,"","Nível 3","Nível 3","-","SINAPI",null,"OUTROS","-",null,null,null,0,""]
[{"$f":"CHOOSE(1+LOG(1+2*(ORÇAMENTO.Nivel=\"Nível 1\")+4*(ORÇAMENTO.Nivel=\"Nível 2\")+8*(ORÇAMENTO.Nivel=\"Nível 3\")+16*(ORÇAMENTO.Nivel=\"Nível 4\")+32*(ORÇAMENTO.Nivel=\"Serviço\"),2),0,1,2,3,4,\"S\")","v":4},{"$f":"IF(OR(C82=\"s\",C82=0),OFFSET(B82,-1,0),C82)","v":4},{"$f":"IF(OFFSET(C82,-1,0)=\"L\",1,IF(OFFSET(C82,-1,0)=1,2,IF(OR(A82=\"s\",A82=0),\"S\",IF(AND(OFFSET(C82,-1,0)=2,A82=4),3,IF(AND(OR(OFFSET(C82,-1,0)=\"s\",OFFSET(C82,-1,0)=0),A82<>\"s\",A82>OFFSET(B82,-1,0)),OFFSET(B82,-1,0),A82)))))","v":4},{"$f":"IF(OR(C82=\"S\",C82=0),0,IF(ISERROR(K82),J82,SMALL(J82:K82,1)))","v":2},{"$f":"IF($C82=1,OFFSET(E82,-1,0)+1,OFFSET(E82,-1,0))","v":1},{"$f":"IF($C82=1,0,IF($C82=2,OFFSET(F82,-1,0)+1,OFFSET(F82,-1,0)))","v":5},{"$f":"IF(AND($C82<=2,$C82<>0),0,IF($C82=3,OFFSET(G82,-1,0)+1,OFFSET(G82,-1,0)))","v":3},{"$f":"IF(AND($C82<=3,$C82<>0),0,IF($C82=4,OFFSET(H82,-1,0)+1,OFFSET(H82,-1,0)))","v":1},{"$f":"IF(AND($C82<=4,$C82<>0),0,IF(AND($C82=\"S\",$W82>0),OFFSET(I82,-1,0)+1,OFFSET(I82,-1,0)))","v":0},6,2,"","Nível 4","Nível 4","-","SINAPI",null,"SALA DO GRÊMIO","-",null,null,null,0,""]
["S",4,"S",0,1,5,3,1,0,0,0,"","Serviço","Serviço","-","AGETOP",60010,"VERGA/CONTRAVERGA EM CONCRETO ARMADO FCK = 20 MPA","m3    ",0.2,null,null,0,""]
[4,4,4,2,1,5,3,2,0,4,2,"","Nível 4","Nível 4","-","SINAPI",null,"REFORMA GERAL DO BLOCO EM ANEXO","-",null,null,null,0,""]
["S",4,"S",0,1,5,3,2,0,0,0,"","Serviço","Serviço","-","AGETOP",60010,"VERGA/CONTRAVERGA EM CONCRETO ARMADO FCK = 20 MPA","m3    ",0.18,null,null,0,""]
[4,4,4,2,1,5,3,3,0,2,93,"","Nível 4","Nível 4","-","SINAPI",null,"REFORMA DOS BANHEIROS","-",null,null,null,0,""]
["S",4,"S",0,1,5,3,3,0,0,0,"","Serviço","Serviço","-","AGETOP",60010,"VERGA/CONTRAVERGA EM CONCRETO ARMADO FCK = 20 MPA","m3    ",0.13,null,null,0,""]
[{"$f":"CHOOSE(1+LOG(1+2*(ORÇAMENTO.Nivel=\"Nível 1\")+4*(ORÇAMENTO.Nivel=\"Nível 2\")+8*(ORÇAMENTO.Nivel=\"Nível 3\")+16*(ORÇAMENTO.Nivel=\"Nível 4\")+32*(ORÇAMENTO.Nivel=\"Serviço\"),2),0,1,2,3,4,\"S\")","v":2},{"$f":"IF(OR(C88=\"s\",C88=0),OFFSET(B88,-1,0),C88)","v":2},{"$f":"IF(OFFSET(C88,-1,0)=\"L\",1,IF(OFFSET(C88,-1,0)=1,2,IF(OR(A88=\"s\",A88=0),\"S\",IF(AND(OFFSET(C88,-1,0)=2,A88=4),3,IF(AND(OR(OFFSET(C88,-1,0)=\"s\",OFFSET(C88,-1,0)=0),A88<>\"s\",A88>OFFSET(B88,-1,0)),OFFSET(B88,-1,0),A88)))))","v":2},{"$f":"IF(OR(C88=\"S\",C88=0),0,IF(ISERROR(K88),J88,SMALL(J88:K88,1)))","v":70},{"$f":"IF($C88=1,OFFSET(E88,-1,0)+1,OFFSET(E88,-1,0))","v":1},{"$f":"IF($C88=1,0,IF($C88=2,OFFSET(F88,-1,0)+1,OFFSET(F88,-1,0)))","v":6},{"$f":"IF(AND($C88<=2,$C88<>0),0,IF($C88=3,OFFSET(G88,-1,0)+1,OFFSET(G88,-1,0)))","v":0},{"$f":"IF(AND($C88<=3,$C88<>0),0,IF($C88=4,OFFSET(H88,-1,0)+1,OFFSET(H88,-1,0)))","v":0},{"$f":"IF(AND($C88<=4,$C88<>0),0,IF(AND($C88=\"S\",$W88>0),OFFSET(I88,-1,0)+1,OFFSET(I88,-1,0)))","v":0},360,70,"","Nível 2","Nível 2","-",null,null,"INSTALAÇÕES ELÉTRICAS","-",null,null,null,0,""]
[3,3,3,2,1,6,1,0,0,69,2,"","Nível 3","Nível 3","-","SINAPI",null,"SERVIÇO PRELIMINAR","-",null,null,null,0,""]
["S",3,"S",0,1,6,1,0,0,0,0,"","Serviço","Serviço","-","AGETOP",20162,"DEMOLIÇÃO DAS INSTALAÇÕES ELÉTRICAS E AFINS C/ TRANSP. ATÉ CB. E CARGA","H     ",8,null,null,0,""]
[3,3,3,3,1,6,2,0,0,67,3,"","Nível 3","Nível 3","-","AGETOP",null,"MOVIMENTAÇÃO DE TERRA","-",null,null,null,0,""]
["S",3,"S",0,1,6,2,0,0,0,0,"","Serviço","Serviço","-","SINAPI",93358,"ESCAVAÇÃO MANUAL DE VALA COM PROFUNDIDADE MENOR OU IGUAL A 1,30 M. AF_03/2016","M3",30,null,null,0,"Referência: AGETOP - 40101"]
["S",3,"S",0,1,6,2,0,0,0,0,"","Serviço","Serviço","-","SINAPI",96995,"REATERRO MANUAL APILOADO COM SOQUETE. AF_10/2017","M3",30,null,null,0,"Referência: AGETOP - 40902"]
[3,3,3,64,1,6,3,0,0,64,140,"","Nível 3","Nível 3","-",null,null,"REFORMA ELÉTRICA","-",null,null,null,0,""]
["S",3,"S",0,1,6,3,0,0,{"$f":"IF(OR($C95=\"S\",$C95=0),0,MATCH(0,OFFSET($D95,1,$C95,ROW($C$448)-ROW($C95)),0))","v":0},{"$f":"IF(OR($C95=\"S\",$C95=0),0,MATCH(OFFSET($D95,0,$C95)+1,OFFSET($D95,1,$C95,ROW($C$448)-ROW($C95)),0))","v":0},"","Serviço","Serviço","-","AGETOP",70371,"BRACADEIRA METALICA TIPO \"D\" DIAM. 3/4\"","Un    ",200,null,null,0,""]
["S",3,"S",0,1,6,3,0,0,0,0,"","Serviço","Serviço","-","AGETOP",70372,"BRACADEIRA METALICA TIPO \"D\" DIAM. 1\"","Un    ",42,null,null,0,""]
["S",3,"S",0,1,6,3,0,0,0,0,"","Serviço","Serviço","-","AGETOP",70374,"BRACADEIRA METALICA TIPO \"D\" DIAM. 1.1/2\"","Un    ",10,null,null,0,""]
["S",3,"S",0,1,6,3,0,0,0,0,"","Serviço","Serviço","-","AGETOP",70375,"BRACADEIRA METALICA TIPO \"D\" DIAM. 2\"","Un    ",23,null,null,0,""]
["S",3,"S",0,1,6,3,0,0,0,0,"","Serviço","Serviço","-","AGETOP",70421,"BUCHA E ARRUELA METALICA DIAM. 3/4\"","PR    ",200,null,null,0,""]
["S",3,"S",0,1,6,3,0,0,0,0,"","Serviço","Serviço","-","AGETOP",70422,"BUCHA E ARRUELA METALICA DIAM. 1\"","PR    ",42,null,null,0,""]
["S",3,"S",0,1,6,3,0,0,0,0,"","Serviço","Serviço","-","AGETOP",70425,"BUCHA E ARRUELA METALICA DIAM. 2\"","PR    ",10,null,null,0,""]
["S",3,"S",0,1,6,3,0,0,0,0,"","Serviço","Serviço","-","AGETOP",70426,"BUCHA E ARRUELA METALICA DIAM. 2.1/2\"","PR    ",23,null,null,0,""]
["S",3,"S",0,1,6,3,0,0,0,0,"","Serviço","Serviço","-","SINAPI",91928,"CABO DE COBRE FLEXÍVEL ISOLADO, 4 MM², ANTI-CHAMA 450/750 V, PARA CIRCUITOS TERMINAIS - FORNECIMENTO E INSTALAÇÃO. AF_12/2015","M",738,null,null,0,"Referência: AGETOP - 70564"]
["S",3,"S",0,1,6,3,0,0,0,0,"","Serviço","Serviço","-","COMPOSIÇÃO","COMP 385_SEE","DEMOLIÇÃO POSTE DE CONCRETO/METALICA ENTRE 10 E 15 METROS C/ REAPROVEITAMENTO C/ TRANSPORTE ATE CAÇAMBA E CARGA","UN ",1,null,null,0,""]
["S",3,"S",0,1,6,3,0,0,0,0,"","Serviço","Serviço","-","AGETOP",70720,"CAIXA METÁLICA PARA MEDIDOR POLIFÁSICO PADRÃO ENEL 500X380X166MM","Un    ",1,null,null,0,""]
["S",3,"S",0,1,6,3,0,0,0,0,"","Serviço","Serviço","-","SINAPI",98111,"CAIXA DE INSPEÇÃO PARA ATERRAMENTO, CIRCULAR, EM POLIETILENO, DIÂMETRO INTERNO = 0,3 M. AF_05/2018","UN",1,null,null,0,""]
["S",3,"S",0,1,6,3,0,0,0,0,"","Serviço","Serviço","-","SINAPI",96986,"HASTE DE ATERRAMENTO 3/4  PARA SPDA - FORNECIMENTO E INSTALAÇÃO. AF_12/2017","UN",4,null,null,0,""]
["S",3,"S",0,1,6,3,0,0,0,0,"","Serviço","Serviço","-","AGETOP",70541,"CABO DE COBRE NU No. 16 MM2 (6,94 M/KG)","M     ",20,null,null,0,""]
["S",3,"S",0,1,6,3,0,0,0,0,"","Serviço","Serviço","-","AGETOP",71251,"ELETRODUTO EM AÇO ZINCADO DIÂMETRO 3/4\"","M     ",300,null,null,0,""]
["S",3,"S",0,1,6,3,0,0,0,0,"","Serviço","Serviço","-","AGETOP",71252,"ELETRODUTO EM AÇO ZINCADO DIÂMETRO 1\"","M     ",63,null,null,0,""]
["S",3,"S",0,1,6,3,0,0,0,0,"","Serviço","Serviço","-","AGETOP",71254,"ELETRODUTO EM AÇO ZINCADO DIÂMETRO 1.1/2\"","M     ",15,null,null,0,""]
["S",3,"S",0,1,6,3,0,0,0,0,"","Serviço","Serviço","-","AGETOP",71255,"ELETRODUTO EM AÇO ZINCADO DIÂMETRO 2\"","M     ",34,null,null,0,""]
["S",3,"S",0,1,6,3,0,0,0,0,"","Serviço","Serviço","-","AGETOP",71722,"LUVA EM AÇO ZINCADO DIÂMETRO 3/4\"","Un    ",85,null,null,0,""]
["S",3,"S",0,1,6,3,0,0,0,0,"","Serviço","Serviço","-","AGETOP",71721,"LUVA EM AÇO ZINCADO DIÂMETRO 1\"","Un    ",15,null,null,0,""]
["S",3,"S",0,1,6,3,0,0,0,0,"","Serviço","Serviço","-","AGETOP",71724,"LUVA EM AÇO ZINCADO DIÂMETRO 1.1/2\"","Un    ",3,null,null,0,""]
["S",3,"S",0,1,6,3,0,0,0,0,"","Serviço","Serviço","-","AGETOP",71725,"LUVA EM AÇO ZINCADO DIÂMETRO 2\"","Un    ",4,null,null,0,""]
["S",3,"S",0,1,6,3,0,0,0,0,"","Serviço","Serviço","-","AGETOP",71121,"CURVA 90 GRAUS AÇO ZINCADO DIÂMETRO 3/4\"","Un    ",45,null,null,0,""]
["S",3,"S",0,1,6,3,0,0,0,0,"","Serviço","Serviço","-","AGETOP",71122,"CURVA 90 GRAUS AÇO ZINCADO DIÂMETRO 1\"","Un    ",7,null,null,0,""]
["S",3,"S",0,1,6,3,0,0,0,0,"","Serviço","Serviço","-","AGETOP",71124,"CURVA 90 GRAUS AÇO ZINCADO DIÂMETRO 1.1/2\"","Un    ",2,null,null,0,""]
["S",3,"S",0,1,6,3,0,0,0,0,"","Serviço","Serviço","-","AGETOP",71125,"CURVA 90 GRAUS AÇO ZINCADO DIÂMETRO 2\"","Un    ",3,null,null,0,""]
["S",3,"S",0,1,6,3,0,0,0,0,"","Serviço","Serviço","-","SINAPI",95778,"CONDULETE DE ALUMÍNIO, TIPO C, PARA ELETRODUTO DE AÇO GALVANIZADO DN 20 MM (3/4''), APARENTE - FORNECIMENTO E INSTALAÇÃO. AF_11/2016_P","UN",24,null,null,0,""]
["S",3,"S",0,1,6,3,0,0,0,0,"","Serviço","Serviço","-","SINAPI",95779,"CONDULETE DE ALUMÍNIO, TIPO E, PARA ELETRODUTO DE AÇO GALVANIZADO DN 20 MM (3/4''), APARENTE - FORNECIMENTO E INSTALAÇÃO. AF_11/2016_P","UN",14,null,null,0,""]
["S",3,"S",0,1,6,3,0,0,0,0,"","Serviço","Serviço","-","SINAPI",95787,"CONDULETE DE ALUMÍNIO, TIPO LR, PARA ELETRODUTO DE AÇO GALVANIZADO DN 20 MM (3/4''), APARENTE - FORNECIMENTO E INSTALAÇÃO. AF_11/2016_P","UN",8,null,null,0,""]
["S",3,"S",0,1,6,3,0,0,0,0,"","Serviço","Serviço","-","SINAPI",95795,"CONDULETE DE ALUMÍNIO, TIPO T, PARA ELETRODUTO DE AÇO GALVANIZADO DN 20 MM (3/4''), APARENTE - FORNECIMENTO E INSTALAÇÃO. AF_11/2016_P","UN",31,null,null,0,""]
["S",3,"S",0,1,6,3,0,0,0,0,"","Serviço","Serviço","-","SINAPI",95801,"CONDULETE DE ALUMÍNIO, TIPO X, PARA ELETRODUTO DE AÇO GALVANIZADO DN 20 MM (3/4''), APARENTE - FORNECIMENTO E INSTALAÇÃO. AF_11/2016_P","UN",5,null,null,0,"Referência: AGETOP - 70929"]
["S",3,"S",0,1,6,3,0,0,0,0,"","Serviço","Serviço","-","AGETOP",70929,"CONDULETE METÁLICO - CAIXA COM 5 ENTRADAS ","un    ",10,null,null,0,""]
["S",3,"S",0,1,6,3,0,0,{"$f":"IF(OR($C127=\"S\",$C127=0),0,MATCH(0,OFFSET($D127,1,$C127,ROW($C$448)-ROW($C127)),0))","v":0},{"$f":"IF(OR($C127=\"S\",$C127=0),0,MATCH(OFFSET($D127,0,$C127)+1,OFFSET($D127,1,$C127,ROW($C$448)-ROW($C127)),0))","v":0},"","Serviço","Serviço","-","AGETOP",81161,"BUCHA DE REDUCAO SOLD.CURTA 25 MM X 20 MM","Un    ",9,null,null,0,""]
["S",3,"S",0,1,6,3,0,0,0,0,"","Serviço","Serviço","-","AGETOP",81176,"BUCHA DE REDUCAO SOLD.LONGA 40 X 20 mm","Un    ",7,null,null,0,""]
["S",3,"S",0,1,6,3,0,0,0,0,"","Serviço","Serviço","-","AGETOP",81177,"BUCHA DE REDUCAO SOLD.LONGA 40 X 25","Un    ",1,null,null,0,""]
["S",3,"S",0,1,6,3,0,0,0,0,"","Serviço","Serviço","-","SINAPI",97599,"LUMINÁRIA DE EMERGÊNCIA - FORNECIMENTO E INSTALAÇÃO. AF_11/2017","UN",14,null,null,0,""]
["S",3,"S",0,1,6,3,0,0,0,0,"","Serviço","Serviço","-","SINAPI","73953/4","LUMINÁRIAS TIPO CALHA, DE SOBREPOR, COM REATORES DE PARTIDA RÁPIDA E LÂMPADAS FLUORESCENTES 2X2X18W, COMPLETAS, FORNECIMENTO E INSTALAÇÃO","UN",42,null,null,0,""]
["S",3,"S",0,1,6,3,0,0,0,0,"","Serviço","Serviço","-","AGETOP",70561,"CABO ISOLADO PP 3 X 2,5 MM2","M     ",42,null,null,0,""]
["S",3,"S",0,1,6,3,0,0,0,0,"","Serviço","Serviço","-","AGETOP",71411,"INTERRUPTOR 1 SEÇÃO (LINHA X OU EQUIVALENTE)","Un    ",5,null,null,0,""]
["S",3,"S",0,1,6,3,0,0,0,0,"","Serviço","Serviço","-","AGETOP",71412,"INTERRUPTOR 2 SEÇÕES (LINHA X OU EQUIVALENTE)","Un    ",3,null,null,0,""]
["S",3,"S",0,1,6,3,0,0,0,0,"","Serviço","Serviço","-","SINAPI",92868,"CAIXA RETANGULAR 4\" X 2\" MÉDIA (1,30 M DO PISO), METÁLICA, INSTALADA EM PAREDE - FORNECIMENTO E INSTALAÇÃO. AF_12/2015","UN",11,null,null,0,"Referência: AGETOP - 70691"]
["S",3,"S",0,1,6,3,0,0,0,0,"","Serviço","Serviço","-","SINAPI",97893,"CAIXA ENTERRADA ELÉTRICA RETANGULAR, EM ALVENARIA COM BLOCOS DE CONCRETO, FUNDO COM BRITA, DIMENSÕES INTERNAS: 0,8X0,8X0,6 M. AF_05/2018","UN",2,null,null,0,""]
["S",3,"S",0,1,6,3,0,0,0,0,"","Serviço","Serviço","-","SINAPI",92008,"TOMADA BAIXA DE EMBUTIR (2 MÓDULOS), 2P+T 10 A, INCLUINDO SUPORTE E PLACA - FORNECIMENTO E INSTALAÇÃO. AF_12/2015","UN",8,null,null,0,""]
["S",3,"S",0,1,6,3,0,0,0,0,"","Serviço","Serviço","-","SINAPI",92004,"TOMADA MÉDIA DE EMBUTIR (2 MÓDULOS), 2P+T 10 A, INCLUINDO SUPORTE E PLACA - FORNECIMENTO E INSTALAÇÃO. AF_12/2015","UN",2,null,null,0,"Referência: AGETOP - 72578"]
["S",3,"S",0,1,6,3,0,0,0,0,"","Serviço","Serviço","-","SINAPI",92000,"TOMADA BAIXA DE EMBUTIR (1 MÓDULO), 2P+T 10 A, INCLUINDO SUPORTE E PLACA - FORNECIMENTO E INSTALAÇÃO. AF_12/2015","UN",8,null,null,0,"Referência: AGETOP - 72578"]
["S",3,"S",0,1,6,3,0,0,0,0,"","Serviço","Serviço","-","AGETOP",71043,"CONECTOR TRIPOLAR EM PORCELANA PARA FIOS DE ATÉ 10MM2 (BORNES) 50A-250V (CHUVEIRO)","un    ",5,null,null,0,""]
["S",3,"S",0,1,6,3,0,0,0,0,"","Serviço","Serviço","-","AGETOP",72575,"TOMADA HEXAGONAL 2P + T - 20A - 250V (LINHA X OU EQUIVALENTE)","Un    ",5,null,null,0,""]
["S",3,"S",0,1,6,3,0,0,0,0,"","Serviço","Serviço","-","SINAPI",91926,"CABO DE COBRE FLEXÍVEL ISOLADO, 2,5 MM², ANTI-CHAMA 450/750 V, PARA CIRCUITOS TERMINAIS - FORNECIMENTO E INSTALAÇÃO. AF_12/2015","M",1510,null,null,0,"Referência: AGETOP - 70563"]
["S",3,"S",0,1,6,3,0,0,0,0,"","Serviço","Serviço","-","SINAPI",91928,"CABO DE COBRE FLEXÍVEL ISOLADO, 4 MM², ANTI-CHAMA 450/750 V, PARA CIRCUITOS TERMINAIS - FORNECIMENTO E INSTALAÇÃO. AF_12/2015","M",180,null,null,0,"Referência: AGETOP - 70564"]
["S",3,"S",0,1,6,3,0,0,0,0,"","Serviço","Serviço","-","SINAPI",91931,"CABO DE COBRE FLEXÍVEL ISOLADO, 6 MM², ANTI-CHAMA 0,6/1,0 KV, PARA CIRCUITOS TERMINAIS - FORNECIMENTO E INSTALAÇÃO. AF_12/2015","M",280,null,null,0,"Referência: AGETOP - 70583"]
["S",3,"S",0,1,6,3,0,0,0,0,"","Serviço","Serviço","-","SINAPI",92984,"CABO DE COBRE FLEXÍVEL ISOLADO, 25 MM², ANTI-CHAMA 0,6/1,0 KV, PARA DISTRIBUIÇÃO - FORNECIMENTO E INSTALAÇÃO. AF_12/2015","M",140,null,null,0,"Referência: AGETOP - 70511"]
["S",3,"S",0,1,6,3,0,0,0,0,"","Serviço","Serviço","-","SINAPI",92986,"CABO DE COBRE FLEXÍVEL ISOLADO, 35 MM², ANTI-CHAMA 0,6/1,0 KV, PARA DISTRIBUIÇÃO - FORNECIMENTO E INSTALAÇÃO. AF_12/2015","M",60,null,null,0,"Referência: AGETOP - 70512"]
["S",3,"S",0,1,6,3,0,0,0,0,"","Serviço","Serviço","-","SINAPI","74131/5","QUADRO DE DISTRIBUICAO DE ENERGIA DE EMBUTIR, EM CHAPA METALICA, PARA 24 DISJUNTORES TERMOMAGNETICOS MONOPOLARES, COM BARRAMENTO TRIFASICO E NEUTRO, FORNECIMENTO E INSTALACAO","UN",1,null,null,0,""]
["S",3,"S",0,1,6,3,0,0,0,0,"","Serviço","Serviço","-","AGETOP",71450,"INTERRUPTOR DIFERENCIAL RESIDUAL (D.R.) BIPOLAR DE 25A-30mA","Un    ",2,null,null,0,""]
["S",3,"S",0,1,6,3,0,0,0,0,"","Serviço","Serviço","-","SINAPI",93654,"DISJUNTOR MONOPOLAR TIPO DIN, CORRENTE NOMINAL DE 16A - FORNECIMENTO E INSTALAÇÃO. AF_04/2016","UN",7,null,null,0,""]
["S",3,"S",0,1,6,3,0,0,0,0,"","Serviço","Serviço","-","SINAPI",93656,"DISJUNTOR MONOPOLAR TIPO DIN, CORRENTE NOMINAL DE 25A - FORNECIMENTO E INSTALAÇÃO. AF_04/2016","UN",3,null,null,0,""]
["S",3,"S",0,1,6,3,0,0,0,0,"","Serviço","Serviço","-","SINAPI",93672,"DISJUNTOR TRIPOLAR TIPO DIN, CORRENTE NOMINAL DE 40A - FORNECIMENTO E INSTALAÇÃO. AF_04/2016","UN",2,null,null,0,"Referência: AGETOP - 71174"]
[{"$f":"CHOOSE(1+LOG(1+2*(ORÇAMENTO.Nivel=\"Nível 1\")+4*(ORÇAMENTO.Nivel=\"Nível 2\")+8*(ORÇAMENTO.Nivel=\"Nível 3\")+16*(ORÇAMENTO.Nivel=\"Nível 4\")+32*(ORÇAMENTO.Nivel=\"Serviço\"),2),0,1,2,3,4,\"S\")","v":"S"},{"$f":"IF(OR(C152=\"s\",C152=0),OFFSET(B152,-1,0),C152)","v":3},{"$f":"IF(OFFSET(C152,-1,0)=\"L\",1,IF(OFFSET(C152,-1,0)=1,2,IF(OR(A152=\"s\",A152=0),\"S\",IF(AND(OFFSET(C152,-1,0)=2,A152=4),3,IF(AND(OR(OFFSET(C152,-1,0)=\"s\",OFFSET(C152,-1,0)=0),A152<>\"s\",A152>OFFSET(B152,-1,0)),OFFSET(B152,-1,0),A152)))))","v":"S"},{"$f":"IF(OR(C152=\"S\",C152=0),0,IF(ISERROR(K152),J152,SMALL(J152:K152,1)))","v":0},{"$f":"IF($C152=1,OFFSET(E152,-1,0)+1,OFFSET(E152,-1,0))","v":1},{"$f":"IF($C152=1,0,IF($C152=2,OFFSET(F152,-1,0)+1,OFFSET(F152,-1,0)))","v":6},{"$f":"IF(AND($C152<=2,$C152<>0),0,IF($C152=3,OFFSET(G152,-1,0)+1,OFFSET(G152,-1,0)))","v":3},{"$f":"IF(AND($C152<=3,$C152<>0),0,IF($C152=4,OFFSET(H152,-1,0)+1,OFFSET(H152,-1,0)))","v":0},{"$f":"IF(AND($C152<=4,$C152<>0),0,IF(AND($C152=\"S\",$W152>0),OFFSET(I152,-1,0)+1,OFFSET(I152,-1,0)))","v":0},0,0,"","Serviço","Serviço","-","AGETOP",70764,"CANALETA COM TAMPA (LINHA X OU EQUIVALENTE) 50X20X2000 MM","M     ",2,null,null,0,""]
["S",3,"S",0,1,6,3,0,0,0,0,"","Serviço","Serviço","-","SINAPI","74131/4","QUADRO DE DISTRIBUICAO DE ENERGIA DE EMBUTIR, EM CHAPA METALICA, PARA 18 DISJUNTORES TERMOMAGNETICOS MONOPOLARES, COM BARRAMENTO TRIFASICO E NEUTRO, FORNECIMENTO E INSTALACAO","UN",1,null,null,0,""]
["S",3,"S",0,1,6,3,0,0,0,0,"","Serviço","Serviço","-","SINAPI",93655,"DISJUNTOR MONOPOLAR TIPO DIN, CORRENTE NOMINAL DE 20A - FORNECIMENTO E INSTALAÇÃO. AF_04/2016","UN",3,null,null,0,""]
["S",3,"S",0,1,6,3,0,0,0,0,"","Serviço","Serviço","-","AGETOP",71184,"DISPOSITIVO DE PROTEÇÃO CONTRA SURTOS (D.P.S.) 275V DE 8 A 40KA","Un    ",3,null,null,0,""]
["S",3,"S",0,1,6,3,0,0,0,0,"","Serviço","Serviço","-","AGETOP",71175,"DISJUNTOR TRIPOLAR DE 60 A 100-A","Un    ",2,null,null,0,""]
["S",3,"S",0,1,6,3,0,0,0,0,"","Serviço","Serviço","-","AGETOP",72630,"TRILHO OU SUPORTE P/BORNE TERMINAL","M     ",1,null,null,0,""]
[{"$f":"CHOOSE(1+LOG(1+2*(ORÇAMENTO.Nivel=\"Nível 1\")+4*(ORÇAMENTO.Nivel=\"Nível 2\")+8*(ORÇAMENTO.Nivel=\"Nível 3\")+16*(ORÇAMENTO.Nivel=\"Nível 4\")+32*(ORÇAMENTO.Nivel=\"Serviço\"),2),0,1,2,3,4,\"S\")","v":2},{"$f":"IF(OR(C158=\"s\",C158=0),OFFSET(B158,-1,0),C158)","v":2},{"$f":"IF(OFFSET(C158,-1,0)=\"L\",1,IF(OFFSET(C158,-1,0)=1,2,IF(OR(A158=\"s\",A158=0),\"S\",IF(AND(OFFSET(C158,-1,0)=2,A158=4),3,IF(AND(OR(OFFSET(C158,-1,0)=\"s\",OFFSET(C158,-1,0)=0),A158<>\"s\",A158>OFFSET(B158,-1,0)),OFFSET(B158,-1,0),A158)))))","v":2},{"$f":"IF(OR(C158=\"S\",C158=0),0,IF(ISERROR(K158),J158,SMALL(J158:K158,1)))","v":81},{"$f":"IF($C158=1,OFFSET(E158,-1,0)+1,OFFSET(E158,-1,0))","v":1},{"$f":"IF($C158=1,0,IF($C158=2,OFFSET(F158,-1,0)+1,OFFSET(F158,-1,0)))","v":7},{"$f":"IF(AND($C158<=2,$C158<>0),0,IF($C158=3,OFFSET(G158,-1,0)+1,OFFSET(G158,-1,0)))","v":0},{"$f":"IF(AND($C158<=3,$C158<>0),0,IF($C158=4,OFFSET(H158,-1,0)+1,OFFSET(H158,-1,0)))","v":0},{"$f":"IF(AND($C158<=4,$C158<>0),0,IF(AND($C158=\"S\",$W158>0),OFFSET(I158,-1,0)+1,OFFSET(I158,-1,0)))","v":0},290,81,"","Nível 2","Nível 2","-","AGETOP",null,"INSTALAÇÕES HIDROSSANITÁRIAS","-",null,null,null,0,""]
[3,3,3,23,1,7,1,0,0,80,23,"","Nível 3","Nível 3","-","SINAPI",null,"PEÇAS E ACESSÓRIOS","-",null,null,null,0,""]
[4,4,4,6,1,7,1,1,0,22,6,"","Nível 4","Nível 4","-","SINAPI",null,"VASO SANITÁRIO E ACESSÓRIOS","-",null,null,null,0,""]
["S",4,"S",0,1,7,1,1,0,0,0,"","Serviço","Serviço","-","SINAPI",95470,"VASO SANITARIO SIFONADO CONVENCIONAL COM LOUÇA BRANCA, INCLUSO CONJUNTO DE LIGAÇÃO PARA BACIA SANITÁRIA AJUSTÁVEL - FORNECIMENTO E INSTALAÇÃO. AF_10/2016","UN",7,null,null,0,""]
["S",4,"S",0,1,7,1,1,0,0,0,"","Serviço","Serviço","-","SINAPI",99635,"VÁLVULA DE DESCARGA METÁLICA, BASE 1 1/2 \", ACABAMENTO METALICO CROMADO - FORNECIMENTO E INSTALAÇÃO. AF_01/2019","UN",7,null,null,0,"Referência: AGETOP - 80515"]
["S",4,"S",0,1,7,1,1,0,0,0,"","Serviço","Serviço","-","AGETOP",80520,"CONJUNTO DE FIXACAO P/VASO SANITARIO (PAR)","CJ    ",7,null,null,0,""]
["S",4,"S",0,1,7,1,1,0,{"$f":"IF(OR($C164=\"S\",$C164=0),0,MATCH(0,OFFSET($D164,1,$C164,ROW($C$448)-ROW($C164)),0))","v":0},{"$f":"IF(OR($C164=\"S\",$C164=0),0,MATCH(OFFSET($D164,0,$C164)+1,OFFSET($D164,1,$C164,ROW($C$448)-ROW($C164)),0))","v":0},"","Serviço","Serviço","-","AGETOP",80526,"ASSENTO EM POLIPROPILENO COM SISTEMA DE FECHAMENTO SUAVE PARA VASO SANITÁRIO","Un    ",7,null,null,0,""]
["S",4,"S",0,1,7,1,1,0,0,0,"","Serviço","Serviço","-","SINAPI",95544,"PAPELEIRA DE PAREDE EM METAL CROMADO SEM TAMPA, INCLUSO FIXAÇÃO. AF_10/2016","UN",7,null,null,0,""]
[4,4,4,8,1,7,1,2,0,16,8,"","Nível 4","Nível 4","-","SINAPI",null,"LAVATÓRIO E ACESSÓRIOS","-",null,null,null,0,""]
["S",4,"S",0,1,7,1,2,0,0,0,"","Serviço","Serviço","-","AGETOP",80542,"LAVATÓRIO MÉDIO SEM COLUNA","Un    ",1,null,null,0,""]
["S",4,"S",0,1,7,1,2,0,0,0,"","Serviço","Serviço","-","AGETOP",80550,"FIXACAO P/LAVATORIO (PAR)","PAR   ",1,null,null,0,""]
["S",4,"S",0,1,7,1,2,0,0,0,"","Serviço","Serviço","-","AGETOP",80556,"LIGAÇÃO FLEXÍVEL PVC DIAM.1/2\" (ENGATE)","Un    ",6,null,null,0,""]
["S",4,"S",0,1,7,1,2,0,0,0,"","Serviço","Serviço","-","SINAPI",86883,"SIFÃO DO TIPO FLEXÍVEL EM PVC 1\u0094 X 1.1/2\u0094 - FORNECIMENTO E INSTALAÇÃO. AF_12/2013","UN",6,null,null,0,""]
["S",4,"S",0,1,7,1,2,0,0,0,"","Serviço","Serviço","-","SINAPI",86915,"TORNEIRA CROMADA DE MESA, 1/2\" OU 3/4\", PARA LAVATÓRIO, PADRÃO MÉDIO - FORNECIMENTO E INSTALAÇÃO. AF_12/2013","UN",6,null,null,0,"Referência: AGETOP - 80570"]
["S",4,"S",0,1,7,1,2,0,0,0,"","Serviço","Serviço","-","SINAPI",86877,"VÁLVULA EM METAL CROMADO 1.1/2\" X 1.1/2\" PARA TANQUE OU LAVATÓRIO, COM OU SEM LADRÃO - FORNECIMENTO E INSTALAÇÃO. AF_12/2013","UN",6,null,null,0,""]
["S",4,"S",0,1,7,1,2,0,0,0,"","Serviço","Serviço","-","SINAPI",86901,"CUBA DE EMBUTIR OVAL EM LOUÇA BRANCA, 35 X 50CM OU EQUIVALENTE - FORNECIMENTO E INSTALAÇÃO. AF_12/2013","UN",5,null,null,0,"Referência: AGETOP - 80587"]
[4,4,4,5,1,7,1,3,0,8,5,"","Nível 4","Nível 4","-","SINAPI",null,"PIA E ACESSÓRIOS","-",null,null,null,0,""]
["S",4,"S",0,1,7,1,3,0,0,0,"","Serviço","Serviço","-","SINAPI",86909,"TORNEIRA CROMADA TUBO MÓVEL, DE MESA, 1/2\" OU 3/4\", PARA PIA DE COZINHA, PADRÃO ALTO - FORNECIMENTO E INSTALAÇÃO. AF_12/2013","UN",5,null,null,0,""]
["S",4,"S",0,1,7,1,3,0,0,0,"","Serviço","Serviço","-","AGETOP",80671,"SIFAO PVC P/PIA 1.1/2\" X 2\"","Un    ",5,null,null,0,""]
["S",4,"S",0,1,7,1,3,0,0,0,"","Serviço","Serviço","-","SINAPI",86878,"VÁLVULA EM METAL CROMADO TIPO AMERICANA 3.1/2\" X 1.1/2\" PARA PIA - FORNECIMENTO E INSTALAÇÃO. AF_12/2013","UN",5,null,null,0,""]
["S",4,"S",0,1,7,1,3,0,0,0,"","Serviço","Serviço","-","AGETOP",80689,"CUBA INOX 50X40X20CM E=0,7MM-AÇO 304","Un    ",5,null,null,0,""]
[4,4,4,3,1,7,1,4,0,3,16,"","Nível 4","Nível 4","-","SINAPI",null,"REGISTROS","-",null,null,null,0,""]
["S",4,"S",0,1,7,1,4,0,0,0,"","Serviço","Serviço","-","AGETOP",80905,"REGISTRO DE GAVETA BRUTO DIAMETRO 1.1/2\"","Un    ",2,null,null,0,""]
["S",4,"S",0,1,7,1,4,0,0,0,"","Serviço","Serviço","-","SINAPI",89987,"REGISTRO DE GAVETA BRUTO, LATÃO, ROSCÁVEL, 3/4\", COM ACABAMENTO E CANOPLA CROMADOS. FORNECIDO E INSTALADO EM RAMAL DE ÁGUA. AF_12/2014","UN",5,null,null,0,"Referência: AGETOP - 80926"]
[3,3,3,21,1,7,2,0,0,57,21,"","Nível 3","Nível 3","-","SINAPI",null,"ÁGUA FRIA","-",null,null,null,0,""]
[4,4,4,4,1,7,2,1,0,20,4,"","Nível 4","Nível 4","-","SINAPI",null,"TUBOS DE PVC SOLDÁVEL","-",null,null,null,0,""]
["S",4,"S",0,1,7,2,1,0,0,0,"","Serviço","Serviço","-","SINAPI",89402,"TUBO, PVC, SOLDÁVEL, DN 25MM, INSTALADO EM RAMAL DE DISTRIBUIÇÃO DE ÁGUA - FORNECIMENTO E INSTALAÇÃO. AF_12/2014","M",25,null,null,0,"Referência: AGETOP - 81003"]
["S",4,"S",0,1,7,2,1,0,0,0,"","Serviço","Serviço","-","SINAPI",89448,"TUBO, PVC, SOLDÁVEL, DN 40MM, INSTALADO EM PRUMADA DE ÁGUA - FORNECIMENTO E INSTALAÇÃO. AF_12/2014","M",45,null,null,0,""]
["S",4,"S",0,1,7,2,1,0,0,0,"","Serviço","Serviço","-","SINAPI",89449,"TUBO, PVC, SOLDÁVEL, DN 50MM, INSTALADO EM PRUMADA DE ÁGUA - FORNECIMENTO E INSTALAÇÃO. AF_12/2014","M",6,null,null,0,""]
[4,4,4,3,1,7,2,2,0,16,3,"","Nível 4","Nível 4","-","SINAPI",null,"ADAPTADORES DE PVC SOLDÁVEL","-",null,null,null,0,""]
["S",4,"S",0,1,7,2,2,0,0,0,"","Serviço","Serviço","-","SINAPI",89538,"ADAPTADOR CURTO COM BOLSA E ROSCA PARA REGISTRO, PVC, SOLDÁVEL, DN 25MM X 3/4\u0094, INSTALADO EM PRUMADA DE ÁGUA - FORNECIMENTO E INSTALAÇÃO. AF_12/2014","UN",10,null,null,0,""]
["S",4,"S",0,1,7,2,2,0,0,0,"","Serviço","Serviço","-","SINAPI",89596,"ADAPTADOR CURTO COM BOLSA E ROSCA PARA REGISTRO, PVC, SOLDÁVEL, DN 50MM X 1.1/2\u0094, INSTALADO EM PRUMADA DE ÁGUA - FORNECIMENTO E INSTALAÇÃO. AF_12/2014","UN",6,null,null,0,"Referência: AGETOP - 81069"]
[4,4,4,2,1,7,2,3,0,13,2,"","Nível 4","Nível 4","-","SINAPI",null,"LUVAS DE PVC","-",null,null,null,0,""]
["S",4,"S",0,1,7,2,3,0,0,0,"","Serviço","Serviço","-","SINAPI",89575,"LUVA, PVC, SOLDÁVEL, DN 50MM, INSTALADO EM PRUMADA DE ÁGUA - FORNECIMENTO E INSTALAÇÃO. AF_12/2014","UN",2,null,null,0,"Referência: AGETOP - 81105"]
[4,4,4,3,1,7,2,4,0,11,3,"","Nível 4","Nível 4","-","SINAPI",null,"BUCHAS","-",null,null,null,0,""]
["S",4,"S",0,1,7,2,4,0,0,0,"","Serviço","Serviço","-","AGETOP",81177,"BUCHA DE REDUCAO SOLD.LONGA 40 X 25","Un    ",2,null,null,0,""]
["S",4,"S",0,1,7,2,4,0,0,0,"","Serviço","Serviço","-","AGETOP",81179,"BUCHA DE REDUCAO SOLDAVEL LONGA 50 X 25 mm","Un    ",2,null,null,0,""]
[4,4,4,4,1,7,2,5,0,8,4,"","Nível 4","Nível 4","-","SINAPI",null,"JOELHO","-",null,null,null,0,""]
["S",4,"S",0,1,7,2,5,0,0,0,"","Serviço","Serviço","-","SINAPI",89481,"JOELHO 90 GRAUS, PVC, SOLDÁVEL, DN 25MM, INSTALADO EM PRUMADA DE ÁGUA - FORNECIMENTO E INSTALAÇÃO. AF_12/2014","UN",10,null,null,0,""]
["S",4,"S",0,1,7,2,5,0,0,0,"","Serviço","Serviço","-","SINAPI",89497,"JOELHO 90 GRAUS, PVC, SOLDÁVEL, DN 40MM, INSTALADO EM PRUMADA DE ÁGUA - FORNECIMENTO E INSTALAÇÃO. AF_12/2014","UN",5,null,null,0,""]
["S",4,"S",0,1,7,2,5,0,0,0,"","Serviço","Serviço","-","SINAPI",94672,"JOELHO 90 GRAUS COM BUCHA DE LATÃO, PVC, SOLDÁVEL, DN  25 MM, X 3/4\u0094 INSTALADO EM RESERVAÇÃO DE ÁGUA DE EDIFICAÇÃO QUE POSSUA RESERVATÓRIO DE FIBRA/FIBROCIMENTO   FORNECIMENTO E INSTALAÇÃO. AF_06/2016","UN",7,null,null,0,""]
[4,4,4,4,1,7,2,6,0,4,30,"","Nível 4","Nível 4","-","SINAPI",null,"TÊ","-",null,null,null,0,""]
["S",4,"S",0,1,7,2,6,0,0,0,"","Serviço","Serviço","-","SINAPI",89617,"TE, PVC, SOLDÁVEL, DN 25MM, INSTALADO EM PRUMADA DE ÁGUA - FORNECIMENTO E INSTALAÇÃO. AF_12/2014","UN",2,null,null,0,""]
["S",4,"S",0,1,7,2,6,0,0,0,"","Serviço","Serviço","-","SINAPI",89623,"TE, PVC, SOLDÁVEL, DN 40MM, INSTALADO EM PRUMADA DE ÁGUA - FORNECIMENTO E INSTALAÇÃO. AF_12/2014","UN",2,null,null,0,""]
["S",4,"S",0,1,7,2,6,0,0,0,"","Serviço","Serviço","-","SINAPI",89625,"TE, PVC, SOLDÁVEL, DN 50MM, INSTALADO EM PRUMADA DE ÁGUA - FORNECIMENTO E INSTALAÇÃO. AF_12/2014","UN",3,null,null,0,"Referência: AGETOP - 81405"]
[3,3,3,31,1,7,3,0,0,36,31,"","Nível 3","Nível 3","-","SINAPI",null,"ESGOTO SANITÁRIO","-",null,null,null,0,""]
[4,4,4,2,1,7,3,1,0,30,2,"","Nível 4","Nível 4","-","SINAPI",null,"CORPO DE CAIXA SIFONADA / RALO","-",null,null,null,0,""]
["S",4,"S",0,1,7,3,1,0,0,0,"","Serviço","Serviço","-","AGETOP",81663,"CORPO CX. SIFONADA DIAM. 150 X 150 X 50","Un    ",3,null,null,0,""]
[4,4,4,4,1,7,3,2,0,28,4,"","Nível 4","Nível 4","-","SINAPI",null,"CURVAS","-",null,null,null,0,""]
["S",4,"S",0,1,7,3,2,0,0,0,"","Serviço","Serviço","-","AGETOP",81732,"CURVA 90 GRAUS CURTA DIAM. 75 MM","Un    ",1,null,null,0,""]
["S",4,"S",0,1,7,3,2,0,0,0,"","Serviço","Serviço","-","AGETOP",81731,"CURVA 90 GRAUS CURTA DIAM. 50 MM","Un    ",1,null,null,0,""]
["S",4,"S",0,1,7,3,2,0,0,0,"","Serviço","Serviço","-","AGETOP",81730,"CURVA 90 GRAUS CURTA DIAM. 40 MM","Un    ",2,null,null,0,""]
[4,4,4,7,1,7,3,3,0,24,7,"","Nível 4","Nível 4","-","SINAPI",null,"JOELHOS","-",null,null,null,0,""]
["S",4,"S",0,1,7,3,3,0,0,0,"","Serviço","Serviço","-","SINAPI",89726,"JOELHO 45 GRAUS, PVC, SERIE NORMAL, ESGOTO PREDIAL, DN 40 MM, JUNTA SOLDÁVEL, FORNECIDO E INSTALADO EM RAMAL DE DESCARGA OU RAMAL DE ESGOTO SANITÁRIO. AF_12/2014","UN",2,null,null,0,""]
["S",4,"S",0,1,7,3,3,0,0,0,"","Serviço","Serviço","-","SINAPI",89802,"JOELHO 45 GRAUS, PVC, SERIE NORMAL, ESGOTO PREDIAL, DN 50 MM, JUNTA ELÁSTICA, FORNECIDO E INSTALADO EM PRUMADA DE ESGOTO SANITÁRIO OU VENTILAÇÃO. AF_12/2014","UN",3,null,null,0,""]
["S",4,"S",0,1,7,3,3,0,0,0,"","Serviço","Serviço","-","SINAPI",89810,"JOELHO 45 GRAUS, PVC, SERIE NORMAL, ESGOTO PREDIAL, DN 100 MM, JUNTA ELÁSTICA, FORNECIDO E INSTALADO EM PRUMADA DE ESGOTO SANITÁRIO OU VENTILAÇÃO. AF_12/2014","UN",1,null,null,0,""]
["S",4,"S",0,1,7,3,3,0,0,0,"","Serviço","Serviço","-","SINAPI",89744,"JOELHO 90 GRAUS, PVC, SERIE NORMAL, ESGOTO PREDIAL, DN 100 MM, JUNTA ELÁSTICA, FORNECIDO E INSTALADO EM RAMAL DE DESCARGA OU RAMAL DE ESGOTO SANITÁRIO. AF_12/2014","UN",2,null,null,0,"Referência: AGETOP - 81938"]
["S",4,"S",0,1,7,3,3,0,0,0,"","Serviço","Serviço","-","SINAPI",89731,"JOELHO 90 GRAUS, PVC, SERIE NORMAL, ESGOTO PREDIAL, DN 50 MM, JUNTA ELÁSTICA, FORNECIDO E INSTALADO EM RAMAL DE DESCARGA OU RAMAL DE ESGOTO SANITÁRIO. AF_12/2014","UN",13,null,null,0,""]
["S",4,"S",0,1,7,3,3,0,0,0,"","Serviço","Serviço","-","AGETOP",81927,"JOELHO 90 GRAUS C/ANEL 40 mm ","Un    ",2,null,null,0,""]
[4,4,4,5,1,7,3,4,0,17,5,"","Nível 4","Nível 4","-","SINAPI",null,"JUNÇÕES","-",null,null,null,0,""]
["S",4,"S",0,1,7,3,4,0,0,0,"","Serviço","Serviço","-","AGETOP",81973,"JUNCAO SIMPLES DIAM. 100 X 50 MM","Un    ",1,null,null,0,""]
["S",4,"S",0,1,7,3,4,0,0,0,"","Serviço","Serviço","-","AGETOP",81974,"JUNCAO SIMPLES DIAMETRO 100 X 75 MM","Un    ",1,null,null,0,""]
["S",4,"S",0,1,7,3,4,0,0,0,"","Serviço","Serviço","-","AGETOP",81971,"JUNCAO SIMPLES DIAM. 75 X 50 MM","Un    ",3,null,null,0,""]
["S",4,"S",0,1,7,3,4,0,0,0,"","Serviço","Serviço","-","SINAPI",89797,"JUNÇÃO SIMPLES, PVC, SERIE NORMAL, ESGOTO PREDIAL, DN 100 X 100 MM, JUNTA ELÁSTICA, FORNECIDO E INSTALADO EM RAMAL DE DESCARGA OU RAMAL DE ESGOTO SANITÁRIO. AF_12/2014","UN",1,null,null,0,"Referência: AGETOP - 81975"]
[4,4,4,3,1,7,3,5,0,12,3,"","Nível 4","Nível 4","-","SINAPI",null,"REDUÇÕES","-",null,null,null,0,""]
["S",4,"S",0,1,7,3,5,0,0,0,"","Serviço","Serviço","-","SINAPI",89549,"REDUÇÃO EXCÊNTRICA, PVC, SERIE R, ÁGUA PLUVIAL, DN 75 X 50 MM, JUNTA ELÁSTICA, FORNECIDO E INSTALADO EM RAMAL DE ENCAMINHAMENTO. AF_12/2014","UN",3,null,null,0,""]
["S",4,"S",0,1,7,3,5,0,0,0,"","Serviço","Serviço","-","SINAPI",89557,"REDUÇÃO EXCÊNTRICA, PVC, SERIE R, ÁGUA PLUVIAL, DN 100 X 75 MM, JUNTA ELÁSTICA, FORNECIDO E INSTALADO EM RAMAL DE ENCAMINHAMENTO. AF_12/2014","UN",1,null,null,0,"Referência: AGETOP - 82102"]
[4,4,4,4,1,7,3,6,0,9,4,"","Nível 4","Nível 4","-","SINAPI",null,"TÊ","-",null,null,null,0,""]
["S",4,"S",0,1,7,3,6,0,0,0,"","Serviço","Serviço","-","SINAPI",89825,"TE, PVC, SERIE NORMAL, ESGOTO PREDIAL, DN 50 X 50 MM, JUNTA ELÁSTICA, FORNECIDO E INSTALADO EM PRUMADA DE ESGOTO SANITÁRIO OU VENTILAÇÃO. AF_12/2014","UN",3,null,null,0,""]
["S",4,"S",0,1,7,3,6,0,0,0,"","Serviço","Serviço","-","AGETOP",82233,"TE SANITARIO DIAMETRO 100 X 50 MM","Un    ",1,null,null,0,""]
["S",4,"S",0,1,7,3,6,0,{"$f":"IF(OR($C228=\"S\",$C228=0),0,MATCH(0,OFFSET($D228,1,$C228,ROW($C$448)-ROW($C228)),0))","v":0},{"$f":"IF(OR($C228=\"S\",$C228=0),0,MATCH(OFFSET($D228,0,$C228)+1,OFFSET($D228,1,$C228,ROW($C$448)-ROW($C228)),0))","v":0},"","Serviço","Serviço","-","AGETOP",82235,"TE SANITARIO DIAMETRO 100 X 100 MM","Un    ",1,null,null,0,""]
[4,4,4,5,1,7,3,7,0,5,{"$error":"#N/A"},"","Nível 4","Nível 4","-","SINAPI",null,"TUBOS","-",null,null,null,0,""]
["S",4,"S",0,1,7,3,7,0,0,0,"","Serviço","Serviço","-","SINAPI",89711,"TUBO PVC, SERIE NORMAL, ESGOTO PREDIAL, DN 40 MM, FORNECIDO E INSTALADO EM RAMAL DE DESCARGA OU RAMAL DE ESGOTO SANITÁRIO. AF_12/2014","M",6,null,null,0,"Referência: AGETOP - 82301"]
["S",4,"S",0,1,7,3,7,0,0,0,"","Serviço","Serviço","-","SINAPI",89798,"TUBO PVC, SERIE NORMAL, ESGOTO PREDIAL, DN 50 MM, FORNECIDO E INSTALADO EM PRUMADA DE ESGOTO SANITÁRIO OU VENTILAÇÃO. AF_12/2014","M",26,null,null,0,""]
["S",4,"S",0,1,7,3,7,0,0,0,"","Serviço","Serviço","-","SINAPI",89799,"TUBO PVC, SERIE NORMAL, ESGOTO PREDIAL, DN 75 MM, FORNECIDO E INSTALADO EM PRUMADA DE ESGOTO SANITÁRIO OU VENTILAÇÃO. AF_12/2014","M",6,null,null,0,""]
["S",4,"S",0,1,7,3,7,0,0,0,"","Serviço","Serviço","-","SINAPI",89800,"TUBO PVC, SERIE NORMAL, ESGOTO PREDIAL, DN 100 MM, FORNECIDO E INSTALADO EM PRUMADA DE ESGOTO SANITÁRIO OU VENTILAÇÃO. AF_12/2014","M",75,null,null,0,""]
[3,3,3,5,1,7,4,0,0,5,140,"","Nível 3","Nível 3","-","SINAPI",null,"EXTRAS","-",null,null,null,0,""]
["S",3,"S",0,1,7,4,0,0,0,0,"","Serviço","Serviço","-","AGETOP",81885,"TERMINAL DE VENTILACAO DIAMETRO 50 MM","Un    ",2,null,null,0,""]
["S",3,"S",0,1,7,4,0,0,0,0,"","Serviço","Serviço","-","AGETOP",81825,"CAIXA DE PASSAGEM 60 X 60 CM SEM TAMPA","Un    ",6,null,null,0,""]
["S",3,"S",0,1,7,4,0,0,0,0,"","Serviço","Serviço","-","AGETOP",81826,"TAMPA EM CONCRETO ARMADO 25 MPA E=5CM PARA A CAIXA DE PASSAGEM 60X60CM","Un    ",6,null,null,0,""]
["S",3,"S",0,1,7,4,0,0,0,0,"","Serviço","Serviço","-","COMPOSIÇÃO","COMP 554_SEE","CAIXA DE DECANTAÇÃO","UN ",1,null,null,0,""]
[{"$f":"CHOOSE(1+LOG(1+2*(ORÇAMENTO.Nivel=\"Nível 1\")+4*(ORÇAMENTO.Nivel=\"Nível 2\")+8*(ORÇAMENTO.Nivel=\"Nível 3\")+16*(ORÇAMENTO.Nivel=\"Nível 4\")+32*(ORÇAMENTO.Nivel=\"Serviço\"),2),0,1,2,3,4,\"S\")","v":2},{"$f":"IF(OR(C239=\"s\",C239=0),OFFSET(B239,-1,0),C239)","v":2},{"$f":"IF(OFFSET(C239,-1,0)=\"L\",1,IF(OFFSET(C239,-1,0)=1,2,IF(OR(A239=\"s\",A239=0),\"S\",IF(AND(OFFSET(C239,-1,0)=2,A239=4),3,IF(AND(OR(OFFSET(C239,-1,0)=\"s\",OFFSET(C239,-1,0)=0),A239<>\"s\",A239>OFFSET(B239,-1,0)),OFFSET(B239,-1,0),A239)))))","v":2},{"$f":"IF(OR(C239=\"S\",C239=0),0,IF(ISERROR(K239),J239,SMALL(J239:K239,1)))","v":35},{"$f":"IF($C239=1,OFFSET(E239,-1,0)+1,OFFSET(E239,-1,0))","v":1},{"$f":"IF($C239=1,0,IF($C239=2,OFFSET(F239,-1,0)+1,OFFSET(F239,-1,0)))","v":8},{"$f":"IF(AND($C239<=2,$C239<>0),0,IF($C239=3,OFFSET(G239,-1,0)+1,OFFSET(G239,-1,0)))","v":0},{"$f":"IF(AND($C239<=3,$C239<>0),0,IF($C239=4,OFFSET(H239,-1,0)+1,OFFSET(H239,-1,0)))","v":0},{"$f":"IF(AND($C239<=4,$C239<>0),0,IF(AND($C239=\"S\",$W239>0),OFFSET(I239,-1,0)+1,OFFSET(I239,-1,0)))","v":0},209,35,"","Nível 2","Nível 2","-",null,null,"INSTALAÇÕES ESPECIAIS","-",null,null,null,0,""]
[3,3,3,28,1,8,1,0,0,34,28,"","Nível 3","Nível 3","-","SINAPI",null,"INSTALAÇÕES DE GÁS","-",null,null,null,0,""]
["S",3,"S",0,1,8,1,0,0,0,0,"","Serviço","Serviço","-","AGETOP",91007,"CENTRAL DE GÁS PADRÃO GOINFRA SEM INSTALAÇÕES (1+1 CILINDRO 45 KG)","Un    ",1,null,null,0,""]
["S",3,"S",0,1,8,1,0,0,0,0,"","Serviço","Serviço","-","AGETOP",91023,"UNIÃO S/BRONZE PRETA 3/4\" NPT 300 LBS","Un    ",3,null,null,0,""]
["S",3,"S",0,1,8,1,0,0,0,0,"","Serviço","Serviço","-","COMPOSIÇÃO","COMP 382_SEE","TE DE REDUCAO DE FERRO GALVANIZADO, COM ROSCA BSP, DE 3/4\" X 1/2\"","UN ",1,null,null,0,""]
["S",3,"S",0,1,8,1,0,0,0,0,"","Serviço","Serviço","-","COMPOSIÇÃO","COMP 383_SEE","BUCHA DE REDUCAO DE FERRO GALVANIZADO, COM ROSCA BSP, DE 1/2\" X 1/4\"","UN ",3,null,null,0,""]
["S",3,"S",0,1,8,1,0,0,0,0,"","Serviço","Serviço","-","AGETOP",91021,"LUVA GALVANIZADO DE REDUÇÃO 3/4\" X 1/2\" (GÁS)","Un    ",2,null,null,0,""]
["S",3,"S",0,1,8,1,0,0,0,0,"","Serviço","Serviço","-","SINAPI",92692,"NIPLE, EM FERRO GALVANIZADO, CONEXÃO ROSQUEADA, DN 15 (1/2\"), INSTALADO EM RAMAIS E SUB-RAMAIS DE GÁS - FORNECIMENTO E INSTALAÇÃO. AF_12/2015","UN",6,null,null,0,""]
["S",3,"S",0,1,8,1,0,0,0,0,"","Serviço","Serviço","-","AGETOP",91031,"NIPLE DUPLO 300 PSI 3/4\"","Un    ",6,null,null,0,""]
["S",3,"S",0,1,8,1,0,0,0,0,"","Serviço","Serviço","-","COMPOSIÇÃO","COMP 212_SEE","NIPLE DE REDUÇÃO 1/2\" X 1/4\" BSP","UN ",4,null,null,0,""]
["S",3,"S",0,1,8,1,0,0,0,0,"","Serviço","Serviço","-","COMPOSIÇÃO","COMP 213_SEE","NIPLE DE REDUÇÃO 3/4\" X 1/2\" BSP","UN ",4,null,null,0,""]
["S",3,"S",0,1,8,1,0,0,0,0,"","Serviço","Serviço","-","SINAPI",92688,"TUBO DE AÇO GALVANIZADO COM COSTURA, CLASSE MÉDIA, CONEXÃO ROSQUEADA, DN 20 (3/4\"), INSTALADO EM RAMAIS E SUB-RAMAIS DE GÁS - FORNECIMENTO E INSTALAÇÃO. AF_12/2015","M",15,null,null,0,""]
["S",3,"S",0,1,8,1,0,0,0,0,"","Serviço","Serviço","-","SINAPI",92701,"JOELHO 90 GRAUS, EM FERRO GALVANIZADO, CONEXÃO ROSQUEADA, DN 20 (3/4\"), INSTALADO EM RAMAIS E SUB-RAMAIS DE GÁS - FORNECIMENTO E INSTALAÇÃO. AF_12/2015","UN",3,null,null,0,""]
["S",3,"S",0,1,8,1,0,0,0,0,"","Serviço","Serviço","-","COMPOSIÇÃO","COMP 237_SEE","FITA ANTICORROSIVA","M",12,null,null,0,""]
["S",3,"S",0,1,8,1,0,0,0,0,"","Serviço","Serviço","-","AGETOP",91025,"VÁLVULA ESFERICA LATÃO 3/4\"","Un    ",3,null,null,0,""]
["S",3,"S",0,1,8,1,0,0,0,0,"","Serviço","Serviço","-","AGETOP",91019,"TE PRETO 90º 3/4\" NPT 300 LBS","Un    ",1,null,null,0,""]
["S",3,"S",0,1,8,1,0,0,0,0,"","Serviço","Serviço","-","COMPOSIÇÃO","COMP 542_SEE","VÁLVULA UGV 3/4\" (S) LATÃO","UN ",1,null,null,0,""]
["S",3,"S",0,1,8,1,0,0,0,0,"","Serviço","Serviço","-","COMPOSIÇÃO","COMP 543_SEE","VÁLVULA UGV 1/2\" (S) LATÃO","UN ",1,null,null,0,""]
["S",3,"S",0,1,8,1,0,0,0,0,"","Serviço","Serviço","-","AGETOP",91029,"VALVULA DE RETENÇÃO LATÃO 1/2\" X 7/16\" NPT","Un    ",1,null,null,0,""]
["S",3,"S",0,1,8,1,0,0,0,0,"","Serviço","Serviço","-","COMPOSIÇÃO","COMP 211_SEE","REGULADOR DE 2º ESTÁGIO 5KG/H","UN ",1,null,null,0,""]
["S",3,"S",0,1,8,1,0,0,0,0,"","Serviço","Serviço","-","COMPOSIÇÃO","COMP 210_SEE","REGULADOR DE 1º ESTÁGIO 60KG/H MODELO AP-40  COM MANÔMETRO","UN ",1,null,null,0,""]
["S",3,"S",0,1,8,1,0,0,0,0,"","Serviço","Serviço","-","AGETOP",85003,"EXTINTOR PO QUIMICO SECO (6 KG) - CAPACIDADE EXTINTORA 20 BC","Un    ",1,null,null,0,""]
["S",3,"S",0,1,8,1,0,0,0,0,"","Serviço","Serviço","-","COMPOSIÇÃO","COMP 235_SEE","PLACA DE SINALIZAÇÃO EM PVC COD 01 - (300X300) PROIBIDO FUMAR","UN ",2,null,null,0,""]
["S",3,"S",0,1,8,1,0,0,0,0,"","Serviço","Serviço","-","COMPOSIÇÃO","COMP 236_SEE","PLACA DE SINALIZAÇÃO EM PVC COD 06 - (300X300) PERIGO INFLAMÁVEL","UN ",2,null,null,0,""]
["S",3,"S",0,1,8,1,0,0,0,0,"","Serviço","Serviço","-","AGETOP",91043,"BRAÇADEIRA METALICA TIPO \"D\" DIAM. 3/4\"","Un    ",4,null,null,0,""]
["S",3,"S",0,1,8,1,0,0,0,0,"","Serviço","Serviço","-","AGETOP",71863,"PARAFUSO P/BUCHA S-10","Un    ",8,null,null,0,""]
["S",3,"S",0,1,8,1,0,0,0,0,"","Serviço","Serviço","-","AGETOP",70393,"BUCHA DE NYLON S-10","Un    ",8,null,null,0,""]
["S",3,"S",0,1,8,1,0,0,0,0,"","Serviço","Serviço","-","AGETOP",91045,"SUPORTE PARA COLETOR","Un    ",2,null,null,0,""]
["S",3,"S",0,1,8,1,0,0,0,0,"","Serviço","Serviço","-","COMPOSIÇÃO","COMP 045_SEE","LAUDO DE ESTANQUEIDADE","UN ",1,null,null,0,""]
[3,3,3,4,1,8,2,0,0,6,4,"","Nível 3","Nível 3","-","SINAPI",null,"DEMOLIÇÃO","-",null,null,null,0,""]
["S",3,"S",0,1,8,2,0,0,0,0,"","Serviço","Serviço","-","AGETOP",20121,"DEM. MANUAL EM CONCR.SIMPLES C/TR.ATE CB.E CARGA (O.C.)","m3    ",8.0000000000000019E-3,null,null,0,""]
["S",3,"S",0,1,8,2,0,0,0,0,"","Serviço","Serviço","-","SINAPI",93358,"ESCAVAÇÃO MANUAL DE VALA COM PROFUNDIDADE MENOR OU IGUAL A 1,30 M. AF_03/2016","M3",0.45960000000000001,null,null,0,"Referência: AGETOP - 40101"]
["S",3,"S",0,1,8,2,0,0,0,0,"","Serviço","Serviço","-","SINAPI",96995,"REATERRO MANUAL APILOADO COM SOQUETE. AF_10/2017","M3",0.45960000000000001,null,null,0,"Referência: AGETOP - 40902"]
[3,3,3,2,1,8,3,0,0,2,9,"","Nível 3","Nível 3","-","SINAPI",null,"EXECUÇÃO","-",null,null,null,0,""]
["S",3,"S",0,1,8,3,0,0,0,0,"","Serviço","Serviço","-","AGETOP",220102,"PISO CONCRETO DESEMPENADO ESPESSURA = 5 CM  1:2,5:3,5","m2    ",0.16000000000000003,null,null,0,""]
[2,2,2,9,1,9,0,0,0,174,9,"","Nível 2","Nível 2","-","AGETOP",91045,"ALVENARIAS E DIVISÓRIAS","Un    ",null,null,null,0,""]
[{"$f":"CHOOSE(1+LOG(1+2*(ORÇAMENTO.Nivel=\"Nível 1\")+4*(ORÇAMENTO.Nivel=\"Nível 2\")+8*(ORÇAMENTO.Nivel=\"Nível 3\")+16*(ORÇAMENTO.Nivel=\"Nível 4\")+32*(ORÇAMENTO.Nivel=\"Serviço\"),2),0,1,2,3,4,\"S\")","v":3},{"$f":"IF(OR(C275=\"s\",C275=0),OFFSET(B275,-1,0),C275)","v":3},{"$f":"IF(OFFSET(C275,-1,0)=\"L\",1,IF(OFFSET(C275,-1,0)=1,2,IF(OR(A275=\"s\",A275=0),\"S\",IF(AND(OFFSET(C275,-1,0)=2,A275=4),3,IF(AND(OR(OFFSET(C275,-1,0)=\"s\",OFFSET(C275,-1,0)=0),A275<>\"s\",A275>OFFSET(B275,-1,0)),OFFSET(B275,-1,0),A275)))))","v":3},{"$f":"IF(OR(C275=\"S\",C275=0),0,IF(ISERROR(K275),J275,SMALL(J275:K275,1)))","v":2},{"$f":"IF($C275=1,OFFSET(E275,-1,0)+1,OFFSET(E275,-1,0))","v":1},{"$f":"IF($C275=1,0,IF($C275=2,OFFSET(F275,-1,0)+1,OFFSET(F275,-1,0)))","v":9},{"$f":"IF(AND($C275<=2,$C275<>0),0,IF($C275=3,OFFSET(G275,-1,0)+1,OFFSET(G275,-1,0)))","v":1},{"$f":"IF(AND($C275<=3,$C275<>0),0,IF($C275=4,OFFSET(H275,-1,0)+1,OFFSET(H275,-1,0)))","v":0},{"$f":"IF(AND($C275<=4,$C275<>0),0,IF(AND($C275=\"S\",$W275>0),OFFSET(I275,-1,0)+1,OFFSET(I275,-1,0)))","v":0},8,2,"","Nível 3","Nível 3","-","SINAPI",null,"REFORMA GERAL DO BLOCO EM ANEXO","-",null,null,null,0,""]
["S",3,"S",0,1,9,1,0,0,0,0,"","Serviço","Serviço","-","AGETOP",100102,"ALVENARIA DE TIJOLO COMUM 1/2 VEZ - ARG. (1CI : 2CH : 8ARML)","m2    ",1.7,null,null,0,""]
[3,3,3,2,1,9,2,0,0,6,2,"","Nível 3","Nível 3","-","SINAPI",null,"SALA DO GRÊMIO","-",null,null,null,0,""]
["S",3,"S",0,1,9,2,0,0,0,0,"","Serviço","Serviço","-","AGETOP",100102,"ALVENARIA DE TIJOLO COMUM 1/2 VEZ - ARG. (1CI : 2CH : 8ARML)","m2    ",55.71,null,null,0,""]
[3,3,3,2,1,9,3,0,0,4,2,"","Nível 3","Nível 3","-","AGETOP",null,"REFORMA DOS BANHEIROS","-",null,null,null,0,""]
["S",3,"S",0,1,9,3,0,0,0,0,"","Serviço","Serviço","-","AGETOP",100102,"ALVENARIA DE TIJOLO COMUM 1/2 VEZ - ARG. (1CI : 2CH : 8ARML)","m2    ",9,null,null,0,""]
[3,3,3,2,1,9,4,0,0,2,93,"","Nível 3","Nível 3","-","SINAPI",null,"LABORATÓRIO DE QUÍMICA","-",null,null,null,0,""]
["S",{"$f":"IF(OR(C282=\"s\",C282=0),OFFSET(B282,-1,0),C282)","v":3},{"$f":"IF(OFFSET(C282,-1,0)=\"L\",1,IF(OFFSET(C282,-1,0)=1,2,IF(OR(A282=\"s\",A282=0),\"S\",IF(AND(OFFSET(C282,-1,0)=2,A282=4),3,IF(AND(OR(OFFSET(C282,-1,0)=\"s\",OFFSET(C282,-1,0)=0),A282<>\"s\",A282>OFFSET(B282,-1,0)),OFFSET(B282,-1,0),A282)))))","v":"S"},{"$f":"IF(OR(C282=\"S\",C282=0),0,IF(ISERROR(K282),J282,SMALL(J282:K282,1)))","v":0},{"$f":"IF($C282=1,OFFSET(E282,-1,0)+1,OFFSET(E282,-1,0))","v":1},{"$f":"IF($C282=1,0,IF($C282=2,OFFSET(F282,-1,0)+1,OFFSET(F282,-1,0)))","v":9},{"$f":"IF(AND($C282<=2,$C282<>0),0,IF($C282=3,OFFSET(G282,-1,0)+1,OFFSET(G282,-1,0)))","v":4},{"$f":"IF(AND($C282<=3,$C282<>0),0,IF($C282=4,OFFSET(H282,-1,0)+1,OFFSET(H282,-1,0)))","v":0},{"$f":"IF(AND($C282<=4,$C282<>0),0,IF(AND($C282=\"S\",$W282>0),OFFSET(I282,-1,0)+1,OFFSET(I282,-1,0)))","v":0},0,0,"","Serviço","Serviço","-","AGETOP",100102,"ALVENARIA DE TIJOLO COMUM 1/2 VEZ - ARG. (1CI : 2CH : 8ARML)","m2    ",7.4,null,null,0,""]
[{"$f":"CHOOSE(1+LOG(1+2*(ORÇAMENTO.Nivel=\"Nível 1\")+4*(ORÇAMENTO.Nivel=\"Nível 2\")+8*(ORÇAMENTO.Nivel=\"Nível 3\")+16*(ORÇAMENTO.Nivel=\"Nível 4\")+32*(ORÇAMENTO.Nivel=\"Serviço\"),2),0,1,2,3,4,\"S\")","v":2},2,2,11,1,10,0,0,0,165,11,"","Nível 2","Nível 2","-",null,null,"COBERTURAS","-",null,null,null,0,""]
[3,3,3,3,1,10,1,0,0,10,3,"","Nível 3","Nível 3","-",null,null,"FIBROCIMENTO","-",null,null,null,0,""]
[4,{"$f":"IF(OR(C285=\"s\",C285=0),OFFSET(B285,-1,0),C285)","v":4},{"$f":"IF(OFFSET(C285,-1,0)=\"L\",1,IF(OFFSET(C285,-1,0)=1,2,IF(OR(A285=\"s\",A285=0),\"S\",IF(AND(OFFSET(C285,-1,0)=2,A285=4),3,IF(AND(OR(OFFSET(C285,-1,0)=\"s\",OFFSET(C285,-1,0)=0),A285<>\"s\",A285>OFFSET(B285,-1,0)),OFFSET(B285,-1,0),A285)))))","v":4},{"$f":"IF(OR(C285=\"S\",C285=0),0,IF(ISERROR(K285),J285,SMALL(J285:K285,1)))","v":2},{"$f":"IF($C285=1,OFFSET(E285,-1,0)+1,OFFSET(E285,-1,0))","v":1},{"$f":"IF($C285=1,0,IF($C285=2,OFFSET(F285,-1,0)+1,OFFSET(F285,-1,0)))","v":10},{"$f":"IF(AND($C285<=2,$C285<>0),0,IF($C285=3,OFFSET(G285,-1,0)+1,OFFSET(G285,-1,0)))","v":1},{"$f":"IF(AND($C285<=3,$C285<>0),0,IF($C285=4,OFFSET(H285,-1,0)+1,OFFSET(H285,-1,0)))","v":1},{"$f":"IF(AND($C285<=4,$C285<>0),0,IF(AND($C285=\"S\",$W285>0),OFFSET(I285,-1,0)+1,OFFSET(I285,-1,0)))","v":0},2,6,"","Nível 4","Nível 4","-","SINAPI",null,"SALA DO GRÊMIO","-",null,null,null,0,""]
["S",4,"S",0,1,10,1,1,0,0,0,"","Serviço","Serviço","-","SINAPI",94210,"TELHAMENTO COM TELHA ONDULADA DE FIBROCIMENTO E = 6 MM, COM RECOBRIMENTO LATERAL DE 1 1/4 DE ONDA PARA TELHADO COM INCLINAÇÃO MÁXIMA DE 10°, COM ATÉ 2 ÁGUAS, INCLUSO IÇAMENTO. AF_07/2019","M2",22,null,null,0,"Referência: AGETOP - 160501"]
[3,3,3,7,1,10,2,0,0,7,20,"","Nível 3","Nível 3","-",null,null,"CALHA E RUFO","-",null,null,null,0,""]
[{"$f":"CHOOSE(1+LOG(1+2*(ORÇAMENTO.Nivel=\"Nível 1\")+4*(ORÇAMENTO.Nivel=\"Nível 2\")+8*(ORÇAMENTO.Nivel=\"Nível 3\")+16*(ORÇAMENTO.Nivel=\"Nível 4\")+32*(ORÇAMENTO.Nivel=\"Serviço\"),2),0,1,2,3,4,\"S\")","v":4},{"$f":"IF(OR(C288=\"s\",C288=0),OFFSET(B288,-1,0),C288)","v":4},{"$f":"IF(OFFSET(C288,-1,0)=\"L\",1,IF(OFFSET(C288,-1,0)=1,2,IF(OR(A288=\"s\",A288=0),\"S\",IF(AND(OFFSET(C288,-1,0)=2,A288=4),3,IF(AND(OR(OFFSET(C288,-1,0)=\"s\",OFFSET(C288,-1,0)=0),A288<>\"s\",A288>OFFSET(B288,-1,0)),OFFSET(B288,-1,0),A288)))))","v":4},{"$f":"IF(OR(C288=\"S\",C288=0),0,IF(ISERROR(K288),J288,SMALL(J288:K288,1)))","v":3},{"$f":"IF($C288=1,OFFSET(E288,-1,0)+1,OFFSET(E288,-1,0))","v":1},{"$f":"IF($C288=1,0,IF($C288=2,OFFSET(F288,-1,0)+1,OFFSET(F288,-1,0)))","v":10},{"$f":"IF(AND($C288<=2,$C288<>0),0,IF($C288=3,OFFSET(G288,-1,0)+1,OFFSET(G288,-1,0)))","v":2},{"$f":"IF(AND($C288<=3,$C288<>0),0,IF($C288=4,OFFSET(H288,-1,0)+1,OFFSET(H288,-1,0)))","v":1},{"$f":"IF(AND($C288<=4,$C288<>0),0,IF(AND($C288=\"S\",$W288>0),OFFSET(I288,-1,0)+1,OFFSET(I288,-1,0)))","v":0},6,3,"","Nível 4","Nível 4","-","SINAPI",null,"SALA DO GRÊMIO","-",null,null,null,0,""]
["S",4,"S",0,1,10,2,1,0,0,0,"","Serviço","Serviço","-","SINAPI",94228,"CALHA EM CHAPA DE AÇO GALVANIZADO NÚMERO 24, DESENVOLVIMENTO DE 50 CM, INCLUSO TRANSPORTE VERTICAL. AF_07/2019","M",44,null,null,0,"Referência: AGETOP - 160601"]
["S",4,"S",0,1,10,2,1,0,0,0,"","Serviço","Serviço","-","SINAPI",94231,"RUFO EM CHAPA DE AÇO GALVANIZADO NÚMERO 24, CORTE DE 25 CM, INCLUSO TRANSPORTE VERTICAL. AF_07/2019","M",88,null,null,0,"Referência: AGETOP - 160602"]
[4,{"$f":"IF(OR(C291=\"s\",C291=0),OFFSET(B291,-1,0),C291)","v":4},{"$f":"IF(OFFSET(C291,-1,0)=\"L\",1,IF(OFFSET(C291,-1,0)=1,2,IF(OR(A291=\"s\",A291=0),\"S\",IF(AND(OFFSET(C291,-1,0)=2,A291=4),3,IF(AND(OR(OFFSET(C291,-1,0)=\"s\",OFFSET(C291,-1,0)=0),A291<>\"s\",A291>OFFSET(B291,-1,0)),OFFSET(B291,-1,0),A291)))))","v":4},{"$f":"IF(OR(C291=\"S\",C291=0),0,IF(ISERROR(K291),J291,SMALL(J291:K291,1)))","v":3},{"$f":"IF($C291=1,OFFSET(E291,-1,0)+1,OFFSET(E291,-1,0))","v":1},{"$f":"IF($C291=1,0,IF($C291=2,OFFSET(F291,-1,0)+1,OFFSET(F291,-1,0)))","v":10},{"$f":"IF(AND($C291<=2,$C291<>0),0,IF($C291=3,OFFSET(G291,-1,0)+1,OFFSET(G291,-1,0)))","v":2},{"$f":"IF(AND($C291<=3,$C291<>0),0,IF($C291=4,OFFSET(H291,-1,0)+1,OFFSET(H291,-1,0)))","v":2},{"$f":"IF(AND($C291<=4,$C291<>0),0,IF(AND($C291=\"S\",$W291>0),OFFSET(I291,-1,0)+1,OFFSET(I291,-1,0)))","v":0},3,9,"","Nível 4","Nível 4","-","SINAPI",null,"TROCAR CALHA PÁTIO COBERTO 02","-",null,null,null,0,""]
["S",4,"S",0,1,10,2,2,0,{"$f":"IF(OR($C292=\"S\",$C292=0),0,MATCH(0,OFFSET($D292,1,$C292,ROW($C$448)-ROW($C292)),0))","v":0},{"$f":"IF(OR($C292=\"S\",$C292=0),0,MATCH(OFFSET($D292,0,$C292)+1,OFFSET($D292,1,$C292,ROW($C$448)-ROW($C292)),0))","v":0},"","Serviço","Serviço","-","SINAPI",94228,"CALHA EM CHAPA DE AÇO GALVANIZADO NÚMERO 24, DESENVOLVIMENTO DE 50 CM, INCLUSO TRANSPORTE VERTICAL. AF_07/2019","M",25,null,null,0,"Referência: AGETOP - 160601"]
["S",4,"S",0,1,10,2,2,0,0,0,"","Serviço","Serviço","-","SINAPI",94231,"RUFO EM CHAPA DE AÇO GALVANIZADO NÚMERO 24, CORTE DE 25 CM, INCLUSO TRANSPORTE VERTICAL. AF_07/2019","M",25,null,null,0,"Referência: AGETOP - 160602"]
[2,2,2,21,1,11,0,0,0,154,21,"","Nível 2","Nível 2","-",null,null,"ESQUADRIAS METÁLICAS","-",null,null,null,0,""]
[3,{"$f":"IF(OR(C295=\"s\",C295=0),OFFSET(B295,-1,0),C295)","v":3},{"$f":"IF(OFFSET(C295,-1,0)=\"L\",1,IF(OFFSET(C295,-1,0)=1,2,IF(OR(A295=\"s\",A295=0),\"S\",IF(AND(OFFSET(C295,-1,0)=2,A295=4),3,IF(AND(OR(OFFSET(C295,-1,0)=\"s\",OFFSET(C295,-1,0)=0),A295<>\"s\",A295>OFFSET(B295,-1,0)),OFFSET(B295,-1,0),A295)))))","v":3},{"$f":"IF(OR(C295=\"S\",C295=0),0,IF(ISERROR(K295),J295,SMALL(J295:K295,1)))","v":7},{"$f":"IF($C295=1,OFFSET(E295,-1,0)+1,OFFSET(E295,-1,0))","v":1},{"$f":"IF($C295=1,0,IF($C295=2,OFFSET(F295,-1,0)+1,OFFSET(F295,-1,0)))","v":11},{"$f":"IF(AND($C295<=2,$C295<>0),0,IF($C295=3,OFFSET(G295,-1,0)+1,OFFSET(G295,-1,0)))","v":1},{"$f":"IF(AND($C295<=3,$C295<>0),0,IF($C295=4,OFFSET(H295,-1,0)+1,OFFSET(H295,-1,0)))","v":0},{"$f":"IF(AND($C295<=4,$C295<>0),0,IF(AND($C295=\"S\",$W295>0),OFFSET(I295,-1,0)+1,OFFSET(I295,-1,0)))","v":0},20,7,"","Nível 3","Nível 3","-","SINAPI",null,"REFORMA GERAL DO BLOCO EM ANEXO","-",null,null,null,0,""]
[{"$f":"CHOOSE(1+LOG(1+2*(ORÇAMENTO.Nivel=\"Nível 1\")+4*(ORÇAMENTO.Nivel=\"Nível 2\")+8*(ORÇAMENTO.Nivel=\"Nível 3\")+16*(ORÇAMENTO.Nivel=\"Nível 4\")+32*(ORÇAMENTO.Nivel=\"Serviço\"),2),0,1,2,3,4,\"S\")","v":4},{"$f":"IF(OR(C296=\"s\",C296=0),OFFSET(B296,-1,0),C296)","v":4},{"$f":"IF(OFFSET(C296,-1,0)=\"L\",1,IF(OFFSET(C296,-1,0)=1,2,IF(OR(A296=\"s\",A296=0),\"S\",IF(AND(OFFSET(C296,-1,0)=2,A296=4),3,IF(AND(OR(OFFSET(C296,-1,0)=\"s\",OFFSET(C296,-1,0)=0),A296<>\"s\",A296>OFFSET(B296,-1,0)),OFFSET(B296,-1,0),A296)))))","v":4},{"$f":"IF(OR(C296=\"S\",C296=0),0,IF(ISERROR(K296),J296,SMALL(J296:K296,1)))","v":2},{"$f":"IF($C296=1,OFFSET(E296,-1,0)+1,OFFSET(E296,-1,0))","v":1},{"$f":"IF($C296=1,0,IF($C296=2,OFFSET(F296,-1,0)+1,OFFSET(F296,-1,0)))","v":11},{"$f":"IF(AND($C296<=2,$C296<>0),0,IF($C296=3,OFFSET(G296,-1,0)+1,OFFSET(G296,-1,0)))","v":1},{"$f":"IF(AND($C296<=3,$C296<>0),0,IF($C296=4,OFFSET(H296,-1,0)+1,OFFSET(H296,-1,0)))","v":1},{"$f":"IF(AND($C296<=4,$C296<>0),0,IF(AND($C296=\"S\",$W296>0),OFFSET(I296,-1,0)+1,OFFSET(I296,-1,0)))","v":0},6,2,"","Nível 4","Nível 4","-","SINAPI",null,"PORTAS","-",null,null,null,0,""]
["S",4,"S",0,1,11,1,1,0,0,0,"","Serviço","Serviço","-","AGETOP",180501,"PORTA DE ABRIR EM CHAPA PF-1 C/FERRAGENS","m2    ",2.1,null,null,0,""]
[{"$f":"CHOOSE(1+LOG(1+2*(ORÇAMENTO.Nivel=\"Nível 1\")+4*(ORÇAMENTO.Nivel=\"Nível 2\")+8*(ORÇAMENTO.Nivel=\"Nível 3\")+16*(ORÇAMENTO.Nivel=\"Nível 4\")+32*(ORÇAMENTO.Nivel=\"Serviço\"),2),0,1,2,3,4,\"S\")","v":4},{"$f":"IF(OR(C298=\"s\",C298=0),OFFSET(B298,-1,0),C298)","v":4},{"$f":"IF(OFFSET(C298,-1,0)=\"L\",1,IF(OFFSET(C298,-1,0)=1,2,IF(OR(A298=\"s\",A298=0),\"S\",IF(AND(OFFSET(C298,-1,0)=2,A298=4),3,IF(AND(OR(OFFSET(C298,-1,0)=\"s\",OFFSET(C298,-1,0)=0),A298<>\"s\",A298>OFFSET(B298,-1,0)),OFFSET(B298,-1,0),A298)))))","v":4},{"$f":"IF(OR(C298=\"S\",C298=0),0,IF(ISERROR(K298),J298,SMALL(J298:K298,1)))","v":2},{"$f":"IF($C298=1,OFFSET(E298,-1,0)+1,OFFSET(E298,-1,0))","v":1},{"$f":"IF($C298=1,0,IF($C298=2,OFFSET(F298,-1,0)+1,OFFSET(F298,-1,0)))","v":11},{"$f":"IF(AND($C298<=2,$C298<>0),0,IF($C298=3,OFFSET(G298,-1,0)+1,OFFSET(G298,-1,0)))","v":1},{"$f":"IF(AND($C298<=3,$C298<>0),0,IF($C298=4,OFFSET(H298,-1,0)+1,OFFSET(H298,-1,0)))","v":2},{"$f":"IF(AND($C298<=4,$C298<>0),0,IF(AND($C298=\"S\",$W298>0),OFFSET(I298,-1,0)+1,OFFSET(I298,-1,0)))","v":0},4,2,"","Nível 4","Nível 4","-","SINAPI",null,"JANELAS","-",null,null,null,0,""]
["S",4,"S",0,1,11,1,2,0,0,0,"","Serviço","Serviço","-","AGETOP",180381,"ESQ. MAXIMO AR CHAPA/VIDRO J3/J5/J6/J8 C/FERRAGENS","m2    ",20.7,null,null,0,""]
[4,4,4,2,1,11,1,3,0,2,69,"","Nível 4","Nível 4","-","SINAPI",null,"RECOLOCAÇÃO DAS JANELAS","-",null,null,null,0,""]
["S",4,"S",0,1,11,1,3,0,0,0,"","Serviço","Serviço","-","AGETOP",180381,"ESQ. MAXIMO AR CHAPA/VIDRO J3/J5/J6/J8 C/FERRAGENS","m2    ",5.4,null,null,0,""]
[3,3,3,5,1,11,2,0,0,13,5,"","Nível 3","Nível 3","-","SINAPI",null,"SALA DO GRÊMIO","-",null,null,null,0,""]
[{"$f":"CHOOSE(1+LOG(1+2*(ORÇAMENTO.Nivel=\"Nível 1\")+4*(ORÇAMENTO.Nivel=\"Nível 2\")+8*(ORÇAMENTO.Nivel=\"Nível 3\")+16*(ORÇAMENTO.Nivel=\"Nível 4\")+32*(ORÇAMENTO.Nivel=\"Serviço\"),2),0,1,2,3,4,\"S\")","v":4},{"$f":"IF(OR(C303=\"s\",C303=0),OFFSET(B303,-1,0),C303)","v":4},{"$f":"IF(OFFSET(C303,-1,0)=\"L\",1,IF(OFFSET(C303,-1,0)=1,2,IF(OR(A303=\"s\",A303=0),\"S\",IF(AND(OFFSET(C303,-1,0)=2,A303=4),3,IF(AND(OR(OFFSET(C303,-1,0)=\"s\",OFFSET(C303,-1,0)=0),A303<>\"s\",A303>OFFSET(B303,-1,0)),OFFSET(B303,-1,0),A303)))))","v":4},{"$f":"IF(OR(C303=\"S\",C303=0),0,IF(ISERROR(K303),J303,SMALL(J303:K303,1)))","v":2},{"$f":"IF($C303=1,OFFSET(E303,-1,0)+1,OFFSET(E303,-1,0))","v":1},{"$f":"IF($C303=1,0,IF($C303=2,OFFSET(F303,-1,0)+1,OFFSET(F303,-1,0)))","v":11},{"$f":"IF(AND($C303<=2,$C303<>0),0,IF($C303=3,OFFSET(G303,-1,0)+1,OFFSET(G303,-1,0)))","v":2},{"$f":"IF(AND($C303<=3,$C303<>0),0,IF($C303=4,OFFSET(H303,-1,0)+1,OFFSET(H303,-1,0)))","v":1},{"$f":"IF(AND($C303<=4,$C303<>0),0,IF(AND($C303=\"S\",$W303>0),OFFSET(I303,-1,0)+1,OFFSET(I303,-1,0)))","v":0},4,2,"","Nível 4","Nível 4","-","SINAPI",null,"PORTAS","-",null,null,null,0,""]
["S",4,"S",0,1,11,2,1,0,0,0,"","Serviço","Serviço","-","AGETOP",180501,"PORTA DE ABRIR EM CHAPA PF-1 C/FERRAGENS","m2    ",1.89,null,null,0,""]
[4,4,4,2,1,11,2,2,0,2,8,"","Nível 4","Nível 4","-","SINAPI",null,"JANELAS","-",null,null,null,0,""]
["S",4,"S",0,1,11,2,2,0,0,0,"","Serviço","Serviço","-","AGETOP",180381,"ESQ. MAXIMO AR CHAPA/VIDRO J3/J5/J6/J8 C/FERRAGENS","m2    ",4.5,null,null,0,""]
[3,3,3,8,1,11,3,0,0,8,31,"","Nível 3","Nível 3","-","AGETOP",180381,"REFORMA DOS BANHEIROS","m2    ",null,null,null,0,""]
[4,4,4,2,1,11,3,1,0,7,2,"","Nível 4","Nível 4","-","SINAPI",null,"PORTAS","-",null,null,null,0,""]
["S",4,"S",0,1,11,3,1,0,0,0,"","Serviço","Serviço","-","AGETOP",180501,"PORTA DE ABRIR EM CHAPA PF-1 C/FERRAGENS","m2    ",3.3600000000000003,null,null,0,""]
[4,4,4,3,1,11,3,2,0,5,3,"","Nível 4","Nível 4","-","SINAPI",null,"JANELAS","-",null,null,null,0,""]
["S",4,"S",0,1,11,3,2,0,0,0,"","Serviço","Serviço","-","AGETOP",180381,"ESQ. MAXIMO AR CHAPA/VIDRO J3/J5/J6/J8 C/FERRAGENS","m2    ",0.9,null,null,0,""]
["S",4,"S",0,1,11,3,2,0,0,0,"","Serviço","Serviço","-","AGETOP",180380,"ESQ. MAXIMO AR CHAPA/VIDRO J4 C/FERRAGENS","m2    ",0.4,null,null,0,""]
[4,4,4,2,1,11,3,3,0,2,56,"","Nível 4","Nível 4","-","SINAPI",null,"INSTALAÇÃO ALAMBRADO NA QUADRA","-",null,null,null,0,""]
["S",4,"S",0,1,11,3,3,0,0,0,"","Serviço","Serviço","-","AGETOP",270621,"ALAMBRADO EM TUBO INDUSTRIAL 2\"#2,28 E TELA MALHA 4\" FIO 12 (QUADRA ESPORTE EXISTENTE) SEM PINTURA","m2    ",402.3,null,null,0,""]
[2,{"$f":"IF(OR(C315=\"s\",C315=0),OFFSET(B315,-1,0),C315)","v":2},{"$f":"IF(OFFSET(C315,-1,0)=\"L\",1,IF(OFFSET(C315,-1,0)=1,2,IF(OR(A315=\"s\",A315=0),\"S\",IF(AND(OFFSET(C315,-1,0)=2,A315=4),3,IF(AND(OR(OFFSET(C315,-1,0)=\"s\",OFFSET(C315,-1,0)=0),A315<>\"s\",A315>OFFSET(B315,-1,0)),OFFSET(B315,-1,0),A315)))))","v":2},{"$f":"IF(OR(C315=\"S\",C315=0),0,IF(ISERROR(K315),J315,SMALL(J315:K315,1)))","v":7},{"$f":"IF($C315=1,OFFSET(E315,-1,0)+1,OFFSET(E315,-1,0))","v":1},{"$f":"IF($C315=1,0,IF($C315=2,OFFSET(F315,-1,0)+1,OFFSET(F315,-1,0)))","v":12},{"$f":"IF(AND($C315<=2,$C315<>0),0,IF($C315=3,OFFSET(G315,-1,0)+1,OFFSET(G315,-1,0)))","v":0},{"$f":"IF(AND($C315<=3,$C315<>0),0,IF($C315=4,OFFSET(H315,-1,0)+1,OFFSET(H315,-1,0)))","v":0},{"$f":"IF(AND($C315<=4,$C315<>0),0,IF(AND($C315=\"S\",$W315>0),OFFSET(I315,-1,0)+1,OFFSET(I315,-1,0)))","v":0},133,7,"","Nível 2","Nível 2","-",null,null,"VIDROS","-",null,null,null,0,""]
[{"$f":"CHOOSE(1+LOG(1+2*(ORÇAMENTO.Nivel=\"Nível 1\")+4*(ORÇAMENTO.Nivel=\"Nível 2\")+8*(ORÇAMENTO.Nivel=\"Nível 3\")+16*(ORÇAMENTO.Nivel=\"Nível 4\")+32*(ORÇAMENTO.Nivel=\"Serviço\"),2),0,1,2,3,4,\"S\")","v":3},3,3,2,1,12,1,0,0,6,2,"","Nível 3","Nível 3","-","SINAPI",null,"REFORMA GERAL DO BLOCO EM ANEXO","-",null,null,null,0,""]
["S",3,"S",0,1,12,1,0,0,0,0,"","Serviço","Serviço","-","SINAPI",72117,"VIDRO LISO COMUM TRANSPARENTE, ESPESSURA 4MM","M2",20.7,null,null,0,"Referência: AGETOP - 190102"]
[3,3,3,2,1,12,2,0,0,4,2,"","Nível 3","Nível 3","-","SINAPI",null,"SALA DO GRÊMIO","-",null,null,null,0,""]
["S",3,"S",0,1,12,2,0,0,0,0,"","Serviço","Serviço","-","SINAPI",72117,"VIDRO LISO COMUM TRANSPARENTE, ESPESSURA 4MM","M2",4.5,null,null,0,"Referência: AGETOP - 190102"]
[3,3,3,2,1,12,3,0,0,2,18,"","Nível 3","Nível 3","-","SINAPI",null,"REFORMA DOS BANHEIROS","-",null,null,null,0,""]
["S",3,"S",0,1,12,3,0,0,0,0,"","Serviço","Serviço","-","SINAPI",72117,"VIDRO LISO COMUM TRANSPARENTE, ESPESSURA 4MM","M2",1.3,null,null,0,"Referência: AGETOP - 190102"]
[{"$f":"CHOOSE(1+LOG(1+2*(ORÇAMENTO.Nivel=\"Nível 1\")+4*(ORÇAMENTO.Nivel=\"Nível 2\")+8*(ORÇAMENTO.Nivel=\"Nível 3\")+16*(ORÇAMENTO.Nivel=\"Nível 4\")+32*(ORÇAMENTO.Nivel=\"Serviço\"),2),0,1,2,3,4,\"S\")","v":2},2,2,19,1,13,0,0,0,126,19,"","Nível 2","Nível 2","-",null,null,"REVESTIMENTO DE PAREDE","-",null,null,null,0,""]
[3,3,3,5,1,13,1,0,0,18,5,"","Nível 3","Nível 3","-","SINAPI",null,"REFORMA GERAL DO BLOCO EM ANEXO","-",null,null,null,0,""]
["S",3,"S",0,1,13,1,0,0,0,0,"","Serviço","Serviço","-","SINAPI",87904,"CHAPISCO APLICADO EM ALVENARIA (COM PRESENÇA DE VÃOS) E ESTRUTURAS DE CONCRETO DE FACHADA, COM COLHER DE PEDREIRO.  ARGAMASSA TRAÇO 1:3 COM PREPARO MANUAL. AF_06/2014","M2",193,null,null,0,"Referência: AGETOP - 200101"]
["S",3,"S",0,1,13,1,0,0,0,0,"","Serviço","Serviço","-","SINAPI",87547,"MASSA ÚNICA, PARA RECEBIMENTO DE PINTURA, EM ARGAMASSA TRAÇO 1:2:8, PREPARO MECÂNICO COM BETONEIRA 400L, APLICADA MANUALMENTE EM FACES INTERNAS DE PAREDES, ESPESSURA DE 10MM, COM EXECUÇÃO DE TALISCAS. AF_06/2014","M2",367,null,null,0,""]
["S",3,"S",0,1,13,1,0,0,0,0,"","Serviço","Serviço","-","SINAPI",87553,"EMBOÇO, PARA RECEBIMENTO DE CERÂMICA, EM ARGAMASSA TRAÇO 1:2:8, PREPARO MECÂNICO COM BETONEIRA 400L, APLICADO MANUALMENTE EM FACES INTERNAS DE PAREDES, PARA AMBIENTE COM ÁREA MAIOR QUE 10M2, ESPESSURA DE 10MM, COM EXECUÇÃO DE TALISCAS. AF_06/2014","M2",35.31,null,null,0,""]
["S",3,"S",0,1,13,1,0,0,0,0,"","Serviço","Serviço","-","SINAPI",87273,"REVESTIMENTO CERÂMICO PARA PAREDES INTERNAS COM PLACAS TIPO ESMALTADA EXTRA DE DIMENSÕES 33X45 CM APLICADAS EM AMBIENTES DE ÁREA MAIOR QUE 5 M² NA ALTURA INTEIRA DAS PAREDES. AF_06/2014","M2",35.51,null,null,0,""]
[3,3,3,5,1,13,2,0,0,13,5,"","Nível 3","Nível 3","-","SINAPI",null,"SALA DO GRÊMIO","-",null,null,null,0,""]
["S",3,"S",0,1,13,2,0,0,0,0,"","Serviço","Serviço","-","SINAPI",87904,"CHAPISCO APLICADO EM ALVENARIA (COM PRESENÇA DE VÃOS) E ESTRUTURAS DE CONCRETO DE FACHADA, COM COLHER DE PEDREIRO.  ARGAMASSA TRAÇO 1:3 COM PREPARO MANUAL. AF_06/2014","M2",55,null,null,0,"Referência: AGETOP - 200101"]
["S",3,"S",0,1,13,2,0,0,0,0,"","Serviço","Serviço","-","SINAPI",87553,"EMBOÇO, PARA RECEBIMENTO DE CERÂMICA, EM ARGAMASSA TRAÇO 1:2:8, PREPARO MECÂNICO COM BETONEIRA 400L, APLICADO MANUALMENTE EM FACES INTERNAS DE PAREDES, PARA AMBIENTE COM ÁREA MAIOR QUE 10M2, ESPESSURA DE 10MM, COM EXECUÇÃO DE TALISCAS. AF_06/2014","M2",17,null,null,0,""]
["S",3,"S",0,1,13,2,0,0,0,0,"","Serviço","Serviço","-","SINAPI",87273,"REVESTIMENTO CERÂMICO PARA PAREDES INTERNAS COM PLACAS TIPO ESMALTADA EXTRA DE DIMENSÕES 33X45 CM APLICADAS EM AMBIENTES DE ÁREA MAIOR QUE 5 M² NA ALTURA INTEIRA DAS PAREDES. AF_06/2014","M2",17,null,null,0,""]
["S",3,"S",0,1,13,2,0,0,0,0,"","Serviço","Serviço","-","SINAPI",87547,"MASSA ÚNICA, PARA RECEBIMENTO DE PINTURA, EM ARGAMASSA TRAÇO 1:2:8, PREPARO MECÂNICO COM BETONEIRA 400L, APLICADA MANUALMENTE EM FACES INTERNAS DE PAREDES, ESPESSURA DE 10MM, COM EXECUÇÃO DE TALISCAS. AF_06/2014","M2",38,null,null,0,""]
[3,3,3,5,1,13,3,0,0,8,5,"","Nível 3","Nível 3","-","SINAPI",null,"REFORMA DOS BANHEIROS","-",null,null,null,0,""]
["S",3,"S",0,1,13,3,0,0,0,0,"","Serviço","Serviço","-","SINAPI",87904,"CHAPISCO APLICADO EM ALVENARIA (COM PRESENÇA DE VÃOS) E ESTRUTURAS DE CONCRETO DE FACHADA, COM COLHER DE PEDREIRO.  ARGAMASSA TRAÇO 1:3 COM PREPARO MANUAL. AF_06/2014","M2",19.03,null,null,0,"Referência: AGETOP - 200101"]
["S",3,"S",0,1,13,3,0,0,0,0,"","Serviço","Serviço","-","SINAPI",87553,"EMBOÇO, PARA RECEBIMENTO DE CERÂMICA, EM ARGAMASSA TRAÇO 1:2:8, PREPARO MECÂNICO COM BETONEIRA 400L, APLICADO MANUALMENTE EM FACES INTERNAS DE PAREDES, PARA AMBIENTE COM ÁREA MAIOR QUE 10M2, ESPESSURA DE 10MM, COM EXECUÇÃO DE TALISCAS. AF_06/2014","M2",40.479999999999997,null,null,0,""]
["S",3,"S",0,1,13,3,0,0,0,0,"","Serviço","Serviço","-","SINAPI",87547,"MASSA ÚNICA, PARA RECEBIMENTO DE PINTURA, EM ARGAMASSA TRAÇO 1:2:8, PREPARO MECÂNICO COM BETONEIRA 400L, APLICADA MANUALMENTE EM FACES INTERNAS DE PAREDES, ESPESSURA DE 10MM, COM EXECUÇÃO DE TALISCAS. AF_06/2014","M2",7,null,null,0,""]
["S",3,"S",0,1,13,3,0,0,0,0,"","Serviço","Serviço","-","SINAPI",87273,"REVESTIMENTO CERÂMICO PARA PAREDES INTERNAS COM PLACAS TIPO ESMALTADA EXTRA DE DIMENSÕES 33X45 CM APLICADAS EM AMBIENTES DE ÁREA MAIOR QUE 5 M² NA ALTURA INTEIRA DAS PAREDES. AF_06/2014","M2",40.85,null,null,0,""]
[3,3,3,3,1,13,4,0,0,3,36,"","Nível 3","Nível 3","-","SINAPI",null,"LABORATÓRIO DE QUÍMICA","-",null,null,null,0,""]
[{"$f":"CHOOSE(1+LOG(1+2*(ORÇAMENTO.Nivel=\"Nível 1\")+4*(ORÇAMENTO.Nivel=\"Nível 2\")+8*(ORÇAMENTO.Nivel=\"Nível 3\")+16*(ORÇAMENTO.Nivel=\"Nível 4\")+32*(ORÇAMENTO.Nivel=\"Serviço\"),2),0,1,2,3,4,\"S\")","v":"S"},{"$f":"IF(OR(C339=\"s\",C339=0),OFFSET(B339,-1,0),C339)","v":3},{"$f":"IF(OFFSET(C339,-1,0)=\"L\",1,IF(OFFSET(C339,-1,0)=1,2,IF(OR(A339=\"s\",A339=0),\"S\",IF(AND(OFFSET(C339,-1,0)=2,A339=4),3,IF(AND(OR(OFFSET(C339,-1,0)=\"s\",OFFSET(C339,-1,0)=0),A339<>\"s\",A339>OFFSET(B339,-1,0)),OFFSET(B339,-1,0),A339)))))","v":"S"},{"$f":"IF(OR(C339=\"S\",C339=0),0,IF(ISERROR(K339),J339,SMALL(J339:K339,1)))","v":0},{"$f":"IF($C339=1,OFFSET(E339,-1,0)+1,OFFSET(E339,-1,0))","v":1},{"$f":"IF($C339=1,0,IF($C339=2,OFFSET(F339,-1,0)+1,OFFSET(F339,-1,0)))","v":13},{"$f":"IF(AND($C339<=2,$C339<>0),0,IF($C339=3,OFFSET(G339,-1,0)+1,OFFSET(G339,-1,0)))","v":4},{"$f":"IF(AND($C339<=3,$C339<>0),0,IF($C339=4,OFFSET(H339,-1,0)+1,OFFSET(H339,-1,0)))","v":0},{"$f":"IF(AND($C339<=4,$C339<>0),0,IF(AND($C339=\"S\",$W339>0),OFFSET(I339,-1,0)+1,OFFSET(I339,-1,0)))","v":0},0,0,"","Serviço","Serviço","-","SINAPI",87553,"EMBOÇO, PARA RECEBIMENTO DE CERÂMICA, EM ARGAMASSA TRAÇO 1:2:8, PREPARO MECÂNICO COM BETONEIRA 400L, APLICADO MANUALMENTE EM FACES INTERNAS DE PAREDES, PARA AMBIENTE COM ÁREA MAIOR QUE 10M2, ESPESSURA DE 10MM, COM EXECUÇÃO DE TALISCAS. AF_06/2014","M2",77.41,null,null,0,""]
["S",3,"S",0,1,13,4,0,0,0,0,"","Serviço","Serviço","-","SINAPI",87273,"REVESTIMENTO CERÂMICO PARA PAREDES INTERNAS COM PLACAS TIPO ESMALTADA EXTRA DE DIMENSÕES 33X45 CM APLICADAS EM AMBIENTES DE ÁREA MAIOR QUE 5 M² NA ALTURA INTEIRA DAS PAREDES. AF_06/2014","M2",77.41,null,null,0,""]
[2,2,2,10,1,14,0,0,0,107,10,"","Nível 2","Nível 2","-",null,null,"FORROS","-",null,null,null,0,""]
[3,3,3,3,1,14,1,0,0,9,3,"","Nível 3","Nível 3","-","SINAPI",null,"PVC COM ESTRUTURA","-",null,null,null,0,""]
[4,4,4,2,1,14,1,1,0,2,6,"","Nível 4","Nível 4","-","SINAPI",null,"LABORATÓRIO DE QUÍMICA","-",null,null,null,0,""]
["S",4,"S",0,1,14,1,1,0,0,0,"","Serviço","Serviço","-","SINAPI",96116,"FORRO EM RÉGUAS DE PVC, FRISADO, PARA AMBIENTES COMERCIAIS, INCLUSIVE ESTRUTURA DE FIXAÇÃO. AF_05/2017_P","M2",49.71,null,null,0,"Referência: AGETOP - 210460"]
[3,3,3,6,1,14,2,0,0,6,17,"","Nível 3","Nível 3","-","SINAPI",null,"OUTROS","-",null,null,null,0,""]
[4,4,4,3,1,14,2,1,0,5,3,"","Nível 4","Nível 4","-","SINAPI",null,"REFORMA DOS BANHEIROS","-",null,null,null,0,""]
["S",4,"S",0,1,14,2,1,0,0,0,"","Serviço","Serviço","-","AGETOP",210501,"FORRO DE GESSO COMUM","m2    ",6.8,null,null,0,""]
["S",4,"S",0,1,14,2,1,0,0,0,"","Serviço","Serviço","-","AGETOP",210506,"TABICA PARA FORRO DE GESSO COMUM","m     ",15.2,null,null,0,""]
[4,4,4,2,1,14,2,2,0,2,18,"","Nível 4","Nível 4","-","SINAPI",null,"REFORMA GERAL DO BLOCO EM ANEXO","-",null,null,null,0,""]
["S",4,"S",0,1,14,2,2,0,0,0,"","Serviço","Serviço","-","SINAPI",87884,"CHAPISCO APLICADO NO TETO, COM ROLO PARA TEXTURA ACRÍLICA. ARGAMASSA INDUSTRIALIZADA COM PREPARO MANUAL. AF_06/2014","M2",42,null,null,0,"Referência: AGETOP - 210102"]
[2,2,2,27,1,15,0,0,0,97,27,"","Nível 2","Nível 2","-",null,null,"REVESTIMENTO DE PISO","-",null,null,null,0,""]
[3,3,3,2,1,15,1,0,0,26,2,"","Nível 3","Nível 3","-","SINAPI",null,"LASTRO","-",null,null,null,0,""]
["S",3,"S",0,1,15,1,0,0,0,0,"","Serviço","Serviço","-","AGETOP",220101,"LASTRO DE CONCRETO REGULARIZADO IMPERMEABILIZADO 1:3:6 ESP=5CM (BASE)","m2    ",496.47999999999996,null,null,0,""]
[3,3,3,8,1,15,2,0,0,24,8,"","Nível 3","Nível 3","-",null,null,"GRANITINA","-",null,null,null,0,""]
[4,4,4,4,1,15,2,1,0,7,4,"","Nível 4","Nível 4","-","SINAPI",null,"REFORMA GERAL DO BLOCO EM ANEXO","-",null,null,null,0,""]
["S",4,"S",0,1,15,2,1,0,0,0,"","Serviço","Serviço","-","AGETOP",221106,"GRANITINA 8MM FUNDIDA COM CONTRAPISO (1CI:3ARML) E=2CM E JUNTA PLASTICA 27MM (COM ÓXIDO DE FERRO)","m2    ",146,null,null,0,""]
["S",4,"S",0,1,15,2,1,0,0,0,"","Serviço","Serviço","-","AGETOP",221102,"RODAPÉ FUNDIDO DE GRANITINA 7CM","m     ",102.2,null,null,0,""]
["S",4,"S",0,1,15,2,1,0,0,0,"","Serviço","Serviço","-","AGETOP",221104,"RASPAGEM E APLICAÇÃO RESINA ACRÍLICA DUAS DEMÃOS","m2    ",153.15,null,null,0,""]
[4,4,4,3,1,15,2,2,0,3,8,"","Nível 4","Nível 4","-","SINAPI",null,"REFORMA DOS BANHEIROS","-",null,null,null,0,""]
["S",4,"S",0,1,15,2,2,0,{"$f":"IF(OR($C360=\"S\",$C360=0),0,MATCH(0,OFFSET($D360,1,$C360,ROW($C$448)-ROW($C360)),0))","v":0},{"$f":"IF(OR($C360=\"S\",$C360=0),0,MATCH(OFFSET($D360,0,$C360)+1,OFFSET($D360,1,$C360,ROW($C$448)-ROW($C360)),0))","v":0},"","Serviço","Serviço","-","AGETOP",221106,"GRANITINA 8MM FUNDIDA COM CONTRAPISO (1CI:3ARML) E=2CM E JUNTA PLASTICA 27MM (COM ÓXIDO DE FERRO)","m2    ",1.2,null,null,0,""]
["S",4,"S",0,1,15,2,2,0,0,0,"","Serviço","Serviço","-","AGETOP",221104,"RASPAGEM E APLICAÇÃO RESINA ACRÍLICA DUAS DEMÃOS","m2    ",1.2,null,null,0,""]
[3,3,3,9,1,15,3,0,0,16,9,"","Nível 3","Nível 3","-",null,null,"CERÂMICO","-",null,null,null,0,""]
[4,4,4,2,1,15,3,1,0,8,2,"","Nível 4","Nível 4","-","SINAPI",null,"REFORMA GERAL DO BLOCO EM ANEXO","-",null,null,null,0,""]
["S",4,"S",0,1,15,3,1,0,0,0,"","Serviço","Serviço","-","SINAPI",87251,"REVESTIMENTO CERÂMICO PARA PISO COM PLACAS TIPO ESMALTADA EXTRA DE DIMENSÕES 45X45 CM APLICADA EM AMBIENTES DE ÁREA MAIOR QUE 10 M2. AF_06/2014","M2",85.3,null,null,0,""]
[4,4,4,2,1,15,3,2,0,6,2,"","Nível 4","Nível 4","-","SINAPI",null,"REFORMA DOS BANHEIROS","-",null,null,null,0,""]
["S",4,"S",0,1,15,3,2,0,0,0,"","Serviço","Serviço","-","SINAPI",87251,"REVESTIMENTO CERÂMICO PARA PISO COM PLACAS TIPO ESMALTADA EXTRA DE DIMENSÕES 45X45 CM APLICADA EM AMBIENTES DE ÁREA MAIOR QUE 10 M2. AF_06/2014","M2",6.8,null,null,0,""]
[4,4,4,2,1,15,3,3,0,4,2,"","Nível 4","Nível 4","-","SINAPI",null,"SALA DO GRÊMIO","-",null,null,null,0,""]
["S",4,"S",0,1,15,3,3,0,0,0,"","Serviço","Serviço","-","SINAPI",87251,"REVESTIMENTO CERÂMICO PARA PISO COM PLACAS TIPO ESMALTADA EXTRA DE DIMENSÕES 45X45 CM APLICADA EM AMBIENTES DE ÁREA MAIOR QUE 10 M2. AF_06/2014","M2",21.65,null,null,0,""]
[4,4,4,2,1,15,3,4,0,2,{"$error":"#N/A"},"","Nível 4","Nível 4","-","SINAPI",null,"LABORATÓRIO DE QUÍMICA","-",null,null,null,0,""]
["S",4,"S",0,1,15,3,4,0,0,0,"","Serviço","Serviço","-","SINAPI",87251,"REVESTIMENTO CERÂMICO PARA PISO COM PLACAS TIPO ESMALTADA EXTRA DE DIMENSÕES 45X45 CM APLICADA EM AMBIENTES DE ÁREA MAIOR QUE 10 M2. AF_06/2014","M2",49.71,null,null,0,""]
[3,3,3,3,1,15,4,0,0,7,3,"","Nível 3","Nível 3","-",null,null,"CONCRETO","-",null,null,null,0,""]
[4,4,4,2,1,15,4,1,0,2,24,"","Nível 4","Nível 4","-","SINAPI",null,"REFORMA GERAL DO BLOCO EM ANEXO","-",null,null,null,0,""]
["S",4,"S",0,1,15,4,1,0,0,0,"","Serviço","Serviço","-","AGETOP",220102,"PISO CONCRETO DESEMPENADO ESPESSURA = 5 CM  1:2,5:3,5","m2    ",185.82,null,null,0,""]
[3,3,3,4,1,15,5,0,0,4,56,"","Nível 3","Nível 3","-",null,null,"PODOTÁTIL","-",null,null,null,0,""]
[{"$f":"CHOOSE(1+LOG(1+2*(ORÇAMENTO.Nivel=\"Nível 1\")+4*(ORÇAMENTO.Nivel=\"Nível 2\")+8*(ORÇAMENTO.Nivel=\"Nível 3\")+16*(ORÇAMENTO.Nivel=\"Nível 4\")+32*(ORÇAMENTO.Nivel=\"Serviço\"),2),0,1,2,3,4,\"S\")","v":4},{"$f":"IF(OR(C375=\"s\",C375=0),OFFSET(B375,-1,0),C375)","v":4},{"$f":"IF(OFFSET(C375,-1,0)=\"L\",1,IF(OFFSET(C375,-1,0)=1,2,IF(OR(A375=\"s\",A375=0),\"S\",IF(AND(OFFSET(C375,-1,0)=2,A375=4),3,IF(AND(OR(OFFSET(C375,-1,0)=\"s\",OFFSET(C375,-1,0)=0),A375<>\"s\",A375>OFFSET(B375,-1,0)),OFFSET(B375,-1,0),A375)))))","v":4},{"$f":"IF(OR(C375=\"S\",C375=0),0,IF(ISERROR(K375),J375,SMALL(J375:K375,1)))","v":3},{"$f":"IF($C375=1,OFFSET(E375,-1,0)+1,OFFSET(E375,-1,0))","v":1},{"$f":"IF($C375=1,0,IF($C375=2,OFFSET(F375,-1,0)+1,OFFSET(F375,-1,0)))","v":15},{"$f":"IF(AND($C375<=2,$C375<>0),0,IF($C375=3,OFFSET(G375,-1,0)+1,OFFSET(G375,-1,0)))","v":5},{"$f":"IF(AND($C375<=3,$C375<>0),0,IF($C375=4,OFFSET(H375,-1,0)+1,OFFSET(H375,-1,0)))","v":1},{"$f":"IF(AND($C375<=4,$C375<>0),0,IF(AND($C375=\"S\",$W375>0),OFFSET(I375,-1,0)+1,OFFSET(I375,-1,0)))","v":0},3,21,"","Nível 4","Nível 4","-","SINAPI",null,"PISO TÁTIL","-",null,null,null,0,""]
["S",4,"S",0,1,15,5,1,0,0,0,"","Serviço","Serviço","-","AGETOP",221120,"PISO DE BORRACHA COLORIDO MODELO TÁTIL ( ALERTA OU DIRECIONAL) INCLUSO CONTRAPISO (1CI:3ARML) C/ E=2CM E NATA DE CIMENTO","m2    ",4.88,null,null,0,""]
["S",4,"S",0,1,15,5,1,0,0,0,"","Serviço","Serviço","-","AGETOP",221126,"PISO DE LADRILHO HIDRÁULICO COLORIDO MODELO TÁTIL ( ALERTA OU DIRECIONAL) SEM LASTRO","m2    ",22.619999999999997,null,null,0,""]
[2,2,2,4,1,16,0,0,0,70,4,"","Nível 2","Nível 2","-",null,null,"FERRAGENS","-",null,null,null,0,""]
[3,3,3,3,1,16,1,0,0,3,6,"","Nível 3","Nível 3","-","SINAPI",null,"REFORMA DOS BANHEIROS","-",null,null,null,0,""]
["S",3,"S",0,1,16,1,0,0,0,0,"","Serviço","Serviço","-","AGETOP",230174,"BARRA DE APOIO EM AÇO INOX - 40 CM","un    ",3,null,null,0,""]
["S",3,"S",0,1,16,1,0,0,0,0,"","Serviço","Serviço","-","AGETOP",230176,"BARRA DE APOIO EM AÇO INOX - 80 CM ","un    ",3,null,null,0,""]
[2,{"$f":"IF(OR(C382=\"s\",C382=0),OFFSET(B382,-1,0),C382)","v":2},{"$f":"IF(OFFSET(C382,-1,0)=\"L\",1,IF(OFFSET(C382,-1,0)=1,2,IF(OR(A382=\"s\",A382=0),\"S\",IF(AND(OFFSET(C382,-1,0)=2,A382=4),3,IF(AND(OR(OFFSET(C382,-1,0)=\"s\",OFFSET(C382,-1,0)=0),A382<>\"s\",A382>OFFSET(B382,-1,0)),OFFSET(B382,-1,0),A382)))))","v":2},{"$f":"IF(OR(C382=\"S\",C382=0),0,IF(ISERROR(K382),J382,SMALL(J382:K382,1)))","v":5},{"$f":"IF($C382=1,OFFSET(E382,-1,0)+1,OFFSET(E382,-1,0))","v":1},{"$f":"IF($C382=1,0,IF($C382=2,OFFSET(F382,-1,0)+1,OFFSET(F382,-1,0)))","v":17},{"$f":"IF(AND($C382<=2,$C382<>0),0,IF($C382=3,OFFSET(G382,-1,0)+1,OFFSET(G382,-1,0)))","v":0},{"$f":"IF(AND($C382<=3,$C382<>0),0,IF($C382=4,OFFSET(H382,-1,0)+1,OFFSET(H382,-1,0)))","v":0},{"$f":"IF(AND($C382<=4,$C382<>0),0,IF(AND($C382=\"S\",$W382>0),OFFSET(I382,-1,0)+1,OFFSET(I382,-1,0)))","v":0},66,5,"","Nível 2","Nível 2","-",null,null,"MARCENARIA","-",null,null,null,0,""]
[3,3,3,2,1,17,1,0,0,4,2,"","Nível 3","Nível 3","-","SINAPI",null,"REFORMA GERAL DO BLOCO EM ANEXO","-",null,null,null,0,""]
["S",3,"S",0,1,17,1,0,0,0,0,"","Serviço","Serviço","-","AGETOP",240106,"BATE CARTEIRA ENVERNIZADO E ASSENT. 2,5 X 12 CM","M     ",54,null,null,0,""]
[3,3,3,2,1,17,2,0,0,2,26,"","Nível 3","Nível 3","-","SINAPI",null,"SALA DO GRÊMIO","-",null,null,null,0,""]
["S",3,"S",0,1,17,2,0,0,0,0,"","Serviço","Serviço","-","AGETOP",240106,"BATE CARTEIRA ENVERNIZADO E ASSENT. 2,5 X 12 CM","M     ",18.399999999999999,null,null,0,""]
[2,2,2,4,1,18,0,0,0,61,4,"","Nível 2","Nível 2","-",null,null,"ADMINISTRAÇÃO","-",null,null,null,0,""]
[3,3,3,3,1,18,1,0,0,3,10,"","Nível 3","Nível 3","-",null,null,"MENSALISTAS","-",null,null,null,0,""]
["S",3,"S",0,1,18,1,0,0,0,0,"","Serviço","Serviço","-","SINAPI",90778,"ENGENHEIRO CIVIL DE OBRA PLENO COM ENCARGOS COMPLEMENTARES","H",67,null,null,0,"Referência: AGETOP - 250101"]
["S",3,"S",0,1,18,1,0,0,0,0,"","Serviço","Serviço","-","SINAPI",90776,"ENCARREGADO GERAL COM ENCARGOS COMPLEMENTARES","H",335,null,null,0,"Referência: AGETOP - 250103"]
[{"$f":"CHOOSE(1+LOG(1+2*(ORÇAMENTO.Nivel=\"Nível 1\")+4*(ORÇAMENTO.Nivel=\"Nível 2\")+8*(ORÇAMENTO.Nivel=\"Nível 3\")+16*(ORÇAMENTO.Nivel=\"Nível 4\")+32*(ORÇAMENTO.Nivel=\"Serviço\"),2),0,1,2,3,4,\"S\")","v":2},2,2,50,1,19,0,0,0,57,50,"","Nível 2","Nível 2","-",null,null,"PINTURA","-",null,null,null,0,""]
[3,3,3,6,1,19,1,0,0,49,6,"","Nível 3","Nível 3","-","SINAPI",null,"LAJE/FORRO","-",null,null,null,0,""]
[4,4,4,3,1,19,1,1,0,5,3,"","Nível 4","Nível 4","-","SINAPI",null,"REFORMA GERAL DO BLOCO EM ANEXO","-",null,null,null,0,""]
["S",4,"S",0,1,19,1,1,0,0,0,"","Serviço","Serviço","-","SINAPI",88497,"APLICAÇÃO E LIXAMENTO DE MASSA LÁTEX EM PAREDES, DUAS DEMÃOS. AF_06/2014","M2",120,null,null,0,"Referência: AGETOP - 261300"]
["S",4,"S",0,1,19,1,1,0,0,0,"","Serviço","Serviço","-","SINAPI",88489,"APLICAÇÃO MANUAL DE PINTURA COM TINTA LÁTEX ACRÍLICA EM PAREDES, DUAS DEMÃOS. AF_06/2014","M2",120,null,null,0,"Referência: AGETOP - 261001"]
[4,4,4,2,1,19,1,2,0,2,10,"","Nível 4","Nível 4","-","SINAPI",null,"REFORMA DOS BANHEIROS","-",null,null,null,0,""]
["S",4,"S",0,1,19,1,2,0,0,0,"","Serviço","Serviço","-","SINAPI",88488,"APLICAÇÃO MANUAL DE PINTURA COM TINTA LÁTEX ACRÍLICA EM TETO, DUAS DEMÃOS. AF_06/2014","M2",6.8,null,null,0,""]
[3,3,3,13,1,19,2,0,0,43,13,"","Nível 3","Nível 3","-","SINAPI",null,"LÁTEX ACRÍLICA","-",null,null,null,0,""]
[{"$f":"CHOOSE(1+LOG(1+2*(ORÇAMENTO.Nivel=\"Nível 1\")+4*(ORÇAMENTO.Nivel=\"Nível 2\")+8*(ORÇAMENTO.Nivel=\"Nível 3\")+16*(ORÇAMENTO.Nivel=\"Nível 4\")+32*(ORÇAMENTO.Nivel=\"Serviço\"),2),0,1,2,3,4,\"S\")","v":4},{"$f":"IF(OR(C399=\"s\",C399=0),OFFSET(B399,-1,0),C399)","v":4},{"$f":"IF(OFFSET(C399,-1,0)=\"L\",1,IF(OFFSET(C399,-1,0)=1,2,IF(OR(A399=\"s\",A399=0),\"S\",IF(AND(OFFSET(C399,-1,0)=2,A399=4),3,IF(AND(OR(OFFSET(C399,-1,0)=\"s\",OFFSET(C399,-1,0)=0),A399<>\"s\",A399>OFFSET(B399,-1,0)),OFFSET(B399,-1,0),A399)))))","v":4},{"$f":"IF(OR(C399=\"S\",C399=0),0,IF(ISERROR(K399),J399,SMALL(J399:K399,1)))","v":4},{"$f":"IF($C399=1,OFFSET(E399,-1,0)+1,OFFSET(E399,-1,0))","v":1},{"$f":"IF($C399=1,0,IF($C399=2,OFFSET(F399,-1,0)+1,OFFSET(F399,-1,0)))","v":19},{"$f":"IF(AND($C399<=2,$C399<>0),0,IF($C399=3,OFFSET(G399,-1,0)+1,OFFSET(G399,-1,0)))","v":2},{"$f":"IF(AND($C399<=3,$C399<>0),0,IF($C399=4,OFFSET(H399,-1,0)+1,OFFSET(H399,-1,0)))","v":1},{"$f":"IF(AND($C399<=4,$C399<>0),0,IF(AND($C399=\"S\",$W399>0),OFFSET(I399,-1,0)+1,OFFSET(I399,-1,0)))","v":0},12,4,"","Nível 4","Nível 4","-","SINAPI",null,"REFORMA GERAL DO BLOCO EM ANEXO","-",null,null,null,0,""]
[{"$f":"CHOOSE(1+LOG(1+2*(ORÇAMENTO.Nivel=\"Nível 1\")+4*(ORÇAMENTO.Nivel=\"Nível 2\")+8*(ORÇAMENTO.Nivel=\"Nível 3\")+16*(ORÇAMENTO.Nivel=\"Nível 4\")+32*(ORÇAMENTO.Nivel=\"Serviço\"),2),0,1,2,3,4,\"S\")","v":"S"},{"$f":"IF(OR(C400=\"s\",C400=0),OFFSET(B400,-1,0),C400)","v":4},{"$f":"IF(OFFSET(C400,-1,0)=\"L\",1,IF(OFFSET(C400,-1,0)=1,2,IF(OR(A400=\"s\",A400=0),\"S\",IF(AND(OFFSET(C400,-1,0)=2,A400=4),3,IF(AND(OR(OFFSET(C400,-1,0)=\"s\",OFFSET(C400,-1,0)=0),A400<>\"s\",A400>OFFSET(B400,-1,0)),OFFSET(B400,-1,0),A400)))))","v":"S"},{"$f":"IF(OR(C400=\"S\",C400=0),0,IF(ISERROR(K400),J400,SMALL(J400:K400,1)))","v":0},{"$f":"IF($C400=1,OFFSET(E400,-1,0)+1,OFFSET(E400,-1,0))","v":1},{"$f":"IF($C400=1,0,IF($C400=2,OFFSET(F400,-1,0)+1,OFFSET(F400,-1,0)))","v":19},{"$f":"IF(AND($C400<=2,$C400<>0),0,IF($C400=3,OFFSET(G400,-1,0)+1,OFFSET(G400,-1,0)))","v":2},{"$f":"IF(AND($C400<=3,$C400<>0),0,IF($C400=4,OFFSET(H400,-1,0)+1,OFFSET(H400,-1,0)))","v":1},{"$f":"IF(AND($C400<=4,$C400<>0),0,IF(AND($C400=\"S\",$W400>0),OFFSET(I400,-1,0)+1,OFFSET(I400,-1,0)))","v":0},0,0,"","Serviço","Serviço","-","AGETOP",260104,"REMOCAO DE PINTURA ANTIGA A LATEX","m2    ",177.37,null,null,0,""]
["S",4,"S",0,1,19,2,1,0,0,0,"","Serviço","Serviço","-","SINAPI",88497,"APLICAÇÃO E LIXAMENTO DE MASSA LÁTEX EM PAREDES, DUAS DEMÃOS. AF_06/2014","M2",75,null,null,0,"Referência: AGETOP - 261300"]
["S",4,"S",0,1,19,2,1,0,0,0,"","Serviço","Serviço","-","SINAPI",88489,"APLICAÇÃO MANUAL DE PINTURA COM TINTA LÁTEX ACRÍLICA EM PAREDES, DUAS DEMÃOS. AF_06/2014","M2",75,null,null,0,"Referência: AGETOP - 261001"]
[4,4,4,3,1,19,2,2,0,8,3,"","Nível 4","Nível 4","-","SINAPI",null,"SALA DO GRÊMIO","-",null,null,null,0,""]
["S",4,"S",0,1,19,2,2,0,0,0,"","Serviço","Serviço","-","SINAPI",88497,"APLICAÇÃO E LIXAMENTO DE MASSA LÁTEX EM PAREDES, DUAS DEMÃOS. AF_06/2014","M2",38,null,null,0,"Referência: AGETOP - 261300"]
["S",4,"S",0,1,19,2,2,0,0,0,"","Serviço","Serviço","-","SINAPI",88489,"APLICAÇÃO MANUAL DE PINTURA COM TINTA LÁTEX ACRÍLICA EM PAREDES, DUAS DEMÃOS. AF_06/2014","M2",38,null,null,0,"Referência: AGETOP - 261001"]
[4,4,4,2,1,19,2,3,0,5,2,"","Nível 4","Nível 4","-","SINAPI",null,"LABORATÓRIO DE QUÍMICA","-",null,null,null,0,""]
["S",4,"S",0,1,19,2,3,0,0,0,"","Serviço","Serviço","-","AGETOP",260104,"REMOCAO DE PINTURA ANTIGA A LATEX","m2    ",77.41,null,null,0,""]
[4,4,4,3,1,19,2,4,0,3,{"$error":"#N/A"},"","Nível 4","Nível 4","-","SINAPI",null,"REFORMA DOS BANHEIROS","-",null,null,null,0,""]
["S",4,"S",0,1,19,2,4,0,0,0,"","Serviço","Serviço","-","SINAPI",88497,"APLICAÇÃO E LIXAMENTO DE MASSA LÁTEX EM PAREDES, DUAS DEMÃOS. AF_06/2014","M2",5.23,null,null,0,"Referência: AGETOP - 261300"]
["S",4,"S",0,1,19,2,4,0,0,0,"","Serviço","Serviço","-","SINAPI",88489,"APLICAÇÃO MANUAL DE PINTURA COM TINTA LÁTEX ACRÍLICA EM PAREDES, DUAS DEMÃOS. AF_06/2014","M2",5.23,null,null,0,"Referência: AGETOP - 261001"]
[3,3,3,7,1,19,3,0,0,30,7,"","Nível 3","Nível 3","-","SINAPI",null,"ESMALTE SINTÉTICO","-",null,null,null,0,""]
[4,4,4,3,1,19,3,1,0,6,3,"","Nível 4","Nível 4","-","SINAPI",null,"REFORMA GERAL DO BLOCO EM ANEXO","-",null,null,null,0,""]
["S",4,"S",0,1,19,3,1,0,0,0,"","Serviço","Serviço","-","SINAPI",88497,"APLICAÇÃO E LIXAMENTO DE MASSA LÁTEX EM PAREDES, DUAS DEMÃOS. AF_06/2014","M2",75,null,null,0,"Referência: AGETOP - 261300"]
["S",4,"S",0,1,19,3,1,0,0,0,"","Serviço","Serviço","-","AGETOP",261550,"PINT.ESMALTE SINT.PAREDES - 2 DEM.C/SELADOR","m2    ",75,null,null,0,""]
[4,4,4,3,1,19,3,2,0,3,8,"","Nível 4","Nível 4","-","SINAPI",null,"REFORMA DOS BANHEIROS","-",null,null,null,0,""]
["S",4,"S",0,1,19,3,2,0,0,0,"","Serviço","Serviço","-","SINAPI",88497,"APLICAÇÃO E LIXAMENTO DE MASSA LÁTEX EM PAREDES, DUAS DEMÃOS. AF_06/2014","M2",5.23,null,null,0,"Referência: AGETOP - 261300"]
["S",4,"S",0,1,19,3,2,0,0,0,"","Serviço","Serviço","-","AGETOP",261550,"PINT.ESMALTE SINT.PAREDES - 2 DEM.C/SELADOR","m2    ",5.23,null,null,0,""]
[3,3,3,8,1,19,4,0,0,23,8,"","Nível 3","Nível 3","-","SINAPI",null,"PAREDES EXTERNAS","-",null,null,null,0,""]
[4,4,4,2,1,19,4,1,0,7,2,"","Nível 4","Nível 4","-","SINAPI",null,"REFORMA GERAL DO BLOCO EM ANEXO","-",null,null,null,0,""]
[{"$f":"CHOOSE(1+LOG(1+2*(ORÇAMENTO.Nivel=\"Nível 1\")+4*(ORÇAMENTO.Nivel=\"Nível 2\")+8*(ORÇAMENTO.Nivel=\"Nível 3\")+16*(ORÇAMENTO.Nivel=\"Nível 4\")+32*(ORÇAMENTO.Nivel=\"Serviço\"),2),0,1,2,3,4,\"S\")","v":"S"},{"$f":"IF(OR(C420=\"s\",C420=0),OFFSET(B420,-1,0),C420)","v":4},{"$f":"IF(OFFSET(C420,-1,0)=\"L\",1,IF(OFFSET(C420,-1,0)=1,2,IF(OR(A420=\"s\",A420=0),\"S\",IF(AND(OFFSET(C420,-1,0)=2,A420=4),3,IF(AND(OR(OFFSET(C420,-1,0)=\"s\",OFFSET(C420,-1,0)=0),A420<>\"s\",A420>OFFSET(B420,-1,0)),OFFSET(B420,-1,0),A420)))))","v":"S"},{"$f":"IF(OR(C420=\"S\",C420=0),0,IF(ISERROR(K420),J420,SMALL(J420:K420,1)))","v":0},{"$f":"IF($C420=1,OFFSET(E420,-1,0)+1,OFFSET(E420,-1,0))","v":1},{"$f":"IF($C420=1,0,IF($C420=2,OFFSET(F420,-1,0)+1,OFFSET(F420,-1,0)))","v":19},{"$f":"IF(AND($C420<=2,$C420<>0),0,IF($C420=3,OFFSET(G420,-1,0)+1,OFFSET(G420,-1,0)))","v":4},{"$f":"IF(AND($C420<=3,$C420<>0),0,IF($C420=4,OFFSET(H420,-1,0)+1,OFFSET(H420,-1,0)))","v":1},{"$f":"IF(AND($C420<=4,$C420<>0),0,IF(AND($C420=\"S\",$W420>0),OFFSET(I420,-1,0)+1,OFFSET(I420,-1,0)))","v":0},0,0,"","Serviço","Serviço","-","AGETOP",261000,"PINTURA LATEX ACRILICA 2 DEMAOS C/SELADOR","m2    ",217,null,null,0,""]
[4,{"$f":"IF(OR(C421=\"s\",C421=0),OFFSET(B421,-1,0),C421)","v":4},{"$f":"IF(OFFSET(C421,-1,0)=\"L\",1,IF(OFFSET(C421,-1,0)=1,2,IF(OR(A421=\"s\",A421=0),\"S\",IF(AND(OFFSET(C421,-1,0)=2,A421=4),3,IF(AND(OR(OFFSET(C421,-1,0)=\"s\",OFFSET(C421,-1,0)=0),A421<>\"s\",A421>OFFSET(B421,-1,0)),OFFSET(B421,-1,0),A421)))))","v":4},{"$f":"IF(OR(C421=\"S\",C421=0),0,IF(ISERROR(K421),J421,SMALL(J421:K421,1)))","v":2},{"$f":"IF($C421=1,OFFSET(E421,-1,0)+1,OFFSET(E421,-1,0))","v":1},{"$f":"IF($C421=1,0,IF($C421=2,OFFSET(F421,-1,0)+1,OFFSET(F421,-1,0)))","v":19},{"$f":"IF(AND($C421<=2,$C421<>0),0,IF($C421=3,OFFSET(G421,-1,0)+1,OFFSET(G421,-1,0)))","v":4},{"$f":"IF(AND($C421<=3,$C421<>0),0,IF($C421=4,OFFSET(H421,-1,0)+1,OFFSET(H421,-1,0)))","v":2},{"$f":"IF(AND($C421<=4,$C421<>0),0,IF(AND($C421=\"S\",$W421>0),OFFSET(I421,-1,0)+1,OFFSET(I421,-1,0)))","v":0},5,2,"","Nível 4","Nível 4","-","SINAPI",null,"INSTALAÇÃO ALAMBRADO NA QUADRA","-",null,null,null,0,""]
["S",4,"S",0,1,19,4,2,0,0,0,"","Serviço","Serviço","-","AGETOP",261000,"PINTURA LATEX ACRILICA 2 DEMAOS C/SELADOR","m2    ",103.4,null,null,0,""]
[4,4,4,3,1,19,4,3,0,3,14,"","Nível 4","Nível 4","-",null,null,"REFORMA DO MURO","-",null,null,null,0,""]
["S",4,"S",0,1,19,4,3,0,{"$f":"IF(OR($C424=\"S\",$C424=0),0,MATCH(0,OFFSET($D424,1,$C424,ROW($C$448)-ROW($C424)),0))","v":0},{"$f":"IF(OR($C424=\"S\",$C424=0),0,MATCH(OFFSET($D424,0,$C424)+1,OFFSET($D424,1,$C424,ROW($C$448)-ROW($C424)),0))","v":0},"","Serviço","Serviço","-","AGETOP",260104,"REMOCAO DE PINTURA ANTIGA A LATEX","m2    ",193,null,null,0,""]
["S",4,"S",0,1,19,4,3,0,0,0,"","Serviço","Serviço","-","AGETOP",261000,"PINTURA LATEX ACRILICA 2 DEMAOS C/SELADOR","m2    ",751.75,null,null,0,""]
[3,3,3,4,1,19,5,0,0,15,4,"","Nível 3","Nível 3","-","SINAPI",null,"ESQUADRIAS EXISTENTES","-",null,null,null,0,""]
[{"$f":"CHOOSE(1+LOG(1+2*(ORÇAMENTO.Nivel=\"Nível 1\")+4*(ORÇAMENTO.Nivel=\"Nível 2\")+8*(ORÇAMENTO.Nivel=\"Nível 3\")+16*(ORÇAMENTO.Nivel=\"Nível 4\")+32*(ORÇAMENTO.Nivel=\"Serviço\"),2),0,1,2,3,4,\"S\")","v":4},{"$f":"IF(OR(C427=\"s\",C427=0),OFFSET(B427,-1,0),C427)","v":4},{"$f":"IF(OFFSET(C427,-1,0)=\"L\",1,IF(OFFSET(C427,-1,0)=1,2,IF(OR(A427=\"s\",A427=0),\"S\",IF(AND(OFFSET(C427,-1,0)=2,A427=4),3,IF(AND(OR(OFFSET(C427,-1,0)=\"s\",OFFSET(C427,-1,0)=0),A427<>\"s\",A427>OFFSET(B427,-1,0)),OFFSET(B427,-1,0),A427)))))","v":4},{"$f":"IF(OR(C427=\"S\",C427=0),0,IF(ISERROR(K427),J427,SMALL(J427:K427,1)))","v":3},{"$f":"IF($C427=1,OFFSET(E427,-1,0)+1,OFFSET(E427,-1,0))","v":1},{"$f":"IF($C427=1,0,IF($C427=2,OFFSET(F427,-1,0)+1,OFFSET(F427,-1,0)))","v":19},{"$f":"IF(AND($C427<=2,$C427<>0),0,IF($C427=3,OFFSET(G427,-1,0)+1,OFFSET(G427,-1,0)))","v":5},{"$f":"IF(AND($C427<=3,$C427<>0),0,IF($C427=4,OFFSET(H427,-1,0)+1,OFFSET(H427,-1,0)))","v":1},{"$f":"IF(AND($C427<=4,$C427<>0),0,IF(AND($C427=\"S\",$W427>0),OFFSET(I427,-1,0)+1,OFFSET(I427,-1,0)))","v":0},{"$f":"IF(OR($C427=\"S\",$C427=0),0,MATCH(0,OFFSET($D427,1,$C427,ROW($C$448)-ROW($C427)),0))","v":3},{"$f":"IF(OR($C427=\"S\",$C427=0),0,MATCH(OFFSET($D427,0,$C427)+1,OFFSET($D427,1,$C427,ROW($C$448)-ROW($C427)),0))","v":6},"","Nível 4","Nível 4","-","SINAPI",null,"REFORMA GERAL DO BLOCO EM ANEXO","-",null,null,null,0,""]
["S",4,"S",0,1,19,5,1,0,0,0,"","Serviço","Serviço","-","AGETOP",260105,"REMOCAO DE PINTURA ANTIGA A OLEO OU ESMALTE","m2    ",10.8,null,null,0,""]
["S",4,"S",0,1,19,5,1,0,0,0,"","Serviço","Serviço","-","SINAPI","74145/1","PINTURA ESMALTE FOSCO, DUAS DEMAOS, SOBRE SUPERFICIE METALICA, INCLUSO UMA DEMAO DE FUNDO ANTICORROSIVO. UTILIZACAO DE REVOLVER ( AR-COMPRIMIDO).","M2",10.8,null,null,0,"Referência: AGETOP - 261602"]
[3,3,3,9,1,19,6,0,0,11,9,"","Nível 3","Nível 3","-","AGETOP",null,"ESQUADRIAS NOVAS","-",null,null,null,0,""]
[{"$f":"CHOOSE(1+LOG(1+2*(ORÇAMENTO.Nivel=\"Nível 1\")+4*(ORÇAMENTO.Nivel=\"Nível 2\")+8*(ORÇAMENTO.Nivel=\"Nível 3\")+16*(ORÇAMENTO.Nivel=\"Nível 4\")+32*(ORÇAMENTO.Nivel=\"Serviço\"),2),0,1,2,3,4,\"S\")","v":4},{"$f":"IF(OR(C431=\"s\",C431=0),OFFSET(B431,-1,0),C431)","v":4},{"$f":"IF(OFFSET(C431,-1,0)=\"L\",1,IF(OFFSET(C431,-1,0)=1,2,IF(OR(A431=\"s\",A431=0),\"S\",IF(AND(OFFSET(C431,-1,0)=2,A431=4),3,IF(AND(OR(OFFSET(C431,-1,0)=\"s\",OFFSET(C431,-1,0)=0),A431<>\"s\",A431>OFFSET(B431,-1,0)),OFFSET(B431,-1,0),A431)))))","v":4},{"$f":"IF(OR(C431=\"S\",C431=0),0,IF(ISERROR(K431),J431,SMALL(J431:K431,1)))","v":2},{"$f":"IF($C431=1,OFFSET(E431,-1,0)+1,OFFSET(E431,-1,0))","v":1},{"$f":"IF($C431=1,0,IF($C431=2,OFFSET(F431,-1,0)+1,OFFSET(F431,-1,0)))","v":19},{"$f":"IF(AND($C431<=2,$C431<>0),0,IF($C431=3,OFFSET(G431,-1,0)+1,OFFSET(G431,-1,0)))","v":6},{"$f":"IF(AND($C431<=3,$C431<>0),0,IF($C431=4,OFFSET(H431,-1,0)+1,OFFSET(H431,-1,0)))","v":1},{"$f":"IF(AND($C431<=4,$C431<>0),0,IF(AND($C431=\"S\",$W431>0),OFFSET(I431,-1,0)+1,OFFSET(I431,-1,0)))","v":0},8,2,"","Nível 4","Nível 4","-","SINAPI",null,"REFORMA GERAL DO BLOCO EM ANEXO","-",null,null,null,0,""]
["S",{"$f":"IF(OR(C432=\"s\",C432=0),OFFSET(B432,-1,0),C432)","v":4},{"$f":"IF(OFFSET(C432,-1,0)=\"L\",1,IF(OFFSET(C432,-1,0)=1,2,IF(OR(A432=\"s\",A432=0),\"S\",IF(AND(OFFSET(C432,-1,0)=2,A432=4),3,IF(AND(OR(OFFSET(C432,-1,0)=\"s\",OFFSET(C432,-1,0)=0),A432<>\"s\",A432>OFFSET(B432,-1,0)),OFFSET(B432,-1,0),A432)))))","v":"S"},{"$f":"IF(OR(C432=\"S\",C432=0),0,IF(ISERROR(K432),J432,SMALL(J432:K432,1)))","v":0},{"$f":"IF($C432=1,OFFSET(E432,-1,0)+1,OFFSET(E432,-1,0))","v":1},{"$f":"IF($C432=1,0,IF($C432=2,OFFSET(F432,-1,0)+1,OFFSET(F432,-1,0)))","v":19},{"$f":"IF(AND($C432<=2,$C432<>0),0,IF($C432=3,OFFSET(G432,-1,0)+1,OFFSET(G432,-1,0)))","v":6},{"$f":"IF(AND($C432<=3,$C432<>0),0,IF($C432=4,OFFSET(H432,-1,0)+1,OFFSET(H432,-1,0)))","v":1},{"$f":"IF(AND($C432<=4,$C432<>0),0,IF(AND($C432=\"S\",$W432>0),OFFSET(I432,-1,0)+1,OFFSET(I432,-1,0)))","v":0},0,0,"","Serviço","Serviço","-","SINAPI","74145/1","PINTURA ESMALTE FOSCO, DUAS DEMAOS, SOBRE SUPERFICIE METALICA, INCLUSO UMA DEMAO DE FUNDO ANTICORROSIVO. UTILIZACAO DE REVOLVER ( AR-COMPRIMIDO).","M2",47.7,null,null,0,"Referência: AGETOP - 261602"]
[4,4,4,2,1,19,6,2,0,6,2,"","Nível 4","Nível 4","-","SINAPI",null,"SALA DO GRÊMIO","-",null,null,null,0,""]
["S",4,"S",0,1,19,6,2,0,0,0,"","Serviço","Serviço","-","SINAPI","74145/1","PINTURA ESMALTE FOSCO, DUAS DEMAOS, SOBRE SUPERFICIE METALICA, INCLUSO UMA DEMAO DE FUNDO ANTICORROSIVO. UTILIZACAO DE REVOLVER ( AR-COMPRIMIDO).","M2",14.67,null,null,0,"Referência: AGETOP - 261602"]
[4,4,4,2,1,19,6,3,0,4,2,"","Nível 4","Nível 4","-","SINAPI",null,"REFORMA DOS BANHEIROS","-",null,null,null,0,""]
["S",4,"S",0,1,19,6,3,0,0,0,"","Serviço","Serviço","-","SINAPI","74145/1","PINTURA ESMALTE FOSCO, DUAS DEMAOS, SOBRE SUPERFICIE METALICA, INCLUSO UMA DEMAO DE FUNDO ANTICORROSIVO. UTILIZACAO DE REVOLVER ( AR-COMPRIMIDO).","M2",12.680000000000001,null,null,0,"Referência: AGETOP - 261602"]
[4,4,4,2,1,19,6,4,0,2,{"$error":"#N/A"},"","Nível 4","Nível 4","-","SINAPI",null,"INSTALAÇÃO ALAMBRADO NA QUADRA","-",null,null,null,0,""]
["S",4,"S",0,1,19,6,4,0,0,0,"","Serviço","Serviço","-","SINAPI","74145/1","PINTURA ESMALTE FOSCO, DUAS DEMAOS, SOBRE SUPERFICIE METALICA, INCLUSO UMA DEMAO DE FUNDO ANTICORROSIVO. UTILIZACAO DE REVOLVER ( AR-COMPRIMIDO).","M2",804.6,null,null,0,"Referência: AGETOP - 261602"]
[3,3,3,2,1,19,7,0,0,2,{"$error":"#N/A"},"","Nível 3","Nível 3","-","AGETOP",null,"OUTROS","-",null,null,null,0,""]
["S",3,"S",0,1,19,7,0,0,0,0,"","Serviço","Serviço","-","AGETOP",261620,"LETREIRO MÉDIO A GRANDE PORTE EM PAREDE FEITO A PINCEL","m2    ",7.2,null,null,0,""]
[2,2,2,7,1,20,0,0,0,7,{"$error":"#N/A"},"","Nível 2","Nível 2","-",null,null,"DIVERSOS","-",null,null,null,0,""]
[{"$f":"CHOOSE(1+LOG(1+2*(ORÇAMENTO.Nivel=\"Nível 1\")+4*(ORÇAMENTO.Nivel=\"Nível 2\")+8*(ORÇAMENTO.Nivel=\"Nível 3\")+16*(ORÇAMENTO.Nivel=\"Nível 4\")+32*(ORÇAMENTO.Nivel=\"Serviço\"),2),0,1,2,3,4,\"S\")","v":3},{"$f":"IF(OR(C442=\"s\",C442=0),OFFSET(B442,-1,0),C442)","v":3},{"$f":"IF(OFFSET(C442,-1,0)=\"L\",1,IF(OFFSET(C442,-1,0)=1,2,IF(OR(A442=\"s\",A442=0),\"S\",IF(AND(OFFSET(C442,-1,0)=2,A442=4),3,IF(AND(OR(OFFSET(C442,-1,0)=\"s\",OFFSET(C442,-1,0)=0),A442<>\"s\",A442>OFFSET(B442,-1,0)),OFFSET(B442,-1,0),A442)))))","v":3},{"$f":"IF(OR(C442=\"S\",C442=0),0,IF(ISERROR(K442),J442,SMALL(J442:K442,1)))","v":2},{"$f":"IF($C442=1,OFFSET(E442,-1,0)+1,OFFSET(E442,-1,0))","v":1},{"$f":"IF($C442=1,0,IF($C442=2,OFFSET(F442,-1,0)+1,OFFSET(F442,-1,0)))","v":20},{"$f":"IF(AND($C442<=2,$C442<>0),0,IF($C442=3,OFFSET(G442,-1,0)+1,OFFSET(G442,-1,0)))","v":1},{"$f":"IF(AND($C442<=3,$C442<>0),0,IF($C442=4,OFFSET(H442,-1,0)+1,OFFSET(H442,-1,0)))","v":0},{"$f":"IF(AND($C442<=4,$C442<>0),0,IF(AND($C442=\"S\",$W442>0),OFFSET(I442,-1,0)+1,OFFSET(I442,-1,0)))","v":0},6,2,"","Nível 3","Nível 3","-","SINAPI",null,"LABORATÓRIO DE QUÍMICA","-",null,null,null,0,""]
["S",3,"S",0,1,20,1,0,0,0,0,"","Serviço","Serviço","-","AGETOP",271608,"BANCADA DE GRANITO C/ESPELHO","m2    ",17.07,null,null,0,""]
[3,3,3,2,1,20,2,0,0,4,2,"","Nível 3","Nível 3","-","SINAPI",null,"REFORMA DOS BANHEIROS","-",null,null,null,0,""]
["S",3,"S",0,1,20,2,0,0,0,0,"","Serviço","Serviço","-","AGETOP",271608,"BANCADA DE GRANITO C/ESPELHO","m2    ",0.65,null,null,0,""]
[{"$f":"CHOOSE(1+LOG(1+2*(ORÇAMENTO.Nivel=\"Nível 1\")+4*(ORÇAMENTO.Nivel=\"Nível 2\")+8*(ORÇAMENTO.Nivel=\"Nível 3\")+16*(ORÇAMENTO.Nivel=\"Nível 4\")+32*(ORÇAMENTO.Nivel=\"Serviço\"),2),0,1,2,3,4,\"S\")","v":3},{"$f":"IF(OR(C446=\"s\",C446=0),OFFSET(B446,-1,0),C446)","v":3},{"$f":"IF(OFFSET(C446,-1,0)=\"L\",1,IF(OFFSET(C446,-1,0)=1,2,IF(OR(A446=\"s\",A446=0),\"S\",IF(AND(OFFSET(C446,-1,0)=2,A446=4),3,IF(AND(OR(OFFSET(C446,-1,0)=\"s\",OFFSET(C446,-1,0)=0),A446<>\"s\",A446>OFFSET(B446,-1,0)),OFFSET(B446,-1,0),A446)))))","v":3},{"$f":"IF(OR(C446=\"S\",C446=0),0,IF(ISERROR(K446),J446,SMALL(J446:K446,1)))","v":2},{"$f":"IF($C446=1,OFFSET(E446,-1,0)+1,OFFSET(E446,-1,0))","v":1},{"$f":"IF($C446=1,0,IF($C446=2,OFFSET(F446,-1,0)+1,OFFSET(F446,-1,0)))","v":20},{"$f":"IF(AND($C446<=2,$C446<>0),0,IF($C446=3,OFFSET(G446,-1,0)+1,OFFSET(G446,-1,0)))","v":3},{"$f":"IF(AND($C446<=3,$C446<>0),0,IF($C446=4,OFFSET(H446,-1,0)+1,OFFSET(H446,-1,0)))","v":0},{"$f":"IF(AND($C446<=4,$C446<>0),0,IF(AND($C446=\"S\",$W446>0),OFFSET(I446,-1,0)+1,OFFSET(I446,-1,0)))","v":0},{"$f":"IF(OR($C446=\"S\",$C446=0),0,MATCH(0,OFFSET($D446,1,$C446,ROW($C$448)-ROW($C446)),0))","v":2},{"$f":"IF(OR($C446=\"S\",$C446=0),0,MATCH(OFFSET($D446,0,$C446)+1,OFFSET($D446,1,$C446,ROW($C$448)-ROW($C446)),0))","v":{"$error":"#N/A"}},"","Nível 3","Nível 3","-","SINAPI",null,"OUTROS","-",null,null,null,0,""]
["S",3,"S",0,1,20,3,0,0,0,0,"","Serviço","Serviço","-","AGETOP",270501,"LIMPEZA FINAL DE OBRA - (OBRAS CIVIS)","m2    ",1401.85,null,null,0,""]
[-1,null,-1,null,0,0,0,0,0,null,null,"F"]
[null,null,null,null,null,null,null,null,null,null,null,"F",null,null,null,null,null,"OBS: OS QUANTITATIVOS DE MATERIAIS  DAS INSTALAÇÕES HIDROSSANITÁRIAS, ELÉTRICAS E ESPECIAIS SÃO FORNECIDOS PELOS PROFISSIONAIS RESPONSÁVEIS PELOS RESPECTIVOS PROJETOS.",null,null,"VALOR TOTAL",null,0]
[null,null,null,null,null,null,null,null,null,null,null,"F",null,null,null,null,null,null,null,null,"VALOR BDI (26,40%)",null,0]
[null,null,null,null,null,null,null,null,null,null,null,"F",null,null,null,null,null,null,null,null,"TOTAL ORÇAMENTO",null,0]
[null,null,null,null,null,null,null,null,null,null,null,"F"]
[null,null,null,null,null,null,null,null,null,null,null,"F",null,null,null,null,null,null,null,null,"CUSTO POR M2 ³",null,0]
[null,null,null,null,null,null,null,null,null,null,null,"F",null,null,null,null,null,null,null,null,"MATERIAL S/ BDI",null,0]
[null,null,null,null,null,null,null,null,null,null,null,"F",null,null,null,null,null,null,null,null,"MÃO DE OBRA S/ BDI",null,0]
[null,null,null,null,null,null,null,null,null,null,null,"F"]
[null,null,null,null,null,null,null,null,null,null,null,"F",null,null,null,null,"(1) Conforme previsto pelo DECRETO Nº 7.983, DE 8 DE ABRIL DE 2013, os preços adotados são aqueles constantes dos sistemas de referência indicados. Justifica-se o uso dos preços destas composições de custos unitários devido ao seu valor ser menor à mediana de seus correspondentes na tabela SINAPI;"]
[null,null,null,null,null,null,null,null,null,null,null,"F",null,null,null,null,"(2) Optou-se pelo uso das composições de custos da AGETOP para itens não presentes na SINAPI;"]
[null,null,null,null,null,null,null,null,null,null,null,"F",null,null,null,null,"(3) Para itens da AGETOP, os vidros não estão inclusos nas esquadrias e já foram considerados os custos de contramarco para as esquadrias de alumínio;"]
[null,null,null,null,null,null,null,null,null,null,null,"F",null,null,null,null,"(4) Nos casos em que houver execução de granitina e omissão do item AGETOP 221102, considerou-se que o quantitativo para o rodapé, de altura igual a 7cm, foi incorporado na área de piso;"]
[null,null,null,null,null,null,null,null,null,null,null,"F",null,null,null,null,"(5) O custo unitário aproximado por metro quadrado é calculado dividindo-se o valor total do orçamento pela área total de construção."]
[null,null,null,null,null,null,null,null,null,null,null,"F"]
[null,null,null,null,null,null,null,null,null,null,null,"F"]
[]
[null,null,null,null,null,null,null,null,null,null,null,null,null,null,"SOMATÓRIO DE SERVIÇOS"]
[null,null,null,null,null,null,null,null,null,null,null,null,null,null,"ITEM","DESCRIÇÃO DOS SERVIÇOS",null,null,"PREÇO SEM BDI",null,null,"PREÇO COM BDI",null,"PARTICIPAÇÃO ( % )"]
[null,null,null,null,null,null,null,null,null,null,null,null,null,null,"a.","SERVIÇOS PRELIMINARES",null,null,0,null,null,0,null,0]
[null,null,null,null,null,null,null,null,null,null,null,null,null,null,"b.","TRANSPORTES",null,null,0,null,null,0,null,0]
[null,null,null,null,null,null,null,null,null,null,null,null,null,null,"c.","SERVIÇO EM TERRA",null,null,0,null,null,0,null,0]
[null,null,null,null,null,null,null,null,null,null,null,null,null,null,"d.","FUNDAÇÕES E SONDAGENS",null,null,0,null,null,0,null,0]
[null,null,null,null,null,null,null,null,null,null,null,null,null,null,"e.","ESTRUTURA",null,null,0,null,null,0,null,0]
[null,null,null,null,null,null,null,null,null,null,null,null,null,null,"f.","INSTALAÇÕES ELÉTRICAS",null,null,0,null,null,0,null,0]
[null,null,null,null,null,null,null,null,null,null,null,null,null,null,"g.","INSTALAÇÕES HIDROSSANITÁRIAS",null,null,0,null,null,0,null,0]
[null,null,null,null,null,null,null,null,null,null,null,null,null,null,"h","INSTALAÇÕES ESPECIAIS",null,null,0,null,null,0,null,0]
[null,null,null,null,null,null,null,null,null,null,null,null,null,null,"i.","ALVENARIAS E DIVISÓRIAS",null,null,0,null,null,0,null,0]
[null,null,null,null,null,null,null,null,null,null,null,null,null,null,"j.","ALVENARIA AUTO-PORTANTE",null,null,0,null,null,0,null,0]
[null,null,null,null,null,null,null,null,null,null,null,null,null,null,"k.","IMPERMEABILIZAÇÃO",null,null,0,null,null,0,null,0]
[null,null,null,null,null,null,null,null,null,null,null,null,null,null,"l.","ISOLAMENTO TÉRMICO E ACÚSTICO",null,null,0,null,null,0,null,0]
[null,null,null,null,null,null,null,null,null,null,null,null,null,null,"m.","ESTRUTURA DE MADEIRA",null,null,0,null,null,0,null,0]
[null,null,null,null,null,null,null,null,null,null,null,null,null,null,"n.","ESTRUTURAS METÁLICAS",null,null,0,null,null,0,null,0]
[null,null,null,null,null,null,null,null,null,null,null,null,null,null,"o.","COBERTURAS",null,null,0,null,null,0,null,0]
[null,null,null,null,null,null,null,null,null,null,null,null,null,null,"p.","ESQUADRIAS DE MADEIRA",null,null,0,null,null,0,null,0]
[null,null,null,null,null,null,null,null,null,null,null,null,null,null,"q.","ESQUADRIAS METÁLICAS",null,null,0,null,null,0,null,0]
[null,null,null,null,null,null,null,null,null,null,null,null,null,null,"r.","VIDROS",null,null,0,null,null,0,null,0]
[null,null,null,null,null,null,null,null,null,null,null,null,null,null,"s.","REVESTIMENTO DE PAREDE",null,null,0,null,null,0,null,0]
[null,null,null,null,null,null,null,null,null,null,null,null,null,null,"t.","FORROS",null,null,0,null,null,0,null,0]
[null,null,null,null,null,null,null,null,null,null,null,null,null,null,"u.","REVESTIMENTO DE PISO",null,null,0,null,null,0,null,0]
[null,null,null,null,null,null,null,null,null,null,null,null,null,null,"v.","FERRAGENS",null,null,0,null,null,0,null,0]
[null,null,null,null,null,null,null,null,null,null,null,null,null,null,"w.","MARCENARIA",null,null,0,null,null,0,null,0]
[null,null,null,null,null,null,null,null,null,null,null,null,null,null,"x.","ADMINISTRAÇÃO",null,null,0,null,null,0,null,0]
[null,null,null,null,null,null,null,null,null,null,null,null,null,null,"y.","PINTURA",null,null,0,null,null,0,null,0]
[null,null,null,null,null,null,null,null,null,null,null,null,null,null,"z.","DIVERSOS",null,null,0,null,null,0,null,0]
[null,null,null,null,null,null,null,null,null,null,null,null,null,null,"TOTAL GERAL DO ORÇAMENTO (R$)",null,null,null,0,null,null,0,null,0]
[null,null,null,null,null,null,null,null,null,null,null,null,null,null,null,null,null,null,0,null,null,0,null,100]
[null,null,null,null,null,null,null,null,null,null,null,null,null,null,null,null,null,null,"(TOTAL SEM BDI)",null,null,"(TOTAL COM BDI)",null,"(ARRED porcentagem)"]
[null,null,null,null,null,null,null,null,null,null,null,null,null,null,null,null,null,null,"ERRO",null,null,"ERRO",null,"ERRO"]
[]
[]
[null,null,null,null,null,null,null,null,null,null,null,null,null,null,"RESUMO GERAL DO ORÇAMENTO"]
[null,null,null,null,null,null,null,null,null,null,null,null,null,null,"ITEM","DESCRIÇÃO DOS SERVIÇOS",null,null,"PREÇO SEM BDI",null,null,"PREÇO COM BDI",null,"PARTICIPAÇÃO ( % )"]
[null,null,null,null,null,null,null,null,null,null,null,null,null,null,"1.","REFORMA E AMPLIAÇÃO",null,null,0,null,null,0,null,100]
[null,null,null,null,null,null,null,null,null,null,null,null,null,null,"2.","",null,null,0,null,null,0,null,0]
[null,null,null,null,null,null,null,null,null,null,null,null,null,null,"3.","",null,null,0,null,null,0,null,0]
[null,null,null,null,null,null,null,null,null,null,null,null,null,null,"4.","",null,null,0,null,null,0,null,0]
[null,null,null,null,null,null,null,null,null,null,null,null,null,null,"5.","",null,null,0,null,null,0,null,0]
[null,null,null,null,null,null,null,null,null,null,null,null,null,null,"6.","",null,null,0,null,null,0,null,0]
[null,null,null,null,null,null,null,null,null,null,null,null,null,null,"7.","",null,null,0,null,null,0,null,0]
[null,null,null,null,null,null,null,null,null,null,null,null,null,null,"8.","",null,null,0,null,null,0,null,0]
[null,null,null,null,null,null,null,null,null,null,null,null,null,null,"9.","",null,null,0,null,null,0,null,0]
[null,null,null,null,null,null,null,null,null,null,null,null,null,null,"10.","",null,null,0,null,null,0,null,0]
[null,null,null,null,null,null,null,null,null,null,null,null,null,null,"11.","",null,null,0,null,null,0,null,0]
[null,null,null,null,null,null,null,null,null,null,null,null,null,null,"12.","",null,null,0,null,null,0,null,0]
[null,null,null,null,null,null,null,null,null,null,null,null,null,null,"13.","",null,null,0,null,null,0,null,0]
[null,null,null,null,null,null,null,null,null,null,null,null,null,null,"14.","",null,null,0,null,null,0,null,0]
[null,null,null,null,null,null,null,null,null,null,null,null,null,null,"15.","",null,null,0,null,null,0,null,0]
[null,null,null,null,null,null,null,null,null,null,null,null,null,null,"16.","",null,null,0,null,null,0,null,0]
[null,null,null,null,null,null,null,null,null,null,null,null,null,null,"17.","",null,null,0,null,null,0,null,0]
[null,null,null,null,null,null,null,null,null,null,null,null,null,null,"18.","",null,null,0,null,null,0,null,0]
[null,null,null,null,null,null,null,null,null,null,null,null,null,null,"19.","",null,null,0,null,null,0,null,0]
[null,null,null,null,null,null,null,null,null,null,null,null,null,null,"20.","",null,null,0,null,null,0,null,0]
[null,null,null,null,null,null,null,null,null,null,null,null,null,null,"TOTAL GERAL DO ORÇAMENTO (R$)",null,null,null,0,null,null,0,null,100]
[null,null,null,null,null,null,null,null,null,null,null,null,null,null,null,null,null,null,0,null,null,0,null,100]
[null,null,null,null,null,null,null,null,null,null,null,null,null,null,null,null,null,null,"(TOTAL SEM BDI)",null,null,"(TOTAL COM BDI)",null,"(ARRED porcentagem)"]
[null,null,null,null,null,null,null,null,null,null,null,null,null,null,null,null,null,null,"ERRO",null,null,"ERRO",null,"ERRO"]

{"sheet":"Resumo ","index":1,"n_rows":39,"n_cols":22,"rows_kept":39,"cut":false,"hidden":false,"merged":[[42,3,42,7],[11,1,11,2],[12,1,12,2],[15,2,15,3],[16,2,16,3],[14,1,14,8],[17,2,17,3],[23,2,23,3],[18,2,18,3],[19,2,19,3],[20,2,20,3],[41,3,41,7],[24,2,24,3],[26,2,26,3],[27,2,27,3],[38,1,38,8],[1,1,1,8],[2,6,2,8],[3,6,3,8],[4,1,4,8],[5,6,5,8],[6,6,6,8],[7,1,7,8],[8,6,8,8],[9,6,9,8],[13,1,13,8],[0,1,0,8],[36,1,36,5],[2,1,2,5],[3,1,3,5],[5,1,5,5],[6,1,6,5],[8,1,8,5],[9,1,9,5],[11,3,11,5],[12,3,12,5],[10,1,10,8],[11,6,11,8],[12,6,12,8],[25,2,25,3],[21,2,21,3],[22,2,22,3],[13,0,14,0],[34,2,34,3],[35,2,35,3],[31,2,31,3],[32,2,32,3],[33,2,33,3],[28,2,28,3],[29,2,29,3],[30,2,30,3]]}
[]
[]
[null,"UNIDADE ESCOLAR",null,null,null,null,"CÓDIGO INEP"]
[null,{"$f":"Orçamento!$O$4","v":"COLÉGIO ESTADUAL FREDERICO JAYME"},null,null,null,null,{"$f":"Orçamento!V4","v":52054365}]
[]
[null,"OBRA",null,null,null,null,"CIDADE"]
[null,{"$f":"Orçamento!$O$7","v":"REFORMA E AMPLIAÇÃO"},null,null,null,null,{"$f":"Orçamento!$V$7","v":"RIO VERDE"}]
[]
[null,"ENDEREÇO",null,null,null,null,"CRE"]
[null,{"$f":"Orçamento!$R$10","v":"RUA TERCIO CAMPOS LEAO SN, SANTO ANTONIO, CEP:75906-420"},null,null,null,null,{"$f":"Orçamento!$O$10","v":"RIO VERDE"}]
[]
[null,"REFERÊNCIA",null,"DATA",null,null,"ÁREA TOTAL CONSTRUÍDA (M²)"]
[null,{"$f":"CONCATENATE(\"AGETOP E SINAPI - \",Orçamento!$T$10)","v":"AGETOP E SINAPI - DESONERADA"},null,{"$f":"Orçamento!$S$7","v":"2020-04-16"},null,null,{"$f":"Orçamento!$V$13","v":1425.05},null,null,null,null,null,null,null,null,null,null,25.2,null,null,null,1425.05]
["FILTRO"]
[null,"RESUMO GERAL DO ORÇAMENTO"]
["↓","ITEM","DESCRIÇÃO DOS SERVIÇOS",null,"UNID","QUANT","PREÇO SEM BDI","PREÇO COM BDI","PARTICIP. (%)"]
[{"$f":"IF(H17>0,\"F\",\"\")","v":""},"1.",{"$f":"Orçamento!$P501","v":"REFORMA E AMPLIAÇÃO"},null,{"$f":"IF(C17<>\"\",\"UN\",\"\")","v":"UN"},{"$f":"IF(C17<>\"\",1,\"\")","v":1},{"$f":"IFERROR(Orçamento!S501,\"-\")","v":0},{"$f":"IFERROR(Orçamento!V501,\"\")","v":0},{"$f":"Orçamento!X501","v":100}]
[{"$f":"IF(H18>0,\"F\",\"\")","v":""},"2.",{"$f":"Orçamento!$P502","v":""},null,{"$f":"IF(C18<>\"\",\"UN\",\"\")","v":""},{"$f":"IF(C18<>\"\",1,\"\")","v":""},{"$f":"IFERROR(Orçamento!S502,\"-\")","v":0},{"$f":"IFERROR(Orçamento!V502,\"\")","v":0},{"$f":"Orçamento!X502","v":0}]
[{"$f":"IF(H19>0,\"F\",\"\")","v":""},"3.",{"$f":"Orçamento!$P503","v":""},null,"","",{"$f":"IFERROR(Orçamento!S503,\"-\")","v":0},{"$f":"IFERROR(Orçamento!V503,\"\")","v":0},{"$f":"Orçamento!X503","v":0}]
["","4.",{"$f":"Orçamento!$P504","v":""},null,"","",{"$f":"IFERROR(Orçamento!S504,\"-\")","v":0},{"$f":"IFERROR(Orçamento!V504,\"\")","v":0},{"$f":"Orçamento!X504","v":0}]
["","5.",{"$f":"Orçamento!$P505","v":""},null,"","",{"$f":"IFERROR(Orçamento!S505,\"-\")","v":0},{"$f":"IFERROR(Orçamento!V505,\"\")","v":0},{"$f":"Orçamento!X505","v":0}]
["","6.",{"$f":"Orçamento!$P506","v":""},null,"","",{"$f":"IFERROR(Orçamento!S506,\"-\")","v":0},{"$f":"IFERROR(Orçamento!V506,\"\")","v":0},{"$f":"Orçamento!X506","v":0}]
["","7.",{"$f":"Orçamento!$P507","v":""},null,"","",{"$f":"IFERROR(Orçamento!S507,\"-\")","v":0},{"$f":"IFERROR(Orçamento!V507,\"\")","v":0},{"$f":"Orçamento!X507","v":0}]
["","8.",{"$f":"Orçamento!$P508","v":""},null,"","",{"$f":"IFERROR(Orçamento!S508,\"-\")","v":0},{"$f":"IFERROR(Orçamento!V508,\"\")","v":0},{"$f":"Orçamento!X508","v":0}]
["","9.",{"$f":"Orçamento!$P509","v":""},null,"","",{"$f":"IFERROR(Orçamento!S509,\"-\")","v":0},{"$f":"IFERROR(Orçamento!V509,\"\")","v":0},{"$f":"Orçamento!X509","v":0}]
["","10.",{"$f":"Orçamento!$P510","v":""},null,"","",{"$f":"IFERROR(Orçamento!S510,\"-\")","v":0},{"$f":"IFERROR(Orçamento!V510,\"\")","v":0},{"$f":"Orçamento!X510","v":0}]
["","11.",{"$f":"Orçamento!$P511","v":""},null,"","",{"$f":"IFERROR(Orçamento!S511,\"-\")","v":0},{"$f":"IFERROR(Orçamento!V511,\"\")","v":0},{"$f":"Orçamento!X511","v":0}]
["","12.",{"$f":"Orçamento!$P512","v":""},null,"","",{"$f":"IFERROR(Orçamento!S512,\"-\")","v":0},{"$f":"IFERROR(Orçamento!V512,\"\")","v":0},{"$f":"Orçamento!X512","v":0}]
["","13.",{"$f":"Orçamento!$P513","v":""},null,"","",{"$f":"IFERROR(Orçamento!S513,\"-\")","v":0},{"$f":"IFERROR(Orçamento!V513,\"\")","v":0},{"$f":"Orçamento!X513","v":0}]
["","14.",{"$f":"Orçamento!$P514","v":""},null,"","",{"$f":"IFERROR(Orçamento!S514,\"-\")","v":0},{"$f":"IFERROR(Orçamento!V514,\"\")","v":0},{"$f":"Orçamento!X514","v":0}]
["","15.",{"$f":"Orçamento!$P515","v":""},null,"","",{"$f":"IFERROR(Orçamento!S515,\"-\")","v":0},{"$f":"IFERROR(Orçamento!V515,\"\")","v":0},{"$f":"Orçamento!X515","v":0}]
["","16.",{"$f":"Orçamento!$P516","v":""},null,"","",{"$f":"IFERROR(Orçamento!S516,\"-\")","v":0},{"$f":"IFERROR(Orçamento!V516,\"\")","v":0},{"$f":"Orçamento!X516","v":0}]
["","17.",{"$f":"Orçamento!$P517","v":""},null,"","",{"$f":"IFERROR(Orçamento!S517,\"-\")","v":0},{"$f":"IFERROR(Orçamento!V517,\"\")","v":0},{"$f":"Orçamento!X517","v":0}]
["","18.",{"$f":"Orçamento!$P518","v":""},null,"","",{"$f":"IFERROR(Orçamento!S518,\"-\")","v":0},{"$f":"IFERROR(Orçamento!V518,\"\")","v":0},{"$f":"Orçamento!X518","v":0}]
["","19.",{"$f":"Orçamento!$P519","v":""},null,"","",{"$f":"IFERROR(Orçamento!S519,\"-\")","v":0},{"$f":"IFERROR(Orçamento!V519,\"\")","v":0},{"$f":"Orçamento!X519","v":0}]
["","20.",{"$f":"Orçamento!$P520","v":""},null,"","",{"$f":"IFERROR(Orçamento!S520,\"-\")","v":0},{"$f":"IFERROR(Orçamento!V520,\"\")","v":0},{"$f":"Orçamento!X520","v":0}]
["F","TOTAL GERAL DO ORÇAMENTO (R$)",null,null,null,null,{"$f":"SUM(G17:G36)","v":0},{"$f":"SUM(H17:H36)","v":0},{"$f":"SUM(I17:I36)","v":100}]
["F"]
["F"]

{"sheet":"Somatório","index":2,"n_rows":45,"n_cols":22,"rows_kept":45,"cut":false,"hidden":false,"merged":[[0,1,0,5],[14,1,14,5],[2,1,2,3],[2,4,2,5],[3,1,3,3],[3,4,3,5],[5,1,5,3],[5,4,5,5],[6,1,6,3],[6,4,6,5],[8,1,8,3],[8,4,8,5],[1,1,1,5],[4,1,4,5],[7,1,7,5],[10,1,10,5],[9,1,9,3],[9,4,9,5],[11,1,11,2],[11,4,11,5],[12,1,12,2],[12,4,12,5],[13,0,14,0],[42,1,42,2],[44,1,44,5],[47,3,47,5],[48,3,48,5],[13,1,13,5]]}
[]
[]
[null,"UNIDADE ESCOLAR",null,null,"CÓDIGO INEP"]
[null,{"$f":"Orçamento!$O$4","v":"COLÉGIO ESTADUAL FREDERICO JAYME"},null,null,{"$f":"Orçamento!V4","v":52054365}]
[]
[null,"OBRA",null,null,"CIDADE"]
[null,{"$f":"Orçamento!$O$7","v":"REFORMA E AMPLIAÇÃO"},null,null,{"$f":"Orçamento!$V$7","v":"RIO VERDE"}]
[]
[null,"ENDEREÇO",null,null,"CRE"]
[null,{"$f":"Orçamento!$R$10","v":"RUA TERCIO CAMPOS LEAO SN, SANTO ANTONIO, CEP:75906-420"},null,null,{"$f":"Orçamento!$O$10","v":"RIO VERDE"}]
[]
[null,"REFERÊNCIA",null,"DATA","ÁREA TOTAL CONSTRUÍDA (M²)"]
[null,{"$f":"CONCATENATE(\"AGETOP E SINAPI - \",Orçamento!$T$10)","v":"AGETOP E SINAPI - DESONERADA"},null,{"$f":"Orçamento!$S$7","v":"2020-04-16"},{"$f":"Orçamento!$V$13","v":1425.05},null,null,null,null,null,null,null,null,null,null,null,null,25.2,null,null,null,1425.05]
["FILTRO"]
[null,"SOMATÓRIO DE SERVIÇOS"]
["↓","ITEM","DESCRIÇÃO DOS SERVIÇOS","PREÇO SEM BDI (R$)","PREÇO COM BDI (R$)","PARTIC.  ( % )"]
[{"$f":"IF(D17>0,\"F\",\"\")","v":""},"a.",{"$f":"Orçamento!P467","v":"SERVIÇOS PRELIMINARES"},{"$f":"Orçamento!S467","v":0},{"$f":"Orçamento!V467","v":0},{"$f":"Orçamento!X467","v":0}]
[{"$f":"IF(D18>0,\"F\",\"\")","v":""},"b.",{"$f":"Orçamento!P468","v":"TRANSPORTES"},{"$f":"Orçamento!S468","v":0},{"$f":"Orçamento!V468","v":0},{"$f":"Orçamento!X468","v":0}]
["","c.",{"$f":"Orçamento!P469","v":"SERVIÇO EM TERRA"},{"$f":"Orçamento!S469","v":0},{"$f":"Orçamento!V469","v":0},{"$f":"Orçamento!X469","v":0}]
["","d.",{"$f":"Orçamento!P470","v":"FUNDAÇÕES E SONDAGENS"},{"$f":"Orçamento!S470","v":0},{"$f":"Orçamento!V470","v":0},{"$f":"Orçamento!X470","v":0}]
["","e.",{"$f":"Orçamento!P471","v":"ESTRUTURA"},{"$f":"Orçamento!S471","v":0},{"$f":"Orçamento!V471","v":0},{"$f":"Orçamento!X471","v":0}]
["","f.",{"$f":"Orçamento!P472","v":"INSTALAÇÕES ELÉTRICAS"},{"$f":"Orçamento!S472","v":0},{"$f":"Orçamento!V472","v":0},{"$f":"Orçamento!X472","v":0}]
["","g.",{"$f":"Orçamento!P473","v":"INSTALAÇÕES HIDROSSANITÁRIAS"},{"$f":"Orçamento!S473","v":0},{"$f":"Orçamento!V473","v":0},{"$f":"Orçamento!X473","v":0}]
["","h.",{"$f":"Orçamento!P474","v":"INSTALAÇÕES ESPECIAIS"},{"$f":"Orçamento!S474","v":0},{"$f":"Orçamento!V474","v":0},{"$f":"Orçamento!X474","v":0}]
["","i.",{"$f":"Orçamento!P475","v":"ALVENARIAS E DIVISÓRIAS"},{"$f":"Orçamento!S475","v":0},{"$f":"Orçamento!V475","v":0},{"$f":"Orçamento!X475","v":0}]
["","j.",{"$f":"Orçamento!P476","v":"ALVENARIA AUTO-PORTANTE"},{"$f":"Orçamento!S476","v":0},{"$f":"Orçamento!V476","v":0},{"$f":"Orçamento!X476","v":0}]
["","k.",{"$f":"Orçamento!P477","v":"IMPERMEABILIZAÇÃO"},{"$f":"Orçamento!S477","v":0},{"$f":"Orçamento!V477","v":0},{"$f":"Orçamento!X477","v":0}]
["","l.",{"$f":"Orçamento!P478","v":"ISOLAMENTO TÉRMICO E ACÚSTICO"},{"$f":"Orçamento!S478","v":0},{"$f":"Orçamento!V478","v":0},{"$f":"Orçamento!X478","v":0}]
["","m.",{"$f":"Orçamento!P479","v":"ESTRUTURA DE MADEIRA"},{"$f":"Orçamento!S479","v":0},{"$f":"Orçamento!V479","v":0},{"$f":"Orçamento!X479","v":0}]
["","n.",{"$f":"Orçamento!P480","v":"ESTRUTURAS METÁLICAS"},{"$f":"Orçamento!S480","v":0},{"$f":"Orçamento!V480","v":0},{"$f":"Orçamento!X480","v":0}]
["","o.",{"$f":"Orçamento!P481","v":"COBERTURAS"},{"$f":"Orçamento!S481","v":0},{"$f":"Orçamento!V481","v":0},{"$f":"Orçamento!X481","v":0}]
["","p.",{"$f":"Orçamento!P482","v":"ESQUADRIAS DE MADEIRA"},{"$f":"Orçamento!S482","v":0},{"$f":"Orçamento!V482","v":0},{"$f":"Orçamento!X482","v":0}]
["","q.",{"$f":"Orçamento!P483","v":"ESQUADRIAS METÁLICAS"},{"$f":"Orçamento!S483","v":0},{"$f":"Orçamento!V483","v":0},{"$f":"Orçamento!X483","v":0}]
["","r.",{"$f":"Orçamento!P484","v":"VIDROS"},{"$f":"Orçamento!S484","v":0},{"$f":"Orçamento!V484","v":0},{"$f":"Orçamento!X484","v":0}]
["","s.",{"$f":"Orçamento!P485","v":"REVESTIMENTO DE PAREDE"},{"$f":"Orçamento!S485","v":0},{"$f":"Orçamento!V485","v":0},{"$f":"Orçamento!X485","v":0}]
["","t.",{"$f":"Orçamento!P486","v":"FORROS"},{"$f":"Orçamento!S486","v":0},{"$f":"Orçamento!V486","v":0},{"$f":"Orçamento!X486","v":0}]
["","u.",{"$f":"Orçamento!P487","v":"REVESTIMENTO DE PISO"},{"$f":"Orçamento!S487","v":0},{"$f":"Orçamento!V487","v":0},{"$f":"Orçamento!X487","v":0}]
["","v.",{"$f":"Orçamento!P488","v":"FERRAGENS"},{"$f":"Orçamento!S488","v":0},{"$f":"Orçamento!V488","v":0},{"$f":"Orçamento!X488","v":0}]
["","w.",{"$f":"Orçamento!P489","v":"MARCENARIA"},{"$f":"Orçamento!S489","v":0},{"$f":"Orçamento!V489","v":0},{"$f":"Orçamento!X489","v":0}]
["","x.",{"$f":"Orçamento!P490","v":"ADMINISTRAÇÃO"},{"$f":"Orçamento!S490","v":0},{"$f":"Orçamento!V490","v":0},{"$f":"Orçamento!X490","v":0}]
["","y.",{"$f":"Orçamento!P491","v":"PINTURA"},{"$f":"Orçamento!S491","v":0},{"$f":"Orçamento!V491","v":0},{"$f":"Orçamento!X491","v":0}]
["","z.",{"$f":"Orçamento!P492","v":"DIVERSOS"},{"$f":"Orçamento!S492","v":0},{"$f":"Orçamento!V492","v":0},{"$f":"Orçamento!X492","v":0}]
["F","TOTAL GERAL DO ORÇAMENTO",null,{"$f":"SUM(D17:D42)","v":0},{"$f":"SUM(E17:E42)","v":0},{"$f":"SUM(F17:F42)","v":0}]
[]
[null,"(*) Para itens da AGETOP, os vidros não estão inclusos nas esquadrias e já foram considerados os custos de contramarco para as esquadrias de alumínio;"]

{"sheet":"Cronog_60_Dias","index":3,"n_rows":99,"n_cols":22,"rows_kept":99,"cut":false,"hidden":false,"merged":[[10,1,10,13],[9,8,9,13],[8,8,8,13],[3,8,3,13],[6,8,6,13],[5,8,5,13],[3,1,3,7],[56,4,58,4],[29,3,31,3],[35,1,37,2],[35,4,37,4],[50,3,52,3],[53,3,55,3],[12,13,13,13],[13,1,13,2],[13,5,13,8],[13,9,13,12],[12,3,13,3],[12,9,12,12],[14,1,16,2],[12,5,12,8],[17,1,19,2],[17,4,19,4],[17,5,17,8],[56,1,58,2],[68,4,70,4],[44,3,46,3],[62,1,64,2],[62,4,64,4],[38,1,40,2],[38,4,40,4],[59,3,61,3],[44,1,46,2],[44,4,46,4],[53,1,55,2],[50,1,52,2],[50,4,52,4],[20,1,22,2],[20,4,22,4],[20,5,20,8],[20,9,20,12],[22,5,22,8],[22,9,22,12],[20,3,22,3],[83,3,85,3],[53,4,55,4],[59,1,61,2],[59,4,61,4],[74,1,76,2],[77,1,79,2],[77,4,79,4],[80,1,82,2],[65,1,67,2],[68,3,70,3],[62,3,64,3],[68,1,70,2],[56,3,58,3],[65,4,67,4],[71,3,73,3],[74,3,76,3],[74,4,76,4],[14,3,16,3],[17,3,19,3],[14,4,16,4],[14,5,14,8],[14,9,14,12],[16,5,16,8],[16,9,16,12],[23,9,23,12],[25,5,25,8],[25,9,25,12],[17,9,17,12],[19,5,19,8],[19,9,19,12],[26,1,28,2],[26,4,28,4],[26,5,26,8],[26,9,26,12],[28,5,28,8],[28,9,28,12],[23,3,25,3],[23,1,25,2],[23,4,25,4],[23,5,23,8],[26,3,28,3],[29,9,29,12],[31,5,31,8],[31,9,31,12],[32,1,34,2],[32,4,34,4],[32,5,32,8],[32,9,32,12],[34,5,34,8],[34,9,34,12],[32,3,34,3],[29,5,29,8],[29,1,31,2],[29,4,31,4],[35,9,35,12],[37,5,37,8],[37,9,37,12],[35,3,37,3],[40,9,40,12],[38,3,40,3],[38,9,38,12],[41,1,43,2],[41,4,43,4],[41,5,41,8],[41,9,41,12],[43,5,43,8],[43,9,43,12],[41,3,43,3],[35,5,35,8],[38,5,38,8],[40,5,40,8],[44,9,44,12],[46,5,46,8],[46,9,46,12],[47,1,49,2],[47,4,49,4],[47,5,47,8],[47,9,47,12],[49,5,49,8],[49,9,49,12],[44,5,44,8],[47,3,49,3],[53,9,53,12],[55,5,55,8],[55,9,55,12],[50,5,50,8],[50,9,50,12],[52,5,52,8],[52,9,52,12],[56,9,56,12],[58,5,58,8],[58,9,58,12],[53,5,53,8],[56,5,56,8],[68,5,68,8],[65,5,65,8],[65,9,65,12],[67,5,67,8],[67,9,67,12],[65,3,67,3],[62,9,62,12],[64,5,64,8],[64,9,64,12],[62,5,62,8],[95,1,95,2],[95,5,95,8],[95,9,95,12],[97,1,97,4],[98,1,98,13],[86,9,86,12],[88,5,88,8],[88,9,88,12],[85,5,85,8],[85,9,85,12],[89,1,91,2],[89,4,91,4],[89,5,89,8],[89,9,89,12],[91,5,91,8],[91,9,91,12],[89,3,91,3],[86,4,88,4],[86,5,86,8],[86,3,88,3],[83,1,85,2],[83,4,85,4],[83,5,83,8],[83,9,83,12],[94,1,94,2],[94,5,94,8],[94,9,94,12],[76,5,76,8],[76,9,76,12],[77,5,77,8],[77,9,77,12],[79,5,79,8],[79,9,79,12],[80,5,80,8],[80,9,80,12],[82,5,82,8],[82,9,82,12],[77,3,79,3],[80,3,82,3],[86,1,88,2],[80,4,82,4],[12,0,13,0],[9,0,11,0],[11,1,11,13],[92,1,92,2],[92,5,92,8],[92,9,92,12],[93,1,93,2],[93,5,93,8],[93,9,93,12],[74,9,74,12],[74,5,74,8],[68,9,68,12],[70,5,70,8],[70,9,70,12],[59,5,59,8],[71,1,73,2],[71,4,73,4],[71,5,71,8],[71,9,71,12],[73,5,73,8],[73,9,73,12],[59,9,59,12],[61,5,61,8],[61,9,61,12],[2,1,2,7],[5,1,5,7],[6,1,6,7],[8,1,8,7],[9,1,9,7],[4,1,4,13],[7,1,7,13],[0,1,0,13],[1,1,1,13],[2,8,2,13]]}
[]
[]
[null,"UNIDADE ESCOLAR",null,null,null,null,null,null,"PRAZO"]
[null,{"$f":"Orçamento!$O$4","v":"COLÉGIO ESTADUAL FREDERICO JAYME"},null,null,null,null,null,null,"60 DIAS CORRIDOS"]
[]
[null,"OBRA",null,null,null,null,null,null,"DATA"]
[null,{"$f":"Orçamento!$O$7","v":"REFORMA E AMPLIAÇÃO"},null,null,null,null,null,null,{"$f":"Orçamento!$S$7","v":"2020-04-16"}]
[]
[null,"LOCAL",null,null,null,null,null,null,"ÁREA TOTAL CONSTRUÍDA (M²)"]
["FILTRO",{"$f":"Orçamento!$V$7","v":"RIO VERDE"},null,null,null,null,null,null,{"$f":"Orçamento!$V$13","v":1425.05}]
[]
[null,"CRONOGRAMA - FÍSICO FINANCEIRO"]
["↓","CUSTO TOTAL:",{"$f":"D93","v":0},"VALOR","Dias:",30,null,null,null,60,null,null,null,"TOTAL",null,null,null,25.2,null,null,null,1425.05]
[null,"DESCRIÇÃO DOS SERVIÇOS",null,null,"%","1ª PARCELA",null,null,null,"2ª PARCELA"]
[{"$f":"IF(D15>0,\"F\",\"\")","v":""},"SERVIÇOS PRELIMINARES",null,{"$f":"Orçamento!V467","v":0},{"$f":"Orçamento!X467","v":0},{"$f":"ROUND(F17*$D$15,2)","v":0},null,null,null,{"$f":"ROUND(J17*$D$15,2)","v":0},null,null,null,{"$f":"SUM(F15:M15)","v":0},null,{"$f":"IF(D15=N15,\"OK\",\"ERRO\")","v":"OK"}]
[{"$f":"IF(A15=\"F\",A15,\"\")","v":""}]
[{"$f":"IF(A16=\"F\",A16,\"\")","v":""},null,null,null,null,1,null,null,null,{"$f":"1-F17","v":0},null,null,null,{"$f":"IFERROR(E15/100,\"\")","v":0},null,{"$f":"IF(E15=N17*100,\"OK\",\"ERRO\")","v":"OK"}]
[{"$f":"IF(D18>0,\"F\",\"\")","v":""},"TRANSPORTES",null,{"$f":"Orçamento!V468","v":0},{"$f":"Orçamento!X468","v":0},{"$f":"ROUND(F20*$D$18,2)","v":0},null,null,null,{"$f":"ROUND(J20*$D$18,2)","v":0},null,null,null,{"$f":"SUM(F18:M18)","v":0},null,{"$f":"IF(D18=N18,\"OK\",\"ERRO\")","v":"OK"}]
[{"$f":"IF(A18=\"F\",A18,\"\")","v":""}]
[{"$f":"IF(A19=\"F\",A19,\"\")","v":""},null,null,null,null,0.48,null,null,null,{"$f":"1-F20","v":0.52},null,null,null,{"$f":"IFERROR(E18/100,\"\")","v":0},null,{"$f":"IF(E18=N20*100,\"OK\",\"ERRO\")","v":"OK"}]
[{"$f":"IF(D21>0,\"F\",\"\")","v":""},"SERVIÇO EM TERRA",null,{"$f":"Orçamento!V469","v":0},{"$f":"Orçamento!X469","v":0},{"$f":"ROUND(F23*$D$21,2)","v":0},null,null,null,{"$f":"ROUND(J23*$D$21,2)","v":0},null,null,null,{"$f":"SUM(F21:M21)","v":0},null,{"$f":"IF(D21=N21,\"OK\",\"ERRO\")","v":"OK"}]
[{"$f":"IF(A21=\"F\",A21,\"\")","v":""}]
[{"$f":"IF(A22=\"F\",A22,\"\")","v":""},null,null,null,null,1,null,null,null,{"$f":"1-F23","v":0},null,null,null,{"$f":"IFERROR(E21/100,\"\")","v":0},null,{"$f":"IF(E21=N23*100,\"OK\",\"ERRO\")","v":"OK"}]
[{"$f":"IF(D24>0,\"F\",\"\")","v":""},"FUNDAÇÕES E SONDAGENS",null,{"$f":"Orçamento!V470","v":0},{"$f":"Orçamento!X470","v":0},{"$f":"ROUND(F26*$D$24,2)","v":0},null,null,null,{"$f":"ROUND(J26*$D$24,2)","v":0},null,null,null,{"$f":"SUM(F24:M24)","v":0},null,{"$f":"IF(D24=N24,\"OK\",\"ERRO\")","v":"OK"}]
[{"$f":"IF(A24=\"F\",A24,\"\")","v":""}]
[{"$f":"IF(A25=\"F\",A25,\"\")","v":""},null,null,null,null,1,null,null,null,{"$f":"1-F26","v":0},null,null,null,{"$f":"IFERROR(E24/100,\"\")","v":0},null,{"$f":"IF(E24=N26*100,\"OK\",\"ERRO\")","v":"OK"}]
[{"$f":"IF(D27>0,\"F\",\"\")","v":""},"ESTRUTURA",null,{"$f":"Orçamento!V471","v":0},{"$f":"Orçamento!X471","v":0},{"$f":"ROUND(F29*$D$27,2)","v":0},null,null,null,{"$f":"ROUND(J29*$D$27,2)","v":0},null,null,null,{"$f":"SUM(F27:M27)","v":0},null,{"$f":"IF(D27=N27,\"OK\",\"ERRO\")","v":"OK"}]
[{"$f":"IF(A27=\"F\",A27,\"\")","v":""}]
[{"$f":"IF(A28=\"F\",A28,\"\")","v":""},null,null,null,null,0.49,null,null,null,{"$f":"1-F29","v":0.51},null,null,null,{"$f":"IFERROR(E27/100,\"\")","v":0},null,{"$f":"IF(E27=N29*100,\"OK\",\"ERRO\")","v":"OK"}]
[{"$f":"IF(D30>0,\"F\",\"\")","v":""},"INST.ELET/TELEFÔNICA/CABEAMENTO ESTRUTURADO",null,{"$f":"Orçamento!V472","v":0},{"$f":"Orçamento!X472","v":0},{"$f":"ROUND(F32*$D$30,2)","v":0},null,null,null,{"$f":"ROUND(J32*$D$30,2)","v":0},null,null,null,{"$f":"SUM(F30:M30)","v":0},null,{"$f":"IF(D30=N30,\"OK\",\"ERRO\")","v":"OK"}]
[{"$f":"IF(A30=\"F\",A30,\"\")","v":""}]
[{"$f":"IF(A31=\"F\",A31,\"\")","v":""},null,null,null,null,0.4,null,null,null,{"$f":"1-F32","v":0.6},null,null,null,{"$f":"IFERROR(E30/100,\"\")","v":0},null,{"$f":"IF(E30=N32*100,\"OK\",\"ERRO\")","v":"OK"}]
[{"$f":"IF(D33>0,\"F\",\"\")","v":""},"INSTALAÇÕES HIDROSSANITÁRIAS",null,{"$f":"Orçamento!V473","v":0},{"$f":"Orçamento!X473","v":0},{"$f":"ROUND(F35*$D$33,2)","v":0},null,null,null,{"$f":"ROUND(J35*$D$33,2)","v":0},null,null,null,{"$f":"SUM(F33:M33)","v":0},null,{"$f":"IF(D33=N33,\"OK\",\"ERRO\")","v":"OK"}]
[{"$f":"IF(A33=\"F\",A33,\"\")","v":""}]
[{"$f":"IF(A34=\"F\",A34,\"\")","v":""},null,null,null,null,0.48,null,null,null,{"$f":"1-F35","v":0.52},null,null,null,{"$f":"IFERROR(E33/100,\"\")","v":0},null,{"$f":"IF(E33=N35*100,\"OK\",\"ERRO\")","v":"OK"}]
[{"$f":"IF(D36>0,\"F\",\"\")","v":""},"INSTALAÇÕES ESPECIAIS",null,{"$f":"Orçamento!V474","v":0},{"$f":"Orçamento!X474","v":0},{"$f":"ROUND(F38*$D$36,2)","v":0},null,null,null,{"$f":"ROUND(J38*$D$36,2)","v":0},null,null,null,{"$f":"SUM(F36:M36)","v":0},null,{"$f":"IF(D36=N36,\"OK\",\"ERRO\")","v":"OK"}]
[{"$f":"IF(A36=\"F\",A36,\"\")","v":""}]
[{"$f":"IF(A37=\"F\",A37,\"\")","v":""},null,null,null,null,1,null,null,null,{"$f":"1-F38","v":0},null,null,null,{"$f":"IFERROR(E36/100,\"\")","v":0},null,{"$f":"IF(E36=N38*100,\"OK\",\"ERRO\")","v":"OK"}]
[{"$f":"IF(D39>0,\"F\",\"\")","v":""},"ALVENARIA E DIVISÓRIAS",null,{"$f":"Orçamento!V475","v":0},{"$f":"Orçamento!X475","v":0},{"$f":"ROUND(F41*$D$39,2)","v":0},null,null,null,{"$f":"ROUND(J41*$D$39,2)","v":0},null,null,null,{"$f":"SUM(F39:M39)","v":0},null,{"$f":"IF(D39=N39,\"OK\",\"ERRO\")","v":"OK"}]
[{"$f":"IF(A39=\"F\",A39,\"\")","v":""}]
[{"$f":"IF(A40=\"F\",A40,\"\")","v":""},null,null,null,null,1,null,null,null,{"$f":"1-F41","v":0},null,null,null,{"$f":"IFERROR(E39/100,\"\")","v":0},null,{"$f":"IF(E39=N41*100,\"OK\",\"ERRO\")","v":"OK"}]
[{"$f":"IF(D42>0,\"F\",\"\")","v":""},"ALVENARIA AUTO-PORTANTE",null,{"$f":"Orçamento!V476","v":0},{"$f":"Orçamento!X476","v":0},{"$f":"ROUND(F44*$D$42,2)","v":0},null,null,null,{"$f":"ROUND(J44*$D$42,2)","v":0},null,null,null,{"$f":"SUM(F42:M42)","v":0},null,{"$f":"IF(D42=N42,\"OK\",\"ERRO\")","v":"OK"}]
[{"$f":"IF(A42=\"F\",A42,\"\")","v":""}]
[{"$f":"IF(A43=\"F\",A43,\"\")","v":""},null,null,null,null,1,null,null,null,{"$f":"1-F44","v":0},null,null,null,{"$f":"IFERROR(E42/100,\"\")","v":0},null,{"$f":"IF(E42=N44*100,\"OK\",\"ERRO\")","v":"OK"}]
[{"$f":"IF(D45>0,\"F\",\"\")","v":""},"IMPERMEABILIZAÇÃO",null,{"$f":"Orçamento!V477","v":0},{"$f":"Orçamento!X477","v":0},{"$f":"ROUND(F47*$D$45,2)","v":0},null,null,null,{"$f":"ROUND(J47*$D$45,2)","v":0},null,null,null,{"$f":"SUM(F45:M45)","v":0},null,{"$f":"IF(D45=N45,\"OK\",\"ERRO\")","v":"OK"}]
[{"$f":"IF(A45=\"F\",A45,\"\")","v":""}]
[{"$f":"IF(A46=\"F\",A46,\"\")","v":""},null,null,null,null,1,null,null,null,{"$f":"1-F47","v":0},null,null,null,{"$f":"IFERROR(E45/100,\"\")","v":0},null,{"$f":"IF(E45=N47*100,\"OK\",\"ERRO\")","v":"OK"}]
[{"$f":"IF(D48>0,\"F\",\"\")","v":""},"ISOLAMENTO TÉRMICO E ACÚSTICO",null,{"$f":"Orçamento!V478","v":0},{"$f":"Orçamento!X478","v":0},{"$f":"ROUND(F50*$D$48,2)","v":0},null,null,null,{"$f":"ROUND(J50*$D$48,2)","v":0},null,null,null,{"$f":"SUM(F48:M48)","v":0},null,{"$f":"IF(D48=N48,\"OK\",\"ERRO\")","v":"OK"}]
[{"$f":"IF(A48=\"F\",A48,\"\")","v":""}]
[{"$f":"IF(A49=\"F\",A49,\"\")","v":""},null,null,null,null,0.5,null,null,null,{"$f":"1-F50","v":0.5},null,null,null,{"$f":"IFERROR(E48/100,\"\")","v":0},null,{"$f":"IF(E48=N50*100,\"OK\",\"ERRO\")","v":"OK"}]
[{"$f":"IF(D51>0,\"F\",\"\")","v":""},"ESTRUTURA DE MADEIRA",null,{"$f":"Orçamento!V479","v":0},{"$f":"Orçamento!X479","v":0},{"$f":"ROUND(F53*$D$51,2)","v":0},null,null,null,{"$f":"ROUND(J53*$D$51,2)","v":0},null,null,null,{"$f":"SUM(F51:M51)","v":0},null,{"$f":"IF(D51=N51,\"OK\",\"ERRO\")","v":"OK"}]
[{"$f":"IF(A51=\"F\",A51,\"\")","v":""}]
[{"$f":"IF(A52=\"F\",A52,\"\")","v":""},null,null,null,null,0.4,null,null,null,{"$f":"1-F53","v":0.6},null,null,null,{"$f":"IFERROR(E51/100,\"\")","v":0},null,{"$f":"IF(E51=N53*100,\"OK\",\"ERRO\")","v":"OK"}]
[{"$f":"IF(D54>0,\"F\",\"\")","v":""},"ESTRUTURA METÁLICA",null,{"$f":"Orçamento!V480","v":0},{"$f":"Orçamento!X480","v":0},{"$f":"ROUND(F56*$D$54,2)","v":0},null,null,null,{"$f":"ROUND(J56*$D$54,2)","v":0},null,null,null,{"$f":"SUM(F54:M54)","v":0},null,{"$f":"IF(D54=N54,\"OK\",\"ERRO\")","v":"OK"}]
[{"$f":"IF(A54=\"F\",A54,\"\")","v":""}]
[{"$f":"IF(A55=\"F\",A55,\"\")","v":""},null,null,null,null,0.35,null,null,null,{"$f":"1-F56","v":0.65},null,null,null,{"$f":"IFERROR(E54/100,\"\")","v":0},null,{"$f":"IF(E54=N56*100,\"OK\",\"ERRO\")","v":"OK"}]
[{"$f":"IF(D57>0,\"F\",\"\")","v":""},"COBERTURAS",null,{"$f":"Orçamento!V481","v":0},{"$f":"Orçamento!X481","v":0},{"$f":"ROUND(F59*$D$57,2)","v":0},null,null,null,{"$f":"ROUND(J59*$D$57,2)","v":0},null,null,null,{"$f":"SUM(F57:M57)","v":0},null,{"$f":"IF(D57=N57,\"OK\",\"ERRO\")","v":"OK"}]
[{"$f":"IF(A57=\"F\",A57,\"\")","v":""}]
[{"$f":"IF(A58=\"F\",A58,\"\")","v":""},null,null,null,null,0,null,null,null,{"$f":"1-F59","v":1},null,null,null,{"$f":"IFERROR(E57/100,\"\")","v":0},null,{"$f":"IF(E57=N59*100,\"OK\",\"ERRO\")","v":"OK"}]
[{"$f":"IF(D60>0,\"F\",\"\")","v":""},"ESQUADRIAS DE MADEIRA",null,{"$f":"Orçamento!V482","v":0},{"$f":"Orçamento!X482","v":0},{"$f":"ROUND(F62*$D$60,2)","v":0},null,null,null,{"$f":"ROUND(J62*$D$60,2)","v":0},null,null,null,{"$f":"SUM(F60:M60)","v":0},null,{"$f":"IF(D60=N60,\"OK\",\"ERRO\")","v":"OK"}]
[{"$f":"IF(A60=\"F\",A60,\"\")","v":""}]
[{"$f":"IF(A61=\"F\",A61,\"\")","v":""},null,null,null,null,0.54,null,null,null,{"$f":"1-F62","v":0.45999999999999996},null,null,null,{"$f":"IFERROR(E60/100,\"\")","v":0},null,{"$f":"IF(E60=N62*100,\"OK\",\"ERRO\")","v":"OK"}]
[{"$f":"IF(D63>0,\"F\",\"\")","v":""},"ESQUADRIAS METÁLICAS",null,{"$f":"Orçamento!V483","v":0},{"$f":"Orçamento!X483","v":0},{"$f":"ROUND(F65*$D$63,2)","v":0},null,null,null,{"$f":"ROUND(J65*$D$63,2)","v":0},null,null,null,{"$f":"SUM(F63:M63)","v":0},null,{"$f":"IF(D63=N63,\"OK\",\"ERRO\")","v":"OK"}]
[{"$f":"IF(A63=\"F\",A63,\"\")","v":""}]
[{"$f":"IF(A64=\"F\",A64,\"\")","v":""},null,null,null,null,0.49,null,null,null,{"$f":"1-F65","v":0.51},null,null,null,{"$f":"IFERROR(E63/100,\"\")","v":0},null,{"$f":"IF(E63=N65*100,\"OK\",\"ERRO\")","v":"OK"}]
[{"$f":"IF(D66>0,\"F\",\"\")","v":""},"VIDROS",null,{"$f":"Orçamento!V484","v":0},{"$f":"Orçamento!X484","v":0},{"$f":"ROUND(F68*$D$66,2)","v":0},null,null,null,{"$f":"ROUND(J68*$D$66,2)","v":0},null,null,null,{"$f":"SUM(F66:M66)","v":0},null,{"$f":"IF(D66=N66,\"OK\",\"ERRO\")","v":"OK"}]
[{"$f":"IF(A66=\"F\",A66,\"\")","v":""}]
[{"$f":"IF(A67=\"F\",A67,\"\")","v":""},null,null,null,null,0,null,null,null,{"$f":"1-F68","v":1},null,null,null,{"$f":"IFERROR(E66/100,\"\")","v":0},null,{"$f":"IF(E66=N68*100,\"OK\",\"ERRO\")","v":"OK"}]
[{"$f":"IF(D69>0,\"F\",\"\")","v":""},"REVESTIMENTO DE PAREDE",null,{"$f":"Orçamento!V485","v":0},{"$f":"Orçamento!X485","v":0},{"$f":"ROUND(F71*$D$69,2)","v":0},null,null,null,{"$f":"ROUND(J71*$D$69,2)","v":0},null,null,null,{"$f":"SUM(F69:M69)","v":0},null,{"$f":"IF(D69=N69,\"OK\",\"ERRO\")","v":"OK"}]
[{"$f":"IF(A69=\"F\",A69,\"\")","v":""}]
[{"$f":"IF(A70=\"F\",A70,\"\")","v":""},null,null,null,null,0.32,null,null,null,{"$f":"1-F71","v":0.67999999999999994},null,null,null,{"$f":"IFERROR(E69/100,\"\")","v":0},null,{"$f":"IF(E69=N71*100,\"OK\",\"ERRO\")","v":"OK"}]
[{"$f":"IF(D72>0,\"F\",\"\")","v":""},"FORROS",null,{"$f":"Orçamento!V486","v":0},{"$f":"Orçamento!X486","v":0},{"$f":"ROUND(F74*$D$72,2)","v":0},null,null,null,{"$f":"ROUND(J74*$D$72,2)","v":0},null,null,null,{"$f":"SUM(F72:M72)","v":0},null,{"$f":"IF(D72=N72,\"OK\",\"ERRO\")","v":"OK"}]
[{"$f":"IF(A72=\"F\",A72,\"\")","v":""}]
[{"$f":"IF(A73=\"F\",A73,\"\")","v":""},null,null,null,null,0.24,null,null,null,{"$f":"1-F74","v":0.76},null,null,null,{"$f":"IFERROR(E72/100,\"\")","v":0},null,{"$f":"IF(E72=N74*100,\"OK\",\"ERRO\")","v":"OK"}]
[{"$f":"IF(D75>0,\"F\",\"\")","v":""},"REVESTIMENTO DE PISO",null,{"$f":"Orçamento!V487","v":0},{"$f":"Orçamento!X487","v":0},{"$f":"ROUND(F77*$D$75,2)","v":0},null,null,null,{"$f":"ROUND(J77*$D$75,2)","v":0},null,null,null,{"$f":"SUM(F75:M75)","v":0},null,{"$f":"IF(D75=N75,\"OK\",\"ERRO\")","v":"OK"}]
[{"$f":"IF(A75=\"F\",A75,\"\")","v":""}]
[{"$f":"IF(A76=\"F\",A76,\"\")","v":""},null,null,null,null,0.49,null,null,null,{"$f":"1-F77","v":0.51},null,null,null,{"$f":"IFERROR(E75/100,\"\")","v":0},null,{"$f":"IF(E75=N77*100,\"OK\",\"ERRO\")","v":"OK"}]
[{"$f":"IF(D78>0,\"F\",\"\")","v":""},"FERRAGENS",null,{"$f":"Orçamento!V488","v":0},{"$f":"Orçamento!X488","v":0},{"$f":"ROUND(F80*$D$78,2)","v":0},null,null,null,{"$f":"ROUND(J80*$D$78,2)","v":0},null,null,null,{"$f":"SUM(F78:M78)","v":0},null,{"$f":"IF(D78=N78,\"OK\",\"ERRO\")","v":"OK"}]
[{"$f":"IF(A78=\"F\",A78,\"\")","v":""}]
[{"$f":"IF(A79=\"F\",A79,\"\")","v":""},null,null,null,null,0,null,null,null,{"$f":"1-F80","v":1},null,null,null,{"$f":"IFERROR(E78/100,\"\")","v":0},null,{"$f":"IF(E78=N80*100,\"OK\",\"ERRO\")","v":"OK"}]
[{"$f":"IF(D81>0,\"F\",\"\")","v":""},"MARCENARIA",null,{"$f":"Orçamento!V489","v":0},{"$f":"Orçamento!X489","v":0},{"$f":"ROUND(F83*$D$81,2)","v":0},null,null,null,{"$f":"ROUND(J83*$D$81,2)","v":0},null,null,null,{"$f":"SUM(F81:M81)","v":0},null,{"$f":"IF(D81=N81,\"OK\",\"ERRO\")","v":"OK"}]
[{"$f":"IF(A81=\"F\",A81,\"\")","v":""}]
[{"$f":"IF(A82=\"F\",A82,\"\")","v":""},null,null,null,null,0.4,null,null,null,{"$f":"1-F83","v":0.6},null,null,null,{"$f":"IFERROR(E81/100,\"\")","v":0},null,{"$f":"IF(E81=N83*100,\"OK\",\"ERRO\")","v":"OK"}]
[{"$f":"IF(D84>0,\"F\",\"\")","v":""},"ADMINISTRAÇÃO - MENSALISTAS",null,{"$f":"Orçamento!V490","v":0},{"$f":"Orçamento!X490","v":0},{"$f":"ROUND(F86*$D$84,2)","v":0},null,null,null,{"$f":"ROUND(J86*$D$84,2)","v":0},null,null,null,{"$f":"SUM(F84:M84)","v":0},null,{"$f":"IF(D84=N84,\"OK\",\"ERRO\")","v":"OK"}]
[{"$f":"IF(A84=\"F\",A84,\"\")","v":""}]
[{"$f":"IF(A85=\"F\",A85,\"\")","v":""},null,null,null,null,0.49,null,null,null,{"$f":"1-F86","v":0.51},null,null,null,{"$f":"IFERROR(E84/100,\"\")","v":0},null,{"$f":"IF(E84=N86*100,\"OK\",\"ERRO\")","v":"OK"}]
[{"$f":"IF(D87>0,\"F\",\"\")","v":""},"PINTURA",null,{"$f":"Orçamento!V491","v":0},{"$f":"Orçamento!X491","v":0},{"$f":"ROUND(F89*$D$87,2)","v":0},null,null,null,{"$f":"ROUND(J89*$D$87,2)","v":0},null,null,null,{"$f":"SUM(F87:M87)","v":0},null,{"$f":"IF(D87=N87,\"OK\",\"ERRO\")","v":"OK"}]
[{"$f":"IF(A87=\"F\",A87,\"\")","v":""}]
[{"$f":"IF(A88=\"F\",A88,\"\")","v":""},null,null,null,null,0,null,null,null,{"$f":"1-F89","v":1},null,null,null,{"$f":"IFERROR(E87/100,\"\")","v":0},null,{"$f":"IF(E87=N89*100,\"OK\",\"ERRO\")","v":"OK"}]
[{"$f":"IF(D90>0,\"F\",\"\")","v":""},"DIVERSOS",null,{"$f":"Orçamento!V492","v":0},{"$f":"Orçamento!X492","v":0},{"$f":"ROUND(F92*$D$90,2)","v":0},null,null,null,{"$f":"ROUND(J92*$D$90,2)","v":0},null,null,null,{"$f":"SUM(F90:M90)","v":0},null,{"$f":"IF(D90=N90,\"OK\",\"ERRO\")","v":"OK"}]
[{"$f":"IF(A90=\"F\",A90,\"\")","v":""}]
[{"$f":"IF(A91=\"F\",A91,\"\")","v":""},null,null,null,null,0.46,null,null,null,{"$f":"1-F92","v":0.54},null,null,null,{"$f":"IFERROR(E90/100,\"\")","v":0},null,{"$f":"IF(E90=N92*100,\"OK\",\"ERRO\")","v":"OK"}]
["F","CUSTO DO ORÇAMENTO",null,{"$f":"SUM(D15:D92)","v":0},{"$f":"SUM(E15:E92)","v":0},{"$f":"F15+F18+F21+F24+F27+F30+F33+F36+F39+F42+F45+F48+F51+F54+F57+F60+F63+F66+F69+F72+F75+F78+F81+F84+F87+F90","v":0},null,null,null,{"$f":"J15+J18+J21+J24+J27+J30+J33+J36+J39+J42+J45+J48+J51+J54+J57+J60+J63+J66+J69+J72+J75+J78+J81+J84+J87+J90","v":0},null,null,null,{"$f":"N15+N18+N21+N24+N27+N30+N33+N36+N39+N42+N45+N48+N51+N54+N57+N60+N63+N66+N69+N72+N75+N78+N81+N84+N87+N90","v":0}]
["F","PERCENTUAIS:",null,null,null,{"$f":"IFERROR(F93/D93,\"\")","v":""},null,null,null,{"$f":"IFERROR(J93/D93,\"\")","v":""},null,null,null,{"$f":"SUM(F94:M94)","v":0}]
["F","TOTAIS ACUMULADOS:",null,null,null,{"$f":"F93","v":0},null,null,null,{"$f":"F95+J93","v":0}]
["F","PERCENTUAIS  ACUMULADOS:",null,null,null,{"$f":"F94","v":""},null,null,null,{"$f":"IFERROR(F96+J94,\"\")","v":""}]
["F"]
["F","OBSERVAÇÕES:"]
["F","Os pagamentos somente poderão ser efetuados mediante medição e atesto pelos técnicos da Secretaria da Educação. "]

{"sheet":"Composição BDI","index":4,"n_rows":45,"n_cols":22,"rows_kept":45,"cut":false,"hidden":false,"merged":[[18,5,18,8],[17,0,17,3],[16,0,16,3],[44,0,44,3],[42,0,42,3],[43,0,43,3],[18,0,18,3],[36,0,36,3],[39,0,39,3],[38,0,38,3],[40,0,40,3],[29,0,29,2],[32,0,32,3],[33,0,33,3],[34,0,34,3],[35,0,35,3],[0,0,0,3],[1,0,1,3],[4,0,4,3],[7,0,7,3],[10,0,10,3],[2,0,2,3],[3,0,3,3],[5,0,5,3],[6,0,6,3],[8,0,8,3],[9,0,9,3],[11,0,11,3],[12,0,12,3],[14,0,14,3],[15,0,15,3],[13,0,13,3]]}
[]
[]
["UNIDADE ESCOLAR"]
["COLÉGIO ESTADUAL FREDERICO JAYME"]
[]
["OBRA"]
["REFORMA E AMPLIAÇÃO"]
[]
["ENDEREÇO"]
["RUA TERCIO CAMPOS LEAO SN, SANTO ANTONIO, CEP:75906-420"]
[]
["CIDADE"]
["RIO VERDE",null,null,null,null,null,null,null,null,null,null,null,null,null,null,null,null,25.2,null,null,null,1425.05]
[]
["CRE"]
["RIO VERDE"]
[]
["DETALHAMENTO DA COMPOSIÇÃO DE BDI"]
["COMPOSIÇÃO BDI PARA OBRAS CIVIS",null,null,null,null,"BDI CONSTRUÇÃO E REFORMA"]
["DESCRIÇÃO","COEF.","TAXA % (a.m)","% no preço de venda",null,"Situação","1º Quartil","Médio","3º Quartil"]
["1) COFINS",1,0.03,0.03,null,"OK",0.03,0.03,0.03]
["2) PIS",1,6.4999999999999997E-3,6.4999999999999997E-3,null,"OK",6.4999999999999997E-3,6.4999999999999997E-3,6.4999999999999997E-3]
["3) ISSQN",1,2.5000000000000001E-2,2.5000000000000001E-2,null,"OK",0.02,3.5000000000000003E-2,0.05]
["4) CPRB",1,4.4999999999999998E-2,4.4999999999999998E-2,null,"OK",4.4999999999999998E-2,4.4999999999999998E-2,4.4999999999999998E-2]
["5) Administração Central",1,0.04,0.04,null,"OK",0.03,0.04,5.5E-2]
["6) Despesas Financeiras",1,5.5999999999999999E-3,5.5999999999999999E-3,null,"FORA DO INTERVALO",5.8999999999999999E-3,1.23E-2,1.3899999999999999E-2]
["7) Seguros + Garantias",1,1.1999999999999999E-3,1.1999999999999999E-3,null,"FORA DO INTERVALO",8.0000000000000002E-3,8.0000000000000002E-3,0.01]
["8) Risco",1,9.7000000000000003E-3,9.7000000000000003E-3,null,"OK",9.7000000000000003E-3,1.2699999999999999E-2,1.2699999999999999E-2]
["9) Lucro",1,6.8720000000000003E-2,6.8720000000000003E-2,null,"OK",6.1600000000000002E-2,7.3999999999999996E-2,8.9599999999999999E-2]
["BDI - FINAL",null,null,0.26402608612064959,null,"FORA DO INTERVALO",0.2034,0.22120000000000001,0.25]
[]
["Notas:"]
["(1) e (2) Alíquota definida por lei."]
["(3) Alíquota e base de cálculo definidas pela legislação municipal."]
["(4) Alíquota definida pelas leis 12.546/11, 12844/13 e 13.161/15 (CPRB – contribuição previdenciária sobre a receita bruta)."]
["(5) Valores definidos a partir dos limites no Acórdão nº 2.622/2013 - TCU – Plenário. Valores entre o 1º e 3º quartis."]
["(6) Valor calculado pela expressão matemática do acórdão 2.369/2011 – TCU – Plenário e disponibilizado pela AGETOP em dezembro de 2018. (Foi utilizado para o cálculo a média da Taxa SELIC no período de 11/2017 a 10/2018)"]
[]
["(7) Valores definidos pela AGETOP a partir dos limites no Acórdão nº 2.622/2013 - TCU – Plenário. Valores médios. \n\nObservação da AGETOP: (Seguros contra erros de execução, incêndio e explosão, danos da natureza (vendaval, destelhamento, alagamento, inundação, desmoronamento, geadas etc.), emprego de material defeituoso ou inadequado, roubo e/ou furto qualificado, quebra de equipamentos, desmoronamento de estrutura, nas modalidades de Obras Civis em Construção (OCC); Instalação e Montagem (IM); e Obras Civis em Construção e Instalação e Montagem (OCC/IM). Bem como coberturas adicionais para ampliação dessas coberturas básicas, como: cobertura de responsabilidade civil geral, cobertura de responsabilidade civil cruzada, cobertura de despesas extraordinárias, cobertura de tumultos, cobertura de desentulho do local, cobertura de riscos do fabricante, dentre outras, incluindo o seguro de vida em grupo regido pela convenção coletiva dos trabalhadores na indústria da construção civil). A partir de 24/02/2015 por intermédio da Portaria 449/2015 a Presidência da AGETOP, na pessoa do Senhor Jayme Eduardo Rincon, determinou a exclusão dos valores referentes aos Seguros de Risco de Engenharia e Responsabilidade Civil do Profissional na composição do cálculo do B.D.I.."]
["(8) Valores definidos a partir dos limites no Acórdão nº 2.622/2013 - TCU – Plenário. Valores entre 1º e 3° quartis."]
["(9) Valores definidos a partir dos limites definidos no Acórdão nº 2.622/2013 - TCU – Plenário. Valores adotados e praticados no mercado ( “ ex ante ” ) ou aqueles entre os 1º e 3º quartis."]
[]
["(*) A fórmula para estipulação da taxa de BDI estimado adotado é a mesma que foi aplicada para a obtenção das tabelas contidas no Acórdão n. 2.622/2013 – TCUPlenário"]
[]
["Obs.: Para obras com valores superiores a R$ 20.000.000,00 sugere-se recalcular o BDI, dimensionando as taxas de administração central e lucro para patamares inferiores ao estipulado acima."]

{"sheet":"Relatório CENTRAL","index":5,"n_rows":40,"n_cols":22,"rows_kept":40,"cut":false,"hidden":false,"merged":[[11,1,11,4],[39,1,39,2],[9,0,11,0],[0,1,0,4],[6,3,6,4],[9,3,9,4],[1,1,1,4],[2,1,2,2],[2,3,2,4],[3,1,3,2],[3,3,3,4],[4,1,4,4],[5,1,5,2],[5,3,5,4],[6,1,6,2],[7,1,7,4],[8,1,8,2],[8,3,8,4],[9,1,9,2],[10,1,10,4]]}
[]
[]
[null,"UNIDADE ESCOLAR",null,"CIDADE"]
[null,{"$f":"Orçamento!$O$4","v":"COLÉGIO ESTADUAL FREDERICO JAYME"},null,{"$f":"Orçamento!$V$7","v":"RIO VERDE"}]
[]
[null,"OBRA",null,"CRE"]
[null,{"$f":"Orçamento!$O$7","v":"REFORMA E AMPLIAÇÃO"},null,{"$f":"Orçamento!$O$10","v":"RIO VERDE"}]
[]
[null,"ENDEREÇO",null,"DATA"]
["FILTRO",{"$f":"Orçamento!$R$10","v":"RUA TERCIO CAMPOS LEAO SN, SANTO ANTONIO, CEP:75906-420"},null,{"$f":"Orçamento!$S$7","v":"2020-04-16"}]
[]
[null,"RELATÓRIO CENTRAL"]
["↓","CÓDIGO","ETAPA","PREÇO  (R$) C/ BDI","PARTIC  ( % )",null,null,null,null,null,null,null,null,null,null,null,null,25.2,null,null,null,1425.05]
[{"$f":"IF(D14>0,\"F\",\"\")","v":""},{"$f":"Orçamento!O467","v":"a."},{"$f":"Orçamento!P467","v":"SERVIÇOS PRELIMINARES"},{"$f":"Orçamento!V467","v":0},{"$f":"Orçamento!X467","v":0}]
[{"$f":"IF(D15>0,\"F\",\"\")","v":""},{"$f":"Orçamento!O468","v":"b."},{"$f":"Orçamento!P468","v":"TRANSPORTES"},{"$f":"Orçamento!V468","v":0},{"$f":"Orçamento!X468","v":0}]
["",{"$f":"Orçamento!O469","v":"c."},{"$f":"Orçamento!P469","v":"SERVIÇO EM TERRA"},{"$f":"Orçamento!V469","v":0},{"$f":"Orçamento!X469","v":0}]
["",{"$f":"Orçamento!O470","v":"d."},{"$f":"Orçamento!P470","v":"FUNDAÇÕES E SONDAGENS"},{"$f":"Orçamento!V470","v":0},{"$f":"Orçamento!X470","v":0}]
["",{"$f":"Orçamento!O471","v":"e."},{"$f":"Orçamento!P471","v":"ESTRUTURA"},{"$f":"Orçamento!V471","v":0},{"$f":"Orçamento!X471","v":0}]
["",{"$f":"Orçamento!O472","v":"f."},{"$f":"Orçamento!P472","v":"INSTALAÇÕES ELÉTRICAS"},{"$f":"Orçamento!V472","v":0},{"$f":"Orçamento!X472","v":0}]
["",{"$f":"Orçamento!O473","v":"g."},{"$f":"Orçamento!P473","v":"INSTALAÇÕES HIDROSSANITÁRIAS"},{"$f":"Orçamento!V473","v":0},{"$f":"Orçamento!X473","v":0}]
["",{"$f":"Orçamento!O474","v":"h"},{"$f":"Orçamento!P474","v":"INSTALAÇÕES ESPECIAIS"},{"$f":"Orçamento!V474","v":0},{"$f":"Orçamento!X474","v":0}]
["",{"$f":"Orçamento!O475","v":"i."},{"$f":"Orçamento!P475","v":"ALVENARIAS E DIVISÓRIAS"},{"$f":"Orçamento!V475","v":0},{"$f":"Orçamento!X475","v":0}]
["",{"$f":"Orçamento!O476","v":"j."},{"$f":"Orçamento!P476","v":"ALVENARIA AUTO-PORTANTE"},{"$f":"Orçamento!V476","v":0},{"$f":"Orçamento!X476","v":0}]
["",{"$f":"Orçamento!O477","v":"k."},{"$f":"Orçamento!P477","v":"IMPERMEABILIZAÇÃO"},{"$f":"Orçamento!V477","v":0},{"$f":"Orçamento!X477","v":0}]
["",{"$f":"Orçamento!O478","v":"l."},{"$f":"Orçamento!P478","v":"ISOLAMENTO TÉRMICO E ACÚSTICO"},{"$f":"Orçamento!V478","v":0},{"$f":"Orçamento!X478","v":0}]
["",{"$f":"Orçamento!O479","v":"m."},{"$f":"Orçamento!P479","v":"ESTRUTURA DE MADEIRA"},{"$f":"Orçamento!V479","v":0},{"$f":"Orçamento!X479","v":0}]
["",{"$f":"Orçamento!O480","v":"n."},{"$f":"Orçamento!P480","v":"ESTRUTURAS METÁLICAS"},{"$f":"Orçamento!V480","v":0},{"$f":"Orçamento!X480","v":0}]
["",{"$f":"Orçamento!O481","v":"o."},{"$f":"Orçamento!P481","v":"COBERTURAS"},{"$f":"Orçamento!V481","v":0},{"$f":"Orçamento!X481","v":0}]
["",{"$f":"Orçamento!O482","v":"p."},{"$f":"Orçamento!P482","v":"ESQUADRIAS DE MADEIRA"},{"$f":"Orçamento!V482","v":0},{"$f":"Orçamento!X482","v":0}]
["",{"$f":"Orçamento!O483","v":"q."},{"$f":"Orçamento!P483","v":"ESQUADRIAS METÁLICAS"},{"$f":"Orçamento!V483","v":0},{"$f":"Orçamento!X483","v":0}]
["",{"$f":"Orçamento!O484","v":"r."},{"$f":"Orçamento!P484","v":"VIDROS"},{"$f":"Orçamento!V484","v":0},{"$f":"Orçamento!X484","v":0}]
["",{"$f":"Orçamento!O485","v":"s."},{"$f":"Orçamento!P485","v":"REVESTIMENTO DE PAREDE"},{"$f":"Orçamento!V485","v":0},{"$f":"Orçamento!X485","v":0}]
["",{"$f":"Orçamento!O486","v":"t."},{"$f":"Orçamento!P486","v":"FORROS"},{"$f":"Orçamento!V486","v":0},{"$f":"Orçamento!X486","v":0}]
["",{"$f":"Orçamento!O487","v":"u."},{"$f":"Orçamento!P487","v":"REVESTIMENTO DE PISO"},{"$f":"Orçamento!V487","v":0},{"$f":"Orçamento!X487","v":0}]
["",{"$f":"Orçamento!O488","v":"v."},{"$f":"Orçamento!P488","v":"FERRAGENS"},{"$f":"Orçamento!V488","v":0},{"$f":"Orçamento!X488","v":0}]
["",{"$f":"Orçamento!O489","v":"w."},{"$f":"Orçamento!P489","v":"MARCENARIA"},{"$f":"Orçamento!V489","v":0},{"$f":"Orçamento!X489","v":0}]
["",{"$f":"Orçamento!O490","v":"x."},{"$f":"Orçamento!P490","v":"ADMINISTRAÇÃO"},{"$f":"Orçamento!V490","v":0},{"$f":"Orçamento!X490","v":0}]
["",{"$f":"Orçamento!O491","v":"y."},{"$f":"Orçamento!P491","v":"PINTURA"},{"$f":"Orçamento!V491","v":0},{"$f":"Orçamento!X491","v":0}]
["",{"$f":"Orçamento!O492","v":"z."},{"$f":"Orçamento!P492","v":"DIVERSOS"},{"$f":"Orçamento!V492","v":0},{"$f":"Orçamento!X492","v":0}]
["F","TOTAL GERAL DO ORÇAMENTO (R$) C/BDI",null,{"$f":"SUM(D14:D39)","v":0},{"$f":"SUM(E14:E39)","v":0}]

{"sheet":"Parc Maior Relev","index":6,"n_rows":33,"n_cols":22,"rows_kept":33,"cut":false,"hidden":false,"merged":[[8,1,8,3],[8,4,8,6],[33,3,33,7],[31,1,31,6],[0,1,0,6],[11,1,11,6],[1,1,1,6],[2,1,2,3],[2,4,2,6],[3,1,3,3],[3,4,3,6],[4,1,4,6],[5,1,5,3],[5,4,5,6],[9,1,9,3],[9,4,9,6],[10,1,10,6],[6,1,6,3],[6,4,6,6],[7,1,7,6]]}
[]
[]
[null,"UNIDADE ESCOLAR",null,null,"CÓDIGO INEP"]
[null,{"$f":"Orçamento!$O$4","v":"COLÉGIO ESTADUAL FREDERICO JAYME"},null,null,{"$f":"Orçamento!$V$4","v":52054365}]
[]
[null,"OBRA",null,null,"CIDADE"]
[null,{"$f":"Orçamento!$O$7","v":"REFORMA E AMPLIAÇÃO"},null,null,{"$f":"Orçamento!$V$7","v":"RIO VERDE"}]
[]
[null,"CRE",null,null,"ÁREA TOTAL CONSTRUÍDA (M²)"]
[null,{"$f":"Orçamento!$O$10","v":"RIO VERDE"},null,null,{"$f":"Orçamento!$V$13","v":1425.05}]
[]
["FILTRO","PARCELA DE MAIOR RELEVÂNCIA"]
[{"$f":"IF(G14>0,\"F\",\"\")","v":""},"CÓDIGO","SERVIÇO","DESCRIÇÃO","UNID","QUANT","PARC. MAIOR RELEV (100%)",null,null,null,null,null,null,null,null,null,null,25.2,null,null,null,1425.05]
[{"$f":"IF(G14>0,\"F\",\"\")","v":""},{"$f":"Somatório!B22","v":"f."},"INSTALAÇÕES ELÉTRICAS","SUBESTAÇÃO","KVA",{"$f":"SUMIF(Orçamento!$R$20:$R$448,'Parc Maior Relev'!D14,Orçamento!$T$20:$T$448)","v":0},{"$f":"F14","v":0}]
[{"$f":"IF(SUM(G16:G30)>0,\"F\",\"\")","v":"F"},"CÓDIGO","SERVIÇO","DESCRIÇÃO","UNID","QUANT","PARC. MAIOR RELEV (50%)"]
[{"$f":"IF(G16>0,\"F\",\"\")","v":"F"},"u.","REVESTIMENTO DE PISO","PISO EM GRANITINA","m²",147.19999999999999,{"$f":"F16*0.5","v":73.599999999999994}]
[{"$f":"IF(G17>0,\"F\",\"\")","v":"F"},"s.","REVESTIMENTO DE PAREDE","MASSA ÚNICA (REBOCO PAULISTA)","m²",412,{"$f":"F17*0.5","v":206}]
[{"$f":"IF(G18>0,\"F\",\"\")","v":""},{"$f":"Somatório!B31","v":"o."},"COBERTURAS","COBERTURA COM TELHA METÁLICA","M2",{"$f":"SUMIF(Orçamento!$R$20:$R$448,'Parc Maior Relev'!D18,Orçamento!$T$20:$T$448)","v":0},{"$f":"F18*0.5","v":0}]
["","o.","COBERTURAS","COBERTURA COM TELHA METÁLICA","M2",{"$f":"SUMIF(Orçamento!$R$20:$R$448,'Parc Maior Relev'!D19,Orçamento!$T$20:$T$448)","v":0},0]
["F",{"$f":"Somatório!B35","v":"s."},"REVESTIMENTO DE PAREDE","LASTRO DE CONCRETO IMPERMEABILIZADO","m²",496.47999999999996,248.23999999999998]
["","s.","REVESTIMENTO DE PAREDE","REBOCO","M2",{"$f":"SUMIF(Orçamento!$R$20:$R$448,'Parc Maior Relev'!D21,Orçamento!$T$20:$T$448)","v":0},{"$f":"F21*0.5","v":0}]
["","s.","REVESTIMENTO DE PAREDE","REVESTIMENTO CERÂMICO","M2",{"$f":"SUMIF(Orçamento!$R$20:$R$448,'Parc Maior Relev'!D22,Orçamento!$T$20:$T$448)","v":0},{"$f":"F22*0.5","v":0}]
["",{"$f":"Somatório!B36","v":"t."},"FORROS","FORRO DE GESSO","M2",{"$f":"SUMIF(Orçamento!$R$20:$R$448,'Parc Maior Relev'!D23,Orçamento!$T$20:$T$448)","v":0},{"$f":"F23*0.5","v":0}]
["","t.","FORROS","FORRO DE PVC","M2",{"$f":"SUMIF(Orçamento!$R$20:$R$448,'Parc Maior Relev'!D24,Orçamento!$T$20:$T$448)","v":0},{"$f":"F24*0.5","v":0}]
["","t.","FORROS","FORRO DE GESSO ACARTONADO","M2",{"$f":"SUMIF(Orçamento!$R$20:$R$448,'Parc Maior Relev'!D25,Orçamento!$T$20:$T$448)","v":0},{"$f":"F25*0.5","v":0}]
["","u.","REVESTIMENTO DE PISO","PISO DE GRANITINA","M2",{"$f":"SUMIF(Orçamento!$R$20:$R$448,'Parc Maior Relev'!D26,Orçamento!$T$20:$T$448)","v":0},0]
["","u.","REVESTIMENTO DE PISO","PISO LAMINADO","M2",{"$f":"SUMIF(Orçamento!$R$20:$R$448,'Parc Maior Relev'!D27,Orçamento!$T$20:$T$448)","v":0},0]
["","u.","REVESTIMENTO DE PISO","PISO DE CONCRETO DESEMPENADO","M2",{"$f":"SUMIF(Orçamento!$R$20:$R$448,'Parc Maior Relev'!D28,Orçamento!$T$20:$T$448)","v":0},0]
["","u.","REVESTIMENTO DE PISO","PISO CERÂMICO","M2",{"$f":"SUMIF(Orçamento!$R$20:$R$448,'Parc Maior Relev'!D29,Orçamento!$T$20:$T$448)","v":0},{"$f":"F29*0.5","v":0}]
["","y.","PINTURA","PINTURA","M2",{"$f":"SUMIF(Orçamento!$R$20:$R$448,'Parc Maior Relev'!D30,Orçamento!$T$20:$T$448)","v":0},0]
["F"]
["F","(*) Para os fins do inciso I dp § 1º do Art. 30 da Lei Federal 8.666/93, são consideradas parcelas de maior relevância técnica as execuções apresentadas"]
["F"]

{"sheet":"Composições","index":7,"n_rows":147,"n_cols":22,"rows_kept":147,"cut":false,"hidden":false,"merged":[[141,5,142,5],[141,6,141,7],[141,8,141,9],[145,1,145,7],[146,1,146,7],[141,0,142,0],[141,1,142,1],[141,2,142,2],[141,3,142,3],[141,4,142,4],[131,5,132,5],[131,6,131,7],[131,8,131,9],[135,1,135,7],[139,1,139,7],[131,0,132,0],[131,1,132,1],[131,2,132,2],[131,3,132,3],[131,4,132,4],[121,5,122,5],[121,6,121,7],[121,8,121,9],[125,1,125,7],[129,1,129,7],[121,0,122,0],[121,1,122,1],[121,2,122,2],[121,3,122,3],[121,4,122,4],[111,5,112,5],[111,6,111,7],[111,8,111,9],[116,1,116,7],[119,1,119,7],[111,0,112,0],[111,1,112,1],[111,2,112,2],[111,3,112,3],[111,4,112,4],[101,5,102,5],[101,6,101,7],[101,8,101,9],[106,1,106,7],[109,1,109,7],[101,0,102,0],[101,1,102,1],[101,2,102,2],[101,3,102,3],[101,4,102,4],[92,5,93,5],[92,6,92,7],[92,8,92,9],[97,1,97,7],[99,1,99,7],[92,0,93,0],[92,1,93,1],[92,2,93,2],[92,3,93,3],[92,4,93,4],[83,5,84,5],[83,6,83,7],[83,8,83,9],[88,1,88,7],[90,1,90,7],[83,0,84,0],[83,1,84,1],[83,2,84,2],[83,3,84,3],[83,4,84,4],[74,5,75,5],[74,6,74,7],[74,8,74,9],[79,1,79,7],[81,1,81,7],[74,0,75,0],[74,1,75,1],[74,2,75,2],[74,3,75,3],[74,4,75,4],[65,5,66,5],[65,6,65,7],[65,8,65,9],[70,1,70,7],[72,1,72,7],[65,0,66,0],[65,1,66,1],[65,2,66,2],[65,3,66,3],[65,4,66,4],[56,5,57,5],[56,6,56,7],[56,8,56,9],[61,1,61,7],[63,1,63,7],[56,0,57,0],[56,1,57,1],[56,2,57,2],[56,3,57,3],[56,4,57,4],[46,5,47,5],[46,6,46,7],[46,8,46,9],[51,1,51,7],[54,1,54,7],[46,0,47,0],[46,1,47,1],[46,2,47,2],[46,3,47,3],[46,4,47,4],[36,5,37,5],[36,6,36,7],[36,8,36,9],[41,1,41,7],[44,1,44,7],[36,0,37,0],[36,1,37,1],[36,2,37,2],[36,3,37,3],[36,4,37,4],[24,5,25,5],[24,6,24,7],[24,8,24,9],[33,1,33,7],[34,1,34,7],[24,0,25,0],[24,1,25,1],[24,2,25,2],[24,3,25,3],[24,4,25,4],[16,5,17,5],[16,6,16,7],[16,8,16,9],[20,1,20,7],[22,1,22,7],[16,0,17,0],[16,1,17,1],[16,2,17,2],[16,3,17,3],[16,4,17,4],[0,0,0,8],[10,0,10,2],[10,3,10,6],[11,0,11,9],[12,0,12,2],[12,3,12,6],[12,7,12,8],[7,0,7,6],[9,0,9,2],[9,3,9,6],[9,7,9,8],[3,0,3,6],[4,0,4,6],[15,0,15,9],[13,0,13,2],[13,3,13,6],[1,0,1,9],[3,7,3,9],[4,7,4,9],[6,7,6,9],[7,7,7,9],[6,0,6,6],[10,8,10,9],[13,8,13,9],[14,0,14,9],[8,0,8,9],[5,0,5,9],[2,0,2,9]]}
[]
[]
[]
["UNIDADE ESCOLAR",null,null,null,null,null,null,"CÓDIGO INEP"]
[{"$f":"Orçamento!$O$4","v":"COLÉGIO ESTADUAL FREDERICO JAYME"},null,null,null,null,null,null,{"$f":"Orçamento!$V$4","v":52054365}]
[]
["OBRA",null,null,null,null,null,null,"CIDADE"]
[{"$f":"Orçamento!$O$7","v":"REFORMA E AMPLIAÇÃO"},null,null,null,null,null,null,{"$f":"Orçamento!$V$7","v":"RIO VERDE"}]
[]
["CRE",null,null,"ENDEREÇO",null,null,null,"REFERÊNCIA AGETOP"]
[{"$f":"Orçamento!$O$10","v":"RIO VERDE"},null,null,{"$f":"Orçamento!$R$10","v":"RUA TERCIO CAMPOS LEAO SN, SANTO ANTONIO, CEP:75906-420"},null,null,null,{"$f":"Orçamento!$S$10","v":"ABR/19"},{"$f":"Orçamento!$T$10","v":"DESONERADA"}]
[]
["DATA",null,null,"ÁREA TOTAL CONSTRUÍDA (M²)",null,null,null,"REFERÊNCIA SINAPI",null,null,null,null,null,null,null,null,null,25.2,null,null,null,1425.05]
[{"$f":"Orçamento!$S$7","v":"2020-04-16"},null,null,{"$f":"Orçamento!$V$13","v":1425.05},null,null,null,{"$f":"Orçamento!$V$10","v":"DEZ/19"},{"$f":"Orçamento!$W$10","v":"DESONERADA"}]
[]
["COMPOSIÇÕES DE CUSTOS UNITÁRIOS - SEE-GO"]
[385,"FONTE","CÓDIGO","DESCRIÇÃO","UNIDADE","COEFIC.","CUSTO UNITÁRIO",null,"CUSTO  TOTAL (A) + (B) + (C) + (D) + (E)"]
[null,null,null,null,null,null,"DESONERADO","NÃO DESONER.","DESONERADO","NÃO DESONER."]
[null,"COMPOSIÇÃO","COMP 385_SEE","DEMOLIÇÃO POSTE DE CONCRETO/METALICA ENTRE 10 E 15 METROS C/ REAPROVEITAMENTO C/ TRANSPORTE ATE CAÇAMBA E CARGA","UN ",null,null,null,138.75,140.13999999999999]
[null,"AGETOP_I",8,"AJUDANTE","h     ",1,8.75,10.14,8.75,10.14]
[null,"MÃO DE OBRA (B) - TOTAL",null,null,null,null,null,null,8.75,10.14]
[null,"AGETOP",72080,"POSTE/TRAFO - CAMINHÃO MUNCK 12 TON. (MÍNIMO 4H/DIA)","H     ",1,130,130,130,130]
[null,"MATERIAL (C) - TOTAL",null,null,null,null,null,null,130,130]
[]
[554,"FONTE","CÓDIGO","DESCRIÇÃO","UNID ","COEFIC.","CUSTO UNITÁRIO",null,"CUSTO  TOTAL (A) + (B) + (C) + (D) + (E)"]
[null,null,null,null,null,null,"DESONERADO","NÃO DESONER.","DESONERADO","NÃO DESONER."]
[null,"COMPOSIÇÃO","COMP 554_SEE","CAIXA DE DECANTAÇÃO","UN ","-","-","-",698.68999999999994,743.82]
[null,"AGETOP",81840,"TAMPA  PARA CAIXA PASSAGEM FERRO FUNDIDO T-33 - TRÁFEGO LEVE","Un    ",1,114.58,117,114.58,117]
[null,"AGETOP",81938,"JOELHO 90 GRAUS DIAMETRO 100 MM","Un    ",1,15.63,17.239999999999998,15.63,17.239999999999998]
[null,"AGETOP",82235,"TE SANITARIO DIAMETRO 100 X 100 MM","Un    ",1,25.46,27.1,25.46,27.1]
[null,"AGETOP",82304,"TUBO SOLDAVEL P/ESGOTO DIAM. 100 MM","m     ",3,21.02,22.89,63.06,68.67]
[null,"AGETOP",100102,"ALVENARIA DE TIJOLO COMUM 1/2 VEZ - ARG. (1CI : 2CH : 8ARML)","m2    ",8,57.8,61.9,462.4,495.2]
[null,"AGETOP",220050,"LASTRO DE CONCRETO REGULARIZADO SEM IMPERMEAB. 1:3:6 ESP= 5CM (BASE)","m2    ",1,17.559999999999999,18.61,17.559999999999999,18.61]
[null,"MÃO DE OBRA (B) - TOTAL",null,null,null,null,null,null,698.68999999999994,743.82]
[null,"MATERIAL (C) - TOTAL",null,null,null,null,null,null,0,0]
[]
[382,"FONTE","CÓDIGO","DESCRIÇÃO","UNIDADE","COEFIC.","CUSTO UNITÁRIO",null,"CUSTO  TOTAL (A) + (B) + (C) + (D) + (E)"]
[null,null,null,null,null,null,"DESONERADO","NÃO DESONER.","DESONERADO","NÃO DESONER."]
[null,"COMPOSIÇÃO","COMP 382_SEE","TE DE REDUCAO DE FERRO GALVANIZADO, COM ROSCA BSP, DE 3/4\" X 1/2\"","UN ",null,null,null,23.02,25.2]
[null,"AGETOP_I",8,"AJUDANTE","h     ",0.6,8.75,10.14,5.25,6.08]
[null,"AGETOP_I",11,"ENCANADOR","h     ",0.61050000000000004,13.95,16.16,8.52,9.8699999999999992]
[null,"MÃO DE OBRA (B) - TOTAL",null,null,null,null,null,null,13.77,15.95]
[null,"SINAPI_I",3146,"FITA VEDA ROSCA EM ROLOS DE 18 MM X 10 M (L X C)","UN    ",0.12075471698113208,3.4,3.4,0.41,0.41]
[null,"SINAPI_I",6302,"TE DE REDUCAO DE FERRO GALVANIZADO, COM ROSCA BSP, DE 3/4\" X 1/2\"","UN    ",1,8.84,8.84,8.84,8.84]
[null,"MATERIAL (C) - TOTAL",null,null,null,null,null,null,9.25,9.25]
[]
[383,"FONTE","CÓDIGO","DESCRIÇÃO","UNIDADE","COEFIC.","CUSTO UNITÁRIO",null,"CUSTO  TOTAL (A) + (B) + (C) + (D) + (E)"]
[null,null,null,null,null,null,"DESONERADO","NÃO DESONER.","DESONERADO","NÃO DESONER."]
[null,"COMPOSIÇÃO","COMP 383_SEE","BUCHA DE REDUCAO DE FERRO GALVANIZADO, COM ROSCA BSP, DE 1/2\" X 1/4\"","UN ",null,null,null,7.22,7.8]
[null,"AGETOP_I",8,"AJUDANTE","h     ",0.16,8.75,10.14,1.4,1.62]
[null,"AGETOP_I",11,"ENCANADOR","h     ",0.16,13.95,16.16,2.23,2.59]
[null,"MÃO DE OBRA (B) - TOTAL",null,null,null,null,null,null,3.63,4.21]
[null,"AGETOP_I","H689","FITA VEDAROSCA 12 MM","m",1.2,0.28000000000000003,0.28000000000000003,0.34,0.34]
[null,"SINAPI_I",770,"BUCHA DE REDUCAO DE FERRO GALVANIZADO, COM ROSCA BSP, DE 1/2\" X 1/4\"","UN    ",1,3.25,3.25,3.25,3.25]
[null,"MATERIAL (C) - TOTAL",null,null,null,null,null,null,3.59,3.59]
[]
[212,"FONTE","CÓDIGO","DESCRIÇÃO","UNIDADE","COEFIC.","CUSTO UNITÁRIO",null,"CUSTO  TOTAL (A) + (B) + (C) + (D) + (E)"]
[null,null,null,null,null,null,"DESONERADO","NÃO DESONER.","DESONERADO","NÃO DESONER."]
[null,"COMPOSIÇÃO","COMP 212_SEE","NIPLE DE REDUÇÃO 1/2\" X 1/4\" BSP","UN ",null,null,null,9.68,10.26]
[null,"AGETOP_I",8,"AJUDANTE","h     ",0.16,8.75,10.14,1.4,1.62]
[null,"AGETOP_I",11,"ENCANADOR","h     ",0.16,13.95,16.16,2.23,2.59]
[null,"MÃO DE OBRA (B) - TOTAL",null,null,null,null,null,null,3.63,4.21]
[null,"COTAÇÃO","COT 103_SEE","NIPLE DE REDUÇÃO 1/2\" X 1/4\" BSP","UN",1,6.0533333333333337,6.0533333333333337,6.05,6.05]
[null,"MATERIAL (C) - TOTAL",null,null,null,null,null,null,6.05,6.05]
[]
[213,"FONTE","CÓDIGO","DESCRIÇÃO","UNIDADE","COEFIC.","CUSTO UNITÁRIO",null,"CUSTO  TOTAL (A) + (B) + (C) + (D) + (E)"]
[null,null,null,null,null,null,"DESONERADO","NÃO DESONER.","DESONERADO","NÃO DESONER."]
[null,"COMPOSIÇÃO","COMP 213_SEE","NIPLE DE REDUÇÃO 3/4\" X 1/2\" BSP","UN ",null,null,null,13.34,13.920000000000002]
[null,"AGETOP_I",8,"AJUDANTE","h     ",0.16,8.75,10.14,1.4,1.62]
[null,"AGETOP_I",11,"ENCANADOR","h     ",0.16,13.95,16.16,2.23,2.59]
[null,"MÃO DE OBRA (B) - TOTAL",null,null,null,null,null,null,3.63,4.21]
[null,"COTAÇÃO","COT 104_SEE","NIPLE DE REDUÇÃO 3/4\" X 1/2\" BSP","UN",1,9.7099999999999991,9.7099999999999991,9.7100000000000009,9.7100000000000009]
[null,"MATERIAL (C) - TOTAL",null,null,null,null,null,null,9.7100000000000009,9.7100000000000009]
[]
[237,"FONTE","CÓDIGO","DESCRIÇÃO","UNIDADE","COEFIC.","CUSTO UNITÁRIO",null,"CUSTO  TOTAL (A) + (B) + (C) + (D) + (E)"]
[null,null,null,null,null,null,"DESONERADO","NÃO DESONER.","DESONERADO","NÃO DESONER."]
[null,"COMPOSIÇÃO","COMP 237_SEE","FITA ANTICORROSIVA","M",null,null,null,11.16,11.879999999999999]
[null,"AGETOP_I",8,"AJUDANTE","h     ",0.2,8.75,10.14,1.75,2.0299999999999998]
[null,"AGETOP_I",12,"ELETRICISTA","h     ",0.2,13.95,16.16,2.79,3.23]
[null,"MÃO DE OBRA (B) - TOTAL",null,null,null,null,null,null,4.54,5.26]
[null,"SINAPI_I",39634,"FITA ADESIVA ANTICORROSIVA DE PVC FLEXIVEL, COR PRETA, PARA PROTECAO TUBULACAO, 50 MM X 30 M (L X C), E= *0,25* MM","M     ",1,6.62,6.62,6.62,6.62]
[null,"MATERIAL (C) - TOTAL",null,null,null,null,null,null,6.62,6.62]
[]
[542,"FONTE","CÓDIGO","DESCRIÇÃO","UNIDADE","COEFIC.","CUSTO UNITÁRIO",null,"CUSTO  TOTAL (A) + (B) + (C) + (D) + (E)"]
[null,null,null,null,null,null,"DESONERADO","NÃO DESONER.","DESONERADO","NÃO DESONER."]
[null,"COMPOSIÇÃO","COMP 542_SEE","VÁLVULA UGV 3/4\" (S) LATÃO","UN ",null,null,null,25.65,27.2]
[null,"AGETOP_I",8,"AJUDANTE","h     ",0.432,8.75,10.14,3.78,4.38]
[null,"AGETOP_I",11,"ENCANADOR","h     ",0.432,13.95,16.16,6.03,6.98]
[null,"MÃO DE OBRA (B) - TOTAL",null,null,null,null,null,null,9.81,11.36]
[null,"COTAÇÃO","COT 281_SEE","VÁLVULA UGV 3/4\" (S) LATÃO","UN ",1,15.836666666666666,15.836666666666666,15.84,15.84]
[null,"MATERIAL (C) - TOTAL",null,null,null,null,null,null,15.84,15.84]
[]
[543,"FONTE","CÓDIGO","DESCRIÇÃO","UNIDADE","COEFIC.","CUSTO UNITÁRIO",null,"CUSTO  TOTAL (A) + (B) + (C) + (D) + (E)"]
[null,null,null,null,null,null,"DESONERADO","NÃO DESONER.","DESONERADO","NÃO DESONER."]
[null,"COMPOSIÇÃO","COMP 543_SEE","VÁLVULA UGV 1/2\" (S) LATÃO","UN ",null,null,null,24.98,26.53]
[null,"AGETOP_I",8,"AJUDANTE","h     ",0.432,8.75,10.14,3.78,4.38]
[null,"AGETOP_I",11,"ENCANADOR","h     ",0.432,13.95,16.16,6.03,6.98]
[null,"MÃO DE OBRA (B) - TOTAL",null,null,null,null,null,null,9.81,11.36]
[null,"COTAÇÃO","COT 282_SEE","VÁLVULA UGV 1/2\" (S) LATÃO","UN ",1,15.166666666666666,15.166666666666666,15.17,15.17]
[null,"MATERIAL (C) - TOTAL",null,null,null,null,null,null,15.17,15.17]
[]
[211,"FONTE","CÓDIGO","DESCRIÇÃO","UNIDADE","COEFIC.","CUSTO UNITÁRIO",null,"CUSTO  TOTAL (A) + (B) + (C) + (D) + (E)"]
[null,null,null,null,null,null,"DESONERADO","NÃO DESONER.","DESONERADO","NÃO DESONER."]
[null,"COMPOSIÇÃO","COMP 211_SEE","REGULADOR DE 2º ESTÁGIO 5KG/H","UN ",null,null,null,86.72,90.86]
[null,"AGETOP_I",8,"AJUDANTE","h     ",1.1499999999999999,8.75,10.14,10.06,11.66]
[null,"AGETOP_I",11,"ENCANADOR","h     ",1.1499999999999999,13.95,16.16,16.04,18.579999999999998]
[null,"MÃO DE OBRA (B) - TOTAL",null,null,null,null,null,null,26.1,30.24]
[null,"COTAÇÃO","COT 102_SEE","REGULADOR DE 2º ESTÁGIO 5KG/H","UN",1,59.833333333333336,59.833333333333336,59.83,59.83]
[null,"AGETOP_I","H689","FITA VEDAROSCA 12 MM","m",2.82,0.28000000000000003,0.28000000000000003,0.79,0.79]
[null,"MATERIAL (C) - TOTAL",null,null,null,null,null,null,60.62,60.62]
[]
[210,"FONTE","CÓDIGO","DESCRIÇÃO","UNIDADE","COEFIC.","CUSTO UNITÁRIO",null,"CUSTO  TOTAL (A) + (B) + (C) + (D) + (E)"]
[null,null,null,null,null,null,"DESONERADO","NÃO DESONER.","DESONERADO","NÃO DESONER."]
[null,"COMPOSIÇÃO","COMP 210_SEE","REGULADOR DE 1º ESTÁGIO 60KG/H MODELO AP-40  COM MANÔMETRO","UN ",null,null,null,232.47,236.61]
[null,"AGETOP_I",8,"AJUDANTE","h     ",1.1499999999999999,8.75,10.14,10.06,11.66]
[null,"AGETOP_I",11,"ENCANADOR","h     ",1.1499999999999999,13.95,16.16,16.04,18.579999999999998]
[null,"MÃO DE OBRA (B) - TOTAL",null,null,null,null,null,null,26.1,30.24]
[null,"COTAÇÃO","COT 101_SEE","REGULADOR DE 1º ESTÁGIO 60KG/H MODELO AP-40  COM MANÔMETRO","UN",1,205.57666666666668,205.57666666666668,205.58,205.58]
[null,"AGETOP_I","H689","FITA VEDAROSCA 12 MM","m",2.82,0.28000000000000003,0.28000000000000003,0.79,0.79]
[null,"MATERIAL (C) - TOTAL",null,null,null,null,null,null,206.37,206.37]
[]
[235,"FONTE","CÓDIGO","DESCRIÇÃO","UNIDADE","COEFIC.","CUSTO UNITÁRIO",null,"CUSTO  TOTAL (A) + (B) + (C) + (D) + (E)"]
[null,null,null,null,null,null,"DESONERADO","NÃO DESONER.","DESONERADO","NÃO DESONER."]
[null,"COMPOSIÇÃO","COMP 235_SEE","PLACA DE SINALIZAÇÃO EM PVC COD 01 - (300X300) PROIBIDO FUMAR","UN ",null,null,null,25.319999999999997,25.439999999999998]
[null,"AGETOP_I",5,"SERVENTE","h     ",0.09,8.75,10.14,0.79,0.91]
[null,"MÃO DE OBRA (B) - TOTAL",null,null,null,null,null,null,0.79,0.91]
[null,"AGETOP_I",3070,"BUCHA DE NYLON S-6","un",2,0.04,0.04,0.08,0.08]
[null,"AGETOP_I",3393,"PARAFUSO P/BUCHA S-6","un",2,0.08,0.08,0.16,0.16]
[null,"SINAPI_I",37556,"PLACA DE SINALIZACAO DE SEGURANCA CONTRA INCENDIO, FOTOLUMINESCENTE, QUADRADA, *20 X 20* CM, EM PVC *2* MM ANTI-CHAMAS (SIMBOLOS, CORES E PICTOGRAMAS CONFORME NBR 13434)","UN    ",1,24.29,24.29,24.29,24.29]
[null,"MATERIAL (C) - TOTAL",null,null,null,null,null,null,24.529999999999998,24.529999999999998]
[]
[236,"FONTE","CÓDIGO","DESCRIÇÃO","UNIDADE","COEFIC.","CUSTO UNITÁRIO",null,"CUSTO  TOTAL (A) + (B) + (C) + (D) + (E)"]
[null,null,null,null,null,null,"DESONERADO","NÃO DESONER.","DESONERADO","NÃO DESONER."]
[null,"COMPOSIÇÃO","COMP 236_SEE","PLACA DE SINALIZAÇÃO EM PVC COD 06 - (300X300) PERIGO INFLAMÁVEL","UN ",null,null,null,25.319999999999997,25.439999999999998]
[null,"AGETOP_I",5,"SERVENTE","h     ",0.09,8.75,10.14,0.79,0.91]
[null,"MÃO DE OBRA (B) - TOTAL",null,null,null,null,null,null,0.79,0.91]
[null,"AGETOP_I",3070,"BUCHA DE NYLON S-6","un",2,0.04,0.04,0.08,0.08]
[null,"AGETOP_I",3393,"PARAFUSO P/BUCHA S-6","un",2,0.08,0.08,0.16,0.16]
[null,"SINAPI_I",37556,"PLACA DE SINALIZACAO DE SEGURANCA CONTRA INCENDIO, FOTOLUMINESCENTE, QUADRADA, *20 X 20* CM, EM PVC *2* MM ANTI-CHAMAS (SIMBOLOS, CORES E PICTOGRAMAS CONFORME NBR 13434)","UN    ",1,24.29,24.29,24.29,24.29]
[null,"MATERIAL (C) - TOTAL",null,null,null,null,null,null,24.529999999999998,24.529999999999998]
[]
[45,"FONTE","CÓDIGO","DESCRIÇÃO","UNIDADE","COEFIC.","CUSTO UNITÁRIO",null,"CUSTO  TOTAL (A) + (B) + (C) + (D) + (E)"]
[null,null,null,null,null,null,"DESONERADO","NÃO DESONER.","DESONERADO","NÃO DESONER."]
[null,"COMPOSIÇÃO","COMP 045_SEE","LAUDO DE ESTANQUEIDADE","UN ",null,null,null,936,1085.1199999999999]
[null,"AGETOP",250101,"ENGENHEIRO - (OBRAS CIVIS)","H     ",16,58.5,67.819999999999993,936,1085.1199999999999]
[null,"MÃO DE OBRA (B) - TOTAL",null,null,null,null,null,null,936,1085.1199999999999]
[null,"MATERIAL (C) - TOTAL",null,null,null,null,null,null,0,0]