{"text_format":"1","workbook":"xlsx","n_sheets":8,"sheets":["Orçamento","Resumo ","Somatório","Cronog_75_Dias","Composição BDI","Relatório CENTRAL","Parc Maior Relev","Composições"],"not_rendered":{"charts":0,"images":4,"macros":1,"external_links":1,"defined_names":105,"comments":4,"pivot_tables":0},"unopened":[],"bounds":{"document_bytes":16777216,"sheet_cells":100000,"rows_first":2000,"rows_last":500,"rows_between":2000,"halvings":0,"cell_chars":16384,"cell_head_chars":4096},"cells_cut":0,"cells_raw":0,"read":"whole","date_system":"1900"}

{"sheet":"Orçamento","index":0,"n_rows":581,"n_cols":27,"rows_kept":581,"cut":false,"hidden":false,"merged":[[546,15,546,17],[551,23,551,25],[552,23,552,25],[573,18,573,22],[509,22,509,24],[510,22,510,24],[6,12,6,13],[5,12,5,13],[12,23,12,25],[11,23,11,25],[9,19,9,22],[548,23,548,25],[523,23,523,25],[524,23,524,25],[525,23,525,25],[526,23,526,25],[527,23,527,25],[528,23,528,25],[529,23,529,25],[530,23,530,25],[531,23,531,25],[532,23,532,25],[533,23,533,25],[534,23,534,25],[571,23,571,25],[572,23,572,25],[573,23,573,25],[556,23,556,25],[557,23,557,25],[558,23,558,25],[559,23,559,25],[560,23,560,25],[561,23,561,25],[562,23,562,25],[563,23,563,25],[564,23,564,25],[565,23,565,25],[566,23,566,25],[567,23,567,25],[568,23,568,25],[569,23,569,25],[570,23,570,25],[551,18,551,22],[0,14,0,24],[8,14,8,16],[9,14,9,16],[11,14,11,16],[12,14,12,16],[14,14,14,24],[1,14,1,24],[4,14,4,24],[7,14,7,24],[535,18,535,22],[532,15,532,17],[533,15,533,17],[534,15,534,17],[544,18,544,22],[542,18,542,22],[550,18,550,22],[537,18,537,22],[530,18,530,22],[544,15,544,17],[545,15,545,17],[547,15,547,17],[548,15,548,17],[550,23,550,25],[552,18,552,22],[528,18,528,22],[529,18,529,22],[527,18,527,22],[536,18,536,22],[518,18,518,24],[524,18,524,22],[525,18,525,22],[526,18,526,22],[549,18,549,22],[547,18,547,22],[548,18,548,22],[538,18,538,22],[545,18,545,22],[541,18,541,22],[543,18,543,22],[539,18,539,22],[540,18,540,22],[549,23,549,25],[543,23,543,25],[544,23,544,25],[545,23,545,25],[546,23,546,25],[547,23,547,25],[529,15,529,17],[530,15,530,17],[531,15,531,17],[540,23,540,25],[541,23,541,25],[539,15,539,17],[540,15,540,17],[541,15,541,17],[542,23,542,25],[537,15,537,17],[538,15,538,17],[536,23,536,25],[537,23,537,25],[535,23,535,25],[516,16,516,24],[522,23,522,25],[538,23,538,25],[539,23,539,25],[558,15,558,17],[558,18,558,22],[517,16,517,24],[535,15,535,17],[536,15,536,17],[521,14,521,26],[522,18,522,22],[523,18,523,22],[531,18,531,22],[532,18,532,22],[533,18,533,22],[534,18,534,22],[546,18,546,22],[543,15,543,17],[523,15,523,17],[524,15,524,17],[525,15,525,17],[526,15,526,17],[527,15,527,17],[528,15,528,17],[513,16,513,24],[514,16,514,24],[515,16,515,24],[10,14,10,26],[13,14,13,26],[2,14,2,22],[3,14,3,22],[5,18,5,22],[6,18,6,22],[11,18,11,22],[12,18,12,22],[6,14,6,17],[5,14,5,17],[3,23,3,25],[2,23,2,25],[5,23,5,25],[6,23,6,25],[8,18,8,20],[505,17,510,17],[511,22,511,24],[505,22,505,24],[506,22,506,24],[507,22,507,24],[580,18,580,22],[577,14,577,17],[574,15,574,17],[574,18,574,22],[575,15,575,17],[575,18,575,22],[576,15,576,17],[576,18,576,22],[579,18,579,22],[578,18,578,22],[574,23,574,25],[575,23,575,25],[576,23,576,25],[577,23,577,25],[578,23,578,25],[579,23,579,25],[580,23,580,25],[549,14,549,17],[556,15,556,17],[522,15,522,17],[577,18,577,22],[565,15,565,17],[565,18,565,22],[566,15,566,17],[566,18,566,22],[567,15,567,17],[567,18,567,22],[571,15,571,17],[571,18,571,22],[572,15,572,17],[572,18,572,22],[573,15,573,17],[562,15,562,17],[568,15,568,17],[568,18,568,22],[569,15,569,17],[569,18,569,22],[570,15,570,17],[570,18,570,22],[9,24,9,25],[8,23,8,25],[562,18,562,22],[563,15,563,17],[563,18,563,22],[564,15,564,17],[564,18,564,22],[559,15,559,17],[559,18,559,22],[560,15,560,17],[560,18,560,22],[561,15,561,17],[561,18,561,22],[555,14,555,26],[556,18,556,22],[557,15,557,17],[557,18,557,22],[542,15,542,17]]}
[]
[]
[null,null,null,null,null,null,null,null,null,null,null,null,null,null,"UNIDADE ESCOLAR",null,null,null,null,null,null,null,null,"CÓDIGO INEP"]
[null,null,null,null,null,null,null,null,null,null,null,null,"",null,"COLÉGIO ESTADUAL OLYNTO PEREIRA DE CASTRO",null,null,null,null,null,null,null,null,52054217]
[]
["Nmax",null,null,null,null,null,null,null,null,null,null,null,null,null,"OBRA",null,null,null,"DATA",null,null,null,null,"CIDADE"]
[{"$f":"MAX($C$18:$C$505)","v":4},null,null,null,null,null,null,null,null,null,null,null,null,null,"REFORMA E AMPLIAÇÃO",null,null,null,"2020-06-18",null,null,null,null,"RIO VERDE"]
[]
[null,null,null,null,null,null,null,null,null,null,null,null,null,null,"CRE",null,null,"ENDEREÇO","REFERÊNCIA AGETOP",null,null,null,null,"REFERÊNCIA SINAPI"]
[null,null,null,null,null,null,null,null,null,null,null,null,null,null,"CRE-RIO VERDE",null,null," RUA JUCA BAILAO SN , SETOR MORADA DO SOL , CEP:75909-050","ABR/19","DESONERADA",null,null,null,"ABR/20","DESONERADA"]
[]
[null,null,null,null,null,null,null,null,null,null,null,null,null,null,"ÁREA EXISTENTE (M²)",null,null,"ÁREA A CONSTRUIR (M²)","ÁREA A DEMOLIR (M²)",null,null,null,null,"ÁREA TOTAL CONSTRUÍDA (M²)"]
[null,null,null,null,null,null,null,null,null,null,null,null,null,null,2245,null,null,6.75,null,null,null,null,null,2251.75]
[]
[null,null,null,null,null,null,null,null,null,null,null,"FILTRO",null,null,"PLANILHA ORÇAMENTÁRIA"]
["Nível E","Save Nivel","Nível C","Altura","n1","n2","n3","n4","n5","Czero","Cnível","↓","Nível","Nível Corrigido","ITEM","TABELA","CODIGO","DESCRIÇÃO DOS SERVIÇOS","UNID","QUANT","REPET","QUANT TOTAL","MAT","MO","T.SERVIÇO UNIT","VALOR TOTAL","OBSERVAÇÕES¹"]
[{"$f":"CHOOSE(1+LOG(1+2*(ORÇAMENTO.Nivel=\"Nível 1\")+4*(ORÇAMENTO.Nivel=\"Nível 2\")+8*(ORÇAMENTO.Nivel=\"Nível 3\")+16*(ORÇAMENTO.Nivel=\"Nível 4\")+32*(ORÇAMENTO.Nivel=\"Serviço\"),2),0,1,2,3,4,\"S\")","v":"S"},{"$f":"IF(OR(C17=\"s\",C17=0),OFFSET(B17,-1,0),C17)","v":"Save Nivel"},{"$f":"IF(OFFSET(C17,-1,0)=\"L\",1,IF(OFFSET(C17,-1,0)=1,2,IF(OR(A17=\"s\",A17=0),\"S\",IF(AND(OFFSET(C17,-1,0)=2,A17=4),3,IF(AND(OR(OFFSET(C17,-1,0)=\"s\",OFFSET(C17,-1,0)=0),A17<>\"s\",A17>OFFSET(B17,-1,0)),OFFSET(B17,-1,0),A17)))))","v":"S"},{"$f":"IF(OR(C17=\"S\",C17=0),0,IF(ISERROR(K17),J17,SMALL(J17:K17,1)))","v":0},{"$f":"IF($C17=1,OFFSET(E17,-1,0)+1,OFFSET(E17,-1,0))","v":"n1"},{"$f":"IF($C17=1,0,IF($C17=2,OFFSET(F17,-1,0)+1,OFFSET(F17,-1,0)))","v":"n2"},{"$f":"IF(AND($C17<=2,$C17<>0),0,IF($C17=3,OFFSET(G17,-1,0)+1,OFFSET(G17,-1,0)))","v":"n3"},{"$f":"IF(AND($C17<=3,$C17<>0),0,IF($C17=4,OFFSET(H17,-1,0)+1,OFFSET(H17,-1,0)))","v":"n4"},{"$f":"IF(AND($C17<=4,$C17<>0),0,IF(AND($C17=\"S\",$Y17>0),OFFSET(I17,-1,0)+1,OFFSET(I17,-1,0)))","v":"n5"},{"$f":"IF(OR($C17=\"S\",$C17=0),0,MATCH(0,OFFSET($D17,1,$C17,ROW($C$505)-ROW($C17)),0))","v":0},{"$f":"IF(OR($C17=\"S\",$C17=0),0,MATCH(OFFSET($D17,0,$C17)+1,OFFSET($D17,1,$C17,ROW($C$505)-ROW($C17)),0))","v":0},"","Serviço","Serviço","-","SINAPI",null,"(sem código)","-",null,"REPET","-",0,0,0,"-",""]
[0,null,"L",{"$f":"COUNTA(OFFSET(D18,1,0):D$505)","v":486},{"$f":"LEFT(O19,1)-1","v":0},null,null,null,null,null,null,"F","LOTE","LOTE","REFORMA E AMPLIAÇÃO - COLÉGIO ESTADUAL OLYNTO PEREIRA DE CASTRO",null,null,null,null,null,null,null,null,null,null,0]
[{"$f":"CHOOSE(1+LOG(1+2*(ORÇAMENTO.Nivel=\"Nível 1\")+4*(ORÇAMENTO.Nivel=\"Nível 2\")+8*(ORÇAMENTO.Nivel=\"Nível 3\")+16*(ORÇAMENTO.Nivel=\"Nível 4\")+32*(ORÇAMENTO.Nivel=\"Serviço\"),2),0,1,2,3,4,\"S\")","v":1},{"$f":"IF(OR(C19=\"s\",C19=0),OFFSET(B19,-1,0),C19)","v":1},{"$f":"IF(OFFSET(C19,-1,0)=\"L\",1,IF(OFFSET(C19,-1,0)=1,2,IF(OR(A19=\"s\",A19=0),\"S\",IF(AND(OFFSET(C19,-1,0)=2,A19=4),3,IF(AND(OR(OFFSET(C19,-1,0)=\"s\",OFFSET(C19,-1,0)=0),A19<>\"s\",A19>OFFSET(B19,-1,0)),OFFSET(B19,-1,0),A19)))))","v":1},{"$f":"IF(OR(C19=\"S\",C19=0),0,IF(ISERROR(K19),J19,SMALL(J19:K19,1)))","v":37},{"$f":"IF($C19=1,OFFSET(E19,-1,0)+1,OFFSET(E19,-1,0))","v":1},{"$f":"IF($C19=1,0,IF($C19=2,OFFSET(F19,-1,0)+1,OFFSET(F19,-1,0)))","v":0},{"$f":"IF(AND($C19<=2,$C19<>0),0,IF($C19=3,OFFSET(G19,-1,0)+1,OFFSET(G19,-1,0)))","v":0},{"$f":"IF(AND($C19<=3,$C19<>0),0,IF($C19=4,OFFSET(H19,-1,0)+1,OFFSET(H19,-1,0)))","v":0},{"$f":"IF(AND($C19<=4,$C19<>0),0,IF(AND($C19=\"S\",$Y19>0),OFFSET(I19,-1,0)+1,OFFSET(I19,-1,0)))","v":0},{"$f":"IF(OR($C19=\"S\",$C19=0),0,MATCH(0,OFFSET($D19,1,$C19,ROW($C$505)-ROW($C19)),0))","v":486},{"$f":"IF(OR($C19=\"S\",$C19=0),0,MATCH(OFFSET($D19,0,$C19)+1,OFFSET($D19,1,$C19,ROW($C$505)-ROW($C19)),0))","v":37},"F","Nível 1","Nível 1","1.","AGETOP",null,"SANITÁRIOS","UN",1,1,1,null,null,0,0]
[{"$f":"CHOOSE(1+LOG(1+2*(ORÇAMENTO.Nivel=\"Nível 1\")+4*(ORÇAMENTO.Nivel=\"Nível 2\")+8*(ORÇAMENTO.Nivel=\"Nível 3\")+16*(ORÇAMENTO.Nivel=\"Nível 4\")+32*(ORÇAMENTO.Nivel=\"Serviço\"),2),0,1,2,3,4,\"S\")","v":2},{"$f":"IF(OR(C20=\"s\",C20=0),OFFSET(B20,-1,0),C20)","v":2},{"$f":"IF(OFFSET(C20,-1,0)=\"L\",1,IF(OFFSET(C20,-1,0)=1,2,IF(OR(A20=\"s\",A20=0),\"S\",IF(AND(OFFSET(C20,-1,0)=2,A20=4),3,IF(AND(OR(OFFSET(C20,-1,0)=\"s\",OFFSET(C20,-1,0)=0),A20<>\"s\",A20>OFFSET(B20,-1,0)),OFFSET(B20,-1,0),A20)))))","v":2},{"$f":"IF(OR(C20=\"S\",C20=0),0,IF(ISERROR(K20),J20,SMALL(J20:K20,1)))","v":11},{"$f":"IF($C20=1,OFFSET(E20,-1,0)+1,OFFSET(E20,-1,0))","v":1},{"$f":"IF($C20=1,0,IF($C20=2,OFFSET(F20,-1,0)+1,OFFSET(F20,-1,0)))","v":1},{"$f":"IF(AND($C20<=2,$C20<>0),0,IF($C20=3,OFFSET(G20,-1,0)+1,OFFSET(G20,-1,0)))","v":0},{"$f":"IF(AND($C20<=3,$C20<>0),0,IF($C20=4,OFFSET(H20,-1,0)+1,OFFSET(H20,-1,0)))","v":0},{"$f":"IF(AND($C20<=4,$C20<>0),0,IF(AND($C20=\"S\",$Y20>0),OFFSET(I20,-1,0)+1,OFFSET(I20,-1,0)))","v":0},{"$f":"IF(OR($C20=\"S\",$C20=0),0,MATCH(0,OFFSET($D20,1,$C20,ROW($C$505)-ROW($C20)),0))","v":36},{"$f":"IF(OR($C20=\"S\",$C20=0),0,MATCH(OFFSET($D20,0,$C20)+1,OFFSET($D20,1,$C20,ROW($C$505)-ROW($C20)),0))","v":11},"","Nível 2","Nível 2","-","SINAPI",null,"SERVIÇOS PRELIMINARES","-",null,1,"-",0,0,0,0,""]
["S",2,"S",0,1,1,0,0,0,{"$f":"IF(OR($C21=\"S\",$C21=0),0,MATCH(0,OFFSET($D21,1,$C21,ROW($C$505)-ROW($C21)),0))","v":0},{"$f":"IF(OR($C21=\"S\",$C21=0),0,MATCH(OFFSET($D21,0,$C21)+1,OFFSET($D21,1,$C21,ROW($C$505)-ROW($C21)),0))","v":0},"","Serviço","Serviço","-","SINAPI",97644,"REMOÇÃO DE PORTAS, DE FORMA MANUAL, SEM REAPROVEITAMENTO. AF_12/2017","M2",15.36,1,15.36,null,null,0,0,"Referência: AGETOP - 20106"]
["S",2,"S",0,1,1,0,0,0,{"$f":"IF(OR($C22=\"S\",$C22=0),0,MATCH(0,OFFSET($D22,1,$C22,ROW($C$505)-ROW($C22)),0))","v":0},{"$f":"IF(OR($C22=\"S\",$C22=0),0,MATCH(OFFSET($D22,0,$C22)+1,OFFSET($D22,1,$C22,ROW($C$505)-ROW($C22)),0))","v":0},"","Serviço","Serviço","-","AGETOP",20118,"DEM.ALVEN.TIJOLO S/REAP. C/TR.ATE CB. E CARGA","m3    ",2.1074999999999999,1,2.1074999999999999,null,null,0,0,""]
["S",2,"S",0,1,1,0,0,0,{"$f":"IF(OR($C23=\"S\",$C23=0),0,MATCH(0,OFFSET($D23,1,$C23,ROW($C$505)-ROW($C23)),0))","v":0},{"$f":"IF(OR($C23=\"S\",$C23=0),0,MATCH(OFFSET($D23,0,$C23)+1,OFFSET($D23,1,$C23,ROW($C$505)-ROW($C23)),0))","v":0},"","Serviço","Serviço","-","AGETOP",20109,"DEM.PISO CIMENT.SOBRE LASTRO CONC.C/TR.ATE CB. E CARGA","m2    ",5,1,5,null,null,0,0,""]
["S",2,"S",0,1,1,0,0,0,{"$f":"IF(OR($C24=\"S\",$C24=0),0,MATCH(0,OFFSET($D24,1,$C24,ROW($C$505)-ROW($C24)),0))","v":0},{"$f":"IF(OR($C24=\"S\",$C24=0),0,MATCH(OFFSET($D24,0,$C24)+1,OFFSET($D24,1,$C24,ROW($C$505)-ROW($C24)),0))","v":0},"","Serviço","Serviço","-","AGETOP",20137,"DEMOLIÇAO BACIA SANITARIA C/ TRANSP. ATÉ CB. E CARGA","Un    ",4,1,4,null,null,0,0,""]
[{"$f":"CHOOSE(1+LOG(1+2*(ORÇAMENTO.Nivel=\"Nível 1\")+4*(ORÇAMENTO.Nivel=\"Nível 2\")+8*(ORÇAMENTO.Nivel=\"Nível 3\")+16*(ORÇAMENTO.Nivel=\"Nível 4\")+32*(ORÇAMENTO.Nivel=\"Serviço\"),2),0,1,2,3,4,\"S\")","v":"S"},{"$f":"IF(OR(C25=\"s\",C25=0),OFFSET(B25,-1,0),C25)","v":2},{"$f":"IF(OFFSET(C25,-1,0)=\"L\",1,IF(OFFSET(C25,-1,0)=1,2,IF(OR(A25=\"s\",A25=0),\"S\",IF(AND(OFFSET(C25,-1,0)=2,A25=4),3,IF(AND(OR(OFFSET(C25,-1,0)=\"s\",OFFSET(C25,-1,0)=0),A25<>\"s\",A25>OFFSET(B25,-1,0)),OFFSET(B25,-1,0),A25)))))","v":"S"},{"$f":"IF(OR(C25=\"S\",C25=0),0,IF(ISERROR(K25),J25,SMALL(J25:K25,1)))","v":0},{"$f":"IF($C25=1,OFFSET(E25,-1,0)+1,OFFSET(E25,-1,0))","v":1},{"$f":"IF($C25=1,0,IF($C25=2,OFFSET(F25,-1,0)+1,OFFSET(F25,-1,0)))","v":1},{"$f":"IF(AND($C25<=2,$C25<>0),0,IF($C25=3,OFFSET(G25,-1,0)+1,OFFSET(G25,-1,0)))","v":0},{"$f":"IF(AND($C25<=3,$C25<>0),0,IF($C25=4,OFFSET(H25,-1,0)+1,OFFSET(H25,-1,0)))","v":0},{"$f":"IF(AND($C25<=4,$C25<>0),0,IF(AND($C25=\"S\",$Y25>0),OFFSET(I25,-1,0)+1,OFFSET(I25,-1,0)))","v":0},{"$f":"IF(OR($C25=\"S\",$C25=0),0,MATCH(0,OFFSET($D25,1,$C25,ROW($C$505)-ROW($C25)),0))","v":0},{"$f":"IF(OR($C25=\"S\",$C25=0),0,MATCH(OFFSET($D25,0,$C25)+1,OFFSET($D25,1,$C25,ROW($C$505)-ROW($C25)),0))","v":0},"","Serviço","Serviço","-","AGETOP",20146,"DEMOLIÇÃO DE MICTÓRIO C/ TRANSP. ATÉ CB. E CARGA","Un    ",6,1,6,null,null,0,0,""]
["S",2,"S",0,1,1,0,0,0,{"$f":"IF(OR($C26=\"S\",$C26=0),0,MATCH(0,OFFSET($D26,1,$C26,ROW($C$505)-ROW($C26)),0))","v":0},{"$f":"IF(OR($C26=\"S\",$C26=0),0,MATCH(OFFSET($D26,0,$C26)+1,OFFSET($D26,1,$C26,ROW($C$505)-ROW($C26)),0))","v":0},"","Serviço","Serviço","-","AGETOP",20163,"DEMOLIÇÃO DAS INSTALAÇÕES HIDROSANITÁRIAS E AFINS C/ TRANSP. ATÉ CB. E CARGA","H     ",3.5999999999999996,1,3.5999999999999996,null,null,0,0,""]
["S",2,"S",0,1,1,0,0,0,{"$f":"IF(OR($C27=\"S\",$C27=0),0,MATCH(0,OFFSET($D27,1,$C27,ROW($C$505)-ROW($C27)),0))","v":0},{"$f":"IF(OR($C27=\"S\",$C27=0),0,MATCH(OFFSET($D27,0,$C27)+1,OFFSET($D27,1,$C27,ROW($C$505)-ROW($C27)),0))","v":0},"","Serviço","Serviço","-","AGETOP",20140,"DEMOLIÇAO DE VÁLVULA DE DESCARGA C/ TRANSP. ATÉ CB. E CARGA","Un    ",2,1,2,null,null,0,0,""]
[{"$f":"CHOOSE(1+LOG(1+2*(ORÇAMENTO.Nivel=\"Nível 1\")+4*(ORÇAMENTO.Nivel=\"Nível 2\")+8*(ORÇAMENTO.Nivel=\"Nível 3\")+16*(ORÇAMENTO.Nivel=\"Nível 4\")+32*(ORÇAMENTO.Nivel=\"Serviço\"),2),0,1,2,3,4,\"S\")","v":"S"},{"$f":"IF(OR(C28=\"s\",C28=0),OFFSET(B28,-1,0),C28)","v":2},{"$f":"IF(OFFSET(C28,-1,0)=\"L\",1,IF(OFFSET(C28,-1,0)=1,2,IF(OR(A28=\"s\",A28=0),\"S\",IF(AND(OFFSET(C28,-1,0)=2,A28=4),3,IF(AND(OR(OFFSET(C28,-1,0)=\"s\",OFFSET(C28,-1,0)=0),A28<>\"s\",A28>OFFSET(B28,-1,0)),OFFSET(B28,-1,0),A28)))))","v":"S"},{"$f":"IF(OR(C28=\"S\",C28=0),0,IF(ISERROR(K28),J28,SMALL(J28:K28,1)))","v":0},{"$f":"IF($C28=1,OFFSET(E28,-1,0)+1,OFFSET(E28,-1,0))","v":1},{"$f":"IF($C28=1,0,IF($C28=2,OFFSET(F28,-1,0)+1,OFFSET(F28,-1,0)))","v":1},{"$f":"IF(AND($C28<=2,$C28<>0),0,IF($C28=3,OFFSET(G28,-1,0)+1,OFFSET(G28,-1,0)))","v":0},{"$f":"IF(AND($C28<=3,$C28<>0),0,IF($C28=4,OFFSET(H28,-1,0)+1,OFFSET(H28,-1,0)))","v":0},{"$f":"IF(AND($C28<=4,$C28<>0),0,IF(AND($C28=\"S\",$Y28>0),OFFSET(I28,-1,0)+1,OFFSET(I28,-1,0)))","v":0},{"$f":"IF(OR($C28=\"S\",$C28=0),0,MATCH(0,OFFSET($D28,1,$C28,ROW($C$505)-ROW($C28)),0))","v":0},{"$f":"IF(OR($C28=\"S\",$C28=0),0,MATCH(OFFSET($D28,0,$C28)+1,OFFSET($D28,1,$C28,ROW($C$505)-ROW($C28)),0))","v":0},"","Serviço","Serviço","-","AGETOP",20151,"DEMOL.DIVISÓRIA EM PEDRA/CONC.C/TRANSP.ATE C.B.CARGA","m2    ",3.3,1,3.3,null,null,0,0,""]
["S",2,"S",0,1,1,0,0,0,{"$f":"IF(OR($C29=\"S\",$C29=0),0,MATCH(0,OFFSET($D29,1,$C29,ROW($C$505)-ROW($C29)),0))","v":0},{"$f":"IF(OR($C29=\"S\",$C29=0),0,MATCH(OFFSET($D29,0,$C29)+1,OFFSET($D29,1,$C29,ROW($C$505)-ROW($C29)),0))","v":0},"","Serviço","Serviço","-","AGETOP",260105,"REMOCAO DE PINTURA ANTIGA A OLEO OU ESMALTE","m2    ",25.92,1,25.92,null,null,0,0,""]
["S",2,"S",0,1,1,0,0,0,{"$f":"IF(OR($C30=\"S\",$C30=0),0,MATCH(0,OFFSET($D30,1,$C30,ROW($C$505)-ROW($C30)),0))","v":0},{"$f":"IF(OR($C30=\"S\",$C30=0),0,MATCH(OFFSET($D30,0,$C30)+1,OFFSET($D30,1,$C30,ROW($C$505)-ROW($C30)),0))","v":0},"","Serviço","Serviço","-","SINAPI",97640,"REMOÇÃO DE FORROS DE DRYWALL, PVC E FIBROMINERAL, DE FORMA MANUAL, SEM REAPROVEITAMENTO. AF_12/2017","M2",57.12,1,57.12,null,null,0,0,""]
[2,2,2,3,1,2,0,0,0,{"$f":"IF(OR($C31=\"S\",$C31=0),0,MATCH(0,OFFSET($D31,1,$C31,ROW($C$505)-ROW($C31)),0))","v":25},{"$f":"IF(OR($C31=\"S\",$C31=0),0,MATCH(OFFSET($D31,0,$C31)+1,OFFSET($D31,1,$C31,ROW($C$505)-ROW($C31)),0))","v":3},"","Nível 2","Nível 2","-","SINAPI",null,"TRANSPORTES","-",null,1,"-",null,null,0,0,""]
["S",2,"S",0,1,2,0,0,0,{"$f":"IF(OR($C32=\"S\",$C32=0),0,MATCH(0,OFFSET($D32,1,$C32,ROW($C$505)-ROW($C32)),0))","v":0},{"$f":"IF(OR($C32=\"S\",$C32=0),0,MATCH(OFFSET($D32,0,$C32)+1,OFFSET($D32,1,$C32,ROW($C$505)-ROW($C32)),0))","v":0},"","Serviço","Serviço","-","SINAPI",72900,"TRANSPORTE DE ENTULHO COM CAMINHAO BASCULANTE 6 M3, RODOVIA PAVIMENTADA, DMT 0,5 A 1,0 KM","M3",7.94,1,7.94,null,null,0,0,""]
["S",2,"S",0,1,2,0,0,0,{"$f":"IF(OR($C33=\"S\",$C33=0),0,MATCH(0,OFFSET($D33,1,$C33,ROW($C$505)-ROW($C33)),0))","v":0},{"$f":"IF(OR($C33=\"S\",$C33=0),0,MATCH(OFFSET($D33,0,$C33)+1,OFFSET($D33,1,$C33,ROW($C$505)-ROW($C33)),0))","v":0},"","Serviço","Serviço","-","SINAPI",72897,"CARGA MANUAL DE ENTULHO EM CAMINHAO BASCULANTE 6 M3","M3",7.94,1,7.94,null,null,0,0,""]
[2,2,2,2,1,3,0,0,0,{"$f":"IF(OR($C34=\"S\",$C34=0),0,MATCH(0,OFFSET($D34,1,$C34,ROW($C$505)-ROW($C34)),0))","v":22},{"$f":"IF(OR($C34=\"S\",$C34=0),0,MATCH(OFFSET($D34,0,$C34)+1,OFFSET($D34,1,$C34,ROW($C$505)-ROW($C34)),0))","v":2},"","Nível 2","Nível 2","-","SINAPI",null,"ALVENARIAS E DIVISÓRIAS","-",null,1,"-",null,null,0,0,""]
["S",2,"S",0,1,3,0,0,0,{"$f":"IF(OR($C35=\"S\",$C35=0),0,MATCH(0,OFFSET($D35,1,$C35,ROW($C$505)-ROW($C35)),0))","v":0},{"$f":"IF(OR($C35=\"S\",$C35=0),0,MATCH(OFFSET($D35,0,$C35)+1,OFFSET($D35,1,$C35,ROW($C$505)-ROW($C35)),0))","v":0},"","Serviço","Serviço","-","AGETOP",100201,"ALVENARIA DE TIJOLO FURADO 1/2 VEZ - 9 x 19 x 19 - ARG. (1CALH:4ARML+100KG DE CI/M3)","m2    ",2.2000000000000002,1,2.2000000000000002,null,null,0,0,""]
[2,2,2,4,1,4,0,0,0,{"$f":"IF(OR($C36=\"S\",$C36=0),0,MATCH(0,OFFSET($D36,1,$C36,ROW($C$505)-ROW($C36)),0))","v":20},{"$f":"IF(OR($C36=\"S\",$C36=0),0,MATCH(OFFSET($D36,0,$C36)+1,OFFSET($D36,1,$C36,ROW($C$505)-ROW($C36)),0))","v":4},"","Nível 2","Nível 2","-","SINAPI",null,"REVESTIMENTO DE PISO","-",null,1,"-",null,null,0,0,""]
["S",2,"S",0,1,4,0,0,0,{"$f":"IF(OR($C37=\"S\",$C37=0),0,MATCH(0,OFFSET($D37,1,$C37,ROW($C$505)-ROW($C37)),0))","v":0},{"$f":"IF(OR($C37=\"S\",$C37=0),0,MATCH(OFFSET($D37,0,$C37)+1,OFFSET($D37,1,$C37,ROW($C$505)-ROW($C37)),0))","v":0},"","Serviço","Serviço","-","AGETOP",221101,"GRANITINA 8MM FUNDIDA COM CONTRAPISO (1CI:3ARML) E=2CM E JUNTA PLASTICA 27MM","m2    ",5,1,5,null,null,0,0,""]
["S",2,"S",0,1,4,0,0,0,{"$f":"IF(OR($C38=\"S\",$C38=0),0,MATCH(0,OFFSET($D38,1,$C38,ROW($C$505)-ROW($C38)),0))","v":0},{"$f":"IF(OR($C38=\"S\",$C38=0),0,MATCH(OFFSET($D38,0,$C38)+1,OFFSET($D38,1,$C38,ROW($C$505)-ROW($C38)),0))","v":0},"","Serviço","Serviço","-","AGETOP",221102,"RODAPÉ FUNDIDO DE GRANITINA 7CM","m     ",6.42,1,6.42,null,null,0,0,""]
["S",2,"S",0,1,4,0,0,0,{"$f":"IF(OR($C39=\"S\",$C39=0),0,MATCH(0,OFFSET($D39,1,$C39,ROW($C$505)-ROW($C39)),0))","v":0},{"$f":"IF(OR($C39=\"S\",$C39=0),0,MATCH(OFFSET($D39,0,$C39)+1,OFFSET($D39,1,$C39,ROW($C$505)-ROW($C39)),0))","v":0},"","Serviço","Serviço","-","AGETOP",221104,"RASPAGEM E APLICAÇÃO RESINA ACRÍLICA DUAS DEMÃOS","m2    ",5.4493999999999998,1,5.4493999999999998,null,null,0,0,""]
[2,2,2,4,1,5,0,0,0,{"$f":"IF(OR($C40=\"S\",$C40=0),0,MATCH(0,OFFSET($D40,1,$C40,ROW($C$505)-ROW($C40)),0))","v":16},{"$f":"IF(OR($C40=\"S\",$C40=0),0,MATCH(OFFSET($D40,0,$C40)+1,OFFSET($D40,1,$C40,ROW($C$505)-ROW($C40)),0))","v":4},"","Nível 2","Nível 2","-","SINAPI",null,"REVESTIMENTO DE PAREDE","-",null,1,"-",null,null,0,0,""]
["S",2,"S",0,1,5,0,0,0,{"$f":"IF(OR($C41=\"S\",$C41=0),0,MATCH(0,OFFSET($D41,1,$C41,ROW($C$505)-ROW($C41)),0))","v":0},{"$f":"IF(OR($C41=\"S\",$C41=0),0,MATCH(OFFSET($D41,0,$C41)+1,OFFSET($D41,1,$C41,ROW($C$505)-ROW($C41)),0))","v":0},"","Serviço","Serviço","-","AGETOP",200101,"CHAPISCO COMUM","m2    ",4.5,1,4.5,null,null,0,0,""]
["S",2,"S",0,1,5,0,0,0,{"$f":"IF(OR($C42=\"S\",$C42=0),0,MATCH(0,OFFSET($D42,1,$C42,ROW($C$505)-ROW($C42)),0))","v":0},{"$f":"IF(OR($C42=\"S\",$C42=0),0,MATCH(OFFSET($D42,0,$C42)+1,OFFSET($D42,1,$C42,ROW($C$505)-ROW($C42)),0))","v":0},"","Serviço","Serviço","-","AGETOP",200201,"EMBOÇO (1CI:4 ARML)","m2    ",4.5,1,4.5,null,null,0,0,""]
["S",2,"S",0,1,5,0,0,0,{"$f":"IF(OR($C43=\"S\",$C43=0),0,MATCH(0,OFFSET($D43,1,$C43,ROW($C$505)-ROW($C43)),0))","v":0},{"$f":"IF(OR($C43=\"S\",$C43=0),0,MATCH(OFFSET($D43,0,$C43)+1,OFFSET($D43,1,$C43,ROW($C$505)-ROW($C43)),0))","v":0},"","Serviço","Serviço","-","AGETOP",201302,"REVESTIMENTO COM CERÂMICA ","m2    ",4.5,1,4.5,null,null,0,0,""]
[2,2,2,3,1,6,0,0,0,{"$f":"IF(OR($C44=\"S\",$C44=0),0,MATCH(0,OFFSET($D44,1,$C44,ROW($C$505)-ROW($C44)),0))","v":12},{"$f":"IF(OR($C44=\"S\",$C44=0),0,MATCH(OFFSET($D44,0,$C44)+1,OFFSET($D44,1,$C44,ROW($C$505)-ROW($C44)),0))","v":3},"","Nível 2","Nível 2","-","SINAPI",null,"ESQUADRIAS METÁLICAS","-",null,1,"-",null,null,0,0,""]
["S",2,"S",0,1,6,0,0,0,{"$f":"IF(OR($C45=\"S\",$C45=0),0,MATCH(0,OFFSET($D45,1,$C45,ROW($C$505)-ROW($C45)),0))","v":0},{"$f":"IF(OR($C45=\"S\",$C45=0),0,MATCH(OFFSET($D45,0,$C45)+1,OFFSET($D45,1,$C45,ROW($C$505)-ROW($C45)),0))","v":0},"","Serviço","Serviço","-","AGETOP",180509,"PORTA ABRIR CH.P/WC PF-10 C/FERRAGENS","m2    ",5.76,1,5.76,null,null,0,0,""]
[{"$f":"CHOOSE(1+LOG(1+2*(ORÇAMENTO.Nivel=\"Nível 1\")+4*(ORÇAMENTO.Nivel=\"Nível 2\")+8*(ORÇAMENTO.Nivel=\"Nível 3\")+16*(ORÇAMENTO.Nivel=\"Nível 4\")+32*(ORÇAMENTO.Nivel=\"Serviço\"),2),0,1,2,3,4,\"S\")","v":"S"},{"$f":"IF(OR(C46=\"s\",C46=0),OFFSET(B46,-1,0),C46)","v":2},{"$f":"IF(OFFSET(C46,-1,0)=\"L\",1,IF(OFFSET(C46,-1,0)=1,2,IF(OR(A46=\"s\",A46=0),\"S\",IF(AND(OFFSET(C46,-1,0)=2,A46=4),3,IF(AND(OR(OFFSET(C46,-1,0)=\"s\",OFFSET(C46,-1,0)=0),A46<>\"s\",A46>OFFSET(B46,-1,0)),OFFSET(B46,-1,0),A46)))))","v":"S"},{"$f":"IF(OR(C46=\"S\",C46=0),0,IF(ISERROR(K46),J46,SMALL(J46:K46,1)))","v":0},{"$f":"IF($C46=1,OFFSET(E46,-1,0)+1,OFFSET(E46,-1,0))","v":1},{"$f":"IF($C46=1,0,IF($C46=2,OFFSET(F46,-1,0)+1,OFFSET(F46,-1,0)))","v":6},{"$f":"IF(AND($C46<=2,$C46<>0),0,IF($C46=3,OFFSET(G46,-1,0)+1,OFFSET(G46,-1,0)))","v":0},{"$f":"IF(AND($C46<=3,$C46<>0),0,IF($C46=4,OFFSET(H46,-1,0)+1,OFFSET(H46,-1,0)))","v":0},{"$f":"IF(AND($C46<=4,$C46<>0),0,IF(AND($C46=\"S\",$Y46>0),OFFSET(I46,-1,0)+1,OFFSET(I46,-1,0)))","v":0},{"$f":"IF(OR($C46=\"S\",$C46=0),0,MATCH(0,OFFSET($D46,1,$C46,ROW($C$505)-ROW($C46)),0))","v":0},{"$f":"IF(OR($C46=\"S\",$C46=0),0,MATCH(OFFSET($D46,0,$C46)+1,OFFSET($D46,1,$C46,ROW($C$505)-ROW($C46)),0))","v":0},"","Serviço","Serviço","-","AGETOP",180490,"PORTA DE ABRIR EM CHAPA PF-1A C/FERRAGENS","m2    ",6.72,1,6.72,null,null,0,0,""]
[2,2,2,3,1,7,0,0,0,{"$f":"IF(OR($C47=\"S\",$C47=0),0,MATCH(0,OFFSET($D47,1,$C47,ROW($C$505)-ROW($C47)),0))","v":9},{"$f":"IF(OR($C47=\"S\",$C47=0),0,MATCH(OFFSET($D47,0,$C47)+1,OFFSET($D47,1,$C47,ROW($C$505)-ROW($C47)),0))","v":3},"","Nível 2","Nível 2","-","SINAPI",null,"PINTURA","-",null,1,"-",null,null,0,0,""]
["S",2,"S",0,1,7,0,0,0,{"$f":"IF(OR($C48=\"S\",$C48=0),0,MATCH(0,OFFSET($D48,1,$C48,ROW($C$505)-ROW($C48)),0))","v":0},{"$f":"IF(OR($C48=\"S\",$C48=0),0,MATCH(OFFSET($D48,0,$C48)+1,OFFSET($D48,1,$C48,ROW($C$505)-ROW($C48)),0))","v":0},"","Serviço","Serviço","-","AGETOP",261602,"PINT.ESMALTE/ESQUAD.FERRO C/FUNDO ANTICOR.","m2    ",37.44,1,37.44,null,null,0,0,""]
["S",2,"S",0,1,7,0,0,0,{"$f":"IF(OR($C49=\"S\",$C49=0),0,MATCH(0,OFFSET($D49,1,$C49,ROW($C$505)-ROW($C49)),0))","v":0},{"$f":"IF(OR($C49=\"S\",$C49=0),0,MATCH(OFFSET($D49,0,$C49)+1,OFFSET($D49,1,$C49,ROW($C$505)-ROW($C49)),0))","v":0},"","Serviço","Serviço","-","AGETOP",261602,"PINT.ESMALTE/ESQUAD.FERRO C/FUNDO ANTICOR.","m2    ",25.92,1,25.92,null,null,0,0,""]
[2,2,2,3,1,8,0,0,0,{"$f":"IF(OR($C50=\"S\",$C50=0),0,MATCH(0,OFFSET($D50,1,$C50,ROW($C$505)-ROW($C50)),0))","v":6},{"$f":"IF(OR($C50=\"S\",$C50=0),0,MATCH(OFFSET($D50,0,$C50)+1,OFFSET($D50,1,$C50,ROW($C$505)-ROW($C50)),0))","v":3},"","Nível 2","Nível 2","-","SINAPI",null,"FORROS","-",null,1,"-",null,null,0,0,""]
["S",2,"S",0,1,8,0,0,0,{"$f":"IF(OR($C51=\"S\",$C51=0),0,MATCH(0,OFFSET($D51,1,$C51,ROW($C$505)-ROW($C51)),0))","v":0},{"$f":"IF(OR($C51=\"S\",$C51=0),0,MATCH(OFFSET($D51,0,$C51)+1,OFFSET($D51,1,$C51,ROW($C$505)-ROW($C51)),0))","v":0},"","Serviço","Serviço","-","SINAPI",96114,"FORRO EM DRYWALL, PARA AMBIENTES COMERCIAIS, INCLUSIVE ESTRUTURA DE FIXAÇÃO. AF_05/2017_P","M2",60,1,60,null,null,0,0,""]
[{"$f":"CHOOSE(1+LOG(1+2*(ORÇAMENTO.Nivel=\"Nível 1\")+4*(ORÇAMENTO.Nivel=\"Nível 2\")+8*(ORÇAMENTO.Nivel=\"Nível 3\")+16*(ORÇAMENTO.Nivel=\"Nível 4\")+32*(ORÇAMENTO.Nivel=\"Serviço\"),2),0,1,2,3,4,\"S\")","v":"S"},{"$f":"IF(OR(C52=\"s\",C52=0),OFFSET(B52,-1,0),C52)","v":2},{"$f":"IF(OFFSET(C52,-1,0)=\"L\",1,IF(OFFSET(C52,-1,0)=1,2,IF(OR(A52=\"s\",A52=0),\"S\",IF(AND(OFFSET(C52,-1,0)=2,A52=4),3,IF(AND(OR(OFFSET(C52,-1,0)=\"s\",OFFSET(C52,-1,0)=0),A52<>\"s\",A52>OFFSET(B52,-1,0)),OFFSET(B52,-1,0),A52)))))","v":"S"},{"$f":"IF(OR(C52=\"S\",C52=0),0,IF(ISERROR(K52),J52,SMALL(J52:K52,1)))","v":0},{"$f":"IF($C52=1,OFFSET(E52,-1,0)+1,OFFSET(E52,-1,0))","v":1},{"$f":"IF($C52=1,0,IF($C52=2,OFFSET(F52,-1,0)+1,OFFSET(F52,-1,0)))","v":8},{"$f":"IF(AND($C52<=2,$C52<>0),0,IF($C52=3,OFFSET(G52,-1,0)+1,OFFSET(G52,-1,0)))","v":0},{"$f":"IF(AND($C52<=3,$C52<>0),0,IF($C52=4,OFFSET(H52,-1,0)+1,OFFSET(H52,-1,0)))","v":0},{"$f":"IF(AND($C52<=4,$C52<>0),0,IF(AND($C52=\"S\",$Y52>0),OFFSET(I52,-1,0)+1,OFFSET(I52,-1,0)))","v":0},{"$f":"IF(OR($C52=\"S\",$C52=0),0,MATCH(0,OFFSET($D52,1,$C52,ROW($C$505)-ROW($C52)),0))","v":0},{"$f":"IF(OR($C52=\"S\",$C52=0),0,MATCH(OFFSET($D52,0,$C52)+1,OFFSET($D52,1,$C52,ROW($C$505)-ROW($C52)),0))","v":0},"","Serviço","Serviço","-","AGETOP",210506,"TABICA PARA FORRO DE GESSO COMUM","m     ",65.5,1,65.5,null,null,0,0,""]
[2,2,2,3,1,9,0,0,0,{"$f":"IF(OR($C53=\"S\",$C53=0),0,MATCH(0,OFFSET($D53,1,$C53,ROW($C$505)-ROW($C53)),0))","v":3},{"$f":"IF(OR($C53=\"S\",$C53=0),0,MATCH(OFFSET($D53,0,$C53)+1,OFFSET($D53,1,$C53,ROW($C$505)-ROW($C53)),0))","v":{"$error":"#N/A"}},"","Nível 2","Nível 2","-","SINAPI",null,"FERRAGENS","-",null,1,"-",null,null,0,0,""]
["S",2,"S",0,1,9,0,0,0,{"$f":"IF(OR($C54=\"S\",$C54=0),0,MATCH(0,OFFSET($D54,1,$C54,ROW($C$505)-ROW($C54)),0))","v":0},{"$f":"IF(OR($C54=\"S\",$C54=0),0,MATCH(OFFSET($D54,0,$C54)+1,OFFSET($D54,1,$C54,ROW($C$505)-ROW($C54)),0))","v":0},"","Serviço","Serviço","-","AGETOP",230176,"BARRA DE APOIO EM AÇO INOX - 80 CM ","un    ",12,1,12,null,null,0,0,""]
["S",2,"S",0,1,9,0,0,0,{"$f":"IF(OR($C55=\"S\",$C55=0),0,MATCH(0,OFFSET($D55,1,$C55,ROW($C$505)-ROW($C55)),0))","v":0},{"$f":"IF(OR($C55=\"S\",$C55=0),0,MATCH(OFFSET($D55,0,$C55)+1,OFFSET($D55,1,$C55,ROW($C$505)-ROW($C55)),0))","v":0},"","Serviço","Serviço","-","AGETOP",230174,"BARRA DE APOIO EM AÇO INOX - 40 CM","un    ",16,1,16,null,null,0,0,""]
[1,1,1,4,2,0,0,0,0,{"$f":"IF(OR($C56=\"S\",$C56=0),0,MATCH(0,OFFSET($D56,1,$C56,ROW($C$505)-ROW($C56)),0))","v":449},{"$f":"IF(OR($C56=\"S\",$C56=0),0,MATCH(OFFSET($D56,0,$C56)+1,OFFSET($D56,1,$C56,ROW($C$505)-ROW($C56)),0))","v":4},"F","Nível 1","Nível 1","2.","SINAPI",null,"PINTURA DE PORTAS DE SALAS DE AULA","UN",1,1,1,null,null,0,0,""]
[2,2,2,3,2,1,0,0,0,{"$f":"IF(OR($C57=\"S\",$C57=0),0,MATCH(0,OFFSET($D57,1,$C57,ROW($C$505)-ROW($C57)),0))","v":3},{"$f":"IF(OR($C57=\"S\",$C57=0),0,MATCH(OFFSET($D57,0,$C57)+1,OFFSET($D57,1,$C57,ROW($C$505)-ROW($C57)),0))","v":6},"","Nível 2","Nível 2","-","SINAPI",null,"PINTURA","-",null,1,"-",null,null,0,0,""]
["S",2,"S",0,2,1,0,0,0,{"$f":"IF(OR($C58=\"S\",$C58=0),0,MATCH(0,OFFSET($D58,1,$C58,ROW($C$505)-ROW($C58)),0))","v":0},{"$f":"IF(OR($C58=\"S\",$C58=0),0,MATCH(OFFSET($D58,0,$C58)+1,OFFSET($D58,1,$C58,ROW($C$505)-ROW($C58)),0))","v":0},"","Serviço","Serviço","-","AGETOP",260105,"REMOCAO DE PINTURA ANTIGA A OLEO OU ESMALTE","m2    ",90.72,1,90.72,null,null,0,0,""]
["S",2,"S",0,2,1,0,0,0,{"$f":"IF(OR($C59=\"S\",$C59=0),0,MATCH(0,OFFSET($D59,1,$C59,ROW($C$505)-ROW($C59)),0))","v":0},{"$f":"IF(OR($C59=\"S\",$C59=0),0,MATCH(OFFSET($D59,0,$C59)+1,OFFSET($D59,1,$C59,ROW($C$505)-ROW($C59)),0))","v":0},"","Serviço","Serviço","-","AGETOP",261602,"PINT.ESMALTE/ESQUAD.FERRO C/FUNDO ANTICOR.","m2    ",90.72,1,90.72,null,null,0,0,""]
[1,1,1,8,3,0,0,0,0,{"$f":"IF(OR($C60=\"S\",$C60=0),0,MATCH(0,OFFSET($D60,1,$C60,ROW($C$505)-ROW($C60)),0))","v":445},{"$f":"IF(OR($C60=\"S\",$C60=0),0,MATCH(OFFSET($D60,0,$C60)+1,OFFSET($D60,1,$C60,ROW($C$505)-ROW($C60)),0))","v":8},"F","Nível 1","Nível 1","3.","SINAPI",null,"TROCA DE VIDROS QUEBRADOS DAS JANELAS","UN",1,1,1,null,null,0,0,""]
[2,2,2,2,3,1,0,0,0,{"$f":"IF(OR($C61=\"S\",$C61=0),0,MATCH(0,OFFSET($D61,1,$C61,ROW($C$505)-ROW($C61)),0))","v":7},{"$f":"IF(OR($C61=\"S\",$C61=0),0,MATCH(OFFSET($D61,0,$C61)+1,OFFSET($D61,1,$C61,ROW($C$505)-ROW($C61)),0))","v":2},"","Nível 2","Nível 2","-","SINAPI",null,"SERVIÇOS PRELIMINARES","-",null,1,"-",null,null,0,0,""]
["S",2,"S",0,3,1,0,0,0,{"$f":"IF(OR($C62=\"S\",$C62=0),0,MATCH(0,OFFSET($D62,1,$C62,ROW($C$505)-ROW($C62)),0))","v":0},{"$f":"IF(OR($C62=\"S\",$C62=0),0,MATCH(OFFSET($D62,0,$C62)+1,OFFSET($D62,1,$C62,ROW($C$505)-ROW($C62)),0))","v":0},"","Serviço","Serviço","-","SINAPI",88325,"VIDRACEIRO COM ENCARGOS COMPLEMENTARES","H",4.66,1,4.66,null,null,0,0,""]
[2,2,2,3,3,2,0,0,0,{"$f":"IF(OR($C63=\"S\",$C63=0),0,MATCH(0,OFFSET($D63,1,$C63,ROW($C$505)-ROW($C63)),0))","v":5},{"$f":"IF(OR($C63=\"S\",$C63=0),0,MATCH(OFFSET($D63,0,$C63)+1,OFFSET($D63,1,$C63,ROW($C$505)-ROW($C63)),0))","v":3},"","Nível 2","Nível 2","-","SINAPI",null,"TRANSPORTES","-",null,1,"-",null,null,0,0,""]
["S",2,"S",0,3,2,0,0,0,{"$f":"IF(OR($C64=\"S\",$C64=0),0,MATCH(0,OFFSET($D64,1,$C64,ROW($C$505)-ROW($C64)),0))","v":0},{"$f":"IF(OR($C64=\"S\",$C64=0),0,MATCH(OFFSET($D64,0,$C64)+1,OFFSET($D64,1,$C64,ROW($C$505)-ROW($C64)),0))","v":0},"","Serviço","Serviço","-","SINAPI",72900,"TRANSPORTE DE ENTULHO COM CAMINHAO BASCULANTE 6 M3, RODOVIA PAVIMENTADA, DMT 0,5 A 1,0 KM","M3",1.4,1,1.4,null,null,0,0,""]
["S",2,"S",0,3,2,0,0,0,{"$f":"IF(OR($C65=\"S\",$C65=0),0,MATCH(0,OFFSET($D65,1,$C65,ROW($C$505)-ROW($C65)),0))","v":0},{"$f":"IF(OR($C65=\"S\",$C65=0),0,MATCH(OFFSET($D65,0,$C65)+1,OFFSET($D65,1,$C65,ROW($C$505)-ROW($C65)),0))","v":0},"","Serviço","Serviço","-","SINAPI",72897,"CARGA MANUAL DE ENTULHO EM CAMINHAO BASCULANTE 6 M3","M3",1.4,1,1.4,null,null,0,0,""]
[{"$f":"CHOOSE(1+LOG(1+2*(ORÇAMENTO.Nivel=\"Nível 1\")+4*(ORÇAMENTO.Nivel=\"Nível 2\")+8*(ORÇAMENTO.Nivel=\"Nível 3\")+16*(ORÇAMENTO.Nivel=\"Nível 4\")+32*(ORÇAMENTO.Nivel=\"Serviço\"),2),0,1,2,3,4,\"S\")","v":2},{"$f":"IF(OR(C66=\"s\",C66=0),OFFSET(B66,-1,0),C66)","v":2},{"$f":"IF(OFFSET(C66,-1,0)=\"L\",1,IF(OFFSET(C66,-1,0)=1,2,IF(OR(A66=\"s\",A66=0),\"S\",IF(AND(OFFSET(C66,-1,0)=2,A66=4),3,IF(AND(OR(OFFSET(C66,-1,0)=\"s\",OFFSET(C66,-1,0)=0),A66<>\"s\",A66>OFFSET(B66,-1,0)),OFFSET(B66,-1,0),A66)))))","v":2},{"$f":"IF(OR(C66=\"S\",C66=0),0,IF(ISERROR(K66),J66,SMALL(J66:K66,1)))","v":2},{"$f":"IF($C66=1,OFFSET(E66,-1,0)+1,OFFSET(E66,-1,0))","v":3},{"$f":"IF($C66=1,0,IF($C66=2,OFFSET(F66,-1,0)+1,OFFSET(F66,-1,0)))","v":3},{"$f":"IF(AND($C66<=2,$C66<>0),0,IF($C66=3,OFFSET(G66,-1,0)+1,OFFSET(G66,-1,0)))","v":0},{"$f":"IF(AND($C66<=3,$C66<>0),0,IF($C66=4,OFFSET(H66,-1,0)+1,OFFSET(H66,-1,0)))","v":0},{"$f":"IF(AND($C66<=4,$C66<>0),0,IF(AND($C66=\"S\",$Y66>0),OFFSET(I66,-1,0)+1,OFFSET(I66,-1,0)))","v":0},{"$f":"IF(OR($C66=\"S\",$C66=0),0,MATCH(0,OFFSET($D66,1,$C66,ROW($C$505)-ROW($C66)),0))","v":2},{"$f":"IF(OR($C66=\"S\",$C66=0),0,MATCH(OFFSET($D66,0,$C66)+1,OFFSET($D66,1,$C66,ROW($C$505)-ROW($C66)),0))","v":14},"","Nível 2","Nível 2","-","SINAPI",null,"VIDROS","-",null,1,"-",null,null,0,0,""]
[{"$f":"CHOOSE(1+LOG(1+2*(ORÇAMENTO.Nivel=\"Nível 1\")+4*(ORÇAMENTO.Nivel=\"Nível 2\")+8*(ORÇAMENTO.Nivel=\"Nível 3\")+16*(ORÇAMENTO.Nivel=\"Nível 4\")+32*(ORÇAMENTO.Nivel=\"Serviço\"),2),0,1,2,3,4,\"S\")","v":"S"},{"$f":"IF(OR(C67=\"s\",C67=0),OFFSET(B67,-1,0),C67)","v":2},{"$f":"IF(OFFSET(C67,-1,0)=\"L\",1,IF(OFFSET(C67,-1,0)=1,2,IF(OR(A67=\"s\",A67=0),\"S\",IF(AND(OFFSET(C67,-1,0)=2,A67=4),3,IF(AND(OR(OFFSET(C67,-1,0)=\"s\",OFFSET(C67,-1,0)=0),A67<>\"s\",A67>OFFSET(B67,-1,0)),OFFSET(B67,-1,0),A67)))))","v":"S"},{"$f":"IF(OR(C67=\"S\",C67=0),0,IF(ISERROR(K67),J67,SMALL(J67:K67,1)))","v":0},{"$f":"IF($C67=1,OFFSET(E67,-1,0)+1,OFFSET(E67,-1,0))","v":3},{"$f":"IF($C67=1,0,IF($C67=2,OFFSET(F67,-1,0)+1,OFFSET(F67,-1,0)))","v":3},{"$f":"IF(AND($C67<=2,$C67<>0),0,IF($C67=3,OFFSET(G67,-1,0)+1,OFFSET(G67,-1,0)))","v":0},{"$f":"IF(AND($C67<=3,$C67<>0),0,IF($C67=4,OFFSET(H67,-1,0)+1,OFFSET(H67,-1,0)))","v":0},{"$f":"IF(AND($C67<=4,$C67<>0),0,IF(AND($C67=\"S\",$Y67>0),OFFSET(I67,-1,0)+1,OFFSET(I67,-1,0)))","v":0},{"$f":"IF(OR($C67=\"S\",$C67=0),0,MATCH(0,OFFSET($D67,1,$C67,ROW($C$505)-ROW($C67)),0))","v":0},{"$f":"IF(OR($C67=\"S\",$C67=0),0,MATCH(OFFSET($D67,0,$C67)+1,OFFSET($D67,1,$C67,ROW($C$505)-ROW($C67)),0))","v":0},"","Serviço","Serviço","-","AGETOP",190102,"VIDRO LISO 4 MM - COLOCADO","m2    ",35,1,35,null,null,0,0,""]
[1,1,1,29,4,0,0,0,0,{"$f":"IF(OR($C68=\"S\",$C68=0),0,MATCH(0,OFFSET($D68,1,$C68,ROW($C$505)-ROW($C68)),0))","v":437},{"$f":"IF(OR($C68=\"S\",$C68=0),0,MATCH(OFFSET($D68,0,$C68)+1,OFFSET($D68,1,$C68,ROW($C$505)-ROW($C68)),0))","v":29},"F","Nível 1","Nível 1","4.","SINAPI",null,"ELEVADOR","UN",1,1,1,null,null,0,0,""]
[{"$f":"CHOOSE(1+LOG(1+2*(ORÇAMENTO.Nivel=\"Nível 1\")+4*(ORÇAMENTO.Nivel=\"Nível 2\")+8*(ORÇAMENTO.Nivel=\"Nível 3\")+16*(ORÇAMENTO.Nivel=\"Nível 4\")+32*(ORÇAMENTO.Nivel=\"Serviço\"),2),0,1,2,3,4,\"S\")","v":2},2,2,3,4,1,0,0,{"$f":"IF(AND($C69<=4,$C69<>0),0,IF(AND($C69=\"S\",$Y69>0),OFFSET(I69,-1,0)+1,OFFSET(I69,-1,0)))","v":0},{"$f":"IF(OR($C69=\"S\",$C69=0),0,MATCH(0,OFFSET($D69,1,$C69,ROW($C$505)-ROW($C69)),0))","v":28},{"$f":"IF(OR($C69=\"S\",$C69=0),0,MATCH(OFFSET($D69,0,$C69)+1,OFFSET($D69,1,$C69,ROW($C$505)-ROW($C69)),0))","v":3},"","Nível 2","Nível 2","-","SINAPI",null,"SERVIÇOS PRELIMINARES","-",null,1,"-",null,null,0,0,""]
["S",2,"S",0,4,1,0,0,0,{"$f":"IF(OR($C70=\"S\",$C70=0),0,MATCH(0,OFFSET($D70,1,$C70,ROW($C$505)-ROW($C70)),0))","v":0},{"$f":"IF(OR($C70=\"S\",$C70=0),0,MATCH(OFFSET($D70,0,$C70)+1,OFFSET($D70,1,$C70,ROW($C$505)-ROW($C70)),0))","v":0},"","Serviço","Serviço","-","AGETOP",20109,"DEM.PISO CIMENT.SOBRE LASTRO CONC.C/TR.ATE CB. E CARGA","m2    ",3.3,1,3.3,null,null,0,0,""]
["S",2,"S",0,4,1,0,0,0,{"$f":"IF(OR($C71=\"S\",$C71=0),0,MATCH(0,OFFSET($D71,1,$C71,ROW($C$505)-ROW($C71)),0))","v":0},{"$f":"IF(OR($C71=\"S\",$C71=0),0,MATCH(OFFSET($D71,0,$C71)+1,OFFSET($D71,1,$C71,ROW($C$505)-ROW($C71)),0))","v":0},"","Serviço","Serviço","-","COMPOSIÇÃO","COMP 010_SEE","DEMOLIÇÃO DE GRADE/GRELHA/CORRIMÃO/GUARDA CORPO - METÁLICO","M2",3.5750000000000002,1,3.5750000000000002,null,null,0,0,""]
[2,{"$f":"IF(OR(C72=\"s\",C72=0),OFFSET(B72,-1,0),C72)","v":2},{"$f":"IF(OFFSET(C72,-1,0)=\"L\",1,IF(OFFSET(C72,-1,0)=1,2,IF(OR(A72=\"s\",A72=0),\"S\",IF(AND(OFFSET(C72,-1,0)=2,A72=4),3,IF(AND(OR(OFFSET(C72,-1,0)=\"s\",OFFSET(C72,-1,0)=0),A72<>\"s\",A72>OFFSET(B72,-1,0)),OFFSET(B72,-1,0),A72)))))","v":2},{"$f":"IF(OR(C72=\"S\",C72=0),0,IF(ISERROR(K72),J72,SMALL(J72:K72,1)))","v":3},{"$f":"IF($C72=1,OFFSET(E72,-1,0)+1,OFFSET(E72,-1,0))","v":4},{"$f":"IF($C72=1,0,IF($C72=2,OFFSET(F72,-1,0)+1,OFFSET(F72,-1,0)))","v":2},{"$f":"IF(AND($C72<=2,$C72<>0),0,IF($C72=3,OFFSET(G72,-1,0)+1,OFFSET(G72,-1,0)))","v":0},{"$f":"IF(AND($C72<=3,$C72<>0),0,IF($C72=4,OFFSET(H72,-1,0)+1,OFFSET(H72,-1,0)))","v":0},0,{"$f":"IF(OR($C72=\"S\",$C72=0),0,MATCH(0,OFFSET($D72,1,$C72,ROW($C$505)-ROW($C72)),0))","v":25},{"$f":"IF(OR($C72=\"S\",$C72=0),0,MATCH(OFFSET($D72,0,$C72)+1,OFFSET($D72,1,$C72,ROW($C$505)-ROW($C72)),0))","v":3},"","Nível 2","Nível 2","-","SINAPI",null,"TRANSPORTES","-",null,1,"-",null,null,0,0,""]
["S",2,"S",0,4,2,0,0,0,{"$f":"IF(OR($C73=\"S\",$C73=0),0,MATCH(0,OFFSET($D73,1,$C73,ROW($C$505)-ROW($C73)),0))","v":0},{"$f":"IF(OR($C73=\"S\",$C73=0),0,MATCH(OFFSET($D73,0,$C73)+1,OFFSET($D73,1,$C73,ROW($C$505)-ROW($C73)),0))","v":0},"","Serviço","Serviço","-","SINAPI",72900,"TRANSPORTE DE ENTULHO COM CAMINHAO BASCULANTE 6 M3, RODOVIA PAVIMENTADA, DMT 0,5 A 1,0 KM","M3",0.34,1,0.34,null,null,0,0,""]
["S",2,"S",0,4,2,0,0,0,{"$f":"IF(OR($C74=\"S\",$C74=0),0,MATCH(0,OFFSET($D74,1,$C74,ROW($C$505)-ROW($C74)),0))","v":0},{"$f":"IF(OR($C74=\"S\",$C74=0),0,MATCH(OFFSET($D74,0,$C74)+1,OFFSET($D74,1,$C74,ROW($C$505)-ROW($C74)),0))","v":0},"","Serviço","Serviço","-","SINAPI",72897,"CARGA MANUAL DE ENTULHO EM CAMINHAO BASCULANTE 6 M3","M3",0.34,1,0.34,null,null,0,0,""]
[2,2,2,5,4,3,0,0,0,{"$f":"IF(OR($C75=\"S\",$C75=0),0,MATCH(0,OFFSET($D75,1,$C75,ROW($C$505)-ROW($C75)),0))","v":22},{"$f":"IF(OR($C75=\"S\",$C75=0),0,MATCH(OFFSET($D75,0,$C75)+1,OFFSET($D75,1,$C75,ROW($C$505)-ROW($C75)),0))","v":5},"","Nível 2","Nível 2","-","SINAPI",null,"SERVIÇO EM TERRA","-",null,1,"-",null,null,0,0,""]
["S",2,"S",0,4,3,0,0,0,{"$f":"IF(OR($C76=\"S\",$C76=0),0,MATCH(0,OFFSET($D76,1,$C76,ROW($C$505)-ROW($C76)),0))","v":0},{"$f":"IF(OR($C76=\"S\",$C76=0),0,MATCH(OFFSET($D76,0,$C76)+1,OFFSET($D76,1,$C76,ROW($C$505)-ROW($C76)),0))","v":0},"","Serviço","Serviço","-","AGETOP",41010,"TRANSPORTE COM LÂMINA ATE 100 M - (OBRAS CIVIS)","m3    ",0.43,1,0.43,null,null,0,0,""]
["S",2,"S",0,4,3,0,0,0,{"$f":"IF(OR($C77=\"S\",$C77=0),0,MATCH(0,OFFSET($D77,1,$C77,ROW($C$505)-ROW($C77)),0))","v":0},{"$f":"IF(OR($C77=\"S\",$C77=0),0,MATCH(OFFSET($D77,0,$C77)+1,OFFSET($D77,1,$C77,ROW($C$505)-ROW($C77)),0))","v":0},"","Serviço","Serviço","-","AGETOP",41006,"TRANSPORTE DE MATERIAL ESCAVADO M3.KM","m3km  ",4.3,1,4.3,null,null,0,0,""]
["S",2,"S",0,4,3,0,0,0,{"$f":"IF(OR($C78=\"S\",$C78=0),0,MATCH(0,OFFSET($D78,1,$C78,ROW($C$505)-ROW($C78)),0))","v":0},{"$f":"IF(OR($C78=\"S\",$C78=0),0,MATCH(OFFSET($D78,0,$C78)+1,OFFSET($D78,1,$C78,ROW($C$505)-ROW($C78)),0))","v":0},"","Serviço","Serviço","-","AGETOP",41140,"REGULARIZAÇÃO DO TERRENO SEM APILOAMENTO COM TRANSPORTE MANUAL DA TERRA ESCAVADA ","m2    ",1.92,1,1.92,null,null,0,0,""]
["S",2,"S",0,4,3,0,0,0,{"$f":"IF(OR($C79=\"S\",$C79=0),0,MATCH(0,OFFSET($D79,1,$C79,ROW($C$505)-ROW($C79)),0))","v":0},{"$f":"IF(OR($C79=\"S\",$C79=0),0,MATCH(OFFSET($D79,0,$C79)+1,OFFSET($D79,1,$C79,ROW($C$505)-ROW($C79)),0))","v":0},"","Serviço","Serviço","-","AGETOP",41002,"APILOAMENTO","m2    ",1.92,1,1.92,null,null,0,0,""]
[2,2,2,2,4,4,0,0,0,{"$f":"IF(OR($C80=\"S\",$C80=0),0,MATCH(0,OFFSET($D80,1,$C80,ROW($C$505)-ROW($C80)),0))","v":17},{"$f":"IF(OR($C80=\"S\",$C80=0),0,MATCH(OFFSET($D80,0,$C80)+1,OFFSET($D80,1,$C80,ROW($C$505)-ROW($C80)),0))","v":2},"","Nível 2","Nível 2","-","SINAPI",null,"DIVERSOS","-",null,1,"-",null,null,0,0,""]
["S",2,"S",0,4,4,0,0,0,{"$f":"IF(OR($C81=\"S\",$C81=0),0,MATCH(0,OFFSET($D81,1,$C81,ROW($C$505)-ROW($C81)),0))","v":0},{"$f":"IF(OR($C81=\"S\",$C81=0),0,MATCH(OFFSET($D81,0,$C81)+1,OFFSET($D81,1,$C81,ROW($C$505)-ROW($C81)),0))","v":0},"","Serviço","Serviço","-","COMPOSIÇÃO","COMP 086_SEE","ELEVADOR (PLATAFORMA VERTICAL) MODELO HERA OU EQUIVALENTE 02 PARADAS - CAPACIDADE 280KG (INSTALADO)","UN ",1,1,1,null,null,0,0,""]
[2,2,2,2,4,5,0,0,0,{"$f":"IF(OR($C82=\"S\",$C82=0),0,MATCH(0,OFFSET($D82,1,$C82,ROW($C$505)-ROW($C82)),0))","v":15},{"$f":"IF(OR($C82=\"S\",$C82=0),0,MATCH(OFFSET($D82,0,$C82)+1,OFFSET($D82,1,$C82,ROW($C$505)-ROW($C82)),0))","v":2},"","Nível 2","Nível 2","-","SINAPI",null,"ALVENARIAS E DIVISÓRIAS","-",null,1,"-",null,null,0,0,""]
["S",2,"S",0,4,5,0,0,0,{"$f":"IF(OR($C83=\"S\",$C83=0),0,MATCH(0,OFFSET($D83,1,$C83,ROW($C$505)-ROW($C83)),0))","v":0},{"$f":"IF(OR($C83=\"S\",$C83=0),0,MATCH(OFFSET($D83,0,$C83)+1,OFFSET($D83,1,$C83,ROW($C$505)-ROW($C83)),0))","v":0},"","Serviço","Serviço","-","AGETOP",100201,"ALVENARIA DE TIJOLO FURADO 1/2 VEZ - 9 x 19 x 19 - ARG. (1CALH:4ARML+100KG DE CI/M3)","m2    ",39,1,39,null,null,0,0,""]
[2,2,2,3,4,6,0,0,0,{"$f":"IF(OR($C84=\"S\",$C84=0),0,MATCH(0,OFFSET($D84,1,$C84,ROW($C$505)-ROW($C84)),0))","v":13},{"$f":"IF(OR($C84=\"S\",$C84=0),0,MATCH(OFFSET($D84,0,$C84)+1,OFFSET($D84,1,$C84,ROW($C$505)-ROW($C84)),0))","v":3},"","Nível 2","Nível 2","-","SINAPI",null,"REVESTIMENTO DE PAREDE","-",null,1,"-",null,null,0,0,""]
["S",2,"S",0,4,6,0,0,0,{"$f":"IF(OR($C85=\"S\",$C85=0),0,MATCH(0,OFFSET($D85,1,$C85,ROW($C$505)-ROW($C85)),0))","v":0},{"$f":"IF(OR($C85=\"S\",$C85=0),0,MATCH(OFFSET($D85,0,$C85)+1,OFFSET($D85,1,$C85,ROW($C$505)-ROW($C85)),0))","v":0},"","Serviço","Serviço","-","AGETOP",200101,"CHAPISCO COMUM","m2    ",39,1,39,null,null,0,0,""]
["S",2,"S",0,4,6,0,0,0,{"$f":"IF(OR($C86=\"S\",$C86=0),0,MATCH(0,OFFSET($D86,1,$C86,ROW($C$505)-ROW($C86)),0))","v":0},{"$f":"IF(OR($C86=\"S\",$C86=0),0,MATCH(OFFSET($D86,0,$C86)+1,OFFSET($D86,1,$C86,ROW($C$505)-ROW($C86)),0))","v":0},"","Serviço","Serviço","-","AGETOP",200403,"REBOCO (1 CALH:4 ARFC+100kgCI/M3)","m2    ",39,1,39,null,null,0,0,""]
[2,2,2,3,4,7,0,0,0,{"$f":"IF(OR($C87=\"S\",$C87=0),0,MATCH(0,OFFSET($D87,1,$C87,ROW($C$505)-ROW($C87)),0))","v":10},{"$f":"IF(OR($C87=\"S\",$C87=0),0,MATCH(OFFSET($D87,0,$C87)+1,OFFSET($D87,1,$C87,ROW($C$505)-ROW($C87)),0))","v":3},"","Nível 2","Nível 2","-","SINAPI",null,"PINTURA","-",null,1,"-",null,null,0,0,""]
["S",2,"S",0,4,7,0,0,0,{"$f":"IF(OR($C88=\"S\",$C88=0),0,MATCH(0,OFFSET($D88,1,$C88,ROW($C$505)-ROW($C88)),0))","v":0},{"$f":"IF(OR($C88=\"S\",$C88=0),0,MATCH(OFFSET($D88,0,$C88)+1,OFFSET($D88,1,$C88,ROW($C$505)-ROW($C88)),0))","v":0},"","Serviço","Serviço","-","AGETOP",261000,"PINTURA LATEX ACRILICA 2 DEMAOS C/SELADOR","m2    ",39,1,39,null,null,0,0,""]
[{"$f":"CHOOSE(1+LOG(1+2*(ORÇAMENTO.Nivel=\"Nível 1\")+4*(ORÇAMENTO.Nivel=\"Nível 2\")+8*(ORÇAMENTO.Nivel=\"Nível 3\")+16*(ORÇAMENTO.Nivel=\"Nível 4\")+32*(ORÇAMENTO.Nivel=\"Serviço\"),2),0,1,2,3,4,\"S\")","v":"S"},{"$f":"IF(OR(C89=\"s\",C89=0),OFFSET(B89,-1,0),C89)","v":2},{"$f":"IF(OFFSET(C89,-1,0)=\"L\",1,IF(OFFSET(C89,-1,0)=1,2,IF(OR(A89=\"s\",A89=0),\"S\",IF(AND(OFFSET(C89,-1,0)=2,A89=4),3,IF(AND(OR(OFFSET(C89,-1,0)=\"s\",OFFSET(C89,-1,0)=0),A89<>\"s\",A89>OFFSET(B89,-1,0)),OFFSET(B89,-1,0),A89)))))","v":"S"},{"$f":"IF(OR(C89=\"S\",C89=0),0,IF(ISERROR(K89),J89,SMALL(J89:K89,1)))","v":0},{"$f":"IF($C89=1,OFFSET(E89,-1,0)+1,OFFSET(E89,-1,0))","v":4},{"$f":"IF($C89=1,0,IF($C89=2,OFFSET(F89,-1,0)+1,OFFSET(F89,-1,0)))","v":7},{"$f":"IF(AND($C89<=2,$C89<>0),0,IF($C89=3,OFFSET(G89,-1,0)+1,OFFSET(G89,-1,0)))","v":0},{"$f":"IF(AND($C89<=3,$C89<>0),0,IF($C89=4,OFFSET(H89,-1,0)+1,OFFSET(H89,-1,0)))","v":0},{"$f":"IF(AND($C89<=4,$C89<>0),0,IF(AND($C89=\"S\",$Y89>0),OFFSET(I89,-1,0)+1,OFFSET(I89,-1,0)))","v":0},{"$f":"IF(OR($C89=\"S\",$C89=0),0,MATCH(0,OFFSET($D89,1,$C89,ROW($C$505)-ROW($C89)),0))","v":0},{"$f":"IF(OR($C89=\"S\",$C89=0),0,MATCH(OFFSET($D89,0,$C89)+1,OFFSET($D89,1,$C89,ROW($C$505)-ROW($C89)),0))","v":0},"","Serviço","Serviço","-","AGETOP",261609,"PINTURA ESMALTE ALQUIDICO ESTR.METALICA 2 DEMAOS","m2    ",1.92,1,1.92,null,null,0,0,""]
[2,2,2,5,4,8,0,0,0,{"$f":"IF(OR($C90=\"S\",$C90=0),0,MATCH(0,OFFSET($D90,1,$C90,ROW($C$505)-ROW($C90)),0))","v":7},{"$f":"IF(OR($C90=\"S\",$C90=0),0,MATCH(OFFSET($D90,0,$C90)+1,OFFSET($D90,1,$C90,ROW($C$505)-ROW($C90)),0))","v":5},"","Nível 2","Nível 2","-","SINAPI",null,"REVESTIMENTO DE PISO","-",null,1,"-",null,null,0,0,""]
["S",2,"S",0,4,8,0,0,0,{"$f":"IF(OR($C91=\"S\",$C91=0),0,MATCH(0,OFFSET($D91,1,$C91,ROW($C$505)-ROW($C91)),0))","v":0},{"$f":"IF(OR($C91=\"S\",$C91=0),0,MATCH(OFFSET($D91,0,$C91)+1,OFFSET($D91,1,$C91,ROW($C$505)-ROW($C91)),0))","v":0},"","Serviço","Serviço","-","AGETOP",220101,"LASTRO DE CONCRETO REGULARIZADO IMPERMEABILIZADO 1:3:6 ESP=5CM (BASE)","m2    ",1.92,1,1.92,null,null,0,0,""]
["S",2,"S",0,4,8,0,0,0,{"$f":"IF(OR($C92=\"S\",$C92=0),0,MATCH(0,OFFSET($D92,1,$C92,ROW($C$505)-ROW($C92)),0))","v":0},{"$f":"IF(OR($C92=\"S\",$C92=0),0,MATCH(OFFSET($D92,0,$C92)+1,OFFSET($D92,1,$C92,ROW($C$505)-ROW($C92)),0))","v":0},"","Serviço","Serviço","-","AGETOP",221101,"GRANITINA 8MM FUNDIDA COM CONTRAPISO (1CI:3ARML) E=2CM E JUNTA PLASTICA 27MM","m2    ",1.92,1,1.92,null,null,0,0,""]
["S",2,"S",0,4,8,0,0,0,{"$f":"IF(OR($C93=\"S\",$C93=0),0,MATCH(0,OFFSET($D93,1,$C93,ROW($C$505)-ROW($C93)),0))","v":0},{"$f":"IF(OR($C93=\"S\",$C93=0),0,MATCH(OFFSET($D93,0,$C93)+1,OFFSET($D93,1,$C93,ROW($C$505)-ROW($C93)),0))","v":0},"","Serviço","Serviço","-","AGETOP",221102,"RODAPÉ FUNDIDO DE GRANITINA 7CM","m     ",1.1399999999999999,1,1.1399999999999999,null,null,0,0,""]
["S",2,"S",0,4,8,0,0,0,{"$f":"IF(OR($C94=\"S\",$C94=0),0,MATCH(0,OFFSET($D94,1,$C94,ROW($C$505)-ROW($C94)),0))","v":0},{"$f":"IF(OR($C94=\"S\",$C94=0),0,MATCH(OFFSET($D94,0,$C94)+1,OFFSET($D94,1,$C94,ROW($C$505)-ROW($C94)),0))","v":0},"","Serviço","Serviço","-","AGETOP",221104,"RASPAGEM E APLICAÇÃO RESINA ACRÍLICA DUAS DEMÃOS","m2    ",1.9998,1,1.9998,null,null,0,0,""]
[2,2,2,2,4,9,0,0,0,{"$f":"IF(OR($C95=\"S\",$C95=0),0,MATCH(0,OFFSET($D95,1,$C95,ROW($C$505)-ROW($C95)),0))","v":2},{"$f":"IF(OR($C95=\"S\",$C95=0),0,MATCH(OFFSET($D95,0,$C95)+1,OFFSET($D95,1,$C95,ROW($C$505)-ROW($C95)),0))","v":{"$error":"#N/A"}},"","Nível 2","Nível 2","-","SINAPI",null,"ESQUADRIAS METÁLICAS","-",null,1,"-",null,null,0,0,""]
["S",2,"S",0,4,9,0,0,0,{"$f":"IF(OR($C96=\"S\",$C96=0),0,MATCH(0,OFFSET($D96,1,$C96,ROW($C$505)-ROW($C96)),0))","v":0},{"$f":"IF(OR($C96=\"S\",$C96=0),0,MATCH(OFFSET($D96,0,$C96)+1,OFFSET($D96,1,$C96,ROW($C$505)-ROW($C96)),0))","v":0},"","Serviço","Serviço","-","COMPOSIÇÃO","COMP 085_SEE","GUARDA-CORPO - SEDUC","M",4.2,1,4.2,null,null,0,0,""]
[1,1,1,31,5,0,0,0,0,{"$f":"IF(OR($C97=\"S\",$C97=0),0,MATCH(0,OFFSET($D97,1,$C97,ROW($C$505)-ROW($C97)),0))","v":408},{"$f":"IF(OR($C97=\"S\",$C97=0),0,MATCH(OFFSET($D97,0,$C97)+1,OFFSET($D97,1,$C97,ROW($C$505)-ROW($C97)),0))","v":31},"F","Nível 1","Nível 1","5.","SINAPI",null,"ACESSO À QUADRA","UN",1,1,1,null,null,0,0,""]
[2,2,2,5,5,1,0,0,0,{"$f":"IF(OR($C98=\"S\",$C98=0),0,MATCH(0,OFFSET($D98,1,$C98,ROW($C$505)-ROW($C98)),0))","v":30},{"$f":"IF(OR($C98=\"S\",$C98=0),0,MATCH(OFFSET($D98,0,$C98)+1,OFFSET($D98,1,$C98,ROW($C$505)-ROW($C98)),0))","v":5},"","Nível 2","Nível 2","-","SINAPI",null,"SERVIÇOS PRELIMINARES","-",null,1,"-",null,null,0,0,""]
["S",2,"S",0,5,1,0,0,0,{"$f":"IF(OR($C99=\"S\",$C99=0),0,MATCH(0,OFFSET($D99,1,$C99,ROW($C$505)-ROW($C99)),0))","v":0},{"$f":"IF(OR($C99=\"S\",$C99=0),0,MATCH(OFFSET($D99,0,$C99)+1,OFFSET($D99,1,$C99,ROW($C$505)-ROW($C99)),0))","v":0},"","Serviço","Serviço","-","AGETOP",20109,"DEM.PISO CIMENT.SOBRE LASTRO CONC.C/TR.ATE CB. E CARGA","m2    ",80,1,80,null,null,0,0,""]
["S",2,"S",0,5,1,0,0,0,{"$f":"IF(OR($C100=\"S\",$C100=0),0,MATCH(0,OFFSET($D100,1,$C100,ROW($C$505)-ROW($C100)),0))","v":0},{"$f":"IF(OR($C100=\"S\",$C100=0),0,MATCH(OFFSET($D100,0,$C100)+1,OFFSET($D100,1,$C100,ROW($C$505)-ROW($C100)),0))","v":0},"","Serviço","Serviço","-","COMPOSIÇÃO","COMP 385_SEE","DEMOLIÇÃO POSTE DE CONCRETO/METALICA ENTRE 10 E 15 METROS C/ REAPROVEITAMENTO C/ TRANSPORTE ATE CAÇAMBA E CARGA","UN ",1,1,1,null,null,0,0,""]
["S",2,"S",0,5,1,0,0,0,{"$f":"IF(OR($C101=\"S\",$C101=0),0,MATCH(0,OFFSET($D101,1,$C101,ROW($C$505)-ROW($C101)),0))","v":0},{"$f":"IF(OR($C101=\"S\",$C101=0),0,MATCH(OFFSET($D101,0,$C101)+1,OFFSET($D101,1,$C101,ROW($C$505)-ROW($C101)),0))","v":0},"","Serviço","Serviço","-","AGETOP",20118,"DEM.ALVEN.TIJOLO S/REAP. C/TR.ATE CB. E CARGA","m3    ",0.21,1,0.21,null,null,0,0,""]
["S",2,"S",0,5,1,0,0,0,{"$f":"IF(OR($C102=\"S\",$C102=0),0,MATCH(0,OFFSET($D102,1,$C102,ROW($C$505)-ROW($C102)),0))","v":0},{"$f":"IF(OR($C102=\"S\",$C102=0),0,MATCH(OFFSET($D102,0,$C102)+1,OFFSET($D102,1,$C102,ROW($C$505)-ROW($C102)),0))","v":0},"","Serviço","Serviço","-","SINAPI",98528,"REMOÇÃO DE RAÍZES REMANESCENTES DE TRONCO DE ÁRVORE COM DIÂMETRO MAIOR OU IGUAL A 0,60 M.AF_05/2018","UN",4,1,4,null,null,0,0,""]
[2,2,2,3,5,2,0,0,0,{"$f":"IF(OR($C103=\"S\",$C103=0),0,MATCH(0,OFFSET($D103,1,$C103,ROW($C$505)-ROW($C103)),0))","v":25},{"$f":"IF(OR($C103=\"S\",$C103=0),0,MATCH(OFFSET($D103,0,$C103)+1,OFFSET($D103,1,$C103,ROW($C$505)-ROW($C103)),0))","v":3},"","Nível 2","Nível 2","-","SINAPI",null,"TRANSPORTES","-",null,1,"-",null,null,0,0,""]
["S",2,"S",0,5,2,0,0,0,{"$f":"IF(OR($C104=\"S\",$C104=0),0,MATCH(0,OFFSET($D104,1,$C104,ROW($C$505)-ROW($C104)),0))","v":0},{"$f":"IF(OR($C104=\"S\",$C104=0),0,MATCH(OFFSET($D104,0,$C104)+1,OFFSET($D104,1,$C104,ROW($C$505)-ROW($C104)),0))","v":0},"","Serviço","Serviço","-","SINAPI",72900,"TRANSPORTE DE ENTULHO COM CAMINHAO BASCULANTE 6 M3, RODOVIA PAVIMENTADA, DMT 0,5 A 1,0 KM","M3",4.21,1,4.21,null,null,0,0,""]
["S",2,"S",0,5,2,0,0,0,{"$f":"IF(OR($C105=\"S\",$C105=0),0,MATCH(0,OFFSET($D105,1,$C105,ROW($C$505)-ROW($C105)),0))","v":0},{"$f":"IF(OR($C105=\"S\",$C105=0),0,MATCH(OFFSET($D105,0,$C105)+1,OFFSET($D105,1,$C105,ROW($C$505)-ROW($C105)),0))","v":0},"","Serviço","Serviço","-","SINAPI",72897,"CARGA MANUAL DE ENTULHO EM CAMINHAO BASCULANTE 6 M3","M3",4.21,1,4.21,null,null,0,0,""]
[2,2,2,3,5,3,0,0,0,{"$f":"IF(OR($C106=\"S\",$C106=0),0,MATCH(0,OFFSET($D106,1,$C106,ROW($C$505)-ROW($C106)),0))","v":22},{"$f":"IF(OR($C106=\"S\",$C106=0),0,MATCH(OFFSET($D106,0,$C106)+1,OFFSET($D106,1,$C106,ROW($C$505)-ROW($C106)),0))","v":3},"","Nível 2","Nível 2","-","SINAPI",null,"DIVERSOS","-",null,1,"-",null,null,0,0,""]
[{"$f":"CHOOSE(1+LOG(1+2*(ORÇAMENTO.Nivel=\"Nível 1\")+4*(ORÇAMENTO.Nivel=\"Nível 2\")+8*(ORÇAMENTO.Nivel=\"Nível 3\")+16*(ORÇAMENTO.Nivel=\"Nível 4\")+32*(ORÇAMENTO.Nivel=\"Serviço\"),2),0,1,2,3,4,\"S\")","v":3},{"$f":"IF(OR(C107=\"s\",C107=0),OFFSET(B107,-1,0),C107)","v":3},{"$f":"IF(OFFSET(C107,-1,0)=\"L\",1,IF(OFFSET(C107,-1,0)=1,2,IF(OR(A107=\"s\",A107=0),\"S\",IF(AND(OFFSET(C107,-1,0)=2,A107=4),3,IF(AND(OR(OFFSET(C107,-1,0)=\"s\",OFFSET(C107,-1,0)=0),A107<>\"s\",A107>OFFSET(B107,-1,0)),OFFSET(B107,-1,0),A107)))))","v":3},{"$f":"IF(OR(C107=\"S\",C107=0),0,IF(ISERROR(K107),J107,SMALL(J107:K107,1)))","v":2},{"$f":"IF($C107=1,OFFSET(E107,-1,0)+1,OFFSET(E107,-1,0))","v":5},{"$f":"IF($C107=1,0,IF($C107=2,OFFSET(F107,-1,0)+1,OFFSET(F107,-1,0)))","v":3},{"$f":"IF(AND($C107<=2,$C107<>0),0,IF($C107=3,OFFSET(G107,-1,0)+1,OFFSET(G107,-1,0)))","v":1},{"$f":"IF(AND($C107<=3,$C107<>0),0,IF($C107=4,OFFSET(H107,-1,0)+1,OFFSET(H107,-1,0)))","v":0},{"$f":"IF(AND($C107<=4,$C107<>0),0,IF(AND($C107=\"S\",$Y107>0),OFFSET(I107,-1,0)+1,OFFSET(I107,-1,0)))","v":0},{"$f":"IF(OR($C107=\"S\",$C107=0),0,MATCH(0,OFFSET($D107,1,$C107,ROW($C$505)-ROW($C107)),0))","v":2},{"$f":"IF(OR($C107=\"S\",$C107=0),0,MATCH(OFFSET($D107,0,$C107)+1,OFFSET($D107,1,$C107,ROW($C$505)-ROW($C107)),0))","v":172},"","Nível 3","Nível 3","-","SINAPI",null,"RELOCAÇÃO DO POSTE","-",null,1,"-",null,null,0,0,""]
["S",3,"S",0,5,3,1,0,0,{"$f":"IF(OR($C108=\"S\",$C108=0),0,MATCH(0,OFFSET($D108,1,$C108,ROW($C$505)-ROW($C108)),0))","v":0},{"$f":"IF(OR($C108=\"S\",$C108=0),0,MATCH(OFFSET($D108,0,$C108)+1,OFFSET($D108,1,$C108,ROW($C$505)-ROW($C108)),0))","v":0},"","Serviço","Serviço","-","AGETOP",71993,"POSTE SIMPLES,CÔNICO CONTÍNUO, CIRCULAR, RETO, COM DIÂMETRO NOMINAL DE 60MM NA EXTREMIDADE, GALVANIZADO A FOGO, Hútil= 12 M - ENGASTADO EM CONCRETO COM FCK = 13,5 MPA","Un    ",1,1,1,null,null,0,0,""]
[2,2,2,6,5,4,0,0,0,{"$f":"IF(OR($C109=\"S\",$C109=0),0,MATCH(0,OFFSET($D109,1,$C109,ROW($C$505)-ROW($C109)),0))","v":19},{"$f":"IF(OR($C109=\"S\",$C109=0),0,MATCH(OFFSET($D109,0,$C109)+1,OFFSET($D109,1,$C109,ROW($C$505)-ROW($C109)),0))","v":6},"","Nível 2","Nível 2","-","SINAPI",null,"SERVIÇO EM TERRA","-",null,1,"-",null,null,0,0,""]
["S",2,"S",0,5,4,0,0,0,{"$f":"IF(OR($C110=\"S\",$C110=0),0,MATCH(0,OFFSET($D110,1,$C110,ROW($C$505)-ROW($C110)),0))","v":0},{"$f":"IF(OR($C110=\"S\",$C110=0),0,MATCH(OFFSET($D110,0,$C110)+1,OFFSET($D110,1,$C110,ROW($C$505)-ROW($C110)),0))","v":0},"","Serviço","Serviço","-","AGETOP",41140,"REGULARIZAÇÃO DO TERRENO SEM APILOAMENTO COM TRANSPORTE MANUAL DA TERRA ESCAVADA ","m2    ",65,1,65,null,null,0,0,""]
["S",2,"S",0,5,4,0,0,0,{"$f":"IF(OR($C111=\"S\",$C111=0),0,MATCH(0,OFFSET($D111,1,$C111,ROW($C$505)-ROW($C111)),0))","v":0},{"$f":"IF(OR($C111=\"S\",$C111=0),0,MATCH(OFFSET($D111,0,$C111)+1,OFFSET($D111,1,$C111,ROW($C$505)-ROW($C111)),0))","v":0},"","Serviço","Serviço","-","AGETOP",41002,"APILOAMENTO","m2    ",65,1,65,null,null,0,0,""]
["S",2,"S",0,5,4,0,0,0,{"$f":"IF(OR($C112=\"S\",$C112=0),0,MATCH(0,OFFSET($D112,1,$C112,ROW($C$505)-ROW($C112)),0))","v":0},{"$f":"IF(OR($C112=\"S\",$C112=0),0,MATCH(OFFSET($D112,0,$C112)+1,OFFSET($D112,1,$C112,ROW($C$505)-ROW($C112)),0))","v":0},"","Serviço","Serviço","-","AGETOP",41006,"TRANSPORTE DE MATERIAL ESCAVADO M3.KM","m3km  ",47.5,1,47.5,null,null,0,0,""]
["S",2,"S",0,5,4,0,0,0,{"$f":"IF(OR($C113=\"S\",$C113=0),0,MATCH(0,OFFSET($D113,1,$C113,ROW($C$505)-ROW($C113)),0))","v":0},{"$f":"IF(OR($C113=\"S\",$C113=0),0,MATCH(OFFSET($D113,0,$C113)+1,OFFSET($D113,1,$C113,ROW($C$505)-ROW($C113)),0))","v":0},"","Serviço","Serviço","-","AGETOP",41010,"TRANSPORTE COM LÂMINA ATE 100 M - (OBRAS CIVIS)","m3    ",4.75,1,4.75,null,null,0,0,""]
["S",2,"S",0,5,4,0,0,0,{"$f":"IF(OR($C114=\"S\",$C114=0),0,MATCH(0,OFFSET($D114,1,$C114,ROW($C$505)-ROW($C114)),0))","v":0},{"$f":"IF(OR($C114=\"S\",$C114=0),0,MATCH(OFFSET($D114,0,$C114)+1,OFFSET($D114,1,$C114,ROW($C$505)-ROW($C114)),0))","v":0},"","Serviço","Serviço","-","AGETOP",41009,"COMPACTAÇÃO MECÂNICA SEM CONTROLE LABORATÓRIO","m3    ",3.8,1,3.8,null,null,0,0,""]
[2,2,2,3,5,5,0,0,0,{"$f":"IF(OR($C115=\"S\",$C115=0),0,MATCH(0,OFFSET($D115,1,$C115,ROW($C$505)-ROW($C115)),0))","v":13},{"$f":"IF(OR($C115=\"S\",$C115=0),0,MATCH(OFFSET($D115,0,$C115)+1,OFFSET($D115,1,$C115,ROW($C$505)-ROW($C115)),0))","v":3},"","Nível 2","Nível 2","-","SINAPI",null,"ALVENARIAS E DIVISÓRIAS","-",null,1,"-",null,null,0,0,""]
["S",2,"S",0,5,5,0,0,0,{"$f":"IF(OR($C116=\"S\",$C116=0),0,MATCH(0,OFFSET($D116,1,$C116,ROW($C$505)-ROW($C116)),0))","v":0},{"$f":"IF(OR($C116=\"S\",$C116=0),0,MATCH(OFFSET($D116,0,$C116)+1,OFFSET($D116,1,$C116,ROW($C$505)-ROW($C116)),0))","v":0},"","Serviço","Serviço","-","AGETOP",61130,"MURO ARRIMO PADRÃO GOINFRA EM CANALETA SEM REVESTIMENTO-(COM ALTURA ATÉ 2,50M)-INCLUSO FUNDAÇÃO","m2    ",26,1,26,null,null,0,0,""]
["S",2,"S",0,5,5,0,0,0,{"$f":"IF(OR($C117=\"S\",$C117=0),0,MATCH(0,OFFSET($D117,1,$C117,ROW($C$505)-ROW($C117)),0))","v":0},{"$f":"IF(OR($C117=\"S\",$C117=0),0,MATCH(OFFSET($D117,0,$C117)+1,OFFSET($D117,1,$C117,ROW($C$505)-ROW($C117)),0))","v":0},"","Serviço","Serviço","-","AGETOP",100201,"ALVENARIA DE TIJOLO FURADO 1/2 VEZ - 9 x 19 x 19 - ARG. (1CALH:4ARML+100KG DE CI/M3)","m2    ",50,1,50,null,null,0,0,""]
[2,2,2,3,5,6,0,0,0,{"$f":"IF(OR($C118=\"S\",$C118=0),0,MATCH(0,OFFSET($D118,1,$C118,ROW($C$505)-ROW($C118)),0))","v":10},{"$f":"IF(OR($C118=\"S\",$C118=0),0,MATCH(OFFSET($D118,0,$C118)+1,OFFSET($D118,1,$C118,ROW($C$505)-ROW($C118)),0))","v":3},"","Nível 2","Nível 2","-","SINAPI",null,"REVESTIMENTO DE PAREDE","-",null,1,"-",null,null,0,0,""]
["S",2,"S",0,5,6,0,0,0,{"$f":"IF(OR($C119=\"S\",$C119=0),0,MATCH(0,OFFSET($D119,1,$C119,ROW($C$505)-ROW($C119)),0))","v":0},{"$f":"IF(OR($C119=\"S\",$C119=0),0,MATCH(OFFSET($D119,0,$C119)+1,OFFSET($D119,1,$C119,ROW($C$505)-ROW($C119)),0))","v":0},"","Serviço","Serviço","-","AGETOP",200101,"CHAPISCO COMUM","m2    ",133,1,133,null,null,0,0,""]
["S",2,"S",0,5,6,0,0,0,{"$f":"IF(OR($C120=\"S\",$C120=0),0,MATCH(0,OFFSET($D120,1,$C120,ROW($C$505)-ROW($C120)),0))","v":0},{"$f":"IF(OR($C120=\"S\",$C120=0),0,MATCH(OFFSET($D120,0,$C120)+1,OFFSET($D120,1,$C120,ROW($C$505)-ROW($C120)),0))","v":0},"","Serviço","Serviço","-","AGETOP",200403,"REBOCO (1 CALH:4 ARFC+100kgCI/M3)","m2    ",133,1,133,null,null,0,0,""]
[2,2,2,2,5,7,0,0,0,{"$f":"IF(OR($C121=\"S\",$C121=0),0,MATCH(0,OFFSET($D121,1,$C121,ROW($C$505)-ROW($C121)),0))","v":7},{"$f":"IF(OR($C121=\"S\",$C121=0),0,MATCH(OFFSET($D121,0,$C121)+1,OFFSET($D121,1,$C121,ROW($C$505)-ROW($C121)),0))","v":2},"","Nível 2","Nível 2","-","SINAPI",null,"PINTURA","-",null,1,"-",null,null,0,0,""]
["S",2,"S",0,5,7,0,0,0,{"$f":"IF(OR($C122=\"S\",$C122=0),0,MATCH(0,OFFSET($D122,1,$C122,ROW($C$505)-ROW($C122)),0))","v":0},{"$f":"IF(OR($C122=\"S\",$C122=0),0,MATCH(OFFSET($D122,0,$C122)+1,OFFSET($D122,1,$C122,ROW($C$505)-ROW($C122)),0))","v":0},"","Serviço","Serviço","-","AGETOP",261302,"PINTURA LATEX DUAS DEMAOS COM SELADOR","m2    ",133,1,133,null,null,0,0,""]
[2,2,2,2,5,8,0,0,0,{"$f":"IF(OR($C123=\"S\",$C123=0),0,MATCH(0,OFFSET($D123,1,$C123,ROW($C$505)-ROW($C123)),0))","v":5},{"$f":"IF(OR($C123=\"S\",$C123=0),0,MATCH(OFFSET($D123,0,$C123)+1,OFFSET($D123,1,$C123,ROW($C$505)-ROW($C123)),0))","v":2},"","Nível 2","Nível 2","-","SINAPI",null,"REVESTIMENTO DE PISO","-",null,1,"-",null,null,0,0,""]
["S",2,"S",0,5,8,0,0,0,{"$f":"IF(OR($C124=\"S\",$C124=0),0,MATCH(0,OFFSET($D124,1,$C124,ROW($C$505)-ROW($C124)),0))","v":0},{"$f":"IF(OR($C124=\"S\",$C124=0),0,MATCH(OFFSET($D124,0,$C124)+1,OFFSET($D124,1,$C124,ROW($C$505)-ROW($C124)),0))","v":0},"","Serviço","Serviço","-","AGETOP",220102,"PISO CONCRETO DESEMPENADO ESPESSURA = 5 CM  1:2,5:3,5","m2    ",115,1,115,null,null,0,0,""]
[2,2,2,3,5,9,0,0,0,{"$f":"IF(OR($C125=\"S\",$C125=0),0,MATCH(0,OFFSET($D125,1,$C125,ROW($C$505)-ROW($C125)),0))","v":3},{"$f":"IF(OR($C125=\"S\",$C125=0),0,MATCH(OFFSET($D125,0,$C125)+1,OFFSET($D125,1,$C125,ROW($C$505)-ROW($C125)),0))","v":{"$error":"#N/A"}},"","Nível 2","Nível 2","-","SINAPI",null,"ESQUADRIAS METÁLICAS","-",null,1,"-",null,null,0,0,""]
["S",2,"S",0,5,9,0,0,0,{"$f":"IF(OR($C126=\"S\",$C126=0),0,MATCH(0,OFFSET($D126,1,$C126,ROW($C$505)-ROW($C126)),0))","v":0},{"$f":"IF(OR($C126=\"S\",$C126=0),0,MATCH(OFFSET($D126,0,$C126)+1,OFFSET($D126,1,$C126,ROW($C$505)-ROW($C126)),0))","v":0},"","Serviço","Serviço","-","COMPOSIÇÃO","COMP 082_SEE","CORRIMÃO PAREDE - SEDUC","M",45.8,1,45.8,null,null,0,0,""]
["S",2,"S",0,5,9,0,0,0,{"$f":"IF(OR($C127=\"S\",$C127=0),0,MATCH(0,OFFSET($D127,1,$C127,ROW($C$505)-ROW($C127)),0))","v":0},{"$f":"IF(OR($C127=\"S\",$C127=0),0,MATCH(OFFSET($D127,0,$C127)+1,OFFSET($D127,1,$C127,ROW($C$505)-ROW($C127)),0))","v":0},"","Serviço","Serviço","-","COMPOSIÇÃO","COMP 084_SEE","GUARDA-CORPO COM CORRIMÃO - SEDUC","M",9.9,1,9.9,null,null,0,0,""]
[1,1,1,12,6,0,0,0,0,{"$f":"IF(OR($C128=\"S\",$C128=0),0,MATCH(0,OFFSET($D128,1,$C128,ROW($C$505)-ROW($C128)),0))","v":377},{"$f":"IF(OR($C128=\"S\",$C128=0),0,MATCH(OFFSET($D128,0,$C128)+1,OFFSET($D128,1,$C128,ROW($C$505)-ROW($C128)),0))","v":12},"F","Nível 1","Nível 1","6.","AGETOP",null,"CENTRAL DE GÁS","UN",1,1,1,null,null,0,0,""]
[2,2,2,2,6,1,0,0,0,{"$f":"IF(OR($C129=\"S\",$C129=0),0,MATCH(0,OFFSET($D129,1,$C129,ROW($C$505)-ROW($C129)),0))","v":11},{"$f":"IF(OR($C129=\"S\",$C129=0),0,MATCH(OFFSET($D129,0,$C129)+1,OFFSET($D129,1,$C129,ROW($C$505)-ROW($C129)),0))","v":2},"","Nível 2","Nível 2","-","AGETOP",null,"SERVIÇOS PRELIMINARES","-",null,1,"-",null,null,0,0,""]
["S",2,"S",0,6,1,0,0,0,{"$f":"IF(OR($C130=\"S\",$C130=0),0,MATCH(0,OFFSET($D130,1,$C130,ROW($C$505)-ROW($C130)),0))","v":0},{"$f":"IF(OR($C130=\"S\",$C130=0),0,MATCH(OFFSET($D130,0,$C130)+1,OFFSET($D130,1,$C130,ROW($C$505)-ROW($C130)),0))","v":0},"","Serviço","Serviço","-","AGETOP",20118,"DEM.ALVEN.TIJOLO S/REAP. C/TR.ATE CB. E CARGA","m3    ",1.23,1,1.23,null,null,0,0,""]
[2,2,2,3,6,2,0,0,0,{"$f":"IF(OR($C131=\"S\",$C131=0),0,MATCH(0,OFFSET($D131,1,$C131,ROW($C$505)-ROW($C131)),0))","v":9},{"$f":"IF(OR($C131=\"S\",$C131=0),0,MATCH(OFFSET($D131,0,$C131)+1,OFFSET($D131,1,$C131,ROW($C$505)-ROW($C131)),0))","v":3},"","Nível 2","Nível 2","-","SINAPI",null,"TRANSPORTES","-",null,1,"-",null,null,0,0,""]
["S",2,"S",0,6,2,0,0,0,{"$f":"IF(OR($C132=\"S\",$C132=0),0,MATCH(0,OFFSET($D132,1,$C132,ROW($C$505)-ROW($C132)),0))","v":0},{"$f":"IF(OR($C132=\"S\",$C132=0),0,MATCH(OFFSET($D132,0,$C132)+1,OFFSET($D132,1,$C132,ROW($C$505)-ROW($C132)),0))","v":0},"","Serviço","Serviço","-","SINAPI",72900,"TRANSPORTE DE ENTULHO COM CAMINHAO BASCULANTE 6 M3, RODOVIA PAVIMENTADA, DMT 0,5 A 1,0 KM","M3",1.23,1,1.23,null,null,0,0,""]
[{"$f":"CHOOSE(1+LOG(1+2*(ORÇAMENTO.Nivel=\"Nível 1\")+4*(ORÇAMENTO.Nivel=\"Nível 2\")+8*(ORÇAMENTO.Nivel=\"Nível 3\")+16*(ORÇAMENTO.Nivel=\"Nível 4\")+32*(ORÇAMENTO.Nivel=\"Serviço\"),2),0,1,2,3,4,\"S\")","v":"S"},2,"S",0,6,2,0,0,{"$f":"IF(AND($C133<=4,$C133<>0),0,IF(AND($C133=\"S\",$Y133>0),OFFSET(I133,-1,0)+1,OFFSET(I133,-1,0)))","v":0},{"$f":"IF(OR($C133=\"S\",$C133=0),0,MATCH(0,OFFSET($D133,1,$C133,ROW($C$505)-ROW($C133)),0))","v":0},{"$f":"IF(OR($C133=\"S\",$C133=0),0,MATCH(OFFSET($D133,0,$C133)+1,OFFSET($D133,1,$C133,ROW($C$505)-ROW($C133)),0))","v":0},"","Serviço","Serviço","-","SINAPI",72897,"CARGA MANUAL DE ENTULHO EM CAMINHAO BASCULANTE 6 M3","M3",1.23,1,1.23,null,null,0,0,""]
[2,2,2,6,6,3,0,0,0,{"$f":"IF(OR($C134=\"S\",$C134=0),0,MATCH(0,OFFSET($D134,1,$C134,ROW($C$505)-ROW($C134)),0))","v":6},{"$f":"IF(OR($C134=\"S\",$C134=0),0,MATCH(OFFSET($D134,0,$C134)+1,OFFSET($D134,1,$C134,ROW($C$505)-ROW($C134)),0))","v":51},"","Nível 2","Nível 2","-","SINAPI",null,"SERVIÇO EM TERRA","-",null,1,"-",null,null,0,0,""]
["S",2,"S",0,6,3,0,0,0,{"$f":"IF(OR($C135=\"S\",$C135=0),0,MATCH(0,OFFSET($D135,1,$C135,ROW($C$505)-ROW($C135)),0))","v":0},{"$f":"IF(OR($C135=\"S\",$C135=0),0,MATCH(OFFSET($D135,0,$C135)+1,OFFSET($D135,1,$C135,ROW($C$505)-ROW($C135)),0))","v":0},"","Serviço","Serviço","-","AGETOP",41004,"ESCAVACAO MECANICA","m3    ",0.75,1,0.75,null,null,0,0,""]
["S",{"$f":"IF(OR(C136=\"s\",C136=0),OFFSET(B136,-1,0),C136)","v":2},{"$f":"IF(OFFSET(C136,-1,0)=\"L\",1,IF(OFFSET(C136,-1,0)=1,2,IF(OR(A136=\"s\",A136=0),\"S\",IF(AND(OFFSET(C136,-1,0)=2,A136=4),3,IF(AND(OR(OFFSET(C136,-1,0)=\"s\",OFFSET(C136,-1,0)=0),A136<>\"s\",A136>OFFSET(B136,-1,0)),OFFSET(B136,-1,0),A136)))))","v":"S"},{"$f":"IF(OR(C136=\"S\",C136=0),0,IF(ISERROR(K136),J136,SMALL(J136:K136,1)))","v":0},{"$f":"IF($C136=1,OFFSET(E136,-1,0)+1,OFFSET(E136,-1,0))","v":6},{"$f":"IF($C136=1,0,IF($C136=2,OFFSET(F136,-1,0)+1,OFFSET(F136,-1,0)))","v":3},{"$f":"IF(AND($C136<=2,$C136<>0),0,IF($C136=3,OFFSET(G136,-1,0)+1,OFFSET(G136,-1,0)))","v":0},{"$f":"IF(AND($C136<=3,$C136<>0),0,IF($C136=4,OFFSET(H136,-1,0)+1,OFFSET(H136,-1,0)))","v":0},0,{"$f":"IF(OR($C136=\"S\",$C136=0),0,MATCH(0,OFFSET($D136,1,$C136,ROW($C$505)-ROW($C136)),0))","v":0},{"$f":"IF(OR($C136=\"S\",$C136=0),0,MATCH(OFFSET($D136,0,$C136)+1,OFFSET($D136,1,$C136,ROW($C$505)-ROW($C136)),0))","v":0},"","Serviço","Serviço","-","AGETOP",41005,"CARGA MECANIZADA","m3    ",0.75,1,0.75,null,null,0,0,""]
["S",2,"S",0,6,3,0,0,0,{"$f":"IF(OR($C137=\"S\",$C137=0),0,MATCH(0,OFFSET($D137,1,$C137,ROW($C$505)-ROW($C137)),0))","v":0},{"$f":"IF(OR($C137=\"S\",$C137=0),0,MATCH(OFFSET($D137,0,$C137)+1,OFFSET($D137,1,$C137,ROW($C$505)-ROW($C137)),0))","v":0},"","Serviço","Serviço","-","AGETOP",41012,"INDENIZAÇÃO DE JAZIDA","m3    ",0.75,1,0.75,null,null,0,0,""]
["S",2,"S",0,6,3,0,0,0,{"$f":"IF(OR($C138=\"S\",$C138=0),0,MATCH(0,OFFSET($D138,1,$C138,ROW($C$505)-ROW($C138)),0))","v":0},{"$f":"IF(OR($C138=\"S\",$C138=0),0,MATCH(OFFSET($D138,0,$C138)+1,OFFSET($D138,1,$C138,ROW($C$505)-ROW($C138)),0))","v":0},"","Serviço","Serviço","-","AGETOP",41006,"TRANSPORTE DE MATERIAL ESCAVADO M3.KM","m3km  ",7.5,1,7.5,null,null,0,0,""]
["S",2,"S",0,6,3,0,0,0,{"$f":"IF(OR($C139=\"S\",$C139=0),0,MATCH(0,OFFSET($D139,1,$C139,ROW($C$505)-ROW($C139)),0))","v":0},{"$f":"IF(OR($C139=\"S\",$C139=0),0,MATCH(OFFSET($D139,0,$C139)+1,OFFSET($D139,1,$C139,ROW($C$505)-ROW($C139)),0))","v":0},"","Serviço","Serviço","-","AGETOP",41009,"COMPACTAÇÃO MECÂNICA SEM CONTROLE LABORATÓRIO","m3    ",0.6,1,0.6,null,null,0,0,""]
[1,1,1,29,7,0,0,0,0,{"$f":"IF(OR($C140=\"S\",$C140=0),0,MATCH(0,OFFSET($D140,1,$C140,ROW($C$505)-ROW($C140)),0))","v":365},{"$f":"IF(OR($C140=\"S\",$C140=0),0,MATCH(OFFSET($D140,0,$C140)+1,OFFSET($D140,1,$C140,ROW($C$505)-ROW($C140)),0))","v":29},"F","Nível 1","Nível 1","7.","AGETOP",null,"INSTALAÇÕES DE GÁS ","UN",1,1,1,null,null,0,0,""]
[2,2,2,28,7,1,0,0,0,{"$f":"IF(OR($C141=\"S\",$C141=0),0,MATCH(0,OFFSET($D141,1,$C141,ROW($C$505)-ROW($C141)),0))","v":28},{"$f":"IF(OR($C141=\"S\",$C141=0),0,MATCH(OFFSET($D141,0,$C141)+1,OFFSET($D141,1,$C141,ROW($C$505)-ROW($C141)),0))","v":39},"","Nível 2","Nível 2","-","SINAPI",null,"INSTALAÇÕES ESPECIAIS","-",null,1,"-",null,null,0,0,""]
["S",2,"S",0,7,1,0,0,0,{"$f":"IF(OR($C142=\"S\",$C142=0),0,MATCH(0,OFFSET($D142,1,$C142,ROW($C$505)-ROW($C142)),0))","v":0},{"$f":"IF(OR($C142=\"S\",$C142=0),0,MATCH(OFFSET($D142,0,$C142)+1,OFFSET($D142,1,$C142,ROW($C$505)-ROW($C142)),0))","v":0},"","Serviço","Serviço","-","AGETOP",91007,"CENTRAL DE GÁS PADRÃO GOINFRA SEM INSTALAÇÕES (1+1 CILINDRO 45 KG)","Un    ",1,1,1,null,null,0,0,""]
["S",2,"S",0,7,1,0,0,0,{"$f":"IF(OR($C143=\"S\",$C143=0),0,MATCH(0,OFFSET($D143,1,$C143,ROW($C$505)-ROW($C143)),0))","v":0},{"$f":"IF(OR($C143=\"S\",$C143=0),0,MATCH(OFFSET($D143,0,$C143)+1,OFFSET($D143,1,$C143,ROW($C$505)-ROW($C143)),0))","v":0},"","Serviço","Serviço","-","AGETOP",91023,"UNIÃO S/BRONZE PRETA 3/4\" NPT 300 LBS","Un    ",3,1,3,null,null,0,0,""]
["S",2,"S",0,7,1,0,0,0,{"$f":"IF(OR($C144=\"S\",$C144=0),0,MATCH(0,OFFSET($D144,1,$C144,ROW($C$505)-ROW($C144)),0))","v":0},{"$f":"IF(OR($C144=\"S\",$C144=0),0,MATCH(OFFSET($D144,0,$C144)+1,OFFSET($D144,1,$C144,ROW($C$505)-ROW($C144)),0))","v":0},"","Serviço","Serviço","-","COMPOSIÇÃO","COMP 382_SEE","TE DE REDUCAO DE FERRO GALVANIZADO, COM ROSCA BSP, DE 3/4\" X 1/2\"","UN ",1,1,1,null,null,0,0,""]
["S",2,"S",0,7,1,0,0,0,{"$f":"IF(OR($C145=\"S\",$C145=0),0,MATCH(0,OFFSET($D145,1,$C145,ROW($C$505)-ROW($C145)),0))","v":0},{"$f":"IF(OR($C145=\"S\",$C145=0),0,MATCH(OFFSET($D145,0,$C145)+1,OFFSET($D145,1,$C145,ROW($C$505)-ROW($C145)),0))","v":0},"","Serviço","Serviço","-","COMPOSIÇÃO","COMP 383_SEE","BUCHA DE REDUCAO DE FERRO GALVANIZADO, COM ROSCA BSP, DE 1/2\" X 1/4\"","UN ",3,1,3,null,null,0,0,""]
["S",2,"S",0,7,1,0,0,0,{"$f":"IF(OR($C146=\"S\",$C146=0),0,MATCH(0,OFFSET($D146,1,$C146,ROW($C$505)-ROW($C146)),0))","v":0},{"$f":"IF(OR($C146=\"S\",$C146=0),0,MATCH(OFFSET($D146,0,$C146)+1,OFFSET($D146,1,$C146,ROW($C$505)-ROW($C146)),0))","v":0},"","Serviço","Serviço","-","AGETOP",91021,"LUVA GALVANIZADO DE REDUÇÃO 3/4\" X 1/2\" (GÁS)","Un    ",2,1,2,null,null,0,0,""]
["S",2,"S",0,7,1,0,0,0,{"$f":"IF(OR($C147=\"S\",$C147=0),0,MATCH(0,OFFSET($D147,1,$C147,ROW($C$505)-ROW($C147)),0))","v":0},{"$f":"IF(OR($C147=\"S\",$C147=0),0,MATCH(OFFSET($D147,0,$C147)+1,OFFSET($D147,1,$C147,ROW($C$505)-ROW($C147)),0))","v":0},"","Serviço","Serviço","-","SINAPI",92692,"NIPLE, EM FERRO GALVANIZADO, CONEXÃO ROSQUEADA, DN 15 (1/2\"), INSTALADO EM RAMAIS E SUB-RAMAIS DE GÁS - FORNECIMENTO E INSTALAÇÃO. AF_12/2015","UN",6,1,6,null,null,0,0,""]
["S",2,"S",0,7,1,0,0,0,{"$f":"IF(OR($C148=\"S\",$C148=0),0,MATCH(0,OFFSET($D148,1,$C148,ROW($C$505)-ROW($C148)),0))","v":0},{"$f":"IF(OR($C148=\"S\",$C148=0),0,MATCH(OFFSET($D148,0,$C148)+1,OFFSET($D148,1,$C148,ROW($C$505)-ROW($C148)),0))","v":0},"","Serviço","Serviço","-","AGETOP",91031,"NIPLE DUPLO 300 PSI 3/4\"","Un    ",6,1,6,null,null,0,0,""]
["S",2,"S",0,7,1,0,0,0,{"$f":"IF(OR($C149=\"S\",$C149=0),0,MATCH(0,OFFSET($D149,1,$C149,ROW($C$505)-ROW($C149)),0))","v":0},{"$f":"IF(OR($C149=\"S\",$C149=0),0,MATCH(OFFSET($D149,0,$C149)+1,OFFSET($D149,1,$C149,ROW($C$505)-ROW($C149)),0))","v":0},"","Serviço","Serviço","-","COMPOSIÇÃO","COMP 212_SEE","NIPLE DE REDUÇÃO 1/2\" X 1/4\" BSP","UN ",4,1,4,null,null,0,0,""]
["S",2,"S",0,7,1,0,0,0,{"$f":"IF(OR($C150=\"S\",$C150=0),0,MATCH(0,OFFSET($D150,1,$C150,ROW($C$505)-ROW($C150)),0))","v":0},{"$f":"IF(OR($C150=\"S\",$C150=0),0,MATCH(OFFSET($D150,0,$C150)+1,OFFSET($D150,1,$C150,ROW($C$505)-ROW($C150)),0))","v":0},"","Serviço","Serviço","-","COMPOSIÇÃO","COMP 213_SEE","NIPLE DE REDUÇÃO 3/4\" X 1/2\" BSP","UN ",4,1,4,null,null,0,0,""]
["S",2,"S",0,7,1,0,0,0,{"$f":"IF(OR($C151=\"S\",$C151=0),0,MATCH(0,OFFSET($D151,1,$C151,ROW($C$505)-ROW($C151)),0))","v":0},{"$f":"IF(OR($C151=\"S\",$C151=0),0,MATCH(OFFSET($D151,0,$C151)+1,OFFSET($D151,1,$C151,ROW($C$505)-ROW($C151)),0))","v":0},"","Serviço","Serviço","-","SINAPI",92688,"TUBO DE AÇO GALVANIZADO COM COSTURA, CLASSE MÉDIA, CONEXÃO ROSQUEADA, DN 20 (3/4\"), INSTALADO EM RAMAIS E SUB-RAMAIS DE GÁS - FORNECIMENTO E INSTALAÇÃO. AF_12/2015","M",12,1,12,null,null,0,0,""]
["S",2,"S",0,7,1,0,0,0,{"$f":"IF(OR($C152=\"S\",$C152=0),0,MATCH(0,OFFSET($D152,1,$C152,ROW($C$505)-ROW($C152)),0))","v":0},{"$f":"IF(OR($C152=\"S\",$C152=0),0,MATCH(OFFSET($D152,0,$C152)+1,OFFSET($D152,1,$C152,ROW($C$505)-ROW($C152)),0))","v":0},"","Serviço","Serviço","-","SINAPI",92701,"JOELHO 90 GRAUS, EM FERRO GALVANIZADO, CONEXÃO ROSQUEADA, DN 20 (3/4\"), INSTALADO EM RAMAIS E SUB-RAMAIS DE GÁS - FORNECIMENTO E INSTALAÇÃO. AF_12/2015","UN",5,1,5,null,null,0,0,""]
["S",2,"S",0,7,1,0,0,0,{"$f":"IF(OR($C153=\"S\",$C153=0),0,MATCH(0,OFFSET($D153,1,$C153,ROW($C$505)-ROW($C153)),0))","v":0},{"$f":"IF(OR($C153=\"S\",$C153=0),0,MATCH(OFFSET($D153,0,$C153)+1,OFFSET($D153,1,$C153,ROW($C$505)-ROW($C153)),0))","v":0},"","Serviço","Serviço","-","COMPOSIÇÃO","COMP 237_SEE","FITA ANTICORROSIVA","M",5,1,5,null,null,0,0,""]
["S",2,"S",0,7,1,0,0,0,{"$f":"IF(OR($C154=\"S\",$C154=0),0,MATCH(0,OFFSET($D154,1,$C154,ROW($C$505)-ROW($C154)),0))","v":0},{"$f":"IF(OR($C154=\"S\",$C154=0),0,MATCH(OFFSET($D154,0,$C154)+1,OFFSET($D154,1,$C154,ROW($C$505)-ROW($C154)),0))","v":0},"","Serviço","Serviço","-","AGETOP",91025,"VÁLVULA ESFERICA LATÃO 3/4\"","Un    ",3,1,3,null,null,0,0,""]
["S",2,"S",0,7,1,0,0,0,{"$f":"IF(OR($C155=\"S\",$C155=0),0,MATCH(0,OFFSET($D155,1,$C155,ROW($C$505)-ROW($C155)),0))","v":0},{"$f":"IF(OR($C155=\"S\",$C155=0),0,MATCH(OFFSET($D155,0,$C155)+1,OFFSET($D155,1,$C155,ROW($C$505)-ROW($C155)),0))","v":0},"","Serviço","Serviço","-","AGETOP",91019,"TE PRETO 90º 3/4\" NPT 300 LBS","Un    ",2,1,2,null,null,0,0,""]
["S",2,"S",0,7,1,0,0,0,{"$f":"IF(OR($C156=\"S\",$C156=0),0,MATCH(0,OFFSET($D156,1,$C156,ROW($C$505)-ROW($C156)),0))","v":0},{"$f":"IF(OR($C156=\"S\",$C156=0),0,MATCH(OFFSET($D156,0,$C156)+1,OFFSET($D156,1,$C156,ROW($C$505)-ROW($C156)),0))","v":0},"","Serviço","Serviço","-","COMPOSIÇÃO","COMP 542_SEE","VÁLVULA UGV 3/4\" (S) LATÃO","UN ",4,1,4,null,null,0,0,""]
["S",2,"S",0,7,1,0,0,0,{"$f":"IF(OR($C157=\"S\",$C157=0),0,MATCH(0,OFFSET($D157,1,$C157,ROW($C$505)-ROW($C157)),0))","v":0},{"$f":"IF(OR($C157=\"S\",$C157=0),0,MATCH(OFFSET($D157,0,$C157)+1,OFFSET($D157,1,$C157,ROW($C$505)-ROW($C157)),0))","v":0},"","Serviço","Serviço","-","COMPOSIÇÃO","COMP 543_SEE","VÁLVULA UGV 1/2\" (S) LATÃO","UN ",4,1,4,null,null,0,0,""]
["S",2,"S",0,7,1,0,0,0,{"$f":"IF(OR($C158=\"S\",$C158=0),0,MATCH(0,OFFSET($D158,1,$C158,ROW($C$505)-ROW($C158)),0))","v":0},{"$f":"IF(OR($C158=\"S\",$C158=0),0,MATCH(OFFSET($D158,0,$C158)+1,OFFSET($D158,1,$C158,ROW($C$505)-ROW($C158)),0))","v":0},"","Serviço","Serviço","-","AGETOP",91029,"VALVULA DE RETENÇÃO LATÃO 1/2\" X 7/16\" NPT","Un    ",4,1,4,null,null,0,0,""]
["S",2,"S",0,7,1,0,0,0,{"$f":"IF(OR($C159=\"S\",$C159=0),0,MATCH(0,OFFSET($D159,1,$C159,ROW($C$505)-ROW($C159)),0))","v":0},{"$f":"IF(OR($C159=\"S\",$C159=0),0,MATCH(OFFSET($D159,0,$C159)+1,OFFSET($D159,1,$C159,ROW($C$505)-ROW($C159)),0))","v":0},"","Serviço","Serviço","-","COMPOSIÇÃO","COMP 211_SEE","REGULADOR DE 2º ESTÁGIO 5KG/H","UN ",4,1,4,null,null,0,0,""]
["S",2,"S",0,7,1,0,0,0,{"$f":"IF(OR($C160=\"S\",$C160=0),0,MATCH(0,OFFSET($D160,1,$C160,ROW($C$505)-ROW($C160)),0))","v":0},{"$f":"IF(OR($C160=\"S\",$C160=0),0,MATCH(OFFSET($D160,0,$C160)+1,OFFSET($D160,1,$C160,ROW($C$505)-ROW($C160)),0))","v":0},"","Serviço","Serviço","-","COMPOSIÇÃO","COMP 210_SEE","REGULADOR DE 1º ESTÁGIO 60KG/H MODELO AP-40  COM MANÔMETRO","UN ",1,1,1,null,null,0,0,""]
["S",2,"S",0,7,1,0,0,0,{"$f":"IF(OR($C161=\"S\",$C161=0),0,MATCH(0,OFFSET($D161,1,$C161,ROW($C$505)-ROW($C161)),0))","v":0},{"$f":"IF(OR($C161=\"S\",$C161=0),0,MATCH(OFFSET($D161,0,$C161)+1,OFFSET($D161,1,$C161,ROW($C$505)-ROW($C161)),0))","v":0},"","Serviço","Serviço","-","AGETOP",85003,"EXTINTOR PO QUIMICO SECO (6 KG) - CAPACIDADE EXTINTORA 20 BC","Un    ",1,1,1,null,null,0,0,""]
["S",2,"S",0,7,1,0,0,0,{"$f":"IF(OR($C162=\"S\",$C162=0),0,MATCH(0,OFFSET($D162,1,$C162,ROW($C$505)-ROW($C162)),0))","v":0},{"$f":"IF(OR($C162=\"S\",$C162=0),0,MATCH(OFFSET($D162,0,$C162)+1,OFFSET($D162,1,$C162,ROW($C$505)-ROW($C162)),0))","v":0},"","Serviço","Serviço","-","COMPOSIÇÃO","COMP 235_SEE","PLACA DE SINALIZAÇÃO EM PVC COD 01 - (300X300) PROIBIDO FUMAR","UN ",2,1,2,null,null,0,0,""]
["S",2,"S",0,7,1,0,0,0,{"$f":"IF(OR($C163=\"S\",$C163=0),0,MATCH(0,OFFSET($D163,1,$C163,ROW($C$505)-ROW($C163)),0))","v":0},{"$f":"IF(OR($C163=\"S\",$C163=0),0,MATCH(OFFSET($D163,0,$C163)+1,OFFSET($D163,1,$C163,ROW($C$505)-ROW($C163)),0))","v":0},"","Serviço","Serviço","-","COMPOSIÇÃO","COMP 236_SEE","PLACA DE SINALIZAÇÃO EM PVC COD 06 - (300X300) PERIGO INFLAMÁVEL","UN ",2,1,2,null,null,0,0,""]
["S",2,"S",0,7,1,0,0,0,{"$f":"IF(OR($C164=\"S\",$C164=0),0,MATCH(0,OFFSET($D164,1,$C164,ROW($C$505)-ROW($C164)),0))","v":0},{"$f":"IF(OR($C164=\"S\",$C164=0),0,MATCH(OFFSET($D164,0,$C164)+1,OFFSET($D164,1,$C164,ROW($C$505)-ROW($C164)),0))","v":0},"","Serviço","Serviço","-","AGETOP",91043,"BRAÇADEIRA METALICA TIPO \"D\" DIAM. 3/4\"","Un    ",6,1,6,null,null,0,0,""]
["S",2,"S",0,7,1,0,0,0,{"$f":"IF(OR($C165=\"S\",$C165=0),0,MATCH(0,OFFSET($D165,1,$C165,ROW($C$505)-ROW($C165)),0))","v":0},{"$f":"IF(OR($C165=\"S\",$C165=0),0,MATCH(OFFSET($D165,0,$C165)+1,OFFSET($D165,1,$C165,ROW($C$505)-ROW($C165)),0))","v":0},"","Serviço","Serviço","-","AGETOP",71863,"PARAFUSO P/BUCHA S-10","Un    ",12,1,12,null,null,0,0,""]
["S",2,"S",0,7,1,0,0,0,{"$f":"IF(OR($C166=\"S\",$C166=0),0,MATCH(0,OFFSET($D166,1,$C166,ROW($C$505)-ROW($C166)),0))","v":0},{"$f":"IF(OR($C166=\"S\",$C166=0),0,MATCH(OFFSET($D166,0,$C166)+1,OFFSET($D166,1,$C166,ROW($C$505)-ROW($C166)),0))","v":0},"","Serviço","Serviço","-","AGETOP",70393,"BUCHA DE NYLON S-10","Un    ",12,1,12,null,null,0,0,""]
["S",2,"S",0,7,1,0,0,0,{"$f":"IF(OR($C167=\"S\",$C167=0),0,MATCH(0,OFFSET($D167,1,$C167,ROW($C$505)-ROW($C167)),0))","v":0},{"$f":"IF(OR($C167=\"S\",$C167=0),0,MATCH(OFFSET($D167,0,$C167)+1,OFFSET($D167,1,$C167,ROW($C$505)-ROW($C167)),0))","v":0},"","Serviço","Serviço","-","AGETOP",91045,"SUPORTE PARA COLETOR","Un    ",2,1,2,null,null,0,0,""]
["S",2,"S",0,7,1,0,0,0,{"$f":"IF(OR($C168=\"S\",$C168=0),0,MATCH(0,OFFSET($D168,1,$C168,ROW($C$505)-ROW($C168)),0))","v":0},{"$f":"IF(OR($C168=\"S\",$C168=0),0,MATCH(OFFSET($D168,0,$C168)+1,OFFSET($D168,1,$C168,ROW($C$505)-ROW($C168)),0))","v":0},"","Serviço","Serviço","-","COMPOSIÇÃO","COMP 045_SEE","LAUDO DE ESTANQUEIDADE","UN ",1,1,1,null,null,0,0,""]
[1,1,1,8,8,0,0,0,0,{"$f":"IF(OR($C169=\"S\",$C169=0),0,MATCH(0,OFFSET($D169,1,$C169,ROW($C$505)-ROW($C169)),0))","v":336},{"$f":"IF(OR($C169=\"S\",$C169=0),0,MATCH(OFFSET($D169,0,$C169)+1,OFFSET($D169,1,$C169,ROW($C$505)-ROW($C169)),0))","v":8},"F","Nível 1","Nível 1","8.","SINAPI",null,"PINTURA GERAL","UN",1,1,1,null,null,0,0,""]
[2,2,2,7,8,1,0,0,0,{"$f":"IF(OR($C170=\"S\",$C170=0),0,MATCH(0,OFFSET($D170,1,$C170,ROW($C$505)-ROW($C170)),0))","v":7},{"$f":"IF(OR($C170=\"S\",$C170=0),0,MATCH(OFFSET($D170,0,$C170)+1,OFFSET($D170,1,$C170,ROW($C$505)-ROW($C170)),0))","v":10},"","Nível 2","Nível 2","-","SINAPI",null,"PINTURA","-",null,1,"-",null,null,0,0,""]
["S",2,"S",0,8,1,0,0,0,{"$f":"IF(OR($C171=\"S\",$C171=0),0,MATCH(0,OFFSET($D171,1,$C171,ROW($C$505)-ROW($C171)),0))","v":0},{"$f":"IF(OR($C171=\"S\",$C171=0),0,MATCH(OFFSET($D171,0,$C171)+1,OFFSET($D171,1,$C171,ROW($C$505)-ROW($C171)),0))","v":0},"","Serviço","Serviço","-","AGETOP",260104,"REMOCAO DE PINTURA ANTIGA A LATEX","m2    ",150,1,150,null,null,0,0,""]
["S",2,"S",0,8,1,0,0,0,{"$f":"IF(OR($C172=\"S\",$C172=0),0,MATCH(0,OFFSET($D172,1,$C172,ROW($C$505)-ROW($C172)),0))","v":0},{"$f":"IF(OR($C172=\"S\",$C172=0),0,MATCH(OFFSET($D172,0,$C172)+1,OFFSET($D172,1,$C172,ROW($C$505)-ROW($C172)),0))","v":0},"","Serviço","Serviço","-","SINAPI",88495,"APLICAÇÃO E LIXAMENTO DE MASSA LÁTEX EM PAREDES, UMA DEMÃO. AF_06/2014","M2",150,1,150,null,null,0,0,""]
["S",2,"S",0,8,1,0,0,0,{"$f":"IF(OR($C173=\"S\",$C173=0),0,MATCH(0,OFFSET($D173,1,$C173,ROW($C$505)-ROW($C173)),0))","v":0},{"$f":"IF(OR($C173=\"S\",$C173=0),0,MATCH(OFFSET($D173,0,$C173)+1,OFFSET($D173,1,$C173,ROW($C$505)-ROW($C173)),0))","v":0},"","Serviço","Serviço","-","AGETOP",261302,"PINTURA LATEX DUAS DEMAOS COM SELADOR","m2    ",1260,1,1260,null,null,0,0,""]
["S",2,"S",0,8,1,0,0,0,{"$f":"IF(OR($C174=\"S\",$C174=0),0,MATCH(0,OFFSET($D174,1,$C174,ROW($C$505)-ROW($C174)),0))","v":0},{"$f":"IF(OR($C174=\"S\",$C174=0),0,MATCH(OFFSET($D174,0,$C174)+1,OFFSET($D174,1,$C174,ROW($C$505)-ROW($C174)),0))","v":0},"","Serviço","Serviço","-","AGETOP",261550,"PINT.ESMALTE SINT.PAREDES - 2 DEM.C/SELADOR","m2    ",1650,1,1650,null,null,0,0,""]
["S",2,"S",0,8,1,0,0,0,{"$f":"IF(OR($C175=\"S\",$C175=0),0,MATCH(0,OFFSET($D175,1,$C175,ROW($C$505)-ROW($C175)),0))","v":0},{"$f":"IF(OR($C175=\"S\",$C175=0),0,MATCH(OFFSET($D175,0,$C175)+1,OFFSET($D175,1,$C175,ROW($C$505)-ROW($C175)),0))","v":0},"","Serviço","Serviço","-","AGETOP",261001,"PINTURA LATEX ACRILICO 2 DEMAOS","m2    ",2710,1,2710,null,null,0,0,""]
["S",2,"S",0,8,1,0,0,0,{"$f":"IF(OR($C176=\"S\",$C176=0),0,MATCH(0,OFFSET($D176,1,$C176,ROW($C$505)-ROW($C176)),0))","v":0},{"$f":"IF(OR($C176=\"S\",$C176=0),0,MATCH(OFFSET($D176,0,$C176)+1,OFFSET($D176,1,$C176,ROW($C$505)-ROW($C176)),0))","v":0},"","Serviço","Serviço","-","SINAPI",88488,"APLICAÇÃO MANUAL DE PINTURA COM TINTA LÁTEX ACRÍLICA EM TETO, DUAS DEMÃOS. AF_06/2014","M2",570,1,570,null,null,0,0,""]
[1,1,1,11,9,0,0,0,0,{"$f":"IF(OR($C177=\"S\",$C177=0),0,MATCH(0,OFFSET($D177,1,$C177,ROW($C$505)-ROW($C177)),0))","v":328},{"$f":"IF(OR($C177=\"S\",$C177=0),0,MATCH(OFFSET($D177,0,$C177)+1,OFFSET($D177,1,$C177,ROW($C$505)-ROW($C177)),0))","v":11},"F","Nível 1","Nível 1","9.","SINAPI",null,"CALÇADA","UN",1,1,1,null,null,0,0,""]
[2,2,2,2,9,1,0,0,0,{"$f":"IF(OR($C178=\"S\",$C178=0),0,MATCH(0,OFFSET($D178,1,$C178,ROW($C$505)-ROW($C178)),0))","v":10},{"$f":"IF(OR($C178=\"S\",$C178=0),0,MATCH(OFFSET($D178,0,$C178)+1,OFFSET($D178,1,$C178,ROW($C$505)-ROW($C178)),0))","v":2},"","Nível 2","Nível 2","-","SINAPI",null,"SERVIÇOS PRELIMINARES","-",null,1,"-",null,null,0,0,""]
["S",2,"S",0,9,1,0,0,0,{"$f":"IF(OR($C179=\"S\",$C179=0),0,MATCH(0,OFFSET($D179,1,$C179,ROW($C$505)-ROW($C179)),0))","v":0},{"$f":"IF(OR($C179=\"S\",$C179=0),0,MATCH(OFFSET($D179,0,$C179)+1,OFFSET($D179,1,$C179,ROW($C$505)-ROW($C179)),0))","v":0},"","Serviço","Serviço","-","AGETOP",20109,"DEM.PISO CIMENT.SOBRE LASTRO CONC.C/TR.ATE CB. E CARGA","m2    ",119.75,1,119.75,null,null,0,0,""]
[2,2,2,3,9,2,0,0,0,{"$f":"IF(OR($C180=\"S\",$C180=0),0,MATCH(0,OFFSET($D180,1,$C180,ROW($C$505)-ROW($C180)),0))","v":8},{"$f":"IF(OR($C180=\"S\",$C180=0),0,MATCH(OFFSET($D180,0,$C180)+1,OFFSET($D180,1,$C180,ROW($C$505)-ROW($C180)),0))","v":3},"","Nível 2","Nível 2","-","SINAPI",null,"TRANSPORTES","-",null,1,"-",null,null,0,0,""]
["S",2,"S",0,9,2,0,0,0,{"$f":"IF(OR($C181=\"S\",$C181=0),0,MATCH(0,OFFSET($D181,1,$C181,ROW($C$505)-ROW($C181)),0))","v":0},{"$f":"IF(OR($C181=\"S\",$C181=0),0,MATCH(OFFSET($D181,0,$C181)+1,OFFSET($D181,1,$C181,ROW($C$505)-ROW($C181)),0))","v":0},"","Serviço","Serviço","-","SINAPI",72900,"TRANSPORTE DE ENTULHO COM CAMINHAO BASCULANTE 6 M3, RODOVIA PAVIMENTADA, DMT 0,5 A 1,0 KM","M3",5.98,1,5.98,null,null,0,0,""]
["S",2,"S",0,9,2,0,0,0,{"$f":"IF(OR($C182=\"S\",$C182=0),0,MATCH(0,OFFSET($D182,1,$C182,ROW($C$505)-ROW($C182)),0))","v":0},{"$f":"IF(OR($C182=\"S\",$C182=0),0,MATCH(OFFSET($D182,0,$C182)+1,OFFSET($D182,1,$C182,ROW($C$505)-ROW($C182)),0))","v":0},"","Serviço","Serviço","-","SINAPI",72897,"CARGA MANUAL DE ENTULHO EM CAMINHAO BASCULANTE 6 M3","M3",5.98,1,5.98,null,null,0,0,""]
[2,2,2,2,9,3,0,0,0,{"$f":"IF(OR($C183=\"S\",$C183=0),0,MATCH(0,OFFSET($D183,1,$C183,ROW($C$505)-ROW($C183)),0))","v":5},{"$f":"IF(OR($C183=\"S\",$C183=0),0,MATCH(OFFSET($D183,0,$C183)+1,OFFSET($D183,1,$C183,ROW($C$505)-ROW($C183)),0))","v":2},"","Nível 2","Nível 2","-","SINAPI",null,"SERVIÇO EM TERRA","-",null,1,"-",null,null,0,0,""]
["S",2,"S",0,9,3,0,0,0,{"$f":"IF(OR($C184=\"S\",$C184=0),0,MATCH(0,OFFSET($D184,1,$C184,ROW($C$505)-ROW($C184)),0))","v":0},{"$f":"IF(OR($C184=\"S\",$C184=0),0,MATCH(OFFSET($D184,0,$C184)+1,OFFSET($D184,1,$C184,ROW($C$505)-ROW($C184)),0))","v":0},"","Serviço","Serviço","-","AGETOP",41140,"REGULARIZAÇÃO DO TERRENO SEM APILOAMENTO COM TRANSPORTE MANUAL DA TERRA ESCAVADA ","m2    ",119.75,1,119.75,null,null,0,0,""]
[2,2,2,3,9,4,0,0,0,{"$f":"IF(OR($C185=\"S\",$C185=0),0,MATCH(0,OFFSET($D185,1,$C185,ROW($C$505)-ROW($C185)),0))","v":3},{"$f":"IF(OR($C185=\"S\",$C185=0),0,MATCH(OFFSET($D185,0,$C185)+1,OFFSET($D185,1,$C185,ROW($C$505)-ROW($C185)),0))","v":14},"","Nível 2","Nível 2","-","SINAPI",null,"REVESTIMENTO DE PISO","-",null,1,"-",null,null,0,0,""]
["S",2,"S",0,9,4,0,0,0,{"$f":"IF(OR($C186=\"S\",$C186=0),0,MATCH(0,OFFSET($D186,1,$C186,ROW($C$505)-ROW($C186)),0))","v":0},{"$f":"IF(OR($C186=\"S\",$C186=0),0,MATCH(OFFSET($D186,0,$C186)+1,OFFSET($D186,1,$C186,ROW($C$505)-ROW($C186)),0))","v":0},"","Serviço","Serviço","-","AGETOP",220102,"PISO CONCRETO DESEMPENADO ESPESSURA = 5 CM  1:2,5:3,5","m2    ",54.75,1,54.75,null,null,0,0,""]
["S",2,"S",0,9,4,0,0,0,{"$f":"IF(OR($C187=\"S\",$C187=0),0,MATCH(0,OFFSET($D187,1,$C187,ROW($C$505)-ROW($C187)),0))","v":0},{"$f":"IF(OR($C187=\"S\",$C187=0),0,MATCH(OFFSET($D187,0,$C187)+1,OFFSET($D187,1,$C187,ROW($C$505)-ROW($C187)),0))","v":0},"","Serviço","Serviço","-","AGETOP",221126,"PISO DE LADRILHO HIDRÁULICO COLORIDO MODELO TÁTIL ( ALERTA OU DIRECIONAL) SEM LASTRO","m2    ",65,1,65,null,null,0,0,""]
[1,1,1,22,10,0,0,0,0,{"$f":"IF(OR($C188=\"S\",$C188=0),0,MATCH(0,OFFSET($D188,1,$C188,ROW($C$505)-ROW($C188)),0))","v":317},{"$f":"IF(OR($C188=\"S\",$C188=0),0,MATCH(OFFSET($D188,0,$C188)+1,OFFSET($D188,1,$C188,ROW($C$505)-ROW($C188)),0))","v":22},"F","Nível 1","Nível 1","10.","SINAPI",null,"BIBLIOTECA","UN",1,1,1,null,null,0,0,""]
[2,2,2,3,10,1,0,0,0,{"$f":"IF(OR($C189=\"S\",$C189=0),0,MATCH(0,OFFSET($D189,1,$C189,ROW($C$505)-ROW($C189)),0))","v":21},{"$f":"IF(OR($C189=\"S\",$C189=0),0,MATCH(OFFSET($D189,0,$C189)+1,OFFSET($D189,1,$C189,ROW($C$505)-ROW($C189)),0))","v":3},"","Nível 2","Nível 2","-","SINAPI",null,"SERVIÇOS PRELIMINARES","-",null,1,"-",null,null,0,0,""]
["S",2,"S",0,10,1,0,0,0,{"$f":"IF(OR($C190=\"S\",$C190=0),0,MATCH(0,OFFSET($D190,1,$C190,ROW($C$505)-ROW($C190)),0))","v":0},{"$f":"IF(OR($C190=\"S\",$C190=0),0,MATCH(OFFSET($D190,0,$C190)+1,OFFSET($D190,1,$C190,ROW($C$505)-ROW($C190)),0))","v":0},"","Serviço","Serviço","-","AGETOP",20106,"RETIRADA DE JANELAS OU PORTAIS C/ TRANSP. ATÉ CB. E CARGA","m2    ",3.8,1,3.8,null,null,0,0,""]
["S",2,"S",0,10,1,0,0,0,{"$f":"IF(OR($C191=\"S\",$C191=0),0,MATCH(0,OFFSET($D191,1,$C191,ROW($C$505)-ROW($C191)),0))","v":0},{"$f":"IF(OR($C191=\"S\",$C191=0),0,MATCH(OFFSET($D191,0,$C191)+1,OFFSET($D191,1,$C191,ROW($C$505)-ROW($C191)),0))","v":0},"","Serviço","Serviço","-","AGETOP",20118,"DEM.ALVEN.TIJOLO S/REAP. C/TR.ATE CB. E CARGA","m3    ",0.94,1,0.94,null,null,0,0,""]
[2,2,2,3,10,2,0,0,0,{"$f":"IF(OR($C192=\"S\",$C192=0),0,MATCH(0,OFFSET($D192,1,$C192,ROW($C$505)-ROW($C192)),0))","v":18},{"$f":"IF(OR($C192=\"S\",$C192=0),0,MATCH(OFFSET($D192,0,$C192)+1,OFFSET($D192,1,$C192,ROW($C$505)-ROW($C192)),0))","v":3},"","Nível 2","Nível 2","-","SINAPI",null,"TRANSPORTES","-",null,1,"-",null,null,0,0,""]
["S",2,"S",0,10,2,0,0,0,{"$f":"IF(OR($C193=\"S\",$C193=0),0,MATCH(0,OFFSET($D193,1,$C193,ROW($C$505)-ROW($C193)),0))","v":0},{"$f":"IF(OR($C193=\"S\",$C193=0),0,MATCH(OFFSET($D193,0,$C193)+1,OFFSET($D193,1,$C193,ROW($C$505)-ROW($C193)),0))","v":0},"","Serviço","Serviço","-","SINAPI",72900,"TRANSPORTE DE ENTULHO COM CAMINHAO BASCULANTE 6 M3, RODOVIA PAVIMENTADA, DMT 0,5 A 1,0 KM","M3",1.1299999999999999,1,1.1299999999999999,null,null,0,0,""]
[{"$f":"CHOOSE(1+LOG(1+2*(ORÇAMENTO.Nivel=\"Nível 1\")+4*(ORÇAMENTO.Nivel=\"Nível 2\")+8*(ORÇAMENTO.Nivel=\"Nível 3\")+16*(ORÇAMENTO.Nivel=\"Nível 4\")+32*(ORÇAMENTO.Nivel=\"Serviço\"),2),0,1,2,3,4,\"S\")","v":"S"},2,"S",0,10,2,0,0,{"$f":"IF(AND($C194<=4,$C194<>0),0,IF(AND($C194=\"S\",$Y194>0),OFFSET(I194,-1,0)+1,OFFSET(I194,-1,0)))","v":0},{"$f":"IF(OR($C194=\"S\",$C194=0),0,MATCH(0,OFFSET($D194,1,$C194,ROW($C$505)-ROW($C194)),0))","v":0},{"$f":"IF(OR($C194=\"S\",$C194=0),0,MATCH(OFFSET($D194,0,$C194)+1,OFFSET($D194,1,$C194,ROW($C$505)-ROW($C194)),0))","v":0},"","Serviço","Serviço","-","SINAPI",72897,"CARGA MANUAL DE ENTULHO EM CAMINHAO BASCULANTE 6 M3","M3",1.1299999999999999,1,1.1299999999999999,null,null,0,0,""]
[2,2,2,2,10,3,0,0,0,{"$f":"IF(OR($C195=\"S\",$C195=0),0,MATCH(0,OFFSET($D195,1,$C195,ROW($C$505)-ROW($C195)),0))","v":15},{"$f":"IF(OR($C195=\"S\",$C195=0),0,MATCH(OFFSET($D195,0,$C195)+1,OFFSET($D195,1,$C195,ROW($C$505)-ROW($C195)),0))","v":2},"","Nível 2","Nível 2","-","SINAPI",null,"ALVENARIAS E DIVISÓRIAS","-",null,1,"-",null,null,0,0,""]
["S",2,"S",0,10,3,0,0,0,{"$f":"IF(OR($C196=\"S\",$C196=0),0,MATCH(0,OFFSET($D196,1,$C196,ROW($C$505)-ROW($C196)),0))","v":0},{"$f":"IF(OR($C196=\"S\",$C196=0),0,MATCH(OFFSET($D196,0,$C196)+1,OFFSET($D196,1,$C196,ROW($C$505)-ROW($C196)),0))","v":0},"","Serviço","Serviço","-","AGETOP",100201,"ALVENARIA DE TIJOLO FURADO 1/2 VEZ - 9 x 19 x 19 - ARG. (1CALH:4ARML+100KG DE CI/M3)","m2    ",0.95,1,0.95,null,null,0,0,""]
[2,{"$f":"IF(OR(C197=\"s\",C197=0),OFFSET(B197,-1,0),C197)","v":2},{"$f":"IF(OFFSET(C197,-1,0)=\"L\",1,IF(OFFSET(C197,-1,0)=1,2,IF(OR(A197=\"s\",A197=0),\"S\",IF(AND(OFFSET(C197,-1,0)=2,A197=4),3,IF(AND(OR(OFFSET(C197,-1,0)=\"s\",OFFSET(C197,-1,0)=0),A197<>\"s\",A197>OFFSET(B197,-1,0)),OFFSET(B197,-1,0),A197)))))","v":2},{"$f":"IF(OR(C197=\"S\",C197=0),0,IF(ISERROR(K197),J197,SMALL(J197:K197,1)))","v":2},{"$f":"IF($C197=1,OFFSET(E197,-1,0)+1,OFFSET(E197,-1,0))","v":10},{"$f":"IF($C197=1,0,IF($C197=2,OFFSET(F197,-1,0)+1,OFFSET(F197,-1,0)))","v":4},{"$f":"IF(AND($C197<=2,$C197<>0),0,IF($C197=3,OFFSET(G197,-1,0)+1,OFFSET(G197,-1,0)))","v":0},{"$f":"IF(AND($C197<=3,$C197<>0),0,IF($C197=4,OFFSET(H197,-1,0)+1,OFFSET(H197,-1,0)))","v":0},0,{"$f":"IF(OR($C197=\"S\",$C197=0),0,MATCH(0,OFFSET($D197,1,$C197,ROW($C$505)-ROW($C197)),0))","v":13},{"$f":"IF(OR($C197=\"S\",$C197=0),0,MATCH(OFFSET($D197,0,$C197)+1,OFFSET($D197,1,$C197,ROW($C$505)-ROW($C197)),0))","v":2},"","Nível 2","Nível 2","-","SINAPI",null,"ESTRUTURA","-",null,1,"-",null,null,0,0,""]
["S",2,"S",0,10,4,0,0,0,{"$f":"IF(OR($C198=\"S\",$C198=0),0,MATCH(0,OFFSET($D198,1,$C198,ROW($C$505)-ROW($C198)),0))","v":0},{"$f":"IF(OR($C198=\"S\",$C198=0),0,MATCH(OFFSET($D198,0,$C198)+1,OFFSET($D198,1,$C198,ROW($C$505)-ROW($C198)),0))","v":0},"","Serviço","Serviço","-","AGETOP",60010,"VERGA/CONTRAVERGA EM CONCRETO ARMADO FCK = 20 MPA","m3    ",0.3,1,0.3,null,null,0,0,""]
[2,2,2,3,10,5,0,0,0,{"$f":"IF(OR($C199=\"S\",$C199=0),0,MATCH(0,OFFSET($D199,1,$C199,ROW($C$505)-ROW($C199)),0))","v":11},{"$f":"IF(OR($C199=\"S\",$C199=0),0,MATCH(OFFSET($D199,0,$C199)+1,OFFSET($D199,1,$C199,ROW($C$505)-ROW($C199)),0))","v":3},"","Nível 2","Nível 2","-","SINAPI",null,"REVESTIMENTO DE PAREDE","-",null,1,"-",null,null,0,0,""]
["S",2,"S",0,10,5,0,0,0,{"$f":"IF(OR($C200=\"S\",$C200=0),0,MATCH(0,OFFSET($D200,1,$C200,ROW($C$505)-ROW($C200)),0))","v":0},{"$f":"IF(OR($C200=\"S\",$C200=0),0,MATCH(OFFSET($D200,0,$C200)+1,OFFSET($D200,1,$C200,ROW($C$505)-ROW($C200)),0))","v":0},"","Serviço","Serviço","-","AGETOP",200101,"CHAPISCO COMUM","m2    ",1.9,1,1.9,null,null,0,0,""]
["S",2,"S",0,10,5,0,0,0,{"$f":"IF(OR($C201=\"S\",$C201=0),0,MATCH(0,OFFSET($D201,1,$C201,ROW($C$505)-ROW($C201)),0))","v":0},{"$f":"IF(OR($C201=\"S\",$C201=0),0,MATCH(OFFSET($D201,0,$C201)+1,OFFSET($D201,1,$C201,ROW($C$505)-ROW($C201)),0))","v":0},"","Serviço","Serviço","-","AGETOP",200403,"REBOCO (1 CALH:4 ARFC+100kgCI/M3)","m2    ",1.9,1,1.9,null,null,0,0,""]
[2,2,2,3,10,6,0,0,0,{"$f":"IF(OR($C202=\"S\",$C202=0),0,MATCH(0,OFFSET($D202,1,$C202,ROW($C$505)-ROW($C202)),0))","v":8},{"$f":"IF(OR($C202=\"S\",$C202=0),0,MATCH(OFFSET($D202,0,$C202)+1,OFFSET($D202,1,$C202,ROW($C$505)-ROW($C202)),0))","v":3},"","Nível 2","Nível 2","-","SINAPI",null,"PINTURA","-",null,1,"-",null,null,0,0,""]
["S",2,"S",0,10,6,0,0,0,{"$f":"IF(OR($C203=\"S\",$C203=0),0,MATCH(0,OFFSET($D203,1,$C203,ROW($C$505)-ROW($C203)),0))","v":0},{"$f":"IF(OR($C203=\"S\",$C203=0),0,MATCH(OFFSET($D203,0,$C203)+1,OFFSET($D203,1,$C203,ROW($C$505)-ROW($C203)),0))","v":0},"","Serviço","Serviço","-","SINAPI",88495,"APLICAÇÃO E LIXAMENTO DE MASSA LÁTEX EM PAREDES, UMA DEMÃO. AF_06/2014","M2",1.9,1,1.9,null,null,0,0,""]
["S",2,"S",0,10,6,0,0,0,{"$f":"IF(OR($C204=\"S\",$C204=0),0,MATCH(0,OFFSET($D204,1,$C204,ROW($C$505)-ROW($C204)),0))","v":0},{"$f":"IF(OR($C204=\"S\",$C204=0),0,MATCH(OFFSET($D204,0,$C204)+1,OFFSET($D204,1,$C204,ROW($C$505)-ROW($C204)),0))","v":0},"","Serviço","Serviço","-","AGETOP",261001,"PINTURA LATEX ACRILICO 2 DEMAOS","m2    ",1.9,1,1.9,null,null,0,0,""]
[2,2,2,3,10,7,0,0,0,{"$f":"IF(OR($C205=\"S\",$C205=0),0,MATCH(0,OFFSET($D205,1,$C205,ROW($C$505)-ROW($C205)),0))","v":5},{"$f":"IF(OR($C205=\"S\",$C205=0),0,MATCH(OFFSET($D205,0,$C205)+1,OFFSET($D205,1,$C205,ROW($C$505)-ROW($C205)),0))","v":3},"","Nível 2","Nível 2","-","SINAPI",null,"ESQUADRIAS METÁLICAS","-",null,1,"-",null,null,0,0,""]
["S",2,"S",0,10,7,0,0,0,{"$f":"IF(OR($C206=\"S\",$C206=0),0,MATCH(0,OFFSET($D206,1,$C206,ROW($C$505)-ROW($C206)),0))","v":0},{"$f":"IF(OR($C206=\"S\",$C206=0),0,MATCH(OFFSET($D206,0,$C206)+1,OFFSET($D206,1,$C206,ROW($C$505)-ROW($C206)),0))","v":0},"","Serviço","Serviço","-","AGETOP",180381,"ESQ. MAXIMO AR CHAPA/VIDRO J3/J5/J6/J8 C/FERRAGENS","m2    ",7,1,7,null,null,0,0,""]
["S",2,"S",0,10,7,0,0,0,{"$f":"IF(OR($C207=\"S\",$C207=0),0,MATCH(0,OFFSET($D207,1,$C207,ROW($C$505)-ROW($C207)),0))","v":0},{"$f":"IF(OR($C207=\"S\",$C207=0),0,MATCH(OFFSET($D207,0,$C207)+1,OFFSET($D207,1,$C207,ROW($C$505)-ROW($C207)),0))","v":0},"","Serviço","Serviço","-","AGETOP",180381,"ESQ. MAXIMO AR CHAPA/VIDRO J3/J5/J6/J8 C/FERRAGENS","m2    ",2.5,1,2.5,null,null,0,0,""]
[2,2,2,2,10,8,0,0,0,{"$f":"IF(OR($C208=\"S\",$C208=0),0,MATCH(0,OFFSET($D208,1,$C208,ROW($C$505)-ROW($C208)),0))","v":2},{"$f":"IF(OR($C208=\"S\",$C208=0),0,MATCH(OFFSET($D208,0,$C208)+1,OFFSET($D208,1,$C208,ROW($C$505)-ROW($C208)),0))","v":{"$error":"#N/A"}},"","Nível 2","Nível 2","-","SINAPI",null,"PINTURA","-",null,1,"-",null,null,0,0,""]
["S",2,"S",0,10,8,0,0,0,{"$f":"IF(OR($C209=\"S\",$C209=0),0,MATCH(0,OFFSET($D209,1,$C209,ROW($C$505)-ROW($C209)),0))","v":0},{"$f":"IF(OR($C209=\"S\",$C209=0),0,MATCH(OFFSET($D209,0,$C209)+1,OFFSET($D209,1,$C209,ROW($C$505)-ROW($C209)),0))","v":0},"","Serviço","Serviço","-","AGETOP",261602,"PINT.ESMALTE/ESQUAD.FERRO C/FUNDO ANTICOR.","m2    ",19,1,19,null,null,0,0,""]
[{"$f":"CHOOSE(1+LOG(1+2*(ORÇAMENTO.Nivel=\"Nível 1\")+4*(ORÇAMENTO.Nivel=\"Nível 2\")+8*(ORÇAMENTO.Nivel=\"Nível 3\")+16*(ORÇAMENTO.Nivel=\"Nível 4\")+32*(ORÇAMENTO.Nivel=\"Serviço\"),2),0,1,2,3,4,\"S\")","v":1},{"$f":"IF(OR(C210=\"s\",C210=0),OFFSET(B210,-1,0),C210)","v":1},{"$f":"IF(OFFSET(C210,-1,0)=\"L\",1,IF(OFFSET(C210,-1,0)=1,2,IF(OR(A210=\"s\",A210=0),\"S\",IF(AND(OFFSET(C210,-1,0)=2,A210=4),3,IF(AND(OR(OFFSET(C210,-1,0)=\"s\",OFFSET(C210,-1,0)=0),A210<>\"s\",A210>OFFSET(B210,-1,0)),OFFSET(B210,-1,0),A210)))))","v":1},{"$f":"IF(OR(C210=\"S\",C210=0),0,IF(ISERROR(K210),J210,SMALL(J210:K210,1)))","v":102},{"$f":"IF($C210=1,OFFSET(E210,-1,0)+1,OFFSET(E210,-1,0))","v":11},{"$f":"IF($C210=1,0,IF($C210=2,OFFSET(F210,-1,0)+1,OFFSET(F210,-1,0)))","v":0},{"$f":"IF(AND($C210<=2,$C210<>0),0,IF($C210=3,OFFSET(G210,-1,0)+1,OFFSET(G210,-1,0)))","v":0},{"$f":"IF(AND($C210<=3,$C210<>0),0,IF($C210=4,OFFSET(H210,-1,0)+1,OFFSET(H210,-1,0)))","v":0},{"$f":"IF(AND($C210<=4,$C210<>0),0,IF(AND($C210=\"S\",$Y210>0),OFFSET(I210,-1,0)+1,OFFSET(I210,-1,0)))","v":0},{"$f":"IF(OR($C210=\"S\",$C210=0),0,MATCH(0,OFFSET($D210,1,$C210,ROW($C$505)-ROW($C210)),0))","v":295},{"$f":"IF(OR($C210=\"S\",$C210=0),0,MATCH(OFFSET($D210,0,$C210)+1,OFFSET($D210,1,$C210,ROW($C$505)-ROW($C210)),0))","v":102},"F","Nível 1","Nível 1","11.","SINAPI",null,"PROJETO DE INSTALAÇÕES ELÉTRICAS","UN",1,1,1,null,null,0,0,""]
[2,2,2,3,11,1,0,0,0,{"$f":"IF(OR($C211=\"S\",$C211=0),0,MATCH(0,OFFSET($D211,1,$C211,ROW($C$505)-ROW($C211)),0))","v":101},{"$f":"IF(OR($C211=\"S\",$C211=0),0,MATCH(OFFSET($D211,0,$C211)+1,OFFSET($D211,1,$C211,ROW($C$505)-ROW($C211)),0))","v":3},"","Nível 2","Nível 2","-","SINAPI",null,"SERVIÇO EM TERRA","-",null,1,"-",null,null,0,0,""]
["S",2,"S",0,11,1,0,0,0,{"$f":"IF(OR($C212=\"S\",$C212=0),0,MATCH(0,OFFSET($D212,1,$C212,ROW($C$505)-ROW($C212)),0))","v":0},{"$f":"IF(OR($C212=\"S\",$C212=0),0,MATCH(OFFSET($D212,0,$C212)+1,OFFSET($D212,1,$C212,ROW($C$505)-ROW($C212)),0))","v":0},"","Serviço","Serviço","-","SINAPI",93358,"ESCAVAÇÃO MANUAL DE VALA COM PROFUNDIDADE MENOR OU IGUAL A 1,30 M. AF_03/2016","M3",14.399999999999999,1,14.399999999999999,null,null,0,0,"Referência: AGETOP - 40101"]
[{"$f":"CHOOSE(1+LOG(1+2*(ORÇAMENTO.Nivel=\"Nível 1\")+4*(ORÇAMENTO.Nivel=\"Nível 2\")+8*(ORÇAMENTO.Nivel=\"Nível 3\")+16*(ORÇAMENTO.Nivel=\"Nível 4\")+32*(ORÇAMENTO.Nivel=\"Serviço\"),2),0,1,2,3,4,\"S\")","v":"S"},2,"S",0,11,1,0,0,{"$f":"IF(AND($C213<=4,$C213<>0),0,IF(AND($C213=\"S\",$Y213>0),OFFSET(I213,-1,0)+1,OFFSET(I213,-1,0)))","v":0},{"$f":"IF(OR($C213=\"S\",$C213=0),0,MATCH(0,OFFSET($D213,1,$C213,ROW($C$505)-ROW($C213)),0))","v":0},{"$f":"IF(OR($C213=\"S\",$C213=0),0,MATCH(OFFSET($D213,0,$C213)+1,OFFSET($D213,1,$C213,ROW($C$505)-ROW($C213)),0))","v":0},"","Serviço","Serviço","-","SINAPI",96995,"REATERRO MANUAL APILOADO COM SOQUETE. AF_10/2017","M3",14.4,1,14.4,null,null,0,0,"Referência: AGETOP - 40902"]
[2,{"$f":"IF(OR(C214=\"s\",C214=0),OFFSET(B214,-1,0),C214)","v":2},{"$f":"IF(OFFSET(C214,-1,0)=\"L\",1,IF(OFFSET(C214,-1,0)=1,2,IF(OR(A214=\"s\",A214=0),\"S\",IF(AND(OFFSET(C214,-1,0)=2,A214=4),3,IF(AND(OR(OFFSET(C214,-1,0)=\"s\",OFFSET(C214,-1,0)=0),A214<>\"s\",A214>OFFSET(B214,-1,0)),OFFSET(B214,-1,0),A214)))))","v":2},{"$f":"IF(OR(C214=\"S\",C214=0),0,IF(ISERROR(K214),J214,SMALL(J214:K214,1)))","v":69},{"$f":"IF($C214=1,OFFSET(E214,-1,0)+1,OFFSET(E214,-1,0))","v":11},{"$f":"IF($C214=1,0,IF($C214=2,OFFSET(F214,-1,0)+1,OFFSET(F214,-1,0)))","v":2},{"$f":"IF(AND($C214<=2,$C214<>0),0,IF($C214=3,OFFSET(G214,-1,0)+1,OFFSET(G214,-1,0)))","v":0},{"$f":"IF(AND($C214<=3,$C214<>0),0,IF($C214=4,OFFSET(H214,-1,0)+1,OFFSET(H214,-1,0)))","v":0},{"$f":"IF(AND($C214<=4,$C214<>0),0,IF(AND($C214=\"S\",$Y214>0),OFFSET(I214,-1,0)+1,OFFSET(I214,-1,0)))","v":0},{"$f":"IF(OR($C214=\"S\",$C214=0),0,MATCH(0,OFFSET($D214,1,$C214,ROW($C$505)-ROW($C214)),0))","v":98},{"$f":"IF(OR($C214=\"S\",$C214=0),0,MATCH(OFFSET($D214,0,$C214)+1,OFFSET($D214,1,$C214,ROW($C$505)-ROW($C214)),0))","v":69},"","Nível 2","Nível 2","-","SINAPI",null,"INSTALAÇÕES ELÉTRICAS","-",null,1,"-",null,null,0,0,""]
[3,3,3,64,11,2,1,0,0,{"$f":"IF(OR($C215=\"S\",$C215=0),0,MATCH(0,OFFSET($D215,1,$C215,ROW($C$505)-ROW($C215)),0))","v":68},{"$f":"IF(OR($C215=\"S\",$C215=0),0,MATCH(OFFSET($D215,0,$C215)+1,OFFSET($D215,1,$C215,ROW($C$505)-ROW($C215)),0))","v":64},"","Nível 3","Nível 3","-","SINAPI",null,"SUBESTAÇÃO 112,5kVA","-",null,1,"-",null,null,0,0,""]
["S",3,"S",0,11,2,1,0,0,{"$f":"IF(OR($C216=\"S\",$C216=0),0,MATCH(0,OFFSET($D216,1,$C216,ROW($C$505)-ROW($C216)),0))","v":0},{"$f":"IF(OR($C216=\"S\",$C216=0),0,MATCH(OFFSET($D216,0,$C216)+1,OFFSET($D216,1,$C216,ROW($C$505)-ROW($C216)),0))","v":0},"","Serviço","Serviço","-","SINAPI","73767/2","ALCA PRE-FORMADA DISTRIBUIÇÃO EM  ACO RECOBERTO COM ALUMINIO PARA CABO 25MM2, ENCAPADO. FORNECIMENTO E INSTALAÇÃO.","UN",1,1,1,null,null,0,0,""]
["S",{"$f":"IF(OR(C217=\"s\",C217=0),OFFSET(B217,-1,0),C217)","v":3},{"$f":"IF(OFFSET(C217,-1,0)=\"L\",1,IF(OFFSET(C217,-1,0)=1,2,IF(OR(A217=\"s\",A217=0),\"S\",IF(AND(OFFSET(C217,-1,0)=2,A217=4),3,IF(AND(OR(OFFSET(C217,-1,0)=\"s\",OFFSET(C217,-1,0)=0),A217<>\"s\",A217>OFFSET(B217,-1,0)),OFFSET(B217,-1,0),A217)))))","v":"S"},{"$f":"IF(OR(C217=\"S\",C217=0),0,IF(ISERROR(K217),J217,SMALL(J217:K217,1)))","v":0},{"$f":"IF($C217=1,OFFSET(E217,-1,0)+1,OFFSET(E217,-1,0))","v":11},{"$f":"IF($C217=1,0,IF($C217=2,OFFSET(F217,-1,0)+1,OFFSET(F217,-1,0)))","v":2},{"$f":"IF(AND($C217<=2,$C217<>0),0,IF($C217=3,OFFSET(G217,-1,0)+1,OFFSET(G217,-1,0)))","v":1},{"$f":"IF(AND($C217<=3,$C217<>0),0,IF($C217=4,OFFSET(H217,-1,0)+1,OFFSET(H217,-1,0)))","v":0},0,{"$f":"IF(OR($C217=\"S\",$C217=0),0,MATCH(0,OFFSET($D217,1,$C217,ROW($C$505)-ROW($C217)),0))","v":0},{"$f":"IF(OR($C217=\"S\",$C217=0),0,MATCH(OFFSET($D217,0,$C217)+1,OFFSET($D217,1,$C217,ROW($C$505)-ROW($C217)),0))","v":0},"","Serviço","Serviço","-","AGETOP",70252,"ARRUELA LISA D=5/16\"","Un    ",8,1,8,null,null,0,0,""]
["S",3,"S",0,11,2,1,0,0,{"$f":"IF(OR($C218=\"S\",$C218=0),0,MATCH(0,OFFSET($D218,1,$C218,ROW($C$505)-ROW($C218)),0))","v":0},{"$f":"IF(OR($C218=\"S\",$C218=0),0,MATCH(OFFSET($D218,0,$C218)+1,OFFSET($D218,1,$C218,ROW($C$505)-ROW($C218)),0))","v":0},"","Serviço","Serviço","-","AGETOP",70268,"BARRA DE COBRE 2\" X 3/16\"  (2,0865 KG/M)","m     ",1.5,1,1.5,null,null,0,0,""]
["S",3,"S",0,11,2,1,0,0,{"$f":"IF(OR($C219=\"S\",$C219=0),0,MATCH(0,OFFSET($D219,1,$C219,ROW($C$505)-ROW($C219)),0))","v":0},{"$f":"IF(OR($C219=\"S\",$C219=0),0,MATCH(OFFSET($D219,0,$C219)+1,OFFSET($D219,1,$C219,ROW($C$505)-ROW($C219)),0))","v":0},"","Serviço","Serviço","-","SINAPI",91175,"FIXAÇÃO DE TUBOS VERTICAIS DE PPR DIÂMETROS MAIORES QUE 75 MM COM ABRAÇADEIRA METÁLICA RÍGIDA TIPO D 3\", FIXADA EM PERFILADO EM ALVENARIA. AF_05/2015","M",6,1,6,null,null,0,0,""]
["S",3,"S",0,11,2,1,0,0,{"$f":"IF(OR($C220=\"S\",$C220=0),0,MATCH(0,OFFSET($D220,1,$C220,ROW($C$505)-ROW($C220)),0))","v":0},{"$f":"IF(OR($C220=\"S\",$C220=0),0,MATCH(OFFSET($D220,0,$C220)+1,OFFSET($D220,1,$C220,ROW($C$505)-ROW($C220)),0))","v":0},"","Serviço","Serviço","-","AGETOP",70386,"BRAÇO C AÇO GALVANIZADO , CONFORME NTD-17","un    ",1,1,1,null,null,0,0,""]
["S",3,"S",0,11,2,1,0,0,{"$f":"IF(OR($C221=\"S\",$C221=0),0,MATCH(0,OFFSET($D221,1,$C221,ROW($C$505)-ROW($C221)),0))","v":0},{"$f":"IF(OR($C221=\"S\",$C221=0),0,MATCH(OFFSET($D221,0,$C221)+1,OFFSET($D221,1,$C221,ROW($C$505)-ROW($C221)),0))","v":0},"","Serviço","Serviço","-","AGETOP",70422,"BUCHA E ARRUELA METALICA DIAM. 1\"","PR    ",2,1,2,null,null,0,0,""]
["S",3,"S",0,11,2,1,0,0,{"$f":"IF(OR($C222=\"S\",$C222=0),0,MATCH(0,OFFSET($D222,1,$C222,ROW($C$505)-ROW($C222)),0))","v":0},{"$f":"IF(OR($C222=\"S\",$C222=0),0,MATCH(OFFSET($D222,0,$C222)+1,OFFSET($D222,1,$C222,ROW($C$505)-ROW($C222)),0))","v":0},"","Serviço","Serviço","-","AGETOP",70426,"BUCHA E ARRUELA METALICA DIAM. 2.1/2\"","PR    ",1,1,1,null,null,0,0,""]
["S",3,"S",0,11,2,1,0,0,{"$f":"IF(OR($C223=\"S\",$C223=0),0,MATCH(0,OFFSET($D223,1,$C223,ROW($C$505)-ROW($C223)),0))","v":0},{"$f":"IF(OR($C223=\"S\",$C223=0),0,MATCH(OFFSET($D223,0,$C223)+1,OFFSET($D223,1,$C223,ROW($C$505)-ROW($C223)),0))","v":0},"","Serviço","Serviço","-","SINAPI",92980,"CABO DE COBRE FLEXÍVEL ISOLADO, 10 MM², ANTI-CHAMA 0,6/1,0 KV, PARA DISTRIBUIÇÃO - FORNECIMENTO E INSTALAÇÃO. AF_12/2015","M",10,1,10,null,null,0,0,""]
["S",3,"S",0,11,2,1,0,0,{"$f":"IF(OR($C224=\"S\",$C224=0),0,MATCH(0,OFFSET($D224,1,$C224,ROW($C$505)-ROW($C224)),0))","v":0},{"$f":"IF(OR($C224=\"S\",$C224=0),0,MATCH(OFFSET($D224,0,$C224)+1,OFFSET($D224,1,$C224,ROW($C$505)-ROW($C224)),0))","v":0},"","Serviço","Serviço","-","AGETOP",70543,"CABO DE COBRE NÚ No. 35 MM2","M     ",6,1,6,null,null,0,0,""]
["S",3,"S",0,11,2,1,0,0,{"$f":"IF(OR($C225=\"S\",$C225=0),0,MATCH(0,OFFSET($D225,1,$C225,ROW($C$505)-ROW($C225)),0))","v":0},{"$f":"IF(OR($C225=\"S\",$C225=0),0,MATCH(OFFSET($D225,0,$C225)+1,OFFSET($D225,1,$C225,ROW($C$505)-ROW($C225)),0))","v":0},"","Serviço","Serviço","-","SINAPI",96977,"CORDOALHA DE COBRE NU 50 MM², ENTERRADA, SEM ISOLADOR - FORNECIMENTO E INSTALAÇÃO. AF_12/2017","M",45,1,45,null,null,0,0,""]
["S",3,"S",0,11,2,1,0,0,{"$f":"IF(OR($C226=\"S\",$C226=0),0,MATCH(0,OFFSET($D226,1,$C226,ROW($C$505)-ROW($C226)),0))","v":0},{"$f":"IF(OR($C226=\"S\",$C226=0),0,MATCH(OFFSET($D226,0,$C226)+1,OFFSET($D226,1,$C226,ROW($C$505)-ROW($C226)),0))","v":0},"","Serviço","Serviço","-","AGETOP",70695,"CAIXA METÁLICA PARA PROTEÇÃO GERAL 580X500X216MM ATÉ 175A","Un    ",1,1,1,null,null,0,0,""]
["S",3,"S",0,11,2,1,0,0,{"$f":"IF(OR($C227=\"S\",$C227=0),0,MATCH(0,OFFSET($D227,1,$C227,ROW($C$505)-ROW($C227)),0))","v":0},{"$f":"IF(OR($C227=\"S\",$C227=0),0,MATCH(OFFSET($D227,0,$C227)+1,OFFSET($D227,1,$C227,ROW($C$505)-ROW($C227)),0))","v":0},"","Serviço","Serviço","-","AGETOP",70725,"CAIXA METÁLICA PARA T.C. 580X500X216MM - ATÉ 175A","Un    ",1,1,1,null,null,0,0,""]
["S",3,"S",0,11,2,1,0,0,{"$f":"IF(OR($C228=\"S\",$C228=0),0,MATCH(0,OFFSET($D228,1,$C228,ROW($C$505)-ROW($C228)),0))","v":0},{"$f":"IF(OR($C228=\"S\",$C228=0),0,MATCH(OFFSET($D228,0,$C228)+1,OFFSET($D228,1,$C228,ROW($C$505)-ROW($C228)),0))","v":0},"","Serviço","Serviço","-","SINAPI",97893,"CAIXA ENTERRADA ELÉTRICA RETANGULAR, EM ALVENARIA COM BLOCOS DE CONCRETO, FUNDO COM BRITA, DIMENSÕES INTERNAS: 0,8X0,8X0,6 M. AF_05/2018","UN",1,1,1,null,null,0,0,""]
["S",3,"S",0,11,2,1,0,0,{"$f":"IF(OR($C229=\"S\",$C229=0),0,MATCH(0,OFFSET($D229,1,$C229,ROW($C$505)-ROW($C229)),0))","v":0},{"$f":"IF(OR($C229=\"S\",$C229=0),0,MATCH(OFFSET($D229,0,$C229)+1,OFFSET($D229,1,$C229,ROW($C$505)-ROW($C229)),0))","v":0},"","Serviço","Serviço","-","AGETOP",70720,"CAIXA METÁLICA PARA MEDIDOR POLIFÁSICO PADRÃO ENEL 500X380X166MM","Un    ",1,1,1,null,null,0,0,""]
["S",3,"S",0,11,2,1,0,0,{"$f":"IF(OR($C230=\"S\",$C230=0),0,MATCH(0,OFFSET($D230,1,$C230,ROW($C$505)-ROW($C230)),0))","v":0},{"$f":"IF(OR($C230=\"S\",$C230=0),0,MATCH(OFFSET($D230,0,$C230)+1,OFFSET($D230,1,$C230,ROW($C$505)-ROW($C230)),0))","v":0},"","Serviço","Serviço","-","AGETOP",70771,"CANTONEIRA AUXILIAR PARA BRAÇO TIPO C","un    ",1,1,1,null,null,0,0,""]
["S",3,"S",0,11,2,1,0,0,{"$f":"IF(OR($C231=\"S\",$C231=0),0,MATCH(0,OFFSET($D231,1,$C231,ROW($C$505)-ROW($C231)),0))","v":0},{"$f":"IF(OR($C231=\"S\",$C231=0),0,MATCH(OFFSET($D231,0,$C231)+1,OFFSET($D231,1,$C231,ROW($C$505)-ROW($C231)),0))","v":0},"","Serviço","Serviço","-","AGETOP",70920,"CINTA DE ACO GALVANIZADO DIAM.190 MM","Un    ",1,1,1,null,null,0,0,""]
["S",3,"S",0,11,2,1,0,0,{"$f":"IF(OR($C232=\"S\",$C232=0),0,MATCH(0,OFFSET($D232,1,$C232,ROW($C$505)-ROW($C232)),0))","v":0},{"$f":"IF(OR($C232=\"S\",$C232=0),0,MATCH(OFFSET($D232,0,$C232)+1,OFFSET($D232,1,$C232,ROW($C$505)-ROW($C232)),0))","v":0},"","Serviço","Serviço","-","AGETOP",70921,"CINTA DE ACO GALVANIZADO DIAM.220 MM","Un    ",2,1,2,null,null,0,0,""]
["S",3,"S",0,11,2,1,0,0,{"$f":"IF(OR($C233=\"S\",$C233=0),0,MATCH(0,OFFSET($D233,1,$C233,ROW($C$505)-ROW($C233)),0))","v":0},{"$f":"IF(OR($C233=\"S\",$C233=0),0,MATCH(OFFSET($D233,0,$C233)+1,OFFSET($D233,1,$C233,ROW($C$505)-ROW($C233)),0))","v":0},"","Serviço","Serviço","-","AGETOP",70922,"CINTA DE ACO GALVANIZADO DIAM.230MM","Un    ",2,1,2,null,null,0,0,""]
["S",3,"S",0,11,2,1,0,0,{"$f":"IF(OR($C234=\"S\",$C234=0),0,MATCH(0,OFFSET($D234,1,$C234,ROW($C$505)-ROW($C234)),0))","v":0},{"$f":"IF(OR($C234=\"S\",$C234=0),0,MATCH(OFFSET($D234,0,$C234)+1,OFFSET($D234,1,$C234,ROW($C$505)-ROW($C234)),0))","v":0},"","Serviço","Serviço","-","AGETOP",71016,"CONECTOR DE COMPRESSÃO FORMATO H PARA CABO 25 A 70 MM2","un    ",4,1,4,null,null,0,0,""]
["S",3,"S",0,11,2,1,0,0,{"$f":"IF(OR($C235=\"S\",$C235=0),0,MATCH(0,OFFSET($D235,1,$C235,ROW($C$505)-ROW($C235)),0))","v":0},{"$f":"IF(OR($C235=\"S\",$C235=0),0,MATCH(OFFSET($D235,0,$C235)+1,OFFSET($D235,1,$C235,ROW($C$505)-ROW($C235)),0))","v":0},"","Serviço","Serviço","-","AGETOP",71020,"CONECTOR PARAL. ALUM.EXTRUD.CA-CU-10,0D.10-2-1 PARAF.","Un    ",6,1,6,null,null,0,0,""]
["S",3,"S",0,11,2,1,0,0,{"$f":"IF(OR($C236=\"S\",$C236=0),0,MATCH(0,OFFSET($D236,1,$C236,ROW($C$505)-ROW($C236)),0))","v":0},{"$f":"IF(OR($C236=\"S\",$C236=0),0,MATCH(OFFSET($D236,0,$C236)+1,OFFSET($D236,1,$C236,ROW($C$505)-ROW($C236)),0))","v":0},"","Serviço","Serviço","-","AGETOP",72528,"TERMINAL DE PRESSAO 35 MM2","Un    ",1,1,1,null,null,0,0,""]
["S",3,"S",0,11,2,1,0,0,{"$f":"IF(OR($C237=\"S\",$C237=0),0,MATCH(0,OFFSET($D237,1,$C237,ROW($C$505)-ROW($C237)),0))","v":0},{"$f":"IF(OR($C237=\"S\",$C237=0),0,MATCH(OFFSET($D237,0,$C237)+1,OFFSET($D237,1,$C237,ROW($C$505)-ROW($C237)),0))","v":0},"","Serviço","Serviço","-","AGETOP",71037,"CONECTOR TIPO PARAFUSO FENDIDO 70 MM2","Un    ",4,1,4,null,null,0,0,""]
["S",3,"S",0,11,2,1,0,0,{"$f":"IF(OR($C238=\"S\",$C238=0),0,MATCH(0,OFFSET($D238,1,$C238,ROW($C$505)-ROW($C238)),0))","v":0},{"$f":"IF(OR($C238=\"S\",$C238=0),0,MATCH(OFFSET($D238,0,$C238)+1,OFFSET($D238,1,$C238,ROW($C$505)-ROW($C238)),0))","v":0},"","Serviço","Serviço","-","AGETOP",71142,"CURVA DE 90 GRAUS DE PVC RIGIDO DIAM. 1\"","Un    ",1,1,1,null,null,0,0,""]
["S",3,"S",0,11,2,1,0,0,{"$f":"IF(OR($C239=\"S\",$C239=0),0,MATCH(0,OFFSET($D239,1,$C239,ROW($C$505)-ROW($C239)),0))","v":0},{"$f":"IF(OR($C239=\"S\",$C239=0),0,MATCH(OFFSET($D239,0,$C239)+1,OFFSET($D239,1,$C239,ROW($C$505)-ROW($C239)),0))","v":0},"","Serviço","Serviço","-","SINAPI",93022,"CURVA 90 GRAUS PARA ELETRODUTO, PVC, ROSCÁVEL, DN 75 MM (2 1/2\") - FORNECIMENTO E INSTALAÇÃO. AF_12/2015","UN",1,1,1,null,null,0,0,""]
["S",3,"S",0,11,2,1,0,0,{"$f":"IF(OR($C240=\"S\",$C240=0),0,MATCH(0,OFFSET($D240,1,$C240,ROW($C$505)-ROW($C240)),0))","v":0},{"$f":"IF(OR($C240=\"S\",$C240=0),0,MATCH(OFFSET($D240,0,$C240)+1,OFFSET($D240,1,$C240,ROW($C$505)-ROW($C240)),0))","v":0},"","Serviço","Serviço","-","AGETOP",71184,"DISPOSITIVO DE PROTEÇÃO CONTRA SURTOS (D.P.S.) 275V DE 8 A 40KA","Un    ",3,1,3,null,null,0,0,""]
["S",3,"S",0,11,2,1,0,0,{"$f":"IF(OR($C241=\"S\",$C241=0),0,MATCH(0,OFFSET($D241,1,$C241,ROW($C$505)-ROW($C241)),0))","v":0},{"$f":"IF(OR($C241=\"S\",$C241=0),0,MATCH(OFFSET($D241,0,$C241)+1,OFFSET($D241,1,$C241,ROW($C$505)-ROW($C241)),0))","v":0},"","Serviço","Serviço","-","SINAPI","74130/10","DISJUNTOR TERMOMAGNETICO TRIPOLAR EM CAIXA MOLDADA 175 A 225A 240V, FORNECIMENTO E INSTALACAO","UN",1,1,1,null,null,0,0,""]
["S",3,"S",0,11,2,1,0,0,{"$f":"IF(OR($C242=\"S\",$C242=0),0,MATCH(0,OFFSET($D242,1,$C242,ROW($C$505)-ROW($C242)),0))","v":0},{"$f":"IF(OR($C242=\"S\",$C242=0),0,MATCH(OFFSET($D242,0,$C242)+1,OFFSET($D242,1,$C242,ROW($C$505)-ROW($C242)),0))","v":0},"","Serviço","Serviço","-","AGETOP",71202,"ELETRODUTO DE PVC RIGIDO DIAMETRO 1\"","M     ",3,1,3,null,null,0,0,""]
["S",3,"S",0,11,2,1,0,0,{"$f":"IF(OR($C243=\"S\",$C243=0),0,MATCH(0,OFFSET($D243,1,$C243,ROW($C$505)-ROW($C243)),0))","v":0},{"$f":"IF(OR($C243=\"S\",$C243=0),0,MATCH(OFFSET($D243,0,$C243)+1,OFFSET($D243,1,$C243,ROW($C$505)-ROW($C243)),0))","v":0},"","Serviço","Serviço","-","AGETOP",71171,"DISJUNTOR MONOPOLAR DE 10 A 32-A","Un    ",3,1,3,null,null,0,0,""]
["S",3,"S",0,11,2,1,0,0,{"$f":"IF(OR($C244=\"S\",$C244=0),0,MATCH(0,OFFSET($D244,1,$C244,ROW($C$505)-ROW($C244)),0))","v":0},{"$f":"IF(OR($C244=\"S\",$C244=0),0,MATCH(OFFSET($D244,0,$C244)+1,OFFSET($D244,1,$C244,ROW($C$505)-ROW($C244)),0))","v":0},"","Serviço","Serviço","-","SINAPI",93010,"ELETRODUTO RÍGIDO ROSCÁVEL, PVC, DN 75 MM (2 1/2\") - FORNECIMENTO E INSTALAÇÃO. AF_12/2015","M",24,1,24,null,null,0,0,""]
["S",3,"S",0,11,2,1,0,0,{"$f":"IF(OR($C245=\"S\",$C245=0),0,MATCH(0,OFFSET($D245,1,$C245,ROW($C$505)-ROW($C245)),0))","v":0},{"$f":"IF(OR($C245=\"S\",$C245=0),0,MATCH(OFFSET($D245,0,$C245)+1,OFFSET($D245,1,$C245,ROW($C$505)-ROW($C245)),0))","v":0},"","Serviço","Serviço","-","AGETOP",71216,"ELETRODUTO EM AÇO GALVANIZADO A FOGO DIÂMETRO 2 1/2\" - PESADO ","M     ",6,1,6,null,null,0,0,""]
["S",3,"S",0,11,2,1,0,0,{"$f":"IF(OR($C246=\"S\",$C246=0),0,MATCH(0,OFFSET($D246,1,$C246,ROW($C$505)-ROW($C246)),0))","v":0},{"$f":"IF(OR($C246=\"S\",$C246=0),0,MATCH(OFFSET($D246,0,$C246)+1,OFFSET($D246,1,$C246,ROW($C$505)-ROW($C246)),0))","v":0},"","Serviço","Serviço","-","AGETOP",71268,"ELO FUSÍVEL 6 K","Un    ",1,1,1,null,null,0,0,""]
["S",3,"S",0,11,2,1,0,0,{"$f":"IF(OR($C247=\"S\",$C247=0),0,MATCH(0,OFFSET($D247,1,$C247,ROW($C$505)-ROW($C247)),0))","v":0},{"$f":"IF(OR($C247=\"S\",$C247=0),0,MATCH(OFFSET($D247,0,$C247)+1,OFFSET($D247,1,$C247,ROW($C$505)-ROW($C247)),0))","v":0},"","Serviço","Serviço","-","AGETOP",71321,"FITA DE AUTO FUSAO, ROLO E 10,00 MM","Un    ",5,1,5,null,null,0,0,""]
["S",3,"S",0,11,2,1,0,0,{"$f":"IF(OR($C248=\"S\",$C248=0),0,MATCH(0,OFFSET($D248,1,$C248,ROW($C$505)-ROW($C248)),0))","v":0},{"$f":"IF(OR($C248=\"S\",$C248=0),0,MATCH(OFFSET($D248,0,$C248)+1,OFFSET($D248,1,$C248,ROW($C$505)-ROW($C248)),0))","v":0},"","Serviço","Serviço","-","AGETOP",71365,"GRAMPO DE ANCORAGEM POLIMÉRICO","un    ",3,1,3,null,null,0,0,""]
["S",3,"S",0,11,2,1,0,0,{"$f":"IF(OR($C249=\"S\",$C249=0),0,MATCH(0,OFFSET($D249,1,$C249,ROW($C$505)-ROW($C249)),0))","v":0},{"$f":"IF(OR($C249=\"S\",$C249=0),0,MATCH(OFFSET($D249,0,$C249)+1,OFFSET($D249,1,$C249,ROW($C$505)-ROW($C249)),0))","v":0},"","Serviço","Serviço","-","AGETOP",71381,"HASTE REV.COBRE(COPPERWELD)  5/8\" X 3,00 M C/CONECTOR","Un    ",4,1,4,null,null,0,0,""]
["S",3,"S",0,11,2,1,0,0,{"$f":"IF(OR($C250=\"S\",$C250=0),0,MATCH(0,OFFSET($D250,1,$C250,ROW($C$505)-ROW($C250)),0))","v":0},{"$f":"IF(OR($C250=\"S\",$C250=0),0,MATCH(OFFSET($D250,0,$C250)+1,OFFSET($D250,1,$C250,ROW($C$505)-ROW($C250)),0))","v":0},"","Serviço","Serviço","-","AGETOP",71463,"ISOLADOR EPOXI 50X40 (BUJAO)","Un    ",2,1,2,null,null,0,0,""]
["S",3,"S",0,11,2,1,0,0,{"$f":"IF(OR($C251=\"S\",$C251=0),0,MATCH(0,OFFSET($D251,1,$C251,ROW($C$505)-ROW($C251)),0))","v":0},{"$f":"IF(OR($C251=\"S\",$C251=0),0,MATCH(OFFSET($D251,0,$C251)+1,OFFSET($D251,1,$C251,ROW($C$505)-ROW($C251)),0))","v":0},"","Serviço","Serviço","-","AGETOP",71476,"ISOLADOR DE ANCORAGEM POLIMÉRICO 15KV","un    ",1,1,1,null,null,0,0,""]
["S",3,"S",0,11,2,1,0,0,{"$f":"IF(OR($C252=\"S\",$C252=0),0,MATCH(0,OFFSET($D252,1,$C252,ROW($C$505)-ROW($C252)),0))","v":0},{"$f":"IF(OR($C252=\"S\",$C252=0),0,MATCH(OFFSET($D252,0,$C252)+1,OFFSET($D252,1,$C252,ROW($C$505)-ROW($C252)),0))","v":0},"","Serviço","Serviço","-","AGETOP",71510,"LACO PREFORMADO DE DISTRIBUICAO","Un    ",1,1,1,null,null,0,0,""]
["S",3,"S",0,11,2,1,0,0,{"$f":"IF(OR($C253=\"S\",$C253=0),0,MATCH(0,OFFSET($D253,1,$C253,ROW($C$505)-ROW($C253)),0))","v":0},{"$f":"IF(OR($C253=\"S\",$C253=0),0,MATCH(OFFSET($D253,0,$C253)+1,OFFSET($D253,1,$C253,ROW($C$505)-ROW($C253)),0))","v":0},"","Serviço","Serviço","-","AGETOP",71742,"LUVA PVC ROSQUEAVEL DIAMETRO 1\"","Un    ",1,1,1,null,null,0,0,""]
["S",3,"S",0,11,2,1,0,0,{"$f":"IF(OR($C254=\"S\",$C254=0),0,MATCH(0,OFFSET($D254,1,$C254,ROW($C$505)-ROW($C254)),0))","v":0},{"$f":"IF(OR($C254=\"S\",$C254=0),0,MATCH(OFFSET($D254,0,$C254)+1,OFFSET($D254,1,$C254,ROW($C$505)-ROW($C254)),0))","v":0},"","Serviço","Serviço","-","SINAPI",93015,"LUVA PARA ELETRODUTO, PVC, ROSCÁVEL, DN 75 MM (2 1/2\") - FORNECIMENTO E INSTALAÇÃO. AF_12/2015","UN",1,1,1,null,null,0,0,""]
["S",3,"S",0,11,2,1,0,0,{"$f":"IF(OR($C255=\"S\",$C255=0),0,MATCH(0,OFFSET($D255,1,$C255,ROW($C$505)-ROW($C255)),0))","v":0},{"$f":"IF(OR($C255=\"S\",$C255=0),0,MATCH(OFFSET($D255,0,$C255)+1,OFFSET($D255,1,$C255,ROW($C$505)-ROW($C255)),0))","v":0},"","Serviço","Serviço","-","AGETOP",71706,"LUVA  EM AÇO GALVANIZADO DIÂMETRO 2.1/2\"","Un    ",1,1,1,null,null,0,0,""]
["S",3,"S",0,11,2,1,0,0,{"$f":"IF(OR($C256=\"S\",$C256=0),0,MATCH(0,OFFSET($D256,1,$C256,ROW($C$505)-ROW($C256)),0))","v":0},{"$f":"IF(OR($C256=\"S\",$C256=0),0,MATCH(OFFSET($D256,0,$C256)+1,OFFSET($D256,1,$C256,ROW($C$505)-ROW($C256)),0))","v":0},"","Serviço","Serviço","-","AGETOP",71750,"MANILHA-SAPATILHA EM AÇO GALVANIZADO","un    ",1,1,1,null,null,0,0,""]
["S",3,"S",0,11,2,1,0,0,{"$f":"IF(OR($C257=\"S\",$C257=0),0,MATCH(0,OFFSET($D257,1,$C257,ROW($C$505)-ROW($C257)),0))","v":0},{"$f":"IF(OR($C257=\"S\",$C257=0),0,MATCH(OFFSET($D257,0,$C257)+1,OFFSET($D257,1,$C257,ROW($C$505)-ROW($C257)),0))","v":0},"","Serviço","Serviço","-","AGETOP",71761,"MURETA MEDIÇÃO ALVEN. 1 1/2 V.(35CM) REBOC.C/PINTURA ACRÍL. E LAJE CONC. 20MPA MALHA 8.0MM CADA 10CM REVEST.C/ARGAMASSA 1:3 C/ IMPERMEABILIZANTE","m2    ",4,1,4,null,null,0,0,""]
["S",3,"S",0,11,2,1,0,0,{"$f":"IF(OR($C258=\"S\",$C258=0),0,MATCH(0,OFFSET($D258,1,$C258,ROW($C$505)-ROW($C258)),0))","v":0},{"$f":"IF(OR($C258=\"S\",$C258=0),0,MATCH(OFFSET($D258,0,$C258)+1,OFFSET($D258,1,$C258,ROW($C$505)-ROW($C258)),0))","v":0},"","Serviço","Serviço","-","AGETOP",71773,"NIPLE METALICO Fo.Zo. DIAMETRO 1\"","Un    ",1,1,1,null,null,0,0,""]
["S",3,"S",0,11,2,1,0,0,{"$f":"IF(OR($C259=\"S\",$C259=0),0,MATCH(0,OFFSET($D259,1,$C259,ROW($C$505)-ROW($C259)),0))","v":0},{"$f":"IF(OR($C259=\"S\",$C259=0),0,MATCH(OFFSET($D259,0,$C259)+1,OFFSET($D259,1,$C259,ROW($C$505)-ROW($C259)),0))","v":0},"","Serviço","Serviço","-","AGETOP",71776,"NIPLE METALICO Fo.Zo. DIAMETRO 2.1/2\"","Un    ",2,1,2,null,null,0,0,""]
["S",3,"S",0,11,2,1,0,0,{"$f":"IF(OR($C260=\"S\",$C260=0),0,MATCH(0,OFFSET($D260,1,$C260,ROW($C$505)-ROW($C260)),0))","v":0},{"$f":"IF(OR($C260=\"S\",$C260=0),0,MATCH(OFFSET($D260,0,$C260)+1,OFFSET($D260,1,$C260,ROW($C$505)-ROW($C260)),0))","v":0},"","Serviço","Serviço","-","AGETOP",85047,"NIPLE DUPLO FERRO GALVANIZADO 2.1/2\"","Un    ",1,1,1,null,null,0,0,""]
["S",3,"S",0,11,2,1,0,0,{"$f":"IF(OR($C261=\"S\",$C261=0),0,MATCH(0,OFFSET($D261,1,$C261,ROW($C$505)-ROW($C261)),0))","v":0},{"$f":"IF(OR($C261=\"S\",$C261=0),0,MATCH(OFFSET($D261,0,$C261)+1,OFFSET($D261,1,$C261,ROW($C$505)-ROW($C261)),0))","v":0},"","Serviço","Serviço","-","AGETOP",71795,"OLHAL PARA PARAFUSO","un    ",3,1,3,null,null,0,0,""]
["S",3,"S",0,11,2,1,0,0,{"$f":"IF(OR($C262=\"S\",$C262=0),0,MATCH(0,OFFSET($D262,1,$C262,ROW($C$505)-ROW($C262)),0))","v":0},{"$f":"IF(OR($C262=\"S\",$C262=0),0,MATCH(OFFSET($D262,0,$C262)+1,OFFSET($D262,1,$C262,ROW($C$505)-ROW($C262)),0))","v":0},"","Serviço","Serviço","-","AGETOP",71835,"PARAFUSO CABEÇA ABAULADA (FRANCES) M16 X 45 MM","Un    ",3,1,3,null,null,0,0,""]
["S",3,"S",0,11,2,1,0,0,{"$f":"IF(OR($C263=\"S\",$C263=0),0,MATCH(0,OFFSET($D263,1,$C263,ROW($C$505)-ROW($C263)),0))","v":0},{"$f":"IF(OR($C263=\"S\",$C263=0),0,MATCH(OFFSET($D263,0,$C263)+1,OFFSET($D263,1,$C263,ROW($C$505)-ROW($C263)),0))","v":0},"","Serviço","Serviço","-","AGETOP",71841,"PARAFUSO CABEÇA ABAULADA (FRANCES) M16 X 150 MM","Un    ",3,1,3,null,null,0,0,""]
["S",3,"S",0,11,2,1,0,0,{"$f":"IF(OR($C264=\"S\",$C264=0),0,MATCH(0,OFFSET($D264,1,$C264,ROW($C$505)-ROW($C264)),0))","v":0},{"$f":"IF(OR($C264=\"S\",$C264=0),0,MATCH(OFFSET($D264,0,$C264)+1,OFFSET($D264,1,$C264,ROW($C$505)-ROW($C264)),0))","v":0},"","Serviço","Serviço","-","AGETOP",71833,"PARA RAIOS DISTRIBUIDOR POLIMÉRICO ÓXIDO DE ZINCO S/CENTELHADOR C/ DESLIGAMENTO AUTOMÁTICO 15KV,10KA","Un    ",3,1,3,null,null,0,0,""]
["S",3,"S",0,11,2,1,0,0,{"$f":"IF(OR($C265=\"S\",$C265=0),0,MATCH(0,OFFSET($D265,1,$C265,ROW($C$505)-ROW($C265)),0))","v":0},{"$f":"IF(OR($C265=\"S\",$C265=0),0,MATCH(OFFSET($D265,0,$C265)+1,OFFSET($D265,1,$C265,ROW($C$505)-ROW($C265)),0))","v":0},"","Serviço","Serviço","-","AGETOP",71997,"POSTE - FUNDAÇÃO EM CONCRETO SIMPLES DA BASE DOS POSTES 11/600 PARA TRAFO ( DIAM. 1000MM)","m     ",0.3,1,0.3,null,null,0,0,""]
["S",3,"S",0,11,2,1,0,0,{"$f":"IF(OR($C266=\"S\",$C266=0),0,MATCH(0,OFFSET($D266,1,$C266,ROW($C$505)-ROW($C266)),0))","v":0},{"$f":"IF(OR($C266=\"S\",$C266=0),0,MATCH(OFFSET($D266,0,$C266)+1,OFFSET($D266,1,$C266,ROW($C$505)-ROW($C266)),0))","v":0},"","Serviço","Serviço","-","AGETOP",72061,"POSTE DE CONCRETO SC 11/600 - SEM FUNDAÇÃO/CONCRETO","Un    ",1,1,1,null,null,0,0,""]
["S",3,"S",0,11,2,1,0,0,{"$f":"IF(OR($C267=\"S\",$C267=0),0,MATCH(0,OFFSET($D267,1,$C267,ROW($C$505)-ROW($C267)),0))","v":0},{"$f":"IF(OR($C267=\"S\",$C267=0),0,MATCH(OFFSET($D267,0,$C267)+1,OFFSET($D267,1,$C267,ROW($C$505)-ROW($C267)),0))","v":0},"","Serviço","Serviço","-","AGETOP",72080,"POSTE/TRAFO - CAMINHÃO MUNCK 12 TON. (MÍNIMO 4H/DIA)","H     ",8,1,8,null,null,0,0,""]
["S",3,"S",0,11,2,1,0,0,{"$f":"IF(OR($C268=\"S\",$C268=0),0,MATCH(0,OFFSET($D268,1,$C268,ROW($C$505)-ROW($C268)),0))","v":0},{"$f":"IF(OR($C268=\"S\",$C268=0),0,MATCH(OFFSET($D268,0,$C268)+1,OFFSET($D268,1,$C268,ROW($C$505)-ROW($C268)),0))","v":0},"","Serviço","Serviço","-","AGETOP",72329,"SAPATILHA DE AÇO GALVANIZADO PARA POSTE COM TRANSFORMADOR","un    ",3,1,3,null,null,0,0,""]
["S",3,"S",0,11,2,1,0,0,{"$f":"IF(OR($C269=\"S\",$C269=0),0,MATCH(0,OFFSET($D269,1,$C269,ROW($C$505)-ROW($C269)),0))","v":0},{"$f":"IF(OR($C269=\"S\",$C269=0),0,MATCH(OFFSET($D269,0,$C269)+1,OFFSET($D269,1,$C269,ROW($C$505)-ROW($C269)),0))","v":0},"","Serviço","Serviço","-","SINAPI",73624,"SUPORTE PARA TRANSFORMADOR EM POSTE DE CONCRETO CIRCULAR","UN",2,1,2,null,null,0,0,""]
["S",3,"S",0,11,2,1,0,0,{"$f":"IF(OR($C270=\"S\",$C270=0),0,MATCH(0,OFFSET($D270,1,$C270,ROW($C$505)-ROW($C270)),0))","v":0},{"$f":"IF(OR($C270=\"S\",$C270=0),0,MATCH(OFFSET($D270,0,$C270)+1,OFFSET($D270,1,$C270,ROW($C$505)-ROW($C270)),0))","v":0},"","Serviço","Serviço","-","AGETOP",72518,"TERMINAL DE PRESSAO 10 MM2","Un    ",1,1,1,null,null,0,0,""]
["S",3,"S",0,11,2,1,0,0,{"$f":"IF(OR($C271=\"S\",$C271=0),0,MATCH(0,OFFSET($D271,1,$C271,ROW($C$505)-ROW($C271)),0))","v":0},{"$f":"IF(OR($C271=\"S\",$C271=0),0,MATCH(OFFSET($D271,0,$C271)+1,OFFSET($D271,1,$C271,ROW($C$505)-ROW($C271)),0))","v":0},"","Serviço","Serviço","-","AGETOP",72528,"TERMINAL DE PRESSAO 35 MM2","Un    ",5,1,5,null,null,0,0,""]
["S",3,"S",0,11,2,1,0,0,{"$f":"IF(OR($C272=\"S\",$C272=0),0,MATCH(0,OFFSET($D272,1,$C272,ROW($C$505)-ROW($C272)),0))","v":0},{"$f":"IF(OR($C272=\"S\",$C272=0),0,MATCH(OFFSET($D272,0,$C272)+1,OFFSET($D272,1,$C272,ROW($C$505)-ROW($C272)),0))","v":0},"","Serviço","Serviço","-","AGETOP",72535,"TERMINAL DE PRESSAO 70 MMM2","Un    ",2,1,2,null,null,0,0,""]
["S",3,"S",0,11,2,1,0,0,{"$f":"IF(OR($C273=\"S\",$C273=0),0,MATCH(0,OFFSET($D273,1,$C273,ROW($C$505)-ROW($C273)),0))","v":0},{"$f":"IF(OR($C273=\"S\",$C273=0),0,MATCH(OFFSET($D273,0,$C273)+1,OFFSET($D273,1,$C273,ROW($C$505)-ROW($C273)),0))","v":0},"","Serviço","Serviço","-","SINAPI","73857/2","TRANSFORMADOR DISTRIBUICAO  112,5KVA TRIFASICO 60HZ CLASSE 15KV IMERSO EM ÓLEO MINERAL FORNECIMENTO E INSTALACAO","UN",1,1,1,null,null,0,0,""]
["S",3,"S",0,11,2,1,0,0,{"$f":"IF(OR($C274=\"S\",$C274=0),0,MATCH(0,OFFSET($D274,1,$C274,ROW($C$505)-ROW($C274)),0))","v":0},{"$f":"IF(OR($C274=\"S\",$C274=0),0,MATCH(OFFSET($D274,0,$C274)+1,OFFSET($D274,1,$C274,ROW($C$505)-ROW($C274)),0))","v":0},"","Serviço","Serviço","-","SINAPI",88543,"ARMACAO SECUNDARIA OU REX COMPLETA PARA TRESLINHAS-FORNECIMENTO E INSTALACAO.","UN",1,1,1,null,null,0,0,""]
["S",3,"S",0,11,2,1,0,0,{"$f":"IF(OR($C275=\"S\",$C275=0),0,MATCH(0,OFFSET($D275,1,$C275,ROW($C$505)-ROW($C275)),0))","v":0},{"$f":"IF(OR($C275=\"S\",$C275=0),0,MATCH(OFFSET($D275,0,$C275)+1,OFFSET($D275,1,$C275,ROW($C$505)-ROW($C275)),0))","v":0},"","Serviço","Serviço","-","COMPOSIÇÃO","COMP 046_SEE","CAPUZ PARA PROTEÇÃO DOS PARA RAIOS","UN ",3,1,3,null,null,0,0,""]
["S",3,"S",0,11,2,1,0,0,{"$f":"IF(OR($C276=\"S\",$C276=0),0,MATCH(0,OFFSET($D276,1,$C276,ROW($C$505)-ROW($C276)),0))","v":0},{"$f":"IF(OR($C276=\"S\",$C276=0),0,MATCH(OFFSET($D276,0,$C276)+1,OFFSET($D276,1,$C276,ROW($C$505)-ROW($C276)),0))","v":0},"","Serviço","Serviço","-","COMPOSIÇÃO","COMP 047_SEE","CAPUZ DE PROTEÇÃO PARA BUCHA DE TRANSFORMADOR","UN ",3,1,3,null,null,0,0,""]
[{"$f":"CHOOSE(1+LOG(1+2*(ORÇAMENTO.Nivel=\"Nível 1\")+4*(ORÇAMENTO.Nivel=\"Nível 2\")+8*(ORÇAMENTO.Nivel=\"Nível 3\")+16*(ORÇAMENTO.Nivel=\"Nível 4\")+32*(ORÇAMENTO.Nivel=\"Serviço\"),2),0,1,2,3,4,\"S\")","v":"S"},3,"S",0,11,2,1,0,0,{"$f":"IF(OR($C277=\"S\",$C277=0),0,MATCH(0,OFFSET($D277,1,$C277,ROW($C$505)-ROW($C277)),0))","v":0},{"$f":"IF(OR($C277=\"S\",$C277=0),0,MATCH(OFFSET($D277,0,$C277)+1,OFFSET($D277,1,$C277,ROW($C$505)-ROW($C277)),0))","v":0},"","Serviço","Serviço","-","COMPOSIÇÃO","COMP 048_SEE","HASTE ROSQUEADA \"TIRANTE\" 3/8\"","M",0.5,1,0.5,null,null,0,0,""]
["S",3,"S",0,11,2,1,0,{"$f":"IF(AND($C278<=4,$C278<>0),0,IF(AND($C278=\"S\",$Y278>0),OFFSET(I278,-1,0)+1,OFFSET(I278,-1,0)))","v":0},{"$f":"IF(OR($C278=\"S\",$C278=0),0,MATCH(0,OFFSET($D278,1,$C278,ROW($C$505)-ROW($C278)),0))","v":0},{"$f":"IF(OR($C278=\"S\",$C278=0),0,MATCH(OFFSET($D278,0,$C278)+1,OFFSET($D278,1,$C278,ROW($C$505)-ROW($C278)),0))","v":0},"","Serviço","Serviço","-","COMPOSIÇÃO","COMP 049_SEE","PORCA SEXTAVADA 3/8\"","UN ",8,1,8,null,null,0,0,""]
[3,3,3,4,11,2,2,0,0,{"$f":"IF(OR($C279=\"S\",$C279=0),0,MATCH(0,OFFSET($D279,1,$C279,ROW($C$505)-ROW($C279)),0))","v":4},{"$f":"IF(OR($C279=\"S\",$C279=0),0,MATCH(OFFSET($D279,0,$C279)+1,OFFSET($D279,1,$C279,ROW($C$505)-ROW($C279)),0))","v":25},"","Nível 3","Nível 3","-","SINAPI",null,"IMPLANTAÇÃO SUBESTAÇÃO 112,5","-",null,1,"-",null,null,0,0,""]
["S",3,"S",0,11,2,2,0,0,{"$f":"IF(OR($C280=\"S\",$C280=0),0,MATCH(0,OFFSET($D280,1,$C280,ROW($C$505)-ROW($C280)),0))","v":0},{"$f":"IF(OR($C280=\"S\",$C280=0),0,MATCH(OFFSET($D280,0,$C280)+1,OFFSET($D280,1,$C280,ROW($C$505)-ROW($C280)),0))","v":0},"","Serviço","Serviço","-","AGETOP",70514,"CABO EPR/XLPE (90°C) 1 KV - 70 MM2","M     ",300,1,300,null,null,0,0,""]
["S",{"$f":"IF(OR(C281=\"s\",C281=0),OFFSET(B281,-1,0),C281)","v":3},{"$f":"IF(OFFSET(C281,-1,0)=\"L\",1,IF(OFFSET(C281,-1,0)=1,2,IF(OR(A281=\"s\",A281=0),\"S\",IF(AND(OFFSET(C281,-1,0)=2,A281=4),3,IF(AND(OR(OFFSET(C281,-1,0)=\"s\",OFFSET(C281,-1,0)=0),A281<>\"s\",A281>OFFSET(B281,-1,0)),OFFSET(B281,-1,0),A281)))))","v":"S"},{"$f":"IF(OR(C281=\"S\",C281=0),0,IF(ISERROR(K281),J281,SMALL(J281:K281,1)))","v":0},{"$f":"IF($C281=1,OFFSET(E281,-1,0)+1,OFFSET(E281,-1,0))","v":11},{"$f":"IF($C281=1,0,IF($C281=2,OFFSET(F281,-1,0)+1,OFFSET(F281,-1,0)))","v":2},{"$f":"IF(AND($C281<=2,$C281<>0),0,IF($C281=3,OFFSET(G281,-1,0)+1,OFFSET(G281,-1,0)))","v":2},{"$f":"IF(AND($C281<=3,$C281<>0),0,IF($C281=4,OFFSET(H281,-1,0)+1,OFFSET(H281,-1,0)))","v":0},0,{"$f":"IF(OR($C281=\"S\",$C281=0),0,MATCH(0,OFFSET($D281,1,$C281,ROW($C$505)-ROW($C281)),0))","v":0},{"$f":"IF(OR($C281=\"S\",$C281=0),0,MATCH(OFFSET($D281,0,$C281)+1,OFFSET($D281,1,$C281,ROW($C$505)-ROW($C281)),0))","v":0},"","Serviço","Serviço","-","SINAPI",97893,"CAIXA ENTERRADA ELÉTRICA RETANGULAR, EM ALVENARIA COM BLOCOS DE CONCRETO, FUNDO COM BRITA, DIMENSÕES INTERNAS: 0,8X0,8X0,6 M. AF_05/2018","UN",2,1,2,null,null,0,0,""]
["S",3,"S",0,11,2,2,0,0,{"$f":"IF(OR($C282=\"S\",$C282=0),0,MATCH(0,OFFSET($D282,1,$C282,ROW($C$505)-ROW($C282)),0))","v":0},{"$f":"IF(OR($C282=\"S\",$C282=0),0,MATCH(OFFSET($D282,0,$C282)+1,OFFSET($D282,1,$C282,ROW($C$505)-ROW($C282)),0))","v":0},"","Serviço","Serviço","-","SINAPI",93011,"ELETRODUTO RÍGIDO ROSCÁVEL, PVC, DN 85 MM (3\") - FORNECIMENTO E INSTALAÇÃO. AF_12/2015","M",75,1,75,null,null,0,0,""]
[2,2,2,29,11,3,0,0,0,{"$f":"IF(OR($C283=\"S\",$C283=0),0,MATCH(0,OFFSET($D283,1,$C283,ROW($C$505)-ROW($C283)),0))","v":29},{"$f":"IF(OR($C283=\"S\",$C283=0),0,MATCH(OFFSET($D283,0,$C283)+1,OFFSET($D283,1,$C283,ROW($C$505)-ROW($C283)),0))","v":75},"","Nível 2","Nível 2","-",null,null,"INSTALAÇÕES ELÉTRICAS","-",null,1,"-",null,null,0,0,""]
[3,3,3,17,11,3,1,0,0,{"$f":"IF(OR($C284=\"S\",$C284=0),0,MATCH(0,OFFSET($D284,1,$C284,ROW($C$505)-ROW($C284)),0))","v":28},{"$f":"IF(OR($C284=\"S\",$C284=0),0,MATCH(OFFSET($D284,0,$C284)+1,OFFSET($D284,1,$C284,ROW($C$505)-ROW($C284)),0))","v":17},"","Nível 3","Nível 3","-","SINAPI",null,"REFORMA GERAL","-",null,1,"-",null,null,0,0,""]
["S",3,"S",0,11,3,1,0,0,{"$f":"IF(OR($C285=\"S\",$C285=0),0,MATCH(0,OFFSET($D285,1,$C285,ROW($C$505)-ROW($C285)),0))","v":0},{"$f":"IF(OR($C285=\"S\",$C285=0),0,MATCH(OFFSET($D285,0,$C285)+1,OFFSET($D285,1,$C285,ROW($C$505)-ROW($C285)),0))","v":0},"","Serviço","Serviço","-","AGETOP",70391,"BUCHA DE NYLON S-6","Un    ",9,1,9,null,null,0,0,""]
["S",3,"S",0,11,3,1,0,0,{"$f":"IF(OR($C286=\"S\",$C286=0),0,MATCH(0,OFFSET($D286,1,$C286,ROW($C$505)-ROW($C286)),0))","v":0},{"$f":"IF(OR($C286=\"S\",$C286=0),0,MATCH(OFFSET($D286,0,$C286)+1,OFFSET($D286,1,$C286,ROW($C$505)-ROW($C286)),0))","v":0},"","Serviço","Serviço","-","AGETOP",71861,"PARAFUSO P/BUCHA S-6","Un    ",9,1,9,null,null,0,0,""]
["S",3,"S",0,11,3,1,0,0,{"$f":"IF(OR($C287=\"S\",$C287=0),0,MATCH(0,OFFSET($D287,1,$C287,ROW($C$505)-ROW($C287)),0))","v":0},{"$f":"IF(OR($C287=\"S\",$C287=0),0,MATCH(OFFSET($D287,0,$C287)+1,OFFSET($D287,1,$C287,ROW($C$505)-ROW($C287)),0))","v":0},"","Serviço","Serviço","-","AGETOP",70354,"BRACADEIRA METALICA TIPO \"U\" DIAM. 1.1/2\"","Un    ",45,1,45,null,null,0,0,""]
["S",3,"S",0,11,3,1,0,0,{"$f":"IF(OR($C288=\"S\",$C288=0),0,MATCH(0,OFFSET($D288,1,$C288,ROW($C$505)-ROW($C288)),0))","v":0},{"$f":"IF(OR($C288=\"S\",$C288=0),0,MATCH(OFFSET($D288,0,$C288)+1,OFFSET($D288,1,$C288,ROW($C$505)-ROW($C288)),0))","v":0},"","Serviço","Serviço","-","AGETOP",70424,"BUCHA E ARRUELA METALICA DIAM. 1.1/2\"","PR    ",2,1,2,null,null,0,0,""]
["S",3,"S",0,11,3,1,0,0,{"$f":"IF(OR($C289=\"S\",$C289=0),0,MATCH(0,OFFSET($D289,1,$C289,ROW($C$505)-ROW($C289)),0))","v":0},{"$f":"IF(OR($C289=\"S\",$C289=0),0,MATCH(OFFSET($D289,0,$C289)+1,OFFSET($D289,1,$C289,ROW($C$505)-ROW($C289)),0))","v":0},"","Serviço","Serviço","-","SINAPI",92980,"CABO DE COBRE FLEXÍVEL ISOLADO, 10 MM², ANTI-CHAMA 0,6/1,0 KV, PARA DISTRIBUIÇÃO - FORNECIMENTO E INSTALAÇÃO. AF_12/2015","M",220,1,220,null,null,0,0,""]
["S",3,"S",0,11,3,1,0,0,{"$f":"IF(OR($C290=\"S\",$C290=0),0,MATCH(0,OFFSET($D290,1,$C290,ROW($C$505)-ROW($C290)),0))","v":0},{"$f":"IF(OR($C290=\"S\",$C290=0),0,MATCH(OFFSET($D290,0,$C290)+1,OFFSET($D290,1,$C290,ROW($C$505)-ROW($C290)),0))","v":0},"","Serviço","Serviço","-","AGETOP",70352,"BRACADEIRA METALICA TIPO \"U\" DIAM. 1\"","Un    ",36,1,36,null,null,0,0,""]
["S",3,"S",0,11,3,1,0,0,{"$f":"IF(OR($C291=\"S\",$C291=0),0,MATCH(0,OFFSET($D291,1,$C291,ROW($C$505)-ROW($C291)),0))","v":0},{"$f":"IF(OR($C291=\"S\",$C291=0),0,MATCH(OFFSET($D291,0,$C291)+1,OFFSET($D291,1,$C291,ROW($C$505)-ROW($C291)),0))","v":0},"","Serviço","Serviço","-","AGETOP",70582,"CABO PVC (70ºC) 1 KV No. 4 MM2","M     ",180,1,180,null,null,0,0,""]
["S",3,"S",0,11,3,1,0,0,{"$f":"IF(OR($C292=\"S\",$C292=0),0,MATCH(0,OFFSET($D292,1,$C292,ROW($C$505)-ROW($C292)),0))","v":0},{"$f":"IF(OR($C292=\"S\",$C292=0),0,MATCH(OFFSET($D292,0,$C292)+1,OFFSET($D292,1,$C292,ROW($C$505)-ROW($C292)),0))","v":0},"","Serviço","Serviço","-","AGETOP",70563,"CABO ISOLADO PVC 750 V. No. 2,5 MM2","m     ",500,1,500,null,null,0,0,""]
["S",3,"S",0,11,3,1,0,0,{"$f":"IF(OR($C293=\"S\",$C293=0),0,MATCH(0,OFFSET($D293,1,$C293,ROW($C$505)-ROW($C293)),0))","v":0},{"$f":"IF(OR($C293=\"S\",$C293=0),0,MATCH(OFFSET($D293,0,$C293)+1,OFFSET($D293,1,$C293,ROW($C$505)-ROW($C293)),0))","v":0},"","Serviço","Serviço","-","SINAPI","74130/10","DISJUNTOR TERMOMAGNETICO TRIPOLAR EM CAIXA MOLDADA 175 A 225A 240V, FORNECIMENTO E INSTALACAO","UN",1,1,1,null,null,0,0,""]
["S",3,"S",0,11,3,1,0,0,{"$f":"IF(OR($C294=\"S\",$C294=0),0,MATCH(0,OFFSET($D294,1,$C294,ROW($C$505)-ROW($C294)),0))","v":0},{"$f":"IF(OR($C294=\"S\",$C294=0),0,MATCH(OFFSET($D294,0,$C294)+1,OFFSET($D294,1,$C294,ROW($C$505)-ROW($C294)),0))","v":0},"","Serviço","Serviço","-","SINAPI","74130/5","DISJUNTOR TERMOMAGNETICO TRIPOLAR PADRAO NEMA (AMERICANO) 60 A 100A 240V, FORNECIMENTO E INSTALACAO","UN",6,1,6,null,null,0,0,""]
["S",3,"S",0,11,3,1,0,0,{"$f":"IF(OR($C295=\"S\",$C295=0),0,MATCH(0,OFFSET($D295,1,$C295,ROW($C$505)-ROW($C295)),0))","v":0},{"$f":"IF(OR($C295=\"S\",$C295=0),0,MATCH(OFFSET($D295,0,$C295)+1,OFFSET($D295,1,$C295,ROW($C$505)-ROW($C295)),0))","v":0},"","Serviço","Serviço","-","AGETOP",71184,"DISPOSITIVO DE PROTEÇÃO CONTRA SURTOS (D.P.S.) 275V DE 8 A 40KA","Un    ",4,1,4,null,null,0,0,""]
["S",3,"S",0,11,3,1,0,0,{"$f":"IF(OR($C296=\"S\",$C296=0),0,MATCH(0,OFFSET($D296,1,$C296,ROW($C$505)-ROW($C296)),0))","v":0},{"$f":"IF(OR($C296=\"S\",$C296=0),0,MATCH(OFFSET($D296,0,$C296)+1,OFFSET($D296,1,$C296,ROW($C$505)-ROW($C296)),0))","v":0},"","Serviço","Serviço","-","AGETOP",71202,"ELETRODUTO DE PVC RIGIDO DIAMETRO 1\"","M     ",36,1,36,null,null,0,0,""]
["S",3,"S",0,11,3,1,0,0,{"$f":"IF(OR($C297=\"S\",$C297=0),0,MATCH(0,OFFSET($D297,1,$C297,ROW($C$505)-ROW($C297)),0))","v":0},{"$f":"IF(OR($C297=\"S\",$C297=0),0,MATCH(OFFSET($D297,0,$C297)+1,OFFSET($D297,1,$C297,ROW($C$505)-ROW($C297)),0))","v":0},"","Serviço","Serviço","-","SINAPI",93008,"ELETRODUTO RÍGIDO ROSCÁVEL, PVC, DN 50 MM (1 1/2\") - FORNECIMENTO E INSTALAÇÃO. AF_12/2015","M",45,1,45,null,null,0,0,""]
["S",3,"S",0,11,3,1,0,0,{"$f":"IF(OR($C298=\"S\",$C298=0),0,MATCH(0,OFFSET($D298,1,$C298,ROW($C$505)-ROW($C298)),0))","v":0},{"$f":"IF(OR($C298=\"S\",$C298=0),0,MATCH(OFFSET($D298,0,$C298)+1,OFFSET($D298,1,$C298,ROW($C$505)-ROW($C298)),0))","v":0},"","Serviço","Serviço","-","AGETOP",71742,"LUVA PVC ROSQUEAVEL DIAMETRO 1\"","Un    ",14,1,14,null,null,0,0,""]
["S",3,"S",0,11,3,1,0,0,{"$f":"IF(OR($C299=\"S\",$C299=0),0,MATCH(0,OFFSET($D299,1,$C299,ROW($C$505)-ROW($C299)),0))","v":0},{"$f":"IF(OR($C299=\"S\",$C299=0),0,MATCH(OFFSET($D299,0,$C299)+1,OFFSET($D299,1,$C299,ROW($C$505)-ROW($C299)),0))","v":0},"","Serviço","Serviço","-","AGETOP",71744,"LUVA PVC ROSQUEAVEL DIAMETRO 1.1/2\"","Un    ",17,1,17,null,null,0,0,""]
["S",3,"S",0,11,3,1,0,0,{"$f":"IF(OR($C300=\"S\",$C300=0),0,MATCH(0,OFFSET($D300,1,$C300,ROW($C$505)-ROW($C300)),0))","v":0},{"$f":"IF(OR($C300=\"S\",$C300=0),0,MATCH(OFFSET($D300,0,$C300)+1,OFFSET($D300,1,$C300,ROW($C$505)-ROW($C300)),0))","v":0},"","Serviço","Serviço","-","AGETOP",72201,"QUADRO DE DISTRIBUIÇÃO DE EMBUTIR METÁLICO CB-44E - 150A","Un    ",1,1,1,null,null,0,0,""]
[3,3,3,3,11,3,2,0,0,{"$f":"IF(OR($C301=\"S\",$C301=0),0,MATCH(0,OFFSET($D301,1,$C301,ROW($C$505)-ROW($C301)),0))","v":11},{"$f":"IF(OR($C301=\"S\",$C301=0),0,MATCH(OFFSET($D301,0,$C301)+1,OFFSET($D301,1,$C301,ROW($C$505)-ROW($C301)),0))","v":3},"","Nível 3","Nível 3","-","SINAPI",null,"INSTALAÇÕES ELÉTRICAS SISTEMA DE DETECÇÃO E ALARME DE INCÊNDIO","-",null,1,"-",null,null,0,0,""]
["S",3,"S",0,11,3,2,0,0,{"$f":"IF(OR($C302=\"S\",$C302=0),0,MATCH(0,OFFSET($D302,1,$C302,ROW($C$505)-ROW($C302)),0))","v":0},{"$f":"IF(OR($C302=\"S\",$C302=0),0,MATCH(OFFSET($D302,0,$C302)+1,OFFSET($D302,1,$C302,ROW($C$505)-ROW($C302)),0))","v":0},"","Serviço","Serviço","-","SINAPI",91853,"ELETRODUTO FLEXÍVEL CORRUGADO REFORÇADO, PVC, DN 20 MM (1/2\"), PARA CIRCUITOS TERMINAIS, INSTALADO EM PAREDE - FORNECIMENTO E INSTALAÇÃO. AF_12/2015","M",120,1,120,null,null,0,0,""]
["S",3,"S",0,11,3,2,0,0,{"$f":"IF(OR($C303=\"S\",$C303=0),0,MATCH(0,OFFSET($D303,1,$C303,ROW($C$505)-ROW($C303)),0))","v":0},{"$f":"IF(OR($C303=\"S\",$C303=0),0,MATCH(OFFSET($D303,0,$C303)+1,OFFSET($D303,1,$C303,ROW($C$505)-ROW($C303)),0))","v":0},"","Serviço","Serviço","-","AGETOP",70561,"CABO ISOLADO PP 3 X 2,5 MM2","M     ",120,1,120,null,null,0,0,""]
[3,3,3,8,11,3,3,0,0,{"$f":"IF(OR($C304=\"S\",$C304=0),0,MATCH(0,OFFSET($D304,1,$C304,ROW($C$505)-ROW($C304)),0))","v":8},{"$f":"IF(OR($C304=\"S\",$C304=0),0,MATCH(OFFSET($D304,0,$C304)+1,OFFSET($D304,1,$C304,ROW($C$505)-ROW($C304)),0))","v":95},"","Nível 3","Nível 3","-","SINAPI",null,"IMPLANTAÇÃO QD-INCÊNDIO","-",null,1,"-",null,null,0,0,""]
["S",3,"S",0,11,3,3,0,0,{"$f":"IF(OR($C305=\"S\",$C305=0),0,MATCH(0,OFFSET($D305,1,$C305,ROW($C$505)-ROW($C305)),0))","v":0},{"$f":"IF(OR($C305=\"S\",$C305=0),0,MATCH(OFFSET($D305,0,$C305)+1,OFFSET($D305,1,$C305,ROW($C$505)-ROW($C305)),0))","v":0},"","Serviço","Serviço","-","AGETOP",71173,"DISJUNTOR TRIPOLAR DE 10 A 35-A","Un    ",1,1,1,null,null,0,0,""]
["S",3,"S",0,11,3,3,0,0,{"$f":"IF(OR($C306=\"S\",$C306=0),0,MATCH(0,OFFSET($D306,1,$C306,ROW($C$505)-ROW($C306)),0))","v":0},{"$f":"IF(OR($C306=\"S\",$C306=0),0,MATCH(OFFSET($D306,0,$C306)+1,OFFSET($D306,1,$C306,ROW($C$505)-ROW($C306)),0))","v":0},"","Serviço","Serviço","-","SINAPI",84402,"QUADRO DE DISTRIBUICAO DE ENERGIA P/ 6 DISJUNTORES TERMOMAGNETICOS MONOPOLARES SEM BARRAMENTO, DE EMBUTIR, EM CHAPA METALICA - FORNECIMENTO E INSTALACAO","UN",1,1,1,null,null,0,0,""]
["S",3,"S",0,11,3,3,0,0,{"$f":"IF(OR($C307=\"S\",$C307=0),0,MATCH(0,OFFSET($D307,1,$C307,ROW($C$505)-ROW($C307)),0))","v":0},{"$f":"IF(OR($C307=\"S\",$C307=0),0,MATCH(OFFSET($D307,0,$C307)+1,OFFSET($D307,1,$C307,ROW($C$505)-ROW($C307)),0))","v":0},"","Serviço","Serviço","-","SINAPI",91917,"CURVA 90 GRAUS PARA ELETRODUTO, PVC, ROSCÁVEL, DN 32 MM (1\"), PARA CIRCUITOS TERMINAIS, INSTALADA EM PAREDE - FORNECIMENTO E INSTALAÇÃO. AF_12/2015","UN",2,1,2,null,null,0,0,""]
["S",3,"S",0,11,3,3,0,0,{"$f":"IF(OR($C308=\"S\",$C308=0),0,MATCH(0,OFFSET($D308,1,$C308,ROW($C$505)-ROW($C308)),0))","v":0},{"$f":"IF(OR($C308=\"S\",$C308=0),0,MATCH(OFFSET($D308,0,$C308)+1,OFFSET($D308,1,$C308,ROW($C$505)-ROW($C308)),0))","v":0},"","Serviço","Serviço","-","AGETOP",71202,"ELETRODUTO DE PVC RIGIDO DIAMETRO 1\"","M     ",10,1,10,null,null,0,0,""]
["S",3,"S",0,11,3,3,0,0,{"$f":"IF(OR($C309=\"S\",$C309=0),0,MATCH(0,OFFSET($D309,1,$C309,ROW($C$505)-ROW($C309)),0))","v":0},{"$f":"IF(OR($C309=\"S\",$C309=0),0,MATCH(OFFSET($D309,0,$C309)+1,OFFSET($D309,1,$C309,ROW($C$505)-ROW($C309)),0))","v":0},"","Serviço","Serviço","-","SINAPI",91857,"ELETRODUTO FLEXÍVEL CORRUGADO REFORÇADO, PVC, DN 32 MM (1\"), PARA CIRCUITOS TERMINAIS, INSTALADO EM PAREDE - FORNECIMENTO E INSTALAÇÃO. AF_12/2015","M",19,1,19,null,null,0,0,""]
["S",3,"S",0,11,3,3,0,0,{"$f":"IF(OR($C310=\"S\",$C310=0),0,MATCH(0,OFFSET($D310,1,$C310,ROW($C$505)-ROW($C310)),0))","v":0},{"$f":"IF(OR($C310=\"S\",$C310=0),0,MATCH(OFFSET($D310,0,$C310)+1,OFFSET($D310,1,$C310,ROW($C$505)-ROW($C310)),0))","v":0},"","Serviço","Serviço","-","AGETOP",70582,"CABO PVC (70ºC) 1 KV No. 4 MM2","M     ",150,1,150,null,null,0,0,""]
["S",3,"S",0,11,3,3,0,0,{"$f":"IF(OR($C311=\"S\",$C311=0),0,MATCH(0,OFFSET($D311,1,$C311,ROW($C$505)-ROW($C311)),0))","v":0},{"$f":"IF(OR($C311=\"S\",$C311=0),0,MATCH(OFFSET($D311,0,$C311)+1,OFFSET($D311,1,$C311,ROW($C$505)-ROW($C311)),0))","v":0},"","Serviço","Serviço","-","SINAPI",97893,"CAIXA ENTERRADA ELÉTRICA RETANGULAR, EM ALVENARIA COM BLOCOS DE CONCRETO, FUNDO COM BRITA, DIMENSÕES INTERNAS: 0,8X0,8X0,6 M. AF_05/2018","UN",1,1,1,null,null,0,0,""]
[1,1,1,54,12,0,0,0,0,{"$f":"IF(OR($C312=\"S\",$C312=0),0,MATCH(0,OFFSET($D312,1,$C312,ROW($C$505)-ROW($C312)),0))","v":193},{"$f":"IF(OR($C312=\"S\",$C312=0),0,MATCH(OFFSET($D312,0,$C312)+1,OFFSET($D312,1,$C312,ROW($C$505)-ROW($C312)),0))","v":54},"F","Nível 1","Nível 1","12.","SINAPI",null,"INSTALAÇÕES DE PREVENÇÃO E COMBATE À INCÊNDIO","UN",1,1,1,null,null,0,0,""]
[2,2,2,39,12,1,0,0,0,{"$f":"IF(OR($C313=\"S\",$C313=0),0,MATCH(0,OFFSET($D313,1,$C313,ROW($C$505)-ROW($C313)),0))","v":53},{"$f":"IF(OR($C313=\"S\",$C313=0),0,MATCH(OFFSET($D313,0,$C313)+1,OFFSET($D313,1,$C313,ROW($C$505)-ROW($C313)),0))","v":39},"","Nível 2","Nível 2","-","SINAPI",null,"INSTALAÇÕES ESPECIAIS","-",null,1,"-",null,null,0,0,""]
["S",2,"S",0,12,1,0,0,0,{"$f":"IF(OR($C314=\"S\",$C314=0),0,MATCH(0,OFFSET($D314,1,$C314,ROW($C$505)-ROW($C314)),0))","v":0},{"$f":"IF(OR($C314=\"S\",$C314=0),0,MATCH(OFFSET($D314,0,$C314)+1,OFFSET($D314,1,$C314,ROW($C$505)-ROW($C314)),0))","v":0},"","Serviço","Serviço","-","COMPOSIÇÃO","COMP 040_SEE","CONJUNTO MOTOR-BOMBA ELÉTRICA TRIFÁSICO 380/220 V PARA VZ= 24,33 M³/H, HM= 46,24 M POTÊNCIA= 7,5 CV","UN ",1,1,1,null,null,0,0,""]
["S",2,"S",0,12,1,0,0,0,{"$f":"IF(OR($C315=\"S\",$C315=0),0,MATCH(0,OFFSET($D315,1,$C315,ROW($C$505)-ROW($C315)),0))","v":0},{"$f":"IF(OR($C315=\"S\",$C315=0),0,MATCH(OFFSET($D315,0,$C315)+1,OFFSET($D315,1,$C315,ROW($C$505)-ROW($C315)),0))","v":0},"","Serviço","Serviço","-","COMPOSIÇÃO","COMP 076_SEE","CURVA FERRO GALVANIZADO 45G ROSCA MACHO/FEMEA REF. 2 1/2\"","UN ",1,1,1,null,null,0,0,""]
["S",2,"S",0,12,1,0,0,0,{"$f":"IF(OR($C316=\"S\",$C316=0),0,MATCH(0,OFFSET($D316,1,$C316,ROW($C$505)-ROW($C316)),0))","v":0},{"$f":"IF(OR($C316=\"S\",$C316=0),0,MATCH(OFFSET($D316,0,$C316)+1,OFFSET($D316,1,$C316,ROW($C$505)-ROW($C316)),0))","v":0},"","Serviço","Serviço","-","AGETOP",81889,"TORNEIRA BOIA DIAMETRO 1\" (25 MM )","Un    ",1,1,1,null,null,0,0,""]
["S",2,"S",0,12,1,0,0,0,{"$f":"IF(OR($C317=\"S\",$C317=0),0,MATCH(0,OFFSET($D317,1,$C317,ROW($C$505)-ROW($C317)),0))","v":0},{"$f":"IF(OR($C317=\"S\",$C317=0),0,MATCH(OFFSET($D317,0,$C317)+1,OFFSET($D317,1,$C317,ROW($C$505)-ROW($C317)),0))","v":0},"","Serviço","Serviço","-","AGETOP",80910,"REGISTRO DE GAVETA BRUTO DIAMETRO 2.1/2\"","Un    ",2,1,2,null,null,0,0,""]
["S",2,"S",0,12,1,0,0,0,{"$f":"IF(OR($C318=\"S\",$C318=0),0,MATCH(0,OFFSET($D318,1,$C318,ROW($C$505)-ROW($C318)),0))","v":0},{"$f":"IF(OR($C318=\"S\",$C318=0),0,MATCH(OFFSET($D318,0,$C318)+1,OFFSET($D318,1,$C318,ROW($C$505)-ROW($C318)),0))","v":0},"","Serviço","Serviço","-","AGETOP",82379,"TUBO FERRO GALVANIZADO DIAM.2.1/2\"","m     ",59,1,59,null,null,0,0,""]
["S",2,"S",0,12,1,0,0,0,{"$f":"IF(OR($C319=\"S\",$C319=0),0,MATCH(0,OFFSET($D319,1,$C319,ROW($C$505)-ROW($C319)),0))","v":0},{"$f":"IF(OR($C319=\"S\",$C319=0),0,MATCH(OFFSET($D319,0,$C319)+1,OFFSET($D319,1,$C319,ROW($C$505)-ROW($C319)),0))","v":0},"","Serviço","Serviço","-","AGETOP",85003,"EXTINTOR PO QUIMICO SECO (6 KG) - CAPACIDADE EXTINTORA 20 BC","Un    ",2,1,2,null,null,0,0,""]
["S",2,"S",0,12,1,0,0,0,{"$f":"IF(OR($C320=\"S\",$C320=0),0,MATCH(0,OFFSET($D320,1,$C320,ROW($C$505)-ROW($C320)),0))","v":0},{"$f":"IF(OR($C320=\"S\",$C320=0),0,MATCH(OFFSET($D320,0,$C320)+1,OFFSET($D320,1,$C320,ROW($C$505)-ROW($C320)),0))","v":0},"","Serviço","Serviço","-","AGETOP",85006,"EXTINTOR MULTI USO EM PO A B C (6 KG) - CAPACIDADE EXTINTORA 3A 20BC","un    ",7,1,7,null,null,0,0,""]
["S",2,"S",0,12,1,0,0,0,{"$f":"IF(OR($C321=\"S\",$C321=0),0,MATCH(0,OFFSET($D321,1,$C321,ROW($C$505)-ROW($C321)),0))","v":0},{"$f":"IF(OR($C321=\"S\",$C321=0),0,MATCH(OFFSET($D321,0,$C321)+1,OFFSET($D321,1,$C321,ROW($C$505)-ROW($C321)),0))","v":0},"","Serviço","Serviço","-","AGETOP",85011,"CAIXA DE INCÊNDIO METÁLICA COM SUPORTE PARA MANGUEIRA, TAMPA E MURETA 17X60X90 CM C/PINTURA","Un    ",2,1,2,null,null,0,0,""]
["S",2,"S",0,12,1,0,0,0,{"$f":"IF(OR($C322=\"S\",$C322=0),0,MATCH(0,OFFSET($D322,1,$C322,ROW($C$505)-ROW($C322)),0))","v":0},{"$f":"IF(OR($C322=\"S\",$C322=0),0,MATCH(OFFSET($D322,0,$C322)+1,OFFSET($D322,1,$C322,ROW($C$505)-ROW($C322)),0))","v":0},"","Serviço","Serviço","-","AGETOP",85017,"MANGUEIRA DE INCÊNDIO D.I. = 38 MM TIPO 2 COMP. = 15 M","CJ    ",8,1,8,null,null,0,0,""]
["S",2,"S",0,12,1,0,0,0,{"$f":"IF(OR($C323=\"S\",$C323=0),0,MATCH(0,OFFSET($D323,1,$C323,ROW($C$505)-ROW($C323)),0))","v":0},{"$f":"IF(OR($C323=\"S\",$C323=0),0,MATCH(OFFSET($D323,0,$C323)+1,OFFSET($D323,1,$C323,ROW($C$505)-ROW($C323)),0))","v":0},"","Serviço","Serviço","-","AGETOP",85025,"ESGUICHO REGULÁVEL 1.1/2\"","Un    ",8,1,8,null,null,0,0,""]
["S",2,"S",0,12,1,0,0,0,{"$f":"IF(OR($C324=\"S\",$C324=0),0,MATCH(0,OFFSET($D324,1,$C324,ROW($C$505)-ROW($C324)),0))","v":0},{"$f":"IF(OR($C324=\"S\",$C324=0),0,MATCH(OFFSET($D324,0,$C324)+1,OFFSET($D324,1,$C324,ROW($C$505)-ROW($C324)),0))","v":0},"","Serviço","Serviço","-","AGETOP",85027,"ADAPTADOR P/ENGATE STORZ 2.1/2\" X 1.1/2\"","Un    ",3,1,3,null,null,0,0,""]
["S",2,"S",0,12,1,0,0,0,{"$f":"IF(OR($C325=\"S\",$C325=0),0,MATCH(0,OFFSET($D325,1,$C325,ROW($C$505)-ROW($C325)),0))","v":0},{"$f":"IF(OR($C325=\"S\",$C325=0),0,MATCH(OFFSET($D325,0,$C325)+1,OFFSET($D325,1,$C325,ROW($C$505)-ROW($C325)),0))","v":0},"","Serviço","Serviço","-","AGETOP",85031,"REGISTRO GLOBO ANGULAR 2.1/2\"","Un    ",2,1,2,null,null,0,0,""]
["S",2,"S",0,12,1,0,0,0,{"$f":"IF(OR($C326=\"S\",$C326=0),0,MATCH(0,OFFSET($D326,1,$C326,ROW($C$505)-ROW($C326)),0))","v":0},{"$f":"IF(OR($C326=\"S\",$C326=0),0,MATCH(OFFSET($D326,0,$C326)+1,OFFSET($D326,1,$C326,ROW($C$505)-ROW($C326)),0))","v":0},"","Serviço","Serviço","-","AGETOP",85035,"TAMPÃO CEGO COM CORRENTE 2.1/2\"","Un    ",1,1,1,null,null,0,0,""]
["S",2,"S",0,12,1,0,0,0,{"$f":"IF(OR($C327=\"S\",$C327=0),0,MATCH(0,OFFSET($D327,1,$C327,ROW($C$505)-ROW($C327)),0))","v":0},{"$f":"IF(OR($C327=\"S\",$C327=0),0,MATCH(OFFSET($D327,0,$C327)+1,OFFSET($D327,1,$C327,ROW($C$505)-ROW($C327)),0))","v":0},"","Serviço","Serviço","-","AGETOP",85037,"TANQUE DE PRESSÃO DE 10 L","Un    ",1,1,1,null,null,0,0,""]
["S",2,"S",0,12,1,0,0,0,{"$f":"IF(OR($C328=\"S\",$C328=0),0,MATCH(0,OFFSET($D328,1,$C328,ROW($C$505)-ROW($C328)),0))","v":0},{"$f":"IF(OR($C328=\"S\",$C328=0),0,MATCH(OFFSET($D328,0,$C328)+1,OFFSET($D328,1,$C328,ROW($C$505)-ROW($C328)),0))","v":0},"","Serviço","Serviço","-","AGETOP",85039,"PRESSOSTATO 50 A 80 PSI","Un    ",1,1,1,null,null,0,0,""]
["S",2,"S",0,12,1,0,0,0,{"$f":"IF(OR($C329=\"S\",$C329=0),0,MATCH(0,OFFSET($D329,1,$C329,ROW($C$505)-ROW($C329)),0))","v":0},{"$f":"IF(OR($C329=\"S\",$C329=0),0,MATCH(OFFSET($D329,0,$C329)+1,OFFSET($D329,1,$C329,ROW($C$505)-ROW($C329)),0))","v":0},"","Serviço","Serviço","-","AGETOP",85041,"MANOMETRO - 0 A 10 KG/CM2","Un    ",1,1,1,null,null,0,0,""]
["S",2,"S",0,12,1,0,0,0,{"$f":"IF(OR($C330=\"S\",$C330=0),0,MATCH(0,OFFSET($D330,1,$C330,ROW($C$505)-ROW($C330)),0))","v":0},{"$f":"IF(OR($C330=\"S\",$C330=0),0,MATCH(OFFSET($D330,0,$C330)+1,OFFSET($D330,1,$C330,ROW($C$505)-ROW($C330)),0))","v":0},"","Serviço","Serviço","-","AGETOP",85047,"NIPLE DUPLO FERRO GALVANIZADO 2.1/2\"","Un    ",2,1,2,null,null,0,0,""]
["S",2,"S",0,12,1,0,0,0,{"$f":"IF(OR($C331=\"S\",$C331=0),0,MATCH(0,OFFSET($D331,1,$C331,ROW($C$505)-ROW($C331)),0))","v":0},{"$f":"IF(OR($C331=\"S\",$C331=0),0,MATCH(OFFSET($D331,0,$C331)+1,OFFSET($D331,1,$C331,ROW($C$505)-ROW($C331)),0))","v":0},"","Serviço","Serviço","-","COMPOSIÇÃO","COMP 194_SEE","TAMPÃO CEGO COM CORRENTE 1.1/2\"","UN ",2,1,2,null,null,0,0,""]
["S",2,"S",0,12,1,0,0,{"$f":"IF(AND($C332<=4,$C332<>0),0,IF(AND($C332=\"S\",$Y332>0),OFFSET(I332,-1,0)+1,OFFSET(I332,-1,0)))","v":0},{"$f":"IF(OR($C332=\"S\",$C332=0),0,MATCH(0,OFFSET($D332,1,$C332,ROW($C$505)-ROW($C332)),0))","v":0},{"$f":"IF(OR($C332=\"S\",$C332=0),0,MATCH(OFFSET($D332,0,$C332)+1,OFFSET($D332,1,$C332,ROW($C$505)-ROW($C332)),0))","v":0},"","Serviço","Serviço","-","COMPOSIÇÃO","COMP 079_SEE","LUVA FERRO GALVANIZADO DIAMETRO 2.1/2\"","UN ",4,1,4,null,null,0,0,""]
["S",2,"S",0,12,1,0,0,0,{"$f":"IF(OR($C333=\"S\",$C333=0),0,MATCH(0,OFFSET($D333,1,$C333,ROW($C$505)-ROW($C333)),0))","v":0},{"$f":"IF(OR($C333=\"S\",$C333=0),0,MATCH(OFFSET($D333,0,$C333)+1,OFFSET($D333,1,$C333,ROW($C$505)-ROW($C333)),0))","v":0},"","Serviço","Serviço","-","AGETOP",85077,"VÁLVULA DE RETENÇÃO HORIZONTAL 2.1/2\"","Un    ",2,1,2,null,null,0,0,""]
["S",2,"S",0,12,1,0,0,0,{"$f":"IF(OR($C334=\"S\",$C334=0),0,MATCH(0,OFFSET($D334,1,$C334,ROW($C$505)-ROW($C334)),0))","v":0},{"$f":"IF(OR($C334=\"S\",$C334=0),0,MATCH(OFFSET($D334,0,$C334)+1,OFFSET($D334,1,$C334,ROW($C$505)-ROW($C334)),0))","v":0},"","Serviço","Serviço","-","COMPOSIÇÃO","COMP 017_SEE","REDUCAO GIRATÓRIA TIPO STORZ LATAO P/ INST. PREDIAL COMBATE A INCENDIO ENGATE RAPIDO 2.1/2\" X 1.1/2\"","UN ",2,1,2,null,null,0,0,""]
["S",{"$f":"IF(OR(C335=\"s\",C335=0),OFFSET(B335,-1,0),C335)","v":2},{"$f":"IF(OFFSET(C335,-1,0)=\"L\",1,IF(OFFSET(C335,-1,0)=1,2,IF(OR(A335=\"s\",A335=0),\"S\",IF(AND(OFFSET(C335,-1,0)=2,A335=4),3,IF(AND(OR(OFFSET(C335,-1,0)=\"s\",OFFSET(C335,-1,0)=0),A335<>\"s\",A335>OFFSET(B335,-1,0)),OFFSET(B335,-1,0),A335)))))","v":"S"},{"$f":"IF(OR(C335=\"S\",C335=0),0,IF(ISERROR(K335),J335,SMALL(J335:K335,1)))","v":0},{"$f":"IF($C335=1,OFFSET(E335,-1,0)+1,OFFSET(E335,-1,0))","v":12},{"$f":"IF($C335=1,0,IF($C335=2,OFFSET(F335,-1,0)+1,OFFSET(F335,-1,0)))","v":1},{"$f":"IF(AND($C335<=2,$C335<>0),0,IF($C335=3,OFFSET(G335,-1,0)+1,OFFSET(G335,-1,0)))","v":0},{"$f":"IF(AND($C335<=3,$C335<>0),0,IF($C335=4,OFFSET(H335,-1,0)+1,OFFSET(H335,-1,0)))","v":0},0,{"$f":"IF(OR($C335=\"S\",$C335=0),0,MATCH(0,OFFSET($D335,1,$C335,ROW($C$505)-ROW($C335)),0))","v":0},{"$f":"IF(OR($C335=\"S\",$C335=0),0,MATCH(OFFSET($D335,0,$C335)+1,OFFSET($D335,1,$C335,ROW($C$505)-ROW($C335)),0))","v":0},"","Serviço","Serviço","-","COMPOSIÇÃO","COMP 018_SEE","CHAVE DUPLA P/ CONEXÕES TIPO STORZ EM LATÃO ENGATE RÁPIDO 1 1/2\" X 2 1/2\"","UN ",8,1,8,null,null,0,0,""]
["S",2,"S",0,12,1,0,0,0,{"$f":"IF(OR($C336=\"S\",$C336=0),0,MATCH(0,OFFSET($D336,1,$C336,ROW($C$505)-ROW($C336)),0))","v":0},{"$f":"IF(OR($C336=\"S\",$C336=0),0,MATCH(OFFSET($D336,0,$C336)+1,OFFSET($D336,1,$C336,ROW($C$505)-ROW($C336)),0))","v":0},"","Serviço","Serviço","-","AGETOP",80981,"REGISTRO DE ESFERA DIAMETRO 2.1/2\"","Un    ",1,1,1,null,null,0,0,""]
["S",2,"S",0,12,1,0,0,0,{"$f":"IF(OR($C337=\"S\",$C337=0),0,MATCH(0,OFFSET($D337,1,$C337,ROW($C$505)-ROW($C337)),0))","v":0},{"$f":"IF(OR($C337=\"S\",$C337=0),0,MATCH(OFFSET($D337,0,$C337)+1,OFFSET($D337,1,$C337,ROW($C$505)-ROW($C337)),0))","v":0},"","Serviço","Serviço","-","COMPOSIÇÃO","COMP 087_SEE","REGISTRO DE GAVETA COM HASTE ASCENDENTE DE BRONZE 2 1/2\"","UN ",1,1,1,null,null,0,0,""]
["S",2,"S",0,12,1,0,0,0,{"$f":"IF(OR($C338=\"S\",$C338=0),0,MATCH(0,OFFSET($D338,1,$C338,ROW($C$505)-ROW($C338)),0))","v":0},{"$f":"IF(OR($C338=\"S\",$C338=0),0,MATCH(OFFSET($D338,0,$C338)+1,OFFSET($D338,1,$C338,ROW($C$505)-ROW($C338)),0))","v":0},"","Serviço","Serviço","-","AGETOP",85056,"TÊ DE FERRO GALVANIZADO 90º X 2 1/2\"","un    ",4,1,4,null,null,0,0,""]
["S",2,"S",0,12,1,0,0,0,{"$f":"IF(OR($C339=\"S\",$C339=0),0,MATCH(0,OFFSET($D339,1,$C339,ROW($C$505)-ROW($C339)),0))","v":0},{"$f":"IF(OR($C339=\"S\",$C339=0),0,MATCH(OFFSET($D339,0,$C339)+1,OFFSET($D339,1,$C339,ROW($C$505)-ROW($C339)),0))","v":0},"","Serviço","Serviço","-","COMPOSIÇÃO","COMP 030_SEE","COTOVELO DE FERRO GALV. 90° X 2 1/2\"","UN ",10,1,10,null,null,0,0,""]
["S",2,"S",0,12,1,0,0,0,{"$f":"IF(OR($C340=\"S\",$C340=0),0,MATCH(0,OFFSET($D340,1,$C340,ROW($C$505)-ROW($C340)),0))","v":0},{"$f":"IF(OR($C340=\"S\",$C340=0),0,MATCH(OFFSET($D340,0,$C340)+1,OFFSET($D340,1,$C340,ROW($C$505)-ROW($C340)),0))","v":0},"","Serviço","Serviço","-","COMPOSIÇÃO","COMP 022_SEE","TAMPÃO FOFO 40X50CM C/INSCRIÇÃO ","UN ",1,1,1,null,null,0,0,""]
[{"$f":"CHOOSE(1+LOG(1+2*(ORÇAMENTO.Nivel=\"Nível 1\")+4*(ORÇAMENTO.Nivel=\"Nível 2\")+8*(ORÇAMENTO.Nivel=\"Nível 3\")+16*(ORÇAMENTO.Nivel=\"Nível 4\")+32*(ORÇAMENTO.Nivel=\"Serviço\"),2),0,1,2,3,4,\"S\")","v":"S"},2,"S",0,12,1,0,0,0,{"$f":"IF(OR($C341=\"S\",$C341=0),0,MATCH(0,OFFSET($D341,1,$C341,ROW($C$505)-ROW($C341)),0))","v":0},{"$f":"IF(OR($C341=\"S\",$C341=0),0,MATCH(OFFSET($D341,0,$C341)+1,OFFSET($D341,1,$C341,ROW($C$505)-ROW($C341)),0))","v":0},"","Serviço","Serviço","-","COMPOSIÇÃO","COMP 546_SEE","BUJÃO DE REBORDO 2.1/2\"","UN ",1,1,1,null,null,0,0,""]
["S",2,"S",0,12,1,0,0,0,{"$f":"IF(OR($C342=\"S\",$C342=0),0,MATCH(0,OFFSET($D342,1,$C342,ROW($C$505)-ROW($C342)),0))","v":0},{"$f":"IF(OR($C342=\"S\",$C342=0),0,MATCH(OFFSET($D342,0,$C342)+1,OFFSET($D342,1,$C342,ROW($C$505)-ROW($C342)),0))","v":0},"","Serviço","Serviço","-","COMPOSIÇÃO","COMP 186_SEE","BOTOEIRA BOMBA DE INCÊNDIO C/ MARTELO CONVENCIONAL/ ANALÓGICA","UN ",1,1,1,null,null,0,0,""]
["S",2,"S",0,12,1,0,0,0,{"$f":"IF(OR($C343=\"S\",$C343=0),0,MATCH(0,OFFSET($D343,1,$C343,ROW($C$505)-ROW($C343)),0))","v":0},{"$f":"IF(OR($C343=\"S\",$C343=0),0,MATCH(OFFSET($D343,0,$C343)+1,OFFSET($D343,1,$C343,ROW($C$505)-ROW($C343)),0))","v":0},"","Serviço","Serviço","-","COMPOSIÇÃO","COMP 188_SEE","ACIONADOR MANUAL DE ALARME","UN ",8,1,8,null,null,0,0,""]
["S",2,"S",0,12,1,0,0,0,{"$f":"IF(OR($C344=\"S\",$C344=0),0,MATCH(0,OFFSET($D344,1,$C344,ROW($C$505)-ROW($C344)),0))","v":0},{"$f":"IF(OR($C344=\"S\",$C344=0),0,MATCH(OFFSET($D344,0,$C344)+1,OFFSET($D344,1,$C344,ROW($C$505)-ROW($C344)),0))","v":0},"","Serviço","Serviço","-","COMPOSIÇÃO","COMP 190_SEE","CENTRAL DE DETECÇÃO E ALARME DE 40 SETORES COM BATERIA","UN ",1,1,1,null,null,0,0,""]
["S",2,"S",0,12,1,0,0,0,{"$f":"IF(OR($C345=\"S\",$C345=0),0,MATCH(0,OFFSET($D345,1,$C345,ROW($C$505)-ROW($C345)),0))","v":0},{"$f":"IF(OR($C345=\"S\",$C345=0),0,MATCH(OFFSET($D345,0,$C345)+1,OFFSET($D345,1,$C345,ROW($C$505)-ROW($C345)),0))","v":0},"","Serviço","Serviço","-","AGETOP",72338,"SIRENE METALICA ALCANCE 500 M","Un    ",2,1,2,null,null,0,0,""]
["S",2,"S",0,12,1,0,0,0,{"$f":"IF(OR($C346=\"S\",$C346=0),0,MATCH(0,OFFSET($D346,1,$C346,ROW($C$505)-ROW($C346)),0))","v":0},{"$f":"IF(OR($C346=\"S\",$C346=0),0,MATCH(OFFSET($D346,0,$C346)+1,OFFSET($D346,1,$C346,ROW($C$505)-ROW($C346)),0))","v":0},"","Serviço","Serviço","-","SINAPI",97599,"LUMINÁRIA DE EMERGÊNCIA, COM 30 LÂMPADAS LED DE 2 W, SEM REATOR - FORNECIMENTO E INSTALAÇÃO. AF_02/2020","UN",28,1,28,null,null,0,0,""]
["S",2,"S",0,12,1,0,0,0,{"$f":"IF(OR($C347=\"S\",$C347=0),0,MATCH(0,OFFSET($D347,1,$C347,ROW($C$505)-ROW($C347)),0))","v":0},{"$f":"IF(OR($C347=\"S\",$C347=0),0,MATCH(OFFSET($D347,0,$C347)+1,OFFSET($D347,1,$C347,ROW($C$505)-ROW($C347)),0))","v":0},"","Serviço","Serviço","-","COMPOSIÇÃO","COMP 024_SEE","SINALIZADOR FOTOLUMINESCENTE PARA EXTINTOR","UN ",9,1,9,null,null,0,0,""]
["S",2,"S",0,12,1,0,0,0,{"$f":"IF(OR($C348=\"S\",$C348=0),0,MATCH(0,OFFSET($D348,1,$C348,ROW($C$505)-ROW($C348)),0))","v":0},{"$f":"IF(OR($C348=\"S\",$C348=0),0,MATCH(OFFSET($D348,0,$C348)+1,OFFSET($D348,1,$C348,ROW($C$505)-ROW($C348)),0))","v":0},"","Serviço","Serviço","-","COMPOSIÇÃO","COMP 025_SEE","SINALIZADOR FOTOLUMINESCENTE DE EMERGÊNCIA","UN ",40,1,40,null,null,0,0,""]
["S",2,"S",0,12,1,0,0,0,{"$f":"IF(OR($C349=\"S\",$C349=0),0,MATCH(0,OFFSET($D349,1,$C349,ROW($C$505)-ROW($C349)),0))","v":0},{"$f":"IF(OR($C349=\"S\",$C349=0),0,MATCH(OFFSET($D349,0,$C349)+1,OFFSET($D349,1,$C349,ROW($C$505)-ROW($C349)),0))","v":0},"","Serviço","Serviço","-","COMPOSIÇÃO","COMP 277_SEE","MARCAÇÃO NO PISO - 1X1 M PARA EXTINTOR","M2",7,1,7,null,null,0,0,""]
["S",2,"S",0,12,1,0,0,0,{"$f":"IF(OR($C350=\"S\",$C350=0),0,MATCH(0,OFFSET($D350,1,$C350,ROW($C$505)-ROW($C350)),0))","v":0},{"$f":"IF(OR($C350=\"S\",$C350=0),0,MATCH(OFFSET($D350,0,$C350)+1,OFFSET($D350,1,$C350,ROW($C$505)-ROW($C350)),0))","v":0},"","Serviço","Serviço","-","COMPOSIÇÃO","COMP 235_SEE","PLACA DE SINALIZAÇÃO EM PVC COD 01 - (300X300) PROIBIDO FUMAR","UN ",1,1,1,null,null,0,0,""]
["S",2,"S",0,12,1,0,0,0,{"$f":"IF(OR($C351=\"S\",$C351=0),0,MATCH(0,OFFSET($D351,1,$C351,ROW($C$505)-ROW($C351)),0))","v":0},{"$f":"IF(OR($C351=\"S\",$C351=0),0,MATCH(OFFSET($D351,0,$C351)+1,OFFSET($D351,1,$C351,ROW($C$505)-ROW($C351)),0))","v":0},"","Serviço","Serviço","-","COMPOSIÇÃO","COMP 236_SEE","PLACA DE SINALIZAÇÃO EM PVC COD 06 - (300X300) PERIGO INFLAMÁVEL","UN ",1,1,1,null,null,0,0,""]
[2,2,2,3,12,2,0,0,0,{"$f":"IF(OR($C352=\"S\",$C352=0),0,MATCH(0,OFFSET($D352,1,$C352,ROW($C$505)-ROW($C352)),0))","v":14},{"$f":"IF(OR($C352=\"S\",$C352=0),0,MATCH(OFFSET($D352,0,$C352)+1,OFFSET($D352,1,$C352,ROW($C$505)-ROW($C352)),0))","v":3},"","Nível 2","Nível 2","-","SINAPI",null,"SERVIÇOS PRELIMINARES","-",null,1,"-",null,null,0,0,""]
["S",2,"S",0,12,2,0,0,0,{"$f":"IF(OR($C353=\"S\",$C353=0),0,MATCH(0,OFFSET($D353,1,$C353,ROW($C$505)-ROW($C353)),0))","v":0},{"$f":"IF(OR($C353=\"S\",$C353=0),0,MATCH(OFFSET($D353,0,$C353)+1,OFFSET($D353,1,$C353,ROW($C$505)-ROW($C353)),0))","v":0},"","Serviço","Serviço","-","AGETOP",20121,"DEM. MANUAL EM CONCR.SIMPLES C/TR.ATE CB.E CARGA (O.C.)","m3    ",0.7,1,0.7,null,null,0,0,""]
["S",2,"S",0,12,2,0,0,0,{"$f":"IF(OR($C354=\"S\",$C354=0),0,MATCH(0,OFFSET($D354,1,$C354,ROW($C$505)-ROW($C354)),0))","v":0},{"$f":"IF(OR($C354=\"S\",$C354=0),0,MATCH(OFFSET($D354,0,$C354)+1,OFFSET($D354,1,$C354,ROW($C$505)-ROW($C354)),0))","v":0},"","Serviço","Serviço","-","AGETOP",20109,"DEM.PISO CIMENT.SOBRE LASTRO CONC.C/TR.ATE CB. E CARGA","m2    ",11.16,1,11.16,null,null,0,0,""]
[2,2,2,3,12,3,0,0,0,{"$f":"IF(OR($C355=\"S\",$C355=0),0,MATCH(0,OFFSET($D355,1,$C355,ROW($C$505)-ROW($C355)),0))","v":11},{"$f":"IF(OR($C355=\"S\",$C355=0),0,MATCH(OFFSET($D355,0,$C355)+1,OFFSET($D355,1,$C355,ROW($C$505)-ROW($C355)),0))","v":3},"","Nível 2","Nível 2","-","SINAPI",null,"TRANSPORTES","-",null,1,"-",null,null,0,0,""]
["S",2,"S",0,12,3,0,0,0,{"$f":"IF(OR($C356=\"S\",$C356=0),0,MATCH(0,OFFSET($D356,1,$C356,ROW($C$505)-ROW($C356)),0))","v":0},{"$f":"IF(OR($C356=\"S\",$C356=0),0,MATCH(OFFSET($D356,0,$C356)+1,OFFSET($D356,1,$C356,ROW($C$505)-ROW($C356)),0))","v":0},"","Serviço","Serviço","-","SINAPI",72900,"TRANSPORTE DE ENTULHO COM CAMINHAO BASCULANTE 6 M3, RODOVIA PAVIMENTADA, DMT 0,5 A 1,0 KM","M3",1.25,1,1.25,null,null,0,0,""]
["S",2,"S",0,12,3,0,0,0,{"$f":"IF(OR($C357=\"S\",$C357=0),0,MATCH(0,OFFSET($D357,1,$C357,ROW($C$505)-ROW($C357)),0))","v":0},{"$f":"IF(OR($C357=\"S\",$C357=0),0,MATCH(OFFSET($D357,0,$C357)+1,OFFSET($D357,1,$C357,ROW($C$505)-ROW($C357)),0))","v":0},"","Serviço","Serviço","-","SINAPI",72897,"CARGA MANUAL DE ENTULHO EM CAMINHAO BASCULANTE 6 M3","M3",1.25,1,1.25,null,null,0,0,""]
[2,2,2,3,12,4,0,0,0,{"$f":"IF(OR($C358=\"S\",$C358=0),0,MATCH(0,OFFSET($D358,1,$C358,ROW($C$505)-ROW($C358)),0))","v":8},{"$f":"IF(OR($C358=\"S\",$C358=0),0,MATCH(OFFSET($D358,0,$C358)+1,OFFSET($D358,1,$C358,ROW($C$505)-ROW($C358)),0))","v":3},"","Nível 2","Nível 2","-","SINAPI",null,"SERVIÇO EM TERRA","-",null,1,"-",null,null,0,0,""]
["S",2,"S",0,12,4,0,0,0,{"$f":"IF(OR($C359=\"S\",$C359=0),0,MATCH(0,OFFSET($D359,1,$C359,ROW($C$505)-ROW($C359)),0))","v":0},{"$f":"IF(OR($C359=\"S\",$C359=0),0,MATCH(OFFSET($D359,0,$C359)+1,OFFSET($D359,1,$C359,ROW($C$505)-ROW($C359)),0))","v":0},"","Serviço","Serviço","-","AGETOP",40101,"ESCAVACAO MANUAL DE VALAS < 1 MTS. (OBRAS CIVIS)","m3    ",12.55,1,12.55,null,null,0,0,""]
["S",2,"S",0,12,4,0,0,0,{"$f":"IF(OR($C360=\"S\",$C360=0),0,MATCH(0,OFFSET($D360,1,$C360,ROW($C$505)-ROW($C360)),0))","v":0},{"$f":"IF(OR($C360=\"S\",$C360=0),0,MATCH(OFFSET($D360,0,$C360)+1,OFFSET($D360,1,$C360,ROW($C$505)-ROW($C360)),0))","v":0},"","Serviço","Serviço","-","AGETOP",40902,"REATERRO COM APILOAMENTO","m3    ",12.55,1,12.55,null,null,0,0,""]
[2,2,2,5,12,5,0,0,0,{"$f":"IF(OR($C361=\"S\",$C361=0),0,MATCH(0,OFFSET($D361,1,$C361,ROW($C$505)-ROW($C361)),0))","v":5},{"$f":"IF(OR($C361=\"S\",$C361=0),0,MATCH(OFFSET($D361,0,$C361)+1,OFFSET($D361,1,$C361,ROW($C$505)-ROW($C361)),0))","v":{"$error":"#N/A"}},"","Nível 2","Nível 2","-","SINAPI",null,"REVESTIMENTO DE PISO","-",null,1,"-",null,null,0,0,""]
["S",2,"S",0,12,5,0,0,0,{"$f":"IF(OR($C362=\"S\",$C362=0),0,MATCH(0,OFFSET($D362,1,$C362,ROW($C$505)-ROW($C362)),0))","v":0},{"$f":"IF(OR($C362=\"S\",$C362=0),0,MATCH(OFFSET($D362,0,$C362)+1,OFFSET($D362,1,$C362,ROW($C$505)-ROW($C362)),0))","v":0},"","Serviço","Serviço","-","AGETOP",220102,"PISO CONCRETO DESEMPENADO ESPESSURA = 5 CM  1:2,5:3,5","m2    ",13.93,1,13.93,null,null,0,0,""]
["S",2,"S",0,12,5,0,0,0,{"$f":"IF(OR($C363=\"S\",$C363=0),0,MATCH(0,OFFSET($D363,1,$C363,ROW($C$505)-ROW($C363)),0))","v":0},{"$f":"IF(OR($C363=\"S\",$C363=0),0,MATCH(OFFSET($D363,0,$C363)+1,OFFSET($D363,1,$C363,ROW($C$505)-ROW($C363)),0))","v":0},"","Serviço","Serviço","-","AGETOP",220101,"LASTRO DE CONCRETO REGULARIZADO IMPERMEABILIZADO 1:3:6 ESP=5CM (BASE)","m2    ",11.16,1,11.16,null,null,0,0,""]
["S",2,"S",0,12,5,0,0,0,{"$f":"IF(OR($C364=\"S\",$C364=0),0,MATCH(0,OFFSET($D364,1,$C364,ROW($C$505)-ROW($C364)),0))","v":0},{"$f":"IF(OR($C364=\"S\",$C364=0),0,MATCH(OFFSET($D364,0,$C364)+1,OFFSET($D364,1,$C364,ROW($C$505)-ROW($C364)),0))","v":0},"","Serviço","Serviço","-","AGETOP",221101,"GRANITINA 8MM FUNDIDA COM CONTRAPISO (1CI:3ARML) E=2CM E JUNTA PLASTICA 27MM","m2    ",11.16,1,11.16,null,null,0,0,""]
["S",2,"S",0,12,5,0,0,0,{"$f":"IF(OR($C365=\"S\",$C365=0),0,MATCH(0,OFFSET($D365,1,$C365,ROW($C$505)-ROW($C365)),0))","v":0},{"$f":"IF(OR($C365=\"S\",$C365=0),0,MATCH(OFFSET($D365,0,$C365)+1,OFFSET($D365,1,$C365,ROW($C$505)-ROW($C365)),0))","v":0},"","Serviço","Serviço","-","AGETOP",221104,"RASPAGEM E APLICAÇÃO RESINA ACRÍLICA DUAS DEMÃOS","m2    ",11.16,1,11.16,null,null,0,0,""]
[1,1,1,3,13,0,0,0,0,{"$f":"IF(OR($C366=\"S\",$C366=0),0,MATCH(0,OFFSET($D366,1,$C366,ROW($C$505)-ROW($C366)),0))","v":139},{"$f":"IF(OR($C366=\"S\",$C366=0),0,MATCH(OFFSET($D366,0,$C366)+1,OFFSET($D366,1,$C366,ROW($C$505)-ROW($C366)),0))","v":3},"F","Nível 1","Nível 1","13.","SINAPI",null,"PROJETO DE ESTRUTURAS METÁLICAS","UN",1,1,1,null,null,0,0,""]
[2,2,2,2,13,1,0,0,0,{"$f":"IF(OR($C367=\"S\",$C367=0),0,MATCH(0,OFFSET($D367,1,$C367,ROW($C$505)-ROW($C367)),0))","v":2},{"$f":"IF(OR($C367=\"S\",$C367=0),0,MATCH(OFFSET($D367,0,$C367)+1,OFFSET($D367,1,$C367,ROW($C$505)-ROW($C367)),0))","v":9},"","Nível 2","Nível 2","-","SINAPI",null,"ESTRUTURAS METÁLICAS","-",null,1,"-",null,null,0,0,""]
["S",2,"S",0,13,1,0,0,0,{"$f":"IF(OR($C368=\"S\",$C368=0),0,MATCH(0,OFFSET($D368,1,$C368,ROW($C$505)-ROW($C368)),0))","v":0},{"$f":"IF(OR($C368=\"S\",$C368=0),0,MATCH(OFFSET($D368,0,$C368)+1,OFFSET($D368,1,$C368,ROW($C$505)-ROW($C368)),0))","v":0},"","Serviço","Serviço","-","AGETOP",150204,"ESTRUTURA METÁLICA CONVENCIONAL EM AÇO DO TIPO MR-250 / ASTM A36 COM FUNDO ANTICORROSIVO","Kg    ",95.34,1,95.34,null,null,0,0,""]
[1,1,1,75,14,0,0,0,0,{"$f":"IF(OR($C369=\"S\",$C369=0),0,MATCH(0,OFFSET($D369,1,$C369,ROW($C$505)-ROW($C369)),0))","v":136},{"$f":"IF(OR($C369=\"S\",$C369=0),0,MATCH(OFFSET($D369,0,$C369)+1,OFFSET($D369,1,$C369,ROW($C$505)-ROW($C369)),0))","v":75},"F","Nível 1","Nível 1","14.","SINAPI",null,"PROJETO ESTRUTURAL","UN",1,1,1,null,null,0,0,""]
[2,2,2,6,14,1,0,0,0,{"$f":"IF(OR($C370=\"S\",$C370=0),0,MATCH(0,OFFSET($D370,1,$C370,ROW($C$505)-ROW($C370)),0))","v":74},{"$f":"IF(OR($C370=\"S\",$C370=0),0,MATCH(OFFSET($D370,0,$C370)+1,OFFSET($D370,1,$C370,ROW($C$505)-ROW($C370)),0))","v":6},"","Nível 2","Nível 2","-","SINAPI",null,"FUNDAÇÕES E SONDAGENS","-",null,1,"-",null,null,0,0,""]
[3,3,3,5,14,1,1,0,0,{"$f":"IF(OR($C371=\"S\",$C371=0),0,MATCH(0,OFFSET($D371,1,$C371,ROW($C$505)-ROW($C371)),0))","v":5},{"$f":"IF(OR($C371=\"S\",$C371=0),0,MATCH(OFFSET($D371,0,$C371)+1,OFFSET($D371,1,$C371,ROW($C$505)-ROW($C371)),0))","v":16},"","Nível 3","Nível 3","-","SINAPI",null,"ESTACAS E ARRANQUES","-",null,1,"-",null,null,0,0,""]
["S",3,"S",0,14,1,1,0,0,{"$f":"IF(OR($C372=\"S\",$C372=0),0,MATCH(0,OFFSET($D372,1,$C372,ROW($C$505)-ROW($C372)),0))","v":0},{"$f":"IF(OR($C372=\"S\",$C372=0),0,MATCH(OFFSET($D372,0,$C372)+1,OFFSET($D372,1,$C372,ROW($C$505)-ROW($C372)),0))","v":0},"","Serviço","Serviço","-","AGETOP",50302,"ESTACA A TRADO DIAM.30 CM SEM FERRO","M     ",12,1,12,null,null,0,0,""]
["S",3,"S",0,14,1,1,0,0,{"$f":"IF(OR($C373=\"S\",$C373=0),0,MATCH(0,OFFSET($D373,1,$C373,ROW($C$505)-ROW($C373)),0))","v":0},{"$f":"IF(OR($C373=\"S\",$C373=0),0,MATCH(OFFSET($D373,0,$C373)+1,OFFSET($D373,1,$C373,ROW($C$505)-ROW($C373)),0))","v":0},"","Serviço","Serviço","-","AGETOP",52004,"ACO CA 50-A - 8,0 MM (5/16\") - (OBRAS CIVIS)","Kg    ",9.0909090909090899,1,9.0909090909090899,null,null,0,0,""]
["S",3,"S",0,14,1,1,0,0,{"$f":"IF(OR($C374=\"S\",$C374=0),0,MATCH(0,OFFSET($D374,1,$C374,ROW($C$505)-ROW($C374)),0))","v":0},{"$f":"IF(OR($C374=\"S\",$C374=0),0,MATCH(OFFSET($D374,0,$C374)+1,OFFSET($D374,1,$C374,ROW($C$505)-ROW($C374)),0))","v":0},"","Serviço","Serviço","-","AGETOP",52005,"ACO CA-50A - 10,0 MM (3/8\") - (OBRAS CIVIS)","Kg    ",16.363636363636363,1,16.363636363636363,null,null,0,0,""]
["S",3,"S",0,14,1,1,0,0,{"$f":"IF(OR($C375=\"S\",$C375=0),0,MATCH(0,OFFSET($D375,1,$C375,ROW($C$505)-ROW($C375)),0))","v":0},{"$f":"IF(OR($C375=\"S\",$C375=0),0,MATCH(OFFSET($D375,0,$C375)+1,OFFSET($D375,1,$C375,ROW($C$505)-ROW($C375)),0))","v":0},"","Serviço","Serviço","-","AGETOP",52014,"ACO CA-60 - 5,0 MM - (OBRAS CIVIS)","Kg    ",3.6363636363636362,1,3.6363636363636362,null,null,0,0,""]
[2,2,2,34,14,2,0,0,0,{"$f":"IF(OR($C376=\"S\",$C376=0),0,MATCH(0,OFFSET($D376,1,$C376,ROW($C$505)-ROW($C376)),0))","v":68},{"$f":"IF(OR($C376=\"S\",$C376=0),0,MATCH(OFFSET($D376,0,$C376)+1,OFFSET($D376,1,$C376,ROW($C$505)-ROW($C376)),0))","v":34},"","Nível 2","Nível 2","-","SINAPI",null,"ESTRUTURA","-",null,1,"-",null,null,0,0,""]
[3,3,3,10,14,2,1,0,0,{"$f":"IF(OR($C377=\"S\",$C377=0),0,MATCH(0,OFFSET($D377,1,$C377,ROW($C$505)-ROW($C377)),0))","v":33},{"$f":"IF(OR($C377=\"S\",$C377=0),0,MATCH(OFFSET($D377,0,$C377)+1,OFFSET($D377,1,$C377,ROW($C$505)-ROW($C377)),0))","v":10},"","Nível 3","Nível 3","-","SINAPI",null,"VIGAS BALDRAMES","-",null,1,"-",null,null,0,0,""]
["S",3,"S",0,14,2,1,0,0,{"$f":"IF(OR($C378=\"S\",$C378=0),0,MATCH(0,OFFSET($D378,1,$C378,ROW($C$505)-ROW($C378)),0))","v":0},{"$f":"IF(OR($C378=\"S\",$C378=0),0,MATCH(OFFSET($D378,0,$C378)+1,OFFSET($D378,1,$C378,ROW($C$505)-ROW($C378)),0))","v":0},"","Serviço","Serviço","-","AGETOP",40101,"ESCAVACAO MANUAL DE VALAS < 1 MTS. (OBRAS CIVIS)","m3    ",1.1499999999999999,1,1.1499999999999999,null,null,0,0,""]
["S",3,"S",0,14,2,1,0,0,{"$f":"IF(OR($C379=\"S\",$C379=0),0,MATCH(0,OFFSET($D379,1,$C379,ROW($C$505)-ROW($C379)),0))","v":0},{"$f":"IF(OR($C379=\"S\",$C379=0),0,MATCH(OFFSET($D379,0,$C379)+1,OFFSET($D379,1,$C379,ROW($C$505)-ROW($C379)),0))","v":0},"","Serviço","Serviço","-","AGETOP",60191,"FORMA DE TABUA CINTA BALDRAME U=8 VEZES","m2    ",5.72,1,5.72,null,null,0,0,""]
["S",3,"S",0,14,2,1,0,0,{"$f":"IF(OR($C380=\"S\",$C380=0),0,MATCH(0,OFFSET($D380,1,$C380,ROW($C$505)-ROW($C380)),0))","v":0},{"$f":"IF(OR($C380=\"S\",$C380=0),0,MATCH(OFFSET($D380,0,$C380)+1,OFFSET($D380,1,$C380,ROW($C$505)-ROW($C380)),0))","v":0},"","Serviço","Serviço","-","AGETOP",41002,"APILOAMENTO","m2    ",3.81,1,3.81,null,null,0,0,""]
["S",3,"S",0,14,2,1,0,0,{"$f":"IF(OR($C381=\"S\",$C381=0),0,MATCH(0,OFFSET($D381,1,$C381,ROW($C$505)-ROW($C381)),0))","v":0},{"$f":"IF(OR($C381=\"S\",$C381=0),0,MATCH(OFFSET($D381,0,$C381)+1,OFFSET($D381,1,$C381,ROW($C$505)-ROW($C381)),0))","v":0},"","Serviço","Serviço","-","SINAPI",94963,"CONCRETO FCK = 15MPA, TRAÇO 1:3,4:3,5 (CIMENTO/ AREIA MÉDIA/ BRITA 1)  - PREPARO MECÂNICO COM BETONEIRA 400 L. AF_07/2016","M3",0.4,1,0.4,null,null,0,0,""]
["S",3,"S",0,14,2,1,0,0,{"$f":"IF(OR($C382=\"S\",$C382=0),0,MATCH(0,OFFSET($D382,1,$C382,ROW($C$505)-ROW($C382)),0))","v":0},{"$f":"IF(OR($C382=\"S\",$C382=0),0,MATCH(OFFSET($D382,0,$C382)+1,OFFSET($D382,1,$C382,ROW($C$505)-ROW($C382)),0))","v":0},"","Serviço","Serviço","-","AGETOP",51055,"LANÇAMENTO/APLICAÇÃO/ADENSAMENTO MANUAL DE CONCRETO - (O.C.)","m3    ",0.4,1,0.4,null,null,0,0,""]
["S",3,"S",0,14,2,1,0,0,{"$f":"IF(OR($C383=\"S\",$C383=0),0,MATCH(0,OFFSET($D383,1,$C383,ROW($C$505)-ROW($C383)),0))","v":0},{"$f":"IF(OR($C383=\"S\",$C383=0),0,MATCH(OFFSET($D383,0,$C383)+1,OFFSET($D383,1,$C383,ROW($C$505)-ROW($C383)),0))","v":0},"","Serviço","Serviço","-","AGETOP",40902,"REATERRO COM APILOAMENTO","m3    ",0.74999999999999989,1,0.74999999999999989,null,null,0,0,""]
["S",3,"S",0,14,2,1,0,0,{"$f":"IF(OR($C384=\"S\",$C384=0),0,MATCH(0,OFFSET($D384,1,$C384,ROW($C$505)-ROW($C384)),0))","v":0},{"$f":"IF(OR($C384=\"S\",$C384=0),0,MATCH(OFFSET($D384,0,$C384)+1,OFFSET($D384,1,$C384,ROW($C$505)-ROW($C384)),0))","v":0},"","Serviço","Serviço","-","AGETOP",52004,"ACO CA 50-A - 8,0 MM (5/16\") - (OBRAS CIVIS)","Kg    ",17.27272727272727,1,17.27272727272727,null,null,0,0,""]
["S",3,"S",0,14,2,1,0,0,{"$f":"IF(OR($C385=\"S\",$C385=0),0,MATCH(0,OFFSET($D385,1,$C385,ROW($C$505)-ROW($C385)),0))","v":0},{"$f":"IF(OR($C385=\"S\",$C385=0),0,MATCH(OFFSET($D385,0,$C385)+1,OFFSET($D385,1,$C385,ROW($C$505)-ROW($C385)),0))","v":0},"","Serviço","Serviço","-","AGETOP",52014,"ACO CA-60 - 5,0 MM - (OBRAS CIVIS)","Kg    ",8.1818181818181817,1,8.1818181818181817,null,null,0,0,""]
["S",3,"S",0,14,2,1,0,0,{"$f":"IF(OR($C386=\"S\",$C386=0),0,MATCH(0,OFFSET($D386,1,$C386,ROW($C$505)-ROW($C386)),0))","v":0},{"$f":"IF(OR($C386=\"S\",$C386=0),0,MATCH(OFFSET($D386,0,$C386)+1,OFFSET($D386,1,$C386,ROW($C$505)-ROW($C386)),0))","v":0},"","Serviço","Serviço","-","AGETOP",120902,"IMPERMEABILIZACAO VIGAS BALDRAMES E=2,0 CM","m2    ",7.05,1,7.05,null,null,0,0,""]
[3,3,3,6,14,2,2,0,0,{"$f":"IF(OR($C387=\"S\",$C387=0),0,MATCH(0,OFFSET($D387,1,$C387,ROW($C$505)-ROW($C387)),0))","v":23},{"$f":"IF(OR($C387=\"S\",$C387=0),0,MATCH(OFFSET($D387,0,$C387)+1,OFFSET($D387,1,$C387,ROW($C$505)-ROW($C387)),0))","v":6},"","Nível 3","Nível 3","-","SINAPI",null,"VIGAS INTERMEDIARIAS","-",null,1,"-",null,null,0,0,""]
["S",3,"S",0,14,2,2,0,0,{"$f":"IF(OR($C388=\"S\",$C388=0),0,MATCH(0,OFFSET($D388,1,$C388,ROW($C$505)-ROW($C388)),0))","v":0},{"$f":"IF(OR($C388=\"S\",$C388=0),0,MATCH(OFFSET($D388,0,$C388)+1,OFFSET($D388,1,$C388,ROW($C$505)-ROW($C388)),0))","v":0},"","Serviço","Serviço","-","SINAPI",92426,"MONTAGEM E DESMONTAGEM DE FÔRMA DE PILARES RETANGULARES E ESTRUTURAS SIMILARES COM ÁREA MÉDIA DAS SEÇÕES MENOR OU IGUAL A 0,25 M², PÉ-DIREITO SIMPLES, EM CHAPA DE MADEIRA COMPENSADA RESINADA, 8 UTILIZAÇÕES. AF_12/2015","M2",7,1,7,null,null,0,0,""]
["S",3,"S",0,14,2,2,0,0,{"$f":"IF(OR($C389=\"S\",$C389=0),0,MATCH(0,OFFSET($D389,1,$C389,ROW($C$505)-ROW($C389)),0))","v":0},{"$f":"IF(OR($C389=\"S\",$C389=0),0,MATCH(OFFSET($D389,0,$C389)+1,OFFSET($D389,1,$C389,ROW($C$505)-ROW($C389)),0))","v":0},"","Serviço","Serviço","-","SINAPI",94963,"CONCRETO FCK = 15MPA, TRAÇO 1:3,4:3,5 (CIMENTO/ AREIA MÉDIA/ BRITA 1)  - PREPARO MECÂNICO COM BETONEIRA 400 L. AF_07/2016","M3",0.4,1,0.4,null,null,0,0,""]
["S",3,"S",0,14,2,2,0,0,{"$f":"IF(OR($C390=\"S\",$C390=0),0,MATCH(0,OFFSET($D390,1,$C390,ROW($C$505)-ROW($C390)),0))","v":0},{"$f":"IF(OR($C390=\"S\",$C390=0),0,MATCH(OFFSET($D390,0,$C390)+1,OFFSET($D390,1,$C390,ROW($C$505)-ROW($C390)),0))","v":0},"","Serviço","Serviço","-","AGETOP",51055,"LANÇAMENTO/APLICAÇÃO/ADENSAMENTO MANUAL DE CONCRETO - (O.C.)","m3    ",0.4,1,0.4,null,null,0,0,""]
["S",3,"S",0,14,2,2,0,0,{"$f":"IF(OR($C391=\"S\",$C391=0),0,MATCH(0,OFFSET($D391,1,$C391,ROW($C$505)-ROW($C391)),0))","v":0},{"$f":"IF(OR($C391=\"S\",$C391=0),0,MATCH(OFFSET($D391,0,$C391)+1,OFFSET($D391,1,$C391,ROW($C$505)-ROW($C391)),0))","v":0},"","Serviço","Serviço","-","AGETOP",52004,"ACO CA 50-A - 8,0 MM (5/16\") - (OBRAS CIVIS)","Kg    ",17.27272727272727,1,17.27272727272727,null,null,0,0,""]
["S",3,"S",0,14,2,2,0,0,{"$f":"IF(OR($C392=\"S\",$C392=0),0,MATCH(0,OFFSET($D392,1,$C392,ROW($C$505)-ROW($C392)),0))","v":0},{"$f":"IF(OR($C392=\"S\",$C392=0),0,MATCH(OFFSET($D392,0,$C392)+1,OFFSET($D392,1,$C392,ROW($C$505)-ROW($C392)),0))","v":0},"","Serviço","Serviço","-","AGETOP",52014,"ACO CA-60 - 5,0 MM - (OBRAS CIVIS)","Kg    ",8.1818181818181817,1,8.1818181818181817,null,null,0,0,""]
[3,3,3,6,14,2,3,0,0,{"$f":"IF(OR($C393=\"S\",$C393=0),0,MATCH(0,OFFSET($D393,1,$C393,ROW($C$505)-ROW($C393)),0))","v":17},{"$f":"IF(OR($C393=\"S\",$C393=0),0,MATCH(OFFSET($D393,0,$C393)+1,OFFSET($D393,1,$C393,ROW($C$505)-ROW($C393)),0))","v":6},"","Nível 3","Nível 3","-","SINAPI",null,"VIGAS DA COBERTURA","-",null,1,"-",null,null,0,0,""]
["S",3,"S",0,14,2,3,0,0,{"$f":"IF(OR($C394=\"S\",$C394=0),0,MATCH(0,OFFSET($D394,1,$C394,ROW($C$505)-ROW($C394)),0))","v":0},{"$f":"IF(OR($C394=\"S\",$C394=0),0,MATCH(OFFSET($D394,0,$C394)+1,OFFSET($D394,1,$C394,ROW($C$505)-ROW($C394)),0))","v":0},"","Serviço","Serviço","-","AGETOP",60209,"FORMA CH.COMPENSADA 12MM-VIGA/PILAR U=4V - (OBRAS CIVIS","m2    ",7,1,7,null,null,0,0,""]
["S",3,"S",0,14,2,3,0,0,{"$f":"IF(OR($C395=\"S\",$C395=0),0,MATCH(0,OFFSET($D395,1,$C395,ROW($C$505)-ROW($C395)),0))","v":0},{"$f":"IF(OR($C395=\"S\",$C395=0),0,MATCH(OFFSET($D395,0,$C395)+1,OFFSET($D395,1,$C395,ROW($C$505)-ROW($C395)),0))","v":0},"","Serviço","Serviço","-","SINAPI",94964,"CONCRETO FCK = 20MPA, TRAÇO 1:2,7:3 (CIMENTO/ AREIA MÉDIA/ BRITA 1)  - PREPARO MECÂNICO COM BETONEIRA 400 L. AF_07/2016","M3",0.4,1,0.4,null,null,0,0,""]
["S",3,"S",0,14,2,3,0,{"$f":"IF(AND($C396<=4,$C396<>0),0,IF(AND($C396=\"S\",$Y396>0),OFFSET(I396,-1,0)+1,OFFSET(I396,-1,0)))","v":0},{"$f":"IF(OR($C396=\"S\",$C396=0),0,MATCH(0,OFFSET($D396,1,$C396,ROW($C$505)-ROW($C396)),0))","v":0},{"$f":"IF(OR($C396=\"S\",$C396=0),0,MATCH(OFFSET($D396,0,$C396)+1,OFFSET($D396,1,$C396,ROW($C$505)-ROW($C396)),0))","v":0},"","Serviço","Serviço","-","AGETOP",51055,"LANÇAMENTO/APLICAÇÃO/ADENSAMENTO MANUAL DE CONCRETO - (O.C.)","m3    ",0.4,1,0.4,null,null,0,0,""]
["S",3,"S",0,14,2,3,0,0,{"$f":"IF(OR($C397=\"S\",$C397=0),0,MATCH(0,OFFSET($D397,1,$C397,ROW($C$505)-ROW($C397)),0))","v":0},{"$f":"IF(OR($C397=\"S\",$C397=0),0,MATCH(OFFSET($D397,0,$C397)+1,OFFSET($D397,1,$C397,ROW($C$505)-ROW($C397)),0))","v":0},"","Serviço","Serviço","-","AGETOP",52004,"ACO CA 50-A - 8,0 MM (5/16\") - (OBRAS CIVIS)","Kg    ",17.27272727272727,1,17.27272727272727,null,null,0,0,""]
["S",3,"S",0,14,2,3,0,0,{"$f":"IF(OR($C398=\"S\",$C398=0),0,MATCH(0,OFFSET($D398,1,$C398,ROW($C$505)-ROW($C398)),0))","v":0},{"$f":"IF(OR($C398=\"S\",$C398=0),0,MATCH(OFFSET($D398,0,$C398)+1,OFFSET($D398,1,$C398,ROW($C$505)-ROW($C398)),0))","v":0},"","Serviço","Serviço","-","AGETOP",52014,"ACO CA-60 - 5,0 MM - (OBRAS CIVIS)","Kg    ",8.1818181818181817,1,8.1818181818181817,null,null,0,0,""]
[3,{"$f":"IF(OR(C399=\"s\",C399=0),OFFSET(B399,-1,0),C399)","v":3},{"$f":"IF(OFFSET(C399,-1,0)=\"L\",1,IF(OFFSET(C399,-1,0)=1,2,IF(OR(A399=\"s\",A399=0),\"S\",IF(AND(OFFSET(C399,-1,0)=2,A399=4),3,IF(AND(OR(OFFSET(C399,-1,0)=\"s\",OFFSET(C399,-1,0)=0),A399<>\"s\",A399>OFFSET(B399,-1,0)),OFFSET(B399,-1,0),A399)))))","v":3},{"$f":"IF(OR(C399=\"S\",C399=0),0,IF(ISERROR(K399),J399,SMALL(J399:K399,1)))","v":5},{"$f":"IF($C399=1,OFFSET(E399,-1,0)+1,OFFSET(E399,-1,0))","v":14},{"$f":"IF($C399=1,0,IF($C399=2,OFFSET(F399,-1,0)+1,OFFSET(F399,-1,0)))","v":2},{"$f":"IF(AND($C399<=2,$C399<>0),0,IF($C399=3,OFFSET(G399,-1,0)+1,OFFSET(G399,-1,0)))","v":4},{"$f":"IF(AND($C399<=3,$C399<>0),0,IF($C399=4,OFFSET(H399,-1,0)+1,OFFSET(H399,-1,0)))","v":0},0,{"$f":"IF(OR($C399=\"S\",$C399=0),0,MATCH(0,OFFSET($D399,1,$C399,ROW($C$505)-ROW($C399)),0))","v":11},{"$f":"IF(OR($C399=\"S\",$C399=0),0,MATCH(OFFSET($D399,0,$C399)+1,OFFSET($D399,1,$C399,ROW($C$505)-ROW($C399)),0))","v":5},"","Nível 3","Nível 3","-","SINAPI",null,"LAJES MACIÇAS","-",null,1,"-",null,null,0,0,""]
["S",3,"S",0,14,2,4,0,0,{"$f":"IF(OR($C400=\"S\",$C400=0),0,MATCH(0,OFFSET($D400,1,$C400,ROW($C$505)-ROW($C400)),0))","v":0},{"$f":"IF(OR($C400=\"S\",$C400=0),0,MATCH(OFFSET($D400,0,$C400)+1,OFFSET($D400,1,$C400,ROW($C$505)-ROW($C400)),0))","v":0},"","Serviço","Serviço","-","SINAPI",92267,"FABRICAÇÃO DE FÔRMA PARA LAJES, EM CHAPA DE MADEIRA COMPENSADA RESINADA, E = 17 MM. AF_12/2015","M2",5.78,1,5.78,null,null,0,0,""]
["S",3,"S",0,14,2,4,0,0,{"$f":"IF(OR($C401=\"S\",$C401=0),0,MATCH(0,OFFSET($D401,1,$C401,ROW($C$505)-ROW($C401)),0))","v":0},{"$f":"IF(OR($C401=\"S\",$C401=0),0,MATCH(OFFSET($D401,0,$C401)+1,OFFSET($D401,1,$C401,ROW($C$505)-ROW($C401)),0))","v":0},"","Serviço","Serviço","-","SINAPI",94964,"CONCRETO FCK = 20MPA, TRAÇO 1:2,7:3 (CIMENTO/ AREIA MÉDIA/ BRITA 1)  - PREPARO MECÂNICO COM BETONEIRA 400 L. AF_07/2016","M3",0.7,1,0.7,null,null,0,0,""]
["S",3,"S",0,14,2,4,0,0,{"$f":"IF(OR($C402=\"S\",$C402=0),0,MATCH(0,OFFSET($D402,1,$C402,ROW($C$505)-ROW($C402)),0))","v":0},{"$f":"IF(OR($C402=\"S\",$C402=0),0,MATCH(OFFSET($D402,0,$C402)+1,OFFSET($D402,1,$C402,ROW($C$505)-ROW($C402)),0))","v":0},"","Serviço","Serviço","-","AGETOP",51055,"LANÇAMENTO/APLICAÇÃO/ADENSAMENTO MANUAL DE CONCRETO - (O.C.)","m3    ",0.7,1,0.7,null,null,0,0,""]
["S",3,"S",0,14,2,4,0,0,{"$f":"IF(OR($C403=\"S\",$C403=0),0,MATCH(0,OFFSET($D403,1,$C403,ROW($C$505)-ROW($C403)),0))","v":0},{"$f":"IF(OR($C403=\"S\",$C403=0),0,MATCH(OFFSET($D403,0,$C403)+1,OFFSET($D403,1,$C403,ROW($C$505)-ROW($C403)),0))","v":0},"","Serviço","Serviço","-","AGETOP",52003,"ACO CA-50A - 6,3 MM (1/4\") - (OBRAS CIVIS)","Kg    ",25.454545454545453,1,25.454545454545453,null,null,0,0,""]
[3,3,3,6,14,2,5,0,0,{"$f":"IF(OR($C404=\"S\",$C404=0),0,MATCH(0,OFFSET($D404,1,$C404,ROW($C$505)-ROW($C404)),0))","v":6},{"$f":"IF(OR($C404=\"S\",$C404=0),0,MATCH(OFFSET($D404,0,$C404)+1,OFFSET($D404,1,$C404,ROW($C$505)-ROW($C404)),0))","v":{"$error":"#N/A"}},"","Nível 3","Nível 3","-","SINAPI",null,"PILARES DO ELEVADOR","-",null,1,"-",null,null,0,0,""]
[{"$f":"CHOOSE(1+LOG(1+2*(ORÇAMENTO.Nivel=\"Nível 1\")+4*(ORÇAMENTO.Nivel=\"Nível 2\")+8*(ORÇAMENTO.Nivel=\"Nível 3\")+16*(ORÇAMENTO.Nivel=\"Nível 4\")+32*(ORÇAMENTO.Nivel=\"Serviço\"),2),0,1,2,3,4,\"S\")","v":"S"},3,"S",0,14,2,5,0,0,{"$f":"IF(OR($C405=\"S\",$C405=0),0,MATCH(0,OFFSET($D405,1,$C405,ROW($C$505)-ROW($C405)),0))","v":0},{"$f":"IF(OR($C405=\"S\",$C405=0),0,MATCH(OFFSET($D405,0,$C405)+1,OFFSET($D405,1,$C405,ROW($C$505)-ROW($C405)),0))","v":0},"","Serviço","Serviço","-","SINAPI",92426,"MONTAGEM E DESMONTAGEM DE FÔRMA DE PILARES RETANGULARES E ESTRUTURAS SIMILARES COM ÁREA MÉDIA DAS SEÇÕES MENOR OU IGUAL A 0,25 M², PÉ-DIREITO SIMPLES, EM CHAPA DE MADEIRA COMPENSADA RESINADA, 8 UTILIZAÇÕES. AF_12/2015","M2",19.97,1,19.97,null,null,0,0,""]
["S",3,"S",0,14,2,5,0,0,{"$f":"IF(OR($C406=\"S\",$C406=0),0,MATCH(0,OFFSET($D406,1,$C406,ROW($C$505)-ROW($C406)),0))","v":0},{"$f":"IF(OR($C406=\"S\",$C406=0),0,MATCH(OFFSET($D406,0,$C406)+1,OFFSET($D406,1,$C406,ROW($C$505)-ROW($C406)),0))","v":0},"","Serviço","Serviço","-","SINAPI",94964,"CONCRETO FCK = 20MPA, TRAÇO 1:2,7:3 (CIMENTO/ AREIA MÉDIA/ BRITA 1)  - PREPARO MECÂNICO COM BETONEIRA 400 L. AF_07/2016","M3",0.91,1,0.91,null,null,0,0,""]
["S",3,"S",0,14,2,5,0,0,{"$f":"IF(OR($C407=\"S\",$C407=0),0,MATCH(0,OFFSET($D407,1,$C407,ROW($C$505)-ROW($C407)),0))","v":0},{"$f":"IF(OR($C407=\"S\",$C407=0),0,MATCH(OFFSET($D407,0,$C407)+1,OFFSET($D407,1,$C407,ROW($C$505)-ROW($C407)),0))","v":0},"","Serviço","Serviço","-","AGETOP",60801,"LANÇAMENTO/APLICAÇÃO/ADENSAMENTO MANUAL DE CONCRETO - (OBRAS CIVIS)","m3    ",0.91,1,0.91,null,null,0,0,""]
["S",3,"S",0,14,2,5,0,0,{"$f":"IF(OR($C408=\"S\",$C408=0),0,MATCH(0,OFFSET($D408,1,$C408,ROW($C$505)-ROW($C408)),0))","v":0},{"$f":"IF(OR($C408=\"S\",$C408=0),0,MATCH(OFFSET($D408,0,$C408)+1,OFFSET($D408,1,$C408,ROW($C$505)-ROW($C408)),0))","v":0},"","Serviço","Serviço","-","AGETOP",60305,"ACO CA-50A - 10,0 MM (3/8\") - (OBRAS CIVIS)","Kg    ",69.090909090909079,1,69.090909090909079,null,null,0,0,""]
["S",3,"S",0,14,2,5,0,0,{"$f":"IF(OR($C409=\"S\",$C409=0),0,MATCH(0,OFFSET($D409,1,$C409,ROW($C$505)-ROW($C409)),0))","v":0},{"$f":"IF(OR($C409=\"S\",$C409=0),0,MATCH(OFFSET($D409,0,$C409)+1,OFFSET($D409,1,$C409,ROW($C$505)-ROW($C409)),0))","v":0},"","Serviço","Serviço","-","AGETOP",60314,"ACO CA - 60 - 5,0 MM - (OBRAS CIVIS)","Kg    ",26.36363636363636,1,26.36363636363636,null,null,0,0,""]
[2,2,2,6,14,3,0,0,0,{"$f":"IF(OR($C410=\"S\",$C410=0),0,MATCH(0,OFFSET($D410,1,$C410,ROW($C$505)-ROW($C410)),0))","v":34},{"$f":"IF(OR($C410=\"S\",$C410=0),0,MATCH(OFFSET($D410,0,$C410)+1,OFFSET($D410,1,$C410,ROW($C$505)-ROW($C410)),0))","v":6},"","Nível 2","Nível 2","-","SINAPI",null,"FUNDAÇÕES E SONDAGENS","-",null,1,"-",null,null,0,0,""]
[3,3,3,5,14,3,1,0,0,{"$f":"IF(OR($C411=\"S\",$C411=0),0,MATCH(0,OFFSET($D411,1,$C411,ROW($C$505)-ROW($C411)),0))","v":5},{"$f":"IF(OR($C411=\"S\",$C411=0),0,MATCH(OFFSET($D411,0,$C411)+1,OFFSET($D411,1,$C411,ROW($C$505)-ROW($C411)),0))","v":16},"","Nível 3","Nível 3","-","SINAPI",null,"ESTACAS E ARRANQUES (RAMPA E ESCADA)","-",null,1,"-",null,null,0,0,""]
["S",3,"S",0,14,3,1,0,0,{"$f":"IF(OR($C412=\"S\",$C412=0),0,MATCH(0,OFFSET($D412,1,$C412,ROW($C$505)-ROW($C412)),0))","v":0},{"$f":"IF(OR($C412=\"S\",$C412=0),0,MATCH(OFFSET($D412,0,$C412)+1,OFFSET($D412,1,$C412,ROW($C$505)-ROW($C412)),0))","v":0},"","Serviço","Serviço","-","AGETOP",50302,"ESTACA A TRADO DIAM.30 CM SEM FERRO","M     ",41,1,41,null,null,0,0,""]
["S",3,"S",0,14,3,1,0,0,{"$f":"IF(OR($C413=\"S\",$C413=0),0,MATCH(0,OFFSET($D413,1,$C413,ROW($C$505)-ROW($C413)),0))","v":0},{"$f":"IF(OR($C413=\"S\",$C413=0),0,MATCH(OFFSET($D413,0,$C413)+1,OFFSET($D413,1,$C413,ROW($C$505)-ROW($C413)),0))","v":0},"","Serviço","Serviço","-","AGETOP",52014,"ACO CA-60 - 5,0 MM - (OBRAS CIVIS)","Kg    ",14.545454545454545,1,14.545454545454545,null,null,0,0,""]
["S",3,"S",0,14,3,1,0,0,{"$f":"IF(OR($C414=\"S\",$C414=0),0,MATCH(0,OFFSET($D414,1,$C414,ROW($C$505)-ROW($C414)),0))","v":0},{"$f":"IF(OR($C414=\"S\",$C414=0),0,MATCH(OFFSET($D414,0,$C414)+1,OFFSET($D414,1,$C414,ROW($C$505)-ROW($C414)),0))","v":0},"","Serviço","Serviço","-","AGETOP",52004,"ACO CA 50-A - 8,0 MM (5/16\") - (OBRAS CIVIS)","Kg    ",20,1,20,null,null,0,0,""]
["S",3,"S",0,14,3,1,0,0,{"$f":"IF(OR($C415=\"S\",$C415=0),0,MATCH(0,OFFSET($D415,1,$C415,ROW($C$505)-ROW($C415)),0))","v":0},{"$f":"IF(OR($C415=\"S\",$C415=0),0,MATCH(OFFSET($D415,0,$C415)+1,OFFSET($D415,1,$C415,ROW($C$505)-ROW($C415)),0))","v":0},"","Serviço","Serviço","-","AGETOP",52005,"ACO CA-50A - 10,0 MM (3/8\") - (OBRAS CIVIS)","Kg    ",72.72727272727272,1,72.72727272727272,null,null,0,0,""]
[2,2,2,28,14,4,0,0,0,{"$f":"IF(OR($C416=\"S\",$C416=0),0,MATCH(0,OFFSET($D416,1,$C416,ROW($C$505)-ROW($C416)),0))","v":28},{"$f":"IF(OR($C416=\"S\",$C416=0),0,MATCH(OFFSET($D416,0,$C416)+1,OFFSET($D416,1,$C416,ROW($C$505)-ROW($C416)),0))","v":{"$error":"#N/A"}},"","Nível 2","Nível 2","-","AGETOP",null,"ESTRUTURA","-",null,1,"-",null,null,0,0,""]
[3,3,3,10,14,4,1,0,0,{"$f":"IF(OR($C417=\"S\",$C417=0),0,MATCH(0,OFFSET($D417,1,$C417,ROW($C$505)-ROW($C417)),0))","v":27},{"$f":"IF(OR($C417=\"S\",$C417=0),0,MATCH(OFFSET($D417,0,$C417)+1,OFFSET($D417,1,$C417,ROW($C$505)-ROW($C417)),0))","v":10},"","Nível 3","Nível 3","-","SINAPI",null,"VIGAS DA RAMPA E ESCADA","-",null,1,"-",null,null,0,0,""]
["S",3,"S",0,14,4,1,0,0,{"$f":"IF(OR($C418=\"S\",$C418=0),0,MATCH(0,OFFSET($D418,1,$C418,ROW($C$505)-ROW($C418)),0))","v":0},{"$f":"IF(OR($C418=\"S\",$C418=0),0,MATCH(OFFSET($D418,0,$C418)+1,OFFSET($D418,1,$C418,ROW($C$505)-ROW($C418)),0))","v":0},"","Serviço","Serviço","-","AGETOP",40101,"ESCAVACAO MANUAL DE VALAS < 1 MTS. (OBRAS CIVIS)","m3    ",4.1875,1,4.1875,null,null,0,0,""]
["S",3,"S",0,14,4,1,0,0,{"$f":"IF(OR($C419=\"S\",$C419=0),0,MATCH(0,OFFSET($D419,1,$C419,ROW($C$505)-ROW($C419)),0))","v":0},{"$f":"IF(OR($C419=\"S\",$C419=0),0,MATCH(OFFSET($D419,0,$C419)+1,OFFSET($D419,1,$C419,ROW($C$505)-ROW($C419)),0))","v":0},"","Serviço","Serviço","-","AGETOP",60191,"FORMA DE TABUA CINTA BALDRAME U=8 VEZES","m2    ",47.86,1,47.86,null,null,0,0,""]
["S",3,"S",0,14,4,1,0,0,{"$f":"IF(OR($C420=\"S\",$C420=0),0,MATCH(0,OFFSET($D420,1,$C420,ROW($C$505)-ROW($C420)),0))","v":0},{"$f":"IF(OR($C420=\"S\",$C420=0),0,MATCH(OFFSET($D420,0,$C420)+1,OFFSET($D420,1,$C420,ROW($C$505)-ROW($C420)),0))","v":0},"","Serviço","Serviço","-","AGETOP",41002,"APILOAMENTO","m2    ",31.91,1,31.91,null,null,0,0,""]
["S",3,"S",0,14,4,1,0,0,{"$f":"IF(OR($C421=\"S\",$C421=0),0,MATCH(0,OFFSET($D421,1,$C421,ROW($C$505)-ROW($C421)),0))","v":0},{"$f":"IF(OR($C421=\"S\",$C421=0),0,MATCH(OFFSET($D421,0,$C421)+1,OFFSET($D421,1,$C421,ROW($C$505)-ROW($C421)),0))","v":0},"","Serviço","Serviço","-","SINAPI",94963,"CONCRETO FCK = 15MPA, TRAÇO 1:3,4:3,5 (CIMENTO/ AREIA MÉDIA/ BRITA 1)  - PREPARO MECÂNICO COM BETONEIRA 400 L. AF_07/2016","M3",3.35,1,3.35,null,null,0,0,""]
["S",3,"S",0,14,4,1,0,0,{"$f":"IF(OR($C422=\"S\",$C422=0),0,MATCH(0,OFFSET($D422,1,$C422,ROW($C$505)-ROW($C422)),0))","v":0},{"$f":"IF(OR($C422=\"S\",$C422=0),0,MATCH(OFFSET($D422,0,$C422)+1,OFFSET($D422,1,$C422,ROW($C$505)-ROW($C422)),0))","v":0},"","Serviço","Serviço","-","AGETOP",51055,"LANÇAMENTO/APLICAÇÃO/ADENSAMENTO MANUAL DE CONCRETO - (O.C.)","m3    ",3.35,1,3.35,null,null,0,0,""]
["S",3,"S",0,14,4,1,0,0,{"$f":"IF(OR($C423=\"S\",$C423=0),0,MATCH(0,OFFSET($D423,1,$C423,ROW($C$505)-ROW($C423)),0))","v":0},{"$f":"IF(OR($C423=\"S\",$C423=0),0,MATCH(OFFSET($D423,0,$C423)+1,OFFSET($D423,1,$C423,ROW($C$505)-ROW($C423)),0))","v":0},"","Serviço","Serviço","-","SINAPI",96995,"REATERRO MANUAL APILOADO COM SOQUETE. AF_10/2017","M3",0.83749999999999991,1,0.83749999999999991,null,null,0,0,"Referência: AGETOP - 40902"]
["S",3,"S",0,14,4,1,0,0,{"$f":"IF(OR($C424=\"S\",$C424=0),0,MATCH(0,OFFSET($D424,1,$C424,ROW($C$505)-ROW($C424)),0))","v":0},{"$f":"IF(OR($C424=\"S\",$C424=0),0,MATCH(OFFSET($D424,0,$C424)+1,OFFSET($D424,1,$C424,ROW($C$505)-ROW($C424)),0))","v":0},"","Serviço","Serviço","-","AGETOP",52004,"ACO CA 50-A - 8,0 MM (5/16\") - (OBRAS CIVIS)","Kg    ",149.09090909090907,1,149.09090909090907,null,null,0,0,""]
["S",3,"S",0,14,4,1,0,0,{"$f":"IF(OR($C425=\"S\",$C425=0),0,MATCH(0,OFFSET($D425,1,$C425,ROW($C$505)-ROW($C425)),0))","v":0},{"$f":"IF(OR($C425=\"S\",$C425=0),0,MATCH(OFFSET($D425,0,$C425)+1,OFFSET($D425,1,$C425,ROW($C$505)-ROW($C425)),0))","v":0},"","Serviço","Serviço","-","AGETOP",52014,"ACO CA-60 - 5,0 MM - (OBRAS CIVIS)","Kg    ",72.72727272727272,1,72.72727272727272,null,null,0,0,""]
["S",3,"S",0,14,4,1,0,0,{"$f":"IF(OR($C426=\"S\",$C426=0),0,MATCH(0,OFFSET($D426,1,$C426,ROW($C$505)-ROW($C426)),0))","v":0},{"$f":"IF(OR($C426=\"S\",$C426=0),0,MATCH(OFFSET($D426,0,$C426)+1,OFFSET($D426,1,$C426,ROW($C$505)-ROW($C426)),0))","v":0},"","Serviço","Serviço","-","AGETOP",120902,"IMPERMEABILIZACAO VIGAS BALDRAMES E=2,0 CM","m2    ",59.03,1,59.03,null,null,0,0,""]
[3,3,3,6,14,4,2,0,0,{"$f":"IF(OR($C427=\"S\",$C427=0),0,MATCH(0,OFFSET($D427,1,$C427,ROW($C$505)-ROW($C427)),0))","v":17},{"$f":"IF(OR($C427=\"S\",$C427=0),0,MATCH(OFFSET($D427,0,$C427)+1,OFFSET($D427,1,$C427,ROW($C$505)-ROW($C427)),0))","v":6},"","Nível 3","Nível 3","-","AGETOP",null,"PILARES DA RAMPA E ESCADA","-",null,1,"-",null,null,0,0,""]
["S",3,"S",0,14,4,2,0,0,{"$f":"IF(OR($C428=\"S\",$C428=0),0,MATCH(0,OFFSET($D428,1,$C428,ROW($C$505)-ROW($C428)),0))","v":0},{"$f":"IF(OR($C428=\"S\",$C428=0),0,MATCH(OFFSET($D428,0,$C428)+1,OFFSET($D428,1,$C428,ROW($C$505)-ROW($C428)),0))","v":0},"","Serviço","Serviço","-","SINAPI",92426,"MONTAGEM E DESMONTAGEM DE FÔRMA DE PILARES RETANGULARES E ESTRUTURAS SIMILARES COM ÁREA MÉDIA DAS SEÇÕES MENOR OU IGUAL A 0,25 M², PÉ-DIREITO SIMPLES, EM CHAPA DE MADEIRA COMPENSADA RESINADA, 8 UTILIZAÇÕES. AF_12/2015","M2",17.600000000000001,1,17.600000000000001,null,null,0,0,""]
["S",3,"S",0,14,4,2,0,0,{"$f":"IF(OR($C429=\"S\",$C429=0),0,MATCH(0,OFFSET($D429,1,$C429,ROW($C$505)-ROW($C429)),0))","v":0},{"$f":"IF(OR($C429=\"S\",$C429=0),0,MATCH(OFFSET($D429,0,$C429)+1,OFFSET($D429,1,$C429,ROW($C$505)-ROW($C429)),0))","v":0},"","Serviço","Serviço","-","SINAPI",94964,"CONCRETO FCK = 20MPA, TRAÇO 1:2,7:3 (CIMENTO/ AREIA MÉDIA/ BRITA 1)  - PREPARO MECÂNICO COM BETONEIRA 400 L. AF_07/2016","M3",0.81,1,0.81,null,null,0,0,""]
["S",3,"S",0,14,4,2,0,0,{"$f":"IF(OR($C430=\"S\",$C430=0),0,MATCH(0,OFFSET($D430,1,$C430,ROW($C$505)-ROW($C430)),0))","v":0},{"$f":"IF(OR($C430=\"S\",$C430=0),0,MATCH(OFFSET($D430,0,$C430)+1,OFFSET($D430,1,$C430,ROW($C$505)-ROW($C430)),0))","v":0},"","Serviço","Serviço","-","AGETOP",60801,"LANÇAMENTO/APLICAÇÃO/ADENSAMENTO MANUAL DE CONCRETO - (OBRAS CIVIS)","m3    ",0.81,1,0.81,null,null,0,0,""]
["S",3,"S",0,14,4,2,0,0,{"$f":"IF(OR($C431=\"S\",$C431=0),0,MATCH(0,OFFSET($D431,1,$C431,ROW($C$505)-ROW($C431)),0))","v":0},{"$f":"IF(OR($C431=\"S\",$C431=0),0,MATCH(OFFSET($D431,0,$C431)+1,OFFSET($D431,1,$C431,ROW($C$505)-ROW($C431)),0))","v":0},"","Serviço","Serviço","-","AGETOP",60305,"ACO CA-50A - 10,0 MM (3/8\") - (OBRAS CIVIS)","Kg    ",55.454545454545453,1,55.454545454545453,null,null,0,0,""]
["S",3,"S",0,14,4,2,0,0,{"$f":"IF(OR($C432=\"S\",$C432=0),0,MATCH(0,OFFSET($D432,1,$C432,ROW($C$505)-ROW($C432)),0))","v":0},{"$f":"IF(OR($C432=\"S\",$C432=0),0,MATCH(OFFSET($D432,0,$C432)+1,OFFSET($D432,1,$C432,ROW($C$505)-ROW($C432)),0))","v":0},"","Serviço","Serviço","-","AGETOP",60314,"ACO CA - 60 - 5,0 MM - (OBRAS CIVIS)","Kg    ",23.636363636363633,1,23.636363636363633,null,null,0,0,""]
[3,3,3,5,14,4,3,0,0,{"$f":"IF(OR($C433=\"S\",$C433=0),0,MATCH(0,OFFSET($D433,1,$C433,ROW($C$505)-ROW($C433)),0))","v":11},{"$f":"IF(OR($C433=\"S\",$C433=0),0,MATCH(OFFSET($D433,0,$C433)+1,OFFSET($D433,1,$C433,ROW($C$505)-ROW($C433)),0))","v":5},"","Nível 3","Nível 3","-",null,null,"RAMPAS","-",null,1,"-",null,null,0,0,""]
["S",3,"S",0,14,4,3,0,0,{"$f":"IF(OR($C434=\"S\",$C434=0),0,MATCH(0,OFFSET($D434,1,$C434,ROW($C$505)-ROW($C434)),0))","v":0},{"$f":"IF(OR($C434=\"S\",$C434=0),0,MATCH(OFFSET($D434,0,$C434)+1,OFFSET($D434,1,$C434,ROW($C$505)-ROW($C434)),0))","v":0},"","Serviço","Serviço","-","AGETOP",41002,"APILOAMENTO","m2    ",54.03,1,54.03,null,null,0,0,""]
["S",3,"S",0,14,4,3,0,0,{"$f":"IF(OR($C435=\"S\",$C435=0),0,MATCH(0,OFFSET($D435,1,$C435,ROW($C$505)-ROW($C435)),0))","v":0},{"$f":"IF(OR($C435=\"S\",$C435=0),0,MATCH(OFFSET($D435,0,$C435)+1,OFFSET($D435,1,$C435,ROW($C$505)-ROW($C435)),0))","v":0},"","Serviço","Serviço","-","SINAPI",94964,"CONCRETO FCK = 20MPA, TRAÇO 1:2,7:3 (CIMENTO/ AREIA MÉDIA/ BRITA 1)  - PREPARO MECÂNICO COM BETONEIRA 400 L. AF_07/2016","M3",5.18,1,5.18,null,null,0,0,""]
["S",3,"S",0,14,4,3,0,0,{"$f":"IF(OR($C436=\"S\",$C436=0),0,MATCH(0,OFFSET($D436,1,$C436,ROW($C$505)-ROW($C436)),0))","v":0},{"$f":"IF(OR($C436=\"S\",$C436=0),0,MATCH(OFFSET($D436,0,$C436)+1,OFFSET($D436,1,$C436,ROW($C$505)-ROW($C436)),0))","v":0},"","Serviço","Serviço","-","AGETOP",60801,"LANÇAMENTO/APLICAÇÃO/ADENSAMENTO MANUAL DE CONCRETO - (OBRAS CIVIS)","m3    ",5.18,1,5.18,null,null,0,0,""]
["S",3,"S",0,14,4,3,0,0,{"$f":"IF(OR($C437=\"S\",$C437=0),0,MATCH(0,OFFSET($D437,1,$C437,ROW($C$505)-ROW($C437)),0))","v":0},{"$f":"IF(OR($C437=\"S\",$C437=0),0,MATCH(OFFSET($D437,0,$C437)+1,OFFSET($D437,1,$C437,ROW($C$505)-ROW($C437)),0))","v":0},"","Serviço","Serviço","-","AGETOP",60303,"ACO CA-50-A - 6,3 MM (1/4\") - (OBRAS CIVIS)","Kg    ",145.45454545454544,1,145.45454545454544,null,null,0,0,""]
[3,3,3,6,14,4,4,0,0,{"$f":"IF(OR($C438=\"S\",$C438=0),0,MATCH(0,OFFSET($D438,1,$C438,ROW($C$505)-ROW($C438)),0))","v":6},{"$f":"IF(OR($C438=\"S\",$C438=0),0,MATCH(OFFSET($D438,0,$C438)+1,OFFSET($D438,1,$C438,ROW($C$505)-ROW($C438)),0))","v":{"$error":"#N/A"}},"","Nível 3","Nível 3","-",null,null,"ESCADA","-",null,1,"-",null,null,0,0,""]
["S",3,"S",0,14,4,4,0,0,{"$f":"IF(OR($C439=\"S\",$C439=0),0,MATCH(0,OFFSET($D439,1,$C439,ROW($C$505)-ROW($C439)),0))","v":0},{"$f":"IF(OR($C439=\"S\",$C439=0),0,MATCH(OFFSET($D439,0,$C439)+1,OFFSET($D439,1,$C439,ROW($C$505)-ROW($C439)),0))","v":0},"","Serviço","Serviço","-","SINAPI",95935,"FABRICAÇÃO DE FÔRMA PARA ESCADAS, COM 2 LANCES, EM CHAPA DE MADEIRA COMPENSADA RESINADA, E= 17 MM. AF_01/2017","M2",3.42,1,3.42,null,null,0,0,""]
["S",3,"S",0,14,4,4,0,0,{"$f":"IF(OR($C440=\"S\",$C440=0),0,MATCH(0,OFFSET($D440,1,$C440,ROW($C$505)-ROW($C440)),0))","v":0},{"$f":"IF(OR($C440=\"S\",$C440=0),0,MATCH(OFFSET($D440,0,$C440)+1,OFFSET($D440,1,$C440,ROW($C$505)-ROW($C440)),0))","v":0},"","Serviço","Serviço","-","SINAPI",94964,"CONCRETO FCK = 20MPA, TRAÇO 1:2,7:3 (CIMENTO/ AREIA MÉDIA/ BRITA 1)  - PREPARO MECÂNICO COM BETONEIRA 400 L. AF_07/2016","M3",1.73,1,1.73,null,null,0,0,""]
["S",3,"S",0,14,4,4,0,0,{"$f":"IF(OR($C441=\"S\",$C441=0),0,MATCH(0,OFFSET($D441,1,$C441,ROW($C$505)-ROW($C441)),0))","v":0},{"$f":"IF(OR($C441=\"S\",$C441=0),0,MATCH(OFFSET($D441,0,$C441)+1,OFFSET($D441,1,$C441,ROW($C$505)-ROW($C441)),0))","v":0},"","Serviço","Serviço","-","AGETOP",60801,"LANÇAMENTO/APLICAÇÃO/ADENSAMENTO MANUAL DE CONCRETO - (OBRAS CIVIS)","m3    ",1.73,1,1.73,null,null,0,0,""]
["S",3,"S",0,14,4,4,0,0,{"$f":"IF(OR($C442=\"S\",$C442=0),0,MATCH(0,OFFSET($D442,1,$C442,ROW($C$505)-ROW($C442)),0))","v":0},{"$f":"IF(OR($C442=\"S\",$C442=0),0,MATCH(OFFSET($D442,0,$C442)+1,OFFSET($D442,1,$C442,ROW($C$505)-ROW($C442)),0))","v":0},"","Serviço","Serviço","-","AGETOP",60303,"ACO CA-50-A - 6,3 MM (1/4\") - (OBRAS CIVIS)","Kg    ",31.818181818181817,1,31.818181818181817,null,null,0,0,""]
["S",3,"S",0,14,4,4,0,0,{"$f":"IF(OR($C443=\"S\",$C443=0),0,MATCH(0,OFFSET($D443,1,$C443,ROW($C$505)-ROW($C443)),0))","v":0},{"$f":"IF(OR($C443=\"S\",$C443=0),0,MATCH(OFFSET($D443,0,$C443)+1,OFFSET($D443,1,$C443,ROW($C$505)-ROW($C443)),0))","v":0},"","Serviço","Serviço","-","AGETOP",60305,"ACO CA-50A - 10,0 MM (3/8\") - (OBRAS CIVIS)","Kg    ",89.999999999999986,1,89.999999999999986,null,null,0,0,""]
[1,1,1,52,15,0,0,0,0,{"$f":"IF(OR($C444=\"S\",$C444=0),0,MATCH(0,OFFSET($D444,1,$C444,ROW($C$505)-ROW($C444)),0))","v":61},{"$f":"IF(OR($C444=\"S\",$C444=0),0,MATCH(OFFSET($D444,0,$C444)+1,OFFSET($D444,1,$C444,ROW($C$505)-ROW($C444)),0))","v":52},"F","Nível 1","Nível 1","15.","SINAPI",null,"PROJETO DE INSTALAÇÕES HIDROSSANITÁRIAS","UN",1,1,1,null,null,0,0,""]
[2,2,2,51,15,1,0,0,0,{"$f":"IF(OR($C445=\"S\",$C445=0),0,MATCH(0,OFFSET($D445,1,$C445,ROW($C$505)-ROW($C445)),0))","v":51},{"$f":"IF(OR($C445=\"S\",$C445=0),0,MATCH(OFFSET($D445,0,$C445)+1,OFFSET($D445,1,$C445,ROW($C$505)-ROW($C445)),0))","v":55},"","Nível 2","Nível 2","-","SINAPI",null,"INSTALAÇÕES HIDROSSANITÁRIAS","-",null,1,"-",null,null,0,0,""]
[3,3,3,13,15,1,1,0,0,{"$f":"IF(OR($C446=\"S\",$C446=0),0,MATCH(0,OFFSET($D446,1,$C446,ROW($C$505)-ROW($C446)),0))","v":50},{"$f":"IF(OR($C446=\"S\",$C446=0),0,MATCH(OFFSET($D446,0,$C446)+1,OFFSET($D446,1,$C446,ROW($C$505)-ROW($C446)),0))","v":13},"","Nível 3","Nível 3","-","SINAPI",null,"PEÇAS E ACESSÓRIOS","-",null,1,"-",null,null,0,0,""]
[4,4,4,3,15,1,1,1,0,{"$f":"IF(OR($C447=\"S\",$C447=0),0,MATCH(0,OFFSET($D447,1,$C447,ROW($C$505)-ROW($C447)),0))","v":12},{"$f":"IF(OR($C447=\"S\",$C447=0),0,MATCH(OFFSET($D447,0,$C447)+1,OFFSET($D447,1,$C447,ROW($C$505)-ROW($C447)),0))","v":3},"","Nível 4","Nível 4","-","SINAPI",null,"CAIXAS E CURVAS","-",null,1,"-",null,null,0,0,""]
["S",4,"S",0,15,1,1,1,0,{"$f":"IF(OR($C448=\"S\",$C448=0),0,MATCH(0,OFFSET($D448,1,$C448,ROW($C$505)-ROW($C448)),0))","v":0},{"$f":"IF(OR($C448=\"S\",$C448=0),0,MATCH(OFFSET($D448,0,$C448)+1,OFFSET($D448,1,$C448,ROW($C$505)-ROW($C448)),0))","v":0},"","Serviço","Serviço","-","SINAPI",6171,"TAMPA DE CONCRETO ARMADO 60X60X5CM PARA CAIXA","UN",1,1,1,null,null,0,0,""]
["S",4,"S",0,15,1,1,1,0,{"$f":"IF(OR($C449=\"S\",$C449=0),0,MATCH(0,OFFSET($D449,1,$C449,ROW($C$505)-ROW($C449)),0))","v":0},{"$f":"IF(OR($C449=\"S\",$C449=0),0,MATCH(OFFSET($D449,0,$C449)+1,OFFSET($D449,1,$C449,ROW($C$505)-ROW($C449)),0))","v":0},"","Serviço","Serviço","-","AGETOP",70715,"CAIXA DE PASSAGEM 60X60X80CM FUNDO DE BRITA SEM TAMPA","Un    ",1,1,1,null,null,0,0,""]
[4,4,4,2,15,1,1,2,0,{"$f":"IF(OR($C450=\"S\",$C450=0),0,MATCH(0,OFFSET($D450,1,$C450,ROW($C$505)-ROW($C450)),0))","v":9},{"$f":"IF(OR($C450=\"S\",$C450=0),0,MATCH(OFFSET($D450,0,$C450)+1,OFFSET($D450,1,$C450,ROW($C$505)-ROW($C450)),0))","v":2},"","Nível 4","Nível 4","-","SINAPI",null,"VASO SANITÁRIO E ACESSÓRIOS","-",null,1,"-",null,null,0,0,""]
["S",4,"S",0,15,1,1,2,0,{"$f":"IF(OR($C451=\"S\",$C451=0),0,MATCH(0,OFFSET($D451,1,$C451,ROW($C$505)-ROW($C451)),0))","v":0},{"$f":"IF(OR($C451=\"S\",$C451=0),0,MATCH(OFFSET($D451,0,$C451)+1,OFFSET($D451,1,$C451,ROW($C$505)-ROW($C451)),0))","v":0},"","Serviço","Serviço","-","AGETOP",80515,"VÁLVULA DE DESCARGA DUPLO ACIONAMENTO COM ACABAMENTO CROMADO ","Un    ",2,1,2,null,null,0,0,""]
[4,4,4,7,15,1,1,3,0,{"$f":"IF(OR($C452=\"S\",$C452=0),0,MATCH(0,OFFSET($D452,1,$C452,ROW($C$505)-ROW($C452)),0))","v":7},{"$f":"IF(OR($C452=\"S\",$C452=0),0,MATCH(OFFSET($D452,0,$C452)+1,OFFSET($D452,1,$C452,ROW($C$505)-ROW($C452)),0))","v":17},"","Nível 4","Nível 4","-","SINAPI",null,"LAVATÓRIO E ACESSÓRIOS","-",null,1,"-",null,null,0,0,""]
["S",4,"S",0,15,1,1,3,0,{"$f":"IF(OR($C453=\"S\",$C453=0),0,MATCH(0,OFFSET($D453,1,$C453,ROW($C$505)-ROW($C453)),0))","v":0},{"$f":"IF(OR($C453=\"S\",$C453=0),0,MATCH(OFFSET($D453,0,$C453)+1,OFFSET($D453,1,$C453,ROW($C$505)-ROW($C453)),0))","v":0},"","Serviço","Serviço","-","AGETOP",80543,"LAVATÓRIO DE CANTO SEM COLUNA ","un    ",4,1,4,null,null,0,0,""]
["S",4,"S",0,15,1,1,3,0,{"$f":"IF(OR($C454=\"S\",$C454=0),0,MATCH(0,OFFSET($D454,1,$C454,ROW($C$505)-ROW($C454)),0))","v":0},{"$f":"IF(OR($C454=\"S\",$C454=0),0,MATCH(OFFSET($D454,0,$C454)+1,OFFSET($D454,1,$C454,ROW($C$505)-ROW($C454)),0))","v":0},"","Serviço","Serviço","-","AGETOP",80550,"FIXACAO P/LAVATORIO (PAR)","PAR   ",4,1,4,null,null,0,0,""]
["S",4,"S",0,15,1,1,3,0,{"$f":"IF(OR($C455=\"S\",$C455=0),0,MATCH(0,OFFSET($D455,1,$C455,ROW($C$505)-ROW($C455)),0))","v":0},{"$f":"IF(OR($C455=\"S\",$C455=0),0,MATCH(OFFSET($D455,0,$C455)+1,OFFSET($D455,1,$C455,ROW($C$505)-ROW($C455)),0))","v":0},"","Serviço","Serviço","-","AGETOP",80556,"LIGAÇÃO FLEXÍVEL PVC DIAM.1/2\" (ENGATE)","Un    ",16,1,16,null,null,0,0,""]
["S",4,"S",0,15,1,1,3,0,{"$f":"IF(OR($C456=\"S\",$C456=0),0,MATCH(0,OFFSET($D456,1,$C456,ROW($C$505)-ROW($C456)),0))","v":0},{"$f":"IF(OR($C456=\"S\",$C456=0),0,MATCH(OFFSET($D456,0,$C456)+1,OFFSET($D456,1,$C456,ROW($C$505)-ROW($C456)),0))","v":0},"","Serviço","Serviço","-","SINAPI",86883,"SIFÃO DO TIPO FLEXÍVEL EM PVC 1  X 1.1/2  - FORNECIMENTO E INSTALAÇÃO. AF_01/2020","UN",16,1,16,null,null,0,0,""]
["S",4,"S",0,15,1,1,3,0,{"$f":"IF(OR($C457=\"S\",$C457=0),0,MATCH(0,OFFSET($D457,1,$C457,ROW($C$505)-ROW($C457)),0))","v":0},{"$f":"IF(OR($C457=\"S\",$C457=0),0,MATCH(OFFSET($D457,0,$C457)+1,OFFSET($D457,1,$C457,ROW($C$505)-ROW($C457)),0))","v":0},"","Serviço","Serviço","-","AGETOP",80570,"TORNEIRA DE MESA PARA LAVATÓRIO DIÂMETRO DE 1/2\"","Un    ",16,1,16,null,null,0,0,""]
["S",4,"S",0,15,1,1,3,0,{"$f":"IF(OR($C458=\"S\",$C458=0),0,MATCH(0,OFFSET($D458,1,$C458,ROW($C$505)-ROW($C458)),0))","v":0},{"$f":"IF(OR($C458=\"S\",$C458=0),0,MATCH(OFFSET($D458,0,$C458)+1,OFFSET($D458,1,$C458,ROW($C$505)-ROW($C458)),0))","v":0},"","Serviço","Serviço","-","AGETOP",80580,"VALVULA P/LAVATORIO OU BEBEDOURO METALICO DIAMETRO 1\"","Un    ",16,1,16,null,null,0,0,""]
[3,3,3,16,15,1,2,0,0,{"$f":"IF(OR($C459=\"S\",$C459=0),0,MATCH(0,OFFSET($D459,1,$C459,ROW($C$505)-ROW($C459)),0))","v":37},{"$f":"IF(OR($C459=\"S\",$C459=0),0,MATCH(OFFSET($D459,0,$C459)+1,OFFSET($D459,1,$C459,ROW($C$505)-ROW($C459)),0))","v":16},"","Nível 3","Nível 3","-","SINAPI",null,"ÁGUA FRIA","-",null,1,"-",null,null,0,0,""]
[4,4,4,3,15,1,2,1,{"$f":"IF(AND($C460<=4,$C460<>0),0,IF(AND($C460=\"S\",$Y460>0),OFFSET(I460,-1,0)+1,OFFSET(I460,-1,0)))","v":0},{"$f":"IF(OR($C460=\"S\",$C460=0),0,MATCH(0,OFFSET($D460,1,$C460,ROW($C$505)-ROW($C460)),0))","v":15},{"$f":"IF(OR($C460=\"S\",$C460=0),0,MATCH(OFFSET($D460,0,$C460)+1,OFFSET($D460,1,$C460,ROW($C$505)-ROW($C460)),0))","v":3},"","Nível 4","Nível 4","-","SINAPI",null,"TUBOS DE PVC SOLDÁVEL","-",null,1,"-",null,null,0,0,""]
["S",4,"S",0,15,1,2,1,0,{"$f":"IF(OR($C461=\"S\",$C461=0),0,MATCH(0,OFFSET($D461,1,$C461,ROW($C$505)-ROW($C461)),0))","v":0},{"$f":"IF(OR($C461=\"S\",$C461=0),0,MATCH(OFFSET($D461,0,$C461)+1,OFFSET($D461,1,$C461,ROW($C$505)-ROW($C461)),0))","v":0},"","Serviço","Serviço","-","AGETOP",81003,"TUBO SOLDAVEL PVC MARROM DIAMETRO 25 mm","M     ",6,1,6,null,null,0,0,""]
["S",4,"S",0,15,1,2,1,0,{"$f":"IF(OR($C462=\"S\",$C462=0),0,MATCH(0,OFFSET($D462,1,$C462,ROW($C$505)-ROW($C462)),0))","v":0},{"$f":"IF(OR($C462=\"S\",$C462=0),0,MATCH(OFFSET($D462,0,$C462)+1,OFFSET($D462,1,$C462,ROW($C$505)-ROW($C462)),0))","v":0},"","Serviço","Serviço","-","SINAPI",89449,"TUBO, PVC, SOLDÁVEL, DN 50MM, INSTALADO EM PRUMADA DE ÁGUA - FORNECIMENTO E INSTALAÇÃO. AF_12/2014","M",6,1,6,null,null,0,0,""]
[4,{"$f":"IF(OR(C463=\"s\",C463=0),OFFSET(B463,-1,0),C463)","v":4},{"$f":"IF(OFFSET(C463,-1,0)=\"L\",1,IF(OFFSET(C463,-1,0)=1,2,IF(OR(A463=\"s\",A463=0),\"S\",IF(AND(OFFSET(C463,-1,0)=2,A463=4),3,IF(AND(OR(OFFSET(C463,-1,0)=\"s\",OFFSET(C463,-1,0)=0),A463<>\"s\",A463>OFFSET(B463,-1,0)),OFFSET(B463,-1,0),A463)))))","v":4},{"$f":"IF(OR(C463=\"S\",C463=0),0,IF(ISERROR(K463),J463,SMALL(J463:K463,1)))","v":3},{"$f":"IF($C463=1,OFFSET(E463,-1,0)+1,OFFSET(E463,-1,0))","v":15},{"$f":"IF($C463=1,0,IF($C463=2,OFFSET(F463,-1,0)+1,OFFSET(F463,-1,0)))","v":1},{"$f":"IF(AND($C463<=2,$C463<>0),0,IF($C463=3,OFFSET(G463,-1,0)+1,OFFSET(G463,-1,0)))","v":2},{"$f":"IF(AND($C463<=3,$C463<>0),0,IF($C463=4,OFFSET(H463,-1,0)+1,OFFSET(H463,-1,0)))","v":2},0,{"$f":"IF(OR($C463=\"S\",$C463=0),0,MATCH(0,OFFSET($D463,1,$C463,ROW($C$505)-ROW($C463)),0))","v":12},{"$f":"IF(OR($C463=\"S\",$C463=0),0,MATCH(OFFSET($D463,0,$C463)+1,OFFSET($D463,1,$C463,ROW($C$505)-ROW($C463)),0))","v":3},"","Nível 4","Nível 4","-","SINAPI",null,"LUVAS DE PVC","-",null,1,"-",null,null,0,0,""]
["S",4,"S",0,15,1,2,2,0,{"$f":"IF(OR($C464=\"S\",$C464=0),0,MATCH(0,OFFSET($D464,1,$C464,ROW($C$505)-ROW($C464)),0))","v":0},{"$f":"IF(OR($C464=\"S\",$C464=0),0,MATCH(OFFSET($D464,0,$C464)+1,OFFSET($D464,1,$C464,ROW($C$505)-ROW($C464)),0))","v":0},"","Serviço","Serviço","-","SINAPI",89528,"LUVA, PVC, SOLDÁVEL, DN 25MM, INSTALADO EM PRUMADA DE ÁGUA - FORNECIMENTO E INSTALAÇÃO. AF_12/2014","UN",4,1,4,null,null,0,0,""]
["S",4,"S",0,15,1,2,2,0,{"$f":"IF(OR($C465=\"S\",$C465=0),0,MATCH(0,OFFSET($D465,1,$C465,ROW($C$505)-ROW($C465)),0))","v":0},{"$f":"IF(OR($C465=\"S\",$C465=0),0,MATCH(OFFSET($D465,0,$C465)+1,OFFSET($D465,1,$C465,ROW($C$505)-ROW($C465)),0))","v":0},"","Serviço","Serviço","-","AGETOP",81105,"LUVA SOLDAVEL DIAMETRO 50 mm","Un    ",5,1,5,null,null,0,0,""]
[4,4,4,3,15,1,2,3,0,{"$f":"IF(OR($C466=\"S\",$C466=0),0,MATCH(0,OFFSET($D466,1,$C466,ROW($C$505)-ROW($C466)),0))","v":9},{"$f":"IF(OR($C466=\"S\",$C466=0),0,MATCH(OFFSET($D466,0,$C466)+1,OFFSET($D466,1,$C466,ROW($C$505)-ROW($C466)),0))","v":3},"","Nível 4","Nível 4","-","SINAPI",null,"JOELHO","-",null,1,"-",null,null,0,0,""]
["S",4,"S",0,15,1,2,3,0,{"$f":"IF(OR($C467=\"S\",$C467=0),0,MATCH(0,OFFSET($D467,1,$C467,ROW($C$505)-ROW($C467)),0))","v":0},{"$f":"IF(OR($C467=\"S\",$C467=0),0,MATCH(OFFSET($D467,0,$C467)+1,OFFSET($D467,1,$C467,ROW($C$505)-ROW($C467)),0))","v":0},"","Serviço","Serviço","-","SINAPI",89501,"JOELHO 90 GRAUS, PVC, SOLDÁVEL, DN 50MM, INSTALADO EM PRUMADA DE ÁGUA - FORNECIMENTO E INSTALAÇÃO. AF_12/2014","UN",4,1,4,null,null,0,0,""]
["S",4,"S",0,15,1,2,3,0,{"$f":"IF(OR($C468=\"S\",$C468=0),0,MATCH(0,OFFSET($D468,1,$C468,ROW($C$505)-ROW($C468)),0))","v":0},{"$f":"IF(OR($C468=\"S\",$C468=0),0,MATCH(OFFSET($D468,0,$C468)+1,OFFSET($D468,1,$C468,ROW($C$505)-ROW($C468)),0))","v":0},"","Serviço","Serviço","-","AGETOP",81380,"JOELHO 90 GRAUS C/ROSCA E BUCHA LATAO DIAM.1/2\"","Un    ",4,1,4,null,null,0,0,""]
[{"$f":"CHOOSE(1+LOG(1+2*(ORÇAMENTO.Nivel=\"Nível 1\")+4*(ORÇAMENTO.Nivel=\"Nível 2\")+8*(ORÇAMENTO.Nivel=\"Nível 3\")+16*(ORÇAMENTO.Nivel=\"Nível 4\")+32*(ORÇAMENTO.Nivel=\"Serviço\"),2),0,1,2,3,4,\"S\")","v":4},4,4,3,15,1,2,4,0,{"$f":"IF(OR($C469=\"S\",$C469=0),0,MATCH(0,OFFSET($D469,1,$C469,ROW($C$505)-ROW($C469)),0))","v":6},{"$f":"IF(OR($C469=\"S\",$C469=0),0,MATCH(OFFSET($D469,0,$C469)+1,OFFSET($D469,1,$C469,ROW($C$505)-ROW($C469)),0))","v":3},"","Nível 4","Nível 4","-","SINAPI",null,"TÊ","-",null,1,"-",null,null,0,0,""]
["S",4,"S",0,15,1,2,4,0,{"$f":"IF(OR($C470=\"S\",$C470=0),0,MATCH(0,OFFSET($D470,1,$C470,ROW($C$505)-ROW($C470)),0))","v":0},{"$f":"IF(OR($C470=\"S\",$C470=0),0,MATCH(OFFSET($D470,0,$C470)+1,OFFSET($D470,1,$C470,ROW($C$505)-ROW($C470)),0))","v":0},"","Serviço","Serviço","-","SINAPI",89625,"TE, PVC, SOLDÁVEL, DN 50MM, INSTALADO EM PRUMADA DE ÁGUA - FORNECIMENTO E INSTALAÇÃO. AF_12/2014","UN",4,1,4,null,null,0,0,""]
["S",4,"S",0,15,1,2,4,0,{"$f":"IF(OR($C471=\"S\",$C471=0),0,MATCH(0,OFFSET($D471,1,$C471,ROW($C$505)-ROW($C471)),0))","v":0},{"$f":"IF(OR($C471=\"S\",$C471=0),0,MATCH(OFFSET($D471,0,$C471)+1,OFFSET($D471,1,$C471,ROW($C$505)-ROW($C471)),0))","v":0},"","Serviço","Serviço","-","SINAPI",89627,"TÊ DE REDUÇÃO, PVC, SOLDÁVEL, DN 50MM X 25MM, INSTALADO EM PRUMADA DE ÁGUA - FORNECIMENTO E INSTALAÇÃO. AF_12/2014","UN",4,1,4,null,null,0,0,""]
[4,4,4,3,15,1,2,5,0,{"$f":"IF(OR($C472=\"S\",$C472=0),0,MATCH(0,OFFSET($D472,1,$C472,ROW($C$505)-ROW($C472)),0))","v":3},{"$f":"IF(OR($C472=\"S\",$C472=0),0,MATCH(OFFSET($D472,0,$C472)+1,OFFSET($D472,1,$C472,ROW($C$505)-ROW($C472)),0))","v":20},"","Nível 4","Nível 4","-","SINAPI",null,"ADESIVOS","-",null,1,"-",null,null,0,0,""]
["S",4,"S",0,15,1,2,5,0,{"$f":"IF(OR($C473=\"S\",$C473=0),0,MATCH(0,OFFSET($D473,1,$C473,ROW($C$505)-ROW($C473)),0))","v":0},{"$f":"IF(OR($C473=\"S\",$C473=0),0,MATCH(OFFSET($D473,0,$C473)+1,OFFSET($D473,1,$C473,ROW($C$505)-ROW($C473)),0))","v":0},"","Serviço","Serviço","-","AGETOP",81501,"ADESIVO PLASTICO - FRASCO 850 G","Un    ",1,1,1,null,null,0,0,""]
["S",4,"S",0,15,1,2,5,0,{"$f":"IF(OR($C474=\"S\",$C474=0),0,MATCH(0,OFFSET($D474,1,$C474,ROW($C$505)-ROW($C474)),0))","v":0},{"$f":"IF(OR($C474=\"S\",$C474=0),0,MATCH(OFFSET($D474,0,$C474)+1,OFFSET($D474,1,$C474,ROW($C$505)-ROW($C474)),0))","v":0},"","Serviço","Serviço","-","AGETOP",81504,"SOLUCAO LIMPADORA 1000 CM3","Un    ",1,1,1,null,null,0,0,""]
[3,3,3,21,15,1,3,0,0,{"$f":"IF(OR($C475=\"S\",$C475=0),0,MATCH(0,OFFSET($D475,1,$C475,ROW($C$505)-ROW($C475)),0))","v":21},{"$f":"IF(OR($C475=\"S\",$C475=0),0,MATCH(OFFSET($D475,0,$C475)+1,OFFSET($D475,1,$C475,ROW($C$505)-ROW($C475)),0))","v":{"$error":"#N/A"}},"","Nível 3","Nível 3","-","SINAPI",null,"ESGOTO SANITÁRIO","-",null,1,"-",null,null,0,0,""]
[4,4,4,2,15,1,3,1,0,{"$f":"IF(OR($C476=\"S\",$C476=0),0,MATCH(0,OFFSET($D476,1,$C476,ROW($C$505)-ROW($C476)),0))","v":20},{"$f":"IF(OR($C476=\"S\",$C476=0),0,MATCH(OFFSET($D476,0,$C476)+1,OFFSET($D476,1,$C476,ROW($C$505)-ROW($C476)),0))","v":2},"","Nível 4","Nível 4","-","SINAPI",null,"CORPO DE CAIXA SIFONADA / RALO","-",null,1,"-",null,null,0,0,""]
["S",4,"S",0,15,1,3,1,0,{"$f":"IF(OR($C477=\"S\",$C477=0),0,MATCH(0,OFFSET($D477,1,$C477,ROW($C$505)-ROW($C477)),0))","v":0},{"$f":"IF(OR($C477=\"S\",$C477=0),0,MATCH(OFFSET($D477,0,$C477)+1,OFFSET($D477,1,$C477,ROW($C$505)-ROW($C477)),0))","v":0},"","Serviço","Serviço","-","AGETOP",81663,"CORPO CX. SIFONADA DIAM. 150 X 150 X 50","Un    ",4,1,4,null,null,0,0,""]
[4,4,4,2,15,1,3,2,0,{"$f":"IF(OR($C478=\"S\",$C478=0),0,MATCH(0,OFFSET($D478,1,$C478,ROW($C$505)-ROW($C478)),0))","v":18},{"$f":"IF(OR($C478=\"S\",$C478=0),0,MATCH(OFFSET($D478,0,$C478)+1,OFFSET($D478,1,$C478,ROW($C$505)-ROW($C478)),0))","v":2},"","Nível 4","Nível 4","-","SINAPI",null,"CURVAS","-",null,1,"-",null,null,0,0,""]
["S",4,"S",0,15,1,3,2,0,{"$f":"IF(OR($C479=\"S\",$C479=0),0,MATCH(0,OFFSET($D479,1,$C479,ROW($C$505)-ROW($C479)),0))","v":0},{"$f":"IF(OR($C479=\"S\",$C479=0),0,MATCH(OFFSET($D479,0,$C479)+1,OFFSET($D479,1,$C479,ROW($C$505)-ROW($C479)),0))","v":0},"","Serviço","Serviço","-","SINAPI",89728,"CURVA CURTA 90 GRAUS, PVC, SERIE NORMAL, ESGOTO PREDIAL, DN 40 MM, JUNTA SOLDÁVEL, FORNECIDO E INSTALADO EM RAMAL DE DESCARGA OU RAMAL DE ESGOTO SANITÁRIO. AF_12/2014","UN",4,1,4,null,null,0,0,""]
[4,4,4,6,15,1,3,3,0,{"$f":"IF(OR($C480=\"S\",$C480=0),0,MATCH(0,OFFSET($D480,1,$C480,ROW($C$505)-ROW($C480)),0))","v":16},{"$f":"IF(OR($C480=\"S\",$C480=0),0,MATCH(OFFSET($D480,0,$C480)+1,OFFSET($D480,1,$C480,ROW($C$505)-ROW($C480)),0))","v":6},"","Nível 4","Nível 4","-","SINAPI",null,"JOELHOS","-",null,1,"-",null,null,0,0,""]
["S",4,"S",0,15,1,3,3,0,{"$f":"IF(OR($C481=\"S\",$C481=0),0,MATCH(0,OFFSET($D481,1,$C481,ROW($C$505)-ROW($C481)),0))","v":0},{"$f":"IF(OR($C481=\"S\",$C481=0),0,MATCH(OFFSET($D481,0,$C481)+1,OFFSET($D481,1,$C481,ROW($C$505)-ROW($C481)),0))","v":0},"","Serviço","Serviço","-","SINAPI",89726,"JOELHO 45 GRAUS, PVC, SERIE NORMAL, ESGOTO PREDIAL, DN 40 MM, JUNTA SOLDÁVEL, FORNECIDO E INSTALADO EM RAMAL DE DESCARGA OU RAMAL DE ESGOTO SANITÁRIO. AF_12/2014","UN",4,1,4,null,null,0,0,""]
["S",4,"S",0,15,1,3,3,0,{"$f":"IF(OR($C482=\"S\",$C482=0),0,MATCH(0,OFFSET($D482,1,$C482,ROW($C$505)-ROW($C482)),0))","v":0},{"$f":"IF(OR($C482=\"S\",$C482=0),0,MATCH(OFFSET($D482,0,$C482)+1,OFFSET($D482,1,$C482,ROW($C$505)-ROW($C482)),0))","v":0},"","Serviço","Serviço","-","SINAPI",89802,"JOELHO 45 GRAUS, PVC, SERIE NORMAL, ESGOTO PREDIAL, DN 50 MM, JUNTA ELÁSTICA, FORNECIDO E INSTALADO EM PRUMADA DE ESGOTO SANITÁRIO OU VENTILAÇÃO. AF_12/2014","UN",2,1,2,null,null,0,0,""]
["S",4,"S",0,15,1,3,3,0,{"$f":"IF(OR($C483=\"S\",$C483=0),0,MATCH(0,OFFSET($D483,1,$C483,ROW($C$505)-ROW($C483)),0))","v":0},{"$f":"IF(OR($C483=\"S\",$C483=0),0,MATCH(OFFSET($D483,0,$C483)+1,OFFSET($D483,1,$C483,ROW($C$505)-ROW($C483)),0))","v":0},"","Serviço","Serviço","-","SINAPI",89810,"JOELHO 45 GRAUS, PVC, SERIE NORMAL, ESGOTO PREDIAL, DN 100 MM, JUNTA ELÁSTICA, FORNECIDO E INSTALADO EM PRUMADA DE ESGOTO SANITÁRIO OU VENTILAÇÃO. AF_12/2014","UN",2,1,2,null,null,0,0,""]
["S",4,"S",0,15,1,3,3,0,{"$f":"IF(OR($C484=\"S\",$C484=0),0,MATCH(0,OFFSET($D484,1,$C484,ROW($C$505)-ROW($C484)),0))","v":0},{"$f":"IF(OR($C484=\"S\",$C484=0),0,MATCH(OFFSET($D484,0,$C484)+1,OFFSET($D484,1,$C484,ROW($C$505)-ROW($C484)),0))","v":0},"","Serviço","Serviço","-","SINAPI",89850,"JOELHO 90 GRAUS, PVC, SERIE NORMAL, ESGOTO PREDIAL, DN 100 MM, JUNTA ELÁSTICA, FORNECIDO E INSTALADO EM SUBCOLETOR AÉREO DE ESGOTO SANITÁRIO. AF_12/2014","UN",4,1,4,null,null,0,0,"Referência: AGETOP - 81938"]
["S",4,"S",0,15,1,3,3,0,{"$f":"IF(OR($C485=\"S\",$C485=0),0,MATCH(0,OFFSET($D485,1,$C485,ROW($C$505)-ROW($C485)),0))","v":0},{"$f":"IF(OR($C485=\"S\",$C485=0),0,MATCH(OFFSET($D485,0,$C485)+1,OFFSET($D485,1,$C485,ROW($C$505)-ROW($C485)),0))","v":0},"","Serviço","Serviço","-","AGETOP",81927,"JOELHO 90 GRAUS C/ANEL 40 mm ","Un    ",4,1,4,null,null,0,0,""]
[4,4,4,2,15,1,3,4,0,{"$f":"IF(OR($C486=\"S\",$C486=0),0,MATCH(0,OFFSET($D486,1,$C486,ROW($C$505)-ROW($C486)),0))","v":10},{"$f":"IF(OR($C486=\"S\",$C486=0),0,MATCH(OFFSET($D486,0,$C486)+1,OFFSET($D486,1,$C486,ROW($C$505)-ROW($C486)),0))","v":2},"","Nível 4","Nível 4","-","SINAPI",null,"JUNÇÕES","-",null,1,"-",null,null,0,0,""]
["S",4,"S",0,15,1,3,4,0,{"$f":"IF(OR($C487=\"S\",$C487=0),0,MATCH(0,OFFSET($D487,1,$C487,ROW($C$505)-ROW($C487)),0))","v":0},{"$f":"IF(OR($C487=\"S\",$C487=0),0,MATCH(OFFSET($D487,0,$C487)+1,OFFSET($D487,1,$C487,ROW($C$505)-ROW($C487)),0))","v":0},"","Serviço","Serviço","-","AGETOP",81975,"JUNCAO SIMPLES DIAM. 100 X 100 MM","Un    ",2,1,2,null,null,0,0,""]
[4,4,4,4,15,1,3,5,0,{"$f":"IF(OR($C488=\"S\",$C488=0),0,MATCH(0,OFFSET($D488,1,$C488,ROW($C$505)-ROW($C488)),0))","v":8},{"$f":"IF(OR($C488=\"S\",$C488=0),0,MATCH(OFFSET($D488,0,$C488)+1,OFFSET($D488,1,$C488,ROW($C$505)-ROW($C488)),0))","v":4},"","Nível 4","Nível 4","-","SINAPI",null,"LUVAS","-",null,1,"-",null,null,0,0,""]
["S",4,"S",0,15,1,3,5,0,{"$f":"IF(OR($C489=\"S\",$C489=0),0,MATCH(0,OFFSET($D489,1,$C489,ROW($C$505)-ROW($C489)),0))","v":0},{"$f":"IF(OR($C489=\"S\",$C489=0),0,MATCH(OFFSET($D489,0,$C489)+1,OFFSET($D489,1,$C489,ROW($C$505)-ROW($C489)),0))","v":0},"","Serviço","Serviço","-","AGETOP",82001,"LUVA SIMPLES DIAMETRO 40 MM","Un    ",4,1,4,null,null,0,0,""]
["S",4,"S",0,15,1,3,5,0,{"$f":"IF(OR($C490=\"S\",$C490=0),0,MATCH(0,OFFSET($D490,1,$C490,ROW($C$505)-ROW($C490)),0))","v":0},{"$f":"IF(OR($C490=\"S\",$C490=0),0,MATCH(OFFSET($D490,0,$C490)+1,OFFSET($D490,1,$C490,ROW($C$505)-ROW($C490)),0))","v":0},"","Serviço","Serviço","-","AGETOP",82002,"LUVA SIMPLES DIAMETRO 50 MM","Un    ",4,1,4,null,null,0,0,""]
["S",4,"S",0,15,1,3,5,0,{"$f":"IF(OR($C491=\"S\",$C491=0),0,MATCH(0,OFFSET($D491,1,$C491,ROW($C$505)-ROW($C491)),0))","v":0},{"$f":"IF(OR($C491=\"S\",$C491=0),0,MATCH(OFFSET($D491,0,$C491)+1,OFFSET($D491,1,$C491,ROW($C$505)-ROW($C491)),0))","v":0},"","Serviço","Serviço","-","AGETOP",82004,"LUVA SIMPLES DIAM. 100 MM","Un    ",4,1,4,null,null,0,0,""]
[4,4,4,4,15,1,3,6,0,{"$f":"IF(OR($C492=\"S\",$C492=0),0,MATCH(0,OFFSET($D492,1,$C492,ROW($C$505)-ROW($C492)),0))","v":4},{"$f":"IF(OR($C492=\"S\",$C492=0),0,MATCH(OFFSET($D492,0,$C492)+1,OFFSET($D492,1,$C492,ROW($C$505)-ROW($C492)),0))","v":{"$error":"#N/A"}},"","Nível 4","Nível 4","-","SINAPI",null,"TUBOS","-",null,1,"-",null,null,0,0,""]
["S",4,"S",0,15,1,3,6,0,{"$f":"IF(OR($C493=\"S\",$C493=0),0,MATCH(0,OFFSET($D493,1,$C493,ROW($C$505)-ROW($C493)),0))","v":0},{"$f":"IF(OR($C493=\"S\",$C493=0),0,MATCH(OFFSET($D493,0,$C493)+1,OFFSET($D493,1,$C493,ROW($C$505)-ROW($C493)),0))","v":0},"","Serviço","Serviço","-","AGETOP",82301,"TUBO SOLD.P/ESGOTO DIAM. 40 MM","m     ",18,1,18,null,null,0,0,""]
["S",4,"S",0,15,1,3,6,0,{"$f":"IF(OR($C494=\"S\",$C494=0),0,MATCH(0,OFFSET($D494,1,$C494,ROW($C$505)-ROW($C494)),0))","v":0},{"$f":"IF(OR($C494=\"S\",$C494=0),0,MATCH(OFFSET($D494,0,$C494)+1,OFFSET($D494,1,$C494,ROW($C$505)-ROW($C494)),0))","v":0},"","Serviço","Serviço","-","SINAPI",89798,"TUBO PVC, SERIE NORMAL, ESGOTO PREDIAL, DN 50 MM, FORNECIDO E INSTALADO EM PRUMADA DE ESGOTO SANITÁRIO OU VENTILAÇÃO. AF_12/2014","M",6,1,6,null,null,0,0,""]
["S",4,"S",0,15,1,3,6,0,{"$f":"IF(OR($C495=\"S\",$C495=0),0,MATCH(0,OFFSET($D495,1,$C495,ROW($C$505)-ROW($C495)),0))","v":0},{"$f":"IF(OR($C495=\"S\",$C495=0),0,MATCH(OFFSET($D495,0,$C495)+1,OFFSET($D495,1,$C495,ROW($C$505)-ROW($C495)),0))","v":0},"","Serviço","Serviço","-","SINAPI",89800,"TUBO PVC, SERIE NORMAL, ESGOTO PREDIAL, DN 100 MM, FORNECIDO E INSTALADO EM PRUMADA DE ESGOTO SANITÁRIO OU VENTILAÇÃO. AF_12/2014","M",12,1,12,null,null,0,0,""]
[1,1,1,9,16,0,0,0,0,{"$f":"IF(OR($C496=\"S\",$C496=0),0,MATCH(0,OFFSET($D496,1,$C496,ROW($C$505)-ROW($C496)),0))","v":9},{"$f":"IF(OR($C496=\"S\",$C496=0),0,MATCH(OFFSET($D496,0,$C496)+1,OFFSET($D496,1,$C496,ROW($C$505)-ROW($C496)),0))","v":{"$error":"#N/A"}},"F","Nível 1","Nível 1","16.","SINAPI",null,"CUSTOS RELATIVOS À OBRA","UN",1,1,1,null,null,0,0,""]
[2,2,2,3,16,1,0,0,0,{"$f":"IF(OR($C497=\"S\",$C497=0),0,MATCH(0,OFFSET($D497,1,$C497,ROW($C$505)-ROW($C497)),0))","v":8},{"$f":"IF(OR($C497=\"S\",$C497=0),0,MATCH(OFFSET($D497,0,$C497)+1,OFFSET($D497,1,$C497,ROW($C$505)-ROW($C497)),0))","v":3},"","Nível 2","Nível 2","-","SINAPI",null,"SERVIÇOS PRELIMINARES","-",null,1,"-",null,null,0,0,""]
["S",2,"S",0,16,1,0,0,0,{"$f":"IF(OR($C498=\"S\",$C498=0),0,MATCH(0,OFFSET($D498,1,$C498,ROW($C$505)-ROW($C498)),0))","v":0},{"$f":"IF(OR($C498=\"S\",$C498=0),0,MATCH(OFFSET($D498,0,$C498)+1,OFFSET($D498,1,$C498,ROW($C$505)-ROW($C498)),0))","v":0},"","Serviço","Serviço","-","AGETOP",21301,"PLACA DE OBRA PLOTADA EM CHAPA METÁLICA 26 , AFIXADA EM CAVALETES DE MADEIRA DE LEI (VIGOTAS 6X12CM) - PADRÃO GOINFRA","m2    ",7.5,1,7.5,null,null,0,0,""]
["S",2,"S",0,16,1,0,0,0,{"$f":"IF(OR($C499=\"S\",$C499=0),0,MATCH(0,OFFSET($D499,1,$C499,ROW($C$505)-ROW($C499)),0))","v":0},{"$f":"IF(OR($C499=\"S\",$C499=0),0,MATCH(OFFSET($D499,0,$C499)+1,OFFSET($D499,1,$C499,ROW($C$505)-ROW($C499)),0))","v":0},"","Serviço","Serviço","-","AGETOP",270804,"PLACA DE INAUGURAÇÃO AÇO ESCOVADO 60 X 120 CM","un    ",1,1,1,null,null,0,0,""]
[2,2,2,3,16,2,0,0,0,{"$f":"IF(OR($C500=\"S\",$C500=0),0,MATCH(0,OFFSET($D500,1,$C500,ROW($C$505)-ROW($C500)),0))","v":5},{"$f":"IF(OR($C500=\"S\",$C500=0),0,MATCH(OFFSET($D500,0,$C500)+1,OFFSET($D500,1,$C500,ROW($C$505)-ROW($C500)),0))","v":3},"","Nível 2","Nível 2","-","SINAPI",null,"ADMINISTRAÇÃO","-",null,1,"-",null,null,0,0,""]
["S",2,"S",0,16,2,0,0,0,{"$f":"IF(OR($C501=\"S\",$C501=0),0,MATCH(0,OFFSET($D501,1,$C501,ROW($C$505)-ROW($C501)),0))","v":0},{"$f":"IF(OR($C501=\"S\",$C501=0),0,MATCH(OFFSET($D501,0,$C501)+1,OFFSET($D501,1,$C501,ROW($C$505)-ROW($C501)),0))","v":0},"","Serviço","Serviço","-","SINAPI",90778,"ENGENHEIRO CIVIL DE OBRA PLENO COM ENCARGOS COMPLEMENTARES","H",81,1,81,null,null,0,0,"Referência: AGETOP - 250101"]
["S",2,"S",0,16,2,0,0,0,{"$f":"IF(OR($C502=\"S\",$C502=0),0,MATCH(0,OFFSET($D502,1,$C502,ROW($C$505)-ROW($C502)),0))","v":0},{"$f":"IF(OR($C502=\"S\",$C502=0),0,MATCH(OFFSET($D502,0,$C502)+1,OFFSET($D502,1,$C502,ROW($C$505)-ROW($C502)),0))","v":0},"","Serviço","Serviço","-","SINAPI",90776,"ENCARREGADO GERAL COM ENCARGOS COMPLEMENTARES","H",467,1,467,null,null,0,0,"Referência: AGETOP - 250103"]
[2,2,2,2,16,3,0,0,0,{"$f":"IF(OR($C503=\"S\",$C503=0),0,MATCH(0,OFFSET($D503,1,$C503,ROW($C$505)-ROW($C503)),0))","v":2},{"$f":"IF(OR($C503=\"S\",$C503=0),0,MATCH(OFFSET($D503,0,$C503)+1,OFFSET($D503,1,$C503,ROW($C$505)-ROW($C503)),0))","v":{"$error":"#N/A"}},"","Nível 2","Nível 2","-","SINAPI",null,"DIVERSOS","-",null,1,"-",null,null,0,0,""]
["S",2,"S",0,16,3,0,0,0,{"$f":"IF(OR($C504=\"S\",$C504=0),0,MATCH(0,OFFSET($D504,1,$C504,ROW($C$505)-ROW($C504)),0))","v":0},{"$f":"IF(OR($C504=\"S\",$C504=0),0,MATCH(OFFSET($D504,0,$C504)+1,OFFSET($D504,1,$C504,ROW($C$505)-ROW($C504)),0))","v":0},"","Serviço","Serviço","-","AGETOP",270501,"LIMPEZA FINAL DE OBRA - (OBRAS CIVIS)","m2    ",107.07,1,107.07,null,null,0,0,""]
[-1,null,-1,null,0,0,0,0,0,null,null,"F"]
[null,null,null,null,null,null,null,null,null,null,null,"F",null,null,null,null,null,"OBS: OS QUANTITATIVOS DE MATERIAIS  DAS INSTALAÇÕES HIDROSSANITÁRIAS, ELÉTRICAS E ESPECIAIS SÃO FORNECIDOS PELOS PROFISSIONAIS RESPONSÁVEIS PELOS RESPECTIVOS PROJETOS.",null,null,null,null,"VALOR TOTAL",null,null,0]
[null,null,null,null,null,null,null,null,null,null,null,"F",null,null,null,null,null,null,null,null,null,null,"VALOR BDI (26,40%)",null,null,0]
[null,null,null,null,null,null,null,null,null,null,null,"F",null,null,null,null,null,null,null,null,null,null,"TOTAL ORÇAMENTO",null,null,0]
[null,null,null,null,null,null,null,null,null,null,null,"F"]
[null,null,null,null,null,null,null,null,null,null,null,"F",null,null,null,null,null,null,null,null,null,null,"CUSTO POR M2 ³",null,null,0]
[null,null,null,null,null,null,null,null,null,null,null,"F",null,null,null,null,null,null,null,null,null,null,"MATERIAL S/ BDI",null,null,0]
[null,null,null,null,null,null,null,null,null,null,null,"F",null,null,null,null,null,null,null,null,null,null,"MÃO DE OBRA S/ BDI",null,null,0]
[null,null,null,null,null,null,null,null,null,null,null,"F"]
[null,null,null,null,null,null,null,null,null,null,null,"F",null,null,null,null,"(1) Conforme previsto pelo DECRETO Nº 7.983, DE 8 DE ABRIL DE 2013, os preços adotados são aqueles constantes dos sistemas de referência indicados. Justifica-se o uso dos preços destas composições de custos unitários devido ao seu valor ser menor à mediana de seus correspondentes na tabela SINAPI;"]
[null,null,null,null,null,null,null,null,null,null,null,"F",null,null,null,null,"(2) Optou-se pelo uso das composições de custos da AGETOP para itens não presentes na SINAPI;"]
[null,null,null,null,null,null,null,null,null,null,null,"F",null,null,null,null,"(3) Para itens da AGETOP, os vidros não estão inclusos nas esquadrias e já foram considerados os custos de contramarco para as esquadrias de alumínio;"]
[null,null,null,null,null,null,null,null,null,null,null,"F",null,null,null,null,"(4) Nos casos em que houver execução de granitina e omissão do item AGETOP 221102, considerou-se que o quantitativo para o rodapé, de altura igual a 7cm, foi incorporado na área de piso;"]
[null,null,null,null,null,null,null,null,null,null,null,"F",null,null,null,null,"(5) O custo unitário aproximado por metro quadrado é calculado dividindo-se o valor total do orçamento pela área total de construção."]
[null,null,null,null,null,null,null,null,null,null,null,"F"]
[null,null,null,null,null,null,null,null,null,null,null,"F"]
[]
[null,null,null,null,null,null,null,null,null,null,null,null,null,null,"SOMATÓRIO DE SERVIÇOS"]
[null,null,null,null,null,null,null,null,null,null,null,null,null,null,"ITEM","DESCRIÇÃO DOS SERVIÇOS",null,null,"PREÇO SEM BDI",null,null,null,null,"PREÇO COM BDI",null,null,"PARTICIPAÇÃO ( % )"]
[null,null,null,null,null,null,null,null,null,null,null,null,null,null,"a.","SERVIÇOS PRELIMINARES",null,null,0,null,null,null,null,0,null,null,0]
[null,null,null,null,null,null,null,null,null,null,null,null,null,null,"b.","TRANSPORTES",null,null,0,null,null,null,null,0,null,null,0]
[null,null,null,null,null,null,null,null,null,null,null,null,null,null,"c.","SERVIÇO EM TERRA",null,null,0,null,null,null,null,0,null,null,0]
[null,null,null,null,null,null,null,null,null,null,null,null,null,null,"d.","FUNDAÇÕES E SONDAGENS",null,null,0,null,null,null,null,0,null,null,0]
[null,null,null,null,null,null,null,null,null,null,null,null,null,null,"e.","ESTRUTURA",null,null,0,null,null,null,null,0,null,null,0]
[null,null,null,null,null,null,null,null,null,null,null,null,null,null,"f.","INSTALAÇÕES ELÉTRICAS",null,null,0,null,null,null,null,0,null,null,0]
[null,null,null,null,null,null,null,null,null,null,null,null,null,null,"g.","INSTALAÇÕES HIDROSSANITÁRIAS",null,null,0,null,null,null,null,0,null,null,0]
[null,null,null,null,null,null,null,null,null,null,null,null,null,null,"h","INSTALAÇÕES ESPECIAIS",null,null,0,null,null,null,null,0,null,null,0]
[null,null,null,null,null,null,null,null,null,null,null,null,null,null,"i.","ALVENARIAS E DIVISÓRIAS",null,null,0,null,null,null,null,0,null,null,0]
[null,null,null,null,null,null,null,null,null,null,null,null,null,null,"j.","ALVENARIA AUTO-PORTANTE",null,null,0,null,null,null,null,0,null,null,0]
[null,null,null,null,null,null,null,null,null,null,null,null,null,null,"k.","IMPERMEABILIZAÇÃO",null,null,0,null,null,null,null,0,null,null,0]
[null,null,null,null,null,null,null,null,null,null,null,null,null,null,"l.","ISOLAMENTO TÉRMICO E ACÚSTICO",null,null,0,null,null,null,null,0,null,null,0]
[null,null,null,null,null,null,null,null,null,null,null,null,null,null,"m.","ESTRUTURA DE MADEIRA",null,null,0,null,null,null,null,0,null,null,0]
[null,null,null,null,null,null,null,null,null,null,null,null,null,null,"n.","ESTRUTURAS METÁLICAS",null,null,0,null,null,null,null,0,null,null,0]
[null,null,null,null,null,null,null,null,null,null,null,null,null,null,"o.","COBERTURAS",null,null,0,null,null,null,null,0,null,null,0]
[null,null,null,null,null,null,null,null,null,null,null,null,null,null,"p.","ESQUADRIAS DE MADEIRA",null,null,0,null,null,null,null,0,null,null,0]
[null,null,null,null,null,null,null,null,null,null,null,null,null,null,"q.","ESQUADRIAS METÁLICAS",null,null,0,null,null,null,null,0,null,null,0]
[null,null,null,null,null,null,null,null,null,null,null,null,null,null,"r.","VIDROS",null,null,0,null,null,null,null,0,null,null,0]
[null,null,null,null,null,null,null,null,null,null,null,null,null,null,"s.","REVESTIMENTO DE PAREDE",null,null,0,null,null,null,null,0,null,null,0]
[null,null,null,null,null,null,null,null,null,null,null,null,null,null,"t.","FORROS",null,null,0,null,null,null,null,0,null,null,0]
[null,null,null,null,null,null,null,null,null,null,null,null,null,null,"u.","REVESTIMENTO DE PISO",null,null,0,null,null,null,null,0,null,null,0]
[null,null,null,null,null,null,null,null,null,null,null,null,null,null,"v.","FERRAGENS",null,null,0,null,null,null,null,0,null,null,0]
[null,null,null,null,null,null,null,null,null,null,null,null,null,null,"w.","MARCENARIA",null,null,0,null,null,null,null,0,null,null,0]
[null,null,null,null,null,null,null,null,null,null,null,null,null,null,"x.","ADMINISTRAÇÃO",null,null,0,null,null,null,null,0,null,null,0]
[null,null,null,null,null,null,null,null,null,null,null,null,null,null,"y.","PINTURA",null,null,0,null,null,null,null,0,null,null,0]
[null,null,null,null,null,null,null,null,null,null,null,null,null,null,"z.","DIVERSOS",null,null,0,null,null,null,null,0,null,null,0]
[null,null,null,null,null,null,null,null,null,null,null,null,null,null,"TOTAL GERAL DO ORÇAMENTO (R$)",null,null,null,0,null,null,null,null,0,null,null,0]
[null,null,null,null,null,null,null,null,null,null,null,null,null,null,null,null,null,null,0,null,null,null,null,0,null,null,100]
[null,null,null,null,null,null,null,null,null,null,null,null,null,null,null,null,null,null,"(TOTAL SEM BDI)",null,null,null,null,"(TOTAL COM BDI)",null,null,"(ARRED porcentagem)"]
[null,null,null,null,null,null,null,null,null,null,null,null,null,null,null,null,null,null,"ERRO",null,null,null,null,"ERRO",null,null,"ERRO"]
[]
[]
[null,null,null,null,null,null,null,null,null,null,null,null,null,null,"RESUMO GERAL DO ORÇAMENTO"]
[null,null,null,null,null,null,null,null,null,null,null,null,null,null,"ITEM","DESCRIÇÃO DOS SERVIÇOS",null,null,"PREÇO SEM BDI",null,null,null,null,"PREÇO COM BDI",null,null,"PARTICIPAÇÃO ( % )"]
[null,null,null,null,null,null,null,null,null,null,null,null,null,null,"1.","SANITÁRIOS",null,null,0,null,null,null,null,0,null,null,{"$error":"#DIV/0!"}]
[null,null,null,null,null,null,null,null,null,null,null,null,null,null,"2.","PINTURA DE PORTAS DE SALAS DE AULA",null,null,0,null,null,null,null,0,null,null,{"$error":"#DIV/0!"}]
[null,null,null,null,null,null,null,null,null,null,null,null,null,null,"3.","TROCA DE VIDROS QUEBRADOS DAS JANELAS",null,null,0,null,null,null,null,0,null,null,{"$error":"#DIV/0!"}]
[null,null,null,null,null,null,null,null,null,null,null,null,null,null,"4.","ELEVADOR",null,null,0,null,null,null,null,0,null,null,{"$error":"#DIV/0!"}]
[null,null,null,null,null,null,null,null,null,null,null,null,null,null,"5.","ACESSO À QUADRA",null,null,0,null,null,null,null,0,null,null,{"$error":"#DIV/0!"}]
[null,null,null,null,null,null,null,null,null,null,null,null,null,null,"6.","CENTRAL DE GÁS",null,null,0,null,null,null,null,0,null,null,{"$error":"#DIV/0!"}]
[null,null,null,null,null,null,null,null,null,null,null,null,null,null,"7.","INSTALAÇÕES DE GÁS ",null,null,0,null,null,null,null,0,null,null,{"$error":"#DIV/0!"}]
[null,null,null,null,null,null,null,null,null,null,null,null,null,null,"8.","PINTURA GERAL",null,null,0,null,null,null,null,0,null,null,{"$error":"#DIV/0!"}]
[null,null,null,null,null,null,null,null,null,null,null,null,null,null,"9.","CALÇADA",null,null,0,null,null,null,null,0,null,null,{"$error":"#DIV/0!"}]
[null,null,null,null,null,null,null,null,null,null,null,null,null,null,"10.","BIBLIOTECA",null,null,0,null,null,null,null,0,null,null,{"$error":"#DIV/0!"}]
[null,null,null,null,null,null,null,null,null,null,null,null,null,null,"11.","PROJETO DE INSTALAÇÕES ELÉTRICAS",null,null,0,null,null,null,null,0,null,null,{"$error":"#DIV/0!"}]
[null,null,null,null,null,null,null,null,null,null,null,null,null,null,"12.","INSTALAÇÕES DE PREVENÇÃO E COMBATE À INCÊNDIO",null,null,0,null,null,null,null,0,null,null,{"$error":"#DIV/0!"}]
[null,null,null,null,null,null,null,null,null,null,null,null,null,null,"13.","PROJETO DE ESTRUTURAS METÁLICAS",null,null,0,null,null,null,null,0,null,null,{"$error":"#DIV/0!"}]
[null,null,null,null,null,null,null,null,null,null,null,null,null,null,"14.","PROJETO ESTRUTURAL",null,null,0,null,null,null,null,0,null,null,{"$error":"#DIV/0!"}]
[null,null,null,null,null,null,null,null,null,null,null,null,null,null,"15.","PROJETO DE INSTALAÇÕES HIDROSSANITÁRIAS",null,null,0,null,null,null,null,0,null,null,{"$error":"#DIV/0!"}]
[null,null,null,null,null,null,null,null,null,null,null,null,null,null,"16.","CUSTOS RELATIVOS À OBRA",null,null,0,null,null,null,null,0,null,null,{"$error":"#DIV/0!"}]
[null,null,null,null,null,null,null,null,null,null,null,null,null,null,"17.","",null,null,0,null,null,null,null,0,null,null,{"$error":"#DIV/0!"}]
[null,null,null,null,null,null,null,null,null,null,null,null,null,null,"18.","",null,null,0,null,null,null,null,0,null,null,{"$error":"#DIV/0!"}]
[null,null,null,null,null,null,null,null,null,null,null,null,null,null,"19.","",null,null,0,null,null,null,null,0,null,null,{"$error":"#DIV/0!"}]
[null,null,null,null,null,null,null,null,null,null,null,null,null,null,"20.","",null,null,0,null,null,null,null,0,null,null,{"$error":"#DIV/0!"}]
[null,null,null,null,null,null,null,null,null,null,null,null,null,null,"TOTAL GERAL DO ORÇAMENTO (R$)",null,null,null,0,null,null,null,null,0,null,null,{"$error":"#DIV/0!"}]
[null,null,null,null,null,null,null,null,null,null,null,null,null,null,null,null,null,null,0,null,null,null,null,0,null,null,100]
[null,null,null,null,null,null,null,null,null,null,null,null,null,null,null,null,null,null,"(TOTAL SEM BDI)",null,null,null,null,"(TOTAL COM BDI)",null,null,"(ARRED porcentagem)"]
[null,null,null,null,null,null,null,null,null,null,null,null,null,null,null,null,null,null,"ERRO",null,null,null,null,"ERRO",null,null,{"$error":"#DIV/0!"}]

{"sheet":"Resumo ","index":1,"n_rows":41,"n_cols":9,"rows_kept":41,"cut":false,"hidden":false,"merged":[[40,2,40,5],[42,3,42,7],[41,3,41,7],[22,2,22,5],[23,2,23,5],[24,2,24,5],[25,2,25,5],[26,2,26,5],[32,2,32,5],[33,2,33,5],[34,2,34,5],[35,2,35,5],[27,2,27,5],[28,2,28,5],[29,2,29,5],[30,2,30,5],[31,2,31,5],[1,1,1,8],[2,6,2,8],[3,6,3,8],[4,1,4,8],[5,6,5,8],[6,6,6,8],[7,1,7,8],[8,6,8,8],[9,6,9,8],[13,1,13,8],[11,1,11,2],[12,1,12,2],[0,1,0,8],[36,1,36,5],[2,1,2,5],[3,1,3,5],[5,1,5,5],[6,1,6,5],[8,1,8,5],[9,1,9,5],[11,3,11,5],[12,3,12,5],[10,1,10,8],[11,6,11,8],[12,6,12,8],[19,2,19,5],[20,2,20,5],[21,2,21,5],[13,0,14,0],[15,2,15,5],[16,2,16,5],[17,2,17,5],[18,2,18,5],[14,1,14,8]]}
[]
[]
[null,"UNIDADE ESCOLAR",null,null,null,null,"CÓDIGO INEP"]
[null,{"$f":"Orçamento!$O$4","v":"COLÉGIO ESTADUAL OLYNTO PEREIRA DE CASTRO"},null,null,null,null,{"$f":"Orçamento!X4","v":52054217}]
[]
[null,"OBRA",null,null,null,null,"CIDADE"]
[null,{"$f":"Orçamento!$O$7","v":"REFORMA E AMPLIAÇÃO"},null,null,null,null,{"$f":"Orçamento!$X$7","v":"RIO VERDE"}]
[]
[null,"ENDEREÇO",null,null,null,null,"CRE"]
[null,{"$f":"Orçamento!$R$10","v":" RUA JUCA BAILAO SN , SETOR MORADA DO SOL , CEP:75909-050"},null,null,null,null,{"$f":"Orçamento!$O$10","v":"CRE-RIO VERDE"}]
[]
[null,"REFERÊNCIA",null,"DATA",null,null,"ÁREA TOTAL CONSTRUÍDA (M²)"]
[null,{"$f":"CONCATENATE(\"AGETOP E SINAPI - \",Orçamento!$T$10)","v":"AGETOP E SINAPI - DESONERADA"},null,{"$f":"Orçamento!$S$7","v":"2020-06-18"},null,null,{"$f":"Orçamento!$X$13","v":2251.75}]
["FILTRO"]
[null,"RESUMO GERAL DO ORÇAMENTO"]
["↓","ITEM","DESCRIÇÃO DOS SERVIÇOS",null,null,null,"PREÇO SEM BDI","PREÇO COM BDI","PARTICIP. (%)"]
[{"$f":"IF(G17>0,\"F\",\"\")","v":""},"1.",{"$f":"Orçamento!$P558","v":"SANITÁRIOS"},null,null,null,{"$f":"IFERROR(Orçamento!S558,\"-\")","v":0},{"$f":"IFERROR(Orçamento!X558,\"\")","v":0},{"$f":"Orçamento!AA558","v":{"$error":"#DIV/0!"}}]
[{"$f":"IF(G18>0,\"F\",\"\")","v":""},"2.",{"$f":"Orçamento!$P559","v":"PINTURA DE PORTAS DE SALAS DE AULA"},null,null,null,{"$f":"IFERROR(Orçamento!S559,\"-\")","v":0},{"$f":"IFERROR(Orçamento!X559,\"\")","v":0},{"$f":"Orçamento!AA559","v":{"$error":"#DIV/0!"}}]
["","3.",{"$f":"Orçamento!$P560","v":"TROCA DE VIDROS QUEBRADOS DAS JANELAS"},null,null,null,{"$f":"IFERROR(Orçamento!S560,\"-\")","v":0},{"$f":"IFERROR(Orçamento!X560,\"\")","v":0},{"$f":"Orçamento!AA560","v":{"$error":"#DIV/0!"}}]
["","4.",{"$f":"Orçamento!$P561","v":"ELEVADOR"},null,null,null,{"$f":"IFERROR(Orçamento!S561,\"-\")","v":0},{"$f":"IFERROR(Orçamento!X561,\"\")","v":0},{"$f":"Orçamento!AA561","v":{"$error":"#DIV/0!"}}]
["","5.",{"$f":"Orçamento!$P562","v":"ACESSO À QUADRA"},null,null,null,{"$f":"IFERROR(Orçamento!S562,\"-\")","v":0},{"$f":"IFERROR(Orçamento!X562,\"\")","v":0},{"$f":"Orçamento!AA562","v":{"$error":"#DIV/0!"}}]
["","6.",{"$f":"Orçamento!$P563","v":"CENTRAL DE GÁS"},null,null,null,{"$f":"IFERROR(Orçamento!S563,\"-\")","v":0},{"$f":"IFERROR(Orçamento!X563,\"\")","v":0},{"$f":"Orçamento!AA563","v":{"$error":"#DIV/0!"}}]
["","7.",{"$f":"Orçamento!$P564","v":"INSTALAÇÕES DE GÁS "},null,null,null,{"$f":"IFERROR(Orçamento!S564,\"-\")","v":0},{"$f":"IFERROR(Orçamento!X564,\"\")","v":0},{"$f":"Orçamento!AA564","v":{"$error":"#DIV/0!"}}]
["","8.",{"$f":"Orçamento!$P565","v":"PINTURA GERAL"},null,null,null,{"$f":"IFERROR(Orçamento!S565,\"-\")","v":0},{"$f":"IFERROR(Orçamento!X565,\"\")","v":0},{"$f":"Orçamento!AA565","v":{"$error":"#DIV/0!"}}]
["","9.",{"$f":"Orçamento!$P566","v":"CALÇADA"},null,null,null,{"$f":"IFERROR(Orçamento!S566,\"-\")","v":0},{"$f":"IFERROR(Orçamento!X566,\"\")","v":0},{"$f":"Orçamento!AA566","v":{"$error":"#DIV/0!"}}]
["","10.",{"$f":"Orçamento!$P567","v":"BIBLIOTECA"},null,null,null,{"$f":"IFERROR(Orçamento!S567,\"-\")","v":0},{"$f":"IFERROR(Orçamento!X567,\"\")","v":0},{"$f":"Orçamento!AA567","v":{"$error":"#DIV/0!"}}]
["","11.",{"$f":"Orçamento!$P568","v":"PROJETO DE INSTALAÇÕES ELÉTRICAS"},null,null,null,{"$f":"IFERROR(Orçamento!S568,\"-\")","v":0},{"$f":"IFERROR(Orçamento!X568,\"\")","v":0},{"$f":"Orçamento!AA568","v":{"$error":"#DIV/0!"}}]
["","12.",{"$f":"Orçamento!$P569","v":"INSTALAÇÕES DE PREVENÇÃO E COMBATE À INCÊNDIO"},null,null,null,{"$f":"IFERROR(Orçamento!S569,\"-\")","v":0},{"$f":"IFERROR(Orçamento!X569,\"\")","v":0},{"$f":"Orçamento!AA569","v":{"$error":"#DIV/0!"}}]
["","13.",{"$f":"Orçamento!$P570","v":"PROJETO DE ESTRUTURAS METÁLICAS"},null,null,null,{"$f":"IFERROR(Orçamento!S570,\"-\")","v":0},{"$f":"IFERROR(Orçamento!X570,\"\")","v":0},{"$f":"Orçamento!AA570","v":{"$error":"#DIV/0!"}}]
["","14.",{"$f":"Orçamento!$P571","v":"PROJETO ESTRUTURAL"},null,null,null,{"$f":"IFERROR(Orçamento!S571,\"-\")","v":0},{"$f":"IFERROR(Orçamento!X571,\"\")","v":0},{"$f":"Orçamento!AA571","v":{"$error":"#DIV/0!"}}]
["","15.",{"$f":"Orçamento!$P572","v":"PROJETO DE INSTALAÇÕES HIDROSSANITÁRIAS"},null,null,null,{"$f":"IFERROR(Orçamento!S572,\"-\")","v":0},{"$f":"IFERROR(Orçamento!X572,\"\")","v":0},{"$f":"Orçamento!AA572","v":{"$error":"#DIV/0!"}}]
["","16.",{"$f":"Orçamento!$P573","v":"CUSTOS RELATIVOS À OBRA"},null,null,null,{"$f":"IFERROR(Orçamento!S573,\"-\")","v":0},{"$f":"IFERROR(Orçamento!X573,\"\")","v":0},{"$f":"Orçamento!AA573","v":{"$error":"#DIV/0!"}}]
["","17.",{"$f":"Orçamento!$P574","v":""},null,null,null,{"$f":"IFERROR(Orçamento!S574,\"-\")","v":0},{"$f":"IFERROR(Orçamento!X574,\"\")","v":0},{"$f":"Orçamento!AA574","v":{"$error":"#DIV/0!"}}]
["","18.",{"$f":"Orçamento!$P575","v":""},null,null,null,{"$f":"IFERROR(Orçamento!S575,\"-\")","v":0},{"$f":"IFERROR(Orçamento!X575,\"\")","v":0},{"$f":"Orçamento!AA575","v":{"$error":"#DIV/0!"}}]
["","19.",{"$f":"Orçamento!$P576","v":""},null,null,null,{"$f":"IFERROR(Orçamento!S576,\"-\")","v":0},{"$f":"IFERROR(Orçamento!X576,\"\")","v":0},{"$f":"Orçamento!AA576","v":{"$error":"#DIV/0!"}}]
["","20.",{"$f":"Orçamento!$P577","v":""},null,null,null,{"$f":"IFERROR(Orçamento!S577,\"-\")","v":0},{"$f":"IFERROR(Orçamento!X577,\"\")","v":0},{"$f":"Orçamento!AA577","v":{"$error":"#DIV/0!"}}]
["F","TOTAL GERAL DO ORÇAMENTO (R$)",null,null,null,null,{"$f":"SUM(G17:G36)","v":0},{"$f":"SUM(H17:H36)","v":0},{"$f":"SUM(I17:I36)","v":{"$error":"#DIV/0!"}}]
["F"]
["F"]
[]
[null,null,{"$f":"B4","v":"COLÉGIO ESTADUAL OLYNTO PEREIRA DE CASTRO"}]

{"sheet":"Somatório","index":2,"n_rows":45,"n_cols":6,"rows_kept":45,"cut":false,"hidden":false,"merged":[[0,1,0,5],[14,1,14,5],[2,1,2,3],[2,4,2,5],[3,1,3,3],[3,4,3,5],[5,1,5,3],[5,4,5,5],[6,1,6,3],[6,4,6,5],[8,1,8,3],[8,4,8,5],[1,1,1,5],[4,1,4,5],[7,1,7,5],[10,1,10,5],[9,1,9,3],[9,4,9,5],[11,1,11,2],[11,4,11,5],[12,1,12,2],[12,4,12,5],[13,0,14,0],[42,1,42,2],[44,1,44,5],[47,3,47,5],[48,3,48,5],[13,1,13,5]]}
[]
[]
[null,"UNIDADE ESCOLAR",null,null,"CÓDIGO INEP"]
[null,{"$f":"Orçamento!$O$4","v":"COLÉGIO ESTADUAL OLYNTO PEREIRA DE CASTRO"},null,null,{"$f":"Orçamento!X4","v":52054217}]
[]
[null,"OBRA",null,null,"CIDADE"]
[null,{"$f":"Orçamento!$O$7","v":"REFORMA E AMPLIAÇÃO"},null,null,{"$f":"Orçamento!$X$7","v":"RIO VERDE"}]
[]
[null,"ENDEREÇO",null,null,"CRE"]
[null,{"$f":"Orçamento!$R$10","v":" RUA JUCA BAILAO SN , SETOR MORADA DO SOL , CEP:75909-050"},null,null,{"$f":"Orçamento!$O$10","v":"CRE-RIO VERDE"}]
[]
[null,"REFERÊNCIA",null,"DATA","ÁREA TOTAL CONSTRUÍDA (M²)"]
[null,{"$f":"CONCATENATE(\"AGETOP E SINAPI - \",Orçamento!$T$10)","v":"AGETOP E SINAPI - DESONERADA"},null,{"$f":"Orçamento!$S$7","v":"2020-06-18"},{"$f":"Orçamento!$X$13","v":2251.75}]
["FILTRO"]
[null,"SOMATÓRIO DE SERVIÇOS"]
["↓","ITEM","DESCRIÇÃO DOS SERVIÇOS","PREÇO SEM BDI (R$)","PREÇO COM BDI (R$)","PARTIC.  ( % )"]
[{"$f":"IF(D17>0,\"F\",\"\")","v":""},"a.",{"$f":"Orçamento!P524","v":"SERVIÇOS PRELIMINARES"},{"$f":"Orçamento!S524","v":0},{"$f":"Orçamento!X524","v":0},{"$f":"Orçamento!AA524","v":0}]
[{"$f":"IF(D18>0,\"F\",\"\")","v":""},"b.",{"$f":"Orçamento!P525","v":"TRANSPORTES"},{"$f":"Orçamento!S525","v":0},{"$f":"Orçamento!X525","v":0},{"$f":"Orçamento!AA525","v":0}]
["","c.",{"$f":"Orçamento!P526","v":"SERVIÇO EM TERRA"},{"$f":"Orçamento!S526","v":0},{"$f":"Orçamento!X526","v":0},{"$f":"Orçamento!AA526","v":0}]
["","d.",{"$f":"Orçamento!P527","v":"FUNDAÇÕES E SONDAGENS"},{"$f":"Orçamento!S527","v":0},{"$f":"Orçamento!X527","v":0},{"$f":"Orçamento!AA527","v":0}]
["","e.",{"$f":"Orçamento!P528","v":"ESTRUTURA"},{"$f":"Orçamento!S528","v":0},{"$f":"Orçamento!X528","v":0},{"$f":"Orçamento!AA528","v":0}]
["","f.",{"$f":"Orçamento!P529","v":"INSTALAÇÕES ELÉTRICAS"},{"$f":"Orçamento!S529","v":0},{"$f":"Orçamento!X529","v":0},{"$f":"Orçamento!AA529","v":0}]
["","g.",{"$f":"Orçamento!P530","v":"INSTALAÇÕES HIDROSSANITÁRIAS"},{"$f":"Orçamento!S530","v":0},{"$f":"Orçamento!X530","v":0},{"$f":"Orçamento!AA530","v":0}]
["","h",{"$f":"Orçamento!P531","v":"INSTALAÇÕES ESPECIAIS"},{"$f":"Orçamento!S531","v":0},{"$f":"Orçamento!X531","v":0},{"$f":"Orçamento!AA531","v":0}]
["","i.",{"$f":"Orçamento!P532","v":"ALVENARIAS E DIVISÓRIAS"},{"$f":"Orçamento!S532","v":0},{"$f":"Orçamento!X532","v":0},{"$f":"Orçamento!AA532","v":0}]
["","j.",{"$f":"Orçamento!P533","v":"ALVENARIA AUTO-PORTANTE"},{"$f":"Orçamento!S533","v":0},{"$f":"Orçamento!X533","v":0},{"$f":"Orçamento!AA533","v":0}]
["","k.",{"$f":"Orçamento!P534","v":"IMPERMEABILIZAÇÃO"},{"$f":"Orçamento!S534","v":0},{"$f":"Orçamento!X534","v":0},{"$f":"Orçamento!AA534","v":0}]
["","l.",{"$f":"Orçamento!P535","v":"ISOLAMENTO TÉRMICO E ACÚSTICO"},{"$f":"Orçamento!S535","v":0},{"$f":"Orçamento!X535","v":0},{"$f":"Orçamento!AA535","v":0}]
["","m.",{"$f":"Orçamento!P536","v":"ESTRUTURA DE MADEIRA"},{"$f":"Orçamento!S536","v":0},{"$f":"Orçamento!X536","v":0},{"$f":"Orçamento!AA536","v":0}]
["","n.",{"$f":"Orçamento!P537","v":"ESTRUTURAS METÁLICAS"},{"$f":"Orçamento!S537","v":0},{"$f":"Orçamento!X537","v":0},{"$f":"Orçamento!AA537","v":0}]
["","o.",{"$f":"Orçamento!P538","v":"COBERTURAS"},{"$f":"Orçamento!S538","v":0},{"$f":"Orçamento!X538","v":0},{"$f":"Orçamento!AA538","v":0}]
["","p.",{"$f":"Orçamento!P539","v":"ESQUADRIAS DE MADEIRA"},{"$f":"Orçamento!S539","v":0},{"$f":"Orçamento!X539","v":0},{"$f":"Orçamento!AA539","v":0}]
["","q.",{"$f":"Orçamento!P540","v":"ESQUADRIAS METÁLICAS"},{"$f":"Orçamento!S540","v":0},{"$f":"Orçamento!X540","v":0},{"$f":"Orçamento!AA540","v":0}]
["","r.",{"$f":"Orçamento!P541","v":"VIDROS"},{"$f":"Orçamento!S541","v":0},{"$f":"Orçamento!X541","v":0},{"$f":"Orçamento!AA541","v":0}]
["","s.",{"$f":"Orçamento!P542","v":"REVESTIMENTO DE PAREDE"},{"$f":"Orçamento!S542","v":0},{"$f":"Orçamento!X542","v":0},{"$f":"Orçamento!AA542","v":0}]
["","t.",{"$f":"Orçamento!P543","v":"FORROS"},{"$f":"Orçamento!S543","v":0},{"$f":"Orçamento!X543","v":0},{"$f":"Orçamento!AA543","v":0}]
["","u.",{"$f":"Orçamento!P544","v":"REVESTIMENTO DE PISO"},{"$f":"Orçamento!S544","v":0},{"$f":"Orçamento!X544","v":0},{"$f":"Orçamento!AA544","v":0}]
["","v.",{"$f":"Orçamento!P545","v":"FERRAGENS"},{"$f":"Orçamento!S545","v":0},{"$f":"Orçamento!X545","v":0},{"$f":"Orçamento!AA545","v":0}]
["","w.",{"$f":"Orçamento!P546","v":"MARCENARIA"},{"$f":"Orçamento!S546","v":0},{"$f":"Orçamento!X546","v":0},{"$f":"Orçamento!AA546","v":0}]
["","x.",{"$f":"Orçamento!P547","v":"ADMINISTRAÇÃO"},{"$f":"Orçamento!S547","v":0},{"$f":"Orçamento!X547","v":0},{"$f":"Orçamento!AA547","v":0}]
["","y.",{"$f":"Orçamento!P548","v":"PINTURA"},{"$f":"Orçamento!S548","v":0},{"$f":"Orçamento!X548","v":0},{"$f":"Orçamento!AA548","v":0}]
["","z.",{"$f":"Orçamento!P549","v":"DIVERSOS"},{"$f":"Orçamento!S549","v":0},{"$f":"Orçamento!X549","v":0},{"$f":"Orçamento!AA549","v":0}]
["F","TOTAL GERAL DO ORÇAMENTO",null,{"$f":"SUM(D17:D42)","v":0},{"$f":"SUM(E17:E42)","v":0},{"$f":"SUM(F17:F42)","v":0}]
[]
[null,"(*) Para itens da AGETOP, os vidros não estão inclusos nas esquadrias e já foram considerados os custos de contramarco para as esquadrias de alumínio;"]

{"sheet":"Cronog_75_Dias","index":3,"n_rows":99,"n_cols":22,"rows_kept":99,"cut":false,"hidden":false,"merged":[[97,1,97,4],[98,1,98,17],[94,1,94,2],[94,5,94,8],[94,9,94,12],[94,13,94,16],[95,1,95,2],[95,5,95,8],[95,9,95,12],[95,13,95,16],[92,1,92,2],[92,5,92,8],[92,9,92,12],[92,13,92,16],[93,1,93,2],[93,5,93,8],[93,9,93,12],[93,13,93,16],[89,1,91,2],[89,3,91,3],[89,4,91,4],[89,5,89,8],[89,9,89,12],[89,13,89,16],[91,5,91,8],[91,9,91,12],[91,13,91,16],[86,1,88,2],[86,3,88,3],[86,4,88,4],[86,5,86,8],[86,9,86,12],[86,13,86,16],[88,5,88,8],[88,9,88,12],[88,13,88,16],[83,1,85,2],[83,3,85,3],[83,4,85,4],[83,5,83,8],[83,9,83,12],[83,13,83,16],[85,5,85,8],[85,9,85,12],[85,13,85,16],[80,1,82,2],[80,3,82,3],[80,4,82,4],[80,5,80,8],[80,9,80,12],[80,13,80,16],[82,5,82,8],[82,9,82,12],[82,13,82,16],[77,1,79,2],[77,3,79,3],[77,4,79,4],[77,5,77,8],[77,9,77,12],[77,13,77,16],[79,5,79,8],[79,9,79,12],[79,13,79,16],[74,1,76,2],[74,3,76,3],[74,4,76,4],[74,5,74,8],[74,9,74,12],[74,13,74,16],[76,5,76,8],[76,9,76,12],[76,13,76,16],[71,1,73,2],[71,3,73,3],[71,4,73,4],[71,5,71,8],[71,9,71,12],[71,13,71,16],[73,5,73,8],[73,9,73,12],[73,13,73,16],[68,1,70,2],[68,3,70,3],[68,4,70,4],[68,5,68,8],[68,9,68,12],[68,13,68,16],[70,5,70,8],[70,9,70,12],[70,13,70,16],[65,1,67,2],[65,3,67,3],[65,4,67,4],[65,5,65,8],[65,9,65,12],[65,13,65,16],[67,5,67,8],[67,9,67,12],[67,13,67,16],[62,1,64,2],[62,3,64,3],[62,4,64,4],[62,5,62,8],[62,9,62,12],[62,13,62,16],[64,5,64,8],[64,9,64,12],[64,13,64,16],[59,1,61,2],[59,3,61,3],[59,4,61,4],[59,5,59,8],[59,9,59,12],[59,13,59,16],[61,5,61,8],[61,9,61,12],[61,13,61,16],[56,1,58,2],[56,3,58,3],[56,4,58,4],[56,5,56,8],[56,9,56,12],[56,13,56,16],[58,5,58,8],[58,9,58,12],[58,13,58,16],[53,1,55,2],[53,3,55,3],[53,4,55,4],[53,5,53,8],[53,9,53,12],[53,13,53,16],[55,5,55,8],[55,9,55,12],[55,13,55,16],[50,1,52,2],[50,3,52,3],[50,4,52,4],[50,5,50,8],[50,9,50,12],[50,13,50,16],[52,5,52,8],[52,9,52,12],[52,13,52,16],[47,1,49,2],[47,3,49,3],[47,4,49,4],[47,5,47,8],[47,9,47,12],[47,13,47,16],[49,5,49,8],[49,9,49,12],[49,13,49,16],[44,1,46,2],[44,3,46,3],[44,4,46,4],[44,5,44,8],[44,9,44,12],[44,13,44,16],[46,5,46,8],[46,9,46,12],[46,13,46,16],[41,1,43,2],[41,3,43,3],[41,4,43,4],[41,5,41,8],[41,9,41,12],[41,13,41,16],[43,5,43,8],[43,9,43,12],[43,13,43,16],[38,1,40,2],[38,3,40,3],[38,4,40,4],[38,5,38,8],[38,9,38,12],[38,13,38,16],[40,5,40,8],[40,9,40,12],[40,13,40,16],[35,1,37,2],[35,3,37,3],[35,4,37,4],[35,5,35,8],[35,9,35,12],[35,13,35,16],[37,5,37,8],[37,9,37,12],[37,13,37,16],[32,1,34,2],[32,3,34,3],[32,4,34,4],[32,5,32,8],[32,9,32,12],[32,13,32,16],[34,5,34,8],[34,9,34,12],[34,13,34,16],[29,1,31,2],[29,3,31,3],[29,4,31,4],[29,5,29,8],[29,9,29,12],[29,13,29,16],[31,5,31,8],[31,9,31,12],[31,13,31,16],[26,1,28,2],[26,3,28,3],[26,4,28,4],[26,5,26,8],[26,9,26,12],[26,13,26,16],[28,5,28,8],[28,9,28,12],[28,13,28,16],[23,1,25,2],[23,3,25,3],[23,4,25,4],[23,5,23,8],[23,9,23,12],[23,13,23,16],[25,5,25,8],[25,9,25,12],[25,13,25,16],[20,1,22,2],[20,3,22,3],[20,4,22,4],[20,5,20,8],[20,9,20,12],[20,13,20,16],[22,5,22,8],[22,9,22,12],[22,13,22,16],[17,1,19,2],[17,3,19,3],[17,4,19,4],[17,5,17,8],[17,9,17,12],[17,13,17,16],[19,5,19,8],[19,9,19,12],[19,13,19,16],[14,1,16,2],[14,3,16,3],[14,4,16,4],[14,5,14,8],[14,9,14,12],[14,13,14,16],[16,5,16,8],[16,9,16,12],[16,13,16,16],[12,0,13,0],[12,3,13,3],[12,5,12,8],[12,9,12,12],[12,13,12,16],[12,17,13,17],[13,1,13,2],[13,5,13,8],[13,9,13,12],[13,13,13,16],[0,1,0,17],[1,1,1,17],[2,1,2,7],[2,8,2,17],[3,1,3,7],[3,8,3,17],[8,1,8,7],[8,8,8,17],[9,0,11,0],[9,1,9,7],[9,8,9,17],[10,1,10,17],[11,1,11,17],[4,1,4,17],[5,1,5,7],[5,8,5,17],[6,1,6,7],[6,8,6,17],[7,1,7,17]]}
[]
[]
[null,"UNIDADE ESCOLAR",null,null,null,null,null,null,"PRAZO"]
[null,{"$f":"Orçamento!O4","v":"COLÉGIO ESTADUAL OLYNTO PEREIRA DE CASTRO"},null,null,null,null,null,null,"75 DIAS CORRIDOS"]
[]
[null,"OBRA",null,null,null,null,null,null,"DATA"]
[null,{"$f":"Orçamento!O7","v":"REFORMA E AMPLIAÇÃO"},null,null,null,null,null,null,{"$f":"Orçamento!S7","v":"2020-06-18"}]
[]
[null,"LOCAL",null,null,null,null,null,null,"ÁREA TOTAL CONSTRUÍDA (M²)"]
["FILTRO",{"$f":"Orçamento!X7","v":"RIO VERDE"},null,null,null,null,null,null,{"$f":"Orçamento!X13","v":2251.75}]
[]
[null,"CRONOGRAMA - FÍSICO FINANCEIRO"]
["↓","CUSTO TOTAL:",{"$f":"D93","v":0},"VALOR","Dias:",25,null,null,null,50,null,null,null,75,null,null,null,"TOTAL"]
[null,"DESCRIÇÃO DOS SERVIÇOS",null,null,"%","1ª PARCELA",null,null,null,"2ª PARCELA",null,null,null,"3ª PARCELA"]
[{"$f":"IF(D15>0,\"F\",\"\")","v":""},"SERVIÇOS PRELIMINARES",null,{"$f":"Orçamento!X524","v":0},{"$f":"Orçamento!AA524","v":0},{"$f":"ROUND(F17*$D$15,2)","v":0},null,null,null,{"$f":"ROUND(J17*$D$15,2)","v":0},null,null,null,{"$f":"ROUND(N17*$D$15,2)","v":0},null,null,null,{"$f":"SUM(F15:Q15)","v":0},null,{"$f":"IF(D15=R15,\"OK\",\"ERRO\")","v":"OK"}]
[{"$f":"IF(A15=\"F\",A15,\"\")","v":""}]
[{"$f":"IF(A16=\"F\",A16,\"\")","v":""},null,null,null,null,1,null,null,null,0,null,null,null,{"$f":"1-F17-J17","v":0},null,null,null,{"$f":"IFERROR(E15/100,\"\")","v":0},null,{"$f":"IF(E15=R17*100,\"OK\",\"ERRO\")","v":"OK"}]
[{"$f":"IF(D18>0,\"F\",\"\")","v":""},"TRANSPORTES",null,{"$f":"Orçamento!X525","v":0},{"$f":"Orçamento!AA525","v":0},{"$f":"ROUND(F20*$D$18,2)","v":0},null,null,null,{"$f":"ROUND(J20*$D$18,2)","v":0},null,null,null,{"$f":"ROUND(N20*$D$18,2)","v":0},null,null,null,{"$f":"SUM(F18:Q18)","v":0},null,{"$f":"IF(D18=R18,\"OK\",\"ERRO\")","v":"OK"}]
[{"$f":"IF(A18=\"F\",A18,\"\")","v":""}]
[{"$f":"IF(A19=\"F\",A19,\"\")","v":""},null,null,null,null,0.33165,null,null,null,{"$f":"F20","v":0.33165},null,null,null,{"$f":"1-(F20+J20)","v":0.3367},null,null,null,{"$f":"IFERROR(E18/100,\"\")","v":0},null,{"$f":"IF(E18=R20*100,\"OK\",\"ERRO\")","v":"OK"}]
[{"$f":"IF(D21>0,\"F\",\"\")","v":""},"SERVIÇO EM TERRA",null,{"$f":"Orçamento!X526","v":0},{"$f":"Orçamento!AA526","v":0},{"$f":"ROUND(F23*$D$21,2)","v":0},null,null,null,{"$f":"ROUND(J23*$D$21,2)","v":0},null,null,null,{"$f":"ROUND(N23*$D$21,2)","v":0},null,null,null,{"$f":"SUM(F21:Q21)","v":0},null,{"$f":"IF(D21=R21,\"OK\",\"ERRO\")","v":"OK"}]
[{"$f":"IF(A21=\"F\",A21,\"\")","v":""}]
[{"$f":"IF(A22=\"F\",A22,\"\")","v":""},null,null,null,null,1,null,null,null,0,null,null,null,{"$f":"1-F23-J23","v":0},null,null,null,{"$f":"IFERROR(E21/100,\"\")","v":0},null,{"$f":"IF(E21=R23*100,\"OK\",\"ERRO\")","v":"OK"}]
[{"$f":"IF(D24>0,\"F\",\"\")","v":""},"FUNDAÇÕES E SONDAGENS",null,{"$f":"Orçamento!X527","v":0},{"$f":"Orçamento!AA527","v":0},{"$f":"ROUND(F26*$D$24,2)","v":0},null,null,null,{"$f":"ROUND(J26*$D$24,2)","v":0},null,null,null,{"$f":"ROUND(N26*$D$24,2)","v":0},null,null,null,{"$f":"SUM(F24:Q24)","v":0},null,{"$f":"IF(D24=R24,\"OK\",\"ERRO\")","v":"OK"}]
[{"$f":"IF(A24=\"F\",A24,\"\")","v":""}]
[{"$f":"IF(A25=\"F\",A25,\"\")","v":""},null,null,null,null,1,null,null,null,0,null,null,null,{"$f":"1-F26-J26","v":0},null,null,null,{"$f":"IFERROR(E24/100,\"\")","v":0},null,{"$f":"IF(E24=R26*100,\"OK\",\"ERRO\")","v":"OK"}]
[{"$f":"IF(D27>0,\"F\",\"\")","v":""},"ESTRUTURA",null,{"$f":"Orçamento!X528","v":0},{"$f":"Orçamento!AA528","v":0},{"$f":"ROUND(F29*$D$27,2)","v":0},null,null,null,{"$f":"ROUND(J29*$D$27,2)","v":0},null,null,null,{"$f":"ROUND(N29*$D$27,2)","v":0},null,null,null,{"$f":"SUM(F27:Q27)","v":0},null,{"$f":"IF(D27=R27,\"OK\",\"ERRO\")","v":"OK"}]
[{"$f":"IF(A27=\"F\",A27,\"\")","v":""}]
[{"$f":"IF(A28=\"F\",A28,\"\")","v":""},null,null,null,null,0.54,null,null,null,0.46,null,null,null,{"$f":"1-F29-J29","v":0},null,null,null,{"$f":"IFERROR(E27/100,\"\")","v":0},null,{"$f":"IF(E27=R29*100,\"OK\",\"ERRO\")","v":"OK"}]
[{"$f":"IF(D30>0,\"F\",\"\")","v":""},"INST.ELET/TELEFÔNICA/CABEAMENTO ESTRUTURADO",null,{"$f":"Orçamento!X529","v":0},{"$f":"Orçamento!AA529","v":0},{"$f":"ROUND(F32*$D$30,2)","v":0},null,null,null,{"$f":"ROUND(J32*$D$30,2)","v":0},null,null,null,{"$f":"ROUND(N32*$D$30,2)","v":0},null,null,null,{"$f":"SUM(F30:Q30)","v":0},null,{"$f":"IF(D30=R30,\"OK\",\"ERRO\")","v":"OK"}]
[{"$f":"IF(A30=\"F\",A30,\"\")","v":""}]
[{"$f":"IF(A31=\"F\",A31,\"\")","v":""},null,null,null,null,0.3,null,null,null,0.7,null,null,null,{"$f":"1-F32-J32","v":0},null,null,null,{"$f":"IFERROR(E30/100,\"\")","v":0},null,{"$f":"IF(E30=R32*100,\"OK\",\"ERRO\")","v":"OK"}]
[{"$f":"IF(D33>0,\"F\",\"\")","v":""},"INSTALAÇÕES HIDROSSANITÁRIAS",null,{"$f":"Orçamento!X530","v":0},{"$f":"Orçamento!AA530","v":0},{"$f":"ROUND(F35*$D$33,2)","v":0},null,null,null,{"$f":"ROUND(J35*$D$33,2)","v":0},null,null,null,{"$f":"ROUND(N35*$D$33,2)","v":0},null,null,null,{"$f":"SUM(F33:Q33)","v":0},null,{"$f":"IF(D33=R33,\"OK\",\"ERRO\")","v":"OK"}]
[{"$f":"IF(A33=\"F\",A33,\"\")","v":""}]
[{"$f":"IF(A34=\"F\",A34,\"\")","v":""},null,null,null,null,0.3,null,null,null,0.7,null,null,null,{"$f":"1-F35-J35","v":0},null,null,null,{"$f":"IFERROR(E33/100,\"\")","v":0},null,{"$f":"IF(E33=R35*100,\"OK\",\"ERRO\")","v":"OK"}]
[{"$f":"IF(D36>0,\"F\",\"\")","v":""},"INSTALAÇÕES ESPECIAIS",null,{"$f":"Orçamento!X531","v":0},{"$f":"Orçamento!AA531","v":0},{"$f":"ROUND(F38*$D$36,2)","v":0},null,null,null,{"$f":"ROUND(J38*$D$36,2)","v":0},null,null,null,{"$f":"ROUND(N38*$D$36,2)","v":0},null,null,null,{"$f":"SUM(F36:Q36)","v":0},null,{"$f":"IF(D36=R36,\"OK\",\"ERRO\")","v":"OK"}]
[{"$f":"IF(A36=\"F\",A36,\"\")","v":""}]
[{"$f":"IF(A37=\"F\",A37,\"\")","v":""},null,null,null,null,0.3,null,null,null,0.7,null,null,null,{"$f":"1-F38-J38","v":0},null,null,null,{"$f":"IFERROR(E36/100,\"\")","v":0},null,{"$f":"IF(E36=R38*100,\"OK\",\"ERRO\")","v":"OK"}]
[{"$f":"IF(D39>0,\"F\",\"\")","v":""},"ALVENARIA E DIVISÓRIAS",null,{"$f":"Orçamento!X532","v":0},{"$f":"Orçamento!AA532","v":0},{"$f":"ROUND(F41*$D$39,2)","v":0},null,null,null,{"$f":"ROUND(J41*$D$39,2)","v":0},null,null,null,{"$f":"ROUND(N41*$D$39,2)","v":0},null,null,null,{"$f":"SUM(F39:Q39)","v":0},null,{"$f":"IF(D39=R39,\"OK\",\"ERRO\")","v":"OK"}]
[{"$f":"IF(A39=\"F\",A39,\"\")","v":""}]
[{"$f":"IF(A40=\"F\",A40,\"\")","v":""},null,null,null,null,0.3,null,null,null,0.7,null,null,null,{"$f":"1-F41-J41","v":0},null,null,null,{"$f":"IFERROR(E39/100,\"\")","v":0},null,{"$f":"IF(E39=R41*100,\"OK\",\"ERRO\")","v":"OK"}]
[{"$f":"IF(D42>0,\"F\",\"\")","v":""},"ALVENARIA AUTO-PORTANTE",null,{"$f":"Orçamento!X533","v":0},{"$f":"Orçamento!AA533","v":0},{"$f":"ROUND(F44*$D$42,2)","v":0},null,null,null,{"$f":"ROUND(J44*$D$42,2)","v":0},null,null,null,{"$f":"ROUND(N44*$D$42,2)","v":0},null,null,null,{"$f":"SUM(F42:Q42)","v":0},null,{"$f":"IF(D42=R42,\"OK\",\"ERRO\")","v":"OK"}]
[{"$f":"IF(A42=\"F\",A42,\"\")","v":""}]
[{"$f":"IF(A43=\"F\",A43,\"\")","v":""},null,null,null,null,0,null,null,null,{"$f":"1-B44","v":1},null,null,null,{"$f":"1-F44-J44","v":0},null,null,null,{"$f":"IFERROR(E42/100,\"\")","v":0},null,{"$f":"IF(E42=R44*100,\"OK\",\"ERRO\")","v":"OK"}]
[{"$f":"IF(D45>0,\"F\",\"\")","v":""},"IMPERMEABILIZAÇÃO",null,{"$f":"Orçamento!X534","v":0},{"$f":"Orçamento!AA534","v":0},{"$f":"ROUND(F47*$D$45,2)","v":0},null,null,null,{"$f":"ROUND(J47*$D$45,2)","v":0},null,null,null,{"$f":"ROUND(N47*$D$45,2)","v":0},null,null,null,{"$f":"SUM(F45:Q45)","v":0},null,{"$f":"IF(D45=R45,\"OK\",\"ERRO\")","v":"OK"}]
[{"$f":"IF(A45=\"F\",A45,\"\")","v":""}]
[{"$f":"IF(A46=\"F\",A46,\"\")","v":""},null,null,null,null,0.85,null,null,null,0.15,null,null,null,{"$f":"1-F47-J47","v":0},null,null,null,{"$f":"IFERROR(E45/100,\"\")","v":0},null,{"$f":"IF(E45=R47*100,\"OK\",\"ERRO\")","v":"OK"}]
[{"$f":"IF(D48>0,\"F\",\"\")","v":""},"ISOLAMENTO TÉRMICO E ACÚSTICO",null,{"$f":"Orçamento!X535","v":0},{"$f":"Orçamento!AA535","v":0},{"$f":"ROUND(F50*$D$48,2)","v":0},null,null,null,{"$f":"ROUND(J50*$D$48,2)","v":0},null,null,null,{"$f":"ROUND(N50*$D$48,2)","v":0},null,null,null,{"$f":"SUM(F48:Q48)","v":0},null,{"$f":"IF(D48=R48,\"OK\",\"ERRO\")","v":"OK"}]
[{"$f":"IF(A48=\"F\",A48,\"\")","v":""}]
[{"$f":"IF(A49=\"F\",A49,\"\")","v":""},null,null,null,null,0,null,null,null,{"$f":"1-B50","v":1},null,null,null,{"$f":"1-F50-J50","v":0},null,null,null,{"$f":"IFERROR(E48/100,\"\")","v":0},null,{"$f":"IF(E48=R50*100,\"OK\",\"ERRO\")","v":"OK"}]
[{"$f":"IF(D51>0,\"F\",\"\")","v":""},"ESTRUTURA DE MADEIRA",null,{"$f":"Orçamento!X536","v":0},{"$f":"Orçamento!AA536","v":0},{"$f":"ROUND(F53*$D$51,2)","v":0},null,null,null,{"$f":"ROUND(J53*$D$51,2)","v":0},null,null,null,{"$f":"ROUND(N53*$D$51,2)","v":0},null,null,null,{"$f":"SUM(F51:Q51)","v":0},null,{"$f":"IF(D51=R51,\"OK\",\"ERRO\")","v":"OK"}]
[{"$f":"IF(A51=\"F\",A51,\"\")","v":""}]
[{"$f":"IF(A52=\"F\",A52,\"\")","v":""},null,null,null,null,0,null,null,null,0.57999999999999996,null,null,null,{"$f":"1-F53-J53","v":0.42000000000000004},null,null,null,{"$f":"IFERROR(E51/100,\"\")","v":0},null,{"$f":"IF(E51=R53*100,\"OK\",\"ERRO\")","v":"OK"}]
[{"$f":"IF(D54>0,\"F\",\"\")","v":""},"ESTRUTURA METÁLICA",null,{"$f":"Orçamento!X537","v":0},{"$f":"Orçamento!AA537","v":0},{"$f":"ROUND(F56*$D$54,2)","v":0},null,null,null,{"$f":"ROUND(J56*$D$54,2)","v":0},null,null,null,{"$f":"ROUND(N56*$D$54,2)","v":0},null,null,null,{"$f":"SUM(F54:Q54)","v":0},null,{"$f":"IF(D54=R54,\"OK\",\"ERRO\")","v":"OK"}]
[{"$f":"IF(A54=\"F\",A54,\"\")","v":""}]
[{"$f":"IF(A55=\"F\",A55,\"\")","v":""},null,null,null,null,0,null,null,null,0.57999999999999996,null,null,null,{"$f":"1-F56-J56","v":0.42000000000000004},null,null,null,{"$f":"IFERROR(E54/100,\"\")","v":0},null,{"$f":"IF(E54=R56*100,\"OK\",\"ERRO\")","v":"OK"}]
[{"$f":"IF(D57>0,\"F\",\"\")","v":""},"COBERTURAS",null,{"$f":"Orçamento!X538","v":0},{"$f":"Orçamento!AA538","v":0},{"$f":"ROUND(F59*$D$57,2)","v":0},null,null,null,{"$f":"ROUND(J59*$D$57,2)","v":0},null,null,null,{"$f":"ROUND(N59*$D$57,2)","v":0},null,null,null,{"$f":"SUM(F57:Q57)","v":0},null,{"$f":"IF(D57=R57,\"OK\",\"ERRO\")","v":"OK"}]
[{"$f":"IF(A57=\"F\",A57,\"\")","v":""}]
[{"$f":"IF(A58=\"F\",A58,\"\")","v":""},null,null,null,null,0,null,null,null,0,null,null,null,{"$f":"1-F59-J59","v":1},null,null,null,{"$f":"IFERROR(E57/100,\"\")","v":0},null,{"$f":"IF(E57=R59*100,\"OK\",\"ERRO\")","v":"OK"}]
[{"$f":"IF(D60>0,\"F\",\"\")","v":""},"ESQUADRIAS DE MADEIRA",null,{"$f":"Orçamento!X539","v":0},{"$f":"Orçamento!AA539","v":0},{"$f":"ROUND(F62*$D$60,2)","v":0},null,null,null,{"$f":"ROUND(J62*$D$60,2)","v":0},null,null,null,{"$f":"ROUND(N62*$D$60,2)","v":0},null,null,null,{"$f":"SUM(F60:Q60)","v":0},null,{"$f":"IF(D60=R60,\"OK\",\"ERRO\")","v":"OK"}]
[{"$f":"IF(A60=\"F\",A60,\"\")","v":""}]
[{"$f":"IF(A61=\"F\",A61,\"\")","v":""},null,null,null,null,0,null,null,null,0.4,null,null,null,{"$f":"1-F62-J62","v":0.6},null,null,null,{"$f":"IFERROR(E60/100,\"\")","v":0},null,{"$f":"IF(E60=R62*100,\"OK\",\"ERRO\")","v":"OK"}]
[{"$f":"IF(D63>0,\"F\",\"\")","v":""},"ESQUADRIAS METÁLICAS",null,{"$f":"Orçamento!X540","v":0},{"$f":"Orçamento!AA540","v":0},{"$f":"ROUND(F65*$D$63,2)","v":0},null,null,null,{"$f":"ROUND(J65*$D$63,2)","v":0},null,null,null,{"$f":"ROUND(N65*$D$63,2)","v":0},null,null,null,{"$f":"SUM(F63:Q63)","v":0},null,{"$f":"IF(D63=R63,\"OK\",\"ERRO\")","v":"OK"}]
[{"$f":"IF(A63=\"F\",A63,\"\")","v":""}]
[{"$f":"IF(A64=\"F\",A64,\"\")","v":""},null,null,null,null,0,null,null,null,0.44,null,null,null,{"$f":"1-J65","v":0.56000000000000005},null,null,null,{"$f":"IFERROR(E63/100,\"\")","v":0},null,{"$f":"IF(E63=R65*100,\"OK\",\"ERRO\")","v":"OK"}]
[{"$f":"IF(D66>0,\"F\",\"\")","v":""},"VIDROS",null,{"$f":"Orçamento!X541","v":0},{"$f":"Orçamento!AA541","v":0},{"$f":"ROUND(F68*$D$66,2)","v":0},null,null,null,{"$f":"ROUND(J68*$D$66,2)","v":0},null,null,null,{"$f":"ROUND(N68*$D$66,2)","v":0},null,null,null,{"$f":"SUM(F66:Q66)","v":0},null,{"$f":"IF(D66=R66,\"OK\",\"ERRO\")","v":"OK"}]
[{"$f":"IF(A66=\"F\",A66,\"\")","v":""}]
[{"$f":"IF(A67=\"F\",A67,\"\")","v":""},null,null,null,null,0,null,null,null,0,null,null,null,{"$f":"1-F68-J68","v":1},null,null,null,{"$f":"IFERROR(E66/100,\"\")","v":0},null,{"$f":"IF(E66=R68*100,\"OK\",\"ERRO\")","v":"OK"}]
[{"$f":"IF(D69>0,\"F\",\"\")","v":""},"REVESTIMENTO DE PAREDE",null,{"$f":"Orçamento!X542","v":0},{"$f":"Orçamento!AA542","v":0},{"$f":"ROUND(F71*$D$69,2)","v":0},null,null,null,{"$f":"ROUND(J71*$D$69,2)","v":0},null,null,null,{"$f":"ROUND(N71*$D$69,2)","v":0},null,null,null,{"$f":"SUM(F69:Q69)","v":0},null,{"$f":"IF(D69=R69,\"OK\",\"ERRO\")","v":"OK"}]
[{"$f":"IF(A69=\"F\",A69,\"\")","v":""}]
[{"$f":"IF(A70=\"F\",A70,\"\")","v":""},null,null,null,null,0,null,null,null,0.4,null,null,null,{"$f":"1-F71-J71","v":0.6},null,null,null,{"$f":"IFERROR(E69/100,\"\")","v":0},null,{"$f":"IF(E69=R71*100,\"OK\",\"ERRO\")","v":"OK"}]
[{"$f":"IF(D72>0,\"F\",\"\")","v":""},"FORROS",null,{"$f":"Orçamento!X543","v":0},{"$f":"Orçamento!AA543","v":0},{"$f":"ROUND(F74*$D$72,2)","v":0},null,null,null,{"$f":"ROUND(J74*$D$72,2)","v":0},null,null,null,{"$f":"ROUND(N74*$D$72,2)","v":0},null,null,null,{"$f":"SUM(F72:Q72)","v":0},null,{"$f":"IF(D72=R72,\"OK\",\"ERRO\")","v":"OK"}]
[{"$f":"IF(A72=\"F\",A72,\"\")","v":""}]
[{"$f":"IF(A73=\"F\",A73,\"\")","v":""},null,null,null,null,0,null,null,null,0.4,null,null,null,{"$f":"1-F74-J74","v":0.6},null,null,null,{"$f":"IFERROR(E72/100,\"\")","v":0},null,{"$f":"IF(E72=R74*100,\"OK\",\"ERRO\")","v":"OK"}]
[{"$f":"IF(D75>0,\"F\",\"\")","v":""},"REVESTIMENTO DE PISO",null,{"$f":"Orçamento!X544","v":0},{"$f":"Orçamento!AA544","v":0},{"$f":"ROUND(F77*$D$75,2)","v":0},null,null,null,{"$f":"ROUND(J77*$D$75,2)","v":0},null,null,null,{"$f":"ROUND(N77*$D$75,2)","v":0},null,null,null,{"$f":"SUM(F75:Q75)","v":0},null,{"$f":"IF(D75=R75,\"OK\",\"ERRO\")","v":"OK"}]
[{"$f":"IF(A75=\"F\",A75,\"\")","v":""}]
[{"$f":"IF(A76=\"F\",A76,\"\")","v":""},null,null,null,null,0,null,null,null,0.4,null,null,null,{"$f":"1-F77-J77","v":0.6},null,null,null,{"$f":"IFERROR(E75/100,\"\")","v":0},null,{"$f":"IF(E75=R77*100,\"OK\",\"ERRO\")","v":"OK"}]
[{"$f":"IF(D78>0,\"F\",\"\")","v":""},"FERRAGENS",null,{"$f":"Orçamento!X545","v":0},{"$f":"Orçamento!AA545","v":0},{"$f":"ROUND(F80*$D$78,2)","v":0},null,null,null,{"$f":"ROUND(J80*$D$78,2)","v":0},null,null,null,{"$f":"ROUND(N80*$D$78,2)","v":0},null,null,null,{"$f":"SUM(F78:Q78)","v":0},null,{"$f":"IF(D78=R78,\"OK\",\"ERRO\")","v":"OK"}]
[{"$f":"IF(A78=\"F\",A78,\"\")","v":""}]
[{"$f":"IF(A79=\"F\",A79,\"\")","v":""},null,null,null,null,0,null,null,null,0,null,null,null,{"$f":"1-F80-J80","v":1},null,null,null,{"$f":"IFERROR(E78/100,\"\")","v":0},null,{"$f":"IF(E78=R80*100,\"OK\",\"ERRO\")","v":"OK"}]
[{"$f":"IF(D81>0,\"F\",\"\")","v":""},"MARCENARIA",null,{"$f":"Orçamento!X546","v":0},{"$f":"Orçamento!AA546","v":0},{"$f":"ROUND(F83*$D$81,2)","v":0},null,null,null,{"$f":"ROUND(J83*$D$81,2)","v":0},null,null,null,{"$f":"ROUND(N83*$D$81,2)","v":0},null,null,null,{"$f":"SUM(F81:Q81)","v":0},null,{"$f":"IF(D81=R81,\"OK\",\"ERRO\")","v":"OK"}]
[{"$f":"IF(A81=\"F\",A81,\"\")","v":""}]
[{"$f":"IF(A82=\"F\",A82,\"\")","v":""},null,null,null,null,0,null,null,null,0,null,null,null,{"$f":"1-F83-J83","v":1},null,null,null,{"$f":"IFERROR(E81/100,\"\")","v":0},null,{"$f":"IF(E81=R83*100,\"OK\",\"ERRO\")","v":"OK"}]
[{"$f":"IF(D84>0,\"F\",\"\")","v":""},"ADMINISTRAÇÃO - MENSALISTAS",null,{"$f":"Orçamento!X547","v":0},{"$f":"Orçamento!AA547","v":0},{"$f":"ROUND(F86*$D$84,2)","v":0},null,null,null,{"$f":"ROUND(J86*$D$84,2)","v":0},null,null,null,{"$f":"ROUND(N86*$D$84,2)","v":0},null,null,null,{"$f":"SUM(F84:Q84)","v":0},null,{"$f":"IF(D84=R84,\"OK\",\"ERRO\")","v":"OK"}]
[{"$f":"IF(A84=\"F\",A84,\"\")","v":""}]
[{"$f":"IF(A85=\"F\",A85,\"\")","v":""},null,null,null,null,0.33835000000000004,null,null,null,{"$f":"F86","v":0.33835000000000004},null,null,null,{"$f":"1-(F86+J86)","v":0.32329999999999992},null,null,null,{"$f":"IFERROR(E84/100,\"\")","v":0},null,{"$f":"IF(E84=R86*100,\"OK\",\"ERRO\")","v":"OK"}]
[{"$f":"IF(D87>0,\"F\",\"\")","v":""},"PINTURA",null,{"$f":"Orçamento!X548","v":0},{"$f":"Orçamento!AA548","v":0},{"$f":"ROUND(F89*$D$87,2)","v":0},null,null,null,{"$f":"ROUND(J89*$D$87,2)","v":0},null,null,null,{"$f":"ROUND(N89*$D$87,2)","v":0},null,null,null,{"$f":"SUM(F87:Q87)","v":0},null,{"$f":"IF(D87=R87,\"OK\",\"ERRO\")","v":"OK"}]
[{"$f":"IF(A87=\"F\",A87,\"\")","v":""}]
[{"$f":"IF(A88=\"F\",A88,\"\")","v":""},null,null,null,null,0,null,null,null,0,null,null,null,{"$f":"1-F89-J89","v":1},null,null,null,{"$f":"IFERROR(E87/100,\"\")","v":0},null,{"$f":"IF(E87=R89*100,\"OK\",\"ERRO\")","v":"OK"}]
[{"$f":"IF(D90>0,\"F\",\"\")","v":""},"DIVERSOS",null,{"$f":"Orçamento!X549","v":0},{"$f":"Orçamento!AA549","v":0},{"$f":"ROUND(F92*$D$90,2)","v":0},null,null,null,{"$f":"ROUND(J92*$D$90,2)","v":0},null,null,null,{"$f":"ROUND(N92*$D$90,2)","v":0},null,null,null,{"$f":"SUM(F90:Q90)","v":0},null,{"$f":"IF(D90=R90,\"OK\",\"ERRO\")","v":"OK"}]
[{"$f":"IF(A90=\"F\",A90,\"\")","v":""}]
[{"$f":"IF(A91=\"F\",A91,\"\")","v":""},null,null,null,null,0,null,null,null,0,null,null,null,{"$f":"1-F92-J92","v":1},null,null,null,{"$f":"IFERROR(E90/100,\"\")","v":0},null,{"$f":"IF(E90=R92*100,\"OK\",\"ERRO\")","v":"OK"}]
["F","CUSTO DO ORÇAMENTO",null,{"$f":"SUM(D15:D92)","v":0},{"$f":"SUM(E15:E92)","v":0},{"$f":"F15+F18+F21+F24+F27+F30+F33+F36+F39+F42+F45+F48+F51+F54+F57+F60+F63+F66+F69+F72+F75+F78+F81+F84+F87+F90","v":0},null,null,null,{"$f":"J15+J18+J21+J24+J27+J30+J33+J36+J39+J42+J45+J48+J51+J54+J57+J60+J63+J66+J69+J72+J75+J78+J81+J84+J87+J90","v":0},null,null,null,{"$f":"N15+N18+N21+N24+N27+N30+N33+N36+N39+N42+N45+N48+N51+N54+N57+N60+N63+N66+N69+N72+N75+N78+N81+N84+N87+N90","v":0},null,null,null,{"$f":"R15+R18+R21+R24+R27+R30+R33+R36+R39+R42+R45+R48+R51+R54+R57+R60+R63+R66+R69+R72+R75+R78+R81+R84+R87+R90","v":0}]
["F","PERCENTUAIS:",null,null,null,{"$f":"IFERROR(F93/D93,\"\")","v":""},null,null,null,{"$f":"IFERROR(J93/D93,\"\")","v":""},null,null,null,{"$f":"IFERROR(N93/D93,\"\")","v":""},null,null,null,{"$f":"SUM(F94:Q94)","v":0}]
["F","TOTAIS ACUMULADOS:",null,null,null,{"$f":"F93","v":0},null,null,null,{"$f":"F95+J93","v":0},null,null,null,{"$f":"J95+N93","v":0},null,null,null,null,null,null,null,{"$f":"18.37+31.71+49.92","v":100}]
["F","PERCENTUAIS  ACUMULADOS:",null,null,null,{"$f":"F94","v":""},null,null,null,{"$f":"J94+F96","v":{"$error":"#VALUE!"}},null,null,null,{"$f":"IFERROR(J96+N94,\"\")","v":""}]
["F"]
["F","OBSERVAÇÕES:"]
["F","Os pagamentos somente poderão ser efetuados mediante medição e atesto pelos técnicos da Secretaria da Educação. "]

{"sheet":"Composição BDI","index":4,"n_rows":45,"n_cols":9,"rows_kept":45,"cut":false,"hidden":false,"merged":[[12,0,12,3],[13,0,13,3],[14,0,14,3],[15,0,15,3],[6,0,6,3],[8,0,8,3],[7,0,7,3],[9,0,9,3],[11,0,11,3],[10,0,10,3],[0,0,0,3],[2,0,2,3],[3,0,3,3],[1,0,1,3],[5,0,5,3],[4,0,4,3],[18,5,18,8],[17,0,17,3],[16,0,16,3],[44,0,44,3],[42,0,42,3],[43,0,43,3],[18,0,18,3],[36,0,36,3],[39,0,39,3],[38,0,38,3],[40,0,40,3],[29,0,29,2],[32,0,32,3],[33,0,33,3],[34,0,34,3],[35,0,35,3]]}
[]
[]
["UNIDADE ESCOLAR"]
[{"$f":"Orçamento!$O$4","v":"COLÉGIO ESTADUAL OLYNTO PEREIRA DE CASTRO"}]
[]
["OBRA"]
[{"$f":"Orçamento!$O$7","v":"REFORMA E AMPLIAÇÃO"}]
[]
["ENDEREÇO"]
[{"$f":"Orçamento!$R$10","v":" RUA JUCA BAILAO SN , SETOR MORADA DO SOL , CEP:75909-050"}]
[]
["CIDADE"]
[{"$f":"Orçamento!$X$7","v":"RIO VERDE"}]
[]
["CRE"]
[{"$f":"Orçamento!$O$10","v":"CRE-RIO VERDE"}]
[]
["DETALHAMENTO DA COMPOSIÇÃO DE BDI"]
["COMPOSIÇÃO BDI PARA OBRAS CIVIS",null,null,null,null,"BDI CONSTRUÇÃO E REFORMA"]
["DESCRIÇÃO","COEF.","TAXA % (a.m)","% no preço de venda",null,"Situação","1º Quartil","Médio","3º Quartil"]
["1) COFINS",1,0.03,0.03,null,{"$f":"IF(OR(C21<G21,C21>I21),\"FORA DO INTERVALO\",\"OK\")","v":"OK"},0.03,0.03,0.03]
["2) PIS",1,6.4999999999999997E-3,6.4999999999999997E-3,null,{"$f":"IF(OR(C22<G22,C22>I22),\"FORA DO INTERVALO\",\"OK\")","v":"OK"},6.4999999999999997E-3,6.4999999999999997E-3,6.4999999999999997E-3]
["3) ISSQN",1,2.5000000000000001E-2,2.5000000000000001E-2,null,"OK",0.02,3.5000000000000003E-2,0.05]
["4) CPRB",1,4.4999999999999998E-2,4.4999999999999998E-2,null,"OK",4.4999999999999998E-2,4.4999999999999998E-2,4.4999999999999998E-2]
["5) Administração Central",1,0.04,0.04,null,"OK",0.03,0.04,5.5E-2]
["6) Despesas Financeiras",1,5.5999999999999999E-3,5.5999999999999999E-3,null,"FORA DO INTERVALO",5.8999999999999999E-3,1.23E-2,1.3899999999999999E-2]
["7) Seguros + Garantias",1,1.1999999999999999E-3,1.1999999999999999E-3,null,"FORA DO INTERVALO",8.0000000000000002E-3,8.0000000000000002E-3,0.01]
["8) Risco",1,9.7000000000000003E-3,9.7000000000000003E-3,null,"OK",9.7000000000000003E-3,1.2699999999999999E-2,1.2699999999999999E-2]
["9) Lucro",1,6.8709999999999993E-2,6.8709999999999993E-2,null,"OK",6.1600000000000002E-2,7.3999999999999996E-2,8.9599999999999999E-2]
["BDI - FINAL",null,null,0.26401425864398487,null,{"$f":"IF(OR(D30<G30,D30>I30),\"FORA DO INTERVALO\",\"OK\")","v":"FORA DO INTERVALO"},0.2034,0.22120000000000001,0.25]
[]
["Notas:"]
["(1) e (2) Alíquota definida por lei."]
["(3) Alíquota e base de cálculo definidas pela legislação municipal."]
["(4) Alíquota definida pelas leis 12.546/11, 12844/13 e 13.161/15 (CPRB – contribuição previdenciária sobre a receita bruta)."]
["(5) Valores definidos a partir dos limites no Acórdão nº 2.622/2013 - TCU – Plenário. Valores entre o 1º e 3º quartis."]
["(6) Valor calculado pela expressão matemática do acórdão 2.369/2011 – TCU – Plenário e disponibilizado pela AGETOP em dezembro de 2018. (Foi utilizado para o cálculo a média da Taxa SELIC no período de 11/2017 a 10/2018)"]
[]
["(7) Valores definidos pela AGETOP a partir dos limites no Acórdão nº 2.622/2013 - TCU – Plenário. Valores médios. \n\nObservação da AGETOP: (Seguros contra erros de execução, incêndio e explosão, danos da natureza (vendaval, destelhamento, alagamento, inundação, desmoronamento, geadas etc.), emprego de material defeituoso ou inadequado, roubo e/ou furto qualificado, quebra de equipamentos, desmoronamento de estrutura, nas modalidades de Obras Civis em Construção (OCC); Instalação e Montagem (IM); e Obras Civis em Construção e Instalação e Montagem (OCC/IM). Bem como coberturas adicionais para ampliação dessas coberturas básicas, como: cobertura de responsabilidade civil geral, cobertura de responsabilidade civil cruzada, cobertura de despesas extraordinárias, cobertura de tumultos, cobertura de desentulho do local, cobertura de riscos do fabricante, dentre outras, incluindo o seguro de vida em grupo regido pela convenção coletiva dos trabalhadores na indústria da construção civil). A partir de 24/02/2015 por intermédio da Portaria 449/2015 a Presidência da AGETOP, na pessoa do Senhor Jayme Eduardo Rincon, determinou a exclusão dos valores referentes aos Seguros de Risco de Engenharia e Responsabilidade Civil do Profissional na composição do cálculo do B.D.I.."]
["(8) Valores definidos a partir dos limites no Acórdão nº 2.622/2013 - TCU – Plenário. Valores entre 1º e 3° quartis."]
["(9) Valores definidos a partir dos limites definidos no Acórdão nº 2.622/2013 - TCU – Plenário. Valores adotados e praticados no mercado ( “ ex ante ” ) ou aqueles entre os 1º e 3º quartis."]
[]
["(*) A fórmula para estipulação da taxa de BDI estimado adotado é a mesma que foi aplicada para a obtenção das tabelas contidas no Acórdão n. 2.622/2013 – TCUPlenário"]
[]
["Obs.: Para obras com valores superiores a R$ 20.000.000,00 sugere-se recalcular o BDI, dimensionando as taxas de administração central e lucro para patamares inferiores ao estipulado acima."]

{"sheet":"Relatório CENTRAL","index":5,"n_rows":40,"n_cols":5,"rows_kept":40,"cut":false,"hidden":false,"merged":[[8,1,8,2],[8,3,8,4],[9,1,9,2],[10,1,10,4],[11,1,11,4],[39,1,39,2],[9,0,11,0],[0,1,0,4],[6,3,6,4],[9,3,9,4],[1,1,1,4],[2,1,2,2],[2,3,2,4],[3,1,3,2],[3,3,3,4],[4,1,4,4],[5,1,5,2],[5,3,5,4],[6,1,6,2],[7,1,7,4]]}
[]
[]
[null,"UNIDADE ESCOLAR",null,"CIDADE"]
[null,{"$f":"Orçamento!$O$4","v":"COLÉGIO ESTADUAL OLYNTO PEREIRA DE CASTRO"},null,{"$f":"Orçamento!$X$7","v":"RIO VERDE"}]
[]
[null,"OBRA",null,"CRE"]
[null,{"$f":"Orçamento!$O$7","v":"REFORMA E AMPLIAÇÃO"},null,{"$f":"Orçamento!$O$10","v":"CRE-RIO VERDE"}]
[]
[null,"ENDEREÇO",null,"DATA"]
["FILTRO",{"$f":"Orçamento!$R$10","v":" RUA JUCA BAILAO SN , SETOR MORADA DO SOL , CEP:75909-050"},null,{"$f":"Orçamento!$S$7","v":"2020-06-18"}]
[]
[null,"RELATÓRIO CENTRAL"]
["↓","CÓDIGO","ETAPA","PREÇO  (R$) C/ BDI","PARTIC  ( % )"]
[{"$f":"IF(D14>0,\"F\",\"\")","v":""},{"$f":"Orçamento!O524","v":"a."},{"$f":"Orçamento!P524","v":"SERVIÇOS PRELIMINARES"},{"$f":"Orçamento!X524","v":0},{"$f":"Orçamento!AA524","v":0}]
[{"$f":"IF(D15>0,\"F\",\"\")","v":""},{"$f":"Orçamento!O525","v":"b."},{"$f":"Orçamento!P525","v":"TRANSPORTES"},{"$f":"Orçamento!X525","v":0},{"$f":"Orçamento!AA525","v":0}]
["",{"$f":"Orçamento!O526","v":"c."},{"$f":"Orçamento!P526","v":"SERVIÇO EM TERRA"},{"$f":"Orçamento!X526","v":0},{"$f":"Orçamento!AA526","v":0}]
["",{"$f":"Orçamento!O527","v":"d."},{"$f":"Orçamento!P527","v":"FUNDAÇÕES E SONDAGENS"},{"$f":"Orçamento!X527","v":0},{"$f":"Orçamento!AA527","v":0}]
["",{"$f":"Orçamento!O528","v":"e."},{"$f":"Orçamento!P528","v":"ESTRUTURA"},{"$f":"Orçamento!X528","v":0},{"$f":"Orçamento!AA528","v":0}]
["",{"$f":"Orçamento!O529","v":"f."},{"$f":"Orçamento!P529","v":"INSTALAÇÕES ELÉTRICAS"},{"$f":"Orçamento!X529","v":0},{"$f":"Orçamento!AA529","v":0}]
["",{"$f":"Orçamento!O530","v":"g."},{"$f":"Orçamento!P530","v":"INSTALAÇÕES HIDROSSANITÁRIAS"},{"$f":"Orçamento!X530","v":0},{"$f":"Orçamento!AA530","v":0}]
["",{"$f":"Orçamento!O531","v":"h"},{"$f":"Orçamento!P531","v":"INSTALAÇÕES ESPECIAIS"},{"$f":"Orçamento!X531","v":0},{"$f":"Orçamento!AA531","v":0}]
["",{"$f":"Orçamento!O532","v":"i."},{"$f":"Orçamento!P532","v":"ALVENARIAS E DIVISÓRIAS"},{"$f":"Orçamento!X532","v":0},{"$f":"Orçamento!AA532","v":0}]
["",{"$f":"Orçamento!O533","v":"j."},{"$f":"Orçamento!P533","v":"ALVENARIA AUTO-PORTANTE"},{"$f":"Orçamento!X533","v":0},{"$f":"Orçamento!AA533","v":0}]
["",{"$f":"Orçamento!O534","v":"k."},{"$f":"Orçamento!P534","v":"IMPERMEABILIZAÇÃO"},{"$f":"Orçamento!X534","v":0},{"$f":"Orçamento!AA534","v":0}]
["",{"$f":"Orçamento!O535","v":"l."},{"$f":"Orçamento!P535","v":"ISOLAMENTO TÉRMICO E ACÚSTICO"},{"$f":"Orçamento!X535","v":0},{"$f":"Orçamento!AA535","v":0}]
["",{"$f":"Orçamento!O536","v":"m."},{"$f":"Orçamento!P536","v":"ESTRUTURA DE MADEIRA"},{"$f":"Orçamento!X536","v":0},{"$f":"Orçamento!AA536","v":0}]
["",{"$f":"Orçamento!O537","v":"n."},{"$f":"Orçamento!P537","v":"ESTRUTURAS METÁLICAS"},{"$f":"Orçamento!X537","v":0},{"$f":"Orçamento!AA537","v":0}]
["",{"$f":"Orçamento!O538","v":"o."},{"$f":"Orçamento!P538","v":"COBERTURAS"},{"$f":"Orçamento!X538","v":0},{"$f":"Orçamento!AA538","v":0}]
["",{"$f":"Orçamento!O539","v":"p."},{"$f":"Orçamento!P539","v":"ESQUADRIAS DE MADEIRA"},{"$f":"Orçamento!X539","v":0},{"$f":"Orçamento!AA539","v":0}]
["",{"$f":"Orçamento!O540","v":"q."},{"$f":"Orçamento!P540","v":"ESQUADRIAS METÁLICAS"},{"$f":"Orçamento!X540","v":0},{"$f":"Orçamento!AA540","v":0}]
["",{"$f":"Orçamento!O541","v":"r."},{"$f":"Orçamento!P541","v":"VIDROS"},{"$f":"Orçamento!X541","v":0},{"$f":"Orçamento!AA541","v":0}]
["",{"$f":"Orçamento!O542","v":"s."},{"$f":"Orçamento!P542","v":"REVESTIMENTO DE PAREDE"},{"$f":"Orçamento!X542","v":0},{"$f":"Orçamento!AA542","v":0}]
["",{"$f":"Orçamento!O543","v":"t."},{"$f":"Orçamento!P543","v":"FORROS"},{"$f":"Orçamento!X543","v":0},{"$f":"Orçamento!AA543","v":0}]
["",{"$f":"Orçamento!O544","v":"u."},{"$f":"Orçamento!P544","v":"REVESTIMENTO DE PISO"},{"$f":"Orçamento!X544","v":0},{"$f":"Orçamento!AA544","v":0}]
["",{"$f":"Orçamento!O545","v":"v."},{"$f":"Orçamento!P545","v":"FERRAGENS"},{"$f":"Orçamento!X545","v":0},{"$f":"Orçamento!AA545","v":0}]
["",{"$f":"Orçamento!O546","v":"w."},{"$f":"Orçamento!P546","v":"MARCENARIA"},{"$f":"Orçamento!X546","v":0},{"$f":"Orçamento!AA546","v":0}]
["",{"$f":"Orçamento!O547","v":"x."},{"$f":"Orçamento!P547","v":"ADMINISTRAÇÃO"},{"$f":"Orçamento!X547","v":0},{"$f":"Orçamento!AA547","v":0}]
["",{"$f":"Orçamento!O548","v":"y."},{"$f":"Orçamento!P548","v":"PINTURA"},{"$f":"Orçamento!X548","v":0},{"$f":"Orçamento!AA548","v":0}]
["",{"$f":"Orçamento!O549","v":"z."},{"$f":"Orçamento!P549","v":"DIVERSOS"},{"$f":"Orçamento!X549","v":0},{"$f":"Orçamento!AA549","v":0}]
["F","TOTAL GERAL DO ORÇAMENTO (R$) C/BDI",null,{"$f":"SUM(D14:D39)","v":0},{"$f":"SUM(E14:E39)","v":0}]

{"sheet":"Parc Maior Relev","index":6,"n_rows":33,"n_cols":7,"rows_kept":33,"cut":false,"hidden":false,"merged":[[10,1,10,6],[6,1,6,3],[6,4,6,6],[7,1,7,6],[8,1,8,3],[8,4,8,6],[33,3,33,7],[31,1,31,6],[0,1,0,6],[11,1,11,6],[1,1,1,6],[2,1,2,3],[2,4,2,6],[3,1,3,3],[3,4,3,6],[4,1,4,6],[5,1,5,3],[5,4,5,6],[9,1,9,3],[9,4,9,6]]}
[]
[]
[null,"UNIDADE ESCOLAR",null,null,"CÓDIGO INEP"]
[null,{"$f":"Orçamento!$O$4","v":"COLÉGIO ESTADUAL OLYNTO PEREIRA DE CASTRO"},null,null,{"$f":"Orçamento!$X$4","v":52054217}]
[]
[null,"OBRA",null,null,"CIDADE"]
[null,{"$f":"Orçamento!$O$7","v":"REFORMA E AMPLIAÇÃO"},null,null,{"$f":"Orçamento!$X$7","v":"RIO VERDE"}]
[]
[null,"CRE",null,null,"ÁREA TOTAL CONSTRUÍDA (M²)"]
[null,{"$f":"Orçamento!$O$10","v":"CRE-RIO VERDE"},null,null,{"$f":"Orçamento!$X$13","v":2251.75}]
[]
["FILTRO","PARCELA DE MAIOR RELEVÂNCIA"]
[{"$f":"IF(G14>0,\"F\",\"\")","v":"F"},"CÓDIGO","SERVIÇO","DESCRIÇÃO","UNID","QUANT","PARC. MAIOR RELEV (100%)"]
[{"$f":"IF(G14>0,\"F\",\"\")","v":"F"},"f.","INSTALAÇÕES ELÉTRICAS","SUBESTAÇÃO","KVA",112.5,{"$f":"F14","v":112.5}]
[{"$f":"IF(SUM(G16:G30)>0,\"F\",\"\")","v":"F"},"CÓDIGO","SERVIÇO","DESCRIÇÃO","UNID","QUANT","PARC. MAIOR RELEV (50%)"]
[{"$f":"IF(G16>0,\"F\",\"\")","v":""},"e.","ESTRUTURA","CONCRETO","M3",{"$f":"SUMIF(Orçamento!$R$20:$R$505,'Parc Maior Relev'!D16,Orçamento!$T$20:$T$505)","v":0},{"$f":"F16*0.5","v":0}]
[{"$f":"IF(G17>0,\"F\",\"\")","v":""},"f.","INSTALAÇÕES ELÉTRICAS","INSTALAÇÕES ELÉTRICAS","KVA",{"$f":"SUMIF(Orçamento!$R$20:$R$505,'Parc Maior Relev'!D17,Orçamento!$T$20:$T$505)","v":0},{"$f":"F17*0.5","v":0}]
[{"$f":"IF(G18>0,\"F\",\"\")","v":""},"o.","COBERTURAS","COBERTURA CERÂMICA","M2",{"$f":"SUMIF(Orçamento!$R$20:$R$505,'Parc Maior Relev'!D18,Orçamento!$T$20:$T$505)","v":0},0]
["","o.","COBERTURAS","COBERTURA COM TELHA METÁLICA","M2",{"$f":"SUMIF(Orçamento!$R$20:$R$505,'Parc Maior Relev'!D19,Orçamento!$T$20:$T$505)","v":0},0]
["","s.","REVESTIMENTO DE PAREDE","CHAPISCO","M2",{"$f":"SUMIF(Orçamento!$R$20:$R$505,'Parc Maior Relev'!D20,Orçamento!$T$20:$T$505)","v":0},0]
["","s.","REVESTIMENTO DE PAREDE","REBOCO","M2",{"$f":"SUMIF(Orçamento!$R$20:$R$505,'Parc Maior Relev'!D21,Orçamento!$T$20:$T$505)","v":0},0]
["","s.","REVESTIMENTO DE PAREDE","REVESTIMENTO CERÂMICO","M2",{"$f":"SUMIF(Orçamento!$R$20:$R$505,'Parc Maior Relev'!D22,Orçamento!$T$20:$T$505)","v":0},0]
["","t.","FORROS","FORRO DE GESSO","M2",{"$f":"SUMIF(Orçamento!$R$20:$R$505,'Parc Maior Relev'!D23,Orçamento!$T$20:$T$505)","v":0},0]
["","t.","FORROS","FORRO DE PVC","M2",{"$f":"SUMIF(Orçamento!$R$20:$R$505,'Parc Maior Relev'!D24,Orçamento!$T$20:$T$505)","v":0},0]
["","t.","FORROS","FORRO DE GESSO ACARTONADO","M2",{"$f":"SUMIF(Orçamento!$R$20:$R$505,'Parc Maior Relev'!D25,Orçamento!$T$20:$T$505)","v":0},0]
["","u.","REVESTIMENTO DE PISO","PISO DE GRANITINA","M2",{"$f":"SUMIF(Orçamento!$R$20:$R$505,'Parc Maior Relev'!D26,Orçamento!$T$20:$T$505)","v":0},0]
["F","u.","REVESTIMENTO DE PISO","PISO CONCRETO","m²",183.68,91.84]
["","u.","REVESTIMENTO DE PISO","PISO DE CONCRETO DESEMPENADO","M2",{"$f":"SUMIF(Orçamento!$R$20:$R$505,'Parc Maior Relev'!D28,Orçamento!$T$20:$T$505)","v":0},0]
["","u.","REVESTIMENTO DE PISO","PISO CERÂMICO","M2",{"$f":"SUMIF(Orçamento!$R$20:$R$505,'Parc Maior Relev'!D29,Orçamento!$T$20:$T$505)","v":0},0]
["","y.","PINTURA","PINTURA","M2",{"$f":"SUMIF(Orçamento!$R$20:$R$505,'Parc Maior Relev'!D30,Orçamento!$T$20:$T$505)","v":0},0]
["F"]
["F","(*) Para os fins do inciso I dp § 1º do Art. 30 da Lei Federal 8.666/93, são consideradas parcelas de maior relevância técnica as execuções apresentadas"]
["F"]

{"sheet":"Composições","index":7,"n_rows":396,"n_cols":10,"rows_kept":396,"cut":false,"hidden":false,"merged":[[384,5,385,5],[384,6,384,7],[384,8,384,9],[388,1,388,7],[395,1,395,7],[384,0,385,0],[384,1,385,1],[384,2,385,2],[384,3,385,3],[384,4,385,4],[374,5,375,5],[374,6,374,7],[374,8,374,9],[378,1,378,7],[382,1,382,7],[374,0,375,0],[374,1,375,1],[374,2,375,2],[374,3,375,3],[374,4,375,4],[364,5,365,5],[364,6,364,7],[364,8,364,9],[368,1,368,7],[372,1,372,7],[364,0,365,0],[364,1,365,1],[364,2,365,2],[364,3,365,3],[364,4,365,4],[355,5,356,5],[355,6,355,7],[355,8,355,9],[360,1,360,7],[362,1,362,7],[355,0,356,0],[355,1,356,1],[355,2,356,2],[355,3,356,3],[355,4,356,4],[346,5,347,5],[346,6,346,7],[346,8,346,9],[351,1,351,7],[353,1,353,7],[346,0,347,0],[346,1,347,1],[346,2,347,2],[346,3,347,3],[346,4,347,4],[337,5,338,5],[337,6,337,7],[337,8,337,9],[342,1,342,7],[344,1,344,7],[337,0,338,0],[337,1,338,1],[337,2,338,2],[337,3,338,3],[337,4,338,4],[328,5,329,5],[328,6,328,7],[328,8,328,9],[333,1,333,7],[335,1,335,7],[328,0,329,0],[328,1,329,1],[328,2,329,2],[328,3,329,3],[328,4,329,4],[320,5,321,5],[320,6,320,7],[320,8,320,9],[324,1,324,7],[326,1,326,7],[320,0,321,0],[320,1,321,1],[320,2,321,2],[320,3,321,3],[320,4,321,4],[310,5,311,5],[310,6,310,7],[310,8,310,9],[315,1,315,7],[318,1,318,7],[310,0,311,0],[310,1,311,1],[310,2,311,2],[310,3,311,3],[310,4,311,4],[300,5,301,5],[300,6,300,7],[300,8,300,9],[305,1,305,7],[308,1,308,7],[300,0,301,0],[300,1,301,1],[300,2,301,2],[300,3,301,3],[300,4,301,4],[292,5,293,5],[292,6,292,7],[292,8,292,9],[296,1,296,7],[298,1,298,7],[292,0,293,0],[292,1,293,1],[292,2,293,2],[292,3,293,3],[292,4,293,4],[283,5,284,5],[283,6,283,7],[283,8,283,9],[288,1,288,7],[290,1,290,7],[283,0,284,0],[283,1,284,1],[283,2,284,2],[283,3,284,3],[283,4,284,4],[273,5,274,5],[273,6,273,7],[273,8,273,9],[278,1,278,7],[281,1,281,7],[273,0,274,0],[273,1,274,1],[273,2,274,2],[273,3,274,3],[273,4,274,4],[265,5,266,5],[265,6,265,7],[265,8,265,9],[269,1,269,7],[271,1,271,7],[265,0,266,0],[265,1,266,1],[265,2,266,2],[265,3,266,3],[265,4,266,4],[255,5,256,5],[255,6,255,7],[255,8,255,9],[260,1,260,7],[263,1,263,7],[255,0,256,0],[255,1,256,1],[255,2,256,2],[255,3,256,3],[255,4,256,4],[246,5,247,5],[246,6,246,7],[246,8,246,9],[251,1,251,7],[253,1,253,7],[246,0,247,0],[246,1,247,1],[246,2,247,2],[246,3,247,3],[246,4,247,4],[238,5,239,5],[238,6,238,7],[238,8,238,9],[242,1,242,7],[244,1,244,7],[238,0,239,0],[238,1,239,1],[238,2,239,2],[238,3,239,3],[238,4,239,4],[229,5,230,5],[229,6,229,7],[229,8,229,9],[234,1,234,7],[236,1,236,7],[229,0,230,0],[229,1,230,1],[229,2,230,2],[229,3,230,3],[229,4,230,4],[220,5,221,5],[220,6,220,7],[220,8,220,9],[225,1,225,7],[227,1,227,7],[220,0,221,0],[220,1,221,1],[220,2,221,2],[220,3,221,3],[220,4,221,4],[211,5,212,5],[211,6,211,7],[211,8,211,9],[216,1,216,7],[218,1,218,7],[211,0,212,0],[211,1,212,1],[211,2,212,2],[211,3,212,3],[211,4,212,4],[204,5,205,5],[204,6,204,7],[204,8,204,9],[208,1,208,7],[209,1,209,7],[204,0,205,0],[204,1,205,1],[204,2,205,2],[204,3,205,3],[204,4,205,4],[194,5,195,5],[194,6,194,7],[194,8,194,9],[198,1,198,7],[202,1,202,7],[194,0,195,0],[194,1,195,1],[194,2,195,2],[194,3,195,3],[194,4,195,4],[184,5,185,5],[184,6,184,7],[184,8,184,9],[188,1,188,7],[192,1,192,7],[184,0,185,0],[184,1,185,1],[184,2,185,2],[184,3,185,3],[184,4,185,4],[174,5,175,5],[174,6,174,7],[174,8,174,9],[179,1,179,7],[182,1,182,7],[174,0,175,0],[174,1,175,1],[174,2,175,2],[174,3,175,3],[174,4,175,4],[164,5,165,5],[164,6,164,7],[164,8,164,9],[169,1,169,7],[172,1,172,7],[164,0,165,0],[164,1,165,1],[164,2,165,2],[164,3,165,3],[164,4,165,4],[155,5,156,5],[155,6,155,7],[155,8,155,9],[160,1,160,7],[162,1,162,7],[155,0,156,0],[155,1,156,1],[155,2,156,2],[155,3,156,3],[155,4,156,4],[146,5,147,5],[146,6,146,7],[146,8,146,9],[151,1,151,7],[153,1,153,7],[146,0,147,0],[146,1,147,1],[146,2,147,2],[146,3,147,3],[146,4,147,4],[137,5,138,5],[137,6,137,7],[137,8,137,9],[142,1,142,7],[144,1,144,7],[137,0,138,0],[137,1,138,1],[137,2,138,2],[137,3,138,3],[137,4,138,4],[128,5,129,5],[128,6,128,7],[128,8,128,9],[133,1,133,7],[135,1,135,7],[128,0,129,0],[128,1,129,1],[128,2,129,2],[128,3,129,3],[128,4,129,4],[119,5,120,5],[119,6,119,7],[119,8,119,9],[124,1,124,7],[126,1,126,7],[119,0,120,0],[119,1,120,1],[119,2,120,2],[119,3,120,3],[119,4,120,4],[109,5,110,5],[109,6,109,7],[109,8,109,9],[114,1,114,7],[117,1,117,7],[109,0,110,0],[109,1,110,1],[109,2,110,2],[109,3,110,3],[109,4,110,4],[99,5,100,5],[99,6,99,7],[99,8,99,9],[104,1,104,7],[107,1,107,7],[99,0,100,0],[99,1,100,1],[99,2,100,2],[99,3,100,3],[99,4,100,4],[77,5,78,5],[77,6,77,7],[77,8,77,9],[82,1,82,7],[97,1,97,7],[77,0,78,0],[77,1,78,1],[77,2,78,2],[77,3,78,3],[77,4,78,4],[58,5,59,5],[58,6,58,7],[58,8,58,9],[63,1,63,7],[75,1,75,7],[58,0,59,0],[58,1,59,1],[58,2,59,2],[58,3,59,3],[58,4,59,4],[50,5,51,5],[50,6,50,7],[50,8,50,9],[54,1,54,7],[56,1,56,7],[50,0,51,0],[50,1,51,1],[50,2,51,2],[50,3,51,3],[50,4,51,4],[29,5,30,5],[29,6,29,7],[29,8,29,9],[34,1,34,7],[48,1,48,7],[29,0,30,0],[29,1,30,1],[29,2,30,2],[29,3,30,3],[29,4,30,4],[22,5,23,5],[22,6,22,7],[22,8,22,9],[25,1,25,7],[27,1,27,7],[22,0,23,0],[22,1,23,1],[22,2,23,2],[22,3,23,3],[22,4,23,4],[15,5,16,5],[15,6,15,7],[15,8,15,9],[18,1,18,7],[20,1,20,7],[15,0,16,0],[15,1,16,1],[15,2,16,2],[15,3,16,3],[15,4,16,4],[9,0,9,2],[9,3,9,6],[10,0,10,9],[11,0,11,2],[11,3,11,6],[11,7,11,8],[6,0,6,6],[8,0,8,2],[8,3,8,6],[8,7,8,8],[2,0,2,6],[3,0,3,6],[14,0,14,9],[12,0,12,2],[12,3,12,6],[0,0,0,9],[2,7,2,9],[3,7,3,9],[5,7,5,9],[6,7,6,9],[5,0,5,6],[9,8,9,9],[12,8,12,9],[13,0,13,9],[7,0,7,9],[4,0,4,9],[1,0,1,9]]}
[]
[]
["UNIDADE ESCOLAR",null,null,null,null,null,null,"CÓDIGO INEP"]
[{"$f":"Orçamento!$O$4","v":"COLÉGIO ESTADUAL OLYNTO PEREIRA DE CASTRO"},null,null,null,null,null,null,{"$f":"Orçamento!$X$4","v":52054217}]
[]
["OBRA",null,null,null,null,null,null,"CIDADE"]
[{"$f":"Orçamento!$O$7","v":"REFORMA E AMPLIAÇÃO"},null,null,null,null,null,null,{"$f":"Orçamento!$X$7","v":"RIO VERDE"}]
[]
["CRE",null,null,"ENDEREÇO",null,null,null,"REFERÊNCIA AGETOP"]
[{"$f":"Orçamento!$O$10","v":"CRE-RIO VERDE"},null,null,{"$f":"Orçamento!$R$10","v":" RUA JUCA BAILAO SN , SETOR MORADA DO SOL , CEP:75909-050"},null,null,null,{"$f":"Orçamento!$S$10","v":"ABR/19"},{"$f":"Orçamento!$T$10","v":"DESONERADA"}]
[]
["DATA",null,null,"ÁREA TOTAL CONSTRUÍDA (M²)",null,null,null,"REFERÊNCIA SINAPI"]
[{"$f":"Orçamento!$S$7","v":"2020-06-18"},null,null,{"$f":"Orçamento!$X$13","v":2251.75},null,null,null,{"$f":"Orçamento!$X$10","v":"ABR/20"},{"$f":"Orçamento!$Y$10","v":"DESONERADA"}]
[]
["COMPOSIÇÕES DE CUSTOS UNITÁRIOS - SEE-GO"]
[10,"FONTE","CÓDIGO","DESCRIÇÃO","UNIDADE","COEFIC.","CUSTO UNITÁRIO",null,"CUSTO  TOTAL (A) + (B) + (C) + (D) + (E)"]
[null,null,null,null,null,null,"DESONERADO","NÃO DESONER.","DESONERADO","NÃO DESONER."]
[null,"COMPOSIÇÃO","COMP 010_SEE","DEMOLIÇÃO DE GRADE/GRELHA/CORRIMÃO/GUARDA CORPO - METÁLICO","M2",null,"-","-",4.0599999999999996,4.71]
[null,"MÃO DE OBRA (B) - TOTAL",null,null,null,null,null,null,0,0]
[null,"AGETOP",20106,"RETIRADA DE JANELAS OU PORTAIS C/ TRANSP. ATÉ CB. E CARGA","m2    ",1,4.0599999999999996,4.71,4.0599999999999996,4.71]
[null,"MATERIAL (C) - TOTAL",null,null,null,null,null,null,4.0599999999999996,4.71]
[]
[86,"FONTE","CÓDIGO","DESCRIÇÃO","UNIDADE","COEFIC.","CUSTO UNITÁRIO",null,"CUSTO  TOTAL (A) + (B) + (C) + (D) + (E)"]
[null,null,null,null,null,null,"DESONERADO","NÃO DESONER.","DESONERADO","NÃO DESONER."]
[null,"COMPOSIÇÃO","COMP 086_SEE","ELEVADOR (PLATAFORMA VERTICAL) MODELO HERA OU EQUIVALENTE 02 PARADAS - CAPACIDADE 280KG (INSTALADO)","UN ",null,null,null,37873.33,37873.33]
[null,"MÃO DE OBRA (B) - TOTAL",null,null,null,null,null,null,0,0]
[null,"COTAÇÃO","COT 016_SEE","ELEVADOR (PLATAFORMA VERTICAL) MODELO HERA OU EQUIVALENTE 02 PARADAS - CAPACIDADE 280KG (INSTALADO)","UN ",1,37873.333333333336,37873.333333333336,37873.33,37873.33]
[null,"MATERIAL (C) - TOTAL",null,null,null,null,null,null,37873.33,37873.33]
[]
[85,"FONTE","CÓDIGO","DESCRIÇÃO","UNIDADE","COEFIC.","CUSTO UNITÁRIO",null,"CUSTO  TOTAL (A) + (B) + (C) + (D) + (E)"]
[null,null,null,null,null,null,"DESONERADO","NÃO DESONER.","DESONERADO","NÃO DESONER."]
[null,"COMPOSIÇÃO","COMP 085_SEE","GUARDA-CORPO - SEDUC","M",null,null,null,190.52999999999997,195.41]
[null,"AGETOP_I",25,"OFICIAL \"B\"","h     ",1.1000000000000001,13.95,16.16,15.35,17.78]
[null,"AGETOP_I",8,"AJUDANTE","h     ",1.1000000000000001,8.75,10.14,9.6300000000000008,11.15]
[null,"MÃO DE OBRA (B) - TOTAL",null,null,null,null,null,null,24.98,28.93]
[null,"AGETOP_I",2376,"TUBO INDUSTRIAL 2\" CHAPA 13 ","Kg",7.7778,5.23,5.23,40.68,40.68]
[null,"AGETOP_I",2504,"TUBO INDUSTRIAL D=25 MM CHAPA 13 ","Kg",4.6319999999999997,5.07,5.07,23.48,23.48]
[null,"AGETOP_I",2377,"TUBO INDUSTRIAL 40X40 CH.13","Kg",6.3419999999999996,5.07,5.07,32.15,32.15]
[null,"AGETOP_I",2417,"MASSA PLASTICA","Kg",0.2041,10.58,10.58,2.16,2.16]
[null,"AGETOP_I",2246,"ELETRODO 2.5 OK","Kg",0.11459999999999999,8.6999999999999993,8.6999999999999993,1,1]
[null,"AGETOP_I",1672,"LIXA PARA FERRO ( NÚMERO 100 )","un",0.25509999999999999,2.12,2.12,0.54,0.54]
[null,"AGETOP_I",1264,"DISCO DE DESBASTE 7/8\" P/ CONC./FERRO (1/4\" X 7\")","un",5.0999999999999997E-2,7,7,0.36,0.36]
[null,"AGETOP_I",1334,"DISCO DE CORTE DIAM. 5/8\"- 10\"","un",0.2334,5.5,5.5,1.28,1.28]
[null,"AGETOP_I",2902,"FABRICAÇÃO / MONTAGEM","un",1,50.44,50.44,50.44,50.44]
[null,"AGETOP_I",2150,"CHAPA DE FERRO DOBRADA No.13","Kg",0.33909,5.28,5.28,1.79,1.79]
[null,"AGETOP_I",2719,"CHAPA PERFILADA 3/16\"","Kg",0.3463,5.04,5.04,1.75,1.75]
[null,"AGETOP_I",2436,"ACO CA-25 - 6,3 MM (1/4\") - BARRA LISA A-36","Kg",0.18029999999999999,5.13,5.13,0.92,0.92]
[null,"AGETOP",261602,"PINT.ESMALTE/ESQUAD.FERRO C/FUNDO ANTICOR.","m2    ",0.64,14.07,15.51,9,9.93]
[null,"MATERIAL (C) - TOTAL",null,null,null,null,null,null,165.54999999999998,166.48]
[]
[385,"FONTE","CÓDIGO","DESCRIÇÃO","UNIDADE","COEFIC.","CUSTO UNITÁRIO",null,"CUSTO  TOTAL (A) + (B) + (C) + (D) + (E)"]
[null,null,null,null,null,null,"DESONERADO","NÃO DESONER.","DESONERADO","NÃO DESONER."]
[null,"COMPOSIÇÃO","COMP 385_SEE","DEMOLIÇÃO POSTE DE CONCRETO/METALICA ENTRE 10 E 15 METROS C/ REAPROVEITAMENTO C/ TRANSPORTE ATE CAÇAMBA E CARGA","UN ",null,null,null,138.75,140.13999999999999]
[null,"AGETOP_I",8,"AJUDANTE","h     ",1,8.75,10.14,8.75,10.14]
[null,"MÃO DE OBRA (B) - TOTAL",null,null,null,null,null,null,8.75,10.14]
[null,"AGETOP",72080,"POSTE/TRAFO - CAMINHÃO MUNCK 12 TON. (MÍNIMO 4H/DIA)","H     ",1,130,130,130,130]
[null,"MATERIAL (C) - TOTAL",null,null,null,null,null,null,130,130]
[]
[82,"FONTE","CÓDIGO","DESCRIÇÃO","UNIDADE","COEFIC.","CUSTO UNITÁRIO",null,"CUSTO  TOTAL (A) + (B) + (C) + (D) + (E)"]
[null,null,null,null,null,null,"DESONERADO","NÃO DESONER.","DESONERADO","NÃO DESONER."]
[null,"COMPOSIÇÃO","COMP 082_SEE","CORRIMÃO PAREDE - SEDUC","M",null,null,null,121.38,125.41]
[null,"AGETOP_I",25,"OFICIAL \"B\"","h     ",1,13.95,16.16,13.95,16.16]
[null,"AGETOP_I",8,"AJUDANTE","h     ",1,8.75,10.14,8.75,10.14]
[null,"MÃO DE OBRA (B) - TOTAL",null,null,null,null,null,null,22.7,26.3]
[null,"AGETOP_I",2376,"TUBO INDUSTRIAL 2\" CHAPA 13 ","Kg",5.5247999999999999,5.23,5.23,28.89,28.89]
[null,"AGETOP_I",2504,"TUBO INDUSTRIAL D=25 MM CHAPA 13 ","Kg",1.1000000000000001,5.07,5.07,5.58,5.58]
[null,"AGETOP_I",2417,"MASSA PLASTICA","Kg",0.2041,10.58,10.58,2.16,2.16]
[null,"AGETOP_I",2246,"ELETRODO 2.5 OK","Kg",0.11459999999999999,8.6999999999999993,8.6999999999999993,1,1]
[null,"AGETOP_I",1672,"LIXA PARA FERRO ( NÚMERO 100 )","un",0.125,2.12,2.12,0.27,0.27]
[null,"AGETOP_I",1264,"DISCO DE DESBASTE 7/8\" P/ CONC./FERRO (1/4\" X 7\")","un",2.5000000000000001E-2,7,7,0.18,0.18]
[null,"AGETOP_I",1334,"DISCO DE CORTE DIAM. 5/8\"- 10\"","un",0.1865,5.5,5.5,1.03,1.03]
[null,"AGETOP_I",2902,"FABRICAÇÃO / MONTAGEM","un",1,50.44,50.44,50.44,50.44]
[null,"AGETOP_I",2719,"CHAPA PERFILADA 3/16\"","Kg",0.72,5.04,5.04,3.63,3.63]
[null,"AGETOP_I",2436,"ACO CA-25 - 6,3 MM (1/4\") - BARRA LISA A-36","Kg",0.25,5.13,5.13,1.28,1.28]
[null,"AGETOP",261602,"PINT.ESMALTE/ESQUAD.FERRO C/FUNDO ANTICOR.","m2    ",0.3,14.07,15.51,4.22,4.6500000000000004]
[null,"MATERIAL (C) - TOTAL",null,null,null,null,null,null,98.679999999999993,99.11]
[]
[84,"FONTE","CÓDIGO","DESCRIÇÃO","UNIDADE","COEFIC.","CUSTO UNITÁRIO",null,"CUSTO  TOTAL (A) + (B) + (C) + (D) + (E)"]
[null,null,null,null,null,null,"DESONERADO","NÃO DESONER.","DESONERADO","NÃO DESONER."]
[null,"COMPOSIÇÃO","COMP 084_SEE","GUARDA-CORPO COM CORRIMÃO - SEDUC","M",null,null,null,206.14000000000001,211.22000000000003]
[null,"AGETOP_I",25,"OFICIAL \"B\"","h     ",1.1000000000000001,13.95,16.16,15.35,17.78]
[null,"AGETOP_I",8,"AJUDANTE","h     ",1.1000000000000001,8.75,10.14,9.6300000000000008,11.15]
[null,"MÃO DE OBRA (B) - TOTAL",null,null,null,null,null,null,24.98,28.93]
[null,"AGETOP_I",2376,"TUBO INDUSTRIAL 2\" CHAPA 13 ","Kg",7.7778,5.23,5.23,40.68,40.68]
[null,"AGETOP_I",2504,"TUBO INDUSTRIAL D=25 MM CHAPA 13 ","Kg",4.6319999999999997,5.07,5.07,23.48,23.48]
[null,"AGETOP_I",2377,"TUBO INDUSTRIAL 40X40 CH.13","Kg",6.3419999999999996,5.07,5.07,32.15,32.15]
[null,"AGETOP_I",2421,"TUBO INDUSTRIAL 1.1/2\" CHAPA 13 ","Kg",1.4862,5.07,5.07,7.54,7.54]
[null,"AGETOP_I",2417,"MASSA PLASTICA","Kg",0.2041,10.58,10.58,2.16,2.16]
[null,"AGETOP_I",2246,"ELETRODO 2.5 OK","Kg",0.11459999999999999,8.6999999999999993,8.6999999999999993,1,1]
[null,"AGETOP_I",1672,"LIXA PARA FERRO ( NÚMERO 100 )","un",0.25509999999999999,2.12,2.12,0.54,0.54]
[null,"AGETOP_I",1264,"DISCO DE DESBASTE 7/8\" P/ CONC./FERRO (1/4\" X 7\")","un",5.0999999999999997E-2,7,7,0.36,0.36]
[null,"AGETOP_I",1334,"DISCO DE CORTE DIAM. 5/8\"- 10\"","un",0.373,5.5,5.5,2.0499999999999998,2.0499999999999998]
[null,"AGETOP_I",2902,"FABRICAÇÃO / MONTAGEM","un",1,50.44,50.44,50.44,50.44]
[null,"AGETOP_I",2150,"CHAPA DE FERRO DOBRADA No.13","Kg",0.43519999999999998,5.28,5.28,2.2999999999999998,2.2999999999999998]
[null,"AGETOP_I",2719,"CHAPA PERFILADA 3/16\"","Kg",1.0979999999999999,5.04,5.04,5.53,5.53]
[null,"AGETOP_I",2436,"ACO CA-25 - 6,3 MM (1/4\") - BARRA LISA A-36","Kg",0.38124999999999998,5.13,5.13,1.96,1.96]
[null,"AGETOP",261602,"PINT.ESMALTE/ESQUAD.FERRO C/FUNDO ANTICOR.","m2    ",0.78,14.07,15.51,10.97,12.1]
[null,"MATERIAL (C) - TOTAL",null,null,null,null,null,null,181.16000000000003,182.29000000000002]
[]
[382,"FONTE","CÓDIGO","DESCRIÇÃO","UNIDADE","COEFIC.","CUSTO UNITÁRIO",null,"CUSTO  TOTAL (A) + (B) + (C) + (D) + (E)"]
[null,null,null,null,null,null,"DESONERADO","NÃO DESONER.","DESONERADO","NÃO DESONER."]
[null,"COMPOSIÇÃO","COMP 382_SEE","TE DE REDUCAO DE FERRO GALVANIZADO, COM ROSCA BSP, DE 3/4\" X 1/2\"","UN ",null,null,null,24.25,26.43]
[null,"AGETOP_I",8,"AJUDANTE","h     ",0.6,8.75,10.14,5.25,6.08]
[null,"AGETOP_I",11,"ENCANADOR","h     ",0.61050000000000004,13.95,16.16,8.52,9.8699999999999992]
[null,"MÃO DE OBRA (B) - TOTAL",null,null,null,null,null,null,13.77,15.95]
[null,"SINAPI_I",3146,"FITA VEDA ROSCA EM ROLOS DE 18 MM X 10 M (L X C)","UN    ",0.12075471698113208,3.4,3.4,0.41,0.41]
[null,"SINAPI_I",6302,"TE DE REDUCAO DE FERRO GALVANIZADO, COM ROSCA BSP, DE 3/4\" X 1/2\"","UN    ",1,10.07,10.07,10.07,10.07]
[null,"MATERIAL (C) - TOTAL",null,null,null,null,null,null,10.48,10.48]
[]
[383,"FONTE","CÓDIGO","DESCRIÇÃO","UNIDADE","COEFIC.","CUSTO UNITÁRIO",null,"CUSTO  TOTAL (A) + (B) + (C) + (D) + (E)"]
[null,null,null,null,null,null,"DESONERADO","NÃO DESONER.","DESONERADO","NÃO DESONER."]
[null,"COMPOSIÇÃO","COMP 383_SEE","BUCHA DE REDUCAO DE FERRO GALVANIZADO, COM ROSCA BSP, DE 1/2\" X 1/4\"","UN ",null,null,null,7.68,8.26]
[null,"AGETOP_I",8,"AJUDANTE","h     ",0.16,8.75,10.14,1.4,1.62]
[null,"AGETOP_I",11,"ENCANADOR","h     ",0.16,13.95,16.16,2.23,2.59]
[null,"MÃO DE OBRA (B) - TOTAL",null,null,null,null,null,null,3.63,4.21]
[null,"AGETOP_I","H689","FITA VEDAROSCA 12 MM","m",1.2,0.28000000000000003,0.28000000000000003,0.34,0.34]
[null,"SINAPI_I",770,"BUCHA DE REDUCAO DE FERRO GALVANIZADO, COM ROSCA BSP, DE 1/2\" X 1/4\"","UN    ",1,3.71,3.71,3.71,3.71]
[null,"MATERIAL (C) - TOTAL",null,null,null,null,null,null,4.05,4.05]
[]
[212,"FONTE","CÓDIGO","DESCRIÇÃO","UNIDADE","COEFIC.","CUSTO UNITÁRIO",null,"CUSTO  TOTAL (A) + (B) + (C) + (D) + (E)"]
[null,null,null,null,null,null,"DESONERADO","NÃO DESONER.","DESONERADO","NÃO DESONER."]
[null,"COMPOSIÇÃO","COMP 212_SEE","NIPLE DE REDUÇÃO 1/2\" X 1/4\" BSP","UN ",null,null,null,9.68,10.26]
[null,"AGETOP_I",8,"AJUDANTE","h     ",0.16,8.75,10.14,1.4,1.62]
[null,"AGETOP_I",11,"ENCANADOR","h     ",0.16,13.95,16.16,2.23,2.59]
[null,"MÃO DE OBRA (B) - TOTAL",null,null,null,null,null,null,3.63,4.21]
[null,"COTAÇÃO","COT 103_SEE","NIPLE DE REDUÇÃO 1/2\" X 1/4\" BSP","UN",1,6.0533333333333337,6.0533333333333337,6.05,6.05]
[null,"MATERIAL (C) - TOTAL",null,null,null,null,null,null,6.05,6.05]
[]
[213,"FONTE","CÓDIGO","DESCRIÇÃO","UNIDADE","COEFIC.","CUSTO UNITÁRIO",null,"CUSTO  TOTAL (A) + (B) + (C) + (D) + (E)"]
[null,null,null,null,null,null,"DESONERADO","NÃO DESONER.","DESONERADO","NÃO DESONER."]
[null,"COMPOSIÇÃO","COMP 213_SEE","NIPLE DE REDUÇÃO 3/4\" X 1/2\" BSP","UN ",null,null,null,13.34,13.920000000000002]
[null,"AGETOP_I",8,"AJUDANTE","h     ",0.16,8.75,10.14,1.4,1.62]
[null,"AGETOP_I",11,"ENCANADOR","h     ",0.16,13.95,16.16,2.23,2.59]
[null,"MÃO DE OBRA (B) - TOTAL",null,null,null,null,null,null,3.63,4.21]
[null,"COTAÇÃO","COT 104_SEE","NIPLE DE REDUÇÃO 3/4\" X 1/2\" BSP","UN",1,9.7099999999999991,9.7099999999999991,9.7100000000000009,9.7100000000000009]
[null,"MATERIAL (C) - TOTAL",null,null,null,null,null,null,9.7100000000000009,9.7100000000000009]
[]
[237,"FONTE","CÓDIGO","DESCRIÇÃO","UNIDADE","COEFIC.","CUSTO UNITÁRIO",null,"CUSTO  TOTAL (A) + (B) + (C) + (D) + (E)"]
[null,null,null,null,null,null,"DESONERADO","NÃO DESONER.","DESONERADO","NÃO DESONER."]
[null,"COMPOSIÇÃO","COMP 237_SEE","FITA ANTICORROSIVA","M",null,null,null,11.16,11.879999999999999]
[null,"AGETOP_I",8,"AJUDANTE","h     ",0.2,8.75,10.14,1.75,2.0299999999999998]
[null,"AGETOP_I",12,"ELETRICISTA","h     ",0.2,13.95,16.16,2.79,3.23]
[null,"MÃO DE OBRA (B) - TOTAL",null,null,null,null,null,null,4.54,5.26]
[null,"SINAPI_I",39634,"FITA ADESIVA ANTICORROSIVA DE PVC FLEXIVEL, COR PRETA, PARA PROTECAO TUBULACAO, 50 MM X 30 M (L X C), E= *0,25* MM","M     ",1,6.62,6.62,6.62,6.62]
[null,"MATERIAL (C) - TOTAL",null,null,null,null,null,null,6.62,6.62]
[]
[542,"FONTE","CÓDIGO","DESCRIÇÃO","UNIDADE","COEFIC.","CUSTO UNITÁRIO",null,"CUSTO  TOTAL (A) + (B) + (C) + (D) + (E)"]
[null,null,null,null,null,null,"DESONERADO","NÃO DESONER.","DESONERADO","NÃO DESONER."]
[null,"COMPOSIÇÃO","COMP 542_SEE","VÁLVULA UGV 3/4\" (S) LATÃO","UN ",null,null,null,25.65,27.2]
[null,"AGETOP_I",8,"AJUDANTE","h     ",0.432,8.75,10.14,3.78,4.38]
[null,"AGETOP_I",11,"ENCANADOR","h     ",0.432,13.95,16.16,6.03,6.98]
[null,"MÃO DE OBRA (B) - TOTAL",null,null,null,null,null,null,9.81,11.36]
[null,"COTAÇÃO","COT 281_SEE","VÁLVULA UGV 3/4\" (S) LATÃO","UN ",1,15.836666666666666,15.836666666666666,15.84,15.84]
[null,"MATERIAL (C) - TOTAL",null,null,null,null,null,null,15.84,15.84]
[]
[543,"FONTE","CÓDIGO","DESCRIÇÃO","UNIDADE","COEFIC.","CUSTO UNITÁRIO",null,"CUSTO  TOTAL (A) + (B) + (C) + (D) + (E)"]
[null,null,null,null,null,null,"DESONERADO","NÃO DESONER.","DESONERADO","NÃO DESONER."]
[null,"COMPOSIÇÃO","COMP 543_SEE","VÁLVULA UGV 1/2\" (S) LATÃO","UN ",null,null,null,24.98,26.53]
[null,"AGETOP_I",8,"AJUDANTE","h     ",0.432,8.75,10.14,3.78,4.38]
[null,"AGETOP_I",11,"ENCANADOR","h     ",0.432,13.95,16.16,6.03,6.98]
[null,"MÃO DE OBRA (B) - TOTAL",null,null,null,null,null,null,9.81,11.36]
[null,"COTAÇÃO","COT 282_SEE","VÁLVULA UGV 1/2\" (S) LATÃO","UN ",1,15.166666666666666,15.166666666666666,15.17,15.17]
[null,"MATERIAL (C) - TOTAL",null,null,null,null,null,null,15.17,15.17]
[]
[211,"FONTE","CÓDIGO","DESCRIÇÃO","UNIDADE","COEFIC.","CUSTO UNITÁRIO",null,"CUSTO  TOTAL (A) + (B) + (C) + (D) + (E)"]
[null,null,null,null,null,null,"DESONERADO","NÃO DESONER.","DESONERADO","NÃO DESONER."]
[null,"COMPOSIÇÃO","COMP 211_SEE","REGULADOR DE 2º ESTÁGIO 5KG/H","UN ",null,null,null,86.72,90.86]
[null,"AGETOP_I",8,"AJUDANTE","h     ",1.1499999999999999,8.75,10.14,10.06,11.66]
[null,"AGETOP_I",11,"ENCANADOR","h     ",1.1499999999999999,13.95,16.16,16.04,18.579999999999998]
[null,"MÃO DE OBRA (B) - TOTAL",null,null,null,null,null,null,26.1,30.24]
[null,"COTAÇÃO","COT 102_SEE","REGULADOR DE 2º ESTÁGIO 5KG/H","UN",1,59.833333333333336,59.833333333333336,59.83,59.83]
[null,"AGETOP_I","H689","FITA VEDAROSCA 12 MM","m",2.82,0.28000000000000003,0.28000000000000003,0.79,0.79]
[null,"MATERIAL (C) - TOTAL",null,null,null,null,null,null,60.62,60.62]
[]
[210,"FONTE","CÓDIGO","DESCRIÇÃO","UNIDADE","COEFIC.","CUSTO UNITÁRIO",null,"CUSTO  TOTAL (A) + (B) + (C) + (D) + (E)"]
[null,null,null,null,null,null,"DESONERADO","NÃO DESONER.","DESONERADO","NÃO DESONER."]
[null,"COMPOSIÇÃO","COMP 210_SEE","REGULADOR DE 1º ESTÁGIO 60KG/H MODELO AP-40  COM MANÔMETRO","UN ",null,null,null,232.47,236.61]
[null,"AGETOP_I",8,"AJUDANTE","h     ",1.1499999999999999,8.75,10.14,10.06,11.66]
[null,"AGETOP_I",11,"ENCANADOR","h     ",1.1499999999999999,13.95,16.16,16.04,18.579999999999998]
[null,"MÃO DE OBRA (B) - TOTAL",null,null,null,null,null,null,26.1,30.24]
[null,"COTAÇÃO","COT 101_SEE","REGULADOR DE 1º ESTÁGIO 60KG/H MODELO AP-40  COM MANÔMETRO","UN",1,205.57666666666668,205.57666666666668,205.58,205.58]
[null,"AGETOP_I","H689","FITA VEDAROSCA 12 MM","m",2.82,0.28000000000000003,0.28000000000000003,0.79,0.79]
[null,"MATERIAL (C) - TOTAL",null,null,null,null,null,null,206.37,206.37]
[]
[235,"FONTE","CÓDIGO","DESCRIÇÃO","UNIDADE","COEFIC.","CUSTO UNITÁRIO",null,"CUSTO  TOTAL (A) + (B) + (C) + (D) + (E)"]
[null,null,null,null,null,null,"DESONERADO","NÃO DESONER.","DESONERADO","NÃO DESONER."]
[null,"COMPOSIÇÃO","COMP 235_SEE","PLACA DE SINALIZAÇÃO EM PVC COD 01 - (300X300) PROIBIDO FUMAR","UN ",null,null,null,25.319999999999997,25.439999999999998]
[null,"AGETOP_I",5,"SERVENTE","h     ",0.09,8.75,10.14,0.79,0.91]
[null,"MÃO DE OBRA (B) - TOTAL",null,null,null,null,null,null,0.79,0.91]
[null,"AGETOP_I",3070,"BUCHA DE NYLON S-6","un",2,0.04,0.04,0.08,0.08]
[null,"AGETOP_I",3393,"PARAFUSO P/BUCHA S-6","un",2,0.08,0.08,0.16,0.16]
[null,"SINAPI_I",37556,"PLACA DE SINALIZACAO DE SEGURANCA CONTRA INCENDIO, FOTOLUMINESCENTE, QUADRADA, *20 X 20* CM, EM PVC *2* MM ANTI-CHAMAS (SIMBOLOS, CORES E PICTOGRAMAS CONFORME NBR 13434)","UN    ",1,24.29,24.29,24.29,24.29]
[null,"MATERIAL (C) - TOTAL",null,null,null,null,null,null,24.529999999999998,24.529999999999998]
[]
[236,"FONTE","CÓDIGO","DESCRIÇÃO","UNIDADE","COEFIC.","CUSTO UNITÁRIO",null,"CUSTO  TOTAL (A) + (B) + (C) + (D) + (E)"]
[null,null,null,null,null,null,"DESONERADO","NÃO DESONER.","DESONERADO","NÃO DESONER."]
[null,"COMPOSIÇÃO","COMP 236_SEE","PLACA DE SINALIZAÇÃO EM PVC COD 06 - (300X300) PERIGO INFLAMÁVEL","UN ",null,null,null,25.319999999999997,25.439999999999998]
[null,"AGETOP_I",5,"SERVENTE","h     ",0.09,8.75,10.14,0.79,0.91]
[null,"MÃO DE OBRA (B) - TOTAL",null,null,null,null,null,null,0.79,0.91]
[null,"AGETOP_I",3070,"BUCHA DE NYLON S-6","un",2,0.04,0.04,0.08,0.08]
[null,"AGETOP_I",3393,"PARAFUSO P/BUCHA S-6","un",2,0.08,0.08,0.16,0.16]
[null,"SINAPI_I",37556,"PLACA DE SINALIZACAO DE SEGURANCA CONTRA INCENDIO, FOTOLUMINESCENTE, QUADRADA, *20 X 20* CM, EM PVC *2* MM ANTI-CHAMAS (SIMBOLOS, CORES E PICTOGRAMAS CONFORME NBR 13434)","UN    ",1,24.29,24.29,24.29,24.29]
[null,"MATERIAL (C) - TOTAL",null,null,null,null,null,null,24.529999999999998,24.529999999999998]
[]
[45,"FONTE","CÓDIGO","DESCRIÇÃO","UNIDADE","COEFIC.","CUSTO UNITÁRIO",null,"CUSTO  TOTAL (A) + (B) + (C) + (D) + (E)"]
[null,null,null,null,null,null,"DESONERADO","NÃO DESONER.","DESONERADO","NÃO DESONER."]
[null,"COMPOSIÇÃO","COMP 045_SEE","LAUDO DE ESTANQUEIDADE","UN ",null,null,null,936,1085.1199999999999]
[null,"AGETOP",250101,"ENGENHEIRO - (OBRAS CIVIS)","H     ",16,58.5,67.819999999999993,936,1085.1199999999999]
[null,"MÃO DE OBRA (B) - TOTAL",null,null,null,null,null,null,936,1085.1199999999999]
[null,"MATERIAL (C) - TOTAL",null,null,null,null,null,null,0,0]
[]
[46,"FONTE","CÓDIGO","DESCRIÇÃO","UNIDADE","COEFIC.","CUSTO UNITÁRIO",null,"CUSTO  TOTAL (A) + (B) + (C) + (D) + (E)"]
[null,null,null,null,null,null,"DESONERADO","NÃO DESONER.","DESONERADO","NÃO DESONER."]
[null,"COMPOSIÇÃO","COMP 046_SEE","CAPUZ PARA PROTEÇÃO DOS PARA RAIOS","UN ",null,null,null,16.560000000000002,16.690000000000001]
[null,"AGETOP_I",8,"AJUDANTE","h     ",3.3300000000000003E-2,8.75,10.14,0.28999999999999998,0.34]
[null,"AGETOP_I",12,"ELETRICISTA","h     ",3.3300000000000003E-2,13.95,16.16,0.46,0.54]
[null,"MÃO DE OBRA (B) - TOTAL",null,null,null,null,null,null,0.75,0.88000000000000012]
[null,"COTAÇÃO","COT 010_SEE","CAPUZ PARA PROTEÇÃO DOS PARA RAIOS","UN ",1,15.81,15.81,15.81,15.81]
[null,"MATERIAL (C) - TOTAL",null,null,null,null,null,null,15.81,15.81]
[]
[47,"FONTE","CÓDIGO","DESCRIÇÃO","UNIDADE","COEFIC.","CUSTO UNITÁRIO",null,"CUSTO  TOTAL (A) + (B) + (C) + (D) + (E)"]
[null,null,null,null,null,null,"DESONERADO","NÃO DESONER.","DESONERADO","NÃO DESONER."]
[null,"COMPOSIÇÃO","COMP 047_SEE","CAPUZ DE PROTEÇÃO PARA BUCHA DE TRANSFORMADOR","UN ",null,null,null,16.560000000000002,16.690000000000001]
[null,"AGETOP_I",8,"AJUDANTE","h     ",3.3300000000000003E-2,8.75,10.14,0.28999999999999998,0.34]
[null,"AGETOP_I",12,"ELETRICISTA","h     ",3.3300000000000003E-2,13.95,16.16,0.46,0.54]
[null,"MÃO DE OBRA (B) - TOTAL",null,null,null,null,null,null,0.75,0.88000000000000012]
[null,"COTAÇÃO","COT 011_SEE","CAPUZ DE PROTEÇÃO PARA BUCHA DE TRANSFORMADOR","UN ",1,15.81,15.81,15.81,15.81]
[null,"MATERIAL (C) - TOTAL",null,null,null,null,null,null,15.81,15.81]
[]
[48,"FONTE","CÓDIGO","DESCRIÇÃO","UNIDADE","COEFIC.","CUSTO UNITÁRIO",null,"CUSTO  TOTAL (A) + (B) + (C) + (D) + (E)"]
[null,null,null,null,null,null,"DESONERADO","NÃO DESONER.","DESONERADO","NÃO DESONER."]
[null,"COMPOSIÇÃO","COMP 048_SEE","HASTE ROSQUEADA \"TIRANTE\" 3/8\"","M",null,null,null,14.46,15.899999999999999]
[null,"AGETOP_I",8,"AJUDANTE","h     ",0.4,8.75,10.14,3.5,4.0599999999999996]
[null,"AGETOP_I",12,"ELETRICISTA","h     ",0.4,13.95,16.16,5.58,6.46]
[null,"MÃO DE OBRA (B) - TOTAL",null,null,null,null,null,null,9.08,10.52]
[null,"COTAÇÃO","COT 012_SEE","HASTE ROSQUEADA \"TIRANTE\" 3/8\"","M",1,5.3833333333333329,5.3833333333333329,5.38,5.38]
[null,"MATERIAL (C) - TOTAL",null,null,null,null,null,null,5.38,5.38]
[]
[49,"FONTE","CÓDIGO","DESCRIÇÃO","UNIDADE","COEFIC.","CUSTO UNITÁRIO",null,"CUSTO  TOTAL (A) + (B) + (C) + (D) + (E)"]
[null,null,null,null,null,null,"DESONERADO","NÃO DESONER.","DESONERADO","NÃO DESONER."]
[null,"COMPOSIÇÃO","COMP 049_SEE","PORCA SEXTAVADA 3/8\"","UN ",null,null,null,0.21000000000000002,0.22]
[null,"AGETOP_I",8,"AJUDANTE","h     ",8.9999999999999993E-3,8.75,10.14,0.08,0.09]
[null,"MÃO DE OBRA (B) - TOTAL",null,null,null,null,null,null,0.08,0.09]
[null,"COTAÇÃO","COT 013_SEE","PORCA SEXTAVADA 3/8\"","UN ",1,0.13,0.13,0.13,0.13]
[null,"MATERIAL (C) - TOTAL",null,null,null,null,null,null,0.13,0.13]
[]
[40,"FONTE","CÓDIGO","DESCRIÇÃO","UNIDADE","COEFIC.","CUSTO UNITÁRIO",null,"CUSTO  TOTAL (A) + (B) + (C) + (D) + (E)"]
[null,null,null,null,null,null,"DESONERADO","NÃO DESONER.","DESONERADO","NÃO DESONER."]
[null,"COMPOSIÇÃO","COMP 040_SEE","CONJUNTO MOTOR-BOMBA ELÉTRICA TRIFÁSICO 380/220 V PARA VZ= 24,33 M³/H, HM= 46,24 M POTÊNCIA= 7,5 CV","UN ",null,null,null,3974.27,4003.07]
[null,"AGETOP_I",8,"AJUDANTE","h     ",8,8.75,10.14,70,81.12]
[null,"AGETOP_I",11,"ENCANADOR","h     ",8,13.95,16.16,111.6,129.28]
[null,"MÃO DE OBRA (B) - TOTAL",null,null,null,null,null,null,181.6,210.4]
[null,"COTAÇÃO","COT 008_SEE","CONJUNTO MOTOR-BOMBA ELÉTRICA TRIFÁSICO 380/220 V PARA VZ= 24,33 M³/H, HM= 46,24 M POTÊNCIA= 7,5 CV","UN ",1,3792.6666666666665,3792.6666666666665,3792.67,3792.67]
[null,"MATERIAL (C) - TOTAL",null,null,null,null,null,null,3792.67,3792.67]
[]
[76,"FONTE","CÓDIGO","DESCRIÇÃO","UNIDADE","COEFIC.","CUSTO UNITÁRIO",null,"CUSTO  TOTAL (A) + (B) + (C) + (D) + (E)"]
[null,null,null,null,null,null,"DESONERADO","NÃO DESONER.","DESONERADO","NÃO DESONER."]
[null,"COMPOSIÇÃO","COMP 076_SEE","CURVA FERRO GALVANIZADO 45G ROSCA MACHO/FEMEA REF. 2 1/2\"","UN ",null,null,null,137.35,140.66999999999999]
[null,"AGETOP_I",8,"AJUDANTE","h     ",0.92,8.75,10.14,8.0500000000000007,9.33]
[null,"AGETOP_I",11,"ENCANADOR","h     ",0.92,13.95,16.16,12.83,14.87]
[null,"MÃO DE OBRA (B) - TOTAL",null,null,null,null,null,null,20.880000000000003,24.2]
[null,"SINAPI_I",3148,"FITA VEDA ROSCA EM ROLOS DE 18 MM X 50 M (L X C)","UN    ",4.9099999999999998E-2,12.54,12.54,0.62,0.62]
[null,"SINAPI_I",1784,"CURVA 45 GRAUS DE FERRO GALVANIZADO, COM ROSCA BSP MACHO/FEMEA, DE 2 1/2\"","UN    ",1,115.85,115.85,115.85,115.85]
[null,"MATERIAL (C) - TOTAL",null,null,null,null,null,null,116.47,116.47]
[]
[194,"FONTE","CÓDIGO","DESCRIÇÃO","UNIDADE","COEFIC.","CUSTO UNITÁRIO",null,"CUSTO  TOTAL (A) + (B) + (C) + (D) + (E)"]
[null,null,null,null,null,null,"DESONERADO","NÃO DESONER.","DESONERADO","NÃO DESONER."]
[null,"COMPOSIÇÃO","COMP 194_SEE","TAMPÃO CEGO COM CORRENTE 1.1/2\"","UN ",null,null,null,59.480000000000004,59.81]
[null,"AGETOP_I",11,"ENCANADOR","h     ",0.15,13.95,16.16,2.09,2.42]
[null,"MÃO DE OBRA (B) - TOTAL",null,null,null,null,null,null,2.09,2.42]
[null,"SINAPI_I",20964,"TAMPAO COM CORRENTE, EM LATAO, ENGATE RAPIDO 1 1/2\", PARA INSTALACAO PREDIAL DE COMBATE A INCENDIO","UN    ",1,57.39,57.39,57.39,57.39]
[null,"MATERIAL (C) - TOTAL",null,null,null,null,null,null,57.39,57.39]
[]
[79,"FONTE","CÓDIGO","DESCRIÇÃO","UNIDADE","COEFIC.","CUSTO UNITÁRIO",null,"CUSTO  TOTAL (A) + (B) + (C) + (D) + (E)"]
[null,null,null,null,null,null,"DESONERADO","NÃO DESONER.","DESONERADO","NÃO DESONER."]
[null,"COMPOSIÇÃO","COMP 079_SEE","LUVA FERRO GALVANIZADO DIAMETRO 2.1/2\"","UN ",null,null,null,19.5,21.29]
[null,"AGETOP_I",8,"AJUDANTE","h     ",0.5,8.75,10.14,4.38,5.07]
[null,"AGETOP_I",11,"ENCANADOR","h     ",0.5,13.95,16.16,6.98,8.08]
[null,"MÃO DE OBRA (B) - TOTAL",null,null,null,null,null,null,11.36,13.15]
[null,"SINAPI_I",3148,"FITA VEDA ROSCA EM ROLOS DE 18 MM X 50 M (L X C)","UN    ",2.4500000000000001E-2,12.54,12.54,0.31,0.31]
[null,"SINAPI_I",2640,"LUVA PARA ELETRODUTO, EM ACO GALVANIZADO ELETROLITICO, DIAMETRO DE 65 MM (2 1/2\")","UN    ",1,7.83,7.83,7.83,7.83]
[null,"MATERIAL (C) - TOTAL",null,null,null,null,null,null,8.14,8.14]
[]
[17,"FONTE","CÓDIGO","DESCRIÇÃO","UNIDADE","COEFIC.","CUSTO UNITÁRIO",null,"CUSTO  TOTAL (A) + (B) + (C) + (D) + (E)"]
[null,null,null,null,null,null,"DESONERADO","NÃO DESONER.","DESONERADO","NÃO DESONER."]
[null,"COMPOSIÇÃO","COMP 017_SEE","REDUCAO GIRATÓRIA TIPO STORZ LATAO P/ INST. PREDIAL COMBATE A INCENDIO ENGATE RAPIDO 2.1/2\" X 1.1/2\"","UN ",null,"-","-",108.61999999999999,109.19999999999999]
[null,"AGETOP_I",8,"AJUDANTE","h     ",0.16,8.75,10.14,1.4,1.62]
[null,"AGETOP_I",11,"ENCANADOR","h     ",0.16,13.95,16.16,2.23,2.59]
[null,"MÃO DE OBRA (B) - TOTAL",null,null,null,null,null,null,3.63,4.21]
[null,"SINAPI_I",20972,"REDUCAO FIXA TIPO STORZ, ENGATE RAPIDO 2.1/2\" X 1.1/2\", EM LATAO, PARA INSTALACAO PREDIAL COMBATE A INCENDIO PREDIAL","UN    ",1,104.99,104.99,104.99,104.99]
[null,"MATERIAL (C) - TOTAL",null,null,null,null,null,null,104.99,104.99]
[]
[18,"FONTE","CÓDIGO","DESCRIÇÃO","UNIDADE","COEFIC.","CUSTO UNITÁRIO",null,"CUSTO  TOTAL (A) + (B) + (C) + (D) + (E)"]
[null,null,null,null,null,null,"DESONERADO","NÃO DESONER.","DESONERADO","NÃO DESONER."]
[null,"COMPOSIÇÃO","COMP 018_SEE","CHAVE DUPLA P/ CONEXÕES TIPO STORZ EM LATÃO ENGATE RÁPIDO 1 1/2\" X 2 1/2\"","UN ",null,"-","-",16.079999999999998,16.41]
[null,"AGETOP_I",11,"ENCANADOR","h     ",0.15,13.95,16.16,2.09,2.42]
[null,"MÃO DE OBRA (B) - TOTAL",null,null,null,null,null,null,2.09,2.42]
[null,"SINAPI_I",20971,"CHAVE DUPLA PARA CONEXOES TIPO STORZ, ENGATE RAPIDO 1 1/2\" X 2 1/2\", EM LATAO, PARA INSTALACAO PREDIAL COMBATE A INCENDIO","UN    ",1,13.99,13.99,13.99,13.99]
[null,"MATERIAL (C) - TOTAL",null,null,null,null,null,null,13.99,13.99]
[]
[87,"FONTE","CÓDIGO","DESCRIÇÃO","UNIDADE","COEFIC.","CUSTO UNITÁRIO",null,"CUSTO  TOTAL (A) + (B) + (C) + (D) + (E)"]
[null,null,null,null,null,null,"DESONERADO","NÃO DESONER.","DESONERADO","NÃO DESONER."]
[null,"COMPOSIÇÃO","COMP 087_SEE","REGISTRO DE GAVETA COM HASTE ASCENDENTE DE BRONZE 2 1/2\"","UN ",null,null,null,258.56,262.7]
[null,"AGETOP_I",8,"AJUDANTE","h     ",1.1499999999999999,8.75,10.14,10.06,11.66]
[null,"AGETOP_I",11,"ENCANADOR","h     ",1.1499999999999999,13.95,16.16,16.04,18.579999999999998]
[null,"MÃO DE OBRA (B) - TOTAL",null,null,null,null,null,null,26.1,30.24]
[null,"AGETOP_I","H689","FITA VEDAROSCA 12 MM","m",2.82,0.28000000000000003,0.28000000000000003,0.79,0.79]
[null,"COTAÇÃO","COT 017_SEE","REGISTRO DE GAVETA COM HASTE ASCENDENTE DE BRONZE 2 1/2\"","UN ",1,231.66666666666666,231.66666666666666,231.67,231.67]
[null,"MATERIAL (C) - TOTAL",null,null,null,null,null,null,232.45999999999998,232.45999999999998]
[]
[30,"FONTE","CÓDIGO","DESCRIÇÃO","UNIDADE","COEFIC.","CUSTO UNITÁRIO",null,"CUSTO  TOTAL (A) + (B) + (C) + (D) + (E)"]
[null,null,null,null,null,null,"DESONERADO","NÃO DESONER.","DESONERADO","NÃO DESONER."]
[null,"COMPOSIÇÃO","COMP 030_SEE","COTOVELO DE FERRO GALV. 90° X 2 1/2\"","UN ",null,null,null,80.16,83.48]
[null,"AGETOP_I",8,"AJUDANTE","h     ",0.92,8.75,10.14,8.0500000000000007,9.33]
[null,"AGETOP_I",11,"ENCANADOR","h     ",0.92,13.95,16.16,12.83,14.87]
[null,"MÃO DE OBRA (B) - TOTAL",null,null,null,null,null,null,20.880000000000003,24.2]
[null,"SINAPI_I",3470,"COTOVELO 90 GRAUS DE FERRO GALVANIZADO, COM ROSCA BSP, DE 2 1/2\"","UN    ",1,58.72,58.72,58.72,58.72]
[null,"AGETOP_I","H689","FITA VEDAROSCA 12 MM","m",2,0.28000000000000003,0.28000000000000003,0.56000000000000005,0.56000000000000005]
[null,"MATERIAL (C) - TOTAL",null,null,null,null,null,null,59.28,59.28]
[]
[22,"FONTE","CÓDIGO","DESCRIÇÃO","UNIDADE","COEFIC.","CUSTO UNITÁRIO",null,"CUSTO  TOTAL (A) + (B) + (C) + (D) + (E)"]
[null,null,null,null,null,null,"DESONERADO","NÃO DESONER.","DESONERADO","NÃO DESONER."]
[null,"COMPOSIÇÃO","COMP 022_SEE","TAMPÃO FOFO 40X50CM C/INSCRIÇÃO ","UN ",null,"-","-",254.15,254.48]
[null,"AGETOP_I",11,"ENCANADOR","h     ",0.15,13.95,16.16,2.09,2.42]
[null,"MÃO DE OBRA (B) - TOTAL",null,null,null,null,null,null,2.09,2.42]
[null,"SINAPI_I",11293,"TAMPAO FOFO SIMPLES COM BASE, CLASSE A15 CARGA MAX 1,5 T, 400 X 500 MM, COM INSCRICAO INCENDIO","UN    ",1,252.06,252.06,252.06,252.06]
[null,"MATERIAL (C) - TOTAL",null,null,null,null,null,null,252.06,252.06]
[]
[546,"FONTE","CÓDIGO","DESCRIÇÃO","UNID ","COEFIC.","CUSTO UNITÁRIO",null,"CUSTO  TOTAL (A) + (B) + (C) + (D) + (E)"]
[null,null,null,null,null,null,"DESONERADO","NÃO DESONER.","DESONERADO","NÃO DESONER."]
[null,"COMPOSIÇÃO","COMP 546_SEE","BUJÃO DE REBORDO 2.1/2\"","UN ","-","-","-",21.09,21.34]
[null,"AGETOP_I",8,"AJUDANTE","h     ",7.0000000000000007E-2,8.75,10.14,0.61,0.71]
[null,"AGETOP_I",11,"ENCANADOR","h     ",7.0000000000000007E-2,13.95,16.16,0.98,1.1299999999999999]
[null,"MÃO DE OBRA (B) - TOTAL",null,null,null,null,null,null,1.5899999999999999,1.8399999999999999]
[null,"COTAÇÃO","COT 286_SEE","BUJÃO DE REBORDO 2.1/2\"","UN ",1,19.5,19.5,19.5,19.5]
[null,"MATERIAL (C) - TOTAL",null,null,null,null,null,null,19.5,19.5]
[]
[186,"FONTE","CÓDIGO","DESCRIÇÃO","UNIDADE","COEFIC.","CUSTO UNITÁRIO",null,"CUSTO  TOTAL (A) + (B) + (C) + (D) + (E)"]
[null,null,null,null,null,null,"DESONERADO","NÃO DESONER.","DESONERADO","NÃO DESONER."]
[null,"COMPOSIÇÃO","COMP 186_SEE","BOTOEIRA BOMBA DE INCÊNDIO C/ MARTELO CONVENCIONAL/ ANALÓGICA","UN ",null,null,null,86.2,89.8]
[null,"AGETOP_I",8,"AJUDANTE","h     ",1,8.75,10.14,8.75,10.14]
[null,"AGETOP_I",12,"ELETRICISTA","h     ",1,13.95,16.16,13.95,16.16]
[null,"MÃO DE OBRA (B) - TOTAL",null,null,null,null,null,null,22.7,26.3]
[null,"COTAÇÃO","COT 088_SEE","BOTOEIRA BOMBA DE INCÊNDIO C/ MARTELO CONVENCIONAL/ ANALÓGICA","UN",1,63.5,63.5,63.5,63.5]
[null,"MATERIAL (C) - TOTAL",null,null,null,null,null,null,63.5,63.5]
[]
[188,"FONTE","CÓDIGO","DESCRIÇÃO","UNIDADE","COEFIC.","CUSTO UNITÁRIO",null,"CUSTO  TOTAL (A) + (B) + (C) + (D) + (E)"]
[null,null,null,null,null,null,"DESONERADO","NÃO DESONER.","DESONERADO","NÃO DESONER."]
[null,"COMPOSIÇÃO","COMP 188_SEE","ACIONADOR MANUAL DE ALARME","UN ",null,null,null,101.49,104.37]
[null,"AGETOP_I",8,"AJUDANTE","h     ",0.8,8.75,10.14,7,8.11]
[null,"AGETOP_I",12,"ELETRICISTA","h     ",0.8,13.95,16.16,11.16,12.93]
[null,"MÃO DE OBRA (B) - TOTAL",null,null,null,null,null,null,18.16,21.04]
[null,"COTAÇÃO","COT 090_SEE","ACIONADOR MANUAL DE ALARME","UN",1,83.333333333333329,83.333333333333329,83.33,83.33]
[null,"MATERIAL (C) - TOTAL",null,null,null,null,null,null,83.33,83.33]
[]
[190,"FONTE","CÓDIGO","DESCRIÇÃO","UNIDADE","COEFIC.","CUSTO UNITÁRIO",null,"CUSTO  TOTAL (A) + (B) + (C) + (D) + (E)"]
[null,null,null,null,null,null,"DESONERADO","NÃO DESONER.","DESONERADO","NÃO DESONER."]
[null,"COMPOSIÇÃO","COMP 190_SEE","CENTRAL DE DETECÇÃO E ALARME DE 40 SETORES COM BATERIA","UN ",null,null,null,1144.93,1173.73]
[null,"AGETOP_I",8,"AJUDANTE","h     ",8,8.75,10.14,70,81.12]
[null,"AGETOP_I",12,"ELETRICISTA","h     ",8,13.95,16.16,111.6,129.28]
[null,"MÃO DE OBRA (B) - TOTAL",null,null,null,null,null,null,181.6,210.4]
[null,"COTAÇÃO","COT 092_SEE","CENTRAL DE DETECÇÃO E ALARME DE 40 SETORES COM BATERIA (PREÇO MÉDIO)","UN",1,963.33333333333337,963.33333333333337,963.33,963.33]
[null,"MATERIAL (C) - TOTAL",null,null,null,null,null,null,963.33,963.33]
[]
[24,"FONTE","CÓDIGO","DESCRIÇÃO","UNIDADE","COEFIC.","CUSTO UNITÁRIO",null,"CUSTO  TOTAL (A) + (B) + (C) + (D) + (E)"]
[null,null,null,null,null,null,"DESONERADO","NÃO DESONER.","DESONERADO","NÃO DESONER."]
[null,"COMPOSIÇÃO","COMP 024_SEE","SINALIZADOR FOTOLUMINESCENTE PARA EXTINTOR","UN ",null,"-","-",25.319999999999997,25.439999999999998]
[null,"AGETOP_I",5,"SERVENTE","h     ",0.09,8.75,10.14,0.79,0.91]
[null,"MÃO DE OBRA (B) - TOTAL",null,null,null,null,null,null,0.79,0.91]
[null,"AGETOP_I",3070,"BUCHA DE NYLON S-6","un",2,0.04,0.04,0.08,0.08]
[null,"AGETOP_I",3393,"PARAFUSO P/BUCHA S-6","un",2,0.08,0.08,0.16,0.16]
[null,"SINAPI_I",37556,"PLACA DE SINALIZACAO DE SEGURANCA CONTRA INCENDIO, FOTOLUMINESCENTE, QUADRADA, *20 X 20* CM, EM PVC *2* MM ANTI-CHAMAS (SIMBOLOS, CORES E PICTOGRAMAS CONFORME NBR 13434)","UN    ",1,24.29,24.29,24.29,24.29]
[null,"MATERIAL (C) - TOTAL",null,null,null,null,null,null,24.529999999999998,24.529999999999998]
[]
[25,"FONTE","CÓDIGO","DESCRIÇÃO","UNIDADE","COEFIC.","CUSTO UNITÁRIO",null,"CUSTO  TOTAL (A) + (B) + (C) + (D) + (E)"]
[null,null,null,null,null,null,"DESONERADO","NÃO DESONER.","DESONERADO","NÃO DESONER."]
[null,"COMPOSIÇÃO","COMP 025_SEE","SINALIZADOR FOTOLUMINESCENTE DE EMERGÊNCIA","UN ",null,"-","-",25.319999999999997,25.439999999999998]
[null,"AGETOP_I",5,"SERVENTE","h     ",0.09,8.75,10.14,0.79,0.91]
[null,"MÃO DE OBRA (B) - TOTAL",null,null,null,null,null,null,0.79,0.91]
[null,"AGETOP_I",3070,"BUCHA DE NYLON S-6","un",2,0.04,0.04,0.08,0.08]
[null,"AGETOP_I",3393,"PARAFUSO P/BUCHA S-6","un",2,0.08,0.08,0.16,0.16]
[null,"SINAPI_I",37556,"PLACA DE SINALIZACAO DE SEGURANCA CONTRA INCENDIO, FOTOLUMINESCENTE, QUADRADA, *20 X 20* CM, EM PVC *2* MM ANTI-CHAMAS (SIMBOLOS, CORES E PICTOGRAMAS CONFORME NBR 13434)","UN    ",1,24.29,24.29,24.29,24.29]
[null,"MATERIAL (C) - TOTAL",null,null,null,null,null,null,24.529999999999998,24.529999999999998]
[]
[277,"FONTE","CÓDIGO","DESCRIÇÃO","UNIDADE","COEFIC.","CUSTO UNITÁRIO",null,"CUSTO  TOTAL (A) + (B) + (C) + (D) + (E)"]
[null,null,null,null,null,null,"DESONERADO","NÃO DESONER.","DESONERADO","NÃO DESONER."]
[null,"COMPOSIÇÃO","COMP 277_SEE","MARCAÇÃO NO PISO - 1X1 M PARA EXTINTOR","M2",null,null,null,29.69,29.76]
[null,"AGETOP_I",5,"SERVENTE","h     ",3.3300000000000003E-2,8.75,10.14,0.28999999999999998,0.34]
[null,"MÃO DE OBRA (B) - TOTAL",null,null,null,null,null,null,0.28999999999999998,0.34]
[null,"SINAPI_I",5318,"SOLVENTE DILUENTE A BASE DE AGUARRAS","L     ",0.13,11.98,11.98,1.56,1.56]
[null,"SINAPI",5824,"CAMINHÃO TOCO, PBT 16.000 KG, CARGA ÚTIL MÁX. 10.685 KG, DIST. ENTRE EIXOS 4,8 M, POTÊNCIA 189 CV, INCLUSIVE CARROCERIA FIXA ABERTA DE MADEIRA P/ TRANSPORTE GERAL DE CARGA SECA, DIMEN. APROX. 2,5 X 7,00 X 0,50 M - CHP DIURNO. AF_06/2014","CHP",3.3E-3,115.5,118.69,0.38,0.39]
[null,"SINAPI_I",7343,"TINTA A BASE DE RESINA ACRILICA, PARA SINALIZACAO HORIZONTAL VIARIA (NBR 11862)","L     ",0.6,12.82,12.82,7.69,7.69]
[null,"SINAPI_I",7348,"TINTA ACRILICA PREMIUM PARA PISO","L     ",0.03,13.96,13.96,0.42,0.42]
[null,"SINAPI_I",25972,"MICROESFERAS DE VIDRO PARA SINALIZACAO HORIZONTAL VIARIA, TIPO I-B (PREMIX) - NBR 16184","KG    ",2.14,8.8800000000000008,8.8800000000000008,19,19]
[null,"SINAPI",95133,"MÁQUINA DEMARCADORA DE FAIXA DE TRÁFEGO À FRIO, AUTOPROPELIDA, POTÊNCIA 38 HP - CHP DIURNO. AF_07/2016","CHP",3.3E-3,105.93,109.48,0.35,0.36]
[null,"MATERIAL (C) - TOTAL",null,null,null,null,null,null,29.400000000000002,29.42]