{"text_format":"1","workbook":"xlsx","n_sheets":8,"sheets":["Orçamento","Resumo ","Somatório","Cronog_45_Dias","Composição BDI","Relatório CENTRAL","Parc Maior Relev","Composições"],"not_rendered":{"charts":0,"images":4,"macros":1,"external_links":0,"defined_names":104,"comments":2,"pivot_tables":0},"unopened":[],"bounds":{"document_bytes":16777216,"sheet_cells":100000,"rows_first":2000,"rows_last":500,"rows_between":2000,"halvings":0,"cell_chars":16384,"cell_head_chars":4096},"cells_cut":0,"cells_raw":0,"read":"whole","date_system":"1900"}

{"sheet":"Orçamento","index":0,"n_rows":365,"n_cols":27,"rows_kept":365,"cut":false,"hidden":false,"merged":[[12,23,12,25],[11,23,11,25],[9,19,9,22],[334,23,334,25],[335,23,335,25],[336,23,336,25],[332,23,332,25],[307,23,307,25],[308,23,308,25],[309,23,309,25],[310,23,310,25],[311,23,311,25],[312,23,312,25],[313,23,313,25],[314,23,314,25],[315,23,315,25],[316,23,316,25],[317,23,317,25],[318,23,318,25],[319,23,319,25],[320,23,320,25],[321,23,321,25],[322,23,322,25],[323,23,323,25],[355,23,355,25],[356,23,356,25],[357,23,357,25],[340,23,340,25],[341,23,341,25],[342,23,342,25],[343,23,343,25],[344,23,344,25],[345,23,345,25],[346,23,346,25],[347,23,347,25],[348,23,348,25],[349,23,349,25],[350,23,350,25],[351,23,351,25],[352,23,352,25],[353,23,353,25],[354,23,354,25],[8,12,9,12],[335,18,335,22],[0,14,0,24],[8,14,8,16],[9,14,9,16],[11,14,11,16],[12,14,12,16],[14,14,14,24],[1,14,1,24],[4,14,4,24],[7,14,7,24],[319,18,319,22],[316,15,316,17],[317,15,317,17],[318,15,318,17],[328,18,328,22],[326,18,326,22],[289,23,289,24],[334,18,334,22],[321,18,321,22],[314,18,314,22],[328,15,328,17],[329,15,329,17],[330,15,330,17],[336,18,336,22],[312,18,312,22],[313,18,313,22],[311,18,311,22],[320,18,320,22],[302,18,302,24],[308,18,308,22],[309,18,309,22],[310,18,310,22],[333,18,333,22],[331,18,331,22],[332,18,332,22],[322,18,322,22],[329,18,329,22],[325,18,325,22],[327,18,327,22],[323,18,323,22],[324,18,324,22],[333,23,333,25],[327,23,327,25],[328,23,328,25],[329,23,329,25],[330,23,330,25],[331,23,331,25],[331,15,331,17],[332,15,332,17],[305,14,305,26],[289,17,294,17],[306,18,306,22],[307,18,307,22],[315,18,315,22],[316,18,316,22],[317,18,317,22],[318,18,318,22],[330,18,330,22],[327,15,327,17],[307,15,307,17],[308,15,308,17],[309,15,309,17],[310,15,310,17],[311,15,311,17],[312,15,312,17],[313,15,313,17],[314,15,314,17],[315,15,315,17],[324,23,324,25],[325,23,325,25],[326,23,326,25],[321,15,321,17],[322,15,322,17],[323,15,323,17],[324,15,324,17],[325,15,325,17],[326,15,326,17],[300,16,300,24],[290,23,290,24],[291,23,291,24],[306,23,306,25],[342,15,342,17],[342,18,342,22],[297,16,297,24],[298,16,298,24],[299,16,299,24],[10,14,10,26],[13,14,13,26],[2,14,2,22],[3,14,3,22],[5,18,5,22],[6,18,6,22],[11,18,11,22],[12,18,12,22],[6,14,6,17],[5,14,5,17],[3,23,3,25],[2,23,2,25],[5,23,5,25],[6,23,6,25],[301,16,301,24],[8,18,8,20],[319,15,319,17],[320,15,320,17],[364,18,364,22],[361,14,361,17],[358,15,358,17],[358,18,358,22],[359,15,359,17],[359,18,359,22],[360,15,360,17],[360,18,360,22],[363,18,363,22],[362,18,362,22],[358,23,358,25],[359,23,359,25],[360,23,360,25],[361,23,361,25],[362,23,362,25],[363,23,363,25],[364,23,364,25],[333,14,333,17],[340,15,340,17],[306,15,306,17],[361,18,361,22],[349,15,349,17],[349,18,349,22],[350,15,350,17],[350,18,350,22],[351,15,351,17],[351,18,351,22],[355,15,355,17],[355,18,355,22],[356,15,356,17],[356,18,356,22],[357,15,357,17],[346,15,346,17],[357,18,357,22],[352,15,352,17],[352,18,352,22],[353,15,353,17],[353,18,353,22],[354,15,354,17],[354,18,354,22],[9,24,9,25],[8,23,8,25],[346,18,346,22],[347,15,347,17],[347,18,347,22],[348,15,348,17],[348,18,348,22],[343,15,343,17],[343,18,343,22],[344,15,344,17],[344,18,344,22],[345,15,345,17],[345,18,345,22],[339,14,339,26],[340,18,340,22],[341,15,341,17],[341,18,341,22]]}
[]
[]
[null,null,null,null,null,null,null,null,null,null,null,null,null,null,"UNIDADE ESCOLAR",null,null,null,null,null,null,null,null,"CÓDIGO INEP"]
[null,null,null,null,null,null,null,null,null,null,null,null,null,null,"CENTRO DE ENSINO EM PERÍODO INTEGRAL DRº ARY RIBEIRO VALADÃO FILHO",null,null,null,null,null,null,null,null,52024180]
[]
["Nmax",null,null,null,null,null,null,null,null,null,null,null,"Ajustar altura?",null,"OBRA",null,null,null,"DATA",null,null,null,null,"CIDADE"]
[{"$f":"MAX($C$18:$C$289)","v":4},null,null,null,null,null,null,null,null,null,null,null,"NÃO",null,"REFORMA E AMPLIAÇÃO",null,null,null,"2020-05-13",null,null,null,null,"ITAGUARU"]
[]
[null,null,null,null,null,null,null,null,null,null,null,null,"",null,"CRE",null,null,"ENDEREÇO","REFERÊNCIA AGETOP",null,null,null,null,"REFERÊNCIA SINAPI"]
[null,null,null,null,null,null,null,null,null,null,null,null,null,null,"CRE-ITABERAI",null,null," R. BENIGNO PINTO DE FARIA 1068 , CENTRO , CEP: 7666-000","ABR/19","DESONERADA",null,null,null,"FEV/20","DESONERADA"]
[]
[null,null,null,null,null,null,null,null,null,null,null,null,null,null,"ÁREA EXISTENTE (M²)",null,null,"ÁREA A CONSTRUIR (M²)","ÁREA A DEMOLIR (M²)",null,null,null,null,"ÁREA TOTAL CONSTRUÍDA (M²)"]
[null,null,null,null,null,null,null,null,null,null,null,null,null,null,1171.17,null,null,91.19,null,null,null,null,null,1262.3600000000001]
[]
[null,null,null,null,null,null,null,null,null,null,null,"FILTRO",null,null,"PLANILHA ORÇAMENTÁRIA"]
["Nível E","Save Nivel","Nível C","Altura","n1","n2","n3","n4","n5","Czero","Cnível","↓","Nível","Nível Corrigido","ITEM","TABELA","CODIGO","DESCRIÇÃO DOS SERVIÇOS","UNID","QUANT","REPET","QUANT TOTAL","MAT","MO","T.SERVIÇO UNIT","VALOR TOTAL","OBSERVAÇÕES¹"]
[{"$f":"CHOOSE(1+LOG(1+2*(ORÇAMENTO.Nivel=\"Nível 1\")+4*(ORÇAMENTO.Nivel=\"Nível 2\")+8*(ORÇAMENTO.Nivel=\"Nível 3\")+16*(ORÇAMENTO.Nivel=\"Nível 4\")+32*(ORÇAMENTO.Nivel=\"Serviço\"),2),0,1,2,3,4,\"S\")","v":"S"},{"$f":"IF(OR(C17=\"s\",C17=0),OFFSET(B17,-1,0),C17)","v":"Save Nivel"},{"$f":"IF(OFFSET(C17,-1,0)=\"L\",1,IF(OFFSET(C17,-1,0)=1,2,IF(OR(A17=\"s\",A17=0),\"S\",IF(AND(OFFSET(C17,-1,0)=2,A17=4),3,IF(AND(OR(OFFSET(C17,-1,0)=\"s\",OFFSET(C17,-1,0)=0),A17<>\"s\",A17>OFFSET(B17,-1,0)),OFFSET(B17,-1,0),A17)))))","v":"S"},{"$f":"IF(OR(C17=\"S\",C17=0),0,IF(ISERROR(K17),J17,SMALL(J17:K17,1)))","v":0},{"$f":"IF($C17=1,OFFSET(E17,-1,0)+1,OFFSET(E17,-1,0))","v":"n1"},{"$f":"IF($C17=1,0,IF($C17=2,OFFSET(F17,-1,0)+1,OFFSET(F17,-1,0)))","v":"n2"},{"$f":"IF(AND($C17<=2,$C17<>0),0,IF($C17=3,OFFSET(G17,-1,0)+1,OFFSET(G17,-1,0)))","v":"n3"},{"$f":"IF(AND($C17<=3,$C17<>0),0,IF($C17=4,OFFSET(H17,-1,0)+1,OFFSET(H17,-1,0)))","v":"n4"},{"$f":"IF(AND($C17<=4,$C17<>0),0,IF(AND($C17=\"S\",$Y17>0),OFFSET(I17,-1,0)+1,OFFSET(I17,-1,0)))","v":"n5"},{"$f":"IF(OR($C17=\"S\",$C17=0),0,MATCH(0,OFFSET($D17,1,$C17,ROW($C$289)-ROW($C17)),0))","v":0},{"$f":"IF(OR($C17=\"S\",$C17=0),0,MATCH(OFFSET($D17,0,$C17)+1,OFFSET($D17,1,$C17,ROW($C$289)-ROW($C17)),0))","v":0},"","Serviço","Serviço","-","SINAPI",null,"(sem código)","-",null,"REPET","-",0,0,0,"-",""]
[0,null,"L",{"$f":"COUNTA(OFFSET(D18,1,0):D$289)","v":270},{"$f":"LEFT(O19,1)-1","v":0},null,null,null,null,null,null,"F","LOTE","LOTE","REFORMA E AMPLIAÇÃO - CENTRO DE ENSINO EM PERÍODO INTEGRAL DRº ARY RIBEIRO VALADÃO FILHO",null,null,null,null,null,null,null,null,null,null,0]
[1,{"$f":"IF(OR(C19=\"s\",C19=0),OFFSET(B19,-1,0),C19)","v":1},{"$f":"IF(OFFSET(C19,-1,0)=\"L\",1,IF(OFFSET(C19,-1,0)=1,2,IF(OR(A19=\"s\",A19=0),\"S\",IF(AND(OFFSET(C19,-1,0)=2,A19=4),3,IF(AND(OR(OFFSET(C19,-1,0)=\"s\",OFFSET(C19,-1,0)=0),A19<>\"s\",A19>OFFSET(B19,-1,0)),OFFSET(B19,-1,0),A19)))))","v":1},{"$f":"IF(OR(C19=\"S\",C19=0),0,IF(ISERROR(K19),J19,SMALL(J19:K19,1)))","v":157},{"$f":"IF($C19=1,OFFSET(E19,-1,0)+1,OFFSET(E19,-1,0))","v":1},{"$f":"IF($C19=1,0,IF($C19=2,OFFSET(F19,-1,0)+1,OFFSET(F19,-1,0)))","v":0},{"$f":"IF(AND($C19<=2,$C19<>0),0,IF($C19=3,OFFSET(G19,-1,0)+1,OFFSET(G19,-1,0)))","v":0},{"$f":"IF(AND($C19<=3,$C19<>0),0,IF($C19=4,OFFSET(H19,-1,0)+1,OFFSET(H19,-1,0)))","v":0},0,{"$f":"IF(OR($C19=\"S\",$C19=0),0,MATCH(0,OFFSET($D19,1,$C19,ROW($C$289)-ROW($C19)),0))","v":270},{"$f":"IF(OR($C19=\"S\",$C19=0),0,MATCH(OFFSET($D19,0,$C19)+1,OFFSET($D19,1,$C19,ROW($C$289)-ROW($C19)),0))","v":157},"F","Nível 1","Nível 1","1.","AGETOP",null,"REFORMA E AMPLIAÇÃO","UN",1,1,1,null,null,0,0]
[2,{"$f":"IF(OR(C20=\"s\",C20=0),OFFSET(B20,-1,0),C20)","v":2},{"$f":"IF(OFFSET(C20,-1,0)=\"L\",1,IF(OFFSET(C20,-1,0)=1,2,IF(OR(A20=\"s\",A20=0),\"S\",IF(AND(OFFSET(C20,-1,0)=2,A20=4),3,IF(AND(OR(OFFSET(C20,-1,0)=\"s\",OFFSET(C20,-1,0)=0),A20<>\"s\",A20>OFFSET(B20,-1,0)),OFFSET(B20,-1,0),A20)))))","v":2},{"$f":"IF(OR(C20=\"S\",C20=0),0,IF(ISERROR(K20),J20,SMALL(J20:K20,1)))","v":20},{"$f":"IF($C20=1,OFFSET(E20,-1,0)+1,OFFSET(E20,-1,0))","v":1},{"$f":"IF($C20=1,0,IF($C20=2,OFFSET(F20,-1,0)+1,OFFSET(F20,-1,0)))","v":1},{"$f":"IF(AND($C20<=2,$C20<>0),0,IF($C20=3,OFFSET(G20,-1,0)+1,OFFSET(G20,-1,0)))","v":0},{"$f":"IF(AND($C20<=3,$C20<>0),0,IF($C20=4,OFFSET(H20,-1,0)+1,OFFSET(H20,-1,0)))","v":0},0,{"$f":"IF(OR($C20=\"S\",$C20=0),0,MATCH(0,OFFSET($D20,1,$C20,ROW($C$289)-ROW($C20)),0))","v":156},{"$f":"IF(OR($C20=\"S\",$C20=0),0,MATCH(OFFSET($D20,0,$C20)+1,OFFSET($D20,1,$C20,ROW($C$289)-ROW($C20)),0))","v":20},"","Nível 2","Nível 2","-","AGETOP",null,"SERVIÇOS PRELIMINARES","-",null,1,"-",null,null,0,0]
[{"$f":"CHOOSE(1+LOG(1+2*(ORÇAMENTO.Nivel=\"Nível 1\")+4*(ORÇAMENTO.Nivel=\"Nível 2\")+8*(ORÇAMENTO.Nivel=\"Nível 3\")+16*(ORÇAMENTO.Nivel=\"Nível 4\")+32*(ORÇAMENTO.Nivel=\"Serviço\"),2),0,1,2,3,4,\"S\")","v":3},3,3,19,1,1,1,0,0,{"$f":"IF(OR($C21=\"S\",$C21=0),0,MATCH(0,OFFSET($D21,1,$C21,ROW($C$289)-ROW($C21)),0))","v":19},{"$f":"IF(OR($C21=\"S\",$C21=0),0,MATCH(OFFSET($D21,0,$C21)+1,OFFSET($D21,1,$C21,ROW($C$289)-ROW($C21)),0))","v":30},"","Nível 3","Nível 3","-","SINAPI",null,"OUTROS","-",null,1,"-",0,0,0,0,""]
[4,4,4,7,1,1,1,1,0,{"$f":"IF(OR($C22=\"S\",$C22=0),0,MATCH(0,OFFSET($D22,1,$C22,ROW($C$289)-ROW($C22)),0))","v":18},{"$f":"IF(OR($C22=\"S\",$C22=0),0,MATCH(OFFSET($D22,0,$C22)+1,OFFSET($D22,1,$C22,ROW($C$289)-ROW($C22)),0))","v":7},"","Nível 4","Nível 4","-","SINAPI",null,"IMPLANTAÇÃO PÁTIO MULTIUSO","-",null,1,"-",0,0,0,0,""]
[{"$f":"CHOOSE(1+LOG(1+2*(ORÇAMENTO.Nivel=\"Nível 1\")+4*(ORÇAMENTO.Nivel=\"Nível 2\")+8*(ORÇAMENTO.Nivel=\"Nível 3\")+16*(ORÇAMENTO.Nivel=\"Nível 4\")+32*(ORÇAMENTO.Nivel=\"Serviço\"),2),0,1,2,3,4,\"S\")","v":"S"},4,"S",0,1,1,1,1,0,{"$f":"IF(OR($C23=\"S\",$C23=0),0,MATCH(0,OFFSET($D23,1,$C23,ROW($C$289)-ROW($C23)),0))","v":0},{"$f":"IF(OR($C23=\"S\",$C23=0),0,MATCH(OFFSET($D23,0,$C23)+1,OFFSET($D23,1,$C23,ROW($C$289)-ROW($C23)),0))","v":0},"","Serviço","Serviço","-","AGETOP",20109,"DEM.PISO CIMENT.SOBRE LASTRO CONC.C/TR.ATE CB. E CARGA","m2    ",125,1,125,null,null,0,0,""]
["S",4,"S",0,1,1,1,1,0,{"$f":"IF(OR($C24=\"S\",$C24=0),0,MATCH(0,OFFSET($D24,1,$C24,ROW($C$289)-ROW($C24)),0))","v":0},{"$f":"IF(OR($C24=\"S\",$C24=0),0,MATCH(OFFSET($D24,0,$C24)+1,OFFSET($D24,1,$C24,ROW($C$289)-ROW($C24)),0))","v":0},"","Serviço","Serviço","-","SINAPI",97622,"DEMOLIÇÃO DE ALVENARIA DE BLOCO FURADO, DE FORMA MANUAL, SEM REAPROVEITAMENTO. AF_12/2017","M3",3.21,1,3.21,null,null,0,0,"Referência: AGETOP - 20118"]
["S",4,"S",0,1,1,1,1,0,{"$f":"IF(OR($C25=\"S\",$C25=0),0,MATCH(0,OFFSET($D25,1,$C25,ROW($C$289)-ROW($C25)),0))","v":0},{"$f":"IF(OR($C25=\"S\",$C25=0),0,MATCH(OFFSET($D25,0,$C25)+1,OFFSET($D25,1,$C25,ROW($C$289)-ROW($C25)),0))","v":0},"","Serviço","Serviço","-","AGETOP",20102,"DEMOLICAO-COBERTURA TELHA FIBROCIMENTO/FIBRA DE VIDRO/SIMILARES C/ TRANSP. ATÉ CB. E CARGA","m2    ",21.62,1,21.62,null,null,0,0,""]
["S",4,"S",0,1,1,1,1,0,{"$f":"IF(OR($C26=\"S\",$C26=0),0,MATCH(0,OFFSET($D26,1,$C26,ROW($C$289)-ROW($C26)),0))","v":0},{"$f":"IF(OR($C26=\"S\",$C26=0),0,MATCH(OFFSET($D26,0,$C26)+1,OFFSET($D26,1,$C26,ROW($C$289)-ROW($C26)),0))","v":0},"","Serviço","Serviço","-","SINAPI",98533,"PODA EM ALTURA DE ÁRVORE COM DIÂMETRO DE TRONCO MAIOR OU IGUAL A 0,20 M E MENOR QUE 0,40 M.AF_05/2018","UN",3,1,3,null,null,0,0,""]
["S",4,"S",0,1,1,1,1,0,{"$f":"IF(OR($C27=\"S\",$C27=0),0,MATCH(0,OFFSET($D27,1,$C27,ROW($C$289)-ROW($C27)),0))","v":0},{"$f":"IF(OR($C27=\"S\",$C27=0),0,MATCH(OFFSET($D27,0,$C27)+1,OFFSET($D27,1,$C27,ROW($C$289)-ROW($C27)),0))","v":0},"","Serviço","Serviço","-","SINAPI",98529,"CORTE RASO E RECORTE DE ÁRVORE COM DIÂMETRO DE TRONCO MAIOR OU IGUAL A 0,20 M E MENOR QUE 0,40 M.AF_05/2018","UN",3,1,3,null,null,0,0,""]
["S",4,"S",0,1,1,1,1,0,{"$f":"IF(OR($C28=\"S\",$C28=0),0,MATCH(0,OFFSET($D28,1,$C28,ROW($C$289)-ROW($C28)),0))","v":0},{"$f":"IF(OR($C28=\"S\",$C28=0),0,MATCH(OFFSET($D28,0,$C28)+1,OFFSET($D28,1,$C28,ROW($C$289)-ROW($C28)),0))","v":0},"","Serviço","Serviço","-","SINAPI",98526,"REMOÇÃO DE RAÍZES REMANESCENTES DE TRONCO DE ÁRVORE COM DIÂMETRO MAIOR OU IGUAL A 0,20 M E MENOR QUE 0,40 M.AF_05/2018","UN",3,1,3,null,null,0,0,""]
[4,4,4,2,1,1,1,2,0,{"$f":"IF(OR($C29=\"S\",$C29=0),0,MATCH(0,OFFSET($D29,1,$C29,ROW($C$289)-ROW($C29)),0))","v":11},{"$f":"IF(OR($C29=\"S\",$C29=0),0,MATCH(OFFSET($D29,0,$C29)+1,OFFSET($D29,1,$C29,ROW($C$289)-ROW($C29)),0))","v":2},"","Nível 4","Nível 4","-","SINAPI",null,"BLOCO 01 E PÁTIO COBERTO","-",null,1,"-",null,null,0,0,""]
["S",4,"S",0,1,1,1,2,0,{"$f":"IF(OR($C30=\"S\",$C30=0),0,MATCH(0,OFFSET($D30,1,$C30,ROW($C$289)-ROW($C30)),0))","v":0},{"$f":"IF(OR($C30=\"S\",$C30=0),0,MATCH(OFFSET($D30,0,$C30)+1,OFFSET($D30,1,$C30,ROW($C$289)-ROW($C30)),0))","v":0},"","Serviço","Serviço","-","AGETOP",20109,"DEM.PISO CIMENT.SOBRE LASTRO CONC.C/TR.ATE CB. E CARGA","m2    ",234,1,234,null,null,0,0,""]
[4,4,4,5,1,1,1,3,0,{"$f":"IF(OR($C31=\"S\",$C31=0),0,MATCH(0,OFFSET($D31,1,$C31,ROW($C$289)-ROW($C31)),0))","v":9},{"$f":"IF(OR($C31=\"S\",$C31=0),0,MATCH(OFFSET($D31,0,$C31)+1,OFFSET($D31,1,$C31,ROW($C$289)-ROW($C31)),0))","v":5},"","Nível 4","Nível 4","-","SINAPI",null,"PÁTIO DESCOBERTO FRONTAL","-",null,1,"-",null,null,0,0,""]
["S",4,"S",0,1,1,1,3,0,{"$f":"IF(OR($C32=\"S\",$C32=0),0,MATCH(0,OFFSET($D32,1,$C32,ROW($C$289)-ROW($C32)),0))","v":0},{"$f":"IF(OR($C32=\"S\",$C32=0),0,MATCH(OFFSET($D32,0,$C32)+1,OFFSET($D32,1,$C32,ROW($C$289)-ROW($C32)),0))","v":0},"","Serviço","Serviço","-","AGETOP",20109,"DEM.PISO CIMENT.SOBRE LASTRO CONC.C/TR.ATE CB. E CARGA","m2    ",55.38,1,55.38,null,null,0,0,""]
["S",4,"S",0,1,1,1,3,0,{"$f":"IF(OR($C33=\"S\",$C33=0),0,MATCH(0,OFFSET($D33,1,$C33,ROW($C$289)-ROW($C33)),0))","v":0},{"$f":"IF(OR($C33=\"S\",$C33=0),0,MATCH(OFFSET($D33,0,$C33)+1,OFFSET($D33,1,$C33,ROW($C$289)-ROW($C33)),0))","v":0},"","Serviço","Serviço","-","SINAPI",98533,"PODA EM ALTURA DE ÁRVORE COM DIÂMETRO DE TRONCO MAIOR OU IGUAL A 0,20 M E MENOR QUE 0,40 M.AF_05/2018","UN",1,1,1,null,null,0,0,""]
["S",{"$f":"IF(OR(C34=\"s\",C34=0),OFFSET(B34,-1,0),C34)","v":4},{"$f":"IF(OFFSET(C34,-1,0)=\"L\",1,IF(OFFSET(C34,-1,0)=1,2,IF(OR(A34=\"s\",A34=0),\"S\",IF(AND(OFFSET(C34,-1,0)=2,A34=4),3,IF(AND(OR(OFFSET(C34,-1,0)=\"s\",OFFSET(C34,-1,0)=0),A34<>\"s\",A34>OFFSET(B34,-1,0)),OFFSET(B34,-1,0),A34)))))","v":"S"},{"$f":"IF(OR(C34=\"S\",C34=0),0,IF(ISERROR(K34),J34,SMALL(J34:K34,1)))","v":0},{"$f":"IF($C34=1,OFFSET(E34,-1,0)+1,OFFSET(E34,-1,0))","v":1},{"$f":"IF($C34=1,0,IF($C34=2,OFFSET(F34,-1,0)+1,OFFSET(F34,-1,0)))","v":1},{"$f":"IF(AND($C34<=2,$C34<>0),0,IF($C34=3,OFFSET(G34,-1,0)+1,OFFSET(G34,-1,0)))","v":1},{"$f":"IF(AND($C34<=3,$C34<>0),0,IF($C34=4,OFFSET(H34,-1,0)+1,OFFSET(H34,-1,0)))","v":3},{"$f":"IF(AND($C34<=4,$C34<>0),0,IF(AND($C34=\"S\",$Y34>0),OFFSET(I34,-1,0)+1,OFFSET(I34,-1,0)))","v":0},{"$f":"IF(OR($C34=\"S\",$C34=0),0,MATCH(0,OFFSET($D34,1,$C34,ROW($C$289)-ROW($C34)),0))","v":0},{"$f":"IF(OR($C34=\"S\",$C34=0),0,MATCH(OFFSET($D34,0,$C34)+1,OFFSET($D34,1,$C34,ROW($C$289)-ROW($C34)),0))","v":0},"","Serviço","Serviço","-","SINAPI",98529,"CORTE RASO E RECORTE DE ÁRVORE COM DIÂMETRO DE TRONCO MAIOR OU IGUAL A 0,20 M E MENOR QUE 0,40 M.AF_05/2018","UN",1,1,1,null,null,0,0,""]
["S",4,"S",0,1,1,1,3,0,{"$f":"IF(OR($C35=\"S\",$C35=0),0,MATCH(0,OFFSET($D35,1,$C35,ROW($C$289)-ROW($C35)),0))","v":0},{"$f":"IF(OR($C35=\"S\",$C35=0),0,MATCH(OFFSET($D35,0,$C35)+1,OFFSET($D35,1,$C35,ROW($C$289)-ROW($C35)),0))","v":0},"","Serviço","Serviço","-","SINAPI",98526,"REMOÇÃO DE RAÍZES REMANESCENTES DE TRONCO DE ÁRVORE COM DIÂMETRO MAIOR OU IGUAL A 0,20 M E MENOR QUE 0,40 M.AF_05/2018","UN",1,1,1,null,null,0,0,""]
[4,4,4,2,1,1,1,4,0,{"$f":"IF(OR($C36=\"S\",$C36=0),0,MATCH(0,OFFSET($D36,1,$C36,ROW($C$289)-ROW($C36)),0))","v":4},{"$f":"IF(OR($C36=\"S\",$C36=0),0,MATCH(OFFSET($D36,0,$C36)+1,OFFSET($D36,1,$C36,ROW($C$289)-ROW($C36)),0))","v":2},"","Nível 4","Nível 4","-","SINAPI",null,"CENTRAL DE GÁS","-",null,1,"-",null,null,0,0,""]
["S",4,"S",0,1,1,1,4,0,{"$f":"IF(OR($C37=\"S\",$C37=0),0,MATCH(0,OFFSET($D37,1,$C37,ROW($C$289)-ROW($C37)),0))","v":0},{"$f":"IF(OR($C37=\"S\",$C37=0),0,MATCH(OFFSET($D37,0,$C37)+1,OFFSET($D37,1,$C37,ROW($C$289)-ROW($C37)),0))","v":0},"","Serviço","Serviço","-","AGETOP",20109,"DEM.PISO CIMENT.SOBRE LASTRO CONC.C/TR.ATE CB. E CARGA","m2    ",3.5,1,3.5,null,null,0,0,""]
[4,4,4,2,1,1,1,5,0,{"$f":"IF(OR($C38=\"S\",$C38=0),0,MATCH(0,OFFSET($D38,1,$C38,ROW($C$289)-ROW($C38)),0))","v":2},{"$f":"IF(OR($C38=\"S\",$C38=0),0,MATCH(OFFSET($D38,0,$C38)+1,OFFSET($D38,1,$C38,ROW($C$289)-ROW($C38)),0))","v":{"$error":"#N/A"}},"","Nível 4","Nível 4","-","SINAPI",null,"PLACA","-",null,1,"-",null,null,0,0,""]
["S",4,"S",0,1,1,1,5,0,{"$f":"IF(OR($C39=\"S\",$C39=0),0,MATCH(0,OFFSET($D39,1,$C39,ROW($C$289)-ROW($C39)),0))","v":0},{"$f":"IF(OR($C39=\"S\",$C39=0),0,MATCH(OFFSET($D39,0,$C39)+1,OFFSET($D39,1,$C39,ROW($C$289)-ROW($C39)),0))","v":0},"","Serviço","Serviço","-","AGETOP",21301,"PLACA DE OBRA PLOTADA EM CHAPA METÁLICA 26 , AFIXADA EM CAVALETES DE MADEIRA DE LEI (VIGOTAS 6X12CM) - PADRÃO GOINFRA","m2    ",7.5,1,7.5,null,null,0,0,""]
[2,2,2,3,1,2,0,0,0,{"$f":"IF(OR($C40=\"S\",$C40=0),0,MATCH(0,OFFSET($D40,1,$C40,ROW($C$289)-ROW($C40)),0))","v":136},{"$f":"IF(OR($C40=\"S\",$C40=0),0,MATCH(OFFSET($D40,0,$C40)+1,OFFSET($D40,1,$C40,ROW($C$289)-ROW($C40)),0))","v":3},"","Nível 2","Nível 2","-","AGETOP",null,"TRANSPORTES","-",null,1,"-",null,null,0,0,""]
["S",2,"S",0,1,2,0,0,0,{"$f":"IF(OR($C41=\"S\",$C41=0),0,MATCH(0,OFFSET($D41,1,$C41,ROW($C$289)-ROW($C41)),0))","v":0},{"$f":"IF(OR($C41=\"S\",$C41=0),0,MATCH(OFFSET($D41,0,$C41)+1,OFFSET($D41,1,$C41,ROW($C$289)-ROW($C41)),0))","v":0},"","Serviço","Serviço","-","SINAPI",72900,"TRANSPORTE DE ENTULHO COM CAMINHAO BASCULANTE 6 M3, RODOVIA PAVIMENTADA, DMT 0,5 A 1,0 KM","M3",25.61,1,25.61,null,null,0,0,""]
["S",2,"S",0,1,2,0,0,0,{"$f":"IF(OR($C42=\"S\",$C42=0),0,MATCH(0,OFFSET($D42,1,$C42,ROW($C$289)-ROW($C42)),0))","v":0},{"$f":"IF(OR($C42=\"S\",$C42=0),0,MATCH(OFFSET($D42,0,$C42)+1,OFFSET($D42,1,$C42,ROW($C$289)-ROW($C42)),0))","v":0},"","Serviço","Serviço","-","SINAPI",72897,"CARGA MANUAL DE ENTULHO EM CAMINHAO BASCULANTE 6 M3","M3",25.61,1,25.61,null,null,0,0,""]
[2,2,2,18,1,3,0,0,0,{"$f":"IF(OR($C43=\"S\",$C43=0),0,MATCH(0,OFFSET($D43,1,$C43,ROW($C$289)-ROW($C43)),0))","v":133},{"$f":"IF(OR($C43=\"S\",$C43=0),0,MATCH(OFFSET($D43,0,$C43)+1,OFFSET($D43,1,$C43,ROW($C$289)-ROW($C43)),0))","v":18},"","Nível 2","Nível 2","-","AGETOP",null,"SERVIÇO EM TERRA","-",null,1,"-",null,null,0,0,""]
[3,3,3,7,1,3,1,0,0,{"$f":"IF(OR($C44=\"S\",$C44=0),0,MATCH(0,OFFSET($D44,1,$C44,ROW($C$289)-ROW($C44)),0))","v":17},{"$f":"IF(OR($C44=\"S\",$C44=0),0,MATCH(OFFSET($D44,0,$C44)+1,OFFSET($D44,1,$C44,ROW($C$289)-ROW($C44)),0))","v":7},"","Nível 3","Nível 3","-",null,null,"AQUISIÇÃO DE TERRA (SOMENTE ATERRO)","-",null,1,"-",null,null,0,0,""]
[4,4,4,6,1,3,1,1,0,{"$f":"IF(OR($C45=\"S\",$C45=0),0,MATCH(0,OFFSET($D45,1,$C45,ROW($C$289)-ROW($C45)),0))","v":6},{"$f":"IF(OR($C45=\"S\",$C45=0),0,MATCH(OFFSET($D45,0,$C45)+1,OFFSET($D45,1,$C45,ROW($C$289)-ROW($C45)),0))","v":10},"","Nível 4","Nível 4","-","SINAPI",null,"PÁTIO DESCOBERTO FRONTAL","-",null,1,"-",null,null,0,0,""]
["S",4,"S",0,1,3,1,1,0,{"$f":"IF(OR($C46=\"S\",$C46=0),0,MATCH(0,OFFSET($D46,1,$C46,ROW($C$289)-ROW($C46)),0))","v":0},{"$f":"IF(OR($C46=\"S\",$C46=0),0,MATCH(OFFSET($D46,0,$C46)+1,OFFSET($D46,1,$C46,ROW($C$289)-ROW($C46)),0))","v":0},"","Serviço","Serviço","-","SINAPI",79480,"ESCAVACAO MECANICA CAMPO ABERTO EM SOLO EXCETO ROCHA ATE 2,00M PROFUNDIDADE","M3",0.88,1,0.88,null,null,0,0,"Referência: AGETOP - 41004"]
["S",4,"S",0,1,3,1,1,0,{"$f":"IF(OR($C47=\"S\",$C47=0),0,MATCH(0,OFFSET($D47,1,$C47,ROW($C$289)-ROW($C47)),0))","v":0},{"$f":"IF(OR($C47=\"S\",$C47=0),0,MATCH(OFFSET($D47,0,$C47)+1,OFFSET($D47,1,$C47,ROW($C$289)-ROW($C47)),0))","v":0},"","Serviço","Serviço","-","AGETOP",41005,"CARGA MECANIZADA","m3    ",0.88,1,0.88,null,null,0,0,""]
["S",4,"S",0,1,3,1,1,0,{"$f":"IF(OR($C48=\"S\",$C48=0),0,MATCH(0,OFFSET($D48,1,$C48,ROW($C$289)-ROW($C48)),0))","v":0},{"$f":"IF(OR($C48=\"S\",$C48=0),0,MATCH(OFFSET($D48,0,$C48)+1,OFFSET($D48,1,$C48,ROW($C$289)-ROW($C48)),0))","v":0},"","Serviço","Serviço","-","AGETOP",41012,"INDENIZAÇÃO DE JAZIDA","m3    ",0.88,1,0.88,null,null,0,0,""]
[{"$f":"CHOOSE(1+LOG(1+2*(ORÇAMENTO.Nivel=\"Nível 1\")+4*(ORÇAMENTO.Nivel=\"Nível 2\")+8*(ORÇAMENTO.Nivel=\"Nível 3\")+16*(ORÇAMENTO.Nivel=\"Nível 4\")+32*(ORÇAMENTO.Nivel=\"Serviço\"),2),0,1,2,3,4,\"S\")","v":"S"},4,"S",0,1,3,1,1,0,{"$f":"IF(OR($C49=\"S\",$C49=0),0,MATCH(0,OFFSET($D49,1,$C49,ROW($C$289)-ROW($C49)),0))","v":0},{"$f":"IF(OR($C49=\"S\",$C49=0),0,MATCH(OFFSET($D49,0,$C49)+1,OFFSET($D49,1,$C49,ROW($C$289)-ROW($C49)),0))","v":0},"","Serviço","Serviço","-","AGETOP",41006,"TRANSPORTE DE MATERIAL ESCAVADO M3.KM","m3km  ",8.8699999999999992,1,8.8699999999999992,null,null,0,0,""]
["S",4,"S",0,1,3,1,1,0,{"$f":"IF(OR($C50=\"S\",$C50=0),0,MATCH(0,OFFSET($D50,1,$C50,ROW($C$289)-ROW($C50)),0))","v":0},{"$f":"IF(OR($C50=\"S\",$C50=0),0,MATCH(OFFSET($D50,0,$C50)+1,OFFSET($D50,1,$C50,ROW($C$289)-ROW($C50)),0))","v":0},"","Serviço","Serviço","-","AGETOP",41009,"COMPACTAÇÃO MECÂNICA SEM CONTROLE LABORATÓRIO","m3    ",0.71,1,0.71,null,null,0,0,""]
[3,3,3,10,1,3,2,0,0,{"$f":"IF(OR($C51=\"S\",$C51=0),0,MATCH(0,OFFSET($D51,1,$C51,ROW($C$289)-ROW($C51)),0))","v":10},{"$f":"IF(OR($C51=\"S\",$C51=0),0,MATCH(OFFSET($D51,0,$C51)+1,OFFSET($D51,1,$C51,ROW($C$289)-ROW($C51)),0))","v":49},"","Nível 3","Nível 3","-",null,null,"OUTROS SERVIÇOS","-",null,1,"-",null,null,0,0,""]
[4,4,4,3,1,3,2,1,0,{"$f":"IF(OR($C52=\"S\",$C52=0),0,MATCH(0,OFFSET($D52,1,$C52,ROW($C$289)-ROW($C52)),0))","v":9},{"$f":"IF(OR($C52=\"S\",$C52=0),0,MATCH(OFFSET($D52,0,$C52)+1,OFFSET($D52,1,$C52,ROW($C$289)-ROW($C52)),0))","v":3},"","Nível 4","Nível 4","-","SINAPI",null,"IMPLANTAÇÃO PÁTIO MULTIUSO","-",null,1,"-",null,null,0,0,""]
["S",4,"S",0,1,3,2,1,0,{"$f":"IF(OR($C53=\"S\",$C53=0),0,MATCH(0,OFFSET($D53,1,$C53,ROW($C$289)-ROW($C53)),0))","v":0},{"$f":"IF(OR($C53=\"S\",$C53=0),0,MATCH(OFFSET($D53,0,$C53)+1,OFFSET($D53,1,$C53,ROW($C$289)-ROW($C53)),0))","v":0},"","Serviço","Serviço","-","AGETOP",41140,"REGULARIZAÇÃO DO TERRENO SEM APILOAMENTO COM TRANSPORTE MANUAL DA TERRA ESCAVADA ","m2    ",125,1,125,null,null,0,0,""]
["S",4,"S",0,1,3,2,1,0,{"$f":"IF(OR($C54=\"S\",$C54=0),0,MATCH(0,OFFSET($D54,1,$C54,ROW($C$289)-ROW($C54)),0))","v":0},{"$f":"IF(OR($C54=\"S\",$C54=0),0,MATCH(OFFSET($D54,0,$C54)+1,OFFSET($D54,1,$C54,ROW($C$289)-ROW($C54)),0))","v":0},"","Serviço","Serviço","-","AGETOP",41002,"APILOAMENTO","m2    ",125,1,125,null,null,0,0,""]
[4,4,4,3,1,3,2,2,0,{"$f":"IF(OR($C55=\"S\",$C55=0),0,MATCH(0,OFFSET($D55,1,$C55,ROW($C$289)-ROW($C55)),0))","v":6},{"$f":"IF(OR($C55=\"S\",$C55=0),0,MATCH(OFFSET($D55,0,$C55)+1,OFFSET($D55,1,$C55,ROW($C$289)-ROW($C55)),0))","v":3},"","Nível 4","Nível 4","-","SINAPI",null,"CENTRAL DE GÁS","-",null,1,"-",null,null,0,0,""]
["S",4,"S",0,1,3,2,2,0,{"$f":"IF(OR($C56=\"S\",$C56=0),0,MATCH(0,OFFSET($D56,1,$C56,ROW($C$289)-ROW($C56)),0))","v":0},{"$f":"IF(OR($C56=\"S\",$C56=0),0,MATCH(OFFSET($D56,0,$C56)+1,OFFSET($D56,1,$C56,ROW($C$289)-ROW($C56)),0))","v":0},"","Serviço","Serviço","-","SINAPI",79480,"ESCAVACAO MECANICA CAMPO ABERTO EM SOLO EXCETO ROCHA ATE 2,00M PROFUNDIDADE","M3",1.1000000000000001,1,1.1000000000000001,null,null,0,0,"Referência: AGETOP - 41004"]
["S",4,"S",0,1,3,2,2,0,{"$f":"IF(OR($C57=\"S\",$C57=0),0,MATCH(0,OFFSET($D57,1,$C57,ROW($C$289)-ROW($C57)),0))","v":0},{"$f":"IF(OR($C57=\"S\",$C57=0),0,MATCH(OFFSET($D57,0,$C57)+1,OFFSET($D57,1,$C57,ROW($C$289)-ROW($C57)),0))","v":0},"","Serviço","Serviço","-","AGETOP",40902,"REATERRO COM APILOAMENTO","m3    ",0.88,1,0.88,null,null,0,0,""]
[4,4,4,3,1,3,2,3,0,{"$f":"IF(OR($C58=\"S\",$C58=0),0,MATCH(0,OFFSET($D58,1,$C58,ROW($C$289)-ROW($C58)),0))","v":3},{"$f":"IF(OR($C58=\"S\",$C58=0),0,MATCH(OFFSET($D58,0,$C58)+1,OFFSET($D58,1,$C58,ROW($C$289)-ROW($C58)),0))","v":{"$error":"#N/A"}},"","Nível 4","Nível 4","-","SINAPI",null,"COMP. ELÉTRICO","-",null,1,"-",null,null,0,0,""]
["S",4,"S",0,1,3,2,3,0,{"$f":"IF(OR($C59=\"S\",$C59=0),0,MATCH(0,OFFSET($D59,1,$C59,ROW($C$289)-ROW($C59)),0))","v":0},{"$f":"IF(OR($C59=\"S\",$C59=0),0,MATCH(OFFSET($D59,0,$C59)+1,OFFSET($D59,1,$C59,ROW($C$289)-ROW($C59)),0))","v":0},"","Serviço","Serviço","-","SINAPI",93358,"ESCAVAÇÃO MANUAL DE VALA COM PROFUNDIDADE MENOR OU IGUAL A 1,30 M. AF_03/2016","M3",1.62,1,1.62,null,null,0,0,"Referência: AGETOP - 40101"]
["S",4,"S",0,1,3,2,3,0,{"$f":"IF(OR($C60=\"S\",$C60=0),0,MATCH(0,OFFSET($D60,1,$C60,ROW($C$289)-ROW($C60)),0))","v":0},{"$f":"IF(OR($C60=\"S\",$C60=0),0,MATCH(OFFSET($D60,0,$C60)+1,OFFSET($D60,1,$C60,ROW($C$289)-ROW($C60)),0))","v":0},"","Serviço","Serviço","-","SINAPI",96995,"REATERRO MANUAL APILOADO COM SOQUETE. AF_10/2017","M3",1.62,1,1.62,null,null,0,0,"Referência: AGETOP - 40902"]
[{"$f":"CHOOSE(1+LOG(1+2*(ORÇAMENTO.Nivel=\"Nível 1\")+4*(ORÇAMENTO.Nivel=\"Nível 2\")+8*(ORÇAMENTO.Nivel=\"Nível 3\")+16*(ORÇAMENTO.Nivel=\"Nível 4\")+32*(ORÇAMENTO.Nivel=\"Serviço\"),2),0,1,2,3,4,\"S\")","v":2},2,2,29,1,4,0,0,0,{"$f":"IF(OR($C61=\"S\",$C61=0),0,MATCH(0,OFFSET($D61,1,$C61,ROW($C$289)-ROW($C61)),0))","v":115},{"$f":"IF(OR($C61=\"S\",$C61=0),0,MATCH(OFFSET($D61,0,$C61)+1,OFFSET($D61,1,$C61,ROW($C$289)-ROW($C61)),0))","v":29},"","Nível 2","Nível 2","-",null,null,"INSTALAÇÕES ELÉTRICAS","-",null,1,"-",null,null,0,0,""]
["S",2,"S",0,1,4,0,0,0,{"$f":"IF(OR($C62=\"S\",$C62=0),0,MATCH(0,OFFSET($D62,1,$C62,ROW($C$289)-ROW($C62)),0))","v":0},{"$f":"IF(OR($C62=\"S\",$C62=0),0,MATCH(OFFSET($D62,0,$C62)+1,OFFSET($D62,1,$C62,ROW($C$289)-ROW($C62)),0))","v":0},"","Serviço","Serviço","-","AGETOP",70370,"BRACADEIRA METALICA TIPO \"D\" DIAM. 1/2\"","Un    ",156,1,156,null,null,0,0,""]
["S",2,"S",0,1,4,0,0,0,{"$f":"IF(OR($C63=\"S\",$C63=0),0,MATCH(0,OFFSET($D63,1,$C63,ROW($C$289)-ROW($C63)),0))","v":0},{"$f":"IF(OR($C63=\"S\",$C63=0),0,MATCH(OFFSET($D63,0,$C63)+1,OFFSET($D63,1,$C63,ROW($C$289)-ROW($C63)),0))","v":0},"","Serviço","Serviço","-","AGETOP",70420,"BUCHA E ARRUELA METALICA DIAM. 1/2\"","PR    ",2,1,2,null,null,0,0,""]
["S",2,"S",0,1,4,0,0,0,{"$f":"IF(OR($C64=\"S\",$C64=0),0,MATCH(0,OFFSET($D64,1,$C64,ROW($C$289)-ROW($C64)),0))","v":0},{"$f":"IF(OR($C64=\"S\",$C64=0),0,MATCH(OFFSET($D64,0,$C64)+1,OFFSET($D64,1,$C64,ROW($C$289)-ROW($C64)),0))","v":0},"","Serviço","Serviço","-","AGETOP",70372,"BRACADEIRA METALICA TIPO \"D\" DIAM. 1\"","Un    ",51,1,51,null,null,0,0,""]
["S",2,"S",0,1,4,0,0,0,{"$f":"IF(OR($C65=\"S\",$C65=0),0,MATCH(0,OFFSET($D65,1,$C65,ROW($C$289)-ROW($C65)),0))","v":0},{"$f":"IF(OR($C65=\"S\",$C65=0),0,MATCH(OFFSET($D65,0,$C65)+1,OFFSET($D65,1,$C65,ROW($C$289)-ROW($C65)),0))","v":0},"","Serviço","Serviço","-","AGETOP",70422,"BUCHA E ARRUELA METALICA DIAM. 1\"","PR    ",3,1,3,null,null,0,0,""]
["S",2,"S",0,1,4,0,0,0,{"$f":"IF(OR($C66=\"S\",$C66=0),0,MATCH(0,OFFSET($D66,1,$C66,ROW($C$289)-ROW($C66)),0))","v":0},{"$f":"IF(OR($C66=\"S\",$C66=0),0,MATCH(OFFSET($D66,0,$C66)+1,OFFSET($D66,1,$C66,ROW($C$289)-ROW($C66)),0))","v":0},"","Serviço","Serviço","-","SINAPI",91925,"CABO DE COBRE FLEXÍVEL ISOLADO, 1,5 MM², ANTI-CHAMA 0,6/1,0 KV, PARA CIRCUITOS TERMINAIS - FORNECIMENTO E INSTALAÇÃO. AF_12/2015","M",47,1,47,null,null,0,0,""]
["S",2,"S",0,1,4,0,0,0,{"$f":"IF(OR($C67=\"S\",$C67=0),0,MATCH(0,OFFSET($D67,1,$C67,ROW($C$289)-ROW($C67)),0))","v":0},{"$f":"IF(OR($C67=\"S\",$C67=0),0,MATCH(OFFSET($D67,0,$C67)+1,OFFSET($D67,1,$C67,ROW($C$289)-ROW($C67)),0))","v":0},"","Serviço","Serviço","-","SINAPI",91927,"CABO DE COBRE FLEXÍVEL ISOLADO, 2,5 MM², ANTI-CHAMA 0,6/1,0 KV, PARA CIRCUITOS TERMINAIS - FORNECIMENTO E INSTALAÇÃO. AF_12/2015","M",408,1,408,null,null,0,0,"Referência: AGETOP - 70581"]
["S",2,"S",0,1,4,0,0,0,{"$f":"IF(OR($C68=\"S\",$C68=0),0,MATCH(0,OFFSET($D68,1,$C68,ROW($C$289)-ROW($C68)),0))","v":0},{"$f":"IF(OR($C68=\"S\",$C68=0),0,MATCH(OFFSET($D68,0,$C68)+1,OFFSET($D68,1,$C68,ROW($C$289)-ROW($C68)),0))","v":0},"","Serviço","Serviço","-","SINAPI",91929,"CABO DE COBRE FLEXÍVEL ISOLADO, 4 MM², ANTI-CHAMA 0,6/1,0 KV, PARA CIRCUITOS TERMINAIS - FORNECIMENTO E INSTALAÇÃO. AF_12/2015","M",240,1,240,null,null,0,0,"Referência: AGETOP - 70582"]
["S",2,"S",0,1,4,0,0,0,{"$f":"IF(OR($C69=\"S\",$C69=0),0,MATCH(0,OFFSET($D69,1,$C69,ROW($C$289)-ROW($C69)),0))","v":0},{"$f":"IF(OR($C69=\"S\",$C69=0),0,MATCH(OFFSET($D69,0,$C69)+1,OFFSET($D69,1,$C69,ROW($C$289)-ROW($C69)),0))","v":0},"","Serviço","Serviço","-","SINAPI",93670,"DISJUNTOR TRIPOLAR TIPO DIN, CORRENTE NOMINAL DE 25A - FORNECIMENTO E INSTALAÇÃO. AF_04/2016","UN",2,1,2,null,null,0,0,"Referência: AGETOP - 71173"]
["S",2,"S",0,1,4,0,0,0,{"$f":"IF(OR($C70=\"S\",$C70=0),0,MATCH(0,OFFSET($D70,1,$C70,ROW($C$289)-ROW($C70)),0))","v":0},{"$f":"IF(OR($C70=\"S\",$C70=0),0,MATCH(OFFSET($D70,0,$C70)+1,OFFSET($D70,1,$C70,ROW($C$289)-ROW($C70)),0))","v":0},"","Serviço","Serviço","-","SINAPI",93660,"DISJUNTOR BIPOLAR TIPO DIN, CORRENTE NOMINAL DE 10A - FORNECIMENTO E INSTALAÇÃO. AF_04/2016","UN",1,1,1,null,null,0,0,""]
["S",2,"S",0,1,4,0,0,0,{"$f":"IF(OR($C71=\"S\",$C71=0),0,MATCH(0,OFFSET($D71,1,$C71,ROW($C$289)-ROW($C71)),0))","v":0},{"$f":"IF(OR($C71=\"S\",$C71=0),0,MATCH(OFFSET($D71,0,$C71)+1,OFFSET($D71,1,$C71,ROW($C$289)-ROW($C71)),0))","v":0},"","Serviço","Serviço","-","SINAPI",93661,"DISJUNTOR BIPOLAR TIPO DIN, CORRENTE NOMINAL DE 16A - FORNECIMENTO E INSTALAÇÃO. AF_04/2016","UN",1,1,1,null,null,0,0,""]
["S",2,"S",0,1,4,0,0,0,{"$f":"IF(OR($C72=\"S\",$C72=0),0,MATCH(0,OFFSET($D72,1,$C72,ROW($C$289)-ROW($C72)),0))","v":0},{"$f":"IF(OR($C72=\"S\",$C72=0),0,MATCH(OFFSET($D72,0,$C72)+1,OFFSET($D72,1,$C72,ROW($C$289)-ROW($C72)),0))","v":0},"","Serviço","Serviço","-","AGETOP",71186,"DISPOSITIVO DE PROTEÇÃO CONTRA SURTOS (D.P.S.) 275V DE 90KA","Un    ",4,1,4,null,null,0,0,""]
["S",2,"S",0,1,4,0,0,0,{"$f":"IF(OR($C73=\"S\",$C73=0),0,MATCH(0,OFFSET($D73,1,$C73,ROW($C$289)-ROW($C73)),0))","v":0},{"$f":"IF(OR($C73=\"S\",$C73=0),0,MATCH(OFFSET($D73,0,$C73)+1,OFFSET($D73,1,$C73,ROW($C$289)-ROW($C73)),0))","v":0},"","Serviço","Serviço","-","AGETOP",70541,"CABO DE COBRE NU No. 16 MM2 (6,94 M/KG)","M     ",12,1,12,null,null,0,0,""]
["S",2,"S",0,1,4,0,0,0,{"$f":"IF(OR($C74=\"S\",$C74=0),0,MATCH(0,OFFSET($D74,1,$C74,ROW($C$289)-ROW($C74)),0))","v":0},{"$f":"IF(OR($C74=\"S\",$C74=0),0,MATCH(OFFSET($D74,0,$C74)+1,OFFSET($D74,1,$C74,ROW($C$289)-ROW($C74)),0))","v":0},"","Serviço","Serviço","-","AGETOP",71381,"HASTE REV.COBRE(COPPERWELD)  5/8\" X 3,00 M C/CONECTOR","Un    ",1,1,1,null,null,0,0,""]
["S",2,"S",0,1,4,0,0,0,{"$f":"IF(OR($C75=\"S\",$C75=0),0,MATCH(0,OFFSET($D75,1,$C75,ROW($C$289)-ROW($C75)),0))","v":0},{"$f":"IF(OR($C75=\"S\",$C75=0),0,MATCH(OFFSET($D75,0,$C75)+1,OFFSET($D75,1,$C75,ROW($C$289)-ROW($C75)),0))","v":0},"","Serviço","Serviço","-","SINAPI",98111,"CAIXA DE INSPEÇÃO PARA ATERRAMENTO, CIRCULAR, EM POLIETILENO, DIÂMETRO INTERNO = 0,3 M. AF_05/2018","UN",1,1,1,null,null,0,0,""]
["S",2,"S",0,1,4,0,0,0,{"$f":"IF(OR($C76=\"S\",$C76=0),0,MATCH(0,OFFSET($D76,1,$C76,ROW($C$289)-ROW($C76)),0))","v":0},{"$f":"IF(OR($C76=\"S\",$C76=0),0,MATCH(OFFSET($D76,0,$C76)+1,OFFSET($D76,1,$C76,ROW($C$289)-ROW($C76)),0))","v":0},"","Serviço","Serviço","-","SINAPI",91992,"TOMADA ALTA DE EMBUTIR (1 MÓDULO), 2P+T 10 A, INCLUINDO SUPORTE E PLACA - FORNECIMENTO E INSTALAÇÃO. AF_12/2015","UN",10,1,10,null,null,0,0,""]
["S",2,"S",0,1,4,0,0,0,{"$f":"IF(OR($C77=\"S\",$C77=0),0,MATCH(0,OFFSET($D77,1,$C77,ROW($C$289)-ROW($C77)),0))","v":0},{"$f":"IF(OR($C77=\"S\",$C77=0),0,MATCH(OFFSET($D77,0,$C77)+1,OFFSET($D77,1,$C77,ROW($C$289)-ROW($C77)),0))","v":0},"","Serviço","Serviço","-","AGETOP",70645,"CAIXA DE PASSAGEM METÁLICA DE EMBUTIR 15X15X8 CM","Un    ",1,1,1,null,null,0,0,""]
["S",2,"S",0,1,4,0,0,0,{"$f":"IF(OR($C78=\"S\",$C78=0),0,MATCH(0,OFFSET($D78,1,$C78,ROW($C$289)-ROW($C78)),0))","v":0},{"$f":"IF(OR($C78=\"S\",$C78=0),0,MATCH(OFFSET($D78,0,$C78)+1,OFFSET($D78,1,$C78,ROW($C$289)-ROW($C78)),0))","v":0},"","Serviço","Serviço","-","AGETOP",70929,"CONDULETE METÁLICO - CAIXA COM 5 ENTRADAS ","un    ",22,1,22,null,null,0,0,""]
["S",2,"S",0,1,4,0,0,0,{"$f":"IF(OR($C79=\"S\",$C79=0),0,MATCH(0,OFFSET($D79,1,$C79,ROW($C$289)-ROW($C79)),0))","v":0},{"$f":"IF(OR($C79=\"S\",$C79=0),0,MATCH(OFFSET($D79,0,$C79)+1,OFFSET($D79,1,$C79,ROW($C$289)-ROW($C79)),0))","v":0},"","Serviço","Serviço","-","AGETOP",70930,"CONDULETE METÁLICO - ADAPTADOR DE SAÍDA 3/4\" ","un    ",46,1,46,null,null,0,0,""]
["S",2,"S",0,1,4,0,0,0,{"$f":"IF(OR($C80=\"S\",$C80=0),0,MATCH(0,OFFSET($D80,1,$C80,ROW($C$289)-ROW($C80)),0))","v":0},{"$f":"IF(OR($C80=\"S\",$C80=0),0,MATCH(OFFSET($D80,0,$C80)+1,OFFSET($D80,1,$C80,ROW($C$289)-ROW($C80)),0))","v":0},"","Serviço","Serviço","-","AGETOP",70924,"CONDULETE DE PVC - CAIXA COM 5 ENTRADAS ","un    ",5,1,5,null,null,0,0,""]
["S",2,"S",0,1,4,0,0,0,{"$f":"IF(OR($C81=\"S\",$C81=0),0,MATCH(0,OFFSET($D81,1,$C81,ROW($C$289)-ROW($C81)),0))","v":0},{"$f":"IF(OR($C81=\"S\",$C81=0),0,MATCH(OFFSET($D81,0,$C81)+1,OFFSET($D81,1,$C81,ROW($C$289)-ROW($C81)),0))","v":0},"","Serviço","Serviço","-","AGETOP",70926,"CONDULETE DE PVC - ADAPTADOR DE SAÍDA 1\" ","un    ",10,1,10,null,null,0,0,""]
["S",2,"S",0,1,4,0,0,0,{"$f":"IF(OR($C82=\"S\",$C82=0),0,MATCH(0,OFFSET($D82,1,$C82,ROW($C$289)-ROW($C82)),0))","v":0},{"$f":"IF(OR($C82=\"S\",$C82=0),0,MATCH(OFFSET($D82,0,$C82)+1,OFFSET($D82,1,$C82,ROW($C$289)-ROW($C82)),0))","v":0},"","Serviço","Serviço","-","SINAPI",95801,"CONDULETE DE ALUMÍNIO, TIPO X, PARA ELETRODUTO DE AÇO GALVANIZADO DN 20 MM (3/4''), APARENTE - FORNECIMENTO E INSTALAÇÃO. AF_11/2016_P","UN",22,1,22,null,null,0,0,"Referência: AGETOP - 70929"]
["S",2,"S",0,1,4,0,0,0,{"$f":"IF(OR($C83=\"S\",$C83=0),0,MATCH(0,OFFSET($D83,1,$C83,ROW($C$289)-ROW($C83)),0))","v":0},{"$f":"IF(OR($C83=\"S\",$C83=0),0,MATCH(OFFSET($D83,0,$C83)+1,OFFSET($D83,1,$C83,ROW($C$289)-ROW($C83)),0))","v":0},"","Serviço","Serviço","-","AGETOP",71250,"ELETRODUTO EM AÇO ZINCADO DIÂMETRO 1/2\"","M     ",156,1,156,null,null,0,0,""]
["S",2,"S",0,1,4,0,0,0,{"$f":"IF(OR($C84=\"S\",$C84=0),0,MATCH(0,OFFSET($D84,1,$C84,ROW($C$289)-ROW($C84)),0))","v":0},{"$f":"IF(OR($C84=\"S\",$C84=0),0,MATCH(OFFSET($D84,0,$C84)+1,OFFSET($D84,1,$C84,ROW($C$289)-ROW($C84)),0))","v":0},"","Serviço","Serviço","-","AGETOP",71720,"LUVA EM AÇO ZINCADO DIÂMETRO 1/2\"","Un    ",52,1,52,null,null,0,0,""]
["S",2,"S",0,1,4,0,0,0,{"$f":"IF(OR($C85=\"S\",$C85=0),0,MATCH(0,OFFSET($D85,1,$C85,ROW($C$289)-ROW($C85)),0))","v":0},{"$f":"IF(OR($C85=\"S\",$C85=0),0,MATCH(OFFSET($D85,0,$C85)+1,OFFSET($D85,1,$C85,ROW($C$289)-ROW($C85)),0))","v":0},"","Serviço","Serviço","-","AGETOP",71120,"CURVA 90 GRAUS AÇO ZINCADO DIÂMETRO 1/2\"","Un    ",7,1,7,null,null,0,0,""]
["S",2,"S",0,1,4,0,0,0,{"$f":"IF(OR($C86=\"S\",$C86=0),0,MATCH(0,OFFSET($D86,1,$C86,ROW($C$289)-ROW($C86)),0))","v":0},{"$f":"IF(OR($C86=\"S\",$C86=0),0,MATCH(OFFSET($D86,0,$C86)+1,OFFSET($D86,1,$C86,ROW($C$289)-ROW($C86)),0))","v":0},"","Serviço","Serviço","-","SINAPI",95731,"ELETRODUTO RÍGIDO SOLDÁVEL, PVC, DN 32 MM (1\u0092\u0092), APARENTE, INSTALADO EM PAREDE - FORNECIMENTO E INSTALAÇÃO. AF_11/2016_P","M",51,1,51,null,null,0,0,""]
["S",2,"S",0,1,4,0,0,0,{"$f":"IF(OR($C87=\"S\",$C87=0),0,MATCH(0,OFFSET($D87,1,$C87,ROW($C$289)-ROW($C87)),0))","v":0},{"$f":"IF(OR($C87=\"S\",$C87=0),0,MATCH(OFFSET($D87,0,$C87)+1,OFFSET($D87,1,$C87,ROW($C$289)-ROW($C87)),0))","v":0},"","Serviço","Serviço","-","SINAPI",95738,"LUVA PARA ELETRODUTO, PVC, SOLDÁVEL, DN 32 MM (1\u0092\u0092), APARENTE, INSTALADA EM PAREDE - FORNECIMENTO E INSTALAÇÃO. AF_11/2016_P","UN",17,1,17,null,null,0,0,""]
["S",2,"S",0,1,4,0,0,0,{"$f":"IF(OR($C88=\"S\",$C88=0),0,MATCH(0,OFFSET($D88,1,$C88,ROW($C$289)-ROW($C88)),0))","v":0},{"$f":"IF(OR($C88=\"S\",$C88=0),0,MATCH(OFFSET($D88,0,$C88)+1,OFFSET($D88,1,$C88,ROW($C$289)-ROW($C88)),0))","v":0},"","Serviço","Serviço","-","AGETOP",70391,"BUCHA DE NYLON S-6","Un    ",366,1,366,null,null,0,0,""]
["S",2,"S",0,1,4,0,0,0,0,0,"","Serviço","Serviço","-","AGETOP",71861,"PARAFUSO P/BUCHA S-6","Un    ",366,1,366,null,null,0,0,""]
[{"$f":"CHOOSE(1+LOG(1+2*(ORÇAMENTO.Nivel=\"Nível 1\")+4*(ORÇAMENTO.Nivel=\"Nível 2\")+8*(ORÇAMENTO.Nivel=\"Nível 3\")+16*(ORÇAMENTO.Nivel=\"Nível 4\")+32*(ORÇAMENTO.Nivel=\"Serviço\"),2),0,1,2,3,4,\"S\")","v":2},{"$f":"IF(OR(C90=\"s\",C90=0),OFFSET(B90,-1,0),C90)","v":2},{"$f":"IF(OFFSET(C90,-1,0)=\"L\",1,IF(OFFSET(C90,-1,0)=1,2,IF(OR(A90=\"s\",A90=0),\"S\",IF(AND(OFFSET(C90,-1,0)=2,A90=4),3,IF(AND(OR(OFFSET(C90,-1,0)=\"s\",OFFSET(C90,-1,0)=0),A90<>\"s\",A90>OFFSET(B90,-1,0)),OFFSET(B90,-1,0),A90)))))","v":2},{"$f":"IF(OR(C90=\"S\",C90=0),0,IF(ISERROR(K90),J90,SMALL(J90:K90,1)))","v":13},{"$f":"IF($C90=1,OFFSET(E90,-1,0)+1,OFFSET(E90,-1,0))","v":1},{"$f":"IF($C90=1,0,IF($C90=2,OFFSET(F90,-1,0)+1,OFFSET(F90,-1,0)))","v":5},{"$f":"IF(AND($C90<=2,$C90<>0),0,IF($C90=3,OFFSET(G90,-1,0)+1,OFFSET(G90,-1,0)))","v":0},{"$f":"IF(AND($C90<=3,$C90<>0),0,IF($C90=4,OFFSET(H90,-1,0)+1,OFFSET(H90,-1,0)))","v":0},{"$f":"IF(AND($C90<=4,$C90<>0),0,IF(AND($C90=\"S\",$Y90>0),OFFSET(I90,-1,0)+1,OFFSET(I90,-1,0)))","v":0},86,13,"","Nível 2","Nível 2","-","AGETOP",null,"INSTALAÇÕES HIDROSSANITÁRIAS","-",null,1,"-",null,null,0,0,""]
[3,3,3,6,1,5,1,0,0,12,6,"","Nível 3","Nível 3","-","AGETOP",null,"PEÇAS E ACESSÓRIOS ","-",null,1,"-",null,null,0,0,""]
["S",3,"S",0,1,5,1,0,0,0,0,"","Serviço","Serviço","-","AGETOP",81501,"ADESIVO PLASTICO - FRASCO 850 G","Un    ",1,1,1,null,null,0,0,""]
["S",3,"S",0,1,5,1,0,0,0,0,"","Serviço","Serviço","-","AGETOP",81504,"SOLUCAO LIMPADORA 1000 CM3","Un    ",1,1,1,null,null,0,0,""]
["S",3,"S",0,1,5,1,0,0,0,0,"","Serviço","Serviço","-","AGETOP",81828,"CAIXA DE AREIA 60X60CM FUNDO DE BRITA COM GRELHA METÁLICA FERRO CHATO PADRÃO GOINFRA","Un    ",2,1,2,null,null,0,0,""]
["S",3,"S",0,1,5,1,0,0,0,0,"","Serviço","Serviço","-","AGETOP",81825,"CAIXA DE PASSAGEM 60 X 60 CM SEM TAMPA","Un    ",1,1,1,null,null,0,0,""]
["S",3,"S",0,1,5,1,0,0,0,0,"","Serviço","Serviço","-","AGETOP",81826,"TAMPA EM CONCRETO ARMADO 25 MPA E=5CM PARA A CAIXA DE PASSAGEM 60X60CM","Un    ",1,1,1,null,null,0,0,""]
[3,3,3,3,1,5,2,0,0,6,3,"","Nível 3","Nível 3","-","SINAPI",null,"ÁGUA FRIA","-",null,1,"-",null,null,0,0,""]
["S",3,"S",0,1,5,2,0,0,0,0,"","Serviço","Serviço","-","AGETOP",81004,"TUBO SOLDAVEL PVC MARROM DIAMETRO 32 mm","m     ",10,1,10,null,null,0,0,""]
["S",3,"S",0,1,5,2,0,0,0,0,"","Serviço","Serviço","-","AGETOP",81322,"JOELHO 90 GRAUS SOLDAVEL DIAMETRO 32 MM (1\")","Un    ",4,1,4,null,null,0,0,""]
[3,3,3,3,1,5,3,0,0,3,{"$error":"#N/A"},"","Nível 3","Nível 3","-","AGETOP",null,"ESGOTO","-",null,1,"-",null,null,0,0,""]
["S",3,"S",0,1,5,3,0,0,0,0,"","Serviço","Serviço","-","AGETOP",82304,"TUBO SOLDAVEL P/ESGOTO DIAM. 100 MM","m     ",27,1,27,null,null,0,0,""]
["S",3,"S",0,1,5,3,0,0,0,0,"","Serviço","Serviço","-","AGETOP",82303,"TUBO SOLDAVEL P/ESGOTO DIAM.75 MM","m     ",12,1,12,null,null,0,0,""]
[{"$f":"CHOOSE(1+LOG(1+2*(ORÇAMENTO.Nivel=\"Nível 1\")+4*(ORÇAMENTO.Nivel=\"Nível 2\")+8*(ORÇAMENTO.Nivel=\"Nível 3\")+16*(ORÇAMENTO.Nivel=\"Nível 4\")+32*(ORÇAMENTO.Nivel=\"Serviço\"),2),0,1,2,3,4,\"S\")","v":2},{"$f":"IF(OR(C103=\"s\",C103=0),OFFSET(B103,-1,0),C103)","v":2},{"$f":"IF(OFFSET(C103,-1,0)=\"L\",1,IF(OFFSET(C103,-1,0)=1,2,IF(OR(A103=\"s\",A103=0),\"S\",IF(AND(OFFSET(C103,-1,0)=2,A103=4),3,IF(AND(OR(OFFSET(C103,-1,0)=\"s\",OFFSET(C103,-1,0)=0),A103<>\"s\",A103>OFFSET(B103,-1,0)),OFFSET(B103,-1,0),A103)))))","v":2},{"$f":"IF(OR(C103=\"S\",C103=0),0,IF(ISERROR(K103),J103,SMALL(J103:K103,1)))","v":40},{"$f":"IF($C103=1,OFFSET(E103,-1,0)+1,OFFSET(E103,-1,0))","v":1},{"$f":"IF($C103=1,0,IF($C103=2,OFFSET(F103,-1,0)+1,OFFSET(F103,-1,0)))","v":6},{"$f":"IF(AND($C103<=2,$C103<>0),0,IF($C103=3,OFFSET(G103,-1,0)+1,OFFSET(G103,-1,0)))","v":0},{"$f":"IF(AND($C103<=3,$C103<>0),0,IF($C103=4,OFFSET(H103,-1,0)+1,OFFSET(H103,-1,0)))","v":0},{"$f":"IF(AND($C103<=4,$C103<>0),0,IF(AND($C103=\"S\",$Y103>0),OFFSET(I103,-1,0)+1,OFFSET(I103,-1,0)))","v":0},73,40,"","Nível 2","Nível 2","-",null,null,"INSTALAÇÕES ESPECIAIS","-",null,1,"-",null,null,0,0,""]
[3,3,3,28,1,6,1,0,0,39,28,"","Nível 3","Nível 3","-","SINAPI",null,"INSTALAÇÕES DE GÁS","-",null,1,"-",null,null,0,0,""]
["S",3,"S",0,1,6,1,0,0,0,0,"","Serviço","Serviço","-","AGETOP",91007,"CENTRAL DE GÁS PADRÃO GOINFRA SEM INSTALAÇÕES (1+1 CILINDRO 45 KG)","Un    ",1,1,1,null,null,0,0,""]
["S",3,"S",0,1,6,1,0,0,0,0,"","Serviço","Serviço","-","AGETOP",91023,"UNIÃO S/BRONZE PRETA 3/4\" NPT 300 LBS","Un    ",3,1,3,null,null,0,0,""]
["S",3,"S",0,1,6,1,0,0,0,0,"","Serviço","Serviço","-","COMPOSIÇÃO","COMP 382_SEE","TE DE REDUCAO DE FERRO GALVANIZADO, COM ROSCA BSP, DE 3/4\" X 1/2\"","UN ",1,1,1,null,null,0,0,""]
["S",3,"S",0,1,6,1,0,0,0,0,"","Serviço","Serviço","-","COMPOSIÇÃO","COMP 383_SEE","BUCHA DE REDUCAO DE FERRO GALVANIZADO, COM ROSCA BSP, DE 1/2\" X 1/4\"","UN ",3,1,3,null,null,0,0,""]
["S",3,"S",0,1,6,1,0,0,0,0,"","Serviço","Serviço","-","AGETOP",91021,"LUVA GALVANIZADO DE REDUÇÃO 3/4\" X 1/2\" (GÁS)","Un    ",2,1,2,null,null,0,0,""]
["S",3,"S",0,1,6,1,0,0,0,0,"","Serviço","Serviço","-","SINAPI",92692,"NIPLE, EM FERRO GALVANIZADO, CONEXÃO ROSQUEADA, DN 15 (1/2\"), INSTALADO EM RAMAIS E SUB-RAMAIS DE GÁS - FORNECIMENTO E INSTALAÇÃO. AF_12/2015","UN",6,1,6,null,null,0,0,""]
["S",3,"S",0,1,6,1,0,0,0,0,"","Serviço","Serviço","-","AGETOP",91031,"NIPLE DUPLO 300 PSI 3/4\"","Un    ",6,1,6,null,null,0,0,""]
["S",3,"S",0,1,6,1,0,0,0,0,"","Serviço","Serviço","-","COMPOSIÇÃO","COMP 212_SEE","NIPLE DE REDUÇÃO 1/2\" X 1/4\" BSP","UN ",4,1,4,null,null,0,0,""]
["S",3,"S",0,1,6,1,0,0,0,0,"","Serviço","Serviço","-","COMPOSIÇÃO","COMP 213_SEE","NIPLE DE REDUÇÃO 3/4\" X 1/2\" BSP","UN ",4,1,4,null,null,0,0,""]
["S",3,"S",0,1,6,1,0,0,0,0,"","Serviço","Serviço","-","SINAPI",92688,"TUBO DE AÇO GALVANIZADO COM COSTURA, CLASSE MÉDIA, CONEXÃO ROSQUEADA, DN 20 (3/4\"), INSTALADO EM RAMAIS E SUB-RAMAIS DE GÁS - FORNECIMENTO E INSTALAÇÃO. AF_12/2015","M",24,1,24,null,null,0,0,""]
["S",3,"S",0,1,6,1,0,0,0,0,"","Serviço","Serviço","-","SINAPI",92701,"JOELHO 90 GRAUS, EM FERRO GALVANIZADO, CONEXÃO ROSQUEADA, DN 20 (3/4\"), INSTALADO EM RAMAIS E SUB-RAMAIS DE GÁS - FORNECIMENTO E INSTALAÇÃO. AF_12/2015","UN",8,1,8,null,null,0,0,""]
["S",3,"S",0,1,6,1,0,0,0,0,"","Serviço","Serviço","-","COMPOSIÇÃO","COMP 237_SEE","FITA ANTICORROSIVA","M",20,1,20,null,null,0,0,""]
["S",3,"S",0,1,6,1,0,0,0,0,"","Serviço","Serviço","-","AGETOP",91025,"VÁLVULA ESFERICA LATÃO 3/4\"","Un    ",3,1,3,null,null,0,0,""]
["S",3,"S",0,1,6,1,0,0,0,0,"","Serviço","Serviço","-","AGETOP",91019,"TE PRETO 90º 3/4\" NPT 300 LBS","Un    ",3,1,3,null,null,0,0,""]
["S",3,"S",0,1,6,1,0,0,0,0,"","Serviço","Serviço","-","COMPOSIÇÃO","COMP 542_SEE","VÁLVULA UGV 3/4\" (S) LATÃO","UN ",4,1,4,null,null,0,0,""]
["S",3,"S",0,1,6,1,0,0,0,0,"","Serviço","Serviço","-","COMPOSIÇÃO","COMP 543_SEE","VÁLVULA UGV 1/2\" (S) LATÃO","UN ",4,1,4,null,null,0,0,""]
["S",3,"S",0,1,6,1,0,0,0,0,"","Serviço","Serviço","-","AGETOP",91029,"VALVULA DE RETENÇÃO LATÃO 1/2\" X 7/16\" NPT","Un    ",4,1,4,null,null,0,0,""]
["S",3,"S",0,1,6,1,0,0,0,0,"","Serviço","Serviço","-","COMPOSIÇÃO","COMP 211_SEE","REGULADOR DE 2º ESTÁGIO 5KG/H","UN ",4,1,4,null,null,0,0,""]
["S",3,"S",0,1,6,1,0,0,0,0,"","Serviço","Serviço","-","COMPOSIÇÃO","COMP 210_SEE","REGULADOR DE 1º ESTÁGIO 60KG/H MODELO AP-40  COM MANÔMETRO","UN ",1,1,1,null,null,0,0,""]
["S",3,"S",0,1,6,1,0,0,0,0,"","Serviço","Serviço","-","AGETOP",85003,"EXTINTOR PO QUIMICO SECO (6 KG) - CAPACIDADE EXTINTORA 20 BC","Un    ",1,1,1,null,null,0,0,""]
["S",3,"S",0,1,6,1,0,0,0,0,"","Serviço","Serviço","-","COMPOSIÇÃO","COMP 235_SEE","PLACA DE SINALIZAÇÃO EM PVC COD 01 - (300X300) PROIBIDO FUMAR","UN ",2,1,2,null,null,0,0,""]
["S",3,"S",0,1,6,1,0,0,0,0,"","Serviço","Serviço","-","COMPOSIÇÃO","COMP 236_SEE","PLACA DE SINALIZAÇÃO EM PVC COD 06 - (300X300) PERIGO INFLAMÁVEL","UN ",2,1,2,null,null,0,0,""]
["S",3,"S",0,1,6,1,0,0,0,0,"","Serviço","Serviço","-","AGETOP",91043,"BRAÇADEIRA METALICA TIPO \"D\" DIAM. 3/4\"","Un    ",6,1,6,null,null,0,0,""]
["S",3,"S",0,1,6,1,0,0,0,0,"","Serviço","Serviço","-","AGETOP",71863,"PARAFUSO P/BUCHA S-10","Un    ",12,1,12,null,null,0,0,""]
["S",3,"S",0,1,6,1,0,0,0,0,"","Serviço","Serviço","-","AGETOP",70393,"BUCHA DE NYLON S-10","Un    ",12,1,12,null,null,0,0,""]
["S",3,"S",0,1,6,1,0,0,0,0,"","Serviço","Serviço","-","AGETOP",91045,"SUPORTE PARA COLETOR","Un    ",2,1,2,null,null,0,0,""]
["S",3,"S",0,1,6,1,0,0,0,0,"","Serviço","Serviço","-","COMPOSIÇÃO","COMP 045_SEE","LAUDO DE ESTANQUEIDADE","UN ",1,1,1,null,null,0,0,""]
[3,3,3,11,1,6,2,0,0,11,119,"","Nível 3","Nível 3","-","SINAPI",null,"INSTALAÇÕES DE INCENDIO","-",null,1,"-",null,null,0,0,""]
["S",3,"S",0,1,6,2,0,0,0,0,"","Serviço","Serviço","-","AGETOP",85003,"EXTINTOR PO QUIMICO SECO (6 KG) - CAPACIDADE EXTINTORA 20 BC","Un    ",2,1,2,null,null,0,0,""]
["S",3,"S",0,1,6,2,0,0,0,0,"","Serviço","Serviço","-","AGETOP",85005,"EXTINTOR AGUA PRESSURIZADA (10 LITROS) - CAPACIDADE EXTINTORA 2A","Un    ",2,1,2,null,null,0,0,""]
["S",3,"S",0,1,6,2,0,0,0,0,"","Serviço","Serviço","-","SINAPI",97599,"LUMINÁRIA DE EMERGÊNCIA, COM 30 LÂMPADAS LED DE 2 W, SEM REATOR - FORNECIMENTO E INSTALAÇÃO. AF_02/2020","UN",9,1,9,null,null,0,0,""]
["S",3,"S",0,1,6,2,0,0,0,0,"","Serviço","Serviço","-","COMPOSIÇÃO","COMP 024_SEE","SINALIZADOR FOTOLUMINESCENTE PARA EXTINTOR","UN ",4,1,4,null,null,0,0,""]
["S",3,"S",0,1,6,2,0,0,0,0,"","Serviço","Serviço","-","COMPOSIÇÃO","COMP 025_SEE","SINALIZADOR FOTOLUMINESCENTE DE EMERGÊNCIA","UN ",9,1,9,null,null,0,0,""]
["S",3,"S",0,1,6,2,0,0,0,0,"","Serviço","Serviço","-","COMPOSIÇÃO","COMP 277_SEE","MARCAÇÃO NO PISO - 1X1 M PARA EXTINTOR","M2",4,1,4,null,null,0,0,""]
["S",3,"S",0,1,6,2,0,0,0,0,"","Serviço","Serviço","-","COMPOSIÇÃO","COMP 235_SEE","PLACA DE SINALIZAÇÃO EM PVC COD 01 - (300X300) PROIBIDO FUMAR","UN ",1,1,1,null,null,0,0,""]
["S",3,"S",0,1,6,2,0,0,0,0,"","Serviço","Serviço","-","COMPOSIÇÃO","COMP 236_SEE","PLACA DE SINALIZAÇÃO EM PVC COD 06 - (300X300) PERIGO INFLAMÁVEL","UN ",1,1,1,null,null,0,0,""]
["S",3,"S",0,1,6,2,0,0,0,0,"","Serviço","Serviço","-","COMPOSIÇÃO","COMP 411_SEE","PLACA DE SINALIZAÇÃO EM PVC COD 13 - (316X158) SAÍDA DE EMERGÊNCIA","UN ",1,1,1,null,null,0,0,""]
["S",3,"S",0,1,6,2,0,0,0,0,"","Serviço","Serviço","-","COMPOSIÇÃO","COMP 412_SEE","PLACA DE SINALIZAÇÃO EM PVC COD 17 - (316X158) MENSAGEM \"SAÍDA\"","UN ",1,1,1,null,null,0,0,""]
[2,2,2,4,1,7,0,0,0,33,4,"","Nível 2","Nível 2","-","AGETOP",91045,"COBERTURAS","Un    ",null,1,"-",null,null,0,0,""]
[3,{"$f":"IF(OR(C144=\"s\",C144=0),OFFSET(B144,-1,0),C144)","v":3},{"$f":"IF(OFFSET(C144,-1,0)=\"L\",1,IF(OFFSET(C144,-1,0)=1,2,IF(OR(A144=\"s\",A144=0),\"S\",IF(AND(OFFSET(C144,-1,0)=2,A144=4),3,IF(AND(OR(OFFSET(C144,-1,0)=\"s\",OFFSET(C144,-1,0)=0),A144<>\"s\",A144>OFFSET(B144,-1,0)),OFFSET(B144,-1,0),A144)))))","v":3},{"$f":"IF(OR(C144=\"S\",C144=0),0,IF(ISERROR(K144),J144,SMALL(J144:K144,1)))","v":3},{"$f":"IF($C144=1,OFFSET(E144,-1,0)+1,OFFSET(E144,-1,0))","v":1},{"$f":"IF($C144=1,0,IF($C144=2,OFFSET(F144,-1,0)+1,OFFSET(F144,-1,0)))","v":7},{"$f":"IF(AND($C144<=2,$C144<>0),0,IF($C144=3,OFFSET(G144,-1,0)+1,OFFSET(G144,-1,0)))","v":1},{"$f":"IF(AND($C144<=3,$C144<>0),0,IF($C144=4,OFFSET(H144,-1,0)+1,OFFSET(H144,-1,0)))","v":0},{"$f":"IF(AND($C144<=4,$C144<>0),0,IF(AND($C144=\"S\",$Y144>0),OFFSET(I144,-1,0)+1,OFFSET(I144,-1,0)))","v":0},3,12,"","Nível 3","Nível 3","-",null,null,"CALHA E RUFO","-",null,1,"-",null,null,0,0,""]
[4,4,4,2,1,7,1,1,0,2,14,"","Nível 4","Nível 4","-","SINAPI",null,"IMPLANTAÇÃO PÁTIO MULTIUSO","-",null,1,"-",null,null,0,0,""]
["S",4,"S",0,1,7,1,1,0,0,0,"","Serviço","Serviço","-","SINAPI",94228,"CALHA EM CHAPA DE AÇO GALVANIZADO NÚMERO 24, DESENVOLVIMENTO DE 50 CM, INCLUSO TRANSPORTE VERTICAL. AF_07/2019","M",20.75,1,20.75,null,null,0,0,"Referência: AGETOP - 160601"]
[2,2,2,3,1,8,0,0,0,29,3,"","Nível 2","Nível 2","-",null,null,"ESQUADRIAS METÁLICAS","-",null,1,"-",null,null,0,0,""]
[3,3,3,2,1,8,1,0,0,2,8,"","Nível 3","Nível 3","-","SINAPI",null,"PÁTIO DESCOBERTO FRONTAL","-",null,1,"-",null,null,0,0,""]
["S",3,"S",0,1,8,1,0,0,0,0,"","Serviço","Serviço","-","AGETOP",180323,"GRELHA PADRÃO GOINFRA DE FERRO CHATO COM BERÇO (ESPAÇAMENTO ENTRE FACES = 1,5CM - NBR 9050 ACESSIBILIDADE)","m2    ",3.45,1,3.45,null,null,0,0,""]
[2,2,2,13,1,9,0,0,0,26,13,"","Nível 2","Nível 2","-",null,null,"REVESTIMENTO DE PISO","-",null,1,"-",null,null,0,0,""]
[3,3,3,5,1,9,1,0,0,12,5,"","Nível 3","Nível 3","-","SINAPI",null,"GRANITINA","-",null,1,"-",null,null,0,0,""]
[4,4,4,4,1,9,1,1,0,{"$f":"IF(OR($C152=\"S\",$C152=0),0,MATCH(0,OFFSET($D152,1,$C152,ROW($C$289)-ROW($C152)),0))","v":4},{"$f":"IF(OR($C152=\"S\",$C152=0),0,MATCH(OFFSET($D152,0,$C152)+1,OFFSET($D152,1,$C152,ROW($C$289)-ROW($C152)),0))","v":7},"","Nível 4","Nível 4","-","SINAPI",null,"BLOCO 01 E PÁTIO COBERTO","-",null,1,"-",null,null,0,0,""]
["S",4,"S",0,1,9,1,1,0,0,0,"","Serviço","Serviço","-","SINAPI",84191,"PISO EM GRANILITE, MARMORITE OU GRANITINA ESPESSURA 8 MM, INCLUSO JUNTAS DE DILATACAO PLASTICAS","M2",234,1,234,null,null,0,0,"Referência: AGETOP - 221101"]
["S",4,"S",0,1,9,1,1,0,0,0,"","Serviço","Serviço","-","AGETOP",221102,"RODAPÉ FUNDIDO DE GRANITINA 7CM","m     ",171.42,1,171.42,null,null,0,0,""]
["S",4,"S",0,1,9,1,1,0,0,0,"","Serviço","Serviço","-","AGETOP",221104,"RASPAGEM E APLICAÇÃO RESINA ACRÍLICA DUAS DEMÃOS","m2    ",245.99940000000001,1,245.99940000000001,null,null,0,0,""]
[3,{"$f":"IF(OR(C156=\"s\",C156=0),OFFSET(B156,-1,0),C156)","v":3},{"$f":"IF(OFFSET(C156,-1,0)=\"L\",1,IF(OFFSET(C156,-1,0)=1,2,IF(OR(A156=\"s\",A156=0),\"S\",IF(AND(OFFSET(C156,-1,0)=2,A156=4),3,IF(AND(OR(OFFSET(C156,-1,0)=\"s\",OFFSET(C156,-1,0)=0),A156<>\"s\",A156>OFFSET(B156,-1,0)),OFFSET(B156,-1,0),A156)))))","v":3},{"$f":"IF(OR(C156=\"S\",C156=0),0,IF(ISERROR(K156),J156,SMALL(J156:K156,1)))","v":7},{"$f":"IF($C156=1,OFFSET(E156,-1,0)+1,OFFSET(E156,-1,0))","v":1},{"$f":"IF($C156=1,0,IF($C156=2,OFFSET(F156,-1,0)+1,OFFSET(F156,-1,0)))","v":9},{"$f":"IF(AND($C156<=2,$C156<>0),0,IF($C156=3,OFFSET(G156,-1,0)+1,OFFSET(G156,-1,0)))","v":2},{"$f":"IF(AND($C156<=3,$C156<>0),0,IF($C156=4,OFFSET(H156,-1,0)+1,OFFSET(H156,-1,0)))","v":0},{"$f":"IF(AND($C156<=4,$C156<>0),0,IF(AND($C156=\"S\",$Y156>0),OFFSET(I156,-1,0)+1,OFFSET(I156,-1,0)))","v":0},7,95,"","Nível 3","Nível 3","-",null,null,"CONCRETO","-",null,1,"-",null,null,0,0,""]
[4,4,4,2,1,9,2,1,0,6,2,"","Nível 4","Nível 4","-","SINAPI",null,"PÁTIO DESCOBERTO FRONTAL","-",null,1,"-",null,null,0,0,""]
["S",4,"S",0,1,9,2,1,0,0,0,"","Serviço","Serviço","-","AGETOP",220102,"PISO CONCRETO DESEMPENADO ESPESSURA = 5 CM  1:2,5:3,5","m2    ",58.91,1,58.91,null,null,0,0,""]
[4,4,4,2,1,9,2,2,0,4,2,"","Nível 4","Nível 4","-","SINAPI",null,"CENTRAL DE GÁS","-",null,1,"-",null,null,0,0,""]
["S",4,"S",0,1,9,2,2,0,0,0,"","Serviço","Serviço","-","AGETOP",220102,"PISO CONCRETO DESEMPENADO ESPESSURA = 5 CM  1:2,5:3,5","m2    ",3.5,1,3.5,null,null,0,0,""]
[4,4,4,2,1,9,2,3,0,2,{"$error":"#N/A"},"","Nível 4","Nível 4","-","SINAPI",null,"COMP. ELÉTRICO","-",null,1,"-",null,null,0,0,""]
["S",4,"S",0,1,9,2,3,0,0,0,"","Serviço","Serviço","-","SINAPI",68325,"PISO EM CONCRETO 20 MPA PREPARO MECANICO, ESPESSURA 7CM, INCLUSO SELANTE ELASTICO A BASE DE POLIURETANO","M2",2.7,1,2.7,null,null,0,0,""]
[2,2,2,4,1,10,0,0,0,13,4,"","Nível 2","Nível 2","-",null,null,"ADMINISTRAÇÃO","-",null,1,"-",null,null,0,0,""]
[3,3,3,3,1,10,1,0,0,3,10,"","Nível 3","Nível 3","-",null,null,"MENSALISTAS","-",null,1,"-",null,null,0,0,""]
["S",3,"S",0,1,10,1,0,0,0,0,"","Serviço","Serviço","-","SINAPI",90778,"ENGENHEIRO CIVIL DE OBRA PLENO COM ENCARGOS COMPLEMENTARES","H",66,1,66,null,null,0,0,"Referência: AGETOP - 250101"]
["S",3,"S",0,1,10,1,0,0,0,0,"","Serviço","Serviço","-","SINAPI",90776,"ENCARREGADO GERAL COM ENCARGOS COMPLEMENTARES","H",330,1,330,null,null,0,0,"Referência: AGETOP - 250103"]
[2,2,2,4,1,11,0,0,0,9,4,"","Nível 2","Nível 2","-",null,null,"PINTURA","-",null,1,"-",null,null,0,0,""]
[3,3,3,3,1,11,1,0,0,3,6,"","Nível 3","Nível 3","-","AGETOP",null,"ESQUADRIAS NOVAS","-",null,1,"-",null,null,0,0,""]
[4,4,4,2,1,11,1,1,0,2,{"$error":"#N/A"},"","Nível 4","Nível 4","-","SINAPI",null,"PÁTIO DESCOBERTO FRONTAL","-",null,1,"-",null,null,0,0,""]
["S",4,"S",0,1,11,1,1,0,0,0,"","Serviço","Serviço","-","AGETOP",261602,"PINT.ESMALTE/ESQUAD.FERRO C/FUNDO ANTICOR.","m2    ",5.18,1,5.18,null,null,0,0,""]
[2,{"$f":"IF(OR(C171=\"s\",C171=0),OFFSET(B171,-1,0),C171)","v":2},{"$f":"IF(OFFSET(C171,-1,0)=\"L\",1,IF(OFFSET(C171,-1,0)=1,2,IF(OR(A171=\"s\",A171=0),\"S\",IF(AND(OFFSET(C171,-1,0)=2,A171=4),3,IF(AND(OR(OFFSET(C171,-1,0)=\"s\",OFFSET(C171,-1,0)=0),A171<>\"s\",A171>OFFSET(B171,-1,0)),OFFSET(B171,-1,0),A171)))))","v":2},{"$f":"IF(OR(C171=\"S\",C171=0),0,IF(ISERROR(K171),J171,SMALL(J171:K171,1)))","v":5},{"$f":"IF($C171=1,OFFSET(E171,-1,0)+1,OFFSET(E171,-1,0))","v":1},{"$f":"IF($C171=1,0,IF($C171=2,OFFSET(F171,-1,0)+1,OFFSET(F171,-1,0)))","v":12},{"$f":"IF(AND($C171<=2,$C171<>0),0,IF($C171=3,OFFSET(G171,-1,0)+1,OFFSET(G171,-1,0)))","v":0},{"$f":"IF(AND($C171<=3,$C171<>0),0,IF($C171=4,OFFSET(H171,-1,0)+1,OFFSET(H171,-1,0)))","v":0},{"$f":"IF(AND($C171<=4,$C171<>0),0,IF(AND($C171=\"S\",$Y171>0),OFFSET(I171,-1,0)+1,OFFSET(I171,-1,0)))","v":0},5,105,"","Nível 2","Nível 2","-",null,null,"DIVERSOS","-",null,1,"-",null,null,0,0,""]
[3,3,3,2,1,12,1,0,0,4,2,"","Nível 3","Nível 3","-","SINAPI",null,"PÁTIO DESCOBERTO FRONTAL","-",null,1,"-",null,null,0,0,""]
["S",3,"S",0,1,12,1,0,0,0,0,"","Serviço","Serviço","-","AGETOP",271417,"CANALETA CONCRETO DESEMPENADO 5 CM PD.GOINFRA","m     ",9.85,1,9.85,null,null,0,0,""]
[3,3,3,2,1,12,2,0,0,2,77,"","Nível 3","Nível 3","-","SINAPI",null,"LIMPEZA","-",null,1,"-",null,null,0,0,""]
["S",3,"S",0,1,12,2,0,0,0,0,"","Serviço","Serviço","-","AGETOP",270501,"LIMPEZA FINAL DE OBRA - (OBRAS CIVIS)","m2    ",327.28150197108562,1,327.28150197108562,null,null,0,0,""]
[1,1,1,113,2,0,0,0,0,113,{"$error":"#N/A"},"F","Nível 1","Nível 1","2.","AGETOP",null,"PATIO MULTIUSO OPÇÃO 02","UN",1,1,1,null,null,0,0,""]
[{"$f":"CHOOSE(1+LOG(1+2*(ORÇAMENTO.Nivel=\"Nível 1\")+4*(ORÇAMENTO.Nivel=\"Nível 2\")+8*(ORÇAMENTO.Nivel=\"Nível 3\")+16*(ORÇAMENTO.Nivel=\"Nível 4\")+32*(ORÇAMENTO.Nivel=\"Serviço\"),2),0,1,2,3,4,\"S\")","v":2},2,2,2,2,1,0,0,0,112,2,"","Nível 2","Nível 2","-","SINAPI",null,"SERVIÇOS PRELIMINARES","-",null,1,"-",null,null,0,0,""]
["S",2,"S",0,2,1,0,0,0,0,0,"","Serviço","Serviço","-","SINAPI",99059,"LOCACAO CONVENCIONAL DE OBRA, UTILIZANDO GABARITO DE TÁBUAS CORRIDAS PONTALETADAS A CADA 2,00M -  2 UTILIZAÇÕES. AF_10/2018","M",89.67,1,89.67,null,null,0,0,""]
[2,2,2,3,2,2,0,0,0,110,3,"","Nível 2","Nível 2","-","SINAPI",null,"TRANSPORTES","-",null,1,"-",null,null,0,0,""]
["S",2,"S",0,2,2,0,0,0,0,0,"","Serviço","Serviço","-","SINAPI",72900,"TRANSPORTE DE ENTULHO COM CAMINHAO BASCULANTE 6 M3, RODOVIA PAVIMENTADA, DMT 0,5 A 1,0 KM","M3",6.2769000000000004,1,6.2769000000000004,null,null,0,0,""]
["S",2,"S",0,2,2,0,0,0,0,0,"","Serviço","Serviço","-","SINAPI",72897,"CARGA MANUAL DE ENTULHO EM CAMINHAO BASCULANTE 6 M3","M3",6.2769000000000004,1,6.2769000000000004,null,null,0,0,""]
[2,2,2,8,2,3,0,0,0,107,8,"","Nível 2","Nível 2","-","SINAPI",null,"SERVIÇO EM TERRA","-",null,1,"-",null,null,0,0,""]
["S",2,"S",0,2,3,0,0,0,0,0,"","Serviço","Serviço","-","SINAPI",93358,"ESCAVAÇÃO MANUAL DE VALA COM PROFUNDIDADE MENOR OU IGUAL A 1,30 M. AF_03/2016","M3",2.8,1,2.8,null,null,0,0,"Referência: AGETOP - 40101"]
["S",2,"S",0,2,3,0,0,0,0,0,"","Serviço","Serviço","-","SINAPI",96995,"REATERRO MANUAL APILOADO COM SOQUETE. AF_10/2017","M3",1.4,1,1.4,null,null,0,0,"Referência: AGETOP - 40902"]
["S",2,"S",0,2,3,0,0,0,0,0,"","Serviço","Serviço","-","SINAPI",79480,"ESCAVACAO MECANICA CAMPO ABERTO EM SOLO EXCETO ROCHA ATE 2,00M PROFUNDIDADE","M3",22.4375,1,22.4375,null,null,0,0,"Referência: AGETOP - 41004"]
["S",2,"S",0,2,3,0,0,0,0,0,"","Serviço","Serviço","-","SINAPI",72898,"CARGA E DESCARGA MECANIZADAS DE ENTULHO EM CAMINHAO BASCULANTE 6 M3","M3",22.4375,1,22.4375,null,null,0,0,"Referência: AGETOP - 41005"]
["S",2,"S",0,2,3,0,0,0,0,0,"","Serviço","Serviço","-","AGETOP",41002,"APILOAMENTO","m2    ",22.4375,1,22.4375,null,null,0,0,""]
["S",2,"S",0,2,3,0,0,0,0,0,"","Serviço","Serviço","-","AGETOP",41006,"TRANSPORTE DE MATERIAL ESCAVADO M3.KM","m3km  ",89.75,1,89.75,null,null,0,0,""]
["S",2,"S",0,2,3,0,0,0,0,0,"","Serviço","Serviço","-","AGETOP",41008,"COMPACTAÇÃO MECÂNICA COM CONTROLE DA UMIDADE (95% PN)","m3    ",17.95,1,17.95,null,null,0,0,""]
[2,2,2,11,2,4,0,0,0,99,11,"","Nível 2","Nível 2","-","SINAPI",null,"FUNDAÇÕES E SONDAGENS","-",null,1,"-",null,null,0,0,""]
["S",2,"S",0,2,4,0,0,0,0,0,"","Serviço","Serviço","-","SINAPI",98230,"ESTACA BROCA DE CONCRETO, DIÂMETRO DE 30 CM, PROFUNDIDADE DE ATÉ 3 M, ESCAVAÇÃO MANUAL COM TRADO CONCHA, NÃO ARMADA. AF_03/2018","M",36,1,36,null,null,0,0,"Referência: AGETOP - 50302"]
["S",2,"S",0,2,4,0,0,0,0,0,"","Serviço","Serviço","-","SINAPI",96521,"ESCAVAÇÃO MECANIZADA PARA BLOCO DE COROAMENTO OU SAPATA, COM PREVISÃO DE FÔRMA, COM RETROESCAVADEIRA. AF_06/2017","M3",3.78,1,3.78,null,null,0,0,""]
["S",2,"S",0,2,4,0,0,0,0,0,"","Serviço","Serviço","-","SINAPI",93382,"REATERRO MANUAL DE VALAS COM COMPACTAÇÃO MECANIZADA. AF_04/2016","M3",0.28000000000000003,1,0.28000000000000003,null,null,0,0,"Referência: AGETOP - 40904"]
["S",2,"S",0,2,4,0,0,0,0,0,"","Serviço","Serviço","-","SINAPI",96534,"FABRICAÇÃO, MONTAGEM E DESMONTAGEM DE FÔRMA PARA BLOCO DE COROAMENTO, EM MADEIRA SERRADA, E=25 MM, 4 UTILIZAÇÕES. AF_06/2017","M2",3.5,1,3.5,null,null,0,0,"Referência: AGETOP - 51009"]
["S",2,"S",0,2,4,0,0,0,0,0,"","Serviço","Serviço","-","SINAPI",94963,"CONCRETO FCK = 15MPA, TRAÇO 1:3,4:3,5 (CIMENTO/ AREIA MÉDIA/ BRITA 1)  - PREPARO MECÂNICO COM BETONEIRA 400 L. AF_07/2016","M3",0.18,1,0.18,null,null,0,0,""]
["S",2,"S",0,2,4,0,0,0,0,0,"","Serviço","Serviço","-","SINAPI",94964,"CONCRETO FCK = 20MPA, TRAÇO 1:2,7:3 (CIMENTO/ AREIA MÉDIA/ BRITA 1)  - PREPARO MECÂNICO COM BETONEIRA 400 L. AF_07/2016","M3",2.0999999999999996,1,2.0999999999999996,null,null,0,0,""]
["S",2,"S",0,2,4,0,0,0,0,0,"","Serviço","Serviço","-","SINAPI",92874,"LANÇAMENTO COM USO DE BOMBA, ADENSAMENTO E ACABAMENTO DE CONCRETO EM ESTRUTURAS. AF_12/2015","M3",2.2799999999999998,1,2.2799999999999998,null,null,0,0,""]
["S",2,"S",0,2,4,0,0,0,0,0,"","Serviço","Serviço","-","SINAPI",96544,"ARMAÇÃO DE BLOCO, VIGA BALDRAME OU SAPATA UTILIZANDO AÇO CA-50 DE 6,3 MM - MONTAGEM. AF_06/2017","KG",26,1,26,null,null,0,0,"Referência: AGETOP - 52003"]
["S",2,"S",0,2,4,0,0,0,0,0,"","Serviço","Serviço","-","SINAPI",96545,"ARMAÇÃO DE BLOCO, VIGA BALDRAME OU SAPATA UTILIZANDO AÇO CA-50 DE 8 MM - MONTAGEM. AF_06/2017","KG",115,1,115,null,null,0,0,"Referência: AGETOP - 52004"]
["S",2,"S",0,2,4,0,0,0,0,0,"","Serviço","Serviço","-","SINAPI",96543,"ARMAÇÃO DE BLOCO, VIGA BALDRAME E SAPATA UTILIZANDO AÇO CA-60 DE 5 MM - MONTAGEM. AF_06/2017","KG",20,1,20,null,null,0,0,"Referência: AGETOP - 52014"]
[2,2,2,8,2,5,0,0,0,88,8,"","Nível 2","Nível 2","-","SINAPI",null,"ESTRUTURA","-",null,1,"-",null,null,0,0,""]
["S",2,"S",0,2,5,0,0,0,0,0,"","Serviço","Serviço","-","SINAPI",92415,"MONTAGEM E DESMONTAGEM DE FÔRMA DE PILARES RETANGULARES E ESTRUTURAS SIMILARES COM ÁREA MÉDIA DAS SEÇÕES MAIOR QUE 0,25 M², PÉ-DIREITO SIMPLES, EM CHAPA DE MADEIRA COMPENSADA RESINADA, 2 UTILIZAÇÕES. AF_12/2015","M2",30.22,1,30.22,null,null,0,0,""]
["S",2,"S",0,2,5,0,0,0,0,0,"","Serviço","Serviço","-","AGETOP",60192,"FORMA DE TABUA CINTA/PILAR SOBRE/ENTRE ALVENARIA U=8 VEZES","m2    ",72.240000000000009,1,72.240000000000009,null,null,0,0,""]
["S",2,"S",0,2,5,0,0,0,0,0,"","Serviço","Serviço","-","SINAPI",92777,"ARMAÇÃO DE PILAR OU VIGA DE UMA ESTRUTURA CONVENCIONAL DE CONCRETO ARMADO EM UMA EDIFICAÇÃO TÉRREA OU SOBRADO UTILIZANDO AÇO CA-50 DE 8,0 MM - MONTAGEM. AF_12/2015","KG",155,1,155,null,null,0,0,"Referência: AGETOP - 60304"]
["S",2,"S",0,2,5,0,0,0,0,0,"","Serviço","Serviço","-","SINAPI",92778,"ARMAÇÃO DE PILAR OU VIGA DE UMA ESTRUTURA CONVENCIONAL DE CONCRETO ARMADO EM UMA EDIFICAÇÃO TÉRREA OU SOBRADO UTILIZANDO AÇO CA-50 DE 10,0 MM - MONTAGEM. AF_12/2015","KG",233,1,233,null,null,0,0,"Referência: AGETOP - 60305"]
["S",2,"S",0,2,5,0,0,0,0,0,"","Serviço","Serviço","-","SINAPI",92775,"ARMAÇÃO DE PILAR OU VIGA DE UMA ESTRUTURA CONVENCIONAL DE CONCRETO ARMADO EM UMA EDIFICAÇÃO TÉRREA OU SOBRADO UTILIZANDO AÇO CA-60 DE 5,0 MM - MONTAGEM. AF_12/2015","KG",111,1,111,null,null,0,0,"Referência: AGETOP - 60314"]
["S",2,"S",0,2,5,0,0,0,0,0,"","Serviço","Serviço","-","SINAPI",94964,"CONCRETO FCK = 20MPA, TRAÇO 1:2,7:3 (CIMENTO/ AREIA MÉDIA/ BRITA 1)  - PREPARO MECÂNICO COM BETONEIRA 400 L. AF_07/2016","M3",3.91,1,3.91,null,null,0,0,""]
["S",2,"S",0,2,5,0,0,0,0,0,"","Serviço","Serviço","-","SINAPI",92874,"LANÇAMENTO COM USO DE BOMBA, ADENSAMENTO E ACABAMENTO DE CONCRETO EM ESTRUTURAS. AF_12/2015","M3",3.91,1,3.91,null,null,0,0,""]
[2,2,2,19,2,6,0,0,0,80,19,"","Nível 2","Nível 2","-","SINAPI",null,"INSTALAÇÕES ELÉTRICAS","-",null,1,"-",null,null,0,0,""]
["S",2,"S",0,2,6,0,0,0,0,0,"","Serviço","Serviço","-","SINAPI",91927,"CABO DE COBRE FLEXÍVEL ISOLADO, 2,5 MM², ANTI-CHAMA 0,6/1,0 KV, PARA CIRCUITOS TERMINAIS - FORNECIMENTO E INSTALAÇÃO. AF_12/2015","M",197,1,197,null,null,0,0,"Referência: AGETOP - 70581"]
["S",2,"S",0,2,6,0,0,0,0,0,"","Serviço","Serviço","-","SINAPI",91940,"CAIXA RETANGULAR 4\" X 2\" MÉDIA (1,30 M DO PISO), PVC, INSTALADA EM PAREDE - FORNECIMENTO E INSTALAÇÃO. AF_12/2015","UN",5,1,5,null,null,0,0,""]
["S",2,"S",0,2,6,0,0,0,0,0,"","Serviço","Serviço","-","SINAPI",91914,"CURVA 90 GRAUS PARA ELETRODUTO, PVC, ROSCÁVEL, DN 25 MM (3/4\"), PARA CIRCUITOS TERMINAIS, INSTALADA EM PAREDE - FORNECIMENTO E INSTALAÇÃO. AF_12/2015","UN",15,1,15,null,null,0,0,""]
["S",2,"S",0,2,6,0,0,0,0,0,"","Serviço","Serviço","-","SINAPI",91917,"CURVA 90 GRAUS PARA ELETRODUTO, PVC, ROSCÁVEL, DN 32 MM (1\"), PARA CIRCUITOS TERMINAIS, INSTALADA EM PAREDE - FORNECIMENTO E INSTALAÇÃO. AF_12/2015","UN",7,1,7,null,null,0,0,""]
["S",2,"S",0,2,6,0,0,0,0,0,"","Serviço","Serviço","-","SINAPI",93654,"DISJUNTOR MONOPOLAR TIPO DIN, CORRENTE NOMINAL DE 16A - FORNECIMENTO E INSTALAÇÃO. AF_04/2016","UN",3,1,3,null,null,0,0,""]
["S",2,"S",0,2,6,0,0,0,0,0,"","Serviço","Serviço","-","SINAPI",93671,"DISJUNTOR TRIPOLAR TIPO DIN, CORRENTE NOMINAL DE 32A - FORNECIMENTO E INSTALAÇÃO. AF_04/2016","UN",1,1,1,null,null,0,0,"Referência: AGETOP - 71173"]
["S",2,"S",0,2,6,0,0,0,0,0,"","Serviço","Serviço","-","SINAPI",91871,"ELETRODUTO RÍGIDO ROSCÁVEL, PVC, DN 25 MM (3/4\"), PARA CIRCUITOS TERMINAIS, INSTALADO EM PAREDE - FORNECIMENTO E INSTALAÇÃO. AF_12/2015","M",24,1,24,null,null,0,0,"Referência: AGETOP - 71201"]
["S",2,"S",0,2,6,0,0,0,0,0,"","Serviço","Serviço","-","SINAPI",91856,"ELETRODUTO FLEXÍVEL CORRUGADO, PVC, DN 32 MM (1\"), PARA CIRCUITOS TERMINAIS, INSTALADO EM PAREDE - FORNECIMENTO E INSTALAÇÃO. AF_12/2015","M",13,1,13,null,null,0,0,""]
["S",2,"S",0,2,6,0,0,0,{"$f":"IF(OR($C218=\"S\",$C218=0),0,MATCH(0,OFFSET($D218,1,$C218,ROW($C$289)-ROW($C218)),0))","v":0},{"$f":"IF(OR($C218=\"S\",$C218=0),0,MATCH(OFFSET($D218,0,$C218)+1,OFFSET($D218,1,$C218,ROW($C$289)-ROW($C218)),0))","v":0},"","Serviço","Serviço","-","SINAPI",91953,"INTERRUPTOR SIMPLES (1 MÓDULO), 10A/250V, INCLUINDO SUPORTE E PLACA - FORNECIMENTO E INSTALAÇÃO. AF_12/2015","UN",1,1,1,null,null,0,0,"Referência: AGETOP - 71440"]
["S",2,"S",0,2,6,0,0,0,0,0,"","Serviço","Serviço","-","COMPOSIÇÃO","COMP 387_SEE","LÂMPADA LED TUBULAR 18W ","UN ",16,1,16,null,null,0,0,""]
["S",2,"S",0,2,6,0,0,0,0,0,"","Serviço","Serviço","-","SINAPI",97585,"LUMINÁRIA TIPO CALHA, DE SOBREPOR, COM 2 LÂMPADAS TUBULARES FLUORESCENTES DE 18 W, COM REATOR DE PARTIDA RÁPIDA - FORNECIMENTO E INSTALAÇÃO. AF_02/2020","UN",8,1,8,null,null,0,0,""]
["S",2,"S",0,2,6,0,0,0,0,0,"","Serviço","Serviço","-","SINAPI",91884,"LUVA PARA ELETRODUTO, PVC, ROSCÁVEL, DN 25 MM (3/4\"), PARA CIRCUITOS TERMINAIS, INSTALADA EM PAREDE - FORNECIMENTO E INSTALAÇÃO. AF_12/2015","UN",15,1,15,null,null,0,0,"Referência: AGETOP - 71741"]
["S",2,"S",0,2,6,0,0,0,0,0,"","Serviço","Serviço","-","SINAPI",91885,"LUVA PARA ELETRODUTO, PVC, ROSCÁVEL, DN 32 MM (1\"), PARA CIRCUITOS TERMINAIS, INSTALADA EM PAREDE - FORNECIMENTO E INSTALAÇÃO. AF_12/2015","UN",7,1,7,null,null,0,0,"Referência: AGETOP - 71742"]
["S",2,"S",0,2,6,0,0,0,0,0,"","Serviço","Serviço","-","SINAPI",91996,"TOMADA MÉDIA DE EMBUTIR (1 MÓDULO), 2P+T 10 A, INCLUINDO SUPORTE E PLACA - FORNECIMENTO E INSTALAÇÃO. AF_12/2015","UN",4,1,4,null,null,0,0,"Referência: AGETOP - 72578"]
["S",2,"S",0,2,6,0,0,0,0,0,"","Serviço","Serviço","-","SINAPI",91997,"TOMADA MÉDIA DE EMBUTIR (1 MÓDULO), 2P+T 20 A, INCLUINDO SUPORTE E PLACA - FORNECIMENTO E INSTALAÇÃO. AF_12/2015","UN",1,1,1,null,null,0,0,""]
["S",2,"S",0,2,6,0,0,0,0,0,"","Serviço","Serviço","-","AGETOP",71450,"INTERRUPTOR DIFERENCIAL RESIDUAL (D.R.) BIPOLAR DE 25A-30mA","Un    ",3,1,3,null,null,0,0,""]
["S",2,"S",0,2,6,0,0,0,0,0,"","Serviço","Serviço","-","AGETOP",71331,"FITA ISOLANTE, ROLO DE 20,00 M","Un    ",2,1,2,null,null,0,0,""]
["S",2,"S",0,2,6,0,0,0,0,0,"","Serviço","Serviço","-","AGETOP",71321,"FITA DE AUTO FUSAO, ROLO E 10,00 MM","Un    ",1,1,1,null,null,0,0,""]
[2,2,2,31,2,7,0,0,0,61,31,"","Nível 2","Nível 2","-","SINAPI",null,"INSTALAÇÕES HIDROSSANITÁRIAS","-",null,1,"-",null,null,0,0,""]
[3,3,3,10,2,7,1,0,0,30,10,"","Nível 3","Nível 3","-","SINAPI",null,"PEÇAS E ACESSORIOS","-",null,1,"-",null,null,0,0,""]
["S",3,"S",0,2,7,1,0,0,0,0,"","Serviço","Serviço","-","AGETOP",81501,"ADESIVO PLASTICO - FRASCO 850 G","Un    ",2,1,2,null,null,0,0,""]
["S",3,"S",0,2,7,1,0,0,0,0,"","Serviço","Serviço","-","AGETOP",81504,"SOLUCAO LIMPADORA 1000 CM3","Un    ",2,1,2,null,null,0,0,""]
["S",3,"S",0,2,7,1,0,0,0,0,"","Serviço","Serviço","-","AGETOP",81825,"CAIXA DE PASSAGEM 60 X 60 CM SEM TAMPA","Un    ",1,1,1,null,null,0,0,""]
["S",3,"S",0,2,7,1,0,0,0,0,"","Serviço","Serviço","-","SINAPI",6171,"TAMPA DE CONCRETO ARMADO 60X60X5CM PARA CAIXA","UN",1,1,1,null,null,0,0,""]
["S",3,"S",0,2,7,1,0,0,0,0,"","Serviço","Serviço","-","SINAPI",86901,"CUBA DE EMBUTIR OVAL EM LOUÇA BRANCA, 35 X 50CM OU EQUIVALENTE - FORNECIMENTO E INSTALAÇÃO. AF_01/2020","UN",2,1,2,null,null,0,0,"Referência: AGETOP - 80587"]
["S",{"$f":"IF(OR(C235=\"s\",C235=0),OFFSET(B235,-1,0),C235)","v":3},{"$f":"IF(OFFSET(C235,-1,0)=\"L\",1,IF(OFFSET(C235,-1,0)=1,2,IF(OR(A235=\"s\",A235=0),\"S\",IF(AND(OFFSET(C235,-1,0)=2,A235=4),3,IF(AND(OR(OFFSET(C235,-1,0)=\"s\",OFFSET(C235,-1,0)=0),A235<>\"s\",A235>OFFSET(B235,-1,0)),OFFSET(B235,-1,0),A235)))))","v":"S"},{"$f":"IF(OR(C235=\"S\",C235=0),0,IF(ISERROR(K235),J235,SMALL(J235:K235,1)))","v":0},{"$f":"IF($C235=1,OFFSET(E235,-1,0)+1,OFFSET(E235,-1,0))","v":2},{"$f":"IF($C235=1,0,IF($C235=2,OFFSET(F235,-1,0)+1,OFFSET(F235,-1,0)))","v":7},{"$f":"IF(AND($C235<=2,$C235<>0),0,IF($C235=3,OFFSET(G235,-1,0)+1,OFFSET(G235,-1,0)))","v":1},{"$f":"IF(AND($C235<=3,$C235<>0),0,IF($C235=4,OFFSET(H235,-1,0)+1,OFFSET(H235,-1,0)))","v":0},{"$f":"IF(AND($C235<=4,$C235<>0),0,IF(AND($C235=\"S\",$Y235>0),OFFSET(I235,-1,0)+1,OFFSET(I235,-1,0)))","v":0},0,0,"","Serviço","Serviço","-","AGETOP",80556,"LIGAÇÃO FLEXÍVEL PVC DIAM.1/2\" (ENGATE)","Un    ",2,1,2,null,null,0,0,""]
["S",3,"S",0,2,7,1,0,0,0,0,"","Serviço","Serviço","-","AGETOP",80562,"SIFAO FLEXIVEL UNIVERSAL ( SANFONADO) EM PVC PARA LAVATORIO","Un    ",2,1,2,null,null,0,0,""]
["S",3,"S",0,2,7,1,0,0,0,0,"","Serviço","Serviço","-","SINAPI",86877,"VÁLVULA EM METAL CROMADO 1.1/2\u0094 X 1.1/2\u0094 PARA TANQUE OU LAVATÓRIO, COM OU SEM LADRÃO - FORNECIMENTO E INSTALAÇÃO. AF_01/2020","UN",2,1,2,null,null,0,0,"Referência: AGETOP - 80580"]
["S",3,"S",0,2,7,1,0,0,0,0,"","Serviço","Serviço","-","AGETOP",80570,"TORNEIRA DE MESA PARA LAVATÓRIO DIÂMETRO DE 1/2\"","Un    ",2,1,2,null,null,0,0,""]
[3,3,3,12,2,7,2,0,0,20,12,"","Nível 3","Nível 3","-","SINAPI",null,"AGUA FRIA","-",null,1,"-",null,null,0,0,""]
["S",3,"S",0,2,7,2,0,0,0,0,"","Serviço","Serviço","-","AGETOP",80927,"REGISTRO DE GAVETA C/CANOPLA DIAMETRO 1\"","Un    ",1,1,1,null,null,0,0,""]
[{"$f":"CHOOSE(1+LOG(1+2*(ORÇAMENTO.Nivel=\"Nível 1\")+4*(ORÇAMENTO.Nivel=\"Nível 2\")+8*(ORÇAMENTO.Nivel=\"Nível 3\")+16*(ORÇAMENTO.Nivel=\"Nível 4\")+32*(ORÇAMENTO.Nivel=\"Serviço\"),2),0,1,2,3,4,\"S\")","v":"S"},3,"S",0,2,7,2,0,0,0,0,"","Serviço","Serviço","-","SINAPI",89402,"TUBO, PVC, SOLDÁVEL, DN 25MM, INSTALADO EM RAMAL DE DISTRIBUIÇÃO DE ÁGUA - FORNECIMENTO E INSTALAÇÃO. AF_12/2014","M",3,1,3,null,null,0,0,"Referência: AGETOP - 81003"]
["S",3,"S",0,2,7,2,0,0,0,0,"","Serviço","Serviço","-","SINAPI",89447,"TUBO, PVC, SOLDÁVEL, DN 32MM, INSTALADO EM PRUMADA DE ÁGUA - FORNECIMENTO E INSTALAÇÃO. AF_12/2014","M",6,1,6,null,null,0,0,""]
["S",3,"S",0,2,7,2,0,0,0,0,"","Serviço","Serviço","-","SINAPI",94709,"ADAPTADOR COM FLANGES LIVRES, PVC, SOLDÁVEL, DN 32 MM X 1 , INSTALADO EM RESERVAÇÃO DE ÁGUA DE EDIFICAÇÃO QUE POSSUA RESERVATÓRIO DE FIBRA/FIBROCIMENTO   FORNECIMENTO E INSTALAÇÃO. AF_06/2016","UN",2,1,2,null,null,0,0,"Referência: AGETOP - 81042"]
["S",3,"S",0,2,7,2,0,0,0,0,"","Serviço","Serviço","-","SINAPI",96662,"BUCHA DE REDUÇÃO, PPR, 32 X 25, CLASSE PN 25, INSTALADO EM RAMAL DE DISTRIBUIÇÃO DE ÁGUA \u0096 FORNECIMENTO E INSTALAÇÃO . AF_06/2015","UN",1,1,1,null,null,0,0,""]
["S",3,"S",0,2,7,2,0,0,0,0,"","Serviço","Serviço","-","SINAPI",89481,"JOELHO 90 GRAUS, PVC, SOLDÁVEL, DN 25MM, INSTALADO EM PRUMADA DE ÁGUA - FORNECIMENTO E INSTALAÇÃO. AF_12/2014","UN",1,1,1,null,null,0,0,""]
["S",3,"S",0,2,7,2,0,0,0,0,"","Serviço","Serviço","-","AGETOP",81341,"JOELHO 90 GRAUS ROSCAVEL 1/2\" (MARROM)","Un    ",3,1,3,null,null,0,0,""]
["S",3,"S",0,2,7,2,0,0,0,0,"","Serviço","Serviço","-","AGETOP",81342,"JOELHO 90 GRAUS ROSCAVEL DIAMETRO 3/4\"","Un    ",1,1,1,null,null,0,0,""]
["S",3,"S",0,2,7,2,0,0,0,0,"","Serviço","Serviço","-","AGETOP",81322,"JOELHO 90 GRAUS SOLDAVEL DIAMETRO 32 MM (1\")","Un    ",20,1,20,null,null,0,0,""]
["S",3,"S",0,2,7,2,0,0,0,0,"","Serviço","Serviço","-","AGETOP",81421,"TE REDUCAO 90 GRAUS SOLDAVEL 32 X 25 mm","Un    ",2,1,2,null,null,0,0,""]
["S",3,"S",0,2,7,2,0,0,0,0,"","Serviço","Serviço","-","SINAPI",89617,"TE, PVC, SOLDÁVEL, DN 25MM, INSTALADO EM PRUMADA DE ÁGUA - FORNECIMENTO E INSTALAÇÃO. AF_12/2014","UN",1,1,1,null,null,0,0,""]
[3,3,3,8,2,7,3,0,0,8,{"$error":"#N/A"},"","Nível 3","Nível 3","-",null,null,"ESGOTO SANITÁRIO","-",null,1,"-",null,null,0,0,""]
["S",3,"S",0,2,7,3,0,0,0,0,"","Serviço","Serviço","-","AGETOP",81663,"CORPO CX. SIFONADA DIAM. 150 X 150 X 50","Un    ",1,1,1,null,null,0,0,""]
["S",3,"S",0,2,7,3,0,0,0,0,"","Serviço","Serviço","-","AGETOP",81752,"GRELHA QUADRADA ACO INOX ROTATIVO DIAM.150 MM","Un    ",1,1,1,null,null,0,0,""]
["S",3,"S",0,2,7,3,0,0,0,0,"","Serviço","Serviço","-","SINAPI",89726,"JOELHO 45 GRAUS, PVC, SERIE NORMAL, ESGOTO PREDIAL, DN 40 MM, JUNTA SOLDÁVEL, FORNECIDO E INSTALADO EM RAMAL DE DESCARGA OU RAMAL DE ESGOTO SANITÁRIO. AF_12/2014","UN",2,1,2,null,null,0,0,""]
["S",3,"S",0,2,7,3,0,0,0,0,"","Serviço","Serviço","-","SINAPI",89724,"JOELHO 90 GRAUS, PVC, SERIE NORMAL, ESGOTO PREDIAL, DN 40 MM, JUNTA SOLDÁVEL, FORNECIDO E INSTALADO EM RAMAL DE DESCARGA OU RAMAL DE ESGOTO SANITÁRIO. AF_12/2014","UN",3,1,3,null,null,0,0,""]
["S",3,"S",0,2,7,3,0,0,0,0,"","Serviço","Serviço","-","AGETOP",81927,"JOELHO 90 GRAUS C/ANEL 40 mm ","Un    ",3,1,3,null,null,0,0,""]
["S",3,"S",0,2,7,3,0,0,0,0,"","Serviço","Serviço","-","SINAPI",89711,"TUBO PVC, SERIE NORMAL, ESGOTO PREDIAL, DN 40 MM, FORNECIDO E INSTALADO EM RAMAL DE DESCARGA OU RAMAL DE ESGOTO SANITÁRIO. AF_12/2014","M",6,1,6,null,null,0,0,"Referência: AGETOP - 82301"]
["S",3,"S",0,2,7,3,0,0,0,0,"","Serviço","Serviço","-","SINAPI",89798,"TUBO PVC, SERIE NORMAL, ESGOTO PREDIAL, DN 50 MM, FORNECIDO E INSTALADO EM PRUMADA DE ESGOTO SANITÁRIO OU VENTILAÇÃO. AF_12/2014","M",3,1,3,null,null,0,0,""]
[2,2,2,4,2,8,0,0,0,30,4,"","Nível 2","Nível 2","-","SINAPI",null,"ALVENARIAS E DIVISÓRIAS","-",null,1,"-",null,null,0,0,""]
["S",2,"S",0,2,8,0,0,0,0,0,"","Serviço","Serviço","-","SINAPI",87471,"ALVENARIA DE VEDAÇÃO DE BLOCOS CERÂMICOS FURADOS NA VERTICAL DE 9X19X39CM (ESPESSURA 9CM) DE PAREDES COM ÁREA LÍQUIDA MENOR QUE 6M² SEM VÃOS E ARGAMASSA DE ASSENTAMENTO COM PREPARO EM BETONEIRA. AF_06/2014","M2",45.440000000000005,1,45.440000000000005,null,null,0,0,""]
["S",2,"S",0,2,8,0,0,0,0,0,"","Serviço","Serviço","-","SINAPI",93202,"FIXAÇÃO (ENCUNHAMENTO) DE ALVENARIA DE VEDAÇÃO COM TIJOLO MACIÇO. AF_03/2016","M",5.6,1,5.6,null,null,0,0,"Referência: AGETOP - 100204"]
["S",2,"S",0,2,8,0,0,0,0,0,"","Serviço","Serviço","-","SINAPI",95465,"COBOGO CERAMICO (ELEMENTO VAZADO), 9X20X20CM, ASSENTADO COM ARGAMASSA TRACO 1:4 DE CIMENTO E AREIA","M2",24.56,1,24.56,null,null,0,0,""]
[2,2,2,2,2,9,0,0,0,26,2,"","Nível 2","Nível 2","-","SINAPI",null,"IMPERMEABILIZAÇÃO","-",null,1,"-",null,null,0,0,""]
["S",2,"S",0,2,9,0,0,0,0,0,"","Serviço","Serviço","-","SINAPI",98546,"IMPERMEABILIZAÇÃO DE SUPERFÍCIE COM MANTA ASFÁLTICA, UMA CAMADA, INCLUSIVE APLICAÇÃO DE PRIMER ASFÁLTICO, E=3MM. AF_06/2018","M2",30.3,1,30.3,null,null,0,0,"Referência: AGETOP - 120107"]
[2,2,2,2,2,10,0,0,0,24,2,"","Nível 2","Nível 2","-","SINAPI",null,"ESTRUTURAS METÁLICAS","-",null,1,"-",null,null,0,0,""]
["S",2,"S",0,2,10,0,0,0,0,0,"","Serviço","Serviço","-","AGETOP",150103,"ESTRUTURA METÁLICA CONVENCIONAL EM AÇO DO TIPO USI SAC-300 COM FUNDO ANTICORROSIVO","Kg    ",1638.68,1,1638.68,null,null,0,0,""]
[2,2,2,4,2,11,0,0,0,22,4,"","Nível 2","Nível 2","-","SINAPI",null,"COBERTURAS","-",null,1,"-",null,null,0,0,""]
["S",2,"S",0,2,11,0,0,0,0,0,"","Serviço","Serviço","-","SINAPI",94445,"TELHAMENTO COM TELHA CERÂMICA CAPA-CANAL, TIPO PLAN, COM ATÉ 2 ÁGUAS, INCLUSO TRANSPORTE VERTICAL. AF_07/2019","M2",124.64,1,124.64,null,null,0,0,"Referência: AGETOP - 160401"]
["S",2,"S",0,2,11,0,0,0,0,0,"","Serviço","Serviço","-","SINAPI",94221,"CUMEEIRA PARA TELHA CERÂMICA EMBOÇADA COM ARGAMASSA TRAÇO 1:2:9 (CIMENTO, CAL E AREIA) PARA TELHADOS COM ATÉ 2 ÁGUAS, INCLUSO TRANSPORTE VERTICAL. AF_07/2019","M",15.2,1,15.2,null,null,0,0,""]
["S",2,"S",0,2,11,0,0,0,0,0,"","Serviço","Serviço","-","SINAPI",94224,"EMBOÇAMENTO COM ARGAMASSA TRAÇO 1:2:9 (CIMENTO, CAL E AREIA). AF_07/2019","M",47.2,1,47.2,null,null,0,0,"Referência: AGETOP - 160403"]
[2,2,2,5,2,12,0,0,0,18,5,"","Nível 2","Nível 2","-","SINAPI",null,"REVESTIMENTO DE PAREDE","-",null,1,"-",null,null,0,0,""]
["S",2,"S",0,2,12,0,0,0,0,0,"","Serviço","Serviço","-","SINAPI",87879,"CHAPISCO APLICADO EM ALVENARIAS E ESTRUTURAS DE CONCRETO INTERNAS, COM COLHER DE PEDREIRO.  ARGAMASSA TRAÇO 1:3 COM PREPARO EM BETONEIRA 400L. AF_06/2014","M2",75.52,1,75.52,null,null,0,0,""]
["S",2,"S",0,2,12,0,0,0,0,0,"","Serviço","Serviço","-","SINAPI",87547,"MASSA ÚNICA, PARA RECEBIMENTO DE PINTURA, EM ARGAMASSA TRAÇO 1:2:8, PREPARO MECÂNICO COM BETONEIRA 400L, APLICADA MANUALMENTE EM FACES INTERNAS DE PAREDES, ESPESSURA DE 10MM, COM EXECUÇÃO DE TALISCAS. AF_06/2014","M2",72.36999999999999,1,72.36999999999999,null,null,0,0,""]
["S",2,"S",0,2,12,0,0,0,0,0,"","Serviço","Serviço","-","SINAPI",87336,"ARGAMASSA TRAÇO 1:2:8 (EM VOLUME DE CIMENTO, CAL E AREIA MÉDIA ÚMIDA) PARA EMBOÇO/MASSA ÚNICA/ASSENTAMENTO DE ALVENARIA DE VEDAÇÃO, PREPARO MECÂNICO COM MISTURADOR DE EIXO HORIZONTAL DE 600 KG. AF_08/2019","M3",3.15,1,3.15,null,null,0,0,""]
["S",2,"S",0,2,12,0,0,0,0,0,"","Serviço","Serviço","-","SINAPI",87274,"REVESTIMENTO CERÂMICO PARA PAREDES INTERNAS COM PLACAS TIPO ESMALTADA EXTRA DE DIMENSÕES 33X45 CM APLICADAS EM AMBIENTES DE ÁREA MENOR QUE 5 M² A MEIA ALTURA DAS PAREDES. AF_06/2014","M2",3.15,1,3.15,null,null,0,0,"Referência: AGETOP - 201302"]
[2,2,2,5,2,13,0,0,0,13,5,"","Nível 2","Nível 2","-","SINAPI",null,"REVESTIMENTO DE PISO","-",null,1,"-",null,null,0,0,""]
["S",2,"S",0,2,13,0,0,0,0,0,"","Serviço","Serviço","-","SINAPI",95241,"LASTRO DE CONCRETO MAGRO, APLICADO EM PISOS OU RADIERS, ESPESSURA DE 5 CM. AF_07/2016","M2",89.67,1,89.67,null,null,0,0,""]
["S",2,"S",0,2,13,0,0,0,0,0,"","Serviço","Serviço","-","SINAPI",84191,"PISO EM GRANILITE, MARMORITE OU GRANITINA ESPESSURA 8 MM, INCLUSO JUNTAS DE DILATACAO PLASTICAS","M2",90.723500000000001,1,90.723500000000001,null,null,0,0,"Referência: AGETOP - 221101"]
["S",2,"S",0,2,13,0,0,0,0,0,"","Serviço","Serviço","-","AGETOP",221104,"RASPAGEM E APLICAÇÃO RESINA ACRÍLICA DUAS DEMÃOS","m2    ",90.723500000000001,1,90.723500000000001,null,null,0,0,""]
["S",2,"S",0,2,13,0,0,0,0,0,"","Serviço","Serviço","-","SINAPI",94992,"EXECUÇÃO DE PASSEIO (CALÇADA) OU PISO DE CONCRETO COM CONCRETO MOLDADO IN LOCO, FEITO EM OBRA, ACABAMENTO CONVENCIONAL, ESPESSURA 6 CM, ARMADO. AF_07/2016","M2",25.68,1,25.68,null,null,0,0,""]
[2,2,2,4,2,14,0,0,0,8,4,"","Nível 2","Nível 2","-","SINAPI",null,"PINTURA","-",null,1,"-",null,null,0,0,""]
["S",2,"S",0,2,14,0,0,0,{"$f":"IF(OR($C282=\"S\",$C282=0),0,MATCH(0,OFFSET($D282,1,$C282,ROW($C$289)-ROW($C282)),0))","v":0},{"$f":"IF(OR($C282=\"S\",$C282=0),0,MATCH(OFFSET($D282,0,$C282)+1,OFFSET($D282,1,$C282,ROW($C$289)-ROW($C282)),0))","v":0},"","Serviço","Serviço","-","SINAPI",88497,"APLICAÇÃO E LIXAMENTO DE MASSA LÁTEX EM PAREDES, DUAS DEMÃOS. AF_06/2014","M2",65.36,1,65.36,null,null,0,0,"Referência: AGETOP - 261300"]
["S",2,"S",0,2,14,0,0,0,0,0,"","Serviço","Serviço","-","SINAPI",88489,"APLICAÇÃO MANUAL DE PINTURA COM TINTA LÁTEX ACRÍLICA EM PAREDES, DUAS DEMÃOS. AF_06/2014","M2",65.36,1,65.36,null,null,0,0,"Referência: AGETOP - 261001"]
["S",2,"S",0,2,14,0,0,0,0,0,"","Serviço","Serviço","-","AGETOP",261602,"PINT.ESMALTE/ESQUAD.FERRO C/FUNDO ANTICOR.","m2    ",128.9,1,128.9,null,null,0,0,""]
[2,2,2,4,2,15,0,0,0,4,{"$error":"#N/A"},"","Nível 2","Nível 2","-","SINAPI",null,"DIVERSOS","-",null,1,"-",null,null,0,0,""]
["S",2,"S",0,2,15,0,0,0,0,0,"","Serviço","Serviço","-","AGETOP",270501,"LIMPEZA FINAL DE OBRA - (OBRAS CIVIS)","m2    ",89.67,1,89.67,null,null,0,0,""]
["S",2,"S",0,2,15,0,0,0,0,0,"","Serviço","Serviço","-","AGETOP",271303,"BANCO DE CONCRETO POLIDO BASE EM ALVENARIA REBOCADA E PINTADA - PADRÃO GOINFRA ","m     ",12.6,1,12.6,null,null,0,0,""]
["S",2,"S",0,2,15,0,0,0,0,0,"","Serviço","Serviço","-","AGETOP",271608,"BANCADA DE GRANITO C/ESPELHO","m2    ",1.4824999999999999,1,1.4824999999999999,null,null,0,0,""]
[-1,null,-1,null,0,0,0,0,0,null,null,"F"]
[null,null,null,null,null,null,null,null,null,null,null,"F",null,null,null,null,null,"OBS: OS QUANTITATIVOS DE MATERIAIS  DAS INSTALAÇÕES HIDROSSANITÁRIAS, ELÉTRICAS E ESPECIAIS SÃO FORNECIDOS PELOS PROFISSIONAIS RESPONSÁVEIS PELOS RESPECTIVOS PROJETOS.",null,null,null,null,null,"VALOR TOTAL",null,0]
[null,null,null,null,null,null,null,null,null,null,null,"F",null,null,null,null,null,null,null,null,null,null,null,"VALOR BDI (26,43%)",null,0]
[null,null,null,null,null,null,null,null,null,null,null,"F",null,null,null,null,null,null,null,null,null,null,null,"TOTAL ORÇAMENTO",null,0]
[null,null,null,null,null,null,null,null,null,null,null,"F"]
[null,null,null,null,null,null,null,null,null,null,null,"F",null,null,null,null,null,null,null,null,null,null,null,"CUSTO POR M2 ³",null,0]
[null,null,null,null,null,null,null,null,null,null,null,"F",null,null,null,null,null,null,null,null,null,null,null,"MATERIAL S/ BDI",null,0]
[null,null,null,null,null,null,null,null,null,null,null,"F",null,null,null,null,null,null,null,null,null,null,null,"MÃO DE OBRA S/ BDI",null,0]
[null,null,null,null,null,null,null,null,null,null,null,"F"]
[null,null,null,null,null,null,null,null,null,null,null,"F",null,null,null,null,"(1) Conforme previsto pelo DECRETO Nº 7.983, DE 8 DE ABRIL DE 2013, os preços adotados são aqueles constantes dos sistemas de referência indicados. Justifica-se o uso dos preços destas composições de custos unitários devido ao seu valor ser menor à mediana de seus correspondentes na tabela SINAPI;"]
[null,null,null,null,null,null,null,null,null,null,null,"F",null,null,null,null,"(2) Optou-se pelo uso das composições de custos da AGETOP para itens não presentes na SINAPI;"]
[null,null,null,null,null,null,null,null,null,null,null,"F",null,null,null,null,"(3) Para itens da AGETOP, os vidros não estão inclusos nas esquadrias e já foram considerados os custos de contramarco para as esquadrias de alumínio;"]
[null,null,null,null,null,null,null,null,null,null,null,"F",null,null,null,null,"(4) Nos casos em que houver execução de granitina e omissão do item AGETOP 221102, considerou-se que o quantitativo para o rodapé, de altura igual a 7cm, foi incorporado na área de piso;"]
[null,null,null,null,null,null,null,null,null,null,null,"F",null,null,null,null,"(5) O custo unitário aproximado por metro quadrado é calculado dividindo-se o valor total do orçamento pela área total de construção."]
[null,null,null,null,null,null,null,null,null,null,null,"F"]
[null,null,null,null,null,null,null,null,null,null,null,"F"]
[]
[null,null,null,null,null,null,null,null,null,null,null,null,null,null,"SOMATÓRIO DE SERVIÇOS"]
[null,null,null,null,null,null,null,null,null,null,null,null,null,null,"ITEM","DESCRIÇÃO DOS SERVIÇOS",null,null,"PREÇO SEM BDI",null,null,null,null,"PREÇO COM BDI",null,null,"PARTICIPAÇÃO ( % )"]
[null,null,null,null,null,null,null,null,null,null,null,null,null,null,"a.","SERVIÇOS PRELIMINARES",null,null,0,null,null,null,null,0,null,null,0]
[null,null,null,null,null,null,null,null,null,null,null,null,null,null,"b.","TRANSPORTES",null,null,0,null,null,null,null,0,null,null,0]
[null,null,null,null,null,null,null,null,null,null,null,null,null,null,"c.","SERVIÇO EM TERRA",null,null,0,null,null,null,null,0,null,null,0]
[null,null,null,null,null,null,null,null,null,null,null,null,null,null,"d.","FUNDAÇÕES E SONDAGENS",null,null,0,null,null,null,null,0,null,null,0]
[null,null,null,null,null,null,null,null,null,null,null,null,null,null,"e.","ESTRUTURA",null,null,0,null,null,null,null,0,null,null,0]
[null,null,null,null,null,null,null,null,null,null,null,null,null,null,"f.","INSTALAÇÕES ELÉTRICAS",null,null,0,null,null,null,null,0,null,null,0]
[null,null,null,null,null,null,null,null,null,null,null,null,null,null,"g.","INSTALAÇÕES HIDROSSANITÁRIAS",null,null,0,null,null,null,null,0,null,null,0]
[null,null,null,null,null,null,null,null,null,null,null,null,null,null,"h","INSTALAÇÕES ESPECIAIS",null,null,0,null,null,null,null,0,null,null,0]
[null,null,null,null,null,null,null,null,null,null,null,null,null,null,"i.","ALVENARIAS E DIVISÓRIAS",null,null,0,null,null,null,null,0,null,null,0]
[null,null,null,null,null,null,null,null,null,null,null,null,null,null,"j.","ALVENARIA AUTO-PORTANTE",null,null,0,null,null,null,null,0,null,null,0]
[null,null,null,null,null,null,null,null,null,null,null,null,null,null,"k.","IMPERMEABILIZAÇÃO",null,null,0,null,null,null,null,0,null,null,0]
[null,null,null,null,null,null,null,null,null,null,null,null,null,null,"l.","ISOLAMENTO TÉRMICO E ACÚSTICO",null,null,0,null,null,null,null,0,null,null,0]
[null,null,null,null,null,null,null,null,null,null,null,null,null,null,"m.","ESTRUTURA DE MADEIRA",null,null,0,null,null,null,null,0,null,null,0]
[null,null,null,null,null,null,null,null,null,null,null,null,null,null,"n.","ESTRUTURAS METÁLICAS",null,null,0,null,null,null,null,0,null,null,0]
[null,null,null,null,null,null,null,null,null,null,null,null,null,null,"o.","COBERTURAS",null,null,0,null,null,null,null,0,null,null,0]
[null,null,null,null,null,null,null,null,null,null,null,null,null,null,"p.","ESQUADRIAS DE MADEIRA",null,null,0,null,null,null,null,0,null,null,0]
[null,null,null,null,null,null,null,null,null,null,null,null,null,null,"q.","ESQUADRIAS METÁLICAS",null,null,0,null,null,null,null,0,null,null,0]
[null,null,null,null,null,null,null,null,null,null,null,null,null,null,"r.","VIDROS",null,null,0,null,null,null,null,0,null,null,0]
[null,null,null,null,null,null,null,null,null,null,null,null,null,null,"s.","REVESTIMENTO DE PAREDE",null,null,0,null,null,null,null,0,null,null,0]
[null,null,null,null,null,null,null,null,null,null,null,null,null,null,"t.","FORROS",null,null,0,null,null,null,null,0,null,null,0]
[null,null,null,null,null,null,null,null,null,null,null,null,null,null,"u.","REVESTIMENTO DE PISO",null,null,0,null,null,null,null,0,null,null,0]
[null,null,null,null,null,null,null,null,null,null,null,null,null,null,"v.","FERRAGENS",null,null,0,null,null,null,null,0,null,null,0]
[null,null,null,null,null,null,null,null,null,null,null,null,null,null,"w.","MARCENARIA",null,null,0,null,null,null,null,0,null,null,0]
[null,null,null,null,null,null,null,null,null,null,null,null,null,null,"x.","ADMINISTRAÇÃO",null,null,0,null,null,null,null,0,null,null,0]
[null,null,null,null,null,null,null,null,null,null,null,null,null,null,"y.","PINTURA",null,null,0,null,null,null,null,0,null,null,0]
[null,null,null,null,null,null,null,null,null,null,null,null,null,null,"z.","DIVERSOS",null,null,0,null,null,null,null,0,null,null,0]
[null,null,null,null,null,null,null,null,null,null,null,null,null,null,"TOTAL GERAL DO ORÇAMENTO (R$)",null,null,null,0,null,null,null,null,0,null,null,0]
[null,null,null,null,null,null,null,null,null,null,null,null,null,null,null,null,null,null,0,null,null,null,null,0,null,null,100]
[null,null,null,null,null,null,null,null,null,null,null,null,null,null,null,null,null,null,"(TOTAL SEM BDI)",null,null,null,null,"(TOTAL COM BDI)",null,null,"(ARRED porcentagem)"]
[null,null,null,null,null,null,null,null,null,null,null,null,null,null,null,null,null,null,"ERRO",null,null,null,null,"ERRO",null,null,"ERRO"]
[]
[]
[null,null,null,null,null,null,null,null,null,null,null,null,null,null,"RESUMO GERAL DO ORÇAMENTO"]
[null,null,null,null,null,null,null,null,null,null,null,null,null,null,"ITEM","DESCRIÇÃO DOS SERVIÇOS",null,null,"PREÇO SEM BDI",null,null,null,null,"PREÇO COM BDI",null,null,"PARTICIPAÇÃO ( % )"]
[null,null,null,null,null,null,null,null,null,null,null,null,null,null,"1.","REFORMA E AMPLIAÇÃO",null,null,0,null,null,null,null,0,null,null,{"$error":"#DIV/0!"}]
[null,null,null,null,null,null,null,null,null,null,null,null,null,null,"2.","PATIO MULTIUSO OPÇÃO 02",null,null,0,null,null,null,null,0,null,null,{"$error":"#DIV/0!"}]
[null,null,null,null,null,null,null,null,null,null,null,null,null,null,"3.","",null,null,0,null,null,null,null,0,null,null,{"$error":"#DIV/0!"}]
[null,null,null,null,null,null,null,null,null,null,null,null,null,null,"4.","",null,null,0,null,null,null,null,0,null,null,{"$error":"#DIV/0!"}]
[null,null,null,null,null,null,null,null,null,null,null,null,null,null,"5.","",null,null,0,null,null,null,null,0,null,null,{"$error":"#DIV/0!"}]
[null,null,null,null,null,null,null,null,null,null,null,null,null,null,"6.","",null,null,0,null,null,null,null,0,null,null,{"$error":"#DIV/0!"}]
[null,null,null,null,null,null,null,null,null,null,null,null,null,null,"7.","",null,null,0,null,null,null,null,0,null,null,{"$error":"#DIV/0!"}]
[null,null,null,null,null,null,null,null,null,null,null,null,null,null,"8.","",null,null,0,null,null,null,null,0,null,null,{"$error":"#DIV/0!"}]
[null,null,null,null,null,null,null,null,null,null,null,null,null,null,"9.","",null,null,0,null,null,null,null,0,null,null,{"$error":"#DIV/0!"}]
[null,null,null,null,null,null,null,null,null,null,null,null,null,null,"10.","",null,null,0,null,null,null,null,0,null,null,{"$error":"#DIV/0!"}]
[null,null,null,null,null,null,null,null,null,null,null,null,null,null,"11.","",null,null,0,null,null,null,null,0,null,null,{"$error":"#DIV/0!"}]
[null,null,null,null,null,null,null,null,null,null,null,null,null,null,"12.","",null,null,0,null,null,null,null,0,null,null,{"$error":"#DIV/0!"}]
[null,null,null,null,null,null,null,null,null,null,null,null,null,null,"13.","",null,null,0,null,null,null,null,0,null,null,{"$error":"#DIV/0!"}]
[null,null,null,null,null,null,null,null,null,null,null,null,null,null,"14.","",null,null,0,null,null,null,null,0,null,null,{"$error":"#DIV/0!"}]
[null,null,null,null,null,null,null,null,null,null,null,null,null,null,"15.","",null,null,0,null,null,null,null,0,null,null,{"$error":"#DIV/0!"}]
[null,null,null,null,null,null,null,null,null,null,null,null,null,null,"16.","",null,null,0,null,null,null,null,0,null,null,{"$error":"#DIV/0!"}]
[null,null,null,null,null,null,null,null,null,null,null,null,null,null,"17.","",null,null,0,null,null,null,null,0,null,null,{"$error":"#DIV/0!"}]
[null,null,null,null,null,null,null,null,null,null,null,null,null,null,"18.","",null,null,0,null,null,null,null,0,null,null,{"$error":"#DIV/0!"}]
[null,null,null,null,null,null,null,null,null,null,null,null,null,null,"19.","",null,null,0,null,null,null,null,0,null,null,{"$error":"#DIV/0!"}]
[null,null,null,null,null,null,null,null,null,null,null,null,null,null,"20.","",null,null,0,null,null,null,null,0,null,null,{"$error":"#DIV/0!"}]
[null,null,null,null,null,null,null,null,null,null,null,null,null,null,"TOTAL GERAL DO ORÇAMENTO (R$)",null,null,null,0,null,null,null,null,0,null,null,{"$error":"#DIV/0!"}]
[null,null,null,null,null,null,null,null,null,null,null,null,null,null,null,null,null,null,0,null,null,null,null,0,null,null,100]
[null,null,null,null,null,null,null,null,null,null,null,null,null,null,null,null,null,null,"(TOTAL SEM BDI)",null,null,null,null,"(TOTAL COM BDI)",null,null,"(ARRED porcentagem)"]
[null,null,null,null,null,null,null,null,null,null,null,null,null,null,null,null,null,null,"ERRO",null,null,null,null,"ERRO",null,null,{"$error":"#DIV/0!"}]

{"sheet":"Resumo ","index":1,"n_rows":39,"n_cols":9,"rows_kept":39,"cut":false,"hidden":false,"merged":[[42,3,42,7],[41,3,41,7],[38,1,38,8],[22,2,22,5],[23,2,23,5],[24,2,24,5],[25,2,25,5],[26,2,26,5],[32,2,32,5],[33,2,33,5],[34,2,34,5],[35,2,35,5],[27,2,27,5],[28,2,28,5],[29,2,29,5],[30,2,30,5],[31,2,31,5],[1,1,1,8],[2,6,2,8],[3,6,3,8],[4,1,4,8],[5,6,5,8],[6,6,6,8],[7,1,7,8],[8,6,8,8],[9,6,9,8],[13,1,13,8],[11,1,11,2],[12,1,12,2],[0,1,0,8],[36,1,36,5],[2,1,2,5],[3,1,3,5],[5,1,5,5],[6,1,6,5],[8,1,8,5],[9,1,9,5],[11,3,11,5],[12,3,12,5],[10,1,10,8],[11,6,11,8],[12,6,12,8],[19,2,19,5],[20,2,20,5],[21,2,21,5],[13,0,14,0],[15,2,15,5],[16,2,16,5],[17,2,17,5],[18,2,18,5],[14,1,14,8]]}
[]
[]
[null,"UNIDADE ESCOLAR",null,null,null,null,"CÓDIGO INEP"]
[null,{"$f":"Orçamento!$O$4","v":"CENTRO DE ENSINO EM PERÍODO INTEGRAL DRº ARY RIBEIRO VALADÃO FILHO"},null,null,null,null,{"$f":"Orçamento!X4","v":52024180}]
[]
[null,"OBRA",null,null,null,null,"CIDADE"]
[null,{"$f":"Orçamento!$O$7","v":"REFORMA E AMPLIAÇÃO"},null,null,null,null,{"$f":"Orçamento!$X$7","v":"ITAGUARU"}]
[]
[null,"ENDEREÇO",null,null,null,null,"CRE"]
[null,{"$f":"Orçamento!$R$10","v":" R. BENIGNO PINTO DE FARIA 1068 , CENTRO , CEP: 7666-000"},null,null,null,null,{"$f":"Orçamento!$O$10","v":"CRE-ITABERAI"}]
[]
[null,"REFERÊNCIA",null,"DATA",null,null,"ÁREA TOTAL CONSTRUÍDA (M²)"]
[null,{"$f":"CONCATENATE(\"AGETOP E SINAPI - \",Orçamento!$T$10)","v":"AGETOP E SINAPI - DESONERADA"},null,{"$f":"Orçamento!$S$7","v":"2020-05-13"},null,null,{"$f":"Orçamento!$X$13","v":1262.3600000000001}]
["FILTRO"]
[null,"RESUMO GERAL DO ORÇAMENTO"]
["↓","ITEM","DESCRIÇÃO DOS SERVIÇOS",null,null,null,"PREÇO SEM BDI","PREÇO COM BDI","PARTICIP. (%)"]
[{"$f":"IF(G17>0,\"F\",\"\")","v":""},"1.",{"$f":"Orçamento!$P342","v":"REFORMA E AMPLIAÇÃO"},null,null,null,{"$f":"IFERROR(Orçamento!S342,\"-\")","v":0},{"$f":"IFERROR(Orçamento!X342,\"\")","v":0},{"$f":"Orçamento!AA342","v":{"$error":"#DIV/0!"}}]
[{"$f":"IF(G18>0,\"F\",\"\")","v":""},"2.",{"$f":"Orçamento!$P343","v":"PATIO MULTIUSO OPÇÃO 02"},null,null,null,{"$f":"IFERROR(Orçamento!S343,\"-\")","v":0},{"$f":"IFERROR(Orçamento!X343,\"\")","v":0},{"$f":"Orçamento!AA343","v":{"$error":"#DIV/0!"}}]
["","3.",{"$f":"Orçamento!$P344","v":""},null,null,null,{"$f":"IFERROR(Orçamento!S344,\"-\")","v":0},{"$f":"IFERROR(Orçamento!X344,\"\")","v":0},{"$f":"Orçamento!AA344","v":{"$error":"#DIV/0!"}}]
["","4.",{"$f":"Orçamento!$P345","v":""},null,null,null,{"$f":"IFERROR(Orçamento!S345,\"-\")","v":0},{"$f":"IFERROR(Orçamento!X345,\"\")","v":0},{"$f":"Orçamento!AA345","v":{"$error":"#DIV/0!"}}]
["","5.",{"$f":"Orçamento!$P346","v":""},null,null,null,{"$f":"IFERROR(Orçamento!S346,\"-\")","v":0},{"$f":"IFERROR(Orçamento!X346,\"\")","v":0},{"$f":"Orçamento!AA346","v":{"$error":"#DIV/0!"}}]
["","6.",{"$f":"Orçamento!$P347","v":""},null,null,null,{"$f":"IFERROR(Orçamento!S347,\"-\")","v":0},{"$f":"IFERROR(Orçamento!X347,\"\")","v":0},{"$f":"Orçamento!AA347","v":{"$error":"#DIV/0!"}}]
["","7.",{"$f":"Orçamento!$P348","v":""},null,null,null,{"$f":"IFERROR(Orçamento!S348,\"-\")","v":0},{"$f":"IFERROR(Orçamento!X348,\"\")","v":0},{"$f":"Orçamento!AA348","v":{"$error":"#DIV/0!"}}]
["","8.",{"$f":"Orçamento!$P349","v":""},null,null,null,{"$f":"IFERROR(Orçamento!S349,\"-\")","v":0},{"$f":"IFERROR(Orçamento!X349,\"\")","v":0},{"$f":"Orçamento!AA349","v":{"$error":"#DIV/0!"}}]
["","9.",{"$f":"Orçamento!$P350","v":""},null,null,null,{"$f":"IFERROR(Orçamento!S350,\"-\")","v":0},{"$f":"IFERROR(Orçamento!X350,\"\")","v":0},{"$f":"Orçamento!AA350","v":{"$error":"#DIV/0!"}}]
["","10.",{"$f":"Orçamento!$P351","v":""},null,null,null,{"$f":"IFERROR(Orçamento!S351,\"-\")","v":0},{"$f":"IFERROR(Orçamento!X351,\"\")","v":0},{"$f":"Orçamento!AA351","v":{"$error":"#DIV/0!"}}]
["","11.",{"$f":"Orçamento!$P352","v":""},null,null,null,{"$f":"IFERROR(Orçamento!S352,\"-\")","v":0},{"$f":"IFERROR(Orçamento!X352,\"\")","v":0},{"$f":"Orçamento!AA352","v":{"$error":"#DIV/0!"}}]
["","12.",{"$f":"Orçamento!$P353","v":""},null,null,null,{"$f":"IFERROR(Orçamento!S353,\"-\")","v":0},{"$f":"IFERROR(Orçamento!X353,\"\")","v":0},{"$f":"Orçamento!AA353","v":{"$error":"#DIV/0!"}}]
["","13.",{"$f":"Orçamento!$P354","v":""},null,null,null,{"$f":"IFERROR(Orçamento!S354,\"-\")","v":0},{"$f":"IFERROR(Orçamento!X354,\"\")","v":0},{"$f":"Orçamento!AA354","v":{"$error":"#DIV/0!"}}]
["","14.",{"$f":"Orçamento!$P355","v":""},null,null,null,{"$f":"IFERROR(Orçamento!S355,\"-\")","v":0},{"$f":"IFERROR(Orçamento!X355,\"\")","v":0},{"$f":"Orçamento!AA355","v":{"$error":"#DIV/0!"}}]
["","15.",{"$f":"Orçamento!$P356","v":""},null,null,null,{"$f":"IFERROR(Orçamento!S356,\"-\")","v":0},{"$f":"IFERROR(Orçamento!X356,\"\")","v":0},{"$f":"Orçamento!AA356","v":{"$error":"#DIV/0!"}}]
["","16.",{"$f":"Orçamento!$P357","v":""},null,null,null,{"$f":"IFERROR(Orçamento!S357,\"-\")","v":0},{"$f":"IFERROR(Orçamento!X357,\"\")","v":0},{"$f":"Orçamento!AA357","v":{"$error":"#DIV/0!"}}]
["","17.",{"$f":"Orçamento!$P358","v":""},null,null,null,{"$f":"IFERROR(Orçamento!S358,\"-\")","v":0},{"$f":"IFERROR(Orçamento!X358,\"\")","v":0},{"$f":"Orçamento!AA358","v":{"$error":"#DIV/0!"}}]
["","18.",{"$f":"Orçamento!$P359","v":""},null,null,null,{"$f":"IFERROR(Orçamento!S359,\"-\")","v":0},{"$f":"IFERROR(Orçamento!X359,\"\")","v":0},{"$f":"Orçamento!AA359","v":{"$error":"#DIV/0!"}}]
["","19.",{"$f":"Orçamento!$P360","v":""},null,null,null,{"$f":"IFERROR(Orçamento!S360,\"-\")","v":0},{"$f":"IFERROR(Orçamento!X360,\"\")","v":0},{"$f":"Orçamento!AA360","v":{"$error":"#DIV/0!"}}]
["","20.",{"$f":"Orçamento!$P361","v":""},null,null,null,{"$f":"IFERROR(Orçamento!S361,\"-\")","v":0},{"$f":"IFERROR(Orçamento!X361,\"\")","v":0},{"$f":"Orçamento!AA361","v":{"$error":"#DIV/0!"}}]
["F","TOTAL GERAL DO ORÇAMENTO (R$)",null,null,null,null,{"$f":"SUM(G17:G36)","v":0},0,{"$f":"SUM(I17:I36)","v":{"$error":"#DIV/0!"}}]
["F"]
["F"]

{"sheet":"Somatório","index":2,"n_rows":45,"n_cols":6,"rows_kept":45,"cut":false,"hidden":false,"merged":[[0,1,0,5],[14,1,14,5],[2,1,2,3],[2,4,2,5],[3,1,3,3],[3,4,3,5],[5,1,5,3],[5,4,5,5],[6,1,6,3],[6,4,6,5],[8,1,8,3],[8,4,8,5],[1,1,1,5],[4,1,4,5],[7,1,7,5],[10,1,10,5],[9,1,9,3],[9,4,9,5],[11,1,11,2],[11,4,11,5],[12,1,12,2],[12,4,12,5],[13,0,14,0],[42,1,42,2],[44,1,44,5],[47,3,47,5],[48,3,48,5],[13,1,13,5]]}
[]
[]
[null,"UNIDADE ESCOLAR",null,null,"CÓDIGO INEP"]
[null,{"$f":"Orçamento!$O$4","v":"CENTRO DE ENSINO EM PERÍODO INTEGRAL DRº ARY RIBEIRO VALADÃO FILHO"},null,null,{"$f":"Orçamento!X4","v":52024180}]
[]
[null,"OBRA",null,null,"CIDADE"]
[null,{"$f":"Orçamento!$O$7","v":"REFORMA E AMPLIAÇÃO"},null,null,{"$f":"Orçamento!$X$7","v":"ITAGUARU"}]
[]
[null,"ENDEREÇO",null,null,"CRE"]
[null,{"$f":"Orçamento!$R$10","v":" R. BENIGNO PINTO DE FARIA 1068 , CENTRO , CEP: 7666-000"},null,null,{"$f":"Orçamento!$O$10","v":"CRE-ITABERAI"}]
[]
[null,"REFERÊNCIA",null,"DATA","ÁREA TOTAL CONSTRUÍDA (M²)"]
[null,{"$f":"CONCATENATE(\"AGETOP E SINAPI - \",Orçamento!$T$10)","v":"AGETOP E SINAPI - DESONERADA"},null,{"$f":"Orçamento!$S$7","v":"2020-05-13"},{"$f":"Orçamento!$X$13","v":1262.3600000000001}]
["FILTRO"]
[null,"SOMATÓRIO DE SERVIÇOS"]
["↓","ITEM","DESCRIÇÃO DOS SERVIÇOS","PREÇO SEM BDI (R$)","PREÇO COM BDI (R$)","PARTIC.  ( % )"]
[{"$f":"IF(D17>0,\"F\",\"\")","v":""},"a.",{"$f":"Orçamento!P308","v":"SERVIÇOS PRELIMINARES"},{"$f":"Orçamento!S308","v":0},{"$f":"Orçamento!X308","v":0},{"$f":"Orçamento!AA308","v":0}]
[{"$f":"IF(D18>0,\"F\",\"\")","v":""},"b.",{"$f":"Orçamento!P309","v":"TRANSPORTES"},{"$f":"Orçamento!S309","v":0},{"$f":"Orçamento!X309","v":0},{"$f":"Orçamento!AA309","v":0}]
["","c.",{"$f":"Orçamento!P310","v":"SERVIÇO EM TERRA"},{"$f":"Orçamento!S310","v":0},{"$f":"Orçamento!X310","v":0},{"$f":"Orçamento!AA310","v":0}]
["","d.",{"$f":"Orçamento!P311","v":"FUNDAÇÕES E SONDAGENS"},{"$f":"Orçamento!S311","v":0},{"$f":"Orçamento!X311","v":0},{"$f":"Orçamento!AA311","v":0}]
["","e.",{"$f":"Orçamento!P312","v":"ESTRUTURA"},{"$f":"Orçamento!S312","v":0},{"$f":"Orçamento!X312","v":0},{"$f":"Orçamento!AA312","v":0}]
["","f.",{"$f":"Orçamento!P313","v":"INSTALAÇÕES ELÉTRICAS"},{"$f":"Orçamento!S313","v":0},{"$f":"Orçamento!X313","v":0},{"$f":"Orçamento!AA313","v":0}]
["","g.",{"$f":"Orçamento!P314","v":"INSTALAÇÕES HIDROSSANITÁRIAS"},{"$f":"Orçamento!S314","v":0},{"$f":"Orçamento!X314","v":0},{"$f":"Orçamento!AA314","v":0}]
["","h",{"$f":"Orçamento!P315","v":"INSTALAÇÕES ESPECIAIS"},{"$f":"Orçamento!S315","v":0},{"$f":"Orçamento!X315","v":0},{"$f":"Orçamento!AA315","v":0}]
["","i.",{"$f":"Orçamento!P316","v":"ALVENARIAS E DIVISÓRIAS"},{"$f":"Orçamento!S316","v":0},{"$f":"Orçamento!X316","v":0},{"$f":"Orçamento!AA316","v":0}]
["","j.",{"$f":"Orçamento!P317","v":"ALVENARIA AUTO-PORTANTE"},{"$f":"Orçamento!S317","v":0},{"$f":"Orçamento!X317","v":0},{"$f":"Orçamento!AA317","v":0}]
["","k.",{"$f":"Orçamento!P318","v":"IMPERMEABILIZAÇÃO"},{"$f":"Orçamento!S318","v":0},{"$f":"Orçamento!X318","v":0},{"$f":"Orçamento!AA318","v":0}]
["","l.",{"$f":"Orçamento!P319","v":"ISOLAMENTO TÉRMICO E ACÚSTICO"},{"$f":"Orçamento!S319","v":0},{"$f":"Orçamento!X319","v":0},{"$f":"Orçamento!AA319","v":0}]
["","m.",{"$f":"Orçamento!P320","v":"ESTRUTURA DE MADEIRA"},{"$f":"Orçamento!S320","v":0},{"$f":"Orçamento!X320","v":0},{"$f":"Orçamento!AA320","v":0}]
["","n.",{"$f":"Orçamento!P321","v":"ESTRUTURAS METÁLICAS"},{"$f":"Orçamento!S321","v":0},{"$f":"Orçamento!X321","v":0},{"$f":"Orçamento!AA321","v":0}]
["","o.",{"$f":"Orçamento!P322","v":"COBERTURAS"},{"$f":"Orçamento!S322","v":0},{"$f":"Orçamento!X322","v":0},{"$f":"Orçamento!AA322","v":0}]
["","p.",{"$f":"Orçamento!P323","v":"ESQUADRIAS DE MADEIRA"},{"$f":"Orçamento!S323","v":0},{"$f":"Orçamento!X323","v":0},{"$f":"Orçamento!AA323","v":0}]
["","q.",{"$f":"Orçamento!P324","v":"ESQUADRIAS METÁLICAS"},{"$f":"Orçamento!S324","v":0},{"$f":"Orçamento!X324","v":0},{"$f":"Orçamento!AA324","v":0}]
["","r.",{"$f":"Orçamento!P325","v":"VIDROS"},{"$f":"Orçamento!S325","v":0},{"$f":"Orçamento!X325","v":0},{"$f":"Orçamento!AA325","v":0}]
["","s.",{"$f":"Orçamento!P326","v":"REVESTIMENTO DE PAREDE"},{"$f":"Orçamento!S326","v":0},{"$f":"Orçamento!X326","v":0},{"$f":"Orçamento!AA326","v":0}]
["","t.",{"$f":"Orçamento!P327","v":"FORROS"},{"$f":"Orçamento!S327","v":0},{"$f":"Orçamento!X327","v":0},{"$f":"Orçamento!AA327","v":0}]
["","u.",{"$f":"Orçamento!P328","v":"REVESTIMENTO DE PISO"},{"$f":"Orçamento!S328","v":0},{"$f":"Orçamento!X328","v":0},{"$f":"Orçamento!AA328","v":0}]
["","v.",{"$f":"Orçamento!P329","v":"FERRAGENS"},{"$f":"Orçamento!S329","v":0},{"$f":"Orçamento!X329","v":0},{"$f":"Orçamento!AA329","v":0}]
["","w.",{"$f":"Orçamento!P330","v":"MARCENARIA"},{"$f":"Orçamento!S330","v":0},{"$f":"Orçamento!X330","v":0},{"$f":"Orçamento!AA330","v":0}]
["","x.",{"$f":"Orçamento!P331","v":"ADMINISTRAÇÃO"},{"$f":"Orçamento!S331","v":0},{"$f":"Orçamento!X331","v":0},{"$f":"Orçamento!AA331","v":0}]
["","y.",{"$f":"Orçamento!P332","v":"PINTURA"},{"$f":"Orçamento!S332","v":0},{"$f":"Orçamento!X332","v":0},{"$f":"Orçamento!AA332","v":0}]
["","z.",{"$f":"Orçamento!P333","v":"DIVERSOS"},{"$f":"Orçamento!S333","v":0},{"$f":"Orçamento!X333","v":0},{"$f":"Orçamento!AA333","v":0}]
["F","TOTAL GERAL DO ORÇAMENTO",null,{"$f":"SUM(D17:D42)","v":0},{"$f":"SUM(E17:E42)","v":0},{"$f":"SUM(F17:F42)","v":0}]
[]
[null,"(*) Para itens da AGETOP, os vidros não estão inclusos nas esquadrias e já foram considerados os custos de contramarco para as esquadrias de alumínio;"]

{"sheet":"Cronog_45_Dias","index":3,"n_rows":99,"n_cols":14,"rows_kept":99,"cut":false,"hidden":false,"merged":[[97,1,97,4],[98,1,98,13],[94,1,94,2],[94,5,94,8],[94,9,94,12],[95,1,95,2],[95,5,95,8],[95,9,95,12],[92,1,92,2],[92,5,92,8],[92,9,92,12],[93,1,93,2],[93,5,93,8],[93,9,93,12],[89,1,91,2],[89,3,91,3],[89,4,91,4],[89,5,89,8],[89,9,89,12],[91,5,91,8],[91,9,91,12],[86,1,88,2],[86,3,88,3],[86,4,88,4],[86,5,86,8],[86,9,86,12],[88,5,88,8],[88,9,88,12],[83,1,85,2],[83,3,85,3],[83,4,85,4],[83,5,83,8],[83,9,83,12],[85,5,85,8],[85,9,85,12],[80,1,82,2],[80,3,82,3],[80,4,82,4],[80,5,80,8],[80,9,80,12],[82,5,82,8],[82,9,82,12],[77,1,79,2],[77,3,79,3],[77,4,79,4],[77,5,77,8],[77,9,77,12],[79,5,79,8],[79,9,79,12],[74,1,76,2],[74,3,76,3],[74,4,76,4],[74,5,74,8],[74,9,74,12],[76,5,76,8],[76,9,76,12],[71,1,73,2],[71,3,73,3],[71,4,73,4],[71,5,71,8],[71,9,71,12],[73,5,73,8],[73,9,73,12],[68,1,70,2],[68,3,70,3],[68,4,70,4],[68,5,68,8],[68,9,68,12],[70,5,70,8],[70,9,70,12],[65,1,67,2],[65,3,67,3],[65,4,67,4],[65,5,65,8],[65,9,65,12],[67,5,67,8],[67,9,67,12],[62,1,64,2],[62,3,64,3],[62,4,64,4],[62,5,62,8],[62,9,62,12],[64,5,64,8],[64,9,64,12],[59,1,61,2],[59,3,61,3],[59,4,61,4],[59,5,59,8],[59,9,59,12],[61,5,61,8],[61,9,61,12],[56,1,58,2],[56,3,58,3],[56,4,58,4],[56,5,56,8],[56,9,56,12],[58,5,58,8],[58,9,58,12],[53,1,55,2],[53,3,55,3],[53,4,55,4],[53,5,53,8],[53,9,53,12],[55,5,55,8],[55,9,55,12],[50,1,52,2],[50,3,52,3],[50,4,52,4],[50,5,50,8],[50,9,50,12],[52,5,52,8],[52,9,52,12],[47,1,49,2],[47,3,49,3],[47,4,49,4],[47,5,47,8],[47,9,47,12],[49,5,49,8],[49,9,49,12],[44,1,46,2],[44,3,46,3],[44,4,46,4],[44,5,44,8],[44,9,44,12],[46,5,46,8],[46,9,46,12],[41,1,43,2],[41,3,43,3],[41,4,43,4],[41,5,41,8],[41,9,41,12],[43,5,43,8],[43,9,43,12],[38,1,40,2],[38,3,40,3],[38,4,40,4],[38,5,38,8],[38,9,38,12],[40,5,40,8],[40,9,40,12],[35,1,37,2],[35,3,37,3],[35,4,37,4],[35,5,35,8],[35,9,35,12],[37,5,37,8],[37,9,37,12],[32,1,34,2],[32,3,34,3],[32,4,34,4],[32,5,32,8],[32,9,32,12],[34,5,34,8],[34,9,34,12],[29,1,31,2],[29,3,31,3],[29,4,31,4],[29,5,29,8],[29,9,29,12],[31,5,31,8],[31,9,31,12],[26,1,28,2],[26,3,28,3],[26,4,28,4],[26,5,26,8],[26,9,26,12],[28,5,28,8],[28,9,28,12],[23,1,25,2],[23,3,25,3],[23,4,25,4],[23,5,23,8],[23,9,23,12],[25,5,25,8],[25,9,25,12],[20,1,22,2],[20,3,22,3],[20,4,22,4],[20,5,20,8],[20,9,20,12],[22,5,22,8],[22,9,22,12],[17,1,19,2],[17,3,19,3],[17,4,19,4],[17,5,17,8],[17,9,17,12],[19,5,19,8],[19,9,19,12],[14,1,16,2],[14,3,16,3],[14,4,16,4],[14,5,14,8],[14,9,14,12],[16,5,16,8],[16,9,16,12],[12,0,13,0],[12,3,13,3],[12,5,12,8],[12,9,12,12],[12,13,13,13],[13,1,13,2],[13,5,13,8],[13,9,13,12],[8,1,8,7],[8,8,8,13],[9,0,11,0],[9,1,9,7],[9,8,9,13],[10,1,10,13],[11,1,11,13],[4,1,4,13],[5,1,5,7],[5,8,5,13],[6,1,6,7],[6,8,6,13],[7,1,7,13],[0,1,0,13],[1,1,1,13],[2,1,2,7],[2,8,2,13],[3,1,3,7],[3,8,3,13]]}
[]
[]
[null,"UNIDADE ESCOLAR",null,null,null,null,null,null,"PRAZO"]
[null,{"$f":"Orçamento!$O$4","v":"CENTRO DE ENSINO EM PERÍODO INTEGRAL DRº ARY RIBEIRO VALADÃO FILHO"},null,null,null,null,null,null,"45 DIAS CORRIDOS"]
[]
[null,"OBRA",null,null,null,null,null,null,"DATA"]
[null,{"$f":"Orçamento!$O$7","v":"REFORMA E AMPLIAÇÃO"},null,null,null,null,null,null,{"$f":"Orçamento!$S$7","v":"2020-05-13"}]
[]
[null,"LOCAL",null,null,null,null,null,null,"ÁREA TOTAL CONSTRUÍDA (M²)"]
["FILTRO",{"$f":"Orçamento!$X$7","v":"ITAGUARU"},null,null,null,null,null,null,{"$f":"Orçamento!$X$13","v":1262.3600000000001}]
[]
[null,"CRONOGRAMA - FÍSICO FINANCEIRO"]
["↓","CUSTO TOTAL:",{"$f":"D93","v":0},"VALOR","Dias:",22,null,null,null,45,null,null,null,"TOTAL"]
[null,"DESCRIÇÃO DOS SERVIÇOS",null,null,"%","1ª PARCELA",null,null,null,"2ª PARCELA"]
[{"$f":"IF(D15>0,\"F\",\"\")","v":""},"SERVIÇOS PRELIMINARES",null,{"$f":"Orçamento!X308","v":0},{"$f":"Orçamento!AA308","v":0},{"$f":"ROUND(F17*$D$15,2)","v":0},null,null,null,{"$f":"ROUND(J17*$D$15,2)","v":0},null,null,null,{"$f":"SUM(F15:M15)","v":0}]
[{"$f":"IF(A15=\"F\",A15,\"\")","v":""}]
[{"$f":"IF(A16=\"F\",A16,\"\")","v":""},null,null,null,null,1,null,null,null,{"$f":"1-F17","v":0},null,null,null,{"$f":"IFERROR(E15/100,\"\")","v":0}]
[{"$f":"IF(D18>0,\"F\",\"\")","v":""},"TRANSPORTES",null,{"$f":"Orçamento!X309","v":0},{"$f":"Orçamento!AA309","v":0},{"$f":"ROUND(F20*$D$18,2)","v":0},null,null,null,{"$f":"ROUND(J20*$D$18,2)","v":0},null,null,null,{"$f":"SUM(F18:M18)","v":0}]
[{"$f":"IF(A18=\"F\",A18,\"\")","v":""}]
[{"$f":"IF(A19=\"F\",A19,\"\")","v":""},null,null,null,null,0.48,null,null,null,{"$f":"1-F20","v":0.52},null,null,null,{"$f":"IFERROR(E18/100,\"\")","v":0}]
[{"$f":"IF(D21>0,\"F\",\"\")","v":""},"SERVIÇO EM TERRA",null,{"$f":"Orçamento!X310","v":0},{"$f":"Orçamento!AA310","v":0},{"$f":"ROUND(F23*$D$21,2)","v":0},null,null,null,{"$f":"ROUND(J23*$D$21,2)","v":0},null,null,null,{"$f":"SUM(F21:M21)","v":0}]
[{"$f":"IF(A21=\"F\",A21,\"\")","v":""}]
[{"$f":"IF(A22=\"F\",A22,\"\")","v":""},null,null,null,null,1,null,null,null,{"$f":"1-F23","v":0},null,null,null,{"$f":"IFERROR(E21/100,\"\")","v":0}]
[{"$f":"IF(D24>0,\"F\",\"\")","v":""},"FUNDAÇÕES E SONDAGENS",null,{"$f":"Orçamento!X311","v":0},{"$f":"Orçamento!AA311","v":0},{"$f":"ROUND(F26*$D$24,2)","v":0},null,null,null,{"$f":"ROUND(J26*$D$24,2)","v":0},null,null,null,{"$f":"SUM(F24:M24)","v":0}]
[{"$f":"IF(A24=\"F\",A24,\"\")","v":""}]
[{"$f":"IF(A25=\"F\",A25,\"\")","v":""},null,null,null,null,1,null,null,null,{"$f":"1-F26","v":0},null,null,null,{"$f":"IFERROR(E24/100,\"\")","v":0}]
[{"$f":"IF(D27>0,\"F\",\"\")","v":""},"ESTRUTURA",null,{"$f":"Orçamento!X312","v":0},{"$f":"Orçamento!AA312","v":0},{"$f":"ROUND(F29*$D$27,2)","v":0},null,null,null,{"$f":"ROUND(J29*$D$27,2)","v":0},null,null,null,{"$f":"SUM(F27:M27)","v":0}]
[{"$f":"IF(A27=\"F\",A27,\"\")","v":""}]
[{"$f":"IF(A28=\"F\",A28,\"\")","v":""},null,null,null,null,0.49,null,null,null,{"$f":"1-F29","v":0.51},null,null,null,{"$f":"IFERROR(E27/100,\"\")","v":0}]
[{"$f":"IF(D30>0,\"F\",\"\")","v":""},"INST.ELET/TELEFÔNICA/CABEAMENTO ESTRUTURADO",null,{"$f":"Orçamento!X313","v":0},{"$f":"Orçamento!AA313","v":0},{"$f":"ROUND(F32*$D$30,2)","v":0},null,null,null,{"$f":"ROUND(J32*$D$30,2)","v":0},null,null,null,{"$f":"SUM(F30:M30)","v":0}]
[{"$f":"IF(A30=\"F\",A30,\"\")","v":""}]
[{"$f":"IF(A31=\"F\",A31,\"\")","v":""},null,null,null,null,0.4,null,null,null,{"$f":"1-F32","v":0.6},null,null,null,{"$f":"IFERROR(E30/100,\"\")","v":0}]
[{"$f":"IF(D33>0,\"F\",\"\")","v":""},"INSTALAÇÕES HIDROSSANITÁRIAS",null,{"$f":"Orçamento!X314","v":0},{"$f":"Orçamento!AA314","v":0},{"$f":"ROUND(F35*$D$33,2)","v":0},null,null,null,{"$f":"ROUND(J35*$D$33,2)","v":0},null,null,null,{"$f":"SUM(F33:M33)","v":0}]
[{"$f":"IF(A33=\"F\",A33,\"\")","v":""}]
[{"$f":"IF(A34=\"F\",A34,\"\")","v":""},null,null,null,null,0.48,null,null,null,{"$f":"1-F35","v":0.52},null,null,null,{"$f":"IFERROR(E33/100,\"\")","v":0}]
[{"$f":"IF(D36>0,\"F\",\"\")","v":""},"INSTALAÇÕES ESPECIAIS",null,{"$f":"Orçamento!X315","v":0},{"$f":"Orçamento!AA315","v":0},{"$f":"ROUND(F38*$D$36,2)","v":0},null,null,null,{"$f":"ROUND(J38*$D$36,2)","v":0},null,null,null,{"$f":"SUM(F36:M36)","v":0}]
[{"$f":"IF(A36=\"F\",A36,\"\")","v":""}]
[{"$f":"IF(A37=\"F\",A37,\"\")","v":""},null,null,null,null,1,null,null,null,{"$f":"1-F38","v":0},null,null,null,{"$f":"IFERROR(E36/100,\"\")","v":0}]
[{"$f":"IF(D39>0,\"F\",\"\")","v":""},"ALVENARIA E DIVISÓRIAS",null,{"$f":"Orçamento!X316","v":0},{"$f":"Orçamento!AA316","v":0},{"$f":"ROUND(F41*$D$39,2)","v":0},null,null,null,{"$f":"ROUND(J41*$D$39,2)","v":0},null,null,null,{"$f":"SUM(F39:M39)","v":0}]
[{"$f":"IF(A39=\"F\",A39,\"\")","v":""}]
[{"$f":"IF(A40=\"F\",A40,\"\")","v":""},null,null,null,null,1,null,null,null,{"$f":"1-F41","v":0},null,null,null,{"$f":"IFERROR(E39/100,\"\")","v":0}]
[{"$f":"IF(D42>0,\"F\",\"\")","v":""},"ALVENARIA AUTO-PORTANTE",null,{"$f":"Orçamento!X317","v":0},{"$f":"Orçamento!AA317","v":0},{"$f":"ROUND(F44*$D$42,2)","v":0},null,null,null,{"$f":"ROUND(J44*$D$42,2)","v":0},null,null,null,{"$f":"SUM(F42:M42)","v":0}]
[{"$f":"IF(A42=\"F\",A42,\"\")","v":""}]
[{"$f":"IF(A43=\"F\",A43,\"\")","v":""},null,null,null,null,1,null,null,null,{"$f":"1-F44","v":0},null,null,null,{"$f":"IFERROR(E42/100,\"\")","v":0}]
[{"$f":"IF(D45>0,\"F\",\"\")","v":""},"IMPERMEABILIZAÇÃO",null,{"$f":"Orçamento!X318","v":0},{"$f":"Orçamento!AA318","v":0},{"$f":"ROUND(F47*$D$45,2)","v":0},null,null,null,{"$f":"ROUND(J47*$D$45,2)","v":0},null,null,null,{"$f":"SUM(F45:M45)","v":0}]
[{"$f":"IF(A45=\"F\",A45,\"\")","v":""}]
[{"$f":"IF(A46=\"F\",A46,\"\")","v":""},null,null,null,null,1,null,null,null,{"$f":"1-F47","v":0},null,null,null,{"$f":"IFERROR(E45/100,\"\")","v":0}]
[{"$f":"IF(D48>0,\"F\",\"\")","v":""},"ISOLAMENTO TÉRMICO E ACÚSTICO",null,{"$f":"Orçamento!X319","v":0},{"$f":"Orçamento!AA319","v":0},{"$f":"ROUND(F50*$D$48,2)","v":0},null,null,null,{"$f":"ROUND(J50*$D$48,2)","v":0},null,null,null,{"$f":"SUM(F48:M48)","v":0}]
[{"$f":"IF(A48=\"F\",A48,\"\")","v":""}]
[{"$f":"IF(A49=\"F\",A49,\"\")","v":""},null,null,null,null,0.5,null,null,null,{"$f":"1-F50","v":0.5},null,null,null,{"$f":"IFERROR(E48/100,\"\")","v":0}]
[{"$f":"IF(D51>0,\"F\",\"\")","v":""},"ESTRUTURA DE MADEIRA",null,{"$f":"Orçamento!X320","v":0},{"$f":"Orçamento!AA320","v":0},{"$f":"ROUND(F53*$D$51,2)","v":0},null,null,null,{"$f":"ROUND(J53*$D$51,2)","v":0},null,null,null,{"$f":"SUM(F51:M51)","v":0}]
[{"$f":"IF(A51=\"F\",A51,\"\")","v":""}]
[{"$f":"IF(A52=\"F\",A52,\"\")","v":""},null,null,null,null,0.4,null,null,null,{"$f":"1-F53","v":0.6},null,null,null,{"$f":"IFERROR(E51/100,\"\")","v":0}]
[{"$f":"IF(D54>0,\"F\",\"\")","v":""},"ESTRUTURA METÁLICA",null,{"$f":"Orçamento!X321","v":0},{"$f":"Orçamento!AA321","v":0},{"$f":"ROUND(F56*$D$54,2)","v":0},null,null,null,{"$f":"ROUND(J56*$D$54,2)","v":0},null,null,null,{"$f":"SUM(F54:M54)","v":0}]
[{"$f":"IF(A54=\"F\",A54,\"\")","v":""}]
[{"$f":"IF(A55=\"F\",A55,\"\")","v":""},null,null,null,null,0.35,null,null,null,{"$f":"1-F56","v":0.65},null,null,null,{"$f":"IFERROR(E54/100,\"\")","v":0}]
[{"$f":"IF(D57>0,\"F\",\"\")","v":""},"COBERTURAS",null,{"$f":"Orçamento!X322","v":0},{"$f":"Orçamento!AA322","v":0},{"$f":"ROUND(F59*$D$57,2)","v":0},null,null,null,{"$f":"ROUND(J59*$D$57,2)","v":0},null,null,null,{"$f":"SUM(F57:M57)","v":0}]
[{"$f":"IF(A57=\"F\",A57,\"\")","v":""}]
[{"$f":"IF(A58=\"F\",A58,\"\")","v":""},null,null,null,null,0,null,null,null,{"$f":"1-F59","v":1},null,null,null,{"$f":"IFERROR(E57/100,\"\")","v":0}]
[{"$f":"IF(D60>0,\"F\",\"\")","v":""},"ESQUADRIAS DE MADEIRA",null,{"$f":"Orçamento!X323","v":0},{"$f":"Orçamento!AA323","v":0},{"$f":"ROUND(F62*$D$60,2)","v":0},null,null,null,{"$f":"ROUND(J62*$D$60,2)","v":0},null,null,null,{"$f":"SUM(F60:M60)","v":0}]
[{"$f":"IF(A60=\"F\",A60,\"\")","v":""}]
[{"$f":"IF(A61=\"F\",A61,\"\")","v":""},null,null,null,null,0.54,null,null,null,{"$f":"1-F62","v":0.45999999999999996},null,null,null,{"$f":"IFERROR(E60/100,\"\")","v":0}]
[{"$f":"IF(D63>0,\"F\",\"\")","v":""},"ESQUADRIAS METÁLICAS",null,{"$f":"Orçamento!X324","v":0},{"$f":"Orçamento!AA324","v":0},{"$f":"ROUND(F65*$D$63,2)","v":0},null,null,null,{"$f":"ROUND(J65*$D$63,2)","v":0},null,null,null,{"$f":"SUM(F63:M63)","v":0}]
[{"$f":"IF(A63=\"F\",A63,\"\")","v":""}]
[{"$f":"IF(A64=\"F\",A64,\"\")","v":""},null,null,null,null,0.49,null,null,null,{"$f":"1-F65","v":0.51},null,null,null,{"$f":"IFERROR(E63/100,\"\")","v":0}]
[{"$f":"IF(D66>0,\"F\",\"\")","v":""},"VIDROS",null,{"$f":"Orçamento!X325","v":0},{"$f":"Orçamento!AA325","v":0},{"$f":"ROUND(F68*$D$66,2)","v":0},null,null,null,{"$f":"ROUND(J68*$D$66,2)","v":0},null,null,null,{"$f":"SUM(F66:M66)","v":0}]
[{"$f":"IF(A66=\"F\",A66,\"\")","v":""}]
[{"$f":"IF(A67=\"F\",A67,\"\")","v":""},null,null,null,null,0,null,null,null,{"$f":"1-F68","v":1},null,null,null,{"$f":"IFERROR(E66/100,\"\")","v":0}]
[{"$f":"IF(D69>0,\"F\",\"\")","v":""},"REVESTIMENTO DE PAREDE",null,{"$f":"Orçamento!X326","v":0},{"$f":"Orçamento!AA326","v":0},{"$f":"ROUND(F71*$D$69,2)","v":0},null,null,null,{"$f":"ROUND(J71*$D$69,2)","v":0},null,null,null,{"$f":"SUM(F69:M69)","v":0}]
[{"$f":"IF(A69=\"F\",A69,\"\")","v":""}]
[{"$f":"IF(A70=\"F\",A70,\"\")","v":""},null,null,null,null,0.32,null,null,null,{"$f":"1-F71","v":0.67999999999999994},null,null,null,{"$f":"IFERROR(E69/100,\"\")","v":0}]
[{"$f":"IF(D72>0,\"F\",\"\")","v":""},"FORROS",null,{"$f":"Orçamento!X327","v":0},{"$f":"Orçamento!AA327","v":0},{"$f":"ROUND(F74*$D$72,2)","v":0},null,null,null,{"$f":"ROUND(J74*$D$72,2)","v":0},null,null,null,{"$f":"SUM(F72:M72)","v":0}]
[{"$f":"IF(A72=\"F\",A72,\"\")","v":""}]
[{"$f":"IF(A73=\"F\",A73,\"\")","v":""},null,null,null,null,0.24,null,null,null,{"$f":"1-F74","v":0.76},null,null,null,{"$f":"IFERROR(E72/100,\"\")","v":0}]
[{"$f":"IF(D75>0,\"F\",\"\")","v":""},"REVESTIMENTO DE PISO",null,{"$f":"Orçamento!X328","v":0},{"$f":"Orçamento!AA328","v":0},{"$f":"ROUND(F77*$D$75,2)","v":0},null,null,null,{"$f":"ROUND(J77*$D$75,2)","v":0},null,null,null,{"$f":"SUM(F75:M75)","v":0}]
[{"$f":"IF(A75=\"F\",A75,\"\")","v":""}]
[{"$f":"IF(A76=\"F\",A76,\"\")","v":""},null,null,null,null,0.49,null,null,null,{"$f":"1-F77","v":0.51},null,null,null,{"$f":"IFERROR(E75/100,\"\")","v":0}]
[{"$f":"IF(D78>0,\"F\",\"\")","v":""},"FERRAGENS",null,{"$f":"Orçamento!X329","v":0},{"$f":"Orçamento!AA329","v":0},{"$f":"ROUND(F80*$D$78,2)","v":0},null,null,null,{"$f":"ROUND(J80*$D$78,2)","v":0},null,null,null,{"$f":"SUM(F78:M78)","v":0}]
[{"$f":"IF(A78=\"F\",A78,\"\")","v":""}]
[{"$f":"IF(A79=\"F\",A79,\"\")","v":""},null,null,null,null,0,null,null,null,{"$f":"1-F80","v":1},null,null,null,{"$f":"IFERROR(E78/100,\"\")","v":0}]
[{"$f":"IF(D81>0,\"F\",\"\")","v":""},"MARCENARIA",null,{"$f":"Orçamento!X330","v":0},{"$f":"Orçamento!AA330","v":0},{"$f":"ROUND(F83*$D$81,2)","v":0},null,null,null,{"$f":"ROUND(J83*$D$81,2)","v":0},null,null,null,{"$f":"SUM(F81:M81)","v":0}]
[{"$f":"IF(A81=\"F\",A81,\"\")","v":""}]
[{"$f":"IF(A82=\"F\",A82,\"\")","v":""},null,null,null,null,0.4,null,null,null,{"$f":"1-F83","v":0.6},null,null,null,{"$f":"IFERROR(E81/100,\"\")","v":0}]
[{"$f":"IF(D84>0,\"F\",\"\")","v":""},"ADMINISTRAÇÃO - MENSALISTAS",null,{"$f":"Orçamento!X331","v":0},{"$f":"Orçamento!AA331","v":0},{"$f":"ROUND(F86*$D$84,2)","v":0},null,null,null,{"$f":"ROUND(J86*$D$84,2)","v":0},null,null,null,{"$f":"SUM(F84:M84)","v":0}]
[{"$f":"IF(A84=\"F\",A84,\"\")","v":""}]
[{"$f":"IF(A85=\"F\",A85,\"\")","v":""},null,null,null,null,0.49,null,null,null,{"$f":"1-F86","v":0.51},null,null,null,{"$f":"IFERROR(E84/100,\"\")","v":0}]
[{"$f":"IF(D87>0,\"F\",\"\")","v":""},"PINTURA",null,{"$f":"Orçamento!X332","v":0},{"$f":"Orçamento!AA332","v":0},{"$f":"ROUND(F89*$D$87,2)","v":0},null,null,null,{"$f":"ROUND(J89*$D$87,2)","v":0},null,null,null,{"$f":"SUM(F87:M87)","v":0}]
[{"$f":"IF(A87=\"F\",A87,\"\")","v":""}]
[{"$f":"IF(A88=\"F\",A88,\"\")","v":""},null,null,null,null,0,null,null,null,{"$f":"1-F89","v":1},null,null,null,{"$f":"IFERROR(E87/100,\"\")","v":0}]
[{"$f":"IF(D90>0,\"F\",\"\")","v":""},"DIVERSOS",null,{"$f":"Orçamento!X333","v":0},{"$f":"Orçamento!AA333","v":0},{"$f":"ROUND(F92*$D$90,2)","v":0},null,null,null,{"$f":"ROUND(J92*$D$90,2)","v":0},null,null,null,{"$f":"SUM(F90:M90)","v":0}]
[{"$f":"IF(A90=\"F\",A90,\"\")","v":""}]
[{"$f":"IF(A91=\"F\",A91,\"\")","v":""},null,null,null,null,0.46,null,null,null,{"$f":"1-F92","v":0.54},null,null,null,{"$f":"IFERROR(E90/100,\"\")","v":0}]
["F","CUSTO DO ORÇAMENTO",null,{"$f":"SUM(D15:D92)","v":0},{"$f":"SUM(E15:E92)","v":0},{"$f":"F15+F18+F21+F24+F27+F30+F33+F36+F39+F42+F45+F48+F51+F54+F57+F60+F63+F66+F69+F72+F75+F78+F81+F84+F87+F90","v":0},null,null,null,{"$f":"J15+J18+J21+J24+J27+J30+J33+J36+J39+J42+J45+J48+J51+J54+J57+J60+J63+J66+J69+J72+J75+J78+J81+J84+J87+J90","v":0},null,null,null,{"$f":"N15+N18+N21+N24+N27+N30+N33+N36+N39+N42+N45+N48+N51+N54+N57+N60+N63+N66+N69+N72+N75+N78+N81+N84+N87+N90","v":0}]
["F","PERCENTUAIS:",null,null,null,{"$f":"IFERROR(F93/D93,\"\")","v":""},null,null,null,{"$f":"IFERROR(J93/D93,\"\")","v":""},null,null,null,{"$f":"SUM(F94:M94)","v":0}]
["F","TOTAIS ACUMULADOS:",null,null,null,{"$f":"F93","v":0},null,null,null,{"$f":"F95+J93","v":0}]
["F","PERCENTUAIS  ACUMULADOS:",null,null,null,{"$f":"F94","v":""},null,null,null,{"$f":"IFERROR(F96+J94,\"\")","v":""}]
["F"]
["F","OBSERVAÇÕES:"]
["F","Os pagamentos somente poderão ser efetuados mediante medição e atesto pelos técnicos da Secretaria da Educação. "]

{"sheet":"Composição BDI","index":4,"n_rows":45,"n_cols":9,"rows_kept":45,"cut":false,"hidden":false,"merged":[[12,0,12,3],[13,0,13,3],[14,0,14,3],[15,0,15,3],[6,0,6,3],[8,0,8,3],[7,0,7,3],[9,0,9,3],[11,0,11,3],[10,0,10,3],[0,0,0,3],[2,0,2,3],[3,0,3,3],[1,0,1,3],[5,0,5,3],[4,0,4,3],[18,5,18,8],[17,0,17,3],[16,0,16,3],[44,0,44,3],[42,0,42,3],[43,0,43,3],[18,0,18,3],[36,0,36,3],[39,0,39,3],[38,0,38,3],[40,0,40,3],[29,0,29,2],[32,0,32,3],[33,0,33,3],[34,0,34,3],[35,0,35,3]]}
[]
[]
["UNIDADE ESCOLAR"]
["CENTRO DE ENSINO EM PERÍODO INTEGRAL DRº ARY RIBEIRO VALADÃO FILHO"]
[]
["OBRA"]
["REFORMA E AMPLIAÇÃO"]
[]
["ENDEREÇO"]
[" R. BENIGNO PINTO DE FARIA 1068 , CENTRO , CEP: 7666-000"]
[]
["CIDADE"]
["ITAGUARU"]
[]
["CRE"]
["CRE-ITABERAI"]
[]
["DETALHAMENTO DA COMPOSIÇÃO DE BDI"]
["COMPOSIÇÃO BDI PARA OBRAS CIVIS",null,null,null,null,"BDI CONSTRUÇÃO E REFORMA"]
["DESCRIÇÃO","COEF.","TAXA % (a.m)","% no preço de venda",null,"Situação","1º Quartil","Médio","3º Quartil"]
["1) COFINS",1,0.03,0.03,null,"OK",0.03,0.03,0.03]
["2) PIS",1,6.4999999999999997E-3,6.4999999999999997E-3,null,"OK",6.4999999999999997E-3,6.4999999999999997E-3,6.4999999999999997E-3]
["3) ISSQN",1,0.03,0.03,null,"OK",0.02,3.5000000000000003E-2,0.05]
["4) CPRB",1,4.4999999999999998E-2,4.4999999999999998E-2,null,"OK",4.4999999999999998E-2,4.4999999999999998E-2,4.4999999999999998E-2]
["5) Administração Central",1,0.04,0.04,null,"OK",0.03,0.04,5.5E-2]
["6) Despesas Financeiras",1,5.5999999999999999E-3,5.5999999999999999E-3,null,"FORA DO INTERVALO",5.8999999999999999E-3,1.23E-2,1.3899999999999999E-2]
["7) Seguros + Garantias",1,1.1999999999999999E-3,1.1999999999999999E-3,null,"FORA DO INTERVALO",8.0000000000000002E-3,8.0000000000000002E-3,0.01]
["8) Risco",1,9.7000000000000003E-3,9.7000000000000003E-3,null,"OK",9.7000000000000003E-3,1.2699999999999999E-2,1.2699999999999999E-2]
["9) Lucro",1,6.3E-2,6.3E-2,null,"OK",6.1600000000000002E-2,7.3999999999999996E-2,8.9599999999999999E-2]
["BDI - FINAL",null,null,0.26433595669105281,null,"FORA DO INTERVALO",0.2034,0.22120000000000001,0.25]
[]
["Notas:"]
["(1) e (2) Alíquota definida por lei."]
["(3) Alíquota e base de cálculo definidas pela legislação municipal."]
["(4) Alíquota definida pelas leis 12.546/11, 12844/13 e 13.161/15 (CPRB – contribuição previdenciária sobre a receita bruta)."]
["(5) Valores definidos a partir dos limites no Acórdão nº 2.622/2013 - TCU – Plenário. Valores entre o 1º e 3º quartis."]
["(6) Valor calculado pela expressão matemática do acórdão 2.369/2011 – TCU – Plenário e disponibilizado pela AGETOP em dezembro de 2018. (Foi utilizado para o cálculo a média da Taxa SELIC no período de 11/2017 a 10/2018)"]
[]
["(7) Valores definidos pela AGETOP a partir dos limites no Acórdão nº 2.622/2013 - TCU – Plenário. Valores médios. \n\nObservação da AGETOP: (Seguros contra erros de execução, incêndio e explosão, danos da natureza (vendaval, destelhamento, alagamento, inundação, desmoronamento, geadas etc.), emprego de material defeituoso ou inadequado, roubo e/ou furto qualificado, quebra de equipamentos, desmoronamento de estrutura, nas modalidades de Obras Civis em Construção (OCC); Instalação e Montagem (IM); e Obras Civis em Construção e Instalação e Montagem (OCC/IM). Bem como coberturas adicionais para ampliação dessas coberturas básicas, como: cobertura de responsabilidade civil geral, cobertura de responsabilidade civil cruzada, cobertura de despesas extraordinárias, cobertura de tumultos, cobertura de desentulho do local, cobertura de riscos do fabricante, dentre outras, incluindo o seguro de vida em grupo regido pela convenção coletiva dos trabalhadores na indústria da construção civil). A partir de 24/02/2015 por intermédio da Portaria 449/2015 a Presidência da AGETOP, na pessoa do Senhor Jayme Eduardo Rincon, determinou a exclusão dos valores referentes aos Seguros de Risco de Engenharia e Responsabilidade Civil do Profissional na composição do cálculo do B.D.I.."]
["(8) Valores definidos a partir dos limites no Acórdão nº 2.622/2013 - TCU – Plenário. Valores entre 1º e 3° quartis."]
["(9) Valores definidos a partir dos limites definidos no Acórdão nº 2.622/2013 - TCU – Plenário. Valores adotados e praticados no mercado ( “ ex ante ” ) ou aqueles entre os 1º e 3º quartis."]
[]
["(*) A fórmula para estipulação da taxa de BDI estimado adotado é a mesma que foi aplicada para a obtenção das tabelas contidas no Acórdão n. 2.622/2013 – TCUPlenário"]
[]
["Obs.: Para obras com valores superiores a R$ 20.000.000,00 sugere-se recalcular o BDI, dimensionando as taxas de administração central e lucro para patamares inferiores ao estipulado acima."]

{"sheet":"Relatório CENTRAL","index":5,"n_rows":40,"n_cols":5,"rows_kept":40,"cut":false,"hidden":false,"merged":[[10,1,10,4],[11,1,11,4],[39,1,39,2],[9,0,11,0],[0,1,0,4],[6,3,6,4],[9,3,9,4],[1,1,1,4],[2,1,2,2],[2,3,2,4],[3,1,3,2],[3,3,3,4],[4,1,4,4],[5,1,5,2],[5,3,5,4],[6,1,6,2],[7,1,7,4],[8,1,8,2],[8,3,8,4],[9,1,9,2]]}
[]
[]
[null,"UNIDADE ESCOLAR",null,"CIDADE"]
[null,{"$f":"Orçamento!$O$4","v":"CENTRO DE ENSINO EM PERÍODO INTEGRAL DRº ARY RIBEIRO VALADÃO FILHO"},null,{"$f":"Orçamento!$X$7","v":"ITAGUARU"}]
[]
[null,"OBRA",null,"CRE"]
[null,{"$f":"Orçamento!$O$7","v":"REFORMA E AMPLIAÇÃO"},null,{"$f":"Orçamento!$O$10","v":"CRE-ITABERAI"}]
[]
[null,"ENDEREÇO",null,"DATA"]
["FILTRO",{"$f":"Orçamento!$R$10","v":" R. BENIGNO PINTO DE FARIA 1068 , CENTRO , CEP: 7666-000"},null,{"$f":"Orçamento!$S$7","v":"2020-05-13"}]
[]
[null,"RELATÓRIO CENTRAL"]
["↓","CÓDIGO","ETAPA","PREÇO  (R$) C/ BDI","PARTIC  ( % )"]
[{"$f":"IF(D14>0,\"F\",\"\")","v":""},{"$f":"Orçamento!O308","v":"a."},{"$f":"Orçamento!P308","v":"SERVIÇOS PRELIMINARES"},{"$f":"Orçamento!X308","v":0},{"$f":"Orçamento!AA308","v":0}]
[{"$f":"IF(D15>0,\"F\",\"\")","v":""},{"$f":"Orçamento!O309","v":"b."},{"$f":"Orçamento!P309","v":"TRANSPORTES"},{"$f":"Orçamento!X309","v":0},{"$f":"Orçamento!AA309","v":0}]
["",{"$f":"Orçamento!O310","v":"c."},{"$f":"Orçamento!P310","v":"SERVIÇO EM TERRA"},{"$f":"Orçamento!X310","v":0},{"$f":"Orçamento!AA310","v":0}]
["",{"$f":"Orçamento!O311","v":"d."},{"$f":"Orçamento!P311","v":"FUNDAÇÕES E SONDAGENS"},{"$f":"Orçamento!X311","v":0},{"$f":"Orçamento!AA311","v":0}]
["",{"$f":"Orçamento!O312","v":"e."},{"$f":"Orçamento!P312","v":"ESTRUTURA"},{"$f":"Orçamento!X312","v":0},{"$f":"Orçamento!AA312","v":0}]
["",{"$f":"Orçamento!O313","v":"f."},{"$f":"Orçamento!P313","v":"INSTALAÇÕES ELÉTRICAS"},{"$f":"Orçamento!X313","v":0},{"$f":"Orçamento!AA313","v":0}]
["",{"$f":"Orçamento!O314","v":"g."},{"$f":"Orçamento!P314","v":"INSTALAÇÕES HIDROSSANITÁRIAS"},{"$f":"Orçamento!X314","v":0},{"$f":"Orçamento!AA314","v":0}]
["",{"$f":"Orçamento!O315","v":"h"},{"$f":"Orçamento!P315","v":"INSTALAÇÕES ESPECIAIS"},{"$f":"Orçamento!X315","v":0},{"$f":"Orçamento!AA315","v":0}]
["",{"$f":"Orçamento!O316","v":"i."},{"$f":"Orçamento!P316","v":"ALVENARIAS E DIVISÓRIAS"},{"$f":"Orçamento!X316","v":0},{"$f":"Orçamento!AA316","v":0}]
["",{"$f":"Orçamento!O317","v":"j."},{"$f":"Orçamento!P317","v":"ALVENARIA AUTO-PORTANTE"},{"$f":"Orçamento!X317","v":0},{"$f":"Orçamento!AA317","v":0}]
["",{"$f":"Orçamento!O318","v":"k."},{"$f":"Orçamento!P318","v":"IMPERMEABILIZAÇÃO"},{"$f":"Orçamento!X318","v":0},{"$f":"Orçamento!AA318","v":0}]
["",{"$f":"Orçamento!O319","v":"l."},{"$f":"Orçamento!P319","v":"ISOLAMENTO TÉRMICO E ACÚSTICO"},{"$f":"Orçamento!X319","v":0},{"$f":"Orçamento!AA319","v":0}]
["",{"$f":"Orçamento!O320","v":"m."},{"$f":"Orçamento!P320","v":"ESTRUTURA DE MADEIRA"},{"$f":"Orçamento!X320","v":0},{"$f":"Orçamento!AA320","v":0}]
["",{"$f":"Orçamento!O321","v":"n."},{"$f":"Orçamento!P321","v":"ESTRUTURAS METÁLICAS"},{"$f":"Orçamento!X321","v":0},{"$f":"Orçamento!AA321","v":0}]
["",{"$f":"Orçamento!O322","v":"o."},{"$f":"Orçamento!P322","v":"COBERTURAS"},{"$f":"Orçamento!X322","v":0},{"$f":"Orçamento!AA322","v":0}]
["",{"$f":"Orçamento!O323","v":"p."},{"$f":"Orçamento!P323","v":"ESQUADRIAS DE MADEIRA"},{"$f":"Orçamento!X323","v":0},{"$f":"Orçamento!AA323","v":0}]
["",{"$f":"Orçamento!O324","v":"q."},{"$f":"Orçamento!P324","v":"ESQUADRIAS METÁLICAS"},{"$f":"Orçamento!X324","v":0},{"$f":"Orçamento!AA324","v":0}]
["",{"$f":"Orçamento!O325","v":"r."},{"$f":"Orçamento!P325","v":"VIDROS"},{"$f":"Orçamento!X325","v":0},{"$f":"Orçamento!AA325","v":0}]
["",{"$f":"Orçamento!O326","v":"s."},{"$f":"Orçamento!P326","v":"REVESTIMENTO DE PAREDE"},{"$f":"Orçamento!X326","v":0},{"$f":"Orçamento!AA326","v":0}]
["",{"$f":"Orçamento!O327","v":"t."},{"$f":"Orçamento!P327","v":"FORROS"},{"$f":"Orçamento!X327","v":0},{"$f":"Orçamento!AA327","v":0}]
["",{"$f":"Orçamento!O328","v":"u."},{"$f":"Orçamento!P328","v":"REVESTIMENTO DE PISO"},{"$f":"Orçamento!X328","v":0},{"$f":"Orçamento!AA328","v":0}]
["",{"$f":"Orçamento!O329","v":"v."},{"$f":"Orçamento!P329","v":"FERRAGENS"},{"$f":"Orçamento!X329","v":0},{"$f":"Orçamento!AA329","v":0}]
["",{"$f":"Orçamento!O330","v":"w."},{"$f":"Orçamento!P330","v":"MARCENARIA"},{"$f":"Orçamento!X330","v":0},{"$f":"Orçamento!AA330","v":0}]
["",{"$f":"Orçamento!O331","v":"x."},{"$f":"Orçamento!P331","v":"ADMINISTRAÇÃO"},{"$f":"Orçamento!X331","v":0},{"$f":"Orçamento!AA331","v":0}]
["",{"$f":"Orçamento!O332","v":"y."},{"$f":"Orçamento!P332","v":"PINTURA"},{"$f":"Orçamento!X332","v":0},{"$f":"Orçamento!AA332","v":0}]
["",{"$f":"Orçamento!O333","v":"z."},{"$f":"Orçamento!P333","v":"DIVERSOS"},{"$f":"Orçamento!X333","v":0},{"$f":"Orçamento!AA333","v":0}]
["F","TOTAL GERAL DO ORÇAMENTO (R$) C/BDI",null,{"$f":"SUM(D14:D39)","v":0},{"$f":"SUM(E14:E39)","v":0}]

{"sheet":"Parc Maior Relev","index":6,"n_rows":33,"n_cols":7,"rows_kept":33,"cut":false,"hidden":false,"merged":[[0,1,0,6],[11,1,11,6],[1,1,1,6],[2,1,2,3],[2,4,2,6],[3,1,3,3],[3,4,3,6],[4,1,4,6],[5,1,5,3],[5,4,5,6],[9,1,9,3],[9,4,9,6],[10,1,10,6],[6,1,6,3],[6,4,6,6],[7,1,7,6],[8,1,8,3],[8,4,8,6],[33,3,33,7],[31,1,31,6]]}
[]
[]
[null,"UNIDADE ESCOLAR",null,null,"CÓDIGO INEP"]
[null,{"$f":"Orçamento!$O$4","v":"CENTRO DE ENSINO EM PERÍODO INTEGRAL DRº ARY RIBEIRO VALADÃO FILHO"},null,null,{"$f":"Orçamento!$X$4","v":52024180}]
[]
[null,"OBRA",null,null,"CIDADE"]
[null,{"$f":"Orçamento!$O$7","v":"REFORMA E AMPLIAÇÃO"},null,null,{"$f":"Orçamento!$X$7","v":"ITAGUARU"}]
[]
[null,"CRE",null,null,"ÁREA TOTAL CONSTRUÍDA (M²)"]
[null,{"$f":"Orçamento!$O$10","v":"CRE-ITABERAI"},null,null,{"$f":"Orçamento!$X$13","v":1262.3600000000001}]
[]
["FILTRO","PARCELA DE MAIOR RELEVÂNCIA"]
[{"$f":"IF(G14>0,\"F\",\"\")","v":""},"CÓDIGO","SERVIÇO","DESCRIÇÃO","UNID","QUANT","PARC. MAIOR RELEV (100%)"]
[{"$f":"IF(G14>0,\"F\",\"\")","v":""},"f.","INSTALAÇÕES ELÉTRICAS","SUBESTAÇÃO","KVA",null,{"$f":"F14","v":0}]
[{"$f":"IF(SUM(G16:G30)>0,\"F\",\"\")","v":"F"},"CÓDIGO","SERVIÇO","DESCRIÇÃO","UNID","QUANT","PARC. MAIOR RELEV (50%)"]
[{"$f":"IF(G16>0,\"F\",\"\")","v":""},"e.","ESTRUTURA","CONCRETO","M3",{"$f":"SUMIF(Orçamento!$R$20:$R$289,'Parc Maior Relev'!D16,Orçamento!$T$20:$T$289)","v":0},{"$f":"F16*0.5","v":0}]
[{"$f":"IF(G17>0,\"F\",\"\")","v":""},"f.","INSTALAÇÕES ELÉTRICAS","INSTALAÇÕES ELÉTRICAS","KVA",{"$f":"SUMIF(Orçamento!$R$20:$R$289,'Parc Maior Relev'!D17,Orçamento!$T$20:$T$289)","v":0},{"$f":"F17*0.5","v":0}]
[{"$f":"IF(G18>0,\"F\",\"\")","v":""},"o.","COBERTURAS","COBERTURA CERÂMICA","M2",{"$f":"SUMIF(Orçamento!$R$20:$R$289,'Parc Maior Relev'!D18,Orçamento!$T$20:$T$289)","v":0},0]
["","o.","COBERTURAS","COBERTURA COM TELHA METÁLICA","M2",{"$f":"SUMIF(Orçamento!$R$20:$R$289,'Parc Maior Relev'!D19,Orçamento!$T$20:$T$289)","v":0},0]
["","s.","REVESTIMENTO DE PAREDE","CHAPISCO","M2",{"$f":"SUMIF(Orçamento!$R$20:$R$289,'Parc Maior Relev'!D20,Orçamento!$T$20:$T$289)","v":0},0]
["","s.","REVESTIMENTO DE PAREDE","REBOCO","M2",{"$f":"SUMIF(Orçamento!$R$20:$R$289,'Parc Maior Relev'!D21,Orçamento!$T$20:$T$289)","v":0},0]
["","s.","REVESTIMENTO DE PAREDE","REVESTIMENTO CERÂMICO","M2",{"$f":"SUMIF(Orçamento!$R$20:$R$289,'Parc Maior Relev'!D22,Orçamento!$T$20:$T$289)","v":0},0]
["","t.","FORROS","FORRO DE GESSO","M2",{"$f":"SUMIF(Orçamento!$R$20:$R$289,'Parc Maior Relev'!D23,Orçamento!$T$20:$T$289)","v":0},0]
["","t.","FORROS","FORRO DE PVC","M2",{"$f":"SUMIF(Orçamento!$R$20:$R$289,'Parc Maior Relev'!D24,Orçamento!$T$20:$T$289)","v":0},0]
["","t.","FORROS","FORRO DE GESSO ACARTONADO","M2",{"$f":"SUMIF(Orçamento!$R$20:$R$289,'Parc Maior Relev'!D25,Orçamento!$T$20:$T$289)","v":0},0]
["F","u.","REVESTIMENTO DE PISO","PISO DE GRANITINA","M2",324.72000000000003,162.36000000000001]
["","u.","REVESTIMENTO DE PISO","PISO LAMINADO","M2",{"$f":"SUMIF(Orçamento!$R$20:$R$289,'Parc Maior Relev'!D27,Orçamento!$T$20:$T$289)","v":0},0]
["","u.","REVESTIMENTO DE PISO","PISO DE CONCRETO DESEMPENADO","M2",{"$f":"SUMIF(Orçamento!$R$20:$R$289,'Parc Maior Relev'!D28,Orçamento!$T$20:$T$289)","v":0},0]
["","u.","REVESTIMENTO DE PISO","PISO CERÂMICO","M2",{"$f":"SUMIF(Orçamento!$R$20:$R$289,'Parc Maior Relev'!D29,Orçamento!$T$20:$T$289)","v":0},0]
["","y.","PINTURA","PINTURA","M2",{"$f":"SUMIF(Orçamento!$R$20:$R$289,'Parc Maior Relev'!D30,Orçamento!$T$20:$T$289)","v":0},0]
["F"]
["F","(*) Para os fins do inciso I dp § 1º do Art. 30 da Lei Federal 8.666/93, são consideradas parcelas de maior relevância técnica as execuções apresentadas"]
["F"]

{"sheet":"Composições","index":7,"n_rows":189,"n_cols":10,"rows_kept":189,"cut":false,"hidden":false,"merged":[[0,0,0,8],[10,0,10,2],[10,3,10,6],[11,0,11,9],[12,0,12,2],[12,3,12,6],[12,7,12,8],[7,0,7,6],[9,0,9,2],[9,3,9,6],[9,7,9,8],[3,0,3,6],[4,0,4,6],[15,0,15,9],[13,0,13,2],[13,3,13,6],[1,0,1,9],[3,7,3,9],[4,7,4,9],[6,7,6,9],[7,7,7,9],[6,0,6,6],[10,8,10,9],[13,8,13,9],[14,0,14,9],[8,0,8,9],[5,0,5,9],[2,0,2,9],[16,5,17,5],[16,6,16,7],[16,8,16,9],[21,1,21,7],[24,1,24,7],[16,0,17,0],[16,1,17,1],[16,2,17,2],[16,3,17,3],[16,4,17,4],[26,5,27,5],[26,6,26,7],[26,8,26,9],[31,1,31,7],[34,1,34,7],[26,0,27,0],[26,1,27,1],[26,2,27,2],[26,3,27,3],[26,4,27,4],[36,5,37,5],[36,6,36,7],[36,8,36,9],[41,1,41,7],[43,1,43,7],[36,0,37,0],[36,1,37,1],[36,2,37,2],[36,3,37,3],[36,4,37,4],[45,5,46,5],[45,6,45,7],[45,8,45,9],[50,1,50,7],[52,1,52,7],[45,0,46,0],[45,1,46,1],[45,2,46,2],[45,3,46,3],[45,4,46,4],[54,5,55,5],[54,6,54,7],[54,8,54,9],[59,1,59,7],[61,1,61,7],[54,0,55,0],[54,1,55,1],[54,2,55,2],[54,3,55,3],[54,4,55,4],[63,5,64,5],[63,6,63,7],[63,8,63,9],[68,1,68,7],[70,1,70,7],[63,0,64,0],[63,1,64,1],[63,2,64,2],[63,3,64,3],[63,4,64,4],[72,5,73,5],[72,6,72,7],[72,8,72,9],[77,1,77,7],[79,1,79,7],[72,0,73,0],[72,1,73,1],[72,2,73,2],[72,3,73,3],[72,4,73,4],[81,5,82,5],[81,6,81,7],[81,8,81,9],[86,1,86,7],[89,1,89,7],[81,0,82,0],[81,1,82,1],[81,2,82,2],[81,3,82,3],[81,4,82,4],[91,5,92,5],[91,6,91,7],[91,8,91,9],[96,1,96,7],[99,1,99,7],[91,0,92,0],[91,1,92,1],[91,2,92,2],[91,3,92,3],[91,4,92,4],[101,5,102,5],[101,6,101,7],[101,8,101,9],[105,1,105,7],[109,1,109,7],[101,0,102,0],[101,1,102,1],[101,2,102,2],[101,3,102,3],[101,4,102,4],[111,5,112,5],[111,6,111,7],[111,8,111,9],[115,1,115,7],[119,1,119,7],[111,0,112,0],[111,1,112,1],[111,2,112,2],[111,3,112,3],[111,4,112,4],[121,5,122,5],[121,6,121,7],[121,8,121,9],[125,1,125,7],[126,1,126,7],[121,0,122,0],[121,1,122,1],[121,2,122,2],[121,3,122,3],[121,4,122,4],[128,5,129,5],[128,6,128,7],[128,8,128,9],[132,1,132,7],[136,1,136,7],[128,0,129,0],[128,1,129,1],[128,2,129,2],[128,3,129,3],[128,4,129,4],[138,5,139,5],[138,6,138,7],[138,8,138,9],[142,1,142,7],[146,1,146,7],[138,0,139,0],[138,1,139,1],[138,2,139,2],[138,3,139,3],[138,4,139,4],[148,5,149,5],[148,6,148,7],[148,8,148,9],[152,1,152,7],[159,1,159,7],[148,0,149,0],[148,1,149,1],[148,2,149,2],[148,3,149,3],[148,4,149,4],[161,5,162,5],[161,6,161,7],[161,8,161,9],[165,1,165,7],[169,1,169,7],[161,0,162,0],[161,1,162,1],[161,2,162,2],[161,3,162,3],[161,4,162,4],[171,5,172,5],[171,6,171,7],[171,8,171,9],[175,1,175,7],[179,1,179,7],[171,0,172,0],[171,1,172,1],[171,2,172,2],[171,3,172,3],[171,4,172,4],[181,5,182,5],[181,6,181,7],[181,8,181,9],[186,1,186,7],[188,1,188,7],[181,0,182,0],[181,1,182,1],[181,2,182,2],[181,3,182,3],[181,4,182,4]]}
[]
[]
[]
["UNIDADE ESCOLAR",null,null,null,null,null,null,"CÓDIGO INEP"]
[{"$f":"Orçamento!$O$4","v":"CENTRO DE ENSINO EM PERÍODO INTEGRAL DRº ARY RIBEIRO VALADÃO FILHO"},null,null,null,null,null,null,{"$f":"Orçamento!$X$4","v":52024180}]
[]
["OBRA",null,null,null,null,null,null,"CIDADE"]
[{"$f":"Orçamento!$O$7","v":"REFORMA E AMPLIAÇÃO"},null,null,null,null,null,null,{"$f":"Orçamento!$X$7","v":"ITAGUARU"}]
[]
["CRE",null,null,"ENDEREÇO",null,null,null,"REFERÊNCIA AGETOP"]
[{"$f":"Orçamento!$O$10","v":"CRE-ITABERAI"},null,null,{"$f":"Orçamento!$R$10","v":" R. BENIGNO PINTO DE FARIA 1068 , CENTRO , CEP: 7666-000"},null,null,null,{"$f":"Orçamento!$S$10","v":"ABR/19"},{"$f":"Orçamento!$T$10","v":"DESONERADA"}]
[]
["DATA",null,null,"ÁREA TOTAL CONSTRUÍDA (M²)",null,null,null,"REFERÊNCIA SINAPI"]
[{"$f":"Orçamento!$S$7","v":"2020-05-13"},null,null,{"$f":"Orçamento!$X$13","v":1262.3600000000001},null,null,null,{"$f":"Orçamento!$X$10","v":"FEV/20"},{"$f":"Orçamento!$Y$10","v":"DESONERADA"}]
[]
["COMPOSIÇÕES DE CUSTOS UNITÁRIOS - SEE-GO"]
[382,"FONTE","CÓDIGO","DESCRIÇÃO","UNIDADE","COEFIC.","CUSTO UNITÁRIO",null,"CUSTO  TOTAL (A) + (B) + (C) + (D) + (E)"]
[null,null,null,null,null,null,"DESONERADO","NÃO DESONER.","DESONERADO","NÃO DESONER."]
[null,"COMPOSIÇÃO","COMP 382_SEE","TE DE REDUCAO DE FERRO GALVANIZADO, COM ROSCA BSP, DE 3/4\" X 1/2\"","UN ",null,null,null,24.25,26.43]
[null,"AGETOP_I",8,"AJUDANTE","h     ",0.6,8.75,10.14,5.25,6.08]
[null,"AGETOP_I",11,"ENCANADOR","h     ",0.61050000000000004,13.95,16.16,8.52,9.8699999999999992]
[null,"MÃO DE OBRA (B) - TOTAL",null,null,null,null,null,null,13.77,15.95]
[null,"SINAPI_I",3146,"FITA VEDA ROSCA EM ROLOS DE 18 MM X 10 M (L X C)","UN    ",0.12075471698113208,3.4,3.4,0.41,0.41]
[null,"SINAPI_I",6302,"TE DE REDUCAO DE FERRO GALVANIZADO, COM ROSCA BSP, DE 3/4\" X 1/2\"","UN    ",1,10.07,10.07,10.07,10.07]
[null,"MATERIAL (C) - TOTAL",null,null,null,null,null,null,10.48,10.48]
[]
[383,"FONTE","CÓDIGO","DESCRIÇÃO","UNIDADE","COEFIC.","CUSTO UNITÁRIO",null,"CUSTO  TOTAL (A) + (B) + (C) + (D) + (E)"]
[null,null,null,null,null,null,"DESONERADO","NÃO DESONER.","DESONERADO","NÃO DESONER."]
[null,"COMPOSIÇÃO","COMP 383_SEE","BUCHA DE REDUCAO DE FERRO GALVANIZADO, COM ROSCA BSP, DE 1/2\" X 1/4\"","UN ",null,null,null,7.68,8.26]
[null,"AGETOP_I",8,"AJUDANTE","h     ",0.16,8.75,10.14,1.4,1.62]
[null,"AGETOP_I",11,"ENCANADOR","h     ",0.16,13.95,16.16,2.23,2.59]
[null,"MÃO DE OBRA (B) - TOTAL",null,null,null,null,null,null,3.63,4.21]
[null,"AGETOP_I","H689","FITA VEDAROSCA 12 MM","m",1.2,0.28000000000000003,0.28000000000000003,0.34,0.34]
[null,"SINAPI_I",770,"BUCHA DE REDUCAO DE FERRO GALVANIZADO, COM ROSCA BSP, DE 1/2\" X 1/4\"","UN    ",1,3.71,3.71,3.71,3.71]
[null,"MATERIAL (C) - TOTAL",null,null,null,null,null,null,4.05,4.05]
[]
[212,"FONTE","CÓDIGO","DESCRIÇÃO","UNIDADE","COEFIC.","CUSTO UNITÁRIO",null,"CUSTO  TOTAL (A) + (B) + (C) + (D) + (E)"]
[null,null,null,null,null,null,"DESONERADO","NÃO DESONER.","DESONERADO","NÃO DESONER."]
[null,"COMPOSIÇÃO","COMP 212_SEE","NIPLE DE REDUÇÃO 1/2\" X 1/4\" BSP","UN ",null,null,null,9.68,10.26]
[null,"AGETOP_I",8,"AJUDANTE","h     ",0.16,8.75,10.14,1.4,1.62]
[null,"AGETOP_I",11,"ENCANADOR","h     ",0.16,13.95,16.16,2.23,2.59]
[null,"MÃO DE OBRA (B) - TOTAL",null,null,null,null,null,null,3.63,4.21]
[null,"COTAÇÃO","COT 103_SEE","NIPLE DE REDUÇÃO 1/2\" X 1/4\" BSP","UN",1,6.0533333333333337,6.0533333333333337,6.05,6.05]
[null,"MATERIAL (C) - TOTAL",null,null,null,null,null,null,6.05,6.05]
[]
[213,"FONTE","CÓDIGO","DESCRIÇÃO","UNIDADE","COEFIC.","CUSTO UNITÁRIO",null,"CUSTO  TOTAL (A) + (B) + (C) + (D) + (E)"]
[null,null,null,null,null,null,"DESONERADO","NÃO DESONER.","DESONERADO","NÃO DESONER."]
[null,"COMPOSIÇÃO","COMP 213_SEE","NIPLE DE REDUÇÃO 3/4\" X 1/2\" BSP","UN ",null,null,null,13.34,13.920000000000002]
[null,"AGETOP_I",8,"AJUDANTE","h     ",0.16,8.75,10.14,1.4,1.62]
[null,"AGETOP_I",11,"ENCANADOR","h     ",0.16,13.95,16.16,2.23,2.59]
[null,"MÃO DE OBRA (B) - TOTAL",null,null,null,null,null,null,3.63,4.21]
[null,"COTAÇÃO","COT 104_SEE","NIPLE DE REDUÇÃO 3/4\" X 1/2\" BSP","UN",1,9.7099999999999991,9.7099999999999991,9.7100000000000009,9.7100000000000009]
[null,"MATERIAL (C) - TOTAL",null,null,null,null,null,null,9.7100000000000009,9.7100000000000009]
[]
[237,"FONTE","CÓDIGO","DESCRIÇÃO","UNIDADE","COEFIC.","CUSTO UNITÁRIO",null,"CUSTO  TOTAL (A) + (B) + (C) + (D) + (E)"]
[null,null,null,null,null,null,"DESONERADO","NÃO DESONER.","DESONERADO","NÃO DESONER."]
[null,"COMPOSIÇÃO","COMP 237_SEE","FITA ANTICORROSIVA","M",null,null,null,11.16,11.879999999999999]
[null,"AGETOP_I",8,"AJUDANTE","h     ",0.2,8.75,10.14,1.75,2.0299999999999998]
[null,"AGETOP_I",12,"ELETRICISTA","h     ",0.2,13.95,16.16,2.79,3.23]
[null,"MÃO DE OBRA (B) - TOTAL",null,null,null,null,null,null,4.54,5.26]
[null,"SINAPI_I",39634,"FITA ADESIVA ANTICORROSIVA DE PVC FLEXIVEL, COR PRETA, PARA PROTECAO TUBULACAO, 50 MM X 30 M (L X C), E= *0,25* MM","M     ",1,6.62,6.62,6.62,6.62]
[null,"MATERIAL (C) - TOTAL",null,null,null,null,null,null,6.62,6.62]
[]
[542,"FONTE","CÓDIGO","DESCRIÇÃO","UNIDADE","COEFIC.","CUSTO UNITÁRIO",null,"CUSTO  TOTAL (A) + (B) + (C) + (D) + (E)"]
[null,null,null,null,null,null,"DESONERADO","NÃO DESONER.","DESONERADO","NÃO DESONER."]
[null,"COMPOSIÇÃO","COMP 542_SEE","VÁLVULA UGV 3/4\" (S) LATÃO","UN ",null,null,null,25.65,27.2]
[null,"AGETOP_I",8,"AJUDANTE","h     ",0.432,8.75,10.14,3.78,4.38]
[null,"AGETOP_I",11,"ENCANADOR","h     ",0.432,13.95,16.16,6.03,6.98]
[null,"MÃO DE OBRA (B) - TOTAL",null,null,null,null,null,null,9.81,11.36]
[null,"COTAÇÃO","COT 281_SEE","VÁLVULA UGV 3/4\" (S) LATÃO","UN ",1,15.836666666666666,15.836666666666666,15.84,15.84]
[null,"MATERIAL (C) - TOTAL",null,null,null,null,null,null,15.84,15.84]
[]
[543,"FONTE","CÓDIGO","DESCRIÇÃO","UNIDADE","COEFIC.","CUSTO UNITÁRIO",null,"CUSTO  TOTAL (A) + (B) + (C) + (D) + (E)"]
[null,null,null,null,null,null,"DESONERADO","NÃO DESONER.","DESONERADO","NÃO DESONER."]
[null,"COMPOSIÇÃO","COMP 543_SEE","VÁLVULA UGV 1/2\" (S) LATÃO","UN ",null,null,null,24.98,26.53]
[null,"AGETOP_I",8,"AJUDANTE","h     ",0.432,8.75,10.14,3.78,4.38]
[null,"AGETOP_I",11,"ENCANADOR","h     ",0.432,13.95,16.16,6.03,6.98]
[null,"MÃO DE OBRA (B) - TOTAL",null,null,null,null,null,null,9.81,11.36]
[null,"COTAÇÃO","COT 282_SEE","VÁLVULA UGV 1/2\" (S) LATÃO","UN ",1,15.166666666666666,15.166666666666666,15.17,15.17]
[null,"MATERIAL (C) - TOTAL",null,null,null,null,null,null,15.17,15.17]
[]
[211,"FONTE","CÓDIGO","DESCRIÇÃO","UNIDADE","COEFIC.","CUSTO UNITÁRIO",null,"CUSTO  TOTAL (A) + (B) + (C) + (D) + (E)"]
[null,null,null,null,null,null,"DESONERADO","NÃO DESONER.","DESONERADO","NÃO DESONER."]
[null,"COMPOSIÇÃO","COMP 211_SEE","REGULADOR DE 2º ESTÁGIO 5KG/H","UN ",null,null,null,86.72,90.86]
[null,"AGETOP_I",8,"AJUDANTE","h     ",1.1499999999999999,8.75,10.14,10.06,11.66]
[null,"AGETOP_I",11,"ENCANADOR","h     ",1.1499999999999999,13.95,16.16,16.04,18.579999999999998]
[null,"MÃO DE OBRA (B) - TOTAL",null,null,null,null,null,null,26.1,30.24]
[null,"COTAÇÃO","COT 102_SEE","REGULADOR DE 2º ESTÁGIO 5KG/H","UN",1,59.833333333333336,59.833333333333336,59.83,59.83]
[null,"AGETOP_I","H689","FITA VEDAROSCA 12 MM","m",2.82,0.28000000000000003,0.28000000000000003,0.79,0.79]
[null,"MATERIAL (C) - TOTAL",null,null,null,null,null,null,60.62,60.62]
[]
[210,"FONTE","CÓDIGO","DESCRIÇÃO","UNIDADE","COEFIC.","CUSTO UNITÁRIO",null,"CUSTO  TOTAL (A) + (B) + (C) + (D) + (E)"]
[null,null,null,null,null,null,"DESONERADO","NÃO DESONER.","DESONERADO","NÃO DESONER."]
[null,"COMPOSIÇÃO","COMP 210_SEE","REGULADOR DE 1º ESTÁGIO 60KG/H MODELO AP-40  COM MANÔMETRO","UN ",null,null,null,232.47,236.61]
[null,"AGETOP_I",8,"AJUDANTE","h     ",1.1499999999999999,8.75,10.14,10.06,11.66]
[null,"AGETOP_I",11,"ENCANADOR","h     ",1.1499999999999999,13.95,16.16,16.04,18.579999999999998]
[null,"MÃO DE OBRA (B) - TOTAL",null,null,null,null,null,null,26.1,30.24]
[null,"COTAÇÃO","COT 101_SEE","REGULADOR DE 1º ESTÁGIO 60KG/H MODELO AP-40  COM MANÔMETRO","UN",1,205.57666666666668,205.57666666666668,205.58,205.58]
[null,"AGETOP_I","H689","FITA VEDAROSCA 12 MM","m",2.82,0.28000000000000003,0.28000000000000003,0.79,0.79]
[null,"MATERIAL (C) - TOTAL",null,null,null,null,null,null,206.37,206.37]
[]
[235,"FONTE","CÓDIGO","DESCRIÇÃO","UNIDADE","COEFIC.","CUSTO UNITÁRIO",null,"CUSTO  TOTAL (A) + (B) + (C) + (D) + (E)"]
[null,null,null,null,null,null,"DESONERADO","NÃO DESONER.","DESONERADO","NÃO DESONER."]
[null,"COMPOSIÇÃO","COMP 235_SEE","PLACA DE SINALIZAÇÃO EM PVC COD 01 - (300X300) PROIBIDO FUMAR","UN ",null,null,null,25.319999999999997,25.439999999999998]
[null,"AGETOP_I",5,"SERVENTE","h     ",0.09,8.75,10.14,0.79,0.91]
[null,"MÃO DE OBRA (B) - TOTAL",null,null,null,null,null,null,0.79,0.91]
[null,"AGETOP_I",3070,"BUCHA DE NYLON S-6","un",2,0.04,0.04,0.08,0.08]
[null,"AGETOP_I",3393,"PARAFUSO P/BUCHA S-6","un",2,0.08,0.08,0.16,0.16]
[null,"SINAPI_I",37556,"PLACA DE SINALIZACAO DE SEGURANCA CONTRA INCENDIO, FOTOLUMINESCENTE, QUADRADA, *20 X 20* CM, EM PVC *2* MM ANTI-CHAMAS (SIMBOLOS, CORES E PICTOGRAMAS CONFORME NBR 13434)","UN    ",1,24.29,24.29,24.29,24.29]
[null,"MATERIAL (C) - TOTAL",null,null,null,null,null,null,24.529999999999998,24.529999999999998]
[]
[236,"FONTE","CÓDIGO","DESCRIÇÃO","UNIDADE","COEFIC.","CUSTO UNITÁRIO",null,"CUSTO  TOTAL (A) + (B) + (C) + (D) + (E)"]
[null,null,null,null,null,null,"DESONERADO","NÃO DESONER.","DESONERADO","NÃO DESONER."]
[null,"COMPOSIÇÃO","COMP 236_SEE","PLACA DE SINALIZAÇÃO EM PVC COD 06 - (300X300) PERIGO INFLAMÁVEL","UN ",null,null,null,25.319999999999997,25.439999999999998]
[null,"AGETOP_I",5,"SERVENTE","h     ",0.09,8.75,10.14,0.79,0.91]
[null,"MÃO DE OBRA (B) - TOTAL",null,null,null,null,null,null,0.79,0.91]
[null,"AGETOP_I",3070,"BUCHA DE NYLON S-6","un",2,0.04,0.04,0.08,0.08]
[null,"AGETOP_I",3393,"PARAFUSO P/BUCHA S-6","un",2,0.08,0.08,0.16,0.16]
[null,"SINAPI_I",37556,"PLACA DE SINALIZACAO DE SEGURANCA CONTRA INCENDIO, FOTOLUMINESCENTE, QUADRADA, *20 X 20* CM, EM PVC *2* MM ANTI-CHAMAS (SIMBOLOS, CORES E PICTOGRAMAS CONFORME NBR 13434)","UN    ",1,24.29,24.29,24.29,24.29]
[null,"MATERIAL (C) - TOTAL",null,null,null,null,null,null,24.529999999999998,24.529999999999998]
[]
[45,"FONTE","CÓDIGO","DESCRIÇÃO","UNIDADE","COEFIC.","CUSTO UNITÁRIO",null,"CUSTO  TOTAL (A) + (B) + (C) + (D) + (E)"]
[null,null,null,null,null,null,"DESONERADO","NÃO DESONER.","DESONERADO","NÃO DESONER."]
[null,"COMPOSIÇÃO","COMP 045_SEE","LAUDO DE ESTANQUEIDADE","UN ",null,null,null,936,1085.1199999999999]
[null,"AGETOP",250101,"ENGENHEIRO - (OBRAS CIVIS)","H     ",16,58.5,67.819999999999993,936,1085.1199999999999]
[null,"MÃO DE OBRA (B) - TOTAL",null,null,null,null,null,null,936,1085.1199999999999]
[null,"MATERIAL (C) - TOTAL",null,null,null,null,null,null,0,0]
[]
[24,"FONTE","CÓDIGO","DESCRIÇÃO","UNIDADE","COEFIC.","CUSTO UNITÁRIO",null,"CUSTO  TOTAL (A) + (B) + (C) + (D) + (E)"]
[null,null,null,null,null,null,"DESONERADO","NÃO DESONER.","DESONERADO","NÃO DESONER."]
[null,"COMPOSIÇÃO","COMP 024_SEE","SINALIZADOR FOTOLUMINESCENTE PARA EXTINTOR","UN ",null,"-","-",25.319999999999997,25.439999999999998]
[null,"AGETOP_I",5,"SERVENTE","h     ",0.09,8.75,10.14,0.79,0.91]
[null,"MÃO DE OBRA (B) - TOTAL",null,null,null,null,null,null,0.79,0.91]
[null,"AGETOP_I",3070,"BUCHA DE NYLON S-6","un",2,0.04,0.04,0.08,0.08]
[null,"AGETOP_I",3393,"PARAFUSO P/BUCHA S-6","un",2,0.08,0.08,0.16,0.16]
[null,"SINAPI_I",37556,"PLACA DE SINALIZACAO DE SEGURANCA CONTRA INCENDIO, FOTOLUMINESCENTE, QUADRADA, *20 X 20* CM, EM PVC *2* MM ANTI-CHAMAS (SIMBOLOS, CORES E PICTOGRAMAS CONFORME NBR 13434)","UN    ",1,24.29,24.29,24.29,24.29]
[null,"MATERIAL (C) - TOTAL",null,null,null,null,null,null,24.529999999999998,24.529999999999998]
[]
[25,"FONTE","CÓDIGO","DESCRIÇÃO","UNIDADE","COEFIC.","CUSTO UNITÁRIO",null,"CUSTO  TOTAL (A) + (B) + (C) + (D) + (E)"]
[null,null,null,null,null,null,"DESONERADO","NÃO DESONER.","DESONERADO","NÃO DESONER."]
[null,"COMPOSIÇÃO","COMP 025_SEE","SINALIZADOR FOTOLUMINESCENTE DE EMERGÊNCIA","UN ",null,"-","-",25.319999999999997,25.439999999999998]
[null,"AGETOP_I",5,"SERVENTE","h     ",0.09,8.75,10.14,0.79,0.91]
[null,"MÃO DE OBRA (B) - TOTAL",null,null,null,null,null,null,0.79,0.91]
[null,"AGETOP_I",3070,"BUCHA DE NYLON S-6","un",2,0.04,0.04,0.08,0.08]
[null,"AGETOP_I",3393,"PARAFUSO P/BUCHA S-6","un",2,0.08,0.08,0.16,0.16]
[null,"SINAPI_I",37556,"PLACA DE SINALIZACAO DE SEGURANCA CONTRA INCENDIO, FOTOLUMINESCENTE, QUADRADA, *20 X 20* CM, EM PVC *2* MM ANTI-CHAMAS (SIMBOLOS, CORES E PICTOGRAMAS CONFORME NBR 13434)","UN    ",1,24.29,24.29,24.29,24.29]
[null,"MATERIAL (C) - TOTAL",null,null,null,null,null,null,24.529999999999998,24.529999999999998]
[]
[277,"FONTE","CÓDIGO","DESCRIÇÃO","UNIDADE","COEFIC.","CUSTO UNITÁRIO",null,"CUSTO  TOTAL (A) + (B) + (C) + (D) + (E)"]
[null,null,null,null,null,null,"DESONERADO","NÃO DESONER.","DESONERADO","NÃO DESONER."]
[null,"COMPOSIÇÃO","COMP 277_SEE","MARCAÇÃO NO PISO - 1X1 M PARA EXTINTOR","M2",null,null,null,29.67,29.75]
[null,"AGETOP_I",5,"SERVENTE","h     ",3.3300000000000003E-2,8.75,10.14,0.28999999999999998,0.34]
[null,"MÃO DE OBRA (B) - TOTAL",null,null,null,null,null,null,0.28999999999999998,0.34]
[null,"SINAPI_I",5318,"SOLVENTE DILUENTE A BASE DE AGUARRAS","L     ",0.13,11.78,11.78,1.53,1.53]
[null,"SINAPI",5824,"CAMINHÃO TOCO, PBT 16.000 KG, CARGA ÚTIL MÁX. 10.685 KG, DIST. ENTRE EIXOS 4,8 M, POTÊNCIA 189 CV, INCLUSIVE CARROCERIA FIXA ABERTA DE MADEIRA P/ TRANSPORTE GERAL DE CARGA SECA, DIMEN. APROX. 2,5 X 7,00 X 0,50 M - CHP DIURNO. AF_06/2014","CHP",3.3E-3,120.02,123.21,0.4,0.41]
[null,"SINAPI_I",7343,"TINTA A BASE DE RESINA ACRILICA, PARA SINALIZACAO HORIZONTAL VIARIA (NBR 11862)","L     ",0.6,12.82,12.82,7.69,7.69]
[null,"SINAPI_I",7348,"TINTA ACRILICA PREMIUM PARA PISO","L     ",0.03,13.72,13.72,0.41,0.41]
[null,"SINAPI_I",25972,"MICROESFERAS DE VIDRO PARA SINALIZACAO HORIZONTAL VIARIA, TIPO I-B (PREMIX) - NBR 16184","KG    ",2.14,8.8800000000000008,8.8800000000000008,19,19]
[null,"SINAPI",95133,"MÁQUINA DEMARCADORA DE FAIXA DE TRÁFEGO À FRIO, AUTOPROPELIDA, POTÊNCIA 38 HP - CHP DIURNO. AF_07/2016","CHP",3.3E-3,107.44,110.99,0.35,0.37]
[null,"MATERIAL (C) - TOTAL",null,null,null,null,null,null,29.380000000000003,29.41]
[]
[411,"FONTE","CÓDIGO","DESCRIÇÃO","UNIDADE","COEFIC.","CUSTO UNITÁRIO",null,"CUSTO  TOTAL (A) + (B) + (C) + (D) + (E)"]
[null,null,null,null,null,null,"DESONERADO","NÃO DESONER.","DESONERADO","NÃO DESONER."]
[null,"COMPOSIÇÃO","COMP 411_SEE","PLACA DE SINALIZAÇÃO EM PVC COD 13 - (316X158) SAÍDA DE EMERGÊNCIA","UN ",null,null,null,30.819999999999997,30.939999999999998]
[null,"AGETOP_I",5,"SERVENTE","h     ",0.09,8.75,10.14,0.79,0.91]
[null,"MÃO DE OBRA (B) - TOTAL",null,null,null,null,null,null,0.79,0.91]
[null,"AGETOP_I",3070,"BUCHA DE NYLON S-6","un",2,0.04,0.04,0.08,0.08]
[null,"AGETOP_I",3393,"PARAFUSO P/BUCHA S-6","un",2,0.08,0.08,0.16,0.16]
[null,"SINAPI_I",37559,"PLACA DE SINALIZACAO DE SEGURANCA CONTRA INCENDIO, FOTOLUMINESCENTE, RETANGULAR, *12 X 40* CM, EM PVC *2* MM ANTI-CHAMAS (SIMBOLOS, CORES E PICTOGRAMAS CONFORME NBR 13434)","UN    ",1,29.79,29.79,29.79,29.79]
[null,"MATERIAL (C) - TOTAL",null,null,null,null,null,null,30.029999999999998,30.029999999999998]
[]
[412,"FONTE","CÓDIGO","DESCRIÇÃO","UNIDADE","COEFIC.","CUSTO UNITÁRIO",null,"CUSTO  TOTAL (A) + (B) + (C) + (D) + (E)"]
[null,null,null,null,null,null,"DESONERADO","NÃO DESONER.","DESONERADO","NÃO DESONER."]
[null,"COMPOSIÇÃO","COMP 412_SEE","PLACA DE SINALIZAÇÃO EM PVC COD 17 - (316X158) MENSAGEM \"SAÍDA\"","UN ",null,null,null,30.819999999999997,30.939999999999998]
[null,"AGETOP_I",5,"SERVENTE","h     ",0.09,8.75,10.14,0.79,0.91]
[null,"MÃO DE OBRA (B) - TOTAL",null,null,null,null,null,null,0.79,0.91]
[null,"AGETOP_I",3070,"BUCHA DE NYLON S-6","un",2,0.04,0.04,0.08,0.08]
[null,"AGETOP_I",3393,"PARAFUSO P/BUCHA S-6","un",2,0.08,0.08,0.16,0.16]
[null,"SINAPI_I",37559,"PLACA DE SINALIZACAO DE SEGURANCA CONTRA INCENDIO, FOTOLUMINESCENTE, RETANGULAR, *12 X 40* CM, EM PVC *2* MM ANTI-CHAMAS (SIMBOLOS, CORES E PICTOGRAMAS CONFORME NBR 13434)","UN    ",1,29.79,29.79,29.79,29.79]
[null,"MATERIAL (C) - TOTAL",null,null,null,null,null,null,30.029999999999998,30.029999999999998]
[]
[387,"FONTE","CÓDIGO","DESCRIÇÃO","UNIDADE","COEFIC.","CUSTO UNITÁRIO",null,"CUSTO  TOTAL (A) + (B) + (C) + (D) + (E)"]
[null,null,null,null,null,null,"DESONERADO","NÃO DESONER.","DESONERADO","NÃO DESONER."]
[null,"COMPOSIÇÃO","COMP 387_SEE","LÂMPADA LED TUBULAR 18W ","UN ",null,null,null,22.3,22.35]
[null,"AGETOP_I",8,"AJUDANTE","h     ",1.4999999999999999E-2,8.75,10.14,0.13,0.15]
[null,"AGETOP_I",12,"ELETRICISTA","h     ",1.4999999999999999E-2,13.95,16.16,0.21,0.24]
[null,"MÃO DE OBRA (B) - TOTAL",null,null,null,null,null,null,0.33999999999999997,0.39]
[null,"COTAÇÃO","COT 195_SEE","LÂMPADA LED TUBULAR 18W ","UN",1,21.959999999999997,21.959999999999997,21.96,21.96]
[null,"MATERIAL (C) - TOTAL",null,null,null,null,null,null,21.96,21.96]