{"text_format":"1","workbook":"xlsx","n_sheets":8,"sheets":["Orçamento","Resumo ","Somatório","Cronog_75_Dias","Composição BDI","Relatório CENTRAL","Parc Maior Relev","Composições"],"not_rendered":{"charts":0,"images":3,"macros":1,"external_links":1,"defined_names":105,"comments":2,"pivot_tables":0},"unopened":[],"bounds":{"document_bytes":16777216,"sheet_cells":100000,"rows_first":2000,"rows_last":500,"rows_between":2000,"halvings":0,"cell_chars":16384,"cell_head_chars":4096},"cells_cut":0,"cells_raw":0,"read":"whole","date_system":"1900"}

{"sheet":"Orçamento","index":0,"n_rows":424,"n_cols":27,"rows_kept":424,"cut":false,"hidden":false,"merged":[[6,12,6,13],[5,12,5,13],[12,23,12,25],[11,23,11,25],[9,19,9,22],[391,23,391,25],[366,23,366,25],[367,23,367,25],[368,23,368,25],[369,23,369,25],[370,23,370,25],[371,23,371,25],[372,23,372,25],[373,23,373,25],[374,23,374,25],[375,23,375,25],[376,23,376,25],[377,23,377,25],[391,15,391,17],[389,15,389,17],[378,23,378,25],[384,23,384,25],[382,15,382,17],[383,15,383,17],[407,15,407,17],[407,18,407,22],[402,15,402,17],[402,18,402,22],[403,15,403,17],[403,18,403,22],[416,18,416,22],[352,22,352,24],[353,22,353,24],[407,23,407,25],[408,23,408,25],[409,23,409,25],[378,18,378,22],[375,15,375,17],[376,15,376,17],[377,15,377,17],[387,18,387,22],[385,18,385,22],[393,18,393,22],[380,18,380,22],[373,18,373,22],[387,15,387,17],[388,15,388,17],[390,15,390,17],[388,23,388,25],[389,23,389,25],[383,23,383,25],[0,14,0,24],[8,14,8,16],[9,14,9,16],[11,14,11,16],[12,14,12,16],[14,14,14,24],[1,14,1,24],[4,14,4,24],[7,14,7,24],[8,23,8,25],[359,16,359,24],[365,23,365,25],[381,23,381,25],[382,23,382,25],[395,18,395,22],[371,18,371,22],[372,18,372,22],[370,18,370,22],[379,18,379,22],[361,18,361,24],[367,18,367,22],[368,18,368,22],[369,18,369,22],[392,18,392,22],[390,18,390,22],[391,18,391,22],[381,18,381,22],[388,18,388,22],[384,18,384,22],[386,18,386,22],[382,18,382,22],[383,18,383,22],[392,23,392,25],[386,23,386,25],[360,16,360,24],[378,15,378,17],[379,15,379,17],[364,14,364,26],[365,18,365,22],[366,18,366,22],[374,18,374,22],[375,18,375,22],[376,18,376,22],[377,18,377,22],[366,15,366,17],[367,15,367,17],[368,15,368,17],[369,15,369,17],[370,15,370,17],[371,15,371,17],[365,15,365,17],[379,23,379,25],[356,16,356,24],[357,16,357,24],[358,16,358,24],[10,14,10,26],[13,14,13,26],[2,14,2,22],[3,14,3,22],[5,18,5,22],[6,18,6,22],[11,18,11,22],[12,18,12,22],[6,14,6,17],[5,14,5,17],[3,23,3,25],[2,23,2,25],[5,23,5,25],[6,23,6,25],[8,18,8,20],[348,17,353,17],[354,22,354,24],[348,22,348,24],[349,22,349,24],[350,22,350,24],[9,24,9,25],[415,15,415,17],[415,18,415,22],[416,15,416,17],[411,15,411,17],[411,18,411,22],[412,15,412,17],[412,18,412,22],[413,15,413,17],[413,18,413,22],[372,15,372,17],[373,15,373,17],[374,15,374,17],[404,15,404,17],[404,18,404,22],[398,14,398,26],[399,18,399,22],[400,15,400,17],[400,18,400,22],[385,15,385,17],[394,23,394,25],[395,23,395,25],[401,15,401,17],[401,18,401,22],[389,18,389,22],[386,15,386,17],[390,23,390,25],[394,18,394,22],[384,15,384,17],[385,23,385,25],[380,15,380,17],[381,15,381,17],[380,23,380,25],[387,23,387,25],[406,23,406,25],[410,23,410,25],[411,23,411,25],[405,15,405,17],[420,14,420,17],[417,15,417,17],[417,18,417,22],[418,15,418,17],[418,18,418,22],[419,15,419,17],[419,18,419,22],[417,23,417,25],[418,23,418,25],[412,23,412,25],[413,23,413,25],[420,18,420,22],[408,15,408,17],[408,18,408,22],[409,15,409,17],[409,18,409,22],[410,15,410,17],[410,18,410,22],[414,15,414,17],[414,18,414,22],[405,18,405,22],[406,15,406,17],[406,18,406,22],[419,23,419,25],[420,23,420,25],[421,23,421,25],[422,23,422,25],[423,23,423,25],[392,14,392,17],[399,15,399,17],[423,18,423,22],[422,18,422,22],[421,18,421,22],[393,23,393,25],[414,23,414,25],[415,23,415,25],[416,23,416,25],[399,23,399,25],[400,23,400,25],[401,23,401,25],[402,23,402,25],[403,23,403,25],[404,23,404,25],[405,23,405,25]]}
[]
[]
[null,null,null,null,null,null,null,null,null,null,null,null,null,null,"UNIDADE ESCOLAR",null,null,null,null,null,null,null,null,"CÓDIGO INEP"]
[null,null,null,null,null,null,null,null,null,null,null,null,{"$f":"IF($M$7=\"MANUAL\",\"DESPROTEJA A PLANILHA PARA FORMATAR\",\"\")","v":""},null,"ESCOLA ESTADUAL LUIZ ALVES MACHADO",null,null,null,null,null,null,null,null,52017320]
[]
["Nmax",null,null,null,null,null,null,null,null,null,null,null,null,null,"OBRA",null,null,null,"DATA",null,null,null,null,"CIDADE"]
[{"$f":"MAX($C$18:$C$348)","v":4},null,null,null,null,null,null,null,null,null,null,null,null,null,"REFORMA",null,null,null,"2020-05-25",null,null,null,null,"ITAPACI"]
[]
[null,null,null,null,null,null,null,null,null,null,null,null,null,null,"CRE",null,null,"ENDEREÇO","REFERÊNCIA AGETOP",null,null,null,null,"REFERÊNCIA SINAPI"]
[null,null,null,null,null,null,null,null,null,null,null,null,null,null,"CRE-ITAPACI",null,null," AV GOIAS 155 , CENTRO , CEP: 7636-000","ABR/19","ONERADA",null,null,null,"MAR/20","ONERADA"]
[]
[null,null,null,null,null,null,null,null,null,null,null,null,null,null,"ÁREA EXISTENTE (M²)",null,null,"ÁREA A CONSTRUIR (M²)","ÁREA A DEMOLIR (M²)",null,null,null,null,"ÁREA TOTAL CONSTRUÍDA (M²)"]
[null,null,null,null,null,null,null,null,null,null,null,null,null,null,926.8,null,null,null,null,null,null,null,null,926.8]
[]
[null,null,null,null,null,null,null,null,null,null,null,"FILTRO",null,null,"PLANILHA ORÇAMENTÁRIA"]
["Nível E","Save Nivel","Nível C","Altura","n1","n2","n3","n4","n5","Czero","Cnível","↓","Nível","Nível Corrigido","ITEM","TABELA","CODIGO","DESCRIÇÃO DOS SERVIÇOS","UNID","QUANT","REPET","QUANT TOTAL","MAT","MO","T.SERVIÇO UNIT","VALOR TOTAL","OBSERVAÇÕES¹"]
[{"$f":"CHOOSE(1+LOG(1+2*(ORÇAMENTO.Nivel=\"Nível 1\")+4*(ORÇAMENTO.Nivel=\"Nível 2\")+8*(ORÇAMENTO.Nivel=\"Nível 3\")+16*(ORÇAMENTO.Nivel=\"Nível 4\")+32*(ORÇAMENTO.Nivel=\"Serviço\"),2),0,1,2,3,4,\"S\")","v":"S"},{"$f":"IF(OR(C17=\"s\",C17=0),OFFSET(B17,-1,0),C17)","v":"Save Nivel"},{"$f":"IF(OFFSET(C17,-1,0)=\"L\",1,IF(OFFSET(C17,-1,0)=1,2,IF(OR(A17=\"s\",A17=0),\"S\",IF(AND(OFFSET(C17,-1,0)=2,A17=4),3,IF(AND(OR(OFFSET(C17,-1,0)=\"s\",OFFSET(C17,-1,0)=0),A17<>\"s\",A17>OFFSET(B17,-1,0)),OFFSET(B17,-1,0),A17)))))","v":"S"},{"$f":"IF(OR(C17=\"S\",C17=0),0,IF(ISERROR(K17),J17,SMALL(J17:K17,1)))","v":0},{"$f":"IF($C17=1,OFFSET(E17,-1,0)+1,OFFSET(E17,-1,0))","v":"n1"},{"$f":"IF($C17=1,0,IF($C17=2,OFFSET(F17,-1,0)+1,OFFSET(F17,-1,0)))","v":"n2"},{"$f":"IF(AND($C17<=2,$C17<>0),0,IF($C17=3,OFFSET(G17,-1,0)+1,OFFSET(G17,-1,0)))","v":"n3"},{"$f":"IF(AND($C17<=3,$C17<>0),0,IF($C17=4,OFFSET(H17,-1,0)+1,OFFSET(H17,-1,0)))","v":"n4"},{"$f":"IF(AND($C17<=4,$C17<>0),0,IF(AND($C17=\"S\",$Y17>0),OFFSET(I17,-1,0)+1,OFFSET(I17,-1,0)))","v":"n5"},{"$f":"IF(OR($C17=\"S\",$C17=0),0,MATCH(0,OFFSET($D17,1,$C17,ROW($C$348)-ROW($C17)),0))","v":0},{"$f":"IF(OR($C17=\"S\",$C17=0),0,MATCH(OFFSET($D17,0,$C17)+1,OFFSET($D17,1,$C17,ROW($C$348)-ROW($C17)),0))","v":0},{"$f":"IF(OR(Y17>0,$C17=1),\"F\",\"\")","v":""},"Serviço",{"$f":"CHOOSE(1+LOG(1+2*(C17=1)+4*(C17=2)+8*(C17=3)+16*(C17=4)+32*(C17=\"S\"),2),\"\",\"Nível 1\",\"Nível 2\",\"Nível 3\",\"Nível 4\",\"Serviço\")","v":"Serviço"},"-","SINAPI",null,"(sem código)","-",null,"REPET","-",0,0,0,"-",""]
[0,null,"L",{"$f":"COUNTA(OFFSET(D18,1,0):D$348)","v":329},{"$f":"LEFT(O19,1)-1","v":0},null,null,null,null,null,null,"F","LOTE","LOTE","REFORMA - ESCOLA ESTADUAL LUIZ ALVES MACHADO",null,null,null,null,null,null,null,null,null,null,0]
[1,{"$f":"IF(OR(C19=\"s\",C19=0),OFFSET(B19,-1,0),C19)","v":1},{"$f":"IF(OFFSET(C19,-1,0)=\"L\",1,IF(OFFSET(C19,-1,0)=1,2,IF(OR(A19=\"s\",A19=0),\"S\",IF(AND(OFFSET(C19,-1,0)=2,A19=4),3,IF(AND(OR(OFFSET(C19,-1,0)=\"s\",OFFSET(C19,-1,0)=0),A19<>\"s\",A19>OFFSET(B19,-1,0)),OFFSET(B19,-1,0),A19)))))","v":1},{"$f":"IF(OR(C19=\"S\",C19=0),0,IF(ISERROR(K19),J19,SMALL(J19:K19,1)))","v":18},{"$f":"IF($C19=1,OFFSET(E19,-1,0)+1,OFFSET(E19,-1,0))","v":1},{"$f":"IF($C19=1,0,IF($C19=2,OFFSET(F19,-1,0)+1,OFFSET(F19,-1,0)))","v":0},{"$f":"IF(AND($C19<=2,$C19<>0),0,IF($C19=3,OFFSET(G19,-1,0)+1,OFFSET(G19,-1,0)))","v":0},{"$f":"IF(AND($C19<=3,$C19<>0),0,IF($C19=4,OFFSET(H19,-1,0)+1,OFFSET(H19,-1,0)))","v":0},0,{"$f":"IF(OR($C19=\"S\",$C19=0),0,MATCH(0,OFFSET($D19,1,$C19,ROW($C$348)-ROW($C19)),0))","v":329},{"$f":"IF(OR($C19=\"S\",$C19=0),0,MATCH(OFFSET($D19,0,$C19)+1,OFFSET($D19,1,$C19,ROW($C$348)-ROW($C19)),0))","v":18},{"$f":"IF(OR(Y19>0,$C19=1),\"F\",\"\")","v":"F"},"Nível 1",{"$f":"CHOOSE(1+LOG(1+2*(C19=1)+4*(C19=2)+8*(C19=3)+16*(C19=4)+32*(C19=\"S\"),2),\"\",\"Nível 1\",\"Nível 2\",\"Nível 3\",\"Nível 4\",\"Serviço\")","v":"Nível 1"},"1.","AGETOP",null,"1. COZINHA E DESPENSA","UN",1,1,1,null,null,0,0]
[2,2,{"$f":"IF(OFFSET(C20,-1,0)=\"L\",1,IF(OFFSET(C20,-1,0)=1,2,IF(OR(A20=\"s\",A20=0),\"S\",IF(AND(OFFSET(C20,-1,0)=2,A20=4),3,IF(AND(OR(OFFSET(C20,-1,0)=\"s\",OFFSET(C20,-1,0)=0),A20<>\"s\",A20>OFFSET(B20,-1,0)),OFFSET(B20,-1,0),A20)))))","v":2},3,{"$f":"IF($C20=1,OFFSET(E20,-1,0)+1,OFFSET(E20,-1,0))","v":1},{"$f":"IF($C20=1,0,IF($C20=2,OFFSET(F20,-1,0)+1,OFFSET(F20,-1,0)))","v":1},{"$f":"IF(AND($C20<=2,$C20<>0),0,IF($C20=3,OFFSET(G20,-1,0)+1,OFFSET(G20,-1,0)))","v":0},{"$f":"IF(AND($C20<=3,$C20<>0),0,IF($C20=4,OFFSET(H20,-1,0)+1,OFFSET(H20,-1,0)))","v":0},0,17,3,"","Nível 2","Nível 2","-","SINAPI",null,"SERVIÇOS PRELIMINARES","-",null,1,"-",0,0,0,0,""]
[{"$f":"CHOOSE(1+LOG(1+2*(ORÇAMENTO.Nivel=\"Nível 1\")+4*(ORÇAMENTO.Nivel=\"Nível 2\")+8*(ORÇAMENTO.Nivel=\"Nível 3\")+16*(ORÇAMENTO.Nivel=\"Nível 4\")+32*(ORÇAMENTO.Nivel=\"Serviço\"),2),0,1,2,3,4,\"S\")","v":3},3,3,2,1,1,1,0,0,2,65,"","Nível 3","Nível 3","-","SINAPI",null,"OUTROS","-",null,1,"-",0,0,0,0,""]
["S",3,"S",0,1,1,1,0,0,0,0,"","Serviço","Serviço","-","SINAPI",97622,"DEMOLIÇÃO DE ALVENARIA DE BLOCO FURADO, DE FORMA MANUAL, SEM REAPROVEITAMENTO. AF_12/2017","M3",0.08,1,0.08,null,null,0,0,"Referência: AGETOP - 20118"]
[2,2,2,3,1,2,0,0,{"$f":"IF(AND($C23<=4,$C23<>0),0,IF(AND($C23=\"S\",$Y23>0),OFFSET(I23,-1,0)+1,OFFSET(I23,-1,0)))","v":0},14,3,{"$f":"IF(OR(Y23>0,$C23=1),\"F\",\"\")","v":""},"Nível 2",{"$f":"CHOOSE(1+LOG(1+2*(C23=1)+4*(C23=2)+8*(C23=3)+16*(C23=4)+32*(C23=\"S\"),2),\"\",\"Nível 1\",\"Nível 2\",\"Nível 3\",\"Nível 4\",\"Serviço\")","v":"Nível 2"},"-","AGETOP",null,"TRANSPORTES","-",null,1,"-",null,null,0,0,""]
["S",2,"S",0,1,2,0,0,0,0,0,"","Serviço","Serviço","-","SINAPI",72900,"TRANSPORTE DE ENTULHO COM CAMINHAO BASCULANTE 6 M3, RODOVIA PAVIMENTADA, DMT 0,5 A 1,0 KM","M3",0.08,1,0.08,null,null,0,0,""]
["S",2,"S",0,1,2,0,0,0,0,0,"","Serviço","Serviço","-","SINAPI",72897,"CARGA MANUAL DE ENTULHO EM CAMINHAO BASCULANTE 6 M3","M3",0.08,1,0.08,null,null,0,0,""]
[2,2,2,2,1,3,0,0,0,11,2,"","Nível 2","Nível 2","-","SINAPI",null,"ESQUADRIAS METÁLICAS","-",null,1,"-",null,null,0,0,""]
["S",2,"S",0,1,3,0,0,0,0,0,"","Serviço","Serviço","-","AGETOP",180381,"ESQ. MAXIMO AR CHAPA/VIDRO J3/J5/J6/J8 C/FERRAGENS","m2    ",0.5,1,0.5,null,null,0,0,""]
[2,2,2,2,1,4,0,0,0,9,2,"","Nível 2","Nível 2","-","SINAPI",null,"VIDROS","-",null,1,"-",null,null,0,0,""]
["S",2,"S",0,1,4,0,0,0,0,0,"","Serviço","Serviço","-","SINAPI",72117,"VIDRO LISO COMUM TRANSPARENTE, ESPESSURA 4MM","M2",0.5,1,0.5,null,null,0,0,"Referência: AGETOP - 190102"]
[2,2,2,4,1,5,0,0,0,7,4,"","Nível 2","Nível 2","-","SINAPI",null,"DIVERSOS","-",null,1,"-",null,null,0,0,""]
["S",2,"S",0,1,5,0,0,0,0,0,"","Serviço","Serviço","-","COMPOSIÇÃO","COMP 027_SEE","TELA MOSQUITEIRA EM NYLON COM ESTRUTURA DE ALUMÍNIO, COM FORNECIMENTO DE MÃO DE OBRA E INSTALAÇÃO","M2",10.4,1,10.4,null,null,0,0,""]
["S",2,"S",0,1,5,0,0,0,0,0,"","Serviço","Serviço","-","COMPOSIÇÃO","COMP 575_SEE","MOLA AEREA FECHA PORTA, PARA PORTAS COM LARGURA ATE 95 CM","UN ",2,1,2,null,null,0,0,""]
["S",2,"S",0,1,5,0,0,{"$f":"IF(AND($C33<=4,$C33<>0),0,IF(AND($C33=\"S\",$Y33>0),OFFSET(I33,-1,0)+1,OFFSET(I33,-1,0)))","v":0},0,0,{"$f":"IF(OR(Y33>0,$C33=1),\"F\",\"\")","v":""},"Serviço",{"$f":"CHOOSE(1+LOG(1+2*(C33=1)+4*(C33=2)+8*(C33=3)+16*(C33=4)+32*(C33=\"S\"),2),\"\",\"Nível 1\",\"Nível 2\",\"Nível 3\",\"Nível 4\",\"Serviço\")","v":"Serviço"},"-","AGETOP",240203,"PRATELEIRA MONTANTES EM ALVEN. APARENTE C/PINTURA","m2    ",10,1,10,null,null,0,0,""]
[2,2,2,3,1,6,0,0,0,3,32,"","Nível 2","Nível 2","-","SINAPI",null,"PINTURA","-",null,1,"-",null,null,0,0,""]
[3,3,3,2,1,6,1,0,{"$f":"IF(AND($C35<=4,$C35<>0),0,IF(AND($C35=\"S\",$Y35>0),OFFSET(I35,-1,0)+1,OFFSET(I35,-1,0)))","v":0},2,51,{"$f":"IF(OR(Y35>0,$C35=1),\"F\",\"\")","v":""},"Nível 3",{"$f":"CHOOSE(1+LOG(1+2*(C35=1)+4*(C35=2)+8*(C35=3)+16*(C35=4)+32*(C35=\"S\"),2),\"\",\"Nível 1\",\"Nível 2\",\"Nível 3\",\"Nível 4\",\"Serviço\")","v":"Nível 3"},"-","SINAPI",null,"ESQUADRIAS NOVAS","-",null,1,"-",null,null,0,0,""]
["S",3,"S",0,1,6,1,0,0,0,0,"","Serviço","Serviço","-","AGETOP",261602,"PINT.ESMALTE/ESQUAD.FERRO C/FUNDO ANTICOR.","m2    ",1,1,1,null,null,0,0,""]
[1,1,1,35,2,0,0,0,0,311,35,"F","Nível 1","Nível 1","2.","SINAPI",null,"2. SANITÁRIO FEMININO E MASCULINO","UN",1,1,1,null,null,0,0,""]
[2,2,2,12,2,1,0,0,0,34,12,"","Nível 2","Nível 2","-","SINAPI",null,"SERVIÇOS PRELIMINARES","-",null,1,"-",null,null,0,0,""]
[3,3,3,11,2,1,1,0,0,11,47,"","Nível 3","Nível 3","-","SINAPI",null,"OUTROS","-",null,1,"-",null,null,0,0,""]
["S",3,"S",0,2,1,1,0,0,0,0,"","Serviço","Serviço","-","SINAPI",97622,"DEMOLIÇÃO DE ALVENARIA DE BLOCO FURADO, DE FORMA MANUAL, SEM REAPROVEITAMENTO. AF_12/2017","M3",2.1,1,2.1,null,null,0,0,"Referência: AGETOP - 20118"]
["S",3,"S",0,2,1,1,0,0,0,0,"","Serviço","Serviço","-","SINAPI",97644,"REMOÇÃO DE PORTAS, DE FORMA MANUAL, SEM REAPROVEITAMENTO. AF_12/2017","M2",3.1,1,3.1,null,null,0,0,"Referência: AGETOP - 20106"]
["S",3,"S",0,2,1,1,0,0,0,0,"","Serviço","Serviço","-","AGETOP",20111,"DEM.PISO CERAM.SOBRE LASTRO CONC.C/TR.CB.E CARGA","m2    ",46.81,1,46.81,null,null,0,0,""]
["S",3,"S",0,2,1,1,0,0,0,0,"","Serviço","Serviço","-","SINAPI",97633,"DEMOLIÇÃO DE REVESTIMENTO CERÂMICO, DE FORMA MANUAL, SEM REAPROVEITAMENTO. AF_12/2017","M2",184.62,1,184.62,null,null,0,0,"Referência: AGETOP - 20115"]
["S",3,"S",0,2,1,1,0,0,0,0,"","Serviço","Serviço","-","AGETOP",20137,"DEMOLIÇAO BACIA SANITARIA C/ TRANSP. ATÉ CB. E CARGA","Un    ",10,1,10,null,null,0,0,""]
["S",3,"S",0,2,1,1,0,0,0,0,"","Serviço","Serviço","-","AGETOP",20140,"DEMOLIÇAO DE VÁLVULA DE DESCARGA C/ TRANSP. ATÉ CB. E CARGA","Un    ",2,1,2,null,null,0,0,""]
["S",3,"S",0,2,1,1,0,{"$f":"IF(AND($C46<=4,$C46<>0),0,IF(AND($C46=\"S\",$Y46>0),OFFSET(I46,-1,0)+1,OFFSET(I46,-1,0)))","v":0},0,0,{"$f":"IF(OR(Y46>0,$C46=1),\"F\",\"\")","v":""},"Serviço",{"$f":"CHOOSE(1+LOG(1+2*(C46=1)+4*(C46=2)+8*(C46=3)+16*(C46=4)+32*(C46=\"S\"),2),\"\",\"Nível 1\",\"Nível 2\",\"Nível 3\",\"Nível 4\",\"Serviço\")","v":"Serviço"},"-","AGETOP",20138,"DEMOLIÇAO DE LAVATÓRIO C/ TRANSP. ATÉ CB. E CARGA","Un    ",2,1,2,null,null,0,0,""]
["S",3,"S",0,2,1,1,0,0,0,0,"","Serviço","Serviço","-","SINAPI",88242,"AJUDANTE DE PEDREIRO COM ENCARGOS COMPLEMENTARES","H",1.33,1,1.33,null,null,0,0,""]
["S",3,"S",0,2,1,1,0,0,0,0,"","Serviço","Serviço","-","AGETOP",20163,"DEMOLIÇÃO DAS INSTALAÇÕES HIDROSANITÁRIAS E AFINS C/ TRANSP. ATÉ CB. E CARGA","H     ",1.83,1,1.83,null,null,0,0,""]
["S",3,"S",0,2,1,1,0,0,0,0,"","Serviço","Serviço","-","AGETOP",20139,"DEMOLIÇAO DE BANCADAS C/ TRANSP. ATÉ CB. E CARGA","m2    ",1.1399999999999999,1,1.1399999999999999,null,null,0,0,""]
[2,2,2,3,2,2,0,0,0,22,3,"","Nível 2","Nível 2","-","AGETOP",null,"TRANSPORTES","-",null,1,"-",null,null,0,0,""]
["S",2,"S",0,2,2,0,0,0,{"$f":"IF(OR($C51=\"S\",$C51=0),0,MATCH(0,OFFSET($D51,1,$C51,ROW($C$348)-ROW($C51)),0))","v":0},{"$f":"IF(OR($C51=\"S\",$C51=0),0,MATCH(OFFSET($D51,0,$C51)+1,OFFSET($D51,1,$C51,ROW($C$348)-ROW($C51)),0))","v":0},"","Serviço","Serviço","-","SINAPI",72900,"TRANSPORTE DE ENTULHO COM CAMINHAO BASCULANTE 6 M3, RODOVIA PAVIMENTADA, DMT 0,5 A 1,0 KM","M3",27.833000000000002,1,27.833000000000002,null,null,0,0,""]
["S",2,"S",0,2,2,0,0,0,0,0,"","Serviço","Serviço","-","SINAPI",72897,"CARGA MANUAL DE ENTULHO EM CAMINHAO BASCULANTE 6 M3","M3",27.833000000000002,1,27.833000000000002,null,null,0,0,""]
[2,2,2,2,2,3,0,0,0,19,2,"","Nível 2","Nível 2","-","SINAPI",null,"ALVENARIAS E DIVISÓRIAS","-",null,1,"-",null,null,0,0,""]
["S",2,"S",0,2,3,0,0,0,0,0,"","Serviço","Serviço","-","AGETOP",100201,"ALVENARIA DE TIJOLO FURADO 1/2 VEZ - 9 x 19 x 19 - ARG. (1CALH:4ARML+100KG DE CI/M3)","m2    ",12.6,1,12.6,null,null,0,0,""]
[2,2,2,4,2,4,0,0,0,17,4,"","Nível 2","Nível 2","-","SINAPI",null,"REVESTIMENTO DE PAREDE","-",null,1,"-",null,null,0,0,""]
["S",2,"S",0,2,4,0,0,0,0,0,"","Serviço","Serviço","-","SINAPI",87904,"CHAPISCO APLICADO EM ALVENARIA (COM PRESENÇA DE VÃOS) E ESTRUTURAS DE CONCRETO DE FACHADA, COM COLHER DE PEDREIRO.  ARGAMASSA TRAÇO 1:3 COM PREPARO MANUAL. AF_06/2014","M2",25.2,1,25.2,null,null,0,0,"Referência: AGETOP - 200101"]
["S",2,"S",0,2,4,0,0,0,0,0,"","Serviço","Serviço","-","SINAPI",87553,"EMBOÇO, PARA RECEBIMENTO DE CERÂMICA, EM ARGAMASSA TRAÇO 1:2:8, PREPARO MECÂNICO COM BETONEIRA 400L, APLICADO MANUALMENTE EM FACES INTERNAS DE PAREDES, PARA AMBIENTE COM ÁREA MAIOR QUE 10M2, ESPESSURA DE 10MM, COM EXECUÇÃO DE TALISCAS. AF_06/2014","M2",25.2,1,25.2,null,null,0,0,""]
["S",2,"S",0,2,4,0,0,0,0,0,"","Serviço","Serviço","-","SINAPI",87273,"REVESTIMENTO CERÂMICO PARA PAREDES INTERNAS COM PLACAS TIPO ESMALTADA EXTRA DE DIMENSÕES 33X45 CM APLICADAS EM AMBIENTES DE ÁREA MAIOR QUE 5 M² NA ALTURA INTEIRA DAS PAREDES. AF_06/2014","M2",205.95,1,205.95,null,null,0,0,""]
[2,2,2,4,2,5,0,0,0,13,4,"","Nível 2","Nível 2","-","SINAPI",null,"ESQUADRIAS METÁLICAS","-",null,1,"-",null,null,0,0,""]
["S",2,"S",0,2,5,0,0,0,0,0,"","Serviço","Serviço","-","AGETOP",230174,"BARRA DE APOIO EM AÇO INOX - 40 CM","un    ",8,1,8,null,null,0,0,""]
["S",2,"S",0,2,5,0,0,0,0,0,"","Serviço","Serviço","-","AGETOP",230176,"BARRA DE APOIO EM AÇO INOX - 80 CM ","un    ",6,1,6,null,null,0,0,""]
["S",2,"S",0,2,5,0,0,0,0,0,"","Serviço","Serviço","-","AGETOP",180501,"PORTA DE ABRIR EM CHAPA PF-1 C/FERRAGENS","m2    ",3.78,1,3.78,null,null,0,0,""]
[2,2,2,3,2,6,0,0,0,9,3,"","Nível 2","Nível 2","-","SINAPI",null,"PINTURA","-",null,1,"-",null,null,0,0,""]
[3,3,3,2,2,6,1,0,0,2,22,"","Nível 3","Nível 3","-","SINAPI",null,"ESQUADRIAS NOVAS","-",null,1,"-",null,null,0,0,""]
["S",3,"S",0,2,6,1,0,0,0,0,"","Serviço","Serviço","-","AGETOP",261602,"PINT.ESMALTE/ESQUAD.FERRO C/FUNDO ANTICOR.","m2    ",11.34,1,11.34,null,null,0,0,""]
[2,2,2,4,2,7,0,0,0,6,4,"","Nível 2","Nível 2","-","SINAPI",null,"REVESTIMENTO DE PISO","-",null,1,"-",null,null,0,0,""]
[3,3,3,3,2,7,1,0,0,3,19,"","Nível 3","Nível 3","-","SINAPI",null,"GRANITINA","-",null,1,"-",null,null,0,0,""]
["S",3,"S",0,2,7,1,0,0,0,0,"","Serviço","Serviço","-","SINAPI",84191,"PISO EM GRANILITE, MARMORITE OU GRANITINA ESPESSURA 8 MM, INCLUSO JUNTAS DE DILATACAO PLASTICAS","M2",43.4,1,43.4,null,null,0,0,"Referência: AGETOP - 221101"]
["S",3,"S",0,2,7,1,0,0,0,0,"","Serviço","Serviço","-","AGETOP",221104,"RASPAGEM E APLICAÇÃO RESINA ACRÍLICA DUAS DEMÃOS","m2    ",43.4,1,43.4,null,null,0,0,""]
[2,2,2,2,2,8,0,0,0,2,{"$error":"#N/A"},"","Nível 2","Nível 2","-","SINAPI",null,"DIVERSOS","-",null,1,"-",null,null,0,0,""]
["S",2,"S",0,2,8,0,0,0,0,0,"","Serviço","Serviço","-","AGETOP",271608,"BANCADA DE GRANITO C/ESPELHO","m2    ",1.2,1,1.2,null,null,0,0,""]
[1,1,1,21,3,0,0,0,0,276,21,"F","Nível 1","Nível 1","3.","SINAPI",null,"3. COBERTURA","UN",1,1,1,null,null,0,0,""]
[2,2,2,4,3,1,0,0,0,20,4,"","Nível 2","Nível 2","-","SINAPI",null,"SERVIÇOS PRELIMINARES","-",1,1,1,null,null,0,0,""]
[3,3,3,3,3,1,1,0,0,3,12,"","Nível 3","Nível 3","-","SINAPI",null,"OUTROS","-",null,1,"-",null,null,0,0,""]
["S",3,"S",0,3,1,1,0,0,0,0,"","Serviço","Serviço","-","AGETOP",20101,"DEMOLICAO COBERTURA TELHA CERAMICA C/ TRANSP. ATÉ CB. E CARGA","m2    ",618.70000000000005,1,618.70000000000005,null,null,0,0,""]
["S",3,"S",0,3,1,1,0,0,0,0,"","Serviço","Serviço","-","AGETOP",20103,"DEMOLIÇÃO ESTRUTURA EM MADEIRA TELHADO C/ TRANSP. ATÉ CB. E CARGA","m2    ",648.1,1,648.1,null,null,0,0,""]
[2,2,2,3,3,2,0,0,0,16,3,"","Nível 2","Nível 2","-","AGETOP",null,"TRANSPORTES","-",null,1,"-",null,null,0,0,""]
["S",2,"S",0,3,2,0,0,0,0,0,"","Serviço","Serviço","-","SINAPI",72900,"TRANSPORTE DE ENTULHO COM CAMINHAO BASCULANTE 6 M3, RODOVIA PAVIMENTADA, DMT 0,5 A 1,0 KM","M3",63.34,1,63.34,null,null,0,0,""]
["S",2,"S",0,3,2,0,0,0,0,0,"","Serviço","Serviço","-","SINAPI",72897,"CARGA MANUAL DE ENTULHO EM CAMINHAO BASCULANTE 6 M3","M3",63.34,1,63.34,null,null,0,0,""]
[2,2,2,8,3,3,0,0,0,13,8,"","Nível 2","Nível 2","-","SINAPI",null,"COBERTURAS","-",null,1,"-",null,null,0,0,""]
[3,3,3,5,3,3,1,0,0,7,5,"","Nível 3","Nível 3","-","SINAPI",null,"CERÂMICA","-",null,1,"-",null,null,0,0,""]
["S",3,"S",0,3,3,1,0,0,0,0,"","Serviço","Serviço","-","SINAPI",94445,"TELHAMENTO COM TELHA CERÂMICA CAPA-CANAL, TIPO PLAN, COM ATÉ 2 ÁGUAS, INCLUSO TRANSPORTE VERTICAL. AF_07/2019","M2",618.70000000000005,1,618.70000000000005,null,null,0,0,"Referência: AGETOP - 160401"]
["S",3,"S",0,3,3,1,0,0,{"$f":"IF(OR($C83=\"S\",$C83=0),0,MATCH(0,OFFSET($D83,1,$C83,ROW($C$348)-ROW($C83)),0))","v":0},{"$f":"IF(OR($C83=\"S\",$C83=0),0,MATCH(OFFSET($D83,0,$C83)+1,OFFSET($D83,1,$C83,ROW($C$348)-ROW($C83)),0))","v":0},"","Serviço","Serviço","-","AGETOP",160403,"EMBOCAMENTO LATERAL  (OITOES)","m     ",174.4,1,174.4,null,null,0,0,""]
["S",3,"S",0,3,3,1,0,0,0,0,"","Serviço","Serviço","-","AGETOP",160404,"EMBOCAMENTO DE BEIRAL","M     ",45.44,1,45.44,null,null,0,0,""]
["S",3,"S",0,3,3,1,0,0,0,0,"","Serviço","Serviço","-","SINAPI",94221,"CUMEEIRA PARA TELHA CERÂMICA EMBOÇADA COM ARGAMASSA TRAÇO 1:2:9 (CIMENTO, CAL E AREIA) PARA TELHADOS COM ATÉ 2 ÁGUAS, INCLUSO TRANSPORTE VERTICAL. AF_07/2019","M",87.2,1,87.2,null,null,0,0,""]
[3,3,3,2,3,3,2,0,0,2,18,"","Nível 3","Nível 3","-","SINAPI",null,"REAPROVEITAMENTO","-",null,1,"-",null,null,0,0,""]
["S",3,"S",0,3,3,2,0,0,0,0,"","Serviço","Serviço","-","AGETOP",160421,"MAO DE OBRA PARA COBERTURA C/TELHA COLONIAL PLAN","m2    ",588,1,588,null,null,0,0,""]
[2,2,2,3,3,4,0,0,0,5,3,"","Nível 2","Nível 2","-","SINAPI",null,"PINTURA","-",null,1,"-",null,null,0,0,""]
[3,3,3,2,3,4,1,0,0,2,11,"","Nível 3","Nível 3","-","SINAPI",null,"ESTRUTURA METÁLICA","-",null,1,"-",null,null,0,0,""]
["S",3,"S",0,3,4,1,0,0,0,0,"","Serviço","Serviço","-","AGETOP",261609,"PINTURA ESMALTE ALQUIDICO ESTR.METALICA 2 DEMAOS","m2    ",618.70000000000005,1,618.70000000000005,null,null,0,0,""]
[2,2,2,2,3,5,0,0,0,2,{"$error":"#N/A"},"","Nível 2","Nível 2","-","SINAPI",null,"ESTRUTURA DE MADEIRA","-",null,1,"-",null,null,0,0,""]
["S",2,"S",0,3,5,0,0,0,0,0,"","Serviço","Serviço","-","AGETOP",140205,"RIPAMENTO DE MADEIRA","m2    ",29.4,1,29.4,null,null,0,0,""]
[1,1,1,3,4,0,0,0,0,255,3,"F","Nível 1","Nível 1","4.","SINAPI",null,"PROJETO DE ESTRUTURAS METÁLICAS","UN",1,1,1,null,null,0,0,""]
[2,2,2,2,4,1,0,0,0,2,24,"","Nível 2","Nível 2","-","SINAPI",null,"ESTRUTURAS METÁLICAS","-",null,1,"-",null,null,0,0,""]
["S",2,"S",0,4,1,0,0,0,0,0,"","Serviço","Serviço","-","AGETOP",150204,"ESTRUTURA METÁLICA CONVENCIONAL EM AÇO DO TIPO MR-250 / ASTM A36 COM FUNDO ANTICORROSIVO","Kg    ",9872,1,9872,null,null,0,0,""]
[{"$f":"CHOOSE(1+LOG(1+2*(ORÇAMENTO.Nivel=\"Nível 1\")+4*(ORÇAMENTO.Nivel=\"Nível 2\")+8*(ORÇAMENTO.Nivel=\"Nível 3\")+16*(ORÇAMENTO.Nivel=\"Nível 4\")+32*(ORÇAMENTO.Nivel=\"Serviço\"),2),0,1,2,3,4,\"S\")","v":1},{"$f":"IF(OR(C96=\"s\",C96=0),OFFSET(B96,-1,0),C96)","v":1},{"$f":"IF(OFFSET(C96,-1,0)=\"L\",1,IF(OFFSET(C96,-1,0)=1,2,IF(OR(A96=\"s\",A96=0),\"S\",IF(AND(OFFSET(C96,-1,0)=2,A96=4),3,IF(AND(OR(OFFSET(C96,-1,0)=\"s\",OFFSET(C96,-1,0)=0),A96<>\"s\",A96>OFFSET(B96,-1,0)),OFFSET(B96,-1,0),A96)))))","v":1},{"$f":"IF(OR(C96=\"S\",C96=0),0,IF(ISERROR(K96),J96,SMALL(J96:K96,1)))","v":17},{"$f":"IF($C96=1,OFFSET(E96,-1,0)+1,OFFSET(E96,-1,0))","v":5},{"$f":"IF($C96=1,0,IF($C96=2,OFFSET(F96,-1,0)+1,OFFSET(F96,-1,0)))","v":0},{"$f":"IF(AND($C96<=2,$C96<>0),0,IF($C96=3,OFFSET(G96,-1,0)+1,OFFSET(G96,-1,0)))","v":0},{"$f":"IF(AND($C96<=3,$C96<>0),0,IF($C96=4,OFFSET(H96,-1,0)+1,OFFSET(H96,-1,0)))","v":0},0,252,17,"F","Nível 1","Nível 1","5.","SINAPI",null,"4. PINTURA GERAL","UN",1,1,1,null,null,0,0,""]
[2,2,2,16,5,1,0,0,0,16,21,"","Nível 2","Nível 2","-",null,null,"PINTURA","-",null,1,"-",null,null,0,0,""]
[3,3,3,2,5,1,1,0,0,15,2,"","Nível 3","Nível 3","-",null,null,"ESMALTE SINTÉTICO","-",null,1,"-",null,null,0,0,""]
["S",3,"S",0,5,1,1,0,0,0,0,"","Serviço","Serviço","-","AGETOP",261550,"PINT.ESMALTE SINT.PAREDES - 2 DEM.C/SELADOR","m2    ",656.31,1,656.31,null,null,0,0,""]
[3,3,3,4,5,1,2,0,0,13,4,"","Nível 3","Nível 3","-","AGETOP",null,"LÁTEX ACRÍLICA","-",null,1,"-",null,null,0,0,""]
["S",3,"S",0,5,1,2,0,0,0,0,"","Serviço","Serviço","-","AGETOP",260104,"REMOCAO DE PINTURA ANTIGA A LATEX","m2    ",374.23,1,374.23,null,null,0,0,""]
["S",3,"S",0,5,1,2,0,0,0,0,"","Serviço","Serviço","-","SINAPI",88497,"APLICAÇÃO E LIXAMENTO DE MASSA LÁTEX EM PAREDES, DUAS DEMÃOS. AF_06/2014","M2",374.23,1,374.23,null,null,0,0,"Referência: AGETOP - 261300"]
["S",3,"S",0,5,1,2,0,0,0,0,"","Serviço","Serviço","-","SINAPI",88489,"APLICAÇÃO MANUAL DE PINTURA COM TINTA LÁTEX ACRÍLICA EM PAREDES, DUAS DEMÃOS. AF_06/2014","M2",518.3599999999999,1,518.3599999999999,null,null,0,0,"Referência: AGETOP - 261001"]
[3,3,3,4,5,1,3,0,0,9,4,"","Nível 3","Nível 3","-","AGETOP",null,"TETO","-",null,1,"-",null,null,0,0,""]
["S",3,"S",0,5,1,3,0,0,0,0,"","Serviço","Serviço","-","AGETOP",260104,"REMOCAO DE PINTURA ANTIGA A LATEX","m2    ",200,1,200,null,null,0,0,""]
["S",3,"S",0,5,1,3,0,0,0,0,"","Serviço","Serviço","-","SINAPI",88496,"APLICAÇÃO E LIXAMENTO DE MASSA LÁTEX EM TETO, DUAS DEMÃOS. AF_06/2014","M2",200,1,200,null,null,0,0,"Referência: AGETOP - 261300"]
["S",3,"S",0,5,1,3,0,0,0,0,"","Serviço","Serviço","-","SINAPI",88486,"APLICAÇÃO MANUAL DE PINTURA COM TINTA LÁTEX PVA EM TETO, DUAS DEMÃOS. AF_06/2014","M2",482,1,482,null,null,0,0,"Referência: AGETOP - 261307"]
[3,3,3,2,5,1,4,0,0,5,2,"","Nível 3","Nível 3","-","SINAPI",null,"EXTERNA","-",null,1,"-",null,null,0,0,""]
["S",3,"S",0,5,1,4,0,0,0,0,"","Serviço","Serviço","-","AGETOP",261000,"PINTURA LATEX ACRILICA 2 DEMAOS C/SELADOR","m2    ",119,1,119,null,null,0,0,""]
[3,3,3,3,5,1,5,0,0,{"$f":"IF(OR($C110=\"S\",$C110=0),0,MATCH(0,OFFSET($D110,1,$C110,ROW($C$348)-ROW($C110)),0))","v":3},{"$f":"IF(OR($C110=\"S\",$C110=0),0,MATCH(OFFSET($D110,0,$C110)+1,OFFSET($D110,1,$C110,ROW($C$348)-ROW($C110)),0))","v":{"$error":"#N/A"}},"","Nível 3","Nível 3","-","AGETOP",null,"ESQUADRIAS EXISTENTES","-",null,1,"-",null,null,0,0,""]
["S",3,"S",0,5,1,5,0,0,0,0,"","Serviço","Serviço","-","AGETOP",260105,"REMOCAO DE PINTURA ANTIGA A OLEO OU ESMALTE","m2    ",152,1,152,null,null,0,0,""]
["S",3,"S",0,5,1,5,0,0,0,0,"","Serviço","Serviço","-","AGETOP",261602,"PINT.ESMALTE/ESQUAD.FERRO C/FUNDO ANTICOR.","m2    ",152,1,152,null,null,0,0,""]
[{"$f":"CHOOSE(1+LOG(1+2*(ORÇAMENTO.Nivel=\"Nível 1\")+4*(ORÇAMENTO.Nivel=\"Nível 2\")+8*(ORÇAMENTO.Nivel=\"Nível 3\")+16*(ORÇAMENTO.Nivel=\"Nível 4\")+32*(ORÇAMENTO.Nivel=\"Serviço\"),2),0,1,2,3,4,\"S\")","v":1},{"$f":"IF(OR(C113=\"s\",C113=0),OFFSET(B113,-1,0),C113)","v":1},{"$f":"IF(OFFSET(C113,-1,0)=\"L\",1,IF(OFFSET(C113,-1,0)=1,2,IF(OR(A113=\"s\",A113=0),\"S\",IF(AND(OFFSET(C113,-1,0)=2,A113=4),3,IF(AND(OR(OFFSET(C113,-1,0)=\"s\",OFFSET(C113,-1,0)=0),A113<>\"s\",A113>OFFSET(B113,-1,0)),OFFSET(B113,-1,0),A113)))))","v":1},{"$f":"IF(OR(C113=\"S\",C113=0),0,IF(ISERROR(K113),J113,SMALL(J113:K113,1)))","v":15},{"$f":"IF($C113=1,OFFSET(E113,-1,0)+1,OFFSET(E113,-1,0))","v":6},{"$f":"IF($C113=1,0,IF($C113=2,OFFSET(F113,-1,0)+1,OFFSET(F113,-1,0)))","v":0},{"$f":"IF(AND($C113<=2,$C113<>0),0,IF($C113=3,OFFSET(G113,-1,0)+1,OFFSET(G113,-1,0)))","v":0},{"$f":"IF(AND($C113<=3,$C113<>0),0,IF($C113=4,OFFSET(H113,-1,0)+1,OFFSET(H113,-1,0)))","v":0},{"$f":"IF(AND($C113<=4,$C113<>0),0,IF(AND($C113=\"S\",$Y113>0),OFFSET(I113,-1,0)+1,OFFSET(I113,-1,0)))","v":0},235,15,{"$f":"IF(OR(Y113>0,$C113=1),\"F\",\"\")","v":"F"},"Nível 1",{"$f":"CHOOSE(1+LOG(1+2*(C113=1)+4*(C113=2)+8*(C113=3)+16*(C113=4)+32*(C113=\"S\"),2),\"\",\"Nível 1\",\"Nível 2\",\"Nível 3\",\"Nível 4\",\"Serviço\")","v":"Nível 1"},"6.","SINAPI",null,"5. CENTRAL DE GÁS","UN",1,1,1,null,null,0,0,""]
[2,2,2,4,6,1,0,0,0,14,4,"","Nível 2","Nível 2","-","SINAPI",null,"SERVIÇOS PRELIMINARES","-",null,1,"-",null,null,0,0,""]
[3,3,3,3,6,1,1,0,0,3,59,"","Nível 3","Nível 3","-","SINAPI",null,"OUTROS","-",null,1,"-",null,null,0,0,""]
["S",3,"S",0,6,1,1,0,0,0,0,"","Serviço","Serviço","-","SINAPI",97622,"DEMOLIÇÃO DE ALVENARIA DE BLOCO FURADO, DE FORMA MANUAL, SEM REAPROVEITAMENTO. AF_12/2017","M3",1.33,1,1.33,null,null,0,0,"Referência: AGETOP - 20118"]
["S",3,"S",0,6,1,1,0,0,0,0,"","Serviço","Serviço","-","SINAPI",97644,"REMOÇÃO DE PORTAS, DE FORMA MANUAL, SEM REAPROVEITAMENTO. AF_12/2017","M2",1.44,1,1.44,null,null,0,0,"Referência: AGETOP - 20106"]
[2,2,2,3,6,2,0,0,0,10,3,"","Nível 2","Nível 2","-","AGETOP",null,"TRANSPORTES","-",null,1,"-",null,null,0,0,""]
["S",2,"S",0,6,2,0,0,0,0,0,"","Serviço","Serviço","-","SINAPI",72900,"TRANSPORTE DE ENTULHO COM CAMINHAO BASCULANTE 6 M3, RODOVIA PAVIMENTADA, DMT 0,5 A 1,0 KM","M3",1.4,1,1.4,null,null,0,0,""]
["S",2,"S",0,6,2,0,0,0,0,0,"","Serviço","Serviço","-","SINAPI",72897,"CARGA MANUAL DE ENTULHO EM CAMINHAO BASCULANTE 6 M3","M3",1.4,1,1.4,null,null,0,0,""]
[2,2,2,4,6,3,0,0,0,7,4,"","Nível 2","Nível 2","-","SINAPI",null,"SERVIÇO EM TERRA","-",null,1,"-",null,null,0,0,""]
[3,3,3,3,6,3,1,0,0,3,52,"","Nível 3","Nível 3","-","SINAPI",null,"OUTROS","-",null,1,"-",null,null,0,0,""]
["S",3,"S",0,6,3,1,0,0,0,0,"","Serviço","Serviço","-","AGETOP",41140,"REGULARIZAÇÃO DO TERRENO SEM APILOAMENTO COM TRANSPORTE MANUAL DA TERRA ESCAVADA ","m2    ",31.25,1,31.25,null,null,0,0,""]
["S",3,"S",0,6,3,1,0,0,0,0,"","Serviço","Serviço","-","AGETOP",41009,"COMPACTAÇÃO MECÂNICA SEM CONTROLE LABORATÓRIO","m3    ",31.25,1,31.25,null,null,0,0,""]
[2,2,2,3,6,4,0,0,0,3,{"$error":"#N/A"},"","Nível 2","Nível 2","-","SINAPI",null,"REVESTIMENTO DE PISO","-",null,1,"-",null,null,0,0,""]
[3,3,3,2,6,4,1,0,0,2,48,"","Nível 3","Nível 3","-","SINAPI",null,"CONCRETO","-",null,1,"-",null,null,0,0,""]
["S",3,"S",0,6,4,1,0,0,0,0,"","Serviço","Serviço","-","AGETOP",220102,"PISO CONCRETO DESEMPENADO ESPESSURA = 5 CM  1:2,5:3,5","m2    ",31.25,1,31.25,null,null,0,0,""]
[{"$f":"CHOOSE(1+LOG(1+2*(ORÇAMENTO.Nivel=\"Nível 1\")+4*(ORÇAMENTO.Nivel=\"Nível 2\")+8*(ORÇAMENTO.Nivel=\"Nível 3\")+16*(ORÇAMENTO.Nivel=\"Nível 4\")+32*(ORÇAMENTO.Nivel=\"Serviço\"),2),0,1,2,3,4,\"S\")","v":1},{"$f":"IF(OR(C128=\"s\",C128=0),OFFSET(B128,-1,0),C128)","v":1},{"$f":"IF(OFFSET(C128,-1,0)=\"L\",1,IF(OFFSET(C128,-1,0)=1,2,IF(OR(A128=\"s\",A128=0),\"S\",IF(AND(OFFSET(C128,-1,0)=2,A128=4),3,IF(AND(OR(OFFSET(C128,-1,0)=\"s\",OFFSET(C128,-1,0)=0),A128<>\"s\",A128>OFFSET(B128,-1,0)),OFFSET(B128,-1,0),A128)))))","v":1},{"$f":"IF(OR(C128=\"S\",C128=0),0,IF(ISERROR(K128),J128,SMALL(J128:K128,1)))","v":8},{"$f":"IF($C128=1,OFFSET(E128,-1,0)+1,OFFSET(E128,-1,0))","v":7},{"$f":"IF($C128=1,0,IF($C128=2,OFFSET(F128,-1,0)+1,OFFSET(F128,-1,0)))","v":0},{"$f":"IF(AND($C128<=2,$C128<>0),0,IF($C128=3,OFFSET(G128,-1,0)+1,OFFSET(G128,-1,0)))","v":0},{"$f":"IF(AND($C128<=3,$C128<>0),0,IF($C128=4,OFFSET(H128,-1,0)+1,OFFSET(H128,-1,0)))","v":0},0,220,8,"F","Nível 1","Nível 1","7.","SINAPI",null,"6 . BLOCO 01","UN",1,1,1,null,null,0,0,""]
[2,2,2,4,7,1,0,0,0,7,4,"","Nível 2","Nível 2","-","SINAPI",null,"SERVIÇO EM TERRA","-",null,1,"-",null,null,0,0,""]
[3,3,3,3,7,1,1,0,0,3,44,"","Nível 3","Nível 3","-","SINAPI",null,"OUTROS","-",null,1,"-",null,null,0,0,""]
["S",3,"S",0,7,1,1,0,0,0,0,"","Serviço","Serviço","-","AGETOP",41140,"REGULARIZAÇÃO DO TERRENO SEM APILOAMENTO COM TRANSPORTE MANUAL DA TERRA ESCAVADA ","m2    ",22.69,1,22.69,null,null,0,0,""]
["S",3,"S",0,7,1,1,0,0,0,0,"","Serviço","Serviço","-","AGETOP",41009,"COMPACTAÇÃO MECÂNICA SEM CONTROLE LABORATÓRIO","m3    ",22.69,1,22.69,null,null,0,0,""]
[2,2,2,3,7,2,0,0,0,3,10,"","Nível 2","Nível 2","-","SINAPI",null,"REVESTIMENTO DE PISO","-",null,1,"-",null,null,0,0,""]
[3,3,3,2,7,2,1,0,0,2,40,"","Nível 3","Nível 3","-","SINAPI",null,"CONCRETO","-",null,1,"-",null,null,0,0,""]
["S",3,"S",0,7,2,1,0,0,0,0,"","Serviço","Serviço","-","AGETOP",220100,"PASSEIO PROTECAO EM CONC.DESEMPEN.5 CM 1:2,5:3,5 ( INCLUSO ESPELHO DE 30CM/ESCAVAÇÃO/REATERRO/APILOAMENTO/ATERRO INTERNO)","m2    ",22.69,1,22.69,null,null,0,0,""]
[1,1,1,13,8,0,0,0,0,212,13,"F","Nível 1","Nível 1","8.","SINAPI",null,"7. CALÇADAS, CIRCULAÇÃO PRINCIPAL E RECEPÇÃO","UN",1,1,1,null,null,0,0,""]
[2,2,2,3,8,1,0,0,0,12,3,"","Nível 2","Nível 2","-","SINAPI",null,"SERVIÇOS PRELIMINARES","-",null,1,"-",null,null,0,0,""]
[3,3,3,2,8,1,1,0,0,2,36,"","Nível 3","Nível 3","-","SINAPI",null,"OUTROS","-",null,1,"-",null,null,0,0,""]
["S",3,"S",0,8,1,1,0,0,0,0,"","Serviço","Serviço","-","AGETOP",20121,"DEM. MANUAL EM CONCR.SIMPLES C/TR.ATE CB.E CARGA (O.C.)","m3    ",1.3,1,1.3,null,null,0,0,""]
[2,2,2,3,8,2,0,0,0,9,3,"","Nível 2","Nível 2","-","AGETOP",null,"TRANSPORTES","-",null,1,"-",null,null,0,0,""]
["S",2,"S",0,8,2,0,0,0,0,0,"","Serviço","Serviço","-","SINAPI",72900,"TRANSPORTE DE ENTULHO COM CAMINHAO BASCULANTE 6 M3, RODOVIA PAVIMENTADA, DMT 0,5 A 1,0 KM","M3",1.3,1,1.3,null,null,0,0,""]
["S",2,"S",0,8,2,0,0,0,{"$f":"IF(OR($C142=\"S\",$C142=0),0,MATCH(0,OFFSET($D142,1,$C142,ROW($C$348)-ROW($C142)),0))","v":0},{"$f":"IF(OR($C142=\"S\",$C142=0),0,MATCH(OFFSET($D142,0,$C142)+1,OFFSET($D142,1,$C142,ROW($C$348)-ROW($C142)),0))","v":0},"","Serviço","Serviço","-","SINAPI",72897,"CARGA MANUAL DE ENTULHO EM CAMINHAO BASCULANTE 6 M3","M3",1.3,1,1.3,null,null,0,0,""]
[2,2,2,3,8,3,0,0,0,6,3,"","Nível 2","Nível 2","-","SINAPI",null,"REVESTIMENTO DE PISO","-",null,1,"-",null,null,0,0,""]
[3,3,3,2,8,3,1,0,{"$f":"IF(AND($C144<=4,$C144<>0),0,IF(AND($C144=\"S\",$Y144>0),OFFSET(I144,-1,0)+1,OFFSET(I144,-1,0)))","v":0},2,30,{"$f":"IF(OR(Y144>0,$C144=1),\"F\",\"\")","v":""},"Nível 3",{"$f":"CHOOSE(1+LOG(1+2*(C144=1)+4*(C144=2)+8*(C144=3)+16*(C144=4)+32*(C144=\"S\"),2),\"\",\"Nível 1\",\"Nível 2\",\"Nível 3\",\"Nível 4\",\"Serviço\")","v":"Nível 3"},"-","SINAPI",null,"PODOTÁTIL","-",null,1,"-",null,null,0,0,""]
["S",3,"S",0,8,3,1,0,0,0,0,"","Serviço","Serviço","-","AGETOP",221126,"PISO DE LADRILHO HIDRÁULICO COLORIDO MODELO TÁTIL ( ALERTA OU DIRECIONAL) SEM LASTRO","m2    ",23.299999999999997,1,23.299999999999997,null,null,0,0,""]
[2,2,2,3,8,4,0,0,0,3,{"$error":"#N/A"},"","Nível 2","Nível 2","-","SINAPI",null,"REVESTIMENTO DE PISO","-",null,1,"-",null,null,0,0,""]
[3,3,3,2,8,4,1,0,0,2,27,"","Nível 3","Nível 3","-","SINAPI",null,"CONCRETO","-",null,1,"-",null,null,0,0,""]
["S",3,"S",0,8,4,1,0,0,0,0,"","Serviço","Serviço","-","AGETOP",220102,"PISO CONCRETO DESEMPENADO ESPESSURA = 5 CM  1:2,5:3,5","m2    ",5.5,1,5.5,null,null,0,0,""]
[1,1,1,83,9,0,0,0,0,199,83,"F","Nível 1","Nível 1","9.","SINAPI",null,"PROJETO HIDROSSANITÁRIO","UN",1,1,1,null,null,0,0,""]
[2,2,2,82,9,1,0,0,0,82,121,"","Nível 2","Nível 2","-","AGETOP",null,"INSTALAÇÕES HIDROSSANITÁRIAS","-",null,1,"-",null,null,0,0,""]
[3,3,3,23,9,1,1,0,0,81,23,"","Nível 3","Nível 3","-","SINAPI",null,"PEÇAS E ACESSÓRIOS","-",null,1,"-",null,null,0,0,""]
[4,4,4,7,9,1,1,1,0,22,7,"","Nível 4","Nível 4","-","SINAPI",null,"VASO SANITÁRIO E ACESSÓRIOS","-",null,1,"-",null,null,0,0,""]
["S",4,"S",0,9,1,1,1,0,0,0,"","Serviço","Serviço","-","AGETOP",80502,"VASO SANITARIO","Un    ",10,1,10,null,null,0,0,""]
["S",4,"S",0,9,1,1,1,0,0,0,"","Serviço","Serviço","-","SINAPI",99635,"VÁLVULA DE DESCARGA METÁLICA, BASE 1 1/2 \", ACABAMENTO METALICO CROMADO - FORNECIMENTO E INSTALAÇÃO. AF_01/2019","UN",2,1,2,null,null,0,0,"Referência: AGETOP - 80515"]
["S",4,"S",0,9,1,1,1,0,0,0,"","Serviço","Serviço","-","AGETOP",80520,"CONJUNTO DE FIXACAO P/VASO SANITARIO (PAR)","CJ    ",10,1,10,null,null,0,0,""]
["S",4,"S",0,9,1,1,1,0,0,0,"","Serviço","Serviço","-","AGETOP",80526,"ASSENTO EM POLIPROPILENO COM SISTEMA DE FECHAMENTO SUAVE PARA VASO SANITÁRIO","Un    ",10,1,10,null,null,0,0,""]
["S",4,"S",0,9,1,1,1,0,0,0,"","Serviço","Serviço","-","AGETOP",80510,"ANEL DE VEDAÇÃO PARA VASO SANITÁRIO","Un    ",10,1,10,null,null,0,0,""]
["S",4,"S",0,9,1,1,1,0,0,0,"","Serviço","Serviço","-","SINAPI",95544,"PAPELEIRA DE PAREDE EM METAL CROMADO SEM TAMPA, INCLUSO FIXAÇÃO. AF_01/2020","UN",2,1,2,null,null,0,0,""]
[4,4,4,8,9,1,1,2,0,15,8,"","Nível 4","Nível 4","-","SINAPI",null,"LAVATÓRIO E ACESSÓRIOS","-",null,1,"-",null,null,0,0,""]
["S",4,"S",0,9,1,1,2,0,0,0,"","Serviço","Serviço","-","AGETOP",80542,"LAVATÓRIO MÉDIO SEM COLUNA","Un    ",2,1,2,null,null,0,0,""]
["S",4,"S",0,9,1,1,2,0,0,0,"","Serviço","Serviço","-","AGETOP",80550,"FIXACAO P/LAVATORIO (PAR)","PAR   ",2,1,2,null,null,0,0,""]
["S",4,"S",0,9,1,1,2,0,0,0,"","Serviço","Serviço","-","AGETOP",80556,"LIGAÇÃO FLEXÍVEL PVC DIAM.1/2\" (ENGATE)","Un    ",5,1,5,null,null,0,0,""]
["S",4,"S",0,9,1,1,2,0,0,0,"","Serviço","Serviço","-","SINAPI",86883,"SIFÃO DO TIPO FLEXÍVEL EM PVC 1  X 1.1/2  - FORNECIMENTO E INSTALAÇÃO. AF_01/2020","UN",5,1,5,null,null,0,0,""]
["S",4,"S",0,9,1,1,2,0,0,0,"","Serviço","Serviço","-","SINAPI",86915,"TORNEIRA CROMADA DE MESA, 1/2\u0094 OU 3/4\u0094, PARA LAVATÓRIO, PADRÃO MÉDIO - FORNECIMENTO E INSTALAÇÃO. AF_01/2020","UN",5,1,5,null,null,0,0,"Referência: AGETOP - 80570"]
["S",4,"S",0,9,1,1,2,0,0,0,"","Serviço","Serviço","-","SINAPI",86877,"VÁLVULA EM METAL CROMADO 1.1/2\u0094 X 1.1/2\u0094 PARA TANQUE OU LAVATÓRIO, COM OU SEM LADRÃO - FORNECIMENTO E INSTALAÇÃO. AF_01/2020","UN",5,1,5,null,null,0,0,"Referência: AGETOP - 80580"]
["S",4,"S",0,9,1,1,2,0,0,0,"","Serviço","Serviço","-","SINAPI",86901,"CUBA DE EMBUTIR OVAL EM LOUÇA BRANCA, 35 X 50CM OU EQUIVALENTE - FORNECIMENTO E INSTALAÇÃO. AF_01/2020","UN",3,1,3,null,null,0,0,"Referência: AGETOP - 80587"]
[4,4,4,3,9,1,1,3,0,7,3,"","Nível 4","Nível 4","-","SINAPI",null,"TANQUES / TORNEIRAS","-",null,1,"-",null,null,0,0,""]
["S",4,"S",0,9,1,1,3,0,0,0,"","Serviço","Serviço","-","AGETOP",80840,"TAMPA T-5 ARTICULADA 20X20","Un    ",1,1,1,null,null,0,0,""]
["S",4,"S",0,9,1,1,3,0,0,0,"","Serviço","Serviço","-","AGETOP",80845,"CAIXA DE ALVENARIA 20x20x25 CM (REVESTIMENTO IMPERMEABILIZADO), FUNDO DE BRITA SEM TAMPA - PARA REGISTRO/TORNEIRA JARDIM","Un    ",1,1,1,null,null,0,0,""]
[4,4,4,4,9,1,1,4,0,4,21,"","Nível 4","Nível 4","-","SINAPI",null,"REGISTROS","-",null,1,"-",null,null,0,0,""]
["S",4,"S",0,9,1,1,4,0,0,0,"","Serviço","Serviço","-","SINAPI",94794,"REGISTRO DE GAVETA BRUTO, LATÃO, ROSCÁVEL, 1 1/2\u0094, COM ACABAMENTO E CANOPLA CROMADOS, INSTALADO EM RESERVAÇÃO DE ÁGUA DE EDIFICAÇÃO QUE POSSUA RESERVATÓRIO DE FIBRA/FIBROCIMENTO \u0096 FORNECIMENTO E INSTALAÇÃO. AF_06/2016","UN",2,1,2,null,null,0,0,"Referência: AGETOP - 80929"]
["S",4,"S",0,9,1,1,4,0,0,0,"","Serviço","Serviço","-","SINAPI",90371,"REGISTRO DE ESFERA, PVC, ROSCÁVEL, 3/4\", FORNECIDO E INSTALADO EM RAMAL DE ÁGUA. AF_03/2015","UN",1,1,1,null,null,0,0,""]
["S",4,"S",0,9,1,1,4,0,0,0,"","Serviço","Serviço","-","AGETOP",80981,"REGISTRO DE ESFERA DIAMETRO 2.1/2\"","Un    ",1,1,1,null,null,0,0,""]
[3,3,3,31,9,1,2,0,0,{"$f":"IF(OR($C174=\"S\",$C174=0),0,MATCH(0,OFFSET($D174,1,$C174,ROW($C$348)-ROW($C174)),0))","v":58},{"$f":"IF(OR($C174=\"S\",$C174=0),0,MATCH(OFFSET($D174,0,$C174)+1,OFFSET($D174,1,$C174,ROW($C$348)-ROW($C174)),0))","v":31},"","Nível 3","Nível 3","-","SINAPI",null,"ÁGUA FRIA","-",null,1,"-",null,null,0,0,""]
[4,4,4,4,9,1,2,1,0,30,4,"","Nível 4","Nível 4","-","SINAPI",null,"TUBOS DE PVC SOLDÁVEL","-",null,1,"-",null,null,0,0,""]
["S",4,"S",0,9,1,2,1,0,0,0,"","Serviço","Serviço","-","SINAPI",89402,"TUBO, PVC, SOLDÁVEL, DN 25MM, INSTALADO EM RAMAL DE DISTRIBUIÇÃO DE ÁGUA - FORNECIMENTO E INSTALAÇÃO. AF_12/2014","M",48,1,48,null,null,0,0,"Referência: AGETOP - 81003"]
["S",4,"S",0,9,1,2,1,0,0,0,"","Serviço","Serviço","-","SINAPI",89449,"TUBO, PVC, SOLDÁVEL, DN 50MM, INSTALADO EM PRUMADA DE ÁGUA - FORNECIMENTO E INSTALAÇÃO. AF_12/2014","M",18,1,18,null,null,0,0,""]
["S",4,"S",0,9,1,2,1,0,0,0,"","Serviço","Serviço","-","SINAPI",89451,"TUBO, PVC, SOLDÁVEL, DN 75MM, INSTALADO EM PRUMADA DE ÁGUA - FORNECIMENTO E INSTALAÇÃO. AF_12/2014","M",24,1,24,null,null,0,0,""]
[4,4,4,5,9,1,2,2,0,26,5,"","Nível 4","Nível 4","-","SINAPI",null,"ADAPTADORES DE PVC SOLDÁVEL","-",null,1,"-",null,null,0,0,""]
["S",4,"S",0,9,1,2,2,0,0,0,"","Serviço","Serviço","-","SINAPI",94708,"ADAPTADOR COM FLANGES LIVRES, PVC, SOLDÁVEL, DN  25 MM X 3/4 , INSTALADO EM RESERVAÇÃO DE ÁGUA DE EDIFICAÇÃO QUE POSSUA RESERVATÓRIO DE FIBRA/FIBROCIMENTO   FORNECIMENTO E INSTALAÇÃO. AF_06/2016","UN",2,1,2,null,null,0,0,"Referência: AGETOP - 81041"]
["S",4,"S",0,9,1,2,2,0,0,0,"","Serviço","Serviço","-","SINAPI",89596,"ADAPTADOR CURTO COM BOLSA E ROSCA PARA REGISTRO, PVC, SOLDÁVEL, DN 50MM X 1.1/2\u0094, INSTALADO EM PRUMADA DE ÁGUA - FORNECIMENTO E INSTALAÇÃO. AF_12/2014","UN",6,1,6,null,null,0,0,"Referência: AGETOP - 81069"]
["S",4,"S",0,9,1,2,2,0,0,0,"","Serviço","Serviço","-","SINAPI",94789,"ADAPTADOR COM FLANGES LIVRES, PVC, SOLDÁVEL LONGO, DN 75 MM X 2 1/2 , INSTALADO EM RESERVAÇÃO DE ÁGUA DE EDIFICAÇÃO QUE POSSUA RESERVATÓRIO DE FIBRA/FIBROCIMENTO   FORNECIMENTO E INSTALAÇÃO. AF_06/2016","UN",2,1,2,null,null,0,0,""]
["S",4,"S",0,9,1,2,2,0,0,0,"","Serviço","Serviço","-","SINAPI",89613,"ADAPTADOR CURTO COM BOLSA E ROSCA PARA REGISTRO, PVC, SOLDÁVEL, DN 75MM X 2.1/2\u0094, INSTALADO EM PRUMADA DE ÁGUA - FORNECIMENTO E INSTALAÇÃO. AF_12/2014","UN",2,1,2,null,null,0,0,"Referência: AGETOP - 81071"]
[4,4,4,5,9,1,2,3,0,21,5,"","Nível 4","Nível 4","-","SINAPI",null,"LUVAS DE PVC","-",null,1,"-",null,null,0,0,""]
["S",4,"S",0,9,1,2,3,0,0,0,"","Serviço","Serviço","-","SINAPI",89528,"LUVA, PVC, SOLDÁVEL, DN 25MM, INSTALADO EM PRUMADA DE ÁGUA - FORNECIMENTO E INSTALAÇÃO. AF_12/2014","UN",2,1,2,null,null,0,0,""]
["S",4,"S",0,9,1,2,3,0,0,0,"","Serviço","Serviço","-","SINAPI",89558,"LUVA, PVC, SOLDÁVEL, DN 40MM, INSTALADO EM PRUMADA DE ÁGUA - FORNECIMENTO E INSTALAÇÃO. AF_12/2014","UN",2,1,2,null,null,0,0,""]
["S",4,"S",0,9,1,2,3,0,0,0,"","Serviço","Serviço","-","SINAPI",89575,"LUVA, PVC, SOLDÁVEL, DN 50MM, INSTALADO EM PRUMADA DE ÁGUA - FORNECIMENTO E INSTALAÇÃO. AF_12/2014","UN",2,1,2,null,null,0,0,"Referência: AGETOP - 81105"]
["S",4,"S",0,9,1,2,3,0,0,0,"","Serviço","Serviço","-","SINAPI",89611,"LUVA, PVC, SOLDÁVEL, DN 75MM, INSTALADO EM PRUMADA DE ÁGUA - FORNECIMENTO E INSTALAÇÃO. AF_12/2014","UN",2,1,2,null,null,0,0,""]
[4,4,4,2,9,1,2,4,0,16,2,"","Nível 4","Nível 4","-","SINAPI",null,"BUCHAS","-",null,1,"-",null,null,0,0,""]
["S",4,"S",0,9,1,2,4,0,0,0,"","Serviço","Serviço","-","SINAPI",89579,"LUVA DE REDUÇÃO, PVC, SOLDÁVEL, DN 50MM X 25MM, INSTALADO EM PRUMADA DE ÁGUA   FORNECIMENTO E INSTALAÇÃO. AF_12/2014","UN",2,1,2,null,null,0,0,""]
[4,4,4,5,9,1,2,5,0,14,5,"","Nível 4","Nível 4","-","SINAPI",null,"JOELHO","-",null,1,"-",null,null,0,0,""]
["S",4,"S",0,9,1,2,5,0,0,0,"","Serviço","Serviço","-","SINAPI",89481,"JOELHO 90 GRAUS, PVC, SOLDÁVEL, DN 25MM, INSTALADO EM PRUMADA DE ÁGUA - FORNECIMENTO E INSTALAÇÃO. AF_12/2014","UN",16,1,16,null,null,0,0,""]
["S",4,"S",0,9,1,2,5,0,0,0,"","Serviço","Serviço","-","SINAPI",89501,"JOELHO 90 GRAUS, PVC, SOLDÁVEL, DN 50MM, INSTALADO EM PRUMADA DE ÁGUA - FORNECIMENTO E INSTALAÇÃO. AF_12/2014","UN",6,1,6,null,null,0,0,""]
["S",4,"S",0,9,1,2,5,0,0,0,"","Serviço","Serviço","-","SINAPI",89513,"JOELHO 90 GRAUS, PVC, SOLDÁVEL, DN 75MM, INSTALADO EM PRUMADA DE ÁGUA - FORNECIMENTO E INSTALAÇÃO. AF_12/2014","UN",6,1,6,null,null,0,0,"Referência: AGETOP - 81326"]
["S",4,"S",0,9,1,2,5,0,0,0,"","Serviço","Serviço","-","AGETOP",81380,"JOELHO 90 GRAUS C/ROSCA E BUCHA LATAO DIAM.1/2\"","Un    ",2,1,2,null,null,0,0,""]
[4,4,4,4,9,1,2,6,0,9,4,"","Nível 4","Nível 4","-","SINAPI",null,"TÊ","-",null,1,"-",null,null,0,0,""]
["S",4,"S",0,9,1,2,6,0,0,0,"","Serviço","Serviço","-","SINAPI",89625,"TE, PVC, SOLDÁVEL, DN 50MM, INSTALADO EM PRUMADA DE ÁGUA - FORNECIMENTO E INSTALAÇÃO. AF_12/2014","UN",2,1,2,null,null,0,0,""]
["S",4,"S",0,9,1,2,6,0,0,0,"","Serviço","Serviço","-","SINAPI",89629,"TE, PVC, SOLDÁVEL, DN 75MM, INSTALADO EM PRUMADA DE ÁGUA - FORNECIMENTO E INSTALAÇÃO. AF_12/2014","UN",2,1,2,null,null,0,0,"Referência: AGETOP - 81407"]
["S",4,"S",0,9,1,2,6,0,0,0,"","Serviço","Serviço","-","SINAPI",94698,"TÊ DE REDUÇÃO, PVC, SOLDÁVEL, DN 75 MM X 50 MM, INSTALADO EM RESERVAÇÃO DE ÁGUA DE EDIFICAÇÃO QUE POSSUA RESERVATÓRIO DE FIBRA/FIBROCIMENTO   FORNECIMENTO E INSTALAÇÃO. AF_06/2016","UN",3,1,3,null,null,0,0,"Referência: AGETOP - 81427"]
[4,4,4,2,9,1,2,7,0,5,2,"","Nível 4","Nível 4","-","SINAPI",null,"UNIÃO","-",null,1,"-",null,null,0,0,""]
["S",4,"S",0,9,1,2,7,0,0,0,"","Serviço","Serviço","-","SINAPI",89612,"UNIÃO, PVC, SOLDÁVEL, DN 75MM, INSTALADO EM PRUMADA DE ÁGUA - FORNECIMENTO E INSTALAÇÃO. AF_12/2014","UN",2,1,2,null,null,0,0,""]
[4,4,4,3,9,1,2,8,0,3,{"$error":"#N/A"},"","Nível 4","Nível 4","-","SINAPI",null,"ADESIVOS","-",null,1,"-",null,null,0,0,""]
["S",4,"S",0,9,1,2,8,0,0,0,"","Serviço","Serviço","-","AGETOP",81501,"ADESIVO PLASTICO - FRASCO 850 G","Un    ",4,1,4,null,null,0,0,""]
["S",4,"S",0,9,1,2,8,0,0,0,"","Serviço","Serviço","-","AGETOP",81504,"SOLUCAO LIMPADORA 1000 CM3","Un    ",4,1,4,null,null,0,0,""]
[3,3,3,24,9,1,3,0,0,27,24,"","Nível 3","Nível 3","-","SINAPI",null,"ESGOTO SANITÁRIO","-",null,1,"-",null,null,0,0,""]
[4,4,4,2,9,1,3,1,0,{"$f":"IF(OR($C206=\"S\",$C206=0),0,MATCH(0,OFFSET($D206,1,$C206,ROW($C$348)-ROW($C206)),0))","v":23},{"$f":"IF(OR($C206=\"S\",$C206=0),0,MATCH(OFFSET($D206,0,$C206)+1,OFFSET($D206,1,$C206,ROW($C$348)-ROW($C206)),0))","v":2},"","Nível 4","Nível 4","-","SINAPI",null,"CORPO DE CAIXA SIFONADA / RALO","-",null,1,"-",null,null,0,0,""]
["S",4,"S",0,9,1,3,1,0,0,0,"","Serviço","Serviço","-","AGETOP",81663,"CORPO CX. SIFONADA DIAM. 150 X 150 X 50","Un    ",2,1,2,null,null,0,0,""]
[4,4,4,2,9,1,3,2,0,21,2,"","Nível 4","Nível 4","-","SINAPI",null,"CURVAS","-",null,1,"-",null,null,0,0,""]
["S",4,"S",0,9,1,3,2,0,0,0,"","Serviço","Serviço","-","AGETOP",81730,"CURVA 90 GRAUS CURTA DIAM. 40 MM","Un    ",2,1,2,null,null,0,0,""]
[4,4,4,7,9,1,3,3,0,19,7,"","Nível 4","Nível 4","-","SINAPI",null,"JOELHOS","-",null,1,"-",null,null,0,0,""]
["S",4,"S",0,9,1,3,3,0,0,0,"","Serviço","Serviço","-","SINAPI",89726,"JOELHO 45 GRAUS, PVC, SERIE NORMAL, ESGOTO PREDIAL, DN 40 MM, JUNTA SOLDÁVEL, FORNECIDO E INSTALADO EM RAMAL DE DESCARGA OU RAMAL DE ESGOTO SANITÁRIO. AF_12/2014","UN",3,1,3,null,null,0,0,""]
["S",4,"S",0,9,1,3,3,0,0,0,"","Serviço","Serviço","-","SINAPI",89802,"JOELHO 45 GRAUS, PVC, SERIE NORMAL, ESGOTO PREDIAL, DN 50 MM, JUNTA ELÁSTICA, FORNECIDO E INSTALADO EM PRUMADA DE ESGOTO SANITÁRIO OU VENTILAÇÃO. AF_12/2014","UN",2,1,2,null,null,0,0,""]
["S",4,"S",0,9,1,3,3,0,0,0,"","Serviço","Serviço","-","SINAPI",89810,"JOELHO 45 GRAUS, PVC, SERIE NORMAL, ESGOTO PREDIAL, DN 100 MM, JUNTA ELÁSTICA, FORNECIDO E INSTALADO EM PRUMADA DE ESGOTO SANITÁRIO OU VENTILAÇÃO. AF_12/2014","UN",2,1,2,null,null,0,0,""]
["S",4,"S",0,9,1,3,3,0,0,0,"","Serviço","Serviço","-","SINAPI",89731,"JOELHO 90 GRAUS, PVC, SERIE NORMAL, ESGOTO PREDIAL, DN 50 MM, JUNTA ELÁSTICA, FORNECIDO E INSTALADO EM RAMAL DE DESCARGA OU RAMAL DE ESGOTO SANITÁRIO. AF_12/2014","UN",1,1,1,null,null,0,0,""]
["S",4,"S",0,9,1,3,3,0,0,0,"","Serviço","Serviço","-","AGETOP",81938,"JOELHO 90 GRAUS DIAMETRO 100 MM","Un    ",2,1,2,null,null,0,0,""]
["S",4,"S",0,9,1,3,3,0,0,0,"","Serviço","Serviço","-","AGETOP",81927,"JOELHO 90 GRAUS C/ANEL 40 mm ","Un    ",2,1,2,null,null,0,0,""]
[4,4,4,4,9,1,3,4,0,12,4,"","Nível 4","Nível 4","-","SINAPI",null,"JUNÇÕES","-",null,1,"-",null,null,0,0,""]
["S",4,"S",0,9,1,3,4,0,0,0,"","Serviço","Serviço","-","AGETOP",81973,"JUNCAO SIMPLES DIAM. 100 X 50 MM","Un    ",2,1,2,null,null,0,0,""]
["S",4,"S",0,9,1,3,4,0,0,0,"","Serviço","Serviço","-","AGETOP",81885,"TERMINAL DE VENTILACAO DIAMETRO 50 MM","Un    ",2,1,2,null,null,0,0,""]
["S",4,"S",0,9,1,3,4,0,0,0,"","Serviço","Serviço","-","SINAPI",89797,"JUNÇÃO SIMPLES, PVC, SERIE NORMAL, ESGOTO PREDIAL, DN 100 X 100 MM, JUNTA ELÁSTICA, FORNECIDO E INSTALADO EM RAMAL DE DESCARGA OU RAMAL DE ESGOTO SANITÁRIO. AF_12/2014","UN",2,1,2,null,null,0,0,"Referência: AGETOP - 81975"]
[4,4,4,2,9,1,3,5,0,8,2,"","Nível 4","Nível 4","-","SINAPI",null,"REDUÇÕES","-",null,1,"-",null,null,0,0,""]
["S",4,"S",0,9,1,3,5,0,0,0,"","Serviço","Serviço","-","AGETOP",82103,"REDUCAO EXCENTRICA 100 X 50 MM","Un    ",2,1,2,null,null,0,0,""]
[4,4,4,2,9,1,3,6,0,6,2,"","Nível 4","Nível 4","-","SINAPI",null,"TÊ","-",null,1,"-",null,null,0,0,""]
["S",4,"S",0,9,1,3,6,0,0,0,"","Serviço","Serviço","-","SINAPI",89825,"TE, PVC, SERIE NORMAL, ESGOTO PREDIAL, DN 50 X 50 MM, JUNTA ELÁSTICA, FORNECIDO E INSTALADO EM PRUMADA DE ESGOTO SANITÁRIO OU VENTILAÇÃO. AF_12/2014","UN",2,1,2,null,null,0,0,""]
[4,4,4,4,9,1,3,7,0,4,{"$error":"#N/A"},"","Nível 4","Nível 4","-","SINAPI",null,"TUBOS","-",null,1,"-",null,null,0,0,""]
["S",4,"S",0,9,1,3,7,0,0,0,"","Serviço","Serviço","-","SINAPI",89711,"TUBO PVC, SERIE NORMAL, ESGOTO PREDIAL, DN 40 MM, FORNECIDO E INSTALADO EM RAMAL DE DESCARGA OU RAMAL DE ESGOTO SANITÁRIO. AF_12/2014","M",12,1,12,null,null,0,0,"Referência: AGETOP - 82301"]
["S",4,"S",0,9,1,3,7,0,0,0,"","Serviço","Serviço","-","SINAPI",89798,"TUBO PVC, SERIE NORMAL, ESGOTO PREDIAL, DN 50 MM, FORNECIDO E INSTALADO EM PRUMADA DE ESGOTO SANITÁRIO OU VENTILAÇÃO. AF_12/2014","M",18,1,18,null,null,0,0,""]
["S",4,"S",0,9,1,3,7,0,0,0,"","Serviço","Serviço","-","SINAPI",89800,"TUBO PVC, SERIE NORMAL, ESGOTO PREDIAL, DN 100 MM, FORNECIDO E INSTALADO EM PRUMADA DE ESGOTO SANITÁRIO OU VENTILAÇÃO. AF_12/2014","M",24,1,24,null,null,0,0,""]
[3,3,3,3,9,1,4,0,0,3,{"$error":"#N/A"},"","Nível 3","Nível 3","-","SINAPI",null,"EXTRAS","-",null,1,"-",null,null,0,0,""]
["S",3,"S",0,9,1,4,0,0,0,0,"","Serviço","Serviço","-","AGETOP",81825,"CAIXA DE PASSAGEM 60 X 60 CM SEM TAMPA","Un    ",1,1,1,null,null,0,0,""]
["S",3,"S",0,9,1,4,0,0,0,0,"","Serviço","Serviço","-","AGETOP",81826,"TAMPA EM CONCRETO ARMADO 25 MPA E=5CM PARA A CAIXA DE PASSAGEM 60X60CM","Un    ",1,1,1,null,null,0,0,""]
[1,1,1,10,10,0,0,0,0,116,10,"F","Nível 1","Nível 1","10.","SINAPI",null,"PROJETO DE PREVENÇÃO E COMBATE A INCÊNDIO","UN",1,1,1,null,null,0,0,""]
[2,2,2,9,10,1,0,0,0,9,38,"","Nível 2","Nível 2","-","SINAPI",null,"INSTALAÇÕES ESPECIAIS","-",null,1,"-",null,null,0,0,""]
["S",2,"S",0,10,1,0,0,0,0,0,"","Serviço","Serviço","-","AGETOP",85003,"EXTINTOR PO QUIMICO SECO (6 KG) - CAPACIDADE EXTINTORA 20 BC","Un    ",1,1,1,null,null,0,0,""]
["S",2,"S",0,10,1,0,0,0,0,0,"","Serviço","Serviço","-","AGETOP",85006,"EXTINTOR MULTI USO EM PO A B C (6 KG) - CAPACIDADE EXTINTORA 3A 20BC","un    ",3,1,3,null,null,0,0,""]
["S",2,"S",0,10,1,0,0,0,0,0,"","Serviço","Serviço","-","SINAPI",97599,"LUMINÁRIA DE EMERGÊNCIA, COM 30 LÂMPADAS LED DE 2 W, SEM REATOR - FORNECIMENTO E INSTALAÇÃO. AF_02/2020","UN",15,1,15,null,null,0,0,""]
["S",2,"S",0,10,1,0,0,0,0,0,"","Serviço","Serviço","-","COMPOSIÇÃO","COMP 024_SEE","SINALIZADOR FOTOLUMINESCENTE PARA EXTINTOR","UN ",4,1,4,null,null,0,0,""]
["S",2,"S",0,10,1,0,0,0,{"$f":"IF(OR($C238=\"S\",$C238=0),0,MATCH(0,OFFSET($D238,1,$C238,ROW($C$348)-ROW($C238)),0))","v":0},{"$f":"IF(OR($C238=\"S\",$C238=0),0,MATCH(OFFSET($D238,0,$C238)+1,OFFSET($D238,1,$C238,ROW($C$348)-ROW($C238)),0))","v":0},"","Serviço","Serviço","-","COMPOSIÇÃO","COMP 025_SEE","SINALIZADOR FOTOLUMINESCENTE DE EMERGÊNCIA","UN ",20,1,20,null,null,0,0,""]
["S",2,"S",0,10,1,0,0,0,0,0,"","Serviço","Serviço","-","COMPOSIÇÃO","COMP 277_SEE","MARCAÇÃO NO PISO - 1X1 M PARA EXTINTOR","M2",4,1,4,null,null,0,0,""]
["S",2,"S",0,10,1,0,0,0,0,0,"","Serviço","Serviço","-","COMPOSIÇÃO","COMP 235_SEE","PLACA DE SINALIZAÇÃO EM PVC COD 01 - (300X300) PROIBIDO FUMAR","UN ",1,1,1,null,null,0,0,""]
["S",2,"S",0,10,1,0,0,0,0,0,"","Serviço","Serviço","-","COMPOSIÇÃO","COMP 236_SEE","PLACA DE SINALIZAÇÃO EM PVC COD 06 - (300X300) PERIGO INFLAMÁVEL","UN ",1,1,1,null,null,0,0,""]
[1,1,1,32,11,0,0,0,0,106,32,"F","Nível 1","Nível 1","11.","SINAPI",null,"PROJETO DE GÁS","UN",1,1,1,null,null,0,0,""]
[2,2,2,28,11,1,0,0,0,31,28,"","Nível 2","Nível 2","-","SINAPI",null,"INSTALAÇÕES ESPECIAIS","-",null,1,"-",null,null,0,0,""]
["S",2,"S",0,11,1,0,0,0,0,0,"","Serviço","Serviço","-","AGETOP",91007,"CENTRAL DE GÁS PADRÃO GOINFRA SEM INSTALAÇÕES (1+1 CILINDRO 45 KG)","Un    ",1,1,1,null,null,0,0,""]
["S",2,"S",0,11,1,0,0,0,0,0,"","Serviço","Serviço","-","AGETOP",91023,"UNIÃO S/BRONZE PRETA 3/4\" NPT 300 LBS","Un    ",3,1,3,null,null,0,0,""]
["S",2,"S",0,11,1,0,0,0,0,0,"","Serviço","Serviço","-","COMPOSIÇÃO","COMP 382_SEE","TE DE REDUCAO DE FERRO GALVANIZADO, COM ROSCA BSP, DE 3/4\" X 1/2\"","UN ",1,1,1,null,null,0,0,""]
["S",2,"S",0,11,1,0,0,0,0,0,"","Serviço","Serviço","-","COMPOSIÇÃO","COMP 383_SEE","BUCHA DE REDUCAO DE FERRO GALVANIZADO, COM ROSCA BSP, DE 1/2\" X 1/4\"","UN ",3,1,3,null,null,0,0,""]
["S",2,"S",0,11,1,0,0,0,0,0,"","Serviço","Serviço","-","AGETOP",91021,"LUVA GALVANIZADO DE REDUÇÃO 3/4\" X 1/2\" (GÁS)","Un    ",2,1,2,null,null,0,0,""]
["S",2,"S",0,11,1,0,0,0,{"$f":"IF(OR($C249=\"S\",$C249=0),0,MATCH(0,OFFSET($D249,1,$C249,ROW($C$348)-ROW($C249)),0))","v":0},{"$f":"IF(OR($C249=\"S\",$C249=0),0,MATCH(OFFSET($D249,0,$C249)+1,OFFSET($D249,1,$C249,ROW($C$348)-ROW($C249)),0))","v":0},"","Serviço","Serviço","-","SINAPI",92692,"NIPLE, EM FERRO GALVANIZADO, CONEXÃO ROSQUEADA, DN 15 (1/2\"), INSTALADO EM RAMAIS E SUB-RAMAIS DE GÁS - FORNECIMENTO E INSTALAÇÃO. AF_12/2015","UN",6,1,6,null,null,0,0,""]
["S",2,"S",0,11,1,0,0,0,0,0,"","Serviço","Serviço","-","AGETOP",91031,"NIPLE DUPLO 300 PSI 3/4\"","Un    ",6,1,6,null,null,0,0,""]
["S",2,"S",0,11,1,0,0,0,0,0,"","Serviço","Serviço","-","COMPOSIÇÃO","COMP 212_SEE","NIPLE DE REDUÇÃO 1/2\" X 1/4\" BSP","UN ",4,1,4,null,null,0,0,""]
["S",2,"S",0,11,1,0,0,0,0,0,"","Serviço","Serviço","-","COMPOSIÇÃO","COMP 213_SEE","NIPLE DE REDUÇÃO 3/4\" X 1/2\" BSP","UN ",4,1,4,null,null,0,0,""]
["S",2,"S",0,11,1,0,0,0,0,0,"","Serviço","Serviço","-","SINAPI",92688,"TUBO DE AÇO GALVANIZADO COM COSTURA, CLASSE MÉDIA, CONEXÃO ROSQUEADA, DN 20 (3/4\"), INSTALADO EM RAMAIS E SUB-RAMAIS DE GÁS - FORNECIMENTO E INSTALAÇÃO. AF_12/2015","M",24,1,24,null,null,0,0,""]
["S",2,"S",0,11,1,0,0,0,0,0,"","Serviço","Serviço","-","SINAPI",92701,"JOELHO 90 GRAUS, EM FERRO GALVANIZADO, CONEXÃO ROSQUEADA, DN 20 (3/4\"), INSTALADO EM RAMAIS E SUB-RAMAIS DE GÁS - FORNECIMENTO E INSTALAÇÃO. AF_12/2015","UN",10,1,10,null,null,0,0,""]
["S",2,"S",0,11,1,0,0,0,0,0,"","Serviço","Serviço","-","COMPOSIÇÃO","COMP 237_SEE","FITA ANTICORROSIVA","M",4,1,4,null,null,0,0,""]
["S",2,"S",0,11,1,0,0,0,0,0,"","Serviço","Serviço","-","AGETOP",91025,"VÁLVULA ESFERICA LATÃO 3/4\"","Un    ",3,1,3,null,null,0,0,""]
["S",2,"S",0,11,1,0,0,0,0,0,"","Serviço","Serviço","-","COMPOSIÇÃO","COMP 542_SEE","VÁLVULA UGV 3/4\" (S) LATÃO","UN ",1,1,1,null,null,0,0,""]
["S",2,"S",0,11,1,0,0,0,0,0,"","Serviço","Serviço","-","COMPOSIÇÃO","COMP 543_SEE","VÁLVULA UGV 1/2\" (S) LATÃO","UN ",1,1,1,null,null,0,0,""]
["S",2,"S",0,11,1,0,0,0,0,0,"","Serviço","Serviço","-","AGETOP",91029,"VALVULA DE RETENÇÃO LATÃO 1/2\" X 7/16\" NPT","Un    ",1,1,1,null,null,0,0,""]
["S",2,"S",0,11,1,0,0,0,0,0,"","Serviço","Serviço","-","COMPOSIÇÃO","COMP 211_SEE","REGULADOR DE 2º ESTÁGIO 5KG/H","UN ",1,1,1,null,null,0,0,""]
["S",2,"S",0,11,1,0,0,0,0,0,"","Serviço","Serviço","-","COMPOSIÇÃO","COMP 210_SEE","REGULADOR DE 1º ESTÁGIO 60KG/H MODELO AP-40  COM MANÔMETRO","UN ",1,1,1,null,null,0,0,""]
["S",2,"S",0,11,1,0,0,0,0,0,"","Serviço","Serviço","-","AGETOP",85003,"EXTINTOR PO QUIMICO SECO (6 KG) - CAPACIDADE EXTINTORA 20 BC","Un    ",1,1,1,null,null,0,0,""]
["S",2,"S",0,11,1,0,0,0,0,0,"","Serviço","Serviço","-","COMPOSIÇÃO","COMP 235_SEE","PLACA DE SINALIZAÇÃO EM PVC COD 01 - (300X300) PROIBIDO FUMAR","UN ",2,1,2,null,null,0,0,""]
["S",2,"S",0,11,1,0,0,0,0,0,"","Serviço","Serviço","-","COMPOSIÇÃO","COMP 236_SEE","PLACA DE SINALIZAÇÃO EM PVC COD 06 - (300X300) PERIGO INFLAMÁVEL","UN ",2,1,2,null,null,0,0,""]
["S",2,"S",0,11,1,0,0,0,0,0,"","Serviço","Serviço","-","AGETOP",91043,"BRAÇADEIRA METALICA TIPO \"D\" DIAM. 3/4\"","Un    ",10,1,10,null,null,0,0,""]
["S",2,"S",0,11,1,0,0,0,0,0,"","Serviço","Serviço","-","AGETOP",71863,"PARAFUSO P/BUCHA S-10","Un    ",20,1,20,null,null,0,0,""]
["S",2,"S",0,11,1,0,0,0,0,0,"","Serviço","Serviço","-","AGETOP",70393,"BUCHA DE NYLON S-10","Un    ",20,1,20,null,null,0,0,""]
["S",2,"S",0,11,1,0,0,0,0,0,"","Serviço","Serviço","-","AGETOP",91045,"SUPORTE PARA COLETOR","Un    ",2,1,2,null,null,0,0,""]
["S",2,"S",0,11,1,0,0,0,0,0,"","Serviço","Serviço","-","COMPOSIÇÃO","COMP 045_SEE","LAUDO DE ESTANQUEIDADE","UN ",1,1,1,null,null,0,0,""]
["S",2,"S",0,11,1,0,0,0,0,0,"","Serviço","Serviço","-","COMPOSIÇÃO","COMP 277_SEE","MARCAÇÃO NO PISO - 1X1 M PARA EXTINTOR","M2",1,1,1,null,null,0,0,""]
[2,2,2,3,11,2,0,0,0,3,{"$error":"#N/A"},"","Nível 2","Nível 2","-","SINAPI",null,"SERVIÇO EM TERRA","-",null,1,"-",null,null,0,0,""]
["S",2,"S",0,11,2,0,0,0,0,0,"","Serviço","Serviço","-","SINAPI",93358,"ESCAVAÇÃO MANUAL DE VALA COM PROFUNDIDADE MENOR OU IGUAL A 1,30 M. AF_03/2016","M3",0.13120000000000001,1,0.13120000000000001,null,null,0,0,"Referência: AGETOP - 40101"]
["S",2,"S",0,11,2,0,0,0,0,0,"","Serviço","Serviço","-","SINAPI",96995,"REATERRO MANUAL APILOADO COM SOQUETE. AF_10/2017","M3",0.13120000000000001,1,0.13120000000000001,null,null,0,0,"Referência: AGETOP - 40902"]
[1,1,1,5,12,0,0,0,0,74,5,"F","Nível 1","Nível 1","12.","AGETOP",240210,"ADMINISTRAÇÃO LOCAL","UN",1,1,1,null,null,0,0,""]
[2,2,2,4,12,1,0,0,0,4,13,"","Nível 2","Nível 2","-",null,null,"ADMINISTRAÇÃO","-",null,1,"-",null,null,0,0,""]
[3,3,3,3,12,1,1,0,0,3,{"$error":"#N/A"},"","Nível 3","Nível 3","-",null,null,"MENSALISTAS","-",null,1,"-",null,null,0,0,""]
["S",3,"S",0,12,1,1,0,0,0,0,"","Serviço","Serviço","-","SINAPI",90778,"ENGENHEIRO CIVIL DE OBRA PLENO COM ENCARGOS COMPLEMENTARES","H",110,1,110,null,null,0,0,"Referência: AGETOP - 250101"]
["S",3,"S",0,12,1,1,0,0,0,0,"","Serviço","Serviço","-","SINAPI",90776,"ENCARREGADO GERAL COM ENCARGOS COMPLEMENTARES","H",550,1,550,null,null,0,0,"Referência: AGETOP - 250103"]
[1,1,1,5,13,0,0,0,0,69,5,"F","Nível 1","Nível 1","13.","SINAPI",null,"OBRA","UN",1,1,1,null,null,0,0,""]
[2,2,2,4,13,1,0,0,0,4,8,"","Nível 2","Nível 2","-","SINAPI",null,"DIVERSOS","-",null,1,"-",null,null,0,0,""]
["S",2,"S",0,13,1,0,0,0,0,0,"","Serviço","Serviço","-","AGETOP",21301,"PLACA DE OBRA PLOTADA EM CHAPA METÁLICA 26 , AFIXADA EM CAVALETES DE MADEIRA DE LEI (VIGOTAS 6X12CM) - PADRÃO GOINFRA","m2    ",7.5,1,7.5,null,null,0,0,""]
["S",2,"S",0,13,1,0,0,0,0,0,"","Serviço","Serviço","-","AGETOP",270804,"PLACA DE INAUGURAÇÃO AÇO ESCOVADO 60 X 120 CM","un    ",1,1,1,null,null,0,0,""]
["S",2,"S",0,13,1,0,0,0,0,0,"","Serviço","Serviço","-","AGETOP",270501,"LIMPEZA FINAL DE OBRA - (OBRAS CIVIS)","m2    ",165,1,165,null,null,0,0,""]
[1,1,1,64,14,0,0,0,0,64,{"$error":"#N/A"},"F","Nível 1","Nível 1","14.","SINAPI",null,"PROJETO ELÉTRICO","UN",1,1,1,null,null,0,0,""]
[2,2,2,3,14,1,0,0,0,63,3,"","Nível 2","Nível 2","-","AGETOP",null,"SERVIÇO EM TERRA","-",null,1,"-",null,null,0,0,""]
["S",2,"S",0,14,1,0,0,0,0,0,"","Serviço","Serviço","-","SINAPI",93358,"ESCAVAÇÃO MANUAL DE VALA COM PROFUNDIDADE MENOR OU IGUAL A 1,30 M. AF_03/2016","M3",11.2,1,11.2,null,null,0,0,"Referência: AGETOP - 40101"]
["S",2,"S",0,14,1,0,0,0,0,0,"","Serviço","Serviço","-","SINAPI",96995,"REATERRO MANUAL APILOADO COM SOQUETE. AF_10/2017","M3",11.2,1,11.2,null,null,0,0,"Referência: AGETOP - 40902"]
[2,2,2,60,14,2,0,0,0,60,{"$error":"#N/A"},"","Nível 2","Nível 2","-",null,null,"INSTALAÇÕES ELÉTRICAS","-",null,1,"-",null,null,0,0,""]
["S",2,"S",0,14,2,0,0,0,0,0,"","Serviço","Serviço","-","AGETOP",70371,"BRACADEIRA METALICA TIPO \"D\" DIAM. 3/4\"","Un    ",417,1,417,null,null,0,0,""]
["S",2,"S",0,14,2,0,0,0,0,0,"","Serviço","Serviço","-","AGETOP",70421,"BUCHA E ARRUELA METALICA DIAM. 3/4\"","PR    ",417,1,417,null,null,0,0,""]
["S",2,"S",0,14,2,0,0,0,0,0,"","Serviço","Serviço","-","AGETOP",70372,"BRACADEIRA METALICA TIPO \"D\" DIAM. 1\"","Un    ",48,1,48,null,null,0,0,""]
["S",2,"S",0,14,2,0,0,0,0,0,"","Serviço","Serviço","-","AGETOP",70422,"BUCHA E ARRUELA METALICA DIAM. 1\"","PR    ",48,1,48,null,null,0,0,""]
["S",2,"S",0,14,2,0,0,0,0,0,"","Serviço","Serviço","-","AGETOP",70374,"BRACADEIRA METALICA TIPO \"D\" DIAM. 1.1/2\"","Un    ",14,1,14,null,null,0,0,""]
["S",2,"S",0,14,2,0,0,0,0,0,"","Serviço","Serviço","-","AGETOP",70424,"BUCHA E ARRUELA METALICA DIAM. 1.1/2\"","PR    ",14,1,14,null,null,0,0,""]
["S",2,"S",0,14,2,0,0,0,0,0,"","Serviço","Serviço","-","AGETOP",70375,"BRACADEIRA METALICA TIPO \"D\" DIAM. 2\"","Un    ",30,1,30,null,null,0,0,""]
["S",2,"S",0,14,2,0,0,0,0,0,"","Serviço","Serviço","-","AGETOP",70425,"BUCHA E ARRUELA METALICA DIAM. 2\"","PR    ",30,1,30,null,null,0,0,""]
["S",2,"S",0,14,2,0,0,0,0,0,"","Serviço","Serviço","-","AGETOP",71251,"ELETRODUTO EM AÇO ZINCADO DIÂMETRO 3/4\"","M     ",625,1,625,null,null,0,0,""]
["S",2,"S",0,14,2,0,0,0,0,0,"","Serviço","Serviço","-","AGETOP",71252,"ELETRODUTO EM AÇO ZINCADO DIÂMETRO 1\"","M     ",72,1,72,null,null,0,0,""]
["S",2,"S",0,14,2,0,0,0,0,0,"","Serviço","Serviço","-","AGETOP",71254,"ELETRODUTO EM AÇO ZINCADO DIÂMETRO 1.1/2\"","M     ",21,1,21,null,null,0,0,""]
["S",2,"S",0,14,2,0,0,0,0,0,"","Serviço","Serviço","-","AGETOP",71255,"ELETRODUTO EM AÇO ZINCADO DIÂMETRO 2\"","M     ",45,1,45,null,null,0,0,""]
["S",2,"S",0,14,2,0,0,0,0,0,"","Serviço","Serviço","-","AGETOP",71722,"LUVA EM AÇO ZINCADO DIÂMETRO 3/4\"","Un    ",439,1,439,null,null,0,0,""]
["S",2,"S",0,14,2,0,0,0,0,0,"","Serviço","Serviço","-","AGETOP",71121,"CURVA 90 GRAUS AÇO ZINCADO DIÂMETRO 3/4\"","Un    ",115,1,115,null,null,0,0,""]
["S",2,"S",0,14,2,0,0,0,0,0,"","Serviço","Serviço","-","AGETOP",71721,"LUVA EM AÇO ZINCADO DIÂMETRO 1\"","Un    ",34,1,34,null,null,0,0,""]
["S",2,"S",0,14,2,0,0,0,0,0,"","Serviço","Serviço","-","AGETOP",71122,"CURVA 90 GRAUS AÇO ZINCADO DIÂMETRO 1\"","Un    ",5,1,5,null,null,0,0,""]
["S",2,"S",0,14,2,0,0,0,0,0,"","Serviço","Serviço","-","AGETOP",71724,"LUVA EM AÇO ZINCADO DIÂMETRO 1.1/2\"","Un    ",13,1,13,null,null,0,0,""]
["S",2,"S",0,14,2,0,0,0,0,0,"","Serviço","Serviço","-","AGETOP",71124,"CURVA 90 GRAUS AÇO ZINCADO DIÂMETRO 1.1/2\"","Un    ",3,1,3,null,null,0,0,""]
["S",2,"S",0,14,2,0,0,0,0,0,"","Serviço","Serviço","-","AGETOP",71725,"LUVA EM AÇO ZINCADO DIÂMETRO 2\"","Un    ",27,1,27,null,null,0,0,""]
["S",2,"S",0,14,2,0,0,0,0,0,"","Serviço","Serviço","-","AGETOP",71125,"CURVA 90 GRAUS AÇO ZINCADO DIÂMETRO 2\"","Un    ",6,1,6,null,null,0,0,""]
["S",2,"S",0,14,2,0,0,0,0,0,"","Serviço","Serviço","-","SINAPI",97667,"ELETRODUTO FLEXÍVEL CORRUGADO, PEAD, DN 50 (1 ½\u0094)  - FORNECIMENTO E INSTALAÇÃO. AF_04/2016","M",60,1,60,null,null,0,0,""]
["S",2,"S",0,14,2,0,0,0,0,0,"","Serviço","Serviço","-","AGETOP",70924,"CONDULETE DE PVC - CAIXA COM 5 ENTRADAS ","un    ",168,1,168,null,null,0,0,""]
["S",2,"S",0,14,2,0,0,0,0,0,"","Serviço","Serviço","-","SINAPI",92008,"TOMADA BAIXA DE EMBUTIR (2 MÓDULOS), 2P+T 10 A, INCLUINDO SUPORTE E PLACA - FORNECIMENTO E INSTALAÇÃO. AF_12/2015","UN",31,1,31,null,null,0,0,""]
["S",2,"S",0,14,2,0,0,0,0,0,"","Serviço","Serviço","-","SINAPI",92004,"TOMADA MÉDIA DE EMBUTIR (2 MÓDULOS), 2P+T 10 A, INCLUINDO SUPORTE E PLACA - FORNECIMENTO E INSTALAÇÃO. AF_12/2015","UN",4,1,4,null,null,0,0,"Referência: AGETOP - 72578"]
["S",2,"S",0,14,2,0,0,0,{"$f":"IF(OR($C313=\"S\",$C313=0),0,MATCH(0,OFFSET($D313,1,$C313,ROW($C$348)-ROW($C313)),0))","v":0},{"$f":"IF(OR($C313=\"S\",$C313=0),0,MATCH(OFFSET($D313,0,$C313)+1,OFFSET($D313,1,$C313,ROW($C$348)-ROW($C313)),0))","v":0},"","Serviço","Serviço","-","SINAPI",92000,"TOMADA BAIXA DE EMBUTIR (1 MÓDULO), 2P+T 10 A, INCLUINDO SUPORTE E PLACA - FORNECIMENTO E INSTALAÇÃO. AF_12/2015","UN",35,1,35,null,null,0,0,"Referência: AGETOP - 72578"]
["S",2,"S",0,14,2,0,0,0,0,0,"","Serviço","Serviço","-","AGETOP",71411,"INTERRUPTOR 1 SEÇÃO (LINHA X OU EQUIVALENTE)","Un    ",29,1,29,null,null,0,0,""]
["S",2,"S",0,14,2,0,0,0,0,0,"","Serviço","Serviço","-","AGETOP",71043,"CONECTOR TRIPOLAR EM PORCELANA PARA FIOS DE ATÉ 10MM2 (BORNES) 50A-250V (CHUVEIRO)","un    ",13,1,13,null,null,0,0,""]
["S",2,"S",0,14,2,0,0,0,0,0,"","Serviço","Serviço","-","AGETOP",72575,"TOMADA HEXAGONAL 2P + T - 20A - 250V (LINHA X OU EQUIVALENTE)","Un    ",13,1,13,null,null,0,0,""]
["S",2,"S",0,14,2,0,0,0,0,0,"","Serviço","Serviço","-","SINAPI",97592,"LUMINÁRIA TIPO PLAFON, DE SOBREPOR, COM 1 LÂMPADA LED DE 12/13 W, SEM REATOR - FORNECIMENTO E INSTALAÇÃO. AF_02/2020","UN",126,1,126,null,null,0,0,""]
["S",2,"S",0,14,2,0,0,0,0,0,"","Serviço","Serviço","-","SINAPI",91926,"CABO DE COBRE FLEXÍVEL ISOLADO, 2,5 MM², ANTI-CHAMA 450/750 V, PARA CIRCUITOS TERMINAIS - FORNECIMENTO E INSTALAÇÃO. AF_12/2015","M",3545,1,3545,null,null,0,0,"Referência: AGETOP - 70563"]
["S",2,"S",0,14,2,0,0,0,0,0,"","Serviço","Serviço","-","SINAPI",91928,"CABO DE COBRE FLEXÍVEL ISOLADO, 4 MM², ANTI-CHAMA 450/750 V, PARA CIRCUITOS TERMINAIS - FORNECIMENTO E INSTALAÇÃO. AF_12/2015","M",235,1,235,null,null,0,0,"Referência: AGETOP - 70564"]
["S",2,"S",0,14,2,0,0,0,0,0,"","Serviço","Serviço","-","SINAPI",91929,"CABO DE COBRE FLEXÍVEL ISOLADO, 4 MM², ANTI-CHAMA 0,6/1,0 KV, PARA CIRCUITOS TERMINAIS - FORNECIMENTO E INSTALAÇÃO. AF_12/2015","M",200,1,200,null,null,0,0,"Referência: AGETOP - 70582"]
["S",2,"S",0,14,2,0,0,0,0,0,"","Serviço","Serviço","-","SINAPI",92982,"CABO DE COBRE FLEXÍVEL ISOLADO, 16 MM², ANTI-CHAMA 0,6/1,0 KV, PARA DISTRIBUIÇÃO - FORNECIMENTO E INSTALAÇÃO. AF_12/2015","M",500,1,500,null,null,0,0,""]
["S",2,"S",0,14,2,0,0,0,0,0,"","Serviço","Serviço","-","AGETOP",70646,"CAIXA DE PASSAGEM METÁLICA DE EMBUTIR 20X20X10 CM","Un    ",2,1,2,null,null,0,0,""]
["S",2,"S",0,14,2,0,0,0,0,0,"","Serviço","Serviço","-","SINAPI",84798,"TAMPAO FOFO P/ CAIXA R1 PADRAO TELEBRAS COMPLETO - FORNECIMENTO E INSTALACAO","UN",4,1,4,null,null,0,0,""]
["S",2,"S",0,14,2,0,0,0,0,0,"","Serviço","Serviço","-","AGETOP",70716,"CAIXA DE PASSAGEM 80X80X110 CM FUNDO DE BRITA SEM TAMPA","Un    ",4,1,4,null,null,0,0,""]
["S",2,"S",0,14,2,0,0,0,0,0,"","Serviço","Serviço","-","SINAPI","74131/7","QUADRO DE DISTRIBUICAO DE ENERGIA DE EMBUTIR, EM CHAPA METALICA, PARA 40 DISJUNTORES TERMOMAGNETICOS MONOPOLARES, COM BARRAMENTO TRIFASICO E NEUTRO, FORNECIMENTO E INSTALACAO","UN",1,1,1,null,null,0,0,""]
["S",2,"S",0,14,2,0,0,0,0,0,"","Serviço","Serviço","-","AGETOP",71184,"DISPOSITIVO DE PROTEÇÃO CONTRA SURTOS (D.P.S.) 275V DE 8 A 40KA","Un    ",3,1,3,null,null,0,0,""]
["S",2,"S",0,14,2,0,0,0,0,0,"","Serviço","Serviço","-","SINAPI",93655,"DISJUNTOR MONOPOLAR TIPO DIN, CORRENTE NOMINAL DE 20A - FORNECIMENTO E INSTALAÇÃO. AF_04/2016","UN",3,1,3,null,null,0,0,""]
["S",2,"S",0,14,2,0,0,0,0,0,"","Serviço","Serviço","-","SINAPI",93654,"DISJUNTOR MONOPOLAR TIPO DIN, CORRENTE NOMINAL DE 16A - FORNECIMENTO E INSTALAÇÃO. AF_04/2016","UN",11,1,11,null,null,0,0,""]
["S",2,"S",0,14,2,0,0,0,0,0,"","Serviço","Serviço","-","AGETOP",71450,"INTERRUPTOR DIFERENCIAL RESIDUAL (D.R.) BIPOLAR DE 25A-30mA","Un    ",4,1,4,null,null,0,0,""]
["S",2,"S",0,14,2,0,0,0,0,0,"","Serviço","Serviço","-","SINAPI",93670,"DISJUNTOR TRIPOLAR TIPO DIN, CORRENTE NOMINAL DE 25A - FORNECIMENTO E INSTALAÇÃO. AF_04/2016","UN",1,1,1,null,null,0,0,"Referência: AGETOP - 71173"]
["S",2,"S",0,14,2,0,0,0,0,0,"","Serviço","Serviço","-","SINAPI",93672,"DISJUNTOR TRIPOLAR TIPO DIN, CORRENTE NOMINAL DE 40A - FORNECIMENTO E INSTALAÇÃO. AF_04/2016","UN",1,1,1,null,null,0,0,"Referência: AGETOP - 71174"]
["S",2,"S",0,14,2,0,0,0,0,0,"","Serviço","Serviço","-","AGETOP",71175,"DISJUNTOR TRIPOLAR DE 60 A 100-A","Un    ",2,1,2,null,null,0,0,""]
["S",2,"S",0,14,2,0,0,0,0,0,"","Serviço","Serviço","-","AGETOP",70764,"CANALETA COM TAMPA (LINHA X OU EQUIVALENTE) 50X20X2000 MM","M     ",5,1,5,null,null,0,0,""]
["S",2,"S",0,14,2,0,0,0,0,0,"","Serviço","Serviço","-","AGETOP",72630,"TRILHO OU SUPORTE P/BORNE TERMINAL","M     ",5,1,5,null,null,0,0,""]
["S",2,"S",0,14,2,0,0,0,0,0,"","Serviço","Serviço","-","SINAPI","74131/5","QUADRO DE DISTRIBUICAO DE ENERGIA DE EMBUTIR, EM CHAPA METALICA, PARA 24 DISJUNTORES TERMOMAGNETICOS MONOPOLARES, COM BARRAMENTO TRIFASICO E NEUTRO, FORNECIMENTO E INSTALACAO","UN",1,1,1,null,null,0,0,""]
["S",2,"S",0,14,2,0,0,0,0,0,"","Serviço","Serviço","-","SINAPI",93654,"DISJUNTOR MONOPOLAR TIPO DIN, CORRENTE NOMINAL DE 16A - FORNECIMENTO E INSTALAÇÃO. AF_04/2016","UN",11,1,11,null,null,0,0,""]
["S",2,"S",0,14,2,0,0,0,0,0,"","Serviço","Serviço","-","SINAPI",93656,"DISJUNTOR MONOPOLAR TIPO DIN, CORRENTE NOMINAL DE 25A - FORNECIMENTO E INSTALAÇÃO. AF_04/2016","UN",2,1,2,null,null,0,0,""]
["S",2,"S",0,14,2,0,0,0,0,0,"","Serviço","Serviço","-","SINAPI",93672,"DISJUNTOR TRIPOLAR TIPO DIN, CORRENTE NOMINAL DE 40A - FORNECIMENTO E INSTALAÇÃO. AF_04/2016","UN",1,1,1,null,null,0,0,"Referência: AGETOP - 71174"]
["S",2,"S",0,14,2,0,0,0,0,0,"","Serviço","Serviço","-","SINAPI",83463,"QUADRO DE DISTRIBUICAO DE ENERGIA EM CHAPA DE ACO GALVANIZADO, PARA 12 DISJUNTORES TERMOMAGNETICOS MONOPOLARES, COM BARRAMENTO TRIFASICO E NEUTRO - FORNECIMENTO E INSTALACAO","UN",1,1,1,null,null,0,0,""]
["S",2,"S",0,14,2,0,0,0,0,0,"","Serviço","Serviço","-","SINAPI",93654,"DISJUNTOR MONOPOLAR TIPO DIN, CORRENTE NOMINAL DE 16A - FORNECIMENTO E INSTALAÇÃO. AF_04/2016","UN",5,1,5,null,null,0,0,""]
["S",2,"S",0,14,2,0,0,0,0,0,"","Serviço","Serviço","-","SINAPI",93670,"DISJUNTOR TRIPOLAR TIPO DIN, CORRENTE NOMINAL DE 25A - FORNECIMENTO E INSTALAÇÃO. AF_04/2016","UN",1,1,1,null,null,0,0,"Referência: AGETOP - 71173"]
["S",2,"S",0,14,2,0,0,0,0,0,"","Serviço","Serviço","-","AGETOP",70255,"ATERRAMENTO - SOLDA EXOTÉRMICA - CARTUCHO 90 G","un    ",5,1,5,null,null,0,0,""]
["S",2,"S",0,14,2,0,0,0,0,0,"","Serviço","Serviço","-","SINAPI",98111,"CAIXA DE INSPEÇÃO PARA ATERRAMENTO, CIRCULAR, EM POLIETILENO, DIÂMETRO INTERNO = 0,3 M. AF_05/2018","UN",1,1,1,null,null,0,0,""]
["S",2,"S",0,14,2,0,0,0,0,0,"","Serviço","Serviço","-","SINAPI",96986,"HASTE DE ATERRAMENTO 3/4  PARA SPDA - FORNECIMENTO E INSTALAÇÃO. AF_12/2017","UN",4,1,4,null,null,0,0,""]
["S",2,"S",0,14,2,0,0,0,0,0,"","Serviço","Serviço","-","AGETOP",70541,"CABO DE COBRE NU No. 16 MM2 (6,94 M/KG)","M     ",18,1,18,null,null,0,0,""]
["S",2,"S",0,14,2,0,0,0,0,0,"","Serviço","Serviço","-","AGETOP",71331,"FITA ISOLANTE, ROLO DE 20,00 M","Un    ",10,1,10,null,null,0,0,""]
["S",2,"S",0,14,2,0,0,0,0,0,"","Serviço","Serviço","-","AGETOP",71826,"PADRÃO TRIFASICO 25 MM H=7 METROS","Un    ",1,1,1,null,null,0,0,""]
[-1,null,-1,null,0,0,0,0,0,null,null,"F"]
[null,null,null,null,null,null,null,null,null,null,null,"F",null,null,null,null,null,"OBS: OS QUANTITATIVOS DE MATERIAIS  DAS INSTALAÇÕES HIDROSSANITÁRIAS, ELÉTRICAS E ESPECIAIS SÃO FORNECIDOS PELOS PROFISSIONAIS RESPONSÁVEIS PELOS RESPECTIVOS PROJETOS.",null,null,null,null,"VALOR TOTAL",null,null,0]
[null,null,null,null,null,null,null,null,null,null,null,"F",null,null,null,null,null,null,null,null,null,null,"VALOR BDI (20,34%)",null,null,0]
[null,null,null,null,null,null,null,null,null,null,null,"F",null,null,null,null,null,null,null,null,null,null,"TOTAL ORÇAMENTO",null,null,0]
[null,null,null,null,null,null,null,null,null,null,null,"F"]
[null,null,null,null,null,null,null,null,null,null,null,"F",null,null,null,null,null,null,null,null,null,null,"CUSTO POR M2 ³",null,null,0]
[null,null,null,null,null,null,null,null,null,null,null,"F",null,null,null,null,null,null,null,null,null,null,"MATERIAL S/ BDI",null,null,0]
[null,null,null,null,null,null,null,null,null,null,null,"F",null,null,null,null,null,null,null,null,null,null,"MÃO DE OBRA S/ BDI",null,null,0]
[null,null,null,null,null,null,null,null,null,null,null,"F"]
[null,null,null,null,null,null,null,null,null,null,null,"F",null,null,null,null,"(1) Conforme previsto pelo DECRETO Nº 7.983, DE 8 DE ABRIL DE 2013, os preços adotados são aqueles constantes dos sistemas de referência indicados. Justifica-se o uso dos preços destas composições de custos unitários devido ao seu valor ser menor à mediana de seus correspondentes na tabela SINAPI;"]
[null,null,null,null,null,null,null,null,null,null,null,"F",null,null,null,null,"(2) Optou-se pelo uso das composições de custos da AGETOP para itens não presentes na SINAPI;"]
[null,null,null,null,null,null,null,null,null,null,null,"F",null,null,null,null,"(3) Para itens da AGETOP, os vidros não estão inclusos nas esquadrias e já foram considerados os custos de contramarco para as esquadrias de alumínio;"]
[null,null,null,null,null,null,null,null,null,null,null,"F",null,null,null,null,"(4) Nos casos em que houver execução de granitina e omissão do item AGETOP 221102, considerou-se que o quantitativo para o rodapé, de altura igual a 7cm, foi incorporado na área de piso;"]
[null,null,null,null,null,null,null,null,null,null,null,"F",null,null,null,null,"(5) O custo unitário aproximado por metro quadrado é calculado dividindo-se o valor total do orçamento pela área total de construção."]
[null,null,null,null,null,null,null,null,null,null,null,"F"]
[null,null,null,null,null,null,null,null,null,null,null,"F"]
[]
[null,null,null,null,null,null,null,null,null,null,null,null,null,null,"SOMATÓRIO DE SERVIÇOS"]
[null,null,null,null,null,null,null,null,null,null,null,null,null,null,"ITEM","DESCRIÇÃO DOS SERVIÇOS",null,null,"PREÇO SEM BDI",null,null,null,null,"PREÇO COM BDI",null,null,"PARTICIPAÇÃO ( % )"]
[null,null,null,null,null,null,null,null,null,null,null,null,null,null,"a.","SERVIÇOS PRELIMINARES",null,null,{"$f":"SUMIF($R$19:$R$348,$P367,$Z$19:$Z$348)","v":0},null,null,null,null,{"$f":"ROUND(S367*(1+BDI.Taxa),2)","v":0},null,null,{"$f":"IFERROR(ROUND($X367*100/$Z$351,2),0)","v":0}]
[null,null,null,null,null,null,null,null,null,null,null,null,null,null,"b.","TRANSPORTES",null,null,0,null,null,null,null,0,null,null,0]
[null,null,null,null,null,null,null,null,null,null,null,null,null,null,"c.","SERVIÇO EM TERRA",null,null,0,null,null,null,null,0,null,null,0]
[null,null,null,null,null,null,null,null,null,null,null,null,null,null,"d.","FUNDAÇÕES E SONDAGENS",null,null,0,null,null,null,null,0,null,null,0]
[null,null,null,null,null,null,null,null,null,null,null,null,null,null,"e.","ESTRUTURA",null,null,0,null,null,null,null,0,null,null,0]
[null,null,null,null,null,null,null,null,null,null,null,null,null,null,"f.","INSTALAÇÕES ELÉTRICAS",null,null,0,null,null,null,null,0,null,null,0]
[null,null,null,null,null,null,null,null,null,null,null,null,null,null,"g.","INSTALAÇÕES HIDROSSANITÁRIAS",null,null,0,null,null,null,null,0,null,null,0]
[null,null,null,null,null,null,null,null,null,null,null,null,null,null,"h","INSTALAÇÕES ESPECIAIS",null,null,0,null,null,null,null,0,null,null,0]
[null,null,null,null,null,null,null,null,null,null,null,null,null,null,"i.","ALVENARIAS E DIVISÓRIAS",null,null,0,null,null,null,null,0,null,null,0]
[null,null,null,null,null,null,null,null,null,null,null,null,null,null,"j.","ALVENARIA AUTO-PORTANTE",null,null,0,null,null,null,null,0,null,null,0]
[null,null,null,null,null,null,null,null,null,null,null,null,null,null,"k.","IMPERMEABILIZAÇÃO",null,null,0,null,null,null,null,0,null,null,0]
[null,null,null,null,null,null,null,null,null,null,null,null,null,null,"l.","ISOLAMENTO TÉRMICO E ACÚSTICO",null,null,0,null,null,null,null,0,null,null,0]
[null,null,null,null,null,null,null,null,null,null,null,null,null,null,"m.","ESTRUTURA DE MADEIRA",null,null,0,null,null,null,null,0,null,null,0]
[null,null,null,null,null,null,null,null,null,null,null,null,null,null,"n.","ESTRUTURAS METÁLICAS",null,null,0,null,null,null,null,0,null,null,0]
[null,null,null,null,null,null,null,null,null,null,null,null,null,null,"o.","COBERTURAS",null,null,0,null,null,null,null,0,null,null,0]
[null,null,null,null,null,null,null,null,null,null,null,null,null,null,"p.","ESQUADRIAS DE MADEIRA",null,null,0,null,null,null,null,0,null,null,0]
[null,null,null,null,null,null,null,null,null,null,null,null,null,null,"q.","ESQUADRIAS METÁLICAS",null,null,0,null,null,null,null,{"$f":"ROUND(S383*(1+BDI.Taxa),2)","v":0},null,null,0]
[null,null,null,null,null,null,null,null,null,null,null,null,null,null,"r.","VIDROS",null,null,0,null,null,null,null,0,null,null,0]
[null,null,null,null,null,null,null,null,null,null,null,null,null,null,"s.","REVESTIMENTO DE PAREDE",null,null,0,null,null,null,null,0,null,null,0]
[null,null,null,null,null,null,null,null,null,null,null,null,null,null,"t.","FORROS",null,null,0,null,null,null,null,0,null,null,0]
[null,null,null,null,null,null,null,null,null,null,null,null,null,null,"u.","REVESTIMENTO DE PISO",null,null,0,null,null,null,null,0,null,null,0]
[null,null,null,null,null,null,null,null,null,null,null,null,null,null,"v.","FERRAGENS",null,null,0,null,null,null,null,0,null,null,0]
[null,null,null,null,null,null,null,null,null,null,null,null,null,null,"w.","MARCENARIA",null,null,0,null,null,null,null,0,null,null,0]
[null,null,null,null,null,null,null,null,null,null,null,null,null,null,"x.","ADMINISTRAÇÃO",null,null,0,null,null,null,null,0,null,null,0]
[null,null,null,null,null,null,null,null,null,null,null,null,null,null,"y.","PINTURA",null,null,0,null,null,null,null,{"$f":"ROUND(S391*(1+BDI.Taxa),2)","v":0},null,null,0]
[null,null,null,null,null,null,null,null,null,null,null,null,null,null,"z.","DIVERSOS",null,null,0,null,null,null,null,{"$f":"IF(S392>0,IF((SUM(X367:Y391)+ROUND(S392*(1+BDI.Taxa),2))<>X394,X394-SUM(X367:Y391),ROUND(S392*(1+BDI.Taxa),2)),0)","v":0},null,null,{"$f":"IF(S392>0,IF((SUM(AA367:AA391)+IFERROR(ROUND($X392*100/$Z$351,2),0))<>AA394,AA394-SUM(AA367:AA391),IFERROR(ROUND($X392*100/$Z$351,2),0)),0)","v":0}]
[null,null,null,null,null,null,null,null,null,null,null,null,null,null,"TOTAL GERAL DO ORÇAMENTO (R$)",null,null,null,{"$f":"SUM(S367:W392)","v":0},null,null,null,null,{"$f":"SUM(X367:Y392)","v":0},null,null,{"$f":"SUM(AA367:AA392)","v":0}]
[null,null,null,null,null,null,null,null,null,null,null,null,null,null,null,null,null,null,{"$f":"$Z$349","v":0},null,null,null,null,{"$f":"$Z$351","v":0},null,null,100]
[null,null,null,null,null,null,null,null,null,null,null,null,null,null,null,null,null,null,"(TOTAL SEM BDI)",null,null,null,null,"(TOTAL COM BDI)",null,null,"(ARRED porcentagem)"]
[null,null,null,null,null,null,null,null,null,null,null,null,null,null,null,null,null,null,{"$f":"IF(AND(S393=S394,S393>0),\"OK\",\"ERRO\")","v":"ERRO"},null,null,null,null,{"$f":"IF(AND(X393=X394,X393>0),\"OK\",\"ERRO\")","v":"ERRO"},null,null,{"$f":"IF(AA393=100,\"OK\",\"ERRO\")","v":"ERRO"}]
[]
[]
[null,null,null,null,null,null,null,null,null,null,null,null,null,null,"RESUMO GERAL DO ORÇAMENTO"]
[null,null,null,null,null,null,null,null,null,null,null,null,null,null,"ITEM","DESCRIÇÃO DOS SERVIÇOS",null,null,"PREÇO SEM BDI",null,null,null,null,"PREÇO COM BDI",null,null,"PARTICIPAÇÃO ( % )"]
[null,null,null,null,null,null,null,null,null,null,null,null,null,null,"1.",{"$f":"IFERROR(VLOOKUP(O401,$O$19:$Y$348,4,FALSE),\"\")","v":"1. COZINHA E DESPENSA"},null,null,{"$f":"IF(P402=\"\",$S$422-SUM(OFFSET($S$400:S400,0,0,COUNTA($S$400:S400),1)),SUMIF($R$19:$R$348,$P401,$Z$19:$Z$348))","v":0},null,null,null,null,{"$f":"IF(P402=\"\",$X$422-SUM(OFFSET($X$400:X400,0,0,COUNTA($X$400:X400),1)),ROUND(S401*(1+BDI.Taxa),2))","v":0},null,null,{"$f":"IF(P402=\"\",$AA$422-SUM(OFFSET($AA$400:AA400,0,0,COUNTA($AA$400:AA400),1)),ROUND(X401*100/ORÇAMENTO.TotalOrçamento,2))","v":{"$error":"#DIV/0!"}}]
[null,null,null,null,null,null,null,null,null,null,null,null,null,null,"2.","2. SANITÁRIO FEMININO E MASCULINO",null,null,{"$f":"IF(P403=\"\",$S$422-SUM(OFFSET($S$400:S401,0,0,COUNTA($S$400:S401),1)),SUMIF($R$19:$R$348,$P402,$Z$19:$Z$348))","v":0},null,null,null,null,{"$f":"IF(P403=\"\",$X$422-SUM(OFFSET($X$400:X401,0,0,COUNTA($X$400:X401),1)),ROUND(S402*(1+BDI.Taxa),2))","v":0},null,null,{"$f":"IF(P403=\"\",$AA$422-SUM(OFFSET($AA$400:AA401,0,0,COUNTA($AA$400:AA401),1)),ROUND(X402*100/ORÇAMENTO.TotalOrçamento,2))","v":{"$error":"#DIV/0!"}}]
[null,null,null,null,null,null,null,null,null,null,null,null,null,null,"3.","3. COBERTURA",null,null,{"$f":"IF(P404=\"\",$S$422-SUM(OFFSET($S$400:S402,0,0,COUNTA($S$400:S402),1)),SUMIF($R$19:$R$348,$P403,$Z$19:$Z$348))","v":0},null,null,null,null,{"$f":"IF(P404=\"\",$X$422-SUM(OFFSET($X$400:X402,0,0,COUNTA($X$400:X402),1)),ROUND(S403*(1+BDI.Taxa),2))","v":0},null,null,{"$f":"IF(P404=\"\",$AA$422-SUM(OFFSET($AA$400:AA402,0,0,COUNTA($AA$400:AA402),1)),ROUND(X403*100/ORÇAMENTO.TotalOrçamento,2))","v":{"$error":"#DIV/0!"}}]
[null,null,null,null,null,null,null,null,null,null,null,null,null,null,"4.","PROJETO DE ESTRUTURAS METÁLICAS",null,null,{"$f":"IF(P405=\"\",$S$422-SUM(OFFSET($S$400:S403,0,0,COUNTA($S$400:S403),1)),SUMIF($R$19:$R$348,$P404,$Z$19:$Z$348))","v":0},null,null,null,null,{"$f":"IF(P405=\"\",$X$422-SUM(OFFSET($X$400:X403,0,0,COUNTA($X$400:X403),1)),ROUND(S404*(1+BDI.Taxa),2))","v":0},null,null,{"$f":"IF(P405=\"\",$AA$422-SUM(OFFSET($AA$400:AA403,0,0,COUNTA($AA$400:AA403),1)),ROUND(X404*100/ORÇAMENTO.TotalOrçamento,2))","v":{"$error":"#DIV/0!"}}]
[null,null,null,null,null,null,null,null,null,null,null,null,null,null,"5.","4. PINTURA GERAL",null,null,{"$f":"IF(P406=\"\",$S$422-SUM(OFFSET($S$400:S404,0,0,COUNTA($S$400:S404),1)),SUMIF($R$19:$R$348,$P405,$Z$19:$Z$348))","v":0},null,null,null,null,{"$f":"IF(P406=\"\",$X$422-SUM(OFFSET($X$400:X404,0,0,COUNTA($X$400:X404),1)),ROUND(S405*(1+BDI.Taxa),2))","v":0},null,null,{"$f":"IF(P406=\"\",$AA$422-SUM(OFFSET($AA$400:AA404,0,0,COUNTA($AA$400:AA404),1)),ROUND(X405*100/ORÇAMENTO.TotalOrçamento,2))","v":{"$error":"#DIV/0!"}}]
[null,null,null,null,null,null,null,null,null,null,null,null,null,null,"6.","5. CENTRAL DE GÁS",null,null,{"$f":"IF(P407=\"\",$S$422-SUM(OFFSET($S$400:S405,0,0,COUNTA($S$400:S405),1)),SUMIF($R$19:$R$348,$P406,$Z$19:$Z$348))","v":0},null,null,null,null,{"$f":"IF(P407=\"\",$X$422-SUM(OFFSET($X$400:X405,0,0,COUNTA($X$400:X405),1)),ROUND(S406*(1+BDI.Taxa),2))","v":0},null,null,{"$f":"IF(P407=\"\",$AA$422-SUM(OFFSET($AA$400:AA405,0,0,COUNTA($AA$400:AA405),1)),ROUND(X406*100/ORÇAMENTO.TotalOrçamento,2))","v":{"$error":"#DIV/0!"}}]
[null,null,null,null,null,null,null,null,null,null,null,null,null,null,"7.","6 . BLOCO 01",null,null,{"$f":"IF(P408=\"\",$S$422-SUM(OFFSET($S$400:S406,0,0,COUNTA($S$400:S406),1)),SUMIF($R$19:$R$348,$P407,$Z$19:$Z$348))","v":0},null,null,null,null,{"$f":"IF(P408=\"\",$X$422-SUM(OFFSET($X$400:X406,0,0,COUNTA($X$400:X406),1)),ROUND(S407*(1+BDI.Taxa),2))","v":0},null,null,{"$f":"IF(P408=\"\",$AA$422-SUM(OFFSET($AA$400:AA406,0,0,COUNTA($AA$400:AA406),1)),ROUND(X407*100/ORÇAMENTO.TotalOrçamento,2))","v":{"$error":"#DIV/0!"}}]
[null,null,null,null,null,null,null,null,null,null,null,null,null,null,"8.","7. CALÇADAS, CIRCULAÇÃO PRINCIPAL E RECEPÇÃO",null,null,{"$f":"IF(P409=\"\",$S$422-SUM(OFFSET($S$400:S407,0,0,COUNTA($S$400:S407),1)),SUMIF($R$19:$R$348,$P408,$Z$19:$Z$348))","v":0},null,null,null,null,{"$f":"IF(P409=\"\",$X$422-SUM(OFFSET($X$400:X407,0,0,COUNTA($X$400:X407),1)),ROUND(S408*(1+BDI.Taxa),2))","v":0},null,null,{"$f":"IF(P409=\"\",$AA$422-SUM(OFFSET($AA$400:AA407,0,0,COUNTA($AA$400:AA407),1)),ROUND(X408*100/ORÇAMENTO.TotalOrçamento,2))","v":{"$error":"#DIV/0!"}}]
[null,null,null,null,null,null,null,null,null,null,null,null,null,null,"9.","PROJETO HIDROSSANITÁRIO",null,null,{"$f":"IF(P410=\"\",$S$422-SUM(OFFSET($S$400:S408,0,0,COUNTA($S$400:S408),1)),SUMIF($R$19:$R$348,$P409,$Z$19:$Z$348))","v":0},null,null,null,null,{"$f":"IF(P410=\"\",$X$422-SUM(OFFSET($X$400:X408,0,0,COUNTA($X$400:X408),1)),ROUND(S409*(1+BDI.Taxa),2))","v":0},null,null,{"$f":"IF(P410=\"\",$AA$422-SUM(OFFSET($AA$400:AA408,0,0,COUNTA($AA$400:AA408),1)),ROUND(X409*100/ORÇAMENTO.TotalOrçamento,2))","v":{"$error":"#DIV/0!"}}]
[null,null,null,null,null,null,null,null,null,null,null,null,null,null,"10.","PROJETO DE PREVENÇÃO E COMBATE A INCÊNDIO",null,null,{"$f":"IF(P411=\"\",$S$422-SUM(OFFSET($S$400:S409,0,0,COUNTA($S$400:S409),1)),SUMIF($R$19:$R$348,$P410,$Z$19:$Z$348))","v":0},null,null,null,null,{"$f":"IF(P411=\"\",$X$422-SUM(OFFSET($X$400:X409,0,0,COUNTA($X$400:X409),1)),ROUND(S410*(1+BDI.Taxa),2))","v":0},null,null,{"$f":"IF(P411=\"\",$AA$422-SUM(OFFSET($AA$400:AA409,0,0,COUNTA($AA$400:AA409),1)),ROUND(X410*100/ORÇAMENTO.TotalOrçamento,2))","v":{"$error":"#DIV/0!"}}]
[null,null,null,null,null,null,null,null,null,null,null,null,null,null,"11.","PROJETO DE GÁS",null,null,{"$f":"IF(P412=\"\",$S$422-SUM(OFFSET($S$400:S410,0,0,COUNTA($S$400:S410),1)),SUMIF($R$19:$R$348,$P411,$Z$19:$Z$348))","v":0},null,null,null,null,{"$f":"IF(P412=\"\",$X$422-SUM(OFFSET($X$400:X410,0,0,COUNTA($X$400:X410),1)),ROUND(S411*(1+BDI.Taxa),2))","v":0},null,null,{"$f":"IF(P412=\"\",$AA$422-SUM(OFFSET($AA$400:AA410,0,0,COUNTA($AA$400:AA410),1)),ROUND(X411*100/ORÇAMENTO.TotalOrçamento,2))","v":{"$error":"#DIV/0!"}}]
[null,null,null,null,null,null,null,null,null,null,null,null,null,null,"12.","ADMINISTRAÇÃO LOCAL",null,null,{"$f":"IF(P413=\"\",$S$422-SUM(OFFSET($S$400:S411,0,0,COUNTA($S$400:S411),1)),SUMIF($R$19:$R$348,$P412,$Z$19:$Z$348))","v":0},null,null,null,null,{"$f":"IF(P413=\"\",$X$422-SUM(OFFSET($X$400:X411,0,0,COUNTA($X$400:X411),1)),ROUND(S412*(1+BDI.Taxa),2))","v":0},null,null,{"$f":"IF(P413=\"\",$AA$422-SUM(OFFSET($AA$400:AA411,0,0,COUNTA($AA$400:AA411),1)),ROUND(X412*100/ORÇAMENTO.TotalOrçamento,2))","v":{"$error":"#DIV/0!"}}]
[null,null,null,null,null,null,null,null,null,null,null,null,null,null,"13.","OBRA",null,null,{"$f":"IF(P414=\"\",$S$422-SUM(OFFSET($S$400:S412,0,0,COUNTA($S$400:S412),1)),SUMIF($R$19:$R$348,$P413,$Z$19:$Z$348))","v":0},null,null,null,null,{"$f":"IF(P414=\"\",$X$422-SUM(OFFSET($X$400:X412,0,0,COUNTA($X$400:X412),1)),ROUND(S413*(1+BDI.Taxa),2))","v":0},null,null,{"$f":"IF(P414=\"\",$AA$422-SUM(OFFSET($AA$400:AA412,0,0,COUNTA($AA$400:AA412),1)),ROUND(X413*100/ORÇAMENTO.TotalOrçamento,2))","v":{"$error":"#DIV/0!"}}]
[null,null,null,null,null,null,null,null,null,null,null,null,null,null,"14.","PROJETO ELÉTRICO",null,null,{"$f":"IF(P415=\"\",$S$422-SUM(OFFSET($S$400:S413,0,0,COUNTA($S$400:S413),1)),SUMIF($R$19:$R$348,$P414,$Z$19:$Z$348))","v":0},null,null,null,null,{"$f":"IF(P415=\"\",$X$422-SUM(OFFSET($X$400:X413,0,0,COUNTA($X$400:X413),1)),ROUND(S414*(1+BDI.Taxa),2))","v":0},null,null,{"$f":"IF(P415=\"\",$AA$422-SUM(OFFSET($AA$400:AA413,0,0,COUNTA($AA$400:AA413),1)),ROUND(X414*100/ORÇAMENTO.TotalOrçamento,2))","v":{"$error":"#DIV/0!"}}]
[null,null,null,null,null,null,null,null,null,null,null,null,null,null,"15.","",null,null,{"$f":"IF(P416=\"\",$S$422-SUM(OFFSET($S$400:S414,0,0,COUNTA($S$400:S414),1)),SUMIF($R$19:$R$348,$P415,$Z$19:$Z$348))","v":0},null,null,null,null,{"$f":"IF(P416=\"\",$X$422-SUM(OFFSET($X$400:X414,0,0,COUNTA($X$400:X414),1)),ROUND(S415*(1+BDI.Taxa),2))","v":0},null,null,{"$f":"IF(P416=\"\",$AA$422-SUM(OFFSET($AA$400:AA414,0,0,COUNTA($AA$400:AA414),1)),ROUND(X415*100/ORÇAMENTO.TotalOrçamento,2))","v":{"$error":"#DIV/0!"}}]
[null,null,null,null,null,null,null,null,null,null,null,null,null,null,"16.","",null,null,{"$f":"IF(P417=\"\",$S$422-SUM(OFFSET($S$400:S415,0,0,COUNTA($S$400:S415),1)),SUMIF($R$19:$R$348,$P416,$Z$19:$Z$348))","v":0},null,null,null,null,{"$f":"IF(P417=\"\",$X$422-SUM(OFFSET($X$400:X415,0,0,COUNTA($X$400:X415),1)),ROUND(S416*(1+BDI.Taxa),2))","v":0},null,null,{"$f":"IF(P417=\"\",$AA$422-SUM(OFFSET($AA$400:AA415,0,0,COUNTA($AA$400:AA415),1)),ROUND(X416*100/ORÇAMENTO.TotalOrçamento,2))","v":{"$error":"#DIV/0!"}}]
[null,null,null,null,null,null,null,null,null,null,null,null,null,null,"17.","",null,null,{"$f":"IF(P418=\"\",$S$422-SUM(OFFSET($S$400:S416,0,0,COUNTA($S$400:S416),1)),SUMIF($R$19:$R$348,$P417,$Z$19:$Z$348))","v":0},null,null,null,null,{"$f":"IF(P418=\"\",$X$422-SUM(OFFSET($X$400:X416,0,0,COUNTA($X$400:X416),1)),ROUND(S417*(1+BDI.Taxa),2))","v":0},null,null,{"$f":"IF(P418=\"\",$AA$422-SUM(OFFSET($AA$400:AA416,0,0,COUNTA($AA$400:AA416),1)),ROUND(X417*100/ORÇAMENTO.TotalOrçamento,2))","v":{"$error":"#DIV/0!"}}]
[null,null,null,null,null,null,null,null,null,null,null,null,null,null,"18.","",null,null,{"$f":"IF(P419=\"\",$S$422-SUM(OFFSET($S$400:S417,0,0,COUNTA($S$400:S417),1)),SUMIF($R$19:$R$348,$P418,$Z$19:$Z$348))","v":0},null,null,null,null,{"$f":"IF(P419=\"\",$X$422-SUM(OFFSET($X$400:X417,0,0,COUNTA($X$400:X417),1)),ROUND(S418*(1+BDI.Taxa),2))","v":0},null,null,{"$f":"IF(P419=\"\",$AA$422-SUM(OFFSET($AA$400:AA417,0,0,COUNTA($AA$400:AA417),1)),ROUND(X418*100/ORÇAMENTO.TotalOrçamento,2))","v":{"$error":"#DIV/0!"}}]
[null,null,null,null,null,null,null,null,null,null,null,null,null,null,"19.","",null,null,{"$f":"IF(P420=\"\",$S$422-SUM(OFFSET($S$400:S418,0,0,COUNTA($S$400:S418),1)),SUMIF($R$19:$R$348,$P419,$Z$19:$Z$348))","v":0},null,null,null,null,{"$f":"IF(P420=\"\",$X$422-SUM(OFFSET($X$400:X418,0,0,COUNTA($X$400:X418),1)),ROUND(S419*(1+BDI.Taxa),2))","v":0},null,null,{"$f":"IF(P420=\"\",$AA$422-SUM(OFFSET($AA$400:AA418,0,0,COUNTA($AA$400:AA418),1)),ROUND(X419*100/ORÇAMENTO.TotalOrçamento,2))","v":{"$error":"#DIV/0!"}}]
[null,null,null,null,null,null,null,null,null,null,null,null,null,null,"20.","",null,null,{"$f":"IF(P421=\"\",$S$422-SUM(OFFSET($S$400:S419,0,0,COUNTA($S$400:S419),1)),SUMIF($R$19:$R$348,$P420,$Z$19:$Z$348))","v":0},null,null,null,null,{"$f":"IF(P421=\"\",$X$422-SUM(OFFSET($X$400:X419,0,0,COUNTA($X$400:X419),1)),ROUND(S420*(1+BDI.Taxa),2))","v":0},null,null,{"$f":"IF(P421=\"\",$AA$422-SUM(OFFSET($AA$400:AA419,0,0,COUNTA($AA$400:AA419),1)),ROUND(X420*100/ORÇAMENTO.TotalOrçamento,2))","v":{"$error":"#DIV/0!"}}]
[null,null,null,null,null,null,null,null,null,null,null,null,null,null,"TOTAL GERAL DO ORÇAMENTO (R$)",null,null,null,{"$f":"SUM(S401:W420)","v":0},null,null,null,null,{"$f":"SUM(X401:Y420)","v":0},null,null,{"$f":"SUM(AA401:AA420)","v":{"$error":"#DIV/0!"}}]
[null,null,null,null,null,null,null,null,null,null,null,null,null,null,null,null,null,null,{"$f":"$Z$349","v":0},null,null,null,null,{"$f":"$Z$351","v":0},null,null,100]
[null,null,null,null,null,null,null,null,null,null,null,null,null,null,null,null,null,null,"(TOTAL SEM BDI)",null,null,null,null,"(TOTAL COM BDI)",null,null,"(ARRED porcentagem)"]
[null,null,null,null,null,null,null,null,null,null,null,null,null,null,null,null,null,null,{"$f":"IF(AND(S421=S422,S421>0),\"OK\",\"ERRO\")","v":"ERRO"},null,null,null,null,{"$f":"IF(AND(X421=X422,X421>0),\"OK\",\"ERRO\")","v":"ERRO"},null,null,{"$f":"IF(AND(AA421=100,S401<>0),\"OK\",\"ERRO\")","v":{"$error":"#DIV/0!"}}]

{"sheet":"Resumo ","index":1,"n_rows":39,"n_cols":9,"rows_kept":39,"cut":false,"hidden":false,"merged":[[42,3,42,7],[41,3,41,7],[38,1,38,8],[22,2,22,5],[23,2,23,5],[24,2,24,5],[25,2,25,5],[26,2,26,5],[32,2,32,5],[33,2,33,5],[34,2,34,5],[35,2,35,5],[27,2,27,5],[28,2,28,5],[29,2,29,5],[30,2,30,5],[31,2,31,5],[1,1,1,8],[2,6,2,8],[3,6,3,8],[4,1,4,8],[5,6,5,8],[6,6,6,8],[7,1,7,8],[8,6,8,8],[9,6,9,8],[13,1,13,8],[11,1,11,2],[12,1,12,2],[0,1,0,8],[36,1,36,5],[2,1,2,5],[3,1,3,5],[5,1,5,5],[6,1,6,5],[8,1,8,5],[9,1,9,5],[11,3,11,5],[12,3,12,5],[10,1,10,8],[11,6,11,8],[12,6,12,8],[19,2,19,5],[20,2,20,5],[21,2,21,5],[13,0,14,0],[15,2,15,5],[16,2,16,5],[17,2,17,5],[18,2,18,5],[14,1,14,8]]}
[]
[]
[null,"UNIDADE ESCOLAR",null,null,null,null,"CÓDIGO INEP"]
[null,{"$f":"Orçamento!$O$4","v":"ESCOLA ESTADUAL LUIZ ALVES MACHADO"},null,null,null,null,{"$f":"Orçamento!X4","v":52017320}]
[]
[null,"OBRA",null,null,null,null,"CIDADE"]
[null,{"$f":"Orçamento!$O$7","v":"REFORMA"},null,null,null,null,{"$f":"Orçamento!$X$7","v":"ITAPACI"}]
[]
[null,"ENDEREÇO",null,null,null,null,"CRE"]
[null,{"$f":"Orçamento!$R$10","v":" AV GOIAS 155 , CENTRO , CEP: 7636-000"},null,null,null,null,{"$f":"Orçamento!$O$10","v":"CRE-ITAPACI"}]
[]
[null,"REFERÊNCIA",null,"DATA",null,null,"ÁREA TOTAL CONSTRUÍDA (M²)"]
[null,{"$f":"CONCATENATE(\"AGETOP E SINAPI - \",Orçamento!$T$10)","v":"AGETOP E SINAPI - ONERADA"},null,{"$f":"Orçamento!$S$7","v":"2020-05-25"},null,null,{"$f":"Orçamento!$X$13","v":926.8}]
["FILTRO"]
[null,"RESUMO GERAL DO ORÇAMENTO"]
["↓","ITEM","DESCRIÇÃO DOS SERVIÇOS",null,null,null,"PREÇO SEM BDI","PREÇO COM BDI","PARTICIP. (%)"]
[{"$f":"IF(G17>0,\"F\",\"\")","v":""},"1.",{"$f":"Orçamento!$P401","v":"1. COZINHA E DESPENSA"},null,null,null,{"$f":"IFERROR(Orçamento!S401,\"-\")","v":0},{"$f":"IFERROR(Orçamento!X401,\"\")","v":0},{"$f":"Orçamento!AA401","v":{"$error":"#DIV/0!"}}]
[{"$f":"IF(G18>0,\"F\",\"\")","v":""},"2.",{"$f":"Orçamento!$P402","v":"2. SANITÁRIO FEMININO E MASCULINO"},null,null,null,{"$f":"IFERROR(Orçamento!S402,\"-\")","v":0},{"$f":"IFERROR(Orçamento!X402,\"\")","v":0},{"$f":"Orçamento!AA402","v":{"$error":"#DIV/0!"}}]
["","3.",{"$f":"Orçamento!$P403","v":"3. COBERTURA"},null,null,null,{"$f":"IFERROR(Orçamento!S403,\"-\")","v":0},{"$f":"IFERROR(Orçamento!X403,\"\")","v":0},{"$f":"Orçamento!AA403","v":{"$error":"#DIV/0!"}}]
["","4.",{"$f":"Orçamento!$P404","v":"PROJETO DE ESTRUTURAS METÁLICAS"},null,null,null,{"$f":"IFERROR(Orçamento!S404,\"-\")","v":0},{"$f":"IFERROR(Orçamento!X404,\"\")","v":0},{"$f":"Orçamento!AA404","v":{"$error":"#DIV/0!"}}]
["","5.",{"$f":"Orçamento!$P405","v":"4. PINTURA GERAL"},null,null,null,{"$f":"IFERROR(Orçamento!S405,\"-\")","v":0},{"$f":"IFERROR(Orçamento!X405,\"\")","v":0},{"$f":"Orçamento!AA405","v":{"$error":"#DIV/0!"}}]
["","6.",{"$f":"Orçamento!$P406","v":"5. CENTRAL DE GÁS"},null,null,null,{"$f":"IFERROR(Orçamento!S406,\"-\")","v":0},{"$f":"IFERROR(Orçamento!X406,\"\")","v":0},{"$f":"Orçamento!AA406","v":{"$error":"#DIV/0!"}}]
["","7.",{"$f":"Orçamento!$P407","v":"6 . BLOCO 01"},null,null,null,{"$f":"IFERROR(Orçamento!S407,\"-\")","v":0},{"$f":"IFERROR(Orçamento!X407,\"\")","v":0},{"$f":"Orçamento!AA407","v":{"$error":"#DIV/0!"}}]
["","8.",{"$f":"Orçamento!$P408","v":"7. CALÇADAS, CIRCULAÇÃO PRINCIPAL E RECEPÇÃO"},null,null,null,{"$f":"IFERROR(Orçamento!S408,\"-\")","v":0},{"$f":"IFERROR(Orçamento!X408,\"\")","v":0},{"$f":"Orçamento!AA408","v":{"$error":"#DIV/0!"}}]
["","9.",{"$f":"Orçamento!$P409","v":"PROJETO HIDROSSANITÁRIO"},null,null,null,{"$f":"IFERROR(Orçamento!S409,\"-\")","v":0},{"$f":"IFERROR(Orçamento!X409,\"\")","v":0},{"$f":"Orçamento!AA409","v":{"$error":"#DIV/0!"}}]
["","10.",{"$f":"Orçamento!$P410","v":"PROJETO DE PREVENÇÃO E COMBATE A INCÊNDIO"},null,null,null,{"$f":"IFERROR(Orçamento!S410,\"-\")","v":0},{"$f":"IFERROR(Orçamento!X410,\"\")","v":0},{"$f":"Orçamento!AA410","v":{"$error":"#DIV/0!"}}]
["","11.",{"$f":"Orçamento!$P411","v":"PROJETO DE GÁS"},null,null,null,{"$f":"IFERROR(Orçamento!S411,\"-\")","v":0},{"$f":"IFERROR(Orçamento!X411,\"\")","v":0},{"$f":"Orçamento!AA411","v":{"$error":"#DIV/0!"}}]
["","12.",{"$f":"Orçamento!$P412","v":"ADMINISTRAÇÃO LOCAL"},null,null,null,{"$f":"IFERROR(Orçamento!S412,\"-\")","v":0},{"$f":"IFERROR(Orçamento!X412,\"\")","v":0},{"$f":"Orçamento!AA412","v":{"$error":"#DIV/0!"}}]
["","13.",{"$f":"Orçamento!$P413","v":"OBRA"},null,null,null,{"$f":"IFERROR(Orçamento!S413,\"-\")","v":0},{"$f":"IFERROR(Orçamento!X413,\"\")","v":0},{"$f":"Orçamento!AA413","v":{"$error":"#DIV/0!"}}]
["","14.",{"$f":"Orçamento!$P414","v":"PROJETO ELÉTRICO"},null,null,null,{"$f":"IFERROR(Orçamento!S414,\"-\")","v":0},{"$f":"IFERROR(Orçamento!X414,\"\")","v":0},{"$f":"Orçamento!AA414","v":{"$error":"#DIV/0!"}}]
["","15.",{"$f":"Orçamento!$P415","v":""},null,null,null,{"$f":"IFERROR(Orçamento!S415,\"-\")","v":0},{"$f":"IFERROR(Orçamento!X415,\"\")","v":0},{"$f":"Orçamento!AA415","v":{"$error":"#DIV/0!"}}]
["","16.",{"$f":"Orçamento!$P416","v":""},null,null,null,{"$f":"IFERROR(Orçamento!S416,\"-\")","v":0},{"$f":"IFERROR(Orçamento!X416,\"\")","v":0},{"$f":"Orçamento!AA416","v":{"$error":"#DIV/0!"}}]
["","17.",{"$f":"Orçamento!$P417","v":""},null,null,null,{"$f":"IFERROR(Orçamento!S417,\"-\")","v":0},{"$f":"IFERROR(Orçamento!X417,\"\")","v":0},{"$f":"Orçamento!AA417","v":{"$error":"#DIV/0!"}}]
["","18.",{"$f":"Orçamento!$P418","v":""},null,null,null,{"$f":"IFERROR(Orçamento!S418,\"-\")","v":0},{"$f":"IFERROR(Orçamento!X418,\"\")","v":0},{"$f":"Orçamento!AA418","v":{"$error":"#DIV/0!"}}]
["","19.",{"$f":"Orçamento!$P419","v":""},null,null,null,{"$f":"IFERROR(Orçamento!S419,\"-\")","v":0},{"$f":"IFERROR(Orçamento!X419,\"\")","v":0},{"$f":"Orçamento!AA419","v":{"$error":"#DIV/0!"}}]
["","20.",{"$f":"Orçamento!$P420","v":""},null,null,null,{"$f":"IFERROR(Orçamento!S420,\"-\")","v":0},{"$f":"IFERROR(Orçamento!X420,\"\")","v":0},{"$f":"Orçamento!AA420","v":{"$error":"#DIV/0!"}}]
["F","TOTAL GERAL DO ORÇAMENTO (R$)",null,null,null,null,{"$f":"SUM(G17:G36)","v":0},0,{"$f":"SUM(I17:I36)","v":{"$error":"#DIV/0!"}}]
["F"]
["F"]

{"sheet":"Somatório","index":2,"n_rows":45,"n_cols":6,"rows_kept":45,"cut":false,"hidden":false,"merged":[[0,1,0,5],[14,1,14,5],[2,1,2,3],[2,4,2,5],[3,1,3,3],[3,4,3,5],[5,1,5,3],[5,4,5,5],[6,1,6,3],[6,4,6,5],[8,1,8,3],[8,4,8,5],[1,1,1,5],[4,1,4,5],[7,1,7,5],[10,1,10,5],[9,1,9,3],[9,4,9,5],[11,1,11,2],[11,4,11,5],[12,1,12,2],[12,4,12,5],[13,0,14,0],[42,1,42,2],[44,1,44,5],[47,3,47,5],[48,3,48,5],[13,1,13,5]]}
[]
[]
[null,"UNIDADE ESCOLAR",null,null,"CÓDIGO INEP"]
[null,{"$f":"Orçamento!$O$4","v":"ESCOLA ESTADUAL LUIZ ALVES MACHADO"},null,null,{"$f":"Orçamento!X4","v":52017320}]
[]
[null,"OBRA",null,null,"CIDADE"]
[null,{"$f":"Orçamento!$O$7","v":"REFORMA"},null,null,{"$f":"Orçamento!$X$7","v":"ITAPACI"}]
[]
[null,"ENDEREÇO",null,null,"CRE"]
[null,{"$f":"Orçamento!$R$10","v":" AV GOIAS 155 , CENTRO , CEP: 7636-000"},null,null,{"$f":"Orçamento!$O$10","v":"CRE-ITAPACI"}]
[]
[null,"REFERÊNCIA",null,"DATA","ÁREA TOTAL CONSTRUÍDA (M²)"]
[null,{"$f":"CONCATENATE(\"AGETOP E SINAPI - \",Orçamento!$T$10)","v":"AGETOP E SINAPI - ONERADA"},null,{"$f":"Orçamento!$S$7","v":"2020-05-25"},{"$f":"Orçamento!$X$13","v":926.8}]
["FILTRO"]
[null,"SOMATÓRIO DE SERVIÇOS"]
["↓","ITEM","DESCRIÇÃO DOS SERVIÇOS","PREÇO SEM BDI (R$)","PREÇO COM BDI (R$)","PARTIC.  ( % )"]
[{"$f":"IF(D17>0,\"F\",\"\")","v":""},"a.",{"$f":"Orçamento!P367","v":"SERVIÇOS PRELIMINARES"},{"$f":"Orçamento!S367","v":0},{"$f":"Orçamento!X367","v":0},{"$f":"Orçamento!AA367","v":0}]
[{"$f":"IF(D18>0,\"F\",\"\")","v":""},"b.",{"$f":"Orçamento!P368","v":"TRANSPORTES"},{"$f":"Orçamento!S368","v":0},{"$f":"Orçamento!X368","v":0},{"$f":"Orçamento!AA368","v":0}]
["","c.",{"$f":"Orçamento!P369","v":"SERVIÇO EM TERRA"},{"$f":"Orçamento!S369","v":0},{"$f":"Orçamento!X369","v":0},{"$f":"Orçamento!AA369","v":0}]
["","d.",{"$f":"Orçamento!P370","v":"FUNDAÇÕES E SONDAGENS"},{"$f":"Orçamento!S370","v":0},{"$f":"Orçamento!X370","v":0},{"$f":"Orçamento!AA370","v":0}]
["","e.",{"$f":"Orçamento!P371","v":"ESTRUTURA"},{"$f":"Orçamento!S371","v":0},{"$f":"Orçamento!X371","v":0},{"$f":"Orçamento!AA371","v":0}]
["","f.",{"$f":"Orçamento!P372","v":"INSTALAÇÕES ELÉTRICAS"},{"$f":"Orçamento!S372","v":0},{"$f":"Orçamento!X372","v":0},{"$f":"Orçamento!AA372","v":0}]
["","g.",{"$f":"Orçamento!P373","v":"INSTALAÇÕES HIDROSSANITÁRIAS"},{"$f":"Orçamento!S373","v":0},{"$f":"Orçamento!X373","v":0},{"$f":"Orçamento!AA373","v":0}]
["","h",{"$f":"Orçamento!P374","v":"INSTALAÇÕES ESPECIAIS"},{"$f":"Orçamento!S374","v":0},{"$f":"Orçamento!X374","v":0},{"$f":"Orçamento!AA374","v":0}]
["","i.",{"$f":"Orçamento!P375","v":"ALVENARIAS E DIVISÓRIAS"},{"$f":"Orçamento!S375","v":0},{"$f":"Orçamento!X375","v":0},{"$f":"Orçamento!AA375","v":0}]
["","j.",{"$f":"Orçamento!P376","v":"ALVENARIA AUTO-PORTANTE"},{"$f":"Orçamento!S376","v":0},{"$f":"Orçamento!X376","v":0},{"$f":"Orçamento!AA376","v":0}]
["","k.",{"$f":"Orçamento!P377","v":"IMPERMEABILIZAÇÃO"},{"$f":"Orçamento!S377","v":0},{"$f":"Orçamento!X377","v":0},{"$f":"Orçamento!AA377","v":0}]
["","l.",{"$f":"Orçamento!P378","v":"ISOLAMENTO TÉRMICO E ACÚSTICO"},{"$f":"Orçamento!S378","v":0},{"$f":"Orçamento!X378","v":0},{"$f":"Orçamento!AA378","v":0}]
["","m.",{"$f":"Orçamento!P379","v":"ESTRUTURA DE MADEIRA"},{"$f":"Orçamento!S379","v":0},{"$f":"Orçamento!X379","v":0},{"$f":"Orçamento!AA379","v":0}]
["","n.",{"$f":"Orçamento!P380","v":"ESTRUTURAS METÁLICAS"},{"$f":"Orçamento!S380","v":0},{"$f":"Orçamento!X380","v":0},{"$f":"Orçamento!AA380","v":0}]
["","o.",{"$f":"Orçamento!P381","v":"COBERTURAS"},{"$f":"Orçamento!S381","v":0},{"$f":"Orçamento!X381","v":0},{"$f":"Orçamento!AA381","v":0}]
["","p.",{"$f":"Orçamento!P382","v":"ESQUADRIAS DE MADEIRA"},{"$f":"Orçamento!S382","v":0},{"$f":"Orçamento!X382","v":0},{"$f":"Orçamento!AA382","v":0}]
["","q.",{"$f":"Orçamento!P383","v":"ESQUADRIAS METÁLICAS"},{"$f":"Orçamento!S383","v":0},{"$f":"Orçamento!X383","v":0},{"$f":"Orçamento!AA383","v":0}]
["","r.",{"$f":"Orçamento!P384","v":"VIDROS"},{"$f":"Orçamento!S384","v":0},{"$f":"Orçamento!X384","v":0},{"$f":"Orçamento!AA384","v":0}]
["","s.",{"$f":"Orçamento!P385","v":"REVESTIMENTO DE PAREDE"},{"$f":"Orçamento!S385","v":0},{"$f":"Orçamento!X385","v":0},{"$f":"Orçamento!AA385","v":0}]
["","t.",{"$f":"Orçamento!P386","v":"FORROS"},{"$f":"Orçamento!S386","v":0},{"$f":"Orçamento!X386","v":0},{"$f":"Orçamento!AA386","v":0}]
["","u.",{"$f":"Orçamento!P387","v":"REVESTIMENTO DE PISO"},{"$f":"Orçamento!S387","v":0},{"$f":"Orçamento!X387","v":0},{"$f":"Orçamento!AA387","v":0}]
["","v.",{"$f":"Orçamento!P388","v":"FERRAGENS"},{"$f":"Orçamento!S388","v":0},{"$f":"Orçamento!X388","v":0},{"$f":"Orçamento!AA388","v":0}]
["","w.",{"$f":"Orçamento!P389","v":"MARCENARIA"},{"$f":"Orçamento!S389","v":0},{"$f":"Orçamento!X389","v":0},{"$f":"Orçamento!AA389","v":0}]
["","x.",{"$f":"Orçamento!P390","v":"ADMINISTRAÇÃO"},{"$f":"Orçamento!S390","v":0},{"$f":"Orçamento!X390","v":0},{"$f":"Orçamento!AA390","v":0}]
["","y.",{"$f":"Orçamento!P391","v":"PINTURA"},{"$f":"Orçamento!S391","v":0},{"$f":"Orçamento!X391","v":0},{"$f":"Orçamento!AA391","v":0}]
["","z.",{"$f":"Orçamento!P392","v":"DIVERSOS"},{"$f":"Orçamento!S392","v":0},{"$f":"Orçamento!X392","v":0},{"$f":"Orçamento!AA392","v":0}]
["F","TOTAL GERAL DO ORÇAMENTO",null,{"$f":"SUM(D17:D42)","v":0},{"$f":"SUM(E17:E42)","v":0},{"$f":"SUM(F17:F42)","v":0}]
[]
[null,"(*) Para itens da AGETOP, os vidros não estão inclusos nas esquadrias e já foram considerados os custos de contramarco para as esquadrias de alumínio;"]

{"sheet":"Cronog_75_Dias","index":3,"n_rows":99,"n_cols":20,"rows_kept":99,"cut":false,"hidden":false,"merged":[[97,1,97,4],[98,1,98,17],[94,1,94,2],[94,5,94,8],[94,9,94,12],[94,13,94,16],[95,1,95,2],[95,5,95,8],[95,9,95,12],[95,13,95,16],[92,1,92,2],[92,5,92,8],[92,9,92,12],[92,13,92,16],[93,1,93,2],[93,5,93,8],[93,9,93,12],[93,13,93,16],[89,1,91,2],[89,3,91,3],[89,4,91,4],[89,5,89,8],[89,9,89,12],[89,13,89,16],[91,5,91,8],[91,9,91,12],[91,13,91,16],[86,1,88,2],[86,3,88,3],[86,4,88,4],[86,5,86,8],[86,9,86,12],[86,13,86,16],[88,5,88,8],[88,9,88,12],[88,13,88,16],[83,1,85,2],[83,3,85,3],[83,4,85,4],[83,5,83,8],[83,9,83,12],[83,13,83,16],[85,5,85,8],[85,9,85,12],[85,13,85,16],[80,1,82,2],[80,3,82,3],[80,4,82,4],[80,5,80,8],[80,9,80,12],[80,13,80,16],[82,5,82,8],[82,9,82,12],[82,13,82,16],[77,1,79,2],[77,3,79,3],[77,4,79,4],[77,5,77,8],[77,9,77,12],[77,13,77,16],[79,5,79,8],[79,9,79,12],[79,13,79,16],[74,1,76,2],[74,3,76,3],[74,4,76,4],[74,5,74,8],[74,9,74,12],[74,13,74,16],[76,5,76,8],[76,9,76,12],[76,13,76,16],[71,1,73,2],[71,3,73,3],[71,4,73,4],[71,5,71,8],[71,9,71,12],[71,13,71,16],[73,5,73,8],[73,9,73,12],[73,13,73,16],[68,1,70,2],[68,3,70,3],[68,4,70,4],[68,5,68,8],[68,9,68,12],[68,13,68,16],[70,5,70,8],[70,9,70,12],[70,13,70,16],[65,1,67,2],[65,3,67,3],[65,4,67,4],[65,5,65,8],[65,9,65,12],[65,13,65,16],[67,5,67,8],[67,9,67,12],[67,13,67,16],[62,1,64,2],[62,3,64,3],[62,4,64,4],[62,5,62,8],[62,9,62,12],[62,13,62,16],[64,5,64,8],[64,9,64,12],[64,13,64,16],[59,1,61,2],[59,3,61,3],[59,4,61,4],[59,5,59,8],[59,9,59,12],[59,13,59,16],[61,5,61,8],[61,9,61,12],[61,13,61,16],[56,1,58,2],[56,3,58,3],[56,4,58,4],[56,5,56,8],[56,9,56,12],[56,13,56,16],[58,5,58,8],[58,9,58,12],[58,13,58,16],[53,1,55,2],[53,3,55,3],[53,4,55,4],[53,5,53,8],[53,9,53,12],[53,13,53,16],[55,5,55,8],[55,9,55,12],[55,13,55,16],[50,1,52,2],[50,3,52,3],[50,4,52,4],[50,5,50,8],[50,9,50,12],[50,13,50,16],[52,5,52,8],[52,9,52,12],[52,13,52,16],[47,1,49,2],[47,3,49,3],[47,4,49,4],[47,5,47,8],[47,9,47,12],[47,13,47,16],[49,5,49,8],[49,9,49,12],[49,13,49,16],[44,1,46,2],[44,3,46,3],[44,4,46,4],[44,5,44,8],[44,9,44,12],[44,13,44,16],[46,5,46,8],[46,9,46,12],[46,13,46,16],[41,1,43,2],[41,3,43,3],[41,4,43,4],[41,5,41,8],[41,9,41,12],[41,13,41,16],[43,5,43,8],[43,9,43,12],[43,13,43,16],[38,1,40,2],[38,3,40,3],[38,4,40,4],[38,5,38,8],[38,9,38,12],[38,13,38,16],[40,5,40,8],[40,9,40,12],[40,13,40,16],[35,1,37,2],[35,3,37,3],[35,4,37,4],[35,5,35,8],[35,9,35,12],[35,13,35,16],[37,5,37,8],[37,9,37,12],[37,13,37,16],[32,1,34,2],[32,3,34,3],[32,4,34,4],[32,5,32,8],[32,9,32,12],[32,13,32,16],[34,5,34,8],[34,9,34,12],[34,13,34,16],[29,1,31,2],[29,3,31,3],[29,4,31,4],[29,5,29,8],[29,9,29,12],[29,13,29,16],[31,5,31,8],[31,9,31,12],[31,13,31,16],[26,1,28,2],[26,3,28,3],[26,4,28,4],[26,5,26,8],[26,9,26,12],[26,13,26,16],[28,5,28,8],[28,9,28,12],[28,13,28,16],[23,1,25,2],[23,3,25,3],[23,4,25,4],[23,5,23,8],[23,9,23,12],[23,13,23,16],[25,5,25,8],[25,9,25,12],[25,13,25,16],[20,1,22,2],[20,3,22,3],[20,4,22,4],[20,5,20,8],[20,9,20,12],[20,13,20,16],[22,5,22,8],[22,9,22,12],[22,13,22,16],[17,1,19,2],[17,3,19,3],[17,4,19,4],[17,5,17,8],[17,9,17,12],[17,13,17,16],[19,5,19,8],[19,9,19,12],[19,13,19,16],[14,1,16,2],[14,3,16,3],[14,4,16,4],[14,5,14,8],[14,9,14,12],[14,13,14,16],[16,5,16,8],[16,9,16,12],[16,13,16,16],[12,0,13,0],[12,3,13,3],[12,5,12,8],[12,9,12,12],[12,13,12,16],[12,17,13,17],[13,1,13,2],[13,5,13,8],[13,9,13,12],[13,13,13,16],[0,1,0,17],[1,1,1,17],[2,1,2,7],[2,8,2,17],[3,1,3,7],[3,8,3,17],[8,1,8,7],[8,8,8,17],[9,0,11,0],[9,1,9,7],[9,8,9,17],[10,1,10,17],[11,1,11,17],[4,1,4,17],[5,1,5,7],[5,8,5,17],[6,1,6,7],[6,8,6,17],[7,1,7,17]]}
[]
[]
[null,"UNIDADE ESCOLAR",null,null,null,null,null,null,"PRAZO"]
[null,{"$f":"Orçamento!O4","v":"ESCOLA ESTADUAL LUIZ ALVES MACHADO"},null,null,null,null,null,null,"75 DIAS CORRIDOS"]
[]
[null,"OBRA",null,null,null,null,null,null,"DATA"]
[null,{"$f":"Orçamento!O7","v":"REFORMA"},null,null,null,null,null,null,{"$f":"Orçamento!S7","v":"2020-05-25"}]
[]
[null,"LOCAL",null,null,null,null,null,null,"ÁREA TOTAL CONSTRUÍDA (M²)"]
["FILTRO",{"$f":"Orçamento!X7","v":"ITAPACI"},null,null,null,null,null,null,{"$f":"Orçamento!X13","v":926.8}]
[]
[null,"CRONOGRAMA - FÍSICO FINANCEIRO"]
["↓","CUSTO TOTAL:",{"$f":"D93","v":0},"VALOR","Dias:",25,null,null,null,50,null,null,null,75,null,null,null,"TOTAL"]
[null,"DESCRIÇÃO DOS SERVIÇOS",null,null,"%","1ª PARCELA",null,null,null,"2ª PARCELA",null,null,null,"3ª PARCELA"]
[{"$f":"IF(D15>0,\"F\",\"\")","v":""},"SERVIÇOS PRELIMINARES",null,{"$f":"Orçamento!X367","v":0},{"$f":"Orçamento!AA367","v":0},{"$f":"ROUND(F17*$D$15,2)","v":0},null,null,null,{"$f":"ROUND(J17*$D$15,2)","v":0},null,null,null,{"$f":"ROUND(N17*$D$15,2)","v":0},null,null,null,{"$f":"SUM(F15:Q15)","v":0},null,{"$f":"IF(D15=R15,\"OK\",\"ERRO\")","v":"OK"}]
[{"$f":"IF(A15=\"F\",A15,\"\")","v":""}]
[{"$f":"IF(A16=\"F\",A16,\"\")","v":""},null,null,null,null,1,null,null,null,0,null,null,null,{"$f":"1-F17-J17","v":0},null,null,null,{"$f":"IFERROR(E15/100,\"\")","v":0},null,{"$f":"IF(E15=R17*100,\"OK\",\"ERRO\")","v":"OK"}]
[{"$f":"IF(D18>0,\"F\",\"\")","v":""},"TRANSPORTES",null,{"$f":"Orçamento!X368","v":0},{"$f":"Orçamento!AA368","v":0},{"$f":"ROUND(F20*$D$18,2)","v":0},null,null,null,{"$f":"ROUND(J20*$D$18,2)","v":0},null,null,null,{"$f":"ROUND(N20*$D$18,2)","v":0},null,null,null,{"$f":"SUM(F18:Q18)","v":0},null,{"$f":"IF(D18=R18,\"OK\",\"ERRO\")","v":"OK"}]
[{"$f":"IF(A18=\"F\",A18,\"\")","v":""}]
[{"$f":"IF(A19=\"F\",A19,\"\")","v":""},null,null,null,null,0.37,null,null,null,0.3,null,null,null,{"$f":"1-F20-J20","v":0.33},null,null,null,{"$f":"IFERROR(E18/100,\"\")","v":0},null,{"$f":"IF(E18=R20*100,\"OK\",\"ERRO\")","v":"OK"}]
[{"$f":"IF(D21>0,\"F\",\"\")","v":""},"SERVIÇO EM TERRA",null,{"$f":"Orçamento!X369","v":0},{"$f":"Orçamento!AA369","v":0},{"$f":"ROUND(F23*$D$21,2)","v":0},null,null,null,{"$f":"ROUND(J23*$D$21,2)","v":0},null,null,null,{"$f":"ROUND(N23*$D$21,2)","v":0},null,null,null,{"$f":"SUM(F21:Q21)","v":0},null,{"$f":"IF(D21=R21,\"OK\",\"ERRO\")","v":"OK"}]
[{"$f":"IF(A21=\"F\",A21,\"\")","v":""}]
[{"$f":"IF(A22=\"F\",A22,\"\")","v":""},null,null,null,null,1,null,null,null,0,null,null,null,{"$f":"1-F23-J23","v":0},null,null,null,{"$f":"IFERROR(E21/100,\"\")","v":0},null,{"$f":"IF(E21=R23*100,\"OK\",\"ERRO\")","v":"OK"}]
[{"$f":"IF(D24>0,\"F\",\"\")","v":""},"FUNDAÇÕES E SONDAGENS",null,{"$f":"Orçamento!X370","v":0},{"$f":"Orçamento!AA370","v":0},{"$f":"ROUND(F26*$D$24,2)","v":0},null,null,null,{"$f":"ROUND(J26*$D$24,2)","v":0},null,null,null,{"$f":"ROUND(N26*$D$24,2)","v":0},null,null,null,{"$f":"SUM(F24:Q24)","v":0},null,{"$f":"IF(D24=R24,\"OK\",\"ERRO\")","v":"OK"}]
[{"$f":"IF(A24=\"F\",A24,\"\")","v":""}]
[{"$f":"IF(A25=\"F\",A25,\"\")","v":""},null,null,null,null,1,null,null,null,0,null,null,null,{"$f":"1-F26-J26","v":0},null,null,null,{"$f":"IFERROR(E24/100,\"\")","v":0},null,{"$f":"IF(E24=R26*100,\"OK\",\"ERRO\")","v":"OK"}]
[{"$f":"IF(D27>0,\"F\",\"\")","v":""},"ESTRUTURA",null,{"$f":"Orçamento!X371","v":0},{"$f":"Orçamento!AA371","v":0},{"$f":"ROUND(F29*$D$27,2)","v":0},null,null,null,{"$f":"ROUND(J29*$D$27,2)","v":0},null,null,null,{"$f":"ROUND(N29*$D$27,2)","v":0},null,null,null,{"$f":"SUM(F27:Q27)","v":0},null,{"$f":"IF(D27=R27,\"OK\",\"ERRO\")","v":"OK"}]
[{"$f":"IF(A27=\"F\",A27,\"\")","v":""}]
[{"$f":"IF(A28=\"F\",A28,\"\")","v":""},null,null,null,null,0.54,null,null,null,0.46,null,null,null,{"$f":"1-F29-J29","v":0},null,null,null,{"$f":"IFERROR(E27/100,\"\")","v":0},null,{"$f":"IF(E27=R29*100,\"OK\",\"ERRO\")","v":"OK"}]
[{"$f":"IF(D30>0,\"F\",\"\")","v":""},"INST.ELET/TELEFÔNICA/CABEAMENTO ESTRUTURADO",null,{"$f":"Orçamento!X372","v":0},{"$f":"Orçamento!AA372","v":0},{"$f":"ROUND(F32*$D$30,2)","v":0},null,null,null,{"$f":"ROUND(J32*$D$30,2)","v":0},null,null,null,{"$f":"ROUND(N32*$D$30,2)","v":0},null,null,null,{"$f":"SUM(F30:Q30)","v":0},null,{"$f":"IF(D30=R30,\"OK\",\"ERRO\")","v":"OK"}]
[{"$f":"IF(A30=\"F\",A30,\"\")","v":""}]
[{"$f":"IF(A31=\"F\",A31,\"\")","v":""},null,null,null,null,0,null,null,null,{"$f":"1-B32","v":1},null,null,null,{"$f":"1-F32-J32","v":0},null,null,null,{"$f":"IFERROR(E30/100,\"\")","v":0},null,{"$f":"IF(E30=R32*100,\"OK\",\"ERRO\")","v":"OK"}]
[{"$f":"IF(D33>0,\"F\",\"\")","v":""},"INSTALAÇÕES HIDROSSANITÁRIAS",null,{"$f":"Orçamento!X373","v":0},{"$f":"Orçamento!AA373","v":0},{"$f":"ROUND(F35*$D$33,2)","v":0},null,null,null,{"$f":"ROUND(J35*$D$33,2)","v":0},null,null,null,{"$f":"ROUND(N35*$D$33,2)","v":0},null,null,null,{"$f":"SUM(F33:Q33)","v":0},null,{"$f":"IF(D33=R33,\"OK\",\"ERRO\")","v":"OK"}]
[{"$f":"IF(A33=\"F\",A33,\"\")","v":""}]
[{"$f":"IF(A34=\"F\",A34,\"\")","v":""},null,null,null,null,0,null,null,null,{"$f":"1-B35","v":1},null,null,null,{"$f":"1-F35-J35","v":0},null,null,null,{"$f":"IFERROR(E33/100,\"\")","v":0},null,{"$f":"IF(E33=R35*100,\"OK\",\"ERRO\")","v":"OK"}]
[{"$f":"IF(D36>0,\"F\",\"\")","v":""},"INSTALAÇÕES ESPECIAIS",null,{"$f":"Orçamento!X374","v":0},{"$f":"Orçamento!AA374","v":0},{"$f":"ROUND(F38*$D$36,2)","v":0},null,null,null,{"$f":"ROUND(J38*$D$36,2)","v":0},null,null,null,{"$f":"ROUND(N38*$D$36,2)","v":0},null,null,null,{"$f":"SUM(F36:Q36)","v":0},null,{"$f":"IF(D36=R36,\"OK\",\"ERRO\")","v":"OK"}]
[{"$f":"IF(A36=\"F\",A36,\"\")","v":""}]
[{"$f":"IF(A37=\"F\",A37,\"\")","v":""},null,null,null,null,0,null,null,null,{"$f":"1-B38","v":1},null,null,null,{"$f":"1-F38-J38","v":0},null,null,null,{"$f":"IFERROR(E36/100,\"\")","v":0},null,{"$f":"IF(E36=R38*100,\"OK\",\"ERRO\")","v":"OK"}]
[{"$f":"IF(D39>0,\"F\",\"\")","v":""},"ALVENARIA E DIVISÓRIAS",null,{"$f":"Orçamento!X375","v":0},{"$f":"Orçamento!AA375","v":0},{"$f":"ROUND(F41*$D$39,2)","v":0},null,null,null,{"$f":"ROUND(J41*$D$39,2)","v":0},null,null,null,{"$f":"ROUND(N41*$D$39,2)","v":0},null,null,null,{"$f":"SUM(F39:Q39)","v":0},null,{"$f":"IF(D39=R39,\"OK\",\"ERRO\")","v":"OK"}]
[{"$f":"IF(A39=\"F\",A39,\"\")","v":""}]
[{"$f":"IF(A40=\"F\",A40,\"\")","v":""},null,null,null,null,0,null,null,null,{"$f":"1-B41","v":1},null,null,null,{"$f":"1-F41-J41","v":0},null,null,null,{"$f":"IFERROR(E39/100,\"\")","v":0},null,{"$f":"IF(E39=R41*100,\"OK\",\"ERRO\")","v":"OK"}]
[{"$f":"IF(D42>0,\"F\",\"\")","v":""},"ALVENARIA AUTO-PORTANTE",null,{"$f":"Orçamento!X376","v":0},{"$f":"Orçamento!AA376","v":0},{"$f":"ROUND(F44*$D$42,2)","v":0},null,null,null,{"$f":"ROUND(J44*$D$42,2)","v":0},null,null,null,{"$f":"ROUND(N44*$D$42,2)","v":0},null,null,null,{"$f":"SUM(F42:Q42)","v":0},null,{"$f":"IF(D42=R42,\"OK\",\"ERRO\")","v":"OK"}]
[{"$f":"IF(A42=\"F\",A42,\"\")","v":""}]
[{"$f":"IF(A43=\"F\",A43,\"\")","v":""},null,null,null,null,0,null,null,null,{"$f":"1-B44","v":1},null,null,null,{"$f":"1-F44-J44","v":0},null,null,null,{"$f":"IFERROR(E42/100,\"\")","v":0},null,{"$f":"IF(E42=R44*100,\"OK\",\"ERRO\")","v":"OK"}]
[{"$f":"IF(D45>0,\"F\",\"\")","v":""},"IMPERMEABILIZAÇÃO",null,{"$f":"Orçamento!X377","v":0},{"$f":"Orçamento!AA377","v":0},{"$f":"ROUND(F47*$D$45,2)","v":0},null,null,null,{"$f":"ROUND(J47*$D$45,2)","v":0},null,null,null,{"$f":"ROUND(N47*$D$45,2)","v":0},null,null,null,{"$f":"SUM(F45:Q45)","v":0},null,{"$f":"IF(D45=R45,\"OK\",\"ERRO\")","v":"OK"}]
[{"$f":"IF(A45=\"F\",A45,\"\")","v":""}]
[{"$f":"IF(A46=\"F\",A46,\"\")","v":""},null,null,null,null,0.85,null,null,null,0.15,null,null,null,{"$f":"1-F47-J47","v":0},null,null,null,{"$f":"IFERROR(E45/100,\"\")","v":0},null,{"$f":"IF(E45=R47*100,\"OK\",\"ERRO\")","v":"OK"}]
[{"$f":"IF(D48>0,\"F\",\"\")","v":""},"ISOLAMENTO TÉRMICO E ACÚSTICO",null,{"$f":"Orçamento!X378","v":0},{"$f":"Orçamento!AA378","v":0},{"$f":"ROUND(F50*$D$48,2)","v":0},null,null,null,{"$f":"ROUND(J50*$D$48,2)","v":0},null,null,null,{"$f":"ROUND(N50*$D$48,2)","v":0},null,null,null,{"$f":"SUM(F48:Q48)","v":0},null,{"$f":"IF(D48=R48,\"OK\",\"ERRO\")","v":"OK"}]
[{"$f":"IF(A48=\"F\",A48,\"\")","v":""}]
[{"$f":"IF(A49=\"F\",A49,\"\")","v":""},null,null,null,null,0,null,null,null,{"$f":"1-B50","v":1},null,null,null,{"$f":"1-F50-J50","v":0},null,null,null,{"$f":"IFERROR(E48/100,\"\")","v":0},null,{"$f":"IF(E48=R50*100,\"OK\",\"ERRO\")","v":"OK"}]
[{"$f":"IF(D51>0,\"F\",\"\")","v":""},"ESTRUTURA DE MADEIRA",null,{"$f":"Orçamento!X379","v":0},{"$f":"Orçamento!AA379","v":0},{"$f":"ROUND(F53*$D$51,2)","v":0},null,null,null,{"$f":"ROUND(J53*$D$51,2)","v":0},null,null,null,{"$f":"ROUND(N53*$D$51,2)","v":0},null,null,null,{"$f":"SUM(F51:Q51)","v":0},null,{"$f":"IF(D51=R51,\"OK\",\"ERRO\")","v":"OK"}]
[{"$f":"IF(A51=\"F\",A51,\"\")","v":""}]
[{"$f":"IF(A52=\"F\",A52,\"\")","v":""},null,null,null,null,0,null,null,null,0.57999999999999996,null,null,null,{"$f":"1-F53-J53","v":0.42000000000000004},null,null,null,{"$f":"IFERROR(E51/100,\"\")","v":0},null,{"$f":"IF(E51=R53*100,\"OK\",\"ERRO\")","v":"OK"}]
[{"$f":"IF(D54>0,\"F\",\"\")","v":""},"ESTRUTURA METÁLICA",null,{"$f":"Orçamento!X380","v":0},{"$f":"Orçamento!AA380","v":0},{"$f":"ROUND(F56*$D$54,2)","v":0},null,null,null,{"$f":"ROUND(J56*$D$54,2)","v":0},null,null,null,{"$f":"ROUND(N56*$D$54,2)","v":0},null,null,null,{"$f":"SUM(F54:Q54)","v":0},null,{"$f":"IF(D54=R54,\"OK\",\"ERRO\")","v":"OK"}]
[{"$f":"IF(A54=\"F\",A54,\"\")","v":""}]
[{"$f":"IF(A55=\"F\",A55,\"\")","v":""},null,null,null,null,0,null,null,null,0.57999999999999996,null,null,null,{"$f":"1-F56-J56","v":0.42000000000000004},null,null,null,{"$f":"IFERROR(E54/100,\"\")","v":0},null,{"$f":"IF(E54=R56*100,\"OK\",\"ERRO\")","v":"OK"}]
[{"$f":"IF(D57>0,\"F\",\"\")","v":""},"COBERTURAS",null,{"$f":"Orçamento!X381","v":0},{"$f":"Orçamento!AA381","v":0},{"$f":"ROUND(F59*$D$57,2)","v":0},null,null,null,{"$f":"ROUND(J59*$D$57,2)","v":0},null,null,null,{"$f":"ROUND(N59*$D$57,2)","v":0},null,null,null,{"$f":"SUM(F57:Q57)","v":0},null,{"$f":"IF(D57=R57,\"OK\",\"ERRO\")","v":"OK"}]
[{"$f":"IF(A57=\"F\",A57,\"\")","v":""}]
[{"$f":"IF(A58=\"F\",A58,\"\")","v":""},null,null,null,null,0,null,null,null,0,null,null,null,{"$f":"1-F59-J59","v":1},null,null,null,{"$f":"IFERROR(E57/100,\"\")","v":0},null,{"$f":"IF(E57=R59*100,\"OK\",\"ERRO\")","v":"OK"}]
[{"$f":"IF(D60>0,\"F\",\"\")","v":""},"ESQUADRIAS DE MADEIRA",null,{"$f":"Orçamento!X382","v":0},{"$f":"Orçamento!AA382","v":0},{"$f":"ROUND(F62*$D$60,2)","v":0},null,null,null,{"$f":"ROUND(J62*$D$60,2)","v":0},null,null,null,{"$f":"ROUND(N62*$D$60,2)","v":0},null,null,null,{"$f":"SUM(F60:Q60)","v":0},null,{"$f":"IF(D60=R60,\"OK\",\"ERRO\")","v":"OK"}]
[{"$f":"IF(A60=\"F\",A60,\"\")","v":""}]
[{"$f":"IF(A61=\"F\",A61,\"\")","v":""},null,null,null,null,0,null,null,null,0.4,null,null,null,{"$f":"1-F62-J62","v":0.6},null,null,null,{"$f":"IFERROR(E60/100,\"\")","v":0},null,{"$f":"IF(E60=R62*100,\"OK\",\"ERRO\")","v":"OK"}]
[{"$f":"IF(D63>0,\"F\",\"\")","v":""},"ESQUADRIAS METÁLICAS",null,{"$f":"Orçamento!X383","v":0},{"$f":"Orçamento!AA383","v":0},{"$f":"ROUND(F65*$D$63,2)","v":0},null,null,null,{"$f":"ROUND(J65*$D$63,2)","v":0},null,null,null,{"$f":"ROUND(N65*$D$63,2)","v":0},null,null,null,{"$f":"SUM(F63:Q63)","v":0},null,{"$f":"IF(D63=R63,\"OK\",\"ERRO\")","v":"OK"}]
[{"$f":"IF(A63=\"F\",A63,\"\")","v":""}]
[{"$f":"IF(A64=\"F\",A64,\"\")","v":""},null,null,null,null,0,null,null,null,0.45,null,null,null,{"$f":"1-F65-J65","v":0.55000000000000004},null,null,null,{"$f":"IFERROR(E63/100,\"\")","v":0},null,{"$f":"IF(E63=R65*100,\"OK\",\"ERRO\")","v":"OK"}]
[{"$f":"IF(D66>0,\"F\",\"\")","v":""},"VIDROS",null,{"$f":"Orçamento!X384","v":0},{"$f":"Orçamento!AA384","v":0},{"$f":"ROUND(F68*$D$66,2)","v":0},null,null,null,{"$f":"ROUND(J68*$D$66,2)","v":0},null,null,null,{"$f":"ROUND(N68*$D$66,2)","v":0},null,null,null,{"$f":"SUM(F66:Q66)","v":0},null,{"$f":"IF(D66=R66,\"OK\",\"ERRO\")","v":"OK"}]
[{"$f":"IF(A66=\"F\",A66,\"\")","v":""}]
[{"$f":"IF(A67=\"F\",A67,\"\")","v":""},null,null,null,null,0,null,null,null,0,null,null,null,{"$f":"1-F68-J68","v":1},null,null,null,{"$f":"IFERROR(E66/100,\"\")","v":0},null,{"$f":"IF(E66=R68*100,\"OK\",\"ERRO\")","v":"OK"}]
[{"$f":"IF(D69>0,\"F\",\"\")","v":""},"REVESTIMENTO DE PAREDE",null,{"$f":"Orçamento!X385","v":0},{"$f":"Orçamento!AA385","v":0},{"$f":"ROUND(F71*$D$69,2)","v":0},null,null,null,{"$f":"ROUND(J71*$D$69,2)","v":0},null,null,null,{"$f":"ROUND(N71*$D$69,2)","v":0},null,null,null,{"$f":"SUM(F69:Q69)","v":0},null,{"$f":"IF(D69=R69,\"OK\",\"ERRO\")","v":"OK"}]
[{"$f":"IF(A69=\"F\",A69,\"\")","v":""}]
[{"$f":"IF(A70=\"F\",A70,\"\")","v":""},null,null,null,null,0,null,null,null,0.4,null,null,null,{"$f":"1-F71-J71","v":0.6},null,null,null,{"$f":"IFERROR(E69/100,\"\")","v":0},null,{"$f":"IF(E69=R71*100,\"OK\",\"ERRO\")","v":"OK"}]
[{"$f":"IF(D72>0,\"F\",\"\")","v":""},"FORROS",null,{"$f":"Orçamento!X386","v":0},{"$f":"Orçamento!AA386","v":0},{"$f":"ROUND(F74*$D$72,2)","v":0},null,null,null,{"$f":"ROUND(J74*$D$72,2)","v":0},null,null,null,{"$f":"ROUND(N74*$D$72,2)","v":0},null,null,null,{"$f":"SUM(F72:Q72)","v":0},null,{"$f":"IF(D72=R72,\"OK\",\"ERRO\")","v":"OK"}]
[{"$f":"IF(A72=\"F\",A72,\"\")","v":""}]
[{"$f":"IF(A73=\"F\",A73,\"\")","v":""},null,null,null,null,0,null,null,null,0.4,null,null,null,{"$f":"1-F74-J74","v":0.6},null,null,null,{"$f":"IFERROR(E72/100,\"\")","v":0},null,{"$f":"IF(E72=R74*100,\"OK\",\"ERRO\")","v":"OK"}]
[{"$f":"IF(D75>0,\"F\",\"\")","v":""},"REVESTIMENTO DE PISO",null,{"$f":"Orçamento!X387","v":0},{"$f":"Orçamento!AA387","v":0},{"$f":"ROUND(F77*$D$75,2)","v":0},null,null,null,{"$f":"ROUND(J77*$D$75,2)","v":0},null,null,null,{"$f":"ROUND(N77*$D$75,2)","v":0},null,null,null,{"$f":"SUM(F75:Q75)","v":0},null,{"$f":"IF(D75=R75,\"OK\",\"ERRO\")","v":"OK"}]
[{"$f":"IF(A75=\"F\",A75,\"\")","v":""}]
[{"$f":"IF(A76=\"F\",A76,\"\")","v":""},null,null,null,null,0,null,null,null,0.4,null,null,null,{"$f":"1-F77-J77","v":0.6},null,null,null,{"$f":"IFERROR(E75/100,\"\")","v":0},null,{"$f":"IF(E75=R77*100,\"OK\",\"ERRO\")","v":"OK"}]
[{"$f":"IF(D78>0,\"F\",\"\")","v":""},"FERRAGENS",null,{"$f":"Orçamento!X388","v":0},{"$f":"Orçamento!AA388","v":0},{"$f":"ROUND(F80*$D$78,2)","v":0},null,null,null,{"$f":"ROUND(J80*$D$78,2)","v":0},null,null,null,{"$f":"ROUND(N80*$D$78,2)","v":0},null,null,null,{"$f":"SUM(F78:Q78)","v":0},null,{"$f":"IF(D78=R78,\"OK\",\"ERRO\")","v":"OK"}]
[{"$f":"IF(A78=\"F\",A78,\"\")","v":""}]
[{"$f":"IF(A79=\"F\",A79,\"\")","v":""},null,null,null,null,0,null,null,null,0,null,null,null,{"$f":"1-F80-J80","v":1},null,null,null,{"$f":"IFERROR(E78/100,\"\")","v":0},null,{"$f":"IF(E78=R80*100,\"OK\",\"ERRO\")","v":"OK"}]
[{"$f":"IF(D81>0,\"F\",\"\")","v":""},"MARCENARIA",null,{"$f":"Orçamento!X389","v":0},{"$f":"Orçamento!AA389","v":0},{"$f":"ROUND(F83*$D$81,2)","v":0},null,null,null,{"$f":"ROUND(J83*$D$81,2)","v":0},null,null,null,{"$f":"ROUND(N83*$D$81,2)","v":0},null,null,null,{"$f":"SUM(F81:Q81)","v":0},null,{"$f":"IF(D81=R81,\"OK\",\"ERRO\")","v":"OK"}]
[{"$f":"IF(A81=\"F\",A81,\"\")","v":""}]
[{"$f":"IF(A82=\"F\",A82,\"\")","v":""},null,null,null,null,0,null,null,null,0,null,null,null,{"$f":"1-F83-J83","v":1},null,null,null,{"$f":"IFERROR(E81/100,\"\")","v":0},null,{"$f":"IF(E81=R83*100,\"OK\",\"ERRO\")","v":"OK"}]
[{"$f":"IF(D84>0,\"F\",\"\")","v":""},"ADMINISTRAÇÃO - MENSALISTAS",null,{"$f":"Orçamento!X390","v":0},{"$f":"Orçamento!AA390","v":0},{"$f":"ROUND(F86*$D$84,2)","v":0},null,null,null,{"$f":"ROUND(J86*$D$84,2)","v":0},null,null,null,{"$f":"ROUND(N86*$D$84,2)","v":0},null,null,null,{"$f":"SUM(F84:Q84)","v":0},null,{"$f":"IF(D84=R84,\"OK\",\"ERRO\")","v":"OK"}]
[{"$f":"IF(A84=\"F\",A84,\"\")","v":""}]
[{"$f":"IF(A85=\"F\",A85,\"\")","v":""},null,null,null,null,0.34,null,null,null,0.33,null,null,null,0.33,null,null,null,{"$f":"IFERROR(E84/100,\"\")","v":0},null,{"$f":"IF(E84=R86*100,\"OK\",\"ERRO\")","v":"OK"}]
[{"$f":"IF(D87>0,\"F\",\"\")","v":""},"PINTURA",null,{"$f":"Orçamento!X391","v":0},{"$f":"Orçamento!AA391","v":0},{"$f":"ROUND(F89*$D$87,2)","v":0},null,null,null,{"$f":"ROUND(J89*$D$87,2)","v":0},null,null,null,{"$f":"ROUND(N89*$D$87,2)","v":0},null,null,null,{"$f":"SUM(F87:Q87)","v":0},null,{"$f":"IF(D87=R87,\"OK\",\"ERRO\")","v":"OK"}]
[{"$f":"IF(A87=\"F\",A87,\"\")","v":""}]
[{"$f":"IF(A88=\"F\",A88,\"\")","v":""},null,null,null,null,0,null,null,null,0,null,null,null,{"$f":"1-F89-J89","v":1},null,null,null,{"$f":"IFERROR(E87/100,\"\")","v":0},null,{"$f":"IF(E87=R89*100,\"OK\",\"ERRO\")","v":"OK"}]
[{"$f":"IF(D90>0,\"F\",\"\")","v":""},"DIVERSOS",null,{"$f":"Orçamento!X392","v":0},{"$f":"Orçamento!AA392","v":0},{"$f":"ROUND(F92*$D$90,2)","v":0},null,null,null,{"$f":"ROUND(J92*$D$90,2)","v":0},null,null,null,{"$f":"ROUND(N92*$D$90,2)","v":0},null,null,null,{"$f":"SUM(F90:Q90)","v":0},null,{"$f":"IF(D90=R90,\"OK\",\"ERRO\")","v":"OK"}]
[{"$f":"IF(A90=\"F\",A90,\"\")","v":""}]
[{"$f":"IF(A91=\"F\",A91,\"\")","v":""},null,null,null,null,0,null,null,null,0,null,null,null,{"$f":"1-F92-J92","v":1},null,null,null,{"$f":"IFERROR(E90/100,\"\")","v":0},null,{"$f":"IF(E90=R92*100,\"OK\",\"ERRO\")","v":"OK"}]
["F","CUSTO DO ORÇAMENTO",null,{"$f":"SUM(D15:D92)","v":0},{"$f":"SUM(E15:E92)","v":0},{"$f":"F15+F18+F21+F24+F27+F30+F33+F36+F39+F42+F45+F48+F51+F54+F57+F60+F63+F66+F69+F72+F75+F78+F81+F84+F87+F90","v":0},null,null,null,{"$f":"J15+J18+J21+J24+J27+J30+J33+J36+J39+J42+J45+J48+J51+J54+J57+J60+J63+J66+J69+J72+J75+J78+J81+J84+J87+J90","v":0},null,null,null,{"$f":"N15+N18+N21+N24+N27+N30+N33+N36+N39+N42+N45+N48+N51+N54+N57+N60+N63+N66+N69+N72+N75+N78+N81+N84+N87+N90","v":0},null,null,null,{"$f":"R15+R18+R21+R24+R27+R30+R33+R36+R39+R42+R45+R48+R51+R54+R57+R60+R63+R66+R69+R72+R75+R78+R81+R84+R87+R90","v":0}]
["F","PERCENTUAIS:",null,null,null,{"$f":"IFERROR(F93/D93,\"\")","v":""},null,null,null,{"$f":"IFERROR(J93/D93,\"\")","v":""},null,null,null,{"$f":"IFERROR(N93/D93,\"\")","v":""},null,null,null,{"$f":"SUM(F94:Q94)","v":0}]
["F","TOTAIS ACUMULADOS:",null,null,null,{"$f":"F93","v":0},null,null,null,{"$f":"F95+J93","v":0},null,null,null,{"$f":"J95+N93","v":0}]
["F","PERCENTUAIS  ACUMULADOS:",null,null,null,{"$f":"F94","v":""},null,null,null,{"$f":"J94+F96","v":{"$error":"#VALUE!"}},null,null,null,{"$f":"IFERROR(J96+N94,\"\")","v":""}]
["F"]
["F","OBSERVAÇÕES:"]
["F","Os pagamentos somente poderão ser efetuados mediante medição e atesto pelos técnicos da Secretaria da Educação. "]

{"sheet":"Composição BDI","index":4,"n_rows":45,"n_cols":9,"rows_kept":45,"cut":false,"hidden":false,"merged":[[12,0,12,3],[13,0,13,3],[14,0,14,3],[15,0,15,3],[6,0,6,3],[8,0,8,3],[7,0,7,3],[9,0,9,3],[11,0,11,3],[10,0,10,3],[0,0,0,3],[2,0,2,3],[3,0,3,3],[1,0,1,3],[5,0,5,3],[4,0,4,3],[18,5,18,8],[17,0,17,3],[16,0,16,3],[44,0,44,3],[42,0,42,3],[43,0,43,3],[18,0,18,3],[36,0,36,3],[39,0,39,3],[38,0,38,3],[40,0,40,3],[29,0,29,2],[32,0,32,3],[33,0,33,3],[34,0,34,3],[35,0,35,3]]}
[]
[]
["UNIDADE ESCOLAR"]
[{"$f":"Orçamento!$O$4","v":"ESCOLA ESTADUAL LUIZ ALVES MACHADO"}]
[]
["OBRA"]
[{"$f":"Orçamento!$O$7","v":"REFORMA"}]
[]
["ENDEREÇO"]
[{"$f":"Orçamento!$R$10","v":" AV GOIAS 155 , CENTRO , CEP: 7636-000"}]
[]
["CIDADE"]
[{"$f":"Orçamento!$X$7","v":"ITAPACI"}]
[]
["CRE"]
[{"$f":"Orçamento!$O$10","v":"CRE-ITAPACI"}]
[]
["DETALHAMENTO DA COMPOSIÇÃO DE BDI"]
["COMPOSIÇÃO BDI PARA OBRAS CIVIS",null,null,null,null,"BDI CONSTRUÇÃO E REFORMA"]
["DESCRIÇÃO","COEF.","TAXA % (a.m)","% no preço de venda",null,"Situação","1º Quartil","Médio","3º Quartil"]
["1) COFINS",1,0.03,{"$f":"C21","v":0.03},null,{"$f":"IF(OR(C21<G21,C21>I21),\"FORA DO INTERVALO\",\"OK\")","v":"OK"},0.03,0.03,0.03]
["2) PIS",1,6.4999999999999997E-3,{"$f":"C22","v":6.4999999999999997E-3},null,{"$f":"IF(OR(C22<G22,C22>I22),\"FORA DO INTERVALO\",\"OK\")","v":"OK"},6.4999999999999997E-3,6.4999999999999997E-3,6.4999999999999997E-3]
["3) ISSQN",1,2.5000000000000001E-2,{"$f":"C23*B23","v":2.5000000000000001E-2},null,"OK",0.02,3.5000000000000003E-2,0.05]
["4) CPRB",1,0,{"$f":"C24","v":0},null,"FORA DO INTERVALO",4.4999999999999998E-2,4.4999999999999998E-2,4.4999999999999998E-2]
["5) Administração Central",1,0.04,0.04,null,"OK",0.03,0.04,5.5E-2]
["6) Despesas Financeiras",1,5.5999999999999999E-3,5.5999999999999999E-3,null,"FORA DO INTERVALO",5.8999999999999999E-3,1.23E-2,1.3899999999999999E-2]
["7) Seguros + Garantias",1,1.1999999999999999E-3,1.1999999999999999E-3,null,"FORA DO INTERVALO",8.0000000000000002E-3,8.0000000000000002E-3,0.01]
["8) Risco",1,9.7000000000000003E-3,9.7000000000000003E-3,null,"OK",9.7000000000000003E-3,1.2699999999999999E-2,1.2699999999999999E-2]
["9) Lucro",1,6.8699999999999997E-2,6.8699999999999997E-2,null,"OK",6.1600000000000002E-2,7.3999999999999996E-2,8.9599999999999999E-2]
["BDI - FINAL",null,null,{"$f":"(((1+D25+D27+D28)*(1+D26)*(1+D29))/(1-(D21+D22+D23+D24))-1)","v":0.2033949624379332},null,{"$f":"IF(OR(D30<G30,D30>I30),\"FORA DO INTERVALO\",\"OK\")","v":"FORA DO INTERVALO"},0.2034,0.22120000000000001,0.25]
[]
["Notas:"]
["(1) e (2) Alíquota definida por lei."]
["(3) Alíquota e base de cálculo definidas pela legislação municipal."]
["(4) Alíquota definida pelas leis 12.546/11, 12844/13 e 13.161/15 (CPRB – contribuição previdenciária sobre a receita bruta)."]
["(5) Valores definidos a partir dos limites no Acórdão nº 2.622/2013 - TCU – Plenário. Valores entre o 1º e 3º quartis."]
["(6) Valor calculado pela expressão matemática do acórdão 2.369/2011 – TCU – Plenário e disponibilizado pela AGETOP em dezembro de 2018. (Foi utilizado para o cálculo a média da Taxa SELIC no período de 11/2017 a 10/2018)"]
[]
["(7) Valores definidos pela AGETOP a partir dos limites no Acórdão nº 2.622/2013 - TCU – Plenário. Valores médios. \n\nObservação da AGETOP: (Seguros contra erros de execução, incêndio e explosão, danos da natureza (vendaval, destelhamento, alagamento, inundação, desmoronamento, geadas etc.), emprego de material defeituoso ou inadequado, roubo e/ou furto qualificado, quebra de equipamentos, desmoronamento de estrutura, nas modalidades de Obras Civis em Construção (OCC); Instalação e Montagem (IM); e Obras Civis em Construção e Instalação e Montagem (OCC/IM). Bem como coberturas adicionais para ampliação dessas coberturas básicas, como: cobertura de responsabilidade civil geral, cobertura de responsabilidade civil cruzada, cobertura de despesas extraordinárias, cobertura de tumultos, cobertura de desentulho do local, cobertura de riscos do fabricante, dentre outras, incluindo o seguro de vida em grupo regido pela convenção coletiva dos trabalhadores na indústria da construção civil). A partir de 24/02/2015 por intermédio da Portaria 449/2015 a Presidência da AGETOP, na pessoa do Senhor Jayme Eduardo Rincon, determinou a exclusão dos valores referentes aos Seguros de Risco de Engenharia e Responsabilidade Civil do Profissional na composição do cálculo do B.D.I.."]
["(8) Valores definidos a partir dos limites no Acórdão nº 2.622/2013 - TCU – Plenário. Valores entre 1º e 3° quartis."]
["(9) Valores definidos a partir dos limites definidos no Acórdão nº 2.622/2013 - TCU – Plenário. Valores adotados e praticados no mercado ( “ ex ante ” ) ou aqueles entre os 1º e 3º quartis."]
[]
["(*) A fórmula para estipulação da taxa de BDI estimado adotado é a mesma que foi aplicada para a obtenção das tabelas contidas no Acórdão n. 2.622/2013 – TCUPlenário"]
[]
["Obs.: Para obras com valores superiores a R$ 20.000.000,00 sugere-se recalcular o BDI, dimensionando as taxas de administração central e lucro para patamares inferiores ao estipulado acima."]

{"sheet":"Relatório CENTRAL","index":5,"n_rows":40,"n_cols":5,"rows_kept":40,"cut":false,"hidden":false,"merged":[[8,1,8,2],[8,3,8,4],[9,1,9,2],[10,1,10,4],[11,1,11,4],[39,1,39,2],[9,0,11,0],[0,1,0,4],[6,3,6,4],[9,3,9,4],[1,1,1,4],[2,1,2,2],[2,3,2,4],[3,1,3,2],[3,3,3,4],[4,1,4,4],[5,1,5,2],[5,3,5,4],[6,1,6,2],[7,1,7,4]]}
[]
[]
[null,"UNIDADE ESCOLAR",null,"CIDADE"]
[null,{"$f":"Orçamento!$O$4","v":"ESCOLA ESTADUAL LUIZ ALVES MACHADO"},null,{"$f":"Orçamento!$X$7","v":"ITAPACI"}]
[]
[null,"OBRA",null,"CRE"]
[null,{"$f":"Orçamento!$O$7","v":"REFORMA"},null,{"$f":"Orçamento!$O$10","v":"CRE-ITAPACI"}]
[]
[null,"ENDEREÇO",null,"DATA"]
["FILTRO",{"$f":"Orçamento!$R$10","v":" AV GOIAS 155 , CENTRO , CEP: 7636-000"},null,{"$f":"Orçamento!$S$7","v":"2020-05-25"}]
[]
[null,"RELATÓRIO CENTRAL"]
["↓","CÓDIGO","ETAPA","PREÇO  (R$) C/ BDI","PARTIC  ( % )"]
[{"$f":"IF(D14>0,\"F\",\"\")","v":""},{"$f":"Orçamento!O367","v":"a."},{"$f":"Orçamento!P367","v":"SERVIÇOS PRELIMINARES"},{"$f":"Orçamento!X367","v":0},{"$f":"Orçamento!AA367","v":0}]
[{"$f":"IF(D15>0,\"F\",\"\")","v":""},{"$f":"Orçamento!O368","v":"b."},{"$f":"Orçamento!P368","v":"TRANSPORTES"},{"$f":"Orçamento!X368","v":0},{"$f":"Orçamento!AA368","v":0}]
["",{"$f":"Orçamento!O369","v":"c."},{"$f":"Orçamento!P369","v":"SERVIÇO EM TERRA"},{"$f":"Orçamento!X369","v":0},{"$f":"Orçamento!AA369","v":0}]
["",{"$f":"Orçamento!O370","v":"d."},{"$f":"Orçamento!P370","v":"FUNDAÇÕES E SONDAGENS"},{"$f":"Orçamento!X370","v":0},{"$f":"Orçamento!AA370","v":0}]
["",{"$f":"Orçamento!O371","v":"e."},{"$f":"Orçamento!P371","v":"ESTRUTURA"},{"$f":"Orçamento!X371","v":0},{"$f":"Orçamento!AA371","v":0}]
["",{"$f":"Orçamento!O372","v":"f."},{"$f":"Orçamento!P372","v":"INSTALAÇÕES ELÉTRICAS"},{"$f":"Orçamento!X372","v":0},{"$f":"Orçamento!AA372","v":0}]
["",{"$f":"Orçamento!O373","v":"g."},{"$f":"Orçamento!P373","v":"INSTALAÇÕES HIDROSSANITÁRIAS"},{"$f":"Orçamento!X373","v":0},{"$f":"Orçamento!AA373","v":0}]
["",{"$f":"Orçamento!O374","v":"h"},{"$f":"Orçamento!P374","v":"INSTALAÇÕES ESPECIAIS"},{"$f":"Orçamento!X374","v":0},{"$f":"Orçamento!AA374","v":0}]
["",{"$f":"Orçamento!O375","v":"i."},{"$f":"Orçamento!P375","v":"ALVENARIAS E DIVISÓRIAS"},{"$f":"Orçamento!X375","v":0},{"$f":"Orçamento!AA375","v":0}]
["",{"$f":"Orçamento!O376","v":"j."},{"$f":"Orçamento!P376","v":"ALVENARIA AUTO-PORTANTE"},{"$f":"Orçamento!X376","v":0},{"$f":"Orçamento!AA376","v":0}]
["",{"$f":"Orçamento!O377","v":"k."},{"$f":"Orçamento!P377","v":"IMPERMEABILIZAÇÃO"},{"$f":"Orçamento!X377","v":0},{"$f":"Orçamento!AA377","v":0}]
["",{"$f":"Orçamento!O378","v":"l."},{"$f":"Orçamento!P378","v":"ISOLAMENTO TÉRMICO E ACÚSTICO"},{"$f":"Orçamento!X378","v":0},{"$f":"Orçamento!AA378","v":0}]
["",{"$f":"Orçamento!O379","v":"m."},{"$f":"Orçamento!P379","v":"ESTRUTURA DE MADEIRA"},{"$f":"Orçamento!X379","v":0},{"$f":"Orçamento!AA379","v":0}]
["",{"$f":"Orçamento!O380","v":"n."},{"$f":"Orçamento!P380","v":"ESTRUTURAS METÁLICAS"},{"$f":"Orçamento!X380","v":0},{"$f":"Orçamento!AA380","v":0}]
["",{"$f":"Orçamento!O381","v":"o."},{"$f":"Orçamento!P381","v":"COBERTURAS"},{"$f":"Orçamento!X381","v":0},{"$f":"Orçamento!AA381","v":0}]
["",{"$f":"Orçamento!O382","v":"p."},{"$f":"Orçamento!P382","v":"ESQUADRIAS DE MADEIRA"},{"$f":"Orçamento!X382","v":0},{"$f":"Orçamento!AA382","v":0}]
["",{"$f":"Orçamento!O383","v":"q."},{"$f":"Orçamento!P383","v":"ESQUADRIAS METÁLICAS"},{"$f":"Orçamento!X383","v":0},{"$f":"Orçamento!AA383","v":0}]
["",{"$f":"Orçamento!O384","v":"r."},{"$f":"Orçamento!P384","v":"VIDROS"},{"$f":"Orçamento!X384","v":0},{"$f":"Orçamento!AA384","v":0}]
["",{"$f":"Orçamento!O385","v":"s."},{"$f":"Orçamento!P385","v":"REVESTIMENTO DE PAREDE"},{"$f":"Orçamento!X385","v":0},{"$f":"Orçamento!AA385","v":0}]
["",{"$f":"Orçamento!O386","v":"t."},{"$f":"Orçamento!P386","v":"FORROS"},{"$f":"Orçamento!X386","v":0},{"$f":"Orçamento!AA386","v":0}]
["",{"$f":"Orçamento!O387","v":"u."},{"$f":"Orçamento!P387","v":"REVESTIMENTO DE PISO"},{"$f":"Orçamento!X387","v":0},{"$f":"Orçamento!AA387","v":0}]
["",{"$f":"Orçamento!O388","v":"v."},{"$f":"Orçamento!P388","v":"FERRAGENS"},{"$f":"Orçamento!X388","v":0},{"$f":"Orçamento!AA388","v":0}]
["",{"$f":"Orçamento!O389","v":"w."},{"$f":"Orçamento!P389","v":"MARCENARIA"},{"$f":"Orçamento!X389","v":0},{"$f":"Orçamento!AA389","v":0}]
["",{"$f":"Orçamento!O390","v":"x."},{"$f":"Orçamento!P390","v":"ADMINISTRAÇÃO"},{"$f":"Orçamento!X390","v":0},{"$f":"Orçamento!AA390","v":0}]
["",{"$f":"Orçamento!O391","v":"y."},{"$f":"Orçamento!P391","v":"PINTURA"},{"$f":"Orçamento!X391","v":0},{"$f":"Orçamento!AA391","v":0}]
["",{"$f":"Orçamento!O392","v":"z."},{"$f":"Orçamento!P392","v":"DIVERSOS"},{"$f":"Orçamento!X392","v":0},{"$f":"Orçamento!AA392","v":0}]
["F","TOTAL GERAL DO ORÇAMENTO (R$) C/BDI",null,{"$f":"SUM(D14:D39)","v":0},{"$f":"SUM(E14:E39)","v":0}]

{"sheet":"Parc Maior Relev","index":6,"n_rows":33,"n_cols":7,"rows_kept":33,"cut":false,"hidden":false,"merged":[[10,1,10,6],[6,1,6,3],[6,4,6,6],[7,1,7,6],[8,1,8,3],[8,4,8,6],[33,3,33,7],[31,1,31,6],[0,1,0,6],[11,1,11,6],[1,1,1,6],[2,1,2,3],[2,4,2,6],[3,1,3,3],[3,4,3,6],[4,1,4,6],[5,1,5,3],[5,4,5,6],[9,1,9,3],[9,4,9,6]]}
[]
[]
[null,"UNIDADE ESCOLAR",null,null,"CÓDIGO INEP"]
[null,{"$f":"Orçamento!$O$4","v":"ESCOLA ESTADUAL LUIZ ALVES MACHADO"},null,null,{"$f":"Orçamento!$X$4","v":52017320}]
[]
[null,"OBRA",null,null,"CIDADE"]
[null,{"$f":"Orçamento!$O$7","v":"REFORMA"},null,null,{"$f":"Orçamento!$X$7","v":"ITAPACI"}]
[]
[null,"CRE",null,null,"ÁREA TOTAL CONSTRUÍDA (M²)"]
[null,{"$f":"Orçamento!$O$10","v":"CRE-ITAPACI"},null,null,{"$f":"Orçamento!$X$13","v":926.8}]
[]
["FILTRO","PARCELA DE MAIOR RELEVÂNCIA"]
[{"$f":"IF(G14>0,\"F\",\"\")","v":""},"CÓDIGO","SERVIÇO","DESCRIÇÃO","UNID","QUANT","PARC. MAIOR RELEV (100%)"]
[{"$f":"IF(G14>0,\"F\",\"\")","v":""},"f.","INSTALAÇÕES ELÉTRICAS","SUBESTAÇÃO","KVA",{"$f":"SUMIF(Orçamento!$R$348:$R$348,'Parc Maior Relev'!D14,Orçamento!$T$348:$T$348)","v":0},{"$f":"F14","v":0}]
[{"$f":"IF(SUM(G16:G30)>0,\"F\",\"\")","v":"F"},"CÓDIGO","SERVIÇO","DESCRIÇÃO","UNID","QUANT","PARC. MAIOR RELEV (50%)"]
[{"$f":"IF(G16>0,\"F\",\"\")","v":""},"e.","ESTRUTURA","CONCRETO","M3",{"$f":"SUMIF(Orçamento!$R$348:$R$348,'Parc Maior Relev'!D16,Orçamento!$T$348:$T$348)","v":0},{"$f":"F16*0.5","v":0}]
[{"$f":"IF(G17>0,\"F\",\"\")","v":""},"f.","INSTALAÇÕES ELÉTRICAS","INSTALAÇÕES ELÉTRICAS","KVA",{"$f":"SUMIF(Orçamento!$R$348:$R$348,'Parc Maior Relev'!D17,Orçamento!$T$348:$T$348)","v":0},{"$f":"F17*0.5","v":0}]
[{"$f":"IF(G18>0,\"F\",\"\")","v":"F"},"o.","COBERTURAS","COBERTURA CERÂMICA","M2",618.70000000000005,309.35000000000002]
["","o.","COBERTURAS","COBERTURA COM TELHA METÁLICA","M2",{"$f":"SUMIF(Orçamento!$R$348:$R$348,'Parc Maior Relev'!D19,Orçamento!$T$348:$T$348)","v":0},0]
["","s.","REVESTIMENTO DE PAREDE","CHAPISCO","M2",{"$f":"SUMIF(Orçamento!$R$348:$R$348,'Parc Maior Relev'!D20,Orçamento!$T$348:$T$348)","v":0},0]
["","s.","REVESTIMENTO DE PAREDE","REBOCO","M2",{"$f":"SUMIF(Orçamento!$R$348:$R$348,'Parc Maior Relev'!D21,Orçamento!$T$348:$T$348)","v":0},0]
["F","s.","REVESTIMENTO DE PAREDE","REVESTIMENTO CERÂMICO","M2",205.95,102.97499999999999]
["","t.","FORROS","FORRO DE GESSO","M2",{"$f":"SUMIF(Orçamento!$R$348:$R$348,'Parc Maior Relev'!D23,Orçamento!$T$348:$T$348)","v":0},0]
["","t.","FORROS","FORRO DE PVC","M2",{"$f":"SUMIF(Orçamento!$R$348:$R$348,'Parc Maior Relev'!D24,Orçamento!$T$348:$T$348)","v":0},0]
["","t.","FORROS","FORRO DE GESSO ACARTONADO","M2",{"$f":"SUMIF(Orçamento!$R$348:$R$348,'Parc Maior Relev'!D25,Orçamento!$T$348:$T$348)","v":0},0]
["","u.","REVESTIMENTO DE PISO","PISO DE GRANITINA","M2",{"$f":"SUMIF(Orçamento!$R$348:$R$348,'Parc Maior Relev'!D26,Orçamento!$T$348:$T$348)","v":0},0]
["","u.","REVESTIMENTO DE PISO","PISO LAMINADO","M2",{"$f":"SUMIF(Orçamento!$R$348:$R$348,'Parc Maior Relev'!D27,Orçamento!$T$348:$T$348)","v":0},0]
["","u.","REVESTIMENTO DE PISO","PISO DE CONCRETO DESEMPENADO","M2",{"$f":"SUMIF(Orçamento!$R$348:$R$348,'Parc Maior Relev'!D28,Orçamento!$T$348:$T$348)","v":0},0]
["","u.","REVESTIMENTO DE PISO","PISO CERÂMICO","M2",{"$f":"SUMIF(Orçamento!$R$348:$R$348,'Parc Maior Relev'!D29,Orçamento!$T$348:$T$348)","v":0},0]
["","y.","PINTURA","PINTURA","M2",{"$f":"SUMIF(Orçamento!$R$348:$R$348,'Parc Maior Relev'!D30,Orçamento!$T$348:$T$348)","v":0},0]
["F"]
["F","(*) Para os fins do inciso I dp § 1º do Art. 30 da Lei Federal 8.666/93, são consideradas parcelas de maior relevância técnica as execuções apresentadas"]
["F"]

{"sheet":"Composições","index":7,"n_rows":176,"n_cols":10,"rows_kept":176,"cut":false,"hidden":false,"merged":[[170,5,171,5],[170,6,170,7],[170,8,170,9],[174,1,174,7],[175,1,175,7],[170,0,171,0],[170,1,171,1],[170,2,171,2],[170,3,171,3],[170,4,171,4],[160,5,161,5],[160,6,160,7],[160,8,160,9],[165,1,165,7],[168,1,168,7],[160,0,161,0],[160,1,161,1],[160,2,161,2],[160,3,161,3],[160,4,161,4],[150,5,151,5],[150,6,150,7],[150,8,150,9],[155,1,155,7],[158,1,158,7],[150,0,151,0],[150,1,151,1],[150,2,151,2],[150,3,151,3],[150,4,151,4],[141,5,142,5],[141,6,141,7],[141,8,141,9],[146,1,146,7],[148,1,148,7],[141,0,142,0],[141,1,142,1],[141,2,142,2],[141,3,142,3],[141,4,142,4],[132,5,133,5],[132,6,132,7],[132,8,132,9],[137,1,137,7],[139,1,139,7],[132,0,133,0],[132,1,133,1],[132,2,133,2],[132,3,133,3],[132,4,133,4],[123,5,124,5],[123,6,123,7],[123,8,123,9],[128,1,128,7],[130,1,130,7],[123,0,124,0],[123,1,124,1],[123,2,124,2],[123,3,124,3],[123,4,124,4],[114,5,115,5],[114,6,114,7],[114,8,114,9],[119,1,119,7],[121,1,121,7],[114,0,115,0],[114,1,115,1],[114,2,115,2],[114,3,115,3],[114,4,115,4],[105,5,106,5],[105,6,105,7],[105,8,105,9],[110,1,110,7],[112,1,112,7],[105,0,106,0],[105,1,106,1],[105,2,106,2],[105,3,106,3],[105,4,106,4],[95,5,96,5],[95,6,95,7],[95,8,95,9],[100,1,100,7],[103,1,103,7],[95,0,96,0],[95,1,96,1],[95,2,96,2],[95,3,96,3],[95,4,96,4],[85,5,86,5],[85,6,85,7],[85,8,85,9],[90,1,90,7],[93,1,93,7],[85,0,86,0],[85,1,86,1],[85,2,86,2],[85,3,86,3],[85,4,86,4],[75,5,76,5],[75,6,75,7],[75,8,75,9],[79,1,79,7],[83,1,83,7],[75,0,76,0],[75,1,76,1],[75,2,76,2],[75,3,76,3],[75,4,76,4],[65,5,66,5],[65,6,65,7],[65,8,65,9],[69,1,69,7],[73,1,73,7],[65,0,66,0],[65,1,66,1],[65,2,66,2],[65,3,66,3],[65,4,66,4],[52,5,53,5],[52,6,52,7],[52,8,52,9],[56,1,56,7],[63,1,63,7],[52,0,53,0],[52,1,53,1],[52,2,53,2],[52,3,53,3],[52,4,53,4],[42,5,43,5],[42,6,42,7],[42,8,42,9],[46,1,46,7],[50,1,50,7],[42,0,43,0],[42,1,43,1],[42,2,43,2],[42,3,43,3],[42,4,43,4],[32,5,33,5],[32,6,32,7],[32,8,32,9],[36,1,36,7],[40,1,40,7],[32,0,33,0],[32,1,33,1],[32,2,33,2],[32,3,33,3],[32,4,33,4],[23,5,24,5],[23,6,23,7],[23,8,23,9],[28,1,28,7],[30,1,30,7],[23,0,24,0],[23,1,24,1],[23,2,24,2],[23,3,24,3],[23,4,24,4],[16,5,17,5],[16,6,16,7],[16,8,16,9],[19,1,19,7],[21,1,21,7],[16,0,17,0],[16,1,17,1],[16,2,17,2],[16,3,17,3],[16,4,17,4],[0,0,0,8],[10,0,10,2],[10,3,10,6],[11,0,11,9],[12,0,12,2],[12,3,12,6],[12,7,12,8],[7,0,7,6],[9,0,9,2],[9,3,9,6],[9,7,9,8],[3,0,3,6],[4,0,4,6],[15,0,15,9],[13,0,13,2],[13,3,13,6],[1,0,1,9],[3,7,3,9],[4,7,4,9],[6,7,6,9],[7,7,7,9],[6,0,6,6],[10,8,10,9],[13,8,13,9],[14,0,14,9],[8,0,8,9],[5,0,5,9],[2,0,2,9]]}
[]
[]
[]
["UNIDADE ESCOLAR",null,null,null,null,null,null,"CÓDIGO INEP"]
[{"$f":"Orçamento!$O$4","v":"ESCOLA ESTADUAL LUIZ ALVES MACHADO"},null,null,null,null,null,null,{"$f":"Orçamento!$X$4","v":52017320}]
[]
["OBRA",null,null,null,null,null,null,"CIDADE"]
[{"$f":"Orçamento!$O$7","v":"REFORMA"},null,null,null,null,null,null,{"$f":"Orçamento!$X$7","v":"ITAPACI"}]
[]
["CRE",null,null,"ENDEREÇO",null,null,null,"REFERÊNCIA AGETOP"]
[{"$f":"Orçamento!$O$10","v":"CRE-ITAPACI"},null,null,{"$f":"Orçamento!$R$10","v":" AV GOIAS 155 , CENTRO , CEP: 7636-000"},null,null,null,{"$f":"Orçamento!$S$10","v":"ABR/19"},{"$f":"Orçamento!$T$10","v":"ONERADA"}]
[]
["DATA",null,null,"ÁREA TOTAL CONSTRUÍDA (M²)",null,null,null,"REFERÊNCIA SINAPI"]
[{"$f":"Orçamento!$S$7","v":"2020-05-25"},null,null,{"$f":"Orçamento!$X$13","v":926.8},null,null,null,{"$f":"Orçamento!$X$10","v":"MAR/20"},{"$f":"Orçamento!$Y$10","v":"ONERADA"}]
[]
["COMPOSIÇÕES DE CUSTOS UNITÁRIOS - SEE-GO"]
[27,"FONTE","CÓDIGO","DESCRIÇÃO","UNIDADE","COEFIC.","CUSTO UNITÁRIO",null,"CUSTO  TOTAL (A) + (B) + (C) + (D) + (E)"]
[null,null,null,null,null,null,"DESONERADO","NÃO DESONER.","DESONERADO","NÃO DESONER."]
[null,"COMPOSIÇÃO","COMP 027_SEE","TELA MOSQUITEIRA EM NYLON COM ESTRUTURA DE ALUMÍNIO, COM FORNECIMENTO DE MÃO DE OBRA E INSTALAÇÃO","M2",null,null,null,123.21,123.21]
[null,"MÃO DE OBRA (B) - TOTAL",null,null,null,null,null,null,0,0]
[null,"COTAÇÃO","COT 002_SEE","TELA MOSQUITEIRA EM NYLON COM ESTRUTURA DE ALUMÍNIO [M²], COM FORNECIMENTO DE MÃO DE OBRA E INSTALAÇÃO","M2",1,123.21333333333332,123.21333333333332,123.21,123.21]
[null,"MATERIAL (C) - TOTAL",null,null,null,null,null,null,123.21,123.21]
[]
[575,"FONTE","CÓDIGO","DESCRIÇÃO","UNID ","COEFIC.","CUSTO UNITÁRIO",null,"CUSTO  TOTAL (A) + (B) + (C) + (D) + (E)"]
[null,null,null,null,null,null,"DESONERADO","NÃO DESONER.","DESONERADO","NÃO DESONER."]
[null,"COMPOSIÇÃO","COMP 575_SEE","MOLA AEREA FECHA PORTA, PARA PORTAS COM LARGURA ATE 95 CM","UN ","-","-","-",120.96,121.83]
[null,"AGETOP_I",5,"SERVENTE","h     ",0.15,8.75,10.14,1.31,1.52]
[null,"AGETOP_I",24,"MARCENEIRO","h     ",0.3,13.95,16.16,4.1900000000000004,4.8499999999999996]
[null,"MÃO DE OBRA (B) - TOTAL",null,null,null,null,null,null,5.5,6.3699999999999992]
[null,"SINAPI_I",11560,"MOLA AEREA FECHA PORTA, PARA PORTAS COM LARGURA ATE 95 CM","UN    ",1,115.46,115.46,115.46,115.46]
[null,"MATERIAL (C) - TOTAL",null,null,null,null,null,null,115.46,115.46]
[]
[24,"FONTE","CÓDIGO","DESCRIÇÃO","UNIDADE","COEFIC.","CUSTO UNITÁRIO",null,"CUSTO  TOTAL (A) + (B) + (C) + (D) + (E)"]
[null,null,null,null,null,null,"DESONERADO","NÃO DESONER.","DESONERADO","NÃO DESONER."]
[null,"COMPOSIÇÃO","COMP 024_SEE","SINALIZADOR FOTOLUMINESCENTE PARA EXTINTOR","UN ",null,"-","-",25.319999999999997,25.439999999999998]
[null,"AGETOP_I",5,"SERVENTE","h     ",0.09,8.75,10.14,0.79,0.91]
[null,"MÃO DE OBRA (B) - TOTAL",null,null,null,null,null,null,0.79,0.91]
[null,"AGETOP_I",3070,"BUCHA DE NYLON S-6","un",2,0.04,0.04,0.08,0.08]
[null,"AGETOP_I",3393,"PARAFUSO P/BUCHA S-6","un",2,0.08,0.08,0.16,0.16]
[null,"SINAPI_I",37556,"PLACA DE SINALIZACAO DE SEGURANCA CONTRA INCENDIO, FOTOLUMINESCENTE, QUADRADA, *20 X 20* CM, EM PVC *2* MM ANTI-CHAMAS (SIMBOLOS, CORES E PICTOGRAMAS CONFORME NBR 13434)","UN    ",1,24.29,24.29,24.29,24.29]
[null,"MATERIAL (C) - TOTAL",null,null,null,null,null,null,24.529999999999998,24.529999999999998]
[]
[25,"FONTE","CÓDIGO","DESCRIÇÃO","UNIDADE","COEFIC.","CUSTO UNITÁRIO",null,"CUSTO  TOTAL (A) + (B) + (C) + (D) + (E)"]
[null,null,null,null,null,null,"DESONERADO","NÃO DESONER.","DESONERADO","NÃO DESONER."]
[null,"COMPOSIÇÃO","COMP 025_SEE","SINALIZADOR FOTOLUMINESCENTE DE EMERGÊNCIA","UN ",null,"-","-",25.319999999999997,25.439999999999998]
[null,"AGETOP_I",5,"SERVENTE","h     ",0.09,8.75,10.14,0.79,0.91]
[null,"MÃO DE OBRA (B) - TOTAL",null,null,null,null,null,null,0.79,0.91]
[null,"AGETOP_I",3070,"BUCHA DE NYLON S-6","un",2,0.04,0.04,0.08,0.08]
[null,"AGETOP_I",3393,"PARAFUSO P/BUCHA S-6","un",2,0.08,0.08,0.16,0.16]
[null,"SINAPI_I",37556,"PLACA DE SINALIZACAO DE SEGURANCA CONTRA INCENDIO, FOTOLUMINESCENTE, QUADRADA, *20 X 20* CM, EM PVC *2* MM ANTI-CHAMAS (SIMBOLOS, CORES E PICTOGRAMAS CONFORME NBR 13434)","UN    ",1,24.29,24.29,24.29,24.29]
[null,"MATERIAL (C) - TOTAL",null,null,null,null,null,null,24.529999999999998,24.529999999999998]
[]
[277,"FONTE","CÓDIGO","DESCRIÇÃO","UNIDADE","COEFIC.","CUSTO UNITÁRIO",null,"CUSTO  TOTAL (A) + (B) + (C) + (D) + (E)"]
[null,null,null,null,null,null,"DESONERADO","NÃO DESONER.","DESONERADO","NÃO DESONER."]
[null,"COMPOSIÇÃO","COMP 277_SEE","MARCAÇÃO NO PISO - 1X1 M PARA EXTINTOR","M2",null,null,null,29.69,29.76]
[null,"AGETOP_I",5,"SERVENTE","h     ",3.3300000000000003E-2,8.75,10.14,0.28999999999999998,0.34]
[null,"MÃO DE OBRA (B) - TOTAL",null,null,null,null,null,null,0.28999999999999998,0.34]
[null,"SINAPI_I",5318,"SOLVENTE DILUENTE A BASE DE AGUARRAS","L     ",0.13,11.98,11.98,1.56,1.56]
[null,"SINAPI",5824,"CAMINHÃO TOCO, PBT 16.000 KG, CARGA ÚTIL MÁX. 10.685 KG, DIST. ENTRE EIXOS 4,8 M, POTÊNCIA 189 CV, INCLUSIVE CARROCERIA FIXA ABERTA DE MADEIRA P/ TRANSPORTE GERAL DE CARGA SECA, DIMEN. APROX. 2,5 X 7,00 X 0,50 M - CHP DIURNO. AF_06/2014","CHP",3.3E-3,115.5,118.69,0.38,0.39]
[null,"SINAPI_I",7343,"TINTA A BASE DE RESINA ACRILICA, PARA SINALIZACAO HORIZONTAL VIARIA (NBR 11862)","L     ",0.6,12.82,12.82,7.69,7.69]
[null,"SINAPI_I",7348,"TINTA ACRILICA PREMIUM PARA PISO","L     ",0.03,13.96,13.96,0.42,0.42]
[null,"SINAPI_I",25972,"MICROESFERAS DE VIDRO PARA SINALIZACAO HORIZONTAL VIARIA, TIPO I-B (PREMIX) - NBR 16184","KG    ",2.14,8.8800000000000008,8.8800000000000008,19,19]
[null,"SINAPI",95133,"MÁQUINA DEMARCADORA DE FAIXA DE TRÁFEGO À FRIO, AUTOPROPELIDA, POTÊNCIA 38 HP - CHP DIURNO. AF_07/2016","CHP",3.3E-3,105.93,109.48,0.35,0.36]
[null,"MATERIAL (C) - TOTAL",null,null,null,null,null,null,29.400000000000002,29.42]
[]
[235,"FONTE","CÓDIGO","DESCRIÇÃO","UNIDADE","COEFIC.","CUSTO UNITÁRIO",null,"CUSTO  TOTAL (A) + (B) + (C) + (D) + (E)"]
[null,null,null,null,null,null,"DESONERADO","NÃO DESONER.","DESONERADO","NÃO DESONER."]
[null,"COMPOSIÇÃO","COMP 235_SEE","PLACA DE SINALIZAÇÃO EM PVC COD 01 - (300X300) PROIBIDO FUMAR","UN ",null,null,null,25.319999999999997,25.439999999999998]
[null,"AGETOP_I",5,"SERVENTE","h     ",0.09,8.75,10.14,0.79,0.91]
[null,"MÃO DE OBRA (B) - TOTAL",null,null,null,null,null,null,0.79,0.91]
[null,"AGETOP_I",3070,"BUCHA DE NYLON S-6","un",2,0.04,0.04,0.08,0.08]
[null,"AGETOP_I",3393,"PARAFUSO P/BUCHA S-6","un",2,0.08,0.08,0.16,0.16]
[null,"SINAPI_I",37556,"PLACA DE SINALIZACAO DE SEGURANCA CONTRA INCENDIO, FOTOLUMINESCENTE, QUADRADA, *20 X 20* CM, EM PVC *2* MM ANTI-CHAMAS (SIMBOLOS, CORES E PICTOGRAMAS CONFORME NBR 13434)","UN    ",1,24.29,24.29,24.29,24.29]
[null,"MATERIAL (C) - TOTAL",null,null,null,null,null,null,24.529999999999998,24.529999999999998]
[]
[236,"FONTE","CÓDIGO","DESCRIÇÃO","UNIDADE","COEFIC.","CUSTO UNITÁRIO",null,"CUSTO  TOTAL (A) + (B) + (C) + (D) + (E)"]
[null,null,null,null,null,null,"DESONERADO","NÃO DESONER.","DESONERADO","NÃO DESONER."]
[null,"COMPOSIÇÃO","COMP 236_SEE","PLACA DE SINALIZAÇÃO EM PVC COD 06 - (300X300) PERIGO INFLAMÁVEL","UN ",null,null,null,25.319999999999997,25.439999999999998]
[null,"AGETOP_I",5,"SERVENTE","h     ",0.09,8.75,10.14,0.79,0.91]
[null,"MÃO DE OBRA (B) - TOTAL",null,null,null,null,null,null,0.79,0.91]
[null,"AGETOP_I",3070,"BUCHA DE NYLON S-6","un",2,0.04,0.04,0.08,0.08]
[null,"AGETOP_I",3393,"PARAFUSO P/BUCHA S-6","un",2,0.08,0.08,0.16,0.16]
[null,"SINAPI_I",37556,"PLACA DE SINALIZACAO DE SEGURANCA CONTRA INCENDIO, FOTOLUMINESCENTE, QUADRADA, *20 X 20* CM, EM PVC *2* MM ANTI-CHAMAS (SIMBOLOS, CORES E PICTOGRAMAS CONFORME NBR 13434)","UN    ",1,24.29,24.29,24.29,24.29]
[null,"MATERIAL (C) - TOTAL",null,null,null,null,null,null,24.529999999999998,24.529999999999998]
[]
[382,"FONTE","CÓDIGO","DESCRIÇÃO","UNIDADE","COEFIC.","CUSTO UNITÁRIO",null,"CUSTO  TOTAL (A) + (B) + (C) + (D) + (E)"]
[null,null,null,null,null,null,"DESONERADO","NÃO DESONER.","DESONERADO","NÃO DESONER."]
[null,"COMPOSIÇÃO","COMP 382_SEE","TE DE REDUCAO DE FERRO GALVANIZADO, COM ROSCA BSP, DE 3/4\" X 1/2\"","UN ",null,null,null,24.25,26.43]
[null,"AGETOP_I",8,"AJUDANTE","h     ",0.6,8.75,10.14,5.25,6.08]
[null,"AGETOP_I",11,"ENCANADOR","h     ",0.61050000000000004,13.95,16.16,8.52,9.8699999999999992]
[null,"MÃO DE OBRA (B) - TOTAL",null,null,null,null,null,null,13.77,15.95]
[null,"SINAPI_I",3146,"FITA VEDA ROSCA EM ROLOS DE 18 MM X 10 M (L X C)","UN    ",0.12075471698113208,3.4,3.4,0.41,0.41]
[null,"SINAPI_I",6302,"TE DE REDUCAO DE FERRO GALVANIZADO, COM ROSCA BSP, DE 3/4\" X 1/2\"","UN    ",1,10.07,10.07,10.07,10.07]
[null,"MATERIAL (C) - TOTAL",null,null,null,null,null,null,10.48,10.48]
[]
[383,"FONTE","CÓDIGO","DESCRIÇÃO","UNIDADE","COEFIC.","CUSTO UNITÁRIO",null,"CUSTO  TOTAL (A) + (B) + (C) + (D) + (E)"]
[null,null,null,null,null,null,"DESONERADO","NÃO DESONER.","DESONERADO","NÃO DESONER."]
[null,"COMPOSIÇÃO","COMP 383_SEE","BUCHA DE REDUCAO DE FERRO GALVANIZADO, COM ROSCA BSP, DE 1/2\" X 1/4\"","UN ",null,null,null,7.68,8.26]
[null,"AGETOP_I",8,"AJUDANTE","h     ",0.16,8.75,10.14,1.4,1.62]
[null,"AGETOP_I",11,"ENCANADOR","h     ",0.16,13.95,16.16,2.23,2.59]
[null,"MÃO DE OBRA (B) - TOTAL",null,null,null,null,null,null,3.63,4.21]
[null,"AGETOP_I","H689","FITA VEDAROSCA 12 MM","m",1.2,0.28000000000000003,0.28000000000000003,0.34,0.34]
[null,"SINAPI_I",770,"BUCHA DE REDUCAO DE FERRO GALVANIZADO, COM ROSCA BSP, DE 1/2\" X 1/4\"","UN    ",1,3.71,3.71,3.71,3.71]
[null,"MATERIAL (C) - TOTAL",null,null,null,null,null,null,4.05,4.05]
[]
[212,"FONTE","CÓDIGO","DESCRIÇÃO","UNIDADE","COEFIC.","CUSTO UNITÁRIO",null,"CUSTO  TOTAL (A) + (B) + (C) + (D) + (E)"]
[null,null,null,null,null,null,"DESONERADO","NÃO DESONER.","DESONERADO","NÃO DESONER."]
[null,"COMPOSIÇÃO","COMP 212_SEE","NIPLE DE REDUÇÃO 1/2\" X 1/4\" BSP","UN ",null,null,null,9.68,10.26]
[null,"AGETOP_I",8,"AJUDANTE","h     ",0.16,8.75,10.14,1.4,1.62]
[null,"AGETOP_I",11,"ENCANADOR","h     ",0.16,13.95,16.16,2.23,2.59]
[null,"MÃO DE OBRA (B) - TOTAL",null,null,null,null,null,null,3.63,4.21]
[null,"COTAÇÃO","COT 103_SEE","NIPLE DE REDUÇÃO 1/2\" X 1/4\" BSP","UN",1,6.0533333333333337,6.0533333333333337,6.05,6.05]
[null,"MATERIAL (C) - TOTAL",null,null,null,null,null,null,6.05,6.05]
[]
[213,"FONTE","CÓDIGO","DESCRIÇÃO","UNIDADE","COEFIC.","CUSTO UNITÁRIO",null,"CUSTO  TOTAL (A) + (B) + (C) + (D) + (E)"]
[null,null,null,null,null,null,"DESONERADO","NÃO DESONER.","DESONERADO","NÃO DESONER."]
[null,"COMPOSIÇÃO","COMP 213_SEE","NIPLE DE REDUÇÃO 3/4\" X 1/2\" BSP","UN ",null,null,null,13.34,13.920000000000002]
[null,"AGETOP_I",8,"AJUDANTE","h     ",0.16,8.75,10.14,1.4,1.62]
[null,"AGETOP_I",11,"ENCANADOR","h     ",0.16,13.95,16.16,2.23,2.59]
[null,"MÃO DE OBRA (B) - TOTAL",null,null,null,null,null,null,3.63,4.21]
[null,"COTAÇÃO","COT 104_SEE","NIPLE DE REDUÇÃO 3/4\" X 1/2\" BSP","UN",1,9.7099999999999991,9.7099999999999991,9.7100000000000009,9.7100000000000009]
[null,"MATERIAL (C) - TOTAL",null,null,null,null,null,null,9.7100000000000009,9.7100000000000009]
[]
[237,"FONTE","CÓDIGO","DESCRIÇÃO","UNIDADE","COEFIC.","CUSTO UNITÁRIO",null,"CUSTO  TOTAL (A) + (B) + (C) + (D) + (E)"]
[null,null,null,null,null,null,"DESONERADO","NÃO DESONER.","DESONERADO","NÃO DESONER."]
[null,"COMPOSIÇÃO","COMP 237_SEE","FITA ANTICORROSIVA","M",null,null,null,11.16,11.879999999999999]
[null,"AGETOP_I",8,"AJUDANTE","h     ",0.2,8.75,10.14,1.75,2.0299999999999998]
[null,"AGETOP_I",12,"ELETRICISTA","h     ",0.2,13.95,16.16,2.79,3.23]
[null,"MÃO DE OBRA (B) - TOTAL",null,null,null,null,null,null,4.54,5.26]
[null,"SINAPI_I",39634,"FITA ADESIVA ANTICORROSIVA DE PVC FLEXIVEL, COR PRETA, PARA PROTECAO TUBULACAO, 50 MM X 30 M (L X C), E= *0,25* MM","M     ",1,6.62,6.62,6.62,6.62]
[null,"MATERIAL (C) - TOTAL",null,null,null,null,null,null,6.62,6.62]
[]
[542,"FONTE","CÓDIGO","DESCRIÇÃO","UNIDADE","COEFIC.","CUSTO UNITÁRIO",null,"CUSTO  TOTAL (A) + (B) + (C) + (D) + (E)"]
[null,null,null,null,null,null,"DESONERADO","NÃO DESONER.","DESONERADO","NÃO DESONER."]
[null,"COMPOSIÇÃO","COMP 542_SEE","VÁLVULA UGV 3/4\" (S) LATÃO","UN ",null,null,null,25.65,27.2]
[null,"AGETOP_I",8,"AJUDANTE","h     ",0.432,8.75,10.14,3.78,4.38]
[null,"AGETOP_I",11,"ENCANADOR","h     ",0.432,13.95,16.16,6.03,6.98]
[null,"MÃO DE OBRA (B) - TOTAL",null,null,null,null,null,null,9.81,11.36]
[null,"COTAÇÃO","COT 281_SEE","VÁLVULA UGV 3/4\" (S) LATÃO","UN ",1,15.836666666666666,15.836666666666666,15.84,15.84]
[null,"MATERIAL (C) - TOTAL",null,null,null,null,null,null,15.84,15.84]
[]
[543,"FONTE","CÓDIGO","DESCRIÇÃO","UNIDADE","COEFIC.","CUSTO UNITÁRIO",null,"CUSTO  TOTAL (A) + (B) + (C) + (D) + (E)"]
[null,null,null,null,null,null,"DESONERADO","NÃO DESONER.","DESONERADO","NÃO DESONER."]
[null,"COMPOSIÇÃO","COMP 543_SEE","VÁLVULA UGV 1/2\" (S) LATÃO","UN ",null,null,null,24.98,26.53]
[null,"AGETOP_I",8,"AJUDANTE","h     ",0.432,8.75,10.14,3.78,4.38]
[null,"AGETOP_I",11,"ENCANADOR","h     ",0.432,13.95,16.16,6.03,6.98]
[null,"MÃO DE OBRA (B) - TOTAL",null,null,null,null,null,null,9.81,11.36]
[null,"COTAÇÃO","COT 282_SEE","VÁLVULA UGV 1/2\" (S) LATÃO","UN ",1,15.166666666666666,15.166666666666666,15.17,15.17]
[null,"MATERIAL (C) - TOTAL",null,null,null,null,null,null,15.17,15.17]
[]
[211,"FONTE","CÓDIGO","DESCRIÇÃO","UNIDADE","COEFIC.","CUSTO UNITÁRIO",null,"CUSTO  TOTAL (A) + (B) + (C) + (D) + (E)"]
[null,null,null,null,null,null,"DESONERADO","NÃO DESONER.","DESONERADO","NÃO DESONER."]
[null,"COMPOSIÇÃO","COMP 211_SEE","REGULADOR DE 2º ESTÁGIO 5KG/H","UN ",null,null,null,86.72,90.86]
[null,"AGETOP_I",8,"AJUDANTE","h     ",1.1499999999999999,8.75,10.14,10.06,11.66]
[null,"AGETOP_I",11,"ENCANADOR","h     ",1.1499999999999999,13.95,16.16,16.04,18.579999999999998]
[null,"MÃO DE OBRA (B) - TOTAL",null,null,null,null,null,null,26.1,30.24]
[null,"COTAÇÃO","COT 102_SEE","REGULADOR DE 2º ESTÁGIO 5KG/H","UN",1,59.833333333333336,59.833333333333336,59.83,59.83]
[null,"AGETOP_I","H689","FITA VEDAROSCA 12 MM","m",2.82,0.28000000000000003,0.28000000000000003,0.79,0.79]
[null,"MATERIAL (C) - TOTAL",null,null,null,null,null,null,60.62,60.62]
[]
[210,"FONTE","CÓDIGO","DESCRIÇÃO","UNIDADE","COEFIC.","CUSTO UNITÁRIO",null,"CUSTO  TOTAL (A) + (B) + (C) + (D) + (E)"]
[null,null,null,null,null,null,"DESONERADO","NÃO DESONER.","DESONERADO","NÃO DESONER."]
[null,"COMPOSIÇÃO","COMP 210_SEE","REGULADOR DE 1º ESTÁGIO 60KG/H MODELO AP-40  COM MANÔMETRO","UN ",null,null,null,232.47,236.61]
[null,"AGETOP_I",8,"AJUDANTE","h     ",1.1499999999999999,8.75,10.14,10.06,11.66]
[null,"AGETOP_I",11,"ENCANADOR","h     ",1.1499999999999999,13.95,16.16,16.04,18.579999999999998]
[null,"MÃO DE OBRA (B) - TOTAL",null,null,null,null,null,null,26.1,30.24]
[null,"COTAÇÃO","COT 101_SEE","REGULADOR DE 1º ESTÁGIO 60KG/H MODELO AP-40  COM MANÔMETRO","UN",1,205.57666666666668,205.57666666666668,205.58,205.58]
[null,"AGETOP_I","H689","FITA VEDAROSCA 12 MM","m",2.82,0.28000000000000003,0.28000000000000003,0.79,0.79]
[null,"MATERIAL (C) - TOTAL",null,null,null,null,null,null,206.37,206.37]
[]
[45,"FONTE","CÓDIGO","DESCRIÇÃO","UNIDADE","COEFIC.","CUSTO UNITÁRIO",null,"CUSTO  TOTAL (A) + (B) + (C) + (D) + (E)"]
[null,null,null,null,null,null,"DESONERADO","NÃO DESONER.","DESONERADO","NÃO DESONER."]
[null,"COMPOSIÇÃO","COMP 045_SEE","LAUDO DE ESTANQUEIDADE","UN ",null,null,null,936,1085.1199999999999]
[null,"AGETOP",250101,"ENGENHEIRO - (OBRAS CIVIS)","H     ",16,58.5,67.819999999999993,936,1085.1199999999999]
[null,"MÃO DE OBRA (B) - TOTAL",null,null,null,null,null,null,936,1085.1199999999999]
[null,"MATERIAL (C) - TOTAL",null,null,null,null,null,null,0,0]